/home/aaron/Documents/CS/inge_appli/hangman/src/main/java/hangman/Controler.java
/home/aaron/Documents/CS/inge_appli/hangman/src/main/java/hangman/View.java
/home/aaron/Documents/CS/inge_appli/hangman/src/main/java/hangman/CharacterAsker.java
/home/aaron/Documents/CS/inge_appli/hangman/src/main/java/hangman/Model.java
