Categorie_emplois;Effet_mesures_perimetre_2022;Effet_mesures_transfets_2022 ;Effet_corrections_techniques_2022;Impact_schema_emplois_2022
A;0;0;-1.24;628.84
B;0;-82;10.19;606.73
C;0;0;174.64;96.51
Ouvriers_etat;0;-2;-6.43;-677.03
Officiers;0;0;-7.81;432.44
Sous_officiers;0;0;11.35;-8.75
Militaires_rang;0;0;46.45;-162.96
Volontaires;0;0;41.43;-181.52
Volontaires_stagiaires_SMV ;0;0;429.20;0
