@startuml
'https://plantuml.com/use-case-diagram

package Bibliothèque {
    usecase "Emprunter un livre" as (emprunt)
    usecase "Ajouter un livre" as (ajout)
    usecase "Supprimer un livre" as (sup)
    usecase "Rendre un livre" as (rendre)
}
package Administration {
    usecase "Interdire d'emprunt" as (ban)
    usecase "Ajouter un client" as (ajclient)
    usecase "Consulter les emprunts d'un client" as (consulc)
    usecase "Consulter les statistiques d'emprunt" as (consulstats)
    usecase "Éditer une catégorie d'utilisateur" as (edit)
}
Utilisateur --> (emprunt)
Utilisateur --> (rendre)
Bibliothéquaire --> (sup)
Bibliothéquaire --> (ajout)
Bibliothéquaire --> (ajclient)
Bibliothéquaire --> (ban)
Bibliothéquaire --> (consulc)
Bibliothéquaire --> (consulstats)
Bibliothéquaire --> (edit)
Utilisateur --> (sous)

(ban) ..> (consulc) : extend

(ban) ..> Utilisateur
(ajclient) ..> Utilisateur


@enduml