AYGX_mean,AZ_mean,timestamp
5.4174,-8.2201,639
30.665,-10.9156,640
5.1346,-9.9722,641
8.2899,-9.4708,642
2.5434,-9.8824,644
1.0606,-9.8666,645
0.0643,-9.7086,646
3.6072,-9.9749,647
17.3377,-9.8714,648
89.9604,-9.5248,649
5.3916,-9.7499,650
23.6191,-9.5301,651
2.4677,-8.6345,652
1.8784,-9.9486,654
-0.0796,-8.7908,655
2.2921,-10.6274,656
8.0592,-9.6184,657
3.5645,-9.7478,658
3.1653,-9.9271,659
