AYGX_mean,AZ_mean,timestamp
2.7497,-9.9263,853
-2.0454,-9.7955,854
7.1078,-9.9678,855
-2.5412,-9.7328,856
1.8414,-9.7812,857
-1.7576,-9.8032,858
2.9723,-9.7459,859
6.5327,-9.7852,860
0.5551,-9.54,862
0.631,-9.9808,863
0.1694,-9.7186,864
37.9652,-9.6531,865
1.588,-9.7969,866
0.417,-9.8478,867
0.8918,-9.8446,868
2.286,-9.8385,869
1.3168,-9.8892,870
0.7762,-9.9606,871
-40.881,-7.8389,872
