AYGX_mean,AZ_mean,timestamp
-0.2443,-9.9316,0
0.4736,-9.9315,1
-14.714,-9.7283,2
20.6892,-9.6926,3
3.9704,-9.4553,4
-1.3126,-9.6921,5
-30.6445,-9.822,6
10.7424,-9.8076,7
6.8633,-9.7321,8
17.8858,-9.8027,9
9.6729,-9.9696,10
1.6051,-9.9171,11
1.0915,-9.8904,12
0.1184,-9.9247,13
-0.6362,-9.9715,14
-0.9278,-9.8239,15
-3.4874,-9.8689,16
-0.4468,-10.051,17
0.1216,-9.8628,18
0.0757,-9.9379,19
0.4444,-10.0283,20
1.0256,-9.9145,21
0.6692,-9.933,22
-0.4906,-9.933,24
-1.3739,-10.5708,25
0.2663,-9.8895,26
3.3446,-9.9443,27
0.3866,-9.9198,29
-0.1043,-9.7713,30
-0.227,-9.8494,31
0.8539,-9.9859,32
0.6412,-9.9688,33
0.7758,-11.0488,34
1.4731,-9.9258,35
-2.3859,-10.1369,36
-1.323,-10.1881,37
-2.9011,-10.5365,38
0.0769,-9.9034,39
0.0718,-10.0339,40
3.1376,-10.178,41
0.2183,-9.9437,42
-1.0371,-9.9406,43
1.5961,-10.0162,44
0.4755,-9.9166,45
-1.0048,-9.8577,46
-0.1205,-9.9061,47
1.6023,-9.9076,48
6.1099,-9.9564,49
-0.9685,-9.9849,50
0.6394,-9.9284,51
-1.0893,-9.895,52
-0.4037,-9.9597,53
-1.555,-9.7644,54
0.2198,-9.9344,55
0.5275,-9.8632,56
0.5231,-9.8619,57
3.4371,-9.3831,58
3.5844,-9.5495,59
0.4022,-9.7384,60
0.7219,-10.228,61
2.2622,-9.5966,62
-0.9481,-9.693,63
4.6103,-10.3641,64
-1.8388,-9.5796,65
4.6991,-9.4854,66
-0.0779,-9.1844,67
0.5138,-9.9485,68
0.0585,-9.9552,69
0.2757,-9.9241,70
-0.016,-9.9573,71
8.4035,-9.9814,72
1.815,-10.3016,73
-3.359,-10.3993,74
-0.5685,-8.9991,75
9.9984,-8.0531,76
1.1731,-10.0882,77
-1.8537,-9.726,78
-3.2285,-10.381,79
1.6784,-10.0912,80
0.4746,-9.9436,81
0.274,-9.8745,82
1.3899,-8.4337,83
-2.4331,-9.9528,84
-3.1625,-9.9798,85
-2.926,-9.7787,86
-0.3627,-9.8094,87
-0.654,-9.8763,88
-0.1451,-9.9261,89
3.6931,-10.0226,90
3.3553,-10.2577,91
25.654,-9.0305,92
1.7442,-10.0701,93
4.7704,-10.0704,94
4.3993,-9.6449,95
5.1549,-9.4111,96
0.9777,-10.3279,97
6.1806,-10.1175,98
1.2381,-9.5924,99
-0.618,-10.0251,100
-0.1128,-9.8945,101
-1.5157,-9.8815,102
0.3842,-9.8637,103
0.3621,-10.2234,104
0.0494,-10.0264,105
-0.0261,-8.7942,106
4.7814,-8.9202,107
2.1233,-9.5684,108
-0.9351,-9.8561,109
-1.4284,-10.8345,110
0.4484,-10.0477,111
2.3298,-9.9074,112
-1.5991,-9.9704,113
-3.1443,-9.8077,114
-0.6098,-10.1798,115
0.9451,-10.1089,116
0.1198,-10.0155,117
-1.0853,-9.8038,118
-1.4681,-9.8375,119
-0.9367,-10.046,120
0.0403,-9.9156,121
0.5494,-9.904,122
-0.3784,-9.91,123
0.1075,-9.9416,124
0.4213,-9.7028,125
-0.4821,-9.898,126
0.6326,-10.0288,127
3.2256,-9.9644,128
-0.9247,-10.0481,129
-0.5068,-9.9256,130
0.7695,-10.0001,131
0.4962,-9.8272,132
0.3129,-10.0114,133
0.9529,-10.132,134
2.6901,-9.9817,135
0.0817,-10.1066,136
2.608,-9.8755,137
6.0004,-9.2885,138
-0.1153,-9.2682,139
-0.5005,-10.0277,140
-0.5954,-9.8668,141
0.1079,-10.0024,142
-0.5755,-9.9935,143
-0.3431,-9.9865,144
0.0998,-10.0296,145
-0.1837,-9.936,146
-0.158,-9.8308,147
1.8731,-9.7676,148
0.2396,-9.8921,149
0.847,-9.9839,150
0.3553,-9.9397,151
0.0809,-9.8833,152
-0.8007,-10.028,153
0.3277,-9.7432,154
0.43,-9.824,155
-0.1231,-9.7538,156
-0.2134,-9.9379,157
-0.5279,-9.4536,158
-1.5686,-10.6939,159
0.2149,-10.0237,160
0.0106,-9.8906,161
0.2614,-9.7169,162
-0.0391,-9.9161,163
-0.0056,-10.0381,164
-4.9528,-9.9224,165
6.0925,-10.4097,166
0.5935,-9.8911,167
-0.501,-10.0301,168
0.4233,-9.8301,169
-0.3995,-9.8203,170
0.6637,-9.7445,171
3.2695,-9.9325,172
0.4481,-10.011,173
0.4364,-9.3696,174
1.392,-9.3755,175
4.1048,-10.0195,176
0.5125,-11.0702,177
2.1686,-8.0685,178
-0.3121,-9.8487,179
-0.981,-9.1564,180
-1.8904,-10.0608,181
0.8887,-10.0172,182
0.9627,-9.9918,183
-1.7734,-9.7503,184
1.7433,-10.1366,185
-0.0388,-10.2956,186
0.7545,-10.1458,187
-0.2876,-10.4861,188
3.3504,-9.2939,189
1.316,-10.1767,190
0.9486,-9.9317,191
10.6795,-6.89,192
0.2849,-9.8992,193
-1.6102,-9.8745,194
-0.9335,-10.2739,195
1.418,-9.4503,196
0.4588,-9.446,197
-1.9949,-9.9376,198
-0.1023,-9.3967,199
-0.4583,-9.8554,200
-0.0983,-10.1587,201
0.3565,-9.8838,202
-0.1192,-9.9509,203
-0.5624,-9.9167,204
0.2905,-9.0043,205
2.1212,-9.353,206
0.0779,-10.0444,207
0.9977,-10.2887,208
-0.8185,-9.8232,209
0.4566,-9.9701,210
0.2923,-9.7961,211
-0.0121,-9.6763,212
-0.0213,-9.964,213
0.3367,-9.9857,214
3.0629,-9.9596,215
-0.038,-10.0283,217
0.8448,-10.0143,218
1.2687,-9.902,219
0.1923,-10.111,220
5.4344,-9.8813,222
-37.2008,-9.3308,223
98.6265,-8.9386,224
-1.2185,-9.8978,225
-254.2306,-8.6422,226
139.0517,-9.0948,227
-9.2627,-9.9454,228
-19.0269,-9.7374,229
1.5395,-9.5239,230
-4.9966,-9.6271,231
2.1494,-9.6232,232
2.1127,-9.6476,233
2.8699,-9.6477,234
2.3282,-9.6388,235
2.3036,-9.6407,236
2.4037,-9.6422,237
2.4312,-9.6428,238
2.4251,-9.6415,239
