AYGX_mean,AZ_mean,timestamp
-0.4253,-9.7068,0
-0.4218,-9.7064,1
-0.4147,-9.7067,2
-0.4336,-9.7065,3
1.4156,-9.7568,4
0.2081,-9.7813,5
0.1658,-9.7819,7
0.294,-9.7814,8
0.5306,-9.7852,9
-0.0591,-9.7933,13
-0.1098,-9.689,14
-2.2433,-9.7857,15
-5.3467,-9.7701,16
2.6789,-9.7825,17
0.1276,-9.802,18
-0.0187,-9.8039,19
0.0855,-9.8009,20
-0.0909,-9.8031,21
0.0834,-9.7809,22
-0.1997,-9.8064,24
-0.1779,-9.7688,25
-2.217,-9.5589,26
0.4306,-9.5714,27
0.6273,-9.5725,28
0.6883,-9.5706,29
0.7205,-9.5719,30
0.6948,-9.5733,31
0.6498,-9.5718,32
0.5998,-9.5704,33
0.6733,-9.5719,34
0.6891,-9.5711,35
0.6342,-9.5718,36
0.7036,-9.574,37
0.638,-9.5725,38
0.6561,-9.5729,39
0.6955,-9.5737,40
0.6324,-9.5734,41
0.6696,-9.5734,42
0.68,-9.5734,43
0.6384,-9.5743,44
0.6857,-9.5728,45
0.6598,-9.5733,46
0.6876,-9.573,47
0.6885,-9.5748,48
0.6351,-9.5739,49
0.6252,-9.5745,50
0.6553,-9.5746,51
0.649,-9.574,52
0.6257,-9.575,53
0.6698,-9.5739,54
0.6532,-9.5753,55
0.6204,-9.5735,56
0.6557,-9.5743,57
0.6392,-9.5748,58
0.6527,-9.5758,59
0.6718,-9.574,60
0.6813,-9.5745,61
0.7235,-9.5743,62
0.6897,-9.5742,63
0.6561,-9.5744,64
0.6769,-9.5744,65
0.6538,-9.5748,66
0.6588,-9.5747,67
0.6163,-9.5751,68
0.6485,-9.5751,69
0.6545,-9.5754,70
0.6448,-9.574,71
0.6077,-9.5738,72
0.6382,-9.5757,73
0.6333,-9.5763,75
0.6049,-9.576,76
0.6661,-9.5756,77
0.6403,-9.5755,78
0.6339,-9.5756,79
0.6321,-9.5752,80
0.6767,-9.5746,81
0.6596,-9.578,82
0.6411,-9.5763,83
0.9111,-9.5999,85
1.8532,-9.5913,86
-0.2251,-9.5865,87
-0.7374,-9.5419,88
-3.0128,-9.6512,89
0.5714,-9.5853,90
-0.0175,-9.588,91
1.2882,-9.6018,92
-0.23,-9.5952,93
-0.0797,-9.595,94
0.7755,-9.5981,95
0.2743,-9.5999,96
0.4729,-9.5951,97
1.3498,-9.5994,98
0.8163,-9.59,99
0.7071,-9.589,100
0.6601,-9.5898,101
0.5892,-9.59,102
0.6005,-9.5881,103
0.5862,-9.5903,104
0.5919,-9.5891,105
0.5972,-9.59,106
0.5892,-9.5904,107
0.6012,-9.5908,108
0.6067,-9.5896,109
0.6156,-9.5889,110
0.563,-9.5901,111
0.5891,-9.5887,112
0.5919,-9.5884,113
1.6012,-9.5611,114
-0.7733,-9.6081,116
0.3524,-9.5082,117
-0.1749,-9.5822,118
1.4964,-9.5653,119
1.0931,-9.5795,120
0.7203,-9.5826,121
-0.1658,-9.5819,123
6.4715,-9.6074,124
4.8876,-9.7546,125
-4.3069,-9.3977,126
-9.7555,-9.6479,127
4.0989,-9.4907,128
-3.8359,-9.3447,129
10.0826,-9.6769,130
-24.1406,-9.1445,132
18.7896,-8.9737,133
29.5167,-9.4226,134
-2.2755,-9.7328,135
9.8142,-9.5647,136
-9.5958,-9.7033,137
-6.6271,-9.5474,138
-1.2498,-9.5349,139
-0.5062,-9.503,140
-1.3319,-9.4692,142
1.7695,-9.4964,143
-5.4908,-9.4582,144
-1.1497,-9.4662,145
-3.3737,-9.4396,146
-2.2009,-9.4489,147
4.1505,-9.4553,148
-3.7049,-9.4312,149
1.7699,-9.4408,150
7.6666,-9.4748,151
11.439,-9.6532,152
-6.6566,-9.6729,153
9.5239,-9.7835,154
2.5824,-9.7949,155
-2.1034,-9.6936,156
-5.5791,-9.7499,157
7.2497,-9.7862,158
-1.6048,-9.7222,159
1.3489,-9.8179,160
-0.1096,-9.8132,161
-0.2399,-9.8254,162
-0.1546,-9.9184,163
-0.0854,-10.0199,164
-0.7187,-9.8048,165
2.6506,-9.8795,166
3.2866,-9.6647,167
0.9276,-8.9789,168
-0.8502,-9.9231,169
-0.416,-9.6747,170
-2.4507,-9.6438,171
-0.0494,-9.8177,172
1.7017,-9.7284,173
0.475,-9.7364,174
1.2008,-10.078,175
0.5222,-9.8578,176
0.3152,-9.0826,177
1.0718,-9.869,178
-0.068,-9.77,179
-0.1792,-9.8333,180
0.7892,-9.8349,181
0.3052,-9.6163,182
-0.1553,-10.0616,183
0.0284,-9.7787,184
-0.0762,-9.596,185
0.1682,-9.7093,186
-0.3546,-10.2961,187
0.2497,-9.731,188
0.3853,-9.713,189
0.1065,-9.9628,190
1.104,-9.4263,191
-0.0354,-9.4608,192
0.3296,-9.9903,193
0.179,-9.8394,194
-0.1702,-10.0586,195
0.1453,-9.9326,196
0.3109,-9.7069,198
1.3035,-10.1412,200
-0.0492,-9.5462,201
-0.1336,-10.159,202
0.6638,-9.7882,203
1.29,-9.9601,204
0.3364,-9.9189,205
0.2836,-10.0678,206
-0.0384,-10.3382,207
-0.1704,-9.7099,208
-0.0971,-9.8193,209
0.602,-9.8494,210
0.616,-9.8347,211
-0.093,-9.82,212
1.63,-9.7813,213
0.63,-9.9344,214
1.747,-9.7554,215
0.2809,-9.815,216
-0.4108,-9.8231,217
1.063,-9.7578,218
0.1676,-9.8487,219
0.3731,-9.8497,220
2.6038,-9.6243,221
0.1125,-9.7322,222
0.2748,-9.8698,223
0.098,-9.9801,224
-0.3393,-9.8606,225
1.2444,-9.7697,226
1.2193,-9.9054,228
1.3158,-9.7709,229
1.5923,-8.978,230
-0.4289,-9.705,231
0.3537,-9.6462,232
1.5227,-9.8772,234
-0.6256,-9.8175,235
-0.9797,-9.3173,236
0.5675,-9.7036,238
0.423,-9.8204,239
-0.4389,-10.0843,240
-0.2098,-10.2233,241
-0.0659,-9.831,242
-0.0509,-9.9009,243
1.3548,-9.8405,244
-0.0542,-9.7574,245
0.1843,-9.8108,246
0.1995,-9.7465,248
-0.1272,-9.8602,249
-0.326,-9.9244,250
1.28,-9.8626,251
0.7613,-9.6742,252
0.0782,-9.3864,253
2.0172,-9.8101,254
0.7216,-9.5545,255
0.8757,-9.8293,256
0.392,-8.2782,258
0.633,-9.7691,259
-0.0188,-9.3773,260
-0.2056,-9.7655,261
1.0719,-10.0076,262
1.6586,-9.705,263
0.4301,-10.2894,264
0.4818,-9.6714,265
0.1735,-9.7153,266
0.267,-10.0272,267
0.3131,-9.793,268
0.09,-9.7714,269
1.5728,-9.747,270
0.058,-9.6391,271
-0.3888,-9.9166,272
-0.0143,-9.5671,273
-0.229,-9.5906,274
0.3604,-9.7356,275
0.0457,-9.8946,276
0.6461,-9.6135,277
-0.2124,-9.8592,278
0.6496,-9.8439,279
0.3151,-9.8039,280
0.2578,-9.7715,281
0.4277,-10.0384,282
-0.1859,-9.8589,283
-0.2126,-9.8042,284
0.1016,-9.7164,285
-0.0018,-9.8977,286
0.3457,-9.7342,287
1.5056,-9.4478,288
-0.0337,-9.7083,289
-0.0662,-9.4309,290
3.3849,-9.6574,291
-0.4241,-8.5555,292
6.6034,-9.7105,293
-0.248,-9.7152,294
-0.8755,-9.8602,295
0.4902,-9.7941,296
-0.0572,-9.7454,297
0.178,-9.5475,298
-0.0401,-9.8417,299
0.0866,-9.701,300
-0.0076,-9.9034,301
0.7329,-9.8093,302
0.0027,-10.1858,303
0.5312,-10.316,304
-0.1747,-9.9141,305
-0.1073,-9.742,306
0.266,-10.0104,307
0.3681,-9.686,308
0.4895,-9.8943,309
0.2264,-9.8847,310
0.2524,-9.7084,311
-1.1445,-9.7707,312
0.136,-9.4267,313
-0.1187,-9.8833,314
0.0959,-9.7206,315
0.11,-9.8085,316
0.2206,-9.3386,317
3.3336,-9.9298,318
0.7445,-9.8187,319
0.5333,-9.9144,320
-0.0423,-10.1988,321
-0.1474,-9.7154,322
-0.1803,-9.4674,323
0.5891,-9.725,324
-0.0801,-9.6637,325
-0.2631,-9.8144,326
0.4747,-9.6476,328
0.2826,-9.7684,329
0.2532,-9.8213,330
0.022,-9.8042,331
-0.0534,-9.4215,332
1.0121,-9.7088,333
0.3899,-9.7211,334
-0.0528,-9.7961,335
-0.0185,-9.8651,336
-0.1831,-9.7607,337
0.4469,-9.8682,338
1.4327,-9.7772,339
-0.7509,-9.826,340
-0.5082,-9.8203,341
-4.1856,-9.777,343
17.9077,-8.9604,344
-10.8535,-9.7703,345
9.5182,-9.5619,346
4.9648,-9.6967,347
-7.3292,-9.6972,348
-21.2139,-9.5054,349
3.788,-9.573,350
6.0318,-9.6461,351
7.1473,-9.7641,353
-11.6779,-9.9263,354
0.8707,-9.7254,355
-4.2913,-9.7407,356
-3.7226,-9.5901,358
17.3871,-9.4075,359
2.2065,-9.6735,360
1.0548,-9.95,361
-3.6083,-9.8723,362
3.0578,-9.645,363
0.5231,-9.6707,364
-3.0284,-9.7704,365
-0.3034,-9.7484,366
0.2331,-9.8664,368
-0.4469,-9.7268,369
3.7097,-9.8932,370
-1.281,-9.6402,371
0.8121,-9.8269,372
0.0995,-9.888,373
0.3594,-9.8979,374
1.9474,-9.7304,375
0.0601,-9.6544,376
-0.026,-9.7941,378
0.3543,-9.8212,379
0.4705,-9.8581,380
0.06,-9.7264,381
-0.0734,-9.7842,382
0.2657,-9.9127,383
-0.0746,-9.8365,384
-0.2519,-9.7793,385
0.3046,-9.7422,386
-0.198,-9.7762,387
-16.1955,-9.4058,388
-26.6667,-9.106,389
-16.9106,-8.9498,390
4.3289,-8.7027,391
15.3715,-9.3729,392
4.7827,-9.438,393
15.3219,-9.5192,394
3.3161,-9.6792,395
2.2497,-9.7277,396
1.2516,-9.742,397
5.1958,-9.6422,398
2.3634,-9.7755,399
-0.6971,-9.8052,400
2.6549,-9.7953,401
8.3411,-9.6919,402
-56.8539,-9.47,403
0.0164,-9.5866,404
0.1019,-9.6184,405
0.6,-9.6156,406
0.5109,-9.6132,407
0.4295,-9.6134,408
0.4479,-9.6128,409
0.4303,-9.6135,410
0.4225,-9.6129,411
0.4577,-9.6141,412
0.431,-9.6145,413
2.0222,-9.7247,414
1.643,-9.6075,415
0.7531,-9.8047,416
-3.9942,-9.3403,418
5.4946,-9.2324,419
27.8041,-9.4833,420
-21.9912,-9.911,421
9.2792,-9.4609,422
-1.8531,-9.7875,423
-2.3571,-9.7409,424
-1.2977,-9.5448,425
1.3006,-9.757,426
1.7234,-9.5107,427
0.3426,-9.768,428
-0.2284,-9.7865,429
-0.1517,-9.9037,430
-0.1106,-9.6779,431
0.602,-9.8522,432
-0.881,-9.868,433
0.1419,-9.8964,434
0.7509,-9.9465,435
-0.1616,-9.8047,436
-0.1657,-9.892,438
0.5371,-9.7953,439
-7.8805,-9.7689,440
-8.6496,-9.6244,441
-2.328,-9.5712,442
5.0373,-9.5349,443
-1.2543,-9.6077,444
3.2549,-9.6467,445
7.2591,-9.7485,446
-0.8911,-9.8253,447
-1.6609,-9.7084,448
-0.3556,-9.7983,449
1.9063,-9.7457,450
1.7954,-9.8911,451
-0.2068,-9.9432,452
-1.5576,-10.1281,453
-1.425,-9.7834,454
0.9533,-9.8598,455
-0.0408,-9.9539,456
1.1399,-9.905,457
-0.2022,-9.8348,458
0.3705,-9.8207,459
-0.0102,-9.935,460
2.9126,-9.9207,461
1.0586,-8.1136,462
0.7274,-9.5778,463
0.554,-9.8769,464
-0.1995,-9.7833,465
-0.0117,-9.8497,466
0.543,-9.9237,467
0.0339,-9.8652,468
0.6928,-9.8164,469
0.2504,-9.8153,470
0.9786,-9.8176,471
0.3196,-10.0151,472
0.4428,-9.2765,473
1.0829,-9.7958,474
-0.0806,-9.8493,475
0.0946,-9.7485,476
1.3217,-9.5734,477
0.198,-10.5775,478
0.2728,-9.7572,479
0.2077,-9.8023,480
0.3993,-10.1668,481
-0.0946,-9.9317,482
-0.0292,-9.9909,483
-0.4404,-9.5566,484
-0.1498,-9.7905,485
1.087,-9.4587,486
-0.2318,-9.505,487
1.5163,-9.7484,488
0.1871,-9.8467,489
-1.1117,-9.2529,490
-1.2437,-9.789,491
-0.1352,-9.8,492
-0.3215,-9.922,493
0.9534,-10.2525,494
0.4461,-9.8729,495
0.0187,-9.7301,496
0.5044,-9.7114,498
0.0469,-9.8703,499
-0.0777,-9.9167,500
-0.1591,-9.7734,501
0.3768,-9.7849,502
-0.5263,-9.8521,503
1.0649,-10.1183,504
-0.2908,-9.6137,505
0.0832,-9.8351,506
1.1688,-9.8941,508
0.0809,-9.8141,509
-0.0973,-9.81,510
0.2025,-9.7443,511
0.2672,-9.8817,512
-0.0414,-9.8735,513
-0.5177,-9.6388,514
0.5949,-9.7842,515
0.0178,-10.0473,516
0.2512,-9.8106,518
-0.071,-9.7501,519
0.3725,-9.9086,520
-0.058,-9.67,521
1.8568,-9.8569,522
-1.0425,-9.5887,523
-1.1185,-9.8198,524
-0.1072,-9.2576,525
-0.0781,-9.8499,526
0.1593,-9.8043,528
0.0185,-9.8231,529
-0.0291,-9.6476,530
0.0813,-9.5945,531
0.0299,-9.9038,532
-0.1145,-9.7952,533
-0.7405,-9.5092,534
-0.0883,-9.9123,535
0.1555,-9.6567,536
0.8562,-9.8664,538
-0.0862,-9.8441,539
0.0645,-9.7417,540
0.0233,-9.8031,541
0.0202,-9.893,542
0.1668,-9.9207,543
-0.0196,-8.7812,544
0.1709,-9.8443,545
0.857,-9.9892,546
0.8638,-9.7842,548
0.3744,-9.9237,549
-2.4714,-9.7652,550
1.0471,-9.8434,551
-0.1316,-9.6633,552
0.0042,-9.8088,553
0.5523,-9.964,554
0.0737,-9.748,555
0.7777,-9.6874,556
0.347,-9.9595,558
1.052,-9.3804,559
0.3783,-9.9811,560
-0.3871,-9.721,561
3.3672,-9.6287,562
-0.012,-9.8985,563
-0.2056,-9.9043,564
2.319,-9.8756,565
0.0286,-9.7708,566
-24.5545,-9.4653,581
4.4586,-9.3771,582
10.8848,-9.5243,583
-1.636,-9.5803,584
4.5017,-9.5887,585
3.5124,-9.6632,586
-5.2962,-9.6797,587
1.2699,-9.6312,588
1.3679,-9.6247,589
2.0463,-9.6449,590
-1.5856,-9.635,591
-0.4206,-9.6193,592
1.9412,-9.6296,593
1.1125,-9.6489,594
-3.2931,-9.6102,595
14.67,-9.6101,596
-0.5427,-9.826,597
0.2518,-9.7949,598
0.7961,-9.8776,599
0.6267,-9.9626,600
0.8131,-9.6545,601
0.5424,-9.7725,602
0.0113,-10.4328,603
-0.1734,-9.813,604
0.8272,-9.7908,605
0.3432,-9.9343,606
0.0912,-9.7123,607
0.7771,-9.8949,608
2.3123,-9.8292,609
-0.4271,-9.6493,610
-0.1006,-9.833,611
-0.1898,-9.9688,612
-0.2358,-9.8897,613
-1.065,-9.7097,614
0.0499,-9.8542,615
-0.2731,-9.5482,616
0.3131,-10.2173,617
1.8002,-9.5458,618
1.0434,-10.0181,619
0.661,-10.213,620
-0.7527,-9.7961,621
0.9836,-9.8936,622
-0.1276,-10.1332,623
0.8415,-9.507,624
0.9739,-9.8454,625
-0.1773,-9.849,626
-0.0547,-9.5472,627
0.6372,-9.8293,628
-0.0225,-9.9308,629
0.3469,-9.842,631
-0.0656,-9.7725,632
-0.0663,-9.893,634
-0.0378,-9.4894,635
-0.04,-9.6271,636
0.0136,-9.7314,637
0.0806,-9.8925,638
0.3207,-9.7858,639
4.9672,-9.8031,640
-0.2292,-9.853,641
0.3946,-9.8802,642
2.5533,-9.8422,644
1.6743,-9.8407,645
0.0531,-9.7532,646
1.3446,-9.7205,647
1.7629,-9.6608,648
1.2758,-9.6981,649
0.2875,-9.8517,650
-0.0482,-9.8113,651
0.2117,-9.7948,652
0.3712,-9.8445,654
0.1174,-9.849,655
0.5472,-9.6836,656
-0.2098,-9.8874,657
-0.0527,-9.9554,658
-0.2653,-9.5731,659
0.0453,-9.7123,660
-0.0428,-9.8727,661
-0.0814,-9.7813,662
-0.1924,-9.8029,664
-0.0159,-9.762,665
0.4186,-10.0366,666
-0.2664,-9.3875,667
-0.3883,-9.7545,668
0.743,-9.8213,669
0.0447,-9.8003,670
0.9266,-9.7527,671
0.1498,-9.9443,672
0.6261,-9.7293,674
0.2614,-9.8271,675
-0.112,-9.8262,676
-0.9042,-9.7194,677
0.4226,-9.1097,678
-0.2157,-9.8805,679
-0.7838,-9.7183,680
0.4652,-9.8307,681
-0.0369,-9.7195,682
-0.0087,-9.796,683
-0.4396,-9.8491,685
0.4136,-9.8722,686
1.3314,-9.98,687
-0.0854,-9.948,688
1.4297,-9.7453,689
0.2524,-10.1379,690
-0.1936,-9.8034,691
-0.026,-9.7441,692
-0.4136,-9.6903,694
0.3343,-9.7341,695
2.7259,-9.8747,696
-1.0596,-9.668,697
1.1242,-9.9075,698
0.2864,-9.8653,699
-0.1449,-10.3262,700
0.36,-9.828,701
5.2584,-9.7708,702
0.6131,-9.7483,703
-0.0989,-10.0921,704
2.2061,-9.8843,705
-0.1052,-9.9762,706
0.7079,-9.9827,707
0.2925,-9.6369,708
1.7955,-9.9901,709
0.2853,-9.9616,710
0.4459,-9.4197,711
0.1253,-9.7383,713
-0.1869,-9.7195,714
0.1937,-9.7947,715
0.1641,-10.085,716
-0.2666,-9.5076,717
-0.1091,-10.1285,718
8.4676,-9.863,719
-0.3614,-9.843,720
0.5289,-9.7909,721
-0.0314,-9.9726,722
0.4128,-9.8956,723
0.2452,-9.8654,724
-0.0101,-9.85,725
0.3161,-9.8159,726
0.1114,-10.0283,727
0.986,-9.7463,728
-0.8309,-9.9467,729
0.5015,-10.1523,730
-0.0718,-9.7961,731
-0.536,-9.8609,732
0.0803,-10.0217,733
-0.1174,-9.9414,734
0.011,-9.7732,736
0.0768,-9.7122,737
0.1029,-9.7722,738
0.1225,-9.8314,739
0.1124,-9.7876,740
2.8724,-9.7548,741
-0.139,-9.6229,742
0.2167,-9.8496,744
-0.3755,-9.7269,745
1.0892,-10.0854,747
-1.6967,-9.6475,748
0.4947,-10.3567,749
1.03,-9.7755,750
0.2967,-9.8136,751
-0.2678,-9.7225,752
-0.1796,-9.7738,754
-0.1014,-9.8082,755
1.0488,-9.844,756
-0.5279,-9.9179,757
0.7779,-9.8272,758
-0.5942,-9.7073,759
-0.0129,-9.7389,760
0.0906,-9.898,761
0.0884,-9.7765,763
1.3903,-9.8328,764
-0.2167,-9.8449,765
-0.4794,-9.7509,766
-0.546,-9.5774,767
2.5082,-9.7641,769
0.8828,-9.7476,770
0.1407,-9.9939,771
-0.3857,-9.6451,772
-0.0166,-9.81,773
-0.3066,-9.7909,775
0.3467,-9.8277,776
0.0863,-9.802,777
-0.1284,-9.6641,779
0.1087,-9.7718,780
0.1049,-9.814,781
1.9253,-9.7296,782
-0.4253,-9.8774,783
0.9414,-9.9148,784
0.4166,-9.8146,785
0.6648,-9.8174,786
-4.1424,-9.7761,787
-2.8446,-9.6732,789
1.685,-9.7266,790
1.846,-9.7638,791
-2.3039,-9.8224,792
-2.7596,-9.9711,793
-2.3939,-9.7312,794
-0.3072,-9.6472,795
1.6977,-9.7495,796
-0.1725,-9.5888,797
-0.2722,-9.7952,799
-0.0592,-9.6297,800
0.0064,-9.6169,801
0.7308,-9.5722,802
-0.1558,-10.0852,803
0.9104,-9.9454,804
0.3307,-9.7799,805
-0.0499,-9.8248,806
1.8463,-9.6052,807
-0.4,-9.6551,808
0.0386,-10.0134,809
0.2727,-9.7042,811
-0.4191,-9.8002,812
0.1219,-9.8361,813
0.4267,-9.4614,814
-1.1968,-10.007,815
0.7387,-9.7811,816
2.877,-9.8887,817
2.2698,-9.4451,818
0.6199,-9.5741,819
-0.2291,-9.7665,820
0.0386,-9.8111,821
-0.0392,-9.6974,822
-0.2818,-9.8679,823
-0.3491,-9.8884,824
-0.0425,-9.9758,825
0.0057,-9.7475,826
-0.6973,-9.9828,827
0.0827,-9.6234,828
0.1493,-9.7798,830
0.6699,-9.7138,831
-0.3695,-9.5359,832
-0.0254,-9.5719,833
0.4634,-9.8244,834
0.0201,-9.7773,835
0.1843,-9.6713,836
0.1104,-9.9416,837
0.0723,-10.1912,838
-0.1935,-9.817,839
-0.1564,-10.1834,840
0.017,-9.7746,841
-0.2311,-9.8431,842
-0.1671,-9.9237,843
-0.262,-9.8072,844
0.4111,-9.6321,845
0.4048,-9.8186,846
1.1335,-9.7951,847
2.9627,-9.7549,848
2.6597,-9.7276,849
1.0628,-9.8126,850
0.0873,-9.9266,851
0.2031,-9.6855,852
-0.1492,-9.9411,853
0.7452,-9.5955,854
0.5017,-9.946,855
-0.602,-9.5647,856
-0.3475,-9.7891,857
0.6165,-9.8079,858
0.1164,-9.6201,859
-0.1662,-9.8657,860
1.2165,-9.7964,861
1.4058,-9.4056,863
0.3884,-9.8185,864
0.1942,-9.7745,865
0.1552,-9.8504,866
-0.1696,-9.8721,868
0.0914,-9.8889,869
-0.0182,-9.6996,870
0.6486,-9.7172,871
-0.3371,-9.7716,872
1.1181,-9.9373,874
0.7605,-9.9237,875
1.1706,-9.5097,876
0.5568,-9.3485,877
-0.4863,-9.789,878
0.3302,-9.8249,879
0.0723,-9.6997,880
-0.2305,-9.781,881
-0.3695,-9.8648,882
0.8555,-9.8977,884
1.7807,-9.826,885
-0.2336,-9.9931,886
2.0189,-9.8362,887
1.2863,-9.5635,888
0.0159,-9.9498,889
0.8237,-9.2755,890
0.1035,-9.7959,891
1.5097,-9.5192,893
0.3238,-9.8683,894
-0.3335,-9.7103,895
-0.2518,-9.578,896
2.452,-9.7858,897
0.07,-9.6471,900
-0.2687,-10.0639,901
0.2461,-9.3881,902
-0.6866,-9.6044,903
-0.2654,-10.0071,904
0.9104,-9.8267,905
0.0069,-9.8694,906
0.6226,-9.3356,907
0.202,-9.6956,909
11.159,-9.5286,910
-4.7453,-9.4675,911
-0.4904,-9.7453,912
1.2767,-9.9376,914
0.7315,-9.8506,915
-2.7871,-9.7585,916
-12.256,-9.7534,917
-3.8485,-9.5001,918
2.4966,-9.8899,919
0.1964,-9.7837,920
1.4125,-9.8201,921
0.5622,-9.9543,922
-0.9766,-9.733,923
0.4859,-9.7512,925
1.801,-9.8655,926
0.027,-9.8821,927
-0.2574,-9.8275,928
-1.6694,-9.7705,929
-0.5125,-9.541,930
0.1124,-9.7498,931
3.1963,-9.9762,932
-0.0489,-9.4324,933
-0.5089,-9.8336,934
-0.0064,-9.8423,935
1.0227,-9.8868,936
2.4971,-9.8413,937
1.3735,-9.9336,938
1.0119,-9.7908,939
0.2996,-9.5009,940
0.095,-9.9845,941
1.3256,-9.3675,942
-0.3323,-9.8923,943
-0.0069,-9.7542,944
0.6013,-9.7295,945
0.5836,-9.6343,946
1.4595,-9.7885,947
1.0813,-9.9529,948
0.5805,-10.156,949
0.0094,-9.6452,950
0.4977,-9.7831,951
0.538,-9.7392,952
-0.067,-9.761,953
0.5406,-9.7946,954
-0.3621,-9.8399,955
-0.029,-9.8582,956
0.04,-9.5535,957
-0.2395,-9.913,958
0.3405,-9.7776,959
-0.9076,-10.1558,960
-0.7843,-9.9538,961
3.7198,-9.9683,962
-0.0385,-9.7852,963
-1.024,-9.8487,964
1.2786,-9.8011,965
0.3053,-9.8403,966
2.1262,-9.8422,967
0.5824,-9.7345,968
0.7135,-9.8437,969
1.048,-9.7607,971
1.6249,-9.8341,972
1.1019,-9.6295,973
1.1118,-9.7829,974
0.0728,-9.6985,975
0.2739,-9.9214,976
0.194,-9.7476,977
1.107,-9.9154,978
-0.5064,-9.839,979
0.0809,-9.8085,980
1.1878,-9.8271,981
-0.723,-9.8295,982
-0.0214,-9.758,983
-0.2984,-9.8507,984
0.2513,-9.7333,985
0.1164,-9.7979,986
-0.2653,-9.8839,987
-0.6443,-9.8088,988
-17.3708,-9.6743,989
5.8263,-9.661,990
-0.4819,-9.7051,991
-0.8808,-9.6853,992
-1.2963,-9.6544,993
2.2179,-9.6629,994
0.5057,-9.6953,995
-0.291,-9.6796,996
-0.3895,-9.6675,997
1.3012,-9.6773,999
0.468,-9.6887,1000
0.2276,-9.6867,1001
0.4891,-9.6902,1002
-0.3973,-9.6908,1003
0.5426,-9.6668,1004
1.1628,-9.6653,1005
1.1055,-9.697,1006
-0.1008,-9.6977,1007
0.4535,-9.6961,1009
0.1961,-9.6825,1010
2.0356,-9.6985,1011
-0.4301,-9.5982,1012
4.7232,-9.56,1013
-1.5487,-9.7922,1015
0.0378,-9.8195,1016
7.9309,-9.6438,1017
2.3806,-9.7751,1019
0.9596,-9.9296,1020
1.1503,-10.0478,1021
0.4694,-9.7041,1022
0.025,-9.9374,1023
-0.2284,-9.7939,1024
2.9398,-9.6171,1025
0.5401,-9.6879,1026
-0.0927,-9.8685,1027
0.1578,-9.4904,1029
0.3941,-9.6084,1030
1.0821,-9.7282,1032
-0.0083,-9.8056,1033
0.0761,-9.8181,1034
0.0334,-9.7759,1035
0.0519,-9.7845,1036
0.7752,-9.8609,1037
-0.218,-9.7484,1039
0.8484,-9.8051,1040
-0.2294,-9.8295,1041
2.7633,-9.7198,1042
-0.0686,-9.6832,1043
0.153,-9.9449,1044
0.0764,-9.9626,1045
0.7421,-9.7762,1046
1.7474,-9.7633,1048
0.1602,-9.7771,1049
-0.1709,-9.7885,1050
0.0945,-9.8274,1051
-0.6483,-9.8602,1052
-0.1458,-9.7466,1053
0.374,-9.7856,1054
0.1005,-9.774,1055
-0.6274,-9.7614,1056
0.1588,-9.7827,1057
-0.8857,-9.9088,1058
0.1497,-9.789,1059
3.9433,-9.6859,1060
0.046,-9.7911,1061
1.3603,-9.7548,1062
0.1438,-9.8221,1063
0.5798,-9.7691,1065
1.0641,-9.8197,1066
0.135,-9.7725,1067
-0.0213,-9.6719,1068
0.7507,-9.806,1069
-0.018,-9.7675,1070
0.17,-9.7514,1071
-0.0272,-9.8333,1072
0.2744,-9.8588,1073
1.0346,-9.7701,1074
1.2486,-9.8085,1075
1.6825,-9.8592,1076
0.5161,-9.7187,1078
0.0264,-9.8283,1079
-0.0074,-9.7764,1080
0.3724,-9.831,1081
-0.0314,-9.7186,1082
0.7801,-9.7408,1083
0.4159,-9.8829,1084
0.6067,-9.9559,1085
-0.0176,-9.8274,1086
-0.302,-9.9088,1087
1.7462,-9.5748,1088
0.33,-9.7655,1089
-0.1738,-9.9733,1090
2.7776,-9.8419,1091
0.032,-9.877,1092
-2.4748,-9.7777,1093
-14.2755,-9.5501,1094
-3.128,-9.4554,1095
4.8558,-9.6067,1096
7.1879,-9.6458,1098
2.0123,-9.5676,1099
15.6407,-9.5539,1100
5.6133,-9.7504,1101
-3.2366,-9.5508,1102
-1.7717,-9.7134,1104
1.2915,-9.7707,1105
-4.3123,-9.785,1106
-2.3475,-9.6459,1107
2.8013,-9.6369,1108
4.3264,-9.8027,1109
1.4679,-9.8915,1110
-1.0585,-9.7311,1111
7.5114,-9.7944,1113
-0.8578,-9.7505,1114
-0.8715,-9.6123,1115
5.333,-9.6777,1116
1.1736,-9.8224,1118
0.4296,-9.7996,1119
-2.7081,-9.6748,1120
0.5242,-9.6243,1121
-1.0945,-9.6489,1122
-1.3772,-9.6768,1124
-0.2141,-9.7792,1125
-1.8983,-9.7779,1126
11.7392,-9.6376,1127
4.6156,-9.7614,1128
-7.5043,-9.7855,1130
-4.0399,-9.6321,1131
12.2036,-9.8629,1132
1.1432,-9.7404,1133
-5.486,-9.3711,1134
-4.1307,-9.678,1135
11.3068,-9.7035,1136
-42.7626,-9.3545,1137
6.4364,-9.1242,1139
0.8178,-9.4092,1140
-0.2306,-9.396,1141
1.0961,-9.3769,1143
0.0879,-9.3804,1144
0.7709,-9.3675,1145
3.259,-9.3726,1146
0.2079,-9.4298,1147
27.0897,-9.4774,1149
5.2294,-9.6513,1150
5.121,-9.7183,1151
0.0467,-9.8102,1152
-0.1631,-9.7831,1153
7.456,-9.7182,1154
2.3817,-9.6036,1155
-6.6092,-9.6008,1156
-4.5679,-9.6143,1157
-8.0648,-9.5824,1158
-0.3467,-9.7589,1159
-3.7892,-9.7502,1160
-1.6545,-9.7364,1161
-0.7344,-9.7806,1162
2.7547,-9.6302,1163
-0.1155,-9.6292,1164
0.9127,-9.6607,1165
-3.8185,-9.7523,1166
-0.3402,-9.6757,1167
1.2237,-9.7304,1168
0.5467,-9.9568,1169
-2.5472,-9.7678,1170
-1.9381,-9.7692,1171
4.6564,-9.784,1172
5.0956,-9.8867,1173
0.5862,-9.8787,1174
4.1262,-10.3857,1175
-0.4368,-9.8059,1176
-5.4091,-9.7347,1177
-13.7642,-9.6298,1178
-19.3597,-9.4673,1179
8.7237,-9.514,1180
10.2333,-9.5985,1181
2.2954,-9.7477,1182
1.3212,-9.8876,1183
-2.0644,-9.8362,1184
0.5605,-10.02,1185
1.4551,-9.8288,1186
0.4737,-9.9052,1187
0.2243,-9.5479,1188
0.2793,-9.847,1189
0.4469,-9.9977,1191
0.3179,-9.3788,1192
1.0877,-9.6304,1193
0.3267,-9.5778,1194
0.858,-9.735,1196
1.4969,-9.8262,1197
0.7343,-9.851,1198
1.2478,-9.7628,1199
0.5253,-9.8458,1200
1.4926,-9.7757,1201
0.2349,-9.7971,1202
-0.016,-9.9116,1203
0.7926,-9.8472,1204
0.0991,-9.7914,1205
1.6979,-9.8596,1206
-0.5463,-9.8959,1207
-0.6464,-9.9549,1208
1.8079,-9.7815,1209
0.7704,-9.7821,1210
0.2196,-9.7184,1211
1.9714,-9.8185,1212
0.9458,-9.8488,1213
0.1286,-9.7803,1214
-0.132,-9.7876,1215
0.2042,-9.753,1216
0.0845,-9.7313,1217
0.832,-9.7311,1218
-1.4899,-9.8904,1219
0.2038,-9.6173,1220
1.4477,-10.0048,1221
-1.7956,-9.5778,1222
-0.5122,-9.691,1223
-0.3648,-9.6761,1224
-0.9564,-10.1416,1225
-0.4774,-9.6738,1226
-3.2827,-9.9625,1228
0.7182,-9.8727,1229
-0.4865,-9.846,1230
0.1312,-9.7726,1231
1.3374,-10.0495,1232
-0.9176,-9.7006,1234
-1.0145,-9.8252,1235
4.8386,-9.8364,1236
8.6657,-10.0448,1237
0.4485,-10.2149,1238
1.4393,-9.179,1239
-0.4478,-9.8047,1240
0.4211,-9.7579,1241
1.6573,-9.9466,1243
0.7777,-9.7996,1244
0.7352,-9.8169,1245
0.8086,-9.7748,1246
0.5211,-9.7982,1247
1.1819,-9.6249,1248
-0.531,-9.93,1249
-0.8195,-9.414,1250
0.2861,-9.7954,1251
-1.1846,-9.8126,1252
-0.4958,-9.7131,1254
0.0969,-9.721,1255
0.0957,-9.8593,1256
4.1319,-9.5841,1257
0.9233,-9.9781,1258
-2.1933,-9.7183,1259
0.5281,-10.2076,1260
2.4101,-9.8223,1261
-5.1662,-9.7335,1262
-0.548,-9.9147,1264
0.1515,-9.8903,1265
6.7529,-10.1052,1266
1.1341,-9.6154,1267
0.957,-9.7782,1268
2.7699,-9.5486,1269
-0.2133,-10.2865,1270
0.2228,-9.8394,1271
1.8672,-9.8017,1272
5.3528,-9.5843,1273
0.6942,-9.8049,1275
-0.1124,-9.8257,1276
0.0848,-9.6849,1277
0.4173,-9.8054,1278
0.5173,-9.9163,1279
-1.1074,-10.0101,1280
0.4433,-9.793,1281
0.2064,-9.8076,1282
-0.2643,-9.6482,1283
-0.4462,-10.0763,1284
0.8116,-9.7967,1285
1.5835,-10.0335,1286
3.0515,-9.8434,1287
1.7694,-9.9298,1288
0.563,-9.726,1289
0.1893,-10.1142,1290
0.0306,-9.8518,1291
-0.1,-9.8479,1292
-0.2727,-9.8697,1293
0.082,-9.8337,1294
0.0278,-9.8134,1295
-0.2215,-9.8101,1296
0.1452,-9.7982,1297
0.8485,-9.7889,1298
-0.2303,-9.8063,1299
1.1947,-9.8071,1300
1.0278,-9.857,1301
0.7204,-9.8177,1302
0.3201,-9.816,1303
0.1901,-9.8647,1304
0.0123,-9.8294,1305
1.4097,-9.8234,1306
0.4284,-9.8715,1307
0.0329,-9.9693,1308
0.2347,-9.7492,1309
-0.5569,-9.7414,1310
-0.4255,-9.8849,1311
-0.2343,-9.8522,1312
0.0456,-10.0173,1313
-0.117,-9.8936,1314
4.0606,-9.848,1315
2.5092,-9.7887,1316
-0.0586,-9.449,1317
-0.2097,-9.8895,1318
1.2536,-9.8618,1319
0.4763,-9.839,1320
0.296,-9.8129,1321
0.6866,-9.8104,1322
-0.3148,-9.7855,1323
1.0924,-9.9765,1324
0.0624,-9.8291,1325
0.254,-9.8195,1326
0.6171,-10.0406,1327
-0.1029,-9.7623,1329
-0.2231,-9.831,1330
0.9916,-9.7175,1331
-0.0233,-9.8757,1332
0.4373,-9.7803,1333
-0.5183,-9.7297,1334
0.9805,-9.9569,1335
-0.1416,-9.6906,1336
-0.1439,-10.1042,1338
0.3662,-9.8898,1339
3.739,-9.6579,1340
1.0082,-9.6923,1341
-1.0169,-9.8845,1343
0.2359,-9.5685,1344
0.2572,-9.829,1345
1.6964,-9.8275,1346
0.9966,-9.5087,1348
0.6589,-9.9212,1349
-0.1742,-9.8116,1350
0.0368,-9.8024,1351
3.0673,-9.6841,1352
-0.0684,-9.6782,1354
-0.0158,-9.9334,1355
1.0446,-9.6564,1356
1.3776,-10.2811,1357
1.4461,-9.3398,1358
2.7064,-9.5377,1359
-0.7664,-9.8628,1360
0.1317,-9.6807,1361
0.4906,-9.5685,1362
0.0016,-9.5218,1364
-0.1522,-9.778,1365
0.5169,-9.7209,1366
1.2362,-10.0923,1367
0.9219,-9.8675,1368
0.8474,-9.5362,1369
-0.1971,-9.7133,1370
0.5025,-9.6814,1371
-0.5831,-9.8903,1372
-0.3286,-9.8486,1374
0.0193,-9.8065,1375
0.5718,-9.872,1376
0.393,-9.7575,1377
0.555,-9.7124,1378
0.2221,-9.5622,1379
0.6548,-9.6879,1380
0.5661,-9.6537,1381
-0.5224,-9.6318,1382
0.2405,-9.7676,1384
0.2179,-9.7729,1385
0.541,-9.7559,1386
0.548,-9.7098,1387
0.3651,-9.7633,1388
1.937,-9.8955,1389
-0.2476,-9.6182,1390
-0.2578,-9.7561,1391
-0.2951,-9.7444,1392
0.6284,-9.7516,1393
0.2114,-9.7747,1395
-0.4983,-9.8101,1396
-0.5232,-9.8493,1397
0.1579,-9.8109,1398
-0.428,-9.8754,1399
-0.1107,-9.6285,1400
0.6603,-9.7507,1401
1.461,-9.8871,1402
2.2046,-10.3922,1403
0.1796,-9.8735,1405
0.4806,-9.8657,1406
-0.3558,-10.0944,1407
-1.0645,-9.8235,1408
0.8958,-9.6572,1409
0.2261,-9.9873,1410
1.5749,-9.6199,1411
-0.2898,-9.673,1412
-0.5819,-9.572,1413
-0.4392,-9.728,1415
-0.767,-9.7104,1416
-0.3363,-9.4941,1417
-0.2824,-9.7871,1418
0.2787,-9.9164,1419
-0.0882,-9.8016,1420
-0.1014,-9.6114,1421
0.4221,-9.7296,1422
0.2531,-9.4165,1423
-0.1506,-9.8675,1424
-0.2286,-9.5822,1425
0.3774,-9.8061,1426
-0.346,-9.8436,1427
0.2873,-9.7339,1428
-0.1718,-9.6571,1429
0.0188,-9.9146,1430
-0.1664,-9.722,1431
0.0381,-10.0417,1432
0.9616,-9.7986,1434
-0.0686,-9.7742,1435
0.6223,-9.8593,1436
-0.0466,-9.7432,1437
0.817,-9.9001,1438
-0.1381,-9.8534,1439
0.6637,-9.7491,1440
0.0501,-9.7908,1441
1.2143,-9.6799,1442
-0.2735,-9.7499,1444
-0.0391,-9.8285,1445
0.5998,-9.8486,1446
0.7522,-9.829,1447
-0.0844,-9.9464,1448
2.5994,-9.7045,1449
0.0852,-9.8908,1450
0.6581,-9.7204,1451
0.0448,-9.7656,1452
-3.1288,-9.8248,1454
-3.4136,-9.6147,1455
3.3729,-9.628,1456
-1.1173,-9.6929,1457
-3.2735,-9.7012,1458
2.9642,-9.6473,1459
1.1785,-9.6106,1460
1.6329,-9.6141,1461
2.8758,-9.6472,1463
5.01,-9.7677,1464
0.1111,-10.0946,1465
0.4693,-9.8704,1466
1.0737,-9.6514,1467
-0.5582,-9.7893,1469
0.7829,-9.8868,1470
-0.1538,-9.831,1471
2.7896,-9.4035,1472
-0.2399,-9.8535,1473
0.2146,-9.7541,1474
0.0355,-9.8017,1475
0.2725,-9.7388,1476
-0.1595,-9.8377,1477
1.2006,-9.745,1478
1.1594,-9.7541,1479
0.2014,-9.7877,1480
0.3975,-9.8139,1481
-0.3423,-9.7346,1482
0.2086,-9.8265,1483
0.1976,-9.8712,1484
-0.3433,-9.8992,1485
-0.2042,-9.7591,1486
0.3739,-9.8381,1487
0.0711,-9.7897,1489
0.755,-9.9175,1490
-0.4975,-9.7185,1491
1.684,-9.8445,1492
-0.0869,-9.5805,1493
1.0803,-10.0331,1494
0.1695,-9.913,1496
0.34,-10.003,1497
0.6934,-9.9839,1500
1.7857,-9.8378,1501
0.2943,-9.8679,1502
0.2542,-9.6834,1503
0.13,-9.789,1504
2.0762,-9.9694,1505
1.1034,-9.8453,1506
0.7415,-9.7944,1507
0.4074,-9.8768,1508
0.0645,-9.8249,1510
0.0943,-9.7386,1511
0.2075,-10.1566,1512
0.471,-9.9505,1514
1.5693,-9.6433,1515
0.1482,-9.8246,1516
0.0169,-9.8138,1517
0.3744,-9.8335,1518
-0.2805,-9.8045,1519
-0.8651,-9.8331,1520
1.4095,-9.7587,1521
7.2555,-9.7482,1522
0.2023,-10.208,1523
0.0403,-9.9654,1524
-0.4062,-9.605,1525
-1.729,-9.0356,1526
-1.1353,-9.8158,1527
1.9609,-9.5923,1528
-1.1346,-9.9854,1529
0.3005,-9.8327,1530
0.1259,-9.8659,1531
0.9269,-9.8652,1532
0.215,-9.846,1533
0.2188,-10.0361,1534
0.0066,-9.8035,1535
-0.5491,-9.7325,1536
-0.5222,-9.7446,1537
0.0791,-10.1937,1538
0.398,-9.6485,1539
0.7026,-9.8871,1540
0.8074,-9.8967,1541
0.4906,-9.6856,1542
0.8963,-10.0272,1543
0.4047,-9.4253,1544
-0.6117,-9.5802,1545
1.7157,-9.9365,1546
-0.3174,-10.0368,1547
0.6833,-9.858,1549
0.2892,-9.8644,1550
0.4537,-9.8142,1551
0.5721,-9.8168,1552
1.0075,-9.864,1553
0.2991,-9.8075,1554
0.4057,-9.7939,1556
0.4028,-9.7482,1557
0.1769,-9.8289,1559
1.5977,-9.6919,1560
-0.2531,-9.6214,1561
1.3089,-9.3627,1562
3.5874,-9.7333,1563
5.2464,-9.8418,1564
0.8297,-9.9096,1565
-0.3513,-9.873,1566
1.4038,-9.9009,1568
0.1385,-9.7683,1569
0.0385,-9.8164,1570
0.0551,-9.8662,1571
-0.305,-8.8738,1573
0.3454,-9.8592,1574
0.2849,-9.7539,1575
-0.1159,-9.8603,1576
0.0418,-9.9468,1578
0.4973,-9.7051,1579
-0.1606,-10.3492,1580
-0.2534,-9.0262,1581
0.2009,-9.5384,1583
0.4656,-9.5894,1585
-0.168,-9.897,1586
0.1698,-9.8326,1587
3.0057,-9.6755,1588
0.4258,-9.866,1590
-0.0414,-9.7717,1591
0.065,-9.7813,1592
0.0405,-9.8733,1593
-0.4705,-9.7421,1594
-0.1907,-9.7385,1595
0.2141,-9.8768,1596
-0.2575,-9.9977,1597
-0.1582,-9.2795,1598
-0.1916,-9.6962,1599
0.1826,-9.7193,1600
-0.3593,-9.6248,1601
0.0998,-9.7257,1602
-0.296,-10.211,1604
0.5366,-9.8382,1605
0.6649,-9.7296,1606
-0.3385,-9.7928,1607
-0.1323,-9.7341,1608
0.0481,-9.6838,1609
0.2539,-9.759,1610
0.6882,-9.7547,1611
0.8476,-9.7292,1612
-0.4226,-9.8818,1613
0.5431,-9.904,1615
0.0539,-9.7827,1617
0.5993,-9.7844,1618
0.6805,-9.7722,1619
1.5964,-9.6822,1621
3.4249,-9.9403,1622
2.3247,-9.7653,1623
0.2585,-9.8685,1624
3.8069,-9.8118,1625
0.3097,-9.8536,1626
0.6344,-9.9184,1627
0.4908,-9.8337,1628
-0.086,-9.9593,1629
1.359,-9.796,1630
0.3664,-9.8333,1631
0.5983,-9.9723,1632
0.1513,-9.7874,1633
2.1081,-9.7799,1634
0.0144,-9.968,1635
3.3875,-9.6434,1636
0.4597,-9.824,1637
2.14,-9.8849,1638
-1.1206,-9.9688,1639
1.0594,-9.2025,1640
0.1644,-10.2602,1641
-0.0664,-9.8628,1642
0.7874,-9.3686,1643
0.0729,-9.7144,1644
0.1613,-9.6767,1645
-0.4902,-9.9869,1646
1.3926,-9.8916,1647
0.9556,-9.9955,1648
-0.1313,-9.8263,1649
0.0665,-9.8072,1650
0.1823,-9.917,1651
-1.9845,-9.8111,1652
0.3897,-9.7664,1653
-6.2611,-9.7905,1654
6.9443,-9.4561,1655
-4.2968,-9.6718,1656
-5.042,-9.5792,1657
11.7553,-9.5507,1658
-6.6032,-9.675,1659
4.0057,-9.6733,1660
-0.0849,-9.7193,1661
-2.7204,-9.7735,1662
2.4875,-9.8196,1663
0.3207,-9.8083,1664
-0.122,-9.8086,1665
-0.5599,-9.8167,1666
-0.1314,-9.8018,1667
0.0619,-9.8305,1668
-41.6884,-9.4898,1669
8.2287,-9.4555,1670
-2.8157,-9.4551,1671
13.1686,-9.5112,1672
-0.4026,-9.8029,1673
1.8858,-9.8055,1674
0.0375,-9.8112,1675
-0.0138,-9.8133,1676
-0.036,-9.816,1677
-10.7454,-9.7426,1678
2.3286,-9.7231,1679
-11.3976,-9.7308,1680
-0.615,-9.6609,1681
-0.2422,-9.6761,1682
7.6089,-9.7318,1683
-2.0657,-9.8001,1684
0.2194,-9.8053,1685
-2.5346,-9.7918,1686
-29.5715,-9.5587,1687
-17.8333,-9.0775,1688
-47.8678,-8.7109,1689
11.2092,-8.5783,1690
4.65,-8.7802,1691
83.0642,-9.2136,1692
-3.225,-9.8069,1693
0.3226,-9.8136,1694
-0.1533,-9.8182,1695
-24.8987,-9.8165,1696
-5.6889,-9.3951,1697
-0.2175,-9.8371,1698
-3.9307,-9.741,1699
2.4793,-9.9591,1700
-0.0656,-9.7557,1701
1.0548,-9.874,1702
2.2194,-9.9211,1703
-0.3401,-9.8039,1704
-0.6135,-9.5997,1705
-0.0182,-10.0903,1706
0.7236,-9.096,1707
0.6091,-10.168,1708
0.0687,-9.8563,1709
-0.3338,-9.7063,1710
0.0083,-9.0544,1711
-0.1663,-10.4581,1712
0.1284,-9.7815,1713
-0.1015,-9.1659,1714
0.1074,-9.6634,1715
0.4828,-10.0371,1716
-1.165,-10.3843,1717
4.5959,-9.6563,1718
0.8715,-9.8312,1719
0.976,-9.2854,1720
-0.5724,-10.3034,1721
-0.7577,-9.6022,1722
-0.2744,-9.1704,1723
0.9835,-9.744,1724
0.8486,-9.9391,1725
1.6032,-10.0072,1726
-0.0201,-10.0028,1727
-7.1737,-9.757,1728
-0.1247,-9.7081,1729
8.498,-9.7017,1730
-8.8692,-9.7369,1731
15.4743,-9.7532,1732
0.0734,-9.8018,1733
0.8104,-9.7172,1734
-27.0126,-9.3715,1735
8.511,-9.9256,1736
-5.1502,-9.9429,1737
-0.667,-9.7867,1738
-0.9604,-9.8244,1739
-0.0,-9.8025,1740
