AYGX_mean,AZ_mean,timestamp
-0.0724,-9.803,0
-0.0703,-9.8046,1
-0.0724,-9.8043,2
-8.4238,-9.7472,3
-8.3018,-9.6373,4
0.492,-9.4806,5
11.7909,-9.7042,6
0.5198,-9.775,7
-0.2162,-9.7838,8
0.2117,-9.7951,9
-0.6876,-9.7948,10
0.9868,-9.7919,11
-1.1961,-9.8001,12
-0.6551,-9.799,14
-0.3291,-9.7873,15
2.6554,-9.7936,16
-5.4304,-9.7786,17
5.6012,-9.7279,18
-0.8281,-9.7882,19
-0.0603,-9.7906,20
-3.2226,-9.7665,21
-4.3818,-9.6633,22
3.9345,-9.6134,24
-2.3095,-9.6732,25
0.7831,-9.7492,26
-4.2474,-9.6951,27
-1.7367,-9.8075,28
-1.4163,-9.7968,30
-1.3979,-9.7765,31
-2.7814,-9.7033,32
-12.4005,-9.6479,34
-1.1184,-9.5788,35
2.7827,-9.4499,36
-1.3762,-9.5299,38
5.1554,-9.6507,39
-0.0497,-9.6462,40
5.7042,-9.6964,41
6.2751,-9.851,42
0.596,-9.7713,44
-1.3934,-9.7701,45
-9.3212,-9.7551,46
-10.1785,-9.3119,47
16.4451,-9.6764,48
8.7839,-9.79,49
-1.1266,-9.784,50
2.8568,-9.7052,51
-10.2712,-9.5798,52
3.0558,-9.594,54
-0.4169,-9.6658,55
-20.5379,-9.5266,56
29.5956,-9.3379,57
15.1108,-9.5062,58
-5.3704,-9.4528,59
4.4484,-9.7351,61
-14.266,-9.5886,62
-1.751,-9.8316,63
0.7883,-9.7884,64
0.8144,-9.8637,65
-0.4652,-9.795,67
-0.1965,-9.933,68
-0.3761,-9.8934,69
-4.2684,-10.1403,70
-1.8855,-10.1231,71
2.1406,-9.6943,73
-3.368,-10.2326,74
8.9231,-9.7485,75
34.9537,-9.5617,76
5.1935,-7.3906,77
1.3444,-9.6633,78
13.1239,-9.5481,79
34.5511,-9.9471,80
0.8047,-9.6211,81
4.5787,-9.7904,83
4.5584,-9.5835,84
4.3495,-9.7776,86
5.3201,-9.8011,87
0.0024,-9.8398,88
5.5331,-10.0879,89
-4.2628,-9.7504,90
-1.2982,-9.8134,91
-8.6682,-9.8796,92
-4.2854,-9.7789,94
-0.0332,-10.1607,95
4.6426,-9.6088,96
25.2268,-9.7312,97
-6.5775,-9.5911,98
3.7935,-9.7461,99
-1.1965,-9.5403,100
0.509,-9.7834,101
3.4857,-9.772,102
-1.6655,-10.0121,104
-1.3958,-9.8306,107
-1.2363,-0.6106,108
6.576,-9.7887,109
7.3523,-9.8442,110
-0.0852,-9.8545,111
0.6634,-9.8216,113
-0.0124,-9.7681,114
-0.0566,-9.7895,115
-3.0756,-9.8176,116
3.2015,-9.8824,117
4.1987,-10.004,118
-0.2899,-10.0969,119
0.5998,-9.8758,120
1.9089,-9.9153,121
-0.0609,-9.7487,123
-1.5525,-9.8026,124
0.8799,-9.7746,125
0.0245,-9.7973,126
-0.4474,-9.8833,127
-0.0218,-9.822,128
-0.9619,-9.814,129
1.2261,-9.7554,130
1.9,-9.5477,131
1.0722,-9.7302,132
0.8582,-9.7431,134
-0.4291,-9.8295,135
0.4116,-9.7147,136
-1.1946,-9.8346,137
-0.08,-9.7446,138
0.2808,-9.7563,139
1.4093,-9.8974,140
0.0521,-9.746,141
-0.1798,-9.7395,142
0.2996,-9.6768,144
-0.7968,-9.8247,145
-0.3217,-9.8292,146
-0.7617,-9.7654,147
0.3346,-9.6955,148
-0.7919,-9.8472,149
-0.6831,-10.137,150
-1.6713,-9.7703,151
0.5334,-9.8508,153
-0.0295,-9.8366,154
-0.562,-9.4702,155
-0.23,-9.8194,156
0.5367,-9.7246,157
-0.0304,-9.9559,158
0.2728,-9.578,159
1.1687,-9.7834,160
-0.4053,-9.9138,161
1.6589,-9.8641,163
0.3185,-9.742,164
2.3919,-9.7641,165
3.798,-10.1098,166
-0.0332,-9.6111,167
1.4639,-9.2264,168
6.0699,-9.5439,169
6.7542,-10.0124,170
1.7852,-9.8493,171
-1.8923,-9.5397,173
3.2498,-10.2464,174
-1.8863,-9.4503,175
3.6361,-9.7345,176
-0.4513,-10.0016,177
-0.4346,-10.01,178
0.3102,-9.8646,179
0.6072,-9.8916,180
-0.079,-9.8321,182
-0.1764,-9.7705,183
2.3203,-9.6173,184
-2.0187,-9.7497,185
-0.4351,-10.0382,186
-3.1014,-9.88,187
0.2439,-9.7785,189
-0.0365,-9.8953,190
0.7146,-9.8527,191
0.9634,-10.0039,192
1.7338,-9.9409,193
-2.2616,-9.7805,194
3.6367,-9.7136,195
-1.6503,-9.8105,196
-0.365,-9.7454,198
1.3351,-9.8035,199
0.6146,-9.8003,200
0.7095,-9.9802,201
-0.2889,-9.8018,202
-0.3302,-9.9111,203
-0.485,-9.6905,204
0.318,-10.1896,205
-1.224,-9.9368,208
-2.0056,-9.822,209
3.0748,-9.8572,210
-2.9993,-9.6411,211
6.5733,-9.6349,212
-2.3692,-9.4199,213
-0.8552,-9.8834,214
5.4485,-9.9231,215
-7.9286,-9.4389,216
-2.9968,-10.0048,217
1.0287,-9.7979,219
-1.8551,-9.8207,220
0.9246,-9.7318,221
-1.5663,-9.8115,222
-16.4182,-9.6127,223
4.8098,-9.4534,225
5.4988,-9.6125,226
-0.5051,-9.7022,227
0.2085,-9.6893,228
2.1679,-9.7808,231
1.6699,-9.7955,232
-0.7756,-9.7966,233
-0.0394,-9.8002,234
-0.1833,-9.8197,285
-0.0586,-9.8204,287
-0.21,-9.8207,288
-0.1715,-9.8196,289
-0.0274,-9.8211,290
-0.3459,-9.8193,291
-0.4549,-9.8167,293
0.1926,-9.8187,294
0.101,-9.818,295
-0.5761,-9.8228,296
0.3608,-9.8153,297
-1.2663,-9.8175,298
-6.0204,-9.765,299
1.025,-9.7418,300
-4.6333,-9.7545,301
0.9476,-9.7812,303
-0.5569,-9.7969,304
-1.023,-9.7795,305
3.9678,-9.752,306
-0.0745,-9.9421,307
3.1677,-9.8494,308
0.1714,-9.8519,309
-2.3283,-9.6968,310
4.6698,-9.8946,311
2.6432,-9.894,313
-2.2638,-9.9748,314
5.1553,-10.107,315
5.7762,-10.0037,316
-1.0738,-9.7428,317
7.2929,-9.7886,318
1.5161,-9.8216,319
14.1163,-9.6939,320
-0.167,-9.4007,321
2.6629,-10.0989,323
3.7946,-9.92,324
-0.2983,-8.5918,325
1.5451,-10.0442,326
-0.8571,-9.768,328
2.0034,-10.1193,329
1.3768,-9.794,330
0.8085,-9.9009,331
0.4876,-9.7594,333
-0.7258,-9.805,335
4.6723,-9.3254,336
-0.9849,-9.7432,337
-0.9783,-9.8778,338
4.2758,-9.6966,339
-1.7983,-10.4135,340
3.6322,-10.0596,341
-0.5147,-9.7928,342
2.3819,-9.8608,344
-1.8339,-9.812,345
-7.2002,-9.7726,346
-7.1901,-9.6288,347
2.4441,-9.7363,348
3.0016,-9.7201,349
3.1759,-9.7889,350
0.0539,-9.8155,351
-0.7108,-9.8025,353
0.5553,-9.7894,354
0.8167,-9.8162,355
-0.2094,0.0295,432
0.6248,-9.812,433
-1.383,-9.8066,434
0.7875,-9.8087,435
-0.6614,-9.8138,436
0.3617,-9.8054,437
0.3486,-9.8092,438
-0.0973,-9.7941,439
-1.757,-9.8178,440
0.9733,-9.8087,441
0.4172,-9.816,442
-0.9537,-9.7668,443
-0.6817,-9.8142,445
-0.1343,-9.7996,446
0.0048,-9.8679,447
-1.6413,-9.8148,448
-1.5825,-9.974,449
8.4352,-9.8162,450
2.3279,-9.5716,452
2.3159,-9.8483,453
2.0699,-9.8203,454
-2.0169,-9.7422,456
-1.5192,-9.8446,457
-6.3955,-9.9287,459
3.8711,-9.7388,461
-1.8896,-9.3919,462
1.6729,-9.9937,463
1.6758,-10.0147,465
-0.7719,-9.5648,466
-8.741,-10.0236,468
9.9522,-9.8779,469
-3.2174,-10.0214,470
0.4745,-9.9985,471
17.6028,-8.2049,472
-2.4605,-10.2474,473
-2.0838,-8.7102,474
1.464,-9.5245,475
-1.2871,-9.7764,476
4.6429,-9.8062,477
2.2194,-9.6077,478
1.4301,-10.3797,479
0.7834,-9.8237,482
-1.6798,-9.9847,483
-0.624,-8.8947,484
0.6739,-9.2845,485
1.2659,-9.7722,486
-1.2445,-10.0148,487
-0.0579,-9.6915,488
-0.5139,-10.4018,489
-1.1927,-9.8779,490
-0.1776,-9.5624,491
-0.5884,-9.851,492
3.7432,-9.7861,493
1.2075,-10.1847,494
1.4248,-9.8829,495
1.3701,-9.7225,496
0.7781,-9.8017,497
-2.7502,-9.9454,498
-2.5697,-9.8889,499
6.1498,-9.723,500
1.9919,-10.3713,501
-0.516,-9.8172,503
1.2307,-9.8598,504
-1.1082,-9.8457,505
-0.6806,-9.7674,506
-0.982,-9.7821,507
-17.6816,-9.6385,508
-0.1002,-9.4603,509
0.823,-9.7963,660
-1.9983,-9.7919,661
-0.1587,-9.8091,662
0.4241,-9.8085,663
-0.3674,-9.8133,664
0.3434,-9.8135,665
0.0236,-9.8146,666
-0.069,-9.8135,667
-0.3695,-9.7997,668
0.6218,-9.7979,669
0.4635,-9.8074,670
-3.5724,-9.7495,671
-12.4078,-9.6004,672
5.3355,-9.5294,673
4.265,-9.6938,674
-5.0214,-9.7818,675
-0.5519,-9.6731,676
-18.8198,-10.1239,677
-2.8931,-9.8414,678
-0.252,-9.8198,679
6.5878,-9.7633,680
-3.0143,-9.7776,681
-0.1496,-9.7828,682
1.3455,-9.8127,683
1.6323,-9.8267,684
-1.1427,-9.7195,685
2.4066,-10.0788,686
0.8001,-9.82,687
1.1201,-9.8281,688
-1.9931,-9.8806,689
1.1178,-9.8044,690
0.4598,-9.9089,691
5.0309,-9.7815,692
2.6836,-9.9014,693
7.8754,-9.958,694
-1.4971,-10.1235,695
-7.7945,-10.4447,696
8.5865,-9.8165,697
0.8154,-9.5967,698
9.9495,-9.8023,699
0.6653,-8.9239,700
-1.4439,-9.7826,701
-0.9191,-9.7878,702
0.2083,-9.7684,703
3.1503,-9.6605,704
0.4612,-9.7932,705
-2.712,-9.7499,706
1.2003,-9.8716,707
-1.4747,-9.7986,708
4.8197,-9.8317,709
2.1308,-9.6929,710
-0.3095,-9.4013,711
-0.2712,-9.8699,712
-1.9346,-10.0549,714
0.2007,-9.8264,715
-2.5807,-10.1758,716
-0.7858,-10.1355,717
-2.1021,-9.7621,718
5.7119,-9.7566,719
1.6625,-9.8117,720
1.773,-9.8397,721
0.0012,-9.7478,722
-0.4035,-9.9185,723
0.7415,-9.7215,724
-0.9053,-9.848,725
-3.0002,-9.8682,726
-1.2311,-9.7738,727
0.9479,-9.9165,728
1.8736,-9.9189,729
0.3295,-9.8309,730
-0.0905,-9.9118,731
-0.2472,-9.9052,732
-0.2112,-9.7259,733
0.1091,-9.6006,737
3.569,-9.8053,738
0.0513,-9.7814,739
-0.6506,-9.759,740
-1.7856,-9.9049,741
-1.4406,-9.7446,742
-0.7424,-9.6374,743
-0.4785,-9.9977,744
0.1895,-9.774,745
-1.6186,-9.7217,747
-0.0713,-9.8817,748
0.4493,-9.7373,750
2.5026,-9.8244,752
1.232,-9.8067,753
-0.6465,-9.8556,754
0.8385,-9.7743,755
-2.4548,-9.8253,757
1.4295,-9.8187,758
-5.8977,-9.9611,759
0.2783,-9.4934,760
-0.3591,-9.8831,762
1.9517,-9.7191,763
0.4019,-9.9735,764
1.8651,-9.8909,765
-1.5928,-9.8313,766
2.8723,-9.7979,767
0.7836,-9.9757,768
1.1884,-10.1072,769
2.0909,-9.7118,770
0.9099,-9.8066,772
0.8241,-9.8256,773
-0.8617,-9.7012,774
3.8985,-9.6961,775
1.4397,-9.6951,777
3.5952,-9.9203,778
-1.9605,-9.9089,779
11.7044,-9.7718,780
2.4043,-9.6588,782
1.3547,-9.8199,783
-0.2047,-9.7172,784
1.562,-9.7767,785
5.9519,-9.8863,787
-1.1295,-9.8358,788
-2.8906,-9.5879,789
-0.0041,-9.7743,790
-0.1806,-9.8059,791
0.5331,-9.7776,793
0.5746,-9.885,794
5.0679,-9.8152,795
2.4992,-9.791,797
0.9176,-9.7916,798
10.6726,-10.0004,799
-1.0798,-9.7909,800
1.7007,-9.7549,802
7.3044,-9.9276,803
5.5085,-9.5319,804
2.9677,-9.7942,805
-0.0375,-9.7592,807
1.2106,-9.7648,808
3.4403,-9.7288,809
2.8251,-9.7443,810
2.3844,-9.8219,812
0.8601,-9.7487,813
-4.1562,-9.7194,814
-1.0345,-9.7309,815
0.2291,-9.7919,817
-1.6928,-9.8147,818
-1.9499,-9.9052,819
-2.4568,-9.7937,820
