AYGX_mean,AZ_mean,timestamp
0.6211,-9.8168,0
-2.0987,-9.7872,1
-1.9056,-9.7818,2
-4.9838,-9.7479,3
-8.273,-9.5161,5
-26.5874,-9.3206,6
-5.9423,-9.4022,7
-11.282,-9.7637,8
26.6398,-9.2898,9
2.272,-9.6818,10
3.2743,-9.7204,11
4.4965,-9.8125,12
-1.1824,-9.8466,13
-0.4073,-9.8314,14
-0.6141,-9.8383,15
-0.1559,-9.8297,16
-4.3445,-9.8211,17
-2.9402,-9.8033,18
-1.3092,-9.8104,19
-1.1386,-9.804,20
-1.8827,-9.8002,21
0.4423,-9.8224,22
-2.061,-9.8393,23
-2.6066,-9.8195,24
-1.6432,-9.7863,25
5.1086,-9.8065,26
-13.679,-9.7371,27
-4.3764,-9.6351,28
2.5994,-9.709,29
0.0731,-9.7449,30
-1.6945,-9.7717,31
0.869,-9.7606,32
0.4503,-9.7769,33
1.4606,-9.8123,34
-1.9127,-9.7983,35
-0.2104,-9.7989,36
-0.874,-9.7987,37
0.4021,-9.7934,38
0.432,-9.819,39
-0.6521,-9.8199,40
-0.5528,-9.8225,41
-0.9931,-9.8181,42
-0.2977,-9.8368,43
-3.2625,-9.8432,44
-0.1491,-9.8405,45
-1.3401,-9.8304,46
-0.6121,-9.7909,48
0.4373,-9.7618,49
5.0257,-9.7917,50
1.8377,-9.8527,51
1.612,-9.8443,52
1.1814,-9.941,53
0.1539,-9.9003,54
1.4776,-9.8684,55
1.5232,-9.9474,56
0.9515,-9.7796,58
0.8056,-9.8797,59
0.5754,-9.906,60
3.105,-9.5698,61
-5.388,-6.4345,62
-1.8867,-9.5608,63
0.7982,-9.9474,64
2.5604,-10.4884,65
2.3227,-9.8582,66
1.7461,-9.915,68
0.9377,-9.78,69
0.508,-9.5844,70
0.2604,-10.1689,71
0.1867,-9.7261,72
0.754,-9.5345,73
0.1659,-10.0076,74
0.1548,-9.8338,75
3.412,-9.6764,76
0.4634,-9.838,78
0.5247,-9.6406,79
1.619,-10.5896,80
5.3669,-9.7466,81
1.0665,-9.2095,82
0.5739,-9.6965,83
0.4168,-9.9125,84
0.7234,-9.8444,85
0.4238,-9.8744,86
1.5019,-9.9169,88
5.4208,-9.8672,89
11.4904,-9.9074,90
1.3809,-9.9772,91
4.4431,-9.8284,92
-0.057,-9.3237,93
-1.4613,-8.8532,94
1.5002,-9.8436,95
0.0139,-10.0591,96
0.4658,-9.8743,98
-0.0229,-9.978,99
0.2967,-9.8579,100
-8.2597,-9.7405,101
0.7519,-9.6804,102
0.8236,-9.685,104
0.6835,-9.723,105
-2.652,-9.7417,106
6.8662,-9.7951,107
-0.5308,-9.8142,109
1.0888,-9.8301,110
-0.565,-9.8108,111
-1.7781,-9.7908,112
-0.1816,-9.8251,113
2.45,-9.8265,114
0.645,-9.8707,115
0.3338,-9.8599,116
-1.1222,-9.8774,117
0.1813,-9.9155,118
-0.0064,-9.7924,119
0.4311,-9.7937,120
4.5634,-9.8448,121
-0.1375,-10.0782,122
0.4499,-9.8564,123
0.8406,-9.6097,124
0.9739,-9.8814,125
0.9669,-9.8775,126
0.2869,-9.6753,127
0.4864,-9.9346,128
1.4984,-9.7403,129
0.5562,-9.8465,130
2.3843,-9.7564,131
2.2007,-9.9095,132
21.781,-9.887,133
11.4561,-10.1342,134
0.0205,-8.8707,135
0.6229,-9.8858,136
-0.1832,-10.3739,137
2.8543,-9.9443,138
-0.6709,-9.7228,139
0.3412,-9.3829,140
0.2875,-10.0551,141
0.1565,-9.7249,142
0.8906,-9.6524,143
3.8176,-9.8653,144
0.7626,-10.0043,145
2.4049,-9.8632,146
1.0387,-9.8655,147
0.6563,-10.1019,148
5.2714,-9.7837,149
-0.1545,-11.1711,150
0.3242,-9.4034,151
0.4272,-9.7118,153
-0.6956,-9.6247,154
2.0226,-10.2756,155
-6.9526,-11.2605,156
2.684,-10.7879,157
0.9922,-9.8625,158
0.7032,-10.1181,159
-0.6271,-9.5735,160
-0.8093,-9.8157,161
1.6153,-9.7356,163
0.9943,-9.7246,164
-1.1811,-8.8131,165
-0.1697,-9.8378,166
-0.1337,-10.6613,167
0.6409,-10.1311,168
1.4403,-10.3343,169
2.2117,-10.324,170
0.0695,-10.2063,171
-0.0659,-9.871,173
0.1736,-9.8981,174
1.3181,-9.7712,175
0.3454,-9.77,176
0.4202,-9.5276,177
-0.5662,-9.6812,178
8.0682,-9.9927,179
-1.0399,-9.4563,180
4.3012,-9.4473,181
3.8365,-9.6288,183
3.3799,-9.7515,184
1.0096,-9.8293,185
-0.3432,-9.0647,186
1.3996,-10.012,187
0.5561,-9.9296,188
-0.1656,-9.8072,189
0.5126,-9.885,190
0.5675,-9.9824,191
0.0908,-9.8784,193
-0.0661,-9.8816,194
0.3607,-10.1849,195
-7.3319,-9.8058,196
-8.6471,-9.6759,198
5.8146,-9.616,199
-10.2974,-9.5508,200
-7.3273,-8.2996,201
2.9441,-10.2357,202
-1.7387,-9.908,203
1.8516,-9.8013,204
-0.7859,-9.8763,205
2.62,-9.7661,207
-12.03,-9.765,208
-4.4077,-9.7406,209
-0.7331,-9.7678,210
-0.5312,-9.7563,211
