AYGX_mean,AZ_mean,timestamp
-20.614,-9.6325,890
14.5808,-9.5991,891
-18.6369,-9.5828,892
-17.1115,-9.3421,893
24.477,-9.2241,894
8.6964,-9.6913,895
-1.1057,-9.7712,897
-3.7269,-10.2184,898
-50.1874,-9.1538,899
8.5769,-9.0523,900
13.1504,-9.6569,901
-5.7735,-9.7028,902
1.8133,-9.7437,903
-3.0383,-9.7366,904
-0.1992,-9.743,905
-1.2932,-9.7412,906
-2.7613,-9.7118,907
-0.6767,-9.7103,908
-0.3371,-9.7117,909
