AYGX_mean,AZ_mean,timestamp
-2.7905,-9.7476,0
0.8319,-9.7787,1
1.014,-9.7695,2
-1.2448,-9.8463,3
-13.3392,-9.7548,4
5.0304,-9.6968,5
0.4901,-9.7786,6
0.0104,-9.8704,7
0.1449,-9.8411,8
0.4248,-9.7886,9
2.6292,-9.8133,10
3.9015,-9.7927,11
-0.1431,-9.7446,13
3.5708,-9.8469,14
0.1311,-9.8332,15
0.9686,-9.7544,16
1.0543,-9.8096,17
1.0809,-9.7834,18
1.0053,-9.6188,19
-0.2924,-9.8127,20
-0.1007,-9.8077,21
0.5555,-9.8829,22
0.1392,-9.6278,23
0.0946,-9.8545,24
0.1811,-9.8528,25
-0.1044,-9.755,26
-0.9711,-9.7987,27
1.0513,-9.8167,28
0.0355,-9.8117,29
0.5233,-9.8186,30
0.2922,-9.818,31
0.2683,-9.8153,32
0.4577,-9.8105,33
-0.6112,-9.8134,34
-0.0681,-9.8202,35
-1.2902,-9.8022,36
1.6626,-9.7481,37
-0.149,-9.8064,38
0.8129,-9.8373,39
-1.5598,-9.9667,40
8.0754,-9.7533,41
11.7797,-9.8201,42
-0.1556,-10.0538,43
0.307,-10.2101,44
0.3304,-9.9522,45
3.1031,-9.772,46
2.8062,-9.749,47
0.536,-9.9101,48
0.3896,-9.8524,49
1.2286,-9.7443,50
5.9526,-9.8213,51
-0.1277,-9.7651,52
1.7216,-9.8489,53
-0.4605,-9.9875,54
0.3131,-9.7835,55
0.1436,-9.9117,56
0.3417,-9.8123,57
0.6778,-9.7243,58
0.0908,-9.7174,59
-0.0984,-10.0659,60
0.1687,-9.7777,61
0.0614,-9.6967,62
0.9543,-9.9095,63
1.4675,-9.8971,65
0.0452,-9.6355,66
1.2762,-9.8214,67
-0.094,-9.9244,68
-0.0508,-9.7153,69
0.3242,-9.8683,70
0.3588,-9.964,71
4.3922,-9.8114,72
3.1932,-10.0569,73
1.1133,-9.8148,74
-0.3386,-9.8861,75
1.3536,-9.7933,76
1.2292,-9.8409,77
0.5379,-9.8425,78
0.1349,-9.7856,79
1.1041,-9.7724,80
-0.0017,-9.7583,81
0.3734,-9.8006,82
1.8814,-9.7992,83
0.0304,-9.6486,84
2.6707,-9.6212,85
2.0492,-9.8773,86
0.2081,-9.8358,87
0.3901,-9.7924,88
0.732,-9.8457,89
0.593,-9.8101,90
0.641,-9.9116,91
3.4773,-9.7319,92
9.2811,-9.747,93
0.7619,-9.8852,94
-0.2475,-9.475,95
0.1352,-9.8281,96
0.2163,-9.8422,97
0.5454,-9.88,98
0.248,-9.8883,99
0.0687,-9.7988,100
0.6398,-9.8506,101
0.6866,-9.7297,102
2.5409,-9.8057,103
3.3277,-9.8369,104
0.4492,-9.5856,105
0.3497,-9.8854,106
2.0169,-9.7006,107
0.4521,-9.8307,108
0.0426,-9.8416,109
0.5928,-9.8966,110
-0.2227,-9.9451,111
0.0175,-9.9302,112
0.2696,-9.9579,113
0.902,-10.0074,115
0.9592,-9.7845,116
0.2085,-9.9355,117
0.3441,-10.1241,118
-0.8455,-9.2706,119
1.9952,-10.124,120
-1.0529,-9.6967,121
-0.9296,-9.6509,122
-0.792,-9.9213,123
1.5958,-9.6088,124
1.5086,-9.9165,125
-0.0783,-9.7199,126
1.2558,-9.8251,127
-0.4843,-9.8927,128
0.5688,-9.7622,129
-1.1805,-9.9566,130
-0.3718,-9.8484,131
3.9759,-9.9201,132
0.3597,-9.6406,133
1.2881,-9.6691,134
0.1444,-9.7985,135
-0.6091,-9.7706,136
12.092,-9.8195,137
2.1555,-9.859,138
2.0842,-10.0071,139
-0.3204,-10.0195,140
-0.5017,-9.8104,141
2.8398,-9.5123,142
-1.1925,-9.7678,143
1.7873,-9.8479,144
0.9402,-9.721,145
0.1732,-9.8358,146
-0.021,-9.843,147
0.556,-9.8497,148
0.8044,-9.8441,149
0.1075,-9.7572,150
1.004,-9.435,151
-0.064,-9.7167,152
1.841,-9.8545,153
-0.0126,-9.7866,156
0.0648,-10.0,157
1.0217,-9.5126,158
0.0567,-9.7218,159
-0.1592,-9.6885,160
0.2511,-10.0393,161
0.2,-9.8101,162
-0.7523,-9.2221,163
-2.0438,-9.8959,164
2.3774,-9.8933,165
0.6144,-9.8057,167
-2.3037,-9.6475,168
1.9375,-9.8062,169
2.8997,-9.8757,170
0.1097,-10.1892,171
5.0122,-9.8578,172
2.6122,-10.0867,173
0.3187,-9.7719,174
0.2948,-9.6181,175
-0.4454,-9.7899,176
1.263,-9.8316,177
0.0984,-9.926,178
1.3929,-9.8318,179
0.2605,-9.8933,180
0.1236,-9.6916,181
0.1319,-10.1213,182
1.8465,-9.9282,183
2.2495,-9.5159,184
-0.0787,-9.9927,185
0.9543,-9.7146,186
-0.2076,-9.6584,187
-0.0698,-10.0735,188
0.0136,-9.812,189
0.1721,-10.2538,190
-0.1764,-9.7184,191
0.8152,-9.8004,192
0.3106,-9.6708,193
0.0558,-9.474,194
2.0614,-9.7662,195
-0.0503,-9.8615,196
0.4243,-9.7365,197
1.2745,-9.8662,198
1.0856,-9.8922,199
5.7187,-9.7401,200
0.6212,-9.7803,201
0.0992,-9.8025,202
0.1978,-9.8392,204
0.4256,-9.8226,205
0.9231,-9.5322,206
0.2726,-9.8434,207
0.1697,-10.0039,208
-0.1295,-9.8306,209
-0.1511,-9.6913,210
2.2852,-10.0736,211
2.8742,-9.9506,213
-0.0476,-9.8136,214
-0.3409,-9.8763,215
1.3965,-9.7406,217
0.528,-9.8706,218
-0.1781,-9.6048,219
2.3578,-10.0845,220
0.9878,-9.9648,221
-0.4272,-9.932,222
-2.2741,-10.0002,223
2.6544,-9.9207,224
-1.0302,-10.0732,225
5.0389,-9.87,226
-0.2226,-9.5882,227
0.4148,-10.1548,228
-0.2107,-9.345,229
0.189,-9.2451,230
-0.8495,-9.0902,231
0.2293,-9.7497,232
0.6904,-8.5671,233
2.038,-8.427,234
0.9285,-10.4902,235
0.5821,-8.7059,236
0.0335,-9.7819,237
1.5573,-9.9593,238
0.5318,-9.3376,239
0.3258,-10.4079,240
-1.1803,-9.5723,241
3.9998,-9.9109,242
1.6517,-9.5401,243
0.5821,-9.8924,244
-1.3605,-8.6779,245
0.9563,-8.489,246
2.8511,-10.1418,247
0.2237,-8.7836,248
2.9515,-9.3199,249
-0.5948,-9.7607,250
0.9118,-9.4897,251
0.0326,-10.2652,252
-0.2271,-8.5637,253
-0.5036,-9.713,254
-1.7047,-9.8596,255
0.1318,-9.5492,256
3.6924,-9.846,257
0.1808,-9.8159,258
0.9462,-11.2509,259
1.837,-9.9347,260
1.2147,-9.7911,261
2.3831,-9.9358,262
0.9007,-9.7801,263
-0.0602,-9.9384,264
0.1973,-9.7964,265
0.2248,-9.827,267
0.0291,-10.0908,268
1.4248,-9.8406,269
-0.3502,-9.8434,270
3.6156,-9.8138,271
0.0091,-9.8053,272
0.0613,-9.9082,273
1.2358,-9.8027,274
0.3124,-9.8044,275
-0.3322,-9.882,276
-0.1892,-9.59,277
4.1377,-9.848,278
0.034,-9.8795,279
2.6287,-10.0708,280
-0.086,-9.7505,281
0.2224,-9.8324,282
0.3558,-9.8403,283
0.8021,-9.8541,284
5.2379,-9.9364,285
1.9908,-10.0526,286
-0.5606,-9.8544,287
1.4323,-10.1288,288
-0.1951,-9.9405,289
-0.179,-9.7823,290
0.0265,-9.8732,291
-0.2995,-9.8159,292
0.8275,-9.8094,293
2.4687,-9.8272,294
3.9776,-10.0989,295
1.1213,-10.062,296
10.503,-9.706,297
-1.6925,-10.1461,298
0.8736,-9.8897,299
0.8629,-9.97,300
1.7806,-9.9062,301
0.1359,-10.0288,302
4.533,-10.4815,303
-0.1126,-9.8534,304
-0.4132,-10.1962,305
36.4051,-9.6867,306
35.3165,-9.3624,307
0.1377,-9.7801,308
4.4244,-9.4006,309
0.2007,-9.8633,310
0.463,-9.9403,311
-0.6162,-9.8058,312
-2.2556,-9.842,313
2.2021,-9.7414,314
0.2519,-9.8204,315
-2.6601,-9.3325,316
-2.8868,-9.8878,317
0.6445,-9.7718,319
0.5497,-9.7631,320
0.5732,-9.7659,321
0.5275,-9.7657,322
0.5469,-9.7665,323
0.5936,-9.768,5758
0.7234,-9.7756,5759
9.852,-9.652,5760
-0.1511,-9.7574,5761
-8.7717,-9.7196,5762
6.1423,-9.7279,5763
10.1608,-9.8336,5764
-17.3045,-9.4748,5765
24.384,-9.5616,5766
2.1289,-9.7933,5767
0.8819,-9.8418,5768
-0.1341,-9.8196,5769
0.0515,-9.8308,5770
0.3712,-9.7001,5771
-0.6093,-9.9399,5772
7.2826,-9.8171,5773
2.6151,-10.1131,5775
1.2531,-9.8298,5777
-0.0698,-9.7208,5778
0.1033,-10.1783,5779
0.2929,-9.9768,5780
0.759,-9.6952,5781
-0.2281,-9.7488,5782
-0.1546,-9.9045,5783
4.8115,-10.2901,5784
-0.2901,-10.6514,5785
3.9144,-9.7479,5786
0.4385,-9.9239,5787
2.7141,-9.7713,5788
7.3451,-9.7909,5789
0.503,-10.1628,5790
0.9531,-10.2203,5791
4.6637,-9.852,5792
-0.8899,-9.8888,5793
2.2173,-9.9565,5794
-0.5611,-9.7882,5795
0.358,-9.8839,5796
-0.1972,-9.7452,5797
3.9606,-9.7759,5798
5.5557,-9.865,5799
0.2239,-9.6401,5800
1.1333,-9.696,5801
-0.1216,-9.7601,5802
0.4971,-9.7698,5803
-0.0769,-9.7346,5804
-0.1491,-9.8697,5805
0.241,-9.7637,5806
-0.2679,-9.8017,5807
0.0498,-9.7707,5808
0.0001,-9.692,5809
-0.2304,-9.836,5810
0.0374,-9.8489,5811
0.2098,-9.8118,5812
0.1386,-9.8362,5813
-0.0552,-9.8136,5814
1.5552,-9.7987,5815
2.9667,-9.9075,5816
4.5157,-9.8052,5817
0.3413,-10.0747,5818
-0.6954,-9.9403,5819
1.6543,-9.9957,5820
0.6464,-9.8083,5821
-0.4371,-9.9588,5822
-0.0958,-9.8398,5823
0.3497,-10.0427,5824
1.2895,-9.7578,5825
1.0363,-9.8641,5826
1.2998,-9.8222,5828
0.5881,-10.2052,5829
-0.0569,-9.6848,5830
1.5579,-9.858,5831
0.7591,-10.0824,5832
0.9409,-9.9494,5833
2.6098,-9.8078,5834
0.0377,-9.9104,5835
-0.024,-9.7307,5836
0.1742,-9.8226,5838
0.7334,-10.0268,5840
2.8327,-9.9707,5841
0.452,-10.1652,5842
6.565,-9.4226,5843
3.3531,-9.9786,5844
5.323,-9.8379,5845
0.3383,-9.8165,5846
2.6589,-9.8617,5847
8.8988,-9.4185,5848
1.0906,-9.4734,5849
2.6315,-9.3411,5850
2.2135,-9.7983,5851
-0.123,-9.8785,5852
0.9038,-9.8048,5853
2.9101,-9.8261,5854
7.5176,-9.8276,5855
0.6576,-9.8348,5856
-0.2423,-9.7892,5857
-1.2907,-9.7845,5858
0.6746,-9.8322,5859
0.5405,-9.831,5860
0.0824,-9.834,5861
0.0296,-9.8337,5862
0.1208,-9.8318,5863
0.29,-9.8315,5864
0.1025,-9.8319,5865
0.1005,-9.832,5866
0.1526,-9.8304,5867
0.1211,-9.8338,5868
0.0733,-9.8328,5869
0.0544,-9.8328,5870
