AYGX_mean,AZ_mean,timestamp
1.3113,-9.73,185
4.4769,-9.7684,186
0.8302,-9.8566,187
1.7206,-10.0,188
1.6212,-9.9755,189
0.8849,-9.7734,190
1.006,-9.8103,191
5.6429,-9.5528,193
-3.2105,-9.798,194
-184.2471,-8.3703,195
33.9326,-9.2986,196
12.2426,-9.6969,197
7.7089,-9.7151,198
-2.7752,-9.755,199
-2.7898,-9.7359,200
-2.5973,-9.7749,201
-4.8367,-9.7212,203
-46.5257,-9.3011,204
68.5371,-9.0101,205
