AYGX_mean,AZ_mean,timestamp
0.3681,-10.0115,1492
-1.2348,-10.02,1493
-11.513,-9.891,1494
-8.0849,-9.9217,1495
9.4625,-10.0363,1496
0.7747,-9.9391,1497
0.8653,-10.0974,1498
-28.7191,-9.6702,1499
9.9595,-9.5797,1500
-0.3539,-9.8708,1501
42.8831,-9.6839,1502
5.6876,-9.9531,1503
4.5779,-10.0771,1504
0.7998,-10.0109,1506
-0.2182,-9.8893,1507
0.948,-9.9339,1508
0.9806,-10.1074,1509
0.8349,-8.9475,1510
-0.2021,-10.1863,1511
0.1846,-9.7341,1512
