AYGX_mean,AZ_mean,timestamp
-0.8295,-9.7603,0
4.8355,-9.7804,1
1.1703,-9.821,2
1.0327,-9.785,3
0.1116,-9.8809,4
-7.3489,-9.6616,5
-0.2574,-9.8132,6
2.8368,-9.8581,7
-3.0758,-9.9022,8
1.4521,-9.7582,9
1.1576,-9.8254,11
4.4678,-9.6962,12
0.4027,-9.8577,13
0.3073,-9.9929,14
-0.2158,-9.8438,15
0.6756,-9.7889,16
2.3583,-9.5055,17
-0.1787,-9.6956,18
2.5142,-9.8091,19
-0.3433,-9.7977,20
3.0056,-9.8056,21
1.6572,-9.757,22
1.5835,-9.7562,23
-2.816,-9.6226,24
-0.0929,-9.76,25
0.3422,-9.8309,26
0.2991,-9.7924,27
-0.6231,-9.7385,28
-0.6691,-9.8498,29
0.5928,-10.0084,30
3.3444,-10.0591,31
0.6951,-9.7502,32
1.1357,-9.8662,33
-10.6792,-9.9459,34
-2.1345,-9.618,35
3.806,-9.5761,36
1.1647,-9.8129,37
0.5523,-9.7677,38
1.4534,-9.8719,39
-0.0277,-9.8565,40
0.2313,-9.74,41
2.5012,-10.1062,42
2.6306,-9.8535,43
-0.7754,-9.7974,44
3.7792,-9.337,45
-7.7401,-10.0579,46
-1.7431,-9.6344,47
-3.1376,-9.9317,48
-2.2889,-9.9663,49
0.1938,-9.7183,50
-0.5947,-9.5109,51
-4.5807,-9.8494,52
-2.8663,-9.7749,53
-3.1974,-9.7028,54
9.1934,-9.5975,55
-1.0298,-10.119,56
0.385,-9.6453,57
7.9949,-9.8472,58
-14.3042,-9.9187,59
-1.4733,-9.9991,60
1.6065,-10.2923,61
0.2263,-10.0885,62
-0.1537,-10.0072,63
3.8249,-9.6668,64
6.7421,-10.0076,65
-0.5427,-10.1138,66
13.5625,-10.1794,67
2.7542,-9.7206,68
-1.0636,-9.8359,69
0.3283,-9.8699,70
3.1204,-9.782,71
-1.5511,-10.0584,72
-2.3329,-9.7944,74
0.7084,-9.8402,75
-0.6487,-9.8168,76
-0.1294,-10.3376,77
-0.2897,-9.501,78
2.0712,-9.6899,79
0.6066,-9.4204,80
-1.6981,-9.7709,81
-0.1051,-9.7626,82
1.103,-9.8788,83
0.2734,-8.937,84
0.402,-9.722,85
-0.9458,-9.7764,86
8.4574,-10.1231,87
5.9552,-9.6711,88
1.5823,-9.8175,89
1.039,-9.7931,90
1.2604,-9.8074,91
0.1251,-10.3352,92
1.244,-9.8249,93
-3.1741,-9.8313,94
-0.1226,-9.8577,95
15.1745,-9.7304,96
-1.8849,-10.22,97
-2.0,-9.8563,98
-1.617,-9.8279,99
-1.1353,-10.0779,100
2.1815,-9.0252,101
0.5549,-9.851,102
3.654,-9.7359,103
-0.3488,-9.8074,104
-0.1121,-9.9663,105
1.4734,-9.2349,106
2.4273,-9.8238,107
12.535,-10.044,108
0.318,-9.7925,109
7.3529,-9.7463,110
-0.3507,-9.8478,111
0.0568,-9.8058,112
-0.9979,-9.825,113
-10.4973,-9.5976,114
8.4264,-9.7752,115
-12.2907,-9.7064,116
3.6284,-9.8128,117
2.6936,-9.7677,118
-0.6758,-9.8163,119
-4.7818,-9.7844,120
-3.7103,-9.6882,121
