AYGX_mean,AZ_mean,timestamp
-0.5677,-9.5253,0
-0.4992,-9.5243,1
-0.2576,-9.5223,2
6.8199,-9.5717,3
1.8145,-9.7134,4
-3.3041,-9.6609,5
0.5469,-9.6456,6
3.2277,-9.665,7
-19.3541,-10.1017,8
-116.4756,-7.5965,9
-15.1884,-8.2643,10
-23.698,-8.8112,11
1.7155,-9.5803,12
0.2347,-9.7288,14
2.1448,-9.7354,15
-0.1648,-9.6378,16
0.3727,-9.7328,17
8.1226,-9.4899,18
38.1757,-9.8266,19
1.2645,-9.7679,20
-0.6448,-9.5369,21
1.0411,-9.797,23
0.6926,-9.574,24
0.5377,-9.7743,25
2.1359,-10.1289,26
0.6827,-9.2394,27
0.6627,-9.9064,28
-0.1829,-10.1165,29
1.2235,-9.8988,30
-0.6676,-9.672,31
-1.4925,-9.7216,33
2.7163,-9.6993,34
0.5411,-9.6568,35
5.4669,-9.7581,36
13.0817,-9.5084,37
9.9902,-9.4914,38
-0.6983,-9.9675,39
1.8077,-9.8801,40
4.7562,-7.8427,41
0.6615,-9.8181,43
3.0235,-9.7832,44
0.3794,-9.6566,45
5.2936,-9.8378,46
-4.8991,-9.782,47
3.0927,-9.743,49
0.3877,-9.74,50
-0.1297,-9.741,51
-0.0201,-9.8236,52
-0.9314,-9.7578,53
0.2494,-9.7671,54
-0.1676,-9.7662,55
-0.0429,-9.7666,56
-0.2449,-9.7579,57
0.129,-9.767,58
-0.0755,-9.761,59
0.131,-9.8123,60
4.0966,-9.8917,61
7.4022,-9.7053,62
0.1982,-9.4318,63
-3.0612,-9.6851,64
-1.1724,-9.7661,65
16.9305,-9.719,66
-0.1084,-9.6953,68
2.2729,-9.7975,69
3.355,-9.6925,70
1.2429,-9.8193,71
1.9235,-9.6547,72
2.027,-9.6705,74
1.0051,-9.7411,75
-0.1131,-9.7798,76
3.148,-9.7761,78
0.8453,-9.6759,79
7.3214,-9.4718,80
-1.1135,-8.1691,81
14.4607,-9.6909,82
2.6858,-9.6521,83
5.8269,-9.6628,84
0.9714,-8.8627,85
-1.144,-9.7662,86
4.6129,-9.756,88
1.6241,-9.6481,89
14.4439,-8.9073,90
-2.8246,-9.8511,91
-3.0199,-9.9244,92
-0.1116,-9.71,93
-5.1229,-9.7188,94
-3.2223,-9.7652,95
-1.6782,-8.9595,96
1.1616,-9.6224,98
0.1695,-9.3314,99
-0.3897,-8.6752,100
1.5886,-10.0503,101
-0.5465,-10.2398,102
4.4308,-9.8524,103
2.8721,-8.8411,104
0.2053,-9.8453,105
-0.0099,-9.5234,106
3.809,-9.7922,108
0.289,-9.4932,110
11.704,-9.8326,111
23.9421,-9.6468,112
0.5084,-9.808,113
0.088,-9.7032,114
-0.0134,-9.1778,115
-0.4607,-9.8296,116
14.0124,-9.6628,117
26.5174,-10.244,118
8.6976,-9.7698,119
2.6887,-9.6894,120
0.2738,-9.6936,121
0.9316,-9.8505,122
0.1324,-9.8286,124
1.0006,-9.7433,125
0.2196,-9.6836,126
4.2358,-9.7503,128
5.1652,-9.7567,129
0.2082,-9.7941,130
5.7977,-9.7495,131
-0.9617,-9.8694,132
-0.8785,-9.8044,133
-1.1249,-10.0164,134
0.55,-9.9128,135
2.4901,-9.676,136
4.8479,-9.7854,138
2.827,-9.1958,139
-1.2036,-9.6655,140
3.6623,-9.8111,141
0.0873,-9.7596,142
1.7272,-9.7364,143
0.3203,-9.8308,144
3.3693,-10.0014,145
3.0796,-9.5979,146
0.5719,-9.6576,148
-0.0564,-9.6405,149
0.7275,-9.4879,150
1.8593,-10.1132,151
-0.1246,-9.7499,152
0.4806,-9.5299,153
0.3604,-9.7984,154
2.2031,-9.9124,155
0.9492,-9.8291,156
1.5133,-9.7657,158
9.2809,-9.6703,159
2.7322,-3.9276,160
0.4222,-9.9628,161
0.1335,-9.7666,162
0.8651,-9.7929,163
3.5111,-10.0202,164
1.1176,-9.7911,165
0.4244,-9.8934,166
1.6188,-9.7499,168
13.3215,-9.9742,169
22.3027,-9.9636,171
11.1091,-9.66,172
6.1337,-9.4347,173
4.0782,-10.0041,174
2.7834,-9.9352,175
2.0935,-9.8003,176
-0.7984,-9.811,177
1.7676,-9.8574,178
10.1408,-9.5001,179
-0.5025,-9.8329,180
-0.0093,-9.6959,181
10.0939,-9.7186,182
-0.3257,-9.7695,183
-0.2044,-9.6164,184
2.7739,-9.071,185
0.1722,-9.3267,186
0.4739,-9.113,188
-0.2802,-10.1041,189
5.1802,-9.1802,190
0.7239,-9.7554,191
6.4872,-9.3365,192
8.0494,-9.8625,193
-0.3378,-7.3777,194
2.4987,-9.2063,195
1.5535,-9.8221,196
1.215,-8.2631,198
0.1847,-9.2893,199
0.0494,-9.4891,200
0.6032,-8.978,201
-1.0411,-9.8165,202
0.7859,-9.6154,203
7.7784,-9.5181,204
1.8982,-9.5409,205
2.4499,-8.8702,206
6.7305,-9.6802,208
7.1617,-10.1509,209
7.4882,-10.0412,210
-0.1063,-9.5433,211
0.8836,-10.4203,212
2.8166,-9.4673,213
-0.3388,-7.1681,214
0.159,-7.8864,215
-0.2001,-8.9863,216
1.6216,-9.5054,218
-1.2987,-9.9269,219
2.8617,-9.5824,225
3.2972,-9.6724,227
-1.0689,-9.7055,228
-0.4706,-9.7117,229
-0.5296,-9.6985,230
6.7525,-9.6735,232
2.2199,-9.684,233
-2.7059,-9.5481,234
-0.2906,-9.587,235
-0.4653,-9.5661,236
-0.8176,-9.5672,237
-0.5592,-9.5735,238
-0.3415,-9.5699,239
-0.4242,-9.57,240
-0.4398,-9.5699,241
-0.433,-9.5699,242
-0.427,-9.5698,243
-0.4217,-9.5704,244
-0.4357,-9.5697,245
-0.4368,-9.571,246
-0.4331,-9.5713,247
-0.4408,-9.5701,248
-0.4242,-9.5704,249
-0.4255,-9.5699,250
-0.4323,-9.57,251
-0.4385,-9.5713,252
-0.4408,-9.5699,253
-0.4348,-9.5704,254
-0.4371,-9.5705,255
-0.4334,-9.5704,256
-0.4379,-9.5702,257
-0.4472,-9.5714,258
-0.4361,-9.5696,259
-0.4104,-9.5709,260
-0.4157,-9.5634,261
-9.0013,-9.5899,262
2.3932,-9.6299,263
13.8049,-9.5377,264
-82.2951,-8.3879,265
-11.3807,-9.5274,266
-1.361,-9.3797,267
1.8801,-9.7147,268
-1.7833,-9.7495,269
-0.5683,-9.724,270
0.0152,-9.746,271
0.0545,-9.7467,273
-0.5602,-9.6855,274
-0.0824,-9.7808,275
0.3278,-9.6924,276
-0.0235,-9.7493,277
-0.2816,-9.7538,278
0.1198,-9.741,279
