AYGX_mean,AZ_mean,timestamp
15.9952,-10.0971,1326
3.5076,-9.9009,1327
0.6387,-9.972,1328
-0.5124,-9.9505,1329
4.2711,-9.8239,1330
-0.6302,-7.8075,1332
6.0319,-9.8428,1334
7.6282,-9.7743,1335
67.6139,-9.5411,1336
6.3872,-9.9722,1337
0.5516,-9.6998,1338
5.8433,-9.6733,1339
0.0316,-9.7355,1340
1.7576,-9.7295,1342
1.7095,-9.7931,1343
2.0038,-9.7434,1344
0.9337,-9.8103,1345
0.2525,-9.5258,1346
