AYGX_mean,AZ_mean,timestamp
-0.3293,-9.8733,1
-0.332,-9.8738,2
-0.3317,-9.872,3
-0.3322,-9.8728,4
-0.3321,-9.8728,5
-0.327,-9.873,7
-0.3298,-9.8728,8
-0.3293,-9.8725,9
-0.3305,-9.8736,10
-0.0762,-9.8913,11
-0.4422,-9.8875,12
0.0028,-9.8453,14
-0.4376,-9.8762,15
-0.2926,-9.8445,16
-0.358,-9.8433,17
-0.3142,-9.8634,18
0.1554,-9.8689,19
-0.4054,-9.8788,20
-0.3631,-9.872,21
-0.3803,-9.8629,22
-0.3595,-9.8683,23
2.5666,-9.7173,24
0.9572,-9.6969,25
-1.1822,-9.8719,27
-0.1626,-9.8514,28
-48.6004,-9.6887,29
6.4091,-9.5557,30
22.4982,-9.6338,31
-20.501,-9.9466,32
3.2845,-9.9099,34
1.1704,-9.9541,35
1.0664,-9.9888,36
-0.3245,-9.9415,37
0.2564,-9.8671,38
-0.8666,-9.8864,39
2.7311,-10.0072,40
-2.7788,-9.9883,41
33.1541,-9.851,42
5.6724,-9.8296,44
0.2556,-10.1894,45
4.3984,-9.7092,46
4.3561,-9.9899,47
2.0423,-9.9462,48
1.0946,-10.0581,49
-9.2089,-10.0945,50
1.1328,-9.8316,51
2.7713,-9.973,52
1.5994,-9.7688,54
12.9817,-10.0727,55
7.1949,-9.9786,56
56.7113,-9.6427,57
-0.5496,-9.9588,58
1.1185,-9.8925,59
3.8354,-9.9539,60
0.3017,-9.9517,61
1.8444,-9.9408,62
0.6481,-9.8746,63
-2.0374,-9.9738,64
8.859,-10.1428,65
4.9502,-10.2086,66
2.2823,-10.19,67
-0.6834,-9.8434,68
2.4285,-10.0852,69
-2.2836,-9.9827,70
1.5717,-9.8321,71
3.906,-11.0081,72
40.9064,-9.8376,74
-3.1771,-9.935,75
-0.0225,-9.8238,76
2.592,-9.7766,77
-0.2936,-9.8311,78
5.1141,-9.9196,79
1.4152,-9.9568,80
1.6515,-9.922,81
0.4652,-9.9522,82
24.757,-9.8857,84
0.5966,-9.8953,85
-1.3852,-9.9914,86
25.7604,-9.4241,87
14.8623,-10.8699,88
-1.4279,-9.8576,89
-4.6459,-9.8389,90
1.8302,-9.9066,91
0.8417,-9.8892,92
0.6513,-9.8997,94
4.5515,-9.9597,95
4.6901,-9.8706,96
7.687,-9.9028,97
5.6688,-9.8961,98
3.7767,-9.7354,99
5.3405,-9.8941,100
0.8801,-9.8451,101
0.8558,-9.9789,102
-3.0468,-10.1088,104
-1.8383,-9.932,105
8.6307,-9.8649,106
5.2245,-10.2731,107
-4.3569,-9.3492,108
-2.1109,-9.9,109
0.1607,-9.7664,110
-4.3357,-9.9917,111
2.8536,-9.8383,112
-0.0143,-9.9077,113
3.7798,-10.0362,114
3.9753,-9.9133,115
3.5666,-9.6318,116
-0.4249,-3.9841,117
0.8933,-9.98,118
0.3339,-9.9892,119
1.3745,-9.7082,120
2.7174,-9.688,121
1.4575,-9.9423,122
0.1897,-9.6509,123
0.5419,-9.9194,124
2.3357,-9.9261,125
4.6817,-9.9068,126
5.941,-10.2314,127
140.0234,-9.4948,128
44.4874,-10.2303,129
1.9709,-10.0044,130
1.5131,-9.6839,131
1.7834,-9.8858,132
-3.7019,-9.6829,133
2.9263,-9.868,134
3.5547,-9.919,135
-2.2167,-9.9385,136
36.3515,-10.0736,137
7.804,-9.7939,138
8.1238,-9.9072,139
5.9313,-9.7023,140
2.6961,-9.9704,141
3.6005,-9.8769,142
-4.6471,-9.8092,143
0.7757,-9.7316,144
1.3795,-9.8927,145
4.0285,-10.0517,146
-7.6171,-9.8658,147
0.9622,-9.9233,148
-0.4359,-9.9283,149
5.8481,-10.3123,150
13.186,-9.8152,151
2.5508,-9.8292,152
1.5936,-10.0733,153
4.1623,-9.8771,154
6.2699,-9.884,155
2.1201,-10.0308,156
1.6591,-9.9452,157
-2.077,-9.8069,158
-2.3872,-9.8616,159
4.9079,-9.9153,160
-11.7061,-9.7694,161
2.2699,-9.4711,162
-1.695,-10.121,163
0.1631,-9.8979,164
2.1097,-9.8974,165
-0.321,-9.7941,166
2.1422,-9.9597,167
6.7723,-9.9595,168
0.8628,-9.8278,169
-0.0734,-9.8956,170
3.1764,-9.7769,171
0.599,-6.6381,172
6.5768,-9.7779,174
-1.0058,-9.8115,175
0.6037,-9.8121,176
3.2417,-10.0902,177
1.0832,-9.8995,178
3.0842,-9.7933,179
-0.4488,-9.6984,180
7.1335,-10.0767,181
-1.5535,-9.7741,182
-0.4009,-9.8325,184
-9.9762,-9.906,185
-111.9233,-10.2474,186
26.7744,-9.0152,187
2.8289,-9.2885,188
-0.1505,-10.1251,189
3.7202,-10.3029,190
9.4119,-10.1845,191
3.2959,-10.01,192
6.9479,-9.9493,194
8.9884,-7.7054,195
-5.5828,-7.116,196
5.1849,-9.8878,197
0.2913,-9.7811,198
-1.4216,-10.1801,199
2.5363,-9.877,200
-1.0841,-10.0446,201
-3.9266,-9.4845,202
2.2756,-9.8708,204
2.5449,-9.848,205
1.8765,-9.9652,206
1.6999,-10.1797,207
-1.5687,-11.2143,208
0.731,-9.0872,209
1.1594,-9.8582,210
4.6696,-9.8329,211
4.4154,-10.1642,212
1.9329,-9.9712,214
18.8125,-9.9909,215
167.2256,-8.921,216
-9.7959,-10.0497,217
69.4344,-9.5185,218
57.5184,-9.3771,219
0.3865,-9.7721,220
0.0584,-7.6881,221
-1.3324,-7.2113,222
86.7701,-10.0817,224
1.7712,-9.8796,225
7.2168,-9.9656,226
-1.1249,-9.8783,227
-1.3165,-9.9962,228
71.9158,-9.7097,229
93.1086,-9.8627,230
17.5089,-9.8545,231
3.2076,-9.7285,232
-0.0198,-10.0912,234
-5.2313,-9.9458,235
-2.3966,-9.905,236
-1.728,-9.7709,237
3.8298,-9.7761,238
9.765,-9.9033,239
-1.4321,-9.7478,240
20.9104,-9.9719,241
0.1645,-9.7061,242
-3.0038,-9.8808,244
8.2697,-9.2115,245
-0.1578,-9.1152,246
-4.9048,-10.1175,247
-1.5508,-10.1743,248
-7.8083,-10.0014,249
1.0145,-9.1207,250
1.6515,-9.805,251
-1.6867,-9.8089,252
3.4829,-9.5586,254
6.1046,-9.9281,255
1.748,-10.196,256
-3.6337,-10.0746,257
3.329,-9.5917,258
8.7054,-9.2511,259
6.7449,-10.0668,260
4.5062,-10.0378,261
0.4441,-10.3223,262
4.4891,-9.7257,264
1.0597,-9.4691,265
-0.1614,-10.0155,266
1.4271,-9.775,267
16.7475,-10.1467,268
8.4334,-9.995,269
29.6928,-9.5122,270
-0.0608,-9.8454,271
-0.3929,-9.9589,272
1.7864,-10.0543,274
1.9125,-10.0205,275
1.3407,-9.7103,276
1.3516,-9.764,277
48.6775,-10.1609,278
4.6336,-10.1392,279
11.4408,-9.4889,280
0.0323,-9.9611,282
2.0409,-9.1156,283
6.8363,-10.0074,284
5.1356,-9.6618,285
0.0865,-9.9227,286
6.18,-9.7687,287
1.4834,-9.7726,288
0.1959,-9.7652,289
0.2479,-10.2324,290
0.1868,-10.1244,291
1.8371,-9.8258,292
7.9555,-9.9598,293
14.4959,-10.3326,294
5.6717,-9.846,295
4.6427,-9.9583,296
3.2701,-10.0875,297
1.0019,-9.8901,298
0.0876,-10.0542,299
4.9349,-9.9255,300
-8.0329,-9.9274,301
8.5112,-9.8873,302
-5.2251,-9.8879,303
-0.4559,-9.5762,304
2.0214,-9.9291,305
5.6715,-9.8802,306
6.7441,-9.9858,307
3.2975,-10.0928,308
8.2833,-9.6253,309
5.5407,-9.9958,310
0.5594,-10.0239,311
5.5784,-9.9794,312
-0.7249,-10.1493,313
3.0174,-9.3656,314
-0.2969,-9.5761,315
-3.2,-10.0897,316
4.7646,-9.8973,317
3.4274,-10.0098,318
13.4574,-10.4688,319
-3.2019,-11.2142,320
14.4057,-9.0452,321
13.363,-8.0687,322
3.8223,-9.9097,323
-0.4656,-9.9566,324
2.7442,-9.8119,325
2.2189,-9.9056,326
9.2357,-10.0256,327
2.7691,-9.978,328
0.5341,-9.5998,329
-1.5918,-10.0696,330
2.131,-10.1677,331
-0.9624,-9.9968,332
-0.5868,-9.617,333
-0.2281,-9.741,334
0.7462,-9.966,335
0.5369,-9.9821,336
0.3936,-9.1649,337
0.1081,-10.0596,338
0.656,-10.2083,339
0.3285,-9.235,340
0.014,-9.9767,341
0.4673,-9.9629,342
0.9559,-10.0838,343
6.2871,-10.002,344
0.6614,-9.6746,345
6.3114,-10.2709,346
3.6631,-9.8146,347
7.663,-10.1224,348
0.3688,-9.9493,349
0.1045,-10.1119,350
0.5764,-9.9087,351
3.5752,-10.0945,352
10.5043,-9.6568,354
0.2813,-9.8778,355
3.3783,-10.0516,356
-0.0609,-9.941,357
-0.1226,-9.9872,358
2.7592,-9.7446,359
-0.1353,-10.0936,360
0.6112,-9.9205,361
0.4711,-9.9171,362
0.7695,-10.0012,364
8.829,-9.9259,365
13.6349,-9.9018,366
2.4386,-10.3412,367
0.4508,-9.6752,368
1.4251,-10.0873,369
3.9159,-9.67,370
-0.5236,-9.9449,371
-0.345,-9.7212,372
6.9871,-9.7195,374
2.6668,-9.8851,375
4.9281,-9.811,376
1.2397,-9.8826,377
1.4358,-9.8779,378
1.507,-9.8715,379
-1.83,-9.7721,380
6.2348,-5.8105,381
0.6431,-9.5357,382
0.6059,-9.9447,384
2.2353,-9.8711,385
-2.7008,-9.847,386
-6.2865,-9.9617,387
-2.7238,-9.8064,388
4.0005,-9.9526,389
9.514,-10.0566,390
12.0185,-9.8607,391
8.9355,-9.9735,392
1.7736,-9.8841,394
1.2816,-9.9426,395
1.0097,-9.81,396
-0.9014,-10.0845,397
0.5792,-9.8245,398
-0.8525,-9.8916,399
3.8163,-9.969,401
-3.1251,-9.9557,402
-2.0709,-9.3423,403
-2.5788,-9.9405,404
-0.1978,-9.8596,405
-1.4646,-9.8471,406
3.4161,-10.0991,407
2.5635,-9.8396,409
-5.7521,-9.9162,410
-1.873,-9.9152,411
-0.2055,-9.8519,412
0.6379,-9.8479,413
0.6482,-9.9452,414
-0.8052,-9.7554,415
0.334,-9.8733,416
1.427,-9.6791,417
2.5032,-9.886,419
-2.0426,-9.9294,420
3.3943,-9.6797,421
7.0702,-9.75,422
1.73,-10.0608,423
-1.9809,-9.8666,424
9.2704,-9.8035,425
10.8765,-10.1548,426
-4.2553,-9.606,427
-0.4173,-9.7496,429
0.1636,-9.7053,430
3.0884,-9.7581,431
-0.5878,-9.4549,432
38.875,-10.1523,433
-4.3395,-4.9044,434
-0.6984,-9.9373,435
12.5788,-9.8309,436
14.6623,-10.5226,437
27.7421,-10.6559,439
63.3594,-10.123,440
9.5612,-9.9195,441
5.3557,-9.9327,442
-1.1917,-10.1169,443
5.569,-10.2261,445
2.9808,-9.6016,446
3.7398,-10.0253,447
0.4618,-10.0503,448
4.066,-9.9327,449
2.2534,-9.9701,450
4.6885,-9.8601,451
6.2443,-9.8128,452
5.6387,-10.0063,453
-4.3543,-9.5561,454
1.3936,-9.1233,455
45.0118,-7.6535,456
11.8772,-6.2823,457
4.2419,-9.7101,458
-7.0793,-7.0519,459
0.4544,-7.7392,460
-3.2586,-10.3304,461
111.948,-11.5389,462
53.4882,-10.2892,463
3.6455,-9.6983,464
1.5037,-9.2998,465
8.1736,-9.596,466
-0.3346,-9.9508,467
-0.4244,-10.0031,468
3.4856,-9.9305,469
-0.822,-9.9647,470
-0.344,-9.909,471
0.1974,-9.7699,472
7.3142,-10.3968,473
6.3104,-9.8096,474
1.4463,-10.0122,475
-0.0431,-10.2318,476
6.1247,-9.9194,477
0.9105,-9.6986,478
1.8055,-9.9735,479
0.2728,-9.9039,480
-11.0377,-10.0276,481
2.5459,-9.8696,482
2.1909,-9.9788,483
-0.6582,-9.8973,484
-0.1065,-9.3883,485
3.2526,-3.0314,486
0.54,-9.9281,487
0.8317,-9.9223,488
0.922,-7.4324,489
-13.1239,-5.814,490
3.5655,-9.9772,491
0.0419,-10.0665,492
44.2785,-10.0391,493
3.0238,-10.1953,494
11.2527,-10.4193,495
7.729,-9.9185,496
0.0561,-9.8845,497
-0.8014,-9.8052,498
-0.298,-9.8457,499
-5.583,-8.1721,500
-20.7322,-10.1688,501
16.2655,-10.2231,502
-2.14,-10.4691,503
15.2041,-9.8661,504
2.0003,-9.8901,505
5.9645,-9.8815,506
3.2872,-9.9746,507
0.7681,-9.7816,508
10.6846,-9.5638,509
6.7704,-10.5331,510
-0.8873,-9.9926,511
0.0072,-9.9521,512
-0.2187,-9.9992,513
0.19,-9.6937,514
6.2494,-9.8209,515
0.5975,-9.6869,516
0.5754,-10.2448,517
33.4848,-9.3364,518
8.9004,-9.5106,519
-2.8484,-9.6138,520
6.8141,-10.6818,521
-0.474,-9.8025,522
5.3048,-9.4877,524
1.8367,-9.7032,525
-0.9146,-9.6697,526
0.7629,-9.5011,527
5.5096,-9.5996,528
2.8035,-8.8351,529
10.4735,-9.8746,530
0.8276,-9.6983,531
-2.2435,-10.0362,532
6.069,-9.6035,534
4.4292,-9.7433,535
3.1201,-9.9799,536
0.4023,-9.8918,537
10.7291,-9.7485,538
-1.9732,-8.9074,539
-3.9252,-10.8903,540
-0.9764,-10.1418,541
0.0966,-9.842,542
1.3313,-9.8703,544
2.8687,-9.8961,545
8.4484,-9.9185,546
13.3132,-10.0797,547
6.6478,-10.1615,548
0.9333,-10.0166,549
3.5392,-9.8636,550
9.4363,-9.8489,551
19.1535,-9.61,552
0.8177,-9.6242,554
4.8665,-9.7061,555
1.3346,-9.0826,556
-0.0206,-9.3453,557
1.5847,-9.9969,558
1.7223,-10.1118,559
2.7672,-8.9116,560
2.159,-9.8151,561
1.3369,-9.938,562
1.1344,-9.8062,564
125.4028,-10.1951,565
4.0559,-8.1639,566
1.0736,-10.0804,567
1.4541,-9.912,568
13.6129,-9.6785,569
2.4568,-9.2288,570
5.9378,-9.0383,571
-5.1032,-10.2089,572
2.5854,-9.8329,574
8.458,-9.9901,575
2.5231,-9.075,576
1.1867,-9.6656,577
-0.1398,-9.9698,578
-2.3005,-10.3486,579
-1.2024,-10.1285,580
-1.8879,-7.5991,581
-7.5418,-9.8492,582
-3.7349,-9.8263,584
0.7452,-9.9332,585
0.8793,-9.8283,586
-0.9179,-9.4926,587
0.0604,-10.002,588
-4.4177,-9.3702,589
2.3284,-9.7953,590
2.0804,-9.8486,591
19.6198,-9.7477,592
-1.627,-10.4034,594
42.7114,-9.8378,595
11.2248,-10.27,596
9.4091,-10.077,597
11.0178,-10.5229,598
3.4855,-10.7121,599
-0.9969,-9.5522,600
0.0981,-9.9628,601
-0.972,-8.8334,602
2.062,-10.0313,604
1.3301,-9.7982,605
1.0916,-10.0318,607
1.4948,-9.6864,608
9.3851,-9.921,609
-5.2085,-9.6525,610
2.6097,-10.0662,611
0.2123,-9.8709,612
2.111,-10.0667,613
0.2848,-9.1497,614
7.6762,-9.9699,615
28.4361,-10.1965,616
26.2045,-9.8885,617
48.4554,-9.7664,618
0.688,-10.3396,619
6.7508,-10.1774,620
4.6239,-8.9935,621
5.669,-9.7398,622
0.7625,-9.6015,623
2.1022,-10.0217,624
0.8964,-10.1713,625
0.8049,-9.5739,626
2.3519,-9.2961,627
12.9894,-9.5664,628
15.1442,-9.2444,629
-0.083,-10.0511,630
3.5274,-9.4291,631
0.4189,-9.6974,632
9.4974,-9.8457,633
68.0213,-9.4175,634
11.176,-9.7328,635
11.3864,-10.0885,636
2.5714,-10.5065,637
4.4257,-10.3476,638
1.2883,-9.8508,639
-0.7115,-9.9019,640
5.7838,-9.7232,641
7.1689,-9.5814,642
-0.0761,-10.6768,643
2.6265,-9.6585,644
0.1217,-10.1453,645
1.5263,-9.6419,646
4.0792,-9.3728,647
-3.6925,-10.4676,648
6.6743,-10.3569,649
-0.3552,-9.0555,650
6.6277,-9.9714,651
-0.3785,-9.9865,652
0.8541,-10.3256,653
0.7556,-9.956,654
1.4822,-9.8644,655
-1.2431,-10.7094,656
1.5111,-9.4706,657
-0.1732,-10.1533,658
-0.3404,-9.8243,659
1.9294,-9.9791,660
4.3033,-10.1076,661
-0.136,-9.9369,662
-3.8938,-9.9535,663
0.4731,-9.9437,664
4.4784,-10.0195,665
2.6736,-9.9435,666
0.0236,-9.9551,667
-0.6067,-9.9639,668
0.8484,-9.8695,669
-0.12,-9.7202,670
4.3304,-12.4449,671
3.5011,-9.9623,672
35.9111,-10.0469,673
2.335,-10.1554,674
3.9362,-10.561,675
-2.2842,-9.0509,676
2.2333,-10.3822,677
59.7684,-11.6124,678
0.5725,-9.6003,679
1.0977,-10.2648,680
1.2428,-11.3143,681
-2.5414,-9.1095,682
11.6392,-10.2572,684
1.0331,-10.4784,685
-6.9921,-10.5417,686
5.7744,-10.1995,687
-125.8029,-9.186,688
21.8183,-7.4794,689
20.2124,-9.5808,690
10.1277,-9.9322,691
-0.3695,-9.9009,692
9.7852,-9.9575,694
-24.9282,-9.7443,695
-95.8115,-9.1801,696
37.0409,-9.5113,697
14.5696,-9.7081,698
-3.8059,-9.8558,699
5.6719,-9.8426,700
0.2825,-9.8523,701
-0.3832,-9.8303,702
0.2714,-9.8207,704
0.1719,-9.8216,705
0.0485,-9.8158,706
1.3721,-9.8069,707
0.9731,-9.7961,708
0.7697,-9.819,709
6.1114,-9.8292,710
-0.0587,-9.8946,711
0.092,-9.8959,712
0.9446,-9.8907,713
0.3475,-9.8884,714
1.9601,-9.8787,715
-3.0857,-9.8669,717
1.4308,-9.8216,718
-1.5614,-9.9441,719
-1.6571,-9.7884,720
-4.2201,-9.8812,721
2.9176,-9.9409,722
1.9872,-9.9048,724
-0.1604,-9.8735,725
3.1409,-9.8716,726
-1.0163,-8.4071,727
1.4738,-7.7223,728
0.0643,-9.9049,729
-0.0411,-9.9676,730
1.0803,-9.8328,731
-0.5546,-10.1795,732
0.5359,-9.8605,734
0.1964,-9.9046,735
-0.634,-9.7919,736
1.0012,-9.8682,737
3.0378,-9.9062,738
-17.8161,-9.7456,739
-3.9318,-9.9043,740
2.1274,-9.9206,741
3.8239,-9.9489,743
7.9221,-10.0454,744
15.5125,-9.8017,745
10.2373,-9.8843,746
0.9943,-9.9922,747
0.3595,-9.6923,749
1.8475,-9.9016,750
2.348,-9.802,751
-1.7384,-9.846,752
23.2588,-10.6291,753
-3.3485,-9.9119,754
0.2644,-9.8573,755
-18.896,-9.5538,757
2.1388,-9.7808,758
2.1455,-9.8203,759
-6.9741,-9.7505,760
1.0137,-9.8615,761
1.7865,-9.8538,762
-0.064,-9.8873,764
-0.1992,-9.8861,765
-0.3477,-9.8869,766
-0.4303,-9.8912,767
-0.0802,-9.8929,768
0.1511,-9.9041,769
-0.2096,-9.8882,770
-1.8336,-9.7803,771
-9.4629,-9.7995,772
3.9652,-9.8325,774
9.2714,-9.9152,775
-1.1067,-9.7832,776
2.8092,-9.9707,777
2.3748,-10.0066,778
-0.2199,-9.704,779
19.8698,-10.0841,780
0.2024,-10.0702,781
17.9388,-9.3079,782
0.2937,-9.8911,784
0.7064,-9.9489,785
2.0911,-10.1058,786
3.6925,-9.4717,787
0.9949,-9.8734,788
4.5731,-9.6664,790
0.153,-9.6821,791
1.0562,-9.9632,792
1.7855,-9.8918,793
-0.0837,-9.854,794
1.3225,-9.931,795
0.2415,-9.8949,796
-0.4754,-9.3847,797
1.1166,-10.4045,798
0.8814,-9.9727,799
2.9745,-8.7003,800
0.3999,-10.0435,801
0.8041,-9.8143,802
0.502,-8.872,803
0.248,-8.638,804
2.8298,-10.0021,805
0.4087,-9.7191,806
0.3277,-9.5804,807
-0.0949,-9.4534,808
2.8543,-9.6603,809
-1.1269,-10.2358,810
-0.5564,-9.8408,811
1.0708,-9.98,812
-1.6407,-9.9889,813
-1.3147,-9.8333,814
-0.4149,-9.9499,815
-0.0708,-9.8421,816
-0.4161,-9.8631,817
9.5386,-9.5477,818
-3.9046,-7.3753,819
-0.3949,-9.9298,820
5.3178,-9.8925,821
2.1793,-9.6995,822
-2.5511,-9.5677,823
2.6049,-10.1584,824
-0.4317,-9.8444,825
3.8233,-9.7233,826
-1.2707,-9.7702,827
-0.5438,-9.5776,828
-1.3958,-10.326,829
1.7424,-9.8779,830
-0.9289,-10.0715,831
3.7838,-10.1224,832
1.8051,-9.6267,833
1.9027,-9.842,834
-0.6853,-9.9806,835
1.9665,-10.0829,836
-0.3168,-9.548,837
-0.5452,-10.0089,838
3.8328,-10.2037,839
-0.8499,-9.8921,840
1.8296,-9.9122,841
-1.0006,-9.8651,842
0.735,-9.7261,843
2.4875,-9.9125,844
0.4341,-9.8487,845
2.8544,-10.0384,846
1.683,-11.8983,847
1.7226,-10.6299,848
3.8276,-9.7467,849
0.9183,-10.5012,850
-5.6674,-9.9799,851
-1.3075,-10.1952,852
0.1335,-9.895,854
-2.8601,-9.6085,855
0.5828,-9.6499,856
0.2302,-9.979,857
1.8411,-9.9085,858
-2.2634,-8.5397,859
-0.6307,-9.8515,860
0.1559,-9.9373,861
3.2832,-9.8264,862
0.8414,-10.044,863
1.3418,-9.881,864
1.2162,-9.963,865
-3.6862,-9.9367,866
1.5585,-10.0388,867
2.4475,-9.815,868
5.4104,-9.7546,869
2.7879,-9.8628,870
2.2797,-9.8396,871
-0.2106,-10.0055,872
-0.113,-9.8447,874
-0.7948,-9.4212,875
-4.772,-9.6795,876
-3.0934,-9.1616,877
1.777,-9.8718,878
1.4016,-10.0286,879
2.2751,-9.9298,880
2.0281,-10.0241,881
0.5908,-9.9144,882
5.3275,-9.9178,884
4.7065,-9.668,885
2.6144,-9.8754,886
-0.1246,-9.8889,887
1.7305,-9.8205,888
0.0327,-9.6547,889
0.2444,-9.6169,890
-3.409,-9.8802,891
-13.2957,-9.7481,893
-1.5467,-9.6523,894
2.0078,-9.6673,895
9.9392,-9.8107,896
-1.7896,-9.8751,897
-10.8744,-9.7931,898
-3.2741,-9.8596,899
-0.7768,-9.8943,900
0.865,-9.874,902
-13.0223,-9.7653,903
-3.1005,-9.7728,904
-4.0098,-9.5383,905
0.482,-9.7041,906
7.5815,-9.8348,907
-0.3735,-9.902,908
-4.1714,-9.8991,909
2.8832,-9.8753,910
-2.5152,-9.8989,912
1.423,-9.8735,913
0.9525,-9.9469,914
-0.6289,-9.8625,915
0.1012,-9.8899,916
0.1964,-9.8992,917
-0.1934,-9.8953,919
-0.1589,-9.8845,920
0.5126,-9.8792,921
0.1015,-9.887,922
-0.5096,-9.8408,923
-2.7768,-9.8479,924
-1.0216,-9.9088,925
1.4038,-9.9405,927
2.0978,-10.0816,928
4.4595,-10.1528,929
-47.2458,-9.5733,930
18.026,-9.3162,931
-7.4529,-9.6963,933
7.3197,-9.7497,934
4.1284,-10.0089,935
-1.6096,-9.9184,936
-1.8218,-9.7351,937
-1.536,-9.9167,939
1.3227,-9.8247,940
0.3536,-9.7571,941
2.5615,-10.0634,942
3.5517,-9.5542,943
-2.611,-9.7257,944
-2.3314,-9.8281,945
0.0951,-9.8969,946
0.2291,-9.7241,947
-0.417,-9.7594,949
0.0778,-9.789,950
-0.5399,-9.6821,951
0.0698,-9.8232,952
-3.0161,-10.0165,953
1.0866,-9.9064,955
-2.9812,-9.8572,956
0.3381,-9.8515,957
0.5454,-9.821,958
2.9342,-9.8599,975
0.9754,-9.8875,976
-4.1023,-9.8241,977
-0.2731,-9.8432,978
1.4955,-9.8592,979
-3.2844,-9.8161,980
-3.9312,-9.7687,981
5.2152,-9.6622,982
-0.8003,-9.9051,983
-0.4673,-9.5898,984
-0.0868,-10.0293,985
2.0721,-10.0019,986
4.8431,-10.4781,987
3.751,-9.8954,988
-1.3349,-9.909,989
1.0241,-7.3131,990
11.0916,-10.1313,991
-5.6305,-10.6112,992
-4.2246,-9.3047,993
5.2361,-10.0531,994
-4.7979,-10.3044,995
0.2774,-9.8775,996
-2.2512,-9.9765,997
3.4482,-9.9499,998
5.275,-9.9535,999
2.7053,-9.9528,1000
21.4407,-9.8042,1001
1.1973,-9.9561,1002
-0.2839,-10.3522,1003
-0.488,-10.0045,1004
0.926,-7.8108,1005
1.5547,-9.6084,1006
-1.4307,-9.9701,1007
6.51,-9.9049,1008
-2.5124,-9.8675,1009
6.1194,-10.1655,1010
7.7893,-9.8876,1011
15.6653,-9.9634,1012
-12.0893,-10.0639,1013
85.6636,-9.715,1014
140.025,-9.4082,1015
119.7044,-10.4703,1016
-3.4644,-9.9783,1018
0.1642,-9.3853,1019
1.9714,-6.0245,1020
-1.6804,-9.9141,1021
2.0502,-9.8647,1022
-1.9654,-9.8637,1023
4.617,-10.1211,1025
6.2537,-9.5603,1026
1.7862,-10.1587,1027
4.7471,-9.9104,1028
32.3343,-10.0176,1029
4.1067,-9.8036,1030
2.0997,-9.9898,1031
0.4256,-10.023,1032
0.1683,-9.8813,1033
2.1367,-9.8,1034
4.2955,-9.8569,1035
4.6344,-9.904,1036
1.4788,-9.9533,1038
0.1484,-9.9792,1039
0.0574,-9.9524,1040
2.1086,-9.9768,1041
0.5375,-10.2403,1042
-0.2613,-10.2709,1043
-0.1665,-10.0045,1044
0.7098,-9.8948,1045
-1.0324,-9.8713,1046
5.4494,-9.8393,1048
-0.2708,-9.8414,1049
-0.207,-9.8287,1050
0.0368,-9.8329,1051
1.3459,-9.8445,1052
-0.0901,-9.84,1053
9.7734,-9.8533,1054
0.8411,-9.994,1055
2.2373,-9.8758,1056
0.0688,-9.9067,1057
0.5235,-9.8958,1058
-0.6621,-9.8714,1059
-0.6841,-9.905,1060
0.4742,-9.9059,1062
-1.709,-9.8998,1063
-0.4311,-9.8882,1064
0.2307,-9.8987,1065
0.1067,-9.8899,1066
0.1039,-9.8822,1067
0.4962,-9.893,1068
-0.0243,-9.8967,1069
-0.0019,-9.8683,1071
1.3129,-9.8805,1072
-2.0361,-9.8729,1073
1.1893,-9.8682,1074
0.8358,-9.8825,1075
0.2843,-9.8906,1076
0.5088,-9.8877,1078
0.3448,-9.8878,1079
0.4222,-9.8737,1080
0.7707,-9.8876,1081
-6.0309,-9.8746,1082
1.3439,-9.9248,1083
-1.923,-9.9687,1084
-6.2715,-9.9848,1085
-3.5578,-9.904,1086
0.1572,-9.9501,1088
-1.3559,-10.0439,1089
10.6415,-9.9137,1090
4.2681,-9.8743,1091
-0.8841,-9.8142,1092
-0.2202,-9.8655,1093
1.6701,-9.9065,1094
-3.9912,-9.9476,1095
0.703,-9.8354,1096
2.8279,-9.9146,1098
-0.9044,-9.9043,1099
6.1215,-9.9297,1100
-2.4445,-9.8266,1101
9.8428,-9.7426,1102
2.4336,-9.8689,1103
-0.9966,-9.9108,1104
0.7159,-9.9069,1105
0.3641,-9.9913,1106
3.8566,-9.9057,1108
19.222,-10.2363,1109
-5.1084,-9.7899,1110
-2.4138,-9.8596,1111
2.4896,-9.7278,1112
-3.9521,-9.862,1113
-5.6734,-9.7918,1114
3.0441,-9.8315,1116
-1.3222,-9.8029,1117
-2.7786,-9.7952,1118
-13.2582,-9.7773,1119
6.8463,-9.9132,1120
1.6861,-9.9643,1121
2.6401,-9.9129,1123
4.9505,-9.295,1124
-5.0961,-9.9157,1125
-18.9936,-10.1179,1126
5.784,-10.095,1127
-5.6568,-9.9345,1128
1.7056,-9.8693,1129
-0.8235,-9.8903,1130
-0.2271,-9.924,1131
-0.7874,-9.8616,1133
-0.2027,-9.8887,1134
0.0282,-9.8538,1135
-0.3165,-9.8776,1136
-1.0823,-9.9572,1137
1.9837,-10.4547,1138
2.227,-10.1355,1139
-6.5981,-9.8796,1140
0.7498,-10.0011,1142
-4.2967,-10.9737,1143
12.4973,-8.7022,1144
6.5674,-9.9895,1145
9.3795,-9.8769,1146
4.3721,-9.9279,1147
18.2278,-9.9036,1148
6.505,-5.4051,1149
-4.8571,-9.5273,1150
5.4844,-9.8787,1151
1.9873,-10.3666,1152
22.7431,-9.8702,1153
17.7424,-9.9316,1154
26.9443,-9.8782,1155
-1.8073,-10.1617,1156
10.8398,-8.8643,1157
6.8895,-9.3015,1158
-2.8008,-9.9315,1159
12.8636,-9.8327,1160
36.2149,-9.4603,1161
13.6913,-9.3497,1162
-3.6398,-9.6471,1163
-0.6099,-9.8695,1164
1.7809,-9.9103,1165
0.708,-9.846,1166
3.6625,-9.9811,1170
-2.9623,-9.9335,1171
-1.1232,-9.8316,1172
-39.6379,-8.647,1173
19.7415,-9.4088,1174
0.9518,-9.7923,1175
-2.7969,-9.8444,1176
-7.3704,-9.8245,1177
-4.0992,-9.8719,1178
-1.5486,-9.7506,1179
-1.8326,-10.2016,1180
1.8601,-9.3076,1181
-2.2368,-9.8032,1182
-0.0827,-9.9014,1183
