AYGX_mean,AZ_mean,timestamp
-1.5716,-9.5348,0
-1.5929,-9.5357,1
-2.0427,-9.542,27
-4.7881,-9.6873,28
-6.9249,-9.5578,29
3.7828,-9.6543,30
0.2728,-9.6925,31
-0.222,-9.6806,32
0.19,-9.6031,33
2.636,-9.1811,34
-2.4031,-9.6232,35
-0.4239,-9.6958,36
-0.1264,-9.8981,37
3.2547,-10.0343,38
-0.9589,-9.6866,39
7.6433,-9.6916,40
1.5074,-9.7213,41
-0.3887,-10.2802,42
0.8627,-9.6236,44
-0.5853,-9.4122,45
0.7835,-10.2128,46
0.0752,-9.5523,47
-0.5347,-10.0546,48
-0.2962,-9.7426,49
-0.2025,-6.5152,53
-0.4606,-9.5646,54
-0.1261,-9.7105,56
-1.9015,-7.3719,57
-1.2541,-9.836,58
-1.0443,-9.3163,59
2.4832,-9.8927,60
-1.214,-9.7331,61
-0.4829,-9.7318,62
-0.5193,-9.777,63
-1.4346,-10.0218,64
-0.1854,-9.8372,65
-0.2099,-9.713,66
0.9503,-9.7266,67
1.9981,-9.7358,68
0.6482,-9.6266,69
-1.047,-9.5752,70
-0.7567,-9.6317,71
0.4851,-9.3849,72
0.9845,-9.4832,73
2.1067,-10.0707,74
-0.9706,-10.0631,75
0.9369,-9.6264,76
-0.5203,-9.4917,77
-0.313,-9.3548,78
-1.0134,-9.6297,79
0.183,-9.6185,80
-0.7016,-9.7283,81
-0.0002,-9.832,82
-0.3023,-9.6049,83
-0.1852,-10.076,84
-0.1864,-9.5192,85
0.1678,-9.632,86
-0.4541,-9.5525,87
0.3807,-9.9028,88
0.2159,-9.7124,89
-0.1907,-9.3784,90
0.8719,-9.7899,91
-0.1426,-9.7243,92
0.1473,-9.7392,93
-0.1079,-9.9004,94
-0.5259,-9.7117,95
0.8952,-9.8158,96
-1.0219,-9.2318,97
-0.7493,-9.8877,98
0.0465,-10.0705,99
-0.4938,-9.4139,100
-0.019,-9.7804,101
-0.4547,-9.7824,102
-0.3158,-9.9684,103
-1.0674,-9.7504,104
0.0486,-9.7228,105
-1.0415,-9.7747,106
-0.5071,-9.1332,107
-0.2469,-9.6222,108
-0.6574,-10.1353,109
-0.6976,-10.0366,110
-0.4184,-10.1843,111
-0.351,-9.7609,112
-0.6141,-9.3543,113
-0.2585,-9.8731,115
2.534,-9.7622,116
-0.1921,-9.3365,117
-1.3076,-7.9096,118
0.1813,-9.8395,119
-0.3255,-9.6424,120
0.1968,-9.702,121
2.0715,-9.6288,122
-1.1559,-9.8788,123
-0.552,-9.4634,125
1.2079,-9.6871,126
-1.8611,-9.8418,127
0.2299,-9.7621,128
-0.2327,-9.6082,129
1.2381,-9.7996,130
-1.8373,-9.5802,131
1.3754,-9.715,132
0.2708,-9.6483,133
0.6648,-9.7111,135
0.124,-9.7181,136
1.6358,-9.7327,137
-1.7357,-9.6798,138
0.2235,-9.6587,139
-0.533,-9.7093,140
-0.7987,-9.9438,141
0.5594,-9.7619,142
-0.138,-9.7363,144
-0.0535,-9.6679,145
-0.4636,-9.7596,146
0.1555,-9.7248,147
-0.0589,-9.7266,148
-0.0608,-9.7497,150
-0.0159,-9.7006,151
0.1648,-9.7769,152
0.5626,-9.7907,153
-1.3917,-9.4646,154
0.5702,-9.6554,155
-0.3114,-9.7405,156
-0.411,-9.755,157
0.5624,-9.7989,158
2.2879,-9.693,160
-0.2772,-9.7196,161
0.1488,-9.7022,163
-0.141,-9.6846,164
-0.3363,-9.7168,165
0.4199,-9.7339,166
-1.44,-9.7013,167
-0.3944,-9.7128,168
-1.1013,-9.712,169
-2.7239,-9.6666,170
4.1629,-9.5244,171
1.1109,-9.4837,172
1.0375,-9.6662,173
3.5906,-9.6541,174
-1.032,-9.7076,175
-0.0572,-9.6855,176
-3.7293,-9.6574,177
1.1123,-9.6371,178
1.8468,-9.8069,180
-1.1698,-9.7688,181
-0.5167,-9.67,182
0.9159,-9.4492,183
-0.4129,-9.8023,184
0.2528,-9.7257,185
-0.1204,-9.7178,186
-0.3851,-9.6503,187
0.3062,-9.9137,188
-0.4103,-9.7095,189
0.0945,-9.6586,190
-0.4109,-9.7136,191
-0.3643,-9.6931,192
0.257,-9.7511,193
-0.8323,-9.725,194
-0.3984,-9.7034,195
-0.4368,-9.6868,196
0.3785,-9.7449,197
-0.077,-9.6809,198
2.4753,-9.6494,199
-0.7015,-9.6468,200
-0.0325,-9.6483,201
0.375,-9.6926,202
-5.1153,-9.4572,203
0.1763,-9.7497,204
-1.222,-9.7132,205
-0.1994,-9.7286,206
1.5795,-9.7479,207
1.1692,-9.8037,208
2.2358,-9.6643,209
4.488,-9.5454,210
-1.7234,-9.7296,211
1.1443,-9.7246,212
2.3765,-9.8803,213
0.1036,-9.339,215
-0.818,-9.5866,216
-0.7052,-9.7694,217
-0.5073,-9.6895,218
-0.7275,-9.9855,219
0.2669,-9.6766,220
2.5306,-9.894,221
1.124,-9.6625,222
0.1611,-9.7264,223
-0.3899,-9.6229,225
0.8195,-9.7126,226
0.0944,-9.7832,227
-0.9132,-9.4962,228
0.074,-9.2446,229
0.3606,-9.8723,230
-0.519,-9.7629,231
0.8165,-9.6642,232
2.3052,-9.5385,233
1.1437,-9.7162,235
-0.1627,-9.7588,236
1.4242,-9.7869,237
0.4811,-9.9282,238
-0.8926,-9.9421,239
-3.0225,-9.7113,240
-1.5274,-9.9566,241
0.8321,-9.8516,242
-0.1731,-9.4692,243
0.1606,-9.7674,245
0.0174,-9.6967,246
-2.6721,-9.6385,247
-0.5745,-9.6699,248
1.1162,-9.7138,250
3.2907,-9.6106,251
1.8029,-9.7869,252
0.7129,-9.6296,253
0.4674,-9.612,255
4.0291,-9.8219,256
1.8431,-9.8296,257
1.0048,-9.6638,258
1.0083,-9.7315,259
-0.4563,-9.7317,260
0.8651,-9.6343,261
0.0109,-9.7228,262
0.0904,-9.6241,263
1.9459,-9.7289,265
0.977,-9.7085,266
0.3554,-9.778,267
-0.0378,-9.8304,268
-0.6694,-9.7543,270
-0.0187,-9.7338,271
0.9692,-9.6968,272
1.1673,-9.7982,273
-0.399,-9.7332,274
0.0225,-9.7459,275
0.1372,-9.6793,276
0.9755,-9.7958,277
-1.1884,-10.013,278
1.3087,-9.7161,279
0.5415,-9.9072,280
1.0611,-9.4971,281
-0.3731,-9.3562,282
-0.3141,-9.865,283
-0.9791,-9.7447,284
-0.2034,-9.7147,285
-0.0623,-9.664,286
-0.9965,-9.8016,287
-1.0522,-9.8169,288
0.3744,-9.733,289
-1.9629,-9.7875,290
2.3506,-9.7149,291
-0.7063,-9.6794,292
-1.5177,-9.5085,293
2.511,-9.6766,294
2.44,-9.9014,295
1.2619,-9.7333,296
0.8275,-9.5626,297
1.2947,-9.6534,298
0.09,-9.7209,299
0.5914,-9.6922,300
-0.3119,-9.8052,301
3.0154,-9.5689,302
-0.9736,-9.564,303
-2.455,-9.5306,304
5.2912,-9.5868,305
-1.9096,-9.7844,306
0.3418,-9.6834,307
-1.1476,-9.7035,308
1.7131,-9.7412,310
0.4043,-9.8089,311
-0.6959,-9.7483,312
-0.4935,-9.6951,313
0.2414,-9.703,314
0.3069,-9.7033,315
0.3802,-9.7029,316
0.3137,-9.7044,317
0.3611,-9.7039,318
0.3812,-9.6991,320
0.0915,-9.7084,321
0.1518,-9.7107,322
0.1821,-9.7056,323
0.2031,-9.71,324
0.2551,-9.7086,325
0.167,-9.7098,326
0.1359,-9.7032,327
0.0153,-9.69,328
0.5985,-9.6773,329
0.2013,-9.6899,331
-0.7918,-9.5724,332
6.0025,-9.4615,333
1.087,-7.1599,334
6.6941,-9.9079,335
-1.4015,-9.87,336
-0.2992,-9.7317,337
-0.2723,-9.5994,338
0.1554,-9.7135,340
-0.5272,-9.7006,341
-0.6458,-9.7359,342
0.9735,-9.7084,343
1.889,-9.7758,344
-1.514,-9.9826,345
1.5417,-7.763,346
2.8,-9.4736,347
-0.211,-9.4818,349
-1.6338,-9.6162,350
-0.9543,-9.8744,351
-0.8912,-9.6612,352
-0.7667,-9.7119,354
0.2723,-9.7258,355
-0.7044,-9.774,356
0.0857,-9.6932,357
-0.7997,-9.7889,358
-0.4375,-9.7056,360
0.7206,-9.7348,361
-1.6801,-9.6577,362
-0.3683,-9.714,363
0.1509,-9.7088,364
0.3165,-9.7187,365
-0.9628,-9.714,366
0.1264,-9.7229,367
2.1465,-9.6686,368
-0.3008,-9.7175,370
1.5546,-9.7371,372
0.6014,-9.6389,373
-1.2396,-9.6009,374
-1.1174,-9.4151,375
-0.0475,-9.5088,376
0.1934,-9.6133,377
-0.8787,-9.7897,378
-2.4305,-9.6335,379
-3.0863,-9.7785,380
-0.3917,-9.7104,381
0.3099,-9.7426,382
-0.6295,-9.8175,383
-0.8665,-9.8453,384
0.0552,-9.6767,385
-2.8856,-7.7987,386
-5.0379,-8.7321,387
1.406,-9.4512,388
-4.5032,-9.5804,389
-1.5541,-9.713,390
-0.3594,-9.6825,391
-0.7313,-9.735,392
-1.0975,-9.6903,393
0.183,-9.7233,395
-0.1057,-9.6867,396
0.9508,-9.7729,397
0.0577,-9.833,398
1.4347,-9.6775,399
-3.2635,-9.6482,400
-2.4536,-9.9909,401
3.9603,-9.7641,402
1.7295,-9.6811,403
-1.116,-9.7454,404
-1.5616,-9.7369,405
1.9202,-9.7203,406
-1.7461,-9.7014,407
0.1675,-9.6125,408
-0.1603,-9.6513,409
0.4001,-9.672,410
-0.1173,-9.6438,411
-2.0067,-7.825,412
-3.0281,-9.3501,413
2.8849,-9.5863,414
3.3935,-9.1739,415
3.7759,-9.7195,416
0.9293,-9.8329,417
-0.6954,-9.6437,418
0.3775,-8.9382,420
-0.2737,-9.6278,421
-1.1222,-8.8675,422
0.141,-9.4368,423
0.1669,-9.8392,424
-0.0885,-9.8708,425
1.4946,-9.5146,426
0.0839,-9.6711,427
-0.8147,-8.9893,428
0.1485,-9.7715,430
0.1009,-9.7971,431
-2.4967,-9.1608,432
-1.1804,-9.7152,433
-1.7894,-9.7191,434
1.3549,-9.5833,435
2.9469,-10.0458,436
0.4602,-9.6912,437
-0.1582,-9.7185,439
-0.0363,-9.7445,440
-0.2395,-9.7286,441
0.1693,-9.7024,442
0.2898,-9.8045,443
-0.3702,-9.6311,445
0.5347,-9.6492,446
2.2286,-9.8917,447
2.8098,-9.6769,448
-0.7071,-9.9332,449
-0.4364,-9.6712,450
-0.2734,-9.4379,451
1.3543,-9.7343,452
-0.4792,-9.6525,453
-0.0056,-9.7303,455
0.2552,-9.7124,456
0.334,-9.7093,457
-0.0413,-9.7184,458
0.023,-9.7174,459
-0.0102,-9.7172,460
0.0135,-9.7168,461
0.0567,-9.7179,462
0.051,-9.7186,463
-0.0227,-9.718,465
-0.0258,-9.7185,466
0.0767,-9.7197,467
0.0205,-9.721,468
0.047,-9.7107,469
4.7405,-10.5269,470
10.3258,-9.7487,471
-2.8404,-9.687,472
-0.7451,-9.6545,473
-1.4733,-9.7619,475
1.3212,-9.7395,476
-1.3882,-9.551,478
1.0657,-9.7591,479
-1.4111,-8.9109,480
-3.8262,-9.8391,481
-0.9114,-9.7862,482
5.2389,-9.6424,483
0.134,-9.4114,484
-0.2234,-9.6976,485
0.1886,-9.7295,486
-0.3297,-9.7366,487
-0.8212,-9.6733,488
-0.0333,-8.9123,489
0.2321,-9.5318,490
0.4918,-9.982,491
-0.5894,-9.6774,492
-0.4479,-9.6139,493
0.2463,-9.4684,494
1.8813,-8.8334,495
-0.876,-10.0724,496
-1.0791,-9.7545,497
-0.8057,-9.5458,498
-0.2632,-9.5304,499
-0.3203,-9.7133,500
-0.3818,-9.7956,501
1.1084,-8.4841,502
-3.2705,-9.4962,503
1.7919,-9.5999,504
0.7001,-9.7046,505
6.4847,-9.6273,506
0.2409,-9.7307,507
-0.1438,-9.7028,508
-0.5058,-9.6429,509
0.655,-9.6489,510
-0.8673,-9.6049,511
1.3885,-9.6571,512
0.4908,-9.5476,513
-6.1639,-9.7101,514
2.0378,-9.6971,515
1.8232,-9.211,516
-0.947,-11.3019,517
-0.9128,-9.8575,518
1.8296,-9.6466,519
-0.3496,-10.0639,520
0.792,-9.2547,521
-2.1695,-9.5184,522
0.649,-9.0917,523
0.0787,-9.7519,524
-0.4314,-9.7798,525
0.0134,-9.5754,526
0.2063,-9.8282,527
0.1548,-9.5154,528
1.1321,-9.8283,530
-0.9332,-9.7552,531
4.5024,-9.7963,532
-0.6967,-9.5887,533
-0.5796,-9.2651,534
4.7582,-9.6316,535
0.5819,-9.6587,536
-0.5136,-9.7915,537
-0.1118,-9.5644,538
0.8093,-9.5778,540
1.0429,-9.6499,541
1.5858,-9.7268,542
-1.6286,-9.7051,543
5.6584,-9.6929,544
-0.233,-9.8362,545
0.4214,-9.7775,546
0.2419,-9.8265,547
-1.035,-9.8263,549
1.7936,-9.5671,550
1.4873,-9.7161,551
-0.3926,-9.8053,552
0.8892,-9.619,553
1.8661,-9.6395,555
-0.0897,-9.7515,556
5.151,-9.6464,557
-0.7,-9.8519,558
0.9152,-9.8443,559
5.9221,-9.3094,560
-1.0329,-9.9035,561
0.2401,-9.7272,562
0.9725,-9.7514,564
-1.0435,-9.8653,565
0.4108,-9.8373,566
-0.0478,-9.6695,567
0.6289,-9.7583,569
-0.3768,-9.7989,570
-3.1006,-9.6731,571
0.9316,-9.6026,572
-0.2465,-9.4872,573
0.5425,-9.6339,575
1.4626,-9.7604,576
-1.0072,-9.7597,577
-0.0528,-9.7166,578
-2.3388,-10.1541,579
-1.3085,-9.2868,580
-2.1886,-9.5967,581
0.5511,-9.8043,582
0.4324,-9.7945,584
1.154,-9.925,585
-0.4792,-9.7407,586
-0.1083,-9.72,587
0.2383,-9.7585,588
0.07,-9.6526,589
-0.2585,-9.8364,590
-0.2595,-9.7203,591
-0.2576,-9.7489,592
-0.1029,-9.7038,593
-0.1255,-9.7185,594
-0.0255,-9.6966,595
-0.8969,-9.8914,596
0.3822,-9.7047,597
-0.6455,-9.7055,598
0.1862,-9.7094,599
-0.3703,-9.7152,600
0.3255,-9.7028,601
0.8165,-9.6734,602
0.6562,-9.7418,603
0.3198,-9.72,604
0.0221,-9.7033,605
0.2445,-9.6981,606
0.342,-9.6976,607
0.4345,-9.6972,608
0.934,-9.7148,609
-0.4087,-9.6859,610
-0.3181,-9.8242,611
-0.3547,-9.6919,612
0.2621,-9.6845,613
0.1428,-9.6827,614
0.1881,-9.7647,615
-0.5905,-9.7691,616
1.7908,-9.7355,617
-0.2366,-9.7437,618
-2.8997,-9.6238,619
-0.1738,-9.3713,620
-1.4629,-8.993,621
-0.3989,-9.5601,622
1.3389,-9.7366,623
-1.1148,-10.2674,624
0.1664,-9.7384,625
-0.4613,-9.6799,626
-0.6893,-9.7455,627
-1.1699,-9.6627,628
0.1299,-9.695,630
-0.8377,-9.5106,631
-0.227,-9.4936,632
-1.0355,-9.6288,633
0.7916,-9.398,634
0.4033,-9.7915,635
1.5845,-9.2265,636
-0.7905,-9.7767,637
-1.4565,-9.6143,638
0.8647,-9.7582,640
0.4826,-9.7079,641
-2.2125,-9.6723,642
1.2999,-9.7504,643
1.5955,-9.7077,644
4.3001,-9.6163,645
7.9115,-9.5727,646
0.397,-9.697,647
3.7436,-9.6371,648
0.1822,-9.5196,650
2.9439,-10.0099,651
-0.1263,-9.6291,652
0.9176,-9.4661,653
-0.8806,-9.705,654
0.045,-10.1043,655
-0.0189,-9.727,656
-0.1046,-9.6512,657
-0.2516,-9.6748,658
0.7252,-9.45,660
6.6678,-9.8675,661
-0.742,-9.4491,662
0.6839,-9.5176,663
2.8864,-9.7812,664
0.9639,-9.6147,665
0.0494,-9.6324,666
2.9992,-9.8532,667
5.478,-9.5214,668
0.615,-9.8317,670
1.4852,-9.8524,671
5.0737,-9.6796,672
1.955,-9.4648,673
-0.005,-9.7425,674
0.129,-9.9255,675
0.9131,-9.7977,676
0.4231,-9.7064,677
-0.5182,-9.7328,679
-0.3193,-9.7201,680
-1.2049,-9.717,681
-0.9725,-9.6336,682
0.8387,-9.7762,683
0.6716,-9.7886,685
1.4617,-9.7343,687
0.333,-9.7538,688
-1.0093,-9.8557,689
-0.4091,-9.6716,691
0.3576,-9.7655,692
-0.5125,-9.7405,693
1.5278,-9.5893,694
1.13,-9.7805,695
0.3571,-9.6853,696
3.5587,-9.8006,697
2.6675,-9.7319,698
1.6772,-9.6795,699
0.5144,-9.6501,700
0.3246,-9.8972,701
-0.1329,-9.7206,702
1.4872,-9.9178,703
0.1568,-9.6949,704
-1.0453,-9.5718,705
-0.038,-9.746,706
0.8778,-9.747,707
-0.1153,-9.8433,708
-1.0078,-9.7243,709
0.5499,-9.6964,710
4.2033,-9.699,711
0.1706,-9.7304,712
-0.8354,-9.7099,713
0.8695,-9.7024,714
-2.5846,-9.672,715
-3.2954,-9.5784,716
0.1964,-9.7016,717
0.7975,-9.7099,718
1.5033,-9.6542,719
0.8273,-9.6811,720
0.406,-9.7066,721
0.1208,-9.7182,722
-0.5676,-9.7019,723
1.6133,-9.7004,724
0.2867,-9.6868,725
-0.3907,-9.7442,726
-0.357,-9.6796,727
0.0959,-9.6753,728
-0.2699,-9.7338,729
-0.3213,-9.725,730
0.4734,-9.6761,731
0.1065,-9.7075,732
0.2257,-9.7018,734
0.4263,-9.6994,735
0.4992,-9.7031,736
0.2838,-9.7033,737
0.2758,-9.7004,739
0.4228,-9.6968,740
0.6543,-9.6984,741
0.3939,-9.7013,742
0.3841,-9.7027,743
0.2785,-9.7035,745
0.3702,-9.7007,746
0.4758,-9.6977,747
0.303,-9.7017,748
0.3815,-9.7011,749
0.5909,-9.6985,750
0.5036,-9.6686,751
-0.101,-9.7147,752
0.2194,-9.6683,753
0.4552,-9.6838,755
-0.3918,-9.6751,756
-1.92,-9.7847,757
-0.6143,-9.7143,758
-0.1793,-9.7431,759
-0.6445,-9.6885,760
-0.2448,-9.6799,762
3.0721,-9.7116,763
-1.5913,-9.5967,764
0.0877,-9.8185,765
7.077,-9.8633,766
-1.6658,-9.5085,767
-1.8877,-9.2334,768
-0.4078,-9.5466,770
-1.5553,-9.6528,771
-0.0773,-9.5805,772
0.667,-9.7033,774
-3.374,-9.5549,775
3.3767,-9.6097,776
1.0152,-9.7123,777
-1.0638,-9.6302,778
2.0114,-9.4605,780
0.4715,-9.7049,781
3.9074,-9.3579,782
0.1523,-9.6573,783
-0.9309,-9.5266,784
-2.7731,-10.0151,785
-0.4325,-9.8829,786
-0.1154,-9.708,787
0.6111,-9.9831,788
-0.6514,-9.6447,790
1.1366,-9.8996,791
-0.6698,-9.3878,793
-0.6372,-9.8367,794
5.0468,-9.8312,795
4.1081,-9.7897,796
-0.3685,-8.7503,797
-1.3509,-9.714,798
-0.634,-9.9774,799
-0.0066,-9.2194,800
-0.8715,-9.6396,801
3.4667,-9.3512,802
1.0082,-10.0189,803
0.2398,-9.6437,804
-0.0721,-10.0292,805
-0.486,-9.2179,806
1.2518,-9.3257,807
1.6186,-9.5053,808
0.5326,-9.7371,809
1.147,-9.6574,810
2.0844,-9.7774,811
2.3237,-9.643,812
-0.5325,-10.4656,813
0.9068,-9.8603,814
0.1988,-9.7749,815
1.6537,-9.5598,816
-0.1068,-9.7368,817
1.2152,-9.5375,818
-4.035,-9.6397,819
0.2075,-9.6671,820
9.9673,-9.5572,821
1.0414,-9.7187,822
0.9454,-9.9325,823
0.1077,-9.7727,824
-0.6652,-9.8694,825
0.7988,-9.7723,826
1.8751,-9.742,827
-0.1382,-9.484,828
0.1131,-9.6982,829
1.0384,-9.636,830
0.0657,-9.8822,831
0.1693,-9.8767,832
-0.2979,-9.6917,833
-0.3763,-9.7422,834
0.3646,-9.7944,835
-1.3864,-9.9056,836
-1.512,-9.782,837
0.4639,-9.6794,838
-0.0186,-9.628,839
-0.1996,-9.7203,840
-0.0293,-9.7336,841
-0.1345,-9.7343,842
-1.2182,-9.5152,843
-2.6988,-9.9845,844
1.404,-9.1564,845
-1.3548,-9.6218,846
-2.6923,-9.2444,847
1.78,-9.6954,848
-1.1872,-9.6735,849
-0.7508,-9.7107,850
-0.4088,-9.7112,851
-1.992,-9.5619,852
-1.4201,-9.6834,853
-0.7193,-9.6534,854
0.1456,-9.796,855
-2.0341,-9.6995,856
-0.9464,-9.714,857
1.6768,-9.7426,858
-0.5142,-9.7675,860
-0.8636,-9.6303,861
0.9171,-9.7719,862
-0.6093,-9.7203,863
0.0442,-9.7302,865
1.06,-9.6525,866
-0.8969,-9.7443,867
0.4572,-9.6745,868
-0.2714,-9.7179,870
1.2646,-9.7107,871
0.6185,-9.7439,872
2.6578,-9.2459,873
0.3191,-9.6629,874
0.323,-9.7511,875
2.4236,-9.5305,876
-0.3847,-9.6898,877
0.2521,-9.6843,879
-0.204,-9.717,880
0.2693,-9.7074,881
-0.2394,-9.7228,882
0.2121,-9.738,884
-0.3739,-9.7032,885
-0.2441,-9.6658,886
-0.8274,-9.7053,887
0.386,-9.6866,889
1.8895,-9.9449,890
-0.426,-9.7992,891
-0.3302,-9.7322,892
-0.6574,-9.7803,894
-0.4621,-9.6137,895
6.5522,-9.8383,896
3.7268,-9.5025,897
3.9356,-9.4924,898
-0.425,-9.5004,899
-0.1918,-8.2949,900
1.6728,-9.7566,901
2.3851,-9.3142,902
-0.8828,-10.062,903
0.9768,-9.5202,904
-0.9326,-9.7535,905
0.8698,-9.7356,906
1.6292,-9.7356,907
-0.8438,-9.7016,908
-0.3991,-9.7099,909
1.951,-9.7301,910
1.0746,-9.1392,911
3.833,-9.962,912
0.0319,-9.6696,913
-1.2809,-9.719,914
-0.7445,-9.6925,915
2.7734,-9.5539,916
0.6677,-9.6075,917
-2.7173,-9.8206,918
1.0416,-9.6541,919
-1.1842,-9.7138,920
0.4423,-9.8046,921
0.0625,-9.2828,922
4.7253,-9.8908,923
0.1406,-9.5621,925
-0.3595,-9.7261,926
-1.382,-9.7869,927
0.3364,-9.7313,928
0.8151,-9.5756,929
-1.8413,-9.8418,930
1.3708,-9.6668,931
0.1446,-9.6916,932
0.4481,-9.8186,933
0.2778,-9.8054,934
1.5052,-9.7084,936
-0.2097,-9.7062,937
0.5237,-9.7237,938
-1.0319,-9.6312,939
5.5566,-9.6152,940
0.1348,-10.2103,941
3.3211,-9.7649,942
1.4649,-9.5597,944
0.4177,-9.8588,945
-1.3189,-9.7057,946
1.9075,-9.7174,947
0.6012,-9.8347,948
0.4459,-9.2512,950
0.9921,-9.5585,951
3.6626,-9.7053,952
0.1245,-9.8339,953
-0.0831,-9.73,954
-0.7297,-9.7192,955
-0.1914,-9.6917,956
-0.2166,-9.7515,957
0.257,-9.6263,958
-0.418,-9.7082,960
0.3634,-9.7192,961
0.0117,-9.6883,963
0.3769,-9.6413,964
0.4697,-9.5361,965
0.018,-10.0406,966
0.8839,-9.6164,967
2.6438,-9.8227,968
0.2787,-9.7385,970
-0.3104,-9.7224,971
-1.0925,-9.5352,972
0.719,-9.9061,973
-0.2656,-9.7482,974
0.2395,-9.5654,975
-0.9015,-9.6828,976
3.4904,-9.7169,977
0.4867,-9.4632,978
0.2143,-9.7462,980
-0.476,-9.7055,981
-0.5339,-9.7218,982
0.4203,-9.7552,983
0.0287,-9.78,984
0.0938,-9.8438,985
-0.2705,-9.6942,986
1.1718,-9.672,987
-1.1139,-9.7069,988
-0.0561,-9.7277,990
-0.527,-9.712,991
1.571,-9.714,992
0.0435,-9.5362,993
-2.6267,-9.5749,994
-1.6226,-9.4054,995
0.3936,-9.9957,996
-0.5288,-9.6749,997
-0.3499,-9.3843,998
0.3652,-9.7432,1000
-1.2225,-9.7036,1001
-0.2555,-9.8647,1002
-1.8348,-9.7792,1003
0.9096,-9.8296,1004
0.0169,-9.7063,1005
-0.4711,-9.6667,1006
-0.5329,-9.7416,1007
0.1922,-9.7213,1008
-0.7215,-9.7576,1009
-0.3481,-9.7969,1010
-1.2456,-9.6963,1011
-0.465,-9.8057,1012
-0.5097,-9.5698,1013
0.7807,-9.705,1014
-0.586,-9.706,1015
6.2102,-9.733,1016
1.2061,-9.9476,1017
1.1583,-9.8814,1018
1.2281,-9.7203,1019
-0.6647,-10.1229,1020
0.1188,-9.7344,1021
0.0597,-9.7548,1022
2.9651,-9.4669,1023
1.1349,-7.7561,1024
3.9637,-9.6608,1025
0.7721,-9.9521,1026
-0.8715,-9.2676,1027
5.4847,-10.0582,1028
2.0181,-9.8167,1029
0.0303,-9.7263,1030
1.5108,-10.0724,1031
-0.3255,-9.6565,1032
2.0591,-10.1822,1033
4.0645,-10.0928,1034
-0.4623,-9.5117,1035
0.1595,-9.5759,1036
-1.8788,-9.7497,1037
-0.1109,-9.6017,1038
0.5204,-9.3116,1039
11.5619,-10.1098,1040
-1.5375,-9.4026,1041
-0.4372,-9.7767,1042
-0.6158,-9.7654,1043
-0.1443,-9.7288,1045
2.0033,-9.8496,1046
-0.4864,-9.5222,1047
0.5263,-9.7241,1048
-0.4766,-9.9041,1049
0.5396,-9.7317,1050
-0.29,-9.7582,1051
-0.0451,-9.7468,1052
0.4711,-9.7333,1054
-0.7002,-9.6771,1055
-0.2743,-9.6176,1056
-0.3284,-9.7331,1057
1.0858,-9.6261,1059
1.0226,-9.6623,1060
-3.2787,-9.4032,1061
2.5822,-9.6819,1062
-0.0436,-9.6409,1063
0.8458,-9.7142,1064
1.9235,-9.7529,1065
0.8738,-9.6928,1066
1.4646,-9.5858,1067
-0.0842,-9.6297,1068
0.2187,-9.61,1069
0.2655,-10.5472,1070
2.7934,-9.4711,1071
3.5142,-9.6961,1072
0.9721,-9.726,1073
0.3452,-9.6654,1075
-0.3427,-9.7259,1076
-0.7995,-9.6619,1077
-0.8993,-10.1206,1078
0.0085,-10.1663,1079
-0.6955,-9.6524,1080
0.4483,-9.0945,1081
3.0313,-9.512,1082
-0.2609,-9.8318,1084
1.3357,-9.8281,1085
6.6081,-10.0042,1086
-0.0039,-9.4008,1087
-0.5215,-9.1704,1089
-0.0779,-9.6461,1090
-0.4342,-9.7744,1091
-0.2866,-9.6814,1092
-0.513,-9.6458,1093
0.187,-9.4992,1095
-0.5932,-9.7798,1096
0.191,-10.7227,1097
0.9215,-9.5251,1098
3.6759,-9.6901,1099
-0.8964,-9.697,1100
1.4918,-9.4103,1101
0.5101,-9.5243,1102
2.8457,-9.6687,1104
-0.9454,-9.2739,1105
-1.3599,-9.7563,1106
1.0529,-9.5422,1107
-1.1317,-9.5836,1108
0.9615,-9.7249,1109
-0.8713,-9.7411,1110
0.9283,-9.6055,1111
-0.7249,-9.8218,1112
1.7233,-9.7017,1113
0.9407,-9.6355,1114
-0.5737,-9.4681,1115
-1.326,-9.6304,1116
-0.1692,-9.6915,1117
1.2491,-9.3543,1118
-0.3837,-9.6906,1119
-1.1053,-9.7078,1120
0.1771,-9.6371,1121
0.3608,-9.769,1122
0.0914,-9.4366,1123
-0.4686,-10.2194,1124
0.4095,-9.6364,1125
-0.0219,-9.7707,1126
-0.1901,-9.7401,1127
-0.2358,-9.8428,1128
0.2281,-9.7091,1129
-0.1809,-9.8332,1130
1.1668,-9.7111,1131
-0.055,-9.7293,1132
-1.229,-9.7328,1133
-0.8554,-9.7565,1134
2.5077,-9.8172,1135
5.5672,-9.7584,1136
0.0538,-9.4022,1137
0.6518,-9.5109,1138
2.9468,-9.8321,1139
-1.474,-9.7134,1140
-1.3356,-9.7074,1141
-0.6521,-9.5645,1142
-0.1914,-9.8163,1143
-1.7632,-9.7678,1144
-0.9936,-9.6637,1145
-0.9113,-9.6485,1146
1.2234,-9.665,1147
-0.2313,-9.6661,1148
0.5078,-9.7341,1149
-0.4491,-9.6833,1150
-0.4484,-9.6716,1151
-0.2939,-9.7,1152
0.1574,-9.7715,1153
0.3027,-9.7104,1155
-1.0932,-9.6976,1156
-2.2419,-9.6606,1157
-0.2643,-9.6193,1158
-1.3947,-9.6043,1159
10.4793,-9.6405,1160
-4.0391,-9.6465,1161
1.4521,-9.5707,1162
-3.9214,-9.5607,1163
3.4847,-9.6255,1165
-8.6238,-9.5517,1166
1.1867,-9.5128,1167
-0.6785,-9.6437,1168
0.4009,-9.6413,1169
-3.5278,-9.6503,1170
-1.1236,-9.6114,1171
-1.0862,-9.6104,1172
-1.1762,-9.6094,1173
-1.2404,-9.6101,1175
-1.2219,-9.6107,1176
-1.2242,-9.6088,1177
-1.2141,-9.6068,1178
-1.2254,-9.6109,1179
-1.2086,-9.6086,1180
-1.2253,-9.6097,1181
-1.231,-9.6094,1182
-1.2133,-9.6078,1183
-1.2199,-9.6099,1184
