AYGX_mean,AZ_mean,timestamp
0.1684,-9.815,0
0.1683,-9.8155,1
0.1658,-9.8154,3
0.1715,-9.8143,4
0.1803,-9.8144,5
0.1705,-9.8157,6
0.1736,-9.8161,8
0.1817,-9.8154,9
0.1768,-9.815,10
0.1707,-9.8163,12
0.1707,-9.8162,13
0.1784,-9.8175,14
0.1739,-9.8167,15
0.1755,-9.8168,16
0.184,-9.8158,17
0.176,-9.8156,18
0.1745,-9.8126,19
0.0654,-9.8195,20
0.2279,-9.8171,21
0.2132,-9.8166,22
0.184,-9.8144,23
0.1593,-9.8128,24
0.216,-9.8133,25
0.1941,-9.8152,26
0.1944,-9.8143,27
0.1922,-9.816,28
0.1888,-9.8143,29
0.1938,-9.8145,30
0.194,-9.8157,31
0.1938,-9.8147,32
0.1952,-9.8159,33
0.1933,-9.816,34
0.1916,-9.816,35
0.1988,-9.8162,36
0.1915,-9.8141,37
0.1534,-9.8187,38
0.2709,-9.8172,39
0.143,-9.8182,40
0.2315,-9.8171,41
0.1386,-9.8133,42
0.1741,-9.8172,43
0.1789,-9.8178,44
0.1678,-9.818,45
0.1734,-9.8223,48
0.2402,-9.8178,49
0.2299,-9.8143,50
0.1594,-9.822,51
0.1524,-9.816,52
0.1626,-9.8179,53
0.1733,-9.8163,54
24.753,-9.7051,55
-208.0325,-9.141,56
11.4248,-9.5431,57
15.0236,-9.4962,58
-28.2746,-9.7768,59
-90.2363,-7.2057,60
46.3312,-9.4397,61
2.1396,-9.8092,62
-1.3585,-9.8002,63
-5.3832,-9.5743,64
5.2413,-9.7543,65
-1.1532,-9.7909,66
-2.725,-9.6397,68
-2.1466,-9.658,69
7.6736,-9.7071,70
-8.777,-9.7132,72
6.4053,-9.6824,73
0.529,-9.7975,74
3.286,-9.7789,75
0.1937,-9.8229,76
0.7433,-9.8085,77
-5.0449,-9.7747,78
-4.1569,-9.7011,79
-5.0413,-9.6111,80
13.3598,-9.632,81
-4.0537,-9.7575,82
1.3748,-9.7873,83
1.3124,-9.7969,84
2.2945,-9.7978,85
0.2216,-9.868,86
-1.6688,-9.8356,87
0.0625,-9.8719,88
6.2538,-9.7769,89
-1.1201,-9.7707,90
3.4366,-9.7733,91
-3.7141,-9.6596,92
-1.7485,-9.6957,93
-0.0831,-10.3727,94
1.51,-10.075,95
0.3421,-9.8233,96
1.0329,-9.8014,97
1.5058,-9.8208,98
2.4273,-9.8484,99
-0.1266,-9.8356,100
0.7149,-9.8748,101
2.113,-9.8845,102
2.0463,-9.8293,103
0.2912,-9.7787,104
1.0391,-9.8852,105
3.2124,-9.774,106
-0.0204,-9.9144,107
-0.3572,-9.8405,108
0.1787,-9.8233,109
2.3044,-9.7613,110
1.3572,-9.8012,112
0.5683,-9.8332,113
-3.4627,-9.6404,114
0.1588,-9.7919,115
-2.7597,-9.9037,116
3.0793,-9.6498,117
0.7954,-9.8078,119
3.7123,-9.7842,120
6.0132,-9.7446,121
14.6686,-9.9123,122
-2.3498,-9.519,123
0.1158,-9.9275,124
1.5993,-9.8094,125
4.7828,-9.6711,126
0.81,-9.8255,128
7.7398,-9.9152,129
1.2292,-9.7822,130
4.7865,-10.1011,131
2.0343,-9.7283,132
0.9386,-9.6799,133
3.5451,-9.8097,134
-4.3523,-8.8681,135
6.5738,-10.2259,136
2.1465,-9.8179,137
2.1341,-9.814,138
4.9563,-9.7969,139
12.6656,-9.8559,140
-2.7558,-9.956,141
-2.8348,-10.0047,142
1.2855,-9.7997,144
3.0186,-9.9172,145
-0.3369,-9.8858,146
1.2306,-9.7277,147
0.48,-9.7699,148
-0.0572,-9.9316,149
-0.0143,-9.9684,150
-1.1806,-9.6813,151
1.604,-9.7047,152
0.1701,-10.1116,153
4.5052,-9.9841,154
3.4397,-9.7996,155
14.0835,-9.8232,156
0.7432,-9.9128,157
0.0068,-10.0341,158
9.1985,-9.8697,159
1.8096,-9.9827,160
21.108,-9.7102,161
9.1752,-9.8372,162
1.8414,-9.8298,163
-0.9666,-9.821,164
5.392,-9.8637,165
-5.6325,-9.7752,166
0.1736,-9.9009,167
-1.0845,-9.9866,168
-1.9423,-9.7427,169
-0.9921,-9.8894,170
0.5563,-9.7993,171
-4.081,-9.8032,172
-0.0027,-9.8811,173
-6.8678,-9.6112,174
0.3517,-9.7812,175
-1.0539,-9.8424,176
2.5648,-9.8439,178
-0.1985,-9.8267,179
2.5174,-9.8622,180
2.1296,-9.8192,181
1.6098,-9.8013,182
1.0366,-9.7983,183
1.1903,-9.8782,184
0.2115,-9.8209,185
1.7068,-9.835,187
-1.2864,-9.7436,188
8.8572,-9.8204,189
4.0802,-10.1229,190
-5.433,-9.7768,191
5.3258,-9.6324,192
16.3795,-9.9453,193
2.58,-9.8607,194
6.3814,-9.9258,195
17.1587,-10.1369,196
0.4967,-10.2096,197
2.8892,-9.8473,198
2.0354,-9.95,199
7.7898,-9.9939,200
1.6065,-9.5701,201
-26.3384,-9.628,202
-9.3763,-9.8619,203
-26.8957,-9.6844,204
-1.855,-9.9912,205
52.0959,-9.7659,206
0.2061,-9.8314,207
4.4015,-9.7119,208
13.7362,-10.0315,209
20.1326,-9.7681,210
-6.8081,-9.8905,211
0.6207,-9.337,212
-7.407,-8.2326,213
-0.863,-9.6741,214
3.3218,-9.6033,215
0.8315,-9.5166,216
-0.2083,-10.2469,217
-1.1415,-8.4957,219
8.2792,-10.2318,220
0.5095,-9.8861,221
6.7096,-9.9001,222
5.3221,-9.6916,223
-1.3394,-10.0789,224
1.3849,-9.7708,225
1.8067,-8.6769,227
18.5575,-10.4112,228
6.4159,-9.8961,229
0.7861,-9.6628,230
-0.2622,-9.488,231
9.9427,-10.125,232
1.8549,-8.7563,233
1.8273,-9.9086,235
0.6324,-9.8638,236
0.3298,-10.0221,238
1.4339,-9.5944,239
1.8849,-9.9129,240
0.1333,-9.9582,241
-0.2019,-9.6417,243
0.1693,-9.8873,244
3.4908,-10.2321,245
-2.4563,-9.8163,246
0.7295,-9.7815,247
1.1585,-9.9651,248
-3.6849,-9.7523,249
-3.9173,-9.5983,250
-9.6563,-9.4623,251
-78.1942,-9.0812,252
-15.6621,-9.6252,253
1.8948,-9.7391,254
-6.4292,-9.6493,255
3.4222,-9.6373,256
-1.109,-9.7352,257
-5.0225,-9.7722,258
2.8623,-9.729,259
-9.027,-9.6798,260
-1.5216,-9.5798,261
4.3914,-9.634,262
5.4014,-9.7777,263
1.7455,-9.7945,264
33.9783,-9.3108,267
31.9438,-9.6002,268
1.1786,-9.7767,269
2.6504,-9.7908,270
-5.3723,-9.7733,271
-0.0204,-9.7588,272
-4.0009,-9.7089,273
0.5078,-9.7236,274
4.9191,-9.6905,275
4.4535,-9.7596,276
-8.9936,-9.727,277
-1.2943,-9.7783,278
-4.5541,-9.7317,279
5.3424,-9.7859,281
-13.7919,-9.6824,282
-0.397,-9.5991,284
-18.9539,-9.4421,285
-13.3113,-9.563,286
6.962,-9.6478,287
-3.791,-9.6749,288
0.0725,-9.6856,289
20.6748,-9.5805,290
-0.6264,-9.8457,291
0.3419,-9.8229,292
-0.3069,-9.8056,294
-3.5397,-9.787,295
5.2476,-9.7851,296
-18.8347,-9.6078,297
1.3786,-9.3182,298
13.2396,-9.4417,299
5.9212,-9.5863,300
4.2405,-9.7504,302
3.9072,-9.8167,303
-0.1195,-9.9747,304
0.6819,-9.7873,305
-4.9855,-9.9192,306
2.7449,-9.8884,308
1.2922,-9.7975,309
-17.2106,-9.7652,310
1.6276,-9.7215,311
-3.407,-9.8424,313
-3.0137,-10.0599,314
0.5561,-9.7884,316
-5.4398,-9.2236,317
-11.015,-9.8812,318
-9.4053,-9.531,319
-19.0187,-9.6489,320
-3.4759,-9.8535,321
-0.8512,-10.0769,322
-15.9861,-9.4711,323
9.1028,-9.8957,324
-2.113,-9.8233,325
3.2044,-9.7087,326
0.0031,-9.9313,328
-2.5761,-9.8825,329
-0.8199,-9.719,330
1.7956,-10.0293,332
2.383,-9.92,333
3.9239,-9.7972,335
-0.5552,-9.8441,336
0.3235,-9.8076,337
4.9079,-9.8953,339
1.3089,-9.8464,340
1.1818,-9.9532,341
0.588,-9.8092,342
3.0332,-10.0762,343
12.0607,-10.0583,344
3.8219,-9.7308,345
1.3578,-9.7725,346
1.4044,-9.8639,347
-0.7416,-9.4182,348
0.6215,-9.8382,349
4.5284,-9.7545,350
-1.6378,-9.9883,351
5.6912,-9.9207,352
0.1097,-9.7938,353
-0.2359,-9.8499,354
0.7659,-9.8791,355
-1.787,-9.7577,356
-0.3955,-9.8409,358
6.3113,-9.8631,359
-0.2356,-9.8886,360
1.226,-9.8387,361
8.0396,-9.9329,362
8.218,-9.4996,363
-1.2131,-9.8213,364
0.4092,-9.914,365
0.0742,-9.8729,366
5.8777,-9.8559,368
1.0379,-9.866,369
2.1522,-9.9634,370
-0.0541,-9.881,371
2.2852,-9.7922,372
4.0505,-9.7845,373
0.1314,-9.9068,374
-1.7071,-9.8224,375
2.0767,-9.7103,377
4.9353,-9.8058,378
1.2212,-9.8885,379
0.1295,-9.8659,380
6.9124,-9.7384,381
1.176,-9.8324,383
0.9284,-9.8146,384
9.4782,-9.7602,385
27.8589,-9.6562,386
1.5281,-9.8459,387
-0.1613,-9.8241,388
0.8269,-9.8253,389
12.7246,-9.8976,390
0.3591,-9.8595,392
3.978,-9.8476,393
0.2628,-9.807,394
1.7139,-9.9305,395
20.1067,-9.967,396
2.1017,-9.9717,397
0.3476,-9.7813,398
-0.0447,-9.8387,399
2.4724,-9.765,400
6.8777,-9.7111,401
-1.6979,-9.2921,402
-0.962,-9.7772,403
-8.5717,-9.7217,404
-1.4104,-9.8571,405
4.1884,-9.982,407
0.8246,-9.8283,408
-7.0111,-9.6906,409
-12.9211,-9.7917,410
12.1259,-10.1011,411
-0.381,-9.8875,413
-4.4731,-9.9012,414
9.1506,-9.5982,415
-4.5859,-9.602,416
8.4143,-9.6615,417
-1.8316,-8.4479,418
10.6068,-9.6463,419
1.316,-9.8365,420
13.0461,-9.8609,421
0.1838,-9.792,423
2.3818,-9.7506,424
3.2387,-9.2817,425
-0.0412,-9.8811,426
-0.6423,-9.9798,427
-7.1882,-9.7751,428
19.5144,-9.7689,429
-1.9227,-9.7918,430
0.8182,-9.6966,431
0.7424,-9.7856,433
3.0425,-9.7636,434
2.4782,-10.2748,435
-5.4899,-10.0008,436
-29.2626,-9.9352,437
-13.3174,-10.307,438
6.3412,-9.7631,439
-0.0611,-9.7815,440
0.2906,-9.7882,441
-1.1077,-9.8662,443
-1.7251,-9.8203,444
-3.7972,-9.6603,445
-0.0111,-9.8861,446
-0.4579,-9.8755,447
12.1235,-9.7315,448
-14.4446,-9.912,449
1.4912,-9.8578,451
-2.3805,-9.9327,452
-1.4016,-10.0629,453
0.4732,-10.1069,454
0.9441,-9.7782,455
-1.8376,-9.7692,456
2.4279,-9.7471,457
10.1697,-9.7109,458
5.3674,-10.0322,459
10.3626,-9.9171,460
2.2416,-9.8551,462
0.5505,-9.5429,463
4.3563,-9.8701,464
4.435,-9.9137,465
-2.1683,-9.9602,466
8.0856,-9.8578,467
9.8,-10.1596,468
12.3642,-9.6985,469
7.1318,-9.8212,470
4.3949,-10.1256,472
1.0605,-9.8057,473
10.9004,-9.6832,474
-12.6605,-9.7997,475
-64.1045,-9.5211,476
-0.1128,-9.8476,478
23.7625,-9.7316,479
-12.9916,-9.3856,480
-13.6419,-9.7857,481
2.3377,-9.4904,482
-13.2882,-9.8972,483
-14.5909,-9.7426,484
0.1587,-9.6859,485
14.6496,-10.0553,486
10.9569,-9.3336,488
-0.4352,-8.4622,489
-0.8874,-9.8484,490
-4.5848,-9.823,491
-10.8625,-9.6273,492
21.6774,-9.648,493
2.9254,-9.7771,495
7.7817,-9.7916,496
-7.8467,-9.8165,497
3.2622,-7.5607,499
-3.3474,-9.8931,500
-3.8439,-9.6066,501
5.0679,-9.8107,503
4.6675,-9.8791,504
0.283,-9.7954,505
-1.9101,-9.69,506
-4.5647,-9.8131,507
-13.4936,-9.6687,508
-4.3591,-9.9789,510
-4.2342,-9.6823,511
-10.6225,-9.8039,512
1.9544,-9.8305,513
-3.6771,-9.8235,514
3.9214,-9.7508,515
14.7209,-9.9866,516
-7.6248,-9.8352,517
-0.3186,-10.0544,518
-6.4136,-7.4475,519
-13.9413,-9.6234,520
-19.0364,-6.6291,521
-14.6327,-9.4827,522
-12.2469,-9.6995,523
-2.0568,-9.7878,524
-33.163,-10.0768,525
7.4515,-9.6083,526
-2.3675,-10.1375,527
12.4835,-9.7538,528
12.1461,-9.954,529
-0.1539,-10.081,530
21.5884,-9.6505,531
4.7419,-9.9103,533
1.4238,-9.8017,534
1.0743,-9.9425,535
1.371,-9.7076,536
11.0329,-9.846,537
25.6256,-9.7944,538
-0.5851,-9.9591,539
0.8431,-9.7387,540
15.0751,-9.7112,541
8.9418,-9.8534,543
-7.4968,-10.0467,544
-6.3583,-10.1171,545
-40.2981,-8.1044,546
0.6531,-9.5515,547
-10.1067,-9.4915,548
-0.9676,-9.2788,549
-0.0584,-9.9366,550
9.9906,-9.7962,552
3.2041,-8.919,553
-0.8689,-9.1771,554
1.2856,-9.7847,555
-2.1866,-9.8429,557
11.0802,-9.6073,558
1.2479,-10.3504,559
-0.2478,-9.9686,560
3.6481,-9.9094,561
6.5882,-7.4944,563
5.4819,-8.493,564
-11.3838,-9.7848,565
-1.8494,-9.8392,566
6.0816,-10.0257,567
0.0391,-9.693,568
3.479,-9.598,570
-6.0354,-9.9151,571
9.3543,-9.8138,572
-0.8085,-9.6957,573
1.0745,-9.9746,574
-2.3991,-9.7637,575
-3.959,-9.7719,576
-13.151,-9.9561,577
-5.3316,-9.5936,578
-1.3959,-10.3291,579
2.3791,-9.7877,580
-1.6923,-9.81,581
9.3905,-9.9353,582
6.0407,-9.8737,583
0.3252,-9.8653,584
0.7259,-9.3571,585
5.6035,-9.7808,586
-1.3149,-9.8291,587
-0.7581,-9.8914,588
-4.1791,-10.1716,589
-0.2964,-9.6691,590
-0.1844,-10.042,591
-0.469,-9.6975,593
-0.8077,-9.8186,594
1.4945,-9.7718,595
-4.1605,-9.7116,596
1.6401,-9.6038,597
0.8663,-9.757,598
-1.708,-9.6859,599
-1.5057,-9.7677,600
2.066,-9.8808,601
1.4373,-10.0093,603
0.38,-9.703,604
-0.7857,-9.9454,605
-11.6639,-9.96,606
3.8484,-9.5521,607
-11.6449,-10.3944,608
0.6094,-9.0933,609
42.6136,-9.0568,610
12.0408,-9.7481,612
0.1019,-9.448,613
0.9551,-9.4909,614
3.6481,-9.6032,615
2.1543,-9.8794,616
14.7155,-9.956,618
9.5399,-9.7229,620
5.0547,-9.9099,621
-1.5092,-9.4068,622
11.3277,-9.1263,624
1.0338,-9.8532,625
-2.1303,-9.7899,626
0.6513,-9.635,627
0.7371,-9.8401,628
-0.8827,-9.8859,629
-0.0624,-10.0149,630
-0.4103,-9.6813,631
2.9897,-10.167,632
0.5741,-9.644,633
-2.2012,-9.8404,634
0.3996,-9.907,635
3.2038,-9.8565,636
-0.3514,-9.8154,637
-0.4631,-9.8353,638
-0.5633,-9.9567,639
-0.4418,-9.6046,640
-1.7746,-9.5317,641
-0.0964,-9.9149,642
-0.9963,-9.7549,643
0.4867,-9.97,644
8.5435,-5.6227,645
-1.3619,-9.7333,646
1.5006,-10.0633,647
4.1167,-10.0205,648
1.2685,-9.566,649
1.2653,-9.9857,650
3.5186,-9.7925,651
1.3769,-9.5477,653
5.889,-9.8595,654
0.8206,-9.8714,655
6.1024,-9.6561,656
-1.7642,-9.7863,657
5.2754,-9.9071,658
9.1327,-10.147,659
0.9973,-9.5276,660
2.7791,-9.8311,662
0.1174,-9.9944,663
0.1477,-9.7417,664
0.1911,-9.7998,665
0.1919,-10.083,666
-2.5892,-9.4456,668
0.4561,-9.8504,669
1.3384,-9.6463,670
-0.3067,-9.791,671
-0.0586,-9.713,672
0.2856,-9.0649,673
6.283,-9.8886,674
-0.469,-9.839,675
-1.2337,-9.4642,676
3.5764,-9.5086,678
0.6171,-9.4964,680
4.8481,-9.9274,681
-1.6446,-9.6302,682
8.1696,-10.1337,684
5.8788,-11.4889,685
9.0558,-9.9578,686
8.7814,-9.8448,687
16.8225,-9.9519,688
2.3642,-9.9682,689
2.3134,-9.7253,690
4.0507,-9.8641,691
11.6981,-9.6966,692
0.981,-9.8444,693
-3.2673,-9.8983,694
1.6591,-9.8758,695
-1.872,-10.087,696
6.1599,-9.8986,697
0.262,-9.9264,698
-1.196,-9.9013,699
1.4124,-9.5705,700
38.2973,-9.7289,701
4.3787,-9.5299,702
3.2671,-9.7381,703
7.8337,-9.6641,704
1.0363,-9.8388,705
0.5968,-9.8876,706
1.1953,-9.8409,708
1.8425,-9.7885,709
-0.5276,-9.8194,710
9.7714,-9.8899,711
-0.1886,-9.8889,712
1.2634,-9.9491,713
5.4793,-9.7495,714
-0.9397,-9.8386,715
-4.256,-9.2839,716
-1.1656,-9.8755,718
5.4508,-9.9712,719
6.7767,-9.3382,720
1.8055,-9.4967,721
1.0248,-9.2072,722
-1.0858,-9.9837,723
3.8362,-9.8613,724
1.8477,-9.0349,725
14.8452,-9.4697,726
0.0012,-9.9693,728
0.3424,-9.6508,729
-0.1719,-9.8683,730
11.9509,-8.834,731
-18.113,-9.4647,732
14.8224,-9.6785,733
-5.0868,-9.669,734
-0.3839,-9.254,735
4.0378,-9.8899,737
6.4946,-9.6249,738
6.0509,-9.3573,739
3.6773,-10.2148,740
4.0259,-10.0259,741
6.0544,-9.7676,743
0.0153,-9.5784,744
-2.0195,-9.901,745
5.0813,-9.5161,746
-1.0733,-10.1469,747
16.5823,-9.1818,748
-0.8671,-9.6022,749
-4.1786,-9.7231,750
7.247,-8.9661,751
4.1554,-9.803,753
19.005,-9.9979,754
1.652,-10.1918,755
-0.5991,-10.1378,756
-0.4592,-9.8411,757
2.8454,-9.7322,758
-1.1454,-9.4291,759
2.4692,-9.7747,760
-0.9263,-10.0549,761
-0.1671,-9.7903,762
3.5925,-9.3613,763
4.261,-9.8211,764
11.0795,-10.0085,765
0.638,-9.7133,766
1.9605,-9.8765,768
-2.2564,-10.0206,769
-1.3677,-9.5208,770
6.93,-9.9967,771
6.4273,-9.7405,772
-2.8808,-9.8633,773
3.1271,-10.4697,774
8.8276,-9.7498,775
10.6087,-9.6469,777
-12.377,-9.6764,778
-4.5821,-9.4042,779
-0.9126,-9.768,780
0.8328,-10.0902,781
-0.7129,-9.7657,783
-2.0844,-9.8006,784
-1.0736,-9.9204,785
0.2047,-9.8148,786
-1.6264,-9.672,787
-14.4823,-9.7331,788
-0.8685,-9.8795,789
1.7511,-9.8117,790
-2.3935,-9.7426,792
-4.1363,-9.7336,793
-10.7333,-9.7909,794
9.8539,-9.9658,795
-6.4196,-9.8626,797
-0.3726,-9.8498,798
-5.1604,-9.7685,799
-0.4246,-9.7998,800
0.647,-9.9911,802
-10.5331,-9.8513,803
2.0746,-9.6326,804
-6.0857,-10.15,805
3.7917,-9.5702,806
-0.3704,-9.6702,807
-2.3896,-9.5453,808
-0.6885,-9.7791,809
-3.8234,-9.4312,810
-9.5518,-9.0526,811
-4.5823,-10.0424,812
3.2515,-10.1542,813
2.3677,-8.8293,814
2.2313,-9.9845,815
16.7067,-10.5156,816
1.7425,-8.1579,817
-0.1925,-9.8251,818
3.713,-9.6939,819
-0.5807,-9.8081,820
2.9484,-9.7637,822
0.7379,-9.2445,823
-0.0194,-10.5226,824
3.0746,-9.6577,825
1.0574,-9.9396,827
0.3942,-9.8284,828
5.4059,-10.0937,829
1.1904,-9.7228,830
0.8682,-10.1755,831
0.7237,-9.6246,833
0.9075,-9.8274,834
1.9415,-9.5952,835
6.9581,-9.3565,836
-0.0834,-10.0275,837
-0.948,-10.1418,838
-0.6545,-9.4577,839
5.7273,-9.9229,840
7.6702,-9.6817,841
1.8007,-9.7917,843
3.6071,-9.7559,844
-0.8275,-9.7695,845
-1.6457,-10.0159,846
2.539,-9.5506,847
-0.7538,-9.7613,848
2.7579,-9.503,849
2.0614,-9.7728,850
1.3376,-9.9808,851
2.4617,-10.0386,853
2.5282,-9.6708,854
4.1433,-10.2661,855
14.101,-9.2437,856
4.9213,-10.063,858
7.6023,-9.3573,859
3.7475,-9.9715,861
-1.6328,-9.6989,862
3.4111,-9.6687,863
1.2019,-9.9446,864
3.8152,-9.8146,865
9.0172,-10.1519,866
-3.3697,-9.5762,867
-5.7258,-9.9151,868
3.7584,-9.8914,869
13.9017,-9.9162,870
-10.3861,-9.9651,871
4.6206,-9.721,872
-1.6271,-9.7866,873
-4.9926,-10.1487,874
2.2774,-9.6866,875
-1.4844,-9.638,876
-0.3166,-9.8424,877
-0.1877,-9.5093,878
4.7695,-9.4402,879
-14.5974,-9.5886,880
7.3565,-9.6066,881
0.7442,-9.8463,883
1.5407,-9.308,884
-0.9406,-9.5613,885
-2.3693,-9.9553,886
1.3372,-9.7216,887
1.7074,-8.7748,888
-6.4804,-9.7718,889
17.452,-9.8564,890
5.4551,-9.7456,892
-6.6092,-9.6337,893
5.0954,-8.5837,894
2.881,-9.9675,895
-0.5098,-9.6506,896
-2.5175,-9.9417,898
-1.7811,-9.4881,899
-5.4006,-9.91,900
7.0155,-9.4627,901
-0.2417,-9.2512,902
-2.7657,-9.58,903
-1.1611,-9.9355,904
5.7769,-10.0498,905
12.9777,-9.1678,907
-2.6275,-9.7982,908
-4.2282,-9.0503,909
-2.5662,-9.9009,910
0.8045,-9.1132,911
-1.6685,-9.7396,913
0.6607,-10.0238,914
0.9352,-9.4981,915
-5.0252,-9.8703,916
-0.8303,-9.925,917
5.5683,-9.5579,919
3.8059,-9.6116,921
-0.2829,-9.8717,922
-0.116,-9.6407,923
9.1689,-9.7828,924
-2.1836,-9.7433,925
6.004,-9.7398,926
-1.6229,-10.0634,927
-6.179,-10.2806,928
-3.8736,-9.5597,929
17.4428,-9.8649,930
11.1027,-8.901,931
3.855,-9.5119,932
-1.5413,-9.6447,933
-5.5416,-9.4861,934
0.1774,-9.7536,935
5.5127,-9.981,936
-1.5907,-9.8489,938
3.3598,-9.3825,939
1.8201,-9.9176,940
-0.9421,-9.1298,941
2.6664,-8.931,942
4.3129,-9.6498,943
0.5048,-10.1832,944
3.9274,-8.3517,945
-1.9796,-9.8503,946
-3.3188,-9.4153,948
-0.4898,-9.9226,949
-4.3606,-10.0099,950
-7.2543,-9.4992,951
-6.7741,-9.4054,952
-3.7128,-9.626,953
8.2357,-10.0328,954
0.5998,-9.7793,955
-10.176,-10.1726,956
2.9924,-9.9705,958
8.4535,-9.7637,959
-1.0058,-9.8485,960
4.4012,-9.9403,961
3.7191,-9.8581,962
1.9596,-9.2774,963
5.8574,-9.8617,964
1.2791,-9.5979,965
-0.9224,-9.7066,966
3.6502,-9.8544,968
2.6961,-9.8715,969
5.7849,-9.7458,970
0.745,-10.0916,971
0.5059,-9.6202,972
2.4923,-9.6498,973
-5.016,-9.868,974
6.5945,-9.7499,975
2.0065,-9.8278,976
-4.6631,-10.0782,978
8.8723,-9.7109,979
6.1391,-8.9394,980
20.4565,-9.9509,981
-10.5409,-9.952,982
0.288,-9.5081,983
0.4927,-9.8854,984
0.5771,-9.9118,985
0.5387,-9.8502,986
0.2193,-10.233,987
0.8806,-9.8693,988
-0.112,-9.6385,989
0.2551,-9.7147,990
0.0732,-9.7048,991
1.4154,-9.8529,992
1.1757,-9.9219,993
-0.77,-9.8839,994
0.4733,-9.8308,995
0.1126,-9.8065,996
-0.6495,-9.8831,997
1.0918,-9.8825,998
1.602,-9.7989,999
-20.4867,-9.7317,1000
4.0144,-9.5968,1001
2.4217,-9.6827,1002
12.1725,-9.6666,1003
-8.5042,-9.7019,1004
3.3825,-9.743,1005
1.7461,-9.7759,1006
-0.9214,-9.7562,1008
2.1972,-9.7074,1009
4.8278,-9.7372,1010
1.6764,-9.7753,1011
-0.0928,-9.8311,1012
-0.8773,-9.8441,1013
-1.5255,-9.7844,1014
8.3298,-9.7533,1015
-2.3696,-9.8131,1016
7.0739,-9.8045,1018
2.7532,-9.7445,1019
6.4086,-9.7692,1020
4.5796,-9.7775,1021
0.8652,-9.8344,1022
-2.5053,-9.8162,1023
-0.9136,-9.6987,1024
-0.0588,-9.8217,1025
1.2153,-9.917,1026
-3.2833,-9.8809,1028
3.2755,-9.934,1029
5.0041,-10.0935,1030
9.0085,-9.6073,1031
1.6334,-9.7771,1032
19.1443,-9.7876,1033
-4.9687,-9.8018,1034
14.2779,-9.8714,1035
9.5056,-9.8255,1037
1.2564,-9.793,1039
-3.2354,-9.7348,1040
-0.0223,-9.7707,1041
-4.7955,-9.8493,1042
1.385,-9.8145,1043
3.1802,-9.7459,1044
0.5926,-9.727,1045
-3.0208,-9.9022,1046
2.6913,-9.925,1047
0.1334,-9.8088,1048
-1.2441,-9.8626,1049
4.5819,-9.7139,1050
0.9925,-9.9827,1051
1.6305,-9.9171,1052
-0.3742,-9.8071,1053
3.3512,-9.8051,1054
1.4106,-9.9626,1055
2.2826,-9.9023,1056
8.2561,-9.7684,1057
12.9525,-9.7874,1058
3.5338,-10.0525,1059
9.4451,-9.9364,1060
1.1839,-9.7225,1061
-1.8605,-9.819,1063
-13.4813,-9.7792,1064
-10.5644,-9.7934,1065
6.4653,-9.801,1066
-4.6413,-10.0531,1067
1.8622,-9.767,1068
-11.1743,-10.2125,1069
1.0396,-9.8195,1070
2.9727,-9.8476,1071
0.6932,-9.8542,1073
9.7427,-9.9015,1074
4.6257,-9.81,1075
8.4517,-9.7081,1076
10.6536,-9.57,1077
1.276,-9.8027,1078
1.9343,-9.89,1079
7.3527,-9.8088,1080
-20.9763,-9.6295,1081
-5.3303,-9.5985,1083
-12.0808,-9.7607,1084
-2.435,-9.9839,1085
-5.1374,-9.679,1086
-9.221,-9.7805,1087
21.2775,-9.5088,1088
-25.7842,-9.6253,1089
-1.3109,-9.8575,1090
-7.8545,-9.7783,1092
-14.079,-9.7562,1093
-7.0087,-9.7793,1094
2.3567,-9.7483,1095
3.604,-9.6786,1097
-4.2376,-9.7436,1098
3.0055,-9.6775,1099
-4.8704,-9.8173,1100
2.2297,-9.7144,1101
-0.4578,-9.5925,1102
-6.4491,-9.695,1103
-18.0136,-9.6086,1104
-8.9949,-9.9209,1105
-3.423,-9.6783,1106
-9.5527,-9.7961,1107
-12.9407,-9.8212,1108
-15.59,-9.6412,1109
18.8616,-10.0345,1110
12.1273,-9.6888,1111
0.4196,-9.7508,1112
-12.9044,-9.53,1113
-3.9772,-9.7046,1114
-2.9442,-9.9558,1115
-12.5444,-10.0412,1116
8.0259,-9.9786,1117
-11.5342,-9.7879,1118
-0.6275,-9.8767,1119
-3.5001,-9.8407,1120
-10.2077,-9.7311,1121
13.9769,-9.7639,1123
27.133,-9.9734,1124
6.4405,-10.1758,1125
19.1681,-9.4111,1126
1.015,-9.6697,1127
48.3999,-9.3324,1128
-4.8157,-9.6396,1129
8.2154,-9.5942,1131
0.2123,-9.4397,1132
6.1963,-9.4446,1133
33.7815,-9.2417,1134
5.6975,-9.6759,1135
-6.522,-9.4612,1137
0.9243,-9.5124,1138
12.7428,-9.5187,1139
-1.7194,-9.569,1140
-32.4711,-9.7155,1141
25.2113,-9.236,1143
4.6338,-9.5432,1144
-1.4624,-9.6887,1145
-9.0383,-9.5684,1146
0.7543,-9.5943,1147
-18.4968,-9.48,1148
13.6838,-9.5648,1150
-2.7522,-9.7166,1151
2.983,-9.5897,1152
4.4133,-9.6584,1153
4.656,-9.7823,1154
-6.2395,-9.6499,1155
5.0174,-9.7695,1157
1.1721,-9.6838,1158
-0.8507,-9.8208,1159
0.029,-9.7012,1160
-1.9123,-9.6879,1161
-16.0358,-9.4635,1162
13.86,-9.4618,1163
5.3959,-9.7245,1164
0.5738,-9.7949,1165
-0.3826,-9.7614,1166
-0.4311,-9.5071,1167
21.7834,-9.7226,1168
-3.5268,-9.8493,1169
0.4036,-9.7948,1170
2.9236,-9.9612,1171
-7.4862,-9.5915,1172
-3.754,-10.0016,1173
2.395,-9.7012,1174
6.4282,-9.9405,1175
-5.4655,-9.8261,1176
5.3976,-9.6886,1177
30.1268,-9.7868,1178
20.9091,-10.0588,1179
-4.8035,-9.6604,1180
-1.6716,-9.8468,1182
-2.7196,-9.5133,1183
-0.2489,-9.8419,1184
-5.711,-9.7828,1185
-11.0793,-9.7212,1187
13.2979,-9.6902,1188
-5.0419,-9.7549,1189
-7.7876,-9.6614,1190
15.6148,-9.5819,1191
-0.7752,-9.7458,1193
-1.9751,-9.8288,1194
-15.6286,-9.7084,1195
-23.9369,-9.5431,1196
22.2992,-9.5449,1197
-4.6201,-9.8591,1198
1.2767,-9.8276,1199
8.9871,-9.6558,1200
1.379,-10.066,1201
-13.0615,-9.7066,1203
13.4773,-9.8605,1204
10.4304,-9.9657,1205
3.0799,-9.5286,1206
2.0626,-9.7887,1207
-1.6722,-9.8485,1208
-1.4864,-9.5918,1209
-9.2589,-9.3726,1210
5.9553,-10.0721,1211
-6.9547,-9.8686,1213
-11.9812,-9.4396,1214
-5.0369,-9.6612,1215
0.2987,-10.139,1217
3.4435,-9.7684,1218
2.5198,-9.9097,1219
0.6793,-9.8952,1220
-2.6463,-9.846,1221
-2.4487,-10.2404,1222
4.1664,-9.8919,1223
4.8073,-9.8102,1224
4.1419,-9.8405,1225
6.6749,-10.1706,1227
2.2743,-10.0308,1228
6.9502,-9.3467,1229
-0.2863,-9.8855,1230
32.9675,-9.9899,1231
15.9381,-9.4872,1232
2.2272,-9.7951,1233
5.2516,-9.8067,1234
-0.595,-9.7888,1235
-2.6817,-9.7513,1236
3.6313,-9.5628,1237
-0.2251,-10.1738,1238
0.5634,-9.9092,1239
0.8671,-9.8473,1240
0.6936,-9.9321,1242
0.581,-9.8981,1243
1.1193,-9.6939,1244
-21.6304,-9.7578,1245
-3.1119,-9.8021,1247
-3.7875,-9.7774,1248
-4.0523,-9.9261,1249
-0.304,-9.826,1250
0.1768,-9.7504,1251
-2.4084,-9.7774,1253
-5.2788,-9.9514,1254
1.8859,-9.8501,1255
-2.0281,-9.9352,1256
17.3013,-9.5043,1257
-2.8895,-9.5952,1258
19.085,-9.756,1259
5.1882,-9.8652,1260
-23.9352,-9.5803,1261
-11.816,-9.8818,1263
-1.6299,-9.7319,1264
0.5872,-10.1089,1265
1.0476,-9.6137,1266
0.8378,-10.3895,1267
-1.5203,-8.747,1268
6.1179,-10.0423,1269
18.1937,-10.018,1270
40.3717,-9.8789,1272
3.451,-9.3295,1273
-0.8699,-10.1068,1274
1.1222,-9.8668,1276
6.8224,-9.7991,1277
2.2315,-9.8705,1278
1.6316,-9.7161,1279
1.3149,-9.8377,1280
-0.1246,-9.7618,1281
0.1462,-9.9063,1282
2.0511,-9.8436,1283
0.4273,-9.8272,1284
-1.5229,-9.8211,1285
-6.1602,-9.8182,1286
6.188,-9.8764,1287
0.1202,-9.8762,1288
0.7084,-9.7828,1289
-0.0292,-9.7915,1290
-0.1041,-9.6942,1291
0.0777,-9.84,1292
11.4475,-9.9578,1293
-1.5282,-9.8319,1295
11.3556,-9.8097,1296
-4.9862,-9.8731,1297
8.2571,-9.6958,1298
1.9128,-10.1342,1299
1.639,-9.8216,1300
6.2087,-9.8343,1302
1.7185,-9.8646,1303
-5.6383,-9.8608,1304
-0.2082,-9.8276,1305
-0.2709,-9.888,1307
-8.8735,-9.8231,1308
-10.4233,-9.6655,1309
-1.4219,-9.8017,1310
-19.7006,-9.6613,1311
10.9557,-9.6937,1313
-3.6359,-9.8547,1314
1.5911,-9.6471,1315
1.1755,-9.7369,1316
9.2237,-9.7703,1317
-0.3012,-9.8874,1318
-3.9102,-9.8154,1319
6.0803,-9.93,1320
6.5746,-9.8294,1321
0.9518,-9.8425,1323
10.8889,-9.7321,1324
20.1155,-9.7906,1325
0.2687,-9.8177,1326
1.529,-9.9078,1327
2.9952,-9.9802,1328
-2.2466,-9.8114,1329
4.5677,-9.9182,1331
6.2217,-9.7594,1332
4.3294,-9.8596,1333
1.3306,-9.8151,1334
0.2583,-9.9013,1335
-3.9957,-9.7472,1336
-0.1402,-9.8931,1337
0.6102,-9.8186,1338
2.2385,-9.8201,1339
0.2071,-9.8153,1340
0.7839,-9.6998,1341
-0.8771,-9.8185,1342
0.6138,-9.8197,1343
-2.4022,-9.8184,1344
4.375,-9.8266,1345
-1.3835,-9.8771,1346
20.1082,-9.8363,1347
-1.0618,-9.8288,1348
2.7963,-10.0154,1349
0.285,-9.7631,1350
-0.4755,-10.0264,1351
-0.0818,-9.6499,1352
0.8312,-8.5197,1353
-15.9473,-9.9115,1354
-1.8096,-9.7454,1355
-2.4268,-9.6423,1357
-2.9733,-9.9959,1358
-2.2729,-9.7146,1359
5.7308,-8.9216,1360
1.7541,-9.6778,1361
0.3004,-9.4358,1362
8.7684,-10.071,1363
4.9025,-9.9036,1364
0.0503,-10.2628,1365
0.447,-9.8037,1366
-0.2657,-10.4008,1367
-1.6469,-9.5078,1368
-1.789,-8.7317,1369
0.6106,-9.565,1370
0.6381,-7.9343,1372
0.7614,-9.9493,1373
6.1874,-9.5523,1374
1.9648,-9.7396,1375
2.2008,-9.7842,1377
6.7474,-9.3517,1378
1.4294,-9.891,1379
6.8073,-9.6634,1380
0.2926,-8.763,1382
10.4908,-9.6415,1383
10.7555,-9.8218,1384
2.4994,-10.0541,1385
4.8045,-9.6715,1387
15.3148,-9.9887,1388
23.4486,-9.6962,1390
18.046,-10.0173,1391
2.1236,-9.7382,1392
12.6339,-10.048,1393
4.7909,-10.115,1394
5.115,-9.7868,1395
-0.3567,-9.9753,1396
0.9694,-9.7739,1397
3.2508,-9.7849,1398
0.4054,-9.6448,1399
0.6418,-9.0363,1400
-0.7113,-9.4883,1401
0.9293,-9.6761,1402
2.1152,-9.7826,1403
5.1033,-9.7804,1404
1.3951,-9.8488,1405
0.7857,-8.3923,1406
-0.3237,-9.73,1407
0.453,-9.6492,1408
0.4657,-8.0947,1409
3.2254,-9.607,1410
2.1074,-9.3145,1412
7.9861,-9.7419,1413
9.7863,-9.8416,1414
1.7113,-9.8373,1415
11.1367,-9.8988,1416
1.2187,-9.7606,1417
-2.6645,-9.8227,1418
2.9374,-8.7001,1419
2.054,-9.8594,1420
0.2925,-9.8156,1421
4.5188,-9.9966,1422
1.6557,-9.7823,1423
3.0557,-9.8252,1424
1.3472,-9.9686,1425
1.5775,-9.7794,1426
2.4377,-9.798,1427
-0.3405,-9.8792,1428
3.6025,-9.8459,1429
4.371,-9.7296,1430
-0.3007,-9.8804,1431
0.8332,-9.8879,1433
1.655,-9.818,1434
2.6784,-9.8615,1435
2.3133,-9.663,1436
0.6904,-9.7241,1437
0.8977,-9.8563,1438
2.2685,-9.6972,1439
3.4401,-9.8429,1440
-0.6204,-9.8953,1442
-0.7229,-9.8112,1443
0.9322,-9.8097,1444
3.2061,-9.8029,1445
0.6684,-9.8993,1447
3.2066,-9.8266,1448
1.1111,-9.8856,1449
1.1104,-9.6599,1450
0.5726,-9.9506,1451
-0.1569,-9.7934,1452
2.4547,-9.9751,1453
2.2578,-9.6684,1454
5.0332,-9.969,1455
3.3454,-9.9388,1456
15.8418,-9.7853,1457
3.5762,-9.9378,1458
3.0013,-9.905,1459
3.9954,-9.6663,1461
-0.2837,-10.0982,1462
0.3651,-9.7645,1463
5.6071,-9.8624,1464
1.6131,-9.665,1465
0.3504,-9.8405,1467
0.4679,-9.8041,1468
0.6301,-9.793,1469
0.8126,-9.7913,1470
0.8317,-10.2332,1471
-1.7005,-9.8279,1472
15.7873,-9.2718,1473
2.0092,-9.605,1474
0.235,-9.736,1475
2.8934,-9.9015,1476
1.874,-9.9387,1477
4.0856,-9.8235,1478
0.7526,-9.8234,1479
2.0994,-9.7073,1480
0.2443,-10.0348,1482
-0.0581,-7.1132,1483
2.9417,-9.8688,1484
1.6077,-9.4545,1485
3.3881,-9.827,1486
-14.291,-9.7145,1488
-3.1188,-9.8654,1489
-1.2013,-10.0502,1490
0.0148,-9.7617,1491
-0.372,-9.4801,1492
8.483,-9.6832,1493
-29.0612,-9.6657,1494
-2.7277,-9.7636,1495
-0.856,-9.8899,1496
-3.5237,-9.8824,1498
-5.5438,-9.7759,1499
4.6893,-8.9957,1500
5.4713,-9.7957,1501
-6.3538,-9.7878,1502
11.3196,-9.6275,1503
-2.6185,-9.9459,1504
6.0235,-9.8064,1505
0.2611,-9.7994,1507
-6.5175,-9.7422,1508
7.5441,-9.825,1509
2.5433,-9.5893,1510
-5.3535,-9.3779,1511
0.6595,-9.9197,1512
1.4632,-9.2538,1513
-16.5962,-10.1861,1514
7.8187,-9.8175,1515
-12.726,-10.6675,1516
-37.2853,-9.9065,1517
-5.3023,-9.7088,1518
1.0474,-9.7279,1519
0.8926,-9.612,1520
2.1285,-9.5106,1521
-29.5405,-9.8538,1522
7.1235,-9.5527,1523
1.1069,-9.6333,1524
1.3145,-10.0263,1525
6.4929,-9.9103,1526
14.2987,-9.576,1527
1.8194,-9.9523,1528
2.8956,-9.8793,1529
3.9324,-9.8649,1530
-38.8719,-10.1135,1531
6.365,-9.7608,1533
1.112,-9.7656,1534
3.7457,-9.881,1535
10.2514,-9.691,1536
-2.7526,-10.0493,1537
21.4437,-9.5399,1538
-36.6166,-9.8548,1539
2.4033,-9.6229,1540
-12.0513,-9.832,1542
-6.0512,-9.5651,1543
-20.7109,-9.7592,1544
-10.3542,-9.8791,1545
-10.6906,-9.3377,1547
0.8137,-9.6776,1548
0.1885,-10.2636,1549
13.6073,-9.7215,1550
7.1614,-10.0525,1551
8.1467,-9.8618,1553
0.9183,-9.9519,1554
3.8303,-9.8773,1555
-0.0497,-10.0667,1556
2.04,-9.8752,1557
0.3118,-9.9381,1558
-4.8711,-9.6347,1559
1.0805,-9.8177,1560
6.4271,-9.6293,1561
3.847,-9.8388,1563
0.6476,-9.6243,1564
-1.3697,-9.8285,1565
-3.2345,-10.0951,1567
-0.0603,-9.647,1568
5.3685,-9.6197,1569
4.5841,-9.5683,1570
2.0073,-9.8216,1571
11.3089,-10.035,1572
5.3682,-9.9208,1573
5.1401,-9.6024,1574
0.3478,-9.8713,1575
-2.5835,-9.459,1576
9.4774,-9.6894,1577
-1.6558,-9.6924,1578
1.0994,-9.8234,1579
-0.7775,-10.1566,1580
8.4304,-10.0821,1581
3.3351,-10.005,1582
2.7397,-9.9243,1583
2.3142,-9.9958,1584
7.9903,-9.8047,1585
0.3239,-9.4265,1586
-1.1468,-10.3321,1587
-29.9597,-9.8695,1588
1.1455,-9.6789,1589
-0.7654,-9.339,1590
-7.6662,-8.8622,1591
-1.7821,-9.2355,1592
-7.9867,-9.0819,1593
-38.6228,-9.9915,1594
-6.9613,-9.7463,1595
0.9067,-9.5286,1597
5.8181,-10.0408,1598
0.776,-9.5711,1599
1.6295,-9.8347,1600
-1.3645,-10.4388,1601
1.9378,-9.89,1603
1.3934,-9.8581,1604
5.22,-9.6186,1605
21.7349,-10.3214,1606
-1.2058,-9.8755,1607
-0.2317,-9.6208,1608
2.2699,-9.5788,1609
-0.6832,-9.8843,1610
0.7734,-10.1398,1611
0.6057,-9.7077,1613
5.699,-9.9295,1614
0.9131,-9.291,1615
-0.7704,-9.3747,1616
-1.654,-10.0291,1617
0.2903,-9.6275,1618
4.4413,-9.5538,1619
-4.0743,-9.7853,1620
-20.1983,-9.6404,1622
-3.6652,-9.3299,1623
17.864,-9.4331,1624
-5.6546,-9.4624,1625
0.6749,-9.6822,1626
0.7241,-9.7081,1627
-1.5292,-9.8262,1628
-1.1265,-9.8527,1629
5.7566,-9.8011,1630
-5.007,-9.929,1631
7.9894,-9.735,1633
7.534,-9.4465,1634
-2.8073,-9.6536,1635
5.6432,-9.4653,1636
-10.2365,-9.6304,1637
-1.2523,-9.9608,1638
-5.0062,-10.2024,1639
-1.8076,-9.7736,1640
-0.5368,-9.9086,1641
0.5419,-9.8034,1642
2.197,-9.7027,1643
-3.0804,-9.7788,1644
-1.0104,-9.8245,1645
-3.3703,-9.8845,1646
0.7158,-9.7855,1647
0.6307,-9.8359,1648
-2.3576,-9.7355,1650
10.5256,-9.6788,1651
3.3924,-10.0131,1652
0.4909,-9.7259,1653
-0.8135,-9.4465,1654
7.8134,-9.7982,1655
-8.9592,-10.0118,1656
-0.4526,-9.7614,1658
3.0999,-9.9495,1659
12.5704,-9.8912,1661
-0.9982,-9.6876,1662
-5.9866,-9.7739,1665
8.5834,-9.7798,1666
-0.8955,-9.7881,1668
-1.4284,-9.8395,1669
11.1187,-9.8751,1670
3.5707,-9.7012,1671
0.1662,-10.2206,1672
-2.9915,-9.6637,1673
0.7857,-9.9046,1674
1.8753,-9.8296,1675
-0.7151,-9.9709,1676
1.5306,-9.864,1678
-0.1227,-9.9075,1679
4.6137,-9.9401,1680
-0.496,-9.7002,1681
-6.3345,-9.7701,1683
6.5085,-9.6899,1684
-0.2534,-9.8814,1685
5.014,-9.7629,1686
-0.8971,-9.7834,1687
-0.5247,-9.9404,1688
-0.1716,-9.8225,1689
0.0165,-9.7696,1690
6.4829,-9.8509,1691
1.056,-9.7743,1692
0.4512,-9.8871,1693
3.5973,-9.8848,1694
-3.5484,-9.7913,1695
11.3789,-9.5503,1696
-5.7542,-9.7697,1697
-2.1494,-9.8089,1698
-2.8088,-9.9022,1699
-0.8504,-9.8646,1700
-0.571,-9.8558,1701
-4.5239,-9.7927,1702
2.5361,-9.7436,1703
0.1312,-9.8019,1704
0.1785,-9.828,1705
-2.3044,-9.8137,1706
0.0543,-9.8418,1707
7.0204,-9.7488,1708
-4.3419,-9.8084,1709
-5.9613,-9.7499,1710
10.5239,-9.7394,1711
-0.7963,-9.7579,1713
-3.9991,-9.6829,1714
12.8377,-9.6772,1715
-9.8873,-9.671,1716
4.6054,-9.7079,1717
4.927,-9.8004,1718
-27.2361,-9.4785,1719
-1.8785,-9.8365,1720
0.9695,-9.822,1721
0.9621,-9.7785,1723
-1.468,-9.8191,1724
-5.6072,-9.7646,1725
9.6273,-9.7588,1726
-0.4465,-9.8346,1727
2.9455,-9.8169,1728
-3.5374,-9.7927,1729
0.5337,-9.8219,1730
-6.2697,-9.7876,1731
-0.8356,-9.77,1733
-4.1014,-9.8048,1734
-2.8571,-9.7879,1735
5.6712,-9.724,1736
0.5159,-9.8504,1737
-0.2896,-9.8022,1738
0.37,-9.8074,1739
2.8336,-9.8319,1740
-11.3477,-9.7655,1742
4.424,-9.5864,1743
10.045,-9.6427,1744
3.5851,-9.773,1745
1.9073,-9.7965,1746
1.5674,-9.8248,1747
-0.9407,-9.8094,1748
-8.6599,-9.6858,1749
4.542,-9.6857,1750
3.1394,-9.7524,1751
-3.7623,-9.686,1752
2.5685,-9.6374,1753
12.1292,-9.6944,1754
3.1256,-9.8297,1755
-0.2556,-9.8434,1756
0.4994,-9.8227,1757
2.4052,-9.9007,1758
1.1058,-9.8985,1759
-2.1708,-9.7904,1760
4.2579,-9.7664,1761
8.7259,-9.8336,1762
-0.4587,-9.7335,1763
1.4872,-9.85,1764
2.5423,-10.0133,1765
2.4278,-9.7956,1766
3.0509,-9.6972,1767
3.4714,-9.8214,1768
0.0265,-9.7817,1769
2.2887,-9.831,1770
6.0748,-9.8204,1771
7.0409,-9.7202,1772
-0.1343,-9.9169,1773
1.5953,-9.977,1774
-0.3711,-9.8622,1775
7.9584,-9.8968,1776
0.6266,-9.8788,1778
-1.1904,-9.839,1779
4.0571,-9.7784,1780
2.9469,-9.7981,1781
3.7523,-9.6772,1782
-0.3361,-9.8576,1783
2.2437,-9.8989,1784
2.408,-9.8341,1785
1.1472,-9.6222,1786
1.7041,-9.8321,1788
0.3833,-9.8185,1789
-0.3234,-9.6135,1790
7.077,-9.7237,1791
3.1645,-9.863,1792
-0.4763,-9.7456,1793
1.9004,-9.8471,1794
2.7685,-9.7994,1795
3.7911,-10.0299,1796
2.895,-9.8492,1798
0.5759,-9.8282,1799
1.0041,-9.8483,1800
1.5203,-9.8514,1802
1.1538,-9.8752,1803
-0.4033,-9.9422,1804
-0.452,-9.7984,1805
2.4314,-9.9178,1806
-2.1475,-9.7853,1807
8.6701,-9.9608,1808
-6.11,-9.8423,1809
9.8065,-9.9123,1810
1.5749,-9.7482,1811
-1.2327,-9.8453,1812
1.0006,-9.8601,1813
-5.2501,-9.7016,1814
-12.1042,-9.736,1815
-0.4544,-9.8736,1816
-6.482,-9.8706,1817
8.9075,-9.7876,1818
-3.771,-9.8857,1819
-7.5479,-9.7626,1820
-0.1892,-9.655,1821
-0.9197,-9.8081,1822
-10.402,-9.8574,1823
25.005,-9.9428,1824
4.7483,-9.6942,1825
-0.177,-9.8989,1826
8.1255,-9.8484,1827
-7.4911,-9.911,1828
0.3616,-9.7791,1829
-0.1662,-9.8864,1830
-3.8128,-9.6941,1831
0.2416,-9.6819,1833
-0.0493,-9.8264,1834
22.0181,-9.7013,1835
-0.4066,-9.9302,1836
-1.7826,-9.8521,1837
-8.2028,-9.7881,1838
5.3852,-9.5871,1839
2.9253,-9.7906,1840
4.8475,-9.8366,1841
1.0369,-9.8623,1843
1.0615,-9.7652,1844
3.4788,-9.6445,1845
-6.4099,-9.9844,1846
-0.4442,-9.5088,1847
4.8052,-9.7992,1848
5.128,-9.7482,1849
1.2515,-9.8769,1850
0.9684,-9.7686,1852
1.098,-9.9904,1853
-0.2963,-9.9073,1854
3.556,-9.9111,1855
1.5707,-9.8937,1856
-0.1484,-9.8873,1858
7.0209,-9.2856,1859
1.3401,-9.8756,1861
-1.5261,-10.0324,1862
2.1188,-9.9037,1863
7.96,-9.8123,1864
-0.3683,-9.9204,1865
0.9469,-9.7454,1866
3.3373,-9.9404,1867
2.3147,-9.8066,1868
-11.6661,-9.7364,1869
1.2261,-9.8303,1870
-1.0351,-9.6161,1871
0.6872,-9.8794,1872
-1.4076,-9.5809,1873
-0.2261,-9.9034,1874
0.2275,-9.8249,1876
-9.2751,-9.8117,1877
5.2392,-10.4263,1878
-1.5181,-9.8732,1879
13.5301,-9.1114,1880
1.7089,-9.7739,1882
-0.3405,-9.8932,1883
0.3159,-9.8687,1884
-1.4417,-9.8197,1885
0.7822,-9.9259,1886
-0.3135,-9.9017,1887
-0.4471,-9.8881,1888
2.2899,-9.8658,1889
0.0961,-9.798,1890
-0.0824,-9.9136,1892
0.4169,-9.8467,1893
0.4899,-9.8502,1894
-1.3818,-9.8219,1895
-1.1346,-9.689,1896
0.3608,-9.8132,1898
-0.376,-9.8332,1899
-0.1687,-9.979,1900
1.0531,-9.7886,1901
-0.2017,-9.8246,1902
1.1116,-9.6424,1903
-0.0976,-9.4546,1904
-3.1457,-9.8524,1905
4.8107,-9.7882,1906
1.3854,-9.7807,1908
1.2218,-9.8054,1909
2.1409,-9.9238,1910
-2.8773,-9.4208,1911
-0.2302,-9.8925,1912
-2.964,-9.9976,1913
-1.3779,-10.0335,1914
1.6737,-9.8322,1915
0.3754,-9.8399,1916
4.5013,-9.9789,1918
0.7788,-9.8905,1920
-5.9931,-9.7022,1921
-1.3578,-10.0407,1922
2.4016,-9.9372,1923
10.5603,-9.1577,1924
10.9493,-9.832,1925
6.7555,-9.8365,1926
-0.1073,-10.1313,1927
3.4916,-9.8604,1928
7.8322,-9.866,1929
7.2829,-9.3311,1930
3.1185,-9.3608,1931
1.8308,-9.7831,1932
1.9383,-9.8568,1933
0.126,-9.9192,1934
0.3592,-9.8521,1935
2.7163,-9.9192,1936
2.3752,-10.0868,1937
2.1616,-9.4351,1938
10.1703,-9.8616,1939
11.9926,-9.935,1940
0.7128,-9.6838,1941
0.5221,-9.8455,1942
-2.4076,-9.5232,1943
1.8656,-9.7783,1944
0.1677,-9.8729,1945
3.2877,-9.8182,1946
5.2477,-9.7814,1947
-36.0044,-9.4011,1948
-0.506,-9.7094,1949
1.2212,-9.6093,1950
-0.1058,-9.9282,1951
0.7465,-9.6341,1952
-0.4972,-9.6807,1953
2.4798,-9.2238,1954
1.6416,-9.9681,1955
0.2656,-10.2756,1956
0.9562,-9.818,1958
-1.4382,-9.9185,1959
5.3934,-9.5473,1960
2.9901,-9.8165,1961
-1.2617,-10.1776,1962
16.6202,-10.7337,1963
30.9591,-10.0006,1964
4.1505,-9.7907,1965
4.0352,-10.1454,1966
7.6712,-9.8351,1968
-0.8026,-9.7969,1969
-1.261,-10.0134,1970
-7.9734,-10.2431,1971
-2.889,-9.9138,1972
0.571,-9.5868,1973
0.6694,-10.5685,1974
1.7901,-9.7315,1975
1.8593,-9.0235,1977
2.0004,-9.9866,1979
3.5332,-9.8334,1980
1.0363,-9.9467,1981
0.5215,-9.9074,1982
-0.1407,-8.966,1983
0.9089,-9.5448,1984
0.1389,-9.9546,1985
-0.3177,-10.0426,1986
9.1633,-9.5119,1987
0.3565,-9.8045,1988
-0.0854,-9.8592,1989
0.4368,-9.8536,1990
1.2646,-9.7472,1991
14.4292,-9.8093,1992
5.1422,-9.8642,1993
0.5052,-10.203,1994
1.0363,-9.7577,1995
-2.0274,-9.7482,1996
-0.1371,-9.7628,1997
-1.172,-9.8514,1998
6.7684,-9.8824,1999
-0.4555,-9.7989,2000
5.4565,-9.8213,2001
3.7156,-9.8244,2002
-1.467,-9.0938,2003
-0.1943,-9.9889,2004
-0.5452,-9.6862,2005
-0.9624,-9.849,2006
1.0421,-9.4275,2007
3.0691,-9.9859,2008
13.5068,-9.4361,2009
-3.0392,-9.5675,2010
-1.8732,-9.9522,2013
-9.3722,-10.0386,2014
-4.4419,-9.381,2015
-1.721,-9.8247,2016
-26.6549,-10.3696,2017
10.8898,-10.2705,2018
-1.3441,-9.8145,2019
2.0136,-9.8762,2020
-0.1918,-9.5726,2021
0.7766,-9.8138,2023
-0.3711,-9.9306,2024
1.3799,-9.6947,2025
-1.0171,-9.909,2026
-0.2004,-9.8509,2027
3.662,-9.9087,2028
5.4221,-9.8127,2029
-0.3909,-9.8291,2030
1.4703,-9.7829,2032
2.0855,-10.0559,2033
-0.4404,-9.8442,2034
0.2038,-9.8563,2035
-0.97,-10.103,2036
7.2065,-9.7853,2038
3.4421,-9.834,2039
0.6981,-10.0106,2040
-0.6786,-10.0625,2041
3.3139,-10.0184,2042
0.3623,-8.8517,2043
8.0042,-9.5246,2044
0.1174,-9.8804,2045
-0.1274,-9.841,2046
-3.0211,-9.8475,2047
7.3821,-9.4727,2048
-2.3328,-9.8139,2049
-0.2114,-9.7692,2050
5.0238,-10.1344,2051
0.7938,-9.5542,2052
-0.0724,-10.3518,2053
5.5188,-7.2122,2054
11.6678,-9.6722,2055
3.2952,-9.746,2056
3.269,-9.664,2058
6.2976,-9.1875,2059
-0.739,-9.9731,2060
-0.1714,-9.8224,2061
6.0927,-10.4348,2062
3.9732,-10.4976,2063
4.3521,-9.8484,2064
-1.3612,-9.8246,2065
1.6259,-9.9194,2066
1.3079,-9.798,2067
6.8413,-9.7265,2068
0.447,-9.8574,2069
0.1651,-9.8105,2070
-6.825,-9.7919,2072
-2.5949,-9.765,2073
0.705,-9.6296,2074
-5.7836,-9.7965,2075
-0.1334,-10.2596,2076
1.6532,-9.7952,2078
13.5809,-9.6908,2079
-9.51,-9.7877,2080
7.4696,-9.7348,2081
11.5093,-9.8527,2082
-14.6095,-9.6825,2083
21.5435,-10.7162,2084
-21.2839,-9.7633,2085
6.1851,-9.4493,2086
4.0545,-9.8037,2088
2.2217,-9.751,2089
7.7033,-9.4501,2090
16.3394,-9.3865,2091
-2.4191,-9.9766,2092
-2.9318,-9.8566,2093
2.9466,-10.1919,2094
12.4063,-9.9678,2095
-2.6626,-9.6803,2097
4.2165,-9.7356,2098
1.6904,-9.8698,2099
0.0703,-9.7731,2100
11.106,-9.9467,2101
9.4599,-9.8444,2102
-0.2305,-9.7852,2103
4.5279,-9.8564,2104
-3.5224,-9.8438,2105
2.105,-9.9344,2107
-0.0236,-9.7873,2108
-1.4747,-9.9482,2109
6.4442,-9.8864,2110
8.8542,-9.7876,2111
2.6402,-10.7884,2112
2.8614,-9.8476,2113
6.6873,-9.943,2114
5.7922,-9.4838,2115
-21.14,-9.5137,2116
-1.2019,-10.0298,2117
-9.014,-9.6379,2118
3.5861,-9.9146,2119
-7.5392,-9.8427,2120
-6.501,-9.7305,2121
0.9238,-9.7913,2123
7.3876,-9.7961,2124
4.7693,-9.9175,2125
-1.2486,-9.7018,2126
-5.7138,-9.6569,2127
-36.0753,-9.8469,2128
-3.8286,-9.5678,2129
-36.2158,-9.7446,2130
0.4386,-10.0001,2131
1.2077,-9.734,2133
-8.5749,-9.9524,2134
-0.5693,-9.7388,2135
7.076,-9.4432,2136
-1.8674,-9.5762,2137
1.8483,-9.9113,2138
0.4863,-9.7591,2139
-5.6294,-9.9123,2140
4.2435,-9.6182,2141
0.8124,-9.79,2143
3.4994,-9.8289,2144
12.0774,-9.8486,2145
-2.0067,-10.0118,2146
0.2341,-9.8,2147
-8.0326,-9.9156,2148
-4.6442,-9.6968,2149
-3.8367,-9.8134,2150
-5.3161,-9.7991,2151
-1.1416,-9.8123,2153
-0.6471,-10.1076,2154
0.1252,-9.8562,2155
2.6799,-9.7316,2157
-39.8238,-9.6873,2158
-6.8803,-9.7075,2159
12.3617,-4.8359,2160
-10.4966,-9.7265,2161
-41.6128,-9.908,2162
-18.4665,-9.695,2163
-5.1524,-9.0307,2164
2.2903,-9.6697,2165
1.935,-7.1332,2166
-14.0471,-10.3577,2167
-0.7956,-9.5003,2168
-30.4403,-9.8089,2169
-6.604,-9.7603,2170
-19.3209,-9.654,2171
-0.5225,-9.4645,2172
-0.789,-9.8469,2173
-14.9453,-9.7461,2174
6.1198,-9.864,2175
-17.169,-9.9142,2176
1.9905,-9.5168,2177
-14.0734,-9.6475,2178
5.0699,-9.5976,2179
2.7606,-9.3765,2180
14.6274,-9.6846,2181
20.0071,-9.7732,2183
17.1627,-9.2991,2184
-7.161,-10.3789,2185
18.8354,-9.2152,2186
23.6886,-9.6024,2187
-42.6132,-9.5231,2188
-18.0656,-9.677,2189
-1.0483,-9.7085,2190
-2.4088,-9.7873,2191
-8.7812,-9.9,2193
-22.8576,-9.3919,2194
-22.266,-10.0171,2195
-24.0963,-9.5318,2196
-1.3515,-9.8631,2197
-12.3307,-9.9397,2198
5.2247,-10.2483,2199
-9.5679,-9.834,2200
6.0634,-9.5452,2202
-3.9582,-9.8331,2203
-15.823,-9.8562,2204
-2.2909,-9.7454,2205
-0.2421,-9.6003,2206
-1.9083,-9.7992,2208
1.9759,-9.9158,2209
-0.1543,-9.7798,2210
0.411,-9.8569,2211
-0.9379,-9.9545,2212
0.1902,-9.8583,2213
2.6343,-9.8131,2214
0.0335,-9.9085,2216
4.7081,-9.9458,2217
-1.0729,-9.8198,2218
-1.3839,-9.7202,2219
0.2336,-9.954,2220
23.4398,-9.3277,2221
8.4176,-9.7753,2222
7.4666,-9.9336,2223
6.4479,-10.0067,2224
13.4317,-9.8888,2225
0.869,-10.3642,2226
1.6022,-9.7825,2227
6.3391,-9.9089,2228
2.891,-9.8509,2229
19.347,-9.8847,2230
14.5773,-9.5366,2231
25.0115,-9.7547,2232
7.62,-10.5192,2233
3.1675,-9.429,2234
1.9423,-9.6257,2235
12.117,-10.0085,2236
5.7536,-9.8818,2237
5.9391,-9.8416,2238
-3.6406,-9.6905,2239
0.5422,-9.8232,2240
9.5059,-9.9782,2242
9.5658,-9.8949,2243
1.198,-9.8289,2244
0.0511,-9.822,2245
5.1741,-9.8707,2247
1.8485,-9.076,2248
5.7365,-7.6718,2249
1.1041,-9.8895,2250
-2.0098,-9.7022,2251
4.8959,-9.9846,2253
11.9444,-9.8833,2254
-4.8477,-10.4899,2255
0.27,-8.9202,2256
0.6965,-10.3114,2257
-4.3384,-10.0513,2258
-7.1163,-10.2059,2259
0.5297,-9.9751,2260
6.3377,-9.0017,2262
9.1986,-9.877,2263
-0.6527,-9.7588,2264
0.4191,-9.9467,2265
2.6908,-9.5171,2266
3.8944,-9.8964,2268
2.5667,-9.9544,2269
19.6489,-10.5653,2270
16.7557,-9.4123,2271
-2.3757,-9.592,2272
3.9762,-9.6758,2273
26.6256,-9.9049,2275
1.5312,-9.6954,2276
3.1953,-9.8478,2277
4.5268,-9.8966,2278
-2.1476,-9.7864,2279
-0.0961,-9.9067,2280
0.4019,-10.1122,2281
9.0791,-9.9617,2282
-0.1024,-10.1796,2283
-0.2749,-9.7334,2284
-1.06,-9.8247,2285
1.3045,-9.7645,2286
-3.3254,-9.7143,2287
4.6653,-9.7835,2288
-16.5289,-9.6716,2289
2.5022,-9.5972,2290
-20.56,-9.443,2291
15.8099,-9.0368,2292
7.3716,-9.5598,2293
-1.6647,-9.7084,2294
4.4101,-9.7863,2295
0.7216,-9.849,2296
-1.2946,-9.7748,2298
1.737,-9.7636,2299
2.0773,-9.7935,2300
0.5531,-9.8223,2301
-1.5968,-9.8098,2302
2.0751,-9.7778,2303
1.4511,-9.7805,2304
1.2432,-9.7897,2305
1.1649,-9.8014,2306
0.863,-9.8144,2307
-1.169,-9.7966,2308
-2.734,-9.7543,2309
1.378,-9.7182,2310
3.4288,-9.7624,2311
1.5445,-9.7925,2312
0.3687,-9.7906,2313
0.1247,-9.7907,2314
-0.172,-9.7836,2315
0.2001,-9.7718,2316
0.447,-9.7623,2318
-0.748,-9.7409,2319
0.7851,-9.7174,2320
2.1352,-9.7455,2321
1.584,-9.7528,2322
1.9875,-9.7766,2323
2.8561,-9.8085,2324
-0.9897,-9.8123,2325
-3.4694,-9.7566,2326
-0.1086,-9.747,2328
-2.0897,-9.6869,2329
2.2408,-9.6204,2330
1.9854,-9.8143,2331
-0.6365,-9.7747,2332
2.4948,-9.7895,2334
-1.1543,-9.7968,2335
-0.399,-9.7654,2336
1.1873,-9.771,2337
0.7945,-9.7558,2338
2.7703,-9.7937,2339
0.2323,-9.7987,2340
0.1633,-9.7908,2341
-0.8171,-9.784,2342
0.7003,-9.7819,2343
-0.4898,-9.7687,2344
3.4997,-9.7769,2345
-2.6122,-9.7666,2346
2.2531,-9.771,2347
3.5077,-9.8008,2348
-0.1163,-9.8334,2349
-0.0514,-9.7984,2350
2.88,-9.8049,2351
-0.1185,-9.8222,2352
-1.2821,-9.8034,2353
0.8451,-9.8101,2354
1.1002,-9.8264,2355
-0.2556,-9.8195,2356
-0.0838,-9.8159,2357
0.0115,-9.8123,2358
1.0225,-9.8021,2359
0.9462,-9.8208,2360
0.5581,-9.8243,2361
-0.6746,-9.8102,2363
0.4478,-9.8085,2364
-0.8816,-9.8009,2365
-3.6203,-9.7382,2366
8.257,-9.7737,2367
-0.4133,-9.7855,2368
1.8113,-9.8013,2369
-0.4467,-9.7731,2370
0.0739,-9.7971,2372
-1.1346,-9.7856,2373
3.1799,-9.7703,2374
-0.5333,-9.7702,2375
7.6877,-9.7866,2376
-0.6044,-9.8102,2378
0.1177,-9.8085,2379
1.1295,-9.8065,2380
0.2246,-9.8147,2381
0.5946,-9.812,2382
-1.8006,-9.7977,2383
-0.1797,-9.8056,2384
2.0107,-9.7826,2385
0.1735,-9.8112,2387
0.1504,-9.8,2388
-0.0961,-9.7979,2389
0.0789,-9.8015,2390
1.5517,-9.8047,2391
0.168,-9.8262,2393
-0.9168,-9.8133,2394
0.3212,-9.8152,2395
0.1677,-9.8106,2396
0.5107,-9.8075,2397
0.8043,-9.809,2398
-0.0179,-9.8088,2399
0.1507,-9.7992,2400
0.5718,-9.7976,2401
0.7753,-9.8016,2402
0.4296,-9.8002,2403
0.6378,-9.8063,2404
0.311,-9.8077,2405
1.5142,-9.8074,2406
-0.7838,-9.8314,2407
-0.8452,-9.8298,2408
-0.0586,-9.7278,2409
-4.1342,-9.7187,2410
-6.7452,-9.6342,2411
6.8343,-9.6855,2412
3.5257,-9.7803,2413
-3.1053,-9.7271,2414
3.8802,-9.7535,2415
2.8832,-9.7942,2416
-0.4539,-9.8102,2417
-4.6988,-9.7756,2418
1.1917,-9.7976,2419
0.5197,-9.7974,2420
-3.0334,-9.7725,2421
-0.0827,-9.741,2422
-0.3902,-9.7181,2423
3.6494,-9.7043,2424
3.8464,-9.8021,2425
0.8052,-9.7871,2426
-2.4682,-9.7808,2427
0.0492,-9.7521,2428
5.1703,-9.7692,2429
-1.0531,-9.7879,2430
-0.7065,-9.7692,2431
0.9556,-9.7978,2433
-0.9121,-9.8043,2434
-2.8567,-9.7637,2435
4.2679,-9.7274,2436
1.5909,-9.786,2437
-1.2232,-9.7762,2438
2.7954,-9.7828,2439
3.858,-9.7819,2440
-14.5101,-9.7185,2441
0.6009,-9.7632,2443
-4.1482,-9.6579,2444
-56.6596,-9.1496,2445
-2.1032,-9.4618,2446
6.3518,-9.6652,2447
3.3871,-9.7719,2448
-5.9214,-9.771,2450
-1.5833,-9.5793,2451
9.639,-9.5536,2452
9.798,-9.8043,2453
-2.2429,-9.8033,2454
0.1474,-9.8888,2455
0.0194,-9.7803,2456
4.9927,-9.7076,2457
0.6829,-9.8317,2458
-3.6917,-9.803,2459
2.7719,-9.8121,2460
1.3441,-9.8173,2461
0.306,-9.8348,2462
-2.1344,-9.9552,2463
-7.0411,-8.6025,2464
-9.121,-8.3133,2465
-7.6606,-9.7752,2466
0.4123,-9.7831,2467
-0.0451,-9.8185,2468
-0.1529,-9.9781,2469
15.6873,-9.986,2470
3.4358,-9.9375,2471
1.1322,-9.7854,2472
1.7692,-9.8882,2473
4.8506,-9.8307,2474
9.6787,-9.8447,2475
-4.8913,-9.8862,2476
-0.1186,-9.7523,2478
-1.4825,-9.8167,2479
14.3178,-10.1005,2480
1.6592,-10.3205,2481
1.5026,-9.8133,2482
6.8266,-9.6989,2483
3.8716,-9.7886,2484
3.458,-9.3855,2485
5.2731,-9.721,2486
4.4828,-9.4554,2487
2.3925,-9.8714,2488
1.6104,-9.784,2489
0.0116,-9.9589,2490
-1.4208,-9.8006,2491
7.7148,-10.8412,2492
1.154,-9.697,2493
-1.9973,-9.6906,2494
2.1684,-9.6602,2495
1.6413,-9.0409,2496
1.7188,-9.7421,2498
0.7993,-9.8496,2499
1.0806,-9.8279,2500
2.0684,-10.1864,2501
3.3383,-10.5464,2502
3.681,-9.8392,2503
11.5424,-10.4912,2504
1.9954,-10.0731,2505
0.948,-9.4008,2506
0.8949,-9.875,2508
0.1975,-9.7259,2510
1.0547,-10.0503,2511
0.4954,-8.7498,2512
-5.0788,-7.1869,2513
0.7747,-8.1703,2514
0.039,-9.7663,2515
0.2593,-10.1776,2516
-0.0289,-10.0559,2517
0.2567,-10.0379,2518
0.5898,-9.6481,2519
1.4506,-10.4,2520
0.0993,-8.895,2521
0.6208,-10.0217,2522
1.1476,-9.9672,2523
-0.038,-9.607,2524
0.173,-9.2131,2525
0.7129,-10.2421,2526
0.404,-10.112,2527
0.2676,-9.8188,2528
2.581,-9.8297,2529
2.3907,-9.7879,2530
0.8799,-9.7497,2531
-0.4985,-9.8099,2532
0.4514,-10.0373,2533
1.9537,-10.0761,2534
1.2128,-9.8727,2535
1.519,-9.8806,2537
-0.0176,-9.9462,2538
5.4743,-9.7846,2539
2.4027,-9.8606,2540
-0.4629,-9.7126,2541
6.7815,-10.1166,2543
11.5577,-10.0819,2544
7.6236,-9.7975,2545
2.3849,-9.7826,2546
1.1262,-9.864,2547
0.375,-9.8046,2548
3.4279,-9.4274,2549
0.6615,-9.7283,2550
0.0323,-10.2652,2551
0.4416,-9.8352,2553
1.4524,-9.798,2554
0.5243,-9.926,2555
0.2108,-9.9474,2556
2.6322,-9.8054,2557
2.7916,-9.6773,2558
-0.9772,-9.8609,2559
5.6569,-10.0638,2560
10.3565,-9.8849,2561
3.3676,-9.6389,2563
-2.3342,-9.4796,2564
-1.151,-10.3522,2565
1.7353,-10.033,2566
-0.7654,-9.9487,2567
0.5085,-9.4156,2569
11.7328,-10.1825,2570
1.0187,-9.8282,2571
-0.4754,-9.8055,2572
1.4394,-9.9019,2573
1.5764,-9.8218,2574
1.116,-9.4165,2575
0.2441,-9.6041,2576
0.0114,-9.7331,2577
0.1052,-9.6488,2578
-0.5111,-9.965,2579
5.2666,-9.7479,2580
13.728,-9.0017,2581
2.569,-9.8673,2583
0.7714,-9.8268,2584
1.1267,-9.8033,2585
-0.4233,-9.9554,2586
11.9361,-9.8333,2587
-4.3265,-9.7379,2588
2.8398,-9.7179,2590
-0.8224,-9.8728,2591
3.6352,-9.7103,2592
3.5505,-9.725,2593
14.0304,-9.699,2594
1.5214,-9.8375,2595
0.3144,-9.864,2596
0.7899,-10.026,2598
1.8475,-9.8299,2599
0.5609,-9.8153,2600
-0.1026,-9.8592,2601
0.1821,-9.8082,2602
-0.3002,-10.0729,2603
-0.0879,-9.8094,2604
0.7752,-9.7317,2605
0.0218,-9.7854,2606
14.5133,-8.9814,2607
-22.3347,-9.632,2609
-11.5031,-9.9729,2610
-4.2727,-9.7178,2611
10.6441,-10.3131,2612
0.4658,-10.0535,2613
-0.6548,-9.6488,2614
6.2074,-9.4095,2615
-0.5437,-9.9221,2616
-1.5415,-4.9369,2618
-0.511,-9.8623,2619
1.5508,-9.6892,2620
0.0915,-9.6947,2621
1.3913,-8.1939,2622
21.4075,-10.0909,2623
5.3205,-10.157,2624
0.5851,-9.8459,2625
0.8681,-10.3342,2626
3.1288,-9.3178,2628
9.5047,-9.7877,2629
3.9511,-8.8842,2630
1.164,-10.2241,2631
-0.8552,-9.8849,2632
0.6123,-9.8496,2633
3.3412,-10.0963,2634
38.8383,-10.4714,2635
31.6836,-9.8274,2636
9.823,-10.6563,2637
-4.2358,-9.7616,2651
0.9448,-10.0008,2652
3.2321,-9.7498,2653
-14.2462,-8.8182,2654
1.6962,-9.1125,2655
-3.8888,-9.9972,2656
7.933,-10.2549,2657
-0.1714,-9.9056,2658
8.7516,-10.179,2659
-0.5603,-9.7687,2660
0.0309,-10.1264,2661
0.4275,-9.8066,2662
-0.1149,-9.954,2663
0.4956,-9.8686,2664
2.3104,-9.1317,2665
-1.325,-9.9412,2666
-1.7759,-8.5744,2667
-3.0314,-9.9192,2668
4.6598,-9.9077,2669
19.5342,-9.857,2670
2.8611,-9.3442,2671
3.3218,-9.776,2672
1.6038,-9.9525,2673
8.6667,-9.7529,2674
1.0482,-9.9919,2675
-4.7968,-9.4904,2676
1.0987,-9.7512,2677
-0.0749,-9.8771,2678
0.1906,-9.7745,2679
0.6123,-10.1666,2680
-0.4929,-9.9176,2681
-4.7257,-9.6447,2682
0.9042,-9.8545,2683
-3.3618,-10.0602,2684
3.9924,-9.9241,2685
4.9171,-10.0667,2686
3.5739,-9.9839,2687
-1.0537,-9.7173,2688
-0.4857,-9.7563,2689
4.5675,-9.7845,2690
-4.5412,-9.6739,2691
15.8031,-9.5956,2692
0.3179,-10.0281,2693
6.9875,-9.9616,2694
0.3123,-9.6728,2695
3.963,-9.7944,2696
0.2739,-10.1849,2697
-0.7591,-9.7824,2698
-1.8003,-9.9483,2699
9.9583,-10.0469,2700
-11.9852,-9.7954,2701
-13.3681,-9.5761,2702
5.4477,-9.8196,2704
-57.2367,-9.5279,2705
2.5592,-9.6568,2709
-0.5145,-9.9288,2710
1.4221,-9.8331,2711
-0.4434,-9.8347,2712
-4.0154,-9.8741,2713
6.0495,-9.3702,2714
-67.9856,-10.0538,2715
6.165,-9.6521,2716
8.9766,-9.7334,2717
5.6571,-9.9028,2718
18.3554,-9.5797,2719
0.2709,-9.9624,2720
6.5903,-9.7479,2721
-1.7505,-9.7055,2722
2.4374,-9.7402,2723
13.6679,-9.7633,2724
9.3661,-9.8232,2725
1.9169,-9.8893,2726
1.2989,-9.3687,2727
3.0023,-9.8662,2728
2.3901,-9.9298,2729
-0.6409,-10.0012,2730
-0.6634,-9.9666,2731
5.923,-9.5349,2732
-0.0682,-10.112,2733
3.609,-9.8558,2734
9.6268,-9.7594,2735
2.7091,-9.9939,2736
0.5486,-9.825,2737
0.9092,-9.6628,2738
3.633,-9.7127,2739
0.6586,-9.4435,2745
0.1145,-9.7698,2746
4.6578,-9.8241,2747
7.3241,-10.0175,2748
2.3312,-9.8884,2749
-0.0702,-9.8916,2750
0.2542,-9.5465,2751
1.2163,-10.0012,2752
24.0905,-9.5852,2753
35.2945,-9.9642,2754
8.5745,-10.1047,2755
6.6935,-9.7222,2756
3.7571,-9.883,2757
-0.8975,-10.3871,2758
0.6889,-9.6597,2759
2.0455,-9.9244,2760
11.4946,-9.6798,2761
3.5546,-9.7268,2763
4.6172,-10.1907,2764
1.9455,-9.8683,2765
6.4415,-10.0638,2766
0.9428,-9.6042,2767
1.1647,-9.8813,2768
-2.854,-9.8461,2769
-2.5248,-9.8411,2770
4.3539,-9.9791,2771
8.3357,-9.6781,2772
-2.0397,-10.0169,2773
9.149,-9.924,2774
2.21,-9.9558,2775
-2.625,-9.9327,2776
1.1176,-9.9525,2777
10.7319,-9.8954,2778
0.1839,-9.6356,2779
-13.9281,-9.8016,2780
-9.0281,-10.1829,2781
16.5841,-9.644,2782
-10.7737,-9.5279,2783
-21.0808,-9.6834,2784
-3.7563,-9.8684,2785
-2.1294,-9.7078,2786
-2.6244,-10.0484,2787
2.7034,-9.9401,2788
-10.7832,-9.7747,2789
-4.0259,-9.9314,2790
-1.0986,-9.9301,2791
2.8225,-9.7603,2792
3.7692,-10.0135,2793
-6.3345,-9.8059,2794
7.2543,-9.7857,2795
0.2078,-9.7745,2796
-14.3589,-10.4865,2797
-15.3543,-9.629,2798
-1.7047,-9.6442,2799
-1.3829,-9.6839,2800
-1.3451,-9.552,2801
9.7771,-9.6447,2802
0.8304,-9.761,2803
4.0308,-9.8747,2804
4.1468,-9.4862,2805
1.5198,-9.9233,2806
-6.3104,-9.8022,2807
-2.4417,-9.9122,2808
-3.5975,-9.756,2809
2.8913,-9.1258,2810
-1.6098,-9.8442,2811
5.903,-9.9294,2812
-1.1812,-9.7491,2813
3.8333,-9.8559,2814
1.4127,-9.8125,2815
-2.8839,-10.127,2816
-0.1656,-9.8456,2817
-0.6735,-9.9294,2818
-1.9929,-10.0116,2819
5.9523,-9.9057,2820
11.2654,-9.8058,2822
0.835,-9.7867,2823
3.0026,-10.0294,2824
6.4038,-9.7392,2825
-0.4395,-9.8544,2826
-1.0912,-9.7416,2827
0.2657,-10.0923,2828
8.5858,-9.8277,2829
4.9507,-9.7938,2830
5.1409,-9.788,2831
1.6493,-9.7307,2832
1.6933,-9.8795,2833
-0.7692,-9.8637,2834
-1.3747,-9.8088,2835
0.4146,-9.9702,2836
-0.8169,-9.8678,2837
-0.2479,-9.8411,2838
0.5222,-9.5507,2839
16.099,-9.6219,2840
9.2155,-9.6608,2841
0.5758,-9.8244,2842
-1.8495,-9.8284,2843
2.1146,-10.1038,2844
0.0044,-9.1148,2845
3.2454,-9.7602,2846
1.7179,-9.0745,2847
53.5759,-9.4804,2848
2.5026,-8.9422,2849
1.7285,-9.9452,2850
7.3316,-9.6198,2851
5.6424,-9.6876,2852
-0.2797,-9.5215,2853
-15.2894,-10.0049,2854
-2.7463,-10.3092,2855
0.3342,-10.094,2856
2.7547,-9.9233,2857
-0.4176,-9.5958,2858
0.0147,-9.6765,2859
2.6303,-10.5807,2860
-0.8355,-10.4356,2861
2.415,-10.1072,2862
9.3797,-9.5028,2863
-3.6471,-8.919,2864
-2.6358,-9.653,2865
28.1442,-9.6588,2866
8.879,-10.2746,2870
11.0893,-9.614,2871
4.5832,-10.2093,2872
-0.4061,-9.8884,2873
4.9111,-9.77,2876
-0.8158,-9.8344,2877
0.3705,-10.3442,2878
8.1153,-9.4966,2879
-0.4423,-9.9415,2880
0.0005,-10.1048,2882
1.255,-9.8053,2883
14.4632,-9.9419,2884
-1.5563,-8.8038,2885
-30.2531,-9.5257,2886
17.3081,-9.2253,2887
9.8498,-9.6459,2888
21.7442,-9.5563,2889
0.9573,-9.8096,2890
0.014,-9.8006,2891
-6.7478,-9.8317,2892
5.7367,-9.7396,2893
0.2983,-9.7852,2894
-8.0009,-9.748,2895
-0.8259,-9.798,2896
1.0512,-9.8023,2897
-0.3145,-9.791,2898
2.2184,-9.6723,2899
5.3131,-9.5302,2900
-0.1398,-9.9272,2901
-2.1102,-9.8539,2902
-0.1683,-9.8059,2903
-0.1867,-9.8054,2904
-0.1782,-9.8044,2905
-0.204,-9.8074,2906
-0.17,-9.8048,2907
-0.1884,-9.8025,2908
1.8595,-9.951,2909
-5.7186,-9.3676,2910
-1.2078,-9.7662,2911
0.941,-9.8283,2912
0.556,-9.7879,2913
-0.7743,-9.769,2914
-0.2156,-9.8509,2915
0.2486,-9.7908,2916
