AYGX_mean,AZ_mean,timestamp
1.4392,-9.8612,121
0.4755,-9.9408,122
0.528,-9.6218,123
-0.023,-10.1659,124
0.5007,-10.1118,125
0.909,-9.9269,126
0.205,-9.9452,127
1.7105,-9.9036,129
-0.7756,-9.9089,130
45.9292,-9.7178,131
10.5741,-9.6157,132
0.4103,-9.942,133
0.2788,-9.7932,134
0.5436,-11.1796,135
3.4518,-9.8119,136
0.6999,-9.3939,137
-6.7328,-9.9903,139
0.482,-9.8481,140
0.351,-9.9614,141
