AYGX_mean,AZ_mean,timestamp
1.4661,-9.667,0
1.6125,-9.6709,1
1.6743,-9.6712,2
1.7711,-9.6705,3
1.7681,-9.6692,4
1.7967,-9.672,5
1.6851,-9.6684,6
1.5189,-9.6689,7
2.1979,-9.6678,8
1.7607,-9.6712,9
1.6836,-9.6709,10
1.7504,-9.6744,11
1.6942,-9.671,12
9.4597,-9.6993,13
1.3536,-9.8053,14
-10.9615,-9.49,18
23.9246,-9.8203,19
-8.4093,-9.7358,20
-0.6232,-9.7435,21
2.9519,-9.7578,22
-4.417,-9.7792,23
-0.4298,-9.7052,24
0.2689,-9.8023,25
1.6071,-9.7832,26
4.8446,-9.7915,27
2.6741,-9.7754,28
0.183,-9.8272,29
4.8583,-9.944,30
7.6075,-9.6208,31
5.2351,-9.8855,33
-1.083,-9.5329,34
-1.5336,-10.0104,35
-2.429,-9.9026,36
2.6892,-9.6986,37
2.8046,-9.9767,38
2.4323,-11.0705,39
-1.7703,-9.7891,40
1.8613,-9.8223,41
-0.3825,-10.1758,42
1.33,-9.7592,43
3.8125,-9.8563,44
2.7947,-9.8471,45
0.4422,-9.8028,46
0.4652,-9.8572,47
2.4584,-9.8821,48
-2.2343,-9.8336,49
2.2136,-10.0287,50
-0.5568,-10.073,51
0.6664,-9.7841,52
1.8024,-9.9164,53
1.1342,-9.7522,54
1.3403,-9.8673,55
-1.6395,-9.6589,56
-1.1268,-9.919,57
-0.1664,-10.0254,58
0.6607,-9.7603,59
1.2005,-9.878,60
0.9941,-9.7759,61
0.8878,-9.8509,62
1.9472,-9.8026,63
1.0069,-9.8489,64
-0.871,-9.7382,65
3.2156,-9.7126,66
-1.5367,-9.6983,67
0.1683,-9.7546,68
-2.2979,-9.8062,69
-0.3085,-9.7964,70
-8.9153,-9.7146,71
2.9646,-9.6739,72
3.7819,-9.6869,73
5.2072,-9.7095,74
1.2934,-9.7046,75
3.7039,-9.7474,76
1.8922,-9.7415,77
5.0001,-9.7987,78
-1.472,-9.7975,79
1.5357,-9.7062,80
-2.0536,-9.7518,81
3.2904,-9.6629,82
4.5532,-9.7855,84
-1.0302,-9.7168,85
-1.0758,-9.861,86
1.1263,-9.8405,87
0.0905,-9.8302,88
-0.4792,-9.7373,89
0.8094,-10.1009,90
5.64,-10.1726,91
-0.8364,-9.7117,92
0.6921,-9.7,93
-1.5781,-9.9347,94
4.1364,-9.7968,95
1.1689,-9.7779,96
-0.0341,-9.9617,97
1.4967,-9.8192,98
0.6731,-9.6293,99
2.9285,-9.9298,100
-0.2019,-9.6017,101
0.7798,-9.7069,102
2.7212,-10.3894,103
-6.2084,-10.5967,104
0.8767,-9.8067,105
3.7771,-9.8499,106
-0.0854,-9.8391,107
1.7821,-9.8261,108
0.1039,-9.7376,109
0.8112,-9.9035,110
2.1433,-9.6075,111
0.8661,-9.7525,113
1.2229,-9.8771,114
0.7322,-9.8892,115
-1.8851,-9.7692,116
-0.6563,-9.8724,117
0.8613,-9.8882,118
0.0138,-9.9294,120
0.6934,-9.7123,121
0.5667,-9.9098,122
-0.3917,-9.8527,123
2.1312,-9.8706,124
0.7406,-9.8194,125
-4.0113,-9.9805,126
3.9154,-10.2289,127
3.5113,-9.6942,128
3.1682,-9.8775,129
-4.6642,-9.8411,130
-4.1475,-9.9449,131
-4.5051,-9.7162,132
-2.8707,-10.0707,133
1.6966,-9.8432,135
0.453,-9.873,136
0.3365,-9.7692,137
0.418,-9.7811,138
1.3843,-9.8952,139
0.5729,-9.8629,140
6.4581,-9.7915,141
-0.1277,-9.8599,142
0.4652,-9.7891,143
-0.0848,-9.8002,144
0.7119,-9.8158,145
-0.1602,-9.8205,146
-0.0798,-9.8199,147
1.9191,-9.8007,148
-0.8561,-9.8391,149
0.7844,-9.816,150
0.3964,-9.8083,151
0.0573,-9.8573,152
0.543,-9.8173,153
0.1047,-9.8005,154
-1.7167,-9.8345,155
3.2518,-9.8176,156
-0.3826,-9.8549,157
-0.3338,-9.8107,158
0.4328,-9.7979,160
0.5865,-9.8151,161
2.6582,-10.065,162
3.0534,-9.8357,163
0.3144,-9.8874,164
0.2885,-9.8794,165
0.179,-9.6371,166
0.318,-9.8618,167
0.54,-9.797,168
1.8698,-9.8054,169
0.584,-9.8501,170
-0.2321,-9.911,171
4.6399,-9.8422,172
0.6946,-9.8606,173
2.8084,-9.8143,174
2.9307,-9.8355,175
2.2639,-9.8864,176
12.7424,-9.9489,177
-6.9373,-10.1309,178
-4.9406,-9.8964,179
-1.0276,-9.8226,180
-5.4737,-9.876,181
0.7666,-9.8944,182
4.1277,-9.8386,183
0.3647,-9.8377,184
1.7731,-9.7336,186
0.2427,-9.9348,187
0.6249,-9.8136,188
2.25,-9.904,189
1.1532,-9.8272,190
0.687,-9.8296,191
-1.2377,-9.8333,192
-1.6373,-9.7904,193
1.4978,-9.7917,194
0.4733,-9.791,195
0.8775,-9.7907,196
1.0116,-9.7881,198
1.829,-9.7921,199
0.9208,-9.799,200
0.7495,-9.8107,201
-0.0439,-9.8135,202
7.1264,-9.8033,203
1.1351,-9.7995,204
13.0637,-10.3125,205
-1.0486,-10.3014,206
-6.4125,-9.6608,207
-15.2587,-10.1517,208
-7.1271,-9.7833,209
0.3589,-9.78,210
0.0155,-9.6104,211
-2.6494,-9.8575,212
-4.7158,-9.8221,213
20.0194,-9.8979,214
-4.2703,-9.6425,215
1.3381,-9.4409,216
-1.8165,-9.0999,217
-0.7659,-9.6718,218
15.0327,-9.4216,219
1.3932,-9.9398,220
-0.9649,-9.2645,221
0.9619,-10.0517,222
1.1472,-9.6014,223
-0.596,-9.4858,224
4.0967,-8.9443,225
-0.5192,-8.8947,226
-1.2216,-7.8629,227
-1.9548,-9.7601,228
7.3344,-10.487,229
2.848,-9.8805,230
-1.096,-9.7993,231
-5.4447,-9.7943,232
5.1957,-9.8117,233
0.814,-9.8111,234
5.3005,-9.513,235
3.4746,-9.6836,237
7.3942,-10.1066,238
6.6069,-10.4438,239
-0.9499,-10.3065,240
1.2863,-9.5502,241
2.331,-10.0446,242
4.7097,-9.8273,243
1.4105,-9.8342,244
1.4241,-9.9899,245
1.0494,-9.7861,246
0.6866,-9.827,247
0.1435,-9.7813,248
0.2932,-10.0935,249
1.0512,-9.9608,250
12.8392,-9.9763,251
0.4069,-9.6151,252
4.9425,-9.8289,253
-1.4229,-9.9035,254
-0.5043,-9.7962,255
-3.3561,-10.13,256
-1.2111,-9.7018,257
-0.0959,-9.9665,258
-0.2712,-10.0773,259
-0.5276,-9.7576,260
0.7492,-9.0767,261
0.2865,-10.6446,262
1.5056,-9.6726,263
-0.1862,-10.2007,264
7.0618,-9.1625,265
1.0162,-10.1902,266
0.7192,-9.8981,267
-3.0646,-10.0003,268
-0.1683,-9.6176,269
-0.4835,-9.8632,270
-2.5857,-9.8316,271
0.4117,-9.861,272
2.6311,-9.9232,273
8.0366,-9.9411,274
-2.9857,-9.7728,275
-11.812,-9.9683,276
-4.5896,-9.7107,277
-2.651,-9.8009,278
2.8984,-9.8575,279
1.669,-9.7701,280
3.7975,-9.8793,281
-0.2858,-9.9987,282
3.3522,-9.7757,283
8.4659,-10.7737,284
-0.7505,-9.551,285
0.1279,-9.9794,286
1.0057,-9.8276,288
20.9563,-10.0052,289
12.1018,-9.9865,290
5.3106,-9.9448,291
23.7262,-9.9622,292
12.3798,-9.8305,293
1.8154,-9.8673,294
0.0094,-10.5525,295
23.2889,-9.7107,296
-0.43,-9.8901,297
-0.116,-9.8291,298
-0.2436,-9.6641,299
-0.3471,-9.8512,300
0.6737,-9.7185,301
-3.1554,-10.0318,302
1.6753,-9.8908,303
-0.6947,-9.8107,304
0.1601,-10.4102,305
-0.6654,-10.0489,306
-2.4597,-9.8169,307
1.8897,-9.5314,308
0.8485,-9.1508,309
1.7602,-9.8254,310
-1.1769,-9.9169,311
-1.1963,-9.9505,312
14.2402,-9.8128,313
8.2032,-10.0822,314
-0.2027,-9.7483,315
-3.9342,-9.7821,316
0.6302,-9.7818,317
2.5599,-9.749,318
1.4655,-9.7774,319
1.4292,-9.7627,320
