AYGX_mean,AZ_mean,timestamp
0.0303,-9.7867,0
-0.0133,-9.7815,1
0.0448,-9.8038,2
-7.0826,-9.0223,3
-8.469,-9.6536,4
-0.2562,-9.6374,5
5.7873,-9.7102,7
-2.8086,-9.6346,8
0.5673,-9.6869,9
2.1912,-9.7042,10
3.9901,-9.7714,11
-0.8046,-9.7758,13
-9.7277,-9.6602,14
0.8919,-9.5698,15
3.2137,-9.6509,16
-0.3694,-9.7452,17
3.6184,-9.7277,18
-0.8827,-9.7469,19
2.4238,-9.7405,20
-1.0794,-9.7599,22
-19.7899,-9.5849,23
20.8168,-9.2102,24
5.6739,-9.6383,25
-0.4264,-9.75,26
-0.6676,-9.8934,28
-0.7262,-9.7808,29
0.4891,-9.7939,30
-0.3583,-9.8037,31
-0.0813,-9.7986,32
0.4043,-9.6423,33
0.0652,-9.8344,34
1.4337,-9.6836,35
1.0994,-9.6685,36
-15.7481,-9.5954,38
26.8154,-9.4703,39
6.1814,-9.6824,40
-3.4002,-9.734,41
1.4153,-9.7965,42
-8.3378,-9.676,43
-4.9844,-9.7466,44
-0.1407,-9.8075,45
0.6374,-9.8044,46
-0.3593,-9.7867,48
0.0902,-9.7786,49
-2.646,-9.7989,50
1.0851,-9.7266,51
-8.1834,-9.9482,52
5.0406,-9.8714,53
-3.9073,-9.8369,54
-2.4872,-9.7626,56
0.3968,-9.5973,57
2.5867,-9.9219,58
9.2936,-10.1519,59
6.2535,-9.8767,60
0.4554,-9.7462,62
-1.5022,-9.9028,63
7.5918,-9.8408,64
0.1238,-9.6564,65
-1.9793,-9.6581,66
4.7868,-9.4211,68
1.6166,-9.5247,69
13.1945,-9.8569,70
-0.5883,-9.8369,71
-2.6101,-10.2063,72
15.3893,-9.1603,73
4.7014,-9.8227,74
1.3716,-9.2992,75
-6.46,-9.9535,76
1.7891,-9.7999,78
1.7426,-9.8719,79
11.4679,-9.6443,80
-3.2988,-8.8135,81
9.1707,-9.7303,82
1.457,-9.6589,83
4.3978,-9.7236,84
1.1003,-9.9706,85
2.8019,-9.7977,87
0.9866,-9.7681,88
-3.59,-9.7263,89
0.4106,-9.7812,90
3.3994,-9.7176,91
1.4324,-9.7167,93
2.2132,-9.8513,94
2.7534,-10.2069,95
4.9508,-9.8485,96
2.6939,-9.8843,97
0.5,-9.7966,99
-1.5738,-9.8886,100
-1.1047,-9.5636,101
2.0171,-9.7393,103
4.7084,-9.8409,104
-0.047,-9.7866,105
2.2665,-9.8373,106
-1.1572,-9.568,107
-1.3576,-9.7935,108
3.8009,-9.5841,109
4.1965,-9.9097,110
-0.0812,-9.7967,111
2.1717,-9.7964,113
1.0539,-9.8378,114
1.1316,-9.6943,115
-0.6283,-9.8827,116
-0.9575,-9.8987,117
-1.6299,-10.021,118
-1.7016,-9.8242,119
0.8028,-9.8188,120
7.6298,-9.6801,121
-0.2242,-10.1392,123
0.1959,-9.6104,124
0.6424,-9.7065,125
-0.5459,-9.7733,126
-0.1214,-9.4898,127
0.2412,-9.5723,128
0.6849,-9.6349,129
0.405,-9.7878,130
4.8913,-9.8667,131
18.2229,-9.7155,133
1.4391,-9.8065,134
0.5901,-9.8595,135
1.9286,-9.7388,137
0.7937,-9.3468,138
10.2034,-10.3121,139
7.5804,-10.0373,140
0.7468,-9.5406,142
-2.28,-9.8585,143
-0.996,-10.2249,144
10.0045,-9.7931,145
-7.3048,-9.7207,146
5.2689,-9.697,148
-0.4081,-9.8007,149
1.0794,-9.8057,150
-2.0762,-9.8069,151
0.162,-9.7677,152
0.7016,-9.751,153
-8.3656,-9.7746,154
2.8302,-9.7793,155
0.041,-9.7846,156
-0.3594,-9.7843,158
4.4493,-9.7264,159
27.3258,-9.8222,160
-3.8577,-10.7762,161
33.8532,-9.4528,162
4.0643,-9.1374,163
2.8343,-6.1665,164
-4.8103,-8.9921,165
18.1306,-4.3861,166
3.7784,-9.531,168
2.6983,-10.1066,169
-1.0615,-10.1599,170
0.6571,-10.2536,171
-1.6467,-9.7314,172
-3.0504,-10.1555,173
-2.4131,-9.7893,174
3.6276,-10.0087,175
1.4669,-8.9529,176
0.7184,-8.3425,178
5.1612,-8.9344,179
3.8205,-9.7345,180
-0.2549,-9.0138,181
-2.8605,-7.7909,182
5.5978,-5.3546,183
4.311,-8.4068,184
-0.8123,-9.7429,185
0.3305,-9.6879,186
3.7536,-9.837,188
3.7558,-10.2389,189
-2.6593,-10.3475,190
0.3475,-9.4899,191
-0.7261,-8.6957,192
8.7278,-9.5816,193
11.3096,-9.7268,194
2.2576,-8.2127,195
-1.1525,-9.7327,196
1.633,-9.1698,198
-0.7331,-10.1368,199
1.6234,-9.3521,200
-4.9137,-9.4083,201
0.2247,-9.7778,202
-0.0479,-10.4729,203
0.6487,-10.1251,204
9.05,-7.7932,205
2.5484,-9.9058,207
-2.9027,-9.4931,208
1.2251,-9.8063,209
0.2933,-9.8387,210
0.1252,-9.5857,212
3.1552,-10.2378,213
0.9381,-10.0584,214
-1.7287,-8.9244,215
-0.1406,-9.5096,216
13.1953,-9.7079,218
9.5376,-9.856,219
3.5094,-9.9307,220
-1.3009,-9.5794,221
-0.2382,-9.2564,222
4.423,-9.6625,223
-0.3577,-10.2417,224
0.9231,-9.8374,225
0.0785,-10.4329,227
0.4512,-9.5682,228
1.8797,-9.7931,229
0.3183,-9.8434,230
1.5827,-9.8301,232
-1.561,-9.7929,233
-7.316,-9.7454,234
0.454,-9.8586,235
-0.7635,-9.8343,236
0.3021,-9.8014,238
1.218,-9.943,239
3.1593,-9.8098,240
1.9067,-9.6471,241
0.3082,-9.9378,242
5.5095,-11.0147,243
2.9411,-9.6107,244
3.894,-9.7497,245
-5.0483,-9.6138,246
1.1092,-9.7708,248
4.2142,-9.7595,249
-12.7609,-9.6669,250
-1.4881,-9.7536,251
-11.8654,-9.691,252
-0.6159,-9.6168,253
-11.7992,-9.7181,254
-0.6025,-9.7964,255
-6.6061,-9.7959,256
3.1007,-9.7353,258
-0.899,-9.7618,259
-0.4665,-9.7657,260
0.2757,-9.8048,261
2.1677,-9.7749,262
2.9895,-9.8052,263
-4.9595,-9.7748,264
-0.42,-9.7543,265
2.6343,-9.7201,266
0.223,-9.792,267
-1.6387,-9.7915,268
-0.0165,-9.715,269
21.1313,-9.6738,271
0.3636,-9.7889,272
-4.7527,-9.8036,273
-1.1762,-9.7913,274
0.2592,-9.8049,275
2.8694,-9.7397,276
0.6362,-9.8866,278
0.6377,-9.8021,279
-2.6628,-9.7657,280
10.0845,-9.9214,281
17.429,-10.2193,282
24.0046,-10.2624,283
-9.3781,-9.3377,284
5.798,-9.841,285
13.3849,-9.8119,287
-4.415,-8.9594,288
7.1132,-10.0157,289
2.3287,-10.1081,290
4.4519,-9.5843,291
0.7609,-9.9017,293
4.5875,-9.7004,294
-0.9652,-9.1266,295
-1.5402,-9.723,296
44.2974,-9.2712,297
0.9682,-10.2237,298
-0.8428,-9.8571,299
-1.7319,-9.914,300
3.1429,-9.8695,302
0.7792,-9.8536,303
10.8739,-10.5318,304
25.9683,-9.9033,305
7.5182,-10.0721,306
5.5002,-9.6626,308
8.3749,-9.8599,309
18.2181,-9.9065,310
70.3871,-9.4529,311
-0.9018,-8.952,312
7.9124,-9.7122,313
-5.1196,-9.8603,314
14.1516,-10.0176,315
4.3343,-9.6101,316
-3.0923,-9.7562,318
6.8656,-9.5131,319
-2.6126,-9.8909,320
-0.0811,-9.7619,321
11.682,-9.8109,322
-0.0066,-9.7304,323
-0.3864,-9.8239,324
-9.3657,-9.6702,325
9.6277,-9.8878,327
-21.3256,-9.7729,328
1.152,-9.8495,329
2.689,-9.8996,330
4.1872,-9.6053,331
-8.0688,-10.1102,332
21.3057,-9.83,333
11.8318,-10.0932,334
0.6238,-9.6514,335
7.7418,-10.1302,336
13.7791,-10.0019,337
2.9148,-9.8139,338
1.167,-9.9009,339
2.0746,-9.9965,340
5.0217,-9.932,341
7.1332,-9.9223,342
2.5464,-10.01,343
-2.5736,-10.5455,344
-0.3057,-10.1456,345
5.1692,-9.8765,346
24.078,-9.9585,347
0.0924,-9.4005,348
-22.9001,-9.0692,349
-14.6488,-9.544,350
4.0637,-10.1738,351
18.4739,-9.8707,352
0.6298,-9.841,353
1.1731,-9.8979,354
-0.6263,-9.8376,355
-1.8129,-9.8106,356
-1.0383,-9.7664,357
3.7644,-9.7906,358
-0.3755,-9.8171,359
-0.8366,-9.8476,360
-0.1526,-9.8365,361
-0.8421,-9.8232,362
0.2095,-9.7754,363
-1.6727,-9.7884,364
0.0417,-9.7781,365
0.2301,-9.7786,366
-0.8074,-9.7874,367
0.8031,-9.8028,368
-0.6093,-9.8031,369
-0.2183,-9.7766,370
-0.8315,-9.799,371
-3.6356,-9.7802,372
-1.8162,-9.7532,373
-3.9821,-9.8124,374
0.5812,-9.7752,375
1.2392,-9.9448,376
10.0178,-9.6939,377
1.1166,-9.876,378
-2.9523,-9.8503,379
-4.5007,-10.0121,380
12.083,-10.1047,381
7.2879,-9.9159,382
2.9083,-9.8447,383
0.0367,-9.8061,384
3.5259,-9.9144,385
-2.341,-9.6629,386
9.0993,-9.9119,387
-17.8013,-9.688,388
-7.2868,-10.1767,389
19.6251,-9.9451,390
112.0899,-9.2842,391
-9.815,-9.9591,393
-1.3819,-9.9394,394
31.4997,-9.6504,395
10.5636,-10.595,396
-20.4334,-9.7222,397
8.3532,-9.9655,399
26.4446,-9.6226,400
34.2608,-9.9936,402
12.6757,-9.8948,403
4.9205,-9.9618,404
-0.0356,-9.6653,405
1.635,-9.7999,406
2.2435,-9.7188,408
-0.5673,-9.6154,409
-0.915,-9.8503,410
-3.4835,-9.0441,411
-0.8334,-9.6999,413
-4.5594,-9.7802,414
48.2077,-9.7738,415
0.4493,-8.3331,416
-36.5708,-9.1542,417
4.0944,-10.2252,418
-0.7562,-9.7484,419
4.0324,-9.2366,420
-0.7047,-9.814,421
-1.0495,-8.1899,423
4.7067,-10.1893,424
50.8934,-8.8352,425
5.4429,-9.8693,426
1.7179,-8.8184,427
18.1125,-9.596,428
-0.0294,-8.9527,429
25.2143,-9.9363,430
-0.0182,-10.2007,432
7.9179,-9.3676,433
9.615,-8.2023,434
29.1983,-8.9504,435
9.9434,-8.4472,436
-0.8577,-8.8727,437
18.3615,-10.0709,438
11.019,-10.0322,439
1.2749,-9.8918,440
3.8491,-9.3973,442
19.1379,-9.7699,443
-5.5904,-9.6814,444
-1.7683,-9.2368,445
7.09,-9.4935,446
39.5036,-9.6554,447
39.9696,-9.7221,448
2.782,-9.9966,449
-2.4967,-10.2858,450
-2.1786,-9.841,451
23.5194,-9.9054,453
3.8932,-10.1627,454
-4.2582,-10.2546,455
13.0575,-9.715,456
12.0245,-9.9366,458
9.3911,-9.9193,459
7.8444,-10.1805,460
36.9642,-9.9155,461
-7.4443,-9.9544,463
-16.7868,-9.7981,464
11.8809,-10.204,465
9.176,-8.1643,466
-4.511,-9.5998,467
8.2568,-9.862,468
16.7862,-9.6858,469
-10.1288,-9.5409,470
-1.4231,-9.829,471
5.7111,-7.5129,473
-1.2611,-9.3891,474
3.1924,-8.8163,475
-3.0505,-9.6006,476
0.2814,-8.8048,477
9.0996,-9.6424,478
79.4305,-8.7146,479
5.7406,-9.5344,480
18.0679,-9.503,481
-1.7306,-9.8161,483
-2.0704,-9.7852,484
-2.7151,-9.7656,485
-3.5377,-9.6355,488
1.2484,-9.607,489
-0.7478,-9.6126,490
-0.3453,-9.5932,492
-0.6542,-9.5341,493
4.929,-9.5554,494
-0.4648,-9.7239,495
-0.2605,-9.7936,496
-1.9622,-9.8211,497
1.1782,-9.7895,498
-0.1296,-9.7992,499
-0.8415,-9.9313,500
-0.7855,-9.6652,502
5.0015,-9.8178,503
3.2424,-9.9174,504
5.9469,-9.8303,505
10.7103,-9.8362,506
0.8095,-9.8602,507
8.9364,-9.9464,508
-0.1383,-9.8643,509
4.3142,-9.8803,510
-3.1309,-10.2271,512
-2.3576,-10.8334,513
5.5689,-9.9214,514
13.7075,-10.2113,515
21.1524,-9.6663,516
-0.7895,-10.3784,517
-0.0262,-9.9199,519
1.8584,-9.8122,520
1.7494,-10.2836,522
3.4393,-9.8341,523
-0.0063,-9.7695,524
4.253,-11.0044,525
-4.3702,-9.6622,526
4.2755,-10.7575,528
9.6698,-8.9095,529
2.6088,-7.8736,530
0.7964,-7.4703,531
-2.8257,-9.6699,532
-2.5834,-9.0337,533
2.6454,-9.8635,534
1.6198,-9.2702,535
22.32,-9.5185,536
10.0626,-9.7989,537
0.3777,-9.6769,538
1.0283,-10.2749,539
1.9267,-7.76,540
2.9662,-9.4387,541
32.9819,-9.548,542
7.6974,-10.0663,543
-2.0713,-9.8133,544
16.5052,-9.7854,545
1.4278,-10.4457,546
-1.9559,-10.243,547
11.4494,-9.7315,548
7.8082,-10.027,549
-0.6734,-10.06,550
-3.5801,-10.7465,551
15.0766,-9.7596,552
6.7588,-9.868,553
1.5085,-9.9657,554
-1.8648,-8.8804,555
4.0184,-9.693,556
3.6277,-9.7128,557
0.1089,-9.8751,558
-0.7328,-9.7703,559
2.4821,-9.8847,560
20.9762,-7.848,561
-19.4718,-8.9344,562
0.8296,-10.0953,563
19.826,-9.3669,564
-0.8416,-9.8262,565
-7.17,-9.7979,566
-2.2721,-9.7285,567
18.6584,-9.6813,568
-1.4329,-9.8153,569
-1.1215,-9.8075,570
1.3483,-9.7053,571
2.6622,-9.7848,572
11.1982,-9.7423,573
0.4774,-9.8043,574
-0.0075,-9.808,575
-1.4326,-9.9619,576
-5.7044,-9.7624,577
20.79,-9.7229,578
8.8461,-10.1209,579
7.9845,-10.0575,580
4.9334,-9.9642,581
73.8964,-9.5437,582
-3.8641,-8.8124,583
11.7398,-10.0003,584
7.8727,-10.1105,585
1.9369,-9.7533,586
-3.1204,-9.7701,587
-1.7785,-9.7734,588
-3.6017,-9.6167,589
-25.3739,-9.4412,590
2.2548,-9.5999,591
19.3532,-9.6559,592
-26.2449,-9.5044,593
37.1453,-9.4682,594
4.2589,-9.7321,595
-1.9046,-9.8702,596
-1.0337,-9.7934,597
7.804,-9.7392,598
7.6224,-9.8399,599
-4.4989,-9.8705,600
19.9693,-9.7211,601
50.2032,-10.1736,602
7.3856,-10.1968,603
11.8283,-8.9377,604
7.6774,-9.8043,605
-0.694,-9.6493,606
37.2492,-9.6862,607
3.6867,-9.7688,609
1.3418,-9.8183,610
4.4742,-9.9684,611
0.385,-9.7903,612
24.0252,-9.9039,613
4.9723,-9.306,614
0.5966,-9.9277,615
1.8799,-10.0507,616
6.0969,-10.1831,617
12.5077,-9.7026,619
21.8114,-8.9338,620
4.9733,-10.0535,621
0.0782,-10.0456,622
3.6909,-9.6448,623
3.6819,-8.7996,624
3.9442,-9.4123,625
9.6426,-9.7514,627
2.9113,-9.8012,628
4.0525,-9.7876,629
3.5713,-9.7508,630
1.3236,-9.9391,631
2.2316,-9.7013,632
6.1769,-10.6419,633
0.9632,-9.6945,634
0.7105,-9.7174,635
-1.2564,-10.211,636
-2.3898,-9.6161,637
14.8425,-9.6066,638
4.6709,-9.8295,639
31.0612,-9.7601,640
-13.0901,-9.4297,641
-2.4787,-9.9843,642
9.3072,-9.8645,643
6.9136,-9.1646,644
0.2308,-9.6367,645
11.9458,-9.57,646
1.3739,-9.7868,647
0.0468,-10.0575,648
5.2406,-9.8007,649
0.3478,-9.8954,650
-0.4911,-9.8199,651
-3.0446,-9.8114,652
0.1435,-9.6424,653
7.1315,-9.5881,654
1.9786,-9.7943,655
-0.6264,-9.7734,656
0.2357,-9.8241,658
0.0348,-9.818,659
8.3563,-9.6907,660
-0.2752,-9.7972,661
2.2232,-9.9587,662
-1.0447,-9.7499,663
2.9459,-10.3562,664
-2.2459,-9.8095,665
-6.6737,-10.4364,666
26.1609,-9.9614,668
1.9537,-9.7017,669
7.4405,-10.2402,670
1.7254,-9.8201,671
1.3273,-9.5632,672
6.2827,-8.6382,673
14.8052,-10.0145,674
-0.4595,-9.8253,675
1.2502,-9.8571,676
4.7001,-9.5985,678
-32.1546,-9.455,679
56.8828,-8.8891,680
2.6304,-9.7229,681
-0.9462,-9.802,682
1.3313,-9.8041,683
1.6963,-9.7931,684
8.5315,-9.7514,685
-0.6242,-9.8109,686
-0.2925,-9.7968,688
0.0959,-9.8145,689
0.3242,-9.8291,690
-0.1885,-9.8078,691
0.0247,-9.8063,692
0.211,-9.8132,693
-0.3799,-9.7967,694
-0.0652,-9.8097,695
-0.5351,-9.801,696
0.4168,-9.8044,697
-0.2407,-9.8157,698
-0.6947,-9.7971,699
0.496,-9.797,700
0.4978,-9.8108,701
0.0525,-9.8148,702
-0.0323,-9.8178,703
-0.4233,-9.8,704
-0.1201,-9.8053,705
1.2705,-9.8466,706
0.0169,-9.8156,707
-0.2224,-9.8118,709
-0.8539,-9.7916,710
-0.0236,-9.8022,711
-4.0985,-9.7737,712
2.2487,-9.7795,713
0.0625,-9.7678,714
0.0738,-9.8005,715
0.3199,-9.7685,716
-0.0131,-9.7446,717
1.4089,-9.862,718
-18.6184,-9.6037,719
1.1693,-9.7659,721
1.629,-9.7888,722
-0.1032,-9.8081,723
0.1021,-9.808,724
0.2151,-9.8112,725
-2.0759,-9.744,726
-1.3411,-9.6825,728
-0.2916,-9.7803,729
-0.5714,-9.7975,730
0.0992,-9.8046,731
0.0058,-9.7977,732
-0.4496,-9.7894,733
-0.0008,-9.8066,734
0.0616,-9.8042,735
0.0096,-9.8074,737
-2.7937,-9.7761,738
1.3858,-9.7725,739
3.815,-9.7946,740
-1.8298,-9.7526,741
-9.4912,-9.6942,742
-7.6232,-9.7154,743
-2.2109,-9.7017,744
-2.0107,-9.951,745
0.8072,-9.7498,747
2.6121,-9.8931,748
6.5926,-9.9374,749
1.8621,-9.7312,750
13.013,-9.362,751
2.1567,-9.7662,752
0.0637,-10.1706,753
1.6725,-10.1426,754
8.265,-9.6988,755
11.636,-9.5947,757
-0.1352,-8.2269,758
11.086,-9.8566,760
21.315,-9.5791,761
9.7335,-9.9116,762
10.1768,-9.8112,763
-0.6151,-9.8354,764
0.0904,-9.8208,765
1.9914,-9.8551,766
7.5758,-9.8696,768
1.1943,-9.8181,769
4.9836,-9.7653,770
1.5299,-9.482,771
4.6769,-9.4439,772
2.5439,-10.0102,773
-6.6279,-8.5377,774
-0.7697,-9.7368,775
6.8881,-10.1504,776
2.5721,-9.9603,778
3.7012,-9.91,779
3.3559,-9.724,780
3.9385,-9.7958,781
23.2146,-10.0982,782
2.7715,-9.8772,783
-3.8561,-9.7441,784
1.2022,-9.8671,785
-2.0989,-9.9332,786
0.3841,-9.835,788
4.3664,-9.8742,789
25.6109,-9.7317,790
6.6583,-9.5605,791
3.7699,-9.9161,792
4.0694,-9.7107,793
10.5011,-10.3289,794
2.9572,-9.8321,795
0.1616,-9.7104,797
0.926,-9.7889,798
5.3839,-9.7514,799
0.2198,-9.769,800
0.6914,-9.8808,801
-0.463,-9.7691,802
8.9193,-9.8658,803
1.0213,-9.3644,804
10.2185,-9.7915,805
6.1327,-9.6835,807
7.8275,-9.8846,808
-1.9616,-9.6788,809
21.1946,-9.8135,810
-0.7996,-8.9643,811
5.6908,-9.543,812
7.9361,-9.7296,813
5.655,-9.5883,814
4.7646,-10.044,815
19.3523,-9.8037,816
2.9069,-9.9935,818
7.2279,-9.7881,819
6.313,-9.8524,820
2.1716,-9.7997,821
0.5136,-9.7862,822
-0.1441,-9.5628,823
-2.6178,-9.715,824
-0.2999,-9.5408,825
-0.3473,-10.0201,826
5.008,-9.662,828
3.8875,-9.6475,829
-2.4097,-9.9683,830
10.1886,-9.8927,831
6.9855,-7.3622,832
3.6121,-10.1379,834
17.4393,-9.5446,835
3.9902,-9.9259,837
5.0368,-9.4477,838
1.0856,-9.9296,839
4.9354,-9.9573,840
0.4634,-9.4675,841
7.0648,-9.6319,842
2.4457,-9.2316,843
-0.2482,-9.9994,844
44.5134,-9.6331,845
43.5733,-9.9557,846
1.6388,-9.8037,848
4.1519,-9.9994,849
-3.4404,-9.6616,850
0.163,-9.8364,851
-5.0242,-9.8103,852
7.9201,-9.6259,853
1.3627,-9.8032,854
-4.4757,-9.5671,855
-0.797,-9.8918,856
-0.3321,-9.7974,858
-0.0821,-9.8057,859
