AYGX_mean,AZ_mean,timestamp
-0.6307,-9.6151,0
-0.653,-9.6143,1
-0.6513,-9.615,3
-0.6609,-9.6148,4
-0.6504,-9.6151,5
-0.6584,-9.6146,6
-0.6702,-9.6149,7
-0.67,-9.6146,8
-0.6463,-9.615,9
-0.6512,-9.6146,10
-0.6679,-9.6133,11
-1.2123,-9.6393,13
-13.8872,-9.6053,14
38.6379,-9.4428,16
-0.3227,-9.8798,17
6.4857,-9.8445,18
-1.8509,-9.9552,19
2.7867,-9.9522,20
-3.2376,-9.9242,21
-7.0705,-9.8256,22
-0.649,-9.8942,23
0.7638,-9.9037,24
0.6397,-9.9194,25
4.4315,-10.0194,26
1.223,-10.0619,27
21.0346,-9.8994,28
-1.3081,-9.8639,29
15.181,-9.8247,30
1.2409,-9.9617,31
-0.5665,-9.8394,33
1.7117,-9.9253,34
-0.4598,-9.7403,35
0.1521,-10.331,36
0.1668,-9.9558,37
1.6336,-9.9329,38
1.1891,-9.8563,39
-0.1149,-9.8863,40
0.5806,-10.0035,41
0.989,-10.2806,43
-5.9286,-9.1975,44
2.4071,-10.2598,45
0.7907,-9.6915,46
0.2227,-9.9248,47
-2.985,-9.997,48
9.4893,-9.9191,49
-0.0688,-10.2042,50
0.372,-9.9549,51
1.0227,-9.9187,53
6.9987,-9.8136,54
0.7759,-9.7641,55
6.89,-9.9585,56
-1.4215,-9.8869,57
-1.6422,-9.8141,59
-6.3037,-9.876,60
-2.9732,-10.0029,61
-0.0907,-9.921,62
-0.314,-9.8871,63
-32.5963,-9.6706,64
0.1933,-9.7379,65
2.5146,-9.9037,66
-1.1032,-9.8648,68
1.8859,-9.854,69
11.9731,-9.8792,70
2.8745,-9.7382,71
-60.9033,-9.5901,72
-2.0026,-9.8053,73
-245.9876,-2.1148,74
2.7507,0.8942,75
-2.6139,0.8209,77
-2.6323,0.8222,78
-2.668,0.825,79
-2.6334,0.8248,80
-2.6865,0.8249,81
-2.5243,0.8236,82
-2.5782,0.8237,83
-2.5866,0.825,84
-2.6114,0.8242,85
-2.6259,0.8232,86
-2.6073,0.8225,87
3.6879,0.9176,88
254.9584,-1.1834,89
247.0847,-6.1657,90
65.9436,-9.1949,91
-11.8537,-9.5483,92
9.3418,-9.5851,93
