AYGX_mean,AZ_mean,timestamp
1.7222,-9.772,453
1.3174,-9.6498,454
0.4625,-9.9701,455
0.5639,-9.6834,457
1.5972,-9.8004,458
5.2495,-9.6428,459
4.3465,-9.7855,460
3.856,-9.7877,462
-251.1978,-8.2243,463
-28.0789,-8.7207,464
10.0226,-9.7402,465
-4.0458,-9.7247,466
-0.7001,-9.7355,467
-0.671,-9.7295,468
-0.4851,-9.7269,469
-1.0977,-9.719,470
-0.5428,-9.7209,472
-0.4193,-9.7177,473
