AYGX_mean,AZ_mean,timestamp
0.9366,-9.7762,2764
0.9443,-9.7766,2765
0.9305,-9.7769,2766
0.9369,-9.776,2767
0.9377,-9.7771,2768
0.9383,-9.7768,2769
0.9218,-9.7746,2770
1.0365,-9.7729,2771
41.801,-9.6358,2772
-1.7966,-9.7229,2773
1.5724,-9.7061,2774
-0.7385,-9.8213,2775
-1.0657,-9.8674,2776
-10.8064,-9.7694,2777
-2.2973,-9.7732,2778
-18.568,-9.6964,2779
-13.1267,-9.6806,2780
14.2889,-9.4544,2781
3.9737,-9.2735,2782
42.039,-9.4024,2783
