AYGX_mean,AZ_mean,timestamp
-1.7986,-9.8676,191
5.6249,-9.7398,192
-5.5793,-9.8265,193
2.4394,-9.8204,194
-1.3911,-9.8293,195
-0.7927,-9.7796,196
-24.0806,-9.6262,198
-0.1389,-9.6666,199
-58.2575,-9.3531,200
148.244,-8.6255,201
-21.8493,-9.8082,202
0.8538,-9.7255,203
13.3921,-9.6975,204
-10.8561,-9.7233,205
-103.9933,-8.7082,206
37.4653,-9.4971,208
1.4302,-9.8505,209
-6.4711,-9.8258,210
-5.9353,-9.7979,211
