AYGX_mean,AZ_mean,timestamp
-0.0159,-9.9116,0
-0.0153,-9.9108,1
-0.017,-9.9121,4
-0.0118,-9.9123,5
-0.0115,-9.9131,6
-1.301,-9.901,8
-0.5938,-9.8875,9
-11.5513,-9.7998,10
-0.6244,-9.6191,11
-19.0782,-9.5262,12
7.1167,-9.6322,13
3.6231,-9.8182,15
13.7205,-9.9027,16
-2.739,-9.8725,17
4.0802,-9.849,18
-2.9561,-9.8629,19
2.5054,-9.8847,20
-0.9918,-9.9004,21
0.1211,-9.8952,22
-0.2529,-9.9133,23
0.0519,-9.9126,24
-0.3649,-9.9118,25
-0.3893,-9.9096,26
-1.137,-9.9025,27
0.6681,-9.8993,28
0.0683,-9.8947,29
0.1912,-9.9092,30
0.1655,-9.9137,31
0.2911,-9.9113,32
0.1028,-9.9141,34
-0.1602,-9.911,35
1.4655,-9.8957,36
-2.8133,-9.8613,38
-0.9251,-9.8571,39
5.3847,-9.9747,40
-1.5216,-9.8332,41
-0.14,-9.9069,43
0.1265,-9.9094,44
0.0511,-9.9077,45
-0.0447,-9.9058,46
1.0216,-9.851,47
-0.443,-9.9094,48
-0.6412,-9.8891,49
0.64,-9.8871,50
0.2357,-9.8988,51
0.43,-9.8944,52
-0.0296,-9.9024,53
-0.3431,-9.894,54
0.3217,-9.9011,55
0.7431,-9.8977,56
-1.2177,-9.8977,57
0.8121,-9.8874,58
0.4968,-9.8894,59
0.6572,-9.8902,60
0.7198,-9.8975,61
0.4969,-9.9023,63
-0.2777,-9.8822,64
0.9198,-9.8743,65
0.9193,-9.8816,66
0.6046,-9.8846,67
0.4779,-9.8839,69
0.5035,-9.8815,70
0.6954,-9.8853,71
0.469,-9.887,72
0.3328,-9.884,73
-0.0078,-9.873,74
1.3627,-9.8677,75
1.031,-9.8786,76
1.2667,-9.8871,77
0.4076,-9.8843,78
0.8589,-9.8838,79
0.978,-9.8852,80
0.7231,-9.8951,81
0.1499,-9.8912,82
0.1572,-9.8861,83
0.539,-9.8847,84
0.2086,-9.8834,85
0.9545,-9.8779,86
0.4508,-9.8867,87
0.2845,-9.8865,88
1.5779,-9.8841,89
-0.2771,-9.8887,90
0.6067,-9.8931,91
0.1663,-9.8898,92
-2.1188,-9.8656,93
-0.1341,-9.8907,94
1.239,-9.8891,95
0.3079,-9.8823,96
0.4054,-9.8583,97
0.5965,-9.8651,98
2.099,-9.8741,99
2.0285,-9.8934,101
0.0311,-9.9072,102
-0.0144,-9.9105,103
0.1821,-9.9093,104
-0.0078,-9.9098,105
0.0038,-9.9106,106
-1.6009,-9.8904,107
-1.1662,-9.8884,108
2.9153,-9.8845,109
-0.8857,-9.8993,110
-1.0461,-9.8914,111
0.731,-9.8949,112
-0.1649,-9.9114,113
-0.1898,-9.9023,114
-5.338,-9.8244,115
-2.7409,-9.7976,116
2.4659,-9.7642,117
1.7213,-9.7699,121
3.66,-9.8327,123
2.3866,-9.8624,124
1.3214,-9.9273,125
-1.0754,-9.8303,126
-36.6825,-9.4774,127
28.6761,-9.5178,128
5.1733,-9.8149,129
-31.892,-9.7445,130
-0.8461,-9.6319,132
27.2232,-9.8055,133
8.9913,-9.8175,134
1.7029,-9.9102,135
0.1695,-9.929,136
-5.1868,-9.8765,137
3.8762,-9.7627,138
-12.9761,-9.837,139
9.2403,-9.837,140
-0.3658,-9.881,141
-0.7163,-9.8317,142
-1.9489,-9.8912,143
-0.0586,-9.9201,144
-0.2786,-9.9276,145
-0.4243,-9.9025,146
0.0174,-9.9216,147
-0.2996,-9.9551,148
0.8895,-9.9223,149
-2.9659,-9.6711,150
-5.2513,-9.8388,151
2.5599,-9.8663,152
-0.9699,-9.9104,153
-0.0714,-9.9324,154
2.1864,-9.7898,155
-2.0703,-9.9281,156
0.4516,-9.9303,157
1.6105,-9.7905,158
6.0923,-9.3295,159
7.0863,-9.668,160
6.3071,-9.8991,161
5.7788,-9.9364,163
4.03,-9.8389,165
1.8858,-9.7706,166
-0.029,-9.9423,167
0.6791,-10.0101,168
0.1889,-9.9177,170
16.0163,-9.8781,171
-0.2791,-10.0096,173
3.0927,-9.9744,175
-0.8049,-10.0042,176
37.0109,-9.8599,177
14.9973,-10.1158,178
0.8673,-10.067,179
-0.0833,-9.8395,180
0.0732,-9.9543,181
2.4015,-9.9463,182
-0.6817,-10.1647,183
0.3779,-9.8959,184
1.5805,-10.0625,185
2.85,-9.8121,186
0.4756,-10.4438,187
-0.7102,-5.9452,188
3.9121,-9.6902,189
2.5134,-9.6777,190
-0.0167,-10.2383,191
5.8898,-9.9148,193
0.5435,-9.9274,194
1.3394,-9.8894,195
1.2639,-9.9612,196
2.4325,-9.3888,197
1.0424,-10.0368,198
-0.9229,-9.9376,199
28.9608,-9.5904,200
2.4141,-9.8394,201
1.8694,-9.9137,202
0.2735,-9.9487,203
0.8874,-9.786,204
1.5825,-9.9339,205
-0.543,-9.9004,206
-5.8309,-9.8405,207
1.9863,-9.7684,208
-0.2222,-9.7907,209
0.8906,-9.5866,210
1.3425,-9.7925,211
-0.795,-9.9992,212
2.9574,-9.8383,213
0.1607,-10.1193,214
0.6337,-9.6339,215
12.1288,-10.1182,216
3.2038,-9.719,217
-0.4803,-9.7695,218
-0.2981,-10.0085,219
0.8213,-9.9776,220
-1.5495,-10.2073,221
5.5124,-9.8963,223
2.5932,-10.1211,224
8.6214,-9.9108,226
14.2353,-10.365,227
1.4409,-9.9782,228
0.9651,-9.8048,229
2.5835,-9.921,230
-0.1407,-10.086,231
0.5984,-9.8356,232
3.601,-10.0226,234
1.8693,-9.82,235
9.0368,-10.4081,236
-0.3407,-9.9033,238
2.0541,-9.8719,239
1.113,-9.8463,240
8.8519,-10.0781,241
-4.6919,-9.8735,243
3.6031,-10.0892,244
0.1961,-9.9812,245
0.2905,-10.0079,246
1.9343,-10.026,247
-3.3599,-10.1028,248
0.0594,-10.1111,249
0.1777,-10.0083,250
0.6615,-10.0707,251
0.8869,-10.0354,252
0.1874,-10.2114,253
2.0982,-9.922,254
4.1445,-9.8475,255
0.6611,-9.7965,256
0.7609,-10.1985,257
-0.1736,-9.9892,258
1.2676,-10.2553,259
5.7334,-8.3891,260
1.4416,-9.8552,261
-2.4533,-10.0827,262
9.6317,-9.7458,264
2.4593,-10.0322,265
0.1354,-9.9513,266
2.4887,-9.8285,267
2.3706,-10.0198,268
-0.6923,-8.6817,269
1.8694,-9.8184,270
5.8149,-10.0177,271
1.9186,-9.9298,273
4.6074,-9.9835,274
-1.227,-7.9142,276
1.7758,-10.02,278
1.2445,-9.8905,279
11.9861,-9.918,280
3.5306,-10.0056,281
5.8597,-10.0581,282
4.0804,-10.0385,283
3.3204,-9.8767,284
7.3348,-10.2347,285
0.831,-9.8844,286
0.9724,-9.9278,287
1.4599,-9.9613,288
0.474,-9.8454,289
2.3368,-9.9433,290
0.5611,-10.0374,291
0.4319,-9.8294,293
0.2054,-9.9026,294
-2.6806,-9.932,295
-0.0482,-9.8148,296
-0.2702,-9.8393,297
0.0004,-9.8843,298
12.8249,-10.1003,300
4.835,-9.989,301
6.087,-9.5355,303
4.4665,-9.5671,304
6.1426,-9.8419,305
1.2318,-9.8045,306
13.8839,-10.4276,307
2.4628,-9.7019,308
6.8664,-9.8757,309
1.2231,-9.7133,310
-0.741,-10.1433,311
8.2523,-10.1555,312
0.8784,-9.6158,313
15.1485,-9.1806,314
2.0416,-9.3944,315
1.3164,-9.4561,316
1.6633,-9.5414,317
-0.5025,-9.6845,318
-0.1787,-9.7177,319
0.0777,-10.0571,320
2.3462,-9.0642,321
-3.5136,-8.1465,323
3.2865,-10.0758,324
-1.8506,-10.0933,325
11.3401,-9.9802,326
0.0233,-9.8941,327
1.9436,-10.0386,328
-0.3423,-9.849,329
0.048,-9.7969,330
2.8774,-9.8323,331
1.1734,-9.9485,333
17.9906,-9.9729,335
-1.0251,-10.1015,336
1.3713,-9.7215,337
-31.5756,-9.6591,338
-27.4424,-9.0501,339
8.4147,-9.081,340
3.4076,-9.2353,341
-2.0582,-9.4261,342
-4.134,-9.409,343
-2.1581,-9.4156,344
-5.8149,-9.4269,345
-1.9911,-9.5331,346
2.6051,-9.5863,348
6.0853,-9.7073,349
6.8321,-9.8943,350
4.828,-9.8816,351
9.8903,-9.7054,352
-0.223,-9.9123,353
-5.3934,-9.9796,354
0.5104,-9.6865,355
-0.1323,-9.8737,356
0.2481,-9.7067,357
7.9315,-9.9681,359
5.7244,-9.9289,360
30.2394,-9.422,361
2.8102,-10.0079,363
0.0947,-9.6283,364
15.4395,-9.9619,366
12.605,-9.8496,367
0.7895,-9.948,368
0.484,-9.9279,369
0.9508,-9.9496,370
0.4133,-9.9262,371
3.1763,-9.8938,372
-0.1528,-9.7946,373
1.4194,-10.01,374
0.342,-9.9891,375
0.9327,-9.9464,376
1.5126,-9.9119,378
0.375,-9.8519,379
0.0135,-10.3649,380
-0.0918,-10.1021,381
1.3959,-10.16,382
2.3087,-9.8534,383
-2.8579,-10.4464,384
6.6747,-10.4356,385
-0.2968,-9.7781,386
3.4238,-9.5438,388
5.2616,-10.0123,389
4.2084,-10.0162,390
-0.0718,-9.6689,391
25.9698,-7.0737,392
1.8889,-9.9963,393
4.3008,-10.1117,394
1.2493,-9.8494,395
1.5817,-9.8596,397
-0.089,-9.8579,398
0.6958,-9.9408,399
0.124,-9.9567,400
0.1424,-9.8569,401
0.4578,-10.0571,402
0.2648,-9.9906,403
0.0724,-9.9059,404
0.0364,-9.913,405
0.0738,-9.912,406
0.388,-9.9171,408
0.095,-9.9725,409
0.0471,-9.8545,410
0.1231,-9.8566,411
1.2263,-9.9513,412
-0.027,-9.9101,413
1.7644,-9.9425,414
3.9203,-9.9455,415
9.3206,-9.9387,417
-2.2009,-9.9346,418
2.105,-9.8758,419
1.7801,-9.8647,420
33.3393,-9.9165,421
-0.1223,-10.0014,423
2.6152,-9.8129,424
0.6008,-6.6101,425
0.6598,-9.6519,426
0.0089,-9.6367,427
5.6106,-9.2532,429
0.3138,-10.0111,430
3.1529,-9.3846,431
3.4969,-9.5588,432
4.6268,-9.5554,433
3.5588,-9.6049,434
4.7299,-9.786,435
16.2417,-9.1491,436
0.6266,-9.3934,437
1.2698,-9.9932,438
1.8457,-10.0489,439
20.6694,-10.041,440
0.323,-9.9313,441
0.1361,-9.8521,443
0.4023,-9.9514,444
0.7661,-9.9109,445
-0.4934,-9.9185,446
-7.7268,-9.8443,447
-1.5279,-9.908,449
0.9228,-9.8715,450
0.3542,-9.8801,451
0.0031,-9.9192,452
-3.454,-9.8859,453
-1.3723,-9.8545,454
0.0771,-9.8951,455
-0.0454,-9.8934,456
-0.5638,-9.9068,458
0.2194,-9.9152,459
-0.564,-9.9114,460
-0.1543,-9.9154,461
-0.6764,-9.9107,462
-0.3822,-9.9039,463
0.2311,-9.9118,464
0.0175,-9.9182,465
-0.5307,-9.9181,466
-0.0643,-9.9271,467
0.3063,-9.917,468
-0.3597,-9.919,469
-0.7484,-9.9143,470
-0.0243,-9.9116,471
-0.2105,-9.9176,472
-0.164,-9.9192,473
-0.3717,-9.9184,474
-0.09,-9.9152,475
-0.431,-9.9167,476
-0.8422,-9.913,478
-0.2596,-9.9158,479
-0.2631,-9.9125,480
-0.1271,-9.9147,481
-0.0521,-9.9108,482
-0.5434,-9.919,483
-0.5521,-9.91,484
-0.3592,-9.913,485
-1.2589,-9.9088,486
-0.5183,-9.8989,488
-0.3056,-9.9118,489
-0.1247,-9.9098,490
-0.4866,-9.9072,492
-0.7755,-9.9026,493
-0.1397,-9.9059,494
-1.1651,-9.8954,495
-0.5556,-9.897,496
-0.6367,-9.8941,497
-0.7475,-9.8915,499
-0.5324,-9.8909,500
0.4213,-9.9025,501
-0.071,-9.8968,502
-0.1772,-9.9103,503
-0.0183,-9.9101,504
0.1766,-9.9265,505
-0.4557,-9.9134,506
-0.3673,-9.9057,508
-0.6687,-9.9007,509
0.2479,-9.9062,510
-0.7002,-9.8886,511
-0.5957,-9.9127,512
-1.2301,-9.9026,513
0.5399,-9.9146,514
-2.1648,-9.8935,515
-0.7251,-9.8812,516
-4.8717,-9.872,518
3.0566,-9.877,519
-0.2094,-9.9087,520
0.404,-9.8847,521
-0.1809,-9.9066,523
-0.498,-9.9106,524
-0.0879,-9.9119,525
-3.3181,-9.9089,526
0.0397,-9.8925,527
-0.508,-9.9395,528
0.0982,-9.9134,529
0.7931,-9.918,530
-0.2291,-9.9199,531
0.0487,-9.9375,532
-2.0832,-9.9012,533
-0.3058,-9.9093,534
-1.8048,-9.8889,535
-0.2126,-9.8722,536
-0.6713,-9.8781,538
-0.2496,-9.858,539
1.1565,-9.9237,540
0.9849,-9.7981,541
5.4359,-9.8703,542
-0.8966,-9.8922,543
1.0665,-9.8867,544
-1.4307,-9.8931,545
-0.5604,-9.888,546
-0.8638,-9.8884,548
-1.0349,-9.8756,549
-2.8316,-9.857,550
1.6249,-9.8373,551
-2.6131,-9.8608,553
4.7556,-9.8348,555
0.0862,-9.9197,556
-0.3611,-9.9216,557
-0.2202,-9.9102,558
-0.8242,-9.911,559
-1.0708,-9.8966,560
-0.2936,-9.9072,561
0.0404,-9.8992,562
-1.4136,-9.9075,563
-0.3024,-9.9041,564
-0.9406,-9.8955,565
-0.9588,-9.8793,566
-0.0735,-9.8909,568
-1.0982,-9.8824,569
-2.1975,-9.8592,570
2.2953,-9.8831,571
0.0958,-9.9109,572
-0.6056,-9.9054,573
-0.5623,-9.8866,574
-3.4404,-9.8851,575
0.1312,-9.8699,576
-0.4257,-9.8887,578
0.0314,-9.8953,579
-0.9144,-9.9036,580
-0.1523,-9.9036,581
-0.5518,-9.9054,582
-0.8294,-9.9072,583
-1.0632,-9.9026,584
-1.6623,-9.8877,585
-2.242,-9.8724,587
0.4605,-9.8842,588
-1.0943,-9.8977,589
-8.1289,-9.7953,590
1.9135,-9.7436,591
-16.6028,-9.7664,592
2.1578,-9.5831,593
5.0534,-9.7456,594
-8.7436,-9.6604,595
1.7682,-9.6946,596
1.7371,-9.7358,598
-1.7063,-9.7975,599
1.6584,-9.8502,600
-10.566,-9.8175,601
1.8213,-9.7337,602
-0.5132,-9.7616,603
-3.5144,-9.7688,604
-2.7882,-9.7383,605
-2.2249,-9.7251,606
-3.687,-9.7038,608
3.5756,-9.7871,609
-6.6974,-9.8329,610
-3.7307,-9.7352,611
1.9749,-9.7522,612
-2.2828,-9.7679,613
-1.613,-9.7558,614
-0.8744,-9.7544,615
-1.5943,-9.7605,616
-1.3584,-9.7524,618
-3.0195,-9.7461,619
-2.3997,-9.6722,620
-0.4936,-9.6796,621
-8.6346,-9.6709,622
-1.8746,-9.7123,623
3.3316,-9.744,624
-5.6982,-9.6373,625
-2.7525,-9.6674,626
5.2033,-9.7031,627
-3.8832,-9.701,629
-1.4585,-9.7683,630
-2.5925,-9.7452,631
-2.5933,-9.7495,632
-3.7314,-9.7725,633
-2.6113,-9.7263,634
-1.8621,-9.7253,635
-2.0141,-9.7132,636
-1.9629,-9.705,638
-1.2013,-9.7008,639
-0.8484,-9.7134,640
-3.248,-9.6961,641
-1.3907,-9.6875,642
-1.9662,-9.6819,643
-1.175,-9.6845,644
8.2268,-9.7115,645
-0.5239,-9.9095,646
1.2329,-9.8977,647
0.0267,-9.8996,649
0.259,-9.9136,650
-0.1109,-9.9216,651
-3.0465,-9.9407,652
-1.5155,-9.8958,653
0.6433,-9.9028,654
0.431,-9.9248,655
-0.0715,-9.9229,656
0.1217,-9.9247,657
-0.8057,-9.9134,659
-0.8058,-9.9027,660
-0.2149,-9.9035,661
0.1351,-9.8904,662
-1.0829,-9.9047,663
0.041,-9.8886,664
1.1473,-9.904,665
-0.5384,-9.9103,666
-0.5798,-9.9112,668
-0.2624,-9.9104,669
-0.043,-9.9175,670
-0.2541,-9.916,671
-0.279,-9.9158,672
-0.5014,-9.9082,673
-0.1542,-9.8098,674
-0.2808,-9.887,675
-0.7602,-9.9061,676
-0.3928,-9.8979,678
-0.4609,-9.911,679
0.2109,-9.913,681
-0.0927,-9.9256,682
0.046,-9.9231,683
-0.3536,-9.93,684
-1.1349,-9.9079,685
0.3074,-9.9186,686
-0.0613,-9.9215,689
-0.1218,-9.9226,690
-0.2021,-9.9188,691
-0.1326,-9.9201,692
-0.1615,-9.9132,693
0.17,-9.9126,694
0.1343,-9.9175,695
-0.5368,-9.9154,696
-0.6187,-9.9216,698
-0.5481,-9.9087,699
-1.9643,-9.9043,700
-0.7788,-9.8796,701
-2.142,-9.8907,702
0.951,-9.8865,703
0.6389,-9.9078,704
-0.0087,-9.9169,705
-0.1336,-9.9189,706
-0.1457,-9.9224,707
-0.1478,-9.9176,709
-0.098,-9.9233,710
0.004,-9.9206,711
0.7949,-9.9332,713
-1.1624,-10.164,714
1.7577,-9.9787,715
-0.6792,-9.4039,716
0.8019,-9.5553,719
6.9015,-9.7984,720
2.9054,-9.974,721
6.736,-10.2708,722
3.3594,-9.9338,723
-73.9694,-8.3374,724
-81.1181,1.0687,725
-13.3464,-0.0836,727
-7.1801,-0.1457,728
-7.2089,-0.1451,729
-7.1732,-0.1438,730
-7.1503,-0.1448,731
-7.1737,-0.1446,733
-7.1667,-0.1452,734
-7.1704,-0.1449,735
-7.149,-0.1454,736
-7.1026,-0.1429,737
306.6158,-3.6305,738
122.5073,-6.9324,739
84.2836,-8.4729,740
33.7596,-9.6265,741
-7.7177,-9.8507,743
-3.8292,-9.9833,744
-4.8791,-9.8057,745
12.7094,-9.8286,746
-0.8131,-9.9086,747
6.5531,-9.8609,748
-0.1275,-9.9272,749
3.0201,-9.9206,750
-1.7793,-9.9032,751
1.2498,-9.9095,752
0.0028,-9.9226,754
-0.5277,-9.9169,755
0.7742,-9.9147,756
3.1338,-9.9163,757
-0.3106,-10.4149,758
-2.1244,-9.7051,759
-0.7847,-9.8998,760
-0.2157,-9.9203,761
-0.0608,-9.9148,763
0.2062,-9.9204,764
0.2132,-9.9187,765
-0.8221,-9.9244,766
-0.2536,-9.9121,768
-2.1525,-9.903,769
2.7056,-9.8777,770
0.9361,-9.8918,771
-7.9469,-9.8682,773
1.5683,-9.8429,774
-0.9544,-9.8556,775
-0.5309,-9.8988,776
0.1272,-9.8654,777
-1.0885,-9.8991,778
-2.4075,-9.8665,779
-0.3979,-9.8899,780
0.1096,-9.8905,781
-1.1065,-9.8878,782
-0.258,-9.9029,784
-0.5744,-9.8958,785
-0.139,-9.8987,786
-1.2621,-9.8847,787
-0.0594,-9.8807,788
-0.9377,-9.9031,789
-1.0077,-9.8964,790
0.569,-9.8839,791
0.9786,-9.8937,792
-2.1437,-9.9124,794
0.6016,-9.8261,795
1.4883,-9.8033,796
-0.5753,-9.91,797
-0.043,-9.9044,798
0.3264,-9.8989,799
-0.37,-9.9327,800
-0.6111,-9.9069,801
-0.4985,-9.9117,803
-0.5174,-9.9121,804
0.2997,-9.9065,806
-0.3328,-9.9114,807
0.2891,-9.922,808
-0.1267,-9.8845,809
5.5773,-9.8187,810
0.7597,-10.0409,811
0.1422,-10.347,812
4.3565,-9.9818,814
2.3243,-9.5505,815
-0.1523,-10.188,816
17.0836,-10.0034,817
7.98,-9.9734,818
-1.0034,-9.7705,819
-3.9766,-10.1239,820
0.6196,-9.4215,821
1.9148,-9.726,823
6.0505,-9.9218,824
6.2614,-9.8841,825
9.6533,-9.8766,826
6.1993,-10.0407,828
6.5212,-9.9188,829
1.5974,-9.9792,830
-1.2062,-9.9731,831
-0.1862,-9.8294,833
5.0237,-9.9816,834
4.5577,-9.8974,835
-0.4693,-9.9334,837
0.793,-9.9464,838
0.0273,-9.9017,839
1.3812,-9.9754,840
14.1513,-9.9755,841
2.7548,-10.3071,842
1.0741,-9.935,844
3.3105,-9.9029,845
0.0727,-9.9681,846
12.3713,-9.9641,847
2.0198,-9.9008,848
3.0222,-9.8279,849
1.3486,-10.0084,850
2.4894,-9.9571,851
0.6754,-9.7354,853
18.6878,-9.979,854
20.4545,-9.9932,855
2.3021,-9.841,856
3.2288,-10.2098,857
-0.1584,-10.2356,858
4.9687,-9.4889,859
3.4914,-10.0539,860
39.0714,-10.2664,861
0.1841,-10.3669,863
2.7637,-9.7534,864
-0.0148,-10.6777,865
9.4278,-9.698,866
-0.4309,-10.3807,867
6.1137,-9.8469,869
22.023,-10.1029,870
6.5402,-9.7974,871
42.3055,-9.7225,872
2.2709,-9.7455,873
3.6439,-10.0679,874
3.0115,-9.9125,875
-2.9321,-9.9196,876
1.0366,-10.2495,877
1.1927,-9.8075,878
-1.4698,-10.2293,879
7.5677,-10.235,880
1.8108,-9.7832,881
1.1892,-9.8797,883
3.9395,-9.9524,884
2.9946,-9.4242,885
4.5567,-10.2417,886
1.9493,-9.8512,888
2.1763,-9.8751,889
20.858,-9.8986,890
0.5165,-10.0383,891
0.1766,-9.9745,893
-8.1199,-9.7859,894
-4.4657,-9.7092,895
-2.1597,-9.6709,896
-2.0433,-9.6661,897
-1.3809,-9.6595,898
-4.3224,-9.62,900
4.3547,-9.6253,901
7.8546,-9.5521,903
15.0078,-9.8345,904
5.5031,-9.9355,905
0.0829,-10.0925,906
4.4455,-9.7916,907
16.2735,-10.0089,908
8.7484,-9.7984,909
0.4492,-10.0522,910
10.6811,-10.0213,911
11.8927,-9.7679,913
2.4683,-10.0128,914
11.2313,-10.0562,915
3.3013,-9.5847,916
-2.1947,-9.9529,917
0.8837,-9.8685,918
0.1908,-10.1104,919
1.2629,-9.9194,920
-0.6518,-9.7755,921
0.4369,-9.3429,923
0.1202,-9.9384,924
-9.5257,-9.7917,925
-61.7435,-8.9381,926
8.857,-8.6089,928
-4.5496,-9.0248,929
-13.8276,-9.1882,930
18.4065,-9.6581,931
8.9882,-9.75,932
-0.6049,-9.8716,933
-1.2593,-9.8514,934
0.1832,-9.8689,935
0.4323,-9.8881,936
-3.2734,-9.8731,937
1.4174,-9.8891,938
-0.2851,-9.9004,939
-0.8192,-9.8886,940
-0.8646,-9.8945,941
-1.7322,-9.8754,942
1.6645,-9.866,943
-2.1777,-9.8652,944
0.4424,-9.8976,946
-0.7199,-9.8869,947
-0.3624,-9.901,949
-0.4423,-9.9093,950
-0.2905,-9.9088,951
-0.1543,-9.9091,953
-0.3478,-9.9098,954
-0.4409,-9.9142,955
-0.7127,-9.9096,956
-2.0266,-9.8704,957
-1.0168,-9.8592,958
0.2541,-9.8676,960
7.8083,-9.9064,961
0.3496,-9.8393,962
9.9376,-9.8976,963
-1.7798,-10.0424,965
5.6444,-9.7265,966
1.6229,-9.892,967
0.4675,-9.8836,968
5.7242,-9.995,969
4.7052,-10.1017,970
-5.5771,-9.7897,971
10.2915,-9.9552,972
4.3932,-9.8827,974
0.0,-10.0345,975
6.3798,-9.7163,976
1.4061,-9.9161,977
-0.4866,-9.8824,978
0.1402,-10.3298,979
-0.2268,-9.9737,980
0.5694,-9.9814,981
-1.6639,-9.9577,983
0.0335,-10.2166,984
-0.4986,-10.2555,985
0.7525,-10.5616,986
-2.9766,-9.8055,987
1.938,-10.0735,988
-0.6386,-10.1194,989
3.3534,-9.8919,991
2.0071,-10.177,992
1.1424,-9.6428,993
4.6035,-9.9849,994
2.2426,-9.86,995
0.5402,-10.0553,996
3.0739,-9.7443,997
-2.5305,-9.7243,998
0.3494,-10.0072,999
2.1039,-9.721,1000
0.7182,-9.9193,1001
2.7767,-9.9298,1003
3.0623,-9.9194,1004
-0.5485,-9.668,1005
-0.4038,-9.9519,1006
-0.3846,-9.1656,1007
1.0698,-10.0366,1008
2.8491,-10.1359,1009
-0.2848,-9.6598,1010
1.7124,-9.7257,1011
1.6403,-9.9568,1013
3.7084,-10.0292,1014
-0.2974,-9.8817,1015
3.3419,-9.7748,1016
0.0616,-10.0049,1017
4.3546,-9.4014,1018
2.0304,-10.327,1019
3.6229,-9.7445,1020
-0.3359,-9.8804,1021
-1.1398,-10.2155,1023
2.0885,-9.9893,1024
3.035,-9.9759,1025
1.8312,-9.8059,1026
2.9694,-9.577,1027
0.8664,-9.3542,1028
4.161,-9.7461,1029
0.0007,-9.6913,1030
1.1415,-9.5798,1031
1.8642,-9.3772,1032
3.2783,-9.8677,1034
8.2831,-9.7539,1035
2.953,-10.0554,1036
-0.4744,-10.3241,1037
4.7128,-10.181,1038
0.4913,-9.7653,1039
18.4438,-10.0229,1040
3.9516,-9.8324,1041
-0.2467,-10.1877,1043
0.7655,-9.9401,1044
0.5297,-9.9758,1045
0.3067,-10.1603,1046
6.6209,-9.6412,1047
2.271,-9.2347,1048
0.9231,-9.9054,1050
8.2033,-9.637,1051
3.8127,-9.8353,1053
1.0963,-9.9166,1054
1.3322,-9.9145,1055
2.8054,-9.6101,1056
0.7295,-9.7102,1057
1.5314,-10.1777,1058
-0.0778,-10.0754,1059
-0.0061,-9.7137,1060
2.0813,-9.9748,1061
4.8576,-8.4902,1062
3.9777,-9.8357,1064
0.8761,-9.4058,1065
2.0835,-10.0266,1066
0.8307,-10.4289,1067
6.7414,-9.4885,1068
1.3441,-9.538,1069
2.0116,-10.1758,1070
7.1888,-9.8204,1071
0.042,-9.7229,1073
2.0775,-9.6358,1074
1.94,-10.2348,1075
2.8481,-10.0322,1076
2.2102,-9.7327,1077
-0.3433,-9.7914,1078
0.3654,-10.0898,1079
0.9229,-9.8089,1080
1.7957,-10.0469,1081
1.1349,-10.0708,1083
-0.2237,-9.8508,1084
-0.592,-9.7803,1086
19.0926,-9.8316,1087
0.7643,-10.4248,1088
3.9018,-9.8797,1089
0.6583,-10.0527,1090
0.0371,-9.8154,1091
1.2076,-9.8772,1092
1.2427,-9.7615,1094
0.3955,-10.1763,1095
-0.6519,-9.5537,1096
1.4866,-9.5286,1097
0.6879,-9.9552,1098
6.7725,-9.9754,1099
-0.4564,-10.2322,1100
0.9428,-9.9353,1101
-0.0948,-10.0323,1103
1.0806,-9.8023,1104
-1.6999,-10.1321,1105
3.1126,-9.8759,1106
0.6483,-9.8174,1107
4.2275,-9.6904,1108
1.2508,-10.0214,1109
1.936,-9.8484,1110
2.4953,-9.63,1111
1.096,-9.8922,1113
3.0909,-9.9362,1114
1.0955,-9.8232,1115
3.1602,-9.9251,1117
4.6542,-9.9228,1118
5.8818,-9.8858,1119
3.279,-10.1405,1120
-0.2686,-9.9601,1121
1.13,-10.0433,1122
1.2782,-9.8843,1124
3.8138,-9.9061,1125
-0.6813,-10.524,1126
23.794,-9.8782,1127
0.007,-10.0888,1128
0.409,-9.8761,1129
0.2599,-9.7612,1130
1.1857,-10.0551,1131
2.4544,-9.9042,1133
2.5227,-9.9667,1134
3.2353,-9.9484,1135
1.1242,-9.8227,1136
1.4034,-9.8999,1137
1.9572,-9.7652,1138
0.1259,-10.0072,1139
3.8983,-9.5099,1140
1.1813,-10.155,1141
0.4259,-9.3171,1143
3.4632,-9.8935,1144
-0.0129,-9.6717,1145
3.131,-9.841,1146
0.4112,-9.8114,1147
-0.2405,-10.0173,1149
0.0274,-9.9878,1150
4.0569,-9.9058,1151
2.1529,-10.067,1152
1.7212,-9.8796,1153
-0.0626,-10.0762,1154
6.0285,-9.9852,1155
-4.4636,-9.6386,1156
0.463,-10.5868,1157
-0.2627,-9.1614,1158
1.1149,-9.9959,1159
-1.4571,-10.0105,1160
6.3172,-9.9313,1161
-1.1564,-9.899,1163
4.735,-9.9053,1164
1.7994,-9.8063,1165
16.1143,-8.4651,1166
3.1519,-9.8292,1167
5.196,-9.7611,1168
10.6289,-10.0261,1170
-0.3437,-9.9787,1171
1.7058,-9.8397,1173
2.9706,-9.8946,1174
-0.2751,-9.8115,1175
-0.4223,-9.59,1178
1.28,-9.5792,1180
2.9149,-9.8779,1181
6.1776,-9.8061,1182
1.8379,-10.2294,1183
-17.8445,-9.789,1184
4.7814,-9.4728,1185
-20.8284,-9.4751,1186
16.9002,-9.3295,1187
-3.9676,-9.3948,1188
5.7946,-9.738,1189
3.9343,-9.8723,1190
-0.4294,-9.9166,1191
