AYGX_mean,AZ_mean,timestamp
0.9809,-9.9292,967
0.9684,-9.9483,968
-0.1605,-9.8671,969
0.4224,-9.6799,970
-0.6309,-9.7571,971
6.218,-9.9271,972
0.3479,-9.9194,973
-0.5654,-9.8904,974
5.8376,-9.7965,975
-24.097,-10.2179,976
-99.8393,-9.8103,977
-12.0206,-9.7871,978
3.8188,-9.8728,979
0.4162,-9.8462,980
3.028,-9.8742,982
1.9091,-9.9501,983
-1.1771,-9.5197,984
-0.2586,-10.1901,985
4.2409,-10.0309,987
