AYGX_mean,AZ_mean,timestamp
1.1841,-9.6163,572
1.5575,-9.7604,573
2.0188,-9.8152,574
-0.3823,-10.2816,575
17.7536,-10.0212,576
18.1952,-10.0509,577
0.8389,-9.6723,578
24.7288,-9.5502,579
13.1671,-9.9128,580
0.6704,-9.7176,582
0.9651,-10.0399,583
7.6521,-9.7712,584
1.7741,-9.669,585
0.1084,-8.7482,586
0.1538,-9.2675,587
0.2205,-9.6133,588
6.2222,-9.7231,589
-4.184,-9.8778,590
-28.2807,-9.7315,591
