AYGX_mean,AZ_mean,timestamp
0.039,-9.8426,0
0.0397,-9.8425,1
0.2248,-9.8384,3
-2.3478,-9.7782,4
-0.7393,-9.7801,5
-1.1157,-9.771,7
-0.1982,-9.775,8
-0.6068,-9.7754,9
-0.2754,-9.7745,10
-0.5523,-9.7751,11
0.0703,-9.7768,12
-0.4582,-9.7819,13
-0.4986,-9.7821,14
-0.1439,-9.7758,15
-0.4945,-9.7806,16
0.4928,-9.7819,17
-0.4176,-9.7908,18
-1.2414,-9.7915,19
-0.028,-9.7909,20
-0.6824,-9.7849,21
-0.4639,-9.7852,22
-0.4864,-9.7778,23
-0.2659,-9.7832,24
-0.3021,-9.7798,25
-1.1016,-9.7746,26
0.1091,-9.7764,27
-0.6073,-9.7889,28
-0.6065,-9.7859,29
0.1712,-9.7888,30
-0.0451,-9.794,31
0.0556,-9.8037,33
-0.3196,-9.7964,34
-0.0384,-9.7936,35
-0.478,-9.8001,36
0.9529,-9.8069,37
0.3766,-9.8349,38
-28.6279,-9.4842,39
8.6181,-9.6684,41
23.3007,-9.6036,42
-12.258,-9.7803,43
0.9772,-9.8073,45
1.4285,-9.8185,46
-2.6143,-9.933,47
-1.5658,-9.8273,48
0.5186,-9.8279,49
0.2286,-9.831,50
0.1107,-9.8293,51
0.2828,-9.8331,52
-0.3307,-9.8156,53
-0.0389,-9.8325,55
0.3154,-9.8362,56
0.2534,-9.8335,57
0.1467,-9.8343,58
0.1734,-9.8323,59
-0.0075,-9.8327,60
-0.7208,-9.8275,61
9.3553,-9.6851,62
0.5624,-9.7085,63
-0.1371,-9.8395,65
-0.4453,-9.5198,67
0.6052,-9.3504,68
0.1725,-9.829,69
2.4926,-10.3112,70
0.2221,-9.9109,71
3.2438,-9.084,72
20.3483,-9.01,73
1.1692,-9.8506,74
5.4452,-10.0783,75
3.7913,-9.9582,76
-2.3237,-9.8261,77
4.7992,-9.9575,78
1.5937,-9.823,79
0.9878,-9.8612,80
-1.1683,-9.959,81
-1.0263,-9.826,82
0.2341,-9.9561,83
-0.3178,-9.8475,84
0.8633,-9.7825,85
1.4022,-9.5244,86
1.4689,-9.7023,87
-1.7943,-9.8734,88
0.7641,-9.3192,89
-1.2137,-9.8422,90
1.0982,-9.6379,91
-1.6779,-9.742,92
0.3559,-9.679,93
0.1002,-9.8796,94
4.1209,-9.991,95
-0.9711,-9.6029,96
-2.4751,-9.6683,97
-1.24,-10.2074,98
7.5946,-9.8189,99
7.9692,-9.9655,100
10.0556,-10.0891,101
1.2997,-9.8901,103
1.1518,-9.952,104
-0.0582,-9.7959,105
0.5325,-9.9151,106
-0.667,-9.7805,107
2.5683,-9.8837,108
21.8532,-9.6301,109
1.4988,-9.631,110
1.1054,-9.4138,111
3.4566,-10.2806,113
0.1243,-9.6422,114
-0.4309,-9.8427,118
22.1879,-9.7891,119
0.5857,-9.7191,120
3.4849,-9.9915,121
0.2624,-10.0003,123
2.6632,-9.7554,124
0.2094,-9.9219,125
5.0903,-9.7565,126
1.1063,-9.9116,128
0.1817,-9.8916,129
3.1762,-9.4041,130
2.2721,-9.8595,131
-0.0142,-9.7737,132
-0.36,-9.8055,133
0.9275,-10.0659,134
1.3821,-9.6141,135
-0.8259,-10.0581,136
-0.5666,-9.934,137
-0.2232,-9.6553,138
-0.485,-9.8558,139
1.4411,-9.929,140
1.8788,-10.0198,141
0.9518,-10.1675,142
2.3712,-10.0631,143
3.6799,-9.9946,144
4.9413,-9.714,145
1.0115,-10.1088,146
0.0686,-9.4034,147
3.4868,-10.6295,148
2.6853,-6.7934,149
-1.2355,-10.4612,150
0.5224,-9.4142,151
1.5105,-9.6327,153
0.5501,-9.8426,154
0.0652,-9.7815,155
1.5225,-10.3627,156
6.3079,-9.8784,157
3.0936,-9.9669,158
-1.3078,-9.9988,159
10.4234,-10.0759,160
3.1999,-9.6501,161
0.8277,-8.5509,163
3.4868,-10.2191,164
1.8862,-9.9187,165
0.2235,-9.1594,166
0.4039,-9.7355,167
-0.6002,-9.0807,168
0.0025,-9.8631,169
2.0595,-9.1599,170
1.2716,-10.0014,171
3.1574,-9.8291,174
0.2028,-9.1597,176
0.5771,-9.8966,178
-0.3575,-9.3913,179
0.861,-9.8476,180
0.51,-9.2905,181
1.3558,-10.4043,183
0.6748,-9.6692,184
0.2279,-10.5547,185
0.7845,-9.8906,186
1.9521,-10.0111,187
2.3307,-9.8806,188
0.7727,-9.1922,189
1.869,-8.9158,190
1.9,-10.1456,191
16.2528,-9.6049,193
2.3483,-9.8061,194
2.3597,-9.525,195
0.1475,-9.8609,196
-0.8473,-10.2793,197
-0.3158,-9.7259,198
-0.0215,-9.7269,199
-0.3839,-9.9466,200
0.5247,-9.3611,201
-0.3565,-10.099,203
0.3912,-9.846,204
-0.4123,-9.9624,206
-0.4647,-10.0444,208
6.3166,-10.2159,209
-0.2528,-9.5121,210
0.1368,-9.7288,211
-0.9495,-9.5208,213
1.0911,-9.6896,214
-0.1852,-9.9732,215
0.0376,-9.8898,216
3.6106,-9.4843,217
-0.7299,-9.6473,218
-0.0398,-10.2451,219
2.3889,-9.5354,220
0.0649,-9.4633,221
0.0754,-9.4822,222
-0.5836,-9.1565,223
7.0183,-9.9876,224
14.5705,-9.7757,225
2.8702,-9.9429,226
-4.775,-9.8696,227
20.9916,-9.9173,228
10.3458,-10.354,229
0.5376,-9.8118,230
4.9249,-9.6361,231
5.7253,-10.4285,233
4.2162,-9.9854,234
3.3573,-9.9079,235
-0.0308,-9.8154,236
3.5282,-9.4472,237
14.4057,-9.7897,238
1.0815,-10.5887,239
0.6312,-9.9287,240
0.2539,-9.4086,242
0.7881,-9.6193,244
0.0965,-9.6957,246
0.5061,-9.9324,247
2.1098,-9.8426,248
2.5353,-9.7868,249
0.0904,-9.6639,250
0.5662,-10.0853,251
0.1037,-8.8279,253
0.4839,-10.0117,254
0.4746,-9.7693,255
1.8068,-9.6773,256
-2.3185,-9.7609,257
2.2715,-9.8818,258
-1.4759,-9.9221,259
3.0606,-10.0214,260
4.9027,-9.7464,261
68.0814,-10.0654,263
29.344,-9.6068,264
-2.0628,-10.3454,265
2.9204,-9.4332,266
27.6178,-10.2751,267
12.3605,-8.4864,268
64.9069,-9.8034,269
1.9253,-9.6673,270
-0.1515,-10.6975,271
0.6117,-10.4611,273
1.3431,-10.0477,274
8.7407,-9.8786,275
13.282,-9.9531,276
3.1253,-9.849,277
0.6248,-9.8234,278
5.3162,-10.3405,279
-2.802,-9.8143,280
-5.6227,-9.8944,282
1.9251,-9.8361,283
10.0521,-9.7755,285
8.8533,-10.2087,286
-0.1664,-9.9534,288
14.9515,-9.9534,289
23.9966,-9.3993,290
91.4415,-9.7641,291
-2.3276,-9.778,292
1.6899,-9.9147,293
0.6358,-9.8227,294
4.0774,-9.9199,295
17.8151,-9.9593,296
0.3985,-9.6799,298
7.2708,-9.904,299
26.6512,-10.0011,300
4.0119,-9.9447,302
0.0865,-9.6479,303
-0.5252,-9.7958,304
-0.869,-9.7555,305
-0.0071,-9.8561,306
1.1361,-9.9122,307
-0.2147,-9.8159,308
-0.3997,-10.0333,309
0.0774,-9.9079,310
-0.2448,-9.9136,311
-0.1813,-10.0468,312
-1.0908,-10.3486,313
2.3432,-9.9083,314
6.4251,-9.6087,315
20.0771,-9.5449,316
8.2375,-9.6629,318
2.6635,-9.5576,319
0.2724,-9.5999,320
-0.5187,-10.0099,321
1.4883,-9.8708,325
0.9627,-9.8215,326
-0.9908,-9.7824,328
2.2807,-9.8281,329
-2.4172,-9.7392,330
1.841,-9.8297,331
-0.3599,-9.3659,332
1.5912,-8.8687,333
-0.5136,-9.7867,334
13.7069,-9.7408,335
0.3882,-9.9109,336
0.5928,-9.915,338
0.7899,-9.8736,339
0.548,-9.8222,340
7.6144,-9.848,341
0.3868,-9.7841,342
3.2064,-9.7256,343
-0.0267,-9.8037,345
0.8698,-9.9412,346
6.1035,-9.9081,348
5.6919,-9.0694,349
1.5621,-9.9431,350
0.3724,-9.9535,351
0.301,-9.5569,352
-0.09,-10.0465,353
1.8626,-9.7656,354
0.2295,-9.6908,355
1.999,-9.5594,356
1.0773,-9.91,358
3.3684,-9.5902,359
3.6477,-9.6977,360
-1.6211,-9.2018,361
-2.9433,-9.6319,362
-0.3753,-8.5958,363
2.8945,-10.3411,364
2.541,-9.7768,365
7.9727,-9.9124,366
3.5057,-9.8171,368
3.1007,-9.6038,369
3.5785,-9.64,370
3.5491,-10.007,371
-0.6024,-10.0438,372
2.2066,-10.2947,373
2.7179,-9.8732,374
6.6602,-9.7962,375
1.4329,-9.9897,376
16.6234,-9.8539,378
-0.0558,-9.8317,379
0.003,-9.9582,380
0.249,-9.7737,381
0.1098,-9.7892,382
5.1565,-10.0289,383
1.1237,-9.914,384
1.2901,-9.8247,385
1.9353,-9.7382,386
3.3056,-8.8484,388
3.0881,-9.0084,389
-0.0341,-9.7439,391
0.9996,-10.3456,392
18.8522,-8.5717,393
12.6392,-7.1215,394
2.6666,-10.06,395
0.47,-9.9482,396
4.6821,-9.7627,398
1.3475,-9.9649,399
8.083,-9.8308,400
-1.6003,-9.8872,401
2.3423,-9.68,402
-1.0761,-9.8207,403
2.2836,-10.0474,404
-0.0537,-9.8231,405
0.0989,-9.8237,407
0.5699,-9.8246,408
0.2291,-9.8258,409
0.0124,-9.8276,410
0.1009,-9.8249,411
0.1565,-9.8245,412
0.2086,-9.8262,414
0.1806,-9.8248,415
0.2702,-9.8254,416
-0.0929,-9.7972,417
1.1047,-9.786,418
11.671,-9.8846,419
-0.008,-10.3814,420
11.0705,-9.851,421
-1.0329,-9.1356,423
1.8051,-9.7363,424
1.8819,-9.8867,425
-0.7954,-10.1194,426
0.463,-9.8156,427
2.6928,-9.9196,428
0.0883,-9.6677,429
2.7153,-9.2385,430
-0.2499,-9.8201,431
0.2324,-9.877,433
-0.8536,-9.5166,434
-1.4175,-9.1812,435
-0.3476,-10.0778,436
-0.6039,-9.7653,437
0.6435,-9.3491,438
2.7349,-10.0234,439
0.8607,-9.816,440
-0.3218,-9.2766,441
-1.0338,-10.061,443
2.8406,-9.9116,444
2.4598,-9.9552,445
4.4557,-9.5663,446
7.6888,-9.9419,447
0.0515,-9.6182,448
0.2611,-9.9405,449
-0.0614,-9.8297,450
0.1688,-9.7572,451
0.923,-9.9029,453
0.0888,-9.9119,454
0.1401,-9.9106,455
0.4109,-9.8885,456
0.4676,-9.8073,457
1.7769,-9.8225,458
-3.5748,-9.763,459
-1.2381,-9.8834,460
0.4982,-9.9496,462
0.391,-9.8141,463
0.4248,-9.8314,465
2.4953,-9.8784,466
4.4558,-9.8621,468
0.6628,-9.8412,469
0.6286,-9.9476,470
1.1639,-9.8452,471
0.1416,-9.9331,472
13.5042,-8.8211,473
0.5353,-10.4228,474
-0.2561,-9.6925,475
2.8594,-10.0143,476
0.5355,-9.4811,478
1.1271,-10.1681,479
0.7291,-9.8123,480
-2.8666,-6.5173,481
-0.1162,-9.7583,482
0.63,-9.6198,483
-0.41,-9.7699,484
2.9615,-9.8373,485
1.2188,-9.4432,486
1.8667,-9.4102,488
12.4761,-9.9728,489
0.7464,-9.73,490
0.7241,-9.9447,491
1.658,-9.9534,492
0.4993,-9.9338,493
0.0665,-9.8234,494
1.5858,-10.1062,495
6.4634,-9.9221,496
4.0442,-9.987,497
0.5385,-9.8683,499
-0.157,-9.9619,500
-1.4691,-9.9081,501
0.1783,-9.7168,502
-0.1866,-9.8534,503
9.4529,-9.8974,504
-0.8142,-9.8692,505
3.0069,-9.7841,506
-0.346,-9.426,507
5.5455,-9.7882,509
-0.1593,-8.8853,510
0.5251,-9.703,511
1.7076,-10.003,512
1.1657,-10.0286,513
3.389,-9.8825,514
1.9721,-9.8241,515
-0.8409,-9.5427,516
2.5755,-10.0679,518
3.9101,-9.7908,519
0.5768,-10.0786,520
-0.9159,-9.9613,521
9.1109,-9.8438,522
13.1288,-10.1188,523
4.5503,-9.8407,524
1.3695,-9.7873,525
2.4776,-9.4436,526
0.3293,-9.8035,528
1.4963,-9.986,529
-0.1218,-10.0031,530
-1.3054,-9.3779,531
-0.5874,-9.1443,532
-0.539,-9.5522,533
-0.0267,-10.2598,534
1.6786,-10.0116,535
0.9141,-10.1606,536
-0.3549,-9.8915,538
0.3624,-9.937,539
-0.029,-10.0373,540
0.0504,-9.9331,541
-0.0695,-10.0373,542
-4.507,-8.0417,543
-0.1023,-9.6171,544
0.7165,-9.7031,545
-0.1879,-10.1976,546
0.1251,-9.8273,548
2.4289,-9.8997,549
0.3697,-9.8697,550
-0.2819,-9.8774,551
1.854,-10.1554,552
9.4013,-8.4818,553
0.7092,-10.0492,554
-0.8481,-9.8476,555
-2.1989,-9.969,556
-0.6773,-9.8161,558
-6.3153,-9.7299,559
5.1741,-9.601,560
-19.4267,-9.6323,561
9.1611,-9.7111,562
-1.5328,-9.7388,563
-1.5038,-9.7982,564
-0.4061,-9.8633,565
6.8742,-9.592,566
11.2933,-9.559,568
0.615,-9.7958,569
-1.3571,-9.6605,571
1.9508,-9.7121,572
1.3809,-10.3538,573
8.386,-10.0236,574
3.2152,-9.9146,575
-1.1555,-9.8658,576
6.5479,-9.9213,577
-1.9206,-9.872,578
5.8091,-9.749,580
-0.4833,-9.766,581
-0.4489,-9.842,582
-3.7841,-9.7321,583
-5.2759,-9.8,584
-247.1153,-7.2602,585
40.7862,-8.2983,586
19.9938,-9.2862,587
3.5402,-9.4843,588
-12.2837,-9.6544,589
17.8508,-9.5433,590
-5.5228,-9.726,591
17.443,-9.707,592
-14.9927,-9.4378,593
8.4128,-9.5241,594
2.7616,-9.8117,595
-3.9799,-9.6775,596
1.5389,-9.7329,598
2.3412,-9.6375,599
14.4906,-9.7269,600
-10.0331,-9.7932,601
-1.6391,-9.8158,602
-3.4834,-9.8202,603
0.9661,-9.8421,604
-0.1711,-9.7547,605
-0.8537,-9.7279,606
-1.3922,-9.7172,608
-0.6124,-9.7213,609
-0.5365,-9.7234,610
-0.5523,-9.7229,611
-0.5289,-9.7208,612
-0.5529,-9.7239,613
-0.5597,-9.7182,878
-0.246,-9.7147,879
6.2162,-9.7746,880
1.3928,-9.8696,882
0.028,-9.9578,883
-1.6923,-9.8352,884
1.5921,-9.829,886
0.3423,-9.8526,887
-5.7124,-9.8816,888
41.7631,-9.5709,890
-3.3985,-9.6619,891
6.0192,-9.8644,906
1.3954,-9.5483,907
0.1315,-9.8962,908
3.8563,-9.7905,909
0.7064,-9.82,910
0.8229,-10.0889,911
15.2274,-9.937,912
17.3332,-9.4831,913
3.6746,-10.5911,914
4.7255,-9.8179,915
12.9486,-9.429,917
10.7024,-10.2012,918
6.8818,-9.9943,919
1.164,-10.1789,920
-2.1422,-9.3313,921
-2.6855,-9.7314,922
-1.0949,-9.8067,923
-0.2666,-9.9014,925
2.9664,-9.9564,926
0.862,-9.9147,927
-0.8462,-9.6466,928
0.1167,-9.7196,929
0.4009,-9.9711,930
0.6409,-9.3146,931
-0.8552,-9.6593,932
-0.8738,-10.0775,933
5.4848,-9.9352,935
40.317,-9.3397,936
26.3505,-9.764,937
4.0331,-10.0024,938
2.2168,-9.7545,939
5.2096,-9.6046,940
4.4137,-10.0124,941
0.7257,-9.9528,942
0.5365,-9.7386,943
0.7711,-9.8586,944
-1.91,-9.8937,945
1.522,-9.9952,946
0.053,-9.7183,947
2.8947,-9.872,949
0.4042,-9.8094,950
5.5335,-9.4133,951
-1.2695,-9.8632,952
3.5302,-9.9042,954
25.1279,-9.8998,955
27.4608,-9.6505,956
3.4184,-9.9427,958
0.6132,-9.8589,959
-1.4258,-9.6537,960
-0.6924,-9.8592,961
-0.1028,-9.9416,963
-0.1221,-9.7914,964
0.6448,-10.1451,965
-1.2989,-9.892,966
3.2373,-9.7936,968
3.1108,-9.7915,969
-0.3214,-9.9111,970
-0.0419,-9.8321,971
-0.003,-9.9437,973
0.1955,-9.8662,974
0.2423,-10.2734,975
4.3733,-9.9437,976
4.1106,-9.9991,978
2.6527,-9.6613,979
0.905,-9.75,980
-0.1344,-9.8293,981
0.8307,-9.4661,983
0.3862,-9.8483,984
-0.6654,-9.8654,985
-0.4812,-9.8214,986
0.8198,-9.9402,988
-0.0381,-9.8162,989
-1.2426,-9.855,990
-0.4253,-9.8583,991
-0.0643,-9.9796,993
0.1186,-9.856,994
1.7418,-9.6573,995
1.3878,-9.8289,996
-0.4525,-9.7925,998
-0.4473,-9.8287,999
-1.0683,-9.7444,1000
0.5878,-10.0179,1001
-2.1054,-9.8628,1003
0.3023,-9.4964,1004
-1.4978,-9.6769,1005
0.0352,-9.8635,1007
0.1024,-9.7835,1008
0.0247,-9.8042,1009
-0.262,-9.9325,1010
-0.0699,-9.806,1011
-0.6199,-9.9399,1012
0.1617,-9.7402,1013
0.0798,-9.8855,1014
0.1364,-9.8912,1015
0.63,-9.8872,1016
-0.6547,-9.5736,1017
-0.0516,-9.734,1018
-1.0248,-9.4772,1019
2.4036,-9.3051,1020
1.2164,-9.421,1021
2.614,-8.7602,1022
1.7933,-9.3931,1024
5.4542,-9.885,1025
0.3349,-9.9812,1026
0.8688,-10.0924,1027
42.7775,-9.3932,1029
3.3648,-9.5506,1030
4.007,-9.7091,1031
-0.5139,-9.5298,1032
4.3664,-9.9094,1034
0.0685,-9.9682,1035
3.8222,-9.8085,1036
-0.4908,-9.7509,1037
2.1898,-9.7872,1039
2.492,-9.8062,1040
0.9947,-10.3246,1041
8.1938,-10.159,1042
4.8702,-9.906,1043
1.632,-9.6197,1044
0.3082,-9.8997,1045
0.462,-9.8212,1046
-0.1902,-9.9328,1047
0.1096,-9.8522,1049
-0.0213,-9.8418,1050
14.8135,-9.7593,1051
14.5985,-9.8738,1053
5.4702,-9.7416,1054
2.5561,-9.7972,1055
-0.1618,-9.8088,1056
0.2634,-9.9439,1058
2.5628,-9.7684,1059
0.3438,-9.7216,1060
-0.8207,-9.7718,1061
0.1228,-9.9786,1063
0.4789,-9.8951,1064
4.5633,-9.8904,1065
7.2717,-9.9489,1066
0.7706,-9.8596,1068
0.8563,-9.8285,1069
-50.4272,-9.8939,1070
47.4218,-8.208,1071
11.815,-9.5798,1073
1.8209,-9.7541,1074
0.1224,-9.852,1075
-0.4339,-9.8165,1076
6.5951,-9.8493,1078
8.0792,-9.8836,1079
1.0272,-9.9671,1080
0.6709,-9.908,1081
-0.077,-9.6918,1083
1.1073,-9.8336,1084
16.6168,-9.3021,1085
0.9233,-10.2067,1086
3.1292,-9.7252,1088
2.5511,-9.8646,1089
9.648,-10.1248,1090
9.1802,-9.7323,1091
0.108,-9.9607,1093
0.947,-9.8826,1094
-2.5109,-9.7941,1096
1.093,-9.8037,1097
-17.4866,-9.7372,1098
-1.309,-9.7672,1099
-0.5113,-9.7719,1100
-0.4532,-9.7705,1101
-0.4086,-9.7729,1102
-0.4122,-9.7723,1103
-0.4217,-9.772,1104
-0.413,-9.7725,1105
-0.417,-9.7722,1106
-0.4227,-9.7713,1107
-0.4168,-9.7713,1108
-0.4128,-9.7712,1109
-0.4584,-9.7711,1110
-0.4197,-9.7728,1111
-0.4182,-9.7722,1114
-0.4182,-9.7728,1115
-0.4126,-9.7707,1116
-0.4017,-9.7721,1117
-0.4064,-9.7728,1119
-0.4038,-9.7707,1120
-0.417,-9.7719,1121
-0.411,-9.7713,1122
-0.41,-9.7719,1124
-0.4073,-9.7724,1125
-0.6424,-9.8186,1375
-0.8595,-9.8287,1376
-8.7387,-9.6831,1378
2.2985,-9.6962,1379
-0.5231,-9.672,1380
1.9982,-9.7846,1381
0.4543,-9.8329,1382
1.7605,-9.7386,1383
0.1081,-9.838,1384
1.5114,-10.0161,1385
0.0409,-9.6882,1386
3.111,-10.0932,1387
1.1624,-9.4112,1388
0.1574,-9.7901,1389
-0.6408,-9.8717,1390
6.5945,-9.9449,1391
9.369,-9.9783,1392
-1.1792,-9.8846,1393
-0.9684,-9.6366,1394
19.1501,-9.9781,1395
3.2583,-9.9727,1396
62.2882,-9.8084,1397
3.2408,-9.9973,1398
0.9709,-9.6409,1399
-0.6034,-9.8346,1400
3.5737,-9.6687,1401
0.7199,-9.7879,1403
-0.5444,-10.015,1404
0.935,-9.9901,1405
0.1326,-9.9878,1406
0.787,-9.9119,1408
-3.3094,-9.8439,1409
-3.9709,-9.6632,1410
-3.7155,-9.4367,1411
19.8824,-9.5216,1413
-1.4671,-9.7966,1414
-2.2163,-9.8586,1415
-5.1084,-9.7984,1416
2.4656,-9.7217,1417
3.9979,-9.5893,1418
4.0369,-9.8351,1419
2.0706,-9.822,1420
-1.5923,-9.6752,1421
-0.3625,-9.8779,1422
4.9569,-9.7178,1423
2.7027,-9.9077,1424
0.157,-9.8826,1425
-7.3914,-9.8272,1426
-0.5238,-9.7883,1427
0.3345,-9.7976,1428
0.5993,-9.7997,1429
1.1281,-9.8795,1430
-0.0358,-9.941,1431
1.1754,-9.9835,1432
-1.7842,-9.7306,1433
0.442,-10.2908,1434
7.1111,-9.928,1435
24.0965,-9.7447,1436
1.1789,-9.8228,1438
0.8293,-9.6139,1439
0.3657,-9.9025,1440
-0.2741,-9.6467,1441
4.0325,-8.3389,1442
0.6701,-9.7324,1444
1.3175,-9.9297,1445
-0.1992,-10.0464,1446
19.6922,-9.827,1447
-2.336,-9.7684,1448
-1.0686,-10.0886,1449
-0.9788,-9.812,1450
-0.4118,-9.7119,1451
18.3294,-9.9442,1452
5.0319,-9.8968,1454
-2.7486,-9.3723,1455
-3.0264,-9.3809,1456
-0.1811,-9.3571,1457
0.7258,-9.9052,1458
2.3589,-9.8242,1459
1.1995,-9.8281,1460
0.308,-9.821,1461
0.5292,-9.8961,1463
0.0335,-9.925,1464
5.4396,-9.8641,1465
-0.1986,-9.9626,1466
1.2577,-9.9029,1467
8.1401,-9.4138,1468
3.7436,-8.9143,1469
1.6081,-9.7699,1470
1.4315,-10.1405,1471
0.1059,-9.9987,1473
-0.2014,-9.6168,1474
-0.5761,-10.0286,1475
-0.0957,-9.7227,1476
-1.7013,-9.373,1477
-0.4835,-10.4686,1478
-0.0778,-9.5289,1479
-0.3502,-10.0834,1480
0.0516,-8.8528,1481
6.775,-9.7557,1483
-3.4126,-9.7141,1484
34.2732,-10.4089,1485
12.0066,-10.1354,1486
1.3147,-10.0484,1487
8.1362,-9.8217,1488
0.0972,-9.8697,1489
7.5334,-10.1619,1490
9.9212,-8.934,1492
-0.3602,-9.9874,1493
10.3333,-10.1194,1494
-0.7537,-9.8056,1495
0.9971,-10.0943,1496
1.9191,-9.7177,1497
0.1135,-9.9277,1498
-0.0128,-9.7467,1499
-1.0725,-10.0,1500
-0.1749,-9.901,1502
0.1528,-9.9277,1503
1.9115,-9.4792,1504
2.9499,-9.3398,1505
0.5517,-9.7178,1506
-0.4077,-9.8882,1507
-1.4032,-9.8828,1508
-0.4957,-9.7626,1509
0.3595,-9.8069,1510
0.4016,-9.7942,1511
0.6518,-9.9257,1513
-0.1257,-9.9177,1514
-0.0236,-9.9005,1515
0.5738,-9.9189,1516
-4.7177,-9.7678,1517
-0.7841,-10.0473,1518
-0.2584,-9.9316,1519
1.3204,-9.8758,1520
-0.4688,-9.8396,1521
0.119,-9.7987,1522
1.727,-9.6615,1524
1.1825,-10.1939,1525
-0.3676,-9.6171,1526
-0.2241,-9.5284,1527
1.1828,-9.9492,1529
0.603,-9.5568,1530
-0.2814,-9.3081,1531
0.8718,-9.5823,1532
0.2783,-9.6944,1533
-1.2043,-9.7581,1534
-4.5195,-9.9649,1535
1.279,-9.8927,1536
-1.2639,-9.5717,1537
-1.7231,-9.8027,1538
-0.447,-9.4777,1539
1.4476,-9.5733,1540
0.068,-9.9537,1541
4.4451,-9.2048,1542
0.5838,-8.8021,1543
-1.0558,-9.6338,1544
0.0855,-10.5504,1545
1.4631,-10.0273,1546
0.6765,-9.9733,1547
0.8318,-9.2062,1548
-0.5662,-9.8698,1549
0.9648,-9.9764,1550
-0.4049,-10.4299,1551
0.1122,-9.9208,1553
0.3157,-9.8778,1554
0.5947,-10.115,1555
-0.2471,-9.5877,1556
-0.0695,-9.5857,1557
0.6697,-9.6023,1558
0.4183,-9.7872,1559
2.1383,-9.9411,1560
2.7616,-10.1727,1562
15.5445,-10.1488,1563
2.2006,-10.7385,1564
0.5149,-9.4487,1565
3.2826,-9.8469,1566
-4.4316,-9.8107,1567
1.9372,-9.7065,1568
18.1975,-9.5596,1569
1.5397,-9.7855,1570
-25.0652,-9.5112,1571
-13.6626,-9.4318,1573
-5.5587,-9.5972,1574
-67.7854,-9.6827,1575
-22.2986,-9.8382,1576
0.0236,-10.0824,1577
-8.655,-10.2218,1578
-32.9808,-9.8164,1579
-51.8559,-9.7597,1580
3.4043,-9.7733,1582
-0.4883,-9.8369,1583
0.903,-9.7674,1584
0.7033,-9.912,1585
0.6172,-9.8627,1586
-1.3218,-9.9865,1587
0.8959,-9.8889,1588
3.0123,-9.7179,1589
-1.6447,-9.8399,1590
8.6178,-9.7755,1591
-0.7072,-9.9003,1593
-1.2832,-9.9069,1594
-0.2009,-9.7346,1595
5.7594,-9.753,1596
0.5378,-10.0488,1597
5.252,-9.6988,1598
-0.2839,-9.9326,1599
1.5628,-9.71,1600
-1.1513,-9.2992,1601
0.6795,-9.7004,1603
-0.4366,-9.9049,1604
-0.4111,-9.5957,1605
1.5459,-9.8846,1606
-2.5248,-10.4632,1607
2.1162,-9.6549,1608
0.8255,-9.9047,1609
2.8444,-9.2591,1610
-1.1619,-9.8798,1613
-0.6396,-9.8139,1614
1.3729,-9.8868,1615
-0.4789,-9.7579,1617
1.1647,-9.7251,1618
-1.3249,-9.7446,1619
-2.049,-9.8075,1620
2.5609,-10.0764,1621
1.3624,-9.8244,1622
13.0299,-9.8717,1623
