AYGX_mean,AZ_mean,timestamp
-0.4123,-9.8384,17
-0.4073,-9.8388,18
-0.4109,-9.8378,19
-0.4542,-9.8395,20
-0.3401,-9.8385,21
-1.0149,-9.8386,22
-0.362,-9.8403,23
-2.2218,-9.8239,24
0.3172,-9.9439,25
-28.6267,-9.8545,26
-291.5785,-6.7005,27
-130.8231,-6.9028,28
46.8469,-9.405,29
7.0568,-9.8908,30
-0.439,-9.9495,31
-1.2797,-9.8422,32
-2.0478,-9.8449,33
1.7672,-9.8227,34
-0.4836,-9.8855,35
-2.2726,-9.841,36
-0.5216,-9.9003,37
