AYGX_mean,AZ_mean,timestamp
5.5894,-9.7995,423
6.7574,-9.9088,424
-0.0037,-9.9386,425
4.8229,-9.8117,426
0.5915,-9.8393,427
-10.8365,-9.7692,428
3.6168,-9.6817,430
-1.4498,-9.729,431
-3.4477,-9.7081,432
-49.1005,-9.0993,433
13.0036,-9.0036,434
-5.0296,-9.5274,435
-20.28,-9.7333,437
-37.714,-6.1067,438
6.3029,-9.6708,439
-5.8309,-9.681,440
-3.5819,-9.66,441
-6.6339,-9.5642,442
8.8381,-8.9927,443
