AYGX_mean,AZ_mean,timestamp
0.8704,-9.6447,373
3.6415,-9.9968,374
-0.6205,-9.9474,375
0.2895,-8.2115,377
2.7296,-9.6529,378
1.1603,-9.5358,379
3.6694,-9.7276,380
9.7963,-8.3793,381
-1.1575,-9.3508,382
53.3449,-9.6008,383
15.6294,-9.6004,384
0.4356,-9.8542,385
9.3836,-9.4771,386
1.0994,-9.8409,388
3.5437,-9.7044,389
3.5927,-9.6241,390
4.9767,-9.7715,391
10.4553,-9.2156,392
0.7821,-9.3929,393
