AYGX_mean,AZ_mean,timestamp
0.8581,-9.9021,821
0.99,-10.011,822
-0.0784,-10.1486,823
2.1396,-9.8664,824
1.6719,-10.0081,825
-1.5212,-9.9141,826
0.6044,-9.8084,827
2.1694,-9.8529,828
-0.6492,-10.0699,829
-1.6215,-10.05,830
0.6346,-9.7887,831
2.9595,-10.0274,832
4.1133,-9.8482,833
2.2985,-9.9345,834
-0.4052,-9.938,835
-12.2448,-9.8164,836
5.6799,-9.8303,837
-8.1977,-9.8016,838
-0.7398,-9.8794,839
-213.4125,-8.0202,840
