AYGX_mean,AZ_mean,timestamp
1.4588,-9.7374,0
3.1867,-9.8058,1
0.6881,-9.8206,2
-0.1482,-9.8322,3
0.1968,-9.831,4
0.2185,-9.8301,5
0.2941,-9.829,6
0.1969,-9.8288,7
0.048,-9.8304,8
1.2489,-9.8123,9
0.1206,-9.8009,10
0.0981,-9.8815,11
0.1364,-9.8279,12
0.0639,-9.859,13
0.0302,-9.836,14
-0.1007,-9.8502,15
-0.2766,-9.8016,16
0.5178,-8.9951,17
0.0507,-9.1127,18
2.2543,-9.6067,19
2.4175,-9.8384,20
3.556,-9.7573,21
0.0913,-9.8022,22
0.0735,-9.8008,23
0.0223,-9.8706,24
2.0103,-9.6678,25
-0.0539,-9.8264,26
0.4756,-9.8412,27
-0.069,-9.883,28
0.8402,-9.7369,29
1.5531,-9.8256,30
1.086,-9.9019,33
-0.1147,-9.8479,34
-0.4973,-9.8715,35
-0.16,-9.8663,36
1.6066,-9.7283,37
-0.5289,-9.7909,38
0.3016,-9.7921,39
0.1708,-9.7053,40
-0.6084,-9.6936,41
0.8777,-9.6971,43
-0.2038,-9.8765,44
-1.1191,-9.7849,45
1.5056,-9.7749,46
0.2417,-9.5933,47
-0.5347,-9.9143,48
-1.0162,-11.3289,49
-0.3157,-9.8101,50
1.496,-9.8759,51
0.4251,-9.7719,53
0.1703,-10.1376,54
1.1908,-9.8233,55
0.0898,-9.8167,56
0.851,-9.7709,57
-0.6054,-9.8654,58
1.0082,-9.7912,59
-0.1093,-9.7882,60
0.9849,-9.8338,61
-0.18,-9.7929,62
-0.313,-9.856,63
-0.1792,-9.7198,64
1.8747,-9.6069,65
-2.508,-9.8358,66
-1.396,-9.6636,67
-0.3849,-9.0657,68
1.5538,-8.8634,69
-1.1508,-8.8161,70
1.5956,-9.4317,71
0.3886,-9.2338,72
1.4937,-9.7648,73
0.5204,-9.9582,74
3.7122,-9.7066,75
0.2591,-9.904,76
1.4848,-9.7957,77
2.1352,-9.9815,78
0.8035,-10.1131,79
0.2729,-9.7855,80
-0.01,-9.845,81
-0.0182,-9.7529,83
-0.0032,-9.9451,84
0.9239,-9.8155,85
-0.1758,-9.8323,86
0.2665,-9.6662,87
-0.2795,-9.9018,88
-0.9538,-9.1618,89
1.2292,-9.5842,90
2.3351,-9.8455,91
5.2574,-10.5377,92
0.8055,-9.9171,93
-6.9341,-9.8304,94
-12.8413,-9.5964,95
4.9897,-9.6845,96
3.8521,-9.741,97
2.0294,-9.775,98
7.515,-10.1611,99
1.517,-9.8863,100
1.5226,-9.7537,101
28.3255,-10.0216,102
1.3544,-9.9082,103
0.3546,-9.7235,104
3.7418,-9.5206,105
5.0213,-9.9309,106
0.0827,-9.7397,107
0.2051,-9.8511,108
0.5012,-9.3845,109
0.566,-9.8653,110
0.6202,-9.8264,111
1.8116,-7.9868,112
1.0845,-9.8384,113
0.321,-10.0396,114
2.2428,-9.8045,115
0.4936,-10.1347,116
1.0003,-9.3429,117
1.8561,-8.9755,118
0.3405,-8.3942,119
2.6309,-9.7756,120
0.3438,-10.0099,121
-0.148,-8.8787,122
-0.0392,-9.9162,123
0.1385,-10.1174,124
1.483,-9.9808,125
-0.9061,-10.0595,126
0.7121,-9.8682,127
-0.4795,-9.8478,128
-1.0815,-10.5264,129
-0.1908,-9.5435,130
-0.824,-9.5361,131
8.7857,-9.8235,132
0.4077,-9.964,134
7.1973,-10.0532,135
0.3695,-10.2021,136
8.7457,-9.8124,137
1.4963,-9.8356,138
0.6874,-9.8782,139
0.4613,-9.7963,140
1.5478,-9.5993,141
0.0531,-9.857,142
5.0793,-9.9409,143
4.8672,-9.7647,144
0.9246,-9.8286,145
0.3831,-9.7648,146
-0.044,-9.9063,147
2.3037,-9.9158,148
3.2812,-9.7785,149
3.5035,-9.9655,150
-1.3478,-10.1098,151
0.7035,-10.2161,152
1.0915,-10.1588,153
0.7885,-9.787,154
-0.1696,-9.8184,155
3.4836,-9.8346,156
-1.0055,-9.8491,157
-0.8959,-9.4984,158
0.7744,-9.7876,159
0.6383,-9.8701,160
1.9724,-9.6921,161
0.0692,-9.812,162
-0.9036,-9.7889,163
4.0003,-10.1412,164
13.3871,-10.1196,165
6.5826,-10.0009,166
0.0981,-9.9216,167
9.347,-10.0109,168
2.8806,-9.6798,169
-0.1579,-9.7432,170
3.267,-9.8516,171
0.0437,-9.8041,172
0.1517,-9.9195,173
0.063,-9.8396,174
0.2846,-9.8276,175
0.2271,-9.7699,176
-0.042,-9.8735,177
-0.2486,-9.855,178
-0.0621,-9.6599,179
0.98,-9.9475,180
0.8304,-9.0819,181
0.2068,-9.8586,182
0.7627,-10.0265,183
1.3855,-9.7822,186
0.495,-9.6825,187
1.1963,-9.8534,188
3.2956,-9.976,189
0.4544,-9.8835,190
-0.0606,-9.8422,192
0.1173,-9.7735,193
-0.022,-9.8029,194
0.2302,-9.6778,195
-0.3261,-10.2232,196
0.1142,-9.7533,197
0.0741,-9.9232,198
0.3732,-10.4383,199
0.5523,-9.8869,200
0.5551,-9.8136,201
0.9525,-9.7024,202
-0.2263,-9.8355,203
-1.0428,-9.3331,204
0.2923,-9.7112,205
0.3336,-9.794,206
0.4597,-9.9581,207
0.0526,-9.8096,208
0.2322,-9.6811,209
-0.2843,-9.8089,210
-0.0498,-9.7046,211
0.2031,-10.1269,212
0.585,-9.5944,213
-0.0922,-9.4608,214
-0.038,-9.8353,215
0.207,-9.8137,216
1.8674,-9.8994,217
0.4459,-10.2858,218
-0.1302,-9.5462,219
0.0864,-9.5913,220
0.3505,-10.2915,221
4.8152,-9.9299,222
7.7744,-9.7374,223
0.2123,-9.9331,224
0.306,-9.8278,225
-0.2538,-9.7788,226
0.1091,-9.7563,227
0.2425,-9.8146,228
0.2376,-9.939,229
0.2101,-9.8317,230
-0.064,-9.8004,231
0.0005,-9.6999,232
0.2224,-10.4397,233
6.3176,-10.0131,234
-0.9941,-10.2772,236
25.9665,-9.6352,237
2.0838,-10.7912,238
-0.4743,-10.5615,239
7.3421,-10.0512,240
8.952,-9.9373,241
0.7653,-9.8007,242
4.0334,-10.1451,243
1.6759,-10.0608,244
0.1859,-9.8028,245
0.8711,-9.3442,246
1.4166,-9.8838,247
0.3906,-9.9005,248
0.5305,-9.7181,249
0.0924,-9.8857,250
1.1491,-9.8887,251
1.3009,-9.8247,252
0.8548,-9.8588,253
0.4576,-9.7148,254
-0.8401,-9.8877,255
1.9981,-9.7664,256
1.5734,-9.851,257
-0.2653,-10.0005,258
0.8588,-9.8214,259
0.2553,-9.8463,260
0.7066,-9.873,261
0.9331,-9.8682,262
0.7299,-9.852,263
0.5757,-9.7218,264
-0.0918,-9.9397,265
0.0434,-9.8883,266
0.597,-9.7868,267
-0.0916,-9.7455,268
-0.2876,-9.5197,269
0.693,-8.9935,270
-0.6328,-9.1412,271
-0.0985,-9.8267,272
2.2542,-9.8481,273
-0.3733,-10.0498,274
0.229,-9.6734,275
-0.3725,-10.011,276
1.5823,-9.6895,277
-2.0947,-9.653,278
0.403,-9.6913,279
1.0991,-9.8818,280
0.7351,-9.9233,281
-1.0372,-9.9056,282
-0.6703,-9.9682,283
4.3195,-9.8601,284
1.2199,-9.8242,285
0.0764,-9.7749,287
0.3043,-9.8431,288
0.2332,-9.7329,289
2.668,-9.5968,290
-0.4329,-10.1396,291
2.044,-9.9564,292
0.6066,-9.7914,293
0.6647,-9.8234,294
0.2023,-9.84,295
1.336,-9.9912,296
0.482,-9.7303,297
0.0328,-9.9217,298
-0.0633,-9.8104,299
0.8167,-9.8707,300
0.4154,-9.8301,301
0.7588,-9.8817,302
0.0382,-9.7749,303
-0.3011,-9.9373,304
1.3781,-9.7185,305
0.8123,-10.0156,306
1.0851,-10.1918,307
2.9309,-10.0302,308
1.8652,-9.846,309
4.1739,-9.8983,310
1.4757,-9.8767,311
0.695,-9.8224,312
0.7094,-9.9644,313
1.497,-9.8406,314
0.4071,-9.8068,315
-0.1241,-9.9142,316
0.5118,-9.9407,317
0.3366,-10.1059,318
-0.1608,-9.7364,319
1.2723,-9.8827,320
0.5999,-9.8421,321
0.3614,-9.8835,322
1.2658,-9.8043,323
0.1435,-9.8774,324
0.1131,-9.907,325
0.1723,-9.8208,326
2.1172,-9.8846,327
1.503,-9.7624,328
5.2552,-9.9279,329
2.0258,-9.8241,330
6.1024,-9.9939,331
2.9945,-9.7938,332
0.4404,-9.4371,333
0.1936,-9.961,334
-0.0973,-9.7866,335
0.4388,-9.8028,336
0.3694,-9.7997,338
1.6034,-9.4831,339
0.0664,-8.978,340
1.185,-9.768,341
0.6562,-10.042,342
0.6686,-9.7252,343
-0.3187,-9.9485,344
0.5722,-9.8627,345
0.4089,-9.8793,346
0.2501,-9.8344,347
0.3912,-9.8553,348
0.4219,-10.0187,349
2.3754,-9.7842,350
0.1148,-9.9676,351
-0.0477,-9.9002,352
1.8251,-9.8963,353
1.7417,-9.803,354
-0.4519,-9.8005,355
1.1852,-9.9183,356
3.5708,-9.7873,357
2.4706,-10.1798,358
1.5186,-9.7408,359
1.478,-9.2794,360
1.0683,-9.849,361
0.1562,-9.8704,362
0.1512,-9.9932,363
0.6049,-9.4978,364
0.0691,-9.7793,365
0.0166,-10.0263,366
-0.1945,-9.6899,367
-0.1075,-10.0423,368
-0.6253,-9.8172,369
-0.0255,-9.8711,370
-0.2269,-9.8107,371
0.555,-9.8894,372
-1.0229,-9.4865,373
-0.4116,-10.1602,374
1.4347,-9.428,375
0.0021,-9.8592,376
1.4834,-9.94,377
-0.9153,-9.6914,378
0.4797,-9.9264,379
-0.0161,-9.7848,380
0.3427,-9.8314,381
0.1208,-9.691,382
0.1849,-9.7546,383
-2.2987,-10.1806,384
-0.0657,-9.8403,385
3.7808,-9.9608,386
1.2693,-9.8148,387
1.4752,-10.1018,389
3.337,-9.847,390
1.5367,-9.8412,391
0.8163,-9.7888,392
0.4006,-9.8938,393
0.3949,-9.8549,394
0.3069,-9.8306,395
1.1376,-9.9043,396
0.8201,-9.835,397
2.1592,-9.8679,398
0.0914,-9.7228,399
0.3085,-9.8596,400
-0.2207,-9.8429,401
1.452,-9.8096,402
5.7373,-9.9676,403
0.5891,-10.0304,404
1.9082,-9.8954,405
1.1182,-9.7962,406
2.4106,-9.8238,407
-4.7368,-9.7926,408
-1.5933,-9.7638,409
1.4986,-9.8063,410
6.0081,-9.8706,411
1.0928,-9.8414,412
-1.6132,-9.9491,413
7.5174,-9.8941,414
-0.7747,-9.8956,415
0.4007,-9.8098,416
0.877,-9.8285,417
0.0331,-10.0043,418
1.8881,-9.8351,419
-0.0432,-9.8134,420
0.7345,-9.7939,421
0.5469,-9.849,422
1.6504,-9.8926,423
7.8623,-9.8729,424
0.507,-9.9399,425
-0.0486,-9.9638,426
1.4387,-9.9061,427
0.3023,-9.8611,428
0.1139,-10.4856,429
0.5665,-9.8258,430
-0.324,-9.7205,431
1.0584,-9.843,432
0.1467,-9.9888,433
1.5746,-10.0399,434
-0.7599,-9.7361,435
-4.712,-9.554,436
-0.7865,-10.1658,437
-1.4446,-10.214,438
1.0853,-9.2622,441
4.9269,-9.7453,442
1.5995,-9.7874,443
0.8587,-9.9342,444
0.5631,-9.9209,445
0.0786,-9.8524,446
2.1738,-9.8815,447
2.0067,-9.9133,448
1.1876,-10.0429,449
0.1579,-9.7572,450
-0.4299,-9.872,451
2.3694,-9.9094,452
1.7775,-9.8647,453
-1.2654,-9.8093,454
0.7888,-10.081,455
0.2024,-9.9585,456
3.1395,-9.7642,457
0.0615,-9.7407,458
1.1182,-9.8803,459
0.324,-9.8661,460
0.6133,-9.7606,461
1.4029,-9.9193,462
0.33,-9.9021,463
-0.1446,-10.0155,464
0.7689,-9.7931,465
1.1461,-9.8325,466
0.9064,-9.9946,467
-0.2458,-9.5891,468
0.2614,-9.6963,469
1.6905,-9.9047,470
1.9701,-9.7934,471
2.5498,-9.8942,472
1.85,-9.9457,473
0.4733,-9.6674,474
0.1363,-9.7797,475
1.0917,-9.9629,476
-0.252,-9.8012,477
1.2442,-9.7236,478
0.1257,-9.7851,479
1.5091,-9.771,480
0.8791,-9.7437,481
-0.0913,-9.9912,482
1.1032,-9.7306,483
0.2173,-9.946,484
0.1131,-9.6996,485
0.1348,-9.9729,486
0.0651,-9.4015,487
1.2428,-10.2822,488
-0.7755,-10.0242,489
0.5288,-9.8905,491
0.3909,-9.5926,492
-0.1108,-9.9512,493
-0.2474,-9.7807,494
-0.4629,-10.0194,495
0.0337,-9.8463,496
0.2355,-9.7145,497
0.2823,-9.6732,498
0.2419,-9.8999,499
0.2141,-9.9041,500
0.4207,-9.8435,502
0.1278,-9.8828,503
0.8943,-9.8593,504
0.0884,-9.7772,505
-0.0192,-9.9159,506
2.4065,-9.6411,507
-0.3327,-10.316,508
0.1208,-9.837,509
0.1918,-9.7254,510
-1.3195,-10.299,511
1.483,-9.8818,512
-0.2945,-9.8225,513
-1.7021,-9.8434,514
1.1764,-9.8171,515
-0.4634,-9.5587,516
1.3929,-9.8919,517
4.4954,-9.6766,518
0.5373,-9.9663,519
1.6109,-9.9195,520
1.6124,-9.7251,521
4.8067,-9.8948,522
1.1599,-9.8695,523
1.4891,-10.3425,524
-0.1262,-9.9705,525
1.4507,-10.0759,526
0.0715,-9.8103,527
-0.5091,-9.8313,528
0.1789,-10.2521,529
-0.2908,-9.8256,530
0.9691,-9.8377,531
0.4721,-9.8069,532
1.6541,-9.8335,533
0.0311,-9.871,534
0.3479,-9.8193,535
0.1916,-9.7979,536
1.184,-9.7445,537
-0.037,-9.3007,538
1.3875,-10.1707,539
-0.6983,-9.8325,540
0.9847,-9.7509,542
1.6655,-9.8276,543
0.0112,-8.7136,544
-0.6427,-9.7693,545
0.3892,-9.4587,546
0.295,-9.8042,547
1.6365,-9.8935,548
1.1293,-9.8613,549
-1.5996,-9.811,550
-0.4695,-9.2528,551
1.5976,-9.8693,552
-2.6228,-9.4684,553
-0.6866,-9.9142,554
-0.5751,-9.9172,555
0.4864,-9.8682,556
0.1989,-9.8351,557
0.1458,-9.8011,558
0.4858,-9.625,559
0.1333,-9.8081,560
1.0847,-9.8133,561
0.2706,-9.8557,562
0.5396,-9.7994,563
0.4494,-10.0069,564
-0.0202,-9.8284,565
0.282,-9.7977,566
3.3851,-9.8837,567
0.2704,-9.7921,568
0.4342,-9.9106,569
2.0152,-9.8449,570
1.1694,-9.8263,571
1.0768,-9.8711,572
0.4495,-9.7962,573
1.7058,-9.9721,574
0.4108,-9.8819,575
0.7692,-9.8186,576
0.0676,-9.9033,577
-0.0033,-9.7035,578
0.2953,-9.7778,579
-0.2444,-9.895,580
0.8519,-9.8786,581
4.4256,-9.7716,582
0.2791,-9.8514,583
0.5521,-9.7707,584
0.0107,-10.019,585
1.3303,-9.8297,586
-0.4293,-9.8533,587
0.1145,-10.008,588
0.148,-9.9122,589
2.8611,-9.8646,590
2.3945,-9.8739,591
1.4574,-9.881,593
0.6438,-9.9623,594
