AYGX_mean,AZ_mean,timestamp
-0.0064,-9.8761,4
-0.0034,-9.8787,5
-0.1146,-9.8643,6
-0.0224,-9.8857,7
0.0357,-9.8778,8
-0.0358,-9.8762,10
0.0293,-9.8604,11
0.2555,-9.8534,12
0.1368,-9.8808,13
-134.0683,-9.6357,14
-24.3542,-9.7141,15
-2.9792,-9.7796,16
-2.6981,-9.678,17
11.9134,-9.7703,18
-1.0636,-9.8704,20
0.5444,-9.8655,21
-1.2417,-9.8738,22
-19.7351,-9.7768,23
-1.3458,-9.8011,24
