AYGX_mean,AZ_mean,timestamp
0.064,-9.8635,0
0.0558,-9.863,1
-8.7642,-9.8055,2
-2.2949,-9.6304,3
5.833,-9.74,5
2.6974,-9.8038,6
-1.2197,-9.7751,7
2.0184,-9.7907,8
1.2007,-9.8147,9
0.4526,-9.8103,10
1.2525,-9.8252,11
-3.0061,-9.8194,12
0.1262,-9.8439,13
-1.5133,-9.8177,14
2.6022,-9.8406,16
-0.4652,-9.8462,17
1.3303,-9.8397,18
-4.358,-9.8554,19
-1.7937,-9.5099,20
1.0081,-9.6612,21
2.693,-9.6382,23
10.9359,-9.763,24
1.2243,-9.8575,25
-0.6109,-9.8556,26
-0.1423,-9.8866,27
0.7087,-9.8694,28
-0.1273,-9.8527,29
-0.5833,-9.8637,30
1.6184,-9.84,31
-0.8805,-9.8608,33
-4.8453,-9.7951,34
2.0456,-9.8197,35
-5.2386,-9.7693,36
25.1328,-9.6631,37
-1.5672,-9.9321,38
-1.2142,-9.8457,39
2.0229,-9.8527,40
0.3252,-9.879,41
-1.5435,-9.857,43
1.2729,-9.8549,44
-4.2032,-9.7952,45
7.3924,-9.814,46
2.191,-9.839,47
-2.9911,-9.7987,48
0.8321,-9.8107,49
0.6766,-9.878,50
-9.7906,-9.7976,51
-5.7826,-9.8218,53
2.62,-9.7782,54
-0.2472,-9.8606,55
-0.6564,-9.8655,56
-6.153,-9.7337,57
1.5436,-9.7211,58
0.863,-9.746,59
2.8554,-9.7621,60
-1.2734,-9.7482,61
1.5721,-9.736,63
-4.6999,-9.7292,64
-0.8319,-9.7223,65
2.6312,-9.6614,66
-0.0013,-9.6881,67
1.4314,-9.6946,68
0.4721,-9.7185,69
-3.02,-9.6446,70
1.4643,-9.6395,71
1.8107,-9.6436,73
0.8793,-9.6601,74
0.5716,-9.6589,75
1.4669,-9.651,76
0.38,-9.6561,77
0.3837,-9.6551,78
1.1425,-9.6582,79
0.8564,-9.6684,80
0.5407,-9.6603,81
0.404,-9.6531,83
0.9438,-9.6487,84
-2.5872,-9.6395,87
7.6253,-9.6644,88
9.3209,-9.7871,89
-1.271,-9.8508,90
1.9824,-9.8454,91
-3.5312,-9.8164,92
2.6547,-9.8019,93
0.6277,-9.856,94
0.0183,-9.8612,95
0.0479,-9.8685,96
-0.0774,-9.8691,97
-0.0611,-9.8726,98
-0.1137,-9.8709,99
0.2759,-9.8577,100
0.0886,-9.867,101
-1.13,-9.871,103
-1.779,-9.9109,104
-0.6328,-9.6528,105
-0.6982,-9.8467,106
-0.1537,-9.8995,107
-1.2911,-9.8921,108
1.8289,-9.8812,109
0.0129,-9.832,110
0.4179,-9.8402,111
1.8587,-9.8094,113
-0.4923,-9.8524,114
0.873,-9.8722,115
-0.3741,-9.8264,116
-10.5434,-9.7586,117
-7.4937,-9.8667,118
1.7739,-9.8607,119
0.0875,-9.8741,120
0.0021,-9.8723,121
0.0326,-9.8723,122
0.7981,-9.8841,123
1.4622,-9.8521,124
0.4094,-9.8683,126
-0.0473,-9.8638,127
0.5315,-9.8624,128
0.14,-9.8664,129
0.2376,-9.8678,130
-0.3764,-9.8729,131
-0.4609,-9.8416,133
0.9745,-9.8378,135
-2.6134,-9.7687,136
4.5712,-9.8428,137
7.4679,-9.8892,138
1.1227,-9.8947,139
5.3413,-9.8015,140
-4.1444,-9.9135,141
9.4373,-9.9153,143
-0.2941,-10.0106,144
52.9985,-9.311,145
45.3793,-9.8876,146
31.4972,-9.476,147
58.1931,-10.4152,148
70.1995,-9.5323,149
41.7055,-10.4358,150
29.3105,-10.1451,151
43.1225,-9.7418,153
-1.4024,-10.2173,154
-0.2356,-10.0698,155
-0.0053,-10.3646,156
11.2873,-9.6666,157
11.3467,-10.4092,158
0.7589,-10.1108,159
1.6822,-9.8906,160
2.3105,-9.8619,161
0.0705,-9.844,163
0.004,-8.6837,165
-0.3915,-9.9105,166
8.4165,-9.8483,167
1.3032,-9.9255,168
0.0154,-9.8388,169
2.4364,-9.8563,170
22.681,-9.7644,171
14.5831,-9.8302,173
3.4934,-10.0192,174
2.7114,-10.0215,175
1.9147,-9.9352,176
1.929,-9.8454,177
-2.9097,-9.7017,178
23.6438,-10.6247,179
18.8732,-9.9377,180
3.7978,-9.8143,181
12.5107,-9.9213,183
-2.1605,-9.9501,184
-4.6721,-9.8492,185
45.1132,-9.5742,187
-6.7441,-9.79,188
26.4878,-10.0193,399
45.1415,-9.9259,400
4.1139,-10.7846,411
29.5814,-10.2141,412
34.3302,-9.9131,413
7.7501,-9.9172,414
-12.6478,-9.7259,415
14.3051,-9.7358,416
0.4282,-9.8564,417
0.0953,-9.8657,418
-0.1773,-9.8671,419
-0.5852,-9.8615,420
0.3852,-9.8557,422
2.0021,-9.6492,578
0.5071,-9.6716,579
0.5215,-9.665,580
0.6965,-9.6638,581
1.2016,-9.6671,582
1.0429,-9.671,583
-0.4831,-9.6644,584
-0.0548,-9.6421,585
-2.7053,-9.635,586
4.0683,-9.5776,587
8.8533,-9.7078,588
6.1331,-9.8281,589
0.345,-9.7521,590
-2.8501,-9.8815,591
1.9697,-9.8029,592
0.2178,-9.8375,593
0.743,-9.8449,594
-0.2977,-9.9074,595
-5.9394,-9.7056,598
-2.1112,-9.8478,599
0.309,-9.8482,600
-1.0811,-9.8531,602
-2.0305,-9.8322,603
2.1662,-9.7585,604
0.9454,-9.7518,606
0.1385,-9.7474,607
0.2451,-9.7416,608
0.2618,-9.7423,609
6.65,-9.8086,610
-0.5326,-9.8575,611
-0.0561,-9.8616,612
-0.0862,-9.8601,613
0.0612,-9.8565,614
0.0173,-9.8553,616
-0.0713,-9.8546,617
-0.081,-9.8544,618
-0.2508,-9.8531,619
-0.0265,-9.8544,620
-0.1924,-9.8553,621
-0.0911,-9.8512,622
0.2346,-9.8555,623
-0.1941,-9.8592,624
-0.0727,-9.8585,626
0.7322,-9.8516,627
-34.0607,-9.701,628
24.8379,-9.7321,629
-1.6656,-9.7319,630
5.1183,-9.7144,631
4.4402,-9.8347,632
4.6133,-9.8401,633
-0.1208,-9.8737,634
1.0441,-9.6356,636
10.5599,-9.8717,637
10.0514,-9.8318,639
0.8348,-9.8832,640
-0.5592,-9.9397,641
4.9098,-10.0231,642
7.0722,-10.0754,643
-1.2966,-9.9386,646
0.9446,-10.0083,647
10.3243,-9.6382,648
0.4743,-9.9365,649
5.7623,-10.0476,650
-10.0033,-9.9016,651
2.0313,-10.1273,652
20.7276,-9.9906,653
30.5658,-9.866,654
11.8802,-10.1298,656
13.0579,-9.9584,657
9.9429,-9.8177,658
4.4147,-9.7717,659
7.5206,-9.8018,660
1.4375,-9.8749,661
-1.9856,-9.9769,662
-3.4437,-9.8525,664
-0.2104,-9.8652,665
-0.162,-9.863,666
0.0573,-9.8652,667
-0.3971,-9.8595,668
1.0859,-9.8486,669
-0.0944,-9.8659,671
-2.1862,-9.8177,672
2.84,-9.842,673
-0.1558,-9.8223,674
-21.1998,-9.7594,675
0.6529,-9.7767,676
33.5296,-9.6632,677
-1.0669,-9.8476,678
-0.0871,-9.8569,679
6.9291,-9.8121,681
-2.8056,-9.7349,682
-2.1852,-9.7825,683
-1.1481,-9.7174,684
-1.1917,-9.7629,685
-10.3078,-9.7783,688
1.8797,-9.6558,689
4.1647,-9.6649,691
4.6723,-9.7469,692
0.8493,-9.8162,693
4.0897,-9.8299,694
-0.54,-9.8806,695
2.9951,-9.839,696
9.6232,-9.4477,697
3.1738,-9.8266,698
-3.1934,-9.774,699
-21.1178,-9.7169,700
0.5976,-9.7314,702
0.6665,-9.7288,703
0.609,-9.7289,704
0.5858,-9.729,705
0.5597,-9.73,706
0.5572,-9.7285,707
0.5423,-9.7291,708
0.5376,-9.7272,709
0.5453,-9.7284,710
0.536,-9.7289,711
0.5247,-9.7286,712
0.5264,-9.7289,713
0.5188,-9.7291,714
0.5411,-9.7287,715
0.5465,-9.7284,716
0.538,-9.7292,717
0.5216,-9.7288,718
0.5237,-9.7297,719
0.5369,-9.7289,720
0.5221,-9.7297,721
0.5375,-9.7292,722
0.5284,-9.73,723
0.5267,-9.7298,724
0.5295,-9.7307,726
0.506,-9.7289,727
0.5076,-9.7303,728
0.5183,-9.73,729
0.5201,-9.7293,730
0.4836,-9.7317,731
0.4436,-9.7346,732
0.4949,-9.7282,733
0.4799,-9.7341,734
0.5481,-9.7301,735
0.4504,-9.7311,736
0.5059,-9.7308,738
0.235,-9.7272,740
0.6085,-9.7316,741
0.3511,-9.7291,742
1.7294,-9.6853,743
-1.945,-9.7104,744
1.363,-9.7213,745
1.4928,-9.7354,746
0.6308,-9.7303,747
0.4968,-9.7333,748
0.5694,-9.7366,749
-1.2867,-9.7206,751
0.8107,-9.7309,752
-2.8336,-9.6802,753
-0.9435,-9.714,754
2.4261,-9.761,755
0.1388,-9.7628,756
-0.0859,-9.7549,757
0.6664,-9.7426,758
-0.5124,-9.7374,759
1.4553,-9.7396,761
0.2723,-9.7414,762
1.1829,-9.7403,763
0.6489,-9.746,764
-0.0111,-9.7422,765
0.5887,-9.7416,766
1.1866,-9.7487,767
0.3208,-9.7288,768
0.1762,-9.7378,769
0.5961,-9.7379,771
0.6143,-9.7299,772
0.6278,-9.731,773
0.6814,-9.7314,774
0.5221,-9.73,775
0.5068,-9.7301,776
0.5189,-9.732,777
0.5278,-9.7312,778
0.5358,-9.7318,779
0.5153,-9.731,781
0.5269,-9.7306,782
0.4537,-9.7319,783
0.5201,-9.7322,784
0.5076,-9.7314,785
0.5156,-9.7304,786
0.5449,-9.7318,787
0.3709,-9.7355,788
0.4928,-9.7331,789
0.5216,-9.7335,791
0.5455,-9.7324,792
0.5585,-9.7328,793
0.5454,-9.7309,794
0.5375,-9.7325,797
0.5361,-9.7313,798
0.5224,-9.7316,799
0.5004,-9.7312,801
0.51,-9.7317,802
0.5075,-9.7322,803
0.5278,-9.7325,804
0.5258,-9.7323,805
-0.8632,-9.7224,806
0.1936,-9.7305,807
0.3,-9.7328,808
0.4449,-9.7335,809
0.5655,-9.7321,811
0.4604,-9.7338,812
0.4967,-9.7339,813
0.4923,-9.7333,814
0.4378,-9.7348,815
-0.0699,-9.7282,816
-1.1407,-9.7587,817
0.7548,-9.7384,818
-0.1402,-9.7302,819
0.3771,-9.7397,820
0.5981,-9.7463,822
0.0636,-9.7416,823
0.4673,-9.7464,824
0.8461,-9.7453,825
1.8885,-9.7459,826
1.3822,-9.7455,827
0.1534,-9.7468,828
-0.2074,-9.757,829
0.7064,-9.7445,830
-0.6374,-9.727,832
1.9875,-9.7283,833
-1.4222,-9.7945,837
-2.291,-9.7421,839
1.0217,-9.7593,840
0.464,-9.7458,842
0.4775,-9.7521,843
0.7284,-9.7521,844
4.4706,-9.7695,845
0.9897,-9.7543,846
0.5773,-9.7458,847
0.6824,-9.7497,848
0.6348,-9.7506,849
0.0519,-9.754,850
1.1466,-9.7546,851
-1.1958,-9.7399,852
0.2258,-9.7561,853
5.4695,-9.7867,854
0.4193,-9.7543,855
2.1144,-9.7677,856
2.1206,-9.7893,857
0.6772,-9.79,858
-6.286,-9.7735,859
10.4678,-9.7798,860
-1.445,-9.8435,861
-8.0824,-9.8025,862
5.7999,-9.8167,863
-1.227,-9.8726,864
-0.242,-9.8343,865
0.2708,-9.8391,866
-9.8692,-9.5944,867
-17.8623,-9.2883,868
-4.8925,-9.2026,869
6.0881,-9.2375,870
2.028,-9.2783,871
0.1031,-9.2995,872
1.0182,-9.2878,873
3.2646,-9.2862,874
-0.3888,-9.2674,875
-0.9721,-9.2103,876
-19.1742,-9.2674,877
-3.9373,-9.4445,878
46.0537,-9.2156,879
-8.0169,-9.7517,881
-0.1814,-9.8599,882
0.224,-9.8616,883
-0.1138,-9.8634,884
-0.216,-9.8648,885
-0.0342,-9.8686,886
0.4006,-9.8693,887
-0.0402,-9.8656,888
1.1689,-9.8694,889
-0.7537,-9.8097,891
1.0089,-9.8524,892
-6.3297,-9.7312,893
3.3374,-9.7971,894
-0.9053,-9.8198,895
6.5268,-9.8253,896
-4.4367,-9.896,897
1.7041,-9.7891,898
0.0176,-9.9131,899
-0.2154,-10.005,901
5.9875,-9.8269,902
2.0106,-9.9401,903
1.3058,-9.9637,904
-2.2669,-9.9393,905
10.8746,-10.4995,906
2.9569,-9.5937,907
2.2585,-9.7429,908
19.4732,-10.2071,910
41.7663,-10.4145,911
90.3096,-10.024,912
51.962,-10.2124,913
31.4824,-9.9644,915
9.8079,-9.9461,916
5.8998,-9.7444,917
11.8138,-9.6778,918
4.1807,-10.5457,920
16.8911,-9.9992,921
6.0165,-10.3271,922
0.3866,-9.8198,923
5.2247,-9.9667,924
6.1567,-10.0664,925
-1.2222,-10.4713,926
5.9368,-10.2555,927
62.16,-10.1339,928
98.225,-10.0574,930
63.2284,-10.2149,931
55.1924,-9.7798,932
-13.3164,-9.9574,933
-8.5231,-10.9139,934
6.858,-10.5228,935
7.3371,-9.8942,936
1.7028,-9.3448,937
13.1381,-9.4791,938
69.9615,-10.6218,940
5.6119,-9.9335,941
1.1001,-9.4413,942
4.3424,-9.9434,943
29.5373,-9.7199,944
44.3422,-9.8339,945
13.2593,-9.5485,946
38.2535,-10.9167,949
3.5933,-9.4547,951
3.494,-10.0862,952
9.1554,-9.5522,953
2.2608,-9.6273,954
2.6328,-9.7692,955
-0.9224,-9.9132,956
1.1949,-10.0397,957
11.9017,-9.8316,958
-4.9167,-9.8176,959
-5.8704,-9.625,960
2.8816,-9.8431,962
-0.5564,-9.8559,963
-4.9487,-9.7957,964
0.3795,-9.7723,965
4.7737,-9.7734,966
-4.7076,-9.8807,967
-56.3952,-8.9965,969
-5.8211,-9.8297,970
-4.4609,-9.8049,972
0.7737,-9.7808,973
7.3986,-9.9434,974
-12.8881,-9.7777,975
4.8396,-9.7589,976
3.8476,-9.8109,977
-6.2667,-9.6974,978
16.1016,-9.8029,979
0.0518,-9.9052,981
5.0986,-9.8282,982
0.0279,-9.8306,983
1.6292,-10.0523,984
17.031,-9.8522,985
0.2995,-9.7557,986
0.1056,-9.9014,987
0.8732,-9.8555,988
2.0413,-9.9098,989
-0.7658,-9.898,990
4.023,-10.0005,992
3.8617,-9.8694,993
-0.0442,-9.8045,994
0.0671,-9.9634,995
0.6841,-9.5635,996
1.472,-9.8466,997
1.4935,-9.7816,998
0.8345,-10.1368,999
2.4966,-9.6522,1000
12.5223,-9.9153,1001
7.4844,-9.8816,1002
23.2676,-9.5809,1003
40.0847,-9.8304,1004
45.2658,-9.68,1005
-0.268,-9.8925,1006
2.8338,-9.8791,1008
26.0268,-10.1184,1009
25.8901,-9.6639,1011
17.4256,-10.0166,1012
20.3205,-9.7635,1013
34.3039,-10.0614,1014
-0.7431,-10.2361,1015
18.512,-9.5208,1016
5.8427,-10.2459,1017
13.6735,-10.3306,1018
4.5893,-9.6663,1019
13.6966,-10.3513,1021
20.9139,-10.2595,1022
9.0291,-10.1501,1023
39.8688,-9.6663,1024
-4.1448,-9.7046,1025
1.1621,-9.7953,1026
28.2512,-9.6252,1027
0.4473,-9.8722,1028
-0.3715,-9.8546,1029
0.3503,-9.9184,1031
2.9892,-9.9539,1032
0.0566,-9.6896,1033
3.2536,-9.7376,1034
5.56,-9.9778,1035
-16.328,-9.9692,1036
-0.2907,-9.6927,1038
6.6184,-9.7983,1039
14.3587,-8.918,1040
-27.4191,-9.6944,1041
-2.8928,-9.7068,1042
1.444,-9.8216,1043
-4.7633,-9.8402,1044
6.053,-9.8164,1046
4.2113,-9.8217,1047
1.2981,-10.0849,1048
-4.0948,-10.233,1049
49.8908,-9.7054,1050
-2.1304,-10.1564,1051
7.055,-9.8193,1052
0.7118,-9.8426,1053
2.1469,-9.719,1054
0.048,-9.9055,1056
4.8311,-9.9441,1057
1.4099,-9.7924,1058
-1.6594,-9.8132,1059
-1.627,-10.3626,1060
30.687,-9.8162,1061
8.5731,-10.0453,1062
7.7313,-9.9766,1063
-2.8821,-9.4156,1064
31.3057,-9.4449,1066
10.6738,-9.9921,1067
1.8624,-9.5752,1068
96.4343,-9.6813,1069
2.0715,-10.6852,1070
-15.4987,-9.5507,1071
46.9272,-9.8551,1072
97.5661,-10.4214,1073
109.3254,-9.9768,1074
11.743,-11.1145,1076
2.7052,-9.8454,1077
0.898,-10.0965,1078
5.0809,-9.9346,1079
56.2363,-10.2575,1083
161.5736,-10.0076,1084
22.7747,-10.5405,1086
36.4138,-9.8583,1087
2.5578,-9.9134,1088
4.4191,-9.9924,1089
12.0303,-11.0014,1090
44.4768,-9.9624,1091
5.0254,-10.2583,1092
19.4079,-10.1745,1093
33.9736,-10.7197,1094
5.8967,-10.3689,1095
1.4974,-9.9205,1097
0.2259,-9.8651,1098
-2.49,-10.05,1099
5.3426,-9.7592,1100
0.9345,-9.7,1101
5.9857,-9.6355,1102
5.7056,-9.8137,1103
5.1203,-10.2552,1104
4.9346,-9.9381,1106
2.7896,-10.0186,1107
5.8847,-9.7076,1108
15.3621,-9.8855,1109
24.6991,-9.9076,1110
0.3174,-9.892,1111
51.296,-9.5069,1112
68.9715,-9.6358,1113
16.036,-9.4925,1114
3.9909,-9.8039,1117
5.6988,-10.0195,1118
92.6624,-10.0293,1119
30.6735,-9.0604,1120
8.6387,-9.481,1121
75.5833,-9.947,1122
49.9992,-9.6831,1123
1.8602,-10.0329,1124
2.1932,-9.8922,1125
6.78,-9.9802,1126
-0.5334,-10.1571,1127
0.181,-9.9634,1128
0.8957,-10.3441,1129
-0.8905,-9.6446,1130
-5.8373,-9.7698,1131
41.4298,-9.3457,1132
0.2176,-10.6812,1133
6.9602,-9.9423,1134
0.1389,-9.5967,1135
113.1827,-10.1953,1137
28.9203,-10.7141,1138
63.6985,-9.7132,1139
-5.3659,-10.0736,1140
17.7141,-10.48,1141
24.5217,-9.623,1142
9.3423,-10.0489,1143
10.3318,-9.9827,1144
1.3351,-10.3198,1146
3.069,-9.955,1147
19.1233,-10.1431,1149
-12.2934,-10.482,1150
-2.2693,-9.4568,1151
-15.2214,-9.6084,1152
-0.6966,-9.9891,1153
-5.8901,-9.8088,1154
-8.389,-9.7093,1156
1.3909,-9.8112,1157
3.0477,-9.9807,1158
5.4094,-9.9431,1159
2.7993,-9.3052,1160
7.4425,-9.6414,1161
-0.9875,-9.8104,1162
2.8802,-9.6293,1163
-0.5237,-9.6108,1164
4.7888,-9.8469,1166
3.9634,-9.9334,1167
5.2255,-10.0757,1168
4.4051,-9.9425,1169
41.8503,-9.6116,1170
5.6434,-9.9212,1171
4.2918,-9.2333,1172
15.6525,-10.0191,1173
2.7468,-9.7297,1174
1.3751,-9.9242,1176
18.1666,-10.0929,1177
18.8611,-9.7272,1178
1.1695,-10.0762,1179
0.8641,-9.8525,1180
0.7551,-10.0551,1181
1.5188,-9.9403,1182
0.1086,-9.8658,1183
2.4635,-9.7756,1184
1.6243,-9.9778,1186
4.2432,-9.9257,1187
17.5658,-9.6018,1188
8.4142,-9.8645,1189
0.4594,-9.9503,1190
17.0106,-10.095,1191
-0.1421,-10.0436,1192
9.7844,-10.1929,1193
23.6685,-9.4786,1194
0.5174,-9.762,1196
1.7096,-9.8149,1197
-1.3947,-9.8859,1198
2.6584,-9.9469,1199
-0.4078,-9.472,1200
-0.9648,-10.2128,1201
5.782,-10.0024,1203
5.9625,-9.9774,1204
11.028,-9.7789,1205
45.6396,-10.0977,1207
4.0768,-10.0231,1208
37.6758,-9.5615,1209
9.3794,-10.0856,1210
-0.0963,-9.6976,1211
1.5935,-10.2368,1212
7.311,-10.0242,1213
10.2769,-9.7585,1217
22.5709,-9.8184,1218
11.3158,-9.7203,1219
10.0692,-10.1869,1220
59.8946,-9.7626,1221
13.666,-9.8651,1222
25.6838,-9.1938,1223
126.7038,-8.6423,1225
4.4268,-9.9213,1226
0.1445,-9.9458,1227
5.3083,-10.0426,1228
1.3159,-9.8561,1229
10.1833,-10.0039,1230
-0.5255,-10.0336,1231
28.2926,-10.6443,1232
15.3108,-9.8012,1233
21.4466,-9.8661,1234
2.3824,-9.8657,1235
16.9318,-9.8633,1237
0.9944,-9.9332,1238
-0.9909,-9.786,1239
1.2914,-9.8612,1240
3.4217,-9.8264,1241
22.2853,-9.9614,1242
1.0652,-10.0045,1243
-4.0239,-9.8901,1244
22.0033,-9.8023,1245
20.2006,-10.2984,1247
185.4163,-8.8813,1248
11.3875,-10.1534,1249
0.1217,-9.6446,1250
1.74,-9.7714,1251
0.5334,-9.8211,1252
22.1344,-10.0944,1253
3.8393,-10.0718,1254
3.6585,-9.8419,1255
3.228,-9.9673,1257
4.8882,-9.8893,1258
-0.6598,-9.9334,1259
0.6045,-10.0227,1260
0.4943,-9.7007,1261
0.8702,-9.7969,1262
2.7838,-10.0014,1263
31.8447,-10.079,1264
-1.2829,-9.5885,1265
7.1515,-9.9617,1266
35.3021,-10.1774,1267
37.477,-9.9686,1268
0.4021,-9.9597,1269
3.6062,-9.7302,1270
0.1356,-9.7593,1271
1.3663,-10.051,1272
1.5299,-9.9744,1273
0.4905,-9.7509,1274
2.7357,-9.6716,1275
11.1933,-9.8226,1277
121.5196,-9.3499,1278
58.5652,-10.5073,1279
-2.3091,-9.9587,1280
5.9424,-10.4099,1281
16.1634,-10.3044,1282
36.6203,-10.0777,1283
2.7418,-10.2558,1284
11.6541,-10.3153,1285
1.2627,-9.8677,1286
2.7692,-10.3668,1288
-2.8655,-8.637,1293
-74.677,-9.0948,1294
-4.4917,-9.9141,1295
5.4191,-10.0,1296
17.0289,-9.7299,1297
3.9825,-9.799,1298
3.2807,-9.5563,1302
4.6115,-9.9119,1303
0.8946,-9.7416,1304
1.73,-10.1061,1306
6.0552,-9.8524,1307
24.9146,-9.8522,1308
-1.6362,-9.5998,1309
7.1948,-9.7935,1310
5.5981,-9.6517,1311
0.1073,-10.0772,1312
-0.9433,-9.6448,1313
-0.6207,-11.0476,1314
24.2452,-10.1079,1317
7.5271,-10.0514,1318
-2.2718,-9.9925,1319
-0.1846,-9.2187,1320
-1.9648,-10.1745,1321
3.7863,-10.1158,1323
1.1567,-9.6986,1324
1.9,-10.0548,1325
2.135,-9.8743,1327
6.3428,-10.1284,1328
-0.329,-9.8398,1329
5.5614,-9.9236,1330
1.2567,-9.884,1331
25.7901,-9.9113,1332
0.7988,-9.8723,1333
18.8206,-9.7144,1334
4.3922,-9.6979,1336
7.1332,-7.8663,1337
43.8019,-9.7098,1338
67.8734,-10.2808,1339
123.5097,-9.3948,1340
75.6869,-10.2776,1341
30.2344,-10.192,1342
24.7075,-9.9096,1343
3.4973,-9.9167,1344
36.0034,-9.9474,1346
4.6381,-9.9461,1347
3.4433,-9.7492,1348
1.3481,-9.4184,1349
1.6684,-9.5302,1350
-0.371,-9.8065,1351
0.9893,-9.8009,1352
-4.7768,-8.7122,1353
-1.856,-9.7597,1354
0.7993,-9.9382,1356
0.6851,-9.8803,1357
-0.2462,-10.0962,1358
0.4003,-9.8791,1359
2.5285,-9.8322,1360
0.7219,-9.2416,1361
20.4624,-10.3313,1362
38.3892,-9.8472,1363
14.5758,-9.7489,1364
16.4052,-9.5277,1366
2.5367,-9.8422,1367
6.5681,-9.8921,1368
0.0489,-9.45,1369
-0.0804,-9.9512,1370
-0.1703,-10.3409,1371
0.2347,-9.5844,1372
-0.004,-9.8898,1373
2.8599,-10.0726,1374
9.2518,-9.8543,1376
7.7775,-9.7912,1377
2.8835,-9.9934,1378
130.5792,-11.2596,1379
56.2021,-9.6556,1380
24.8459,-9.7534,1381
43.1799,-10.2847,1382
45.3623,-9.8608,1383
5.6019,-9.8767,1384
3.5738,-9.7355,1386
22.1757,-9.2028,1387
-0.0357,-9.4738,1388
5.7789,-10.062,1389
3.1484,-9.7103,1390
5.6533,-9.9962,1391
0.1002,-10.0636,1392
15.9946,-10.1256,1393
55.6884,-10.7663,1394
55.8428,-9.5987,1395
9.8707,-10.0242,1397
-0.7092,-9.9448,1398
0.0521,-10.0613,1399
1.0807,-10.0748,1400
10.9325,-9.8532,1401
5.3321,-9.8745,1402
-0.9209,-9.8091,1403
11.9982,-9.9422,1404
5.9735,-10.2373,1406
4.1233,-9.9505,1407
0.599,-9.89,1408
-4.6239,-10.0111,1409
5.4321,-9.7406,1410
-1.592,-9.8016,1411
8.3673,-9.9118,1412
11.0732,-9.902,1413
1.9098,-9.9344,1414
0.7879,-10.042,1415
0.9448,-9.8752,1416
5.9142,-9.9,1417
3.1701,-10.1064,1418
5.9001,-10.0781,1419
7.436,-9.8533,1420
5.9873,-9.8514,1421
-7.0449,-9.936,1422
1.9553,-9.9608,1423
8.4268,-9.8641,1424
23.6683,-10.008,1425
23.0289,-9.6443,1427
13.4984,-10.2948,1428
9.552,-10.0889,1429
5.5046,-10.071,1430
51.1211,-9.8669,1431
19.562,-10.192,1432
3.0642,-9.8961,1433
3.9154,-9.8805,1434
26.9302,-9.7329,1436
12.1237,-10.4719,1437
8.1375,-9.9592,1438
0.7649,-9.8508,1443
-29.7266,-9.6644,1445
3.2294,-9.7762,1446
12.0626,-9.8184,1447
0.4347,-9.9777,1448
1.2577,-9.6592,1449
-2.8312,-10.0561,1450
-2.0311,-9.9159,1451
-0.7415,-9.9604,1452
0.837,-9.9725,1453
-0.0421,-10.0974,1454
-0.5166,-9.905,1456
1.0642,-9.9493,1457
5.5474,-10.2795,1458
40.7563,-10.3199,1459
38.4125,-9.9632,1460
-0.6938,-9.9634,1461
3.0706,-9.9173,1462
3.3646,-9.8801,1463
1.8376,-9.8619,1464
4.594,-9.9437,1466
2.9147,-9.9674,1467
2.8406,-9.6611,1468
19.0262,-9.8086,1469
5.3727,-9.949,1470
3.945,-10.1037,1471
33.3198,-9.7811,1472
40.8236,-10.2393,1473
-10.8387,-11.1075,1474
39.5311,-10.0994,1476
46.5245,-9.831,1477
29.0149,-10.5059,1478
3.4514,-9.8556,1479
75.0766,-10.7982,1480
13.1518,-10.3135,1481
5.9572,-9.6105,1482
11.6808,-9.5359,1483
4.3092,-9.863,1485
76.361,-9.9544,1486
86.4976,-10.7055,1487
49.3624,-10.7614,1488
24.0219,-11.1271,1489
32.025,-9.9523,1490
15.8217,-9.8121,1491
3.9217,-9.8447,1492
7.8214,-9.3573,1493
11.7523,-9.7981,1495
5.7687,-9.8238,1496
31.8586,-10.1823,1497
16.2888,-10.9061,1498
10.9375,-10.7994,1499
19.1804,-11.6293,1500
85.2631,-10.1473,1501
18.9536,-9.9894,1502
4.8093,-9.8416,1503
-0.8321,-10.4092,1504
21.8961,-10.0013,1505
6.5693,-10.0092,1507
14.1429,-10.0759,1508
15.9547,-10.1494,1509
69.3363,-9.7922,1510
34.7359,-9.5097,1511
43.1661,-10.2185,1512
9.1505,-10.3027,1513
14.7922,-9.7477,1514
-5.3359,-10.0127,1515
4.118,-9.8932,1517
5.5158,-9.8831,1518
4.3361,-10.1116,1519
43.8925,-9.7099,1520
-0.2815,-9.4094,1521
0.3232,-10.0472,1522
7.5991,-9.9133,1523
4.05,-9.9278,1524
24.0157,-9.9699,1525
-1.1921,-9.7385,1527
2.4551,-9.9087,1528
0.2763,-9.8566,1529
-0.6034,-9.2308,1530
-3.0212,-9.8647,1531
3.867,-10.2519,1532
24.7016,-9.9052,1533
12.778,-9.2946,1534
2.0691,-9.9488,1535
9.0921,-9.803,1537
5.583,-9.9924,1538
28.2649,-10.153,1539
-2.3206,-10.3926,1540
86.0967,-9.5393,1541
78.4307,-10.1883,1542
26.8144,-10.1052,1543
6.7703,-9.6676,1544
83.2359,-9.9288,1545
26.6852,-10.7163,1546
-0.1823,-9.7232,1548
26.2258,-9.4834,1549
3.1914,-10.2249,1550
6.5377,-9.7992,1551
-0.4152,-9.4818,1552
4.3904,-9.7866,1553
0.5475,-10.1405,1554
10.4425,-10.0833,1555
37.8773,-10.1432,1557
14.8992,-9.7211,1558
-1.4409,-9.9259,1559
2.5223,-9.8276,1560
21.12,-10.3975,1561
36.2849,-9.7184,1562
1.7549,-9.9215,1563
1.0688,-9.8683,1564
-0.0181,-9.8652,1565
2.6618,-9.8709,1566
2.0863,-9.9103,1568
7.7549,-9.9781,1569
0.024,-10.0925,1570
-2.3636,-9.772,1571
1.214,-9.9473,1572
0.8848,-9.8901,1573
18.2245,-10.2425,1576
28.9383,-10.2321,1577
-0.1478,-9.7771,1578
11.5353,-10.2046,1579
1.1767,-10.0962,1580
-5.4645,-10.2419,1581
0.1935,-9.6293,1582
-0.2627,-10.2188,1583
2.2856,-9.5553,1584
2.7008,-9.752,1586
5.9863,-9.8598,1587
0.3488,-9.7954,1588
-0.002,-9.3616,1589
0.212,-9.7435,1590
0.16,-9.9013,1591
-0.1947,-9.8739,1592
11.4422,-9.9222,1593
0.3738,-10.0823,1594
0.2087,-9.8841,1596
-0.0762,-9.9203,1597
2.1709,-9.8841,1598
-0.4361,-9.7134,1599
8.9502,-10.1613,1600
2.8577,-9.8164,1601
10.4026,-9.7727,1602
8.6975,-9.9617,1604
1.1463,-10.0878,1607
3.6533,-8.6255,1608
4.5619,-9.6092,1609
0.1113,-9.6549,1610
13.0891,-9.9352,1611
-0.1688,-9.8754,1612
0.2971,-9.9103,1613
5.7483,-10.0452,1614
9.5519,-9.903,1616
4.1861,-9.92,1617
8.535,-9.9929,1618
-3.8036,-10.1101,1619
0.879,-10.0662,1620
22.6632,-9.8468,1621
1.8778,-9.975,1622
4.8873,-9.9226,1623
15.6686,-9.9159,1624
0.5324,-9.9717,1625
0.6966,-9.8704,1627
0.7503,-10.0968,1628
0.5454,-9.7219,1629
1.1801,-7.7039,1630
-1.161,-9.7662,1631
4.6439,-9.1182,1632
1.856,-9.8792,1633
4.9518,-10.2763,1635
4.1659,-9.9325,1636
42.7871,-9.7329,1637
4.6299,-10.2275,1638
7.2427,-9.9608,1639
-0.2751,-9.7723,1640
7.2726,-9.8463,1641
4.6979,-10.0356,1642
0.8714,-9.8875,1643
0.2463,-9.9941,1644
2.2377,-10.1574,1646
4.6323,-9.7325,1647
21.0473,-9.8221,1648
331.5632,-8.8347,1649
63.2301,-11.0417,1650
106.8705,-11.8063,1651
213.7,-8.9816,1652
23.6047,-10.386,1653
1.2728,-10.1268,1654
-1.1416,-10.196,1656
7.167,-9.9247,1657
-28.1035,-9.7356,1658
63.9861,-9.3789,1659
-14.1942,-9.7103,1660
2.6272,-9.8209,1661
-2.2706,-9.8616,1662
-2.7625,-9.8418,1663
-0.3151,-9.8419,1664
9.6506,-9.8199,1666
0.7805,-9.8363,1667
0.5045,-9.8635,1668
-6.8914,-9.7833,1669
-2.8891,-9.5649,1670
-1.1219,-9.8913,1671
3.0284,-9.9463,1672
-0.5722,-9.8849,1673
-0.0239,-9.8731,1674
-0.3637,-9.8706,1676
0.011,-9.8694,1677
-2.0186,-9.8547,1678
0.8763,-9.8535,1679
-2.1013,-9.85,1680
0.8611,-9.8544,1681
-0.4975,-9.8431,1682
0.94,-9.8579,1683
-2.5567,-9.8249,1684
7.6876,-9.7978,1686
-16.4632,-9.4239,1687
-17.49,-9.0663,1688
83.6908,-9.3809,1689
-0.3471,-9.8463,1690
-1.1766,-9.8726,1691
-1.4634,-9.8799,1692
0.4187,-9.8696,1693
-0.3057,-9.8577,1694
