AYGX_mean,AZ_mean,timestamp
-0.0081,-9.8447,1
-0.0083,-9.8442,2
-0.0087,-9.8443,3
-0.0083,-9.8449,5
-0.0104,-9.8268,6
-0.0219,-9.8578,7
0.0408,-9.8682,8
0.1678,-9.7148,9
-0.0362,-9.8443,10
-0.02,-9.8373,11
-0.0017,-9.8439,12
-0.0385,-9.8335,13
-0.0053,-9.8439,14
-0.0057,-9.8451,15
-0.0056,-9.845,16
-0.0055,-9.8437,17
-0.002,-9.8841,18
-29.4709,-9.4605,19
0.7427,-11.1528,20
2.3589,-9.9462,21
78.6381,-8.0826,22
-44.0556,-9.1264,24
49.025,-9.0358,25
-0.0604,-9.7285,26
1.7041,-9.8886,27
1.276,-9.7788,28
3.5471,-9.7793,29
1.0177,-9.9071,30
0.0884,-9.9245,31
9.8245,-10.084,32
1.0929,-9.8384,34
1.8136,-9.7416,35
2.1616,-10.0353,36
2.2005,-10.3765,37
-2.6109,-9.7549,38
-0.6639,-9.7474,39
-1.295,-9.8844,40
-1.2548,-9.99,41
0.4146,-9.8213,42
2.5516,-9.7659,44
-0.6832,-9.854,45
0.1607,-9.6381,46
-0.1026,-10.3433,47
0.7865,-9.5532,48
1.9541,-9.1562,49
0.2426,-9.7879,50
0.8984,-9.7525,51
0.9515,-10.0249,52
-0.1138,-9.9641,54
-0.0328,-9.8228,55
0.4933,-9.7241,56
-0.4137,-10.1961,57
0.2959,-9.4381,58
0.6987,-9.7092,59
0.3481,-9.4439,61
0.5939,-9.8304,64
-0.68,-9.6715,65
-0.2115,-9.7274,66
1.8783,-9.8449,68
-0.0714,-9.9379,69
-0.6143,-10.0217,71
-0.3196,-9.5605,72
0.0969,-9.6584,73
-0.2418,-9.7454,74
-0.1555,-9.8777,75
-0.1868,-9.7554,76
-0.0769,-10.018,77
-0.0432,-9.6897,78
0.7529,-9.9368,79
0.0908,-9.7309,80
-2.3092,-9.935,81
-0.7937,-9.9116,82
0.5314,-9.6813,84
1.0452,-9.6452,85
0.4311,-10.0076,86
-0.1496,-10.2966,87
0.8565,-9.9957,88
0.4382,-9.8818,89
-0.3063,-9.6138,90
-1.9649,-9.5147,91
2.4217,-9.7775,92
4.4766,-9.7997,93
-0.3559,-8.4998,94
1.5811,-9.386,95
1.0186,-9.4132,96
0.2728,-9.5313,97
-0.6102,-10.1226,98
2.9115,-9.9032,99
0.5032,-9.7852,100
-1.5014,-10.0203,101
1.3898,-9.8746,102
-1.0528,-9.662,103
-1.3964,-9.7188,104
-0.207,-9.8585,105
-0.2063,-9.7364,106
-1.0637,-9.682,107
-0.0351,-9.916,108
-0.1724,-9.785,109
-0.558,-9.9298,110
0.1659,-9.9684,111
-0.0973,-9.8936,112
3.3996,-9.8287,113
-0.6906,-9.935,114
-0.402,-9.8013,115
0.4543,-9.4911,116
2.6389,-10.0209,117
1.4364,-9.8159,118
-1.7626,-9.8135,119
-0.2873,-9.856,120
-1.0105,-9.9166,121
-0.5212,-9.7848,122
-0.2686,-9.8537,123
-0.6743,-9.894,124
0.1911,-9.7862,125
-0.5171,-9.8481,126
0.2812,-9.8531,127
-0.6714,-9.7439,128
-2.2655,-10.0484,129
-2.2158,-9.8837,130
-2.7152,-10.1605,131
-0.105,-9.7462,132
-0.6648,-9.8671,134
-0.056,-9.8623,135
0.5776,-9.7205,136
0.083,-9.8991,138
0.2029,-9.871,139
1.1258,-9.7737,140
-1.166,-9.9378,141
4.8114,-9.8432,142
3.1973,-9.8169,143
2.0935,-9.8834,145
1.884,-9.856,146
0.4941,-9.7626,147
6.8486,-9.8657,148
0.8132,-9.8263,149
-1.578,-9.8437,150
0.7602,-9.8418,151
0.752,-9.9026,152
-1.3481,-9.8433,153
0.1339,-9.8256,155
-0.1446,-9.8265,156
0.0249,-9.8219,157
0.0628,-9.8256,158
-0.0123,-9.8246,159
0.0172,-9.8245,160
0.0806,-9.826,161
0.0142,-9.8244,162
0.0774,-9.8225,163
0.0334,-9.828,165
0.0383,-9.8285,166
0.2153,-9.8318,167
2.1944,-9.801,168
-0.1611,-9.8234,169
3.9308,-9.6242,170
6.0309,-9.8821,171
1.5243,-9.8138,172
5.2657,-9.8413,174
0.661,-9.7844,175
-1.1274,-9.8193,176
1.0124,-7.1409,177
-0.2682,-10.0633,178
0.4583,-9.8329,179
0.4986,-9.9955,180
0.1114,-9.805,181
0.4018,-9.8897,182
0.1242,-9.7901,184
0.3317,-9.8332,185
0.6338,-9.9081,186
4.9004,-9.7901,187
0.7111,-9.8496,188
-0.5411,-9.7148,189
-3.594,-9.75,190
0.0217,-10.2899,191
1.9314,-9.872,192
-0.3307,-9.8285,194
-1.0784,-9.8653,195
-0.4122,-9.856,196
1.1682,-9.7537,197
1.5968,-9.8197,198
4.559,-9.8224,199
-0.1538,-9.7941,200
-0.3957,-9.7146,201
0.1846,-9.8327,202
0.7111,-9.8426,204
-0.5086,-9.8309,205
0.7549,-9.8002,206
-0.3874,-9.7951,207
0.284,-9.9595,208
-0.3312,-9.8705,209
-0.091,-9.8822,210
-0.8906,-9.9085,211
-0.0308,-9.9344,212
-0.5934,-9.8258,214
-1.4574,-9.8033,215
-0.7748,-9.7839,216
-0.2859,-9.7803,218
-0.1464,-9.865,219
-0.2126,-9.7719,220
-2.147,-9.8175,221
-0.5172,-9.8391,222
0.4802,-9.8769,224
-0.3149,-9.8317,225
-0.0038,-9.8345,226
0.0341,-9.8255,227
3.5539,-9.8571,228
0.8442,-9.8059,229
-0.3658,-9.9092,230
-0.1292,-10.1549,231
-0.4878,-9.8149,232
-0.1447,-9.7296,234
0.4415,-9.8155,235
-0.2745,-9.9073,236
1.091,-9.6853,237
-0.1975,-9.8288,238
0.2248,-9.8745,239
3.3379,-9.7751,240
-0.6846,-9.9068,241
-0.3334,-9.8172,242
0.5638,-9.8994,244
0.4934,-9.8588,245
-9.0749,-9.7792,246
-2.5158,-9.6056,247
2.7958,-9.7995,248
-1.1208,-9.7642,249
-1.1102,-9.777,250
-2.359,-9.7778,251
-0.5554,-9.7333,252
-0.3231,-9.7277,254
4.3613,-9.698,255
-0.9772,-9.7871,256
5.0514,-9.7693,257
0.8341,-9.802,258
1.1055,-9.7649,259
2.0683,-9.7739,260
0.4193,-9.8048,261
0.0253,-9.7995,262
0.0204,-9.8012,263
0.0321,-9.7989,265
0.1193,-9.799,266
0.201,-9.8033,267
-0.3296,-9.791,268
0.1013,-9.8014,269
-0.0177,-9.8004,270
0.0975,-9.7999,271
-0.0135,-9.7991,272
0.0481,-9.7991,274
0.0436,-9.7996,275
0.0139,-9.8006,276
0.0721,-9.7997,277
0.0012,-9.7998,278
0.0312,-9.7976,279
0.0604,-9.7993,280
0.2398,-9.7792,281
3.757,-9.8184,282
1.8869,-9.7926,283
0.8053,-9.7767,284
1.5254,-9.7856,285
-0.2229,-9.7902,287
-0.0701,-9.7941,288
0.3285,-9.7947,289
-0.0482,-9.7936,290
0.022,-9.7936,291
0.078,-9.7944,292
0.0042,-9.795,294
0.0492,-9.7957,295
0.0112,-9.7948,296
0.0077,-9.7929,297
-0.0029,-9.7961,298
0.0716,-9.7941,299
-0.0449,-9.793,300
0.1137,-9.7935,301
-0.0349,-9.7973,302
-0.0114,-9.7945,303
-1.5225,-9.7737,304
1.4662,-9.7709,305
1.0082,-9.8238,306
0.1443,-9.7549,307
3.3233,-9.7665,308
0.5302,-9.8638,309
0.7889,-9.8313,310
2.1572,-9.9434,311
0.2425,-9.8941,312
-0.9188,-9.8688,314
-0.208,-9.7706,315
-0.056,-9.8338,316
3.8686,-9.8864,317
0.1022,-9.8503,318
-1.7721,-9.2593,319
-0.9275,-10.2977,320
0.0096,-9.9055,321
-1.8687,-9.7958,322
-1.2987,-9.6596,324
0.0317,-9.6463,325
-0.5728,-9.5831,326
1.1371,-9.6229,328
-0.4865,-9.8438,329
2.4004,-9.8725,330
0.3623,-9.6095,331
-2.3436,-10.6242,332
2.1506,-9.8463,334
-0.3523,-9.7642,335
-0.6753,-9.7981,336
-0.6406,-9.7283,337
-0.9777,-9.8239,338
0.222,-9.1246,339
-1.8516,-10.1842,340
-1.2208,-9.7868,341
0.3635,-9.8468,342
0.9222,-9.9527,344
-0.3532,-9.8593,345
1.0112,-9.7571,346
-2.0335,-9.6684,347
0.0463,-10.0543,348
-0.945,-9.8597,349
-1.4289,-9.2423,350
-0.3203,-9.3471,351
-2.0563,-9.9411,352
-0.6001,-10.2073,354
1.3346,-9.6325,355
-0.4019,-9.6895,356
-0.9483,-9.7058,358
-0.1895,-9.9557,359
-0.5768,-10.0573,360
-0.6507,-9.7914,361
1.0875,-9.618,362
-0.9806,-9.7847,364
-0.1313,-9.8121,365
0.4947,-9.7792,366
0.5775,-9.8101,367
1.3806,-9.7949,368
0.1135,-9.7387,369
3.5326,-9.9455,370
-0.7174,-9.7909,371
-0.3707,-10.0186,372
-0.8568,-9.8198,374
0.9262,-9.8347,375
-1.0171,-9.9629,376
0.0894,-9.7735,377
-0.4529,-9.8177,379
0.9808,-9.6432,380
0.1604,-9.9651,381
1.0388,-9.7294,382
-1.5554,-9.6687,384
-0.2105,-9.8505,385
-1.5919,-9.5807,387
-2.614,-9.7051,388
4.6612,-10.03,389
-1.057,-9.9442,390
-3.8391,-9.7838,391
-0.9424,-9.8756,392
-3.7295,-9.7131,393
-0.365,-9.5125,394
2.3674,-9.8903,395
-0.5531,-9.8193,396
-1.3456,-9.8934,397
1.4887,-9.7486,398
-1.3603,-9.8066,399
-0.5994,-10.405,400
-1.0136,-9.6821,401
0.4836,-9.8094,402
-1.7102,-10.0291,403
3.3817,-9.9545,404
-1.4686,-9.7193,405
0.7216,-9.7947,406
0.3151,-9.8708,407
-0.8519,-9.6935,408
-1.9455,-9.831,409
0.8035,-10.2161,410
-4.8657,-9.6374,411
-1.547,-9.833,412
2.1077,-9.5525,413
-5.885,-9.3117,414
-0.1605,-9.1703,415
-1.0019,-9.6708,416
-4.2222,-9.4642,417
-5.505,-9.745,418
0.5205,-9.7134,419
-0.1528,-9.8069,420
-0.7703,-10.0143,421
1.2948,-9.8221,422
0.7537,-8.9902,423
2.0256,-9.62,425
0.6113,-9.6514,426
-1.4905,-10.0252,427
-0.3649,-9.8521,428
1.8449,-10.0769,429
-0.8078,-10.0614,430
-0.6086,-9.9274,431
0.5982,-9.654,432
-0.4161,-9.7023,433
0.6369,-9.8644,434
-0.1872,-9.7029,435
-0.8561,-9.837,436
0.4413,-9.8692,437
0.1561,-9.7411,438
-1.3729,-9.8203,439
-1.2229,-9.8779,440
-0.0988,-9.8898,441
0.0345,-9.9476,442
-0.2693,-9.8616,443
-0.4884,-9.8657,445
0.0543,-9.9289,446
0.1184,-9.7193,447
-0.4266,-9.889,448
-0.5016,-9.7511,449
-0.6408,-9.7043,450
1.3187,-9.6776,451
0.1691,-9.951,452
0.0071,-9.8675,453
-0.3043,-9.849,455
0.6259,-10.0471,456
0.1869,-9.9164,457
0.4711,-9.8428,459
-0.2173,-9.9575,460
-0.3314,-8.4624,461
0.3215,-9.8468,462
-0.1604,-9.882,463
0.2599,-9.6906,465
-0.9713,-9.8534,466
0.0005,-10.0969,467
1.4819,-10.4452,468
-0.0809,-9.5851,469
-0.1597,-10.1512,470
-0.3263,-9.2129,471
-0.3442,-9.6087,472
-0.373,-9.823,473
0.3573,-9.9162,475
0.2118,-9.7221,476
6.0633,-10.0554,477
-0.084,-9.5597,478
9.4207,-8.0064,479
0.5824,-8.7114,480
0.0285,-9.9007,481
-0.0896,-9.9067,482
0.2759,-9.8293,483
2.4152,-9.8364,485
1.8621,-9.8987,486
1.2906,-9.538,487
0.0711,-9.9031,488
-0.7543,-9.7318,489
1.0639,-9.7323,490
-0.2876,-9.8681,491
2.5617,-9.7855,492
0.0496,-9.8954,494
1.5365,-9.8149,495
1.0083,-10.0125,496
0.2417,-9.9097,497
4.518,-9.9874,498
0.475,-10.0723,499
-1.234,-9.6088,500
0.3018,-9.7321,501
2.2556,-9.6894,502
-0.7864,-9.7695,504
0.4811,-9.7585,505
0.0799,-9.7978,506
2.312,-9.7973,507
-0.1346,-9.6754,508
0.5606,-9.8197,509
-0.0103,-9.8074,510
-1.0194,-9.7782,511
-0.0018,-9.9059,512
1.8372,-10.0249,514
-0.105,-9.8576,515
0.631,-9.8412,516
3.2181,-9.8863,517
-0.2284,-9.8775,518
2.3571,-9.7573,519
0.3023,-9.9218,520
-0.3703,-9.8185,521
0.3577,-9.8343,522
-0.4009,-10.0282,524
-0.9501,-8.6778,525
-0.3792,-9.9933,526
1.1096,-9.7939,528
1.098,-9.5936,529
-0.68,-9.9278,530
-0.4381,-9.8141,531
0.1836,-9.8225,532
0.2689,-9.7626,534
1.0727,-9.7348,535
0.7454,-9.9687,536
0.9703,-9.9031,537
0.1567,-10.0305,538
-0.2149,-9.8705,539
0.5734,-9.4075,540
1.8774,-9.5329,541
0.0979,-9.1547,542
0.5715,-9.9309,544
0.4827,-9.4392,545
0.3609,-9.9975,546
-0.0472,-9.5059,547
0.0664,-9.4024,548
-0.7931,-9.9553,549
-0.2291,-10.0731,550
-0.0046,-10.6156,551
-0.775,-9.2321,552
-0.4876,-9.4405,553
-0.0722,-9.6526,554
0.2447,-9.7321,555
-0.1019,-9.5707,556
-0.5061,-9.9091,557
-0.6422,-10.1097,558
0.9299,-10.4527,559
-0.4161,-9.9265,560
-0.153,-9.8732,561
0.7315,-9.68,562
-0.2978,-9.888,564
0.5324,-9.8625,565
0.1663,-10.0749,566
0.2664,-9.2347,567
0.1214,-9.6867,568
1.0048,-8.0101,569
-0.8065,-10.07,570
-0.0298,-9.7262,571
-0.027,-9.9188,572
0.0002,-9.8815,574
-2.8222,-9.8176,575
-1.1215,-9.8384,576
0.6301,-9.8909,578
-3.1346,-9.8209,579
0.9426,-9.8069,581
-0.1862,-9.8122,582
2.4196,-9.837,583
1.5296,-9.909,584
7.0833,-10.0737,585
1.616,-9.8147,586
0.2392,-9.9176,587
-0.1036,-9.7462,589
0.0133,-9.8344,590
0.366,-9.8564,591
0.1336,-8.729,592
-0.3352,-9.6043,593
1.9738,-9.8533,594
-0.0599,-9.8925,595
1.7904,-9.5941,596
