AYGX_mean,AZ_mean,timestamp
19.5464,-9.7933,1071
6.1962,-9.648,1073
3.2642,-9.54,1074
10.0038,-9.7576,1075
2.3579,-9.3237,1076
-6.0326,-9.5144,1077
1.093,-10.0015,1078
9.7733,-10.2535,1079
-58.1976,-9.3915,1080
122.424,-9.2578,1081
10.9146,-9.7647,1083
1.1801,-9.7731,1084
5.8567,-9.8198,1085
0.3892,-9.6495,1086
6.0933,-9.9211,1088
-1.8808,-9.8799,1089
-1.768,-10.0641,1090
-5.2484,-9.4652,1091
