AYGX_mean,AZ_mean,timestamp
0.0583,-9.8083,547
0.1098,-9.8777,548
0.0155,-9.811,549
0.2156,-9.9399,550
0.5189,-9.8112,551
0.7272,-9.7978,552
-15.3449,-9.602,553
-7.7281,-9.6214,555
8.7468,-9.3691,556
-49.9388,-8.3888,557
22.6924,-9.5875,558
-9.0789,-9.2557,559
17.1905,-9.6752,561
-12.4312,-9.6832,562
0.0537,-9.4548,563
1.3697,-9.4998,564
1.4285,-9.5175,565
1.3099,-9.515,566
1.3235,-9.515,567
