AYGX_mean,AZ_mean,timestamp
-1.4469,-9.8527,597
-0.1611,-9.8696,598
-2.5473,-9.8664,599
-0.7991,-9.7954,600
0.3029,-9.7785,602
0.2421,-9.7329,603
-0.3773,-9.626,604
1.0997,-9.8973,606
-0.02,-9.9988,607
0.7587,-9.9072,608
0.7737,-9.9034,609
-0.2534,-9.9535,610
0.7429,-9.986,612
5.2497,-10.1674,613
2.185,-10.439,614
42.7764,-10.6241,615
