AYGX_mean,AZ_mean,timestamp
-0.2016,-9.9487,4707
-0.8503,-9.892,4708
0.5496,-9.7924,4709
1.5925,-9.901,4710
0.181,-9.9738,4711
1.4022,-9.8138,4713
-0.1343,-9.9071,4715
2.0015,-9.794,4716
1.5423,-9.8247,4717
-1.6217,-9.7169,4718
6.2811,-9.5604,4719
2.1302,-9.4971,4720
2.5011,-9.8384,4721
0.838,-9.8113,4722
1.3666,-9.7531,4723
1.1548,-9.8211,4724
-8.618,-9.7762,4725
-81.4975,-9.2195,4726
