AYGX_mean,AZ_mean,timestamp
0.0909,-9.7243,0
0.0928,-9.7242,1
-11.1777,-9.587,2
-3.5256,-9.3506,3
6.6417,-9.6317,4
-6.1396,-9.6164,5
0.2605,-9.6518,6
-0.1686,-9.6607,7
-0.6566,-9.6589,8
-0.3932,-9.6596,9
-0.3313,-9.6641,10
-2.0017,-9.6742,11
2.6646,-9.7234,12
1.4732,-9.7353,13
-0.6865,-9.6732,14
-6.6891,-9.6822,15
2.9797,-9.6617,16
4.2304,-9.7124,17
-1.1019,-9.6865,18
0.1491,-9.7801,19
-7.846,-9.6091,20
-1.6745,-9.6031,21
8.6748,-9.5871,22
0.5512,-9.6711,23
-1.3342,-9.5628,39
2.6312,-8.1294,40
-1.0122,-9.3781,41
-0.2784,-9.4809,42
-1.5502,-9.7143,43
-1.8863,-9.329,44
0.0984,-9.5976,45
-0.4176,-9.4459,46
2.7822,-7.4148,47
-5.7393,-6.599,48
-2.167,-9.6747,49
0.6059,-9.7589,50
-3.1528,-9.8545,51
6.2372,-9.6273,52
0.251,-9.8526,53
3.2173,-9.828,54
-2.7321,-9.5565,55
2.8352,-9.8196,56
0.5091,-9.5373,57
0.0831,-9.5845,58
4.0515,-9.6186,59
2.0099,-9.8884,60
-0.7864,-9.8193,61
-0.318,-9.8784,62
-0.4014,-10.0112,63
0.7654,-9.5889,64
6.701,-9.9484,65
0.3107,-9.7318,66
0.1788,-9.7426,67
0.0808,-9.6955,68
-0.0939,-9.7177,69
-0.4908,-9.6854,70
-0.0235,-9.6945,72
-0.0503,-9.699,73
0.0202,-9.7001,74
-0.007,-9.7009,75
-0.0145,-9.7043,76
-1.5897,-9.7082,77
0.2226,-9.7151,78
-0.0974,-9.6946,79
-0.331,-9.6937,80
-0.0495,-9.7005,82
-0.4681,-9.6953,83
0.1833,-9.6976,84
-6.4363,-9.5944,85
5.1792,-9.6113,86
-0.5156,-9.6789,87
-0.2118,-9.6907,88
0.4927,-9.6847,89
0.268,-9.6575,90
0.5842,-9.7357,91
-0.2461,-9.7056,92
-0.3067,-9.6976,93
-1.1786,-9.6118,95
-0.914,-9.7145,96
0.8393,-9.6106,97
1.9839,-9.5824,98
-1.6581,-9.4903,99
2.0502,-9.6282,100
5.8823,-9.5418,102
5.9228,-9.5461,103
-4.8914,-9.8988,104
-0.9956,-9.8817,105
-2.7148,-9.7192,106
0.8861,-10.0279,107
3.3754,-9.5931,108
-0.5682,-9.7741,109
1.9522,-9.6728,110
1.784,-9.9232,112
-0.4074,-9.2853,113
0.8524,-8.8662,114
-0.3686,-9.8751,115
0.9887,-9.5918,116
1.6541,-9.1054,117
-0.4464,-9.6735,118
0.3603,-9.7564,119
0.2073,-10.2473,120
-1.7415,-10.19,122
-1.0179,-9.7565,123
4.2552,-8.8864,124
-1.9868,-9.5653,125
1.715,-9.7969,126
-0.2541,-10.1743,127
-0.4492,-9.4869,128
-1.7272,-9.366,129
0.5577,-9.8853,130
-2.3768,-9.9568,132
-1.0725,-9.8225,133
-0.168,-9.6208,134
7.4525,-9.998,135
-1.2916,-9.9473,137
-1.2823,-9.6967,138
-1.9106,-10.1725,139
2.6958,-9.6604,140
-2.2828,-9.4347,141
-0.6016,-9.2154,142
-1.1427,-9.8125,143
0.3512,-9.8669,144
12.4696,-7.8534,145
-1.0837,-9.6196,146
9.4668,-9.4901,147
0.318,-9.1979,148
-2.7154,-9.8891,149
-0.8188,-9.6837,150
-0.5246,-9.6391,152
18.531,-9.9969,153
-0.1741,-9.7834,154
0.007,-9.4822,155
-0.6828,-9.3899,156
-2.1928,-9.7441,157
-0.8677,-9.8491,158
2.306,-9.7107,159
0.419,-9.8743,160
0.5808,-9.5811,162
0.5192,-9.7243,163
-0.0798,-9.8948,164
0.3743,-9.7422,165
1.9228,-9.7736,166
-1.4476,-9.7394,167
0.8685,-9.7333,168
2.459,-9.6729,170
1.7831,-9.8452,171
1.5371,-9.5579,172
-1.325,-9.8456,173
-1.6026,-9.9697,174
6.5502,-9.8049,175
-1.1141,-7.8582,177
0.5744,-9.6358,178
2.6126,-8.4879,179
-1.7765,-9.7247,180
-0.8096,-9.6858,181
-0.3255,-9.8453,182
-0.6555,-9.6492,183
-0.5801,-9.6428,184
-3.0989,-9.5234,185
2.4818,-9.8933,187
2.7143,-9.725,188
-0.8807,-9.7103,189
-5.2779,-9.879,190
-0.9702,-9.7237,191
0.6856,-9.5202,192
-4.3904,-9.8547,193
2.7975,-9.9011,194
-1.6976,-9.6741,195
27.1805,-9.3112,197
3.3386,-9.7172,198
1.3419,-9.4054,199
1.1743,-9.3218,200
3.7414,-9.4034,201
-3.4155,-9.7812,202
-1.4608,-7.8376,203
20.0282,-9.7371,204
4.9411,-9.3821,205
2.5753,-9.4998,207
-0.5414,-9.7003,208
4.6523,-9.8499,209
5.3261,-9.9299,210
-0.5645,-9.0223,212
2.5476,-7.9664,213
-1.0443,-9.8412,214
0.3385,-9.823,215
0.6355,-10.1293,216
-0.6971,-8.3104,217
0.3372,-8.3574,218
0.4525,-9.2534,219
0.1234,-9.7529,220
-0.4518,-7.4193,221
0.5834,-9.3206,222
-0.2712,-9.4783,223
-0.3305,-9.7495,224
-0.4241,-9.5602,225
-2.1576,-9.6688,226
-0.2442,-9.5872,227
-0.3142,-9.7458,228
7.1238,-9.9376,229
1.333,-9.3746,230
0.4004,-9.7803,232
2.1965,-9.7992,233
1.2527,-9.7169,234
-0.5413,-9.7187,235
2.474,-9.8457,237
4.6545,-9.7278,238
6.2196,-9.9364,239
14.2084,-9.5664,240
6.1896,-10.5419,241
1.0594,-10.003,242
52.994,-10.248,243
1.6437,-8.7868,244
-10.5686,-6.065,245
0.2183,-9.5232,247
5.477,-9.7739,248
10.5755,-10.3775,249
-2.5299,-9.6751,250
0.1249,-9.8001,251
-0.3251,-9.7091,252
2.9551,-9.6342,253
3.1117,-9.7401,254
-0.9338,-10.4276,255
-3.0115,-9.6741,257
-1.6126,-9.7221,258
-4.1099,-9.8548,259
2.2382,-9.6128,260
9.5186,-9.7653,261
4.3819,-9.8713,262
2.7144,-9.9488,263
19.7046,-9.1398,264
-2.1893,-10.3151,265
-0.9749,-9.9709,267
-2.0087,-9.6934,268
-3.349,-9.4848,269
12.0522,-9.953,270
-3.5564,-9.1458,271
1.3113,-10.3028,272
-1.4389,-9.6177,273
-1.3091,-9.7075,274
9.6745,-9.8944,275
0.8993,-9.7974,277
0.0982,-9.756,278
1.5806,-9.6835,279
-5.2844,-9.6276,280
-3.2655,-9.5454,281
24.7362,-8.3247,282
-17.7007,-9.3736,283
0.1542,-7.7474,284
-3.0058,-9.2629,286
0.688,-9.9131,287
1.3291,-8.9443,288
-4.9589,-7.7563,289
-3.8767,-9.8074,290
-1.6658,-9.8129,291
-2.9124,-9.9335,292
-0.9405,-9.924,293
1.9656,-9.263,294
-2.4303,-9.7042,295
-0.322,-9.7746,296
-2.3793,-9.676,298
1.064,-9.8489,299
1.0116,-9.8688,300
-0.5117,-9.9498,301
2.3056,-9.886,302
2.4118,-9.8534,303
-0.2524,-9.8342,304
0.0365,-9.9616,305
3.6687,-9.7949,307
5.045,-9.5889,308
2.975,-9.551,309
-25.6081,-9.5205,310
6.4936,-6.4751,311
2.3777,-10.0649,312
1.0851,-9.8172,313
0.7868,-9.6451,314
4.1614,-9.6603,315
3.679,-8.6629,317
0.19,-9.8201,318
0.3761,-9.7723,319
-0.0343,-9.7412,320
0.6523,-9.7559,321
-0.6196,-9.7568,323
-0.338,-9.7169,324
-0.5472,-9.7224,325
-4.0294,-9.6625,326
7.5675,-9.6593,327
-0.2092,-9.7359,328
-1.8951,-9.7176,329
1.4324,-9.5576,330
1.1112,-9.6081,332
0.9281,-9.7177,333
-6.5049,-9.5728,334
4.243,-9.9033,335
-0.5923,-9.8835,336
18.8144,-10.0405,337
0.4992,-9.8855,338
3.054,-9.2158,339
0.4447,-9.4333,340
-6.2983,-7.4078,342
-1.4225,-9.6901,343
-0.4472,-9.8056,344
-2.8087,-9.8353,345
-1.0338,-9.992,346
1.0458,-9.9573,347
0.9814,-9.6481,348
11.2897,-9.3055,349
-1.3128,-9.8177,350
1.208,-3.11,352
8.0749,-9.2605,353
-0.9736,-9.6159,354
-0.1857,-10.1154,355
0.2379,-9.9926,356
1.4553,-9.4769,357
0.5769,-9.7685,358
-0.0947,-9.5007,359
-1.6593,-9.5615,361
5.5497,-9.8758,362
-0.0878,-9.3179,363
0.8459,-9.5939,364
-0.6385,-9.7115,365
-0.3951,-9.7471,366
-0.123,-9.7335,367
-0.0861,-9.7358,368
-0.1388,-9.7362,369
-0.2575,-9.7349,370
-0.1565,-9.7388,371
-0.2368,-9.7361,372
-0.1938,-9.7363,373
-0.8144,-9.6899,374
-0.5078,-9.7282,375
0.6026,-9.7171,377
1.064,-9.2421,378
0.863,-9.4809,379
5.4575,-9.7324,380
-1.345,-2.3553,381
54.0386,-9.2847,382
1.7097,-7.8497,383
4.2862,-9.548,384
-0.4017,-9.856,385
0.2701,-9.2455,387
2.1165,-9.8574,388
-0.3373,-9.7294,389
-3.5241,-9.7991,390
1.2986,-9.4902,391
-1.2534,-10.1966,392
6.1949,-9.9028,393
-15.5837,-6.9402,394
0.9431,-9.1946,395
1.0629,-9.5022,397
-0.9572,-9.4673,398
-1.2548,-9.7426,399
0.6936,-9.7705,400
-0.1083,-9.688,402
2.1016,-9.0273,403
1.2053,-9.8353,404
2.2055,-9.6693,405
2.381,-9.8657,407
5.1548,-9.6746,408
1.4087,-9.8703,409
10.1261,-9.6593,410
6.0313,-8.3579,412
0.465,-9.7065,414
2.0635,-10.1145,415
-1.7366,-10.1273,417
3.7906,-9.6827,418
-1.1401,-9.1672,419
-0.0704,-9.3357,420
-0.2134,-9.9023,421
0.2116,-10.2313,422
9.3283,-9.4702,423
-0.8537,-9.5011,424
0.0121,-10.1172,425
1.1369,-9.6038,427
-0.5539,-9.7077,428
-0.9265,-9.7712,429
-0.2045,-9.9559,430
-0.8328,-9.3748,431
-0.6501,-9.707,432
-0.9162,-10.1737,433
8.9859,-7.1051,434
-3.714,-9.5175,436
1.7498,-9.9386,437
-2.9761,-10.0038,438
-1.8559,-9.7057,439
-0.8718,-9.9068,440
0.0614,-9.9621,441
-0.4117,-9.9021,442
0.5924,-9.8667,443
-0.1746,-9.6612,444
3.4644,-9.7604,445
-0.2585,-9.648,446
-0.3051,-8.6324,448
-0.535,-9.7673,449
1.3658,-9.6797,450
0.8696,-9.6866,451
-2.5166,-8.2459,452
8.9181,-9.5745,453
-1.0429,-9.7911,454
1.2368,-9.7733,455
4.0273,-9.3662,457
-0.0878,-9.6728,458
5.1129,-9.3163,459
3.5171,-9.4074,460
3.7728,-9.6773,461
-3.7506,-9.2995,462
-1.5428,-10.4927,463
-1.5912,-8.8007,464
2.8583,-9.1651,465
-1.1456,-8.9324,467
-2.2525,-9.2587,468
1.2157,-9.8852,469
-0.2448,-8.9514,470
-0.9507,-9.4011,472
-2.5091,-9.4511,473
-1.8619,-9.7409,474
0.5245,-9.7116,475
-2.8521,-8.6701,477
-0.672,-9.6366,478
-0.7583,-9.332,479
-0.8938,-9.7843,481
0.1039,-9.7047,482
0.477,-9.5813,483
2.7568,-9.8645,484
-0.2286,-9.8097,485
-2.173,-9.6122,487
-2.8682,-9.7696,488
-6.632,-9.4362,489
-1.3733,-9.0089,490
1.3592,-9.2091,491
5.9265,-7.8888,492
-1.5024,-8.638,493
6.24,-9.2962,494
8.3428,-9.8608,495
12.3825,-8.2008,497
4.7602,-9.5093,498
-4.6866,-7.4015,499
-5.6886,-9.8682,500
-1.075,-9.7274,501
-3.0352,-9.9735,502
-0.4743,-10.072,503
1.4233,-9.6843,504
0.1617,-9.7568,505
-0.1409,-9.7,507
3.0236,-9.7583,508
3.6569,-9.9301,510
0.4508,-9.4941,511
-0.0481,-10.0405,512
-1.0195,-9.6561,513
2.7739,-9.7473,514
0.445,-9.3439,515
7.0897,-9.091,516
0.4279,-9.8557,517
-4.1096,-9.6696,518
2.1594,-9.7042,519
0.5674,-9.5996,520
1.5342,-9.6825,521
6.1583,-9.5793,522
-2.7752,-9.5293,523
17.2803,-9.8444,524
-1.435,-9.8087,525
2.6943,-9.8053,527
-1.244,-9.6856,528
4.6825,-9.6623,529
0.3327,-9.7527,530
-0.6969,-9.747,531
0.675,-9.7295,533
-5.1738,-9.7115,534
-0.4062,-9.7664,535
-6.2898,-9.6236,536
1.6695,-9.7248,537
-2.7675,-9.6593,538
0.1252,-9.7384,539
-12.8271,-9.6482,541
-1.0027,-9.5009,542
-1.0579,-9.5008,543
-1.0642,-9.5012,544
-1.0644,-9.5005,545
-1.0555,-9.5011,547
-1.0691,-9.5012,548
-1.0548,-9.5008,549
-1.0641,-9.5013,550
-1.0725,-9.5008,551
-1.07,-9.5014,552
-1.0734,-9.5002,553
-1.0813,-9.501,554
-1.0733,-9.5004,555
-1.0799,-9.5019,557
-1.0639,-9.5016,558
-1.0548,-9.5016,559
-1.0703,-9.5003,560
-1.066,-9.5,561
-1.0675,-9.5021,562
-1.0724,-9.4992,563
-1.0757,-9.5015,564
-1.098,-9.5023,565
-1.0811,-9.5008,567
-1.0713,-9.5016,568
-1.0763,-9.5013,569
-1.0913,-9.5011,570
-1.0928,-9.4992,571
-1.0815,-9.5005,572
-1.1004,-9.4999,573
-1.0712,-9.5015,574
-1.0914,-9.5007,575
-1.0698,-9.5005,577
-1.0829,-9.5001,578
-1.093,-9.5004,579
-1.0646,-9.5006,580
-1.0707,-9.5015,581
-1.0672,-9.5,582
-1.0686,-9.5025,583
-1.069,-9.5007,585
-1.0783,-9.5003,586
-1.0666,-9.5006,587
-1.0763,-9.4992,588
-1.0882,-9.5012,589
-1.0725,-9.5007,590
-1.0626,-9.5002,591
-1.0737,-9.5005,592
-1.0757,-9.5011,593
-1.0735,-9.5004,594
-1.0733,-9.5015,595
-1.0629,-9.5019,597
-1.1067,-9.4995,598
-1.0907,-9.5016,599
-1.0837,-9.5002,600
-1.0792,-9.4961,601
-1.1276,-9.5041,602
-1.0728,-9.5001,603
-1.0729,-9.5,604
-1.0889,-9.4996,605
-1.0841,-9.5001,607
-1.0832,-9.4999,608
-1.0771,-9.4996,609
-0.3026,-9.7015,2282
-0.3047,-9.7012,2283
-0.3053,-9.7001,2284
-0.3271,-9.6994,2286
-0.2996,-9.6991,2287
2.5591,-9.6992,2288
-20.0562,-9.5401,2289
16.8317,-9.5825,2290
0.4227,-9.7272,2291
0.5842,-9.7255,2292
-0.7681,-9.7235,2293
-4.5561,-9.6917,2294
1.4852,-9.6495,2295
1.6175,-9.6679,2296
-1.9456,-9.6718,2297
4.0954,-9.6413,2298
0.6183,-9.7084,2299
0.7571,-9.6828,2300
0.4322,-9.7445,2301
-0.931,-9.708,2302
5.4483,-9.6533,2303
0.7985,-9.6884,2304
-0.4425,-9.7058,2305
-19.5717,-9.565,2306
8.7749,-9.5513,2307
5.9786,-9.5845,2308
-14.4119,-9.5371,2309
-1.7048,-9.6066,2310
-12.9633,-9.6399,2311
8.0196,-9.6261,2312
-23.0368,-9.4659,2313
26.9994,-9.2441,2315
-0.0057,-9.6801,2316
-2.5443,-9.6737,2317
-2.3025,-9.6794,2318
3.0853,-9.9481,2319
-1.6665,-9.615,2320
-1.7932,-9.6151,2321
1.275,-9.8558,2322
-0.5863,-9.9238,2323
-4.365,-9.8997,2325
1.741,-9.8119,2326
0.3714,-9.8792,2327
0.0164,-9.7167,2328
1.7247,-9.7222,2329
2.7558,-9.7452,2330
-0.6848,-9.7205,2331
-0.2123,-9.7806,2332
-0.0348,-9.8155,2333
1.6039,-9.9604,2334
2.665,-10.1259,2336
-0.2113,-8.854,2337
1.1485,-8.5544,2338
-0.5775,-9.2213,2339
-1.8992,-9.0181,2340
0.1974,-9.6903,2341
-0.8905,-9.4731,2342
1.6285,-9.2408,2343
9.3142,-10.894,2344
1.5231,-10.9105,2345
2.2906,-9.735,2346
0.8457,-9.8909,2347
-3.7409,-9.7469,2348
-4.9826,-9.6738,2349
1.3264,-9.8393,2350
-2.2745,-9.2952,2351
0.4944,-9.6803,2352
5.2701,-9.3182,2353
-1.9993,-9.2945,2354
1.2821,-9.7485,2356
0.146,-9.7305,2357
2.7065,-9.8599,2358
0.5867,-9.9153,2359
12.5536,-9.982,2360
6.6351,-9.278,2361
-2.3931,-9.3218,2362
1.9242,-9.6113,2363
-4.9443,-10.1534,2364
-1.3825,-9.4521,2366
3.9795,-9.7669,2367
1.5663,-9.8501,2368
-0.3746,-9.8098,2369
-6.6157,-9.4612,2370
1.0802,-9.566,2371
-2.6881,-9.3558,2372
0.334,-9.6012,2373
-0.0272,-9.8866,2374
0.561,-9.7056,2376
2.6831,-9.718,2377
3.1368,-9.6318,2378
-2.1638,-9.6501,2379
0.443,-9.7582,2380
1.0523,-9.9688,2381
2.7584,-9.8,2382
2.351,-9.7977,2383
3.2523,-6.8578,2384
2.2625,-7.5746,2386
6.2332,-9.6841,2387
-1.7256,-9.8332,2388
-3.0933,-9.1051,2389
1.4617,-9.0768,2390
-0.9589,-9.6387,2391
-2.7341,-9.3582,2392
-0.3163,-8.9219,2393
-0.7109,-9.2837,2394
0.9265,-10.0036,2396
0.2659,-9.789,2397
-1.5428,-9.8246,2398
0.2667,-9.8255,2399
1.4185,-10.186,2400
7.86,-10.2131,2401
4.3777,-9.7019,2402
0.1346,-10.1178,2403
6.4758,-8.9324,2406
0.7129,-10.0194,2407
0.1345,-9.7277,2408
0.3651,-9.863,2409
0.1329,-10.0565,2410
0.1565,-9.5055,2411
-0.335,-9.496,2412
0.1527,-7.4528,2413
0.3743,-9.6297,2414
0.2985,-9.6971,2415
-0.1943,-9.7346,2417
-0.4388,-9.7324,2418
0.2998,-9.7294,2419
-0.8883,-9.5941,2420
-1.2307,-9.4782,2421
-4.4934,-9.5882,2422
19.5989,-9.3852,2423
-11.5707,-9.7836,2424
0.7039,-9.7468,2426
-2.6259,-9.6981,2427
-1.7115,-9.6909,2428
5.7419,-9.6562,2430
21.581,-9.7588,2431
9.7791,-9.4413,2432
16.4859,-9.8929,2433
8.1403,-8.8458,2434
0.7398,-9.6708,2436
0.0093,-9.7773,2437
-0.5809,-9.6837,2438
-2.0647,-10.0098,2439
0.1067,-9.9161,2440
32.0948,-10.8264,2441
14.8571,-9.6574,2442
2.5407,-9.7093,2443
3.2489,-9.6638,2445
2.7013,-9.8301,2446
-1.0896,-9.89,2447
-0.0583,-9.6051,2448
-0.4998,-9.688,2449
1.0412,-9.7688,2450
0.2986,-9.6228,2451
-2.4393,-9.7383,2452
-0.4042,-9.733,2453
1.1389,-9.8744,2454
0.6766,-9.9019,2456
0.7604,-9.8021,2457
5.3979,-9.3901,2458
21.1973,-9.7902,2459
-1.7938,-9.4769,2460
-6.2853,-9.14,2461
18.7618,-10.3526,2462
-0.9135,-7.8802,2463
-2.8237,-10.3294,2464
-1.2102,-9.9086,2466
1.0532,-9.634,2467
0.5219,-9.9172,2468
1.1465,-10.3041,2469
-1.3637,-9.3653,2470
-0.5534,-9.8461,2471
1.1292,-9.7593,2472
0.4019,-9.383,2473
1.6937,-9.5339,2474
-0.9812,-9.7546,2476
-0.8483,-9.7639,2477
1.0542,-9.7026,2478
-0.0702,-9.9545,2480
0.6157,-9.821,2481
6.6418,-9.6311,2482
-0.2378,-8.6601,2483
-6.5728,-7.5459,2484
5.2238,-8.7368,2485
0.7756,-10.415,2486
2.0659,-9.874,2487
-1.3387,-9.5302,2488
0.1454,-9.8726,2489
1.173,-9.936,2490
-0.2773,-10.0099,2491
1.1255,-9.4751,2492
16.957,-10.2168,2493
1.5014,-8.9169,2494
1.2936,-9.5964,2496
1.399,-9.7026,2497
-0.7056,-9.8704,2498
-0.5082,-9.6842,2499
8.1012,-9.9108,2500
3.2718,-9.424,2501
-1.3288,-9.7284,2502
16.6213,-9.9966,2503
35.3806,-9.3649,2504
41.643,-9.7569,2506
2.6509,-9.7233,2507
0.8134,-9.7766,2508
1.3203,-9.6967,2509
9.0721,-9.7821,2510
7.0304,-10.2281,2511
6.6533,-9.7912,2512
2.8079,-9.9161,2513
-1.8938,-9.4865,2514
5.4829,-9.8225,2516
-0.2005,-9.7033,2517
0.1825,-9.6216,2518
0.1473,-9.6876,2519
0.1573,-9.6812,2520
1.4928,-9.7925,2521
1.5867,-9.9752,2522
3.2929,-9.8762,2523
7.1373,-9.8852,2525
8.1314,-10.0625,2526
-0.6724,-9.8563,2527
2.1457,-9.79,2528
-1.4545,-9.7952,2529
-1.0515,-10.3616,2530
-7.6255,-8.0462,2531
4.2939,-7.5208,2532
1.2993,-9.6018,2533
-1.8363,-9.7051,2534
3.5012,-9.7284,2536
6.165,-7.3495,2537
-2.3344,-9.3675,2538
-4.1896,-9.6551,2539
-1.7436,-9.3365,2540
-0.1333,-9.8155,2541
-0.0061,-9.8349,2542
1.5154,-10.1766,2543
-6.0567,-7.5699,2544
0.1726,-10.0328,2546
-0.2926,-10.1494,2547
-1.1133,-9.8376,2548
-1.7095,-9.5753,2550
-0.3944,-9.6295,2551
-1.0613,-9.8696,2552
1.0461,-9.6573,2554
-0.4079,-9.9831,2555
-1.2487,-9.3076,2556
0.8684,-9.5618,2557
-2.1959,-9.9065,2558
-0.2316,-8.2493,2559
-1.1546,-9.3236,2560
0.5027,-9.8072,2561
2.3567,-9.9756,2562
3.9981,-9.7129,2563
0.9426,-9.6419,2564
0.4546,-9.9141,2565
0.3091,-9.6254,2566
-0.8955,-9.492,2567
-0.7871,-9.6403,2568
-0.0562,-9.8195,2569
-0.5747,-9.7433,2570
0.2589,-9.659,2571
3.469,-9.7716,2572
1.3336,-9.7816,2573
0.9866,-9.6939,2575
0.4101,-9.4811,2576
1.8052,-9.7118,2577
3.9248,-9.7183,2578
-1.9821,-10.0102,2579
2.8856,-9.8942,2580
-0.9371,-9.938,2581
0.445,-10.1326,2582
2.3077,-9.7686,2583
1.0659,-9.5502,2584
2.6392,-9.7031,2586
-1.4387,-9.3886,2587
-6.1444,-9.9982,2588
-8.2236,-9.9202,2589
-1.1621,-9.7963,2590
-0.2019,-10.0111,2591
0.3805,-9.3836,2592
-0.8227,-9.7401,2593
-1.048,-9.699,2595
1.3655,-9.7381,2596
-0.2071,-9.7468,2597
1.2634,-10.0659,2598
0.7421,-9.6858,2599
-1.7202,-9.7265,2600
4.3313,-10.0557,2601
4.197,-9.6256,2602
-0.1274,-9.5576,2603
-1.3631,-8.0441,2604
-0.8393,-6.6945,2606
1.7573,-9.6573,2607
1.2728,-9.666,2608
-2.2531,-9.9379,2609
1.0858,-10.2004,2610
43.5751,-10.0162,2611
-8.2035,-9.8624,2612
-4.027,-8.9993,2613
0.379,-9.6026,2614
1.0436,-9.688,2616
1.0513,-9.7142,2617
-1.8243,-9.557,2619
1.0119,-9.3436,2620
0.3667,-9.863,2621
-0.9072,-9.8308,2622
0.5048,-10.1671,2623
-0.8082,-10.2091,2624
1.152,-9.5173,2626
0.395,-8.8239,2627
0.6716,-9.0399,2629
2.919,-9.3902,2630
-6.1902,-9.8615,2631
0.7021,-9.2399,2632
-2.8618,-8.9674,2633
-4.9753,-9.8838,2634
-0.4821,-9.851,2636
-0.3977,-9.6126,2637
-0.7551,-9.8053,2638
1.1082,-9.269,2639
0.6117,-9.631,2640
0.639,-9.6822,2641
0.1373,-9.7332,2642
0.5591,-9.7607,2643
-0.7521,-9.6868,2644
2.0943,-9.7621,2645
5.3799,-9.7926,2647
-1.1295,-9.7008,2648
-8.4313,-9.6285,2649
5.5852,-9.5451,2650
0.0994,-9.6193,2651
-2.7895,-9.6439,2652
5.9826,-9.6764,2653
-0.0418,-9.7391,2654
-0.0747,-9.7407,2656
-0.038,-9.7405,2657
-0.4241,-9.739,2658
0.1934,-9.7344,2659
-0.125,-9.7393,2660
-0.0651,-9.7291,2661
-0.0462,-9.7391,2662
-0.0163,-9.7433,2663
-0.0759,-9.7411,2665
-0.0168,-9.7434,2666
-0.0058,-9.7422,2667
0.0186,-9.7429,2668
0.0076,-9.743,2669
0.0277,-9.7443,2670
0.0048,-9.7427,2671
0.0169,-9.742,2672
-0.0158,-9.7418,2673
-0.2668,-9.7429,2675
-0.1882,-9.7367,2676
-0.0445,-9.7394,2677
-0.3167,-9.7496,2679
-0.9826,-9.7495,2680
-4.9557,-9.6664,2681
1.2658,-9.6953,2682
-0.2859,-9.7148,2683
-5.6628,-9.8275,2684
6.0233,-9.4502,2686
1.8287,-9.6211,2687
4.3594,-9.6548,2688
1.4039,-9.4068,2689
-1.3355,-9.7345,2690
-2.676,-9.5604,2691
-0.7701,-9.8202,2692
1.3049,-10.1364,2693
1.7756,-10.0377,2695
2.8159,-9.672,2696
-0.3517,-9.8135,2697
2.6496,-9.7635,2698
0.3671,-9.7052,2699
-0.0822,-9.3386,2700
-4.7662,-9.1383,2701
1.1027,-9.4574,2702
0.1449,-9.8251,2704
-0.3547,-7.8647,2705
-0.4583,-9.609,2706
1.3426,-9.5295,2707
2.3736,-9.266,2708
1.596,-9.8613,2709
-0.1904,-7.1853,2710
6.0615,-9.5144,2711
0.1293,-9.6216,2712
0.0432,-9.4689,2713
1.8393,-9.1965,2714
-0.2656,-9.8726,2715
0.3217,-9.7983,2716
-0.0116,-9.5679,2717
2.8382,-9.9127,2718
-0.9356,-9.6994,2719
-0.3739,-9.2867,2720
-0.1346,-9.8076,2721
1.5604,-9.9063,2722
2.3232,-10.0856,2723
6.9429,-9.3124,2724
0.3758,-9.7733,2726
4.8353,-9.6016,2727
-0.6162,-10.1011,2728
5.9789,-9.512,2729
0.7643,-9.4533,2730
-1.0432,-9.4248,2731
-0.527,-9.8787,2732
-0.1121,-8.0056,2733
-2.4435,-10.5538,2734
14.8707,-9.8547,2736
1.551,-9.3403,2737
0.2246,-9.8655,2739
-0.5972,-9.6705,2740
-0.8301,-9.5111,2741
-3.496,-9.5499,2742
8.857,-9.6766,2743
4.0409,-9.7755,2744
1.519,-9.5958,2746
-0.1768,-9.6545,2747
-1.4969,-9.3854,2748
0.5452,-9.5839,2749
0.0347,-9.614,2750
4.9061,-9.6057,2751
0.6202,-9.6142,2752
0.6306,-9.6138,2753
0.6619,-9.6129,2754
0.6561,-9.612,2756
0.6481,-9.6128,2757
0.6638,-9.6135,2758
0.6537,-9.6137,2759
0.6524,-9.6126,2760
0.6549,-9.6145,2761
0.6656,-9.6128,2762
0.6502,-9.6127,2763
0.6699,-9.6144,2765
0.6502,-9.6134,2766
0.6591,-9.6139,2767
0.6696,-9.6125,2768
0.6607,-9.6139,2769
0.6509,-9.6142,2770
0.6587,-9.6136,2771
0.6519,-9.6128,2772
0.7917,-9.6211,2773
-7.5861,-9.6585,2774
2.3238,-9.6157,2776
-0.3113,-9.6006,2777
5.5901,-9.6472,2779
-0.5074,-9.8724,2780
0.1073,-9.7336,2781
2.8371,-9.7175,2782
-26.3957,-9.6341,2783
-13.6478,-9.5348,2784
3.3878,-9.6693,2785
-4.7603,-9.6569,2786
-0.7437,-9.4878,2787
-6.2202,-9.6827,2788
-5.5448,-9.6212,2789
2.8919,-9.8765,2790
-3.4385,-9.6893,2791
6.2684,-10.1226,2792
-7.5,-9.8482,2793
-7.0546,-10.0217,2794
5.4473,-9.6468,2795
3.3672,-9.688,2796
0.3555,-9.6993,2797
-0.7302,-9.712,2798
0.1275,-9.7084,2799
-38.0251,-9.525,2800
-6.2801,-9.7015,2801
1.0641,-9.6906,2802
-0.9633,-9.6623,2803
0.0722,-9.6768,2805
-4.8153,-9.6707,2806
0.0066,-9.6931,2807
0.3671,-9.696,2808
0.1985,-9.7021,2809
0.6459,-9.6963,2810
0.1885,-9.7038,2811
0.1805,-9.7041,2812
0.1764,-9.7049,2813
0.1767,-9.704,2814
0.179,-9.7039,2816
0.1767,-9.7051,2817
0.1755,-9.7042,2818
0.1259,-9.7057,2819
0.1775,-9.7071,2820
0.1644,-9.7042,2821
0.2131,-9.7069,2822
0.0964,-9.7131,2823
0.0712,-9.7133,2825
0.0476,-9.7147,2826
-0.1384,-9.7087,2828
0.0452,-9.7147,2830
0.0449,-9.7147,2831
0.0454,-9.715,2832
0.0435,-9.7143,2833
0.0451,-9.7134,2834
0.0437,-9.714,2835
0.0441,-9.7151,2837
0.0439,-9.7143,2838
0.043,-9.7148,2839
0.0435,-9.7148,2840
0.0424,-9.7156,2841
0.0425,-9.7147,2842
0.0436,-9.7137,2843
0.0316,-9.713,2845
0.0578,-9.7201,2846
0.008,-9.7144,2847
0.0072,-9.7148,2848
0.0076,-9.7146,2849
0.0081,-9.7119,2850
0.0069,-9.7146,2851
-0.0003,-9.719,2853
-0.1588,-9.7277,2854
-0.0778,-9.6938,2855
-0.6409,-9.7057,2856
1.4127,-9.7126,2857
0.1257,-9.7129,2858
0.1262,-9.7128,2859
0.124,-9.7138,2860
0.1228,-9.7129,2861
0.1232,-9.7129,2862
0.1256,-9.7135,2863
0.1258,-9.7143,2864
0.1236,-9.7137,2865
0.122,-9.7149,2866
0.1248,-9.7137,2867
0.1249,-9.7138,2870
0.1247,-9.7123,2871
0.1238,-9.7144,2872
0.1235,-9.7131,2873
0.1242,-9.7132,2874
0.1243,-9.7129,2875
0.1248,-9.7132,2876
0.1229,-9.7128,2877
0.1254,-9.7125,2878
0.1251,-9.7131,2879
0.1176,-9.7108,2880
0.1277,-9.7101,2881
0.1146,-9.7143,2882
0.1124,-9.7138,2883
0.1359,-9.7106,2884
0.1042,-9.7134,2885
0.1087,-9.7146,2887
0.1083,-9.7145,2888
0.109,-9.7134,2889
0.1099,-9.7133,2890
0.1085,-9.7158,2891
0.1107,-9.714,2892
0.1094,-9.7143,2893
0.1082,-9.7131,2894
0.1077,-9.7139,2896
0.1086,-9.7144,2897
0.1096,-9.7141,2898
0.1077,-9.7142,2899
0.1076,-9.714,2900
0.1062,-9.7142,2901
0.106,-9.7145,2902
0.1098,-9.7139,2903
0.1103,-9.7147,2904
0.1074,-9.7147,2906
0.1088,-9.7144,2907
0.107,-9.7155,2908
0.1066,-9.7147,2909
0.1072,-9.7145,2910
0.1088,-9.7146,2911
0.1083,-9.7144,2912
0.1086,-9.7148,2913
0.107,-9.7146,2914
0.109,-9.7157,2915
0.1074,-9.7154,2916
0.109,-9.7142,2918
0.1076,-9.7156,2919
-0.5025,-9.7118,2920
1.4942,-9.6946,2921
1.6811,-9.7129,2922
0.1131,-9.7157,2923
0.1146,-9.7147,2926
0.1157,-9.7152,2927
0.1141,-9.715,2928
0.1131,-9.7151,2929
0.1159,-9.7151,2930
0.1179,-9.7175,2931
0.1566,-9.7255,2932
-0.0818,-9.7536,2933
-4.3153,-9.4762,2934
-0.1018,-9.8877,2935
-0.2022,-9.7801,2936
-0.1265,-9.614,2937
0.9943,-9.7149,2938
0.1155,-9.7074,2939
-0.263,-9.7066,2940
-0.038,-9.7186,2941
1.136,-9.716,2942
1.8249,-9.7124,2943
4.1724,-9.6269,2944
0.246,-9.7149,2946
0.1949,-9.7111,2947
0.1932,-9.7107,2948
0.1924,-9.7097,2949
0.1954,-9.7091,2950
0.1988,-9.711,2951
0.1951,-9.7091,2952
0.1993,-9.7092,2953
0.2148,-9.7155,2954
0.1919,-9.7103,2956
0.012,-9.7113,2957
-0.2538,-9.6979,2959
-1.4204,-9.6042,2960
0.5144,-9.6811,3071
0.5159,-9.6821,3072
0.5082,-9.6808,3073
0.5067,-9.6811,3074
0.51,-9.681,3075
0.5111,-9.6807,3076
0.5138,-9.68,3077
0.5108,-9.6799,3078
0.5064,-9.681,3079
0.5058,-9.681,3080
0.5142,-9.68,3081
0.5057,-9.68,3082
0.5023,-9.6801,3083
0.5076,-9.6809,3084
0.5023,-9.6793,3085
0.485,-9.6814,3086
0.3032,-9.6737,3087
0.4277,-9.6839,3088
0.5491,-9.6812,3089
0.5299,-9.6759,3090
0.5213,-9.6765,3091
0.528,-9.6757,3092
0.5331,-9.6769,3094
0.527,-9.6764,3095
0.5203,-9.6758,3096
0.5308,-9.6756,3097
0.5228,-9.6762,3098
0.5247,-9.6761,3100
0.5185,-9.6773,3101
0.5373,-9.6774,3102
0.5307,-9.6761,3104
0.5291,-9.677,3105
0.5267,-9.6775,3106
0.5208,-9.6761,3107
0.5297,-9.677,3108
0.5262,-9.6767,3109
0.522,-9.6785,3111
0.5249,-9.677,3113
0.5202,-9.6768,3115
0.5272,-9.6767,3116
0.5313,-9.676,3117
0.5278,-9.6787,3118
0.5219,-9.6767,3119
0.5333,-9.6779,3120
0.5208,-9.677,3121
0.5323,-9.6774,3122
0.5248,-9.6778,3124
0.5256,-9.6773,3125
0.5233,-9.6772,3126
0.5274,-9.6776,3127
0.5296,-9.6776,3128
0.5206,-9.6777,3129
0.538,-9.6774,3130
0.5257,-9.6774,3131
0.5298,-9.6786,3132
0.526,-9.6779,3134
0.5244,-9.6777,3135
0.5201,-9.6783,3137
0.5245,-9.6763,3138
0.5126,-9.6777,3139
0.5306,-9.6774,3140
0.5255,-9.6774,3141
0.53,-9.6774,3142
0.5193,-9.6769,3143
0.5214,-9.6775,3144
0.5242,-9.6771,3145
0.52,-9.6773,3146
0.5315,-9.6773,3147
0.5321,-9.6778,3148
0.5206,-9.6775,3149
0.5262,-9.678,3150
0.5266,-9.6769,3151
0.5309,-9.6773,3152
0.5325,-9.6774,3153
0.5278,-9.6781,3154
0.5373,-9.6777,3155
0.5279,-9.6767,3157
0.5294,-9.6774,3158
0.5378,-9.6776,3159
0.5327,-9.6778,3160
-0.7487,-9.6559,3161
4.4205,-9.6557,3162
1.1471,-9.4872,3165
2.2892,-9.732,3166
-1.7601,-9.7499,3167
-12.4129,-9.5441,3168
10.0551,-9.5241,3169
6.4356,-9.6549,3170
-3.1051,-9.719,3172
10.7461,-9.4008,3173
-3.8046,-9.5988,3174
-2.0533,-9.5631,3175
0.4102,-9.5554,3176
0.9472,-9.5705,3177
1.2647,-9.6402,3178
-1.4168,-9.6406,3179
-0.2398,-9.6346,3180
-0.847,-9.6342,3181
-0.4993,-9.6302,3182
-0.5432,-9.6271,3183
-5.4694,-9.5975,3184
0.6378,-9.5423,3185
-0.4842,-9.5585,3186
0.3001,-9.5656,3187
-1.0955,-9.5764,3189
0.4743,-9.5704,3190
7.2272,-9.5976,3191
-4.8282,-9.5188,3192
3.96,-9.8287,3193
-24.2971,-9.1106,3194
5.9096,-9.4565,3195
-4.4288,-9.6634,3196
-7.7711,-9.5818,3197
-1.3115,-9.662,3199
2.8663,-9.6883,3200
