AYGX_mean,AZ_mean,timestamp
-0.5007,-9.5912,3346
0.0054,-9.8737,3347
-0.4661,-9.622,3348
2.1046,-10.066,3349
0.8678,-10.0081,3350
0.5919,-9.8154,3351
0.3981,-9.8368,3352
0.1141,-9.8714,3353
0.3961,-9.8232,3354
-0.8187,-9.689,3355
-0.0577,-9.8403,3356
-0.1174,-9.7253,3357
-0.3079,-9.7448,3358
-1.6241,-10.0815,3359
0.7688,-9.7455,3360
0.0756,-9.7688,3361
-0.2318,-9.7162,3362
1.5596,-9.6878,3363
-1.0683,-10.0087,3364
-78.5393,-9.0364,3365
