AYGX_mean,AZ_mean,timestamp
-0.0017,-9.8439,12
-0.0385,-9.8335,13
-0.0053,-9.8439,14
-0.0057,-9.8451,15
-0.0056,-9.845,16
-0.0055,-9.8437,17
-0.002,-9.8841,18
-29.4709,-9.4605,19
0.7427,-11.1528,20
2.3589,-9.9462,21
78.6381,-8.0826,22
-44.0556,-9.1264,24
49.025,-9.0358,25
-0.0604,-9.7285,26
1.7041,-9.8886,27
1.276,-9.7788,28
3.5471,-9.7793,29
1.0177,-9.9071,30
0.0884,-9.9245,31
9.8245,-10.084,32
