AYGX_mean,AZ_mean,timestamp
5.1496,-9.707,1055
-138.1748,-8.4503,1056
-305.2306,-4.6177,1058
-8.0533,-3.4162,1059
-7.9587,-3.4166,1060
-8.0463,-3.4176,1061
-8.0277,-3.4164,1062
-7.9937,-3.4159,1063
-8.013,-3.4129,1064
448.7685,-5.8126,1065
10.3983,-9.4669,1066
-2.0278,-9.7677,1068
-14.0524,-9.4454,1069
0.498,-9.4819,1070
5.7394,-9.5218,1071
15.5297,-9.7866,1072
-12.0996,-9.8655,1073
-5.3022,-9.9535,1074
-13.7887,-9.758,1075
