AYGX_mean,AZ_mean,timestamp
12.083,-10.1047,381
7.2879,-9.9159,382
2.9083,-9.8447,383
0.0367,-9.8061,384
3.5259,-9.9144,385
-2.341,-9.6629,386
9.0993,-9.9119,387
-17.8013,-9.688,388
-7.2868,-10.1767,389
19.6251,-9.9451,390
112.0899,-9.2842,391
-9.815,-9.9591,393
-1.3819,-9.9394,394
31.4997,-9.6504,395
10.5636,-10.595,396
-20.4334,-9.7222,397
8.3532,-9.9655,399
26.4446,-9.6226,400
