AYGX_mean,AZ_mean,timestamp
0.1886,-9.9055,1051
-0.3418,-9.9822,1053
0.3538,-9.9609,1054
2.2479,-10.0556,1055
2.1019,-9.9525,1056
0.0998,-9.8492,1058
0.8936,-9.8917,1059
2.1569,-9.9286,1060
3.1885,-9.9104,1061
3.3489,-9.7651,1063
-8.9729,-9.7869,1064
-7.2828,-9.7868,1065
-28.7867,-9.593,1066
15.6277,-9.5822,1068
-13.4188,-9.7428,1069
-142.0471,-7.268,1070
