AYGX_mean,AZ_mean,timestamp
-0.4597,-9.8459,1574
2.8328,-9.1837,1575
1.4336,-9.698,1576
0.7151,-9.711,1577
-6.1419,-9.5479,1579
10.1746,-9.4749,1580
1.7944,-9.4596,1581
3.692,-9.6011,1582
-25.7611,-9.1659,1583
73.3681,-9.1049,1584
2.1554,-9.5531,1585
2.2546,-9.5079,1586
12.4221,-9.6472,1587
1.0735,-9.6855,1589
0.9198,-9.6894,1590
0.0413,-9.7057,1591
-0.0884,-9.7055,1592
-0.122,-9.7056,1593
-17.1873,-9.589,1594
