AYGX_mean,AZ_mean,timestamp
-0.0497,-9.7202,1256
-164.5478,-7.1451,1258
-31.4583,2.1189,1259
47.6172,0.7082,1260
1.2789,0.6952,1261
-3.243,0.6828,1262
-1.4701,0.8047,1263
5.4751,0.2152,1264
-3.2545,0.2803,1265
503.1882,-2.1991,1266
191.9216,-8.6157,1267
-61.1432,-9.5177,1268
-12.1385,-9.6932,1270
-2.9709,-9.8497,1271
0.2446,-9.8222,1272
0.5677,-9.8221,1273
0.6466,-9.8185,1274
-1.8299,-9.8281,1275
-0.3616,-9.7714,1276
