AYGX_mean,AZ_mean,timestamp
4.466,-9.7406,828
-1.3214,-9.8406,829
12.8528,-10.0103,830
16.8486,-10.2296,831
3.4184,-9.2377,833
1.2148,-9.7097,834
3.4173,-9.8491,835
31.5146,-9.6304,836
12.1735,-10.1156,837
20.8961,-9.4372,838
74.5944,-10.3165,839
0.8904,-9.8577,840
17.6557,-9.8602,841
-0.0199,-9.9321,843
0.5288,-9.7557,844
12.6974,-9.6219,845
94.8522,-9.9239,847
