AYGX_mean,AZ_mean,timestamp
54.2693,-8.482,2180
6.9914,-10.1902,2181
92.893,-9.6025,2182
7.5597,-9.6892,2183
15.0706,-9.8326,2184
4.0234,-9.8607,2185
-0.8175,-9.8022,2186
2.0903,-9.8168,2187
-0.1075,-10.5564,2188
94.0927,-10.472,2189
230.949,-7.8155,2190
109.6423,-10.895,2191
15.2602,-11.2205,2192
148.103,-8.8257,2193
10.6362,-9.9032,2194
0.2974,-9.8464,2195
0.4863,-9.7862,2196
-0.8821,-9.7998,2197
1.0121,-9.6599,2198
1.7849,-9.9296,2199
0.157,-9.9049,2200
