AYGX_mean,AZ_mean,timestamp
0.6031,-9.9006,423
1.6915,-10.168,424
-0.0137,-9.912,425
3.2107,-9.8694,426
1.2707,-9.8832,427
19.8211,-10.3563,428
2.7466,-10.3596,429
1.1611,-9.6437,430
0.7441,-9.4609,431
-4.6738,-9.8269,432
-47.2199,-9.3126,433
14.9661,-9.7164,434
-0.3354,-9.8189,435
-13.1284,-9.7097,436
-7.9933,-9.6213,437
3.3885,-9.578,438
-9.6504,-9.7982,439
-19.9258,-9.6737,440
15.1998,-9.7245,441
9.5654,-9.7828,442
