AYGX_mean,AZ_mean,timestamp
-7.3416,-9.5501,593
5.973,-9.6,594
15.788,-9.5364,595
1.9042,-9.9978,596
-4.8067,-9.9389,597
4.3797,-9.6857,598
1.4201,-9.7855,599
-11.1471,-9.8192,600
-0.3541,-9.8168,601
0.5848,-9.7636,602
-3.7081,-9.9144,603
-28.2067,-9.5652,604
1.517,-9.6922,605
-1.0658,-9.7099,607
-0.0169,-9.7236,608
0.7995,-9.7193,609
-0.3018,-9.7139,610
20.1575,-9.6411,611
-114.3141,-7.8365,612
