AYGX_mean,AZ_mean,timestamp
0.5359,-9.9697,130
-4.6953,-9.8748,131
-2.9083,-9.8166,132
-7.5163,-9.9003,133
-5.3143,-9.6792,135
-5.0695,-9.7185,136
1.1577,-9.5936,137
20.3725,-9.5966,138
-4.8289,-9.3638,139
-30.7304,-9.4193,140
-7.0467,-9.6621,141
-0.0879,-9.8194,142
3.1569,-10.0653,143
-2.7251,-9.5969,145
9.9395,-9.6402,146
-12.685,-9.7345,147
-17.2393,-9.6124,148
15.9794,-9.5625,149
