AYGX_mean,AZ_mean,timestamp
-0.2863,-9.8121,0
-1.4505,-9.7884,1
-6.8211,-9.7568,2
7.5219,-9.7797,4
-0.6172,-9.8193,5
0.3891,-9.8096,6
0.0295,-9.8227,7
-0.1822,-9.8279,8
-2.6501,-9.8188,9
21.7857,-9.5555,10
0.1892,-9.8272,11
-1.715,-9.8108,13
-0.4239,-9.7959,14
0.8116,-9.8176,15
-0.0559,-9.8205,16
-2.0255,-9.7747,17
9.2804,-9.7399,18
4.0564,-9.5496,19
-3.4352,-9.7748,20
-5.4458,-9.8257,21
-1.6599,-9.8096,23
-1.0248,-9.7929,24
0.8786,-9.7884,25
2.9947,-9.8235,26
-0.2676,-9.8144,27
-1.0216,-9.8264,28
0.3395,-9.8227,29
-0.2827,-9.8109,30
0.4204,-9.8224,31
0.1819,-9.809,33
-12.2315,-9.6806,34
8.6157,-9.6845,35
42.8306,-9.7433,36
6.3859,-9.7053,37
6.2485,-9.9651,38
13.0994,-9.8414,39
54.9638,-10.0277,40
3.4477,-9.6772,41
3.3136,-9.6311,43
0.8687,-9.8569,44
-0.0063,-9.8909,45
-2.4677,-9.9375,46
4.2442,-9.9604,47
-0.1771,-10.27,48
0.2939,-10.0676,49
-0.1893,-9.6653,50
0.6176,-9.7919,51
0.0385,-9.9322,53
0.408,-9.768,54
0.4636,-10.0127,55
-0.8824,-9.5438,56
0.0177,-9.8525,57
0.0971,-10.1009,58
0.3151,-9.7865,59
0.367,-9.9733,60
-0.1192,-9.8701,61
0.3196,-9.9079,63
0.8396,-10.0322,64
-0.9238,-9.6513,65
-0.2105,-9.9449,66
0.1101,-9.8632,67
5.9106,-9.7077,68
16.66,-9.7748,69
1.4598,-9.6252,70
-0.4344,-9.9041,71
0.9942,-9.8881,73
-0.2559,-9.8531,74
0.121,-10.2917,75
9.5369,-10.3268,76
22.1566,-10.3766,77
8.1673,-9.8574,78
1.6202,-9.9355,79
8.0069,-9.7761,80
4.0208,-9.8498,81
0.25,-9.9503,83
1.894,-9.7316,84
-1.0785,-9.8895,85
4.4636,-10.3114,86
19.3916,-9.828,87
1.3654,-9.4507,88
1.1116,-9.9733,89
8.4725,-9.86,90
3.8112,-10.2201,91
0.9251,-9.6801,93
0.7232,-9.8633,94
2.2548,-9.9413,95
0.3405,-9.9977,96
0.862,-9.6461,97
-1.3725,-9.4729,98
0.3747,-9.8935,99
-0.1459,-9.6287,100
-0.4204,-9.3501,101
-0.5131,-9.4153,103
5.4542,-9.6293,104
12.526,-9.4853,105
20.1474,-10.2026,106
7.6791,-10.1763,107
2.9226,-10.0307,108
3.1089,-9.9544,109
1.9806,-9.8127,110
1.3108,-9.5347,111
1.1629,-9.8128,113
3.0745,-9.9154,114
0.3123,-9.3644,115
5.4403,-9.8455,116
11.9286,-10.4502,117
-0.2512,-9.7809,118
2.0142,-9.7102,119
4.6584,-9.813,120
23.4842,-10.2485,121
-0.1825,-9.6802,123
1.1815,-9.6448,124
-1.296,-9.7854,125
-0.309,-9.6262,126
6.3537,-9.8934,127
4.9878,-9.5742,128
0.7301,-10.245,129
24.0241,-9.7625,130
4.57,-9.6095,131
12.7366,-9.6511,133
14.1398,-8.8946,134
-0.9685,-8.0714,135
2.6322,-9.9785,136
8.3389,-8.4065,137
0.5651,-9.691,138
4.7618,-8.1624,139
-4.0871,-8.8138,140
4.5695,-10.339,141
-1.2296,-9.7274,143
2.5852,-9.8619,144
2.7903,-9.8824,145
0.2398,-9.5189,146
0.0023,-9.7814,147
4.4875,-10.0943,148
16.1527,-9.5907,149
-0.0469,-9.8822,150
-3.6964,-9.8107,151
-0.768,-9.7829,153
4.5001,-9.7026,154
1.2424,-9.8502,155
-2.5778,-9.8437,156
-38.7634,-9.238,157
-23.3997,-9.597,158
0.7068,-9.6887,159
1.1422,-9.6793,160
1.1373,-9.6793,161
1.1767,-9.6796,163
1.1375,-9.6793,164
1.1478,-9.6791,165
1.1397,-9.6795,166
1.1175,-9.6796,167
1.1251,-9.6797,168
1.1349,-9.6786,169
1.1473,-9.68,170
1.1558,-9.68,171
1.1556,-9.6796,173
1.1192,-9.6784,174
1.1334,-9.6793,175
1.1323,-9.679,176
1.1282,-9.6782,177
1.0993,-9.6796,178
1.0973,-9.6803,179
1.1128,-9.6791,180
1.0974,-9.68,181
1.1114,-9.6799,183
1.1154,-9.6799,184
1.1082,-9.6791,185
1.1323,-9.6788,186
1.1189,-9.6787,187
1.1128,-9.6804,188
1.1171,-9.6792,189
1.1455,-9.6783,190
1.1303,-9.6791,191
1.1308,-9.6783,193
1.1029,-9.6789,194
1.1024,-9.6793,195
1.1068,-9.678,196
1.0986,-9.6795,197
1.097,-9.6798,198
1.0883,-9.6798,199
1.0991,-9.6791,200
1.1033,-9.6788,201
1.1249,-9.6797,203
1.0988,-9.6788,204
1.0921,-9.6784,205
1.0946,-9.6791,206
1.0942,-9.6785,207
1.0895,-9.679,208
1.093,-9.6785,209
1.1136,-9.6784,210
1.0988,-9.68,211
1.1093,-9.6793,213
1.09,-9.6801,214
1.0964,-9.679,215
1.1082,-9.6795,216
1.0977,-9.6798,217
1.0724,-9.6804,218
1.0934,-9.6808,219
1.1004,-9.6806,220
1.098,-9.6816,221
1.1028,-9.6805,223
1.096,-9.6811,224
1.1031,-9.6799,225
1.0923,-9.6808,226
1.087,-9.6804,227
1.0965,-9.6807,228
1.1007,-9.6812,229
1.1029,-9.6795,230
1.0801,-9.6809,231
1.0936,-9.6803,233
1.0893,-9.6803,234
1.0835,-9.6796,235
1.0836,-9.6787,236
1.089,-9.6793,237
1.0725,-9.68,238
1.0943,-9.6797,239
1.0741,-9.6787,240
1.0741,-9.6806,241
1.0747,-9.6793,243
1.0847,-9.6793,244
1.0794,-9.6791,245
1.1027,-9.6796,246
1.0905,-9.679,247
1.079,-9.679,248
1.0638,-9.6787,249
1.0874,-9.6797,250
1.0757,-9.6803,251
1.0869,-9.6802,253
1.0768,-9.6797,254
1.0697,-9.6803,255
1.1074,-9.6797,256
1.0739,-9.6798,257
1.0756,-9.6797,258
1.0712,-9.6796,259
1.0891,-9.6796,260
1.0951,-9.6802,261
1.0853,-9.6792,263
1.0811,-9.6795,264
1.0759,-9.6793,265
1.082,-9.6792,266
1.0697,-9.6789,267
1.0748,-9.6794,268
1.0637,-9.6783,269
1.0828,-9.6793,270
1.0799,-9.6801,271
1.0847,-9.6793,272
1.0579,-9.6803,274
1.0683,-9.6799,275
1.0756,-9.6797,276
1.0755,-9.6801,277
1.0762,-9.6792,278
1.0868,-9.6802,279
1.0639,-9.6797,280
1.0717,-9.6805,281
1.071,-9.6808,282
1.0768,-9.6786,283
1.0737,-9.6799,285
1.0707,-9.6793,286
1.0675,-9.6796,287
1.0567,-9.6787,288
1.0702,-9.6793,289
1.0766,-9.68,290
1.0542,-9.6808,291
1.0594,-9.679,292
1.0743,-9.6795,294
1.0604,-9.6798,295
1.0648,-9.6793,296
1.0667,-9.6784,297
1.0612,-9.6798,298
1.0789,-9.6779,299
1.0412,-9.6794,300
1.0678,-9.6796,303
1.058,-9.6798,304
1.0645,-9.6789,305
1.0394,-9.6786,306
1.0583,-9.6789,307
1.055,-9.6799,308
1.0665,-9.68,309
1.0676,-9.6797,310
1.0608,-9.68,311
1.0793,-9.6801,313
1.0505,-9.6791,314
1.0438,-9.6794,315
1.0455,-9.6802,316
1.0444,-9.6793,317
1.0312,-9.6796,318
1.0341,-9.6804,319
1.0357,-9.6809,320
1.0315,-9.6796,321
1.0614,-9.6793,322
1.0556,-9.6795,323
1.0486,-9.6797,324
1.0387,-9.6799,325
1.0284,-9.6796,326
1.0259,-9.6785,327
1.0412,-9.6804,328
1.0187,-9.6787,329
1.0499,-9.6801,330
1.052,-9.6798,331
1.0596,-9.68,332
1.0501,-9.6799,333
1.0423,-9.6802,334
1.044,-9.6795,335
1.0384,-9.68,336
1.0288,-9.6795,337
1.0227,-9.6806,338
1.0344,-9.6802,339
1.0509,-9.6817,340
1.0266,-9.6792,341
1.0044,-9.6795,342
1.0157,-9.6789,343
1.0226,-9.6783,344
1.0143,-9.6791,345
1.0346,-9.6797,346
1.0163,-9.6806,347
1.0421,-9.6809,348
1.0293,-9.6809,349
1.0211,-9.6799,350
1.0332,-9.6787,351
1.055,-9.6796,352
1.0537,-9.6814,353
1.0255,-9.6795,355
0.9993,-9.6808,356
1.0102,-9.6796,357
1.0018,-9.6778,358
0.9969,-9.6793,359
1.0076,-9.6808,360
1.031,-9.6789,361
1.0383,-9.6794,362
1.0223,-9.6795,363
1.0215,-9.6795,364
1.0311,-9.6796,365
1.0093,-9.6798,366
1.0053,-9.6799,367
1.0105,-9.6789,368
1.021,-9.6815,369
1.0261,-9.6796,370
1.0062,-9.6788,371
1.023,-9.6793,372
1.0279,-9.6797,373
1.0257,-9.68,374
0.9998,-9.6801,375
1.0167,-9.6797,376
1.0077,-9.6795,377
1.0264,-9.6789,378
1.0071,-9.6801,379
1.0102,-9.68,380
1.0273,-9.6798,381
0.9967,-9.6795,382
1.0201,-9.6796,383
1.0271,-9.6798,384
1.0098,-9.6798,385
1.0162,-9.6787,386
0.989,-9.6799,387
0.9998,-9.6776,388
1.0128,-9.6777,389
1.0065,-9.6777,390
1.0121,-9.6788,391
1.0204,-9.6781,392
1.0245,-9.6799,393
1.013,-9.6789,394
1.021,-9.6799,395
0.9999,-9.679,396
1.0044,-9.6797,397
1.0099,-9.6789,398
0.9974,-9.6792,399
0.9813,-9.6815,400
1.0151,-9.6791,401
1.0177,-9.6783,402
0.9945,-9.6792,404
1.0023,-9.6789,405
0.9995,-9.6781,406
1.0052,-9.6769,407
1.0032,-9.6772,408
1.0127,-9.6795,409
1.019,-9.6776,410
1.0131,-9.6786,411
0.9977,-9.6791,412
1.0135,-9.6802,413
1.0173,-9.6779,414
1.0077,-9.6785,415
0.9795,-9.6772,416
0.9961,-9.678,417
1.0182,-9.6791,418
0.9676,-9.6781,419
0.9924,-9.6771,420
0.998,-9.6776,421
1.01,-9.679,422
0.9875,-9.6787,423
0.9972,-9.6778,424
1.0013,-9.6776,425
1.0015,-9.6783,426
1.0094,-9.6765,427
1.0153,-9.6768,428
1.0093,-9.6782,429
1.0066,-9.6778,430
1.0105,-9.6773,431
0.9909,-9.6785,432
1.0048,-9.6776,434
0.9921,-9.6782,435
0.9863,-9.6776,436
0.9994,-9.6786,437
0.9988,-9.6779,438
0.9976,-9.6791,439
0.9902,-9.6787,440
1.0006,-9.678,441
0.9958,-9.6778,442
1.0023,-9.6781,444
0.9908,-9.6788,445
0.988,-9.6779,446
0.9939,-9.6788,447
1.0019,-9.6771,448
0.9844,-9.6778,449
1.0003,-9.6786,450
1.009,-9.6782,451
1.006,-9.6774,452
0.9954,-9.6789,454
0.9929,-9.6788,455
1.0121,-9.6772,456
0.9874,-9.6789,457
0.9873,-9.6795,458
1.0004,-9.6793,459
0.9974,-9.6795,460
0.9948,-9.6797,461
0.986,-9.6801,462
0.9743,-9.6781,463
1.0064,-9.6798,464
0.9872,-9.679,465
0.9951,-9.6794,466
0.9744,-9.6794,467
1.0062,-9.6781,468
0.987,-9.6789,469
0.9708,-9.6796,470
0.9791,-9.6804,471
0.9785,-9.6782,472
0.9827,-9.6797,473
0.9931,-9.6783,474
0.9715,-9.6789,475
0.9775,-9.6798,476
0.9763,-9.6787,477
0.9857,-9.6805,478
0.9817,-9.6775,479
0.9878,-9.6775,480
0.9825,-9.6788,481
1.0141,-9.6787,482
0.996,-9.6798,483
0.9909,-9.6795,484
0.9789,-9.6803,485
0.981,-9.6796,486
0.9833,-9.6787,487
0.9698,-9.6782,488
0.971,-9.6775,489
0.9862,-9.6799,490
0.98,-9.6784,491
0.9757,-9.6788,492
0.9854,-9.6793,494
0.978,-9.6794,495
0.9743,-9.6801,496
0.9601,-9.6786,497
0.9769,-9.6794,498
0.9763,-9.6807,499
0.9715,-9.6784,500
0.9802,-9.6793,501
0.9826,-9.6786,504
0.9816,-9.6791,505
0.976,-9.6783,506
0.9734,-9.6792,507
0.9605,-9.6792,508
0.9674,-9.68,509
0.9801,-9.6779,510
0.9801,-9.6791,511
0.9673,-9.6777,512
0.9492,-9.6784,513
0.9789,-9.6784,514
0.9683,-9.6787,515
0.9771,-9.6799,516
0.9718,-9.6785,517
0.9893,-9.6806,518
0.9765,-9.6782,519
0.9528,-9.6801,520
0.9869,-9.6795,521
0.9796,-9.6786,522
0.9848,-9.6785,523
0.9572,-9.6782,524
0.9601,-9.6796,525
0.9601,-9.6788,526
0.9759,-9.6785,527
0.9721,-9.6769,528
0.9589,-9.6792,529
0.977,-9.6787,530
0.9691,-9.6781,531
0.9674,-9.6796,532
0.963,-9.6787,534
0.9802,-9.6803,535
0.9926,-9.6767,536
0.9721,-9.6802,537
0.9657,-9.6783,538
0.9595,-9.679,539
0.9627,-9.6767,540
0.959,-9.678,541
0.9635,-9.6789,542
0.9636,-9.6776,543
0.9541,-9.6782,544
0.9628,-9.6772,545
0.9691,-9.6789,546
0.9602,-9.6773,547
0.9659,-9.6769,548
0.9593,-9.6776,549
0.969,-9.6784,550
0.9784,-9.6784,551
0.972,-9.6781,552
0.972,-9.6775,553
0.9618,-9.6785,554
0.9591,-9.6784,555
0.9521,-9.6773,556
0.9734,-9.6775,557
0.9615,-9.6788,558
0.9765,-9.6779,559
0.9816,-9.6776,560
0.9632,-9.6774,561
8.1871,-9.7107,564
-5.205,-9.8041,565
-13.7586,-9.6951,566
-9.5175,-9.843,567
5.7643,-9.7536,568
-3.2861,-9.882,569
12.0475,-10.3828,570
4.663,-9.9346,571
-0.0918,-10.0369,572
1.046,-9.8944,574
0.514,-9.8235,575
-0.4851,-9.7917,576
0.0372,-9.9595,577
0.0802,-9.9336,578
-0.9554,-9.8474,579
4.1509,-9.8219,580
7.3071,-9.8633,581
-0.5447,-10.0746,582
0.2943,-9.7951,584
0.6399,-9.655,585
0.5546,-9.833,586
-0.8812,-9.8147,587
4.3194,-6.6467,588
1.7565,-9.7413,589
-2.0126,-10.4998,590
0.475,-9.3706,591
-1.1774,-10.0013,592
0.7893,-9.8777,594
-2.7358,-9.9797,595
3.3747,-9.5933,596
-0.6936,-9.2948,597
-0.4055,-9.7701,598
0.088,-9.7321,599
4.7628,-9.9106,600
-0.1191,-9.8206,601
-0.4845,-9.7782,602
-1.2431,-9.658,603
6.3625,-10.2249,604
2.4515,-9.6495,605
0.3436,-9.4906,606
-1.2368,-9.7687,607
1.2431,-10.0378,608
6.533,-9.675,609
3.5151,-11.55,610
2.5353,-9.3295,611
0.0744,-10.0299,612
1.9889,-9.7916,614
10.9439,-10.0279,615
6.5903,-10.5696,616
11.8359,-9.584,617
3.0261,-9.9294,618
-0.4936,-9.7569,619
0.9443,-10.2376,620
-1.0471,-9.6527,621
2.0186,-9.9525,622
0.048,-9.8362,624
3.6509,-9.8359,625
4.05,-9.5211,626
-0.8433,-8.4774,627
4.59,-9.8816,628
1.9356,-9.7299,629
-0.5485,-9.8638,630
2.4375,-9.8675,631
0.8733,-9.936,632
-0.4921,-9.8884,634
0.3874,-9.9645,635
-0.0215,-9.9197,636
12.04,-9.8936,637
0.5856,-10.0744,638
0.5292,-9.7434,639
0.3031,-9.5748,640
-0.0423,-9.9097,641
1.456,-9.8174,642
0.3263,-9.7625,644
3.0713,-9.8363,645
2.7584,-10.1796,646
-0.3106,-9.549,647
1.1162,-9.3907,648
0.065,-9.8238,649
0.4182,-9.9605,650
1.4322,-9.867,651
0.2111,-9.8718,652
1.0409,-9.5209,654
19.5913,-9.6807,655
2.0681,-9.7451,656
-0.9406,-10.6026,657
0.0764,-10.2027,658
3.1654,-9.9766,659
2.3897,-10.7048,660
-0.3021,-9.4943,661
-0.1441,-9.8776,663
1.7783,-9.7457,664
1.9634,-10.0884,665
-1.2137,-9.8662,666
2.1745,-9.8995,667
2.5148,-9.8013,668
1.1733,-9.9959,669
3.8867,-9.5096,670
-1.0563,-9.9429,671
1.3715,-10.3215,672
0.0092,-9.7574,674
2.8771,-9.8267,675
8.4778,-10.0327,676
-2.5644,-8.9193,677
4.8008,-9.6613,678
1.6231,-10.3743,679
-1.8901,-9.6878,680
-0.3123,-9.7929,681
1.6684,-9.3723,682
6.8872,-9.8107,684
1.6661,-9.8244,685
2.1641,-9.9537,686
0.6845,-9.8531,687
0.3303,-9.7983,688
0.4675,-10.0527,689
-0.7037,-10.2663,690
-16.0561,-9.86,691
-0.5923,-9.742,692
11.6383,-9.5485,694
0.4476,-9.7764,695
-0.1302,-9.8346,696
-0.1193,-9.8203,697
-0.6433,-9.8188,698
0.2592,-9.8181,699
2.1223,-9.8471,700
-0.6666,-9.8291,701
