AYGX_mean,AZ_mean,timestamp
0.1139,-9.7109,168
0.9031,-9.7666,169
0.1574,-9.4379,170
2.133,-9.8184,171
0.061,-9.9294,172
0.2004,-9.8178,173
0.104,-9.8723,174
-0.0435,-9.7976,175
0.0006,-9.7438,176
3.3493,-9.7726,177
-41.2136,-9.7384,178
1.8226,-10.0946,179
0.059,-9.7686,180
-0.0552,-9.7054,181
0.5216,-9.8274,182
0.9161,-9.8205,183
2.3472,-9.6738,184
2.5345,-10.28,185
-12.2516,-9.6205,186
13.786,-9.59,187
0.5772,-9.6683,188
