AYGX_mean,AZ_mean,timestamp
0.0173,-10.0144,0
-0.4132,-10.0047,2
-0.3015,-10.0162,3
-1.1406,-10.0402,4
-15.7298,-9.717,5
2.9005,-10.0225,6
-4.5243,-10.0127,7
0.1626,-10.0136,8
-0.0684,-10.013,9
-0.0921,-10.0103,10
-0.0092,-10.0185,11
0.0365,-10.0138,13
0.0914,-10.0154,14
0.0522,-10.0133,15
-0.0277,-10.0173,16
0.0179,-10.0135,17
0.0154,-10.0142,18
0.0493,-10.0146,19
0.0327,-10.0149,20
0.0419,-10.0151,21
0.0481,-10.0214,22
0.0939,-10.0154,24
-0.0384,-10.0127,25
0.7618,-9.9945,26
-11.8781,-9.9568,27
-3.0226,-10.0105,28
-5.759,-9.9639,29
-1.2349,-10.0076,33
0.196,-10.0085,34
0.3222,-10.0155,35
-0.0562,-10.0335,37
-0.2597,-10.0145,38
-0.1337,-9.993,39
-0.5954,-9.9779,40
-0.3077,-9.9519,41
0.8745,-9.9835,42
-0.6991,-9.9807,43
-4.7654,-9.9691,44
-8.1626,-9.947,45
-0.9959,-10.0776,46
1.2736,-10.0219,47
-0.7167,-9.9567,48
0.0999,-10.0941,49
0.2591,-10.2083,50
-1.2254,-9.3902,51
1.2017,-9.4893,52
-1.1686,-9.7257,53
3.7198,-10.0043,54
1.6076,-10.2251,55
4.8091,-10.1435,57
2.7022,-10.2669,58
5.5974,-10.1413,59
0.0126,-9.9956,60
1.0023,-10.0414,61
2.9454,-10.1614,62
13.3165,-10.0745,63
-0.2494,-9.9688,64
14.674,-9.9477,65
3.479,-9.7471,67
-0.2974,-10.0537,68
1.5618,-10.1719,70
11.8058,-9.9026,71
5.6269,-10.1357,72
-1.976,-10.0562,73
4.477,-9.9902,74
3.6335,-10.0222,75
12.4991,-10.1121,76
2.6321,-9.9657,78
5.6819,-10.1701,79
2.427,-9.9735,80
4.7278,-10.1745,81
0.4703,-9.5847,82
-2.1539,-10.0417,83
13.9949,-9.7215,84
1.0623,-9.9866,85
1.2227,-9.7845,86
5.3035,-10.0638,88
-0.2649,-10.0341,89
0.1795,-9.5914,90
-0.6577,-10.1239,91
0.0865,-9.8926,92
2.716,-9.9806,93
-0.9109,-10.0249,94
-0.177,-10.0112,95
0.0964,-10.0263,96
-0.8628,-10.0231,98
-2.7008,-9.9798,99
2.0291,-9.9606,100
-2.0846,-9.984,102
1.6271,-9.9242,103
3.2326,-10.0207,104
-0.5898,-9.9278,105
1.5698,-10.0793,106
0.5389,-9.8576,107
8.0954,-9.6922,108
-1.1326,-10.0216,109
-1.4888,-9.9523,110
5.1891,-9.9827,111
6.5618,-10.2737,112
12.3494,-9.9912,113
18.7146,-10.1264,114
30.125,-10.2866,115
5.0744,-10.0478,117
7.515,-9.7135,118
0.2581,-9.9237,119
-0.1808,-10.0469,120
0.6683,-10.0041,121
0.4171,-10.0844,123
0.6155,-9.9532,124
-0.2194,-9.9456,125
1.0578,-9.9857,127
0.6718,-10.2638,128
-0.0929,-10.0269,129
-0.2275,-10.0228,130
-0.106,-9.9325,131
0.1555,-9.9882,132
5.5646,-10.1129,133
0.71,-10.4619,134
-2.9519,-10.1772,135
4.7908,-10.2743,136
12.4053,-10.1613,137
5.1377,-9.9841,138
1.3424,-10.0433,139
6.3761,-10.0032,140
10.1464,-10.0855,141
4.4233,-10.0774,142
8.9454,-9.9446,143
2.5568,-10.0306,144
0.7149,-10.103,145
6.625,-10.0909,147
1.6912,-10.0119,148
2.8933,-9.9957,149
4.3646,-10.0849,150
-0.8413,-9.8188,151
1.0949,-10.2105,153
3.092,-10.0489,154
0.6937,-10.0692,155
3.0559,-9.9466,157
1.5931,-10.0624,158
-0.676,-10.0972,160
0.4382,-9.9999,161
-0.1278,-9.7766,162
0.084,-9.8563,163
-0.4796,-10.115,164
2.8817,-10.0927,165
1.5529,-10.0267,166
1.9734,-10.1446,167
-0.4299,-10.1642,168
0.549,-10.0268,169
3.6704,-9.9917,170
8.4959,-10.1937,171
8.2954,-10.0805,172
0.1509,-9.9925,174
0.7218,-10.087,175
3.2142,-10.1658,176
7.4775,-9.9638,177
5.6046,-10.3849,178
-0.1783,-9.8441,179
0.1672,-10.1545,180
1.0387,-10.1329,182
0.2513,-10.0083,183
0.7218,-10.4784,184
-0.2412,-10.0552,185
4.7515,-10.1559,187
1.5944,-10.2585,188
0.477,-9.8881,189
-0.491,-10.0348,191
1.0917,-10.0469,192
0.0848,-9.9877,193
0.1501,-10.2363,194
0.382,-10.1065,195
3.6935,-9.9872,196
0.2721,-10.0921,197
1.8334,-9.9028,198
0.4782,-10.0364,199
1.1834,-10.1441,200
-0.5071,-10.1758,202
0.7277,-9.9821,203
0.5821,-10.0508,204
0.4455,-10.0484,205
3.9539,-10.0097,207
2.6643,-10.0298,208
1.8727,-10.1117,209
0.9839,-9.9691,210
3.2174,-10.1442,212
0.0525,-10.3044,213
3.1503,-10.2826,214
10.5522,-10.6548,215
10.1713,-10.0748,217
2.3879,-10.0348,218
2.5442,-10.4744,219
1.1428,-10.2993,220
4.0719,-9.8786,222
11.8123,-10.3086,223
19.8758,-9.3175,224
18.7403,-9.8145,225
-1.7109,-9.8872,226
-1.1544,-10.3155,227
-0.3233,-9.955,228
-0.1024,-9.988,229
8.1342,-10.0149,230
-1.202,-9.7593,231
-7.2107,-10.3338,232
4.4282,-10.2065,233
3.7014,-10.0635,234
3.67,-9.9784,235
21.439,-10.0991,236
0.0604,-10.4937,237
0.3413,-10.0223,238
3.2154,-10.0632,239
1.7475,-10.0458,240
0.6858,-10.0736,242
-0.1039,-10.0319,243
0.0011,-9.9547,244
0.1564,-10.1697,245
0.0829,-10.1443,247
0.5439,-9.9514,248
0.3805,-10.0609,249
0.0862,-10.0314,250
2.2895,-10.0219,252
0.3603,-9.9775,253
1.7521,-10.0174,254
-0.0029,-10.1213,255
1.0555,-9.9457,257
-1.2504,-10.0626,258
-0.01,-9.9967,259
-0.3678,-9.9409,260
0.0709,-9.8087,261
2.0253,-9.9675,262
0.6254,-9.4088,263
0.2242,-10.7776,264
1.9493,-9.6672,265
12.0274,-9.9944,266
1.0552,-10.0055,267
2.4424,-9.9736,268
4.2923,-9.7559,269
-0.3129,-10.1851,270
0.3399,-10.0145,272
0.6308,-9.9385,273
1.8244,-10.0726,274
-0.8654,-10.1253,275
-0.5878,-9.4748,277
0.1708,-9.6278,278
-0.4582,-9.8338,279
-0.8674,-9.8899,280
-0.1579,-10.0894,282
-2.4523,-9.5019,283
0.3107,-10.186,284
-0.0752,-10.0525,285
0.1595,-10.0067,287
-0.0487,-9.9944,288
-3.3585,-10.7517,290
-11.8483,-6.6454,291
-1.0451,-10.032,292
-43.3117,-9.5546,293
-6.8043,-9.8199,294
30.1126,-9.1385,295
3.6975,-9.6139,296
-4.3402,-9.8046,297
15.2054,-9.7827,298
-3.318,-9.938,299
-0.1375,-10.2017,300
0.325,-10.2637,301
-0.0322,-9.952,302
1.0451,-10.0468,303
0.3248,-9.9606,304
0.8574,-10.0405,305
-0.9038,-10.1323,307
0.301,-10.066,308
1.02,-9.9548,309
2.1478,-9.8253,310
2.1337,-10.1203,312
-0.4003,-9.7334,313
0.8227,-10.245,314
2.3061,-9.9182,315
0.3958,-10.0512,317
0.1363,-10.0378,319
-0.2259,-9.9855,320
-0.0963,-10.0791,322
0.2893,-9.9675,323
0.4999,-10.0329,324
0.4587,-9.9715,325
-0.0629,-10.1019,326
0.3832,-9.9735,327
-0.1199,-9.9632,328
0.2326,-10.1842,329
-0.007,-10.229,330
-0.01,-10.1881,331
-0.2751,-10.04,332
0.6467,-10.034,333
7.2936,-9.8928,334
6.5305,-10.1084,335
1.597,-10.0383,337
0.7413,-10.0621,338
0.1148,-9.9827,339
0.2508,-10.0101,340
-0.0747,-9.9153,342
0.5661,-10.1489,343
1.3674,-10.3812,344
0.3148,-9.8027,345
1.2059,-9.9808,347
6.2952,-9.9161,348
1.615,-9.8847,349
7.8359,-10.2553,350
3.1138,-10.1743,352
-0.1245,-10.0219,353
-0.7048,-10.1084,354
-4.5233,-10.1411,355
1.8191,-10.1444,357
-6.9895,-9.9453,358
-10.1608,-9.7332,359
8.1885,-9.7815,360
0.4946,-9.8592,361
1.5716,-9.8626,362
3.7457,-9.7582,363
3.1003,-9.8831,364
-1.0422,-9.8925,365
1.5966,-9.9127,366
0.196,-9.9224,367
-0.002,-9.9216,368
-3.1513,-9.9368,370
-3.6867,-9.8993,371
4.3221,-9.7339,372
-3.3798,-9.9799,373
-2.3046,-9.9961,374
12.1964,-9.8851,375
-0.254,-10.0281,377
-4.4155,-9.8915,378
1.5369,-9.9288,379
1.5479,-9.9297,380
7.6966,-9.8607,382
0.3655,-9.9767,383
0.8008,-9.978,384
0.4096,-9.976,385
-0.0957,-9.98,386
-0.2289,-9.9714,387
0.733,-9.9684,388
0.1163,-9.9857,390
0.0993,-9.9819,391
0.2775,-9.9819,392
0.4985,-9.9753,393
-1.4057,-9.9665,394
1.136,-9.9446,395
1.0218,-9.9246,396
2.9684,-9.9646,397
-5.4657,-9.9664,398
-2.5706,-9.8685,399
5.0723,-9.8896,400
-0.0257,-9.8988,401
-0.3817,-9.9523,403
-2.8069,-9.9541,404
5.4402,-9.9907,405
-0.3643,-10.0684,407
0.7953,-9.9754,408
0.6035,-9.9709,409
0.1945,-10.0083,410
0.2077,-10.0262,412
2.0442,-10.0654,413
-0.697,-9.9667,414
-2.9319,-10.0073,415
5.2149,-9.9415,417
-4.3963,-9.8892,418
-3.4567,-9.9733,419
0.33,-9.9906,420
-2.7299,-9.9979,422
0.0379,-10.0034,423
-0.6777,-9.9883,424
-5.3105,-9.9459,425
-9.1523,-9.9289,426
5.5257,-9.9312,427
0.2851,-9.9907,428
0.6523,-10.0048,429
1.5709,-9.9972,430
-5.8846,-9.9854,431
-1.5472,-9.9472,432
2.7806,-10.014,433
0.0395,-10.0649,434
2.5455,-10.1578,435
3.3734,-9.9837,436
-1.262,-10.0231,437
0.4392,-9.9664,438
-0.3494,-10.2553,439
13.8344,-9.9341,440
0.1916,-9.9378,442
0.8402,-10.1286,443
4.8874,-10.0294,444
-0.198,-9.823,445
-0.3046,-10.1165,446
0.7623,-9.8149,448
1.2263,-10.0945,449
1.9934,-10.1375,450
4.3996,-10.3201,451
-1.0751,-10.0581,452
0.586,-7.7799,453
-0.7604,-9.4727,454
-0.0441,-9.9699,456
-0.6646,-9.9511,457
0.2254,-10.1377,458
-1.3164,-10.0047,459
-1.8475,-10.0825,460
-1.0227,-9.9897,461
-8.3631,-9.9507,462
-4.8475,-9.7993,463
-2.4253,-10.0481,464
6.323,-9.9085,465
-8.4311,-9.9524,466
-2.319,-9.4814,468
1.9357,-9.9147,469
0.9024,-9.9825,470
-6.5816,-9.9236,472
3.21,-10.0439,473
-0.9322,-10.1621,474
2.7858,-10.0217,475
-0.286,-9.9712,477
3.3191,-10.0405,478
5.3212,-10.1519,479
2.1328,-9.6839,480
2.4275,-9.985,482
4.2623,-10.031,483
-1.4469,-10.1108,484
3.4776,-10.1043,485
10.8941,-9.9077,487
-0.4246,-9.9279,488
6.8016,-9.9987,489
9.3205,-10.0993,490
1.3208,-9.968,491
15.2365,-9.988,492
2.6647,-9.8883,493
-2.0281,-10.0241,494
9.7788,-10.0377,495
-0.426,-9.9817,496
0.0028,-9.9985,497
0.2611,-10.045,498
-5.9025,-9.881,499
2.0959,-9.9095,500
0.4705,-9.9913,501
3.0558,-10.0366,503
4.7525,-10.0099,504
9.1397,-10.0343,505
8.6749,-9.7666,506
8.2979,-10.056,507
-4.5503,-10.1435,508
9.0448,-9.9263,509
4.2876,-9.8927,510
3.0689,-9.9034,512
7.073,-10.1981,513
4.9207,-10.5859,514
1.1531,-9.9348,515
4.8896,-9.9895,517
0.769,-9.7499,518
0.1698,-10.1053,519
-2.1635,-10.0074,520
3.2974,-10.0042,522
0.6016,-10.1103,523
4.1753,-10.1276,524
5.8781,-10.0951,525
2.8611,-9.6332,526
1.749,-10.2927,527
-0.3984,-10.0329,528
0.2345,-9.9536,529
0.3296,-9.8977,530
-1.2328,-10.0986,531
-1.0596,-9.7883,532
-1.0344,-9.9072,533
1.78,-10.311,534
4.4514,-9.312,535
0.2709,-10.7665,536
0.4314,-9.9224,537
0.062,-10.0451,538
0.08,-10.0756,539
-0.0825,-10.0148,540
0.009,-9.9738,542
-0.1033,-10.0461,543
3.0138,-9.9309,544
1.4493,-9.9831,545
3.1513,-9.9818,547
1.1172,-9.8859,548
-0.8744,-10.6089,549
0.2239,-10.0332,550
0.0087,-9.9967,552
0.2071,-10.0219,553
-3.9374,-12.4025,555
0.601,-9.935,556
-0.2944,-9.9903,557
0.4802,-10.0444,559
-3.2531,-10.0005,560
-2.949,-9.9389,561
3.0121,-9.9675,562
0.2744,-9.9715,563
1.0125,-9.9794,564
-1.4646,-9.9778,565
-2.8321,-9.9465,566
3.2202,-9.9772,568
-1.4933,-9.9786,569
1.4691,-10.0236,570
-0.883,-9.9962,572
-0.3926,-9.9947,573
-9.6132,-9.9309,574
0.4167,-10.0179,575
4.6969,-9.8811,577
1.3172,-10.2584,578
10.7406,-9.4295,579
2.7158,-9.923,580
-1.9918,-10.0589,582
2.2604,-9.9539,583
0.8198,-9.9394,584
0.1486,-10.0583,585
-0.5058,-10.3347,586
0.7818,-9.9263,588
-0.6408,-10.001,590
1.31,-10.0633,591
9.6451,-9.8405,592
-0.5502,-9.9639,593
-1.4006,-10.0079,594
2.7602,-9.9809,595
-0.2029,-10.0147,597
6.4821,-10.0654,598
0.7581,-10.1108,599
0.8292,-9.9671,600
3.0709,-9.6777,602
-0.3976,-9.9646,603
1.7193,-10.1431,604
2.6716,-10.1311,605
3.4129,-10.1645,607
2.7947,-9.2723,608
4.0408,-10.13,609
-0.0122,-9.7576,610
5.0878,-10.096,612
1.3013,-10.0765,613
-0.1093,-10.0729,614
-0.6733,-9.6948,615
0.846,-9.9139,617
1.6662,-9.9304,618
3.6066,-10.0691,620
13.0794,-9.9527,621
-0.3975,-9.9439,622
6.4577,-9.9562,623
0.576,-10.0675,624
-1.284,-10.1219,625
-0.1221,-9.9486,626
2.898,-9.9305,628
0.2591,-10.0355,629
6.4289,-10.098,630
0.6698,-9.9733,633
0.2562,-10.0507,634
0.9621,-9.9757,635
0.2119,-9.9619,637
3.1542,-9.9622,638
-1.5166,-10.1887,639
2.5559,-10.0177,640
-0.3022,-9.6458,642
-1.1692,-10.0996,643
9.9959,-10.0825,644
1.3439,-10.1355,645
3.3342,-10.0448,647
3.1788,-10.017,648
1.9752,-10.0301,649
10.2303,-10.1599,650
0.9958,-10.074,652
0.8677,-10.0374,653
0.7249,-10.0343,654
-4.8909,-9.8758,655
0.8352,-10.0341,656
2.9487,-10.0343,657
-0.7377,-9.9954,658
-0.385,-10.0736,659
0.0145,-10.0397,660
11.1153,-10.173,661
-0.3804,-10.0422,663
1.9689,-10.0197,664
0.4457,-9.9414,665
17.0985,-10.1511,667
0.3947,-10.1025,668
0.7905,-9.9773,669
0.7837,-10.0392,670
5.89,-9.9179,672
2.6848,-10.0129,673
1.0365,-9.2754,674
-0.2527,-10.0489,675
-0.0002,-9.9398,677
0.0395,-10.064,678
3.6488,-10.0403,680
-1.4884,-9.994,682
1.1802,-10.0668,683
3.216,-9.6186,684
1.0945,-9.8965,686
-2.2526,-9.9587,687
2.9748,-9.553,688
13.7739,-10.1766,689
-7.3274,-9.6548,690
8.421,-9.9734,691
4.3124,-9.9979,693
0.8467,-10.0378,694
6.7157,-10.0604,695
-0.6038,-10.1511,696
3.2686,-9.9997,698
4.4404,-10.0615,699
4.0391,-10.0582,700
0.3541,-9.9294,702
2.7905,-10.0169,703
2.4798,-10.186,704
-2.94,-10.0984,705
-0.7746,-10.0039,707
1.3414,-10.0725,708
2.9683,-9.9515,709
4.4513,-9.972,710
0.7532,-10.1176,712
0.0475,-10.0205,713
1.5344,-10.073,714
1.3737,-9.7941,715
2.0863,-10.0109,717
2.478,-9.9893,718
1.3712,-10.0934,719
2.5852,-9.9098,720
2.5633,-10.0152,721
1.0072,-9.9059,722
-0.1812,-9.9077,723
2.7857,-10.0379,724
6.8147,-9.8428,725
-0.4062,-9.9319,726
2.7145,-9.9863,728
0.5506,-10.0107,729
0.3343,-9.9743,730
-0.3612,-9.9629,731
0.8174,-10.0164,733
1.1347,-10.0129,734
-0.3957,-9.9834,735
0.4261,-10.1709,737
0.7874,-10.0503,738
-2.5951,-9.9308,740
-1.9344,-9.9082,742
2.1304,-9.9323,743
0.9021,-10.2401,744
4.2314,-10.0025,745
-1.3538,-10.1513,747
0.4299,-9.261,748
12.255,-9.9199,749
6.082,-9.6398,750
5.4499,-9.9665,752
4.4019,-10.1865,753
1.0507,-9.8943,754
2.0932,-10.4331,755
-0.3646,-9.9842,757
1.2027,-9.8866,758
-1.2226,-10.0046,759
5.2236,-9.9249,760
-0.8249,-9.7042,761
3.5979,-9.8986,762
-1.1487,-9.9998,763
-3.9353,-9.9469,764
0.8712,-10.0285,765
2.1488,-10.0267,767
50.565,-10.0145,768
37.1977,-10.0499,769
7.4182,-10.0855,770
8.4864,-10.0893,772
3.2696,-9.5516,773
5.1149,-9.5706,774
-1.2878,-10.304,775
-0.0031,-10.2391,777
0.1798,-10.0004,778
1.8462,-10.1723,779
1.511,-10.0395,780
1.1493,-10.0112,782
1.2673,-10.0147,783
0.3367,-9.9957,784
4.9306,-10.1279,785
1.2031,-9.9495,786
4.7968,-9.6247,787
1.294,-10.0232,788
0.9358,-9.9781,789
1.7954,-10.0311,790
2.6311,-10.0816,791
-0.0425,-10.0809,792
1.7533,-10.0858,793
1.4924,-10.0598,794
6.0611,-9.9994,795
-0.0238,-10.1583,796
5.1243,-10.0488,798
-1.0761,-10.0205,799
2.1075,-10.0711,800
-0.227,-10.0104,802
2.4004,-10.0143,803
0.7888,-9.9404,804
5.9662,-10.0404,805
0.6366,-10.1628,807
1.3391,-9.8924,808
0.8263,-10.1079,809
4.0777,-10.0099,810
-0.011,-9.9923,812
0.4386,-9.9672,813
3.0402,-9.9973,814
1.7257,-9.9394,815
-0.9307,-10.1028,817
0.5044,-10.055,818
0.5843,-10.2752,819
-0.6909,-9.9284,820
-0.2254,-10.3477,821
-0.3271,-10.103,822
-0.1661,-10.0291,823
-0.5947,-10.0562,824
-0.3976,-10.0326,825
-1.1967,-9.9583,826
8.1027,-10.0234,828
5.1134,-9.9907,829
7.8234,-10.1563,830
3.7453,-9.9367,831
-0.2065,-9.9311,833
-0.3806,-10.115,834
0.7604,-10.0564,835
3.7616,-10.072,837
0.2705,-10.0364,838
0.1577,-9.9894,839
0.1059,-10.0625,840
-0.1117,-10.0155,842
0.1107,-9.9906,843
0.2595,-10.0426,844
4.2718,-10.1547,845
1.0069,-10.158,847
-0.5844,-9.9238,848
-7.2349,-9.9315,850
1.6762,-9.9312,851
-0.6085,-9.925,852
5.0681,-10.0233,853
3.4381,-10.0504,854
5.2303,-10.0153,855
2.4958,-10.0009,856
1.184,-10.118,858
0.9112,-9.7643,859
-1.5241,-10.0526,860
-0.2813,-9.9932,861
-0.7565,-9.9946,863
-16.2311,-9.9217,864
