AYGX_mean,AZ_mean,timestamp
-0.0026,-9.4919,0
0.0126,-9.4898,1
0.0157,-9.49,2
0.0101,-9.4906,3
0.0119,-9.4909,4
20.5001,-9.5795,5
9.5717,-9.8352,6
-7.973,-9.6532,7
7.1893,-9.6727,8
2.1821,-9.8676,9
3.6732,-9.7115,10
3.7167,-9.3185,67
0.1663,-9.4908,68
2.3738,-9.7311,69
4.2215,-9.7662,70
3.5379,-10.0657,71
0.894,-9.7115,72
2.6735,-9.7798,73
1.5333,-9.7041,74
4.0203,-9.5897,75
2.6892,-9.7932,76
3.1629,-9.515,77
3.3518,-10.205,78
0.1321,-10.1089,79
4.8332,-10.1659,80
1.2069,-10.1861,81
-3.9438,-9.949,82
0.6503,-10.1368,83
0.5037,-9.3885,84
-0.2376,-9.7996,85
-0.0024,-7.9543,86
2.2415,-9.6042,87
1.4465,-8.8771,88
5.5523,-7.6525,89
4.9675,-9.8528,90
2.029,-9.5858,91
2.5181,-9.9064,92
-0.4287,-9.3987,93
1.8958,-9.7121,94
3.9775,-9.8246,95
1.0016,-10.0763,96
4.3056,-9.8474,97
0.645,-9.6975,98
3.033,-9.6357,99
3.1254,-10.0974,100
2.8526,-9.5215,101
0.3377,-9.5969,102
-0.5034,-10.4128,103
4.7018,-10.0,104
1.1822,-9.7597,105
0.186,-10.1052,106
0.7415,-9.7477,107
0.6149,-9.8215,108
-0.9897,-10.1002,109
4.101,-9.8823,110
1.4579,-9.6933,111
2.0683,-9.6307,112
-0.4845,-10.007,113
-1.4569,-9.4663,114
1.3209,-9.8298,115
-2.1352,-9.8423,116
-8.0938,-9.6711,117
-6.7301,-10.4718,118
-32.0715,-4.0451,119
-7.6959,-3.2161,120
13.7594,-2.9162,121
-11.2959,-3.4892,122
-11.4929,-2.7042,123
-2.1674,0.5543,124
-3.1343,-5.8196,125
7.2247,-6.2679,126
15.7461,-8.1361,127
-3.1606,-9.6767,128
-43.6044,-9.1792,129
0.2455,-9.458,130
63.1059,-8.7648,131
-29.9555,-8.7082,132
14.3478,-9.722,133
0.35,-9.8047,134
0.0154,-9.8257,135
0.6509,-9.7363,136
-0.2388,-9.7823,137
-4.2009,-10.2575,138
-18.1584,-9.0485,139
0.8346,-9.6084,140
12.3673,-8.8279,141
4.905,-9.3058,142
28.1643,-9.4938,143
13.5333,-9.8286,144
0.6376,-9.1704,145
8.9449,-9.4172,146
1.3165,-9.3906,147
-1.721,-9.7569,148
-7.983,-9.7636,149
0.7626,-9.8086,150
-0.2058,-9.8283,151
-9.0111,-9.7422,152
6.2839,-9.8145,153
3.9519,-9.9189,154
0.0862,-9.9094,155
10.0346,-9.9738,156
15.6096,-9.5229,157
1.6022,-9.6216,158
7.9313,-9.2875,159
-1.1328,-9.7853,160
0.3974,-9.9579,161
-0.3412,-9.9596,162
3.39,-9.7988,163
-0.4636,-9.9465,164
5.1836,-9.8587,165
2.5936,-9.7635,166
0.6468,-9.8257,167
11.263,-9.8656,168
-0.5362,-8.77,169
2.118,-9.8344,170
-0.2618,-9.9168,171
-0.9742,-9.7681,172
-1.5266,-9.8217,173
0.4934,-9.9764,174
0.4493,-9.7791,175
0.2315,-9.8874,176
1.2789,-9.7337,177
0.2176,-9.7831,178
2.7883,-9.8956,179
-0.7511,-9.8086,180
-0.8459,-9.8254,181
-2.1429,-9.2361,182
0.7193,-9.7455,183
7.6079,-9.8559,184
3.1742,-9.6865,185
0.1188,-9.963,186
10.4355,-9.9259,187
0.9182,-9.6328,188
0.5468,-8.6521,189
1.2332,-9.4412,190
0.9957,-9.6578,191
0.4153,-9.9888,192
2.2272,-9.7857,193
7.5014,-9.6977,194
8.6463,-9.7473,195
0.0751,-9.9904,196
3.1677,-9.8684,197
5.1944,-9.6438,198
4.1242,-9.6041,199
-1.0209,-9.6814,200
4.9251,-9.4652,201
-0.2101,-9.834,202
5.4735,-9.9271,203
0.3078,-10.0903,204
0.9791,-9.442,205
0.1791,-10.0734,206
0.0177,-9.9513,207
0.2549,-9.819,208
-0.0823,-9.8654,209
2.419,-9.8095,210
2.2582,-9.6577,211
1.3932,-9.7855,212
0.585,-9.7794,213
-0.5261,-9.9321,214
0.7137,-9.8164,215
2.5424,-9.6258,216
1.6892,-9.8611,217
2.3265,-9.7903,218
-0.1932,-9.7537,219
4.9443,-9.9396,220
1.944,-10.166,221
6.7436,-9.8735,222
2.2365,-9.8769,223
4.3619,-9.7611,224
3.1098,-9.9064,225
6.3353,-9.8366,226
1.4687,-9.8928,227
-3.0824,-9.4239,228
10.019,-9.9499,229
1.5595,-9.7617,230
-3.8586,-10.0139,231
