AYGX_mean,AZ_mean,timestamp
-1.2359,-9.6729,0
-1.2488,-9.6716,1
-1.2335,-9.6726,2
-1.2245,-9.6725,3
-1.2392,-9.6722,4
-1.3161,-9.6662,2604
-1.3093,-9.6647,2605
-1.3054,-9.6659,2606
-1.3096,-9.6651,2607
-1.3079,-9.6641,2608
-1.3029,-9.6655,2609
-1.3116,-9.6655,2610
-1.3006,-9.6654,2611
-1.3098,-9.6651,2612
-1.3025,-9.665,2613
-1.3005,-9.6657,2614
-1.3139,-9.6652,2615
-1.324,-9.6653,2616
-1.3435,-9.6649,2617
-1.3449,-9.6656,2618
3.6967,-9.667,2619
1.4813,-9.7376,2620
-2.3244,-9.7321,2621
-11.1338,-9.6963,2622
-1.2434,-10.2867,2623
-19.63,-9.2458,2624
-5.2425,-9.4772,2625
21.8586,-9.4495,2626
0.8752,-9.6817,2627
-1.4241,-9.8391,2628
7.4393,-9.7572,2629
-3.2054,-9.7135,2630
0.8327,-9.7736,2632
0.5591,-9.7156,2633
-1.7955,-9.8115,2634
1.061,-9.7235,2635
-0.6521,-9.9313,2636
-1.4269,-9.8405,2637
0.475,-9.8788,2638
-0.1344,-9.839,2639
0.4996,-9.7764,2640
0.0355,-9.7985,2641
0.2166,-9.8612,2642
0.1078,-10.0019,2643
5.7978,-10.63,2644
5.8173,-9.8288,2645
-0.8396,-9.683,2646
-0.4686,-9.7943,2647
-0.8586,-9.7071,2648
2.3077,-9.6683,2649
0.1344,-9.7732,2650
1.3557,-9.7208,2651
-0.787,-9.6249,2652
0.4018,-9.9212,2653
2.229,-10.0279,2654
11.4571,-9.8569,2655
1.865,-9.9285,2656
-0.1682,-9.7858,2657
0.1548,-9.7856,2658
-1.3493,-10.1023,2659
-0.104,-9.3959,2660
-1.5178,-9.6234,2661
-0.0445,-9.8408,2662
-0.9883,-9.6968,2663
2.5674,-9.7773,2664
-0.4244,-9.7187,2665
-0.3009,-9.8636,2666
0.3685,-9.7703,2667
-1.1571,-9.4614,2668
0.0608,-9.7408,2669
0.8658,-9.9775,2670
0.2191,-9.7005,2671
-0.032,-9.917,2672
-0.2443,-9.913,2673
-0.3137,-9.8995,2674
-0.1495,-8.5921,2675
-0.342,-9.8618,2676
-0.0839,-9.6708,2677
0.8711,-9.5694,2679
1.5409,-9.7753,2680
-0.1486,-9.7125,2681
0.6577,-10.545,2682
-10.3652,-9.7311,2683
-92.4145,-9.1216,2684
16.9312,-9.5653,2685
-1.4129,-9.7096,2686
2.8087,-9.7389,2687
0.5989,-9.8175,2688
-10.2034,-9.7686,2689
0.6516,-9.7956,2690
8.4397,-9.5796,2691
-1.2042,-9.7552,2692
0.6863,-9.757,2693
-0.3361,-8.9203,2694
-0.0805,-9.7896,2695
0.2358,-9.7898,2696
15.3349,-9.5556,2697
1.8188,-10.5235,2698
5.5874,-8.1153,2699
6.4029,-9.4047,2700
-0.0448,-9.6657,2701
1.2895,-9.6428,2702
1.1401,-9.2259,2703
2.5682,-9.655,2704
0.5328,-9.784,2705
0.6802,-9.7702,2706
-0.4785,-9.3325,2707
-0.6844,-8.6159,2708
2.901,-9.8188,2709
-0.6506,-9.7932,2710
0.0969,-9.8255,2711
-0.0823,-9.8773,2712
-0.4772,-9.8073,2713
0.0618,-9.3762,2714
-0.0634,-9.3403,2715
2.0528,-9.7518,2716
18.7301,-11.3613,2717
20.8063,-9.5972,2718
-0.3011,-9.8168,2719
-2.1389,-9.652,2720
2.838,-9.2077,2721
0.9858,-9.8822,2722
-0.9829,-9.6538,2723
-0.0925,-9.9546,2724
0.9871,-9.6939,2726
0.2071,-9.8366,2727
0.8717,-9.7864,2728
-0.3497,-9.9952,2729
0.4934,-9.551,2730
-0.3496,-8.6787,2731
1.803,-9.8273,2732
0.1459,-9.6628,2733
0.0878,-9.8235,2734
-2.0156,-10.2395,2735
4.039,-10.3244,2736
7.9799,-9.7378,2737
-1.0366,-9.996,2738
1.3976,-10.0781,2739
0.3508,-9.886,2740
-0.1465,-9.687,2741
1.3087,-9.9249,2742
-0.8167,-9.7218,2743
2.2347,-9.7012,2744
0.0928,-9.6257,2745
-0.8402,-9.7916,2746
-0.3068,-9.5748,2747
-0.2791,-9.8681,2748
1.3987,-9.6966,2749
0.0458,-9.7481,2750
-0.7982,-9.9033,2751
1.1664,-9.7185,2752
-0.573,-9.6236,2753
2.2401,-10.0925,2754
1.0577,-9.7491,2755
1.0095,-9.6635,2756
-1.0548,-9.6992,2757
0.7495,-9.7804,2758
0.028,-9.2724,2759
-0.2185,-9.848,2760
1.0516,-9.9656,2761
1.1173,-9.6057,2762
-0.4831,-9.9311,2763
-0.8213,-9.657,2764
-0.6624,-9.7362,2765
0.113,-9.735,2766
0.9063,-9.5962,2767
2.0577,-10.317,2768
-0.3238,-9.8743,2769
-1.758,-8.7278,2770
-0.7635,-9.761,2772
1.2675,-9.5671,2773
1.0498,-9.8288,2774
0.7623,-9.8004,2775
1.1814,-9.4948,2776
0.4658,-9.7546,2777
0.8314,-8.2274,2778
3.973,-8.3506,2779
0.9433,-10.3545,2780
27.9599,-10.3361,2781
5.193,-9.6826,2782
-0.3891,-9.3728,2783
-1.98,-10.3593,2784
0.0376,-9.7916,2785
-0.0849,-9.7236,2786
-0.039,-9.6152,2787
0.197,-10.3467,2788
0.4794,-9.7136,2789
1.6111,-9.8284,2790
0.6732,-8.3971,2791
-0.1819,-9.7608,2792
-0.6251,-9.4434,2793
-2.2946,-9.8415,2794
3.129,-9.3809,2795
-0.189,-9.663,2796
2.0531,-10.0352,2797
-0.2134,-9.205,2798
-0.1681,-10.062,2799
0.5127,-10.2534,2800
-0.1939,-9.1356,2801
1.4922,-9.9211,2802
0.0224,-9.8053,2803
3.1996,-9.744,2804
-81.3768,-9.0313,2805
3.5064,-8.3759,2806
0.1373,-8.5641,2807
1.1091,-8.4351,2808
13.8356,-8.4861,2809
5.8106,-8.5466,2810
21.455,-9.476,2812
1.5538,-9.5945,2813
1.6353,-9.5938,2814
-0.3401,-9.5959,2815
1.5714,-9.5589,2816
2.4583,-9.57,2817
1.4965,-9.5775,2819
1.6718,-9.5741,2820
1.9397,-9.5763,2821
1.1548,-9.5741,2822
4.5151,-9.5783,2823
0.313,-9.6384,2824
1.6586,-9.5981,2825
1.4935,-9.6203,2826
1.9769,-9.6115,2827
0.2257,-9.6246,2828
1.7713,-9.6113,2829
0.5579,-9.6095,2830
1.1276,-9.6021,2831
1.239,-9.6012,2832
0.834,-9.5938,2833
3.1971,-9.5972,2834
7.1221,-9.508,2835
0.1208,-9.853,2836
-9.733,-9.6628,2837
3.4798,-10.146,2838
-0.685,-9.3333,2839
-0.5259,-9.7477,2840
0.3012,-9.755,2841
2.6623,-9.8933,2842
-0.4216,-9.766,2843
2.7815,-10.2802,2844
0.9025,-10.3614,2845
2.0197,-9.8983,2846
1.4498,-9.6943,2847
0.573,-9.8501,2848
-0.9082,-9.7956,2849
-0.0794,-9.742,2852
-0.4854,-9.7101,2853
0.6046,-9.7393,2854
-0.2773,-9.8889,2855
2.5561,-9.513,2856
0.2405,-10.2406,2857
6.8259,-9.9205,2858
1.3758,-9.7752,2859
-1.6602,-9.9449,2861
0.5851,-9.8454,2862
0.7558,-9.8068,2863
1.7505,-8.949,2864
0.4949,-9.9096,2865
-2.2721,-10.7605,2866
1.7236,-9.6797,2867
0.1029,-9.771,2868
-0.7907,-10.0451,2869
-0.4118,-9.6338,2870
-0.64,-9.6417,2871
0.2344,-9.6317,2872
0.7569,-9.8387,2873
0.5248,-10.0729,2874
-3.4596,-9.7754,2875
-1.5656,-9.7307,2876
11.0283,-9.2382,2877
-4.6713,-8.953,2878
16.4486,-9.8493,2879
-4.2102,-9.6721,2880
-9.2075,-9.9459,2881
-3.6653,-9.8227,2882
10.9878,-9.923,2883
0.1189,-9.5418,2884
4.6756,-8.926,2885
-11.7124,-9.8601,2886
4.4073,-9.7655,2887
3.1598,-9.5771,2888
-10.6091,-9.3931,2889
-3.0291,-9.4817,2890
-2.5376,-9.4851,2891
-2.1771,-9.4829,2892
-2.0262,-9.4791,2893
-2.027,-9.4783,2894
-2.0907,-9.478,2895
-2.0613,-9.4768,2896
-2.0553,-9.4131,3133
-2.3692,-9.4201,3134
-1.9407,-9.4174,3135
-1.0691,-9.4228,3136
15.923,-9.6059,3138
-0.5559,-9.7797,3139
-4.167,-9.4965,3140
-15.0897,-9.5373,3141
24.1236,-9.5546,3142
0.5428,-9.6734,3143
3.1147,-9.8941,3144
2.1484,-10.2423,3145
0.5,-9.7314,3146
-2.0545,-9.8425,3147
0.4034,-9.6065,3148
0.4731,-9.6676,3149
1.8333,-9.7099,3150
3.9934,-9.4971,3151
6.3842,-9.0812,3152
3.309,-9.9852,3153
2.5329,-9.7865,3154
2.292,-9.6312,3155
5.1427,-9.8248,3156
1.421,-9.4749,3157
5.5943,-9.5908,3158
8.3245,-9.1712,3159
3.0788,-10.2358,3160
4.8326,-10.1623,3161
0.4058,-9.4744,3162
-0.8954,-9.6763,3163
-2.0214,-9.6917,3164
-1.6537,-10.0656,3165
0.9303,-9.8208,3166
0.6372,-9.7935,3167
-1.7812,-9.7864,3168
-0.0207,-9.6398,3169
-0.9687,-9.4462,3170
-1.2204,-9.7406,3171
0.4413,-9.783,3172
1.02,-7.0617,3173
0.2731,-9.4821,3174
0.1448,-9.7739,3175
0.8672,-10.0083,3176
-0.2323,-10.473,3177
-0.1285,-10.1473,3178
4.2514,-9.5482,3179
-3.4297,-9.7191,3180
0.2,-9.9501,3181
-1.2065,-10.462,3182
0.1841,-9.5975,3183
-0.5182,-7.2008,3185
1.8566,-9.6711,3186
-3.9019,-9.1833,3187
-0.7816,-9.5158,3188
-3.9743,-10.4341,3189
-1.3579,-9.5972,3190
4.9342,-9.7395,3191
-2.1323,-9.606,3192
-0.1482,-9.7875,3193
1.8531,-10.2759,3194
0.1213,-10.2674,3195
0.5911,-10.1124,3196
-5.9722,-9.9745,3197
0.5739,-9.6682,3198
-1.6538,-9.7832,3199
1.7342,-9.4484,3200
-2.0845,-10.0146,3201
1.1366,-9.7543,3202
0.2457,-9.8622,3203
2.0253,-9.0605,3204
-3.104,-9.8521,3205
0.3984,-9.6889,3206
4.6807,-9.8702,3207
1.3855,-9.769,3208
0.2812,-9.5688,3209
1.6625,-9.8704,3210
-2.2981,-9.6744,3211
-0.2557,-9.7529,3212
0.3071,-9.7855,3213
0.8523,-9.7138,3214
0.8107,-9.8019,3215
1.2064,-9.8755,3216
-0.2122,-9.7186,3217
2.0454,-10.097,3218
2.477,-9.8308,3219
-0.6896,-9.9529,3220
0.2551,-9.5519,3221
-4.4932,-9.7143,3222
0.416,-9.8221,3223
2.1999,-9.8311,3224
0.9429,-9.7899,3225
-0.3131,-9.8447,3226
-1.0131,-10.1163,3227
-0.2073,-9.3198,3228
-1.824,-9.8478,3229
2.8777,-9.6293,3230
-0.5981,-9.702,3232
1.1956,-9.7582,3233
0.4274,-9.5914,3234
0.602,-9.7802,3235
2.3235,-9.8853,3236
0.0986,-9.7028,3237
-0.2508,-9.743,3238
-0.4136,-9.8817,3239
2.7235,-9.6307,3240
0.6551,-9.6758,3241
0.0311,-9.6496,3242
0.2766,-9.7641,3243
0.1764,-9.6768,3244
-0.0583,-9.7186,3245
0.5845,-9.8172,3246
0.6006,-9.8128,3247
0.3491,-9.7532,3248
0.1575,-9.7594,3249
-0.0733,-9.7281,3250
-0.1161,-9.6623,3251
-0.2767,-9.7351,3252
0.7891,-9.7525,3253
1.4397,-10.2158,3254
-0.2965,-10.1498,3255
4.7906,-9.7893,3256
-0.5494,-10.2088,3257
75.5774,-9.2258,3258
0.884,-9.7765,3259
0.256,-9.8287,3260
2.2748,-9.8694,3261
0.3695,-9.7232,3262
0.9068,-9.6722,3263
1.4515,-9.8564,3264
0.3879,-9.8561,3265
0.9641,-9.7724,3266
-0.3045,-10.1334,3267
2.3264,-10.3756,3268
2.805,-9.8506,3269
0.8398,-9.918,3270
1.8936,-9.814,3271
-2.06,-9.0591,3272
0.0318,-9.5695,3273
-0.7207,-9.7397,3274
0.9622,-10.0833,3275
5.8642,-9.4869,3276
-3.1284,-9.642,3278
-1.1689,-9.9863,3279
-0.3832,-9.8469,3280
0.0336,-10.1631,3281
-1.6485,-10.2862,3282
-1.3151,-9.4516,3283
0.3871,-9.3583,3284
0.1883,-9.8591,3285
1.3574,-9.8359,3287
2.0108,-9.6431,3288
-1.1021,-10.0269,3289
2.0038,-9.5736,3290
-0.2937,-10.2447,3291
2.8385,-9.9389,3292
-1.5621,-9.3802,3293
1.8759,-9.7271,3294
0.2607,-9.7649,3295
2.7653,-9.7589,3296
-1.3663,-9.8336,3297
-1.1912,-9.9183,3298
2.9933,-9.9749,3299
-1.6679,-9.703,3300
-1.0773,-9.4722,3301
2.8672,-9.7568,3302
2.0587,-9.7995,3303
0.4227,-9.7705,3304
1.9204,-9.767,3305
0.1753,-9.7512,3306
0.2845,-9.9241,3307
-0.1996,-9.907,3308
0.2382,-9.3468,3309
0.2943,-9.7598,3310
-0.46,-9.8032,3311
-0.3187,-9.7425,3312
-0.4013,-9.8252,3313
-0.3325,-9.693,3314
-0.0321,-9.6406,3315
0.254,-9.8024,3316
0.0796,-9.8965,3317
-0.2948,-9.7762,3318
2.0957,-9.7471,3319
1.9276,-9.869,3321
-1.0272,-9.8002,3322
0.3218,-9.6995,3323
1.5601,-9.7662,3324
0.3404,-9.7941,3325
0.2873,-9.8189,3326
1.1875,-9.7961,3327
0.2834,-9.747,3328
-0.0419,-9.7943,3329
0.889,-9.7782,3330
0.0488,-9.7853,3331
0.076,-9.7588,3332
3.4214,-9.8054,3333
-27.6168,-9.5601,3334
20.8824,-9.4559,3335
1.4257,-9.7121,3336
0.8272,-9.6937,3337
0.8439,-9.6939,3338
-3.7685,-9.6677,3339
-5.1417,-9.5806,3340
4.0676,-9.6489,3341
1.5034,-9.6761,3342
1.6633,-9.6855,3343
2.9127,-9.6775,3344
4.7547,-9.8192,3345
0.1793,-9.6325,3346
-0.1364,-9.7543,3347
2.8451,-9.7865,3348
5.724,-9.7277,3349
2.7872,-10.1662,3350
2.8651,-9.4972,3351
0.2765,-9.8431,3352
0.5587,-9.5971,3353
-0.7413,-8.8028,3354
2.7095,-9.5369,3355
1.9803,-9.7975,3356
-1.676,-9.8548,3357
3.9167,-9.384,3358
0.4661,-9.8303,3359
0.8373,-9.8671,3360
9.3293,-9.4812,3361
8.0812,-9.8304,3362
4.1958,-9.8629,3363
-8.8117,-9.987,3364
0.514,-9.7004,3365
-0.6327,-9.6345,3366
-1.5894,-9.6467,3368
-0.3235,-9.9288,3369
-2.7026,-9.6967,3370
-1.5819,-9.9421,3371
-0.5979,-9.6388,3372
-3.7718,-9.6931,3373
5.6431,-9.8849,3374
10.2839,-9.5887,3375
5.9978,-9.5719,3376
3.6076,-9.6112,3377
0.7598,-10.0855,3378
-0.5321,-9.6994,3379
-0.2849,-10.1431,3380
1.5834,-10.5879,3381
0.0077,-9.6047,3382
-0.3723,-9.6206,3383
-0.2726,-9.7316,3384
-0.664,-9.7456,3385
-1.0965,-9.5038,3386
1.4933,-9.0464,3387
-0.2416,-9.6811,3388
-1.2104,-9.8979,3389
-0.6421,-9.6936,3390
-1.1327,-9.9401,3391
-0.1352,-9.2474,3392
-2.1097,-9.6383,3393
-0.8698,-9.9022,3394
-0.5314,-9.654,3395
2.9361,-8.4961,3396
0.827,-10.1446,3397
3.1102,-9.6457,3398
-2.376,-10.0699,3399
1.1684,-10.0222,3400
0.7446,-9.7689,3401
-0.7843,-10.1854,3402
0.3496,-9.726,3403
-1.0348,-9.9094,3404
-0.3863,-9.6975,3405
-0.2708,-9.7925,3406
-0.6974,-9.5241,3407
-1.7639,-9.815,3408
-1.131,-10.3196,3409
-1.6155,-9.4645,3410
1.2396,-9.8904,3412
-1.022,-9.7459,3414
0.0123,-9.7561,3415
0.3507,-9.8297,3416
-1.0531,-9.7748,3417
0.4004,-9.81,3418
1.7336,-9.8328,3419
-0.92,-9.2471,3420
-0.4957,-9.3729,3421
2.0114,-9.4258,3422
1.3692,-8.8704,3423
-0.3032,-8.8966,3424
0.3567,-9.686,3425
-1.5751,-9.5758,3426
-1.3377,-9.8281,3427
-1.7247,-10.2602,3428
-1.7919,-9.417,3429
-1.7399,-9.8077,3430
0.541,-9.879,3431
-0.7743,-9.6047,3432
1.2803,-9.756,3433
0.547,-9.8398,3434
0.2174,-9.6571,3435
-0.7438,-9.8063,3436
-1.9982,-10.5936,3437
-0.6623,-9.504,3438
0.1618,-9.673,3439
0.3906,-9.4882,3440
0.205,-7.3528,3441
-1.0291,-9.8656,3442
-0.2128,-9.5096,3443
0.9561,-9.8287,3444
-1.411,-9.8551,3445
0.1745,-9.7307,3446
1.064,-9.7982,3447
0.1871,-10.2169,3448
0.277,-9.7094,3449
-0.0686,-9.8451,3450
0.3311,-10.0987,3451
0.219,-9.8178,3452
-0.4711,-9.9174,3453
-0.3354,-9.711,3454
-0.9981,-8.7943,3455
0.1502,-9.5216,3456
0.3034,-9.0678,3457
0.3875,-9.3538,3458
-2.066,-9.2399,3459
-0.3966,-9.7722,3461
-0.1827,-10.0742,3462
-0.7491,-9.7125,3463
-0.6288,-9.7658,3464
-0.0687,-10.207,3465
1.5613,-9.6645,3466
0.9596,-9.8873,3467
0.7858,-9.7599,3468
-0.0032,-10.7291,3469
0.4635,-9.6514,3470
-0.8191,-9.3348,3471
-0.481,-9.4259,3472
-0.0408,-9.4766,3473
-1.469,-9.6755,3474
2.6136,-9.8449,3475
1.3463,-9.7392,3476
-0.4025,-9.572,3477
0.85,-9.7513,3478
-1.2384,-9.7443,3479
0.1614,-10.3395,3480
-1.052,-9.408,3481
-2.2715,-9.1325,3482
-1.0281,-9.5091,3483
-0.5095,-9.3835,3484
0.1621,-9.7721,3485
0.2945,-9.7384,3486
2.3948,-9.8521,3487
-0.3556,-9.9013,3488
-3.6005,-9.8694,3489
-2.8622,-9.7829,3490
-0.3842,-9.7691,3491
-0.0257,-9.9729,3492
0.3079,-9.7801,3493
-0.3001,-9.802,3494
0.8395,-9.7986,3495
0.2248,-9.8368,3496
2.1011,-10.0108,3497
2.538,-9.2131,3498
1.7037,-10.0296,3499
-5.3314,-9.909,3500
0.1996,-9.9499,3501
-0.4453,-8.634,3502
-0.647,-9.7506,3503
-1.7209,-9.6491,3504
-1.1667,-9.7487,3505
-0.6134,-9.6948,3506
-2.2013,-9.3476,3508
6.1883,-9.6605,3509
0.7115,-9.8093,3510
-2.9178,-9.5883,3511
-1.4396,-9.777,3512
-1.3248,-9.8372,3513
0.0977,-9.5739,3514
-0.7023,-9.1096,3515
-1.3937,-9.7137,3516
-2.7008,-9.5696,3517
-3.4398,-9.9952,3518
-1.2676,-9.6349,3519
-1.3694,-9.7124,3520
-1.8791,-9.6369,3521
-1.8755,-9.6351,3522
-2.4822,-9.7173,3523
-0.5582,-9.7433,3524
-1.4672,-9.4342,3525
-0.969,-9.4677,3526
0.577,-8.4506,3527
-1.5206,-10.0586,3528
-1.4778,-9.3833,3529
1.4683,-9.6877,3530
0.0361,-8.9887,3531
-1.2169,-9.193,3532
-0.1755,-9.6531,3533
-2.099,-9.8067,3534
-2.1774,-9.6771,3535
-0.9961,-9.7328,3536
-2.2086,-9.6464,3537
-1.2315,-9.9911,3538
-2.0793,-10.4956,3539
-0.9807,-9.7278,3540
-0.4066,-9.5768,3541
0.5365,-9.6256,3542
-0.0647,-9.8094,3543
-0.0517,-9.7445,3544
0.6171,-9.7911,3545
0.8421,-9.8091,3546
0.351,-9.7454,3547
-0.7567,-9.8244,3548
-2.6209,-9.9827,3549
4.0575,-9.7274,3550
-1.1213,-9.5669,3551
-6.6585,-9.8448,3552
-1.3087,-9.7328,3554
0.8765,-9.7534,3555
0.8801,-9.3622,3556
-1.3918,-9.7436,3557
0.0791,-9.3069,3558
0.6838,-9.6025,3559
1.8661,-10.3197,3560
0.3571,-10.0019,3561
1.7339,-9.5525,3562
-1.954,-9.5845,3563
-0.3515,-9.7027,3564
-0.1121,-9.8056,3565
2.191,-9.5724,3566
-1.1,-9.7891,3567
1.2337,-9.6269,3568
-0.1158,-9.6542,3569
5.2667,-9.6123,3570
-0.4062,-9.7099,3571
0.0926,-9.2499,3572
-1.512,-8.5048,3573
-1.6043,-9.0235,3574
0.5656,-7.2367,3575
-2.0989,-8.1713,3576
-0.3421,-6.4552,3577
2.1492,-10.2,3578
-1.4499,-9.8155,3579
-1.5163,-9.744,3580
-0.582,-9.4285,3581
2.8629,-9.0344,3582
-0.3895,-9.3011,3583
3.0483,-9.681,3584
3.3253,-8.5724,3585
-2.0799,-7.4655,3586
7.622,-9.4057,3587
5.2353,-10.0157,3588
-1.4015,-8.564,3589
-0.7253,-9.048,3590
6.1017,-8.893,3591
2.773,-9.0439,3592
2.2192,-9.0445,3593
0.8902,-10.3315,3594
-0.072,-9.0176,3595
5.6724,-9.1612,3596
-0.8148,-8.422,3597
0.6704,-9.8455,3598
2.6552,-9.8972,3599
12.6986,-8.8096,3601
-1.0479,-9.9611,3602
1.7213,-9.04,3603
6.5332,-9.6718,3604
-0.561,-9.7946,3605
0.7174,-9.4841,3606
-0.9037,-9.6695,3607
3.3,-9.5836,3608
7.198,-9.6921,3609
-1.0981,-8.9608,3610
-0.6958,-8.4323,3611
0.4618,-8.597,3612
-0.7494,-9.3037,3613
2.4199,-9.5552,3614
7.2834,-8.8659,3615
-0.3606,-8.0428,3616
6.3332,-9.0819,3617
2.666,-10.6177,3618
6.8964,-8.6728,3619
1.8683,-7.9772,3620
4.567,-9.5161,3621
-8.8215,-9.6979,3622
2.8738,-9.721,3623
0.9202,-9.6649,3624
1.8062,-9.9007,3625
1.1164,-9.6382,3626
1.9317,-9.7554,3627
-0.1265,-10.8518,3628
-0.5235,-9.3614,3629
2.4589,-9.5224,3630
4.2896,-9.3274,3631
3.6945,-9.7848,3632
5.7582,-9.0626,3633
5.764,-9.3298,3634
4.9263,-9.7519,3635
4.6189,-10.1603,3636
2.8037,-9.8236,3637
-12.2942,-9.2586,3638
-5.1391,-9.3499,3639
-0.0301,-9.4175,3640
-0.856,-10.0028,3641
-0.9705,-10.0335,3642
-0.627,-9.5921,3643
0.4226,-9.7917,3645
-0.9557,-8.5605,3647
-0.0062,-9.7616,3648
-0.2761,-10.006,3649
-3.1996,-9.5875,3650
0.4861,-9.5227,3651
-1.2361,-9.265,3652
-1.2639,-9.8017,3653
-0.9695,-9.5662,3654
-1.3009,-9.9441,3655
-1.3924,-9.8849,3656
-1.8599,-9.8027,3657
-1.656,-9.7029,3658
-0.9239,-9.7935,3659
-2.362,-9.7996,3660
-1.3756,-10.0712,3661
-1.0803,-9.7847,3662
-1.1791,-9.8223,3663
0.402,-9.7294,3664
-0.7657,-9.7516,3665
-1.7319,-9.8063,3666
-1.0209,-9.7282,3667
-1.5773,-9.7018,3668
-0.85,-10.0709,3669
0.0178,-9.7516,3670
-0.7003,-8.6496,3671
-2.6007,-10.2597,3672
-0.37,-9.6253,3673
-0.8712,-9.8793,3674
-0.4808,-9.7002,3675
-0.5586,-9.9256,3676
0.488,-9.4822,3677
-1.484,-9.5567,3678
-0.7557,-9.9128,3679
0.3423,-9.517,3680
-2.0817,-10.2701,3681
-0.3227,-9.7601,3682
-1.7507,-9.8132,3683
-1.1264,-9.7278,3684
-1.2708,-9.7959,3685
-0.8882,-9.8226,3686
-0.8658,-9.754,3687
-1.0396,-9.7033,3688
0.5217,-9.8432,3689
2.3646,-9.3775,3690
-2.3308,-9.7229,3691
-0.6243,-9.7537,3692
-0.4594,-9.8152,3694
-1.4788,-8.4323,3695
-1.1826,-9.7254,3696
-0.7163,-9.8105,3697
-1.679,-9.9011,3698
1.0502,-9.9897,3699
0.2553,-4.626,3700
1.0152,-8.5817,3701
0.4827,-8.7724,3702
-0.2212,-7.7558,3703
0.316,-8.0746,3704
-0.4445,-7.0173,3705
-0.4223,-7.6159,3706
-0.4871,-6.8872,3707
1.111,-7.7817,3708
-1.7476,-6.7877,3709
7.2417,-7.468,3710
11.025,-8.7272,3711
0.7766,-10.1935,3712
0.7128,-9.4316,3713
-1.3977,-9.9394,3714
0.8639,-9.7585,3715
1.1377,-9.7876,3716
-1.3033,-9.8569,3717
0.4865,-10.0496,3718
4.5334,-9.6243,3719
1.6995,-9.6688,3720
-0.995,-10.9584,3721
0.92,-9.4471,3722
4.9965,-9.5385,3723
1.5821,-9.7609,3724
2.2523,-9.9035,3725
3.3363,-9.678,3726
0.5444,-9.7395,3727
2.7545,-10.6582,3728
10.2104,-9.2392,3729
-2.8133,-9.817,3730
1.7014,-9.5352,3731
-1.5083,-9.8136,3732
0.6405,-9.6677,3733
0.2187,-9.446,3734
1.6957,-9.0788,3735
5.9054,-9.7302,3736
14.595,-10.3009,3737
0.8913,-8.837,3738
5.8595,-10.0861,3740
1.3758,-7.4615,3741
-1.4646,-9.6213,3742
13.8888,-9.6521,3743
-0.6201,-9.7991,3744
-3.2423,-6.9457,3745
0.4774,-9.4297,3746
-1.891,-9.4812,3747
2.5387,-9.6191,3748
1.4089,-9.6213,3749
-0.0611,-9.9125,3750
-0.3574,-9.9873,3751
3.0473,-9.9218,3752
5.4612,-9.8387,3753
1.3202,-9.914,3754
3.1872,-9.7068,3755
-0.8217,-9.831,3756
3.9456,-9.8274,3757
0.6797,-9.4736,3758
2.5786,-9.6561,3759
0.7144,-10.5283,3760
1.8067,-9.8577,3761
-4.2227,-8.8636,3762
-2.203,-9.8664,3763
4.0126,-9.6067,3764
1.8124,-9.9294,3765
1.5879,-9.6875,3766
4.7144,-10.0687,3767
3.7462,-9.8931,3768
0.6058,-9.5878,3769
-0.3563,-9.5519,3770
1.3301,-9.9459,3771
-0.7156,-8.2075,3772
0.4229,-10.1423,3773
3.2061,-9.6285,3774
2.2423,-9.8056,3775
0.3175,-9.8364,3776
-10.1313,-9.6351,3777
-24.9852,-9.3075,3778
9.9486,-9.5325,3779
-27.6364,-6.9614,3780
8.5382,-9.4267,3781
1.5948,-9.507,3782
6.6102,-9.7371,3783
-5.7343,-9.768,3785
-2.82,-9.7347,3786
-4.6392,-9.6558,3787
-0.8596,-9.6765,3788
-1.831,-9.7522,3789
6.4922,-9.735,3790
-0.2979,-9.7153,3791
-9.3102,-9.5638,3792
-50.9081,-9.1132,3793
-104.0108,-8.3918,3794
109.9884,-8.8923,3795
3.305,-9.8289,3796
-2.9345,-9.6921,3797
-1.7237,-9.7165,3798
-0.9783,-9.7133,3799
-0.9637,-9.7126,3800
-0.9938,-9.7122,3801
-1.0089,-9.7123,3802
-0.9921,-9.7129,3803
-1.0021,-9.713,3804
-0.992,-9.7126,3805
-0.9849,-9.7133,3806
-0.9923,-9.7137,3807
-0.9932,-9.714,3808
-0.9971,-9.7137,3809
-0.9933,-9.7139,3810
-0.9939,-9.7127,3811
-0.9918,-9.7139,3812
-0.9926,-9.7129,3813
-0.9781,-9.7132,3814
-0.9664,-9.7136,3815
-0.9842,-9.7147,3816
-0.9822,-9.7141,3817
-0.9793,-9.714,3818
-0.9727,-9.7131,3819
-0.9765,-9.7141,3820
-0.9754,-9.7136,3821
-0.9658,-9.7134,3822
-0.9936,-9.714,3823
-0.9929,-9.7143,3824
-0.9816,-9.7137,3825
-0.9828,-9.7146,3826
-0.9917,-9.7148,3827
-0.992,-9.715,3828
-1.0978,-9.7025,11045
-1.0883,-9.7018,11046
-1.0913,-9.7018,11047
-1.094,-9.7016,11048
-1.0866,-9.7015,11049
-1.096,-9.7016,11050
-1.0915,-9.7017,11051
-1.0836,-9.7028,11052
-1.0794,-9.7024,11053
-1.0795,-9.7021,11054
-1.0828,-9.7019,11055
-1.0894,-9.7018,11056
-1.078,-9.7022,11057
-1.0768,-9.7022,11058
-1.0864,-9.7033,11059
-1.0827,-9.7021,11060
-1.0795,-9.7015,11061
-1.0843,-9.7029,11062
-1.0851,-9.7031,11063
-1.0862,-9.7029,11064
5.4381,-9.7644,11065
-0.351,-9.7918,11066
1.4338,-9.7505,11067
-8.5457,-9.6434,11068
-1.4878,-9.6149,11069
-6.9556,-9.6719,11070
13.3272,-9.5305,11071
0.2521,-9.7199,11073
0.6338,-9.7399,11074
-20.503,-9.4271,11075
-4.0772,-9.5953,11076
-24.2626,-8.9765,11077
6.2892,-9.3156,11078
-137.1185,-8.7329,11079
28.3197,-9.2106,11080
-3.273,-9.7527,11081
-55.6279,-9.4673,11082
-5.6515,-9.5463,11083
8.8612,-9.5428,11084
-3.3648,-10.0924,11085
5.7959,-9.2908,11086
1.505,-9.9973,11087
-8.2467,-9.4839,11088
-1.2689,-10.0844,11089
-0.0467,-9.8156,11090
2.9318,-9.8643,11091
-0.6943,-9.7768,11092
1.3923,-9.7936,11093
-0.031,-9.4763,11094
0.025,-9.666,11095
0.0957,-10.1085,11096
1.0765,-9.7807,11097
-0.982,-9.4492,11098
-0.775,-10.1941,11099
32.361,-9.8116,11100
8.6247,-10.4151,11101
3.5268,-9.3299,11102
-1.5687,-9.7607,11103
-1.9297,-9.6799,11104
-0.6448,-9.9828,11105
0.6861,-9.7332,11106
-0.1194,-9.4297,11107
0.238,-9.4463,11108
-0.6659,-9.7094,11109
0.3954,-9.9584,11110
-1.7966,-9.5377,11111
-0.6854,-9.7848,11112
-1.2422,-9.6347,11113
-0.4736,-10.0648,11114
-0.375,-9.7217,11115
-0.3863,-9.1666,11116
-2.4394,-9.8813,11117
2.5775,-10.7947,11118
0.3089,-9.4088,11120
-3.2409,-10.1281,11121
-3.9755,-9.8413,11122
-1.9303,-9.8848,11123
-1.3032,-9.6756,11124
0.2552,-10.0951,11125
-1.7379,-9.8156,11126
0.4805,-9.9164,11127
-0.1602,-9.4027,11128
1.524,-10.063,11129
2.3126,-10.2975,11130
0.5266,-9.6815,11131
-0.9109,-9.9776,11132
0.277,-8.9517,11133
0.2833,-8.8733,11134
1.0894,-7.4814,11135
2.8228,-9.795,11136
-0.0235,-9.9685,11137
-0.8884,-9.8941,11138
-1.7719,-9.7296,11139
4.0863,-9.8614,11140
1.9307,-9.847,11141
0.7036,-9.9147,11142
2.4866,-9.6415,11143
-0.0942,-10.0846,11144
2.2349,-10.1507,11145
0.0356,-10.15,11146
0.2872,-9.7967,11147
0.3106,-9.7428,11148
0.0064,-9.3252,11149
0.5007,-9.5956,11150
0.193,-9.5401,11151
0.2814,-9.6747,11152
-0.1923,-10.2929,11153
-0.4833,-9.8997,11154
0.0652,-9.7621,11155
0.3913,-8.4413,11156
0.0286,-9.3344,11157
0.1369,-10.0702,11158
11.454,-9.9323,11159
24.9489,-9.8419,11160
5.6313,-9.8847,11161
0.8781,-9.8801,11162
1.7428,-9.6917,11163
-1.2225,-10.191,11164
-0.8534,-10.0523,11165
2.1867,-9.8682,11167
0.5875,-10.1467,11168
-0.6893,-9.5492,11169
-2.0945,-9.5322,11170
1.2584,-9.8444,11171
0.4802,-10.1531,11172
-0.6613,-9.7347,11173
-0.1816,-9.3506,11174
-1.9452,-9.3425,11175
3.3653,-10.4039,11176
-0.6693,-9.6627,11177
-0.9298,-9.9901,11178
-2.1235,-9.4901,11179
-1.3585,-9.8728,11180
-1.2418,-9.5528,11181
-0.5285,-9.7367,11182
-0.872,-9.7229,11183
0.9664,-9.7792,11184
0.5768,-9.6546,11185
0.1586,-9.8271,11186
-0.0418,-9.7142,11187
2.1967,-9.798,11188
1.7011,-9.3033,11189
-1.4739,-9.7113,11190
-1.4322,-9.23,11191
-1.9669,-8.6775,11192
0.4229,-9.6928,11193
-1.4692,-9.689,11194
-0.0692,-9.7721,11195
-1.0307,-9.7529,11196
-1.1024,-9.7442,11197
-0.0506,-9.4275,11198
0.5702,-7.7626,11199
-1.4584,-9.7991,11200
-0.5737,-10.0289,11201
-0.5618,-9.8288,11202
-1.0424,-9.7033,11203
-0.8671,-9.7437,11204
0.1699,-9.8691,11205
0.2492,-9.7787,11206
0.2987,-9.8425,11207
0.3304,-9.7935,11208
-0.0411,-9.8527,11209
0.821,-9.8095,11210
0.1419,-9.7904,11211
0.1347,-9.7814,11213
0.457,-9.8053,11214
-11.0934,-9.6728,11215
-27.7584,-9.1425,11216
1.4536,-9.2811,11217
9.2778,-9.3876,11218
13.5163,-9.7054,11219
12.0116,-9.5251,11220
4.7102,-9.8206,11221
8.0081,-9.7228,11222
2.3773,-9.6829,11223
1.3634,-9.8843,11224
-1.0467,-9.7546,11225
-0.6739,-9.6483,11226
-0.4973,-9.7048,11228
-0.1158,-9.804,11229
-1.9083,-9.6139,11230
-0.0632,-9.9973,11231
-2.0187,-9.8688,11232
-1.757,-9.9315,11233
2.1565,-9.4241,11234
-1.2163,-9.9353,11235
-0.4957,-9.6592,11236
-0.9655,-9.843,11237
0.1069,-9.8298,11238
-1.0194,-9.3298,11239
-0.9268,-9.5697,11240
-0.674,-9.8298,11241
0.3698,-9.5952,11242
0.6749,-9.9737,11243
-1.2847,-9.7176,11244
-0.6979,-9.6308,11245
0.1766,-9.8925,11246
2.0966,-9.7986,11247
0.042,-9.619,11248
-0.0129,-10.0539,11249
-0.9055,-9.826,11250
0.1546,-8.1866,11251
1.1784,-9.8448,11252
0.2781,-9.7578,11253
3.714,-9.5291,11254
0.3262,-9.7028,11255
0.378,-9.6882,11256
0.0831,-9.8768,11257
-0.6827,-9.8185,11258
-4.2205,-9.4578,11260
1.755,-9.7955,11261
1.8816,-9.6513,11262
2.7422,-9.8311,11263
1.5276,-9.7569,11264
0.6796,-9.8449,11265
4.8021,-9.3455,11266
2.2142,-9.8494,11267
-0.8265,-10.1828,11268
-1.7751,-9.3174,11269
-1.9196,-9.527,11270
2.0445,-9.1618,11271
-0.7044,-9.8329,11272
-0.1194,-9.488,11274
-0.1246,-9.8648,11275
-0.6026,-9.7945,11276
0.8712,-10.1935,11277
-1.0161,-9.8787,11278
-0.8218,-9.6875,11279
-0.2885,-10.0827,11280
-1.2017,-9.8356,11281
0.7624,-9.8644,11282
0.5085,-9.6928,11283
0.899,-10.1865,11284
3.617,-9.7108,11285
-0.7544,-9.5683,11286
-0.3079,-9.7456,11287
1.9078,-9.9121,11288
-0.8722,-9.5016,11289
-1.2819,-9.4139,11290
0.6254,-9.6713,11291
-0.5098,-8.9849,11292
-1.4003,-9.7855,11293
-1.1521,-9.6053,11294
-0.9904,-9.8176,11295
-1.089,-9.485,11296
-2.2087,-9.8195,11297
-0.2651,-9.7782,11298
1.8361,-9.4955,11299
-2.6748,-9.1158,11300
0.1717,-9.5738,11301
-1.6554,-9.9798,11302
-2.5224,-9.3624,11303
-4.2231,-10.1544,11304
-2.3171,-9.7301,11305
-0.9891,-10.1504,11306
0.2383,-9.6968,11307
0.0448,-9.6101,11308
0.226,-9.9564,11309
-0.1427,-9.6536,11310
-0.0632,-9.9102,11311
0.4933,-9.6138,11312
0.45,-9.7386,11313
0.8555,-9.6523,11314
1.8375,-9.8201,11316
-0.0345,-9.7332,11317
0.0452,-9.6934,11318
-0.3307,-9.6583,11319
1.0054,-10.0757,11320
-0.2334,-9.7311,11321
0.4186,-9.0639,11322
0.5917,-8.9691,11323
0.7855,-8.7056,11324
9.5746,-9.6174,11325
0.9105,-10.009,11326
0.6012,-8.5905,11327
1.2198,-8.379,11328
3.4573,-9.6039,11329
0.1201,-8.4496,11330
-0.4539,-9.7208,11331
-0.0996,-9.062,11332
-0.1497,-7.3469,11333
0.667,-9.7054,11334
0.4259,-9.747,11335
0.1868,-9.7277,11336
0.1292,-9.6178,11337
0.0043,-9.6895,11338
0.2723,-9.9049,11339
0.2452,-9.5236,11340
0.0471,-10.0878,11341
-0.164,-9.8237,11342
-0.0388,-9.7426,11343
0.28,-9.295,11344
-0.0643,-9.8463,11345
-0.0522,-9.6555,11346
-0.1586,-9.7661,11347
0.3813,-9.7405,11348
0.8156,-9.8077,11349
0.0275,-9.621,11350
1.0394,-10.1624,11351
0.0371,-9.8831,11352
-0.3018,-9.0484,11353
0.693,-9.057,11354
-1.064,-6.2191,11355
-0.6094,-7.528,11356
-1.2479,-6.4949,11357
-0.2566,-8.0283,11358
0.0698,-6.8067,11359
-1.0019,-4.8866,11360
-0.2182,-7.4475,11362
-0.4357,-2.6777,11364
-0.2324,-7.3686,11365
0.4173,-6.8475,11366
0.6439,-5.2155,11367
0.1502,-9.3065,11368
0.1704,-9.4459,11369
0.4611,-4.1598,11370
0.8993,-4.9498,11371
0.4667,-6.6047,11372
-0.772,-7.9437,11373
0.044,-9.439,11374
0.0291,-9.3799,11375
-3.5887,-9.6267,11376
-0.7813,-9.7813,11377
-0.1556,-9.5396,11378
0.4617,-8.3517,11379
1.6134,-9.3729,11380
-0.1417,-9.7234,11381
-1.0797,-9.6252,11382
0.2437,-9.7857,11383
1.2472,-10.0502,11384
0.8647,-9.7971,11385
6.4414,-7.4624,11386
-0.0337,-9.7139,11387
-0.1243,-8.9577,11388
-1.2463,-9.8524,11389
0.3008,-10.0853,11390
1.2095,-9.5375,11391
-1.3931,-9.6914,11392
0.927,-9.8199,11393
3.5019,-9.5023,11394
1.1228,-9.7278,11395
-0.4427,-9.7032,11396
-0.1067,-9.7498,11397
-0.6695,-9.6999,11398
-0.3764,-10.2373,11399
-1.2063,-9.7502,11400
-0.6023,-9.8134,11401
-0.8046,-9.9708,11402
-0.8089,-9.9066,11403
-2.4531,-9.7411,11404
0.051,-9.8324,11405
-0.8938,-9.5554,11406
-1.2368,-8.4788,11407
3.5825,-9.7508,11412
5.7389,-8.1032,11413
-2.7353,-10.2236,11414
-1.0492,-9.7014,11415
-1.4499,-9.6438,11416
-0.5999,-9.6405,11418
0.848,-9.7008,11419
-1.3868,-9.4459,11420
0.0497,-9.7944,11421
-1.033,-9.0619,11422
1.7449,-9.6904,11423
4.9191,-10.0801,11424
-1.4525,-9.7084,11425
0.1914,-9.8273,11426
-0.2119,-9.831,11427
-0.7983,-9.7736,11428
0.4615,-8.9697,11429
-0.4562,-9.5607,11430
-1.0388,-9.328,11431
0.8539,-9.8064,11432
-0.0755,-9.8321,11433
0.2211,-9.7262,11434
-0.4722,-9.7548,11435
-1.3073,-9.683,11436
2.4218,-9.7447,11437
-0.0124,-9.8412,11438
-1.3164,-9.4213,11439
-0.5612,-9.9157,11440
2.5857,-10.0372,11441
-0.004,-9.8248,11442
0.5968,-9.7713,11443
1.2003,-9.8664,11444
0.0464,-9.5586,11445
-1.0662,-9.9022,11446
0.0663,-7.3291,11447
1.4611,-8.5295,11448
0.7744,-10.2388,11449
-0.5918,-9.1012,11450
-1.1796,-9.7387,11451
1.3204,-9.4679,11452
-1.8067,-9.4832,11453
-0.7004,-9.7975,11454
-2.2002,-9.9432,11456
-0.7496,-9.8579,11457
-0.4231,-9.6524,11458
8.4532,-9.8242,11459
-1.5791,-9.9821,11460
1.2182,-9.69,11461
-0.5738,-9.7234,11462
0.0597,-9.6664,11463
3.2218,-10.2527,11464
-0.9973,-9.7579,11465
-1.0193,-9.6334,11466
0.2488,-9.6879,11467
3.152,-8.0014,11468
-7.4528,-9.2694,11469
-9.5309,-9.5752,11470
0.0856,-9.5173,11471
-0.5933,-9.7284,11472
-0.051,-9.7321,11473
0.5359,-9.6729,11474
0.623,-9.7877,11475
0.0027,-9.8175,11476
0.3302,-9.7753,11477
0.0132,-9.7474,11478
0.1425,-9.7296,11479
-0.2519,-9.7724,11480
0.6533,-9.8038,11481
0.3169,-9.7674,11482
0.676,-9.7979,11483
0.0504,-9.8461,11484
-1.3277,-9.8335,11485
0.7945,-9.7886,11486
1.2191,-9.876,11487
0.1141,-9.778,11488
-35.8625,-9.3991,11489
8.2271,-9.1802,11490
-7.0919,-9.2767,11491
15.1275,-9.6568,11492
13.9745,-9.7811,11493
3.7435,-9.8687,11494
0.5311,-9.8751,11495
6.0956,-9.5517,11496
0.5779,-9.9159,11497
2.5572,-9.8351,11498
-3.5747,-10.0395,11499
3.0258,-9.7065,11500
-0.8879,-9.6396,11501
-0.62,-9.6751,11503
-0.8982,-9.9541,11504
-1.489,-9.7616,11505
-1.7628,-9.6937,11506
-0.8985,-9.6995,11507
0.8731,-9.6895,11508
6.5277,-10.2702,11509
-2.0347,-9.237,11510
-1.6815,-10.008,11511
-0.1807,-9.7713,11512
-2.0067,-9.8116,11513
-2.4532,-9.7455,11514
-0.9982,-9.7781,11515
-1.1511,-9.6339,11516
-0.7197,-9.6769,11517
1.5662,-9.9231,11518
-0.7552,-9.6433,11519
-0.5292,-9.5641,11520
-0.3018,-9.6744,11521
-1.2638,-9.7875,11522
-0.7324,-9.7809,11523
0.9094,-10.1699,11524
-1.4018,-9.6497,11525
-0.975,-9.9556,11526
-0.2958,-9.8125,11527
-1.6557,-10.0061,11528
1.1775,-9.7599,11529
-1.161,-9.6187,11530
-0.8428,-9.9411,11531
-1.56,-9.6162,11532
-0.1358,-9.8872,11533
0.6087,-9.39,11534
0.3503,-9.7202,11535
0.4249,-10.0191,11536
1.0749,-9.7399,11537
0.5445,-9.8788,11538
2.9987,-9.8919,11539
3.8808,-10.3349,11540
7.4517,-9.6758,11541
1.599,-9.7336,11542
-1.2063,-9.6824,11543
0.4772,-9.6967,11544
1.5014,-9.7879,11545
0.5488,-9.7595,11546
0.4406,-9.842,11547
-0.2242,-9.7553,11548
-0.1678,-9.506,11550
1.5903,-10.4585,11551
0.9475,-9.7182,11552
7.0479,-10.2554,11553
4.9498,-9.7495,11554
-0.5618,-10.1277,11555
6.7964,-9.8273,11556
1.4745,-9.8349,11557
0.6025,-9.7181,11558
-0.2148,-9.7657,11559
0.5983,-9.7062,11560
2.1896,-9.8703,11561
1.5529,-9.7568,11562
0.2533,-9.8668,11563
0.2247,-9.421,11564
0.5735,-9.7158,11565
1.1843,-9.8627,11566
2.3214,-9.7222,11567
1.238,-9.7123,11568
0.0081,-9.7876,11569
0.9059,-9.9836,11570
0.0421,-9.6864,11571
0.5099,-9.7732,11572
1.0151,-9.7428,11573
0.3149,-10.0369,11574
1.4494,-9.6784,11575
1.182,-9.7952,11576
0.7218,-9.7663,11577
1.3971,-9.6232,11578
1.0565,-9.6331,11579
0.7053,-9.8213,11580
1.048,-10.0624,11581
0.2347,-9.7849,11582
-0.5714,-9.9412,11583
-0.5907,-10.0159,11584
0.0026,-9.7253,11585
0.1398,-9.8371,11586
-0.0941,-9.8312,11587
3.1802,-9.2502,11588
-2.4344,-9.4303,11589
-0.1486,-9.3044,11590
0.3255,-9.6163,11591
2.9017,-9.4219,11592
1.2366,-9.9853,11593
0.1971,-9.8004,11594
-0.3069,-9.8789,11595
-0.0049,-9.8031,11597
-0.7222,-9.7964,11598
0.8666,-9.5668,11599
-0.2538,-9.7189,11600
0.2452,-9.8021,11601
-0.1096,-9.7907,11602
0.0222,-9.7577,11603
0.8811,-9.8565,11604
-0.4504,-9.8103,11605
-0.3433,-9.813,11606
0.8305,-9.7907,11607
1.2365,-9.74,11608
-0.4133,-9.7547,11609
-1.0214,-10.0166,11610
9.1644,-9.7949,11611
-0.0604,-9.818,11612
0.5897,-9.7455,11613
0.3021,-9.6891,11614
-0.5478,-9.7879,11615
-0.1524,-9.8141,11616
1.6901,-9.8428,11617
-0.2113,-9.7993,11618
-0.1739,-9.7472,11619
-1.3352,-9.7324,11620
-0.1452,-9.7987,11621
0.1584,-9.8249,11622
1.1394,-9.7753,11623
1.7708,-9.834,11624
2.566,-9.8211,11625
0.7518,-9.8235,11626
1.3922,-9.5876,11627
-0.5124,-9.7852,11628
-1.5357,-10.5383,11629
-0.6603,-10.6199,11630
9.1372,-9.6575,11631
1.5315,-9.7334,11632
-1.6878,-10.0772,11633
-0.0228,-9.636,11634
-1.7585,-9.888,11635
0.787,-9.7338,11636
2.9121,-9.9705,11637
7.1596,-8.8864,11638
-2.7079,-10.0996,11639
5.7011,-9.8611,11640
-1.6525,-8.855,11641
0.7371,-9.8052,11643
0.1949,-9.842,11644
6.4419,-9.7157,11645
4.7377,-9.7838,11646
-3.4217,-9.559,11647
0.7377,-10.031,11648
-0.5796,-9.4998,11649
-1.0037,-10.5551,11650
1.0042,-9.7197,11651
-0.4322,-9.9154,11652
-2.0045,-9.6651,11653
-0.0598,-10.6297,11654
-0.8716,-9.0271,11655
7.5691,-8.0131,11656
9.0155,-9.8866,11658
0.0466,-9.6067,11659
0.0394,-9.2182,11660
1.7969,-9.8263,11661
2.7601,-9.5746,11662
1.2368,-9.7244,11663
4.8883,-9.9879,11664
-0.3769,-9.7573,11665
2.1616,-9.8645,11666
0.5347,-9.785,11667
1.2856,-9.746,11668
0.9322,-9.9904,11669
-0.9523,-9.8343,11670
-0.4599,-9.7626,11671
-0.3707,-9.7493,11672
7.1249,-9.8123,11673
1.1832,-9.9125,11674
0.1307,-9.9067,11675
-1.1109,-9.1484,11676
0.3186,-9.8099,11677
0.8686,-9.8467,11678
2.5712,-9.6672,11679
0.0241,-9.7444,11680
1.0062,-9.6508,11681
-4.9403,-9.783,11682
23.0349,-9.411,11683
3.3332,-9.579,11684
3.7577,-8.7285,11685
1.4534,-9.6803,11686
7.0233,-9.7242,11687
2.8699,-9.6969,11688
-7.4783,-9.9218,11690
8.7828,-10.1148,11691
3.6116,-9.8759,11692
-0.5935,-9.8512,11693
5.5992,-9.5115,11694
-1.1849,-9.8376,11695
0.5026,-9.7635,11696
-3.8739,-9.5874,11697
-24.8516,-9.5019,11698
-0.4105,-9.4383,11699
-3.2934,-9.4657,11700
-2.3866,-9.4737,11701
-2.2456,-9.4802,11702
-1.9656,-9.4813,11703
-1.9606,-9.483,11704
-2.0028,-9.4818,11705
-2.0305,-9.4822,11706
-2.0145,-9.4823,11707
-2.0095,-9.4821,11708
-2.0429,-9.4804,11709
-2.0281,-9.4816,11710
-2.0254,-9.4819,11711
-2.0083,-9.4827,11712
-2.0226,-9.4827,11713
-2.0532,-9.4805,11714
-2.035,-9.4824,11715
-2.0285,-9.4817,11716
