AYGX_mean,AZ_mean,timestamp
1.1317,-9.5502,10
1.1447,-9.5459,11
0.6284,-9.5326,13
1.0294,-9.5434,14
1.5732,-9.5343,15
22.204,-9.5679,16
-2.3008,-9.8083,17
-0.6867,-9.8153,18
-17.3811,-9.4654,19
30.478,-9.516,20
3.6936,-9.7195,21
2.6789,-9.7674,22
0.6335,-9.8004,23
-1.2943,-9.806,24
0.0014,-9.8104,25
0.7284,-9.8137,26
1.1743,-9.7728,27
2.3048,-9.7791,28
1.9416,-9.8595,29
-1.4094,-9.7473,30
