AYGX_mean,AZ_mean,timestamp
0.0538,-9.8074,14
-0.3032,-9.8011,15
-0.32,-9.8098,16
0.082,-9.7638,17
-0.1667,-9.8177,18
0.1132,-9.8054,19
-0.1376,-9.7885,20
-0.1087,-9.8052,21
1.3962,-9.8134,22
-11.6266,-9.0155,23
19.7926,-9.3135,24
9.3333,-9.6572,25
3.0821,-9.7421,26
-7.2176,-9.774,27
3.7669,-9.7293,28
-4.6958,-9.7349,29
1.2231,-9.7678,30
-0.5015,-9.7611,31
-0.0049,-9.7618,32
0.0696,-9.7567,33
-0.0954,-9.757,34
