AYGX_mean,AZ_mean,timestamp
0.9262,-9.8892,457
4.253,-9.9043,458
-1.2869,-9.8208,459
-0.6532,-10.0454,460
-3.1963,-10.1521,461
0.1492,-10.0138,462
3.6907,-9.8216,463
3.8117,-9.8062,464
-0.323,-10.1398,465
-0.8711,-9.9047,466
-0.8231,-9.7353,467
-0.6959,-9.8125,468
-0.8454,-9.1702,469
-0.6078,-9.8657,470
0.3727,-9.8665,471
-0.2631,-9.6663,472
-0.0756,-9.8591,473
-0.2908,-9.7736,474
-1.8247,-9.8702,475
0.4572,-9.8443,476
0.0984,-9.8315,478
1.5633,-9.923,479
7.0774,-9.888,480
1.9521,-9.9079,481
4.287,-9.5391,482
1.2683,-9.6504,483
1.2917,-9.8458,484
-0.0935,-9.9116,485
-2.0407,-9.7419,486
-0.2939,-9.834,487
0.2723,-9.8637,488
-0.0552,-9.6901,489
-1.5673,-9.7023,490
-0.1926,-9.7711,491
-0.7373,-9.6941,492
-0.4717,-10.0281,493
-0.4117,-9.8546,494
-2.1585,-9.941,495
-0.0002,-9.832,496
-0.0794,-9.8009,497
-0.5631,-9.823,498
-0.0478,-9.8586,499
-0.2711,-9.8386,500
0.1565,-9.7699,501
-0.6565,-9.753,502
12.3548,-9.8729,503
4.233,-9.9839,504
0.28,-10.2587,505
1.9354,-9.7845,506
-1.2876,-9.8091,507
-2.1457,-9.8977,508
-0.8379,-9.8494,509
0.1289,-9.8519,510
0.3175,-9.8211,511
-0.2232,-9.7704,512
-0.5982,-9.8569,513
-0.0365,-9.8436,514
4.5904,-9.7585,515
-0.1385,-9.7869,516
0.4645,-9.776,517
0.9979,-9.9988,518
-0.2774,-9.6596,519
-0.2823,-9.7928,520
-0.2663,-9.9187,521
0.499,-9.7285,522
-0.4505,-9.7578,523
-0.69,-9.8733,524
-0.9782,-9.8274,525
-0.589,-9.8572,526
0.0169,-9.8659,527
-0.5288,-9.8495,528
-0.1288,-9.8098,529
0.2925,-9.883,530
-2.7145,-9.8711,531
0.4103,-9.8012,532
-0.4473,-9.9647,533
0.3263,-9.733,534
0.2555,-9.9504,535
0.1442,-9.8773,536
1.4602,-10.0503,537
-1.8753,-10.2892,539
-1.1811,-9.9041,540
2.1191,-9.7323,541
7.9849,-9.1729,542
4.792,-9.073,543
-0.9416,-9.6285,544
-2.251,-9.7919,545
0.2401,-9.8102,546
2.6949,-9.6858,547
-1.0039,-9.779,548
-0.8277,-9.8635,549
-0.3642,-9.7756,550
-2.3059,-9.8843,551
23.609,-9.2227,552
4.4718,-9.0479,553
-0.085,-9.7025,554
-1.3664,-9.8479,555
-1.5416,-9.5061,556
-1.5808,-9.9026,557
-0.4414,-9.7729,558
-0.7646,-9.8854,559
-3.7227,-9.812,560
-2.0503,-9.856,561
0.3634,-9.8523,562
0.0372,-9.8012,563
0.1536,-9.9373,564
-3.2116,-9.9313,565
-1.8449,-9.9536,566
-0.9602,-10.1149,567
-0.909,-10.225,568
-0.0245,-9.9434,569
0.7602,-10.0229,570
0.2568,-9.8965,571
-0.5487,-9.6288,572
1.2127,-9.7227,573
-0.9068,-9.8947,574
-1.2397,-9.7361,575
-1.1495,-9.8195,576
-0.152,-9.9801,577
-0.3395,-9.8441,578
-0.5875,-9.7552,579
-0.1127,-9.7501,580
0.7843,-10.013,581
-0.6613,-9.6922,582
0.123,-9.745,583
-0.2857,-9.8907,584
0.7196,-9.8607,585
0.3214,-9.953,586
6.8754,-9.7991,587
1.3611,-10.2867,588
-0.829,-10.2042,589
-1.7975,-9.8241,590
-3.1337,-9.376,591
-0.4163,-9.7338,592
-0.1374,-10.2207,593
-0.2664,-9.5272,594
0.7186,-9.8149,595
-0.4085,-9.8339,596
0.8509,-9.811,597
0.391,-9.6289,598
-0.603,-9.8993,599
0.5047,-9.9336,600
0.0043,-9.7009,601
-0.1878,-9.8018,602
-0.2906,-10.3956,603
0.4544,-9.8484,604
0.768,-9.8908,605
1.1053,-9.7945,606
-1.368,-10.0214,607
2.7159,-9.8844,608
3.1153,-9.8356,609
-1.1347,-9.8538,610
1.485,-9.8154,611
1.8525,-9.7636,612
-4.0178,-10.0841,613
-0.956,-9.7067,614
-0.3183,-9.8974,615
8.8566,-9.9218,616
14.7968,-9.8895,617
9.2548,-9.6631,618
3.2971,-9.8539,619
0.574,-9.8053,620
0.18,-9.9114,621
0.0833,-9.7943,622
0.0159,-9.1784,623
2.8975,-9.716,624
-0.8219,-9.9665,625
0.0803,-9.7328,626
-0.1202,-9.8754,627
-0.0367,-9.8238,628
0.4671,-9.8399,629
0.0556,-9.865,630
-0.4817,-9.8424,631
0.7864,-9.8571,632
-1.6585,-9.7677,633
-1.7804,-9.8532,634
0.1068,-9.7576,635
-0.6092,-9.6464,636
13.1519,-10.0972,637
1.1099,-9.5682,638
1.7909,-9.5465,639
-0.7957,-9.7492,640
3.5686,-9.8265,641
2.7639,-9.8692,642
0.4547,-9.8275,643
2.9289,-9.9701,644
3.7069,-9.795,645
0.2166,-9.8914,646
0.4518,-9.8172,647
-23.1405,-9.6815,648
5.0799,-9.8856,649
0.6401,-9.7963,650
