AYGX_mean,AZ_mean,timestamp
3.9987,-9.8846,270
3.4029,-9.8361,272
3.4646,-9.7389,273
-0.628,-9.845,274
1.347,-9.8345,275
15.1593,-9.834,277
1.4481,-10.1552,278
-0.2823,-9.9534,279
48.7126,-9.8854,280
3.5646,-9.7785,282
18.7228,-8.8541,283
1.0235,-9.8686,284
0.3846,-9.9075,285
-0.4369,-9.8619,287
0.7549,-9.8352,288
0.0104,-9.8715,289
-0.0604,-9.8324,290
