AYGX_mean,AZ_mean,timestamp
0.5381,-9.7452,374
-0.5239,-9.7393,375
3.2515,-10.1519,376
-0.5567,-10.1259,377
31.2006,-9.9991,378
-0.7249,-9.7765,380
3.4662,-9.9556,381
1.9868,-9.7174,382
5.6402,-9.9627,383
75.0404,-10.1225,384
-2.9101,-9.7809,385
4.9023,-9.8472,386
-2.6018,-10.1693,387
32.8263,-9.8062,388
-1.1366,-9.9588,389
4.6073,-8.3352,390
3.5473,-9.8765,391
1.4293,-10.1869,392
3.6721,-9.9685,394
