AYGX_mean,AZ_mean,timestamp
-0.0303,-9.7667,600
-0.03,-9.7695,601
-0.0298,-9.7664,602
-0.0299,-9.7666,603
-0.0305,-9.7681,604
-0.0295,-9.7675,605
-0.0325,-9.7678,606
-0.0304,-9.768,607
-0.0297,-9.7667,608
-0.0308,-9.7677,609
-0.0304,-9.7657,610
-0.0326,-9.7668,611
-0.0305,-9.7663,612
-0.0305,-9.767,613
-0.0301,-9.7675,614
-0.0312,-9.7668,615
-0.0303,-9.7673,616
-0.071,-9.7505,617
0.2415,-9.7685,618
-42.5213,-9.3548,619
