AYGX_mean,AZ_mean,timestamp
2.3744,-9.6353,0
-13.5966,-9.4333,2
-3.1787,-9.493,3
-3.351,-9.5003,5
4.8186,-9.5908,6
-3.7391,-9.6046,8
1.3107,-9.6208,9
0.4459,-9.629,10
1.6682,-9.63,11
-2.0182,-9.6225,12
0.723,-9.6237,13
-1.5716,-9.6114,14
-0.3367,-9.6093,15
-0.8554,-9.6241,16
-0.5356,-9.6261,17
-0.3073,-9.6196,18
-0.296,-9.6191,20
-0.3592,-9.6247,21
-0.5655,-9.6233,22
-0.6774,-9.6258,23
-0.4494,-9.6296,24
-0.7443,-9.6303,25
-0.7011,-9.6267,27
-0.1086,-9.6321,28
-0.2016,-9.6403,29
-0.8558,-9.6331,30
0.5476,-9.6359,31
0.4953,-9.6348,32
-1.4122,-9.6277,33
0.3545,-9.6372,34
-0.8913,-9.6395,35
-0.4329,-9.6332,37
-0.5123,-9.6332,38
-0.4093,-9.6307,39
-0.1558,-9.6197,40
0.246,-9.6441,41
-0.1502,-9.6407,42
-1.4765,-9.5889,44
-9.345,-9.5466,45
1.0599,-9.6192,47
0.2654,-9.6356,48
0.2859,-9.6214,49
-4.7441,-9.6449,50
2.0847,-9.6253,51
1.8919,-9.6376,52
0.2554,-9.6309,53
0.6774,-9.5913,54
1.6731,-9.647,55
-0.9122,-9.6348,57
-1.9207,-9.6071,58
3.8964,-9.5921,59
-0.1607,-9.645,60
0.0961,-9.6381,61
0.4412,-9.6466,62
0.1236,-9.6623,63
-0.4453,-9.6492,64
0.0348,-9.6389,65
-5.5166,-9.5565,67
0.1209,-9.6398,68
-0.0735,-9.6415,69
-1.2476,-9.649,70
-0.1166,-9.6418,71
0.1224,-9.6549,72
-0.4823,-9.6338,73
-0.4983,-9.6373,74
0.1689,-9.6377,75
0.0708,-9.61,76
-1.0013,-9.6128,77
-0.2943,-9.655,78
-5.261,-9.5867,79
-0.3299,-9.6225,81
1.4469,-9.6108,82
-0.9517,-9.6736,83
3.1651,-9.6379,84
18.8542,-9.4346,85
-3.0257,-9.5777,87
0.4128,-9.6266,88
1.5361,-9.6291,89
3.7181,-9.6451,90
2.3727,-9.6479,91
3.0736,-9.6787,93
2.3781,-9.8417,94
9.0134,-9.5296,95
0.0826,-9.6909,96
-1.3538,-9.6472,97
-0.0963,-9.6596,99
-0.139,-9.6217,100
0.5445,-9.6088,101
0.74,-9.6505,102
0.0989,-9.7307,103
1.8586,-9.6153,104
10.4821,-9.5696,105
-0.9783,-9.4996,106
1.0042,-9.8973,108
-1.7833,-9.5847,109
2.5106,-9.6181,110
2.3619,-9.7839,111
0.4595,-9.8482,112
-0.2166,-9.4926,113
0.0292,-9.6515,114
0.7517,-9.7805,115
2.1748,-9.4797,116
2.5033,-9.6889,118
1.6498,-9.703,119
0.0583,-9.6309,120
2.2496,-9.7279,121
-2.1269,-9.503,122
13.364,-9.4924,123
0.2644,-9.6766,124
10.7444,-9.7245,125
0.482,-9.7265,126
1.1292,-9.7134,128
2.4759,-9.6406,130
5.232,-9.7515,131
1.297,-9.7089,132
5.1358,-9.63,133
4.4167,-9.3721,134
-1.8838,-9.63,135
12.7288,-9.9652,136
0.5474,-9.6902,138
4.8148,-9.7502,139
-0.1013,-9.9014,140
3.9328,-9.5429,141
0.0345,-9.8694,142
4.3805,-8.8551,143
3.4617,-9.9053,144
-3.5748,-9.727,145
1.188,-9.1733,146
5.3289,-9.6646,148
3.6308,-9.7126,149
1.4082,-9.7326,150
-3.1154,-9.7279,151
-0.4189,-9.5416,152
-2.552,-9.6993,153
1.209,-9.5271,154
8.8341,-9.6339,155
4.5842,-9.7577,158
-1.0918,-9.598,159
0.0293,-9.6153,160
1.9749,-9.7593,161
0.2883,-9.7859,162
2.2005,-9.5991,163
6.251,-9.611,164
-0.0147,-9.7661,165
0.1279,-10.2135,166
2.6601,-8.8571,168
2.1749,-9.7122,169
4.1192,-9.5323,170
38.8764,-9.4056,171
4.924,-9.124,172
3.9257,-9.5779,173
0.2556,-9.8067,174
7.9329,-9.6232,175
8.6338,-9.7765,176
5.5563,-9.6778,177
3.8939,-9.2056,178
-3.9616,-9.4027,179
3.7566,-8.8593,180
6.2095,-8.3512,181
8.9909,-10.123,182
-0.5254,-9.3771,183
6.2775,-9.3885,184
-1.9259,-9.6899,185
11.982,-9.7407,186
-0.8737,-9.7554,187
-0.6991,-9.5429,188
9.817,-9.7008,189
6.6106,-9.6327,190
7.9772,-9.6228,191
4.6174,-9.6885,192
5.9272,-9.7213,193
2.7046,-9.6602,194
6.34,-9.6669,195
7.9044,-9.619,196
-1.9685,-9.4381,197
1.9938,-9.5921,198
0.4412,-9.6796,199
-1.027,-9.9236,200
2.5026,-9.6147,201
23.417,-10.0706,202
25.5897,-9.6013,203
3.959,-9.697,204
-0.497,-9.519,205
6.5582,-9.4069,207
6.0482,-9.6444,208
28.6925,-10.0126,209
5.4231,-9.4707,210
2.1589,-9.718,211
3.4551,-9.4601,212
19.1816,-9.4118,213
0.3259,-9.6508,214
1.6489,-9.6703,215
10.6781,-9.5037,217
2.9773,-9.6649,218
0.7883,-9.5027,219
6.9934,-9.7887,220
5.3387,-9.684,221
6.6282,-9.5863,222
3.5059,-9.6169,224
16.0364,-9.786,225
3.5227,-10.1087,227
8.8286,-9.6086,228
19.1874,-9.769,229
10.4436,-9.4852,230
3.2343,-9.8232,231
6.5807,-9.4903,232
5.1433,-10.0902,233
8.3012,-9.6172,234
8.609,-9.7681,235
1.1662,-9.5284,237
3.652,-9.6036,238
8.7069,-9.7703,239
9.031,-9.7313,240
28.8996,-9.4199,241
2.5437,-9.7372,242
-1.2235,-9.6549,243
4.2767,-9.3766,244
6.1311,-9.6613,245
10.1016,-9.7454,247
8.0623,-9.7275,248
0.5541,-9.67,249
5.4567,-9.6587,251
6.9303,-9.7043,252
16.1483,-9.4282,253
3.7534,-9.7267,254
4.087,-9.0633,255
-3.6376,-9.9291,257
8.8213,-9.6314,258
2.6929,-9.4483,259
17.5158,-9.2958,260
1.1457,-9.0994,261
11.0926,-9.6401,262
1.8561,-9.4762,263
-0.9361,-9.4881,264
0.5949,-6.2074,265
1.2456,-9.6852,267
15.2601,-9.6613,268
3.5209,-9.6259,270
15.5513,-9.7127,271
12.3076,-9.5162,272
33.0127,-9.8113,273
4.7178,-9.7162,274
5.526,-9.6893,275
7.965,-9.6741,277
5.1788,-9.6835,278
3.0136,-9.6108,279
15.3404,-9.5782,280
2.2594,-9.9242,281
18.5139,-9.9182,282
4.694,-9.5947,284
7.9101,-9.6345,285
9.8993,-9.7288,287
4.0875,-9.659,288
15.0196,-9.63,289
-3.2062,-9.7761,290
1.3161,-9.8419,291
0.8923,-9.0597,292
0.9917,-9.5661,293
5.0511,-9.6533,294
-1.6803,-9.7252,295
1.6222,-9.7283,297
6.9399,-9.3654,298
3.7763,-9.9149,299
0.124,-9.5638,300
5.9744,-9.5632,301
5.8051,-9.4171,302
4.5715,-9.6538,303
11.3693,-9.721,304
2.5016,-9.819,305
34.9196,-10.3491,306
5.4529,-9.7229,308
7.0824,-9.5513,309
9.2256,-9.4728,310
19.4137,-9.5989,311
7.0323,-9.7953,312
-0.2186,-9.8508,313
7.7341,-9.7682,314
0.7391,-9.6483,315
-0.3569,-9.5334,317
9.4955,-9.3104,318
1.6273,-9.8468,319
4.0376,-9.5567,320
18.881,-9.6813,321
6.3954,-9.4624,322
0.8932,-9.6937,323
14.5417,-9.6539,324
3.8471,-9.6915,325
-0.6696,-8.8871,327
4.5155,-9.6926,328
6.9367,-9.5647,329
-0.4334,-9.7202,330
18.3471,-9.7144,331
5.682,-9.7176,332
6.7934,-9.4876,333
0.7936,-10.0466,334
9.5102,-9.711,335
7.0352,-9.5466,337
3.2098,-9.6882,338
2.9611,-9.6778,339
-1.4831,-9.5968,340
5.9279,-10.2355,341
1.6955,-9.4571,342
9.2032,-9.6165,343
1.062,-9.5661,344
4.9434,-9.6989,345
0.1365,-9.7091,347
2.1316,-9.6638,348
1.1642,-9.5723,349
-1.0722,-9.8062,350
12.7905,-9.0993,351
-1.8572,-9.838,352
3.133,-9.8811,353
4.2714,-9.5898,354
-1.3814,-9.7513,355
1.54,-9.723,357
-0.7565,-9.821,358
10.535,-9.6836,359
14.8153,-9.5724,360
-1.6128,-9.832,361
4.6829,-9.5152,362
5.5346,-9.6371,363
2.7167,-9.7254,364
20.3607,-9.4167,365
11.7006,-9.7669,367
9.54,-9.8592,368
5.2464,-9.5812,369
6.7727,-9.7154,370
2.4778,-9.6927,371
0.2023,-9.55,372
0.8704,-9.6447,373
3.6415,-9.9968,374
-0.6205,-9.9474,375
0.2895,-8.2115,377
2.7296,-9.6529,378
1.1603,-9.5358,379
3.6694,-9.7276,380
9.7963,-8.3793,381
-1.1575,-9.3508,382
53.3449,-9.6008,383
15.6294,-9.6004,384
0.4356,-9.8542,385
9.3836,-9.4771,386
1.0994,-9.8409,388
3.5437,-9.7044,389
3.5927,-9.6241,390
4.9767,-9.7715,391
10.4553,-9.2156,392
0.7821,-9.3929,393
1.6592,-9.6959,394
0.9177,-9.8447,395
19.388,-9.8725,396
7.7351,-9.6826,398
12.7508,-9.4383,399
1.6552,-9.4094,400
7.2903,-9.4447,401
-0.3823,-9.7384,402
5.2557,-9.6174,403
1.1097,-9.821,404
14.6884,-9.7476,405
-0.7905,-9.7446,406
8.8465,-9.8232,408
4.8046,-9.5942,409
-0.0529,-9.6663,410
4.6001,-9.7222,411
22.1963,-9.7689,412
1.3039,-9.8229,413
1.6668,-9.6344,414
1.6377,-9.5001,415
3.4732,-9.3458,416
2.305,-10.0932,418
7.163,-9.6464,419
1.901,-9.8792,420
18.0897,-9.7482,421
-10.5171,-9.3829,422
1.0183,-9.7298,423
-1.4218,-9.9142,424
1.6111,-10.0962,425
-2.6219,-8.7316,426
-4.6566,-9.3814,427
3.7963,-9.8781,428
0.705,-9.822,429
32.2959,-9.4284,430
5.2016,-9.1526,431
-0.4348,-10.0721,432
6.5622,-9.8964,433
2.9546,-9.5125,434
0.497,-9.4464,435
3.1164,-9.5174,436
13.2963,-9.8854,437
-5.9267,-9.9724,438
1.0404,-9.5988,439
8.7949,-9.7015,440
11.1102,-9.5423,441
0.4787,-9.6891,442
10.396,-9.6887,443
11.6175,-9.6344,444
17.4311,-9.7037,445
52.9706,-9.7626,446
8.2713,-9.8844,447
5.9422,-9.7211,448
-0.1075,-9.6076,449
1.1403,-9.6158,450
0.5345,-9.7345,451
4.9325,-9.6414,452
12.3306,-9.6363,453
1.2064,-8.9411,454
3.4029,-9.789,455
6.1364,-9.4863,456
12.4554,-9.8022,457
-1.2836,-9.4221,458
9.5361,-9.6559,459
-2.6567,-9.4793,460
4.3915,-9.4614,461
0.9913,-9.6368,462
3.3126,-9.5353,463
4.6437,-9.6172,464
1.1655,-9.7998,465
9.8596,-9.5354,466
1.1985,-8.9724,467
0.7849,-9.5176,468
-0.6916,-9.4504,469
4.7253,-8.9577,470
-1.4695,-9.6978,471
-16.1952,-9.4966,472
-7.5334,-9.3535,474
3.4091,-9.6272,475
-9.3069,-9.554,476
24.4902,-9.2949,477
1.3056,-9.3213,478
3.8323,-9.5225,479
0.3387,-9.5221,480
0.7954,-9.5324,482
0.547,-9.5203,483
0.6915,-9.5306,484
0.0021,-9.5224,485
0.034,-9.4929,486
-0.2854,-9.4863,487
-1.6638,-9.4548,488
0.8294,-9.4438,489
0.9074,-9.4347,490
0.4481,-9.424,491
0.1094,-9.4327,492
0.702,-9.4059,493
-0.5602,-9.3938,495
0.9935,-9.3565,496
5.0875,-9.4682,497
-2.4449,-9.4832,498
4.7688,-9.4809,499
0.2485,-9.5129,500
-0.0605,-9.4687,502
0.7285,-9.4761,503
-3.2352,-9.4622,504
-3.7036,-9.4395,505
4.8075,-9.4176,506
-1.8538,-9.4459,507
0.6016,-9.3317,508
10.5264,-9.1813,509
9.3826,-9.5444,510
-0.1108,-9.6121,512
0.605,-9.6421,513
0.6015,-9.6438,514
0.1736,-9.6354,515
-3.7107,-9.624,516
-8.6232,-9.6114,517
2.4424,-9.5005,518
17.2182,-9.4468,519
-0.0972,-9.637,520
0.5551,-9.6173,521
0.9121,-9.6563,522
-0.5645,-9.6006,524
-1.5003,-9.5362,525
3.0384,-9.5622,526
1.7239,-9.6028,527
-0.3734,-9.5976,528
-3.4082,-9.6091,529
-2.4881,-9.5862,530
-4.0446,-9.6364,531
-8.5952,-9.4986,532
7.2517,-9.5129,533
1.018,-9.6099,535
0.3827,-9.6205,536
0.7424,-9.5517,537
-0.1877,-9.6019,538
6.4213,-9.0142,540
1.0546,-9.5507,541
0.252,-9.5292,542
-1.1673,-9.5554,543
0.8315,-9.5494,544
2.3208,-9.4613,545
9.6894,-9.6421,547
2.4139,-9.6696,548
4.7938,-9.6868,549
-1.6951,-9.6461,550
3.631,-9.5495,551
2.0325,-9.6453,552
3.0852,-9.4977,553
1.7712,-9.4762,554
2.9969,-9.5893,555
0.1346,-9.6636,557
3.1106,-9.5548,558
0.136,-9.5593,559
2.7952,-10.0165,560
-0.9447,-9.4222,561
1.1145,-9.8735,562
4.4979,-9.3309,563
3.3279,-10.5569,564
2.4084,-9.7054,565
2.7052,-9.6649,567
0.1241,-9.5925,568
-1.3143,-9.7519,569
3.6503,-9.5902,570
-1.9402,-9.4596,571
13.0267,-9.7507,572
2.9607,-9.6503,573
2.9261,-9.4827,574
1.1563,-8.9006,575
0.5238,-9.778,577
1.9237,-9.7186,578
0.3413,-9.6935,579
5.282,-9.78,580
0.3503,-9.6683,581
7.6174,-9.407,582
2.3258,-9.697,583
2.4714,-9.6492,584
2.9399,-9.6506,585
0.2475,-9.6541,587
0.2244,-9.686,588
-3.6013,-9.5672,589
-1.0737,-9.5114,590
-1.8669,-9.5184,591
8.547,-9.648,592
-1.4619,-9.5802,593
6.053,-9.5766,594
-7.6023,-9.798,595
2.5353,-9.6954,597
4.8665,-9.5897,598
0.6597,-9.5543,599
1.9333,-9.7193,600
4.5743,-9.5816,601
-0.3017,-9.7296,602
-0.1704,-9.4702,603
-0.0419,-9.7688,604
1.1978,-9.6006,605
-0.354,-9.7215,607
0.3207,-9.6356,608
0.7781,-9.6797,609
-0.0222,-9.4777,610
2.5773,-9.9105,611
0.0931,-9.6375,612
2.2769,-9.5423,613
1.2603,-9.5646,614
2.3498,-9.6724,615
0.8424,-9.6769,617
0.0762,-9.6828,618
0.7318,-9.6806,619
0.1834,-9.6092,620
-0.6123,-9.4806,621
0.0964,-9.6583,622
-0.1268,-9.5123,623
-0.8699,-9.5331,624
1.0845,-9.7103,625
2.0466,-9.6459,626
1.4991,-9.655,628
-0.282,-9.8115,629
11.3312,-9.4893,630
2.1309,-9.7285,631
-0.0863,-9.672,632
0.6979,-9.6183,633
0.3992,-9.6526,634
-1.2021,-9.6111,635
15.4931,-9.8222,636
2.6129,-9.6236,638
3.8789,-9.6175,639
0.2552,-9.5059,640
0.5802,-9.5154,641
-1.2341,-9.6327,642
0.5607,-9.3949,643
0.8144,-9.747,644
0.9086,-9.6344,645
0.4275,-9.689,646
-0.5049,-9.664,647
-1.0485,-9.6445,649
-4.5426,-9.6312,650
0.6413,-9.6271,651
-0.4732,-9.6382,652
-0.6742,-9.6069,653
1.5996,-9.6354,655
1.7672,-9.588,656
5.1942,-9.5921,657
2.7552,-9.608,658
1.4427,-9.7217,659
1.7994,-9.606,660
0.543,-9.7032,661
0.0572,-9.6897,663
1.0741,-9.6156,664
-0.4491,-9.6727,665
1.3112,-9.7787,666
0.2177,-9.4311,667
0.4002,-9.7899,668
0.4628,-9.5326,669
1.2357,-9.5399,670
-1.0193,-9.6689,671
0.8689,-9.6427,673
0.7323,-9.6452,674
-0.4692,-9.2653,675
2.4437,-9.679,676
1.0852,-9.5079,677
1.6834,-9.651,678
2.8636,-9.6115,679
1.1779,-9.6572,680
-0.2145,-9.7963,681
1.2143,-9.623,682
3.0068,-9.6162,683
-0.559,-9.6424,684
2.5788,-9.5926,685
0.0727,-9.6999,686
0.1406,-9.636,687
-0.3196,-9.6289,688
-0.0839,-9.6942,689
1.9801,-9.595,690
1.4585,-9.6987,691
3.2565,-9.6388,692
1.3511,-9.6738,693
2.7106,-9.6609,694
1.129,-9.6774,695
0.8838,-9.6361,696
0.0641,-9.6398,697
-5.4271,-9.5067,698
0.2887,-9.6305,699
0.0798,-9.6281,700
-0.4433,-9.5986,701
1.6256,-9.622,702
2.4169,-9.4911,703
10.5787,-9.56,704
2.0825,-8.3206,705
8.8699,-9.6996,707
2.2499,-9.6394,708
0.3703,-9.6452,709
0.1489,-9.6698,710
9.3939,-9.548,711
1.7757,-9.7044,712
0.2004,-9.6022,713
5.8073,-9.6734,714
5.5053,-9.919,715
3.1321,-9.6818,717
2.4436,-9.6654,718
0.6187,-9.6044,719
-0.1479,-9.5923,720
-0.5477,-9.5905,721
-0.2946,-9.6342,722
-0.6587,-9.5909,724
-2.4212,-9.4817,725
3.5656,-9.4578,726
8.2961,-9.4834,727
2.4597,-9.5884,728
0.2845,-9.6125,729
0.2499,-9.6715,730
-0.3558,-9.68,732
0.71,-9.6198,733
1.2404,-9.9904,734
0.4619,-9.5706,735
0.5384,-9.607,736
3.5521,-9.5658,737
1.5406,-9.5277,738
-2.7496,-9.507,739
-1.7411,-9.6018,740
-2.7848,-9.6256,742
1.1998,-9.5504,743
3.5278,-9.5908,744
-5.7016,-9.4224,745
-1.3292,-9.4989,746
-3.9018,-9.5734,747
1.4648,-9.5952,748
-2.6832,-9.6193,749
1.3665,-9.5536,750
-2.5175,-9.611,752
-1.3876,-9.618,753
3.0583,-9.6185,754
1.8374,-9.7245,755
12.5189,-9.601,756
-13.5397,-9.2472,757
34.9522,-9.0911,758
-27.5808,-9.3171,760
8.4301,-9.6298,761
10.5371,-9.6026,762
6.4083,-9.6869,763
-1.3397,-9.7189,764
8.9899,-9.8406,765
0.156,-9.6843,767
0.8819,-9.6095,768
0.0526,-9.6443,769
1.3043,-9.3971,770
0.1189,-9.8591,771
3.4126,-9.747,772
-0.5614,-9.6471,773
-1.8623,-9.6987,774
-0.4135,-9.6094,776
1.109,-9.6344,777
-0.2556,-9.6418,778
0.7975,-9.692,779
-0.033,-9.5684,781
0.6987,-9.5658,782
-0.5076,-9.3746,783
1.7433,-9.8017,784
0.3558,-9.6607,785
0.8457,-9.6535,787
10.1352,-9.5524,788
7.016,-9.4673,789
-0.2188,-9.7196,790
0.0823,-9.6834,791
2.3771,-9.6055,792
0.0257,-9.9289,793
1.189,-10.0031,794
0.1428,-9.7035,795
0.0408,-9.6528,797
0.0478,-9.6003,798
1.1906,-9.6306,799
-0.9377,-9.6658,800
-2.1116,-9.6548,801
1.8443,-9.639,802
4.597,-9.4922,803
-0.1583,-9.4207,804
-0.1733,-9.6703,805
0.7376,-9.6543,807
2.9528,-9.6624,808
2.1568,-9.6148,809
-0.1823,-9.6861,810
-1.7129,-9.6427,811
-1.7615,-9.5548,812
4.8585,-9.3831,813
4.2842,-9.5406,814
3.4103,-9.9499,815
0.5262,-9.618,817
-0.1767,-9.6115,818
-2.7943,-9.5597,819
7.3076,-9.7026,820
-0.1063,-9.6792,821
9.0908,-9.5502,823
5.4146,-9.551,824
1.6177,-9.5793,825
0.9473,-9.6743,826
-0.2271,-9.5925,827
2.5591,-9.5263,828
0.0955,-9.6012,829
0.0769,-9.6931,830
0.3108,-9.6238,832
0.1156,-9.7289,833
-0.1766,-9.7206,834
2.2019,-9.8538,835
-0.4706,-9.7173,836
16.9827,-9.6284,837
4.4579,-9.6439,839
8.7885,-9.8586,840
4.0237,-9.4409,841
3.9965,-9.7051,842
0.554,-9.7829,843
5.3861,-9.7264,844
0.87,-9.9319,845
1.7022,-9.6114,846
1.2649,-9.6797,847
-0.7628,-9.648,848
-0.0862,-9.8384,849
2.8474,-9.6691,850
0.6573,-9.5933,852
5.0922,-9.5914,853
3.8644,-9.5232,854
0.5608,-9.7079,855
1.3874,-9.7329,856
0.4335,-9.5891,857
0.9018,-8.6588,858
-0.4234,-9.3563,859
0.6582,-9.776,860
0.5185,-9.6285,862
0.3803,-9.5107,863
-1.6324,-10.1259,864
0.3433,-9.6134,865
0.2538,-9.6163,866
-0.7701,-9.6429,867
4.5296,-9.4971,868
-1.5367,-10.0645,869
-0.6611,-9.5929,870
0.2242,-9.5809,872
1.6879,-9.6984,873
-2.6319,-9.6527,874
-4.2517,-9.606,875
-0.0316,-9.738,876
9.1002,-9.8595,877
1.0891,-9.7471,878
1.3911,-9.4849,879
-0.535,-9.6648,880
0.1395,-9.4844,881
0.6821,-9.7281,882
1.2102,-9.5441,883
2.642,-9.7438,884
1.5315,-9.5653,885
-0.6274,-9.4956,886
-0.1666,-9.8685,887
3.4575,-9.6706,888
-12.0055,-9.4246,889
5.6073,-9.5481,890
1.481,-9.6016,891
1.9641,-9.7125,892
-4.4117,-9.5565,893
-6.2003,-9.4364,894
3.8199,-9.4946,895
-6.3436,-9.4424,896
44.4578,-9.1553,897
-8.8737,-9.4899,898
2.0418,-9.2143,899
-1.1123,-8.9097,900
-1.6975,-9.8631,901
-1.685,-9.6203,902
5.6851,-9.7785,903
-9.9884,-9.7367,904
-0.7524,-9.638,905
0.2455,-9.6389,906
-0.4437,-9.6383,907
-0.1284,-9.6396,908
-0.1314,-9.6406,909
1.8171,-9.6519,910
-3.5459,-9.495,911
0.3217,-9.6392,912
-0.2676,-9.6704,913
0.0104,-9.6262,914
-0.1905,-9.6362,915
0.1329,-9.6364,916
-0.0864,-9.6414,917
-0.1224,-9.6434,918
-0.381,-9.644,919
-0.1585,-9.6444,920
0.039,-9.6559,921
1.3859,-9.6619,922
-2.662,-9.6302,923
-0.401,-9.633,924
-2.1323,-9.6289,926
