AYGX_mean,AZ_mean,timestamp
-2.3859,-9.7106,110
-2.6885,-10.946,111
5.0024,-9.6461,112
5.1798,-9.6222,113
16.3852,-9.7172,114
2.0623,-9.8106,115
0.786,-9.7491,116
2.4295,-9.8063,117
8.5303,-9.5529,118
8.6741,-9.678,119
22.8689,-9.6169,120
10.9627,-9.7572,121
5.4912,-9.7656,122
1.0533,-9.9531,123
2.6611,-9.5986,124
3.3645,-9.8299,125
0.4475,-9.8121,126
0.5454,-9.4821,128
2.6371,-10.4728,129
1.0021,-9.9749,130
