AYGX_mean,AZ_mean,timestamp
-3.5059,-9.8491,2
-6.8709,-9.6766,3
16.8448,-9.7392,29
6.6934,-9.9364,30
4.3294,-9.8324,31
2.3757,-9.8676,32
2.0577,-9.8703,33
1.1493,-9.9069,35
-0.3076,-9.9208,36
-0.0696,-9.9835,37
-0.7653,-10.1131,39
8.2467,-10.1494,40
-6.6371,-10.0316,41
0.1294,-9.6994,42
2.1597,-9.6137,43
0.8297,-9.9147,44
-0.483,-9.8083,45
0.7133,-9.803,46
-0.0243,-10.001,47
0.7401,-6.5453,51
0.0016,-9.6149,52
-0.0152,-9.906,53
0.3185,-9.9729,54
-0.1748,-9.9688,55
-0.0259,-9.4699,56
-1.0707,-9.4852,57
-0.0506,-9.9271,58
0.3532,-9.9045,59
0.392,-9.7172,60
-1.3417,-9.1587,61
0.1883,-10.2997,62
0.2782,-8.5554,63
0.9674,-10.3429,64
0.6351,-9.6152,65
-0.6662,-9.9146,66
-0.0253,-9.8413,67
10.177,-10.5851,68
4.2735,-10.385,69
-1.8324,-10.4275,70
0.8712,-9.7372,71
0.8802,-9.7373,72
0.144,-9.9498,73
6.1217,-9.6034,74
1.4703,-10.0004,75
0.5355,-9.7505,77
0.6742,-9.8299,78
0.4251,-9.5282,79
-0.1047,-9.682,80
0.473,-9.8681,81
-0.156,-9.8918,82
0.5131,-9.6308,83
0.0661,-9.0367,84
-0.1624,-9.404,86
7.3014,-9.9976,87
31.5045,-10.0708,88
-5.6874,-9.3424,89
1.3993,-9.8533,90
0.5302,-9.8609,91
-1.1741,-9.7828,92
-0.0437,-9.6129,93
0.301,-9.4911,94
-1.0423,-9.7976,95
0.0099,-9.9733,96
-2.1266,-9.9515,97
3.4689,-9.7843,98
5.8498,-9.9772,99
7.057,-9.875,100
-0.9309,-9.6648,101
4.0609,-9.8931,102
2.1117,-9.5547,103
-0.3224,-8.472,104
-5.6389,-10.1728,105
-4.1313,-10.022,106
-2.6256,-9.8386,107
2.503,-9.5124,108
-1.1091,-9.9296,109
-1.1137,-9.8414,110
-0.2605,-8.6208,111
0.1948,-10.0396,112
-5.465,-9.8486,113
1.4332,-9.8461,114
-2.6947,-9.7202,116
-1.6499,-9.6337,117
5.3182,-9.5734,118
-1.7756,-9.5801,119
-0.5498,-9.96,120
-0.3119,-10.0,122
-0.4112,-9.8525,123
-1.2047,-9.8365,124
-2.5436,-9.8554,126
-1.9902,-9.6126,127
-1.4282,-9.8925,128
-1.0072,-10.1338,129
-1.2992,-10.004,130
-0.4482,-9.829,131
3.3255,-9.8723,132
2.247,-9.9397,133
-0.8709,-9.808,134
-0.8862,-10.0032,135
0.5785,-9.7464,136
0.2542,-9.9003,137
0.1935,-9.6244,138
3.1934,-9.9157,139
0.7607,-9.8344,140
3.8481,-9.8135,141
0.9897,-9.8944,142
1.0382,-9.7904,143
-0.6585,-10.0438,144
2.3642,-10.0435,146
-0.2423,-9.8234,147
-3.4373,-9.7421,148
-1.9367,-9.9504,149
1.2567,-9.8888,150
0.1357,-9.8883,152
0.6037,-9.9645,153
3.6833,-9.7726,154
-1.3301,-9.6629,156
0.5446,-9.8301,157
1.1961,-9.9726,158
-1.0327,-9.8272,159
-0.8931,-10.0234,160
0.3041,-9.861,161
1.2449,-9.8007,162
-2.3759,-10.4196,163
-0.413,-9.7138,164
1.3254,-8.5078,165
0.058,-9.7965,167
-0.3256,-10.1804,168
0.0101,-9.9353,169
-0.3378,-10.2831,170
0.0815,-9.8764,171
0.0692,-9.9108,172
0.3104,-9.7223,173
-3.0087,-9.8896,174
-1.3358,-9.8047,175
-1.3916,-9.8115,176
1.5625,-9.8102,177
0.9596,-9.7282,178
-6.1583,-9.8957,179
-3.7997,-10.0771,180
-3.7271,-9.8313,181
-1.1443,-9.9103,182
0.2744,-10.0492,183
0.3922,-9.7881,184
0.8313,-9.8208,186
-1.0596,-9.7438,187
3.2213,-10.0408,188
-1.0861,-9.8687,189
-0.4642,-9.6462,190
0.1545,-9.8949,191
1.2475,-9.885,192
-0.9157,-9.9136,193
0.1387,-9.6018,194
0.3663,-9.7745,195
0.0256,-9.0086,196
0.2411,-9.947,197
0.2817,-9.9597,198
0.0171,-9.7741,199
2.7811,-8.9699,200
0.5014,-9.9148,201
0.2013,-9.7835,202
0.6612,-9.8873,203
1.1057,-9.9294,204
-1.5024,-9.9876,205
7.7463,-9.936,207
1.0753,-9.9328,208
2.1387,-9.4469,209
-1.6175,-9.8662,210
0.0832,-9.8125,211
3.0943,-9.1291,212
2.6977,-10.0966,213
3.1045,-9.8633,214
0.7693,-9.871,216
0.1848,-9.7867,217
5.0398,-9.906,218
2.0163,-9.9983,221
1.2901,-9.8419,222
-0.8686,-9.9081,223
1.7993,-9.6713,224
1.7334,-9.9033,226
1.0384,-9.7577,227
0.141,-9.9071,228
0.6361,-9.7383,229
2.9633,-10.3452,230
5.098,-9.8365,231
0.7281,-10.056,232
0.9478,-9.7642,233
0.2669,-9.9428,234
0.4701,-9.9911,235
2.7033,-10.0484,236
3.5803,-9.7369,237
2.2973,-9.913,238
0.9123,-9.8771,239
24.1538,-9.5377,240
6.6589,-10.0147,241
-1.5374,-10.0218,242
0.1638,-10.0498,243
0.4176,-10.1881,244
5.5735,-9.9642,246
1.7144,-9.6602,247
0.8462,-9.7768,248
0.2873,-9.8463,249
0.5265,-10.4479,250
13.5213,-9.9408,251
-0.7786,-9.7264,252
-0.6936,-9.8604,253
-0.2242,-9.7983,254
-0.3188,-9.9364,256
0.4526,-9.8849,257
0.6952,-9.4597,258
0.1019,-9.84,259
4.0403,-9.6472,260
0.3244,-9.6685,261
-1.2298,-9.8623,262
-2.2017,-7.2419,263
5.0676,-9.8439,264
0.611,-9.8768,265
-2.9635,-9.961,266
-2.4188,-9.8348,267
0.1806,-9.9319,268
1.1292,-9.8937,269
-1.2039,-9.9484,270
-0.6334,-9.9574,271
-0.1589,-9.7997,272
1.1218,-9.6878,273
0.2319,-8.5705,274
-0.64,-9.813,276
0.7809,-9.5276,277
-0.1863,-9.9719,278
-0.2785,-9.7759,279
0.4361,-9.8896,280
-0.1169,-9.9523,281
-0.0264,-9.8723,282
2.2727,-9.8125,283
-0.3334,-9.8754,284
-0.2521,-9.7833,286
0.7132,-9.9056,287
-1.3777,-9.7864,288
0.0868,-9.8395,289
2.5908,-10.1853,290
-0.5478,-9.8917,292
-0.4999,-9.8152,293
0.4042,-9.9001,294
-0.3331,-9.901,295
0.9245,-9.812,296
-0.3189,-9.8696,297
-0.9383,-9.8136,298
-0.5934,-9.7441,299
1.1104,-8.4655,300
0.2301,-9.9381,301
-1.6611,-9.8635,302
-0.661,-9.9331,303
-0.7824,-9.8701,304
-0.2917,-9.6934,305
-0.3304,-9.7116,306
0.2598,-10.0179,307
0.3788,-9.7709,308
0.1076,-9.8988,309
-2.0192,-9.9128,310
1.1413,-9.8201,311
-0.0994,-9.8048,312
0.5616,-9.9125,313
0.3712,-9.9077,314
-0.828,-9.9623,316
-0.0239,-9.8209,317
-0.2894,-9.9486,318
1.6079,-9.8723,319
-0.0381,-9.7978,320
6.8992,-10.1102,321
4.567,-9.5423,322
1.4918,-9.8466,323
2.6816,-9.8579,324
-0.873,-9.795,326
-3.1213,-9.8732,327
-39.8162,-9.45,328
14.1063,-9.926,329
3.6036,-9.825,330
0.3834,-9.8782,331
4.5641,-9.4392,332
-0.0223,-9.8721,333
1.3875,-9.8015,334
-2.9139,-9.8506,335
-0.2699,-9.8179,337
0.3383,-9.8267,338
1.1032,-9.8292,339
-0.0701,-9.8661,340
0.0071,-9.866,341
