AYGX_mean,AZ_mean,timestamp
0.0419,-9.9736,1
0.0407,-9.9739,2
0.039,-9.974,4
0.6336,-9.9692,5
-6.1856,-9.9019,7
-7.7122,-9.8708,8
0.8358,-9.9458,9
-4.591,-9.924,10
2.5394,-9.9375,11
-1.6273,-9.9464,12
-0.1958,-9.9332,14
-0.8875,-9.9237,15
-0.6296,-9.9158,16
-0.2963,-9.9126,17
-0.4062,-9.9127,18
0.9115,-9.9087,19
0.1323,-9.9164,20
-0.2844,-9.9192,21
0.1509,-9.9253,22
-0.0668,-9.9273,23
-0.2224,-9.9319,24
-0.1991,-9.9363,25
-0.071,-9.9381,26
-0.1393,-9.9418,27
-0.3021,-9.937,28
0.1019,-9.9462,29
-0.4916,-9.9427,30
-0.2583,-9.9447,31
-0.3245,-9.9448,32
-0.0435,-9.9411,33
-0.6248,-9.9439,34
-0.4084,-9.9359,35
0.7141,-9.9416,36
-0.6684,-9.9469,37
-1.9944,-9.9462,38
1.9522,-9.9456,39
-10.748,-9.7852,40
16.2491,-9.6416,41
1.9066,-9.8958,42
-2.0502,-9.9096,43
-2.3767,-9.8458,44
-25.723,-9.6967,45
-27.0653,-9.4819,46
13.8351,-8.9638,47
4.724,-9.6564,48
-0.8951,-10.0462,49
0.1866,-9.9991,50
3.8498,-10.0326,51
0.0745,-8.9473,52
3.4863,-9.9323,53
1.9445,-9.8536,54
1.1338,-10.1199,55
0.1285,-10.0504,56
8.8573,-9.8817,57
-0.8244,-9.994,58
1.3944,-10.0976,59
1.7187,-10.2512,60
3.7371,-10.1481,61
11.3382,-6.4058,62
3.774,-10.2499,64
2.8107,-10.0407,65
2.9187,-9.0381,66
1.1802,-10.685,67
9.0581,-9.8996,68
8.0922,-9.9312,69
-2.1269,-9.826,70
0.7884,-9.9904,71
0.5527,-9.5449,72
1.7847,-9.9082,73
3.5698,-9.8855,74
0.5577,-9.8526,75
0.6525,-10.0008,76
-0.7717,-10.249,77
1.7043,-10.2777,78
0.0241,-9.9146,79
-7.4271,-9.8345,80
-0.7028,-9.9034,81
0.4551,-10.4146,82
-0.29,-9.7811,84
0.37,-9.9944,85
0.1759,-9.9286,86
1.0872,-10.032,87
0.8995,-10.0837,88
0.2914,-10.0021,89
-4.1465,-8.3797,90
-3.6573,-10.0507,91
3.0122,-10.1873,92
-1.2985,-10.1588,94
-0.8114,-9.9087,95
0.5847,-10.3411,96
-0.3605,-10.1542,97
-0.9136,-9.9016,98
-1.0092,-10.0244,99
0.876,-9.8257,100
0.5568,-10.2791,101
0.9363,-9.8831,102
0.858,-10.0886,103
0.4089,-10.1708,104
0.2371,-9.7081,105
0.7583,-9.6335,106
-1.0282,-9.8389,107
1.2445,-9.9976,108
-0.1606,-9.9057,109
0.7167,-9.9569,110
-0.4843,-9.7065,111
-1.5155,-10.2659,112
-2.355,-10.0679,113
-0.174,-9.7273,115
-1.5312,-9.9075,116
0.332,-9.7315,117
0.25,-9.8779,118
0.0609,-10.0217,119
4.5768,-10.0837,120
-1.2182,-9.9224,121
4.1583,-10.1779,122
0.2173,-9.978,123
-0.0205,-9.5222,124
1.868,-10.0117,125
-0.8532,-10.0261,126
-2.7699,-10.1422,127
0.4567,-9.8513,128
-0.7931,-9.9199,129
-0.7826,-10.0786,130
-0.3301,-9.938,131
-1.5957,-10.0881,132
0.1748,-10.376,133
-0.0508,-10.3407,134
0.9494,-10.0317,135
0.7847,-9.9316,136
6.0706,-10.0428,137
3.2034,-8.1328,138
0.5723,-9.9292,139
-0.1658,-10.0885,140
-2.3666,-10.0482,141
6.0666,-9.9971,142
-0.2346,-9.6182,144
-0.0934,-9.8796,145
-1.5847,-9.3939,146
-1.1595,-10.0724,147
-1.7739,-10.1296,148
1.2433,-10.0434,149
0.1271,-9.9256,150
1.0815,-9.9499,151
1.0561,-10.7699,152
-0.622,-10.254,154
-0.4035,-9.8476,155
0.5548,-10.0177,157
-0.468,-9.5115,158
-1.1593,-9.922,159
-2.2601,-9.9547,160
1.0189,-10.2845,161
0.2611,-10.182,162
-0.3541,-9.7558,163
0.064,-9.8957,164
-0.0181,-9.9429,165
0.241,-9.9371,166
0.395,-10.1412,167
0.2091,-9.7102,168
1.9449,-10.0484,170
0.1013,-9.8088,171
-0.1236,-10.1695,172
3.5767,-9.9732,174
2.9586,-8.7333,175
-0.0086,-9.2371,176
0.2933,-10.0322,177
0.1957,-10.0594,178
-0.6193,-9.472,179
6.8086,-10.1385,180
-1.9119,-10.0858,181
-1.656,-10.0321,182
6.7611,-10.0518,183
1.3116,-10.3568,184
1.1016,-9.9817,185
1.5801,-10.0317,186
0.8901,-9.8288,187
2.0378,-10.0022,188
1.9145,-9.5784,189
-0.1593,-9.7247,190
0.0218,-9.9612,191
-0.0145,-9.9833,192
-0.0895,-10.048,193
-0.076,-9.8606,194
0.6148,-9.9453,195
-0.1428,-10.0714,196
0.1776,-10.0241,197
0.1812,-10.0545,198
1.2707,-9.9225,199
0.0071,-10.0548,200
0.3225,-9.9027,201
-0.3616,-10.1045,202
1.1581,-9.9864,204
-0.0082,-9.8655,205
0.0161,-9.9606,206
2.4509,-10.0941,207
0.1122,-9.9669,208
2.358,-10.0211,209
-0.255,-10.0078,210
-0.067,-9.9935,211
0.0839,-9.9624,212
-0.1,-9.9925,213
1.0753,-9.9974,215
0.106,-10.007,216
1.6609,-10.5905,217
-4.2636,-10.0028,218
-10.8087,-9.851,220
-3.3705,-9.6702,221
4.4244,-9.9175,222
-1.6394,-9.8614,223
-5.6068,-9.8826,224
11.3506,-9.713,225
-0.0547,-9.9897,227
-0.814,-9.9643,228
-8.2062,-10.0978,229
3.5631,-9.9934,230
0.7644,-10.0363,231
2.196,-10.034,232
-2.9135,-9.9438,233
-4.4134,-9.9195,234
-6.8302,-9.9411,235
1.8532,-9.9626,236
0.3781,-9.9413,237
-1.169,-10.094,238
0.3408,-10.3929,239
-0.5976,-9.9088,240
-0.5021,-10.0026,241
-2.8961,-8.8943,242
0.2542,-9.4347,243
6.0749,-10.0782,244
2.9829,-10.1859,245
0.3637,-9.7634,246
4.0722,-9.1381,247
0.8333,-10.0201,248
0.5036,-10.2015,249
0.5712,-9.617,250
0.9566,-10.1807,251
-2.6508,-8.7698,252
2.859,-9.7322,253
0.1705,-9.7207,254
-0.4435,-10.1368,255
2.3656,-9.9837,256
0.6996,-8.5565,257
1.0281,-10.3669,258
0.295,-10.0595,259
2.1228,-10.2487,260
-0.9653,-9.791,261
-0.629,-10.1934,262
8.0168,-9.9301,263
1.7535,-9.8804,264
4.8937,-10.148,265
0.0199,-9.9874,266
2.0176,-10.1223,267
0.8928,-9.8175,268
-0.2427,-9.765,269
0.3188,-9.9664,270
0.2469,-9.7625,271
2.6565,-9.8702,272
3.0183,-9.9966,273
0.14,-9.9054,274
-0.0173,-10.2289,275
1.4022,-10.3017,276
1.3241,-10.1306,277
4.4584,-10.0054,278
0.2819,-10.0526,279
-0.3193,-9.9647,280
-0.1995,-9.9549,281
2.1331,-9.8672,282
0.8149,-10.3574,283
3.9189,-10.0688,284
0.5326,-10.2287,285
0.1361,-9.9394,286
0.9054,-9.7447,287
-0.4267,-9.9207,289
-0.1511,-10.0807,290
0.1798,-9.9842,291
0.1042,-9.9155,292
0.3138,-9.8843,294
-0.126,-10.1097,295
1.3369,-10.7317,297
-0.1327,-9.7309,298
4.6389,-10.3189,299
0.0939,-9.9411,300
-0.4079,-9.8645,301
2.9638,-10.0781,302
-0.5963,-9.8186,303
7.1621,-9.7094,304
-0.189,-9.8884,305
0.2996,-10.4911,306
4.5437,-9.2298,307
-0.0049,-9.9451,308
0.1908,-9.8853,309
1.5869,-10.076,310
0.3677,-9.9971,311
0.2931,-10.1033,312
1.4112,-9.9447,313
-0.4739,-9.9822,314
0.8389,-10.5614,315
-0.3444,-9.8463,316
-0.1985,-10.1467,317
-0.3444,-9.6343,318
0.3668,-10.0467,319
0.0303,-10.0012,320
-0.026,-10.0155,321
-0.0152,-10.0154,322
1.3102,-10.0548,323
3.0188,-9.9933,324
-2.4755,-9.8995,325
0.1876,-10.3758,326
0.2356,-9.9658,327
0.1939,-9.8912,329
-0.0361,-9.9654,330
1.4808,-10.0118,331
-0.0538,-9.9413,332
0.0731,-9.9554,333
1.9453,-10.1106,334
-0.0338,-10.099,335
0.6725,-9.8826,336
1.2628,-9.7777,337
0.0176,-10.0802,338
0.2611,-9.9514,340
-0.1423,-10.2719,341
-0.3754,-9.9595,342
0.9746,-10.0779,343
0.4932,-9.7512,344
0.1359,-9.9233,345
2.9279,-10.0936,346
-0.3198,-9.8228,347
0.2855,-10.0769,348
0.1574,-9.7692,349
-0.0239,-9.9741,351
1.2003,-10.4482,352
2.6823,-6.1715,353
0.176,-9.9336,354
0.5413,-10.3042,355
-0.0127,-9.8987,356
0.0762,-9.9984,357
-0.1232,-9.8186,359
2.1297,-9.8311,360
0.7053,-9.2729,361
0.3089,-10.0887,362
0.054,-10.1397,363
0.5107,-10.2692,364
0.2547,-10.1558,365
1.4132,-9.6259,367
-2.1083,-10.0997,368
-0.021,-9.7397,369
-0.4093,-9.5358,370
0.66,-9.8363,371
-0.2582,-10.4419,372
0.2332,-10.0793,373
-0.602,-10.0365,374
-0.4884,-9.8467,375
-0.9228,-10.0078,376
0.3705,-10.0195,377
-0.426,-10.2205,378
0.3466,-10.149,379
0.963,-10.0101,380
2.45,-9.763,381
4.6502,-9.845,382
2.4202,-10.4002,383
7.9667,-9.3446,384
0.4299,-9.8607,385
-0.3068,-10.2992,386
-0.3859,-10.0744,387
0.3278,-9.8796,388
-1.4899,-10.1083,389
0.6207,-10.0101,390
0.2449,-9.9821,391
-0.1226,-10.2012,392
3.423,-10.009,393
0.7174,-9.9472,394
4.8205,-9.3457,395
-4.4188,-10.0913,396
6.7575,-9.74,397
1.0845,-10.2521,398
-0.2444,-9.7217,399
0.093,-9.9838,400
0.8741,-9.9948,401
0.6014,-10.012,402
0.8353,-9.958,403
-0.2203,-9.8294,404
2.5742,-10.0968,405
0.439,-9.9155,406
1.1513,-10.0094,407
2.1976,-10.1367,408
0.1585,-10.0548,409
0.6298,-9.8721,410
4.9052,-9.5972,411
0.1069,-10.1433,412
-0.1637,-9.9624,413
6.6284,-10.1452,414
6.8587,-9.581,415
-0.7827,-10.1478,416
0.1563,-10.321,417
3.8788,-8.17,418
-0.0859,-9.7497,419
0.4172,-10.0811,420
1.5002,-9.8102,421
0.0498,-10.2735,422
1.113,-10.1772,423
0.263,-10.0955,424
2.7265,-10.0029,425
1.2504,-10.098,426
3.4149,-9.9894,427
0.3016,-9.8726,429
0.3862,-10.0904,430
-0.5588,-9.8294,431
3.5997,-10.1947,432
-0.1864,-9.8922,433
5.4234,-9.8672,434
0.0826,-10.0964,435
1.9283,-9.6923,436
-0.7194,-9.9044,439
0.0342,-9.9801,440
0.8714,-10.0151,441
-0.3705,-9.999,442
-0.046,-9.687,443
0.2597,-10.0679,444
2.5265,-9.9849,445
0.3519,-10.1658,446
0.2884,-9.8801,447
-0.0956,-9.9132,448
1.0854,-9.7813,449
0.2581,-10.0376,450
1.8196,-10.0172,451
-0.3576,-9.9719,452
0.1087,-10.0176,453
0.4266,-10.0919,454
-0.0258,-10.0656,455
0.0788,-9.998,456
0.6659,-10.0574,457
0.7789,-9.2579,459
-0.199,-9.9843,460
0.8217,-10.0502,461
0.1218,-10.0105,462
-0.0453,-10.0146,463
0.0914,-10.0358,464
0.1254,-9.994,465
0.0295,-9.997,466
-0.574,-9.9848,468
-1.231,-9.9724,469
-0.2727,-9.9596,470
0.9012,-9.9688,471
0.2628,-10.007,472
5.5592,-9.896,473
-1.5218,-10.2349,474
-1.173,-9.8533,475
-2.5828,-10.1136,476
-1.3472,-10.0422,477
1.2071,-9.938,478
-0.7695,-9.8401,479
0.5047,-7.4336,480
1.4682,-10.0498,481
1.4407,-9.8269,482
-0.8336,-9.1788,483
0.1791,-9.9622,484
0.6821,-9.9775,485
5.892,-9.9457,486
16.5172,-9.9414,487
1.8852,-10.7111,488
0.1148,-10.0917,489
0.5698,-10.0557,491
0.2454,-10.121,492
1.3792,-10.0914,493
0.0923,-10.2215,495
-0.1244,-9.983,496
0.2482,-9.8632,497
-0.0907,-9.9727,498
-0.3366,-10.1826,499
2.6472,-9.8885,500
-1.2357,-9.7923,501
-0.5608,-9.6871,502
2.7798,-10.1624,504
0.1916,-9.6609,505
4.7345,-10.0144,506
0.8893,-10.2245,507
0.9162,-9.8249,508
0.5619,-9.6902,509
6.5001,-9.9158,510
2.396,-10.5434,511
0.999,-9.8696,512
0.1167,-10.0525,514
0.9938,-9.842,516
1.2537,-9.7577,517
1.4735,-9.9478,518
0.5197,-10.4916,519
-0.1498,-9.8878,520
2.1877,-9.9967,521
0.277,-9.9205,522
-0.0273,-9.9214,523
0.4844,-7.7838,524
1.5934,-10.0292,525
0.7675,-10.0272,526
0.0349,-10.1199,527
0.7339,-10.1964,528
3.4894,-9.8074,529
-0.0387,-9.9342,530
0.5201,-10.088,531
1.707,-10.1252,532
2.4643,-10.4351,534
0.8334,-9.9703,535
-0.3529,-10.0557,536
1.7118,-10.2827,537
0.649,-9.553,538
-0.1306,-9.8546,539
0.2837,-10.5336,540
3.4185,-10.0872,541
1.6767,-9.925,542
0.5314,-9.6355,543
0.7434,-9.9734,544
1.5875,-10.046,545
-0.2821,-9.8967,546
4.1988,-10.145,547
0.1472,-10.029,548
0.0324,-9.399,549
0.9596,-9.2475,550
0.7161,-9.2423,551
1.4715,-10.0545,552
-0.1388,-9.9661,553
-0.3961,-9.9642,554
0.6389,-9.9445,555
-0.3019,-9.8362,556
-0.0466,-10.0838,557
-0.2828,-9.8856,558
1.1727,-10.0688,559
3.503,-10.1072,560
2.914,-9.3376,561
0.3324,-10.1205,562
1.087,-10.0219,564
0.8504,-10.0571,565
-0.037,-10.0004,566
-0.1319,-9.8721,567
5.9278,-10.7735,568
4.801,-10.0747,569
-2.9637,-9.919,571
1.7825,-10.019,573
2.0346,-9.9949,574
1.4283,-10.0539,575
-2.8716,-10.2664,576
7.9903,-9.9738,577
-1.0715,-10.5962,578
1.3431,-9.6415,579
-1.338,-9.9303,580
-0.4703,-9.9439,581
-1.6901,-10.0282,582
0.5173,-9.4774,583
-1.2787,-9.5088,584
0.2004,-10.0749,585
-0.1447,-9.88,586
1.0292,-9.944,587
0.1883,-10.1392,588
1.0217,-8.8446,589
-0.4726,-10.0072,590
0.4406,-10.0525,591
0.4197,-10.0215,592
1.5915,-10.0267,593
0.9287,-9.8041,594
0.3205,-10.0258,595
0.9647,-9.8272,596
-0.2525,-9.8841,597
0.0857,-10.0429,598
-0.9907,-9.8985,599
0.8285,-10.0225,600
0.0285,-9.9952,601
1.3519,-9.8124,602
-0.6986,-9.6584,603
0.9501,-10.0953,604
0.2802,-10.0326,605
0.0325,-10.0636,606
-0.2789,-9.9298,607
0.2763,-10.2333,608
0.1063,-9.9733,609
0.7311,-9.9831,610
-0.2335,-9.9189,611
1.1446,-10.215,612
-6.0664,-9.9808,613
1.7512,-9.9484,614
4.6266,-10.0842,615
0.0837,-9.9364,616
0.3849,-9.8788,617
2.5818,-10.1149,619
0.0359,-10.0286,620
1.7368,-9.9084,621
-0.7434,-9.8453,622
-5.483,-9.9982,623
11.0707,-7.8042,624
4.2612,-10.2158,625
1.1628,-10.2172,626
-0.2988,-9.9225,627
1.1612,-9.7376,629
0.6221,-9.748,630
3.0575,-9.8929,631
2.2993,-9.7577,632
7.2195,-10.2539,633
13.1951,-10.0194,634
-0.6383,-9.2576,635
-0.5377,-10.0824,636
10.6488,-9.6716,637
-1.015,-9.9873,639
-0.007,-10.1717,641
-0.5815,-9.477,642
-0.5404,-10.2722,643
-0.4372,-10.4248,644
-0.351,-9.3578,645
1.0733,-10.2734,646
-0.4508,-10.0139,647
0.9336,-9.7932,648
1.822,-10.0176,649
-0.1367,-9.9944,650
0.4958,-10.0792,651
0.0795,-9.9444,652
0.5277,-9.7675,653
-0.1586,-10.2209,654
1.41,-9.5327,655
0.2819,-9.8723,656
1.4167,-10.354,657
1.5096,-9.3615,658
-3.0209,-11.1023,659
-0.1364,-10.0049,660
0.1751,-9.9504,661
-2.3824,-9.7407,662
1.776,-9.4556,663
-0.7876,-9.9545,664
1.2399,-10.1628,665
0.516,-9.8177,666
-0.0246,-10.1965,667
-0.2473,-10.0367,669
-0.7151,-9.4868,670
-4.501,-7.3257,671
1.5144,-9.731,672
0.5022,-9.8964,673
-1.5441,-10.2602,674
1.1627,-10.2882,675
0.799,-10.0202,676
0.1149,-9.955,677
-0.2217,-10.257,679
0.3668,-10.0058,680
0.5967,-10.0044,681
0.1103,-9.8756,682
0.0522,-9.9901,683
-0.276,-9.9963,684
-0.2867,-10.0085,685
0.0927,-10.0009,686
-0.0769,-9.9987,687
-0.0918,-9.9952,688
-0.067,-9.9977,689
-0.1916,-9.9922,690
-0.2774,-9.9964,691
0.4252,-9.9887,692
6.3108,-9.6838,694
1.0088,-10.0235,695
0.3934,-9.9288,696
0.0719,-10.0114,697
0.5461,-9.9758,698
0.2919,-9.8851,699
0.1517,-10.0437,700
-3.2351,-9.9505,701
7.0219,-9.9378,703
-0.7804,-10.0009,704
1.3196,-9.977,705
0.481,-9.9903,706
0.4795,-9.9972,707
0.0941,-9.9932,709
0.2117,-9.9988,710
0.0974,-9.997,711
0.0811,-9.9866,712
3.1393,-10.0239,713
-0.1217,-9.7435,714
0.0104,-9.957,715
-0.0703,-9.4614,716
0.1103,-10.0348,717
-0.4207,-10.0,718
0.2419,-10.6054,719
0.6624,-9.6818,720
0.5328,-9.8749,721
-1.3263,-9.9024,722
0.1271,-10.1259,723
0.6429,-9.91,724
-0.0109,-10.1264,725
-0.3014,-9.9782,726
0.6573,-9.8869,727
1.1105,-10.0614,728
-0.9673,-10.0981,729
3.9445,-9.8704,730
3.495,-9.1563,731
0.5353,-10.3929,732
1.2047,-9.9214,733
3.6823,-9.3491,734
-1.8035,-10.4205,735
2.4079,-9.9577,736
0.3927,-10.1331,737
0.4515,-9.9905,738
0.0307,-9.861,739
4.0959,-9.9716,740
0.0314,-10.1931,741
2.9769,-10.1574,742
0.4715,-7.9524,743
0.4398,-9.9345,744
0.0293,-10.6045,745
0.1598,-10.1857,746
-0.0587,-9.7382,747
2.0702,-10.0619,749
0.8191,-9.1175,750
4.2203,-9.8447,751
-1.7207,-9.9813,752
2.5245,-10.186,753
-0.2935,-10.0207,754
1.5965,-9.7686,755
-0.5369,-10.0757,756
1.3464,-6.4408,757
2.7262,-10.3267,758
-1.1509,-9.695,759
-0.1201,-10.1422,760
1.1736,-10.1973,761
0.6969,-9.7875,762
2.1874,-9.8363,763
0.2799,-9.8856,764
-0.0231,-9.9825,765
-0.2309,-9.9039,766
0.6431,-9.8704,767
26.9624,-10.2677,769
-0.5116,-9.8601,770
6.9355,-10.1384,772
0.1719,-10.1229,773
-0.0872,-10.0521,774
-0.6456,-9.934,775
0.4316,-10.0236,776
-0.417,-9.8094,777
0.4786,-9.8507,779
-0.2294,-10.038,781
0.4654,-10.0494,782
3.1484,-10.1658,783
-0.2168,-10.2165,784
0.4713,-10.0674,785
0.7925,-9.9613,786
0.675,-9.9018,787
0.0371,-10.3367,788
-0.2705,-10.0849,789
-0.223,-10.0196,790
-0.009,-9.8495,791
-1.0676,-10.2455,792
1.4446,-10.1582,793
-0.3959,-10.3947,794
0.2423,-9.9932,795
1.9333,-9.9898,796
0.7026,-9.9856,797
0.1046,-9.7396,798
-0.316,-6.9386,799
-0.0571,-9.984,800
2.2023,-9.9836,801
0.0337,-10.0368,802
0.308,-10.0585,803
0.1819,-9.9819,804
1.7393,-10.1013,805
0.032,-10.0623,806
-0.3572,-10.1,807
-0.4512,-9.7134,808
1.6629,-9.7764,809
-1.0802,-9.9369,810
-0.0174,-9.9802,811
-0.1546,-10.1654,812
-0.2681,-9.4921,813
-0.3035,-9.9243,814
-0.6397,-10.0056,815
0.0138,-9.9214,816
0.1345,-9.9122,817
-0.533,-10.0985,818
-0.1837,-9.9986,819
0.413,-9.9269,820
-0.0156,-9.998,821
0.014,-10.0963,822
0.0947,-9.9267,823
-1.0099,-8.3948,824
0.4003,-10.0759,825
0.3536,-10.0509,826
3.7021,-9.988,827
11.8897,-9.9305,828
2.2696,-9.3703,830
-1.7766,-9.9293,831
-0.6003,-8.7339,832
4.6499,-10.2157,833
0.1931,-10.1109,834
-0.1694,-9.0161,835
0.2527,-9.9836,836
0.2521,-9.9472,837
0.0777,-9.8507,839
0.2668,-9.8001,840
0.7292,-9.5743,841
0.123,-6.9866,842
-1.6501,-9.2622,843
-0.8886,-9.9612,844
-0.3457,-9.4994,846
0.0519,-10.0039,847
-1.0583,-9.7257,848
-0.0155,-7.741,849
-0.2015,-9.5039,850
-0.3936,-9.8349,851
0.7571,-9.7694,852
1.0574,-10.1066,853
1.4672,-9.8859,854
0.2377,-10.2562,855
1.8982,-9.9092,856
0.1203,-10.0313,857
-0.0252,-9.9983,858
-0.0032,-9.9998,859
0.1584,-9.9153,860
1.8566,-9.9583,861
-0.0087,-9.9924,862
-0.1969,-9.9786,863
0.0949,-9.9687,864
0.7394,-9.9807,865
0.0125,-9.9898,866
-0.6457,-9.9725,867
0.3045,-9.9777,869
0.0899,-9.986,870
0.1834,-9.9843,871
-0.2384,-9.9811,872
0.0783,-9.9746,873
0.4254,-9.9766,874
0.056,-9.976,875
0.1,-9.984,876
0.0013,-9.9813,877
0.4894,-9.9738,878
-1.7565,-9.9678,880
1.3226,-9.9662,881
0.457,-9.9892,882
2.3461,-10.0202,883
4.0428,-9.4406,884
3.8606,-9.9802,885
1.6022,-9.7716,886
9.655,-10.3019,887
0.1,-10.3263,889
-1.728,-9.924,890
0.2605,-10.0115,892
-0.6986,-10.0143,893
0.5144,-10.0241,894
0.3829,-10.0458,895
0.3274,-10.1364,896
-0.3083,-10.1471,898
0.6508,-10.2304,899
-0.523,-9.9842,900
0.5644,-9.9761,901
-0.08,-9.9618,902
1.3265,-9.9731,903
0.0891,-10.272,904
-0.104,-9.8919,905
1.1208,-10.4515,906
-0.6825,-9.93,907
2.5184,-9.9656,908
0.4524,-10.0174,909
1.7487,-10.0,910
0.2743,-9.9283,911
-0.0499,-9.6759,912
12.209,-9.2687,913
0.3099,-10.2073,914
0.0832,-9.8312,915
-0.5198,-9.8363,916
0.1085,-10.0316,917
0.1412,-10.1202,918
0.1514,-9.9014,919
-0.4391,-9.929,920
0.2823,-9.7858,921
-0.4855,-10.0531,922
-0.5952,-9.9244,923
0.5602,-9.8611,924
4.7692,-10.2152,925
0.3262,-8.7257,926
-0.2612,-9.884,927
-0.0104,-9.9947,929
-0.5706,-9.9902,930
-0.9267,-10.059,931
1.7392,-9.6405,932
1.7672,-10.1456,933
-0.0408,-9.9678,934
0.1308,-10.0818,935
1.4949,-9.7843,936
2.4237,-9.2007,937
0.3437,-7.8493,939
0.6529,-9.5161,940
-0.0154,-9.9193,942
-0.5941,-9.9835,943
-2.1611,-9.9386,944
-0.8004,-10.0873,945
-0.2642,-10.0066,946
-0.613,-10.1738,947
0.4478,-10.103,949
0.4874,-9.8872,950
-0.7989,-10.158,952
0.4073,-9.9648,953
0.3702,-10.2215,954
-0.5288,-9.4771,956
-1.3218,-8.688,957
4.8822,-10.288,958
-2.4594,-9.5522,959
-0.7897,-9.8341,960
-0.8677,-10.1772,961
-0.1943,-9.9339,962
0.0472,-10.1312,963
-0.7753,-9.906,964
-0.9924,-10.1379,965
-0.2585,-10.1324,966
-0.3571,-10.1149,967
1.9939,-9.8543,968
-0.2682,-10.0204,969
0.827,-10.0207,970
-0.0133,-10.0588,971
1.2909,-9.9279,972
0.0504,-10.085,973
-0.0207,-9.9587,974
2.521,-10.0313,975
4.5464,-10.1884,976
2.3974,-9.9013,977
0.1293,-9.9503,978
-0.323,-9.976,980
-0.1279,-9.9858,981
0.6969,-9.9851,982
0.7407,-9.9873,983
-0.0269,-9.9917,984
0.6053,-9.9908,985
-0.5366,-9.9787,986
0.111,-9.9913,987
0.4144,-9.9919,989
0.1115,-9.995,990
0.3133,-10.0016,991
-0.0172,-10.0079,992
0.0041,-9.9959,993
-0.0167,-9.9979,994
-0.0011,-9.9997,995
0.0736,-9.9993,996
-0.0234,-9.9938,997
0.1334,-9.9966,999
0.0197,-9.998,1000
-0.0145,-9.9959,1001
0.0274,-9.9931,1002
0.0887,-9.9946,1003
-0.4483,-9.984,1004
-1.7943,-9.5492,1005
12.7887,-10.0711,1006
0.6037,-10.2228,1007
2.5294,-9.8573,1009
-0.2889,-9.8252,1010
0.0296,-9.1259,1012
1.5091,-9.8498,1013
-0.8121,-9.2904,1014
1.1309,-9.8056,1015
0.6053,-9.9511,1016
0.3795,-10.0755,1017
0.1081,-9.9838,1019
0.5573,-10.086,1020
-0.6814,-10.0089,1021
-0.0005,-9.8004,1022
-0.7245,-10.1032,1023
0.733,-10.007,1024
0.0712,-9.9438,1025
0.6955,-10.0362,1027
-0.4327,-9.6092,1028
0.4593,-10.3709,1029
-0.5349,-10.012,1030
1.5705,-9.7516,1031
0.1163,-10.0883,1032
-0.453,-10.0915,1033
0.6226,-10.0711,1034
0.0564,-9.9583,1035
0.5722,-9.8616,1036
-0.2755,-9.8029,1037
0.9192,-10.2339,1039
-0.4979,-9.9482,1040
0.4762,-10.0534,1041
-2.0583,-10.1155,1042
6.3724,-9.9635,1043
1.6662,-9.9246,1044
1.0059,-9.8395,1045
-0.328,-9.9659,1046
1.9799,-10.0126,1047
0.2989,-9.9384,1048
2.0572,-10.2221,1049
5.8199,-9.8805,1050
0.4838,-9.7581,1051
0.6654,-10.277,1052
3.3787,-9.9624,1053
11.1661,-8.0842,1054
1.2852,-10.0717,1055
0.6812,-9.948,1056
2.0731,-10.0773,1057
-0.4143,-10.0528,1059
1.4441,-10.0316,1060
-0.0996,-10.0975,1061
0.1195,-10.2228,1062
0.5847,-10.1591,1063
1.8659,-9.502,1064
0.8597,-9.9254,1065
0.3033,-9.6448,1066
0.4553,-10.09,1067
1.1651,-9.4637,1069
-0.152,-9.9803,1070
-0.0675,-9.9805,1072
0.1573,-10.0521,1073
-0.2605,-9.8313,1074
1.4693,-10.1361,1075
0.4223,-9.9971,1076
0.0873,-10.0969,1077
0.1721,-9.8832,1079
0.2693,-10.0074,1080
-0.463,-9.9963,1081
0.2021,-9.9554,1083
3.6108,-9.9651,1084
0.6419,-10.0263,1085
-0.5512,-9.986,1087
2.0269,-10.0041,1088
0.9128,-10.0226,1089
0.7162,-9.8541,1090
3.9482,-10.0375,1091
-3.022,-11.2394,1092
-11.1321,-10.0115,1094
3.5377,-9.9069,1095
0.0623,-10.1233,1097
-0.0457,-9.2639,1098
0.3395,-10.0379,1099
0.0742,-10.2445,1100
1.0807,-10.1429,1101
1.0827,-10.1543,1102
1.1672,-7.9201,1103
0.5268,-9.8346,1104
0.111,-10.1668,1105
0.0031,-10.191,1106
1.3089,-9.6282,1107
4.4408,-10.337,1108
1.3494,-9.5129,1109
-2.2104,-9.0682,1110
10.4302,-10.1063,1111
0.1416,-10.0622,1112
-0.3901,-9.5826,1114
2.454,-9.8995,1115
0.5927,-9.7,1116
1.0138,-9.64,1117
1.7806,-10.0174,1118
-0.0641,-9.8224,1119
0.0388,-9.6517,1120
-0.0537,-9.8951,1121
0.0837,-9.9187,1122
-0.018,-9.8278,1124
0.2474,-9.9037,1125
2.0495,-10.0976,1126
-0.8859,-9.5854,1127
0.0348,-10.2354,1128
1.1859,-9.5897,1129
-0.0912,-9.7178,1130
-0.1605,-10.3887,1131
0.3829,-9.9993,1132
0.188,-9.8439,1134
0.5388,-9.9501,1135
-0.9431,-10.0202,1136
0.3903,-9.962,1137
0.0393,-9.982,1138
-2.4451,-9.9452,1139
-0.3316,-9.92,1140
0.7539,-9.9116,1141
4.6838,-9.9491,1142
9.4841,-9.9694,1144
2.5851,-9.8485,1145
2.5768,-10.1869,1146
0.4141,-9.8043,1147
-0.9514,-9.9131,1148
8.2803,-10.0383,1149
-0.382,-10.0032,1150
0.3156,-10.0793,1151
-1.7987,-10.0349,1152
0.8461,-8.6184,1154
11.6093,-9.0057,1155
1.7082,-9.4267,1156
1.1899,-9.7103,1157
0.5853,-11.0702,1158
7.93,-9.2921,1159
-1.3408,-10.1616,1160
2.0174,-10.2778,1161
-0.6687,-9.6683,1162
0.0523,-10.0074,1164
0.4619,-9.8653,1165
-0.3302,-9.9952,1167
0.8242,-10.1438,1168
0.2954,-10.0332,1169
-0.4161,-10.0343,1170
0.0557,-10.0285,1171
-24.2258,-9.6894,1172
6.1707,-9.6957,1173
3.4551,-10.1289,1174
11.7765,-10.0236,1175
4.8902,-9.8163,1176
-0.6389,-9.9774,1177
-0.2758,-10.0348,1178
-16.3675,-9.8169,1179
1.8624,-9.8361,1180
-2.0943,-9.7316,1181
3.317,-9.8529,1182
-4.3037,-9.8418,1183
-5.6555,-9.7798,1184
0.3282,-9.7677,1185
-2.8807,-9.7663,1186
-2.8619,-9.719,1187
2.6223,-9.7489,1189
1.0933,-9.7538,1190
-2.7177,-9.8593,1191
6.0064,-9.5586,1193
8.6221,-9.9467,1194
1.7767,-10.0529,1195
-0.0548,-9.6801,1196
0.0184,-9.8699,1197
-0.0526,-10.3498,1199
0.0998,-9.9735,1200
-4.1523,-10.0555,1201
-2.2816,-10.1131,1202
-0.7801,-10.1198,1203
7.1013,-10.1396,1204
2.9002,-10.1765,1205
7.8511,-9.9059,1206
8.1622,-11.3342,1207
2.3565,-8.6541,1209
0.3334,-9.6486,1210
1.3256,-9.9408,1211
0.2269,-10.3107,1212
-0.3665,-9.4085,1213
-0.039,-9.876,1214
0.4963,-10.0619,1215
-0.0509,-9.868,1216
0.2394,-9.5665,1217
0.537,-10.1312,1219
2.297,-9.9245,1220
-0.5266,-9.484,1221
0.7943,-10.1136,1222
-0.1938,-10.1383,1223
-0.1379,-9.9257,1224
-0.1508,-9.9083,1225
-7.1867,-9.9146,1226
0.344,-9.9746,1227
-1.7791,-9.9307,1229
-2.1361,-9.8784,1230
-2.0228,-9.8778,1231
1.5253,-9.8728,1232
2.1262,-9.9348,1233
11.0434,-9.9256,1235
-1.9405,-9.743,1237
6.9431,-9.5875,1238
15.616,-9.729,1239
-1.8329,-9.9532,1240
0.0282,-10.0636,1241
5.1503,-9.9752,1242
-1.1269,-10.1366,1243
4.5849,-9.9355,1244
4.7375,-10.0454,1245
2.1089,-10.0144,1246
0.2406,-9.8319,1247
1.5664,-9.885,1248
-0.3255,-10.0947,1249
0.0049,-9.9846,1250
1.9118,-10.0215,1251
4.129,-10.029,1252
3.5124,-9.9677,1253
0.8511,-9.9634,1255
-0.0538,-10.3562,1256
0.003,-10.8667,1257
0.3623,-10.2075,1258
0.2463,-6.9871,1259
0.7756,-9.8338,1260
1.4603,-9.8822,1261
-0.5624,-10.1836,1262
-0.939,-9.7509,1263
-0.3757,-10.0224,1265
0.0009,-10.1834,1266
-0.8026,-10.0759,1267
0.1394,-9.5726,1268
-0.4456,-9.7011,1269
-0.2545,-10.1253,1270
0.1657,-10.1448,1271
-0.5245,-10.055,1272
0.6732,-10.0686,1274
0.3181,-10.0833,1275
2.0392,-10.1652,1276
-0.0765,-10.1836,1277
-0.2351,-8.8723,1278
6.6386,-10.0246,1279
2.0081,-10.0263,1280
2.6447,-9.6256,1281
4.6339,-10.1224,1282
-0.6745,-9.9085,1284
-0.2425,-9.8593,1285
0.1734,-9.6431,1286
0.2007,-10.1674,1287
-0.7072,-9.9659,1288
0.0215,-10.2329,1289
-0.6519,-9.7472,1290
-0.1158,-9.9513,1291
-1.171,-10.2794,1292
-0.5355,-10.0432,1294
2.5087,-10.1252,1295
1.9744,-9.3259,1296
7.7408,-9.7303,1297
-0.3345,-9.8388,1298
0.5369,-9.7729,1299
-1.1664,-10.2043,1300
3.3713,-10.3191,1301
-0.057,-10.1808,1302
1.7336,-9.4099,1304
-0.057,-10.3924,1305
-1.0819,-9.7832,1306
0.2779,-10.0251,1307
1.265,-9.8644,1308
-0.0695,-9.9185,1309
-0.2461,-9.8036,1310
-0.2466,-9.3071,1311
-0.4341,-9.951,1312
1.0508,-10.0176,1313
-0.2846,-9.4766,1314
-0.2766,-10.173,1315
0.8908,-9.8496,1316
2.1486,-10.3194,1317
0.7949,-10.0958,1318
1.5553,-10.0122,1319
1.3154,-9.8159,1320
-0.2195,-10.0164,1321
1.0871,-10.1107,1322
11.7425,-9.8128,1323
0.4405,-10.0044,1325
0.2289,-10.0004,1326
0.559,-10.0434,1327
-0.0721,-9.5879,1328
0.091,-9.4014,1329
2.1554,-9.998,1330
1.6622,-10.0866,1331
-0.1339,-9.9165,1332
2.8848,-9.6486,1334
-2.8214,-9.789,1335
3.4744,-9.9492,1336
-2.3287,-9.9616,1337
0.2584,-9.9603,1338
-0.3019,-9.9662,1339
-0.4438,-9.9594,1340
0.4042,-9.9751,1341
-0.5377,-9.9707,1342
0.0494,-9.9729,1344
-0.5145,-9.9419,1345
-0.2252,-9.9712,1346
0.8284,-9.9824,1347
-0.4298,-9.9892,1348
0.1541,-9.9739,1349
0.0133,-9.9905,1350
-0.1393,-9.9781,1351
-0.1742,-9.9796,1352
-0.0755,-9.9802,1353
-0.505,-9.9821,1354
-0.1064,-9.9729,1356
-0.2835,-9.9737,1357
1.521,-9.9622,1358
-1.7088,-9.95,1359
0.2101,-10.0006,1360
-0.1491,-9.9399,1361
-1.5149,-9.9511,1362
0.6143,-9.9604,1363
0.1889,-9.9541,1364
-0.4058,-9.9548,1365
-2.6582,-9.9035,1367
11.0327,-10.0277,1368
17.3544,-10.4394,1369
0.619,-10.2101,1370
3.5849,-10.1814,1371
-0.1306,-10.1837,1372
-0.2326,-9.9565,1374
-0.5998,-10.0736,1375
-0.0918,-9.9928,1376
-0.0312,-10.0456,1377
-0.0162,-10.0165,1378
-1.3535,-9.845,1379
0.9096,-10.118,1380
-1.0519,-10.0508,1381
0.6936,-9.9325,1382
1.9234,-9.7542,1383
-1.4943,-9.9733,1384
0.3107,-9.8693,1385
-0.1934,-10.0644,1386
0.0604,-10.2894,1387
0.988,-9.5278,1388
0.3393,-9.845,1389
0.0502,-9.6834,1390
-0.6336,-9.897,1391
-0.3524,-10.1296,1392
-0.2923,-10.4388,1394
-0.8147,-9.6113,1395
-0.1052,-10.1753,1396
3.4476,-9.8877,1397
1.1083,-9.9055,1398
-0.4437,-10.0042,1399
0.8985,-9.6632,1400
2.8237,-10.0366,1401
4.532,-9.8721,1402
-0.1781,-10.1712,1404
0.9031,-10.0123,1405
0.0107,-9.9517,1406
-0.2616,-9.9506,1407
-13.3147,-9.6874,1408
-2.0881,-9.7633,1409
17.5025,-9.756,1410
-4.599,-9.8667,1411
8.873,-10.5228,1412
2.3165,-10.0318,1413
19.083,-10.0193,1414
8.2041,-10.3109,1415
-27.6499,-9.2332,1416
-0.1151,-9.7794,1417
6.7106,-9.8683,1419
12.1698,-9.7514,1420
-7.2727,-9.9561,1421
-9.171,-9.8331,1422
9.5543,-9.5694,1423
-4.0697,-9.9408,1424
3.7191,-9.7035,1425
-23.0762,-9.7164,1426
26.7624,-9.8193,1428
-0.5175,-9.9837,1429
-1.6656,-9.9982,1430
0.1741,-9.9923,1431
-0.8877,-10.0409,1432
0.1628,-9.9882,1433
-0.0674,-10.0191,1434
0.3626,-10.0383,1436
-0.209,-9.9992,1437
