AYGX_mean,AZ_mean,timestamp
0.404,-9.8074,185
-0.4087,-9.8106,186
0.3605,-9.8048,187
-0.0333,-9.8022,188
-0.2467,-9.7588,189
0.1047,-9.7469,190
1.9993,-9.9016,191
0.9139,-9.3638,192
0.4029,-9.8382,193
0.5729,-9.9539,194
0.6731,-9.9752,195
-1.4316,-9.8037,196
-0.1177,-9.7828,197
-0.1625,-9.7879,198
-0.2034,-9.7891,199
-0.1434,-9.7895,200
0.9534,-9.7367,201
1.7729,-9.7469,202
-1.8042,-9.4532,203
0.0713,-9.7794,204
0.5949,-9.7681,205
0.0116,-9.6886,206
0.0221,-9.9828,207
0.4538,-9.8223,208
-1.0739,-9.7256,209
0.6428,-10.0666,210
0.7236,-9.5326,211
0.0586,-10.0904,212
-0.498,-10.0512,213
-0.1668,-9.7854,214
0.1636,-9.7216,215
-0.0044,-9.9916,216
0.0472,-9.8354,217
0.9901,-9.5681,218
-0.4012,-9.8193,219
0.0255,-9.8271,220
-0.5739,-9.6748,221
-0.1102,-9.7848,222
0.6304,-9.7206,223
-0.1776,-9.8845,224
0.2735,-9.8401,225
-0.1069,-9.5059,226
0.0302,-9.7734,227
-0.3193,-9.7438,228
-0.2809,-9.8502,229
-0.7648,-9.8675,230
1.8154,-8.5888,231
-13.4216,-9.5819,232
1.0066,-9.8771,233
0.4038,-9.7956,234
0.3173,-9.7627,235
-0.0086,-9.7718,236
0.1054,-9.8239,237
-0.0044,-9.9311,238
0.2443,-9.8642,239
0.0676,-9.7672,240
0.1617,-9.8416,241
-0.3676,-9.7579,242
0.8955,-9.9062,243
1.3517,-9.6752,244
0.1572,-9.8196,245
0.1724,-8.9757,246
0.4843,-9.8324,247
2.0044,-9.7241,248
0.3449,-9.9352,249
0.0864,-9.6565,250
0.0582,-9.8881,251
0.1281,-9.7939,252
0.0864,-9.469,253
-0.0863,-9.4541,254
0.0592,-9.8672,255
-0.0119,-9.7731,256
-0.0537,-9.9173,257
0.3401,-9.6361,258
-0.1098,-9.7724,259
-0.1325,-9.7521,260
0.7692,-10.0038,261
0.4178,-9.9779,262
1.5409,-10.2573,263
2.7395,-9.1397,264
0.3611,-9.4379,265
-0.0349,-9.5139,266
0.0898,-8.9791,267
0.0131,-9.4916,268
0.5801,-9.2511,269
-0.6442,-9.8465,270
0.0731,-9.8025,271
0.0026,-9.8432,272
0.2578,-9.905,273
0.4197,-9.9288,274
0.8349,-9.7693,275
-0.1677,-9.8583,276
1.8558,-8.918,277
1.8617,-9.7878,278
0.6635,-9.6726,279
0.4894,-9.6358,280
0.1811,-9.8434,281
0.0107,-9.8409,282
1.3572,-9.2125,283
-0.026,-9.8623,284
0.5852,-9.6944,285
0.5203,-10.2497,286
0.8975,-9.9517,287
0.737,-9.717,288
-0.104,-9.6415,289
0.1286,-9.9001,290
0.39,-9.6142,291
0.7095,-9.8022,292
0.7774,-9.7686,293
0.6178,-9.8628,294
1.0335,-9.783,295
1.0926,-9.8531,296
0.4942,-9.794,297
0.4615,-9.7991,298
0.1348,-9.8181,299
0.4716,-9.887,300
0.0051,-9.619,301
0.578,-9.914,302
1.4115,-9.7381,303
0.3757,-9.7436,304
0.4118,-9.6884,305
1.3649,-9.7168,306
0.8601,-9.9152,307
-0.0538,-9.7841,308
0.0554,-9.7993,309
-0.0875,-9.8825,310
1.093,-9.7512,311
0.5421,-9.4327,312
1.1084,-9.5457,313
1.9659,-9.7801,314
1.1032,-9.6482,315
-0.2085,-10.4563,316
0.5874,-9.754,317
0.4508,-9.9193,318
0.2918,-9.5426,319
0.5804,-9.8579,320
0.7291,-9.9578,321
0.16,-9.4826,322
-0.0357,-9.9424,323
0.993,-9.7896,324
0.9432,-9.8284,325
1.2753,-10.108,326
0.7829,-9.7856,327
0.3178,-9.7086,328
0.6382,-9.602,329
0.0238,-9.6463,330
0.2458,-9.803,331
0.7825,-9.952,332
-0.0113,-9.8763,333
0.0421,-9.7918,334
0.377,-9.8918,335
0.1972,-9.8443,336
0.0435,-9.8328,337
0.446,-9.7439,338
0.9742,-9.808,339
0.2593,-9.776,340
1.3131,-9.9068,341
9.1915,-8.1961,342
10.7225,-9.7987,343
0.7627,-9.792,344
-0.0658,-9.6884,345
-0.3116,-9.6042,346
-0.0462,-9.5703,347
-0.5022,-9.3345,348
0.0188,-9.7286,349
-0.529,-10.1673,350
1.9275,-10.1348,351
0.1254,-9.5191,352
0.286,-10.099,353
0.2724,-9.972,354
0.2501,-9.9433,355
0.8219,-9.7952,356
0.6536,-9.4556,357
0.7133,-9.7384,358
0.3039,-9.9428,359
1.1546,-9.8103,360
0.1327,-9.7055,361
1.3502,-9.4568,362
0.612,-9.803,363
1.0979,-9.8393,364
0.7799,-9.8023,365
0.0996,-9.7078,366
0.0582,-9.8242,367
-0.2555,-9.7376,368
-0.1092,-9.7421,369
0.2034,-10.1148,370
0.2827,-9.8329,371
0.5081,-10.4445,373
3.4753,-8.8493,374
0.5884,-9.9186,375
0.5616,-9.838,376
1.4623,-10.2117,377
3.0151,-9.8416,378
0.0129,-9.8417,379
0.3104,-9.8312,380
1.3191,-9.6259,381
-0.7121,-9.8151,382
0.4782,-10.1143,383
0.562,-9.4103,384
-0.444,-9.659,385
0.416,-9.7663,386
0.6351,-9.8547,388
0.1796,-9.8777,389
-0.047,-9.8249,390
0.0772,-9.65,391
0.1424,-9.7487,392
0.2609,-9.7145,393
-0.0034,-9.7624,394
-0.0449,-9.8038,395
0.5837,-9.891,396
0.6585,-9.7177,397
0.4312,-9.7409,398
0.3783,-9.6748,399
1.2915,-9.2071,400
1.5234,-9.632,401
0.1466,-9.5899,402
-0.14,-10.1981,403
-0.1284,-9.7806,404
3.3783,-9.2733,405
-0.1292,-10.018,406
-0.0837,-9.7205,407
-0.721,-9.9396,408
0.3336,-9.8053,409
1.3815,-9.7793,410
1.0739,-9.7279,411
0.2476,-9.741,412
0.0509,-9.8905,413
0.016,-9.5369,414
0.0972,-9.827,415
0.3894,-9.8018,416
0.8436,-9.7884,417
0.7041,-9.9475,418
0.445,-9.7784,419
-0.0116,-9.8239,420
-0.1884,-9.3537,421
0.1028,-10.0215,422
0.1082,-9.1392,423
0.3566,-9.952,424
-0.1411,-9.8346,425
0.0013,-9.8328,426
0.0166,-9.8583,427
-0.0086,-9.8439,428
0.0101,-9.8053,429
0.0623,-9.8097,430
-0.1501,-9.8439,431
-0.5963,-9.8411,432
-0.2662,-9.8085,433
-0.2831,-9.811,434
-0.3073,-9.8078,435
-0.2082,-9.8076,436
-0.2949,-9.8075,437
-0.2374,-9.8032,438
-0.3986,-9.8069,439
-0.0779,-9.8076,440
-0.2801,-9.8086,441
-0.2294,-9.8063,442
-0.2277,-9.807,443
-0.2185,-9.8079,444
-0.5077,-9.8077,445
1.1662,-9.7752,446
-0.1687,-9.777,447
-0.3561,-9.82,448
3.5506,-9.6329,449
0.5946,-9.8077,450
0.1896,-9.7075,451
0.0273,-9.8246,453
0.0431,-9.791,454
0.287,-9.8421,455
-0.1007,-9.7292,456
0.0248,-9.8388,457
-0.0201,-9.9656,458
-0.2383,-9.8123,459
-0.2654,-9.7622,460
0.0274,-9.9439,461
-0.0142,-9.8225,462
0.0528,-9.9141,463
0.1076,-9.8326,464
1.0938,-9.7474,465
0.0629,-9.839,466
-0.0315,-9.8395,467
0.3901,-9.8644,468
0.2201,-9.8278,469
0.0284,-9.8343,470
0.0276,-9.8214,471
0.0023,-9.8199,472
0.2387,-9.8221,473
-0.4688,-9.8612,474
-0.1108,-9.7873,475
-0.1971,-9.8142,476
-0.1129,-9.8125,477
-0.156,-9.8133,478
-0.1589,-9.8109,479
-0.1359,-9.8113,480
-0.0675,-9.8092,481
-0.2257,-9.8114,482
-0.1337,-9.8107,483
-0.1449,-9.8107,484
-0.0942,-9.8128,485
-0.1118,-9.8126,486
-0.2205,-9.811,487
-0.0845,-9.8109,488
-0.1886,-9.8114,489
-0.1452,-9.8097,490
-0.1903,-9.812,491
-0.2157,-9.8082,492
-0.128,-9.81,493
-0.0678,-9.8107,495
-0.2363,-9.811,496
-0.1913,-9.8088,497
-0.0838,-9.8109,498
-0.1674,-9.8107,499
-0.1055,-9.8115,500
-0.2355,-9.8107,501
-0.1362,-9.7952,502
-0.1104,-9.7995,503
-0.2492,-9.7756,504
0.165,-9.7128,505
0.1619,-9.6328,506
-0.1287,-9.7447,507
-0.2771,-9.9713,508
0.3832,-9.8517,509
0.2602,-9.8838,510
2.899,-9.7036,511
-1.827,-9.1913,512
6.0845,-9.3612,513
7.4421,-10.1193,514
0.1031,-9.541,515
1.0266,-9.9102,516
0.1271,-9.4498,517
0.8501,-9.8569,518
1.3073,-9.921,519
0.8064,-9.5783,520
-0.33,-9.186,521
1.1999,-9.8951,522
1.352,-9.8638,523
0.0183,-9.9009,524
0.4367,-8.6836,525
0.1937,-9.6571,526
0.7286,-9.7068,527
0.1615,-10.1494,528
0.544,-9.5884,529
0.4159,-9.7074,530
0.1759,-9.9918,531
1.212,-9.8543,532
0.0515,-9.6668,533
0.1221,-10.0233,534
-0.1971,-9.8849,535
0.1018,-9.7312,536
0.0204,-9.8193,537
0.0823,-9.868,538
0.0992,-9.8052,539
0.0318,-9.8283,540
-0.0066,-9.8372,541
-0.0301,-9.9109,542
-0.0428,-9.8505,543
0.2316,-9.8523,544
-0.0218,-9.751,545
-0.0455,-9.8781,546
-0.2591,-10.1993,547
-2.0505,-9.8529,548
-0.8039,-9.7901,549
0.7039,-9.7934,550
0.0389,-9.7931,551
-0.0092,-9.7891,552
0.1363,-9.795,553
-0.7965,-9.8251,554
1.0075,-9.7805,555
2.9562,-9.6963,556
1.4613,-9.8584,557
1.5301,-9.7133,558
3.1823,-9.7005,559
0.7468,-10.0031,560
0.5483,-9.6663,561
-0.7704,-9.8678,562
0.2665,-9.8483,563
4.348,-8.3449,564
0.7922,-9.4037,565
0.2125,-9.9633,566
2.0605,-9.8251,567
0.2091,-9.8702,568
0.8999,-9.754,569
-0.1773,-9.8861,570
0.2021,-10.0078,571
1.3567,-9.7594,572
1.0414,-9.8137,573
-0.1549,-9.9785,574
0.1804,-9.8686,575
0.1916,-9.7796,576
0.0422,-9.819,577
0.6094,-9.7698,578
0.1945,-9.8602,579
0.196,-9.8127,580
-0.0921,-9.9311,581
0.059,-9.7268,582
-0.018,-9.9357,583
0.1181,-9.7716,584
0.4644,-9.7883,585
0.0974,-9.7942,586
-0.2046,-9.8073,587
0.4302,-9.6804,588
0.7039,-9.3531,589
-0.3838,-9.9364,590
0.5484,-9.9811,591
0.7038,-9.8621,592
0.6673,-9.7441,593
0.2862,-9.7505,594
0.4409,-9.9118,595
-0.0301,-9.7543,596
0.1588,-9.7946,597
0.9159,-9.8159,598
0.7834,-9.7771,599
0.2871,-9.8311,600
0.2491,-9.5864,601
0.0453,-9.8213,602
0.0244,-9.7823,603
0.9196,-9.7821,604
0.8515,-9.7646,605
0.4725,-9.7102,606
-0.0351,-9.9778,607
0.1831,-9.7643,608
0.1479,-9.8776,609
0.6294,-9.7181,610
0.4596,-10.1665,611
0.4267,-9.7522,612
0.3886,-9.779,613
0.3742,-9.8388,614
0.4842,-9.8034,615
0.1938,-9.8914,616
0.6777,-9.7292,617
0.254,-9.799,618
0.4041,-9.8817,619
0.2563,-9.8269,620
0.1582,-9.6319,621
0.8585,-9.8652,622
0.3935,-9.7572,623
0.2796,-9.843,624
1.6576,-9.8933,625
0.0325,-10.0046,626
0.103,-9.5746,627
0.3383,-9.7616,628
-0.0563,-9.7847,629
0.1816,-9.7875,630
-0.0889,-9.3353,631
1.1277,-9.7455,632
2.2006,-10.0302,633
0.734,-9.831,634
1.7402,-9.8457,635
0.2752,-9.8039,636
0.154,-9.8966,637
0.0776,-9.8117,638
-0.0161,-9.8695,639
0.0915,-9.831,640
0.2316,-9.8225,641
0.5651,-9.7915,642
0.5141,-9.8264,643
-0.0548,-9.9222,644
-0.0002,-9.8279,645
-0.6663,-9.8502,646
-0.0368,-9.8202,647
-0.4256,-9.8095,648
-0.2595,-9.8047,649
-0.1989,-9.8074,650
-0.1746,-9.8053,651
-0.2439,-9.807,652
0.1048,-9.7796,653
0.2049,-9.6951,654
-0.0878,-9.7579,655
-0.6902,-9.7761,656
-0.0376,-9.8311,657
1.1,-9.7853,658
0.2972,-9.968,659
1.9101,-9.5112,660
0.3794,-9.6869,661
0.0967,-9.5723,662
-0.1285,-9.5402,663
0.3472,-9.7808,664
1.6795,-9.8365,665
-0.0757,-10.4921,666
0.3611,-9.8005,667
1.6853,-9.4725,668
1.1419,-10.1629,669
0.7092,-9.2915,670
4.8569,-9.3948,671
0.7329,-10.161,672
4.0887,-10.1063,673
2.6337,-9.7834,674
0.8779,-9.9238,676
0.8421,-9.6336,677
0.9723,-9.8231,678
0.4614,-9.7461,679
0.6192,-9.412,680
1.5964,-10.6489,681
-0.2659,-8.8329,682
0.2583,-9.5107,683
2.4235,-9.9215,684
-0.0344,-9.8986,685
2.0934,-9.9282,686
1.1346,-9.7814,687
0.6435,-9.8649,688
0.6183,-9.814,689
0.6549,-9.8022,690
0.3758,-9.7729,691
0.9287,-9.5613,692
-0.0546,-9.5543,693
0.9611,-9.9513,694
0.9421,-9.4126,695
1.2343,-9.8319,696
0.5183,-9.8471,697
1.0842,-9.7766,698
1.1326,-9.6763,699
0.1862,-9.8112,700
1.5924,-10.0446,701
0.331,-9.69,702
0.3514,-10.3403,703
-0.2271,-9.2732,704
1.1787,-9.9328,705
0.1457,-9.9509,706
-0.1991,-9.766,707
1.211,-9.6416,708
0.4667,-10.0512,709
1.9716,-10.1073,710
20.6695,-9.4603,711
-0.6543,-10.1158,712
1.4306,-9.6876,713
0.4126,-9.9842,714
0.4761,-9.7394,715
0.2415,-9.7917,716
0.5301,-9.8718,717
0.128,-9.9435,718
-0.0216,-9.8232,719
0.1531,-9.8304,720
-0.0815,-9.809,721
