AYGX_mean,AZ_mean,timestamp
0.5169,-9.6976,0
0.5161,-9.6972,1
0.518,-9.6977,2
0.5215,-9.6977,3
0.61,-9.7022,4
-1.992,-9.6336,6
-2.2887,-9.7118,7
-0.498,-9.6661,8
0.8935,-9.6216,9
-6.777,-9.6807,10
-0.7422,-9.5754,11
-1.3421,-9.606,12
12.0823,-9.6426,13
-0.7233,-9.7186,14
0.167,-9.7238,15
-2.9682,-9.7184,16
1.6199,-9.6818,17
-10.9531,-9.6367,18
4.6203,-9.5288,19
8.9082,-9.6221,20
-3.7423,-9.5984,21
6.3735,-9.6045,22
-2.5432,-9.6367,23
-0.886,-9.4561,24
13.9651,-9.629,25
-0.1275,-9.7104,26
-3.292,-9.6861,27
2.1257,-9.7016,28
-0.6193,-9.6658,29
0.3495,-9.6946,30
0.1271,-9.7006,31
-0.3515,-9.7054,32
0.0837,-9.6952,33
-0.1761,-9.6928,34
-0.9855,-9.7264,35
-0.2732,-9.7042,36
1.4453,-9.7504,37
-2.9818,-9.759,38
-1.5473,-9.7035,39
1.383,-9.7415,40
2.3253,-9.7121,41
3.1047,-9.4967,42
-0.6912,-9.652,43
5.1471,-9.7074,44
8.2471,-8.8303,45
4.3152,-9.6456,46
-1.8114,-9.5381,47
-15.5156,-9.24,48
7.5556,-9.6374,49
6.5256,-10.0614,50
11.3034,-9.1708,51
0.0412,-10.3021,52
1.6869,-9.6836,53
0.3627,-9.7594,54
0.6615,-9.6957,55
-0.9039,-9.7552,56
1.415,-9.7376,57
1.0353,-9.8951,58
0.6357,-9.7292,59
1.4542,-9.6443,60
1.505,-9.7224,62
0.9875,-9.6534,63
5.194,-9.7624,64
8.5072,-9.5503,65
2.399,-9.5821,66
5.9618,-8.3029,67
5.9103,-9.6658,68
1.1319,-9.6429,69
1.1141,-9.8258,70
0.0095,-9.4991,71
5.9859,-9.5128,72
-0.091,-9.5157,73
3.6862,-9.7605,74
0.9734,-9.521,75
2.5235,-9.8487,76
0.0605,-9.7633,78
1.6701,-9.7837,79
0.6804,-9.6736,80
1.2639,-9.731,81
1.7053,-9.6612,82
10.8192,-9.9007,83
6.1914,-9.5678,84
6.4199,-9.7392,85
19.986,-9.9774,86
3.3948,-9.7499,87
2.6936,-9.8093,88
15.5935,-9.8848,89
2.956,-9.7503,90
-1.1247,-9.532,91
-7.7797,-9.8809,92
1.6252,-9.687,93
0.5313,-9.7134,94
5.2254,-9.5223,95
0.6281,-9.6432,96
0.1049,-9.7463,97
0.3822,-9.8395,98
0.2239,-9.8398,99
3.1161,-9.8205,100
0.8168,-8.9203,101
9.1004,-9.8802,102
-0.0343,-9.5933,103
1.3423,-9.6651,104
-0.6015,-9.7263,105
3.1792,-9.7292,106
0.3271,-9.4372,107
3.0277,-9.7818,108
0.3693,-9.8169,109
1.7046,-9.609,110
1.0033,-9.7247,111
1.2092,-9.8686,112
1.1056,-8.7826,113
-0.0172,-9.7144,114
-0.2816,-9.77,115
0.2855,-9.6219,116
3.0666,-9.7691,118
-1.3037,-9.7135,119
-1.0254,-9.7914,120
8.1484,-9.6708,121
0.0535,-9.7426,123
-0.01,-9.7377,124
-0.0174,-9.7273,125
-0.7414,-9.7302,126
-0.3528,-9.7096,128
-0.7332,-9.7165,129
0.0877,-9.7186,130
-0.4777,-9.7218,131
-0.6887,-9.7395,132
-0.8449,-9.7283,133
-0.0854,-9.7327,134
1.9396,-9.6955,135
2.7421,-9.8213,136
0.2873,-8.7226,137
1.8948,-9.6775,138
1.182,-9.9799,139
2.6314,-10.004,140
-3.5957,-8.5557,141
-1.5266,-9.7177,142
14.7651,-10.005,143
5.3774,-9.6199,144
-4.8748,-9.8812,145
4.6453,-9.9324,146
1.4535,-9.8023,147
0.0092,-9.7399,148
1.0986,-9.5725,149
0.7885,-9.8449,150
1.8419,-9.8248,151
-2.578,-9.8558,152
6.4867,-10.1799,153
0.4217,-9.3259,154
8.3317,-10.298,155
2.9288,-10.1348,156
3.0681,-9.6925,157
0.8166,-9.4656,158
8.9592,-9.3931,159
-3.6792,-9.4408,160
6.1726,-10.1243,161
2.5251,-10.6685,162
-1.6941,-9.1872,163
2.5491,-9.5072,164
-5.6297,-9.5761,165
5.3519,-9.7772,166
0.4004,-10.3682,167
14.4499,-9.6755,168
2.5153,-7.9689,169
3.619,-9.9325,170
-3.0198,-8.9766,171
2.2053,-9.1834,172
2.3271,-10.0237,173
-0.9948,-9.8632,174
4.235,-9.7937,175
0.6123,-10.3599,176
12.6893,-9.8395,177
3.4108,-7.0084,178
1.8538,-9.8657,179
0.1403,-10.2987,180
25.4032,-10.7718,181
1.5218,-9.4445,182
-5.5293,-9.645,183
0.7452,-8.1364,184
18.977,-9.3055,185
-0.561,-9.5314,186
7.0483,-9.6436,187
4.0407,-9.4684,188
3.2134,-9.6326,189
0.1577,-10.035,190
4.9579,-10.2052,191
4.1848,-9.9787,192
0.5379,-8.3663,193
19.8705,-9.3807,194
13.9964,-10.1847,195
9.0929,-9.7613,196
6.2005,-9.6515,197
17.2035,-10.1813,198
20.0729,-9.9127,199
2.8602,-8.8333,200
4.8005,-9.8407,201
1.3635,-9.1811,202
-1.1503,-9.9966,203
0.6222,-9.5814,204
0.852,-9.7172,205
2.7492,-9.6942,206
0.5374,-9.5421,207
-0.2937,-10.0674,208
0.0788,-9.7526,209
4.5853,-9.8658,210
14.0273,-9.9887,211
7.0277,-9.7348,212
2.4012,-9.6005,213
-0.8618,-10.1747,214
5.106,-9.8751,215
0.3485,-9.4387,216
-0.1667,-9.8257,217
-3.3306,-10.3949,218
3.2137,-9.1023,219
8.0004,-9.8313,220
0.5038,-9.4802,221
1.5055,-9.5988,222
2.6151,-9.5119,223
5.4268,-10.0176,224
0.7779,-9.555,225
-0.1782,-9.755,226
2.1056,-9.4792,228
2.0934,-9.7224,229
0.4012,-8.8633,230
4.6391,-8.2623,231
0.7116,-9.7804,232
-0.3332,-9.7982,233
0.4355,-9.5695,234
0.8838,-10.1448,235
0.1522,-9.8858,236
1.7143,-9.7908,238
3.7135,-9.6102,239
1.9644,-9.5135,240
2.6656,-9.7584,241
15.4888,-9.7022,242
5.2558,-9.8987,243
6.4688,-9.8106,244
2.4014,-9.8281,245
3.3555,-9.7591,246
4.014,-9.6969,247
9.982,-9.8094,248
12.1303,-9.8803,249
2.3278,-9.667,250
-2.4788,-9.6917,251
7.4183,-9.9836,252
-0.8278,-9.768,253
0.5903,-9.6498,254
0.3435,-9.8891,255
0.7972,-9.6943,256
0.2701,-10.0999,257
2.133,-9.8913,258
1.0615,-9.7581,259
0.1931,-9.8303,260
5.3058,-9.7677,261
9.0199,-9.6713,262
6.3907,-9.353,263
5.041,-9.7537,264
4.3258,-9.7414,265
0.5896,-9.9494,266
1.5212,-10.3062,267
-1.8656,-9.6775,268
0.3471,-9.7146,269
0.3097,-9.3756,270
1.8289,-10.0439,271
5.0278,-9.776,272
-0.8808,-9.7194,273
2.1559,-9.7866,274
-0.0616,-9.7515,275
0.3137,-9.7484,276
-1.5721,-9.7331,277
1.1089,-9.7912,278
-9.2316,-9.6886,279
-0.7387,-9.6951,280
0.0525,-9.7814,281
-2.5844,-9.8577,282
-3.2966,-9.5938,283
-4.7282,-9.6343,284
2.4858,-9.4699,286
-5.4405,-9.7092,287
0.6601,-9.798,288
-0.6663,-9.7131,290
-0.6665,-9.7163,291
-0.6592,-9.7181,292
-0.6513,-9.7186,293
-0.6541,-9.7178,294
-0.6458,-9.7192,295
-0.6505,-9.7179,296
-0.6481,-9.7172,297
-0.6489,-9.7175,298
-0.6455,-9.7179,299
-0.646,-9.7181,300
-0.6461,-9.7209,301
-0.6519,-9.7184,303
-0.6496,-9.7191,304
-0.6551,-9.7184,305
-0.6463,-9.7198,306
-0.6449,-9.718,307
-0.6532,-9.7181,308
-0.646,-9.7209,309
-1.4567,-9.6853,310
-4.9658,-9.6441,311
0.6267,-9.673,312
-4.4933,-9.2885,313
-2.7548,-9.3946,314
4.4945,-9.6976,315
2.4937,-9.2993,316
-8.5456,-9.5184,317
11.3551,-9.4055,318
-2.1084,-9.601,319
-1.6164,-9.6032,320
-1.5549,-9.5974,321
-1.5984,-9.5967,322
-1.6335,-9.5962,323
-1.6368,-9.5961,324
-1.6579,-9.5959,325
-1.6483,-9.5957,326
-1.6409,-9.5953,327
-1.655,-9.5957,328
-1.6273,-9.5958,329
-1.6463,-9.5957,330
-1.6295,-9.5942,331
-1.6332,-9.5962,332
-1.6506,-9.5975,333
-1.6434,-9.5963,334
-1.6346,-9.5958,335
-1.6505,-9.5962,336
-1.6365,-9.5952,337
-1.6472,-9.5951,338
-1.6466,-9.5969,339
-1.6397,-9.5967,340
-1.6478,-9.5963,341
-1.6585,-9.5958,342
-1.6434,-9.5952,343
-1.6481,-9.5958,344
-1.6444,-9.5961,345
-1.6594,-9.595,346
-1.6535,-9.5955,348
-1.6399,-9.5973,349
-1.6585,-9.5957,350
-1.6631,-9.5966,351
-1.6622,-9.5956,352
-1.6526,-9.5954,353
-1.6701,-9.5942,354
-1.6607,-9.5942,355
-1.6581,-9.5957,356
-1.6662,-9.5952,358
-1.6577,-9.5952,359
-1.6626,-9.5947,360
-1.6512,-9.5955,361
-1.6447,-9.5956,362
-1.6562,-9.5937,363
-1.6651,-9.5949,364
-1.6656,-9.594,365
-1.6715,-9.5955,366
-1.6626,-9.5957,367
-1.6643,-9.5954,368
-1.6614,-9.5951,369
-1.664,-9.5951,370
-1.6615,-9.5958,371
-1.6542,-9.5956,372
-1.6651,-9.5953,373
-1.6741,-9.5951,374
-1.6752,-9.5947,375
-1.6735,-9.5957,376
-1.6681,-9.5958,377
-1.6631,-9.596,378
-1.6629,-9.5959,379
-1.6649,-9.5962,380
-1.6902,-9.5957,381
-1.6643,-9.5957,382
-1.6605,-9.5961,383
-1.6733,-9.5959,384
-1.674,-9.5961,385
-1.6713,-9.5966,386
-1.6857,-9.5958,387
-1.6855,-9.595,388
-1.6746,-9.5958,389
-1.6851,-9.5961,390
-1.6836,-9.596,391
-1.669,-9.5957,392
-1.6864,-9.5964,393
-1.6847,-9.5965,394
-1.6756,-9.5965,395
-1.6718,-9.5967,396
-1.6729,-9.5982,397
-1.681,-9.597,398
-1.6821,-9.596,399
-1.6826,-9.5964,400
-1.6742,-9.5973,401
-1.6739,-9.5966,402
-1.6856,-9.5973,403
-1.6847,-9.5961,404
-1.6858,-9.5972,405
-1.6917,-9.5973,406
-1.6852,-9.5973,408
-1.6938,-9.5972,409
-1.6768,-9.5964,410
-1.6736,-9.5983,411
-1.6908,-9.5981,412
-1.6874,-9.5988,413
-1.6779,-9.5956,414
-1.6833,-9.5976,415
-1.6814,-9.5964,416
-1.6861,-9.5964,417
-1.6857,-9.5973,418
-1.6909,-9.5973,419
-1.6847,-9.5964,420
-1.6856,-9.5969,421
-1.6863,-9.5974,422
-1.6926,-9.5961,423
-1.697,-9.5961,424
-1.6908,-9.5965,425
-1.6888,-9.5976,426
-1.689,-9.5966,427
-1.6795,-9.5951,428
-1.6947,-9.5972,429
-1.6952,-9.5978,430
-1.6863,-9.5962,431
-1.7076,-9.5944,432
-1.6962,-9.5973,433
-1.6915,-9.5962,434
-1.7078,-9.5963,435
-1.7026,-9.5969,436
-1.6991,-9.596,437
-1.7123,-9.5974,438
-1.7005,-9.5964,439
-1.6959,-9.5966,440
-1.7115,-9.5945,441
-1.6891,-9.5967,442
-1.7029,-9.5947,443
-1.7073,-9.595,444
-1.7087,-9.5946,445
-1.6979,-9.597,446
-1.7018,-9.5959,447
-1.6951,-9.5963,448
-1.7059,-9.5961,449
-1.7059,-9.5964,450
-1.7184,-9.5956,451
-1.7038,-9.5971,452
-1.7012,-9.5979,453
-1.7001,-9.5973,454
-1.6981,-9.5981,455
-1.7035,-9.5966,456
-1.7116,-9.5971,457
-1.709,-9.5974,458
-1.697,-9.5975,460
-1.7152,-9.5985,461
-1.7097,-9.5974,462
-1.7069,-9.5972,463
-1.7157,-9.5972,464
-1.7116,-9.5978,465
-1.7141,-9.5964,466
-1.6998,-9.5972,467
-1.7106,-9.5978,468
-1.7072,-9.5976,469
-1.709,-9.5983,470
-1.7147,-9.5978,471
-1.6987,-9.5974,472
-1.7213,-9.5974,473
-1.7005,-9.5976,474
-1.7133,-9.5985,475
-1.7202,-9.5978,476
-1.7003,-9.5977,477
-1.7205,-9.5993,478
-1.7229,-9.5986,479
-1.7298,-9.598,480
-1.7276,-9.5991,481
-1.73,-9.5984,482
-1.7238,-9.5983,483
-1.7269,-9.5981,484
-1.7216,-9.5989,485
-1.7335,-9.5973,486
-1.7259,-9.5984,487
-1.7375,-9.5982,488
-1.7227,-9.5981,489
-1.7278,-9.5984,490
-1.7343,-9.5973,491
-1.7333,-9.5992,492
-1.7217,-9.5984,493
-1.7236,-9.5986,494
-1.7245,-9.5976,495
-1.7269,-9.598,496
-1.7357,-9.5978,497
-1.7196,-9.5992,498
-1.7262,-9.5994,499
-1.7316,-9.5975,500
-1.7328,-9.5979,501
-1.7262,-9.5985,502
-1.7185,-9.5981,503
-1.7252,-9.5986,504
-1.7292,-9.5968,505
-1.7236,-9.5987,506
-1.7105,-9.5983,507
-1.7345,-9.5983,508
-1.734,-9.5978,509
-1.7271,-9.5977,510
-1.7223,-9.5973,511
-1.7271,-9.598,512
-1.7433,-9.5976,513
-1.729,-9.5978,514
-1.7259,-9.5977,515
-1.7288,-9.5983,516
-1.7351,-9.5968,518
-1.7289,-9.5964,519
-1.7265,-9.5964,520
-1.7424,-9.5962,521
-1.7409,-9.5978,522
-1.726,-9.5968,523
-1.7308,-9.5963,524
-1.7306,-9.598,525
-1.7417,-9.5976,526
-1.7378,-9.5971,528
-1.734,-9.5975,529
-1.7332,-9.5966,530
-1.741,-9.5972,531
-1.7576,-9.596,532
-1.7412,-9.5983,533
-1.7335,-9.5975,534
-1.738,-9.5977,535
-1.7383,-9.5978,536
-1.7465,-9.5969,537
-1.7409,-9.598,538
-1.7324,-9.5975,539
-1.7307,-9.5979,540
-1.733,-9.5969,541
-1.7363,-9.5966,542
-1.7491,-9.5975,543
-1.7309,-9.5976,544
-1.7363,-9.5974,545
-1.7272,-9.5981,546
-1.7401,-9.5959,547
-1.7339,-9.5982,548
-1.7325,-9.5974,549
-1.7253,-9.5982,550
-1.7311,-9.5977,551
-1.7291,-9.5966,552
-1.7325,-9.5985,553
-1.7417,-9.5988,554
-1.7348,-9.5992,555
-1.7399,-9.5987,556
-1.7439,-9.597,557
-1.7365,-9.5982,558
-1.7513,-9.5985,559
-1.7465,-9.5978,560
-1.758,-9.5977,561
-1.7417,-9.5992,562
-1.7435,-9.5984,563
-1.7618,-9.598,564
-1.7422,-9.5988,565
-1.7483,-9.5984,566
-1.748,-9.5997,567
-1.7508,-9.5989,568
-1.7517,-9.5993,569
-1.7414,-9.6004,570
-1.7581,-9.5986,571
-1.7483,-9.5995,572
-1.7478,-9.598,573
-1.7476,-9.6002,574
-1.7483,-9.5994,575
-1.7489,-9.5989,576
-1.7504,-9.5994,578
-1.7548,-9.6009,579
-1.7481,-9.599,580
-1.7483,-9.6005,581
-1.7506,-9.5988,582
-1.7507,-9.5985,583
-1.7543,-9.6002,584
-1.752,-9.5997,585
-1.7599,-9.5999,586
-1.7533,-9.6001,588
-1.7577,-9.6003,589
-1.7622,-9.6025,590
-1.7656,-9.6003,591
-1.7648,-9.6,592
-3.4376,-9.6494,593
13.8103,-9.3511,594
-0.3728,-9.6924,595
-1.9414,-9.7061,596
-16.7515,-9.6422,598
2.788,-9.6766,599
0.9433,-9.7109,600
0.5427,-9.7038,601
0.8648,-9.6681,602
1.6513,-9.6976,603
0.7906,-9.6942,604
0.2162,-9.6774,605
1.8258,-9.7007,606
0.5003,-9.6918,608
0.8205,-9.6916,609
-0.0839,-9.6947,610
1.3578,-9.6599,611
1.1707,-9.7176,612
4.3047,-9.6746,613
-0.5994,-9.6828,614
5.9936,-9.7243,615
0.5284,-9.7388,616
0.6478,-9.7588,617
2.6619,-9.746,618
1.835,-9.7466,619
4.3801,-9.7726,620
0.1664,-9.7621,621
2.4662,-9.7255,622
15.8661,-9.8062,623
13.7907,-10.0563,624
0.1339,-10.0393,625
1.2115,-9.7357,626
1.8093,-9.7727,628
14.343,-9.7524,629
2.2391,-9.5497,630
0.5426,-9.8413,631
-0.8383,-9.8833,632
7.7671,-10.0511,633
-0.2254,-9.6576,634
4.2784,-9.7647,635
7.864,-8.9766,636
3.0433,-9.8879,637
2.2489,-9.6759,638
2.9422,-9.8147,639
0.756,-9.2815,640
8.4928,-9.6033,641
4.6668,-9.8902,642
15.3164,-9.8361,643
1.5836,-9.9134,644
12.1904,-10.0293,645
-0.4649,-9.2683,646
2.6314,-9.819,647
-0.7309,-9.7344,648
2.262,-9.7035,649
9.321,-9.9886,651
2.3402,-9.8914,652
2.8778,-10.1287,653
0.1177,-9.8534,654
3.6581,-9.7491,655
0.2388,-9.6473,656
6.5867,-9.6962,658
6.8726,-9.8265,659
4.3314,-9.6736,660
3.6514,-9.8672,661
0.5382,-9.6079,662
-0.271,-9.8198,663
1.3602,-9.6939,664
0.2809,-9.8843,665
6.0453,-9.7225,666
0.0821,-9.7424,668
0.3417,-9.7414,669
0.2422,-9.7374,670
1.5147,-9.7517,671
0.9842,-9.7359,672
0.245,-9.7103,673
1.2669,-9.6487,674
-0.1949,-9.3286,675
0.6637,-9.7554,676
2.1311,-9.5127,677
-0.0821,-9.7474,678
1.967,-9.7461,679
1.6475,-9.8243,680
7.1293,-9.7219,681
0.0236,-9.7673,682
-0.0806,-9.7813,683
1.6819,-9.7012,684
-1.5793,-9.7347,685
-2.0741,-9.717,686
-4.6839,-9.6822,687
1.7499,-9.729,688
0.2455,-9.7236,689
-0.4424,-9.739,690
0.1006,-9.7287,691
-0.4188,-9.7111,692
4.3799,-9.7399,693
0.0394,-9.7917,694
-1.3277,-9.7271,695
1.3534,-9.732,696
-0.6203,-9.718,697
-1.3367,-9.7327,698
0.4797,-9.7255,699
-0.0883,-9.7223,700
1.4461,-9.7418,701
0.8182,-9.6996,703
21.0769,-9.8847,704
34.2017,-9.8886,705
51.1881,-9.6674,706
-8.9417,-9.4273,707
4.665,-9.8567,708
30.6861,-9.9889,709
29.6504,-10.071,710
-8.207,-11.1735,711
10.1928,-9.83,712
5.8214,-10.2115,713
0.9608,-9.7768,714
1.3071,-9.7892,715
-4.6101,-9.7595,716
-0.1676,-9.969,717
1.5887,-9.8221,718
12.1774,-9.941,719
9.3779,-9.683,720
0.1758,-10.003,721
2.835,-9.9766,722
0.1153,-9.7583,723
0.2116,-9.7142,724
2.4108,-9.7487,725
1.778,-9.9667,726
29.4705,-9.7779,727
-1.044,-10.1927,728
8.9914,-9.7821,729
2.839,-9.7229,730
4.3548,-9.9702,731
9.5602,-9.5681,732
-0.2435,-9.2523,733
3.7809,-9.7244,734
1.6962,-9.6429,735
0.8813,-10.0469,736
-0.5152,-9.6918,737
3.0358,-9.2762,738
1.1598,-9.5881,739
1.3201,-9.7885,740
2.654,-9.7201,741
0.6343,-9.5949,743
3.1758,-9.258,744
0.5006,-9.6834,746
1.2463,-9.6169,747
2.1161,-9.6496,748
81.4603,-9.3551,749
54.1851,-10.2224,750
8.6847,-9.9287,751
8.6273,-9.7149,753
0.3363,-9.1896,754
-0.0813,-9.7451,755
-0.5004,-10.0945,756
14.0506,-9.4183,757
5.0533,-10.1424,758
2.0798,-9.4382,759
-0.2132,-9.6616,760
1.5962,-9.6674,761
-7.1066,-9.6563,762
4.403,-10.1504,763
1.4943,-9.6309,764
0.0881,-9.957,765
2.1764,-10.0213,766
-0.417,-9.7729,767
4.3419,-9.476,768
3.5453,-9.4237,769
5.3295,-10.2192,770
1.3634,-9.6678,771
0.7812,-9.836,774
6.3124,-9.495,775
-0.897,-9.7713,777
0.9977,-9.4173,778
1.5002,-9.608,780
2.5523,-10.0915,782
5.5405,-9.9585,784
0.6341,-9.6889,785
0.6986,-9.5145,786
7.1516,-9.4759,787
-2.7677,-9.5669,789
1.9623,-9.2979,790
2.486,-9.7394,791
-3.3721,-9.5362,792
6.0074,-9.6277,794
-2.35,-9.7258,795
0.676,-9.9452,796
25.3449,-9.9772,797
-1.6461,-7.3869,798
-2.8926,-9.2401,799
-1.7292,-9.8959,800
-0.6421,-9.9336,801
5.4722,-10.0626,803
16.6417,-9.7541,804
-5.919,-10.0641,805
38.5722,-8.9923,806
6.1675,-9.5191,807
1.8896,-9.2609,808
13.7516,-9.5742,809
2.3021,-9.5675,810
3.2603,-9.7933,811
1.098,-9.7121,813
5.3651,-9.8266,814
16.9697,-9.321,816
3.1791,-9.8831,817
2.847,-9.6667,819
0.2693,-9.7324,820
2.5045,-9.6714,821
1.3538,-9.7846,823
7.5825,-9.7643,824
0.4978,-9.515,825
40.8434,-9.6286,826
1.453,-9.5698,827
-1.1545,-9.1733,828
3.884,-10.3882,829
0.5024,-9.718,830
7.2311,-9.8216,831
3.1517,-10.0077,833
2.3136,-9.778,834
17.3082,-9.7164,835
3.4785,-9.7452,836
3.8298,-10.116,837
0.4407,-9.6765,838
20.0084,-9.5735,840
1.9822,-9.7928,841
10.9584,-9.4762,842
6.0717,-9.5185,843
6.9011,-9.3867,844
0.326,-9.7457,845
1.5575,-9.7081,846
-2.6513,-9.8008,847
1.5717,-9.7564,848
14.3016,-9.8034,849
3.6307,-9.4915,850
49.48,-9.8439,851
7.4129,-10.1466,853
-0.1713,-9.5736,854
1.6944,-9.3994,855
-0.3018,-9.5606,856
-1.0982,-9.4521,857
5.2681,-9.7134,858
2.7675,-9.4011,859
0.2686,-9.5969,860
0.5905,-9.889,861
2.5839,-9.7742,863
3.8244,-9.6272,864
5.0998,-9.8633,865
1.6699,-10.0207,866
1.1876,-9.6115,867
-0.1418,-10.5562,868
12.2177,-9.833,869
-0.9692,-8.9914,870
1.8963,-9.4992,871
1.7871,-10.0467,872
0.0018,-10.1206,873
2.4163,-9.5346,874
2.9692,-9.7837,875
1.2185,-9.6243,876
8.9267,-9.8326,877
3.4215,-9.6724,878
0.4013,-9.576,879
2.2587,-9.598,880
5.9562,-9.7807,881
3.9651,-9.7822,882
3.3304,-9.8475,883
6.0349,-10.1578,884
6.5665,-9.6623,885
-2.3833,-9.6575,886
0.4197,-9.536,887
0.2548,-9.8784,888
1.0073,-9.7308,889
5.4141,-9.7458,890
-3.7557,-9.7031,891
3.4752,-9.6724,893
9.4838,-8.9398,894
-1.8429,-9.9427,895
0.0965,-9.539,896
-0.586,-9.7453,897
8.9827,-9.9604,898
0.1093,-10.2912,899
6.7667,-9.3639,900
2.5185,-9.58,901
8.09,-9.8416,903
8.6154,-10.364,904
47.8659,-8.8902,905
11.2077,-9.5666,906
17.2776,-10.0161,907
1.4228,-9.7325,908
0.1181,-9.797,909
0.0584,-9.8307,910
-1.1925,-9.6916,912
2.0373,-9.8193,913
-1.4285,-9.694,914
9.3966,-9.6836,915
6.7968,-9.6627,916
4.1853,-9.5703,918
20.7251,-9.9374,919
-1.0809,-9.674,920
3.4087,-9.8585,921
10.6162,-9.8461,922
-0.3736,-9.7332,923
0.2092,-9.2103,924
-1.5983,-9.6384,925
3.652,-9.7485,926
-2.2311,-9.8212,927
0.5959,-9.7938,928
3.3109,-9.6871,929
10.154,-9.7401,930
5.3782,-10.0415,931
-0.2473,-9.833,932
0.8718,-9.8174,933
2.0518,-9.6536,934
0.5266,-9.6064,935
2.8169,-9.7798,936
0.9269,-9.8694,937
5.107,-9.9971,938
1.4106,-9.344,939
0.2035,-9.7212,940
5.9716,-9.8925,941
2.221,-9.6738,942
11.5715,-9.7088,943
1.4118,-9.3458,944
2.628,-9.8594,945
5.6609,-8.9294,946
6.1389,-9.5817,948
0.8117,-9.8882,949
0.8283,-9.4741,950
1.8509,-9.8508,951
10.4397,-9.9792,952
0.6801,-9.8979,953
0.1832,-9.5501,954
13.7013,-9.7744,955
4.5066,-10.1509,956
1.1812,-8.3869,958
1.193,-9.7208,959
0.8782,-9.8005,960
1.1779,-9.5999,961
22.1802,-10.1417,962
1.0886,-9.7705,963
2.4226,-9.7021,964
-0.3384,-9.4952,965
2.998,-9.7369,966
5.6963,-9.7439,968
0.7815,-9.6926,969
-0.7669,-9.5244,970
7.9286,-9.8954,971
22.4896,-10.0791,972
0.0804,-9.5607,973
3.4389,-9.7853,974
-0.1918,-10.0,975
2.3219,-9.5892,976
-0.3165,-9.7351,978
4.9125,-9.5613,979
5.0655,-9.75,980
2.3458,-10.1275,981
0.5098,-9.607,982
4.5043,-9.551,983
-2.2258,-9.7797,984
7.2661,-10.0815,985
1.7129,-9.7728,986
0.1689,-9.5876,987
-0.3486,-8.9466,988
4.9733,-9.7502,989
5.4967,-9.3653,990
0.6691,-9.7338,991
0.6524,-9.738,992
3.8814,-9.7959,993
3.7764,-9.6617,994
8.1807,-9.8354,995
4.8084,-9.4943,996
-0.2688,-10.2096,997
-0.0602,-9.5062,998
1.221,-9.7286,999
0.443,-9.592,1000
-0.4248,-9.6488,1001
-0.5502,-9.9086,1002
7.4985,-9.634,1003
1.6466,-9.7073,1004
2.8828,-9.7949,1005
0.7278,-9.7159,1006
0.7289,-9.5731,1008
1.3081,-9.1687,1009
2.9982,-9.5726,1010
1.8436,-9.6513,1011
-1.1504,-9.8033,1012
1.4884,-8.5288,1013
1.1868,-9.6288,1014
0.3488,-9.7871,1015
5.2075,-9.884,1016
0.3402,-9.5837,1018
0.5192,-9.7075,1019
1.5725,-10.0177,1020
3.9605,-10.0606,1021
0.577,-9.5876,1022
15.4983,-10.0079,1023
-1.7551,-10.0202,1024
6.8251,-9.796,1025
0.3609,-9.6026,1026
4.3241,-9.7384,1028
2.0402,-9.5987,1029
0.973,-9.9036,1030
0.9071,-9.1139,1031
3.4776,-9.7281,1032
1.8798,-10.0083,1033
2.976,-9.7883,1034
1.1608,-9.7214,1035
3.6248,-9.8513,1036
-3.5665,-9.6715,1037
5.2709,-9.2628,1038
2.555,-9.7435,1039
0.2958,-9.6909,1040
1.7932,-9.8194,1041
-1.5894,-9.9279,1042
0.6404,-9.7994,1043
0.1751,-9.8343,1044
0.4121,-9.7545,1045
2.7465,-9.7209,1046
2.3171,-9.8577,1047
1.3268,-9.782,1048
9.1645,-9.8264,1049
1.8158,-9.7466,1050
5.9191,-9.0671,1051
0.9128,-9.6772,1052
11.7826,-9.8154,1053
4.9933,-9.4846,1054
1.6382,-9.75,1055
14.3011,-9.6959,1056
5.3095,-9.62,1058
8.1975,-9.6143,1059
0.6796,-9.6512,1060
6.0296,-9.9219,1061
1.3157,-9.4127,1062
3.9267,-9.7821,1063
1.3673,-9.4327,1064
3.256,-9.2726,1065
2.3649,-9.9544,1066
4.3047,-9.7041,1068
1.1669,-9.7349,1069
3.4147,-9.6318,1070
-0.3296,-9.9786,1071
0.2336,-9.9963,1072
0.3381,-9.8098,1073
0.7961,-9.7043,1074
1.3133,-9.675,1075
6.5297,-9.0531,1076
0.8816,-9.6244,1078
3.5414,-9.4157,1079
2.7268,-9.3518,1080
1.6766,-9.7132,1081
1.3197,-9.9114,1082
2.6886,-9.8138,1083
3.5483,-9.3101,1084
2.4629,-9.6025,1085
0.3598,-9.6821,1086
2.3562,-9.5732,1088
2.7069,-9.8033,1089
44.7328,-9.4658,1090
9.5161,-9.5318,1091
0.4434,-9.6497,1092
4.7924,-9.2843,1093
0.6358,-9.7415,1094
-0.6627,-9.6833,1095
-0.5948,-9.6136,1096
5.2937,-8.8262,1097
3.1964,-9.7253,1098
0.3265,-9.7107,1099
0.1284,-8.6601,1100
1.5642,-9.9515,1101
4.7192,-9.1902,1102
-0.7318,-9.412,1103
0.3702,-9.4113,1104
-0.3627,-9.7377,1105
2.0845,-9.7891,1106
-1.222,-9.6264,1107
3.6503,-9.5979,1108
1.8105,-9.3378,1109
2.1597,-9.5737,1110
1.1212,-9.8733,1111
-0.0569,-9.6107,1112
18.3402,-9.4272,1113
4.225,-9.1233,1114
3.4434,-9.7926,1115
1.1934,-9.6864,1116
0.6777,-9.2698,1118
11.828,-9.6997,1119
3.9421,-9.6909,1120
3.502,-9.7544,1121
44.3006,-9.9138,1122
1.7712,-9.8594,1123
41.9518,-9.753,1124
7.8637,-8.9892,1125
5.5251,-9.4682,1126
2.0438,-9.5911,1128
0.1741,-9.6721,1129
2.392,-9.6021,1130
1.3797,-9.7163,1131
16.4647,-8.4533,1132
2.8744,-9.9822,1133
0.1135,-9.5625,1134
-0.0102,-9.574,1135
4.6948,-9.6585,1136
0.4427,-9.1352,1138
2.0303,-9.3289,1139
0.8287,-9.9291,1140
-0.1334,-10.0456,1141
7.3482,-9.4153,1142
-1.7709,-8.6323,1143
6.83,-8.6774,1144
16.1589,-8.9041,1145
55.0945,-10.3999,1146
11.8022,-9.4528,1147
26.0571,-9.7106,1148
7.0864,-9.8436,1149
1.6699,-9.7316,1160
0.6616,-9.7876,1161
0.3273,-9.688,1162
-2.655,-9.7205,1163
3.797,-9.6742,1164
0.8579,-9.7294,1165
1.7442,-9.7039,1166
0.6057,-9.7298,1167
0.0138,-9.7201,1168
0.6971,-9.7386,1169
0.602,-9.7397,1170
0.0873,-9.7484,1171
0.055,-9.7407,1173
0.5479,-9.7361,1174
0.1734,-9.7379,1175
-0.2016,-9.7276,1176
1.1587,-9.7365,1177
0.2302,-9.723,1178
0.8497,-9.7382,1179
0.3914,-9.7324,1180
0.5077,-9.7361,1181
-2.2055,-9.6768,1183
0.1237,-9.6099,1184
0.8092,-9.5963,1185
7.2011,-9.6294,1186
-2.2648,-9.7044,1187
4.3455,-9.6367,1188
0.2592,-9.6743,1189
1.4341,-9.6843,1190
0.8864,-9.6633,1191
0.9215,-9.7276,1192
1.4965,-9.7085,1194
0.4311,-9.7326,1195
0.5878,-9.712,1196
0.804,-9.7276,1197
0.7172,-9.7331,1198
2.0823,-9.7482,1199
-1.8555,-9.7771,1200
0.1837,-9.7414,1201
0.9005,-9.7387,1203
1.0054,-9.8541,1204
-0.1109,-9.1588,1205
17.4406,-9.8461,1206
12.4462,-9.5654,1207
-9.1102,-10.0938,1208
6.2086,-10.8808,1209
11.8011,-9.9137,1210
4.5859,-9.7873,1211
15.1255,-9.7642,1212
19.7832,-9.844,1213
2.1201,-9.6003,1214
0.1591,-9.9222,1215
-0.3471,-9.7858,1216
2.4751,-9.9066,1217
0.154,-9.7644,1218
24.3735,-9.7353,1219
3.827,-9.0788,1220
15.4586,-9.7142,1221
-3.9415,-9.7129,1222
19.039,-9.903,1223
11.2846,-9.6681,1224
1.7683,-9.6169,1225
0.1219,-9.474,1226
1.7075,-9.5469,1227
35.8753,-10.1426,1228
11.9199,-9.9202,1229
0.6124,-9.7943,1230
1.4091,-10.2723,1231
1.4029,-9.7864,1233
1.7649,-9.8551,1234
3.0476,-10.5863,1235
4.7027,-9.799,1236
2.5358,-9.0429,1237
0.016,-9.9796,1238
0.3492,-10.3626,1239
2.7872,-9.8596,1240
-0.8804,-9.8417,1241
1.0349,-9.7802,1243
0.9699,-9.7862,1244
4.0371,-9.7489,1245
6.1556,-9.5632,1246
15.1996,-9.5323,1247
0.1456,-9.6342,1248
1.4575,-9.9805,1249
2.0267,-9.7984,1250
0.4972,-9.6432,1251
1.568,-9.523,1253
20.9192,-9.8396,1254
43.1847,-9.103,1255
10.1834,-9.6071,1256
7.9928,-9.578,1257
2.6898,-9.8103,1258
0.9338,-9.7329,1259
22.9788,-9.8266,1260
-0.9829,-9.6557,1261
1.1427,-9.8519,1263
15.2828,-9.9989,1264
10.9883,-9.7098,1266
14.4234,-9.6678,1267
14.4243,-9.0853,1268
0.0,-9.9213,1269
0.731,-9.8817,1270
7.8572,-9.7107,1271
4.4921,-9.6116,1273
3.4258,-9.6478,1274
4.4496,-9.4373,1275
5.3164,-9.6915,1276
7.8769,-9.7045,1277
0.09,-9.7211,1278
-9.3738,-9.7711,1279
1.3019,-9.7527,1280
4.6709,-9.6966,1281
3.9138,-9.8519,1283
8.2377,-9.7857,1284
7.4073,-9.3164,1285
10.5433,-9.8893,1286
10.5322,-9.3039,1287
8.3522,-9.8111,1288
1.7924,-9.8002,1289
-0.8656,-9.8199,1290
-0.6897,-9.7362,1292
1.6016,-9.7519,1293
0.4367,-9.7493,1294
-4.4985,-9.7142,1295
-0.9951,-9.6737,1296
0.779,-9.674,1298
0.7082,-9.7275,1299
-0.2558,-9.7355,1300
-0.7123,-9.733,1301
-1.4159,-9.7148,1302
0.0976,-9.7329,1303
-0.6417,-9.7339,1304
-0.3174,-9.7349,1305
-0.3929,-9.7371,1306
-0.6024,-9.7374,1308
-0.2345,-9.7371,1309
-0.3177,-9.7396,1310
1.4717,-9.7418,1311
-0.069,-9.7336,1312
-6.4367,-9.7038,1313
1.9249,-9.669,1314
-0.4653,-9.6622,1315
-4.0546,-9.6631,1316
1.9311,-9.7037,1317
0.0135,-9.7549,1318
-0.5595,-9.7159,1319
0.007,-9.7298,1320
0.4001,-9.7451,1321
-6.6702,-9.6495,1322
1.4788,-9.6716,1323
-0.19,-10.2189,1324
-0.178,-9.779,1325
6.613,-9.6911,1326
5.5327,-9.6964,1327
-0.1346,-9.6739,1328
-2.0451,-9.506,1329
