AYGX_mean,AZ_mean,timestamp
-1.2935,-10.0732,525
1.0545,-9.5369,526
-2.3297,-9.9169,527
5.7651,-9.3686,528
-0.1125,-9.7982,529
1.2267,-8.5509,530
3.337,-8.161,532
0.624,-9.9936,533
-3.1198,-9.5831,534
58.7574,-5.2953,535
-0.5451,-10.0044,537
-4.7179,-9.9379,538
-2.2919,-9.8991,539
1.3752,-9.8173,540
6.3217,-9.5119,542
-0.1781,-9.7671,543
2.1738,-8.102,544
-0.6095,-9.961,545
