AYGX_mean,AZ_mean,timestamp
7.3635,-10.5949,2818
4.3593,-10.0426,2819
2.1478,-10.0784,2821
6.3007,-10.0143,2822
7.4792,-9.9119,2823
0.8055,-10.1089,2824
15.9788,-9.7302,2825
-2.0235,-9.875,2826
-1.7258,-10.0197,2827
-0.1461,-10.0231,2828
-2.4561,-10.008,2830
-1.6416,-10.001,2831
-5.0539,-9.9504,2832
-1.7799,-9.8957,2833
-12.8037,-9.7482,2834
-46.4271,-9.6667,2835
2.958,-9.2293,2836
60.9283,-9.502,2837
