AYGX_mean,AZ_mean,timestamp
0.0169,-9.8806,0
-16.7296,-9.7547,1
9.973,-9.7185,2
-3.0437,-9.5821,4
10.2275,-9.6506,6
-1.1253,-9.8829,7
-0.982,-9.8428,9
-17.0223,-9.4275,10
-0.2847,-9.0927,11
17.4886,-9.6933,12
-0.0759,-9.8823,13
0.1695,-9.8793,14
-0.0796,-9.8824,15
-1.2953,-9.8742,16
0.4412,-9.8666,17
0.3881,-9.876,18
0.2585,-9.8766,19
-0.5983,-9.8828,20
0.1641,-9.8744,21
-0.8012,-9.8775,22
-1.2006,-9.8693,23
-2.4363,-9.8489,24
0.18,-9.842,26
-0.9032,-9.8476,27
1.231,-9.8447,28
0.5764,-9.872,29
0.5167,-9.8849,30
-0.3903,-9.8742,31
-0.0461,-9.8871,33
-0.0602,-9.8785,34
-0.1262,-9.8824,35
-0.002,-9.8851,36
-0.1099,-9.8798,37
0.1485,-9.8802,38
0.0476,-9.8832,39
-0.022,-9.8845,40
-0.019,-9.8828,41
-0.01,-9.8847,43
0.0662,-9.8846,44
-0.2078,-9.8773,45
-0.3197,-9.8808,46
0.208,-9.8785,47
0.2139,-9.8812,48
-0.4894,-9.8822,49
0.1969,-9.8795,50
0.0059,-9.8846,51
-0.1488,-9.8807,53
-1.516,-9.8594,54
1.1203,-9.8713,55
0.2373,-9.8806,56
-2.9893,-9.8661,57
1.3923,-9.8403,58
0.3994,-9.8738,59
-0.2748,-9.8782,60
-0.2509,-9.866,61
-0.0641,-9.8692,63
-7.7099,-9.8103,64
6.0759,-9.7642,65
-0.8759,-9.8575,66
0.1541,-9.8818,67
-0.3463,-9.8803,68
0.2988,-9.8663,69
-1.0941,-9.8604,70
1.3258,-9.8702,71
-1.8616,-9.8421,73
-5.2434,-9.7826,74
2.5609,-9.6077,75
6.3113,-9.8251,76
-2.0959,-9.8343,77
-2.6237,-9.8652,78
-1.0319,-9.8367,79
2.6218,-9.8291,80
0.085,-9.8795,81
-0.7577,-9.8703,83
0.2302,-9.8803,84
-0.7084,-9.8795,85
0.7348,-9.8613,86
-3.4706,-9.8673,87
4.6538,-9.8293,88
-0.5993,-9.8803,89
-0.3264,-9.8789,90
-0.1027,-9.8758,91
-1.3658,-9.8621,93
2.0405,-9.8449,94
0.029,-9.8782,95
-0.1613,-9.8831,96
-0.3726,-9.8784,97
-0.7372,-9.8746,98
-0.6287,-9.8769,99
-0.3209,-9.8842,100
0.0443,-9.8637,101
-0.0359,-9.8811,102
-0.1083,-9.8787,103
-0.7064,-9.8768,104
1.5551,-9.83,106
0.1248,-9.8836,107
-0.1083,-9.8806,108
-0.0279,-9.8845,109
-0.2225,-9.8727,110
-1.2716,-9.8418,111
-0.1874,-9.8771,113
2.2861,-9.8261,114
-7.733,-9.8523,115
-1.9252,-9.8628,116
-1.5361,-9.8348,117
3.2626,-9.8283,118
-3.4883,-9.8015,119
1.5721,-9.8597,120
-2.0275,-9.8262,121
-1.6714,-9.8592,123
-1.8511,-9.8668,124
-2.0255,-9.8688,125
-8.5657,-9.7543,126
-6.8647,-9.6627,127
5.9518,-9.8003,129
-0.5593,-9.9078,130
5.3067,-9.9975,131
-2.4951,-9.8589,132
-2.9585,-9.7631,134
-0.1109,-9.7576,135
-11.3118,-9.695,136
24.7201,-9.4597,137
3.9798,-9.8429,138
-3.6372,-9.8595,139
0.1765,-10.1324,140
10.292,-9.9849,141
2.9532,-9.8062,143
-1.0842,-9.7865,144
3.0776,-9.8787,145
4.2584,-10.0806,146
-1.6902,-11.2161,148
29.22,-9.8028,149
8.6319,-9.9673,150
0.3929,-10.0954,151
3.6525,-9.7935,153
1.371,-9.9312,154
0.7179,-9.6951,155
4.4526,-9.4986,156
7.8128,-9.9421,157
5.2591,-9.478,158
-0.4506,-10.0239,159
5.6715,-9.9737,160
11.4591,-9.726,161
0.9652,-10.0737,163
0.9342,-9.8938,164
2.9447,-9.8679,165
-0.2258,-9.8592,166
0.0731,-9.916,167
-0.0413,-9.8742,168
-0.6835,-9.8803,170
1.3867,-9.8257,171
1.0793,-9.8418,172
-0.6198,-9.8939,173
0.5797,-9.8889,174
0.0179,-9.8935,175
0.0313,-9.8816,176
-0.1525,-9.8804,178
-0.0621,-9.8783,179
0.541,-9.8631,180
-1.7755,-9.9234,181
-0.1423,-9.8815,182
-0.2032,-9.885,183
0.3827,-9.8379,184
-0.4336,-9.8738,185
0.4445,-9.8771,186
-0.6284,-9.8651,188
0.2626,-9.8534,189
0.22,-9.8761,190
-0.1683,-9.9013,191
0.441,-9.896,192
-1.2684,-9.8542,193
0.1715,-9.9088,194
-0.3242,-9.8777,195
1.0337,-9.883,196
-0.0318,-9.8713,198
0.1431,-9.8934,199
0.2549,-9.8521,200
2.6082,-9.7023,201
-1.8667,-9.9442,202
-2.6632,-9.7449,203
18.5271,-9.983,204
6.8791,-9.5901,205
1.945,-10.1148,206
1.6612,-10.1664,208
2.5164,-10.1579,209
0.5103,-10.4858,210
1.5452,-10.0214,211
7.4604,-10.4899,212
-2.9993,-11.0864,213
-0.2579,-8.6003,214
-0.7631,-9.8666,215
-0.5084,-9.6341,216
-0.3108,-9.8312,218
-0.3261,-9.8705,219
2.1918,-9.9136,220
0.9828,-10.5534,221
-0.0431,-9.8228,222
1.203,-9.912,223
0.0161,-9.9892,224
0.1349,-9.9183,225
1.4457,-9.9679,226
0.4459,-9.8785,228
2.6493,-9.8549,229
-0.0788,-9.4793,230
1.661,-9.6347,231
0.1017,-10.0331,233
-0.1508,-9.985,234
1.6022,-9.2757,235
0.0159,-9.6483,236
0.6215,-9.9687,238
1.2235,-9.8487,239
0.703,-10.0393,240
-0.5975,-9.1152,241
0.8997,-9.8305,243
-0.3965,-9.3326,244
2.124,-10.0893,245
-0.7813,-9.8284,246
0.7985,-9.735,248
0.6571,-8.5248,249
0.6169,-9.763,250
3.8288,-9.1412,251
0.797,-9.6762,253
0.7747,-9.8306,254
0.6656,-9.5336,255
-0.8518,-9.5605,256
-0.4178,-9.8366,258
2.8058,-9.762,260
1.6198,-10.3653,261
1.4755,-9.9664,262
0.1172,-10.2077,263
-0.1622,-7.8151,264
2.0021,-8.9218,265
0.4633,-10.1786,266
1.2579,-9.2654,268
-0.0138,-8.5884,269
0.6761,-7.983,270
0.7369,-9.6847,271
0.0882,-9.3333,273
0.7471,-9.6884,274
0.8099,-8.7311,275
0.1803,-9.5147,276
0.1267,-9.2778,277
-0.0129,-9.2461,278
0.1914,-9.1668,279
1.088,-8.1969,280
0.0065,-8.6055,281
3.4289,-8.3204,283
1.2707,-9.5157,284
0.7888,-10.6429,285
1.0789,-7.5057,286
0.6376,-9.0045,287
3.7022,-8.2947,288
-0.0719,-8.1842,289
0.4442,-9.2105,290
1.7943,-10.0589,291
0.3432,-9.9678,293
1.3576,-8.6854,294
2.1158,-9.3753,295
0.5357,-8.8493,296
0.3839,-9.1765,298
0.1653,-9.7359,299
0.6814,-9.9311,300
0.9612,-8.7922,301
-8.7747,-8.0651,303
-370.5441,0.768,304
27.0407,1.806,305
13.8371,1.0324,306
-0.589,0.5911,308
-0.5329,0.7572,309
6.618,0.707,310
452.5747,-1.1933,311
12.4132,-9.7513,313
2.2271,-9.8639,314
-14.2964,-9.5149,315
-9.1622,-10.1892,316
-6.4658,-9.7538,318
11.8155,-9.708,319
-3.5594,-9.853,320
-0.9163,-9.8427,321
-0.0837,-9.7804,322
2.9639,-9.8119,323
-1.0348,-9.8128,324
0.1537,-9.8274,325
1.3467,-9.7977,326
0.0955,-9.8396,328
-4.5208,-9.7331,329
-19.1039,-9.5319,330
-29.0892,-9.2469,331
18.2463,-9.6411,332
0.5422,-9.8248,333
2.7634,-9.8403,334
-2.1203,-9.865,335
1.3537,-9.8672,336
-1.8076,-9.8582,338
-0.4511,-9.8164,339
0.7065,-9.8429,340
1.4963,-9.8555,341
0.3296,-9.841,343
-1.004,-9.8579,344
-2.8652,-9.8088,345
-6.7392,-9.7715,346
3.0604,-9.6461,348
-3.2934,-9.6597,349
0.0171,-9.6118,350
8.2434,-9.629,351
-1.0766,-9.6446,353
-1.1479,-9.6326,354
-3.5941,-9.5933,355
-0.4184,-9.5885,356
2.2695,-9.5203,358
-1.0782,-9.6255,359
2.3248,-9.6251,360
2.6503,-9.6667,361
-2.3513,-9.6861,363
-1.5636,-9.6026,364
13.3673,-9.6514,365
9.4296,-9.9028,366
-1.1998,-9.5465,367
6.0562,-9.2583,368
9.7016,-9.9089,369
5.4092,-9.8457,370
3.3657,-9.9272,371
0.2031,-9.883,372
0.1789,-9.882,373
0.5979,-9.9332,374
0.1941,-9.9078,375
0.4911,-9.9577,376
2.553,-9.8513,377
8.3635,-9.8945,378
4.0993,-9.8841,379
1.8091,-9.845,380
1.3163,-9.884,381
4.4704,-9.8755,383
1.3713,-9.8567,384
1.3308,-9.8692,385
0.4666,-9.6757,386
0.2636,-9.8493,388
2.748,-9.9097,389
0.4903,-9.9508,390
-0.0716,-9.9109,391
-1.0463,-9.8727,393
0.5396,-9.8436,394
0.9816,-9.7489,395
7.5793,-9.8553,396
0.6474,-9.9074,398
1.5886,-9.7769,399
2.1933,-9.5485,400
0.7486,-9.8595,401
0.6545,-9.9507,403
2.1896,-9.2249,404
1.6368,-9.7495,405
1.8338,-9.2591,406
0.2514,-7.459,407
0.1139,-9.8883,408
0.0991,-9.2811,409
0.8929,-9.9572,410
-0.3061,-10.1523,411
5.5585,-9.8781,413
0.8399,-7.4017,414
0.1779,-8.7815,415
-0.0932,-6.9573,416
0.2504,-9.7306,418
-1.6245,-9.8841,419
-0.0423,-9.8712,420
16.3703,-9.9832,421
2.8203,-9.7724,422
11.3283,-9.2422,423
4.917,-9.7348,424
1.3875,-9.8093,425
-0.4735,-9.859,426
0.1653,-9.9182,428
2.5972,-10.0928,429
-17.5044,-10.6568,430
-0.4153,-9.9071,431
-2.4524,-10.0935,432
2.4237,-9.1539,433
2.9674,-10.1971,435
-0.4875,-10.0778,436
1.4878,-9.9498,439
0.2189,-9.9586,440
0.9562,-9.8332,441
2.3808,-9.9039,442
3.6724,-9.9339,443
0.588,-9.8863,444
-0.2906,-9.5677,445
6.5432,-9.927,446
4.2723,-10.1407,448
0.9383,-9.8941,449
1.4125,-9.9837,450
1.091,-10.142,451
1.1362,-9.7573,452
0.2801,-10.0471,453
-1.1737,-9.8588,454
0.9393,-9.8628,456
1.6901,-9.8618,457
-1.0359,-9.9005,458
-0.1146,-9.5126,460
1.73,-9.8507,461
1.9659,-9.9507,463
9.4402,-9.3242,464
3.8342,-9.7266,465
10.3074,-9.8908,466
0.8151,-9.614,467
0.4012,-10.756,468
2.5029,-9.6573,469
5.3835,-9.395,470
1.1463,-10.0574,471
4.9655,-9.6986,473
2.774,-9.7115,474
5.2041,-9.4605,475
3.3365,-9.4732,476
-3.0196,-9.8136,477
1.8461,-9.7074,478
1.3352,-9.1211,479
1.3211,-9.4052,480
0.7885,-9.0795,481
6.713,-9.673,483
-0.5233,-9.6616,484
0.3602,-9.5834,485
0.0504,-9.5875,486
0.9631,-9.4553,487
3.584,-10.1439,488
-2.6204,-9.1716,489
-0.533,-9.8646,490
-0.5086,-9.6751,491
-1.0724,-10.8063,493
1.9548,-9.4148,494
3.5145,-9.3907,495
0.0436,-9.4194,496
-1.2665,-10.3776,497
0.5128,-9.6398,498
1.1341,-10.0994,499
0.0403,-9.9169,500
-1.0606,-9.1758,501
2.5156,-10.1507,503
1.6026,-9.7886,504
1.5551,-9.9677,505
-0.972,-9.8765,506
0.0062,-9.806,507
-1.6557,-10.0894,508
0.6367,-9.4626,509
0.1995,-9.9624,510
1.8231,-10.0686,511
3.1102,-10.1825,513
3.9658,-9.9154,514
0.0377,-9.8835,515
-3.6707,-10.0843,516
-3.7781,-9.0831,517
-0.2447,-9.7969,518
4.3007,-9.7104,520
-0.6309,-9.7719,521
0.1831,-9.8794,523
0.7948,-9.9169,524
0.2275,-9.5552,525
-0.5604,-9.8464,526
-0.0572,-10.0115,527
4.4034,-10.0597,528
-0.4713,-10.0842,529
2.017,-9.6821,530
-0.2657,-9.511,531
-0.4187,-9.9929,533
1.6569,-9.7777,534
1.4514,-9.7354,535
-1.4672,-10.077,536
-2.7167,-9.3985,537
-2.2511,-8.4429,538
-0.0285,-10.081,539
2.0088,-9.7493,540
-1.7553,-9.3015,541
10.8656,-9.7298,543
-0.9816,-9.8954,544
3.1604,-9.8484,545
0.0746,-10.2679,546
0.7518,-9.5015,547
-2.0045,-9.6677,548
-0.7728,-9.9468,549
0.5136,-9.8083,550
0.4109,-9.9169,551
3.0778,-9.7448,553
-1.8031,-9.582,554
-2.4808,-10.3026,555
1.7343,-9.7567,556
0.0063,-10.124,557
-0.1488,-9.7669,558
2.1672,-9.9703,559
-0.1929,-9.5648,560
-0.4354,-9.8797,561
1.8348,-9.7977,563
2.745,-9.6565,564
5.8272,-9.7907,565
-0.7243,-9.9397,566
2.8389,-9.998,567
1.1781,-9.9563,568
-0.2513,-9.8305,569
3.4268,-9.846,570
-0.3236,-9.8888,571
-1.7068,-9.7152,573
2.4055,-9.8108,574
2.1004,-9.7961,575
-0.2412,-9.796,576
-2.4912,-9.6607,577
2.514,-10.2933,578
-0.2814,-9.8644,580
0.0765,-9.6253,581
-0.1623,-10.3988,583
0.652,-9.9373,584
-0.0835,-9.4412,585
1.0661,-9.7258,586
0.7972,-10.0161,587
0.0969,-10.048,588
4.8443,-9.9316,589
0.8402,-9.88,590
-9.5191,-9.7643,592
8.5067,-9.7875,593
2.2053,-9.8174,594
2.2536,-9.7651,595
-1.5269,-9.6662,596
1.2641,-9.9261,598
-4.1666,-9.8215,599
0.0296,-9.8467,600
-20.3053,-9.7499,601
-0.7608,-9.8265,602
0.0133,-9.8378,603
