AYGX_mean,AZ_mean,timestamp
-4.7122,-8.9426,24
-3.5475,-8.9425,25
-3.5704,-8.9302,26
-3.3257,-8.9217,27
-2.9816,-8.92,28
-3.1985,-8.9163,29
-2.678,-8.9135,30
-3.1535,-8.9099,31
-2.1619,-8.8591,32
-2.2574,-9.068,33
44.014,-9.3932,34
-17.8657,-9.064,35
-3.2596,-9.0289,36
-4.2288,-9.0201,37
-2.288,-9.0086,38
-2.7402,-9.0276,39
-5.9516,-9.0168,40
-3.3285,-8.9779,41
-2.6527,-8.9638,42
-2.5188,-8.9823,43
-5.8692,-8.9514,44
