AYGX_mean,AZ_mean,timestamp
1.2027,-9.8866,758
-1.2226,-10.0046,759
5.2236,-9.9249,760
-0.8249,-9.7042,761
3.5979,-9.8986,762
-1.1487,-9.9998,763
-3.9353,-9.9469,764
0.8712,-10.0285,765
2.1488,-10.0267,767
50.565,-10.0145,768
37.1977,-10.0499,769
7.4182,-10.0855,770
8.4864,-10.0893,772
3.2696,-9.5516,773
5.1149,-9.5706,774
-1.2878,-10.304,775
-0.0031,-10.2391,777
0.1798,-10.0004,778
