AYGX_mean,AZ_mean,timestamp
0.1067,-9.7624,2
0.1064,-9.7606,3
0.1055,-9.76,4
0.1231,-9.763,5
-13.6453,-9.3573,6
3.3352,-9.5906,7
-6.5621,-9.5899,8
7.5746,-9.663,9
-1.0143,-9.6398,10
-0.2629,-9.706,11
-0.4869,-9.7652,12
-4.1192,-9.7277,13
-0.7901,-9.7139,14
-0.7937,-9.7111,15
-1.1628,-9.7028,16
-0.3755,-9.7041,17
-0.6991,-9.7061,18
-0.9302,-9.7048,19
-0.976,-9.7026,20
0.071,-9.7003,21
-0.217,-9.7151,22
-1.0157,-9.7164,23
-0.9649,-9.7057,24
-0.4999,-9.7434,25
-0.8122,-9.7369,26
-0.3211,-9.734,27
0.0619,-9.7372,28
0.2327,-9.7474,29
-0.6225,-9.752,30
-0.333,-9.745,31
-3.5009,-9.8638,32
-3.7991,-9.5854,33
3.0577,-9.6197,34
-0.1649,-9.7791,36
0.8398,-9.7812,37
2.1724,-9.7592,38
0.7167,-9.8274,39
0.1336,-9.8041,40
0.3242,-9.6849,41
-0.0659,-9.6577,42
0.7448,-9.7492,43
1.2263,-9.9459,44
0.6027,-9.2982,45
5.5376,-10.1414,46
-0.6167,-10.2992,47
1.1387,-9.4105,48
-1.8837,-10.1787,51
1.3299,-8.7326,52
-0.8874,-9.8709,53
13.7257,-9.3406,54
8.5232,-9.7396,55
2.7099,-9.7202,56
2.3783,-9.6316,57
-0.5423,-9.4849,61
0.2112,-9.0296,62
-1.324,-9.8351,63
-0.0412,-9.922,64
-0.992,-9.6845,65
5.4072,-10.0643,66
-0.4738,-9.7462,67
4.5798,-9.7314,68
4.4824,-10.3754,69
3.3825,-10.0774,70
0.8637,-9.2488,71
1.032,-9.8685,72
-0.4624,-9.7449,73
0.0402,-9.8958,74
-0.9008,-9.9555,75
-0.1195,-9.8663,76
11.9534,-9.6751,77
4.2965,-9.8336,78
0.418,-9.5592,79
1.9747,-9.6296,80
0.6572,-10.21,81
3.7189,-8.9835,82
-2.6678,-9.8794,83
0.2361,-9.9202,84
2.3745,-9.809,85
2.3985,-9.7805,86
-1.4556,-9.8752,87
2.3981,-9.6884,88
1.2644,-9.8049,89
0.1069,-9.8066,90
0.8182,-9.7014,91
-2.7728,-9.8627,92
1.5353,-9.7874,93
0.9056,-9.1226,94
-1.0368,-9.559,95
2.5836,-9.6636,96
1.8916,-9.8239,97
2.3411,-9.5557,98
2.6526,-9.7813,99
-0.5495,-9.5676,100
1.5502,-9.9823,101
0.3562,-9.8463,102
0.2638,-9.867,103
0.372,-9.882,104
-0.3297,-9.7598,105
0.6456,-9.5124,106
0.3277,-9.7158,108
0.4819,-9.8511,109
1.3008,-9.7222,110
0.6311,-9.3056,111
-0.4364,-9.6846,112
0.3803,-9.7341,113
1.1505,-9.874,114
3.6204,-9.9955,115
3.2919,-9.5663,116
-1.9117,-9.611,117
-3.7455,-9.8374,118
-1.3843,-9.745,119
-0.9775,-9.5518,120
14.667,-9.912,121
-1.7554,-9.7913,122
-2.7458,-9.8973,123
-2.5466,-9.7905,124
1.9411,-9.9087,125
21.7038,-9.6944,126
0.2099,-9.8644,127
4.7148,-9.0363,128
0.9031,-9.3926,129
-0.388,-9.7523,130
-0.296,-9.6683,131
-0.3085,-10.4615,132
2.8429,-9.6826,133
1.0536,-9.2994,134
0.479,-9.8486,135
0.1045,-9.1079,136
-0.5123,-9.8335,137
2.2383,-9.4678,138
0.7723,-9.7566,139
0.6113,-9.4558,140
-0.4339,-9.4926,141
-0.6313,-9.7291,142
-0.1837,-9.3037,143
-0.1506,-9.8898,144
1.2372,-9.6271,145
-0.3852,-9.8387,146
0.6178,-9.5422,147
41.1032,-10.1884,148
-12.5759,-10.1615,149
17.211,-9.7083,150
31.3745,-9.1846,151
24.821,-9.7069,152
1.5884,-10.1072,153
42.0422,-10.3623,154
2.1526,-10.2146,155
4.9442,-9.8448,156
-0.6375,-10.1802,157
0.2657,-9.8201,158
0.3793,-9.9336,159
0.2445,-9.0358,160
4.8134,-9.8728,161
-0.0423,-10.1133,162
0.8745,-9.8736,163
1.1953,-9.7584,164
0.6469,-9.6796,165
-0.0018,-9.9025,166
1.5228,-9.7734,167
0.4257,-9.5908,168
0.3439,-9.7671,169
0.2461,-9.7321,170
-0.0192,-10.0391,171
14.6898,-10.4849,172
4.6923,-10.0924,173
40.2745,-10.0489,174
5.47,-10.1802,175
-0.039,-10.0708,176
-0.5781,-9.4597,177
0.3789,-9.8627,180
2.2422,-10.1747,181
0.3788,-10.1151,182
1.4353,-9.829,183
-2.3588,-9.7828,184
2.0714,-9.7141,185
2.925,-9.9828,186
1.5052,-9.807,187
4.8541,-10.0446,188
-0.0671,-9.5419,189
0.585,-10.1379,190
0.227,-9.9855,191
1.0733,-9.824,192
8.1446,-9.4569,193
2.7558,-9.7982,194
-0.6688,-9.8025,195
1.8309,-9.8344,196
-1.412,-9.8043,197
0.8261,-9.6319,198
0.477,-9.5252,199
-0.2081,-9.9948,200
0.7687,-9.6884,201
-1.1428,-9.3816,202
1.447,-9.6149,203
0.0759,-9.8349,204
-1.6681,-9.2178,205
-0.1467,-10.3703,206
-0.1238,-9.6727,207
-0.4721,-9.8361,208
0.5649,-9.4741,209
1.2859,-9.7456,210
-0.3292,-9.3978,211
-1.5807,-9.4322,212
-0.0355,-9.8911,213
-0.4746,-9.8993,214
0.3124,-9.9037,215
-0.2029,-9.8728,216
4.6387,-9.4461,217
1.2213,-8.6617,218
-0.4871,-9.7335,219
1.9516,-9.7966,220
1.9556,-9.1922,221
-1.7178,-9.4167,222
0.6111,-8.9402,223
0.1817,-9.6796,224
-0.4,-10.042,225
0.2983,-9.4863,226
2.6454,-8.9285,227
-1.0754,-9.8342,228
2.1416,-9.6376,229
2.0229,-9.7144,231
0.5867,-9.3485,232
0.2737,-10.164,233
0.2755,-9.5275,234
1.2823,-9.5967,235
-0.0261,-10.1851,236
1.8468,-10.0577,237
1.1087,-9.783,238
3.5914,-10.1297,239
4.0241,-10.4315,240
2.6899,-10.0165,241
1.6296,-9.7638,242
2.067,-9.4093,243
-0.7765,-9.9485,244
3.2056,-10.3438,245
4.03,-9.7947,246
1.5973,-9.9465,247
10.8436,-9.7669,248
-0.2195,-9.9071,249
2.3058,-10.5241,250
-0.3984,-9.6949,251
1.4217,-9.5032,252
0.1703,-9.8084,253
1.2834,-9.6877,254
-0.177,-10.3563,255
-0.233,-9.6563,256
2.0492,-9.7448,257
1.0906,-9.4934,258
-1.8206,-9.517,259
1.9564,-10.2263,260
0.9363,-9.4016,261
0.3414,-9.1606,262
0.966,-9.6978,264
1.5922,-9.7674,266
0.4634,-9.642,267
-3.1455,-10.3736,268
0.5952,-9.9328,270
-0.085,-9.8137,271
1.3401,-9.7974,272
0.077,-10.0646,274
-0.573,-9.1782,275
0.1518,-9.5948,276
1.2776,-9.5042,277
-0.0608,-9.7557,278
0.0709,-9.7962,279
0.8009,-9.7595,280
0.4021,-9.866,281
-1.7963,-9.9629,282
-1.749,-9.9804,283
-0.2684,-9.8767,284
-2.1233,-10.0593,285
0.595,-9.6864,286
0.9425,-9.893,287
3.3515,-9.5412,288
0.875,-10.1495,289
-0.5363,-10.0333,290
-0.173,-9.915,291
-0.0155,-9.9276,292
8.103,-9.8194,293
3.5208,-9.7043,294
0.1839,-9.8982,295
-0.5169,-9.3044,296
0.3905,-9.218,297
2.2792,-10.5373,298
7.3076,-9.4763,299
0.0449,-9.4834,300
1.9284,-9.1717,301
3.3532,-9.4506,302
-0.1273,-9.3949,303
1.3571,-10.298,305
-0.1536,-10.1015,306
0.1165,-9.79,307
0.5567,-9.8647,308
1.5602,-10.0081,309
1.0845,-9.9392,311
1.7333,-9.7575,312
0.6064,-8.9976,313
2.3578,-9.779,314
0.0491,-9.9633,315
0.8426,-9.657,316
0.2157,-10.2009,317
4.5989,-9.3883,318
0.4626,-9.1938,319
-0.6179,-9.8466,320
0.211,-9.2592,321
0.782,-9.4818,322
0.6057,-9.1124,323
7.3573,-9.7391,324
-0.4571,-9.9306,325
0.0918,-9.8728,326
0.0142,-10.0999,327
1.3106,-9.8502,328
-0.3278,-9.7972,329
-0.1241,-8.8817,330
0.2686,-9.4681,331
-0.1983,-9.8758,332
-0.0194,-9.7384,333
-0.2492,-9.6011,334
0.5283,-9.8869,335
-0.8019,-9.7734,336
0.2185,-10.2602,337
1.3135,-9.3967,338
-0.2306,-10.0607,339
7.7801,-9.8072,340
0.3692,-9.2722,341
0.3744,-10.5065,342
0.5273,-10.2342,343
0.6215,-9.4001,344
-0.3058,-9.4325,345
-0.2473,-9.3739,346
1.6731,-9.8877,347
0.0186,-9.7655,348
-0.1998,-8.5943,349
-1.0594,-10.1237,350
1.3787,-9.8565,351
1.9269,-9.3305,352
-0.7776,-9.5598,353
-0.5281,-9.9704,354
1.3643,-9.0974,355
0.6246,-9.5319,356
0.0497,-9.7718,357
1.6496,-10.0064,358
11.0771,-10.2187,359
2.7723,-9.7593,360
0.9361,-9.6195,361
0.3673,-9.879,362
-1.1115,-9.3818,363
-0.1992,-9.9095,364
1.4325,-9.9095,365
1.5489,-10.2454,366
1.6313,-9.7816,367
-0.4263,-9.4783,368
4.5844,-9.3219,369
-0.0328,-10.267,370
-0.903,-9.6693,371
-0.6555,-9.4219,372
-0.4374,-9.6724,373
0.3898,-10.1256,374
0.5726,-9.2338,375
-0.2833,-10.0848,376
-0.5783,-9.6683,377
0.679,-9.5462,378
5.5237,-9.5451,379
0.142,-9.6604,380
0.777,-9.8917,381
4.2619,-9.7845,382
-0.1353,-9.5339,383
-0.5786,-9.4154,384
1.2021,-9.5355,385
0.3428,-9.4783,386
-0.1161,-9.7351,387
0.1338,-9.7809,388
1.7695,-9.8899,390
-0.3099,-10.1401,391
-0.9364,-9.8227,392
1.674,-9.779,393
-0.7476,-10.355,394
0.4014,-9.6899,395
2.9497,-10.1979,396
0.2764,-9.7939,397
0.0288,-9.7812,398
0.3068,-9.7808,399
-0.0591,-9.7405,400
5.5561,-9.778,401
8.7467,-9.7964,402
1.42,-9.7399,403
1.9635,-9.8457,404
-5.9597,-9.4443,405
0.3845,-9.7795,406
3.8682,-9.8098,407
3.8086,-9.9749,408
-0.0367,-9.6325,409
0.4043,-9.7524,410
-0.0968,-9.7004,411
0.5237,-8.1639,412
2.5472,-9.8332,413
0.951,-9.6962,414
-0.0404,-9.6916,415
0.8886,-10.147,416
0.7508,-9.6263,417
0.1965,-10.0874,418
0.2515,-9.6417,419
-0.9307,-9.7485,420
-2.4081,-9.8171,421
1.104,-9.8733,422
-0.1269,-9.6161,423
-2.0012,-8.6144,424
-2.0196,-9.7489,425
1.5691,-9.0272,426
4.2747,-9.5667,429
-0.8218,-9.7122,430
5.4959,-9.6834,431
-1.3147,-10.0841,432
0.607,-9.9982,433
1.3823,-9.9458,434
-2.4822,-9.762,435
2.0744,-9.7291,436
1.3099,-10.3377,437
-0.8479,-9.294,439
3.0026,-9.4798,440
2.3039,-9.8946,441
5.0548,-10.0243,442
0.4256,-9.7176,443
2.2023,-9.7729,444
23.0068,-9.1957,445
8.6776,-9.0348,446
0.5207,-9.8561,447
-0.2967,-9.7224,449
0.6373,-9.5748,450
2.4196,-10.2244,451
1.5236,-10.1709,452
-0.3999,-9.711,453
0.4064,-9.7021,454
2.4614,-9.581,455
-0.166,-9.6975,456
1.2151,-9.7983,457
0.3044,-9.7677,459
0.2011,-9.5307,460
-0.1623,-9.9091,461
0.2626,-9.7004,462
-0.1502,-9.8146,463
1.8022,-9.9798,464
4.5658,-9.6265,465
-0.2454,-9.9672,466
1.5161,-9.7064,467
0.5343,-9.7588,469
8.299,-9.1464,470
0.2321,-9.3322,471
-0.2161,-9.9545,472
1.7113,-9.5914,473
-0.6805,-9.5972,474
0.2737,-9.4254,475
1.4711,-9.8035,476
0.6357,-9.7284,477
2.3877,-9.7848,479
1.9161,-9.8187,480
0.7605,-8.2365,481
-0.161,-9.7651,482
-0.4442,-9.6901,483
0.8984,-9.9177,484
0.333,-8.819,485
-0.6735,-9.8323,486
0.5856,-9.7526,487
0.5377,-9.7643,489
1.0288,-9.9704,490
-0.0771,-9.7867,491
0.2136,-10.0034,492
0.1451,-9.0676,493
-0.0945,-9.8022,494
0.6497,-9.514,495
2.5112,-9.7838,496
-0.2402,-9.8415,497
0.7837,-9.6626,499
0.8855,-10.4544,500
7.7352,-9.6808,501
1.5554,-10.0564,502
-0.018,-9.5383,503
0.0453,-9.7078,504
0.0635,-9.5283,505
0.2297,-9.4238,506
1.1284,-9.8489,507
1.4709,-9.9778,509
0.9273,-9.6617,510
-0.0205,-9.1693,511
0.5298,-10.3797,512
0.1292,-9.3896,513
0.0334,-9.6034,514
3.6025,-10.1771,515
0.194,-9.9886,516
1.7761,-9.7826,517
0.5472,-9.1961,519
1.2504,-9.1716,520
1.5136,-8.8454,521
2.9664,-9.8913,522
-1.901,-9.2404,523
-0.6824,-10.4072,524
-0.208,-10.0049,525
0.3634,-9.8695,526
0.6273,-10.2952,527
0.0209,-9.7073,529
1.9072,-9.6662,530
-0.8126,-9.8628,531
3.5486,-10.0244,534
3.0616,-9.3478,535
2.0322,-9.6267,536
-0.9333,-9.7396,537
3.1102,-10.1263,539
1.2037,-9.92,540
1.3391,-9.6785,541
2.3169,-9.5664,542
1.4069,-9.4937,543
1.9077,-10.0339,544
1.6258,-9.5727,545
2.4594,-9.8013,546
0.6376,-10.04,547
1.8776,-10.0149,549
0.9473,-9.5063,550
14.4229,-9.7662,551
10.472,-9.5962,552
2.2794,-9.7916,553
4.4816,-9.6569,554
3.8683,-9.743,555
-0.6723,-9.8559,556
-1.5538,-9.4677,557
-1.5622,-9.5274,558
0.5877,-10.21,559
0.1802,-9.7558,560
-0.9571,-9.6391,561
0.2225,-9.8071,562
2.2748,-9.8821,563
0.7967,-9.8212,564
0.8057,-9.1753,565
0.4773,-10.6386,566
-0.7997,-10.2523,567
2.4544,-9.3854,568
-1.4672,-9.7337,569
1.7966,-9.6518,570
0.8329,-9.9659,571
-0.5156,-9.4641,572
-0.0269,-9.8704,574
2.8137,-9.6829,575
50.9889,-9.8743,576
6.984,-9.649,577
-0.5196,-9.944,578
1.6926,-9.8419,579
1.0882,-9.7287,580
0.5953,-9.6581,582
7.0441,-9.9597,583
0.1917,-9.6628,584
1.5756,-9.9287,585
0.3408,-9.6052,586
0.8801,-9.7358,587
-0.1764,-10.1634,588
-0.5027,-8.3597,589
0.0628,-9.2599,590
-0.7093,-9.3084,591
0.7704,-9.6539,594
4.6012,-10.1199,595
-0.8406,-9.7651,596
-0.9352,-9.3468,597
1.9927,-9.8744,598
-0.5009,-10.1858,599
0.2865,-9.3944,600
6.2616,-10.142,601
0.1881,-9.7382,602
0.6288,-9.6179,604
0.9079,-8.9292,605
-1.2136,-10.2316,607
-0.0051,-8.6667,608
-0.4378,-9.8115,609
0.9516,-8.9137,610
-1.4277,-9.2073,611
2.0334,-9.8228,612
3.8394,-9.8339,614
-0.6843,-9.6379,615
0.1213,-9.5811,616
0.2731,-10.0393,617
-0.0069,-9.9975,618
31.8423,-9.7102,619
-0.8774,-9.3748,620
-0.5744,-10.0649,621
2.4657,-9.6423,622
-0.9273,-9.6709,624
1.8342,-9.3051,625
0.1468,-6.6787,626
0.3877,-9.7575,627
0.6176,-9.8218,629
0.111,-9.9535,630
-0.6963,-9.5901,631
0.5507,-9.8505,632
0.2914,-9.756,634
-1.2491,-8.7949,635
-1.0493,-10.0229,636
4.3141,-9.6627,637
2.6231,-9.7001,639
-2.2973,-9.0762,640
12.1777,-9.6822,641
1.1391,-10.0107,642
-0.2051,-9.3867,644
0.0648,-9.7699,645
-0.2276,-10.2663,646
1.0066,-9.8425,647
0.9308,-9.7685,649
-0.4709,-9.902,650
-0.2591,-9.8287,651
-0.8813,-10.0326,652
-0.3534,-9.7374,654
0.3534,-10.0775,655
1.9262,-9.452,656
-0.6794,-9.7217,657
2.1093,-9.9721,659
1.1607,-9.9059,661
8.2563,-9.3639,662
-0.393,-9.6433,663
0.4766,-9.5845,664
1.2109,-9.6899,665
4.124,-9.1621,666
1.3136,-7.749,667
1.1516,-10.1197,668
-4.5783,-9.662,669
-1.8748,-10.2652,670
-0.9316,-8.8053,671
1.8688,-9.7975,672
-1.6322,-9.6851,673
0.3585,-9.6671,674
0.8214,-9.5872,675
0.7731,-9.7834,676
0.2773,-9.83,678
-0.0512,-9.818,679
-0.3641,-9.977,680
0.9409,-9.6125,681
0.7976,-9.7913,682
1.1037,-9.5691,683
-0.6454,-9.7261,684
0.6695,-9.8374,685
2.0531,-9.7079,686
2.1833,-9.7784,687
-0.5508,-9.7809,689
0.592,-9.8165,690
-1.6277,-9.7859,691
-0.3561,-8.4397,692
4.2827,-9.7783,693
-0.7299,-9.7387,694
-0.298,-10.0683,695
-0.9171,-9.8032,696
1.0156,-9.8087,697
-0.284,-9.8765,699
-1.1626,-9.7763,700
0.4713,-9.9115,701
-0.2751,-9.805,702
3.5663,-10.3592,703
-0.0996,-9.9483,704
-0.3076,-9.7823,705
0.4919,-9.577,706
2.7014,-9.4694,707
-2.122,-9.5407,708
-0.8807,-9.5936,709
-0.5363,-9.7321,710
1.0834,-9.8151,711
1.2154,-9.7651,712
0.6914,-9.8088,714
0.0902,-9.8297,715
0.4425,-9.7191,716
0.1488,-9.7649,717
0.0922,-9.7046,718
3.5584,-9.7407,719
6.8859,-9.7842,720
-0.2322,-9.6106,721
0.5581,-9.9007,722
-0.1123,-10.2401,723
-0.2663,-9.6579,724
2.2438,-9.6452,725
0.9611,-9.9762,726
-0.7062,-9.877,727
0.9201,-9.6072,728
-0.629,-9.9441,729
-0.7189,-8.6144,730
-1.2059,-9.57,731
1.484,-10.1407,732
1.1531,-9.6511,733
-0.071,-9.8079,734
2.3474,-9.2646,735
4.5231,-10.0178,736
1.3833,-9.842,737
0.3522,-9.6184,738
0.7905,-9.7534,739
2.1082,-9.788,740
-0.6465,-9.3039,741
0.6981,-10.0312,742
-0.1696,-9.7611,743
-0.2072,-9.9722,744
0.0922,-9.7782,745
1.2796,-9.7896,746
0.0326,-9.8224,748
0.453,-9.6064,749
4.5491,-9.9689,750
-0.0987,-9.4706,751
5.226,-10.0343,752
1.3616,-9.7699,753
-0.3163,-9.729,754
-0.0886,-9.5344,755
2.7296,-9.9956,756
2.7313,-9.5164,757
3.0216,-9.9156,759
3.1029,-9.7171,760
1.3583,-9.7915,761
-0.2689,-10.0648,762
1.6903,-9.6185,763
-0.1241,-9.7585,764
0.5846,-9.9734,765
-0.0999,-10.3676,766
0.1803,-9.7116,767
2.8372,-9.8828,769
1.0302,-9.9879,770
1.8116,-9.8241,771
3.9797,-9.4264,772
1.2861,-9.8921,773
0.8613,-10.0212,774
1.2823,-10.257,775
1.5454,-9.4923,776
0.1783,-8.3341,777
1.422,-9.8676,779
1.1467,-9.8995,780
0.5764,-9.7858,781
6.1865,-9.3091,782
4.0083,-9.8676,783
1.6444,-9.9864,784
-1.6458,-9.8077,785
0.149,-9.4537,786
1.2404,-9.6698,787
0.4693,-9.8033,789
0.6866,-9.7893,790
-0.0996,-10.2065,791
0.5882,-9.8093,792
0.8926,-9.903,793
1.0122,-9.7769,794
-0.1979,-9.8482,795
1.2638,-9.7976,796
-0.5226,-9.766,797
0.5111,-9.7727,799
0.3868,-9.932,800
-0.1418,-9.5231,801
-6.0536,-9.458,802
0.1308,-9.7398,803
-0.6975,-9.995,804
-0.4891,-10.161,805
0.0216,-9.2244,806
0.7885,-10.1387,807
0.1798,-9.7793,809
0.8655,-9.9222,810
3.2283,-9.954,811
-0.2078,-10.8219,812
-2.4226,-9.8571,813
2.9313,-9.5023,814
-0.7502,-9.5414,815
0.0144,-9.4999,816
0.7176,-9.4904,817
1.3613,-9.7857,819
0.0529,-10.0745,820
42.8471,-9.4841,821
2.7998,-9.9622,822
6.0417,-9.6397,823
0.122,-9.7896,824
1.3155,-9.9948,825
-0.2168,-9.9025,826
-0.8256,-9.7728,827
3.9937,-9.8244,829
1.2575,-9.778,830
1.951,-9.8164,831
-1.0635,-9.9335,832
6.1915,-9.9667,833
5.6209,-8.9775,834
0.4681,-8.0847,835
0.8264,-9.5412,836
-0.5525,-9.9299,837
1.9062,-9.6452,839
0.3778,-10.1766,840
-0.0515,-10.1036,841
3.146,-9.1856,842
-1.3057,-9.8139,843
2.4858,-9.8466,844
0.9533,-10.2864,845
0.1888,-8.9118,846
0.2974,-9.9769,847
2.022,-9.7772,849
1.0295,-9.809,850
1.574,-9.9313,851
0.2917,-9.716,852
3.1572,-9.7913,853
0.2703,-9.5831,854
0.7332,-9.6682,855
0.0202,-9.8003,856
1.3131,-9.8685,857
0.1224,-9.508,858
-0.5137,-9.7867,859
1.3371,-9.6795,860
0.2612,-10.0331,861
1.7978,-9.7722,862
1.301,-9.9586,863
0.0343,-9.5996,864
0.6788,-7.9403,865
-0.3953,-10.2527,866
-0.5423,-9.5987,867
0.4309,-9.4405,869
0.6707,-9.8505,870
-0.2327,-6.9682,871
0.9066,-9.666,872
5.012,-9.5671,873
-0.8676,-10.1576,874
-0.0883,-10.1285,875
0.62,-9.6204,876
0.1236,-9.6876,877
0.4634,-9.8835,879
2.7996,-9.7874,880
1.8479,-9.8243,881
0.5765,-9.9236,882
2.2051,-9.7855,883
0.9715,-10.0249,884
5.0037,-9.8547,885
0.6466,-9.7567,886
2.5733,-9.7169,887
5.9102,-9.5521,888
-1.5704,-9.4068,889
-0.1831,-9.5967,890
1.122,-9.8082,891
-2.9197,-9.6618,892
0.4917,-9.8045,893
1.306,-9.6147,894
0.1659,-9.8987,895
3.063,-9.5783,896
0.953,-9.9502,897
1.453,-9.7634,898
1.0079,-9.6986,899
1.3057,-9.9878,900
0.7241,-9.5416,902
1.2719,-10.0609,903
2.552,-9.6265,904
-1.1923,-10.0388,905
1.3651,-10.2906,906
0.3144,-9.9899,907
6.473,-9.1812,908
-1.2875,-9.8563,909
7.8787,-9.2694,910
-0.8988,-9.9212,911
1.6674,-9.2865,912
3.3751,-9.7757,914
0.7844,-10.0902,915
-0.9364,-10.134,916
0.4006,-9.6053,918
0.6051,-9.8756,919
1.849,-9.7994,920
2.7999,-10.2158,921
2.0893,-9.9104,922
1.4397,-9.7009,924
-0.8092,-9.9313,925
8.3058,-9.8514,926
2.049,-10.0122,927
-0.3478,-10.1308,928
0.605,-9.5479,929
4.7424,-9.7375,930
2.1301,-9.7675,931
1.8081,-9.6809,932
1.0032,-9.8063,934
-0.6371,-9.59,935
-0.5896,-9.366,936
0.1282,-9.8754,937
0.3634,-9.8446,938
1.3618,-9.6825,939
1.6452,-9.4961,940
0.5976,-9.2536,941
7.0512,-9.9257,942
0.4947,-9.6922,944
-0.3824,-9.892,945
2.6964,-10.0102,946
-2.5301,-8.8934,947
-1.3805,-9.6537,948
2.9178,-9.9132,949
-2.3242,-9.6237,950
8.7205,-7.9536,951
2.2907,-10.026,952
2.4992,-9.8133,954
0.9236,-9.7085,955
-2.3767,-8.8315,956
1.5307,-9.8633,957
-0.0651,-9.8503,958
0.327,-9.9127,959
0.8516,-9.6225,960
0.5301,-9.8666,961
1.4341,-9.7404,962
2.7841,-9.7931,964
10.9512,-9.8525,965
-0.5975,-9.5972,966
-0.3295,-9.5646,967
-0.3085,-9.8415,968
36.4868,-9.3158,969
13.9851,-9.5281,970
3.4808,-9.3519,971
0.6774,-9.6911,972
2.1395,-9.7911,974
-1.0924,-9.6869,975
8.6824,-9.8709,976
0.4224,-9.3182,977
8.2587,-9.7768,978
15.8265,-9.8971,979
3.0925,-9.8042,980
5.9931,-9.7107,981
9.757,-9.7402,982
4.948,-9.823,984
4.5446,-9.9229,985
-0.3707,-9.9212,986
1.0806,-9.9555,987
2.4347,-9.8677,988
0.5211,-9.7916,989
0.3448,-9.7738,990
0.4627,-9.6447,991
0.0139,-9.8345,992
3.2814,-9.6169,994
1.7893,-9.607,995
5.4771,-9.7934,996
-0.1925,-9.8434,997
0.6797,-9.8801,998
0.9099,-9.8535,999
0.7831,-9.8288,1000
0.7326,-9.5268,1001
-0.0787,-9.8296,1002
3.962,-9.6511,1004
-2.5045,-9.6925,1005
2.3077,-9.5368,1006
1.1098,-10.1631,1007
1.9115,-9.2897,1008
0.8626,-9.9832,1009
0.4595,-9.2349,1010
0.5689,-10.2038,1011
-0.392,-9.7896,1012
1.2568,-9.7482,1014
2.459,-9.7754,1015
0.7717,-9.6505,1016
0.5584,-9.8453,1017
0.7863,-9.4965,1018
2.0627,-9.7054,1019
0.5328,-10.9292,1020
-0.97,-9.7485,1021
-0.9513,-9.7449,1022
1.0927,-9.789,1024
0.6847,-9.851,1025
0.5487,-9.7724,1027
0.2999,-9.8967,1028
1.3815,-9.8163,1029
2.3445,-9.8762,1030
0.1144,-9.8111,1031
0.572,-9.7532,1032
4.285,-9.6964,1034
1.7993,-9.7371,1035
1.2796,-9.8412,1036
0.3142,-9.8652,1037
-0.5566,-9.6904,1038
4.3043,-9.8722,1039
5.7134,-9.7068,1040
-0.5738,-9.8529,1041
1.5549,-9.855,1042
0.5813,-9.7819,1044
0.982,-9.8065,1045
7.6631,-9.6447,1046
1.7556,-9.702,1047
0.9984,-9.7795,1048
5.9325,-9.7197,1049
0.0419,-9.8135,1050
5.471,-9.9131,1051
-0.1352,-9.6102,1052
0.8794,-9.6698,1053
0.1781,-9.7158,1054
14.8887,-9.5761,1055
6.7917,-9.8269,1056
4.5554,-9.7776,1057
-0.8872,-9.9238,1058
8.6016,-9.8101,1059
0.4117,-9.6832,1060
-0.0189,-9.5708,1061
3.8272,-10.1858,1062
0.7636,-9.479,1063
-0.0933,-9.7564,1064
-0.6316,-9.6788,1065
2.4561,-9.5613,1066
-0.6325,-9.729,1068
-0.0657,-9.8287,1069
-0.2047,-9.7696,1070
1.4547,-9.8521,1071
-0.4325,-9.7964,1072
-2.3556,-9.7217,1073
2.9341,-9.5915,1074
-0.6297,-9.7779,1075
0.2468,-9.791,1076
0.1576,-9.7104,1077
0.8687,-9.7457,1079
-0.658,-9.6588,1080
0.9254,-9.466,1081
-0.2947,-8.8995,1082
-0.5386,-10.0705,1083
-0.5018,-9.068,1084
4.4591,-9.8038,1085
3.7896,-10.4626,1086
-0.3614,-9.7318,1087
1.8826,-9.9075,1089
2.3381,-9.4423,1090
1.5178,-9.8539,1091
2.4856,-9.8471,1092
0.0453,-9.9819,1093
-0.1848,-9.7289,1094
6.1619,-10.2418,1095
-0.3576,-9.6548,1096
0.6018,-9.7974,1097
0.935,-9.754,1099
2.2621,-9.6823,1100
-0.368,-9.2531,1101
-0.3461,-9.7223,1102
0.5504,-9.7583,1103
-0.8222,-9.5472,1104
-0.1053,-9.8575,1105
0.5253,-9.744,1106
-2.5026,-9.7583,1107
0.4057,-9.8199,1109
-1.2197,-8.8958,1110
0.7152,-10.0988,1111
4.2548,-9.9994,1112
5.9782,-10.0783,1113
1.6064,-9.9365,1114
0.2767,-9.5735,1115
-0.4698,-9.6273,1116
2.9389,-9.7822,1117
1.4618,-9.8438,1119
2.8955,-9.6375,1120
0.1544,-9.9229,1121
2.6418,-9.6363,1122
-0.8975,-9.8364,1123
-1.0925,-9.8142,1124
-2.3714,-9.8339,1125
1.0505,-9.8391,1126
1.9009,-9.7678,1127
3.1256,-9.7708,1129
-0.0377,-9.904,1130
1.6662,-9.6857,1131
9.6885,-9.8227,1132
0.2669,-10.1015,1133
3.7432,-10.1388,1134
-1.2356,-9.612,1135
-0.3717,-9.961,1136
2.3282,-9.5996,1137
3.9899,-9.8219,1139
5.5642,-9.7345,1140
-0.1416,-10.29,1141
2.5731,-9.8337,1142
11.5761,-9.9319,1143
0.4108,-9.8951,1144
-0.4905,-9.7287,1145
1.4962,-9.9061,1146
0.0077,-9.7244,1147
1.3725,-9.8536,1149
0.1544,-10.5649,1150
10.3838,-9.851,1151
-1.5233,-9.1199,1152
-1.0988,-9.7937,1153
-0.4289,-9.8817,1154
4.741,-9.752,1155
0.2909,-9.9433,1156
-0.4291,-9.7285,1157
4.1045,-9.655,1158
-0.043,-9.8619,1159
1.3882,-9.6644,1160
1.6221,-9.9199,1161
-0.1052,-9.9298,1162
-0.0564,-9.8595,1163
1.9799,-10.1134,1164
-0.6856,-8.6027,1165
-0.2546,-9.6609,1166
-0.0669,-9.9301,1167
0.0662,-9.8862,1169
0.1699,-9.6429,1170
-0.8526,-9.1668,1171
-3.8689,-9.3588,1172
3.3017,-10.0142,1173
0.3552,-9.36,1174
0.8896,-9.5046,1175
-0.1339,-9.8312,1176
0.7706,-10.1185,1177
0.1773,-9.7999,1179
1.1263,-9.6542,1180
-1.2311,-9.8242,1181
1.722,-9.7545,1182
1.0641,-9.8875,1183
-0.9005,-9.5921,1184
0.1125,-9.6137,1185
-0.1347,-9.4507,1186
-1.5759,-9.6671,1187
9.8565,-9.8497,1189
1.0625,-9.9014,1190
0.6996,-9.6264,1191
1.2256,-9.658,1192
1.1563,-9.8352,1193
-1.1669,-9.7692,1194
0.2879,-9.9006,1195
-1.8047,-9.7207,1196
1.9895,-9.6355,1197
0.5134,-9.8669,1199
0.0709,-9.7017,1200
1.2332,-9.9014,1201
7.7124,-9.9117,1202
0.148,-9.41,1203
-0.8881,-9.4274,1204
3.3431,-11.2596,1205
1.2578,-9.7919,1206
1.0582,-9.7247,1207
1.4132,-9.6899,1208
0.2854,-9.8626,1209
4.1329,-10.6816,1213
11.8424,-10.4042,1214
-0.0934,-10.1808,1215
0.3189,-10.2143,1216
2.8204,-9.6603,1217
0.795,-9.7014,1218
0.2215,-9.6714,1220
-1.0939,-9.9527,1221
-0.6733,-9.7951,1222
0.1663,-9.9194,1223
-0.728,-9.3095,1224
-0.7841,-10.0735,1225
0.516,-9.7639,1226
2.1519,-9.2924,1227
0.6541,-9.8731,1229
3.136,-9.6279,1230
1.789,-10.4332,1231
0.2339,-9.9548,1232
-0.1644,-9.6649,1233
3.4903,-9.9677,1234
0.5771,-9.2578,1235
2.4398,-9.7001,1236
-0.1762,-9.7746,1237
1.3141,-9.6783,1239
-0.3142,-10.0894,1240
-1.0312,-9.6202,1241
0.2268,-9.8473,1242
-0.1852,-9.7874,1243
1.4485,-9.6416,1244
-1.4143,-9.8906,1245
0.2104,-10.046,1246
0.8693,-9.7413,1249
-0.1369,-9.8822,1250
-0.9359,-9.655,1251
2.1583,-9.5018,1252
-0.074,-9.5828,1253
0.9874,-9.9535,1254
0.2019,-9.8459,1255
-0.1961,-9.7312,1256
-1.2407,-9.8303,1257
-0.1784,-9.7573,1259
-0.1283,-9.919,1260
0.5088,-9.7225,1261
0.2126,-10.1709,1262
5.2416,-9.0815,1263
-0.6793,-9.8077,1264
0.3834,-9.7082,1265
2.6948,-9.8515,1266
-0.2703,-9.2089,1267
0.2133,-9.7732,1269
-0.4772,-9.3559,1270
0.1536,-9.4157,1271
0.7775,-9.8845,1272
-0.4936,-9.7893,1273
-0.4899,-10.0808,1274
0.9562,-9.8041,1275
1.742,-9.8527,1276
0.4262,-9.8481,1277
0.69,-10.0648,1278
0.9534,-9.8957,1279
1.4563,-9.6867,1280
1.3354,-9.6813,1281
4.5038,-10.0126,1282
1.2321,-9.7588,1283
-1.1405,-9.6268,1284
-0.2834,-9.3661,1285
-0.2027,-10.0312,1286
-0.4893,-9.7661,1287
-0.4101,-9.7159,1289
1.3969,-9.9131,1290
1.8111,-10.378,1291
1.587,-9.9833,1292
-0.6164,-9.4686,1293
-0.104,-9.8001,1294
-0.0691,-9.861,1295
0.0368,-9.6402,1296
3.0398,-10.0697,1297
1.321,-9.7537,1299
-0.4519,-9.6199,1300
0.3293,-10.0323,1301
-0.6911,-10.0543,1302
5.0355,-10.1108,1303
2.902,-9.339,1304
0.7942,-10.0183,1305
1.1824,-9.6451,1306
0.5459,-9.814,1307
4.1938,-9.7932,1309
-1.1509,-9.393,1310
1.2887,-9.9277,1311
-0.7971,-9.6471,1312
2.2096,-10.1909,1313
4.7124,-10.3977,1314
5.5695,-9.6037,1315
-1.547,-9.676,1316
3.6605,-9.5787,1317
1.3274,-9.9094,1319
0.7925,-9.5103,1320
8.343,-9.6411,1321
1.1311,-9.5684,1322
1.7689,-9.2115,1323
3.4884,-8.1941,1324
0.5967,-9.6115,1325
4.9209,-9.7647,1326
0.1381,-9.8944,1327
3.4444,-9.4436,1329
0.4604,-9.749,1330
-1.574,-9.8126,1331
0.8004,-9.137,1332
0.1035,-9.7309,1333
1.8134,-9.9349,1334
0.3677,-9.5623,1335
-0.5882,-9.565,1336
1.4247,-9.6234,1337
0.9247,-9.6674,1338
0.365,-9.8895,1339
1.5218,-9.6648,1340
-0.8438,-9.953,1341
9.338,-9.7924,1342
1.9768,-10.2187,1343
7.7367,-9.597,1344
6.4159,-9.671,1345
0.8156,-10.0355,1346
4.5096,-9.6772,1347
-0.1078,-9.8016,1348
1.557,-9.7838,1349
3.7224,-9.7199,1350
4.8743,-9.7601,1351
0.113,-9.8939,1352
0.0094,-9.9413,1353
1.0677,-9.92,1354
2.3018,-9.4198,1355
4.8027,-9.3578,1356
0.8418,-9.7076,1357
0.8891,-8.7731,1359
2.4445,-8.6746,1360
-3.262,-9.6303,1361
3.8213,-9.7676,1362
-3.4853,-9.9707,1363
3.4196,-9.6976,1364
19.4289,-10.2179,1365
1.5699,-9.2834,1366
0.0881,-9.7149,1367
-0.7802,-9.8571,1368
-0.0611,-9.7439,1370
1.9771,-10.1923,1371
0.1814,-9.7603,1372
1.6996,-9.8419,1373
-0.262,-9.5641,1374
1.5887,-9.7005,1375
-1.4482,-9.7876,1376
1.2588,-9.594,1377
1.1761,-10.1584,1378
0.7151,-10.138,1379
-0.7927,-10.0265,1380
-0.5477,-9.7918,1381
-0.3411,-9.5909,1382
-0.9026,-9.8242,1383
-0.7479,-9.8354,1384
0.4128,-9.7518,1385
-0.7791,-9.9775,1386
-0.4381,-9.9912,1387
0.328,-9.8507,1388
1.5993,-10.1222,1389
0.1415,-9.7712,1390
-0.5222,-9.5113,1391
0.405,-9.7418,1392
2.133,-9.6543,1394
0.5056,-9.662,1395
0.2084,-9.6678,1396
0.6508,-9.3497,1397
1.5875,-9.8067,1399
-0.0059,-9.675,1400
0.9692,-9.7013,1401
-1.0184,-8.6799,1402
1.2538,-9.7053,1404
0.936,-9.7828,1405
-0.2172,-9.9487,1406
-0.9551,-10.0947,1407
-0.4293,-9.5862,1408
-1.1595,-9.7674,1409
0.3461,-9.6588,1410
0.8553,-9.8048,1411
1.3782,-9.257,1412
0.9009,-9.7727,1414
0.3806,-9.629,1415
-0.3908,-9.8898,1416
2.2261,-10.1695,1417
-0.073,-8.4753,1418
4.728,-9.8136,1419
4.8443,-10.2578,1420
-1.908,-10.639,1421
28.563,-10.477,1422
3.3967,-9.767,1424
-0.7742,-9.7465,1425
1.1215,-10.1994,1426
-0.1206,-10.0686,1427
2.792,-8.9278,1428
0.6279,-9.9226,1429
3.8763,-9.7567,1430
3.9403,-9.4745,1431
0.4909,-9.9606,1432
-0.3257,-9.692,1434
5.2371,-9.7331,1435
-4.688,-10.5143,1436
1.6724,-9.7145,1437
0.7711,-9.9694,1438
0.4734,-9.3676,1439
-0.9542,-8.9992,1440
-0.8159,-10.2863,1441
36.63,-9.8592,1442
3.6157,-9.7737,1444
0.3628,-9.4582,1445
-0.3039,-8.4511,1446
-0.0123,-9.7724,1447
-2.8155,-10.2545,1448
-3.4219,-10.0027,1449
-0.1883,-9.7705,1450
0.2166,-9.6098,1451
-0.1429,-9.1361,1452
0.6156,-9.7237,1454
-0.7186,-9.9724,1455
1.4115,-9.5949,1456
-0.3679,-9.884,1457
1.758,-9.6852,1459
-0.6564,-9.8183,1460
0.6924,-9.2694,1461
-1.0825,-9.8532,1462
-1.1482,-9.7255,1464
1.2909,-10.1433,1465
-2.6416,-9.9191,1466
0.4677,-9.8199,1467
-1.476,-9.5544,1468
-1.9132,-7.8353,1469
-1.353,-9.9525,1470
10.5741,-10.0372,1471
2.5617,-9.8424,1472
0.4666,-9.547,1474
-0.9301,-9.9535,1475
4.5947,-9.5325,1476
1.3314,-9.822,1477
-1.5866,-9.6309,1478
0.824,-9.7531,1479
0.2792,-10.1824,1480
-0.3745,-10.5161,1481
-0.1799,-9.9779,1482
0.7734,-9.5898,1484
-0.1612,-9.7767,1485
-0.0717,-9.7312,1486
-0.8555,-9.7832,1487
-2.0506,-9.9622,1488
0.14,-9.2907,1489
7.2141,-9.8188,1490
5.7665,-9.8833,1491
0.7349,-9.6332,1492
-0.291,-9.7745,1494
3.9427,-9.8028,1495
5.2584,-9.4565,1496
6.2751,-9.6027,1497
-0.4884,-9.5736,1498
-0.0088,-9.5405,1499
0.5624,-9.7019,1500
-0.4691,-9.5265,1501
10.0522,-10.1871,1502
3.162,-9.6385,1504
0.816,-9.6729,1505
0.3394,-9.9874,1506
0.8831,-9.9439,1507
-0.1852,-9.5316,1508
0.7649,-9.8175,1509
0.4289,-8.1048,1510
1.1536,-9.7048,1511
0.8344,-9.6726,1512
-0.2408,-9.7496,1513
0.2797,-9.7045,1514
1.6802,-9.8547,1515
9.3716,-9.7383,1516
0.1242,-10.1579,1517
1.756,-9.5263,1518
0.4181,-9.888,1519
2.6401,-9.5325,1520
-0.6102,-8.7651,1521
1.5334,-8.9182,1522
0.7635,-8.6488,1523
0.3823,-9.6958,1524
0.5764,-9.5814,1525
0.4774,-9.5837,1526
0.3682,-9.6096,1527
0.6189,-9.4394,1528
-0.284,-9.7974,1529
0.4826,-9.9385,1530
-0.4432,-9.7624,1531
0.5153,-9.7627,1532
0.8428,-9.7818,1535
0.4393,-9.5221,1536
2.0445,-9.7034,1537
1.0545,-10.0112,1538
-2.9782,-9.5918,1539
-0.9636,-9.7723,1540
1.3267,-9.7652,1541
0.6527,-9.8623,1542
0.2912,-9.758,1543
2.371,-9.581,1544
-0.5056,-9.7119,1545
-1.5652,-9.749,1546
-2.8481,-9.7998,1548
3.4912,-10.1969,1549
-1.335,-10.0222,1550
1.1961,-9.9974,1551
0.8904,-9.604,1552
1.0915,-9.9116,1553
0.2613,-9.6953,1554
3.3259,-9.9622,1555
-0.0396,-10.1331,1556
-0.1969,-9.8928,1557
0.2077,-9.8392,1559
0.7629,-9.5858,1560
0.8375,-9.8594,1561
-0.1633,-9.7236,1562
0.1274,-9.7518,1563
0.6219,-9.7641,1564
-0.707,-9.7557,1566
0.6765,-9.7403,1567
-0.8521,-9.9519,1568
2.0559,-9.6281,1569
6.5778,-9.5588,1570
24.7581,-9.7101,1571
18.8658,-9.8479,1572
1.4997,-9.7792,1574
-0.9169,-10.0995,1575
1.9259,-9.7529,1576
-0.8138,-9.2385,1577
2.5355,-9.9568,1579
11.5266,-9.7855,1580
3.0776,-9.9644,1581
0.4666,-9.6215,1582
1.4345,-9.9258,1584
1.9864,-9.5039,1585
0.0929,-10.0139,1586
16.0073,-9.7191,1587
-5.6735,-9.6861,1588
-6.5069,-9.3069,1590
19.7949,-9.6319,1591
4.306,-9.601,1592
-17.3012,-9.7108,1593
6.8084,-9.7391,1594
-1.0287,-9.7336,1595
-0.1076,-9.7587,1596
-0.0395,-9.7648,1597
