AYGX_mean,AZ_mean,timestamp
-0.1297,-9.7726,0
-0.1293,-9.7724,1
-0.1285,-9.7728,2
-0.1507,-9.7736,4
-0.1026,-9.7729,13
-0.1028,-9.7734,14
-0.1034,-9.7734,16
-0.1051,-9.7743,17
-5.0668,-9.7239,19
0.2822,-9.6468,20
2.3233,-9.642,21
5.3091,-9.6907,22
0.9302,-9.7163,23
-0.169,-9.7137,24
1.0803,-9.7161,26
2.1814,-9.7065,27
-8.5736,-9.7067,28
2.0752,-9.5796,29
-8.5331,-9.6677,30
2.046,-9.5709,31
3.9298,-9.6419,32
3.0122,-9.6829,33
2.4118,-9.6937,34
1.2933,-9.6948,35
0.8756,-9.7069,36
0.864,-9.6956,37
2.1936,-9.6967,38
0.5477,-9.7023,39
-0.5769,-9.6893,40
-10.8455,-9.5321,41
-2.7383,-9.4586,43
-45.2286,-9.0081,44
46.0347,-9.1228,45
1.1407,-9.5258,46
-30.1995,-9.2481,47
-24.4683,-8.8613,48
-78.4336,-7.3793,49
0.063,-9.4886,51
26.1284,-9.0578,52
0.4889,-9.4084,53
5.4,-9.4032,54
4.2586,-9.5747,55
-12.6991,-9.3778,56
5.296,-9.2521,57
12.6611,-9.4007,58
-3.3348,-9.4527,59
-24.6009,-9.1589,60
25.237,-9.3412,61
1.4208,-9.6737,62
-1.3064,-9.6658,63
-0.8572,-9.7387,64
0.1489,-9.797,66
4.7495,-9.8145,67
1.426,-9.7665,68
6.6875,-9.6788,69
-2.7169,-9.6349,70
7.5943,-9.8777,71
13.9913,-9.4559,72
-0.3131,-9.9516,73
0.0964,-9.7814,74
2.2583,-9.9819,75
17.2323,-9.6704,76
-0.5105,-9.7525,77
2.3766,-9.9968,78
-0.4409,-9.6757,79
-0.6893,-9.5823,80
1.3355,-9.503,81
0.9246,-9.782,83
1.1633,-9.6696,84
6.7442,-10.2415,85
-0.2113,-9.851,86
-0.0723,-9.7684,87
8.754,-9.6217,88
0.1675,-9.7879,89
-0.1738,-9.7698,90
-0.2918,-9.7646,91
-0.1145,-9.7118,92
9.6196,-9.821,93
-0.9854,-9.7822,94
0.9245,-9.6981,95
-0.5323,-9.7573,96
1.1822,-9.6958,98
4.3886,-9.7257,99
-0.3612,-9.7847,100
-0.1606,-9.78,101
-0.502,-9.7813,102
-0.3404,-9.774,103
-0.0153,-9.7814,104
-0.0506,-9.7822,105
-0.1075,-9.7824,106
0.0215,-9.7766,107
-0.2716,-9.7816,108
-0.3274,-9.7789,109
-0.0155,-9.7724,110
-0.1864,-9.7747,111
-0.1281,-9.7803,112
-0.1488,-9.7811,113
-0.1708,-9.7791,114
-0.8492,-9.7801,115
-0.3825,-9.7771,116
-0.5546,-9.7781,117
-1.2473,-9.7829,118
0.759,-9.765,119
2.9325,-9.7941,120
-8.6969,-9.7799,121
-0.4888,-9.786,122
5.3366,-9.735,123
-1.6805,-9.7497,125
-0.2059,-9.7288,126
-9.1298,-10.1962,127
-43.5779,-9.5771,128
3.2246,-9.6377,129
10.7154,-9.6453,130
-3.5277,-9.7005,131
1.6295,-9.6511,132
-0.6097,-9.7254,133
-15.4437,-9.9824,134
10.2107,-9.357,135
4.8335,-9.7213,136
4.9463,-9.7534,137
0.3137,-9.836,138
0.7364,-9.7464,140
-0.1469,-9.7458,141
-3.8788,-9.8647,142
-0.3932,-10.4551,143
5.2448,-9.7561,144
15.9262,-9.9331,145
1.4183,-9.8703,146
0.043,-9.7557,147
-0.226,-9.7388,148
0.0088,-9.6341,149
-1.3131,-9.1081,150
1.2853,-9.9811,151
13.3522,-9.3091,152
-1.7581,-9.6284,153
18.2362,-9.7493,154
-0.6987,-9.8122,155
16.4425,-10.202,156
9.7957,-9.5868,157
4.3518,-7.3615,158
0.789,-9.8145,159
1.6193,-9.7798,160
-0.6049,-9.8469,161
2.7425,-9.7136,163
-1.9407,-9.9127,164
10.6697,-9.2527,165
12.8805,-9.6646,166
0.7118,-9.9923,167
10.7335,-9.8923,168
1.7556,-9.7783,169
-0.1256,-9.7754,170
-0.7196,-9.7609,193
0.3236,-9.7954,194
-1.1028,-9.7991,195
-0.5618,-9.8382,196
-0.1872,-9.6827,197
0.2483,-9.7913,198
2.457,-9.853,199
1.1879,-9.7463,200
1.8053,-9.8315,201
1.0212,-9.8091,202
-0.7542,-9.7501,203
-1.3881,-10.082,204
8.8806,-9.6144,205
-1.3787,-9.6407,207
6.1094,-9.9144,208
1.8081,-9.7523,209
-0.089,-9.821,210
4.3194,-9.7579,211
1.6627,-9.7067,212
4.8149,-9.8949,213
-0.8076,-9.7508,214
0.6643,-9.8182,215
-0.3465,-9.7576,216
3.1307,-9.7872,218
1.3041,-9.7803,219
-2.2845,-9.8089,220
3.5303,-9.8086,221
6.0072,-9.8729,222
-0.1236,-9.8423,223
-0.1061,-9.7407,224
-0.8257,-9.7642,225
-0.8809,-9.7123,226
-3.6072,-9.5335,227
2.8673,-9.8692,228
9.2376,-10.1074,229
5.3909,-9.7344,230
4.6924,-9.5492,231
5.4881,-9.6787,232
0.0726,-9.7529,234
4.8008,-9.8943,235
1.4318,-9.943,236
8.7417,-10.0937,237
0.4215,-9.8819,238
0.5616,-9.8664,239
5.7862,-9.7922,240
-0.0092,-9.6554,241
1.155,-9.867,242
1.273,-9.753,243
8.937,-9.7831,244
5.7687,-9.8059,245
6.8511,-9.8308,246
9.3439,-9.7597,248
3.723,-9.8785,249
3.2556,-9.5885,250
-0.8826,-9.8001,251
14.6701,-9.8479,252
3.2483,-9.7618,253
1.1027,-9.6611,254
9.5223,-8.7763,255
4.3913,-10.0227,256
10.0683,-9.5338,257
3.5764,-10.0013,258
-1.816,-9.8853,259
8.8147,-10.1639,260
2.2363,-8.4191,261
5.1469,-9.8878,262
3.0271,-9.7051,264
5.2221,-9.9979,265
17.3982,-9.7401,266
1.1744,-10.0565,267
7.9212,-8.3687,268
1.1744,-9.8046,269
20.6772,-9.6055,270
-0.1017,-10.3334,271
1.4103,-8.9651,272
-0.0115,-10.091,273
2.0492,-10.2332,274
2.0981,-10.0203,275
1.2855,-9.534,276
4.8691,-9.7325,277
1.0652,-9.6191,278
2.7,-9.5885,279
7.7647,-9.8962,280
8.6292,-9.8023,281
-0.177,-9.6571,282
9.3438,-10.0228,283
-2.4977,-10.0968,284
-3.7395,-9.7618,285
2.9688,-9.8305,286
0.7449,-9.7096,287
-1.1065,-10.0322,288
1.5233,-9.8261,289
2.5551,-9.7168,290
0.9345,-10.4038,291
-0.7026,-9.8656,292
0.0351,-9.8215,294
-3.0323,-9.63,295
5.0576,-9.7822,296
-1.5273,-9.7347,297
-0.4718,-9.6278,298
5.2412,-9.8796,299
3.9668,-9.8882,300
1.9745,-9.6359,301
0.7656,-9.6829,302
2.7117,-9.529,303
0.093,-9.9109,304
5.6392,-9.7582,305
0.3504,-9.6967,306
2.285,-9.5413,307
0.6643,-9.8612,308
-0.6729,-9.7037,309
-0.0522,-9.6244,310
0.1784,-9.7675,311
-0.0286,-9.8364,312
-0.5142,-10.0044,313
1.0709,-9.8697,315
1.2284,-9.7868,317
2.0288,-9.7182,318
-0.8198,-9.751,319
0.1111,-9.651,320
-1.2578,-9.569,321
1.0463,-9.6912,322
1.128,-9.7866,323
-0.0288,-9.9098,324
11.4142,-9.7396,325
3.8468,-9.9454,326
-2.8003,-9.7275,327
4.8048,-9.7598,328
-0.451,-10.0812,329
8.7372,-9.8329,330
1.1397,-9.8487,331
5.1515,-9.7279,334
4.1011,-9.9111,335
7.9646,-9.7708,337
1.2582,-9.8192,338
0.0846,-9.7601,339
2.8327,-9.7115,340
1.9402,-9.8795,342
3.0993,-9.8046,343
4.8532,-9.526,344
4.3808,-9.7574,345
6.8744,-9.9884,346
4.2257,-9.5065,347
0.4648,-9.5763,348
0.7828,-9.8425,349
3.8537,-9.6636,350
0.5407,-9.6381,352
5.2841,-9.7969,353
12.5888,-9.5627,354
-0.2192,-9.8761,355
12.1694,-9.6805,356
0.4072,-9.8044,357
7.0187,-9.6135,358
5.5517,-9.8316,359
9.046,-9.8532,360
0.8747,-9.8019,361
0.7332,-9.7198,362
4.4112,-9.5682,363
-1.3551,-9.9653,364
2.5362,-9.7795,365
-3.1734,-9.6453,366
2.3245,-9.9599,367
0.0733,-10.018,369
5.2843,-9.1576,370
11.9629,-9.97,371
0.1056,-9.7946,372
1.6829,-9.7514,373
3.0625,-9.7156,374
6.5593,-9.8341,375
8.613,-9.9961,376
-0.2788,-9.7668,377
-1.084,-9.6846,378
-1.3763,-9.8557,379
11.0143,-9.8014,380
42.7001,-9.8285,381
9.3214,-9.7856,383
0.4684,-9.7816,384
1.0187,-9.8188,385
7.7247,-9.6957,387
2.9771,-9.78,388
1.383,-9.8422,389
16.5924,-9.8628,390
2.8856,-9.8309,392
15.3962,-9.7796,393
-0.1186,-9.9038,394
3.2651,-9.7923,395
2.6104,-9.8173,396
-9.8674,-10.0976,397
-2.5943,-9.6535,398
2.0494,-9.7494,399
-1.3949,-10.0164,400
4.667,-9.8421,401
-3.7509,-9.5991,402
-0.7788,-10.0155,403
3.4898,-9.9821,404
7.137,-9.8482,405
9.9652,-9.9104,407
-0.0315,-9.7779,408
-0.1781,-9.7929,409
2.3965,-9.1312,410
0.4326,-9.7504,411
4.0711,-9.6731,412
2.4207,-9.8032,413
-2.4276,-9.7857,414
-5.4868,-9.7327,415
0.3911,-9.568,416
9.9343,-9.8391,417
0.1733,-9.9354,418
1.7691,-9.8731,419
1.1213,-9.8019,420
0.05,-9.7309,421
4.4218,-9.7131,422
1.0372,-9.7836,424
5.1585,-9.5737,425
0.2921,-9.8126,426
-0.574,-9.7675,427
0.3242,-10.3154,428
0.941,-9.791,429
3.8601,-9.7833,430
-0.7627,-9.7151,432
0.5727,-9.8113,433
9.1535,-9.8003,434
-0.5403,-9.8666,435
0.4764,-9.8486,436
2.9165,-9.7222,437
0.4151,-9.7309,438
4.7616,-8.994,439
-0.2308,-9.7453,440
7.4054,-9.4757,441
0.6013,-9.7409,442
-0.7068,-9.6625,443
5.0274,-9.9175,444
4.8005,-9.6989,445
2.3935,-9.8232,446
-0.8783,-9.7402,448
2.2308,-9.7602,449
1.8668,-9.8565,450
1.1226,-9.7604,451
2.732,-9.766,452
4.0018,-9.4338,453
-0.5162,-9.4378,454
-0.68,-8.4479,455
-0.3056,-9.8013,456
5.5658,-9.0016,457
-0.1655,-9.6885,458
-0.45,-8.9441,459
5.4567,-10.3349,460
11.4125,-8.0554,461
5.8324,-10.3784,462
2.2398,-9.0066,464
3.565,-10.0591,465
1.7611,-10.2963,466
2.9201,-10.1949,467
24.8891,-10.1082,468
2.7101,-9.8167,469
2.7829,-9.8249,470
2.2706,-9.3416,471
2.7949,-9.2489,472
3.3609,-9.6503,473
2.267,-9.6131,474
9.8327,-10.0571,475
2.2353,-9.9897,476
-0.5583,-10.3411,477
0.5311,-9.9835,478
0.958,-9.6501,479
4.4674,-9.5294,480
3.385,-9.674,481
0.1975,-10.1696,482
-1.1382,-9.7322,483
5.1546,-10.1129,484
2.8746,-9.6795,485
2.7958,-9.9239,486
1.8081,-9.424,487
6.955,-9.8305,488
-1.1014,-9.7649,489
4.1878,-9.6645,490
3.1843,-10.2107,491
6.7598,-9.8997,492
6.0109,-10.4907,493
1.9727,-9.9525,494
1.7612,-9.5829,495
0.7368,-9.7433,496
-1.2568,-9.5683,497
28.2819,-10.1787,498
20.477,-10.3088,499
4.4909,-9.9149,500
1.2534,-9.6767,501
16.5122,-9.9919,502
-11.6076,-7.3464,503
1.6977,-10.1365,504
1.2521,-9.7572,505
1.2111,-9.8505,507
0.527,-10.1543,508
5.4778,-9.7737,509
4.8045,-9.8698,510
5.6938,-9.9642,511
-0.7368,-10.2691,512
3.4356,-9.711,513
2.4543,-9.7881,514
6.2981,-10.2809,515
0.8178,-9.927,516
0.5371,-9.7855,517
-2.2565,-7.9599,518
-26.6439,-10.8602,519
2.2845,-9.5018,520
-1.1367,-9.7781,521
2.4665,-10.2003,522
-1.3085,-9.7532,524
1.1326,-9.9934,525
7.3872,-9.7442,526
4.4593,-10.3368,527
-2.2182,-9.7903,528
3.2552,-9.8865,529
-1.2449,-10.5857,530
5.2368,-9.7001,531
6.6252,-9.0346,532
-2.7553,-9.2502,533
9.4856,-9.4696,534
-1.5979,-9.8104,535
0.5042,-9.0691,536
2.7935,-9.5319,538
0.9387,-9.6057,539
16.243,-9.5428,540
-3.4024,-9.7284,541
14.884,-9.4674,542
8.2438,-9.2438,543
1.9992,-9.9028,544
7.2037,-9.1417,545
1.1344,-9.6309,546
27.6638,-10.4891,547
9.2187,-9.6018,548
2.4955,-9.9417,549
-0.6009,-9.8498,550
0.3168,-10.2397,551
-0.0439,-9.8402,552
5.3429,-9.8724,554
-0.0685,-9.5633,555
4.1386,-9.3611,556
8.8629,-10.4087,557
2.0094,-9.9441,558
2.1042,-9.5614,559
0.3739,-9.8325,560
3.9532,-9.8901,561
-0.3466,-10.1723,562
4.2337,-9.3309,563
6.478,-9.6481,564
-3.565,-9.8419,565
6.7989,-9.8169,566
2.1963,-9.9379,568
1.8289,-9.7374,569
0.918,-9.7053,570
-0.1644,-9.5775,571
0.1917,-9.9758,572
0.0288,-9.774,573
2.0984,-9.8195,574
3.0317,-10.1751,575
10.8805,-10.4375,576
23.9086,-9.7344,577
2.9256,-10.4392,578
2.4607,-9.846,579
15.6776,-9.5611,580
1.5981,-9.8722,581
6.617,-9.429,582
-0.7899,-9.7019,584
11.7501,-10.6315,585
5.7092,-9.9682,586
3.631,-9.599,587
4.8849,-9.6983,588
1.322,-9.797,589
0.5579,-9.1578,590
0.1026,-9.6886,592
3.5851,-10.0446,593
-1.4928,-10.2533,594
3.214,-10.1942,595
4.8459,-9.8776,596
0.6213,-9.1461,597
0.6913,-9.4966,598
2.2255,-9.5794,599
-1.9483,-9.7662,600
-2.0049,-9.9876,601
-0.8086,-9.7188,602
1.1879,-10.0252,603
-1.3979,-9.8457,604
19.0179,-10.3317,605
3.171,-9.6478,606
7.8062,-10.1626,607
14.5479,-10.0014,609
4.3196,-9.9154,610
5.6922,-10.0479,611
1.4807,-9.9458,612
7.8398,-9.8997,613
6.881,-9.881,614
5.608,-9.6606,615
0.6955,-9.5492,616
4.3697,-9.5464,617
0.6504,-9.8842,618
1.3914,-9.4877,619
-4.0381,-9.6427,620
4.3615,-9.6567,621
2.9213,-9.7679,622
4.0446,-9.7162,624
6.374,-9.911,625
-1.5768,-10.2515,626
1.0171,-9.7953,628
-0.5892,-9.8288,629
-0.3031,-9.748,630
0.8878,-9.6975,632
4.4335,-9.6809,633
12.9051,-9.6458,634
3.9503,-9.6871,635
30.7471,-10.0405,636
2.2468,-9.5041,637
-0.0915,-9.6314,638
1.0263,-10.0125,639
0.3057,-10.1725,640
-0.0434,-9.4228,641
0.3932,-9.7427,642
-1.6706,-9.9749,643
0.1259,-9.8566,644
-0.883,-10.249,645
0.2998,-9.8778,646
4.5236,-9.692,648
7.5872,-9.6721,649
-0.2453,-9.88,650
-1.0478,-9.7407,651
12.2581,-9.788,652
9.2808,-9.3956,653
3.5912,-10.0321,654
-0.7114,-9.7589,655
0.1456,-9.8467,656
2.4869,-9.9697,657
1.4539,-9.3851,658
22.6231,-9.585,659
0.1921,-9.7211,660
3.5117,-9.7954,661
-0.9011,-9.8567,662
-0.9759,-10.1476,663
0.2087,-9.7107,664
0.6425,-9.6217,665
2.3345,-9.544,666
4.4303,-10.4228,667
0.9657,-9.8764,668
0.0103,-9.626,669
0.9945,-9.5697,670
1.4786,-10.04,671
-1.5467,-9.4515,672
-0.3019,-10.1017,673
1.4684,-9.7121,674
-0.2815,-9.1855,675
-0.3274,-9.7752,676
0.5331,-10.1927,677
2.8883,-9.6614,679
2.9331,-9.8492,680
1.7998,-9.8021,681
1.8711,-9.887,682
8.6366,-9.826,683
0.254,-9.8447,684
13.6276,-9.6035,685
1.9816,-9.3925,686
3.3828,-9.6627,687
9.4897,-9.6734,688
3.9766,-9.3577,689
4.5523,-9.8042,690
-0.7612,-8.4606,691
2.3257,-9.9688,692
0.0626,-9.7859,693
5.8298,-9.6325,694
2.7431,-9.7429,695
2.9585,-9.9743,696
12.2929,-9.8903,697
3.3097,-9.6999,698
-1.8119,-10.1617,699
6.8928,-10.0137,700
0.9966,-9.7573,701
0.4886,-9.9135,702
0.0217,-9.8102,703
-0.9418,-9.8454,704
6.2139,-9.6481,705
-0.8036,-9.6445,706
-0.2498,-9.6012,707
-1.1987,-9.1122,708
3.2581,-9.7878,709
5.7496,-9.7683,710
2.7249,-9.5939,711
10.3681,-9.8406,713
0.3798,-9.7122,714
2.856,-9.9686,715
-1.8012,-9.8548,716
2.6152,-9.7632,717
0.0145,-9.4673,718
9.6682,-9.6658,719
7.3324,-9.6668,720
0.1146,-10.0886,722
0.3363,-9.7929,723
2.681,-9.7645,724
-0.7226,-9.9303,725
10.1579,-9.7252,727
0.7804,-9.9462,729
3.5318,-9.6921,730
2.8729,-9.7759,732
2.4613,-9.7028,733
1.3939,-9.6711,734
7.0213,-9.9376,735
-1.0638,-9.9577,736
0.583,-9.3849,737
22.5586,-9.6686,738
7.4468,-9.7616,739
3.6078,-9.5801,740
9.0918,-9.9987,743
-1.973,-9.9422,744
2.1954,-9.7844,745
19.8474,-7.4716,746
-0.5932,-9.6495,747
4.3452,-9.5876,748
12.0001,-9.9666,749
4.2066,-9.7491,750
-3.6419,-9.2977,751
22.8356,-10.2648,752
10.1172,-9.5909,753
6.1395,-9.4824,754
2.5235,-9.3832,755
1.3383,-10.2604,757
3.2329,-9.948,758
14.2715,-9.7297,759
1.5307,-9.6667,760
-1.5015,-9.7183,761
1.6872,-9.9566,762
-0.7537,-10.0148,763
-0.2188,-9.5294,764
-1.3756,-9.8543,765
33.8574,-10.6059,766
5.8511,-9.9347,767
4.7698,-9.7342,768
-0.9705,-9.4381,769
5.7731,-10.1336,770
9.5308,-9.7513,771
-1.5994,-9.7406,772
2.7443,-9.9932,774
21.6873,-9.7596,775
5.3601,-10.2339,776
-3.8291,-9.7175,777
2.4936,-9.7192,779
1.69,-10.073,780
0.2217,-9.8548,781
4.929,-9.7722,782
3.7621,-9.7045,783
3.8802,-9.7594,784
4.3877,-9.6317,785
0.5967,-9.9317,786
2.31,-9.7535,787
1.4939,-9.6155,788
2.049,-9.7277,789
6.5368,-9.7412,790
-1.2088,-8.6684,791
-0.0612,-9.8872,792
-1.7885,-8.9464,794
0.5153,-9.7917,795
3.549,-9.8312,796
2.1339,-9.411,797
0.4825,-9.6637,798
1.7191,-9.608,799
0.3232,-9.9419,800
-0.4439,-9.6212,801
13.3569,-9.5781,802
-2.9253,-9.7153,803
2.5301,-9.9659,804
12.5697,-9.6084,805
1.2411,-10.1377,806
0.6996,-9.7591,807
2.0985,-9.799,809
0.3413,-9.7324,810
2.678,-9.9281,811
-6.1118,-9.8172,812
25.234,-9.4652,813
13.2061,-9.7088,814
2.1866,-9.8745,815
0.4973,-9.9938,816
-0.1996,-10.2369,817
4.3998,-9.4273,818
-0.2195,-9.7271,819
9.3561,-10.0155,820
-0.8181,-9.7321,821
0.1755,-9.6631,822
1.477,-9.7152,824
14.0382,-10.4952,825
-1.7788,-9.8452,826
3.6122,-9.6473,827
1.0874,-9.1517,828
-1.6549,-9.7242,829
7.3368,-10.0084,830
5.3921,-9.787,831
-0.6253,-10.2114,832
6.4605,-9.8227,833
-0.2183,-10.2138,834
1.8625,-9.8297,835
27.3899,-10.0652,836
1.9068,-9.8333,839
17.7156,-9.5468,840
2.2729,-10.023,841
-0.211,-9.9815,842
4.8626,-9.7235,843
2.7863,-9.865,844
16.7372,-9.6537,845
2.5911,-9.7034,846
0.2418,-9.8071,848
2.7927,-9.9613,849
5.5854,-9.6309,850
7.2622,-9.7961,851
3.0415,-9.7394,852
3.3731,-9.9306,853
0.7525,-9.6926,854
-0.264,-9.7611,855
-0.0686,-9.299,856
0.1199,-10.0332,857
-1.9837,-9.9082,858
-3.6176,-9.7327,859
2.8681,-9.9157,860
3.4486,-9.9225,861
2.0113,-10.0987,862
0.0537,-9.7823,863
-1.073,-9.8812,864
11.2181,-9.6648,865
-3.2796,-9.8786,866
5.7397,-9.7372,867
2.4534,-9.7418,868
2.5798,-9.8268,869
0.5177,-9.769,870
2.3064,-9.7515,871
113.1268,-9.9404,872
1.0356,-9.8975,873
2.5699,-9.7762,874
1.1107,-9.787,875
1.247,-9.5865,876
-4.5828,-9.6669,877
20.2687,-10.3635,878
-0.8211,-9.7384,879
-0.3454,-9.6577,880
0.6252,-9.7752,881
0.869,-9.741,882
-0.4661,-9.5814,883
-0.3667,-9.6872,884
-0.4102,-9.6992,885
7.1321,-9.7732,886
0.9624,-9.8122,887
-1.7183,-9.7747,888
6.1026,-9.7356,889
-1.2619,-9.6993,890
-11.3894,-9.6262,892
-18.1975,-9.4769,893
24.085,-9.4973,894
-11.5282,-9.5617,895
-9.2553,-9.8822,897
-8.9447,-9.6039,898
15.1256,-9.4796,899
-5.0967,-9.5967,900
1.5263,-9.7834,901
14.0575,-9.4943,902
7.0939,-9.5404,903
-1.7964,-9.7095,904
-0.4439,-9.7495,905
-0.5784,-9.7584,906
-0.5977,-9.7723,907
0.3335,-9.8087,908
0.0029,-9.769,909
0.0559,-9.7699,910
