AYGX_mean,AZ_mean,timestamp
0.1285,-9.8625,17
0.1278,-9.862,18
0.1092,-9.8501,19
0.1147,-9.8751,20
0.1115,-9.8645,21
0.125,-9.8609,22
0.129,-9.8609,24
-3.2424,-9.8298,25
-28.9016,-9.6185,26
-37.7054,-8.6885,27
12.8325,-8.8588,28
-6.9924,-9.4242,29
-2.7942,-9.393,30
6.1747,-9.3086,31
3.8072,-9.1236,32
-12.2508,-9.1931,33
11.0257,-9.1466,34
20.1482,-9.538,35
6.9373,-9.7453,36
-3.0015,-9.7723,37
