AYGX_mean,AZ_mean,timestamp
-1.3574,-9.73,29
-1.1681,-9.7309,30
-2.2881,-9.7215,31
-7.2317,-9.7147,33
-13.6693,-9.5296,34
9.1196,-9.4694,35
-0.4482,-9.6949,36
-4.3159,-9.6508,37
4.6989,-9.733,38
32.4848,-9.8268,39
6.2275,-9.5725,40
5.441,-9.7293,41
1.3521,-9.7498,43
0.9175,-9.6991,44
3.1266,-9.6961,45
4.8731,-9.8901,46
3.7658,-9.8515,47
3.4926,-10.0794,48
-0.0016,-9.8574,49
