AYGX_mean,AZ_mean,timestamp
-0.4652,-9.795,67
-0.1965,-9.933,68
-0.3761,-9.8934,69
-4.2684,-10.1403,70
-1.8855,-10.1231,71
2.1406,-9.6943,73
-3.368,-10.2326,74
8.9231,-9.7485,75
34.9537,-9.5617,76
5.1935,-7.3906,77
1.3444,-9.6633,78
13.1239,-9.5481,79
34.5511,-9.9471,80
0.8047,-9.6211,81
4.5787,-9.7904,83
4.5584,-9.5835,84
4.3495,-9.7776,86
