AYGX_mean,AZ_mean,timestamp
0.0284,-9.8299,0
0.0279,-9.8295,1
0.0284,-9.8293,2
0.2322,-9.5975,3
-8.9934,-9.8756,4
-4.3639,-9.7184,5
2.1257,-9.5971,6
-7.7795,-9.7663,7
-4.6342,-9.1877,8
-13.2387,-9.7527,10
2.7376,-9.7474,11
-5.8288,-9.6912,12
0.7924,-9.8039,13
0.685,-9.8,14
-2.356,-9.8009,15
1.3059,-9.8368,16
-0.59,-9.8281,18
-0.9473,-9.7948,19
-10.718,-9.7448,20
-2.1916,-9.701,21
1.4445,-9.6295,22
6.3427,-9.7102,23
-3.6698,-9.8285,24
8.9895,-9.7318,25
-1.4049,-9.7798,26
0.0926,-9.7811,27
0.5793,-9.7776,29
-1.1649,-9.8203,30
-0.727,-9.8052,31
-1.7655,-9.7795,32
-0.1546,-9.7685,33
-0.1564,-9.7798,34
-0.9279,-9.7768,35
-0.2743,-9.7494,36
-9.7324,-9.6907,37
2.5213,-9.8004,38
-0.6684,-9.7764,39
1.7776,-9.8164,40
-3.4633,-9.7764,41
0.4463,-9.8129,42
-0.4107,-9.8033,43
0.2267,-9.8113,44
-0.2589,-9.8117,45
0.0717,-9.812,46
-0.2362,-9.8111,47
-0.0646,-9.8121,48
-0.1768,-9.8115,49
-0.1314,-9.8117,50
-0.2173,-9.8103,51
-0.1238,-9.8082,52
-0.3285,-9.8011,53
1.2161,-9.8198,54
0.0453,-9.8392,55
-3.6601,-9.8206,56
0.0539,-9.8325,58
0.0813,-9.8419,59
-0.6267,-9.8229,60
0.0135,-9.83,61
-0.0565,-9.8403,62
-0.1197,-9.8374,63
-0.0074,-9.8359,64
-0.0564,-9.8347,65
-0.1294,-9.8397,66
0.0006,-9.8348,68
-0.6192,-9.8385,69
0.1432,-9.8233,70
0.0301,-9.8421,71
-0.3706,-9.8315,72
0.1645,-9.8519,73
-1.572,-9.8273,74
-0.0445,-9.8234,75
-0.1878,-9.8264,76
0.0694,-9.8104,78
-0.7684,-9.8344,79
-0.3042,-9.8019,80
-2.0562,-9.7893,81
-1.8062,-9.7798,82
3.5979,-9.8421,83
-1.7584,-9.7673,84
0.8996,-9.7743,85
-1.3393,-9.6584,86
-3.3516,-9.7967,87
4.8072,-9.5543,88
2.7421,-9.7789,89
0.0307,-9.7992,90
0.1229,-9.8018,91
-0.4438,-9.812,92
-17.2392,-9.6474,93
12.3301,-9.6861,94
2.3278,-9.7192,95
-2.8116,-9.6705,96
0.8596,-9.8564,97
-1.6985,-9.8274,98
-6.6558,-9.8008,99
-7.485,-9.6203,100
0.35,-9.6003,101
2.5732,-9.6137,102
0.0855,-9.6663,103
-7.1042,-9.5939,104
12.7517,-9.5698,105
-2.2267,-9.6542,106
8.5172,-9.7229,107
1.8434,-9.6808,108
-1.0555,-9.7736,109
-8.0161,-9.6589,110
6.8462,-9.7655,111
-0.9197,-9.7897,112
-0.0692,-9.8151,113
-1.7085,-9.7858,114
-7.4193,-9.6797,115
0.03,-9.6754,116
-2.5684,-9.6502,117
6.6026,-9.7262,118
-2.8711,-9.7032,119
-3.0933,-9.8042,120
14.9814,-9.8177,121
-0.2241,-9.9313,122
1.3023,-10.0954,123
6.7425,-10.044,124
0.6081,-9.8452,125
5.7523,-9.625,126
-0.3969,-9.5572,127
2.505,-10.0958,129
-2.8218,-9.9776,130
1.832,-9.4911,131
-0.166,-10.0189,132
0.7288,-10.026,133
18.9326,-9.9057,134
8.7855,-10.2185,135
0.184,-9.7837,136
-1.9867,-9.776,137
1.5846,-9.8577,138
3.5084,-9.8918,139
1.4183,-9.6942,140
0.1565,-10.1272,141
0.036,-9.9339,142
2.2938,-10.0956,143
-0.4473,-9.5131,144
3.2588,-10.1841,145
5.1864,-9.7711,146
-0.9862,-9.7771,147
-0.5245,-9.7227,149
1.5973,-9.9755,150
0.0346,-9.6906,151
0.3888,-9.4631,152
0.4051,-8.8016,153
0.2218,-9.7981,154
-0.6291,-9.9957,155
8.5936,-9.9207,156
2.3002,-9.7061,157
0.9586,-9.9123,158
-0.0212,-10.0353,159
-0.075,-10.0985,160
0.7712,-9.9539,161
0.1871,-10.0264,162
0.4767,-9.9119,163
0.2577,-9.9327,164
1.291,-10.0828,165
0.0305,-9.9749,166
0.2265,-9.7157,167
0.6628,-9.9423,168
0.1304,-9.8946,169
-0.0562,-9.8103,170
3.2428,-9.9133,171
-2.5494,-9.8981,172
2.3433,-9.8082,173
0.5971,-9.8282,174
-0.4744,-9.8181,175
-3.4099,-9.8623,176
1.8456,-9.8066,177
-0.5769,-9.8161,178
-0.3751,-9.7964,179
0.3666,-9.8137,180
-0.2931,-9.8162,181
1.4747,-9.8138,182
1.23,-9.8058,183
-3.3634,-9.8801,184
-2.2029,-9.7691,185
-28.962,-9.6388,186
37.4249,-9.6512,187
18.5833,-9.8531,188
-0.5144,-10.0312,189
-0.8837,-10.3874,190
-4.5993,-9.7631,191
9.2028,-9.8876,192
0.9993,-9.9389,193
1.1123,-9.8952,194
-0.6167,-9.8534,195
-0.147,-9.8692,196
0.593,-9.938,197
-24.633,-9.6618,198
6.4156,-9.4759,199
6.1773,-9.4663,200
0.5748,-9.6772,201
2.4101,-9.6654,202
-1.0722,-9.5871,203
5.8691,-9.578,204
0.4816,-9.6509,205
-0.6903,-9.6569,206
-0.5452,-9.6486,208
-0.6503,-9.6446,209
-9.7021,-9.4971,213
4.1014,-9.1619,214
1.023,-9.2499,216
11.7625,-9.5408,217
15.8064,-9.4166,218
3.508,-9.7442,219
-18.6963,-9.7073,220
2.8909,-9.8903,221
1.8205,-10.033,223
0.0158,-9.8612,224
1.8917,-10.0489,225
7.769,-10.0003,226
0.3579,-9.964,227
-1.5388,-9.963,229
-2.3873,-9.271,230
2.8026,-9.7192,231
-1.463,-9.7273,233
-1.2156,-8.1471,234
2.2363,-10.4799,235
0.8414,-9.7978,236
-1.4816,-9.6478,237
-0.2005,-10.5959,238
-1.5243,-9.8596,239
4.2711,-9.6606,240
1.0017,-9.8258,241
0.371,-9.7787,242
0.0141,-9.7806,243
-0.1152,-9.6572,244
-0.7367,-9.8658,245
4.1273,-9.7785,246
2.6655,-10.1993,247
4.7134,-9.5491,248
10.7369,-9.258,249
0.803,-8.3532,250
-0.7167,-10.0683,251
0.5856,-9.8256,253
4.119,-9.9602,254
2.8139,-9.9214,255
-0.3071,-9.7885,256
-0.1941,-9.4053,257
0.5549,-9.8798,258
0.5055,-9.7123,259
0.8621,-9.9348,260
-0.5176,-10.0871,261
1.1811,-9.9121,263
0.0527,-9.9257,264
-0.2413,-9.7752,265
-0.127,-9.8138,266
-0.0666,-9.9397,267
-0.0524,-9.8366,268
-0.4587,-9.8098,269
4.1288,-9.9055,270
-0.0522,-10.0163,271
2.8252,-9.8593,273
0.5144,-9.7922,274
4.7941,-9.8263,275
1.5614,-9.6542,276
2.7318,-9.6196,277
2.1837,-9.8622,278
2.2504,-9.8738,279
-4.7,-9.8179,280
-1.3877,-9.7652,282
5.3814,-9.966,283
2.4208,-9.7071,284
1.639,-9.5307,285
-0.7344,-9.7874,286
0.7577,-9.9149,288
0.1082,-9.878,289
6.3188,-9.3151,290
-2.5637,-9.7064,291
16.0813,-10.483,292
2.7414,-9.7371,293
1.0667,-9.8313,294
2.6976,-9.8355,295
0.2246,-9.7759,296
1.0555,-10.1228,297
21.8592,-9.4569,299
-0.4356,-10.6672,300
7.4669,-8.7178,301
-1.205,-10.1357,302
0.6522,-9.679,303
2.4739,-9.1717,304
-0.44,-9.8636,305
2.0266,-8.9659,306
4.6095,-9.8596,307
6.7221,-10.081,309
0.5243,-10.3874,310
8.4664,-9.9642,311
0.0287,-9.9327,312
-0.08,-9.9526,313
0.3779,-9.949,314
0.607,-9.8276,315
2.2299,-9.4979,316
0.4193,-9.0428,317
0.4328,-9.9327,318
2.0739,-9.9519,319
0.3375,-9.3793,320
2.1148,-10.2157,321
-0.0251,-9.697,322
8.7095,-10.4962,323
0.1302,-9.4351,324
0.5938,-9.7216,325
0.322,-9.7545,326
-1.0165,-9.5863,327
0.6051,-9.8412,328
2.3213,-9.775,329
13.1075,-10.1114,330
0.2074,-9.644,331
-0.9489,-9.5901,332
0.086,-9.9459,333
1.234,-9.7935,334
2.2125,-9.86,336
1.1996,-10.5946,337
0.6468,-10.1203,338
1.2117,-9.7993,339
0.7006,-9.8577,340
1.1981,-9.8723,341
0.0979,-9.9584,342
1.1979,-10.0568,343
1.865,-9.8432,344
-0.0391,-10.1146,345
-0.1726,-10.0368,346
0.6487,-10.0041,347
-0.9565,-9.8036,348
-1.2662,-10.0178,349
1.5567,-9.6107,350
0.9771,-10.0094,351
2.1311,-10.0305,352
-0.4585,-9.7018,353
2.3616,-8.7788,354
1.3476,-9.9373,355
0.9924,-9.8386,356
-0.2107,-9.7742,358
1.3319,-9.8866,359
-0.4265,-9.7069,360
0.603,-9.8135,361
-1.2244,-10.0376,362
-0.0333,-9.7258,363
0.1126,-9.6661,364
0.9828,-9.8686,365
2.4155,-8.594,366
-0.0891,-9.3704,368
0.3748,-10.1102,369
5.2129,-9.9526,370
15.3602,-9.8384,372
-0.658,-10.0379,373
4.7761,-10.2824,374
2.4144,-9.7778,375
0.6512,-10.1001,376
-0.2494,-9.8465,378
0.8571,-9.697,379
0.8513,-9.8187,380
-0.063,-9.5436,381
3.4977,-9.6953,382
-0.3283,-10.0602,383
0.8933,-9.8363,384
2.1148,-10.129,385
10.4557,-10.1772,386
10.5912,-9.8505,388
7.5353,-9.6857,389
1.2245,-10.1348,390
-0.5556,-10.1078,391
-0.166,-9.4511,392
0.1412,-10.0635,393
-0.1377,-9.7922,394
2.0871,-9.7446,395
3.3459,-10.1037,396
1.4661,-9.7967,398
1.5114,-9.8443,399
3.0008,-9.8789,400
-1.0106,-9.7887,401
-0.8592,-9.8889,402
1.8298,-9.5561,403
0.1873,-9.8933,404
-1.0669,-9.8525,405
0.5575,-10.1141,406
0.9202,-9.8391,408
-0.0552,-10.0831,409
-0.2658,-9.9592,410
-0.7061,-9.8321,411
-0.6429,-10.1117,412
2.2432,-9.6067,413
1.6989,-9.9693,414
5.0152,-10.0476,415
-0.9077,-9.896,416
1.951,-9.8334,418
0.3281,-9.8514,419
3.125,-8.8462,420
0.1565,-9.9572,421
-0.3991,-10.0277,422
0.9906,-10.1001,423
0.4258,-9.555,424
-0.4607,-9.9495,425
-0.3641,-9.5511,426
-0.5453,-9.8784,428
0.5983,-9.8038,429
0.1925,-10.1008,430
0.069,-9.9637,431
-0.091,-9.8101,432
1.8794,-9.7553,433
-0.5935,-9.7125,434
0.2266,-8.7644,435
2.3696,-9.8688,436
1.2724,-9.8277,438
3.8888,-9.9176,439
0.0943,-9.83,440
0.0423,-9.8046,441
-0.175,-9.9055,442
3.6314,-9.7934,443
-0.2631,-9.9254,444
-0.6482,-9.7929,445
2.225,-9.7472,446
1.7201,-10.006,448
1.687,-10.3553,449
-0.4465,-9.2258,450
3.2454,-10.05,451
12.5223,-9.7655,452
1.7757,-9.9409,453
2.3085,-10.5098,454
-1.7806,-9.3494,455
-0.974,-9.9263,456
0.3733,-9.8583,458
1.301,-9.851,459
1.5647,-9.9331,460
20.3587,-10.0325,461
-4.3689,-9.8186,462
0.9169,-9.8075,464
0.5229,-9.8212,465
-0.6071,-9.8228,466
0.5963,-9.816,467
0.6146,-9.8127,468
-0.5458,-9.802,469
7.454,-9.4376,470
1.1574,-9.8747,471
4.44,-9.8564,473
0.4251,-9.8603,474
-0.4721,-9.6807,475
1.2053,-9.8348,476
-0.2913,-9.5881,477
1.2208,-10.1091,478
0.3677,-9.8843,479
0.0134,-9.7996,480
0.8156,-9.8515,481
1.9124,-9.8594,482
0.8824,-9.8407,483
3.3135,-9.8737,484
7.3078,-9.8427,485
1.9193,-9.8707,486
2.2556,-9.6968,487
0.6335,-9.9293,488
1.1098,-9.9402,490
-0.2327,-9.7345,491
0.3108,-9.7523,492
1.3344,-9.9165,493
-2.2189,-9.886,494
-0.7893,-9.8547,495
1.1996,-9.8766,496
1.8164,-9.1874,497
0.3204,-9.7829,498
1.2783,-9.8247,499
0.1031,-9.9126,500
-0.3746,-9.8843,501
1.1349,-9.8978,503
0.7406,-9.866,504
-0.0512,-9.7994,505
0.1659,-9.952,506
2.0391,-9.887,507
-0.3087,-10.1245,508
0.3834,-9.7716,509
0.1505,-10.0417,510
-0.1472,-9.684,511
-0.0012,-9.6763,512
0.8387,-9.7672,513
-0.2177,-9.7308,514
-0.3717,-10.1392,515
0.8104,-10.1,516
-0.3139,-9.5723,517
1.9219,-9.0837,518
-0.2554,-8.5814,519
-0.0104,-9.9177,520
0.5408,-9.8009,521
-0.0086,-9.7867,522
0.1634,-9.8426,524
3.7132,-10.1262,525
-0.215,-9.9912,526
-0.5302,-9.762,527
1.6196,-9.8582,528
-0.1471,-9.8867,529
2.0399,-9.6591,530
0.2102,-9.9494,531
5.9196,-9.7461,532
-0.0502,-9.8868,533
-0.0226,-9.8754,534
-0.3968,-10.0531,535
0.4458,-9.4617,536
0.2778,-9.9391,537
0.8197,-9.9116,538
-0.2569,-9.9422,539
0.0538,-9.9343,540
0.2934,-9.6849,541
0.0054,-9.8687,543
0.1639,-9.829,544
-0.1263,-9.7974,545
0.484,-9.6525,546
5.6122,-9.7438,547
0.9327,-9.8464,548
-0.23,-9.2802,549
-0.9997,-9.7329,550
-0.148,-10.1703,551
-0.3223,-9.8248,553
3.5711,-10.0326,554
0.4235,-9.9689,555
8.7669,-9.746,556
3.4872,-10.1345,557
0.6039,-9.7437,558
0.0547,-9.6818,559
2.7725,-9.874,560
-0.2159,-10.3866,561
1.5132,-9.6955,563
0.6191,-9.9307,564
-0.4957,-9.9974,565
-1.4239,-9.8203,566
-0.1011,-9.8929,567
1.1843,-9.5659,568
0.9301,-9.8143,569
-0.1657,-9.7244,570
0.8438,-9.9299,571
1.9561,-9.8312,573
3.0317,-9.5123,574
1.8065,-9.5225,575
0.9731,-9.5771,576
0.0464,-10.0247,577
-0.2303,-9.9076,578
2.5304,-9.8773,579
4.9088,-9.8668,580
-1.6611,-9.8944,581
1.7733,-9.8832,583
1.5269,-9.8471,584
0.9485,-9.9678,585
-0.3837,-9.6156,586
-0.221,-9.7068,587
0.9944,-9.5466,589
0.8571,-9.7989,590
-0.0739,-10.0531,591
4.1466,-9.8829,593
1.385,-9.7756,594
-0.3115,-9.8149,595
2.4835,-9.8163,596
-0.1308,-9.6862,597
1.1547,-9.8832,598
-0.1637,-9.8911,599
2.0556,-9.8387,600
-0.1095,-10.1137,601
-0.0375,-9.8438,603
0.3337,-9.928,604
0.6646,-9.752,605
3.1386,-10.0707,606
1.9754,-9.1018,607
-0.1098,-9.7932,608
1.8982,-9.8264,610
0.0767,-9.9084,611
0.1589,-9.7027,613
-0.0348,-9.9639,614
-0.0669,-9.7688,615
-0.0106,-9.9454,616
-0.0121,-9.8701,617
4.1383,-9.7406,618
0.1575,-9.8023,619
0.21,-10.1079,620
0.3531,-9.9606,621
0.1575,-9.7804,623
-1.0829,-9.8534,624
-1.6246,-9.8089,625
2.4463,-9.811,626
-1.9471,-9.8242,627
1.6011,-9.8313,628
0.0295,-9.849,629
-0.1159,-9.8444,630
-0.077,-9.8449,631
-0.099,-9.8487,633
-0.2173,-9.8435,634
-0.3935,-9.8431,635
-0.5283,-9.8432,636
0.9989,-9.8184,637
-1.2109,-9.8139,638
-0.4221,-9.8452,639
0.0012,-9.8368,640
0.3906,-9.8621,641
-0.5056,-9.9142,643
-0.1507,-9.842,644
0.4134,-9.8318,645
-1.9972,-9.8067,646
0.0323,-9.8452,647
2.134,-9.8555,648
0.0036,-9.8361,649
0.7927,-9.8536,650
2.1938,-9.9208,651
-0.0973,-9.8487,652
1.5363,-9.8302,653
0.241,-9.8303,654
2.5996,-10.0674,655
2.9464,-9.6074,656
1.8491,-9.997,657
0.3288,-9.878,658
5.0755,-9.9433,659
1.6405,-9.7883,660
-1.0094,-8.6223,661
2.2765,-9.7994,663
0.0137,-9.4842,664
2.1565,-9.782,665
0.489,-9.741,666
-0.7917,-9.7973,667
6.4095,-9.9117,668
9.2703,-9.6743,669
2.8615,-10.0071,670
0.6688,-9.8313,671
0.1817,-9.6928,672
2.5193,-9.9508,673
0.1235,-9.8824,674
1.0035,-9.7852,675
0.4901,-9.9362,676
0.1341,-9.7554,677
2.8675,-9.6924,678
-0.1888,-9.494,679
1.5698,-10.5263,680
0.5787,-9.7896,681
1.9101,-10.5422,682
2.5709,-9.8952,683
0.9709,-9.8027,684
2.6917,-9.7626,685
-0.187,-9.9143,686
1.9987,-9.7498,687
0.249,-9.7229,688
0.0136,-9.8048,689
0.2748,-9.6477,690
0.1004,-9.7901,691
3.7627,-9.7347,692
5.9509,-9.9563,693
1.0142,-9.6931,694
-0.2115,-10.0574,695
0.0126,-9.6375,696
-0.1774,-9.7195,697
0.1118,-9.886,698
1.0784,-10.0199,699
0.4075,-9.799,700
0.1781,-9.9108,701
0.9647,-9.9072,702
0.9135,-9.8436,703
0.4052,-9.8466,704
0.4506,-9.8946,705
0.3019,-10.4653,706
1.3201,-9.8477,707
0.2506,-9.821,709
0.9695,-9.8878,710
-0.1271,-9.863,711
0.0613,-9.8513,713
0.9028,-10.0848,714
3.9156,-9.8815,715
-1.2144,-9.8885,716
2.127,-9.6966,717
-0.371,-9.5143,718
-0.6003,-9.8735,719
2.0816,-9.9957,720
-1.5238,-9.9595,721
0.5476,-9.8887,723
-0.0253,-9.8579,724
-0.0693,-9.5903,725
-0.059,-9.9088,726
0.0959,-9.9673,727
0.0868,-10.0191,728
0.1569,-9.8188,729
-0.0953,-9.8656,730
-0.0327,-9.8747,731
1.0823,-9.8387,733
1.6278,-10.2135,734
-0.1062,-9.6988,735
5.5109,-9.844,736
-0.7551,-10.111,737
0.2848,-9.7211,738
-0.4795,-10.0109,739
4.1578,-9.7561,740
14.9849,-9.5443,741
0.5477,-9.8343,743
0.0383,-9.8796,744
1.2177,-9.7582,745
2.5694,-10.0198,746
1.6922,-9.9288,747
1.5644,-9.7073,748
0.1447,-9.9669,749
7.7981,-9.7277,750
-0.7397,-9.7191,751
3.7154,-9.8426,753
-0.2897,-9.9581,754
3.0084,-9.377,755
-0.4552,-9.5373,756
1.335,-9.9096,757
0.2715,-9.9363,758
3.1981,-9.735,759
0.7022,-9.8622,760
1.2473,-9.9929,761
6.0576,-9.8139,763
-1.6307,-9.961,764
-1.9267,-9.9357,765
0.0109,-9.6448,766
5.4586,-9.5748,767
0.6421,-9.8076,768
0.5865,-9.8783,769
4.8188,-9.9289,770
0.8324,-9.8879,771
-0.1753,-9.858,773
0.624,-9.8555,774
0.3053,-10.1363,775
2.3368,-9.9716,776
1.631,-9.8479,777
1.0848,-10.0823,778
-0.0432,-9.7857,779
1.0959,-9.8381,780
0.9812,-10.0234,781
0.151,-9.7065,783
1.4439,-9.9162,784
2.2467,-9.9641,785
-0.0713,-9.8285,786
2.6907,-9.455,787
-0.2182,-9.8057,788
0.5709,-9.7779,789
1.1863,-9.843,790
0.2695,-9.8945,791
0.6883,-9.9311,793
-1.4016,-10.094,794
-0.0998,-9.8816,795
0.5308,-9.8928,796
1.0697,-9.9285,797
-0.1898,-9.9622,798
0.3685,-9.8014,799
1.4381,-9.7065,800
-0.6443,-9.8018,801
0.214,-9.7768,803
0.6579,-9.9559,804
-0.4112,-9.8667,805
-0.2355,-9.8028,806
8.8688,-9.8613,807
0.927,-10.1273,808
2.2667,-9.7303,809
3.124,-10.1172,810
0.1539,-9.9582,811
2.0078,-9.878,813
2.9478,-9.9178,814
1.0651,-9.8696,815
2.3736,-9.7095,816
-0.1688,-9.867,817
2.0864,-9.37,818
-0.0812,-9.7411,819
-0.2515,-9.8143,820
0.1803,-9.7245,821
5.1893,-9.9922,822
0.4996,-9.913,823
0.0168,-9.583,824
-0.1475,-10.2812,825
-0.0032,-9.9218,826
0.1989,-9.7928,827
-0.0492,-9.8657,828
1.8296,-10.0238,829
0.8365,-9.8141,830
1.052,-10.0033,831
0.1185,-10.0869,832
0.4653,-9.8511,833
0.1354,-9.8783,834
3.5579,-9.8663,835
3.1772,-9.8282,836
4.376,-9.3884,837
4.2119,-9.7588,838
0.9442,-9.8341,839
1.9511,-9.8896,840
0.3787,-9.8353,841
0.3773,-9.8567,842
5.8019,-9.8537,843
2.6743,-9.8162,844
-0.4146,-10.0164,845
-1.1087,-9.5224,846
-9.9234,-9.7024,847
3.0664,-9.7199,848
-0.6081,-9.724,849
-1.6836,-9.7222,850
-0.533,-9.7154,851
-0.6538,-9.7136,852
-0.294,-9.7087,853
-0.401,-9.7103,854
-0.3326,-9.708,855
0.2131,-9.7182,856
2.2465,-9.7366,857
13.142,-9.6673,859
-15.8927,-9.6677,860
36.6683,-9.4167,861
0.2239,-9.8822,862
-2.5009,-9.8327,863
-2.3745,-9.7294,864
-10.0334,-9.5999,865
-57.5358,-9.2307,866
20.6354,-9.5657,868
-3.0611,-9.7352,869
-1.4689,-9.6405,870
-0.0315,-9.6142,871
-0.7761,-9.6363,872
2.185,-9.6594,873
11.9579,-9.5549,874
-1.3911,-9.6937,875
15.0454,-9.6399,876
-2.1718,-9.6584,878
-1.4921,-9.6661,879
-1.7292,-9.6593,880
-1.3646,-9.641,881
-0.6394,-9.6445,882
0.2384,-9.6435,883
2.0042,-9.6351,884
1.3878,-9.6415,885
-0.3196,-9.6527,886
-0.6928,-9.6799,888
-1.1142,-9.678,889
0.2247,-9.6745,890
0.3743,-9.6879,891
3.3319,-9.7315,892
-2.4173,-9.6626,893
0.3891,-9.6869,894
1.9804,-9.6991,895
-1.6633,-9.7356,896
0.11,-9.8007,898
-0.0131,-9.807,899
-0.0687,-9.8158,900
-0.1922,-9.8242,901
-0.1939,-9.8156,902
-4.5019,-9.7821,903
-2.2465,-9.6176,904
0.8604,-9.6768,905
-9.8601,-9.6361,906
2.8724,-9.7657,908
-0.4693,-9.8523,909
-26.9688,-9.6021,910
2.7226,-9.6197,911
7.9744,-9.5979,912
-0.9087,-9.7565,913
-0.1277,-9.7623,914
-0.051,-9.7659,915
1.5787,-9.7521,916
-1.7422,-9.7455,917
-14.6089,-9.6738,918
-7.279,-9.6424,919
8.5795,-9.7844,921
9.3389,-9.7292,922
0.6247,-10.1096,923
-1.0438,-9.9098,924
8.9442,-9.8237,925
14.4841,-9.894,926
1.6109,-9.7906,928
1.4705,-9.8957,929
3.1806,-9.8466,930
-0.0216,-9.7912,931
0.6777,-9.7275,932
1.3142,-9.8767,933
1.4607,-9.8836,934
1.4342,-9.6769,935
-0.1528,-9.851,936
1.5868,-9.7421,937
1.2444,-9.8955,938
2.3995,-9.8745,939
0.2256,-9.8362,940
2.0239,-9.7903,941
0.0169,-9.773,942
0.0646,-10.0687,943
0.7362,-10.0167,944
0.0012,-9.315,945
0.1015,-10.5319,946
1.6575,-9.7914,948
1.9774,-9.9124,949
1.3822,-9.7607,950
-0.4041,-9.6503,951
0.3617,-9.8211,952
1.0444,-9.9174,953
2.2562,-9.8254,954
0.3366,-9.8375,955
-0.2181,-9.927,956
0.488,-9.6339,958
1.5691,-9.6575,959
-0.1747,-10.8361,960
-0.7054,-10.1572,961
0.541,-9.6208,962
0.2567,-9.9919,963
0.4732,-9.9943,964
1.1251,-9.8482,965
0.127,-9.8678,966
0.1467,-9.7758,967
0.5022,-9.9646,968
1.2429,-9.8599,969
0.4787,-9.8711,970
0.3998,-9.6408,971
2.717,-9.9773,972
-1.203,-9.7361,973
1.4468,-9.6866,974
-0.7454,-9.8099,975
1.7941,-9.9183,976
-0.1052,-9.7155,977
0.7443,-9.8442,978
4.1537,-9.9135,979
6.6089,-9.6517,980
0.2156,-9.9302,981
-0.5371,-9.9617,982
0.2687,-10.3732,983
0.0836,-9.8591,984
-1.2621,-9.6464,985
4.3806,-9.8449,986
-0.2165,-10.108,987
4.7043,-9.7648,988
4.4315,-9.716,989
1.0421,-9.8585,990
-0.6671,-10.0967,991
4.4617,-9.8984,992
0.4188,-10.0732,993
7.6255,-9.726,994
2.1482,-9.8855,995
2.781,-9.6104,996
1.9172,-9.8006,998
1.0847,-9.8478,999
3.2369,-9.8373,1000
9.3274,-9.9674,1001
-0.1084,-9.9698,1002
2.3752,-9.7698,1003
-0.3337,-9.6094,1004
1.7529,-10.013,1005
4.3773,-9.625,1006
0.3931,-9.5106,1008
0.0353,-9.918,1009
0.1059,-9.9795,1010
1.2135,-9.0534,1011
0.8248,-9.982,1012
-1.3683,-9.8186,1013
5.6214,-9.8918,1014
-0.279,-9.6395,1015
1.3843,-9.8643,1016
1.7099,-10.3164,1017
0.5562,-9.7888,1018
-0.6974,-9.3968,1019
0.567,-9.5116,1020
-0.3258,-9.8653,1021
3.3659,-9.8097,1022
0.0611,-9.6866,1023
4.4226,-9.7438,1024
0.5925,-10.0595,1025
0.5877,-9.8742,1026
-0.1137,-9.8607,1028
4.0784,-9.8382,1029
-0.5411,-9.8473,1030
0.0804,-10.0633,1031
-0.2799,-10.0483,1032
-1.7138,-10.0088,1033
5.2734,-9.6132,1034
-0.2662,-10.0438,1035
-2.8714,-9.4108,1036
-0.3018,-9.8083,1038
0.7917,-9.8726,1039
0.0902,-9.933,1040
1.874,-9.6945,1041
1.5271,-9.9078,1042
1.3673,-9.8578,1043
1.3694,-9.8808,1044
-1.0253,-9.7293,1045
-0.7246,-10.226,1046
0.6995,-9.7524,1048
-0.1931,-9.9099,1049
2.2272,-9.8729,1050
0.2519,-9.7768,1051
-2.0733,-9.5662,1052
1.4063,-9.4982,1053
1.0876,-10.0647,1054
1.4859,-9.9662,1055
1.2241,-9.7275,1056
0.4082,-9.8702,1058
-0.5694,-9.8842,1059
0.1338,-9.8512,1060
0.1422,-10.2416,1061
-0.8912,-9.801,1062
1.1062,-9.9096,1063
0.1648,-9.8819,1064
0.5862,-9.7769,1065
-0.4617,-9.5953,1066
0.4148,-9.9429,1068
1.7749,-9.8537,1069
0.2768,-9.8801,1070
1.4483,-9.8755,1071
0.044,-9.9537,1072
1.948,-9.7671,1073
2.7451,-9.943,1074
-0.094,-9.8886,1075
-0.7489,-10.0146,1076
0.4622,-9.7794,1078
-2.1593,-10.0348,1079
-2.8285,-9.9444,1080
-1.137,-9.4682,1081
-2.4059,-9.7414,1082
1.2678,-9.9206,1083
2.276,-9.8428,1084
0.4445,-9.9188,1085
-4.998,-9.8867,1086
-0.3519,-9.8548,1088
-0.0039,-9.8673,1089
2.3945,-9.9421,1090
8.134,-10.4764,1091
4.602,-10.1928,1092
0.4083,-10.1833,1093
1.6286,-9.8525,1094
-0.9067,-9.7128,1095
0.5687,-10.1561,1096
0.0549,-9.8492,1099
4.1323,-10.2979,1100
1.6914,-9.6754,1101
1.1394,-10.6017,1102
-0.0027,-9.7585,1103
0.0069,-9.8124,1104
0.8298,-9.9027,1105
0.0814,-9.5376,1106
3.0765,-9.8304,1108
0.5766,-9.8782,1109
0.9872,-9.7513,1110
0.4367,-10.0507,1111
-0.468,-9.9153,1112
1.9619,-9.8289,1113
3.6458,-10.0201,1114
-0.1385,-9.8334,1115
0.1873,-9.8668,1116
0.8672,-9.7582,1118
-1.0652,-10.2533,1119
0.4198,-10.0541,1120
0.9493,-9.873,1121
-1.2185,-9.8455,1122
0.7555,-9.7372,1123
-1.6499,-9.7609,1124
0.3694,-9.9126,1125
0.2774,-9.4258,1126
1.8747,-9.8917,1128
1.4524,-9.8754,1129
0.6399,-9.8284,1130
-2.555,-9.6247,1131
-0.4538,-9.4501,1132
0.4029,-9.6612,1133
-0.4056,-10.0269,1134
2.4697,-9.9554,1135
-0.0003,-9.6233,1136
1.9418,-10.0099,1138
1.8038,-9.6882,1139
-0.0194,-9.9095,1140
1.4482,-10.0788,1141
-0.2905,-9.9514,1142
-0.0308,-9.5601,1143
-0.4202,-9.764,1144
1.6321,-9.893,1145
-0.4006,-9.7657,1146
-0.0934,-9.6811,1148
2.2446,-9.9178,1149
1.2443,-11.4469,1150
-0.4699,-10.0897,1151
-1.5607,-10.0545,1152
-0.5724,-9.9358,1153
1.6521,-8.8145,1154
0.0478,-9.8782,1155
0.8582,-9.8632,1156
0.0379,-9.8187,1158
2.1001,-9.9872,1159
0.1514,-9.8709,1160
0.7093,-9.5389,1161
0.1917,-9.8912,1162
-0.0316,-9.889,1163
0.826,-9.6874,1164
0.1083,-9.8376,1165
-0.5226,-9.8496,1166
3.4999,-9.771,1168
-0.4196,-9.5139,1169
-1.0011,-10.0275,1170
0.4607,-9.6304,1171
-0.0942,-9.7787,1172
1.9498,-9.9002,1173
2.0326,-9.8093,1174
0.1006,-9.912,1175
0.6846,-9.9378,1176
-0.1525,-9.6946,1178
1.2469,-9.8899,1179
3.9732,-9.7938,1180
3.4799,-9.9908,1181
1.0378,-9.7984,1182
1.6263,-9.8057,1183
4.839,-9.9931,1184
0.46,-9.8671,1185
0.2198,-9.9576,1186
0.8638,-9.9106,1188
6.9447,-9.9198,1189
0.959,-9.6705,1190
3.8999,-9.2561,1191
-0.0387,-9.8054,1192
1.7598,-9.7687,1193
-0.2661,-8.9063,1194
6.3269,-10.0517,1195
-1.5223,-10.7361,1196
7.3117,-9.4732,1198
7.079,-9.7931,1199
-0.7854,-9.9468,1200
-0.0137,-9.7412,1201
-23.6666,-9.1251,1202
-0.9734,-9.881,1203
0.0967,-9.853,1204
-0.5757,-9.8512,1205
-1.484,-9.8291,1206
-1.1474,-9.8475,1208
0.0588,-9.8502,1209
