AYGX_mean,AZ_mean,timestamp
-11.0996,-9.799,16
-40.1257,-9.5988,17
17.6417,-9.7019,18
4.2204,-9.8201,20
0.816,-9.8226,21
5.798,-9.9222,22
-2.4417,-9.6205,24
3.3372,-9.8765,25
48.4271,-10.1011,26
-0.0333,-9.8892,27
0.6573,-9.6239,28
-0.2337,-9.8718,30
-0.0145,-9.7502,32
-0.0684,-9.923,33
0.3219,-9.8834,34
3.2368,-9.8752,35
5.1509,-7.0479,36
