AYGX_mean,AZ_mean,timestamp
-4.3616,-11.2197,1302
3.453,-10.2241,1303
-0.5463,-9.7295,1304
9.7323,-10.3086,1305
-0.6694,-9.9245,1306
0.1692,-9.763,1307
0.2608,-9.877,1308
0.6553,-9.8846,1309
-0.1237,-9.9644,1310
0.3648,-9.8164,1311
0.7452,-9.6839,1312
0.7375,-9.9901,1313
-0.9339,-9.8796,1314
-20.0089,-9.7558,1316
-20.0802,-9.7255,1317
3.2958,-9.7992,1318
-0.4099,-9.8953,1319
-40.8722,-9.5485,1321
