AYGX_mean,AZ_mean,timestamp
-16.6172,-9.8497,5
2.2711,-9.9299,6
1.467,-9.8693,7
-1.6851,-9.8504,8
0.2415,-9.8551,14
5.3078,-9.9514,22
0.9932,-9.7847,23
-3.3471,-9.7114,24
-9.3586,-10.1561,27
5.2919,-9.8157,28
-1.8724,-9.8351,29
-9.5733,-9.7478,30
8.2861,-9.7603,32
-0.33,-9.85,33
-1.7945,-8.9916,35
0.0079,-9.8095,93
2.6105,-9.603,100
4.0895,-10.2304,104
0.6728,-8.7273,105
-1.6351,-10.4949,107
-2.0609,-10.573,115
-0.6004,-9.8787,118
-1.3276,-9.9118,121
0.6779,-8.8069,122
-0.6462,-9.8677,123
0.1984,-9.9394,124
-1.3007,-9.7591,126
0.7518,-9.8213,133
0.1595,-9.8441,137
-0.6438,-9.3107,138
-0.3579,-9.9279,139
0.7753,-10.0234,140
-0.8181,-9.8863,141
-1.7904,-9.6394,142
0.0154,-9.6792,143
12.1097,-9.6601,144
-0.4484,-9.5348,145
-3.1477,-8.554,146
-0.2625,-9.1724,147
2.3566,-8.9978,148
1.0706,-9.4991,149
-0.649,-7.457,150
4.0523,-9.5341,151
-3.951,-9.5347,153
-0.5972,-9.6617,154
-0.84,-9.9893,155
-0.5909,-8.4979,157
-0.5759,-9.6097,158
0.3889,-8.8755,159
-1.7811,-9.9802,160
0.7246,-9.6503,161
-0.7142,-9.687,162
-0.8301,-9.8642,163
-1.5954,-9.8093,164
0.1961,-9.9297,165
0.6107,-9.8747,166
-1.1873,-9.8232,167
1.1472,-9.9005,168
-0.7695,-9.8881,169
2.7543,-9.9183,170
-0.6895,-9.8125,171
0.2746,-9.6497,172
-0.2277,-9.7857,173
0.537,-9.9422,174
-0.8196,-9.6613,176
11.8209,-8.6324,177
2.5808,-9.9318,178
1.1507,-9.8831,180
-0.1726,-9.4149,182
-0.1823,-9.8304,183
1.6908,-10.4544,184
-0.3056,-10.0516,185
2.6117,-9.5985,187
0.6467,-10.0644,188
0.1123,-9.7215,189
2.5496,-9.9334,190
-0.937,-10.071,192
-0.6151,-9.9042,193
1.8596,-9.887,195
-0.511,-9.9923,197
3.6734,-9.7918,198
-2.4062,-10.0246,199
-0.543,-9.9026,200
-1.0124,-9.8771,202
-0.0719,-9.8671,203
2.1268,-10.0534,204
-0.4779,-9.9283,205
0.5892,-9.8812,207
0.1142,-9.9665,208
0.0605,-9.8918,209
-0.0202,-9.9516,210
0.316,-9.9229,212
-0.0127,-9.9098,213
0.2948,-9.8229,214
0.7194,-9.8844,215
0.8961,-10.062,216
0.2847,-9.708,217
14.644,-9.8802,218
0.4196,-10.0155,219
-0.7074,-9.8329,220
0.3883,-9.943,222
0.2833,-9.9483,223
1.4625,-9.9722,224
-0.4004,-9.8728,225
0.1304,-10.3853,227
-0.1399,-10.0555,228
-0.0847,-9.9203,229
0.222,-9.6315,230
2.0924,-9.9308,232
-0.478,-9.9033,233
-0.4381,-9.8925,234
0.7593,-9.8212,235
-0.0158,-9.7309,237
0.4696,-9.7671,238
-2.8873,-8.0006,239
-1.6531,-10.0548,240
-0.1511,-9.8621,242
-0.8444,-9.9249,243
0.1116,-9.8542,244
0.4398,-9.8946,245
-0.1847,-9.8497,247
0.5923,-9.9341,248
1.8607,-9.7746,249
-0.3123,-9.9062,250
0.4019,-10.0138,252
-0.1037,-9.857,253
1.0836,-9.8244,254
0.1504,-9.9428,255
0.2794,-9.8278,257
0.1687,-9.7101,258
1.1061,-9.9597,259
0.6673,-9.6973,260
0.1365,-10.2761,262
0.3695,-9.8819,263
-0.1109,-10.0412,264
0.9713,-9.5753,265
2.8216,-10.2773,267
-0.6778,-9.7865,268
11.7098,-10.2227,269
0.039,-9.8485,270
0.5071,-9.5262,272
1.3792,-9.9258,273
1.0656,-9.8527,274
1.3957,-10.1034,275
-12.7724,-7.8506,277
-1.0761,-9.814,278
1.5851,-9.9047,279
-0.0233,-9.9712,280
-0.6596,-9.3039,281
0.7108,-9.7402,283
-0.2159,-9.4992,284
0.3873,-9.946,285
0.7896,-9.9066,287
-0.4693,-9.9019,288
1.1463,-10.0772,289
0.8781,-10.4089,290
1.1167,-10.3263,292
1.8714,-9.9019,293
0.6247,-9.8184,294
-0.1132,-10.0674,295
0.1346,-9.8763,296
-0.0482,-9.936,298
1.7425,-9.5102,299
2.3262,-9.784,300
1.7136,-9.5108,301
0.5346,-10.0113,303
1.0592,-9.8471,304
0.7621,-10.063,305
7.863,-10.1554,306
1.0488,-9.8538,307
0.1841,-10.1301,308
-1.1565,-10.0334,309
-0.1421,-10.2905,310
-0.2714,-9.8644,312
3.8677,-9.9363,313
1.7284,-10.3639,314
0.2892,-10.075,315
-1.2023,-10.0443,316
-1.4295,-9.8529,317
0.3822,-9.9508,318
-0.7105,-9.8157,319
-1.2876,-10.2199,320
-0.4146,-9.6526,321
-0.6434,-9.8057,322
0.6277,-9.9432,323
0.6931,-9.6637,324
-0.0173,-9.8351,325
1.5264,-9.8469,326
0.0138,-9.8386,327
0.2011,-10.1981,328
0.306,-10.024,329
0.1106,-9.1455,331
0.0702,-9.4672,332
-0.3138,-9.622,333
-0.3999,-9.8178,334
-0.6996,-9.9361,335
0.244,-9.8655,337
0.2695,-9.8575,338
-0.0706,-9.703,339
0.3708,-9.6658,340
-0.3521,-9.9558,342
-0.4201,-9.9344,343
1.9231,-9.9288,344
1.6755,-9.1735,345
4.7161,-9.8963,347
0.7265,-9.9595,348
0.0286,-9.3015,349
0.3424,-9.8835,350
-1.5379,-9.6983,352
-0.2561,-9.8296,353
-1.7769,-10.0335,354
-0.7173,-9.9987,355
-0.1197,-9.7328,357
-0.0882,-9.9297,358
-1.6237,-9.8876,359
-1.1064,-9.8838,360
0.034,-9.9034,362
0.2055,-9.2119,363
-3.3503,-9.7308,364
9.5722,-9.9364,365
3.6413,-10.0824,367
-0.1745,-9.795,368
-0.2713,-9.7401,369
1.7188,-9.7154,370
3.5073,-10.2548,372
0.5595,-10.0699,373
1.0141,-9.7466,374
-0.437,-9.8591,375
2.7654,-9.573,377
1.9632,-9.8274,378
-0.1627,-9.7886,379
-0.1849,-9.9262,380
-0.111,-9.875,382
0.1238,-9.8921,383
0.3834,-9.8852,384
-0.3404,-9.8656,385
-0.1733,-9.8484,387
0.1812,-9.7912,388
0.3222,-9.8567,389
0.2021,-9.9183,390
-0.0158,-9.9087,392
0.6193,-9.9343,393
-2.1832,-9.2599,394
0.6253,-9.7935,395
-0.8388,-9.958,397
0.3605,-8.9298,398
-0.7028,-11.992,399
3.1556,-9.3075,400
2.611,-9.6599,401
-1.1632,-9.5699,403
-0.6135,-10.0808,404
-1.0902,-9.8137,405
0.7238,-9.506,407
1.1282,-9.7503,408
-0.0116,-10.0673,409
0.3977,-9.8794,410
5.9749,-10.0445,412
2.1246,-10.0573,413
5.2922,-9.8404,414
0.233,-9.8183,415
3.0468,-9.9122,417
0.7229,-10.0006,418
2.744,-9.8605,419
0.3963,-9.9135,420
0.4991,-9.9611,422
0.6982,-9.8985,423
-0.2777,-9.8267,424
1.7048,-9.7518,425
-1.8725,-10.0769,427
1.0659,-9.8724,428
1.7563,-10.0013,429
-1.4999,-10.0142,432
0.3737,-9.771,433
2.3178,-9.781,434
-0.3193,-9.5581,435
-0.6087,-9.9264,437
-1.197,-9.7845,438
2.0032,-9.9509,439
-0.0789,-9.7633,440
-1.6738,-10.0113,442
-0.5161,-9.9282,443
0.4569,-9.7588,444
1.2338,-9.8572,445
-0.3247,-9.9109,447
0.8425,-9.9183,448
-0.7817,-9.7166,449
0.0029,-9.8561,450
0.502,-10.2435,452
-0.5968,-9.8489,453
-0.4205,-9.906,454
1.4592,-9.9002,455
-0.7311,-9.8527,457
0.4322,-9.8461,458
-1.0478,-9.932,459
0.1559,-9.9506,460
0.4024,-9.9651,463
0.1447,-9.9615,464
2.0385,-9.663,465
3.0394,-10.1341,466
0.2431,-9.9601,468
-0.5811,-10.0836,469
1.1354,-9.9631,470
0.0437,-9.8569,472
0.3044,-9.9013,473
0.4285,-9.8584,474
1.4411,-10.1759,475
2.5103,-10.0346,476
0.4795,-9.988,477
-0.3245,-9.9511,478
0.1615,-9.913,479
-0.6809,-9.9332,480
0.1333,-10.3,482
0.63,-9.4602,483
0.3773,-9.8292,484
4.4634,-10.2846,485
2.7944,-10.057,486
-0.0109,-9.3043,487
1.2806,-10.0805,488
12.6974,-10.09,489
1.8245,-10.0295,490
-0.6652,-10.0021,491
-0.2705,-9.9915,492
-2.2594,-10.1593,493
-0.9938,-9.8934,494
-3.4507,-9.8169,495
1.667,-9.9545,496
-13.0427,-9.8448,497
7.517,-8.9406,498
-2.5951,-8.2233,499
-0.2955,-9.4215,501
2.5431,-10.0382,502
-0.8327,-9.8652,503
-0.6375,-9.6097,504
1.3898,-9.9884,505
-0.6058,-9.6494,507
1.5337,-9.9131,508
-0.3278,-9.8307,509
0.5125,-9.9187,510
1.6711,-9.6821,512
-0.0325,-9.767,513
-2.4042,-9.9134,514
11.0393,-9.7296,515
2.1343,-9.9617,517
-0.4261,-9.8412,518
-1.3611,-9.9656,519
-1.6825,-9.9012,520
1.0876,-9.9263,522
-0.7794,-9.7996,523
1.3823,-9.8888,524
-0.5344,-9.8429,525
-0.0576,-9.8596,528
-1.6857,-10.1205,529
-0.1256,-9.8908,530
0.824,-10.0151,532
0.5919,-9.8843,533
-0.9217,-9.8765,534
-0.9672,-9.7822,535
0.0227,-9.7661,537
-0.2246,-9.9121,538
-1.1761,-9.8947,539
-1.0185,-10.1098,540
2.2606,-9.7654,542
-0.833,-9.7291,543
-0.0087,-9.9726,544
-0.3325,-9.9177,545
0.6394,-9.8316,547
2.1612,-9.9875,548
2.6603,-9.4806,549
-0.8388,-9.885,550
-2.752,-9.8598,552
-0.4217,-9.7704,553
-0.6709,-10.1091,554
-0.0654,-9.895,555
3.7666,-9.9604,557
1.4601,-9.937,558
-0.1898,-10.0068,559
-0.2594,-9.8749,560
-0.5247,-9.7423,562
-0.0293,-9.9314,563
0.0663,-10.1064,564
-0.254,-9.9081,565
4.7203,-9.8856,567
0.1061,-9.8078,568
-0.146,-9.6993,569
-0.1995,-9.8685,570
-1.4064,-9.8066,572
-0.9276,-9.887,573
-1.1073,-9.9463,574
0.0506,-9.9808,575
1.3045,-9.8334,577
-1.2721,-9.9275,578
0.3747,-9.7957,579
0.4338,-9.988,580
-2.8573,-9.8565,581
0.7001,-10.0447,582
-1.1761,-9.9015,583
-0.7945,-9.9011,584
-0.7658,-9.9011,585
2.2732,-10.0141,587
-0.5676,-9.9376,588
-0.934,-9.8336,589
0.4355,-9.864,590
2.5829,-9.9495,592
-0.7943,-9.8536,593
-0.3368,-9.8828,594
-0.9616,-10.0176,595
0.52,-9.5202,597
0.2067,-9.8409,598
0.1021,-9.7754,599
-0.7508,-9.921,600
1.0959,-9.8526,602
-0.0932,-9.8693,603
1.0336,-9.8565,604
0.1665,-9.8099,605
-0.4464,-10.1077,607
-0.1765,-9.7828,608
1.5248,-9.938,609
-0.106,-9.8329,610
0.6677,-10.0084,612
0.7029,-9.9042,613
0.2513,-9.903,614
-0.2483,-9.8409,615
1.505,-9.8485,617
-0.5975,-9.5176,618
1.5529,-10.0664,619
-0.1353,-9.7772,620
0.3653,-8.4716,622
0.5115,-8.8418,623
-2.1793,-9.5314,624
2.0307,-9.9428,625
-0.4202,-9.8404,627
1.1817,-9.983,628
0.1755,-10.289,629
-0.4014,-10.0289,630
5.7564,-10.0297,631
2.0076,-9.8735,633
0.3378,-10.1301,635
0.7319,-10.1461,636
0.0243,-9.6929,637
0.253,-9.5582,638
0.2561,-10.2962,639
0.7805,-9.7121,640
0.5865,-9.778,641
0.4055,-9.9002,642
-0.1993,-9.5659,643
0.4079,-9.9377,644
-2.405,-10.3732,645
6.9811,-10.2879,646
0.7191,-9.9059,647
-0.9703,-9.9349,649
-0.2412,-9.6901,650
-0.6741,-9.4831,651
-0.9029,-9.8504,652
-0.3192,-9.9371,653
-0.458,-9.7737,654
-0.1777,-9.8198,655
1.2006,-10.186,656
0.0699,-10.0027,657
-0.4546,-8.7259,658
0.1702,-9.8618,659
0.676,-10.0026,660
-0.1159,-9.6476,661
0.4697,-9.8988,662
-0.5038,-9.9378,663
0.311,-10.2536,664
0.4135,-9.8542,666
0.5811,-10.0595,667
0.5049,-9.8802,668
1.4731,-9.6903,669
0.6348,-9.9065,670
0.6328,-9.9483,672
0.0676,-9.9277,673
4.0303,-9.5893,674
1.2192,-9.7799,675
-1.8068,-10.1781,677
2.1254,-9.9579,678
-5.7995,-8.1945,679
4.6461,-9.5959,680
-1.792,-10.0582,682
-0.0944,-9.8881,683
1.018,-10.2265,684
0.088,-9.8806,685
0.2887,-10.0758,687
2.0072,-9.8831,688
-1.2767,-10.4955,689
7.9524,-10.0121,690
18.653,-9.3252,692
3.073,-9.8805,693
-0.2179,-9.994,694
0.1646,-9.8361,695
1.6132,-9.5287,697
-0.1643,-9.7238,698
0.8816,-9.7901,699
-0.823,-9.8661,700
-0.0303,-9.9009,702
-0.5088,-9.8753,703
0.2848,-9.8685,704
-0.1582,-9.833,705
-1.1715,-9.0835,707
-0.242,-9.7371,708
0.5917,-9.5128,709
0.0855,-9.6885,710
-0.9824,-9.8825,712
1.9733,-9.8219,713
0.2366,-9.9065,714
-0.0794,-9.9343,715
0.7485,-9.6715,717
-0.2239,-9.8718,718
0.1125,-10.2701,720
-2.5483,-9.7917,722
0.5641,-9.8702,723
-0.937,-9.8628,725
-2.1662,-9.5123,727
1.0398,-9.0434,728
-1.2803,-9.7777,729
0.3893,-9.6933,730
1.0674,-9.7026,732
0.9731,-9.8774,733
-0.2172,-9.9373,734
1.1929,-9.9062,735
0.5852,-9.8581,737
2.0717,-9.8005,738
22.2579,-10.1717,739
2.171,-9.886,740
1.5845,-9.8864,742
-0.477,-9.7681,743
1.7069,-9.946,744
0.5142,-9.846,745
1.1646,-9.8523,747
1.5431,-10.0173,748
-1.9276,-9.795,749
-0.5106,-9.7326,750
0.4264,-9.7989,752
0.4942,-9.8828,753
0.4739,-8.9097,754
-0.8274,-9.8689,755
2.0158,-9.873,756
-6.0668,-9.8503,757
15.557,-9.6007,758
0.1739,-9.4549,759
13.9175,-10.1108,760
0.1681,-8.59,762
0.9742,-9.9439,763
2.0905,-9.1839,764
2.1406,-9.9603,765
-1.3551,-10.0199,767
-0.7312,-9.716,768
-0.2527,-9.8118,769
0.0538,-9.8801,770
-0.0758,-9.8314,771
-0.5068,-9.8634,773
0.8919,-9.8264,774
-0.0935,-9.8243,775
-1.0622,-9.8678,777
0.3598,-9.8576,778
0.1758,-9.8505,779
0.8175,-9.6911,780
0.0022,-9.7568,783
-0.0066,-9.9572,784
-0.1698,-9.739,785
-0.022,-9.7674,787
0.22,-9.8324,788
1.1657,-5.9401,789
3.0916,-10.3454,790
2.437,-9.8686,792
2.1373,-9.5644,793
-1.4336,-9.629,794
-5.3028,-9.5993,795
-0.0934,-9.632,796
-3.1567,-9.5798,797
2.0057,-9.5627,798
-0.1362,-9.602,799
1.735,-9.6062,800
1.1263,-9.6327,801
2.2396,-9.6597,802
-1.0651,-9.6573,803
0.7747,-9.6486,804
-0.3483,-9.6724,805
3.1476,-9.6852,806
-0.4632,-9.7432,807
-3.6155,-9.6426,808
-4.8376,-9.593,809
0.4126,-9.6268,810
-4.6696,-9.501,811
-2.3855,-9.4854,812
2.8555,-9.5082,813
1.4122,-9.546,814
1.7528,-9.5753,815
-1.36,-9.6371,817
-8.9638,-9.5402,818
3.0498,-9.5005,819
-4.9622,-9.5492,820
2.9977,-9.5082,821
-2.5282,-9.5266,822
1.6686,-9.5542,823
-2.3705,-9.5565,824
0.151,-9.484,825
-0.2105,-9.4902,826
-3.8765,-9.489,827
3.5282,-9.497,828
-1.9319,-9.507,829
-1.2944,-9.5038,830
-2.301,-9.4833,831
-3.9442,-9.5059,832
-1.9217,-9.4772,833
-0.355,-9.4794,835
-3.2249,-9.4502,836
4.9635,-9.3261,837
18.7675,-9.3179,838
5.2347,-9.8412,839
2.167,-9.8566,840
2.3338,-9.829,842
-0.3501,-9.2255,843
10.1858,-10.1713,844
-0.3737,-9.9839,845
1.9209,-9.9728,847
0.8035,-9.8838,848
-13.5338,-9.8937,849
11.0446,-9.6467,850
1.1421,-9.8104,852
-2.249,-9.787,853
-0.5291,-9.7751,854
0.7168,-9.8435,855
3.6114,-9.9994,857
-0.6169,-9.6971,858
-1.0273,-9.4542,859
-2.18,-9.895,860
-7.6174,-9.6615,862
-18.3493,-9.5373,863
8.6745,-9.6572,864
-5.1347,-9.8391,865
6.6922,-9.8137,867
1.1202,-9.8648,868
0.8242,-9.8735,869
-0.1845,-9.8776,870
0.334,-9.8788,872
-0.0187,-9.875,873
-0.2478,-9.8739,874
-0.0234,-9.8727,875
-8.4133,-9.8063,877
6.9274,-9.8075,878
5.0047,-9.8507,879
-2.6306,-9.849,880
-27.3919,-9.5697,882
2.9459,-9.7044,883
0.886,-9.8178,884
3.6363,-9.8989,885
9.6143,-10.1405,887
0.57,-9.8586,888
-0.5061,-9.7543,889
-0.112,-9.8186,890
-0.7378,-9.7012,892
-0.388,-9.9367,893
0.4144,-9.8906,894
0.7219,-9.9088,895
0.0801,-9.989,897
1.4019,-9.9004,898
2.4169,-9.6983,899
0.3358,-9.886,900
0.251,-9.8888,902
0.7022,-9.9258,903
0.0998,-9.9969,904
0.9685,-9.9385,905
1.56,-9.8169,907
0.3204,-9.8814,908
1.818,-9.9764,909
0.0692,-9.8468,910
0.3707,-9.9014,912
0.284,-9.8888,913
-0.1115,-9.8187,914
0.106,-9.9071,915
0.3143,-9.9027,916
2.3307,-9.9134,918
5.8607,-9.9056,919
1.4457,-9.8276,920
0.3135,-10.0243,922
0.7629,-10.0112,923
0.3105,-9.751,924
-0.1131,-9.8744,925
0.7174,-9.9362,927
1.7588,-10.0936,928
1.7018,-9.8156,929
1.2644,-10.0239,930
7.8091,-10.1476,932
2.8197,-10.5189,933
3.2944,-9.9717,934
0.5281,-9.8884,935
-1.6133,-9.8555,936
0.5509,-9.8708,938
0.1337,-9.9919,939
-0.1316,-9.8042,940
-0.1031,-9.9269,942
2.3067,-9.9851,943
-3.6283,-9.928,944
1.1474,-9.848,945
1.4267,-9.9899,946
-0.3157,-9.9577,947
1.8102,-9.9135,948
-0.1377,-9.9208,949
0.2,-9.8993,950
-0.3049,-9.7724,952
0.409,-9.8278,953
0.5364,-9.79,954
0.1564,-9.9483,955
0.7948,-9.874,956
0.4109,-9.9118,957
0.7489,-9.8143,958
0.2193,-9.9623,959
-0.143,-9.8159,960
0.6196,-9.8833,963
3.9711,-9.9889,964
7.6391,-9.851,965
0.0723,-10.0011,966
-0.0363,-9.8062,967
0.9001,-9.8541,968
0.5598,-9.9051,969
0.4138,-9.8898,970
-0.1226,-9.9061,971
0.0596,-9.8942,973
0.3302,-9.864,974
0.0447,-10.1853,975
0.9495,-9.8785,976
0.6731,-9.785,977
-0.1209,-9.9812,978
2.0096,-9.9304,979
0.8519,-9.7928,980
-0.8585,-9.9404,981
0.0273,-9.9166,982
0.3077,-9.897,983
-0.2504,-9.8301,984
0.0437,-9.6925,985
-0.6513,-9.7526,986
-0.4104,-9.9112,987
-0.2815,-10.046,988
-0.0333,-9.9539,989
0.4105,-9.9581,990
-0.182,-9.7507,991
-0.4327,-9.8983,992
0.9707,-9.8659,993
0.4246,-9.9051,994
0.1456,-10.0629,996
0.0435,-9.8084,997
0.3256,-9.8613,998
0.4335,-9.9223,999
-2.0291,-10.0922,1002
2.1785,-9.9945,1003
0.7054,-9.6032,1004
6.0372,-8.7759,1005
6.2817,-8.2229,1007
1.4298,-9.8314,1008
-0.6751,-9.9115,1009
0.4411,-9.974,1010
1.3859,-9.8576,1012
0.0337,-9.9014,1013
-0.1465,-9.8336,1014
0.0708,-9.9294,1015
0.3688,-9.8645,1017
0.5131,-9.8846,1018
0.0773,-9.8705,1019
0.2248,-9.8493,1020
0.7358,-9.9153,1022
2.5949,-9.8943,1023
-0.3529,-9.924,1024
0.2016,-9.9239,1025
1.1401,-9.7107,1027
-0.0415,-9.7135,1028
1.2463,-10.2776,1029
0.0776,-9.8593,1030
0.3795,-9.498,1032
0.1483,-9.8432,1033
3.0001,-9.8708,1034
-0.2456,-10.0199,1035
2.7733,-9.4327,1037
-0.2775,-9.8081,1038
3.5078,-9.0899,1039
0.5991,-9.6824,1040
1.0914,-9.876,1042
-0.1675,-9.9166,1043
-0.6388,-8.6313,1044
1.6124,-9.9119,1045
-0.77,-9.942,1047
-0.3566,-9.8289,1048
-0.0011,-9.5757,1049
0.2141,-9.9141,1050
-0.4631,-9.8331,1052
0.7621,-9.5273,1053
0.8275,-10.0,1054
-0.4742,-9.5943,1055
-0.2564,-9.8426,1057
0.4519,-9.7891,1058
1.3874,-10.0021,1059
-0.0387,-9.9077,1060
0.1202,-9.9198,1062
2.4111,-9.9763,1063
0.7798,-9.9396,1064
0.2532,-10.1473,1065
2.8927,-9.8375,1067
0.3977,-9.8154,1068
-0.3743,-9.9195,1069
0.588,-9.8614,1070
-0.4604,-9.8707,1072
-13.8057,-9.3267,1073
7.3941,-9.4259,1074
4.9733,-9.7714,1075
-7.3668,-9.8212,1077
1.0186,-9.9074,1078
5.7407,-9.541,1079
2.5347,-9.8763,1080
-2.5794,-9.7306,1082
0.0391,-9.9989,1083
-0.4195,-9.498,1084
0.1786,-9.1308,1085
0.5368,-9.8377,1087
0.8224,-9.8428,1088
1.3139,-9.7261,1089
-0.3719,-9.8297,1090
0.5864,-10.106,1092
-0.4911,-9.7091,1093
1.3319,-9.6208,1094
-0.4497,-9.9192,1095
2.5744,-9.9939,1097
1.0261,-9.9194,1098
1.0936,-9.913,1099
1.0295,-9.9507,1100
-0.7929,-9.8585,1102
0.3878,-9.7433,1103
0.0521,-10.407,1104
-0.4561,-9.9224,1105
1.2968,-9.8053,1107
0.8066,-9.8192,1108
2.5297,-10.3346,1109
1.1562,-9.833,1110
0.1596,-9.7195,1112
-0.4189,-9.8974,1113
-1.2563,-9.8495,1114
-0.1969,-9.8345,1115
0.2208,-9.8296,1117
0.1414,-9.8347,1118
0.4424,-9.8391,1119
-0.0734,-9.8396,1120
-0.2589,-9.8386,1122
-0.0552,-9.8366,1123
0.1881,-9.8387,1124
-0.1282,-9.8379,1125
0.0739,-9.8416,1126
-0.3287,-9.8363,1128
-0.5161,-9.8353,1129
0.4611,-9.8404,1130
-0.5569,-9.842,1131
-0.385,-9.8296,1132
-0.7963,-9.8258,1133
0.2777,-9.8273,1135
-0.3458,-9.8335,1136
-0.1286,-9.8333,1137
-0.1311,-9.8282,1138
0.4498,-9.8425,1139
0.2233,-9.8338,1140
-1.844,-9.8393,1141
2.6569,-9.8551,1143
0.8755,-9.7418,1144
0.3924,-10.142,1145
0.7326,-9.5716,1146
1.0281,-10.0765,1147
0.1061,-9.6767,1148
0.5099,-9.8651,1149
-0.2426,-10.0144,1150
0.1649,-9.7316,1151
1.0807,-9.924,1152
0.9666,-9.6776,1153
0.1249,-9.7712,1154
0.5958,-10.0552,1155
2.7983,-10.3713,1156
2.2496,-9.8497,1157
0.1167,-9.8323,1158
0.9075,-9.9518,1159
-1.426,-9.8789,1160
-1.2768,-9.6115,1162
0.9511,-9.7709,1163
-0.2383,-9.4319,1164
1.3357,-10.3402,1167
-0.1134,-9.8924,1168
1.5421,-9.7221,1169
-0.6514,-9.8845,1170
1.4295,-9.8882,1172
0.1288,-9.7974,1173
-1.4544,-10.1096,1174
-0.5866,-9.8927,1175
0.8395,-10.0069,1177
-0.3028,-9.8334,1178
-1.1814,-10.0943,1179
1.1752,-9.9703,1180
0.428,-9.9867,1182
0.707,-9.6956,1183
0.5101,-9.7897,1184
1.8903,-9.7854,1185
-0.7215,-9.8795,1187
0.7242,-9.7479,1188
1.829,-10.3145,1189
1.7116,-9.9031,1190
-3.0709,-9.45,1192
1.1669,-9.8616,1193
9.0063,-10.02,1194
1.202,-9.9973,1195
0.9826,-9.8903,1197
-1.1825,-9.5722,1198
5.3792,-9.5374,1199
0.6403,-9.9159,1200
1.8645,-9.9604,1203
-0.3085,-9.4793,1204
7.058,-10.1291,1205
6.3794,-9.661,1207
0.6202,-9.6571,1208
7.3507,-10.0697,1209
-0.046,-9.8704,1210
0.1595,-9.6225,1212
-0.391,-9.3569,1213
1.1102,-9.9488,1214
1.8783,-9.699,1215
1.3475,-9.9637,1217
-0.5543,-9.8553,1218
9.2732,-9.9129,1219
4.0369,-9.8955,1220
0.5325,-10.011,1221
0.9546,-9.4619,1223
3.9643,-9.3096,1224
1.0248,-9.1493,1225
0.0877,-9.7499,1226
0.3919,-9.2347,1227
7.2049,-9.8007,1228
-1.6889,-9.9733,1229
-0.2219,-9.8865,1230
-0.7249,-10.0728,1232
2.3708,-9.3544,1233
1.5911,-9.7174,1234
-0.0391,-8.9299,1235
0.2239,-9.7944,1237
-0.8569,-9.76,1238
3.7595,-9.7991,1239
2.4931,-9.8869,1240
0.623,-10.1744,1242
5.5957,-9.8825,1243
-0.4417,-10.146,1244
-0.8513,-9.6959,1245
-1.5651,-9.1978,1247
9.624,-9.7928,1248
22.4783,-10.1708,1249
-0.4147,-8.9094,1250
-1.0193,-9.4313,1252
-2.0684,-9.8819,1253
1.1223,-9.7156,1254
0.9869,-10.1174,1255
-0.0893,-9.5411,1256
1.1706,-10.6897,1257
0.4483,-8.5679,1258
0.3341,-9.2538,1259
-0.8043,-9.915,1260
1.0132,-9.6694,1262
1.0006,-9.7646,1263
1.0783,-9.8134,1264
2.8805,-8.0436,1265
3.3342,-9.7125,1267
-0.5316,-9.8577,1268
-0.86,-9.9386,1269
5.6216,-9.7865,1270
-0.1558,-9.6722,1272
0.5712,-9.715,1273
0.2621,-10.0126,1274
1.8377,-9.5093,1275
0.0194,-9.818,1277
0.4572,-9.9604,1278
-0.2985,-9.9607,1279
2.5092,-9.8451,1280
0.4941,-9.6933,1281
0.5971,-9.9951,1283
0.3314,-9.9096,1284
-3.2827,-9.795,1285
-0.5017,-10.1018,1286
8.9178,-9.8601,1287
9.3982,-9.8758,1288
-0.0579,-9.9303,1289
0.4575,-10.1108,1290
-0.3437,-10.0836,1292
0.4696,-9.8612,1293
0.9637,-9.8173,1294
-0.6667,-9.7275,1295
-4.0681,-9.5263,1296
3.7483,-9.8328,1297
0.1018,-9.7825,1298
-0.0654,-9.9278,1299
0.9048,-10.1533,1300
0.3421,-8.8386,1301
-4.3616,-11.2197,1302
3.453,-10.2241,1303
-0.5463,-9.7295,1304
9.7323,-10.3086,1305
-0.6694,-9.9245,1306
0.1692,-9.763,1307
0.2608,-9.877,1308
0.6553,-9.8846,1309
-0.1237,-9.9644,1310
0.3648,-9.8164,1311
0.7452,-9.6839,1312
0.7375,-9.9901,1313
-0.9339,-9.8796,1314
-20.0089,-9.7558,1316
-20.0802,-9.7255,1317
3.2958,-9.7992,1318
-0.4099,-9.8953,1319
-40.8722,-9.5485,1321
6.1995,-9.5239,1322
-2.9455,-9.5691,1323
-2.1782,-9.5083,1324
8.0707,-9.5559,1327
2.1521,-9.7254,1328
5.9277,-9.7439,1329
0.6674,-9.8787,1330
-0.9822,-9.896,1331
1.3364,-9.7869,1332
-7.8886,-10.0288,1333
4.8874,-9.7768,1335
-0.8681,-9.8577,1337
-0.1301,-9.2047,1338
0.1515,-9.8634,1339
-1.8665,-9.8819,1340
0.0001,-9.874,1341
-1.3711,-9.98,1342
