AYGX_mean,AZ_mean,timestamp
0.0536,-9.8676,0
0.0368,-9.8679,1
0.0065,-9.8638,3
0.0932,-9.8678,4
0.0518,-9.8685,5
0.0551,-9.8679,6
-0.1155,-9.8665,7
0.2737,-9.8676,8
0.0583,-9.8695,9
0.0537,-9.8677,10
0.0525,-9.8677,11
0.0539,-9.8688,13
0.0536,-9.8678,14
0.0536,-9.8671,15
0.0541,-9.8678,16
0.0565,-9.8681,17
0.0553,-9.8672,18
0.0627,-9.8677,20
0.0732,-9.8665,21
0.0322,-9.8646,22
0.0504,-9.8669,23
0.0541,-9.8696,24
0.0413,-9.8723,25
0.7749,-9.8641,26
0.0888,-9.8655,27
0.0509,-9.8684,28
0.0565,-9.869,29
0.0548,-9.8692,30
0.2206,-9.8755,31
0.0602,-9.7962,32
0.4492,-9.8714,33
0.4222,-9.909,34
0.8314,-9.7903,35
0.1556,-9.8133,36
0.0412,-9.8687,38
0.5085,-9.8431,39
0.5505,-9.9144,40
0.1262,-9.8715,41
1.6373,-9.8063,42
0.2235,-9.9056,43
0.0329,-9.8725,44
0.0385,-9.8708,45
0.0343,-9.8716,46
0.0632,-9.8686,47
0.0651,-9.8709,48
0.0606,-9.8704,49
0.0597,-9.871,50
0.0622,-9.8715,51
0.0627,-9.8705,52
0.0554,-9.873,53
0.0362,-9.8669,54
0.0655,-9.8751,55
0.0848,-9.8709,56
0.0552,-9.8667,57
0.0518,-9.8698,58
0.0577,-9.8709,59
0.0568,-9.8737,60
0.0533,-9.8709,61
0.0537,-9.8715,62
0.0539,-9.873,63
0.0558,-9.8721,64
0.0458,-9.876,65
0.035,-9.8673,66
0.0868,-9.8748,67
0.0394,-9.8652,68
0.0624,-9.8736,69
0.0577,-9.8728,70
0.0582,-9.8748,71
0.0553,-9.8719,72
0.0302,-9.8563,73
0.0606,-9.8747,74
0.0517,-9.8733,75
0.032,-9.8787,76
0.0644,-9.8681,77
0.0427,-9.8721,78
0.0493,-9.8694,79
2.1342,-9.8758,80
-6.5141,-9.8178,81
-5.7727,-9.8558,82
-1.7638,-9.796,83
-0.8655,-9.871,84
0.4212,-9.8692,85
-0.0366,-9.899,86
-1.4822,-9.8738,87
-0.2164,-9.8842,88
0.203,-9.8844,89
-0.1477,-9.8842,90
-0.4588,-9.8817,91
-6.1743,-9.8385,93
2.2154,-9.8422,94
1.1675,-9.8631,95
0.3236,-9.8882,97
-1.8038,-9.881,98
11.9525,-9.805,99
-2.322,-9.8924,100
-4.451,-9.7592,101
10.0589,-9.4344,102
73.9968,-9.4124,103
10.442,-9.7771,104
-35.3346,-9.183,105
-1.2315,-9.8921,106
-0.7084,-9.7802,107
2.8607,-9.801,108
0.1443,-9.8393,109
0.4926,-9.8256,110
-1.5125,-9.791,111
8.8722,-9.7844,112
1.7826,-9.9064,113
-0.3288,-10.1054,115
-21.1451,-9.0261,116
-11.5606,-9.6181,117
14.0062,-9.7541,118
-0.5889,-9.8625,119
-3.9367,-9.8614,120
-8.4648,-9.7878,121
-0.6199,-9.8083,122
5.3171,-9.8329,123
-4.4099,-9.8435,124
1.0118,-9.8761,125
0.2097,-9.8914,126
-3.4931,-9.8412,127
2.0339,-9.7917,128
1.1476,-9.7904,129
-1.2395,-9.883,130
1.8706,-9.7725,131
-7.0435,-9.7746,132
-3.9138,-9.9188,133
1.0556,-9.8961,134
-0.676,-9.9068,135
-0.1442,-9.852,136
14.774,-9.6797,137
1.0254,-9.8944,138
-0.598,-9.9147,139
-3.5016,-9.8476,140
-0.5324,-10.0375,141
-4.1924,-9.905,143
9.9785,-9.7601,144
-0.6915,-9.8444,145
2.7822,-10.3257,146
1.7033,-9.8891,148
3.4921,-9.881,149
10.433,-9.9231,150
27.6151,-9.8079,151
8.2268,-10.5784,152
3.7904,-9.7393,153
-0.1451,-10.0695,154
0.0461,-9.7479,155
4.3931,-10.1191,157
-0.2597,-9.9369,158
-4.3904,-9.8756,159
3.2595,-9.8554,160
-1.3523,-9.8952,162
0.1534,-9.8693,163
-1.3086,-9.8876,164
-2.4637,-9.7241,165
-3.5241,-9.5876,167
4.6922,-9.7797,168
-1.8355,-9.602,169
-1.652,-9.8199,170
6.0636,-9.7141,171
-0.6776,-9.1758,173
5.3659,-9.8474,174
0.8908,-9.881,175
0.0424,-10.1576,176
-0.4455,-10.0172,177
1.2421,-9.6444,178
-6.6799,-9.8967,179
0.5999,-10.0569,180
3.1927,-9.76,181
0.5191,-9.7485,182
3.8437,-8.7872,184
4.7075,-9.8707,185
15.1358,-9.7131,186
-1.4598,-9.89,188
1.924,-10.0198,189
-0.2388,-9.9696,190
-0.0165,-9.9267,191
1.9781,-9.8956,193
0.2121,-9.9046,194
-5.1117,-9.83,195
10.4491,-9.8611,196
-18.3451,-9.7012,197
-1.0887,-9.796,198
0.349,-9.736,199
-2.484,-9.8309,200
-1.5074,-9.8457,201
-2.2139,-9.8068,203
0.9797,-9.8272,204
0.7437,-9.779,205
3.4374,-9.8395,206
-0.6186,-9.8255,207
7.7642,-9.8227,209
-5.9736,-9.8114,210
4.9579,-9.9926,211
1.4017,-10.0764,212
1.6575,-9.5438,213
0.4577,-9.8144,214
-1.491,-9.3931,215
-9.5369,-9.7378,218
1.1658,-9.777,219
0.9195,-10.014,220
1.0691,-10.0699,221
18.7761,-9.858,222
27.2889,-9.8558,224
-0.4556,-8.2356,225
9.5517,-10.2489,226
3.3864,-8.9122,227
-5.5774,-9.6687,228
2.7153,-9.8812,229
-1.215,-8.9977,230
-3.0941,-9.6574,231
7.9815,-9.6378,232
-1.3525,-9.4586,234
-12.4182,-8.7296,235
-0.6852,-9.2202,236
-5.4535,-9.4974,237
-7.9183,-9.4101,238
-20.745,-9.7817,239
-10.3749,-9.701,240
12.2842,-10.3256,241
1.7661,-9.5784,242
0.4301,-9.7888,243
17.5882,-9.811,244
8.9091,-9.0472,245
-6.9213,-8.1246,246
-0.623,-8.9447,247
3.9276,-9.3224,248
4.2945,-9.0236,249
0.0977,-10.1615,250
-5.0885,-10.197,251
4.2369,-10.0114,252
10.9513,-9.607,253
19.3195,-10.0511,254
22.5462,-9.8568,255
12.6932,-10.7302,256
6.622,-9.9252,257
6.8665,-9.9258,258
-0.0255,-9.9554,259
15.5087,-10.018,260
3.1916,-9.9069,262
3.4836,-10.0342,263
-1.3548,-9.9188,264
0.038,-9.9992,265
4.3885,-9.9198,266
0.921,-9.646,267
-1.3279,-10.0218,268
8.8188,-9.8319,269
8.1735,-9.7921,270
-1.6193,-9.8493,271
-0.1959,-9.8672,272
4.464,-9.6508,273
-3.2741,-9.8593,274
1.5653,-9.8471,275
-2.1792,-9.8777,277
-6.8295,-9.1811,278
-2.6784,-9.9301,279
-2.9263,-9.8858,280
-1.007,-9.9169,282
-0.4397,-9.8949,283
8.507,-9.6835,284
0.9437,-9.8862,285
-1.9028,-10.3733,287
-3.016,-9.9511,288
-25.5272,-9.8445,289
-55.8439,-9.8043,290
-5.8223,-9.7837,292
0.0716,-9.8663,293
3.977,-10.1249,294
-0.2523,-9.461,295
-0.8769,-9.8481,296
2.9179,-9.832,298
-1.1552,-9.9305,299
-0.0028,-9.8015,300
-0.9139,-9.6498,301
28.661,-10.006,302
-1.1169,-10.0847,304
0.9793,-9.8301,305
-9.1313,-10.4323,306
0.9725,-9.9329,308
1.0576,-10.0822,309
1.7367,-9.0653,310
-0.2687,-9.8938,311
-0.6386,-9.4195,312
4.423,-10.174,313
1.6072,-9.7484,314
4.837,-9.9392,315
5.5483,-9.9263,317
-0.8903,-9.9083,318
-0.8618,-9.9582,319
-0.2986,-9.9315,320
2.1282,-10.0116,322
3.822,-9.8156,323
2.6975,-10.0324,324
-1.2906,-9.9162,325
22.0073,-10.2253,327
0.4018,-9.8398,328
0.1714,-9.8038,329
5.0312,-9.8002,330
5.5294,-9.9458,331
-1.2069,-10.04,333
8.4275,-8.7634,334
3.1909,-9.8465,335
-2.4808,-9.8162,336
0.7094,-9.7487,337
-0.9455,-10.0922,338
7.9051,-9.8934,339
0.6958,-9.9698,340
4.2237,-9.7852,342
1.7196,-9.5941,343
6.4085,-8.5884,344
0.5869,-9.941,345
-8.3915,-9.968,346
6.1217,-10.0217,347
-7.979,-9.7783,348
1.8696,-9.8039,349
0.0669,-9.9856,350
31.0215,-9.715,351
2.366,-10.0247,353
1.9759,-9.9117,354
6.6315,-9.8691,355
0.3569,-9.932,356
-0.7254,-9.9837,357
4.3181,-10.3569,358
0.4822,-9.6236,359
-1.3044,-9.9544,360
8.4569,-9.5778,362
0.699,-9.6433,363
4.7442,-9.8792,364
2.583,-9.8481,365
1.1391,-9.8885,367
1.8708,-9.5071,368
0.9612,-9.7791,369
9.7212,-9.9837,370
1.0176,-9.8711,371
-3.6953,-10.074,373
4.7533,-10.0481,374
4.9499,-10.0701,375
5.4618,-9.9476,376
1.553,-10.0101,377
-4.2007,-9.9025,378
-3.4608,-9.836,379
-46.5328,-9.8071,380
23.3467,-9.6469,381
-3.956,-10.0648,383
-3.1476,-9.4275,384
17.8196,-10.3683,385
0.52,-9.118,386
23.6954,-8.8516,387
3.9826,-9.6129,388
3.005,-9.9709,389
-0.7282,-10.0246,390
4.8242,-9.95,391
0.9689,-10.0499,393
12.1249,-9.9301,394
1.8517,-9.8355,395
0.9726,-9.9396,396
3.994,-10.2275,397
36.9939,-9.7685,398
2.1025,-9.9977,399
8.4568,-10.2052,400
0.7477,-10.0063,401
4.4939,-9.9251,403
-1.5984,-9.9648,404
1.989,-9.9194,405
1.6832,-10.005,406
1.08,-9.8653,407
8.7555,-10.1653,408
-16.5836,-10.5375,409
-1.1678,-10.0179,410
0.441,-10.1947,411
-3.2741,-9.8145,413
1.9939,-9.9317,414
33.9628,-9.9315,415
-2.0893,-9.92,416
-1.3167,-9.9498,417
-6.8701,-9.9515,418
-16.4818,-9.86,419
7.3646,-9.6937,420
8.9186,-9.8151,422
3.3939,-9.8992,423
6.8678,-9.8909,424
3.849,-9.9403,425
-8.0345,-9.7693,426
1.3731,-10.1473,428
-1.0779,-10.0737,429
1.4635,-10.1474,430
1.2747,-10.2843,431
0.2197,-9.2479,432
3.9423,-9.9299,433
4.8392,-10.1274,434
1.6145,-9.6925,435
1.8217,-9.9279,436
-0.6872,-9.9741,438
2.7425,-9.5148,439
1.5458,-9.9212,440
0.1073,-9.8858,441
0.5713,-10.0313,442
-1.127,-9.9455,443
11.564,-10.8024,444
-13.2478,-9.801,445
15.8145,-9.6729,446
0.1195,-9.8661,448
-14.5343,-9.6859,449
-4.1275,-9.6494,450
39.3462,-9.7126,451
-10.3651,-9.8746,452
-0.5866,-9.8265,454
-0.2854,-9.8276,455
-0.1516,-9.8312,456
-0.1101,-9.8285,457
-0.1586,-9.8289,458
-0.1584,-9.8291,459
-0.1539,-9.8293,460
-0.1537,-9.8292,462
-0.1601,-9.8284,463
-0.1515,-9.8299,464
-0.1581,-9.8297,465
-0.1486,-9.8303,466
-0.1516,-9.8305,467
-0.1555,-9.8289,468
-0.1503,-9.8302,469
-0.1479,-9.8292,470
-0.1552,-9.8283,471
-0.1441,-9.8297,472
-0.1544,-9.8296,474
-0.1472,-9.8297,475
-0.1568,-9.8301,476
-0.1585,-9.829,477
-0.147,-9.8296,478
-0.1527,-9.8315,479
-0.1515,-9.8289,480
-0.1505,-9.8298,481
-0.1572,-9.8288,483
-0.1465,-9.8292,484
-0.1547,-9.8289,485
-0.154,-9.8302,486
-0.1568,-9.8294,487
-0.1497,-9.83,488
-0.1519,-9.8286,489
-0.1525,-9.8292,490
-0.1561,-9.8293,491
-0.1568,-9.8295,492
-0.1554,-9.8299,493
-0.1535,-9.8294,494
-0.1571,-9.8299,495
-0.1491,-9.8293,496
-0.1606,-9.8277,497
-0.1558,-9.8285,498
-0.1646,-9.8291,499
-0.1549,-9.8283,500
-0.1598,-9.8291,501
-0.1545,-9.8286,502
-0.1446,-9.83,504
-0.154,-9.8288,505
-0.1638,-9.8289,506
-0.1593,-9.8289,507
-0.1524,-9.8301,508
-0.1517,-9.8284,509
-0.1541,-9.8291,511
-0.1548,-9.8282,512
-0.1538,-9.8286,513
-0.1522,-9.8295,514
-0.1522,-9.8284,515
-0.1582,-9.8299,516
-0.1576,-9.8294,518
-0.1519,-9.8298,519
-0.1546,-9.8284,520
-0.1483,-9.8296,521
-0.1581,-9.8294,522
-0.1488,-9.8294,523
-0.1584,-9.8289,524
-0.1521,-9.8288,525
-0.1604,-9.8279,526
-0.1589,-9.8284,528
-0.1562,-9.8293,529
-0.1576,-9.8301,530
-0.1516,-9.8281,531
-0.1601,-9.8289,532
-0.1589,-9.8286,533
-0.1554,-9.8289,534
-0.1513,-9.8283,535
-0.1604,-9.8302,537
-0.1547,-9.8289,538
-0.1537,-9.8292,539
-0.1564,-9.8288,540
-0.1647,-9.8275,541
-0.1508,-9.8289,543
-0.1578,-9.8293,544
-0.1587,-9.8284,545
-0.1476,-9.8293,546
-0.1497,-9.8289,549
-0.1511,-9.8293,550
-0.1586,-9.8301,552
-0.1511,-9.8293,553
-0.1609,-9.8297,554
-0.1571,-9.8299,555
-0.154,-9.8297,557
-0.155,-9.8298,558
-0.1551,-9.8295,559
-0.1507,-9.8295,560
-0.1521,-9.8299,562
-0.1529,-9.8296,563
-0.1557,-9.8295,564
-0.1502,-9.8301,565
-0.1515,-9.8314,567
-0.1482,-9.8297,568
-0.1624,-9.8285,569
-0.1491,-9.8292,570
-0.1521,-9.8304,572
-0.1481,-9.8296,573
-0.1581,-9.8302,574
-0.1512,-9.8295,575
-0.1534,-9.8291,577
-0.1522,-9.8296,578
-0.1571,-9.8295,579
-0.1565,-9.8301,580
-0.1579,-9.8297,582
-0.1497,-9.8297,583
-0.1521,-9.8296,584
-0.1497,-9.8289,585
-0.1514,-9.8297,587
-0.1499,-9.8296,588
-0.1492,-9.8299,589
-0.1497,-9.8289,590
-0.1507,-9.83,592
-0.1511,-9.8296,593
-0.148,-9.8289,594
-0.1498,-9.8298,595
-0.1536,-9.8293,597
-0.1518,-9.8286,598
-0.154,-9.8299,599
-0.1596,-9.8289,600
-0.1494,-9.8293,602
-0.152,-9.8286,603
-0.1579,-9.8297,605
-0.1465,-9.828,606
-0.1681,-9.8287,607
-0.1545,-9.8291,608
-0.1608,-9.8289,610
-0.1512,-9.8294,611
-0.1614,-9.8303,612
-0.1558,-9.8286,613
-0.1638,-9.8291,614
-0.1635,-9.8296,615
-0.1524,-9.8307,616
-0.1508,-9.8292,618
-0.15,-9.8291,619
-0.1487,-9.8285,620
-0.1602,-9.8309,621
-0.1404,-9.8301,622
-0.1384,-9.8297,623
-0.1434,-9.8303,624
-0.1525,-9.8293,625
-0.1471,-9.8296,626
-0.1303,-9.8283,628
-0.1406,-9.83,629
-0.1474,-9.8299,630
-0.1583,-9.829,631
-0.1395,-9.829,632
-0.1259,-9.8304,633
-0.1556,-9.8293,634
-0.1338,-9.8305,635
-0.1582,-9.8309,636
-0.1793,-9.8292,638
-0.1616,-9.8303,639
-0.1771,-9.8311,640
-0.1274,-9.8292,641
-0.1709,-9.8286,642
-0.182,-9.8275,643
-0.1392,-9.831,644
-0.1628,-9.8292,645
-0.1439,-9.8302,646
-0.1447,-9.8305,647
-0.1402,-9.8296,648
-0.1519,-9.8294,649
-0.1501,-9.8294,651
-0.1687,-9.8281,652
-0.1364,-9.8299,653
-0.1514,-9.8291,654
-0.1497,-9.8296,655
-0.1648,-9.8294,656
-0.1314,-9.8311,657
-0.1386,-9.8288,658
-0.1481,-9.8299,659
-0.1509,-9.8305,660
-0.1518,-9.8292,662
-0.147,-9.8294,663
-0.1593,-9.8291,664
-0.1442,-9.8298,665
-0.149,-9.8299,666
-0.1496,-9.8308,667
-0.1487,-9.8299,669
-0.1462,-9.8293,670
-0.1423,-9.8298,671
-0.1534,-9.8292,672
-0.1426,-9.8298,673
-0.1487,-9.8294,674
-0.1478,-9.8297,675
-0.1587,-9.8294,676
-0.156,-9.829,677
-0.1499,-9.8309,678
-0.1526,-9.8302,679
-0.1495,-9.8301,680
-0.1449,-9.8298,681
-0.1591,-9.8309,682
-0.1464,-9.8304,684
-0.1519,-9.8297,685
-0.1555,-9.8308,686
-0.156,-9.8302,687
-0.1507,-9.8304,688
-0.1487,-9.8302,689
-0.1509,-9.8304,690
-0.1466,-9.8298,691
-0.1489,-9.831,692
-0.1538,-9.8298,693
-0.1533,-9.8305,694
-0.1426,-9.8308,695
-0.1459,-9.8308,696
-0.1506,-9.8292,697
-0.1562,-9.8307,698
-0.148,-9.8313,699
-0.1521,-9.8298,700
-0.1406,-9.8305,701
-0.1429,-9.8293,702
-0.1424,-9.8304,703
-0.1518,-9.8306,704
-0.1451,-9.83,705
-0.1475,-9.8307,706
-0.1572,-9.8285,709
-0.1498,-9.8289,710
-0.1428,-9.8297,711
-0.1397,-9.8296,712
-0.146,-9.8324,713
-0.1407,-9.8304,714
-0.1418,-9.8307,715
-0.1432,-9.8312,716
-0.1476,-9.8293,717
-0.1541,-9.829,718
-0.1496,-9.8291,720
-0.1443,-9.8303,722
-0.149,-9.8302,723
-0.1499,-9.8294,724
-0.1417,-9.8292,725
-0.1396,-9.8289,726
-0.1467,-9.8304,729
-0.1503,-9.8313,730
-0.1465,-9.8312,731
-0.1444,-9.8304,733
-0.1501,-9.8298,734
-0.1453,-9.8297,735
-0.1487,-9.8295,736
-0.1517,-9.8297,738
-0.1449,-9.8302,739
-0.139,-9.8301,740
-0.1405,-9.8297,741
-0.145,-9.8296,742
-0.1485,-9.829,743
-0.1554,-9.8291,744
-0.1459,-9.8306,745
-0.1454,-9.8303,746
-0.1438,-9.8306,747
-0.1458,-9.8306,748
-0.1431,-9.8297,750
2.2991,-9.8326,751
4.5138,-9.8353,752
5.4005,-9.8225,753
-2.7655,-9.8623,754
7.75,-9.7737,755
-7.7648,-9.8031,756
-2.7613,-9.8882,757
7.3553,-9.8307,758
-4.0381,-9.8549,759
1.5189,-9.8017,761
2.4242,-9.7145,762
-2.2265,-9.8454,763
-3.7216,-9.8681,764
-0.4968,-9.9043,765
-1.0404,-9.8451,767
-1.8085,-9.883,768
0.6664,-9.8674,769
-0.1697,-9.8901,770
-1.5723,-9.8576,771
-0.0621,-9.8854,773
-0.6672,-9.8895,774
-15.887,-9.7798,775
-0.8154,-9.845,776
3.2009,-9.7815,777
-0.902,-9.8264,778
-2.5873,-9.8692,779
2.5589,-9.8725,780
-1.4216,-9.8142,782
0.5287,-9.8392,783
-2.705,-9.719,785
5.9963,-9.7599,787
-0.5166,-9.8723,788
-3.8243,-9.9282,789
5.8205,-9.9145,790
-1.473,-9.8595,791
-12.6535,-9.8393,792
-1.112,-10.005,793
9.1986,-9.782,794
-1.293,-9.9808,795
-0.0726,-9.875,797
-8.0454,-9.7899,798
-52.5829,-9.9693,799
-52.5631,-10.1794,800
6.8801,-9.8232,802
2.5145,-9.86,803
3.4774,-9.9521,804
-9.3492,-9.7854,805
25.3353,-9.6892,806
5.6856,-9.6628,808
-6.6264,-9.1203,809
12.1966,-10.2152,810
11.398,-9.8554,811
11.2695,-9.9691,812
-9.5287,-9.2308,813
9.2758,-9.9258,814
-6.0363,-7.9487,815
0.3249,-9.8827,817
-0.9996,-9.4845,818
-2.1047,-9.9181,819
-1.7787,-9.8192,820
-4.4904,-10.8356,822
0.1852,-8.6431,823
30.0632,-8.3385,824
3.7899,-8.813,825
-7.3472,-9.1192,827
-39.9467,-8.5881,828
21.4236,-8.7818,829
-8.3147,-8.7253,830
11.4197,-9.2361,831
-10.4981,-9.8976,833
0.0498,-9.796,834
-0.7798,-9.856,835
-2.1512,-9.8747,836
3.8177,-9.8738,838
4.2451,-9.8452,839
-13.7211,-9.8384,840
5.3132,-9.7971,842
1.667,-9.8684,843
16.4046,-9.9704,844
11.1452,-10.2161,845
0.1306,-9.7634,846
-18.3999,-9.6259,848
14.2431,-9.7349,849
5.8244,-9.9418,850
-12.6333,-9.7643,851
19.9356,-9.7349,852
-2.9673,-10.2927,853
-0.559,-10.057,854
2.1262,-9.8172,855
0.6459,-9.8257,856
3.4576,-9.9092,858
-54.1491,-9.8231,859
189.0129,-9.4252,860
11.6087,-9.758,861
2.4269,-9.8389,865
0.2692,-9.9955,866
6.9271,-10.0166,868
-1.1918,-10.8239,869
11.7718,-8.7326,870
-3.4878,-10.0805,871
1.9792,-9.8298,872
0.702,-9.9677,873
0.2902,-9.7531,874
6.2408,-9.8827,875
3.7685,-10.0801,876
21.41,-9.8361,878
-8.4839,-9.9412,879
-5.1753,-9.5592,880
1.7277,-10.0037,881
7.5554,-9.5438,882
19.4366,-10.0194,883
-4.7663,-9.53,884
-0.0037,-9.7912,885
0.3962,-9.9591,887
0.5427,-9.8919,888
4.234,-9.991,889
3.4101,-9.8933,890
-0.5896,-9.7232,891
-0.0212,-10.0691,892
8.8023,-8.8991,893
4.3916,-9.2111,894
-0.2466,-10.3984,895
15.453,-10.0145,896
-1.9695,-10.0307,898
35.688,-9.8074,899
1.7613,-9.491,900
-0.3281,-9.7849,901
3.1649,-9.9786,902
-0.743,-9.9068,904
-1.8593,-9.9553,905
3.4495,-10.0387,906
4.621,-9.8173,908
5.5367,-9.6549,909
2.2538,-7.851,910
-1.9439,-9.9173,911
-1.21,-9.8679,912
7.7006,-9.8505,914
6.2965,-10.2187,915
1.3215,-9.9243,916
-0.8948,-9.7415,917
3.1162,-9.7568,918
-2.9778,-10.0669,919
0.655,-9.9677,920
-0.5652,-9.9146,921
1.2191,-9.6146,922
3.397,-9.362,924
4.7398,-10.0575,925
1.105,-9.8357,926
3.4886,-10.049,927
0.8521,-10.1431,928
-0.385,-9.9618,929
5.922,-9.7978,930
0.5814,-10.2172,931
10.948,-10.0432,933
29.6997,-9.8986,934
1.4764,-9.9244,935
0.3214,-9.9968,936
-1.2687,-10.3277,937
8.6837,-9.9812,938
1.5177,-9.7719,939
2.8568,-9.7537,940
0.4742,-10.1728,941
21.4502,-9.9932,942
3.1559,-9.7953,943
-0.3995,-9.8676,944
2.1333,-9.9973,945
3.0843,-9.7249,946
0.2188,-9.8375,947
1.1553,-9.8264,948
6.861,-9.854,949
1.4423,-9.8978,950
-0.1437,-9.7933,951
0.8628,-9.9519,952
0.9641,-10.0975,953
1.0215,-9.7582,954
3.7198,-10.0273,955
10.6936,-9.8681,957
1.1572,-9.9006,958
0.6044,-9.8287,959
5.5099,-9.4411,960
6.8922,-10.129,962
6.6485,-9.2855,963
1.754,-7.8538,965
-8.0531,-9.0943,967
2.874,-9.4168,968
3.902,-10.3502,969
6.6471,-9.267,970
-1.7352,-9.5973,972
1.4244,-9.252,973
3.3727,-9.9638,974
3.4913,-9.905,975
-1.2736,-9.7615,976
4.9057,-9.8484,978
4.6637,-9.9756,979
-13.2426,-8.8857,980
9.7782,-9.6015,981
2.6728,-10.1071,982
1.0513,-9.7807,983
1.4209,-9.2648,984
-0.8116,-9.5777,985
10.3288,-9.5068,986
4.5278,-10.023,988
1.6093,-9.8341,989
-6.9135,-9.5653,990
2.2855,-10.0001,991
3.0579,-10.0415,992
-2.0331,-10.2538,993
-3.9743,-10.303,994
-14.552,-10.3134,995
17.9362,-10.141,996
1.9631,-10.7701,998
6.4876,-9.9218,999
0.0885,-10.4354,1000
-2.3178,-9.2097,1001
8.6206,-9.7344,1002
0.1136,-10.5117,1003
-4.7126,-9.6701,1004
14.6046,-10.5136,1005
4.6524,-9.8907,1007
2.8278,-9.2397,1008
-1.8162,-9.9571,1009
19.2813,-9.8146,1010
2.6883,-9.7568,1011
-2.9105,-9.9188,1013
4.8285,-9.8904,1014
1.1732,-9.8902,1015
2.9834,-9.8941,1016
0.9435,-9.9323,1017
-0.7948,-9.9441,1018
1.5082,-9.9544,1019
9.564,-10.0707,1020
10.2981,-9.9998,1021
3.471,-9.8827,1023
0.4043,-9.9256,1024
5.1795,-9.972,1025
5.9222,-9.9196,1026
3.4021,-9.9552,1027
0.1441,-9.964,1028
4.6606,-10.213,1029
-0.7996,-10.234,1030
0.3498,-9.8087,1032
0.3865,-9.8967,1033
7.2511,-9.9948,1034
2.4014,-9.8329,1035
2.8508,-9.2067,1036
8.5074,-9.9268,1038
5.4385,-9.8905,1039
6.2437,-10.3776,1040
-1.3954,-9.9218,1041
7.4965,-9.6524,1042
1.1479,-9.8303,1043
8.1333,-9.8695,1044
0.454,-9.7952,1045
4.9959,-10.4614,1047
18.3084,-10.0078,1048
-2.0889,-10.3971,1049
-1.9295,-9.6799,1050
2.8633,-9.6861,1051
1.56,-9.5939,1053
-2.1867,-9.5735,1054
4.4607,-10.3299,1055
5.8671,-3.6416,1056
-8.9004,-9.8745,1057
-4.6208,-9.1922,1058
2.5093,-9.827,1059
3.6589,-10.0579,1060
-0.1166,-9.5499,1062
9.909,-9.667,1063
-15.3303,-9.7513,1064
9.3883,-9.8872,1065
-12.9768,-9.2932,1067
5.9296,-9.9373,1068
-0.498,-9.8606,1069
-7.0878,-9.8676,1070
-22.1924,-9.9901,1071
-11.8381,-10.2228,1073
2.537,-9.8976,1074
15.3119,-9.9177,1075
-7.114,-10.1456,1076
4.4451,-9.935,1077
5.0593,-9.9261,1078
-10.231,-9.9198,1079
-6.1878,-9.962,1080
-5.6848,-10.2456,1081
7.6547,-10.0335,1082
1.6697,-9.3296,1083
-14.8267,-10.0244,1084
17.9289,-9.7001,1085
-14.2509,-9.9072,1087
4.8721,-10.0329,1088
-3.1154,-9.8956,1089
-11.5475,-9.7318,1090
-1.3326,-7.9848,1092
-2.0967,-9.9335,1093
5.5554,-10.0222,1094
0.8313,-9.821,1095
2.0503,-9.9549,1097
4.184,-9.9406,1098
2.407,-10.1035,1099
2.3966,-10.0241,1100
11.4841,-10.0141,1101
4.6678,-10.0939,1103
-0.9905,-9.8988,1104
2.4301,-9.7402,1105
6.0544,-9.9887,1107
2.84,-10.045,1108
4.8654,-9.819,1109
5.1003,-10.0222,1110
0.529,-9.6307,1111
-0.7388,-9.2629,1113
7.3108,-9.7659,1114
11.9238,-9.7536,1115
14.2867,-9.7683,1116
6.6776,-10.0578,1117
-2.4221,-9.2923,1118
1.6705,-9.5967,1119
0.0298,-9.7652,1120
1.552,-9.8574,1121
0.4553,-9.9396,1122
2.5608,-9.9197,1123
-5.9947,-9.979,1124
5.4291,-9.8077,1125
0.7526,-10.0329,1126
0.0578,-9.8932,1128
4.1283,-9.9081,1129
5.9041,-9.5643,1130
-5.2501,-10.1942,1131
11.2501,-10.1351,1133
6.9201,-9.9896,1134
-18.1045,-9.7562,1135
6.7315,-9.6512,1136
-4.9475,-9.6959,1137
13.1669,-9.444,1138
-10.5908,-10.3922,1139
8.0257,-9.9803,1140
-0.0965,-9.5096,1141
3.3651,-10.0023,1144
5.2343,-9.5318,1145
2.0341,-9.8756,1146
6.7469,-9.89,1148
1.4806,-9.8704,1149
-3.7021,-9.9655,1150
18.3532,-9.8617,1151
4.868,-9.933,1153
3.2899,-9.893,1154
7.3386,-10.079,1155
1.0693,-9.9038,1156
0.4216,-9.8439,1158
1.2442,-9.8402,1159
1.1796,-9.8579,1160
5.1667,-9.9638,1161
-1.8677,-10.0115,1162
2.439,-9.9349,1163
17.9553,-9.7743,1164
4.6211,-9.9854,1165
0.8259,-10.1161,1166
5.4466,-9.7762,1167
0.7005,-9.8828,1168
4.9664,-9.9621,1169
4.7011,-10.0376,1170
-0.6801,-10.2145,1171
5.5424,-9.8814,1172
0.4599,-9.9304,1174
1.4085,-9.9615,1175
3.3118,-10.1086,1176
5.2037,-10.0937,1177
-0.2331,-9.9096,1178
0.2236,-9.9661,1179
-0.1822,-9.9262,1180
-0.1964,-9.917,1181
0.492,-9.9163,1182
4.0561,-9.9556,1183
10.1195,-10.0047,1184
16.457,-9.8105,1185
0.324,-9.9588,1186
4.4942,-9.9096,1187
1.5004,-9.9067,1188
-0.5442,-9.9462,1189
0.5624,-9.9521,1190
-0.1619,-9.9009,1191
-0.1587,-9.8727,1192
2.687,-10.0327,1193
2.9388,-9.9669,1194
9.6878,-9.9764,1195
17.0822,-10.065,1196
-23.1853,-10.2201,1197
-24.7647,-8.0427,1198
-0.4376,-10.7674,1199
-64.7574,-7.2576,1200
-41.705,-6.3557,1201
-8.6076,-7.9408,1203
-11.2118,-9.8275,1204
-13.2657,-10.2427,1205
22.1487,-10.2671,1206
-1.0301,-2.3052,1207
-1.8075,-10.1557,1208
-12.5767,-9.6898,1209
-14.4764,-10.0524,1210
57.9468,-9.9794,1211
22.8251,-10.0323,1213
-11.2379,-9.9628,1214
-15.7444,-9.7162,1215
-18.6704,-10.1382,1216
-2.798,-10.3956,1217
-24.5147,-9.7067,1218
37.6379,-9.5967,1219
-1.3446,-9.9158,1220
-3.9882,-9.8759,1221
-12.1806,-9.1631,1223
33.7491,-10.0325,1224
-17.3917,-9.5043,1225
0.8571,-9.9416,1226
5.691,-10.0375,1228
0.6893,-9.9086,1229
-0.3857,-9.736,1230
-6.761,-9.6491,1231
-6.5967,-9.9575,1233
-0.3979,-9.8828,1234
3.7826,-9.8953,1235
29.8507,-9.9672,1236
1.1089,-9.9577,1237
3.7867,-10.1826,1238
-2.0677,-10.1899,1239
4.5372,-9.5054,1240
11.1559,-10.1132,1242
-0.2961,-9.9471,1243
-9.0432,-10.0828,1244
-13.9134,-9.5477,1245
-11.2664,-9.9854,1246
7.2474,-10.0448,1248
0.2892,-9.6151,1249
0.3325,-10.0856,1250
-6.9962,-10.0986,1251
-3.8181,-9.9303,1252
-1.5774,-10.0092,1253
5.3837,-10.375,1254
2.1558,-9.8782,1255
0.4703,-10.3143,1257
2.2127,-10.0486,1258
-2.5503,-9.2673,1259
3.1007,-9.9517,1260
-1.5261,-9.5854,1261
13.4338,-9.9473,1263
1.1258,-9.8938,1264
-4.2486,-9.8443,1265
-3.1303,-9.8354,1267
9.2395,-9.9404,1268
-2.1704,-11.2489,1269
4.0396,-9.9352,1270
-1.9962,-9.8953,1271
1.2556,-9.8767,1272
0.1014,-9.8426,1273
0.4604,-9.9862,1274
-0.6678,-9.9382,1275
-4.1182,-10.2602,1277
-0.1185,-10.1395,1278
2.3911,-10.2582,1279
1.0218,-9.057,1280
-0.2734,-10.3065,1281
3.8425,-9.7105,1283
7.4478,-10.0749,1284
-1.5893,-9.683,1285
8.2826,-9.5635,1286
6.7831,-9.8268,1287
-4.7649,-9.6577,1288
-2.2593,-10.1512,1289
8.0797,-9.9736,1290
-14.1318,-9.8017,1291
5.3453,-9.6713,1293
2.5687,-9.8464,1294
0.0128,-9.906,1295
0.1521,-9.9015,1296
0.1035,-9.9011,1297
-2.3433,-9.9006,1298
-16.6398,-9.8115,1299
9.3663,-9.8178,1300
-0.6913,-9.8931,1301
-1.651,-9.889,1303
0.1125,-9.8804,1304
-0.4764,-9.887,1305
-0.5047,-9.8291,1306
10.4203,-9.8,1307
-0.5366,-9.9204,1308
-0.2049,-9.8853,1309
-0.1503,-9.9028,1310
-0.4559,-9.8846,1312
0.0758,-9.8984,1313
0.028,-9.9031,1314
-0.8516,-9.8866,1315
-12.7115,-9.7612,1316
-4.7645,-9.8765,1318
-2.995,-9.8184,1319
0.8496,-9.827,1320
0.7249,-9.8636,1321
8.9667,-9.8596,1322
1.2693,-9.996,1323
-1.9766,-9.5721,1324
-11.0434,-9.8544,1325
-5.8552,-9.7474,1326
5.4197,-9.8234,1328
1.5546,-9.8854,1329
1.6592,-9.8939,1330
-0.1751,-9.8773,1331
21.537,-9.7511,1332
1.2397,-9.9193,1333
8.8761,-9.41,1334
-6.3747,-9.648,1335
-0.6113,-9.7238,1336
4.7693,-9.5948,1338
-1.526,-9.633,1339
-0.7357,-9.8783,1340
16.9087,-9.8469,1341
3.4067,-9.9254,1342
-1.2956,-9.9286,1343
-2.2683,-9.8888,1344
2.6493,-9.9691,1346
-1.0698,-9.8565,1347
-1.1282,-9.8367,1348
1.1321,-9.8317,1349
2.8379,-9.7906,1350
-1.9759,-9.8428,1351
-6.4229,-9.8002,1353
-23.4899,-9.7528,1354
-62.7627,-9.8231,1355
-114.4679,-9.6113,1356
-61.0655,-9.7129,1358
-79.9143,-9.2642,1359
-30.8311,-10.3439,1360
-10.5402,-10.1218,1361
-3.3941,-8.97,1362
4.5591,-10.0685,1364
-0.9842,-9.5814,1365
0.0897,-9.6227,1366
-2.5684,-9.7427,1367
-2.7831,-9.789,1368
12.1056,-9.841,1369
-3.032,-9.811,1370
48.2288,-9.4347,1371
10.7871,-9.7401,1372
-62.7185,-8.6628,1373
1.3535,-9.875,1374
-3.2934,-10.0157,1375
-0.7774,-9.8862,1376
0.8729,-9.9317,1377
8.9273,-10.0762,1378
1.2971,-9.7004,1379
14.1651,-9.9572,1380
2.0837,-10.1205,1381
4.5668,-9.9655,1382
3.0298,-9.9944,1383
5.8541,-9.9713,1384
-0.1282,-9.9602,1385
3.8156,-10.0162,1386
-0.1308,-9.5676,1387
-1.1273,-8.9096,1388
-0.1874,-9.8034,1389
1.4309,-9.692,1390
10.385,-10.7491,1391
9.407,-9.6326,1392
12.6698,-9.9935,1393
3.1206,-9.9163,1394
-2.4824,-9.8835,1395
2.5126,-9.9183,1396
4.1688,-9.9858,1397
10.4634,-9.8531,1398
5.8537,-9.6431,1399
-27.2215,-9.6105,1400
-45.2734,-9.7252,1401
-78.6912,-9.7499,1402
-35.9173,-9.7195,1403
-27.2191,-9.6462,1404
-134.0026,-9.1375,1405
-65.7374,-9.4325,1406
78.5115,-9.1474,1407
-4.6247,-9.4033,1408
-174.0089,-9.382,1409
-133.2822,-9.7709,1410
-149.5722,-9.7967,1411
-18.1281,-9.9372,1413
10.3155,-9.7765,1414
-5.5328,-9.7889,1415
12.9202,-10.0245,1416
10.7461,-9.7591,1417
10.7059,-9.8953,1418
1.7701,-9.964,1419
-7.9364,-9.8395,1420
-16.6118,-9.669,1422
-2.4527,-9.934,1423
2.8219,-9.8542,1424
3.6505,-9.8562,1425
-14.6757,-10.0508,1426
-12.5566,-9.8803,1428
-10.0833,-10.0077,1429
43.7337,-9.8046,1430
-3.5969,-10.0903,1431
4.7731,-10.0501,1432
5.6387,-9.8509,1433
-0.2721,-9.8853,1434
1.3462,-9.934,1435
-2.3965,-10.2036,1436
44.0149,-9.6646,1438
10.305,-10.083,1439
-16.1191,-9.7325,1440
-65.2339,-9.5386,1441
-22.2179,-10.021,1442
-7.649,-10.0615,1443
7.265,-9.7255,1444
-10.0975,-10.1339,1445
5.3344,-10.024,1446
9.171,-9.8313,1448
10.5317,-9.8875,1449
0.2945,-9.8102,1450
2.4051,-9.9508,1451
-1.3256,-9.5563,1452
-1.0321,-9.8434,1453
1.789,-10.0723,1454
0.3621,-10.0543,1455
7.9622,-9.8369,1456
0.1144,-9.7616,1458
0.4915,-6.8753,1459
1.2804,-6.6404,1460
-0.963,-9.8083,1461
0.3445,-9.8415,1462
2.2675,-10.1563,1463
10.8085,-9.9605,1464
1.3072,-9.3448,1465
0.0696,-9.1978,1466
2.0052,-9.3887,1467
3.4725,-9.9888,1469
2.9006,-10.3785,1470
21.4304,-7.2824,1471
4.6455,-9.97,1473
3.7774,-10.2894,1474
0.8998,-10.1136,1475
-7.7641,-10.3072,1476
1.2679,-9.9027,1478
-6.5157,-9.755,1479
-2.9426,-9.5857,1480
5.1568,-9.762,1481
-16.852,-9.7577,1482
3.7051,-9.6911,1483
9.454,-9.818,1484
-2.8823,-9.8329,1485
-0.7411,-9.9135,1487
0.8872,-9.9156,1488
-12.2264,-9.6136,1489
-2.2529,-9.6463,1490
-31.9246,-9.3127,1492
14.8646,-9.5507,1493
-26.2959,-9.7105,1494
13.1156,-9.775,1495
3.7522,-9.8677,1496
1.4333,-9.8791,1498
2.4044,-9.848,1499
-0.8133,-9.902,1500
2.2374,-9.8766,1501
0.1272,-9.895,1502
-1.5448,-9.8934,1503
-0.5153,-9.8648,1504
-7.2956,-9.7343,1505
24.9859,-9.7099,1507
-0.575,-9.8869,1508
-0.1996,-9.8804,1509
-0.2502,-9.895,1510
-0.0947,-9.9086,1512
-2.1645,-9.8397,1513
0.0675,-9.8981,1514
0.1016,-9.9005,1515
-26.3138,-9.7237,1517
-13.9882,-9.3699,1518
-0.1723,-9.7812,1519
4.1371,-9.8671,1520
-0.2139,-9.9059,1522
-0.0045,-9.8911,1523
-1.8329,-9.872,1524
-0.1882,-9.8649,1525
-9.7652,-9.8043,1526
-15.1195,-9.4326,1528
4.8767,-9.6912,1529
-3.0051,-9.7683,1530
-4.1548,-9.64,1531
1.1129,-9.8735,1532
-2.6223,-9.8751,1534
-3.2184,-9.7801,1535
1.8747,-9.7683,1536
-0.6228,-9.8413,1538
0.8972,-9.8236,1539
-0.5419,-9.8956,1540
0.1245,-9.8926,1541
-0.0316,-9.8946,1542
-9.3631,-9.8277,1543
-0.3044,-9.7722,1544
-38.0472,-9.6412,1545
11.5724,-9.3397,1546
18.3913,-9.6898,1547
2.0268,-9.832,1549
-0.7353,-9.8452,1550
-3.3778,-9.7885,1551
-2.0707,-9.3628,1555
10.1971,-9.484,1556
0.792,-9.5905,1557
-2.2696,-9.4708,1558
14.7199,-9.5434,1559
-8.3919,-9.8344,1560
-18.5613,-9.8979,1562
-1.1193,-9.8849,1563
-0.1079,-9.8728,1564
0.0015,-9.9132,1565
0.0063,-9.9356,1568
-3.6364,-9.8286,1569
-0.4689,-9.887,1570
0.0172,-9.8841,1571
-0.3608,-9.8865,1572
-0.0287,-9.8831,1573
-0.0065,-9.8811,1574
-0.0865,-9.8742,1575
0.1853,-9.8799,1576
0.0656,-9.8792,1577
0.1486,-9.8714,1578
0.067,-9.8803,1579
-0.1056,-9.8642,1580
0.2266,-9.8655,1581
0.071,-9.8619,1582
0.2706,-9.8625,1583
