AYGX_mean,AZ_mean,timestamp
0.1392,-9.7263,0
0.14,-9.7261,1
0.1683,-9.7302,3
0.1407,-9.7279,4
-1.4921,-9.7136,5
-4.1642,-9.6899,6
2.6731,-9.6689,7
0.0979,-9.7136,8
0.8104,-9.7167,9
-0.5043,-9.7311,10
1.5684,-9.7093,11
-8.6928,-9.7024,12
1.0312,-9.7155,13
-2.31,-9.6998,14
-0.7441,-9.703,15
-11.0823,-9.5631,16
-31.5325,-9.4598,17
-10.2263,-9.2706,18
13.4703,-9.5693,19
-1.1301,-9.6302,20
5.803,-9.7011,21
0.4122,-9.725,23
-1.4999,-9.4663,24
-0.8443,-9.7189,25
0.1386,-9.735,26
-0.0312,-9.7205,27
0.261,-9.6796,28
0.7313,-9.696,29
1.0028,-9.7416,30
1.5819,-9.7151,32
0.571,-9.7228,33
0.3622,-9.7241,34
-0.3308,-9.7185,35
1.3929,-9.7404,36
0.4011,-9.7257,37
0.4259,-9.7053,38
-0.1419,-9.7491,39
-0.3041,-9.713,40
1.9189,-9.7158,41
3.0279,-9.7081,44
-0.393,-9.7491,45
0.0762,-9.6958,46
-0.2248,-9.6861,47
-0.7405,-9.6553,48
-0.5776,-9.5579,49
1.3061,-9.5836,50
5.2753,-9.5313,51
25.4249,-9.3946,53
-1.792,-9.6706,54
-3.3357,-9.7203,55
0.2917,-9.7119,56
-0.5336,-9.6818,57
-10.546,-9.5818,58
-31.9889,-9.3374,59
15.9819,-9.5077,60
-3.5329,-9.5487,61
-1.6428,-9.5239,63
6.0878,-9.6934,64
1.9975,-9.8622,65
1.1248,-9.7078,66
-1.9091,-9.8206,67
-2.8959,-9.7109,68
-0.0297,-9.6961,69
0.7822,-9.6412,70
-2.0976,-9.7308,71
1.2274,-9.7095,73
0.4604,-9.745,74
-0.548,-9.7908,75
7.9968,-9.664,76
-1.3229,-9.7479,77
7.8492,-9.7695,78
-0.405,-9.674,79
0.1459,-9.7788,80
-0.5174,-9.568,81
13.6805,-9.7358,82
-0.5086,-9.7576,83
0.8009,-9.6489,84
8.9211,-10.1435,85
-2.4992,-9.806,86
8.282,-9.9304,87
-0.2036,-9.7572,88
0.0779,-9.7378,186
0.2207,-9.7377,188
0.3686,-9.7405,189
-4.3124,-9.9631,190
0.937,-10.2273,191
-0.74,-9.7339,192
-0.0751,-9.8882,193
0.7276,-9.1839,194
-4.0774,-9.7273,195
-0.8281,-9.7212,196
2.6293,-9.74,198
4.883,-9.6657,199
0.5581,-9.7024,200
3.0976,-9.6914,201
1.152,-9.6968,202
-0.2006,-9.7419,203
4.8105,-9.69,204
-3.372,-9.704,205
-0.7064,-9.6957,206
-1.0749,-9.7442,207
-5.905,-9.6436,208
-0.3051,-9.6663,209
3.6871,-9.6421,210
1.3998,-9.6858,211
-0.4976,-9.679,212
2.7161,-9.7043,213
3.2162,-9.5992,214
3.2219,-9.6792,215
1.1954,-9.7207,216
1.9982,-9.7024,218
0.3446,-9.6919,219
1.29,-9.7009,220
1.5941,-9.6919,221
1.7402,-9.6598,222
-3.3765,-9.7735,223
2.1543,-7.2928,224
0.3016,-9.6934,225
0.2388,-9.741,226
-0.355,-9.7853,228
2.1651,-9.7557,229
0.8252,-9.7987,230
-0.7299,-9.7191,231
-0.6998,-9.7247,232
7.485,-9.795,233
-0.0884,-9.6858,234
-2.1594,-9.7569,235
-1.2526,-10.0311,237
1.1363,-9.4285,238
1.1572,-9.8782,239
2.4334,-9.483,240
2.5914,-9.9709,241
9.0934,-9.7198,242
2.5572,-9.6659,243
-1.8639,-9.7171,244
-2.3485,-9.9774,245
-0.8836,-9.5742,246
1.8634,-9.7232,248
11.9515,-9.5861,249
0.988,-9.9546,250
2.7077,-8.5836,251
11.1813,-8.5193,252
4.6688,-9.5027,253
4.3888,-9.3033,254
3.9287,-9.773,255
1.6988,-9.8107,257
7.6917,-9.8607,258
1.3975,-9.8316,259
3.8681,-10.1814,260
2.3564,-9.244,261
1.4205,-9.751,262
2.1808,-9.5104,263
14.0677,-9.8748,264
7.0218,-9.4426,265
-2.1076,-9.7476,266
2.183,-9.1526,267
2.3151,-9.9043,269
1.1972,-9.6299,270
-3.5277,-9.8308,271
7.8774,-10.8597,272
12.7626,-9.4382,273
0.9369,-9.4558,274
4.4945,-9.1122,275
-5.3615,-9.3845,276
2.9783,-9.0627,278
-0.5036,-10.0795,279
2.7768,-9.8826,280
22.5115,-9.349,281
-4.7822,-9.678,282
26.0744,-10.0121,283
-3.7024,-9.7903,284
7.3997,-9.9919,285
7.2759,-9.6077,287
0.0819,-9.8045,288
2.3149,-9.7956,289
3.921,-10.419,290
0.4136,-9.7401,291
-11.1053,-9.0717,292
0.3213,-9.8789,293
11.1412,-9.1871,294
1.6329,-8.315,295
4.5393,-8.9172,296
-0.0548,-9.5748,298
6.1018,-9.6462,299
0.9875,-9.9078,300
1.8156,-9.6304,301
3.8764,-9.8195,302
-0.124,-9.831,303
2.3506,-9.8312,304
1.7875,-9.7605,305
-1.0501,-9.75,307
-0.7814,-9.7535,308
-2.3547,-9.6608,309
0.1562,-9.6698,310
5.1943,-9.8827,311
-0.4404,-9.7425,312
-1.0697,-9.7446,314
0.2945,-9.8444,315
-1.9709,-9.8125,316
0.0238,-9.7416,317
0.2895,-9.7697,319
-7.1022,-9.7154,320
0.5155,-9.7652,322
-1.4036,-9.6087,323
-0.6681,-9.8868,324
1.2525,-9.4828,325
0.869,-10.0842,326
8.2434,-8.7073,327
-7.2893,-9.9777,328
12.3541,-10.7466,329
5.7924,-9.6572,330
3.3756,-10.0992,331
14.8014,-9.8288,332
5.1784,-9.7642,333
13.2513,-9.9999,334
5.0948,-9.8284,335
2.3614,-9.6904,336
5.1946,-9.5354,337
9.6042,-10.1277,338
1.468,-10.0333,339
3.4731,-9.8122,340
27.3579,-9.489,341
2.6261,-9.9768,342
-1.332,-9.8122,343
0.9417,-9.786,344
-1.089,-9.8195,345
-3.2478,-9.4969,346
1.8847,-9.5401,347
-0.8604,-9.8723,348
5.9227,-9.7942,349
7.3562,-10.0202,350
12.347,-10.1706,351
-0.2517,-9.7506,353
5.7884,-9.7155,354
-0.0869,-10.3266,355
3.933,-9.6649,356
1.0912,-9.2717,357
-1.6184,-8.2251,358
-0.4187,-10.2198,359
0.4029,-9.4026,360
25.7449,-9.8021,361
5.7611,-9.7925,363
-1.4647,-9.702,364
-3.3716,-9.5455,365
6.227,-9.5454,366
4.0478,-9.563,367
-1.7705,-9.5603,368
7.211,-9.5542,369
-7.5174,-9.5165,370
14.9509,-9.4904,371
2.4686,-9.5839,373
-1.9791,-9.535,374
-4.3935,-9.4709,375
0.847,-9.4077,376
0.7341,-9.3391,377
7.2624,-9.5441,378
2.6669,-9.5973,380
1.5375,-9.7264,381
-1.5719,-9.9151,382
2.4941,-9.606,383
3.9604,-9.0007,384
5.484,-9.6982,385
14.2817,-9.2451,386
-2.8354,-10.0648,388
0.3178,-10.1084,389
-7.4912,-9.8975,390
3.9488,-9.7758,391
0.3006,-9.876,392
11.3346,-9.5003,393
7.7408,-9.5511,394
-0.2684,-9.5564,395
-1.5653,-9.6826,396
-0.5182,-9.996,397
-0.8741,-8.7287,398
-1.9469,-9.6471,399
-9.9253,-9.4456,400
22.785,-9.6794,401
4.7177,-9.5011,402
-0.834,-9.7304,403
5.1976,-9.673,404
0.241,-9.8879,405
6.2146,-9.2839,406
11.6683,-9.669,408
6.2981,-9.7417,409
0.7906,-9.1706,410
8.4667,-10.5137,411
1.5087,-9.7749,413
0.2018,-9.9285,414
1.3318,-9.6393,415
3.0256,-9.755,417
0.9916,-9.7106,418
-0.7377,-9.5459,419
-0.3232,-10.0473,420
0.8816,-9.6625,421
0.2129,-10.1993,422
3.5227,-10.347,423
13.7183,-10.3806,424
3.1667,-10.1163,425
15.2225,-9.9676,427
2.5776,-9.76,428
10.6307,-9.0023,429
4.2668,-10.2807,430
-2.5684,-9.9474,431
6.3727,-9.722,432
-2.8224,-9.7236,433
1.8836,-9.9153,434
7.6929,-9.6993,435
4.913,-9.2809,436
3.2227,-9.8199,438
3.9473,-9.7982,439
0.265,-9.8484,441
1.9231,-10.2258,442
4.7517,-9.2432,443
2.5291,-10.0968,444
8.283,-9.9204,445
0.456,-9.8254,446
0.2237,-9.7322,447
13.7501,-9.8404,448
-1.1194,-9.6037,449
3.551,-9.6669,450
-0.5273,-9.3664,451
-0.0025,-9.368,452
2.4868,-9.7372,453
-0.0501,-9.8431,454
-0.4947,-9.4801,455
7.1685,-9.7993,456
7.8093,-9.575,457
8.3162,-9.8187,458
11.6302,-9.9687,459
5.6908,-9.7754,460
10.9203,-9.9256,461
20.4291,-7.6427,462
6.878,-9.7955,463
6.1069,-9.3088,464
0.6335,-9.8511,465
3.397,-9.8158,466
-0.9959,-9.8687,468
5.8293,-9.8392,469
-0.4781,-9.764,470
-0.4692,-9.4983,471
0.6766,-9.7518,472
-1.168,-8.9518,473
19.3481,-10.4254,474
6.296,-9.6596,475
0.5473,-9.8756,477
1.0932,-9.7525,478
-0.0115,-9.8306,479
-12.6582,-9.6193,480
7.2762,-9.6209,481
-2.1422,-9.5058,482
-0.5303,-9.5962,483
1.8282,-9.6857,484
1.9234,-9.6536,485
2.8177,-9.6087,488
-1.7276,-9.5366,489
1.0463,-9.616,490
-8.5973,-9.5582,491
1.8452,-9.7069,492
0.4585,-9.7127,493
-1.8232,-9.5975,494
-7.7477,-9.7045,495
-7.2339,-9.4089,497
5.0261,-9.5827,498
0.195,-9.6616,500
7.184,-9.503,501
8.2079,-9.6804,502
-3.3529,-9.6676,503
-1.5976,-9.5095,504
6.0935,-9.6952,505
-1.1107,-9.8341,506
3.3077,-9.9088,508
3.4937,-9.7999,509
3.372,-9.7332,510
-1.9775,-9.7391,511
-1.1591,-9.4647,512
4.353,-9.4951,513
-0.5757,-9.9004,514
0.0726,-9.7752,515
3.3355,-9.8031,517
0.4751,-9.5409,518
2.2378,-9.8538,519
0.5136,-9.2121,520
1.1725,-9.8325,521
2.8495,-10.0184,522
2.4336,-9.5779,523
-1.2894,-9.3708,524
0.9805,-9.1471,525
-1.2098,-8.9301,526
5.6239,-10.1158,527
1.6707,-10.0582,528
-1.6826,-9.484,529
-0.5482,-9.3434,530
0.4515,-9.8953,531
0.8547,-9.7786,532
-1.3972,-9.7705,533
1.8818,-10.0798,534
9.3595,-9.9174,535
8.1172,-9.8562,536
1.3305,-9.6269,538
3.8329,-9.891,539
2.8164,-8.8687,540
1.8112,-10.4102,541
-0.4112,-9.7796,542
-0.3522,-8.9971,543
-0.1518,-10.1369,544
0.6703,-9.898,545
0.1203,-9.3029,547
0.3749,-9.7312,548
0.0628,-9.8196,549
0.8988,-10.0642,550
3.3705,-9.484,551
8.2554,-10.1476,552
2.7343,-9.8763,553
0.4303,-9.4911,554
9.9671,-9.693,555
9.5274,-9.5602,556
0.038,-9.7068,558
1.7565,-9.8344,559
1.3024,-9.5685,560
-1.5552,-9.8408,561
11.4455,-9.3911,562
-0.2622,-9.5056,564
19.4267,-9.9022,565
5.398,-9.6602,566
9.0709,-9.7499,568
6.1106,-9.7398,569
13.6413,-9.6821,570
15.8187,-9.7184,571
1.007,-9.9145,572
-3.7694,-9.6466,573
0.3501,-9.928,574
0.6206,-9.7271,575
0.4353,-9.5386,576
0.9764,-9.5281,577
0.2741,-9.7077,579
2.0924,-9.8723,580
10.6251,-9.8397,581
4.8473,-9.6778,582
0.0959,-9.7483,583
-0.8673,-9.7591,584
-0.6289,-9.73,585
1.0437,-9.9325,588
0.065,-9.7163,589
0.7449,-9.6989,590
-0.3885,-9.7377,591
7.0037,-9.6318,592
3.6345,-9.7515,593
2.1767,-9.6789,595
-0.5135,-9.5945,596
-1.2775,-9.3107,598
1.002,-9.7506,599
1.582,-10.0334,600
2.0301,-9.3709,601
7.3363,-10.0052,602
14.1775,-9.8833,603
1.1649,-9.9934,604
2.6303,-9.6824,605
1.0362,-9.9588,606
-0.3419,-9.5734,608
4.3672,-9.7522,609
6.3764,-9.7727,610
7.5462,-9.813,611
2.1135,-9.0887,612
-0.0964,-10.2139,613
8.0159,-10.6866,614
3.9894,-10.09,615
16.2765,-9.8252,616
6.5469,-9.2111,618
7.1047,-9.7544,619
3.1492,-9.9669,620
0.3166,-9.5638,621
6.2183,-9.7582,622
-0.9424,-10.632,623
-3.7361,-10.6724,624
10.2698,-9.8917,625
13.6015,-9.8087,626
-0.6718,-8.4567,628
0.7997,-9.7326,629
0.0445,-9.8055,630
0.0083,-10.0881,631
1.9721,-9.8619,632
2.5561,-9.7502,633
1.6033,-10.0137,634
2.8828,-9.718,635
-0.1236,-9.7778,636
1.7677,-9.7133,639
0.7067,-9.8146,640
1.6071,-9.703,641
-3.3262,-9.7175,642
4.6173,-9.8047,643
-0.2803,-9.7313,645
0.8571,-9.7287,646
0.5955,-9.7292,647
0.2577,-9.7127,648
1.381,-9.7104,649
0.5409,-9.726,650
1.0126,-9.7096,651
3.8595,-9.6992,652
1.2925,-9.732,653
0.2426,-9.685,654
3.7952,-9.7326,655
1.3136,-9.6849,657
0.5101,-9.7139,658
-4.9473,-9.696,659
3.4416,-9.6473,660
4.869,-9.5877,661
3.8213,-9.6352,662
-1.9764,-9.6853,663
1.483,-9.6091,664
5.373,-9.672,666
0.5585,-9.6928,667
1.5364,-9.6899,668
0.9897,-9.6917,669
1.7276,-9.6908,670
1.8385,-9.6959,671
1.4589,-9.7068,673
0.8727,-9.6841,674
1.5818,-9.6904,675
1.7193,-9.6901,676
1.9694,-9.6866,677
0.1539,-9.681,678
1.0271,-9.6512,679
1.6538,-9.653,680
8.3497,-9.6054,682
3.6652,-9.7077,683
-7.031,-9.6144,684
9.9615,-9.6386,685
5.8183,-9.6701,686
-3.3196,-9.6767,687
0.1802,-9.6067,688
10.102,-9.4977,689
7.1459,-9.601,690
-4.1889,-9.6756,691
12.1241,-9.6148,692
2.2307,-9.7121,694
0.2218,-9.8434,695
1.7457,-9.7411,696
0.6947,-9.8366,697
0.823,-9.6962,698
-3.2412,-9.8097,699
1.8819,-9.6907,700
0.9021,-9.69,701
1.1173,-9.8634,702
4.2351,-9.7624,704
0.2868,-9.7509,705
1.2435,-9.7585,706
8.5855,-9.6897,707
14.3668,-9.5351,708
0.6756,-9.7111,709
0.915,-9.7152,710
6.4154,-9.9615,711
0.8127,-9.7894,713
-0.3845,-9.742,714
-3.4753,-9.7688,715
-0.5315,-9.9507,716
4.0698,-9.8116,717
1.2862,-9.9003,718
-4.4801,-10.0391,719
-1.218,-9.7099,720
0.2762,-9.9442,721
3.6846,-9.5527,723
0.1372,-9.9628,724
24.3912,-9.6227,725
0.3823,-9.7586,726
-0.0374,-9.7318,727
0.1034,-9.8036,728
-0.8602,-9.6061,730
8.8862,-9.6809,731
-3.9781,-9.7162,732
4.3039,-9.6926,733
1.5361,-9.7136,734
1.3393,-9.7115,735
1.6556,-9.7071,736
-0.2174,-9.7347,738
-0.2754,-9.6913,739
2.5326,-9.6767,740
0.941,-9.6937,741
1.3462,-9.7184,742
1.0679,-9.7086,743
1.7206,-9.7143,744
0.4109,-9.7202,745
1.3105,-9.7098,746
-2.881,-9.6812,748
1.2185,-9.7854,749
8.6919,-9.7547,750
13.6909,-9.8223,751
0.0873,-9.9514,752
6.7082,-9.915,753
2.9562,-9.8848,754
0.577,-9.6726,755
-1.0744,-9.8272,756
5.1736,-9.8557,758
1.725,-9.7591,759
0.3339,-9.9285,760
-0.1462,-9.9443,761
-6.6801,-9.9867,762
1.2397,-9.7167,763
1.0497,-9.5104,764
3.5251,-9.7564,765
8.5479,-10.1374,766
9.7064,-9.518,767
-0.3341,-9.6616,769
0.4069,-9.6938,770
11.5946,-9.9347,771
-3.53,-10.1728,772
0.8669,-10.0237,773
-1.1328,-9.8376,774
-0.6027,-9.5572,775
-0.0273,-9.8037,776
2.4382,-9.7743,777
5.7501,-9.7215,778
0.0606,-9.754,779
5.5508,-9.752,780
8.341,-9.8398,781
6.7296,-9.7337,782
5.5373,-9.5783,783
10.1973,-8.9767,784
1.6613,-9.7973,785
6.6873,-9.7499,786
4.7129,-9.7163,788
1.0513,-9.7349,789
0.5252,-10.1052,790
19.4748,-9.7768,791
10.3923,-10.087,792
-0.3816,-9.687,793
12.4662,-10.0076,794
15.7991,-9.7259,795
0.7817,-9.7251,797
4.921,-9.6227,798
21.4031,-9.6238,799
13.0595,-9.8895,800
-4.1759,-9.4722,801
9.5955,-9.6427,802
8.2965,-9.7709,803
5.2415,-9.7817,804
6.5574,-9.7996,805
7.9673,-10.1326,806
1.6298,-8.3935,808
7.4625,-9.1697,809
1.2312,-9.6572,810
9.7096,-8.8346,811
21.9539,-9.5053,812
2.1278,-10.0101,813
1.8778,-9.0468,814
0.7093,-10.1519,815
-0.9953,-9.5283,816
7.6088,-10.0305,818
12.2827,-9.5408,819
5.4117,-9.0579,820
2.2757,-9.5991,821
25.2723,-10.5088,822
-1.3803,-9.8338,823
7.4549,-10.0222,824
1.881,-9.791,825
2.8904,-10.2517,826
2.5899,-9.0263,827
0.8157,-9.2085,829
-0.8142,-9.9523,830
2.4374,-9.5869,831
2.0253,-9.7268,832
2.2525,-9.5945,935
2.3016,-9.601,936
1.7116,-9.6013,938
-5.6931,-9.528,939
19.7229,-9.4565,940
4.7177,-9.6002,941
0.3592,-9.6472,942
2.4033,-9.6244,943
-8.803,-9.286,944
0.2517,-9.7712,945
-0.6989,-9.9012,946
1.205,-9.8608,948
10.1337,-9.703,949
0.2538,-9.658,950
25.1394,-9.3806,951
3.7885,-9.4508,952
30.9287,-9.1526,953
4.8191,-9.9956,954
7.29,-9.6266,955
10.6191,-9.7237,956
5.6304,-9.7675,958
8.4723,-9.7239,959
3.9916,-9.46,960
7.675,-9.7998,961
21.0905,-9.914,962
16.7139,-9.7152,963
3.7723,-9.7664,964
19.8193,-9.775,965
3.3167,-9.699,966
2.4495,-9.8157,968
-1.7962,-9.7708,969
1.3632,-9.8345,970
-8.3532,-9.8016,971
4.4688,-9.3706,972
-3.4723,-9.8068,973
3.7788,-9.8233,974
5.6908,-9.7707,975
7.0078,-9.6683,976
5.461,-9.9054,978
20.8938,-9.7735,979
12.5858,-9.8057,980
8.5508,-10.272,981
0.8998,-9.873,982
10.9533,-10.9182,983
22.8785,-9.8268,984
9.3664,-9.8209,985
14.9185,-10.4324,986
3.2209,-10.2039,988
11.743,-9.7503,991
3.3105,-9.9236,992
1.2916,-9.7579,993
29.1609,-9.4561,994
11.5467,-9.8031,995
-0.3633,-9.6158,996
2.9153,-9.9566,998
6.8465,-9.6323,999
5.9138,-9.9116,1000
-0.8213,-9.7047,1001
7.5031,-9.9646,1002
4.3659,-9.867,1003
3.3978,-9.7066,1004
5.8786,-10.1338,1005
-4.2232,-11.1037,1006
29.8632,-10.1116,1008
10.024,-9.7603,1009
2.5417,-10.0935,1010
1.1019,-9.9964,1011
16.3488,-9.5484,1012
0.355,-9.346,1013
-3.606,-10.0629,1014
6.2001,-9.6979,1015
5.471,-9.9377,1016
2.2996,-9.596,1018
2.6833,-9.7491,1019
3.3163,-9.9335,1020
4.5609,-9.9997,1021
-0.2068,-9.7366,1022
4.2208,-9.6329,1023
-1.9423,-9.9134,1024
1.198,-9.677,1025
0.7587,-9.6253,1026
6.6014,-9.7276,1028
2.3355,-9.9828,1029
15.9255,-9.239,1030
7.5626,-10.32,1031
8.1505,-9.3047,1032
6.2704,-9.8415,1033
11.917,-9.7218,1034
8.5143,-9.4435,1035
5.8891,-9.791,1036
9.3558,-10.0528,1037
2.8146,-9.3617,1038
3.4812,-9.8038,1039
5.1682,-9.3007,1040
0.0785,-10.1767,1041
4.1625,-9.7521,1042
0.8794,-9.7563,1043
2.5552,-10.0402,1044
1.6333,-9.7432,1045
2.2748,-9.6466,1047
10.5204,-9.5517,1048
-1.0111,-9.7706,1049
6.3886,-9.7007,1050
2.799,-9.7395,1051
2.0676,-9.8451,1052
-0.1332,-9.6913,1053
20.3595,-10.335,1054
19.1755,-9.5838,1055
12.581,-9.9507,1056
23.0288,-9.9361,1058
12.9326,-9.7551,1059
-0.0337,-9.3488,1060
13.0749,-9.2565,1061
13.2919,-9.7474,1062
1.5055,-9.6664,1063
3.701,-9.0661,1064
4.9137,-9.7002,1065
13.3795,-9.6371,1067
1.4577,-9.624,1068
3.3724,-9.6626,1069
2.9798,-9.817,1070
4.3844,-9.5829,1071
3.1434,-9.7246,1072
0.3153,-10.155,1073
8.5899,-10.7197,1074
0.0526,-9.6207,1075
3.9568,-9.0594,1076
-0.1942,-9.7466,1078
3.0552,-9.5175,1079
7.217,-9.7494,1080
4.4283,-9.776,1081
1.3621,-9.8115,1082
4.2379,-9.6686,1083
-0.4681,-9.9032,1084
3.1141,-9.6062,1085
9.5331,-9.8406,1086
5.5384,-9.9628,1087
10.3086,-9.8741,1089
0.7184,-9.7401,1090
0.8206,-9.9248,1091
2.1978,-9.7552,1092
1.7075,-9.7453,1093
1.4051,-9.9805,1094
2.2153,-10.0911,1095
-1.8769,-8.5313,1096
7.6898,-9.7973,1097
2.8995,-10.3674,1098
1.7525,-9.4132,1099
-0.9714,-10.0499,1100
6.9266,-9.916,1101
4.0124,-9.7858,1102
-0.1833,-9.6252,1103
-0.4785,-10.1286,1104
17.5203,-10.1516,1105
10.8665,-10.0701,1106
13.0249,-10.4395,1108
2.0287,-9.9386,1109
8.5682,-9.6742,1110
1.6778,-9.639,1111
7.7074,-9.7957,1112
4.1036,-9.5402,1113
0.0755,-9.7666,1114
2.401,-9.7291,1115
4.3785,-9.6249,1116
2.8262,-9.7992,1118
4.7212,-9.7834,1119
0.4009,-9.4315,1120
16.1159,-9.8247,1121
0.028,-9.7737,1122
2.6495,-8.8289,1123
11.4154,-9.6902,1124
4.5056,-9.8135,1125
1.1357,-9.8998,1127
4.4383,-9.8854,1128
1.593,-9.3029,1129
1.2554,-9.4864,1130
7.9789,-9.3127,1131
1.5394,-10.1053,1132
5.9572,-9.7433,1133
1.0636,-9.0602,1134
6.961,-9.7658,1135
8.5644,-9.99,1137
4.2563,-9.6874,1138
8.0966,-8.305,1139
3.8925,-10.2454,1140
12.2459,-9.2687,1141
3.8457,-9.6612,1142
1.7062,-9.9055,1143
7.0699,-9.6389,1144
4.1507,-9.8674,1145
3.6857,-9.703,1146
24.2457,-9.997,1148
10.1596,-9.7866,1149
4.9755,-9.8612,1150
4.9986,-9.759,1151
0.045,-9.6659,1152
-0.5173,-9.4037,1153
1.3022,-9.7868,1154
3.7141,-9.8594,1155
8.075,-9.6795,1156
-2.0416,-9.7449,1157
4.1279,-9.7641,1158
9.9048,-9.6902,1159
5.9646,-9.3927,1160
1.3432,-9.9555,1161
1.4773,-9.896,1162
6.9135,-9.5877,1163
21.7525,-9.5289,1164
2.8702,-9.7906,1165
11.3499,-10.4175,1167
4.9808,-9.7295,1168
3.0332,-10.0564,1169
11.6631,-9.8066,1170
-1.3545,-9.7724,1171
0.7459,-9.7133,1172
-1.9186,-9.6046,1173
8.8658,-9.6167,1174
11.0712,-9.7949,1175
3.5718,-9.7994,1176
1.8536,-9.6299,1178
2.5967,-9.4362,1179
2.2265,-10.2356,1180
17.6121,-9.6666,1181
3.1868,-10.0922,1182
-0.86,-9.7731,1183
4.1976,-7.8988,1184
1.3318,-9.8632,1185
3.5622,-9.5244,1187
2.4581,-9.8602,1188
11.3292,-9.3566,1189
-0.9852,-9.6756,1190
2.0179,-9.6028,1191
1.8599,-10.2306,1192
8.14,-9.7453,1193
3.0695,-9.8685,1194
0.9023,-9.8856,1195
0.4752,-9.6048,1196
1.2984,-9.7104,1199
1.7284,-9.8916,1200
-0.0962,-10.355,1201
4.6303,-9.803,1202
2.7453,-9.4329,1203
0.0605,-9.7855,1204
0.9953,-9.8328,1205
1.0742,-9.8094,1207
2.5944,-9.7573,1208
1.8574,-9.6565,1209
-1.2349,-9.8997,1210
8.8992,-9.849,1211
2.5115,-9.7387,1212
1.5885,-9.5074,1213
3.9819,-9.7973,1214
0.4194,-10.0567,1215
0.2388,-9.7669,1216
4.6479,-9.8656,1218
2.5481,-9.7408,1219
-1.1022,-9.8605,1220
6.4758,-9.7791,1221
-0.1049,-8.8515,1222
5.9282,-9.735,1223
1.4187,-10.1055,1224
0.516,-9.8611,1225
-0.4841,-9.7621,1227
-0.899,-9.6284,1228
-24.6953,-9.4023,1229
1.6433,-9.4929,1230
0.9743,-9.6387,1231
16.4509,-9.5932,1232
-12.6779,-9.5005,1233
7.1988,-9.6364,1234
1.9432,-9.7075,1235
-0.8353,-9.7408,1236
-3.4866,-9.6444,1238
1.2465,-9.7349,1239
-1.1422,-9.7348,1240
2.3054,-9.6988,1241
1.8809,-9.7258,1242
0.2861,-9.7466,1243
-3.0017,-9.7051,1244
2.563,-9.7213,1245
-0.3054,-9.7262,1246
0.504,-9.7267,1247
0.6488,-9.7285,1248
0.5669,-9.7208,1250
0.489,-9.7332,1252
0.8845,-9.7339,1253
0.715,-9.7312,1254
-0.9359,-9.7249,1255
2.3174,-9.7045,1256
0.3179,-9.7388,1258
0.5835,-9.7249,1259
-0.4705,-9.7339,1260
2.1243,-9.7616,1261
-1.4558,-9.7424,1262
-1.6801,-9.2256,1263
0.4434,-9.8882,1264
1.1408,-9.7007,1265
0.4639,-9.8501,1266
-15.5346,-9.6545,1267
-6.9763,-9.4641,1268
16.2423,-10.041,1269
11.8031,-9.6901,1270
6.4222,-9.7144,1271
-0.8944,-9.6,1272
19.4859,-9.6438,1273
0.0901,-9.7859,1274
3.4449,-9.4267,1275
1.0165,-9.9333,1276
5.7193,-9.76,1278
-1.2379,-9.5089,1279
4.7252,-9.9154,1280
5.9795,-9.6235,1281
35.2696,-9.6056,1282
9.7727,-9.4604,1283
7.7191,-9.9472,1284
6.7675,-9.5935,1285
-2.4293,-9.6013,1286
9.202,-9.7727,1288
5.056,-9.612,1289
19.3882,-9.6201,1290
23.5933,-9.6107,1291
2.3855,-9.9334,1292
12.115,-9.798,1293
4.2671,-10.1886,1294
1.296,-9.7024,1295
11.9315,-9.552,1296
9.9376,-9.803,1298
12.1628,-9.7055,1299
0.4772,-9.8873,1300
11.1589,-9.5656,1301
6.0875,-9.7034,1302
6.5288,-9.7066,1303
3.3769,-9.5696,1304
0.2522,-9.6943,1305
-1.9315,-9.6122,1306
2.0925,-9.6729,1308
5.604,-9.738,1309
3.2001,-9.5268,1310
8.8665,-9.7665,1311
18.7751,-9.6645,1312
-1.7539,-9.6812,1313
-5.885,-9.3995,1314
5.708,-9.8088,1315
-0.9828,-9.64,1316
19.8484,-9.7531,1318
10.5364,-9.7403,1319
6.7034,-9.9916,1320
0.5403,-9.7061,1321
1.8737,-9.804,1322
-0.0119,-9.7322,1323
0.9019,-9.622,1324
6.446,-9.9231,1325
-0.072,-9.4398,1326
6.2839,-9.7647,1328
5.2838,-9.2591,1329
0.065,-9.8548,1330
2.1705,-10.036,1331
0.9456,-9.8232,1332
-0.416,-9.5703,1333
0.5028,-9.7282,1334
4.1142,-9.7058,1335
1.1389,-9.4413,1336
12.1536,-9.628,1337
-3.3649,-9.6857,1338
1.8442,-9.7766,1339
7.3652,-9.8291,1340
10.4139,-9.7673,1341
15.4029,-8.6844,1342
6.4638,-9.9047,1343
12.6526,-9.8984,1344
7.9251,-9.4809,1345
9.2186,-10.0081,1346
6.6914,-9.5761,1348
14.8784,-9.824,1349
3.9829,-9.6581,1350
8.3765,-9.6247,1351
2.3041,-9.7043,1352
16.517,-9.8038,1353
6.2509,-9.8693,1354
0.4149,-9.6476,1355
0.8001,-9.8381,1357
5.157,-9.7564,1358
-0.2565,-9.4849,1359
9.1118,-9.7641,1360
1.3019,-9.9666,1361
7.7648,-9.7921,1362
5.0622,-9.6567,1363
17.6716,-9.8568,1364
4.9865,-9.8354,1365
1.9486,-9.8,1366
3.1774,-9.7781,1368
3.6609,-9.6584,1369
20.5442,-9.6966,1370
-5.6867,-9.8346,1371
-0.0854,-9.8789,1372
2.1466,-9.8505,1373
-0.371,-9.7285,1374
0.9187,-9.7832,1375
0.1614,-9.6236,1377
1.2646,-9.6975,1378
10.3121,-9.9144,1379
-0.3281,-9.6279,1380
0.551,-9.8017,1381
8.5909,-9.7178,1382
1.3089,-9.8123,1383
3.3121,-9.6759,1384
0.4732,-9.8289,1385
8.842,-9.8253,1386
-0.6834,-9.9136,1387
0.0593,-9.7106,1389
2.5287,-9.7411,1390
0.2417,-9.9224,1391
-0.8821,-9.9512,1392
0.5707,-9.0291,1393
14.7031,-9.9383,1394
23.4954,-9.788,1395
13.3002,-9.7269,1396
6.2982,-10.0757,1397
0.5595,-9.6946,1398
5.2175,-8.8223,1399
0.4475,-9.5927,1400
2.4634,-10.1263,1401
-1.1794,-7.3242,1402
-2.038,-9.9213,1403
-4.5806,-9.471,1404
2.7194,-9.8421,1405
-0.0438,-9.9022,1406
-2.4811,-9.5479,1408
4.1883,-9.7977,1409
7.6793,-9.8586,1410
0.68,-9.909,1411
-0.1753,-9.1229,1412
0.0025,-9.9144,1413
0.0149,-9.6576,1414
0.0449,-9.9193,1415
0.5121,-9.4966,1416
-0.2933,-9.7814,1418
1.3507,-9.7552,1419
1.1274,-9.4775,1420
0.0943,-9.7662,1421
4.3688,-9.7091,1422
11.45,-9.8143,1423
0.9388,-10.274,1424
0.3567,-9.5785,1425
11.0755,-10.0846,1427
7.2122,-9.7666,1428
10.5642,-10.0515,1429
3.1302,-7.1052,1430
8.0313,-9.6349,1431
-0.1791,-9.8079,1432
1.4977,-9.7576,1433
3.6549,-9.7904,1434
10.5107,-9.755,1435
8.8877,-9.7879,1437
4.6133,-9.8467,1438
5.2827,-9.6999,1439
-0.063,-9.576,1440
1.0008,-9.9669,1441
6.3935,-9.7393,1442
2.7757,-9.7246,1443
0.846,-9.8022,1444
1.8304,-9.7685,1445
10.5617,-9.9456,1446
9.602,-9.9646,1447
3.2343,-9.6369,1448
6.2516,-9.7911,1449
-1.1498,-9.968,1450
-0.6326,-9.5791,1451
5.3918,-9.5946,1452
11.4173,-9.7695,1453
4.0863,-9.8099,1454
-1.5863,-9.6494,1455
-2.1529,-9.3094,1456
10.6255,-10.192,1457
-1.9562,-9.6597,1458
2.9844,-9.9978,1459
-1.0024,-9.9115,1460
-0.8257,-9.8487,1461
17.5877,-10.1354,1462
4.6045,-9.9794,1463
1.7257,-9.59,1464
1.1423,-9.7573,1465
2.1506,-9.8323,1466
0.6384,-9.6053,1468
9.3336,-9.816,1469
-1.1155,-9.9462,1470
0.1073,-9.492,1471
10.7415,-9.9021,1472
4.6521,-9.6007,1473
3.9511,-9.7694,1474
7.3875,-9.8505,1475
16.6205,-9.5857,1476
3.0444,-9.9002,1478
8.3487,-9.7808,1479
7.5907,-9.6461,1480
4.1941,-9.8928,1481
3.0525,-9.8775,1482
8.546,-10.1266,1483
23.8171,-9.5058,1484
7.5237,-9.8261,1485
-0.1815,-9.8955,1486
14.2898,-10.1138,1488
6.101,-9.6043,1489
3.5787,-9.3904,1490
8.3986,-9.3152,1491
5.8927,-10.1494,1492
7.617,-9.8228,1493
4.0618,-9.799,1494
3.2839,-9.7662,1495
4.3814,-9.7062,1496
1.4603,-9.7071,1498
7.91,-9.5167,1499
-2.0158,-9.6715,1500
6.4529,-9.6117,1501
-0.3099,-10.0606,1502
3.174,-9.6444,1503
1.7072,-9.7978,1504
-1.6317,-9.6659,1505
16.2773,-9.9869,1506
0.9217,-8.9317,1508
5.3859,-9.7142,1509
1.5107,-9.8974,1510
0.897,-9.811,1511
12.1731,-10.399,1512
0.1051,-10.5265,1513
1.9285,-9.8024,1514
11.54,-9.8163,1515
6.5336,-9.7669,1516
2.3654,-9.852,1518
-0.9056,-9.7141,1520
-0.217,-9.9005,1521
1.878,-9.9172,1522
0.9894,-9.7045,1523
-0.1017,-9.9513,1524
3.2455,-9.7982,1525
1.3922,-9.802,1526
6.1414,-9.8276,1528
2.085,-9.8453,1529
24.3642,-9.7743,1530
4.0893,-9.6662,1531
2.5658,-9.481,1532
11.9486,-9.8717,1533
13.1671,-9.5299,1534
13.4365,-9.8233,1535
1.6338,-9.8052,1537
3.4049,-9.2325,1538
-1.4626,-9.5543,1539
-0.4662,-9.753,1540
0.2406,-9.8743,1541
0.0014,-9.8215,1542
-0.3665,-9.801,1543
-1.2761,-9.7371,1544
1.5594,-9.7388,1545
-2.7281,-9.7165,1547
0.0819,-9.6465,1548
1.505,-9.6296,1549
-0.0196,-9.6224,1550
2.2175,-9.5436,1551
1.5598,-9.5657,1552
0.8226,-9.5793,1553
0.2251,-9.4735,1554
-0.1972,-9.583,1555
-1.7067,-9.5776,1557
1.6458,-9.5481,1558
5.2033,-9.6093,1559
4.3804,-9.6231,1560
1.0394,-9.6033,1561
0.5482,-9.6206,1562
0.6639,-9.5369,1564
4.5062,-9.585,1565
4.1376,-9.6033,1566
-5.5828,-9.5244,1567
1.407,-9.3331,1568
0.6679,-9.2316,1569
30.6768,-9.3097,1570
8.3291,-9.6215,1571
-25.9459,-9.5188,1572
9.6611,-9.5198,1573
2.5902,-9.5706,1574
-1.9641,-9.5344,1575
-0.8384,-9.4551,1576
6.7656,-9.593,1577
4.9442,-9.7804,1578
-0.1594,-9.6367,1580
1.4397,-9.7975,1581
5.8479,-9.7117,1582
2.3255,-9.8111,1583
-0.0519,-9.79,1584
1.532,-9.9951,1585
7.7379,-9.8573,1587
4.9153,-9.7822,1588
7.4723,-9.4174,1589
22.1415,-9.6359,1590
4.9031,-9.8288,1591
2.2857,-9.7367,1592
11.6684,-9.4562,1593
2.9241,-9.8868,1594
13.7137,-9.7711,1595
3.8973,-9.7912,1596
8.6467,-9.7471,1598
9.4923,-9.7736,1599
1.4129,-9.8199,1600
8.0314,-10.1069,1601
4.8144,-10.0023,1602
4.2083,-9.8183,1603
9.1622,-9.9129,1604
-1.1081,-9.7346,1605
3.3671,-9.7255,1607
10.6917,-9.7889,1608
2.8324,-10.1065,1609
0.563,-9.7172,1610
-1.9457,-9.958,1611
3.4799,-9.7892,1612
8.2467,-7.754,1613
-0.3588,-10.0739,1614
-0.0487,-9.853,1615
1.6999,-9.6813,1617
9.5189,-9.7433,1618
2.8919,-9.7666,1619
3.018,-9.6656,1620
5.8116,-9.9031,1621
2.4663,-9.6843,1622
10.0185,-9.9461,1623
0.1514,-9.4407,1624
2.3608,-9.6723,1625
1.5033,-9.8454,1626
-1.2525,-9.8966,1627
2.7072,-9.7448,1628
1.7834,-9.7651,1629
4.8209,-9.8312,1630
1.4853,-9.681,1631
1.9039,-9.7437,1632
0.3906,-9.8136,1633
-0.4864,-9.9769,1634
4.4708,-9.8398,1635
7.7449,-9.7525,1636
1.9789,-9.8647,1638
9.1864,-9.9678,1639
1.9224,-9.7549,1640
1.2512,-9.9971,1641
4.76,-9.2872,1642
0.7704,-8.9763,1643
0.2822,-9.8063,1644
0.726,-9.6152,1645
-2.1095,-9.1144,1647
7.6456,-9.7876,1648
11.2689,-10.0093,1649
1.8351,-10.5419,1650
1.472,-10.0787,1651
6.5153,-9.6993,1652
13.2416,-10.2373,1653
1.12,-9.8783,1654
4.1254,-9.7222,1655
8.508,-9.6736,1656
2.5569,-9.8369,1658
4.4511,-9.0594,1659
-2.8107,-9.9711,1660
-0.3287,-9.8572,1661
-1.2676,-9.5398,1662
8.5595,-9.5016,1663
3.8211,-9.7268,1664
3.1747,-9.7968,1665
11.6719,-10.0189,1666
7.7658,-9.8202,1668
10.5161,-9.7903,1669
9.4795,-9.7167,1670
-1.0596,-9.4676,1671
3.5818,-10.0144,1672
7.6792,-9.7453,1673
4.0069,-10.2005,1674
3.9681,-9.8179,1675
-0.5073,-9.4623,1676
0.1352,-10.0801,1677
3.8702,-9.7858,1679
5.5875,-9.9047,1680
1.2485,-9.6711,1681
14.1891,-9.993,1682
-0.5043,-9.0588,1683
9.2893,-9.6995,1684
4.4692,-9.8887,1685
5.6783,-9.6835,1686
0.8857,-9.6145,1687
2.5565,-9.6453,1688
5.7524,-9.5829,1689
3.769,-9.7821,1690
11.7499,-9.7813,1691
6.9092,-9.3708,1692
2.9265,-10.0181,1693
1.0834,-10.1352,1694
6.9763,-9.7961,1695
8.214,-9.7139,1696
4.2622,-8.6536,1698
9.9426,-9.6383,1699
3.3503,-9.5591,1700
3.8558,-9.7615,1701
0.5855,-10.3146,1702
7.6667,-9.7731,1703
-0.9554,-9.6173,1704
4.8318,-9.5522,1705
16.1758,-9.6498,1706
3.7094,-10.3553,1708
6.7089,-9.5423,1709
2.9833,-9.7454,1710
9.6096,-9.443,1711
12.338,-10.0356,1712
11.223,-9.668,1713
3.0745,-9.6486,1714
3.5862,-9.64,1715
-9.0108,-9.8668,1716
2.6375,-9.6945,1718
1.5886,-9.7317,1719
0.8971,-9.5302,1724
2.007,-9.7724,1725
-0.1011,-9.4382,1726
15.7337,-9.6243,1728
1.1707,-9.798,1729
3.0877,-9.1991,1730
1.5454,-9.6505,1731
1.9975,-9.5185,1732
3.9277,-9.0948,1733
36.9442,-9.5028,1734
6.2378,-9.7405,1735
1.2626,-9.7616,1737
6.179,-9.7607,1738
35.9302,-9.641,1739
11.0883,-9.809,1740
11.8714,-10.2379,1741
5.4628,-9.284,1742
12.4681,-9.2901,1743
5.5905,-9.899,1744
5.7716,-9.577,1745
3.9206,-9.4729,1747
2.3476,-10.0388,1748
-0.13,-9.1964,1749
3.0886,-10.4131,1750
4.1185,-9.8564,1751
13.2275,-9.9872,1752
9.711,-9.5948,1753
8.9597,-9.8674,1754
8.2399,-9.6408,1755
9.0739,-9.7989,1756
0.3983,-9.8613,1758
15.1142,-10.0641,1759
7.8825,-9.7416,1760
-0.664,-9.5808,1761
5.0052,-9.7937,1762
4.1663,-9.708,1763
10.2982,-9.4607,1764
0.1864,-9.366,1765
-1.3826,-9.415,1767
43.1203,-8.9376,1768
1.3003,-9.7152,1769
3.7599,-9.6351,1770
1.4428,-10.064,1771
1.9451,-9.9803,1772
5.7387,-9.9914,1773
20.0435,-9.721,1774
1.6184,-9.8235,1775
-4.1899,-9.4859,1776
0.9344,-9.8013,1778
10.892,-10.0696,1779
2.6443,-9.325,1780
7.7154,-9.8021,1781
3.1775,-10.0,1782
0.3492,-9.97,1783
1.0652,-9.8229,1784
4.0131,-9.799,1785
3.9664,-9.6041,1786
3.1989,-9.7439,1788
4.2618,-9.5352,1789
0.285,-9.376,1790
1.8099,-9.8225,1791
1.6507,-9.4137,1792
3.2015,-9.7442,1793
5.6428,-9.7884,1794
3.9336,-9.9315,1795
7.7424,-9.8734,1796
6.7773,-9.8635,1798
3.6384,-9.644,1799
3.805,-10.0986,1800
3.1398,-9.8728,1801
1.5917,-9.7511,1802
-0.1262,-9.7546,1804
-0.1944,-9.7802,1805
0.1124,-9.9313,1806
-11.3156,-9.6564,1808
6.2528,-9.707,1809
2.6165,-9.6505,1810
-0.0888,-9.6764,1811
-11.349,-9.5744,1812
0.4482,-9.5812,1813
5.1908,-9.5952,1814
16.8414,-9.5888,1815
0.4872,-9.7895,1816
0.6888,-9.558,1817
2.9361,-9.8292,1819
3.6045,-9.758,1820
-0.1189,-9.6927,1821
2.8227,-10.2363,1822
6.1496,-9.7306,1823
9.8381,-9.6964,1824
6.373,-9.7287,1825
-2.3278,-9.7376,1826
1.5774,-9.8288,1827
0.2377,-9.8466,1828
2.2551,-9.7647,1829
3.0373,-10.0663,1833
7.1174,-9.5361,1834
1.5523,-9.9364,1835
-0.6235,-9.8334,1836
30.826,-7.3688,1838
6.395,-9.308,1839
25.2233,-9.9769,1840
1.7235,-9.6399,1841
-1.5454,-9.8364,1842
2.7936,-9.7723,1843
-9.1788,-9.7442,1844
6.5841,-9.5262,1846
2.7263,-9.5419,1847
-1.0359,-9.5321,1848
4.9882,-9.4152,1849
-1.8116,-9.6858,1850
-1.9193,-9.5081,1851
1.1018,-9.5525,1853
1.4935,-9.6635,1854
1.0532,-9.674,1855
-5.4576,-9.6554,1856
5.8513,-9.5474,1857
-0.1898,-9.6511,1858
1.9206,-9.5538,1859
4.1407,-9.6598,1860
-2.4133,-9.6474,1862
2.8042,-9.5877,1863
2.7687,-9.6379,1864
3.5664,-9.6521,1865
-2.6002,-9.6491,1866
4.2294,-9.6005,1867
3.5923,-9.6555,1868
2.2175,-9.6118,1869
7.056,-9.5798,1870
0.9865,-9.5945,1871
-15.1037,-9.608,1872
14.4298,-9.5604,1874
-1.89,-9.7695,1875
-2.9476,-9.7597,1876
-1.4125,-9.6791,1877
1.0203,-9.7636,1878
7.077,-9.7495,1879
1.8318,-9.8086,1880
5.4042,-9.6276,1881
-2.476,-9.7754,1882
2.022,-9.923,1883
-0.0317,-9.7196,1884
-0.0581,-9.8856,1885
-0.3169,-9.8788,1886
7.7304,-9.9375,1887
0.5353,-9.9,1888
0.4992,-9.7396,1889
0.1828,-9.6247,1890
1.4202,-9.6384,1892
0.6302,-9.8483,1893
-0.9276,-9.8739,1894
2.3998,-9.504,1895
9.7767,-9.7132,1896
2.3488,-9.8105,1897
4.5615,-9.8743,1898
0.8817,-9.6354,1899
2.1451,-9.8819,1900
15.0062,-9.599,1901
1.1442,-9.5636,1903
10.9605,-9.9221,1904
16.1835,-9.5071,1905
16.1747,-9.7715,1906
6.4589,-9.9284,1907
-5.7428,-9.8199,1908
7.158,-9.8035,1909
0.724,-9.8346,1910
3.888,-9.5949,1911
-2.4656,-9.3446,1913
3.9497,-9.7819,1914
0.8517,-9.7633,1915
24.9693,-9.7524,1916
4.6768,-9.7516,1917
2.2572,-9.6544,1918
5.3048,-9.9759,1919
4.0331,-9.6834,1920
0.6545,-9.8714,1921
3.7811,-9.779,1923
12.9489,-9.6201,1924
2.8086,-9.6922,1925
-1.0393,-9.9637,1926
0.4705,-10.088,1927
2.175,-9.7894,1928
24.4242,-9.4667,1929
9.2251,-9.946,1930
0.5048,-9.5751,1931
0.3935,-9.8762,1932
4.9716,-9.7378,1934
1.6365,-9.81,1935
-0.0903,-9.9003,1936
-3.4923,-9.7549,1937
7.2108,-9.2136,1938
24.336,-9.9003,1939
31.9501,-9.7482,1940
4.3449,-10.181,1942
3.876,-9.7782,1943
2.4076,-9.7696,1944
31.8747,-9.9281,1945
35.9257,-10.8686,1946
35.4805,-10.4027,1947
0.0818,-9.7138,1948
4.1283,-9.7944,1949
8.0414,-9.5981,1950
0.8544,-9.4569,1952
12.6265,-9.8159,1953
5.2452,-9.5131,1954
18.342,-9.4757,1955
10.6786,-9.7488,1956
6.4686,-9.7365,1957
33.654,-9.6228,1958
-2.6954,-9.6109,1959
0.6281,-9.9099,1960
10.2776,-9.68,1961
16.2042,-9.8906,1963
6.1762,-10.0067,1964
-4.895,-9.9756,1965
-1.3258,-9.5086,1966
-0.3069,-9.7529,1967
1.0217,-9.5461,1968
-1.5694,-9.6822,1969
1.139,-9.6702,1970
1.9779,-9.4759,1971
0.6372,-9.0809,1973
4.2115,-9.5951,1974
11.1744,-9.4453,1975
-0.2686,-9.7677,1976
-8.718,-9.6195,1977
-0.836,-9.54,1978
2.8142,-9.679,1979
0.7484,-9.656,1980
9.6355,-9.5333,1981
4.6013,-9.6516,1983
13.6704,-9.9189,1984
2.6838,-9.6167,1986
-8.3064,-9.8752,1987
7.4876,-9.5303,2034
-8.7481,-9.5023,2035
2.5052,-9.3968,2037
8.4193,-9.7114,2038
17.8188,-9.7979,2039
7.2358,-9.673,2040
10.2096,-10.099,2041
0.4981,-9.6193,2042
11.3867,-9.7392,2043
3.2008,-9.8465,2044
-7.3591,-9.6432,2045
10.5672,-9.847,2046
7.4252,-9.6743,2049
8.3487,-9.7455,2050
9.0754,-9.9382,2051
0.1901,-9.832,2052
20.1121,-9.9033,2053
22.4895,-9.8021,2054
9.6605,-9.6577,2055
29.0255,-9.4151,2056
12.3818,-9.8678,2057
13.5337,-9.7807,2058
27.1017,-9.7389,2059
2.3058,-9.4359,2060
8.2717,-10.0108,2061
8.0761,-9.6063,2062
8.2717,-9.5913,2063
9.784,-9.8538,2064
3.0542,-9.7241,2065
-3.1685,-9.6859,2066
4.1856,-9.7742,2068
6.4039,-9.7383,2069
11.5229,-9.2596,2070
7.0434,-9.8974,2071
10.4294,-9.9204,2072
5.5078,-9.8646,2073
-1.1418,-9.8265,2074
9.9202,-9.7444,2075
13.3488,-9.4838,2076
10.882,-9.4841,2078
5.8051,-9.6887,2079
11.575,-9.556,2080
8.3121,-9.8082,2081
8.2847,-10.1604,2082
2.5612,-9.8324,2083
7.5316,-9.8232,2084
3.7842,-9.872,2085
5.8654,-10.1462,2086
3.4185,-9.7023,2088
5.0637,-9.7488,2089
0.426,-9.9929,2090
0.2516,-9.5659,2091
3.7023,-10.1463,2092
5.2485,-9.463,2093
-0.4067,-7.468,2094
10.6811,-9.8612,2095
9.9349,-9.6115,2096
20.464,-10.1327,2098
-0.884,-9.703,2099
0.0475,-9.9803,2100
0.2908,-9.4516,2101
6.1957,-9.9247,2102
2.183,-9.6599,2104
0.9409,-9.6922,2105
-1.1882,-9.7432,2107
2.7207,-9.8112,2108
1.0945,-9.7377,2109
0.7232,-9.8021,2110
18.8113,-9.5257,2111
13.7507,-9.3418,2112
4.2854,-9.9079,2113
17.1084,-10.1427,2114
17.6425,-9.746,2115
6.7395,-9.69,2116
1.9653,-9.6944,2117
6.441,-9.7337,2118
4.1405,-9.6698,2119
4.9405,-9.818,2120
4.4133,-10.2254,2121
4.6421,-9.8184,2122
0.7886,-9.5662,2123
0.4987,-9.9198,2124
0.3484,-9.9317,2125
1.3617,-9.5374,2126
0.4471,-9.7363,2128
5.6464,-9.7243,2129
2.986,-9.6901,2130
6.6194,-9.9309,2131
1.5798,-9.7996,2132
-0.3096,-9.6884,2133
0.3918,-9.7552,2134
6.4045,-9.929,2135
12.8356,-10.0239,2136
5.9469,-9.7233,2138
5.2874,-9.7576,2139
-1.8319,-9.9132,2140
8.7619,-9.802,2141
-0.9381,-10.0352,2142
15.9285,-9.5048,2143
17.5226,-9.6682,2144
2.9946,-9.6424,2145
3.4102,-9.63,2146
10.3516,-9.8572,2148
12.4285,-9.7302,2149
4.898,-9.8011,2150
7.3582,-9.7761,2151
14.9822,-9.7154,2152
12.5131,-9.2189,2153
3.8316,-9.8178,2154
5.0129,-9.9088,2155
9.7106,-9.514,2157
8.4583,-9.8249,2158
-0.7658,-9.6697,2159
17.5796,-9.5785,2160
-3.6836,-9.612,2161
13.1295,-9.9915,2162
7.4322,-9.8029,2163
8.784,-9.7875,2164
13.3451,-9.8389,2165
11.0649,-9.6853,2166
2.8655,-9.814,2167
1.2201,-9.7185,2169
1.0888,-9.8377,2170
14.9784,-9.6206,2171
4.533,-9.8447,2172
0.3929,-9.6488,2173
5.8701,-9.8702,2174
0.7156,-9.719,2175
2.9682,-9.7738,2176
-0.0677,-9.6183,2177
8.256,-9.0703,2178
0.9129,-9.6221,2179
6.8276,-9.7979,2180
1.4121,-9.8457,2181
0.2067,-9.5808,2182
-0.6068,-9.7182,2183
2.5185,-9.8231,2184
7.0641,-9.8441,2185
2.3207,-9.6578,2186
-0.051,-9.9355,2188
1.7604,-9.7563,2189
1.719,-9.7902,2190
1.5967,-9.7578,2191
-1.5219,-9.7533,2192
-5.5254,-9.6615,2194
0.1766,-9.5018,2195
3.4084,-9.6148,2196
-0.1678,-9.7738,2197
-0.9002,-9.7473,2198
8.6804,-9.7576,2199
0.3339,-9.7047,2200
1.6839,-9.7508,2201
1.4984,-9.8909,2203
0.1358,-9.7636,2204
4.8641,-9.2486,2205
-0.7242,-9.8065,2206
4.2892,-9.7855,2207
3.5057,-9.748,2208
0.1322,-9.5471,2209
4.0096,-9.7592,2210
-3.0818,-9.6231,2211
0.0397,-9.7363,2213
2.4031,-9.6638,2214
-3.5549,-9.76,2215
3.1046,-9.6323,2216
0.1038,-10.1739,2217
0.4477,-9.8351,2218
6.2659,-9.7594,2219
-0.486,-9.9336,2220
3.9516,-9.612,2222
2.3669,-9.7581,2223
8.3102,-9.8304,2224
0.7535,-9.6937,2225
4.162,-10.0914,2226
9.0804,-10.0683,2227
2.5583,-9.8908,2228
0.8393,-9.7229,2229
5.2698,-9.7398,2230
-0.2531,-9.9144,2231
2.4639,-9.7021,2232
1.1328,-9.6553,2233
-0.0997,-9.7267,2234
0.9722,-9.8766,2235
0.0039,-9.9099,2236
-1.4578,-9.7856,2237
-1.0626,-9.6749,2238
-1.055,-9.4559,2239
13.6106,-9.5889,2240
-0.7905,-8.6066,2241
1.2857,-9.4432,2243
1.3885,-9.7677,2244
1.2306,-9.8921,2245
-0.3027,-9.7409,2246
0.2589,-9.8957,2247
-2.6317,-9.7572,2248
1.5802,-9.5919,2250
7.6029,-9.7673,2251
10.7865,-9.7426,2252
1.4552,-9.8458,2253
2.2736,-9.7495,2254
0.5009,-9.7385,2255
0.6355,-9.7502,2256
2.3489,-9.7438,2258
2.545,-9.7696,2259
1.3121,-9.8441,2260
5.0993,-9.7547,2261
-0.9196,-9.8779,2262
15.7265,-9.6308,2263
0.1537,-10.469,2264
0.341,-9.3953,2265
1.3419,-10.3622,2266
2.0526,-9.8154,2268
14.023,-9.8372,2269
9.9427,-9.7248,2270
11.3624,-9.6025,2271
11.2871,-9.5967,2272
2.0221,-9.1714,2273
-0.3133,-8.2028,2274
-3.0377,-6.4735,2275
0.3872,-7.3379,2277
2.0269,-9.367,2278
3.0422,-9.6122,2279
1.7658,-9.3805,2280
0.2525,-9.6002,2281
0.4902,-9.8826,2282
-2.1749,-9.7642,2283
-8.6652,-9.7519,2284
11.4021,-9.3627,2285
6.6425,-9.5467,2286
-5.6269,-9.4608,2287
3.2644,-9.4642,2288
12.5736,-9.4721,2289
5.6101,-9.5927,2290
10.9406,-9.6191,2291
1.7598,-9.7797,2292
-2.126,-9.8445,2294
0.4967,-10.0094,2295
2.2021,-9.5852,2296
6.5846,-8.8431,2297
0.7536,-9.7727,2298
-2.2065,-9.7565,2299
0.4508,-9.7327,2300
0.845,-9.8115,2302
-1.536,-9.7463,2303
0.2735,-10.0145,2304
2.2257,-9.6819,2305
1.1293,-9.732,2306
30.0091,-9.7121,2307
1.5003,-9.4842,2308
-0.7295,-9.8719,2309
0.9059,-9.9131,2310
3.9359,-9.9106,2311
10.274,-9.8061,2313
61.0148,-9.763,2314
-0.6133,-9.7586,2315
12.5052,-9.7999,2316
8.6438,-9.5985,2317
5.7816,-10.105,2318
6.4414,-10.2314,2319
0.2259,-8.9075,2320
16.072,-9.8363,2321
1.0761,-9.6734,2323
2.1599,-9.6581,2324
3.7318,-9.5349,2325
13.9729,-9.5651,2326
0.4768,-9.3984,2327
-0.3513,-9.3604,2328
-0.8323,-9.0766,2329
-0.3124,-9.2889,2330
3.3583,-8.4381,2332
-1.8673,-9.7062,2333
9.0482,-9.511,2334
3.6345,-9.6086,2335
-0.6966,-9.6617,2336
2.0556,-9.9291,2337
-2.1121,-9.2394,2338
-2.219,-9.5665,2339
7.3463,-9.6927,2340
8.0586,-9.7741,2342
3.4954,-9.7619,2343
18.0512,-9.8174,2344
12.149,-10.07,2345
1.0254,-9.4458,2346
1.3434,-10.0308,2347
3.5015,-9.9794,2348
0.5487,-10.0218,2349
-0.1698,-8.6775,2350
0.2934,-8.8411,2351
12.0738,-9.9601,2352
8.5734,-8.8404,2353
3.0496,-9.7468,2354
3.7466,-9.9376,2355
5.6934,-9.2272,2356
18.1827,-10.4798,2357
-1.7291,-10.334,2358
-2.3302,-9.2935,2359
1.8301,-9.953,2360
3.808,-9.8409,2362
18.8892,-10.2161,2363
2.4276,-10.5408,2364
0.7019,-10.9329,2365
5.5176,-8.511,2366
0.2838,-10.3552,2367
-0.4801,-10.0322,2368
19.112,-10.4874,2369
-0.2461,-9.3104,2370
2.2571,-9.2891,2372
0.9882,-10.096,2373
-0.2355,-9.6312,2374
6.1983,-9.9147,2375
1.4678,-9.5709,2376
0.6116,-9.7518,2377
10.6275,-9.7724,2378
-1.0544,-9.6496,2379
-3.2978,-9.8608,2380
3.3798,-9.5541,2382
21.5231,-8.9973,2383
2.4929,-9.1571,2384
0.6396,-9.3523,2385
-0.0622,-9.1742,2386
6.652,-9.3646,2387
2.1163,-10.1289,2388
-1.4405,-10.039,2389
6.1113,-10.0036,2390
3.2113,-9.6986,2392
1.9548,-9.712,2393
15.7091,-9.4307,2394
0.4887,-9.9542,2395
0.146,-9.7404,2396
0.3622,-9.6438,2397
1.3158,-9.7715,2398
-1.121,-9.7631,2399
-0.7404,-9.6072,2400
-1.956,-9.7274,2401
7.608,-9.6002,2402
6.1793,-9.5318,2403
-14.0746,-9.2615,2404
21.0278,-9.5725,2405
-3.4027,-9.5445,2406
0.9767,-9.7566,2407
12.4189,-9.6772,2408
4.9022,-9.8756,2409
3.2564,-9.9018,2410
4.2888,-9.5738,2411
13.8345,-9.4882,2412
1.1561,-9.9974,2413
6.732,-9.6335,2414
-0.0982,-9.6233,2415
1.5307,-9.6607,2416
4.9872,-9.5852,2418
0.6524,-10.1206,2419
-7.732,-9.0698,2421
-0.5548,-9.129,2422
-0.7177,-9.2231,2423
-1.6849,-9.8364,2424
-2.6365,-9.59,2425
0.4493,-9.7634,2427
3.1086,-9.7212,2428
3.4721,-9.4718,2429
-3.3279,-9.9829,2430
6.3008,-9.8583,2431
3.3304,-10.1646,2432
1.3146,-9.984,2433
-0.5494,-9.6369,2434
0.6378,-9.5679,2435
1.1702,-9.7018,2437
0.0398,-10.0129,2438
0.2934,-9.2807,2439
2.6932,-9.8767,2440
5.2811,-10.2331,2441
-2.5497,-9.7416,2442
0.9518,-9.8399,2443
-0.0913,-9.8319,2444
0.1051,-9.6943,2445
1.8372,-9.9258,2446
3.3455,-10.4552,2448
3.9939,-9.7252,2449
0.9168,-9.8035,2450
13.2909,-9.9014,2451
4.3703,-9.6725,2452
31.4925,-9.662,2453
0.5882,-9.4132,2454
-0.2704,-9.7704,2455
8.9346,-8.2254,2456
3.3544,-9.5583,2457
23.6067,-9.7865,2458
7.1952,-9.6587,2459
8.2635,-9.7081,2460
4.1386,-9.4968,2461
5.8949,-9.8418,2462
7.615,-10.0045,2463
7.8584,-9.6993,2464
4.6756,-9.7438,2465
0.7745,-9.9657,2466
0.6003,-9.8601,2467
1.4778,-9.7947,2468
0.6529,-9.7812,2469
-0.4129,-9.9037,2470
-3.3448,-9.7195,2471
3.6711,-9.7117,2472
0.7901,-9.6771,2474
1.1164,-9.7142,2475
4.8128,-9.6779,2476
4.1778,-9.604,2477
-4.8117,-9.5379,2478
9.8383,-9.6486,2479
1.5826,-9.7093,2480
0.6618,-9.7109,2481
1.3808,-9.7197,2483
0.7442,-9.726,2484
-0.2607,-9.7123,2485
1.698,-9.7162,2486
0.9955,-9.7254,2487
-0.225,-9.7297,2488
0.3954,-9.7243,2489
-4.3106,-9.6677,2490
6.4516,-9.5392,2491
-0.6743,-9.7318,2493
-5.1191,-9.5731,2494
1.6789,-9.6687,2495
1.2709,-9.6513,2496
-1.9272,-9.6699,2497
-15.5259,-9.4943,2498
7.6073,-9.51,2499
-1.8885,-9.6947,2500
17.3447,-9.3865,2501
30.5823,-9.6676,2503
9.6993,-9.7101,2504
3.1755,-9.7231,2505
-0.1604,-9.7638,2506
1.9115,-9.3684,2507
0.4041,-9.9127,2508
0.7071,-9.7604,2509
6.1269,-9.6485,2510
13.1531,-9.7723,2511
10.2683,-10.1306,2512
6.5347,-9.5498,2514
4.7073,-9.6981,2515
-1.1233,-10.0424,2516
14.2325,-9.5807,2517
-0.5419,-9.7293,2518
2.3221,-9.7657,2519
5.0309,-9.7887,2520
0.7052,-9.8923,2521
1.9831,-9.7879,2522
1.1451,-9.7099,2523
0.411,-9.7444,2524
-1.433,-9.7862,2525
-3.7516,-9.6778,2526
0.8346,-9.6681,2527
-1.0907,-9.6564,2528
3.8241,-10.1343,2529
-3.0211,-9.7965,2530
-1.1374,-9.744,2532
3.3468,-9.8893,2533
5.3364,-9.8306,2534
21.3045,-9.9609,2535
15.3259,-9.9875,2536
1.2097,-9.7255,2537
6.173,-9.9529,2538
1.9474,-9.6602,2539
6.6325,-9.6688,2540
1.8044,-9.8953,2541
0.118,-9.698,2543
1.4048,-9.7874,2544
4.402,-9.7243,2545
-1.8761,-10.1105,2546
-1.0895,-9.6248,2547
3.1428,-9.6612,2548
-4.1235,-9.704,2549
-2.1423,-9.7089,2551
1.2985,-9.7163,2552
0.6987,-9.7099,2553
1.3391,-9.705,2554
1.6848,-9.7138,2555
1.2731,-9.7305,2556
1.4715,-9.726,2558
2.9447,-9.6577,2559
1.9244,-9.7779,2560
-2.4539,-9.7045,2561
12.4525,-9.6783,2562
2.2617,-9.7328,2563
-0.6143,-9.7227,2564
0.464,-9.6871,2565
2.5853,-9.6982,2566
1.5773,-9.7214,2567
-2.5903,-9.6237,2569
-0.3136,-9.6527,2570
0.2493,-9.6035,2571
0.5981,-9.5027,2572
3.0726,-9.5997,2573
1.3607,-9.5911,2574
7.0252,-9.6163,2575
0.0223,-9.6549,2576
3.3825,-9.597,2578
4.9898,-9.5847,2579
-11.5506,-9.3875,2580
0.0236,-9.4573,2581
-12.7561,-9.4089,2582
9.9314,-9.3971,2583
-0.1554,-9.392,2584
1.6114,-9.3977,2585
16.9861,-9.3639,2586
-29.9289,-9.3544,2588
10.3407,-9.3492,2589
2.7429,-9.3582,2590
1.0528,-9.3744,2591
2.923,-9.3991,2592
7.164,-9.3515,2593
-3.3067,-9.4342,2594
3.5986,-9.3613,2595
-12.7009,-9.2726,2596
14.3422,-9.2694,2598
0.7085,-9.5207,2599
-0.5532,-9.698,2600
11.5368,-9.6837,2601
-2.6882,-9.7658,2602
-2.269,-9.4949,2603
5.9179,-9.72,2604
0.6372,-9.9354,2605
-0.0762,-9.647,2606
11.2239,-9.6907,2608
7.2839,-9.8026,2609
3.0056,-10.1378,2610
9.8509,-9.581,2611
-2.427,-9.7119,2612
-2.7176,-9.6656,2613
-0.8247,-9.911,2614
0.9482,-9.6216,2615
4.2257,-9.6385,2617
2.3469,-9.6857,2618
-0.2646,-9.9558,2619
-0.5255,-10.0947,2620
-6.5093,-9.6339,2621
-6.7274,-9.4564,2623
5.8402,-9.5515,2624
1.6217,-9.4798,2625
39.5097,-9.7044,2626
-2.156,-9.3784,2627
-103.7897,-8.4286,2628
16.5878,-8.8783,2630
-3.9221,-9.3381,2631
-1.8541,-9.5366,2632
17.2044,-9.5758,2633
14.3622,-9.5243,2634
-1.7404,-9.5963,2635
7.3908,-9.62,2636
5.7281,-9.6753,2637
0.3536,-9.7399,2638
-7.1727,-9.7044,2639
-7.567,-9.6232,2640
-3.2183,-9.7464,2641
-1.8095,-9.5858,2642
3.5291,-9.7337,2643
-5.6276,-9.7013,2645
-9.5886,-9.7085,2646
-0.8005,-9.7019,2648
