AYGX_mean,AZ_mean,timestamp
0.3235,-9.6466,6
0.3195,-9.6459,7
0.319,-9.6453,8
0.3228,-9.6457,9
0.3162,-9.6466,10
0.3177,-9.6456,11
0.3116,-9.647,12
0.3173,-9.6457,13
0.3153,-9.6454,14
0.4433,-9.6518,15
0.3108,-9.6468,16
0.3094,-9.6461,17
-5.9195,-9.4892,18
15.6201,-9.5508,19
-218.8991,-7.7719,20
52.5417,-9.081,21
0.5962,-9.3403,22
-13.4004,-9.1601,23
50.3316,-9.0908,24
3.4576,-9.5995,25
1.9731,-9.6471,26
-2.7145,-9.5978,27
-2.2571,-9.6616,28
3.1875,-9.5753,29
-1.8675,-9.5995,30
2.7374,-9.6601,31
-0.208,-9.6622,32
-0.1703,-9.6692,33
-1.2627,-9.6595,34
6.1368,-9.7852,35
-10.0052,-9.5975,36
4.7286,-9.2105,37
-0.7369,-9.4752,38
5.6804,-9.7657,39
22.4112,-9.8041,40
-6.9098,-10.0006,41
-4.1049,-10.2378,42
1.3761,-9.7987,43
-3.2943,-9.3988,44
-2.0974,-9.5713,45
-4.3601,-9.0503,46
-0.1091,-9.8562,47
-1.6213,-9.5468,48
-1.8395,-9.7174,49
-1.8251,-9.649,50
5.2471,-9.7576,51
0.6083,-9.7638,52
-0.8159,-9.8493,53
0.1269,-9.7447,54
-0.022,-9.6657,55
-1.324,-9.9562,56
-3.2303,-9.7807,57
-1.7462,-9.844,58
-1.655,-9.7137,59
-1.3616,-9.7491,60
-3.894,-9.5646,61
-5.2876,-9.9189,62
-0.9054,-9.7244,63
-5.082,-9.6552,64
0.9259,-9.4911,65
7.716,-9.4431,66
-0.7539,-10.1658,67
-2.6425,-9.8029,68
-1.6136,-9.4295,69
-1.9629,-9.6913,70
-0.8797,-9.6258,71
-2.854,-9.6481,72
-2.3258,-9.9439,73
11.2362,-9.132,74
10.9442,-9.6591,75
-0.5697,-9.6768,76
-0.111,-9.4636,77
-0.0604,-9.6998,78
-2.8167,-9.5665,79
8.5092,-9.9966,80
7.9178,-9.5351,81
-3.0325,-10.4605,82
-4.4781,-9.855,83
-5.5717,-7.3045,84
1.822,-9.2099,85
-1.9422,-9.5629,86
-1.492,-9.406,87
-0.8435,-9.8004,88
-0.1558,-9.5462,89
-1.6388,-9.3888,90
-1.6655,-9.7591,91
-0.4354,-9.3768,92
-0.4331,-9.8544,93
-4.3672,-9.6128,94
1.2208,-8.8869,95
-0.2617,-9.5685,96
1.4135,-9.9777,97
7.4442,-9.7171,98
-0.7264,-9.468,99
-0.5018,-9.6858,100
-0.5252,-9.756,101
15.6526,-8.0675,102
-0.2747,-9.5993,103
-0.9691,-10.0654,104
-1.8652,-9.5318,105
-1.9263,-9.3743,106
0.4671,-9.9527,107
-1.0851,-9.4675,108
4.5135,-9.6691,109
-0.6277,-9.6475,110
-0.3554,-9.5356,111
0.8072,-9.8694,112
7.8218,-10.1791,113
-0.0309,-9.7413,114
-0.4091,-9.6487,115
4.7896,-9.659,116
0.6437,-9.9162,117
-0.1758,-9.7413,118
-0.0633,-9.8954,119
-0.1262,-9.2542,120
0.4379,-9.7894,121
-0.3605,-9.5802,122
0.5424,-9.2557,123
-4.4453,-9.0413,124
6.7912,-9.9639,125
-0.2624,-9.8258,126
-1.1706,-10.2844,127
-0.9266,-9.7608,128
-0.8117,-9.6132,129
-0.387,-9.6921,130
-1.3021,-9.8885,131
-0.1696,-9.5421,132
-0.9469,-9.8542,133
-1.8008,-9.9185,134
-0.1914,-9.8628,135
-0.7919,-9.5986,136
-1.1861,-9.215,137
0.352,-8.5984,138
-0.2351,-9.1885,139
-1.4869,-9.4979,140
-2.5368,-9.3031,141
-0.6543,-9.7645,142
-0.4963,-9.0763,143
-0.6771,-9.7437,144
-1.5644,-10.1851,145
0.088,-8.8919,146
-0.2401,-9.4276,147
-0.2432,-9.647,148
0.5793,-9.8069,149
0.7999,-9.6754,150
2.906,-9.9127,151
-0.6981,-10.1984,152
-0.1486,-9.853,153
0.0656,-9.7716,154
4.9613,-11.1279,155
-0.0349,-9.8103,156
-0.2729,-10.0837,157
-0.5573,-10.4766,158
0.7463,-9.8154,159
0.3543,-9.4867,160
0.2737,-10.0818,161
-0.2936,-9.7276,162
0.2573,-9.8766,163
-0.1611,-9.6036,164
0.0353,-9.5835,165
-0.1503,-9.8177,166
-0.8093,-9.8541,167
-1.7031,-8.9767,168
0.1029,-10.2666,169
4.2456,-9.8316,170
3.6887,-9.712,171
1.0842,-9.1081,172
-0.3224,-9.9305,173
0.4428,-10.0455,174
-1.0278,-9.2111,175
-0.1262,-9.9867,176
-0.5453,-10.0328,177
0.2324,-9.931,178
0.1135,-9.613,179
-0.5409,-8.0231,180
-0.1399,-9.6918,181
-1.2544,-10.0085,182
-0.4927,-9.9605,183
-0.4382,-10.0055,184
-0.0513,-9.8066,185
2.1722,-9.7598,186
-1.8513,-9.6322,187
6.7909,-9.8263,188
2.2618,-9.8104,189
2.979,-9.4333,190
-1.554,-9.6929,191
-0.7135,-9.4312,192
-0.0096,-9.565,193
-0.2498,-9.8166,194
-0.1929,-9.8213,195
2.4625,-9.5863,196
0.1185,-10.0229,197
2.01,-9.6697,198
2.401,-10.0095,199
0.1407,-9.7139,200
-1.0503,-9.7035,201
-0.9772,-9.7392,202
1.2491,-10.0656,203
-16.586,-9.7459,204
8.9258,-9.6952,205
3.882,-9.7352,206
4.0656,-9.7588,207
-0.8941,-9.9885,208
5.3372,-9.4394,209
-0.7979,-9.8089,210
-0.0925,-9.9458,211
-4.7325,-9.5455,212
4.0822,-9.4754,213
-5.4135,-9.6441,214
1.115,-9.6679,215
-0.9874,-9.6291,216
-0.0641,-9.4588,217
0.8397,-9.6659,218
-0.7502,-9.6978,219
-1.168,-9.6788,220
-5.0959,-9.7157,221
0.8224,-9.6538,223
0.2506,-9.6421,224
0.3764,-9.6489,225
0.4356,-9.6454,226
0.3427,-9.6453,227
0.3707,-9.6451,228
0.3864,-9.6468,229
0.3885,-9.6468,230
0.3767,-9.6461,231
-0.019,-9.6527,232
0.243,-9.642,233
0.3495,-9.648,234
0.392,-9.6472,235
0.3749,-9.6463,236
0.3687,-9.6473,237
0.3739,-9.6472,238
0.3754,-9.6455,239
0.3762,-9.6471,240
0.3711,-9.6472,241
0.375,-9.6467,242
0.3702,-9.6467,243
0.3772,-9.6466,244
0.364,-9.6473,245
0.3697,-9.6468,246
0.3798,-9.6463,247
0.3756,-9.646,248
0.3742,-9.6463,249
0.3787,-9.6464,250
0.3795,-9.6474,251
0.376,-9.6464,252
0.3738,-9.6463,253
0.3777,-9.6456,254
0.3813,-9.6451,255
0.3838,-9.6454,256
0.3761,-9.6453,257
0.3755,-9.6464,258
0.3795,-9.6465,259
0.3769,-9.6453,260
0.3763,-9.6465,261
0.3724,-9.6467,262
0.3832,-9.6449,263
0.3793,-9.6461,264
0.3825,-9.6448,265
0.3719,-9.6457,266
0.389,-9.6456,267
0.3807,-9.6449,268
0.3792,-9.6463,269
0.3793,-9.6444,270
0.3786,-9.645,271
0.3754,-9.645,272
0.3836,-9.6449,273
0.3837,-9.6458,274
0.3764,-9.645,275
0.3847,-9.6455,276
0.3727,-9.6454,277
0.3747,-9.6448,278
0.3909,-9.6444,279
0.3909,-9.6465,280
0.3849,-9.6452,281
0.3793,-9.6458,282
0.3823,-9.6457,283
0.3838,-9.6448,284
0.387,-9.6446,285
0.3767,-9.646,286
0.3895,-9.6459,287
0.3784,-9.6463,288
0.3774,-9.6455,289
0.3843,-9.6447,290
0.3797,-9.6462,291
0.3817,-9.6444,292
0.3822,-9.6466,293
0.3815,-9.6438,294
0.3763,-9.6467,295
0.3784,-9.6464,296
0.3776,-9.646,297
0.3834,-9.6451,298
0.3771,-9.6452,299
0.3829,-9.6445,300
0.3832,-9.6454,301
0.3807,-9.6457,302
0.3883,-9.6439,303
0.3801,-9.6459,304
0.3758,-9.6457,305
0.3846,-9.6458,306
0.3822,-9.6432,307
0.3817,-9.6457,308
0.3846,-9.6468,309
0.3777,-9.6466,310
0.3768,-9.6465,311
0.3861,-9.6466,312
0.3781,-9.6451,313
0.3611,-9.6457,314
0.3798,-9.6471,315
0.3826,-9.6475,316
0.3763,-9.6475,317
0.3732,-9.647,318
0.3141,-9.6441,319
1.2379,-9.6411,320
-0.0974,-9.6394,321
0.2447,-9.6484,322
0.4383,-9.6468,323
0.4313,-9.6444,324
0.3975,-9.6441,325
0.4158,-9.6443,326
0.4131,-9.6451,327
0.4158,-9.6439,328
0.3802,-9.6451,329
0.3707,-9.6457,330
0.3853,-9.645,331
0.3155,-9.6423,332
0.4087,-9.6433,333
0.389,-9.6431,334
0.3964,-9.6431,335
0.3787,-9.6434,336
0.3839,-9.6443,337
0.383,-9.6424,338
0.3802,-9.6436,339
0.3761,-9.6447,340
0.4007,-9.644,341
0.3865,-9.6439,342
0.3945,-9.6439,343
0.387,-9.6428,344
0.4013,-9.6438,345
0.3843,-9.644,346
0.3749,-9.6435,347
0.3968,-9.6445,348
0.0109,-9.6445,349
0.534,-9.636,350
0.4963,-9.6379,351
0.0194,-9.6521,352
-0.1223,-9.642,353
0.2192,-9.6454,354
0.4876,-9.645,355
0.3394,-9.6463,356
0.3525,-9.6373,357
0.3444,-9.6408,358
0.2879,-9.6388,359
0.3991,-9.6443,360
0.4353,-9.6409,361
0.3767,-9.6439,362
0.3938,-9.6428,363
0.3812,-9.6415,364
0.3837,-9.6427,365
0.3843,-9.6415,366
0.3957,-9.6424,367
0.3828,-9.6419,368
0.3973,-9.6417,369
0.3717,-9.6439,370
0.3748,-9.6418,371
0.3871,-9.6425,372
0.3822,-9.641,373
0.3363,-9.6426,374
0.3836,-9.6422,375
0.3893,-9.6432,376
0.3886,-9.6429,377
0.3914,-9.6425,378
0.3822,-9.6431,379
0.3825,-9.6419,380
0.3852,-9.6426,381
0.3808,-9.6419,382
0.3891,-9.6415,383
0.38,-9.6424,384
0.3816,-9.6416,385
0.3884,-9.6432,386
0.3886,-9.6414,387
0.3963,-9.642,388
0.3751,-9.6421,389
0.3873,-9.6423,390
0.381,-9.6438,391
0.3872,-9.6417,392
0.3862,-9.642,393
0.3995,-9.6417,394
0.3942,-9.6414,395
0.3935,-9.6432,396
0.3784,-9.6442,397
0.3843,-9.643,398
0.3861,-9.642,399
0.3803,-9.6411,400
0.3781,-9.6429,401
0.3867,-9.6431,402
0.3848,-9.6431,403
0.382,-9.6424,404
0.3792,-9.6425,405
0.3903,-9.6429,406
0.3816,-9.6441,407
0.3785,-9.6431,408
0.3808,-9.6425,409
0.3637,-9.6475,410
0.4003,-9.6415,411
0.4172,-9.6439,412
0.4546,-9.6429,413
0.393,-9.6423,414
0.3684,-9.6439,415
0.3574,-9.6431,416
0.4001,-9.6426,417
0.3898,-9.6421,418
0.3908,-9.6445,419
0.3859,-9.6433,420
0.3834,-9.643,421
0.3822,-9.6425,422
0.3825,-9.6437,423
0.383,-9.6432,424
0.3804,-9.6442,425
0.3856,-9.6443,426
0.3844,-9.6438,427
0.3778,-9.6436,428
0.3823,-9.6432,429
0.3927,-9.6443,430
7.4736,-9.6395,431
-0.7039,-9.6941,432
4.6427,-9.5532,433
10.1711,-9.6911,434
-0.2709,-9.5775,435
-1.0806,-9.4633,436
8.8462,-9.6001,437
-2.6641,-9.7028,438
-2.9528,-9.5732,439
-28.2966,-9.4948,440
8.7329,-9.5772,441
4.8269,-9.6404,442
1.3877,-9.7496,443
2.4127,-9.7994,444
0.9654,-9.7159,445
0.0983,-9.641,446
2.4534,-9.6281,447
0.0732,-9.7569,448
0.8936,-9.8191,449
0.0545,-9.7081,450
6.818,-9.7461,451
6.0251,-9.549,452
-0.6619,-9.7669,453
-10.4072,-9.5857,454
-5.9511,-10.045,455
6.8664,-9.6823,456
4.6634,-9.2133,457
0.387,-9.5259,458
0.1667,-9.9711,460
12.3207,-9.9801,461
-0.4411,-9.9084,462
-0.5755,-9.5944,463
-1.5772,-9.5935,464
-1.1618,-9.2961,465
1.6985,-9.6565,466
1.3817,-9.6864,467
0.4225,-9.7511,468
0.085,-9.3371,469
0.5861,-9.6317,470
0.0605,-9.8216,471
0.541,-9.9316,472
12.1151,-10.6988,473
11.561,-9.5043,474
5.1719,-9.6442,475
-0.7157,-9.791,476
1.876,-9.684,477
0.0652,-9.4875,478
4.1697,-9.7623,479
3.6944,-10.044,480
-0.0544,-9.7054,481
0.4839,-9.774,482
-0.4086,-10.0192,483
0.1159,-9.7392,484
0.15,-10.1956,485
-0.0741,-9.646,486
-0.1136,-9.9239,487
0.4975,-9.6419,488
1.9243,-9.7522,489
18.6107,-9.8538,490
19.8589,-9.7101,491
1.0764,-9.3659,492
-0.1324,-9.8941,493
1.6037,-9.4111,494
-2.5525,-9.4754,495
-1.8498,-9.7892,496
1.7043,-9.6306,497
-0.4556,-9.6596,498
0.5751,-9.68,499
-0.4164,-9.3941,500
-0.1848,-9.5061,501
-0.782,-9.7172,502
-0.1886,-9.4652,503
0.081,-8.9344,504
0.7622,-9.6891,505
1.1984,-9.5392,506
0.8902,-9.6575,507
-0.9781,-8.0941,508
-1.3685,-9.6647,509
-0.2762,-9.6977,510
-0.168,-9.6969,511
-1.499,-11.1161,512
0.2873,-9.7625,513
-0.2019,-8.7111,514
-0.8282,-9.0618,515
-1.5316,-9.5815,516
-1.3771,-10.4013,517
-0.9409,-10.4034,518
-0.3584,-9.7408,519
0.2883,-9.7046,520
-0.0991,-9.6185,521
0.5682,-9.5081,522
-0.0569,-9.5123,523
0.0149,-9.6076,524
0.5974,-9.9336,525
3.2522,-9.7556,526
0.121,-9.2251,527
-0.1809,-9.4871,528
-0.4932,-9.6938,529
-0.1946,-9.7519,530
-0.3127,-9.8071,531
1.5343,-9.681,532
1.193,-9.7723,533
-0.1259,-9.6947,534
0.1473,-9.6536,535
2.8356,-9.4403,536
-0.0371,-9.6542,537
0.7707,-9.7948,538
0.063,-9.7818,539
0.3258,-9.7282,540
7.8482,-9.8887,541
2.0648,-9.5786,542
-1.6191,-9.8359,543
0.2631,-9.1391,544
0.5743,-9.4236,545
-0.0392,-9.5696,546
0.0669,-9.6182,547
-0.6845,-9.9382,548
1.327,-9.7981,549
0.1571,-9.7136,550
-0.0829,-9.5247,551
0.1429,-9.6404,552
-0.2982,-9.6631,553
0.0152,-9.6571,554
0.1564,-9.6314,555
0.1972,-9.8839,556
0.8429,-9.4081,557
0.4772,-9.6388,558
0.4002,-9.782,559
-0.3476,-9.3878,560
0.2181,-10.2085,561
-2.8076,-9.1331,562
1.1796,-9.3391,563
35.8005,-10.2832,564
-0.1835,-9.6998,565
-0.306,-9.7245,566
0.36,-9.6323,567
1.3226,-9.4194,568
-0.6943,-9.6944,569
0.2015,-9.6505,570
1.0531,-9.9306,571
0.6054,-10.0463,572
-0.9627,-9.5054,573
1.3117,-8.78,574
-0.2274,-9.77,575
0.0352,-9.6174,576
-0.192,-9.9657,577
-0.6406,-9.7165,578
-0.9645,-10.0731,579
-0.5219,-9.512,580
0.0115,-9.5051,581
-0.1981,-9.7286,582
-0.3103,-9.8519,583
-0.151,-9.8037,584
-0.8829,-9.6312,585
1.5798,-10.0206,586
0.3119,-8.2018,587
-0.1389,-9.4529,588
-0.3974,-9.4667,589
0.1661,-9.3006,590
-0.6974,-9.0947,591
-7.1825,-9.3148,592
0.0141,-9.7028,593
2.3268,-9.7103,594
0.1332,-9.765,595
-0.1528,-9.7678,596
0.002,-9.6697,597
-0.94,-9.8527,598
1.1586,-9.5793,599
0.0074,-9.7826,600
-0.0611,-9.7416,601
-0.5217,-9.6549,602
1.7388,-9.791,603
1.314,-9.7944,604
1.8312,-10.6595,605
0.1902,-10.4897,606
-1.9925,-9.8286,607
2.8379,-10.1002,608
0.8668,-10.5903,609
0.5664,-9.856,610
-1.4651,-10.1913,611
1.6584,-9.6924,612
2.0691,-10.1952,613
-0.1398,-9.8013,614
0.7785,-10.1829,615
3.2332,-9.5655,616
2.9782,-9.6002,617
-0.8254,-9.8249,618
18.8347,-10.3774,619
0.5691,-9.5818,620
-2.3996,-8.8128,621
-1.2254,-9.7094,622
-2.3811,-9.5629,623
-1.7977,-9.8259,624
0.0825,-9.7072,625
-2.2886,-9.6446,626
-0.0551,-9.5361,627
0.4864,-9.6859,628
-0.583,-9.8656,629
0.2956,-9.7634,630
5.2167,-9.5015,631
0.3002,-9.7549,632
-0.1278,-9.6357,633
-0.5767,-9.9032,634
-0.9591,-9.7329,635
0.1563,-9.7744,636
-2.4913,-9.7913,637
-0.2828,-9.7181,638
4.6538,-9.7237,639
20.8283,-9.3152,640
-4.106,-9.3925,641
-0.4015,-9.6619,642
1.6171,-9.7134,643
0.0854,-9.727,644
-0.6427,-9.3713,645
-0.5514,-9.8061,646
3.1261,-9.7825,647
-0.9071,-9.6843,648
-0.0014,-9.8455,649
1.1765,-9.719,650
-0.6447,-9.695,651
0.4054,-9.7808,652
0.0677,-9.5239,653
-0.3538,-9.6922,654
0.1647,-9.5726,655
-0.1046,-9.6696,656
-0.5649,-9.6488,657
-0.5409,-9.7276,658
0.1447,-10.1396,659
0.04,-9.0864,660
0.1063,-9.3125,661
-0.1223,-10.0053,662
1.5448,-9.705,663
1.0647,-9.8551,664
-0.1581,-9.923,665
0.2145,-9.9728,666
0.1813,-9.8338,667
1.5206,-9.8213,668
0.0088,-9.655,669
0.104,-9.6928,670
-0.1669,-9.7135,671
-0.0267,-9.7414,672
0.5757,-9.7024,673
-0.1331,-9.737,674
-0.8959,-9.6854,675
0.1983,-9.695,676
-0.1675,-9.6973,677
-0.1695,-9.6952,678
-0.1924,-9.6945,679
-0.4238,-9.6901,680
-0.6373,-9.6785,681
-0.0189,-9.6813,682
0.0918,-9.6947,683
-0.274,-9.6906,684
-0.1318,-9.6885,685
-0.6254,-9.6881,686
-0.402,-9.6815,687
-0.6192,-9.6836,688
0.5668,-9.6882,689
-0.2706,-9.69,690
-0.2417,-9.6879,691
-0.1322,-9.6878,692
-0.3305,-9.6867,693
-0.2226,-9.6849,694
-0.2011,-9.6848,696
-0.2966,-9.6822,697
-0.1686,-9.6838,698
-0.4747,-9.6822,699
-0.1141,-9.6838,700
-0.3763,-9.6821,701
-0.2663,-9.6824,702
-0.2504,-9.68,703
-0.0394,-9.6817,704
0.6674,-9.6734,705
1.4493,-9.6542,706
-1.7104,-9.6312,707
-0.5969,-10.4532,708
1.4963,-9.7771,709
-3.2365,-9.6115,710
-0.5954,-9.6503,711
0.8246,-9.7528,712
1.1071,-10.2782,713
17.013,-9.4098,714
-0.617,-9.477,715
-0.8802,-9.7997,716
-0.3623,-9.7111,717
-0.8262,-10.0647,718
-0.345,-9.9138,719
-0.06,-9.6077,720
-0.3132,-8.6008,721
0.0886,-9.7713,722
-0.5232,-9.5848,723
0.7893,-9.7473,724
-0.7297,-9.434,725
-0.4002,-9.7706,726
0.3874,-9.9042,727
0.8105,-9.645,728
0.387,-9.7368,729
-0.2254,-9.5561,730
-1.3698,-9.6877,731
-0.5711,-9.7039,732
-0.3066,-9.6866,733
0.5837,-9.8359,734
-0.6175,-9.6915,735
0.0616,-9.6144,736
-0.6339,-9.8005,737
-0.7144,-9.8612,738
0.1744,-9.7485,739
0.1865,-9.7071,740
1.6151,-9.4653,741
0.2327,-9.6055,742
-0.1217,-9.7168,743
-2.3412,-9.6321,744
-0.4639,-9.692,745
-0.1783,-9.8336,746
3.4161,-9.6899,747
8.8517,-9.8914,748
1.9386,-9.6152,749
2.3654,-9.9936,750
-0.0418,-9.8372,751
-1.8936,-9.7007,752
-0.7429,-9.837,753
-0.3983,-9.8012,754
-0.8289,-9.6102,755
0.5093,-9.3995,756
1.9288,-9.6335,757
0.0332,-9.7451,758
14.4655,-10.1617,759
1.0301,-9.8045,760
-7.8665,-9.6256,761
-5.3046,-9.5603,762
0.3939,-9.6432,763
-0.0464,-9.5492,764
0.5371,-8.6616,765
-0.447,-9.2101,766
-0.3553,-9.7248,767
0.7514,-9.4934,768
-0.6986,-9.7129,769
-0.3745,-9.4124,770
-2.2859,-9.5976,771
-1.0764,-9.8005,772
-1.0261,-9.839,773
-0.0385,-9.5361,774
-1.0067,-9.4669,775
-0.4206,-9.686,776
-0.7319,-9.811,777
-0.5592,-9.79,778
-0.211,-9.7373,779
-1.0778,-9.7033,780
-1.2539,-9.6661,781
0.293,-9.5986,782
0.3365,-9.6994,783
0.8072,-9.7172,784
-1.5723,-9.8323,785
-0.0423,-9.7544,786
0.6588,-9.5247,787
-0.0578,-9.5861,788
-0.3754,-8.8034,789
-2.032,-9.7123,790
-1.3313,-9.7405,791
0.7341,-9.7305,792
-0.2084,-9.3353,793
-0.0734,-9.6061,794
0.6681,-7.9077,795
-0.3949,-9.611,796
-3.1762,-9.2456,797
-0.2127,-10.3936,798
0.1645,-9.9385,799
-1.4823,-9.5129,800
1.5778,-9.8202,801
1.3943,-9.7829,802
-0.5004,-9.9241,803
-0.5861,-9.5603,804
0.5848,-9.968,805
-0.6932,-9.5321,806
0.1766,-9.6113,807
-0.4725,-9.653,808
1.5279,-9.7517,809
-1.6,-9.8536,810
-0.8039,-9.8585,811
0.679,-9.6841,812
-0.7388,-9.6679,813
-1.1604,-9.7589,814
-0.0164,-9.6184,815
1.2253,-10.0165,816
-0.42,-9.4589,817
-1.5605,-9.2261,818
-0.9243,-9.814,819
2.0825,-10.1511,820
-1.0407,-9.7645,821
1.0048,-9.7962,822
-0.4791,-9.6482,823
-1.0951,-9.6062,824
-1.409,-9.7043,825
-0.7,-9.8125,826
0.0067,-9.5999,827
-0.8092,-9.8926,828
-0.6734,-9.6892,829
-0.2604,-9.7468,830
2.5824,-9.5924,831
-0.8292,-9.5938,832
-0.4774,-9.739,833
0.5585,-9.8003,834
1.452,-9.6966,835
0.5743,-9.6737,836
-0.0356,-9.6934,837
1.2411,-9.3924,838
0.0384,-9.6224,839
0.0739,-9.7124,840
0.101,-9.7635,841
-0.1137,-9.6703,842
-0.1028,-10.0611,843
0.5436,-9.6798,844
-0.2198,-9.475,845
2.4065,-9.8722,846
4.9436,-9.7233,847
0.6813,-10.0199,848
5.543,-9.7657,849
0.043,-9.7476,850
-0.1506,-9.7147,851
-0.1552,-9.6692,852
10.5765,-9.8191,853
-1.3154,-9.4998,854
-0.2507,-9.8989,855
-0.8939,-9.5773,856
-0.6781,-9.8939,857
-1.4554,-10.2701,858
5.041,-9.9495,859
0.2299,-9.381,860
0.2992,-9.6565,861
-0.1564,-9.4938,862
0.0174,-10.3779,863
1.1102,-9.8619,864
-0.0798,-9.9515,865
-0.3458,-9.7274,866
0.6103,-9.9865,867
1.4398,-9.3037,868
0.0358,-9.712,869
-0.5572,-9.9219,870
11.3165,-9.8191,871
0.4033,-9.3226,872
-0.2411,-9.4231,873
-0.9104,-9.7667,874
-0.9168,-10.0597,876
-0.4814,-9.7782,877
0.3688,-9.7416,878
6.9085,-9.8146,879
0.8226,-9.7543,880
0.6695,-9.7559,881
28.8153,-9.4457,882
32.3666,-6.1935,883
1.9276,-9.815,884
0.0143,-9.7757,885
0.1776,-9.5582,886
-3.1228,-9.6531,887
-0.2239,-9.6896,888
-0.2969,-9.7107,889
0.8096,-9.7213,890
3.4711,-9.8065,891
6.7534,-10.0019,892
6.5118,-8.7164,893
0.0356,-9.2179,894
-0.3035,-9.6525,895
-3.2039,-9.5875,896
-0.3293,-9.503,897
-0.0269,-9.7287,898
0.1296,-9.7695,899
-0.0778,-9.6107,900
0.0878,-9.6393,901
-0.23,-9.6752,902
-0.073,-9.7232,903
0.7669,-9.7644,904
-0.3093,-9.5504,905
-0.7299,-10.0435,906
5.9972,-9.879,907
1.6914,-10.0122,908
-0.3658,-10.3456,909
-1.7721,-9.6518,910
-0.0433,-9.6346,911
-2.4895,-9.7716,912
-0.3134,-9.452,913
-1.498,-9.52,914
0.5436,-9.6358,915
-0.361,-9.6054,916
-1.2006,-9.7807,917
-0.0667,-9.642,918
0.3613,-9.4614,919
0.1231,-10.0428,920
-0.2123,-9.7303,921
0.1483,-9.927,922
1.5955,-9.5239,923
-0.3135,-9.2057,924
-0.7069,-9.8868,925
-2.0641,-10.1509,926
2.9543,-9.9791,927
0.8474,-9.6742,928
1.1144,-9.7359,929
9.6422,-9.7195,930
0.0042,-9.6771,932
0.0264,-9.6608,933
1.2608,-9.5656,934
-0.3221,-9.6295,935
-0.852,-9.7635,936
0.9299,-9.6205,937
-0.3044,-9.1932,938
-5.6815,-9.5136,939
-0.4142,-9.3546,940
0.1951,-9.6268,941
-1.5864,-9.5415,942
-1.0661,-9.7253,943
-1.6525,-9.3203,944
-0.4916,-9.1517,945
-0.5793,-9.8765,946
0.9033,-9.974,947
-1.5584,-9.7146,948
13.766,-9.7754,949
0.7728,-9.6351,950
0.9457,-9.7073,951
13.6919,-9.7892,952
1.4709,-9.7121,953
-0.1994,-9.4747,954
0.186,-9.6244,955
-0.0177,-9.8461,956
0.3402,-9.4993,957
0.1703,-9.61,958
