AYGX_mean,AZ_mean,timestamp
-0.8758,-9.7459,1
-2.9,-9.6689,3
-0.625,-9.6277,5
-3.4421,-9.5891,6
4.4487,-9.7084,7
-0.326,-9.7459,8
0.2272,-9.7446,9
0.092,-9.7452,10
-2.7387,-9.7182,11
4.621,-9.7393,12
-0.0366,-9.7542,13
-6.4522,-9.6829,14
-0.9863,-9.7209,15
-0.827,-9.6985,16
-1.3488,-9.6961,17
-2.3697,-9.7044,18
0.7405,-9.7019,19
1.0932,-9.7209,20
0.1729,-9.7263,21
0.5273,-9.7254,23
2.632,-9.7976,24
-6.3168,-9.6454,25
3.2072,-9.6135,26
-1.5037,-9.6666,27
-4.738,-9.7138,28
6.5973,-9.7087,29
-4.1787,-9.6632,30
-6.3964,-9.6964,31
2.1639,-9.6835,33
4.3556,-9.5941,34
-12.1951,-9.5999,35
5.6171,-9.6579,36
-2.5728,-9.7121,37
-8.2033,-9.7681,38
-4.2439,-9.795,39
-3.3312,-9.6654,40
-1.7191,-9.7247,42
1.1242,-9.6828,43
0.3675,-9.693,44
-2.4204,-9.7103,45
3.8219,-9.756,46
3.687,-9.7064,48
-3.6525,-9.7451,49
-0.0876,-9.7561,50
-0.2542,-9.7568,51
-0.0361,-9.7656,52
-0.0946,-9.7523,53
0.0514,-9.759,54
-0.0245,-9.7641,55
-0.0681,-9.7683,56
-0.0006,-9.765,57
0.0163,-9.7545,59
0.4552,-9.7591,60
1.2231,-9.7713,61
-1.1175,-9.2369,62
-4.3068,-9.4217,63
3.2163,-9.7262,65
-21.0124,-9.5663,66
1.4221,-9.7198,67
-3.9977,-9.7002,68
1.7681,-9.7717,69
-0.1037,-9.749,70
0.0898,-9.7711,71
1.5367,-9.7108,72
-4.1366,-9.7602,73
0.3065,-9.7251,74
-0.0154,-9.7517,75
-0.1756,-9.8199,76
0.9262,-9.7651,77
-1.7751,-9.7391,78
1.4732,-10.1735,79
-0.234,-9.8292,80
-6.9875,-9.6838,81
-5.3334,-9.7123,83
-0.0435,-9.7239,84
-0.0253,-9.7263,85
-0.0325,-9.7247,86
0.0207,-9.7255,87
-0.007,-9.7242,88
0.0086,-9.7272,89
-0.0078,-9.7265,90
0.0096,-9.7256,91
-0.02,-9.7286,92
-0.0074,-9.7257,93
-0.0324,-9.6701,94
-5.1286,-9.6454,95
-1.8277,-9.6268,96
-7.1042,-9.6752,97
0.6864,-9.7355,98
0.2532,-9.7393,99
0.8146,-9.7172,100
-0.6452,-9.7502,102
0.6788,-9.7563,103
-0.1697,-9.7553,104
1.5581,-9.7036,105
0.607,-9.7654,106
-0.0301,-9.7496,107
0.2496,-9.7588,108
-0.2148,-9.7592,109
-0.1126,-9.7576,110
-0.0495,-9.755,111
-2.8849,-9.7083,112
-0.0031,-9.7032,113
1.4315,-9.7513,114
-0.291,-9.7445,116
-0.8595,-9.757,117
0.5756,-9.7467,118
0.2006,-9.7615,119
-0.174,-9.7584,120
-0.5095,-9.7555,121
1.4194,-9.7561,122
-2.7704,-9.7548,123
0.4033,-9.7668,125
1.5864,-9.7742,126
2.3577,-9.7969,127
0.4584,-9.8255,129
1.0047,-9.7176,130
0.0338,-9.7549,131
-0.9107,-9.7512,133
-0.101,-9.7568,134
-0.4075,-9.5662,135
-3.4602,-9.756,136
-1.3589,-9.4642,137
-4.3198,-9.7365,138
0.304,-9.7875,139
0.0544,-9.7505,141
0.2313,-9.7599,142
1.1114,-9.7458,143
2.726,-9.8521,144
-0.3236,-9.7553,146
0.1105,-9.721,148
-0.1387,-9.753,149
0.0359,-9.7335,150
0.9818,-9.7259,151
-3.1346,-9.7015,152
0.6645,-9.7566,154
2.5268,-9.8157,155
0.0885,-9.7659,156
1.4917,-9.7668,158
0.1176,-9.7616,159
0.413,-9.7868,160
-0.0744,-9.765,161
0.1677,-9.7186,163
0.6342,-9.7008,164
1.2473,-9.7961,165
-0.1863,-9.8,166
0.6683,-9.7966,167
-6.0802,-9.6651,168
18.263,-9.7742,169
0.3851,-9.9483,170
2.9545,-9.7313,171
0.322,-9.7846,172
0.7248,-9.7516,173
-0.5894,-9.7904,174
-0.599,-9.7296,175
-0.0801,-9.8081,176
-3.9665,-9.8315,177
3.2757,-9.8678,178
0.2005,-9.7254,179
1.5711,-9.8211,180
0.6373,-9.7291,181
0.2998,-9.7674,182
0.236,-9.8408,183
0.0968,-9.7733,184
-0.0365,-9.8213,185
0.2456,-9.7754,186
12.3216,-9.8187,187
38.3426,-9.5812,188
0.6333,-9.8527,189
0.6406,-9.8305,190
-0.6929,-9.715,191
-1.7041,-9.8632,192
5.0445,-9.819,193
-1.337,-9.5083,194
9.7191,-9.6894,195
-5.0061,-9.8267,196
-3.6172,-9.7004,199
-0.9939,-9.761,200
1.681,-9.7842,201
0.1023,-9.9456,202
-0.0492,-9.7737,203
-0.0438,-9.5033,204
1.6617,-9.8093,205
2.1709,-9.8383,206
1.1565,-9.866,207
-0.0273,-9.5432,208
0.9953,-9.8309,209
2.1544,-9.762,210
14.6327,-9.7153,211
0.5732,-9.9635,212
0.1812,-9.755,213
-1.1819,-9.8051,214
0.4145,-9.749,215
-0.4707,-9.7537,216
0.3349,-9.7762,217
0.0773,-9.7546,219
-3.8683,-9.7206,220
0.8879,-9.7407,221
0.2282,-9.7911,222
-2.1098,-9.7477,223
-2.9644,-9.6677,224
1.5006,-9.75,225
1.0353,-9.7331,226
-0.4219,-9.831,227
-0.0044,-9.7902,228
2.3184,-9.7259,229
-0.7089,-9.8325,230
0.0849,-9.789,231
-0.1126,-9.7323,232
-1.4772,-9.7561,233
1.4352,-9.7317,234
8.2533,-9.8585,235
0.2432,-9.6448,236
-4.1325,-9.7782,237
1.4186,-9.7976,238
-0.6289,-9.8447,239
-0.1174,-9.7483,240
2.8698,-9.828,241
-0.3122,-9.7378,243
1.59,-9.7759,244
0.718,-9.7601,245
-0.3893,-9.6839,246
1.0833,-9.7481,247
0.568,-9.7517,248
-0.1091,-9.7606,249
-0.4088,-9.776,250
0.005,-9.737,251
0.2404,-9.7853,252
-0.109,-9.7246,253
1.1394,-9.7949,254
2.5981,-9.7715,255
1.3349,-9.8313,256
0.214,-9.7799,257
0.4121,-9.7956,258
-0.0806,-9.7767,259
0.153,-9.7819,260
0.1615,-9.7078,261
0.8358,-9.8667,263
1.1233,-9.7722,264
0.2524,-9.7386,265
0.3708,-9.9643,266
0.5491,-9.7259,267
-0.2845,-9.8421,268
0.4994,-9.8523,269
0.1948,-9.7518,270
-0.4354,-9.763,271
1.2556,-9.7553,273
0.3098,-9.7494,274
0.3159,-9.7357,275
0.783,-9.8014,276
0.0731,-9.8352,277
0.1765,-9.8629,278
0.9167,-9.9193,279
0.5199,-9.7926,280
0.2477,-9.3884,281
0.8548,-9.7588,283
0.6466,-9.8315,284
0.3892,-9.6431,285
0.7593,-9.9413,286
1.9877,-9.5596,287
-0.3096,-9.944,288
0.6314,-9.5857,289
0.6765,-9.4189,290
0.1266,-9.7195,291
0.417,-9.7408,293
0.7435,-9.722,294
-0.9666,-9.814,295
-0.5888,-9.9998,296
-0.3397,-9.7733,297
0.1206,-9.6486,298
2.3475,-10.3111,299
0.1997,-9.4949,300
8.5848,-9.7373,301
0.9231,-9.6784,303
0.7812,-9.7896,304
1.4672,-9.8036,305
0.2291,-9.981,306
0.7644,-9.3231,307
-0.014,-9.6812,308
-0.5111,-9.8745,309
3.2597,-9.6505,310
2.5398,-9.7949,311
-0.2583,-9.7443,312
1.8351,-9.7764,313
1.0946,-9.7974,314
0.1314,-9.7251,315
0.6389,-9.8133,316
0.0905,-9.6594,317
-0.0751,-9.6742,318
-0.5186,-10.0516,319
-0.0044,-9.7513,320
0.1912,-9.5478,321
0.2976,-9.3602,323
-1.7117,-10.2814,324
0.2084,-9.7488,325
0.5478,-9.5335,326
0.1551,-9.7773,327
7.7592,-9.675,328
5.0911,-9.7388,329
3.13,-9.8607,330
-0.4986,-10.0136,331
1.2037,-9.7968,333
-0.2724,-9.7285,334
2.1469,-10.1519,335
0.9727,-10.1515,336
-1.4567,-9.7965,337
1.4514,-9.3807,338
-1.0464,-9.7393,339
1.6038,-9.8022,340
1.1252,-9.8702,341
0.1604,-9.634,343
0.0064,-9.6474,344
-0.0548,-9.8318,345
0.695,-9.6883,346
-0.1543,-9.9869,347
1.4606,-9.8315,348
0.5805,-9.6606,349
-0.1486,-9.8277,350
-0.299,-9.726,351
0.7481,-9.6089,353
0.4431,-9.5836,354
0.8372,-10.043,355
0.4147,-10.0602,356
4.2191,-9.8133,357
0.333,-10.1024,358
0.9718,-9.5262,359
1.0082,-9.8069,360
-0.7331,-9.8606,361
3.01,-9.7049,363
-1.5953,-9.7227,364
0.1561,-9.8214,365
-2.093,-9.8312,366
3.5658,-9.8551,367
1.1178,-9.6483,368
2.7822,-9.4237,369
0.4139,-9.8189,370
0.7015,-9.6952,371
-0.3218,-9.7723,372
-0.1085,-9.6319,373
0.9215,-9.7797,374
-0.0698,-9.7739,375
-0.599,-9.739,376
-0.6619,-9.8839,377
1.2144,-9.7282,378
-5.2284,-9.6614,379
1.7191,-9.7545,380
-0.1528,-9.5892,381
1.9949,-9.7527,383
0.698,-9.8122,384
0.3453,-9.7725,385
1.5984,-9.5341,386
1.8044,-9.4803,387
0.2458,-9.7509,388
0.33,-9.4814,389
1.4073,-9.7308,390
7.2118,-9.5463,391
2.7941,-9.7263,393
1.0178,-9.7691,394
1.1694,-9.7504,395
-0.3871,-9.8933,396
0.1505,-9.7033,397
0.4943,-9.7803,398
-0.1658,-9.897,399
2.0896,-9.7551,400
2.6253,-10.2378,401
2.4965,-9.7342,403
0.5746,-9.696,404
3.5267,-10.1559,405
5.7649,-9.7039,406
12.0059,-9.747,407
0.8146,-9.8451,408
0.159,-9.5285,409
0.0434,-9.7582,410
0.415,-9.6243,411
0.5175,-9.7853,413
0.0163,-9.7716,414
1.2073,-9.8027,415
-0.0116,-9.8261,416
0.0972,-9.8839,417
1.5807,-9.6446,418
0.1957,-9.7923,419
-0.0156,-9.7713,420
-0.2112,-9.7728,421
-0.1467,-9.7612,423
2.063,-9.8067,424
-1.6659,-9.696,425
-0.3326,-9.7946,426
1.4438,-9.7321,427
0.7115,-9.9557,428
0.6118,-9.609,429
-0.6974,-9.9,430
0.995,-9.6364,431
-0.0556,-9.7941,433
0.7534,-9.7104,434
-0.3865,-10.1045,435
-0.9036,-9.9115,436
6.0092,-9.2438,437
-0.1796,-9.9295,438
0.4379,-9.4163,439
-0.1582,-9.6874,440
0.0954,-9.8055,441
0.7474,-9.7424,443
0.3454,-9.781,444
0.2543,-9.6844,445
-0.1053,-10.1116,446
-1.1383,-9.9133,447
1.6286,-9.6853,448
0.2804,-9.8566,449
0.3435,-9.343,450
0.9994,-9.6995,451
-1.8183,-9.841,453
3.4651,-9.7885,454
-14.6817,-9.7979,455
-3.4262,-9.6997,456
0.8961,-9.7417,457
0.7854,-9.6185,458
0.6509,-9.7097,459
-5.952,-9.6604,460
3.3219,-9.5871,461
-4.3629,-9.5551,463
3.9865,-9.4951,464
5.6933,-9.6048,465
0.9741,-9.6483,466
1.1537,-9.7334,467
-2.2878,-9.6924,468
1.8407,-9.7149,469
-0.3384,-9.7139,471
-0.0871,-9.698,472
-0.4394,-9.6934,473
0.4353,-9.6821,474
2.0923,-9.6962,475
0.5485,-9.7131,476
-0.4819,-9.7026,477
0.565,-9.6906,478
-1.6936,-9.6777,479
0.0915,-9.7077,480
0.1537,-9.7066,481
-0.0467,-9.6977,483
-0.5794,-9.6986,484
-0.1763,-9.685,485
-0.1619,-9.683,486
-1.9689,-9.6636,487
4.522,-9.6644,488
-2.5508,-9.6888,489
0.0943,-9.6616,490
0.9439,-9.6799,491
-0.9517,-9.6812,492
-1.5125,-9.6622,493
-1.5006,-9.661,494
-1.5428,-9.7218,495
-3.1208,-9.7796,496
-2.8408,-9.9127,497
2.2845,-9.6165,498
-0.7015,-9.8588,499
2.5757,-9.5939,500
2.8311,-9.7833,501
1.0203,-9.8514,503
2.072,-9.6596,504
0.1479,-9.5772,505
-1.2612,-9.621,506
0.14,-9.9059,507
1.3324,-9.8515,508
-1.092,-9.8832,509
2.6325,-9.6605,510
1.0965,-9.9462,511
3.3653,-9.6288,513
-0.0998,-9.7577,514
1.8266,-9.8725,515
2.5457,-9.7558,516
-0.1924,-9.77,517
2.6915,-9.8644,518
1.3184,-9.7491,519
-9.6662,-8.17,520
0.8417,-9.7953,521
0.7774,-9.8995,523
0.2066,-9.7004,524
-0.0619,-10.0472,525
0.6052,-9.5721,526
0.5314,-9.9716,527
0.0563,-9.4038,528
1.5225,-9.6672,529
0.0941,-9.8706,530
0.1676,-9.759,531
0.4537,-9.8518,533
0.6322,-9.7093,534
1.6016,-10.0516,535
-0.648,-10.1314,536
0.4483,-9.9279,537
0.8928,-10.1067,538
-0.1123,-9.6101,539
-0.8693,-9.9731,540
-0.0562,-9.8561,541
0.4702,-9.9086,543
0.3522,-9.7425,544
0.1339,-9.6547,545
-0.0055,-9.8903,546
-0.0562,-10.1379,547
-0.0798,-9.4464,548
0.6923,-9.7526,549
-0.129,-10.1392,550
-0.0321,-9.7895,551
0.0913,-9.6533,552
0.3548,-9.8059,553
0.6095,-9.7373,554
0.6258,-9.7777,555
0.0196,-9.892,556
0.3357,-9.755,557
0.8048,-9.6958,558
-0.0014,-9.8074,559
0.4879,-9.7679,560
-0.854,-9.7367,561
0.1946,-9.8989,563
2.118,-9.7182,564
4.89,-9.8299,565
-1.2071,-9.8254,566
1.8373,-9.7474,567
0.1093,-9.8608,568
-0.7947,-9.7283,569
-2.4963,-9.7469,570
-1.5714,-9.7138,571
-0.4089,-9.6829,572
4.2724,-9.6212,573
-9.4755,-9.6305,574
1.9127,-10.026,575
0.9459,-9.7879,576
0.9888,-9.7182,578
-0.4167,-9.8526,579
1.2872,-9.5476,580
0.9448,-9.6936,581
1.0574,-9.4908,582
0.0017,-9.3082,583
-0.2588,-9.5536,584
0.3835,-9.9042,585
0.7725,-9.7168,586
-0.3074,-9.7395,587
3.5045,-9.7924,588
1.1538,-9.771,589
-1.5328,-9.7769,590
0.6812,-9.7371,591
-0.6449,-9.9024,592
-0.7337,-9.6032,593
-0.3971,-9.2913,594
-0.1239,-10.088,595
3.7069,-9.6629,596
2.1335,-9.7236,597
0.6946,-9.6845,598
-0.0055,-9.845,599
1.6721,-9.9294,600
-0.1754,-9.6603,601
0.4273,-10.2225,602
-0.5965,-9.2271,603
-0.0239,-9.6931,605
1.4859,-9.7498,606
-0.3115,-9.7308,607
0.4303,-9.7454,608
0.3768,-9.759,609
0.3647,-9.7877,610
1.0568,-9.8486,611
0.0772,-9.6098,612
1.7225,-9.7782,613
2.1824,-9.6812,614
-0.0522,-9.6377,615
0.4643,-9.8114,616
0.3665,-9.6077,617
-0.1046,-9.6563,618
2.9757,-9.7921,619
-0.2628,-9.6963,620
1.3369,-9.9174,621
1.9302,-10.2249,622
0.1525,-9.7056,623
2.6696,-10.1052,624
0.3216,-10.0831,625
0.9712,-9.1967,626
0.0405,-9.8318,627
1.2272,-9.0812,628
0.0804,-9.5852,629
2.4953,-10.2191,630
-1.4234,-9.1237,631
0.4506,-9.4582,632
-3.4419,-8.9311,633
2.0311,-10.0683,634
0.652,-9.3584,635
2.7765,-9.6703,636
-0.8529,-9.7483,637
-3.097,-9.4394,638
-0.8162,-9.8133,639
-2.6638,-9.8093,640
-3.689,-9.6226,641
2.3595,-9.5833,642
-0.4329,-8.7175,643
0.7305,-9.3707,644
-0.0029,-9.5405,645
1.6162,-9.5496,646
1.2258,-9.8119,647
1.2612,-9.7411,648
0.3877,-9.8222,649
-0.8416,-9.5308,650
0.2905,-9.6899,651
0.5918,-9.5616,652
0.7127,-9.5663,653
0.7554,-9.899,654
0.5821,-9.4586,655
0.3985,-9.7897,656
-0.3203,-10.018,657
0.3414,-9.9378,658
1.0451,-9.8518,659
-0.3276,-9.6771,660
-0.6745,-10.2216,661
1.9812,-9.684,662
-0.1811,-9.6188,663
-0.2733,-9.4631,664
0.7288,-9.8966,665
-1.6989,-10.1418,666
2.7967,-9.6771,668
0.7265,-9.6643,669
0.6295,-9.4412,670
7.8671,-10.2455,671
0.3927,-9.8164,672
0.1324,-9.8431,673
1.5508,-9.7485,674
0.4781,-9.6984,675
0.0714,-9.694,676
0.4028,-9.6762,678
0.1317,-9.7058,679
0.5816,-9.772,680
1.0137,-9.7827,681
-0.1322,-9.8284,682
0.248,-9.8245,683
0.8464,-9.8211,684
0.7119,-9.7716,685
-0.0083,-9.7992,686
-0.2049,-9.7733,688
-0.5072,-9.7753,689
0.7674,-9.6714,690
-2.2656,-9.7353,691
4.2688,-9.8244,692
3.7712,-9.9255,693
-1.235,-9.717,694
-0.6066,-9.7866,695
-0.3477,-9.6747,696
0.5484,-9.7689,698
3.5754,-9.8111,699
-6.9723,-9.2046,700
-40.0329,-9.4717,701
16.1751,-9.9812,702
2.6951,-10.2109,703
-1.5823,-9.7222,704
-0.4556,-9.806,705
-1.2865,-9.7345,706
0.704,-9.7627,708
0.8715,-9.8348,709
-0.5669,-9.6588,710
0.8167,-9.7583,711
-0.2772,-9.4216,712
-1.2094,-8.8412,713
-3.1208,-9.7949,714
2.2604,-9.7489,715
5.8665,-10.4968,716
6.9981,-9.618,718
1.0363,-9.5443,719
2.3804,-8.9965,720
-0.5336,-9.4806,721
0.1216,-10.1067,722
1.5685,-9.7689,723
-0.7657,-9.1624,724
0.403,-9.5044,725
-0.0316,-9.7465,726
0.1891,-9.9096,728
-1.1136,-9.591,729
-2.0733,-9.621,730
-0.5197,-9.7328,731
0.0802,-9.909,732
0.9447,-9.8089,733
-0.2613,-9.8151,734
0.9781,-9.7192,735
0.4519,-9.9366,736
0.2042,-9.8653,738
2.1103,-9.7954,739
3.6832,-10.0748,740
-2.5298,-9.5974,741
1.6729,-9.8499,742
2.3649,-9.3956,743
-1.0243,-10.5532,744
1.2066,-9.8124,745
1.7412,-9.9284,746
0.6728,-9.8781,748
0.6566,-9.6179,749
-0.6204,-10.2777,750
0.9157,-9.8911,751
-1.0241,-9.5182,752
0.1983,-9.6861,753
-0.1711,-9.7818,754
0.6455,-9.6665,755
0.7144,-9.7559,756
-0.1201,-9.8171,758
1.6406,-9.6081,759
-0.6379,-10.3163,760
1.2643,-9.9709,761
0.1017,-9.5107,762
-1.0548,-9.5542,763
0.1036,-9.6183,764
0.8687,-9.8301,765
-0.1107,-9.633,766
2.0285,-9.5378,768
1.6329,-9.6147,769
-0.8789,-8.946,770
1.0377,-9.4102,771
9.76,-9.9227,772
4.9509,-9.3706,773
3.7215,-9.5529,774
-0.0268,-9.7471,775
-0.3806,-9.971,776
4.5789,-8.8538,778
2.3707,-9.8167,779
-0.3894,-9.7571,780
0.5716,-9.6142,781
0.0888,-9.7852,782
4.0355,-7.9775,783
1.3053,-9.7779,784
-2.6987,-9.8522,785
0.8207,-9.7075,786
-5.7063,-9.3874,788
-0.7455,-9.8063,789
15.9006,-9.8195,790
14.366,-9.8445,791
-18.8946,-9.5005,792
11.3155,-9.479,793
2.4127,-9.5978,795
3.0445,-9.5192,796
-2.3772,-9.6955,797
-4.8521,-9.4588,798
3.5838,-9.7732,799
9.9873,-9.6763,800
15.8209,-9.9728,801
0.294,-10.1053,802
-2.0921,-9.7396,803
4.5579,-9.7499,804
1.665,-9.7593,805
-1.4267,-9.7906,806
-0.7058,-9.7958,807
3.1413,-9.8278,808
34.2124,-9.7164,809
-6.5483,-9.4167,810
7.5698,-9.5171,811
3.4394,-9.6913,812
-0.7644,-9.9373,813
4.6805,-9.7778,814
-3.1325,-9.7547,815
-2.0844,-9.786,817
4.7758,-9.7227,818
1.0161,-9.6653,819
2.9376,-9.8655,820
0.0367,-9.7597,821
-0.4883,-9.7157,822
0.3533,-9.7248,823
1.4011,-9.7177,825
-1.6315,-9.7032,826
2.6714,-9.7013,827
-1.2075,-9.8452,828
1.4642,-9.731,829
-0.6846,-9.7682,830
0.8537,-9.7893,831
-0.1847,-9.752,832
1.0198,-9.7141,833
0.9498,-9.8096,834
-1.2807,-9.8175,835
1.0484,-9.7503,836
0.6717,-9.7171,837
0.5834,-9.7089,838
-0.385,-9.8077,839
-1.1106,-9.9007,840
2.5724,-9.7237,841
0.4722,-9.7928,843
2.1115,-9.6921,844
-4.5127,-9.8502,845
-2.9878,-9.7165,846
0.0378,-9.7376,847
-0.0559,-9.7106,848
-0.4763,-9.7623,849
0.0711,-9.8167,850
-1.0212,-9.7676,851
1.333,-9.8545,852
5.9954,-9.8104,853
-1.0305,-9.7668,854
-1.7729,-9.7796,855
3.7093,-9.5509,856
-0.0125,-9.8754,857
0.2384,-9.8089,858
-0.2542,-9.8235,859
0.1815,-10.002,860
1.1234,-9.4738,861
8.7353,-9.7656,863
3.5129,-9.8054,864
0.9813,-9.5922,865
2.64,-9.4479,866
-1.3732,-9.7008,867
0.0003,-9.7459,868
-1.1939,-10.0643,869
0.2637,-9.4759,870
0.3882,-10.0514,871
2.6817,-9.6688,873
0.5037,-9.7772,874
0.5848,-9.9278,875
2.0247,-9.7623,876
3.0498,-9.8697,877
0.084,-9.9334,878
0.7348,-9.8603,879
1.7171,-9.7992,880
0.7439,-9.7284,881
0.2291,-9.9958,883
8.1874,-9.5882,884
1.3168,-9.8786,885
-0.0236,-9.8924,886
-0.1577,-9.8748,887
0.7395,-9.7468,888
0.2774,-9.6599,889
0.2455,-9.8838,890
1.2631,-9.7345,891
1.9126,-9.8018,893
-0.2896,-9.812,894
10.2554,-9.7642,895
4.0589,-9.8725,896
5.1477,-9.7507,897
2.9501,-9.7483,898
-4.9753,-9.8055,899
0.2206,-9.7652,900
4.8671,-9.7961,901
-0.2072,-9.7625,903
2.9661,-9.911,904
-0.2367,-9.7633,905
0.5787,-9.8639,906
1.56,-9.9515,907
-0.1833,-9.8901,908
1.7701,-9.8411,909
0.1087,-9.9014,910
2.2127,-9.7029,911
0.386,-9.6684,913
4.3063,-9.6314,914
5.4946,-9.6776,915
8.249,-9.5607,916
-0.0531,-9.325,917
0.8553,-9.8745,918
-2.2377,-9.5885,919
0.9836,-9.4982,920
-0.2861,-9.8603,921
7.6281,-9.7525,923
-0.495,-9.9702,924
1.0775,-9.5534,925
0.6029,-9.719,926
-0.0164,-9.8377,927
1.2168,-9.8132,928
0.7538,-9.7742,929
-0.4898,-9.5364,930
-0.5922,-9.7677,931
1.6281,-9.6897,933
1.1406,-9.8215,934
5.2373,-9.7987,935
1.3737,-9.9904,936
1.2695,-9.8877,937
-0.2553,-9.442,938
0.2741,-9.558,939
0.065,-9.9566,940
0.2877,-9.7045,941
1.7129,-9.7634,943
0.9979,-9.8244,944
0.439,-9.7725,945
-0.0585,-9.8538,946
-0.1584,-9.9028,947
-0.08,-9.9938,948
1.6358,-9.5764,949
5.6621,-9.6842,950
3.8782,-9.8585,951
12.3577,-9.8488,953
1.4092,-9.806,954
3.1999,-9.9503,955
3.6041,-9.6857,956
0.3596,-10.0438,957
0.0132,-9.7045,958
2.989,-9.9924,959
1.0208,-9.8199,960
-0.7788,-9.7775,961
-1.6873,-9.7173,963
0.5161,-9.7433,964
0.7034,-9.7506,965
-0.1865,-9.7714,966
-0.1896,-9.7621,967
-0.0399,-9.7444,968
0.266,-9.7521,969
1.7272,-9.7416,970
-0.0034,-9.7662,971
0.0662,-9.766,973
-0.003,-9.7686,974
-0.0318,-9.766,975
0.1834,-9.7682,976
-0.3442,-9.7652,977
-0.4331,-9.757,978
-0.0086,-9.7536,979
-0.0875,-9.7522,980
-3.824,-9.7207,981
-7.2149,-9.6233,983
2.2909,-9.7173,984
-0.2722,-9.7372,985
-0.5238,-9.7289,986
-0.1383,-9.7146,987
-0.888,-9.6998,988
3.8379,-9.6943,989
-2.1632,-9.6964,990
-1.0319,-9.7294,991
0.1863,-9.7359,993
-0.3619,-9.7349,994
0.1202,-9.7357,995
0.3357,-9.7391,996
-0.6272,-9.7574,997
0.8665,-9.7671,998
-0.1942,-9.7869,999
-0.1969,-9.7487,1000
0.1933,-9.7434,1001
-0.2087,-9.7535,1002
0.2887,-9.7598,1003
0.332,-9.7477,1004
0.2288,-9.7672,1005
0.0129,-9.7672,1006
0.1157,-9.7667,1007
-0.1001,-9.7679,1008
0.2164,-9.7585,1009
-0.6221,-9.8041,1010
0.0827,-9.7637,1011
-0.3999,-9.7558,1012
0.1115,-9.7706,1013
-0.0016,-9.769,1014
-0.1204,-9.7663,1015
0.1163,-9.7676,1016
-0.1105,-9.7713,1017
0.0968,-9.7658,1018
-0.0453,-9.7646,1019
-0.022,-9.7699,1020
-0.0277,-9.7675,1021
0.1242,-9.7686,1022
-0.5033,-9.7685,1023
-0.154,-9.7707,1024
-0.1398,-9.7647,1025
-0.3762,-9.7611,1026
0.2605,-9.7585,1027
0.1175,-9.7561,1028
0.3789,-9.7645,1029
-0.035,-9.7629,1030
0.1431,-9.7644,1031
0.2119,-9.7635,1032
-1.1055,-9.7698,1033
0.7916,-9.7512,1034
0.118,-9.7644,1035
0.2062,-9.7554,1036
-2.2716,-9.7502,1037
0.5135,-9.6992,1038
-1.1686,-9.8099,1039
0.8623,-9.8047,1040
2.6521,-9.7947,1041
0.6058,-9.8341,1042
0.487,-9.7561,1043
0.3138,-9.7558,1044
-0.0162,-9.8122,1045
0.1999,-9.7225,1046
-0.9345,-9.7482,1047
2.0276,-9.7591,1048
-3.1486,-9.718,1049
2.5582,-9.7322,1050
0.8859,-9.7481,1051
0.9399,-9.7675,1052
0.1369,-9.7679,1053
-0.3769,-9.7595,1054
-0.1494,-9.7946,1055
-0.0516,-9.7676,1056
-0.0156,-9.7673,1057
-0.0146,-9.762,1058
-0.8219,-9.7524,1059
0.3878,-9.7577,1060
-0.0455,-9.7566,1061
-0.1672,-9.7528,1062
0.0094,-9.7486,1063
0.0715,-9.7501,1064
0.0093,-9.7495,1065
0.1088,-9.7518,1066
0.1705,-9.7497,1067
-0.0484,-9.7517,1068
-5.4349,-9.7043,1069
-2.6413,-9.6314,1070
0.8738,-9.6419,1071
0.2386,-9.6472,1072
0.1657,-9.6494,1073
0.5732,-9.639,1074
0.402,-9.6899,1075
-5.1362,-9.6982,1076
-7.2499,-9.4762,1077
-2.7892,-9.8252,1078
0.06,-9.7307,1079
-1.9301,-9.7523,1080
0.7749,-9.7938,1081
-0.3333,-9.7519,1082
1.6778,-9.8125,1083
-1.9848,-9.8283,1084
-1.041,-9.7063,1085
-0.462,-9.9429,1086
1.7892,-8.8244,1087
1.7875,-9.8665,1088
-1.1578,-10.2185,1089
-0.1038,-9.8533,1090
2.2205,-9.7429,1091
-5.0009,-9.7925,1092
0.9331,-9.6453,1093
-0.5511,-9.5127,1094
-0.0383,-9.7301,1095
0.3542,-9.7188,1096
-0.263,-9.6209,1097
0.5441,-10.2302,1098
0.2029,-9.4751,1099
-0.1941,-10.0545,1100
0.5711,-9.493,1101
-0.6089,-9.6584,1102
0.7587,-9.7643,1103
0.1007,-9.7612,1104
0.0634,-9.7647,1105
2.638,-9.8479,1106
0.0505,-9.7922,1107
-0.2708,-9.7439,1108
0.5153,-9.7744,1109
-0.1693,-9.8253,1110
0.0101,-9.7801,1111
0.394,-9.8014,1112
1.3112,-9.7891,1113
0.4654,-9.7804,1114
0.9236,-9.7129,1115
7.4172,-10.0237,1116
0.5224,-9.7547,1117
-0.7275,-9.6363,1118
0.0273,-9.7556,1119
0.4796,-9.7543,1120
0.4714,-9.9317,1121
2.6143,-8.8993,1123
-0.9131,-9.6596,1124
0.0238,-9.8176,1125
0.7832,-9.9226,1126
-0.0114,-11.0808,1127
-0.7441,-9.5886,1128
-0.0303,-9.9832,1129
0.3006,-9.6882,1130
-0.7461,-9.5895,1131
0.8575,-9.8008,1133
-0.148,-9.8405,1134
0.4892,-9.495,1135
0.5708,-9.7695,1136
0.0165,-9.6046,1137
1.5754,-9.9705,1138
-0.3245,-9.8752,1139
0.8722,-9.8163,1140
0.9139,-9.5581,1141
0.3829,-9.7314,1143
-0.1242,-9.7691,1144
0.1081,-9.8315,1145
0.0428,-9.4989,1146
0.7258,-10.0535,1147
-1.3284,-9.6591,1148
-0.4232,-9.9669,1149
2.3266,-9.6058,1150
2.0353,-9.5147,1151
0.7849,-9.7494,1153
0.088,-9.7994,1154
-0.1004,-9.7833,1155
-0.1708,-9.8965,1156
-2.1313,-9.7956,1157
-0.6824,-9.7058,1158
-0.598,-9.7873,1159
-5.0863,-9.7995,1160
0.6397,-9.5531,1161
-3.0602,-9.6342,1163
-1.1108,-9.7682,1164
-2.0572,-9.7131,1165
-0.086,-9.746,1166
-0.4093,-9.6112,1167
0.2087,-10.135,1168
-0.7156,-9.9084,1169
-0.2681,-9.7326,1170
0.1647,-9.8877,1171
0.6342,-9.6271,1173
0.3525,-9.4686,1174
1.1042,-9.4301,1175
0.2793,-9.4805,1176
1.2137,-9.7647,1177
0.2509,-9.4625,1178
1.2628,-9.5462,1179
0.7786,-9.6524,1180
0.1608,-9.8543,1181
2.4142,-9.716,1183
-0.2386,-9.938,1184
2.5124,-9.221,1185
2.1733,-9.5652,1186
1.6763,-9.6338,1187
0.5497,-9.6764,1188
0.3229,-9.5693,1189
1.1069,-9.5597,1190
-8.3631,-7.4999,1191
-2.6678,-9.5575,1193
-2.1451,-9.8727,1194
-6.8714,-9.7558,1195
-8.5586,-9.7471,1196
-0.5645,-9.7581,1197
-0.0845,-9.7735,1199
-0.3437,-9.7716,1200
0.6843,-9.7659,1201
-0.6001,-9.7286,1202
-2.2017,-9.7514,1203
-1.1488,-9.7483,1204
-0.1338,-9.7617,1205
0.4526,-9.7654,1206
-0.0566,-9.7749,1207
0.0507,-9.7658,1208
0.2404,-9.7693,1209
-0.7453,-9.7659,1210
2.131,-9.7718,1211
-0.2712,-9.793,1212
-0.2336,-9.7737,1213
-1.7144,-9.7364,1214
-0.0971,-9.7659,1215
0.2692,-9.7431,1216
-0.3858,-9.7608,1218
1.1401,-9.7329,1219
0.3143,-9.7722,1220
-0.1523,-9.7667,1221
0.1876,-9.7775,1222
-0.7747,-9.7669,1223
0.394,-9.7712,1224
1.382,-9.7389,1225
0.1966,-9.7653,1226
0.0299,-9.7565,1228
0.4637,-9.7732,1229
-1.9282,-10.117,1230
-1.0304,-9.798,1231
5.978,-9.5213,1232
-4.7364,-9.7226,1233
12.4095,-9.623,1235
-4.6126,-9.7166,1236
7.0516,-9.6547,1237
-5.8129,-9.6985,1238
-1.6979,-9.8967,1239
0.0254,-9.7655,1240
-0.7072,-9.7554,1241
0.0114,-9.7604,1242
0.0558,-9.7672,1243
-0.1304,-9.7665,1244
-0.2569,-9.7636,1246
0.1457,-9.7661,1247
0.0466,-9.7668,1248
0.2206,-9.7649,1249
0.0692,-9.7722,1250
0.0196,-9.7734,1251
0.025,-9.772,1253
0.0123,-9.773,1254
0.0384,-9.7703,1255
0.0123,-9.7711,1256
-0.1399,-9.7698,1257
-0.0975,-9.7704,1258
0.0168,-9.7698,1259
0.0264,-9.7688,1260
-0.0754,-9.769,1261
-0.8002,-9.7699,1263
0.0059,-9.774,1264
-0.0146,-9.7737,1265
-0.0427,-9.7743,1266
-0.3584,-9.7629,1267
-0.0612,-9.7641,1268
-0.8982,-9.7549,1269
-0.1105,-9.7618,1270
0.0458,-9.7591,1271
-0.0765,-9.7599,1272
0.0165,-9.7568,1274
-0.0054,-9.7564,1275
-0.0088,-9.7544,1276
-0.063,-9.7539,1277
-0.0086,-9.7524,1278
-0.0282,-9.7513,1279
-6.2144,-9.7078,1280
0.3984,-9.74,1281
-0.699,-9.734,1282
0.2699,-9.7359,1283
-1.0564,-9.7258,1284
-0.0848,-9.7233,1286
0.3157,-9.742,1287
0.3182,-9.746,1288
-0.1187,-9.7471,1289
-0.407,-9.727,1290
-1.0083,-9.7332,1291
2.9348,-9.7095,1292
-0.246,-9.7644,1293
-3.4415,-9.7688,1294
-0.4098,-9.7322,1296
0.4139,-9.7598,1297
-0.2056,-9.7544,1298
0.2269,-9.7552,1299
-0.7893,-9.7478,1300
0.5568,-9.751,1301
0.2726,-9.7551,1303
-0.8045,-9.7494,1304
0.2733,-9.7392,1305
0.0931,-9.7421,1306
0.0566,-9.7457,1307
0.2161,-9.7473,1308
-0.0857,-9.7457,1309
0.0719,-9.7429,1310
0.3984,-9.7476,1311
-0.2796,-9.757,1313
-0.1396,-9.744,1314
0.3637,-9.7459,1315
0.0926,-9.7497,1316
0.0428,-9.7511,1317
-0.3154,-9.746,1318
0.015,-9.7416,1319
0.2465,-9.7393,1320
0.05,-9.7441,1321
0.1409,-9.7473,1322
-0.1698,-9.7638,1324
0.0782,-9.7739,1325
0.0223,-9.7745,1326
-0.0327,-9.7737,1327
0.0351,-9.7747,1328
-0.0576,-9.773,1329
-0.0724,-9.7728,1330
-0.0256,-9.7748,1331
-0.0223,-9.7736,1333
-0.0348,-9.7738,1334
0.0096,-9.7724,1335
-0.04,-9.7721,1336
0.0196,-9.7733,1337
-0.0465,-9.7736,1338
0.0348,-9.7719,1339
-0.0332,-9.7719,1340
-0.0144,-9.7727,1341
-0.0187,-9.773,1343
-0.023,-9.7737,1344
0.0278,-9.7719,1345
0.0011,-9.7734,1346
-0.0235,-9.7739,1347
-0.0701,-9.7727,1348
0.0753,-9.7732,1349
-0.0202,-9.7723,1350
-0.0435,-9.7727,1351
-0.0282,-9.7726,1352
-0.0449,-9.771,1353
-0.0034,-9.7722,1355
-0.0338,-9.7723,1356
-0.0252,-9.7722,1357
-0.0331,-9.7734,1358
-0.0177,-9.7735,1359
0.0021,-9.7737,1360
-0.0355,-9.7718,1361
-0.0289,-9.773,1363
-0.0186,-9.7729,1364
-0.0291,-9.7708,1365
-0.0434,-9.7719,1366
-0.0152,-9.772,1367
-0.0072,-9.7727,1368
-0.0288,-9.7733,1369
-0.9991,-9.7594,1370
0.7342,-9.7562,1371
0.3166,-9.7625,1372
-0.8844,-9.7661,1373
-0.3183,-9.7696,1374
-0.2448,-9.7631,1375
-1.2451,-9.759,1376
1.5352,-9.7545,1377
-3.3567,-9.6431,1378
-0.6397,-9.8027,1379
-1.3888,-9.7046,1380
2.5182,-9.7404,1381
1.3421,-9.7749,1382
0.3161,-9.7044,1384
-2.9227,-9.7464,1385
0.1026,-9.7234,1386
-3.002,-9.7973,1387
-0.0335,-9.775,1388
1.0112,-9.9743,1389
3.0258,-9.5879,1390
-1.1242,-9.7994,1391
11.3702,-9.5672,1393
0.5248,-9.7733,1394
-0.9297,-9.3881,1395
0.9901,-9.4343,1396
2.0113,-9.82,1397
1.6943,-10.1873,1398
0.129,-9.5987,1399
-0.366,-9.6991,1400
-0.3304,-9.846,1401
4.5903,-9.8509,1403
15.1231,-9.7579,1404
-0.2454,-9.7794,1405
-0.7754,-9.7718,1406
-0.0034,-9.7673,1407
0.1828,-9.7784,1408
0.0504,-9.7711,1409
-0.1107,-9.7851,1410
-0.0721,-9.7762,1411
-0.1482,-9.7708,1413
-0.2526,-9.78,1414
-1.3737,-9.7653,1415
-4.9904,-9.702,1416
3.0239,-9.7414,1417
-5.9147,-9.7182,1418
2.6756,-9.6802,1419
-0.8762,-9.7747,1420
0.436,-9.7478,1421
0.5711,-9.7603,1422
-0.7096,-9.7637,1423
-0.1154,-9.7438,1424
-0.2136,-9.7996,1425
-1.4872,-9.7758,1426
-4.1444,-9.6962,1427
5.3035,-9.7391,1428
-0.3091,-9.7457,1429
-0.2463,-9.7467,1430
-0.4732,-9.7687,1431
3.1073,-9.6852,1432
-1.5332,-9.7401,1433
2.5393,-9.7337,1434
-1.4728,-9.7481,1435
-3.3163,-9.7043,1436
-1.432,-9.6358,1437
0.9182,-9.6649,1438
2.1826,-9.7111,1439
-0.9718,-9.7098,1440
-7.3812,-9.6263,1441
-1.0692,-9.5189,1442
-2.4182,-9.4924,1443
1.6746,-9.4758,1444
1.8884,-9.5269,1445
1.2977,-9.5588,1446
-0.0535,-9.5775,1447
-0.5801,-9.5416,1448
1.7334,-9.5651,1449
2.5016,-9.5871,1450
-11.1707,-9.407,1451
1.291,-9.3814,1452
-4.7469,-9.3316,1453
5.5607,-9.3321,1454
4.6014,-9.4124,1455
3.9442,-9.4826,1456
1.4948,-9.5139,1457
-2.3183,-9.4971,1458
1.0398,-9.5374,1459
2.6705,-9.5592,1460
-1.0733,-9.5713,1461
-4.2862,-9.4926,1462
-0.7617,-9.5028,1463
-1.706,-9.4308,1464
1.8988,-9.2271,1465
4.5982,-9.4927,1466
11.3076,-9.5495,1467
-22.8193,-9.6577,1468
-1.1792,-9.6765,1469
2.7836,-9.7154,1470
1.4122,-9.7301,1471
-7.2065,-9.7163,1472
2.4012,-9.8232,1473
0.9432,-9.7147,1474
1.6454,-9.7117,1475
-3.8466,-9.7071,1476
-0.6092,-9.7864,1477
0.499,-9.735,1478
-1.1814,-9.7138,1479
0.0953,-9.7108,1480
-0.0309,-9.7163,1481
-0.4412,-9.693,1482
2.4605,-9.7245,1483
-3.2979,-9.7347,1484
0.442,-9.6934,1485
-1.0405,-9.7183,1486
-1.8342,-9.7015,1487
-1.229,-9.7169,1488
-0.7812,-9.6786,1489
2.1263,-9.7004,1490
-0.6114,-9.7307,1491
-3.4587,-9.6908,1492
0.2592,-9.665,1493
0.7216,-9.6818,1494
-0.264,-9.7048,1495
0.8587,-9.7322,1496
1.1342,-9.7483,1497
3.7549,-9.7385,1498
-5.3486,-9.7487,1499
-4.122,-9.6896,1500
-2.8542,-9.7278,1501
-3.0622,-9.6968,1502
-0.3405,-9.7178,1503
-1.8434,-9.7003,1504
-2.7159,-9.6665,1505
2.3465,-9.6673,1506
2.0174,-9.7009,1507
1.1061,-9.7732,1508
-0.7749,-9.7125,1509
-2.3192,-9.7134,1510
0.2867,-9.6955,1511
2.3557,-9.7063,1512
-1.3867,-9.7143,1513
-1.4045,-9.6818,1514
0.5105,-9.7206,1515
2.2176,-9.7371,1516
-17.3767,-9.7021,1517
0.6458,-9.6942,1518
-0.6269,-9.7123,1519
-1.2291,-9.6582,1521
9.3882,-9.684,1522
-0.8648,-9.7926,1523
0.0281,-9.7804,1524
-0.1915,-9.7821,1525
-0.8404,-9.7741,1526
-8.3419,-9.7484,1527
-0.7237,-9.7195,1528
0.115,-9.7147,1529
0.1676,-9.7401,1530
-1.4007,-9.7219,1531
-0.9835,-9.7114,1532
1.9094,-9.7757,1533
3.9889,-9.7146,1534
0.5441,-9.7587,1535
-1.0965,-9.6993,1536
0.7919,-9.7658,1537
-0.2941,-9.783,1538
-0.389,-9.7622,1539
0.0123,-9.784,1540
-0.0772,-9.7801,1541
0.0829,-9.7643,1542
-3.3919,-9.7695,1543
2.6551,-9.7564,1544
0.1192,-9.7674,1545
0.1902,-9.7659,1546
0.0053,-9.7714,1547
-0.668,-9.7759,1548
0.2842,-9.7821,1549
-0.0394,-9.7746,1550
-0.0976,-9.7863,1551
-0.0913,-9.7873,1552
1.8007,-9.7648,1553
-0.4204,-9.7561,1554
1.2435,-9.7902,1555
1.582,-9.7586,1556
-0.842,-9.7866,1557
0.0342,-9.7568,1558
0.3027,-9.77,1559
-0.2063,-9.7429,1560
1.1769,-9.782,1561
-1.6453,-9.7716,1562
0.277,-9.7652,1563
-0.1243,-9.7499,1564
-0.0852,-9.7703,1565
0.6416,-9.7829,1566
-0.7301,-9.7715,1567
-3.6679,-9.7383,1568
-3.1019,-9.7333,1569
0.6854,-9.7723,1570
-0.4824,-9.7789,1571
4.338,-9.7921,1572
-0.4657,-9.7751,1573
-0.4545,-9.7665,1574
-2.0639,-9.7471,1575
-2.0656,-9.7535,1576
-0.5936,-9.7786,1577
-0.1253,-9.7926,1578
0.1547,-9.7692,1579
-4.5007,-9.7672,1580
-0.0562,-9.7769,1581
-1.0867,-9.7778,1582
0.5914,-9.7717,1583
-1.0322,-9.773,1584
-1.0022,-9.7648,1585
0.8911,-9.7067,1586
1.4401,-9.7178,1587
-1.3056,-9.7199,1588
-5.8811,-9.7091,1589
-59.5192,-9.159,1590
12.9629,-9.6662,1591
-0.1427,-9.7926,1592
-0.0942,-9.7668,1593
-1.5367,-9.8228,1594
0.1215,-9.815,1595
0.8956,-9.7192,1596
0.145,-9.6104,1597
-5.8782,-9.9106,1598
6.6618,-9.2455,1599
-1.4656,-9.8871,1600
-0.3963,-9.6839,1601
0.2524,-9.7684,1602
-1.2539,-9.8486,1603
0.0392,-9.815,1604
0.178,-9.6858,1605
-0.2147,-9.804,1606
-0.7245,-9.7106,1607
-0.074,-9.7934,1608
-0.3567,-9.7753,1609
4.3038,-9.6981,1610
0.4952,-9.8836,1611
-2.7624,-9.7815,1612
-0.7522,-9.8365,1613
-21.5108,-9.5382,1614
-7.88,-9.4606,1615
9.3843,-9.658,1616
-10.5025,-9.6511,1617
2.0212,-9.3642,1618
6.4622,-9.7181,1619
-8.1796,-9.5921,1621
-1.5321,-9.8528,1622
-0.5658,-9.6864,1623
0.2946,-9.764,1624
1.1367,-9.7265,1625
0.5629,-9.6993,1626
-2.0734,-9.9219,1627
-5.8484,-9.644,1628
-1.3225,-9.6797,1629
-10.3141,-9.6167,1630
7.3736,-9.59,1631
6.3102,-9.7203,1632
-0.2722,-9.7693,1633
0.0552,-9.7565,1634
-0.154,-9.7562,1635
0.0217,-9.758,1636
-0.2406,-9.7534,1637
0.0244,-9.7479,1639
0.092,-9.7537,1640
-1.3304,-9.7394,1641
2.0613,-9.7323,1642
-2.6031,-9.7474,1643
-3.6522,-9.7022,1644
-6.1892,-9.7052,1645
1.5152,-9.6623,1646
-1.6166,-9.6656,1647
2.0822,-9.7219,1649
-0.7629,-9.761,1650
0.3734,-9.7582,1651
-1.4362,-9.7342,1652
-0.4608,-9.7255,1653
-2.7924,-9.6732,1654
-3.3678,-9.6951,1655
2.9265,-9.7077,1656
-3.9249,-9.8078,1657
-2.6075,-9.7578,1658
0.7825,-9.7135,1659
-0.0937,-9.7203,1660
-0.0976,-9.723,1662
6.216,-9.575,1663
1.8188,-9.5786,1664
-3.2263,-9.742,1665
-0.6702,-9.5926,1666
1.6079,-9.7794,1668
0.8785,-9.8885,1669
-0.7454,-9.8396,1670
2.8712,-9.7329,1671
4.5764,-10.1122,1672
-2.714,-9.4868,1674
-2.2441,-9.9737,1675
-13.139,-10.0561,1676
19.6251,-10.1628,1677
5.2325,-10.1305,1678
3.1927,-10.0569,1679
0.9487,-9.6433,1680
1.7581,-9.8283,1681
6.035,-9.6084,1682
0.5873,-9.786,1683
0.0074,-9.4664,1684
-0.203,-9.6984,1685
-0.1863,-9.9761,1686
0.6786,-9.7755,1687
0.1365,-9.6482,1688
0.8411,-9.6578,1689
-0.0024,-9.8842,1690
-0.1171,-9.7811,1691
-0.3439,-9.8168,1692
2.0629,-9.8085,1694
0.5694,-9.8076,1695
5.4027,-9.8183,1696
-1.0744,-9.8161,1697
23.881,-9.3347,1698
5.6046,-9.9915,1699
2.1667,-9.7864,1700
1.9336,-9.6556,1701
2.4534,-9.6153,1702
1.032,-9.7132,1704
1.2031,-9.7832,1705
0.1995,-9.3917,1706
0.4569,-9.8696,1707
0.3101,-9.7727,1708
0.2771,-10.0702,1709
0.559,-9.736,1710
0.6296,-9.7547,1711
2.5237,-10.2609,1712
0.4493,-9.7211,1714
1.4481,-9.9946,1715
-0.207,-9.5938,1716
1.5619,-10.4137,1717
1.5211,-9.4331,1718
-1.1204,-9.6606,1719
3.1535,-9.8291,1720
4.448,-9.8671,1721
31.6829,-9.6511,1722
-1.9507,-9.7603,1724
2.6486,-9.8171,1725
1.4881,-9.6139,1726
8.8982,-9.6589,1727
6.5237,-9.6114,1728
-0.2027,-10.1181,1729
0.5894,-9.7423,1730
2.4227,-9.7673,1731
1.4964,-9.9082,1732
1.4185,-9.8015,1734
1.8382,-9.8166,1735
0.6724,-9.8408,1736
1.9295,-9.9656,1737
-0.7449,-9.7122,1738
-1.0276,-9.6388,1739
-4.061,-9.9035,1740
5.828,-9.7178,1741
-1.7261,-9.8401,1742
7.7011,-9.7021,1744
1.9852,-9.8134,1745
2.3827,-9.8802,1746
-0.6055,-9.3449,1747
0.5627,-9.8046,1748
0.2055,-9.8555,1749
-0.3164,-9.7967,1750
1.0452,-9.793,1751
5.1471,-9.8277,1752
1.7988,-9.8693,1754
0.171,-9.6714,1755
5.7258,-9.6717,1756
6.5439,-9.7245,1757
-0.9304,-9.6789,1758
-21.7245,-10.1093,1759
3.25,-9.7613,1760
-3.5331,-9.7042,1761
0.6209,-9.8855,1762
0.0236,-9.9183,1764
-0.2623,-9.7606,1765
-1.7182,-9.8297,1766
2.0305,-9.7634,1767
0.1618,-9.6952,1768
1.377,-9.8638,1769
2.8495,-9.4845,1770
1.5471,-9.5216,1771
-4.1683,-9.7919,1772
0.8712,-9.7357,1774
0.3027,-9.8152,1775
0.1253,-9.7577,1776
1.7354,-9.6287,1777
0.7828,-9.721,1778
-0.6081,-9.7521,1779
3.2782,-9.8507,1780
2.0646,-9.8202,1781
0.3935,-9.7286,1782
1.0681,-9.8212,1784
1.9424,-9.8635,1785
1.5022,-9.9236,1786
-0.1757,-9.8387,1787
0.5732,-9.747,1788
1.1172,-9.7191,1789
-0.3086,-9.7694,1790
0.6416,-9.7588,1791
0.1009,-9.7469,1792
1.1707,-9.793,1793
0.6026,-9.6893,1794
0.3299,-9.7792,1795
0.5203,-9.7592,1796
-0.18,-9.848,1797
-0.0661,-9.7642,1798
-0.7908,-9.7482,1799
0.7383,-9.8286,1800
0.7419,-9.7535,1801
0.5463,-9.7293,1802
-0.1787,-9.751,1804
-0.21,-9.7729,1805
-0.1573,-9.7483,1806
-0.0728,-9.7782,1807
-0.2565,-9.7678,1808
-0.2227,-9.7614,1809
0.0655,-9.774,1810
-0.3844,-9.7444,1811
0.4157,-9.7526,1812
0.0788,-9.7661,1813
-0.7251,-9.761,1814
0.3282,-9.7043,1815
1.4006,-9.7656,1816
0.3446,-9.7613,1817
-0.0913,-9.7674,1818
-1.0476,-9.7488,1819
-0.1498,-9.7371,1820
1.1969,-9.7343,1821
0.4774,-9.7717,1822
-0.5793,-9.7712,1824
0.223,-9.7577,1825
0.2856,-9.7631,1826
-0.9491,-9.7734,1827
0.611,-9.6957,1828
0.2868,-9.9411,1829
1.6487,-9.8341,1830
0.579,-9.6283,1831
-1.3026,-9.6984,1832
-0.9263,-9.8228,1834
1.6572,-9.7751,1835
0.9824,-9.8514,1836
1.3521,-9.7548,1837
-0.1055,-9.5636,1838
0.0709,-9.614,1839
2.3081,-9.6222,1840
0.3483,-9.6604,1841
1.4082,-9.733,1842
-1.4679,-10.1042,1843
-0.0006,-9.7448,1844
1.9412,-9.8124,1845
1.4264,-9.7299,1846
0.9017,-9.6978,1847
0.5465,-9.7453,1848
-1.5045,-9.9386,1849
-0.0556,-9.6549,1850
0.0775,-9.8368,1851
0.1864,-9.7325,1852
0.062,-9.7151,1853
-0.1559,-9.8101,1854
5.4121,-9.5105,1855
7.5713,-10.2898,1856
-0.1672,-9.9863,1857
0.5525,-9.7047,1858
0.6106,-9.7298,1859
-0.1347,-9.816,1860
0.0206,-9.6935,1861
0.2442,-9.7447,1862
0.4856,-9.7563,1863
0.0279,-9.791,1864
0.1762,-9.7581,1865
0.8575,-9.6781,1866
2.7935,-9.8938,1867
0.6704,-9.8994,1868
1.4224,-9.6761,1869
10.7987,-9.8746,1870
21.6659,-9.7048,1871
11.609,-9.7917,1872
2.0128,-9.9256,1873
-0.0512,-9.7916,1874
0.3292,-9.8074,1875
-0.0589,-9.7355,1876
-0.0633,-9.9696,1877
-0.1123,-9.7436,1878
0.0328,-9.4801,1879
-0.2007,-9.7249,1880
-0.2946,-9.9717,1881
0.2945,-9.6936,1882
0.4395,-9.7502,1884
0.1595,-9.7387,1885
-0.0911,-9.6927,1886
1.0239,-9.7042,1887
0.6972,-9.7311,1888
0.184,-9.9855,1889
0.278,-9.7452,1890
0.2309,-9.752,1891
0.1047,-9.7526,1892
0.2109,-9.633,1893
1.9456,-9.8395,1894
1.4893,-9.8017,1895
0.8128,-9.8471,1896
0.1664,-9.9386,1897
-0.181,-9.9957,1898
0.0066,-9.8348,1899
5.7357,-9.7985,1900
1.0262,-9.2977,1901
0.2555,-9.9355,1902
17.8026,-9.9346,1903
-2.1924,-9.3921,1904
1.1423,-9.8093,1905
0.6586,-9.7836,1906
2.3483,-9.8888,1907
-11.1774,-9.2179,1908
4.8489,-9.3976,1909
23.0356,-9.5507,1910
-2.4361,-9.7487,1911
9.0213,-9.5614,1912
0.9196,-9.796,1913
3.1296,-9.7042,1914
-0.1848,-9.8181,1915
-1.1327,-9.7533,1916
-0.9264,-9.7597,1917
0.1592,-9.7614,1918
-0.5562,-9.7524,1919
-0.4151,-9.7444,1920
0.0503,-9.7538,1921
-0.0447,-9.7641,1922
-0.0447,-9.7594,1923
0.1024,-9.7562,1924
-0.0959,-9.7734,1925
-0.0519,-9.7667,1926
-0.0841,-9.7649,1927
-0.0085,-9.7627,1928
-0.0258,-9.7646,1929
-0.0653,-9.7661,1930
-0.0224,-9.7644,1931
-0.056,-9.7632,1932
-0.0325,-9.7634,1933
-0.0194,-9.7633,1935
0.228,-9.7647,1936
-0.0024,-9.7695,1937
0.0026,-9.7626,1938
0.0004,-9.766,1939
0.0017,-9.7647,1940
-0.1216,-9.7574,1941
-10.5702,-9.7259,1942
9.8918,-9.6878,1944
-6.4237,-9.6769,1945
5.4995,-9.7675,1946
-0.5096,-9.7645,1947
2.9237,-9.7263,1948
-12.3127,-9.6228,1949
-0.3665,-9.7139,1950
-8.0159,-9.681,1951
7.159,-9.4366,1952
-11.513,-9.5118,1954
12.4177,-9.4397,1955
-14.5949,-9.7549,1956
-3.1812,-9.7626,1957
-6.4824,-9.4179,1958
14.0281,-9.6293,1959
-2.7419,-9.6778,1960
0.136,-9.7169,1961
0.0559,-9.7151,1962
-0.0755,-9.714,1964
-0.0736,-9.7141,1965
-0.0748,-9.715,1966
-0.0781,-9.713,1967
-0.0799,-9.7132,1968
-0.0733,-9.7138,1969
-0.0845,-9.7142,1970
-0.078,-9.7146,1971
-0.0649,-9.7138,1972
-0.0818,-9.7131,1973
-0.0774,-9.7124,1974
-0.0788,-9.7139,1977
-0.0876,-9.7126,1978
-0.0797,-9.7128,1979
-0.0711,-9.7146,1981
-0.0652,-9.7141,1982
-0.0766,-9.7134,1984
-0.0808,-9.713,1985
-0.0916,-9.712,1986
-0.0713,-9.7128,1987
-0.074,-9.7131,1988
-0.0734,-9.7138,1989
-0.0782,-9.7119,1990
-0.0731,-9.7135,1991
-0.0822,-9.7118,1992
-0.0744,-9.7126,1994
0.3489,-9.7066,1995
0.4533,-9.8039,1996
-7.6681,-9.6996,1997
1.4924,-9.7799,1998
-0.1175,-9.8549,1999
-7.7737,-9.704,2000
-1.093,-9.7019,2001
0.7598,-9.6906,2002
-0.0993,-9.694,2004
-0.5799,-9.6884,2005
0.2363,-9.6757,2006
0.9747,-9.6765,2007
0.8212,-9.7194,2008
-0.5101,-9.7114,2009
-0.2658,-9.7126,2010
-0.2281,-9.7098,2011
-0.0952,-9.7086,2012
-0.0473,-9.7093,2014
-0.1601,-9.7087,2015
-1.4525,-9.6919,2016
1.7333,-9.7308,2017
0.1042,-9.8194,2018
-1.1971,-9.6948,2019
-0.6285,-9.7524,2021
1.4003,-9.7456,2022
0.1623,-9.7731,2023
-0.2202,-9.7473,2024
1.328,-9.82,2025
-0.5497,-9.9564,2026
2.5933,-9.7739,2027
-2.8526,-9.5065,2029
3.2158,-9.8132,2030
0.8355,-9.9406,2031
-0.4049,-9.7915,2032
-0.5749,-10.5108,2033
0.7211,-9.5037,2034
0.1044,-9.6733,2035
-0.0925,-9.7067,2036
0.5151,-9.5904,2037
0.4559,-9.7923,2039
-0.4964,-9.889,2040
1.7824,-9.7128,2041
0.4666,-9.7536,2042
0.3514,-9.7317,2043
0.2445,-9.9731,2044
3.1316,-9.7763,2045
1.0706,-9.6983,2046
1.423,-9.9033,2047
1.1132,-9.8186,2049
0.4167,-9.7851,2050
0.9167,-9.6761,2051
0.1307,-9.7283,2052
0.5473,-9.7337,2053
-0.7444,-9.7804,2054
2.374,-9.9591,2055
-0.3492,-9.7448,2056
-0.1876,-9.7568,2057
0.6101,-9.8297,2059
1.3349,-9.7417,2060
-1.6776,-9.8181,2061
-6.3256,-9.4651,2062
3.791,-8.2125,2063
-0.1726,-9.6863,2064
0.1366,-9.8126,2065
1.7355,-9.6587,2066
-0.2176,-9.4803,2067
2.4294,-9.7319,2069
1.6201,-9.8797,2070
1.02,-9.9034,2071
0.6687,-9.8373,2072
0.1788,-9.9479,2073
-0.2321,-9.6833,2074
-0.2198,-10.0258,2075
0.6192,-9.732,2076
1.2919,-9.7158,2077
1.306,-9.4642,2079
-0.447,-9.8389,2080
-0.0035,-10.0467,2081
0.1394,-9.4815,2082
0.4793,-9.9701,2083
-0.3586,-9.6371,2084
-0.3918,-9.6433,2085
-0.1383,-9.5272,2086
0.2372,-9.1377,2087
0.9729,-9.8428,2089
1.4767,-9.8968,2090
0.935,-9.8172,2092
0.049,-9.7519,2093
0.7112,-9.6957,2094
1.4016,-9.7673,2095
0.1559,-9.7781,2096
-0.5331,-9.7995,2097
0.3285,-9.704,2099
-3.746,-9.6989,2100
-0.1378,-9.6891,2101
-0.7284,-9.6942,2102
1.3403,-9.68,2103
1.5407,-9.7045,2104
1.2413,-9.7158,2105
0.3855,-9.7371,2106
-0.5279,-9.7458,2107
0.1423,-9.7451,2109
0.1623,-9.7415,2110
0.7799,-9.7516,2111
-0.0029,-9.7578,2112
0.0161,-9.7583,2113
0.0133,-9.7564,2114
0.028,-9.7557,2115
0.0275,-9.7572,2116
-0.1174,-9.7554,2117
-0.1996,-9.7547,2119
0.0106,-9.7466,2120
0.3429,-9.7491,2121
-0.8425,-9.7464,2122
0.8214,-9.7479,2123
-0.1811,-9.7447,2124
-0.7742,-9.734,2125
-0.2011,-9.7058,2126
0.0782,-9.7022,2127
2.3365,-9.7105,2128
0.2755,-9.7289,2129
0.2385,-9.7282,2130
0.0337,-9.7213,2132
-0.0238,-9.714,2133
0.155,-9.7137,2134
-0.5765,-9.7131,2135
1.0162,-9.7129,2136
-11.3056,-9.5925,2137
5.0084,-9.7356,2138
-2.9604,-9.7553,2139
-0.4008,-9.6427,2141
-5.0186,-9.7335,2142
-2.0739,-9.8714,2143
-2.4942,-9.5361,2144
-0.8256,-9.8277,2145
-8.9584,-9.6785,2146
-7.626,-9.6301,2147
3.7401,-9.6309,2149
0.109,-9.6509,2150
1.1888,-8.8158,2151
-0.3393,-8.8581,2152
0.6106,-9.7894,2153
0.6403,-9.7154,2154
-0.4657,-9.6252,2155
1.4949,-10.152,2156
-0.7925,-9.8839,2157
2.3772,-9.797,2159
4.0378,-9.5837,2160
0.4863,-9.8839,2161
1.3387,-9.9307,2162
-0.4403,-9.4129,2163
-0.0361,-9.6516,2164
0.0797,-9.904,2165
1.5244,-9.6852,2166
-0.312,-9.8797,2167
0.1219,-9.8174,2169
0.3327,-9.7743,2170
-0.5168,-9.8104,2171
2.6914,-9.7389,2172
1.9733,-9.8738,2173
0.9065,-9.8521,2174
-0.5028,-9.8903,2175
-0.0895,-9.706,2176
1.7544,-8.7579,2177
-0.0091,-9.8011,2179
0.7738,-9.7379,2180
1.8701,-9.6773,2181
0.3614,-9.6103,2182
6.4165,-9.3107,2183
1.1767,-9.6123,2184
0.1986,-9.8278,2185
0.0144,-9.667,2186
1.1183,-9.3936,2187
-1.6311,-9.791,2189
3.322,-9.3505,2190
-2.35,-9.7514,2191
-0.791,-9.9512,2192
-6.7101,-9.2809,2193
1.7847,-10.3787,2194
3.6005,-9.9515,2195
-1.5494,-9.6453,2196
5.5385,-9.8471,2197
1.3539,-9.809,2198
0.2896,-9.7515,2199
1.2074,-9.7657,2200
-0.1907,-9.8111,2201
2.0056,-9.7144,2202
1.353,-9.7274,2203
-2.4811,-9.5588,2204
19.9306,-9.5828,2205
0.0442,-9.6984,2206
0.4574,-9.9002,2207
-0.0683,-9.7945,2209
0.6098,-9.7395,2210
0.2087,-9.7472,2211
0.285,-9.8227,2212
-0.1174,-9.8375,2213
0.3121,-9.8212,2214
-0.1271,-9.7102,2215
-0.3767,-9.8266,2216
0.4967,-9.6715,2217
0.3232,-9.7857,2219
0.8065,-9.7172,2220
3.9647,-9.6877,2221
-0.0695,-9.7799,2222
0.9956,-9.7839,2223
-0.1017,-9.8228,2224
-0.0333,-9.7827,2225
0.1549,-9.7489,2226
0.1728,-9.7572,2227
0.1369,-9.9106,2229
-0.0817,-9.7997,2230
0.5175,-9.7605,2231
-0.2578,-9.8045,2232
-0.1408,-9.8367,2233
0.6588,-9.8326,2234
1.6685,-9.768,2235
0.9576,-9.9036,2236
0.3159,-9.7732,2237
-0.3011,-9.7383,2238
-0.381,-9.7823,2239
0.4401,-9.8819,2240
17.8094,-9.8962,2241
12.6468,-9.9525,2242
4.4626,-9.851,2243
2.422,-9.8841,2244
0.2536,-10.3201,2245
8.1026,-9.7444,2246
5.34,-9.7608,2247
3.5695,-9.8538,2248
-0.786,-10.1792,2249
1.1844,-9.719,2250
1.7492,-9.8942,2251
-0.7413,-9.706,2252
0.2543,-10.6658,2253
2.6546,-10.297,2254
-1.1042,-9.6992,2255
0.1041,-9.8553,2256
0.2782,-9.8208,2257
4.3956,-9.882,2259
0.5321,-9.8317,2260
1.3379,-9.7071,2261
-0.6176,-9.7339,2262
4.5707,-9.9931,2263
-0.1248,-9.6625,2264
0.743,-10.0307,2265
0.2329,-9.4519,2266
-0.0238,-9.2422,2267
0.4146,-9.6701,2268
1.567,-9.7355,2269
0.0979,-9.7901,2270
0.9375,-9.7985,2271
1.3746,-9.8486,2272
2.2061,-9.9217,2273
0.4736,-9.824,2274
0.0559,-9.7907,2275
0.4889,-9.9158,2276
3.227,-9.7882,2277
0.4416,-9.1166,2278
-0.2718,-9.7265,2279
-0.0601,-9.3845,2280
0.1076,-9.8771,2281
-0.2024,-9.7117,2282
1.0027,-9.6865,2283
2.4408,-9.7082,2284
0.3653,-9.2396,2285
-6.2345,-9.1665,2286
-0.7715,-9.9565,2287
1.2754,-9.9205,2288
-0.016,-9.829,2289
0.3443,-9.8551,2290
0.9024,-9.8015,2291
0.0389,-10.002,2292
0.1873,-9.8316,2293
-0.2512,-9.8273,2294
-0.1258,-9.8587,2295
-0.7289,-9.8234,2296
-0.2232,-9.7972,2297
0.3557,-9.9312,2298
-2.9126,-8.8532,2299
5.3268,-9.7959,2300
2.6425,-9.5146,2301
2.703,-9.8636,2302
-0.4677,-9.9675,2303
0.9155,-10.7952,2304
-0.3025,-9.8006,2305
1.234,-9.5361,2306
2.4795,-9.8168,2307
0.3498,-10.0572,2308
0.6745,-9.2002,2309
-1.5348,-10.0399,2311
0.8574,-9.4851,2312
0.2958,-9.9252,2313
-1.8429,-9.572,2314
18.0084,-9.7537,2315
2.1746,-10.1154,2316
-0.0667,-9.1748,2317
-0.5061,-8.4862,2318
1.36,-9.693,2319
1.5349,-9.7222,2320
-0.1393,-9.5758,2321
1.3695,-9.6961,2322
4.7858,-10.0017,2323
8.7064,-9.6786,2324
8.3211,-9.6333,2325
2.0229,-9.8337,2326
0.3472,-9.7636,2327
-0.8052,-9.7524,2329
1.4956,-9.744,2330
0.9935,-9.7479,2331
-0.2003,-9.7477,2332
-1.4835,-9.7541,2333
-1.172,-9.7279,2334
-1.0958,-9.7288,2336
1.5534,-9.7282,2337
-0.3945,-9.7464,2339
-0.3747,-9.7372,2340
1.5287,-9.7501,2341
-1.3529,-9.7596,2342
-2.4688,-9.7576,2343
-6.1401,-9.6491,2344
-18.4005,-9.4797,2345
21.2135,-9.4962,2346
-2.6671,-9.7844,2347
0.0363,-9.7779,2349
-1.5922,-9.7532,2350
-6.2252,-9.7419,2351
1.6585,-9.7322,2352
-23.8296,-9.2688,2353
0.6637,-9.5952,2354
-0.9358,-9.693,2356
1.7609,-9.7338,2357
0.4016,-9.7784,2358
-0.202,-9.7653,2359
-1.5428,-9.7523,2360
-0.512,-9.7485,2361
0.6109,-9.7672,2362
0.7389,-9.761,2364
0.0042,-9.7745,2365
-0.0132,-9.7749,2366
0.0741,-9.7718,2367
0.0191,-9.7769,2368
0.0259,-9.7823,2369
-0.0016,-9.7774,2370
-0.9294,-9.7668,2371
-0.074,-9.7493,2372
-0.6057,-9.732,2374
-0.1594,-9.7666,2375
0.004,-9.7711,2376
0.1374,-9.7412,2377
-3.9545,-9.7534,2378
-3.2753,-9.6647,2379
4.5899,-9.6661,2380
2.4858,-9.7759,2381
0.2853,-9.7692,2384
0.4264,-9.776,2386
0.4772,-9.7595,2388
-0.205,-9.7666,2389
-0.011,-9.7597,2390
-6.8584,-9.6676,2391
2.6629,-9.7346,2392
0.0881,-9.7574,2394
0.9748,-9.747,2395
3.9336,-9.7764,2396
0.1492,-9.7825,2397
-0.1437,-9.7801,2398
-0.2828,-9.778,2399
-8.2504,-9.7423,2400
4.5599,-9.7582,2401
0.8925,-9.731,2402
-0.3852,-9.8038,2403
-10.8845,-9.7285,2404
5.5094,-9.8212,2405
3.0879,-9.7749,2406
0.419,-9.7712,2407
0.1234,-9.8041,2408
0.6543,-9.7505,2409
-0.8365,-9.6626,2410
-0.2561,-9.7874,2411
0.0026,-9.8447,2412
1.4484,-9.7737,2414
0.0806,-9.686,2415
0.6231,-9.8672,2416
1.7159,-9.9384,2417
0.3581,-9.7886,2418
1.2172,-9.6348,2419
1.1016,-9.7964,2420
0.7424,-9.8141,2421
-0.5448,-9.8052,2422
0.1475,-9.8881,2424
0.1253,-9.7672,2425
-0.0552,-9.7086,2426
0.4553,-9.7238,2427
0.4967,-9.7718,2428
0.3003,-9.7723,2429
0.185,-9.7823,2430
-0.1488,-9.7223,2431
0.7303,-9.8042,2432
0.5991,-9.7295,2434
-0.1915,-9.7791,2435
1.1192,-9.7615,2436
2.4214,-9.8172,2437
-0.2543,-9.7429,2438
0.251,-9.8661,2439
-0.0348,-9.7826,2440
0.1025,-9.8123,2441
-0.0516,-9.6411,2442
0.6653,-9.7631,2444
2.2376,-9.7995,2445
1.3741,-9.7732,2446
0.3207,-9.7689,2447
-0.0473,-9.8008,2448
-0.0545,-9.7654,2449
0.3068,-9.792,2450
0.1839,-9.7555,2452
0.1833,-9.6332,2454
1.9682,-9.7244,2455
0.1303,-9.8266,2456
-0.0015,-9.8994,2457
0.7754,-9.7004,2458
1.148,-9.78,2459
-0.2176,-9.5475,2460
0.5133,-9.7953,2461
0.1812,-9.6182,2462
0.209,-9.9551,2463
4.5189,-9.7299,2464
0.5441,-9.9023,2465
2.4708,-9.6299,2466
1.5114,-9.7521,2467
1.852,-9.734,2468
1.259,-9.7984,2469
1.8047,-9.8136,2470
1.018,-9.8033,2471
-0.2004,-9.7628,2472
0.059,-9.783,2474
0.2462,-9.845,2475
0.0559,-9.7299,2476
-0.2453,-10.283,2477
1.1246,-9.6794,2478
1.4534,-9.8814,2479
2.2353,-9.6731,2480
0.7486,-9.7608,2481
-0.0472,-9.8087,2482
2.5368,-9.7222,2484
0.516,-9.7109,2485
0.2242,-9.8092,2486
2.2222,-9.6872,2487
3.1519,-9.7934,2488
0.7717,-9.5772,2489
-0.1543,-9.7719,2490
2.6855,-9.743,2491
0.0212,-9.6876,2492
1.7429,-9.7925,2494
0.3895,-9.665,2495
1.4271,-9.7767,2496
-0.137,-9.8447,2497
-0.1284,-9.7942,2498
0.5435,-9.8477,2499
0.254,-9.8439,2500
0.0489,-9.7373,2501
-0.4775,-9.582,2502
0.6952,-9.771,2504
6.3343,-9.8151,2505
5.3918,-10.0714,2506
23.0295,-9.857,2507
4.0677,-10.0256,2508
5.2271,-9.8222,2509
0.3363,-9.7525,2510
1.8783,-9.784,2511
0.3428,-9.799,2512
0.6342,-9.7509,2514
0.8022,-9.7587,2515
0.5754,-9.7461,2516
-2.234,-9.7525,2517
1.5471,-9.7574,2518
1.9848,-9.7924,2519
1.9126,-9.9283,2520
0.1616,-9.7578,2521
0.2155,-9.8197,2522
-0.4252,-9.8202,2523
0.6668,-9.762,2524
1.5089,-9.7644,2525
-0.1937,-9.7851,2526
-0.4986,-9.7911,2527
-1.0165,-9.7379,2528
0.8437,-9.7756,2529
8.3372,-9.7717,2530
2.6305,-9.7465,2531
0.8326,-9.7447,2532
2.6147,-9.8022,2534
1.4003,-9.7203,2535
0.1675,-9.836,2536
-0.2488,-9.7328,2537
1.2307,-9.6515,2538
0.6433,-9.7851,2539
1.1668,-9.6638,2540
0.05,-9.8278,2541
1.159,-9.6981,2542
4.6039,-9.7715,2544
5.0,-9.7269,2545
0.2322,-9.7256,2546
-1.126,-9.726,2547
1.3922,-9.6821,2548
2.8558,-9.6557,2549
0.3023,-9.7815,2550
-0.3262,-9.7325,2551
3.5316,-9.9183,2552
-2.7592,-9.7866,2554
-0.3902,-9.7991,2555
0.6989,-9.6932,2556
9.8402,-9.7227,2557
-1.0491,-9.8004,2558
-1.7813,-10.0335,2559
-0.0182,-9.8966,2560
-0.0873,-9.7515,2561
-0.3739,-9.8371,2562
0.2552,-9.7352,2564
0.4519,-9.7387,2565
1.5521,-9.7821,2566
0.2978,-9.8274,2567
0.2357,-9.7446,2568
1.4404,-9.7936,2569
0.3258,-10.1395,2570
0.2253,-9.7686,2571
-0.6945,-9.6357,2572
-0.0579,-9.631,2574
-0.3303,-9.9713,2575
0.9044,-9.5123,2576
-0.9194,-10.0023,2577
0.3969,-8.2611,2578
1.0862,-9.1907,2579
-0.1736,-9.5948,2580
0.3915,-9.792,2581
-0.1241,-9.7633,2582
0.7048,-9.9065,2583
0.1879,-9.7677,2584
0.4423,-9.7232,2585
1.7422,-9.5779,2586
0.4761,-9.716,2587
3.8527,-9.7821,2588
1.747,-9.7363,2589
-0.248,-9.7708,2590
0.8526,-9.7983,2591
0.6723,-9.7891,2592
0.5261,-9.694,2594
0.4216,-9.7864,2595
0.2976,-9.766,2596
-0.3036,-9.8493,2597
2.6454,-9.7871,2598
0.3412,-9.9219,2599
14.9342,-9.9196,2600
5.9538,-10.1728,2601
3.5536,-9.7648,2602
2.8399,-9.8468,2604
0.4679,-9.8065,2605
1.6676,-9.647,2606
2.4927,-9.7113,2607
0.7678,-9.4278,2608
0.6084,-9.85,2609
0.781,-10.0293,2610
-0.1739,-9.8773,2611
0.3087,-9.6755,2612
0.4508,-9.6802,2614
-0.6011,-9.6504,2615
-0.2463,-9.8904,2616
-0.183,-9.692,2617
-1.4486,-9.6131,2618
-0.2697,-9.5448,2619
0.1911,-9.8637,2620
-0.7755,-10.0618,2621
-0.59,-9.7653,2622
-0.5317,-9.7753,2624
1.0251,-9.7409,2625
-0.0603,-9.773,2626
0.0308,-9.571,2627
-0.7984,-9.7123,2628
-0.3237,-9.7726,2629
1.1016,-9.9702,2630
1.6448,-9.7251,2631
2.2573,-9.7599,2632
0.129,-9.8282,2633
0.4121,-9.7967,2634
5.425,-9.9381,2635
-0.1381,-9.7634,2636
0.529,-9.8624,2637
2.1875,-9.7151,2638
0.9238,-9.869,2639
-2.2981,-9.961,2640
-0.1311,-9.8049,2641
2.5062,-9.8003,2642
-0.5418,-9.6755,2643
1.1652,-9.672,2644
0.9509,-9.9687,2645
0.6213,-9.8679,2646
-0.0766,-9.9649,2647
-0.1767,-10.0439,2648
12.566,-9.687,2649
-7.1986,-10.4203,2650
3.5564,-9.6122,2651
2.0885,-9.8351,2652
3.2098,-9.7005,2653
7.7892,-9.7353,2654
0.9934,-9.789,2655
0.83,-9.7492,2656
0.0903,-9.8405,2657
-0.4141,-9.7399,2658
0.0849,-9.8334,2659
1.1859,-9.4434,2660
1.4908,-9.6831,2661
-0.2034,-9.7647,2662
10.1959,-10.1123,2663
4.0563,-9.7572,2664
7.2891,-9.7609,2665
0.0731,-9.8628,2666
3.2722,-9.6131,2667
-0.6176,-10.1112,2668
0.4421,-10.0047,2669
3.7999,-9.8886,2670
0.7197,-9.8523,2671
1.2994,-9.7033,2672
-1.4423,-9.9248,2673
5.209,-9.7123,2674
0.4439,-9.8079,2675
0.3717,-9.8223,2676
0.1619,-9.6675,2677
-0.2519,-9.8133,2678
-0.0324,-9.9032,2679
0.303,-9.7747,2680
1.0974,-9.6279,2681
2.7063,-9.7265,2682
11.9533,-9.9567,2683
3.5807,-9.8031,2684
1.2392,-9.5857,2685
0.2433,-9.5014,2686
0.6639,-9.8247,2687
-1.1924,-10.0012,2688
-1.6265,-9.7602,2689
-1.8134,-9.8003,2690
1.3668,-9.7364,2691
-0.7263,-9.7464,2692
1.3013,-9.7485,2693
0.1237,-9.7277,2694
-1.7974,-9.673,2695
3.3464,-9.7343,2696
-0.1982,-9.762,2697
-0.1717,-9.7397,2698
-0.1841,-9.7404,2699
-2.6692,-9.6795,2700
4.3484,-9.6956,2701
2.2905,-9.7361,2702
-0.6556,-9.7629,2703
-4.259,-9.7209,2704
1.2277,-9.742,2705
-1.8495,-9.7254,2706
1.168,-9.7082,2707
0.8727,-9.7138,2708
-1.4917,-9.7495,2709
0.2986,-9.7495,2710
0.2204,-9.76,2711
-2.8218,-9.7507,2712
0.5253,-9.719,2713
0.066,-9.7255,2714
-0.21,-9.7343,2715
-1.9188,-9.7209,2716
7.2981,-9.6575,2717
2.8236,-9.7169,2718
0.7497,-9.7527,2719
-2.9149,-9.7091,2720
2.9196,-9.7194,2721
-0.1604,-9.7497,2722
-2.8782,-9.6954,2723
2.9176,-9.6132,2724
-2.9792,-9.6853,2725
1.7985,-9.6515,2726
-1.5467,-9.6087,2728
-0.1003,-9.701,2729
-1.1021,-9.7337,2730
2.2135,-9.709,2731
0.0339,-9.7389,2732
-0.5981,-9.7271,2733
-0.7593,-9.7072,2734
-0.9036,-9.7225,2735
-2.6664,-9.6906,2736
0.9167,-9.6616,2737
-1.6068,-9.6852,2739
1.4734,-9.7114,2740
-1.8374,-9.7074,2741
-0.5418,-9.6873,2742
0.8694,-9.6692,2743
1.3414,-9.7132,2744
-2.2064,-9.6907,2745
0.9462,-9.6983,2746
-0.6071,-9.7058,2747
0.3256,-9.7089,2749
0.0115,-9.7057,2750
-0.302,-9.7105,2751
0.0284,-9.6939,2752
0.5028,-9.7006,2753
0.0065,-9.7141,2754
-0.5713,-9.6898,2755
-0.008,-9.6878,2756
-0.3996,-9.6853,2757
0.6302,-9.6958,2759
-0.0855,-9.6986,2760
0.3044,-9.6692,2761
-0.2351,-9.7256,2762
-1.013,-9.6747,2763
3.8785,-9.716,2764
-0.4255,-9.7566,2765
0.6812,-9.7576,2766
-0.6019,-9.7613,2767
-2.2224,-9.7577,2768
0.8479,-9.5535,2769
5.5881,-9.5942,2770
1.6735,-9.7673,2772
0.0988,-9.7092,2773
-1.1418,-9.8513,2774
2.2761,-10.0023,2775
2.9123,-10.0056,2776
9.0302,-10.0428,2777
1.1497,-9.6631,2779
0.5922,-9.7057,2780
-1.4818,-9.9724,2781
4.7318,-9.5571,2782
2.0702,-10.2789,2783
-0.1253,-9.7592,2784
-0.1212,-9.5693,2785
0.4106,-9.7673,2786
-0.1067,-9.861,2787
1.2851,-9.7601,2789
0.1639,-9.7713,2790
1.2715,-9.8238,2791
0.3362,-9.6837,2792
-0.6496,-10.0068,2793
1.9409,-9.7767,2794
3.8336,-9.8123,2795
0.115,-9.6494,2796
0.0493,-9.856,2797
0.3808,-9.6252,2799
1.7171,-9.9378,2800
2.4922,-9.4721,2801
0.4417,-9.3013,2802
-1.0756,-9.2968,2803
0.365,-9.8087,2804
0.6691,-9.4842,2805
4.8883,-9.718,2806
4.668,-10.3496,2807
0.0219,-9.6725,2809
3.1433,-9.7784,2810
1.5085,-9.8471,2811
0.0337,-9.788,2812
0.0136,-9.7422,2813
0.6923,-9.6816,2814
1.3927,-9.8955,2815
0.0143,-9.784,2816
-0.0499,-9.8593,2817
2.1477,-9.8333,2819
0.1791,-9.781,2820
1.4463,-9.813,2821
0.4824,-9.8009,2822
1.8819,-9.6875,2823
0.0861,-9.8842,2824
0.1576,-9.8829,2825
0.8801,-9.7632,2826
-1.2075,-9.7905,2827
-0.0112,-9.7602,2829
2.4109,-9.7941,2830
5.8141,-9.5392,2831
6.4169,-9.8376,2832
3.4325,-9.6517,2833
2.0876,-9.9192,2834
4.2836,-9.7689,2835
1.9218,-9.7719,2836
-0.6446,-9.7375,2837
0.4185,-10.1756,2839
11.7395,-9.7797,2840
0.5553,-9.6675,2841
0.5827,-9.6281,2842
0.1312,-9.6139,2843
0.9636,-9.8981,2844
0.6145,-9.7073,2845
-0.0503,-9.7862,2846
1.2535,-9.7925,2847
6.3385,-9.7531,2849
14.3864,-9.718,2850
12.6543,-9.8946,2851
-0.0028,-9.9297,2852
-0.0465,-9.7489,2853
0.6223,-9.714,2854
-1.1354,-9.8506,2855
0.8508,-9.559,2856
0.2584,-10.0323,2857
-0.3791,-10.1158,2858
1.889,-9.6472,2859
0.7679,-9.7881,2860
-0.1981,-9.8929,2861
0.3026,-9.8225,2862
0.511,-9.7381,2863
5.1138,-8.4603,2864
1.5463,-9.6342,2865
4.9982,-9.8056,2866
0.1292,-9.7516,2867
6.5876,-9.8233,2869
6.4348,-9.8079,2870
1.0912,-9.6634,2871
0.0201,-9.7529,2872
-0.7501,-9.8314,2873
-0.1666,-9.7886,2874
6.7474,-9.7737,2875
-0.3278,-9.6785,2876
0.8196,-9.9706,2877
0.4969,-9.7503,2879
1.4064,-9.7759,2880
1.3468,-9.6711,2881
-1.7368,-9.8354,2882
0.9805,-9.7699,2883
0.4702,-9.8964,2884
0.911,-9.636,2885
1.1016,-9.8578,2886
1.7505,-9.003,2887
0.4049,-9.8119,2889
1.3959,-9.8453,2890
9.5169,-9.8872,2891
0.1787,-9.5719,2892
0.1406,-9.5817,2893
0.0619,-9.764,2894
-1.9314,-9.8339,2895
3.3819,-9.7471,2896
3.2506,-9.8623,2897
3.2651,-9.4276,2899
1.0553,-9.9923,2900
2.1417,-9.7638,2901
2.7266,-9.7009,2902
0.4193,-10.0994,2903
-6.2127,-9.7819,2904
3.2634,-10.6366,2905
3.1335,-9.5099,2906
6.3346,-9.5364,2907
11.8414,-9.9063,2909
4.925,-9.824,2910
5.6996,-10.3161,2911
3.0375,-9.4441,2912
0.3909,-9.9234,2913
3.5039,-9.905,2914
-0.519,-9.9061,2915
0.717,-9.7978,2916
0.7544,-9.6119,2917
1.4257,-9.7451,2919
0.4656,-9.7709,2920
0.0664,-9.9041,2921
-1.0194,-9.6693,2922
-5.2686,-10.1991,2923
6.6513,-9.7281,2924
-0.4546,-9.903,2925
3.1583,-9.7147,2926
0.5105,-9.7802,2927
4.8283,-9.6813,2929
4.1498,-9.8076,2930
1.5452,-9.5428,2931
-0.9434,-9.9725,2932
0.9218,-9.3027,2933
2.4855,-9.9071,2934
2.2662,-9.4462,2935
0.5399,-9.8247,2936
2.1803,-9.8354,2937
0.4536,-9.7732,2939
0.781,-9.7948,2940
0.6543,-9.8608,2941
2.2302,-9.7574,2942
4.471,-9.7782,2943
-0.6648,-9.7607,2944
0.1104,-9.881,2945
-1.8234,-9.7099,2947
1.4778,-9.7356,2948
1.1605,-9.7327,2949
0.7318,-9.7654,2950
-0.4082,-9.7645,2951
1.9624,-9.7458,2952
-0.4866,-9.7714,2954
3.1473,-9.7329,2955
1.0299,-9.9495,2956
-7.7437,-9.6677,2957
5.0301,-9.7692,2958
0.0603,-9.884,2959
-0.421,-9.7677,2960
0.5223,-9.9202,2961
-0.6716,-9.7026,2962
-2.5095,-9.7071,2964
5.7598,-9.6999,2965
1.4072,-9.9264,2966
1.3003,-9.565,2967
12.7944,-9.6085,2968
0.1109,-9.8124,2969
-16.4607,-9.5624,2970
3.4129,-9.4102,2972
0.849,-9.4843,2973
-6.3817,-9.5708,2974
5.3137,-9.5684,2975
0.7763,-9.6267,2976
-1.9446,-9.6283,2977
-0.0001,-9.6378,2979
-0.5816,-9.6449,2980
0.4279,-9.6461,2981
-0.3043,-9.6464,2982
0.1917,-9.647,2983
-0.2543,-9.6456,2984
0.0699,-9.6422,2985
-0.2658,-9.6422,2986
-1.041,-9.6365,2987
-1.2022,-9.6222,2988
-13.4405,-9.3972,2990
6.8457,-9.6638,2991
0.1276,-9.6659,2992
0.6056,-9.709,2993
-0.1499,-9.7553,2994
-4.903,-9.7325,2995
62.2377,-8.9796,2996
4.61,-9.7281,2997
-4.9466,-9.8651,2998
1.589,-9.805,2999
0.8048,-9.677,3000
-2.1315,-9.6922,3001
0.2513,-9.7369,3002
2.6008,-9.745,3003
-0.1259,-9.7951,3004
-0.1577,-9.7788,3005
-0.5719,-9.8041,3007
-2.865,-9.7318,3008
-4.2851,-9.6183,3009
5.9489,-9.6944,3010
-1.8245,-9.7447,3011
-9.3135,-9.4768,3012
6.8859,-9.6867,3014
-0.3304,-9.7563,3015
-1.0303,-9.7396,3016
0.4094,-9.7363,3017
-0.1794,-9.7409,3018
-0.407,-9.7347,3019
1.1897,-9.7362,3020
0.605,-9.7708,3021
-9.0235,-9.6335,3022
1.5958,-9.4948,3023
-1.9075,-9.744,3025
-0.3074,-9.685,3026
-1.6843,-9.6712,3027
2.0081,-9.692,3028
-0.7127,-9.7006,3029
0.2309,-9.6714,3030
1.1905,-9.6991,3031
-0.4599,-9.6988,3032
-1.1746,-9.6874,3033
0.1605,-9.6688,3034
-1.9204,-9.6362,3035
2.51,-9.6568,3036
-19.0214,-9.5733,3037
30.9835,-9.5698,3038
-3.5495,-9.7287,3039
6.7097,-9.6919,3040
-0.131,-9.7929,3041
-3.9563,-9.5887,3042
-4.3083,-9.7384,3043
-16.0441,-9.5279,3044
4.4821,-9.6493,3045
1.0384,-9.7314,3046
-0.5843,-9.711,3047
1.2545,-9.6349,3048
-4.406,-9.7205,3049
2.6311,-9.6341,3050
-11.1718,-9.6648,3051
6.5844,-9.7225,3052
0.3063,-9.7393,3053
-0.4292,-9.8274,3054
-5.8165,-9.6963,3055
0.5614,-9.8031,3056
-7.641,-9.7332,3057
2.7843,-9.732,3058
4.3994,-9.7048,3059
17.7879,-9.6725,3060
-1.0298,-9.6348,3061
0.3938,-9.8193,3062
-0.3142,-9.8189,3063
3.0604,-9.8136,3064
4.6429,-9.7654,3065
1.1004,-9.8173,3066
1.6202,-9.7401,3067
0.3422,-9.5824,3068
2.133,-9.8836,3069
-7.3169,-9.6664,3070
0.4518,-9.7234,3071
0.4645,-9.8471,3072
-0.0069,-9.8084,3073
0.3473,-9.7711,3074
0.3704,-9.763,3075
0.4368,-9.9484,3076
2.7407,-9.7367,3077
3.4005,-9.7911,3078
2.6871,-9.7466,3079
1.3648,-9.6912,3080
-1.1021,-9.378,3081
1.5851,-9.8483,3082
9.5748,-9.869,3083
1.0129,-9.9908,3084
5.5687,-9.7226,3085
1.757,-9.7367,3086
1.3259,-9.7755,3087
0.8729,-9.745,3088
8.3325,-9.6613,3089
-0.3226,-9.7367,3090
0.4573,-9.835,3091
1.4483,-9.7744,3092
0.1956,-9.8065,3093
3.7348,-9.8138,3094
-1.5316,-9.8846,3095
3.402,-9.216,3096
-0.0538,-9.8057,3097
-0.0662,-9.8658,3098
0.3098,-9.6623,3099
-0.1388,-9.7785,3100
-0.33,-9.8512,3101
-0.9269,-9.8236,3102
13.1433,-9.7533,3103
-0.3649,-9.7517,3104
0.3402,-9.7617,3105
0.3382,-9.7069,3106
0.5625,-9.9524,3107
-0.0012,-9.9,3108
-0.3159,-9.8246,3109
1.582,-9.5967,3110
0.0713,-9.8679,3111
1.3098,-9.8075,3112
-0.19,-9.9584,3114
1.86,-9.9117,3115
1.9814,-9.7727,3116
5.145,-9.6099,3117
8.1849,-9.6905,3118
-0.0156,-10.1336,3119
17.1285,-9.5672,3120
-0.2468,-9.6591,3121
0.4852,-9.777,3122
0.3191,-9.7505,3123
-0.828,-9.8054,3124
0.8896,-9.8146,3125
-0.3826,-9.7786,3126
1.7323,-9.7975,3127
0.5796,-9.7997,3128
0.1852,-10.0393,3129
-0.4065,-9.6186,3130
4.6496,-10.0768,3131
50.6925,-9.4212,3132
-0.7386,-9.6307,3134
0.4255,-9.7344,3135
1.6566,-10.3814,3136
19.9381,-9.6508,3137
-1.621,-10.0968,3138
6.8289,-9.7411,3139
7.2868,-10.1035,3140
23.0119,-9.6957,3141
14.8242,-9.8935,3142
-0.9145,-9.8337,3144
1.0883,-9.6568,3145
4.946,-9.7376,3146
-5.3659,-9.9015,3147
5.1391,-9.7474,3148
3.8678,-9.652,3149
-1.6602,-9.7241,3150
78.599,-9.6387,3151
57.1827,-9.5166,3152
3.6874,-9.2778,3154
2.5862,-9.7834,3155
9.1254,-9.4743,3156
-8.1392,-9.4649,3157
10.6033,-9.9252,3158
12.5976,-10.1104,3159
3.4061,-9.879,3160
0.5093,-9.7628,3161
0.7985,-9.8734,3162
0.8183,-9.8108,3164
-0.2258,-9.7451,3165
1.2248,-9.7563,3166
-1.53,-9.808,3167
-1.1901,-9.8892,3168
4.8116,-9.7747,3169
-0.587,-9.6608,3170
1.2674,-9.7789,3171
0.0171,-9.2945,3172
-0.0393,-9.6795,3174
-0.3581,-9.84,3175
-0.2299,-9.8791,3176
4.0101,-9.8404,3177
-0.1682,-9.406,3178
2.6042,-9.7751,3179
-0.7973,-9.8573,3180
5.4527,-9.7477,3181
2.1587,-10.0558,3182
0.8805,-9.856,3183
3.4298,-9.7492,3184
0.8952,-9.8017,3185
-0.222,-9.6527,3186
0.0854,-9.9564,3187
0.181,-9.5444,3188
-3.7488,-9.6899,3189
4.4136,-9.7666,3190
-0.1389,-9.8241,3191
1.0097,-9.7686,3192
0.2184,-9.7564,3194
5.5842,-9.7814,3195
0.5344,-9.7328,3196
0.3162,-9.5775,3197
0.9788,-9.8427,3198
-1.9809,-9.7396,3199
-8.3832,-9.6792,3200
-2.5239,-9.5973,3202
-2.0659,-9.577,3203
-1.3132,-9.5053,3204
7.8407,-9.6257,3205
-3.2019,-9.815,3206
11.1697,-9.863,3207
2.8141,-9.699,3209
2.586,-9.8453,3210
0.1704,-9.7214,3211
-0.4005,-9.7617,3212
1.9128,-9.4866,3213
0.5908,-9.747,3214
1.4988,-9.9911,3215
17.6449,-9.8249,3216
0.0222,-9.8735,3217
10.6757,-9.7697,3219
2.3263,-9.7502,3220
-0.2464,-9.7722,3221
-0.307,-9.6578,3222
1.4522,-9.7029,3223
7.8513,-9.8823,3224
1.4492,-9.8008,3225
-0.17,-9.7586,3226
7.213,-9.8005,3227
1.037,-9.7881,3229
-0.1883,-9.8913,3230
-0.4376,-9.5422,3231
1.9284,-10.2116,3232
-0.3399,-8.1723,3233
0.3389,-9.6966,3234
4.2575,-9.5058,3235
6.9741,-9.6625,3236
-0.2795,-9.762,3237
-0.221,-9.7768,3239
1.2765,-8.6727,3240
7.3901,-9.6124,3241
-5.9727,-9.4085,3242
2.0829,-9.8241,3243
2.2519,-9.8519,3244
-0.043,-9.7052,3245
1.4486,-9.3438,3246
-0.4122,-9.896,3247
1.1568,-9.7146,3249
0.7704,-9.6467,3250
0.9202,-9.9375,3251
1.0986,-9.6188,3252
0.4378,-9.8867,3253
0.49,-9.5651,3254
-0.1702,-9.8196,3255
0.1778,-9.8663,3256
-0.1672,-9.1847,3257
0.758,-9.7856,3259
-0.0073,-9.664,3260
0.3024,-9.9968,3261
1.0124,-9.4376,3262
-0.5816,-9.6043,3263
0.7762,-9.7111,3264
0.3176,-9.6849,3265
2.0174,-9.725,3266
0.2996,-9.7865,3267
0.0609,-9.8541,3269
0.7532,-9.6134,3270
1.0098,-10.0033,3271
-0.1011,-9.4691,3272
-0.241,-9.7912,3273
3.8867,-9.6556,3274
-0.0735,-9.7726,3275
0.5801,-9.656,3276
2.7895,-9.8465,3277
0.5103,-9.8423,3279
0.061,-9.7119,3280
1.6352,-9.884,3281
0.0905,-9.9081,3282
0.3037,-9.664,3283
0.2185,-10.0296,3284
0.5111,-10.1363,3285
0.5827,-9.8946,3286
0.2484,-9.8654,3287
0.4542,-9.942,3289
22.3509,-9.8379,3290
2.0586,-9.6939,3291
6.347,-9.6575,3292
0.543,-9.6658,3293
0.8474,-9.8287,3294
1.0016,-9.6644,3295
2.476,-9.7204,3296
-0.1876,-10.1489,3297
0.0972,-9.8828,3299
0.2959,-9.609,3300
0.0297,-10.0315,3301
1.3835,-9.6055,3302
0.1717,-9.8249,3303
-1.0178,-9.8183,3304
13.0627,-10.076,3305
12.0744,-9.9056,3306
0.9627,-10.2927,3307
1.706,-10.293,3308
1.2385,-9.802,3309
0.5525,-9.7893,3310
0.7471,-9.674,3311
-0.7296,-9.5949,3312
0.7543,-9.8337,3313
-0.1081,-9.8944,3314
0.2559,-9.6782,3315
1.5448,-9.7667,3316
3.2177,-9.6829,3317
0.5869,-9.7836,3319
1.2354,-9.7481,3320
-0.7637,-9.8037,3321
0.1534,-9.7555,3322
0.8605,-9.7621,3323
1.7719,-9.9304,3324
0.1528,-9.7242,3325
0.4125,-9.7792,3326
0.6076,-9.727,3327
0.2735,-9.8208,3329
0.4679,-9.7299,3330
-0.1685,-9.7786,3331
0.5243,-9.567,3332
0.0316,-10.0188,3333
-0.2352,-9.7893,3334
-0.4338,-9.7493,3335
0.505,-9.7681,3336
0.0985,-9.7817,3337
0.5698,-9.7637,3339
0.4788,-9.7292,3340
0.5895,-9.7276,3341
1.1568,-9.7755,3342
1.5581,-9.8588,3343
0.8457,-9.6344,3344
2.2622,-9.7001,3345
1.4247,-9.7564,3346
3.5565,-10.1046,3347
0.1014,-9.8599,3349
7.1013,-10.1403,3350
-1.4666,-9.787,3353
-0.2018,-9.797,3354
1.4125,-9.756,3355
-0.0275,-9.7465,3356
1.1973,-9.7194,3357
1.1051,-9.7851,3359
0.5189,-9.8168,3360
-0.1812,-9.8304,3361
-0.7761,-9.7213,3362
-0.4512,-9.6428,3363
-1.0742,-9.7378,3364
-0.0132,-9.6846,3365
1.9168,-9.7185,3366
0.1887,-10.0009,3367
1.3552,-9.7174,3369
0.1408,-9.7773,3370
-0.0607,-9.9243,3371
-0.5847,-9.4843,3372
-0.975,-9.5763,3373
23.5704,-9.747,3374
1.1402,-9.6927,3375
-0.2605,-9.9398,3376
7.4359,-9.8727,3377
2.1563,-9.784,3379
0.156,-9.7342,3380
5.4852,-9.8251,3381
2.1133,-9.9824,3382
1.3394,-10.0326,3383
-1.5427,-9.9809,3384
2.6447,-9.7259,3385
1.6841,-9.6768,3386
3.4609,-9.0527,3387
-0.3541,-9.7453,3388
0.832,-9.6102,3389
0.8216,-9.4253,3390
-1.6742,-10.0131,3391
-1.414,-9.7628,3392
6.7422,-9.9648,3393
1.8085,-10.2109,3394
2.7919,-9.6016,3395
1.1806,-9.8022,3396
-0.0831,-9.8185,3397
0.3724,-9.6764,3399
-0.177,-9.7773,3400
-0.6115,-10.101,3401
0.4213,-9.8414,3402
1.0673,-9.7024,3403
9.3805,-9.7113,3404
-0.8001,-9.5718,3405
1.4983,-9.6721,3406
0.0687,-9.8577,3407
0.2774,-9.8133,3409
-0.7882,-9.677,3410
3.8829,-9.6861,3411
1.2892,-9.7721,3412
0.54,-10.0247,3413
0.5784,-9.6762,3414
0.4276,-9.7905,3415
0.7852,-9.654,3416
0.0941,-9.7281,3417
2.0899,-9.7927,3419
-0.1254,-9.6883,3420
0.8305,-10.0386,3421
2.6294,-9.6746,3422
-0.0818,-9.7067,3423
1.2259,-9.7542,3424
2.3702,-9.5078,3425
-1.4666,-9.6872,3426
0.3477,-9.7214,3427
1.7091,-9.8639,3428
0.6071,-9.8681,3429
0.2822,-9.7644,3430
0.3327,-9.9189,3431
3.9209,-9.7549,3432
0.1994,-9.6844,3433
0.3754,-9.6943,3434
1.346,-9.7458,3435
-0.0177,-9.9905,3436
0.9088,-9.8597,3437
1.9632,-9.6308,3438
0.1186,-9.7679,3439
0.3416,-9.7805,3440
0.0551,-9.6833,3441
-0.3271,-9.7149,3442
0.9304,-9.82,3443
1.7376,-10.0409,3444
-0.2508,-9.4407,3445
1.2157,-9.718,3446
0.6633,-9.7272,3447
1.529,-9.7734,3448
0.6801,-9.8782,3449
1.7668,-9.8566,3450
1.2445,-9.6548,3451
7.1812,-9.763,3452
-0.134,-9.7165,3453
0.6087,-9.6353,3454
-0.0922,-9.8999,3455
0.0755,-9.8425,3456
0.8099,-9.5993,3457
4.3187,-9.8103,3458
1.4977,-9.6841,3459
1.1428,-9.7718,3460
-0.1734,-9.7,3461
10.7675,-9.6406,3462
1.4563,-9.8044,3463
1.0675,-9.6617,3464
0.3629,-9.654,3465
0.2288,-9.7127,3467
2.6015,-9.7627,3469
5.213,-9.7291,3470
0.0547,-9.7957,3471
1.4159,-9.8737,3472
-0.9349,-10.1043,3473
2.6705,-10.2016,3474
1.0721,-9.9182,3475
3.2192,-9.8781,3476
2.809,-9.7999,3477
1.5531,-9.649,3478
2.4014,-9.8922,3479
0.0672,-9.7671,3480
1.0581,-9.7976,3481
0.0754,-9.7655,3484
0.2097,-9.7617,3485
0.5655,-9.7516,3486
-0.0433,-9.7861,3487
0.216,-9.822,3488
-1.2937,-9.8178,3489
-0.5482,-9.832,3490
-0.121,-9.8367,3491
0.1904,-9.9072,3492
1.3756,-9.7171,3493
0.8544,-10.3348,3494
4.7454,-9.8067,3495
-0.2159,-9.832,3496
-1.5078,-9.7473,3497
28.8755,-9.8247,3498
0.1037,-9.9455,3499
0.0147,-9.6737,3501
1.1972,-9.4898,3502
-0.2318,-9.8532,3503
0.2234,-9.8101,3504
-0.164,-9.8369,3505
0.7058,-9.9736,3506
0.7146,-9.8518,3507
1.896,-9.7565,3508
-0.37,-9.8146,3509
0.5388,-9.743,3510
0.4096,-9.6958,3511
2.686,-9.6076,3512
-0.6586,-9.7782,3513
0.6309,-9.7434,3514
1.4713,-9.8684,3515
0.3052,-9.8462,3516
-0.0114,-9.7767,3517
-0.2031,-9.8008,3518
1.4555,-9.8125,3519
-0.0663,-9.7287,3520
0.1962,-10.1817,3521
-0.6067,-9.084,3522
6.0851,-9.801,3523
-0.0485,-9.4154,3524
7.9289,-9.5852,3525
1.5875,-9.7982,3526
-0.5088,-9.6153,3527
2.377,-9.8188,3529
-0.4444,-9.7563,3530
0.9552,-9.8259,3531
0.0303,-9.8271,3532
1.1293,-9.4904,3533
0.2409,-9.7698,3534
0.1066,-9.789,3535
-0.0084,-9.4818,3536
0.5552,-9.9883,3537
0.8441,-9.7709,3539
0.1858,-9.8137,3540
-3.8021,-9.6379,3541
2.965,-8.1569,3542
-2.9658,-9.7641,3543
-1.8406,-9.8144,3544
-0.915,-9.8538,3545
1.9672,-9.8244,3546
-0.3688,-10.0904,3547
0.4439,-9.8448,3549
-2.4566,-9.8107,3550
-3.5331,-9.851,3551
2.8234,-9.7433,3552
1.3927,-9.8593,3553
-1.1038,-9.5992,3554
1.0796,-9.7806,3555
0.5413,-9.7664,3556
-0.5773,-9.7912,3557
1.6379,-9.7793,3559
0.8226,-9.7443,3560
1.7242,-9.975,3561
-0.3468,-9.7452,3562
3.0589,-9.989,3563
0.4959,-9.8232,3564
-0.3119,-9.9954,3565
-0.1914,-9.7788,3566
0.7646,-9.7782,3567
-0.1705,-9.8355,3569
-0.4444,-9.7385,3570
-0.8191,-9.7389,3571
1.1187,-9.6047,3572
-1.0895,-9.6684,3573
-0.4797,-9.6499,3574
-0.7271,-9.7686,3575
1.1201,-9.7258,3576
-0.7039,-9.6946,3577
0.074,-9.7722,3579
0.515,-9.7015,3580
0.4287,-9.8642,3581
0.8341,-9.7646,3582
-0.9242,-9.617,3583
0.3977,-9.7045,3584
-0.4448,-9.8209,3585
-0.3442,-9.7537,3586
-1.9824,-9.7892,3587
1.3615,-9.8154,3589
0.2145,-9.8084,3590
-0.5173,-9.6011,3591
1.541,-9.595,3592
-0.9764,-9.469,3593
4.0158,-9.7033,3594
7.2849,-11.0752,3595
1.4624,-9.8686,3596
0.8171,-9.9564,3597
1.235,-9.8187,3599
7.2225,-9.6956,3600
-1.7391,-9.9324,3601
-3.4038,-10.1053,3602
3.0361,-9.7098,3603
-0.9258,-9.7778,3604
14.6612,-9.7516,3605
1.0734,-9.8017,3606
2.6044,-9.684,3607
0.4683,-9.8407,3609
0.0463,-9.7347,3610
-0.1052,-10.0339,3611
-0.8723,-9.5847,3612
1.5098,-9.6491,3613
0.8749,-9.8579,3614
-0.1973,-9.8124,3615
1.4913,-9.7356,3616
0.0706,-9.7828,3617
0.7713,-9.8171,3619
1.5774,-9.8299,3620
1.429,-10.2566,3621
-0.1933,-9.8177,3622
-0.3769,-9.7652,3623
-0.355,-9.9624,3624
0.0296,-9.7198,3625
2.0762,-9.6502,3626
4.0995,-9.5923,3627
0.8465,-9.8472,3628
-0.1078,-9.7844,3629
0.5413,-9.7906,3630
-0.1694,-9.7978,3631
0.2889,-9.7267,3632
-0.0166,-9.7555,3633
0.3102,-9.7811,3634
0.3428,-9.7806,3635
-0.8298,-9.287,3636
0.1228,-9.9103,3637
1.243,-9.5938,3639
1.3641,-9.7021,3640
0.3873,-9.3885,3641
0.5824,-9.5477,3642
-0.1129,-10.1974,3643
-0.6817,-9.3721,3644
-0.377,-9.6919,3645
0.4319,-9.7623,3646
0.0537,-9.5162,3647
-0.2509,-9.7585,3648
1.379,-9.7687,3649
1.4283,-9.5131,3650
7.4831,-9.8354,3651
10.9497,-9.704,3653
1.0861,-9.7702,3654
0.9166,-9.7778,3655
-0.1648,-9.6854,3656
1.6192,-9.8933,3657
1.3136,-9.7593,3658
0.527,-9.7933,3659
3.4997,-9.7257,3660
0.9202,-9.9001,3661
1.2691,-9.6927,3662
0.599,-9.783,3663
4.1735,-9.8582,3664
-0.4305,-9.749,3665
3.7753,-9.7483,3666
1.2389,-9.7969,3667
0.4067,-9.6745,3668
5.8803,-9.7389,3669
4.7747,-9.7448,3670
6.4695,-9.8215,3671
3.7698,-9.6561,3672
-0.8183,-9.4339,3673
-2.5173,-9.4062,3674
0.5333,-9.9078,3675
0.3514,-9.79,3676
0.343,-9.87,3677
4.5459,-9.6848,3679
4.8484,-9.7168,3680
-2.1159,-10.1786,3681
-0.3096,-9.8548,3682
-0.366,-9.5621,3683
-0.0699,-10.0946,3684
7.1828,-9.7013,3685
2.8827,-9.7728,3686
0.6055,-9.2251,3687
2.0807,-9.0668,3689
3.3357,-9.7011,3690
0.7163,-9.7311,3691
1.5536,-9.4187,3692
1.0958,-9.6222,3693
-1.0099,-9.6836,3694
-0.0044,-9.8514,3695
0.4371,-9.8557,3696
-1.0622,-9.7785,3697
0.0256,-9.7989,3699
0.422,-9.8527,3700
0.6357,-9.8745,3701
2.1866,-9.7368,3702
-0.1203,-9.7313,3703
1.6626,-9.7189,3704
-1.0337,-9.7903,3705
1.5886,-9.2846,3706
3.0926,-9.8901,3707
10.1962,-9.89,3709
0.2755,-9.7841,3710
1.5931,-9.8386,3711
-0.4193,-9.9871,3712
0.1587,-9.8008,3713
1.6604,-9.9174,3714
0.4567,-9.5346,3715
0.1383,-9.7614,3716
0.8571,-9.7794,3717
1.2852,-9.7248,3719
1.5856,-9.8057,3720
2.7194,-9.6823,3721
-1.6603,-9.7581,3722
3.8995,-10.726,3723
-0.3649,-9.706,3724
2.9091,-9.7999,3725
-0.136,-9.7666,3726
-0.0234,-9.6845,3727
1.6807,-9.7806,3729
-0.2418,-9.7912,3730
0.1077,-9.8495,3731
0.0062,-9.699,3732
0.0342,-9.8418,3733
-1.2758,-9.7563,3734
10.0934,-9.8694,3736
-8.4517,-9.6106,3737
-2.3947,-8.0968,3738
4.8948,-10.4106,3739
-4.803,-10.468,3740
5.251,-9.7963,3741
-0.2648,-9.6553,3742
0.6784,-9.8347,3744
1.5002,-9.7983,3745
-0.2441,-9.8431,3746
4.3753,-9.707,3747
16.6047,-9.4446,3748
-0.3934,-9.5308,3749
-0.9513,-9.7503,3750
0.9479,-9.8006,3751
2.0605,-9.7262,3752
2.5958,-9.7028,3754
2.3268,-9.7321,3755
0.2296,-9.877,3756
-0.0713,-10.5012,3757
0.3468,-9.5368,3758
5.1799,-9.9704,3759
1.3821,-9.8222,3760
2.6686,-9.83,3761
1.0584,-9.9522,3762
4.6532,-9.6874,3764
3.6837,-9.8102,3765
0.2129,-9.6977,3766
2.085,-9.8717,3767
0.223,-9.7212,3768
-4.7616,-9.7165,3769
0.3627,-10.0664,3770
-5.2223,-9.8347,3771
-1.4799,-9.7141,3772
-11.5226,-9.5965,3773
-0.909,-9.5764,3774
2.0229,-9.5723,3775
0.7749,-9.6043,3776
0.3572,-9.5932,3777
-0.0191,-9.6002,3778
1.1459,-9.6301,3779
0.6937,-9.6328,3780
-2.7991,-9.6194,3781
-8.266,-9.3533,3782
1.2571,-9.6005,3784
1.92,-9.6583,3785
-0.6525,-9.6672,3786
-0.5449,-9.6592,3787
0.4581,-9.6151,3788
-11.6337,-9.6058,3789
11.2755,-9.6912,3790
-1.3131,-9.77,3791
0.182,-9.7804,3792
3.0633,-9.7094,3794
0.968,-9.8015,3795
-1.9659,-9.8946,3796
-6.8979,-9.9477,3797
-1.5534,-10.0868,3798
1.1492,-9.8787,3799
-0.563,-9.7905,3800
-3.3585,-9.6273,3801
-4.421,-9.5767,3803
5.294,-9.5555,3804
7.9934,-9.5566,3805
-4.7012,-9.6379,3806
-5.5535,-9.6706,3807
-15.4027,-9.4908,3808
9.1991,-9.6294,3809
-3.8479,-9.6485,3811
7.5241,-9.4515,3812
-12.4931,-9.8152,3813
6.2373,-10.1065,3814
53.5714,-9.6932,3815
-4.2421,-9.5873,3816
0.8037,-9.8431,3817
7.0041,-9.7943,3819
0.523,-9.8719,3820
0.5661,-9.8773,3821
0.1508,-9.5782,3822
1.3867,-9.7384,3823
6.9527,-9.7562,3824
-0.0584,-9.748,3825
-1.4264,-9.8669,3826
1.1133,-9.8668,3827
-0.0294,-9.7457,3828
-0.4923,-9.7847,3829
-5.4888,-9.6893,3830
-3.073,-9.6699,3831
12.4883,-9.5392,3832
-18.5383,-9.5369,3833
6.2607,-9.7589,3834
0.8344,-9.6939,3835
2.2097,-10.1875,3836
7.9259,-9.8458,3837
-2.289,-9.6843,3838
0.595,-10.1409,3839
-0.8802,-9.7429,3840
-1.2089,-9.9813,3841
-1.5607,-9.8325,3842
3.2906,-9.8224,3843
0.5966,-9.7496,3844
-0.3117,-9.7566,3845
4.4908,-9.9192,3846
5.4949,-9.8498,3847
-0.6817,-9.732,3848
1.3165,-9.7368,3849
2.6825,-9.9005,3850
-0.7214,-10.2572,3851
0.3849,-9.7491,3852
0.4174,-9.6651,3854
0.601,-9.8198,3855
1.1557,-9.9067,3856
0.1897,-10.3226,3857
5.6539,-7.5346,3858
0.2486,-9.5565,3859
0.8084,-9.3798,3860
-3.4793,-9.897,3861
-1.7435,-9.3212,3862
0.4532,-9.7019,3864
0.9111,-9.8843,3865
0.3152,-9.639,3866
0.0275,-10.397,3867
0.3537,-9.6798,3868
-0.2095,-9.5954,3869
2.4519,-9.4757,3870
0.2742,-9.0552,3871
1.3521,-9.7402,3872
0.0173,-9.8431,3873
0.7333,-9.6004,3874
3.7071,-9.844,3875
2.9816,-9.732,3876
1.9324,-10.1158,3877
-3.7237,-9.6116,3878
0.1502,-9.6431,3879
1.218,-9.6989,3880
-4.5483,-9.6815,3881
-1.9514,-9.7589,3882
3.4671,-9.8833,3883
-3.3106,-9.6781,3884
-3.4858,-9.5088,3885
-1.581,-9.7869,3886
-3.461,-9.8868,3887
8.719,-9.894,3888
0.5968,-9.7582,3889
9.9247,-9.8082,3890
-0.9864,-9.838,3891
3.2295,-9.7314,3892
0.2253,-9.79,3893
0.3296,-9.6511,3894
2.3899,-9.8305,3895
-1.3178,-9.8099,3896
-1.4647,-9.6851,3897
0.5739,-9.7378,3898
-0.9534,-9.699,3899
0.2638,-9.7384,3900
-0.1523,-9.736,3901
0.4829,-9.7254,3902
-2.9285,-9.6961,3903
1.7653,-9.7194,3904
-0.3159,-9.7269,3905
1.0599,-9.7365,3906
-0.1407,-9.7505,3907
-0.2854,-9.722,3908
-2.6926,-9.7429,3909
1.8906,-9.6061,3910
20.6125,-9.7448,3911
2.9108,-9.7897,3912
19.185,-10.0275,3913
5.0699,-9.6475,3914
1.3254,-9.9086,3915
17.5041,-9.7397,3916
4.028,-9.8841,3917
1.0594,-9.9428,3918
-1.4057,-9.7379,3919
-0.3009,-9.7273,3920
1.3628,-9.7722,3921
2.8661,-9.9414,3922
-0.6947,-7.9364,3923
6.7676,-9.296,3924
1.1331,-9.8358,3925
-0.2682,-9.6661,3926
0.4977,-10.0842,3927
4.0785,-9.4718,3928
2.3616,-9.7319,3929
0.8898,-9.5163,3930
2.8889,-9.4766,3931
-0.1901,-9.8909,3932
2.3234,-9.5107,3933
3.1658,-9.8526,3934
1.0253,-9.5847,3935
0.1985,-9.6398,3936
1.217,-9.4871,3937
1.0277,-9.7633,3938
0.2884,-9.8321,3939
1.8585,-9.8284,3940
1.4926,-9.6086,3941
1.4808,-9.2901,3942
-1.3423,-9.6975,3943
7.3017,-9.7948,3944
2.4672,-9.7782,3945
0.9923,-9.6481,3946
0.2087,-9.5467,3947
0.1953,-9.704,3948
-0.2282,-9.6724,3949
0.1875,-9.6938,3950
0.1256,-9.6189,3951
0.3925,-9.8695,3952
-10.4334,-9.2033,3953
1.617,-9.5981,3954
-0.1993,-9.6202,3955
0.5446,-9.6849,3956
8.3858,-9.7169,3957
1.3425,-9.7952,3958
-0.2574,-9.9326,3959
0.4261,-9.4235,3960
2.029,-9.7813,3962
-0.4576,-9.8338,3964
1.5118,-9.6363,3965
-0.0448,-9.7691,3966
-0.3177,-9.5293,3967
0.0621,-9.754,3968
0.8924,-9.7464,3969
1.9007,-9.7276,3970
0.9971,-9.9523,3971
0.2867,-9.8577,3972
0.7817,-9.9849,3974
0.7463,-9.6702,3975
-0.1954,-9.3506,3976
-0.3191,-10.0724,3977
0.9301,-9.6762,3978
-1.1164,-9.593,3979
0.7373,-9.7024,3980
-0.0115,-9.9555,3981
-1.6096,-9.7018,3982
-0.2995,-10.0105,3984
-2.0381,-9.8916,3985
-0.2928,-9.7658,3986
12.1978,-10.1174,3988
3.5311,-9.8367,3989
0.3448,-10.1388,3990
-0.1802,-9.7136,3991
5.2327,-9.7388,3992
2.8638,-9.2995,3994
1.5192,-9.6695,3995
0.7614,-9.6018,3996
2.3903,-9.5241,3997
1.2699,-9.0934,3998
-0.6385,-9.52,3999
2.7325,-9.9934,4000
3.3408,-9.3112,4001
-0.5907,-9.7604,4002
5.6383,-9.6465,4004
2.3636,-9.8784,4005
19.4933,-9.7825,4006
-0.2857,-9.7976,4007
4.114,-9.5313,4008
0.0905,-9.5718,4009
1.8933,-9.2106,4010
3.904,-9.8473,4011
0.4576,-9.7545,4012
0.6155,-9.7583,4013
1.9962,-9.0787,4014
-0.6917,-9.9893,4015
0.9535,-10.0301,4016
-0.1114,-9.693,4017
0.1782,-9.8232,4018
14.2424,-9.847,4019
16.7378,-9.8312,4020
9.3701,-9.7287,4021
7.8257,-9.7724,4022
7.983,-9.8025,4023
11.1255,-9.6928,4024
0.7367,-9.7528,4025
1.6286,-9.7583,4026
1.124,-9.546,4027
6.2175,-9.9507,4028
7.0325,-9.7072,4029
-0.2817,-7.2788,4030
0.7883,-9.8365,4031
2.8438,-9.7862,4032
0.3862,-9.7244,4034
0.4704,-9.6424,4035
3.2438,-9.6515,4036
0.7942,-9.411,4037
1.9385,-9.3732,4038
1.0987,-10.1486,4039
-0.7633,-9.7956,4040
1.5374,-9.7471,4041
1.7248,-9.846,4042
2.8453,-9.7831,4044
0.7192,-9.9065,4045
-0.1679,-9.9548,4046
-0.2198,-10.0828,4047
2.6383,-9.674,4048
2.6632,-9.7922,4049
0.1266,-9.684,4050
-0.0909,-9.794,4051
-0.0884,-9.9472,4052
1.1342,-9.7723,4054
-0.2064,-9.814,4055
1.7292,-9.6967,4056
-0.6359,-9.7165,4057
0.2127,-9.8764,4058
0.511,-9.7036,4059
6.2016,-9.8671,4060
11.8421,-9.6557,4061
0.547,-9.9936,4062
9.0858,-9.6691,4064
0.1702,-9.761,4065
11.832,-9.8297,4066
1.8802,-9.6587,4067
8.9086,-9.9669,4068
-0.896,-9.8927,4069
3.3933,-9.636,4070
0.1558,-9.9274,4071
1.2225,-9.697,4072
1.2108,-9.7999,4073
0.4124,-9.6584,4074
0.3542,-9.7461,4075
0.7847,-10.1535,4076
2.4362,-10.1035,4077
0.7693,-9.6157,4078
0.4658,-9.8269,4079
0.107,-9.71,4080
0.3535,-9.8296,4081
0.588,-9.9981,4082
1.4375,-9.8262,4084
0.2843,-9.6,4085
-1.0248,-8.8938,4086
1.5943,-9.0081,4087
-3.24,-9.4371,4088
0.4597,-9.8711,4089
-2.6979,-9.8754,4090
1.5385,-9.7754,4091
0.5832,-9.864,4092
0.3408,-9.7505,4094
4.0919,-9.7881,4095
3.9796,-9.7479,4096
6.9753,-9.6618,4097
1.0635,-9.7711,4098
-0.0624,-9.6149,4099
2.7781,-9.9749,4100
4.3483,-9.7172,4101
0.3563,-9.8982,4102
0.1463,-9.598,4104
0.5409,-9.8065,4105
-0.2347,-9.7869,4106
-0.2058,-9.5114,4107
0.5412,-10.2456,4108
0.6284,-9.9448,4109
-0.2936,-9.8062,4110
-0.0425,-9.7423,4111
0.2682,-9.6661,4112
-1.6513,-9.7984,4114
1.2728,-9.7253,4115
-0.4195,-9.7751,4116
-0.0174,-9.7096,4117
6.7383,-9.7448,4118
0.782,-9.7586,4119
1.2497,-9.8549,4120
0.3487,-9.8186,4121
5.4732,-9.7378,4122
-3.2966,-9.6646,4124
1.0703,-9.6535,4125
0.394,-9.8639,4126
-2.3577,-9.589,4127
2.4561,-9.5752,4128
-1.7278,-9.6339,4129
-0.3364,-9.5828,4130
12.5993,-9.59,4131
-3.4654,-9.6709,4132
8.9106,-9.8245,4133
-2.4105,-9.7329,4134
-0.5854,-9.6537,4135
-2.1415,-10.0167,4136
5.1534,-9.9099,4137
2.0733,-9.8426,4138
0.0344,-9.8195,4139
6.2624,-9.4643,4140
-0.1757,-9.6674,4141
0.7418,-10.3314,4142
6.9883,-9.7246,4144
1.0259,-9.6854,4145
-0.404,-9.6668,4146
1.0769,-9.7616,4147
2.0945,-9.6059,4148
0.1048,-10.2585,4149
0.0526,-10.0131,4150
0.8695,-9.9856,4151
3.475,-9.5899,4152
12.6583,-9.7147,4154
2.3599,-9.4012,4155
-0.609,-10.3134,4156
0.3793,-9.8486,4157
0.1784,-9.9794,4158
-0.3705,-9.7749,4159
2.2366,-10.0662,4160
1.5386,-9.7432,4161
0.4585,-9.5459,4162
1.4858,-9.6971,4164
-0.0114,-9.7978,4165
-0.1957,-9.3666,4166
2.5503,-10.5723,4167
3.5636,-9.7283,4168
0.1753,-9.9381,4169
-0.3251,-9.8881,4170
1.2945,-9.7239,4171
-2.669,-9.9228,4172
2.7435,-9.766,4174
0.302,-9.7681,4175
3.2991,-9.6774,4176
-0.5083,-9.7215,4177
11.9537,-10.6762,4178
-1.5355,-9.9594,4179
1.1863,-10.1287,4180
0.799,-9.9133,4181
0.4652,-9.9099,4182
2.1359,-9.7036,4184
0.7936,-9.545,4185
-0.988,-10.121,4186
-0.7714,-9.9694,4187
2.6854,-9.0287,4188
0.0496,-9.5178,4189
0.7803,-9.2865,4190
0.7371,-9.7818,4191
0.8723,-9.6816,4192
1.1182,-9.7757,4193
1.2262,-9.7298,4194
0.7452,-9.826,4195
-2.2318,-10.1878,4196
-0.1121,-9.9018,4197
0.5415,-9.801,4198
1.3445,-9.31,4199
-0.149,-9.901,4200
0.7941,-9.7177,4201
2.3447,-9.8741,4202
5.9825,-9.8746,4203
1.7574,-9.7303,4204
4.131,-9.7966,4205
0.0896,-9.9016,4206
2.5297,-9.8556,4207
3.6509,-9.7715,4208
13.571,-9.6428,4209
1.0467,-9.7125,4210
-2.5753,-9.9206,4211
-11.2084,-9.5575,4212
-2.0001,-9.8159,4214
-3.4486,-9.68,4215
2.3427,-10.0092,4216
-1.5407,-9.7355,4217
3.9666,-9.6473,4218
-2.0063,-9.802,4219
6.0212,-10.5093,4220
-10.5756,-9.9775,4221
13.7285,-10.9546,4222
7.8139,-9.8623,4224
-0.474,-9.8829,4225
-2.0408,-9.2951,4226
122.1674,-9.8598,4227
87.3205,-9.4392,4228
17.0385,-9.5451,4229
-2.2252,-9.8617,4230
-0.8145,-9.7978,4231
2.1936,-9.7704,4232
3.2719,-9.8,4234
-1.5676,-9.6469,4235
3.0487,-9.41,4236
9.0405,-9.7169,4237
-0.3957,-9.6312,4238
2.177,-9.5003,4239
0.4313,-9.6819,4240
13.6621,-9.5129,4241
-2.6355,-9.805,4242
-1.8072,-9.8958,4244
16.4408,-10.1502,4245
-2.7122,-9.7412,4246
-15.8356,-9.6518,4247
-2.4648,-9.8484,4248
0.5636,-9.7534,4249
-0.6763,-9.7643,4250
-12.1584,-9.5252,4251
0.5974,-9.5686,4252
9.7903,-9.6227,4253
4.8942,-9.8121,4254
0.4803,-9.7513,4255
-7.0576,-9.7312,4256
5.7703,-9.6618,4257
-1.85,-9.7595,4258
-1.2262,-9.7463,4259
2.0112,-9.7024,4260
-3.8417,-9.6923,4261
-0.2269,-9.7157,4262
0.5431,-9.7595,4264
-1.8425,-9.7708,4265
1.075,-9.7691,4266
-0.1617,-9.7666,4267
-1.6712,-9.762,4268
-3.9975,-9.7936,4269
-0.2403,-9.708,4270
-3.2827,-9.732,4271
3.6987,-9.7243,4272
-5.0228,-9.6879,4274
8.0603,-9.6894,4275
-9.206,-9.7028,4276
-8.8978,-9.6659,4277
8.0334,-9.6871,4278
3.7615,-9.7981,4280
-2.951,-9.8055,4282
-0.1558,-9.8113,4283
-0.1166,-9.7394,4284
1.8558,-9.7222,4285
6.3382,-9.8139,4286
0.4148,-9.7392,4287
-1.1446,-9.8613,4288
-1.3777,-9.7666,4289
-1.7933,-9.7712,4290
-2.6097,-9.7267,4291
1.4239,-9.7114,4292
1.8578,-9.7246,4293
-1.8904,-9.8405,4294
-9.3233,-9.6987,4295
-5.2661,-8.8282,4296
7.8278,-9.7391,4297
-0.3264,-9.7236,4298
-0.9261,-9.781,4299
-1.2728,-9.7565,4300
0.8699,-9.7019,4301
0.0474,-9.7394,4302
0.9635,-9.7774,4303
2.6288,-9.8014,4304
2.9378,-9.7885,4305
-10.5536,-9.5308,4306
-9.823,-9.6841,4307
-24.1975,-9.2237,4308
21.6791,-9.4582,4309
-0.604,-9.6496,4310
-12.7186,-9.3131,4311
15.1257,-9.6607,4312
-7.3451,-9.6479,4313
-8.2126,-9.6218,4314
6.1463,-9.7481,4315
-4.052,-9.7081,4316
-5.5565,-9.6213,4317
-2.7549,-9.5707,4318
3.5252,-9.7014,4319
0.9534,-9.7129,4320
-15.1863,-9.7517,4321
91.8581,-9.7047,4322
-6.5048,-9.7569,4323
0.8448,-9.7372,4324
-2.1017,-9.7454,4325
2.3746,-9.6521,4326
-0.1105,-9.7957,4327
-0.347,-9.7863,4328
0.0241,-9.3113,4329
-2.5473,-9.8751,4330
0.2876,-10.028,4331
-0.3336,-9.6781,4332
-0.5629,-9.7013,4333
0.7788,-9.7627,4334
-0.0077,-9.78,4335
-0.0394,-9.7919,4336
-0.1707,-9.788,4337
1.1874,-9.7737,4339
1.2735,-9.8131,4340
3.9935,-9.7657,4341
0.0734,-9.6882,4342
1.5486,-9.6664,4343
0.891,-9.8241,4344
-0.4156,-9.6448,4345
-0.3887,-9.7412,4346
-0.0797,-9.8923,4347
0.6388,-9.8271,4348
-0.3026,-9.7105,4349
1.8192,-9.5542,4350
0.2754,-9.7885,4351
-0.0123,-9.7221,4352
0.4162,-9.833,4353
0.2151,-9.7208,4354
-1.1809,-9.7246,4355
6.1236,-10.5845,4356
16.263,-9.3045,4357
-0.3076,-9.481,4358
0.1684,-9.8952,4359
3.7363,-10.1462,4360
3.2877,-9.7686,4361
-1.5774,-9.9285,4362
12.0682,-10.136,4363
13.4904,-9.7079,4364
2.8477,-9.7922,4365
-7.1364,-11.0368,4366
5.3155,-9.8202,4367
-0.9081,-9.7486,4368
1.4165,-9.9461,4370
6.1532,-9.6319,4371
7.8635,-9.7954,4372
-0.5444,-10.0689,4373
1.0714,-9.6204,4374
-0.5432,-9.6769,4375
0.5572,-9.623,4376
1.8797,-9.9512,4377
-0.0612,-9.685,4378
-1.0052,-9.7186,4379
-0.2612,-9.8113,4380
-1.7734,-9.6239,4381
-0.9014,-9.8826,4382
-0.5723,-9.7691,4383
-2.0622,-9.5906,4384
1.408,-9.5862,4385
0.1925,-9.8315,4386
0.2505,-9.5599,4387
0.2435,-9.7425,4388
0.5212,-9.3319,4389
-0.1225,-9.6491,4390
0.0019,-9.6831,4391
1.0975,-9.7282,4392
0.778,-9.8097,4393
-0.8916,-9.8446,4394
0.7575,-9.7813,4395
0.7157,-9.7316,4396
1.2489,-9.7597,4397
0.3043,-9.7215,4398
-0.1891,-9.596,4399
0.497,-9.8102,4400
0.0609,-9.7376,4401
-0.0452,-9.9298,4402
-1.1841,-9.7276,4403
0.1501,-9.7724,4404
-0.2314,-9.7938,4405
0.9305,-9.7755,4406
0.0824,-9.8046,4407
0.2169,-9.4969,4408
1.1511,-9.8056,4409
-1.269,-9.7484,4410
2.8262,-9.7885,4411
0.4119,-9.7532,4412
0.9305,-9.7923,4413
3.3974,-9.777,4414
-0.1325,-9.8608,4415
-8.9603,-9.6896,4416
25.8638,-9.8109,4417
-0.9347,-9.8854,4418
-2.3401,-9.4498,4419
-1.4684,-9.9369,4420
-0.1315,-9.7472,4421
1.1494,-9.2255,4422
0.1084,-10.0174,4423
-0.6982,-9.6671,4424
-0.9871,-9.6306,4425
4.7331,-9.9655,4426
3.8846,-10.1399,4427
3.8269,-9.7703,4428
3.085,-9.7075,4429
4.8527,-10.0778,4430
-0.1876,-9.955,4431
0.6776,-9.6838,4432
0.8074,-9.657,4433
3.2557,-9.7544,4434
-3.3975,-10.3431,4435
37.2957,-9.3774,4436
9.5185,-9.3976,4437
7.8782,-9.5587,4438
0.5424,-9.518,4439
-0.053,-9.5807,4440
-0.4876,-9.6646,4441
-0.0479,-9.8251,4442
1.0854,-9.694,4443
0.2208,-9.7077,4444
0.7888,-9.5419,4445
0.8957,-10.1071,4446
0.9203,-9.8333,4447
-0.4661,-9.9295,4448
1.9239,-9.4491,4449
-0.2142,-10.176,4450
1.0231,-9.8165,4451
-0.1301,-9.8327,4452
3.4477,-9.972,4453
4.2804,-9.8324,4454
1.1218,-9.8531,4455
-0.3102,-9.7761,4456
-1.8503,-9.8432,4457
-0.169,-9.753,4458
-0.189,-9.8684,4459
0.5999,-9.7947,4460
0.7076,-10.0349,4461
5.4228,-9.7097,4462
0.09,-9.8741,4463
1.5438,-9.8945,4464
0.459,-9.735,4465
5.9764,-9.5756,4466
3.6705,-10.0171,4467
-0.7287,-10.2654,4468
-0.1968,-9.5777,4469
-0.4801,-9.9584,4470
-1.0602,-9.7455,4471
2.3358,-9.6848,4472
-2.647,-9.7378,4473
6.9025,-9.8473,4474
2.4966,-9.7345,4475
4.7036,-9.8898,4476
0.9227,-9.7894,4477
0.0224,-9.9362,4478
0.6338,-9.8089,4479
-1.1456,-9.7406,4480
-3.7775,-9.7315,4481
-7.3673,-9.6695,4482
-0.039,-9.8515,4483
6.2393,-9.9543,4484
-0.2843,-9.79,4485
1.0114,-9.7533,4486
1.5197,-9.8623,4487
2.0992,-9.8099,4488
0.9661,-9.6105,4489
4.8771,-9.9616,4490
3.4529,-9.787,4491
4.8475,-9.765,4492
1.3936,-9.8499,4493
1.286,-9.7879,4494
3.0998,-9.9244,4495
2.1544,-9.5864,4496
3.4475,-9.756,4497
3.3029,-9.7787,4498
5.3591,-9.7211,4500
4.9274,-9.8359,4501
8.4724,-9.7863,4502
0.5515,-9.8579,4503
2.6582,-9.6772,4504
3.0497,-9.8222,4505
-0.213,-9.8048,4506
3.4234,-9.7679,4507
0.9653,-9.7372,4508
0.5474,-9.8205,4510
0.3844,-9.7537,4511
3.6412,-9.7762,4512
5.4838,-10.0174,4513
0.507,-9.8901,4514
0.8812,-9.8451,4515
1.7491,-9.7046,4516
0.0536,-9.7918,4517
35.6535,-9.2677,4518
1.9989,-10.1044,4520
5.741,-9.7319,4521
2.0946,-9.8822,4522
2.3692,-9.1243,4523
-0.1573,-9.4542,4524
0.077,-9.7586,4525
1.3354,-9.9042,4526
-0.5516,-9.7743,4527
0.1375,-9.7112,4528
0.0003,-9.81,4530
0.6933,-9.757,4531
0.4383,-9.5143,4532
-1.7292,-9.4545,4533
-0.7193,-9.5564,4534
0.7129,-9.8337,4535
0.3452,-9.4075,4536
0.2249,-9.8539,4537
0.6096,-9.6096,4538
0.1751,-9.6078,4540
1.4644,-9.6559,4541
4.5592,-9.7421,4542
2.2183,-9.8824,4543
0.0011,-9.556,4545
-1.0025,-10.0674,4546
3.886,-9.4186,4547
0.4162,-9.7898,4548
2.4069,-9.3068,4549
-3.5098,-8.8662,4550
0.7409,-9.9312,4551
2.1023,-9.745,4552
1.94,-9.7687,4553
3.1737,-9.5289,4554
-0.6138,-9.6333,4555
7.453,-9.8024,4556
1.683,-9.2443,4557
2.8605,-9.5895,4558
-1.3716,-9.4555,4559
6.6899,-9.8088,4560
6.1194,-9.7559,4561
2.4437,-9.7608,4562
1.3652,-9.707,4563
1.1836,-9.7016,4564
2.2486,-9.7752,4565
1.516,-9.6934,4566
0.6079,-9.7792,4567
0.0764,-9.4198,4568
1.1846,-9.7067,4569
26.4037,-9.1687,4570
1.5848,-9.6146,4571
-0.1441,-9.7238,4572
1.9366,-10.2995,4573
10.5436,-9.5673,4575
13.0846,-9.8187,4576
-5.5819,-9.2674,4577
-1.8248,-9.3957,4578
-1.9396,-9.8414,4579
3.2229,-9.875,4580
-0.4304,-9.4585,4581
0.0996,-9.694,4582
0.1838,-10.2061,4583
0.4603,-9.6234,4585
0.6066,-9.8051,4586
2.8987,-9.6353,4587
3.629,-9.6768,4588
-0.3592,-10.0271,4589
0.5974,-9.6753,4590
0.0446,-9.578,4591
0.8735,-9.8911,4592
1.4304,-9.7447,4593
1.3433,-9.7085,4595
4.0504,-9.5646,4596
0.1586,-9.7555,4597
0.0903,-9.8342,4598
-0.7111,-8.8098,4599
1.0037,-9.4474,4600
1.8313,-9.4662,4601
1.1224,-9.7337,4602
4.8609,-9.7612,4603
13.7887,-9.8933,4604
5.4755,-9.758,4605
4.26,-9.9382,4606
2.4559,-9.8807,4607
-2.8426,-9.5818,4608
3.0289,-9.666,4609
3.4087,-9.8155,4610
0.769,-9.7384,4611
-0.4643,-9.8253,4612
-1.9655,-10.239,4613
3.4721,-9.6447,4615
3.225,-9.7261,4616
1.0687,-9.8273,4618
0.2944,-9.7136,4619
0.0294,-9.6578,4620
3.5483,-9.3638,4621
2.3319,-9.8366,4622
-0.4582,-9.6025,4623
0.0435,-9.9746,4625
0.9036,-9.7672,4626
0.9339,-9.8632,4627
-1.4136,-9.9016,4628
-0.306,-9.4137,4629
0.7533,-9.5421,4630
-0.1313,-9.9287,4631
1.1101,-10.0292,4632
1.402,-10.2007,4633
1.5629,-9.8945,4634
-1.1056,-9.7284,4635
1.2145,-9.7577,4636
-0.4345,-9.9866,4637
3.565,-9.4765,4638
-0.3688,-9.9049,4639
-0.0384,-9.8826,4640
-3.3105,-10.0748,4641
6.0044,-9.6528,4642
-1.047,-9.6593,4643
2.9545,-9.6257,4645
1.9195,-9.6737,4646
0.04,-9.7516,4647
1.6123,-9.8236,4648
15.1725,-9.7417,4649
-0.1368,-10.0349,4650
-0.2019,-9.6077,4651
0.8659,-9.7098,4652
-0.7673,-9.7598,4653
1.198,-9.7005,4655
1.9474,-9.3746,4656
1.7853,-9.964,4657
-1.8029,-9.6128,4658
1.2981,-9.9886,4659
1.6914,-10.091,4660
0.7925,-9.6165,4661
1.5088,-9.7035,4662
4.0242,-9.727,4663
0.1229,-9.8723,4665
0.5798,-9.9446,4666
6.0268,-9.6161,4667
-0.0488,-9.4333,4668
0.5442,-10.2383,4669
0.2398,-9.8447,4670
0.4961,-9.5845,4671
1.0791,-9.7659,4672
1.8615,-9.9062,4673
0.0706,-9.7995,4675
2.5445,-9.7861,4676
6.2443,-9.6598,4678
2.4291,-9.77,4679
-0.9793,-9.0347,4680
3.8413,-9.6662,4681
0.5017,-9.8606,4682
0.0118,-9.7939,4683
-0.3077,-9.9921,4685
-0.2688,-9.8019,4686
4.0532,-9.351,4687
4.2689,-10.587,4688
2.4886,-9.8045,4689
-0.524,-9.7466,4690
-1.1368,-9.8421,4691
-2.0146,-9.8031,4692
-19.485,-9.5501,4693
26.5464,-9.2905,4695
-1.4876,-9.7372,4696
0.171,-9.6674,4697
-18.2178,-10.0642,4698
-6.8521,-9.6987,4699
0.4868,-9.6198,4700
3.6267,-9.7019,4701
-0.1604,-9.8172,4702
-0.2511,-9.4885,4703
3.7951,-9.9038,4704
0.2723,-9.8519,4705
1.2733,-9.6762,4706
0.3847,-9.6036,4707
-0.0284,-9.7265,4708
-0.9307,-9.7612,4709
1.095,-9.8169,4710
1.3966,-10.0493,4711
0.1934,-9.7891,4712
-9.4907,-9.8485,4713
-0.2066,-9.7131,4714
0.7266,-9.6521,4715
-0.2609,-9.701,4716
-1.6408,-9.6859,4717
1.1121,-9.5613,4718
-0.3162,-9.7776,4719
1.4323,-9.5863,4720
-1.4024,-9.6733,4721
0.0115,-9.7348,4722
1.1464,-9.9328,4723
1.8537,-9.7261,4724
0.0484,-9.7995,4725
0.1538,-9.9027,4726
-0.1296,-9.8057,4727
-0.0538,-9.6584,4728
1.8415,-9.79,4729
-0.6097,-9.9846,4730
2.5079,-9.9067,4731
-0.8306,-9.7456,4732
-0.3288,-9.9668,4733
1.1402,-9.7866,4734
1.9836,-9.7463,4735
0.6597,-9.8074,4736
0.0055,-9.9047,4737
-0.2394,-9.7331,4738
-0.4306,-9.5443,4739
-0.378,-9.7225,4740
-0.4413,-9.7629,4741
1.382,-9.9226,4742
0.0179,-10.1485,4743
0.1224,-9.4384,4744
0.115,-9.775,4745
-0.1403,-9.684,4746
-0.1396,-9.6524,4747
-2.9762,-9.6997,4748
-5.91,-9.718,4749
-5.8364,-9.6986,4750
-12.7881,-10.1748,4751
4.9123,-9.6452,4752
-0.7043,-8.6409,4753
-0.5733,-10.2424,4755
0.3923,-9.3285,4756
2.798,-9.6679,4757
-2.8151,-9.7946,4758
0.5709,-9.8377,4759
0.2795,-9.7827,4760
0.1503,-9.7784,4761
1.929,-9.245,4762
1.4355,-9.1737,4763
1.1502,-9.829,4764
-1.1025,-9.57,4765
1.0815,-9.7028,4766
0.4263,-9.4007,4768
-0.0512,-9.334,4769
1.4896,-9.6548,4770
3.137,-9.075,4771
1.2604,-10.2552,4772
2.7483,-9.406,4773
0.6447,-9.8437,4774
-0.1652,-9.1114,4775
-0.2466,-9.859,4777
0.3208,-9.7435,4778
0.1902,-9.7513,4779
-0.4525,-10.8522,4780
-0.3891,-9.8605,4781
-0.0736,-9.734,4782
1.9835,-9.5619,4783
-2.023,-8.8968,4784
2.7351,-9.8192,4785
-0.4668,-9.6647,4787
0.7378,-9.8579,4788
0.5663,-9.4679,4789
2.7509,-9.9707,4790
0.6942,-9.6985,4791
1.6166,-9.6281,4792
-0.0465,-9.8766,4793
-0.033,-9.2498,4794
0.1849,-9.6828,4795
0.4547,-9.9002,4797
0.3918,-10.0016,4798
8.7588,-10.1691,4799
15.4581,-9.709,4800
-3.6528,-9.8063,4801
9.9644,-9.8313,4802
4.1577,-9.7526,4803
0.6779,-9.8402,4804
-1.0041,-9.7004,4805
2.583,-9.7462,4807
2.525,-9.7723,4808
-2.8273,-9.5982,4809
2.651,-9.6772,4810
-0.3698,-9.8049,4811
0.0165,-9.6497,4812
-1.2415,-9.7397,4813
0.2722,-9.7646,4814
-0.7627,-9.6918,4815
0.2599,-9.7678,4817
0.161,-9.7588,4818
0.5582,-9.8275,4819
0.4302,-9.6985,4820
2.0716,-9.8612,4821
2.1294,-9.773,4822
11.9947,-10.5193,4823
4.8391,-9.7795,4824
3.551,-9.7962,4825
0.5847,-9.8271,4826
12.9024,-9.9592,4827
29.0771,-9.7495,4828
-0.0647,-10.1008,4829
30.1308,-9.7456,4830
-4.9971,-9.7645,4831
-34.9784,-9.4255,4833
11.4168,-9.7183,4834
0.8128,-9.8434,4835
