AYGX_mean,AZ_mean,timestamp
-10.1674,-9.7683,2
-1.0154,-9.6995,3
-55.0361,-9.1868,4
-8.727,-9.9624,5
-12.6133,-9.7354,6
19.0837,-9.9167,7
4.3528,-9.8395,8
8.8359,-9.9795,9
8.8967,-9.9387,10
5.0834,-9.8901,11
-20.2044,-9.8094,12
6.8185,-9.7828,13
0.0454,-9.8499,14
-14.6703,-9.6716,15
-3.5314,-9.7953,16
-2.3983,-9.8045,17
11.9104,-9.8184,18
-115.4768,-8.7156,19
8.0632,-9.0023,20
8.1187,-8.9993,21
8.1083,-9.0006,23
8.1313,-8.9997,24
8.064,-9.0019,25
8.1106,-9.0014,26
8.0543,-8.9997,27
8.0995,-8.9992,28
8.1143,-9.0003,29
4.1028,-9.0002,30
5.541,-8.9747,31
8.2702,-8.9601,32
8.3173,-8.9583,34
8.2196,-8.9581,35
8.2528,-8.9576,36
8.2726,-8.959,37
8.292,-8.9593,38
8.1791,-8.9581,39
8.242,-8.9578,40
8.2621,-8.959,41
8.2556,-8.9581,42
8.2662,-8.9589,43
8.2421,-8.959,44
8.2199,-8.9579,45
8.2091,-8.9588,46
8.1861,-8.9556,47
8.2412,-8.9586,48
8.1451,-8.9594,49
8.2152,-8.9584,50
8.1747,-8.9584,51
25.0359,-9.1588,52
-5.9721,-9.4738,53
-14.9076,-9.384,54
-4.3456,-9.5463,55
-0.0741,-9.871,56
0.6058,-9.868,57
0.6051,-9.8685,58
0.6051,-9.8681,59
0.5997,-9.8674,60
0.6057,-9.8651,61
0.614,-9.8678,63
0.6193,-9.8668,64
0.6409,-9.8654,65
0.6471,-9.8663,66
0.6296,-9.868,67
0.6583,-9.8674,68
0.5128,-9.8692,69
0.6487,-9.8665,70
0.6631,-9.8667,71
0.6173,-9.8673,73
0.6186,-9.8672,74
0.6139,-9.8658,75
0.6178,-9.8665,76
0.6182,-9.8682,77
0.614,-9.8693,79
0.6181,-9.8674,80
0.6151,-9.8659,81
0.6129,-9.8659,82
0.6112,-9.8655,83
0.6147,-9.8665,84
0.6165,-9.8669,85
0.6179,-9.8665,86
0.6196,-9.8662,87
0.6202,-9.8669,88
0.6129,-9.8675,89
0.6127,-9.8657,90
0.6149,-9.8672,91
0.613,-9.8678,92
0.6146,-9.866,93
0.6165,-9.8663,94
0.6127,-9.8677,95
0.6158,-9.867,96
0.6103,-9.8665,97
0.6168,-9.8661,98
0.6144,-9.8674,99
0.6194,-9.8674,100
0.6128,-9.8653,101
0.6103,-9.867,102
0.5814,-9.866,103
0.6001,-9.8648,104
0.6019,-9.8667,105
0.612,-9.8666,106
0.6016,-9.8664,107
0.6067,-9.867,108
0.5858,-9.8682,109
0.6053,-9.8695,110
0.6051,-9.8629,111
0.5972,-9.8661,113
0.5965,-9.8673,114
0.5935,-9.8669,115
0.5993,-9.8678,116
0.59,-9.8683,117
0.6162,-9.864,118
0.6065,-9.8668,119
0.5978,-9.8666,120
0.6017,-9.8637,121
0.5941,-9.8671,122
0.5943,-9.8664,124
0.5974,-9.866,126
0.6,-9.8677,127
0.5989,-9.8665,128
0.5708,-9.8789,129
0.5963,-9.8684,130
0.5972,-9.8666,131
0.5959,-9.8664,132
0.5955,-9.8663,133
0.5959,-9.8668,134
0.5953,-9.8657,135
0.6002,-9.8659,136
0.6044,-9.867,137
0.5979,-9.8661,138
0.6008,-9.8657,139
0.6017,-9.8663,140
0.6007,-9.8655,141
0.5967,-9.8658,142
0.5977,-9.8657,143
0.6008,-9.8654,144
0.5937,-9.8657,145
0.5947,-9.8666,146
0.5943,-9.8663,147
0.6048,-9.8656,148
0.598,-9.8647,149
0.5991,-9.8656,150
0.599,-9.8646,151
0.5968,-9.8644,153
0.5965,-9.867,154
-50.3242,-9.7202,155
8.1498,-9.6611,156
0.9895,-9.4949,157
2.6942,-9.7337,159
4.1639,-9.86,160
3.0048,-9.8521,161
-0.6869,-9.9292,162
3.0618,-9.9348,163
-0.3568,-10.0281,164
0.1468,-9.9006,165
-0.2117,-9.9147,166
3.7564,-9.9075,168
-1.8086,-9.5988,170
-3.3816,-9.8163,171
0.3465,-9.7553,172
3.4769,-9.7451,173
2.6776,-9.7573,174
1.2774,-9.7517,175
5.3643,-9.6965,181
1.7076,-9.7095,182
5.7946,-9.7157,183
11.2939,-9.765,184
5.4273,-9.8402,185
2.7221,-9.9785,186
-0.561,-10.0376,187
-0.1923,-9.9616,188
0.1027,-9.9121,189
0.7726,-10.1145,190
8.4756,-9.832,191
10.1939,-9.7572,193
5.1353,-9.9364,194
-1.2354,-9.5947,195
2.6438,-9.864,196
-1.2061,-9.8805,198
-0.8067,-9.8973,199
0.4124,-9.8575,200
0.252,-9.8756,201
-1.6547,-9.8247,203
0.2002,-9.8163,204
-26.1773,-9.7903,205
-2.5632,-9.783,206
-2.6042,-9.7825,208
-2.6647,-9.7824,209
-2.6816,-9.7821,210
-2.6668,-9.7814,211
-2.6739,-9.7816,213
-2.6716,-9.7814,214
-2.6723,-9.7811,215
-1.3956,-9.7928,217
5.2943,-9.8294,218
2.3797,-9.8289,219
-0.3423,-9.8521,220
-5.6244,-9.7582,221
-5.0541,-10.0973,222
-53.1089,-9.3368,223
31.3622,-9.3979,224
0.2464,-9.8631,225
-16.5346,-9.466,226
3.7394,-10.0316,227
0.1921,-9.8672,228
-0.4949,-9.5802,229
0.247,-9.8585,230
0.246,-9.8611,231
0.2408,-9.8654,232
0.2404,-9.8616,233
0.239,-9.861,234
0.2393,-9.862,235
0.2388,-9.8614,236
0.2387,-9.8621,237
-2.6615,-9.7886,240
1.1549,-9.8581,251
-6.0612,-9.8182,252
1.638,-9.8123,253
-19.6298,-9.8255,254
-21.3735,-9.4952,255
-0.2807,-9.8626,256
1.4401,-9.713,257
-14.5276,-9.7674,258
-4.4076,-9.8565,259
-1.9442,-9.7666,260
-1.6657,-9.8341,262
0.4732,-9.84,263
-0.1603,-9.8132,264
2.813,-9.785,266
-4.3878,-9.6719,267
13.0227,-9.7597,270
-2.0004,0.0426,271
0.9065,-9.8295,272
1.6863,-9.8089,273
2.6878,-9.8115,274
1.8129,-9.8216,275
1.7893,-9.8116,276
2.1521,-9.8099,277
2.372,-9.8124,278
2.5059,-9.8213,279
6.5052,-9.7594,280
3.3069,-9.8238,281
1.3241,-9.8136,282
2.2613,-9.8058,283
1.7427,-9.8085,284
2.3088,-9.8023,285
2.0244,-9.8069,286
1.6013,-9.7998,287
2.5225,-9.7929,288
0.4749,-9.7731,289
2.927,-9.7668,290
3.3673,-9.7668,291
3.3416,-9.7774,292
2.3006,-9.7823,293
2.777,-9.7622,294
3.0461,-9.7681,295
2.4008,-9.7682,296
2.5407,-9.7654,298
2.8039,-9.7572,299
2.8105,-9.7755,338
2.6855,-9.7742,339
3.0161,-9.7783,341
2.454,-9.7807,342
1.5354,-9.7853,343
9.9219,-9.593,344
3.2385,-9.8165,345
-3.2441,-9.8278,346
2.459,-9.7652,347
2.67,-9.7616,348
2.5865,-9.7516,349
2.9894,-9.748,350
3.109,-9.748,351
3.0171,-9.7477,352
3.0658,-9.7491,353
2.8079,-9.7452,354
2.9152,-9.7383,355
3.4699,-9.7355,356
3.8959,-9.7497,357
2.2754,-9.7598,358
2.8892,-9.7444,359
3.1782,-9.7479,360
3.0244,-9.7442,361
3.0957,-9.7407,363
2.9689,-9.7411,364
3.4236,-9.7384,365
1.7516,-9.7306,366
4.6183,-9.6968,367
3.1975,-9.7417,369
2.9368,-9.7382,370
3.5175,-9.7395,371
2.9407,-9.7378,372
3.2122,-9.7387,373
3.3078,-9.7382,374
2.957,-9.7357,375
2.5118,-9.7189,376
2.6309,-9.698,378
8.6754,-9.794,379
-7.1684,-9.7634,380
8.2004,-9.7975,381
2.2724,-9.9077,382
-4.5894,-9.6996,384
3.8912,-9.5961,386
-15.4716,-9.825,387
0.6406,-9.8114,388
-2.8886,-9.7843,389
-10.3484,-9.8002,390
0.0145,-9.8397,391
-15.5202,-9.7849,392
-4.7694,-9.847,393
0.2405,-9.8492,394
1.0688,-9.6973,395
-11.3223,-9.7651,396
-4.6906,-9.7513,397
-2.9357,-9.7628,399
-2.8547,-9.7617,400
-2.8051,-9.7641,401
-2.7981,-9.7645,403
-2.7949,-9.7638,404
-2.7984,-9.7634,405
-2.7926,-9.7639,406
-2.7892,-9.7641,408
-2.7849,-9.7651,409
-2.7872,-9.764,410
-2.7891,-9.7646,411
-2.7891,-9.7646,413
-2.7842,-9.7639,414
-2.8041,-9.7646,415
-2.7864,-9.7643,416
-2.8027,-9.7642,418
-2.783,-9.7633,419
-2.7951,-9.7638,420
-2.7968,-9.7637,421
-2.7819,-9.7638,422
-2.7927,-9.7639,424
