AYGX_mean,AZ_mean,timestamp
0.1489,-9.8082,0
0.148,-9.8078,2
0.146,-9.8082,3
0.1486,-9.8088,4
0.1761,-9.8082,5
0.1678,-9.8089,6
0.1109,-9.8102,7
0.1316,-9.8102,8
-1.0005,-9.7899,9
-16.8496,-9.656,10
40.1154,-9.5578,11
1.0461,-9.7885,12
-1.6449,-9.7973,13
-0.3451,-9.7815,14
0.1071,-9.7852,15
0.2763,-9.798,16
-0.368,-9.8093,17
-0.5731,-9.8052,18
-0.2956,-9.8013,19
-0.4701,-9.7998,20
-1.7375,-9.7633,22
0.3053,-9.8361,23
5.0273,-9.8108,24
0.9707,-9.7977,25
-3.7781,-9.7857,26
0.6469,-9.7731,27
-1.7352,-9.7801,28
0.5191,-9.76,29
-3.3807,-9.7881,30
-4.5427,-9.762,31
-0.6098,-9.7948,32
-2.7533,-9.7686,33
0.5474,-9.7488,34
4.9508,-9.7742,35
0.8813,-9.8054,36
-1.222,-9.8132,37
-1.3575,-9.8039,38
-0.565,-9.813,39
-0.2938,-9.8096,40
0.0062,-9.8073,41
-0.9265,-9.806,42
-6.7809,-9.7389,43
-2.8822,-9.7684,44
1.0301,-9.7724,45
1.3665,-9.7944,46
0.0954,-9.813,47
-4.3634,-9.7807,48
-0.2318,-9.6778,49
1.654,-9.6852,50
3.501,-9.7102,51
-0.1525,-9.6888,52
4.8576,-9.6999,54
2.9919,-9.7933,55
-0.2687,-9.8144,56
-1.5178,-9.7992,57
-1.5502,-9.7986,58
-0.3629,-9.795,59
-0.5392,-9.7928,60
-0.3417,-9.7935,62
-0.26,-9.7942,63
-0.5262,-9.7909,64
-0.1809,-9.792,65
0.0843,-9.7938,66
-0.0198,-9.7978,67
-1.3222,-9.8027,68
1.3127,-9.8138,69
-1.3803,-9.8038,70
-0.119,-9.8058,71
-0.0569,-9.8165,72
-2.0757,-9.7921,73
1.1911,-9.8089,74
-0.7145,-9.8052,75
0.3701,-9.8056,76
0.3465,-9.8038,77
0.3752,-9.799,78
0.4266,-9.8137,79
-0.1942,-9.8171,80
-0.72,-9.8093,81
0.0186,-9.8023,82
0.4608,-9.7992,83
0.3476,-9.8002,84
0.187,-9.7958,86
0.3383,-9.7923,87
0.3046,-9.7929,88
1.5723,-9.8125,89
0.133,-9.809,90
3.6959,-9.5124,91
-6.18,-9.7692,93
-0.7937,-9.7079,94
-0.8579,-9.705,95
-0.8406,-9.7069,96
-0.8071,-9.7068,97
-0.796,-9.7066,98
-0.8151,-9.7073,99
-0.7968,-9.706,100
-0.802,-9.7056,102
-0.7942,-9.7068,103
-0.7922,-9.7073,104
-0.7968,-9.7064,105
-0.8025,-9.7066,106
-0.7928,-9.7067,107
-0.8004,-9.7064,108
-0.7917,-9.7069,109
-0.7989,-9.7078,110
-0.7979,-9.7064,111
-0.7857,-9.7057,112
-0.792,-9.7072,114
-0.7922,-9.7059,115
-0.7945,-9.7068,116
-0.7989,-9.7078,117
-0.7847,-9.706,118
-0.8036,-9.7071,119
-0.7926,-9.705,121
-0.1616,-9.7025,122
0.8542,-9.7798,123
0.7964,-9.6687,124
-3.6969,-9.7892,125
-1.2665,-9.8144,126
-2.4986,-9.7784,127
-17.6324,-9.7218,128
6.1566,-9.7221,129
-0.833,-9.7971,130
-4.3864,-9.6832,131
0.7258,-9.7018,133
-1.2898,-9.5226,134
6.3969,-9.646,135
-0.2991,-9.6759,136
-1.128,-9.6524,137
2.4048,-9.643,138
3.9476,-9.645,139
-5.9381,-9.4327,140
4.1172,-9.6243,142
5.6431,-9.6559,143
1.6058,-9.7793,144
2.316,-9.8216,145
0.1042,-9.8047,146
-0.0659,-9.7929,147
0.026,-9.824,148
-0.19,-9.829,149
0.5031,-9.6785,150
0.9853,-10.056,152
0.2956,-9.8308,153
2.9194,-9.7712,154
1.6129,-9.6057,155
3.0222,-10.0231,156
5.3089,-9.7624,157
0.0186,-10.3861,158
-0.1959,-9.9834,159
7.602,-9.9666,160
2.3994,-9.8178,163
0.0084,-9.8437,164
0.8465,-9.7996,165
4.0366,-9.769,166
-5.5912,-9.6967,167
-0.085,-9.6827,168
0.6933,-9.6825,169
1.5073,-9.6819,170
1.4983,-9.6918,172
0.4228,-9.6936,173
1.1738,-9.6869,174
2.4847,-9.6878,176
0.7853,-9.679,177
-2.6839,-9.6599,178
-5.0289,-9.7061,179
2.8305,-9.6659,180
2.0638,-9.636,181
6.1099,-9.6511,182
-2.6126,-9.7167,183
-1.1705,-9.6636,184
1.0851,-9.6373,185
5.9668,-9.6532,186
1.4517,-9.6361,187
0.0659,-9.6364,188
-0.0599,-9.6133,189
0.3829,-9.5902,190
1.9415,-9.5674,191
-1.8473,-9.6575,192
6.9509,-9.7654,194
6.3616,-9.7721,195
5.4262,-9.8522,196
-0.8842,-9.6697,197
2.4989,-9.9071,198
3.0755,-9.1634,199
2.8233,-9.9258,200
9.4333,-9.9355,202
-12.7333,-9.5563,203
-6.0353,-9.2247,204
11.3796,-9.2208,205
-4.3848,-9.2479,206
15.0762,-9.6877,207
10.1583,-9.7047,208
1.2337,-9.7978,209
4.7236,-9.7678,210
2.7445,-9.9979,212
0.5249,-9.8079,213
1.9207,-9.8236,214
8.5088,-9.5549,215
5.8559,-9.7098,216
-0.397,-9.4391,217
1.1798,-9.9555,218
0.627,-9.8041,219
0.4913,-10.0125,220
5.5469,-9.8628,222
0.976,-9.8268,223
0.9625,-9.7908,224
9.5349,-9.8658,225
0.334,-9.7299,226
2.8976,-9.6416,227
1.6376,-9.8428,228
-0.0733,-9.6886,229
1.1622,-9.8889,230
1.7707,-9.8555,232
0.011,-9.8207,233
-0.5629,-9.859,235
2.1255,-9.8704,236
-5.6955,-9.2919,237
2.8675,-9.855,238
0.3642,-9.9203,239
1.8444,-9.8051,240
2.7311,-9.8481,241
4.5647,-10.0601,242
-0.8496,-9.7078,243
1.6345,-9.7847,244
1.7859,-9.9913,245
-0.6614,-9.731,246
2.3149,-9.7802,247
1.8434,-9.8738,248
-1.1221,-9.7665,249
3.9097,-9.6272,250
0.1026,-9.725,252
0.243,-9.7062,253
0.1165,-9.5578,254
-0.4544,-9.6823,255
0.8437,-9.6646,256
1.1968,-9.7713,257
-0.2282,-10.0135,258
0.1125,-9.8069,259
0.6755,-9.641,260
-0.0002,-9.9267,262
0.8637,-9.8456,263
2.3525,-9.9044,264
0.185,-9.9212,265
-0.1134,-9.8001,266
0.0016,-9.7678,267
-0.1485,-8.9871,268
4.5907,-9.8081,269
0.2689,-9.9893,270
0.6014,-9.8728,272
2.9154,-9.8342,273
1.0283,-9.5474,274
-2.1937,-9.7619,275
-13.1305,-9.7069,276
-12.727,-9.5753,278
-2.0013,-9.5352,279
22.496,-9.5452,280
-0.1663,-9.8084,281
0.0945,-9.8144,282
0.3154,-9.8061,283
-0.1306,-9.8118,284
-1.5976,-9.7822,285
0.3365,-9.7685,287
0.8238,-9.786,288
-8.5274,-9.7393,289
6.9925,-9.7215,290
3.4843,-9.7062,292
5.2033,-9.7609,293
1.6683,-9.7172,294
-0.5203,-9.7369,295
5.328,-9.7094,296
-5.2573,-9.6543,297
1.2011,-9.7193,298
3.735,-9.6893,299
0.4649,-9.7473,300
-0.7004,-9.7337,301
-0.6754,-9.7093,302
3.45,-9.7407,303
0.6454,-9.7516,304
0.7459,-9.7579,305
0.0177,-9.7549,306
-3.4332,-9.7053,308
4.2578,-9.847,309
8.6832,-9.4579,310
2.9833,-9.8955,311
-0.5559,-9.728,312
0.6115,-9.8002,313
0.5648,-9.6536,314
0.3016,-9.7433,315
-0.4147,-10.0291,317
2.3359,-9.878,318
2.1792,-9.9224,319
7.0935,-9.8705,320
0.5526,-9.7936,321
0.0882,-9.764,322
1.2009,-9.8789,323
0.4937,-9.8375,324
0.2311,-9.2887,325
1.8869,-9.9255,327
0.0239,-9.8359,328
0.658,-9.8354,330
0.3452,-9.8887,332
0.2893,-9.6752,333
0.119,-9.7834,334
0.0566,-9.9082,335
-0.2416,-9.7586,337
1.7476,-9.8892,338
3.8186,-9.4845,339
-0.0374,-9.8969,340
0.7793,-9.6652,341
0.0639,-9.9765,343
0.2106,-9.772,344
0.3995,-9.8044,345
-0.0995,-9.938,347
1.0719,-9.7433,348
2.7873,-9.8208,349
1.2778,-9.7031,350
0.4997,-9.7425,351
0.0308,-9.8322,352
0.7172,-9.8301,353
-0.5736,-9.8897,354
-0.144,-9.7788,355
-0.2675,-9.9474,356
0.0346,-9.9358,357
0.5332,-9.8144,358
6.3594,-9.8738,359
2.2704,-9.7729,360
1.7016,-9.7753,361
-0.0065,-9.8117,362
10.4265,-9.4399,363
0.807,-10.5408,364
0.4747,-9.8052,365
1.4872,-9.7712,367
0.0763,-9.7877,368
-0.1698,-9.8547,369
0.4124,-9.833,370
1.0428,-9.7566,371
-0.1607,-9.838,372
-0.1106,-9.7548,373
3.9785,-9.7149,374
1.0136,-9.7777,375
0.3734,-9.8269,377
1.3054,-9.7351,378
-2.4251,-9.7228,379
-2.807,-9.6589,380
4.593,-9.7058,381
0.8276,-9.6982,383
-1.4325,-9.6842,384
-8.0447,-9.6258,385
5.5636,-9.5787,387
1.9324,-9.735,388
6.1051,-9.714,389
5.5354,-9.7071,391
-3.0297,-9.3547,392
0.4315,-9.7874,393
7.4415,-9.965,394
4.2816,-9.8381,395
1.6888,-9.7538,396
2.1831,-9.6429,397
0.8996,-9.6432,398
0.4475,-9.8217,399
0.4937,-9.6985,400
1.9402,-9.7948,401
-0.0871,-9.7748,402
0.3337,-9.7467,403
-0.0599,-9.7593,404
0.3467,-9.67,405
0.2095,-9.8756,408
-0.0192,-9.8783,409
0.4983,-9.7879,410
0.0697,-9.8178,411
1.4922,-9.3372,412
-0.6721,-9.2982,413
-1.6538,-10.0624,414
3.7523,-9.8672,415
0.5266,-10.0043,417
0.6719,-9.8283,418
0.0818,-9.8536,419
-0.0319,-9.5559,420
0.2357,-9.685,421
0.3977,-9.8603,422
0.2458,-9.6531,423
0.8166,-9.8269,424
-0.0319,-9.9147,425
0.2898,-9.6809,427
4.8005,-9.8367,428
0.4984,-8.6755,429
4.7419,-9.9323,430
2.6838,-9.0724,431
7.8245,-9.9025,432
1.3526,-9.7881,433
-13.1381,-9.6462,434
4.3526,-9.5566,436
2.9274,-9.787,437
-1.9506,-9.7224,438
-5.7771,-9.6399,439
9.3883,-9.7491,440
9.7261,-9.6531,442
1.4005,-9.7946,443
3.7633,-9.8067,444
0.8678,-9.9282,445
2.8501,-9.0659,446
-0.9378,-9.9679,447
0.4541,-9.3505,448
2.0065,-9.6611,450
0.7532,-9.8261,451
1.513,-9.8647,452
0.249,-9.7303,453
0.2074,-9.7898,454
2.3198,-9.9557,455
0.1059,-9.9838,456
-0.3062,-9.7924,457
0.4984,-9.7869,458
0.5272,-9.8049,459
0.0801,-9.8345,460
3.209,-9.7836,461
0.5499,-9.8412,462
0.3878,-9.8425,463
0.3982,-9.7656,464
-9.4434,-9.7533,465
1.6164,-9.4943,466
-6.0445,-9.4642,467
13.6822,-9.5738,468
-5.7938,-9.488,469
-0.1027,-9.7115,470
-7.8565,-9.781,472
3.647,-9.8911,473
-0.2014,-9.8384,474
-0.4498,-9.775,475
0.5234,-9.7381,476
1.6601,-9.757,478
0.1509,-9.7858,479
-0.4444,-9.9427,480
0.6409,-9.6932,482
5.6872,-9.853,483
2.5047,-9.7673,484
-0.1575,-9.8867,485
-0.2523,-9.7827,486
0.8777,-9.9567,487
-0.0722,-9.7313,488
-0.1257,-9.7529,489
0.1645,-10.246,490
-0.5641,-9.7383,492
0.9975,-9.8078,493
-0.0086,-9.8736,494
0.3946,-9.8997,495
-0.0543,-9.6596,496
0.1519,-9.5897,497
-0.8704,-9.7881,498
0.3941,-10.1294,499
0.7348,-9.9768,500
1.0099,-9.7968,502
0.4986,-9.9893,503
0.0576,-9.6427,504
0.8729,-9.6917,505
-0.359,-9.9288,506
-0.0101,-9.8401,507
0.6144,-9.8234,509
-0.0185,-9.894,510
-0.1872,-9.7199,511
0.2757,-9.8647,513
0.115,-9.8305,514
0.1159,-9.7256,515
1.8281,-9.9567,516
0.7357,-10.1197,517
0.0584,-9.8745,518
6.6738,-10.0177,519
2.2345,-9.8549,520
0.9747,-9.8823,521
0.8929,-9.7687,523
2.8065,-9.7911,524
0.4007,-9.294,525
0.8996,-10.0143,526
-0.0959,-9.7838,527
5.5489,-10.3125,528
-0.168,-9.869,529
0.0341,-9.8546,530
0.5371,-9.777,532
0.316,-9.7918,533
0.4199,-9.6651,534
0.1258,-9.9093,535
1.0155,-9.8035,536
-0.0182,-9.6715,538
0.5167,-9.8613,539
1.5135,-9.5239,540
0.5799,-9.9236,542
0.1328,-9.7343,543
0.1874,-9.8359,544
-0.0261,-9.7436,545
0.704,-9.5652,546
-0.1587,-10.1653,547
-0.2579,-9.9524,548
0.2391,-9.9794,549
1.1491,-9.6232,550
-0.0336,-9.6258,552
0.201,-9.8154,553
0.2305,-9.8373,554
-0.324,-9.7372,555
0.0094,-9.6627,556
0.0993,-9.744,557
0.0617,-9.8923,558
-0.0179,-9.9439,559
0.117,-9.9131,560
1.8943,-9.9092,562
0.3336,-9.777,563
1.6089,-9.4051,564
2.1609,-10.1096,565
0.4413,-9.7716,566
-0.2317,-9.9825,567
-0.107,-10.0026,568
1.6905,-9.852,569
3.9608,-9.8182,570
-0.031,-9.7408,571
0.072,-9.7896,572
0.299,-9.8421,573
0.0311,-9.815,574
-0.0729,-9.773,575
-0.1191,-9.834,576
1.2419,-9.7897,577
0.3625,-9.7923,578
2.2737,-9.9168,579
-0.1853,-9.9024,580
3.019,-8.6462,581
1.5256,-9.981,583
10.8186,-10.0024,584
-0.263,-9.8136,585
2.1067,-9.9358,586
1.4486,-9.815,587
-0.0582,-9.5627,588
0.621,-9.6513,589
0.0535,-9.9403,590
0.1629,-9.7955,592
0.5367,-9.8364,593
1.2192,-9.9688,594
0.9089,-9.6334,595
-0.0456,-9.9912,596
0.8101,-9.8417,598
1.6725,-9.7336,599
3.434,-9.8654,600
4.7969,-9.8669,602
5.246,-9.8488,603
2.4671,-9.9504,604
5.8796,-10.0086,605
0.9693,-9.6562,606
-1.6515,-9.5987,607
2.8959,-9.7676,608
0.4221,-9.8903,609
0.6206,-9.8334,610
0.9134,-9.8475,612
0.0633,-9.8272,613
1.2177,-9.8148,614
0.4422,-9.9753,615
1.3354,-9.8722,616
0.1871,-10.125,617
0.2855,-9.8437,618
2.4379,-9.9238,619
0.3873,-9.9005,620
1.166,-9.8132,622
0.9788,-9.8354,623
0.7574,-9.8504,624
-0.7128,-9.8151,625
2.3479,-9.8509,626
0.2533,-9.6241,627
6.468,-9.5561,628
0.5722,-9.8756,629
0.8251,-9.6636,630
0.2533,-9.8462,633
0.2256,-9.8069,634
-0.2265,-9.8707,635
-0.065,-10.0745,636
-0.2411,-9.7985,637
0.342,-9.7284,638
0.1858,-9.7315,639
0.0194,-9.8007,640
0.4891,-10.05,642
0.1119,-9.8296,643
0.3933,-9.7186,644
-0.2364,-9.7323,645
0.5609,-9.8046,646
0.0641,-9.8244,647
-0.0145,-9.6293,648
0.4725,-9.7611,649
0.1018,-9.9226,650
0.5128,-9.7956,652
0.8739,-9.8417,653
-0.2078,-9.9434,654
0.1465,-9.723,655
0.0518,-9.6962,656
0.6245,-9.7809,658
2.8925,-9.7717,659
1.3328,-9.8327,660
-1.393,-9.765,662
0.5312,-9.7927,663
0.4587,-9.8077,664
-0.3298,-9.8258,665
0.5131,-9.8035,666
13.4538,-9.8462,667
1.5068,-9.6983,668
-0.4137,-9.8005,669
0.0922,-9.8577,670
0.886,-9.6021,672
0.3359,-9.8188,673
0.9367,-9.7259,674
4.5611,-9.3093,675
0.8258,-9.8592,676
-0.0328,-9.8038,677
0.1365,-9.8006,679
0.2421,-9.8278,680
0.1387,-9.5552,681
0.739,-9.798,682
-0.0002,-9.8624,683
0.1155,-9.7998,684
0.6438,-9.8565,685
4.4613,-10.0254,686
0.199,-9.7859,687
2.5899,-9.8465,688
1.246,-9.9915,689
1.1046,-8.9333,690
0.3303,-9.814,693
0.8572,-9.6988,694
-0.3194,-9.7144,695
-0.1084,-9.694,696
0.5461,-9.8935,697
1.7218,-9.7532,698
1.0026,-9.943,699
-0.0908,-9.7162,700
1.6631,-9.7795,702
0.0891,-9.8467,703
0.6738,-9.9548,704
0.9393,-9.6797,705
0.1666,-10.1029,706
0.6927,-10.0665,707
1.8593,-9.8231,708
0.7455,-9.8756,709
2.3605,-10.0301,710
2.6721,-9.7635,712
0.4264,-9.8632,713
-0.2801,-9.7782,714
0.72,-9.7509,715
3.2118,-9.6366,716
1.8204,-9.8343,718
2.2109,-9.7854,719
-0.9861,-9.8694,720
2.7929,-9.8244,722
6.373,-10.3379,723
2.6346,-9.8448,724
-1.8316,-10.0054,725
0.7246,-9.9427,726
2.6436,-9.7179,727
1.7705,-10.0965,728
-0.1446,-9.8748,729
10.2782,-9.6189,730
-0.607,-10.1684,732
0.2666,-9.8452,733
5.1661,-9.8716,734
1.9391,-9.8241,735
0.7214,-9.861,736
0.4554,-9.7655,738
-0.0693,-9.7764,739
0.367,-9.7631,740
0.8002,-9.84,741
0.8416,-9.898,742
-0.6627,-9.6855,743
1.1161,-9.9249,744
4.1226,-9.942,745
7.2197,-9.6867,746
0.7206,-9.7021,747
1.6559,-9.7061,748
0.5972,-9.5416,749
0.3422,-9.9284,750
2.6008,-9.6467,751
-0.0168,-9.7445,753
3.541,-9.7583,754
1.0857,-9.8824,755
0.0689,-9.7618,756
1.9242,-9.5943,757
1.2385,-9.8547,758
0.0301,-9.8234,759
-0.101,-9.6682,760
1.4435,-9.9328,762
3.0112,-9.811,763
3.0539,-9.4927,764
3.4687,-9.9901,765
0.2251,-9.437,766
-0.0191,-9.4641,767
-0.5263,-9.7656,768
0.918,-9.8356,769
2.3649,-9.6477,770
0.6074,-10.003,772
0.9184,-9.8321,773
1.0086,-9.6774,774
0.5991,-9.6709,775
-0.0112,-9.8784,776
0.0832,-9.8153,778
-0.1543,-9.7892,779
-0.0069,-9.8462,780
-1.1741,-9.9963,782
8.0916,-9.8183,783
0.6166,-9.8296,784
0.266,-9.7656,785
-0.5546,-10.1439,786
0.5457,-9.9264,787
0.3491,-10.0092,788
-0.3864,-9.7694,789
-0.0733,-9.7669,790
1.0978,-9.8285,791
1.5003,-9.7954,793
0.6209,-9.8429,794
-0.2975,-9.7766,795
0.5557,-9.7997,796
0.0218,-9.976,797
-0.0229,-9.8842,798
0.4603,-9.7272,799
0.2855,-9.8152,800
0.646,-10.0453,801
1.0941,-9.8141,803
0.6131,-9.8707,804
0.2262,-9.7981,805
0.0114,-9.9215,806
-0.0945,-9.9114,807
0.2342,-9.8828,808
0.2562,-9.9163,809
2.7683,-9.7964,810
0.3794,-9.8469,812
0.491,-9.7903,813
-0.0211,-9.9618,814
1.1977,-9.7788,815
-0.9442,-9.6914,816
2.0055,-9.7703,817
0.3992,-9.6368,818
0.8131,-9.6943,819
0.8811,-9.7844,820
0.0815,-10.0266,822
1.0726,-9.843,823
0.3481,-9.7994,824
0.645,-9.6408,825
0.0598,-9.8267,826
-0.3436,-9.9136,827
0.3965,-9.8438,828
0.2119,-9.7888,829
0.7403,-9.6579,830
0.0005,-9.7662,832
0.1926,-9.8339,833
0.9386,-9.7334,834
1.2886,-9.8722,835
2.0947,-9.9897,836
0.1429,-9.7481,838
2.2889,-9.9116,839
0.0776,-9.7869,840
-0.1349,-9.8964,842
0.6604,-9.8172,843
0.4772,-9.8647,844
0.0045,-9.5814,845
0.2121,-9.6789,846
0.0009,-9.7246,847
0.8498,-9.9023,848
0.287,-9.7995,849
1.303,-9.7426,850
1.133,-9.7971,851
0.0979,-9.7885,852
0.4585,-9.7302,853
-0.0362,-9.7732,854
-0.191,-9.6973,855
1.6083,-9.8182,856
1.2146,-9.8128,857
14.185,-9.9241,858
1.2633,-9.6978,859
0.4809,-9.8807,860
1.3335,-9.8849,862
2.5782,-9.8062,863
-0.2131,-9.6903,864
0.1293,-10.1576,865
-0.6512,-10.0791,866
-0.2788,-9.8063,867
0.1558,-9.8796,868
0.4657,-9.9469,869
0.4246,-10.1216,870
0.6059,-9.8708,872
1.1145,-9.8325,873
1.9605,-9.9796,874
0.293,-9.8358,875
-0.3031,-9.7072,876
1.3944,-9.7243,877
0.2439,-9.856,878
0.6953,-9.8915,879
0.0694,-9.8332,880
7.5767,-9.8622,882
2.8428,-9.8181,883
-0.0065,-10.0192,884
0.3888,-10.1005,885
0.438,-9.7157,887
-0.0674,-9.8401,888
0.6686,-9.8807,889
-0.0417,-9.8175,890
-0.4133,-9.7374,891
-0.1279,-9.8142,892
0.6341,-9.9134,893
0.073,-9.8031,894
0.276,-9.8347,895
-0.095,-9.9244,896
1.295,-10.0077,898
1.2355,-9.6884,899
0.3138,-9.8397,900
-0.251,-9.9132,901
0.2146,-9.7806,903
-0.047,-9.6901,904
-0.3708,-9.6712,905
4.599,-9.6913,906
0.155,-9.8876,907
-0.4056,-9.7322,908
0.0806,-9.8964,909
0.9232,-9.6748,910
-0.8212,-9.9402,912
0.2758,-9.7081,913
0.0257,-10.062,914
-0.1446,-9.5832,915
-0.5543,-9.8218,916
0.6768,-9.785,917
5.9571,-9.5697,918
0.2311,-9.8458,919
-0.1214,-9.8521,920
-0.0162,-9.7686,922
0.7508,-9.8994,923
3.2276,-9.68,924
-0.0861,-10.0219,925
-0.0301,-9.5533,926
0.0322,-9.6529,927
-0.0529,-9.8378,928
1.3991,-9.7301,929
0.4153,-9.7707,930
0.2197,-9.7498,932
1.5669,-9.7464,933
2.9984,-9.729,935
0.6062,-9.8313,936
0.34,-9.778,937
-1.5022,-8.7667,938
0.3391,-9.9027,939
0.9867,-9.827,940
1.486,-9.5867,941
2.5595,-10.0138,942
2.7469,-9.5402,943
1.8774,-9.682,944
0.7347,-9.6216,945
0.7263,-9.617,946
0.1275,-9.757,947
5.1584,-9.9194,948
1.8016,-9.7803,949
1.207,-9.9625,950
0.4931,-10.0167,951
0.6909,-9.7573,953
-0.2088,-9.633,954
-0.1131,-9.6186,955
0.5003,-9.8303,956
0.7419,-9.6167,958
0.289,-10.0397,959
0.9377,-9.7841,960
0.2975,-9.7735,962
0.3813,-9.7841,963
-0.0683,-9.6836,964
2.2459,-9.954,965
1.0916,-9.7222,966
-0.1286,-9.9924,967
-0.4825,-9.8277,968
0.6133,-9.9347,969
0.6461,-9.9418,970
0.1045,-9.6301,972
-0.0656,-9.7218,973
-0.1619,-9.9363,974
-0.0251,-9.5816,975
-0.1707,-9.9269,976
0.0488,-9.8734,977
1.2606,-9.8178,978
0.2929,-9.8348,979
0.9573,-9.3353,980
0.0034,-9.9649,982
0.375,-9.9153,983
-0.3149,-9.7416,984
0.3567,-9.5633,985
0.2048,-9.564,986
-0.2748,-9.9904,987
0.8924,-9.6902,988
0.5628,-9.7723,989
0.6185,-9.7577,990
0.6842,-9.6328,992
0.1389,-9.8836,993
0.0899,-9.7779,994
0.179,-10.049,995
0.2664,-9.6974,996
0.1419,-9.7343,997
1.2022,-9.8252,998
0.5138,-9.6775,999
0.151,-9.8948,1000
0.0288,-9.9319,1002
0.1079,-9.9266,1003
0.0917,-9.8211,1004
-0.2435,-9.6764,1005
-0.153,-9.9045,1006
-0.0801,-9.8453,1007
-0.3864,-9.8888,1008
0.431,-9.8885,1009
-0.0538,-9.8245,1010
0.343,-9.792,1012
-0.0906,-9.3167,1013
-0.0106,-10.0158,1014
0.2937,-9.4109,1015
0.6634,-10.4277,1016
0.172,-10.0342,1018
1.6078,-9.9721,1019
-0.0348,-9.9163,1020
0.8669,-9.9527,1022
0.2337,-9.8541,1023
2.782,-9.8027,1024
-0.0513,-9.8003,1025
0.1823,-9.8433,1026
0.417,-9.7763,1027
2.4569,-9.8448,1028
0.0385,-9.8197,1029
0.133,-9.8864,1030
-0.1961,-9.768,1032
2.2195,-9.8442,1033
1.2975,-9.959,1034
-0.0419,-9.8482,1035
0.9711,-9.6142,1036
0.3571,-10.0176,1037
0.3188,-9.7676,1038
-0.4743,-9.9673,1039
-1.2897,-9.3762,1040
0.2357,-9.8196,1042
1.6989,-9.8199,1043
0.1409,-9.8997,1044
10.8684,-9.8741,1045
-2.0171,-9.7801,1046
-0.0465,-9.8385,1047
-19.6454,-9.5947,1048
20.6777,-9.5564,1049
-5.9775,-9.7793,1051
-0.6901,-9.7951,1052
-0.5064,-9.8079,1053
0.2794,-9.8058,1054
0.1578,-9.8072,1055
0.0194,-9.8107,1056
0.1013,-9.817,1057
0.0208,-9.8104,1058
0.1475,-9.8099,1059
0.0049,-9.8115,1060
-0.0263,-9.8114,1061
-0.2206,-9.8063,1062
0.0152,-9.8087,1063
-0.2028,-9.8041,1064
-0.0133,-9.8028,1065
0.185,-9.8065,1068
-3.5864,-9.8279,1069
7.8149,-9.7204,1070
-0.0823,-9.7958,1071
0.3995,-9.8079,1072
0.0122,-9.8071,1073
0.1644,-9.812,1074
-0.5864,-9.8125,1075
1.667,-9.7921,1077
0.0452,-9.8105,1078
0.021,-9.8105,1079
-0.067,-9.802,1080
-0.0059,-9.8148,1081
-0.1112,-9.8109,1082
-0.0031,-9.8132,1083
0.0371,-9.8182,1084
-0.1998,-9.8112,1085
-0.1493,-9.811,1087
-0.0834,-9.8115,1088
-0.0323,-9.8119,1089
-0.0364,-9.8126,1090
-0.0983,-9.814,1091
0.445,-9.8048,1092
0.4568,-9.8129,1093
-0.1946,-9.8112,1094
-0.3551,-9.8071,1095
0.0179,-9.8069,1097
0.1377,-9.8086,1098
-0.6054,-9.8079,1099
0.4007,-9.8089,1100
0.0001,-9.8087,1101
0.1482,-9.8087,1102
-0.0773,-9.8067,1103
0.2006,-9.808,1104
0.1633,-9.8063,1108
0.2006,-9.8057,1109
0.1344,-9.8059,1111
-0.5711,-9.799,1112
0.5795,-9.7956,1113
0.3765,-9.7969,1114
0.3313,-9.7952,1115
0.2571,-9.7955,1116
0.3753,-9.7958,1118
0.3655,-9.7944,1119
0.658,-9.8005,1120
-0.0214,-9.7984,1121
0.0365,-9.8032,1122
0.1841,-9.7971,1123
0.4551,-9.7985,1124
0.0485,-9.7963,1125
0.4504,-9.7952,1127
0.4816,-9.8005,1128
0.6321,-9.8025,1129
5.7703,-9.7697,1130
-1.9479,-9.8136,1131
0.1001,-9.8107,1132
0.0831,-9.8046,1133
0.1651,-9.8096,1134
-0.2562,-9.8034,1135
0.1058,-9.805,1137
0.2504,-9.8019,1138
0.1852,-9.8015,1139
0.2443,-9.802,1140
0.2955,-9.8004,1141
0.2776,-9.8016,1142
0.2647,-9.8023,1143
0.1001,-9.7941,1144
2.9726,-9.7866,1145
-0.2424,-9.8043,1146
0.0937,-9.8045,1147
-0.2248,-9.7949,1148
-0.0611,-9.7974,1150
0.382,-9.7969,1151
0.1433,-9.796,1152
0.1333,-9.7898,1153
0.2222,-9.7791,1154
-0.9554,-9.7974,1155
0.2702,-9.8108,1157
0.1311,-9.8039,1158
0.3294,-9.8028,1159
0.2101,-9.8061,1160
0.1476,-9.8018,1161
-1.5628,-9.7852,1162
1.4664,-9.7973,1164
0.2063,-9.8035,1165
0.1982,-9.8024,1166
0.8431,-9.8068,1168
-2.2458,-9.7702,1169
0.5932,-9.7675,1170
-0.9548,-9.7555,1171
-0.6963,-9.7455,1172
-0.814,-9.7671,1173
1.7489,-9.7581,1174
0.0287,-9.785,1175
0.2683,-9.7785,1176
-3.692,-9.6426,1178
4.8419,-9.4687,1179
6.0036,-9.5844,1180
0.5744,-9.5659,1181
0.395,-9.59,1182
-1.9361,-9.4779,1183
3.0984,-9.5196,1184
-0.1165,-9.5099,1185
-0.4087,-9.4861,1186
8.4478,-9.4593,1188
-3.2301,-9.6613,1189
-4.5051,-9.5158,1190
-14.3059,-9.7115,1191
28.672,-9.4634,1192
6.5012,-9.4966,1193
-7.2559,-9.5333,1194
9.3143,-9.7473,1195
2.5307,-9.8337,1197
0.2142,-9.8242,1198
0.8592,-9.7987,1199
0.7082,-9.7303,1200
0.6094,-9.7842,1201
-0.0203,-9.786,1202
0.7883,-9.9265,1203
0.5498,-9.9485,1204
5.9096,-9.7544,1205
1.2091,-9.7011,1206
1.1927,-9.7164,1208
1.7564,-9.8757,1209
0.832,-9.9562,1210
0.0609,-10.2844,1211
-0.1188,-9.862,1212
-0.4702,-9.8913,1213
0.3335,-9.7643,1214
-0.0033,-9.7001,1215
0.2659,-9.7714,1217
0.5868,-9.7317,1218
0.0581,-9.8474,1219
0.1679,-9.8509,1220
0.2027,-9.7034,1221
0.2981,-9.6438,1222
-0.1404,-9.8981,1223
0.363,-9.8054,1224
0.3678,-9.8538,1225
0.459,-9.8146,1227
0.206,-9.7813,1228
0.1568,-9.8927,1229
0.4642,-9.6957,1230
-0.2234,-9.9799,1231
-0.2247,-10.267,1232
1.0732,-9.964,1233
-0.3359,-9.4633,1234
0.2125,-10.0331,1235
1.5578,-9.4623,1236
0.7438,-9.8464,1238
1.7469,-9.8393,1239
0.0104,-9.7912,1240
-0.3897,-9.7687,1241
0.9158,-9.8213,1242
0.0809,-9.7048,1243
-0.451,-9.9236,1244
0.587,-9.8327,1245
-9.1249,-9.6283,1246
-0.0893,-9.7617,1248
-0.2234,-9.7877,1249
-0.4288,-9.7898,1250
0.0935,-9.7965,1251
0.1418,-9.7823,1252
-0.1944,-9.8095,1253
-1.2938,-9.7982,1254
1.5805,-9.7423,1255
0.009,-9.8158,1257
-5.9915,-9.7778,1258
28.2194,-9.6373,1259
7.1026,-9.6738,1260
2.3388,-9.8015,1261
0.1512,-9.5122,1262
-0.1669,-9.8892,1263
-0.0972,-9.7916,1264
-0.397,-9.8081,1265
0.2991,-10.0186,1267
0.432,-9.9544,1268
-0.1563,-9.8606,1269
0.3185,-9.8386,1270
-0.0731,-9.6007,1271
-0.3167,-9.8054,1272
2.9281,-9.6995,1273
0.5504,-9.6733,1274
-0.0172,-9.8819,1275
-0.0915,-10.0038,1277
1.6321,-9.8436,1278
0.7087,-9.8791,1279
0.0449,-10.662,1280
0.8405,-9.6118,1281
2.747,-9.8661,1282
0.4929,-9.8185,1283
1.6052,-9.8296,1284
-0.2041,-10.0546,1285
0.5048,-9.9291,1287
0.0663,-9.9193,1288
1.0737,-9.7531,1289
3.3578,-9.5698,1290
0.2554,-9.8045,1291
-0.5837,-9.7598,1292
0.4915,-9.8084,1293
0.1294,-9.7668,1294
0.1594,-9.8852,1295
-0.6453,-10.026,1296
0.4936,-9.7959,1298
-0.1478,-9.8141,1299
0.4916,-9.6966,1300
0.8817,-8.6429,1301
-0.4558,-10.2609,1302
0.2904,-9.6439,1303
-0.299,-9.9935,1304
-0.0253,-9.7415,1305
1.2237,-9.8044,1307
0.5142,-9.7158,1308
0.0725,-9.9513,1309
1.636,-9.7666,1310
1.025,-9.8803,1311
0.243,-9.8869,1312
0.5366,-10.0111,1313
0.221,-9.7912,1314
0.3097,-9.9362,1315
0.0357,-9.6818,1317
0.6741,-9.8053,1318
0.271,-9.8049,1319
0.0872,-9.4845,1320
-0.0174,-9.6781,1321
0.0249,-9.9008,1322
-0.1745,-9.8609,1323
0.8303,-9.8672,1324
1.7185,-9.8754,1325
-0.1066,-9.6425,1327
3.6938,-9.8222,1328
1.6098,-9.7734,1330
0.5614,-9.8201,1331
0.89,-9.742,1332
-0.0029,-9.5806,1333
0.8873,-9.8165,1334
0.0956,-9.8338,1335
0.2116,-9.6482,1337
-0.0725,-9.7118,1338
0.6021,-9.9985,1339
0.0392,-9.8372,1340
-0.0967,-9.872,1341
0.3448,-9.7598,1342
0.533,-9.927,1343
-0.0972,-9.6735,1344
0.3893,-9.9857,1345
0.0432,-9.7881,1346
0.5193,-9.8842,1348
0.1512,-9.6853,1349
0.8155,-10.1107,1350
-0.2733,-9.8783,1351
0.4351,-9.7093,1352
0.6824,-9.9476,1353
0.3997,-9.7148,1354
0.2052,-9.8573,1355
0.0599,-9.9069,1357
3.7862,-9.8709,1358
0.5092,-9.6542,1359
-0.3721,-9.6314,1360
0.7869,-9.7776,1361
-0.4409,-9.726,1362
0.3913,-10.0347,1363
1.0698,-9.6959,1364
-0.3647,-9.7427,1365
0.8754,-9.8795,1367
5.0185,-9.866,1368
-0.1855,-9.6563,1369
1.111,-10.1535,1370
0.8989,-9.7193,1371
0.8672,-9.7567,1372
-0.2285,-9.8447,1373
0.3826,-9.6593,1374
1.2522,-9.6568,1375
0.6384,-9.663,1377
0.0685,-9.8312,1378
0.0442,-9.8115,1379
2.0506,-9.8716,1380
0.0752,-10.0082,1381
-0.1892,-9.7755,1382
2.6613,-10.2589,1383
1.9453,-9.9747,1384
0.631,-10.0329,1385
0.8078,-9.5756,1386
3.3232,-9.7772,1388
0.334,-9.8655,1389
-0.006,-9.8855,1390
1.354,-9.8277,1391
3.8972,-9.6085,1392
16.5196,-10.3164,1393
-3.2028,-10.1748,1394
13.7168,-9.8081,1395
1.5684,-9.7505,1396
0.1813,-9.8173,1398
2.0761,-9.9407,1401
0.4008,-9.7409,1402
-0.2446,-9.8501,1403
0.5122,-10.0521,1404
0.3381,-9.876,1405
0.4662,-10.1932,1407
1.238,-9.7711,1408
0.7432,-9.5575,1409
0.4235,-9.8916,1410
1.0254,-9.784,1411
-0.3886,-9.8832,1412
0.532,-9.4356,1413
1.1906,-9.838,1414
-0.0275,-9.7342,1415
0.155,-9.6714,1417
0.1842,-9.8421,1418
1.207,-9.7298,1419
1.516,-9.7503,1420
0.0251,-9.9512,1421
-0.0806,-9.7619,1423
0.14,-9.8012,1424
-0.1828,-9.6372,1425
0.6657,-10.0363,1426
1.1618,-9.73,1427
0.1052,-9.782,1428
0.0738,-9.8654,1429
0.2806,-9.8124,1430
9.7759,-8.9253,1431
25.6872,-9.4886,1432
3.028,-9.924,1433
-0.7971,-10.0383,1434
-0.054,-9.8194,1435
0.8981,-9.9045,1436
0.4872,-8.148,1438
0.005,-9.8551,1440
-0.0484,-9.8089,1441
-0.4326,-9.8266,1442
3.9468,-9.9242,1443
-0.0538,-10.0291,1444
27.3295,-9.7957,1445
7.2986,-9.7709,1447
0.159,-9.8012,1448
-1.2246,-7.5049,1449
-0.2154,-9.642,1450
-0.2603,-9.2449,1451
0.7209,-10.1101,1452
0.0161,-9.8484,1453
-0.103,-9.8139,1454
6.5519,-9.8232,1455
2.8815,-9.5133,1457
0.2331,-9.7369,1458
0.4196,-10.1192,1459
0.584,-9.9522,1460
1.6938,-9.8236,1461
0.0068,-9.8739,1462
-0.064,-9.6665,1463
-0.3175,-9.7391,1464
1.3317,-9.9017,1465
1.6475,-9.6319,1467
0.1035,-9.7351,1469
0.4186,-9.7765,1470
0.0666,-9.7239,1471
0.0504,-9.7679,1472
-0.0222,-8.1125,1473
0.3798,-10.044,1474
0.0972,-9.8975,1475
-0.2329,-9.7993,1476
2.5514,-9.782,1477
0.6948,-9.807,1478
0.309,-9.8555,1479
0.5109,-9.7895,1480
0.9819,-9.7799,1481
0.0438,-9.8125,1482
0.5695,-9.8464,1483
-0.1621,-9.5727,1484
0.2218,-9.8179,1485
0.8759,-9.6462,1486
0.2092,-9.7464,1488
0.4748,-9.7952,1489
0.1452,-9.6909,1490
0.1484,-9.7394,1491
-0.0706,-9.6153,1492
0.3827,-9.8867,1493
1.0545,-9.103,1494
-0.1312,-9.7985,1495
-0.1705,-9.7638,1497
-0.0351,-9.8191,1498
0.3916,-9.975,1499
0.0797,-9.7299,1500
-0.5638,-9.9631,1501
0.018,-9.6147,1502
-0.1373,-9.6815,1503
0.2207,-9.6377,1504
-0.1452,-9.9189,1505
-0.0219,-9.8405,1507
-0.0646,-9.8317,1508
0.509,-10.7026,1509
-0.1433,-9.8098,1510
-1.667,-9.8465,1511
-0.4217,-10.0112,1512
0.0066,-9.922,1513
0.64,-9.9937,1514
-0.3308,-9.948,1515
0.5694,-9.8835,1517
0.1779,-9.7563,1518
0.1122,-9.719,1519
1.3808,-9.9688,1520
0.2382,-9.7581,1521
-0.1821,-10.0242,1522
-1.1836,-9.7048,1523
-0.0996,-9.8929,1524
2.4794,-9.6662,1525
-0.1518,-9.438,1527
0.8677,-9.8292,1528
-0.1011,-9.6952,1529
1.3445,-9.7951,1530
-0.2609,-9.7132,1531
2.3781,-9.8071,1532
1.2343,-9.7223,1533
0.6117,-9.7412,1534
-0.6893,-9.7131,1535
0.4545,-9.7747,1536
0.1544,-9.8426,1538
0.5706,-9.8256,1539
0.5196,-9.7234,1541
-0.0914,-9.9222,1542
0.9431,-9.7593,1543
0.482,-9.5803,1544
0.6867,-9.9115,1545
-0.0791,-8.7055,1547
0.8036,-9.8981,1548
3.5115,-9.6927,1549
2.4347,-9.3381,1550
1.8829,-9.8724,1551
0.2334,-9.7491,1552
0.0253,-9.2977,1553
0.0585,-9.8154,1554
0.1401,-9.6653,1555
0.6588,-9.7312,1557
1.1506,-9.9464,1558
2.8864,-9.8294,1559
-0.4772,-9.7172,1560
-0.8564,-10.0435,1561
0.4991,-10.3625,1562
-0.6236,-8.6635,1563
-1.312,-9.5089,1564
1.1719,-9.4002,1565
1.8951,-10.016,1567
2.797,-9.5465,1568
1.1597,-9.4495,1569
0.4337,-9.3898,1570
-0.162,-9.2313,1571
0.0111,-9.9659,1572
2.2796,-9.9593,1573
-0.2672,-9.1516,1574
0.1081,-9.6446,1575
0.3486,-9.8424,1577
0.7129,-9.9698,1578
0.7757,-9.2219,1579
2.5258,-10.2076,1580
0.1782,-9.2181,1581
0.1423,-9.9084,1582
0.2178,-9.9664,1583
0.4977,-9.5023,1584
2.2586,-9.904,1585
0.6899,-9.7907,1587
1.4769,-9.6094,1588
0.2156,-9.729,1589
-0.3107,-10.0141,1590
2.9638,-9.7121,1591
0.1924,-10.016,1592
0.6269,-9.8096,1593
-0.7924,-9.7486,1594
0.4647,-9.5956,1595
3.3063,-9.8087,1597
0.4301,-9.8173,1598
-8.4095,-9.713,1599
-3.9912,-9.7348,1600
-5.0163,-9.8312,1601
18.0058,-9.0198,1602
4.4197,-9.7186,1603
2.8949,-9.8933,1604
-1.497,-9.9033,1605
3.6401,-9.6274,1608
1.1796,-9.7788,1609
3.9599,-9.9197,1610
0.1312,-9.9218,1611
-0.1904,-9.7759,1612
-0.0464,-9.7169,1613
1.4115,-9.8789,1614
1.7786,-9.7902,1615
0.6365,-9.76,1616
1.5312,-9.8986,1618
0.4817,-9.8529,1619
1.2662,-9.8054,1620
0.7967,-9.8936,1621
0.3033,-9.734,1622
0.2136,-9.9794,1623
1.91,-9.8584,1624
-0.0607,-9.8511,1625
1.2944,-9.8555,1626
0.2418,-9.849,1628
11.3464,-9.7191,1629
-0.5408,-9.9646,1630
-41.6867,-9.529,1631
0.4191,-9.0715,1632
24.2716,-9.5457,1634
-5.5186,-9.476,1635
-0.9646,-9.407,1636
25.185,-9.4717,1637
-3.502,-9.5976,1638
1.6641,-9.3101,1639
2.344,-9.5887,1640
1.9489,-9.6783,1642
0.3349,-9.6461,1643
-1.9783,-9.6945,1644
-0.7965,-9.7237,1645
-1.1921,-9.7078,1646
-0.0672,-9.7195,1647
1.941,-9.7418,1648
2.9354,-9.7158,1649
2.1032,-9.7608,1650
0.1763,-9.8033,1652
-3.6482,-9.7595,1653
-10.9677,-9.5975,1654
-45.3445,-9.2457,1655
19.799,-9.2817,1656
-24.0501,-9.3948,1657
-0.9981,-9.2609,1658
8.7205,-9.4525,1659
-26.612,-9.5335,1660
3.6179,-9.5998,1662
0.2439,-9.587,1663
-5.7585,-9.5899,1664
-0.0286,-9.5085,1665
13.9311,-9.639,1666
0.6344,-9.6751,1667
-8.7081,-9.4563,1668
3.9885,-9.3664,1669
9.3629,-9.615,1670
0.9533,-9.75,1673
-2.6191,-9.752,1674
1.8186,-9.7464,1675
-0.7851,-9.7687,1676
-1.6575,-9.7531,1677
-0.6798,-9.751,1678
-0.9615,-9.7515,1679
-1.0364,-9.7356,1680
1.7391,-9.7486,1682
-0.4421,-9.7756,1683
-1.2774,-9.7667,1684
-2.1032,-9.7443,1685
0.8465,-9.7437,1686
0.8187,-9.7673,1687
-0.2307,-9.7838,1688
-0.7475,-9.7788,1689
-0.7558,-9.7758,1690
-0.5435,-9.7704,1692
-0.3032,-9.7747,1693
-0.8308,-9.7726,1694
-0.8631,-9.7647,1695
-2.8533,-9.7486,1696
-3.9172,-9.6835,1697
0.3598,-9.684,1698
-4.1355,-9.6777,1699
2.3128,-9.7018,1700
5.5898,-9.7446,1702
-1.0199,-9.8019,1703
-0.3455,-9.7935,1704
-0.4421,-9.7948,1705
-0.3212,-9.7963,1706
-0.1069,-9.7965,1707
0.3168,-9.8062,1708
-0.2439,-9.8072,1709
-0.5314,-9.7999,1710
-0.3953,-9.7959,1712
-0.2084,-9.8044,1713
-0.345,-9.8044,1714
-0.1248,-9.8032,1715
-0.4215,-9.8018,1716
-0.2667,-9.8018,1717
-0.1636,-9.8013,1718
-0.3324,-9.8017,1719
-0.2694,-9.8011,1721
-0.3199,-9.8023,1722
-0.1993,-9.8016,1723
-0.2427,-9.8012,1724
-0.2732,-9.809,1725
-9.4419,-9.7284,1726
-4.3661,-9.604,1727
-3.3997,-9.5846,1728
13.9084,-9.6487,1729
-1.3625,-9.7888,1730
2.1636,-9.7897,1733
-16.0563,-9.6072,1734
-14.0076,-9.5605,1735
-5.4434,-9.4706,1736
0.2084,-9.408,1737
0.147,-9.4912,1738
6.0988,-9.3859,1739
-5.7,-9.6295,1740
-0.6585,-9.9559,1742
-0.4578,-9.7651,1743
3.5658,-9.8123,1744
0.4022,-9.864,1745
0.3619,-9.8433,1746
0.055,-9.7896,1747
0.825,-9.768,1748
0.3461,-9.8473,1749
-0.029,-9.7636,1750
0.0921,-9.6013,1752
1.1642,-9.8578,1753
1.3285,-9.5625,1754
0.0735,-9.6445,1755
-0.1724,-9.6353,1756
0.0905,-9.7046,1757
0.754,-10.0973,1758
2.2929,-9.8276,1759
-0.5394,-9.8058,1760
0.0097,-9.9035,1762
0.49,-9.8707,1763
-0.1373,-9.7151,1764
5.1465,-10.2066,1765
0.3533,-10.0313,1766
0.9734,-10.2317,1767
0.0541,-9.8644,1768
0.3766,-9.798,1769
-0.4129,-9.87,1770
3.9161,-9.8735,1773
0.7347,-9.9048,1774
5.4329,-9.7729,1775
-0.3135,-9.6816,1776
0.5478,-9.7391,1777
-0.3372,-10.0034,1778
0.765,-9.8262,1780
4.4803,-9.7669,1781
1.3564,-9.7356,1782
2.6344,-10.1405,1783
0.608,-9.8399,1784
-0.2652,-9.8928,1785
0.2063,-9.888,1786
0.5578,-9.7722,1787
0.4651,-9.833,1788
3.1805,-9.86,1789
1.3847,-9.6799,1790
2.3816,-9.8575,1792
-1.2795,-9.796,1793
4.7813,-9.7189,1794
7.7456,-9.5913,1795
0.3429,-9.6173,1796
0.3819,-9.8225,1797
0.0854,-9.8314,1798
0.1482,-9.8077,1799
1.1859,-9.8538,1800
-0.154,-9.8128,1802
0.6133,-9.7688,1803
0.1286,-9.9092,1804
-0.2053,-9.5698,1805
7.5689,-9.5434,1806
0.2565,-9.6365,1807
0.3499,-10.1385,1808
-0.2178,-9.7535,1809
0.8237,-9.8557,1810
2.8132,-9.7636,1812
0.7114,-9.7802,1813
7.3447,-9.9307,1814
-0.9358,-9.8346,1815
-1.0339,-9.8245,1816
9.2238,-9.6945,1817
0.3521,-9.7012,1818
0.5695,-9.85,1819
-1.9868,-9.7714,1820
-23.7463,-9.5965,1822
6.0291,-9.4904,1823
3.4152,-9.6694,1824
12.7843,-9.6898,1825
-4.4826,-9.3861,1826
7.9708,-9.7564,1827
4.4464,-9.8689,1828
-5.9695,-10.1945,1829
3.4285,-9.5767,1830
-8.0025,-10.0116,1832
1.0524,-9.7709,1833
-0.4764,-9.935,1834
1.1695,-9.9477,1836
0.7077,-9.92,1837
5.9441,-10.058,1838
-0.0799,-9.8038,1839
0.4901,-9.9489,1840
0.9383,-9.8746,1841
0.4737,-9.8591,1842
2.9098,-9.9095,1844
1.9776,-9.8111,1845
2.5068,-9.7922,1846
2.9332,-9.8873,1847
5.2554,-10.1478,1848
8.484,-9.9288,1849
0.318,-9.8079,1850
1.4459,-9.654,1851
0.029,-9.8241,1853
0.3754,-9.8078,1854
0.5294,-10.1382,1855
2.3117,-9.7678,1856
0.7791,-9.6139,1857
0.0289,-9.7413,1858
0.2523,-9.7688,1859
0.1429,-9.7138,1860
0.7392,-9.9157,1862
0.2984,-9.8174,1863
0.1381,-9.8124,1864
-0.4058,-10.04,1865
0.1017,-9.9699,1866
-0.1463,-9.7538,1867
0.1081,-9.8981,1868
0.0013,-9.8067,1869
0.7585,-9.7877,1870
0.3254,-9.9079,1872
0.2653,-9.7272,1873
-0.1015,-10.0255,1874
-0.7403,-9.886,1875
0.3074,-9.0551,1876
0.0206,-10.0261,1877
0.0942,-9.7246,1879
2.766,-10.143,1880
0.637,-9.9541,1882
0.5231,-9.7515,1883
0.0356,-9.7065,1884
1.5425,-9.4297,1885
1.7022,-10.0801,1886
0.8767,-10.0793,1888
0.5332,-9.6896,1889
0.5057,-9.7213,1890
-0.1011,-9.9823,1891
0.4755,-9.8146,1892
0.5704,-9.6504,1893
0.4118,-9.7322,1894
0.0704,-9.6618,1895
8.0336,-9.7136,1896
0.8705,-10.0488,1897
0.0577,-9.7144,1898
-1.5896,-9.8209,1899
0.5066,-9.7875,1900
0.0138,-9.6326,1901
1.9965,-9.8594,1903
1.9604,-9.8651,1904
2.0422,-9.8852,1905
0.4161,-9.9005,1906
8.7211,-9.8249,1907
-0.2084,-9.6924,1908
0.7574,-9.5846,1909
0.4719,-9.9005,1910
0.5217,-9.7812,1912
-0.1439,-9.7844,1913
2.563,-10.3254,1914
-0.1114,-9.8544,1915
0.6677,-9.9579,1916
2.3228,-10.0031,1917
3.217,-10.1159,1918
0.3388,-9.8175,1919
1.0846,-10.0981,1920
-0.0655,-9.8056,1922
0.237,-9.8094,1923
4.1499,-9.845,1924
5.6156,-9.8178,1925
1.2143,-9.862,1926
-0.1487,-9.7296,1927
2.7854,-9.8294,1928
0.7006,-9.8409,1929
-6.648,-9.5916,1930
8.6782,-9.6353,1932
-1.0149,-9.713,1933
5.5479,-9.7893,1934
10.1749,-9.7786,1936
-1.3047,-9.8027,1937
-0.0665,-9.7415,1938
-3.8869,-9.6951,1939
3.3951,-9.698,1940
-1.2252,-9.7503,1941
2.6765,-9.717,1942
-0.8503,-9.7841,1943
1.4841,-9.7559,1944
-0.6804,-9.7825,1945
-5.5458,-9.711,1946
4.6644,-9.6995,1947
-1.6034,-9.7213,1948
-1.0161,-9.806,1949
-0.1519,-9.6877,1950
3.0504,-9.8134,1952
-8.7757,-9.7348,1953
4.6874,-9.6796,1954
-1.3932,-9.6717,1955
-6.5402,-9.6451,1956
-22.0031,-9.3008,1957
1.7634,-9.2125,1958
1.7752,-9.2113,1959
1.8058,-9.2114,1960
1.8339,-9.2111,1962
1.7921,-9.212,1963
1.7823,-9.2101,1964
1.8138,-9.2034,1965
0.9021,-9.2146,1966
1.2006,-9.2128,1967
1.7271,-9.2078,1968
1.8167,-9.2099,1969
0.6706,-9.2105,1970
1.6493,-9.2007,1972
1.8061,-9.199,1973
0.7966,-9.1991,1974
1.8319,-9.1959,1975
1.8234,-9.1986,1976
1.7766,-9.2091,1977
1.8617,-9.2,1978
1.7891,-9.1981,1979
1.773,-9.1976,1980
1.7797,-9.1978,1982
1.7682,-9.1972,1983
1.7882,-9.201,1984
1.7996,-9.1978,1985
1.8493,-9.2023,1986
1.8425,-9.1955,1987
1.8819,-9.1976,1988
1.8006,-9.1968,1989
1.5918,-9.1958,1991
1.8676,-9.1844,1992
1.9105,-9.1891,1993
1.6528,-9.1896,1994
1.5746,-9.1776,1995
1.1023,-9.1771,1996
1.7394,-9.1846,1997
2.0169,-9.1926,1998
1.8264,-9.1857,1999
1.8302,-9.1887,2000
1.7917,-9.1805,2001
1.8206,-9.1906,2003
1.8469,-9.1911,2004
1.2484,-9.1877,2005
2.0188,-9.1887,2006
1.8232,-9.1891,2007
1.839,-9.1892,2008
1.8404,-9.1878,2009
1.8372,-9.1892,2010
1.8404,-9.1889,2011
1.848,-9.1868,2012
1.841,-9.1879,2014
1.8387,-9.1887,2015
1.831,-9.1875,2016
1.7834,-9.1876,2017
1.8457,-9.19,2018
1.8582,-9.1879,2019
1.8447,-9.1881,2020
1.8211,-9.1889,2022
1.835,-9.1883,2023
1.8705,-9.1888,2024
1.8329,-9.1883,2025
1.8483,-9.1868,2026
1.8784,-9.1892,2027
1.8393,-9.1891,2028
1.8504,-9.1881,2029
1.8092,-9.1881,2030
1.8599,-9.1875,2032
1.8412,-9.1896,2033
2.6828,-9.2057,3442
1.3661,-9.219,3443
3.0121,-9.204,3445
-0.3224,-9.2469,3446
24.6593,-9.5682,3447
21.1391,-9.675,3448
-0.2554,-9.8057,3450
-0.8342,-9.7476,3451
-13.404,-9.6383,3452
-6.2007,-9.6403,3453
-1.5919,-9.6585,3454
-1.0422,-9.662,3455
-0.9733,-9.6595,3456
-0.9468,-9.6613,3457
-1.0045,-9.67,3458
-0.6975,-9.6722,3459
-1.544,-9.6538,3460
-1.4169,-9.6519,3461
-0.8305,-9.6571,3462
-1.0785,-9.6521,3463
-1.052,-9.6514,3464
-1.0662,-9.6543,3465
-0.9121,-9.6644,3466
-1.0496,-9.6579,3467
-0.9848,-9.6592,3468
-0.9534,-9.6583,3469
-0.9598,-9.6563,3470
-0.9995,-9.659,3471
-0.9226,-9.6584,3472
-0.926,-9.6608,3473
-1.1233,-9.6609,3474
-1.6672,-9.6463,3475
-0.7196,-9.6563,3476
-1.372,-9.6609,3477
-1.0301,-9.6615,3479
-0.0496,-9.8129,3481
-0.2391,-9.8016,3482
-0.2765,-9.8127,3483
-0.722,-9.5458,3484
1.3036,-9.7782,3486
-3.4401,-9.7667,3487
1.7432,-9.6527,3488
-1.9822,-9.6742,3489
-7.7169,-9.6267,3490
11.2444,-9.7149,3492
0.3981,-9.8016,3493
-1.5258,-9.7962,3494
-6.7098,-9.6866,3495
-1.3676,-9.6775,3496
-0.9363,-9.6721,3497
-0.8432,-9.6781,3498
-0.4958,-9.6758,3499
-1.0653,-9.6811,3500
-0.7966,-9.6805,3501
-1.1263,-9.6803,3502
-0.9551,-9.6785,3504
-0.9876,-9.6786,3505
-1.0262,-9.6781,3506
-0.9613,-9.6799,3507
-0.8769,-9.6778,3508
-1.2031,-9.6823,3509
-1.3921,-9.6713,3510
-0.4532,-9.6773,3511
-0.3409,-9.6737,3512
-1.0605,-9.6776,3513
-1.4234,-9.6755,3514
-1.0166,-9.6721,3515
-0.5709,-9.6766,3516
-1.792,-9.6746,3517
-0.9264,-9.6704,3518
-0.9379,-9.6673,3519
-1.42,-9.6659,3520
-1.1603,-9.6615,3521
-1.5692,-9.6573,3522
-5.6572,-9.683,3524
1.017,-9.6593,3525
-1.0968,-9.6729,3526
-2.3017,-9.6738,3527
-2.5353,-9.6383,3528
1.6545,-9.6345,3529
-0.8018,-9.6667,3530
-0.2406,-9.6712,3531
-1.266,-9.6781,3532
-2.1598,-9.6689,3533
0.1293,-9.6463,3534
0.446,-9.6399,3535
-3.4894,-9.6635,3536
2.9623,-9.6922,3537
0.5173,-9.7151,3538
0.9044,-9.8013,3540
-0.3667,-9.8143,3541
-0.0846,-9.8119,3542
-0.5141,-9.8092,3544
-0.3385,-9.8072,3545
-0.2684,-9.8069,3546
-0.9826,-9.8019,3547
-2.2714,-9.773,3549
-1.1368,-9.7576,3550
-0.5196,-9.7547,3551
-0.6189,-9.7922,3552
-3.3251,-9.6509,3553
0.8512,-9.6951,3554
17.2648,-9.6009,3555
-3.2624,-9.7942,3556
-0.6219,-9.8005,3557
-0.76,-9.7971,3558
1.0137,-9.8048,3559
-0.032,-9.8212,3560
-0.0257,-9.8204,3561
-0.0104,-9.8205,3562
0.0021,-9.8196,3563
0.0045,-9.8197,3564
0.4684,-9.8174,3565
-0.9557,-9.8103,3566
0.4117,-9.818,3567
-3.584,-9.798,3568
-2.2549,-9.799,3569
1.7996,-9.8052,3570
-0.2585,-9.8166,3571
-0.1762,-9.8206,3572
-0.1063,-9.8197,3573
-2.8481,-9.8028,3574
-2.8638,-9.7743,3575
-5.901,-9.7944,3576
-6.0687,-9.7404,3577
-2.3994,-9.7806,3578
1.7479,-9.7785,3579
-9.9884,-9.6641,3580
9.1647,-9.595,3581
-0.6793,-9.6693,3582
5.9081,-9.7321,3584
-5.7322,-9.7809,3585
-2.1919,-9.7986,3586
-7.0144,-9.6656,3587
6.8391,-9.5926,3589
2.0879,-9.6971,3590
1.855,-9.7937,3591
-0.1515,-9.8239,3592
3.4778,-9.8603,3594
1.5385,-9.8638,3595
2.0403,-9.8527,3596
0.2073,-9.8274,3597
-0.0971,-9.8677,3599
0.7849,-9.777,3600
0.3701,-9.8346,3602
-0.0462,-9.8504,3604
0.3791,-9.8234,3605
-0.6006,-9.7191,3606
0.3515,-9.8986,3608
0.2793,-9.81,3609
0.6606,-9.8288,3610
1.2334,-9.7894,3611
-4.2468,-9.747,3612
-9.3232,-9.703,3613
-0.5071,-9.6116,3614
-1.432,-9.5966,3615
-2.614,-9.7017,3616
3.1281,-9.5104,3617
4.0494,-9.6237,3618
17.1891,-9.6022,3619
2.7366,-9.7937,3620
3.8489,-9.8146,3621
-0.0578,-9.8061,3622
1.1655,-9.6649,3623
-1.4671,-9.6093,3624
1.5115,-9.8357,3625
-0.6582,-9.838,3626
5.2395,-9.8558,3627
1.0809,-10.2622,3628
5.8481,-9.8209,3629
0.6897,-9.8067,3630
0.557,-9.8084,3631
1.3987,-9.7676,3632
0.1658,-9.8075,3634
0.923,-9.7765,3635
0.346,-9.9571,3636
0.8231,-9.753,3637
1.6384,-9.736,3638
0.0955,-9.8141,3639
0.4826,-9.8376,3640
2.8514,-9.7949,3641
-0.0743,-9.7894,3642
0.2219,-9.9323,3644
1.7065,-9.7836,3645
0.5423,-9.8142,3646
0.1262,-9.9074,3647
3.9829,-9.8263,3648
-0.3482,-10.0922,3649
-0.2084,-9.7284,3650
0.2458,-9.9025,3652
3.9271,-9.8826,3654
0.7018,-9.8677,3655
0.14,-9.8334,3656
0.0468,-9.8395,3657
-0.2508,-9.7625,3659
0.6286,-9.8166,3660
2.4063,-9.9375,3662
3.1496,-9.74,3664
0.6222,-9.8407,3665
0.3534,-9.8378,3666
0.9845,-9.9313,3667
0.0333,-9.9503,3668
1.2584,-9.7951,3669
1.1644,-9.8838,3670
0.4655,-9.8377,3671
2.4394,-9.8923,3672
1.7765,-9.8672,3673
-0.3104,-9.856,3674
0.0176,-9.8455,3675
1.1375,-9.84,3676
0.5958,-9.8788,3677
0.4698,-9.8653,3678
0.5191,-9.7944,3679
3.2654,-9.8213,3680
0.7816,-9.8902,3681
3.1656,-9.8055,3682
1.6521,-9.7926,3685
3.4806,-9.8281,3686
2.8233,-9.8177,3687
0.9181,-9.7287,3688
0.1864,-9.983,3689
1.6582,-9.998,3691
1.0496,-9.8389,3692
0.2692,-9.888,3693
0.1356,-9.9335,3694
0.3251,-9.8012,3695
0.1201,-9.8649,3696
0.0713,-9.8082,3697
0.7563,-9.8626,3699
0.0701,-9.8406,3700
2.2421,-9.8159,3701
1.1268,-9.8096,3702
4.8082,-9.9006,3720
0.5951,-9.867,3721
0.5302,-9.7936,3722
-0.1254,-9.8682,3723
0.1871,-9.8107,3751
10.8458,-9.8527,3752
1.061,-9.7542,3760
1.0534,-9.9908,3761
-1.1669,-9.8208,3762
2.9224,-9.9088,3763
4.9327,-9.6542,3764
0.5086,-9.6887,3765
0.4468,-9.6709,3766
-0.1397,-9.8044,3767
1.0587,-9.8308,3768
-0.3526,-9.7176,3769
-0.0451,-9.7732,3772
1.9051,-9.843,3773
0.3621,-9.8442,3774
0.4056,-9.8847,3775
6.3504,-9.8876,3776
1.1044,-9.8047,3777
0.3013,-9.7405,3778
-0.0071,-9.849,3779
0.4382,-9.7525,3780
0.3177,-9.8584,3781
0.1689,-9.8593,3782
-0.0858,-9.7119,3784
1.6384,-9.7957,3785
1.0429,-9.6783,3786
1.4391,-9.8023,3787
3.2523,-9.8701,3788
0.0698,-9.7731,3789
0.4176,-9.5437,3790
-0.0199,-9.8479,3791
0.2687,-9.7677,3792
0.2961,-9.9676,3793
-0.0049,-9.9493,3794
7.5082,-9.8699,3795
1.7639,-9.8129,3796
0.6637,-8.4072,3797
6.0044,-9.8155,3798
2.8382,-9.9051,3799
-0.0214,-9.7998,3800
0.3741,-9.8598,3801
-0.2578,-9.7995,3803
1.4353,-9.7111,3804
1.2321,-9.8286,3805
13.7908,-9.7864,3806
8.3321,-9.8287,3807
2.4659,-9.8137,3808
-3.357,-7.835,3809
12.5492,-9.7145,3810
0.7357,-9.8668,3811
0.2231,-10.1361,3812
1.3061,-9.9279,3814
1.4253,-9.8213,3815
0.8812,-9.7726,3816
-0.0723,-9.9058,3817
-0.0212,-9.8475,3818
0.356,-9.8494,3819
-0.0107,-10.0456,3820
3.0611,-9.7611,3821
2.7064,-9.8924,3822
-0.2259,-9.7174,3823
1.1772,-9.7895,3824
0.764,-9.8277,3825
1.1476,-9.821,3826
-0.1498,-9.8036,3827
0.2541,-9.809,3828
8.209,-9.6562,3829
0.8243,-9.8038,3830
-0.3375,-9.6621,3831
4.5011,-9.9588,3832
0.2782,-9.8368,3833
2.2675,-9.8443,3834
-0.0803,-9.7653,3835
0.0115,-9.767,3836
1.1067,-9.8262,3837
0.9531,-9.9186,3838
1.0872,-9.6233,3839
1.1069,-9.8825,3840
2.5974,-9.7023,3841
0.7269,-9.7911,3842
0.1098,-9.8127,3843
0.0081,-9.8207,3844
0.1182,-9.8731,3845
-0.0429,-9.8363,3846
0.7214,-9.875,3847
0.7414,-9.8625,3848
0.3018,-9.7689,3849
0.1658,-9.8374,3850
1.4533,-9.8489,3851
-0.4054,-9.8286,3852
1.1186,-9.8867,3853
-0.4268,-9.866,3854
-1.0027,-10.0928,3855
2.5034,-9.6567,3856
2.141,-9.9132,3857
6.3842,-9.7789,3858
0.5827,-9.6995,3859
1.0685,-9.7996,3860
-0.0527,-9.622,3861
0.0404,-9.8509,3863
-0.0368,-9.9231,3864
0.0924,-9.7815,3866
-0.2248,-9.8836,3867
0.0361,-9.8489,3868
0.5871,-9.7003,3869
0.1036,-9.5903,3870
3.7428,-9.9079,3871
1.9806,-9.6664,3872
1.5782,-9.869,3874
-0.1575,-10.0987,3875
1.4273,-9.6668,3876
-0.0036,-9.6353,3877
0.8513,-9.8381,3878
0.3897,-9.5232,3879
0.1576,-9.7662,3880
0.1831,-9.8431,3881
0.8201,-9.8377,3882
0.5361,-9.8426,3883
-25.8181,-9.5831,3884
-54.2167,-7.8417,3885
0.5399,-8.1127,3886
0.7025,-8.0413,3887
40.0063,-8.9432,3888
30.6805,-9.3176,3889
12.5974,-9.3155,3890
-0.3196,-9.7306,3891
-0.065,-9.6444,3892
-0.287,-9.8773,3893
3.3418,-9.7363,3894
3.7122,-9.9181,3895
-3.5588,-9.5349,3896
4.6646,-9.634,3897
-1.036,-9.9579,3898
-3.525,-9.8159,3899
0.5993,-10.1674,3900
0.2652,-10.1317,3901
-0.0366,-9.9288,3902
-0.2656,-10.0388,3903
-0.0792,-9.8206,3904
0.213,-9.7596,3905
0.8037,-9.9572,3906
-0.0043,-9.9565,3907
-0.0271,-9.7728,3908
0.4872,-9.7913,3909
0.2401,-9.4359,3910
0.3699,-9.6641,3911
-0.6655,-9.7905,3912
-0.0254,-9.835,3913
1.4334,-9.6775,3914
-0.286,-9.7738,3915
0.2136,-10.1805,3916
1.0911,-9.9094,3917
0.7353,-9.6165,3918
3.1978,-10.0293,3919
-0.3193,-9.9222,3920
1.0177,-9.9093,3921
1.2447,-9.8212,3923
0.5994,-9.6374,3925
0.0419,-9.8312,3926
0.8052,-9.854,3927
1.354,-10.0411,3928
0.0176,-9.6396,3929
-0.2409,-9.9024,3930
2.1209,-9.8067,3931
-0.0772,-10.1445,3932
0.3586,-9.9617,3933
0.512,-9.8483,3934
0.293,-9.7811,3935
0.3104,-9.879,3936
2.8133,-10.0266,3937
0.2585,-9.8326,3938
-0.0597,-9.5742,3939
-0.0947,-9.7998,3940
1.1415,-9.7202,3941
0.1439,-9.8558,3942
1.3632,-9.8972,3943
0.1107,-9.7954,3944
0.6686,-9.8945,3945
-0.2432,-10.0211,3946
-0.0055,-9.7896,3947
0.8559,-9.8588,3948
0.1485,-9.5551,3949
0.1004,-9.6866,3950
3.0922,-9.8926,3951
2.7307,-9.6611,3953
0.7412,-9.7923,3954
-0.3931,-9.8212,3955
0.0661,-9.9734,3956
0.0469,-9.9421,3957
-0.4357,-9.8115,3958
0.2739,-10.1445,3959
0.4222,-9.8692,3960
-0.0281,-9.8033,3961
3.8683,-9.8409,3963
0.2904,-9.7883,3964
-0.211,-9.8408,3965
-0.2808,-9.8605,3966
0.3696,-9.7492,3967
0.8777,-9.9731,3968
1.2776,-9.8329,3969
0.4391,-9.7285,3971
0.3514,-9.8257,3973
0.7614,-9.6808,3974
-0.0813,-9.8346,3975
0.0022,-10.0059,3976
0.5649,-9.6999,3977
0.2794,-9.7535,3978
3.8885,-9.6829,3979
0.1732,-9.7891,3980
10.3335,-9.8907,3981
2.416,-9.724,3983
2.26,-9.9036,3984
3.9134,-9.8857,3985
1.5134,-9.7559,3986
0.4877,-9.8164,3987
-0.1763,-9.7034,3988
-1.5661,-9.7005,3989
0.0372,-10.0177,3990
0.1638,-9.8123,3991
0.2849,-9.7518,3993
0.9966,-9.8685,3994
0.8344,-9.7996,3995
2.8037,-9.666,3996
0.5333,-9.8869,3997
0.4193,-9.8662,3998
-0.3886,-9.7239,3999
1.8597,-9.7029,4000
0.5567,-9.8438,4001
0.1531,-9.8407,4002
1.2488,-9.8606,4003
-0.1978,-9.8094,4004
-0.1227,-9.6619,4005
0.0472,-9.8349,4006
0.0781,-9.8817,4007
0.4807,-9.8595,4008
0.039,-9.848,4009
0.5098,-9.9106,4010
0.4587,-9.7875,4011
0.1923,-9.8244,4012
3.3747,-9.6332,4014
0.3892,-9.9875,4015
0.1336,-9.7531,4016
0.7919,-9.7342,4017
0.3774,-9.8052,4018
0.0833,-9.8073,4019
-0.009,-9.598,4020
0.5631,-9.8519,4021
0.561,-9.7573,4022
0.0392,-9.8023,4023
-0.0294,-9.8776,4024
0.6091,-9.7599,4025
0.3509,-9.8077,4026
0.2902,-9.7727,4027
0.1679,-9.9155,4028
0.3815,-9.8125,4029
0.2641,-9.8795,4030
0.4429,-9.8286,4031
0.212,-9.8416,4032
0.0642,-9.777,4033
-0.0441,-9.8836,4034
1.3641,-9.9035,4035
1.1417,-9.8023,4036
-0.0504,-9.7524,4037
1.8843,-9.8322,4038
0.2045,-9.6949,4039
1.9923,-9.7728,4040
-0.2182,-9.91,4042
-0.1586,-9.7484,4044
1.439,-9.8912,4045
0.2808,-9.6291,4046
0.5563,-9.7615,4047
0.6079,-10.1867,4048
0.0765,-9.9502,4049
0.1112,-9.7984,4050
0.2074,-9.7652,4051
6.5852,-9.9221,4052
3.3478,-10.0189,4053
1.1183,-9.84,4054
2.6411,-9.7926,4055
-0.6178,-9.8659,4056
0.1568,-9.9208,4057
1.6775,-9.8004,4058
0.8476,-9.5462,4059
0.2215,-9.8133,4060
1.2127,-9.8044,4061
0.4618,-9.7926,4063
0.0633,-9.8101,4064
0.0844,-9.7906,4065
0.395,-9.8857,4066
0.1329,-9.733,4067
-0.0006,-9.5411,4068
1.0956,-9.6972,4069
0.2405,-9.8817,4070
0.7193,-9.8271,4071
0.6229,-9.7371,4073
-0.0557,-9.8904,4074
-0.0683,-9.9582,4075
0.0976,-9.8649,4076
1.5434,-9.7968,4077
1.2918,-9.6724,4078
-10.3509,-9.7318,4079
-0.5655,-9.6915,4081
0.8515,-9.7628,4083
-1.0945,-9.7699,4085
3.3366,-9.8334,4086
2.8402,-9.8422,4088
1.7048,-9.7471,4089
4.6171,-9.726,4090
-0.4773,-9.7851,4092
0.5984,-9.9977,4093
0.0299,-9.737,4095
4.7246,-9.7824,4096
-0.6548,-9.8286,4097
-0.2547,-9.7678,4098
2.4052,-9.6641,4099
4.0359,-9.8272,4100
1.5574,-10.0674,4101
3.3282,-9.7252,4102
1.1274,-9.7642,4103
0.3581,-9.8378,4104
0.0523,-10.1349,4105
1.3438,-9.7962,4106
1.492,-9.6572,4107
0.9816,-9.8395,4108
0.4448,-9.6419,4109
1.2918,-9.9917,4110
0.1552,-9.8021,4111
-0.0367,-10.1629,4112
-0.2358,-9.8519,4113
14.0075,-9.6543,4114
0.4202,-9.4791,4115
1.3104,-9.9776,4116
0.1264,-9.7091,4118
-0.1352,-9.9536,4119
0.7789,-9.7148,4120
0.8556,-9.8821,4121
-0.5248,-9.9893,4122
4.3562,-9.8289,4123
1.1523,-9.8286,4124
0.792,-9.6689,4125
-0.0942,-9.7193,4126
0.1821,-9.703,4128
2.682,-9.8276,4129
0.2921,-9.8401,4130
1.3567,-9.717,4131
1.221,-9.7991,4133
0.6008,-9.9475,4134
0.3179,-9.8748,4135
1.3116,-9.779,4136
0.8985,-9.9533,4138
2.107,-9.1066,4139
0.2033,-9.8154,4141
-0.1304,-9.9087,4142
1.186,-9.7317,4144
0.0972,-9.7388,4145
1.249,-9.8498,4146
0.4139,-9.7521,4147
0.6106,-9.9323,4148
0.4707,-9.8424,4149
-0.4185,-9.5847,4150
0.4417,-10.1,4151
1.4095,-9.7727,4152
3.2705,-9.8452,4153
0.5403,-9.7629,4154
0.0297,-10.047,4155
0.7882,-9.8917,4156
-0.2491,-9.927,4157
0.9714,-9.8527,4158
0.1832,-9.8143,4159
0.0076,-9.828,4160
1.2081,-9.9334,4161
2.2497,-9.7002,4162
1.1677,-9.8954,4163
0.5837,-9.564,4164
0.6868,-9.8074,4165
0.8799,-9.7785,4166
1.241,-9.7379,4168
2.1445,-9.8191,4169
-0.3137,-9.7317,4170
0.1273,-9.8706,4171
1.122,-9.9199,4172
0.3411,-9.6497,4173
5.7747,-10.0008,4174
0.1855,-10.0444,4175
6.4042,-9.6722,4176
2.5272,-9.7933,4178
0.8542,-9.9435,4179
5.4496,-9.7031,4180
1.2457,-9.8567,4182
2.8143,-9.8942,4183
7.16,-9.8936,4184
0.1715,-9.9485,4185
1.2619,-9.8659,4187
1.1676,-9.8822,4188
1.2836,-10.0128,4189
1.0204,-9.7997,4190
1.8975,-10.1942,4191
0.3087,-9.8401,4192
3.0032,-9.8831,4193
0.3816,-9.6212,4194
0.187,-9.8733,4195
0.3736,-9.7093,4196
0.4378,-9.8072,4197
0.083,-9.8063,4198
0.5177,-9.8366,4199
0.0815,-10.003,4200
3.0356,-9.5513,4201
-1.8931,-10.0191,4202
1.1696,-9.7364,4203
-0.0934,-9.7735,4204
0.2662,-9.5099,4205
6.9731,-9.7965,4206
3.7636,-9.887,4208
1.1819,-9.6744,4209
2.9973,-9.565,4210
2.9165,-9.874,4211
0.5534,-9.7784,4212
3.7811,-9.9895,4213
1.2781,-9.7957,4214
1.4936,-9.7689,4215
2.8828,-9.9644,4216
1.2779,-9.8806,4218
1.9154,-9.7986,4219
-0.0401,-10.1795,4220
1.9872,-9.7658,4221
3.8516,-9.907,4222
0.1802,-9.9544,4223
-0.2156,-9.7194,4224
0.2055,-9.7748,4225
3.4522,-9.8064,4226
0.0266,-9.7798,4228
0.6912,-9.8367,4229
0.0346,-9.8088,4230
0.4794,-9.865,4231
0.9709,-9.7844,4232
1.8109,-9.8235,4233
2.2385,-9.9285,4234
0.574,-9.8621,4235
-0.1061,-9.6752,4236
5.9816,-9.8785,4238
1.3263,-9.7563,4239
0.6826,-10.0029,4240
0.4873,-9.9915,4241
0.9691,-10.0354,4242
-0.0612,-9.7642,4244
0.1026,-9.8709,4245
0.8457,-9.8312,4246
1.7869,-9.9233,4247
1.9356,-9.7993,4248
1.4978,-9.8716,4249
1.5371,-9.7662,4250
0.6706,-9.8823,4251
0.7542,-9.7337,4252
-0.0249,-9.7824,4253
-1.6881,-9.7827,4254
0.9533,-9.7862,4255
0.3817,-9.6779,4256
0.3551,-9.8307,4258
1.7784,-9.9124,4259
0.2067,-9.8055,4260
0.6336,-9.8263,4261
0.115,-9.6955,4262
0.1817,-9.9673,4263
-0.1587,-9.7448,4264
-0.0475,-9.572,4265
0.219,-9.8744,4266
1.5701,-9.6971,4268
1.6427,-9.8458,4269
1.3307,-9.6001,4270
1.8637,-9.7729,4271
3.3217,-9.7436,4272
-0.9516,-9.5464,4273
-0.1457,-9.8501,4274
-0.2725,-10.04,4275
0.2619,-9.8729,4276
1.7032,-9.8582,4278
0.276,-9.831,4279
0.2254,-9.883,4280
2.9894,-9.7468,4281
-0.1865,-9.8357,4282
1.9022,-9.7421,4283
1.3073,-9.8076,4284
2.1637,-9.9073,4285
-0.38,-9.8081,4286
2.0681,-9.8003,4288
0.7834,-9.8859,4289
5.0773,-9.6673,4290
2.7854,-9.5898,4291
-0.0392,-9.9813,4292
0.904,-10.1347,4293
1.8734,-9.9116,4294
0.474,-9.9545,4295
0.5481,-9.6024,4296
0.4344,-9.8746,4298
0.0641,-9.7959,4299
0.522,-9.6682,4300
1.2767,-9.7982,4301
-0.2645,-9.7629,4303
2.5678,-9.8695,4304
-0.1911,-9.528,4305
1.626,-9.7744,4306
0.081,-9.9328,4307
0.7299,-9.7325,4308
5.3578,-9.9024,4309
23.5186,-9.8952,4310
0.1737,-9.8268,4311
0.5247,-9.7464,4312
1.509,-9.853,4313
0.4749,-9.8999,4314
7.2782,-9.7685,4315
-1.5162,-9.7869,4316
1.2097,-9.8354,4318
0.3093,-9.8671,4319
0.8493,-9.588,4320
-0.8469,-9.8073,4321
2.0698,-9.8564,4322
0.102,-9.7809,4323
0.0412,-9.7294,4324
0.2132,-9.6658,4325
1.2513,-9.7516,4326
1.5637,-9.7893,4328
4.9636,-9.8623,4329
-0.2695,-9.8515,4330
-0.2416,-9.7244,4331
-0.0346,-9.8584,4332
-0.1304,-9.6441,4333
3.8802,-9.8591,4334
1.7006,-9.866,4335
2.8874,-9.8603,4336
0.4957,-9.8552,4338
-0.3415,-9.6549,4339
5.0077,-10.1027,4340
0.476,-9.9249,4341
0.8621,-9.815,4342
0.092,-9.6968,4343
1.1316,-9.7573,4344
1.3213,-9.9228,4345
0.7265,-9.7401,4346
0.578,-9.7485,4348
4.2197,-9.8412,4349
1.0305,-10.1703,4350
0.705,-9.6645,4351
0.6579,-9.989,4352
-0.4389,-10.1562,4353
1.8286,-9.7873,4354
0.7186,-9.8035,4355
0.1575,-9.9524,4356
0.1543,-9.7721,4358
3.3431,-9.6174,4359
1.0643,-9.8513,4360
1.3571,-9.5662,4362
0.1803,-9.6903,4363
0.1577,-9.7739,4364
1.7111,-9.797,4365
1.5122,-9.8522,4366
3.7727,-9.7296,4367
3.2385,-9.7754,4368
0.9814,-9.8125,4369
2.242,-9.9026,4370
0.208,-9.7398,4371
2.8211,-9.8836,4372
1.7805,-9.7328,4373
1.0394,-9.7834,4374
1.3192,-9.8441,4375
0.5724,-9.8204,4376
1.5286,-9.855,4378
0.418,-9.9229,4379
2.7602,-9.6216,4380
0.9756,-9.6712,4381
0.4122,-9.9781,4382
-0.5404,-9.9812,4383
0.7008,-9.7735,4384
-0.4373,-10.0193,4385
2.031,-9.8015,4386
3.0745,-9.8299,4388
2.0484,-9.778,4389
2.7901,-9.7897,4390
0.0665,-10.1534,4391
-0.7107,-9.8946,4392
0.5763,-9.3165,4393
-0.5809,-9.8328,4394
5.1681,-9.5024,4395
0.098,-9.9476,4396
0.6148,-9.8403,4398
0.1675,-9.7689,4399
1.2564,-9.6237,4400
0.0624,-9.6497,4401
-0.0908,-9.6686,4402
0.7387,-9.8431,4403
3.326,-10.078,4404
0.0305,-9.742,4405
0.0652,-9.9856,4406
0.666,-9.7755,4408
2.3036,-9.8429,4409
1.7618,-9.8311,4410
-0.1158,-9.8646,4411
0.652,-9.907,4412
-0.4979,-9.9674,4413
1.6319,-10.1032,4414
3.7585,-9.8549,4415
6.9837,-9.742,4416
0.3219,-9.813,4418
-0.404,-9.9261,4420
0.495,-9.8733,4421
0.2137,-9.8072,4422
-0.0067,-9.6875,4423
-0.1565,-9.948,4424
-0.2268,-10.1548,4425
0.2391,-9.8841,4426
-0.1499,-9.7687,4427
0.4621,-9.6382,4428
0.6246,-9.8636,4429
0.6333,-9.6987,4430
0.6436,-9.7555,4431
3.8406,-9.9784,4432
0.2796,-9.9051,4433
0.075,-9.8157,4434
0.4551,-9.7938,4435
0.9234,-9.8179,4436
0.6669,-9.8155,4438
8.4428,-9.9415,4439
4.5345,-9.9164,4440
-0.3984,-9.7087,4441
1.842,-10.0922,4442
-0.9699,-9.7113,4443
0.273,-9.7284,4444
0.0249,-9.7939,4445
1.6109,-9.8488,4446
0.511,-9.8091,4448
0.4495,-9.9132,4449
0.8929,-9.7626,4450
-0.0802,-9.7605,4451
0.5471,-9.8796,4452
0.0079,-9.676,4453
-0.1057,-9.7291,4454
0.5761,-9.7838,4455
1.2658,-9.8873,4456
0.8935,-9.8513,4458
0.0949,-9.7974,4459
0.1516,-9.587,4460
-0.0521,-9.9451,4461
-0.2647,-9.8727,4462
5.7115,-9.7946,4463
-0.3059,-9.9645,4464
1.0998,-9.8108,4465
-1.1123,-9.7184,4466
0.2572,-9.8442,4468
0.3447,-9.6287,4469
0.1824,-9.8386,4470
1.8636,-9.815,4471
0.1876,-9.7807,4472
0.3557,-9.8604,4473
2.9005,-9.8716,4474
0.2667,-9.8336,4475
-0.2336,-9.7365,4476
1.8166,-9.8441,4478
0.5452,-9.7414,4479
-0.0046,-10.0051,4480
0.0284,-9.8723,4481
0.9153,-9.857,4482
0.5743,-9.8607,4483
0.2174,-9.6902,4484
1.2765,-9.8456,4485
0.4123,-9.7693,4486
-0.0513,-9.6941,4487
0.0907,-9.8516,4488
0.918,-9.8029,4489
0.615,-9.9032,4490
0.4779,-9.9721,4491
0.6996,-9.8326,4492
0.5874,-9.7631,4493
0.6466,-9.8408,4494
1.5943,-9.6594,4495
0.248,-9.8724,4496
2.0124,-9.808,4498
2.2691,-9.8321,4499
0.8855,-9.8204,4500
0.7486,-9.7251,4501
0.5959,-9.8384,4502
1.1714,-9.781,4503
0.4957,-9.9887,4504
0.0803,-9.8808,4505
0.6652,-9.8185,4506
0.7733,-9.8186,4508
4.5466,-9.777,4509
0.2825,-9.9553,4510
-1.0788,-9.7879,4511
0.4673,-9.7353,4512
3.5967,-10.048,4513
3.2061,-10.7232,4514
0.1348,-9.8998,4515
2.0311,-9.8122,4516
5.6587,-9.7534,4517
1.6323,-9.828,4518
1.0864,-9.8575,4519
0.1163,-9.8268,4520
0.2925,-9.9488,4521
0.8711,-9.7473,4522
0.2869,-9.7597,4523
0.4697,-9.7718,4524
0.3346,-9.8024,4525
0.6906,-9.8298,4526
0.506,-9.8413,4528
0.3332,-9.7639,4529
0.0794,-9.7184,4530
1.5486,-9.9293,4531
-0.4635,-9.7394,4532
0.1027,-9.7957,4533
0.5092,-9.84,4534
-0.0826,-9.7997,4535
0.8742,-9.8072,4536
-0.0908,-9.8145,4538
0.0541,-9.8081,4539
0.0422,-9.8582,4540
-13.025,-9.7105,4541
-16.9118,-9.3572,4542
7.1561,-9.5692,4543
1.8282,-9.6744,4544
-3.1006,-9.8802,4545
1.8815,-9.6265,4546
-4.9149,-9.6973,4547
-0.0404,-9.786,4548
1.4808,-9.7903,4549
1.0493,-10.0358,4550
-0.0156,-9.8099,4551
3.483,-9.8223,4552
1.3279,-9.8205,4553
-0.327,-9.7941,4554
0.2497,-9.8676,4555
0.3786,-9.7776,4556
-2.8038,-9.7377,4557
-0.7756,-9.7918,4558
6.0489,-9.7859,4559
0.4802,-9.844,4560
-0.1849,-9.8453,4561
0.266,-9.7835,4563
2.4268,-9.7959,4564
2.8603,-9.9032,4565
-0.1326,-9.7346,4566
0.274,-9.6261,4567
0.2292,-9.7588,4568
1.5095,-9.7818,4569
-0.0423,-9.5715,4570
0.0131,-9.8103,4571
0.5554,-9.7712,4573
0.8443,-9.7569,4574
-0.0492,-9.9581,4575
-0.2979,-9.9202,4576
0.0186,-9.6067,4577
-0.0088,-9.7433,4578
0.2794,-9.7378,4579
0.5678,-9.8653,4580
0.0622,-10.0064,4581
0.0364,-9.5842,4583
1.2663,-10.0277,4584
-0.3703,-9.0775,4585
0.148,-10.0309,4586
2.0984,-9.7255,4587
0.2467,-9.6379,4588
0.5628,-9.8087,4589
0.3703,-9.7121,4590
-0.4049,-9.9875,4591
6.1134,-9.7942,4593
0.7097,-9.9006,4594
0.4968,-9.7949,4595
0.4553,-9.9036,4597
1.1585,-9.7979,4598
0.4976,-9.7521,4599
0.729,-9.7592,4600
2.4424,-9.7855,4601
0.0337,-10.0353,4602
0.875,-9.8748,4603
1.6889,-9.7694,4604
0.3809,-9.9036,4605
1.2797,-9.8583,4606
0.2581,-9.7978,4607
0.7286,-9.9303,4608
2.6576,-10.0731,4609
1.651,-9.7846,4610
1.7888,-9.862,4611
1.2854,-9.7735,4612
1.6558,-9.8347,4613
0.9523,-9.8571,4614
0.0681,-9.6462,4615
6.0019,-9.8377,4616
0.2314,-9.8508,4617
0.558,-9.8438,4618
4.6335,-9.9953,4619
0.7285,-10.0107,4620
-0.151,-9.8443,4621
1.0163,-9.7844,4623
0.0114,-9.8251,4624
0.5865,-9.861,4625
0.3439,-9.8426,4626
0.7549,-9.6392,4627
0.0101,-9.8149,4628
0.3284,-9.9262,4629
-0.0045,-9.9341,4630
-0.0372,-9.6969,4631
1.106,-9.8126,4633
0.4253,-9.8242,4634
0.3527,-9.8501,4635
0.1105,-9.7328,4636
7.8245,-9.5668,4637
0.6136,-9.7613,4638
0.1244,-9.7553,4639
0.1962,-9.7532,4640
-0.0234,-9.7931,4641
0.606,-9.8106,4643
0.0837,-9.929,4644
0.0328,-9.7389,4645
1.7669,-9.8032,4646
-0.1167,-9.7178,4647
1.1461,-9.9086,4648
-0.0898,-9.7813,4649
0.2102,-9.8012,4650
0.1213,-9.6553,4651
0.5924,-9.7834,4653
3.2635,-9.8806,4654
0.7855,-9.8367,4656
-0.0062,-9.8758,4657
-0.1944,-9.9118,4658
0.2982,-9.9872,4659
1.3557,-9.8188,4660
1.6737,-9.8966,4661
0.5696,-9.9679,4662
-0.0192,-9.7184,4663
0.0799,-9.899,4664
-0.1655,-9.6187,4665
-0.0139,-9.9904,4666
1.8693,-9.7702,4667
-0.4641,-10.0052,4668
0.1991,-9.7902,4669
1.2532,-10.0496,4670
-0.0017,-10.0947,4671
2.7569,-9.7926,4673
6.6362,-9.8394,4674
8.1588,-9.8948,4675
-0.8462,-10.4683,4676
1.6215,-9.8898,4677
0.6342,-9.9273,4678
-0.0196,-9.9827,4679
-0.1197,-9.9426,4680
-0.9738,-9.6801,4681
0.8978,-9.8541,4682
0.2431,-9.7213,4683
0.2432,-9.7961,4684
-0.0211,-9.7625,4685
-0.1024,-9.9965,4686
0.2652,-9.9539,4687
-0.2681,-9.5631,4688
0.4895,-9.811,4689
0.1742,-9.8267,4690
0.9318,-10.0344,4691
0.3608,-9.8177,4693
0.3925,-9.8828,4694
0.8029,-9.7523,4695
2.2701,-9.5288,4696
-0.1683,-9.761,4697
0.4769,-9.8866,4698
0.4417,-10.0205,4699
7.6131,-9.8913,4700
0.8192,-9.8146,4701
1.5304,-9.8255,4703
1.1282,-9.7401,4704
-0.0483,-9.8381,4705
8.9049,-9.8344,4706
-0.2016,-9.9487,4707
-0.8503,-9.892,4708
0.5496,-9.7924,4709
1.5925,-9.901,4710
0.181,-9.9738,4711
1.4022,-9.8138,4713
-0.1343,-9.9071,4715
2.0015,-9.794,4716
1.5423,-9.8247,4717
-1.6217,-9.7169,4718
6.2811,-9.5604,4719
2.1302,-9.4971,4720
2.5011,-9.8384,4721
0.838,-9.8113,4722
1.3666,-9.7531,4723
1.1548,-9.8211,4724
-8.618,-9.7762,4725
-81.4975,-9.2195,4726
12.0559,-9.0171,4727
-8.4851,-8.9976,4728
15.1062,-9.0359,4729
2.2055,-9.6623,4730
14.2154,-9.4543,4731
-2.1241,-9.662,4733
-2.1252,-9.5902,4734
0.3984,-9.5926,4735
-0.6275,-9.5968,4736
-0.2154,-9.628,4737
-3.3422,-9.5982,4738
-0.0658,-9.5371,4739
-4.079,-9.6068,4740
-2.198,-9.5533,4741
-8.9838,-9.4407,4743
-6.4214,-9.3964,4744
18.713,-9.3014,4745
1.7793,-9.6317,4746
14.8242,-9.5701,4747
-11.8578,-9.7564,4748
1.4021,-9.8877,4749
-0.1932,-9.82,4750
-0.0393,-9.846,4751
-7.6742,-9.539,4753
22.479,-9.2108,4754
3.0977,-9.6486,4755
2.3876,-9.7107,4756
-0.7639,-9.7266,4757
-0.3695,-9.7294,4758
0.3189,-9.7486,4759
-0.1469,-9.7518,4760
-5.4607,-9.7302,4761
0.2117,-9.6929,4763
-0.0281,-9.7337,4764
-2.9141,-9.7317,4765
-5.8941,-9.6342,4766
2.7464,-9.6443,4767
3.4881,-9.726,4768
-4.0643,-9.7227,4769
-2.4729,-9.6719,4770
-0.5855,-9.6657,4772
0.1368,-9.6939,4773
-7.3697,-9.6618,4774
0.9664,-9.4422,4775
-1.0956,-9.8647,4776
-0.5952,-9.8926,4777
-0.9296,-9.8608,4778
-1.1787,-9.8717,4779
-0.1246,-9.814,4780
-1.8528,-9.7989,4781
-15.7672,-9.7215,4782
5.2662,-9.7276,4783
7.4888,-9.8301,4784
-0.907,-9.7479,4785
0.4636,-9.9295,4786
3.401,-9.9292,4787
2.6416,-9.5709,4788
1.3376,-9.7412,4789
1.1053,-9.7217,4790
3.9364,-9.902,4791
2.0165,-9.8184,4793
0.8122,-9.8374,4794
1.9491,-9.8114,4795
-0.0753,-9.6492,4796
2.2462,-10.0305,4797
0.1633,-9.7064,4798
0.3026,-9.8809,4799
1.2824,-9.846,4800
-0.2929,-9.8266,4801
3.5821,-9.8317,4803
0.6045,-9.8352,4804
-0.8525,-9.5546,4805
0.4097,-9.8998,4806
1.555,-9.7538,4807
6.4554,-9.8578,4808
8.5972,-10.0311,4809
3.6104,-9.744,4810
4.8332,-9.7784,4811
1.847,-9.8009,4813
1.2576,-9.8308,4814
0.6105,-9.8155,4815
0.1719,-9.7837,4816
4.1508,-9.9028,4817
1.057,-9.8338,4818
-0.8979,-9.8849,4819
4.467,-10.195,4820
3.1622,-10.0274,4821
1.0555,-9.8011,4823
-0.3693,-9.8487,4824
0.0881,-9.8955,4825
3.2394,-9.8597,4826
0.2838,-9.784,4827
-10.0269,-9.4514,4829
2.7247,-9.4412,4830
-1.1093,-9.4173,4832
9.7472,-9.4508,4833
5.7233,-9.6111,4834
3.6381,-9.5875,4835
-9.037,-9.6253,4836
17.967,-9.6954,4837
0.4338,-9.789,4838
1.0348,-9.8058,4839
-4.6639,-9.4043,4840
1.8277,-9.7782,4841
-4.8492,-9.7902,4842
14.3742,-9.5547,4843
1.1942,-9.7999,4844
0.6592,-9.7229,4845
6.1064,-9.8919,4846
-2.5825,-10.0511,4847
1.1722,-9.8996,4848
0.0691,-9.7723,4849
0.0121,-9.0079,4850
-0.0907,-9.9614,4851
0.9695,-9.6335,4852
-0.1351,-9.6453,4853
0.0162,-9.8322,4854
1.1822,-9.7909,4855
-0.2146,-9.8809,4856
-4.195,-9.5579,4858
8.1776,-9.6964,4859
-0.0929,-9.7552,4860
0.2607,-9.6968,4861
10.4738,-9.7873,4862
0.0571,-9.867,4863
1.0639,-9.8202,4864
-0.4478,-9.8172,4865
1.683,-9.8096,4866
7.6554,-9.8856,4868
-0.6693,-9.8443,4869
0.634,-10.0952,4870
11.9377,-9.8241,4871
0.3136,-9.6219,4872
0.1022,-9.875,4873
0.3237,-9.8624,4874
0.0114,-9.8598,4875
3.6444,-9.6798,4876
1.7697,-9.7575,4878
-0.7044,-9.8602,4879
0.2262,-9.7815,4880
2.4405,-9.7437,4881
0.7099,-9.9471,4882
1.1923,-9.8767,4883
-0.0809,-9.8178,4884
-0.2708,-9.8228,4885
2.1434,-9.7609,4886
0.475,-9.8328,4888
0.5573,-9.8226,4889
0.4012,-9.7927,4891
0.766,-9.9032,4892
0.872,-10.3858,4893
0.1252,-9.6812,4894
0.8906,-9.9671,4895
2.4866,-9.6689,4896
-0.2761,-9.7098,4897
1.4668,-9.9194,4898
1.912,-9.8084,4899
0.5534,-9.9698,4900
-0.0714,-9.6503,4901
0.5422,-9.8142,4902
0.8662,-9.8197,4903
0.5742,-9.7781,4904
0.3123,-9.8166,4905
-0.1694,-9.7642,4906
3.2937,-9.793,4908
0.1461,-9.8253,4909
0.085,-9.7637,4910
0.3574,-9.7723,4911
0.1829,-9.8323,4912
-0.0199,-9.8031,4913
-0.8921,-9.8982,4914
-0.4056,-10.1346,4915
0.7385,-9.7102,4916
8.0847,-9.8207,4918
3.9158,-9.8578,4919
6.6187,-9.7694,4920
0.112,-9.8274,4921
1.0288,-10.0849,4922
3.1008,-9.8975,4923
0.3518,-9.6456,4924
4.3338,-9.8666,4925
0.4386,-9.8319,4926
4.4349,-9.8333,4928
0.1374,-9.9777,4929
0.7903,-9.5753,4930
-0.0613,-9.7568,4931
-0.0963,-9.7932,4932
1.4761,-9.9067,4933
0.2453,-9.7563,4934
3.1086,-9.8137,4935
-0.0472,-9.7865,4936
0.3968,-9.7985,4938
1.8276,-9.6953,4939
-0.9425,-9.7944,4940
5.0171,-9.058,4941
-0.7518,-10.2268,4942
2.5424,-9.6761,4943
5.9817,-9.7676,4944
0.0757,-9.8581,4945
0.2216,-9.8941,4946
1.2045,-9.7456,4948
-0.0696,-9.6392,4950
0.1015,-9.81,4951
0.6267,-9.7974,4952
0.7551,-9.8058,4953
1.201,-9.8174,4954
0.5957,-9.8291,4955
-0.2454,-9.6743,4956
3.016,-9.7982,4958
2.733,-9.9094,4959
1.7323,-9.767,4960
0.1642,-9.7754,4961
0.5977,-9.9062,4962
0.3445,-9.706,4963
0.2091,-9.8441,4964
0.4855,-9.771,4965
0.0407,-9.7651,4966
-0.183,-9.8354,4968
0.3053,-9.8348,4969
0.2919,-9.9046,4970
0.8601,-9.8009,4971
0.0214,-9.7905,4972
-0.0229,-9.7873,4973
-0.0735,-9.8691,4974
0.4823,-9.9061,4975
0.0258,-9.7536,4976
0.4516,-9.8314,4978
1.7216,-9.808,4979
0.8514,-9.8341,4980
0.9428,-10.0028,4981
-0.4413,-9.9239,4982
-0.0413,-9.8432,4983
0.076,-9.855,4984
-0.0118,-9.8167,4985
0.2436,-9.727,4986
0.2169,-9.8091,4988
0.7521,-9.8138,4989
0.0031,-9.7098,4990
0.3769,-9.7555,4991
-0.1076,-9.8083,4992
0.5902,-9.9957,4993
0.0278,-9.9475,4994
0.5461,-9.8355,4995
0.5773,-9.7816,4996
0.6996,-9.8642,4998
2.7835,-9.7228,4999
0.1454,-9.6563,5000
1.1036,-9.6401,5001
0.3428,-9.857,5002
-4.1473,-9.6137,5003
0.0506,-9.9817,5004
1.0236,-9.7415,5005
2.1405,-10.0283,5007
3.8888,-9.8146,5008
1.7056,-9.8185,5009
-0.2634,-9.7737,5010
0.5811,-9.9811,5011
-0.1528,-10.1439,5012
-0.5558,-9.9655,5013
0.8548,-9.5247,5014
1.7587,-9.9664,5015
0.1658,-9.7826,5016
1.1552,-9.8365,5018
0.2379,-9.7945,5019
0.3354,-9.9285,5020
-0.383,-9.8147,5021
0.1991,-9.8355,5022
1.7745,-9.9798,5023
2.2066,-9.8597,5024
5.4026,-9.7949,5025
1.071,-9.8854,5026
0.6245,-9.8448,5028
0.551,-9.8073,5029
0.7877,-9.8379,5030
0.666,-9.8374,5032
1.0462,-9.74,5033
7.3192,-9.9791,5034
3.1812,-9.6836,5035
-0.1122,-9.9325,5036
0.1127,-9.6791,5038
0.1656,-9.7329,5039
1.2347,-9.9649,5040
0.2875,-9.9737,5041
-0.5261,-9.5132,5042
3.8581,-10.008,5043
1.8441,-9.9364,5044
0.8409,-9.8172,5045
1.5903,-9.8335,5046
0.8752,-9.8237,5048
0.5147,-10.0458,5049
0.1214,-9.9569,5050
-0.2362,-9.8053,5051
0.1504,-9.7081,5052
-0.0105,-9.8253,5053
0.1213,-9.8517,5054
0.7207,-9.7603,5055
0.6902,-9.931,5056
1.1564,-9.8232,5058
1.9494,-10.0254,5059
-3.0527,-9.9752,5060
1.2308,-9.8005,5061
1.3265,-9.4845,5062
1.0999,-9.7518,5063
1.201,-9.687,5065
1.3828,-9.6288,5066
1.0517,-9.9371,5067
5.8501,-9.8564,5068
0.0808,-9.8457,5069
0.0159,-9.8582,5070
1.3795,-9.8874,5071
3.7247,-9.9315,5072
2.5607,-9.7026,5073
0.1155,-9.8598,5074
0.2368,-9.9639,5075
0.8734,-9.716,5076
1.7357,-9.7414,5077
1.0131,-10.0868,5078
-0.2999,-9.8864,5079
0.8978,-9.7541,5080
4.7976,-9.9618,5081
-27.2208,-9.4717,5082
6.782,-9.5094,5084
-9.9752,-9.4669,5085
22.9085,-9.5931,5086
-0.8648,-9.7508,5087
4.2733,-9.7141,5088
-1.2772,-9.7024,5089
7.285,-9.6063,5090
-4.8596,-9.7263,5091
-0.0573,-9.7171,5093
-2.0446,-9.7125,5094
-1.1857,-9.6879,5095
2.6784,-9.7364,5096
0.7416,-9.7938,5097
-2.6558,-9.7726,5098
-1.5387,-9.7641,5099
-0.3408,-9.7639,5100
-0.6826,-9.7489,5101
-0.4743,-9.7634,5103
0.0794,-9.763,5104
-2.6324,-9.742,5105
-1.4934,-9.7186,5106
-1.3933,-9.7098,5107
2.1405,-9.7109,5108
5.3563,-9.7544,5109
-9.0118,-9.6707,5110
6.9623,-9.7334,5111
5.0921,-9.7449,5113
-24.3348,-9.525,5114
9.6379,-9.7511,5115
-2.1454,-9.6934,5116
-25.9703,-8.8992,5117
-57.6336,-9.2324,5118
35.3888,-10.1535,5119
10.651,-9.6895,5120
-5.7519,-9.7853,5121
4.6986,-9.8045,5123
-0.1651,-9.8039,5124
