AYGX_mean,AZ_mean,timestamp
-0.0398,-9.7853,0
-0.0426,-9.7814,1
-0.057,-9.7877,2
1.79,-9.7934,3
-3.8232,-9.7519,4
0.635,-9.7922,5
-0.4024,-9.7618,6
-1.3,-9.7536,7
0.213,-9.7728,9
0.0007,-9.77,10
0.2422,-9.7628,11
0.3912,-9.7285,13
1.5928,-9.7543,14
0.6595,-9.7748,15
0.272,-9.7611,16
-1.646,-9.7519,17
5.9029,-9.7333,18
-1.5519,-9.7557,19
0.4079,-9.7698,20
-0.7015,-9.7663,21
0.2174,-9.7545,22
0.7478,-9.7708,23
0.165,-9.7738,24
0.0216,-9.7733,25
0.1026,-9.7755,26
0.1103,-9.7765,27
0.0368,-9.7743,28
0.0111,-9.7748,29
0.1068,-9.7697,30
0.6003,-9.78,31
0.1044,-9.7828,32
-0.111,-9.7816,33
0.0771,-9.7802,34
-0.0121,-9.7807,35
0.0836,-9.7791,36
-0.0964,-9.7786,37
-0.1911,-9.784,38
1.1646,-9.7505,39
-2.4164,-9.7436,40
-8.176,-9.6597,41
3.3408,-9.6932,42
0.5273,-9.7218,43
0.4213,-9.7235,44
0.1139,-9.7242,45
-1.2029,-9.716,46
-0.7447,-9.6938,47
-0.0292,-9.693,48
-3.2526,-9.6792,50
-0.2545,-9.6382,51
15.6708,-9.6593,52
2.4309,-9.8132,53
0.9608,-9.7671,54
-1.4238,-9.7813,55
-2.0497,-9.7802,56
0.9008,-9.7876,57
-0.32,-9.788,58
0.0206,-9.7835,60
-0.1219,-9.7875,61
-0.0146,-9.7789,62
-0.3085,-9.8274,63
-0.0433,-9.8002,64
-3.1703,-9.7737,65
-1.0632,-9.7663,66
2.6831,-9.7565,67
3.6533,-9.7652,68
0.1134,-9.8215,69
-3.982,-9.6976,70
-66.9862,-5.7288,71
255.9519,-6.2203,72
9.5557,-9.598,73
3.3752,-9.7246,74
-2.9904,-9.7181,75
-0.3556,-9.7053,76
12.1315,-9.6847,77
-6.6512,-9.9945,78
-2.9925,-9.5683,79
2.5195,-9.9854,80
4.5811,-9.7197,81
-2.476,-9.7323,82
-2.7647,-9.6321,83
9.2777,-9.7029,84
-17.6709,-9.6691,85
2.7969,-9.5526,86
21.123,-9.5649,87
-5.6012,-9.7982,88
2.8285,-9.6577,89
5.2675,-9.7644,90
0.523,-9.8015,91
-0.8532,-9.7983,92
-0.1519,-9.7464,93
-0.2858,-9.8011,94
-0.0647,-9.7962,95
-0.6097,-9.7895,96
0.5631,-9.8142,97
0.744,-9.7404,98
-0.4604,-9.7803,99
-0.0759,-9.7872,100
0.0418,-9.6928,101
0.0772,-9.7679,102
-3.6585,-9.7657,103
-0.1193,-9.8046,104
-1.4907,-9.757,105
-13.2426,-9.6676,106
10.8479,-9.7865,107
-3.3767,-9.7909,108
1.5242,-9.7414,109
7.0514,-9.7779,111
3.3209,-9.7028,112
0.8584,-9.8408,113
0.9235,-9.8031,114
-0.7563,-9.7936,115
0.3814,-10.5023,116
11.04,-9.6474,117
-6.7771,-9.6753,118
-6.4859,-9.6939,119
30.6257,-9.2572,120
6.2907,-9.8144,121
1.9373,-9.7602,122
0.6994,-9.7718,123
0.449,-9.8219,124
6.0469,-9.7312,125
-0.2614,-9.8566,126
-5.7817,-9.8105,127
0.1066,-9.9289,128
3.9388,-9.7806,129
10.0505,-10.5083,130
-0.1674,-9.8889,131
1.0161,-9.6937,132
16.1218,-9.8862,133
2.6277,-9.9514,134
7.0413,-9.7788,135
-4.7228,-9.7732,136
0.4809,-9.7443,137
14.655,-9.7691,138
3.5629,-9.7604,139
-2.2248,-9.8363,140
2.0913,-9.7267,141
2.9045,-9.7426,142
13.4966,-9.7833,143
3.0376,-9.7176,144
5.4217,-9.7425,145
4.1043,-9.822,146
15.6921,-9.7656,147
-0.498,-9.6953,148
-0.1887,-9.6075,149
1.331,-9.6655,150
6.541,-9.9141,151
-0.0661,-9.7737,152
8.1804,-9.7672,153
-4.5282,-9.7851,154
11.0583,-9.721,155
-0.5236,-9.776,156
1.8601,-9.7989,157
-0.7674,-9.7535,158
-0.7429,-9.787,159
-0.4248,-9.8276,160
-2.832,-10.2405,162
-0.6698,-9.7691,163
0.2987,-9.4082,164
-0.1861,-9.5633,165
-4.8167,-9.7905,166
-3.4126,-9.3438,167
4.8569,-10.0694,168
-2.0567,-9.651,169
1.7495,-9.8612,170
1.6844,-9.7939,171
4.6908,-9.7198,172
-1.865,-9.8403,173
0.343,-9.5852,174
2.5833,-10.1374,175
-0.8177,-9.8258,176
-1.0286,-9.7479,177
-1.4276,-9.7283,178
-0.2192,-9.5369,179
-1.928,-9.5714,180
-0.0282,-9.6883,181
-0.3382,-9.7871,182
2.8772,-9.7371,183
0.3173,-9.8018,184
1.1088,-9.9825,185
0.5289,-10.2433,186
3.3178,-9.9128,187
0.5284,-9.4745,188
13.1861,-9.7021,189
0.9639,-9.852,190
-0.1058,-9.7432,191
0.7353,-9.8592,192
0.1139,-9.8218,193
0.057,-9.7668,194
0.4832,-9.8084,195
-0.1648,-9.8324,196
0.8279,-9.5523,197
0.3938,-9.3676,198
0.3041,-10.1637,199
0.6038,-9.9819,200
-1.9179,-10.0821,201
1.1012,-9.84,202
1.2768,-9.828,203
-0.6828,-9.8124,204
0.6703,-9.7908,205
-0.0568,-9.7304,206
2.1024,-9.7341,207
5.6422,-9.9602,208
-1.4627,-9.5532,209
1.8728,-9.7247,210
0.8643,-9.9886,211
-0.5018,-9.7857,213
6.7404,-9.8889,214
-6.2769,-10.3603,215
4.3785,-9.9235,216
7.585,-9.8921,217
6.5905,-9.7726,218
19.0205,-9.5411,219
-0.4199,-9.7209,220
-1.7818,-9.701,221
-2.0261,-9.7801,222
-0.1245,-9.2222,223
-2.7178,-9.6064,224
4.9758,-9.6413,225
-0.4571,-9.2991,226
0.0873,-10.1095,227
0.9699,-9.6234,228
0.8097,-9.7854,229
5.0503,-9.999,230
1.1616,-9.821,231
-0.6681,-9.8881,232
0.1311,-9.8365,233
0.4868,-9.8265,234
3.0971,-9.7684,235
1.3186,-9.8,236
-0.8791,-9.728,237
4.4038,-9.7317,238
-2.1828,-9.8099,239
8.6014,-9.6341,240
4.5733,-9.8523,241
-0.0071,-9.7794,242
0.4572,-9.8127,243
0.0578,-9.833,244
0.2368,-9.8376,245
0.0068,-9.7563,246
0.2425,-9.7025,247
-0.1893,-9.6426,248
-0.3848,-9.721,249
0.9562,-9.7796,250
2.2478,-10.2927,251
1.3782,-10.0225,252
3.5595,-9.7781,253
-1.9696,-9.9065,254
-6.9774,-9.7005,255
-10.5294,-9.6188,256
-2.6076,-9.955,257
-2.5084,-9.8646,258
-5.2975,-9.7412,259
-1.5485,-9.375,260
-0.9943,-9.2404,261
-2.5312,-9.7889,262
-1.3232,-9.812,264
-2.4514,-9.8109,265
0.9331,-9.683,266
-3.2501,-9.7239,267
-9.3249,-9.7409,268
-1.3066,-9.671,269
-3.4186,-9.8935,270
-0.9527,-9.7251,271
-1.7454,-9.6442,272
0.2291,-9.8477,273
2.5745,-9.6746,274
6.9342,-9.7964,275
1.9656,-10.2367,276
-9.99,-10.0244,277
-3.3545,-9.4943,278
-3.0692,-9.8862,279
-1.0443,-9.7292,280
-3.7232,-9.8325,281
-2.0161,-9.7164,282
-4.0944,-9.7345,283
-4.6017,-9.9483,284
-1.4869,-10.3358,285
-6.4554,-9.8718,286
-1.7004,-9.3952,287
-4.7906,-9.5645,288
-0.8969,-9.3256,289
-3.7764,-9.9175,290
-2.9546,-9.7747,291
-5.9047,-9.8432,292
-1.5181,-9.6827,293
1.765,-10.2881,294
3.4327,-9.3819,295
-1.6505,-9.6949,296
-0.7552,-10.0291,297
-0.4532,-9.5307,298
10.3953,-9.5849,299
2.7615,-9.7912,300
8.1265,-9.787,301
10.268,-9.8351,302
3.9191,-9.9197,303
-1.9503,-9.8661,304
-0.2187,-9.9275,305
-0.7831,-9.8291,306
1.0645,-9.9676,307
-0.651,-9.7198,308
-0.5008,-9.7846,309
3.4406,-9.7847,310
-2.8193,-8.8783,311
-0.8459,-9.8208,312
0.9784,-9.6479,313
-0.9837,-9.7703,315
-0.5683,-10.0226,316
2.4305,-9.8086,317
0.2524,-10.0015,318
3.4279,-9.6697,319
0.0751,-9.8052,320
1.026,-9.9602,321
2.3125,-9.977,322
0.3633,-9.8011,323
-0.5522,-9.4802,324
-1.1269,-9.9813,325
0.6035,-9.8841,326
-0.5379,-10.2736,327
0.0216,-9.7759,328
0.9588,-9.8434,329
-0.0523,-9.6324,330
0.5892,-9.8012,331
0.2841,-9.8237,332
-0.0836,-9.8146,333
0.1313,-9.8443,334
0.0766,-9.8356,335
-2.6006,-9.7574,336
-2.3003,-9.7014,337
4.1921,-9.7674,338
-0.5923,-9.7726,339
-2.4013,-9.7768,340
-2.7705,-9.7576,341
0.2727,-9.7428,342
-0.2662,-9.7269,343
0.646,-9.7369,344
2.1153,-9.7195,345
1.3458,-9.7539,346
-4.0526,-9.7412,347
5.1035,-9.8265,348
-0.8343,-9.7503,349
0.3722,-9.7508,350
3.7006,-9.8644,351
-0.5635,-9.8044,352
2.906,-9.8378,353
0.2073,-9.8023,354
0.1128,-9.8184,355
-3.0979,-9.9593,356
-1.8644,-9.0795,357
-0.6356,-9.7075,358
5.091,-9.9258,359
3.216,-9.83,360
3.0184,-9.556,361
-0.606,-9.8951,362
3.8758,-9.869,363
-1.6885,-9.8443,364
1.9127,-9.7214,366
1.3541,-9.9097,367
3.9512,-9.9656,368
0.0226,-9.7657,369
-1.0655,-9.9125,370
2.3343,-9.8264,371
-2.0632,-9.8852,372
1.9702,-9.9017,373
-5.6649,-9.8319,374
8.9159,-9.7047,375
1.0459,-9.9647,376
0.0199,-9.7467,377
0.3639,-9.8535,378
-0.1143,-9.6282,379
-0.0328,-9.7748,380
0.5538,-9.8475,381
9.9854,-9.609,382
1.2524,-9.7959,383
0.1025,-9.8514,384
-0.2264,-9.8599,385
-0.5007,-9.8205,386
-1.8275,-9.663,387
-0.9223,-9.8638,388
1.1659,-9.8659,389
1.8116,-9.8965,390
0.8561,-9.8725,391
0.3216,-9.7383,392
2.1659,-9.8229,393
2.2515,-9.84,394
0.7051,-9.6295,395
0.5125,-9.8584,396
-0.6762,-9.8422,397
-0.354,-9.8626,398
-0.3018,-9.7746,399
0.7703,-9.823,400
0.4705,-9.8212,401
-0.3458,-9.7942,402
5.8636,-9.8346,403
5.2977,-9.8128,404
-0.4459,-9.6825,405
-0.9426,-9.5835,406
-3.6216,-8.4082,407
12.7164,-10.0561,408
11.7166,-9.6543,409
-0.7441,-9.8632,410
3.5381,-10.332,411
-3.1185,-9.9097,412
-2.4184,-9.7017,413
8.5866,-9.8423,414
-4.7881,-9.8449,415
-1.4593,-9.7712,417
-3.4189,-9.7673,418
-1.5453,-9.9,419
0.6058,-9.6539,420
-3.1148,-9.84,421
0.9829,-9.3977,422
-0.7971,-9.8062,423
0.9853,-9.808,424
1.7716,-9.806,425
0.7128,-9.8876,426
0.5335,-9.7855,427
2.958,-9.7755,428
-0.2295,-9.7564,429
3.5438,-9.7397,430
-1.3593,-9.7447,431
-0.5045,-9.6543,432
-0.0615,-9.9032,433
0.7723,-9.6762,434
2.5068,-10.1248,435
1.8403,-9.8885,436
1.3852,-9.0397,437
0.813,-8.893,438
-1.8237,-9.4367,439
0.2954,-9.0824,440
0.4079,-9.8281,441
1.8722,-9.7193,442
3.9017,-9.9125,443
1.0089,-9.5849,444
11.2884,-9.8766,445
-2.1543,-9.404,446
1.0348,-9.848,447
-1.6111,-10.952,448
0.36,-9.5817,449
-1.8237,-9.7788,450
1.7987,-9.9905,451
-0.5827,-9.7218,452
-0.14,-9.8832,453
0.903,-10.0103,454
1.0101,-9.863,455
0.1159,-10.5141,456
4.5132,-10.6348,457
-1.1192,-9.5741,458
3.1417,-9.9065,459
-0.6535,-9.7032,460
5.881,-8.9227,461
-1.7389,-9.0785,462
6.3382,-9.7896,463
-4.4297,-9.8964,464
-2.5459,-9.6356,465
-1.7375,-10.2584,466
-14.9243,-9.706,468
1.6593,-9.7431,469
1.982,-9.837,470
-0.2345,-9.8054,471
7.0581,-9.7933,472
-0.286,-9.7461,473
-0.5438,-9.827,474
-0.5877,-9.7968,475
-1.0486,-9.8181,476
0.8256,-9.8278,477
1.2838,-9.7132,478
-4.6337,-9.8785,479
4.7904,-10.1013,480
-1.8315,-9.8943,481
-1.8176,-9.7363,482
3.2156,-9.7847,483
-0.2322,-9.8845,484
-0.1885,-9.8097,485
4.8713,-9.8892,486
2.6858,-9.7757,487
2.7773,-9.6639,488
1.1396,-9.8143,489
-0.0321,-9.5759,490
-1.0756,-9.7616,491
0.2331,-9.8233,492
0.789,-9.791,493
-5.6148,-9.6951,494
-0.3755,-9.91,495
-0.0012,-9.8476,496
-0.5114,-9.7649,497
-1.2778,-9.679,498
-0.0755,-9.9207,499
-1.0797,-9.8748,500
-1.1687,-9.6322,501
0.1411,-9.7711,502
-0.2097,-9.849,503
-0.6891,-9.8118,504
0.3083,-9.8033,505
-0.5132,-9.942,506
-0.5886,-9.9197,507
-1.3479,-9.8073,508
0.6194,-9.8624,509
0.73,-9.7675,510
-1.2838,-9.7251,511
-1.2267,-9.8234,512
0.5353,-9.8432,513
0.8018,-9.5724,514
0.0446,-9.9573,515
0.4392,-9.8291,516
-2.9089,-8.1321,517
-2.1347,-9.7149,519
4.1632,-9.9453,520
2.6481,-9.8295,521
-1.9472,-9.7281,522
5.0032,-9.7814,523
0.2983,-9.463,524
2.151,-9.8293,525
0.005,-9.5412,526
-0.0275,-9.9515,527
-0.4689,-9.699,528
2.4748,-9.6829,529
1.353,-9.5589,530
0.4665,-9.7902,531
0.6443,-9.7851,532
-0.0433,-9.8551,533
0.1952,-9.6183,534
-0.2642,-9.5154,535
0.06,-8.686,536
2.997,-9.8015,537
2.6111,-9.5144,538
3.1864,-9.977,539
2.6456,-9.7162,540
2.9627,-9.8024,541
0.8366,-9.7503,542
-0.192,-9.8218,543
0.9426,-10.3248,544
-0.0448,-9.7576,545
0.0291,-9.53,546
-0.1131,-9.9287,547
0.1401,-9.7677,548
0.3842,-9.9425,549
-0.113,-9.7978,550
-0.3705,-9.8295,551
1.4773,-9.984,552
0.8232,-9.8504,553
-1.2709,-9.8371,554
2.0317,-9.6131,555
2.6264,-9.7968,556
2.4499,-9.8795,557
-0.17,-9.7864,558
-0.5645,-9.7988,559
5.6668,-9.9148,560
7.7435,-10.0375,561
-0.4802,-9.8028,562
-1.1357,-9.8067,563
2.5354,-9.682,564
-1.6848,-9.9319,565
-0.5149,-9.6401,566
0.3064,-9.6707,567
-0.1991,-9.7762,568
0.4262,-9.801,570
-0.4752,-9.7504,571
0.0356,-10.8394,572
1.2867,-9.7442,573
0.7765,-9.7946,574
0.7731,-9.9928,575
-0.8368,-10.1708,576
1.948,-10.2236,577
6.4759,-10.3207,578
2.2291,-9.6274,579
-0.1007,-9.8835,580
2.276,-9.7796,581
2.0934,-9.8217,582
3.1441,-9.9239,583
-2.0782,-9.7148,584
7.7615,-10.1064,585
-1.8048,-9.7597,586
-0.4316,-9.9215,587
-0.9183,-9.8366,588
0.0919,-9.6693,589
5.7983,-9.7118,590
7.0503,-9.746,591
1.055,-9.8927,592
-1.8526,-9.7532,593
-0.823,-9.9205,594
0.773,-9.8692,595
-3.8299,-9.8529,596
4.6091,-9.7475,597
2.2792,-9.8199,598
0.1868,-9.8154,599
1.2118,-9.6547,600
-0.0921,-9.7329,601
-0.6078,-9.8193,602
-0.1019,-9.9662,603
-1.2148,-9.8925,604
-2.7791,-10.2531,605
-0.9816,-9.6244,606
-6.4418,-9.3965,607
2.2972,-9.7648,608
0.3791,-9.7608,609
0.1921,-9.7391,610
-0.1763,-9.8443,611
1.1638,-9.7353,612
0.4139,-9.8302,613
20.9172,-9.635,614
1.3424,-9.6433,615
0.2637,-9.964,616
1.2568,-9.7311,617
1.918,-9.6333,618
2.0448,-9.7741,619
0.7754,-9.8781,621
0.9856,-9.7589,622
-0.0959,-9.8393,623
0.619,-9.8239,624
1.7508,-8.3045,625
4.0552,-9.7875,626
0.9684,-9.8594,627
1.2301,-10.0224,628
1.3462,-9.7876,629
1.1134,-9.8577,630
-0.3429,-9.8093,631
0.018,-9.8001,632
2.374,-9.7454,633
-0.2586,-9.8184,634
-0.362,-9.826,635
-0.3791,-9.756,636
2.6348,-9.7056,637
2.53,-9.9014,638
-4.9862,-9.6492,639
-1.4053,-9.8298,640
-1.7466,-9.812,641
-1.2671,-9.745,642
-0.398,-9.8677,643
-1.4883,-9.503,644
-1.9202,-10.0616,645
2.0541,-9.303,646
4.9329,-9.5354,647
0.523,-10.0402,648
-1.8393,-9.8055,649
-0.006,-9.8019,650
-0.9368,-9.7559,651
0.1204,-9.8923,652
1.6841,-9.7942,653
1.7077,-9.805,654
2.7946,-9.5658,655
1.6473,-9.6601,656
0.3472,-9.8153,657
1.0733,-10.1706,658
-1.1778,-9.6398,659
0.8178,-9.8192,660
0.0374,-9.771,661
0.8063,-9.8247,662
2.0575,-9.5627,663
0.7965,-10.2015,664
1.5016,-9.6861,665
0.6705,-9.8847,666
-0.3542,-9.8304,667
2.0481,-9.835,668
-0.0943,-9.8247,669
0.035,-9.8734,670
-1.0676,-9.6658,673
0.7474,-9.8511,674
0.2985,-9.5819,675
0.1081,-9.7284,676
3.0574,-9.741,677
0.0374,-9.6596,678
5.3572,-9.8565,679
-0.6072,-9.7558,680
2.8009,-9.6497,681
1.7615,-9.8093,682
3.4537,-9.8612,683
0.2805,-9.8081,684
-0.2342,-9.7891,685
-0.3088,-9.7722,686
-1.0583,-9.7165,687
0.4839,-9.9081,688
3.0114,-9.7364,689
1.2021,-10.0307,690
0.7187,-9.8589,691
0.7206,-9.7666,692
-0.299,-9.9556,693
-0.0804,-9.8731,694
-1.6926,-9.8707,695
0.7944,-9.7556,696
-1.1844,-9.7872,697
-0.7045,-9.7151,698
0.5806,-9.8243,699
0.4525,-9.61,700
0.2055,-9.7832,701
0.0808,-9.8624,702
-0.0746,-9.8143,703
0.319,-9.6555,704
-0.288,-9.8569,705
0.3641,-9.8249,706
-0.3652,-9.8265,707
0.182,-9.8113,708
-0.0377,-9.8517,709
0.1578,-9.7777,710
-1.1586,-9.7156,711
0.7213,-9.7097,712
-0.8495,-9.7545,713
0.8828,-9.7438,714
0.3462,-9.8001,715
1.184,-9.8505,716
-1.5757,-9.775,717
-1.6125,-9.6775,718
3.6575,-9.7154,719
10.9138,-9.7632,720
25.8693,-9.8573,721
3.303,-9.8016,723
-1.3338,-9.8506,724
-3.5433,-9.2396,725
-4.7982,-10.2716,726
-12.1997,-9.8724,727
6.7768,-9.813,728
-10.9036,-9.993,729
4.6962,-9.5131,730
-4.9763,-9.9171,731
-9.2906,-9.6437,732
-10.7684,-9.915,733
-19.5501,-10.086,734
1.2883,-9.8454,735
-12.6165,-9.8157,736
-6.4492,-9.893,737
-4.7974,-9.6996,738
2.5274,-9.7449,739
-2.2261,-9.7199,740
-2.6767,-9.7665,741
0.3828,-9.7932,742
-2.4012,-9.6742,743
4.7468,-9.7709,744
-0.2573,-9.7903,745
2.2226,-9.8244,746
-1.1893,-7.9323,747
0.947,-9.5996,748
0.8861,-9.8387,749
-5.5432,-9.8475,750
-0.6955,-9.8183,751
-0.6937,-9.8545,752
-0.0563,-9.8217,753
-1.4111,-9.3734,754
0.5763,-10.0157,755
1.6012,-9.9076,756
-1.863,-9.665,757
-1.3768,-9.7338,758
-1.717,-9.764,759
0.6329,-9.5084,760
-0.5619,-9.8125,761
-1.9767,-9.8183,762
-0.4192,-9.9013,763
0.0073,-9.5225,764
-0.1356,-9.8613,765
1.8165,-9.8678,766
-1.1307,-9.7571,767
0.6083,-9.8966,768
0.3177,-9.7543,769
-1.0463,-9.7749,770
0.6791,-9.8506,771
-0.3147,-9.761,772
-0.6171,-9.7688,774
0.2564,-9.6937,775
-0.6639,-9.9657,776
0.8997,-9.7738,777
4.7745,-9.8173,778
8.4431,-10.1768,779
7.8135,-9.5978,780
0.8277,-9.8271,781
-0.4011,-9.7385,782
1.9963,-9.8621,783
1.0253,-9.8215,784
0.0095,-9.8244,785
1.2056,-9.7716,786
0.4313,-9.9551,787
0.4494,-9.6816,788
0.6452,-9.978,789
-2.1834,-9.9483,790
2.0991,-9.8246,791
0.1825,-9.7995,792
0.1048,-9.8565,793
0.2498,-9.7845,794
-0.4938,-9.834,795
1.1347,-9.893,796
0.072,-9.787,797
1.3133,-9.8938,798
-0.7434,-9.9178,799
0.9112,-9.6902,800
2.5544,-9.7752,801
-0.3571,-9.9253,802
3.5984,-9.843,803
1.4557,-9.7988,804
-0.254,-9.3647,805
-0.258,-10.052,806
0.2795,-9.5703,807
0.3912,-9.7828,808
2.0795,-9.8417,809
0.5441,-9.8663,810
0.01,-9.6331,811
-1.0871,-9.8435,812
-0.315,-9.7805,813
-0.1235,-9.821,814
-1.1214,-9.9002,815
-2.517,-10.1915,816
0.6927,-9.7172,817
-0.5714,-9.9876,818
-0.829,-9.7721,819
-1.8117,-9.8989,820
-1.1885,-9.8345,821
-2.1206,-9.8244,822
-0.8305,-9.806,823
-1.7809,-9.596,825
-1.5826,-9.8507,826
-4.9704,-9.7108,827
-0.6371,-9.7403,828
-2.236,-9.8198,829
-1.0041,-9.7014,830
2.2547,-9.8072,831
-2.5018,-9.7543,832
1.1869,-9.7581,833
-0.7976,-9.7882,834
2.1174,-9.604,835
-0.4317,-9.7906,836
3.3162,-9.6472,837
3.0877,-9.7769,838
4.272,-9.8212,839
0.4227,-9.9469,840
-1.8871,-9.774,841
6.4045,-9.8404,842
5.011,-9.8175,843
0.1171,-9.8367,844
0.3209,-9.7413,845
3.016,-9.6943,846
1.5739,-9.7242,847
0.7658,-9.9939,848
-0.0566,-9.8027,849
21.8059,-9.594,850
0.4144,-9.8036,851
-1.1585,-9.8261,852
-0.2898,-9.8071,853
0.1492,-9.8462,854
-0.5816,-9.8373,855
-2.2715,-9.8189,856
0.6518,-9.8901,857
-0.8317,-9.7658,858
0.042,-10.043,859
-0.8175,-9.8609,860
-1.0469,-9.9641,861
-1.9733,-9.8487,862
3.6112,-9.8305,863
1.5318,-9.7,864
-1.241,-9.9533,865
-0.7558,-9.6935,866
-0.5963,-9.8181,867
-3.4691,-9.6823,868
-0.4645,-9.8638,869
-0.1599,-9.8194,870
-0.6566,-9.9805,871
1.7932,-9.7361,872
-0.5085,-9.825,873
3.3064,-9.8017,874
0.0546,-9.7,876
0.3106,-9.8157,877
0.2853,-9.8326,878
2.0236,-9.9646,879
-0.0353,-9.893,880
-0.452,-9.8279,881
4.402,-9.9013,882
0.7021,-9.8059,883
1.645,-9.7384,884
0.3212,-9.6346,885
11.0309,-9.7562,886
1.1866,-10.1112,887
0.8853,-9.7583,888
-0.0387,-9.5751,889
3.5367,-9.7405,890
1.027,-9.7795,891
-1.3725,-9.8037,892
0.7423,-9.7461,893
0.9956,-9.7645,894
0.7213,-10.0219,895
0.4542,-9.7058,896
-0.355,-10.0581,897
1.4302,-9.8321,898
1.8461,-9.7471,899
0.6359,-9.66,900
7.8981,-9.8954,901
1.5926,-9.7811,902
-1.719,-9.9212,903
4.3688,-9.6531,904
3.4288,-9.6076,905
-1.33,-10.0094,906
-0.2132,-9.6156,907
-0.1114,-9.6301,908
1.2625,-10.1343,909
-1.0629,-9.8764,910
-0.9441,-9.707,911
1.1589,-9.8841,912
0.6883,-9.8791,913
-1.4238,-9.6662,914
-1.4641,-10.0436,915
-1.7131,-9.8445,916
-0.0497,-9.7798,917
0.1963,-9.8702,918
-1.2324,-9.9173,919
0.8143,-9.8328,920
1.255,-9.9124,921
-0.5874,-9.7029,922
1.4353,-9.7843,923
-1.4172,-9.689,924
-1.3909,-9.6784,925
0.1926,-9.8387,927
2.049,-10.1588,928
-1.8462,-9.616,929
6.2925,-9.9935,930
1.2288,-9.6657,931
-1.3867,-9.6356,932
-0.2287,-9.7864,933
-0.7133,-9.855,934
0.8618,-9.4994,935
0.7347,-9.6477,936
-0.0499,-9.7602,937
-0.0764,-9.8213,938
2.241,-9.8785,939
-3.0618,-9.843,940
1.9336,-9.8194,941
1.0496,-10.0571,942
1.0126,-9.8194,943
0.7893,-9.8071,944
-0.633,-9.4702,945
0.5381,-9.7005,946
0.2616,-9.6617,947
-2.47,-9.9858,948
-2.8488,-9.7359,949
1.08,-9.7915,950
-0.9649,-9.8529,951
-0.2153,-9.62,952
0.8947,-9.7798,953
-1.4481,-9.549,954
2.8126,-9.8395,955
0.8198,-9.2421,956
4.8982,-9.8329,957
-0.1486,-9.8027,958
-1.6648,-9.6307,959
-0.5572,-9.7929,960
-3.8523,-9.7578,961
1.1872,-9.8011,962
1.7911,-9.8261,963
1.6729,-10.0476,964
1.183,-9.7535,965
1.5601,-9.9629,966
0.3044,-9.8938,967
-0.9051,-9.637,968
7.7052,-9.8598,969
1.6216,-9.7715,970
0.5045,-9.7207,971
1.5568,-9.6293,972
-1.5133,-9.7841,973
2.8055,-9.6049,974
0.0221,-9.5658,975
0.1095,-9.8844,976
3.1087,-9.8596,978
-1.5404,-9.5786,979
-1.0808,-9.6108,980
0.2118,-9.8878,981
3.8947,-9.9543,982
1.5438,-9.8079,983
0.9896,-9.8206,984
-0.2846,-9.7931,985
-0.0296,-10.1663,986
-0.3511,-9.7173,987
0.3606,-10.0326,988
0.4434,-9.8115,989
3.2504,-9.7866,990
-0.352,-9.8856,991
2.2108,-9.7333,992
-0.6929,-9.7723,993
-0.5311,-9.7785,994
-1.7427,-9.9377,995
-1.0121,-9.7685,996
-0.6232,-9.7493,997
-1.4168,-10.2344,998
-1.4972,-9.7965,999
-0.0164,-9.7504,1000
0.7019,-9.8286,1001
0.3059,-9.7965,1002
1.7374,-9.6832,1003
-1.8851,-9.6823,1004
-6.316,-9.6968,1005
-2.055,-9.5563,1006
5.1838,-9.957,1007
-0.6658,-9.8157,1008
-0.2526,-9.6012,1009
2.6234,-9.8333,1010
0.7083,-9.8058,1011
0.0963,-9.8087,1012
0.7709,-9.9188,1013
-0.8114,-9.7666,1014
0.1858,-9.5674,1015
-0.6579,-9.6049,1016
0.1403,-9.8624,1017
-0.7593,-9.4288,1018
-0.1854,-9.6735,1019
-0.2352,-9.9235,1020
0.4985,-9.9183,1021
4.1337,-9.659,1022
2.1672,-9.9701,1023
1.5601,-9.3952,1024
-0.6438,-9.9349,1025
1.1287,-9.6417,1026
-0.0519,-9.9704,1027
-0.8205,-10.0337,1029
0.5186,-9.8377,1030
0.6376,-9.6873,1031
0.0465,-9.7566,1032
-0.6617,-9.8336,1033
0.1268,-9.8198,1034
0.4876,-9.861,1035
-2.0073,-9.8832,1036
4.363,-10.061,1037
-0.3125,-9.8896,1038
0.4973,-9.8302,1039
0.4063,-9.8169,1040
1.3674,-9.9152,1041
0.863,-9.7363,1042
-0.3713,-9.7982,1043
-0.0618,-9.7724,1044
0.6883,-9.8193,1045
0.005,-9.8694,1046
0.4345,-9.8498,1047
1.9306,-9.8256,1048
2.8106,-10.1872,1049
-0.0912,-9.9123,1050
0.9433,-9.8298,1051
0.36,-9.8027,1052
0.0771,-9.8026,1053
0.1419,-9.8355,1054
-0.0055,-9.8272,1055
0.0537,-9.8214,1056
0.9521,-9.8348,1057
2.6133,-9.8332,1058
0.0653,-9.7888,1059
-0.6427,-9.7995,1060
-0.9598,-9.7782,1061
0.3669,-9.7675,1062
-0.8629,-9.7725,1063
2.7761,-9.8911,1064
0.0627,-9.7114,1065
1.2989,-10.1146,1066
-1.7592,-9.8907,1067
2.7174,-9.8368,1068
11.5983,-9.7182,1069
-6.1234,-9.2957,1070
-13.0988,-10.0481,1071
-2.8463,-10.2051,1072
-3.5963,-9.6658,1073
-3.8272,-9.7792,1074
-1.0496,-9.7599,1075
7.2148,-9.7498,1076
9.6801,-10.1337,1077
3.3753,-9.8404,1078
-0.2807,-10.0269,1080
-2.0349,-9.9569,1081
0.6792,-9.5794,1082
-1.2179,-9.8456,1083
-0.5186,-10.31,1084
-0.1003,-10.088,1085
0.8185,-9.7592,1086
0.0485,-9.6329,1087
1.0103,-9.7617,1088
0.1376,-9.7299,1089
0.0324,-9.8246,1090
0.0132,-9.7098,1091
-0.017,-9.5504,1092
0.0005,-9.8049,1093
0.3607,-9.8528,1094
0.4966,-9.7162,1095
0.0443,-9.8123,1096
-1.3008,-9.8129,1097
1.2111,-9.7864,1098
-0.19,-9.7855,1099
-0.0323,-9.9293,1100
0.0786,-9.8153,1101
0.1167,-9.7837,1102
-0.5468,-9.7666,1103
-1.3882,-9.7152,1104
0.7192,-9.8808,1105
-2.0533,-9.9819,1106
0.2668,-9.7553,1107
-0.9671,-10.1743,1108
0.3399,-9.7812,1109
0.9013,-9.6776,1110
0.5347,-9.4424,1111
2.4689,-9.8292,1112
0.409,-9.8286,1113
4.3312,-9.9848,1114
-2.426,-9.866,1115
-0.2509,-10.454,1116
2.1089,-10.559,1117
3.1904,-9.7806,1118
4.9009,-9.8029,1119
1.2669,-9.8067,1120
0.8319,-9.7832,1121
-0.1054,-9.899,1122
0.5188,-9.8411,1123
1.4147,-9.7778,1124
0.1668,-9.784,1125
1.3176,-9.8672,1126
0.6602,-9.7916,1127
-0.4772,-9.7562,1128
-1.1436,-9.9157,1129
-0.2661,-9.8012,1131
3.168,-10.2044,1132
3.1148,-9.8932,1133
0.1265,-9.7779,1134
-0.2314,-9.9449,1135
5.9268,-9.5407,1136
0.6165,-9.6244,1137
-2.2421,-9.8319,1138
-0.2417,-10.0026,1139
-7.0195,-9.7843,1140
-0.495,-9.8085,1141
0.5597,-9.8228,1142
-0.3394,-9.8233,1143
-1.3347,-9.7742,1144
-0.4794,-9.8497,1145
2.0305,-9.8918,1146
-0.467,-9.6441,1147
0.2104,-9.8102,1148
1.6339,-9.8216,1149
-2.2359,-9.808,1150
6.2137,-9.7992,1151
4.5965,-9.7677,1152
1.4531,-9.8596,1153
1.453,-9.7335,1154
1.2572,-9.8076,1155
-1.9255,-9.3096,1156
10.8623,-9.7415,1157
25.6711,-9.7646,1158
3.9038,-9.89,1159
2.8078,-9.789,1160
0.0988,-9.7981,1161
0.5228,-9.5669,1162
-0.6768,-9.7795,1163
1.561,-9.7603,1164
2.2977,-9.8776,1165
-0.3391,-9.7521,1166
1.5016,-10.0294,1167
-0.9313,-9.6556,1168
-0.678,-9.8852,1169
0.0707,-9.7944,1170
0.0121,-9.8083,1171
-0.1001,-9.8279,1172
-0.3996,-9.7697,1173
-4.9707,-9.7497,1174
1.4563,-9.7149,1175
1.538,-9.7272,1176
1.4249,-9.7336,1177
-1.0506,-9.7683,1178
0.5597,-9.7612,1179
-0.1752,-9.7615,1180
-0.5484,-9.7598,1183
-2.9788,-9.7426,1184
-1.622,-9.6787,1185
4.0337,-9.6914,1186
1.6728,-9.7496,1187
0.6596,-9.7399,1188
1.1243,-9.7536,1189
0.5049,-9.7673,1190
4.9104,-9.7406,1191
0.2993,-9.8325,1192
5.0653,-9.8014,1193
10.9148,-9.7891,1194
5.5292,-9.6779,1195
5.5614,-10.2976,1196
-16.4124,-9.7085,1197
-4.5935,-9.3953,1198
-2.3731,-9.9408,1199
-6.5628,-9.6119,1200
6.8806,-9.8185,1201
-1.0149,-9.8798,1202
0.1221,-9.7698,1203
-0.9066,-9.861,1204
-2.8574,-9.9121,1205
0.6932,-9.8349,1206
0.6058,-9.7273,1207
-2.6098,-9.8433,1208
4.5457,-9.8327,1209
2.0232,-9.7192,1210
-1.5727,-9.8568,1211
3.6883,-9.7308,1212
1.1825,-9.7452,1213
0.6241,-9.9573,1214
4.4914,-9.8698,1215
-1.8543,-9.7905,1216
-1.5342,-9.6871,1217
9.7556,-9.7196,1218
0.5048,-9.6628,1219
1.7456,-9.7067,1220
-0.31,-9.8355,1221
-0.4787,-9.6518,1222
-0.8885,-9.8029,1223
2.1007,-9.8311,1224
0.9866,-9.9939,1225
0.5511,-9.8419,1226
-2.0843,-9.815,1227
-0.8027,-9.7993,1228
2.9043,-9.7156,1229
0.5605,-9.8133,1230
-0.591,-9.8152,1231
-0.1377,-9.7402,1233
1.0047,-9.7167,1234
0.4267,-10.0956,1235
2.3355,-9.8425,1236
-1.4524,-9.8626,1237
-0.1101,-9.8724,1238
-0.2543,-9.406,1239
-2.659,-8.8947,1240
-0.802,-9.7573,1241
0.3801,-9.7242,1242
-1.1712,-9.6378,1243
-2.2981,-9.8639,1244
0.2694,-9.8261,1245
0.0906,-9.7259,1246
0.2434,-9.7393,1247
0.2613,-10.0878,1248
0.3144,-9.746,1249
1.1067,-9.8184,1250
0.3093,-9.8689,1251
2.3489,-9.781,1252
0.0108,-9.791,1253
0.5395,-9.7096,1254
1.3677,-9.7256,1255
1.5658,-9.6553,1256
2.8239,-9.8305,1257
0.2378,-9.9939,1258
2.1914,-9.7449,1259
0.0391,-9.499,1260
-0.6376,-9.8058,1261
0.4902,-9.8645,1262
2.5235,-9.8656,1263
-0.819,-9.8506,1264
4.6288,-9.9933,1265
1.327,-10.1742,1266
0.9576,-9.6373,1267
-0.7294,-10.0807,1268
0.5219,-10.3845,1269
3.8393,-9.9293,1270
9.0374,-9.8523,1271
2.3254,-9.8884,1272
1.5106,-9.986,1273
1.3878,-5.9457,1274
-0.0366,-10.5716,1275
-2.2731,-9.9312,1276
-0.1171,-9.7711,1277
3.4963,-9.8333,1278
7.6946,-9.6054,1279
0.6271,-9.787,1280
2.41,-9.9976,1281
-1.0851,-9.8282,1282
0.6652,-9.841,1284
-0.1827,-9.7636,1285
7.7067,-9.971,1286
0.5489,-9.8975,1287
-2.1116,-9.9526,1288
-0.0665,-9.8961,1289
0.1685,-10.2764,1290
-1.5238,-9.8944,1291
-2.5767,-9.771,1292
-1.7761,-9.9266,1293
2.2076,-9.8375,1294
5.6719,-9.8357,1295
9.5452,-9.7245,1296
-1.851,-9.6545,1297
1.0716,-9.6445,1298
3.1671,-9.8006,1299
4.5155,-9.9118,1300
0.614,-9.8163,1301
1.4182,-9.7886,1302
0.0018,-9.7798,1303
-1.5909,-9.6488,1304
1.3515,-9.8814,1305
0.086,-9.8717,1306
4.3016,-9.7066,1307
-0.5063,-9.7436,1308
0.8358,-9.8339,1309
3.208,-9.8934,1310
9.853,-9.7951,1311
3.601,-9.8664,1312
3.6998,-9.8358,1313
8.0835,-9.8219,1314
1.2412,-9.7402,1315
0.2012,-9.717,1316
3.1933,-9.6982,1317
8.3988,-9.6777,1318
6.0369,-9.7707,1319
2.0245,-9.845,1320
9.5719,-9.8268,1321
1.911,-9.7987,1322
-0.5186,-9.8113,1323
-1.7706,-9.8001,1324
15.7412,-10.1293,1325
3.3627,-9.9068,1326
-0.4171,-9.7543,1327
8.8182,-9.7684,1328
20.6762,-9.9251,1329
4.3305,-9.7574,1330
4.693,-9.9761,1331
19.0572,-9.8513,1332
16.2589,-9.8527,1333
30.5301,-9.7915,1335
-1.4461,-9.7634,1336
2.9079,-9.9473,1337
21.6546,-10.0267,1338
5.9922,-9.814,1339
17.4616,-10.0177,1340
-1.0545,-9.805,1341
0.0888,-9.8809,1342
6.1881,-9.754,1343
3.6207,-10.0956,1344
3.746,-9.6831,1345
1.0421,-9.6866,1346
0.2523,-9.8188,1347
10.817,-9.7839,1348
-5.3426,-9.7735,1349
-0.1514,-9.771,1350
5.7404,-9.7683,1351
6.0197,-9.8573,1352
4.7133,-9.9155,1353
15.3078,-9.7037,1354
0.4606,-9.9204,1355
1.2051,-9.6661,1356
6.2027,-9.7587,1357
-6.5513,-9.7203,1358
4.2567,-9.6537,1359
1.5645,-9.7616,1360
-0.6755,-9.749,1361
0.9051,-9.7534,1362
-0.055,-9.7556,1363
0.4776,-9.7602,1364
0.4929,-9.7505,1365
0.4152,-9.7551,1366
0.0242,-9.7595,1367
0.1639,-9.7639,1368
-0.1155,-9.7581,1369
0.1793,-9.7648,1370
0.0399,-9.7639,1371
0.02,-9.7602,1372
0.1302,-9.7624,1373
0.084,-9.7619,1374
-0.0061,-9.7635,1375
0.0973,-9.7612,1376
-0.0712,-9.7611,1377
0.241,-9.7668,1378
0.1245,-9.7652,1379
-0.7762,-9.7481,1380
-0.9792,-9.7476,1381
0.2162,-9.7504,1382
1.3801,-9.7453,1383
-3.3394,-9.7287,1384
1.8178,-9.7113,1386
0.1866,-9.7709,1388
0.0193,-9.7669,1389
0.0384,-9.7708,1390
-0.1226,-9.7698,1391
0.2308,-9.7561,1392
-6.0632,-9.7073,1393
4.8197,-9.7033,1394
0.7089,-9.7605,1395
-0.0911,-9.7673,1396
-0.012,-9.7627,1397
-0.1298,-9.76,1398
-1.467,-9.6399,1399
-2.4686,-9.8602,1400
-0.0498,-9.9049,1401
4.4381,-9.9261,1402
-3.2015,-10.0354,1403
36.2039,-9.5764,1404
-7.1001,-9.4886,1405
9.1893,-9.799,1406
-4.9495,-9.792,1407
-2.8294,-9.6951,1408
-0.8751,-9.8878,1409
0.72,-9.8174,1410
-3.7476,-9.6899,1411
-0.2239,-9.9131,1412
-4.7658,-9.8114,1413
-0.6295,-8.8804,1414
-0.3882,-9.7276,1415
2.7354,-9.8058,1416
0.5323,-9.9092,1417
0.1561,-9.7951,1418
0.3365,-9.7975,1419
0.5778,-10.1708,1420
-0.3075,-9.5603,1421
-1.7601,-9.767,1422
1.1919,-9.8359,1423
-0.1204,-9.8598,1424
1.9881,-9.78,1425
-1.7718,-9.6923,1426
-0.1757,-9.8204,1427
-1.2129,-9.8009,1428
-0.1965,-9.8262,1429
-0.7432,-9.7528,1430
2.6247,-9.753,1431
-1.7079,-9.6798,1432
1.1227,-9.8574,1433
3.0091,-9.9161,1434
-0.0878,-9.7825,1435
-0.8526,-9.6525,1437
-0.9018,-9.7891,1438
1.5182,-9.7083,1439
-0.8452,-9.8077,1440
-0.4305,-9.8423,1441
-0.259,-9.7016,1442
0.0573,-9.7574,1443
1.0352,-9.7977,1444
-0.1195,-9.7666,1445
-0.4492,-9.7711,1446
2.1365,-9.8494,1447
0.3728,-9.8114,1448
1.1501,-9.8706,1449
0.7466,-9.7833,1450
1.2382,-9.8027,1451
0.9448,-9.7961,1452
-4.0036,-9.9788,1453
0.2086,-9.7158,1454
1.0867,-9.7448,1455
0.8331,-9.9207,1456
-0.0673,-9.7701,1457
0.4274,-9.8502,1458
0.8079,-9.6197,1459
-3.2914,-9.8215,1460
-0.6558,-9.8236,1461
-0.3624,-9.8702,1462
-1.1359,-9.8405,1463
5.4322,-9.8293,1464
-0.8461,-9.7306,1465
3.8807,-9.7832,1466
2.3254,-9.9583,1467
0.114,-9.8249,1468
-1.1611,-9.7548,1469
-1.5504,-9.5884,1470
-1.2265,-9.7255,1471
-3.5988,-9.8809,1472
0.3508,-9.6976,1473
3.6929,-9.9019,1474
-1.1329,-9.8253,1475
1.9671,-9.8287,1476
-0.3402,-9.7297,1477
1.3406,-9.803,1478
2.2003,-9.5456,1479
-3.9263,-9.8931,1480
1.952,-9.8004,1481
8.8731,-9.7856,1482
-0.949,-9.942,1483
-0.5929,-9.8608,1484
0.4483,-9.8756,1485
0.6758,-9.6079,1486
1.9234,-10.0784,1488
1.7356,-10.3664,1489
-1.5665,-10.1639,1490
-0.3338,-10.1463,1491
27.2837,-9.473,1492
6.4419,-10.039,1493
6.4778,-9.7527,1494
-5.296,-9.861,1495
0.4776,-9.8002,1496
-6.8042,-9.7212,1497
-1.2608,-9.4765,1498
-0.0689,-10.218,1499
1.2734,-7.9248,1500
-1.2364,-10.027,1501
-2.8309,-9.7861,1502
-2.8399,-9.3271,1503
-1.3631,-10.6754,1504
-0.524,-10.1117,1505
3.431,-9.7048,1506
-1.1999,-9.7861,1507
-1.0935,-9.8219,1508
1.3188,-9.8022,1509
1.9452,-9.7938,1510
-2.8795,-10.1037,1511
-0.4311,-10.1373,1512
2.3537,-9.7987,1513
-1.2366,-10.1994,1514
-2.2155,-9.9198,1515
1.5706,-9.853,1516
8.5199,-9.6472,1517
3.8551,-9.5619,1518
-2.9038,-9.764,1519
13.7044,-9.7148,1520
0.5472,-9.8376,1521
-1.5828,-9.716,1522
0.8194,-9.8035,1523
-6.4745,-9.8923,1524
-0.0539,-9.8704,1525
0.8095,-9.7483,1526
5.3934,-9.8685,1527
3.6538,-9.7469,1528
0.1553,-10.1196,1529
1.1504,-9.8465,1530
-5.2602,-9.9276,1531
2.9093,-9.7975,1532
2.6856,-9.8257,1533
-2.4739,-9.756,1534
1.9868,-9.7491,1535
-2.4583,-9.901,1536
-2.0408,-9.9408,1537
4.5007,-9.7232,1539
2.3569,-9.8436,1540
6.5023,-9.9724,1541
2.7277,-9.6661,1542
1.0898,-9.6146,1543
1.5521,-9.5347,1544
0.9485,-9.9358,1545
0.3546,-9.8343,1546
6.5046,-9.7091,1547
-1.6271,-9.8117,1548
0.9825,-9.776,1549
-3.3597,-9.6635,1550
1.2118,-9.8733,1551
-0.1149,-9.7706,1552
-0.6266,-9.8809,1553
3.2464,-9.5902,1554
-1.697,-9.5787,1555
0.2429,-9.8058,1556
-0.7055,-9.768,1557
1.6434,-9.8005,1558
0.1451,-9.829,1559
-0.8171,-9.933,1560
0.0517,-9.8148,1561
2.6637,-9.8436,1562
-0.4183,-10.5618,1563
0.5322,-10.3104,1564
2.3639,-9.7277,1565
0.7849,-9.7455,1566
-1.1827,-9.7764,1567
0.5927,-9.6844,1568
0.556,-9.9926,1569
0.7758,-10.0664,1570
-2.2941,-9.8384,1571
10.6711,-9.7003,1572
4.1341,-9.7039,1573
5.021,-10.0259,1574
0.0963,-9.7351,1575
1.3838,-9.8861,1576
0.1839,-9.9691,1577
0.748,-9.5082,1578
-0.9547,-7.9272,1579
9.3384,-9.8336,1580
-0.634,-9.5901,1581
3.815,-9.3551,1582
-0.244,-9.6382,1583
0.1261,-10.3666,1584
0.7173,-9.7648,1585
1.2049,-9.7918,1587
-0.02,-9.2301,1588
-2.0205,-9.1441,1589
1.0119,-9.5494,1590
-0.2445,-8.7848,1591
3.805,-9.5072,1592
1.4363,-9.5815,1593
4.7201,-9.677,1594
3.8073,-10.4718,1595
-0.2356,-9.742,1596
10.1505,-9.5016,1597
2.6616,-9.6002,1598
3.2924,-9.6586,1599
-1.0165,-9.8592,1600
2.1123,-9.7503,1601
-0.5188,-9.5661,1602
1.1959,-9.7261,1603
-0.1029,-9.6767,1604
-0.0756,-9.3002,1605
0.9734,-8.6478,1606
1.3416,-9.7347,1607
2.9599,-9.7958,1608
2.084,-8.5458,1609
1.9708,-8.9403,1610
-1.1277,-9.6558,1611
0.2989,-8.7562,1612
1.1126,-9.4964,1613
0.6642,-9.9048,1614
-0.8958,-9.3422,1615
2.9032,-9.8276,1616
1.9422,-9.5439,1617
1.2719,-9.7661,1618
-2.0122,-9.5798,1619
0.1627,-9.8832,1621
3.2592,-10.5502,1622
2.1239,-9.5382,1623
0.2181,-9.5035,1624
-0.1852,-9.7849,1625
1.2329,-9.7368,1626
-2.6899,-9.9154,1627
-2.8764,-9.7493,1628
2.8864,-9.7229,1629
-0.0798,-9.8503,1630
3.8702,-9.7385,1631
1.6579,-9.7991,1632
-1.3686,-9.7751,1633
-1.4648,-9.7595,1634
-1.2775,-9.7827,1635
0.634,-9.778,1636
0.679,-9.7885,1637
-0.5675,-9.7775,1638
-1.2306,-9.7499,1640
-0.8861,-9.7516,1641
0.4333,-9.7971,1642
0.549,-9.7901,1643
-1.248,-9.774,1644
-1.7613,-9.7618,1645
2.4523,-9.7375,1646
1.8628,-9.8106,1647
0.3398,-9.7901,1648
-0.2635,-9.7982,1649
0.5751,-9.7825,1650
0.1809,-9.7902,1651
0.565,-9.7864,1652
0.6162,-9.7889,1653
0.9078,-9.792,1654
0.378,-9.7898,1655
0.6103,-9.7908,1656
0.0238,-9.7984,1657
0.2237,-9.791,1658
-2.4108,-9.787,1659
-9.3803,-9.6416,1660
2.2159,-9.5744,1661
3.6041,-9.7301,1662
0.6168,-9.7444,1663
-3.0534,-9.6955,1664
-4.6492,-9.6557,1665
5.9405,-9.7924,1666
0.724,-9.8283,1667
1.0282,-9.7411,1668
