AYGX_mean,AZ_mean,timestamp
0.0311,-9.8628,0
0.0268,-9.8629,1
-3.5109,-9.8051,3
2.158,-9.8013,4
-0.7288,-9.8165,6
0.3223,-9.833,7
-1.5097,-9.8426,8
-0.0801,-9.7741,9
0.4152,-9.858,10
-1.2969,-9.8574,11
-1.0802,-9.7942,13
-0.4062,-9.7762,14
2.655,-9.8066,15
-3.653,-9.8123,16
3.2629,-9.8093,17
0.8819,-9.868,18
0.679,-9.8666,19
-26.5171,-9.6233,20
-28.3239,-9.4059,21
37.8324,-9.4986,23
1.8299,-9.8784,24
-0.5205,-9.8074,25
-1.8379,-9.8928,26
-0.6737,-9.779,27
0.1973,-10.0422,29
-1.3112,-9.8822,30
2.0359,-9.9334,31
3.2806,-9.7454,32
7.5873,-9.8991,33
5.8878,-9.8039,34
-0.0009,-9.8044,35
6.8596,-10.8281,36
3.7838,-9.996,38
3.9321,-9.6683,39
0.6568,-10.1314,40
0.7521,-10.0309,41
9.482,-9.7984,42
4.0585,-9.6807,43
-5.1954,-9.85,44
-5.2698,-9.7379,45
0.6323,-9.738,47
-0.2855,-9.7467,48
-1.6392,-9.7619,49
-2.7639,-9.7595,50
2.0995,-9.76,51
-2.8655,-9.7671,53
-12.1072,-9.6449,54
28.9371,-9.5391,55
-1.897,-10.377,56
-1.3759,-9.8337,57
-1.6453,-9.2693,58
-0.0034,-10.0106,59
-0.0393,-8.8549,60
1.4352,-9.7413,61
-2.0523,-10.2747,63
1.6739,-9.9984,64
3.5694,-10.2265,65
3.7155,-9.3573,66
12.3326,-9.5727,67
-0.0045,-9.8395,68
-0.0606,-9.5833,69
29.2586,-9.5088,70
32.4832,-10.6599,71
52.2649,-9.5879,72
2.541,-9.8969,74
8.9201,-9.6036,75
5.9959,-9.9943,76
0.4489,-9.7575,77
4.9347,-9.0931,78
-5.4212,-9.0427,79
3.726,-10.2566,80
3.8147,-10.2576,81
46.1568,-9.7688,82
0.6284,-9.4753,84
4.0584,-9.9858,85
38.7349,-10.1767,86
10.5969,-9.9278,87
0.6182,-10.0542,88
0.4524,-10.1829,89
6.1735,-9.7262,90
2.8497,-10.1407,91
20.5596,-9.6308,92
0.2123,-9.8665,94
-2.9251,-9.7923,95
-1.3274,-10.0309,96
20.1198,-10.0307,97
9.486,-9.9576,98
48.5993,-10.1674,99
27.2797,-9.2729,100
8.8343,-8.9322,101
0.2893,-9.9921,102
-0.1465,-10.2877,103
18.8006,-9.8222,104
10.6033,-9.8044,105
0.411,-10.0734,106
1.2516,-9.3415,107
1.9559,-8.5809,108
1.9243,-7.6254,109
4.1199,-9.3112,110
46.0509,-10.1651,111
1.9223,-10.3729,112
8.2809,-9.8687,113
-1.6907,-9.9858,114
10.7937,-10.0324,115
2.0833,-10.0415,116
3.6023,-10.0985,117
8.7615,-10.0052,118
6.6734,-10.2216,119
0.6211,-10.6109,120
5.1886,-9.8599,121
-0.0266,-9.6969,123
0.6107,-9.6907,124
23.932,-9.9203,125
98.0917,-10.7998,126
-0.5167,-9.9495,127
0.2007,-9.9094,128
-1.7735,-9.8694,129
2.8273,-9.9029,130
-0.731,-9.9871,132
1.7274,-9.9329,133
1.3608,-9.91,134
0.8059,-6.6861,135
4.4608,-9.9412,136
1.0015,-10.3318,137
-3.6039,-9.9177,138
2.2964,-9.607,139
1.1631,-9.9623,140
8.9398,-10.0208,141
-9.4978,-9.8707,143
7.1922,-9.8909,144
13.3376,-9.4121,145
6.6685,-9.8714,146
0.2494,-9.9498,148
3.4038,-10.173,149
2.7658,-10.005,150
7.8954,-9.5595,151
-0.4234,-9.7645,153
10.639,-9.971,154
2.8138,-9.7912,155
11.5592,-10.0524,156
-8.8746,-9.7911,157
7.1649,-9.3974,158
19.236,-9.7903,159
18.8941,-9.737,160
-0.4446,-9.7415,161
2.8582,-9.9194,163
-4.5887,-9.7527,164
16.6796,-9.7303,165
0.0914,-9.8791,166
-0.1102,-9.7595,167
4.9902,-9.6828,168
-1.4347,-9.914,169
0.3135,-9.7821,170
-4.5167,-9.8979,172
4.5667,-10.0182,173
8.8822,-9.8074,174
6.2761,-9.9293,175
12.9083,-9.7751,176
2.9563,-9.9515,178
1.5531,-9.6914,179
0.0136,-9.601,180
-16.4759,-9.9876,181
2.9322,-9.436,182
8.8269,-10.0215,183
-4.979,-9.9567,184
-2.6643,-10.1066,185
0.0104,-10.326,186
2.4769,-8.0683,188
2.9364,-9.6556,189
1.7478,-10.0882,190
2.3704,-9.837,191
14.8345,-9.7339,192
-2.2506,-9.7185,193
-0.0403,-10.0155,194
0.245,-9.9654,195
4.2676,-9.8268,196
8.5654,-10.2774,198
-11.8387,-8.8538,199
10.3551,-9.6952,200
-1.0767,-9.8102,201
-10.5658,-9.6977,202
13.8285,-9.7523,203
0.4541,-9.6966,204
1.9227,-9.3346,205
-4.6084,-9.6163,206
5.9185,-8.2561,208
-0.981,-9.7317,209
-1.0804,-9.7709,210
5.7609,-9.4532,211
1.7434,-9.9728,212
-0.2978,-9.9732,213
1.0235,-10.0378,214
0.2147,-9.9405,215
-0.2646,-9.9524,216
0.7279,-7.4025,218
0.3476,-9.372,219
4.9959,-9.7685,220
3.0851,-9.7584,221
0.9151,-9.4936,222
-0.199,-9.4548,223
0.5177,-9.9337,224
15.0609,-9.9687,225
-2.3428,-9.8519,226
11.8465,-9.5397,228
3.894,-9.9895,229
5.3627,-9.9578,230
5.795,-9.8319,231
0.0704,-9.7825,232
19.7837,-9.5172,233
0.2705,-10.1761,234
1.3881,-9.7826,235
-5.6779,-10.0913,236
4.5089,-9.7813,238
4.1445,-9.8253,239
0.169,-9.8671,240
1.821,-9.8935,241
9.1573,-10.0838,242
10.9414,-9.8867,243
7.2456,-10.1093,244
1.5073,-10.2678,245
10.5809,-9.9054,246
1.1765,-10.0726,248
2.7464,-9.8821,249
1.2673,-9.8679,250
-0.1796,-9.8806,251
-0.0942,-9.8897,252
-3.4672,-9.9306,253
0.1459,-9.8297,254
1.9944,-9.8454,255
2.4029,-9.8784,256
-1.0127,-9.9169,258
1.9815,-9.9687,259
0.8527,-9.8954,260
2.958,-9.9707,261
2.1296,-9.8667,262
2.1782,-9.986,263
0.3746,-9.9286,264
2.8487,-9.8697,265
-0.2399,-9.8171,266
0.9748,-9.9214,268
2.8347,-9.9593,269
0.7682,-10.0105,270
2.1727,-9.8646,271
-0.7222,-9.9483,272
0.7143,-9.8413,273
0.7912,-9.8556,274
5.9085,-9.8061,275
4.7734,-10.0533,276
1.3218,-9.9363,278
1.2541,-9.8655,279
2.9004,-9.8909,280
17.7364,-9.8513,281
4.9882,-10.5903,282
11.3146,-10.3458,283
8.1758,-9.897,284
3.3889,-9.744,285
6.2566,-9.8607,286
15.7746,-9.8976,288
4.4448,-9.9711,289
10.7073,-9.9803,290
47.908,-9.8403,291
6.7003,-9.4966,292
-2.5724,-9.9794,293
0.9547,-8.7568,294
-1.4068,-9.8457,295
7.9933,-8.4169,296
-2.1256,-9.6301,298
10.9265,-9.3932,299
1.8486,-9.8648,300
0.4652,-9.9358,301
2.4547,-9.9256,302
43.5635,-10.3438,304
3.5648,-10.0593,305
-1.1996,-9.9181,306
12.9942,-9.6228,308
4.9222,-9.9407,309
2.4584,-9.8195,310
-3.0767,-9.6573,311
-3.0124,-9.5528,312
-0.5132,-9.8698,313
4.456,-9.6759,314
-2.5194,-9.8874,315
0.8451,-9.8287,316
3.3204,-9.7199,318
1.4636,-9.7001,319
2.057,-9.6236,320
8.4704,-9.7394,321
-0.157,-9.9313,322
12.7757,-9.8471,323
8.2943,-9.9625,325
0.2461,-9.8139,326
8.7312,-9.9076,328
2.0703,-9.1729,329
-3.6196,-10.1281,330
-1.188,-10.0577,331
5.5888,-9.699,332
-0.8104,-10.0198,333
-0.6309,-10.4707,334
4.2936,-10.3871,335
4.6292,-9.1974,336
-7.2,-7.7741,338
8.561,-9.5046,339
0.3155,-9.8183,340
14.8348,-9.863,341
1.4622,-9.9264,342
-2.8701,-8.8784,343
7.8016,-9.6065,344
1.0802,-10.1574,345
2.4673,-10.0833,346
-0.3185,-10.1763,348
2.4747,-9.7979,349
0.5332,-10.0154,350
-1.8838,-9.7117,351
2.2059,-7.5025,352
-13.0022,-9.5343,353
6.8341,-9.4448,354
6.5744,-9.5738,355
1.1484,-10.1505,356
0.9434,-9.9155,358
1.6122,-9.9476,359
25.6874,-9.4443,360
9.4239,-10.3586,361
14.3298,-9.8766,362
-0.0065,-9.7621,363
17.0551,-9.5836,364
3.2776,-10.3826,365
0.1368,-9.9128,366
-0.9691,-10.1994,367
10.0784,-10.0926,368
20.245,-9.9529,369
4.1291,-9.8663,370
3.0268,-9.9712,371
6.0372,-10.1181,372
8.6963,-9.7955,373
5.6833,-10.1179,374
12.9081,-9.8053,375
0.2703,-9.6938,376
7.0414,-9.5847,378
-1.4466,-9.7797,379
-0.1595,-10.0394,380
7.9204,-9.9228,381
4.1156,-9.1501,382
6.2401,-10.1042,383
1.6227,-10.3171,384
2.579,-9.7485,385
-6.4728,-9.3152,386
2.9676,-9.5309,388
2.2086,-9.3525,389
4.0045,-9.9717,390
-0.3456,-9.7712,391
8.0795,-10.0438,392
-0.0933,-10.0049,393
1.7227,-9.9881,394
1.5545,-9.8448,395
4.7643,-7.7982,396
-6.7494,-9.9403,397
7.7087,-10.0885,398
5.2566,-9.8643,400
0.2188,-10.02,401
17.5492,-10.4967,402
10.6734,-10.2186,403
1.0147,-9.4401,404
3.8724,-10.136,405
3.197,-10.4196,406
-0.0507,-9.746,407
-0.0729,-10.1358,408
-0.5562,-10.1892,409
8.8736,-9.7579,410
-0.9034,-9.9487,411
2.7476,-9.8095,412
-1.3739,-9.7268,413
-2.2433,-9.8649,414
3.2829,-9.3262,415
-3.1399,-10.0721,416
-1.3803,-9.8535,417
6.931,-9.8687,418
3.0056,-9.9183,419
1.3156,-9.8241,420
4.364,-9.9264,421
-5.9747,-8.6843,422
3.4133,-10.0758,423
8.0772,-6.9069,424
6.8476,-9.8176,425
3.3747,-9.7832,426
11.4987,-9.8757,427
-2.8739,-9.8982,428
2.9792,-10.1216,429
2.1888,-9.9595,431
1.0232,-9.6741,432
-0.8561,-7.1013,433
-4.2573,-9.9375,434
-13.5223,-10.4579,435
1.4063,-6.4333,436
13.861,-10.0518,437
-16.8859,-9.7524,438
-6.773,-10.2973,439
-1.3106,-9.9735,440
-4.864,-9.8589,441
17.1432,-9.9426,443
11.8372,-9.9158,444
-1.0944,-9.9304,445
-0.9559,-6.7922,446
-2.9889,-8.4003,448
-7.6424,-9.8662,449
-14.0956,-9.4038,450
14.5261,-9.6524,454
6.3217,-10.6658,455
16.7152,-9.7462,456
5.3334,-9.6998,457
14.9101,-9.886,458
7.6848,-10.0279,459
4.0107,-9.8206,460
-1.3573,-10.0472,461
-4.4692,-9.7711,463
-1.7666,-9.8103,464
4.3865,-9.837,465
-0.3756,-9.6457,466
-1.0434,-10.4449,467
13.6145,-9.8776,468
11.9401,-9.7922,469
14.3606,-9.9146,470
-0.2753,-10.018,471
19.8877,-9.9311,473
0.0159,-9.9125,474
0.2403,-10.2211,475
-0.027,-9.9702,476
10.3063,-9.3654,477
2.5017,-10.1912,478
2.7853,-9.9122,479
0.5507,-9.946,480
1.5954,-10.3053,481
0.0995,-9.9193,483
1.6434,-9.8402,484
-1.7904,-10.4176,485
4.4792,-9.4496,486
0.27,-9.5792,487
2.642,-9.993,488
-1.4289,-9.8355,489
12.7919,-9.9425,490
0.3401,-10.3864,491
5.042,-9.7715,493
6.0857,-9.961,494
4.8859,-10.0879,495
-0.1352,-10.0289,496
7.6076,-9.7179,497
-0.4241,-9.9437,498
4.1878,-9.8888,499
2.862,-10.0185,500
10.7445,-10.0886,502
12.3142,-9.8637,503
0.3391,-9.8861,504
-2.4243,-9.8996,505
-0.6985,-10.0864,506
0.3118,-9.7854,508
0.7594,-9.9283,509
0.2937,-10.132,510
-0.2714,-10.9424,511
0.1893,-9.9368,512
1.668,-9.7333,513
5.643,-9.4507,514
4.7039,-9.7636,515
1.3515,-10.2795,516
1.9767,-9.7617,518
2.0962,-9.7198,519
-2.1482,-9.8169,520
2.2794,-9.9508,521
0.0588,-7.8257,522
18.45,-10.568,523
11.5184,-10.2926,524
12.1418,-9.9837,525
-0.4849,-8.1125,526
27.4883,-9.4386,528
-0.487,-9.8076,529
3.81,-9.8698,530
1.0074,-10.0685,531
13.2598,-9.9893,532
1.0377,-9.8783,533
-6.5462,-9.6989,534
19.0487,-9.7036,536
-5.0794,-9.5194,537
36.7022,-9.4769,538
-5.4204,-9.9053,539
-0.0706,-9.8467,540
0.9568,-9.8503,541
-0.5102,-9.8555,543
0.9309,-9.8463,544
0.9071,-9.8715,545
0.0061,-9.8283,546
-0.9645,-9.8115,547
2.0688,-9.6884,548
-1.2947,-9.9137,549
0.4706,-9.944,550
-1.1555,-9.9639,551
0.9993,-10.116,553
1.6722,-10.1076,554
2.104,-9.9333,555
11.719,-9.451,556
0.0615,-9.651,557
0.0048,-10.0242,558
1.0136,-10.7043,559
1.0608,-9.7181,560
-1.474,-9.5411,561
16.9278,-9.6503,563
5.3386,-10.0056,564
-0.7175,-9.8013,565
2.0741,-9.9454,566
0.7004,-10.348,567
4.753,-9.9637,569
11.3409,-9.5468,570
0.1488,-10.0249,571
1.0266,-9.6283,573
-1.4934,-9.8927,574
-0.3435,-9.931,575
12.3758,-9.8282,576
-0.377,-9.7712,577
1.5419,-9.8736,578
-2.8072,-10.5024,579
0.5026,-10.1662,580
7.6105,-10.7274,581
1.6338,-10.2762,583
2.9385,-9.3665,584
-3.4104,-10.0006,585
4.932,-9.9185,586
5.2032,-9.8303,587
0.5251,-9.6617,588
7.1786,-10.0752,589
-0.1093,-9.6244,590
19.0219,-9.6706,591
3.8537,-9.8551,593
2.5803,-9.6064,594
0.0391,-9.9337,595
2.0726,-9.5828,596
5.4412,-10.0804,597
-0.5921,-9.8953,598
1.2482,-10.0868,599
0.3538,-10.04,600
-0.9251,-10.0571,601
0.5671,-9.5563,603
7.5251,-9.9398,604
-1.6245,-9.6232,605
-2.932,-6.1034,606
-0.5984,-10.1009,607
4.7734,-9.489,608
8.9801,-9.8299,609
0.7523,-9.6972,610
9.9446,-9.5835,611
9.3623,-9.8081,613
6.6687,-9.5411,614
6.1949,-9.8288,615
-4.4305,-9.8051,616
-3.4351,-9.4552,617
25.7454,-9.5791,618
10.2689,-10.4399,619
0.1766,-9.8754,620
1.624,-9.5682,621
1.0745,-9.8663,623
2.057,-10.1041,624
0.4648,-9.8401,625
4.3059,-9.858,626
24.4223,-9.7417,627
20.5779,-9.8498,629
10.3257,-9.473,630
4.1452,-9.9083,631
0.1057,-9.8366,633
1.5958,-9.9121,634
0.3466,-10.0748,635
0.2244,-9.7872,636
-1.9916,-9.8161,637
-2.0111,-10.0289,638
3.1377,-9.7571,639
4.8044,-9.7384,640
1.7034,-9.974,641
0.2924,-9.8065,643
1.1368,-9.7904,644
0.9074,-9.9757,645
1.3907,-9.7632,646
1.6972,-9.5482,647
19.2238,-9.8765,648
9.907,-9.9235,649
1.5081,-9.5874,650
-2.1608,-9.4558,651
0.713,-10.0677,653
1.0279,-9.8855,654
2.476,-9.8796,655
-1.9562,-9.7748,656
-0.206,-10.0945,657
0.194,-9.5732,658
15.0018,-7.1498,659
0.7447,-9.7084,660
0.1083,-10.1561,661
3.1713,-9.8269,663
0.4061,-9.7772,664
2.5416,-10.0334,665
4.2037,-10.2952,666
0.142,-9.797,667
4.2106,-10.0686,668
15.4198,-9.7107,669
7.6904,-9.8231,670
-3.3253,-10.311,671
5.2261,-9.8399,673
3.4407,-9.89,674
12.184,-9.8029,675
0.3579,-9.6742,676
0.658,-9.9267,677
0.2219,-9.504,678
0.6049,-10.021,679
2.7189,-9.9351,680
-2.5096,-9.5811,681
1.7052,-9.7561,683
4.4613,-9.9136,684
-1.7475,-9.8278,685
2.0865,-10.1711,686
0.9032,-9.9906,687
1.5724,-9.5433,689
5.0838,-9.9267,690
-2.1066,-10.0927,691
-0.1177,-9.6037,693
2.7974,-9.9093,694
13.133,-10.3692,695
17.0408,-9.6781,696
1.5669,-9.6386,697
1.7932,-10.0705,698
-0.429,-9.904,699
0.741,-9.2902,700
-0.0329,-9.816,701
-0.0403,-9.9197,703
1.4585,-9.7818,704
1.4527,-9.999,705
0.1661,-9.8834,706
1.0994,-10.0919,707
0.067,-9.7456,710
0.1533,-9.7814,711
1.2985,-9.7842,713
0.1321,-9.9677,714
0.251,-8.5357,715
2.5618,-9.4842,716
0.6743,-10.0046,717
0.2189,-9.9765,718
2.7552,-10.2986,719
0.3273,-9.9005,720
0.8713,-8.5247,721
-0.6425,-10.1789,723
1.2397,-9.9419,724
1.996,-9.9262,725
-0.1025,-10.1124,726
12.0513,-8.9798,727
7.9148,-9.8103,728
0.8267,-9.635,729
0.5256,-9.8919,730
1.5161,-10.0304,731
1.6168,-9.7533,733
3.5492,-9.7189,734
4.4097,-9.6599,735
3.6553,-9.8327,736
-2.2365,-10.4701,737
1.1962,-10.672,738
0.3458,-10.5069,739
2.2876,-10.1117,740
3.864,-10.1126,741
0.5094,-9.8919,743
0.1261,-9.9506,744
-0.4833,-9.8095,745
0.4967,-9.8274,746
0.3323,-9.8472,747
1.6383,-10.1342,749
1.6217,-9.5307,750
-0.1342,-10.0822,751
3.8007,-9.5533,753
2.7699,-9.8895,754
3.2403,-9.9588,755
7.7414,-10.1252,756
1.6471,-10.2079,757
7.9934,-10.1568,758
0.1212,-9.7651,759
3.031,-9.9013,760
1.1182,-9.9546,761
3.0208,-9.6575,763
5.1327,-9.8947,764
0.3957,-9.9414,765
-0.6693,-9.9459,766
2.335,-10.1021,767
1.2967,-9.7033,768
-0.4957,-9.9119,769
0.4989,-9.8693,770
-1.0946,-10.3177,771
11.7583,-9.4747,773
4.6103,-9.9503,774
24.1992,-9.4909,775
-1.3524,-10.021,776
2.2695,-10.0525,777
0.7877,-9.8102,778
3.1586,-9.7046,779
4.5987,-9.7485,780
18.1431,-9.7455,781
22.0194,-9.6083,783
27.6017,-9.9415,784
3.8692,-10.0281,785
8.1647,-10.0661,786
2.3411,-10.0388,787
9.5618,-9.8884,788
0.6869,-9.8209,789
2.9476,-9.7615,790
4.0203,-10.5301,791
13.2356,-10.2406,793
28.742,-10.3573,794
15.7954,-10.9603,795
41.8456,-9.6959,796
14.103,-9.696,797
3.4485,-9.8452,798
26.1152,-9.884,799
-1.1135,-10.2067,800
8.0143,-10.499,801
-0.4563,-10.8107,803
3.1395,-9.9124,804
16.9766,-9.9226,805
-1.4105,-9.7247,806
3.1326,-9.0698,807
-6.6348,-9.7305,809
0.052,-9.9313,810
-1.164,-10.0247,811
-0.5142,-9.4488,813
0.1939,-9.7495,814
-0.0369,-7.9418,815
1.3419,-6.3274,816
-1.9869,-9.8766,817
0.8273,-9.7854,818
20.603,-9.7582,819
77.8656,-10.1447,820
41.3054,-10.5452,821
71.5194,-10.248,823
3.3174,-10.0094,824
6.173,-10.0633,825
3.0252,-9.9121,826
0.6041,-9.988,827
2.4332,-9.8751,828
-0.0959,-9.8782,829
12.3712,-10.0251,830
-3.1294,-9.8869,831
1.5074,-10.1314,833
1.308,-9.7581,834
28.8179,-9.8591,835
24.426,-9.9133,836
3.7701,-10.0051,837
3.1613,-10.111,838
-0.4914,-9.7981,839
2.9644,-10.3487,840
-2.5553,-9.8909,841
2.2338,-10.2749,843
8.416,-9.9936,844
16.3471,-10.0113,845
-2.361,-9.5744,846
1.2385,-9.6817,847
-1.3928,-9.6131,848
5.9272,-9.7139,849
5.4222,-9.6117,853
1.8608,-9.8512,854
6.5719,-9.7862,855
-2.7281,-9.5466,856
11.3108,-9.7558,857
-0.6374,-9.2344,858
0.8797,-10.0884,859
0.5423,-10.2689,860
8.4621,-10.4543,861
13.6268,-9.8856,863
11.5467,-9.7136,864
1.0824,-10.3191,865
25.7494,-10.3881,866
3.2132,-10.1036,867
15.1245,-10.0157,869
2.7982,-9.6245,870
44.9967,-10.3673,871
-1.6302,-9.8892,873
3.8599,-9.86,874
-1.1746,-9.6353,875
32.5527,-10.0063,876
41.8924,-10.7922,877
8.5965,-9.2748,878
-0.0047,-10.2257,879
6.4593,-9.8461,880
14.2418,-9.9393,881
7.4072,-9.9927,883
16.6843,-9.9111,884
83.1058,-9.5742,885
-4.5341,-8.3419,886
4.3767,-9.9843,887
54.63,-9.8346,888
16.0145,-9.8589,889
9.5942,-9.7376,890
5.063,-10.0438,891
4.5896,-9.7456,893
2.4088,-9.4195,894
1.0563,-9.8694,895
5.1931,-8.306,896
5.8205,-9.999,897
-1.8088,-9.7505,898
9.1167,-9.8959,899
36.3063,-9.9571,900
33.232,-9.6687,901
31.0288,-10.2471,903
9.3708,-9.8948,904
15.825,-9.4911,905
-4.9647,-10.4071,906
-1.615,-9.8565,907
-0.0231,-9.998,908
5.984,-9.982,909
4.8678,-9.9062,910
0.1193,-9.6172,911
-1.6003,-9.5507,913
2.4999,-9.7739,914
-1.7656,-10.0006,915
4.0532,-5.4538,916
-4.3891,-9.8927,917
27.8808,-9.645,918
97.479,-9.3787,919
13.3411,-9.7023,920
0.9897,-10.3126,921
4.7562,-10.2951,923
1.8191,-10.232,924
1.1351,-9.595,925
17.5717,-10.1132,926
32.3188,-10.0986,927
30.8323,-10.3077,929
0.6901,-10.1398,930
15.4693,-10.1657,931
8.0991,-10.1101,933
6.8489,-9.7265,934
-1.2068,-9.8804,935
0.6568,-11.0869,936
8.7938,-9.0731,937
14.4132,-10.0182,938
4.7689,-9.7089,939
4.2221,-9.8273,940
0.5812,-10.1125,941
1.952,-9.843,943
0.4807,-9.8974,944
0.0975,-9.6551,945
3.2618,-9.8618,946
-2.7453,-9.4973,947
16.6147,-9.9113,948
5.7801,-9.8526,949
2.6789,-9.8453,950
1.2743,-9.6453,951
8.4111,-10.067,953
0.3651,-9.7881,954
1.5065,-10.0386,955
-2.4482,-9.8859,956
-1.0091,-9.8747,957
1.2012,-8.7748,958
2.3837,-7.8752,959
1.891,-10.1443,960
4.417,-9.7824,961
2.5361,-9.8981,963
-0.4259,-9.8829,964
0.0344,-10.0152,965
3.2304,-9.4891,966
14.9622,-9.996,967
0.7139,-10.3476,968
7.4858,-10.3708,969
7.2839,-9.8918,970
-0.3693,-9.1794,971
2.1667,-9.6776,973
1.6981,-9.9519,974
0.4049,-10.5535,975
1.3937,-9.8014,976
8.2525,-10.2769,977
7.8017,-9.9727,978
15.7946,-9.7913,979
3.145,-9.7892,980
-0.4562,-9.7517,981
5.2132,-10.1706,983
2.1223,-9.9456,984
4.791,-10.3135,985
15.9627,-10.5827,986
9.1093,-10.7754,987
2.4735,-10.4874,989
8.5846,-9.8809,990
0.3301,-9.7016,991
9.6385,-9.8909,993
4.1581,-9.884,994
0.0457,-10.0564,995
5.7171,-9.9866,996
8.8168,-9.9143,997
3.3063,-10.0789,998
4.2337,-9.9112,999
-0.1386,-9.9698,1000
6.8368,-9.6986,1001
0.293,-10.0432,1003
-0.3855,-9.8633,1004
-0.3868,-9.8769,1005
-0.4871,-9.846,1006
-1.8582,-9.8855,1007
-9.6183,-9.7045,1008
5.2144,-9.7532,1009
0.0507,-9.8503,1010
-3.1936,-9.7987,1011
2.146,-9.8185,1013
-0.2045,-9.8439,1014
-0.8844,-9.9088,1015
5.9426,-9.8469,1016
-1.2906,-10.1496,1017
0.6976,-9.9963,1018
24.823,-9.5699,1019
14.9546,-9.8997,1020
-1.1938,-10.1888,1021
7.9724,-9.9867,1023
0.3936,-9.9057,1024
-1.0493,-9.8098,1025
0.3187,-10.1032,1026
15.5871,-10.4475,1027
-1.961,-10.3552,1028
14.5639,-10.5707,1029
-1.1854,-10.2752,1030
0.3674,-9.6329,1031
0.2162,-9.8779,1033
0.2227,-9.8653,1034
0.3619,-9.7878,1035
-0.1223,-9.8513,1036
-0.1776,-9.8938,1037
-1.2791,-9.9047,1038
-0.5638,-10.1035,1039
4.9476,-10.1427,1040
15.5327,-9.8249,1041
11.1314,-10.2884,1043
-1.0445,-10.2479,1044
8.9111,-9.9661,1045
0.5207,-9.8626,1046
5.1141,-9.6152,1047
13.7829,-9.9937,1048
28.7199,-9.9736,1050
-9.0351,-9.7938,1051
-15.4141,-9.7113,1054
-27.9597,-9.2094,1055
32.3181,-9.4209,1056
1.074,-9.7582,1057
11.0225,-9.7419,1058
-2.404,-9.8384,1059
-0.1545,-9.8747,1060
1.3663,-9.8178,1061
5.0429,-9.7834,1063
0.494,-9.7856,1064
3.2324,-9.7674,1065
-0.0623,-9.7997,1066
1.156,-9.7964,1067
6.7729,-9.8269,1068
-22.3173,-9.8071,1069
2.3136,-9.823,1070
0.7401,-9.861,1071
1.0662,-9.84,1072
-0.4463,-9.8592,1073
-0.3726,-9.8649,1074
0.1035,-9.8661,1076
-2.8143,-9.8508,1077
0.2482,-9.7173,1078
4.172,-9.8128,1079
1.6755,-9.807,1080
1.3077,-9.8502,1081
-0.4516,-9.9007,1083
0.9582,-9.8891,1084
2.236,-9.811,1085
8.1414,-9.8442,1086
13.4267,-9.9224,1087
3.5965,-9.7389,1088
2.347,-9.57,1089
10.9694,-9.4154,1090
2.3019,-9.8334,1091
14.74,-9.8154,1093
7.4907,-9.6888,1094
-4.09,-9.8435,1095
-0.9073,-10.14,1096
27.3538,-9.9243,1097
21.2016,-8.8285,1098
0.774,-9.6795,1099
4.4077,-9.9905,1100
4.0672,-9.8747,1101
2.7468,-9.7715,1103
2.6548,-9.941,1104
1.9038,-9.8702,1105
0.0217,-9.7285,1106
14.2724,-9.5523,1107
2.1746,-10.0902,1108
1.1152,-9.8492,1109
1.7613,-9.9331,1110
0.8315,-9.8222,1111
-0.022,-9.7722,1113
0.4405,-9.9273,1114
-3.5301,-10.0181,1115
-1.4276,-9.786,1116
4.6289,-10.0014,1117
-1.1413,-10.6891,1118
2.0597,-10.1156,1119
25.8085,-9.8048,1120
-3.1718,-9.8721,1121
14.5991,-10.1305,1123
2.0791,-9.8532,1124
-0.0692,-9.7955,1125
1.5305,-9.7594,1126
1.8565,-10.1261,1127
-17.365,-10.458,1128
4.271,-9.8685,1129
2.9992,-9.7641,1130
1.6677,-9.8646,1131
6.3185,-9.8268,1133
1.0505,-9.851,1134
-0.0194,-9.8323,1135
-0.6181,-9.872,1136
0.6438,-9.7233,1137
0.8343,-9.9792,1138
1.7917,-9.8628,1139
0.5944,-9.7847,1140
-0.2887,-10.0946,1141
3.8991,-9.8698,1143
0.7006,-9.8864,1144
2.534,-9.9074,1145
0.9247,-9.7523,1146
0.8062,-9.9632,1147
-1.9921,-9.9658,1148
5.3863,-9.9786,1149
39.2986,-10.0109,1150
12.9514,-10.0044,1151
-0.324,-9.7159,1153
15.8393,-10.1325,1154
9.1871,-9.7474,1155
3.7087,-10.2257,1156
-2.8378,-10.0446,1157
-0.367,-10.0105,1158
1.2792,-9.8929,1159
5.1521,-10.2014,1160
10.4408,-9.5629,1161
4.0896,-9.6582,1163
0.482,-9.77,1164
-1.6937,-9.6874,1165
-0.2752,-9.7654,1166
-0.7624,-10.0037,1167
1.9877,-9.9755,1168
9.6174,-9.9131,1170
0.6197,-8.9231,1171
-7.1765,-9.5696,1173
-2.8479,-9.5909,1175
6.844,-9.6512,1176
-2.0268,-10.0533,1177
-3.8719,-9.8219,1178
2.1172,-10.384,1179
-0.0446,-9.7288,1180
0.2154,-9.9169,1181
0.7493,-9.6926,1183
1.2817,-9.8457,1184
0.7746,-9.9139,1185
1.1888,-10.1852,1186
16.9744,-9.7136,1187
1.9129,-10.0712,1188
2.7294,-9.8653,1189
22.3371,-10.3582,1190
-1.8597,-9.9269,1191
0.7413,-9.9946,1193
5.1413,-9.7917,1194
3.4456,-9.8981,1195
45.6829,-9.4926,1196
14.7638,-6.8341,1197
-4.1286,-9.3391,1198
-0.1398,-9.4466,1199
1.5643,-10.0145,1200
-0.7227,-9.71,1201
-3.7849,-9.9311,1203
13.7344,-9.839,1204
6.6075,-10.0294,1205
7.6028,-9.8613,1206
48.9974,-9.6443,1207
16.6482,-10.2206,1208
4.9492,-9.4676,1209
7.0204,-9.986,1210
33.0017,-9.9226,1211
10.6709,-9.9681,1213
16.8159,-10.0872,1214
22.2315,-10.0457,1215
6.2825,-10.2743,1216
-7.9926,-10.5904,1217
23.7111,-10.0675,1218
11.7326,-9.8814,1219
-0.31,-8.8312,1220
18.5101,-9.9175,1221
9.1697,-10.1933,1223
5.3378,-10.0216,1224
-1.0271,-8.3504,1225
7.1497,-10.1044,1226
4.9035,-9.8392,1227
4.0516,-9.8992,1228
13.6557,-9.7506,1230
-1.8749,-9.6971,1231
1.5658,-9.7725,1233
4.9733,-9.8561,1234
0.4248,-10.158,1235
3.59,-9.9533,1236
-0.0965,-8.615,1237
0.4353,-8.3223,1238
-0.1466,-9.6342,1239
2.8573,-9.808,1240
0.1012,-9.6705,1241
1.3553,-9.9353,1243
1.0961,-9.9068,1244
-0.0269,-9.8498,1245
2.0817,-10.1319,1246
2.6242,-9.8974,1247
15.7403,-10.2798,1248
6.7915,-10.0813,1249
1.377,-9.9235,1250
9.2801,-10.1785,1251
21.2066,-9.8797,1253
58.2581,-10.9461,1254
-2.2448,-9.6035,1255
30.1963,-9.6821,1256
-13.0184,-10.5355,1257
0.0158,-9.8665,1258
2.94,-10.1506,1259
13.05,-9.8197,1260
17.3038,-9.4576,1261
10.0774,-9.7313,1263
0.5928,-9.6881,1264
5.2239,-9.9828,1265
0.6641,-9.7755,1266
7.8314,-10.0361,1267
5.4282,-10.3222,1268
-0.67,-9.9604,1269
-18.1497,-9.9336,1270
50.6566,-9.6858,1271
27.4633,-9.9131,1273
4.6834,-9.9109,1274
1.5122,-10.1421,1275
-0.7242,-9.9577,1276
23.0027,-10.0714,1277
-0.3465,-9.6911,1278
5.6007,-9.9752,1279
-0.6422,-10.0218,1280
-2.7122,-10.1372,1281
-3.0597,-9.8169,1283
13.1275,-9.4919,1284
0.2322,-9.4492,1285
-2.6267,-9.7766,1286
8.5127,-9.2986,1287
-2.0711,-9.1845,1288
10.3765,-9.6825,1290
2.0209,-9.76,1291
1.4056,-9.7801,1293
1.615,-9.9405,1294
1.1499,-10.0635,1295
-0.1028,-10.0824,1296
1.2939,-10.0426,1297
2.7756,-9.6954,1298
3.8816,-10.057,1299
6.5933,-9.8388,1300
0.7707,-9.8437,1301
1.0406,-10.0777,1303
3.0877,-9.9343,1304
12.0345,-9.9083,1305
3.217,-10.1593,1306
-0.0418,-9.8348,1307
1.9639,-9.2818,1308
0.601,-9.7481,1309
7.3041,-10.1139,1310
0.5661,-9.9057,1311
6.8795,-9.8036,1313
0.2863,-9.8575,1314
2.6624,-10.0204,1315
1.5405,-10.1992,1316
-0.1261,-9.8968,1317
0.8627,-9.9046,1318
-1.7384,-10.0961,1319
1.1917,-9.8624,1320
-1.3991,-9.7579,1321
2.1729,-9.2451,1323
8.0834,-9.8617,1324
1.454,-9.848,1325
19.3248,-9.9773,1326
5.8463,-9.9611,1327
8.9355,-9.6759,1328
1.8187,-9.5204,1329
3.2471,-10.0824,1330
8.9458,-9.6329,1331
7.5637,-8.4133,1333
28.0163,-8.4271,1334
-0.1561,-9.2885,1335
-8.6126,-9.5192,1336
-4.6687,-9.6651,1337
-3.4024,-9.9484,1338
15.7871,-10.0187,1339
3.626,-6.4519,1340
-8.3171,-10.3908,1341
-3.5569,-10.0851,1343
7.5331,-9.888,1344
3.0847,-9.6255,1345
-0.0651,-9.8917,1346
0.168,-10.3626,1347
-1.3237,-9.508,1348
1.012,-9.1248,1350
9.9621,-7.638,1351
14.6858,-8.7616,1353
4.1912,-9.9918,1354
-0.1835,-10.0702,1355
-4.2794,-9.6252,1356
2.2636,-9.6379,1357
0.2194,-9.85,1358
3.1659,-10.0677,1359
8.1272,-9.8683,1360
7.1211,-10.8385,1361
46.583,-9.6685,1363
3.2433,-9.9532,1364
-0.4329,-9.6997,1365
2.3048,-10.0014,1366
-0.0531,-9.7412,1367
0.6169,-9.8047,1368
2.2979,-9.7791,1369
5.5316,-9.7941,1370
2.6032,-10.1224,1371
0.3434,-11.0346,1373
16.1056,-9.9884,1374
2.4342,-10.1182,1375
-1.0603,-9.8792,1376
9.1825,-10.4218,1377
18.0513,-9.7509,1378
0.5773,-10.631,1379
-3.9685,-10.1195,1380
12.6237,-9.1217,1381
-3.7738,-10.174,1383
8.0131,-9.7654,1384
2.9198,-9.9046,1385
6.4175,-10.4989,1386
4.0669,-9.8179,1387
-0.215,-9.9242,1388
33.6575,-10.1072,1389
11.9424,-8.9827,1390
-3.372,-10.0158,1391
-6.868,-9.6957,1393
6.6106,-9.6791,1394
13.8198,-11.0819,1395
29.8005,-9.399,1396
12.4699,-9.778,1397
5.1973,-10.5821,1398
-3.7281,-10.2654,1399
10.5082,-9.6766,1400
0.5935,-9.8059,1401
-1.4398,-9.854,1403
10.091,-9.9516,1404
14.3438,-10.0593,1405
-1.3581,-10.0752,1406
26.1889,-9.2238,1407
4.6923,-9.8762,1408
-0.2602,-9.716,1410
3.773,-9.9465,1411
11.4404,-9.8505,1413
14.7467,-10.0041,1414
-1.7784,-9.9978,1415
-0.5183,-9.9469,1416
0.979,-9.5459,1417
-1.0015,-9.7955,1418
0.9517,-9.895,1419
0.082,-9.8794,1420
0.0526,-9.8947,1421
1.3644,-9.8772,1423
18.0775,-10.0745,1425
-0.5983,-9.7413,1426
0.3639,-9.8897,1427
3.0877,-9.9458,1428
0.3546,-9.9717,1429
0.3015,-9.9431,1430
-0.3693,-9.9518,1431
13.6246,-10.1852,1433
7.0316,-9.941,1434
10.9948,-9.9003,1435
3.7752,-9.8994,1436
-15.4691,-9.704,1437
-0.1152,-9.8959,1438
-4.1251,-9.9702,1439
0.9548,-9.6759,1440
-5.2202,-9.8811,1441
2.9486,-10.3956,1442
-2.4746,-9.8633,1443
-0.1178,-9.8491,1444
-3.0873,-9.7566,1445
3.1138,-9.8294,1446
1.9116,-9.8423,1447
-1.2797,-9.8503,1448
0.0033,-9.8505,1449
2.6538,-9.8616,1450
-0.1627,-9.8527,1451
-1.0223,-9.7992,1452
-0.0623,-9.8281,1453
1.616,-9.8761,1454
0.0257,-9.8244,1455
0.5569,-9.8584,1456
0.4661,-9.9244,1457
0.0154,-9.8759,1458
0.0185,-9.8741,1459
-1.644,-9.8502,1460
-0.3631,-9.8712,1461
-0.1003,-9.8732,1463
-0.0234,-9.8768,1464
-3.2158,-9.9744,1465
1.196,-9.9297,1466
-0.1974,-9.8936,1467
0.2975,-9.825,1468
0.0092,-9.8681,1470
0.0756,-9.8812,1471
0.0831,-9.8757,1473
-0.0605,-9.8738,1474
0.0845,-9.8731,1475
0.0758,-9.8726,1476
0.099,-9.8735,1477
-0.112,-9.8719,1478
0.1668,-9.8726,1479
0.0364,-9.8742,1480
0.121,-9.8724,1481
0.0587,-9.874,1483
0.0451,-9.8686,1484
-0.0051,-9.8743,1485
-0.0047,-9.8748,1486
0.0547,-9.8737,1487
-0.1932,-9.8704,1488
0.2274,-9.8716,1489
-0.2124,-9.8734,1490
0.2996,-9.8726,1491
-0.322,-9.8662,1493
0.0034,-9.8755,1494
0.1197,-9.8634,1495
0.1264,-9.8834,1496
0.0699,-9.8704,1497
0.0261,-9.8814,1498
0.0006,-9.8733,1499
0.1245,-9.8781,1500
-0.3245,-9.8811,1501
-0.0175,-9.8751,1502
0.0015,-9.8722,1504
-0.0814,-9.8647,1505
0.4725,-9.8792,1506
0.124,-9.8757,1507
0.0752,-9.8738,1508
-0.0342,-9.8693,1509
-0.1763,-9.8687,1510
0.1229,-9.8728,1511
0.0692,-9.8694,1513
0.1161,-9.8709,1514
