AYGX_mean,AZ_mean,timestamp
0.8633,-9.6773,0
0.8653,-9.6755,1
0.8818,-9.676,2
0.8567,-9.6761,3
0.8715,-9.6769,4
0.8548,-9.6762,5
0.8659,-9.6766,6
16.6335,-9.6632,7
-2.4599,-9.7256,8
-17.0269,-9.7012,9
-212.3937,-8.9535,10
-10.8556,-6.5445,11
-80.6122,-8.5794,13
14.1979,-9.7053,14
-4.1787,-9.8345,15
2.6954,-9.95,16
6.4415,-10.0873,17
7.1234,-10.0994,18
3.3821,-9.8844,19
34.5578,-9.9764,20
