AYGX_mean,AZ_mean,timestamp
-0.1144,-9.7515,469
-0.2077,-9.7441,470
0.3955,-9.7494,471
0.1512,-9.7524,472
0.0601,-9.7571,473
-0.3697,-9.7473,474
0.4499,-9.7404,475
0.1268,-9.7473,476
0.3415,-9.7533,477
0.203,-9.7607,478
0.0782,-9.7642,479
0.1071,-9.7695,480
-0.2596,-9.7643,482
0.5098,-9.7665,483
0.1704,-9.7781,484
-0.3537,-9.7641,485
-0.733,-9.7618,487
0.9428,-9.7424,488
-1.1405,-9.751,489
-0.1179,-9.734,490
0.3802,-9.7431,492
0.2546,-9.7333,493
1.169,-9.7453,494
-0.324,-9.7425,495
0.4089,-9.7527,497
-0.2434,-9.7649,498
0.3431,-9.7593,499
-0.2904,-9.7681,500
-0.1025,-9.7642,502
-0.039,-9.7809,503
-0.1506,-9.7721,504
0.208,-9.7784,505
-0.2668,-9.7739,507
0.3947,-9.7748,508
-0.6212,-9.7823,509
-0.5779,-9.7595,510
-0.3019,-9.7616,512
-0.0749,-9.7501,513
9.7905,-9.7599,514
-0.5979,-9.8163,515
-0.0045,-9.8134,517
0.016,-9.811,518
-0.0461,-9.8113,519
0.0891,-9.8138,520
-0.2188,-9.8112,522
0.4414,-9.8148,523
0.3922,-9.8024,524
0.6897,-9.7562,525
-0.3863,-9.8766,527
0.549,-10.0066,528
0.8264,-9.9456,529
3.1004,-10.1415,530
1.9264,-9.977,532
11.7353,-9.8702,533
-0.9289,-9.9654,534
-11.73,-9.4798,535
0.8683,-9.7553,537
-0.0392,-9.6315,538
0.0203,-9.843,539
1.4146,-9.8182,540
0.0669,-9.7838,542
-0.126,-9.9851,543
0.0055,-10.0137,544
0.3797,-9.9097,545
0.3424,-9.8192,547
0.2087,-9.7956,548
5.2148,-9.9504,549
1.6179,-10.0002,550
9.8566,-10.0016,552
2.4574,-9.758,553
-0.4488,-9.8351,554
0.3058,-9.8881,555
0.0556,-9.7716,557
9.9054,-10.0791,558
4.1531,-9.957,559
0.7703,-9.9836,560
2.5402,-9.8631,562
1.2,-9.1204,563
-0.4247,-9.9111,564
0.0031,-8.8355,565
2.6899,-9.8734,567
10.7236,-9.798,568
3.905,-9.6191,569
-0.8776,-10.7576,571
0.5962,-9.896,572
-0.2589,-9.8777,573
0.9172,-10.3374,574
0.1285,-9.8615,575
0.032,-9.9134,576
-2.0514,-9.7275,577
-5.6788,-9.8872,578
5.5003,-9.8109,579
-19.5954,-9.6567,580
36.3496,-9.9828,581
-7.0494,-9.9198,583
6.5145,-9.2867,584
-0.898,-9.8154,585
-0.2525,-9.7526,587
-3.7685,-9.7688,588
0.3283,-9.7113,589
0.8314,-9.7541,590
2.8114,-9.7817,591
-4.5147,-9.7542,592
-7.3416,-9.5501,593
5.973,-9.6,594
15.788,-9.5364,595
1.9042,-9.9978,596
-4.8067,-9.9389,597
4.3797,-9.6857,598
1.4201,-9.7855,599
-11.1471,-9.8192,600
-0.3541,-9.8168,601
0.5848,-9.7636,602
-3.7081,-9.9144,603
-28.2067,-9.5652,604
1.517,-9.6922,605
-1.0658,-9.7099,607
-0.0169,-9.7236,608
0.7995,-9.7193,609
-0.3018,-9.7139,610
20.1575,-9.6411,611
-114.3141,-7.8365,612
-2.5456,-9.7514,614
2.725,-9.7803,615
-0.8931,-9.8384,616
-0.9001,-9.786,617
-1.4818,-9.8995,618
-2.4859,-9.8951,619
-3.8103,-9.7818,620
-0.3775,-9.779,622
-0.1423,-9.7832,623
-1.7033,-9.7742,624
-3.312,-9.7345,625
-1.4272,-9.6487,627
0.7925,-9.7328,628
0.5137,-9.7821,629
-1.6006,-9.6085,630
0.1342,-9.7206,632
0.8011,-9.7338,633
5.3419,-9.761,634
-1.0372,-9.8232,635
0.0256,-9.7872,637
0.0269,-9.7891,638
-0.0043,-9.781,640
0.4074,-9.7874,642
0.592,-9.8002,643
-0.1289,-9.791,644
0.2054,-9.7979,645
-0.4169,-9.7998,647
