AYGX_mean,AZ_mean,timestamp
-0.9458,-9.7764,86
8.4574,-10.1231,87
5.9552,-9.6711,88
1.5823,-9.8175,89
1.039,-9.7931,90
1.2604,-9.8074,91
0.1251,-10.3352,92
1.244,-9.8249,93
-3.1741,-9.8313,94
-0.1226,-9.8577,95
15.1745,-9.7304,96
-1.8849,-10.22,97
-2.0,-9.8563,98
-1.617,-9.8279,99
-1.1353,-10.0779,100
2.1815,-9.0252,101
0.5549,-9.851,102
3.654,-9.7359,103
-0.3488,-9.8074,104
-0.1121,-9.9663,105
1.4734,-9.2349,106
