AYGX_mean,AZ_mean,timestamp
0.9287,-9.5613,692
-0.0546,-9.5543,693
0.9611,-9.9513,694
0.9421,-9.4126,695
1.2343,-9.8319,696
0.5183,-9.8471,697
1.0842,-9.7766,698
1.1326,-9.6763,699
0.1862,-9.8112,700
1.5924,-10.0446,701
0.331,-9.69,702
0.3514,-10.3403,703
-0.2271,-9.2732,704
1.1787,-9.9328,705
0.1457,-9.9509,706
-0.1991,-9.766,707
1.211,-9.6416,708
0.4667,-10.0512,709
1.9716,-10.1073,710
20.6695,-9.4603,711
