AYGX_mean,AZ_mean,timestamp
7.3923,-9.675,544
-121.9919,-0.0402,545
-5.6784,0.1895,546
-17.752,0.2438,547
-17.8226,0.2444,548
-17.7041,0.2442,550
-17.8174,0.2432,551
123.0608,0.4758,552
108.1822,-4.761,553
135.1733,-5.937,554
103.8323,-9.1133,555
-0.038,-9.9017,556
-0.2375,-9.8951,557
2.7275,-9.8781,558
-3.4362,-9.9456,560
-3.3134,-9.7096,562
-7.1326,-9.7509,563
-0.3733,-9.9447,564
