AYGX_mean,AZ_mean,timestamp
3.2137,-10.0052,1675
-0.6353,-10.1315,1676
2.9155,-9.7309,1677
-0.9484,-9.9443,1678
-1.5277,-9.9855,1679
-2.0141,-10.145,1681
10.2899,-10.0285,1682
9.1947,-9.9929,1683
-2.0035,-9.7971,1684
65.3293,-10.0725,1685
5.7646,-9.8084,1686
9.8544,-10.0055,1687
1.0938,-9.9105,1688
3.3438,-10.1562,1689
-0.3867,-10.0042,1690
1.5757,-9.8919,1691
2.7929,-10.0422,1692
2.811,-10.1121,1693
6.4258,-9.8407,1694
1.0697,-9.5848,1695
