AYGX_mean,AZ_mean,timestamp
-1.6446,-9.7938,742
-1.6347,-9.7942,743
-1.6378,-9.794,744
-1.6586,-9.7935,745
-1.6426,-9.7947,746
-1.6519,-9.7938,747
-1.6256,-9.7944,748
-1.6399,-9.7937,749
-1.6413,-9.7931,750
4.6848,-9.7902,751
-122.4178,-8.657,752
20.3385,-9.62,753
-19.0456,-9.5935,754
3.7569,-9.7823,755
7.5085,-9.8944,756
-3.0685,-9.9219,757
-2.6707,-9.883,758
-1.6824,-9.9043,759
-1.4988,-9.8763,760
0.428,-9.9007,761
0.9228,-9.9678,762
