AYGX_mean,AZ_mean,timestamp
-0.2543,-9.8731,0
-0.2325,-9.8728,1
-7.7931,-9.7724,3
-5.597,-9.626,4
0.5144,-9.6242,6
0.6105,-9.6779,7
-4.7731,-9.6504,8
-14.8129,-9.5701,9
3.1943,-9.4235,10
-12.7515,-9.5786,12
0.3409,-9.4412,13
-42.9458,-9.1383,14
59.3846,-9.2425,15
-1.9481,-9.5213,17
0.7888,-9.9092,19
-0.4819,-9.8752,20
-0.0735,-9.9193,21
0.0234,-9.965,22
21.6465,-9.7185,23
-0.8579,-9.8207,24
1.3966,-10.0202,25
-0.6717,-10.1566,26
4.8546,-10.0619,27
2.9015,-9.8569,28
1.0436,-9.8457,29
-0.3907,-9.9585,30
-0.0688,-9.7715,31
0.558,-9.617,32
-0.1165,-10.0306,33
-0.6398,-10.0243,34
0.0216,-9.9887,35
0.1442,-9.6262,36
-0.1157,-9.8985,37
1.7883,-9.8157,38
0.5867,-9.7352,39
2.8748,-9.9751,40
-0.1428,-10.328,41
0.0475,-9.8832,42
0.6938,-10.3035,43
7.1872,-9.7013,44
0.1123,-9.962,45
-1.3845,-9.9807,46
2.1905,-9.93,47
0.7938,-9.977,48
-2.04,-9.6424,49
-2.6578,-9.9791,50
0.225,-9.8159,51
-0.0668,-9.8849,52
0.183,-10.0645,53
0.494,-9.8373,54
0.7971,-9.9792,55
-0.3381,-10.0906,56
-1.2325,-10.0004,57
-2.1549,-9.8121,58
3.1737,-9.7573,59
2.4607,-9.253,60
-0.4344,-9.7066,61
-0.7702,-10.2819,62
-0.0707,-9.7895,63
-0.7114,-10.0644,64
-0.2127,-9.8066,65
-1.4249,-9.1773,66
1.5577,-9.8786,68
-0.048,-10.0271,69
0.0116,-9.8722,70
0.4967,-9.7928,71
0.4069,-9.1329,72
-0.0142,-9.974,73
0.801,-9.846,74
-1.3033,-9.6406,75
5.3367,-10.0637,76
-0.5761,-10.0189,78
-1.8773,-9.8539,79
-0.8645,-9.8618,80
-0.4001,-9.8236,82
-0.942,-9.9701,83
1.4454,-9.6699,84
1.9054,-9.8536,85
0.6537,-9.8032,86
-0.1968,-9.7794,87
0.4704,-9.8573,88
-0.2516,-9.8902,89
-0.5192,-9.7162,90
-0.8395,-9.9638,91
-0.7821,-10.0129,92
-0.1542,-9.9155,93
-0.0697,-9.8984,94
-1.5165,-9.9763,95
2.4154,-9.9844,96
-0.4287,-8.8562,97
-0.2837,-9.9353,98
-1.9735,-9.5473,99
0.373,-10.401,100
0.9933,-9.5849,101
-0.8328,-9.8089,102
-1.5914,-9.8307,103
-0.3366,-9.6894,104
-1.2143,-9.8123,105
-0.6006,-10.0227,106
-1.0149,-10.1049,107
0.1051,-9.8808,108
-1.5631,-10.0866,109
-0.9254,-10.1991,110
-0.6074,-10.0209,111
-0.4936,-9.6645,112
-1.2143,-9.8771,113
-0.4707,-9.8019,114
0.5804,-9.8635,115
-0.6173,-9.9328,116
-0.8568,-10.0049,117
1.2859,-9.9014,118
1.1957,-9.8871,119
0.0163,-9.5,120
-0.1065,-9.7153,121
0.5935,-10.0173,122
0.7726,-9.9237,123
-2.8023,-9.9506,124
0.0608,-9.89,125
-1.1895,-9.6471,126
0.2195,-9.9,127
-1.062,-9.8881,128
0.9753,-9.8959,129
1.5739,-9.6164,130
1.0311,-9.8173,131
-0.8595,-8.519,132
0.0036,-10.0008,133
0.2072,-9.8857,134
-0.7218,-9.853,135
1.1401,-9.7415,136
-0.7487,-9.7997,138
1.2119,-9.9324,139
-0.3779,-9.9085,140
-2.6454,-9.7046,141
-0.5892,-10.1169,142
0.0316,-9.9631,143
-1.2708,-9.6836,144
-2.3342,-9.7986,145
-0.7483,-10.0453,147
-3.5209,-9.0615,148
-0.5721,-10.0856,149
0.2191,-9.9379,150
-0.6874,-10.2817,151
1.5542,-9.9823,152
6.5649,-9.7085,153
-1.3706,-9.915,154
0.1006,-9.9673,155
0.9218,-10.0282,156
-0.6596,-9.6213,158
-3.0246,-9.8069,159
1.7572,-9.8594,160
-1.4432,-9.7307,161
-1.867,-10.0317,162
2.7345,-10.5927,163
-5.0075,-9.6013,164
0.0622,-10.0541,165
2.692,-9.7998,166
0.947,-9.6254,167
0.821,-10.0518,168
1.2862,-9.8482,169
4.1922,-10.4243,170
0.5386,-9.7538,171
3.868,-9.6251,172
-0.7945,-9.9528,173
0.4145,-9.458,174
-1.1217,-8.9952,175
0.1561,-9.7681,176
0.3205,-8.5226,177
0.7771,-9.7877,178
0.9067,-9.7243,179
-0.1098,-9.8374,180
0.1948,-9.7697,181
0.0548,-9.9804,182
1.4914,-9.9549,183
0.7342,-9.9268,184
1.4726,-9.5759,185
3.6594,-9.6498,186
3.0622,-9.9882,187
1.7997,-9.9059,188
0.9735,-9.662,189
0.3608,-9.9897,190
0.4617,-9.9278,191
0.0594,-9.8299,192
-0.0391,-9.8485,193
-0.2308,-9.8055,194
-0.0473,-9.7911,195
0.0874,-9.5698,196
-0.0088,-9.4417,198
0.7528,-9.6902,199
2.6961,-9.6359,200
0.2548,-9.2401,201
-0.0793,-9.4465,202
0.3749,-9.9407,203
0.3819,-9.8635,204
0.3961,-9.9149,205
0.3191,-9.8711,207
0.285,-9.9243,208
0.7835,-9.8456,209
0.3883,-9.8184,211
0.3061,-9.702,212
3.3105,-9.9199,213
2.6865,-9.756,214
-0.7908,-9.8913,215
0.7864,-9.8927,216
0.6231,-9.8741,217
0.4098,-9.8721,218
0.0598,-9.8502,219
5.4814,-9.9769,220
-0.0642,-9.9,221
1.0876,-9.9619,222
0.1852,-9.853,223
0.7577,-9.9655,224
-0.0301,-9.8586,225
-0.0734,-9.8883,226
0.7347,-9.8578,227
0.5637,-9.8095,228
0.4214,-9.8806,229
0.0438,-9.8478,230
-0.1213,-9.8297,231
0.1625,-9.8183,232
0.8489,-9.7651,233
0.0658,-9.0452,234
1.7464,-9.8712,235
3.4775,-10.5025,236
-0.0678,-9.5123,237
2.0639,-10.2038,238
0.2295,-8.8995,239
0.3438,-9.7314,240
0.1566,-9.7184,241
0.1702,-9.7744,242
5.7538,-9.2411,243
-0.1259,-9.9668,244
0.2736,-10.2923,245
-0.0721,-10.5853,246
0.2914,-10.0052,248
2.2585,-9.9446,249
-0.4347,-9.3766,250
3.461,-10.3715,251
-1.76,-9.894,252
-1.0927,-9.6249,253
2.355,-9.9585,254
-0.4007,-9.8948,255
3.6832,-9.7599,256
0.6635,-9.9211,258
4.153,-9.9165,259
1.0933,-9.9301,260
-0.0873,-9.9424,261
0.8942,-9.8491,262
1.9456,-9.9777,263
3.4734,-9.9759,264
-1.3308,-9.8889,265
-0.2494,-9.9511,266
-0.1691,-9.9736,268
1.9781,-9.9158,269
5.775,-9.6681,270
0.2595,-9.8827,271
0.4831,-10.0812,272
3.7677,-9.5859,273
-0.6309,-9.6167,274
3.2808,-9.6911,276
0.7425,-9.7433,277
-0.8946,-9.7942,278
0.6563,-9.8473,279
-0.2263,-8.8001,280
0.6937,-9.8039,281
0.4393,-9.938,282
-1.4169,-9.9029,283
2.2128,-9.8973,284
-1.3299,-8.8982,285
-0.6642,-9.9057,286
2.8236,-9.8609,287
3.677,-9.7658,288
-0.1572,-9.7183,289
0.4137,-10.1517,290
-0.1107,-9.7567,291
-0.2975,-9.9756,292
0.2333,-10.0919,293
3.068,-9.6528,294
2.6579,-9.949,295
0.7987,-10.0561,296
0.2761,-9.9934,297
-0.0768,-10.3624,299
-0.187,-9.8307,300
-0.4346,-9.6563,301
-0.4182,-9.3719,302
-0.0065,-10.0573,303
-3.0838,-9.0691,304
0.0727,-8.2873,305
0.7404,-10.1418,306
-0.843,-9.4559,307
-0.1395,-9.5129,308
-0.0106,-10.0152,309
-0.464,-9.6824,310
0.3576,-9.5255,311
-0.6245,-8.4926,312
5.4221,-8.4902,313
-1.7544,-7.991,314
1.0258,-8.885,315
1.0567,-9.0888,316
-4.2473,-9.8716,317
1.5262,-9.7697,318
0.7202,-9.9209,319
1.0777,-9.7671,320
0.3952,-9.6867,321
0.6496,-10.018,322
0.2255,-9.9171,323
-0.0744,-9.9581,324
-1.6052,-9.1552,325
-8.8825,-9.5865,326
0.1965,-9.7409,327
0.1752,-9.9122,328
0.2696,-9.7512,329
0.6459,-10.131,330
-0.4242,-9.9831,331
-0.4345,-9.5744,332
0.2665,-9.4623,333
0.4532,-9.8982,334
0.3702,-9.7576,335
1.8294,-9.5221,337
0.8124,-9.9156,338
9.1698,-9.9416,339
1.0581,-9.9026,341
3.5967,-9.4461,342
-2.5978,-10.6623,343
-2.6136,-10.1724,344
10.9646,-9.7226,345
1.9556,-8.9414,346
1.2465,-9.8713,348
0.7564,-9.8488,349
2.8669,-10.5185,350
3.4876,-10.0737,351
4.6129,-9.8595,352
4.9401,-9.9428,353
0.8287,-9.8032,354
0.6031,-10.0001,355
0.4214,-9.9813,356
0.1504,-9.9744,357
-0.0108,-9.8717,358
4.0516,-9.9238,359
-0.6037,-9.8358,360
3.4804,-9.7875,361
0.1047,-9.8175,362
0.112,-10.1206,363
-0.5924,-9.7134,364
0.547,-9.8027,365
0.2071,-10.1423,366
0.5978,-10.0048,367
1.5858,-9.8137,368
0.0937,-9.8397,369
0.4964,-9.9149,370
-0.0342,-9.8327,371
-0.0399,-10.0555,372
-0.0527,-9.9609,373
1.3858,-9.9497,374
4.5973,-9.8673,375
0.4428,-10.1958,376
20.2002,-9.8901,377
-0.1893,-9.8743,378
6.6355,-9.9004,379
-0.0832,-9.9656,380
-0.3468,-9.865,381
-0.2698,-9.8305,382
0.6637,-9.8989,383
-0.2065,-9.9309,384
0.9419,-9.9582,385
3.5716,-9.563,386
2.412,-9.6466,388
-1.1223,-8.6295,389
1.2523,-9.0742,390
-1.8097,-9.7672,391
8.1925,-11.5423,392
-0.732,-9.77,393
6.0605,-9.6797,394
2.6085,-9.9688,395
2.6932,-9.6066,396
-0.0038,-9.8024,398
0.4549,-9.9083,399
0.5985,-10.0048,400
0.4244,-10.0443,401
1.5761,-9.9757,402
-0.6124,-10.1325,403
-0.3903,-9.8361,405
-0.0723,-9.8818,406
-0.057,-9.7785,408
3.317,-9.867,409
18.4661,-9.9983,410
-1.5599,-9.9689,411
2.3391,-9.7582,412
0.8488,-9.8794,413
1.3094,-9.7618,414
0.252,-9.9242,415
0.5947,-9.9274,416
2.8305,-10.0906,417
-0.6008,-9.7786,418
0.6093,-9.8803,419
1.0526,-9.9026,420
0.1602,-9.7606,421
1.3947,-9.8402,422
1.1206,-9.7938,423
2.8097,-9.9049,424
6.666,-9.8385,425
1.6572,-9.8667,426
0.0199,-9.9768,427
0.0083,-9.8497,429
0.043,-9.8764,430
0.4598,-9.8718,431
2.9523,-9.9414,432
-0.1375,-9.866,433
0.4771,-9.971,434
-0.4672,-9.8691,435
-17.0825,-9.7149,436
1.6306,-9.819,437
1.1973,-9.8563,438
-0.1466,-9.871,439
0.0982,-9.871,440
-0.6971,-9.8788,441
-0.7124,-9.8663,442
-0.2825,-9.8762,443
1.2146,-9.8726,444
-0.5763,-9.875,445
-0.2757,-9.8726,446
-0.2556,-9.8766,447
-0.3426,-9.8746,448
-0.2425,-9.8759,449
-0.4495,-9.8749,450
-0.1916,-9.8758,451
-0.2955,-9.8781,452
-0.6287,-9.8778,453
0.2244,-9.8756,454
-0.4108,-9.8759,455
-0.0704,-9.8778,456
-0.4778,-9.8751,458
-1.1965,-9.8702,459
-0.4303,-9.8747,460
-0.2217,-9.8762,461
-0.3604,-9.8768,462
-0.1907,-9.877,463
-0.3972,-9.8784,464
-0.3172,-9.8776,465
-0.3107,-9.8775,467
-0.3044,-9.8771,468
-0.4633,-9.8776,470
-0.255,-9.8774,471
-0.5964,-9.8738,472
-0.2315,-9.8765,473
0.1965,-9.8754,474
-0.542,-9.8789,475
-0.3923,-9.876,476
-0.3684,-9.8749,477
-0.3987,-9.8771,478
-0.378,-9.8749,479
-0.1349,-9.8773,480
-0.5253,-9.877,481
-0.2589,-9.8779,482
-0.4229,-9.8723,483
-0.244,-9.8756,484
-0.3874,-9.8746,485
-0.477,-9.8774,486
-0.4839,-9.8757,487
-0.3522,-9.8806,488
-0.4087,-9.8762,489
-0.2511,-9.8764,490
-0.3872,-9.8761,491
-0.3353,-9.8754,492
-0.2874,-9.8752,493
-0.4079,-9.8768,494
-0.1609,-9.8745,495
0.0123,-9.8773,496
-0.5616,-9.8749,497
-0.3198,-9.8748,498
-0.5094,-9.8766,499
-0.1794,-9.8742,500
-0.3587,-9.8752,501
-0.2421,-9.8753,502
-0.1317,-9.8755,503
-0.2216,-9.8807,504
-0.7638,-9.8729,505
-0.1874,-9.878,506
-0.3517,-9.8786,507
-0.83,-9.8768,508
-1.9934,-9.8663,509
-0.381,-9.8676,511
-0.6052,-9.8622,512
-0.4951,-9.8597,513
-0.6892,-9.8632,514
-7.4618,-9.7842,515
-1.6599,-9.7634,516
4.9425,-9.7742,517
-1.0766,-9.7682,518
-2.3452,-9.8008,519
0.5845,-9.7943,520
-1.1451,-9.8292,521
-4.13,-9.8168,522
5.1859,-9.8018,523
-1.234,-9.8399,524
-4.5665,-9.7879,525
3.7722,-9.7763,526
-2.4444,-9.8106,528
0.4643,-9.7858,529
-0.0463,-9.808,530
-2.525,-9.7937,531
-0.1409,-9.7926,532
0.3782,-9.8086,534
-1.3514,-9.8214,535
-0.9381,-9.8042,536
0.0619,-9.8146,537
-1.0687,-9.808,538
-0.2331,-9.8172,539
-1.3557,-9.8178,540
-2.4164,-9.7922,541
0.1912,-9.8004,542
-1.4038,-9.8099,543
-0.6407,-9.8087,544
-0.0163,-9.8083,545
-0.9202,-9.8278,546
-2.4235,-9.8131,547
-1.2307,-9.8125,549
-0.7806,-9.8343,550
-2.425,-9.8232,551
-0.4369,-9.8112,552
-0.2632,-9.8292,553
-1.505,-9.8196,554
-1.7519,-9.8168,555
-1.4964,-9.812,556
0.6096,-9.77,557
-1.7106,-9.7733,558
-2.6436,-9.8389,559
-2.271,-10.0016,560
11.1386,-9.9336,561
-4.391,-10.1229,562
-1.11,-9.9166,563
-1.1923,-9.8204,564
0.5079,-9.8901,565
1.207,-9.8744,566
-12.1617,-9.6106,567
9.1085,-9.8459,568
-0.6137,-9.1938,569
1.2413,-9.7347,570
0.586,-10.275,571
1.5089,-9.5751,572
-0.7941,-9.9115,573
-0.5452,-9.715,574
-0.1014,-9.24,575
0.547,-9.991,576
0.5901,-10.3036,577
-0.0767,-9.7966,578
0.0641,-8.8926,579
-3.4953,-10.0586,580
1.9388,-9.8622,581
0.8029,-9.8789,582
-1.2291,-9.9384,583
0.0917,-9.9341,584
4.6909,-9.9509,585
0.8332,-9.8297,586
1.2107,-9.6352,588
8.4047,-10.0314,589
-0.893,-9.9744,590
-9.6905,-8.3741,591
0.3353,-9.2379,592
0.007,-9.3294,593
0.4913,-9.865,594
0.2579,-9.7179,595
0.4215,-9.8771,598
0.6035,-9.7614,599
0.1625,-10.0205,600
0.2979,-10.0272,601
3.3797,-9.8376,602
0.7853,-9.6308,603
-0.4314,-9.1979,604
0.4236,-10.0375,605
-0.1962,-10.0822,606
-0.5401,-9.7556,607
-0.6757,-9.5899,608
0.5794,-9.8374,609
-1.0113,-8.0498,610
0.4191,-10.2284,611
-1.164,-11.3245,612
0.783,-10.2312,613
0.0621,-9.9436,614
0.9503,-10.0068,615
4.7747,-9.9236,616
0.3253,-9.2194,617
1.7091,-9.7708,618
2.2957,-9.6346,619
1.0639,-9.2534,620
0.596,-9.7248,621
0.9271,-10.1516,622
2.8524,-9.9703,623
-0.5593,-9.552,624
0.4495,-9.9148,625
15.1519,-9.8225,626
1.0923,-9.9651,627
0.4127,-9.7111,628
-6.4864,-9.7333,629
-0.7981,-9.0273,630
-1.4879,-9.7947,631
0.3726,-9.3949,632
0.5327,-9.9218,633
-0.0134,-9.9528,634
0.2007,-9.9328,635
1.2826,-10.0482,636
19.6278,-9.6054,637
2.817,-9.9587,638
0.8252,-9.8727,639
1.348,-9.7506,640
1.2772,-10.0774,641
-1.2302,-9.991,642
1.6801,-9.9439,643
-0.6802,-9.9117,644
4.2231,-9.7504,645
-0.8399,-9.3686,646
0.3301,-9.6529,648
-2.2684,-6.9746,649
0.2241,-9.5405,650
-1.6568,-10.0988,651
-1.033,-9.4799,652
-0.2408,-9.976,653
1.1112,-9.8608,654
-1.741,-9.89,655
2.1068,-10.0498,656
-0.1825,-9.9015,658
0.7948,-9.8948,659
0.3437,-9.8185,660
0.7351,-9.3953,661
-0.7509,-9.7869,662
0.9974,-9.9422,664
-0.2377,-9.9823,665
1.7501,-9.784,666
-1.1819,-10.0265,667
-0.0757,-9.8566,668
-0.1938,-9.8506,669
2.2889,-9.9489,670
-0.1866,-9.878,671
0.3323,-9.9185,672
-0.0333,-10.0825,673
1.6451,-9.9076,674
0.4159,-9.9566,675
0.2873,-9.8972,676
-1.1491,-9.9022,677
0.4871,-10.1114,678
-2.1942,-9.7494,679
3.1796,-10.0412,680
-0.7734,-9.8534,681
-0.9706,-9.9134,682
1.7463,-9.7623,683
-2.0903,-9.9612,684
2.6728,-9.8599,685
0.3747,-9.672,686
-0.668,-9.8712,687
3.1079,-9.872,688
-1.1142,-9.8993,689
-0.2873,-9.8892,690
1.353,-10.0939,691
0.1705,-9.8093,692
-0.2223,-9.9539,693
-1.3882,-9.8946,694
-0.0702,-9.8812,695
-0.1241,-9.8908,696
0.3219,-9.911,698
0.2089,-9.8646,699
-0.3988,-10.0125,700
0.1552,-9.9441,701
0.4446,-10.139,702
0.3107,-9.8187,703
3.5892,-9.9687,704
1.7294,-9.9502,705
1.1406,-10.0241,706
1.0216,-9.8222,707
-0.4406,-9.9029,708
0.2841,-9.9047,709
1.5437,-9.8563,710
0.4031,-9.8577,711
2.7463,-9.8531,712
2.2933,-9.979,713
0.8291,-9.8769,714
5.1515,-9.8346,715
-2.2378,-10.0956,716
5.4911,-9.8948,718
0.3927,-9.8435,719
1.2152,-9.9255,720
2.7888,-9.7253,721
-1.8317,-9.8822,722
-1.9202,-9.8485,723
-1.2829,-9.8915,724
1.0017,-9.8444,725
1.5266,-9.7161,726
-0.5612,-9.9811,728
-0.6296,-9.9529,729
0.4221,-9.8669,730
0.4252,-10.0573,731
-1.6359,-9.739,732
-1.0447,-9.7057,733
-0.8585,-9.5712,734
-2.7603,-9.7163,735
-0.443,-9.8203,736
0.0066,-9.9436,737
0.3664,-9.8316,738
0.282,-9.7819,739
0.2947,-9.7608,740
0.3329,-9.879,741
0.7357,-9.8746,742
-1.3443,-9.6753,743
1.4335,-9.8231,744
1.7424,-9.899,745
-0.879,-9.8653,746
-1.4171,-9.7497,747
-0.9208,-9.9242,748
1.5137,-9.8074,749
-1.0241,-9.613,750
-0.1722,-10.0233,751
2.593,-9.6339,752
-0.603,-9.8225,753
3.254,-9.6875,754
-0.3716,-9.8677,755
-0.1803,-9.7769,756
0.4695,-10.1198,757
0.1945,-9.7591,758
-0.2416,-9.7525,759
-0.048,-9.8536,760
-0.1192,-9.8686,761
0.1933,-9.805,762
1.9639,-9.8365,763
0.2262,-9.7432,764
1.1122,-9.6523,765
-1.1037,-10.3867,766
-0.1734,-9.9356,767
0.0734,-9.7405,769
0.5256,-8.9085,770
0.4385,-10.0624,771
6.2396,-9.9365,772
6.1125,-6.1052,773
1.3177,-9.6916,774
0.1623,-9.8699,775
-0.3011,-10.6669,776
0.178,-9.9303,778
0.826,-9.7609,779
-0.2916,-9.8497,780
-9.7819,-9.7833,781
-1.7967,-9.8582,782
2.8476,-9.6474,784
-21.1073,-9.4766,785
1.4782,-9.5929,786
1.4662,-9.5938,787
1.4669,-9.5938,788
1.4705,-9.5948,789
1.4674,-9.5942,790
1.4676,-9.5943,793
1.4613,-9.5954,794
1.4564,-9.5925,795
1.4642,-9.5948,796
64.1116,-9.5474,797
-68.9117,-9.2053,798
-63.8667,-9.3431,799
14.3976,-9.3923,800
-105.5129,-8.6799,801
-1.2236,-7.1218,802
-0.6407,-9.3994,803
0.1578,-9.3971,804
0.0973,-9.4681,805
-0.4283,-9.4136,806
0.1323,-9.4135,807
0.4289,-9.4091,808
-0.2227,-9.4121,809
-9.9982,-9.3203,810
1.1948,-9.356,811
-13.8576,-9.3353,812
-0.4076,-9.4665,813
2.5613,-9.6053,814
-5.0588,-9.7675,815
-4.6459,-9.8244,816
0.0995,-9.8838,817
-0.1257,-9.8301,818
-7.6741,-9.8184,819
-0.2585,-9.8414,820
-3.5414,-9.8355,821
4.6126,-9.8565,822
-1.2344,-9.8673,823
-1.4461,-9.8821,824
2.0939,-10.7052,825
-18.3333,-9.0976,826
-10.2536,-10.1437,827
-16.2198,-10.8089,828
1.355,-8.5772,829
-1.7221,-9.5232,830
1.521,-9.4802,831
0.0271,-9.8824,833
-1.3787,-9.8653,834
-2.6954,-9.864,835
-1.5964,-9.8459,836
1.9064,-9.8463,837
-0.0447,-9.8824,838
-18.9617,-9.7943,839
2.7828,-9.5982,841
3.1844,-9.8015,842
-1.7273,-9.7229,843
14.2139,-9.6904,844
0.7508,-9.7972,845
0.8215,-9.7948,846
0.8462,-9.7972,847
0.8073,-9.7971,848
0.7998,-9.798,849
0.8165,-9.7962,850
0.8309,-9.7956,851
0.8055,-9.7944,852
0.8014,-9.7965,853
0.8077,-9.7952,854
0.8139,-9.7957,855
0.8194,-9.7961,857
0.8264,-9.7958,858
0.8159,-9.7901,1030
0.939,-9.8304,1031
-0.8511,-9.8666,1032
1.1364,-9.8562,1034
-6.3828,-9.708,1035
12.8775,-9.753,1037
-0.8441,-9.8677,1038
-2.3981,-9.8244,1039
-3.804,-9.8249,1040
0.8293,-9.8446,1041
-0.2475,-9.8845,1042
-6.3324,-9.7848,1043
-3.5635,-9.7776,1044
-1.7833,-9.7582,1045
8.3036,-9.8156,1046
0.4782,-9.8337,1047
-8.6994,-10.0883,1048
2.2408,-9.0387,1049
-2.5376,-9.3233,1050
0.4126,-9.3247,1051
-1.0548,-9.4256,1052
3.8474,-7.6901,1053
2.4752,-9.767,1054
0.8003,-9.8543,1055
-7.1139,-9.909,1056
1.9333,-9.915,1057
-2.0361,-9.8825,1058
-0.7164,-9.8723,1059
12.4277,-9.797,1060
0.4106,-9.7509,1061
-8.0782,-9.8104,1062
-23.1856,-9.6723,1063
-32.973,-10.0866,1064
-13.1199,-9.7095,1065
-15.876,-8.9061,1066
-45.7367,-7.6504,1067
28.4513,-9.4141,1068
5.0368,-9.3424,1069
-8.7062,-9.8359,1070
-3.7837,-9.2931,1071
0.2095,-9.883,1072
16.1564,-9.8015,1073
8.2264,-9.6724,1074
4.6102,-9.9859,1075
9.9201,-9.7093,1076
-1.3008,-9.6562,1077
-0.6423,-10.2746,1078
-0.1267,-9.5841,1079
-5.1816,-8.754,1080
0.7103,-10.2089,1081
4.6077,-9.8198,1082
3.5581,-9.6815,1084
1.2969,-9.6468,1085
0.0994,-9.9075,1086
1.8735,-9.8744,1087
3.8423,-9.8967,1088
3.0359,-9.9168,1089
1.3813,-9.8507,1090
-0.4008,-9.8882,1091
-11.5931,-9.7906,1092
2.6216,-9.7629,1094
-3.2809,-9.8167,1095
1.2614,-9.8131,1096
-0.2098,-9.8358,1097
-0.546,-9.8266,1098
2.6985,-9.8241,1099
4.3224,-9.8084,1100
1.8432,-9.9361,1101
-3.2146,-10.043,1102
1.9618,-9.8698,1104
-0.5938,-9.9868,1105
12.2544,-10.1687,1106
7.1607,-8.0199,1107
-2.0763,-9.7903,1108
-2.8634,-9.9623,1109
-1.1855,-9.8648,1110
1.8973,-9.8346,1111
-3.6426,-9.7592,1112
-0.4834,-9.877,1114
0.5801,-9.7423,1115
-1.1575,-9.8469,1116
0.0629,-9.822,1117
-1.0242,-9.86,1118
2.9871,-9.7386,1119
0.3684,-9.9121,1120
-0.4671,-8.5317,1122
1.8076,-9.6668,1123
-0.7067,-9.2889,1124
-1.8936,-9.5493,1125
-2.7332,-9.6677,1126
1.3222,-9.5482,1127
1.9325,-6.9524,1128
-0.5238,-9.7669,1129
0.8973,-9.4917,1130
9.3521,-10.1306,1131
3.0529,-10.3093,1132
-0.1046,-9.5902,1134
0.6157,-9.8865,1135
1.0873,-9.6055,1136
-0.7362,-9.6529,1137
0.186,-9.5955,1138
0.7681,-9.6593,1139
2.0247,-10.2243,1140
0.5089,-10.1359,1141
1.8119,-10.1409,1142
0.2616,-10.1512,1144
-0.9289,-10.0093,1145
3.8668,-9.3081,1146
0.7335,-10.0923,1147
0.1817,-10.006,1148
0.7535,-9.3046,1149
0.4986,-9.8006,1150
1.2972,-9.9198,1151
0.1831,-10.1455,1152
0.7023,-9.8808,1154
0.1949,-10.0744,1155
0.0471,-9.6238,1156
0.3538,-10.1041,1157
0.6536,-9.9855,1158
0.9572,-9.7954,1159
-0.1737,-10.833,1160
0.7958,-9.5129,1161
0.3274,-9.5205,1162
0.6223,-9.8098,1164
-0.3128,-10.2727,1165
0.0036,-9.9804,1166
0.1464,-9.3511,1167
0.8847,-8.4485,1168
0.7567,-9.1468,1169
0.3643,-8.9833,1170
0.0226,-9.7593,1171
0.0393,-9.6812,1172
0.1745,-9.8026,1174
0.5987,-9.9366,1175
-0.0806,-9.8774,1176
-0.4419,-9.9275,1177
0.3424,-8.7257,1178
4.9416,-9.8256,1179
-3.7487,-10.0274,1180
0.9182,-9.8736,1181
-0.3786,-9.8051,1182
0.6517,-9.9489,1184
-0.027,-9.569,1185
1.3126,-9.8186,1186
0.506,-9.8832,1187
-2.1858,-9.9564,1188
-1.786,-9.9975,1189
-0.7574,-10.0274,1190
-0.836,-9.6403,1191
0.0559,-9.8145,1192
1.3139,-9.8377,1193
0.4554,-10.0309,1194
0.2978,-9.8617,1195
0.1306,-10.3369,1196
2.518,-9.5779,1197
8.0681,-9.6126,1198
9.9432,-10.034,1199
1.16,-10.0334,1200
-3.5204,-10.288,1201
2.224,-9.6246,1202
0.1962,-9.7336,1203
0.3612,-9.5794,1204
0.5804,-9.5225,1205
-0.3546,-9.8888,1206
1.0783,-9.887,1207
-0.1616,-9.8822,1208
-0.1021,-9.7328,1209
1.1898,-10.1167,1210
-0.8766,-10.086,1211
-2.0206,-10.0074,1212
2.434,-9.9133,1215
-0.634,-10.2235,1216
-0.2897,-9.058,1217
3.4882,-9.6366,1218
7.8354,-9.8562,1219
4.2416,-9.6938,1220
2.2127,-10.1515,1221
-0.1458,-10.085,1222
0.0722,-10.0213,1224
2.5403,-9.7306,1225
-2.267,-9.7957,1226
0.7133,-9.8791,1227
0.9987,-10.0651,1228
0.8105,-10.0209,1229
1.1906,-9.8746,1230
0.1928,-9.7937,1231
-0.1027,-9.891,1232
-6.4443,-9.775,1234
12.036,-9.7672,1236
0.3147,-9.9425,1237
0.2915,-9.7761,1238
0.1274,-10.1817,1239
-0.2792,-9.5984,1240
-0.0045,-9.3105,1241
0.6032,-9.9382,1242
-0.129,-9.4696,1243
0.5281,-9.7058,1244
1.1035,-9.9541,1245
0.5918,-9.9246,1246
2.5937,-9.8557,1247
0.5087,-10.9896,1248
0.2168,-9.5291,1249
-0.3224,-9.7387,1250
-1.0536,-9.9346,1251
-0.3893,-10.2123,1252
-0.1378,-9.8544,1254
-0.71,-9.7675,1255
3.3274,-10.169,1256
19.8684,-10.1759,1257
1.6591,-10.4513,1258
-6.6731,-10.1008,1259
-0.7809,-9.623,1260
0.0439,-9.879,1261
0.2836,-9.4757,1262
-0.0433,-9.8828,1264
-0.6444,-9.9035,1265
2.9029,-8.3945,1266
1.8469,-9.8046,1267
-5.7889,-9.87,1268
1.105,-9.5664,1269
-0.474,-9.8153,1270
1.3868,-9.9283,1271
-0.3173,-9.8387,1272
-0.2608,-9.8648,1274
0.531,-9.8904,1275
0.2338,-10.2065,1276
0.9998,-9.6402,1277
0.0809,-9.87,1278
1.2567,-10.4448,1279
-0.5412,-9.2927,1280
-0.8761,-10.0562,1281
-0.5741,-10.0267,1282
0.2507,-9.8213,1284
-0.039,-9.915,1285
-1.9205,-9.9088,1286
2.2054,-9.6857,1287
0.5238,-9.6028,1288
0.1027,-9.8254,1289
0.9746,-9.7215,1290
0.5333,-9.8558,1291
-0.2837,-9.8355,1292
-1.2455,-9.6453,1294
0.0606,-9.6797,1295
-0.7152,-9.7756,1296
0.5111,-9.8642,1297
0.6781,-9.9506,1299
-0.3605,-10.0846,1300
2.9439,-8.7891,1301
-5.1343,-10.1282,1303
-2.4902,-9.8343,1304
1.5631,-9.687,1305
0.1178,-9.8442,1306
1.1917,-8.4145,1307
-0.2308,-9.9284,1308
0.5493,-9.7564,1309
0.3196,-9.8349,1310
0.2589,-9.7987,1311
2.4944,-10.7598,1312
-0.9211,-10.1157,1314
0.9186,-9.955,1315
-1.3819,-9.4968,1316
0.4769,-10.0865,1317
0.7692,-9.9608,1318
1.0428,-9.9706,1319
0.7593,-8.4255,1320
-0.7887,-9.6934,1321
-0.0974,-10.0591,1322
0.0717,-9.8366,1324
1.2121,-9.7846,1325
0.02,-9.8048,1326
1.8772,-9.972,1327
-0.7076,-9.9994,1328
-0.741,-9.1578,1329
-0.0819,-9.8448,1330
-2.253,-10.0759,1331
0.6621,-9.984,1332
-0.1608,-9.8761,1334
-1.1506,-9.7193,1335
-0.8447,-9.9373,1336
-0.7676,-10.4251,1337
-1.3146,-10.528,1338
0.9781,-7.0813,1339
-2.879,-10.0229,1340
-0.2987,-9.8778,1341
-0.5858,-9.7874,1342
0.3529,-9.8951,1344
-0.087,-9.6328,1345
8.6467,-9.4493,1346
-0.3365,-9.4672,1347
1.6779,-10.0949,1348
-0.1185,-9.7509,1349
1.0494,-9.5632,1350
0.1898,-10.0242,1352
0.6632,-9.8513,1354
-0.161,-9.8966,1355
0.9198,-9.8728,1356
12.7376,-10.3482,1357
1.3865,-10.1081,1358
0.2062,-10.2606,1359
0.6818,-10.006,1360
-1.0302,-9.8118,1361
-0.2867,-10.0919,1363
0.2371,-9.6405,1364
-0.3452,-10.0622,1365
-0.1249,-9.8715,1366
-1.2423,-9.8378,1367
2.5719,-10.373,1368
-1.652,-10.3607,1369
3.878,-9.9466,1370
-0.5244,-10.1102,1371
9.7853,-9.6856,1372
-0.8217,-9.8897,1373
1.5835,-9.9893,1374
1.0592,-9.9991,1375
2.1716,-9.9404,1376
-0.3316,-10.3677,1377
-1.102,-7.9319,1378
8.4215,-9.7592,1379
7.8859,-9.106,1380
1.8936,-10.1977,1381
2.2513,-9.839,1382
0.389,-10.1673,1384
-0.7441,-9.9284,1385
-3.1254,-9.8623,1386
7.1697,-9.9218,1387
0.8807,-9.8682,1388
1.6484,-10.0654,1389
0.8728,-9.8852,1390
-2.5198,-9.8784,1391
0.3644,-9.906,1392
0.4359,-9.8838,1394
-0.0928,-9.6682,1395
-0.8396,-9.6349,1396
0.3432,-10.0568,1397
1.1746,-10.0044,1398
2.014,-9.6144,1399
-1.5352,-9.7093,1400
0.9494,-9.9029,1401
0.6505,-10.0227,1402
0.2061,-9.8579,1404
0.725,-10.0113,1405
2.1773,-9.902,1406
16.7591,-9.5779,1407
0.0539,-9.7596,1408
-4.6616,-10.3387,1409
2.5856,-9.8823,1410
0.705,-10.0367,1411
0.8957,-9.9661,1412
-0.1039,-9.8516,1414
1.3965,-9.8773,1415
-1.484,-9.8743,1416
0.7206,-9.8356,1417
0.114,-10.0563,1418
2.3135,-9.8979,1419
0.5104,-9.9466,1420
0.112,-9.8925,1421
-0.1144,-9.9201,1422
1.3886,-9.836,1425
5.0353,-10.1496,1426
5.2384,-10.334,1427
5.4116,-9.7231,1428
0.36,-9.8745,1429
6.1488,-9.9737,1430
1.0837,-9.9478,1431
0.6106,-9.789,1432
0.2492,-9.6738,1433
0.0999,-9.7442,1434
0.4936,-9.8122,1435
-0.8683,-10.1381,1436
-0.1817,-9.7362,1437
-0.3814,-10.145,1438
0.0862,-9.9462,1439
-1.5992,-9.812,1440
-0.2991,-9.7912,1441
0.519,-9.8004,1442
-0.6592,-9.8291,1444
-0.2253,-9.2339,1445
0.674,-9.7718,1446
-1.4356,-9.8467,1447
0.4043,-9.9888,1448
0.7365,-9.4412,1449
0.2563,-10.0673,1450
1.5455,-6.6946,1451
3.4792,-9.4979,1452
0.1811,-9.8968,1454
7.6897,-8.136,1455
-0.554,-9.8186,1456
-0.0341,-9.6427,1457
4.1872,-9.3967,1458
-0.0835,-10.2628,1459
0.4533,-9.5989,1460
0.6956,-9.4339,1461
0.8312,-9.9358,1462
-0.1342,-9.858,1464
0.0426,-10.0082,1465
4.9215,-9.6128,1466
-6.1319,-10.6419,1467
0.2421,-10.0307,1468
0.7987,-10.6797,1469
2.53,-9.8781,1470
1.3221,-9.8411,1471
-0.4264,-10.0379,1472
0.2626,-9.9094,1474
1.9188,-9.8825,1475
0.5475,-9.7832,1476
-0.318,-9.954,1477
0.1094,-10.0665,1478
-0.0027,-9.9716,1479
-0.8998,-9.7742,1480
1.6816,-9.4256,1481
-0.1744,-9.6122,1482
0.7006,-10.0061,1484
0.3269,-9.8848,1485
1.1616,-9.9587,1486
1.1704,-10.0371,1487
0.1167,-9.9153,1488
1.775,-10.1417,1490
0.1296,-9.8618,1491
-0.6573,-9.7925,1492
0.6144,-9.5581,1493
1.6765,-10.306,1494
2.5703,-9.8198,1495
2.3395,-9.8001,1496
1.1474,-9.7619,1497
0.19,-10.1216,1498
0.549,-9.9485,1499
0.0166,-9.9773,1500
-0.49,-10.1347,1501
1.1668,-9.9089,1502
7.9123,-9.9787,1503
0.2204,-9.8305,1504
-0.7324,-9.7862,1505
-0.5668,-9.9389,1506
7.1809,-10.4494,1507
-1.3318,-10.0549,1508
8.9087,-9.7864,1509
-3.6179,-10.0707,1510
0.576,-9.675,1511
3.2227,-9.7045,1512
0.321,-9.9406,1515
-1.5916,-9.9006,1516
-0.4218,-9.7717,1517
-13.9583,-10.2265,1518
-7.269,-9.9916,1519
3.7024,-9.7156,1520
-12.3769,-9.5431,1522
2.9163,-9.7761,1524
-0.5533,-9.8811,1525
-0.4071,-9.8451,1526
-0.1532,-9.8435,1528
