AYGX_mean,AZ_mean,timestamp
-0.3642,-9.8682,0
0.2725,-9.8811,1
-14.5643,-9.7394,2
0.9999,-9.7096,3
-0.423,-9.7652,4
-1.7142,-9.7663,5
-1.7967,-9.7694,6
-1.7026,-9.7632,7
-1.5554,-9.7645,8
-1.4009,-9.7652,9
-1.5198,-9.7664,10
-1.4683,-9.7653,11
-1.5161,-9.7582,12
-1.2058,-9.7629,13
-1.5013,-9.7647,14
-1.5359,-9.7645,15
-1.4768,-9.7651,16
-5.0493,-9.7138,17
12.0214,-9.6382,18
-42.0793,-9.532,19
13.4613,-8.8396,20
-3.1089,-9.7287,22
-1.2276,-9.7529,23
-1.3146,-9.8986,24
6.0438,-10.1552,25
4.1167,-9.8789,27
3.2447,-9.8596,28
-1.2547,-9.8787,29
-2.0223,-9.6853,30
3.548,-9.9806,32
1.0552,-9.8989,33
-1.4751,-9.8635,34
-2.1532,-9.8834,35
-0.8068,-10.0191,36
0.5552,-9.919,37
-0.5199,-9.9329,38
2.8922,-9.6877,39
9.0061,-9.9085,40
13.9613,-10.0309,41
8.6014,-9.9251,42
-2.8296,-9.7195,43
-0.8017,-10.0689,44
7.2768,-9.8365,45
2.0539,-9.9096,46
3.8557,-9.9912,47
2.6456,-9.806,48
0.8267,-9.2878,49
-0.8217,-9.9151,50
-1.2772,-9.9565,51
-1.4255,-9.66,52
-0.59,-9.9338,53
0.4676,-9.9454,54
4.0884,-9.8284,55
-2.1048,-9.5117,57
-1.8736,-9.6962,58
0.9451,-9.5376,59
-0.2208,-9.7785,60
-0.3283,-9.6827,61
-0.2472,-9.9488,62
1.6826,-9.9433,63
-0.7888,-9.8053,64
2.9747,-9.7061,65
0.2148,-9.4941,66
-3.7871,-9.8963,67
-2.0549,-9.9565,68
-1.9781,-9.7779,69
-1.0765,-9.8368,70
3.5286,-9.827,71
-0.5163,-10.1401,72
1.8838,-9.9745,73
1.4598,-9.7728,74
3.3499,-9.7662,75
0.4908,-10.142,76
0.6364,-9.939,77
3.5564,-9.9191,78
2.7911,-9.8711,79
2.6386,-10.0413,80
-0.0121,-9.6891,81
1.8426,-9.7387,82
0.7246,-9.8572,83
-0.3135,-10.7402,84
0.0684,-9.7229,85
-0.0817,-9.93,87
-0.0247,-9.8949,88
-0.0361,-9.9397,89
3.137,-9.9456,90
-0.689,-9.868,92
-3.5514,-10.0649,93
0.7038,-9.8768,94
0.1636,-9.8547,95
1.0632,-9.8926,96
-1.3588,-9.4911,97
0.5774,-9.9854,98
0.7268,-10.0695,99
-2.0548,-9.6421,100
-0.2676,-9.9747,102
1.316,-9.8384,103
1.6238,-9.9407,104
0.2236,-9.847,105
-0.4897,-9.9949,107
-0.0931,-9.8919,108
-2.3399,-9.9898,109
-0.619,-9.8721,110
1.5017,-10.0959,112
0.3092,-9.931,113
5.0812,-10.0205,114
-1.1259,-9.8004,115
6.4103,-9.9989,117
-0.2782,-9.7801,118
1.172,-9.9691,119
-0.5867,-10.0853,120
-0.5164,-9.9517,122
0.7205,-9.8353,123
2.8205,-9.8482,124
-4.4565,-9.0704,125
-1.5443,-9.8708,127
1.0853,-9.5484,128
5.7753,-8.632,129
-1.2766,-9.5855,130
2.0182,-9.7648,131
-0.3805,-9.919,132
3.1484,-8.8406,133
-0.1686,-10.0662,134
4.9624,-8.9854,135
-0.7917,-10.031,136
-0.976,-10.0825,137
0.6939,-9.9188,138
-1.7019,-9.6002,139
0.5371,-9.7776,140
4.9017,-9.9043,141
-1.4622,-8.7855,142
0.1476,-10.0188,143
0.322,-9.9577,144
0.8688,-9.975,145
2.6629,-9.8343,146
2.9539,-10.0212,147
1.4333,-9.4736,148
1.4677,-9.8839,149
6.8085,-9.2407,150
-1.2537,-9.393,151
0.2706,-9.7033,152
8.3647,-10.6969,153
-0.9489,-8.8024,154
1.2777,-9.9964,155
-0.0189,-9.7477,156
2.3289,-9.9977,157
1.4791,-9.8443,158
0.0746,-9.5723,159
-1.8864,-10.2306,160
-1.6805,-9.6828,161
2.6214,-9.8379,162
2.7242,-9.6561,163
0.9318,-9.7443,164
-1.4834,-9.3443,165
-0.721,-9.8197,166
0.0429,-10.0241,167
1.016,-9.7938,168
1.7981,-9.846,169
-0.1025,-9.7105,170
2.5364,-9.964,172
0.3355,-9.891,173
-1.5622,-10.0577,174
-0.9806,-9.9327,175
0.2,-9.8845,177
2.0608,-9.9712,178
6.3245,-9.7948,179
0.062,-9.8913,180
2.1507,-9.8385,182
-0.5169,-9.9959,183
1.9808,-9.9012,184
0.7676,-9.7698,185
5.3963,-9.8797,187
1.1981,-9.8685,188
4.1602,-9.9238,189
1.8947,-9.7433,190
3.9779,-9.8596,191
0.5797,-9.8399,192
-0.2858,-9.7761,193
-3.1643,-10.019,194
-1.1688,-9.8468,195
3.3263,-9.7105,197
2.2156,-9.8059,198
0.1601,-9.9348,199
-0.542,-9.8326,200
1.2294,-9.9237,202
0.667,-9.8825,203
0.1535,-9.7029,204
0.2674,-9.8411,205
-0.2655,-9.8728,207
0.3472,-9.78,208
1.0902,-9.8392,209
-0.5616,-10.0205,210
1.1645,-10.0511,212
-0.0236,-9.8195,213
0.0902,-10.1006,214
-0.6686,-10.0255,215
2.8114,-9.8053,216
2.6887,-9.9127,217
1.871,-9.8147,218
1.3902,-10.1628,219
0.6203,-9.8093,220
0.5102,-9.9925,221
-0.3651,-10.1779,222
0.9696,-9.9172,223
1.5074,-10.1725,224
0.7606,-9.8807,225
1.1172,-10.1466,227
1.1659,-10.0397,228
1.2501,-9.6361,229
2.4572,-9.7903,230
-0.0557,-9.9494,232
1.9524,-9.8682,233
0.2093,-10.196,234
-0.2222,-9.8656,235
2.0086,-9.2762,237
0.7726,-9.9199,238
1.7614,-9.9112,239
1.5732,-9.8247,240
1.279,-9.9204,241
3.2907,-9.9208,242
1.069,-9.6941,243
2.0659,-9.7134,244
-0.6898,-9.5657,245
0.1127,-10.7012,246
3.0706,-9.755,247
1.8195,-10.176,248
-0.4319,-10.0042,249
3.2364,-10.2326,250
-1.0118,-9.4746,251
0.0975,-9.7804,252
-0.381,-9.793,253
-0.6952,-9.6167,254
2.7335,-9.9684,255
1.9365,-9.4589,256
-0.1925,-9.917,257
0.3333,-9.8264,258
7.2904,-9.7062,259
1.1177,-9.9276,260
1.6573,-9.8242,262
5.1585,-10.6595,263
0.803,-10.0028,264
0.5576,-9.9385,265
1.039,-9.6994,267
2.5932,-9.9098,268
11.5075,-9.9919,269
-0.073,-9.7678,270
0.7592,-9.7828,272
0.6904,-9.9493,273
0.138,-9.9135,274
-0.2117,-9.7669,275
-0.6442,-9.9246,277
-1.1642,-9.149,278
0.4702,-9.8376,279
-0.8771,-9.9331,280
-1.5668,-9.9198,282
-1.0383,-9.7324,283
-0.672,-10.0377,284
-2.3897,-10.0016,285
0.6871,-9.9436,287
0.1402,-9.9522,288
-2.8076,-9.6432,289
-0.7638,-9.8061,290
0.2315,-9.8119,292
-0.2692,-9.9729,293
0.0338,-9.9293,294
-0.1107,-9.7241,295
-0.9342,-9.86,296
-0.5154,-10.0991,297
-0.1736,-9.808,298
0.5131,-9.8566,299
-0.7676,-10.1329,300
0.4732,-9.8575,302
1.4279,-9.9405,303
-0.0644,-9.9233,304
5.0718,-9.836,305
0.4209,-9.2898,307
-1.7051,-9.7978,308
1.2008,-9.9831,309
4.2652,-10.0951,310
-0.6333,-9.7977,312
-1.4553,-9.8552,313
-0.763,-10.1052,314
-0.8701,-9.9667,315
-0.4923,-9.8378,317
0.6136,-9.9538,318
0.9046,-9.7588,319
-1.434,-9.8525,320
0.2049,-9.7518,321
-0.7409,-9.872,322
1.1598,-9.9022,323
-0.2727,-9.8633,324
0.3329,-9.7479,325
4.817,-10.152,326
-1.3921,-9.6971,327
0.1633,-9.9399,328
-0.8459,-9.7744,329
2.3352,-9.8037,330
-0.6144,-10.6232,331
-0.8199,-9.8338,332
-0.8608,-9.904,333
3.4663,-10.0877,334
2.8918,-9.8167,335
-4.8305,-10.0073,336
-0.0068,-9.7696,337
0.1479,-10.2276,338
-1.5818,-9.8591,339
-0.129,-9.7526,340
3.2423,-9.5066,341
-1.3917,-9.8315,342
2.073,-9.9511,343
6.2794,-9.5769,344
0.2443,-9.4809,345
0.0829,-9.9197,346
-0.1736,-9.8551,347
-1.118,-9.9631,348
-0.4756,-9.765,349
-0.3983,-9.7492,350
-1.1928,-9.8781,352
0.6116,-9.4435,353
2.7214,-9.1166,354
1.699,-9.9399,355
0.1737,-10.0043,357
0.8523,-9.9516,358
-1.0794,-9.71,359
0.0205,-9.861,360
0.9188,-9.9824,362
-0.1586,-9.9737,363
0.6327,-9.976,364
0.0589,-9.0622,365
1.2671,-9.9402,367
1.5473,-9.9093,368
1.8086,-9.2989,369
-0.4723,-9.694,370
0.7117,-9.7499,372
0.8849,-9.9756,373
-0.0741,-9.6626,374
-0.175,-9.9243,375
0.6762,-9.797,377
0.4446,-9.9718,378
0.7722,-9.4586,379
0.1754,-10.118,380
0.1768,-9.2033,382
1.3873,-9.64,383
-1.13,-9.9501,384
0.3796,-9.7452,385
1.1272,-9.8405,387
-1.5401,-10.1754,388
-3.1332,-9.9454,389
0.3222,-10.1248,390
0.4153,-9.879,391
-0.3152,-10.3298,392
4.0651,-9.8856,393
7.721,-9.5613,394
3.7119,-10.7847,395
-3.273,-10.0705,396
4.6613,-9.9296,397
1.5995,-9.8495,398
0.3382,-9.9941,399
-0.4127,-9.5012,400
5.1693,-9.9289,401
-1.1827,-9.8487,402
0.4307,-9.7312,403
5.7062,-9.699,404
6.7538,-9.8513,405
0.011,-9.8683,407
-0.0131,-9.9129,408
0.0208,-9.7893,409
-0.1169,-9.9605,410
0.1952,-9.707,412
-0.6163,-9.8453,413
-1.4304,-10.0145,414
-0.9044,-9.8848,415
-0.0872,-9.9616,417
1.7416,-9.9188,418
-0.3762,-9.9368,419
5.8518,-9.7996,420
0.2166,-9.9484,421
-1.107,-9.6743,422
3.5161,-9.4139,423
6.7034,-10.197,424
-0.9401,-9.6869,425
-1.4734,-9.621,426
0.9063,-9.7122,427
0.2487,-9.9247,428
-1.1217,-9.9426,429
-0.9179,-9.8087,430
-1.2239,-10.0529,431
-1.4198,-9.8156,432
21.6946,-9.9162,433
5.4186,-10.0827,434
-5.4179,-9.2279,435
3.0966,-9.7922,436
-0.2321,-9.999,437
-0.438,-9.7919,438
-0.0099,-9.9017,439
1.1895,-10.0779,440
3.6652,-9.7796,441
5.4503,-8.7725,442
-0.8872,-8.8253,443
-5.4875,-9.6232,444
1.7304,-9.4444,445
1.0455,-9.859,447
0.2439,-9.9692,448
-1.4524,-9.7735,449
0.5426,-9.6104,450
0.1254,-9.5672,452
-0.5952,-9.9445,453
0.7041,-9.6966,454
2.9767,-9.9969,455
0.5378,-9.817,457
-1.1251,-9.7621,458
-0.5816,-9.6361,459
0.3936,-9.8036,460
-0.3334,-10.1111,462
6.2878,-10.1859,463
-0.4077,-8.0357,464
1.3125,-8.3672,465
2.1975,-9.6936,467
1.4536,-9.8188,468
0.5363,-9.9227,469
1.868,-9.8195,470
-0.1454,-9.7239,472
2.3164,-9.4814,473
-6.1672,-9.8047,474
0.6258,-9.8376,475
2.5985,-9.9117,477
2.6248,-9.3006,478
10.3113,-9.4223,479
6.6094,-9.1175,480
0.1617,-9.8658,482
2.0005,-9.7048,483
2.5867,-9.4802,484
4.0461,-9.8147,485
1.9462,-8.9847,487
-2.3289,-9.8541,488
1.4884,-9.7489,489
0.27,-10.0392,490
-0.0089,-9.9903,491
0.8106,-9.8629,492
0.3011,-9.8884,493
-5.6048,-7.434,494
0.0397,-10.0124,495
0.724,-10.0815,496
2.7074,-9.2371,497
-0.3622,-9.775,498
0.1282,-8.5123,499
-2.1345,-9.8399,500
1.2123,-9.9268,501
2.3984,-9.7908,502
-1.348,-9.9301,503
3.697,-9.6025,504
0.4199,-9.2898,505
-2.1287,-9.8546,506
-0.3668,-9.6666,507
0.5631,-9.4996,508
-3.508,-9.6985,509
-0.9501,-7.5681,510
-0.9769,-8.5373,511
-0.8723,-9.1239,512
-0.4499,-10.0996,513
-1.754,-10.5861,514
-3.6809,-9.9057,515
-5.1863,-9.4615,516
-2.7897,-9.8507,517
-2.0509,-10.0221,518
-4.016,-9.9666,519
-0.0078,-9.7711,520
-2.8761,-10.3946,521
-4.0233,-10.0082,522
-0.5303,-9.7164,523
-2.2499,-9.9176,524
-1.2935,-10.0732,525
1.0545,-9.5369,526
-2.3297,-9.9169,527
5.7651,-9.3686,528
-0.1125,-9.7982,529
1.2267,-8.5509,530
3.337,-8.161,532
0.624,-9.9936,533
-3.1198,-9.5831,534
58.7574,-5.2953,535
-0.5451,-10.0044,537
-4.7179,-9.9379,538
-2.2919,-9.8991,539
1.3752,-9.8173,540
6.3217,-9.5119,542
-0.1781,-9.7671,543
2.1738,-8.102,544
-0.6095,-9.961,545
2.1288,-9.8094,547
2.6782,-9.3365,548
7.2833,-9.8003,549
0.696,-9.875,550
15.9179,-9.8184,552
33.45,-10.0764,553
-1.057,-10.2714,554
4.7186,-10.2375,555
-0.1075,-9.7291,557
0.2671,-9.693,558
1.4759,-9.3849,559
-0.459,-9.9087,560
1.9661,-9.3503,562
-0.4115,-9.8782,563
-1.0207,-9.6121,564
-1.1347,-9.6305,565
-0.0584,-9.6944,567
-0.0002,-9.9423,568
0.2336,-9.8021,569
-0.6367,-9.9919,570
1.6187,-9.4678,572
3.7163,-9.753,573
3.018,-10.1533,574
4.8259,-9.6749,575
3.8842,-9.5868,577
-6.2334,-10.4194,578
6.2019,-9.8085,579
-0.9762,-9.9575,580
0.7846,-9.9671,582
6.2688,-7.8718,583
-1.1725,-9.8986,584
-0.0447,-9.94,585
4.2439,-9.582,586
-1.8179,-9.3723,587
11.0562,-9.8213,588
10.8958,-10.1298,589
-4.0625,-9.936,590
3.8528,-9.6091,591
8.1477,-9.0342,592
3.7131,-9.5904,593
0.004,-9.9693,594
0.1128,-10.0255,595
-0.818,-9.8071,597
4.2205,-9.8095,598
16.9412,-10.3714,599
0.537,-9.6486,600
1.5304,-8.1446,601
-0.3809,-8.7049,602
2.3133,-9.8463,603
5.0023,-10.1504,604
0.6338,-9.9182,605
5.6639,-10.0173,606
0.9181,-9.7624,607
1.9297,-9.866,608
0.2533,-9.9185,609
4.3715,-9.9887,610
1.3382,-9.8705,611
0.8728,-9.8863,612
0.1331,-9.9141,613
-0.14,-9.8492,614
-0.15,-9.8628,615
-1.05,-9.9234,616
0.5168,-9.878,617
2.1904,-10.0709,618
5.6848,-10.1383,619
1.105,-9.9111,620
-0.5274,-9.8682,622
-0.3796,-9.8469,623
0.2069,-9.995,624
0.1307,-9.8873,625
0.3144,-9.9037,627
1.0855,-9.7749,628
-0.7653,-9.4564,629
0.028,-9.9041,630
0.3557,-9.9564,632
2.5834,-9.9097,633
-0.0053,-9.8791,634
3.8652,-9.4726,635
8.3366,-9.9857,637
1.2783,-9.9649,638
2.0457,-9.83,639
-0.212,-9.8296,640
0.1212,-9.9028,642
-0.1301,-9.9008,643
-2.0829,-9.804,644
12.5463,-9.9362,645
-0.5215,-9.8371,647
0.2806,-9.9984,648
5.0154,-10.0778,649
15.3065,-4.9041,650
2.6287,-10.4299,652
13.3009,-9.967,653
4.8203,-9.7168,654
0.1767,-9.948,655
-0.8536,-10.5977,657
-2.5033,-9.9473,658
2.1401,-9.9242,659
-0.7174,-9.9779,660
3.9375,-9.9366,662
-2.4483,-9.9195,663
-4.3044,-9.8254,664
2.8381,-10.0428,665
17.2159,-10.1854,666
-14.7539,-10.2787,668
-0.2124,-9.7868,669
0.3697,-8.2647,670
3.0728,-10.0062,671
-2.4836,-9.8786,672
0.2873,-9.5389,673
1.8903,-9.2434,674
1.198,-9.8978,675
1.5599,-10.0795,677
-3.3044,-8.9268,678
18.5902,-10.0153,679
-0.7985,-10.1,680
0.463,-8.9416,681
18.8702,-9.5555,682
3.21,-9.992,683
-3.7892,-9.8601,684
-8.4832,-9.9677,685
3.7916,-9.6792,686
-0.6585,-10.2008,687
-0.2668,-10.2343,688
1.086,-10.0419,689
1.4818,-8.8124,690
-3.2762,-8.5147,691
3.2168,-9.9416,692
3.6517,-9.4855,693
1.8345,-10.2126,694
2.2969,-9.9454,695
-3.7201,-9.8607,696
1.6852,-9.9315,697
0.6042,-9.9843,698
4.9322,-10.2542,699
4.0406,-9.9556,700
4.335,-10.0278,701
-1.026,-9.8226,702
-1.7787,-9.8685,703
-2.7587,-10.2523,704
-0.2857,-9.9235,705
2.3306,-10.0568,707
0.2429,-9.2489,708
0.9025,-8.1432,709
7.1951,-9.8653,710
3.8631,-9.8816,712
-0.7164,-9.8126,713
4.1524,-10.0563,714
1.7059,-9.7367,715
0.2229,-9.813,717
0.6838,-9.9154,718
-0.1461,-9.7757,719
0.6681,-10.3003,720
1.9522,-10.0716,722
1.9443,-9.8886,723
5.4633,-10.0055,724
-1.8319,-7.7901,725
2.5131,-9.821,727
-0.2535,-9.9698,728
1.789,-9.795,729
1.5434,-9.7499,730
1.0849,-9.8481,732
-0.4073,-9.8683,733
-0.1679,-9.97,734
0.6697,-9.7744,735
-2.572,-10.0555,737
0.4567,-9.6136,738
-3.8461,-10.0992,739
0.1424,-8.8166,740
-1.6732,-9.0254,742
-1.0735,-9.8049,743
5.1183,-9.8457,744
-0.8361,-10.055,745
-3.2651,-9.8812,747
-1.1088,-9.8108,748
-1.9941,-9.696,749
-0.2981,-9.8966,750
-0.7677,-9.852,752
12.7678,-10.0091,753
-4.9566,-10.1557,754
-1.3036,-10.0657,755
6.5632,-9.8109,757
-2.6256,-9.9666,758
7.3865,-9.6983,759
-3.4878,-9.8825,760
-1.925,-9.9241,762
1.2608,-9.7889,763
1.0203,-9.944,764
-0.8069,-9.7151,765
6.2636,-9.6875,767
0.7151,-9.7357,768
2.8967,-10.0557,769
-1.5327,-9.7466,770
-1.5904,-9.8558,771
0.249,-9.9147,772
3.5508,-9.704,773
-0.9401,-10.3853,774
0.0872,-9.8912,775
-2.1337,-9.6543,777
0.5017,-10.0393,778
13.1662,-9.9577,779
0.6873,-9.2384,780
1.4011,-9.0194,781
0.458,-10.0771,782
1.3535,-10.0492,783
4.155,-9.9072,784
4.9098,-9.8374,785
0.0857,-10.0516,786
0.2692,-9.8971,787
-0.3929,-9.9072,788
1.8661,-9.852,789
-0.3305,-9.9032,790
0.1631,-9.616,791
1.5027,-9.8711,792
0.116,-9.9401,793
4.6936,-10.1248,794
1.035,-9.4225,795
2.7024,-10.1237,797
-2.4201,-10.1573,798
-10.9599,-10.0998,799
-4.6437,-9.7008,800
-2.7011,-9.8513,802
-1.7467,-9.9071,803
-6.8564,-9.603,804
4.1826,-9.7857,805
-3.2012,-9.7499,807
0.0083,-9.6648,808
-5.7665,-9.7823,809
0.5187,-9.9461,810
-0.4095,-9.7903,812
-1.39,-9.6953,813
0.1456,-9.9878,814
-5.2778,-9.8523,815
-1.4769,-9.8485,817
-0.6249,-9.8958,818
0.2636,-9.7727,819
-0.9273,-9.9062,820
-0.6669,-9.7512,822
-1.3854,-9.8134,823
-1.6952,-9.9664,824
-0.8396,-9.8112,825
0.2104,-10.0305,827
7.5121,-10.0336,828
7.8211,-10.1664,829
11.8814,-10.386,830
5.8352,-9.8984,832
-0.0814,-9.9587,833
-0.7054,-9.3288,834
3.3658,-10.1407,835
-0.5746,-9.7607,837
-0.1089,-10.0762,838
3.4228,-9.7153,839
7.2371,-9.8861,840
1.0494,-9.989,842
-0.5873,-9.957,843
1.7673,-9.8054,844
10.6179,-9.6173,845
0.4983,-10.0608,847
-3.0828,-9.8325,848
3.4403,-9.992,849
-1.6808,-9.911,850
-1.1054,-9.7107,852
-2.7373,-9.4585,853
-0.1349,-10.6178,854
3.5625,-10.209,855
-4.6727,-9.7152,857
1.9537,-9.9348,858
0.09,-10.0268,859
0.5026,-9.7222,860
-0.2537,-10.1866,862
0.4112,-9.7297,863
6.2071,-9.8857,864
0.3786,-9.8341,865
0.4338,-9.8947,866
0.6875,-9.8819,867
1.9023,-9.8808,868
-0.6102,-9.9654,869
2.0331,-9.9344,870
5.7299,-9.8754,871
-3.4331,-10.0071,872
-0.8725,-9.8936,873
-0.9583,-9.92,874
-4.1461,-9.6827,875
1.6673,-9.8407,876
-3.9966,-10.2444,877
4.6978,-10.3845,878
7.1421,-9.7296,879
0.9532,-9.6071,880
-11.4751,-10.1107,881
8.7717,-9.6884,882
2.9427,-10.1395,883
13.665,-10.0007,884
3.0657,-9.1143,885
-1.1661,-9.9662,886
0.2737,-9.7398,887
2.6861,-8.4589,888
-1.6531,-9.7339,889
0.7701,-9.3875,890
2.9116,-9.4063,892
-2.9685,-10.1322,893
-17.5168,-10.3523,894
-6.2477,-9.7103,895
-2.543,-9.4291,897
0.7879,-9.7901,898
1.2191,-9.5736,899
-0.5487,-10.415,900
5.5677,-9.7767,902
0.4702,-9.798,903
2.2173,-9.8881,904
0.993,-10.0201,905
-3.2562,-10.1517,907
7.8435,-9.1256,908
-1.4808,-9.7301,909
0.0898,-9.9288,910
4.0583,-9.9204,912
2.6323,-9.6803,913
3.4521,-9.9422,914
2.9012,-9.7478,915
3.7103,-9.852,917
0.0052,-9.9271,918
1.8945,-9.4519,919
1.6441,-9.8659,920
-0.1555,-9.9429,922
2.5784,-10.0141,923
0.1658,-9.9502,924
1.7397,-10.0985,925
1.9073,-9.8986,927
-2.0711,-9.8546,928
0.4812,-9.9384,929
6.9173,-9.9477,930
1.7957,-9.8593,932
0.5189,-9.8365,933
-4.8949,-10.2101,934
0.544,-9.7914,935
-0.7552,-9.8526,937
-1.6157,-9.9084,938
-0.3626,-9.747,939
-2.7374,-9.6328,940
