AYGX_mean,AZ_mean,timestamp
1.3087,-9.5843,0
2.2003,-9.5934,1
2.5224,-9.6303,2
-1.6492,-9.6144,3
1.3392,-9.5917,4
1.1185,-9.5988,5
8.5003,-9.6257,6
4.1728,-9.7289,7
0.4414,-9.7734,8
-0.5821,-9.811,9
-1.1135,-9.784,10
-18.6056,-9.6686,11
8.0672,-9.6799,12
6.4685,-9.8848,13
-1.5387,-8.842,14
-0.8597,-8.608,15
2.2079,-9.9102,16
-2.3765,-9.845,17
0.7774,-9.8214,18
1.8587,-9.9056,19
-1.2334,-10.0031,20
0.948,-9.7987,21
1.6166,-9.928,22
0.2138,-9.8411,23
1.3743,-9.7079,24
0.9342,-9.8642,25
0.7229,-9.8999,26
1.4319,-10.1644,27
0.875,-9.6766,28
-0.3846,-9.8276,29
0.2031,-9.9607,31
1.3228,-9.636,32
0.8636,-9.8758,33
0.2432,-9.8357,34
-0.3274,-9.8418,35
0.6913,-10.0357,36
-4.0483,-9.0981,37
8.5661,-10.5391,38
-0.9259,-10.0297,39
1.2908,-9.2997,40
4.783,-9.8221,41
2.6507,-9.8196,42
0.5832,-9.5309,43
0.0073,-10.4933,44
2.7262,-9.4857,45
3.2526,-9.4621,46
2.485,-9.4771,47
0.0949,-9.7129,48
0.5533,-9.7379,49
4.0169,-9.8851,50
1.2327,-8.7935,51
1.7129,-9.8501,52
2.8494,-9.784,53
2.0402,-8.4874,54
0.4179,-10.4539,55
-0.1577,-9.809,56
-4.9214,-9.7648,57
0.6835,-9.9325,58
-1.6016,-8.4939,59
-0.4969,-7.0623,60
0.0132,-9.362,62
1.278,-9.8559,63
2.4808,-9.7403,64
5.5763,-10.0232,65
7.5355,-9.6023,66
11.0397,-9.8468,67
-2.1113,-9.5898,68
0.7416,-9.9096,69
1.3458,-10.1583,70
0.6328,-9.0908,71
2.5619,-9.9293,73
0.5664,-9.7668,74
0.8145,-9.766,75
-0.1311,-9.7826,76
-0.2754,-9.5609,77
0.8051,-9.756,78
1.863,-8.8319,79
0.5749,-10.0022,80
1.7467,-10.1427,81
0.3434,-9.7358,83
0.9994,-9.7117,84
1.4626,-10.2498,85
2.9154,-9.8641,87
8.5068,-8.9253,88
-0.3745,-5.1882,89
-2.6417,-9.6869,90
1.6004,-9.8102,92
16.8213,-9.63,93
0.6055,-9.894,94
5.3674,-9.7908,95
3.1529,-9.7399,96
2.1364,-9.5181,97
11.5227,-9.7782,98
0.2283,-10.1838,99
-0.2327,-9.8519,102
0.2625,-10.3951,103
-0.1665,-10.1531,104
6.9933,-10.203,105
-2.1739,-10.5489,106
-0.6181,-9.766,107
-1.7403,-9.7536,108
0.3434,-9.8502,109
2.4536,-9.6911,111
-7.2477,-9.8429,112
0.1437,-9.815,113
-0.6164,-9.8028,114
-8.241,-9.7633,115
-8.1771,-9.6583,116
-467.4627,-7.6681,117
22.6714,-9.9635,118
-3.7263,-9.7242,119
4.8466,-9.6345,120
0.616,-9.8454,121
0.7009,-9.8232,122
-1.4997,-9.715,123
3.2527,-9.8529,124
1.1099,-9.8722,125
8.3369,-9.6614,126
0.5526,-9.269,128
0.724,-9.6688,129
-0.5194,-9.8985,130
-0.7602,-8.8454,131
1.7875,-10.0148,132
4.8968,-9.5715,133
0.5147,-9.8191,134
0.8619,-9.7991,135
1.1654,-9.8637,136
0.1672,-9.8423,137
0.8979,-9.9234,138
0.1024,-10.0029,139
6.39,-9.8227,140
-2.4226,-9.7957,141
3.7671,-10.3299,142
-0.7365,-9.7925,143
3.9727,-9.6828,144
1.4434,-9.704,145
-0.5617,-9.8557,146
0.6962,-9.8278,147
0.4627,-9.9296,148
0.5924,-9.7389,149
2.6442,-9.8346,150
6.3856,-9.5846,151
0.1107,-9.6122,152
0.1358,-10.0814,153
3.2689,-9.8049,154
-0.123,-9.7352,155
0.0748,-9.7089,156
2.7091,-9.8512,157
-1.7132,-9.9219,158
0.17,-9.1467,159
3.7199,-9.897,160
2.3798,-9.7102,161
1.8537,-9.2841,162
0.2629,-9.7549,163
0.6585,-9.6879,164
1.8443,-9.4859,165
4.2481,-9.8277,166
-0.0453,-9.7484,167
-0.263,-9.8491,168
-0.013,-9.6854,169
0.5373,-9.8844,170
2.2364,-10.1868,171
2.0664,-9.7957,172
-0.032,-10.7247,173
15.1082,-9.367,174
0.266,-10.1625,175
5.4617,-10.1634,177
5.647,-9.8224,178
-1.2341,-9.7254,179
3.5624,-9.0262,180
1.1365,-8.1739,181
-5.2717,-8.9577,182
0.7892,-10.1192,183
0.9647,-10.1715,184
-0.3625,-9.8891,185
2.4585,-9.4878,187
-0.188,-9.7337,188
-0.1503,-10.0116,189
1.5531,-9.6914,190
2.5872,-10.0409,191
0.0635,-9.8655,192
-0.6927,-9.7503,193
-1.6296,-9.8602,194
-1.9201,-9.7532,195
0.0051,-9.9775,197
3.4136,-10.1596,198
-7.0179,-9.4613,199
1.3705,-9.6169,200
0.3439,-10.1403,201
1.5848,-9.9241,202
-0.0752,-9.8275,203
-0.9272,-9.3969,204
0.4257,-9.7668,205
1.3769,-9.8691,207
0.6752,-9.925,208
0.1349,-9.8211,209
0.6911,-9.9979,210
0.2672,-10.0654,211
0.8624,-9.8308,212
1.7194,-10.2859,213
12.0641,-11.3888,214
11.3444,-9.6251,215
4.07,-9.958,217
1.5342,-9.4728,218
11.0302,-10.0239,219
14.3407,-10.0333,220
2.3074,-10.5825,221
8.339,-9.496,222
-4.082,-9.5354,223
6.3121,-9.6897,224
0.2704,-10.1786,225
0.4267,-9.1315,227
-0.2373,-9.7598,228
1.0624,-9.9545,229
0.2174,-9.2332,230
5.49,-9.5249,232
