AYGX_mean,AZ_mean,timestamp
0.2131,-9.7182,856
2.2465,-9.7366,857
13.142,-9.6673,859
-15.8927,-9.6677,860
36.6683,-9.4167,861
0.2239,-9.8822,862
-2.5009,-9.8327,863
-2.3745,-9.7294,864
-10.0334,-9.5999,865
-57.5358,-9.2307,866
20.6354,-9.5657,868
-3.0611,-9.7352,869
-1.4689,-9.6405,870
-0.0315,-9.6142,871
-0.7761,-9.6363,872
2.185,-9.6594,873
11.9579,-9.5549,874
-1.3911,-9.6937,875
15.0454,-9.6399,876
