AYGX_mean,AZ_mean,timestamp
0.0631,-9.755,3
0.0609,-9.7552,4
0.0419,-9.7559,5
0.0682,-9.7549,6
-0.0711,-9.7569,7
0.1409,-9.7525,8
0.0676,-9.7555,9
0.0691,-9.7534,10
1.0711,-9.7939,11
-0.9185,-9.7391,12
-0.3559,-9.7487,13
0.108,-9.756,14
0.0479,-9.758,15
-0.1176,-9.761,16
-0.5389,-9.7472,17
-0.5358,-9.7794,19
0.03,-9.7493,20
0.5375,-9.7329,21
-4.5151,-9.7756,22
55.7168,-9.458,23
1.9953,-9.782,24
0.245,-9.9721,25
9.6769,-9.7699,26
-3.682,-9.6872,27
1.7709,-9.8621,28
-8.4092,-9.6982,29
-3.5461,-9.5913,30
-0.1077,-9.5815,31
-0.0996,-9.581,32
-0.1178,-9.581,33
-0.1084,-9.5804,34
-0.115,-9.5807,36
-0.0859,-9.5805,37
-0.1213,-9.5809,38
-0.1383,-9.5808,39
-0.1358,-9.5801,40
20.3302,-9.5889,41
-14.4296,-9.6747,42
4.3723,-9.7253,43
1.9995,-9.811,44
-3.8201,-9.7644,45
7.2671,-9.7141,46
-2.4281,-9.8049,47
0.537,-9.7468,48
-0.9341,-9.7895,49
2.3893,-9.7927,50
-0.8286,-9.8013,51
-2.0191,-9.7779,52
0.4677,-9.7759,53
1.7659,-9.7898,54
-0.3343,-9.8081,56
-0.6272,-9.7877,57
1.5303,-9.7896,58
-0.1662,-9.808,59
0.58,-9.8153,60
0.1235,-9.8139,61
0.5222,-9.8149,62
0.3109,-9.8249,63
-0.9794,-9.8202,64
0.5045,-9.8184,65
0.1597,-9.8341,67
-0.0471,-9.8349,68
0.0496,-9.8324,69
-0.6025,-9.8221,70
0.0176,-9.8295,71
-2.2749,-9.8286,72
0.894,-9.8304,73
-5.3133,-9.7122,77
-0.0666,-9.7146,78
-0.0864,-9.7133,79
-0.1062,-9.7123,80
-0.1066,-9.7144,81
-0.0835,-9.7123,82
-0.0958,-9.7136,83
-0.0812,-9.7129,84
-0.0942,-9.7132,86
-0.0937,-9.7131,87
-0.0984,-9.7138,88
-0.0914,-9.714,89
-0.1009,-9.7135,90
-0.0844,-9.7162,91
-0.0967,-9.7137,92
-0.1072,-9.7138,93
-0.1012,-9.7141,94
-0.0964,-9.7147,95
-0.0914,-9.7147,96
-0.0846,-9.7137,97
-0.0947,-9.7141,98
-0.0857,-9.714,99
-0.1092,-9.7149,101
-0.1273,-9.7148,102
-0.1093,-9.7154,103
-0.1102,-9.7142,104
-0.1176,-9.716,105
-0.1199,-9.7157,106
-0.1208,-9.7152,107
-0.1216,-9.7167,108
-0.118,-9.7154,109
-0.1108,-9.7158,110
-0.1251,-9.7148,111
-0.1152,-9.7167,112
-0.1401,-9.7162,113
-0.1219,-9.7172,114
-0.1314,-9.7145,115
-0.1259,-9.7152,117
-0.1203,-9.7162,118
-0.1198,-9.7164,119
-0.1174,-9.7172,120
-0.1197,-9.7167,121
-0.1281,-9.7169,122
-0.1146,-9.7156,123
-0.1224,-9.7163,124
-0.1149,-9.7169,125
-0.1227,-9.7161,126
-0.1234,-9.7163,127
-0.1243,-9.7167,129
-0.1347,-9.7169,130
-0.123,-9.7178,131
-0.1138,-9.717,132
-2.5835,-9.6925,133
-0.3259,-9.711,134
-0.1049,-9.7091,135
-0.1257,-9.708,136
-0.1304,-9.7085,137
-0.1132,-9.7083,138
-0.1245,-9.709,139
-0.1202,-9.7086,140
-0.0949,-9.7074,141
-0.1287,-9.7079,142
-0.1354,-9.709,143
-0.13,-9.7081,144
-0.1339,-9.7081,146
-0.1339,-9.7085,147
-0.1255,-9.7098,148
-0.1332,-9.7082,149
-0.1401,-9.7104,150
-0.122,-9.7086,151
-0.1462,-9.7094,152
-0.1133,-9.7092,153
-0.1208,-9.7087,154
-0.1209,-9.7101,156
-0.1105,-9.7097,157
-0.101,-9.7076,158
-0.1158,-9.7087,159
-0.118,-9.7091,160
-1.2452,-9.7166,161
0.0957,-9.7335,162
-0.0695,-9.7305,163
-0.0938,-9.732,164
-0.1137,-9.7325,166
-0.1124,-9.7333,167
-0.1123,-9.7322,168
-0.1244,-9.733,169
-0.1288,-9.732,170
-0.114,-9.7309,171
-0.1071,-9.7324,172
-0.1471,-9.7318,173
-0.1139,-9.7323,174
-0.0916,-9.7327,175
-0.1103,-9.7317,176
-0.1025,-9.7312,177
-0.1155,-9.734,178
-0.1146,-9.7321,180
-0.109,-9.733,181
-0.095,-9.7304,182
-0.1302,-9.733,183
-0.132,-9.732,184
-0.0976,-9.7321,185
-0.1217,-9.7318,186
-0.1055,-9.7322,187
-0.1042,-9.7313,188
-0.1081,-9.7321,189
-0.1069,-9.7326,190
-0.1092,-9.7321,191
-0.096,-9.7328,192
-0.1151,-9.7318,193
-0.1181,-9.7327,194
-0.1232,-9.7313,195
-0.1211,-9.7321,196
-0.1167,-9.7327,197
-0.1057,-9.7326,198
-0.097,-9.733,199
-0.1069,-9.7316,200
-0.0974,-9.7321,201
-0.0951,-9.732,202
-0.1059,-9.7333,203
-0.0956,-9.7323,204
-0.1071,-9.7324,206
-0.1066,-9.7332,207
-0.094,-9.7341,208
-0.0887,-9.7344,209
-0.0948,-9.734,210
-0.1219,-9.734,211
-0.1139,-9.7331,212
-0.1294,-9.7324,213
-0.1193,-9.7327,214
-0.1094,-9.7342,215
-0.1244,-9.7321,216
-0.1359,-9.7325,217
-0.5957,-9.7361,219
-0.1449,-9.7331,220
-0.1185,-9.7324,221
-0.1206,-9.7325,222
-0.1167,-9.7334,223
-0.1268,-9.7347,224
-0.1246,-9.7322,225
-0.1477,-9.7317,226
-0.1111,-9.7326,228
-0.1148,-9.7325,229
-0.1232,-9.7317,230
-0.1215,-9.7332,231
-0.1176,-9.7329,232
-0.1161,-9.7324,233
-0.1,-9.7339,234
-0.1184,-9.7332,236
-0.1086,-9.7334,237
-0.1342,-9.7336,238
-0.1218,-9.7341,239
-0.1283,-9.7325,240
-0.1188,-9.7341,241
-0.1124,-9.7334,242
-0.1362,-9.7333,243
-0.1229,-9.7341,244
-0.1219,-9.7329,245
-0.1245,-9.7341,246
-0.1169,-9.7342,247
-0.1294,-9.7344,248
-0.1181,-9.7329,250
-0.1276,-9.7337,251
-0.1214,-9.7349,252
-0.1209,-9.7333,253
-0.1239,-9.734,254
-0.129,-9.7327,255
-0.1169,-9.7338,256
-0.1328,-9.7331,257
-0.1156,-9.7353,258
-0.1329,-9.734,259
-0.1194,-9.7342,260
-0.1203,-9.7342,261
-0.1234,-9.7336,262
-0.1109,-9.7344,263
-0.1271,-9.7339,264
-0.1279,-9.7337,265
-0.126,-9.734,266
-0.1265,-9.7342,267
-0.1242,-9.733,268
-0.1149,-9.734,269
-0.1196,-9.7344,270
-0.1022,-9.7339,271
-0.1134,-9.7346,272
-0.1195,-9.7347,273
-0.1153,-9.7343,274
-0.1195,-9.7343,276
-0.1216,-9.734,277
-0.1169,-9.7329,278
-0.129,-9.7332,279
-0.1319,-9.7331,280
-0.1301,-9.733,281
-0.1383,-9.734,282
-0.1316,-9.7344,283
-0.1085,-9.7333,284
-0.1257,-9.7338,286
-0.1402,-9.7344,287
-0.1436,-9.7342,288
-0.1295,-9.7343,289
-0.1198,-9.7326,290
-0.1234,-9.7332,291
-0.1277,-9.735,292
-0.1336,-9.7336,293
-0.1188,-9.7336,294
-0.1283,-9.7336,296
-0.1289,-9.7334,297
-0.1297,-9.7337,298
-0.1283,-9.7332,299
-0.1266,-9.7342,300
-0.1154,-9.7348,301
-0.0988,-9.7343,302
-0.1114,-9.7332,303
-0.1118,-9.7335,304
-0.1211,-9.7344,305
-0.1268,-9.733,306
-0.1236,-9.7341,307
-0.1311,-9.7342,308
-0.1299,-9.7338,309
-0.1197,-9.7341,310
-0.1144,-9.7328,311
-0.12,-9.7334,312
-0.1216,-9.7329,313
-0.1196,-9.7338,314
-0.1292,-9.7351,315
-0.1332,-9.734,316
-0.1232,-9.7336,317
-0.1172,-9.7324,318
-0.1344,-9.7343,319
-0.1215,-9.732,320
-0.1044,-9.7359,321
-0.1209,-9.7324,322
-0.1078,-9.7333,323
-0.0929,-9.7329,324
-0.1038,-9.7333,325
-0.0889,-9.7325,326
-0.0944,-9.733,327
-0.1043,-9.7334,328
-0.1029,-9.7336,329
-0.1171,-9.733,330
-0.1087,-9.7336,331
-0.1068,-9.7327,332
-0.1136,-9.7323,333
-0.1101,-9.7329,334
-0.1098,-9.7331,335
-0.1104,-9.7337,336
-0.1051,-9.7331,337
-0.1057,-9.7326,338
-0.1046,-9.7332,339
-0.1067,-9.7335,340
-0.0971,-9.7334,341
-0.102,-9.7324,343
-0.092,-9.7327,344
-0.1015,-9.7332,345
-0.104,-9.7332,347
-0.0997,-9.7327,348
-0.0938,-9.7328,349
-0.0992,-9.733,350
-0.0976,-9.7331,351
-0.1084,-9.7333,352
-0.1069,-9.7336,353
-0.0975,-9.7323,354
-0.1078,-9.7324,356
-0.1017,-9.7337,357
-0.1006,-9.7339,358
-0.1141,-9.7325,359
-0.1009,-9.7336,360
-0.0989,-9.7339,361
-0.0981,-9.7328,362
-0.092,-9.7346,363
-0.1067,-9.7333,364
-0.0887,-9.7327,365
-0.0975,-9.7344,366
-0.1205,-9.7334,367
-0.0947,-9.7347,368
-0.1097,-9.7341,370
-0.1041,-9.733,371
-0.1012,-9.733,372
-0.1105,-9.733,373
-0.117,-9.7348,374
-0.1242,-9.7333,375
-0.1089,-9.734,376
-0.1073,-9.7337,377
-0.1145,-9.7344,378
-0.1156,-9.7329,379
-0.1169,-9.7322,380
-0.1102,-9.7355,381
-0.1191,-9.7337,382
-0.1268,-9.7345,383
-0.1213,-9.7334,384
-0.1292,-9.7342,385
-0.1173,-9.7341,386
-0.1157,-9.7346,387
-0.1232,-9.734,388
-0.1242,-9.7343,389
-0.1222,-9.7341,390
-0.0929,-9.734,391
-0.1187,-9.733,392
-0.1043,-9.7331,393
-0.121,-9.7341,394
-0.1223,-9.7338,395
-0.1291,-9.734,396
-0.1189,-9.7349,397
-0.1175,-9.7333,398
-0.116,-9.7326,399
-0.1111,-9.7329,400
-0.1164,-9.7336,401
-0.1116,-9.734,402
-0.1326,-9.7329,403
-0.1125,-9.7328,404
-0.1239,-9.7346,405
-0.1111,-9.7324,406
-0.1057,-9.7345,407
-0.1199,-9.7322,408
-0.1308,-9.7331,409
-0.1242,-9.7326,410
-0.1338,-9.7335,411
-0.1435,-9.7338,412
-0.13,-9.7328,414
-0.1285,-9.7339,415
-0.1223,-9.7321,416
-0.1155,-9.7326,417
0.6198,-9.7391,418
-0.1825,-9.7366,419
-1.6644,-9.7386,421
-0.1198,-9.7346,422
-0.035,-9.7303,423
-0.1041,-9.7361,424
-0.2116,-9.7294,425
0.2272,-9.7338,426
-0.5908,-9.7324,427
-0.0093,-9.7343,428
-0.549,-9.7256,429
-0.9176,-9.7389,430
0.09,-9.726,431
-0.2558,-9.7336,432
-0.1438,-9.7361,433
-0.2163,-9.7316,435
-0.1787,-9.7314,436
-0.0385,-9.7325,437
18.3792,-9.7701,438
-1.9926,-9.7624,439
-4.577,-9.4828,440
1.2541,-9.7237,441
-1.5977,-9.783,442
-0.2681,-9.7303,443
-9.1444,-9.7244,444
14.2794,-9.6602,445
4.444,-9.8062,446
-7.9557,-9.806,447
7.9033,-9.7659,448
-2.3512,-9.8175,449
3.0158,-9.8546,450
3.0991,-9.8138,451
1.1671,-9.9708,452
0.1684,-9.9124,453
-9.7501,-9.8156,454
0.3163,-9.8566,456
2.6241,-9.8066,457
0.0788,-9.8973,458
0.3603,-9.7811,459
-0.3238,-9.8385,460
0.7775,-10.224,461
2.0181,-10.1266,462
5.6569,-10.0975,463
6.0484,-9.7711,464
2.0441,-9.8165,465
1.3332,-9.9654,466
-0.3071,-9.9415,467
-0.397,-9.7388,468
1.5216,-9.8973,469
0.7397,-9.861,471
0.0848,-9.8589,472
0.2234,-9.8751,473
-0.0084,-9.7965,474
0.0799,-9.7863,475
-0.1133,-9.6548,476
-1.1533,-9.8614,477
1.775,-9.7539,478
1.3669,-9.7597,479
0.2507,-9.8596,481
-0.2952,-9.8727,482
-0.077,-9.9812,483
0.2934,-10.1838,484
-0.8371,-9.876,485
3.1065,-9.9451,486
-0.1882,-9.7136,487
-0.2307,-9.7618,488
-0.691,-9.9981,489
-0.0509,-9.6621,491
-0.3959,-9.8599,492
-0.2914,-9.8476,493
-0.5027,-9.6861,494
0.0409,-10.2904,495
-0.2473,-9.7141,496
-0.0805,-9.8904,497
0.0951,-10.2351,498
0.3902,-9.9696,499
-0.1183,-9.766,501
0.4717,-9.9133,502
0.4183,-9.8863,503
-1.0565,-9.6536,504
0.9214,-9.7554,505
0.3778,-9.889,506
-0.1204,-9.8197,507
-0.4116,-9.5203,508
1.4298,-9.8818,509
-0.2991,-9.8351,510
-0.469,-9.8481,511
-0.0183,-9.8138,512
-0.2421,-9.8458,513
-1.7437,-9.9037,514
-8.758,-9.6701,515
-1.16,-9.5737,516
3.3061,-9.625,517
-1.372,-9.6266,518
0.7507,-9.6261,519
1.2625,-9.5967,520
-1.8692,-9.7,521
-0.3935,-9.6831,522
0.1733,-9.6732,523
0.4654,-9.6709,524
4.9727,-9.675,525
0.4048,-9.9579,526
2.6579,-9.8128,527
-1.5219,-9.5766,528
4.1788,-9.8308,529
0.425,-10.0034,530
-0.0006,-9.9143,531
0.576,-9.8009,532
0.4669,-9.8244,533
-0.0051,-9.7953,534
-0.006,-9.771,535
0.1419,-10.2974,536
0.3767,-9.8459,537
-0.1624,-9.8318,538
-0.4485,-9.7531,539
0.4758,-9.8593,541
0.7731,-9.8218,542
0.2818,-9.7377,543
0.7759,-9.7357,544
0.4589,-9.654,545
-0.5858,-9.9509,546
-0.3884,-10.0942,547
0.651,-9.6237,548
0.5829,-9.6796,549
0.1736,-9.9912,551
0.3155,-9.7677,552
0.1636,-9.6121,553
1.3677,-9.9937,554
0.8239,-9.7711,555
0.3395,-9.5694,556
0.1853,-9.8456,557
0.1286,-9.8188,558
-0.2345,-9.7516,559
-0.1063,-9.836,561
0.1073,-9.8639,562
0.3217,-9.8657,563
-0.1245,-9.943,564
0.7947,-9.8698,565
-0.1594,-9.8377,566
-0.5212,-9.8451,567
0.2175,-9.867,568
-0.1663,-9.8122,569
-1.3112,-9.8667,570
0.205,-9.8191,571
-1.5564,-9.8441,572
-0.9532,-9.839,573
-0.828,-9.8382,574
-1.6635,-9.7559,575
0.771,-9.8266,576
-0.3823,-9.8467,577
-3.3068,-9.8371,578
-5.5139,-9.7309,579
-0.0806,-9.6908,580
1.8008,-9.7485,581
-1.2697,-9.7283,582
-0.4202,-9.7155,583
6.6635,-9.7069,584
0.6697,-9.7213,585
2.2512,-9.8399,586
-1.4304,-9.8703,587
1.963,-9.7649,588
1.2266,-9.948,589
2.4598,-9.6053,590
0.6706,-9.8147,591
0.0403,-9.6999,592
-0.35,-9.9232,593
0.6021,-9.773,594
0.2109,-9.2967,595
1.0494,-8.9805,596
1.0122,-9.865,597
0.6628,-9.8206,598
1.2539,-10.0271,599
0.2463,-9.7971,600
-0.0609,-9.7122,601
1.9732,-10.0466,602
1.7377,-8.9534,603
0.4637,-5.9696,604
1.7417,-9.4213,606
0.3586,-9.8082,607
-0.4295,-9.7025,608
0.1477,-10.0068,609
1.5319,-9.8838,610
-0.0991,-9.869,612
0.3279,-9.8898,613
0.0837,-9.8661,614
1.6065,-9.9364,616
1.1995,-9.4833,617
4.0345,-8.9404,618
1.2876,-9.71,619
0.4492,-9.0509,620
-0.0371,-9.9551,621
0.0797,-10.246,622
0.2676,-9.5194,623
2.8738,-9.8367,624
0.4817,-9.6991,626
0.7453,-9.9077,627
0.7272,-9.8765,628
0.3528,-9.791,629
0.2963,-9.8136,630
-0.0013,-9.9366,631
1.003,-9.7633,632
-0.2645,-10.2003,633
0.2102,-9.7436,634
0.3174,-9.9472,636
-0.0832,-9.7117,637
-0.0414,-9.8536,638
-0.3044,-9.2628,639
0.094,-9.9726,640
1.2594,-9.7181,641
0.1709,-9.9326,642
0.5341,-9.7297,643
0.0282,-9.9087,644
0.1071,-9.871,645
0.3009,-9.7585,646
0.3338,-9.7168,647
0.296,-9.8389,648
1.3984,-9.8985,649
1.0067,-9.7566,650
0.1008,-9.6392,651
1.6128,-9.4154,652
0.1222,-9.5472,653
0.2646,-9.6383,654
0.0494,-9.8406,655
0.0751,-9.6564,656
0.0333,-9.7617,657
0.2985,-10.0262,658
0.5491,-10.0293,659
-0.358,-10.2507,660
-0.0954,-9.6147,661
2.1443,-10.1364,662
0.1322,-9.3834,663
-0.1309,-10.104,664
-0.0239,-9.833,666
-0.0202,-9.5273,667
1.373,-9.6344,668
-0.7148,-9.8613,669
1.0318,-9.8199,670
0.5525,-9.2764,671
0.1478,-9.9111,672
0.6868,-9.6889,673
0.942,-9.9867,674
0.7026,-9.6995,676
0.3137,-9.913,677
0.4287,-9.0152,678
0.4231,-9.6912,679
0.3672,-9.6415,680
0.2012,-9.7622,681
0.1809,-9.8002,682
0.0191,-9.7908,683
2.438,-10.4332,684
0.6835,-9.7525,686
0.7424,-10.0403,687
-0.0673,-9.4815,688
-0.0352,-9.0906,689
0.0865,-9.9194,690
-0.152,-9.7496,691
5.9127,-10.2702,692
1.6718,-9.9999,693
-0.4395,-9.7425,694
-0.3832,-9.5851,696
-3.7103,-10.3387,697
11.3595,-9.3651,698
5.1338,-9.6451,699
2.0279,-9.3959,700
2.7721,-9.7273,701
0.2946,-10.255,702
-1.3606,-9.5204,703
0.3173,-9.9049,704
0.0591,-9.9012,705
0.368,-9.8396,706
0.7675,-9.8991,707
0.6035,-10.1396,710
2.2411,-9.5437,711
4.6835,-10.1059,712
0.0028,-9.7645,713
0.908,-9.7221,714
0.1547,-9.6383,715
0.7217,-9.6287,716
-0.2147,-9.8087,717
0.3475,-9.7465,718
-0.208,-9.5338,719
-0.0499,-9.6048,720
-3.5708,-9.981,721
-0.1849,-9.7737,722
-2.9275,-10.0228,723
-0.8612,-9.6553,724
1.3256,-9.8863,725
-0.2583,-9.8843,726
0.1869,-9.7833,727
-5.7069,-9.8163,728
-0.7286,-10.0945,729
-0.252,-8.9209,730
0.0278,-9.5541,731
-0.2353,-9.4845,732
-0.9329,-10.0307,733
0.0873,-10.1856,734
-0.4182,-9.8532,736
0.1121,-9.812,737
0.152,-9.8086,738
0.0641,-9.8969,739
-0.6493,-10.0635,740
-0.1479,-10.0614,741
-0.1132,-10.1927,742
0.7581,-9.8509,743
0.1301,-10.0863,744
0.1002,-9.8441,746
0.1726,-9.8195,747
0.0122,-9.8965,748
1.0928,-9.6572,749
-0.3889,-9.1694,750
0.6454,-9.8498,751
-0.8811,-10.1961,752
0.4628,-9.921,753
1.7393,-9.7448,754
0.5283,-9.6451,756
2.322,-9.6354,757
3.0311,-9.8669,758
0.0754,-9.8317,759
2.0417,-9.9791,760
1.98,-10.0217,761
1.2244,-9.7597,763
-0.4961,-9.8931,764
0.5479,-9.7558,766
-0.1596,-9.9381,767
0.2078,-9.8298,768
0.1638,-9.9149,769
-0.15,-9.7481,770
0.1535,-10.0969,771
0.0641,-9.731,772
-2.8096,-9.6608,773
0.9051,-9.9669,774
4.1808,-9.7953,775
0.5553,-9.7509,776
1.0953,-9.8169,777
0.3596,-9.9162,778
4.4223,-9.9478,779
0.6555,-10.4653,780
-0.7389,-9.9767,781
-0.9073,-10.049,782
0.1757,-9.9572,783
0.102,-9.849,784
-0.1099,-9.836,785
0.0568,-10.0492,786
1.0959,-9.8638,787
0.7689,-9.6,788
0.3932,-9.7985,789
-0.4094,-9.7243,790
0.5036,-9.8392,791
4.8578,-9.8431,792
0.306,-8.9704,793
0.25,-9.85,794
0.9396,-10.0685,795
0.2582,-9.8697,796
0.0269,-9.7634,797
0.0708,-9.9736,798
0.8975,-9.8471,799
-3.2987,-9.8249,800
-0.1712,-9.7948,802
0.1108,-9.7928,803
-0.0964,-9.8044,804
0.0233,-9.7977,805
0.1524,-9.7989,806
0.0636,-9.7985,807
0.0462,-9.7981,808
0.2391,-9.7998,809
0.0591,-9.7989,811
-0.0075,-9.7986,812
-0.0087,-9.793,813
-0.2879,-9.7912,814
0.4223,-9.7955,815
0.1771,-9.7986,816
-2.5408,-9.7818,817
-5.0548,-9.6555,818
7.7053,-9.7467,819
0.5069,-9.8066,821
-0.1419,-9.8057,822
0.1147,-9.8028,823
0.201,-9.7837,824
1.812,-9.8059,825
0.0506,-9.8431,826
-0.058,-9.8664,827
0.1182,-10.15,828
0.8758,-9.8551,829
-2.2433,-9.911,831
1.0511,-9.8104,832
-0.941,-9.7168,833
-2.3451,-9.5843,834
-1.9336,-9.7894,835
-2.2009,-9.6201,836
0.2074,-9.8581,837
-1.534,-9.5211,838
0.642,-9.8116,839
-0.9346,-9.2019,840
0.5238,-9.8327,841
-0.1236,-9.6972,842
-0.2782,-9.4422,843
-1.7588,-9.884,844
1.1133,-9.8115,845
4.602,-8.8939,846
-1.0669,-9.2024,847
0.1428,-10.1972,848
-0.9926,-9.8836,849
-1.854,-9.8027,850
1.223,-9.0624,851
2.2365,-9.8085,852
-0.8887,-9.838,853
-0.2097,-9.83,854
-0.7222,-9.8414,855
0.274,-10.0071,856
-1.0974,-9.8329,857
-0.5531,-9.7555,858
-0.894,-9.7966,859
0.9878,-10.2148,860
-0.8266,-9.8357,861
0.4524,-9.7049,862
-1.3554,-9.848,863
-0.0747,-9.1251,864
-0.9424,-9.9754,865
-1.7175,-10.0249,866
1.0148,-9.9338,867
-0.6822,-9.9165,868
-0.6521,-9.7661,869
0.3561,-9.8424,871
0.6222,-9.4932,872
-0.9388,-9.6268,873
2.8347,-9.8785,874
1.5621,-9.8273,875
-0.0649,-9.74,876
1.6848,-9.5515,877
-0.4674,-9.8353,878
0.5219,-9.8299,879
-0.1367,-9.8164,880
-0.6258,-9.8986,881
-0.012,-9.7208,882
0.7173,-9.889,883
-0.761,-9.9115,884
3.8899,-9.8454,885
-1.0077,-9.7199,886
4.0615,-9.147,887
11.6476,-10.2432,888
5.2293,-9.1225,889
-0.0638,-9.7986,891
0.3996,-9.3994,892
-0.2379,-9.4571,893
-0.8331,-9.5154,894
-0.0929,-9.9545,895
0.9762,-9.9923,896
1.0528,-9.9161,897
-1.0179,-9.5176,898
-0.0481,-9.9634,899
0.6836,-9.5054,900
0.1817,-9.5783,901
1.674,-9.6746,902
2.3147,-9.9739,903
0.6335,-8.7927,904
-0.2269,-9.822,905
-0.3499,-10.4196,906
-0.438,-10.0929,907
0.9806,-10.5714,908
0.0111,-9.7922,909
-1.2783,-10.2876,910
-0.5089,-9.775,911
0.1731,-9.99,912
0.2897,-9.8142,913
0.7515,-9.8131,914
0.2069,-9.1351,915
-0.2592,-9.6462,916
-1.1019,-10.3146,917
1.1687,-10.3311,918
0.1375,-9.7956,919
0.682,-10.1147,920
0.4271,-9.8956,921
0.825,-9.644,922
0.3538,-9.8523,923
0.3563,-9.4452,924
-1.0645,-10.4574,925
0.0734,-8.7496,926
-0.2363,-10.1962,927
0.5402,-9.7086,928
-0.8484,-9.5086,929
-0.1321,-9.899,931
0.0465,-9.6516,932
1.3413,-9.8127,933
-0.1593,-9.7908,934
0.5265,-10.5204,935
-0.5765,-9.6553,936
0.2687,-9.896,937
0.4174,-9.8892,938
0.465,-8.656,939
0.118,-9.5677,941
0.2842,-9.9061,942
-0.1093,-9.9029,943
0.2057,-9.7233,944
0.055,-9.8416,945
0.4405,-9.8947,946
3.5872,-9.9219,947
-0.0814,-9.2807,948
0.1454,-9.6613,949
1.9604,-9.4052,951
-2.3759,-9.0806,952
1.7494,-8.3418,953
0.9795,-9.0406,954
-0.8344,-9.6218,955
-1.056,-9.9311,956
-0.8599,-9.58,957
0.2525,-9.853,958
0.2178,-9.7455,959
3.0191,-9.7709,961
0.8701,-9.6668,962
0.9017,-9.6678,963
-1.6867,-9.7058,964
0.3694,-9.6388,965
-0.3666,-9.8038,966
-0.3164,-9.5354,967
0.3837,-9.9377,968
0.3916,-9.8792,969
-0.6058,-9.8575,971
0.2929,-9.7824,972
-0.6203,-9.8555,973
0.5742,-9.9052,974
0.2359,-9.8011,975
0.9908,-10.1991,976
0.3714,-9.8574,977
-0.1431,-9.6643,978
-0.0273,-9.8905,979
0.2042,-9.8001,980
0.4921,-10.1279,981
0.0247,-9.5444,982
0.0502,-10.1619,983
-0.2131,-9.0833,984
0.57,-10.1045,985
-0.087,-9.8446,986
-0.2072,-9.7768,987
-0.232,-9.7751,988
-0.0983,-9.9098,989
0.0746,-9.5974,990
0.2279,-8.109,991
-0.8697,-9.2413,992
0.2708,-9.792,993
-0.1435,-9.9376,994
0.3373,-9.9718,995
-0.3926,-9.7758,996
0.8057,-9.7458,997
0.5851,-9.767,998
-0.1535,-9.9476,999
0.6484,-9.8467,1001
1.0062,-9.526,1002
0.2038,-9.7332,1003
0.2397,-9.7466,1004
0.8433,-9.983,1005
-0.343,-10.1113,1006
2.6974,-10.0966,1007
1.5603,-9.7052,1008
-0.2923,-10.0744,1009
0.5302,-9.8189,1011
-0.0991,-9.7849,1012
0.0842,-9.9818,1013
-0.1574,-9.7891,1014
0.0727,-9.8678,1015
-0.8472,-9.908,1016
0.1858,-9.7783,1017
-0.6656,-9.7877,1019
-0.013,-9.8623,1021
-0.7642,-9.8377,1022
0.1795,-9.4238,1023
0.883,-9.8497,1024
0.4101,-9.6596,1025
0.7092,-9.8054,1026
-1.8814,-9.5803,1027
0.2688,-9.1578,1028
0.9191,-9.8021,1029
-0.3629,-10.0279,1030
-0.0656,-9.1,1031
-0.3845,-9.8557,1032
-0.3553,-10.0221,1033
-0.3223,-9.9865,1034
-0.1398,-10.0663,1035
0.5664,-9.8472,1036
-2.1613,-6.8811,1037
0.0431,-10.0095,1038
-0.0225,-9.828,1039
0.9943,-9.6938,1040
-0.1192,-9.9169,1041
0.2709,-9.641,1042
1.6551,-10.2628,1043
0.4722,-10.3767,1044
0.3612,-10.3414,1045
-1.3046,-9.5548,1046
1.2071,-9.7776,1047
0.108,-8.8155,1048
0.1491,-9.8218,1049
-0.1163,-10.0278,1050
0.3524,-9.8592,1051
-0.0351,-9.8538,1052
-0.4639,-9.8566,1053
-0.4445,-9.7969,1054
0.5412,-9.7153,1055
-1.6363,-9.6707,1056
-1.0752,-9.7639,1057
-0.4995,-9.8062,1058
-0.0321,-9.5757,1059
0.8859,-9.7451,1061
1.9707,-10.1623,1062
1.281,-9.5844,1063
-0.2876,-9.4585,1064
-0.4295,-9.7285,1065
2.9283,-10.1308,1066
0.4329,-10.0038,1067
0.6119,-9.8168,1068
0.3397,-9.5541,1069
-0.5415,-9.9127,1071
-0.8025,-9.7514,1072
0.374,-10.2189,1073
0.399,-9.8437,1074
-0.7625,-9.8664,1075
-0.1852,-10.0317,1076
0.6285,-9.973,1077
0.0321,-9.7901,1078
-0.8906,-9.8512,1079
1.3038,-10.0143,1081
1.3593,-9.4753,1082
-0.4249,-9.5393,1083
0.21,-9.8025,1084
-1.8555,-8.9819,1085
4.9585,-9.4434,1086
-0.3697,-10.0206,1087
-0.5865,-9.4664,1088
-0.4811,-9.8997,1089
-0.1915,-9.5997,1091
0.5814,-9.7562,1092
0.1819,-9.887,1093
-0.6673,-9.8213,1094
0.0796,-9.8459,1096
-0.1219,-9.8008,1097
0.1135,-9.9213,1098
-0.0266,-9.2243,1099
-0.9076,-8.5754,1100
0.0649,-10.1994,1101
-0.2781,-9.8702,1102
0.7269,-9.743,1103
0.7062,-9.5067,1104
-0.9543,-9.2388,1105
-0.4301,-9.5551,1106
0.6864,-9.9034,1107
1.8226,-8.6207,1108
-0.0185,-9.8225,1109
-0.4296,-9.9021,1110
-0.6758,-9.8751,1111
2.6712,-9.815,1112
-0.8281,-9.8112,1113
-0.9997,-9.6521,1114
1.3456,-9.5349,1115
-0.6198,-9.9894,1116
0.2736,-10.0071,1117
0.1814,-9.8969,1118
-0.5798,-9.885,1119
1.6055,-9.8202,1120
-0.9061,-9.8868,1121
0.0785,-9.5943,1122
0.2933,-9.8599,1123
-0.1846,-9.8191,1124
-0.4693,-9.8757,1125
-0.38,-9.6605,1126
-0.5605,-9.5915,1127
0.3098,-9.8562,1128
0.6395,-9.8341,1129
0.1666,-9.7657,1131
-0.2471,-9.8444,1132
0.0069,-9.8075,1133
-0.6614,-9.9128,1134
-0.186,-9.6487,1135
-0.5274,-9.7481,1136
-0.2908,-9.5639,1137
-0.1026,-9.833,1138
-0.2838,-10.3859,1139
0.0398,-9.8914,1141
0.0228,-9.8241,1142
-1.0717,-10.3513,1143
-0.5418,-9.9392,1144
-0.1479,-10.2566,1145
1.2516,-9.9439,1146
-0.7551,-9.4657,1147
-0.4111,-9.8569,1148
-0.16,-9.8762,1149
-0.9087,-9.6084,1150
-0.5474,-9.8342,1151
0.2034,-9.8855,1152
-0.2297,-9.8891,1153
1.1385,-9.9741,1154
-0.2932,-9.8362,1155
1.5071,-9.4616,1156
0.1303,-8.4311,1157
0.4949,-6.5454,1158
-1.004,-9.7362,1159
-0.9001,-9.7956,1160
-1.8061,-9.2906,1161
0.5087,-9.8459,1162
1.3303,-9.7149,1163
4.9962,-9.7407,1164
-1.2453,-9.8657,1165
0.4828,-10.1973,1166
0.6008,-9.7489,1167
-2.6897,-8.5367,1168
-0.4667,-9.9177,1169
0.6111,-9.6602,1170
0.3195,-9.8341,1171
0.1455,-9.8481,1172
0.0815,-9.8084,1173
0.8397,-10.0803,1175
0.0342,-9.8932,1176
0.0679,-9.8264,1177
-0.2921,-9.8304,1178
-0.1431,-9.8422,1179
1.9253,-9.7896,1181
-1.2381,-9.6303,1182
11.4451,-9.8865,1183
3.8768,-9.9847,1184
-9.1175,-10.2892,1185
15.8836,-9.4897,1186
0.4027,-9.5453,1187
-0.2549,-9.7522,1188
0.353,-10.0377,1189
0.9433,-9.8323,1191
-0.2145,-9.8249,1192
0.4391,-9.8193,1193
-0.0933,-9.8189,1194
-0.2702,-9.9426,1195
-0.1613,-9.9616,1196
-0.0097,-9.8839,1197
-0.2171,-9.8357,1198
-0.134,-9.7158,1199
0.0233,-9.8538,1201
1.0341,-9.7978,1202
0.5182,-9.8562,1203
0.4245,-9.8685,1204
0.6304,-9.8361,1205
0.8382,-9.8262,1206
0.0824,-9.8409,1207
-1.0784,-9.8662,1208
0.8471,-9.7988,1210
0.4707,-9.8038,1211
-1.2843,-9.1435,1212
3.6161,-8.6765,1213
0.162,-9.9959,1214
-0.0998,-9.2036,1216
0.0019,-9.7344,1217
0.6609,-10.3158,1218
2.333,-6.0638,1219
-1.1716,-9.5474,1220
1.6075,-9.6777,1221
-2.6554,-9.9541,1222
2.4092,-9.7867,1223
2.0638,-9.7917,1224
-0.4272,-9.8265,1225
1.5909,-9.8776,1226
-0.5111,-9.7706,1227
-2.7091,-9.9285,1228
2.3202,-9.9818,1229
-1.2923,-9.8564,1230
-1.0634,-9.8266,1232
1.5278,-9.9111,1233
-1.9623,-9.8265,1234
-0.7128,-9.7986,1235
-0.0429,-9.7864,1236
0.3323,-9.904,1237
0.906,-9.9954,1238
-4.077,-9.7298,1239
1.8502,-9.763,1240
-0.1011,-9.9117,1241
0.0109,-9.7638,1243
-2.4527,-9.7269,1244
-0.4101,-9.8227,1247
-2.6421,-9.8893,1248
0.2281,-9.7861,1249
-1.9834,-9.9023,1250
-0.7175,-9.7265,1251
-4.7494,-9.8059,1252
-1.8924,-9.9789,1253
0.6663,-10.1848,1254
-0.9338,-9.8262,1256
2.6934,-9.7283,1257
-0.1437,-9.7957,1258
0.0491,-9.7978,1259
0.8576,-9.7261,1260
-1.0941,-9.7712,1261
-0.643,-9.7723,1262
0.1054,-9.8105,1263
1.3275,-9.818,1264
0.2184,-9.833,1266
-0.6088,-9.8109,1267
0.099,-9.7566,1268
0.437,-10.0959,1269
0.527,-9.9137,1270
0.0836,-9.9412,1271
2.2659,-9.6112,1272
-0.8948,-9.8051,1273
-3.555,-9.8125,1274
2.8204,-9.7676,1276
0.3647,-9.8337,1277
-0.0855,-9.834,1278
-0.7255,-9.8209,1279
-0.0715,-9.8271,1280
-0.3148,-9.8137,1281
0.1052,-9.817,1282
-0.53,-9.8178,1283
0.6483,-9.8013,1284
0.0782,-9.817,1286
0.4989,-9.8092,1287
0.8154,-9.8237,1288
0.4227,-9.8174,1289
-1.0803,-9.8007,1290
-0.2567,-9.8119,1291
0.1222,-9.7837,1292
0.3796,-9.8201,1293
0.2773,-9.8126,1294
-0.0354,-9.8139,1295
0.0485,-9.8099,1296
-0.0063,-9.811,1298
0.1463,-9.8121,1299
0.0199,-9.81,1300
0.0214,-9.813,1301
-0.0012,-9.8126,1302
0.206,-9.8126,1303
-0.0947,-9.8147,1304
0.0046,-9.8141,1306
0.0899,-9.8153,1307
-0.0225,-9.8143,1308
0.0883,-9.8152,1309
-0.1627,-9.8148,1310
0.1937,-9.815,1311
0.0732,-9.8166,1312
0.1349,-9.8182,1313
-0.1324,-9.8152,1314
0.1653,-9.815,1315
0.0628,-9.818,1316
0.0262,-9.8192,1319
0.1512,-9.8178,1320
0.1484,-9.8175,1321
0.0129,-9.8202,1322
-0.0118,-9.819,1323
0.359,-9.8187,1324
0.1264,-9.8229,1326
0.0276,-9.8206,1327
0.1093,-9.8234,1328
0.1094,-9.8229,1329
0.2923,-9.8235,1330
0.1411,-9.8224,1331
0.0779,-9.8247,1332
0.1022,-9.8243,1333
0.0105,-9.8264,1334
0.0534,-9.825,1335
-0.0038,-9.8252,1337
0.0857,-9.8255,1338
-0.0067,-9.8257,1339
0.1929,-9.8264,1340
-0.0163,-9.8273,1341
0.0022,-9.8255,1342
0.2354,-9.8259,1343
0.0755,-9.8245,1344
0.0817,-9.8268,1345
-0.0185,-9.8263,1346
0.1136,-9.8266,1347
0.0015,-9.8271,1348
0.1951,-9.8276,1349
0.0773,-9.8288,1350
-0.0145,-9.8284,1351
0.0244,-9.8266,1352
-0.3851,-9.829,1353
0.1512,-9.8292,1354
-0.0202,-9.8277,1355
-0.0549,-9.8276,1356
0.0711,-9.8301,1357
-0.0063,-9.8285,1358
0.112,-9.83,1359
0.0577,-9.8279,1360
0.0647,-9.8286,1361
-0.0186,-9.8304,1362
0.0054,-9.8283,1363
-0.0047,-9.8276,1364
0.0395,-9.8291,1365
-0.0524,-9.8305,1366
-0.0399,-9.8277,1367
0.0771,-9.8274,1368
-0.0003,-9.8277,1369
0.0891,-9.8291,1370
0.1296,-9.8296,1371
0.0463,-9.8322,1372
-0.109,-9.8302,1373
0.096,-9.8297,1374
0.166,-9.8289,1375
0.1086,-9.8307,1376
0.0442,-9.8352,1378
0.1303,-9.836,1379
0.0263,-9.8394,1380
-0.0509,-9.8428,1381
0.1453,-9.8364,1382
-0.0171,-9.8418,1383
-1.1338,-9.8246,1384
0.1028,-9.8323,1386
0.0614,-9.8354,1387
0.0937,-9.8442,1388
0.1579,-9.8325,1389
-2.4497,-9.8157,1390
-4.8081,-9.785,1391
-7.9238,-9.6488,1392
0.8682,-9.7951,1393
0.3621,-9.8082,1394
1.584,-9.8124,1396
-0.1081,-9.6076,1397
1.2912,-8.0039,1398
1.8049,-9.7804,1399
-0.661,-9.868,1400
-1.3409,-9.9378,1401
5.521,-9.8523,1402
1.0114,-9.7955,1403
-2.3177,-9.837,1404
-2.7369,-9.7926,1406
0.2074,-9.7848,1407
-0.8881,-9.7754,1408
-2.4422,-9.9483,1409
-0.2499,-9.6734,1410
-0.5365,-9.86,1412
0.1635,-9.6957,1413
-0.4285,-9.4837,1414
-0.2371,-9.7029,1416
0.0078,-10.0343,1417
3.0904,-9.158,1418
3.3378,-9.8216,1419
0.2436,-9.915,1420
0.6994,-9.7747,1421
-0.1954,-9.9141,1422
-0.2442,-9.6306,1423
0.8294,-9.8427,1424
-0.9586,-9.8066,1425
0.5871,-9.8834,1426
-0.7559,-9.8872,1427
-0.1214,-9.8434,1428
-0.0458,-9.9634,1429
1.6236,-9.7498,1430
-0.2844,-9.8799,1431
-0.4123,-9.8165,1432
-1.8051,-9.8161,1433
-0.0651,-9.8672,1434
-1.9285,-9.8445,1435
0.1624,-9.8634,1436
-0.0185,-9.8419,1437
-0.3756,-10.1049,1438
0.527,-9.9087,1439
2.7547,-9.7721,1440
0.0754,-9.8793,1441
-0.1507,-9.681,1442
-0.2748,-9.8016,1443
-0.5613,-9.8701,1444
2.3293,-10.0558,1446
-0.4705,-9.851,1447
-0.1905,-9.9059,1448
-2.5488,-9.8874,1449
-0.6558,-9.8601,1450
-1.0928,-9.7831,1451
-0.3357,-9.6518,1452
0.0876,-9.7947,1453
0.6798,-9.8897,1454
0.7402,-9.7805,1456
-0.3407,-9.8324,1457
4.145,-9.6202,1458
0.5422,-10.0478,1459
-1.1298,-9.8757,1460
-0.6818,-10.1355,1461
-0.4223,-9.9169,1462
-1.3922,-9.8909,1463
0.0741,-9.8738,1464
-2.1509,-9.933,1466
-0.7193,-9.8298,1467
0.518,-9.9097,1468
1.6886,-9.7633,1469
-1.6857,-10.0117,1470
0.3054,-9.9286,1472
-1.4655,-9.8106,1473
-0.308,-9.818,1474
-1.0361,-9.7817,1475
1.5973,-9.8556,1477
1.3284,-9.8755,1478
0.1573,-9.8237,1479
-0.5208,-9.8337,1480
5.2929,-9.7808,1481
1.2274,-9.8929,1482
2.6597,-9.8814,1483
0.9161,-9.8489,1484
-0.3841,-9.7663,1486
-0.1752,-9.8151,1487
-0.6021,-9.8086,1488
0.2043,-9.8346,1489
0.1729,-9.794,1490
0.5783,-9.8764,1491
1.2678,-10.0418,1492
1.4916,-9.7152,1493
0.5023,-9.7874,1494
0.4244,-9.9426,1495
0.0098,-9.8822,1496
0.3049,-9.7968,1497
0.0709,-9.8162,1498
0.8049,-9.9285,1499
0.2764,-9.7708,1500
-0.6739,-9.8554,1501
1.5722,-9.885,1502
0.7626,-9.7179,1503
-0.4605,-9.8433,1504
0.2037,-9.7974,1506
2.0645,-9.9496,1507
0.3586,-9.9119,1508
1.1573,-9.5701,1509
3.9146,-9.8818,1510
3.2028,-9.7416,1511
-0.252,-9.5251,1512
-0.0511,-9.7795,1513
-0.4851,-9.6883,1514
0.452,-9.8498,1516
0.3636,-9.7934,1517
1.8192,-9.9557,1518
6.2613,-9.9106,1519
-3.6618,-9.7843,1520
-6.546,-9.6872,1522
0.5138,-9.7534,1523
-0.0795,-9.7542,1524
-0.6371,-9.759,1525
0.5941,-9.7515,1526
0.0485,-9.7563,1527
-0.1089,-9.7484,1528
0.5129,-9.7525,1529
0.0556,-9.7499,1531
-0.1026,-9.7516,1532
0.1519,-9.7431,1533
0.0205,-9.7437,1534
0.0418,-9.7448,1535
0.0898,-9.7448,1536
0.1561,-9.743,1537
0.1462,-9.741,1538
-0.0668,-9.7394,1539
0.2708,-9.7396,1540
-0.1674,-9.7396,1541
0.0151,-9.7339,1542
0.2253,-9.7372,1543
-0.1903,-9.7347,1544
0.05,-9.7312,1545
0.0418,-9.7327,1546
-0.0061,-9.734,1547
0.1768,-9.7327,1548
-0.182,-9.7289,1549
0.1911,-9.7265,1551
0.0968,-9.7269,1552
-4.6748,-9.684,1553
-0.4615,-9.6469,1554
-4.2017,-9.5835,1555
3.1814,-9.4433,1556
-2.3074,-9.7031,1557
10.4813,-9.6699,1558
1.9867,-9.7956,1559
-1.8494,-9.6515,1560
-0.0155,-9.8168,1561
-0.983,-9.7694,1562
1.3249,-9.8624,1563
0.0238,-9.8004,1564
-0.2002,-9.9329,1565
-26.1627,-7.774,1566
0.8305,-9.7112,1567
-0.7177,-9.9694,1568
-0.1882,-10.0097,1569
0.4912,-9.8702,1571
0.0318,-9.9505,1572
-0.5102,-9.4523,1573
-1.6782,-9.9544,1574
0.3736,-10.0395,1575
-0.2824,-9.8038,1576
0.2329,-9.9886,1577
0.0482,-9.8325,1578
-1.168,-9.6055,1579
0.4986,-9.9101,1581
1.845,-9.8876,1582
-0.9042,-10.0832,1583
-3.5647,-9.8801,1584
2.6054,-9.7953,1585
1.5821,-9.8402,1586
5.2101,-9.9622,1587
-1.1352,-9.6066,1588
0.4329,-9.8269,1591
-1.0218,-9.7882,1592
0.3572,-9.8742,1593
1.4744,-9.8483,1594
-3.186,-9.6828,1595
-1.2345,-9.0284,1596
-1.3106,-10.1255,1597
-1.2145,-9.6771,1598
-2.8666,-9.6788,1599
-0.146,-9.5969,1601
0.7434,-9.7744,1602
-0.0513,-9.1801,1603
4.8471,-9.7149,1604
-1.9488,-10.1,1605
-0.3297,-9.9477,1606
-0.7105,-9.6611,1607
1.1621,-10.0032,1608
-0.1946,-9.8143,1609
1.1675,-10.0755,1611
-8.3926,-9.7699,1612
-5.3819,-9.4476,1613
17.1832,-9.6095,1614
27.5538,-9.5956,1615
0.3913,-9.7473,1616
14.1418,-9.9486,1617
4.3879,-9.7328,1618
1.4174,-9.9809,1619
0.4245,-9.9134,1620
2.6942,-9.8675,1621
2.3386,-9.8475,1622
-0.1352,-9.8319,1623
0.0268,-10.0172,1624
-0.5337,-9.865,1625
-0.924,-9.793,1626
0.9654,-9.8398,1628
-0.1778,-9.9437,1629
-0.8274,-9.9305,1630
-0.8403,-9.721,1631
-1.4621,-9.7681,1632
1.3305,-9.8954,1633
10.5502,-9.7792,1634
0.1152,-9.9519,1636
-29.969,-9.4934,1637
14.1965,-9.0593,1638
16.9683,-8.7925,1639
-7.667,-9.4707,1640
1.6081,-9.6115,1642
0.0584,-9.5747,1643
-13.2109,-9.5235,1644
-0.5347,-8.7772,1645
-6.5747,-8.6221,1646
14.4042,-8.3465,1647
-46.7843,-7.6652,1649
-47.107,-7.9047,1650
-46.4618,-7.69,1652
3.3826,-8.7197,1653
-10.2334,-8.5506,1654
5.8055,-7.936,1656
-0.375,-9.7024,1657
-2.7357,-9.6576,1658
0.1951,-9.8352,1659
2.1695,-9.8234,1660
1.8016,-9.8627,1661
1.093,-9.8154,1662
-0.3064,-9.8246,1663
1.3241,-9.8444,1664
3.5774,-9.7647,1666
0.1148,-9.0628,1667
1.7833,-9.169,1668
-4.7015,-8.7142,1669
-0.3913,-8.2672,1670
-0.9473,-9.5966,1672
0.7934,-9.9975,1673
2.9036,-9.8035,1674
5.5401,-10.1523,1675
4.1571,-9.5928,1676
0.2768,-11.3343,1677
0.0588,-9.4932,1678
-2.3514,-9.5621,1679
3.9536,-10.0162,1680
2.7233,-9.6954,1682
5.7551,-9.6221,1683
0.8613,-10.2291,1684
-1.2294,-9.8716,1685
-3.9773,-9.5298,1686
2.5241,-10.6309,1687
3.0193,-9.7384,1688
-0.8592,-10.0428,1689
2.3625,-9.5247,1691
1.581,-9.8128,1692
2.5309,-10.409,1693
-7.4366,-10.1353,1694
0.0538,-9.5744,1695
-0.0069,-9.9573,1696
-0.2411,-9.9453,1697
3.6131,-10.2269,1698
-0.2405,-9.8398,1699
-0.1169,-9.8086,1700
1.159,-9.8247,1701
-5.708,-9.825,1702
-20.0247,-9.6016,1703
7.342,-9.6965,1704
-1.594,-9.7439,1705
1.6396,-9.7774,1707
1.5978,-9.8108,1708
-4.9938,-9.7431,1709
2.7603,-9.7789,1710
6.6788,-9.7275,1712
3.3154,-9.7696,1713
-6.2375,-9.9001,1714
-5.3434,-9.819,1716
0.1241,-9.6335,1717
-0.6593,-9.949,1718
-0.7012,-9.8327,1719
-4.634,-9.7058,1720
-0.5286,-9.7314,1721
-3.6918,-9.7931,1722
-11.3418,-9.8104,1723
2.8081,-9.5276,1724
1.211,-9.8722,1726
-7.1273,-9.6495,1727
24.822,-9.7226,1728
-24.1235,-9.5155,1729
5.3203,-9.5376,1730
-1.6372,-9.8212,1731
-0.8417,-9.8688,1732
-6.4441,-9.9059,1733
0.8429,-9.9825,1734
0.5176,-9.6973,1735
-1.079,-9.8855,1736
3.0848,-9.9018,1737
0.2389,-9.7095,1738
-0.6937,-9.833,1739
2.19,-9.5993,1741
-2.3405,-9.8805,1742
0.2343,-9.7921,1743
-0.6671,-9.7757,1744
-0.3549,-9.7665,1745
0.5078,-9.769,1746
-0.1135,-9.7568,1747
0.7483,-9.7662,1748
0.0756,-9.7743,1749
-0.1573,-9.7727,1750
-0.6471,-9.7612,1751
-4.4278,-9.7316,1752
2.888,-9.6029,1753
-3.9273,-9.833,1754
3.4894,-9.6737,1755
-0.4507,-9.8755,1756
-1.5431,-10.017,1757
-0.7901,-9.8086,1758
-0.0756,-9.9413,1759
-1.8929,-9.9535,1760
2.767,-9.9455,1761
-0.6592,-9.8852,1762
1.8717,-9.904,1763
1.2702,-9.4044,1764
-1.4636,-9.9915,1765
-1.119,-9.9372,1766
-3.0462,-10.0305,1767
-0.495,-9.7749,1768
-0.6321,-9.6433,1769
-0.0042,-10.007,1772
0.0019,-9.7653,1773
-0.6596,-9.789,1774
0.4876,-9.8205,1775
-0.8972,-9.9163,1776
-4.0739,-10.262,1777
0.9167,-9.8037,1778
-1.592,-9.8739,1779
1.15,-9.8786,1781
-0.261,-9.8651,1782
0.103,-9.8102,1783
0.6428,-9.8003,1784
0.0141,-9.3666,1785
-0.783,-9.8934,1786
-0.8488,-9.9936,1787
0.4558,-10.0289,1788
-0.0046,-9.7424,1789
-0.2202,-9.7734,1791
-0.066,-9.9051,1792
-0.2725,-9.7903,1793
-0.3764,-9.5775,1794
0.4752,-9.7734,1795
0.2697,-9.7264,1796
0.5397,-8.5161,1797
-0.4766,-9.8368,1798
-0.8669,-9.6808,1799
-0.3576,-9.9842,1801
-0.1129,-9.7898,1802
0.0404,-9.6127,1803
-0.3181,-10.0043,1804
0.2788,-9.5414,1805
0.6013,-9.9527,1806
-0.5237,-9.7366,1807
0.649,-9.7537,1808
0.6509,-9.7893,1809
4.5525,-9.9453,1811
2.0511,-9.8974,1812
0.2052,-10.1097,1813
-0.11,-10.0589,1814
0.3127,-9.877,1815
1.4726,-9.7257,1816
-0.4704,-10.0544,1817
0.2699,-9.9946,1818
-0.3928,-9.9841,1819
0.1453,-9.6514,1820
-0.0693,-9.8296,1821
0.3076,-9.8724,1822
-0.293,-9.6259,1823
-0.3122,-9.7593,1824
0.0849,-9.8814,1825
-0.1954,-9.9201,1826
0.1159,-9.9152,1827
0.0101,-9.7971,1828
-0.1445,-9.787,1829
-0.1824,-9.9553,1830
0.0123,-9.7705,1831
1.354,-10.0393,1832
7.0814,-9.9194,1833
4.7368,-10.736,1834
10.5612,-9.4044,1835
0.7315,-9.7636,1836
0.3029,-10.0475,1837
0.8604,-9.9381,1838
-2.3557,-9.596,1839
0.2139,-9.9131,1841
-0.4418,-10.0186,1842
-0.29,-9.8689,1843
3.4208,-9.9092,1844
-0.0844,-9.3519,1845
5.5948,-9.7925,1846
-1.1118,-10.1985,1847
0.5046,-9.8926,1848
-1.6401,-9.8998,1849
0.435,-9.7998,1851
-0.5438,-9.9948,1852
0.4348,-9.7741,1853
3.2274,-10.0007,1854
1.3132,-9.3962,1855
-1.3473,-9.7503,1856
-1.0294,-9.878,1857
-0.1134,-9.8116,1858
-2.1554,-9.6759,1859
-0.1395,-9.8208,1861
-0.0908,-9.8827,1862
-0.0017,-10.0184,1863
-0.5006,-9.8779,1864
0.0107,-9.6538,1865
-1.0264,-9.8361,1866
-2.6838,-9.8636,1867
0.496,-9.8187,1868
-0.7444,-9.9271,1869
-0.4922,-9.8066,1870
-0.6816,-9.8294,1872
0.3316,-9.9373,1873
-0.2964,-9.7598,1874
-0.4012,-9.7335,1875
0.7213,-9.7253,1876
-1.3563,-9.9215,1877
0.1412,-9.7861,1878
0.2595,-9.7599,1879
0.1081,-9.8588,1881
0.4565,-9.8596,1882
-0.3368,-9.6899,1883
2.2259,-9.4882,1884
3.4615,-10.5249,1885
0.0255,-9.8194,1886
-0.2063,-9.9065,1887
-2.1093,-9.4777,1888
-0.9231,-9.9377,1889
-0.7809,-10.0632,1890
-1.715,-10.2411,1891
0.0706,-9.9108,1892
-0.1774,-9.8877,1893
0.314,-9.8844,1894
0.1423,-10.1869,1895
0.3854,-10.1995,1896
-1.0706,-9.8879,1897
0.9454,-9.9195,1898
-0.4706,-9.9629,1899
0.3327,-9.8079,1901
0.9808,-9.8349,1902
-0.1882,-9.7616,1903
4.4608,-10.0789,1904
3.5354,-9.7266,1905
4.1542,-9.6276,1906
-0.7541,-9.8096,1907
-0.3423,-9.8273,1908
-0.761,-9.9549,1909
-0.3465,-9.7869,1911
1.8959,-9.8088,1912
3.2106,-9.741,1913
-0.0686,-9.5066,1914
-0.561,-9.7862,1915
0.9467,-9.7618,1916
0.1094,-9.8358,1917
0.0579,-9.9029,1918
-2.5019,-9.838,1919
4.1078,-9.6589,1921
1.8097,-9.8145,1922
-1.9848,-9.8393,1923
-3.6497,-9.7881,1924
-8.744,-9.7677,1925
-0.7569,-9.7181,1926
0.6536,-9.8474,1927
2.4505,-9.7858,1928
-1.2162,-9.826,1929
-1.6407,-9.7782,1931
0.8709,-9.8031,1932
-0.9427,-9.7865,1933
0.0019,-9.8198,1934
-0.1084,-9.803,1935
-4.4458,-9.8285,1936
-1.2746,-9.7224,1937
-5.0784,-9.7543,1938
-15.3666,-9.5641,1939
0.0791,-9.5401,1940
-1.3501,-9.8092,1942
-9.4979,-9.7491,1943
-6.888,-9.501,1944
5.4395,-9.5027,1945
-17.0778,-9.4145,1946
13.4661,-9.379,1948
-1.6984,-9.6967,1949
19.9259,-9.6957,1950
-2.2137,-9.7986,1951
-1.9218,-9.8273,1952
-4.9348,-9.8118,1953
-0.4389,-9.7781,1954
0.6786,-9.7483,1955
0.325,-9.8124,1956
0.1376,-9.8159,1957
0.0811,-9.8152,1958
0.0624,-9.8155,1959
0.0581,-9.8127,1960
0.0695,-9.8154,1961
0.071,-9.8145,1962
0.0663,-9.815,1963
0.0621,-9.813,1964
0.0536,-9.8123,1965
0.0599,-9.8139,1966
0.0544,-9.8173,1967
0.0262,-9.8248,1968
2.5318,-9.7097,1969
-0.0636,-9.846,1971
