AYGX_mean,AZ_mean,timestamp
1.2844,-9.8516,268
4.7579,-10.1036,269
-1.5955,-9.0043,270
0.6757,-10.1574,271
1.2408,-9.8294,273
0.4569,-9.4552,274
6.1059,-10.5189,275
28.3221,-10.6166,276
37.0969,-9.7971,278
-1.5819,-9.8492,280
0.0597,-9.7261,282
-0.6502,-9.7611,283
-0.2706,-9.7785,284
0.015,-9.7715,285
0.0611,-9.7864,286
0.6477,-9.7153,287
0.3805,-9.4252,288
