AYGX_mean,AZ_mean,timestamp
0.5471,-9.6687,0
0.5256,-9.6674,1
0.5233,-9.6676,2
0.5291,-9.6689,3
0.5213,-9.668,4
0.5191,-9.6682,5
0.5438,-9.6672,6
0.491,-9.668,7
0.5078,-9.6684,8
8.6925,-9.6602,9
-2.3076,-9.7502,10
3.3281,-9.7292,12
-12.1606,-9.7269,13
5.1822,-7.9239,14
28.1632,-9.3966,15
19.1726,-9.3357,16
9.927,-9.7509,17
-3.0483,-9.8626,18
3.4568,-9.7874,19
-0.7942,-9.8411,20
3.9239,-9.7886,21
4.8234,-9.6559,22
1.7296,-9.7824,23
14.2142,-9.6274,24
14.8236,-9.7924,25
4.5169,-9.876,26
25.2614,-10.0006,27
2.9005,-9.8809,28
1.4863,-9.8332,29
0.738,-9.6423,30
1.3645,-10.2409,31
0.2472,-9.7383,32
6.8465,-9.7499,33
0.2004,-9.863,34
2.8226,-9.7844,35
1.731,-9.831,36
9.2515,-9.73,37
-1.6447,-9.7898,38
-0.0166,-9.7471,39
2.7812,-9.8136,40
-0.1471,-9.7673,41
10.9597,-9.7707,42
0.4816,-9.707,43
1.645,-9.7588,44
0.6816,-9.8046,45
-0.1615,-9.6566,46
2.1842,-9.8133,47
-0.1056,-9.8098,48
-0.6313,-9.8952,49
2.6807,-9.8452,50
10.7535,-9.5007,51
-2.9613,-9.7593,52
17.6348,-11.4494,53
-8.8316,-9.5158,54
-2.8102,-9.8073,55
18.6489,-9.7946,56
-1.3331,-10.0451,57
38.4717,-9.4973,58
-0.2366,-9.607,59
9.8315,-9.7672,60
0.1433,-9.8533,61
0.2065,-9.7838,62
6.2044,-9.8258,63
2.6419,-9.2968,64
1.4612,-9.4859,65
1.7338,-9.6501,66
4.7782,-9.6586,67
4.86,-9.7831,68
0.8919,-9.6971,69
5.277,-9.8163,70
0.7685,-9.8756,71
7.1268,-9.7651,72
-7.7864,-10.01,73
-0.9299,-10.0046,74
4.7407,-9.7751,75
-1.07,-9.7499,76
-0.859,-9.7413,77
-0.5937,-10.0892,78
2.0221,-10.0793,79
8.4771,-9.8435,80
0.2411,-10.002,81
8.5303,-9.8108,82
4.2345,-9.6224,83
-0.3624,-9.5013,84
3.803,-9.5445,85
-1.3016,-10.1048,86
2.6409,-7.4386,87
-0.4826,-9.6669,88
12.9208,-10.1005,89
11.4794,-9.6425,90
-5.3122,-9.9468,91
12.4949,-9.8941,92
31.1823,-9.985,93
3.6338,-9.3771,94
0.9355,-9.839,95
3.1915,-9.6559,96
1.6298,-9.8516,97
0.9507,-9.7095,98
-0.8884,-9.7597,99
5.9443,-9.8919,100
25.4713,-9.8289,101
10.4831,-10.1972,102
15.9508,-9.4483,103
8.9633,-9.6153,104
1.0024,-9.7906,105
5.4696,-9.786,106
2.2925,-9.7095,107
-0.0795,-9.7435,108
0.487,-9.7493,109
14.3355,-9.7916,110
9.831,-10.0391,111
23.7676,-9.5405,112
-0.3059,-10.4627,113
1.4239,-9.2875,114
5.4782,-9.8665,115
5.0144,-9.8791,116
-0.6934,-9.7039,117
10.1914,-10.1708,118
3.465,-10.1422,119
6.8126,-9.7183,120
2.9745,-9.8919,121
-0.2038,-9.9932,122
0.5575,-9.9931,123
12.7073,-9.6092,124
1.4817,-9.732,125
9.3084,-9.7366,126
0.5918,-9.7684,127
1.0309,-9.454,128
3.3908,-10.2793,129
2.9579,-9.6994,130
0.6974,-9.8372,131
-0.1308,-9.6684,132
-1.6087,-8.9935,133
2.3023,-9.8953,134
0.7458,-9.79,135
0.7055,-9.7974,136
-0.425,-9.7884,137
6.0366,-10.0278,138
0.0005,-9.8861,139
1.9768,-9.8423,140
2.6366,-9.7561,141
1.3488,-9.8803,143
1.1455,-10.4073,144
4.152,-9.7308,145
8.2135,-9.7715,146
1.1327,-9.9035,147
-0.1792,-8.7518,148
2.4741,-9.659,149
-2.7066,-9.8265,150
2.1572,-9.8565,151
2.4127,-9.7358,153
7.6111,-9.9541,154
0.8064,-9.6737,155
15.4355,-8.9094,156
5.9925,-10.6428,157
6.6142,-8.6547,158
6.167,-10.264,159
0.4547,-9.7079,161
5.8055,-9.7998,162
4.0939,-9.7557,164
1.6667,-9.7699,165
7.5872,-9.8713,166
5.1871,-9.8871,167
-1.7073,-10.047,168
2.1121,-9.2266,169
-0.8473,-9.6978,170
0.0485,-9.7924,171
-1.9028,-9.8026,172
3.9102,-9.8731,174
5.372,-9.8382,175
4.0497,-9.7846,176
1.1641,-9.6873,177
6.5894,-10.4065,178
-0.3932,-10.2964,179
0.6395,-9.913,181
3.7818,-10.0443,182
-1.0952,-9.8112,183
-0.1633,-9.8155,184
0.2099,-10.2137,185
-0.4825,-9.9077,186
0.1354,-9.7932,187
0.6008,-9.8402,188
0.5566,-10.1057,189
-1.0748,-9.7932,190
2.7417,-9.8433,191
0.6144,-9.9656,192
0.6828,-9.7665,193
8.4869,-9.8833,194
-1.69,-9.8334,196
3.3004,-9.8501,198
3.1594,-9.83,199
-0.2116,-9.8727,200
0.2925,-9.867,201
7.4383,-9.7314,202
5.555,-9.7005,203
-2.1802,-9.6596,204
-1.2965,-9.2866,205
48.2256,-10.0663,206
13.8276,-9.9465,207
22.825,-9.9827,208
-0.1463,-10.0004,209
1.4623,-9.5453,210
2.2323,-9.6977,211
2.8845,-9.8972,212
0.5965,-9.8266,213
1.9476,-9.7682,214
-7.6819,-9.7388,215
5.5776,-10.0181,216
5.4817,-9.6632,217
2.5734,-9.728,218
-2.0603,-9.8354,219
-5.387,-9.7539,220
1.4796,-9.762,221
2.2553,-9.8257,222
0.3001,-9.9727,223
5.9543,-9.9504,224
3.1207,-9.8176,225
1.3239,-9.7793,226
-0.0038,-9.6632,227
0.0489,-9.8321,228
1.1651,-9.8006,229
1.086,-9.4551,230
0.3151,-9.8689,231
-0.0165,-9.9099,232
1.0959,-9.8642,233
0.0793,-9.7626,234
0.2479,-10.0273,235
0.0751,-9.7144,236
0.4748,-9.7887,237
-0.0205,-9.9359,238
-0.4906,-9.7824,239
1.1432,-9.8892,240
0.0813,-9.7035,241
0.0244,-9.905,242
-0.1288,-9.6943,243
0.6316,-9.7074,244
0.1464,-9.7556,245
-0.0229,-10.0393,246
0.6121,-9.7216,247
1.096,-9.8107,248
3.2942,-9.8702,249
-1.7154,-9.9577,250
2.0913,-9.8329,251
0.9645,-9.8494,252
1.8332,-9.5477,253
-2.0188,-9.9161,254
3.3458,-10.1521,255
1.5335,-10.579,256
-0.4395,-10.5366,257
9.3481,-9.8165,258
15.8867,-9.6248,259
-0.8437,-9.9345,260
4.9174,-9.8117,261
2.3317,-9.8013,262
2.1138,-9.8954,263
-6.9812,-9.7596,264
-7.2151,-9.6778,265
0.7196,-9.7903,266
6.505,-9.7603,267
10.6695,-9.8635,268
-1.5156,-9.7948,269
0.2494,-9.665,270
31.3179,-10.1377,271
11.4165,-9.8588,272
-1.4655,-9.7662,273
-1.8214,-9.697,274
6.6227,-9.8339,275
-6.8907,-9.8482,276
-0.0353,-9.8678,277
-0.1742,-9.7336,278
4.8388,-10.0755,279
-2.0786,-9.8226,280
2.4798,-9.7783,281
3.3926,-9.9091,282
6.4552,-9.7519,283
-8.3891,-10.348,284
-4.4856,-9.771,285
2.5358,-9.7744,286
2.7814,-9.865,287
0.4369,-9.803,288
-1.5955,-9.9546,289
-3.6209,-10.0037,290
0.1157,-9.7792,291
1.3328,-9.8438,292
3.4837,-9.8594,293
6.2793,-9.5871,294
14.9703,-9.7611,295
-0.2222,-9.619,296
2.7357,-9.965,297
1.1576,-9.7941,298
3.3266,-9.8969,299
2.1653,-9.7706,300
-0.6301,-9.9263,301
-5.1761,-9.8697,302
5.6502,-10.0737,303
-5.9665,-9.9263,304
10.4136,-9.4636,305
-1.6526,-9.8406,306
11.7034,-9.8542,307
1.2027,-9.7782,308
31.6157,-10.228,309
13.2984,-10.2973,310
-5.6571,-9.8517,311
10.8446,-9.7324,312
6.4438,-9.7629,313
26.3817,-9.8016,314
-0.8102,-10.8665,315
0.048,-9.6812,316
1.4432,-9.5903,317
11.1548,-10.2351,318
32.2804,-10.2227,319
1.2165,-10.0111,320
8.7718,-10.2221,321
8.0051,-9.1397,322
17.1163,-9.8914,323
3.7342,-9.7272,324
0.4892,-9.7716,325
0.2342,-9.9219,326
0.7522,-9.8266,327
-0.0635,-10.0998,328
0.9988,-9.8179,329
4.1066,-9.7801,330
1.9643,-9.9427,331
9.972,-9.7487,332
3.5897,-9.8403,333
19.5054,-9.9994,334
-0.3525,-10.2545,335
0.1664,-9.8717,336
11.3204,-9.5226,337
9.028,-10.2432,338
0.5201,-9.5961,339
0.8867,-9.8075,340
16.1777,-10.0073,341
13.0637,-9.762,342
28.2075,-10.096,343
28.681,-10.3044,344
-0.031,-9.7832,345
8.5137,-9.8348,346
0.904,-9.7877,347
11.5018,-9.7152,348
-0.1,-9.77,349
32.1057,-10.3603,350
12.6265,-10.0134,351
26.3666,-9.5652,352
1.1443,-9.7938,353
0.2326,-10.0509,354
0.5755,-9.8295,355
1.0796,-9.7634,356
