timestamp,AX_mean,AX_min,AX_max,AX_median,AX_std,AX_meandiff,AX_mediandiff,AX_extremum,AX_delta,AY_mean,AY_min,AY_max,AY_median,AY_std,AY_meandiff,AY_mediandiff,AY_extremum,AY_delta,AZ_mean,AZ_min,AZ_max,AZ_median,AZ_std,AZ_meandiff,AZ_mediandiff,AZ_extremum,AZ_delta,GX_mean,GX_min,GX_max,GX_median,GX_std,GX_meandiff,GX_mediandiff,GX_extremum,GX_delta,GY_mean,GY_min,GY_max,GY_median,GY_std,GY_meandiff,GY_mediandiff,GY_extremum,GY_delta,GZ_mean,GZ_min,GZ_max,GZ_median,GZ_std,GZ_meandiff,GZ_mediandiff,GZ_extremum,GZ_delta,AYGX_mean,AYGX_min,AYGX_max,AYGX_median,AYGX_std,AYGX_meandiff,AYGX_mediandiff,AYGX_extremum,AYGX_delta,Anorm_mean,Anorm_min,Anorm_max,Anorm_median,Anorm_std,Anorm_meandiff,Anorm_mediandiff,Anorm_extremum,Anorm_delta,Gnorm_mean,Gnorm_min,Gnorm_max,Gnorm_median,Gnorm_std,Gnorm_meandiff,Gnorm_mediandiff,Gnorm_extremum,Gnorm_delta
469,0.3724,0.3538,0.3912,0.3687,0.0127,0.0066,0.0074,0.3912,0.0375,-1.0887,-1.1124,-1.058,-1.0888,0.0171,-0.0789,-0.0793,1.1124,0.0545,-9.7515,-9.7666,-9.7411,-9.7492,0.0104,0.0074,0.0031,9.7666,0.0255,0.1048,0.0105,0.2265,0.081,0.0793,0.0755,0.1208,0.2265,0.2161,1.0128,0.9712,1.0325,1.0238,0.0213,-0.0098,-0.0263,1.0325,0.0613,0.0847,0.0675,0.1172,0.0706,0.0219,0.0011,0.0128,0.1172,0.0496,-0.1144,-0.2487,-0.0114,-0.0899,0.0869,-0.0933,-0.1459,0.2487,0.2374,9.8191,9.8085,9.8331,9.8174,0.0104,0.002,0.0043,9.8331,0.0246,1.0245,0.9751,1.0549,1.0334,0.0267,0.0156,0.0038,1.0549,0.0798
470,0.379,0.3522,0.4114,0.3761,0.0142,0.0024,0.0027,0.4114,0.0592,-1.1676,-1.2022,-1.1226,-1.1681,0.0214,0.0488,0.0449,1.2022,0.0796,-9.7441,-9.766,-9.7187,-9.7461,0.0128,-0.0053,-0.004,9.766,0.0473,0.1803,-0.3032,0.4501,0.2018,0.1947,-0.5331,-0.5522,0.4501,0.7533,1.003,0.98,1.0325,0.9975,0.0152,-0.0004,0.0088,1.0325,0.0525,0.0858,0.0362,0.1307,0.0834,0.0246,-0.0153,-0.0131,0.1307,0.0944,-0.2077,-0.5204,0.3614,-0.2358,0.2269,0.6032,0.6212,0.5204,0.8818,9.8211,9.7983,9.8444,9.8216,0.0128,-0.0003,0.0009,9.8444,0.0461,1.0401,0.9926,1.1204,1.0373,0.0344,0.0365,0.0364,1.1204,0.1278
471,0.3814,0.3518,0.4299,0.3789,0.021,0.0005,0.0035,0.4299,0.0781,-1.1188,-1.1657,-1.0753,-1.1232,0.0245,0.0383,0.0371,1.1657,0.0904,-9.7494,-9.7717,-9.725,-9.7501,0.0115,-0.0031,-0.0042,9.7717,0.0467,-0.3528,-0.6093,-0.1246,-0.3505,0.165,0.2132,0.2109,0.6093,0.4846,1.0026,0.9625,1.0325,1.0062,0.0169,-0.0051,-0.0088,1.0325,0.07,0.0704,0.0057,0.1395,0.0703,0.0324,-0.0037,0.0009,0.1395,0.1337,0.3955,0.1407,0.7102,0.3854,0.1887,-0.2443,-0.2349,0.7102,0.5695,9.8208,9.7996,9.8434,9.8225,0.0112,-0.0012,-0.0017,9.8434,0.0438,1.0766,1.0035,1.2005,1.0737,0.0563,-0.0659,-0.0606,1.2005,0.197
472,0.3818,0.364,0.3949,0.3823,0.01,0.018,0.0177,0.3949,0.0309,-1.0805,-1.0993,-1.0478,-1.0861,0.0171,0.035,0.0497,1.0993,0.0515,-9.7524,-9.7643,-9.7371,-9.7544,0.0097,-0.0046,-0.0036,9.7643,0.0272,-0.1396,-0.2071,-0.0481,-0.1396,0.0476,0.0821,0.0818,0.2071,0.1591,0.9975,0.9625,1.0238,0.9975,0.0193,0.0077,0.0088,1.0238,0.0613,0.0667,0.0344,0.0899,0.0712,0.0213,0.0226,0.0188,0.0899,0.0555,0.1512,0.0504,0.2225,0.1505,0.0518,-0.0911,-0.089,0.2225,0.1721,9.8196,9.8036,9.8314,9.8208,0.0104,0.0016,0.0023,9.8314,0.0278,1.0106,0.9774,1.0356,1.0132,0.0167,0.0083,0.0107,1.0356,0.0583
473,0.3998,0.3813,0.4187,0.4,0.0103,-0.014,-0.0162,0.4187,0.0375,-1.0455,-1.0909,-1.0215,-1.0364,0.0232,-0.0898,-0.1041,1.0909,0.0694,-9.7571,-9.7738,-9.7334,-9.7579,0.0135,0.0098,0.013,9.7738,0.0404,-0.0575,-0.2026,0.21,-0.0578,0.1314,0.383,0.3804,0.21,0.4126,1.0052,0.9625,1.0238,1.0062,0.0184,-0.0011,0.0044,1.0238,0.0613,0.0893,0.0075,0.1306,0.09,0.0419,0.0464,0.0461,0.1306,0.1231,0.0601,-0.2184,0.2139,0.0615,0.1365,-0.4298,-0.4187,0.2184,0.4323,9.8211,9.8023,9.8365,9.8231,0.0123,-0.0003,-0.0037,9.8365,0.0342,1.019,0.987,1.0356,1.0238,0.0158,0.0461,0.0503,1.0356,0.0486
474,0.3858,0.3582,0.426,0.3838,0.0201,-0.0024,-0.0011,0.426,0.0678,-1.1353,-1.1549,-1.1065,-1.1406,0.0192,-0.0662,-0.0733,1.1549,0.0485,-9.7473,-9.7616,-9.7363,-9.7449,0.0082,0.007,0.0064,9.7616,0.0252,0.3255,0.267,0.3886,0.3226,0.0411,-0.7098,-0.8396,0.3886,0.1215,1.0041,0.9363,1.0238,1.0106,0.0284,-0.0051,-0.0131,1.0238,0.0875,0.1356,0.0992,0.1713,0.136,0.025,-0.0611,-0.0637,0.1713,0.072,-0.3697,-0.4432,-0.3014,-0.3572,0.0486,0.8196,0.9648,0.4432,0.1418,9.8208,9.8108,9.8323,9.8194,0.0071,0.0009,0.0033,9.8323,0.0215,1.0651,0.9954,1.0986,1.0741,0.0321,0.079,0.052,1.0986,0.1031
475,0.3834,0.3434,0.4223,0.3827,0.0215,-0.0056,-0.0049,0.4223,0.0789,-1.2014,-1.2698,-1.1047,-1.2139,0.0472,0.0836,0.0972,1.2698,0.1652,-9.7404,-9.7771,-9.7177,-9.7385,0.0144,-0.0069,-0.0088,9.7771,0.0594,-0.3842,-0.8944,0.297,-0.517,0.417,0.2703,0.4592,0.8944,1.1914,0.999,0.9712,1.0238,0.9975,0.0174,0.0051,0.0088,1.0238,0.0525,0.0745,0.004,0.1397,0.0723,0.0318,0.028,0.0356,0.1397,0.1357,0.4499,-0.3619,1.0426,0.6076,0.4921,-0.3231,-0.5429,1.0426,1.4045,9.8218,9.7966,9.8522,9.8227,0.0142,-0.0034,-0.0044,9.8522,0.0557,1.1441,1.0227,1.3275,1.1261,0.1024,-0.122,-0.1051,1.3275,0.3048
476,0.3779,0.3595,0.398,0.3778,0.012,-0.0019,-0.0037,0.398,0.0385,-1.1178,-1.1406,-1.0867,-1.1166,0.0141,0.0151,0.012,1.1406,0.0539,-9.7473,-9.7652,-9.7274,-9.7474,0.0095,-0.006,-0.0052,9.7652,0.0378,-0.1139,-0.3857,0.0014,-0.0578,0.1162,-0.1958,-0.2348,0.3857,0.3871,1.0041,0.98,1.0325,1.0062,0.0134,0.0022,0.0044,1.0325,0.0525,0.1025,0.0585,0.1484,0.108,0.0283,-0.0245,-0.0354,0.1484,0.0899,0.1268,-0.0016,0.4256,0.0647,0.129,0.2147,0.2571,0.4256,0.4272,9.8184,9.7972,9.8371,9.8184,0.0097,0.0042,0.0038,9.8371,0.0399,1.0221,0.988,1.0757,1.021,0.0245,0.0344,0.0362,1.0757,0.0877
477,0.376,0.3474,0.4055,0.3741,0.0227,-0.0008,-0.0021,0.4055,0.0581,-1.1027,-1.116,-1.0915,-1.1047,0.0079,0.0819,0.0787,1.116,0.0245,-9.7533,-9.7675,-9.7426,-9.7526,0.0078,-0.0075,-0.0076,9.7675,0.0248,-0.3097,-0.3782,-0.2717,-0.2927,0.0399,0.1059,0.0315,0.3782,0.1065,1.0062,0.98,1.0238,1.0106,0.014,-0.002,-0.0044,1.0238,0.0438,0.078,0.0463,0.1124,0.0726,0.0241,0.0213,0.0217,0.1124,0.0661,0.3415,0.2983,0.4178,0.3218,0.0433,-0.1385,-0.0532,0.4178,0.1195,9.8226,9.8109,9.8344,9.8222,0.0071,-0.0014,0.0004,9.8344,0.0235,1.0565,1.0241,1.0877,1.0572,0.0223,0.0149,0.0052,1.0877,0.0637
478,0.3752,0.2924,0.4372,0.372,0.0315,0.0003,0.0059,0.4372,0.1448,-1.0209,-1.0897,-0.9533,-1.026,0.0398,0.0326,0.0377,1.0897,0.1364,-9.7607,-9.7938,-9.7304,-9.7602,0.0134,-0.0035,-0.0038,9.7938,0.0634,-0.2038,-0.5748,0.3586,-0.2612,0.3004,0.1245,0.1756,0.5748,0.9334,1.0042,0.9538,1.0325,1.0062,0.0229,0.0031,0.0,1.0325,0.0788,0.0994,-0.0374,0.1919,0.0943,0.0565,-0.029,-0.0261,0.1919,0.2293,0.203,-0.3693,0.5668,0.2686,0.3051,-0.1248,-0.1836,0.5668,0.9361,9.8213,9.7904,9.8564,9.8225,0.0133,0.0001,-0.0024,9.8564,0.0659,1.0714,0.9895,1.1757,1.0624,0.0497,-0.0551,-0.0451,1.1757,0.1862
479,0.3755,0.3538,0.4036,0.3779,0.0133,0.0024,0.0052,0.4036,0.0499,-0.9883,-1.0239,-0.9509,-0.9883,0.0219,0.0711,0.0646,1.0239,0.073,-9.7642,-9.7793,-9.7474,-9.7639,0.0095,-0.0052,-0.0077,9.7793,0.0319,-0.0793,-0.2191,0.051,-0.0856,0.0775,-0.0344,-0.1561,0.2191,0.2701,1.0073,0.9712,1.05,1.0062,0.0226,-0.0004,0.0,1.05,0.0787,0.0704,0.0,0.141,0.0682,0.0374,0.014,0.0245,0.141,0.141,0.0782,-0.049,0.2146,0.085,0.0759,0.0289,0.1289,0.2146,0.2637,9.8213,9.8062,9.8336,9.8202,0.0083,-0.0015,0.0017,9.8336,0.0274,1.0163,0.9754,1.0515,1.0173,0.0253,0.0675,0.0705,1.0515,0.0761
480,0.3779,0.3107,0.4251,0.3831,0.0305,-0.0005,-0.0004,0.4251,0.1144,-0.9172,-0.9778,-0.8509,-0.9236,0.0339,-0.0378,-0.0377,0.9778,0.1269,-9.7695,-9.8288,-9.716,-9.7716,0.0201,0.0026,0.0049,9.8288,0.1128,-0.1137,-0.5628,0.5161,-0.2417,0.3804,0.1885,0.2457,0.5628,1.0789,1.007,0.9625,1.05,1.0062,0.0226,-0.0043,-0.0044,1.05,0.0875,0.0844,-0.0465,0.2134,0.0927,0.0666,0.0031,-0.0012,0.2134,0.2599,0.1071,-0.479,0.517,0.2139,0.3522,-0.1833,-0.234,0.517,0.996,9.8198,9.7686,9.8796,9.8219,0.0199,0.0011,-0.0005,9.8796,0.1111,1.0838,0.9733,1.1626,1.0878,0.0544,-0.015,-0.0228,1.1626,0.1893
482,0.377,0.3232,0.4231,0.3824,0.0276,-0.0007,-0.0083,0.4231,0.0999,-0.9928,-1.0442,-0.8946,-0.999,0.0369,0.033,0.0215,1.0442,0.1496,-9.7643,-9.7946,-9.7332,-9.7618,0.0157,-0.0022,-0.0031,9.7946,0.0614,0.2633,-0.0841,0.6497,0.2498,0.1951,-0.8017,-0.8118,0.6497,0.7338,0.9983,0.9363,1.0325,0.9975,0.0189,0.0069,0.0088,1.0325,0.0963,0.0906,0.0153,0.2374,0.0904,0.046,-0.0348,-0.0225,0.2374,0.222,-0.2596,-0.6633,0.0795,-0.2541,0.1898,0.7694,0.8006,0.6633,0.7428,9.822,9.7934,9.8478,9.8209,0.015,-0.0011,0.001,9.8478,0.0544,1.0538,0.9849,1.2222,1.0422,0.0557,0.1047,0.1128,1.2222,0.2372
483,0.3762,0.3279,0.4218,0.3741,0.0231,0.0072,0.0071,0.4218,0.0939,-0.9598,-1.0119,-0.842,-0.9775,0.045,0.1055,0.1146,1.0119,0.1699,-9.7665,-9.7972,-9.7415,-9.7649,0.0161,-0.0116,-0.0083,9.7972,0.0557,-0.5384,-0.8793,-0.2146,-0.562,0.2208,0.3412,0.4036,0.8793,0.6647,1.0052,0.9888,1.0325,1.0062,0.0139,-0.0187,-0.0131,1.0325,0.0438,0.0558,-0.0486,0.1121,0.0678,0.0382,0.0197,0.0064,0.1121,0.1607,0.5098,0.2095,0.7966,0.5465,0.1948,-0.3394,-0.4099,0.7966,0.587,9.8209,9.7858,9.8462,9.822,0.0163,0.0019,-0.0029,9.8462,0.0604,1.1585,1.0151,1.3372,1.1551,0.1015,-0.1227,-0.1306,1.3372,0.3221
484,0.3835,0.3706,0.4093,0.3812,0.0127,-0.006,-0.0011,0.4093,0.0387,-0.8543,-0.8701,-0.815,-0.8629,0.0192,-0.1584,-0.1499,0.8701,0.0551,-9.7781,-9.8136,-9.7581,-9.7731,0.0169,0.0139,0.0092,9.8136,0.0555,-0.1972,-0.5597,0.1935,-0.1584,0.2488,0.5462,0.472,0.5597,0.7532,0.9866,0.9275,1.015,0.9931,0.0272,0.017,0.0131,1.015,0.0875,0.0755,0.0178,0.1367,0.0742,0.0411,0.0392,0.0334,0.1367,0.1189,0.1704,-0.1577,0.483,0.1366,0.212,-0.5241,-0.4596,0.483,0.6407,9.8228,9.8046,9.8589,9.8191,0.0169,0.001,0.0034,9.8589,0.0542,1.0358,0.9916,1.0838,1.0245,0.0383,0.0614,0.0588,1.0838,0.0922
485,0.3775,0.3265,0.4168,0.38,0.0257,-0.0053,-0.0033,0.4168,0.0903,-1.0127,-1.0514,-0.9527,-1.0128,0.0238,0.0067,0.0139,1.0514,0.0987,-9.7641,-9.7856,-9.7415,-9.764,0.0132,0.0012,0.0013,9.7856,0.0442,0.349,0.003,0.8748,0.3136,0.2648,0.1658,0.2149,0.8748,0.8718,1.0035,0.9538,1.0412,1.0062,0.0278,0.0091,0.0066,1.0412,0.0875,0.1146,0.0377,0.2329,0.1076,0.0525,0.009,-0.0014,0.2329,0.1952,-0.3537,-0.8962,-0.003,-0.323,0.2692,-0.1896,-0.2079,0.8962,0.8932,9.8238,9.7984,9.847,9.8225,0.0144,-0.0018,-0.0008,9.847,0.0486,1.0972,0.9908,1.305,1.0833,0.0869,0.2095,0.0957,1.305,0.3143
487,0.3668,0.2511,0.4783,0.3734,0.045,0.0363,0.0328,0.4783,0.2272,-0.9993,-1.1902,-0.8061,-0.985,0.0887,-0.1895,-0.2091,1.1902,0.3842,-9.7618,-9.8215,-9.6839,-9.7614,0.0268,0.0194,0.0196,9.8215,0.1376,0.6806,-0.5177,2.4338,0.7434,1.0371,-1.5469,-1.9499,2.4338,2.9515,1.0218,0.98,1.0762,1.0194,0.0222,-0.0243,-0.0306,1.0762,0.0962,0.1326,-0.0595,0.3734,0.1049,0.1079,-0.0542,-0.003,0.3734,0.4329,-0.733,-2.8152,0.4852,-0.7388,1.1242,1.6758,2.0152,2.8152,3.3004,9.8202,9.7607,9.9009,9.8208,0.0256,0.0041,0.0141,9.9009,0.1402,1.5162,1.0178,2.6779,1.2748,0.5422,0.2322,0.3144,2.6779,1.6601
488,0.4031,0.329,0.4554,0.4062,0.0354,-0.0413,-0.0394,0.4554,0.1264,-1.1888,-1.4093,-0.8964,-1.1941,0.1558,0.1115,0.0886,1.4093,0.5128,-9.7424,-9.8141,-9.6682,-9.7418,0.0351,-0.0085,-0.0066,9.8141,0.1459,-0.8663,-2.2644,1.5274,-1.2065,1.2622,1.9017,2.3101,2.2644,3.7918,0.9975,0.9363,1.0938,0.9888,0.0359,0.0066,0.0219,1.0938,0.1575,0.0784,-0.1133,0.3461,0.1019,0.1116,-0.0113,-0.016,0.3461,0.4594,0.9428,-2.0648,2.6355,1.2764,1.5073,-2.0833,-2.471,2.6355,4.7003,9.8242,9.7667,9.8813,9.8349,0.0319,-0.0068,-0.0139,9.8813,0.1145,1.7483,1.028,2.4679,1.5891,0.4951,-0.2561,-0.0922,2.4679,1.44
489,0.3619,0.2728,0.4114,0.3668,0.0359,0.0195,0.0171,0.4114,0.1386,-1.0773,-1.1681,-0.9174,-1.1056,0.0885,-0.1507,-0.1194,1.1681,0.2507,-9.751,-9.7771,-9.7276,-9.7483,0.0141,0.017,0.0131,9.7771,0.0495,1.0354,-0.1636,1.6087,1.1036,0.4751,-0.9408,-0.9882,1.6087,1.7723,1.0041,0.9188,1.0325,1.0106,0.0276,-0.0033,0.0,1.0325,0.1137,0.0671,-0.0419,0.1552,0.0859,0.0528,0.0389,-0.0004,0.1552,0.197,-1.1405,-1.854,0.1559,-1.1946,0.5389,1.0226,1.0501,1.854,2.0099,9.8174,9.7951,9.8382,9.821,0.0131,0.0012,-0.0023,9.8382,0.0431,1.4922,0.9371,1.8975,1.4969,0.2788,-0.4609,-0.4746,1.8975,0.9604
490,0.3813,0.3537,0.4136,0.3838,0.0154,0.0007,-0.0027,0.4136,0.0599,-1.228,-1.2932,-1.1651,-1.2249,0.0308,0.0392,0.0322,1.2932,0.1281,-9.734,-9.7568,-9.7156,-9.7352,0.011,-0.0045,-0.004,9.7568,0.0412,0.0946,-0.2026,0.4531,0.1155,0.2069,-0.2088,-0.2371,0.4531,0.6557,1.0008,0.9188,1.0412,1.0106,0.0293,-0.0049,-0.0087,1.0412,0.1225,0.1059,0.0314,0.2253,0.0855,0.0533,-0.0171,-0.0114,0.2253,0.1939,-0.1179,-0.5509,0.2419,-0.1445,0.2539,0.2491,0.2922,0.5509,0.7928,9.8186,9.7997,9.8368,9.8187,0.0113,-0.0002,-0.001,9.8368,0.0371,1.0313,0.9826,1.1294,1.0223,0.0435,0.0525,0.0447,1.1294,0.1469
492,0.3827,0.3453,0.4215,0.3785,0.0194,0.0018,0.0055,0.4215,0.0761,-1.1497,-1.2369,-1.0735,-1.1606,0.0506,-0.1013,-0.0898,1.2369,0.1634,-9.7431,-9.7803,-9.7118,-9.7433,0.017,0.0097,0.0109,9.7803,0.0685,-0.323,-0.9049,0.5252,-0.3587,0.469,0.1137,-0.0555,0.9049,1.4301,0.9909,0.9538,1.0325,0.9931,0.0172,0.0133,0.0087,1.0325,0.0788,0.0718,-0.0044,0.1588,0.0628,0.0469,0.0224,0.0285,0.1588,0.1632,0.3802,-0.5638,1.0238,0.4398,0.5331,-0.1256,0.0732,1.0238,1.5876,9.8183,9.7914,9.8487,9.8167,0.0152,0.0027,0.0012,9.8487,0.0573,1.1363,0.9917,1.3342,1.1117,0.1187,0.0058,-0.0012,1.3342,0.3424
493,0.3845,0.3536,0.4277,0.384,0.0208,-0.0079,-0.01,0.4277,0.0741,-1.251,-1.3237,-1.189,-1.2504,0.0341,0.1117,0.1197,1.3237,0.1346,-9.7333,-9.7506,-9.7129,-9.7324,0.0105,-0.012,-0.0191,9.7506,0.0377,-0.2093,-0.9544,0.6077,-0.4142,0.5092,-0.8146,-0.6265,0.9544,1.5621,1.0042,0.9712,1.05,1.0019,0.0236,-0.0242,-0.0262,1.05,0.0787,0.0941,0.0072,0.1814,0.0913,0.0501,-0.0126,-0.0085,0.1814,0.1742,0.2546,-0.7764,1.1349,0.513,0.63,0.9144,0.6715,1.1349,1.9112,9.821,9.8041,9.8419,9.818,0.0104,-0.002,0.0028,9.8419,0.0378,1.1421,1.0247,1.3693,1.1105,0.0971,0.2793,0.3171,1.3693,0.3445
494,0.3766,0.3578,0.3969,0.374,0.0147,0.0051,0.0085,0.3969,0.0391,-1.1392,-1.198,-1.0759,-1.1307,0.041,-0.037,-0.0374,1.198,0.1221,-9.7453,-9.7624,-9.7214,-9.7516,0.0139,0.0028,0.0094,9.7624,0.0411,-1.0238,-1.151,-0.8584,-1.0407,0.0898,1.3003,1.2328,1.151,0.2926,0.98,0.9625,0.9975,0.9756,0.0155,0.0427,0.0437,0.9975,0.035,0.0815,0.0248,0.1269,0.0827,0.0295,0.0201,0.0245,0.1269,0.1021,1.169,0.9236,1.3782,1.1846,0.1371,-1.493,-1.4216,1.3782,0.4546,9.819,9.7939,9.8353,9.8208,0.0142,0.0019,-0.0011,9.8353,0.0414,1.4214,1.3188,1.5018,1.4276,0.0581,-0.3051,-0.3828,1.5018,0.1829
495,0.3817,0.2585,0.4506,0.3825,0.0499,-0.0018,-0.002,0.4506,0.1921,-1.1762,-1.2357,-1.0993,-1.1681,0.0411,0.0431,0.0308,1.2357,0.1364,-9.7425,-9.7684,-9.701,-9.7422,0.0186,-0.0051,-0.0058,9.7684,0.0674,0.2764,-0.1741,0.7368,0.192,0.3627,-0.3285,-0.2829,0.7368,0.9109,1.0227,0.98,1.1288,1.0194,0.0361,-0.0119,-0.0066,1.1288,0.1488,0.1017,0.027,0.1715,0.1072,0.0432,-0.0077,-0.0114,0.1715,0.1445,-0.324,-0.8566,0.2034,-0.2371,0.4228,0.3665,0.3145,0.8566,1.0601,9.8209,9.7864,9.8564,9.8197,0.018,-0.0,0.0008,9.8564,0.0699,1.1163,1.0017,1.3245,1.0448,0.1166,-0.0136,0.016,1.3245,0.3228
497,0.3781,0.3418,0.4285,0.3784,0.0167,0.0016,0.0104,0.4285,0.0867,-1.09,-1.1579,-0.9999,-1.1065,0.0439,0.1053,0.0838,1.1579,0.158,-9.7527,-9.7732,-9.7161,-9.7537,0.0112,-0.0122,-0.0057,9.7732,0.0571,-0.3806,-0.7428,-0.0151,-0.3737,0.2023,0.6106,0.6731,0.7428,0.7277,0.9988,0.875,1.0325,1.0062,0.0262,0.0216,0.0088,1.0325,0.1575,0.0863,0.0131,0.1467,0.0845,0.0324,0.0119,0.0144,0.1467,0.1337,0.4089,0.0175,0.7855,0.3919,0.2106,-0.6523,-0.6687,0.7855,0.768,9.8208,9.7874,9.8437,9.8213,0.0103,0.0014,-0.0012,9.8437,0.0562,1.0891,0.9414,1.2314,1.0768,0.0749,0.1838,0.1932,1.2314,0.29
498,0.3797,0.2464,0.4428,0.3888,0.0495,-0.0085,-0.0154,0.4428,0.1963,-0.9846,-1.1017,-0.7935,-1.0227,0.0908,-0.0453,-0.0084,1.1017,0.3082,-9.7649,-9.8319,-9.712,-9.7594,0.0288,0.0055,0.0002,9.8319,0.1199,0.23,-1.1705,1.2799,0.2994,0.7551,-0.5647,-0.6386,1.2799,2.4504,1.0204,0.9538,1.1375,1.015,0.0367,-0.0021,0.0,1.1375,0.1838,0.0981,-0.0904,0.2693,0.0989,0.1003,-0.0211,-0.0256,0.2693,0.3597,-0.2434,-1.3441,1.1095,-0.2769,0.7415,0.5864,0.6261,1.3441,2.4537,9.8222,9.7688,9.884,9.8201,0.0278,-0.0017,-0.0012,9.884,0.1152,1.2729,0.999,1.631,1.2699,0.2104,-0.1845,-0.1865,1.631,0.632
499,0.3712,0.338,0.3864,0.3734,0.0121,0.0048,0.0017,0.3864,0.0484,-1.0299,-1.049,-1.0017,-1.0311,0.0142,0.0889,0.0425,1.049,0.0473,-9.7593,-9.7722,-9.7481,-9.7592,0.0084,-0.0087,-0.0067,9.7722,0.024,-0.3347,-0.6168,-0.0091,-0.3392,0.1854,0.6239,0.4487,0.6168,0.6077,1.0183,0.98,1.0763,1.015,0.0257,-0.0233,-0.0219,1.0763,0.0963,0.0771,0.0119,0.1317,0.0733,0.0333,0.0057,0.0273,0.1317,0.1198,0.3431,0.0094,0.6326,0.3493,0.1877,-0.6334,-0.4595,0.6326,0.6232,9.8206,9.8086,9.8351,9.8189,0.0085,0.0005,0.0056,9.8351,0.0265,1.0884,0.9915,1.2116,1.0834,0.0654,0.1103,0.0101,1.2116,0.2201
500,0.3759,0.32,0.4215,0.3751,0.0219,-0.0007,-0.0012,0.4215,0.1015,-0.941,-1.0909,-0.7253,-0.9886,0.1075,-0.0142,-0.0063,1.0909,0.3656,-9.7681,-9.8307,-9.7376,-9.7659,0.021,0.002,0.0023,9.8307,0.0931,0.2893,-1.0909,1.3849,0.1095,0.6377,-0.0958,0.0256,1.3849,2.4758,0.9949,0.945,1.0412,0.9931,0.0245,0.0062,0.0022,1.0412,0.0963,0.0828,-0.2356,0.2752,0.1007,0.1202,-0.0031,-0.0099,0.2752,0.5108,-0.2904,-1.3865,0.9054,-0.1102,0.5899,0.0939,-0.0037,1.3865,2.2919,9.8211,9.7805,9.8709,9.8245,0.0198,-0.0006,-0.0022,9.8709,0.0904,1.1988,0.9994,1.7095,1.0935,0.2228,0.0091,0.0162,1.7095,0.7101
502,0.3745,0.2796,0.4408,0.3728,0.0387,0.0002,0.0002,0.4408,0.1613,-0.9694,-1.1172,-0.6786,-1.0011,0.107,0.1372,0.1658,1.1172,0.4386,-9.7642,-9.8535,-9.6813,-9.7613,0.0274,-0.0167,-0.0185,9.8535,0.1722,0.0976,-1.2965,1.2679,0.1606,0.6975,-0.0701,0.0464,1.2965,2.5644,1.0073,0.9538,1.1025,0.9975,0.0341,0.0019,0.0088,1.1025,0.1488,0.0765,-0.2868,0.3682,0.0809,0.131,0.015,0.032,0.3682,0.655,-0.1025,-1.2693,1.1948,-0.1175,0.6654,0.0636,-0.0528,1.2693,2.4641,9.8199,9.7555,9.9204,9.8201,0.0254,0.0038,0.003,9.9204,0.1649,1.2169,0.9835,1.6853,1.1258,0.1988,0.0615,0.0828,1.6853,0.7019
503,0.3747,0.3199,0.4245,0.3729,0.0287,0.0019,0.0003,0.4245,0.1045,-0.8323,-0.9706,-0.672,-0.8354,0.0886,-0.0569,-0.0724,0.9706,0.2986,-9.7809,-9.8367,-9.7214,-9.7797,0.0275,0.0088,0.0065,9.8367,0.1153,0.0275,-1.4916,1.0668,0.207,0.8179,0.1401,-0.1066,1.4916,2.5585,1.0093,0.98,1.05,1.0063,0.0218,-0.009,-0.0044,1.05,0.07,0.0915,-0.2004,0.2753,0.113,0.133,0.0002,-0.019,0.2753,0.4757,-0.039,-0.9238,1.2363,-0.1703,0.6829,-0.1116,0.0766,1.2363,2.16,9.8238,9.7767,9.8852,9.8232,0.0267,-0.0039,-0.0025,9.8852,0.1085,1.2784,1.006,1.7904,1.2086,0.2371,-0.2236,-0.1788,1.7904,0.7844
504,0.3766,0.3173,0.4294,0.3732,0.0342,0.0022,0.0134,0.4294,0.1121,-0.8892,-0.9814,-0.7869,-0.9078,0.0642,0.0373,0.0676,0.9814,0.1945,-9.7721,-9.8117,-9.7343,-9.7732,0.0189,-0.0064,-0.0034,9.8117,0.0774,0.1675,-0.2221,0.6376,0.1005,0.2722,-0.4139,-0.3324,0.6376,0.8597,1.0002,0.9538,1.0412,1.0019,0.0249,-0.0066,-0.0044,1.0412,0.0875,0.0917,-0.111,0.2839,0.0939,0.1005,0.004,0.0057,0.2839,0.3949,-0.1506,-0.5796,0.1777,-0.0937,0.2435,0.3587,0.2962,0.5796,0.7573,9.8199,9.7819,9.8637,9.8207,0.0193,0.003,0.0024,9.8637,0.0818,1.0549,0.9728,1.1901,1.0298,0.063,-0.019,0.0082,1.1901,0.2173
505,0.3788,0.3098,0.4356,0.3866,0.0365,-0.0016,-0.0046,0.4356,0.1258,-0.8519,-0.9186,-0.8114,-0.8402,0.0315,-0.0208,-0.0326,0.9186,0.1071,-9.7784,-9.7953,-9.7585,-9.7766,0.0106,0.0023,0.0003,9.7953,0.0368,-0.2463,-0.4142,-0.0481,-0.2319,0.1139,0.277,0.1921,0.4142,0.3662,0.9937,0.9013,1.0412,0.9975,0.0359,0.0074,0.0044,1.0412,0.14,0.0957,-0.0211,0.2083,0.0997,0.0576,0.0042,0.0038,0.2083,0.2295,0.208,0.0441,0.3386,0.2024,0.0937,-0.2374,-0.1711,0.3386,0.2944,9.8229,9.8071,9.8372,9.8231,0.0096,-0.0005,-0.001,9.8372,0.03,1.0359,0.9903,1.0737,1.038,0.0267,0.0324,-0.0035,1.0737,0.0834
507,0.3756,0.3131,0.4104,0.3774,0.0203,-0.0007,-0.0023,0.4104,0.0973,-0.8935,-0.9658,-0.7714,-0.9054,0.0472,0.0224,0.0452,0.9658,0.1945,-9.7739,-9.7946,-9.7477,-9.7759,0.0133,-0.0009,0.0001,9.7946,0.047,0.3076,-0.0631,1.0053,0.1523,0.3231,-0.7612,-0.5972,1.0053,1.0684,1.0085,0.9712,1.1463,1.0062,0.0279,0.0068,0.0088,1.1463,0.175,0.1041,-0.0402,0.2209,0.1073,0.0552,-0.0181,-0.0237,0.2209,0.2611,-0.2668,-0.8416,0.0592,-0.1398,0.274,0.6615,0.5315,0.8416,0.9008,9.822,9.7931,9.8489,9.8211,0.0129,-0.0012,0.0012,9.8489,0.0557,1.1006,0.978,1.4114,1.031,0.1319,0.027,0.0726,1.4114,0.4333
508,0.3749,0.323,0.4212,0.3751,0.027,-0.0059,0.0016,0.4212,0.0982,-0.871,-0.9598,-0.7935,-0.8602,0.0441,0.1,0.0856,0.9598,0.1664,-9.7748,-9.8323,-9.7373,-9.7758,0.0213,-0.0075,-0.0071,9.8323,0.095,-0.4536,-0.8854,-0.1321,-0.445,0.1733,1.2309,1.2508,0.8854,0.7533,1.0154,0.9712,1.0588,1.015,0.0189,-0.0244,-0.0263,1.0588,0.0875,0.086,-0.0843,0.2472,0.0836,0.0665,-0.0375,-0.0486,0.2472,0.3316,0.3947,0.1219,0.7683,0.3917,0.1541,-1.0159,-1.0085,0.7683,0.6464,9.8208,9.7825,9.8749,9.8223,0.0216,-0.001,-0.0045,9.8749,0.0924,1.1275,1.0067,1.3692,1.1036,0.0801,0.2015,0.1917,1.3692,0.3624
509,0.369,0.3181,0.4007,0.3767,0.031,0.0168,0.012,0.4007,0.0826,-0.771,-0.8527,-0.6642,-0.7746,0.0673,-0.271,-0.2708,0.8527,0.1885,-9.7823,-9.8099,-9.7655,-9.7829,0.0141,0.0228,0.0213,9.8099,0.0444,0.7773,-0.171,1.3444,0.8058,0.4892,-0.2253,-0.3512,1.3444,1.5154,0.9909,0.9538,1.0412,0.9888,0.028,0.023,0.0219,1.0412,0.0875,0.0485,-0.1232,0.2783,0.035,0.1475,0.0394,0.0576,0.2783,0.4014,-0.6212,-1.1464,0.1136,-0.6168,0.4018,0.0433,0.1425,1.1464,1.26,9.8198,9.8007,9.8519,9.8177,0.017,0.0028,0.0094,9.8519,0.0512,1.329,0.9768,1.678,1.2952,0.2423,-0.1531,-0.1849,1.678,0.7013
510,0.3858,0.3468,0.4196,0.3887,0.02,-0.003,-0.0029,0.4196,0.0728,-1.042,-1.1083,-0.9934,-1.0454,0.0269,0.012,0.0037,1.1083,0.1149,-9.7595,-9.7774,-9.735,-9.7616,0.0138,-0.001,0.0003,9.7774,0.0424,0.552,0.228,1.154,0.4546,0.2506,-0.1228,0.0109,1.154,0.9259,1.0139,0.9888,1.0675,1.0106,0.0186,-0.0003,0.0022,1.0675,0.0787,0.0879,-0.0131,0.2047,0.0926,0.0593,-0.0005,0.0007,0.2047,0.2178,-0.5779,-1.2098,-0.2365,-0.4743,0.2706,0.138,0.0249,1.2098,0.9734,9.8226,9.7954,9.8372,9.8271,0.0137,-0.0002,-0.0031,9.8372,0.0419,1.1759,1.0362,1.572,1.1104,0.1466,0.0823,0.1249,1.572,0.5358
512,0.3797,0.3275,0.4312,0.383,0.0298,-0.0346,-0.0186,0.4312,0.1037,-1.018,-1.1286,-0.7977,-1.0379,0.0807,-0.1493,-0.1104,1.1286,0.3309,-9.7616,-9.8017,-9.7269,-9.761,0.016,0.0114,0.0199,9.8017,0.0748,0.3064,-1.052,1.3295,0.4764,0.8511,-0.2274,-0.2964,1.3295,2.3814,1.0132,0.9712,1.1112,1.015,0.0264,0.0045,0.0,1.1112,0.14,0.0869,-0.0841,0.2108,0.094,0.0695,0.0015,0.0262,0.2108,0.2949,-0.3019,-1.4105,1.1035,-0.4246,0.8788,0.2269,0.2153,1.4105,2.514,9.8222,9.7896,9.8653,9.8209,0.0158,0.0042,0.0027,9.8653,0.0757,1.3405,1.0086,1.6766,1.3602,0.2099,-0.1982,-0.2605,1.6766,0.668
513,0.3452,0.1567,0.4255,0.3643,0.0727,-0.0239,-0.0225,0.4255,0.2688,-1.1673,-1.3997,-1.0735,-1.1483,0.0807,-0.0989,-0.0898,1.3997,0.3261,-9.7501,-9.8137,-9.6971,-9.741,0.0351,-0.0098,-0.0175,9.8137,0.1166,0.079,-0.8777,0.8658,0.18,0.5235,-8.1125,-6.8459,0.8777,1.7435,1.0177,0.9888,1.1025,1.015,0.0272,-0.0859,-0.1094,1.1025,0.1137,0.0883,-0.2211,0.1831,0.1202,0.106,0.7438,0.3585,0.2211,0.4043,-0.0749,-0.9963,1.2285,-0.2093,0.6292,9.8655,10.0722,1.2285,2.2248,9.8264,9.7692,9.9142,9.8236,0.0393,0.0253,0.0249,9.9142,0.1451,1.1423,1.0114,1.3665,1.0997,0.1183,7.0209,5.6384,1.3665,0.3551
514,0.3212,0.2045,0.399,0.3418,0.061,0.0983,0.0456,0.399,0.1945,-1.2662,-1.7097,-0.7145,-1.2381,0.3249,1.6459,1.6319,1.7097,0.9952,-9.7599,-9.8643,-9.6808,-9.7585,0.0611,-0.0564,-0.0545,9.8643,0.1836,-8.0335,-15.7442,-2.7866,-6.666,4.983,6.5196,5.1861,15.7442,12.9575,0.9319,0.8575,1.0588,0.9056,0.0695,0.0498,0.0744,1.0588,0.2012,0.8321,-0.0003,1.9423,0.4787,0.7495,-0.5582,-0.2333,1.9423,1.9426,9.7905,2.8365,17.1826,9.8629,5.5257,-10.3885,-10.4417,17.1826,14.346,9.8517,9.7702,10.0172,9.8485,0.0785,-0.0183,-0.0164,10.0172,0.247,8.1632,2.981,15.8891,6.7381,4.9779,-6.3053,-4.9248,15.8891,12.9081
515,0.4195,0.3053,0.6053,0.3874,0.0957,-0.0378,-0.0174,0.6053,0.3,0.3797,0.2059,0.4883,0.3938,0.0837,0.0407,0.044,0.4883,0.2824,-9.8163,-9.8682,-9.7631,-9.813,0.0321,0.0015,0.0003,9.8682,0.1051,-1.5139,-2.8871,-0.8705,-1.4799,0.5247,0.7492,0.7587,2.8871,2.0166,0.9816,0.9363,1.0413,0.98,0.032,0.009,0.0087,1.0413,0.105,0.2738,-0.0709,0.6173,0.2453,0.2092,-0.0832,-0.0769,0.6173,0.6882,-0.5979,-1.2128,-0.1844,-0.5788,0.2908,0.2967,0.2986,1.2128,1.0284,9.8334,9.7788,9.881,9.832,0.0332,-0.0014,-0.001,9.881,0.1021,1.8579,1.369,3.0497,1.8134,0.4367,-0.3951,-0.3926,3.0497,1.6807
517,0.3439,0.2179,0.4237,0.3527,0.0449,0.0179,0.0109,0.4237,0.2058,0.4611,0.298,0.5434,0.4817,0.0663,0.0224,-0.0021,0.5434,0.2453,-9.8134,-9.8536,-9.7786,-9.8124,0.0148,0.0024,-0.0012,9.8536,0.075,-0.0154,-1.0039,0.6151,0.0375,0.3673,0.0489,0.0008,1.0039,1.6191,0.9996,0.91,1.05,0.9975,0.0249,0.0045,0.0044,1.05,0.14,0.1074,0.0084,0.4893,0.0916,0.0862,-0.0081,0.006,0.4893,0.4809,-0.0045,-0.489,0.2676,0.0184,0.1539,0.0206,-0.0002,0.489,0.7566,9.8306,9.7956,9.8671,9.8299,0.0149,-0.001,0.0029,9.8671,0.0715,1.0678,0.9746,1.4282,1.0282,0.103,-0.0574,-0.0215,1.4282,0.4536
518,0.3619,0.3455,0.3698,0.3636,0.0074,-0.0068,-0.0093,0.3698,0.0243,0.4834,0.4674,0.5152,0.4796,0.0161,0.0217,0.0233,0.5152,0.0479,-9.811,-9.8351,-9.791,-9.8136,0.014,-0.0003,0.0025,9.8351,0.0441,0.0335,-0.0466,0.0945,0.0382,0.0414,-0.1247,-0.1178,0.0945,0.1411,1.0041,0.9712,1.05,1.0019,0.0237,-0.0044,-0.0044,1.05,0.0787,0.0992,0.0795,0.1291,0.0976,0.016,0.0016,0.0014,0.1291,0.0495,0.016,-0.0223,0.0444,0.0182,0.0196,-0.0622,-0.0571,0.0444,0.0667,9.8295,9.8095,9.8531,9.8328,0.0139,0.0012,-0.0013,9.8531,0.0436,1.0104,0.9798,1.0588,1.0066,0.0236,0.0006,0.0005,1.0588,0.0789
519,0.3551,0.337,0.3764,0.3543,0.0135,0.0037,0.002,0.3764,0.0394,0.5051,0.4799,0.538,0.503,0.0177,-0.0254,-0.0257,0.538,0.058,-9.8113,-9.8233,-9.7965,-9.8111,0.0082,-0.0025,-0.0027,9.8233,0.0268,-0.0912,-0.1951,-0.0226,-0.0796,0.0661,0.282,0.2589,0.1951,0.1726,0.9997,0.98,1.015,0.9975,0.0146,0.0071,0.0131,1.015,0.035,0.1009,0.0825,0.1425,0.099,0.0187,-0.0456,-0.0351,0.1425,0.0601,-0.0461,-0.098,-0.0114,-0.0389,0.0337,0.1352,0.1283,0.098,0.0866,9.8307,9.8157,9.842,9.8315,0.0084,0.0014,0.0006,9.842,0.0262,1.011,1.0001,1.0268,1.0071,0.01,0.0228,0.0175,1.0268,0.0266
520,0.3588,0.333,0.4335,0.3563,0.0232,-0.0116,0.0006,0.4335,0.1006,0.4797,0.3668,0.5475,0.4772,0.0426,-0.0092,0.0373,0.5475,0.1807,-9.8138,-9.849,-9.7749,-9.8138,0.0172,0.0013,0.0033,9.849,0.0741,0.1907,0.0375,0.4757,0.1793,0.1165,-0.2116,-0.0108,0.4757,0.4382,1.0068,0.9363,1.0588,1.0106,0.0264,0.0036,0.0,1.0588,0.1225,0.0553,-0.1229,0.1277,0.0639,0.064,0.0469,0.0235,0.1277,0.2506,0.0891,0.0195,0.1745,0.0893,0.0485,-0.154,-0.1013,0.1745,0.155,9.8321,9.7928,9.8704,9.8322,0.0175,0.0002,0.0004,9.8704,0.0775,1.0338,0.9724,1.1369,1.0246,0.0412,0.5091,0.4692,1.1369,0.1645
522,0.3357,0.0788,0.629,0.3575,0.1255,0.0315,0.003,0.629,0.5502,0.4613,-0.3172,0.9239,0.5517,0.2875,-0.0569,-0.1795,0.9239,1.2411,-9.8112,-9.948,-9.667,-9.8072,0.0507,-0.0037,-0.0078,9.948,0.281,-0.2325,-2.8652,3.2623,0.1576,1.9082,1.2222,1.117,3.2623,6.1275,1.014,0.875,1.2162,1.0106,0.0581,0.0016,0.0,1.2162,0.3412,0.1491,-1.3325,1.3681,0.1109,0.4122,0.0163,0.024,1.3681,2.7006,-0.2188,-1.7902,2.2677,-0.1132,0.8981,0.6602,0.524,2.2677,4.0579,9.8326,9.6917,10.0071,9.833,0.0537,-0.002,-0.0039,10.0071,0.3154,2.0519,1.0173,3.4649,1.9629,0.7955,-0.2444,-0.3343,3.4649,2.4476
523,0.3672,0.3299,0.4167,0.3605,0.0254,-0.0311,-0.0388,0.4167,0.0868,0.4044,0.2639,0.6942,0.3722,0.1072,0.3798,0.4063,0.6942,0.4303,-9.8148,-9.8399,-9.7882,-9.815,0.0147,0.0124,0.0152,9.8399,0.0517,0.9897,-1.0881,2.44,1.2747,1.2936,-0.1042,0.0841,2.44,3.5281,1.0155,0.9625,1.1025,1.0106,0.0364,0.0323,0.0394,1.1025,0.14,0.1653,-0.0002,0.3342,0.1349,0.0944,-0.2163,-0.1453,0.3342,0.3344,0.4414,-0.5411,1.4718,0.4108,0.6227,-0.0493,0.6134,1.4718,2.0129,9.8306,9.8016,9.8603,9.829,0.0155,0.0105,0.0159,9.8603,0.0586,1.8076,0.9869,2.6402,1.6287,0.6105,0.3865,0.6627,2.6402,1.6532
524,0.3361,0.2678,0.4232,0.3217,0.0564,0.7027,0.9065,0.4232,0.1554,0.7842,0.544,1.0251,0.7785,0.1811,-1.8023,-1.7411,1.0251,0.4811,-9.8024,-9.8308,-9.7855,-9.7997,0.0145,0.0462,0.1175,9.8308,0.0453,0.8856,-2.3396,3.1951,1.3588,1.981,-3.3034,-2.1833,3.1951,5.5347,1.0478,0.9713,1.1025,1.05,0.042,-0.0747,-0.0525,1.1025,0.1312,-0.051,-0.5097,0.2558,-0.0104,0.2482,-0.0632,-0.153,0.5097,0.7655,0.3922,-2.3982,1.738,1.0242,1.5125,0.2976,-0.8856,2.3982,4.1362,9.8411,9.8145,9.8635,9.8449,0.0172,0.0986,0.1523,9.8635,0.049,2.194,1.0657,3.4182,2.2914,0.8002,1.9676,0.1685,3.4182,2.3525
525,1.0388,-1.0782,2.1969,1.2281,0.7579,-0.1933,-0.2461,2.1969,3.2751,-1.0181,-2.5576,1.0472,-0.9625,0.9977,0.4214,0.3649,2.5576,3.6048,-9.7562,-10.6074,-9.0451,-9.6822,0.4046,-0.0602,-0.0996,10.6074,1.5622,-2.4179,-13.5057,5.1764,-0.8244,4.8403,-2.2182,-3.0431,13.5057,18.6821,0.9731,-0.1662,1.7325,0.9975,0.5189,1.1269,0.4047,1.7325,1.8988,-0.1143,-2.1842,1.7344,-0.1634,1.1648,-4.6176,-0.5431,2.1842,3.9186,0.6897,-12.886,20.375,0.1386,7.7929,-0.538,-0.1255,20.375,33.2609,9.9397,9.258,10.7907,9.9972,0.4126,0.0407,0.0223,10.7907,1.5327,4.1616,0.41,13.6111,2.4599,3.7529,9.0639,6.009,13.6111,13.2011
527,0.6522,-2.1311,3.0173,0.736,1.0054,-0.8262,-0.8385,3.0173,5.1484,-0.1754,-3.6796,2.6952,-0.2328,1.1984,0.4215,0.5829,3.6796,6.3749,-9.8766,-12.3344,-7.307,-9.8815,0.8796,-0.13,-0.0451,12.3344,5.0274,-6.8542,-31.9156,4.8121,-6.9107,7.0245,7.8427,8.8998,31.9156,36.7278,3.2269,-0.4637,12.1188,1.8069,3.2921,8.409,9.9356,12.1188,12.5825,-9.3494,-56.5368,27.0554,-1.2495,24.2707,-48.6718,-56.3528,56.5368,83.5922,-0.3863,-81.751,49.4482,-0.1123,16.4048,0.9353,0.9839,81.751,131.1993,10.0211,7.3313,12.4104,10.0418,0.8684,0.0139,-0.0948,12.4104,5.0791,22.2894,1.2642,57.6877,14.478,17.0392,36.994,44.2459,57.6877,56.4235
528,-0.174,-0.7824,0.4579,-0.1025,0.3512,0.7129,0.771,0.7824,1.2403,0.2461,-0.6325,1.2046,0.3501,0.6252,0.1098,-0.009,1.2046,1.8371,-10.0066,-10.9332,-8.5677,-9.9266,0.6504,0.061,0.1711,10.9332,2.3655,0.9886,-5.3984,5.0091,1.9891,3.2932,1.438,0.6877,5.3984,10.4075,11.6359,8.3213,14.7088,11.7425,1.7782,-4.3985,-4.1956,14.7088,6.3875,-58.0212,-64.7504,-49.4214,-57.6023,4.8688,16.3541,15.7719,64.7504,15.329,0.549,-6.5029,4.9217,0.8716,2.5658,0.2774,0.14,6.5029,11.4246,10.035,8.5684,10.9589,9.947,0.6534,-0.0359,-0.135,10.9589,2.3906,59.2834,50.7,66.1437,58.7239,5.0246,-16.8805,-16.1659,66.1437,15.4436
529,0.539,-0.5554,1.1376,0.6685,0.5376,-0.3024,-0.5063,1.1376,1.693,0.3559,-1.0047,1.1154,0.3411,0.641,-0.1709,-0.1442,1.1154,2.1202,-9.9456,-11.6971,-8.7708,-9.7556,0.909,-0.196,-0.5584,11.6971,2.9263,2.4266,0.936,3.4883,2.6768,0.964,-2.0235,-2.2206,3.4883,2.5523,7.2373,3.6488,9.5375,7.5469,1.7406,5.9762,7.175,9.5375,5.8888,-41.6671,-43.4738,-38.5715,-41.8304,1.5311,-13.2211,-15.6227,43.4738,4.9023,0.8264,-3.2329,3.4721,1.0117,1.9651,2.2739,-0.1853,3.4721,6.705,9.9991,8.8654,11.7131,9.812,0.885,0.1899,0.5473,11.7131,2.8477,42.4029,39.517,44.6164,42.558,1.4846,14.3826,16.9181,44.6164,5.0994
530,0.2366,-0.9343,1.4077,0.1622,0.5858,0.2923,0.2315,1.4077,2.342,0.185,-1.1717,1.5086,0.1969,0.7491,0.0221,0.0937,1.5086,2.6803,-10.1415,-12.6482,-8.5321,-10.3139,1.0587,0.0823,0.1287,12.6482,4.1161,0.4031,-7.4916,8.5947,0.4561,5.5089,3.558,1.7881,8.5947,16.0863,13.2136,8.7413,18.4188,14.7219,3.547,-2.7532,-2.765,18.4188,9.6775,-54.8882,-59.8077,-43.5575,-57.4531,4.7609,11.1068,11.6938,59.8077,16.2502,3.1004,-1.4738,10.9292,0.8264,4.334,-0.587,0.2639,10.9292,12.403,10.189,8.6623,12.6592,10.3593,1.0454,-0.0545,-0.1068,12.6592,3.9969,56.7854,44.8176,61.6843,59.4761,5.1006,-10.281,-10.8792,61.6843,16.8667
532,0.8212,-0.8873,3.4494,0.6252,0.8215,0.0778,0.2052,3.4494,4.3367,0.2293,-1.5642,1.3159,0.3842,0.7285,0.4282,0.2857,1.5642,2.8801,-9.977,-14.758,-6.1181,-10.0566,1.7677,0.1068,0.2018,14.758,8.6399,7.5191,-3.46,22.444,4.0323,7.8154,9.7771,14.1646,22.444,25.904,7.7072,-2.45,13.0112,9.1919,3.5691,-4.4888,-6.3744,13.0112,15.4613,-32.6747,-47.355,-6.0435,-34.0656,11.3091,44.393,43.7689,47.355,41.3115,1.9264,-19.6079,24.3343,1.3541,7.9318,9.809,8.5594,24.3343,43.9422,10.0801,6.3232,14.7731,10.1458,1.7211,-0.0235,0.0004,14.7731,8.4499,36.2234,18.12,48.4118,37.7177,8.398,-12.0269,-15.5153,48.4118,30.2919
533,0.899,-1.3156,3.9875,0.8304,1.352,-0.3474,-0.116,3.9875,5.3031,0.6575,-0.222,1.7174,0.6699,0.5788,-0.4739,-0.5152,1.7174,1.9394,-9.8702,-16.6543,-2.1122,-9.8548,3.1775,-0.0952,-0.9028,16.6543,14.5421,17.2962,11.005,23.2076,18.1969,3.6991,-18.85,-19.534,23.2076,12.2026,3.2184,-4.1038,16.7038,2.8175,4.9102,-0.9795,0.5381,16.7038,20.8075,11.7183,-7.1657,28.125,9.7033,11.5935,16.3937,17.4233,28.125,35.2908,11.7353,-3.976,36.7438,9.9135,11.2567,-12.6642,-10.5902,36.7438,40.7198,10.0566,2.3187,16.6554,10.1462,3.1017,0.0253,0.6209,16.6554,14.3366,24.1965,19.0782,32.6221,22.2024,4.932,4.5416,5.2523,32.6221,13.5439
534,0.5516,-1.4662,2.3553,0.7144,1.1237,0.1624,-0.0367,2.3553,3.8215,0.1836,-1.0676,1.1519,0.1547,0.8267,-0.0479,-0.3303,1.1519,2.2195,-9.9654,-15.5074,-3.2608,-10.7576,4.8858,0.4856,1.3579,15.5074,12.2465,-1.5538,-5.911,2.818,-1.3371,3.2707,1.6166,5.4113,5.911,8.729,2.2389,-4.9963,7.2363,3.3556,4.7327,-1.8255,-4.235,7.2363,12.2325,28.1121,26.3661,32.0557,27.1266,2.1181,-22.539,-24.6923,32.0557,5.6897,-0.9289,-6.4625,2.5451,-0.6767,2.7185,-10.8011,-3.215,6.4625,9.0075,10.0819,3.4585,15.6131,10.7671,4.8511,-0.3981,-0.8682,15.6131,12.1546,28.7381,26.5892,33.2267,27.4547,2.3225,-12.0787,-12.0788,33.2267,6.6375
535,0.714,-1.3404,2.6665,0.6777,1.271,-0.2713,-0.3061,2.6665,4.0069,0.1357,-1.6025,2.8939,-0.1756,1.3902,0.0068,0.2006,2.8939,4.4965,-9.4798,-12.8415,-6.1682,-9.3997,1.7881,-0.1378,-0.2318,12.8415,6.6733,0.0628,-22.3443,16.011,4.0742,13.5339,-0.6866,-1.5903,22.3443,38.3553,0.4134,-5.9675,8.0238,-0.8794,4.1403,0.3489,0.7438,8.0238,13.9913,5.573,-9.1242,23.0588,2.4344,11.4724,-3.3445,-2.9527,23.0588,32.183,-11.73,-60.0358,8.8087,-3.8917,20.873,6.2991,2.1892,60.0358,68.8444,9.6838,6.3013,12.8595,9.8989,1.7716,0.2065,0.0322,12.8595,6.5581,16.6594,4.9834,32.0385,15.3759,8.3186,-2.7513,-3.7663,32.0385,27.0551
537,0.1714,-3.1407,5.5347,0.0655,1.5924,-0.0472,-0.46,5.5347,8.6754,0.1494,-0.9174,1.6546,0.2256,0.5443,0.1647,0.035,1.6546,2.572,-9.7553,-19.4809,3.5392,-9.8633,3.9316,0.1238,0.033,19.4809,23.0201,-1.3105,-23.9459,14.4855,0.8936,8.9565,0.9657,-1.1445,23.9459,38.4314,1.1113,-8.3738,12.6963,0.6081,4.5115,0.0175,0.7656,12.6963,21.07,-1.1159,-12.3895,24.4106,-3.4709,8.8405,2.3353,4.6776,24.4106,36.8001,0.8683,-12.1012,16.1269,0.4868,4.3187,-0.9074,-0.5362,16.1269,28.2281,10.0968,3.9383,19.5603,9.9634,3.3799,-0.2415,-0.1172,19.5603,15.622,11.1568,3.0614,30.5413,7.8434,7.4829,-7.7542,-4.6492,30.5413,27.4799
538,0.1243,-1.1154,3.4111,-0.3945,1.5404,0.0794,0.5428,3.4111,4.5264,0.3141,-0.0557,0.7725,0.2606,0.2816,-0.3373,-0.1837,0.7725,0.8282,-9.6315,-15.2178,-3.3393,-9.8303,3.4235,-0.2115,-0.0219,15.2178,11.8786,-0.3448,-1.3751,0.4954,-0.2509,0.574,-4.833,-5.0904,1.3751,1.8705,1.1288,-3.7013,7.3675,1.3738,3.5139,0.2505,0.8925,7.3675,11.0688,1.2194,-0.1335,2.4923,1.2066,0.8773,-7.8306,-7.3098,2.4923,2.6258,-0.0392,-0.4501,0.3827,-0.0494,0.2306,0.0595,-0.3054,0.4501,0.8328,9.8554,4.7847,15.2219,9.8462,3.0525,0.0113,0.0402,15.2219,10.4373,3.4026,1.6114,7.5403,3.1942,1.8725,5.6721,5.6769,7.5403,5.9289
539,0.2037,-0.6797,1.0491,0.1483,0.6251,-0.137,-0.0289,1.0491,1.7288,-0.0232,-0.5631,0.2824,0.0769,0.2844,0.2587,0.1373,0.5631,0.8456,-9.843,-10.8416,-8.0319,-9.8522,0.8682,0.0248,-0.4586,10.8416,2.8096,-5.1778,-6.9134,-2.3107,-5.3413,1.4054,10.879,10.701,6.9134,4.6027,1.3792,-2.6862,4.3313,2.2663,2.574,0.4457,-0.7263,4.3313,7.0175,-6.6112,-9.8815,-4.1844,-6.1032,2.1447,7.2016,7.6409,9.8815,5.6971,0.0203,-1.6599,2.907,-0.3548,1.5177,1.3944,1.5647,2.907,4.5669,9.8667,8.0599,10.8473,9.8864,0.8606,-0.0291,0.4359,10.8473,2.7873,9.0747,7.4758,11.0337,8.8711,1.361,-2.5453,-2.8324,11.0337,3.5579
540,0.0667,-0.7259,0.8375,0.1194,0.4987,-0.0089,-0.04,0.8375,1.5634,0.2355,-0.2406,0.7642,0.2142,0.2485,-0.0427,-0.0588,0.7642,1.0047,-9.8182,-11.734,-7.3926,-10.3107,1.2758,0.0172,0.3404,11.734,4.3414,5.7012,3.354,7.8774,5.3597,1.5932,-3.2426,-2.3076,7.8774,4.5233,1.8249,0.0175,5.005,1.54,1.5522,-0.4858,-0.1881,5.005,4.9875,0.5903,-3.3924,3.3898,1.5377,2.2971,-1.15,-1.5985,3.3924,6.7822,1.4146,-1.1174,5.2475,1.2099,1.558,-0.6739,-0.5237,5.2475,6.3649,9.8376,7.479,11.7671,10.3223,1.2629,-0.0138,-0.3362,11.7671,4.2881,6.5294,4.1358,9.331,6.0388,1.8285,-0.3455,0.1583,9.331,5.1951
542,0.0489,-1.016,1.4055,0.0395,0.6099,0.0522,0.0818,1.4055,2.4215,0.1501,-0.4297,0.7486,0.0966,0.3216,0.0378,-0.0015,0.7486,1.1783,-9.7838,-13.7256,-5.2197,-9.6299,1.6521,-0.2013,-0.4725,13.7256,8.5059,-0.784,-8.669,5.3073,0.7446,4.3579,0.2599,-1.186,8.669,13.9763,0.8533,-2.9575,3.7275,1.1638,1.6729,0.3389,0.7525,3.7275,6.685,-1.7097,-6.8078,4.1853,-1.6592,3.4416,3.2616,3.3766,6.8078,10.9932,0.0669,-5.2767,3.0956,0.1624,1.5685,-0.1929,-0.2221,5.2767,8.3723,9.81,5.2873,13.7593,9.6499,1.6448,0.1907,0.4758,13.7593,8.4719,5.8385,1.9215,9.024,6.3555,1.7901,-3.1271,-3.4651,9.024,7.1026
543,0.1011,-0.869,0.8328,0.1213,0.4945,-0.1067,-0.1155,0.869,1.7018,0.1879,-0.0509,0.6337,0.0951,0.2474,-0.18,-0.2394,0.6337,0.6846,-9.9851,-11.741,-8.0752,-10.1024,1.2183,-0.0286,0.0225,11.741,3.6659,-0.5241,-2.0308,0.7972,-0.4415,0.813,-0.4682,-0.5028,2.0308,2.828,1.1922,-2.4063,2.8875,1.9162,1.7857,0.4452,-0.8837,2.8875,5.2938,1.5519,0.7295,2.1907,1.7174,0.5071,-6.165,-6.4593,2.1907,1.4612,-0.126,-0.41,0.0225,-0.0597,0.1618,0.1315,0.1295,0.41,0.4326,10.0007,8.1,11.7738,10.1256,1.2189,0.0558,-0.0108,11.7738,3.6738,2.7113,1.6638,3.6047,2.8904,0.6294,3.1415,2.7099,3.6047,1.9409
544,-0.0056,-1.4183,1.1635,0.0058,0.9224,0.1015,0.2144,1.4183,2.5818,0.0079,-0.4027,0.4877,-0.1442,0.3517,0.2274,0.3692,0.4877,0.8904,-10.0137,-13.3284,-7.1411,-10.0799,1.7683,0.1041,0.2963,13.3284,6.1873,-0.9924,-3.7569,1.8885,-0.9442,2.2297,1.9464,2.4743,3.7569,5.6454,1.6373,-1.8725,6.1075,1.0325,2.4383,0.4195,1.2337,6.1075,7.98,-4.6131,-6.333,-1.6796,-4.7419,1.5151,5.8869,6.0172,6.333,4.6534,0.0055,-1.2217,0.9442,0.0699,0.6962,0.3742,0.2453,1.2217,2.1659,10.0565,7.2092,13.4039,10.1149,1.7665,-0.1229,-0.2992,13.4039,6.1947,5.8528,3.4988,8.8249,5.6002,1.6044,-1.4708,-1.3736,8.8249,5.3261
545,0.0959,-1.0038,1.0948,0.2203,0.5368,-0.6573,-0.6752,1.0948,2.0986,0.2354,-0.4327,0.8641,0.225,0.3658,-0.0387,-0.0769,0.8641,1.2968,-9.9097,-11.7436,-8.3216,-9.7836,0.9995,0.0452,-0.0693,11.7436,3.4221,0.9541,-5.2446,3.2703,1.5301,2.4792,0.3452,0.184,5.2446,8.5149,2.0568,-1.0062,5.46,2.2663,1.8754,-0.6093,-0.6213,5.46,6.4663,1.2738,-1.7803,5.0621,1.2753,2.219,-1.3862,-1.3546,5.0621,6.8424,0.3797,-1.2962,2.1518,0.3151,0.8616,-0.0187,-0.0699,2.1518,3.448,9.9336,8.3924,11.7585,9.8156,0.992,0.0149,0.143,11.7585,3.3661,4.382,2.9838,6.388,4.2266,1.1485,0.4133,0.5198,6.388,3.4043
547,-1.2187,-4.0486,1.2859,-1.1302,1.1172,-1.4762,-1.5353,4.0486,5.3345,0.1579,-0.8707,1.4942,0.0712,0.4586,-0.1031,-0.0027,1.4942,2.3649,-9.8192,-12.0929,-7.7059,-9.9223,1.1288,0.0236,0.2221,12.0929,4.387,1.6445,-3.4695,5.0128,1.8982,2.0986,-0.4537,-0.9765,5.0128,8.4823,0.8381,-6.265,6.09,1.0238,2.4255,0.0915,-0.5206,6.265,12.355,-1.4987,-6.848,6.7899,-1.4339,3.7636,-0.0847,-0.9716,6.848,13.6379,0.3424,-4.0369,4.6676,0.1753,1.2828,-0.1337,-0.1064,4.6676,8.7045,9.9634,7.8569,12.4091,10.1016,1.1681,0.2321,0.038,12.4091,4.5522,5.2086,1.1984,9.0893,5.2662,1.5983,-0.3378,-0.9599,9.0893,7.8909
548,-2.6948,-3.9575,-0.7526,-2.6655,0.8164,2.3646,2.5578,3.9575,3.2049,0.0549,-0.7432,0.6834,0.0685,0.321,0.4979,0.4736,0.7432,1.4266,-9.7956,-11.6121,-8.446,-9.7002,0.7492,-0.1549,-0.2946,11.6121,3.1662,1.1909,-2.5749,6.9449,0.9217,2.9551,8.096,8.4733,6.9449,9.5198,0.9297,-3.6313,6.7112,0.5031,3.064,2.7398,3.29,6.7112,10.3425,-1.5834,-4.3373,2.8487,-2.4055,2.3229,6.4719,5.0309,4.3373,7.186,0.2087,-1.4357,3.6489,0.0689,1.0338,5.0061,5.1066,3.6489,5.0845,10.1955,8.9085,12.1189,10.1396,0.7551,-0.1895,-0.1103,12.1189,3.2103,4.8708,2.7321,8.5945,4.3063,1.9387,7.0819,6.389,8.5945,5.8624
549,-0.3302,-1.6177,0.3236,-0.1076,0.6894,0.1746,-0.0848,1.6177,1.9413,0.5527,-0.3435,1.2303,0.5422,0.559,-0.3722,-0.1346,1.2303,1.5738,-9.9504,-10.4102,-9.4461,-9.9948,0.3934,-0.0497,0.1167,10.4102,0.9641,9.2868,8.5005,9.5941,9.395,0.3688,-10.4553,-12.6141,9.5941,1.0936,3.6695,2.9225,4.2437,3.7931,0.4698,8.3459,7.3806,4.2437,1.3212,4.8885,-0.3167,14.913,2.6254,5.5375,54.1424,58.2862,14.913,15.2297,5.2148,-3.0966,11.5805,5.1755,5.2586,-3.5969,-3.9306,11.5805,14.6771,10.0059,9.5294,10.4162,10.0293,0.3876,0.0744,0.0045,10.4162,0.8869,11.9526,9.104,17.8956,10.6953,3.002,48.5999,51.6082,17.8956,8.7916
550,-0.1556,-1.373,0.9859,-0.1925,0.6434,0.4444,0.4119,1.373,2.3589,0.1805,-1.6378,1.9604,0.4075,1.1161,-0.1697,-0.1481,1.9604,3.5982,-10.0002,-11.3167,-8.6329,-9.8782,0.6945,-0.0007,-0.0304,11.3167,2.6838,-1.1684,-7.7251,6.74,-3.2191,5.617,-3.3925,-0.7956,7.7251,14.4651,12.0154,7.7088,18.375,11.1738,3.7658,-0.9382,-0.2034,18.375,10.6663,59.0309,41.7894,73.2329,60.9116,10.7174,-7.5028,-9.8446,73.2329,31.4435,1.6179,-9.8302,12.8196,1.2449,6.6795,4.1194,2.1525,12.8196,22.6498,10.0803,8.6707,11.3671,10.0338,0.6975,0.0154,-0.0036,11.3671,2.6964,60.5525,43.0915,74.3089,62.3035,11.0434,-6.0423,-8.594,74.3089,31.2174
552,0.7331,-0.6012,2.5652,0.6313,0.7938,0.6554,0.7709,2.5652,3.1664,-0.1589,-2.1752,1.3596,0.1113,0.981,0.2749,-0.1191,2.1752,3.5348,-10.0016,-11.8989,-7.5203,-9.9389,1.0752,0.2436,0.5358,11.8989,4.3787,-7.9534,-29.3785,9.5681,-4.8102,14.4929,5.6852,5.4558,29.3785,38.9465,10.1389,1.5225,18.2525,10.7669,4.0526,-8.6278,-8.505,18.2525,16.73,44.0254,26.211,64.3374,41.2224,10.5552,-51.1607,-47.4583,64.3374,38.1264,9.8566,-18.0847,44.6639,5.5499,13.8463,-7.3993,-4.6784,44.6639,62.7485,10.1111,7.926,11.9052,10.0266,1.0217,-0.0145,-0.2883,11.9052,3.9792,48.468,38.1842,67.8884,45.1155,9.1227,-32.6742,-31.0254,67.8884,29.7042
553,1.3885,-3.3901,4.6832,1.4022,1.4651,-0.4857,-0.2905,4.6832,8.0733,0.116,-1.344,2.0101,-0.0078,0.8309,-0.0139,0.1906,2.0101,3.3541,-9.758,-17.7879,-0.3008,-9.4031,3.2577,-0.0771,-0.3529,17.7879,17.4871,-2.2682,-28.4079,15.5748,0.6456,11.8838,2.1977,-1.2252,28.4079,43.9827,1.5111,-9.7825,7.0175,2.2619,3.3045,0.2564,-0.8531,9.7825,16.8,-7.1353,-32.6917,21.0987,-6.2358,11.8014,5.3393,5.9252,32.6917,53.7903,2.4574,-22.8429,31.7758,0.8715,9.1492,-2.9061,-1.1103,31.7758,54.6187,10.0966,4.4619,17.9731,9.7383,2.9281,-0.0802,0.108,17.9731,13.5112,15.7938,2.547,35.4618,14.0901,9.8269,-9.7589,-8.826,35.4618,32.9148
554,0.9029,-1.4538,3.6248,1.1117,1.1657,-0.6342,-1.1293,3.6248,5.0786,0.1021,-1.4876,1.6396,0.1828,0.7185,0.2539,0.1421,1.6396,3.1273,-9.8351,-17.1824,-1.8389,-9.756,3.0139,-0.053,0.2061,17.1824,15.3435,-0.0705,-3.5236,3.3895,-0.5797,2.0396,-0.3487,-1.5245,3.5236,6.9132,1.7675,-4.9875,9.6775,1.4088,3.7557,-0.2625,0.3281,9.6775,14.665,-1.796,-9.9705,4.0785,-0.3106,4.2772,2.5828,2.8967,9.9705,14.049,-0.4488,-5.0424,2.2052,-0.2388,1.5918,0.7545,0.4414,5.0424,7.2476,10.0165,2.9666,17.2486,9.8462,2.8396,-0.028,-0.2537,17.2486,14.282,6.0349,2.3139,11.5356,5.2641,2.2775,-0.4086,0.0558,11.5356,9.2217
555,0.2687,-1.3198,2.6405,-0.0176,1.2858,-0.0827,0.0328,2.6405,3.9603,0.356,-0.1442,1.0293,0.3249,0.3553,-0.0685,-0.1067,1.0293,1.1735,-9.8881,-14.0267,-5.5958,-9.5498,2.8857,0.0582,-0.3247,14.0267,8.4309,-0.4192,-3.6762,5.9757,-2.1042,3.8558,-0.0637,0.8058,5.9757,9.6519,1.505,-1.2337,4.2525,1.7369,1.7807,-0.2988,-0.4287,4.2525,5.4863,0.7868,-7.5158,5.0022,2.5861,4.5405,-0.6845,-1.2071,7.5158,12.518,0.3058,-1.3145,2.1207,0.2026,1.3354,-0.1251,-0.0984,2.1207,3.4351,9.9885,5.7117,14.0887,9.5925,2.8379,-0.0556,0.3079,14.0887,8.3769,5.6263,1.7411,10.0445,5.3199,2.4441,0.5408,0.4903,10.0445,8.3034
557,0.1033,-2.6259,3.3941,0.048,1.1069,-0.7847,-0.4967,3.3941,6.02,0.2189,-1.0676,3.3523,0.1116,0.754,-0.6665,-1.1986,3.3523,4.4199,-9.7716,-15.958,-3.5332,-10.1991,3.0399,-0.3075,0.0266,15.958,12.4248,-0.5466,-6.3393,8.8166,-0.4927,3.5751,-11.9665,-13.8612,8.8166,15.1559,0.9074,-8.96,9.9488,0.8794,3.6436,-1.5035,-1.8375,9.9488,18.9087,-0.5822,-10.8905,9.0233,0.172,4.9541,3.9875,6.0347,10.8905,19.9138,0.0556,-6.7993,8.7103,0.0058,2.3097,9.8498,16.6537,8.7103,15.5096,9.8773,3.5376,15.9884,10.2083,2.996,0.3393,0.1313,15.9884,12.4508,6.708,2.0982,12.1358,6.3005,2.485,9.7721,10.9089,12.1358,10.0376
558,-0.6814,-2.4664,0.6563,-0.4487,0.9531,0.4791,0.4269,2.4664,3.1228,-0.4476,-1.3189,2.0376,-1.087,1.235,0.8572,1.6175,2.0376,3.3565,-10.0791,-11.6223,-7.5211,-10.1725,1.2815,0.122,0.0988,11.6223,4.1011,-12.5131,-16.1378,-4.8703,-14.3539,4.0969,21.3104,23.9128,16.1378,11.2675,-0.5961,-5.5737,3.1063,-0.9581,2.9361,4.4847,4.935,5.5737,8.68,3.4052,-12.473,14.067,6.2067,10.0152,14.6016,13.1852,14.067,26.54,9.9054,-9.9236,20.1273,16.6595,12.1552,-5.7523,-12.0953,20.1273,30.0509,10.2166,7.6982,11.6902,10.3396,1.2824,-0.1601,-0.2464,11.6902,3.992,16.4801,9.8906,19.0537,17.2093,2.8145,6.8968,5.0077,19.0537,9.1632
559,-0.2023,-2.7078,2.6517,-0.0218,1.1147,-0.0056,-0.0576,2.7078,5.3595,0.4096,-0.9593,1.4637,0.5305,0.5994,-0.2957,-0.4252,1.4637,2.423,-9.957,-15.9924,-4.2633,-10.0737,1.9904,-0.0265,-0.0831,15.9924,11.7291,8.7973,-3.4757,17.7137,9.5589,5.354,-7.6451,-8.7992,17.7137,21.1894,3.8886,-1.8025,13.335,3.9769,3.1044,0.121,0.6475,13.335,15.1375,18.0069,-2.5152,34.589,19.3919,12.4894,7.4323,6.1503,34.589,37.1041,4.1531,-10.5003,19.5999,4.5642,6.1231,-3.3828,-4.2253,19.5999,30.1002,10.0565,5.1035,16.227,10.0932,1.9246,-0.0197,0.1008,16.227,11.1235,23.3769,12.2949,36.3435,22.217,7.6767,2.6102,3.7149,36.3435,24.0486
560,-0.2079,-2.0476,0.8138,-0.0794,0.8324,0.0321,0.0062,2.0476,2.8613,0.1139,-1.1543,1.0436,0.1053,0.7141,0.0241,-0.0753,1.1543,2.198,-9.9836,-11.2435,-8.4081,-10.1568,1.0563,0.0603,0.1703,11.2435,2.8355,1.1521,-0.3763,3.4907,0.7597,1.4191,-0.9427,-0.8794,3.4907,3.867,4.0097,-1.855,7.3412,4.6244,2.9531,-1.1786,-1.645,7.3412,9.1963,25.4391,21.9964,29.1433,25.5422,2.8194,-18.1788,-17.4588,29.1433,7.147,0.7703,-0.0016,2.8472,0.3389,1.0598,0.8849,-0.173,2.8472,2.8487,10.0368,8.4114,11.4575,10.194,1.0796,-0.0367,-0.1469,11.4575,3.0462,25.987,23.1975,29.4726,25.9319,2.5245,-6.1663,-7.8572,29.4726,6.2751
562,-0.1436,-1.5641,1.0013,-0.067,0.6072,-0.9037,-0.9362,1.5641,2.5654,0.1621,-1.6947,4.6808,-0.0452,1.2656,-0.0082,0.2953,4.6808,6.3755,-9.8631,-11.9285,-8.2058,-9.8162,0.8584,0.7427,0.6034,11.9285,3.7227,-0.7333,-11.8812,13.919,-0.9992,5.8216,3.3418,4.477,13.919,25.8001,1.6526,-1.715,10.92,1.3344,2.5651,-8.2494,0.0044,10.92,12.635,-10.9186,-41.0967,7.6843,-9.3753,11.127,-0.1308,-2.0831,41.0967,48.781,2.5402,-9.5361,65.1514,-0.0072,12.1158,-1.3402,0.8668,65.1514,74.6875,9.9633,8.2375,12.0231,9.9002,0.8536,-0.6959,-0.4865,12.0231,3.7856,13.6544,1.4724,42.489,10.2174,9.9534,3.9141,6.1439,42.489,41.0165
563,-1.0473,-2.9313,1.3838,-1.0032,1.0111,-0.3783,-0.444,2.9313,4.3151,0.1539,-1.7318,1.5026,0.2501,0.8115,0.1151,-0.0419,1.7318,3.2344,-9.1204,-10.8628,-6.7634,-9.2129,1.0569,-0.7907,-0.3565,10.8628,4.0994,2.6085,-3.3004,7.6594,3.4778,3.032,-4.1339,-5.2774,7.6594,10.9598,-6.5968,-40.1275,5.0575,1.3387,13.0608,6.016,0.2056,40.1275,45.185,-11.0494,-21.7856,1.7468,-11.4584,7.1578,10.4568,12.0317,21.7856,23.5324,1.2,-2.0376,5.7247,0.8596,2.155,-1.6247,-0.8517,5.7247,7.7623,9.2674,6.8266,11.2233,9.4137,1.0732,0.8352,0.3352,11.2233,4.3967,17.5685,4.9254,43.0775,16.3613,9.451,-9.6856,-9.9164,43.0775,38.1521
564,-1.4256,-4.7429,1.305,-1.4472,1.0317,3.04,2.1136,4.7429,6.0479,0.2691,-1.5642,3.098,0.2082,0.982,-0.0485,0.009,3.098,4.6622,-9.9111,-18.1011,-7.7069,-9.5694,1.8232,1.0756,0.1668,18.1011,10.3942,-1.5253,-9.5347,8.9641,-1.7996,5.3263,4.423,4.5748,9.5347,18.4988,-0.5809,-40.635,2.9838,1.5444,8.3947,37.8909,26.9588,40.635,43.6188,-0.5926,-14.5443,5.9364,0.5732,4.929,-6.791,-8.1602,14.5443,20.4807,-0.4247,-12.117,11.2794,0.008,4.9737,0.4277,-0.0886,12.117,23.3964,10.1026,8.3726,18.7237,9.7489,1.8857,-0.6652,-0.2332,18.7237,10.3511,7.8829,1.7483,43.1965,6.4449,7.8515,30.5544,23.4869,43.1965,41.4481
565,1.6143,-1.4658,11.0731,0.6664,3.9994,-0.1867,0.2544,11.0731,12.5388,0.2206,-0.6373,0.9198,0.2172,0.5185,-0.1079,-0.1477,0.9198,1.5571,-8.8355,-13.2432,-5.2464,-9.4025,2.521,-0.5189,-0.2426,13.2432,7.9968,2.8977,-0.4449,6.9627,2.7752,2.7446,-1.603,-3.3992,6.9627,7.4076,37.31,5.075,84.385,28.5031,30.0098,-16.0306,-12.2062,84.385,79.31,-7.3836,-10.8954,-3.6768,-7.5869,2.5522,-11.9113,-11.0222,10.8954,7.2186,0.0031,-2.7207,2.3355,-0.0807,1.5026,1.3434,0.5009,2.7207,5.0562,9.4374,5.4117,17.2768,9.5157,3.6174,0.2813,0.2391,17.2768,11.8651,38.4372,6.2827,85.0028,29.9318,29.8153,-2.678,0.776,85.0028,78.7201
567,1.2409,0.0627,3.1762,1.1751,0.6657,0.2445,0.2784,3.1762,3.1135,0.0048,-1.97,1.7138,-0.0781,0.7151,0.3918,0.5359,1.97,3.6838,-9.8734,-11.6245,-6.7891,-9.8878,0.8864,0.0754,0.307,11.6245,4.8354,-0.3084,-9.4442,23.0995,-4.0233,9.6109,27.8866,31.4139,23.0995,32.5437,5.2488,-1.4525,13.755,4.0906,4.5371,-4.8342,-3.535,13.755,15.2075,-31.2063,-45.5469,-5.6693,-29.6313,8.408,10.5584,8.2853,45.5469,39.8776,2.6899,-6.6514,35.4794,0.9211,6.9105,8.0338,11.4912,35.4794,42.1308,10.0,6.9834,11.6481,9.9939,0.8624,-0.0612,-0.245,11.6481,4.6647,33.0812,7.4319,50.559,31.4837,9.427,1.9228,4.4878,50.559,43.1271
568,1.4854,0.8748,2.1504,1.4536,0.397,-0.6394,-0.379,2.1504,1.2756,0.3966,-0.2465,1.0065,0.4578,0.4465,-0.2158,-0.263,1.0065,1.2531,-9.798,-11.6069,-8.6876,-9.5807,0.9727,0.1788,0.0261,11.6069,2.9193,27.5782,24.7408,30.5976,27.3906,2.1991,-14.7528,-12.8341,30.5976,5.8568,0.4145,-1.9163,3.7012,0.5556,2.1797,-1.0752,-1.8025,3.7012,5.6175,-20.6479,-28.8246,-10.1902,-21.346,6.5654,33.9966,34.0966,28.8246,18.6344,10.7236,-6.295,25.9053,12.4123,11.8445,-6.8187,-9.2592,25.9053,32.2003,9.9388,8.9734,11.6794,9.7489,0.9093,-0.1723,0.0059,11.6794,2.706,35.004,28.6763,38.0271,35.9715,3.0029,-15.3014,-16.1899,38.0271,9.3508
569,0.8459,-2.1664,2.504,1.0746,1.452,-0.5382,-0.6814,2.504,4.6704,0.1808,-0.3327,0.6385,0.1948,0.3835,-0.006,-0.0419,0.6385,0.9712,-9.6191,-12.2553,-6.0016,-9.5547,1.9504,-0.5692,-0.4198,12.2553,6.2537,12.8254,3.7248,18.3842,14.5565,5.6283,-9.451,-9.9945,18.3842,14.6594,-0.6606,-9.2925,6.8338,-1.2469,4.7339,6.7222,6.9147,9.2925,16.1263,13.3487,9.5174,18.5709,12.7506,3.2549,13.1946,13.4132,18.5709,9.0535,3.905,-2.9603,11.4769,3.153,5.7567,-2.3913,-2.035,11.4769,14.4372,9.7666,6.3179,12.4617,9.7548,1.9102,0.5119,0.3361,12.4617,6.1437,19.7025,14.8761,24.6631,19.7816,3.629,11.2998,11.3199,24.6631,9.787
571,-0.2304,-1.0809,0.7572,-0.2882,0.7117,0.2997,0.4118,1.0809,1.8381,0.1688,-0.4129,1.1914,0.111,0.4678,-0.1018,0.105,1.1914,1.6043,-10.7576,-12.8532,-9.5617,-10.3943,1.0984,0.8616,0.2574,12.8532,3.2914,-6.0767,-9.98,-2.4318,-5.4324,2.5756,-0.9596,-1.9095,9.98,7.5482,12.7838,8.96,15.8375,12.5825,2.2603,-10.115,-10.3688,15.8375,6.8775,39.738,37.5269,41.8825,39.5771,1.5135,-26.5021,-24.8493,41.8825,4.3555,-0.8776,-4.9411,2.4507,-0.917,2.1101,1.4737,0.2607,4.9411,7.3918,10.7903,9.5922,12.9304,10.4271,1.1048,-0.851,-0.2079,12.9304,3.3382,42.3021,39.9435,44.9685,42.4215,1.6119,-26.0392,-26.2961,44.9685,5.025
572,0.0693,-1.7546,1.1571,0.1235,0.7544,0.2242,0.1395,1.7546,2.9117,0.067,-1.6241,0.7552,0.216,0.5518,0.0845,-0.1484,1.6241,2.3793,-9.896,-12.2191,-5.6539,-10.1369,1.516,0.0183,0.3116,12.2191,6.5652,-7.0364,-12.2155,-1.5503,-7.3419,3.7754,4.1502,4.075,12.2155,10.6651,2.6688,-9.03,8.6713,2.2138,3.9449,-0.0959,-0.4288,9.03,17.7013,13.236,2.944,24.0761,14.7278,7.9654,-10.7806,-12.3734,24.0761,21.1321,0.5962,-5.481,18.6652,-0.6563,5.1394,-0.855,0.5957,18.6652,24.1463,9.9393,5.7268,12.2593,10.2191,1.512,0.0461,-0.3156,12.2593,6.5325,16.2629,5.6142,27.2273,16.1254,7.6933,-9.2961,-9.2117,27.2273,21.6131
573,0.2935,-1.8952,3.6963,0.2631,1.3582,-0.1565,-0.1904,3.6963,5.5915,0.1515,-0.4111,0.8282,0.0676,0.3791,-0.4271,-0.2582,0.8282,1.2393,-9.8777,-13.4482,-6.9241,-9.8253,1.7175,-0.4596,-0.2422,13.4482,6.5241,-2.8862,-6.8032,1.2158,-3.2669,2.1741,-0.0899,-0.5426,6.8032,8.019,2.5729,-5.6262,11.69,1.785,4.5863,-1.2932,0.0263,11.69,17.3162,2.4554,-3.1569,8.9537,2.3544,3.7426,-4.1938,-4.3728,8.9537,12.1106,-0.2589,-4.2653,2.4549,-0.0606,1.4101,1.1761,0.2121,4.2653,6.7202,9.9854,7.0953,13.5173,9.9036,1.6796,0.3933,0.1771,13.5173,6.422,6.9667,1.8712,13.1988,6.9137,3.3185,0.2531,-0.0663,13.1988,11.3275
574,0.137,-0.9941,1.8662,0.0727,0.882,-0.451,-0.5108,1.8662,2.8603,-0.2756,-0.9569,0.0862,-0.1906,0.333,0.3291,0.1424,0.9569,1.043,-10.3374,-13.0971,-9.0857,-10.0675,1.2646,0.4759,0.2263,13.0971,4.0114,-2.9761,-4.8483,0.0599,-3.8095,2.0346,5.0347,5.8946,4.8483,4.9082,1.2797,-4.1912,5.9238,1.8113,3.7425,-1.1102,-2.3975,5.9238,10.115,-1.7385,-8.6075,4.5183,-2.0185,5.3601,-0.5005,0.0042,8.6075,13.1258,0.9172,-0.3761,3.7893,0.1515,1.4359,-0.7887,-0.2828,3.7893,4.1655,10.3787,9.1041,13.1014,10.0807,1.2716,-0.485,-0.2082,13.1014,3.9973,7.2199,5.4155,10.046,6.8474,1.6588,-3.4971,-3.3615,10.046,4.6305
575,-0.314,-1.2055,0.7378,-0.4381,0.735,0.1222,0.1967,1.2055,1.9433,0.0534,-0.2148,0.6164,-0.0482,0.3164,0.2031,0.2175,0.6164,0.8312,-9.8615,-10.8464,-8.5805,-9.8412,0.7904,-0.0519,0.0457,10.8464,2.2659,2.0586,1.1449,3.2513,2.085,0.622,-1.6267,-1.7319,3.2513,2.1064,0.1695,-1.7938,2.835,-0.5863,2.0355,1.5509,2.59,2.835,4.6288,-2.2389,-4.0521,-0.5808,-2.0142,1.2646,4.1343,3.8901,4.0521,3.4713,0.1285,-0.4085,1.1816,-0.1313,0.6384,-0.0965,0.1624,1.1816,1.5901,9.8937,8.5835,10.9133,9.8725,0.8083,0.0308,-0.0617,10.9133,2.3299,3.7228,2.5498,5.213,3.4859,0.9461,-0.7624,-0.8077,5.213,2.6632
576,-0.1918,-0.4862,0.3326,-0.2414,0.2549,-0.4513,-0.5337,0.4862,0.8187,0.2565,-0.1412,0.6577,0.1694,0.2669,0.5435,0.6478,0.6577,0.7989,-9.9134,-10.67,-9.3491,-9.7955,0.4651,0.1859,0.0126,10.67,1.3209,0.4319,-0.0375,1.6072,0.3532,0.527,2.2943,1.1333,1.6072,1.6447,1.7205,0.3238,2.8,2.0038,0.8082,2.3607,2.1569,2.8,2.4763,1.8954,-0.3523,4.0204,1.8758,1.8536,36.6014,37.5036,4.0204,4.3728,0.032,-0.227,0.2295,0.0311,0.1328,-2.0834,-0.5376,0.2295,0.4565,9.9245,9.3531,10.677,9.8108,0.466,0.1766,0.2324,10.677,1.3239,2.9604,0.7051,4.7835,2.6781,1.4326,37.4029,36.9404,4.7835,4.0784
577,-0.6432,-4.0281,4.1002,-0.7751,1.9677,-0.1053,-0.0684,4.1002,8.1282,0.8,-2.7323,6.5538,0.8171,1.7372,-1.2259,-1.4523,6.5538,9.2861,-9.7275,-10.9334,-7.0798,-9.7828,0.7296,-0.1598,0.1563,10.9334,3.8535,2.7262,-8.8393,12.3041,1.4865,6.0071,-7.1396,-6.7919,12.3041,21.1434,4.0811,1.4,9.0825,4.1606,2.1687,0.1922,0.9363,9.0825,7.6825,38.4968,-0.3498,74.6384,39.3794,20.593,-6.0,-12.8079,74.6384,74.9882,-2.0514,-57.9308,15.2338,-0.5066,14.5097,-3.6274,0.5826,57.9308,73.1647,10.1011,8.3062,13.3904,10.0432,0.8894,0.8321,0.1861,13.3904,5.0842,40.3633,11.6715,75.0893,39.6185,18.3412,-5.659,-11.4503,75.0893,63.4178
578,-0.7484,-7.4647,8.3351,-0.8435,3.0439,0.2969,1.1214,8.3351,15.7998,-0.4259,-4.7029,6.9565,-0.6352,2.6448,-0.3113,-0.2633,6.9565,11.6594,-9.8872,-18.2631,2.2479,-9.6266,3.6348,0.0764,-0.2102,18.2631,20.511,-4.4134,-25.5877,3.6822,-5.3054,6.3342,-0.2263,3.8229,25.5877,29.2699,4.2734,-12.8625,32.2525,5.0969,9.6766,-4.0428,-4.7075,32.2525,45.115,32.4968,11.6465,74.4741,26.5715,17.8165,-28.4146,-22.1727,74.4741,62.8276,-5.6788,-178.0015,31.9086,0.076,37.9851,11.1791,0.862,178.0015,209.91,10.9332,6.685,19.0874,10.2293,2.7558,-0.7706,-0.1475,19.0874,12.4024,34.7043,12.0516,74.783,28.1682,18.3346,-22.6413,-17.2217,74.783,62.7313
579,-0.4516,-6.433,3.7444,0.2778,2.0466,0.8057,0.2476,6.433,10.1774,-0.7372,-3.6479,2.2865,-0.8985,1.5299,2.4243,2.7231,3.6479,5.9344,-9.8109,-12.645,-7.9661,-9.8368,0.9694,0.1542,0.0864,12.645,4.6789,-4.6397,-25.6277,11.6916,-1.4826,11.8545,-5.0226,-8.2752,25.6277,37.3194,0.2305,-3.4913,2.1438,0.3894,1.4539,0.629,0.4856,3.4913,5.635,4.0822,-4.7475,13.828,4.3988,5.1165,-2.2696,-3.1895,13.828,18.5754,5.5003,-16.695,37.699,0.938,15.3758,-25.0957,-8.4706,37.699,54.394,10.1626,8.3267,13.357,10.0818,0.9691,-0.2582,-0.0938,13.357,5.0303,12.0629,2.315,25.8706,10.9464,7.5671,-0.5563,-1.0489,25.8706,23.5555
580,0.3541,-1.628,1.317,0.5255,0.6995,-0.3086,-0.6443,1.628,2.945,1.6871,-0.7121,3.5994,1.8246,1.2087,1.8592,2.5037,3.5994,4.3115,-9.6567,-11.5425,-7.961,-9.7503,0.7706,-0.3261,-0.2036,11.5425,3.5815,-9.6623,-29.0607,6.1842,-9.7578,10.4658,30.056,37.1733,29.0607,35.245,0.8595,-0.7875,1.8988,0.875,0.5439,1.0294,-0.5863,1.8988,2.6863,1.8126,-1.6651,9.9327,1.2093,2.4823,4.1453,4.8048,9.9327,11.5978,-19.5954,-67.6314,10.8325,-7.5326,23.9145,55.9451,29.3858,67.6314,78.4639,9.9044,7.9919,11.5768,9.9881,0.7715,1.0139,0.7703,11.5768,3.5849,11.5067,0.772,29.1763,9.8975,8.9203,17.6208,19.5094,29.1763,28.4043
581,0.0455,-0.6997,1.1942,-0.1188,0.7206,0.1952,0.2779,1.1942,1.8939,3.5463,-0.2597,6.6106,4.3283,2.797,-1.2723,-1.9631,6.6106,6.8703,-9.9828,-10.7715,-9.2172,-9.9539,0.4935,0.0315,0.1286,10.7715,1.5543,20.3937,-16.2318,44.0065,27.4155,23.3796,-10.7206,-13.256,44.0065,60.2383,1.8889,-1.9512,9.345,0.2887,4.2548,-0.2852,0.3697,9.345,11.2962,5.958,-2.7251,13.6948,6.0141,6.4628,-0.598,-2.1209,13.6948,16.4199,36.3496,-76.9388,158.1,21.8532,88.874,-21.6995,-11.1735,158.1,235.0388,10.9184,9.7828,12.1882,10.7583,0.7838,-0.3923,-0.4437,12.1882,2.4054,29.1274,11.2249,44.1817,29.4069,12.5233,-7.0341,-9.2049,44.1817,32.9568
583,0.4359,-1.6455,2.0926,0.437,0.854,-0.8384,-0.6109,2.0926,3.7381,1.0017,-0.9317,5.2654,0.4021,1.6654,-0.1084,0.2663,5.2654,6.1971,-9.9198,-18.9606,-7.2849,-9.6966,2.079,0.6331,0.2014,18.9606,11.6756,-1.0474,-26.9591,14.8665,0.9035,12.3372,9.4995,7.9108,26.9591,41.8256,1.3186,-12.985,12.3813,1.0281,6.0473,-0.1986,0.0175,12.985,25.3663,4.7621,-11.8193,31.7689,1.7723,12.066,-5.1652,-1.5939,31.7689,43.5882,-7.0494,-79.6466,22.293,-0.4938,22.1094,13.5639,6.4743,79.6466,101.9396,10.1339,7.4835,19.3599,9.871,2.145,-0.7391,-0.3006,19.3599,11.8764,15.0592,2.3222,43.4221,10.9972,11.1825,-5.8562,-1.9137,43.4221,41.0998
584,-0.4025,-1.78,0.2639,-0.1739,0.6739,0.5189,0.2991,1.78,2.044,0.8933,-0.6385,3.0878,0.6684,1.1282,-0.292,-0.1544,3.0878,3.7263,-9.2867,-15.6101,-5.4648,-9.4952,3.3057,-0.5287,-0.3116,15.6101,10.1453,8.4521,4.6159,10.433,8.8143,1.8643,-8.8311,-9.8541,10.433,5.8171,1.12,-4.0338,5.67,1.0456,2.7628,-0.4298,-0.1619,5.67,9.7038,-0.4032,-4.3008,1.2566,0.1783,1.8645,-3.6981,-1.0061,4.3008,5.5574,6.5145,-5.6759,21.7538,5.9805,8.1738,-7.4125,-6.4666,21.7538,27.4297,9.3948,5.6479,16.0118,9.5704,3.3828,0.4582,0.2734,16.0118,10.3639,9.2029,7.3113,10.5134,9.0834,1.0268,-2.8542,-5.372,10.5134,3.202
585,0.1164,-0.2654,0.385,0.1252,0.1983,0.0154,0.0036,0.385,0.6504,0.6013,-0.2717,2.2291,0.514,0.5867,-0.8693,-0.8856,2.2291,2.5008,-9.8154,-10.1387,-9.4512,-9.8068,0.1705,0.0314,0.0516,10.1387,0.6874,-0.3791,-4.8837,6.4472,-1.0398,3.3262,0.3786,0.4861,6.4472,11.3309,0.6902,-0.8925,1.1638,0.8838,0.4809,0.202,-0.0022,1.1638,2.0562,-4.1013,-24.1339,1.7917,-0.8278,7.7761,3.1821,1.0767,24.1339,25.9256,-0.898,-5.9853,3.6627,-0.4861,2.494,0.3228,0.445,5.9853,9.648,9.853,9.4553,10.1479,9.8438,0.1772,0.0077,-0.0305,10.1479,0.6927,6.3487,0.8604,24.1969,3.7114,6.9211,-0.1276,0.7524,24.1969,23.3365
587,0.1472,-0.5993,1.6132,0.1324,0.5382,0.3249,0.4031,1.6132,2.2125,-1.1374,-2.5546,1.3626,-1.2573,0.853,0.0193,0.1529,2.5546,3.9172,-9.7526,-11.3354,-8.8113,-9.7035,0.6163,-0.0162,0.0044,11.3354,2.5241,0.3781,-9.0184,10.7878,-0.0675,4.2317,3.206,3.1215,10.7878,19.8062,1.0941,-3.2025,9.4238,0.8794,2.2572,0.2775,0.3194,9.4238,12.6262,2.2629,-8.6377,13.7519,1.3256,5.4173,-1.1582,0.2779,13.7519,22.3896,-0.2525,-21.3678,23.0385,0.404,7.424,-3.516,-1.7768,23.0385,44.4062,9.8683,9.0506,11.6197,9.7829,0.6343,0.0161,-0.0231,11.6197,2.5691,6.0934,0.9079,16.7542,5.2161,4.5225,-0.9081,-0.046,16.7542,15.8463
588,0.4721,-0.0811,0.9067,0.5356,0.3791,-0.2818,-0.3181,0.9067,0.9877,-1.1181,-2.6157,0.1849,-1.1044,0.8972,-0.2272,-0.1592,2.6157,2.8006,-9.7688,-10.3319,-9.0507,-9.6991,0.4668,0.0575,-0.007,10.3319,1.2811,3.5841,-0.2734,8.3591,3.0541,3.144,-3.8997,-3.5596,8.3591,8.6325,1.3716,-0.91,4.1387,1.1988,1.4846,-0.4151,-0.2931,4.1387,5.0487,1.1047,-3.1397,4.5436,1.6035,2.8162,-0.9797,-1.4495,4.5436,7.6832,-3.7685,-18.9628,0.9427,-1.3727,6.5742,4.0967,1.9844,18.9628,19.9056,9.8844,9.1651,10.5291,9.7599,0.5024,-0.0689,0.0709,10.5291,1.3641,5.1853,1.6338,9.4078,5.1701,2.7416,-3.7776,-3.7678,9.4078,7.7739
589,0.1904,-0.5282,0.8652,0.2175,0.3367,0.0509,-0.0216,0.8652,1.3933,-1.3452,-2.0968,-1.0119,-1.2635,0.2898,0.3034,0.1212,2.0968,1.0849,-9.7113,-9.8288,-9.3934,-9.7062,0.108,-0.0428,0.0009,9.8288,0.4354,-0.3156,-1.6805,0.9317,-0.5055,0.7332,-0.9709,-0.6329,1.6805,2.6122,0.9565,0.4025,1.4875,0.9056,0.2741,0.0683,0.1312,1.4875,1.085,0.1249,-1.1071,1.0921,0.154,0.665,0.1225,0.132,1.1071,2.1992,0.3283,-1.9536,2.1199,0.6117,1.0373,0.5032,0.1804,2.1199,4.0735,9.8156,9.628,9.9223,9.8308,0.0759,0.0362,0.013,9.9223,0.2943,1.4077,1.136,1.8793,1.4023,0.1996,1.3724,0.7607,1.8793,0.7434
590,0.2413,-0.6334,1.2729,0.1959,0.4754,-0.2148,-0.0978,1.2729,1.9062,-1.0418,-2.344,1.3554,-1.1424,0.7525,0.1847,0.1939,2.344,3.6994,-9.7541,-10.4677,-9.085,-9.7053,0.2714,-0.0276,-0.1198,10.4677,1.3826,-1.2865,-6.0182,4.8129,-1.1384,2.4239,-5.0997,-3.0131,6.0182,10.8311,1.0248,0.6038,1.5838,1.0369,0.2447,0.0914,-0.0262,1.5838,0.98,0.2474,-4.1629,3.5601,0.286,1.585,2.7816,1.4629,4.1629,7.7231,0.8314,-10.9473,7.0402,0.7921,3.5386,1.98,-1.0552,10.9473,17.9875,9.8518,9.3104,10.5472,9.8438,0.2518,0.0486,0.0988,10.5472,1.2368,2.7802,0.9019,7.0915,2.163,1.8127,6.1578,3.6202,7.0915,6.1895
591,0.0265,-1.0304,1.1327,0.0981,0.7206,0.2505,0.2043,1.1327,2.1631,-0.8571,-2.466,1.3775,-0.9485,1.0636,1.5836,1.5502,2.466,3.8436,-9.7817,-11.6918,-8.1826,-9.8251,0.8664,0.0274,0.0783,11.6918,3.5092,-6.3862,-23.0451,3.3687,-4.1515,8.1915,-0.9415,-1.0955,23.0451,26.4138,1.1162,0.385,2.0563,1.0106,0.5064,-0.1635,-0.1444,2.0563,1.6713,3.029,-2.1407,14.5009,1.7489,4.6873,-3.7651,-2.0691,14.5009,16.6416,2.8114,-15.2222,25.8379,-0.2631,10.8435,-7.3261,1.0739,25.8379,41.0601,9.9004,8.218,11.7285,9.9426,0.832,-0.0666,-0.0681,11.7285,3.5104,8.938,1.5514,27.2357,5.7832,7.6637,2.0102,3.6896,27.2357,25.6842
592,0.277,-0.228,0.6569,0.3024,0.2318,-0.1231,-0.1049,0.6569,0.8849,0.7265,-1.1573,2.4786,0.6017,0.9747,1.9342,1.9299,2.4786,3.6359,-9.7542,-10.0196,-9.5396,-9.7468,0.1358,0.2041,0.1627,10.0196,0.4801,-7.3277,-23.9238,7.5457,-5.2469,10.4637,5.0452,1.8018,23.9238,31.4696,0.9527,0.595,1.4875,0.8662,0.2586,-0.0504,0.0131,1.4875,0.8925,-0.7361,-7.3074,4.8463,-0.3202,3.7667,-0.6063,-0.8662,7.3074,12.1537,-4.5147,-32.2569,10.2614,0.8108,12.6387,-2.8269,-8.3557,32.2569,42.5183,9.8339,9.5645,10.0914,9.8745,0.1597,0.1253,0.0402,10.0914,0.5269,10.9481,1.3555,23.9466,9.4729,7.4976,-5.595,-4.744,23.9466,22.5912
593,0.1539,-0.4688,0.5214,0.1975,0.2294,-0.0205,0.0049,0.5214,0.9902,2.6607,0.9132,4.7274,2.5316,0.9639,-0.6623,-0.6433,4.7274,3.8143,-9.5501,-9.8166,-9.275,-9.5841,0.1438,-0.0499,-0.0044,9.8166,0.5416,-2.2825,-14.1123,6.4268,-3.4452,5.1614,5.2701,7.9092,14.1123,20.5391,0.9023,0.5863,1.3125,0.8794,0.2307,0.3577,0.3894,1.3125,0.7262,-1.3424,-6.193,1.5729,-1.1864,1.965,2.0785,1.6229,6.193,7.7659,-7.3416,-66.7153,16.9948,-7.5449,17.4903,13.3146,14.3821,66.7153,83.7101,9.9591,9.5826,10.8344,9.9147,0.3008,-0.1412,-0.1206,10.8344,1.2518,5.3531,1.463,15.4257,4.7289,2.9819,-0.3273,0.5631,15.4257,13.9628
594,0.1333,-0.2103,0.345,0.2024,0.2171,0.0007,-0.3705,0.345,0.5553,1.9984,1.523,2.6528,1.8883,0.4632,1.0179,1.0984,2.6528,1.1298,-9.6,-9.6362,-9.572,-9.5885,0.0262,0.0636,0.0615,9.6362,0.0643,2.9876,-3.6423,7.0158,4.464,4.2423,1.8479,-7.4932,7.0158,10.6581,1.26,1.085,1.4262,1.2687,0.1162,-0.1023,-0.1444,1.4262,0.3412,0.7361,-0.8123,2.8849,0.4365,1.3923,1.312,0.6115,2.8849,3.6971,5.973,-9.6621,16.7639,6.8371,9.6632,9.815,-12.9851,16.7639,26.4261,9.8179,9.7093,9.9969,9.7941,0.1021,0.2795,0.4058,9.9969,0.2876,5.0258,1.8659,7.1639,5.292,1.9279,6.3952,1.667,7.1639,5.298
595,0.134,-0.9814,2.0757,-0.1681,0.9539,-0.0072,0.4675,2.0757,3.0571,3.0163,1.4853,4.7041,2.9867,1.0799,-2.6886,-2.4107,4.7041,3.2188,-9.5364,-10.2392,-8.909,-9.527,0.3321,-0.4614,0.8548,10.2392,1.3302,4.8356,-6.5236,31.4566,-3.0292,13.8575,13.9266,23.4809,31.4566,37.9801,1.1577,0.5075,3.0013,1.1244,0.6097,-5.0099,-5.0838,3.0013,2.4938,2.048,-2.7312,7.5116,1.048,3.3295,-9.6671,-7.1952,7.5116,10.2428,15.788,-20.0744,100.5173,-6.1479,40.3559,-13.8839,12.6352,100.5173,120.5918,10.0974,9.2954,10.7016,10.1999,0.4013,-0.0117,-1.4994,10.7016,1.4062,11.421,2.9077,31.4859,6.959,9.7568,9.9974,16.1279,31.4859,28.5782
596,0.1268,-1.5315,1.1206,0.2994,0.7753,0.0004,-0.296,1.5315,2.652,0.3277,-1.0993,1.4918,0.576,1.1375,-1.0504,-1.0113,1.4918,2.5911,-9.9978,-18.3684,-6.0876,-8.6722,4.2783,0.0589,-1.1946,18.3684,12.2808,18.7621,9.5184,26.2959,20.4517,6.3978,-18.4179,-20.0695,26.2959,16.7775,-3.8522,-11.2525,4.1038,-3.9594,6.1395,4.5504,4.9219,11.2525,15.3563,-7.6191,-14.0014,-2.1719,-6.1471,4.5237,10.4094,6.6049,14.0014,11.8295,1.9042,-27.0825,34.7185,6.4873,21.7355,-6.7108,-7.3538,34.7185,61.801,10.0857,6.1704,18.4924,8.7005,4.2804,0.0589,1.26,18.4924,12.3221,21.4184,11.3867,28.9505,23.0869,7.7725,-3.7666,-15.349,28.9505,17.5639
597,0.1272,-1.0464,2.178,0.0035,0.7166,0.2228,0.2808,2.178,3.2244,-0.7227,-4.7843,2.5169,-0.4353,1.7532,-0.2616,-0.3704,4.7843,7.3012,-9.9389,-17.792,-4.4342,-9.8668,2.9995,0.2531,0.2613,17.792,13.3577,0.3442,-30.0018,44.3795,0.3822,15.6976,-1.1178,0.1917,44.3795,74.3813,0.6982,-8.5488,8.2863,0.9625,3.7748,0.1714,0.0262,8.5488,16.835,2.7903,-55.121,38.2113,0.4578,20.1453,-2.3816,-0.3613,55.121,93.3322,-4.8067,-67.7561,61.7692,-0.8665,25.2829,9.1864,0.4412,67.7561,129.5253,10.1446,5.4399,17.9696,9.9605,2.9723,-0.3497,-0.2108,17.9696,12.5296,17.6519,1.334,71.2069,7.7379,18.7114,-3.8457,-1.6346,71.2069,69.873
598,0.3499,-0.6215,1.2648,0.2842,0.4395,-0.0839,-0.0959,1.2648,1.8863,-0.9842,-3.1285,0.9904,-0.8058,1.0063,-0.0259,-0.231,3.1285,4.1189,-9.6857,-13.2742,-7.4395,-9.6056,1.172,-0.0998,-0.1786,13.2742,5.8347,-0.7737,-36.5978,32.4353,0.5739,15.2986,-1.3692,-3.1424,36.5978,69.0331,0.8696,-7.0875,6.5275,0.9888,2.6327,0.1169,0.0044,7.0875,13.615,0.4087,-34.3751,36.9715,0.0964,15.876,0.5137,0.7445,36.9715,71.3465,4.3797,-65.4685,113.6855,-0.4253,34.7796,-2.9596,1.6156,113.6855,179.154,9.7949,7.4457,13.6397,9.7497,1.2261,0.0635,0.1356,13.6397,6.1941,13.8061,1.5355,52.5026,6.1034,17.2155,-10.6823,-3.1705,52.5026,50.9671
599,0.266,-0.0677,0.7372,0.1883,0.3219,-0.0653,-0.0657,0.7372,0.8049,-1.0102,-1.6265,0.0311,-1.0367,0.535,0.1223,-0.0299,1.6265,1.6576,-9.7855,-9.9149,-9.5408,-9.7841,0.1146,-0.0336,-0.0325,9.9149,0.3742,-2.1429,-5.1037,1.4942,-2.5685,2.4451,8.9651,11.0844,5.1037,6.598,0.9866,0.7962,1.19,0.9931,0.1482,0.1859,0.1356,1.19,0.3938,0.9225,-0.3318,2.5988,0.8409,0.9685,-3.5452,-1.3776,2.5988,2.9306,1.4201,-2.1147,4.3295,1.1903,2.32,-12.5672,-7.5675,4.3295,6.4442,9.8584,9.5955,9.9809,9.8853,0.1219,0.0939,0.0047,9.9809,0.3854,3.1238,1.2176,5.8196,2.9329,1.766,6.7743,5.6801,5.8196,4.602
600,0.2007,-0.3031,1.0391,0.1226,0.4505,0.058,-0.0549,1.0391,1.3422,-0.8879,-3.0525,1.6283,-1.0667,1.3247,-0.2237,0.1349,3.0525,4.6808,-9.8192,-10.5532,-9.2897,-9.8166,0.3254,0.0024,0.0863,10.5532,1.2635,6.8222,-6.2157,20.8864,8.516,8.3252,-7.0485,-8.8023,20.8864,27.1021,1.1725,0.6125,2.2575,1.1287,0.3477,-0.1072,-0.2494,2.2575,1.645,-2.6228,-20.3201,1.4337,-0.5366,5.8431,2.0607,0.8187,20.3201,21.7538,-11.1471,-59.3118,5.5656,-6.3772,17.2706,10.793,6.4729,59.3118,64.8773,9.9523,9.522,10.9867,9.89,0.3752,-0.0128,-0.0898,10.9867,1.4647,9.8982,1.3285,29.2274,8.613,7.5839,-7.0889,-5.7804,29.2274,27.8989
601,0.2587,-0.6983,2.1685,0.0677,0.8991,0.0136,0.0105,2.1685,2.8668,-1.1116,-2.1633,0.0263,-0.9317,0.7051,0.1646,0.0105,2.1633,2.1896,-9.8168,-10.6576,-9.2216,-9.7303,0.4665,0.0532,-0.0791,10.6576,1.436,-0.2262,-2.5871,3.2015,-0.2863,1.8008,-0.3694,-0.3283,3.2015,5.7886,1.0653,0.6737,1.5313,0.8794,0.3571,-0.2439,-0.0744,1.5313,0.8575,-0.5621,-4.5817,1.4543,0.2821,2.3116,1.2052,0.1956,4.5817,6.036,-0.3541,-6.0941,1.8773,0.0957,2.4897,0.9389,0.4069,6.0941,7.9714,9.9395,9.3996,10.7066,9.8002,0.4921,-0.0622,0.091,10.7066,1.3069,2.8092,1.1304,4.8296,2.8326,1.1879,-0.6955,-0.9266,4.8296,3.6992
602,0.2723,-1.2673,2.517,0.0782,1.1141,-0.1013,-0.058,2.517,3.7843,-0.947,-1.7976,-0.4243,-0.9213,0.3248,0.5973,1.0586,1.7976,1.3734,-9.7636,-10.4356,-8.9748,-9.8094,0.3361,-0.1508,-0.0235,10.4356,1.4609,-0.5957,-2.7828,1.5612,-0.6146,1.4018,2.4791,4.1586,2.7828,4.344,0.8214,-0.6125,1.7938,0.805,0.6327,-0.0685,0.1969,1.7938,2.4062,0.6431,-1.2963,3.3911,0.4777,1.372,-1.1451,-0.803,3.3911,4.6874,0.5848,-1.4658,3.8184,0.5026,1.4655,-4.2929,-1.3004,3.8184,5.2842,9.8773,9.183,10.5326,9.8912,0.3373,0.3144,0.017,10.5326,1.3496,2.1137,0.8393,4.4293,1.906,1.0108,7.1874,7.1303,4.4293,3.59
603,0.171,-1.9989,3.7417,0.0202,1.2374,0.1453,0.0155,3.7417,5.7406,-0.3497,-3.7951,4.0464,0.1373,2.0363,-1.4809,-2.0962,4.0464,7.8416,-9.9144,-14.3197,-7.3862,-9.833,1.1586,0.3492,0.2135,14.3197,6.9334,1.8835,-13.1685,15.5696,3.544,9.2983,10.1417,1.8042,15.5696,28.7381,0.7529,-4.1125,1.8812,1.0019,1.1189,-0.2169,-0.4112,4.1125,5.9937,-0.502,-10.0778,9.1459,-0.3253,3.8696,-14.3423,-6.2559,10.0778,19.2237,-3.7081,-50.4126,27.0231,-0.7979,17.1331,-24.4986,-10.4983,50.4126,77.4358,10.1917,8.481,15.062,9.9082,1.1665,-0.4002,-0.0859,15.062,6.581,9.3011,2.6581,16.0469,9.0364,4.1194,10.9461,-0.4977,16.0469,13.3889
604,0.3163,-0.5337,2.0053,0.0357,0.8438,-0.0898,0.2525,2.0053,2.539,-1.8306,-2.6557,-0.7899,-1.9589,0.5769,0.4663,0.4186,2.6557,1.8658,-9.5652,-10.4887,-8.4543,-9.6195,0.6547,-0.127,-0.0004,10.4887,2.0344,12.0252,-1.974,38.7942,5.3482,15.8401,-13.1254,-6.1233,38.7942,40.7683,0.5359,-0.84,1.82,0.5906,0.8641,0.6174,0.6038,1.82,2.66,-14.8443,-45.7066,1.1968,-6.5812,18.3093,17.5206,8.3681,45.7066,46.9035,-28.2067,-103.0276,1.8145,-11.2961,38.665,29.7237,12.0689,103.0276,104.8421,9.7914,8.8912,10.8965,9.8223,0.6429,0.0141,-0.0965,10.8965,2.0053,20.2472,1.7421,59.952,8.5387,23.1472,-15.5185,-5.0243,59.952,58.2099
605,0.2265,-0.413,0.6849,0.2882,0.3316,-0.0152,-0.0477,0.6849,1.0979,-1.3643,-1.8868,-0.1604,-1.5403,0.4716,-0.0076,0.1258,1.8868,1.7264,-9.6922,-10.6557,-8.9512,-9.6198,0.4571,-0.0089,-0.0386,10.6557,1.7045,-1.1002,-5.4635,4.2815,-0.7752,2.7623,0.9614,0.4509,5.4635,9.745,1.1534,0.0438,2.6688,1.1944,0.6841,-0.0958,-0.14,2.6688,2.625,2.6763,-2.8274,9.0587,1.7869,3.8221,-1.2609,-0.8256,9.0587,11.8862,1.517,-4.5144,9.661,0.7728,4.1379,-1.2914,-0.4656,9.661,14.1755,9.8055,8.9759,10.8024,9.7257,0.473,0.0267,0.0399,10.8024,1.8265,4.7287,1.4699,10.5789,3.5144,3.0341,-0.4098,-0.6072,10.5789,9.1089
607,0.196,-1.8871,1.5056,0.1929,0.7986,0.0015,-0.0075,1.8871,3.3927,-1.3796,-3.0543,-0.0401,-1.2887,0.5891,0.0527,-0.0272,3.0543,3.0142,-9.7099,-12.3681,-7.0894,-9.697,0.8616,-0.0137,-0.0223,12.3681,5.2787,0.8227,-6.3396,9.1134,0.1267,3.7959,-0.8247,-0.1045,9.1134,15.4529,0.9617,-0.455,1.9425,0.9144,0.4464,0.0284,0.0744,1.9425,2.3975,0.1546,-7.3352,11.0435,0.1357,3.494,-0.0871,-0.1249,11.0435,18.3787,-1.0658,-15.8048,17.9919,-0.1585,6.5179,1.0489,0.1283,17.9919,33.7967,9.859,7.3858,12.573,9.8056,0.8476,-0.0417,0.0107,12.573,5.1872,3.9092,0.7601,12.8224,2.3001,3.5664,-2.7813,-1.2046,12.8224,12.0623
608,0.1975,0.128,0.3567,0.1854,0.0485,-0.0284,-0.0193,0.3567,0.2287,-1.3268,-1.6803,-0.8108,-1.3159,0.1741,-0.0495,-0.0616,1.6803,0.8695,-9.7236,-9.8542,-9.6591,-9.7193,0.0408,0.0044,0.0061,9.8542,0.1951,-0.0021,-0.8749,0.5913,0.0222,0.3962,-0.5765,-0.4695,0.8749,1.4662,0.9901,0.9188,1.1288,0.9888,0.05,0.0227,0.0219,1.1288,0.21,0.0675,-1.2007,0.8856,0.0108,0.4038,0.0864,0.1104,1.2007,2.0863,-0.0169,-0.8792,1.2016,-0.0302,0.5326,0.8163,0.6142,1.2016,2.0808,9.8174,9.7522,9.8906,9.8162,0.0283,0.0009,-0.0047,9.8906,0.1385,1.1279,0.9523,1.5623,1.0954,0.1542,0.1078,0.0286,1.5623,0.61
609,0.1691,0.0897,0.2701,0.166,0.0525,0.1123,-0.0294,0.2701,0.1804,-1.3763,-1.5481,-1.2387,-1.3775,0.0971,-0.0166,0.006,1.5481,0.3094,-9.7193,-9.77,-9.6766,-9.7132,0.0285,0.0053,0.0252,9.77,0.0935,-0.5786,-1.648,-0.102,-0.4473,0.4778,0.7041,0.3355,1.648,1.546,1.0128,0.945,1.085,1.0106,0.0388,-0.017,-0.0044,1.085,0.14,0.1538,-0.0511,0.5002,0.1212,0.165,0.0122,-0.1893,0.5002,0.5512,0.7995,0.1487,2.2938,0.584,0.6757,-1.1013,-0.4511,2.2938,2.1451,9.8182,9.7937,9.8699,9.8115,0.0241,0.0179,0.024,9.8699,0.0762,1.2356,1.004,1.9644,1.124,0.3068,0.934,0.9647,1.9644,0.9604
610,0.2814,-0.2355,1.226,0.1367,0.4483,-0.1568,-0.0266,1.226,1.4616,-1.3929,-2.2716,-0.7714,-1.3716,0.4308,-0.0599,0.0141,2.2716,1.5002,-9.7139,-9.8698,-9.4903,-9.688,0.1056,0.0728,-0.1215,9.8698,0.3794,0.1255,-2.9168,3.0523,-0.1117,1.7248,-12.5409,-1.2768,3.0523,5.9691,0.9959,0.6387,1.19,1.0062,0.1513,1.558,1.3213,1.19,0.5513,0.166,-3.1794,2.5477,-0.0681,1.4092,14.0049,4.9708,3.1794,5.7271,-0.3018,-6.2376,4.4073,0.1329,2.5965,20.4593,0.4634,6.2376,10.6449,9.8361,9.7081,9.9262,9.8356,0.0675,0.0494,0.1529,9.9262,0.2181,2.1697,0.9085,4.4057,2.0887,1.0327,19.9601,5.6391,4.4057,3.4972
611,0.1246,-0.6433,0.8317,0.11,0.5514,-0.0791,-1.0123,0.8317,1.475,-1.4529,-3.3308,0.3327,-1.3575,1.6244,-0.2268,0.0775,3.3308,3.6635,-9.6411,-10.2633,-8.2716,-9.8095,0.6771,1.8046,0.4072,10.2633,1.9916,-12.4155,-43.8041,4.538,-1.3885,20.3382,45.8696,36.8771,43.8041,48.3422,2.5539,1.1638,4.445,2.3275,1.0171,-1.3333,-0.3544,4.445,3.2813,14.1709,-1.1852,44.6665,4.9027,18.3026,-53.2941,-40.351,44.6665,45.8518,20.1575,-13.1361,90.5915,0.5963,41.7777,-134.4716,-75.142,90.5915,103.7276,9.8855,8.9172,10.6658,9.9885,0.6142,-0.3995,-0.0901,10.6658,1.7486,22.1297,1.4995,62.6041,7.7278,24.558,34.5929,43.6023,62.6041,61.1046
612,0.0455,-4.3262,5.5669,-0.9023,3.3471,-0.026,0.442,5.5669,9.893,-1.6797,-6.692,2.9352,-1.28,2.859,1.3829,1.1832,6.692,9.6272,-7.8365,-16.0027,-0.1953,-9.4023,5.4728,-0.9574,-0.1766,16.0027,15.8075,33.4541,-19.1636,75.0424,35.4887,35.3506,-18.4417,-17.6622,75.0424,94.206,1.2206,-25.1125,17.78,1.9731,12.235,-0.1446,-0.5119,25.1125,42.8925,-39.1233,-85.9733,-1.8184,-35.4483,33.7643,19.5132,17.6962,85.9733,84.1549,-114.3141,-447.1078,-2.0792,-74.5458,149.13,55.8843,37.7025,447.1078,445.0286,9.486,3.5893,16.6798,9.8984,4.4609,0.1743,-0.0392,16.6798,13.0906,56.7226,3.6786,111.3321,51.3302,43.5012,-24.7144,-23.7385,111.3321,107.6535
614,-0.0066,-0.5149,0.5342,-0.0182,0.2576,-0.047,-0.0699,0.5342,1.0491,1.0862,-0.1239,2.4373,1.0864,0.6353,-0.1144,-0.1792,2.4373,2.5612,-9.7514,-10.2036,-9.1098,-9.7556,0.1431,-0.0289,-0.0099,10.2036,1.0938,-3.4294,-21.0841,8.8525,0.1643,9.2438,6.6545,4.228,21.0841,29.9366,0.9314,0.5075,1.3038,0.9494,0.1585,0.0805,0.0438,1.3038,0.7962,-0.0968,-1.7899,1.2328,-0.0559,0.6502,0.0567,-0.0187,1.7899,3.0227,-2.5456,-29.2043,10.3759,0.8592,9.5795,5.2706,2.2305,29.2043,39.5802,9.8346,9.1166,10.2038,9.8201,0.1654,0.001,0.0158,10.2038,1.0872,7.2938,0.999,21.1361,3.8532,6.6554,-3.5909,0.6818,21.1361,20.1371
615,-0.0535,-0.2761,0.1605,-0.0881,0.1234,-0.058,-0.0156,0.2761,0.4366,0.9718,0.0814,1.578,0.9072,0.3573,-0.5065,-0.5508,1.578,1.4966,-9.7803,-10.1052,-9.5275,-9.7654,0.0968,-0.0581,-0.0785,10.1052,0.5777,3.2251,-0.8103,5.8153,4.3923,2.3484,-4.4228,-6.126,5.8153,6.6256,1.012,0.9187,1.2512,0.9931,0.0753,0.1922,0.1575,1.2512,0.3325,-0.0402,-0.6911,1.024,-0.0746,0.3276,0.876,0.9744,1.024,1.7151,2.725,-0.9635,5.8189,3.0897,2.2534,-3.6181,-3.723,5.8189,6.7823,9.8356,9.5628,10.115,9.8358,0.0928,0.025,0.0151,10.115,0.5521,3.7029,1.0163,5.9334,4.535,1.8033,-1.2329,-2.2192,5.9334,4.9171
616,-0.1116,-0.382,0.1823,-0.1037,0.2026,0.2409,0.019,0.382,0.5643,0.4653,-0.0682,1.2064,0.3564,0.4461,0.1906,0.4967,1.2064,1.2746,-9.8384,-10.2417,-9.3831,-9.8439,0.3048,0.0523,0.0918,10.2417,0.8586,-1.1976,-2.8945,1.9367,-1.7337,1.591,2.2334,0.8484,2.8945,4.8312,1.2042,0.84,1.75,1.1506,0.3359,-0.0459,0.0919,1.75,0.91,0.8358,-0.2794,1.7716,0.8998,0.6329,-1.3109,-1.2727,1.7716,2.0511,-0.8931,-2.8632,0.1449,-0.6333,1.1492,-0.007,0.236,2.8632,3.008,9.8606,9.3852,10.2638,9.8509,0.3051,0.0061,-0.0078,10.2638,0.8786,2.47,1.8926,3.1623,2.3158,0.4091,6.8137,6.9189,3.1623,1.2697
617,0.1293,-0.2606,0.8499,-0.0847,0.4391,0.3715,0.4338,0.8499,1.1106,0.6559,-1.0568,1.739,0.853,1.058,-1.4743,-1.891,1.739,2.7958,-9.786,-10.0512,-9.6061,-9.7521,0.1401,-0.1134,0.4398,10.0512,0.4451,1.0357,-11.1874,16.8477,-0.8853,10.849,-4.3774,-5.2883,16.8477,28.0351,1.1583,0.77,1.4613,1.2425,0.265,1.2873,0.7525,1.4613,0.6913,-0.475,-1.5325,0.4746,-0.3729,0.6438,7.2193,4.4817,1.5325,2.0071,-0.9001,-17.8045,11.6989,-0.3973,10.0328,-0.5816,0.4058,17.8045,29.5034,9.8667,9.6436,10.1607,9.8431,0.1753,0.1562,-0.4639,10.1607,0.5171,9.2837,2.4565,16.8722,9.2347,4.7647,3.4076,2.602,16.8722,14.4157
618,0.5008,-0.2254,1.4404,0.3491,0.5806,-0.5807,-0.4187,1.4404,1.6659,-0.8185,-2.2632,0.4793,-1.0379,0.9529,0.334,0.3429,2.2632,2.7425,-9.8995,-16.6372,-5.3175,-9.3123,3.7764,0.0044,-0.4474,16.6372,11.3197,-3.3416,-15.133,14.6791,-6.1736,10.9287,11.8003,14.894,15.133,29.812,2.4456,-2.9488,6.8425,1.995,3.1066,-1.7413,-1.0413,6.8425,9.7913,6.7443,3.1297,15.5188,4.1088,4.7654,-13.3934,-8.3868,15.5188,12.3891,-1.4818,-24.6687,16.8673,0.0085,14.0745,-1.0041,-4.7714,24.6687,41.5359,10.0229,5.3419,16.7019,9.3792,3.7079,-0.0663,0.437,16.7019,11.36,12.6913,4.1767,22.5485,11.8368,6.2687,-1.0132,-1.4849,22.5485,18.3718
619,-0.0798,-0.5184,0.4062,-0.0696,0.3199,0.3401,0.3686,0.5184,0.9246,-0.4845,-1.6486,1.6199,-0.6951,1.0111,-0.1978,-0.1586,1.6486,3.2685,-9.8951,-11.1605,-9.1855,-9.7597,0.7395,0.1133,-0.0197,11.1605,1.975,8.4587,4.6273,12.7073,8.7204,2.7776,-4.7421,-5.2531,12.7073,8.08,0.7044,-0.2188,1.5137,0.9537,0.664,0.0558,-0.0219,1.5137,1.7325,-6.6491,-16.7313,0.0976,-4.278,7.155,4.0092,2.383,16.7313,16.8289,-2.4859,-11.4175,17.3807,-4.7628,8.7297,-1.3244,1.9208,17.3807,28.7982,9.9566,9.1947,11.2786,9.8162,0.7434,-0.0359,0.0657,11.2786,2.0839,11.6781,5.0701,21.0098,10.3519,6.0293,-5.3511,-4.3143,21.0098,15.9397
620,0.2603,-0.8102,1.8805,0.299,0.592,-0.0274,-0.0546,1.8805,2.6906,-0.6823,-2.6139,2.3787,-0.8536,1.4247,-0.0566,0.0242,2.6139,4.9925,-9.7818,-14.3823,-7.0417,-9.7794,1.9988,0.0014,-0.003,14.3823,7.3406,3.7165,0.3609,7.3411,3.4673,2.0556,-1.8919,-1.7428,7.3411,6.9802,0.7602,-3.885,2.6775,0.9319,1.5144,0.1017,0.0241,3.885,6.5625,-2.6399,-13.5682,4.9586,-1.895,4.9615,1.4443,1.0616,13.5682,18.5269,-3.8103,-15.6974,9.1771,-2.842,6.5329,1.7164,1.4325,15.6974,24.8745,9.9207,7.356,14.5123,9.8818,2.0062,-0.0432,-0.0315,14.5123,7.1563,6.327,1.3985,15.0454,6.0377,3.3497,-1.6395,-2.0534,15.0454,13.6468
622,0.2055,-1.0178,0.983,0.1898,0.3507,-0.0281,-0.0142,1.0178,2.0009,-0.7955,-2.7569,0.4769,-0.8052,0.5436,-0.0282,-0.0144,2.7569,3.2338,-9.779,-10.0991,-9.3234,-9.7855,0.1644,-0.0042,0.0056,10.0991,0.7757,-0.0673,-6.1776,8.509,-0.0182,3.4713,0.2238,0.0722,8.509,14.6866,0.9636,0.4462,1.6538,0.98,0.2028,0.0434,0.0175,1.6538,1.2075,0.2487,-3.1354,3.3879,0.2282,1.2457,-0.2508,-0.1734,3.3879,6.5233,-0.3775,-8.7959,7.7336,0.023,3.1073,0.2351,-0.0669,8.7959,16.5295,9.8343,9.4858,10.237,9.8188,0.1607,-0.014,-0.0032,10.237,0.7512,3.048,0.9978,9.0952,1.9308,2.2659,-1.9533,-0.9055,9.0952,8.0974
623,0.1773,0.0863,0.2746,0.1756,0.0341,-0.0372,-0.0041,0.2746,0.1884,-0.8238,-1.2417,-0.5523,-0.8195,0.1215,-0.0665,-0.0721,1.2417,0.6894,-9.7832,-9.8457,-9.741,-9.7799,0.0229,0.009,0.0052,9.8457,0.1048,0.1565,-0.6605,1.0071,0.054,0.3696,1.7886,1.2094,1.0071,1.6676,1.007,0.9363,1.1025,0.9975,0.0334,0.1065,0.0613,1.1025,0.1662,-0.0021,-0.5068,0.408,0.0548,0.2223,-1.7263,-0.9851,0.5068,0.9147,-0.1423,-0.911,0.4779,-0.0438,0.3217,-1.561,-1.5413,0.911,1.3889,9.8202,9.7822,9.8821,9.8156,0.0243,-0.0007,-0.0058,9.8821,0.0999,1.0947,0.9393,1.4334,1.0252,0.1423,1.9862,1.0,1.4334,0.4942
624,0.1401,-0.133,0.3149,0.1715,0.1202,0.0725,0.0114,0.3149,0.4479,-0.8903,-1.3997,-0.4907,-0.8916,0.26,-0.3583,-0.3555,1.3997,0.909,-9.7742,-9.8734,-9.6679,-9.7747,0.0596,0.0398,0.0369,9.8734,0.2055,1.9451,-0.1574,5.18,1.2634,1.8731,0.5792,0.3983,5.18,5.3374,1.1134,0.9187,1.5838,1.0588,0.159,-0.3518,-0.0437,1.5838,0.665,-1.7284,-4.7932,0.1891,-0.9303,1.7568,-0.3025,0.4581,4.7932,4.9823,-1.7033,-5.0265,0.1171,-1.5851,1.6076,-1.6087,-0.1286,5.0265,5.1436,9.8196,9.7094,9.9718,9.8098,0.0686,0.0148,0.0104,9.9718,0.2624,3.0809,1.0406,7.0061,2.0253,2.245,1.1457,0.2202,7.0061,5.9656
625,0.2126,-0.1115,0.6901,0.1829,0.1752,0.026,0.0911,0.6901,0.8016,-1.2486,-1.9927,1.0197,-1.2471,0.5609,-0.0446,-0.1483,1.9927,3.0124,-9.7345,-10.7282,-8.7198,-9.7378,0.3669,0.0429,0.0697,10.7282,2.0084,2.5244,-0.1249,14.7198,1.6617,3.5978,-0.6769,-0.2169,14.7198,14.8447,0.7616,-1.5575,1.6625,1.015,0.7581,0.1327,0.0481,1.6625,3.22,-2.0309,-17.0737,4.9956,-0.4722,4.8779,1.5853,0.5962,17.0737,22.0693,-3.312,-17.6786,1.8758,-1.7137,4.9253,0.9424,0.1856,17.6786,19.5545,9.8344,8.9463,10.7871,9.8203,0.338,-0.0281,-0.0617,10.7871,1.8408,4.2267,1.0138,22.5967,2.2455,5.4982,-1.0423,-0.2379,22.5967,21.5828
627,0.2647,-0.4364,0.6671,0.3651,0.3592,-0.0367,-0.04,0.6671,1.1035,-1.3378,-2.265,0.1209,-1.5436,0.7831,0.2241,0.4033,2.265,2.3859,-9.6487,-10.2147,-9.2694,-9.5985,0.2803,-0.0841,-0.2329,10.2147,0.9453,1.1705,-0.1233,2.7264,1.2278,0.9676,-3.7815,-1.4381,2.7264,2.8497,1.027,0.6388,1.2862,1.1112,0.255,0.3992,0.0744,1.2862,0.6475,1.1397,0.2556,3.0744,0.7202,1.1204,1.6114,-0.0121,3.0744,2.8188,-1.4272,-3.9184,0.3296,-1.3424,1.5476,2.2197,0.1639,3.9184,4.248,9.7782,9.5521,10.3339,9.6968,0.2647,0.0958,0.2879,10.3339,0.7819,2.1421,0.7509,3.8838,1.7697,1.1261,5.9588,1.9963,3.8838,3.1328
628,0.2279,-1.281,1.4541,0.3251,0.7003,-0.0677,-0.1444,1.4541,2.7351,-1.1137,-3.5761,0.7953,-1.1403,1.0372,-0.0922,-0.0141,3.5761,4.3714,-9.7328,-10.5169,-8.8787,-9.8313,0.4188,-0.0493,0.0697,10.5169,1.6382,-2.611,-31.8737,8.2495,-0.2103,9.6145,1.8486,-0.1206,31.8737,40.1232,1.4263,0.4287,3.8938,1.1856,0.7965,-0.6158,-0.3456,3.8938,3.465,2.7511,-7.075,25.5865,0.7081,7.4684,-2.5738,-0.6671,25.5865,32.6615,0.7925,-19.3952,53.8712,-1.1786,14.0801,-0.2787,1.3631,53.8712,73.2663,9.874,9.0636,11.154,9.9848,0.4533,-0.0018,-0.1559,11.154,2.0904,8.1009,1.5,39.0328,3.766,9.8831,-5.6972,-1.4813,39.0328,37.5328
629,0.1602,-0.2494,0.5779,0.1807,0.3006,0.0117,0.4898,0.5779,0.8273,-1.2059,-1.8263,-0.5793,-1.1543,0.5002,-0.2624,-0.3468,1.8263,1.2471,-9.7821,-10.0779,-9.4758,-9.7616,0.1981,0.1736,0.097,10.0779,0.602,-0.7624,-3.245,2.1083,-0.3309,2.0571,1.9284,1.1847,3.245,5.3532,0.8105,0.1925,1.1288,0.84,0.3121,-0.4315,-0.0219,1.1288,0.9363,0.1773,-2.2346,3.0998,0.0411,1.5317,-1.9235,0.6231,3.0998,5.3344,0.5137,-3.8504,5.0101,0.1846,2.8441,-2.1144,-0.7893,5.0101,8.8605,9.8722,9.5369,10.2142,9.8288,0.2173,-0.0114,0.1096,10.2142,0.6773,2.4037,1.1516,4.4038,2.2846,1.2341,3.9663,2.3033,4.4038,3.2523
630,0.1719,-1.8827,1.6761,0.6704,1.0582,0.0041,-0.2482,1.8827,3.5588,-1.4683,-4.1147,1.0813,-1.5011,1.2759,0.0357,0.0416,4.1147,5.196,-9.6085,-11.5144,-7.6181,-9.6647,0.915,-0.056,-0.0299,11.5144,3.8963,1.166,-5.4532,11.789,0.8538,4.9257,-0.6419,-0.4676,11.789,17.2423,0.379,-6.965,2.9925,0.8181,2.2047,0.3166,0.0787,6.965,9.9575,-1.7462,-14.5575,3.4717,0.6642,6.1773,0.9043,-0.27,14.5575,18.0292,-1.6006,-40.3855,12.7478,-0.6047,11.6254,0.8674,0.3532,40.3855,53.1333,9.8609,8.2495,11.7173,9.9384,0.8215,-0.0177,-0.063,11.7173,3.4679,6.37,0.8895,19.9853,4.5879,5.3717,-2.5058,-1.7072,19.9853,19.0958
632,0.1802,-0.2845,0.4835,0.174,0.174,0.1301,0.0504,0.4835,0.7679,-1.3969,-1.8198,-0.891,-1.4179,0.1966,0.2589,0.2076,1.8198,0.9287,-9.7206,-10.0904,-9.5489,-9.7244,0.0958,-0.0133,-0.0168,10.0904,0.5415,-0.1179,-1.1746,1.2313,-0.0815,0.4472,-0.5929,0.0244,1.2313,2.4058,1.0123,0.7788,1.505,0.9756,0.1559,0.0687,0.0262,1.505,0.7263,0.0625,-2.4863,2.0286,0.1241,0.9143,0.0993,-0.0114,2.4863,4.5149,0.1342,-2.0549,1.4311,0.1018,0.6305,0.6668,-0.0394,2.0549,3.486,9.8255,9.6652,10.2558,9.8123,0.0967,0.0049,0.0259,10.2558,0.5906,1.3584,0.8945,2.6263,1.1736,0.4811,0.7328,-0.0502,2.6263,1.7317
633,0.3103,-0.433,1.8385,0.2244,0.5834,-0.8064,-0.8176,1.8385,2.2715,-1.138,-1.9377,-0.1263,-1.2103,0.4256,-0.5865,-0.6508,1.9377,1.8114,-9.7338,-9.9851,-9.2635,-9.7413,0.1449,-0.0271,-0.0245,9.9851,0.7216,-0.7109,-6.2518,3.4349,-0.0571,2.2391,-1.0068,-3.7939,6.2518,9.6867,1.081,0.63,1.785,1.0019,0.2667,0.0653,0.2363,1.785,1.155,0.1618,-1.4359,2.7257,0.1127,0.7734,3.2236,3.3795,2.7257,4.1616,0.8011,-1.8356,7.8977,0.0624,2.1921,4.5409,5.1626,7.8977,9.7333,9.8304,9.3857,10.1551,9.8382,0.1583,0.2213,0.228,10.1551,0.7694,2.0912,0.8989,6.9005,1.1233,1.7037,5.07,5.1778,6.9005,6.0016
634,-0.4961,-2.2021,1.683,-0.5932,1.4874,0.766,0.8169,2.2021,3.885,-1.7245,-2.7545,-0.2777,-1.8611,0.8288,0.907,1.0873,2.7545,2.4768,-9.761,-10.1882,-9.2378,-9.7658,0.3228,-0.0622,-0.0152,10.1882,0.9504,-1.7177,-7.3131,4.928,-3.851,5.2243,2.7283,4.2229,7.3131,12.2411,1.1463,0.2712,1.8113,1.2381,0.5311,-0.2625,-0.3631,1.8113,1.54,3.3854,-2.8683,10.4892,3.4922,4.4506,-3.5266,-3.2674,10.4892,13.3575,5.3419,-6.5276,17.6363,5.225,9.4327,-6.3792,-5.351,17.6363,24.1638,10.0516,9.5657,10.3858,10.0662,0.3197,-0.1532,-0.2413,10.3858,0.8201,7.1612,4.936,12.8857,6.3011,2.5973,-4.4103,-4.5896,12.8857,7.9497
635,0.27,-0.639,1.8964,0.2238,0.5986,-0.0394,-0.0187,1.8964,2.5354,-0.8176,-2.5403,0.8007,-0.7737,0.6455,0.0107,-0.0127,2.5403,3.3409,-9.8232,-10.9388,-9.0887,-9.781,0.4097,0.018,-0.0094,10.9388,1.8501,1.0106,-1.7262,8.9315,0.372,2.661,-0.5171,-0.1889,8.9315,10.6576,0.8838,0.2362,1.3212,0.875,0.2563,0.0591,0.0656,1.3212,1.085,-0.1412,-5.7004,3.0767,0.2248,2.2981,0.1419,-0.0505,5.7004,8.777,-1.0372,-11.7212,2.4972,-0.126,3.4729,0.5314,0.0653,11.7212,14.2184,9.8985,9.3156,11.0065,9.8249,0.3881,-0.0382,0.0028,11.0065,1.6909,2.7509,1.0345,10.0307,1.7115,2.5099,-0.6917,-0.2584,10.0307,8.9961
637,0.1911,0.0505,0.3344,0.1863,0.0798,0.0223,0.0223,0.3344,0.2838,-0.7962,-0.9269,-0.6379,-0.7992,0.0705,0.0051,0.0099,0.9269,0.289,-9.7872,-9.9069,-9.6555,-9.7998,0.0617,-0.0019,0.0115,9.9069,0.2514,-0.0237,-0.7576,0.4392,-0.0059,0.2557,-0.0092,0.0073,0.7576,1.1968,1.0019,0.8488,1.1288,1.0062,0.0593,-0.0033,-0.0175,1.1288,0.28,0.1427,-1.634,1.9743,0.1239,0.9863,-0.0062,-0.0031,1.9743,3.6083,0.0256,-0.3538,0.6406,0.0045,0.2138,0.0013,-0.0057,0.6406,0.9943,9.822,9.6919,9.9477,9.8305,0.0611,0.0016,-0.0095,9.9477,0.2559,1.3674,0.9958,2.3457,1.1948,0.3996,-0.3408,-0.1967,2.3457,1.3498
638,0.2134,0.128,0.4251,0.2086,0.0666,-0.0066,-0.0072,0.4251,0.2972,-0.7911,-0.8216,-0.7743,-0.7893,0.0147,0.0018,-0.0037,0.8216,0.0473,-9.7891,-9.8658,-9.7526,-9.7883,0.0261,0.0041,0.0083,9.8658,0.1132,-0.0329,-0.3771,0.1562,0.0014,0.1279,0.0176,-0.0116,0.3771,0.5332,0.9986,0.91,1.1375,0.9888,0.0597,-0.0005,0.0087,1.1375,0.2275,0.1365,-0.141,0.6615,0.1208,0.1764,-0.0108,-0.0135,0.6615,0.8025,0.0269,-0.122,0.3098,-0.0011,0.1035,-0.0156,0.0089,0.3098,0.4318,9.8236,9.7874,9.9008,9.821,0.0265,-0.0044,-0.0084,9.9008,0.1134,1.0266,0.9103,1.3471,0.9981,0.1073,-0.0032,0.0104,1.3471,0.4368
640,0.2003,0.1429,0.2715,0.1942,0.043,0.0146,0.0042,0.2715,0.1286,-0.7876,-0.8479,-0.7438,-0.7968,0.0375,0.0456,0.0115,0.8479,0.1041,-9.781,-9.8544,-9.7281,-9.7717,0.0432,-0.0032,-0.007,9.8544,0.1262,0.0024,-0.1143,0.1426,-0.0218,0.0899,-0.3346,-0.0368,0.1426,0.2569,0.9975,0.9363,1.0412,1.0062,0.0374,-0.008,-0.0022,1.0412,0.105,0.115,-0.093,0.3601,0.0938,0.1697,-0.002,0.0022,0.3601,0.453,-0.0043,-0.1209,0.085,0.0166,0.0718,0.2058,0.0108,0.1209,0.2059,9.8148,9.7634,9.885,9.8041,0.0421,0.0038,0.0062,9.885,0.1217,1.0203,0.9667,1.0676,1.0189,0.0293,0.2112,0.0141,1.0676,0.1009
642,0.2294,-0.2723,1.2628,0.2027,0.2832,-0.1266,-0.1538,1.2628,1.5351,-0.6964,-1.2106,0.1999,-0.7737,0.2795,0.0367,0.1352,1.2106,1.4105,-9.7874,-9.9571,-9.6422,-9.7858,0.0619,-0.0128,0.0486,9.9571,0.3149,-0.6668,-2.9913,0.1427,-0.0955,1.031,0.5361,-0.521,2.9913,3.134,0.9815,0.4463,1.26,1.0019,0.1563,-0.0863,-0.1181,1.26,0.8138,0.111,-0.5938,0.918,0.0982,0.3625,0.3197,1.2992,0.918,1.5118,0.4074,-0.1745,3.1017,0.0381,0.8037,0.1847,1.0638,3.1017,3.2761,9.8225,9.6793,9.9963,9.8166,0.0624,0.0282,-0.0275,9.9963,0.317,1.4427,0.9628,3.2223,1.0471,0.7273,2.6561,2.822,3.2223,2.2595
643,0.1028,-0.6111,0.9542,0.0489,0.3697,0.05,0.0532,0.9542,1.5654,-0.6597,-2.0142,1.1166,-0.6385,0.6473,-0.0079,-0.0138,2.0142,3.1309,-9.8002,-10.4717,-9.1873,-9.7373,0.3008,0.0091,-0.0191,10.4717,1.2844,-0.1308,-4.8388,6.6265,-0.6165,2.8845,0.43,1.0049,6.6265,11.4652,0.8952,0.1225,1.995,0.8838,0.4867,0.1625,0.1881,1.995,1.8725,0.4307,-7.9584,4.8254,1.3975,3.5516,-0.5507,-1.3633,7.9584,12.7839,0.592,-6.0781,3.7754,1.102,2.1279,-0.7209,-1.3346,6.0781,9.8535,9.8507,9.3455,10.473,9.7891,0.2766,-0.0326,-0.008,10.473,1.1275,4.0987,0.8026,8.8295,3.8691,2.1778,-2.159,-2.1158,8.8295,8.0269
644,0.1528,-0.0902,0.5091,0.1021,0.2129,0.0583,0.0621,0.5091,0.5993,-0.6676,-0.8844,-0.3997,-0.6523,0.1613,0.1315,0.1559,0.8844,0.4847,-9.791,-9.9596,-9.6643,-9.7563,0.1164,-0.0069,-0.0644,9.9596,0.2953,0.2993,-1.0534,1.2618,0.3884,0.8744,-1.2418,-1.7333,1.2618,2.3152,1.0577,0.7875,1.295,1.0719,0.1833,-0.2661,-0.1225,1.295,0.5075,-0.12,-2.4167,2.3478,0.0342,1.5792,-3.2105,0.199,2.4167,4.7645,-0.1289,-0.9385,0.9317,-0.2326,0.6007,0.3343,0.6139,0.9385,1.8702,9.8181,9.6929,9.9962,9.7811,0.1187,0.0234,0.0536,9.9962,0.3032,1.9397,1.1735,2.8538,1.7533,0.624,4.8887,1.8619,2.8538,1.6802
645,0.211,-0.593,2.4037,0.1642,0.5767,-0.0471,-0.0098,2.4037,2.9967,-0.5361,-1.6773,0.0862,-0.4964,0.4756,-0.0554,-0.0715,1.6773,1.7635,-9.7979,-11.4445,-7.531,-9.8207,0.7377,-0.0009,0.0146,11.4445,3.9135,-0.9425,-5.4744,7.6695,-1.3449,2.8832,0.7966,0.5868,7.6695,13.144,0.7915,-1.8463,4.6812,0.9494,1.334,0.0757,0.0022,4.6812,6.5275,-3.3306,-23.4072,5.0658,0.2332,8.5383,1.6636,0.058,23.4072,28.4729,0.2054,-12.2907,5.3267,0.3813,3.2547,-0.3111,-0.1298,12.2907,17.6174,9.8415,7.701,11.7166,9.8347,0.7458,-0.0079,-0.0042,11.7166,4.0156,6.8284,1.1053,23.8896,3.6152,6.8917,-1.9289,-0.5108,23.8896,22.7843
647,0.1168,-0.3236,0.5661,0.1447,0.1662,,,0.5661,0.8897,-0.6469,-1.4482,-0.1472,-0.6394,0.2232,,,1.4482,1.3009,-9.7998,-10.2651,-9.1483,-9.7916,0.2011,,,10.2651,1.1168,0.6507,-4.0556,7.7036,-0.1713,3.0012,,,7.7036,11.7591,0.9428,0.2537,1.6013,0.9538,0.289,,,1.6013,1.3475,-0.0034,-3.8337,3.8105,0.3493,1.7556,,,3.8337,7.6442,-0.4169,-6.7769,3.1138,0.1216,2.0236,,,6.7769,9.8907,9.8257,9.1712,10.2945,9.8263,0.197,,,10.2945,1.1233,2.9707,0.667,8.6096,2.5936,2.1244,,,8.6096,7.9427
