AYGX_mean,AZ_mean,timestamp
0.1513,-9.7888,0
0.151,-9.7897,1
0.1509,-9.7895,2
0.1528,-9.7895,3
0.1488,-9.7909,4
0.1506,-9.7896,5
0.1497,-9.7904,6
0.1517,-9.79,7
0.15,-9.7893,8
0.1496,-9.7898,10
0.1487,-9.7882,11
0.1487,-9.7915,12
0.1256,-9.7908,13
0.1477,-9.7906,14
0.1366,-9.7934,15
0.1425,-9.7914,16
0.1429,-9.7926,17
0.0846,-9.786,18
4.33,-9.6158,19
-2.1441,-9.716,20
-6.753,-9.6941,21
-19.3818,-9.6455,22
2.7042,-9.4888,23
19.0157,-9.4986,24
9.1031,-9.6476,25
-0.5697,-9.7603,26
-10.2502,-9.6845,27
-5.4917,-9.6051,29
5.3523,-9.7097,30
-34.2455,-9.4218,31
72.4566,-9.0338,32
-13.146,-9.5312,33
-6.1764,-9.387,34
0.2128,-9.3621,35
13.1759,-9.4218,36
16.6464,-9.3824,37
2.3829,-9.7046,38
0.7936,-9.7572,39
1.6889,-9.7675,40
0.5259,-9.7937,41
0.5561,-9.7861,42
2.159,-9.777,43
-0.9898,-9.7913,44
-3.1607,-9.7181,45
0.4441,-9.7478,46
-6.9046,-9.7063,47
-0.432,-9.7485,48
-2.036,-9.7615,49
-1.0687,-9.7641,50
1.8316,-9.7579,51
0.4741,-9.7524,52
-0.3226,-9.7523,53
1.9859,-9.6545,54
6.3875,-9.7463,55
0.7587,-9.7713,56
-0.0753,-9.8013,57
0.4512,-9.8025,58
0.3038,-9.5723,59
-59.6075,-9.3423,60
-1.7596,-9.4308,61
-1.6063,-9.4292,62
-1.5039,-9.4326,63
-1.5442,-9.4321,64
-1.6427,-9.4284,65
-1.2881,-9.4326,66
-1.0859,-9.436,67
-2.1683,-9.4338,68
-1.6032,-9.434,69
-1.4939,-9.436,70
-0.5885,-9.4371,71
-2.1095,-9.437,72
-1.6819,-9.434,73
-1.4517,-9.4327,74
-1.4316,-9.4327,75
-1.9179,-9.4329,76
-2.1997,-9.4396,77
-0.7156,-9.4321,78
-1.3704,-9.4416,79
-1.5292,-9.4392,81
20.3015,-9.4594,82
-22.8579,-9.5413,83
-195.2812,-9.2503,84
-74.5684,-6.5499,85
54.5658,-8.6961,86
15.0273,-9.6185,87
2.1647,-9.7827,88
-0.9452,-9.7741,89
-2.4006,-9.7765,90
-1.022,-9.7825,91
0.2573,-9.784,92
-3.1924,-9.7123,93
0.3191,-9.7711,94
