AYGX_mean,AZ_mean,timestamp
0.5165,-9.7997,0
0.6609,-9.7981,1
0.52,-9.7979,2
0.5748,-9.7959,3
-0.258,-9.7886,4
-0.2525,-9.7755,5
-0.1624,-9.7699,6
1.125,-9.7768,7
0.4625,-9.7722,8
-0.0084,-9.7788,9
0.5198,-9.7746,10
0.9409,-9.7734,11
0.9064,-9.767,12
1.0446,-9.7702,13
0.7003,-9.7719,14
0.7473,-9.7605,15
0.9834,-9.7661,16
1.1695,-9.7673,17
2.1048,-9.7695,18
2.5817,-9.8094,19
-1.3257,-9.7902,20
-7.6409,-9.7386,21
3.2069,-9.7866,22
-0.9275,-9.8419,23
1.4274,-9.7855,24
0.8401,-9.8089,25
-0.1069,-9.8252,26
1.6252,-9.7902,27
1.2812,-9.8089,28
-1.1291,-9.7925,29
3.4181,-9.7881,30
0.8594,-9.799,31
-0.3,-9.7893,32
-5.0579,-9.7469,33
1.0872,-9.838,34
2.1516,-9.7914,35
0.2042,-9.8099,36
0.4409,-9.7833,37
-0.5737,-9.7997,38
2.111,-9.7973,39
-1.438,-9.7874,40
0.6497,-9.7785,41
-0.4611,-9.791,43
6.6379,-9.7439,44
15.4505,-9.7711,45
-1.5959,-9.8235,46
10.6546,-9.579,47
0.4176,-9.8035,48
1.7112,-9.4705,49
2.584,-9.7364,50
1.405,-9.9939,51
-2.2209,-9.6378,52
0.1045,-9.86,53
1.704,-9.8336,54
0.2533,-9.781,55
2.0422,-9.7137,56
2.8031,-9.7019,57
2.3803,-10.1553,58
5.295,-9.5635,59
1.1951,-9.7483,60
0.746,-9.8647,61
2.7967,-9.8651,62
-0.3621,-9.7449,64
1.6069,-9.8495,65
0.329,-9.8411,66
1.3216,-9.8355,67
0.81,-9.8611,68
-0.4599,-9.8531,69
0.8012,-9.9136,70
-1.0011,-9.9233,71
6.048,-9.9241,72
6.7633,-10.0248,73
-0.8742,-9.6852,74
0.6074,-9.8438,75
0.7164,-9.7501,76
0.6662,-9.8626,77
-1.2838,-9.81,78
3.2597,-9.8486,79
0.3972,-9.9248,80
1.548,-9.9752,81
1.0258,-9.743,82
3.537,-9.9213,83
1.6784,-9.8245,84
2.689,-9.8455,85
0.4231,-9.9849,86
-0.4652,-9.8463,87
0.4367,-9.7138,88
-0.7806,-9.7936,89
0.6832,-9.7709,91
1.7727,-9.8086,92
0.8709,-9.7283,93
7.4202,-9.822,94
-0.6455,-9.7991,95
-1.3563,-9.7805,96
0.7378,-9.7947,97
1.0505,-9.8056,98
0.5722,-9.7993,99
0.5936,-9.8018,100
0.4668,-9.8021,101
0.8938,-9.803,102
0.4284,-9.7956,103
0.7841,-9.7886,104
0.7202,-9.7964,105
0.3448,-9.7931,106
0.9294,-9.7933,107
0.3881,-9.7922,108
1.5955,-9.7875,109
-1.3132,-9.8087,110
0.4132,-9.7099,111
0.9242,-9.7635,112
1.0951,-9.7936,113
1.6194,-9.7601,115
1.4084,-9.7667,116
2.895,-9.7609,117
1.4065,-9.8319,118
1.4005,-9.7809,119
1.1542,-9.8445,120
-2.6262,-9.7117,121
-0.7728,-9.7791,122
2.8619,-9.8074,123
2.1851,-9.8666,124
0.6668,-9.8681,125
-0.0007,-9.8047,126
3.5164,-9.8975,127
0.1307,-9.6424,128
-0.9098,-9.7574,129
2.6784,-9.7979,130
-1.8154,-9.8828,131
3.4532,-9.9483,132
0.0481,-9.8341,133
0.4487,-9.6781,134
-0.8552,-10.0124,135
1.2018,-9.7271,136
10.5531,-10.0857,137
0.0078,-9.6358,138
3.2746,-9.8102,139
2.4527,-9.8834,140
3.8338,-9.9013,141
0.5327,-9.8074,142
2.6531,-9.8632,143
0.8699,-9.9911,145
-1.0128,-9.9586,146
3.5986,-10.04,147
2.7146,-10.292,148
4.4347,-9.9845,149
2.2667,-9.8322,150
2.4706,-9.8005,151
2.6037,-9.7327,152
0.5348,-9.8164,153
2.1726,-9.8194,154
1.0777,-9.7207,155
-0.4896,-9.449,156
1.3866,-9.9054,157
0.9479,-10.0281,158
0.8042,-9.9425,159
2.2094,-9.7805,160
2.8261,-9.8397,161
1.1617,-9.8063,162
2.0112,-9.9012,163
0.8223,-9.7777,164
-0.0298,-9.7318,165
1.2178,-9.8676,166
0.1817,-9.7818,167
-0.7288,-9.8476,168
-0.0167,-9.8654,169
-3.4382,-9.7619,170
2.0182,-9.7596,171
-0.1446,-9.8089,172
-0.4482,-9.8165,173
0.041,-9.8122,174
0.026,-9.8174,175
-0.0095,-9.819,176
0.0041,-9.818,177
0.028,-9.8186,178
0.0388,-9.8194,179
-0.4082,-9.8199,180
0.0691,-9.7952,181
0.0941,-9.7982,182
0.5917,-9.8134,183
0.4188,-9.7998,184
0.7603,-9.7915,185
1.7244,-9.8024,186
0.188,-9.8066,187
0.6912,-9.8136,188
0.7333,-9.8131,189
0.4199,-9.8042,190
0.22,-9.797,191
0.9863,-9.8009,192
0.4227,-9.7972,193
1.5849,-9.8041,194
0.7608,-9.8064,196
0.7599,-9.7956,197
4.9853,-9.7938,198
-2.5521,-9.8686,199
-1.3108,-9.7881,200
0.0693,-9.8227,201
0.9094,-9.7962,202
0.7703,-9.795,203
1.9883,-9.9005,204
-1.4406,-9.8302,205
-2.2026,-9.5577,206
-3.325,-9.8043,207
0.6388,-9.8788,208
-3.8478,-9.7774,209
3.2239,-9.9967,210
0.3621,-9.8787,211
5.4396,-9.7337,212
-1.3869,-9.7262,213
0.226,-9.7807,214
2.3219,-9.6164,215
-5.021,-10.1295,216
-1.2491,-10.0185,217
-3.5211,-9.9113,218
-0.4785,-9.8202,219
2.4493,-9.8278,220
1.0345,-9.8086,221
5.1025,-9.6939,222
7.881,-9.83,223
-1.7983,-9.8375,225
-0.436,-9.8458,226
-1.3381,-9.8207,227
1.5271,-9.8585,228
0.7939,-9.7618,229
2.6729,-10.0153,230
0.533,-10.1883,231
10.3019,-9.9583,232
0.5332,-9.9823,233
1.3751,-10.0229,234
0.8646,-9.8264,235
1.6578,-9.7291,236
17.0842,-9.463,237
4.553,-9.4399,238
2.1306,-9.7941,239
0.5052,-9.9359,240
3.8038,-9.7132,241
1.9531,-9.7797,242
0.7077,-9.9832,243
4.4944,-10.2915,244
-3.4755,-9.8813,245
1.6228,-9.7796,247
1.8428,-9.7491,248
2.6764,-10.1165,249
3.4572,-9.715,250
0.8833,-9.8074,251
0.8267,-9.7975,252
2.0833,-9.8707,253
0.58,-9.7977,254
0.3816,-9.8557,255
1.2607,-9.9385,256
-0.0921,-9.4797,257
0.8032,-9.772,258
1.0692,-9.8734,259
0.9542,-9.2948,260
-0.3473,-10.1971,261
0.4071,-9.7185,262
2.1278,-9.7848,263
6.3932,-9.7528,265
0.9424,-9.7432,266
-1.3464,-9.9875,267
5.4531,-9.751,268
2.0286,-10.1365,269
1.168,-9.8851,270
1.2094,-9.8274,271
-0.2524,-9.9872,272
0.8978,-9.9246,273
2.4852,-9.4002,274
-0.3607,-10.4629,275
-1.9651,-9.5824,276
1.1741,-9.7558,277
2.0023,-9.8891,278
0.2551,-9.8541,279
-0.3969,-9.8288,280
-0.4184,-9.4659,281
-0.6758,-9.7769,282
0.805,-9.7493,283
0.0769,-10.0318,284
1.2036,-9.9057,285
1.7751,-9.8018,286
-1.8362,-9.7704,287
-0.2043,-9.7929,288
-2.7706,-9.8187,289
-7.5531,-9.6906,290
4.6215,-9.6131,291
2.3012,-9.7879,292
2.9854,-9.8139,293
6.732,-9.6746,294
-2.8754,-9.6176,295
-1.6214,-9.8593,296
-1.4383,-10.0085,298
-0.1324,-9.7989,299
0.9385,-9.8053,300
0.0668,-9.9337,301
-0.242,-9.5051,302
1.2936,-10.1393,303
-0.6173,-9.8383,304
2.927,-9.6537,305
1.7529,-9.9717,306
0.1248,-9.9213,307
-0.3484,-9.7541,308
-0.0705,-9.5176,309
6.154,-9.7734,310
5.3889,-9.9326,311
2.2626,-9.8614,312
0.3405,-9.7689,313
1.1148,-9.8539,314
4.1505,-9.885,315
3.8517,-9.7582,316
2.2767,-9.865,317
-0.4086,-9.8592,318
4.7293,-9.8108,319
0.6953,-9.8173,320
3.6581,-9.9534,321
0.7826,-9.7655,322
0.0094,-10.0345,323
-0.5573,-10.0041,324
1.686,-9.8666,325
0.5939,-9.8409,326
0.1363,-9.8453,327
1.1896,-9.7788,328
1.0048,-9.8314,329
3.8012,-9.8321,330
2.3437,-9.9126,331
0.5482,-9.7803,332
-2.0506,-9.7952,333
-1.8508,-9.8592,334
3.6896,-9.7265,335
0.6397,-9.7766,336
-0.022,-9.7743,337
1.4342,-9.7977,338
0.4921,-9.7921,339
1.1625,-9.7708,340
-0.7449,-9.7669,341
-1.2497,-9.7515,342
1.8714,-9.7598,343
1.4857,-9.7395,344
2.736,-9.731,345
3.8004,-9.8159,346
0.4921,-9.6338,347
5.3926,-9.7937,349
0.9865,-9.841,350
0.5338,-9.8584,351
6.5131,-9.6609,352
15.0768,-9.8379,353
6.4097,-10.0314,354
0.0757,-9.8563,355
1.2696,-9.7144,356
-0.9656,-9.5539,357
2.7637,-9.7524,358
-0.4397,-9.8918,359
1.893,-9.8356,360
3.4699,-9.8955,361
-1.625,-9.6738,362
3.4698,-10.5771,363
2.2863,-9.6756,364
1.1321,-9.7781,365
4.5454,-10.0287,366
2.2266,-9.9492,367
3.1507,-9.7736,368
2.503,-9.8491,369
7.482,-9.879,370
2.14,-9.658,371
11.6891,-10.0962,372
-0.953,-9.864,373
25.8581,-9.7526,374
-0.2974,-9.8383,375
0.5997,-9.7777,376
2.0471,-9.8454,377
4.1715,-9.9051,378
-0.3864,-9.8169,379
-1.1104,-9.8679,380
1.1987,-9.8729,381
0.0754,-9.8562,382
0.1962,-10.1039,383
-0.0801,-10.0208,384
0.6505,-9.7732,385
0.8692,-9.9328,386
5.0215,-9.8153,387
1.759,-10.0635,388
1.0414,-9.9647,389
-1.3695,-9.9159,390
-0.3005,-9.7507,391
6.0829,-9.8469,392
-1.2369,-9.811,393
-1.9001,-9.7559,394
-3.3015,-9.8947,395
1.6441,-9.8025,396
-3.6822,-9.7893,397
6.2237,-9.8463,398
2.9407,-9.6378,400
2.7827,-10.108,401
-3.4764,-10.1429,402
4.6946,-9.6657,403
-2.042,-9.9373,404
0.3955,-9.8517,405
2.9637,-9.9541,406
-0.0988,-9.8136,407
1.9906,-9.8504,408
1.5006,-9.5289,409
1.4365,-9.8127,410
-0.0504,-9.838,411
0.2241,-9.8291,412
0.1616,-9.8222,413
0.2179,-9.8238,414
0.1568,-9.8258,415
