AYGX_mean,AZ_mean,timestamp
-0.1348,-9.9128,0
-6.8053,-9.8703,2
10.1392,-9.7228,3
1.4508,-9.8746,4
1.7202,-9.9113,5
-2.3626,-9.8812,6
-16.9104,-9.6394,7
16.7348,-9.7554,8
1.6261,-9.8851,9
0.6246,-9.88,10
1.2595,-9.8815,11
0.5089,-9.8833,12
1.0861,-9.8798,13
0.9965,-9.8756,14
1.2225,-9.8759,15
1.3117,-9.8747,16
1.02,-9.8789,17
1.3102,-9.8793,18
1.0584,-9.8786,19
0.8885,-9.878,20
1.2804,-9.8777,21
1.1301,-9.8738,22
1.3725,-9.8791,23
1.0101,-9.8824,24
1.0838,-9.8834,25
1.1914,-9.8831,26
0.852,-9.8848,27
0.8105,-9.8834,28
0.9654,-9.8816,29
1.2702,-9.8837,30
1.1154,-9.888,31
0.7578,-9.8838,32
1.6675,-9.8956,34
0.0196,-9.8992,35
2.8059,-9.8912,36
-0.5069,-9.9102,37
-0.6924,-9.8893,38
0.2769,-9.901,39
0.8994,-9.8804,40
1.298,-9.9068,41
-2.7867,-9.8963,42
-1.9732,-10.0283,43
16.1614,-9.952,44
3.0282,-9.905,45
0.6906,-9.9364,46
-0.6742,-9.8284,47
-0.441,-9.95,48
0.6515,-9.9577,49
-0.3156,-9.9388,50
0.0839,-9.933,51
-0.5539,-9.9028,52
-0.3113,-9.9349,53
-0.9575,-9.9313,54
1.2663,-9.9817,55
0.4779,-10.0268,56
1.0411,-10.1394,57
-0.6356,-9.9012,58
0.2209,-9.8038,59
1.3496,-9.6512,60
-0.3542,-10.0283,61
0.9925,-9.8628,62
-1.9158,-8.9766,63
5.1776,-9.9806,64
4.6936,-9.8211,65
0.0032,-9.9106,66
-0.0545,-9.8128,67
0.5465,-9.7861,68
-0.9965,-9.8832,69
-0.2354,-9.7843,70
-2.1158,-10.0642,71
4.3324,-10.0082,72
0.1777,-10.009,73
0.3086,-9.7413,74
-0.6797,-10.1528,75
2.24,-10.0393,76
-0.9054,-9.8382,77
0.2773,-9.8764,78
-0.2365,-9.9218,79
0.2649,-9.9163,80
1.1982,-10.1638,81
0.4167,-10.1397,82
7.2172,-9.991,83
3.2111,-10.1124,84
-1.3772,-9.8282,85
1.0593,-9.4992,86
-3.5258,-9.8952,87
2.1362,-9.6371,88
-0.3482,-9.1068,89
5.6596,-9.9563,90
4.5799,-9.8968,91
5.1625,-10.1871,93
-0.3255,-9.7382,94
0.26,-9.9267,95
-0.0389,-9.9367,96
0.1138,-9.8559,97
2.7956,-10.0653,98
36.4363,-10.8588,99
29.5651,-10.0932,100
70.4663,-9.9779,101
58.5278,-10.6251,103
37.6468,-10.2976,104
99.7213,-9.4297,105
30.9841,-9.6834,106
2.5469,-9.763,107
17.1021,-9.971,108
12.6349,-9.5031,109
4.5271,-10.1465,110
4.1912,-9.722,112
1.4011,-9.8636,113
45.1183,-10.2486,114
1.4989,-10.0817,115
0.389,-10.0387,116
-0.0008,-9.7588,117
-2.5728,-10.0326,118
7.1916,-10.0857,119
0.5177,-10.0246,120
5.1702,-10.0632,121
-0.5634,-8.4365,123
1.3155,-9.1705,124
-0.5236,-10.2391,125
0.13,-9.936,126
0.4016,-9.9109,127
0.1031,-9.927,128
-0.2155,-9.9415,129
-1.0017,-9.9297,130
-0.6404,-9.9015,132
-0.2731,-9.8647,133
1.735,-9.8517,134
5.006,-9.8819,135
-0.2349,-9.9328,136
0.2808,-9.9066,137
0.1149,-9.9021,138
0.2702,-9.9503,139
0.0273,-9.9102,140
-3.2056,-9.88,141
2.2781,-9.8519,142
2.9934,-9.8978,143
-0.1452,-9.9099,144
2.4299,-10.0409,145
21.7291,-9.985,146
49.6751,-10.1155,147
19.4082,-9.8849,148
8.0415,-10.1775,150
6.7659,-10.0249,151
7.979,-9.4081,152
31.3886,-9.7706,153
19.6003,-9.9015,154
11.2574,-9.9744,155
1.7966,-9.8916,157
0.7824,-9.8092,158
-0.1161,-10.1426,159
0.7013,-9.5303,160
2.5425,-10.0275,161
0.7899,-9.6367,162
1.2051,-10.177,163
2.6814,-10.1636,164
2.2749,-9.9599,165
2.9716,-9.9008,166
0.6994,-9.5947,167
-0.0517,-9.8874,168
-0.2887,-9.6889,169
-0.1069,-9.8823,170
0.6519,-9.9557,171
3.9584,-9.1591,172
0.4352,-10.0788,173
-0.6157,-10.2198,174
1.5284,-10.164,175
-0.6129,-9.8758,176
-2.864,-9.6671,177
1.0965,-9.6333,178
16.266,-9.7943,179
20.7602,-10.4109,180
1.699,-10.2435,181
-1.2614,-10.5644,182
3.4259,-10.0008,183
1.658,-10.1418,184
0.5065,-9.6829,185
3.3825,-10.3927,186
-0.0747,-10.0617,187
0.6806,-9.982,188
0.0388,-9.735,189
8.0743,-9.8706,190
5.8734,-9.8228,191
-0.358,-10.0294,192
-1.4808,-10.0785,193
1.4052,-9.9716,194
-0.3078,-9.9311,196
-1.4284,-10.0219,197
8.5851,-9.9091,198
-0.5869,-9.9146,199
4.9431,-9.9571,200
0.0496,-9.9386,201
0.2273,-9.9032,203
-0.5795,-9.8916,204
-0.3109,-9.8927,205
4.5053,-9.9506,206
0.0228,-10.0332,207
-1.2999,-9.9083,208
-0.2614,-9.9565,209
-0.1555,-9.9239,210
-1.6202,-9.9035,211
-22.4182,-9.7472,212
-0.4771,-9.8668,214
-1.3981,-9.884,215
0.0053,-9.8757,216
-0.9917,-9.8967,217
-1.1878,-9.8885,218
-1.9757,-9.8743,219
-0.9375,-9.8665,220
-0.0113,-9.8697,221
-0.9916,-9.8796,223
-1.3914,-9.8734,224
-1.4686,-9.8657,225
-1.9194,-9.8647,226
0.2377,-9.8669,227
-7.9051,-9.8322,228
0.9697,-9.7971,229
-1.8155,-9.8761,230
0.7638,-9.88,232
-9.2595,-9.5926,233
7.512,-9.7281,234
-4.9783,-9.8427,235
0.8487,-9.8103,236
1.0965,-9.8533,237
-0.8411,-9.848,238
-1.7918,-9.8864,239
-2.0632,-9.8712,240
0.8889,-9.88,241
-1.1203,-9.8864,243
-0.6283,-9.8854,245
-1.1695,-9.8587,246
-0.0089,-9.8865,247
0.1212,-9.9099,248
-0.7948,-9.8677,249
-0.8778,-9.8922,250
-0.1393,-9.8936,251
-0.5337,-9.9151,253
-0.9106,-9.892,254
0.5421,-9.9165,255
3.336,-9.7947,256
-0.8691,-9.9714,257
0.8184,-9.8314,258
1.1943,-9.7056,259
3.771,-10.6078,260
56.327,-8.9431,261
-8.8432,-10.5093,263
3.8327,-10.0952,264
5.0389,-9.8695,265
2.4049,-9.7767,266
1.5009,-9.6835,267
6.4976,-9.984,268
-0.0397,-9.8962,269
1.733,-9.7776,270
18.0483,-9.8052,272
-3.1581,-9.9972,273
-7.8135,-10.1329,274
2.6534,-9.5109,275
15.9557,-10.2899,276
0.3921,-9.2273,277
-12.1067,-9.2862,278
5.9206,-9.5818,279
0.9268,-10.3818,280
0.4621,-8.619,282
11.2726,-10.0048,283
10.7089,-10.8126,284
20.6856,-8.7825,285
18.4734,-10.3291,286
36.75,-10.9451,287
9.6094,-10.541,288
16.7208,-10.0271,289
35.5132,-9.9534,290
8.8967,-8.8269,292
21.5526,-9.6775,293
10.7112,-9.9769,294
28.8153,-10.5287,295
10.2595,-10.0472,296
22.246,-9.5936,297
0.3531,-9.6608,298
11.2632,-9.5644,299
9.9937,-8.2407,300
0.2055,-9.8656,302
11.6817,-9.8624,303
-0.7779,-9.679,304
25.8228,-9.6158,305
5.1231,-10.6807,306
3.8945,-9.3121,307
1.3071,-9.7854,308
-7.6856,-9.6634,309
2.4122,-9.4576,310
-0.7032,-9.8102,311
22.3627,-9.7574,313
-0.7971,-9.5872,314
5.3609,-10.1486,315
45.5795,-9.9565,316
22.5758,-10.1971,317
-0.3036,-9.9877,318
10.1434,-9.9834,319
5.2823,-10.0509,320
4.5501,-9.9849,322
6.2415,-10.0038,323
12.3755,-9.8278,324
0.1901,-10.0175,325
1.2206,-10.2242,326
-0.7209,-10.22,327
27.7258,-10.665,328
-2.1623,-9.494,329
1.6847,-10.125,330
1.2065,-9.4013,332
3.6522,-9.7668,333
5.7791,-10.2369,334
9.0777,-9.4048,335
14.4964,-10.0733,336
-0.292,-10.1101,337
16.4588,-9.8864,338
8.9213,-9.925,339
4.7128,-9.9003,340
7.1964,-9.8207,341
2.8782,-9.8684,343
5.2399,-10.003,344
6.4907,-10.1949,345
1.3599,-8.7531,346
-8.4691,-9.523,347
9.084,-9.5981,348
-18.7623,-9.8067,349
2.6859,-9.8894,350
-2.1986,-10.1767,351
-0.886,-9.9303,353
1.5236,-9.205,354
4.307,-10.014,355
4.5404,-9.3974,356
0.3214,-9.8467,357
1.7984,-9.5901,358
0.0881,-9.868,359
8.3518,-10.0377,360
6.9576,-9.4668,362
9.3664,-9.7999,363
0.3075,-8.9843,364
1.8866,-9.735,365
18.0943,-10.2482,366
9.9845,-9.7057,367
-2.5821,-8.6401,368
8.541,-7.8549,369
7.8528,-9.0302,370
1.4353,-8.2568,372
-0.6968,-8.513,373
3.1687,-9.91,374
0.6291,-9.6221,375
1.9141,-9.8816,376
6.3677,-3.6562,377
-15.3395,-9.9544,378
-1.3732,-10.0037,379
11.7536,-9.8107,380
4.1606,-9.853,381
13.4535,-9.9965,383
4.5501,-9.9202,384
4.1151,-9.9376,385
2.0427,-9.7691,386
17.057,-9.6752,387
14.3606,-10.0819,390
6.8825,-9.906,391
0.3848,-9.4285,393
4.7716,-9.813,394
3.2531,-10.336,395
0.2701,-10.1038,396
0.358,-9.9435,397
-0.314,-9.765,398
1.8206,-7.9282,399
-0.7251,-9.0734,400
0.08,-10.2097,402
0.2398,-9.9272,403
1.3171,-9.9127,404
0.1474,-9.9162,405
3.2568,-9.9147,406
-0.2556,-9.9127,407
0.0319,-9.957,408
-0.0201,-10.0433,409
0.3235,-9.8388,410
0.2091,-9.9877,412
2.4774,-10.062,413
6.2933,-10.1008,414
3.4791,-9.6718,415
2.1726,-9.8117,416
0.546,-10.0229,417
0.0368,-9.0435,418
1.8322,-9.948,419
0.9297,-9.9445,420
0.9865,-9.936,422
0.8798,-9.9179,423
1.1102,-9.9078,424
-0.2975,-9.8777,425
1.7212,-9.8484,426
3.6777,-9.9265,427
1.9598,-10.0598,428
0.642,-9.9718,429
0.0516,-9.9335,430
10.9365,-10.0245,431
0.8327,-10.2031,433
9.1444,-9.9324,434
-2.5694,-8.3497,435
5.6754,-9.847,436
-0.215,-9.9238,437
-0.0045,-10.0778,438
-0.042,-9.9619,439
4.0771,-9.9807,440
2.161,-9.8872,473
1.4674,-9.9985,474
10.8591,-10.0151,480
3.0454,-10.155,481
0.8091,-10.4069,482
8.1293,-9.798,483
0.1376,-9.9289,484
0.3648,-9.9033,485
0.0786,-9.8526,487
0.2719,-9.9296,488
-0.4015,-9.8975,489
1.2096,-9.8858,490
10.8617,-9.8534,491
0.3971,-9.8652,492
-13.4634,-9.7757,493
3.3112,-9.8917,495
-4.7984,-9.8739,496
-0.6846,-9.8568,497
0.6863,-9.8944,498
-0.3898,-9.9043,499
-0.0847,-9.9067,500
-1.3858,-9.9013,501
-2.2142,-9.8848,502
1.3001,-9.8685,503
-0.4776,-9.9028,504
0.4941,-9.8943,505
0.9526,-9.9063,506
0.4635,-9.9077,507
0.4388,-9.9094,508
0.5188,-9.9118,509
-0.3657,-9.9114,510
-0.163,-9.9104,511
-0.2376,-9.9126,512
-0.7768,-9.8976,513
-0.4507,-9.867,514
0.7283,-9.9432,515
-0.4648,-9.9096,516
3.909,-9.8943,517
0.6584,-9.9006,518
3.2263,-9.9095,519
-0.1645,-9.9047,520
-0.5696,-9.9014,521
-0.6523,-9.899,522
-0.7407,-9.8981,523
0.1306,-9.903,524
-0.1403,-9.8639,525
8.9539,-9.7972,526
-0.2827,-9.9209,527
-0.1807,-9.8837,528
-0.2112,-9.9206,529
0.0582,-9.9139,530
-6.3218,-9.9869,531
-2.7949,-9.8241,532
-0.0464,-9.9097,533
