AYGX_mean,AZ_mean,timestamp
1.1213,-10.062,296
10.503,-9.706,297
-1.6925,-10.1461,298
0.8736,-9.8897,299
0.8629,-9.97,300
1.7806,-9.9062,301
0.1359,-10.0288,302
4.533,-10.4815,303
-0.1126,-9.8534,304
-0.4132,-10.1962,305
36.4051,-9.6867,306
35.3165,-9.3624,307
0.1377,-9.7801,308
4.4244,-9.4006,309
0.2007,-9.8633,310
0.463,-9.9403,311
-0.6162,-9.8058,312
-2.2556,-9.842,313
2.2021,-9.7414,314
0.2519,-9.8204,315
-2.6601,-9.3325,316
