AYGX_mean,AZ_mean,timestamp
0.6161,-9.8157,0
0.6198,-9.8149,1
0.618,-9.8144,2
0.6147,-9.8145,3
0.6109,-9.8145,4
0.6148,-9.816,5
0.6094,-9.8154,6
0.6184,-9.8148,7
0.5397,-9.8757,8
-3.7394,-9.596,9
-3.9475,-9.8097,10
-3.7845,-9.6931,11
13.8204,-9.7906,12
1.7898,-9.9026,13
2.3311,-9.7009,14
3.6924,-10.0058,15
4.9949,-10.7043,16
-2.4797,-8.2191,17
5.4477,-9.6416,18
1.9689,-9.381,19
0.8439,-9.3608,20
2.9397,-9.7847,21
4.0283,-10.1632,22
0.0453,-9.9019,23
0.2445,-9.7676,24
-0.3754,-9.6388,25
-0.7399,-9.6109,26
-1.7685,-10.2685,27
3.1167,-10.6388,28
0.9624,-10.2195,29
-0.3677,-9.8934,30
-0.959,-9.9717,31
0.1508,-9.9268,32
-0.0775,-9.8692,33
0.707,-9.2806,34
0.0846,-10.016,35
-0.3467,-9.8214,36
0.0754,-9.9068,37
0.0708,-9.8205,38
0.6115,-10.033,39
0.4005,-9.8183,40
3.1417,-9.9161,41
0.7471,-9.8967,42
2.0291,-9.5484,43
-0.9949,-10.0988,44
0.2935,-9.9922,45
-0.0728,-9.8694,46
-1.4059,-9.762,47
0.8784,-9.7391,48
0.0554,-9.4611,49
2.2555,-10.1658,50
0.146,-9.8683,52
0.2367,-9.9067,53
0.8741,-9.97,54
0.2091,-9.7503,56
-0.2028,-10.0985,58
4.0385,-9.5432,59
0.726,-9.9429,60
0.2453,-9.9018,62
-3.2077,-9.9837,63
-1.4263,-9.8725,65
-1.1441,-10.2574,66
1.3242,-6.6126,67
3.123,-9.9732,68
2.3729,-9.3485,69
-3.0228,-10.0076,70
-1.9842,-9.7734,72
0.272,-9.3996,75
-9.6412,0.1315,76
-2.3232,-10.1041,77
-0.2219,-9.8774,78
-3.0609,-10.2755,79
-3.8913,-8.9192,80
-5.0037,-9.8115,81
0.7643,-9.5793,82
2.6835,-10.0009,83
0.532,-10.3617,84
0.8709,-10.2809,85
-0.0415,-9.6232,86
0.0538,-9.3949,87
0.0089,-9.7111,88
-1.162,-9.6546,89
1.1328,-9.9216,90
0.0485,-10.0188,91
0.2462,-9.6864,92
6.6005,-10.2461,93
4.583,-8.628,96
1.9594,-10.2308,97
0.2089,-9.8268,98
0.7655,-9.6649,99
0.2929,-10.0151,100
1.4298,-10.3813,101
0.3657,-10.0641,103
-0.0765,-9.8851,104
-0.3857,-9.9249,105
-0.0334,-9.9222,106
0.6563,-9.9272,107
0.9522,-9.8699,109
0.8315,-9.8498,110
2.2633,-9.9481,111
-2.8252,-9.8549,112
3.439,-9.7997,113
3.6483,-9.924,114
0.2801,-10.0199,115
0.5059,-9.9596,117
4.1685,-10.4073,118
13.8926,-9.5714,119
9.3294,-10.1717,120
0.0058,-9.6369,121
-0.6414,-9.4869,122
8.3422,-10.2142,123
1.9834,-9.8443,124
0.2593,-10.6248,125
2.1966,-8.3395,126
0.0806,-9.6449,128
2.03,-9.9953,129
5.1473,-9.4364,131
7.0728,-10.2228,132
2.8921,-9.234,134
-2.6229,-9.9152,135
-2.6952,-9.7962,136
2.172,-9.4962,137
3.7905,-9.9324,138
0.9323,-8.7566,139
-0.0518,-9.9944,140
-0.6816,-10.1493,141
-2.2377,-9.9732,142
0.17,-9.8298,143
0.1606,-9.5134,144
0.7426,-9.9491,145
-0.4736,-9.8519,146
-1.9886,-10.2295,147
0.6031,-9.8843,148
-0.5646,-9.962,149
0.5162,-10.1188,150
-0.0875,-9.6767,151
0.433,-9.7343,152
-4.4743,-10.453,153
2.8515,-10.0559,154
-0.607,-9.2514,155
-5.2575,-10.3879,156
-0.0773,-8.0941,157
1.5399,-10.4283,158
2.1744,-9.2476,159
3.0543,-10.0993,160
1.2533,-10.8347,161
-0.4814,-9.8139,162
0.9859,-8.1391,163
0.0908,-10.157,164
0.5188,-9.7963,165
-10.0319,-9.7777,166
14.04,-9.7625,167
2.9366,-9.8804,168
0.4519,-9.8746,169
-18.4843,-9.1669,171
-0.908,-9.8966,172
-0.0741,-9.9122,173
3.2389,-9.8687,174
-4.6788,-9.8815,175
0.3949,-9.8619,176
0.4938,-9.8609,177
0.4833,-9.8613,178
0.474,-9.8608,179
0.4751,-9.8618,180
0.4736,-9.8614,182
