AYGX_mean,AZ_mean,timestamp
-4.5843,-9.4081,0
-4.6056,-9.4085,1
-4.6263,-9.4082,2
-4.6137,-9.4086,3
-4.5959,-9.4081,4
-4.5921,-9.4088,5
-4.6057,-9.4089,6
-3.1203,-9.3938,7
21.2723,-9.6533,8
-8.3473,-9.8442,9
-63.6426,-9.8949,10
-132.2793,-7.6903,11
-10.7273,-8.9299,12
-5.6811,-8.6787,13
17.8747,-8.6874,14
26.9214,-9.2412,15
13.9389,-9.4539,16
28.1001,-9.624,17
2.7912,-9.9861,18
-0.6571,-9.7839,19
-0.8578,-10.0106,20
0.7219,-9.9555,21
6.6512,-10.0539,22
6.0849,-9.8201,23
7.1214,-10.1029,24
4.5228,-9.4594,25
4.7561,-10.28,26
1.2959,-10.3894,27
1.9478,-8.7881,28
1.593,-9.869,29
8.3924,-9.896,30
1.231,-11.0017,31
5.0438,-9.9514,32
0.7418,-9.7949,33
4.9331,-9.9309,34
20.2604,-9.6185,35
8.9691,-9.4177,36
28.1973,-9.7274,37
-0.7964,-9.8467,38
0.5791,-9.9173,39
-0.261,-9.9263,41
-0.3933,-9.5685,42
-0.1066,-9.8666,43
4.8699,-9.7491,44
19.5966,-10.4397,45
1.6121,-10.3462,46
-1.1819,-10.1786,47
-1.6141,-9.8314,48
-0.682,-9.7975,49
-1.4297,-9.7469,50
2.1229,-9.5032,51
-6.7432,-10.3073,52
5.391,-9.6846,53
15.1612,-9.7241,54
35.0565,-9.8431,55
-0.8837,-10.6066,56
8.9762,-9.774,57
-5.1543,-9.9157,58
0.7243,-9.8696,59
5.9551,-9.8869,60
1.5415,-9.8637,61
13.8714,-9.8526,62
0.5375,-9.8605,63
-5.3156,-9.8121,64
3.979,-9.8254,65
41.8462,-10.0919,66
84.5571,-7.8281,67
0.4395,-9.4514,68
9.0029,-6.3154,69
-0.7946,-9.3775,70
1.8884,-10.0328,71
-1.3752,-9.1828,72
3.2493,-10.018,73
3.664,-9.5102,74
0.6219,-9.7078,75
-1.453,-10.0935,76
-1.0483,-9.6485,77
-2.3712,-10.2029,78
11.6442,-9.4106,79
2.4137,-9.8958,80
5.7888,-9.7061,81
1.2022,-10.4496,82
-2.0296,-10.1409,83
4.0438,-9.8653,84
1.2754,-9.7795,85
4.1834,-9.6167,87
8.3759,-10.0152,88
-0.4304,-9.8764,90
8.5724,-9.4613,91
10.7153,-9.3521,93
5.8383,-7.9761,94
2.1272,-9.7034,95
4.7463,-8.4172,96
-7.3833,-8.0725,97
7.7398,-8.8344,98
2.4852,-8.9832,99
-0.1219,-9.1149,100
10.6225,-10.5362,101
-2.6101,-8.4541,102
3.9256,-9.874,103
1.1808,-10.1219,104
1.5672,-10.1603,105
-0.4884,-9.7501,106
0.3377,-10.0337,107
1.2808,-10.1038,108
0.4788,-10.7361,109
4.6043,-9.843,110
-1.8127,-10.3102,111
11.0122,-9.8771,112
-1.151,-10.231,113
7.5497,-9.4922,114
17.475,-10.0464,115
39.1166,-9.7382,116
-1.8338,-10.3727,117
4.8502,-9.6738,118
67.0286,-9.0113,119
1.6418,-9.407,120
2.4974,-9.606,121
9.9281,-9.7687,122
5.2628,-9.4963,123
7.7057,-9.467,124
8.1843,-9.9105,125
1.3881,-10.3743,126
0.9907,-10.2641,127
5.9454,-10.3678,128
6.0967,-9.5486,129
0.811,-9.2802,130
-0.6466,-9.8139,131
-0.3142,-10.0015,132
10.0727,-9.4812,133
20.7085,-10.6765,134
35.9519,-10.931,135
26.7791,-9.6838,136
11.6749,-9.589,137
6.7213,-9.8431,138
2.2696,-9.8923,139
0.7702,-10.1153,140
2.2727,-10.1753,142
-0.5952,-10.0475,143
2.7202,-9.5203,144
15.4986,-9.624,145
-3.19,-10.0225,146
24.7469,-10.2269,147
1.0182,-9.0936,148
0.4453,-10.3416,149
0.6237,-9.9656,150
4.0425,-10.177,151
0.5657,-9.7593,152
9.6606,-9.9037,153
-0.4055,-10.3816,154
1.8679,-9.8658,155
0.0226,-9.9471,156
-0.3919,-9.82,157
0.9355,-9.7152,158
1.0186,-9.7985,159
4.2369,-9.5407,160
-0.8923,-9.698,161
1.1417,-9.2235,162
0.6874,-9.7943,163
2.224,-9.828,164
-0.2573,-9.7738,165
5.1832,-10.9316,166
0.8036,-9.6579,167
-0.3979,-10.2303,168
1.3975,-9.0937,169
3.2395,-10.9792,170
4.392,-9.7706,171
1.9777,-10.4665,172
-6.3931,-9.8254,173
4.5084,-10.0791,174
-0.0866,-9.6996,175
-1.3674,-9.5427,176
8.2059,-9.5992,177
-3.135,-9.5456,179
4.3505,-9.4885,180
0.7041,-9.5158,181
4.0443,-9.3542,182
-9.1163,-9.4543,183
9.8124,-9.2157,184
12.386,-9.4321,185
0.4471,-9.4913,186
-6.8408,-9.665,187
0.2202,-9.6605,188
35.0845,-9.7251,189
13.2343,-9.7145,190
1.2928,-9.9457,191
12.6889,-10.0237,192
-4.5976,-9.8408,193
3.7723,-9.96,194
0.3892,-9.7738,195
0.061,-10.2053,196
0.0897,-10.4055,197
0.7218,-10.0677,198
-0.0283,-10.2054,199
4.0435,-9.1527,200
17.3952,-10.9034,201
11.1846,-9.6685,202
0.662,-9.527,203
0.0592,-9.9773,204
0.2932,-9.9722,205
-0.1486,-9.8109,206
-2.2752,-9.9617,207
1.0141,-10.1972,208
6.8142,-9.561,209
0.4309,-10.2279,210
1.8614,-11.1693,211
1.2886,-10.3687,212
4.3524,-10.944,213
7.5723,-9.7068,214
9.1368,-9.7538,215
15.6403,-10.1372,216
6.2573,-9.962,217
2.4115,-9.9083,218
64.5511,-10.5752,219
15.631,-9.9147,220
7.2432,-9.8784,221
4.995,-9.9252,222
-1.0286,-9.8812,223
-2.2777,-10.0548,224
8.6904,-9.7925,225
-1.3433,-9.8977,226
2.108,-9.8992,227
-0.3476,-9.4488,229
-0.4301,-10.4216,230
0.6935,-10.0119,231
-0.1527,-9.7242,232
2.4266,-9.9269,233
-0.1292,-9.9961,234
-0.0328,-10.0197,235
-0.2273,-9.6993,236
19.956,-9.5247,237
-4.7406,-9.8355,238
2.9773,-9.8829,239
-2.5427,-9.8408,240
5.5462,-9.8232,241
-2.0721,-9.9211,242
-3.9682,-9.8508,243
-2.9593,-9.9347,244
-23.3728,-9.735,245
-7.9719,-9.5994,246
-3.8039,-9.6582,248
-3.4357,-9.6612,249
-3.4439,-9.6603,250
-3.3527,-9.6634,251
-3.3843,-9.66,252
-3.3628,-9.6632,253
-3.3787,-9.6604,254
-3.3703,-9.6604,255
-3.3447,-9.66,256
-3.3626,-9.6619,257
-3.3808,-9.6614,258
-3.3857,-9.6602,259
-3.362,-9.6575,528
-3.3291,-9.6555,529
-3.3376,-9.6567,530
-3.3347,-9.6565,531
-1.0013,-9.6514,532
-12.8469,-9.5848,534
-2.2478,-9.3114,535
19.6095,-9.7213,536
5.4943,-9.7864,537
1.0459,-9.8795,538
0.3531,-9.7983,539
-0.3391,-9.7095,540
-7.0107,-9.6615,541
9.4,-9.8302,542
0.1027,-9.8662,543
-6.5965,-9.9352,544
4.7449,-10.0522,545
-4.4533,-9.8106,546
23.0321,-9.8369,547
1.0968,-9.9515,548
6.2573,-9.834,549
-1.6186,-9.9481,550
0.549,-10.022,551
5.6639,-10.2086,552
19.521,-9.578,553
-0.1164,-9.9592,554
5.4488,-9.8113,555
-0.7779,-9.8982,556
-0.1959,-9.7933,557
1.8742,-9.8622,558
-1.9333,-10.0202,559
7.9539,-9.8428,560
-0.1077,-9.9256,561
-1.2776,-9.9131,562
-14.1039,-10.6073,563
-3.2659,-10.0916,564
-5.2288,-9.8458,565
-7.1663,-9.5476,566
3.2392,-9.6918,567
2.3705,-9.9085,568
1.3264,-9.8515,569
2.5783,-9.9649,570
0.0071,-10.0671,571
-0.9755,-9.8134,572
-1.8884,-10.0338,573
-0.8767,-10.8451,574
0.094,-10.0577,575
1.0559,-10.1373,576
-0.6828,-10.2948,577
-1.5132,-10.1807,579
-0.8844,-9.4985,580
1.2759,-9.8554,581
-4.4944,-10.0651,582
-4.6452,-9.7178,584
3.9813,-9.8659,585
-6.4754,-9.931,586
7.5294,-9.6986,587
2.3397,-9.8962,588
3.719,-9.8253,589
2.3863,-9.9086,590
-3.2225,-9.9101,591
2.7389,-9.841,592
0.0095,-9.8963,593
8.5225,-9.9438,594
-0.0877,-9.7867,595
4.6661,-9.8826,596
1.3723,-9.8383,597
1.0336,-9.8237,598
-4.3724,-10.0435,599
-0.1204,-10.0868,600
7.6329,-9.7504,601
-9.1191,-9.6381,602
0.8035,-9.9429,603
-1.808,-9.9189,604
10.2971,-9.9625,605
-0.7258,-9.9892,606
-1.3164,-9.8811,607
2.4873,-9.8043,608
28.4334,-10.0928,609
0.7657,-9.8395,610
0.2808,-9.897,611
2.9222,-9.925,612
3.6897,-10.3213,613
1.3884,-9.807,614
6.2121,-10.0895,615
3.5367,-9.8969,616
0.604,-9.6858,617
0.7737,-10.1096,618
7.4626,-9.8441,619
1.0572,-9.9247,620
0.6486,-9.9612,621
-0.063,-10.0219,622
-0.0828,-9.3495,623
2.779,-10.1971,624
1.1665,-10.0253,625
-0.2409,-9.9537,626
-3.3361,-9.8812,627
0.2829,-9.8555,628
-8.3793,-9.7778,629
-24.9622,-9.5581,630
0.12,-9.8993,631
0.122,-9.9235,632
-0.0733,-9.9128,633
-0.5875,-9.9193,634
2.8583,-9.8438,635
-0.459,-9.8403,637
2.4066,-9.7937,638
0.3032,-9.9111,641
