AYGX_mean,AZ_mean,timestamp
-0.017,-9.7096,0
-14.1643,-9.6106,1
-20.9501,-8.8792,2
35.486,-9.2829,3
8.572,-9.6302,4
-4.1673,-9.6342,5
-7.7153,-9.6306,6
3.7218,-9.5784,7
2.0498,-9.7747,8
-2.3505,-9.7513,9
0.6486,-9.742,10
1.196,-9.7138,11
-1.8039,-9.7247,13
-2.8734,-9.6838,14
0.2018,-9.701,15
1.1877,-9.761,16
0.4795,-9.738,17
0.1753,-9.7564,18
0.0627,-9.742,19
-0.0997,-9.7382,20
-2.5983,-9.7379,21
0.3545,-9.7304,22
-0.6677,-9.745,24
0.1639,-9.7424,25
0.0489,-9.7367,26
-0.4531,-9.74,27
0.2354,-9.7302,28
0.002,-9.7445,29
-0.1325,-9.748,30
0.1389,-9.7454,32
1.1727,-9.7296,33
-0.1075,-9.7425,34
-0.1812,-9.7428,35
0.4735,-9.7257,36
0.1725,-9.7171,38
-0.3686,-9.7127,39
0.8628,-9.7136,40
0.7251,-9.7233,41
0.3519,-9.7224,42
0.4532,-9.7337,43
-0.4632,-9.7289,44
0.5027,-9.7189,45
0.1708,-9.733,46
0.4931,-9.7224,48
0.0038,-9.7382,49
-0.6242,-9.7345,50
0.8576,-9.7276,51
-0.0319,-9.7422,52
-0.2134,-9.7405,53
-0.189,-9.7284,54
0.214,-9.7273,55
0.3018,-9.7281,56
-0.0194,-9.7309,57
0.6961,-9.7383,58
-0.3388,-9.7384,59
0.0338,-9.7422,60
-0.5729,-9.7399,63
0.3157,-9.7347,64
-6.1187,-9.7043,65
-1.7941,-9.6606,66
-0.519,-9.6669,67
0.3731,-9.6696,68
0.2811,-9.7227,69
-0.625,-9.7268,70
0.8044,-9.7326,72
0.331,-9.7451,73
-0.2696,-9.7515,74
-0.7295,-9.7487,75
-1.474,-9.7393,76
0.5559,-9.7372,77
-0.0202,-9.7456,78
-0.2244,-9.7442,79
-0.4379,-9.7445,80
-0.1654,-9.7461,81
-0.3206,-9.7438,83
-0.2146,-9.743,84
-0.3363,-9.7459,85
0.1472,-9.7465,86
-0.4004,-9.7479,87
0.4047,-9.748,88
0.0273,-9.7585,89
-2.4105,-9.7396,90
-1.3347,-9.7158,91
0.8142,-9.6887,92
-1.6086,-9.6243,93
3.1469,-9.7103,94
-10.3502,-9.6254,95
-0.6064,-9.6587,97
-26.9287,-9.6012,98
2.423,-9.6448,99
2.352,-9.6134,100
-4.6784,-9.7003,101
-1.2616,-9.6087,102
3.6534,-9.6464,104
-0.6748,-9.7251,105
-0.2879,-9.7658,106
2.1035,-9.73,108
-6.9026,-9.7984,109
4.26,-9.6244,110
1.0822,-9.8484,111
0.8525,-9.3947,112
-0.8013,-9.4204,113
2.0926,-9.7845,114
2.9913,-9.6524,115
0.9684,-9.691,116
1.73,-9.638,118
0.7549,-9.7732,119
0.2944,-10.0217,120
-0.0514,-9.6074,121
0.2466,-9.7349,122
-0.052,-9.76,123
0.71,-9.8378,124
-0.2325,-9.5134,125
-0.3449,-9.8598,126
0.6641,-9.7957,128
0.1807,-9.6665,129
-0.4141,-9.7605,130
-0.1978,-9.8145,131
0.0032,-9.7407,132
0.5184,-9.7989,133
-0.343,-9.6905,134
1.513,-9.9128,135
3.0884,-9.6398,136
2.8997,-9.805,137
4.1564,-9.8157,138
0.1658,-9.7716,139
0.4059,-9.7616,140
0.9165,-9.7496,141
0.6227,-9.76,142
0.1241,-9.8143,143
-1.0802,-9.3969,144
3.3578,-9.8944,145
0.3611,-9.765,147
-0.0012,-9.7529,148
0.2978,-9.7834,149
-0.3207,-9.7364,150
1.6852,-9.9075,151
-0.2475,-9.6948,153
-0.3366,-9.656,154
-0.2363,-9.8964,155
0.1645,-9.7457,156
-0.5312,-9.5953,157
2.6096,-9.8903,158
0.3677,-9.2711,159
-0.2164,-9.9562,160
0.0477,-9.6162,162
0.1001,-9.5936,163
0.0199,-9.7712,164
0.6932,-9.8589,165
0.6341,-9.7519,166
0.5923,-9.7522,167
1.2296,-9.7729,168
1.4996,-9.7935,169
0.086,-9.6634,170
5.3057,-9.2005,171
1.5875,-9.9868,172
3.2711,-9.7577,173
-0.0753,-9.9023,174
5.6172,-9.6276,175
5.5517,-9.7443,176
0.679,-9.872,177
0.216,-9.8216,178
0.2562,-9.6989,179
-0.1624,-9.7687,180
-0.2649,-9.7729,181
-0.365,-9.7856,183
3.432,-9.737,184
0.7641,-9.7661,185
0.5141,-9.6312,186
-0.4106,-9.757,187
0.2972,-9.6973,188
-0.6039,-9.8393,189
0.6238,-9.8751,190
2.4233,-9.5653,191
-0.4921,-9.8666,193
0.0108,-9.7672,194
-0.7594,-9.7164,195
-0.7513,-9.7123,196
2.7936,-9.8198,197
-0.006,-9.7338,198
-1.1553,-9.7939,199
0.0554,-9.6779,200
2.1702,-9.8246,201
-0.7995,-9.7909,202
-0.1462,-9.7112,203
0.3931,-9.7926,204
-0.2509,-9.7677,205
1.1068,-9.7842,206
1.8781,-9.7698,207
-1.047,-9.7607,208
-1.4261,-9.6523,209
3.164,-9.6839,210
2.2961,-9.7784,211
5.4666,-9.8202,212
3.2367,-9.7954,213
0.728,-9.7451,214
8.5495,-9.9955,215
-0.0708,-9.6558,216
5.3469,-9.7617,218
2.2548,-9.8285,219
-0.2083,-9.586,220
1.5428,-10.053,221
-0.1984,-9.7457,222
3.3386,-10.2452,223
-1.2012,-9.7499,224
0.9182,-9.7765,225
-0.2227,-9.7904,226
-0.1597,-9.7512,228
0.6315,-9.7457,229
-0.209,-9.6624,230
-0.5638,-9.764,231
0.0232,-9.8019,232
-1.4293,-9.7561,233
0.696,-9.7338,234
0.1667,-9.7781,235
-0.5423,-9.8319,236
0.5818,-9.6954,237
0.4171,-9.734,238
-0.1671,-9.9069,239
0.1577,-9.6359,240
-0.1759,-9.7784,241
-0.0319,-9.7801,242
-0.3895,-9.789,243
-0.6593,-9.6637,244
0.3006,-9.7649,245
1.4694,-9.7433,246
0.269,-9.8971,247
0.2395,-9.6498,248
-0.1702,-9.8293,249
-0.0494,-9.8132,250
0.7741,-9.6707,251
0.0413,-9.7801,253
0.0898,-9.7329,254
0.188,-9.7506,255
-0.2169,-9.76,256
-0.2433,-9.7805,257
0.6796,-9.7857,258
4.9179,-9.7839,259
-0.0103,-9.8269,260
-0.3927,-9.8386,261
0.4492,-9.7449,263
-0.1234,-9.7622,264
0.3228,-9.6606,265
0.0302,-9.5548,266
-0.0,-9.7883,267
0.4938,-9.718,268
0.1804,-9.7652,269
0.5561,-9.7925,270
8.4336,-9.8505,271
2.0189,-9.7786,272
1.6423,-9.7422,273
1.596,-9.7891,274
2.6705,-9.726,275
1.1875,-9.8119,276
0.4825,-9.684,277
0.7025,-9.8656,278
0.5008,-9.7274,279
1.8411,-9.8806,280
-0.2895,-9.6923,281
0.7762,-9.8283,282
0.5274,-9.7572,283
1.0452,-9.8324,284
1.8549,-9.7665,285
0.1636,-9.694,286
-0.1102,-9.8241,288
8.6628,-9.6946,289
5.752,-9.6517,290
0.8746,-9.9736,291
1.188,-9.8105,292
-1.688,-9.6663,293
-0.6141,-9.5667,294
0.5003,-9.7604,295
0.4647,-9.7482,296
0.6161,-9.8147,298
1.4668,-9.6687,299
-0.3786,-9.9085,300
-0.2246,-9.7181,301
1.0468,-9.7368,302
1.0312,-9.7642,303
0.4139,-9.8486,304
0.4072,-9.8278,305
2.2195,-9.7316,306
0.5081,-9.7696,308
0.6566,-9.7019,309
1.6511,-9.9227,310
0.5806,-9.6597,311
0.0356,-9.7755,312
-0.2048,-9.7283,313
0.083,-9.8051,314
0.052,-9.7704,315
0.5952,-9.7708,316
0.1072,-9.7562,317
0.2695,-9.7749,318
-0.3081,-9.5018,319
0.2463,-9.7727,320
-0.1424,-9.7916,321
0.1112,-9.7772,323
-0.3663,-9.7806,324
1.1113,-9.7178,325
-0.09,-9.8003,326
3.4405,-9.7895,327
3.2367,-9.7736,328
1.0134,-9.732,329
0.0405,-9.8619,330
-0.2327,-9.7476,331
2.4323,-9.6711,332
0.8628,-9.7924,333
0.2174,-9.7742,334
1.4618,-9.8019,335
6.0686,-9.7981,336
1.7921,-9.688,337
11.0457,-8.8171,338
0.4083,-10.0129,339
-2.0247,-9.5715,340
0.2974,-9.8415,342
3.0272,-9.6674,343
-0.0432,-9.8143,344
0.1289,-9.756,345
-0.4454,-9.7573,346
-0.2592,-9.8524,347
0.4635,-9.7844,348
-0.1554,-9.6812,349
0.4985,-9.7912,350
-0.0112,-9.7659,351
0.0739,-9.7934,352
0.5719,-9.7112,353
0.1553,-9.7988,354
0.1143,-9.7306,355
0.7075,-9.7204,356
0.2193,-9.794,358
-0.3661,-9.7825,359
0.7553,-9.7366,360
0.7822,-9.714,361
1.7038,-9.868,362
3.1725,-9.7947,363
2.2386,-9.7073,364
0.0637,-9.8104,365
0.0746,-9.8387,366
-0.1985,-9.7508,368
0.1732,-9.5235,369
0.139,-9.6613,370
0.1158,-9.8279,371
0.5297,-9.7952,372
2.2017,-9.856,373
3.4751,-9.8068,374
0.4281,-9.7429,375
0.106,-9.714,376
0.5744,-9.7839,378
-0.5925,-9.7132,379
0.7248,-9.7407,380
1.385,-9.8019,381
0.0226,-9.809,382
-0.3891,-9.8916,383
0.3594,-9.6963,384
-0.3136,-9.7312,385
0.0885,-9.5773,386
1.1355,-9.8072,387
0.2416,-9.7047,388
0.5245,-9.9119,389
-0.0832,-9.6978,390
3.3135,-9.4466,391
-0.0417,-9.7021,393
0.8657,-9.9438,394
0.7172,-9.7133,395
0.586,-9.8382,397
0.5069,-9.8891,398
4.1925,-9.6523,399
0.0675,-9.9373,400
-0.3153,-9.4926,401
0.3522,-9.8261,403
0.9126,-9.6515,404
0.0018,-9.8509,405
-0.2782,-9.8244,406
-0.4498,-9.7769,407
1.6288,-9.7487,408
1.1153,-9.7547,409
0.0518,-9.7939,410
-0.5887,-9.7748,411
-0.0806,-9.7912,412
0.7298,-9.7342,413
2.9567,-9.8532,414
-0.272,-9.693,415
3.3123,-9.8076,416
0.2561,-9.7,417
1.2205,-9.7711,418
0.5318,-9.8209,419
0.2178,-9.7781,420
0.0069,-9.6515,421
0.3032,-9.8118,422
-0.0583,-9.724,423
0.0547,-9.8239,424
-0.0859,-9.688,425
0.5059,-9.7438,426
0.0928,-9.8487,427
-0.0934,-9.7323,428
0.1571,-9.7507,429
-0.039,-9.8274,430
-0.221,-9.7779,432
0.36,-9.7454,433
0.3712,-9.7193,434
0.4324,-9.6103,435
1.0908,-9.7866,436
0.5867,-9.816,438
-0.2888,-9.6912,439
-0.121,-9.7868,440
1.7465,-9.7817,441
-0.1405,-9.7958,442
0.4192,-9.9127,443
0.3441,-9.9639,444
7.325,-9.7222,445
0.9909,-9.7256,446
-0.371,-9.7701,448
5.5256,-10.0954,449
-0.4827,-9.7575,450
0.235,-9.818,451
3.2679,-9.7497,452
-1.3476,-9.7969,453
-0.8308,-9.6611,454
1.0072,-9.9157,455
2.1266,-9.7016,456
2.0731,-9.7477,457
0.3035,-9.78,458
-1.1367,-9.6486,459
0.2878,-9.2835,460
0.0545,-9.8996,461
0.153,-9.5903,462
0.0677,-9.8099,463
-0.9939,-9.7389,464
-0.7164,-9.8307,465
-0.6078,-9.7014,466
-0.3447,-9.7675,468
-0.3668,-9.7065,469
2.3665,-9.6727,470
3.0317,-9.8149,471
3.7026,-9.841,472
-0.9329,-9.4654,473
0.2331,-9.8818,474
-0.0875,-9.7718,475
0.1352,-9.9246,476
-0.8686,-9.6741,478
2.0936,-9.7579,479
4.1698,-9.4598,480
-0.0925,-9.2927,481
-0.7609,-9.2659,482
2.0033,-9.3419,483
0.2096,-9.4925,484
-2.4269,-9.8689,485
1.0563,-9.8504,486
-1.5425,-9.4774,487
-0.685,-9.9969,488
-0.1212,-9.6188,489
-0.0242,-9.5496,490
-0.0618,-9.7534,491
-0.0036,-9.7152,492
0.1448,-9.7883,493
-0.1254,-9.7148,494
-0.4829,-9.8114,495
1.7809,-9.7594,496
2.8641,-9.7821,498
-0.0176,-9.7767,499
2.0554,-9.762,501
-0.2641,-9.7636,502
0.0682,-9.7871,503
0.1852,-9.7184,504
-0.2364,-9.749,505
4.2498,-9.5585,506
-0.078,-9.675,508
-1.1861,-10.1434,509
2.5078,-9.7793,511
-0.7561,-9.7192,512
-0.3297,-9.8138,513
2.1018,-9.8061,514
-0.5834,-9.7616,515
-0.968,-9.6389,516
-0.4093,-9.816,518
0.0989,-9.4349,519
0.0691,-9.7735,520
-0.3393,-9.8094,521
-1.1946,-9.7072,522
0.0328,-9.8056,523
-0.8061,-9.7842,524
-0.0758,-9.6728,525
-0.9506,-9.8164,526
-0.9381,-9.8031,527
0.0126,-9.7083,528
-0.6235,-9.9487,529
-0.2128,-9.7238,530
1.4095,-9.7855,531
-0.6014,-9.7783,532
-1.489,-9.7755,533
1.5329,-9.7672,534
-2.9501,-9.8556,535
-2.0126,-9.7748,536
0.2408,-9.7871,538
-0.7853,-9.7963,539
-0.2602,-9.752,540
0.9316,-9.772,541
-0.4737,-9.7588,542
0.7572,-9.8018,543
-0.4079,-9.7692,544
-0.3165,-9.8078,545
-0.2148,-9.7198,546
-0.2998,-9.7644,548
-0.6025,-9.7468,549
-0.9059,-9.7547,550
0.3489,-9.7245,551
-0.5036,-9.865,552
1.3677,-9.7376,553
-0.2586,-9.7818,554
0.0364,-9.8048,557
-0.0821,-9.6574,558
-0.1672,-9.8121,559
-0.5698,-9.783,560
0.8572,-9.7525,561
0.6114,-9.7891,562
-0.1125,-9.7827,563
-0.4527,-9.7389,564
0.0237,-9.8699,565
0.3705,-9.6366,566
-0.1194,-9.8418,567
-0.5046,-9.7361,568
-0.1603,-9.7695,569
0.59,-9.7938,570
-0.3084,-9.7888,571
-0.0714,-9.7247,573
-0.6036,-9.8004,574
2.2107,-9.7945,575
-0.4972,-9.7806,576
-0.5677,-9.7593,577
0.8016,-9.756,578
0.2004,-9.7101,579
1.0415,-9.7161,580
6.0985,-9.6488,581
2.5731,-9.8198,583
0.1912,-9.8292,584
0.4868,-9.7376,585
-0.4415,-9.7642,586
-0.0024,-9.7839,587
-0.0304,-9.756,588
-0.4499,-9.7487,589
0.5205,-9.7187,590
1.6443,-9.8622,591
0.5997,-9.7647,593
1.8557,-9.7241,594
0.3639,-9.8793,595
1.9189,-9.7215,596
0.5858,-9.7965,597
0.93,-9.7198,598
-0.0923,-9.8417,599
-0.1566,-9.7034,600
1.5886,-9.8164,602
0.0765,-9.6774,603
2.7101,-9.8058,604
-0.7077,-9.7227,605
2.1325,-9.8141,606
0.0027,-9.5234,607
0.7224,-9.7153,608
-1.1234,-9.7951,609
-0.2323,-9.7702,610
-0.2433,-9.7547,611
-0.8777,-9.7444,613
1.2701,-9.8584,614
-0.2132,-9.8385,615
1.0374,-9.7415,616
2.7148,-9.0277,617
6.3968,-9.8481,618
-1.5925,-9.7087,619
2.8148,-10.1789,620
0.4549,-9.775,621
0.0054,-9.7697,623
0.1525,-9.8435,624
-0.1724,-9.7357,625
0.9069,-9.7768,626
-0.0113,-9.8472,627
-0.5824,-9.7069,628
1.6932,-9.8591,629
0.5833,-9.7133,630
0.6516,-9.9179,631
0.0113,-9.6023,632
0.319,-9.808,633
0.1397,-9.6724,634
0.8506,-9.8197,635
2.9375,-9.7651,636
2.484,-9.7677,637
-0.5927,-9.8542,638
0.8716,-9.7474,639
-1.4441,-9.7907,640
-0.1216,-9.9025,641
0.5027,-9.7284,643
-0.2327,-9.8414,644
0.3258,-9.8619,645
0.5312,-9.7156,646
0.3121,-9.7337,647
0.0249,-9.8252,648
0.0517,-9.7393,649
-0.8264,-9.7671,650
-0.1915,-9.7448,652
-0.0001,-9.8059,653
0.7598,-9.7244,654
-0.7163,-9.7959,655
0.3558,-9.7662,656
-0.9038,-9.6711,657
-2.0157,-10.1661,658
-1.1246,-9.5923,659
-0.7511,-9.5895,660
2.7178,-9.8179,661
1.7478,-9.7553,663
1.549,-9.7654,664
0.5355,-9.8227,665
-2.4601,-9.7683,666
-1.8312,-9.5617,667
-0.92,-9.9028,668
0.3842,-9.7671,669
1.5402,-9.7407,670
-0.8674,-9.7844,671
1.0986,-9.7804,672
-0.2392,-9.8275,673
0.5985,-9.711,674
-0.0135,-9.752,675
-0.7952,-9.7643,676
1.1272,-9.869,677
0.049,-9.7313,678
-0.1126,-9.8065,679
-0.403,-9.7051,680
-0.1357,-9.719,681
-0.0627,-9.8215,683
0.5452,-9.6088,684
-0.104,-9.8339,685
1.5288,-9.8315,686
-0.9657,-9.9024,687
1.3211,-9.5697,688
-0.611,-9.8486,689
1.6584,-9.8529,690
2.3562,-9.6899,691
-1.0091,-9.706,692
2.1796,-9.838,693
0.8468,-9.7624,694
-0.4406,-9.842,695
-0.6097,-9.8131,696
1.3809,-9.7336,697
-0.3409,-9.708,698
2.1381,-9.8865,699
3.3046,-9.7242,700
0.7785,-9.8321,701
0.3156,-9.8098,702
0.8752,-9.8394,703
0.6528,-9.501,704
1.2281,-9.7889,705
-0.5582,-9.7801,706
-1.5086,-9.7456,707
0.2706,-9.7469,708
0.0626,-9.7712,709
-0.5319,-9.7642,710
-0.2472,-9.7617,711
0.0613,-9.7647,712
-0.0958,-9.7648,713
-0.1468,-9.768,714
-0.9919,-9.7611,715
-0.2862,-9.7563,717
-0.5562,-9.7586,718
-0.1931,-9.7545,719
-0.0039,-9.7661,720
-0.0804,-9.766,721
-0.2115,-9.7609,722
-0.6009,-9.7643,724
-0.2727,-9.7584,725
-0.0258,-9.7601,726
-0.1144,-9.7616,727
-0.3066,-9.7623,729
-0.1735,-9.7628,730
-0.2148,-9.7617,731
-0.1529,-9.7629,732
-0.3386,-9.7609,733
-0.1099,-9.7632,734
-0.2954,-9.7637,735
-0.164,-9.7656,737
-0.0853,-9.7647,738
-0.188,-9.765,739
-0.4019,-9.7637,740
-0.3832,-9.7577,741
-0.2829,-9.7633,742
-0.1767,-9.762,743
-0.1097,-9.7639,744
-0.3178,-9.7621,745
-0.334,-9.761,746
-0.086,-9.7644,748
-0.5607,-9.7642,749
-0.0459,-9.7621,751
-0.3406,-9.7607,752
-0.55,-9.7666,753
-0.1419,-9.7603,754
-0.3886,-9.7599,755
0.1894,-9.7666,756
-0.5724,-9.7634,758
-0.3588,-9.76,759
-0.8775,-9.7542,760
-0.3988,-9.7491,761
0.5682,-9.7577,762
-3.6538,-9.7455,763
-7.2417,-9.4999,764
1.3199,-9.6929,765
-4.4568,-9.6576,766
-0.448,-9.6583,768
-1.2373,-9.6483,769
0.1431,-9.6585,770
-0.9676,-9.6608,771
-1.1121,-9.6572,772
-0.2767,-9.6602,773
-1.6128,-9.6604,774
-0.9936,-9.6484,775
-0.5498,-9.6496,776
-1.2076,-9.6534,777
-0.1725,-9.651,779
-1.3158,-9.6446,780
-0.1394,-9.6521,781
-2.6807,-9.6352,782
0.9542,-9.629,783
4.4137,-9.6686,784
1.5999,-9.6917,785
-0.6108,-9.6991,786
0.3009,-9.6833,788
2.7566,-9.7444,789
-1.0263,-9.7541,790
0.8975,-9.7548,791
0.0729,-9.7645,792
-0.0146,-9.7647,793
-0.0131,-9.7641,795
-0.0366,-9.7645,797
-0.1181,-9.7625,798
-0.0086,-9.7647,799
-0.1118,-9.755,800
0.0783,-9.7561,801
0.1072,-9.7552,803
0.2219,-9.7558,804
0.1086,-9.7566,805
0.1531,-9.7553,806
0.1472,-9.7575,807
-0.021,-9.7522,808
0.364,-9.7572,809
0.1444,-9.7595,810
0.1778,-9.7606,811
-0.0295,-9.7624,812
-0.1652,-9.7671,813
-0.0328,-9.765,814
-0.2612,-9.754,815
0.3423,-9.7528,816
0.2001,-9.762,817
0.107,-9.7633,818
0.0838,-9.7669,819
-0.0386,-9.7652,821
0.0855,-9.7598,823
-0.1697,-9.7679,824
-0.1005,-9.7679,825
-0.1503,-9.7683,827
-0.2101,-9.7677,828
-0.105,-9.7675,829
-0.1758,-9.7681,830
-0.1179,-9.7664,831
-0.0225,-9.7682,832
0.0265,-9.7678,833
-0.129,-9.7681,834
-0.0483,-9.7689,835
0.156,-9.7682,836
-0.9156,-9.741,838
0.0252,-9.7663,839
0.3069,-9.7627,840
-0.2032,-9.766,841
-0.1248,-9.7645,842
-0.0998,-9.7661,843
-0.3128,-9.7525,844
0.6931,-9.7648,845
0.1222,-9.7615,846
-3.2612,-9.7505,847
-0.8352,-9.7418,848
0.4128,-9.7483,849
0.312,-9.7562,850
0.1872,-9.7632,851
0.0427,-9.764,852
0.1071,-9.7612,853
-0.2027,-9.7612,854
-0.196,-9.7627,855
-1.0066,-9.7287,856
1.1373,-9.7392,857
0.4426,-9.7507,858
0.224,-9.7533,859
0.2567,-9.7531,860
-6.0149,-9.704,861
-2.1995,-9.6409,862
-7.6295,-9.7191,863
9.384,-9.6563,864
-0.6721,-9.7173,865
0.3697,-9.7978,866
-0.387,-9.735,867
-6.7903,-9.6815,868
-1.4468,-9.6044,869
1.2143,-9.7373,870
2.409,-9.6416,871
1.7487,-9.7302,872
-3.4453,-9.6961,873
2.8339,-9.7232,874
1.5285,-9.749,875
-1.7073,-9.7551,876
-4.2566,-9.7344,877
1.9299,-9.736,878
-0.7247,-9.7448,879
-5.1288,-9.6719,880
-14.5713,-9.6778,881
2.5833,-9.6427,882
2.3452,-9.7426,883
3.0211,-9.7423,884
-6.2043,-9.692,885
2.1601,-9.7217,886
-0.6811,-9.7435,887
-2.2066,-9.7343,888
-20.614,-9.6325,890
14.5808,-9.5991,891
-18.6369,-9.5828,892
-17.1115,-9.3421,893
24.477,-9.2241,894
8.6964,-9.6913,895
-1.1057,-9.7712,897
-3.7269,-10.2184,898
-50.1874,-9.1538,899
8.5769,-9.0523,900
13.1504,-9.6569,901
-5.7735,-9.7028,902
1.8133,-9.7437,903
-3.0383,-9.7366,904
-0.1992,-9.743,905
-1.2932,-9.7412,906
-2.7613,-9.7118,907
-0.6767,-9.7103,908
-0.3371,-9.7117,909
2.8609,-9.7278,910
-1.0543,-9.7645,911
-2.8946,-9.7427,912
-0.9124,-9.7604,913
-0.646,-9.78,914
