AYGX_mean,AZ_mean,timestamp
-0.0658,-9.7761,1
-0.0497,-9.7736,2
-10.2218,-9.7009,3
-16.3356,-9.3855,5
1.382,-9.596,6
-5.7489,-9.6459,8
-3.2337,-9.7635,9
-9.1785,-9.6662,10
6.109,-9.4919,11
0.7191,-9.7518,13
0.8157,-9.8106,14
-22.0899,-9.7814,15
16.662,-9.6401,16
0.4222,-9.7203,18
-0.6398,-9.7694,19
-3.7324,-9.7324,20
2.7883,-9.7895,21
1.0485,-9.765,23
3.8749,-9.749,24
-2.2278,-9.7673,25
0.4209,-9.7775,26
5.2729,-9.7857,28
0.6139,-9.1838,29
0.1802,-9.5961,30
12.2333,-9.3533,31
4.1595,-9.9603,33
21.2771,-10.2847,34
7.9965,-9.9168,35
10.3452,-9.7979,36
7.1402,-10.1477,37
-1.4355,-9.8817,38
1.554,-9.8769,39
1.0531,-9.8042,40
18.1493,-9.903,41
-0.0929,-9.8838,42
2.4631,-9.8393,43
-0.2645,-9.8092,44
-1.7897,-9.9247,45
-1.4789,-9.6479,46
-7.8371,-9.5785,47
8.8837,-9.7578,48
7.4758,-9.831,49
3.3555,-10.0969,50
-0.4803,-9.8002,51
2.1863,-9.8495,53
1.7496,-9.4357,54
-6.3302,-10.0069,55
48.1571,-9.5059,56
0.3519,-9.4729,58
-4.3591,-9.7354,59
1.3395,-9.6172,60
4.396,-9.2774,61
0.6385,-9.6517,63
5.3415,-9.4788,64
-0.9011,-9.4002,66
6.8588,-10.0011,67
0.8536,-9.8103,68
-1.1142,-9.9073,69
7.2197,-9.6405,70
-0.0076,-10.0201,71
4.5917,-9.6808,72
0.4002,-10.0117,73
-1.0234,-8.9243,74
2.8125,-9.9144,75
22.5474,-9.9033,76
-1.3695,-9.9167,77
-7.4509,-9.8843,78
3.8455,-8.7524,79
5.4236,-9.7062,80
2.2682,-9.6067,81
2.8319,-10.0045,82
2.4309,-9.8211,83
5.8211,-9.6312,84
-17.5277,-9.8868,85
14.8023,-9.8827,86
-6.2142,-10.2191,87
9.273,-10.0444,88
20.9789,-10.1049,89
5.1547,-9.6105,90
3.2777,-9.7432,91
-0.5283,-9.7527,92
-4.0305,-9.816,93
10.9213,-8.9586,94
11.4802,-10.1818,95
4.0225,-9.6397,96
-3.8923,-9.5923,97
-1.8567,-9.5856,98
-6.4662,-9.4054,99
-2.7818,-9.611,100
1.7477,-9.596,101
6.3156,-9.8174,102
-0.644,-8.8822,103
23.4956,-9.8071,104
14.4297,-9.9643,105
-0.9652,-9.7128,106
1.0334,-9.8408,107
5.3603,-9.807,108
2.7936,-9.7179,109
0.7003,-9.7352,110
-0.9058,-9.3593,111
-1.8612,-9.6869,112
-0.4444,-9.7354,113
-3.9018,-8.5946,114
-0.3276,-9.8148,115
10.3796,-9.6139,116
4.409,-9.6449,117
3.5139,-9.7501,118
-5.4388,-9.6498,119
2.9609,-9.7125,120
2.3247,-9.8201,121
8.8533,-9.6546,122
2.6324,-9.7023,123
-2.7368,-9.6339,124
0.5448,-9.845,125
18.6141,-9.685,126
2.8047,-9.7181,127
0.5954,-9.794,128
0.4822,-9.4768,129
0.7135,-9.8023,130
0.1435,-9.8252,131
-1.5891,-9.7486,133
3.4933,-9.7335,134
3.1161,-9.7648,135
-0.017,-9.7853,136
-0.0992,-9.7843,138
0.0723,-9.7838,139
-0.4352,-9.7813,140
-0.1109,-9.7849,141
-0.126,-9.7853,143
-0.2046,-9.7843,144
-0.0135,-9.7848,145
0.1148,-9.7835,146
-1.2118,-9.7662,148
-2.4313,-9.7741,149
1.4276,-9.7886,150
-0.4347,-9.7809,151
2.1515,-9.7714,152
3.7755,-9.7771,154
-1.9066,-9.7493,155
-0.6926,-9.7249,156
-2.3007,-9.6792,157
0.6099,-9.6739,158
11.3348,-9.7251,159
0.8578,-9.7795,160
-25.7985,-9.7778,161
16.5385,-9.8785,163
-0.9004,-9.7259,164
1.8,-9.8883,165
5.0276,-9.7331,166
-4.5309,-9.69,167
2.2077,-9.7401,168
8.0032,-9.77,169
-2.185,-9.7787,170
10.3307,-9.4245,171
-7.4607,-10.0503,172
25.6333,-9.4722,174
3.9018,-9.7915,175
0.5077,-9.9874,176
-2.3008,-9.6647,177
1.9227,-9.8875,178
0.6922,-10.0832,180
-0.2567,-10.04,181
0.5654,-9.6626,183
0.3369,-10.3117,184
1.5954,-9.6098,185
3.3531,-10.1059,186
-1.7918,-9.9138,188
-0.1387,-9.9209,189
2.0201,-9.8511,190
1.3224,-9.6051,191
10.132,-9.9944,193
1.8297,-9.4597,194
1.2157,-9.6717,195
0.6999,-9.6157,196
2.4961,-9.8066,198
14.8545,-10.1276,199
3.4628,-9.4596,200
-1.5604,-8.8002,201
6.8861,-9.0051,203
-1.2817,-9.8022,204
4.3583,-9.4619,205
-1.1205,-9.7956,206
16.444,-9.8058,208
14.5916,-9.7793,209
-45.3693,-10.5666,210
59.359,-9.0287,211
3.4248,-9.5419,213
2.3161,-9.477,214
2.8743,-9.5933,215
4.7496,-9.8984,216
1.3238,-8.8312,218
1.7926,-9.5052,219
-0.0271,-9.6332,220
0.1522,-10.1715,221
1.7834,-9.8937,223
-0.171,-9.7489,224
7.2767,-9.2777,225
1.976,-10.0057,226
-0.3365,-9.7423,227
0.5146,-9.7124,228
10.2284,-9.4317,229
6.1618,-10.268,230
8.443,-10.4031,231
2.7935,-9.5055,232
4.9219,-9.7273,233
0.535,-9.86,234
0.1829,-9.7644,235
6.2812,-9.8215,236
6.2729,-10.0047,237
1.2193,-9.4515,238
2.2021,-9.5663,239
7.0019,-9.5554,240
5.8486,-9.63,241
-0.2037,-9.7345,243
0.0376,-9.8393,244
-6.6297,-9.7629,245
-4.296,-9.7329,246
-2.1354,-9.5767,248
-1.3386,-9.7392,249
3.3842,-9.2832,250
1.3984,-9.9204,251
2.817,-9.5997,253
8.0803,-9.7145,254
-1.5499,-9.6578,255
-5.267,-9.8266,256
-0.2444,-9.6101,258
-2.8953,-10.1099,259
-0.4032,-9.4445,260
-6.4701,-9.6341,261
-6.6844,-10.002,263
6.1679,-9.7459,264
0.3899,-8.5078,265
-1.9346,-9.8031,266
13.5756,-10.0309,268
-3.6152,-9.9621,269
-0.2642,-9.8833,270
38.8898,-9.4005,271
1.5511,-9.651,273
2.0592,-9.8006,274
2.1331,-9.5804,275
0.9889,-9.6236,276
4.7227,-9.8755,278
-0.714,-9.7685,279
6.1135,-9.7803,280
2.028,-9.7332,281
1.8868,-9.7228,283
9.12,-9.7567,284
11.0118,-9.5615,285
3.3785,-9.7186,286
8.0129,-9.7349,287
7.6387,-9.7988,288
2.1755,-9.7764,289
0.3806,-9.6785,290
3.7635,-9.7008,291
-6.2159,-9.7406,292
-4.2657,-9.7258,293
-0.8919,-9.9288,294
2.8904,-9.613,295
2.5136,-9.7789,296
-8.7981,-9.6096,297
9.9584,-9.8406,298
10.1256,-9.7581,299
5.7895,-9.9392,300
-2.3568,-9.3526,302
-1.0377,-10.0238,303
4.2924,-9.7964,304
0.4107,-8.9991,305
-6.6115,-8.1204,306
3.1832,-9.8686,308
3.4921,-9.5565,309
3.6015,-7.3919,310
-2.335,-9.7636,311
0.5743,-9.1794,313
4.8922,-8.573,314
2.0567,-9.8574,315
0.9344,-9.6163,316
-0.9877,-9.8832,318
-10.3073,-9.9968,319
-0.3325,-9.6859,320
1.5623,-9.6834,321
2.5579,-11.018,323
1.9529,-10.3396,324
-8.6187,-11.0456,325
4.403,-9.7155,326
-8.8042,-9.7907,328
-1.1129,-10.0416,329
16.174,-10.912,330
29.4507,-9.614,331
-4.6849,-9.7013,333
-0.2511,-10.0859,334
0.5341,-8.9919,335
8.7237,-9.1333,336
12.9354,-8.3152,338
-7.6665,-9.7565,339
-0.5071,-9.1449,340
-4.3715,-8.0856,341
4.4261,-8.7331,343
-10.9591,-9.8,344
4.4489,-9.6846,345
1.1265,-8.7675,346
13.8545,-10.109,348
12.8002,-9.9998,349
8.9297,-10.06,350
8.8078,-9.6151,351
2.1951,-10.3856,352
2.0888,-9.6408,353
6.5664,-9.3393,354
4.6006,-10.3993,355
8.8934,-10.018,356
7.9151,-10.845,357
7.9143,-10.2096,358
19.6339,-5.8602,359
13.0159,-9.5683,360
-9.8389,-7.6521,361
81.001,-7.0321,362
17.0536,-8.5251,363
3.0678,-8.7126,364
4.7347,-8.7481,365
5.2854,-8.7417,366
-0.2568,-8.6869,368
88.517,-8.7689,369
-0.2737,-9.7394,370
-4.5823,-9.6634,371
1.011,-8.6284,372
1.5144,-9.7131,374
-5.2696,-9.6965,375
1.1178,-9.7703,376
-0.6152,-9.7854,377
-0.02,-9.7681,378
-0.3086,-9.7867,379
-1.0918,-9.7864,380
-0.5525,-9.7823,381
0.8507,-9.7795,383
-2.585,-9.8107,384
4.2953,-9.7126,385
-2.2578,-9.7302,386
-0.0071,-9.7486,388
-5.8471,-9.6915,389
16.4434,-9.5471,390
1.0632,-9.6774,391
1.4663,-9.7415,393
0.1706,-9.7674,394
0.8116,-9.7737,395
0.6893,-9.779,396
1.4709,-9.7678,398
-1.4543,-9.7396,399
-3.2735,-9.7391,400
0.3304,-9.7536,401
-1.5411,-9.793,402
-3.5225,-9.7926,403
-6.7402,-9.6752,405
-3.6257,-9.8115,406
7.4056,-9.7462,407
7.8126,-9.7772,408
2.3573,-9.7681,409
-5.7681,-9.8974,410
1.1941,-9.7734,411
-4.0003,-9.699,412
24.3388,-9.8059,413
4.4173,-9.8718,414
15.6378,-9.62,415
0.4679,-9.826,416
-1.5752,-9.7518,417
-0.9416,-9.7123,418
-2.2206,-9.7682,419
-1.0814,-9.5875,420
20.0013,-9.824,421
-11.8911,-9.5386,422
3.2253,-9.7461,423
2.3308,-9.7489,424
4.0016,-9.7663,425
-2.0779,-9.7579,426
-1.3856,-9.7177,428
1.883,-9.6941,429
-0.648,-9.3128,430
-0.8588,-9.7244,431
3.4317,-9.7442,433
10.3997,-9.684,434
-2.4374,-9.7902,435
-1.2982,-9.7299,436
-1.781,-9.7384,438
0.6304,-9.9111,439
7.7195,-10.2537,440
9.4877,-10.0793,441
0.9056,-9.883,443
6.6656,-9.8563,444
7.021,-9.7371,445
1.9742,-9.6088,446
4.8256,-9.7978,448
1.8581,-9.8168,449
11.4497,-9.2098,450
0.9563,-9.729,451
0.1849,-9.7473,453
0.6369,-9.7978,454
-6.6469,-9.7888,455
-2.8496,-9.8286,456
11.7943,-9.5879,458
1.1111,-9.8756,459
-7.8285,-10.1328,460
9.8357,-9.5328,461
-2.4431,-9.4364,463
1.5057,-9.7979,464
-0.0116,-9.4099,465
15.4747,-9.9394,466
-2.9975,-9.8871,468
-0.2027,-9.68,469
4.8986,-10.3862,470
0.5181,-10.5584,471
5.8217,-10.4012,472
-6.5438,-10.4723,474
14.1356,-10.0101,475
-11.2654,-9.7439,476
27.7254,-10.3774,478
5.4994,-10.3872,479
19.4758,-9.149,480
-9.8162,-9.615,481
-0.1154,-9.6112,482
2.5794,-7.7707,483
11.452,-9.2456,484
-0.8332,-9.9644,485
2.5257,-9.6496,486
-5.0167,-8.8272,488
4.0742,-7.9378,489
-0.2738,-9.987,490
-1.4764,-7.1559,491
6.98,-9.8504,493
6.8387,-9.4904,494
6.3002,-10.7827,495
13.6549,-9.8169,496
-1.0249,-10.2853,498
5.7003,-9.0793,499
2.7602,-9.4673,500
0.0103,-9.7168,501
9.7037,-10.108,503
6.0922,-11.6647,504
5.4438,-10.3318,505
-1.7025,-9.1171,506
8.8869,-9.7823,508
-1.2018,-10.0731,509
19.8925,-10.0728,510
-31.5344,-7.9776,511
15.255,-9.5243,513
-12.9222,-6.8138,514
-3.2678,-9.2343,515
12.4243,-9.6976,516
-4.0774,-8.1593,518
-16.0294,-9.2413,519
-9.6758,-9.3272,520
4.0873,-8.0884,521
1.2715,-8.7063,523
0.1644,-9.4969,524
2.7385,-10.9143,525
0.1134,-9.6646,526
1.0051,-10.1448,528
0.6542,-9.9091,529
14.2153,-10.0172,530
-8.3199,-9.6256,531
7.9519,-9.7983,533
17.8083,-9.4813,534
-21.6581,-9.9299,535
8.9542,-9.8135,536
-18.4768,-10.047,537
10.0058,-9.6952,538
-2.9498,-9.2399,539
-1.8205,-9.8753,540
-15.0451,-9.6654,541
-2.3314,-6.3634,542
6.3468,-9.4328,543
12.3715,-9.8412,544
35.5064,-7.2599,545
7.6925,-9.4728,546
6.2588,-9.779,547
-0.2695,-9.835,548
1.2771,-9.4111,549
-2.763,-9.6314,550
1.5219,-9.8083,551
4.6808,-9.8195,553
0.6093,-9.7952,554
2.5048,-10.2798,555
0.1799,-9.7772,556
3.572,-9.4672,558
1.612,-9.6839,559
3.2409,-9.9068,560
3.1207,-9.7728,561
18.5205,-9.9993,563
-6.0185,-9.784,564
24.8119,-10.1987,565
-3.8032,-10.089,566
7.7049,-9.8156,568
0.8092,-9.7978,569
10.8258,-9.6807,570
-2.984,-9.8271,571
-0.7679,-9.9067,573
5.3781,-9.4224,574
2.0714,-9.7581,575
20.3383,-9.9641,576
10.1671,-9.8831,578
6.0844,-10.0861,579
-2.1713,-9.9377,580
-0.1908,-9.9147,581
5.9216,-9.8951,583
-2.509,-9.677,584
2.7419,-8.4253,585
4.4798,-10.0032,586
14.0614,-9.7307,588
22.1912,-9.8226,589
1.1308,-9.9128,590
0.9911,-9.7292,591
3.1794,-9.7732,593
-0.3777,-9.9062,594
-2.6326,-9.8596,595
2.7887,-9.7765,596
1.6711,-9.8574,597
-0.345,-9.8253,598
2.8212,-9.8848,599
8.6225,-9.7946,600
2.8188,-9.567,601
27.1608,-10.7807,602
-2.1213,-9.8246,604
7.3,-10.0013,605
6.4429,-9.1937,606
8.4672,-9.6424,607
0.9593,-9.6106,608
2.6209,-9.7784,609
-0.8277,-9.662,610
0.8777,-9.8504,611
21.5322,-9.8346,613
4.085,-9.8022,614
7.1692,-9.2674,615
1.948,-9.9286,616
-0.5676,-9.78,618
6.5831,-9.7762,619
0.6962,-9.8349,620
-0.2029,-9.7866,621
0.5874,-9.7642,623
0.5384,-9.7826,624
-0.1554,-9.7756,625
2.3303,-9.7667,626
0.1121,-9.786,628
0.3657,-9.786,629
0.1243,-9.7848,630
0.2385,-9.7856,631
0.2625,-9.7853,633
0.3813,-9.7851,634
0.4423,-9.7854,635
0.494,-9.7847,636
0.0567,-9.788,638
-0.0205,-9.787,639
-0.0239,-9.7887,640
0.1561,-9.7865,641
0.2952,-9.7858,643
0.0701,-9.7877,644
0.0684,-9.7854,645
-0.0467,-9.7874,646
0.1127,-9.7873,648
0.1923,-9.7866,649
0.1692,-9.785,650
0.1037,-9.7856,651
0.2868,-9.7856,653
0.0704,-9.7837,654
0.9358,-9.7788,655
0.0856,-9.7843,656
0.3309,-9.7719,657
0.2214,-9.7803,658
4.2439,-9.7809,659
-0.62,-9.7782,660
-8.2187,-9.6926,661
-8.6085,-9.7438,662
-1.7234,-9.7214,663
-1.3898,-9.7271,664
-2.6495,-9.7235,665
2.7754,-9.6991,666
0.3011,-9.7062,667
-0.5799,-9.7664,668
-0.4979,-9.7895,669
-0.1348,-9.7883,670
-0.9286,-9.775,671
-0.1474,-9.7983,672
-0.0553,-9.7794,673
-1.0386,-9.7849,674
-0.7582,-9.7694,675
-0.9988,-9.7715,676
-0.1923,-9.7919,678
-0.1437,-9.7856,679
0.1436,-9.7815,680
0.0953,-9.7827,681
-2.0514,-9.7689,683
-0.4847,-9.7118,684
0.1693,-9.7556,685
3.9846,-9.7369,686
-2.3409,-9.7219,688
4.383,-9.8014,689
2.6292,-9.74,690
0.4192,-9.8092,691
0.6398,-9.7691,692
-2.856,-9.7502,694
1.0521,-9.7668,695
1.9859,-9.8389,696
-0.4527,-9.7477,697
6.4888,-9.7338,698
0.1256,-9.7899,699
1.6068,-10.039,700
3.8589,-9.8735,701
-1.6222,-9.8741,703
9.7685,-9.8361,704
25.8388,-9.7833,705
12.7673,-9.9266,706
-0.8383,-9.8285,708
0.0282,-9.8242,709
-3.0853,-9.7487,710
2.7372,-9.8679,711
10.8006,-9.7236,713
-5.8355,-9.8483,714
-1.0537,-9.2763,715
6.6351,-9.7222,716
3.569,-9.3641,717
9.0473,-10.0182,718
7.2783,-9.8396,719
40.6216,-9.7063,720
4.6876,-10.0183,721
2.3644,-9.5818,722
2.1916,-9.7181,723
15.6713,-9.7576,724
14.4788,-9.8138,725
-1.1435,-9.8491,726
-4.8563,-9.9421,727
19.4544,-9.5805,729
-0.2696,-9.9241,730
1.9353,-10.0009,731
2.6369,-9.3979,732
6.8171,-9.9932,733
4.0065,-10.0102,734
39.7475,-9.8835,735
1.8655,-9.784,736
11.6255,-9.8841,738
-1.7457,-9.6916,739
-3.5076,-10.1112,740
10.2637,-9.8208,741
9.2516,-9.7428,743
19.7712,-9.5353,744
0.6158,-9.8595,745
3.0556,-9.8396,746
19.3163,-9.7958,748
0.0499,-9.6338,749
4.5334,-9.8828,750
4.1509,-9.6889,751
-0.712,-9.7453,753
9.4504,-10.1169,754
-7.4301,-9.489,755
18.5395,-9.7431,756
5.6527,-8.7749,758
-5.926,-9.3244,759
-7.8243,-9.4621,760
2.6056,-9.2728,761
6.3424,-9.7829,763
-5.1569,-10.0977,764
-11.2827,-9.8014,765
25.7547,-9.1832,766
-5.8006,-9.8797,768
-7.7511,-9.7381,769
0.1437,-10.0719,770
9.2401,-9.6712,771
4.1163,-9.6393,772
20.6852,-10.0985,773
3.8073,-9.8705,774
-15.9818,-9.9174,775
20.1631,-9.7761,776
11.4442,-9.7624,777
12.0435,-9.8984,778
46.5611,-10.1073,779
-6.9518,-9.8768,780
5.7996,-9.7302,781
26.2704,-9.8624,782
55.4863,-9.7238,783
22.778,-10.0448,784
22.1108,-9.9202,785
9.3845,-9.8625,787
3.3425,-9.7939,788
11.6771,-9.8972,789
-2.007,-9.7284,790
15.1478,-10.0879,791
-2.2322,-9.7479,792
3.069,-9.9044,793
2.0936,-9.7656,794
0.58,-9.7914,795
2.832,-9.7182,796
3.3236,-9.7719,797
0.2443,-9.8649,798
6.328,-9.8485,799
1.1799,-9.8673,800
4.9509,-9.9257,801
6.6335,-9.9513,802
10.3406,-9.8145,803
-0.3191,-9.8079,804
-3.659,-9.7882,806
5.233,-9.7849,807
21.5687,-9.9776,808
8.2623,-10.2291,809
2.2133,-9.7328,810
1.441,-9.8501,811
16.1923,-9.7145,812
2.9421,-9.5906,813
35.1807,-9.537,814
9.0736,-9.7832,816
8.4252,-9.7972,817
24.0534,-9.803,818
18.1257,-9.698,819
-0.0884,-9.7551,820
10.5555,-9.7719,821
-6.1199,-10.0,822
8.9748,-9.6741,823
30.2273,-10.0292,824
-1.0905,-9.7912,825
8.6199,-9.8169,827
2.2222,-9.8126,828
-2.1424,-10.1206,829
-1.6008,-9.5448,830
-1.0513,-9.8554,831
47.2531,-9.6342,832
20.893,-9.6306,833
16.7458,-9.6603,834
1.9442,-9.83,835
-4.0514,-9.8077,836
0.459,-9.7943,837
-1.3649,-9.9066,838
13.4473,-9.8991,839
28.8994,-9.7448,840
8.3044,-9.6556,841
1.1281,-9.7251,842
-7.366,-9.8276,843
1.4791,-9.7021,844
0.4942,-9.809,845
4.7753,-9.8207,847
14.9362,-9.8607,848
-0.5105,-9.789,849
6.2817,-9.7643,850
17.0347,-9.7902,851
1.0336,-9.7633,852
-18.5345,-10.5839,853
20.4294,-9.857,854
-1.6714,-9.8378,855
4.2051,-9.77,856
9.3031,-9.7696,857
0.9605,-9.9011,858
-0.179,-9.8267,859
3.7891,-10.023,860
-1.5584,-9.8351,861
3.9935,-10.7139,862
14.5039,-9.6827,863
63.9656,-9.8669,864
31.1005,-9.8642,866
5.3924,-9.7812,867
-1.0524,-9.6813,868
2.2092,-9.5781,869
15.1705,-9.5866,870
-0.686,-9.812,871
11.3413,-9.7373,872
12.8859,-9.9487,873
8.619,-9.8186,874
5.6637,-9.8027,876
9.5034,-9.79,877
13.5017,-9.8678,878
3.7451,-9.7057,879
0.2529,-9.6902,880
8.9903,-9.8451,881
1.8107,-9.8739,882
-0.7687,-9.8118,883
-3.0465,-9.6844,885
5.8136,-9.8079,887
21.1471,-9.6937,888
10.9556,-9.9591,889
2.8947,-9.7743,890
11.3457,-9.7788,891
10.4058,-9.7726,892
-0.405,-9.8956,893
8.7588,-9.7174,894
-2.0257,-9.7322,895
2.5549,-9.8354,896
12.4451,-9.8193,897
6.8836,-9.7419,898
-4.6278,-9.8826,899
12.4416,-9.7587,900
2.9115,-9.8428,901
0.8264,-9.894,902
1.0992,-9.9178,903
21.1712,-9.8311,904
-0.4818,-9.9378,905
14.6738,-9.8848,907
3.7124,-9.816,908
-1.4327,-9.9261,909
-2.4005,-9.8817,910
2.362,-9.8216,911
3.0663,-9.9474,912
0.1456,-9.7833,913
1.6881,-9.9139,914
-5.5673,-9.9088,915
1.1608,-9.8498,916
1.2565,-9.7775,917
-0.0734,-9.6968,918
5.5153,-9.8497,919
9.0184,-9.8158,920
1.0963,-9.6734,921
14.9729,-9.8391,922
11.1236,-9.7299,923
40.0293,-9.5123,924
8.3628,-10.0298,926
17.7861,-9.8516,927
-7.3167,-9.894,928
24.8792,-9.7458,929
0.3695,-9.7671,930
2.1989,-9.6172,931
-1.4492,-9.7891,932
-1.6545,-9.6884,933
0.776,-9.7441,934
1.5176,-9.794,936
0.9203,-9.8248,937
3.6024,-9.8196,938
1.0059,-9.8515,939
-0.3034,-8.8903,940
9.2294,-10.0003,941
27.5666,-9.5789,942
-27.591,-8.7994,943
15.0828,-9.8529,944
4.95,-9.4772,945
0.8798,-9.7786,947
-0.2154,-9.7445,948
-4.6941,-9.8122,949
-2.9421,-9.809,950
-4.5307,-9.7275,951
-0.7539,-8.7457,953
1.3877,-8.6473,954
18.2965,-9.88,955
4.3465,-9.6524,956
0.6426,-9.7811,957
0.1352,-10.1225,959
45.7504,-10.7213,960
1.9131,-9.5956,961
11.3451,-10.0859,962
-1.5838,-9.7608,963
-0.5569,-9.6596,964
-0.8962,-9.6898,965
6.8877,-9.7119,967
-1.5774,-9.7653,968
2.4868,-10.3418,969
-4.3793,-9.9172,970
-1.1048,-9.7427,971
7.2828,-9.6986,972
28.8932,-9.7865,974
1.1827,-9.7669,975
8.966,-9.7881,976
-0.8497,-9.6866,977
-5.2345,-9.6471,978
1.0994,-9.6972,979
16.988,-9.7106,980
30.7988,-10.3131,981
12.0841,-9.7996,982
2.3941,-9.7277,983
7.101,-9.8471,984
21.2027,-9.7397,986
3.7069,-9.6844,988
5.376,-9.7626,989
-1.1555,-10.0045,990
-2.4679,-9.6766,991
2.0154,-9.8545,993
-0.8652,-9.7353,994
5.1941,-9.5075,995
0.7622,-9.7994,996
5.5803,-9.9124,998
1.5788,-9.7634,999
2.4609,-9.4617,1000
5.523,-9.7032,1001
6.8217,-9.6434,1003
12.1254,-9.9427,1004
67.019,-9.5143,1005
3.0323,-9.5127,1006
27.9741,-9.8278,1008
11.137,-9.0781,1009
24.2226,-9.7921,1010
-3.6482,-9.9842,1011
26.5989,-10.0969,1013
12.6021,-9.6765,1014
13.4534,-10.1094,1015
12.9064,-9.4814,1016
11.4349,-8.814,1017
34.4452,-9.8125,1018
22.0355,-9.7986,1019
7.6381,-9.9403,1020
7.5145,-9.7686,1021
19.564,-10.0068,1023
5.4714,-9.7276,1024
7.031,-9.6847,1025
0.3942,-9.7249,1026
-0.1105,-9.7885,1028
6.3063,-9.7835,1029
2.4086,-9.7393,1030
26.0915,-10.5725,1031
11.7292,-9.7859,1032
7.3555,-9.8326,1033
12.797,-9.8393,1034
4.8916,-10.0387,1035
5.5821,-9.958,1036
16.1941,-10.0675,1037
5.9649,-9.8755,1038
-3.5985,-9.7812,1039
0.4815,-9.9009,1040
-6.8866,-9.808,1041
-12.0272,-9.7855,1042
-0.213,-10.1191,1043
0.0691,-9.9685,1044
4.3754,-9.9636,1045
17.2287,-9.8894,1046
4.4785,-9.7661,1048
0.5062,-9.9079,1049
12.4931,-10.361,1050
2.38,-9.4089,1051
7.0216,-9.7632,1053
-2.1631,-9.7936,1054
-3.6135,-8.8178,1055
4.5908,-9.8261,1056
7.8597,-9.7239,1058
2.3705,-10.0137,1059
3.2427,-9.7408,1060
5.4067,-10.0369,1061
10.2263,-9.7405,1063
-7.7331,-10.487,1064
0.7817,-9.7996,1066
-1.2763,-9.669,1067
12.4526,-9.8374,1068
14.2428,-8.7561,1069
15.5712,-9.7792,1070
19.5464,-9.7933,1071
6.1962,-9.648,1073
3.2642,-9.54,1074
10.0038,-9.7576,1075
2.3579,-9.3237,1076
-6.0326,-9.5144,1077
1.093,-10.0015,1078
9.7733,-10.2535,1079
-58.1976,-9.3915,1080
122.424,-9.2578,1081
10.9146,-9.7647,1083
1.1801,-9.7731,1084
5.8567,-9.8198,1085
0.3892,-9.6495,1086
6.0933,-9.9211,1088
-1.8808,-9.8799,1089
-1.768,-10.0641,1090
-5.2484,-9.4652,1091
2.7864,-9.6222,1092
-3.2539,-9.7992,1093
22.8533,-9.7188,1094
12.2111,-9.8192,1095
30.2145,-9.9585,1096
2.8946,-10.1207,1097
19.9698,-9.8571,1098
-1.6433,-9.7902,1099
-7.4013,-9.6626,1100
3.8036,-9.7831,1101
30.8051,-9.8212,1102
10.1548,-9.7771,1103
7.872,-9.8373,1104
25.3607,-9.3161,1105
3.5278,-9.8609,1106
30.7123,-9.8119,1108
6.1712,-10.0027,1109
-2.7781,-9.8967,1110
7.5303,-9.7362,1111
11.4562,-9.9111,1113
36.739,-9.763,1114
96.4718,-9.2482,1115
4.4695,-9.8039,1116
4.9412,-9.8036,1118
1.7377,-9.7521,1119
4.5933,-9.8494,1120
10.8371,-9.9152,1121
14.2676,-9.8194,1123
3.0405,-9.7818,1124
1.901,-9.7257,1126
13.5422,-9.7977,1128
4.4,-9.7514,1129
-1.757,-9.979,1130
-6.0353,-9.8409,1131
12.348,-9.785,1133
0.3737,-9.725,1134
-0.177,-9.7554,1135
5.0327,-9.7956,1136
1.6463,-9.8712,1138
0.1569,-9.715,1139
3.585,-9.8312,1140
1.3089,-9.784,1141
6.4418,-9.817,1143
1.6409,-9.7762,1144
0.8888,-9.1528,1145
5.9371,-9.757,1146
2.5781,-9.9098,1148
-4.1798,-9.5548,1149
4.1498,-9.6148,1150
-6.7225,-9.8747,1151
-27.785,-10.2017,1152
0.2602,-9.3879,1153
-5.4306,-9.9145,1154
41.1613,-10.5059,1155
-18.1183,-9.7874,1156
-8.3826,-10.0106,1157
6.5874,-9.8569,1158
5.0568,-9.7334,1159
6.6917,-10.1299,1160
-0.6473,-9.4762,1161
-0.073,-9.9674,1162
-0.3879,-10.1793,1163
4.3541,-10.1326,1164
11.8304,-9.4415,1165
12.2946,-9.89,1166
3.019,-9.7813,1168
2.0955,-9.5497,1169
-0.0467,-9.678,1170
1.5329,-10.4281,1171
7.0416,-10.544,1173
7.3171,-9.7671,1174
27.4534,-11.0862,1175
-2.5148,-9.761,1176
60.8092,-9.771,1178
-3.7468,-10.2138,1179
12.3267,-9.892,1180
-0.9591,-9.8982,1181
17.6674,-9.8909,1183
-0.2727,-9.7229,1184
6.1859,-9.7407,1185
0.6948,-9.6125,1186
14.4906,-9.8074,1188
1.8881,-10.1231,1189
2.0647,-9.7673,1190
13.411,-9.8299,1191
3.802,-9.7662,1193
1.7123,-9.9086,1194
10.4919,-9.7043,1195
0.403,-9.8594,1196
1.9162,-9.7684,1198
0.9353,-9.9465,1199
4.4159,-9.4834,1200
4.1073,-9.724,1201
-0.183,-9.7106,1203
-0.4413,-9.8176,1204
-0.1075,-9.7793,1205
1.7516,-9.8415,1206
3.8867,-9.7755,1207
1.1899,-9.7441,1208
-0.2899,-9.7213,1209
6.9618,-9.8575,1210
3.4898,-9.7386,1211
1.0056,-9.9135,1213
12.3042,-9.8372,1214
3.7561,-10.1796,1215
3.9173,-9.8132,1216
1.3744,-9.7137,1217
-2.0251,-9.8076,1218
-0.0249,-9.7394,1219
15.688,-10.049,1220
17.4642,-9.6605,1221
11.2039,-9.714,1222
36.5348,-10.0989,1223
19.4159,-10.0041,1224
4.0025,-9.6691,1225
-0.8959,-9.6133,1226
20.9438,-9.8897,1227
2.9471,-9.702,1228
37.9623,-10.0689,1229
21.2797,-9.706,1230
8.2223,-9.632,1231
6.178,-9.776,1233
2.6969,-10.0669,1234
0.7367,-9.8607,1235
1.052,-8.6856,1236
-0.7309,-9.8766,1238
0.6034,-9.6296,1239
5.1777,-9.7831,1240
1.5751,-9.8436,1241
9.4059,-9.7161,1243
-1.8455,-9.766,1244
-0.9132,-10.4778,1245
1.8694,-10.1125,1246
0.186,-9.813,1248
-0.2348,-9.7225,1249
-0.2451,-10.1198,1250
-0.1238,-9.8021,1251
-0.8659,-9.8833,1253
-1.1146,-9.84,1254
-0.0098,-9.6044,1255
3.8483,-9.7907,1256
12.4812,-9.6381,1258
0.5826,-9.9411,1259
-0.4707,-9.821,1260
10.7158,-10.3226,1261
13.4581,-10.0366,1263
6.3627,-9.8951,1264
1.1798,-9.4886,1265
6.8326,-9.9758,1266
1.7111,-9.7216,1268
3.5861,-10.0839,1269
7.4924,-10.1478,1270
4.4471,-9.4227,1271
0.1795,-9.9747,1273
-1.0282,-9.7214,1274
-0.216,-9.6321,1275
0.1128,-9.6578,1276
5.902,-9.7113,1277
1.0662,-9.7758,1278
0.1781,-9.7948,1279
1.2712,-10.0363,1280
12.7369,-9.4132,1281
1.8793,-9.911,1282
1.1717,-9.8164,1283
2.4068,-9.6976,1284
2.2409,-9.9391,1285
0.5584,-9.8859,1286
-0.0157,-10.1643,1287
21.7285,-9.537,1288
17.9969,-8.783,1289
72.318,-9.4588,1290
4.5782,-6.007,1291
1.4049,-9.835,1293
19.2285,-9.5667,1294
-0.475,-9.5013,1295
49.7601,-9.3933,1296
9.3822,-9.8996,1298
0.011,-10.0641,1299
0.0552,-10.0699,1300
22.3877,-9.5504,1301
2.3201,-9.7574,1303
1.5068,-9.8305,1304
14.8979,-9.6985,1306
1.9039,-9.8173,1308
1.8066,-9.6841,1309
0.2756,-9.6254,1310
1.2518,-9.8125,1311
1.5256,-9.7623,1313
2.17,-9.8424,1314
9.7187,-9.6686,1315
5.9924,-9.7175,1316
4.3023,-9.9412,1317
2.2694,-9.6104,1318
-0.4866,-9.8843,1319
-0.0694,-10.5087,1320
0.709,-10.0805,1321
3.4179,-10.7454,1323
33.8874,-8.9681,1324
55.2885,-11.0868,1325
10.0098,-9.8999,1326
-6.8344,-9.5027,1328
11.3329,-9.2147,1329
35.4963,-9.5258,1330
6.3692,-9.7393,1331
2.1333,-9.7867,1333
-1.4975,-9.7381,1334
0.0089,-9.7456,1335
-1.3136,-9.7337,1336
-7.9212,-9.7171,1338
6.6264,-9.6807,1339
-16.2344,-9.7741,1340
-0.1098,-9.7721,1341
2.8624,-9.7409,1342
-18.2946,-9.6158,1343
13.176,-9.435,1344
77.6512,-8.9933,1345
-0.2892,-9.7875,1346
-1.3508,-9.7766,1347
-0.766,-9.8048,1348
0.3889,-9.7986,1349
0.6246,-9.7722,1350
0.1409,-9.787,1351
0.1416,-9.7856,1352
