AYGX_mean,AZ_mean,timestamp
-3.5006,-9.6987,2018
-1.3168,-9.7374,2019
1.4217,-9.7095,2020
1.7154,-9.7194,2021
-10.4318,-9.8293,2022
-3.7355,-9.657,2023
13.2674,-9.6689,2024
4.0933,-9.84,2025
1.2522,-9.6963,2026
20.8595,-9.863,2027
2.3008,-9.8186,2028
12.6671,-9.8713,2029
1.3598,-9.7567,2030
5.704,-10.1336,2031
4.5021,-10.414,2032
-0.7309,-8.9269,2033
1.5799,-9.635,2034
2.4797,-9.6337,2035
0.0075,-9.9497,2036
-41.9703,-10.3444,2037
