AYGX_mean,AZ_mean,timestamp
-0.3505,-9.8511,734
0.8676,-9.8392,735
7.1468,-10.1175,737
0.4055,-9.9279,738
9.4432,-9.888,739
14.2325,-9.9442,740
13.3195,-10.4427,742
48.709,-10.1485,743
229.6016,-10.6961,744
10.9175,-10.0661,745
3.8175,-9.7525,748
-0.5079,-9.9055,749
-4.1675,-9.823,750
0.2527,-9.8287,752
0.7227,-9.8241,753
0.4937,-9.8213,754
