AYGX_mean,AZ_mean,timestamp
1.6438,-9.641,358
10.2195,-10.2705,359
2.0961,-9.716,361
2.9847,-9.6169,362
2.1109,-9.9363,363
0.8927,-9.8597,364
1.4183,-9.6657,365
1.1167,-9.7145,366
0.1978,-9.8383,367
93.47,-10.1616,368
10.3572,-10.1873,369
0.9754,-9.7778,371
2.3565,-10.3151,372
1.6306,-10.2194,373
8.187,-9.6494,374
0.4228,-10.0182,375
0.7419,-9.8589,376
0.2454,-9.6792,377
-0.9732,-9.6517,378
