ID,COMPANY_NAME
1,AES
2,AGL Energy
3,Algonquin Power & Utilities Co
4,Alliant Energy
5,Ameren
6,American Electric Power
7,Black Hills Corp
8,Centrica
9,CEZ
10,CK Infrastructure
11,CLP
12,CMS Energy
13,CenterPoint Energy
14,China Huaneng Group Corporation
15,China Resources Power
16,Chubu Electric Power
17,Chugoku
18,Con Edison
19,DTE Energy
20,Dominion Energy
21,Duke Energy
22,E.ON
23,EDF
24,EDP
25,Edison International
26,Electric Power Development
27,Emera
28,EnBW
29,Endesa
30,Enel SpA
31,Engie
32,Entergy
33,Evergy
34,Eversource Energy
35,Exelon
36,Firstenergy
37,Fortis
38,Fortum
39,Hawaiian Electric
40,Hydro One
41,Iberdrola
42,Idacorp
43,Innogy
44,KEPCO
45,Kansai Elec Power
46,Kyushu Elec Power
47,NRG Energy
48,NTPC
49,National Grid
50,Naturgy
51,NextEra Energy
52,Origin Energy
53,Orsted
54,PG&E
55,PGE
56,PPL
57,Pinnacle West Capital
58,Portland General Electric
59,Power Assets
60,Public Service Enterprise Group
61,Saudi Electricity Company
62,RWE
63,Red Electrica
64,SSE
65,Sempra Energy
66,Southern Company
67,"TEPCO (The Tokyo Electric Power Company Holdings, Inc (TEPCO))"
68,Tenaga Nasional
69,Terna
70,Tohoku Elec Power
71,Uniper
72,Vectren
73,Verbund
74,Vistra Energy
75,WEC Energy Group
76,XCEL Energy
77,Equinor
78,Union Electric
79,China Guodian Group Corporation
80,"Datang Huayin Electric Power Co., Ltd."
81,Huaneng Power International
82,PJSC
83,Huadian Energy Company Ltd
84,Eskom
