Manuel Neuer
[[0.46834192 0.00580506 0.         ... 0.         0.         0.02744126]]
 Marc-Andre ter Stegen
[[0. 0. 0. ... 0. 0. 0.]]
 Kevin Trapp
[[0. 0. 0. ... 0. 0. 0.]]
 Armel Bella-Kotchap
[[0.         0.         0.         ... 0.         0.04156931 0.        ]]
 Matthias Ginter
[[0.01062925 0.         0.         ... 0.         0.         0.        ]]
 Christian Gunter
[[0.         0.         0.         ... 0.         0.00232439 0.        ]]
 Thilo Kehrer
[[0.12568109 0.         0.         ... 0.         0.         0.        ]]
 Lukas Klostermann
[[0.0000000e+00 0.0000000e+00 0.0000000e+00 ... 9.9281875e-05
  0.0000000e+00 4.8038751e-02]]
 David Raum
[[0. 0. 0. ... 0. 0. 0.]]
 Antonio Rudiger
[[0. 0. 0. ... 0. 0. 0.]]
 Nico Schlotterbeck
[[0.         0.         0.         ... 0.         0.         0.06008706]]
 Niklas Sule
[[0.00291253 0.         0.         ... 0.         0.         0.        ]]
 Julian Brandt
[[0.47593257 0.         0.         ... 0.         0.03038554 0.        ]]
 Niclas Fullkrug
[[0. 0. 0. ... 0. 0. 0.]]
 Leon Goretzka
[[0. 0. 0. ... 0. 0. 0.]]
 Mario Gotze
[[0. 0. 0. ... 0. 0. 0.]]
 Ilkay Gundogan
[[0.0278172  0.         0.         ... 0.         0.00935372 0.36809337]]
 Jonas Hofmann
[[0.1091237  0.         0.         ... 0.         0.         0.07385373]]
 Joshua Kimmich
[[0. 0. 0. ... 0. 0. 0.]]
 Karim Adeyemi
[[0.         0.         0.10650422 ... 0.         0.         0.        ]]
 Serge Gnabry
[[0. 0. 0. ... 0. 0. 0.]]
 Kai Havertz
[[0. 0. 0. ... 0. 0. 0.]]
 Youssoufa Moukoko
[[0. 0. 0. ... 0. 0. 0.]]
 Thomas Muller
[[0. 0. 0. ... 0. 0. 0.]]
 Jamal Musiala
[[0.         0.         0.         ... 0.         0.         0.00940575]]
 Leroy Sane
[[0.09726086 0.         0.         ... 0.         0.         0.12245762]]
Jordan Pickford
[[0. 0. 0. ... 0. 0. 0.]]
 Aaron Ramsdale
[[0.         0.         0.         ... 0.         0.05181882 0.00825578]]
 Nick Pope
[[0. 0. 0. ... 0. 0. 0.]]
 Kieran Trippier
[[0. 0. 0. ... 0. 0. 0.]]
 John Stones
[[0. 0. 0. ... 0. 0. 0.]]
 Kyle Walker
[[0. 0. 0. ... 0. 0. 0.]]
 Luke Shaw
[[0. 0. 0. ... 0. 0. 0.]]
 Harry Maguire
[[0. 0. 0. ... 0. 0. 0.]]
 Ben White
[[0.        0.        0.        ... 0.        1.6721549 0.       ]]
 Trent Alexander-Arnold
[[0.11566617 0.         0.11151432 ... 0.         0.         0.02120477]]
 Eric Dier
[[0. 0. 0. ... 0. 0. 0.]]
 Conor Coady
[[0. 0. 0. ... 0. 0. 0.]]
 Declan Rice
[[0.         0.         0.         ... 0.         0.         0.06237616]]
 Kalvin Phillips
[[0. 0. 0. ... 0. 0. 0.]]
 Mason Mount
[[0.         0.         0.         ... 0.         0.01146662 0.        ]]
 Jordan Henderson
[[0.         0.         0.         ... 0.         0.00166069 0.05654002]]
 Jude Bellingham
[[0.         0.         0.         ... 0.         0.37061924 0.14785308]]
 Conor Gallagher
[[0. 0. 0. ... 0. 0. 0.]]
 Harry Kane
[[0.         0.         0.54834765 ... 0.         0.         0.5627793 ]]
 Callum Wilson
[[0.         0.         0.         ... 0.         0.01375122 0.        ]]
 Raheem Sterling
 Phil Foden
