G04 #@! TF.GenerationSoftware,KiCad,Pcbnew,(6.0.4)*
G04 #@! TF.CreationDate,2022-03-21T23:56:28+01:00*
G04 #@! TF.ProjectId,dataloggerV3_3,64617461-6c6f-4676-9765-7256335f332e,rev?*
G04 #@! TF.SameCoordinates,Original*
G04 #@! TF.FileFunction,Copper,L1,Top*
G04 #@! TF.FilePolarity,Positive*
%FSLAX46Y46*%
G04 Gerber Fmt 4.6, Leading zero omitted, Abs format (unit mm)*
G04 Created by KiCad (PCBNEW (6.0.4)) date 2022-03-21 23:56:28*
%MOMM*%
%LPD*%
G01*
G04 APERTURE LIST*
%ADD10C,0.300000*%
G04 #@! TA.AperFunction,NonConductor*
%ADD11C,0.300000*%
G04 #@! TD*
G04 #@! TA.AperFunction,ComponentPad*
%ADD12C,1.905000*%
G04 #@! TD*
G04 #@! TA.AperFunction,ComponentPad*
%ADD13R,3.000000X3.000000*%
G04 #@! TD*
G04 #@! TA.AperFunction,ComponentPad*
%ADD14C,3.000000*%
G04 #@! TD*
G04 #@! TA.AperFunction,ComponentPad*
%ADD15C,1.524000*%
G04 #@! TD*
G04 #@! TA.AperFunction,ComponentPad*
%ADD16R,1.524000X1.524000*%
G04 #@! TD*
G04 #@! TA.AperFunction,ComponentPad*
%ADD17C,1.600000*%
G04 #@! TD*
G04 #@! TA.AperFunction,ComponentPad*
%ADD18O,1.600000X1.600000*%
G04 #@! TD*
G04 #@! TA.AperFunction,ComponentPad*
%ADD19R,1.800000X1.800000*%
G04 #@! TD*
G04 #@! TA.AperFunction,ComponentPad*
%ADD20O,1.800000X1.800000*%
G04 #@! TD*
G04 #@! TA.AperFunction,ComponentPad*
%ADD21C,2.400000*%
G04 #@! TD*
G04 #@! TA.AperFunction,ComponentPad*
%ADD22C,15.000000*%
G04 #@! TD*
G04 #@! TA.AperFunction,ComponentPad*
%ADD23R,1.750000X1.750000*%
G04 #@! TD*
G04 #@! TA.AperFunction,ComponentPad*
%ADD24C,1.750000*%
G04 #@! TD*
G04 #@! TA.AperFunction,ComponentPad*
%ADD25O,11.000000X3.000000*%
G04 #@! TD*
G04 #@! TA.AperFunction,ViaPad*
%ADD26C,1.500000*%
G04 #@! TD*
G04 #@! TA.AperFunction,Conductor*
%ADD27C,0.700000*%
G04 #@! TD*
G04 APERTURE END LIST*
D10*
D11*
X132984749Y-108426666D02*
X130984749Y-109093333D01*
X132984749Y-109760000D01*
X130984749Y-111474285D02*
X130984749Y-110331428D01*
X130984749Y-110902857D02*
X132984749Y-110902857D01*
X132699034Y-110712380D01*
X132508558Y-110521904D01*
X132413320Y-110331428D01*
X132984749Y-112045714D02*
X132984749Y-113188571D01*
X130984749Y-112617142D02*
X132984749Y-112617142D01*
X130984749Y-114902857D02*
X130984749Y-113760000D01*
X130984749Y-114331428D02*
X132984749Y-114331428D01*
X132699034Y-114140952D01*
X132508558Y-113950476D01*
X132413320Y-113760000D01*
D10*
D11*
X132984749Y-105156190D02*
X132984749Y-106299047D01*
X130984749Y-105727619D02*
X132984749Y-105727619D01*
X130984749Y-108013333D02*
X130984749Y-106870476D01*
X130984749Y-107441904D02*
X132984749Y-107441904D01*
X132699034Y-107251428D01*
X132508558Y-107060952D01*
X132413320Y-106870476D01*
D10*
D11*
X132984749Y-70326666D02*
X130984749Y-70993333D01*
X132984749Y-71660000D01*
X132318082Y-73183809D02*
X130984749Y-73183809D01*
X133079987Y-72707619D02*
X131651415Y-72231428D01*
X131651415Y-73469523D01*
X132984749Y-73945714D02*
X132984749Y-75088571D01*
X130984749Y-74517142D02*
X132984749Y-74517142D01*
X132794272Y-75660000D02*
X132889511Y-75755238D01*
X132984749Y-75945714D01*
X132984749Y-76421904D01*
X132889511Y-76612380D01*
X132794272Y-76707619D01*
X132603796Y-76802857D01*
X132413320Y-76802857D01*
X132127606Y-76707619D01*
X130984749Y-75564761D01*
X130984749Y-76802857D01*
D10*
D11*
X132984749Y-67056190D02*
X132984749Y-68199047D01*
X130984749Y-67627619D02*
X132984749Y-67627619D01*
X132318082Y-69722857D02*
X130984749Y-69722857D01*
X133079987Y-69246666D02*
X131651415Y-68770476D01*
X131651415Y-70008571D01*
D10*
D11*
X130929523Y-120550952D02*
X132477142Y-120550952D01*
X131643809Y-121503333D01*
X132000952Y-121503333D01*
X132239047Y-121622380D01*
X132358095Y-121741428D01*
X132477142Y-121979523D01*
X132477142Y-122574761D01*
X132358095Y-122812857D01*
X132239047Y-122931904D01*
X132000952Y-123050952D01*
X131286666Y-123050952D01*
X131048571Y-122931904D01*
X130929523Y-122812857D01*
X133667619Y-122931904D02*
X133667619Y-123050952D01*
X133548571Y-123289047D01*
X133429523Y-123408095D01*
X134500952Y-120550952D02*
X136048571Y-120550952D01*
X135215238Y-121503333D01*
X135572380Y-121503333D01*
X135810476Y-121622380D01*
X135929523Y-121741428D01*
X136048571Y-121979523D01*
X136048571Y-122574761D01*
X135929523Y-122812857D01*
X135810476Y-122931904D01*
X135572380Y-123050952D01*
X134858095Y-123050952D01*
X134620000Y-122931904D01*
X134500952Y-122812857D01*
X136762857Y-120550952D02*
X137596190Y-123050952D01*
X138429523Y-120550952D01*
D10*
D11*
X115351329Y-144733799D02*
X112851329Y-145567132D01*
X115351329Y-146400466D01*
X112851329Y-148543323D02*
X112851329Y-147114751D01*
X112851329Y-147829037D02*
X115351329Y-147829037D01*
X114994186Y-147590942D01*
X114756091Y-147352846D01*
X114637043Y-147114751D01*
X115351329Y-149257608D02*
X115351329Y-150686180D01*
X112851329Y-149971894D02*
X115351329Y-149971894D01*
X115113234Y-151400466D02*
X115232282Y-151519513D01*
X115351329Y-151757608D01*
X115351329Y-152352846D01*
X115232282Y-152590942D01*
X115113234Y-152709989D01*
X114875139Y-152829037D01*
X114637043Y-152829037D01*
X114279901Y-152709989D01*
X112851329Y-151281418D01*
X112851329Y-152829037D01*
D10*
D11*
X115478558Y-163473333D02*
X112978558Y-164306666D01*
X115478558Y-165140000D01*
X115478558Y-165735238D02*
X115478558Y-167282857D01*
X114526177Y-166449523D01*
X114526177Y-166806666D01*
X114407130Y-167044761D01*
X114288082Y-167163809D01*
X114049987Y-167282857D01*
X113454749Y-167282857D01*
X113216653Y-167163809D01*
X113097606Y-167044761D01*
X112978558Y-166806666D01*
X112978558Y-166092380D01*
X113097606Y-165854285D01*
X113216653Y-165735238D01*
X115478558Y-167997142D02*
X115478558Y-169425714D01*
X112978558Y-168711428D02*
X115478558Y-168711428D01*
X112978558Y-171568571D02*
X112978558Y-170140000D01*
X112978558Y-170854285D02*
X115478558Y-170854285D01*
X115121415Y-170616190D01*
X114883320Y-170378095D01*
X114764272Y-170140000D01*
D10*
D11*
X115478558Y-178713333D02*
X112978558Y-179546666D01*
X115478558Y-180380000D01*
X114645225Y-182284761D02*
X112978558Y-182284761D01*
X115597606Y-181689523D02*
X113811891Y-181094285D01*
X113811891Y-182641904D01*
X115478558Y-183237142D02*
X115478558Y-184665714D01*
X112978558Y-183951428D02*
X115478558Y-183951428D01*
X112978558Y-186808571D02*
X112978558Y-185380000D01*
X112978558Y-186094285D02*
X115478558Y-186094285D01*
X115121415Y-185856190D01*
X114883320Y-185618095D01*
X114764272Y-185380000D01*
D10*
D11*
X107810952Y-21172857D02*
X105310952Y-21172857D01*
X106144285Y-19982380D02*
X107810952Y-19982380D01*
X106382380Y-19982380D02*
X106263333Y-19863333D01*
X106144285Y-19625238D01*
X106144285Y-19268095D01*
X106263333Y-19030000D01*
X106501428Y-18910952D01*
X107810952Y-18910952D01*
X106501428Y-16887142D02*
X106501428Y-17720476D01*
X107810952Y-17720476D02*
X105310952Y-17720476D01*
X105310952Y-16530000D01*
X105310952Y-15815714D02*
X105310952Y-14268095D01*
X106263333Y-15101428D01*
X106263333Y-14744285D01*
X106382380Y-14506190D01*
X106501428Y-14387142D01*
X106739523Y-14268095D01*
X107334761Y-14268095D01*
X107572857Y-14387142D01*
X107691904Y-14506190D01*
X107810952Y-14744285D01*
X107810952Y-15458571D01*
X107691904Y-15696666D01*
X107572857Y-15815714D01*
D10*
D11*
X118018558Y-92174761D02*
X118018558Y-92650952D01*
X117899511Y-92889047D01*
X117661415Y-93127142D01*
X117185225Y-93246190D01*
X116351891Y-93246190D01*
X115875701Y-93127142D01*
X115637606Y-92889047D01*
X115518558Y-92650952D01*
X115518558Y-92174761D01*
X115637606Y-91936666D01*
X115875701Y-91698571D01*
X116351891Y-91579523D01*
X117185225Y-91579523D01*
X117661415Y-91698571D01*
X117899511Y-91936666D01*
X118018558Y-92174761D01*
X117185225Y-95389047D02*
X115518558Y-95389047D01*
X117185225Y-94317619D02*
X115875701Y-94317619D01*
X115637606Y-94436666D01*
X115518558Y-94674761D01*
X115518558Y-95031904D01*
X115637606Y-95270000D01*
X115756653Y-95389047D01*
X117185225Y-96222380D02*
X117185225Y-97174761D01*
X118018558Y-96579523D02*
X115875701Y-96579523D01*
X115637606Y-96698571D01*
X115518558Y-96936666D01*
X115518558Y-97174761D01*
X116828082Y-98841428D02*
X116828082Y-98008095D01*
X115518558Y-98008095D02*
X118018558Y-98008095D01*
X118018558Y-99198571D01*
X118018558Y-99912857D02*
X118018558Y-101460476D01*
X117066177Y-100627142D01*
X117066177Y-100984285D01*
X116947130Y-101222380D01*
X116828082Y-101341428D01*
X116589987Y-101460476D01*
X115994749Y-101460476D01*
X115756653Y-101341428D01*
X115637606Y-101222380D01*
X115518558Y-100984285D01*
X115518558Y-100270000D01*
X115637606Y-100031904D01*
X115756653Y-99912857D01*
D10*
D11*
X11981428Y-52701428D02*
X10481428Y-53201428D01*
X11981428Y-53701428D01*
X10481428Y-54201428D02*
X11481428Y-54201428D01*
X11981428Y-54201428D02*
X11910000Y-54130000D01*
X11838571Y-54201428D01*
X11910000Y-54272857D01*
X11981428Y-54201428D01*
X11838571Y-54201428D01*
X11481428Y-54915714D02*
X10481428Y-54915714D01*
X11338571Y-54915714D02*
X11410000Y-54987142D01*
X11481428Y-55130000D01*
X11481428Y-55344285D01*
X11410000Y-55487142D01*
X11267142Y-55558571D01*
X10481428Y-55558571D01*
X11052857Y-56272857D02*
X11052857Y-57415714D01*
X10481428Y-58915714D02*
X10481428Y-58058571D01*
X10481428Y-58487142D02*
X11981428Y-58487142D01*
X11767142Y-58344285D01*
X11624285Y-58201428D01*
X11552857Y-58058571D01*
D10*
D11*
X11981428Y-45081428D02*
X10481428Y-45581428D01*
X11981428Y-46081428D01*
X10481428Y-46581428D02*
X11481428Y-46581428D01*
X11981428Y-46581428D02*
X11910000Y-46510000D01*
X11838571Y-46581428D01*
X11910000Y-46652857D01*
X11981428Y-46581428D01*
X11838571Y-46581428D01*
X11481428Y-47295714D02*
X10481428Y-47295714D01*
X11338571Y-47295714D02*
X11410000Y-47367142D01*
X11481428Y-47510000D01*
X11481428Y-47724285D01*
X11410000Y-47867142D01*
X11267142Y-47938571D01*
X10481428Y-47938571D01*
X11052857Y-48652857D02*
X11052857Y-49795714D01*
X10481428Y-49224285D02*
X11624285Y-49224285D01*
X10481428Y-51295714D02*
X10481428Y-50438571D01*
X10481428Y-50867142D02*
X11981428Y-50867142D01*
X11767142Y-50724285D01*
X11624285Y-50581428D01*
X11552857Y-50438571D01*
D10*
D11*
X100992857Y-66687142D02*
X100921428Y-66901428D01*
X100921428Y-67258571D01*
X100992857Y-67401428D01*
X101064285Y-67472857D01*
X101207142Y-67544285D01*
X101350000Y-67544285D01*
X101492857Y-67472857D01*
X101564285Y-67401428D01*
X101635714Y-67258571D01*
X101707142Y-66972857D01*
X101778571Y-66830000D01*
X101850000Y-66758571D01*
X101992857Y-66687142D01*
X102135714Y-66687142D01*
X102278571Y-66758571D01*
X102350000Y-66830000D01*
X102421428Y-66972857D01*
X102421428Y-67330000D01*
X102350000Y-67544285D01*
X101064285Y-69044285D02*
X100992857Y-68972857D01*
X100921428Y-68758571D01*
X100921428Y-68615714D01*
X100992857Y-68401428D01*
X101135714Y-68258571D01*
X101278571Y-68187142D01*
X101564285Y-68115714D01*
X101778571Y-68115714D01*
X102064285Y-68187142D01*
X102207142Y-68258571D01*
X102350000Y-68401428D01*
X102421428Y-68615714D01*
X102421428Y-68758571D01*
X102350000Y-68972857D01*
X102278571Y-69044285D01*
X100921428Y-70472857D02*
X100921428Y-69615714D01*
X100921428Y-70044285D02*
X102421428Y-70044285D01*
X102207142Y-69901428D01*
X102064285Y-69758571D01*
X101992857Y-69615714D01*
D10*
D11*
X100992857Y-71874285D02*
X100921428Y-72088571D01*
X100921428Y-72445714D01*
X100992857Y-72588571D01*
X101064285Y-72660000D01*
X101207142Y-72731428D01*
X101350000Y-72731428D01*
X101492857Y-72660000D01*
X101564285Y-72588571D01*
X101635714Y-72445714D01*
X101707142Y-72160000D01*
X101778571Y-72017142D01*
X101850000Y-71945714D01*
X101992857Y-71874285D01*
X102135714Y-71874285D01*
X102278571Y-71945714D01*
X102350000Y-72017142D01*
X102421428Y-72160000D01*
X102421428Y-72517142D01*
X102350000Y-72731428D01*
X102421428Y-73160000D02*
X100921428Y-73660000D01*
X102421428Y-74160000D01*
X100921428Y-75445714D02*
X100921428Y-74588571D01*
X100921428Y-75017142D02*
X102421428Y-75017142D01*
X102207142Y-74874285D01*
X102064285Y-74731428D01*
X101992857Y-74588571D01*
D10*
D11*
X14656285Y-31062428D02*
X14584857Y-30991000D01*
X14513428Y-30776714D01*
X14513428Y-30633857D01*
X14584857Y-30419571D01*
X14727714Y-30276714D01*
X14870571Y-30205285D01*
X15156285Y-30133857D01*
X15370571Y-30133857D01*
X15656285Y-30205285D01*
X15799142Y-30276714D01*
X15942000Y-30419571D01*
X16013428Y-30633857D01*
X16013428Y-30776714D01*
X15942000Y-30991000D01*
X15870571Y-31062428D01*
X16013428Y-31991000D02*
X16013428Y-32276714D01*
X15942000Y-32419571D01*
X15799142Y-32562428D01*
X15513428Y-32633857D01*
X15013428Y-32633857D01*
X14727714Y-32562428D01*
X14584857Y-32419571D01*
X14513428Y-32276714D01*
X14513428Y-31991000D01*
X14584857Y-31848142D01*
X14727714Y-31705285D01*
X15013428Y-31633857D01*
X15513428Y-31633857D01*
X15799142Y-31705285D01*
X15942000Y-31848142D01*
X16013428Y-31991000D01*
X14513428Y-33276714D02*
X16013428Y-33276714D01*
X14942000Y-33776714D01*
X16013428Y-34276714D01*
X14513428Y-34276714D01*
D10*
D11*
X11981428Y-93341428D02*
X10481428Y-93841428D01*
X11981428Y-94341428D01*
X10481428Y-94841428D02*
X11481428Y-94841428D01*
X11981428Y-94841428D02*
X11910000Y-94770000D01*
X11838571Y-94841428D01*
X11910000Y-94912857D01*
X11981428Y-94841428D01*
X11838571Y-94841428D01*
X11481428Y-95555714D02*
X10481428Y-95555714D01*
X11338571Y-95555714D02*
X11410000Y-95627142D01*
X11481428Y-95770000D01*
X11481428Y-95984285D01*
X11410000Y-96127142D01*
X11267142Y-96198571D01*
X10481428Y-96198571D01*
X11052857Y-96912857D02*
X11052857Y-98055714D01*
X10481428Y-97484285D02*
X11624285Y-97484285D01*
X11838571Y-98698571D02*
X11910000Y-98770000D01*
X11981428Y-98912857D01*
X11981428Y-99270000D01*
X11910000Y-99412857D01*
X11838571Y-99484285D01*
X11695714Y-99555714D01*
X11552857Y-99555714D01*
X11338571Y-99484285D01*
X10481428Y-98627142D01*
X10481428Y-99555714D01*
D10*
D11*
X11981428Y-139061428D02*
X10481428Y-139561428D01*
X11981428Y-140061428D01*
X10481428Y-140561428D02*
X11481428Y-140561428D01*
X11981428Y-140561428D02*
X11910000Y-140490000D01*
X11838571Y-140561428D01*
X11910000Y-140632857D01*
X11981428Y-140561428D01*
X11838571Y-140561428D01*
X11481428Y-141275714D02*
X10481428Y-141275714D01*
X11338571Y-141275714D02*
X11410000Y-141347142D01*
X11481428Y-141490000D01*
X11481428Y-141704285D01*
X11410000Y-141847142D01*
X11267142Y-141918571D01*
X10481428Y-141918571D01*
X11052857Y-142632857D02*
X11052857Y-143775714D01*
X10481428Y-143204285D02*
X11624285Y-143204285D01*
X11981428Y-144347142D02*
X11981428Y-145275714D01*
X11410000Y-144775714D01*
X11410000Y-144990000D01*
X11338571Y-145132857D01*
X11267142Y-145204285D01*
X11124285Y-145275714D01*
X10767142Y-145275714D01*
X10624285Y-145204285D01*
X10552857Y-145132857D01*
X10481428Y-144990000D01*
X10481428Y-144561428D01*
X10552857Y-144418571D01*
X10624285Y-144347142D01*
D10*
D11*
X11981428Y-184781428D02*
X10481428Y-185281428D01*
X11981428Y-185781428D01*
X10481428Y-186281428D02*
X11481428Y-186281428D01*
X11981428Y-186281428D02*
X11910000Y-186210000D01*
X11838571Y-186281428D01*
X11910000Y-186352857D01*
X11981428Y-186281428D01*
X11838571Y-186281428D01*
X11481428Y-186995714D02*
X10481428Y-186995714D01*
X11338571Y-186995714D02*
X11410000Y-187067142D01*
X11481428Y-187210000D01*
X11481428Y-187424285D01*
X11410000Y-187567142D01*
X11267142Y-187638571D01*
X10481428Y-187638571D01*
X11052857Y-188352857D02*
X11052857Y-189495714D01*
X10481428Y-188924285D02*
X11624285Y-188924285D01*
X11481428Y-190852857D02*
X10481428Y-190852857D01*
X12052857Y-190495714D02*
X10981428Y-190138571D01*
X10981428Y-191067142D01*
D10*
D11*
X11981428Y-100961428D02*
X10481428Y-101461428D01*
X11981428Y-101961428D01*
X10481428Y-102461428D02*
X11481428Y-102461428D01*
X11981428Y-102461428D02*
X11910000Y-102390000D01*
X11838571Y-102461428D01*
X11910000Y-102532857D01*
X11981428Y-102461428D01*
X11838571Y-102461428D01*
X11481428Y-103175714D02*
X10481428Y-103175714D01*
X11338571Y-103175714D02*
X11410000Y-103247142D01*
X11481428Y-103390000D01*
X11481428Y-103604285D01*
X11410000Y-103747142D01*
X11267142Y-103818571D01*
X10481428Y-103818571D01*
X11052857Y-104532857D02*
X11052857Y-105675714D01*
X11838571Y-106318571D02*
X11910000Y-106390000D01*
X11981428Y-106532857D01*
X11981428Y-106890000D01*
X11910000Y-107032857D01*
X11838571Y-107104285D01*
X11695714Y-107175714D01*
X11552857Y-107175714D01*
X11338571Y-107104285D01*
X10481428Y-106247142D01*
X10481428Y-107175714D01*
D10*
D11*
X11981428Y-146681428D02*
X10481428Y-147181428D01*
X11981428Y-147681428D01*
X10481428Y-148181428D02*
X11481428Y-148181428D01*
X11981428Y-148181428D02*
X11910000Y-148110000D01*
X11838571Y-148181428D01*
X11910000Y-148252857D01*
X11981428Y-148181428D01*
X11838571Y-148181428D01*
X11481428Y-148895714D02*
X10481428Y-148895714D01*
X11338571Y-148895714D02*
X11410000Y-148967142D01*
X11481428Y-149110000D01*
X11481428Y-149324285D01*
X11410000Y-149467142D01*
X11267142Y-149538571D01*
X10481428Y-149538571D01*
X11052857Y-150252857D02*
X11052857Y-151395714D01*
X11981428Y-151967142D02*
X11981428Y-152895714D01*
X11410000Y-152395714D01*
X11410000Y-152610000D01*
X11338571Y-152752857D01*
X11267142Y-152824285D01*
X11124285Y-152895714D01*
X10767142Y-152895714D01*
X10624285Y-152824285D01*
X10552857Y-152752857D01*
X10481428Y-152610000D01*
X10481428Y-152181428D01*
X10552857Y-152038571D01*
X10624285Y-151967142D01*
D10*
D11*
X11981428Y-192401428D02*
X10481428Y-192901428D01*
X11981428Y-193401428D01*
X10481428Y-193901428D02*
X11481428Y-193901428D01*
X11981428Y-193901428D02*
X11910000Y-193830000D01*
X11838571Y-193901428D01*
X11910000Y-193972857D01*
X11981428Y-193901428D01*
X11838571Y-193901428D01*
X11481428Y-194615714D02*
X10481428Y-194615714D01*
X11338571Y-194615714D02*
X11410000Y-194687142D01*
X11481428Y-194830000D01*
X11481428Y-195044285D01*
X11410000Y-195187142D01*
X11267142Y-195258571D01*
X10481428Y-195258571D01*
X11052857Y-195972857D02*
X11052857Y-197115714D01*
X11481428Y-198472857D02*
X10481428Y-198472857D01*
X12052857Y-198115714D02*
X10981428Y-197758571D01*
X10981428Y-198687142D01*
D10*
D11*
X14656285Y-78831428D02*
X14584857Y-78760000D01*
X14513428Y-78545714D01*
X14513428Y-78402857D01*
X14584857Y-78188571D01*
X14727714Y-78045714D01*
X14870571Y-77974285D01*
X15156285Y-77902857D01*
X15370571Y-77902857D01*
X15656285Y-77974285D01*
X15799142Y-78045714D01*
X15942000Y-78188571D01*
X16013428Y-78402857D01*
X16013428Y-78545714D01*
X15942000Y-78760000D01*
X15870571Y-78831428D01*
X16013428Y-79760000D02*
X16013428Y-80045714D01*
X15942000Y-80188571D01*
X15799142Y-80331428D01*
X15513428Y-80402857D01*
X15013428Y-80402857D01*
X14727714Y-80331428D01*
X14584857Y-80188571D01*
X14513428Y-80045714D01*
X14513428Y-79760000D01*
X14584857Y-79617142D01*
X14727714Y-79474285D01*
X15013428Y-79402857D01*
X15513428Y-79402857D01*
X15799142Y-79474285D01*
X15942000Y-79617142D01*
X16013428Y-79760000D01*
X14513428Y-81045714D02*
X16013428Y-81045714D01*
X14942000Y-81545714D01*
X16013428Y-82045714D01*
X14513428Y-82045714D01*
D10*
D11*
X13815285Y-125694428D02*
X13743857Y-125623000D01*
X13672428Y-125408714D01*
X13672428Y-125265857D01*
X13743857Y-125051571D01*
X13886714Y-124908714D01*
X14029571Y-124837285D01*
X14315285Y-124765857D01*
X14529571Y-124765857D01*
X14815285Y-124837285D01*
X14958142Y-124908714D01*
X15101000Y-125051571D01*
X15172428Y-125265857D01*
X15172428Y-125408714D01*
X15101000Y-125623000D01*
X15029571Y-125694428D01*
X15172428Y-126623000D02*
X15172428Y-126908714D01*
X15101000Y-127051571D01*
X14958142Y-127194428D01*
X14672428Y-127265857D01*
X14172428Y-127265857D01*
X13886714Y-127194428D01*
X13743857Y-127051571D01*
X13672428Y-126908714D01*
X13672428Y-126623000D01*
X13743857Y-126480142D01*
X13886714Y-126337285D01*
X14172428Y-126265857D01*
X14672428Y-126265857D01*
X14958142Y-126337285D01*
X15101000Y-126480142D01*
X15172428Y-126623000D01*
X13672428Y-127908714D02*
X15172428Y-127908714D01*
X14101000Y-128408714D01*
X15172428Y-128908714D01*
X13672428Y-128908714D01*
D10*
D11*
X13458696Y-172811428D02*
X13387268Y-172740000D01*
X13315839Y-172525714D01*
X13315839Y-172382857D01*
X13387268Y-172168571D01*
X13530125Y-172025714D01*
X13672982Y-171954285D01*
X13958696Y-171882857D01*
X14172982Y-171882857D01*
X14458696Y-171954285D01*
X14601553Y-172025714D01*
X14744411Y-172168571D01*
X14815839Y-172382857D01*
X14815839Y-172525714D01*
X14744411Y-172740000D01*
X14672982Y-172811428D01*
X14815839Y-173740000D02*
X14815839Y-174025714D01*
X14744411Y-174168571D01*
X14601553Y-174311428D01*
X14315839Y-174382857D01*
X13815839Y-174382857D01*
X13530125Y-174311428D01*
X13387268Y-174168571D01*
X13315839Y-174025714D01*
X13315839Y-173740000D01*
X13387268Y-173597142D01*
X13530125Y-173454285D01*
X13815839Y-173382857D01*
X14315839Y-173382857D01*
X14601553Y-173454285D01*
X14744411Y-173597142D01*
X14815839Y-173740000D01*
X13315839Y-175025714D02*
X14815839Y-175025714D01*
X13744411Y-175525714D01*
X14815839Y-176025714D01*
X13315839Y-176025714D01*
D10*
D11*
X100992857Y-79387142D02*
X100921428Y-79601428D01*
X100921428Y-79958571D01*
X100992857Y-80101428D01*
X101064285Y-80172857D01*
X101207142Y-80244285D01*
X101350000Y-80244285D01*
X101492857Y-80172857D01*
X101564285Y-80101428D01*
X101635714Y-79958571D01*
X101707142Y-79672857D01*
X101778571Y-79530000D01*
X101850000Y-79458571D01*
X101992857Y-79387142D01*
X102135714Y-79387142D01*
X102278571Y-79458571D01*
X102350000Y-79530000D01*
X102421428Y-79672857D01*
X102421428Y-80030000D01*
X102350000Y-80244285D01*
X101064285Y-81744285D02*
X100992857Y-81672857D01*
X100921428Y-81458571D01*
X100921428Y-81315714D01*
X100992857Y-81101428D01*
X101135714Y-80958571D01*
X101278571Y-80887142D01*
X101564285Y-80815714D01*
X101778571Y-80815714D01*
X102064285Y-80887142D01*
X102207142Y-80958571D01*
X102350000Y-81101428D01*
X102421428Y-81315714D01*
X102421428Y-81458571D01*
X102350000Y-81672857D01*
X102278571Y-81744285D01*
X102278571Y-82315714D02*
X102350000Y-82387142D01*
X102421428Y-82530000D01*
X102421428Y-82887142D01*
X102350000Y-83030000D01*
X102278571Y-83101428D01*
X102135714Y-83172857D01*
X101992857Y-83172857D01*
X101778571Y-83101428D01*
X100921428Y-82244285D01*
X100921428Y-83172857D01*
D10*
D11*
X100992857Y-92087142D02*
X100921428Y-92301428D01*
X100921428Y-92658571D01*
X100992857Y-92801428D01*
X101064285Y-92872857D01*
X101207142Y-92944285D01*
X101350000Y-92944285D01*
X101492857Y-92872857D01*
X101564285Y-92801428D01*
X101635714Y-92658571D01*
X101707142Y-92372857D01*
X101778571Y-92230000D01*
X101850000Y-92158571D01*
X101992857Y-92087142D01*
X102135714Y-92087142D01*
X102278571Y-92158571D01*
X102350000Y-92230000D01*
X102421428Y-92372857D01*
X102421428Y-92730000D01*
X102350000Y-92944285D01*
X101064285Y-94444285D02*
X100992857Y-94372857D01*
X100921428Y-94158571D01*
X100921428Y-94015714D01*
X100992857Y-93801428D01*
X101135714Y-93658571D01*
X101278571Y-93587142D01*
X101564285Y-93515714D01*
X101778571Y-93515714D01*
X102064285Y-93587142D01*
X102207142Y-93658571D01*
X102350000Y-93801428D01*
X102421428Y-94015714D01*
X102421428Y-94158571D01*
X102350000Y-94372857D01*
X102278571Y-94444285D01*
X102421428Y-94944285D02*
X102421428Y-95872857D01*
X101850000Y-95372857D01*
X101850000Y-95587142D01*
X101778571Y-95730000D01*
X101707142Y-95801428D01*
X101564285Y-95872857D01*
X101207142Y-95872857D01*
X101064285Y-95801428D01*
X100992857Y-95730000D01*
X100921428Y-95587142D01*
X100921428Y-95158571D01*
X100992857Y-95015714D01*
X101064285Y-94944285D01*
D10*
D11*
X100992857Y-104787142D02*
X100921428Y-105001428D01*
X100921428Y-105358571D01*
X100992857Y-105501428D01*
X101064285Y-105572857D01*
X101207142Y-105644285D01*
X101350000Y-105644285D01*
X101492857Y-105572857D01*
X101564285Y-105501428D01*
X101635714Y-105358571D01*
X101707142Y-105072857D01*
X101778571Y-104930000D01*
X101850000Y-104858571D01*
X101992857Y-104787142D01*
X102135714Y-104787142D01*
X102278571Y-104858571D01*
X102350000Y-104930000D01*
X102421428Y-105072857D01*
X102421428Y-105430000D01*
X102350000Y-105644285D01*
X101064285Y-107144285D02*
X100992857Y-107072857D01*
X100921428Y-106858571D01*
X100921428Y-106715714D01*
X100992857Y-106501428D01*
X101135714Y-106358571D01*
X101278571Y-106287142D01*
X101564285Y-106215714D01*
X101778571Y-106215714D01*
X102064285Y-106287142D01*
X102207142Y-106358571D01*
X102350000Y-106501428D01*
X102421428Y-106715714D01*
X102421428Y-106858571D01*
X102350000Y-107072857D01*
X102278571Y-107144285D01*
X101921428Y-108430000D02*
X100921428Y-108430000D01*
X102492857Y-108072857D02*
X101421428Y-107715714D01*
X101421428Y-108644285D01*
D10*
D11*
X100992857Y-84574285D02*
X100921428Y-84788571D01*
X100921428Y-85145714D01*
X100992857Y-85288571D01*
X101064285Y-85360000D01*
X101207142Y-85431428D01*
X101350000Y-85431428D01*
X101492857Y-85360000D01*
X101564285Y-85288571D01*
X101635714Y-85145714D01*
X101707142Y-84860000D01*
X101778571Y-84717142D01*
X101850000Y-84645714D01*
X101992857Y-84574285D01*
X102135714Y-84574285D01*
X102278571Y-84645714D01*
X102350000Y-84717142D01*
X102421428Y-84860000D01*
X102421428Y-85217142D01*
X102350000Y-85431428D01*
X102421428Y-85860000D02*
X100921428Y-86360000D01*
X102421428Y-86860000D01*
X102278571Y-87288571D02*
X102350000Y-87360000D01*
X102421428Y-87502857D01*
X102421428Y-87860000D01*
X102350000Y-88002857D01*
X102278571Y-88074285D01*
X102135714Y-88145714D01*
X101992857Y-88145714D01*
X101778571Y-88074285D01*
X100921428Y-87217142D01*
X100921428Y-88145714D01*
D10*
D11*
X100992857Y-97274285D02*
X100921428Y-97488571D01*
X100921428Y-97845714D01*
X100992857Y-97988571D01*
X101064285Y-98060000D01*
X101207142Y-98131428D01*
X101350000Y-98131428D01*
X101492857Y-98060000D01*
X101564285Y-97988571D01*
X101635714Y-97845714D01*
X101707142Y-97560000D01*
X101778571Y-97417142D01*
X101850000Y-97345714D01*
X101992857Y-97274285D01*
X102135714Y-97274285D01*
X102278571Y-97345714D01*
X102350000Y-97417142D01*
X102421428Y-97560000D01*
X102421428Y-97917142D01*
X102350000Y-98131428D01*
X102421428Y-98560000D02*
X100921428Y-99060000D01*
X102421428Y-99560000D01*
X102421428Y-99917142D02*
X102421428Y-100845714D01*
X101850000Y-100345714D01*
X101850000Y-100560000D01*
X101778571Y-100702857D01*
X101707142Y-100774285D01*
X101564285Y-100845714D01*
X101207142Y-100845714D01*
X101064285Y-100774285D01*
X100992857Y-100702857D01*
X100921428Y-100560000D01*
X100921428Y-100131428D01*
X100992857Y-99988571D01*
X101064285Y-99917142D01*
D10*
D11*
X100992857Y-109974285D02*
X100921428Y-110188571D01*
X100921428Y-110545714D01*
X100992857Y-110688571D01*
X101064285Y-110760000D01*
X101207142Y-110831428D01*
X101350000Y-110831428D01*
X101492857Y-110760000D01*
X101564285Y-110688571D01*
X101635714Y-110545714D01*
X101707142Y-110260000D01*
X101778571Y-110117142D01*
X101850000Y-110045714D01*
X101992857Y-109974285D01*
X102135714Y-109974285D01*
X102278571Y-110045714D01*
X102350000Y-110117142D01*
X102421428Y-110260000D01*
X102421428Y-110617142D01*
X102350000Y-110831428D01*
X102421428Y-111260000D02*
X100921428Y-111760000D01*
X102421428Y-112260000D01*
X101921428Y-113402857D02*
X100921428Y-113402857D01*
X102492857Y-113045714D02*
X101421428Y-112688571D01*
X101421428Y-113617142D01*
D10*
D11*
X132984749Y-79756190D02*
X132984749Y-80899047D01*
X130984749Y-80327619D02*
X132984749Y-80327619D01*
X132984749Y-81375238D02*
X132984749Y-82613333D01*
X132222844Y-81946666D01*
X132222844Y-82232380D01*
X132127606Y-82422857D01*
X132032368Y-82518095D01*
X131841891Y-82613333D01*
X131365701Y-82613333D01*
X131175225Y-82518095D01*
X131079987Y-82422857D01*
X130984749Y-82232380D01*
X130984749Y-81660952D01*
X131079987Y-81470476D01*
X131175225Y-81375238D01*
D10*
D11*
X132984749Y-83026666D02*
X130984749Y-83693333D01*
X132984749Y-84360000D01*
X132984749Y-84836190D02*
X132984749Y-86074285D01*
X132222844Y-85407619D01*
X132222844Y-85693333D01*
X132127606Y-85883809D01*
X132032368Y-85979047D01*
X131841891Y-86074285D01*
X131365701Y-86074285D01*
X131175225Y-85979047D01*
X131079987Y-85883809D01*
X130984749Y-85693333D01*
X130984749Y-85121904D01*
X131079987Y-84931428D01*
X131175225Y-84836190D01*
X132984749Y-86645714D02*
X132984749Y-87788571D01*
X130984749Y-87217142D02*
X132984749Y-87217142D01*
X132794272Y-88360000D02*
X132889511Y-88455238D01*
X132984749Y-88645714D01*
X132984749Y-89121904D01*
X132889511Y-89312380D01*
X132794272Y-89407619D01*
X132603796Y-89502857D01*
X132413320Y-89502857D01*
X132127606Y-89407619D01*
X130984749Y-88264761D01*
X130984749Y-89502857D01*
D10*
D11*
X118018558Y-79474761D02*
X118018558Y-79950952D01*
X117899511Y-80189047D01*
X117661415Y-80427142D01*
X117185225Y-80546190D01*
X116351891Y-80546190D01*
X115875701Y-80427142D01*
X115637606Y-80189047D01*
X115518558Y-79950952D01*
X115518558Y-79474761D01*
X115637606Y-79236666D01*
X115875701Y-78998571D01*
X116351891Y-78879523D01*
X117185225Y-78879523D01*
X117661415Y-78998571D01*
X117899511Y-79236666D01*
X118018558Y-79474761D01*
X117185225Y-82689047D02*
X115518558Y-82689047D01*
X117185225Y-81617619D02*
X115875701Y-81617619D01*
X115637606Y-81736666D01*
X115518558Y-81974761D01*
X115518558Y-82331904D01*
X115637606Y-82570000D01*
X115756653Y-82689047D01*
X117185225Y-83522380D02*
X117185225Y-84474761D01*
X118018558Y-83879523D02*
X115875701Y-83879523D01*
X115637606Y-83998571D01*
X115518558Y-84236666D01*
X115518558Y-84474761D01*
X116828082Y-86141428D02*
X116828082Y-85308095D01*
X115518558Y-85308095D02*
X118018558Y-85308095D01*
X118018558Y-86498571D01*
X117780463Y-87331904D02*
X117899511Y-87450952D01*
X118018558Y-87689047D01*
X118018558Y-88284285D01*
X117899511Y-88522380D01*
X117780463Y-88641428D01*
X117542368Y-88760476D01*
X117304272Y-88760476D01*
X116947130Y-88641428D01*
X115518558Y-87212857D01*
X115518558Y-88760476D01*
D10*
D11*
X132984749Y-95726666D02*
X130984749Y-96393333D01*
X132984749Y-97060000D01*
X132794272Y-97631428D02*
X132889511Y-97726666D01*
X132984749Y-97917142D01*
X132984749Y-98393333D01*
X132889511Y-98583809D01*
X132794272Y-98679047D01*
X132603796Y-98774285D01*
X132413320Y-98774285D01*
X132127606Y-98679047D01*
X130984749Y-97536190D01*
X130984749Y-98774285D01*
X132984749Y-99345714D02*
X132984749Y-100488571D01*
X130984749Y-99917142D02*
X132984749Y-99917142D01*
X132794272Y-101060000D02*
X132889511Y-101155238D01*
X132984749Y-101345714D01*
X132984749Y-101821904D01*
X132889511Y-102012380D01*
X132794272Y-102107619D01*
X132603796Y-102202857D01*
X132413320Y-102202857D01*
X132127606Y-102107619D01*
X130984749Y-100964761D01*
X130984749Y-102202857D01*
D10*
D11*
X64630952Y-21172857D02*
X62130952Y-21172857D01*
X62964285Y-19982380D02*
X64630952Y-19982380D01*
X63202380Y-19982380D02*
X63083333Y-19863333D01*
X62964285Y-19625238D01*
X62964285Y-19268095D01*
X63083333Y-19030000D01*
X63321428Y-18910952D01*
X64630952Y-18910952D01*
X63321428Y-16887142D02*
X63321428Y-17720476D01*
X64630952Y-17720476D02*
X62130952Y-17720476D01*
X62130952Y-16530000D01*
X64630952Y-14268095D02*
X64630952Y-15696666D01*
X64630952Y-14982380D02*
X62130952Y-14982380D01*
X62488095Y-15220476D01*
X62726190Y-15458571D01*
X62845238Y-15696666D01*
D10*
D11*
X132984749Y-92456190D02*
X132984749Y-93599047D01*
X130984749Y-93027619D02*
X132984749Y-93027619D01*
X132794272Y-94170476D02*
X132889511Y-94265714D01*
X132984749Y-94456190D01*
X132984749Y-94932380D01*
X132889511Y-95122857D01*
X132794272Y-95218095D01*
X132603796Y-95313333D01*
X132413320Y-95313333D01*
X132127606Y-95218095D01*
X130984749Y-94075238D01*
X130984749Y-95313333D01*
D10*
D11*
X62130952Y-157956190D02*
X62130952Y-159146666D01*
X63321428Y-159265714D01*
X63202380Y-159146666D01*
X63083333Y-158908571D01*
X63083333Y-158313333D01*
X63202380Y-158075238D01*
X63321428Y-157956190D01*
X63559523Y-157837142D01*
X64154761Y-157837142D01*
X64392857Y-157956190D01*
X64511904Y-158075238D01*
X64630952Y-158313333D01*
X64630952Y-158908571D01*
X64511904Y-159146666D01*
X64392857Y-159265714D01*
X62130952Y-157122857D02*
X64630952Y-156289523D01*
X62130952Y-155456190D01*
D10*
D11*
X103346666Y-195758571D02*
X105251428Y-195758571D01*
X104299047Y-196710952D02*
X104299047Y-194806190D01*
X107751428Y-196710952D02*
X106322857Y-196710952D01*
X107037142Y-196710952D02*
X107037142Y-194210952D01*
X106799047Y-194568095D01*
X106560952Y-194806190D01*
X106322857Y-194925238D01*
X108703809Y-194449047D02*
X108822857Y-194330000D01*
X109060952Y-194210952D01*
X109656190Y-194210952D01*
X109894285Y-194330000D01*
X110013333Y-194449047D01*
X110132380Y-194687142D01*
X110132380Y-194925238D01*
X110013333Y-195282380D01*
X108584761Y-196710952D01*
X110132380Y-196710952D01*
D10*
D11*
X76835238Y-158770000D02*
X76597142Y-158650952D01*
X76240000Y-158650952D01*
X75882857Y-158770000D01*
X75644761Y-159008095D01*
X75525714Y-159246190D01*
X75406666Y-159722380D01*
X75406666Y-160079523D01*
X75525714Y-160555714D01*
X75644761Y-160793809D01*
X75882857Y-161031904D01*
X76240000Y-161150952D01*
X76478095Y-161150952D01*
X76835238Y-161031904D01*
X76954285Y-160912857D01*
X76954285Y-160079523D01*
X76478095Y-160079523D01*
X78025714Y-161150952D02*
X78025714Y-158650952D01*
X79454285Y-161150952D01*
X79454285Y-158650952D01*
X80644761Y-161150952D02*
X80644761Y-158650952D01*
X81240000Y-158650952D01*
X81597142Y-158770000D01*
X81835238Y-159008095D01*
X81954285Y-159246190D01*
X82073333Y-159722380D01*
X82073333Y-160079523D01*
X81954285Y-160555714D01*
X81835238Y-160793809D01*
X81597142Y-161031904D01*
X81240000Y-161150952D01*
X80644761Y-161150952D01*
D10*
D11*
X117224558Y-66774761D02*
X117224558Y-67250952D01*
X117105511Y-67489047D01*
X116867415Y-67727142D01*
X116391225Y-67846190D01*
X115557891Y-67846190D01*
X115081701Y-67727142D01*
X114843606Y-67489047D01*
X114724558Y-67250952D01*
X114724558Y-66774761D01*
X114843606Y-66536666D01*
X115081701Y-66298571D01*
X115557891Y-66179523D01*
X116391225Y-66179523D01*
X116867415Y-66298571D01*
X117105511Y-66536666D01*
X117224558Y-66774761D01*
X116391225Y-69989047D02*
X114724558Y-69989047D01*
X116391225Y-68917619D02*
X115081701Y-68917619D01*
X114843606Y-69036666D01*
X114724558Y-69274761D01*
X114724558Y-69631904D01*
X114843606Y-69870000D01*
X114962653Y-69989047D01*
X116391225Y-70822380D02*
X116391225Y-71774761D01*
X117224558Y-71179523D02*
X115081701Y-71179523D01*
X114843606Y-71298571D01*
X114724558Y-71536666D01*
X114724558Y-71774761D01*
X116034082Y-73441428D02*
X116034082Y-72608095D01*
X114724558Y-72608095D02*
X117224558Y-72608095D01*
X117224558Y-73798571D01*
X114724558Y-76060476D02*
X114724558Y-74631904D01*
X114724558Y-75346190D02*
X117224558Y-75346190D01*
X116867415Y-75108095D01*
X116629320Y-74870000D01*
X116510272Y-74631904D01*
D10*
D11*
X115379562Y-125472148D02*
X112879562Y-126305481D01*
X115379562Y-127138815D01*
X112879562Y-129281672D02*
X112879562Y-127853100D01*
X112879562Y-128567386D02*
X115379562Y-128567386D01*
X115022419Y-128329291D01*
X114784324Y-128091195D01*
X114665276Y-127853100D01*
X115379562Y-129995957D02*
X115379562Y-131424529D01*
X112879562Y-130710243D02*
X115379562Y-130710243D01*
X115141467Y-132138815D02*
X115260515Y-132257862D01*
X115379562Y-132495957D01*
X115379562Y-133091195D01*
X115260515Y-133329291D01*
X115141467Y-133448338D01*
X114903372Y-133567386D01*
X114665276Y-133567386D01*
X114308134Y-133448338D01*
X112879562Y-132019767D01*
X112879562Y-133567386D01*
D10*
D11*
X67330000Y-159384761D02*
X67210952Y-159622857D01*
X67210952Y-159980000D01*
X67330000Y-160337142D01*
X67568095Y-160575238D01*
X67806190Y-160694285D01*
X68282380Y-160813333D01*
X68639523Y-160813333D01*
X69115714Y-160694285D01*
X69353809Y-160575238D01*
X69591904Y-160337142D01*
X69710952Y-159980000D01*
X69710952Y-159741904D01*
X69591904Y-159384761D01*
X69472857Y-159265714D01*
X68639523Y-159265714D01*
X68639523Y-159741904D01*
X69710952Y-158194285D02*
X67210952Y-158194285D01*
X69710952Y-156765714D01*
X67210952Y-156765714D01*
X69710952Y-155575238D02*
X67210952Y-155575238D01*
X67210952Y-154980000D01*
X67330000Y-154622857D01*
X67568095Y-154384761D01*
X67806190Y-154265714D01*
X68282380Y-154146666D01*
X68639523Y-154146666D01*
X69115714Y-154265714D01*
X69353809Y-154384761D01*
X69591904Y-154622857D01*
X69710952Y-154980000D01*
X69710952Y-155575238D01*
D10*
D11*
X118018558Y-104874761D02*
X118018558Y-105350952D01*
X117899511Y-105589047D01*
X117661415Y-105827142D01*
X117185225Y-105946190D01*
X116351891Y-105946190D01*
X115875701Y-105827142D01*
X115637606Y-105589047D01*
X115518558Y-105350952D01*
X115518558Y-104874761D01*
X115637606Y-104636666D01*
X115875701Y-104398571D01*
X116351891Y-104279523D01*
X117185225Y-104279523D01*
X117661415Y-104398571D01*
X117899511Y-104636666D01*
X118018558Y-104874761D01*
X117185225Y-108089047D02*
X115518558Y-108089047D01*
X117185225Y-107017619D02*
X115875701Y-107017619D01*
X115637606Y-107136666D01*
X115518558Y-107374761D01*
X115518558Y-107731904D01*
X115637606Y-107970000D01*
X115756653Y-108089047D01*
X117185225Y-108922380D02*
X117185225Y-109874761D01*
X118018558Y-109279523D02*
X115875701Y-109279523D01*
X115637606Y-109398571D01*
X115518558Y-109636666D01*
X115518558Y-109874761D01*
X116828082Y-111541428D02*
X116828082Y-110708095D01*
X115518558Y-110708095D02*
X118018558Y-110708095D01*
X118018558Y-111898571D01*
X117185225Y-113922380D02*
X115518558Y-113922380D01*
X118137606Y-113327142D02*
X116351891Y-112731904D01*
X116351891Y-114279523D01*
D10*
D11*
X128130952Y-21164177D02*
X125630952Y-21164177D01*
X126464285Y-19973700D02*
X128130952Y-19973700D01*
X126702380Y-19973700D02*
X126583333Y-19854653D01*
X126464285Y-19616558D01*
X126464285Y-19259415D01*
X126583333Y-19021320D01*
X126821428Y-18902272D01*
X128130952Y-18902272D01*
X126821428Y-16878462D02*
X126821428Y-17711796D01*
X128130952Y-17711796D02*
X125630952Y-17711796D01*
X125630952Y-16521320D01*
X126464285Y-14497510D02*
X128130952Y-14497510D01*
X125511904Y-15092748D02*
X127297619Y-15687986D01*
X127297619Y-14140367D01*
D10*
D11*
X91694285Y-163600000D02*
X91408571Y-163457142D01*
X90980000Y-163457142D01*
X90551428Y-163600000D01*
X90265714Y-163885714D01*
X90122857Y-164171428D01*
X89980000Y-164742857D01*
X89980000Y-165171428D01*
X90122857Y-165742857D01*
X90265714Y-166028571D01*
X90551428Y-166314285D01*
X90980000Y-166457142D01*
X91265714Y-166457142D01*
X91694285Y-166314285D01*
X91837142Y-166171428D01*
X91837142Y-165171428D01*
X91265714Y-165171428D01*
X93122857Y-166457142D02*
X93122857Y-163457142D01*
X94837142Y-166457142D01*
X94837142Y-163457142D01*
X96265714Y-166457142D02*
X96265714Y-163457142D01*
X96980000Y-163457142D01*
X97408571Y-163600000D01*
X97694285Y-163885714D01*
X97837142Y-164171428D01*
X97980000Y-164742857D01*
X97980000Y-165171428D01*
X97837142Y-165742857D01*
X97694285Y-166028571D01*
X97408571Y-166314285D01*
X96980000Y-166457142D01*
X96265714Y-166457142D01*
D10*
D11*
X87490952Y-21172857D02*
X84990952Y-21172857D01*
X85824285Y-19982380D02*
X87490952Y-19982380D01*
X86062380Y-19982380D02*
X85943333Y-19863333D01*
X85824285Y-19625238D01*
X85824285Y-19268095D01*
X85943333Y-19030000D01*
X86181428Y-18910952D01*
X87490952Y-18910952D01*
X86181428Y-16887142D02*
X86181428Y-17720476D01*
X87490952Y-17720476D02*
X84990952Y-17720476D01*
X84990952Y-16530000D01*
X85229047Y-15696666D02*
X85110000Y-15577619D01*
X84990952Y-15339523D01*
X84990952Y-14744285D01*
X85110000Y-14506190D01*
X85229047Y-14387142D01*
X85467142Y-14268095D01*
X85705238Y-14268095D01*
X86062380Y-14387142D01*
X87490952Y-15815714D01*
X87490952Y-14268095D01*
D12*
X81290463Y-40640000D03*
X81290463Y-38100000D03*
X81290463Y-35560000D03*
X81290463Y-33020000D03*
X73670463Y-33020000D03*
X73670463Y-35560000D03*
X73670463Y-38100000D03*
X73670463Y-40640000D03*
X131240000Y-43180000D03*
X131240000Y-40640000D03*
X131240000Y-38100000D03*
X131240000Y-35560000D03*
X123620000Y-35560000D03*
X123620000Y-38100000D03*
X123620000Y-40640000D03*
X123620000Y-43180000D03*
D13*
X86360000Y-190500000D03*
D14*
X91440000Y-190500000D03*
D12*
X76320000Y-80620000D03*
X76320000Y-78080000D03*
X76320000Y-75540000D03*
X76320000Y-73000000D03*
X68700000Y-73000000D03*
X68700000Y-75540000D03*
X68700000Y-78080000D03*
X68700000Y-80620000D03*
D15*
X95250000Y-176530000D03*
X92710000Y-176530000D03*
D16*
X90170000Y-176530000D03*
X87630000Y-176530000D03*
D15*
X100330000Y-138430000D03*
X97790000Y-138430000D03*
D16*
X95250000Y-138430000D03*
X92710000Y-138430000D03*
D13*
X81280000Y-167640000D03*
D14*
X76200000Y-167640000D03*
X71120000Y-167640000D03*
X66040000Y-167640000D03*
X60960000Y-167640000D03*
X55880000Y-167640000D03*
D13*
X33020000Y-157480000D03*
D14*
X38100000Y-157480000D03*
X43180000Y-157480000D03*
X48260000Y-157480000D03*
X53340000Y-157480000D03*
D13*
X124460000Y-106680000D03*
D14*
X124460000Y-111760000D03*
D13*
X124460000Y-93980000D03*
D14*
X124460000Y-99060000D03*
D13*
X124460000Y-81280000D03*
D14*
X124460000Y-86360000D03*
D13*
X139509511Y-68580000D03*
D14*
X139509511Y-73660000D03*
D13*
X139509511Y-81280000D03*
D14*
X139509511Y-86360000D03*
D13*
X139509511Y-93980000D03*
D14*
X139509511Y-99060000D03*
D13*
X139509511Y-106680000D03*
D14*
X139509511Y-111760000D03*
D13*
X135429511Y-132080000D03*
D14*
X135429511Y-127000000D03*
D13*
X124269511Y-68580000D03*
D14*
X124269511Y-73660000D03*
D13*
X132080000Y-17771320D03*
D14*
X137160000Y-17771320D03*
D13*
X111760000Y-17771320D03*
D14*
X116840000Y-17771320D03*
D13*
X91440000Y-17780000D03*
D14*
X96520000Y-17780000D03*
D13*
X68580000Y-17780000D03*
D14*
X73660000Y-17780000D03*
D13*
X135544507Y-190500000D03*
D14*
X135544507Y-185420000D03*
D13*
X135544507Y-175260000D03*
D14*
X135544507Y-170180000D03*
D13*
X135572740Y-160020000D03*
D14*
X135572740Y-154940000D03*
D13*
X135544507Y-144780000D03*
D14*
X135544507Y-139700000D03*
D17*
X111569511Y-134916349D03*
D18*
X111569511Y-119676349D03*
D17*
X63500000Y-130620000D03*
D18*
X63500000Y-115380000D03*
D17*
X81280000Y-130380000D03*
D18*
X96520000Y-130380000D03*
D17*
X81280000Y-121920000D03*
D18*
X96520000Y-121920000D03*
D17*
X77432000Y-110846000D03*
D18*
X62192000Y-110846000D03*
D17*
X64460000Y-86360000D03*
D18*
X64460000Y-71120000D03*
D17*
X80500000Y-87200000D03*
D18*
X95740000Y-87200000D03*
D17*
X80500000Y-76200000D03*
D18*
X95740000Y-76200000D03*
D17*
X77160000Y-67920000D03*
D18*
X61920000Y-67920000D03*
D17*
X104862000Y-33998000D03*
D18*
X120102000Y-33998000D03*
D17*
X120102000Y-44158000D03*
D18*
X104862000Y-44158000D03*
D17*
X135342000Y-37998000D03*
D18*
X135342000Y-53238000D03*
D17*
X119380000Y-27940000D03*
D18*
X104140000Y-27940000D03*
D17*
X53350463Y-32162640D03*
D18*
X68590463Y-32162640D03*
D17*
X68590463Y-43180000D03*
D18*
X53350463Y-43180000D03*
D17*
X85422640Y-37162640D03*
D18*
X100662640Y-37162640D03*
D17*
X68580000Y-25400000D03*
D18*
X53340000Y-25400000D03*
D17*
X126946738Y-178852383D03*
D18*
X126946738Y-194092383D03*
D17*
X119326738Y-178852383D03*
D18*
X119326738Y-194092383D03*
D17*
X111706738Y-194092383D03*
D18*
X111706738Y-178852383D03*
D17*
X126809511Y-160020000D03*
D18*
X126809511Y-175260000D03*
D17*
X119189511Y-160020000D03*
D18*
X119189511Y-175260000D03*
D17*
X111569511Y-175260000D03*
D18*
X111569511Y-160020000D03*
D17*
X126809511Y-139700000D03*
D18*
X126809511Y-154940000D03*
D17*
X119189511Y-139700000D03*
D18*
X119189511Y-154940000D03*
D17*
X111569511Y-154940000D03*
D18*
X111569511Y-139700000D03*
D17*
X119189511Y-119676349D03*
D18*
X119189511Y-134916349D03*
D17*
X126809511Y-119676349D03*
D18*
X126809511Y-134916349D03*
D19*
X101600000Y-183880000D03*
D20*
X101600000Y-196580000D03*
D17*
X76200000Y-128080000D03*
X71200000Y-128080000D03*
X74620000Y-85700000D03*
X69620000Y-85700000D03*
X117562000Y-39078000D03*
X112562000Y-39078000D03*
X66050463Y-38100000D03*
X61050463Y-38100000D03*
X86280000Y-125380000D03*
X91280000Y-125380000D03*
X85500000Y-82200000D03*
X90500000Y-82200000D03*
X140342000Y-43998000D03*
X140342000Y-48998000D03*
X88422640Y-43162640D03*
X93422640Y-43162640D03*
D21*
X81280000Y-107680000D03*
X96280000Y-107680000D03*
X80500000Y-68200000D03*
X95500000Y-68200000D03*
X124580000Y-27940000D03*
X139580000Y-27940000D03*
X73780000Y-27940000D03*
X88780000Y-27940000D03*
D22*
X21517589Y-20000000D03*
X21517589Y-42000000D03*
D13*
X109029511Y-68580000D03*
D14*
X109029511Y-73660000D03*
D17*
X53340000Y-49227000D03*
D18*
X68580000Y-49227000D03*
D13*
X20320000Y-54307000D03*
D14*
X15240000Y-54307000D03*
D17*
X48260000Y-49227000D03*
D18*
X33020000Y-49227000D03*
D19*
X85090000Y-50800000D03*
D20*
X92710000Y-50800000D03*
D19*
X80010000Y-58420000D03*
D20*
X87630000Y-58420000D03*
D23*
X35560000Y-41100000D03*
D24*
X38100000Y-41100000D03*
X40640000Y-41100000D03*
X43180000Y-41100000D03*
D25*
X39370000Y-26900000D03*
X39370000Y-32300000D03*
D15*
X26746200Y-55577000D03*
X28016200Y-53037000D03*
X29286200Y-55577000D03*
X30556200Y-53037000D03*
X31826200Y-55577000D03*
X33096200Y-53037000D03*
X65278000Y-55577000D03*
X66548000Y-53037000D03*
X72898000Y-55577000D03*
X74168000Y-53037000D03*
D13*
X109029511Y-81280000D03*
D14*
X109029511Y-86360000D03*
D13*
X109029511Y-93980000D03*
D14*
X109029511Y-99060000D03*
D13*
X109029511Y-106680000D03*
D14*
X109029511Y-111760000D03*
D15*
X26746200Y-102346000D03*
X28016200Y-99806000D03*
X29286200Y-102346000D03*
X30556200Y-99806000D03*
X31826200Y-102346000D03*
X33096200Y-99806000D03*
X65278000Y-102346000D03*
X66548000Y-99806000D03*
X72898000Y-102346000D03*
X74168000Y-99806000D03*
X25905200Y-149130000D03*
X27175200Y-146590000D03*
X28445200Y-149130000D03*
X29715200Y-146590000D03*
X30985200Y-149130000D03*
X32255200Y-146590000D03*
X64437000Y-149130000D03*
X65707000Y-146590000D03*
X72057000Y-149130000D03*
X73327000Y-146590000D03*
X26746200Y-195850000D03*
X28016200Y-193310000D03*
X29286200Y-195850000D03*
X30556200Y-193310000D03*
X31826200Y-195850000D03*
X33096200Y-193310000D03*
X65278000Y-195850000D03*
X66548000Y-193310000D03*
X72898000Y-195850000D03*
X74168000Y-193310000D03*
D17*
X53340000Y-95520000D03*
D18*
X68580000Y-95520000D03*
D17*
X52499000Y-141240000D03*
D18*
X67739000Y-141240000D03*
D17*
X53340000Y-188500000D03*
D18*
X68580000Y-188500000D03*
D13*
X20320000Y-100900000D03*
D14*
X15240000Y-100900000D03*
D13*
X20320000Y-147590010D03*
D14*
X15240000Y-147590010D03*
D13*
X20320000Y-194200000D03*
D14*
X15240000Y-194200000D03*
D19*
X80010000Y-101600000D03*
D20*
X87630000Y-101600000D03*
D19*
X72390000Y-141240000D03*
D20*
X80010000Y-141240000D03*
D19*
X72390000Y-187960000D03*
D20*
X80010000Y-187960000D03*
D19*
X77470000Y-93980000D03*
D20*
X85090000Y-93980000D03*
D19*
X64770000Y-136160000D03*
D20*
X72390000Y-136160000D03*
D19*
X59690000Y-182880000D03*
D20*
X67310000Y-182880000D03*
D23*
X35052000Y-89376000D03*
D24*
X37592000Y-89376000D03*
X40132000Y-89376000D03*
X42672000Y-89376000D03*
D25*
X38862000Y-75176000D03*
X38862000Y-80576000D03*
D23*
X34719000Y-135239000D03*
D24*
X37259000Y-135239000D03*
X39799000Y-135239000D03*
X42339000Y-135239000D03*
D25*
X38529000Y-121039000D03*
X38529000Y-126439000D03*
D23*
X34362411Y-182000000D03*
D24*
X36902411Y-182000000D03*
X39442411Y-182000000D03*
X41982411Y-182000000D03*
D25*
X38172411Y-167800000D03*
X38172411Y-173200000D03*
D22*
X21009589Y-66556000D03*
X21009589Y-88556000D03*
X20676589Y-113239000D03*
X20676589Y-135239000D03*
X20320000Y-160000000D03*
X20320000Y-182000000D03*
D17*
X48260000Y-95520000D03*
D18*
X33020000Y-95520000D03*
D17*
X47419000Y-141240000D03*
D18*
X32179000Y-141240000D03*
D17*
X48260000Y-188500000D03*
D18*
X33020000Y-188500000D03*
D12*
X77162000Y-124816000D03*
X77162000Y-122276000D03*
X77162000Y-119736000D03*
X77162000Y-117196000D03*
X69542000Y-117196000D03*
X69542000Y-119736000D03*
X69542000Y-122276000D03*
X69542000Y-124816000D03*
D26*
X81280000Y-195580000D03*
D27*
X73780000Y-27940000D02*
X73780000Y-29637056D01*
X79702944Y-35560000D02*
X81290463Y-35560000D01*
X73780000Y-29637056D02*
X79702944Y-35560000D01*
X96520000Y-170180000D02*
X90170000Y-176530000D01*
X111569511Y-160020000D02*
X106584755Y-165004755D01*
X104140000Y-170180000D02*
X104140000Y-167449510D01*
X104140000Y-170180000D02*
X96520000Y-170180000D01*
X111706738Y-178852383D02*
X104140000Y-171285645D01*
X104140000Y-167449510D02*
X106584755Y-165004755D01*
X104140000Y-171285645D02*
X104140000Y-170180000D01*
X96520000Y-93980000D02*
X90649511Y-99850489D01*
X96520000Y-93980000D02*
X99412378Y-91087622D01*
X99412378Y-91087622D02*
X104301889Y-91087622D01*
X81759511Y-99850489D02*
X80010000Y-101600000D01*
X104301889Y-91087622D02*
X109029511Y-86360000D01*
X90649511Y-99850489D02*
X81759511Y-99850489D01*
X100507414Y-89145234D02*
X102621152Y-89145234D01*
X100507414Y-89145234D02*
X82304766Y-89145234D01*
X82304766Y-89145234D02*
X77470000Y-93980000D01*
X109029511Y-82736875D02*
X109029511Y-81280000D01*
X102621152Y-89145234D02*
X109029511Y-82736875D01*
X63131623Y-104492377D02*
X56232377Y-104492377D01*
X49577360Y-32162640D02*
X40640000Y-41100000D01*
X53350463Y-32162640D02*
X49577360Y-32162640D01*
X95057630Y-134620000D02*
X76200000Y-134620000D01*
X56232377Y-104492377D02*
X55880000Y-104140000D01*
X65278000Y-60198000D02*
X66040000Y-60960000D01*
X65278000Y-55577000D02*
X65278000Y-60198000D01*
X64460000Y-86360000D02*
X55880000Y-86360000D01*
X55880000Y-60960000D02*
X55880000Y-71120000D01*
X76200000Y-134620000D02*
X72200000Y-130620000D01*
X64437000Y-150130000D02*
X64437000Y-151207630D01*
X104140000Y-60960000D02*
X104140000Y-48260000D01*
X97790000Y-138430000D02*
X97790000Y-137352370D01*
X99060000Y-43180000D02*
X104862000Y-37378000D01*
X97790000Y-137352370D02*
X95057630Y-134620000D01*
X55880000Y-71120000D02*
X55880000Y-86360000D01*
X45498000Y-129540000D02*
X55880000Y-129540000D01*
X67092104Y-60960000D02*
X66040000Y-60960000D01*
X56960000Y-130620000D02*
X55880000Y-129540000D01*
X60960000Y-60960000D02*
X104140000Y-60960000D01*
X66040000Y-60960000D02*
X55880000Y-60960000D01*
X104140000Y-48260000D02*
X99060000Y-43180000D01*
X104862000Y-37378000D02*
X104862000Y-33998000D01*
X50800000Y-170642411D02*
X50800000Y-164844630D01*
X63500000Y-130620000D02*
X56960000Y-130620000D01*
X39442411Y-182000000D02*
X50800000Y-170642411D01*
X72200000Y-130620000D02*
X63500000Y-130620000D01*
X58610489Y-157034141D02*
X64437000Y-151207630D01*
X55880000Y-104140000D02*
X55880000Y-129540000D01*
X39799000Y-135239000D02*
X45498000Y-129540000D01*
X55880000Y-86360000D02*
X55880000Y-104140000D01*
X65278000Y-102346000D02*
X63131623Y-104492377D01*
X50800000Y-164844630D02*
X64437000Y-151207630D01*
X30897711Y-57188511D02*
X34251489Y-57188511D01*
X48260000Y-49227000D02*
X49909511Y-50876511D01*
X29286200Y-55577000D02*
X30897711Y-57188511D01*
X48260000Y-49227000D02*
X42213000Y-49227000D01*
X49909511Y-50876511D02*
X66930489Y-50876511D01*
X42213000Y-49227000D02*
X34251489Y-57188511D01*
X66930489Y-50876511D02*
X68580000Y-49227000D01*
X30897711Y-103957511D02*
X39822489Y-103957511D01*
X39822489Y-103957511D02*
X48260000Y-95520000D01*
X29286200Y-102346000D02*
X30897711Y-103957511D01*
X43252749Y-98194489D02*
X47576749Y-93870489D01*
X32167711Y-98194489D02*
X43252749Y-98194489D01*
X30556200Y-99806000D02*
X32167711Y-98194489D01*
X51690489Y-93870489D02*
X53340000Y-95520000D01*
X47576749Y-93870489D02*
X51690489Y-93870489D01*
X28445200Y-149130000D02*
X30056711Y-150741511D01*
X30056711Y-150741511D02*
X38467498Y-150741511D01*
X38467498Y-150741511D02*
X47419000Y-141790009D01*
X50849489Y-139590489D02*
X36714711Y-139590489D01*
X52499000Y-141240000D02*
X50849489Y-139590489D01*
X29715200Y-146590000D02*
X33542600Y-142762600D01*
X33542600Y-142762600D02*
X35714711Y-140590489D01*
X36714711Y-139590489D02*
X33542600Y-142762600D01*
X29286200Y-195850000D02*
X30897711Y-197461511D01*
X34375222Y-195580000D02*
X42180000Y-195580000D01*
X32493711Y-197461511D02*
X34375222Y-195580000D01*
X42180000Y-195580000D02*
X48260000Y-189500000D01*
X30897711Y-197461511D02*
X32493711Y-197461511D01*
X51690489Y-186850489D02*
X53340000Y-188500000D01*
X37015711Y-186850489D02*
X51690489Y-186850489D01*
X30556200Y-193310000D02*
X37015711Y-186850489D01*
X81290463Y-33020000D02*
X83830463Y-30480000D01*
X68580000Y-25400000D02*
X71730489Y-28550489D01*
X118224078Y-42407316D02*
X106296762Y-30480000D01*
X106296762Y-30480000D02*
X86360000Y-30480000D01*
X83830463Y-30480000D02*
X106296762Y-30480000D01*
X73660000Y-38100000D02*
X73670463Y-38100000D01*
X118224078Y-67614567D02*
X118224078Y-42407316D01*
X124269511Y-73660000D02*
X118224078Y-67614567D01*
X71730489Y-36170489D02*
X73660000Y-38100000D01*
X71730489Y-28550489D02*
X71730489Y-36170489D01*
X126809511Y-42482473D02*
X124967038Y-40640000D01*
X124460000Y-86360000D02*
X126809511Y-84010489D01*
X126809511Y-84010489D02*
X126809511Y-42482473D01*
X124967038Y-40640000D02*
X123620000Y-40640000D01*
X123698044Y-40640000D02*
X123620000Y-40640000D01*
X121920000Y-81470489D02*
X121920000Y-96520000D01*
X103089514Y-77880003D02*
X118329514Y-77880003D01*
X118329514Y-77880003D02*
X121920000Y-81470489D01*
X76320000Y-73000000D02*
X98209511Y-73000000D01*
X121920000Y-96520000D02*
X124460000Y-99060000D01*
X98209511Y-73000000D02*
X103089514Y-77880003D01*
X93216992Y-103376992D02*
X115840888Y-103376992D01*
X115937877Y-103280003D02*
X120698081Y-103280003D01*
X115840888Y-103376992D02*
X115937877Y-103280003D01*
X121920000Y-104501922D02*
X121920000Y-109220000D01*
X85747984Y-110846000D02*
X93216992Y-103376992D01*
X120698081Y-103280003D02*
X121920000Y-104501922D01*
X121920000Y-109220000D02*
X124460000Y-111760000D01*
X77432000Y-110846000D02*
X85747984Y-110846000D01*
X129349511Y-160020000D02*
X129349511Y-154940000D01*
X129349511Y-177800000D02*
X129349511Y-175260000D01*
X126809511Y-139700000D02*
X129349511Y-139700000D01*
X129349511Y-154940000D02*
X129349511Y-139700000D01*
X135544507Y-185420000D02*
X129349511Y-179225004D01*
X126809511Y-160020000D02*
X129349511Y-160020000D01*
X128297128Y-178852383D02*
X129349511Y-177800000D01*
X129349511Y-179225004D02*
X129349511Y-175260000D01*
X129349511Y-134620000D02*
X129349511Y-122216349D01*
X129349511Y-175260000D02*
X129349511Y-170180000D01*
X129349511Y-127000000D02*
X129349511Y-134620000D01*
X126946738Y-178852383D02*
X128297128Y-178852383D01*
X135429511Y-127000000D02*
X129349511Y-127000000D01*
X129349511Y-122216349D02*
X126809511Y-119676349D01*
X135544507Y-139700000D02*
X129349511Y-139700000D01*
X135544507Y-170180000D02*
X129349511Y-170180000D01*
X135572740Y-154940000D02*
X129349511Y-154940000D01*
X129349511Y-139700000D02*
X129349511Y-134620000D01*
X129349511Y-170180000D02*
X129349511Y-160020000D01*
M02*
