EESchema Schematic File Version 4
LIBS:dataloggerV3-cache
EELAYER 26 0
EELAYER END
$Descr A4 11693 8268
encoding utf-8
Sheet 1 1
Title ""
Date ""
Rev ""
Comp ""
Comment1 ""
Comment2 ""
Comment3 ""
Comment4 ""
$EndDescr
$Comp
L V3_sensor:R-RESCUE-Capteur_de_temperature R5
U 1 1 599B52E6
P 3500 6750
F 0 "R5" V 3580 6750 40  0000 C CNN
F 1 "1000 Ohm" V 3507 6751 40  0000 C CNN
F 2 "Resistor_THT:R_Axial_DIN0207_L6.3mm_D2.5mm_P15.24mm_Horizontal" V 3430 6750 30  0001 C CNN
F 3 "~" H 3500 6750 30  0000 C CNN
	1    3500 6750
	-1   0    0    1   
$EndComp
$Comp
L V3_sensor:R-RESCUE-Capteur_de_temperature R7
U 1 1 599B52ED
P 3150 6500
F 0 "R7" V 3230 6500 40  0000 C CNN
F 1 "1000Ohm" V 3157 6501 40  0000 C CNN
F 2 "Resistor_THT:R_Axial_DIN0207_L6.3mm_D2.5mm_P15.24mm_Horizontal" V 3080 6500 30  0001 C CNN
F 3 "~" H 3150 6500 30  0000 C CNN
	1    3150 6500
	0    1    1    0   
$EndComp
$Comp
L V3_sensor:R-RESCUE-Capteur_de_temperature R8
U 1 1 599B52F4
P 2850 6750
F 0 "R8" V 2930 6750 40  0000 C CNN
F 1 "1000Ohm" V 2857 6751 40  0000 C CNN
F 2 "Resistor_THT:R_Axial_DIN0207_L6.3mm_D2.5mm_P15.24mm_Horizontal" V 2780 6750 30  0001 C CNN
F 3 "~" H 2850 6750 30  0000 C CNN
	1    2850 6750
	-1   0    0    1   
$EndComp
$Comp
L V3_sensor:GND-RESCUE-Capteur_de_temperature #PWR0101
U 1 1 599B532F
P 3500 6300
F 0 "#PWR0101" H 3500 6300 30  0001 C CNN
F 1 "GND-RESCUE-Capteur_de_temperature" H 3500 6230 30  0001 C CNN
F 2 "" H 3500 6300 60  0000 C CNN
F 3 "" H 3500 6300 60  0000 C CNN
	1    3500 6300
	-1   0    0    1   
$EndComp
Text Notes 1150 950  0    39   ~ 0
Meas Flow 1\n\n
$Comp
L Device:C C3
U 1 1 5A57B5AE
P 1400 1100
F 0 "C3" H 1400 1200 40  0000 L CNN
F 1 "0.47uF" H 1406 1015 40  0000 L CNN
F 2 "Capacitor_THT:C_Rect_L7.2mm_W3.5mm_P5.00mm_FKS2_FKP2_MKS2_MKP2" H 1438 950 30  0001 C CNN
F 3 "~" H 1400 1100 60  0000 C CNN
	1    1400 1100
	-1   0    0    1   
$EndComp
$Comp
L Device:C C1
U 1 1 5A57B5B4
P 1000 2050
F 0 "C1" H 1000 2150 40  0000 L CNN
F 1 "2.2uF" H 1006 1965 40  0000 L CNN
F 2 "Capacitor_THT:C_Rect_L18.0mm_W6.0mm_P15.00mm_FKS3_FKP3" H 1038 1900 30  0001 C CNN
F 3 "~" H 1000 2050 60  0000 C CNN
	1    1000 2050
	0    1    1    0   
$EndComp
$Comp
L Device:R R19
U 1 1 5A57B5BA
P 1250 1350
F 0 "R19" V 1330 1350 40  0000 C CNN
F 1 "200kOhm" V 1257 1351 40  0000 C CNN
F 2 "Resistor_THT:R_Axial_DIN0207_L6.3mm_D2.5mm_P15.24mm_Horizontal" V 1180 1350 30  0001 C CNN
F 3 "~" H 1250 1350 30  0000 C CNN
	1    1250 1350
	0    1    1    0   
$EndComp
$Comp
L Device:R R18
U 1 1 5A57B5C0
P 1000 1800
F 0 "R18" V 1080 1800 40  0000 C CNN
F 1 "20kOhm" V 1007 1801 40  0000 C CNN
F 2 "Resistor_THT:R_Axial_DIN0207_L6.3mm_D2.5mm_P15.24mm_Horizontal" V 930 1800 30  0001 C CNN
F 3 "~" H 1000 1800 30  0000 C CNN
	1    1000 1800
	0    1    1    0   
$EndComp
$Comp
L Device:R R20
U 1 1 5A57B5C6
P 3000 1750
F 0 "R20" V 3080 1750 40  0000 C CNN
F 1 "475Ohm" V 3007 1751 40  0000 C CNN
F 2 "Resistor_THT:R_Axial_DIN0207_L6.3mm_D2.5mm_P15.24mm_Horizontal" V 2930 1750 30  0001 C CNN
F 3 "~" H 3000 1750 30  0000 C CNN
	1    3000 1750
	0    1    1    0   
$EndComp
$Comp
L power:GND #PWR0121
U 1 1 5A57B5D8
P 2850 1550
F 0 "#PWR0121" H 2850 1550 30  0001 C CNN
F 1 "GND" H 2850 1480 30  0001 C CNN
F 2 "" H 2850 1550 60  0000 C CNN
F 3 "" H 2850 1550 60  0000 C CNN
	1    2850 1550
	0    -1   -1   0   
$EndComp
$Comp
L power:GND #PWR0122
U 1 1 5A57B5E4
P 1100 1350
F 0 "#PWR0122" H 1100 1350 30  0001 C CNN
F 1 "GND" H 1100 1280 30  0001 C CNN
F 2 "" H 1100 1350 60  0000 C CNN
F 3 "" H 1100 1350 60  0000 C CNN
	1    1100 1350
	0    1    1    0   
$EndComp
$Comp
L Device:C C2
U 1 1 5A57B5EA
P 1250 1650
F 0 "C2" H 1250 1750 40  0000 L CNN
F 1 "22nF" H 1100 1550 40  0000 L CNN
F 2 "Capacitor_THT:C_Rect_L7.2mm_W2.5mm_P5.00mm_FKS2_FKP2_MKS2_MKP2" H 1288 1500 30  0001 C CNN
F 3 "~" H 1250 1650 60  0000 C CNN
	1    1250 1650
	0    1    1    0   
$EndComp
$Comp
L power:GND #PWR0123
U 1 1 5A57B5F0
P 1100 1650
F 0 "#PWR0123" H 1100 1650 30  0001 C CNN
F 1 "GND" H 1100 1580 30  0001 C CNN
F 2 "" H 1100 1650 60  0000 C CNN
F 3 "" H 1100 1650 60  0000 C CNN
	1    1100 1650
	0    1    1    0   
$EndComp
Text Notes 2000 1250 0    59   Italic 12
SFRP1\n
$Comp
L Device:R R17
U 1 1 5A57B6D5
P 1400 2100
F 0 "R17" V 1480 2100 40  0000 C CNN
F 1 "20kOhm" V 1400 2100 40  0000 C CNN
F 2 "Resistor_THT:R_Axial_DIN0207_L6.3mm_D2.5mm_P15.24mm_Horizontal" V 1330 2100 30  0001 C CNN
F 3 "~" H 1400 2100 30  0000 C CNN
	1    1400 2100
	0    -1   1    0   
$EndComp
$Comp
L power:GND #PWR0124
U 1 1 5A57B6E1
P 1550 2100
F 0 "#PWR0124" H 1550 2100 30  0001 C CNN
F 1 "GND" H 1550 2030 30  0001 C CNN
F 2 "" H 1550 2100 60  0000 C CNN
F 3 "" H 1550 2100 60  0000 C CNN
	1    1550 2100
	0    -1   1    0   
$EndComp
Text Label 10500 3100 0    60   ~ 0
+12
$Comp
L V3_connector:Conn_01x02 J3
U 1 1 5A5855AD
P 11000 3000
F 0 "J3" H 11000 3200 50  0000 C CNN
F 1 "SupplyMPPT" H 11000 2800 50  0000 C CNN
F 2 "TerminalBlock:TerminalBlock_bornier-2_P5.08mm" H 11000 3000 50  0001 C CNN
F 3 "" H 11000 3000 50  0001 C CNN
	1    11000 3000
	1    0    0    -1  
$EndComp
$Comp
L power:GND #PWR0133
U 1 1 5A586497
P 10800 3000
F 0 "#PWR0133" H 10800 3000 30  0001 C CNN
F 1 "GND" H 10800 2930 30  0001 C CNN
F 2 "" H 10800 3000 60  0000 C CNN
F 3 "" H 10800 3000 60  0000 C CNN
	1    10800 3000
	0    1    1    0   
$EndComp
$Comp
L V3_connector:CONN_2 P1
U 1 1 5A586942
P 1500 6000
F 0 "P1" V 1450 6000 40  0000 C CNN
F 1 "CONN_2" V 1550 6000 40  0000 C CNN
F 2 "TerminalBlock:TerminalBlock_bornier-2_P5.08mm" H 1500 6000 60  0001 C CNN
F 3 "" H 1500 6000 60  0000 C CNN
	1    1500 6000
	-1   0    0    1   
$EndComp
$Comp
L V3_sensor:GND-RESCUE-Capteur_de_temperature #PWR0134
U 1 1 5A58734A
P 1950 6100
F 0 "#PWR0134" H 1950 6100 30  0001 C CNN
F 1 "GND-RESCUE-Capteur_de_temperature" H 1950 6030 30  0001 C CNN
F 2 "" H 1950 6100 60  0000 C CNN
F 3 "" H 1950 6100 60  0000 C CNN
	1    1950 6100
	0    -1   1    0   
$EndComp
Text Label 1800 5900 0    60   ~ 0
3,3V
Text Notes 5750 7500 0    48   ~ 0
1: in rasp_alim 5V\n2,3,4: 5V flowsensors\n5: GND RPI
$Comp
L power:GND #PWR0136
U 1 1 5A6B5365
P 10000 3000
F 0 "#PWR0136" H 10000 3000 30  0001 C CNN
F 1 "GND" H 10000 2930 30  0001 C CNN
F 2 "" H 10000 3000 60  0000 C CNN
F 3 "" H 10000 3000 60  0000 C CNN
	1    10000 3000
	0    -1   1    0   
$EndComp
$Comp
L power:GND #PWR0137
U 1 1 5A6B5419
P 8900 3200
F 0 "#PWR0137" H 8900 3200 30  0001 C CNN
F 1 "GND" H 8900 3130 30  0001 C CNN
F 2 "" H 8900 3200 60  0000 C CNN
F 3 "" H 8900 3200 60  0000 C CNN
	1    8900 3200
	0    1    -1   0   
$EndComp
Text Label 8650 3300 0    60   ~ 0
15V
Text Label 10100 3100 0    60   ~ 0
12V
$Comp
L power:GND #PWR0138
U 1 1 5A6B8E40
P 1500 800
F 0 "#PWR0138" H 1500 800 30  0001 C CNN
F 1 "GND" H 1500 730 30  0001 C CNN
F 2 "" H 1500 800 60  0000 C CNN
F 3 "" H 1500 800 60  0000 C CNN
	1    1500 800 
	0    1    -1   0   
$EndComp
$Comp
L V3_sensor:LM2907 U1
U 1 1 5A57B5DE
P 2000 1600
F 0 "U1" V 1850 1700 60  0000 C CNN
F 1 "LM2907" V 1750 1700 60  0000 C CNN
F 2 "Power_Integrations:PDIP-8" H 2450 1400 60  0001 C CNN
F 3 "" H 2450 1400 60  0001 C CNN
	1    2000 1600
	0    1    1    0   
$EndComp
$Comp
L V3_connector:Conn_01x05 J20
U 1 1 5A6BE0FD
P 6050 7000
F 0 "J20" H 6050 7300 50  0000 C CNN
F 1 "Conn_01x05" H 6050 6700 50  0000 C CNN
F 2 "TerminalBlock:TerminalBlock_bornier-5_P5.08mm" H 6050 7000 50  0001 C CNN
F 3 "" H 6050 7000 50  0001 C CNN
	1    6050 7000
	0    -1   -1   0   
$EndComp
$Comp
L power:GND #PWR0139
U 1 1 5A6BE4A3
P 6250 7200
F 0 "#PWR0139" H 6250 7200 30  0001 C CNN
F 1 "GND" H 6250 7130 30  0001 C CNN
F 2 "" H 6250 7200 60  0000 C CNN
F 3 "" H 6250 7200 60  0000 C CNN
	1    6250 7200
	1    0    0    -1  
$EndComp
Wire Wire Line
	3500 6500 3400 6500
Wire Wire Line
	3500 6500 3500 6300
Wire Wire Line
	2850 7000 2850 7050
Connection ~ 3300 7000
Wire Wire Line
	1400 950  1400 900 
Wire Wire Line
	1150 1750 1400 1750
Wire Wire Line
	1150 1750 1150 1800
Connection ~ 1150 1800
Wire Wire Line
	1400 1850 1250 1850
Wire Wire Line
	3150 1750 3150 1850
Wire Wire Line
	3150 1850 2850 1850
Wire Wire Line
	2850 1650 3200 1650
Wire Wire Line
	3200 1650 3200 2000
Wire Wire Line
	3200 2000 1400 2000
Wire Wire Line
	1400 2000 1400 1850
Connection ~ 1400 1850
Wire Wire Line
	1400 1250 1400 1350
Connection ~ 1400 1350
Wire Wire Line
	1500 800  1600 800 
Wire Wire Line
	5850 7200 5950 7200
Wire Wire Line
	3500 7000 3300 7000
$Comp
L power:GND #PWR0140
U 1 1 5A872E4E
P 850 1800
F 0 "#PWR0140" H 850 1800 30  0001 C CNN
F 1 "GND" H 850 1730 30  0001 C CNN
F 2 "" H 850 1800 60  0000 C CNN
F 3 "" H 850 1800 60  0000 C CNN
	1    850  1800
	0    1    1    0   
$EndComp
$Comp
L power:GND #PWR0141
U 1 1 5A872F94
P 850 2050
F 0 "#PWR0141" H 850 2050 30  0001 C CNN
F 1 "GND" H 850 1980 30  0001 C CNN
F 2 "" H 850 2050 60  0000 C CNN
F 3 "" H 850 2050 60  0000 C CNN
	1    850  2050
	0    1    1    0   
$EndComp
Wire Wire Line
	3300 7000 3300 7150
Wire Wire Line
	3300 7150 3600 7150
Wire Wire Line
	3600 7150 3600 6200
Wire Wire Line
	3600 6200 2950 6200
Wire Wire Line
	2950 6200 2950 6400
$Comp
L power:GND #PWR0142
U 1 1 5A871BEE
P 3950 7350
F 0 "#PWR0142" H 3950 7100 50  0001 C CNN
F 1 "GND" H 3950 7200 50  0000 C CNN
F 2 "" H 3950 7350 50  0001 C CNN
F 3 "" H 3950 7350 50  0001 C CNN
	1    3950 7350
	1    0    0    -1  
$EndComp
Wire Wire Line
	3950 7200 4200 7200
Wire Wire Line
	3950 7300 4100 7300
Wire Wire Line
	4200 7400 4100 7400
Wire Wire Line
	4100 7400 4100 7300
Connection ~ 4100 7300
$Comp
L power:GND #PWR0143
U 1 1 5A8F198E
P 1450 2300
F 0 "#PWR0143" H 1450 2050 50  0001 C CNN
F 1 "GND" H 1450 2150 50  0000 C CNN
F 2 "" H 1450 2300 50  0001 C CNN
F 3 "" H 1450 2300 50  0001 C CNN
	1    1450 2300
	0    -1   1    0   
$EndComp
$Comp
L power:GND #PWR0146
U 1 1 5A8F25EF
P 8900 3100
F 0 "#PWR0146" H 8900 3100 30  0001 C CNN
F 1 "GND" H 8900 3030 30  0001 C CNN
F 2 "" H 8900 3100 60  0000 C CNN
F 3 "" H 8900 3100 60  0000 C CNN
	1    8900 3100
	0    1    -1   0   
$EndComp
$Comp
L power:GND #PWR0147
U 1 1 5A8F26E4
P 10000 2900
F 0 "#PWR0147" H 10000 2900 30  0001 C CNN
F 1 "GND" H 10000 2830 30  0001 C CNN
F 2 "" H 10000 2900 60  0000 C CNN
F 3 "" H 10000 2900 60  0000 C CNN
	1    10000 2900
	0    -1   1    0   
$EndComp
Wire Wire Line
	10200 3100 10000 3100
Connection ~ 6050 7200
Connection ~ 5950 7200
$Comp
L Device:D D7
U 1 1 5A9EBBB3
P 10350 3100
F 0 "D7" H 10350 3200 50  0000 C CNN
F 1 "D" H 10350 3000 50  0000 C CNN
F 2 "Diode_THT:D_A-405_P12.70mm_Horizontal" H 10350 3100 50  0001 C CNN
F 3 "" H 10350 3100 50  0001 C CNN
	1    10350 3100
	1    0    0    -1  
$EndComp
Wire Wire Line
	3300 7000 3050 7000
Wire Wire Line
	1150 1800 1150 2050
Wire Wire Line
	1400 1350 1400 1550
Wire Wire Line
	4100 7300 4200 7300
Wire Wire Line
	6050 7200 6150 7200
Wire Wire Line
	5950 7200 6050 7200
$Comp
L V3_connector:Conn_01x06 J21
U 1 1 5A871AD8
P 4400 7100
F 0 "J21" H 4400 7400 50  0000 C CNN
F 1 "Conn_01x06" H 4400 6700 50  0000 C CNN
F 2 "TerminalBlock:TerminalBlock_bornier-6_P5.08mm" H 4400 7100 50  0001 C CNN
F 3 "" H 4400 7100 50  0001 C CNN
	1    4400 7100
	1    0    0    -1  
$EndComp
Wire Wire Line
	4200 7100 3950 7100
Wire Wire Line
	4200 7000 3950 7000
Wire Wire Line
	4200 6900 3950 6900
$Comp
L V3_sensor:AD202JY U10
U 1 1 5C525798
P 8750 4050
F 0 "U10" H 8800 4525 50  0000 C CNN
F 1 "AD202JY" H 8800 4434 50  0000 C CNN
F 2 "Package_SIP:AD202-SIP" H 8800 3600 50  0001 C CNN
F 3 "" H 8750 4400 50  0001 C CNN
	1    8750 4050
	-1   0    0    -1  
$EndComp
$Comp
L Sensor_Current:HX50-P-SP2 U9
U 1 1 5C525B01
P 10350 4400
F 0 "U9" V 10791 4446 50  0000 L CNN
F 1 "HX50-P-SP2" V 10791 4355 50  0000 R TNN
F 2 "Sensor_Current:LEM_HX50-P-SP2" H 10350 4400 50  0001 L CNN
F 3 "https://www.lem.com/sites/default/files/products_datasheets/hx%203_50-p_sp2_e%20v07.pdf" H 10350 4400 50  0001 C CNN
	1    10350 4400
	0    -1   1    0   
$EndComp
NoConn ~ 9350 4300
NoConn ~ 9350 4200
$Comp
L Device:R R38
U 1 1 5C5A6EAD
P 9550 3800
F 0 "R38" V 9343 3800 50  0000 C CNN
F 1 "20kOhm" V 9434 3800 50  0000 C CNN
F 2 "Resistor_THT:R_Axial_DIN0207_L6.3mm_D2.5mm_P15.24mm_Horizontal" V 9480 3800 50  0001 C CNN
F 3 "~" H 9550 3800 50  0001 C CNN
	1    9550 3800
	0    -1   1    0   
$EndComp
$Comp
L Device:R R37
U 1 1 5C5BB665
P 9900 3900
F 0 "R37" V 9693 3900 50  0000 C CNN
F 1 "2MOhm" V 9784 3900 50  0000 C CNN
F 2 "Resistor_THT:R_Axial_DIN0207_L6.3mm_D2.5mm_P15.24mm_Horizontal" V 9830 3900 50  0001 C CNN
F 3 "~" H 9900 3900 50  0001 C CNN
	1    9900 3900
	0    -1   1    0   
$EndComp
Wire Wire Line
	9700 3800 9700 3900
Wire Wire Line
	9700 3900 9750 3900
Wire Wire Line
	9700 3900 9350 3900
Connection ~ 9700 3900
Wire Wire Line
	9350 3800 9400 3800
$Comp
L power:GND #PWR0103
U 1 1 5C5FAA19
P 10850 4300
F 0 "#PWR0103" H 10850 4050 50  0001 C CNN
F 1 "GND" H 10855 4127 50  0000 C CNN
F 2 "" H 10850 4300 50  0001 C CNN
F 3 "" H 10850 4300 50  0001 C CNN
	1    10850 4300
	1    0    0    1   
$EndComp
$Comp
L power:GND #PWR0104
U 1 1 5C617CED
P 7900 4050
F 0 "#PWR0104" H 7900 3800 50  0001 C CNN
F 1 "GND" H 7905 3877 50  0001 C CNN
F 2 "" H 7900 4050 50  0001 C CNN
F 3 "" H 7900 4050 50  0001 C CNN
	1    7900 4050
	0    -1   1    0   
$EndComp
Wire Wire Line
	7900 4250 7900 4050
Wire Wire Line
	7900 3950 8050 3950
Wire Wire Line
	7900 4250 8050 4250
Wire Wire Line
	8050 4150 8000 4150
Wire Wire Line
	8000 4150 8000 4400
Wire Wire Line
	8000 4400 8500 4400
Connection ~ 7900 4050
Wire Wire Line
	7900 4050 7900 3950
Wire Wire Line
	10850 4300 10850 4400
Wire Wire Line
	10750 4400 10850 4400
Connection ~ 10850 4400
Wire Wire Line
	10850 4400 10850 4500
Wire Wire Line
	10750 4500 10850 4500
Wire Wire Line
	9350 4100 9350 4050
$Comp
L V3_sensor:R-RESCUE-Capteur_de_temperature R9
U 1 1 5C5C2993
P 3500 5300
F 0 "R9" V 3580 5300 40  0000 C CNN
F 1 "1000 Ohm" V 3507 5301 40  0000 C CNN
F 2 "Resistor_THT:R_Axial_DIN0207_L6.3mm_D2.5mm_P15.24mm_Horizontal" V 3430 5300 30  0001 C CNN
F 3 "~" H 3500 5300 30  0000 C CNN
	1    3500 5300
	-1   0    0    -1  
$EndComp
$Comp
L V3_sensor:R-RESCUE-Capteur_de_temperature R11
U 1 1 5C5C299A
P 3150 5550
F 0 "R11" V 3230 5550 40  0000 C CNN
F 1 "1000Ohm" V 3157 5551 40  0000 C CNN
F 2 "Resistor_THT:R_Axial_DIN0207_L6.3mm_D2.5mm_P15.24mm_Horizontal" V 3080 5550 30  0001 C CNN
F 3 "~" H 3150 5550 30  0000 C CNN
	1    3150 5550
	0    1    -1   0   
$EndComp
$Comp
L V3_sensor:R-RESCUE-Capteur_de_temperature R12
U 1 1 5C5C29A1
P 2850 5300
F 0 "R12" V 2930 5300 40  0000 C CNN
F 1 "1000Ohm" V 2857 5301 40  0000 C CNN
F 2 "Resistor_THT:R_Axial_DIN0207_L6.3mm_D2.5mm_P15.24mm_Horizontal" V 2780 5300 30  0001 C CNN
F 3 "~" H 2850 5300 30  0000 C CNN
	1    2850 5300
	-1   0    0    -1  
$EndComp
$Comp
L V3_sensor:GND-RESCUE-Capteur_de_temperature #PWR0105
U 1 1 5C5C29A8
P 3500 5750
F 0 "#PWR0105" H 3500 5750 30  0001 C CNN
F 1 "GND-RESCUE-Capteur_de_temperature" H 3500 5680 30  0001 C CNN
F 2 "" H 3500 5750 60  0000 C CNN
F 3 "" H 3500 5750 60  0000 C CNN
	1    3500 5750
	-1   0    0    -1  
$EndComp
Wire Wire Line
	3500 5550 3400 5550
Wire Wire Line
	3500 5550 3500 5750
Wire Wire Line
	2850 5050 2850 5000
Connection ~ 3300 5050
Wire Wire Line
	3500 5050 3300 5050
Wire Wire Line
	3300 5050 3300 4900
Wire Wire Line
	3300 4900 3600 4900
Wire Wire Line
	3600 4900 3600 5850
Wire Wire Line
	3600 5850 2950 5850
Wire Wire Line
	2950 5850 2950 5650
Text Notes 1150 5459 2    59   Italic 12
STPVP4\n\n
$Comp
L V3_connector:CONN_2 P6
U 1 1 5A577E99
P 1350 2650
F 0 "P6" V 1300 2650 40  0000 C CNN
F 1 "CONN_2" V 1400 2650 40  0000 C CNN
F 2 "TerminalBlock:TerminalBlock_bornier-2_P5.08mm" H 1350 2650 60  0001 C CNN
F 3 "" H 1350 2650 60  0000 C CNN
	1    1350 2650
	0    1    1    0   
$EndComp
$Comp
L V3_sensor:R-RESCUE-Capteur_de_temperature R13
U 1 1 5C656CB0
P 650 5300
F 0 "R13" V 730 5300 40  0000 C CNN
F 1 "1000 Ohm" V 657 5301 40  0000 C CNN
F 2 "Resistor_THT:R_Axial_DIN0207_L6.3mm_D2.5mm_P15.24mm_Horizontal" V 580 5300 30  0001 C CNN
F 3 "~" H 650 5300 30  0000 C CNN
	1    650  5300
	1    0    0    -1  
$EndComp
$Comp
L V3_sensor:R-RESCUE-Capteur_de_temperature R15
U 1 1 5C656CB7
P 1000 5550
F 0 "R15" V 1080 5550 40  0000 C CNN
F 1 "1000Ohm" V 1007 5551 40  0000 C CNN
F 2 "Resistor_THT:R_Axial_DIN0207_L6.3mm_D2.5mm_P15.24mm_Horizontal" V 930 5550 30  0001 C CNN
F 3 "~" H 1000 5550 30  0000 C CNN
	1    1000 5550
	0    -1   -1   0   
$EndComp
$Comp
L V3_sensor:R-RESCUE-Capteur_de_temperature R16
U 1 1 5C656CBE
P 1300 5300
F 0 "R16" V 1380 5300 40  0000 C CNN
F 1 "1000Ohm" V 1307 5301 40  0000 C CNN
F 2 "Resistor_THT:R_Axial_DIN0207_L6.3mm_D2.5mm_P15.24mm_Horizontal" V 1230 5300 30  0001 C CNN
F 3 "~" H 1300 5300 30  0000 C CNN
	1    1300 5300
	1    0    0    -1  
$EndComp
$Comp
L V3_sensor:GND-RESCUE-Capteur_de_temperature #PWR0106
U 1 1 5C656CC5
P 650 5750
F 0 "#PWR0106" H 650 5750 30  0001 C CNN
F 1 "GND-RESCUE-Capteur_de_temperature" H 650 5680 30  0001 C CNN
F 2 "" H 650 5750 60  0000 C CNN
F 3 "" H 650 5750 60  0000 C CNN
	1    650  5750
	1    0    0    -1  
$EndComp
Wire Wire Line
	650  5550 750  5550
Wire Wire Line
	650  5550 650  5750
Wire Wire Line
	1300 5050 1300 5000
Connection ~ 850  5050
Wire Wire Line
	650  5050 850  5050
Wire Wire Line
	850  5050 850  4900
Wire Wire Line
	850  4900 550  4900
Wire Wire Line
	550  4900 550  5850
Wire Wire Line
	550  5850 1200 5850
Wire Wire Line
	1200 5850 1200 5650
$Comp
L V3_sensor:R-RESCUE-Capteur_de_temperature R1
U 1 1 5C6960CB
P 650 6750
F 0 "R1" V 730 6750 40  0000 C CNN
F 1 "1000 Ohm" V 657 6751 40  0000 C CNN
F 2 "Resistor_THT:R_Axial_DIN0207_L6.3mm_D2.5mm_P15.24mm_Horizontal" V 580 6750 30  0001 C CNN
F 3 "~" H 650 6750 30  0000 C CNN
	1    650  6750
	1    0    0    1   
$EndComp
$Comp
L V3_sensor:R-RESCUE-Capteur_de_temperature R3
U 1 1 5C6960D2
P 1000 6500
F 0 "R3" V 1080 6500 40  0000 C CNN
F 1 "1000Ohm" V 1007 6501 40  0000 C CNN
F 2 "Resistor_THT:R_Axial_DIN0207_L6.3mm_D2.5mm_P15.24mm_Horizontal" V 930 6500 30  0001 C CNN
F 3 "~" H 1000 6500 30  0000 C CNN
	1    1000 6500
	0    -1   1    0   
$EndComp
$Comp
L V3_sensor:R-RESCUE-Capteur_de_temperature R4
U 1 1 5C6960D9
P 1300 6750
F 0 "R4" V 1380 6750 40  0000 C CNN
F 1 "1000Ohm" V 1307 6751 40  0000 C CNN
F 2 "Resistor_THT:R_Axial_DIN0207_L6.3mm_D2.5mm_P15.24mm_Horizontal" V 1230 6750 30  0001 C CNN
F 3 "~" H 1300 6750 30  0000 C CNN
	1    1300 6750
	1    0    0    1   
$EndComp
$Comp
L V3_sensor:GND-RESCUE-Capteur_de_temperature #PWR0125
U 1 1 5C6960E0
P 650 6300
F 0 "#PWR0125" H 650 6300 30  0001 C CNN
F 1 "GND-RESCUE-Capteur_de_temperature" H 650 6230 30  0001 C CNN
F 2 "" H 650 6300 60  0000 C CNN
F 3 "" H 650 6300 60  0000 C CNN
	1    650  6300
	1    0    0    1   
$EndComp
Wire Wire Line
	650  6500 750  6500
Wire Wire Line
	650  6500 650  6300
Wire Wire Line
	1300 7000 1300 7050
Connection ~ 850  7000
Wire Wire Line
	650  7000 850  7000
Wire Wire Line
	850  7000 850  7150
Wire Wire Line
	850  7150 550  7150
Wire Wire Line
	550  7150 550  6200
Wire Wire Line
	550  6200 1200 6200
Wire Wire Line
	1200 6200 1200 6400
Wire Wire Line
	850  7000 1100 7000
Wire Wire Line
	1300 5000 2100 5000
Wire Wire Line
	1850 6100 1950 6100
Connection ~ 2100 5000
Wire Wire Line
	2100 5000 2850 5000
Wire Wire Line
	1850 5900 2100 5900
Connection ~ 2100 5900
Wire Wire Line
	2100 5900 2100 7050
$Comp
L V3_sensor:AD202JY U8
U 1 1 5C82FB79
P 8750 5950
F 0 "U8" H 8800 6425 50  0000 C CNN
F 1 "AD202JY" H 8800 6334 50  0000 C CNN
F 2 "Package_SIP:AD202-SIP" H 8800 5500 50  0001 C CNN
F 3 "" H 8750 6300 50  0001 C CNN
	1    8750 5950
	-1   0    0    1   
$EndComp
NoConn ~ 9350 5700
NoConn ~ 9350 5800
$Comp
L Device:R R36
U 1 1 5C82FB89
P 9550 6200
F 0 "R36" V 9343 6200 50  0000 C CNN
F 1 "20kOhm" V 9434 6200 50  0000 C CNN
F 2 "Resistor_THT:R_Axial_DIN0207_L6.3mm_D2.5mm_P15.24mm_Horizontal" V 9480 6200 50  0001 C CNN
F 3 "~" H 9550 6200 50  0001 C CNN
	1    9550 6200
	0    -1   -1   0   
$EndComp
$Comp
L Device:R R35
U 1 1 5C82FB90
P 9900 6100
F 0 "R35" V 9693 6100 50  0000 C CNN
F 1 "2MOhm" V 9784 6100 50  0000 C CNN
F 2 "Resistor_THT:R_Axial_DIN0207_L6.3mm_D2.5mm_P15.24mm_Horizontal" V 9830 6100 50  0001 C CNN
F 3 "~" H 9900 6100 50  0001 C CNN
	1    9900 6100
	0    -1   -1   0   
$EndComp
Wire Wire Line
	9700 6200 9700 6100
Wire Wire Line
	9700 6100 9750 6100
Wire Wire Line
	9700 6100 9350 6100
Connection ~ 9700 6100
Wire Wire Line
	9350 6200 9400 6200
$Comp
L power:GND #PWR0126
U 1 1 5C82FB9F
P 10850 5700
F 0 "#PWR0126" H 10850 5450 50  0001 C CNN
F 1 "GND" H 10855 5527 50  0000 C CNN
F 2 "" H 10850 5700 50  0001 C CNN
F 3 "" H 10850 5700 50  0001 C CNN
	1    10850 5700
	1    0    0    -1  
$EndComp
$Comp
L power:GND #PWR0127
U 1 1 5C82FBA5
P 7900 5950
F 0 "#PWR0127" H 7900 5700 50  0001 C CNN
F 1 "GND" H 7905 5777 50  0001 C CNN
F 2 "" H 7900 5950 50  0001 C CNN
F 3 "" H 7900 5950 50  0001 C CNN
	1    7900 5950
	0    -1   -1   0   
$EndComp
Wire Wire Line
	7900 5750 7900 5950
Wire Wire Line
	7900 6050 8050 6050
Wire Wire Line
	7900 5750 8050 5750
Wire Wire Line
	8050 5850 8000 5850
Wire Wire Line
	8000 5850 8000 5600
Wire Wire Line
	8000 5600 8500 5600
Connection ~ 7900 5950
Wire Wire Line
	7900 5950 7900 6050
Wire Wire Line
	10850 5700 10850 5600
Wire Wire Line
	10750 5600 10850 5600
Connection ~ 10850 5600
Wire Wire Line
	10850 5600 10850 5500
Wire Wire Line
	8050 3850 7700 3850
Wire Wire Line
	7700 3850 7700 4550
Wire Wire Line
	8050 6150 7700 6150
Wire Wire Line
	7700 6150 7700 5450
Wire Wire Line
	9350 5900 9350 5950
$Comp
L V3_sensor:AD202JY U12
U 1 1 5C994F9C
P 6400 4050
F 0 "U12" H 6450 4525 50  0000 C CNN
F 1 "AD202JY" H 6450 4434 50  0000 C CNN
F 2 "Package_SIP:AD202-SIP" H 6450 3600 50  0001 C CNN
F 3 "" H 6400 4400 50  0001 C CNN
	1    6400 4050
	1    0    0    -1  
$EndComp
NoConn ~ 5800 4300
NoConn ~ 5800 4200
$Comp
L Device:R R40
U 1 1 5C994FAC
P 5600 3800
F 0 "R40" V 5393 3800 50  0000 C CNN
F 1 "20kOhm" V 5484 3800 50  0000 C CNN
F 2 "Resistor_THT:R_Axial_DIN0207_L6.3mm_D2.5mm_P15.24mm_Horizontal" V 5530 3800 50  0001 C CNN
F 3 "~" H 5600 3800 50  0001 C CNN
	1    5600 3800
	0    1    1    0   
$EndComp
$Comp
L Device:R R39
U 1 1 5C994FB3
P 5250 3900
F 0 "R39" V 5043 3900 50  0000 C CNN
F 1 "2MOhm" V 5134 3900 50  0000 C CNN
F 2 "Resistor_THT:R_Axial_DIN0207_L6.3mm_D2.5mm_P15.24mm_Horizontal" V 5180 3900 50  0001 C CNN
F 3 "~" H 5250 3900 50  0001 C CNN
	1    5250 3900
	0    1    1    0   
$EndComp
Wire Wire Line
	5450 3800 5450 3900
Wire Wire Line
	5450 3900 5400 3900
Wire Wire Line
	5450 3900 5800 3900
Connection ~ 5450 3900
Wire Wire Line
	5800 3800 5750 3800
$Comp
L power:GND #PWR0128
U 1 1 5C994FC2
P 4300 4300
F 0 "#PWR0128" H 4300 4050 50  0001 C CNN
F 1 "GND" H 4305 4127 50  0000 C CNN
F 2 "" H 4300 4300 50  0001 C CNN
F 3 "" H 4300 4300 50  0001 C CNN
	1    4300 4300
	-1   0    0    1   
$EndComp
$Comp
L power:GND #PWR0129
U 1 1 5C994FC8
P 7250 4050
F 0 "#PWR0129" H 7250 3800 50  0001 C CNN
F 1 "GND" H 7255 3877 50  0001 C CNN
F 2 "" H 7250 4050 50  0001 C CNN
F 3 "" H 7250 4050 50  0001 C CNN
	1    7250 4050
	0    1    1    0   
$EndComp
Wire Wire Line
	7250 4250 7250 4050
Wire Wire Line
	7250 3950 7100 3950
Wire Wire Line
	7250 4250 7100 4250
Wire Wire Line
	7100 4150 7150 4150
Wire Wire Line
	7150 4150 7150 4400
Wire Wire Line
	7150 4400 6700 4400
Connection ~ 7250 4050
Wire Wire Line
	7250 4050 7250 3950
Wire Wire Line
	4400 4400 4300 4400
Wire Wire Line
	4400 4500 4300 4500
Wire Wire Line
	5800 4100 5800 4050
$Comp
L V3_sensor:AD202JY U6
U 1 1 5C994FF9
P 6400 5950
F 0 "U6" H 6450 6425 50  0000 C CNN
F 1 "AD202JY" H 6450 6334 50  0000 C CNN
F 2 "Package_SIP:AD202-SIP" H 6450 5500 50  0001 C CNN
F 3 "" H 6400 6300 50  0001 C CNN
	1    6400 5950
	1    0    0    1   
$EndComp
$Comp
L Sensor_Current:HX50-P-SP2 U5
U 1 1 5C995000
P 4800 5600
F 0 "U5" V 5241 5646 50  0000 L CNN
F 1 "HX50-P-SP2" V 5241 5555 50  0000 R TNN
F 2 "Sensor_Current:LEM_HX50-P-SP2" H 4800 5600 50  0001 L CNN
F 3 "https://www.lem.com/sites/default/files/products_datasheets/hx%203_50-p_sp2_e%20v07.pdf" H 4800 5600 50  0001 C CNN
	1    4800 5600
	0    1    -1   0   
$EndComp
NoConn ~ 5800 5700
NoConn ~ 5800 5800
$Comp
L Device:R R34
U 1 1 5C995009
P 5600 6200
F 0 "R34" V 5393 6200 50  0000 C CNN
F 1 "20kOhm" V 5484 6200 50  0000 C CNN
F 2 "Resistor_THT:R_Axial_DIN0207_L6.3mm_D2.5mm_P15.24mm_Horizontal" V 5530 6200 50  0001 C CNN
F 3 "~" H 5600 6200 50  0001 C CNN
	1    5600 6200
	0    1    -1   0   
$EndComp
$Comp
L Device:R R33
U 1 1 5C995010
P 5250 6100
F 0 "R33" V 5043 6100 50  0000 C CNN
F 1 "2MOhm" V 5134 6100 50  0000 C CNN
F 2 "Resistor_THT:R_Axial_DIN0207_L6.3mm_D2.5mm_P15.24mm_Horizontal" V 5180 6100 50  0001 C CNN
F 3 "~" H 5250 6100 50  0001 C CNN
	1    5250 6100
	0    1    -1   0   
$EndComp
Wire Wire Line
	5450 6200 5450 6100
Wire Wire Line
	5450 6100 5400 6100
Wire Wire Line
	5450 6100 5800 6100
Connection ~ 5450 6100
Wire Wire Line
	5800 6200 5750 6200
$Comp
L power:GND #PWR0130
U 1 1 5C99501F
P 4300 5700
F 0 "#PWR0130" H 4300 5450 50  0001 C CNN
F 1 "GND" H 4305 5527 50  0000 C CNN
F 2 "" H 4300 5700 50  0001 C CNN
F 3 "" H 4300 5700 50  0001 C CNN
	1    4300 5700
	-1   0    0    -1  
$EndComp
$Comp
L power:GND #PWR0131
U 1 1 5C995025
P 7250 5950
F 0 "#PWR0131" H 7250 5700 50  0001 C CNN
F 1 "GND" H 7255 5777 50  0001 C CNN
F 2 "" H 7250 5950 50  0001 C CNN
F 3 "" H 7250 5950 50  0001 C CNN
	1    7250 5950
	0    1    -1   0   
$EndComp
Wire Wire Line
	7250 5750 7250 5950
Wire Wire Line
	7250 6050 7100 6050
Wire Wire Line
	7250 5750 7100 5750
Wire Wire Line
	7100 5850 7150 5850
Wire Wire Line
	7150 5850 7150 5600
Wire Wire Line
	7150 5600 6700 5600
Connection ~ 7250 5950
Wire Wire Line
	7250 5950 7250 6050
Wire Wire Line
	4300 5700 4300 5600
Wire Wire Line
	4400 5600 4300 5600
Wire Wire Line
	4400 5500 4300 5500
Wire Wire Line
	7100 3850 7450 3850
Wire Wire Line
	7450 3850 7450 4550
Wire Wire Line
	7100 6150 7450 6150
Wire Wire Line
	7450 6150 7450 5450
Wire Wire Line
	5800 5900 5800 5950
Wire Wire Line
	6700 5600 5200 5600
Connection ~ 6700 5600
Wire Wire Line
	6700 4400 5200 4400
Connection ~ 6700 4400
Wire Wire Line
	8500 5600 9950 5600
Connection ~ 8500 5600
Wire Wire Line
	8500 4400 9950 4400
Connection ~ 8500 4400
Connection ~ 3950 7000
Connection ~ 3950 7100
Connection ~ 3950 7200
Connection ~ 3950 7300
Wire Wire Line
	3950 7300 3950 7350
Wire Wire Line
	3950 7200 3950 7300
Wire Wire Line
	3950 7100 3950 7200
Wire Wire Line
	3950 7000 3950 7100
Connection ~ 8500 5000
Wire Wire Line
	8500 5000 8500 4400
Wire Wire Line
	8500 5000 8500 5600
Connection ~ 6700 5000
Wire Wire Line
	6700 5000 6700 4400
Wire Wire Line
	6700 5000 6700 5600
Wire Wire Line
	7600 5000 8500 5000
Text Notes 3350 5359 2    59   Italic 12
STPVP3\n
Text Notes 1150 6859 2    59   Italic 12
STPVP1
Text Notes 3350 6859 2    59   Italic 12
STPVP2\n
Wire Wire Line
	3950 6900 3950 7000
Connection ~ 2100 7050
Wire Wire Line
	2100 7050 2850 7050
Wire Wire Line
	1300 7050 2100 7050
Wire Wire Line
	1250 1850 1250 2100
Text Label 1250 2450 0    60   ~ 0
VFlowRpi1
Wire Wire Line
	1250 2300 1250 2100
Connection ~ 1250 2100
$Comp
L Device:C C6
U 1 1 5D1EF8C2
P 4000 1100
F 0 "C6" H 4000 1200 40  0000 L CNN
F 1 "0.47uF" H 4006 1015 40  0000 L CNN
F 2 "Capacitor_THT:C_Rect_L7.2mm_W3.5mm_P5.00mm_FKS2_FKP2_MKS2_MKP2" H 4038 950 30  0001 C CNN
F 3 "~" H 4000 1100 60  0000 C CNN
	1    4000 1100
	-1   0    0    1   
$EndComp
$Comp
L Device:C C4
U 1 1 5D1EF8C9
P 3600 2050
F 0 "C4" H 3600 2150 40  0000 L CNN
F 1 "2.2uF" H 3606 1965 40  0000 L CNN
F 2 "Capacitor_THT:C_Rect_L18.0mm_W6.0mm_P15.00mm_FKS3_FKP3" H 3638 1900 30  0001 C CNN
F 3 "~" H 3600 2050 60  0000 C CNN
	1    3600 2050
	0    1    1    0   
$EndComp
$Comp
L Device:R R23
U 1 1 5D1EF8D0
P 3850 1350
F 0 "R23" V 3930 1350 40  0000 C CNN
F 1 "200kOhm" V 3857 1351 40  0000 C CNN
F 2 "Resistor_THT:R_Axial_DIN0207_L6.3mm_D2.5mm_P15.24mm_Horizontal" V 3780 1350 30  0001 C CNN
F 3 "~" H 3850 1350 30  0000 C CNN
	1    3850 1350
	0    1    1    0   
$EndComp
$Comp
L Device:R R22
U 1 1 5D1EF8D7
P 3600 1800
F 0 "R22" V 3680 1800 40  0000 C CNN
F 1 "20kOhm" V 3607 1801 40  0000 C CNN
F 2 "Resistor_THT:R_Axial_DIN0207_L6.3mm_D2.5mm_P15.24mm_Horizontal" V 3530 1800 30  0001 C CNN
F 3 "~" H 3600 1800 30  0000 C CNN
	1    3600 1800
	0    1    1    0   
$EndComp
$Comp
L Device:R R24
U 1 1 5D1EF8DE
P 5600 1750
F 0 "R24" V 5680 1750 40  0000 C CNN
F 1 "475Ohm" V 5607 1751 40  0000 C CNN
F 2 "Resistor_THT:R_Axial_DIN0207_L6.3mm_D2.5mm_P15.24mm_Horizontal" V 5530 1750 30  0001 C CNN
F 3 "~" H 5600 1750 30  0000 C CNN
	1    5600 1750
	0    1    1    0   
$EndComp
$Comp
L power:GND #PWR0102
U 1 1 5D1EF8E5
P 5450 1550
F 0 "#PWR0102" H 5450 1550 30  0001 C CNN
F 1 "GND" H 5450 1480 30  0001 C CNN
F 2 "" H 5450 1550 60  0000 C CNN
F 3 "" H 5450 1550 60  0000 C CNN
	1    5450 1550
	0    -1   -1   0   
$EndComp
$Comp
L power:GND #PWR0107
U 1 1 5D1EF8EB
P 3700 1350
F 0 "#PWR0107" H 3700 1350 30  0001 C CNN
F 1 "GND" H 3700 1280 30  0001 C CNN
F 2 "" H 3700 1350 60  0000 C CNN
F 3 "" H 3700 1350 60  0000 C CNN
	1    3700 1350
	0    1    1    0   
$EndComp
$Comp
L Device:C C5
U 1 1 5D1EF8F1
P 3850 1650
F 0 "C5" H 3850 1750 40  0000 L CNN
F 1 "22nF" H 3700 1550 40  0000 L CNN
F 2 "Capacitor_THT:C_Rect_L7.2mm_W2.5mm_P5.00mm_FKS2_FKP2_MKS2_MKP2" H 3888 1500 30  0001 C CNN
F 3 "~" H 3850 1650 60  0000 C CNN
	1    3850 1650
	0    1    1    0   
$EndComp
$Comp
L power:GND #PWR0108
U 1 1 5D1EF8F8
P 3700 1650
F 0 "#PWR0108" H 3700 1650 30  0001 C CNN
F 1 "GND" H 3700 1580 30  0001 C CNN
F 2 "" H 3700 1650 60  0000 C CNN
F 3 "" H 3700 1650 60  0000 C CNN
	1    3700 1650
	0    1    1    0   
$EndComp
Text Notes 4600 1250 0    59   Italic 12
SFRP2\n
$Comp
L Device:R R21
U 1 1 5D1EF8FF
P 4000 2100
F 0 "R21" V 4080 2100 40  0000 C CNN
F 1 "20kOhm" V 4000 2100 40  0000 C CNN
F 2 "Resistor_THT:R_Axial_DIN0207_L6.3mm_D2.5mm_P15.24mm_Horizontal" V 3930 2100 30  0001 C CNN
F 3 "~" H 4000 2100 30  0000 C CNN
	1    4000 2100
	0    -1   1    0   
$EndComp
$Comp
L power:GND #PWR0109
U 1 1 5D1EF906
P 4150 2100
F 0 "#PWR0109" H 4150 2100 30  0001 C CNN
F 1 "GND" H 4150 2030 30  0001 C CNN
F 2 "" H 4150 2100 60  0000 C CNN
F 3 "" H 4150 2100 60  0000 C CNN
	1    4150 2100
	0    -1   1    0   
$EndComp
$Comp
L V3_sensor:LM2907 U2
U 1 1 5D1EF912
P 4600 1600
F 0 "U2" V 4450 1700 60  0000 C CNN
F 1 "LM2907" V 4350 1700 60  0000 C CNN
F 2 "Power_Integrations:PDIP-8" H 5050 1400 60  0001 C CNN
F 3 "" H 5050 1400 60  0001 C CNN
	1    4600 1600
	0    1    1    0   
$EndComp
Wire Wire Line
	3750 1750 4000 1750
Wire Wire Line
	3750 1750 3750 1800
Connection ~ 3750 1800
Wire Wire Line
	4000 1850 3850 1850
Wire Wire Line
	5750 1750 5750 1850
Wire Wire Line
	5750 1850 5450 1850
Wire Wire Line
	5450 1650 5800 1650
Wire Wire Line
	5800 1650 5800 2000
Wire Wire Line
	5800 2000 4000 2000
Wire Wire Line
	4000 2000 4000 1850
Connection ~ 4000 1850
Wire Wire Line
	4000 1250 4000 1350
Connection ~ 4000 1350
$Comp
L power:GND #PWR0110
U 1 1 5D1EF928
P 3450 1800
F 0 "#PWR0110" H 3450 1800 30  0001 C CNN
F 1 "GND" H 3450 1730 30  0001 C CNN
F 2 "" H 3450 1800 60  0000 C CNN
F 3 "" H 3450 1800 60  0000 C CNN
	1    3450 1800
	0    1    1    0   
$EndComp
$Comp
L power:GND #PWR0111
U 1 1 5D1EF92E
P 3450 2050
F 0 "#PWR0111" H 3450 2050 30  0001 C CNN
F 1 "GND" H 3450 1980 30  0001 C CNN
F 2 "" H 3450 2050 60  0000 C CNN
F 3 "" H 3450 2050 60  0000 C CNN
	1    3450 2050
	0    1    1    0   
$EndComp
$Comp
L power:GND #PWR0112
U 1 1 5D1EF934
P 4050 2300
F 0 "#PWR0112" H 4050 2050 50  0001 C CNN
F 1 "GND" H 4050 2150 50  0000 C CNN
F 2 "" H 4050 2300 50  0001 C CNN
F 3 "" H 4050 2300 50  0001 C CNN
	1    4050 2300
	0    -1   1    0   
$EndComp
Wire Wire Line
	3750 1800 3750 2050
Wire Wire Line
	4000 1350 4000 1550
$Comp
L V3_connector:CONN_2 P7
U 1 1 5D1EF93C
P 3950 2650
F 0 "P7" V 3900 2650 40  0000 C CNN
F 1 "CONN_2" V 4000 2650 40  0000 C CNN
F 2 "TerminalBlock:TerminalBlock_bornier-2_P5.08mm" H 3950 2650 60  0001 C CNN
F 3 "" H 3950 2650 60  0000 C CNN
	1    3950 2650
	0    1    1    0   
$EndComp
Wire Wire Line
	3850 1850 3850 2100
Text Label 3850 2450 0    60   ~ 0
VFlowRpi2
Wire Wire Line
	3850 2300 3850 2100
Connection ~ 3850 2100
$Comp
L Device:C C12
U 1 1 5D23B859
P 10400 1100
F 0 "C12" H 10400 1200 40  0000 L CNN
F 1 "0.47uF" H 10406 1015 40  0000 L CNN
F 2 "Capacitor_THT:C_Rect_L7.2mm_W3.5mm_P5.00mm_FKS2_FKP2_MKS2_MKP2" H 10438 950 30  0001 C CNN
F 3 "~" H 10400 1100 60  0000 C CNN
	1    10400 1100
	1    0    0    1   
$EndComp
$Comp
L Device:C C10
U 1 1 5D23B860
P 10800 2050
F 0 "C10" H 10800 2150 40  0000 L CNN
F 1 "2.2uF" H 10806 1965 40  0000 L CNN
F 2 "Capacitor_THT:C_Rect_L18.0mm_W6.0mm_P15.00mm_FKS3_FKP3" H 10838 1900 30  0001 C CNN
F 3 "~" H 10800 2050 60  0000 C CNN
	1    10800 2050
	0    -1   1    0   
$EndComp
$Comp
L Device:R R31
U 1 1 5D23B867
P 10550 1350
F 0 "R31" V 10630 1350 40  0000 C CNN
F 1 "200kOhm" V 10557 1351 40  0000 C CNN
F 2 "Resistor_THT:R_Axial_DIN0207_L6.3mm_D2.5mm_P15.24mm_Horizontal" V 10480 1350 30  0001 C CNN
F 3 "~" H 10550 1350 30  0000 C CNN
	1    10550 1350
	0    -1   1    0   
$EndComp
$Comp
L Device:R R30
U 1 1 5D23B86E
P 10800 1800
F 0 "R30" V 10880 1800 40  0000 C CNN
F 1 "20kOhm" V 10807 1801 40  0000 C CNN
F 2 "Resistor_THT:R_Axial_DIN0207_L6.3mm_D2.5mm_P15.24mm_Horizontal" V 10730 1800 30  0001 C CNN
F 3 "~" H 10800 1800 30  0000 C CNN
	1    10800 1800
	0    -1   1    0   
$EndComp
$Comp
L Device:R R32
U 1 1 5D23B875
P 8800 1750
F 0 "R32" V 8880 1750 40  0000 C CNN
F 1 "475Ohm" V 8807 1751 40  0000 C CNN
F 2 "Resistor_THT:R_Axial_DIN0207_L6.3mm_D2.5mm_P15.24mm_Horizontal" V 8730 1750 30  0001 C CNN
F 3 "~" H 8800 1750 30  0000 C CNN
	1    8800 1750
	0    -1   1    0   
$EndComp
$Comp
L power:GND #PWR0113
U 1 1 5D23B87C
P 8950 1550
F 0 "#PWR0113" H 8950 1550 30  0001 C CNN
F 1 "GND" H 8950 1480 30  0001 C CNN
F 2 "" H 8950 1550 60  0000 C CNN
F 3 "" H 8950 1550 60  0000 C CNN
	1    8950 1550
	0    1    -1   0   
$EndComp
$Comp
L power:GND #PWR0114
U 1 1 5D23B882
P 10700 1350
F 0 "#PWR0114" H 10700 1350 30  0001 C CNN
F 1 "GND" H 10700 1280 30  0001 C CNN
F 2 "" H 10700 1350 60  0000 C CNN
F 3 "" H 10700 1350 60  0000 C CNN
	1    10700 1350
	0    -1   1    0   
$EndComp
$Comp
L Device:C C11
U 1 1 5D23B888
P 10550 1650
F 0 "C11" H 10550 1750 40  0000 L CNN
F 1 "22nF" H 10400 1550 40  0000 L CNN
F 2 "Capacitor_THT:C_Rect_L7.2mm_W2.5mm_P5.00mm_FKS2_FKP2_MKS2_MKP2" H 10588 1500 30  0001 C CNN
F 3 "~" H 10550 1650 60  0000 C CNN
	1    10550 1650
	0    -1   1    0   
$EndComp
$Comp
L power:GND #PWR0115
U 1 1 5D23B88F
P 10700 1650
F 0 "#PWR0115" H 10700 1650 30  0001 C CNN
F 1 "GND" H 10700 1580 30  0001 C CNN
F 2 "" H 10700 1650 60  0000 C CNN
F 3 "" H 10700 1650 60  0000 C CNN
	1    10700 1650
	0    -1   1    0   
$EndComp
Text Notes 9600 1268 0    59   Italic 12
SFRP4\n
$Comp
L Device:R R29
U 1 1 5D23B896
P 10400 2100
F 0 "R29" V 10480 2100 40  0000 C CNN
F 1 "20kOhm" V 10400 2100 40  0000 C CNN
F 2 "Resistor_THT:R_Axial_DIN0207_L6.3mm_D2.5mm_P15.24mm_Horizontal" V 10330 2100 30  0001 C CNN
F 3 "~" H 10400 2100 30  0000 C CNN
	1    10400 2100
	0    1    1    0   
$EndComp
$Comp
L power:GND #PWR0116
U 1 1 5D23B89D
P 10250 2100
F 0 "#PWR0116" H 10250 2100 30  0001 C CNN
F 1 "GND" H 10250 2030 30  0001 C CNN
F 2 "" H 10250 2100 60  0000 C CNN
F 3 "" H 10250 2100 60  0000 C CNN
	1    10250 2100
	0    1    1    0   
$EndComp
$Comp
L V3_sensor:LM2907 U4
U 1 1 5D23B8A9
P 9800 1600
F 0 "U4" V 9650 1700 60  0000 C CNN
F 1 "LM2907" V 9550 1700 60  0000 C CNN
F 2 "Power_Integrations:PDIP-8" H 10250 1400 60  0001 C CNN
F 3 "" H 10250 1400 60  0001 C CNN
	1    9800 1600
	0    -1   1    0   
$EndComp
Wire Wire Line
	10650 1750 10400 1750
Wire Wire Line
	10650 1750 10650 1800
Connection ~ 10650 1800
Wire Wire Line
	10400 1850 10550 1850
Wire Wire Line
	8650 1750 8650 1850
Wire Wire Line
	8650 1850 8950 1850
Wire Wire Line
	8950 1650 8600 1650
Wire Wire Line
	8600 1650 8600 2000
Wire Wire Line
	8600 2000 10400 2000
Wire Wire Line
	10400 2000 10400 1850
Connection ~ 10400 1850
Wire Wire Line
	10400 1250 10400 1350
Connection ~ 10400 1350
$Comp
L power:GND #PWR0117
U 1 1 5D23B8BF
P 10950 1800
F 0 "#PWR0117" H 10950 1800 30  0001 C CNN
F 1 "GND" H 10950 1730 30  0001 C CNN
F 2 "" H 10950 1800 60  0000 C CNN
F 3 "" H 10950 1800 60  0000 C CNN
	1    10950 1800
	0    -1   1    0   
$EndComp
$Comp
L power:GND #PWR0118
U 1 1 5D23B8C5
P 10950 2050
F 0 "#PWR0118" H 10950 2050 30  0001 C CNN
F 1 "GND" H 10950 1980 30  0001 C CNN
F 2 "" H 10950 2050 60  0000 C CNN
F 3 "" H 10950 2050 60  0000 C CNN
	1    10950 2050
	0    -1   1    0   
$EndComp
$Comp
L power:GND #PWR0119
U 1 1 5D23B8CB
P 10350 2300
F 0 "#PWR0119" H 10350 2050 50  0001 C CNN
F 1 "GND" H 10350 2150 50  0000 C CNN
F 2 "" H 10350 2300 50  0001 C CNN
F 3 "" H 10350 2300 50  0001 C CNN
	1    10350 2300
	0    1    1    0   
$EndComp
Wire Wire Line
	10650 1800 10650 2050
Wire Wire Line
	10400 1350 10400 1550
$Comp
L V3_connector:CONN_2 P9
U 1 1 5D23B8D3
P 10450 2650
F 0 "P9" V 10400 2650 40  0000 C CNN
F 1 "CONN_2" V 10500 2650 40  0000 C CNN
F 2 "TerminalBlock:TerminalBlock_bornier-2_P5.08mm" H 10450 2650 60  0001 C CNN
F 3 "" H 10450 2650 60  0000 C CNN
	1    10450 2650
	0    -1   1    0   
$EndComp
Wire Wire Line
	10550 1850 10550 2100
Text Label 10550 2450 2    60   ~ 0
VFlowRpi4
Wire Wire Line
	10550 2300 10550 2100
Connection ~ 10550 2100
$Comp
L Device:C C9
U 1 1 5D23B8E7
P 7800 1100
F 0 "C9" H 7800 1200 40  0000 L CNN
F 1 "0.47uF" H 7806 1015 40  0000 L CNN
F 2 "Capacitor_THT:C_Rect_L7.2mm_W3.5mm_P5.00mm_FKS2_FKP2_MKS2_MKP2" H 7838 950 30  0001 C CNN
F 3 "~" H 7800 1100 60  0000 C CNN
	1    7800 1100
	1    0    0    1   
$EndComp
$Comp
L Device:C C7
U 1 1 5D23B8EE
P 8200 2050
F 0 "C7" H 8200 2150 40  0000 L CNN
F 1 "2.2uF" H 8206 1965 40  0000 L CNN
F 2 "Capacitor_THT:C_Rect_L18.0mm_W6.0mm_P15.00mm_FKS3_FKP3" H 8238 1900 30  0001 C CNN
F 3 "~" H 8200 2050 60  0000 C CNN
	1    8200 2050
	0    -1   1    0   
$EndComp
$Comp
L Device:R R27
U 1 1 5D23B8F5
P 7950 1350
F 0 "R27" V 8030 1350 40  0000 C CNN
F 1 "200kOhm" V 7957 1351 40  0000 C CNN
F 2 "Resistor_THT:R_Axial_DIN0207_L6.3mm_D2.5mm_P15.24mm_Horizontal" V 7880 1350 30  0001 C CNN
F 3 "~" H 7950 1350 30  0000 C CNN
	1    7950 1350
	0    -1   1    0   
$EndComp
$Comp
L Device:R R26
U 1 1 5D23B8FC
P 8200 1800
F 0 "R26" V 8280 1800 40  0000 C CNN
F 1 "20kOhm" V 8207 1801 40  0000 C CNN
F 2 "Resistor_THT:R_Axial_DIN0207_L6.3mm_D2.5mm_P15.24mm_Horizontal" V 8130 1800 30  0001 C CNN
F 3 "~" H 8200 1800 30  0000 C CNN
	1    8200 1800
	0    -1   1    0   
$EndComp
$Comp
L Device:R R28
U 1 1 5D23B903
P 6200 1750
F 0 "R28" V 6280 1750 40  0000 C CNN
F 1 "475Ohm" V 6207 1751 40  0000 C CNN
F 2 "Resistor_THT:R_Axial_DIN0207_L6.3mm_D2.5mm_P15.24mm_Horizontal" V 6130 1750 30  0001 C CNN
F 3 "~" H 6200 1750 30  0000 C CNN
	1    6200 1750
	0    -1   1    0   
$EndComp
$Comp
L power:GND #PWR0120
U 1 1 5D23B90A
P 6350 1550
F 0 "#PWR0120" H 6350 1550 30  0001 C CNN
F 1 "GND" H 6350 1480 30  0001 C CNN
F 2 "" H 6350 1550 60  0000 C CNN
F 3 "" H 6350 1550 60  0000 C CNN
	1    6350 1550
	0    1    -1   0   
$EndComp
$Comp
L power:GND #PWR0132
U 1 1 5D23B910
P 8100 1350
F 0 "#PWR0132" H 8100 1350 30  0001 C CNN
F 1 "GND" H 8100 1280 30  0001 C CNN
F 2 "" H 8100 1350 60  0000 C CNN
F 3 "" H 8100 1350 60  0000 C CNN
	1    8100 1350
	0    -1   1    0   
$EndComp
$Comp
L Device:C C8
U 1 1 5D23B916
P 7950 1650
F 0 "C8" H 7950 1750 40  0000 L CNN
F 1 "22nF" H 7800 1550 40  0000 L CNN
F 2 "Capacitor_THT:C_Rect_L7.2mm_W2.5mm_P5.00mm_FKS2_FKP2_MKS2_MKP2" H 7988 1500 30  0001 C CNN
F 3 "~" H 7950 1650 60  0000 C CNN
	1    7950 1650
	0    -1   1    0   
$EndComp
$Comp
L power:GND #PWR0135
U 1 1 5D23B91D
P 8100 1650
F 0 "#PWR0135" H 8100 1650 30  0001 C CNN
F 1 "GND" H 8100 1580 30  0001 C CNN
F 2 "" H 8100 1650 60  0000 C CNN
F 3 "" H 8100 1650 60  0000 C CNN
	1    8100 1650
	0    -1   1    0   
$EndComp
Text Notes 7000 1268 0    59   Italic 12
SFRP3
$Comp
L Device:R R25
U 1 1 5D23B924
P 7800 2100
F 0 "R25" V 7880 2100 40  0000 C CNN
F 1 "20kOhm" V 7800 2100 40  0000 C CNN
F 2 "Resistor_THT:R_Axial_DIN0207_L6.3mm_D2.5mm_P15.24mm_Horizontal" V 7730 2100 30  0001 C CNN
F 3 "~" H 7800 2100 30  0000 C CNN
	1    7800 2100
	0    1    1    0   
$EndComp
$Comp
L power:GND #PWR0144
U 1 1 5D23B92B
P 7650 2100
F 0 "#PWR0144" H 7650 2100 30  0001 C CNN
F 1 "GND" H 7650 2030 30  0001 C CNN
F 2 "" H 7650 2100 60  0000 C CNN
F 3 "" H 7650 2100 60  0000 C CNN
	1    7650 2100
	0    1    1    0   
$EndComp
$Comp
L V3_sensor:LM2907 U3
U 1 1 5D23B937
P 7200 1600
F 0 "U3" V 7050 1700 60  0000 C CNN
F 1 "LM2907" V 6950 1700 60  0000 C CNN
F 2 "Power_Integrations:PDIP-8" H 7650 1400 60  0001 C CNN
F 3 "" H 7650 1400 60  0001 C CNN
	1    7200 1600
	0    -1   1    0   
$EndComp
Wire Wire Line
	8050 1750 7800 1750
Wire Wire Line
	8050 1750 8050 1800
Connection ~ 8050 1800
Wire Wire Line
	7800 1850 7950 1850
Wire Wire Line
	6050 1750 6050 1850
Wire Wire Line
	6050 1850 6350 1850
Wire Wire Line
	6350 1650 6000 1650
Wire Wire Line
	6000 1650 6000 2000
Wire Wire Line
	6000 2000 7800 2000
Wire Wire Line
	7800 2000 7800 1850
Connection ~ 7800 1850
Wire Wire Line
	7800 1250 7800 1350
Connection ~ 7800 1350
$Comp
L power:GND #PWR0145
U 1 1 5D23B94D
P 8350 1800
F 0 "#PWR0145" H 8350 1800 30  0001 C CNN
F 1 "GND" H 8350 1730 30  0001 C CNN
F 2 "" H 8350 1800 60  0000 C CNN
F 3 "" H 8350 1800 60  0000 C CNN
	1    8350 1800
	0    -1   1    0   
$EndComp
$Comp
L power:GND #PWR0148
U 1 1 5D23B953
P 8350 2050
F 0 "#PWR0148" H 8350 2050 30  0001 C CNN
F 1 "GND" H 8350 1980 30  0001 C CNN
F 2 "" H 8350 2050 60  0000 C CNN
F 3 "" H 8350 2050 60  0000 C CNN
	1    8350 2050
	0    -1   1    0   
$EndComp
$Comp
L power:GND #PWR0149
U 1 1 5D23B959
P 7750 2300
F 0 "#PWR0149" H 7750 2050 50  0001 C CNN
F 1 "GND" H 7750 2150 50  0000 C CNN
F 2 "" H 7750 2300 50  0001 C CNN
F 3 "" H 7750 2300 50  0001 C CNN
	1    7750 2300
	0    1    1    0   
$EndComp
Wire Wire Line
	8050 1800 8050 2050
Wire Wire Line
	7800 1350 7800 1550
$Comp
L V3_connector:CONN_2 P8
U 1 1 5D23B961
P 7850 2650
F 0 "P8" V 7800 2650 40  0000 C CNN
F 1 "CONN_2" V 7900 2650 40  0000 C CNN
F 2 "TerminalBlock:TerminalBlock_bornier-2_P5.08mm" H 7850 2650 60  0001 C CNN
F 3 "" H 7850 2650 60  0000 C CNN
	1    7850 2650
	0    -1   1    0   
$EndComp
Wire Wire Line
	7950 1850 7950 2100
Text Label 7950 2450 2    60   ~ 0
VFlowRpi3
Wire Wire Line
	7950 2300 7950 2100
Connection ~ 7950 2100
Wire Wire Line
	7600 3300 5900 3300
Wire Wire Line
	5900 3300 5900 1750
Connection ~ 7600 3300
Connection ~ 6050 1750
Connection ~ 5900 1750
Connection ~ 5750 1750
Wire Wire Line
	5900 3300 3300 3300
Wire Wire Line
	3300 1750 3150 1750
Connection ~ 3150 1750
Connection ~ 8650 1750
Wire Wire Line
	5900 1750 6050 1750
Wire Wire Line
	5750 1750 5900 1750
Connection ~ 8500 3300
Wire Wire Line
	8500 1750 8650 1750
$Comp
L V3_connector:CONN_2 P13
U 1 1 5D56DCCA
P 5950 4650
F 0 "P13" V 5900 4650 40  0000 C CNN
F 1 "CONN_2" V 6000 4650 40  0000 C CNN
F 2 "TerminalBlock:TerminalBlock_bornier-2_P5.08mm" H 5950 4650 60  0001 C CNN
F 3 "" H 5950 4650 60  0000 C CNN
	1    5950 4650
	-1   0    0    1   
$EndComp
$Comp
L V3_connector:CONN_2 P10
U 1 1 5D5C6570
P 5950 5350
F 0 "P10" V 5900 5350 40  0000 C CNN
F 1 "CONN_2" V 6000 5350 40  0000 C CNN
F 2 "TerminalBlock:TerminalBlock_bornier-2_P5.08mm" H 5950 5350 60  0001 C CNN
F 3 "" H 5950 5350 60  0000 C CNN
	1    5950 5350
	-1   0    0    -1  
$EndComp
Wire Wire Line
	6300 4750 6300 4850
Wire Wire Line
	6300 5250 6300 5150
$Comp
L V3_connector:CONN_2 P12
U 1 1 5D699386
P 9250 4650
F 0 "P12" V 9200 4650 40  0000 C CNN
F 1 "CONN_2" V 9300 4650 40  0000 C CNN
F 2 "TerminalBlock:TerminalBlock_bornier-2_P5.08mm" H 9250 4650 60  0001 C CNN
F 3 "" H 9250 4650 60  0000 C CNN
	1    9250 4650
	1    0    0    1   
$EndComp
$Comp
L V3_connector:CONN_2 P11
U 1 1 5D69938D
P 9250 5350
F 0 "P11" V 9200 5350 40  0000 C CNN
F 1 "CONN_2" V 9300 5350 40  0000 C CNN
F 2 "TerminalBlock:TerminalBlock_bornier-2_P5.08mm" H 9250 5350 60  0001 C CNN
F 3 "" H 9250 5350 60  0000 C CNN
	1    9250 5350
	1    0    0    -1  
$EndComp
Wire Wire Line
	8900 4850 9750 4850
Wire Wire Line
	8900 5250 8900 5150
Wire Wire Line
	8900 4750 8900 4850
Wire Wire Line
	8900 5150 9750 5150
Wire Wire Line
	10050 5150 10050 5200
Wire Wire Line
	10050 4850 10050 4800
Wire Wire Line
	5100 4800 5100 4850
Wire Wire Line
	5100 4850 5400 4850
Wire Wire Line
	5100 5200 5100 5150
Wire Wire Line
	5100 5150 5400 5150
$Comp
L V3_connector:Conn_01x02 J8
U 1 1 5DCBE04A
P 1800 800
F 0 "J8" H 1800 900 50  0000 C CNN
F 1 "Conn_01x02" H 1800 600 50  0001 C CNN
F 2 "TerminalBlock:TerminalBlock_bornier-2_P5.08mm" H 1800 800 50  0001 C CNN
F 3 "" H 1800 800 50  0001 C CNN
	1    1800 800 
	1    0    0    -1  
$EndComp
Wire Wire Line
	1600 900  1400 900 
Text Notes 3750 950  0    39   ~ 0
Meas Flow 2\n\n
$Comp
L power:GND #PWR0150
U 1 1 5DE9CEE6
P 4100 800
F 0 "#PWR0150" H 4100 800 30  0001 C CNN
F 1 "GND" H 4100 730 30  0001 C CNN
F 2 "" H 4100 800 60  0000 C CNN
F 3 "" H 4100 800 60  0000 C CNN
	1    4100 800 
	0    1    -1   0   
$EndComp
Wire Wire Line
	4000 950  4000 900 
Wire Wire Line
	4100 800  4200 800 
$Comp
L V3_connector:Conn_01x02 J9
U 1 1 5DE9CEEE
P 4400 800
F 0 "J9" H 4400 900 50  0000 C CNN
F 1 "Conn_01x02" H 4400 600 50  0001 C CNN
F 2 "TerminalBlock:TerminalBlock_bornier-2_P5.08mm" H 4400 800 50  0001 C CNN
F 3 "" H 4400 800 50  0001 C CNN
	1    4400 800 
	1    0    0    -1  
$EndComp
Wire Wire Line
	4200 900  4000 900 
Text Notes 8050 950  2    39   ~ 0
Meas Flow 3\n\n
$Comp
L power:GND #PWR0151
U 1 1 5DEC0393
P 7700 800
F 0 "#PWR0151" H 7700 800 30  0001 C CNN
F 1 "GND" H 7700 730 30  0001 C CNN
F 2 "" H 7700 800 60  0000 C CNN
F 3 "" H 7700 800 60  0000 C CNN
	1    7700 800 
	0    -1   -1   0   
$EndComp
Wire Wire Line
	7800 950  7800 900 
Wire Wire Line
	7700 800  7600 800 
$Comp
L V3_connector:Conn_01x02 J10
U 1 1 5DEC039B
P 7400 800
F 0 "J10" H 7400 900 50  0000 C CNN
F 1 "Conn_01x02" H 7400 600 50  0001 C CNN
F 2 "TerminalBlock:TerminalBlock_bornier-2_P5.08mm" H 7400 800 50  0001 C CNN
F 3 "" H 7400 800 50  0001 C CNN
	1    7400 800 
	-1   0    0    -1  
$EndComp
Wire Wire Line
	7600 900  7800 900 
Text Notes 10650 950  2    39   ~ 0
Meas Flow 4\n\n
$Comp
L power:GND #PWR0152
U 1 1 5DF6EA80
P 10300 800
F 0 "#PWR0152" H 10300 800 30  0001 C CNN
F 1 "GND" H 10300 730 30  0001 C CNN
F 2 "" H 10300 800 60  0000 C CNN
F 3 "" H 10300 800 60  0000 C CNN
	1    10300 800 
	0    -1   -1   0   
$EndComp
Wire Wire Line
	10400 950  10400 900 
Wire Wire Line
	10300 800  10200 800 
$Comp
L V3_connector:Conn_01x02 J11
U 1 1 5DF6EA88
P 10000 800
F 0 "J11" H 10000 900 50  0000 C CNN
F 1 "Conn_01x02" H 10000 600 50  0001 C CNN
F 2 "TerminalBlock:TerminalBlock_bornier-2_P5.08mm" H 10000 800 50  0001 C CNN
F 3 "" H 10000 800 50  0001 C CNN
	1    10000 800 
	-1   0    0    -1  
$EndComp
Wire Wire Line
	10200 900  10400 900 
Wire Wire Line
	8500 1750 8500 3300
Text Notes 6300 4500 0    59   Italic 12
SCPV4\n
Text Notes 8600 4500 0    59   Italic 12
SCPV3
Text Notes 8600 5600 0    59   Italic 12
SCPV2
Text Notes 6300 5600 0    59   Italic 12
SCPV1\n
Text Notes 5100 4300 0    59   Italic 12
SAPV4\n
Text Notes 9750 4400 0    59   Italic 12
SAPV3\n\n
Text Notes 9750 5800 0    59   Italic 12
SAPV2\n
Text Notes 5100 5900 0    59   Italic 12
SAPV1\n\n
Text Label 9400 4850 0    50   ~ 0
VCurrentRPi3
Text Label 8900 5150 0    50   ~ 0
VCurrentRPi2
Text Label 5800 4850 0    50   ~ 0
VCurrentRPi4
Text Label 5800 5150 0    50   ~ 0
VCurrentRPi1
Text Label 8000 4550 0    50   ~ 0
VoltageRPi3
Text Label 8000 5450 0    50   ~ 0
VoltageRPi2
Text Label 6750 5450 0    50   ~ 0
VoltageRPi1
Text Label 6750 4550 0    50   ~ 0
VoltageRPi4
Wire Wire Line
	6300 5450 7200 5450
Wire Wire Line
	6300 4550 7200 4550
Wire Wire Line
	7700 5450 7950 5450
Wire Wire Line
	7700 4550 7950 4550
Wire Wire Line
	10750 5500 10850 5500
Wire Wire Line
	4300 5600 4300 5500
Connection ~ 4300 5600
Wire Wire Line
	7600 3300 7600 5000
Wire Wire Line
	1250 5550 1300 5550
Wire Wire Line
	1250 6500 1300 6500
Wire Wire Line
	8500 3300 8900 3300
Wire Wire Line
	10500 3100 10800 3100
$Comp
L V3_supply:U3V50AHV U15
U 1 1 5C5D6ABB
P 9450 3150
F 0 "U15" H 9450 3625 50  0000 C CNN
F 1 "U3V50AHV" H 9450 3534 50  0000 C CNN
F 2 "Converter_DCDC:Converter_DCDC_U3V50x" H 9450 2800 50  0001 C CNN
F 3 "https://www.pololu.com/product/2571" H 9450 2800 50  0001 C CNN
	1    9450 3150
	-1   0    0    -1  
$EndComp
Wire Wire Line
	10000 3100 10000 3200
Connection ~ 10000 3100
Wire Wire Line
	8900 3300 8900 3400
Connection ~ 8900 3300
Wire Wire Line
	2850 5550 2900 5550
Wire Wire Line
	2850 6500 2900 6500
Wire Wire Line
	3300 1750 3300 3300
$Comp
L V3_connector:RasberryPI3 U14
U 1 1 5C886DCA
P 1200 3300
F 0 "U14" H 1528 3346 50  0000 L CNN
F 1 "RasberryPI3" H 1528 3255 50  0000 L CNN
F 2 "Package_DIP:RasberryPI3" H 1200 3450 50  0001 C CNN
F 3 "" H 1200 3450 50  0001 C CNN
	1    1200 3300
	1    0    0    -1  
$EndComp
Connection ~ 7600 5000
Wire Wire Line
	4800 4800 5100 4800
$Comp
L Sensor_Current:HX50-P-SP2 U11
U 1 1 5C994FA3
P 4800 4400
F 0 "U11" V 5241 4446 50  0000 L CNN
F 1 "HX50-P-SP2" V 5241 4355 50  0000 R TNN
F 2 "Sensor_Current:LEM_HX50-P-SP2" H 4800 4400 50  0001 L CNN
F 3 "https://www.lem.com/sites/default/files/products_datasheets/hx%203_50-p_sp2_e%20v07.pdf" H 4800 4400 50  0001 C CNN
	1    4800 4400
	0    1    1    0   
$EndComp
$Comp
L V3_connector:Conn_01x02 J18
U 1 1 5C6E3F5E
P 5000 3400
F 0 "J18" V 4966 3212 50  0000 R CNN
F 1 "Conn_01x02" V 4875 3212 50  0000 R CNN
F 2 "TerminalBlock:TerminalBlock_bornier-2_P5.08mm" H 5000 3400 50  0001 C CNN
F 3 "" H 5000 3400 50  0001 C CNN
	1    5000 3400
	0    -1   -1   0   
$EndComp
Wire Wire Line
	5800 4050 5000 4050
Connection ~ 5800 4050
Wire Wire Line
	5800 4050 5800 4000
$Comp
L V3_connector:Conn_50A_01x02 J19
U 1 1 5C7AAC81
P 4300 3650
F 0 "J19" H 4244 3285 50  0000 C CNN
F 1 "Conn_50A_01x02" H 4244 3376 50  0000 C CNN
F 2 "Connector_Pin:conn_50A_01x02" H 4300 3900 50  0001 C CNN
F 3 "" H 4300 3900 50  0001 C CNN
	1    4300 3650
	-1   0    0    -1  
$EndComp
Text Label 5100 3750 1    50   ~ 0
Vin-4
Text Label 5000 3750 1    50   ~ 0
Vin+4
Wire Wire Line
	4300 4300 4300 4400
Connection ~ 4300 4400
Wire Wire Line
	4300 4400 4300 4500
Wire Wire Line
	5100 3600 5100 3900
Wire Wire Line
	5000 3600 5000 4050
Wire Wire Line
	4700 4000 4700 3750
Wire Wire Line
	4700 3750 4600 3750
Wire Wire Line
	4900 3550 4600 3550
Wire Wire Line
	4900 3550 4900 4000
$Comp
L V3_connector:Conn_01x02 J12
U 1 1 5CB83A7B
P 5000 6600
F 0 "J12" V 4873 6412 50  0000 R CNN
F 1 "Conn_01x02" V 4964 6412 50  0000 R CNN
F 2 "TerminalBlock:TerminalBlock_bornier-2_P5.08mm" H 5000 6600 50  0001 C CNN
F 3 "" H 5000 6600 50  0001 C CNN
	1    5000 6600
	0    -1   1    0   
$EndComp
$Comp
L V3_connector:Conn_50A_01x02 J13
U 1 1 5CB83A82
P 4300 6350
F 0 "J13" H 4244 5985 50  0000 C CNN
F 1 "Conn_50A_01x02" H 4244 6076 50  0000 C CNN
F 2 "Connector_Pin:conn_50A_01x02" H 4300 6600 50  0001 C CNN
F 3 "" H 4300 6600 50  0001 C CNN
	1    4300 6350
	-1   0    0    1   
$EndComp
Text Label 5100 6150 3    50   ~ 0
Vin-1
Text Label 5000 6150 3    50   ~ 0
Vin+1
Wire Wire Line
	5100 6400 5100 6100
Wire Wire Line
	5000 6400 5000 5950
Wire Wire Line
	4700 6000 4700 6250
Wire Wire Line
	4700 6250 4600 6250
Wire Wire Line
	4900 6450 4600 6450
Wire Wire Line
	4900 6450 4900 6000
$Comp
L V3_connector:Conn_01x02 J16
U 1 1 5CB9C77F
P 10150 3400
F 0 "J16" V 10116 3480 50  0000 L CNN
F 1 "Conn_01x02" V 10025 3480 50  0000 L CNN
F 2 "TerminalBlock:TerminalBlock_bornier-2_P5.08mm" H 10150 3400 50  0001 C CNN
F 3 "" H 10150 3400 50  0001 C CNN
	1    10150 3400
	0    1    -1   0   
$EndComp
$Comp
L V3_connector:Conn_50A_01x02 J17
U 1 1 5CB9C786
P 10850 3650
F 0 "J17" H 10794 3285 50  0000 C CNN
F 1 "Conn_50A_01x02" H 10794 3376 50  0000 C CNN
F 2 "Connector_Pin:conn_50A_01x02" H 10850 3900 50  0001 C CNN
F 3 "" H 10850 3900 50  0001 C CNN
	1    10850 3650
	1    0    0    -1  
$EndComp
Text Label 10050 3750 1    50   ~ 0
Vin-3
Text Label 10150 3600 3    50   ~ 0
Vin+3
Wire Wire Line
	10050 3600 10050 3900
Wire Wire Line
	10150 3600 10150 4050
Wire Wire Line
	10450 4000 10450 3750
Wire Wire Line
	10450 3750 10550 3750
Wire Wire Line
	10250 3550 10550 3550
Wire Wire Line
	10250 3550 10250 4000
Wire Wire Line
	10050 4800 10350 4800
$Comp
L V3_connector:Conn_01x02 J14
U 1 1 5CD71884
P 10150 6600
F 0 "J14" V 10023 6680 50  0000 L CNN
F 1 "Conn_01x02" V 10114 6680 50  0000 L CNN
F 2 "TerminalBlock:TerminalBlock_bornier-2_P5.08mm" H 10150 6600 50  0001 C CNN
F 3 "" H 10150 6600 50  0001 C CNN
	1    10150 6600
	0    1    1    0   
$EndComp
$Comp
L V3_connector:Conn_50A_01x02 J15
U 1 1 5CD7188B
P 10850 6350
F 0 "J15" H 10794 5985 50  0000 C CNN
F 1 "Conn_50A_01x02" H 10794 6076 50  0000 C CNN
F 2 "Connector_Pin:conn_50A_01x02" H 10850 6600 50  0001 C CNN
F 3 "" H 10850 6600 50  0001 C CNN
	1    10850 6350
	1    0    0    1   
$EndComp
Text Label 10050 6250 3    50   ~ 0
Vin-2
Text Label 10150 6300 3    50   ~ 0
Vin+2
Wire Wire Line
	10050 6400 10050 6100
Wire Wire Line
	10150 6400 10150 5950
Wire Wire Line
	10450 6000 10450 6250
Wire Wire Line
	10450 6250 10550 6250
Wire Wire Line
	10250 6450 10550 6450
Wire Wire Line
	10250 6450 10250 6000
Text Notes 7400 6950 0    60   ~ 0
Data Logger - Developped at Geeps by S. Meunier, M. Queval, \nVincent Roy, Paul Lorang, Joséphine Demay \nDo not share
Connection ~ 5900 3300
Wire Wire Line
	4800 5200 5100 5200
Wire Wire Line
	5000 5950 5800 5950
Connection ~ 5800 5950
Wire Wire Line
	5800 5950 5800 6000
Wire Wire Line
	10150 5950 9350 5950
Connection ~ 9350 5950
Wire Wire Line
	9350 5950 9350 6000
Wire Wire Line
	10150 4050 9350 4050
Connection ~ 9350 4050
Wire Wire Line
	9350 4050 9350 4000
$Comp
L Device:D_Zener D14
U 1 1 5D060686
P 7200 4700
F 0 "D14" H 7200 4916 50  0000 C CNN
F 1 "D_Zener_5V" H 7200 4825 50  0001 C CNN
F 2 "Diode_THT:D_A-405_P7.62mm_Horizontal" H 7200 4700 50  0001 C CNN
F 3 "~" H 7200 4700 50  0001 C CNN
	1    7200 4700
	0    1    1    0   
$EndComp
Connection ~ 7200 4550
Wire Wire Line
	7200 4550 7450 4550
Wire Wire Line
	6700 5000 7600 5000
$Comp
L Device:D_Zener D12
U 1 1 5D0D9D55
P 5400 4700
F 0 "D12" H 5400 4916 50  0000 C CNN
F 1 "D_Zener_5V" H 5400 4825 50  0001 C CNN
F 2 "Diode_THT:D_A-405_P7.62mm_Horizontal" H 5400 4700 50  0001 C CNN
F 3 "~" H 5400 4700 50  0001 C CNN
	1    5400 4700
	0    -1   -1   0   
$EndComp
$Comp
L power:GND #PWR0153
U 1 1 5D1FC54D
P 5400 4550
F 0 "#PWR0153" H 5400 4300 50  0001 C CNN
F 1 "GND" H 5405 4377 50  0000 C CNN
F 2 "" H 5400 4550 50  0001 C CNN
F 3 "" H 5400 4550 50  0001 C CNN
	1    5400 4550
	0    -1   -1   0   
$EndComp
Wire Wire Line
	5400 4850 6300 4850
Connection ~ 5400 4850
$Comp
L power:GND #PWR0154
U 1 1 5D25D571
P 7200 4850
F 0 "#PWR0154" H 7200 4600 50  0001 C CNN
F 1 "GND" H 7205 4677 50  0000 C CNN
F 2 "" H 7200 4850 50  0001 C CNN
F 3 "" H 7200 4850 50  0001 C CNN
	1    7200 4850
	0    1    1    0   
$EndComp
$Comp
L Device:D_Zener D15
U 1 1 5D2EEB79
P 7200 5300
F 0 "D15" H 7200 5516 50  0000 C CNN
F 1 "D_Zener_5V" H 7200 5425 50  0001 C CNN
F 2 "Diode_THT:D_A-405_P7.62mm_Horizontal" H 7200 5300 50  0001 C CNN
F 3 "~" H 7200 5300 50  0001 C CNN
	1    7200 5300
	0    1    -1   0   
$EndComp
$Comp
L power:GND #PWR0155
U 1 1 5D2EEB80
P 7200 5150
F 0 "#PWR0155" H 7200 4900 50  0001 C CNN
F 1 "GND" H 7205 4977 50  0000 C CNN
F 2 "" H 7200 5150 50  0001 C CNN
F 3 "" H 7200 5150 50  0001 C CNN
	1    7200 5150
	0    1    -1   0   
$EndComp
Connection ~ 7200 5450
Wire Wire Line
	7200 5450 7450 5450
$Comp
L Device:D_Zener D13
U 1 1 5D337747
P 5400 5300
F 0 "D13" H 5400 5516 50  0000 C CNN
F 1 "D_Zener_5V" H 5400 5425 50  0001 C CNN
F 2 "Diode_THT:D_A-405_P7.62mm_Horizontal" H 5400 5300 50  0001 C CNN
F 3 "~" H 5400 5300 50  0001 C CNN
	1    5400 5300
	0    -1   1    0   
$EndComp
$Comp
L power:GND #PWR0156
U 1 1 5D33774E
P 5400 5450
F 0 "#PWR0156" H 5400 5200 50  0001 C CNN
F 1 "GND" H 5405 5277 50  0000 C CNN
F 2 "" H 5400 5450 50  0001 C CNN
F 3 "" H 5400 5450 50  0001 C CNN
	1    5400 5450
	0    -1   1    0   
$EndComp
Connection ~ 5400 5150
Wire Wire Line
	5400 5150 6300 5150
$Comp
L Device:D_Zener D17
U 1 1 5D3B1E4F
P 7950 5300
F 0 "D17" H 7950 5516 50  0000 C CNN
F 1 "D_Zener_5V" H 7950 5425 50  0001 C CNN
F 2 "Diode_THT:D_A-405_P7.62mm_Horizontal" H 7950 5300 50  0001 C CNN
F 3 "~" H 7950 5300 50  0001 C CNN
	1    7950 5300
	0    -1   -1   0   
$EndComp
$Comp
L power:GND #PWR0157
U 1 1 5D3B1E56
P 7950 5150
F 0 "#PWR0157" H 7950 4900 50  0001 C CNN
F 1 "GND" H 7955 4977 50  0000 C CNN
F 2 "" H 7950 5150 50  0001 C CNN
F 3 "" H 7950 5150 50  0001 C CNN
	1    7950 5150
	0    -1   -1   0   
$EndComp
Connection ~ 7950 5450
Wire Wire Line
	7950 5450 8900 5450
$Comp
L Device:D_Zener D16
U 1 1 5D445498
P 7950 4700
F 0 "D16" H 7950 4916 50  0000 C CNN
F 1 "D_Zener_5V" H 7950 4825 50  0001 C CNN
F 2 "Diode_THT:D_A-405_P7.62mm_Horizontal" H 7950 4700 50  0001 C CNN
F 3 "~" H 7950 4700 50  0001 C CNN
	1    7950 4700
	0    -1   1    0   
$EndComp
$Comp
L power:GND #PWR0158
U 1 1 5D44549F
P 7950 4850
F 0 "#PWR0158" H 7950 4600 50  0001 C CNN
F 1 "GND" H 7955 4677 50  0000 C CNN
F 2 "" H 7950 4850 50  0001 C CNN
F 3 "" H 7950 4850 50  0001 C CNN
	1    7950 4850
	0    -1   1    0   
$EndComp
Connection ~ 7950 4550
Wire Wire Line
	7950 4550 8900 4550
$Comp
L Device:D_Zener D19
U 1 1 5D4A827B
P 9750 4700
F 0 "D19" H 9750 4916 50  0000 C CNN
F 1 "D_Zener_5V" H 9750 4825 50  0000 C CNN
F 2 "Diode_THT:D_A-405_P7.62mm_Horizontal" H 9750 4700 50  0001 C CNN
F 3 "~" H 9750 4700 50  0001 C CNN
	1    9750 4700
	0    1    -1   0   
$EndComp
$Comp
L power:GND #PWR0159
U 1 1 5D4A8282
P 9750 4550
F 0 "#PWR0159" H 9750 4300 50  0001 C CNN
F 1 "GND" H 9755 4377 50  0000 C CNN
F 2 "" H 9750 4550 50  0001 C CNN
F 3 "" H 9750 4550 50  0001 C CNN
	1    9750 4550
	0    1    -1   0   
$EndComp
Connection ~ 9750 4850
Wire Wire Line
	9750 4850 10050 4850
$Comp
L Device:D_Zener D20
U 1 1 5D50B9AD
P 9750 5300
F 0 "D20" H 9750 5516 50  0000 C CNN
F 1 "D_Zener_5V" H 9750 5425 50  0000 C CNN
F 2 "Diode_THT:D_A-405_P7.62mm_Horizontal" H 9750 5300 50  0001 C CNN
F 3 "~" H 9750 5300 50  0001 C CNN
	1    9750 5300
	0    1    1    0   
$EndComp
$Comp
L power:GND #PWR0160
U 1 1 5D50B9B4
P 9750 5450
F 0 "#PWR0160" H 9750 5200 50  0001 C CNN
F 1 "GND" H 9755 5277 50  0000 C CNN
F 2 "" H 9750 5450 50  0001 C CNN
F 3 "" H 9750 5450 50  0001 C CNN
	1    9750 5450
	0    1    1    0   
$EndComp
Connection ~ 9750 5150
Wire Wire Line
	9750 5150 10050 5150
$Comp
L Device:D_Zener D18
U 1 1 5D570AA3
P 8100 2300
F 0 "D18" H 8100 2516 50  0000 C CNN
F 1 "D_Zener_5V" H 8100 2425 50  0000 C CNN
F 2 "Diode_THT:D_A-405_P7.62mm_Horizontal" H 8100 2300 50  0001 C CNN
F 3 "~" H 8100 2300 50  0001 C CNN
	1    8100 2300
	1    0    0    -1  
$EndComp
$Comp
L power:GND #PWR0161
U 1 1 5D570AAA
P 8250 2300
F 0 "#PWR0161" H 8250 2050 50  0001 C CNN
F 1 "GND" H 8255 2127 50  0000 C CNN
F 2 "" H 8250 2300 50  0001 C CNN
F 3 "" H 8250 2300 50  0001 C CNN
	1    8250 2300
	1    0    0    -1  
$EndComp
Wire Wire Line
	7600 3300 8500 3300
Connection ~ 7950 2300
$Comp
L Device:D_Zener D11
U 1 1 5D639C8B
P 3700 2300
F 0 "D11" H 3700 2516 50  0000 C CNN
F 1 "D_Zener_5V" H 3700 2425 50  0000 C CNN
F 2 "Diode_THT:D_A-405_P7.62mm_Horizontal" H 3700 2300 50  0001 C CNN
F 3 "~" H 3700 2300 50  0001 C CNN
	1    3700 2300
	-1   0    0    -1  
$EndComp
$Comp
L power:GND #PWR0162
U 1 1 5D639C92
P 3550 2300
F 0 "#PWR0162" H 3550 2050 50  0001 C CNN
F 1 "GND" H 3555 2127 50  0000 C CNN
F 2 "" H 3550 2300 50  0001 C CNN
F 3 "" H 3550 2300 50  0001 C CNN
	1    3550 2300
	-1   0    0    -1  
$EndComp
Connection ~ 3850 2300
$Comp
L Device:D_Zener D1
U 1 1 5D69E2E0
P 1100 2300
F 0 "D1" H 1100 2516 50  0000 C CNN
F 1 "D_Zener_5V" H 1100 2425 50  0000 C CNN
F 2 "Diode_THT:D_A-405_P7.62mm_Horizontal" H 1100 2300 50  0001 C CNN
F 3 "~" H 1100 2300 50  0001 C CNN
	1    1100 2300
	-1   0    0    -1  
$EndComp
$Comp
L power:GND #PWR0163
U 1 1 5D69E2E7
P 950 2300
F 0 "#PWR0163" H 950 2050 50  0001 C CNN
F 1 "GND" H 955 2127 50  0000 C CNN
F 2 "" H 950 2300 50  0001 C CNN
F 3 "" H 950 2300 50  0001 C CNN
	1    950  2300
	-1   0    0    -1  
$EndComp
Connection ~ 1250 2300
$Comp
L Device:D_Zener D21
U 1 1 5D6E976B
P 10700 2300
F 0 "D21" H 10700 2516 50  0000 C CNN
F 1 "D_Zener_5V" H 10700 2425 50  0000 C CNN
F 2 "Diode_THT:D_A-405_P7.62mm_Horizontal" H 10700 2300 50  0001 C CNN
F 3 "~" H 10700 2300 50  0001 C CNN
	1    10700 2300
	1    0    0    -1  
$EndComp
$Comp
L power:GND #PWR0164
U 1 1 5D6E9772
P 10850 2300
F 0 "#PWR0164" H 10850 2050 50  0001 C CNN
F 1 "GND" H 10855 2127 50  0000 C CNN
F 2 "" H 10850 2300 50  0001 C CNN
F 3 "" H 10850 2300 50  0001 C CNN
	1    10850 2300
	1    0    0    -1  
$EndComp
Connection ~ 10550 2300
Wire Wire Line
	2850 5550 2750 5550
Wire Wire Line
	2750 5550 2750 5400
Connection ~ 2850 5550
Wire Wire Line
	2950 5650 2700 5650
Wire Wire Line
	2700 5650 2700 5500
Wire Wire Line
	2100 5000 2100 5900
Wire Wire Line
	2850 6500 2750 6500
Wire Wire Line
	2750 6500 2750 6650
Connection ~ 2850 6500
Wire Wire Line
	2700 6550 2700 6400
Wire Wire Line
	2700 6400 2950 6400
$Comp
L V3_connector:Conn_01x02 J7
U 1 1 5C96C78E
P 1200 4700
F 0 "J7" H 1200 4800 50  0000 C CNN
F 1 "Conn_01x02" H 1200 4500 50  0001 C CNN
F 2 "TerminalBlock:TerminalBlock_bornier-2_P5.08mm" H 1200 4700 50  0001 C CNN
F 3 "" H 1200 4700 50  0001 C CNN
	1    1200 4700
	0    -1   -1   0   
$EndComp
Wire Wire Line
	1200 5650 1450 5650
Wire Wire Line
	1450 5650 1450 5500
Wire Wire Line
	1400 6650 1400 6500
Wire Wire Line
	1400 6500 1300 6500
Connection ~ 1300 6500
Wire Wire Line
	1400 5400 1400 5550
Wire Wire Line
	1400 5550 1300 5550
Connection ~ 1300 5550
$Comp
L V3_connector:CONN_2 P5
U 1 1 5D267554
P 1900 5450
F 0 "P5" V 1850 5450 40  0000 C CNN
F 1 "CONN_2" V 1950 5450 40  0000 C CNN
F 2 "TerminalBlock:TerminalBlock_bornier-2_P5.08mm" H 1900 5450 60  0001 C CNN
F 3 "" H 1900 5450 60  0000 C CNN
	1    1900 5450
	1    0    0    1   
$EndComp
Text Label 1550 5400 1    60   ~ 0
V1_T4
Text Label 1550 5700 1    60   ~ 0
V2_T4
$Comp
L Device:D_Zener D3
U 1 1 5D26755D
P 1700 5700
F 0 "D3" H 1700 5916 50  0000 C BNN
F 1 "D_Zener_5V" H 1700 5825 50  0001 C CNN
F 2 "Diode_THT:D_A-405_P7.62mm_Horizontal" H 1700 5700 50  0001 C CNN
F 3 "~" H 1700 5700 50  0001 C CNN
	1    1700 5700
	1    0    0    1   
$EndComp
$Comp
L power:GND #PWR0165
U 1 1 5D267564
P 1850 5700
F 0 "#PWR0165" H 1850 5450 50  0001 C CNN
F 1 "GND" H 1855 5527 50  0000 C CNN
F 2 "" H 1850 5700 50  0001 C CNN
F 3 "" H 1850 5700 50  0001 C CNN
	1    1850 5700
	0    -1   1    0   
$EndComp
$Comp
L Device:D_Zener D2
U 1 1 5D26756A
P 1700 5200
F 0 "D2" H 1700 5416 50  0000 C TNN
F 1 "D_Zener_5V" H 1700 5325 50  0001 C CNN
F 2 "Diode_THT:D_A-405_P7.62mm_Horizontal" H 1700 5200 50  0001 C CNN
F 3 "~" H 1700 5200 50  0001 C CNN
	1    1700 5200
	1    0    0    -1  
$EndComp
$Comp
L power:GND #PWR0166
U 1 1 5D267571
P 1850 5200
F 0 "#PWR0166" H 1850 4950 50  0001 C CNN
F 1 "GND" H 1855 5027 50  0000 C CNN
F 2 "" H 1850 5200 50  0001 C CNN
F 3 "" H 1850 5200 50  0001 C CNN
	1    1850 5200
	0    -1   -1   0   
$EndComp
Wire Wire Line
	1550 5200 1550 5350
Wire Wire Line
	1550 5550 1550 5700
Wire Wire Line
	1550 5550 1550 5500
Wire Wire Line
	1550 5500 1450 5500
Connection ~ 1550 5550
Wire Wire Line
	1550 5350 1550 5400
Connection ~ 1550 5350
$Comp
L V3_connector:CONN_2 P2
U 1 1 5D3713C9
P 1900 6600
F 0 "P2" V 1850 6600 40  0000 C CNN
F 1 "CONN_2" V 1950 6600 40  0000 C CNN
F 2 "TerminalBlock:TerminalBlock_bornier-2_P5.08mm" H 1900 6600 60  0001 C CNN
F 3 "" H 1900 6600 60  0000 C CNN
	1    1900 6600
	1    0    0    -1  
$EndComp
Text Label 1550 6650 3    60   ~ 0
V1_T1
Text Label 1550 6350 3    60   ~ 0
V2_T1
$Comp
L Device:D_Zener D4
U 1 1 5D3713D2
P 1700 6350
F 0 "D4" H 1700 6566 50  0000 C BNN
F 1 "D_Zener_5V" H 1700 6475 50  0001 C CNN
F 2 "Diode_THT:D_A-405_P7.62mm_Horizontal" H 1700 6350 50  0001 C CNN
F 3 "~" H 1700 6350 50  0001 C CNN
	1    1700 6350
	1    0    0    -1  
$EndComp
$Comp
L power:GND #PWR0167
U 1 1 5D3713D9
P 1850 6350
F 0 "#PWR0167" H 1850 6100 50  0001 C CNN
F 1 "GND" H 1855 6177 50  0000 C CNN
F 2 "" H 1850 6350 50  0001 C CNN
F 3 "" H 1850 6350 50  0001 C CNN
	1    1850 6350
	0    -1   -1   0   
$EndComp
$Comp
L Device:D_Zener D5
U 1 1 5D3713DF
P 1700 6850
F 0 "D5" H 1700 7066 50  0000 C TNN
F 1 "D_Zener_5V" H 1700 6975 50  0001 C CNN
F 2 "Diode_THT:D_A-405_P7.62mm_Horizontal" H 1700 6850 50  0001 C CNN
F 3 "~" H 1700 6850 50  0001 C CNN
	1    1700 6850
	1    0    0    1   
$EndComp
$Comp
L power:GND #PWR0168
U 1 1 5D3713E6
P 1850 6850
F 0 "#PWR0168" H 1850 6600 50  0001 C CNN
F 1 "GND" H 1855 6677 50  0000 C CNN
F 2 "" H 1850 6850 50  0001 C CNN
F 3 "" H 1850 6850 50  0001 C CNN
	1    1850 6850
	0    -1   1    0   
$EndComp
Wire Wire Line
	1550 6550 1450 6550
Wire Wire Line
	1400 5400 1550 5400
Wire Wire Line
	1200 6400 1450 6400
Wire Wire Line
	1450 6400 1450 6550
Wire Wire Line
	1400 6650 1550 6650
$Comp
L V3_connector:CONN_2 P3
U 1 1 5D437ADA
P 2250 6600
F 0 "P3" V 2200 6600 40  0000 C CNN
F 1 "CONN_2" V 2300 6600 40  0000 C CNN
F 2 "TerminalBlock:TerminalBlock_bornier-2_P5.08mm" H 2250 6600 60  0001 C CNN
F 3 "" H 2250 6600 60  0000 C CNN
	1    2250 6600
	-1   0    0    -1  
$EndComp
Text Label 2600 6650 3    60   ~ 0
V1_T2
Text Label 2600 6350 3    60   ~ 0
V2_T2
$Comp
L Device:D_Zener D9
U 1 1 5D437AE3
P 2450 6350
F 0 "D9" H 2450 6566 50  0000 C BNN
F 1 "D_Zener_5V" H 2450 6475 50  0001 C CNN
F 2 "Diode_THT:D_A-405_P7.62mm_Horizontal" H 2450 6350 50  0001 C CNN
F 3 "~" H 2450 6350 50  0001 C CNN
	1    2450 6350
	-1   0    0    -1  
$EndComp
$Comp
L power:GND #PWR0169
U 1 1 5D437AEA
P 2300 6350
F 0 "#PWR0169" H 2300 6100 50  0001 C CNN
F 1 "GND" H 2305 6177 50  0000 C CNN
F 2 "" H 2300 6350 50  0001 C CNN
F 3 "" H 2300 6350 50  0001 C CNN
	1    2300 6350
	0    1    -1   0   
$EndComp
$Comp
L Device:D_Zener D10
U 1 1 5D437AF0
P 2450 6850
F 0 "D10" H 2450 7066 50  0000 C TNN
F 1 "D_Zener_5V" H 2450 6975 50  0001 C CNN
F 2 "Diode_THT:D_A-405_P7.62mm_Horizontal" H 2450 6850 50  0001 C CNN
F 3 "~" H 2450 6850 50  0001 C CNN
	1    2450 6850
	-1   0    0    1   
$EndComp
$Comp
L power:GND #PWR0170
U 1 1 5D437AF7
P 2300 6850
F 0 "#PWR0170" H 2300 6600 50  0001 C CNN
F 1 "GND" H 2305 6677 50  0000 C CNN
F 2 "" H 2300 6850 50  0001 C CNN
F 3 "" H 2300 6850 50  0001 C CNN
	1    2300 6850
	0    1    1    0   
$EndComp
Wire Wire Line
	2600 6550 2700 6550
Wire Wire Line
	2750 6650 2600 6650
$Comp
L V3_connector:CONN_2 P4
U 1 1 5D49D703
P 2250 5450
F 0 "P4" V 2200 5450 40  0000 C CNN
F 1 "CONN_2" V 2300 5450 40  0000 C CNN
F 2 "TerminalBlock:TerminalBlock_bornier-2_P5.08mm" H 2250 5450 60  0001 C CNN
F 3 "" H 2250 5450 60  0000 C CNN
	1    2250 5450
	-1   0    0    1   
$EndComp
Text Label 2600 5400 1    60   ~ 0
V1_T3
Text Label 2600 5700 1    60   ~ 0
V2_T3
$Comp
L Device:D_Zener D8
U 1 1 5D49D70C
P 2450 5700
F 0 "D8" H 2450 5916 50  0000 C BNN
F 1 "D_Zener_5V" H 2450 5825 50  0001 C CNN
F 2 "Diode_THT:D_A-405_P7.62mm_Horizontal" H 2450 5700 50  0001 C CNN
F 3 "~" H 2450 5700 50  0001 C CNN
	1    2450 5700
	-1   0    0    1   
$EndComp
$Comp
L power:GND #PWR0171
U 1 1 5D49D713
P 2300 5700
F 0 "#PWR0171" H 2300 5450 50  0001 C CNN
F 1 "GND" H 2305 5527 50  0000 C CNN
F 2 "" H 2300 5700 50  0001 C CNN
F 3 "" H 2300 5700 50  0001 C CNN
	1    2300 5700
	0    1    1    0   
$EndComp
$Comp
L Device:D_Zener D6
U 1 1 5D49D719
P 2450 5200
F 0 "D6" H 2450 5416 50  0000 C TNN
F 1 "D_Zener_5V" H 2450 5325 50  0001 C CNN
F 2 "Diode_THT:D_A-405_P7.62mm_Horizontal" H 2450 5200 50  0001 C CNN
F 3 "~" H 2450 5200 50  0001 C CNN
	1    2450 5200
	-1   0    0    -1  
$EndComp
$Comp
L power:GND #PWR0172
U 1 1 5D49D720
P 2300 5200
F 0 "#PWR0172" H 2300 4950 50  0001 C CNN
F 1 "GND" H 2305 5027 50  0000 C CNN
F 2 "" H 2300 5200 50  0001 C CNN
F 3 "" H 2300 5200 50  0001 C CNN
	1    2300 5200
	0    1    -1   0   
$EndComp
Wire Wire Line
	2600 5500 2700 5500
Wire Wire Line
	2750 5400 2600 5400
Wire Wire Line
	1300 5000 1300 4900
Connection ~ 1300 5000
Wire Wire Line
	1200 5050 1200 4900
Wire Wire Line
	850  5050 1200 5050
$Comp
L V3_connector:Conn_01x02 J6
U 1 1 5D88E07E
P 2950 4700
F 0 "J6" H 2950 4800 50  0000 C CNN
F 1 "Conn_01x02" H 2950 4500 50  0001 C CNN
F 2 "TerminalBlock:TerminalBlock_bornier-2_P5.08mm" H 2950 4700 50  0001 C CNN
F 3 "" H 2950 4700 50  0001 C CNN
	1    2950 4700
	0    1    -1   0   
$EndComp
Wire Wire Line
	2850 5000 2850 4900
Wire Wire Line
	2950 5050 2950 4900
Connection ~ 2850 5000
Wire Wire Line
	2950 5050 3300 5050
$Comp
L V3_connector:Conn_01x02 J4
U 1 1 5D92CB23
P 1100 7350
F 0 "J4" H 1100 7450 50  0000 C CNN
F 1 "Conn_01x02" H 1100 7150 50  0001 C CNN
F 2 "TerminalBlock:TerminalBlock_bornier-2_P5.08mm" H 1100 7350 50  0001 C CNN
F 3 "" H 1100 7350 50  0001 C CNN
	1    1100 7350
	0    -1   1    0   
$EndComp
Wire Wire Line
	1200 7050 1200 7150
Wire Wire Line
	1100 7000 1100 7150
$Comp
L V3_connector:Conn_01x02 J5
U 1 1 5D98D1AF
P 3050 7350
F 0 "J5" H 3050 7450 50  0000 C CNN
F 1 "Conn_01x02" H 3050 7150 50  0001 C CNN
F 2 "TerminalBlock:TerminalBlock_bornier-2_P5.08mm" H 3050 7350 50  0001 C CNN
F 3 "" H 3050 7350 50  0001 C CNN
	1    3050 7350
	0    1    1    0   
$EndComp
Wire Wire Line
	2950 7050 2950 7150
Wire Wire Line
	3050 7000 3050 7150
Wire Wire Line
	2950 7050 2850 7050
Connection ~ 2850 7050
Wire Wire Line
	1200 7050 1300 7050
Connection ~ 1300 7050
Text Notes 1100 4950 0    39   ~ 0
Meas T4\n
Text Notes 1000 7150 0    39   ~ 0
Meas T1\n
Text Notes 2900 7150 0    39   ~ 0
Meas T2\n
Text Notes 2750 4950 0    39   ~ 0
Meas T3
Wire Wire Line
	1550 6350 1550 6500
Wire Wire Line
	1550 6650 1550 6700
Connection ~ 1550 6500
Wire Wire Line
	1550 6500 1550 6550
Connection ~ 1550 6700
Wire Wire Line
	1550 6700 1550 6850
Wire Wire Line
	2600 6650 2600 6700
Wire Wire Line
	2600 6350 2600 6500
Connection ~ 2600 6500
Wire Wire Line
	2600 6500 2600 6550
Connection ~ 2600 6700
Wire Wire Line
	2600 6700 2600 6850
Wire Wire Line
	2600 5200 2600 5350
Wire Wire Line
	2600 5500 2600 5550
Connection ~ 2600 5350
Wire Wire Line
	2600 5350 2600 5400
Connection ~ 2600 5550
Wire Wire Line
	2600 5550 2600 5700
Wire Wire Line
	10050 5200 10350 5200
$Comp
L Sensor_Current:HX50-P-SP2 U7
U 1 1 5C82FB80
P 10350 5600
F 0 "U7" V 10791 5646 50  0000 L CNN
F 1 "HX50-P-SP2" V 10791 5555 50  0000 R TNN
F 2 "Sensor_Current:LEM_HX50-P-SP2" H 10350 5600 50  0001 L CNN
F 3 "https://www.lem.com/sites/default/files/products_datasheets/hx%203_50-p_sp2_e%20v07.pdf" H 10350 5600 50  0001 C CNN
	1    10350 5600
	0    -1   -1   0   
$EndComp
Text Label 4600 6250 0    50   ~ 0
CCOM1
Text Label 4600 6450 0    50   ~ 0
CVIN+1
Text Label 10450 6250 0    50   ~ 0
CCOM2
Text Label 10450 6450 0    50   ~ 0
CVIN+2
Text Label 10450 3550 0    50   ~ 0
CVIN+3
Text Label 10450 3750 0    50   ~ 0
CCOM3
Text Label 4650 3550 0    50   ~ 0
CVIN4
Text Label 4650 3750 0    50   ~ 0
CCOM4
$EndSCHEMATC
