date,t,D_b,I_b,N_m1,I_m1,N_m2,I_m2,I_h1,C_h1,R_h1,I_h2,C_h2,R_h2,I_h3,C_h3,R_h3
02/06/30,48,8847,3699,28796,6177,8698,1604,287,84,3030,258,58,1920,234,55,1532
03/06/30,49,9135,2953,29288,6322,8808,1637,267,91,3237,266,58,2075,217,59,1697
05/06/30,51,9558,1805,29804,6488,8928,1696,228,106,3613,237,68,2428,231,66,2009
06/06/30,52,9703,1369,30346,6535,9168,1701,213,109,3799,227,78,2604,215,72,2181
07/06/30,53,9812,1039,31082,6496,9348,1700,187,115,3943,197,81,2778,231,76,2316
08/06/30,54,9908,768,32086,6494,9638,1721,165,118,4111,181,88,2918,238,82,2449
09/06/30,55,9972,568,33050,6459,9870,1715,164,123,4230,160,88,3072,225,84,2604
12/06/30,58,10084,200,35256,6178,10568,1653,117,126,4583,108,99,3428,203,97,3046
13/06/30,59,10105,142,35832,6055,10642,1604,103,129,4674,92,104,3521,190,103,3177
14/06/30,60,10118,100,36744,5910,10886,1565,87,132,4752,85,105,3599,186,105,3321
16/06/30,62,10127,55,38074,5643,11370,1506,60,136,4885,76,108,3724,165,114,3565
17/06/30,63,10133,43,38674,5477,11534,1458,46,138,4944,66,110,3777,151,114,3679
19/06/30,65,10137,28,40222,5165,11938,1375,35,140,5018,39,115,3886,133,125,3869
21/06/30,67,10143,14,41418,4893,12328,1286,24,144,5075,22,117,3953,121,129,4053
