0 0.6062348748653179 0.5619550962301613 0.0883156360272352 0.030915645173589645
0 0.2349315038486818 0.6183486933225419 0.10233084168972625 0.05065472177238952
0 0.8115798571636347 0.6395248755780731 0.0892847800426992 0.04997608087222059
