0 0.2823751205782646 0.38994172371534674 0.0856323865654888 0.03159375135395424
0 0.5353803681341612 0.2984058635253306 0.054862576538147856 0.027219503071093776
0 0.32472284993086503 0.6244684656372205 0.061712185495406226 0.02610713510150422
0 0.7162571053658894 0.6131485022135119 0.12397436096741252 0.056771938559713145
