PatientID,SurvivalTime,Event
207,646,nan
245,632,nan
220,911,nan
219,379,nan
413,799,nan
075,907,nan
050,472,nan
034,646,nan
215,493,nan
118,799,nan
182,493,nan
374,865,nan
038,573,nan
352,865,nan
281,635,nan
097,646,nan
019,706,nan
132,754,nan
344,815,nan
332,632,nan
104,527,nan
153,685,nan
379,635,nan
120,476,nan
010,754,nan
360,683,nan
136,714,nan
260,515,nan
049,635,nan
387,632,nan
364,573,nan
125,683,nan
411,1070,nan
324,448,nan
054,539,nan
363,646,nan
179,539,nan
155,683,nan
065,476,nan
074,703,nan
289,448,nan
046,465,nan
296,642,nan
407,714,nan
119,575,nan
199,646,nan
028,685,nan
265,687,nan
301,528,nan
311,799,nan
066,632,nan
351,632,nan
201,539,nan
405,706,nan
085,528,nan
271,642,nan
169,632,nan
140,639,nan
006,573,nan
267,683,nan
200,632,nan
415,476,nan
234,632,nan
001,361,nan
278,703,nan
062,911,nan
170,573,nan
080,575,nan
270,642,nan
113,639,nan
190,754,nan
203,539,nan
060,683,nan
292,527,nan
243,454,nan
254,515,nan
239,639,nan
408,573,nan
013,439,nan
059,685,nan
404,642,nan
198,991,nan
206,1002,nan
000,539,nan
156,573,nan
012,865,nan
158,683,nan
071,799,nan
128,903,nan
398,573,nan
055,865,nan
377,515,nan
146,439,nan
027,706,nan
241,340,nan
342,907,nan
326,528,nan
370,756,nan
369,457,nan
322,911,nan
287,575,nan
194,472,nan
412,632,nan
232,515,nan
167,703,nan
192,573,nan
230,714,nan
205,573,nan
291,687,nan
177,799,nan
087,632,nan
127,635,nan
410,754,nan
041,756,nan
099,907,nan
217,465,nan
337,515,nan
168,515,nan
223,799,nan
009,632,nan
319,454,nan
339,512,nan
419,575,nan
274,476,nan
191,303,nan
