[
  {
    "title": "Bayesian Generalization Error in Linear Neural Networks with Concept\n  Bottleneck Structure and Multitask Formulation",
    "subject": "Data Analysis",
    "created": "2023-03-16T08:34:56Z",
    "identifier": "2303-09154",
    "bibliographicCitation": [],
    "maker": [
      {
        "name": "Naoki Hayashi"
      },
      {
        "name": "Yoshihide Sawada"
      }
    ]
  },
  {
    "title": "Fiber Tract Shape Measures Inform Prediction of Non-Imaging Phenotypes",
    "subject": "Chinese Learning",
    "created": "2023-03-16T07:39:07Z",
    "identifier": "2303-09124",
    "bibliographicCitation": [
      "2301-01911"
    ],
    "maker": [
      {
        "name": "Wan Liu"
      },
      {
        "name": "Yuqian Chen"
      },
      {
        "name": "Chuyang Ye"
      },
      {
        "name": "Nikos Makris"
      },
      {
        "name": "Yogesh Rathi"
      },
      {
        "name": "Weidong Cai"
      },
      {
        "name": "Fan Zhang"
      },
      {
        "name": "Lauren J. O' Donnell"
      }
    ]
  }
]