[
  {
    "title": "EGC: Image Generation and Classification via a Single Energy-Based Model",
    "subject": "Challenging Models",
    "created": "2023-04-04T17:59:14Z",
    "identifier": "2304-02012",
    "bibliographicCitation": [],
    "maker": [
      {
        "name": "Qiushan Guo"
      },
      {
        "name": "Chuofan Ma"
      },
      {
        "name": "Yi Jiang"
      },
      {
        "name": "Zehuan Yuan"
      },
      {
        "name": "Yizhou Yu"
      },
      {
        "name": "Ping Luo"
      }
    ]
  },
  {
    "title": "Multi-Level Contrastive Learning for Dense Prediction Task",
    "subject": "Machine Learning",
    "created": "2023-04-04T17:59:04Z",
    "identifier": "2304-02010",
    "bibliographicCitation": [],
    "maker": [
      {
        "name": "Qiushan Guo"
      },
      {
        "name": "Yizhou Yu"
      },
      {
        "name": "Yi Jiang"
      },
      {
        "name": "Jiannan Wu"
      },
      {
        "name": "Zehuan Yuan"
      },
      {
        "name": "Ping Luo"
      }
    ]
  },
  {
    "title": "Risk-Aware Distributed Multi-Agent Reinforcement Learning",
    "subject": "Machine Learning",
    "created": "2023-04-04T17:56:44Z",
    "identifier": "2304-02005",
    "bibliographicCitation": [],
    "maker": [
      {
        "name": "Abdullah Al Maruf"
      },
      {
        "name": "Luyao Niu"
      },
      {
        "name": "Bhaskar Ramasubramanian"
      },
      {
        "name": "Andrew Clark"
      },
      {
        "name": "Radha Poovendran"
      }
    ]
  },
  {
    "title": "MEGClass: Text Classification with Extremely Weak Supervision via\n  Mutually-Enhancing Text Granularities",
    "subject": "AI Optimization",
    "created": "2023-04-04T17:26:11Z",
    "identifier": "2304-01969",
    "bibliographicCitation": [
      "1906-08237"
    ],
    "maker": [
      {
        "name": "Priyanka Kargupta"
      },
      {
        "name": "Tanay Komarlu"
      },
      {
        "name": "Susik Yoon"
      },
      {
        "name": "Xuan Wang"
      },
      {
        "name": "Jiawei Han"
      }
    ]
  },
  {
    "title": "High-Throughput Vector Similarity Search in Knowledge Graphs",
    "subject": "Online Tools",
    "created": "2023-04-04T16:19:15Z",
    "identifier": "2304-01926",
    "bibliographicCitation": [],
    "maker": [
      {
        "name": "Jason Mohoney"
      },
      {
        "name": "Anil Pacaci"
      },
      {
        "name": "Shihabur Rahman Chowdhury"
      },
      {
        "name": "Ali Mousavi"
      },
      {
        "name": "Ihab F. Ilyas"
      },
      {
        "name": "Umar Farooq Minhas"
      },
      {
        "name": "Jeffrey Pound"
      },
      {
        "name": "Theodoros Rekatsinas"
      }
    ]
  },
  {
    "title": "PODIA-3D: Domain Adaptation of 3D Generative Model Across Large Domain\n  Gap Using Pose-Preserved Text-to-Image Diffusion",
    "subject": "Challenging Models",
    "created": "2023-04-04T15:49:01Z",
    "identifier": "2304-01900",
    "bibliographicCitation": [],
    "maker": [
      {
        "name": "Gwanghyun Kim"
      },
      {
        "name": "Ji Ha Jang"
      },
      {
        "name": "Se Young Chun"
      }
    ]
  },
  {
    "title": "InfluencerRank: Discovering Effective Influencers via Graph\n  Convolutional Attentive Recurrent Neural Networks",
    "subject": "AI Optimization",
    "created": "2023-04-04T15:48:08Z",
    "identifier": "2304-01897",
    "bibliographicCitation": [],
    "maker": [
      {
        "name": "Seungbae Kim"
      },
      {
        "name": "Jyun-Yu Jiang"
      },
      {
        "name": "Jinyoung Han"
      },
      {
        "name": "Wei Wang"
      }
    ]
  },
  {
    "title": "Robustness Benchmark of Road User Trajectory Prediction Models for\n  Automated Driving",
    "subject": "AI Optimization",
    "created": "2023-04-04T15:47:42Z",
    "identifier": "2304-01895",
    "bibliographicCitation": [],
    "maker": [
      {
        "name": "Manuel Muñoz Sánchez"
      },
      {
        "name": "Emilia Silvas"
      },
      {
        "name": "Jos Elfring"
      },
      {
        "name": "René van de Molengraft"
      }
    ]
  },
  {
    "title": "Sociocultural knowledge is needed for selection of shots in hate speech\n  detection tasks",
    "subject": "AI Optimization",
    "created": "2023-04-04T15:42:08Z",
    "identifier": "2304-01890",
    "bibliographicCitation": [],
    "maker": [
      {
        "name": "Antonis Maronikolakis"
      },
      {
        "name": "Abdullatif Köksal"
      },
      {
        "name": "Hinrich Schütze"
      }
    ]
  },
  {
    "title": "Deep-BIAS: Detecting Structural Bias using Explainable AI",
    "subject": "Algorithm Complexity",
    "created": "2023-04-04T15:21:15Z",
    "identifier": "2304-01869",
    "bibliographicCitation": [],
    "maker": [
      {
        "name": "Bas van Stein"
      },
      {
        "name": "Diederick Vermetten"
      },
      {
        "name": "Fabio Caraffini"
      },
      {
        "name": "Anna V. Kononova"
      }
    ]
  }
]