LUI    PASSED  (lui.s)
ADDI   PASSED  (addi.s)
SUB    PASSED  (sub.s)
ADD    PASSED  (add.s)
AUIPC  PASSED  (auipc.s)
AND    PASSED  (and.s)
ANDI   PASSED  (andi.s)
OR     PASSED  (or.s)
ORI    PASSED  (ori.s)
XOR    PASSED  (xor.s)
XORI   PASSED  (xori.s)
SLL    PASSED  (sll.s)
SLLI   PASSED  (slli.s)
SRL    PASSED  (srl.s)
SRLI   PASSED  (srli.s)
SRA    PASSED  (sra.s)
SRAI   PASSED  (srai.s)
SLT    PASSED  (slt.s)
SLTI   PASSED  (slti.s)
SLTU   PASSED  (sltu.s)
SLTIU  PASSED  (sltiu.s)
LW     PASSED  (lw.s)
JAL    PASSED  (jal.s)
JALR   PASSED  (jalr.s)
BEQ    PASSED  (beq.s)
BGE    PASSED  (bge.s)
BGEU   PASSED  (bgeu.s)
BLT    PASSED  (blt.s)
BLTU   PASSED  (bltu.s)
BNE    PASSED  (bne.s)
