n1	n1	0	[nil, n1]
n1	n2	1	[[nil, n1], n2]
n1	n3	2	[[[nil, n1], n2], n3]
n1	n4	2	[[[nil, n1], n2], n4]
n2	n2	0	[nil, n2]
n2	n3	1	[[nil, n2], n3]
n2	n4	1	[[nil, n2], n4]
n3	n3	0	[nil, n3]
n3	n4	1	[[nil, n3], n4]
n4	n4	0	[nil, n4]
