[2021-12-02T14:21:46.114+0100][gc,heap] Heap region size: 1M
[2021-12-02T14:21:46.122+0100][gc     ] Using G1
[2021-12-02T14:21:46.122+0100][gc,heap,coops] Heap address: 0x00000000c0000000, size: 1024 MB, Compressed Oops mode: 32-bit
[2021-12-02T14:21:46.123+0100][gc,cds       ] Mark closed archive regions in map: [0x00000000fff00000, 0x00000000fff6aff8]
[2021-12-02T14:21:46.123+0100][gc,cds       ] Mark open archive regions in map: [0x00000000ffe00000, 0x00000000ffe46ff8]
[2021-12-02T14:21:47.249+0100][gc,start     ] GC(0) Pause Young (Normal) (G1 Evacuation Pause)
[2021-12-02T14:21:47.249+0100][gc,task      ] GC(0) Using 2 workers of 2 for evacuation
[2021-12-02T14:21:47.265+0100][gc,phases    ] GC(0)   Pre Evacuate Collection Set: 0,0ms
[2021-12-02T14:21:47.265+0100][gc,phases    ] GC(0)   Evacuate Collection Set: 15,9ms
[2021-12-02T14:21:47.265+0100][gc,phases    ] GC(0)   Post Evacuate Collection Set: 0,3ms
[2021-12-02T14:21:47.265+0100][gc,phases    ] GC(0)   Other: 0,2ms
[2021-12-02T14:21:47.265+0100][gc,heap      ] GC(0) Eden regions: 51->0(44)
[2021-12-02T14:21:47.265+0100][gc,heap      ] GC(0) Survivor regions: 0->7(7)
[2021-12-02T14:21:47.265+0100][gc,heap      ] GC(0) Old regions: 2->2
[2021-12-02T14:21:47.265+0100][gc,heap      ] GC(0) Humongous regions: 0->0
[2021-12-02T14:21:47.265+0100][gc,metaspace ] GC(0) Metaspace: 15725K->15725K(1062912K)
[2021-12-02T14:21:47.265+0100][gc           ] GC(0) Pause Young (Normal) (G1 Evacuation Pause) 51M->7M(1024M) 16,502ms
[2021-12-02T14:21:47.265+0100][gc,cpu       ] GC(0) User=0,02s Sys=0,00s Real=0,01s
[2021-12-02T14:21:47.474+0100][gc,start     ] GC(1) Pause Young (Concurrent Start) (Metadata GC Threshold)
[2021-12-02T14:21:47.474+0100][gc,task      ] GC(1) Using 2 workers of 2 for evacuation
[2021-12-02T14:21:47.489+0100][gc,phases    ] GC(1)   Pre Evacuate Collection Set: 0,0ms
[2021-12-02T14:21:47.489+0100][gc,phases    ] GC(1)   Evacuate Collection Set: 15,1ms
[2021-12-02T14:21:47.489+0100][gc,phases    ] GC(1)   Post Evacuate Collection Set: 0,2ms
[2021-12-02T14:21:47.489+0100][gc,phases    ] GC(1)   Other: 0,1ms
[2021-12-02T14:21:47.489+0100][gc,heap      ] GC(1) Eden regions: 20->0(50)
[2021-12-02T14:21:47.489+0100][gc,heap      ] GC(1) Survivor regions: 7->1(7)
[2021-12-02T14:21:47.489+0100][gc,heap      ] GC(1) Old regions: 2->9
[2021-12-02T14:21:47.489+0100][gc,heap      ] GC(1) Humongous regions: 0->0
[2021-12-02T14:21:47.489+0100][gc,metaspace ] GC(1) Metaspace: 20610K->20610K(1069056K)
[2021-12-02T14:21:47.489+0100][gc           ] GC(1) Pause Young (Concurrent Start) (Metadata GC Threshold) 27M->7M(1024M) 15,652ms
[2021-12-02T14:21:47.489+0100][gc,cpu       ] GC(1) User=0,03s Sys=0,00s Real=0,02s
[2021-12-02T14:21:47.489+0100][gc           ] GC(2) Concurrent Cycle
[2021-12-02T14:21:47.489+0100][gc,marking   ] GC(2) Concurrent Clear Claimed Marks
[2021-12-02T14:21:47.489+0100][gc,marking   ] GC(2) Concurrent Clear Claimed Marks 0,082ms
[2021-12-02T14:21:47.490+0100][gc,marking   ] GC(2) Concurrent Scan Root Regions
[2021-12-02T14:21:47.491+0100][gc,marking   ] GC(2) Concurrent Scan Root Regions 1,513ms
[2021-12-02T14:21:47.491+0100][gc,marking   ] GC(2) Concurrent Mark (1,380s)
[2021-12-02T14:21:47.491+0100][gc,marking   ] GC(2) Concurrent Mark From Roots
[2021-12-02T14:21:47.491+0100][gc,task      ] GC(2) Using 1 workers of 1 for marking
[2021-12-02T14:21:47.507+0100][gc,marking   ] GC(2) Concurrent Mark From Roots 15,513ms
[2021-12-02T14:21:47.507+0100][gc,marking   ] GC(2) Concurrent Preclean
[2021-12-02T14:21:47.507+0100][gc,marking   ] GC(2) Concurrent Preclean 0,052ms
[2021-12-02T14:21:47.507+0100][gc,marking   ] GC(2) Concurrent Mark (1,380s, 1,396s) 15,600ms
[2021-12-02T14:21:47.507+0100][gc,start     ] GC(2) Pause Remark
[2021-12-02T14:21:47.509+0100][gc,stringtable] GC(2) Cleaned string and symbol table, strings: 4854 processed, 0 removed, symbols: 51251 processed, 46 removed
[2021-12-02T14:21:47.509+0100][gc            ] GC(2) Pause Remark 8M->8M(1024M) 1,883ms
[2021-12-02T14:21:47.509+0100][gc,cpu        ] GC(2) User=0,00s Sys=0,00s Real=0,01s
[2021-12-02T14:21:47.509+0100][gc,marking    ] GC(2) Concurrent Rebuild Remembered Sets
[2021-12-02T14:21:47.518+0100][gc,marking    ] GC(2) Concurrent Rebuild Remembered Sets 9,339ms
[2021-12-02T14:21:47.518+0100][gc,start      ] GC(2) Pause Cleanup
[2021-12-02T14:21:47.518+0100][gc            ] GC(2) Pause Cleanup 8M->8M(1024M) 0,234ms
[2021-12-02T14:21:47.518+0100][gc,cpu        ] GC(2) User=0,01s Sys=0,00s Real=0,00s
[2021-12-02T14:21:47.518+0100][gc,marking    ] GC(2) Concurrent Cleanup for Next Mark
[2021-12-02T14:21:47.531+0100][gc,marking    ] GC(2) Concurrent Cleanup for Next Mark 12,494ms
[2021-12-02T14:21:47.531+0100][gc            ] GC(2) Concurrent Cycle 41,604ms
[2021-12-02T14:21:48.529+0100][gc,start      ] GC(3) Pause Young (Normal) (G1 Evacuation Pause)
[2021-12-02T14:21:48.529+0100][gc,task       ] GC(3) Using 2 workers of 2 for evacuation
[2021-12-02T14:21:48.536+0100][gc,phases     ] GC(3)   Pre Evacuate Collection Set: 0,0ms
[2021-12-02T14:21:48.536+0100][gc,phases     ] GC(3)   Evacuate Collection Set: 6,5ms
[2021-12-02T14:21:48.536+0100][gc,phases     ] GC(3)   Post Evacuate Collection Set: 0,4ms
[2021-12-02T14:21:48.536+0100][gc,phases     ] GC(3)   Other: 0,1ms
[2021-12-02T14:21:48.536+0100][gc,heap       ] GC(3) Eden regions: 50->0(46)
[2021-12-02T14:21:48.536+0100][gc,heap       ] GC(3) Survivor regions: 1->5(7)
[2021-12-02T14:21:48.536+0100][gc,heap       ] GC(3) Old regions: 9->9
[2021-12-02T14:21:48.536+0100][gc,heap       ] GC(3) Humongous regions: 129->129
[2021-12-02T14:21:48.536+0100][gc,metaspace  ] GC(3) Metaspace: 28647K->28647K(1075200K)
[2021-12-02T14:21:48.536+0100][gc            ] GC(3) Pause Young (Normal) (G1 Evacuation Pause) 186M->140M(1024M) 7,061ms
[2021-12-02T14:21:48.536+0100][gc,cpu        ] GC(3) User=0,02s Sys=0,00s Real=0,00s
[2021-12-02T14:21:49.050+0100][gc,start      ] GC(4) Pause Young (Concurrent Start) (Metadata GC Threshold)
[2021-12-02T14:21:49.050+0100][gc,task       ] GC(4) Using 2 workers of 2 for evacuation
[2021-12-02T14:21:49.073+0100][gc,mmu        ] GC(4) MMU target violated: 21,0ms (20,0ms/21,0ms)
[2021-12-02T14:21:49.073+0100][gc,phases     ] GC(4)   Pre Evacuate Collection Set: 0,2ms
[2021-12-02T14:21:49.073+0100][gc,phases     ] GC(4)   Evacuate Collection Set: 22,2ms
[2021-12-02T14:21:49.073+0100][gc,phases     ] GC(4)   Post Evacuate Collection Set: 0,3ms
[2021-12-02T14:21:49.073+0100][gc,phases     ] GC(4)   Other: 0,3ms
[2021-12-02T14:21:49.073+0100][gc,heap       ] GC(4) Eden regions: 31->0(49)
[2021-12-02T14:21:49.073+0100][gc,heap       ] GC(4) Survivor regions: 5->2(7)
[2021-12-02T14:21:49.073+0100][gc,heap       ] GC(4) Old regions: 9->14
[2021-12-02T14:21:49.073+0100][gc,heap       ] GC(4) Humongous regions: 129->129
[2021-12-02T14:21:49.073+0100][gc,metaspace  ] GC(4) Metaspace: 34393K->34393K(1081344K)
[2021-12-02T14:21:49.073+0100][gc            ] GC(4) Pause Young (Concurrent Start) (Metadata GC Threshold) 171M->143M(1024M) 23,008ms
[2021-12-02T14:21:49.073+0100][gc,cpu        ] GC(4) User=0,02s Sys=0,00s Real=0,02s
[2021-12-02T14:21:49.073+0100][gc            ] GC(5) Concurrent Cycle
[2021-12-02T14:21:49.073+0100][gc,marking    ] GC(5) Concurrent Clear Claimed Marks
[2021-12-02T14:21:49.073+0100][gc,marking    ] GC(5) Concurrent Clear Claimed Marks 0,108ms
[2021-12-02T14:21:49.073+0100][gc,marking    ] GC(5) Concurrent Scan Root Regions
[2021-12-02T14:21:49.075+0100][gc,marking    ] GC(5) Concurrent Scan Root Regions 1,747ms
[2021-12-02T14:21:49.075+0100][gc,marking    ] GC(5) Concurrent Mark (2,964s)
[2021-12-02T14:21:49.075+0100][gc,marking    ] GC(5) Concurrent Mark From Roots
[2021-12-02T14:21:49.075+0100][gc,task       ] GC(5) Using 1 workers of 1 for marking
[2021-12-02T14:21:49.154+0100][gc,marking    ] GC(5) Concurrent Mark From Roots 79,044ms
[2021-12-02T14:21:49.154+0100][gc,marking    ] GC(5) Concurrent Preclean
[2021-12-02T14:21:49.154+0100][gc,marking    ] GC(5) Concurrent Preclean 0,110ms
[2021-12-02T14:21:49.154+0100][gc,marking    ] GC(5) Concurrent Mark (2,964s, 3,043s) 79,194ms
[2021-12-02T14:21:49.154+0100][gc,start      ] GC(5) Pause Remark
[2021-12-02T14:21:49.158+0100][gc,stringtable] GC(5) Cleaned string and symbol table, strings: 10321 processed, 7 removed, symbols: 78471 processed, 16 removed
[2021-12-02T14:21:49.158+0100][gc            ] GC(5) Pause Remark 144M->144M(1024M) 4,129ms
[2021-12-02T14:21:49.158+0100][gc,cpu        ] GC(5) User=0,01s Sys=0,00s Real=0,00s
[2021-12-02T14:21:49.158+0100][gc,marking    ] GC(5) Concurrent Rebuild Remembered Sets
[2021-12-02T14:21:49.189+0100][gc,marking    ] GC(5) Concurrent Rebuild Remembered Sets 30,760ms
[2021-12-02T14:21:49.189+0100][gc,start      ] GC(5) Pause Cleanup
[2021-12-02T14:21:49.190+0100][gc            ] GC(5) Pause Cleanup 144M->144M(1024M) 0,278ms
[2021-12-02T14:21:49.190+0100][gc,cpu        ] GC(5) User=0,00s Sys=0,00s Real=0,00s
[2021-12-02T14:21:49.190+0100][gc,marking    ] GC(5) Concurrent Cleanup for Next Mark
[2021-12-02T14:21:49.200+0100][gc,marking    ] GC(5) Concurrent Cleanup for Next Mark 10,660ms
[2021-12-02T14:21:49.200+0100][gc            ] GC(5) Concurrent Cycle 127,371ms
[2021-12-02T14:36:07.876+0100][gc,start      ] GC(6) Pause Young (Normal) (G1 Evacuation Pause)
[2021-12-02T14:36:07.877+0100][gc,task       ] GC(6) Using 2 workers of 2 for evacuation
[2021-12-02T14:36:08.185+0100][gc,mmu        ] GC(6) MMU target violated: 21,0ms (20,0ms/21,0ms)
[2021-12-02T14:36:08.185+0100][gc,phases     ] GC(6)   Pre Evacuate Collection Set: 111,2ms
[2021-12-02T14:36:08.185+0100][gc,phases     ] GC(6)   Evacuate Collection Set: 190,2ms
[2021-12-02T14:36:08.185+0100][gc,phases     ] GC(6)   Post Evacuate Collection Set: 2,1ms
[2021-12-02T14:36:08.185+0100][gc,phases     ] GC(6)   Other: 8,2ms
[2021-12-02T14:36:08.185+0100][gc,heap       ] GC(6) Eden regions: 49->0(48)
[2021-12-02T14:36:08.185+0100][gc,heap       ] GC(6) Survivor regions: 2->3(7)
[2021-12-02T14:36:08.185+0100][gc,heap       ] GC(6) Old regions: 14->14
[2021-12-02T14:36:08.185+0100][gc,heap       ] GC(6) Humongous regions: 129->129
[2021-12-02T14:36:08.185+0100][gc,metaspace  ] GC(6) Metaspace: 36528K->36528K(1083392K)
[2021-12-02T14:36:08.185+0100][gc            ] GC(6) Pause Young (Normal) (G1 Evacuation Pause) 192M->143M(1024M) 309,820ms
[2021-12-02T14:36:08.185+0100][gc,cpu        ] GC(6) User=0,04s Sys=0,01s Real=0,31s
[2021-12-02T14:36:55.502+0100][gc,start      ] GC(7) Pause Young (Normal) (G1 Evacuation Pause)
[2021-12-02T14:36:55.502+0100][gc,task       ] GC(7) Using 2 workers of 2 for evacuation
[2021-12-02T14:36:55.523+0100][gc,mmu        ] GC(7) MMU target violated: 21,0ms (20,0ms/21,0ms)
[2021-12-02T14:36:55.523+0100][gc,phases     ] GC(7)   Pre Evacuate Collection Set: 0,0ms
[2021-12-02T14:36:55.523+0100][gc,phases     ] GC(7)   Evacuate Collection Set: 20,0ms
[2021-12-02T14:36:55.523+0100][gc,phases     ] GC(7)   Post Evacuate Collection Set: 0,8ms
[2021-12-02T14:36:55.523+0100][gc,phases     ] GC(7)   Other: 4,2ms
[2021-12-02T14:36:55.523+0100][gc,heap       ] GC(7) Eden regions: 48->0(47)
[2021-12-02T14:36:55.523+0100][gc,heap       ] GC(7) Survivor regions: 3->4(7)
[2021-12-02T14:36:55.523+0100][gc,heap       ] GC(7) Old regions: 14->14
[2021-12-02T14:36:55.523+0100][gc,heap       ] GC(7) Humongous regions: 129->129
[2021-12-02T14:36:55.523+0100][gc,metaspace  ] GC(7) Metaspace: 38613K->38613K(1085440K)
[2021-12-02T14:36:55.523+0100][gc            ] GC(7) Pause Young (Normal) (G1 Evacuation Pause) 191M->144M(1024M) 21,217ms
[2021-12-02T14:36:55.523+0100][gc,cpu        ] GC(7) User=0,02s Sys=0,00s Real=0,02s
[2021-12-02T14:39:18.717+0100][gc,start      ] GC(8) Pause Young (Normal) (G1 Evacuation Pause)
[2021-12-02T14:39:18.717+0100][gc,task       ] GC(8) Using 2 workers of 2 for evacuation
[2021-12-02T14:39:18.728+0100][gc,phases     ] GC(8)   Pre Evacuate Collection Set: 0,0ms
[2021-12-02T14:39:18.728+0100][gc,phases     ] GC(8)   Evacuate Collection Set: 6,2ms
[2021-12-02T14:39:18.728+0100][gc,phases     ] GC(8)   Post Evacuate Collection Set: 4,0ms
[2021-12-02T14:39:18.728+0100][gc,phases     ] GC(8)   Other: 0,2ms
[2021-12-02T14:39:18.728+0100][gc,heap       ] GC(8) Eden regions: 47->0(47)
[2021-12-02T14:39:18.728+0100][gc,heap       ] GC(8) Survivor regions: 4->4(7)
[2021-12-02T14:39:18.728+0100][gc,heap       ] GC(8) Old regions: 14->14
[2021-12-02T14:39:18.728+0100][gc,heap       ] GC(8) Humongous regions: 129->129
[2021-12-02T14:39:18.728+0100][gc,metaspace  ] GC(8) Metaspace: 38625K->38625K(1085440K)
[2021-12-02T14:39:18.728+0100][gc            ] GC(8) Pause Young (Normal) (G1 Evacuation Pause) 191M->144M(1024M) 10,507ms
[2021-12-02T14:39:18.728+0100][gc,cpu        ] GC(8) User=0,01s Sys=0,00s Real=0,01s
[2021-12-02T14:43:28.246+0100][gc,start      ] GC(9) Pause Young (Normal) (G1 Evacuation Pause)
[2021-12-02T14:43:28.246+0100][gc,task       ] GC(9) Using 2 workers of 2 for evacuation
[2021-12-02T14:43:28.258+0100][gc,phases     ] GC(9)   Pre Evacuate Collection Set: 0,0ms
[2021-12-02T14:43:28.258+0100][gc,phases     ] GC(9)   Evacuate Collection Set: 11,7ms
[2021-12-02T14:43:28.258+0100][gc,phases     ] GC(9)   Post Evacuate Collection Set: 0,5ms
[2021-12-02T14:43:28.258+0100][gc,phases     ] GC(9)   Other: 0,2ms
[2021-12-02T14:43:28.258+0100][gc,heap       ] GC(9) Eden regions: 47->0(47)
[2021-12-02T14:43:28.258+0100][gc,heap       ] GC(9) Survivor regions: 4->4(7)
[2021-12-02T14:43:28.258+0100][gc,heap       ] GC(9) Old regions: 14->14
[2021-12-02T14:43:28.258+0100][gc,heap       ] GC(9) Humongous regions: 129->129
[2021-12-02T14:43:28.258+0100][gc,metaspace  ] GC(9) Metaspace: 38658K->38658K(1085440K)
[2021-12-02T14:43:28.258+0100][gc            ] GC(9) Pause Young (Normal) (G1 Evacuation Pause) 191M->144M(1024M) 12,521ms
[2021-12-02T14:43:28.258+0100][gc,cpu        ] GC(9) User=0,02s Sys=0,00s Real=0,01s
[2021-12-02T14:46:37.875+0100][gc,start      ] GC(10) Pause Young (Normal) (G1 Evacuation Pause)
[2021-12-02T14:46:37.875+0100][gc,task       ] GC(10) Using 2 workers of 2 for evacuation
[2021-12-02T14:46:37.884+0100][gc,phases     ] GC(10)   Pre Evacuate Collection Set: 0,1ms
[2021-12-02T14:46:37.884+0100][gc,phases     ] GC(10)   Evacuate Collection Set: 8,0ms
[2021-12-02T14:46:37.884+0100][gc,phases     ] GC(10)   Post Evacuate Collection Set: 0,5ms
[2021-12-02T14:46:37.884+0100][gc,phases     ] GC(10)   Other: 0,9ms
[2021-12-02T14:46:37.884+0100][gc,heap       ] GC(10) Eden regions: 47->0(47)
[2021-12-02T14:46:37.884+0100][gc,heap       ] GC(10) Survivor regions: 4->4(7)
[2021-12-02T14:46:37.884+0100][gc,heap       ] GC(10) Old regions: 14->14
[2021-12-02T14:46:37.884+0100][gc,heap       ] GC(10) Humongous regions: 129->129
[2021-12-02T14:46:37.884+0100][gc,metaspace  ] GC(10) Metaspace: 38672K->38672K(1085440K)
[2021-12-02T14:46:37.884+0100][gc            ] GC(10) Pause Young (Normal) (G1 Evacuation Pause) 191M->144M(1024M) 9,228ms
[2021-12-02T14:46:37.884+0100][gc,cpu        ] GC(10) User=0,01s Sys=0,00s Real=0,01s
[2021-12-02T14:49:24.059+0100][gc,start      ] GC(11) Pause Young (Normal) (G1 Evacuation Pause)
[2021-12-02T14:49:24.059+0100][gc,task       ] GC(11) Using 2 workers of 2 for evacuation
[2021-12-02T14:49:24.072+0100][gc,phases     ] GC(11)   Pre Evacuate Collection Set: 0,1ms
[2021-12-02T14:49:24.072+0100][gc,phases     ] GC(11)   Evacuate Collection Set: 12,1ms
[2021-12-02T14:49:24.072+0100][gc,phases     ] GC(11)   Post Evacuate Collection Set: 0,4ms
[2021-12-02T14:49:24.072+0100][gc,phases     ] GC(11)   Other: 0,4ms
[2021-12-02T14:49:24.072+0100][gc,heap       ] GC(11) Eden regions: 47->0(47)
[2021-12-02T14:49:24.072+0100][gc,heap       ] GC(11) Survivor regions: 4->4(7)
[2021-12-02T14:49:24.072+0100][gc,heap       ] GC(11) Old regions: 14->14
[2021-12-02T14:49:24.072+0100][gc,heap       ] GC(11) Humongous regions: 129->129
[2021-12-02T14:49:24.072+0100][gc,metaspace  ] GC(11) Metaspace: 38693K->38693K(1085440K)
[2021-12-02T14:49:24.072+0100][gc            ] GC(11) Pause Young (Normal) (G1 Evacuation Pause) 191M->144M(1024M) 12,935ms
[2021-12-02T14:49:24.072+0100][gc,cpu        ] GC(11) User=0,02s Sys=0,00s Real=0,02s
[2021-12-02T14:54:34.361+0100][gc,start      ] GC(12) Pause Young (Normal) (G1 Evacuation Pause)
[2021-12-02T14:54:34.362+0100][gc,task       ] GC(12) Using 2 workers of 2 for evacuation
[2021-12-02T14:54:34.369+0100][gc,phases     ] GC(12)   Pre Evacuate Collection Set: 0,0ms
[2021-12-02T14:54:34.369+0100][gc,phases     ] GC(12)   Evacuate Collection Set: 6,1ms
[2021-12-02T14:54:34.369+0100][gc,phases     ] GC(12)   Post Evacuate Collection Set: 0,5ms
[2021-12-02T14:54:34.369+0100][gc,phases     ] GC(12)   Other: 1,2ms
[2021-12-02T14:54:34.369+0100][gc,heap       ] GC(12) Eden regions: 47->0(47)
[2021-12-02T14:54:34.369+0100][gc,heap       ] GC(12) Survivor regions: 4->4(7)
[2021-12-02T14:54:34.369+0100][gc,heap       ] GC(12) Old regions: 14->14
[2021-12-02T14:54:34.369+0100][gc,heap       ] GC(12) Humongous regions: 129->129
[2021-12-02T14:54:34.369+0100][gc,metaspace  ] GC(12) Metaspace: 38741K->38741K(1085440K)
[2021-12-02T14:54:34.369+0100][gc            ] GC(12) Pause Young (Normal) (G1 Evacuation Pause) 191M->144M(1024M) 7,835ms
[2021-12-02T14:54:34.369+0100][gc,cpu        ] GC(12) User=0,01s Sys=0,00s Real=0,01s
[2021-12-02T14:59:19.225+0100][gc,start      ] GC(13) Pause Young (Normal) (G1 Evacuation Pause)
[2021-12-02T14:59:19.226+0100][gc,task       ] GC(13) Using 2 workers of 2 for evacuation
[2021-12-02T14:59:19.239+0100][gc,phases     ] GC(13)   Pre Evacuate Collection Set: 0,1ms
[2021-12-02T14:59:19.239+0100][gc,phases     ] GC(13)   Evacuate Collection Set: 13,2ms
[2021-12-02T14:59:19.239+0100][gc,phases     ] GC(13)   Post Evacuate Collection Set: 0,4ms
[2021-12-02T14:59:19.239+0100][gc,phases     ] GC(13)   Other: 0,6ms
[2021-12-02T14:59:19.239+0100][gc,heap       ] GC(13) Eden regions: 47->0(47)
[2021-12-02T14:59:19.239+0100][gc,heap       ] GC(13) Survivor regions: 4->4(7)
[2021-12-02T14:59:19.240+0100][gc,heap       ] GC(13) Old regions: 14->14
[2021-12-02T14:59:19.240+0100][gc,heap       ] GC(13) Humongous regions: 129->129
[2021-12-02T14:59:19.240+0100][gc,metaspace  ] GC(13) Metaspace: 38758K->38758K(1085440K)
[2021-12-02T14:59:19.240+0100][gc            ] GC(13) Pause Young (Normal) (G1 Evacuation Pause) 191M->144M(1024M) 14,111ms
[2021-12-02T14:59:19.240+0100][gc,cpu        ] GC(13) User=0,02s Sys=0,00s Real=0,01s
[2021-12-02T15:05:05.926+0100][gc,start      ] GC(14) Pause Young (Normal) (G1 Evacuation Pause)
[2021-12-02T15:05:05.926+0100][gc,task       ] GC(14) Using 2 workers of 2 for evacuation
[2021-12-02T15:05:05.936+0100][gc,phases     ] GC(14)   Pre Evacuate Collection Set: 0,0ms
[2021-12-02T15:05:05.936+0100][gc,phases     ] GC(14)   Evacuate Collection Set: 9,9ms
[2021-12-02T15:05:05.936+0100][gc,phases     ] GC(14)   Post Evacuate Collection Set: 0,5ms
[2021-12-02T15:05:05.936+0100][gc,phases     ] GC(14)   Other: 0,2ms
[2021-12-02T15:05:05.936+0100][gc,heap       ] GC(14) Eden regions: 47->0(47)
[2021-12-02T15:05:05.936+0100][gc,heap       ] GC(14) Survivor regions: 4->4(7)
[2021-12-02T15:05:05.936+0100][gc,heap       ] GC(14) Old regions: 14->14
[2021-12-02T15:05:05.936+0100][gc,heap       ] GC(14) Humongous regions: 129->129
[2021-12-02T15:05:05.936+0100][gc,metaspace  ] GC(14) Metaspace: 38793K->38793K(1085440K)
[2021-12-02T15:05:05.936+0100][gc            ] GC(14) Pause Young (Normal) (G1 Evacuation Pause) 191M->144M(1024M) 10,690ms
[2021-12-02T15:05:05.936+0100][gc,cpu        ] GC(14) User=0,01s Sys=0,00s Real=0,01s
[2021-12-02T15:10:15.264+0100][gc,start      ] GC(15) Pause Young (Normal) (G1 Evacuation Pause)
[2021-12-02T15:10:15.265+0100][gc,task       ] GC(15) Using 2 workers of 2 for evacuation
[2021-12-02T15:10:15.276+0100][gc,phases     ] GC(15)   Pre Evacuate Collection Set: 0,1ms
[2021-12-02T15:10:15.276+0100][gc,phases     ] GC(15)   Evacuate Collection Set: 10,6ms
[2021-12-02T15:10:15.276+0100][gc,phases     ] GC(15)   Post Evacuate Collection Set: 0,4ms
[2021-12-02T15:10:15.276+0100][gc,phases     ] GC(15)   Other: 0,4ms
[2021-12-02T15:10:15.276+0100][gc,heap       ] GC(15) Eden regions: 47->0(47)
[2021-12-02T15:10:15.276+0100][gc,heap       ] GC(15) Survivor regions: 4->4(7)
[2021-12-02T15:10:15.276+0100][gc,heap       ] GC(15) Old regions: 14->14
[2021-12-02T15:10:15.276+0100][gc,heap       ] GC(15) Humongous regions: 129->129
[2021-12-02T15:10:15.276+0100][gc,metaspace  ] GC(15) Metaspace: 38840K->38840K(1085440K)
[2021-12-02T15:10:15.276+0100][gc            ] GC(15) Pause Young (Normal) (G1 Evacuation Pause) 191M->144M(1024M) 11,642ms
[2021-12-02T15:10:15.276+0100][gc,cpu        ] GC(15) User=0,02s Sys=0,00s Real=0,01s
[2021-12-02T15:12:40.660+0100][gc,start      ] GC(16) Pause Young (Normal) (G1 Evacuation Pause)
[2021-12-02T15:12:40.660+0100][gc,task       ] GC(16) Using 2 workers of 2 for evacuation
[2021-12-02T15:12:40.680+0100][gc,mmu        ] GC(16) MMU target violated: 20,7ms (20,0ms/21,0ms)
[2021-12-02T15:12:40.681+0100][gc,phases     ] GC(16)   Pre Evacuate Collection Set: 0,0ms
[2021-12-02T15:12:40.681+0100][gc,phases     ] GC(16)   Evacuate Collection Set: 18,8ms
[2021-12-02T15:12:40.681+0100][gc,phases     ] GC(16)   Post Evacuate Collection Set: 1,8ms
[2021-12-02T15:12:40.681+0100][gc,phases     ] GC(16)   Other: 0,2ms
[2021-12-02T15:12:40.681+0100][gc,heap       ] GC(16) Eden regions: 47->0(47)
[2021-12-02T15:12:40.681+0100][gc,heap       ] GC(16) Survivor regions: 4->4(7)
[2021-12-02T15:12:40.681+0100][gc,heap       ] GC(16) Old regions: 14->14
[2021-12-02T15:12:40.681+0100][gc,heap       ] GC(16) Humongous regions: 129->129
[2021-12-02T15:12:40.681+0100][gc,metaspace  ] GC(16) Metaspace: 38849K->38849K(1085440K)
[2021-12-02T15:12:40.681+0100][gc            ] GC(16) Pause Young (Normal) (G1 Evacuation Pause) 191M->144M(1024M) 20,863ms
[2021-12-02T15:12:40.681+0100][gc,cpu        ] GC(16) User=0,01s Sys=0,00s Real=0,03s
[2021-12-02T15:18:52.964+0100][gc,start      ] GC(17) Pause Young (Normal) (G1 Evacuation Pause)
[2021-12-02T15:18:52.964+0100][gc,task       ] GC(17) Using 2 workers of 2 for evacuation
[2021-12-02T15:18:52.974+0100][gc,phases     ] GC(17)   Pre Evacuate Collection Set: 0,1ms
[2021-12-02T15:18:52.974+0100][gc,phases     ] GC(17)   Evacuate Collection Set: 9,5ms
[2021-12-02T15:18:52.974+0100][gc,phases     ] GC(17)   Post Evacuate Collection Set: 0,5ms
[2021-12-02T15:18:52.974+0100][gc,phases     ] GC(17)   Other: 0,5ms
[2021-12-02T15:18:52.974+0100][gc,heap       ] GC(17) Eden regions: 47->0(48)
[2021-12-02T15:18:52.974+0100][gc,heap       ] GC(17) Survivor regions: 4->3(7)
[2021-12-02T15:18:52.974+0100][gc,heap       ] GC(17) Old regions: 14->14
[2021-12-02T15:18:52.974+0100][gc,heap       ] GC(17) Humongous regions: 129->129
[2021-12-02T15:18:52.974+0100][gc,metaspace  ] GC(17) Metaspace: 38859K->38859K(1085440K)
[2021-12-02T15:18:52.974+0100][gc            ] GC(17) Pause Young (Normal) (G1 Evacuation Pause) 191M->144M(1024M) 10,584ms
[2021-12-02T15:18:52.974+0100][gc,cpu        ] GC(17) User=0,01s Sys=0,00s Real=0,01s
[2021-12-02T15:21:54.067+0100][gc,start      ] GC(18) Pause Young (Normal) (G1 Evacuation Pause)
[2021-12-02T15:21:54.067+0100][gc,task       ] GC(18) Using 2 workers of 2 for evacuation
[2021-12-02T15:21:54.090+0100][gc,mmu        ] GC(18) MMU target violated: 21,0ms (20,0ms/21,0ms)
[2021-12-02T15:21:54.090+0100][gc,phases     ] GC(18)   Pre Evacuate Collection Set: 0,0ms
[2021-12-02T15:21:54.090+0100][gc,phases     ] GC(18)   Evacuate Collection Set: 23,0ms
[2021-12-02T15:21:54.090+0100][gc,phases     ] GC(18)   Post Evacuate Collection Set: 0,5ms
[2021-12-02T15:21:54.090+0100][gc,phases     ] GC(18)   Other: 0,2ms
[2021-12-02T15:21:54.090+0100][gc,heap       ] GC(18) Eden regions: 48->0(47)
[2021-12-02T15:21:54.090+0100][gc,heap       ] GC(18) Survivor regions: 3->4(7)
[2021-12-02T15:21:54.090+0100][gc,heap       ] GC(18) Old regions: 14->14
[2021-12-02T15:21:54.090+0100][gc,heap       ] GC(18) Humongous regions: 129->129
[2021-12-02T15:21:54.090+0100][gc,metaspace  ] GC(18) Metaspace: 38955K->38955K(1085440K)
[2021-12-02T15:21:54.090+0100][gc            ] GC(18) Pause Young (Normal) (G1 Evacuation Pause) 192M->144M(1024M) 23,738ms
[2021-12-02T15:21:54.090+0100][gc,cpu        ] GC(18) User=0,02s Sys=0,00s Real=0,03s
[2021-12-02T15:28:11.907+0100][gc,start      ] GC(19) Pause Young (Normal) (G1 Evacuation Pause)
[2021-12-02T15:28:11.907+0100][gc,task       ] GC(19) Using 2 workers of 2 for evacuation
[2021-12-02T15:28:11.918+0100][gc,phases     ] GC(19)   Pre Evacuate Collection Set: 0,1ms
[2021-12-02T15:28:11.918+0100][gc,phases     ] GC(19)   Evacuate Collection Set: 9,7ms
[2021-12-02T15:28:11.918+0100][gc,phases     ] GC(19)   Post Evacuate Collection Set: 0,4ms
[2021-12-02T15:28:11.918+0100][gc,phases     ] GC(19)   Other: 0,5ms
[2021-12-02T15:28:11.918+0100][gc,heap       ] GC(19) Eden regions: 47->0(47)
[2021-12-02T15:28:11.918+0100][gc,heap       ] GC(19) Survivor regions: 4->4(7)
[2021-12-02T15:28:11.918+0100][gc,heap       ] GC(19) Old regions: 14->14
[2021-12-02T15:28:11.918+0100][gc,heap       ] GC(19) Humongous regions: 129->129
[2021-12-02T15:28:11.918+0100][gc,metaspace  ] GC(19) Metaspace: 38973K->38973K(1085440K)
[2021-12-02T15:28:11.918+0100][gc            ] GC(19) Pause Young (Normal) (G1 Evacuation Pause) 191M->144M(1024M) 10,662ms
[2021-12-02T15:28:11.918+0100][gc,cpu        ] GC(19) User=0,02s Sys=0,00s Real=0,01s
[2021-12-02T15:31:54.095+0100][gc,start      ] GC(20) Pause Young (Normal) (G1 Evacuation Pause)
[2021-12-02T15:31:54.095+0100][gc,task       ] GC(20) Using 2 workers of 2 for evacuation
[2021-12-02T15:31:54.105+0100][gc,phases     ] GC(20)   Pre Evacuate Collection Set: 0,0ms
[2021-12-02T15:31:54.105+0100][gc,phases     ] GC(20)   Evacuate Collection Set: 9,3ms
[2021-12-02T15:31:54.105+0100][gc,phases     ] GC(20)   Post Evacuate Collection Set: 0,6ms
[2021-12-02T15:31:54.105+0100][gc,phases     ] GC(20)   Other: 0,1ms
[2021-12-02T15:31:54.105+0100][gc,heap       ] GC(20) Eden regions: 47->0(56)
[2021-12-02T15:31:54.105+0100][gc,heap       ] GC(20) Survivor regions: 4->2(7)
[2021-12-02T15:31:54.105+0100][gc,heap       ] GC(20) Old regions: 14->15
[2021-12-02T15:31:54.105+0100][gc,heap       ] GC(20) Humongous regions: 129->129
[2021-12-02T15:31:54.105+0100][gc,metaspace  ] GC(20) Metaspace: 38981K->38981K(1085440K)
[2021-12-02T15:31:54.105+0100][gc            ] GC(20) Pause Young (Normal) (G1 Evacuation Pause) 191M->144M(1024M) 10,196ms
[2021-12-02T15:31:54.105+0100][gc,cpu        ] GC(20) User=0,01s Sys=0,01s Real=0,01s
[2021-12-02T15:38:12.402+0100][gc,start      ] GC(21) Pause Young (Normal) (G1 Evacuation Pause)
[2021-12-02T15:38:12.402+0100][gc,task       ] GC(21) Using 2 workers of 2 for evacuation
[2021-12-02T15:38:12.412+0100][gc,phases     ] GC(21)   Pre Evacuate Collection Set: 0,0ms
[2021-12-02T15:38:12.412+0100][gc,phases     ] GC(21)   Evacuate Collection Set: 7,7ms
[2021-12-02T15:38:12.412+0100][gc,phases     ] GC(21)   Post Evacuate Collection Set: 2,2ms
[2021-12-02T15:38:12.412+0100][gc,phases     ] GC(21)   Other: 0,3ms
[2021-12-02T15:38:12.412+0100][gc,heap       ] GC(21) Eden regions: 56->0(67)
[2021-12-02T15:38:12.412+0100][gc,heap       ] GC(21) Survivor regions: 2->2(8)
[2021-12-02T15:38:12.412+0100][gc,heap       ] GC(21) Old regions: 15->16
[2021-12-02T15:38:12.412+0100][gc,heap       ] GC(21) Humongous regions: 129->129
[2021-12-02T15:38:12.412+0100][gc,metaspace  ] GC(21) Metaspace: 38984K->38984K(1085440K)
[2021-12-02T15:38:12.412+0100][gc            ] GC(21) Pause Young (Normal) (G1 Evacuation Pause) 200M->144M(1024M) 10,266ms
[2021-12-02T15:38:12.412+0100][gc,cpu        ] GC(21) User=0,01s Sys=0,00s Real=0,01s
[2021-12-02T15:47:14.248+0100][gc,start      ] GC(22) Pause Young (Normal) (G1 Evacuation Pause)
[2021-12-02T15:47:14.249+0100][gc,task       ] GC(22) Using 2 workers of 2 for evacuation
[2021-12-02T15:47:14.261+0100][gc,phases     ] GC(22)   Pre Evacuate Collection Set: 0,1ms
[2021-12-02T15:47:14.261+0100][gc,phases     ] GC(22)   Evacuate Collection Set: 7,0ms
[2021-12-02T15:47:14.261+0100][gc,phases     ] GC(22)   Post Evacuate Collection Set: 5,0ms
[2021-12-02T15:47:14.261+0100][gc,phases     ] GC(22)   Other: 0,6ms
[2021-12-02T15:47:14.261+0100][gc,heap       ] GC(22) Eden regions: 67->0(133)
[2021-12-02T15:47:14.261+0100][gc,heap       ] GC(22) Survivor regions: 2->1(9)
[2021-12-02T15:47:14.261+0100][gc,heap       ] GC(22) Old regions: 16->16
[2021-12-02T15:47:14.261+0100][gc,heap       ] GC(22) Humongous regions: 129->129
[2021-12-02T15:47:14.261+0100][gc,metaspace  ] GC(22) Metaspace: 38992K->38992K(1085440K)
[2021-12-02T15:47:14.261+0100][gc            ] GC(22) Pause Young (Normal) (G1 Evacuation Pause) 211M->144M(1024M) 12,743ms
[2021-12-02T15:47:14.261+0100][gc,cpu        ] GC(22) User=0,01s Sys=0,01s Real=0,01s
[2021-12-02T16:03:04.980+0100][gc,start      ] GC(23) Pause Young (Normal) (G1 Evacuation Pause)
[2021-12-02T16:03:04.980+0100][gc,task       ] GC(23) Using 2 workers of 2 for evacuation
[2021-12-02T16:03:04.995+0100][gc,phases     ] GC(23)   Pre Evacuate Collection Set: 0,1ms
[2021-12-02T16:03:04.995+0100][gc,phases     ] GC(23)   Evacuate Collection Set: 5,4ms
[2021-12-02T16:03:04.995+0100][gc,phases     ] GC(23)   Post Evacuate Collection Set: 9,5ms
[2021-12-02T16:03:04.995+0100][gc,phases     ] GC(23)   Other: 0,7ms
[2021-12-02T16:03:04.995+0100][gc,heap       ] GC(23) Eden regions: 133->0(139)
[2021-12-02T16:03:04.995+0100][gc,heap       ] GC(23) Survivor regions: 1->1(17)
[2021-12-02T16:03:04.995+0100][gc,heap       ] GC(23) Old regions: 16->16
[2021-12-02T16:03:04.995+0100][gc,heap       ] GC(23) Humongous regions: 129->129
[2021-12-02T16:03:04.995+0100][gc,metaspace  ] GC(23) Metaspace: 39019K->39019K(1085440K)
[2021-12-02T16:03:04.995+0100][gc            ] GC(23) Pause Young (Normal) (G1 Evacuation Pause) 277M->144M(1024M) 15,678ms
[2021-12-02T16:03:04.996+0100][gc,cpu        ] GC(23) User=0,02s Sys=0,00s Real=0,02s
[2021-12-02T16:15:25.080+0100][gc,start      ] GC(24) Pause Young (Normal) (G1 Evacuation Pause)
[2021-12-02T16:15:25.080+0100][gc,task       ] GC(24) Using 2 workers of 2 for evacuation
[2021-12-02T16:15:25.092+0100][gc,phases     ] GC(24)   Pre Evacuate Collection Set: 0,1ms
[2021-12-02T16:15:25.092+0100][gc,phases     ] GC(24)   Evacuate Collection Set: 10,1ms
[2021-12-02T16:15:25.092+0100][gc,phases     ] GC(24)   Post Evacuate Collection Set: 1,4ms
[2021-12-02T16:15:25.092+0100][gc,phases     ] GC(24)   Other: 0,7ms
[2021-12-02T16:15:25.092+0100][gc,heap       ] GC(24) Eden regions: 139->0(144)
[2021-12-02T16:15:25.092+0100][gc,heap       ] GC(24) Survivor regions: 1->1(18)
[2021-12-02T16:15:25.092+0100][gc,heap       ] GC(24) Old regions: 16->16
[2021-12-02T16:15:25.092+0100][gc,heap       ] GC(24) Humongous regions: 129->129
[2021-12-02T16:15:25.092+0100][gc,metaspace  ] GC(24) Metaspace: 39046K->39046K(1085440K)
[2021-12-02T16:15:25.092+0100][gc            ] GC(24) Pause Young (Normal) (G1 Evacuation Pause) 283M->144M(1024M) 12,416ms
[2021-12-02T16:15:25.092+0100][gc,cpu        ] GC(24) User=0,02s Sys=0,00s Real=0,02s
[2021-12-02T16:31:04.360+0100][gc,start      ] GC(25) Pause Young (Normal) (G1 Evacuation Pause)
[2021-12-02T16:31:04.360+0100][gc,task       ] GC(25) Using 2 workers of 2 for evacuation
[2021-12-02T16:31:04.363+0100][gc,phases     ] GC(25)   Pre Evacuate Collection Set: 0,0ms
[2021-12-02T16:31:04.363+0100][gc,phases     ] GC(25)   Evacuate Collection Set: 2,4ms
[2021-12-02T16:31:04.363+0100][gc,phases     ] GC(25)   Post Evacuate Collection Set: 0,8ms
[2021-12-02T16:31:04.363+0100][gc,phases     ] GC(25)   Other: 0,2ms
[2021-12-02T16:31:04.363+0100][gc,heap       ] GC(25) Eden regions: 144->0(155)
[2021-12-02T16:31:04.363+0100][gc,heap       ] GC(25) Survivor regions: 1->1(19)
[2021-12-02T16:31:04.363+0100][gc,heap       ] GC(25) Old regions: 16->16
[2021-12-02T16:31:04.363+0100][gc,heap       ] GC(25) Humongous regions: 129->129
[2021-12-02T16:31:04.363+0100][gc,metaspace  ] GC(25) Metaspace: 39090K->39090K(1085440K)
[2021-12-02T16:31:04.364+0100][gc            ] GC(25) Pause Young (Normal) (G1 Evacuation Pause) 288M->144M(1024M) 3,360ms
[2021-12-02T16:31:04.364+0100][gc,cpu        ] GC(25) User=0,01s Sys=0,00s Real=0,00s
[2021-12-02T16:49:17.922+0100][gc,start      ] GC(26) Pause Young (Normal) (G1 Evacuation Pause)
[2021-12-02T16:49:17.922+0100][gc,task       ] GC(26) Using 2 workers of 2 for evacuation
[2021-12-02T16:49:17.939+0100][gc,phases     ] GC(26)   Pre Evacuate Collection Set: 0,1ms
[2021-12-02T16:49:17.939+0100][gc,phases     ] GC(26)   Evacuate Collection Set: 12,6ms
[2021-12-02T16:49:17.939+0100][gc,phases     ] GC(26)   Post Evacuate Collection Set: 3,5ms
[2021-12-02T16:49:17.939+0100][gc,phases     ] GC(26)   Other: 0,6ms
[2021-12-02T16:49:17.939+0100][gc,heap       ] GC(26) Eden regions: 155->0(160)
[2021-12-02T16:49:17.939+0100][gc,heap       ] GC(26) Survivor regions: 1->1(20)
[2021-12-02T16:49:17.939+0100][gc,heap       ] GC(26) Old regions: 16->16
[2021-12-02T16:49:17.939+0100][gc,heap       ] GC(26) Humongous regions: 129->129
[2021-12-02T16:49:17.939+0100][gc,metaspace  ] GC(26) Metaspace: 39090K->39090K(1085440K)
[2021-12-02T16:49:17.939+0100][gc            ] GC(26) Pause Young (Normal) (G1 Evacuation Pause) 299M->144M(1024M) 17,027ms
[2021-12-02T16:49:17.939+0100][gc,cpu        ] GC(26) User=0,01s Sys=0,00s Real=0,01s
[2021-12-02T16:57:59.636+0100][gc,start      ] GC(27) Pause Young (Normal) (G1 Evacuation Pause)
[2021-12-02T16:57:59.636+0100][gc,task       ] GC(27) Using 2 workers of 2 for evacuation
[2021-12-02T16:57:59.646+0100][gc,phases     ] GC(27)   Pre Evacuate Collection Set: 0,1ms
[2021-12-02T16:57:59.646+0100][gc,phases     ] GC(27)   Evacuate Collection Set: 5,4ms
[2021-12-02T16:57:59.646+0100][gc,phases     ] GC(27)   Post Evacuate Collection Set: 4,2ms
[2021-12-02T16:57:59.647+0100][gc,phases     ] GC(27)   Other: 0,5ms
[2021-12-02T16:57:59.647+0100][gc,heap       ] GC(27) Eden regions: 160->0(165)
[2021-12-02T16:57:59.647+0100][gc,heap       ] GC(27) Survivor regions: 1->1(21)
[2021-12-02T16:57:59.647+0100][gc,heap       ] GC(27) Old regions: 16->16
[2021-12-02T16:57:59.647+0100][gc,heap       ] GC(27) Humongous regions: 129->129
[2021-12-02T16:57:59.647+0100][gc,metaspace  ] GC(27) Metaspace: 39094K->39094K(1085440K)
[2021-12-02T16:57:59.647+0100][gc            ] GC(27) Pause Young (Normal) (G1 Evacuation Pause) 304M->144M(1024M) 10,184ms
[2021-12-02T16:57:59.647+0100][gc,cpu        ] GC(27) User=0,01s Sys=0,00s Real=0,01s
[2021-12-02T17:14:05.731+0100][gc,start      ] GC(28) Pause Young (Normal) (G1 Evacuation Pause)
[2021-12-02T17:14:05.731+0100][gc,task       ] GC(28) Using 2 workers of 2 for evacuation
[2021-12-02T17:14:05.740+0100][gc,phases     ] GC(28)   Pre Evacuate Collection Set: 0,1ms
[2021-12-02T17:14:05.740+0100][gc,phases     ] GC(28)   Evacuate Collection Set: 4,6ms
[2021-12-02T17:14:05.740+0100][gc,phases     ] GC(28)   Post Evacuate Collection Set: 3,9ms
[2021-12-02T17:14:05.740+0100][gc,phases     ] GC(28)   Other: 0,5ms
[2021-12-02T17:14:05.740+0100][gc,heap       ] GC(28) Eden regions: 165->0(172)
[2021-12-02T17:14:05.740+0100][gc,heap       ] GC(28) Survivor regions: 1->1(21)
[2021-12-02T17:14:05.740+0100][gc,heap       ] GC(28) Old regions: 16->16
[2021-12-02T17:14:05.740+0100][gc,heap       ] GC(28) Humongous regions: 129->129
[2021-12-02T17:14:05.740+0100][gc,metaspace  ] GC(28) Metaspace: 39107K->39107K(1085440K)
[2021-12-02T17:14:05.740+0100][gc            ] GC(28) Pause Young (Normal) (G1 Evacuation Pause) 309M->144M(1024M) 9,222ms
[2021-12-02T17:14:05.740+0100][gc,cpu        ] GC(28) User=0,00s Sys=0,01s Real=0,00s
[2021-12-02T17:31:27.795+0100][gc,start      ] GC(29) Pause Young (Normal) (G1 Evacuation Pause)
[2021-12-02T17:31:27.795+0100][gc,task       ] GC(29) Using 2 workers of 2 for evacuation
[2021-12-02T17:31:27.806+0100][gc,phases     ] GC(29)   Pre Evacuate Collection Set: 0,0ms
[2021-12-02T17:31:27.806+0100][gc,phases     ] GC(29)   Evacuate Collection Set: 6,5ms
[2021-12-02T17:31:27.806+0100][gc,phases     ] GC(29)   Post Evacuate Collection Set: 4,6ms
[2021-12-02T17:31:27.806+0100][gc,phases     ] GC(29)   Other: 0,3ms
[2021-12-02T17:31:27.806+0100][gc,heap       ] GC(29) Eden regions: 172->0(182)
[2021-12-02T17:31:27.806+0100][gc,heap       ] GC(29) Survivor regions: 1->1(22)
[2021-12-02T17:31:27.806+0100][gc,heap       ] GC(29) Old regions: 16->16
[2021-12-02T17:31:27.806+0100][gc,heap       ] GC(29) Humongous regions: 129->129
[2021-12-02T17:31:27.806+0100][gc,metaspace  ] GC(29) Metaspace: 39154K->39154K(1085440K)
[2021-12-02T17:31:27.806+0100][gc            ] GC(29) Pause Young (Normal) (G1 Evacuation Pause) 316M->144M(1024M) 11,554ms
[2021-12-02T17:31:27.806+0100][gc,cpu        ] GC(29) User=0,01s Sys=0,00s Real=0,01s
[2021-12-02T17:48:17.360+0100][gc,start      ] GC(30) Pause Young (Normal) (G1 Evacuation Pause)
[2021-12-02T17:48:17.360+0100][gc,task       ] GC(30) Using 2 workers of 2 for evacuation
[2021-12-02T17:48:17.371+0100][gc,phases     ] GC(30)   Pre Evacuate Collection Set: 0,0ms
[2021-12-02T17:48:17.371+0100][gc,phases     ] GC(30)   Evacuate Collection Set: 5,9ms
[2021-12-02T17:48:17.371+0100][gc,phases     ] GC(30)   Post Evacuate Collection Set: 5,1ms
[2021-12-02T17:48:17.371+0100][gc,phases     ] GC(30)   Other: 0,2ms
[2021-12-02T17:48:17.371+0100][gc,heap       ] GC(30) Eden regions: 182->0(187)
[2021-12-02T17:48:17.371+0100][gc,heap       ] GC(30) Survivor regions: 1->1(23)
[2021-12-02T17:48:17.371+0100][gc,heap       ] GC(30) Old regions: 16->16
[2021-12-02T17:48:17.371+0100][gc,heap       ] GC(30) Humongous regions: 129->129
[2021-12-02T17:48:17.371+0100][gc,metaspace  ] GC(30) Metaspace: 39169K->39169K(1085440K)
[2021-12-02T17:48:17.371+0100][gc            ] GC(30) Pause Young (Normal) (G1 Evacuation Pause) 326M->144M(1024M) 11,329ms
[2021-12-02T17:48:17.371+0100][gc,cpu        ] GC(30) User=0,00s Sys=0,02s Real=0,02s
