tweetoscope/HashtagExtractor.class
tweetoscope/tweetsFilter/TweetoscopeFilter.class
tweetoscope/tweetsProducer/MockTwitterStreamScenario.class
tweetoscope/tweetsFilter/CountryCodeTweetFilter.class
tweetoscope/tweetsFilter/LangTweetFilter.class
tweetoscope/HashtagCounter.class
tweetoscope/tweetsProducer/MockTwitterStreamRecorded.class
tweetoscope/tweetsProducer/MockTwitterStreamRandom.class
tweetoscope/tweetsProducer/OnlineTweetsProducer.class
tweetoscope/tweetsProducer/TweetsProducer.class
tweetoscope/tweetsFilter/TweetFilter.class
tweetoscope/tweetsProducer/TwitterFilteredStreamReaderSingleton.class
tweetoscope/tweetsFilter/EmptyTweetFilter.class
tweetoscope/tweetsProducer/TwitterSampledStreamReaderSingleton.class
tweetoscope/tweetsFilter/OnlineTweetFilter.class
tweetoscope/Visualizor.class
tweetoscope/tweetsProducer/OfflineTweetsProducer.class
tweetoscope/tweetsProducer/TweetoscopeProducer.class
tweetoscope/tweetsFilter/DateTweetFilter.class
