/home/azerty/kafka/project/3MD1510_IAL-master(2)/3MD1510_IAL-master/Code/src/main/java/tweetoscope/tweetsProducer/OnlineTweetsProducer.java
/home/azerty/kafka/project/3MD1510_IAL-master(2)/3MD1510_IAL-master/Code/src/main/java/tweetoscope/tweetsProducer/MockTwitterStreamRecorded.java
/home/azerty/kafka/project/3MD1510_IAL-master(2)/3MD1510_IAL-master/Code/src/main/java/tweetoscope/HashtagCounter.java
/home/azerty/kafka/project/3MD1510_IAL-master(2)/3MD1510_IAL-master/Code/src/main/java/tweetoscope/tweetsProducer/MockTwitterStreamScenario.java
/home/azerty/kafka/project/3MD1510_IAL-master(2)/3MD1510_IAL-master/Code/src/main/java/tweetoscope/tweetsFilter/TweetoscopeFilter.java
/home/azerty/kafka/project/3MD1510_IAL-master(2)/3MD1510_IAL-master/Code/src/main/java/tweetoscope/HashtagExtractor.java
/home/azerty/kafka/project/3MD1510_IAL-master(2)/3MD1510_IAL-master/Code/src/main/java/tweetoscope/tweetsFilter/EmptyTweetFilter.java
/home/azerty/kafka/project/3MD1510_IAL-master(2)/3MD1510_IAL-master/Code/src/main/java/tweetoscope/tweetsProducer/TwitterSampledStreamReaderSingleton.java
/home/azerty/kafka/project/3MD1510_IAL-master(2)/3MD1510_IAL-master/Code/src/main/java/tweetoscope/tweetsFilter/LangTweetFilter.java
/home/azerty/kafka/project/3MD1510_IAL-master(2)/3MD1510_IAL-master/Code/src/main/java/tweetoscope/tweetsFilter/OnlineTweetFilter.java
/home/azerty/kafka/project/3MD1510_IAL-master(2)/3MD1510_IAL-master/Code/src/main/java/tweetoscope/tweetsFilter/TweetFilter.java
/home/azerty/kafka/project/3MD1510_IAL-master(2)/3MD1510_IAL-master/Code/src/main/java/tweetoscope/tweetsProducer/TwitterFilteredStreamReaderSingleton.java
/home/azerty/kafka/project/3MD1510_IAL-master(2)/3MD1510_IAL-master/Code/src/main/java/tweetoscope/tweetsFilter/DateTweetFilter.java
/home/azerty/kafka/project/3MD1510_IAL-master(2)/3MD1510_IAL-master/Code/src/main/java/tweetoscope/tweetsProducer/MockTwitterStreamRandom.java
/home/azerty/kafka/project/3MD1510_IAL-master(2)/3MD1510_IAL-master/Code/src/main/java/tweetoscope/tweetsProducer/OfflineTweetsProducer.java
/home/azerty/kafka/project/3MD1510_IAL-master(2)/3MD1510_IAL-master/Code/src/main/java/tweetoscope/tweetsFilter/CountryCodeTweetFilter.java
/home/azerty/kafka/project/3MD1510_IAL-master(2)/3MD1510_IAL-master/Code/src/main/java/tweetoscope/tweetsProducer/TweetoscopeProducer.java
/home/azerty/kafka/project/3MD1510_IAL-master(2)/3MD1510_IAL-master/Code/src/main/java/tweetoscope/tweetsProducer/TweetsProducer.java
/home/azerty/kafka/project/3MD1510_IAL-master(2)/3MD1510_IAL-master/Code/src/main/java/tweetoscope/Visualizor.java
