<?xml version="1.0" encoding="UTF-8" standalone="no"?>
<!DOCTYPE svg PUBLIC "-//W3C//DTD SVG 1.1//EN"
 "http://www.w3.org/Graphics/SVG/1.1/DTD/svg11.dtd">
<!-- Generated by graphviz version 2.43.0 (0)
 -->
<!-- Title: G Pages: 1 -->
<svg width="1690pt" height="294pt"
 viewBox="0.00 0.00 1690.17 294.25" xmlns="http://www.w3.org/2000/svg" xmlns:xlink="http://www.w3.org/1999/xlink">
<g id="graph0" class="graph" transform="scale(1 1) rotate(0) translate(4 290.25)">
<title>G</title>
<polygon fill="transparent" stroke="transparent" points="-4,4 -4,-290.25 1686.17,-290.25 1686.17,4 -4,4"/>
<!-- generator -->
<g id="node1" class="node">
<title>generator</title>
<polygon fill="#96023c" stroke="white" points="137,-258 0,-258 0,-222 137,-222 137,-258"/>
<text text-anchor="middle" x="68.5" y="-236.3" font-family="Times,serif" font-size="14.00" fill="white">Tweet Generator</text>
</g>
<!-- tweets -->
<g id="node2" class="node">
<title>tweets</title>
<ellipse fill="#857894" stroke="white" cx="215.25" cy="-240" rx="42.49" ry="18"/>
<text text-anchor="middle" x="215.25" y="-236.3" font-family="Times,serif" font-size="14.00" fill="white">tweets</text>
</g>
<!-- generator&#45;&gt;tweets -->
<g id="edge1" class="edge">
<title>generator&#45;&gt;tweets</title>
<path fill="none" stroke="black" d="M137.21,-240C145.8,-240 154.48,-240 162.75,-240"/>
<polygon fill="black" stroke="black" points="162.99,-243.5 172.99,-240 162.99,-236.5 162.99,-243.5"/>
</g>
<!-- collector -->
<g id="node3" class="node">
<title>collector</title>
<polygon fill="#96023c" stroke="white" points="422.49,-258 293.49,-258 293.49,-222 422.49,-222 422.49,-258"/>
<text text-anchor="middle" x="357.99" y="-236.3" font-family="Times,serif" font-size="14.00" fill="white">Tweet Collector</text>
</g>
<!-- tweets&#45;&gt;collector -->
<g id="edge2" class="edge">
<title>tweets&#45;&gt;collector</title>
<path fill="none" stroke="black" d="M257.71,-240C265.76,-240 274.41,-240 283.13,-240"/>
<polygon fill="black" stroke="black" points="283.38,-243.5 293.38,-240 283.38,-236.5 283.38,-243.5"/>
</g>
<!-- logs -->
<g id="node4" class="node">
<title>logs</title>
<ellipse fill="#857894" stroke="white" cx="1508.67" cy="-221" rx="30" ry="18"/>
<text text-anchor="middle" x="1508.67" y="-217.3" font-family="Times,serif" font-size="14.00" fill="white">logs</text>
</g>
<!-- collector&#45;&gt;logs -->
<g id="edge3" class="edge">
<title>collector&#45;&gt;logs</title>
<path fill="none" stroke="black" d="M418.03,-258.04C431.24,-261.51 445.26,-264.76 458.49,-267 576.44,-286.98 607.36,-286 726.99,-286 726.99,-286 726.99,-286 1243.42,-286 1328.28,-286 1424.15,-254 1473.8,-234.9"/>
<polygon fill="black" stroke="black" points="1475.35,-238.06 1483.39,-231.16 1472.8,-231.54 1475.35,-238.06"/>
</g>
<!-- series -->
<g id="node5" class="node">
<title>series</title>
<ellipse fill="#857894" stroke="white" cx="537.99" cy="-240" rx="79.5" ry="18"/>
<text text-anchor="middle" x="537.99" y="-236.3" font-family="Times,serif" font-size="14.00" fill="white">cascade_series</text>
</g>
<!-- collector&#45;&gt;series -->
<g id="edge4" class="edge">
<title>collector&#45;&gt;series</title>
<path fill="none" stroke="black" d="M422.5,-240C430.83,-240 439.47,-240 448.12,-240"/>
<polygon fill="black" stroke="black" points="448.25,-243.5 458.25,-240 448.25,-236.5 448.25,-243.5"/>
</g>
<!-- properties -->
<g id="node6" class="node">
<title>properties</title>
<ellipse fill="#857894" stroke="white" cx="938.58" cy="-194" rx="100.18" ry="18"/>
<text text-anchor="middle" x="938.58" y="-190.3" font-family="Times,serif" font-size="14.00" fill="white">cascade_properties</text>
</g>
<!-- collector&#45;&gt;properties -->
<g id="edge5" class="edge">
<title>collector&#45;&gt;properties</title>
<path fill="none" stroke="black" d="M416.66,-221.99C430.25,-218.41 444.78,-215.1 458.49,-213 584.64,-193.64 731.54,-190.65 829.08,-191.37"/>
<polygon fill="black" stroke="black" points="829.22,-194.87 839.25,-191.46 829.28,-187.87 829.22,-194.87"/>
</g>
<!-- logger -->
<g id="node7" class="node">
<title>logger</title>
<polygon fill="#96023c" stroke="white" points="1672.67,-239 1605.67,-239 1605.67,-203 1672.67,-203 1672.67,-239"/>
<text text-anchor="middle" x="1639.17" y="-217.3" font-family="Times,serif" font-size="14.00" fill="white">Logger</text>
</g>
<!-- logs&#45;&gt;logger -->
<g id="edge6" class="edge">
<title>logs&#45;&gt;logger</title>
<path fill="none" stroke="black" d="M1538.82,-221C1555.57,-221 1576.9,-221 1595.5,-221"/>
<polygon fill="black" stroke="black" points="1595.51,-224.5 1605.51,-221 1595.51,-217.5 1595.51,-224.5"/>
</g>
<!-- estimator -->
<g id="node8" class="node">
<title>estimator</title>
<polygon fill="#96023c" stroke="white" points="802.49,-258 653.49,-258 653.49,-222 802.49,-222 802.49,-258"/>
<text text-anchor="middle" x="727.99" y="-236.3" font-family="Times,serif" font-size="14.00" fill="white">Hawkes Estimator</text>
</g>
<!-- series&#45;&gt;estimator -->
<g id="edge7" class="edge">
<title>series&#45;&gt;estimator</title>
<path fill="none" stroke="black" d="M617.63,-240C626.17,-240 634.87,-240 643.46,-240"/>
<polygon fill="black" stroke="black" points="643.47,-243.5 653.47,-240 643.47,-236.5 643.47,-243.5"/>
</g>
<!-- predictor -->
<g id="node9" class="node">
<title>predictor</title>
<polygon fill="#96023c" stroke="white" points="1157.67,-159 1074.67,-159 1074.67,-123 1157.67,-123 1157.67,-159"/>
<text text-anchor="middle" x="1116.17" y="-137.3" font-family="Times,serif" font-size="14.00" fill="white">Predictor</text>
</g>
<!-- properties&#45;&gt;predictor -->
<g id="edge8" class="edge">
<title>properties&#45;&gt;predictor</title>
<path fill="none" stroke="black" d="M990.84,-178.53C1014.14,-171.5 1041.61,-163.2 1064.8,-156.21"/>
<polygon fill="black" stroke="black" points="1065.89,-159.53 1074.45,-153.29 1063.86,-152.83 1065.89,-159.53"/>
</g>
<!-- estimator&#45;&gt;logs -->
<g id="edge9" class="edge">
<title>estimator&#45;&gt;logs</title>
<path fill="none" stroke="black" d="M802.66,-242.43C880.36,-244.79 1006.37,-248 1115.17,-248 1115.17,-248 1115.17,-248 1243.42,-248 1324.31,-248 1418.42,-235.32 1469.65,-227.34"/>
<polygon fill="black" stroke="black" points="1470.28,-230.79 1479.6,-225.76 1469.18,-223.87 1470.28,-230.79"/>
</g>
<!-- estimator&#45;&gt;properties -->
<g id="edge10" class="edge">
<title>estimator&#45;&gt;properties</title>
<path fill="none" stroke="black" d="M802.53,-223.78C822.7,-219.33 844.56,-214.52 864.69,-210.08"/>
<polygon fill="black" stroke="black" points="865.72,-213.43 874.73,-207.86 864.21,-206.6 865.72,-213.43"/>
</g>
<!-- predictor&#45;&gt;logs -->
<g id="edge11" class="edge">
<title>predictor&#45;&gt;logs</title>
<path fill="none" stroke="black" d="M1138.74,-159.2C1153.29,-170.4 1173.46,-183.92 1193.67,-191 1288.01,-224.06 1407.46,-225.23 1468.24,-223.17"/>
<polygon fill="black" stroke="black" points="1468.68,-226.66 1478.54,-222.78 1468.41,-219.66 1468.68,-226.66"/>
</g>
<!-- samples -->
<g id="node10" class="node">
<title>samples</title>
<ellipse fill="#857894" stroke="white" cx="1242.42" cy="-164" rx="48.99" ry="18"/>
<text text-anchor="middle" x="1242.42" y="-160.3" font-family="Times,serif" font-size="14.00" fill="white">samples</text>
</g>
<!-- predictor&#45;&gt;samples -->
<g id="edge12" class="edge">
<title>predictor&#45;&gt;samples</title>
<path fill="none" stroke="black" d="M1157.86,-148.53C1167.62,-150.34 1178.2,-152.3 1188.43,-154.19"/>
<polygon fill="black" stroke="black" points="1188.04,-157.68 1198.51,-156.06 1189.31,-150.79 1188.04,-157.68"/>
</g>
<!-- alerts -->
<g id="node11" class="node">
<title>alerts</title>
<ellipse fill="#857894" stroke="white" cx="1242.42" cy="-72" rx="37.89" ry="18"/>
<text text-anchor="middle" x="1242.42" y="-68.3" font-family="Times,serif" font-size="14.00" fill="white">alerts</text>
</g>
<!-- predictor&#45;&gt;alerts -->
<g id="edge13" class="edge">
<title>predictor&#45;&gt;alerts</title>
<path fill="none" stroke="black" d="M1149.82,-122.87C1167.82,-112.87 1190.12,-100.49 1208.21,-90.44"/>
<polygon fill="black" stroke="black" points="1210.2,-93.34 1217.24,-85.43 1206.8,-87.22 1210.2,-93.34"/>
</g>
<!-- stats -->
<g id="node12" class="node">
<title>stats</title>
<ellipse fill="#857894" stroke="white" cx="1242.42" cy="-18" rx="34" ry="18"/>
<text text-anchor="middle" x="1242.42" y="-14.3" font-family="Times,serif" font-size="14.00" fill="white">stats</text>
</g>
<!-- predictor&#45;&gt;stats -->
<g id="edge14" class="edge">
<title>predictor&#45;&gt;stats</title>
<path fill="none" stroke="black" d="M1128.67,-122.63C1142.29,-101.91 1166.6,-68.1 1193.67,-45 1197.93,-41.37 1202.75,-37.98 1207.64,-34.92"/>
<polygon fill="black" stroke="black" points="1209.58,-37.84 1216.44,-29.77 1206.04,-31.8 1209.58,-37.84"/>
</g>
<!-- learner -->
<g id="node13" class="node">
<title>learner</title>
<polygon fill="#96023c" stroke="white" points="1410.67,-182 1337.67,-182 1337.67,-146 1410.67,-146 1410.67,-182"/>
<text text-anchor="middle" x="1374.17" y="-160.3" font-family="Times,serif" font-size="14.00" fill="white">Learner</text>
</g>
<!-- samples&#45;&gt;learner -->
<g id="edge18" class="edge">
<title>samples&#45;&gt;learner</title>
<path fill="none" stroke="black" d="M1291.36,-164C1303.2,-164 1315.85,-164 1327.57,-164"/>
<polygon fill="black" stroke="black" points="1327.59,-167.5 1337.59,-164 1327.59,-160.5 1327.59,-167.5"/>
</g>
<!-- dashboard -->
<g id="node15" class="node">
<title>dashboard</title>
<polygon fill="#96023c" stroke="white" points="1421.17,-90 1327.17,-90 1327.17,-54 1421.17,-54 1421.17,-90"/>
<text text-anchor="middle" x="1374.17" y="-68.3" font-family="Times,serif" font-size="14.00" fill="white">Dashboard</text>
</g>
<!-- alerts&#45;&gt;dashboard -->
<g id="edge19" class="edge">
<title>alerts&#45;&gt;dashboard</title>
<path fill="none" stroke="black" d="M1280.25,-72C1291.61,-72 1304.38,-72 1316.74,-72"/>
<polygon fill="black" stroke="black" points="1316.98,-75.5 1326.98,-72 1316.98,-68.5 1316.98,-75.5"/>
</g>
<!-- monitor -->
<g id="node16" class="node">
<title>monitor</title>
<polygon fill="#96023c" stroke="white" points="1411.17,-36 1337.17,-36 1337.17,0 1411.17,0 1411.17,-36"/>
<text text-anchor="middle" x="1374.17" y="-14.3" font-family="Times,serif" font-size="14.00" fill="white">Monitor</text>
</g>
<!-- stats&#45;&gt;monitor -->
<g id="edge20" class="edge">
<title>stats&#45;&gt;monitor</title>
<path fill="none" stroke="black" d="M1276.5,-18C1291.79,-18 1310.22,-18 1326.87,-18"/>
<polygon fill="black" stroke="black" points="1326.96,-21.5 1336.96,-18 1326.96,-14.5 1326.96,-21.5"/>
</g>
<!-- learner&#45;&gt;logs -->
<g id="edge15" class="edge">
<title>learner&#45;&gt;logs</title>
<path fill="none" stroke="black" d="M1410.67,-179.27C1430.48,-187.79 1454.99,-198.34 1474.42,-206.7"/>
<polygon fill="black" stroke="black" points="1473.21,-209.99 1483.78,-210.73 1475.98,-203.56 1473.21,-209.99"/>
</g>
<!-- models -->
<g id="node14" class="node">
<title>models</title>
<ellipse fill="#857894" stroke="white" cx="1508.67" cy="-152" rx="44.39" ry="18"/>
<text text-anchor="middle" x="1508.67" y="-148.3" font-family="Times,serif" font-size="14.00" fill="white">models</text>
</g>
<!-- learner&#45;&gt;models -->
<g id="edge16" class="edge">
<title>learner&#45;&gt;models</title>
<path fill="none" stroke="black" d="M1410.67,-160.78C1424.38,-159.54 1440.33,-158.1 1455.3,-156.74"/>
<polygon fill="black" stroke="black" points="1455.82,-160.21 1465.46,-155.82 1455.19,-153.24 1455.82,-160.21"/>
</g>
<!-- models&#45;&gt;predictor -->
<g id="edge17" class="edge">
<title>models&#45;&gt;predictor</title>
<path fill="none" stroke="black" d="M1469.1,-143.85C1454.2,-141.09 1436.96,-138.36 1421.17,-137 1332.43,-129.36 1228.6,-133.53 1168.13,-137.26"/>
<polygon fill="black" stroke="black" points="1167.84,-133.77 1158.08,-137.9 1168.28,-140.76 1167.84,-133.77"/>
</g>
<!-- loki -->
<g id="node17" class="node">
<title>loki</title>
<polygon fill="white" stroke="black" points="1535.67,-90 1481.67,-90 1481.67,-54 1535.67,-54 1535.67,-90"/>
<text text-anchor="middle" x="1508.67" y="-68.3" font-family="Times,serif" font-size="14.00">Loki</text>
</g>
<!-- dashboard&#45;&gt;loki -->
<g id="edge21" class="edge">
<title>dashboard&#45;&gt;loki</title>
<path fill="none" stroke="black" stroke-dasharray="5,2" d="M1421.51,-72C1437.88,-72 1456.04,-72 1471.45,-72"/>
<polygon fill="black" stroke="black" points="1471.62,-75.5 1481.62,-72 1471.62,-68.5 1471.62,-75.5"/>
</g>
<!-- prometheus -->
<g id="node18" class="node">
<title>prometheus</title>
<polygon fill="white" stroke="black" points="1560.17,-36 1457.17,-36 1457.17,0 1560.17,0 1560.17,-36"/>
<text text-anchor="middle" x="1508.67" y="-14.3" font-family="Times,serif" font-size="14.00">Prometheus</text>
</g>
<!-- monitor&#45;&gt;prometheus -->
<g id="edge22" class="edge">
<title>monitor&#45;&gt;prometheus</title>
<path fill="none" stroke="black" stroke-dasharray="5,2" d="M1411.37,-18C1422.39,-18 1434.81,-18 1446.98,-18"/>
<polygon fill="black" stroke="black" points="1447.1,-21.5 1457.1,-18 1447.1,-14.5 1447.1,-21.5"/>
</g>
<!-- graphana -->
<g id="node19" class="node">
<title>graphana</title>
<polygon fill="white" stroke="black" points="1682.17,-63 1596.17,-63 1596.17,-27 1682.17,-27 1682.17,-63"/>
<text text-anchor="middle" x="1639.17" y="-41.3" font-family="Times,serif" font-size="14.00">Graphana</text>
</g>
<!-- loki&#45;&gt;graphana -->
<g id="edge24" class="edge">
<title>loki&#45;&gt;graphana</title>
<path fill="none" stroke="black" stroke-dasharray="5,2" d="M1535.67,-66.54C1550.14,-63.5 1568.67,-59.6 1585.99,-55.96"/>
<polygon fill="black" stroke="black" points="1586.95,-59.34 1596.01,-53.86 1585.51,-52.49 1586.95,-59.34"/>
</g>
<!-- prometheus&#45;&gt;graphana -->
<g id="edge23" class="edge">
<title>prometheus&#45;&gt;graphana</title>
<path fill="none" stroke="black" stroke-dasharray="5,2" d="M1560.45,-28.67C1568.92,-30.45 1577.72,-32.3 1586.22,-34.09"/>
<polygon fill="black" stroke="black" points="1585.52,-37.51 1596.02,-36.15 1586.96,-30.66 1585.52,-37.51"/>
</g>
</g>
</svg>
