,Groupe,Under 18 years old,Over 65 years old,Median age,White,Black,American Indian,Asian,Hawaiian,higher education achievement,high school achievement,literacy,urban population,Population density (number of people/square mile),unemployement,Crime Rate,Firearms Death Rate,Poverty rate,GINI index,Median income (in US dollars),2016 Trump vote,2020 Trump vote,Governor: democrat (1) / republican (0),Gun ownership rate,Adult obesity rate,Hypertension,Number of Covid-19 cases per 100k,Number of Covid-19 deaths per 100k,non-covered by a health insurance policy,Covid vax hesitancy (somewhat hesitant),Covid vax hesitancy (all),Access to Care (score between 0 and 1)
0,B,0.077,0.0,0.0,0.003,0.174,0.006,0.001,0.0,0.012,0.002,0.0,0.0,0.0,0.008,0.0,0.011,0.136,0.008,0.0,0.007,0.002,0.029,0.001,0.006,0.491,0.0,0.004,0.002,0.0,0.021,0.0
1,B,0.016,0.004,0.071,0.097,0.211,0.139,0.004,0.014,0.013,0.033,0.012,0.002,0.003,0.072,0.0,0.0,0.001,0.065,0.008,0.051,0.029,0.014,0.008,0.006,0.014,0.013,0.0,0.088,0.01,0.001,0.001
2,A,0.0,0.036,0.0,0.0,0.0,0.004,0.004,0.017,0.001,0.012,0.0,0.129,0.0,0.0,0.0,0.0,0.012,0.147,0.38,0.0,0.002,0.0,0.002,0.0,0.0,0.0,0.002,0.0,0.0,0.0,0.253
3,A,0.0,0.234,0.113,0.021,0.068,0.0,0.007,0.023,0.177,0.005,0.0,0.028,0.09,0.002,0.022,0.003,0.012,0.002,0.001,0.01,0.0,0.006,0.003,0.002,0.01,0.006,0.014,0.0,0.0,0.085,0.055
4,A,0.006,0.013,0.005,0.005,0.004,0.004,0.007,0.006,0.017,0.008,0.005,0.008,0.015,0.124,0.004,0.024,0.006,0.231,0.004,0.003,0.037,0.006,0.003,0.005,0.011,0.039,0.003,0.095,0.024,0.27,0.006
5,A,0.008,0.013,0.002,0.005,0.208,0.023,0.014,0.071,0.0,0.008,0.029,0.036,0.009,0.021,0.089,0.033,0.015,0.011,0.022,0.03,0.063,0.113,0.001,0.05,0.069,0.005,0.005,0.023,0.012,0.007,0.003
6,A,0.005,0.078,0.013,0.044,0.002,0.041,0.036,0.012,0.047,0.021,0.004,0.04,0.038,0.009,0.0,0.001,0.005,0.004,0.006,0.184,0.03,0.177,0.03,0.016,0.092,0.034,0.001,0.007,0.001,0.006,0.014
7,C,0.0,0.0,0.0,0.0,0.0,0.176,0.0,0.0,0.0,0.0,0.0,0.0,0.0,0.0,0.0,0.0,0.0,0.0,0.0,0.0,0.0,0.0,0.824,0.0,0.0,0.0,0.0,0.0,0.0,0.0,0.0
8,B,0.0,0.0,0.0,0.0,0.0,0.0,0.0,0.0,0.0,0.001,0.0,0.0,0.0,0.0,0.0,0.0,0.0,0.0,0.0,0.0,0.0,0.0,0.0,0.0,0.0,0.0,0.0,0.999,0.0,0.0,0.0
9,A,0.072,0.0,0.185,0.071,0.009,0.0,0.0,0.067,0.019,0.052,0.088,0.108,0.135,0.009,0.002,0.078,0.0,0.0,0.008,0.01,0.0,0.02,0.027,0.0,0.0,0.037,0.0,0.001,0.0,0.0,0.0
10,A,0.026,0.025,0.036,0.025,0.069,0.027,0.034,0.039,0.026,0.027,0.035,0.026,0.039,0.025,0.036,0.032,0.031,0.025,0.028,0.027,0.036,0.033,0.059,0.026,0.026,0.031,0.025,0.025,0.046,0.026,0.026
11,B,0.012,0.075,0.017,0.009,0.018,0.009,0.012,0.015,0.01,0.037,0.024,0.007,0.034,0.021,0.012,0.009,0.009,0.011,0.02,0.01,0.012,0.031,0.02,0.473,0.013,0.017,0.021,0.015,0.01,0.01,0.009
12,A,0.008,0.01,0.007,0.027,0.029,0.007,0.017,0.019,0.242,0.016,0.046,0.022,0.009,0.02,0.045,0.028,0.079,0.001,0.068,0.024,0.011,0.01,0.037,0.013,0.011,0.07,0.007,0.028,0.031,0.032,0.024
13,A,0.023,0.023,0.023,0.023,0.023,0.023,0.023,0.023,0.023,0.023,0.023,0.023,0.296,0.023,0.023,0.023,0.023,0.023,0.035,0.023,0.023,0.023,0.023,0.023,0.023,0.029,0.023,0.023,0.023,0.023,0.023
14,A,0.058,0.155,0.0,0.0,0.0,0.082,0.002,0.005,0.04,0.001,0.105,0.057,0.005,0.155,0.002,0.027,0.006,0.095,0.0,0.0,0.015,0.0,0.0,0.001,0.035,0.041,0.0,0.0,0.0,0.07,0.044
15,B,0.038,0.089,0.03,0.049,0.049,0.0,0.042,0.012,0.0,0.013,0.006,0.007,0.043,0.001,0.0,0.008,0.101,0.045,0.009,0.04,0.023,0.04,0.0,0.0,0.034,0.0,0.02,0.15,0.043,0.082,0.025
16,A,0.0,0.0,0.0,0.0,0.0,0.0,0.0,0.0,0.0,0.0,0.0,0.0,0.0,0.0,1.0,0.0,0.0,0.0,0.0,0.0,0.0,0.0,0.0,0.0,0.0,0.0,0.0,0.0,0.0,0.0,0.0
17,B,0.12,0.031,0.023,0.017,0.013,0.021,0.016,0.014,0.02,0.04,0.018,0.054,0.016,0.028,0.015,0.027,0.021,0.021,0.045,0.118,0.023,0.016,0.014,0.04,0.047,0.016,0.066,0.023,0.016,0.023,0.039
