,Groupe,Under 18 years old,Over 65 years old,Median age,White,Black,American Indian,Asian,Hawaiian,higher education achievement,high school achievement,literacy,urban population,Population density (number of people/square mile),unemployement,Crime Rate,Firearms Death Rate,Poverty rate,GINI index,Median income (in US dollars),2016 Trump vote,2020 Trump vote,Governor: democrat (1) / republican (0),Gun ownership rate,Adult obesity rate,Hypertension,Number of Covid-19 cases per 100k,Number of Covid-19 deaths per 100k,non-covered by a health insurance policy,Covid vax hesitancy (somewhat hesitant),Covid vax hesitancy (all),Access to Care (score between 0 and 1)
0,B,0.003,0.035,0.004,0.002,0.0,0.082,0.013,0.009,0.019,0.003,0.048,0.007,0.005,0.02,0.091,0.149,0.004,0.001,0.025,0.003,0.013,0.0,0.024,0.056,0.052,0.003,0.234,0.02,0.059,0.012,0.006
1,B,0.022,0.107,0.013,0.013,0.122,0.065,0.031,0.021,0.007,0.011,0.018,0.012,0.009,0.066,0.033,0.009,0.007,0.028,0.017,0.041,0.046,0.039,0.007,0.011,0.019,0.008,0.009,0.091,0.054,0.048,0.016
2,A,0.03,0.168,0.026,0.003,0.005,0.021,0.011,0.065,0.009,0.019,0.006,0.061,0.002,0.013,0.006,0.027,0.009,0.207,0.034,0.036,0.033,0.004,0.007,0.042,0.029,0.004,0.003,0.06,0.009,0.016,0.033
3,A,0.0,0.24,0.0,0.04,0.002,0.065,0.003,0.03,0.188,0.001,0.014,0.074,0.018,0.002,0.007,0.015,0.001,0.002,0.007,0.038,0.017,0.017,0.053,0.001,0.061,0.001,0.02,0.009,0.01,0.028,0.038
4,A,0.081,0.019,0.007,0.006,0.02,0.008,0.018,0.007,0.016,0.015,0.012,0.01,0.01,0.146,0.008,0.007,0.006,0.204,0.009,0.007,0.01,0.016,0.006,0.006,0.037,0.065,0.007,0.066,0.012,0.114,0.045
5,A,0.009,0.012,0.095,0.035,0.146,0.009,0.039,0.009,0.018,0.009,0.057,0.02,0.008,0.046,0.029,0.022,0.018,0.034,0.03,0.017,0.02,0.027,0.012,0.049,0.083,0.01,0.041,0.038,0.019,0.007,0.032
6,A,0.045,0.03,0.018,0.029,0.017,0.013,0.006,0.014,0.386,0.01,0.016,0.0,0.0,0.0,0.002,0.002,0.013,0.0,0.017,0.129,0.018,0.143,0.0,0.024,0.002,0.006,0.0,0.004,0.003,0.007,0.045
7,C,0.0,0.0,0.0,0.0,0.0,0.226,0.0,0.0,0.0,0.0,0.0,0.0,0.0,0.0,0.0,0.0,0.0,0.0,0.0,0.0,0.0,0.0,0.774,0.0,0.0,0.0,0.0,0.0,0.0,0.0,0.0
8,B,0.0,0.0,0.0,0.001,0.001,0.0,0.0,0.0,0.0,0.0,0.0,0.0,0.0,0.0,0.001,0.0,0.0,0.0,0.0,0.0,0.0,1.0,0.0,0.0,0.0,0.0,0.0,0.001,0.0,0.0,0.001
9,A,0.007,0.013,0.229,0.007,0.102,0.009,0.006,0.013,0.007,0.096,0.007,0.162,0.034,0.008,0.082,0.017,0.006,0.006,0.019,0.007,0.009,0.029,0.008,0.006,0.007,0.052,0.023,0.007,0.006,0.005,0.011
10,A,0.029,0.032,0.022,0.031,0.079,0.022,0.025,0.052,0.021,0.021,0.024,0.022,0.04,0.028,0.023,0.022,0.034,0.043,0.037,0.056,0.029,0.035,0.03,0.056,0.024,0.029,0.027,0.025,0.025,0.034,0.023
11,B,0.045,0.004,0.004,0.021,0.022,0.006,0.007,0.013,0.004,0.003,0.006,0.021,0.011,0.023,0.008,0.006,0.054,0.005,0.012,0.032,0.022,0.031,0.012,0.461,0.011,0.055,0.029,0.008,0.026,0.035,0.005
12,A,0.0,0.0,0.081,0.009,0.041,0.001,0.0,0.029,0.305,0.0,0.0,0.0,0.087,0.054,0.021,0.0,0.005,0.016,0.025,0.014,0.0,0.004,0.001,0.038,0.021,0.073,0.0,0.038,0.026,0.034,0.079
13,A,0.005,0.013,0.022,0.001,0.0,0.41,0.001,0.001,0.0,0.001,0.197,0.0,0.099,0.0,0.0,0.0,0.0,0.0,0.152,0.087,0.002,0.0,0.0,0.0,0.0,0.0,0.0,0.0,0.0,0.012,0.0
14,A,0.0,0.097,0.042,0.0,0.002,0.204,0.018,0.085,0.012,0.024,0.025,0.011,0.087,0.038,0.052,0.018,0.0,0.094,0.021,0.013,0.001,0.014,0.009,0.007,0.032,0.058,0.0,0.001,0.0,0.009,0.029
15,B,0.0,0.0,0.0,0.0,0.0,0.0,0.0,0.018,0.057,0.0,0.0,0.03,0.0,0.101,0.0,0.0,0.119,0.168,0.035,0.108,0.0,0.0,0.0,0.063,0.061,0.0,0.0,0.005,0.053,0.182,0.0
16,A,0.0,0.0,0.0,0.0,0.0,0.0,0.0,0.0,0.0,0.0,0.0,1.0,0.0,0.0,0.0,0.0,0.0,0.0,0.0,0.0,0.0,0.0,0.0,0.0,0.0,0.0,0.0,0.0,0.0,0.0,0.0
17,B,0.017,0.09,0.02,0.025,0.03,0.018,0.017,0.017,0.016,0.016,0.016,0.117,0.016,0.017,0.017,0.016,0.078,0.055,0.115,0.096,0.016,0.019,0.017,0.016,0.016,0.024,0.016,0.016,0.018,0.016,0.017
