1,-10.97
2,-17.05
3,-18.57
4,-17.00
5,-15.59
6,-16.09
7,-17.69
8,-18.52
9,-16.87
10,-12.87
11,-8.73
12,-7.27
13,-9.05
14,-12.08
15,-13.81
16,-13.51
17,-12.37
18,-11.65
19,-11.55
20,-11.32
21,-10.55
22,-9.54
23,-9.14
24,-9.70
25,-10.83
26,-11.68
27,-11.53
28,-10.47
29,-9.22
30,-8.35
31,-7.73
32,-6.78
33,-5.58
34,-4.89
35,-5.54
36,-7.49
37,-9.91
38,-11.93
39,-13.02
40,-12.69
41,-10.51
42,-6.66
43,-2.70
44,-0.72
45,-1.69
46,-4.61
47,-7.41
48,-8.84
49,-9.02
50,-8.51
51,-7.48
52,-5.80
53,-4.13
54,-3.63
55,-4.99
56,-7.16
57,-8.32
58,-7.44
59,-5.29
60,-3.63
61,-3.43
62,-4.06
63,-4.09
64,-2.71
65,-0.47
66,1.36
67,1.91
68,1.30
69,0.37
70,-0.35
71,-1.07
72,-2.72
73,-5.73
74,-9.39
75,-11.85
76,-11.74
77,-9.43
78,-7.27
79,-7.71
80,-11.14
81,-15.26
82,-17.15
83,-15.85
84,-13.46
85,-12.90
86,-14.89
87,-16.98
88,-16.15
89,-12.14
90,-7.69
91,-5.84
92,-6.97
93,-8.85
94,-9.17
95,-7.63
96,-5.80
97,-5.41
98,-6.82
99,-8.97
100,-10.35
101,-10.25
102,-9.01
103,-7.84
104,-7.84
105,-9.27
106,-11.61
107,-13.93
108,-15.24
109,-14.70
110,-12.12
111,-8.43
112,-5.77
113,-5.96
114,-8.67
115,-11.46
116,-12.22
117,-11.41
118,-11.13
119,-12.27
120,-13.47
121,-13.08
122,-11.31
123,-9.91
124,-9.81
125,-10.17
126,-9.81
127,-8.76
128,-8.04
129,-8.09
130,-8.07
131,-7.17
132,-5.96
133,-5.98
134,-7.79
135,-10.18
136,-11.38
137,-10.70
138,-9.14
139,-8.08
140,-8.04
141,-8.55
142,-9.13
143,-9.74
144,-10.63
145,-11.79
146,-13.11
147,-14.44
148,-15.79
149,-16.90
150,-17.24
151,-16.46
152,-15.13
153,-14.36
154,-14.79
155,-15.63
156,-15.41
157,-13.55
158,-11.52
159,-11.47
160,-13.93
161,-16.87
162,-17.89
163,-16.83
164,-15.93
165,-17.15
166,-19.89
167,-21.71
168,-21.32
169,-19.84
170,-19.33
171,-20.23
172,-21.10
173,-20.38
174,-18.41
175,-16.86
176,-16.98
177,-18.47
178,-20.26
179,-21.62
180,-22.56
181,-23.32
182,-23.95
183,-24.57
184,-25.16
185,-25.39
186,-24.63
187,-22.86
188,-21.15
189,-20.87
190,-21.97
191,-22.56
192,-20.62
193,-16.29
194,-12.31
195,-11.58
196,-14.34
197,-17.97
198,-19.68
199,-19.20
200,-18.38
201,-18.84
202,-20.28
203,-21.37
204,-21.58
205,-21.65
206,-22.28
207,-23.04
208,-22.63
209,-20.40
210,-17.45
211,-15.78
212,-15.99
213,-16.52
214,-15.69
215,-14.04
216,-13.83
217,-16.05
218,-18.61
219,-18.50
220,-15.57
221,-13.10
222,-14.14
223,-17.93
224,-20.40
225,-18.66
226,-14.47
227,-12.52
228,-15.05
229,-19.46
230,-21.24
231,-19.06
232,-15.82
233,-15.23
234,-17.72
235,-20.63
236,-21.24
237,-19.26
238,-16.07
239,-13.23
240,-11.44
241,-11.07
242,-12.17
243,-14.06
244,-15.13
245,-14.12
246,-11.19
247,-7.93
248,-5.94
249,-5.74
250,-6.56
251,-7.55
252,-8.39
253,-9.41
254,-10.65
255,-11.75
256,-12.14
257,-11.86
258,-11.21
259,-10.43
260,-9.45
261,-8.47
262,-7.86
263,-7.67
264,-7.21
265,-5.74
266,-3.44
267,-1.64
268,-1.45
269,-2.66
270,-3.67
271,-3.40
272,-2.37
273,-2.30
274,-3.92
275,-6.07
276,-6.63
277,-4.84
278,-2.06
279,-0.44
280,-0.83
281,-2.20
282,-3.18
283,-3.39
284,-3.47
285,-3.78
286,-4.18
287,-4.35
288,-4.39
289,-4.41
290,-4.60
291,-5.35
292,-7.23
293,-10.16
294,-13.30
295,-15.51
296,-16.60
297,-17.17
298,-17.80
299,-18.08
300,-17.20
301,-14.93
302,-12.63
303,-11.98
304,-13.35
305,-15.05
306,-15.26
307,-13.86
308,-12.43
309,-12.22
310,-12.91
311,-13.46
312,-13.67
313,-14.46
314,-16.56
315,-19.28
316,-20.69
317,-19.10
318,-14.95
319,-10.78
320,-9.19
321,-10.64
322,-13.22
323,-14.74
324,-14.78
325,-14.69
326,-15.49
327,-16.62
328,-16.70
329,-15.46
330,-13.87
331,-13.07
332,-12.77
333,-12.02
334,-10.52
335,-9.11
336,-8.63
337,-8.84
338,-8.55
339,-7.13
340,-5.26
341,-4.41
342,-5.09
343,-6.45
344,-7.13
345,-6.83
346,-6.22
347,-6.21
348,-6.90
349,-7.92
350,-8.67
351,-8.82
352,-8.36
353,-7.74
354,-7.45
355,-7.48
356,-7.16
357,-5.83
358,-3.60
359,-1.48
360,-0.49
361,-0.83
362,-1.67
363,-1.97
364,-1.47
365,-0.88
366,-0.62
367,-0.43
368,0.18
369,0.65
370,0.15
371,-1.36
372,-2.57
373,-2.45
374,-1.26
375,-0.13
376,0.52
377,1.27
378,2.63
379,4.18
380,5.32
381,6.18
382,7.35
383,8.51
384,8.44
385,6.34
386,3.01
387,0.12
388,-1.19
389,-1.01
390,-0.03
391,1.07
392,1.78
393,1.74
394,1.01
395,0.30
396,0.29
397,0.92
398,1.53
399,1.85
400,2.31
401,3.20
402,3.92
403,3.57
404,2.29
405,1.34
406,1.64
407,2.61
408,3.03
409,2.71
410,2.69
411,3.76
412,5.12
413,5.35
414,4.25
415,3.14
416,3.26
417,4.20
418,4.31
419,2.49
420,-0.61
421,-3.26
422,-4.24
423,-3.46
424,-1.59
425,0.65
426,2.73
427,4.23
428,4.73
429,4.13
430,3.07
431,2.61
432,2.96
433,3.01
434,1.42
435,-1.54
436,-3.82
437,-3.58
438,-1.34
439,0.48
440,0.13
441,-1.57
442,-2.53
443,-1.83
444,-0.85
445,-1.24
446,-2.74
447,-3.35
448,-1.99
449,0.01
450,0.36
451,-1.58
452,-3.96
453,-4.61
454,-3.12
455,-1.10
456,-0.22
457,-0.98
458,-2.35
459,-3.00
460,-2.02
461,0.39
462,3.33
463,5.70
464,7.13
465,8.09
466,9.33
467,10.76
468,11.49
469,10.75
470,9.14
471,8.19
472,8.84
473,10.20
474,10.84
475,10.20
476,9.22
477,8.58
478,7.73
479,5.66
480,2.83
481,1.36
482,3.15
483,7.67
484,12.08
485,13.55
486,11.95
487,9.71
488,9.48
489,11.50
490,13.56
491,13.32
492,11.10
493,9.59
494,11.11
495,14.73
496,17.38
497,16.99
498,14.96
499,14.35
500,16.22
501,18.49
502,18.82
503,17.64
504,17.34
505,18.95
506,20.64
507,20.11
508,17.68
509,15.80
510,15.85
511,16.60
512,16.12
513,14.62
514,13.83
515,14.45
516,14.78
517,13.03
518,9.96
519,8.34
520,9.38
521,11.26
522,11.27
523,9.19
524,7.30
525,7.55
526,9.23
527,10.43
528,10.43
529,10.32
530,10.97
531,11.76
532,11.48
533,10.18
534,9.28
535,9.85
536,11.04
537,11.07
538,9.52
539,8.01
540,8.34
541,10.17
542,11.26
543,9.83
544,6.74
545,4.58
546,4.94
547,6.97
548,8.82
549,9.71
550,10.31
551,11.29
552,12.40
553,13.11
554,13.51
555,13.99
556,14.49
557,14.49
558,13.86
559,13.13
560,12.99
561,13.39
562,13.83
563,13.91
564,13.42
565,12.20
566,10.47
567,9.29
568,9.75
569,11.72
570,13.38
571,13.12
572,11.22
573,9.64
574,9.58
575,10.25
576,10.11
577,9.01
578,8.11
579,7.91
580,7.38
581,5.43
582,2.72
583,1.21
584,1.79
585,3.52
586,4.95
587,5.98
588,7.30
589,8.88
590,9.43
591,8.25
592,6.30
593,5.34
594,5.73
595,6.20
596,5.51
597,4.01
598,3.22
599,3.84
600,4.69
601,3.98
602,1.52
603,-0.76
604,-0.81
605,1.41
606,3.88
607,4.67
608,3.92
609,3.42
610,4.33
611,5.88
612,6.48
613,5.71
614,4.99
615,5.98
616,8.51
617,10.56
618,10.45
619,8.54
620,6.61
621,5.88
622,5.93
623,5.74
624,4.71
625,3.00
626,0.93
627,-1.06
628,-2.26
629,-2.00
630,-0.57
631,0.75
632,0.65
633,-0.77
634,-2.16
635,-2.24
636,-1.07
637,0.45
638,1.68
639,2.79
640,3.91
641,4.55
642,4.14
643,3.02
644,2.31
645,2.66
646,3.27
647,2.67
648,0.59
649,-1.58
650,-2.28
651,-1.46
652,-0.67
653,-1.18
654,-2.80
655,-4.11
656,-4.01
657,-2.43
658,-0.45
659,0.64
660,0.10
661,-1.59
662,-3.55
663,-5.17
664,-6.34
665,-6.78
666,-6.24
667,-4.91
668,-4.19
669,-5.50
670,-8.78
671,-11.81
672,-12.19
673,-9.60
674,-6.74
675,-6.75
676,-10.44
677,-15.22
678,-17.65
679,-16.45
680,-13.51
681,-11.76
682,-12.19
683,-13.18
684,-12.91
685,-11.57
686,-10.96
687,-12.08
688,-13.56
689,-13.14
690,-10.25
691,-6.87
692,-5.55
693,-7.18
694,-9.93
695,-11.21
696,-9.88
697,-7.30
698,-5.52
699,-5.38
700,-5.92
701,-5.80
702,-4.65
703,-3.26
704,-2.33
705,-1.83
706,-1.28
707,-0.62
708,-0.33
709,-0.88
710,-1.95
711,-2.74
712,-2.91
713,-3.11
714,-4.22
715,-6.16
716,-7.47
717,-6.77
718,-4.44
719,-2.54
720,-2.68
721,-4.22
722,-5.03
723,-3.82
724,-1.47
725,0.22
726,0.34
727,-0.55
728,-1.42
729,-1.76
730,-1.65
731,-1.39
732,-1.26
733,-1.62
734,-2.91
735,-5.17
736,-7.52
737,-8.54
738,-7.51
739,-5.21
740,-3.49
741,-3.67
742,-5.28
743,-6.65
744,-6.68
745,-5.88
746,-5.56
747,-6.18
748,-6.69
749,-5.79
750,-3.39
751,-0.92
752,0.26
753,0.00
754,-0.76
755,-1.23
756,-1.41
757,-1.66
758,-1.86
759,-1.65
760,-1.08
761,-0.95
762,-1.81
763,-3.38
764,-4.48
765,-4.25
766,-2.73
767,-0.68
768,1.04
769,1.93
770,2.21
771,2.60
772,3.69
773,5.02
774,5.49
775,4.57
776,2.99
777,2.02
778,2.26
779,3.15
780,3.83
781,4.05
782,4.09
783,4.14
784,3.76
785,2.59
786,0.78
787,-0.86
788,-1.64
789,-1.45
790,-0.97
791,-1.19
792,-2.83
793,-5.61
794,-7.98
795,-8.09
796,-5.35
797,-1.46
798,0.90
799,0.32
800,-2.39
801,-5.17
802,-6.08
803,-4.29
804,-0.41
805,3.63
806,5.93
807,6.00
808,5.01
809,4.19
810,3.81
811,3.22
812,2.06
813,0.70
814,-0.19
815,-0.32
816,0.16
817,0.91
818,1.73
819,2.48
820,2.84
821,2.64
822,1.92
823,1.02
824,0.09
825,-0.89
826,-1.97
827,-2.86
828,-3.42
829,-3.85
830,-4.30
831,-4.22
832,-2.92
833,-0.55
834,1.34
835,1.27
836,-0.78
837,-3.24
838,-4.70
839,-5.10
840,-5.45
841,-6.49
842,-8.09
843,-9.59
844,-10.52
845,-10.53
846,-9.55
847,-7.87
848,-6.02
849,-4.30
850,-2.90
851,-2.23
852,-2.92
853,-5.04
854,-7.31
855,-7.86
856,-5.90
857,-2.81
858,-1.10
859,-2.13
860,-4.83
861,-6.77
862,-6.52
863,-4.79
864,-3.22
865,-2.62
866,-2.69
867,-3.11
868,-4.01
869,-5.57
870,-7.14
871,-7.77
872,-6.65
873,-3.69
874,0.15
875,2.99
876,3.32
877,1.31
878,-0.89
879,-1.09
880,1.14
881,4.10
882,5.81
883,5.57
884,4.26
885,2.89
886,1.84
887,1.01
888,0.78
889,1.82
890,3.83
891,5.38
892,4.95
893,2.83
894,1.07
895,1.51
896,3.50
897,4.52
898,2.62
899,-1.41
900,-5.06
901,-6.49
902,-5.82
903,-4.15
904,-2.44
905,-1.34
906,-1.51
907,-3.03
908,-4.44
909,-3.61
910,-0.19
911,3.26
912,3.34
913,-0.43
914,-4.66
915,-5.26
916,-1.40
917,3.86
918,6.79
919,6.29
920,3.97
921,2.04
922,1.20
923,0.90
924,0.62
925,0.48
926,0.30
927,-0.64
928,-2.80
929,-5.41
930,-7.04
931,-7.18
932,-6.83
933,-7.12
934,-8.09
935,-8.67
936,-8.29
937,-7.36
938,-6.73
939,-6.33
940,-5.50
941,-3.89
942,-2.38
943,-2.11
944,-3.19
945,-4.45
946,-4.92
947,-4.85
948,-5.53
949,-7.67
950,-10.62
951,-12.93
952,-13.72
953,-13.15
954,-11.89
955,-10.64
956,-10.08
957,-10.82
958,-12.83
959,-14.93
960,-15.46
961,-13.76
962,-10.77
963,-8.04
964,-6.11
965,-4.44
966,-2.65
967,-1.62
968,-2.47
969,-4.94
970,-7.03
971,-6.92
972,-4.99
973,-3.68
974,-4.23
975,-5.48
976,-5.32
977,-3.97
978,-3.80
979,-6.34
980,-9.73
981,-10.54
982,-7.34
983,-2.26
984,1.51
985,2.62
986,2.11
987,1.32
988,0.67
989,0.14
990,0.34
991,1.83
992,3.81
993,4.28
994,2.38
995,-0.41
996,-1.51
997,-0.08
998,2.12
999,2.90
1000,2.03
1001,1.23
1002,1.73
1003,2.86
1004,3.03
1005,1.76
1006,0.04
1007,-1.02
1008,-1.56
1009,-2.34
1010,-3.62
1011,-4.63
1012,-4.57
1013,-3.32
1014,-1.77
1015,-1.07
1016,-1.68
1017,-3.09
1018,-4.45
1019,-5.35
1020,-5.93
1021,-6.39
1022,-6.36
1023,-5.35
1024,-3.47
1025,-1.82
1026,-1.32
1027,-1.78
1028,-1.99
1029,-0.95
1030,1.25
1031,3.67
1032,5.50
1033,6.38
1034,6.48
1035,6.00
1036,4.99
1037,3.31
1038,1.42
1039,0.36
1040,0.86
1041,2.22
1042,3.11
1043,3.02
1044,2.81
1045,3.34
1046,4.26
1047,4.41
1048,3.57
1049,2.82
1050,3.32
1051,4.85
1052,5.97
1053,5.60
1054,4.10
1055,2.73
1056,2.61
1057,3.97
1058,6.51
1059,9.34
1060,11.18
1061,10.71
1062,7.82
1063,4.01
1064,1.95
1065,3.34
1066,7.37
1067,11.07
1068,12.00
1069,10.39
1070,8.75
1071,9.28
1072,11.71
1073,13.89
1074,14.07
1075,12.70
1076,11.56
1077,11.83
1078,12.51
1079,11.58
1080,8.46
1081,5.15
1082,3.94
1083,4.89
1084,5.61
1085,4.26
1086,1.41
1087,-0.68
1088,-1.03
1089,-0.55
1090,-0.67
1091,-1.35
1092,-1.61
1093,-0.90
1094,-0.13
1095,-0.29
1096,-1.30
1097,-2.08
1098,-1.87
1099,-0.89
1100,0.18
1101,0.97
1102,1.34
1103,0.99
1104,-0.64
1105,-3.29
1106,-5.29
1107,-4.60
1108,-0.94
1109,3.35
1110,5.04
1111,2.77
1112,-1.77
1113,-5.60
1114,-6.79
1115,-5.56
1116,-3.33
1117,-1.37
1118,0.02
1119,1.14
1120,2.26
1121,3.05
1122,3.00
1123,2.00
1124,0.84
1125,0.65
1126,1.74
1127,3.06
1128,3.29
1129,2.22
1130,1.28
1131,1.87
1132,3.76
1133,5.06
1134,4.25
1135,1.80
1136,-0.29
1137,-0.51
1138,0.59
1139,1.28
1140,0.50
1141,-0.88
1142,-1.03
1143,1.07
1144,4.40
1145,6.74
1146,6.18
1147,2.71
1148,-1.92
1149,-5.26
1150,-6.09
1151,-5.03
1152,-3.79
1153,-3.58
1154,-4.57
1155,-6.22
1156,-8.11
1157,-9.81
1158,-10.57
1159,-9.57
1160,-7.03
1161,-4.52
1162,-3.76
1163,-5.04
1164,-7.01
1165,-8.12
1166,-7.83
1167,-6.51
1168,-4.60
1169,-2.28
1170,0.13
1171,1.93
1172,2.49
1173,1.65
1174,-0.03
1175,-1.82
1176,-3.38
1177,-4.76
1178,-5.94
1179,-6.64
1180,-6.71
1181,-6.53
1182,-6.92
1183,-8.11
1184,-9.35
1185,-9.24
1186,-7.30
1187,-4.51
1188,-2.87
1189,-3.61
1190,-6.09
1191,-8.57
1192,-9.90
1193,-10.72
1194,-11.11
1195,-10.78
1196,-10.25
1197,-11.78
1198,-14.70
1199,-13.90
1200,-7.61
