1,-35.86
2,-51.71
3,-52.72
4,-47.48
5,-45.68
6,-47.91
7,-49.19
8,-48.52
9,-47.74
10,-48.00
11,-48.26
12,-48.33
13,-48.15
14,-48.16
15,-48.17
16,-48.19
17,-48.21
18,-48.23
19,-48.25
20,-48.28
21,-48.32
22,-48.36
23,-48.40
24,-48.44
25,-48.48
26,-48.51
27,-48.53
28,-48.54
29,-48.55
30,-48.55
31,-48.54
32,-48.53
33,-48.51
34,-48.49
35,-48.46
36,-48.41
37,-48.36
38,-48.32
39,-48.28
40,-48.23
41,-48.18
42,-48.11
43,-48.05
44,-47.99
45,-47.95
46,-47.89
47,-47.85
48,-47.80
49,-47.77
50,-47.75
51,-47.73
52,-47.72
53,-47.72
54,-47.72
55,-47.74
56,-47.75
57,-47.77
58,-47.79
59,-47.82
60,-47.86
61,-47.89
62,-47.91
63,-47.93
64,-47.95
65,-47.96
66,-47.96
67,-47.97
68,-47.99
69,-48.02
70,-48.06
71,-48.09
72,-48.11
73,-48.14
74,-48.18
75,-48.21
76,-48.23
77,-48.24
78,-48.23
79,-48.23
80,-48.21
81,-48.20
82,-48.16
83,-48.10
84,-48.03
85,-47.96
86,-47.88
87,-47.80
88,-47.72
89,-47.64
90,-47.56
91,-47.48
92,-47.41
93,-47.35
94,-47.30
95,-47.25
96,-47.20
97,-47.16
98,-47.13
99,-47.13
100,-47.13
101,-47.14
102,-47.16
103,-47.17
104,-47.20
105,-47.24
106,-47.30
107,-47.35
108,-47.42
109,-47.47
110,-47.54
111,-47.61
112,-47.67
113,-47.74
114,-47.79
115,-47.84
116,-47.88
117,-47.90
118,-47.90
119,-47.89
120,-47.87
121,-47.85
122,-47.83
123,-47.78
124,-47.73
125,-47.68
126,-47.65
127,-47.63
128,-47.61
129,-47.59
130,-47.58
131,-47.59
132,-47.61
133,-47.66
134,-47.71
135,-47.78
136,-47.86
137,-47.94
138,-48.03
139,-48.11
140,-48.20
141,-48.27
142,-48.33
143,-48.37
144,-48.42
145,-48.46
146,-48.50
147,-48.54
148,-48.57
149,-48.61
150,-48.66
151,-48.71
152,-48.77
153,-48.83
154,-48.91
155,-48.99
156,-49.08
157,-49.17
158,-49.26
159,-49.33
160,-49.40
161,-49.47
162,-49.51
163,-49.54
164,-49.55
165,-49.55
166,-49.54
167,-49.51
168,-49.46
169,-49.39
170,-49.31
171,-49.23
172,-49.15
173,-49.04
174,-48.93
175,-48.84
176,-48.75
177,-48.69
178,-48.62
179,-48.55
180,-48.48
181,-48.45
182,-48.43
183,-48.43
184,-48.43
185,-48.43
186,-48.44
187,-48.45
188,-48.46
189,-48.47
190,-48.47
191,-48.46
192,-48.45
193,-48.43
194,-48.41
195,-48.39
196,-48.36
197,-48.34
198,-48.34
199,-48.34
200,-48.37
201,-48.40
202,-48.44
203,-48.47
204,-48.52
205,-48.57
206,-48.62
207,-48.68
208,-48.74
209,-48.79
210,-48.84
211,-48.88
212,-48.91
213,-48.93
214,-48.97
215,-49.01
216,-49.05
217,-49.08
218,-49.10
219,-49.12
220,-49.15
221,-49.17
222,-49.21
223,-49.22
224,-49.23
225,-49.23
226,-49.24
227,-49.26
228,-49.28
229,-49.30
230,-49.32
231,-49.35
232,-49.39
233,-49.44
234,-49.50
235,-49.55
236,-49.59
237,-49.62
238,-49.64
239,-49.65
240,-49.65
241,-49.63
242,-49.58
243,-49.50
244,-49.40
245,-49.29
246,-49.17
247,-49.05
248,-48.93
249,-48.81
250,-48.69
251,-48.60
252,-48.52
253,-48.47
254,-48.44
255,-48.41
256,-48.39
257,-48.39
258,-48.40
259,-48.43
260,-48.44
261,-48.46
262,-48.49
263,-48.50
264,-48.52
265,-48.53
266,-48.54
267,-48.55
268,-48.56
269,-48.58
270,-48.61
271,-48.61
272,-48.61
273,-48.61
274,-48.62
275,-48.63
276,-48.64
277,-48.64
278,-48.63
279,-48.63
280,-48.64
281,-48.64
282,-48.63
283,-48.63
284,-48.64
285,-48.66
286,-48.69
287,-48.72
288,-48.75
289,-48.77
290,-48.79
291,-48.80
292,-48.82
293,-48.83
294,-48.83
295,-48.83
296,-48.83
297,-48.82
298,-48.81
299,-48.79
300,-48.76
301,-48.73
302,-48.70
303,-48.68
304,-48.68
305,-48.67
306,-48.67
307,-48.66
308,-48.66
309,-48.68
310,-48.70
311,-48.71
312,-48.72
313,-48.74
314,-48.77
315,-48.81
316,-48.85
317,-48.89
318,-48.93
319,-48.98
320,-49.04
321,-49.11
322,-49.19
323,-49.24
324,-49.30
325,-49.34
326,-49.40
327,-49.46
328,-49.52
329,-49.57
330,-49.61
331,-49.63
332,-49.66
333,-49.68
334,-49.70
335,-49.73
336,-49.76
337,-49.77
338,-49.77
339,-49.78
340,-49.80
341,-49.81
342,-49.83
343,-49.84
344,-49.86
345,-49.89
346,-49.91
347,-49.94
348,-49.96
349,-49.99
350,-50.02
351,-50.05
352,-50.08
353,-50.09
354,-50.11
355,-50.12
356,-50.13
357,-50.11
358,-50.09
359,-50.06
360,-50.03
361,-50.01
362,-50.00
363,-49.98
364,-49.95
365,-49.93
366,-49.92
367,-49.92
368,-49.93
369,-49.93
370,-49.91
371,-49.90
372,-49.88
373,-49.87
374,-49.84
375,-49.80
376,-49.74
377,-49.69
378,-49.63
379,-49.57
380,-49.50
381,-49.44
382,-49.38
383,-49.33
384,-49.29
385,-49.26
386,-49.23
387,-49.21
388,-49.18
389,-49.15
390,-49.11
391,-49.07
392,-49.04
393,-49.01
394,-48.98
395,-48.95
396,-48.92
397,-48.90
398,-48.89
399,-48.90
400,-48.92
401,-48.94
402,-48.97
403,-49.01
404,-49.05
405,-49.09
406,-49.13
407,-49.17
408,-49.21
409,-49.25
410,-49.29
411,-49.32
412,-49.34
413,-49.35
414,-49.35
415,-49.35
416,-49.35
417,-49.37
418,-49.37
419,-49.37
420,-49.36
421,-49.35
422,-49.35
423,-49.37
424,-49.40
425,-49.42
426,-49.44
427,-49.46
428,-49.48
429,-49.50
430,-49.51
431,-49.51
432,-49.51
433,-49.48
434,-49.44
435,-49.39
436,-49.32
437,-49.25
438,-49.17
439,-49.08
440,-48.98
441,-48.88
442,-48.78
443,-48.68
444,-48.60
445,-48.53
446,-48.46
447,-48.40
448,-48.36
449,-48.34
450,-48.34
451,-48.35
452,-48.37
453,-48.40
454,-48.44
455,-48.49
456,-48.54
457,-48.60
458,-48.67
459,-48.73
460,-48.78
461,-48.82
462,-48.85
463,-48.86
464,-48.85
465,-48.82
466,-48.77
467,-48.72
468,-48.67
469,-48.60
470,-48.51
471,-48.42
472,-48.34
473,-48.28
474,-48.23
475,-48.17
476,-48.11
477,-48.08
478,-48.04
479,-48.02
480,-47.98
481,-47.96
482,-47.93
483,-47.91
484,-47.89
485,-47.85
486,-47.80
487,-47.77
488,-47.75
489,-47.73
490,-47.71
491,-47.68
492,-47.65
493,-47.63
494,-47.62
495,-47.61
496,-47.60
497,-47.60
498,-47.61
499,-47.62
500,-47.63
501,-47.64
502,-47.65
503,-47.66
504,-47.67
505,-47.68
506,-47.69
507,-47.70
508,-47.71
509,-47.71
510,-47.74
511,-47.77
512,-47.79
513,-47.81
514,-47.84
515,-47.86
516,-47.89
517,-47.91
518,-47.93
519,-47.95
520,-47.97
521,-47.96
522,-47.95
523,-47.93
524,-47.92
525,-47.91
526,-47.89
527,-47.87
528,-47.86
529,-47.85
530,-47.87
531,-47.90
532,-47.95
533,-48.00
534,-48.07
535,-48.15
536,-48.25
537,-48.33
538,-48.42
539,-48.48
540,-48.55
541,-48.61
542,-48.66
543,-48.69
544,-48.70
545,-48.70
546,-48.69
547,-48.67
548,-48.63
549,-48.58
550,-48.53
551,-48.49
552,-48.46
553,-48.43
554,-48.41
555,-48.39
556,-48.39
557,-48.40
558,-48.43
559,-48.47
560,-48.51
561,-48.56
562,-48.64
563,-48.72
564,-48.82
565,-48.92
566,-49.04
567,-49.16
568,-49.29
569,-49.41
570,-49.53
571,-49.65
572,-49.76
573,-49.86
574,-49.95
575,-50.04
576,-50.13
577,-50.20
578,-50.24
579,-50.27
580,-50.31
581,-50.33
582,-50.34
583,-50.33
584,-50.32
585,-50.31
586,-50.29
587,-50.25
588,-50.19
589,-50.13
590,-50.08
591,-50.03
592,-49.98
593,-49.92
594,-49.85
595,-49.79
596,-49.74
597,-49.70
598,-49.67
599,-49.64
600,-49.61
601,-49.59
602,-49.58
603,-49.57
604,-49.57
605,-49.57
606,-49.57
607,-49.56
608,-49.53
609,-49.51
610,-49.47
611,-49.44
612,-49.41
613,-49.38
614,-49.35
615,-49.32
616,-49.29
617,-49.27
618,-49.27
619,-49.29
620,-49.33
621,-49.38
622,-49.44
623,-49.49
624,-49.57
625,-49.66
626,-49.76
627,-49.86
628,-49.95
629,-50.02
630,-50.11
631,-50.20
632,-50.28
633,-50.35
634,-50.42
635,-50.49
636,-50.58
637,-50.65
638,-50.71
639,-50.78
640,-50.86
641,-50.94
642,-51.02
643,-51.09
644,-51.14
645,-51.19
646,-51.24
647,-51.26
648,-51.28
649,-51.28
650,-51.27
651,-51.24
652,-51.19
653,-51.14
654,-51.10
655,-51.06
656,-51.01
657,-50.96
658,-50.91
659,-50.86
660,-50.82
661,-50.79
662,-50.76
663,-50.72
664,-50.68
665,-50.64
666,-50.59
667,-50.53
668,-50.48
669,-50.42
670,-50.37
671,-50.31
672,-50.26
673,-50.22
674,-50.18
675,-50.14
676,-50.11
677,-50.09
678,-50.09
679,-50.09
680,-50.11
681,-50.12
682,-50.13
683,-50.15
684,-50.17
685,-50.20
686,-50.21
687,-50.21
688,-50.19
689,-50.16
690,-50.13
691,-50.09
692,-50.03
693,-49.97
694,-49.89
695,-49.81
696,-49.72
697,-49.62
698,-49.51
699,-49.41
700,-49.29
701,-49.18
702,-49.04
703,-48.91
704,-48.75
705,-48.60
706,-48.43
707,-48.25
708,-48.06
709,-47.87
710,-47.65
711,-47.45
712,-47.24
713,-47.04
714,-46.81
715,-46.60
716,-46.39
717,-46.20
718,-46.03
719,-45.88
720,-45.76
721,-45.67
722,-45.61
723,-45.59
724,-45.61
725,-45.65
726,-45.75
727,-45.89
728,-46.06
729,-46.26
730,-46.48
731,-46.72
732,-46.97
733,-47.22
734,-47.47
735,-47.71
736,-47.93
737,-48.14
738,-48.34
739,-48.54
740,-48.73
741,-48.90
742,-49.08
743,-49.25
744,-49.41
745,-49.55
746,-49.71
747,-49.85
748,-50.00
749,-50.11
750,-50.21
751,-50.29
752,-50.36
753,-50.42
754,-50.46
755,-50.48
756,-50.48
757,-50.47
758,-50.46
759,-50.44
760,-50.39
761,-50.34
762,-50.27
763,-50.23
764,-50.18
765,-50.12
766,-50.05
767,-49.98
768,-49.91
769,-49.84
770,-49.78
771,-49.73
772,-49.68
773,-49.62
774,-49.55
775,-49.50
776,-49.44
777,-49.38
778,-49.31
779,-49.24
780,-49.14
781,-49.04
782,-48.94
783,-48.83
784,-48.72
785,-48.61
786,-48.50
787,-48.40
788,-48.31
789,-48.22
790,-48.14
791,-48.08
792,-48.03
793,-48.01
794,-48.00
795,-48.01
796,-48.03
797,-48.05
798,-48.08
799,-48.13
800,-48.18
801,-48.22
802,-48.26
803,-48.28
804,-48.31
805,-48.32
806,-48.32
807,-48.32
808,-48.31
809,-48.29
810,-48.26
811,-48.22
812,-48.18
813,-48.12
814,-48.07
815,-48.04
816,-48.01
817,-47.99
818,-47.97
819,-47.95
820,-47.94
821,-47.94
822,-47.93
823,-47.92
824,-47.92
825,-47.92
826,-47.92
827,-47.91
828,-47.90
829,-47.90
830,-47.91
831,-47.93
832,-47.95
833,-47.98
834,-48.02
835,-48.07
836,-48.12
837,-48.15
838,-48.17
839,-48.18
840,-48.18
841,-48.18
842,-48.17
843,-48.14
844,-48.10
845,-48.05
846,-47.99
847,-47.93
848,-47.87
849,-47.81
850,-47.75
851,-47.69
852,-47.64
853,-47.61
854,-47.59
855,-47.57
856,-47.56
857,-47.57
858,-47.60
859,-47.63
860,-47.66
861,-47.70
862,-47.74
863,-47.79
864,-47.85
865,-47.91
866,-47.97
867,-48.03
868,-48.10
869,-48.15
870,-48.20
871,-48.23
872,-48.25
873,-48.28
874,-48.31
875,-48.32
876,-48.32
877,-48.31
878,-48.32
879,-48.34
880,-48.36
881,-48.39
882,-48.42
883,-48.45
884,-48.49
885,-48.52
886,-48.56
887,-48.59
888,-48.64
889,-48.68
890,-48.71
891,-48.73
892,-48.73
893,-48.72
894,-48.71
895,-48.68
896,-48.66
897,-48.63
898,-48.60
899,-48.56
900,-48.51
901,-48.46
902,-48.41
903,-48.35
904,-48.29
905,-48.23
906,-48.17
907,-48.10
908,-48.02
909,-47.95
910,-47.89
911,-47.84
912,-47.80
913,-47.77
914,-47.75
915,-47.74
916,-47.74
917,-47.77
918,-47.80
919,-47.84
920,-47.88
921,-47.91
922,-47.94
923,-47.98
924,-48.01
925,-48.03
926,-48.02
927,-47.99
928,-47.96
929,-47.92
930,-47.88
931,-47.83
932,-47.77
933,-47.71
934,-47.66
935,-47.61
936,-47.56
937,-47.51
938,-47.46
939,-47.42
940,-47.39
941,-47.36
942,-47.33
943,-47.29
944,-47.24
945,-47.21
946,-47.17
947,-47.12
948,-47.05
949,-46.97
950,-46.89
951,-46.81
952,-46.73
953,-46.65
954,-46.57
955,-46.50
956,-46.44
957,-46.41
958,-46.38
959,-46.37
960,-46.37
961,-46.39
962,-46.43
963,-46.48
964,-46.54
965,-46.61
966,-46.69
967,-46.78
968,-46.88
969,-46.97
970,-47.05
971,-47.11
972,-47.19
973,-47.25
974,-47.31
975,-47.38
976,-47.44
977,-47.49
978,-47.54
979,-47.58
980,-47.63
981,-47.69
982,-47.74
983,-47.78
984,-47.83
985,-47.89
986,-47.95
987,-48.00
988,-48.04
989,-48.09
990,-48.15
991,-48.22
992,-48.30
993,-48.38
994,-48.46
995,-48.55
996,-48.64
997,-48.73
998,-48.83
999,-48.93
1000,-49.02
1001,-49.10
1002,-49.17
1003,-49.24
1004,-49.30
1005,-49.34
1006,-49.36
1007,-49.36
1008,-49.34
1009,-49.32
1010,-49.29
1011,-49.26
1012,-49.21
1013,-49.16
1014,-49.11
1015,-49.05
1016,-48.98
1017,-48.91
1018,-48.84
1019,-48.76
1020,-48.67
1021,-48.57
1022,-48.46
1023,-48.36
1024,-48.23
1025,-48.10
1026,-47.95
1027,-47.80
1028,-47.63
1029,-47.47
1030,-47.31
1031,-47.16
1032,-47.02
1033,-46.89
1034,-46.77
1035,-46.68
1036,-46.62
1037,-46.58
1038,-46.56
1039,-46.56
1040,-46.58
1041,-46.62
1042,-46.68
1043,-46.74
1044,-46.80
1045,-46.85
1046,-46.89
1047,-46.93
1048,-46.97
1049,-47.00
1050,-47.01
1051,-47.00
1052,-46.98
1053,-46.95
1054,-46.91
1055,-46.87
1056,-46.84
1057,-46.80
1058,-46.77
1059,-46.74
1060,-46.72
1061,-46.69
1062,-46.68
1063,-46.67
1064,-46.67
1065,-46.69
1066,-46.73
1067,-46.77
1068,-46.81
1069,-46.86
1070,-46.92
1071,-47.00
1072,-47.09
1073,-47.16
1074,-47.25
1075,-47.35
1076,-47.46
1077,-47.56
1078,-47.65
1079,-47.72
1080,-47.80
1081,-47.87
1082,-47.93
1083,-47.97
1084,-47.99
1085,-48.01
1086,-48.03
1087,-48.04
1088,-48.04
1089,-48.03
1090,-48.02
1091,-48.00
1092,-48.00
1093,-48.00
1094,-48.00
1095,-48.02
1096,-48.03
1097,-48.03
1098,-48.04
1099,-48.05
1100,-48.07
1101,-48.09
1102,-48.10
1103,-48.09
1104,-48.07
1105,-48.05
1106,-48.02
1107,-47.97
1108,-47.92
1109,-47.87
1110,-47.81
1111,-47.74
1112,-47.67
1113,-47.61
1114,-47.56
1115,-47.51
1116,-47.46
1117,-47.42
1118,-47.38
1119,-47.34
1120,-47.31
1121,-47.29
1122,-47.28
1123,-47.27
1124,-47.26
1125,-47.25
1126,-47.25
1127,-47.26
1128,-47.27
1129,-47.29
1130,-47.33
1131,-47.36
1132,-47.40
1133,-47.43
1134,-47.46
1135,-47.50
1136,-47.54
1137,-47.57
1138,-47.60
1139,-47.62
1140,-47.67
1141,-47.73
1142,-47.79
1143,-47.86
1144,-47.94
1145,-48.03
1146,-48.13
1147,-48.23
1148,-48.33
1149,-48.43
1150,-48.52
1151,-48.59
1152,-48.65
1153,-48.69
1154,-48.73
1155,-48.75
1156,-48.75
1157,-48.75
1158,-48.75
1159,-48.76
1160,-48.79
1161,-48.82
1162,-48.85
1163,-48.89
1164,-48.94
1165,-49.01
1166,-49.10
1167,-49.19
1168,-49.27
1169,-49.35
1170,-49.42
1171,-49.48
1172,-49.53
1173,-49.57
1174,-49.60
1175,-49.61
1176,-49.60
1177,-49.57
1178,-49.52
1179,-49.46
1180,-49.39
1181,-49.31
1182,-49.23
1183,-49.15
1184,-49.07
1185,-49.00
1186,-48.95
1187,-48.91
1188,-48.87
1189,-48.84
1190,-48.83
1191,-48.84
1192,-48.86
1193,-48.90
1194,-48.93
1195,-48.97
1196,-49.01
1197,-49.05
1198,-49.09
1199,-49.12
1200,-49.15
1201,-49.17
1202,-49.17
1203,-49.15
1204,-49.12
1205,-49.10
1206,-49.08
1207,-49.05
1208,-49.01
1209,-48.97
1210,-48.93
1211,-48.88
1212,-48.83
1213,-48.80
1214,-48.78
1215,-48.76
1216,-48.74
1217,-48.72
1218,-48.72
1219,-48.72
1220,-48.74
1221,-48.75
1222,-48.77
1223,-48.80
1224,-48.82
1225,-48.83
1226,-48.84
1227,-48.86
1228,-48.88
1229,-48.88
1230,-48.87
1231,-48.86
1232,-48.85
1233,-48.83
1234,-48.80
1235,-48.77
1236,-48.74
1237,-48.73
1238,-48.74
1239,-48.73
1240,-48.73
1241,-48.74
1242,-48.77
1243,-48.83
1244,-48.88
1245,-48.92
1246,-48.95
1247,-48.99
1248,-49.03
1249,-49.06
1250,-49.08
1251,-49.09
1252,-49.09
1253,-49.08
1254,-49.06
1255,-49.04
1256,-49.02
1257,-49.01
1258,-49.02
1259,-49.03
1260,-49.04
1261,-49.04
1262,-49.07
1263,-49.09
1264,-49.12
1265,-49.15
1266,-49.15
1267,-49.14
1268,-49.12
1269,-49.08
1270,-49.03
1271,-48.97
1272,-48.90
1273,-48.82
1274,-48.73
1275,-48.65
1276,-48.58
1277,-48.52
1278,-48.47
1279,-48.43
1280,-48.41
1281,-48.41
1282,-48.42
1283,-48.43
1284,-48.45
1285,-48.49
1286,-48.54
1287,-48.59
1288,-48.65
1289,-48.72
1290,-48.78
1291,-48.84
1292,-48.91
1293,-48.98
1294,-49.03
1295,-49.06
1296,-49.06
1297,-49.04
1298,-49.01
1299,-48.95
1300,-48.88
1301,-48.79
1302,-48.67
1303,-48.54
1304,-48.39
1305,-48.25
1306,-48.10
1307,-47.96
1308,-47.81
1309,-47.69
1310,-47.59
1311,-47.51
1312,-47.42
1313,-47.35
1314,-47.31
1315,-47.28
1316,-47.25
1317,-47.22
1318,-47.20
1319,-47.19
1320,-47.18
1321,-47.16
1322,-47.14
1323,-47.12
1324,-47.09
1325,-47.06
1326,-47.03
1327,-47.00
1328,-46.97
1329,-46.94
1330,-46.91
1331,-46.89
1332,-46.89
1333,-46.88
1334,-46.89
1335,-46.90
1336,-46.93
1337,-46.98
1338,-47.03
1339,-47.07
1340,-47.11
1341,-47.16
1342,-47.21
1343,-47.27
1344,-47.31
1345,-47.33
1346,-47.36
1347,-47.38
1348,-47.39
1349,-47.40
1350,-47.41
1351,-47.42
1352,-47.43
1353,-47.42
1354,-47.43
1355,-47.44
1356,-47.45
1357,-47.47
1358,-47.50
1359,-47.54
1360,-47.59
1361,-47.64
1362,-47.68
1363,-47.72
1364,-47.77
1365,-47.83
1366,-47.89
1367,-47.94
1368,-47.99
1369,-48.04
1370,-48.07
1371,-48.10
1372,-48.11
1373,-48.11
1374,-48.12
1375,-48.11
1376,-48.09
1377,-48.07
1378,-48.06
1379,-48.05
1380,-48.06
1381,-48.08
1382,-48.13
1383,-48.20
1384,-48.31
1385,-48.44
1386,-48.60
1387,-48.76
1388,-48.94
1389,-49.13
1390,-49.33
1391,-49.53
1392,-49.72
1393,-49.89
1394,-50.04
1395,-50.18
1396,-50.30
1397,-50.40
1398,-50.48
1399,-50.54
1400,-50.58
1401,-50.61
1402,-50.63
1403,-50.64
1404,-50.64
1405,-50.62
1406,-50.58
1407,-50.54
1408,-50.50
1409,-50.46
1410,-50.42
1411,-50.38
1412,-50.35
1413,-50.33
1414,-50.31
1415,-50.30
1416,-50.30
1417,-50.31
1418,-50.34
1419,-50.38
1420,-50.42
1421,-50.45
1422,-50.47
1423,-50.50
1424,-50.54
1425,-50.58
1426,-50.61
1427,-50.64
1428,-50.68
1429,-50.71
1430,-50.76
1431,-50.80
1432,-50.84
1433,-50.89
1434,-50.94
1435,-50.99
1436,-51.04
1437,-51.09
1438,-51.13
1439,-51.16
1440,-51.19
1441,-51.21
1442,-51.21
1443,-51.19
1444,-51.16
1445,-51.12
1446,-51.07
1447,-51.00
1448,-50.92
1449,-50.83
1450,-50.72
1451,-50.62
1452,-50.51
1453,-50.41
1454,-50.32
1455,-50.24
1456,-50.16
1457,-50.10
1458,-50.03
1459,-49.98
1460,-49.91
1461,-49.85
1462,-49.76
1463,-49.65
1464,-49.52
1465,-49.39
1466,-49.23
1467,-49.05
1468,-48.85
1469,-48.65
1470,-48.43
1471,-48.22
1472,-47.98
1473,-47.75
1474,-47.50
1475,-47.25
1476,-47.00
1477,-46.76
1478,-46.50
1479,-46.25
1480,-45.99
1481,-45.76
1482,-45.52
1483,-45.31
1484,-45.10
1485,-44.92
1486,-44.77
1487,-44.66
1488,-44.59
1489,-44.55
1490,-44.55
1491,-44.59
1492,-44.66
1493,-44.77
1494,-44.92
1495,-45.10
1496,-45.30
1497,-45.52
1498,-45.77
1499,-46.04
1500,-46.34
1501,-46.64
1502,-46.95
1503,-47.25
1504,-47.56
1505,-47.85
1506,-48.15
1507,-48.42
1508,-48.68
1509,-48.92
1510,-49.15
1511,-49.36
1512,-49.57
1513,-49.76
1514,-49.94
1515,-50.09
1516,-50.24
1517,-50.38
1518,-50.51
1519,-50.63
1520,-50.73
1521,-50.81
1522,-50.90
1523,-50.98
1524,-51.05
1525,-51.11
1526,-51.16
1527,-51.18
1528,-51.20
1529,-51.21
1530,-51.22
1531,-51.23
1532,-51.23
1533,-51.22
1534,-51.21
1535,-51.20
1536,-51.19
1537,-51.18
1538,-51.17
1539,-51.14
1540,-51.12
1541,-51.10
1542,-51.08
1543,-51.07
1544,-51.04
1545,-51.03
1546,-51.01
1547,-50.99
1548,-50.96
1549,-50.93
1550,-50.90
1551,-50.89
1552,-50.87
1553,-50.86
1554,-50.85
1555,-50.84
1556,-50.84
1557,-50.85
1558,-50.87
1559,-50.89
1560,-50.90
1561,-50.91
1562,-50.92
1563,-50.93
1564,-50.95
1565,-50.97
1566,-50.98
1567,-50.98
1568,-50.98
1569,-50.99
1570,-51.00
1571,-51.01
1572,-51.02
1573,-51.02
1574,-51.01
1575,-51.02
1576,-51.02
1577,-51.01
1578,-50.98
1579,-50.95
1580,-50.92
1581,-50.90
1582,-50.85
1583,-50.79
1584,-50.73
1585,-50.67
1586,-50.60
1587,-50.53
1588,-50.44
1589,-50.35
1590,-50.25
1591,-50.15
1592,-50.02
1593,-49.90
1594,-49.75
1595,-49.59
1596,-49.42
1597,-49.26
1598,-49.08
1599,-48.90
1600,-48.72
1601,-48.56
1602,-48.39
1603,-48.25
1604,-48.12
1605,-48.02
1606,-47.94
1607,-47.88
1608,-47.85
1609,-47.85
1610,-47.88
1611,-47.94
1612,-48.02
1613,-48.10
1614,-48.18
1615,-48.24
1616,-48.29
1617,-48.34
1618,-48.39
1619,-48.45
1620,-48.52
1621,-48.57
1622,-48.63
1623,-48.68
1624,-48.72
1625,-48.72
1626,-48.69
1627,-48.65
1628,-48.59
1629,-48.55
1630,-48.52
1631,-48.48
1632,-48.44
1633,-48.39
1634,-48.36
1635,-48.32
1636,-48.32
1637,-48.32
1638,-48.34
1639,-48.36
1640,-48.40
1641,-48.46
1642,-48.53
1643,-48.60
1644,-48.67
1645,-48.76
1646,-48.87
1647,-48.97
1648,-49.05
1649,-49.12
1650,-49.19
1651,-49.24
1652,-49.28
1653,-49.30
1654,-49.29
1655,-49.27
1656,-49.26
1657,-49.24
1658,-49.22
1659,-49.22
1660,-49.24
1661,-49.27
1662,-49.31
1663,-49.37
1664,-49.45
1665,-49.53
1666,-49.61
1667,-49.68
1668,-49.75
1669,-49.81
1670,-49.86
1671,-49.90
1672,-49.93
1673,-49.95
1674,-49.96
1675,-49.96
1676,-49.95
1677,-49.92
1678,-49.91
1679,-49.88
1680,-49.86
1681,-49.83
1682,-49.81
1683,-49.80
1684,-49.81
1685,-49.83
1686,-49.85
1687,-49.89
1688,-49.93
1689,-49.97
1690,-50.02
1691,-50.08
1692,-50.14
1693,-50.18
1694,-50.21
1695,-50.23
1696,-50.26
1697,-50.28
1698,-50.29
1699,-50.29
1700,-50.29
1701,-50.30
1702,-50.32
1703,-50.34
1704,-50.36
1705,-50.39
1706,-50.42
1707,-50.45
1708,-50.49
1709,-50.53
1710,-50.56
1711,-50.60
1712,-50.62
1713,-50.64
1714,-50.65
1715,-50.66
1716,-50.68
1717,-50.70
1718,-50.72
1719,-50.74
1720,-50.76
1721,-50.79
1722,-50.82
1723,-50.86
1724,-50.91
1725,-50.95
1726,-50.98
1727,-50.99
1728,-51.01
1729,-51.02
1730,-51.03
1731,-51.03
1732,-51.02
1733,-51.01
1734,-51.00
1735,-50.99
1736,-50.98
1737,-50.96
1738,-50.97
1739,-50.98
1740,-50.99
1741,-51.00
1742,-51.01
1743,-51.03
1744,-51.06
1745,-51.09
1746,-51.12
1747,-51.15
1748,-51.17
1749,-51.19
1750,-51.22
1751,-51.25
1752,-51.28
1753,-51.29
1754,-51.31
1755,-51.33
1756,-51.35
1757,-51.37
1758,-51.39
1759,-51.39
1760,-51.40
1761,-51.41
1762,-51.43
1763,-51.43
1764,-51.44
1765,-51.45
1766,-51.47
1767,-51.49
1768,-51.51
1769,-51.54
1770,-51.57
1771,-51.61
1772,-51.66
1773,-51.71
1774,-51.76
1775,-51.81
1776,-51.86
1777,-51.92
1778,-51.99
1779,-52.05
1780,-52.10
1781,-52.14
1782,-52.17
1783,-52.19
1784,-52.20
1785,-52.20
1786,-52.19
1787,-52.17
1788,-52.14
1789,-52.10
1790,-52.05
1791,-52.01
1792,-51.95
1793,-51.89
1794,-51.83
1795,-51.78
1796,-51.73
1797,-51.69
1798,-51.63
1799,-51.57
1800,-51.51
1801,-51.46
1802,-51.41
1803,-51.37
1804,-51.32
1805,-51.28
1806,-51.24
1807,-51.20
1808,-51.17
1809,-51.14
1810,-51.11
1811,-51.08
1812,-51.05
1813,-51.02
1814,-50.99
1815,-50.96
1816,-50.92
1817,-50.87
1818,-50.82
1819,-50.77
1820,-50.71
1821,-50.64
1822,-50.57
1823,-50.52
1824,-50.45
1825,-50.40
1826,-50.34
1827,-50.31
1828,-50.27
1829,-50.23
1830,-50.20
1831,-50.17
1832,-50.16
1833,-50.16
1834,-50.15
1835,-50.14
1836,-50.12
1837,-50.10
1838,-50.08
1839,-50.06
1840,-50.04
1841,-50.02
1842,-50.01
1843,-50.00
1844,-49.98
1845,-49.96
1846,-49.95
1847,-49.95
1848,-49.96
1849,-49.98
1850,-50.00
1851,-50.03
1852,-50.07
1853,-50.12
1854,-50.18
1855,-50.25
1856,-50.33
1857,-50.41
1858,-50.49
1859,-50.56
1860,-50.62
1861,-50.67
1862,-50.70
1863,-50.74
1864,-50.75
1865,-50.76
1866,-50.77
1867,-50.77
1868,-50.76
1869,-50.75
1870,-50.75
1871,-50.76
1872,-50.77
1873,-50.78
1874,-50.80
1875,-50.82
1876,-50.87
1877,-50.91
1878,-50.94
1879,-50.96
1880,-50.97
1881,-50.99
1882,-51.01
1883,-51.02
1884,-51.03
1885,-51.03
1886,-51.02
1887,-51.02
1888,-51.03
1889,-51.04
1890,-51.05
1891,-51.06
1892,-51.07
1893,-51.09
1894,-51.11
1895,-51.13
1896,-51.15
1897,-51.17
1898,-51.19
1899,-51.20
1900,-51.21
1901,-51.22
1902,-51.22
1903,-51.22
1904,-51.22
1905,-51.22
1906,-51.22
1907,-51.22
1908,-51.23
1909,-51.24
1910,-51.25
1911,-51.26
1912,-51.27
1913,-51.29
1914,-51.32
1915,-51.35
1916,-51.37
1917,-51.39
1918,-51.40
1919,-51.40
1920,-51.40
1921,-51.39
1922,-51.37
1923,-51.35
1924,-51.33
1925,-51.29
1926,-51.27
1927,-51.25
1928,-51.24
1929,-51.24
1930,-51.25
1931,-51.26
1932,-51.30
1933,-51.35
1934,-51.42
1935,-51.50
1936,-51.58
1937,-51.66
1938,-51.74
1939,-51.83
1940,-51.92
1941,-51.99
1942,-52.04
1943,-52.09
1944,-52.14
1945,-52.19
1946,-52.23
1947,-52.26
1948,-52.29
1949,-52.33
1950,-52.37
1951,-52.41
1952,-52.46
1953,-52.52
1954,-52.57
1955,-52.62
1956,-52.69
1957,-52.75
1958,-52.81
1959,-52.87
1960,-52.92
1961,-52.98
1962,-53.04
1963,-53.09
1964,-53.13
1965,-53.16
1966,-53.20
1967,-53.23
1968,-53.26
1969,-53.28
1970,-53.29
1971,-53.30
1972,-53.31
1973,-53.31
1974,-53.30
1975,-53.29
1976,-53.28
1977,-53.27
1978,-53.26
1979,-53.25
1980,-53.24
1981,-53.24
1982,-53.25
1983,-53.26
1984,-53.27
1985,-53.28
1986,-53.30
1987,-53.33
1988,-53.36
1989,-53.39
1990,-53.43
1991,-53.47
1992,-53.50
1993,-53.52
1994,-53.53
1995,-53.54
1996,-53.54
1997,-53.53
1998,-53.52
1999,-53.49
2000,-53.44
2001,-53.38
2002,-53.31
2003,-53.24
2004,-53.17
2005,-53.10
2006,-53.03
2007,-52.95
2008,-52.87
2009,-52.80
2010,-52.73
2011,-52.67
2012,-52.59
2013,-52.51
2014,-52.43
2015,-52.34
2016,-52.24
2017,-52.13
2018,-52.02
2019,-51.91
2020,-51.80
2021,-51.69
2022,-51.58
2023,-51.47
2024,-51.37
2025,-51.29
2026,-51.23
2027,-51.18
2028,-51.14
2029,-51.12
2030,-51.12
2031,-51.13
2032,-51.16
2033,-51.20
2034,-51.24
2035,-51.28
2036,-51.32
2037,-51.36
2038,-51.40
2039,-51.43
2040,-51.45
2041,-51.46
2042,-51.46
2043,-51.45
2044,-51.43
2045,-51.41
2046,-51.39
2047,-51.36
2048,-51.33
2049,-51.29
2050,-51.27
2051,-51.25
2052,-51.24
2053,-51.23
2054,-51.21
2055,-51.21
2056,-51.21
2057,-51.22
2058,-51.16
2059,-51.03
2060,-50.84
2061,-50.63
2062,-50.41
2063,-50.18
2064,-49.95
2065,-49.71
2066,-49.46
2067,-49.23
2068,-48.99
2069,-48.77
2070,-48.57
2071,-48.41
2072,-48.26
2073,-48.15
2074,-48.05
2075,-48.00
2076,-48.00
2077,-48.03
2078,-48.08
2079,-48.15
2080,-48.25
2081,-48.35
2082,-48.47
2083,-48.59
2084,-48.72
2085,-48.84
2086,-48.98
2087,-49.11
2088,-49.26
2089,-49.41
2090,-49.57
2091,-49.73
2092,-49.92
2093,-50.12
2094,-50.34
2095,-50.52
2096,-50.66
2097,-50.73
2098,-50.77
2099,-50.81
2100,-50.84
2101,-50.86
2102,-50.87
2103,-50.88
2104,-50.89
2105,-50.90
2106,-50.91
2107,-50.91
2108,-50.91
2109,-50.91
2110,-50.90
2111,-50.89
2112,-50.89
2113,-50.90
2114,-50.91
2115,-50.91
2116,-50.91
2117,-50.92
2118,-50.93
2119,-50.96
2120,-50.97
2121,-50.98
2122,-50.99
2123,-51.00
2124,-51.00
2125,-51.01
2126,-51.00
2127,-50.99
2128,-50.97
2129,-50.94
2130,-50.91
2131,-50.88
2132,-50.85
2133,-50.81
2134,-50.77
2135,-50.74
2136,-50.70
2137,-50.67
2138,-50.63
2139,-50.61
2140,-50.60
2141,-50.59
2142,-50.59
2143,-50.59
2144,-50.59
2145,-50.60
2146,-50.62
2147,-50.63
2148,-50.65
2149,-50.67
2150,-50.70
2151,-50.73
2152,-50.76
2153,-50.78
2154,-50.79
2155,-50.80
2156,-50.81
2157,-50.82
2158,-50.83
2159,-50.84
2160,-50.85
2161,-50.85
2162,-50.85
2163,-50.85
2164,-50.84
2165,-50.83
2166,-50.82
2167,-50.82
2168,-50.82
2169,-50.82
2170,-50.83
2171,-50.84
2172,-50.85
2173,-50.86
2174,-50.87
2175,-50.88
2176,-50.89
2177,-50.91
2178,-50.94
2179,-50.97
2180,-50.99
2181,-51.03
2182,-51.07
2183,-51.11
2184,-51.17
2185,-51.21
2186,-51.27
2187,-51.33
2188,-51.39
2189,-51.45
2190,-51.51
2191,-51.56
2192,-51.61
2193,-51.64
2194,-51.67
2195,-51.68
2196,-51.67
2197,-51.65
2198,-51.62
2199,-51.58
2200,-51.53
2201,-51.48
2202,-51.44
2203,-51.41
2204,-51.39
2205,-51.37
2206,-51.35
2207,-51.35
2208,-51.36
2209,-51.39
2210,-51.41
2211,-51.45
2212,-51.47
2213,-51.49
2214,-51.50
2215,-51.51
2216,-51.52
2217,-51.52
2218,-51.51
2219,-51.50
2220,-51.50
2221,-51.51
2222,-51.52
2223,-51.54
2224,-51.58
2225,-51.63
2226,-51.69
2227,-51.75
2228,-51.81
2229,-51.88
2230,-51.95
2231,-52.01
2232,-52.06
2233,-52.10
2234,-52.12
2235,-52.14
2236,-52.13
2237,-52.12
2238,-52.11
2239,-52.08
2240,-52.07
2241,-52.06
2242,-52.05
2243,-52.05
2244,-52.06
2245,-52.07
2246,-52.08
2247,-52.10
2248,-52.12
2249,-52.13
2250,-52.14
2251,-52.14
2252,-52.13
2253,-52.11
2254,-52.08
2255,-52.07
2256,-52.05
2257,-52.03
2258,-52.01
2259,-51.98
2260,-51.97
2261,-51.96
2262,-51.95
2263,-51.94
2264,-51.93
2265,-51.93
2266,-51.94
2267,-51.94
2268,-51.93
2269,-51.91
2270,-51.88
2271,-51.84
2272,-51.79
2273,-51.75
2274,-51.72
2275,-51.69
2276,-51.66
2277,-51.63
2278,-51.61
2279,-51.60
2280,-51.59
2281,-51.60
2282,-51.60
2283,-51.62
2284,-51.65
2285,-51.68
2286,-51.72
2287,-51.74
2288,-51.77
2289,-51.79
2290,-51.81
2291,-51.82
2292,-51.85
2293,-51.86
2294,-51.89
2295,-51.90
2296,-51.92
2297,-51.94
2298,-51.97
2299,-52.00
2300,-52.03
2301,-52.05
2302,-52.06
2303,-52.07
2304,-52.08
2305,-52.09
2306,-52.10
2307,-52.10
2308,-52.09
2309,-52.08
2310,-52.07
2311,-52.06
2312,-52.05
2313,-52.04
2314,-52.03
2315,-52.03
2316,-52.04
2317,-52.06
2318,-52.09
2319,-52.13
2320,-52.18
2321,-52.22
2322,-52.25
2323,-52.28
2324,-52.31
2325,-52.33
2326,-52.33
2327,-52.32
2328,-52.30
2329,-52.27
2330,-52.23
2331,-52.18
2332,-52.13
2333,-52.08
2334,-52.03
2335,-51.99
2336,-51.96
2337,-51.94
2338,-51.93
2339,-51.94
2340,-51.97
2341,-52.01
2342,-52.07
2343,-52.13
2344,-52.21
2345,-52.30
2346,-52.40
2347,-52.51
2348,-52.62
2349,-52.72
2350,-52.82
2351,-52.91
2352,-52.98
2353,-53.04
2354,-53.09
2355,-53.13
2356,-53.17
2357,-53.20
2358,-53.21
2359,-53.22
2360,-53.23
2361,-53.25
2362,-53.27
2363,-53.29
2364,-53.32
2365,-53.36
2366,-53.41
2367,-53.46
2368,-53.51
2369,-53.56
2370,-53.61
2371,-53.67
2372,-53.73
2373,-53.78
2374,-53.83
2375,-53.88
2376,-53.92
2377,-53.96
2378,-54.00
2379,-54.04
2380,-54.07
2381,-54.09
2382,-54.11
2383,-54.13
2384,-54.15
2385,-54.17
2386,-54.18
2387,-54.19
2388,-54.21
2389,-54.21
2390,-54.22
2391,-54.22
2392,-54.22
2393,-54.23
2394,-54.25
2395,-54.27
2396,-54.28
2397,-54.29
2398,-54.30
2399,-54.32
2400,-54.35
2401,-54.37
2402,-54.38
2403,-54.39
2404,-54.40
2405,-54.40
2406,-54.39
2407,-54.37
2408,-54.34
2409,-54.31
2410,-54.28
2411,-54.25
2412,-54.22
2413,-54.19
2414,-54.16
2415,-54.13
2416,-54.11
2417,-54.09
2418,-54.07
2419,-54.06
2420,-54.05
2421,-54.04
2422,-54.03
2423,-54.03
2424,-54.01
2425,-53.99
2426,-53.97
2427,-53.95
2428,-53.93
2429,-53.91
2430,-53.89
2431,-53.88
2432,-53.88
2433,-53.89
2434,-53.91
2435,-53.93
2436,-53.94
2437,-53.96
2438,-53.97
2439,-53.98
2440,-53.97
2441,-53.96
2442,-53.93
2443,-53.90
2444,-53.86
2445,-53.82
2446,-53.79
2447,-53.77
2448,-53.75
2449,-53.74
2450,-53.75
2451,-53.78
2452,-53.82
2453,-53.87
2454,-53.93
2455,-53.99
2456,-54.05
2457,-54.10
2458,-54.14
2459,-54.17
2460,-54.18
2461,-54.19
2462,-54.21
2463,-54.21
2464,-54.22
2465,-54.22
2466,-54.22
2467,-54.23
2468,-54.25
2469,-54.27
2470,-54.29
2471,-54.31
2472,-54.33
2473,-54.35
2474,-54.36
2475,-54.36
2476,-54.36
2477,-54.37
2478,-54.38
2479,-54.38
2480,-54.37
2481,-54.37
2482,-54.38
2483,-54.39
2484,-54.40
2485,-54.40
2486,-54.40
2487,-54.40
2488,-54.39
2489,-54.37
2490,-54.34
2491,-54.30
2492,-54.25
2493,-54.19
2494,-54.13
2495,-54.07
2496,-54.01
2497,-53.96
2498,-53.91
2499,-53.86
2500,-53.83
2501,-53.81
2502,-53.79
2503,-53.78
2504,-53.78
2505,-53.78
2506,-53.78
2507,-53.78
2508,-53.78
2509,-53.79
2510,-53.81
2511,-53.81
2512,-53.82
2513,-53.84
2514,-53.85
2515,-53.85
2516,-53.87
2517,-53.88
2518,-53.91
2519,-53.94
2520,-53.98
2521,-54.02
2522,-54.06
2523,-54.10
2524,-54.14
2525,-54.18
2526,-54.21
2527,-54.24
2528,-54.28
2529,-54.31
2530,-54.32
2531,-54.32
2532,-54.31
2533,-54.29
2534,-54.26
2535,-54.21
2536,-54.14
2537,-54.07
2538,-54.01
2539,-53.94
2540,-53.86
2541,-53.78
2542,-53.70
2543,-53.63
2544,-53.57
2545,-53.52
2546,-53.48
2547,-53.45
2548,-53.44
2549,-53.43
2550,-53.42
2551,-53.41
2552,-53.39
2553,-53.38
2554,-53.36
2555,-53.34
2556,-53.31
2557,-53.28
2558,-53.25
2559,-53.22
2560,-53.19
2561,-53.15
2562,-53.11
2563,-53.08
2564,-53.04
2565,-53.01
2566,-52.98
2567,-52.95
2568,-52.93
2569,-52.90
2570,-52.88
2571,-52.87
2572,-52.86
2573,-52.84
2574,-52.82
2575,-52.82
2576,-52.83
2577,-52.84
2578,-52.86
2579,-52.88
2580,-52.90
2581,-52.93
2582,-52.96
2583,-52.98
2584,-53.00
2585,-53.01
2586,-53.01
2587,-53.00
2588,-52.98
2589,-52.95
2590,-52.91
2591,-52.86
2592,-52.80
2593,-52.76
2594,-52.70
2595,-52.64
2596,-52.59
2597,-52.56
2598,-52.54
2599,-52.53
2600,-52.53
2601,-52.54
2602,-52.56
2603,-52.59
2604,-52.63
2605,-52.67
2606,-52.71
2607,-52.75
2608,-52.79
2609,-52.83
2610,-52.86
2611,-52.88
2612,-52.90
2613,-52.91
2614,-52.91
2615,-52.90
2616,-52.88
2617,-52.85
2618,-52.81
2619,-52.77
2620,-52.73
2621,-52.68
2622,-52.62
2623,-52.57
2624,-52.53
2625,-52.51
2626,-52.51
2627,-52.51
2628,-52.52
2629,-52.55
2630,-52.59
2631,-52.64
2632,-52.70
2633,-52.76
2634,-52.82
2635,-52.88
2636,-52.93
2637,-52.97
2638,-53.00
2639,-53.00
2640,-53.01
2641,-53.02
2642,-53.03
2643,-53.05
2644,-53.08
2645,-53.12
2646,-53.18
2647,-53.25
2648,-53.35
2649,-53.46
2650,-53.59
2651,-53.74
2652,-53.89
2653,-54.04
2654,-54.20
2655,-54.35
2656,-54.48
2657,-54.59
2658,-54.68
2659,-54.73
2660,-54.78
2661,-54.79
2662,-54.79
2663,-54.76
2664,-54.71
2665,-54.65
2666,-54.58
2667,-54.52
2668,-54.43
2669,-54.34
2670,-54.25
2671,-54.17
2672,-54.10
2673,-54.05
2674,-53.99
2675,-53.93
2676,-53.88
2677,-53.84
2678,-53.80
2679,-53.76
2680,-53.72
2681,-53.68
2682,-53.65
2683,-53.62
2684,-53.58
2685,-53.54
2686,-53.51
2687,-53.49
2688,-53.47
2689,-53.45
2690,-53.44
2691,-53.42
2692,-53.42
2693,-53.42
2694,-53.42
2695,-53.41
2696,-53.40
2697,-53.39
2698,-53.38
2699,-53.37
2700,-53.36
2701,-53.34
2702,-53.31
2703,-53.28
2704,-53.25
2705,-53.22
2706,-53.19
2707,-53.16
2708,-53.13
2709,-53.10
2710,-53.07
2711,-53.04
2712,-53.02
2713,-52.99
2714,-52.97
2715,-52.95
2716,-52.94
2717,-52.94
2718,-52.95
2719,-52.96
2720,-52.98
2721,-53.02
2722,-53.07
2723,-53.13
2724,-53.20
2725,-53.28
2726,-53.36
2727,-53.44
2728,-53.53
2729,-53.62
2730,-53.70
2731,-53.78
2732,-53.85
2733,-53.91
2734,-53.97
2735,-54.03
2736,-54.08
2737,-54.12
2738,-54.16
2739,-54.18
2740,-54.21
2741,-54.22
2742,-54.22
2743,-54.22
2744,-54.22
2745,-54.22
2746,-54.22
2747,-54.22
2748,-54.21
2749,-54.21
2750,-54.22
2751,-54.23
2752,-54.24
2753,-54.25
2754,-54.26
2755,-54.26
2756,-54.25
2757,-54.24
2758,-54.24
2759,-54.21
2760,-54.17
2761,-54.13
2762,-54.08
2763,-54.04
2764,-53.99
2765,-53.95
2766,-53.90
2767,-53.87
2768,-53.85
2769,-53.84
2770,-53.84
2771,-53.84
2772,-53.84
2773,-53.85
2774,-53.86
2775,-53.88
2776,-53.88
2777,-53.89
2778,-53.90
2779,-53.92
2780,-53.92
2781,-53.93
2782,-53.95
2783,-53.96
2784,-53.99
2785,-54.02
2786,-54.06
2787,-54.10
2788,-54.14
2789,-54.18
2790,-54.22
2791,-54.26
2792,-54.29
2793,-54.32
2794,-54.35
2795,-54.38
2796,-54.41
2797,-54.43
2798,-54.45
2799,-54.46
2800,-54.49
2801,-54.51
2802,-54.52
2803,-54.53
2804,-54.54
2805,-54.56
2806,-54.58
2807,-54.59
2808,-54.60
2809,-54.61
2810,-54.61
2811,-54.62
2812,-54.61
2813,-54.60
2814,-54.58
2815,-54.57
2816,-54.55
2817,-54.53
2818,-54.50
2819,-54.46
2820,-54.42
2821,-54.38
2822,-54.33
2823,-54.28
2824,-54.23
2825,-54.19
2826,-54.16
2827,-54.13
2828,-54.10
2829,-54.07
2830,-54.04
2831,-54.02
2832,-54.02
2833,-54.02
2834,-54.02
2835,-54.03
2836,-54.05
2837,-54.08
2838,-54.11
2839,-54.14
2840,-54.17
2841,-54.20
2842,-54.23
2843,-54.26
2844,-54.29
2845,-54.31
2846,-54.33
2847,-54.35
2848,-54.36
2849,-54.37
2850,-54.39
2851,-54.40
2852,-54.43
2853,-54.44
2854,-54.47
2855,-54.50
2856,-54.53
2857,-54.57
2858,-54.61
2859,-54.65
2860,-54.70
2861,-54.74
2862,-54.77
2863,-54.80
2864,-54.83
2865,-54.86
2866,-54.89
2867,-54.90
2868,-54.92
2869,-54.93
2870,-54.93
2871,-54.92
2872,-54.91
2873,-54.90
2874,-54.89
2875,-54.88
2876,-54.86
2877,-54.84
2878,-54.82
2879,-54.82
2880,-54.81
2881,-54.80
2882,-54.79
2883,-54.76
2884,-54.75
2885,-54.74
2886,-54.73
2887,-54.72
2888,-54.71
2889,-54.70
2890,-54.69
2891,-54.68
2892,-54.67
2893,-54.66
2894,-54.64
2895,-54.63
2896,-54.60
2897,-54.57
2898,-54.53
2899,-54.50
2900,-54.46
2901,-54.42
2902,-54.37
2903,-54.32
2904,-54.27
2905,-54.23
2906,-54.20
2907,-54.17
2908,-54.14
2909,-54.12
2910,-54.12
2911,-54.13
2912,-54.14
2913,-54.15
2914,-54.16
2915,-54.17
2916,-54.18
2917,-54.19
2918,-54.20
2919,-54.20
2920,-54.19
2921,-54.18
2922,-54.17
2923,-54.16
2924,-54.15
2925,-54.14
2926,-54.14
2927,-54.15
2928,-54.17
2929,-54.20
2930,-54.24
2931,-54.30
2932,-54.37
2933,-54.44
2934,-54.52
2935,-54.61
2936,-54.70
2937,-54.77
2938,-54.85
2939,-54.92
2940,-54.98
2941,-55.03
2942,-55.07
2943,-55.10
2944,-55.13
2945,-55.16
2946,-55.18
2947,-55.19
2948,-55.19
2949,-55.20
2950,-55.21
2951,-55.22
2952,-55.24
2953,-55.25
2954,-55.25
2955,-55.25
2956,-55.25
2957,-55.25
2958,-55.24
2959,-55.23
2960,-55.23
2961,-55.23
2962,-55.22
2963,-55.22
2964,-55.21
2965,-55.20
2966,-55.21
2967,-55.22
2968,-55.24
2969,-55.26
2970,-55.28
2971,-55.29
2972,-55.29
2973,-55.30
2974,-55.31
2975,-55.31
2976,-55.30
2977,-55.29
2978,-55.28
2979,-55.27
2980,-55.27
2981,-55.26
2982,-55.24
2983,-55.22
2984,-55.20
2985,-55.18
2986,-55.15
2987,-55.10
2988,-55.05
2989,-55.00
2990,-54.94
2991,-54.87
2992,-54.79
2993,-54.73
2994,-54.66
2995,-54.60
2996,-54.54
2997,-54.50
2998,-54.46
2999,-54.44
3000,-54.43
3001,-54.42
3002,-54.42
3003,-54.42
3004,-54.41
3005,-54.40
3006,-54.40
3007,-54.40
3008,-54.39
3009,-54.37
3010,-54.35
3011,-54.34
3012,-54.33
3013,-54.32
3014,-54.32
3015,-54.32
3016,-54.32
3017,-54.32
3018,-54.32
3019,-54.33
3020,-54.34
3021,-54.33
3022,-54.31
3023,-54.28
3024,-54.24
3025,-54.19
3026,-54.12
3027,-54.05
3028,-53.96
3029,-53.87
3030,-53.77
3031,-53.69
3032,-53.60
3033,-53.52
3034,-53.45
3035,-53.38
3036,-53.31
3037,-53.27
3038,-53.23
3039,-53.21
3040,-53.20
3041,-53.20
3042,-53.21
3043,-53.23
3044,-53.26
3045,-53.29
3046,-53.32
3047,-53.35
3048,-53.39
3049,-53.42
3050,-53.46
3051,-53.48
3052,-53.50
3053,-53.51
3054,-53.53
3055,-53.54
3056,-53.55
3057,-53.56
3058,-53.56
3059,-53.55
3060,-53.53
3061,-53.52
3062,-53.52
3063,-53.52
3064,-53.52
3065,-53.51
3066,-53.51
3067,-53.52
3068,-53.52
3069,-53.54
3070,-53.56
3071,-53.58
3072,-53.62
3073,-53.65
3074,-53.67
3075,-53.69
3076,-53.71
3077,-53.72
3078,-53.72
3079,-53.71
3080,-53.69
3081,-53.67
3082,-53.65
3083,-53.62
3084,-53.59
3085,-53.55
3086,-53.50
3087,-53.46
3088,-53.43
3089,-53.40
3090,-53.37
3091,-53.34
3092,-53.31
3093,-53.31
3094,-53.31
3095,-53.31
3096,-53.30
3097,-53.29
3098,-53.28
3099,-53.27
3100,-53.25
3101,-53.22
3102,-53.19
3103,-53.16
3104,-53.13
3105,-53.08
3106,-53.02
3107,-52.97
3108,-52.92
3109,-52.88
3110,-52.85
3111,-52.82
3112,-52.80
3113,-52.80
3114,-52.82
3115,-52.84
3116,-52.86
3117,-52.89
3118,-52.93
3119,-52.97
3120,-53.00
3121,-53.03
3122,-53.06
3123,-53.09
3124,-53.11
3125,-53.13
3126,-53.13
3127,-53.13
3128,-53.12
3129,-53.11
3130,-53.10
3131,-53.09
3132,-53.08
3133,-53.07
3134,-53.06
3135,-53.05
3136,-53.04
3137,-53.03
3138,-53.02
3139,-53.01
3140,-53.00
3141,-52.99
3142,-52.98
3143,-52.97
3144,-52.96
3145,-52.94
3146,-52.92
3147,-52.90
3148,-52.88
3149,-52.87
3150,-52.87
3151,-52.86
3152,-52.87
3153,-52.88
3154,-52.90
3155,-52.93
3156,-52.97
3157,-53.02
3158,-53.08
3159,-53.16
3160,-53.26
3161,-53.37
3162,-53.48
3163,-53.59
3164,-53.71
3165,-53.83
3166,-53.96
3167,-54.07
3168,-54.17
3169,-54.27
3170,-54.37
3171,-54.44
3172,-54.50
3173,-54.54
3174,-54.57
3175,-54.59
3176,-54.60
3177,-54.58
3178,-54.57
3179,-54.54
3180,-54.53
3181,-54.50
3182,-54.49
3183,-54.47
3184,-54.48
3185,-54.50
3186,-54.53
3187,-54.56
3188,-54.59
3189,-54.63
3190,-54.67
3191,-54.71
3192,-54.72
3193,-54.72
3194,-54.71
3195,-54.70
3196,-54.68
3197,-54.65
3198,-54.62
3199,-54.59
3200,-54.56
3201,-54.54
3202,-54.53
3203,-54.53
3204,-54.55
3205,-54.57
3206,-54.61
3207,-54.65
3208,-54.71
3209,-54.77
3210,-54.85
3211,-54.92
3212,-54.99
3213,-55.05
3214,-55.13
3215,-55.20
3216,-55.26
3217,-55.32
3218,-55.38
3219,-55.43
3220,-55.47
3221,-55.50
3222,-55.51
3223,-55.51
3224,-55.50
3225,-55.47
3226,-55.42
3227,-55.36
3228,-55.29
3229,-55.23
3230,-55.15
3231,-55.08
3232,-54.99
3233,-54.92
3234,-54.83
3235,-54.74
3236,-54.65
3237,-54.57
3238,-54.49
3239,-54.41
3240,-54.31
3241,-54.21
3242,-54.11
3243,-54.00
3244,-53.87
3245,-53.74
3246,-53.59
3247,-53.45
3248,-53.27
3249,-53.09
3250,-52.89
3251,-52.69
3252,-52.48
3253,-52.26
3254,-52.01
3255,-51.78
3256,-51.53
3257,-51.30
3258,-51.07
3259,-50.86
3260,-50.66
3261,-50.49
3262,-50.33
3263,-50.21
3264,-50.13
3265,-50.08
3266,-50.06
3267,-50.07
3268,-50.11
3269,-50.19
3270,-50.30
3271,-50.43
3272,-50.58
3273,-50.75
3274,-50.94
3275,-51.13
3276,-51.35
3277,-51.55
3278,-51.77
3279,-51.97
3280,-52.18
3281,-52.37
3282,-52.57
3283,-52.76
3284,-52.94
3285,-53.10
3286,-53.27
3287,-53.41
3288,-53.55
3289,-53.65
3290,-53.75
3291,-53.84
3292,-53.92
3293,-53.98
3294,-54.03
3295,-54.06
3296,-54.10
3297,-54.13
3298,-54.15
3299,-54.15
3300,-54.17
3301,-54.19
3302,-54.21
3303,-54.23
3304,-54.24
3305,-54.25
3306,-54.26
3307,-54.27
3308,-54.28
3309,-54.28
3310,-54.28
3311,-54.28
3312,-54.28
3313,-54.27
3314,-54.24
3315,-54.23
3316,-54.21
3317,-54.20
3318,-54.19
3319,-54.17
3320,-54.15
3321,-54.13
3322,-54.11
3323,-54.09
3324,-54.07
3325,-54.05
3326,-54.03
3327,-54.02
3328,-54.01
3329,-54.00
3330,-54.00
3331,-54.01
3332,-54.02
3333,-54.03
3334,-54.05
3335,-54.08
3336,-54.11
3337,-54.13
3338,-54.15
3339,-54.18
3340,-54.21
3341,-54.23
3342,-54.25
3343,-54.27
3344,-54.29
3345,-54.31
3346,-54.32
3347,-54.35
3348,-54.37
3349,-54.40
3350,-54.43
3351,-54.44
3352,-54.47
3353,-54.50
3354,-54.53
3355,-54.55
3356,-54.57
3357,-54.58
3358,-54.60
3359,-54.61
3360,-54.62
3361,-54.61
3362,-54.61
3363,-54.60
3364,-54.59
3365,-54.58
3366,-54.56
3367,-54.54
3368,-54.53
3369,-54.52
3370,-54.51
3371,-54.49
3372,-54.47
3373,-54.46
3374,-54.45
3375,-54.44
3376,-54.43
3377,-54.42
3378,-54.41
3379,-54.39
3380,-54.36
3381,-54.33
3382,-54.30
3383,-54.27
3384,-54.24
3385,-54.21
3386,-54.18
3387,-54.15
3388,-54.12
3389,-54.09
3390,-54.07
3391,-54.05
3392,-54.02
3393,-53.98
3394,-53.94
3395,-53.90
3396,-53.86
3397,-53.81
3398,-53.75
3399,-53.70
3400,-53.66
3401,-53.62
3402,-53.59
3403,-53.57
3404,-53.56
3405,-53.56
3406,-53.57
3407,-53.59
3408,-53.61
3409,-53.63
3410,-53.66
3411,-53.69
3412,-53.70
3413,-53.71
3414,-53.70
3415,-53.69
3416,-53.67
3417,-53.64
3418,-53.60
3419,-53.55
3420,-53.50
3421,-53.46
3422,-53.43
3423,-53.40
3424,-53.38
3425,-53.37
3426,-53.36
3427,-53.36
3428,-53.37
3429,-53.38
3430,-53.39
3431,-53.41
3432,-53.43
3433,-53.44
3434,-53.45
3435,-53.46
3436,-53.47
3437,-53.48
3438,-53.48
3439,-53.47
3440,-53.46
3441,-53.46
3442,-53.46
3443,-53.45
3444,-53.44
3445,-53.44
3446,-53.45
3447,-53.46
3448,-53.47
3449,-53.49
3450,-53.52
3451,-53.55
3452,-53.58
3453,-53.61
3454,-53.64
3455,-53.67
3456,-53.70
3457,-53.71
3458,-53.73
3459,-53.74
3460,-53.74
3461,-53.73
3462,-53.71
3463,-53.68
3464,-53.65
3465,-53.62
3466,-53.59
3467,-53.55
3468,-53.49
3469,-53.45
3470,-53.41
3471,-53.38
3472,-53.34
3473,-53.32
3474,-53.30
3475,-53.30
3476,-53.31
3477,-53.32
3478,-53.34
3479,-53.36
3480,-53.40
3481,-53.44
3482,-53.49
3483,-53.54
3484,-53.59
3485,-53.63
3486,-53.66
3487,-53.70
3488,-53.74
3489,-53.77
3490,-53.79
3491,-53.81
3492,-53.83
3493,-53.85
3494,-53.87
3495,-53.89
3496,-53.91
3497,-53.92
3498,-53.92
3499,-53.92
3500,-53.92
3501,-53.91
3502,-53.89
3503,-53.86
3504,-53.82
3505,-53.78
3506,-53.74
3507,-53.69
3508,-53.63
3509,-53.59
3510,-53.54
3511,-53.50
3512,-53.47
3513,-53.45
3514,-53.44
3515,-53.43
3516,-53.41
3517,-53.41
3518,-53.41
3519,-53.42
3520,-53.42
3521,-53.42
3522,-53.43
3523,-53.44
3524,-53.45
3525,-53.46
3526,-53.47
3527,-53.48
3528,-53.49
3529,-53.49
3530,-53.49
3531,-53.49
3532,-53.48
3533,-53.47
3534,-53.46
3535,-53.45
3536,-53.44
3537,-53.42
3538,-53.40
3539,-53.38
3540,-53.35
3541,-53.32
3542,-53.29
3543,-53.26
3544,-53.23
3545,-53.22
3546,-53.20
3547,-53.18
3548,-53.15
3549,-53.13
3550,-53.13
3551,-53.13
3552,-53.12
3553,-53.11
3554,-53.11
3555,-53.11
3556,-53.10
3557,-53.08
3558,-53.06
3559,-53.04
3560,-53.01
3561,-52.97
3562,-52.93
3563,-52.89
3564,-52.84
3565,-52.80
3566,-52.75
3567,-52.71
3568,-52.67
3569,-52.63
3570,-52.59
3571,-52.56
3572,-52.54
3573,-52.52
3574,-52.51
3575,-52.50
3576,-52.48
3577,-52.46
3578,-52.44
3579,-52.42
3580,-52.40
3581,-52.38
3582,-52.36
3583,-52.34
3584,-52.33
3585,-52.32
3586,-52.31
3587,-52.30
3588,-52.29
3589,-52.29
3590,-52.30
3591,-52.31
3592,-52.31
3593,-52.31
3594,-52.32
3595,-52.33
3596,-52.33
3597,-52.35
3598,-52.36
3599,-52.38
3600,-52.40
3601,-52.41
3602,-52.42
3603,-52.44
3604,-52.47
3605,-52.50
3606,-52.52
3607,-52.54
3608,-52.56
3609,-52.58
3610,-52.60
3611,-52.63
3612,-52.67
3613,-52.69
3614,-52.72
3615,-52.75
3616,-52.79
3617,-52.83
3618,-52.87
3619,-52.91
3620,-52.95
3621,-52.98
3622,-53.03
3623,-53.08
3624,-53.13
3625,-53.18
3626,-53.23
3627,-53.28
3628,-53.32
3629,-53.36
3630,-53.41
3631,-53.46
3632,-53.51
3633,-53.56
3634,-53.60
3635,-53.64
3636,-53.68
3637,-53.71
3638,-53.74
3639,-53.77
3640,-53.79
3641,-53.80
3642,-53.81
3643,-53.81
3644,-53.82
3645,-53.82
3646,-53.82
3647,-53.81
3648,-53.79
3649,-53.77
3650,-53.75
3651,-53.73
3652,-53.71
3653,-53.69
3654,-53.67
3655,-53.65
3656,-53.63
3657,-53.63
3658,-53.62
3659,-53.62
3660,-53.62
3661,-53.63
3662,-53.65
3663,-53.67
3664,-53.69
3665,-53.71
3666,-53.74
3667,-53.78
3668,-53.82
3669,-53.85
3670,-53.88
3671,-53.90
3672,-53.93
3673,-53.95
3674,-53.97
3675,-53.98
3676,-53.98
3677,-53.98
3678,-53.98
3679,-53.99
3680,-54.00
3681,-54.01
3682,-54.03
3683,-54.03
3684,-54.04
3685,-54.06
3686,-54.10
3687,-54.14
3688,-54.17
3689,-54.21
3690,-54.23
3691,-54.26
3692,-54.29
3693,-54.32
3694,-54.35
3695,-54.36
3696,-54.36
3697,-54.35
3698,-54.32
3699,-54.29
3700,-54.26
3701,-54.23
3702,-54.20
3703,-54.16
3704,-54.12
3705,-54.08
3706,-54.03
3707,-53.99
3708,-53.94
3709,-53.90
3710,-53.86
3711,-53.82
3712,-53.78
3713,-53.74
3714,-53.71
3715,-53.69
3716,-53.67
3717,-53.66
3718,-53.66
3719,-53.67
3720,-53.70
3721,-53.72
3722,-53.76
3723,-53.79
3724,-53.81
3725,-53.85
3726,-53.87
3727,-53.89
3728,-53.90
3729,-53.90
3730,-53.90
3731,-53.88
3732,-53.88
3733,-53.86
3734,-53.85
3735,-53.85
3736,-53.87
3737,-53.88
3738,-53.91
3739,-53.94
3740,-53.98
3741,-54.03
3742,-54.08
3743,-54.14
3744,-54.18
3745,-54.22
3746,-54.25
3747,-54.28
3748,-54.31
3749,-54.33
3750,-54.34
3751,-54.35
3752,-54.36
3753,-54.37
3754,-54.38
3755,-54.38
3756,-54.38
3757,-54.39
3758,-54.40
3759,-54.43
3760,-54.45
3761,-54.48
3762,-54.50
3763,-54.53
3764,-54.55
3765,-54.57
3766,-54.58
3767,-54.58
3768,-54.57
3769,-54.56
3770,-54.55
3771,-54.53
3772,-54.50
3773,-54.47
3774,-54.44
3775,-54.41
3776,-54.39
3777,-54.38
3778,-54.38
3779,-54.39
3780,-54.40
3781,-54.43
3782,-54.45
3783,-54.48
3784,-54.51
3785,-54.55
3786,-54.59
3787,-54.63
3788,-54.68
3789,-54.71
3790,-54.75
3791,-54.78
3792,-54.81
3793,-54.84
3794,-54.87
3795,-54.90
3796,-54.93
3797,-54.96
3798,-54.98
3799,-54.99
3800,-55.00
3801,-55.00
3802,-54.98
3803,-54.97
3804,-54.94
3805,-54.91
3806,-54.87
3807,-54.82
3808,-54.78
3809,-54.74
3810,-54.72
3811,-54.70
3812,-54.69
3813,-54.69
3814,-54.70
3815,-54.71
3816,-54.72
3817,-54.74
3818,-54.77
3819,-54.80
3820,-54.82
3821,-54.83
3822,-54.83
3823,-54.83
3824,-54.83
3825,-54.83
3826,-54.83
3827,-54.83
3828,-54.84
3829,-54.86
3830,-54.88
3831,-54.90
3832,-54.92
3833,-54.95
3834,-54.99
3835,-55.03
3836,-55.06
3837,-55.08
3838,-55.10
3839,-55.11
3840,-55.11
3841,-55.11
3842,-55.11
3843,-55.10
3844,-55.08
3845,-55.08
3846,-55.07
3847,-55.07
3848,-55.07
3849,-55.08
3850,-55.10
3851,-55.13
3852,-55.16
3853,-55.19
3854,-55.23
3855,-55.26
3856,-55.28
3857,-55.29
3858,-55.29
3859,-55.29
3860,-55.28
3861,-55.25
3862,-55.21
3863,-55.18
3864,-55.16
3865,-55.13
3866,-55.09
3867,-55.05
3868,-55.02
3869,-55.00
3870,-54.98
3871,-54.97
3872,-54.97
3873,-54.97
3874,-54.97
3875,-54.98
3876,-55.00
3877,-55.02
3878,-55.04
3879,-55.06
3880,-55.08
3881,-55.10
3882,-55.11
3883,-55.13
3884,-55.14
3885,-55.15
3886,-55.15
3887,-55.15
3888,-55.15
3889,-55.15
3890,-55.15
3891,-55.15
3892,-55.15
3893,-55.15
3894,-55.15
3895,-55.16
3896,-55.18
3897,-55.20
3898,-55.22
3899,-55.24
3900,-55.25
3901,-55.26
3902,-55.28
3903,-55.30
3904,-55.32
3905,-55.31
3906,-55.30
3907,-55.29
3908,-55.29
3909,-55.29
3910,-55.29
3911,-55.27
3912,-55.27
3913,-55.27
3914,-55.27
3915,-55.28
3916,-55.29
3917,-55.30
3918,-55.32
3919,-55.34
3920,-55.36
3921,-55.38
3922,-55.40
3923,-55.41
3924,-55.40
3925,-55.38
3926,-55.35
3927,-55.32
3928,-55.26
3929,-55.18
3930,-55.08
3931,-54.97
3932,-54.85
3933,-54.72
3934,-54.58
3935,-54.45
3936,-54.31
3937,-54.18
3938,-54.06
3939,-53.95
3940,-53.85
3941,-53.76
3942,-53.68
3943,-53.61
3944,-53.55
3945,-53.50
3946,-53.46
3947,-53.44
3948,-53.41
3949,-53.38
3950,-53.35
3951,-53.32
3952,-53.29
3953,-53.27
3954,-53.25
3955,-53.23
3956,-53.22
3957,-53.22
3958,-53.22
3959,-53.23
3960,-53.23
3961,-53.24
3962,-53.25
3963,-53.26
3964,-53.27
3965,-53.28
3966,-53.29
3967,-53.30
3968,-53.31
3969,-53.33
3970,-53.35
3971,-53.37
3972,-53.40
3973,-53.44
3974,-53.49
3975,-53.55
3976,-53.61
3977,-53.67
3978,-53.73
3979,-53.79
3980,-53.85
3981,-53.90
3982,-53.95
3983,-53.98
3984,-54.01
3985,-54.03
3986,-54.05
3987,-54.06
3988,-54.06
3989,-54.06
3990,-54.06
3991,-54.07
3992,-54.09
3993,-54.10
3994,-54.10
3995,-54.10
3996,-54.09
3997,-54.09
3998,-54.07
3999,-54.06
4000,-54.02
4001,-53.97
4002,-53.92
4003,-53.87
4004,-53.81
4005,-53.75
4006,-53.70
4007,-53.66
4008,-53.63
4009,-53.61
4010,-53.60
4011,-53.60
4012,-53.61
4013,-53.63
4014,-53.66
4015,-53.70
4016,-53.74
4017,-53.79
4018,-53.85
4019,-53.90
4020,-53.94
4021,-53.98
4022,-54.01
4023,-54.03
4024,-54.05
4025,-54.06
4026,-54.06
4027,-54.06
4028,-54.05
4029,-54.03
4030,-54.01
4031,-54.00
4032,-53.99
4033,-53.98
4034,-53.98
4035,-53.99
4036,-54.01
4037,-54.04
4038,-54.07
4039,-54.11
4040,-54.17
4041,-54.23
4042,-54.28
4043,-54.32
4044,-54.35
4045,-54.38
4046,-54.41
4047,-54.43
4048,-54.43
4049,-54.42
4050,-54.42
4051,-54.41
4052,-54.41
4053,-54.40
4054,-54.40
4055,-54.40
4056,-54.43
4057,-54.46
4058,-54.50
4059,-54.53
4060,-54.58
4061,-54.63
4062,-54.68
4063,-54.72
4064,-54.75
4065,-54.77
4066,-54.78
4067,-54.78
4068,-54.76
4069,-54.74
4070,-54.69
4071,-54.64
4072,-54.59
4073,-54.54
4074,-54.49
4075,-54.44
4076,-54.39
4077,-54.35
4078,-54.32
4079,-54.32
4080,-54.32
4081,-54.32
4082,-54.32
4083,-54.33
4084,-54.34
4085,-54.35
4086,-54.36
4087,-54.36
4088,-54.35
4089,-54.33
4090,-54.30
4091,-54.26
4092,-54.21
4093,-54.15
4094,-54.08
4095,-54.00
4096,-53.92
4097,-53.84
4098,-53.77
4099,-53.70
4100,-53.63
4101,-53.56
4102,-53.49
4103,-53.43
4104,-53.38
4105,-53.33
4106,-53.28
4107,-53.23
4108,-53.18
4109,-53.13
4110,-53.07
4111,-53.01
4112,-52.93
4113,-52.85
4114,-52.77
4115,-52.68
4116,-52.58
4117,-52.47
4118,-52.36
4119,-52.25
4120,-52.13
4121,-52.02
4122,-51.90
4123,-51.79
4124,-51.68
4125,-51.59
4126,-51.49
4127,-51.40
4128,-51.32
4129,-51.25
4130,-51.20
4131,-51.16
4132,-51.13
4133,-51.10
4134,-51.10
4135,-51.12
4136,-51.16
4137,-51.21
4138,-51.27
4139,-51.34
4140,-51.42
4141,-51.51
4142,-51.61
4143,-51.71
4144,-51.80
4145,-51.88
4146,-51.96
4147,-52.04
4148,-52.11
4149,-52.16
4150,-52.19
4151,-52.22
4152,-52.24
4153,-52.25
4154,-52.26
4155,-52.27
4156,-52.27
4157,-52.27
4158,-52.28
4159,-52.29
4160,-52.33
4161,-52.37
4162,-52.41
4163,-52.46
4164,-52.52
4165,-52.58
4166,-52.64
4167,-52.70
4168,-52.76
4169,-52.80
4170,-52.86
4171,-52.90
4172,-52.95
4173,-52.99
4174,-53.03
4175,-53.07
4176,-53.10
4177,-53.12
4178,-53.14
4179,-53.17
4180,-53.20
4181,-53.21
4182,-53.21
4183,-53.21
4184,-53.20
4185,-53.18
4186,-53.16
4187,-53.13
4188,-53.12
4189,-53.10
4190,-53.08
4191,-53.07
4192,-53.06
4193,-53.06
4194,-53.08
4195,-53.11
4196,-53.15
4197,-53.19
4198,-53.23
4199,-53.26
4200,-53.31
4201,-53.36
4202,-53.41
4203,-53.45
4204,-53.48
4205,-53.51
4206,-53.53
4207,-53.56
4208,-53.58
4209,-53.59
4210,-53.61
4211,-53.62
4212,-53.63
4213,-53.64
4214,-53.64
4215,-53.63
4216,-53.62
4217,-53.61
4218,-53.59
4219,-53.56
4220,-53.53
4221,-53.50
4222,-53.46
4223,-53.42
4224,-53.39
4225,-53.37
4226,-53.36
4227,-53.35
4228,-53.34
4229,-53.34
4230,-53.35
4231,-53.37
4232,-53.39
4233,-53.41
4234,-53.44
4235,-53.48
4236,-53.51
4237,-53.53
4238,-53.56
4239,-53.59
4240,-53.62
4241,-53.64
4242,-53.64
4243,-53.64
4244,-53.65
4245,-53.66
4246,-53.66
4247,-53.66
4248,-53.67
4249,-53.67
4250,-53.69
4251,-53.71
4252,-53.74
4253,-53.76
4254,-53.79
4255,-53.82
4256,-53.86
4257,-53.90
4258,-53.94
4259,-53.96
4260,-53.99
4261,-54.03
4262,-54.05
4263,-54.07
4264,-54.09
4265,-54.11
4266,-54.12
4267,-54.13
4268,-54.15
4269,-54.17
4270,-54.19
4271,-54.21
4272,-54.23
4273,-54.26
4274,-54.29
4275,-54.32
4276,-54.35
4277,-54.36
4278,-54.39
4279,-54.42
4280,-54.45
4281,-54.47
4282,-54.49
4283,-54.49
4284,-54.49
4285,-54.48
4286,-54.47
4287,-54.46
4288,-54.45
4289,-54.43
4290,-54.40
4291,-54.37
4292,-54.34
4293,-54.32
4294,-54.31
4295,-54.30
4296,-54.29
4297,-54.28
4298,-54.28
4299,-54.28
4300,-54.28
4301,-54.28
4302,-54.28
4303,-54.28
4304,-54.28
4305,-54.29
4306,-54.31
4307,-54.32
4308,-54.35
4309,-54.38
4310,-54.43
4311,-54.48
4312,-54.54
4313,-54.60
4314,-54.67
4315,-54.75
4316,-54.83
4317,-54.90
4318,-54.97
4319,-55.02
4320,-55.08
4321,-55.11
4322,-55.14
4323,-55.16
4324,-55.18
4325,-55.19
4326,-55.19
4327,-55.19
4328,-55.19
4329,-55.19
4330,-55.18
4331,-55.16
4332,-55.14
4333,-55.12
4334,-55.10
4335,-55.07
4336,-55.03
4337,-54.98
4338,-54.92
4339,-54.86
4340,-54.81
4341,-54.76
4342,-54.70
4343,-54.64
4344,-54.59
4345,-54.56
4346,-54.54
4347,-54.52
4348,-54.51
4349,-54.51
4350,-54.52
4351,-54.54
4352,-54.57
4353,-54.60
4354,-54.63
4355,-54.67
4356,-54.71
4357,-54.74
4358,-54.77
4359,-54.79
4360,-54.80
4361,-54.81
4362,-54.82
4363,-54.81
4364,-54.81
4365,-54.80
4366,-54.79
4367,-54.78
4368,-54.76
4369,-54.74
4370,-54.72
4371,-54.70
4372,-54.68
4373,-54.65
4374,-54.62
4375,-54.60
4376,-54.59
4377,-54.58
4378,-54.57
4379,-54.57
4380,-54.58
4381,-54.59
4382,-54.60
4383,-54.61
4384,-54.62
4385,-54.64
4386,-54.66
4387,-54.68
4388,-54.70
4389,-54.71
4390,-54.71
4391,-54.70
4392,-54.68
4393,-54.65
4394,-54.62
4395,-54.59
4396,-54.56
4397,-54.53
4398,-54.50
4399,-54.47
4400,-54.44
4401,-54.42
4402,-54.41
4403,-54.40
4404,-54.39
4405,-54.39
4406,-54.40
4407,-54.41
4408,-54.42
4409,-54.43
4410,-54.44
4411,-54.46
4412,-54.49
4413,-54.51
4414,-54.53
4415,-54.54
4416,-54.57
4417,-54.58
4418,-54.61
4419,-54.62
4420,-54.64
4421,-54.67
4422,-54.68
4423,-54.69
4424,-54.69
4425,-54.69
4426,-54.69
4427,-54.69
4428,-54.69
4429,-54.68
4430,-54.66
4431,-54.64
4432,-54.63
4433,-54.63
4434,-54.64
4435,-54.64
4436,-54.67
4437,-54.69
4438,-54.73
4439,-54.77
4440,-54.82
4441,-54.88
4442,-54.95
4443,-55.00
4444,-55.05
4445,-55.11
4446,-55.16
4447,-55.21
4448,-55.24
4449,-55.25
4450,-55.26
4451,-55.25
4452,-55.23
4453,-55.20
4454,-55.15
4455,-55.08
4456,-55.01
4457,-54.92
4458,-54.83
4459,-54.74
4460,-54.64
4461,-54.53
4462,-54.42
4463,-54.31
4464,-54.20
4465,-54.09
4466,-53.99
4467,-53.89
4468,-53.80
4469,-53.72
4470,-53.65
4471,-53.59
4472,-53.54
4473,-53.50
4474,-53.47
4475,-53.45
4476,-53.44
4477,-53.45
4478,-53.47
4479,-53.49
4480,-53.51
4481,-53.53
4482,-53.55
4483,-53.56
4484,-53.57
4485,-53.58
4486,-53.58
4487,-53.58
4488,-53.58
4489,-53.58
4490,-53.58
4491,-53.58
4492,-53.58
4493,-53.58
4494,-53.59
4495,-53.59
4496,-53.61
4497,-53.63
4498,-53.66
4499,-53.67
4500,-53.69
4501,-53.70
4502,-53.70
4503,-53.72
4504,-53.73
4505,-53.74
4506,-53.75
4507,-53.76
4508,-53.77
4509,-53.78
4510,-53.79
4511,-53.80
4512,-53.81
4513,-53.81
4514,-53.80
4515,-53.79
4516,-53.78
4517,-53.77
4518,-53.75
4519,-53.72
4520,-53.68
4521,-53.66
4522,-53.63
4523,-53.61
4524,-53.59
4525,-53.57
4526,-53.55
4527,-53.53
4528,-53.52
4529,-53.51
4530,-53.49
4531,-53.48
4532,-53.45
4533,-53.43
4534,-53.41
4535,-53.39
4536,-53.38
4537,-53.35
4538,-53.33
4539,-53.31
4540,-53.31
4541,-53.32
4542,-53.33
4543,-53.34
4544,-53.36
4545,-53.38
4546,-53.42
4547,-53.45
4548,-53.48
4549,-53.49
4550,-53.51
4551,-53.52
4552,-53.53
4553,-53.53
4554,-53.52
4555,-53.50
4556,-53.47
4557,-53.45
4558,-53.44
4559,-53.41
4560,-53.39
4561,-53.37
4562,-53.36
4563,-53.34
4564,-53.34
4565,-53.34
4566,-53.35
4567,-53.37
4568,-53.39
4569,-53.41
4570,-53.44
4571,-53.48
4572,-53.52
4573,-53.56
4574,-53.60
4575,-53.64
4576,-53.68
4577,-53.71
4578,-53.74
4579,-53.76
4580,-53.80
4581,-53.83
4582,-53.85
4583,-53.86
4584,-53.87
4585,-53.88
4586,-53.88
4587,-53.88
4588,-53.88
4589,-53.89
4590,-53.91
4591,-53.93
4592,-53.95
4593,-53.96
4594,-54.00
4595,-54.03
4596,-54.08
4597,-54.12
4598,-54.16
4599,-54.21
4600,-54.26
4601,-54.30
4602,-54.34
4603,-54.39
4604,-54.43
4605,-54.46
4606,-54.49
4607,-54.52
4608,-54.55
4609,-54.57
4610,-54.58
4611,-54.60
4612,-54.62
4613,-54.64
4614,-54.66
4615,-54.68
4616,-54.71
4617,-54.74
4618,-54.77
4619,-54.81
4620,-54.85
4621,-54.89
4622,-54.93
4623,-54.97
4624,-55.01
4625,-55.05
4626,-55.09
4627,-55.13
4628,-55.17
4629,-55.21
4630,-55.26
4631,-55.30
4632,-55.35
4633,-55.38
4634,-55.40
4635,-55.42
4636,-55.43
4637,-55.44
4638,-55.42
4639,-55.39
4640,-55.34
4641,-55.28
4642,-55.22
4643,-55.16
4644,-55.09
4645,-55.01
4646,-54.93
4647,-54.86
4648,-54.80
4649,-54.74
4650,-54.69
4651,-54.65
4652,-54.62
4653,-54.59
4654,-54.56
4655,-54.54
4656,-54.53
4657,-54.53
4658,-54.53
4659,-54.53
4660,-54.53
4661,-54.55
4662,-54.57
4663,-54.59
4664,-54.60
4665,-54.61
4666,-54.61
4667,-54.61
4668,-54.61
4669,-54.61
4670,-54.61
4671,-54.60
4672,-54.59
4673,-54.58
4674,-54.56
4675,-54.53
4676,-54.50
4677,-54.47
4678,-54.44
4679,-54.41
4680,-54.38
4681,-54.35
4682,-54.32
4683,-54.29
4684,-54.27
4685,-54.26
4686,-54.25
4687,-54.24
4688,-54.24
4689,-54.24
4690,-54.24
4691,-54.25
4692,-54.26
4693,-54.26
4694,-54.26
4695,-54.26
4696,-54.25
4697,-54.24
4698,-54.23
4699,-54.21
4700,-54.19
4701,-54.17
4702,-54.14
4703,-54.11
4704,-54.08
4705,-54.05
4706,-54.03
4707,-54.01
4708,-53.99
4709,-53.97
4710,-53.95
4711,-53.94
4712,-53.94
4713,-53.94
4714,-53.94
4715,-53.96
4716,-53.96
4717,-53.97
4718,-53.99
4719,-54.01
4720,-54.03
4721,-54.05
4722,-54.06
4723,-54.08
4724,-54.08
4725,-54.08
4726,-54.07
4727,-54.06
4728,-54.05
4729,-54.04
4730,-54.03
4731,-54.02
4732,-54.01
4733,-54.01
4734,-54.03
4735,-54.06
4736,-54.10
4737,-54.14
4738,-54.21
4739,-54.30
4740,-54.42
4741,-54.54
4742,-54.68
4743,-54.83
4744,-55.00
4745,-55.16
4746,-55.33
4747,-55.47
4748,-55.63
4749,-55.76
4750,-55.88
4751,-55.97
4752,-56.05
4753,-56.11
4754,-56.16
4755,-56.19
4756,-56.22
4757,-56.24
4758,-56.27
4759,-56.30
4760,-56.31
4761,-56.33
4762,-56.35
4763,-56.38
4764,-56.38
4765,-56.38
4766,-56.38
4767,-56.38
4768,-56.38
4769,-56.35
4770,-56.33
4771,-56.31
4772,-56.29
4773,-56.28
4774,-56.27
4775,-56.27
4776,-56.26
4777,-56.26
4778,-56.27
4779,-56.29
4780,-56.31
4781,-56.32
4782,-56.32
4783,-56.33
4784,-56.35
4785,-56.36
4786,-56.36
4787,-56.34
4788,-56.34
4789,-56.34
4790,-56.34
4791,-56.35
4792,-56.37
4793,-56.40
4794,-56.44
4795,-56.47
4796,-56.49
4797,-56.52
4798,-56.56
4799,-56.59
4800,-56.60
4801,-56.60
4802,-56.59
4803,-56.57
4804,-56.54
4805,-56.49
4806,-56.43
4807,-56.36
4808,-56.28
4809,-56.19
4810,-56.10
4811,-56.01
4812,-55.92
4813,-55.83
4814,-55.74
4815,-55.65
4816,-55.55
4817,-55.46
4818,-55.36
4819,-55.26
4820,-55.15
4821,-55.04
4822,-54.90
4823,-54.75
4824,-54.56
4825,-54.37
4826,-54.14
4827,-53.90
4828,-53.63
4829,-53.35
4830,-53.05
4831,-52.76
4832,-52.46
4833,-52.19
4834,-51.92
4835,-51.70
4836,-51.50
4837,-51.34
4838,-51.21
4839,-51.14
4840,-51.11
4841,-51.13
4842,-51.18
4843,-51.27
4844,-51.38
4845,-51.51
4846,-51.67
4847,-51.84
4848,-52.04
4849,-52.23
4850,-52.43
4851,-52.63
4852,-52.84
4853,-53.05
4854,-53.27
4855,-53.48
4856,-53.70
4857,-53.91
4858,-54.12
4859,-54.31
4860,-54.49
4861,-54.67
4862,-54.84
4863,-54.97
4864,-55.09
4865,-55.17
4866,-55.25
4867,-55.30
4868,-55.35
4869,-55.38
4870,-55.40
4871,-55.39
4872,-55.39
4873,-55.37
4874,-55.36
4875,-55.34
4876,-55.32
4877,-55.31
4878,-55.30
4879,-55.29
4880,-55.28
4881,-55.27
4882,-55.26
4883,-55.26
4884,-55.24
4885,-55.23
4886,-55.23
4887,-55.22
4888,-55.19
4889,-55.17
4890,-55.14
4891,-55.12
4892,-55.10
4893,-55.07
4894,-55.04
4895,-55.00
4896,-54.98
4897,-54.95
4898,-54.91
4899,-54.89
4900,-54.86
4901,-54.84
4902,-54.82
4903,-54.79
4904,-54.76
4905,-54.74
4906,-54.73
4907,-54.72
4908,-54.71
4909,-54.70
4910,-54.69
4911,-54.69
4912,-54.70
4913,-54.71
4914,-54.72
4915,-54.73
4916,-54.74
4917,-54.76
4918,-54.79
4919,-54.81
4920,-54.82
4921,-54.81
4922,-54.81
4923,-54.81
4924,-54.81
4925,-54.80
4926,-54.78
4927,-54.76
4928,-54.75
4929,-54.75
4930,-54.75
4931,-54.75
4932,-54.76
4933,-54.78
4934,-54.80
4935,-54.83
4936,-54.88
4937,-54.93
4938,-54.97
4939,-55.01
4940,-55.06
4941,-55.09
4942,-55.12
4943,-55.13
4944,-55.13
4945,-55.13
4946,-55.12
4947,-55.09
4948,-55.06
4949,-55.02
4950,-54.99
4951,-54.97
4952,-54.94
4953,-54.93
4954,-54.93
4955,-54.93
4956,-54.94
4957,-54.97
4958,-55.02
4959,-55.07
4960,-55.11
4961,-55.15
4962,-55.19
4963,-55.23
4964,-55.26
4965,-55.27
4966,-55.27
4967,-55.26
4968,-55.23
4969,-55.18
4970,-55.12
4971,-55.06
4972,-55.00
4973,-54.94
4974,-54.88
4975,-54.81
4976,-54.74
4977,-54.68
4978,-54.62
4979,-54.58
4980,-54.53
4981,-54.51
4982,-54.48
4983,-54.46
4984,-54.44
4985,-54.43
4986,-54.41
4987,-54.39
4988,-54.36
4989,-54.33
4990,-54.30
4991,-54.27
4992,-54.24
4993,-54.19
4994,-54.13
4995,-54.07
4996,-54.01
4997,-53.96
4998,-53.92
4999,-53.88
5000,-53.85
5001,-53.84
5002,-53.85
5003,-53.87
5004,-53.89
5005,-53.92
5006,-53.96
5007,-54.01
5008,-54.06
5009,-54.10
5010,-54.14
5011,-54.16
5012,-54.19
5013,-54.21
5014,-54.22
5015,-54.22
5016,-54.22
5017,-54.21
5018,-54.21
5019,-54.21
5020,-54.22
5021,-54.23
5022,-54.24
5023,-54.25
5024,-54.26
5025,-54.26
5026,-54.25
5027,-54.24
5028,-54.23
5029,-54.21
5030,-54.19
5031,-54.17
5032,-54.14
5033,-54.11
5034,-54.09
5035,-54.08
5036,-54.07
5037,-54.08
5038,-54.09
5039,-54.10
5040,-54.13
5041,-54.16
5042,-54.20
5043,-54.24
5044,-54.27
5045,-54.30
5046,-54.34
5047,-54.38
5048,-54.41
5049,-54.44
5050,-54.47
5051,-54.50
5052,-54.53
5053,-54.57
5054,-54.62
5055,-54.65
5056,-54.69
5057,-54.73
5058,-54.78
5059,-54.82
5060,-54.85
5061,-54.88
5062,-54.90
5063,-54.92
5064,-54.94
5065,-54.95
5066,-54.95
5067,-54.94
5068,-54.93
5069,-54.93
5070,-54.93
5071,-54.92
5072,-54.92
5073,-54.92
5074,-54.93
5075,-54.95
5076,-54.96
5077,-54.98
5078,-55.00
5079,-55.02
5080,-55.04
5081,-55.05
5082,-55.05
5083,-55.04
5084,-55.02
5085,-54.99
5086,-54.95
5087,-54.90
5088,-54.85
5089,-54.81
5090,-54.77
5091,-54.73
5092,-54.69
5093,-54.66
5094,-54.64
5095,-54.64
5096,-54.63
5097,-54.63
5098,-54.64
5099,-54.64
5100,-54.66
5101,-54.68
5102,-54.70
5103,-54.72
5104,-54.74
5105,-54.76
5106,-54.79
5107,-54.82
5108,-54.84
5109,-54.86
5110,-54.89
5111,-54.92
5112,-54.94
5113,-54.95
5114,-54.96
5115,-54.95
5116,-54.95
5117,-54.93
5118,-54.93
5119,-54.93
5120,-54.93
5121,-54.93
5122,-54.93
5123,-54.94
5124,-54.97
5125,-54.99
5126,-55.03
5127,-55.05
5128,-55.09
5129,-55.13
5130,-55.17
5131,-55.21
5132,-55.24
5133,-55.26
5134,-55.28
5135,-55.28
5136,-55.29
5137,-55.30
5138,-55.32
5139,-55.32
5140,-55.33
5141,-55.34
5142,-55.36
5143,-55.38
5144,-55.39
5145,-55.40
5146,-55.41
5147,-55.44
5148,-55.46
5149,-55.47
5150,-55.47
5151,-55.45
5152,-55.44
5153,-55.44
5154,-55.42
5155,-55.39
5156,-55.35
5157,-55.31
5158,-55.26
5159,-55.22
5160,-55.17
5161,-55.13
5162,-55.09
5163,-55.05
5164,-55.01
5165,-54.98
5166,-54.95
5167,-54.93
5168,-54.93
5169,-54.94
5170,-54.96
5171,-54.98
5172,-55.01
5173,-55.05
5174,-55.09
5175,-55.14
5176,-55.20
5177,-55.26
5178,-55.31
5179,-55.36
5180,-55.38
5181,-55.39
5182,-55.39
5183,-55.39
5184,-55.38
5185,-55.36
5186,-55.33
5187,-55.29
5188,-55.25
5189,-55.21
5190,-55.18
5191,-55.16
5192,-55.14
5193,-55.13
5194,-55.13
5195,-55.14
5196,-55.16
5197,-55.19
5198,-55.22
5199,-55.25
5200,-55.29
5201,-55.33
5202,-55.36
5203,-55.40
5204,-55.42
5205,-55.43
5206,-55.43
5207,-55.41
5208,-55.40
5209,-55.38
5210,-55.36
5211,-55.33
5212,-55.29
5213,-55.26
5214,-55.24
5215,-55.23
5216,-55.23
5217,-55.24
5218,-55.26
5219,-55.30
5220,-55.35
5221,-55.39
5222,-55.43
5223,-55.48
5224,-55.53
5225,-55.57
5226,-55.61
5227,-55.65
5228,-55.69
5229,-55.71
5230,-55.73
5231,-55.75
5232,-55.78
5233,-55.81
5234,-55.84
5235,-55.87
5236,-55.90
5237,-55.93
5238,-55.96
5239,-55.99
5240,-56.02
5241,-56.03
5242,-56.05
5243,-56.07
5244,-56.09
5245,-56.11
5246,-56.13
5247,-56.14
5248,-56.15
5249,-56.16
5250,-56.16
5251,-56.16
5252,-56.16
5253,-56.17
5254,-56.19
5255,-56.20
5256,-56.20
5257,-56.21
5258,-56.23
5259,-56.25
5260,-56.27
5261,-56.29
5262,-56.31
5263,-56.34
5264,-56.38
5265,-56.41
5266,-56.43
5267,-56.45
5268,-56.48
5269,-56.50
5270,-56.52
5271,-56.54
5272,-56.55
5273,-56.57
5274,-56.58
5275,-56.59
5276,-56.61
5277,-56.63
5278,-56.65
5279,-56.67
5280,-56.69
5281,-56.70
5282,-56.73
5283,-56.76
5284,-56.79
5285,-56.82
5286,-56.85
5287,-56.88
5288,-56.91
5289,-56.93
5290,-56.94
5291,-56.95
5292,-56.95
5293,-56.95
5294,-56.95
5295,-56.94
5296,-56.93
5297,-56.91
5298,-56.89
5299,-56.88
5300,-56.87
5301,-56.87
5302,-56.88
5303,-56.89
5304,-56.91
5305,-56.94
5306,-56.97
5307,-56.99
5308,-57.00
5309,-57.02
5310,-57.04
5311,-57.06
5312,-57.05
5313,-57.03
5314,-57.00
5315,-56.97
5316,-56.94
5317,-56.91
5318,-56.88
5319,-56.85
5320,-56.83
5321,-56.81
5322,-56.82
5323,-56.83
5324,-56.85
5325,-56.86
5326,-56.88
5327,-56.91
5328,-56.92
5329,-56.94
5330,-56.96
5331,-56.99
5332,-57.00
5333,-57.01
5334,-57.02
5335,-57.03
5336,-57.04
5337,-57.05
5338,-57.06
5339,-57.07
5340,-57.07
5341,-57.07
5342,-57.08
5343,-57.08
5344,-57.07
5345,-57.05
5346,-57.02
5347,-56.99
5348,-56.96
5349,-56.92
5350,-56.87
5351,-56.82
5352,-56.77
5353,-56.75
5354,-56.73
5355,-56.72
5356,-56.71
5357,-56.73
5358,-56.75
5359,-56.79
5360,-56.84
5361,-56.89
5362,-56.94
5363,-57.00
5364,-57.06
5365,-57.11
5366,-57.15
5367,-57.18
5368,-57.21
5369,-57.23
5370,-57.24
5371,-57.24
5372,-57.22
5373,-57.19
5374,-57.16
5375,-57.13
5376,-57.09
5377,-57.04
5378,-56.99
5379,-56.95
5380,-56.92
5381,-56.90
5382,-56.89
5383,-56.89
5384,-56.90
5385,-56.92
5386,-56.95
5387,-57.00
5388,-57.06
5389,-57.12
5390,-57.19
5391,-57.27
5392,-57.35
5393,-57.42
5394,-57.48
5395,-57.53
5396,-57.57
5397,-57.60
5398,-57.61
5399,-57.61
5400,-57.61
5401,-57.61
5402,-57.60
5403,-57.59
5404,-57.56
5405,-57.54
5406,-57.53
5407,-57.52
5408,-57.50
5409,-57.47
5410,-57.44
5411,-57.41
5412,-57.37
5413,-57.32
5414,-57.27
5415,-57.21
5416,-57.17
5417,-57.13
5418,-57.09
5419,-57.05
5420,-57.02
5421,-57.00
5422,-56.99
5423,-56.99
5424,-57.00
5425,-57.01
5426,-57.02
5427,-57.03
5428,-57.04
5429,-57.05
5430,-57.06
5431,-57.06
5432,-57.05
5433,-57.03
5434,-56.99
5435,-56.96
5436,-56.92
5437,-56.89
5438,-56.86
5439,-56.82
5440,-56.77
5441,-56.74
5442,-56.70
5443,-56.66
5444,-56.62
5445,-56.58
5446,-56.54
5447,-56.50
5448,-56.45
5449,-56.41
5450,-56.36
5451,-56.32
5452,-56.28
5453,-56.25
5454,-56.23
5455,-56.22
5456,-56.22
5457,-56.22
5458,-56.23
5459,-56.25
5460,-56.27
5461,-56.29
5462,-56.31
5463,-56.33
5464,-56.35
5465,-56.36
5466,-56.36
5467,-56.36
5468,-56.35
5469,-56.33
5470,-56.31
5471,-56.28
5472,-56.24
5473,-56.20
5474,-56.16
5475,-56.12
5476,-56.08
5477,-56.03
5478,-55.98
5479,-55.93
5480,-55.88
5481,-55.84
5482,-55.81
5483,-55.79
5484,-55.77
5485,-55.76
5486,-55.74
5487,-55.73
5488,-55.72
5489,-55.71
5490,-55.70
5491,-55.69
5492,-55.68
5493,-55.65
5494,-55.63
5495,-55.62
5496,-55.60
5497,-55.58
5498,-55.55
5499,-55.53
5500,-55.52
5501,-55.51
5502,-55.50
5503,-55.51
5504,-55.51
5505,-55.53
5506,-55.56
5507,-55.59
5508,-55.62
5509,-55.66
5510,-55.70
5511,-55.73
5512,-55.76
5513,-55.78
5514,-55.79
5515,-55.80
5516,-55.80
5517,-55.79
5518,-55.78
5519,-55.76
5520,-55.73
5521,-55.70
5522,-55.67
5523,-55.64
5524,-55.62
5525,-55.59
5526,-55.58
5527,-55.57
5528,-55.57
5529,-55.56
5530,-55.56
5531,-55.56
5532,-55.57
5533,-55.58
5534,-55.59
5535,-55.59
5536,-55.59
5537,-55.59
5538,-55.58
5539,-55.57
5540,-55.56
5541,-55.55
5542,-55.54
5543,-55.53
5544,-55.52
5545,-55.52
5546,-55.53
5547,-55.54
5548,-55.55
5549,-55.56
5550,-55.58
5551,-55.59
5552,-55.61
5553,-55.62
5554,-55.63
5555,-55.64
5556,-55.65
5557,-55.67
5558,-55.69
5559,-55.71
5560,-55.74
5561,-55.78
5562,-55.83
5563,-55.87
5564,-55.90
5565,-55.93
5566,-55.96
5567,-55.99
5568,-56.01
5569,-56.02
5570,-56.03
5571,-56.03
5572,-56.01
5573,-55.98
5574,-55.95
5575,-55.93
5576,-55.92
5577,-55.91
5578,-55.90
5579,-55.91
5580,-55.94
5581,-55.99
5582,-56.05
5583,-56.12
5584,-56.20
5585,-56.29
5586,-56.39
5587,-56.49
5588,-56.59
5589,-56.69
5590,-56.79
5591,-56.88
5592,-56.95
5593,-57.01
5594,-57.06
5595,-57.09
5596,-57.10
5597,-57.10
5598,-57.09
5599,-57.07
5600,-57.04
5601,-57.00
5602,-56.95
5603,-56.90
5604,-56.85
5605,-56.81
5606,-56.78
5607,-56.75
5608,-56.73
5609,-56.72
5610,-56.71
5611,-56.71
5612,-56.72
5613,-56.73
5614,-56.74
5615,-56.74
5616,-56.74
5617,-56.75
5618,-56.76
5619,-56.75
5620,-56.73
5621,-56.69
5622,-56.66
5623,-56.63
5624,-56.60
5625,-56.57
5626,-56.54
5627,-56.50
5628,-56.46
5629,-56.43
5630,-56.41
5631,-56.40
5632,-56.39
5633,-56.39
5634,-56.41
5635,-56.44
5636,-56.48
5637,-56.52
5638,-56.57
5639,-56.63
5640,-56.71
5641,-56.79
5642,-56.88
5643,-56.98
5644,-57.08
5645,-57.18
5646,-57.28
5647,-57.39
5648,-57.51
5649,-57.63
5650,-57.75
5651,-57.85
5652,-57.96
5653,-58.07
5654,-58.18
5655,-58.28
5656,-58.37
5657,-58.44
5658,-58.49
5659,-58.53
5660,-58.55
5661,-58.55
5662,-58.54
5663,-58.51
5664,-58.46
5665,-58.40
5666,-58.33
5667,-58.26
5668,-58.19
5669,-58.12
5670,-58.06
5671,-58.01
5672,-57.96
5673,-57.93
5674,-57.89
5675,-57.86
5676,-57.83
5677,-57.81
5678,-57.77
5679,-57.73
5680,-57.68
5681,-57.64
5682,-57.59
5683,-57.55
5684,-57.51
5685,-57.47
5686,-57.44
5687,-57.42
5688,-57.40
5689,-57.39
5690,-57.39
5691,-57.40
5692,-57.42
5693,-57.43
5694,-57.44
5695,-57.45
5696,-57.45
5697,-57.46
5698,-57.45
5699,-57.44
5700,-57.42
5701,-57.40
5702,-57.38
5703,-57.37
5704,-57.37
5705,-57.37
5706,-57.37
5707,-57.37
5708,-57.37
5709,-57.39
5710,-57.40
5711,-57.41
5712,-57.41
5713,-57.41
5714,-57.41
5715,-57.41
5716,-57.41
5717,-57.40
5718,-57.39
5719,-57.38
5720,-57.37
5721,-57.35
5722,-57.35
5723,-57.35
5724,-57.35
5725,-57.35
5726,-57.35
5727,-57.36
5728,-57.39
5729,-57.40
5730,-57.42
5731,-57.42
5732,-57.44
5733,-57.46
5734,-57.47
5735,-57.47
5736,-57.47
5737,-57.48
5738,-57.50
5739,-57.50
5740,-57.49
5741,-57.48
5742,-57.47
5743,-57.46
5744,-57.44
5745,-57.42
5746,-57.40
5747,-57.38
5748,-57.36
5749,-57.34
5750,-57.32
5751,-57.30
5752,-57.28
5753,-57.26
5754,-57.24
5755,-57.22
5756,-57.21
5757,-57.19
5758,-57.16
5759,-57.12
5760,-57.07
5761,-57.03
5762,-57.00
5763,-56.96
5764,-56.91
5765,-56.86
5766,-56.81
5767,-56.77
5768,-56.74
5769,-56.71
5770,-56.69
5771,-56.68
5772,-56.67
5773,-56.67
5774,-56.68
5775,-56.70
5776,-56.73
5777,-56.77
5778,-56.83
5779,-56.88
5780,-56.94
5781,-56.99
5782,-57.05
5783,-57.10
5784,-57.16
5785,-57.20
5786,-57.23
5787,-57.26
5788,-57.28
5789,-57.29
5790,-57.29
5791,-57.28
5792,-57.27
5793,-57.24
5794,-57.21
5795,-57.19
5796,-57.17
5797,-57.15
5798,-57.14
5799,-57.14
5800,-57.14
5801,-57.16
5802,-57.18
5803,-57.21
5804,-57.25
5805,-57.30
5806,-57.36
5807,-57.42
5808,-57.48
5809,-57.54
5810,-57.60
5811,-57.66
5812,-57.72
5813,-57.77
5814,-57.81
5815,-57.85
5816,-57.88
5817,-57.90
5818,-57.91
5819,-57.91
5820,-57.90
5821,-57.89
5822,-57.88
5823,-57.87
5824,-57.86
5825,-57.85
5826,-57.85
5827,-57.85
5828,-57.85
5829,-57.86
5830,-57.87
5831,-57.89
5832,-57.92
5833,-57.95
5834,-57.98
5835,-58.00
5836,-58.01
5837,-58.02
5838,-58.02
5839,-58.01
5840,-58.00
5841,-57.99
5842,-57.98
5843,-57.97
5844,-57.96
5845,-57.95
5846,-57.94
5847,-57.94
5848,-57.95
5849,-57.96
5850,-57.97
5851,-57.97
5852,-57.97
5853,-57.97
5854,-57.97
5855,-57.96
5856,-57.94
5857,-57.92
5858,-57.89
5859,-57.86
5860,-57.83
5861,-57.80
5862,-57.78
5863,-57.76
5864,-57.74
5865,-57.72
5866,-57.70
5867,-57.69
5868,-57.69
5869,-57.69
5870,-57.69
5871,-57.69
5872,-57.69
5873,-57.69
5874,-57.68
5875,-57.67
5876,-57.67
5877,-57.67
5878,-57.67
5879,-57.66
5880,-57.65
5881,-57.65
5882,-57.65
5883,-57.66
5884,-57.67
5885,-57.68
5886,-57.70
5887,-57.72
5888,-57.74
5889,-57.75
5890,-57.75
5891,-57.75
5892,-57.75
5893,-57.75
5894,-57.75
5895,-57.75
5896,-57.75
5897,-57.73
5898,-57.73
5899,-57.73
5900,-57.73
5901,-57.75
5902,-57.75
5903,-57.75
5904,-57.75
5905,-57.75
5906,-57.75
5907,-57.74
5908,-57.72
5909,-57.69
5910,-57.65
5911,-57.61
5912,-57.57
5913,-57.52
5914,-57.46
5915,-57.41
5916,-57.37
5917,-57.34
5918,-57.32
5919,-57.32
5920,-57.31
5921,-57.31
5922,-57.32
5923,-57.34
5924,-57.37
5925,-57.40
5926,-57.42
5927,-57.44
5928,-57.46
5929,-57.49
5930,-57.53
5931,-57.56
5932,-57.59
5933,-57.61
5934,-57.64
5935,-57.66
5936,-57.68
5937,-57.69
5938,-57.69
5939,-57.69
5940,-57.68
5941,-57.66
5942,-57.64
5943,-57.62
5944,-57.60
5945,-57.59
5946,-57.58
5947,-57.57
5948,-57.58
5949,-57.60
5950,-57.62
5951,-57.64
5952,-57.67
5953,-57.71
5954,-57.75
5955,-57.78
5956,-57.80
5957,-57.82
5958,-57.83
5959,-57.83
5960,-57.82
5961,-57.80
5962,-57.77
5963,-57.75
5964,-57.71
5965,-57.68
5966,-57.65
5967,-57.61
5968,-57.57
5969,-57.53
5970,-57.49
5971,-57.46
5972,-57.44
5973,-57.42
5974,-57.40
5975,-57.38
5976,-57.37
5977,-57.36
5978,-57.34
5979,-57.32
5980,-57.30
5981,-57.28
5982,-57.25
5983,-57.22
5984,-57.17
5985,-57.12
5986,-57.06
5987,-56.99
5988,-56.92
5989,-56.85
5990,-56.77
5991,-56.70
5992,-56.63
5993,-56.58
5994,-56.53
5995,-56.50
5996,-56.46
5997,-56.44
5998,-56.43
5999,-56.44
6000,-56.44
6001,-56.45
6002,-56.47
6003,-56.49
6004,-56.51
6005,-56.52
6006,-56.52
6007,-56.52
6008,-56.51
6009,-56.50
6010,-56.50
6011,-56.50
6012,-56.50
6013,-56.48
6014,-56.47
6015,-56.46
6016,-56.45
6017,-56.46
6018,-56.47
6019,-56.47
6020,-56.48
6021,-56.48
6022,-56.48
6023,-56.50
6024,-56.53
6025,-56.55
6026,-56.57
6027,-56.61
6028,-56.67
6029,-56.72
6030,-56.78
6031,-56.84
6032,-56.91
6033,-56.98
6034,-57.05
6035,-57.11
6036,-57.16
6037,-57.21
6038,-57.25
6039,-57.28
6040,-57.31
6041,-57.32
6042,-57.34
6043,-57.35
6044,-57.36
6045,-57.38
6046,-57.40
6047,-57.41
6048,-57.42
6049,-57.43
6050,-57.43
6051,-57.42
6052,-57.41
6053,-57.39
6054,-57.35
6055,-57.32
6056,-57.27
6057,-57.22
6058,-57.17
6059,-57.12
6060,-57.07
6061,-57.03
6062,-57.00
6063,-56.97
6064,-56.94
6065,-56.92
6066,-56.90
6067,-56.88
6068,-56.87
6069,-56.86
6070,-56.84
6071,-56.81
6072,-56.78
6073,-56.76
6074,-56.74
6075,-56.71
6076,-56.69
6077,-56.68
6078,-56.67
6079,-56.67
6080,-56.69
6081,-56.72
6082,-56.76
6083,-56.80
6084,-56.84
6085,-56.88
6086,-56.94
6087,-57.00
6088,-57.06
6089,-57.12
6090,-57.18
6091,-57.24
6092,-57.30
6093,-57.36
6094,-57.42
6095,-57.48
6096,-57.54
6097,-57.60
6098,-57.65
6099,-57.69
6100,-57.73
6101,-57.77
6102,-57.80
6103,-57.83
6104,-57.86
6105,-57.89
6106,-57.92
6107,-57.94
6108,-57.96
6109,-57.97
6110,-58.00
6111,-58.02
6112,-58.03
6113,-58.03
6114,-58.03
6115,-58.03
6116,-58.02
6117,-57.99
6118,-57.95
6119,-57.91
6120,-57.86
6121,-57.82
6122,-57.76
6123,-57.70
6124,-57.64
6125,-57.58
6126,-57.53
6127,-57.48
6128,-57.42
6129,-57.38
6130,-57.33
6131,-57.29
6132,-57.25
6133,-57.21
6134,-57.17
6135,-57.15
6136,-57.12
6137,-57.09
6138,-57.06
6139,-57.03
6140,-57.00
6141,-56.97
6142,-56.94
6143,-56.91
6144,-56.88
6145,-56.84
6146,-56.80
6147,-56.76
6148,-56.72
6149,-56.69
6150,-56.67
6151,-56.66
6152,-56.65
6153,-56.65
6154,-56.67
6155,-56.70
6156,-56.73
6157,-56.77
6158,-56.82
6159,-56.87
6160,-56.92
6161,-56.96
6162,-56.99
6163,-57.02
6164,-57.04
6165,-57.05
6166,-57.06
6167,-57.06
6168,-57.06
6169,-57.05
6170,-57.06
6171,-57.07
6172,-57.08
6173,-57.09
6174,-57.10
6175,-57.11
6176,-57.12
6177,-57.14
6178,-57.17
6179,-57.19
6180,-57.19
6181,-57.19
6182,-57.20
6183,-57.21
6184,-57.21
6185,-57.20
6186,-57.19
6187,-57.19
6188,-57.19
6189,-57.19
6190,-57.19
6191,-57.19
6192,-57.19
6193,-57.19
6194,-57.19
6195,-57.19
6196,-57.20
6197,-57.20
6198,-57.18
6199,-57.17
6200,-57.14
6201,-57.12
6202,-57.10
6203,-57.08
6204,-57.06
6205,-57.05
6206,-57.02
6207,-56.99
6208,-56.96
6209,-56.93
6210,-56.90
6211,-56.87
6212,-56.84
6213,-56.81
6214,-56.77
6215,-56.74
6216,-56.70
6217,-56.66
6218,-56.61
6219,-56.58
6220,-56.54
6221,-56.51
6222,-56.48
6223,-56.45
6224,-56.43
6225,-56.42
6226,-56.42
6227,-56.42
6228,-56.42
6229,-56.43
6230,-56.45
6231,-56.47
6232,-56.49
6233,-56.51
6234,-56.53
6235,-56.55
6236,-56.56
6237,-56.56
6238,-56.56
6239,-56.55
6240,-56.53
6241,-56.50
6242,-56.46
6243,-56.42
6244,-56.38
6245,-56.34
6246,-56.30
6247,-56.25
6248,-56.20
6249,-56.16
6250,-56.12
6251,-56.08
6252,-56.05
6253,-56.02
6254,-55.99
6255,-55.96
6256,-55.92
6257,-55.87
6258,-55.82
6259,-55.76
6260,-55.69
6261,-55.62
6262,-55.55
6263,-55.50
6264,-55.44
6265,-55.38
6266,-55.32
6267,-55.27
6268,-55.23
6269,-55.21
6270,-55.20
6271,-55.19
6272,-55.18
6273,-55.18
6274,-55.16
6275,-55.15
6276,-55.15
6277,-55.14
6278,-55.12
6279,-55.09
6280,-55.05
6281,-55.01
6282,-54.97
6283,-54.93
6284,-54.89
6285,-54.86
6286,-54.84
6287,-54.83
6288,-54.83
6289,-54.83
6290,-54.84
6291,-54.86
6292,-54.89
6293,-54.92
6294,-54.94
6295,-54.96
6296,-54.99
6297,-55.02
6298,-55.04
6299,-55.05
6300,-55.06
6301,-55.08
6302,-55.09
6303,-55.11
6304,-55.12
6305,-55.14
6306,-55.16
6307,-55.17
6308,-55.18
6309,-55.18
6310,-55.19
6311,-55.19
6312,-55.18
6313,-55.18
6314,-55.16
6315,-55.15
6316,-55.15
6317,-55.13
6318,-55.12
6319,-55.11
6320,-55.11
6321,-55.09
6322,-55.09
6323,-55.09
6324,-55.09
6325,-55.10
6326,-55.12
6327,-55.14
6328,-55.16
6329,-55.18
6330,-55.20
6331,-55.23
6332,-55.27
6333,-55.31
6334,-55.35
6335,-55.39
6336,-55.43
6337,-55.48
6338,-55.53
6339,-55.58
6340,-55.63
6341,-55.69
6342,-55.75
6343,-55.80
6344,-55.85
6345,-55.88
6346,-55.92
6347,-55.96
6348,-56.01
6349,-56.04
6350,-56.08
6351,-56.12
6352,-56.17
6353,-56.23
6354,-56.29
6355,-56.35
6356,-56.41
6357,-56.48
6358,-56.56
6359,-56.64
6360,-56.71
6361,-56.77
6362,-56.82
6363,-56.86
6364,-56.89
6365,-56.90
6366,-56.90
6367,-56.88
6368,-56.87
6369,-56.85
6370,-56.83
6371,-56.81
6372,-56.78
6373,-56.76
6374,-56.75
6375,-56.75
6376,-56.76
6377,-56.78
6378,-56.81
6379,-56.85
6380,-56.90
6381,-56.95
6382,-57.00
6383,-57.05
6384,-57.10
6385,-57.15
6386,-57.20
6387,-57.24
6388,-57.27
6389,-57.30
6390,-57.32
6391,-57.34
6392,-57.36
6393,-57.37
6394,-57.37
6395,-57.36
6396,-57.34
6397,-57.32
6398,-57.31
6399,-57.28
6400,-57.25
6401,-57.21
6402,-57.17
6403,-57.14
6404,-57.13
6405,-57.11
6406,-57.08
6407,-57.05
6408,-57.02
6409,-57.00
6410,-56.99
6411,-56.97
6412,-56.94
6413,-56.91
6414,-56.88
6415,-56.85
6416,-56.82
6417,-56.78
6418,-56.73
6419,-56.68
6420,-56.63
6421,-56.58
6422,-56.54
6423,-56.51
6424,-56.48
6425,-56.45
6426,-56.42
6427,-56.41
6428,-56.40
6429,-56.40
6430,-56.40
6431,-56.40
6432,-56.40
6433,-56.40
6434,-56.39
6435,-56.38
6436,-56.34
6437,-56.30
6438,-56.25
6439,-56.18
6440,-56.10
6441,-56.02
6442,-55.94
6443,-55.87
6444,-55.78
6445,-55.70
6446,-55.63
6447,-55.57
6448,-55.52
6449,-55.48
6450,-55.45
6451,-55.44
6452,-55.42
6453,-55.41
6454,-55.40
6455,-55.38
6456,-55.36
6457,-55.35
6458,-55.34
6459,-55.32
6460,-55.30
6461,-55.28
6462,-55.26
6463,-55.24
6464,-55.22
6465,-55.22
6466,-55.24
6467,-55.26
6468,-55.28
6469,-55.30
6470,-55.32
6471,-55.35
6472,-55.38
6473,-55.40
6474,-55.41
6475,-55.41
6476,-55.40
6477,-55.38
6478,-55.36
6479,-55.34
6480,-55.31
6481,-55.27
6482,-55.23
6483,-55.20
6484,-55.17
6485,-55.14
6486,-55.12
6487,-55.11
6488,-55.11
6489,-55.12
6490,-55.14
6491,-55.15
6492,-55.18
6493,-55.21
6494,-55.25
6495,-55.29
6496,-55.33
6497,-55.38
6498,-55.44
6499,-55.49
6500,-55.56
6501,-55.62
6502,-55.68
6503,-55.73
6504,-55.80
6505,-55.85
6506,-55.91
6507,-55.96
6508,-56.01
6509,-56.04
6510,-56.09
6511,-56.12
6512,-56.16
6513,-56.19
6514,-56.21
6515,-56.23
6516,-56.25
6517,-56.27
6518,-56.29
6519,-56.31
6520,-56.33
6521,-56.34
6522,-56.35
6523,-56.36
6524,-56.36
6525,-56.36
6526,-56.36
6527,-56.36
6528,-56.36
6529,-56.36
6530,-56.35
6531,-56.33
6532,-56.31
6533,-56.29
6534,-56.27
6535,-56.24
6536,-56.20
6537,-56.17
6538,-56.15
6539,-56.13
6540,-56.11
6541,-56.10
6542,-56.11
6543,-56.13
6544,-56.15
6545,-56.18
6546,-56.23
6547,-56.27
6548,-56.32
6549,-56.36
6550,-56.40
6551,-56.44
6552,-56.48
6553,-56.51
6554,-56.53
6555,-56.53
6556,-56.54
6557,-56.55
6558,-56.57
6559,-56.59
6560,-56.61
6561,-56.64
6562,-56.68
6563,-56.73
6564,-56.78
6565,-56.85
6566,-56.91
6567,-56.96
6568,-57.02
6569,-57.07
6570,-57.12
6571,-57.17
6572,-57.21
6573,-57.24
6574,-57.27
6575,-57.30
6576,-57.32
6577,-57.35
6578,-57.36
6579,-57.37
6580,-57.38
6581,-57.38
6582,-57.37
6583,-57.36
6584,-57.35
6585,-57.34
6586,-57.32
6587,-57.31
6588,-57.28
6589,-57.26
6590,-57.24
6591,-57.22
6592,-57.21
6593,-57.20
6594,-57.19
6595,-57.19
6596,-57.19
6597,-57.19
6598,-57.20
6599,-57.22
6600,-57.24
6601,-57.25
6602,-57.26
6603,-57.28
6604,-57.30
6605,-57.31
6606,-57.31
6607,-57.31
6608,-57.31
6609,-57.32
6610,-57.31
6611,-57.30
6612,-57.29
6613,-57.27
6614,-57.23
6615,-57.19
6616,-57.12
6617,-57.06
6618,-56.97
6619,-56.89
6620,-56.78
6621,-56.68
6622,-56.56
6623,-56.43
6624,-56.29
6625,-56.16
6626,-56.04
6627,-55.94
6628,-55.83
6629,-55.75
6630,-55.67
6631,-55.62
6632,-55.55
6633,-55.50
6634,-55.45
6635,-55.41
6636,-55.36
6637,-55.30
6638,-55.24
6639,-55.18
6640,-55.11
6641,-55.04
6642,-54.94
6643,-54.86
6644,-54.77
6645,-54.71
6646,-54.64
6647,-54.58
6648,-54.53
6649,-54.49
6650,-54.46
6651,-54.45
6652,-54.45
6653,-54.46
6654,-54.49
6655,-54.53
6656,-54.58
6657,-54.64
6658,-54.71
6659,-54.79
6660,-54.88
6661,-54.97
6662,-55.09
6663,-55.20
6664,-55.33
6665,-55.46
6666,-55.60
6667,-55.75
6668,-55.90
6669,-56.05
6670,-56.20
6671,-56.34
6672,-56.49
6673,-56.62
6674,-56.74
6675,-56.84
6676,-56.95
6677,-57.05
6678,-57.14
6679,-57.23
6680,-57.32
6681,-57.39
6682,-57.47
6683,-57.55
6684,-57.63
6685,-57.70
6686,-57.76
6687,-57.83
6688,-57.91
6689,-57.99
6690,-58.06
6691,-58.13
6692,-58.21
6693,-58.29
6694,-58.36
6695,-58.42
6696,-58.47
6697,-58.53
6698,-58.59
6699,-58.63
6700,-58.66
6701,-58.67
6702,-58.69
6703,-58.70
6704,-58.70
6705,-58.70
6706,-58.70
6707,-58.70
6708,-58.70
6709,-58.70
6710,-58.70
6711,-58.70
6712,-58.70
6713,-58.70
6714,-58.70
6715,-58.70
6716,-58.70
6717,-58.69
6718,-58.68
6719,-58.67
6720,-58.65
6721,-58.62
6722,-58.58
6723,-58.55
6724,-58.50
6725,-58.44
6726,-58.37
6727,-58.30
6728,-58.22
6729,-58.15
6730,-58.07
6731,-57.99
6732,-57.90
6733,-57.82
6734,-57.72
6735,-57.64
6736,-57.54
6737,-57.45
6738,-57.33
6739,-57.22
6740,-57.10
6741,-56.98
6742,-56.85
6743,-56.70
6744,-56.54
6745,-56.38
6746,-56.22
6747,-56.05
6748,-55.87
6749,-55.67
6750,-55.46
6751,-55.26
6752,-55.04
6753,-54.81
6754,-54.57
6755,-54.35
6756,-54.13
6757,-53.92
6758,-53.71
6759,-53.54
6760,-53.39
6761,-53.28
6762,-53.20
6763,-53.14
6764,-53.12
6765,-53.14
6766,-53.19
6767,-53.26
6768,-53.35
6769,-53.47
6770,-53.61
6771,-53.77
6772,-53.95
6773,-54.14
6774,-54.34
6775,-54.54
6776,-54.76
6777,-54.98
6778,-55.20
6779,-55.40
6780,-55.61
6781,-55.80
6782,-56.00
6783,-56.18
6784,-56.34
6785,-56.49
6786,-56.63
6787,-56.74
6788,-56.85
6789,-56.95
6790,-57.04
6791,-57.13
6792,-57.22
6793,-57.31
6794,-57.39
6795,-57.47
6796,-57.55
6797,-57.63
6798,-57.71
6799,-57.76
6800,-57.81
6801,-57.84
6802,-57.86
6803,-57.87
6804,-57.86
6805,-57.83
6806,-57.79
6807,-57.75
6808,-57.71
6809,-57.66
6810,-57.60
6811,-57.56
6812,-57.50
6813,-57.46
6814,-57.41
6815,-57.37
6816,-57.33
6817,-57.31
6818,-57.28
6819,-57.26
6820,-57.24
6821,-57.23
6822,-57.24
6823,-57.24
6824,-57.26
6825,-57.27
6826,-57.28
6827,-57.29
6828,-57.29
6829,-57.29
6830,-57.30
6831,-57.30
6832,-57.29
6833,-57.27
6834,-57.24
6835,-57.21
6836,-57.17
6837,-57.12
6838,-57.07
6839,-57.02
6840,-56.97
6841,-56.93
6842,-56.90
6843,-56.87
6844,-56.84
6845,-56.82
6846,-56.82
6847,-56.83
6848,-56.84
6849,-56.85
6850,-56.86
6851,-56.88
6852,-56.91
6853,-56.93
6854,-56.95
6855,-56.96
6856,-56.99
6857,-57.01
6858,-57.02
6859,-57.03
6860,-57.04
6861,-57.05
6862,-57.06
6863,-57.04
6864,-57.03
6865,-57.00
6866,-56.99
6867,-56.95
6868,-56.91
6869,-56.86
6870,-56.81
6871,-56.77
6872,-56.73
6873,-56.70
6874,-56.67
6875,-56.64
6876,-56.63
6877,-56.62
6878,-56.63
6879,-56.66
6880,-56.69
6881,-56.72
6882,-56.75
6883,-56.79
6884,-56.84
6885,-56.88
6886,-56.91
6887,-56.92
6888,-56.92
6889,-56.92
6890,-56.92
6891,-56.91
6892,-56.88
6893,-56.85
6894,-56.82
6895,-56.80
6896,-56.78
6897,-56.77
6898,-56.75
6899,-56.74
6900,-56.74
6901,-56.74
6902,-56.74
6903,-56.75
6904,-56.75
6905,-56.74
6906,-56.73
6907,-56.72
6908,-56.71
6909,-56.68
6910,-56.64
6911,-56.59
6912,-56.53
6913,-56.48
6914,-56.44
6915,-56.40
6916,-56.36
6917,-56.32
6918,-56.29
6919,-56.28
6920,-56.28
6921,-56.29
6922,-56.31
6923,-56.34
6924,-56.38
6925,-56.42
6926,-56.46
6927,-56.50
6928,-56.53
6929,-56.56
6930,-56.59
6931,-56.61
6932,-56.62
6933,-56.63
6934,-56.64
6935,-56.65
6936,-56.66
6937,-56.67
6938,-56.69
6939,-56.72
6940,-56.76
6941,-56.80
6942,-56.84
6943,-56.88
6944,-56.92
6945,-56.97
6946,-57.02
6947,-57.06
6948,-57.09
6949,-57.12
6950,-57.15
6951,-57.18
6952,-57.21
6953,-57.24
6954,-57.27
6955,-57.31
6956,-57.36
6957,-57.39
6958,-57.42
6959,-57.46
6960,-57.49
6961,-57.53
6962,-57.56
6963,-57.58
6964,-57.60
6965,-57.62
6966,-57.64
6967,-57.66
6968,-57.68
6969,-57.70
6970,-57.72
6971,-57.75
6972,-57.79
6973,-57.81
6974,-57.85
6975,-57.89
6976,-57.93
6977,-57.96
6978,-57.97
6979,-57.98
6980,-58.00
6981,-58.00
6982,-58.00
6983,-57.98
6984,-57.96
6985,-57.94
6986,-57.91
6987,-57.89
6988,-57.85
6989,-57.82
6990,-57.80
6991,-57.78
6992,-57.76
6993,-57.76
6994,-57.78
6995,-57.79
6996,-57.82
6997,-57.85
6998,-57.89
6999,-57.93
7000,-57.97
7001,-58.00
7002,-58.05
7003,-58.08
7004,-58.12
7005,-58.15
7006,-58.18
7007,-58.20
7008,-58.21
7009,-58.22
7010,-58.22
7011,-58.22
7012,-58.22
7013,-58.22
7014,-58.22
7015,-58.22
7016,-58.22
7017,-58.22
7018,-58.22
7019,-58.22
7020,-58.23
7021,-58.24
7022,-58.26
7023,-58.27
7024,-58.29
7025,-58.31
7026,-58.34
7027,-58.36
7028,-58.40
7029,-58.43
7030,-58.46
7031,-58.50
7032,-58.55
7033,-58.60
7034,-58.64
7035,-58.68
7036,-58.73
7037,-58.78
7038,-58.82
7039,-58.85
7040,-58.87
7041,-58.91
7042,-58.93
7043,-58.95
7044,-58.97
7045,-58.97
7046,-58.98
7047,-59.00
7048,-59.00
7049,-59.00
7050,-59.00
7051,-59.00
7052,-59.00
7053,-59.00
7054,-58.99
7055,-58.98
7056,-58.98
7057,-58.98
7058,-58.98
7059,-58.98
7060,-58.97
7061,-58.95
7062,-58.93
7063,-58.92
7064,-58.91
7065,-58.89
7066,-58.87
7067,-58.83
7068,-58.80
7069,-58.78
7070,-58.78
7071,-58.78
7072,-58.78
7073,-58.79
7074,-58.81
7075,-58.84
7076,-58.88
7077,-58.94
7078,-59.01
7079,-59.07
7080,-59.13
7081,-59.19
7082,-59.24
7083,-59.29
7084,-59.34
7085,-59.38
7086,-59.41
7087,-59.43
7088,-59.44
7089,-59.45
7090,-59.46
7091,-59.47
7092,-59.48
7093,-59.49
7094,-59.50
7095,-59.51
7096,-59.52
7097,-59.54
7098,-59.57
7099,-59.60
7100,-59.63
7101,-59.66
7102,-59.68
7103,-59.70
7104,-59.73
7105,-59.74
7106,-59.76
7107,-59.77
7108,-59.78
7109,-59.79
7110,-59.79
7111,-59.78
7112,-59.76
7113,-59.74
7114,-59.72
7115,-59.69
7116,-59.66
7117,-59.63
7118,-59.60
7119,-59.57
7120,-59.54
7121,-59.53
7122,-59.54
7123,-59.55
7124,-59.56
7125,-59.57
7126,-59.58
7127,-59.60
7128,-59.63
7129,-59.67
7130,-59.71
7131,-59.75
7132,-59.80
7133,-59.84
7134,-59.89
7135,-59.95
7136,-60.00
7137,-60.06
7138,-60.11
7139,-60.15
7140,-60.19
7141,-60.22
7142,-60.24
7143,-60.25
7144,-60.24
7145,-60.22
7146,-60.19
7147,-60.15
7148,-60.11
7149,-60.07
7150,-60.03
7151,-59.99
7152,-59.96
7153,-59.95
7154,-59.95
7155,-59.96
7156,-59.99
7157,-60.03
7158,-60.07
7159,-60.11
7160,-60.15
7161,-60.19
7162,-60.22
7163,-60.24
7164,-60.26
7165,-60.28
7166,-60.29
7167,-60.29
7168,-60.28
7169,-60.27
7170,-60.27
7171,-60.27
7172,-60.27
7173,-60.28
7174,-60.30
7175,-60.31
7176,-60.34
7177,-60.37
7178,-60.41
7179,-60.45
7180,-60.49
7181,-60.51
7182,-60.54
7183,-60.56
7184,-60.57
7185,-60.60
7186,-60.61
7187,-60.62
7188,-60.63
7189,-60.86
7190,-60.79
7191,-60.48
7192,-60.15
7193,-61.51
7194,-62.27
7195,-59.99
7196,-56.73
7197,-60.51
7198,-68.85
7199,-64.90
7200,-40.17
