1,-4.33
2,-6.59
3,-6.89
4,-5.62
5,-3.85
6,-2.71
7,-3.06
8,-5.28
9,-8.31
10,-10.22
11,-9.76
12,-8.11
13,-7.46
14,-9.01
15,-11.37
16,-12.14
17,-10.12
18,-6.81
19,-4.99
20,-6.37
21,-10.00
22,-13.30
23,-14.19
24,-12.99
25,-11.92
26,-12.86
27,-15.43
28,-17.56
29,-17.51
30,-15.59
31,-13.49
32,-12.84
33,-13.81
34,-15.20
35,-15.37
36,-13.86
37,-12.03
38,-12.06
39,-14.83
40,-18.89
41,-21.54
42,-21.25
43,-19.02
44,-16.74
45,-15.36
46,-14.19
47,-12.66
48,-11.32
49,-11.32
50,-12.52
51,-13.29
52,-12.05
53,-9.00
54,-5.82
55,-4.21
56,-4.20
57,-4.80
58,-4.95
59,-4.63
60,-4.31
61,-4.57
62,-5.44
63,-6.56
64,-7.22
65,-6.93
66,-5.82
67,-4.80
68,-4.44
69,-4.19
70,-3.11
71,-1.28
72,-0.14
73,-0.89
74,-2.89
75,-4.08
76,-3.21
77,-1.19
78,-0.24
79,-1.52
80,-3.89
81,-5.05
82,-3.82
83,-1.07
84,1.22
85,1.73
86,0.46
87,-1.62
88,-3.60
89,-4.94
90,-5.54
91,-5.45
92,-4.99
93,-4.45
94,-4.19
95,-4.44
96,-5.16
97,-5.87
98,-5.97
99,-5.19
100,-4.32
101,-4.65
102,-6.72
103,-9.41
104,-10.71
105,-9.58
106,-7.12
107,-5.60
108,-6.33
109,-8.47
110,-10.05
111,-9.73
112,-8.03
113,-6.52
114,-6.26
115,-6.94
116,-7.43
117,-7.10
118,-6.34
119,-6.31
120,-7.72
121,-10.16
122,-12.04
123,-11.69
124,-8.77
125,-4.83
126,-2.30
127,-2.46
128,-4.43
129,-6.01
130,-5.70
131,-3.94
132,-2.50
133,-2.72
134,-4.37
135,-6.05
136,-6.70
137,-6.55
138,-6.60
139,-7.34
140,-8.41
141,-9.05
142,-9.15
143,-9.18
144,-9.64
145,-10.47
146,-11.23
147,-11.42
148,-11.08
149,-10.65
150,-10.69
151,-11.21
152,-11.57
153,-10.83
154,-8.99
155,-7.20
156,-7.17
157,-9.36
158,-12.29
159,-13.66
160,-12.65
161,-10.85
162,-10.76
163,-13.23
164,-16.82
165,-19.28
166,-19.65
167,-18.48
168,-16.93
169,-15.67
170,-15.09
171,-15.32
172,-16.17
173,-16.93
174,-17.12
175,-17.18
176,-18.29
177,-20.69
178,-22.92
179,-22.87
180,-20.03
181,-16.33
182,-14.28
183,-14.75
184,-16.36
185,-17.33
186,-17.17
187,-16.75
188,-17.02
189,-18.09
190,-18.98
191,-18.54
192,-16.28
193,-13.18
194,-10.85
195,-10.46
196,-11.60
197,-12.80
198,-12.62
199,-10.98
200,-8.95
201,-7.98
202,-8.35
203,-9.23
204,-9.52
205,-9.17
206,-8.65
207,-8.25
208,-7.59
209,-6.57
210,-5.70
211,-5.79
212,-6.84
213,-8.10
214,-8.62
215,-8.07
216,-6.58
217,-4.52
218,-2.38
219,-1.06
220,-1.19
221,-2.49
222,-3.60
223,-3.41
224,-2.01
225,-0.76
226,-0.72
227,-1.82
228,-2.79
229,-2.64
230,-1.42
231,-0.17
232,0.67
233,1.56
234,3.11
235,4.70
236,5.25
237,4.42
238,3.42
239,3.54
240,5.15
241,7.37
242,9.19
243,9.93
244,10.04
245,10.51
246,12.23
247,14.63
248,16.26
249,15.95
250,14.37
251,13.40
252,14.49
253,17.09
254,19.46
255,20.14
256,19.40
257,18.44
258,18.04
259,17.82
260,17.11
261,15.89
262,14.70
263,13.94
264,13.78
265,14.57
266,16.73
267,19.89
268,22.38
269,22.36
270,19.53
271,15.59
272,12.87
273,12.47
274,13.54
275,14.51
276,14.41
277,13.44
278,12.56
279,12.62
280,13.73
281,15.17
282,15.92
283,15.54
284,14.43
285,13.59
286,13.86
287,15.44
288,17.37
289,18.17
290,17.14
291,15.26
292,14.49
293,15.65
294,17.13
295,16.33
296,12.40
297,7.59
298,5.09
299,6.13
300,9.12
301,11.72
302,13.00
303,13.50
304,13.70
305,13.34
306,12.44
307,11.87
308,12.35
309,13.17
310,12.84
311,11.03
312,9.61
313,10.61
314,14.11
315,17.78
316,19.43
317,18.82
318,17.76
319,17.92
320,19.36
321,20.67
322,20.78
323,19.84
324,18.99
325,19.12
326,20.32
327,21.82
328,22.75
329,22.54
330,21.32
331,19.75
332,18.59
333,18.11
334,17.93
335,17.61
336,17.23
337,17.33
338,18.07
339,18.75
340,18.54
341,17.51
342,16.61
343,16.56
344,17.13
345,17.61
346,17.88
347,18.41
348,19.59
349,20.97
350,21.64
351,21.07
352,19.78
353,18.89
354,19.31
355,21.06
356,23.27
357,24.71
358,24.46
359,22.55
360,20.34
361,19.58
362,20.61
363,21.81
364,21.21
365,19.05
366,17.46
367,18.18
368,20.47
369,22.23
370,22.24
371,21.19
372,20.07
373,18.95
374,17.20
375,15.01
376,13.29
377,12.68
378,12.56
379,12.17
380,11.61
381,11.83
382,13.00
383,14.19
384,14.12
385,12.79
386,11.29
387,10.86
388,11.36
389,11.86
390,11.31
391,9.64
392,7.43
393,5.74
394,5.47
395,6.94
396,8.87
397,9.07
398,6.02
399,1.02
400,-2.56
401,-1.97
402,1.69
403,4.55
404,3.67
405,0.16
406,-2.62
407,-2.90
408,-2.15
409,-2.72
410,-4.69
411,-5.92
412,-4.86
413,-2.36
414,-0.44
415,-0.04
416,-0.12
417,0.70
418,2.39
419,3.78
420,4.34
421,4.82
422,6.14
423,7.85
424,8.54
425,7.40
426,5.19
427,3.26
428,2.40
429,2.40
430,2.87
431,3.55
432,4.18
433,4.35
434,3.78
435,2.79
436,2.03
437,2.01
438,2.72
439,3.92
440,5.06
441,5.53
442,4.90
443,3.61
444,2.56
445,2.30
446,2.34
447,1.90
448,0.91
449,0.16
450,0.15
451,0.30
452,-0.46
453,-2.19
454,-4.08
455,-5.25
456,-5.66
457,-5.37
458,-4.09
459,-1.65
460,0.79
461,1.26
462,-1.06
463,-4.55
464,-6.66
465,-6.41
466,-5.28
467,-5.09
468,-5.99
469,-6.56
470,-6.04
471,-5.18
472,-5.24
473,-6.31
474,-7.60
475,-8.46
476,-9.12
477,-9.74
478,-9.88
479,-9.20
480,-8.25
481,-8.22
482,-9.58
483,-11.59
484,-12.70
485,-11.88
486,-9.11
487,-5.39
488,-1.99
489,-0.02
490,0.32
491,-0.24
492,-0.20
493,1.26
494,3.72
495,5.55
496,5.42
497,3.29
498,0.74
499,-0.35
500,0.83
501,3.20
502,4.71
503,4.07
504,1.73
505,-0.44
506,-0.86
507,0.49
508,2.10
509,2.44
510,1.24
511,-0.34
512,-1.33
513,-1.77
514,-2.49
515,-3.64
516,-4.64
517,-4.75
518,-4.15
519,-3.43
520,-3.29
521,-4.10
522,-5.82
523,-7.68
524,-8.63
525,-8.23
526,-7.61
527,-8.73
528,-12.03
529,-15.40
530,-15.80
531,-12.57
532,-8.21
533,-5.79
534,-5.61
535,-5.10
536,-2.10
537,2.45
538,5.76
539,6.16
540,4.78
541,3.55
542,2.92
543,1.67
544,-0.78
545,-3.36
546,-4.27
547,-3.14
548,-1.04
549,0.67
550,1.74
551,2.47
552,2.49
553,1.23
554,-1.02
555,-2.35
556,-1.36
557,1.31
558,3.25
559,2.86
560,0.82
561,-1.17
562,-2.55
563,-4.31
564,-7.38
565,-10.99
566,-13.10
567,-12.15
568,-8.79
569,-5.35
570,-3.68
571,-3.80
572,-4.48
573,-4.96
574,-5.52
575,-6.46
576,-7.21
577,-6.77
578,-4.90
579,-2.62
580,-1.20
581,-1.17
582,-1.56
583,-1.15
584,0.11
585,0.56
586,-1.24
587,-4.70
588,-7.25
589,-6.76
590,-3.57
591,-0.13
592,1.57
593,1.55
594,1.39
595,2.14
596,3.18
597,3.05
598,1.40
599,-0.34
600,-0.55
601,0.76
602,2.13
603,2.31
604,1.57
605,0.99
606,1.02
607,1.29
608,1.32
609,1.26
610,1.19
611,0.71
612,-0.68
613,-2.58
614,-3.99
615,-4.50
616,-4.87
617,-5.89
618,-7.34
619,-8.10
620,-7.77
621,-7.03
622,-6.91
623,-7.29
624,-7.28
625,-6.26
626,-5.13
627,-5.17
628,-6.72
629,-8.50
630,-9.22
631,-8.92
632,-8.67
633,-9.20
634,-10.18
635,-11.13
636,-12.30
637,-14.20
638,-16.38
639,-17.32
640,-15.93
641,-12.78
642,-9.68
643,-7.92
644,-7.34
645,-7.04
646,-6.61
647,-6.32
648,-6.45
649,-6.78
650,-6.94
651,-6.85
652,-6.71
653,-6.61
654,-6.51
655,-6.65
656,-7.30
657,-8.36
658,-9.34
659,-9.95
660,-10.55
661,-11.59
662,-12.93
663,-13.76
664,-13.22
665,-11.20
666,-8.51
667,-6.63
668,-7.05
669,-10.10
670,-13.83
671,-14.85
672,-11.37
673,-5.59
674,-1.85
675,-2.44
676,-5.33
677,-6.89
678,-5.84
679,-4.25
680,-4.52
681,-6.43
682,-7.57
683,-6.15
684,-3.29
685,-1.75
686,-3.04
687,-5.92
688,-8.07
689,-8.35
690,-7.57
691,-7.15
692,-7.96
693,-9.89
694,-12.20
695,-13.73
696,-13.72
697,-12.67
698,-12.00
699,-12.59
700,-14.07
701,-15.18
702,-15.19
703,-14.21
704,-12.81
705,-11.33
706,-10.04
707,-9.30
708,-9.60
709,-10.93
710,-12.72
711,-14.17
712,-14.76
713,-14.44
714,-13.51
715,-12.52
716,-11.96
717,-12.11
718,-12.88
719,-14.03
720,-15.25
721,-16.11
722,-16.19
723,-15.26
724,-13.60
725,-11.98
726,-11.02
727,-10.89
728,-11.05
729,-10.99
730,-10.72
731,-10.77
732,-11.28
733,-11.61
734,-10.69
735,-8.40
736,-5.73
737,-4.20
738,-4.31
739,-5.35
740,-6.03
741,-5.73
742,-4.78
743,-3.96
744,-3.74
745,-4.05
746,-4.42
747,-4.56
748,-4.52
749,-4.71
750,-5.58
751,-7.15
752,-9.06
753,-10.69
754,-11.24
755,-10.22
756,-8.18
757,-6.76
758,-7.24
759,-9.02
760,-10.04
761,-8.83
762,-6.34
763,-4.82
764,-5.22
765,-6.05
766,-5.21
767,-2.73
768,-1.19
769,-3.00
770,-7.41
771,-10.95
772,-11.18
773,-9.11
774,-7.42
775,-7.09
776,-6.99
777,-6.35
778,-6.29
779,-7.95
780,-10.28
781,-10.84
782,-8.84
783,-6.21
784,-5.41
785,-6.74
786,-8.20
787,-8.10
788,-6.86
789,-6.09
790,-6.17
791,-5.99
792,-4.63
793,-2.93
794,-2.55
795,-4.05
796,-6.01
797,-6.68
798,-5.87
799,-4.93
800,-4.85
801,-5.03
802,-4.35
803,-2.85
804,-1.85
805,-2.45
806,-4.04
807,-5.14
808,-5.38
809,-5.89
810,-7.80
811,-10.40
812,-11.70
813,-10.45
814,-7.46
815,-4.64
816,-2.98
817,-2.05
818,-1.37
819,-1.39
820,-3.12
821,-6.42
822,-9.52
823,-10.27
824,-8.23
825,-5.16
826,-3.47
827,-4.29
828,-6.74
829,-9.08
830,-10.33
831,-10.64
832,-10.44
833,-9.66
834,-8.27
835,-7.04
836,-7.09
837,-8.64
838,-10.31
839,-10.41
840,-8.76
841,-6.85
842,-6.01
843,-5.92
844,-5.00
845,-2.51
846,0.32
847,1.30
848,-0.36
849,-3.22
850,-4.98
851,-4.67
852,-3.34
853,-2.88
854,-3.87
855,-5.19
856,-5.34
857,-4.13
858,-2.87
859,-2.97
860,-4.37
861,-5.53
862,-5.11
863,-3.34
864,-1.99
865,-2.61
866,-4.80
867,-6.44
868,-5.61
869,-2.61
870,0.42
871,1.34
872,-0.40
873,-3.73
874,-6.99
875,-8.72
876,-8.27
877,-6.03
878,-3.34
879,-1.62
880,-1.64
881,-3.11
882,-4.95
883,-6.06
884,-6.21
885,-5.93
886,-5.77
887,-5.53
888,-4.85
889,-4.06
890,-4.03
891,-5.03
892,-6.21
893,-6.47
894,-5.88
895,-5.47
896,-5.93
897,-6.65
898,-6.73
899,-6.28
900,-6.43
901,-7.74
902,-9.56
903,-10.73
904,-10.97
905,-10.73
906,-10.19
907,-9.03
908,-7.43
909,-6.68
910,-8.08
911,-11.11
912,-13.40
913,-12.96
914,-10.39
915,-8.25
916,-8.14
917,-9.08
918,-8.85
919,-6.77
920,-4.50
921,-4.09
922,-5.47
923,-6.65
924,-6.12
925,-4.54
926,-3.77
927,-4.72
928,-6.25
929,-6.62
930,-5.40
931,-3.86
932,-3.37
933,-4.16
934,-5.45
935,-6.56
936,-7.46
937,-8.25
938,-8.73
939,-8.55
940,-7.87
941,-7.14
942,-6.55
943,-5.79
944,-4.95
945,-4.86
946,-6.49
947,-9.50
948,-12.33
949,-13.48
950,-12.95
951,-11.88
952,-11.35
953,-11.43
954,-11.62
955,-11.55
956,-11.23
957,-10.70
958,-10.00
959,-9.22
960,-8.88
961,-9.40
962,-10.65
963,-11.88
964,-12.36
965,-12.02
966,-11.56
967,-11.78
968,-12.99
969,-14.68
970,-15.92
971,-15.88
972,-14.81
973,-13.80
974,-13.95
975,-15.04
976,-15.95
977,-15.85
978,-15.30
979,-15.47
980,-16.79
981,-18.39
982,-19.37
983,-19.84
984,-20.41
985,-20.91
986,-20.42
987,-18.68
988,-16.95
989,-16.79
990,-18.15
991,-19.28
992,-18.84
993,-17.43
994,-16.65
995,-16.99
996,-17.11
997,-15.85
998,-13.83
999,-12.96
1000,-13.97
1001,-15.56
1002,-15.68
1003,-13.82
1004,-11.33
1005,-10.00
1006,-10.07
1007,-10.54
1008,-10.63
1009,-10.84
1010,-11.85
1011,-13.38
1012,-14.02
1013,-12.86
1014,-10.41
1015,-8.19
1016,-7.02
1017,-6.73
1018,-6.82
1019,-7.23
1020,-7.90
1021,-8.11
1022,-6.90
1023,-4.48
1024,-2.43
1025,-2.34
1026,-3.83
1027,-5.08
1028,-4.84
1029,-4.05
1030,-4.49
1031,-6.60
1032,-8.75
1033,-9.14
1034,-7.85
1035,-6.54
1036,-6.48
1037,-7.19
1038,-7.28
1039,-6.00
1040,-3.96
1041,-2.34
1042,-1.89
1043,-2.75
1044,-4.74
1045,-7.41
1046,-9.84
1047,-11.04
1048,-10.47
1049,-8.49
1050,-5.88
1051,-3.41
1052,-1.72
1053,-1.39
1054,-2.31
1055,-3.38
1056,-3.23
1057,-1.67
1058,-0.09
1059,-0.07
1060,-1.64
1061,-3.26
1062,-3.50
1063,-2.44
1064,-1.38
1065,-1.24
1066,-1.73
1067,-1.92
1068,-1.73
1069,-2.01
1070,-3.75
1071,-6.73
1072,-9.88
1073,-11.99
1074,-12.50
1075,-11.45
1076,-9.57
1077,-8.24
1078,-8.94
1079,-11.96
1080,-16.01
1081,-18.95
1082,-19.53
1083,-17.80
1084,-14.80
1085,-11.43
1086,-8.56
1087,-7.03
1088,-7.25
1089,-8.58
1090,-9.75
1091,-10.21
1092,-10.94
1093,-13.13
1094,-16.18
1095,-17.69
1096,-15.92
1097,-12.26
1098,-10.16
1099,-11.76
1100,-15.47
1101,-17.53
1102,-15.99
1103,-12.42
1104,-9.96
1105,-9.91
1106,-10.91
1107,-11.03
1108,-9.88
1109,-8.69
1110,-8.36
1111,-8.85
1112,-9.60
1113,-10.62
1114,-12.05
1115,-13.58
1116,-13.87
1117,-11.96
1118,-8.33
1119,-4.97
1120,-3.35
1121,-3.28
1122,-3.06
1123,-1.60
1124,0.80
1125,2.80
1126,3.59
1127,3.19
1128,2.44
1129,1.96
1130,2.06
1131,2.20
1132,2.01
1133,1.46
1134,1.30
1135,2.02
1136,3.45
1137,4.57
1138,4.74
1139,4.19
1140,4.00
1141,4.76
1142,6.19
1143,7.39
1144,8.09
1145,8.76
1146,10.22
1147,12.51
1148,14.80
1149,15.82
1150,15.06
1151,13.04
1152,11.18
1153,10.60
1154,11.52
1155,12.95
1156,13.76
1157,13.59
1158,13.26
1159,13.78
1160,15.20
1161,16.36
1162,16.12
1163,14.61
1164,13.10
1165,12.63
1166,12.92
1167,12.93
1168,12.23
1169,11.66
1170,12.25
1171,14.02
1172,15.54
1173,15.44
1174,13.99
1175,13.00
1176,13.40
1177,13.93
1178,12.33
1179,8.33
1180,4.28
1181,2.91
1182,4.47
1183,6.78
1184,7.80
1185,7.58
1186,7.30
1187,7.37
1188,6.72
1189,4.69
1190,2.39
1191,2.10
1192,4.52
1193,7.74
1194,9.52
1195,9.07
1196,7.88
1197,7.46
1198,8.47
1199,10.37
1200,9.90
