1,-187.15
2,-250.00
3,-250.00
4,-248.66
5,-237.72
6,-246.80
7,-250.00
8,-250.00
9,-242.29
10,-203.81
11,-138.40
12,-68.29
13,-16.29
14,8.34
15,8.88
16,-13.61
17,-61.32
18,-125.89
19,-190.04
20,-232.76
21,-249.58
22,-249.45
23,-249.72
24,-250.00
25,-247.36
26,-221.10
27,-174.32
28,-118.41
29,-64.35
30,-15.25
31,28.24
32,63.68
33,85.69
34,94.19
35,90.39
36,79.93
37,65.81
38,53.60
39,44.62
40,41.11
41,40.89
42,43.08
43,44.92
44,45.50
45,44.22
46,41.53
47,38.56
48,35.90
49,34.36
50,33.61
51,33.55
52,33.52
53,33.26
54,32.54
55,31.55
56,30.44
57,29.53
58,28.79
59,28.36
60,28.06
61,27.88
62,27.66
63,27.40
64,27.11
65,26.93
66,26.86
67,26.94
68,27.08
69,27.28
70,27.46
71,27.59
72,27.59
73,27.46
74,27.15
75,26.78
76,26.30
77,25.77
78,25.15
79,24.51
80,23.81
81,23.14
82,22.42
83,21.76
84,21.09
85,20.48
86,19.84
87,19.23
88,18.60
89,18.00
90,17.31
91,16.62
92,15.86
93,15.16
94,14.46
95,13.85
96,13.28
97,12.79
98,12.27
99,11.73
100,11.08
101,10.38
102,9.56
103,8.71
104,7.81
105,7.03
106,6.29
107,5.73
108,5.23
109,4.83
110,4.44
111,4.11
112,3.72
113,3.32
114,2.82
115,2.30
116,1.72
117,1.14
118,0.48
119,-0.20
120,-0.89
121,-1.52
122,-2.06
123,-2.45
124,-2.63
125,-2.54
126,-2.18
127,-1.60
128,-0.89
129,-0.11
130,0.66
131,1.33
132,1.82
133,2.11
134,2.24
135,2.27
136,2.24
137,2.17
138,2.11
139,2.08
140,2.08
141,2.13
142,2.27
143,2.46
144,2.75
145,3.07
146,3.44
147,3.77
148,4.03
149,4.17
150,4.23
151,4.24
152,4.30
153,4.46
154,4.84
155,5.36
156,6.05
157,6.73
158,7.37
159,7.87
160,8.26
161,8.51
162,8.71
163,8.96
164,9.42
165,10.12
166,11.07
167,12.12
168,13.21
169,14.14
170,14.81
171,15.10
172,15.05
173,14.75
174,14.40
175,14.08
176,13.89
177,13.82
178,13.92
179,14.12
180,14.40
181,14.71
182,15.05
183,15.42
184,15.87
185,16.42
186,17.03
187,17.65
188,18.13
189,18.38
190,18.34
191,18.04
192,17.49
193,16.81
194,16.06
195,15.37
196,14.75
197,14.24
198,13.74
199,13.21
200,12.54
201,11.75
202,10.83
203,9.88
204,8.88
205,7.97
206,7.15
207,6.57
208,6.16
209,5.91
210,5.72
211,5.62
212,5.55
213,5.53
214,5.49
215,5.44
216,5.39
217,5.39
218,5.41
219,5.45
220,5.49
221,5.58
222,5.71
223,5.89
224,6.12
225,6.36
226,6.58
227,6.76
228,6.89
229,6.94
230,6.93
231,6.83
232,6.72
233,6.65
234,6.68
235,6.82
236,7.10
237,7.45
238,7.89
239,8.34
240,8.77
241,9.12
242,9.43
243,9.69
244,9.93
245,10.18
246,10.41
247,10.59
248,10.69
249,10.67
250,10.48
251,10.13
252,9.58
253,8.90
254,8.09
255,7.32
256,6.61
257,6.05
258,5.59
259,5.22
260,4.87
261,4.55
262,4.22
263,3.92
264,3.68
265,3.55
266,3.57
267,3.75
268,4.08
269,4.47
270,4.88
271,5.23
272,5.55
273,5.81
274,6.05
275,6.28
276,6.58
277,6.99
278,7.55
279,8.22
280,8.92
281,9.52
282,9.96
283,10.16
284,10.14
285,9.90
286,9.48
287,8.91
288,8.21
289,7.44
290,6.62
291,5.82
292,5.02
293,4.32
294,3.68
295,3.17
296,2.64
297,2.16
298,1.64
299,1.13
300,0.48
301,-0.25
302,-1.08
303,-1.85
304,-2.55
305,-3.17
306,-3.77
307,-4.30
308,-4.75
309,-5.17
310,-5.62
311,-6.07
312,-6.42
313,-6.55
314,-6.42
315,-6.07
316,-5.58
317,-5.01
318,-4.42
319,-3.89
320,-3.42
321,-3.04
322,-2.70
323,-2.43
324,-2.13
325,-1.82
326,-1.39
327,-0.93
328,-0.40
329,0.08
330,0.62
331,1.16
332,1.79
333,2.44
334,3.16
335,3.86
336,4.59
337,5.29
338,6.03
339,6.72
340,7.38
341,7.89
342,8.26
343,8.42
344,8.41
345,8.23
346,8.06
347,7.95
348,8.00
349,8.20
350,8.59
351,9.09
352,9.68
353,10.22
354,10.69
355,11.03
356,11.31
357,11.60
358,11.99
359,12.50
360,13.10
361,13.68
362,14.13
363,14.31
364,14.14
365,13.57
366,12.65
367,11.52
368,10.38
369,9.37
370,8.63
371,8.25
372,8.23
373,8.51
374,8.96
375,9.46
376,9.91
377,10.25
378,10.38
379,10.36
380,10.22
381,10.03
382,9.83
383,9.68
384,9.65
385,9.70
386,9.77
387,9.78
388,9.71
389,9.52
390,9.23
391,8.90
392,8.63
393,8.54
394,8.63
395,8.92
396,9.33
397,9.80
398,10.15
399,10.26
400,10.03
401,9.52
402,8.77
403,7.93
404,7.07
405,6.28
406,5.52
407,4.84
408,4.20
409,3.59
410,2.92
411,2.23
412,1.44
413,0.74
414,0.12
415,-0.31
416,-0.66
417,-0.95
418,-1.34
419,-1.79
420,-2.43
421,-3.20
422,-4.10
423,-5.00
424,-5.83
425,-6.52
426,-7.06
427,-7.41
428,-7.56
429,-7.56
430,-7.47
431,-7.32
432,-7.06
433,-6.66
434,-6.07
435,-5.36
436,-4.53
437,-3.68
438,-2.78
439,-1.96
440,-1.17
441,-0.51
442,0.12
443,0.70
444,1.33
445,1.94
446,2.58
447,3.17
448,3.73
449,4.19
450,4.58
451,4.84
452,5.00
453,5.03
454,4.93
455,4.71
456,4.45
457,4.23
458,4.13
459,4.11
460,4.18
461,4.31
462,4.49
463,4.68
464,4.76
465,4.75
466,4.65
467,4.55
468,4.49
469,4.50
470,4.58
471,4.75
472,4.90
473,4.97
474,4.83
475,4.43
476,3.72
477,2.76
478,1.59
479,0.36
480,-0.82
481,-1.85
482,-2.66
483,-3.19
484,-3.46
485,-3.47
486,-3.33
487,-3.08
488,-2.78
489,-2.39
490,-1.90
491,-1.33
492,-0.72
493,-0.09
494,0.54
495,1.14
496,1.66
497,2.02
498,2.21
499,2.20
500,2.05
501,1.84
502,1.63
503,1.51
504,1.48
505,1.55
506,1.66
507,1.77
508,1.77
509,1.59
510,1.19
511,0.65
512,0.05
513,-0.46
514,-0.82
515,-0.97
516,-0.92
517,-0.73
518,-0.47
519,-0.29
520,-0.27
521,-0.46
522,-0.78
523,-1.12
524,-1.35
525,-1.37
526,-1.08
527,-0.47
528,0.40
529,1.37
530,2.23
531,2.80
532,3.06
533,2.98
534,2.64
535,2.05
536,1.37
537,0.72
538,0.30
539,0.10
540,0.14
541,0.34
542,0.78
543,1.37
544,2.05
545,2.72
546,3.33
547,3.86
548,4.30
549,4.65
550,4.99
551,5.33
552,5.74
553,6.16
554,6.58
555,6.93
556,7.20
557,7.31
558,7.26
559,7.05
560,6.74
561,6.36
562,6.00
563,5.77
564,5.71
565,5.83
566,6.05
567,6.34
568,6.64
569,6.86
570,6.85
571,6.60
572,6.12
573,5.54
574,4.89
575,4.24
576,3.62
577,3.12
578,2.72
579,2.37
580,1.99
581,1.58
582,1.15
583,0.80
584,0.50
585,0.27
586,0.08
587,-0.02
588,-0.11
589,-0.18
590,-0.34
591,-0.56
592,-0.89
593,-1.25
594,-1.64
595,-1.96
596,-2.19
597,-2.33
598,-2.47
599,-2.62
600,-2.75
601,-2.84
602,-2.90
603,-2.93
604,-2.88
605,-2.71
606,-2.41
607,-2.08
608,-1.76
609,-1.53
610,-1.34
611,-1.23
612,-1.17
613,-1.14
614,-1.11
615,-1.05
616,-0.98
617,-0.91
618,-0.92
619,-1.03
620,-1.26
621,-1.56
622,-1.88
623,-2.17
624,-2.36
625,-2.44
626,-2.43
627,-2.37
628,-2.30
629,-2.24
630,-2.20
631,-2.20
632,-2.24
633,-2.27
634,-2.26
635,-2.19
636,-1.99
637,-1.70
638,-1.28
639,-0.80
640,-0.29
641,0.18
642,0.63
643,1.02
644,1.43
645,1.88
646,2.42
647,3.01
648,3.63
649,4.20
650,4.70
651,5.01
652,5.15
653,5.07
654,4.91
655,4.67
656,4.46
657,4.30
658,4.28
659,4.36
660,4.54
661,4.75
662,5.00
663,5.28
664,5.54
665,5.78
666,6.00
667,6.21
668,6.39
669,6.56
670,6.65
671,6.65
672,6.52
673,6.29
674,5.96
675,5.58
676,5.08
677,4.53
678,3.89
679,3.22
680,2.46
681,1.66
682,0.82
683,0.05
684,-0.66
685,-1.21
686,-1.64
687,-1.89
688,-2.04
689,-2.08
690,-2.11
691,-2.15
692,-2.31
693,-2.57
694,-2.96
695,-3.40
696,-3.88
697,-4.33
698,-4.71
699,-5.00
700,-5.23
701,-5.35
702,-5.35
703,-5.23
704,-5.00
705,-4.74
706,-4.43
707,-4.11
708,-3.75
709,-3.36
710,-2.95
711,-2.54
712,-2.09
713,-1.63
714,-1.11
715,-0.59
716,-0.02
717,0.56
718,1.10
719,1.51
720,1.78
721,1.85
722,1.80
723,1.64
724,1.45
725,1.27
726,1.14
727,1.08
728,1.08
729,1.11
730,1.11
731,1.07
732,0.92
733,0.65
734,0.23
735,-0.27
736,-0.79
737,-1.27
738,-1.70
739,-2.06
740,-2.31
741,-2.44
742,-2.43
743,-2.28
744,-2.00
745,-1.61
746,-1.16
747,-0.73
748,-0.37
749,-0.14
750,-0.05
751,-0.08
752,-0.15
753,-0.18
754,-0.05
755,0.25
756,0.74
757,1.34
758,1.97
759,2.48
760,2.81
761,2.88
762,2.78
763,2.56
764,2.36
765,2.29
766,2.41
767,2.72
768,3.14
769,3.58
770,3.87
771,3.98
772,3.82
773,3.41
774,2.71
775,1.82
776,0.79
777,-0.25
778,-1.31
779,-2.35
780,-3.38
781,-4.30
782,-5.09
783,-5.67
784,-6.11
785,-6.36
786,-6.47
787,-6.43
788,-6.34
789,-6.24
790,-6.17
791,-6.15
792,-6.16
793,-6.20
794,-6.20
795,-6.12
796,-5.89
797,-5.51
798,-4.95
799,-4.24
800,-3.36
801,-2.42
802,-1.43
803,-0.54
804,0.27
805,0.92
806,1.40
807,1.68
808,1.88
809,2.07
810,2.36
811,2.69
812,3.14
813,3.67
814,4.33
815,4.97
816,5.54
817,5.92
818,6.18
819,6.29
820,6.38
821,6.45
822,6.67
823,7.07
824,7.70
825,8.47
826,9.39
827,10.35
828,11.27
829,11.99
830,12.46
831,12.62
832,12.54
833,12.26
834,11.88
835,11.44
836,11.04
837,10.73
838,10.60
839,10.60
840,10.70
841,10.82
842,10.94
843,11.09
844,11.27
845,11.43
846,11.48
847,11.44
848,11.25
849,10.99
850,10.62
851,10.18
852,9.69
853,9.23
854,8.85
855,8.58
856,8.42
857,8.34
858,8.28
859,8.23
860,8.17
861,8.18
862,8.24
863,8.44
864,8.71
865,9.03
866,9.25
867,9.37
868,9.26
869,8.91
870,8.26
871,7.39
872,6.41
873,5.50
874,4.77
875,4.30
876,4.08
877,4.07
878,4.14
879,4.16
880,4.00
881,3.69
882,3.20
883,2.67
884,2.10
885,1.65
886,1.26
887,0.96
888,0.53
889,-0.09
890,-1.05
891,-2.26
892,-3.76
893,-5.33
894,-6.88
895,-8.15
896,-9.17
897,-9.86
898,-10.35
899,-10.60
900,-10.85
901,-11.12
902,-11.58
903,-12.16
904,-12.87
905,-13.58
906,-14.28
907,-14.91
908,-15.43
909,-15.77
910,-15.88
911,-15.80
912,-15.52
913,-15.11
914,-14.53
915,-13.89
916,-13.16
917,-12.40
918,-11.51
919,-10.52
920,-9.34
921,-8.06
922,-6.68
923,-5.32
924,-4.00
925,-2.90
926,-2.03
927,-1.52
928,-1.29
929,-1.34
930,-1.53
931,-1.79
932,-2.01
933,-2.17
934,-2.18
935,-2.11
936,-1.92
937,-1.69
938,-1.39
939,-1.03
940,-0.66
941,-0.32
942,-0.07
943,0.11
944,0.23
945,0.26
946,0.18
947,0.04
948,-0.13
949,-0.28
950,-0.44
951,-0.64
952,-0.92
953,-1.24
954,-1.66
955,-2.15
956,-2.75
957,-3.41
958,-4.11
959,-4.76
960,-5.36
961,-5.82
962,-6.20
963,-6.49
964,-6.74
965,-6.90
966,-7.03
967,-7.15
968,-7.30
969,-7.48
970,-7.64
971,-7.68
972,-7.51
973,-7.13
974,-6.54
975,-5.84
976,-5.13
977,-4.49
978,-4.00
979,-3.69
980,-3.62
981,-3.72
982,-3.91
983,-4.09
984,-4.20
985,-4.26
986,-4.32
987,-4.46
988,-4.76
989,-5.29
990,-6.08
991,-7.05
992,-8.06
993,-8.95
994,-9.56
995,-9.77
996,-9.54
997,-8.90
998,-8.00
999,-7.02
1000,-6.12
1001,-5.43
1002,-5.00
1003,-4.80
1004,-4.74
1005,-4.75
1006,-4.78
1007,-4.80
1008,-4.69
1009,-4.52
1010,-4.30
1011,-4.16
1012,-4.09
1013,-4.05
1014,-3.92
1015,-3.72
1016,-3.43
1017,-3.11
1018,-2.71
1019,-2.27
1020,-1.82
1021,-1.43
1022,-1.10
1023,-0.82
1024,-0.50
1025,-0.13
1026,0.37
1027,0.95
1028,1.66
1029,2.37
1030,3.06
1031,3.65
1032,4.20
1033,4.69
1034,5.16
1035,5.57
1036,5.99
1037,6.39
1038,6.78
1039,7.06
1040,7.19
1041,7.12
1042,6.87
1043,6.48
1044,6.00
1045,5.55
1046,5.16
1047,4.90
1048,4.74
1049,4.63
1050,4.50
1051,4.36
1052,4.19
1053,4.04
1054,3.90
1055,3.79
1056,3.70
1057,3.68
1058,3.68
1059,3.74
1060,3.74
1061,3.66
1062,3.45
1063,3.17
1064,2.79
1065,2.38
1066,1.86
1067,1.27
1068,0.61
1069,-0.03
1070,-0.69
1071,-1.30
1072,-1.93
1073,-2.49
1074,-2.99
1075,-3.39
1076,-3.78
1077,-4.16
1078,-4.55
1079,-4.91
1080,-5.23
1081,-5.47
1082,-5.61
1083,-5.61
1084,-5.46
1085,-5.19
1086,-4.84
1087,-4.47
1088,-4.12
1089,-3.79
1090,-3.49
1091,-3.22
1092,-2.98
1093,-2.74
1094,-2.50
1095,-2.25
1096,-2.05
1097,-1.98
1098,-2.11
1099,-2.43
1100,-2.94
1101,-3.57
1102,-4.31
1103,-5.07
1104,-5.74
1105,-6.25
1106,-6.58
1107,-6.76
1108,-6.81
1109,-6.77
1110,-6.70
1111,-6.65
1112,-6.60
1113,-6.52
1114,-6.32
1115,-5.97
1116,-5.44
1117,-4.78
1118,-4.01
1119,-3.23
1120,-2.53
1121,-1.99
1122,-1.61
1123,-1.40
1124,-1.26
1125,-1.16
1126,-0.96
1127,-0.64
1128,-0.18
1129,0.33
1130,0.85
1131,1.26
1132,1.57
1133,1.73
1134,1.81
1135,1.85
1136,1.97
1137,2.14
1138,2.37
1139,2.60
1140,2.88
1141,3.14
1142,3.35
1143,3.46
1144,3.56
1145,3.69
1146,3.92
1147,4.26
1148,4.69
1149,5.18
1150,5.65
1151,6.02
1152,6.21
1153,6.19
1154,5.90
1155,5.37
1156,4.59
1157,3.67
1158,2.63
1159,1.63
1160,0.67
1161,-0.18
1162,-1.01
1163,-1.78
1164,-2.49
1165,-3.08
1166,-3.62
1167,-4.10
1168,-4.62
1169,-5.06
1170,-5.41
1171,-5.61
1172,-5.73
1173,-5.78
1174,-5.78
1175,-5.68
1176,-5.52
1177,-5.33
1178,-5.18
1179,-5.09
1180,-5.05
1181,-5.09
1182,-5.20
1183,-5.39
1184,-5.55
1185,-5.65
1186,-5.68
1187,-5.69
1188,-5.64
1189,-5.49
1190,-5.20
1191,-4.82
1192,-4.36
1193,-3.86
1194,-3.24
1195,-2.56
1196,-1.88
1197,-1.25
1198,-0.66
1199,-0.17
1200,0.22
1201,0.46
1202,0.59
1203,0.63
1204,0.64
1205,0.64
1206,0.67
1207,0.76
1208,0.90
1209,1.03
1210,1.10
1211,1.11
1212,1.03
1213,0.82
1214,0.42
1215,-0.14
1216,-0.82
1217,-1.51
1218,-2.21
1219,-2.86
1220,-3.42
1221,-3.87
1222,-4.25
1223,-4.58
1224,-4.81
1225,-4.94
1226,-4.95
1227,-4.83
1228,-4.55
1229,-4.14
1230,-3.59
1231,-2.93
1232,-2.19
1233,-1.45
1234,-0.73
1235,-0.08
1236,0.56
1237,1.14
1238,1.66
1239,2.05
1240,2.33
1241,2.49
1242,2.49
1243,2.30
1244,1.97
1245,1.60
1246,1.30
1247,1.08
1248,0.94
1249,0.87
1250,0.80
1251,0.71
1252,0.43
1253,-0.04
1254,-0.72
1255,-1.46
1256,-2.24
1257,-2.97
1258,-3.69
1259,-4.33
1260,-4.94
1261,-5.49
1262,-6.06
1263,-6.61
1264,-7.22
1265,-7.77
1266,-8.27
1267,-8.61
1268,-8.88
1269,-9.07
1270,-9.28
1271,-9.48
1272,-9.71
1273,-9.98
1274,-10.30
1275,-10.60
1276,-10.81
1277,-10.90
1278,-10.89
1279,-10.77
1280,-10.50
1281,-10.12
1282,-9.67
1283,-9.19
1284,-8.66
1285,-8.13
1286,-7.62
1287,-7.21
1288,-6.85
1289,-6.58
1290,-6.31
1291,-6.09
1292,-5.82
1293,-5.55
1294,-5.16
1295,-4.70
1296,-4.10
1297,-3.42
1298,-2.66
1299,-1.92
1300,-1.21
1301,-0.60
1302,-0.05
1303,0.35
1304,0.70
1305,0.94
1306,1.16
1307,1.34
1308,1.64
1309,2.04
1310,2.59
1311,3.17
1312,3.83
1313,4.51
1314,5.23
1315,5.91
1316,6.54
1317,7.06
1318,7.56
1319,7.99
1320,8.40
1321,8.78
1322,9.20
1323,9.61
1324,10.00
1325,10.34
1326,10.61
1327,10.79
1328,10.80
1329,10.60
1330,10.18
1331,9.61
1332,8.95
1333,8.25
1334,7.55
1335,6.96
1336,6.54
1337,6.32
1338,6.27
1339,6.35
1340,6.52
1341,6.80
1342,7.09
1343,7.37
1344,7.61
1345,7.84
1346,8.09
1347,8.34
1348,8.54
1349,8.67
1350,8.67
1351,8.56
1352,8.32
1353,7.97
1354,7.48
1355,6.87
1356,6.23
1357,5.66
1358,5.23
1359,4.97
1360,4.81
1361,4.75
1362,4.66
1363,4.59
1364,4.41
1365,4.14
1366,3.68
1367,3.13
1368,2.44
1369,1.75
1370,0.98
1371,0.20
1372,-0.71
1373,-1.68
1374,-2.73
1375,-3.76
1376,-4.81
1377,-5.74
1378,-6.62
1379,-7.32
1380,-7.89
1381,-8.26
1382,-8.53
1383,-8.67
1384,-8.83
1385,-9.00
1386,-9.26
1387,-9.64
1388,-10.16
1389,-10.80
1390,-11.49
1391,-12.13
1392,-12.60
1393,-12.85
1394,-12.83
1395,-12.57
1396,-12.03
1397,-11.32
1398,-10.48
1399,-9.65
1400,-8.83
1401,-8.07
1402,-7.30
1403,-6.55
1404,-5.70
1405,-4.81
1406,-3.86
1407,-2.98
1408,-2.17
1409,-1.56
1410,-1.08
1411,-0.83
1412,-0.76
1413,-0.84
1414,-0.89
1415,-0.82
1416,-0.56
1417,-0.18
1418,0.35
1419,0.95
1420,1.52
1421,1.92
1422,2.04
1423,1.84
1424,1.31
1425,0.56
1426,-0.34
1427,-1.24
1428,-2.07
1429,-2.71
1430,-3.20
1431,-3.56
1432,-3.97
1433,-4.49
1434,-5.20
1435,-6.03
1436,-6.99
1437,-7.94
1438,-8.83
1439,-9.48
1440,-9.87
1441,-9.98
1442,-9.90
1443,-9.71
1444,-9.50
1445,-9.32
1446,-9.16
1447,-9.03
1448,-8.86
1449,-8.61
1450,-8.16
1451,-7.51
1452,-6.66
1453,-5.71
1454,-4.65
1455,-3.62
1456,-2.61
1457,-1.72
1458,-0.93
1459,-0.32
1460,0.17
1461,0.54
1462,0.90
1463,1.21
1464,1.50
1465,1.71
1466,1.87
1467,1.95
1468,1.95
1469,1.82
1470,1.60
1471,1.32
1472,1.08
1473,0.95
1474,0.98
1475,1.20
1476,1.56
1477,2.02
1478,2.48
1479,2.78
1480,2.83
1481,2.56
1482,2.03
1483,1.36
1484,0.66
1485,0.08
1486,-0.25
1487,-0.25
1488,0.06
1489,0.59
1490,1.16
1491,1.63
1492,1.86
1493,1.85
1494,1.64
1495,1.32
1496,1.03
1497,0.87
1498,0.95
1499,1.28
1500,1.83
1501,2.46
1502,3.11
1503,3.64
1504,4.04
1505,4.23
1506,4.26
1507,4.13
1508,3.95
1509,3.78
1510,3.74
1511,3.81
1512,4.05
1513,4.41
1514,4.88
1515,5.36
1516,5.78
1517,6.06
1518,6.13
1519,6.01
1520,5.72
1521,5.36
1522,5.00
1523,4.73
1524,4.57
1525,4.55
1526,4.61
1527,4.66
1528,4.55
1529,4.24
1530,3.65
1531,2.88
1532,1.97
1533,1.11
1534,0.34
1535,-0.17
1536,-0.50
1537,-0.65
1538,-0.79
1539,-1.01
1540,-1.43
1541,-2.05
1542,-2.88
1543,-3.76
1544,-4.70
1545,-5.49
1546,-6.13
1547,-6.54
1548,-6.78
1549,-6.91
1550,-7.04
1551,-7.20
1552,-7.49
1553,-7.87
1554,-8.37
1555,-8.87
1556,-9.35
1557,-9.74
1558,-10.06
1559,-10.29
1560,-10.41
1561,-10.41
1562,-10.30
1563,-10.12
1564,-9.88
1565,-9.58
1566,-9.23
1567,-8.84
1568,-8.41
1569,-8.00
1570,-7.63
1571,-7.31
1572,-6.97
1573,-6.61
1574,-6.25
1575,-5.89
1576,-5.50
1577,-5.09
1578,-4.68
1579,-4.41
1580,-4.33
1581,-4.45
1582,-4.72
1583,-5.13
1584,-5.62
1585,-6.13
1586,-6.57
1587,-6.88
1588,-7.03
1589,-6.99
1590,-6.77
1591,-6.42
1592,-6.00
1593,-5.54
1594,-5.04
1595,-4.54
1596,-4.07
1597,-3.69
1598,-3.33
1599,-3.01
1600,-2.74
1601,-2.54
1602,-2.33
1603,-2.11
1604,-1.82
1605,-1.43
1606,-0.89
1607,-0.25
1608,0.45
1609,1.08
1610,1.62
1611,1.97
1612,2.11
1613,1.97
1614,1.70
1615,1.40
1616,1.25
1617,1.30
1618,1.60
1619,2.14
1620,2.88
1621,3.67
1622,4.37
1623,4.88
1624,5.20
1625,5.33
1626,5.36
1627,5.33
1628,5.29
1629,5.26
1630,5.20
1631,5.07
1632,4.82
1633,4.47
1634,3.94
1635,3.30
1636,2.53
1637,1.70
1638,0.76
1639,-0.17
1640,-1.12
1641,-2.04
1642,-3.01
1643,-3.95
1644,-4.83
1645,-5.51
1646,-6.02
1647,-6.33
1648,-6.51
1649,-6.48
1650,-6.36
1651,-6.16
1652,-6.04
1653,-5.97
1654,-5.94
1655,-5.91
1656,-5.91
1657,-5.93
1658,-5.97
1659,-6.00
1660,-6.02
1661,-6.04
1662,-6.10
1663,-6.23
1664,-6.42
1665,-6.68
1666,-6.89
1667,-7.06
1668,-7.13
1669,-7.13
1670,-7.03
1671,-6.84
1672,-6.48
1673,-6.01
1674,-5.38
1675,-4.65
1676,-3.81
1677,-2.94
1678,-2.06
1679,-1.22
1680,-0.48
1681,0.08
1682,0.47
1683,0.62
1684,0.53
1685,0.20
1686,-0.35
1687,-1.01
1688,-1.69
1689,-2.33
1690,-2.92
1691,-3.44
1692,-3.89
1693,-4.27
1694,-4.68
1695,-5.05
1696,-5.38
1697,-5.62
1698,-5.84
1699,-6.03
1700,-6.21
1701,-6.36
1702,-6.56
1703,-6.85
1704,-7.20
1705,-7.51
1706,-7.71
1707,-7.71
1708,-7.49
1709,-7.02
1710,-6.29
1711,-5.40
1712,-4.51
1713,-3.76
1714,-3.21
1715,-2.86
1716,-2.64
1717,-2.50
1718,-2.38
1719,-2.24
1720,-2.01
1721,-1.75
1722,-1.49
1723,-1.32
1724,-1.32
1725,-1.50
1726,-1.88
1727,-2.40
1728,-2.95
1729,-3.49
1730,-4.03
1731,-4.55
1732,-5.09
1733,-5.62
1734,-6.20
1735,-6.75
1736,-7.28
1737,-7.64
1738,-7.93
1739,-8.15
1740,-8.45
1741,-8.83
1742,-9.44
1743,-10.23
1744,-11.27
1745,-12.44
1746,-13.63
1747,-14.68
1748,-15.53
1749,-16.12
1750,-16.44
1751,-16.49
1752,-16.35
1753,-16.10
1754,-15.83
1755,-15.59
1756,-15.40
1757,-15.19
1758,-14.93
1759,-14.61
1760,-14.19
1761,-13.72
1762,-13.18
1763,-12.62
1764,-12.02
1765,-11.47
1766,-10.94
1767,-10.51
1768,-10.10
1769,-9.70
1770,-9.22
1771,-8.69
1772,-8.11
1773,-7.56
1774,-6.97
1775,-6.42
1776,-5.88
1777,-5.49
1778,-5.15
1779,-4.90
1780,-4.62
1781,-4.35
1782,-3.99
1783,-3.56
1784,-2.97
1785,-2.33
1786,-1.66
1787,-1.07
1788,-0.49
1789,0.02
1790,0.52
1791,0.98
1792,1.53
1793,2.20
1794,3.03
1795,3.90
1796,4.78
1797,5.52
1798,6.08
1799,6.40
1800,6.52
1801,6.48
1802,6.35
1803,6.16
1804,5.97
1805,5.78
1806,5.63
1807,5.49
1808,5.31
1809,5.08
1810,4.78
1811,4.45
1812,4.12
1813,3.85
1814,3.65
1815,3.54
1816,3.49
1817,3.46
1818,3.41
1819,3.32
1820,3.20
1821,3.08
1822,3.00
1823,2.97
1824,2.98
1825,3.04
1826,3.15
1827,3.28
1828,3.36
1829,3.33
1830,3.14
1831,2.88
1832,2.61
1833,2.37
1834,2.14
1835,1.99
1836,1.98
1837,2.11
1838,2.24
1839,2.27
1840,2.09
1841,1.72
1842,1.17
1843,0.53
1844,-0.17
1845,-0.73
1846,-1.11
1847,-1.19
1848,-1.01
1849,-0.61
1850,-0.24
1851,-0.03
1852,-0.17
1853,-0.63
1854,-1.46
1855,-2.51
1856,-3.69
1857,-4.82
1858,-5.85
1859,-6.70
1860,-7.46
1861,-8.16
1862,-8.90
1863,-9.64
1864,-10.38
1865,-11.05
1866,-11.57
1867,-11.84
1868,-11.82
1869,-11.51
1870,-10.99
1871,-10.36
1872,-9.66
1873,-8.96
1874,-8.22
1875,-7.45
1876,-6.58
1877,-5.64
1878,-4.60
1879,-3.60
1880,-2.60
1881,-1.74
1882,-0.90
1883,-0.15
1884,0.62
1885,1.34
1886,2.11
1887,2.86
1888,3.71
1889,4.55
1890,5.42
1891,6.16
1892,6.78
1893,7.21
1894,7.51
1895,7.61
1896,7.57
1897,7.35
1898,7.00
1899,6.55
1900,6.06
1901,5.59
1902,5.24
1903,5.07
1904,5.07
1905,5.23
1906,5.46
1907,5.71
1908,5.92
1909,6.06
1910,6.02
1911,5.83
1912,5.44
1913,4.91
1914,4.22
1915,3.42
1916,2.53
1917,1.66
1918,0.85
1919,0.14
1920,-0.51
1921,-1.03
1922,-1.45
1923,-1.77
1924,-2.10
1925,-2.41
1926,-2.72
1927,-2.96
1928,-3.14
1929,-3.20
1930,-3.10
1931,-2.79
1932,-2.32
1933,-1.78
1934,-1.25
1935,-0.79
1936,-0.40
1937,-0.11
1938,0.07
1939,0.16
1940,0.21
1941,0.25
1942,0.33
1943,0.43
1944,0.55
1945,0.67
1946,0.72
1947,0.68
1948,0.51
1949,0.24
1950,-0.15
1951,-0.66
1952,-1.28
1953,-1.93
1954,-2.61
1955,-3.30
1956,-3.99
1957,-4.62
1958,-5.12
1959,-5.48
1960,-5.71
1961,-5.83
1962,-5.84
1963,-5.72
1964,-5.47
1965,-5.07
1966,-4.55
1967,-3.93
1968,-3.20
1969,-2.43
1970,-1.65
1971,-1.01
1972,-0.63
1973,-0.60
1974,-0.90
1975,-1.50
1976,-2.24
1977,-3.01
1978,-3.60
1979,-3.93
1980,-3.85
1981,-3.41
1982,-2.62
1983,-1.66
1984,-0.63
1985,0.32
1986,1.16
1987,1.84
1988,2.40
1989,2.83
1990,3.23
1991,3.63
1992,4.14
1993,4.72
1994,5.39
1995,6.03
1996,6.56
1997,6.88
1998,6.97
1999,6.74
2000,6.27
2001,5.60
2002,4.87
2003,4.23
2004,3.81
2005,3.65
2006,3.75
2007,4.05
2008,4.38
2009,4.62
2010,4.55
2011,4.19
2012,3.49
2013,2.62
2014,1.63
2015,0.71
2016,-0.06
2017,-0.59
2018,-0.95
2019,-1.23
2020,-1.53
2021,-1.88
2022,-2.33
2023,-2.86
2024,-3.48
2025,-4.04
2026,-4.51
2027,-4.75
2028,-4.87
2029,-4.88
2030,-4.92
2031,-5.02
2032,-5.26
2033,-5.67
2034,-6.31
2035,-7.08
2036,-7.93
2037,-8.70
2038,-9.39
2039,-9.91
2040,-10.28
2041,-10.48
2042,-10.60
2043,-10.68
2044,-10.74
2045,-10.78
2046,-10.81
2047,-10.80
2048,-10.73
2049,-10.54
2050,-10.28
2051,-9.98
2052,-9.67
2053,-9.38
2054,-9.08
2055,-8.80
2056,-8.58
2057,-8.42
2058,-8.26
2059,-8.08
2060,-7.82
2061,-7.49
2062,-7.16
2063,-6.85
2064,-6.59
2065,-6.42
2066,-6.37
2067,-6.49
2068,-6.75
2069,-7.13
2070,-7.55
2071,-7.97
2072,-8.31
2073,-8.50
2074,-8.50
2075,-8.32
2076,-7.96
2077,-7.46
2078,-6.84
2079,-6.18
2080,-5.51
2081,-4.89
2082,-4.28
2083,-3.66
2084,-2.98
2085,-2.24
2086,-1.43
2087,-0.64
2088,0.14
2089,0.76
2090,1.20
2091,1.37
2092,1.32
2093,1.01
2094,0.62
2095,0.23
2096,0.08
2097,0.18
2098,0.55
2099,1.12
2100,1.88
2101,2.69
2102,3.43
2103,3.97
2104,4.33
2105,4.52
2106,4.61
2107,4.64
2108,4.67
2109,4.72
2110,4.81
2111,4.88
2112,4.90
2113,4.84
2114,4.65
2115,4.39
2116,4.06
2117,3.75
2118,3.40
2119,3.02
2120,2.55
2121,2.00
2122,1.30
2123,0.47
2124,-0.51
2125,-1.56
2126,-2.61
2127,-3.50
2128,-4.19
2129,-4.59
2130,-4.78
2131,-4.80
2132,-4.75
2133,-4.67
2134,-4.64
2135,-4.60
2136,-4.56
2137,-4.44
2138,-4.23
2139,-3.93
2140,-3.58
2141,-3.24
2142,-3.00
2143,-2.90
2144,-2.97
2145,-3.22
2146,-3.62
2147,-4.12
2148,-4.57
2149,-4.91
2150,-5.07
2151,-5.08
2152,-4.89
2153,-4.54
2154,-4.01
2155,-3.36
2156,-2.59
2157,-1.79
2158,-0.98
2159,-0.23
2160,0.44
2161,0.98
2162,1.35
2163,1.56
2164,1.66
2165,1.71
2166,1.74
2167,1.74
2168,1.73
2169,1.69
2170,1.63
2171,1.48
2172,1.22
2173,0.84
2174,0.32
2175,-0.25
2176,-0.81
2177,-1.29
2178,-1.70
2179,-2.02
2180,-2.24
2181,-2.35
2182,-2.45
2183,-2.58
2184,-2.80
2185,-3.08
2186,-3.36
2187,-3.55
2188,-3.56
2189,-3.39
2190,-3.02
2191,-2.51
2192,-1.86
2193,-1.15
2194,-0.43
2195,0.19
2196,0.75
2197,1.24
2198,1.72
2199,2.14
2200,2.48
2201,2.66
2202,2.65
2203,2.43
2204,2.07
2205,1.61
2206,1.14
2207,0.75
2208,0.50
2209,0.42
2210,0.42
2211,0.41
2212,0.24
2213,-0.12
2214,-0.77
2215,-1.57
2216,-2.49
2217,-3.31
2218,-4.03
2219,-4.54
2220,-4.97
2221,-5.32
2222,-5.78
2223,-6.36
2224,-7.15
2225,-8.09
2226,-9.19
2227,-10.24
2228,-11.15
2229,-11.77
2230,-12.12
2231,-12.21
2232,-12.17
2233,-12.04
2234,-11.93
2235,-11.87
2236,-11.85
2237,-11.86
2238,-11.86
2239,-11.80
2240,-11.63
2241,-11.34
2242,-10.92
2243,-10.41
2244,-9.81
2245,-9.23
2246,-8.67
2247,-8.20
2248,-7.74
2249,-7.32
2250,-6.87
2251,-6.47
2252,-6.04
2253,-5.62
2254,-5.10
2255,-4.62
2256,-4.11
2257,-3.68
2258,-3.24
2259,-2.85
2260,-2.41
2261,-1.95
2262,-1.37
2263,-0.73
2264,0.01
2265,0.71
2266,1.40
2267,1.98
2268,2.49
2269,2.92
2270,3.36
2271,3.75
2272,4.19
2273,4.66
2274,5.23
2275,5.85
2276,6.50
2277,7.13
2278,7.77
2279,8.35
2280,8.85
2281,9.22
2282,9.47
2283,9.57
2284,9.50
2285,9.21
2286,8.74
2287,8.09
2288,7.29
2289,6.36
2290,5.46
2291,4.65
2292,4.02
2293,3.62
2294,3.47
2295,3.56
2296,3.79
2297,4.08
2298,4.37
2299,4.64
2300,4.83
2301,4.98
2302,5.15
2303,5.42
2304,5.76
2305,6.16
2306,6.58
2307,6.95
2308,7.16
2309,7.13
2310,6.85
2311,6.37
2312,5.76
2313,5.12
2314,4.55
2315,4.12
2316,3.89
2317,3.87
2318,3.99
2319,4.19
2320,4.35
2321,4.46
2322,4.43
2323,4.33
2324,4.11
2325,3.85
2326,3.53
2327,3.22
2328,2.87
2329,2.53
2330,2.10
2331,1.61
2332,0.98
2333,0.25
2334,-0.66
2335,-1.65
2336,-2.75
2337,-3.80
2338,-4.75
2339,-5.47
2340,-6.04
2341,-6.44
2342,-6.79
2343,-7.10
2344,-7.45
2345,-7.83
2346,-8.29
2347,-8.77
2348,-9.22
2349,-9.59
2350,-9.81
2351,-9.87
2352,-9.74
2353,-9.49
2354,-9.09
2355,-8.64
2356,-8.03
2357,-7.29
2358,-6.37
2359,-5.30
2360,-4.06
2361,-2.73
2362,-1.34
2363,-0.02
2364,1.18
2365,2.07
2366,2.60
2367,2.70
2368,2.49
2369,2.04
2370,1.53
2371,1.03
2372,0.69
2373,0.56
2374,0.69
2375,1.02
2376,1.51
2377,2.02
2378,2.46
2379,2.76
2380,2.92
2381,2.98
2382,2.95
2383,2.86
2384,2.73
2385,2.59
2386,2.42
2387,2.19
2388,1.84
2389,1.40
2390,0.86
2391,0.31
2392,-0.31
2393,-0.98
2394,-1.79
2395,-2.62
2396,-3.58
2397,-4.59
2398,-5.71
2399,-6.82
2400,-7.93
2401,-8.87
2402,-9.72
2403,-10.38
2404,-10.91
2405,-11.32
2406,-11.72
2407,-12.10
2408,-12.47
2409,-12.77
2410,-13.00
2411,-13.09
2412,-12.95
2413,-12.56
2414,-11.84
2415,-10.88
2416,-9.70
2417,-8.48
2418,-7.29
2419,-6.28
2420,-5.42
2421,-4.75
2422,-4.23
2423,-3.85
2424,-3.51
2425,-3.23
2426,-3.00
2427,-2.91
2428,-2.93
2429,-3.14
2430,-3.47
2431,-3.93
2432,-4.39
2433,-4.76
2434,-4.97
2435,-5.01
2436,-4.84
2437,-4.51
2438,-4.07
2439,-3.68
2440,-3.42
2441,-3.33
2442,-3.38
2443,-3.52
2444,-3.64
2445,-3.62
2446,-3.33
2447,-2.73
2448,-1.88
2449,-0.92
2450,0.05
2451,0.89
2452,1.53
2453,1.85
2454,1.88
2455,1.70
2456,1.51
2457,1.40
2458,1.49
2459,1.75
2460,2.21
2461,2.77
2462,3.40
2463,3.94
2464,4.44
2465,4.81
2466,5.15
2467,5.46
2468,5.85
2469,6.36
2470,6.99
2471,7.68
2472,8.36
2473,8.96
2474,9.46
2475,9.78
2476,9.90
2477,9.84
2478,9.67
2479,9.38
2480,9.02
2481,8.58
2482,8.10
2483,7.64
2484,7.21
2485,6.83
2486,6.52
2487,6.36
2488,6.26
2489,6.22
2490,6.14
2491,6.03
2492,5.81
2493,5.47
2494,4.96
2495,4.40
2496,3.80
2497,3.28
2498,2.78
2499,2.29
2500,1.70
2501,1.05
2502,0.24
2503,-0.64
2504,-1.66
2505,-2.68
2506,-3.59
2507,-4.24
2508,-4.67
2509,-4.84
2510,-4.91
2511,-4.92
2512,-5.01
2513,-5.23
2514,-5.67
2515,-6.26
2516,-6.98
2517,-7.67
2518,-8.26
2519,-8.67
2520,-8.93
2521,-9.04
2522,-9.06
2523,-9.00
2524,-8.87
2525,-8.69
2526,-8.48
2527,-8.20
2528,-7.84
2529,-7.44
2530,-7.00
2531,-6.54
2532,-6.05
2533,-5.55
2534,-5.07
2535,-4.65
2536,-4.26
2537,-3.91
2538,-3.61
2539,-3.40
2540,-3.30
2541,-3.34
2542,-3.46
2543,-3.68
2544,-3.96
2545,-4.23
2546,-4.44
2547,-4.53
2548,-4.49
2549,-4.33
2550,-4.12
2551,-3.91
2552,-3.73
2553,-3.62
2554,-3.56
2555,-3.60
2556,-3.71
2557,-3.81
2558,-3.78
2559,-3.58
2560,-3.20
2561,-2.72
2562,-2.16
2563,-1.59
2564,-1.07
2565,-0.69
2566,-0.42
2567,-0.27
2568,-0.10
2569,0.09
2570,0.37
2571,0.69
2572,1.09
2573,1.49
2574,1.91
2575,2.26
2576,2.57
2577,2.82
2578,3.10
2579,3.42
2580,3.83
2581,4.27
2582,4.75
2583,5.17
2584,5.53
2585,5.79
2586,5.97
2587,6.08
2588,6.16
2589,6.28
2590,6.48
2591,6.72
2592,6.94
2593,7.10
2594,7.16
2595,7.11
2596,6.88
2597,6.51
2598,5.97
2599,5.39
2600,4.71
2601,3.97
2602,3.15
2603,2.33
2604,1.48
2605,0.69
2606,-0.11
2607,-0.84
2608,-1.53
2609,-2.14
2610,-2.77
2611,-3.35
2612,-3.91
2613,-4.38
2614,-4.81
2615,-5.16
2616,-5.42
2617,-5.53
2618,-5.55
2619,-5.51
2620,-5.48
2621,-5.50
2622,-5.62
2623,-5.84
2624,-6.10
2625,-6.35
2626,-6.48
2627,-6.50
2628,-6.36
2629,-6.12
2630,-5.78
2631,-5.40
2632,-4.96
2633,-4.50
2634,-3.95
2635,-3.33
2636,-2.60
2637,-1.84
2638,-1.05
2639,-0.26
2640,0.50
2641,1.09
2642,1.46
2643,1.57
2644,1.53
2645,1.38
2646,1.20
2647,0.96
2648,0.71
2649,0.43
2650,0.14
2651,-0.18
2652,-0.53
2653,-0.89
2654,-1.27
2655,-1.69
2656,-2.13
2657,-2.54
2658,-2.91
2659,-3.24
2660,-3.56
2661,-3.85
2662,-4.10
2663,-4.31
2664,-4.53
2665,-4.73
2666,-4.88
2667,-4.95
2668,-4.96
2669,-4.93
2670,-4.81
2671,-4.59
2672,-4.23
2673,-3.82
2674,-3.33
2675,-2.76
2676,-2.11
2677,-1.43
2678,-0.73
2679,-0.05
2680,0.63
2681,1.23
2682,1.68
2683,1.88
2684,1.89
2685,1.76
2686,1.57
2687,1.34
2688,1.16
2689,1.08
2690,1.11
2691,1.17
2692,1.16
2693,1.00
2694,0.65
2695,0.14
2696,-0.55
2697,-1.29
2698,-2.01
2699,-2.53
2700,-2.94
2701,-3.27
2702,-3.68
2703,-4.20
2704,-4.93
2705,-5.81
2706,-6.87
2707,-7.97
2708,-9.05
2709,-9.92
2710,-10.51
2711,-10.77
2712,-10.77
2713,-10.60
2714,-10.35
2715,-10.04
2716,-9.74
2717,-9.51
2718,-9.35
2719,-9.26
2720,-9.19
2721,-9.08
2722,-8.90
2723,-8.63
2724,-8.24
2725,-7.80
2726,-7.33
2727,-6.92
2728,-6.56
2729,-6.30
2730,-6.13
2731,-6.06
2732,-5.97
2733,-5.81
2734,-5.48
2735,-5.04
2736,-4.50
2737,-4.00
2738,-3.52
2739,-3.15
2740,-2.85
2741,-2.66
2742,-2.46
2743,-2.24
2744,-1.95
2745,-1.60
2746,-1.11
2747,-0.56
2748,0.03
2749,0.53
2750,1.00
2751,1.36
2752,1.66
2753,1.87
2754,2.04
2755,2.20
2756,2.40
2757,2.68
2758,3.07
2759,3.55
2760,4.04
2761,4.46
2762,4.80
2763,5.01
2764,5.04
2765,4.84
2766,4.39
2767,3.76
2768,2.99
2769,2.19
2770,1.40
2771,0.70
2772,0.13
2773,-0.28
2774,-0.53
2775,-0.68
2776,-0.80
2777,-0.92
2778,-1.01
2779,-1.03
2780,-1.02
2781,-0.93
2782,-0.71
2783,-0.31
2784,0.20
2785,0.76
2786,1.24
2787,1.61
2788,1.79
2789,1.73
2790,1.41
2791,0.84
2792,0.08
2793,-0.74
2794,-1.48
2795,-2.03
2796,-2.35
2797,-2.43
2798,-2.30
2799,-2.01
2800,-1.68
2801,-1.36
2802,-1.20
2803,-1.21
2804,-1.44
2805,-1.80
2806,-2.28
2807,-2.75
2808,-3.18
2809,-3.52
2810,-3.86
2811,-4.17
2812,-4.53
2813,-4.95
2814,-5.56
2815,-6.32
2816,-7.27
2817,-8.22
2818,-9.12
2819,-9.89
2820,-10.60
2821,-11.20
2822,-11.76
2823,-12.29
2824,-12.89
2825,-13.53
2826,-14.22
2827,-14.82
2828,-15.30
2829,-15.56
2830,-15.61
2831,-15.46
2832,-15.14
2833,-14.75
2834,-14.32
2835,-13.92
2836,-13.50
2837,-13.06
2838,-12.50
2839,-11.81
2840,-10.89
2841,-9.83
2842,-8.60
2843,-7.42
2844,-6.35
2845,-5.55
2846,-4.98
2847,-4.65
2848,-4.43
2849,-4.34
2850,-4.22
2851,-4.03
2852,-3.67
2853,-3.26
2854,-2.84
2855,-2.54
2856,-2.37
2857,-2.34
2858,-2.46
2859,-2.71
2860,-3.01
2861,-3.23
2862,-3.27
2863,-3.09
2864,-2.72
2865,-2.27
2866,-1.80
2867,-1.40
2868,-1.14
2869,-1.05
2870,-1.13
2871,-1.35
2872,-1.64
2873,-1.95
2874,-2.23
2875,-2.46
2876,-2.66
2877,-2.86
2878,-3.14
2879,-3.52
2880,-4.02
2881,-4.60
2882,-5.19
2883,-5.71
2884,-6.05
2885,-6.14
2886,-5.98
2887,-5.62
2888,-5.11
2889,-4.58
2890,-4.04
2891,-3.55
2892,-3.04
2893,-2.54
2894,-2.01
2895,-1.46
2896,-0.78
2897,-0.05
2898,0.74
2899,1.47
2900,2.18
2901,2.79
2902,3.36
2903,3.83
2904,4.25
2905,4.59
2906,4.91
2907,5.17
2908,5.39
2909,5.52
2910,5.50
2911,5.29
2912,4.91
2913,4.41
2914,3.90
2915,3.41
2916,3.02
2917,2.78
2918,2.73
2919,2.88
2920,3.17
2921,3.51
2922,3.83
2923,4.10
2924,4.32
2925,4.49
2926,4.66
2927,4.90
2928,5.24
2929,5.67
2930,6.09
2931,6.40
2932,6.55
2933,6.48
2934,6.19
2935,5.68
2936,5.01
2937,4.30
2938,3.68
2939,3.23
2940,2.98
2941,2.93
2942,3.04
2943,3.24
2944,3.52
2945,3.82
2946,4.13
2947,4.39
2948,4.60
2949,4.78
2950,4.96
2951,5.10
2952,5.21
2953,5.30
2954,5.42
2955,5.60
2956,5.81
2957,6.03
2958,6.24
2959,6.39
2960,6.39
2961,6.20
2962,5.78
2963,5.18
2964,4.38
2965,3.49
2966,2.59
2967,1.78
2968,1.06
2969,0.49
2970,0.01
2971,-0.36
2972,-0.74
2973,-1.11
2974,-1.51
2975,-1.85
2976,-2.20
2977,-2.50
2978,-2.85
2979,-3.16
2980,-3.50
2981,-3.85
2982,-4.26
2983,-4.70
2984,-5.19
2985,-5.65
2986,-6.15
2987,-6.65
2988,-7.18
2989,-7.68
2990,-8.16
2991,-8.59
2992,-9.05
2993,-9.48
2994,-9.92
2995,-10.29
2996,-10.67
2997,-11.05
2998,-11.48
2999,-11.92
3000,-12.37
3001,-12.79
3002,-13.17
3003,-13.44
3004,-13.56
3005,-13.47
3006,-13.18
3007,-12.73
3008,-12.15
3009,-11.53
3010,-10.87
3011,-10.22
3012,-9.52
3013,-8.79
3014,-8.00
3015,-7.22
3016,-6.47
3017,-5.86
3018,-5.36
3019,-5.07
3020,-4.96
3021,-5.07
3022,-5.32
3023,-5.67
3024,-5.97
3025,-6.16
3026,-6.18
3027,-6.04
3028,-5.71
3029,-5.27
3030,-4.73
3031,-4.17
3032,-3.56
3033,-2.98
3034,-2.42
3035,-1.93
3036,-1.40
3037,-0.86
3038,-0.21
3039,0.52
3040,1.41
3041,2.37
3042,3.41
3043,4.36
3044,5.23
3045,5.94
3046,6.51
3047,6.90
3048,7.22
3049,7.50
3050,7.86
3051,8.26
3052,8.74
3053,9.22
3054,9.70
3055,10.07
3056,10.33
3057,10.44
3058,10.51
3059,10.54
3060,10.61
3061,10.70
3062,10.85
3063,11.05
3064,11.31
3065,11.56
3066,11.76
3067,11.88
3068,11.89
3069,11.86
3070,11.81
3071,11.76
3072,11.67
3073,11.53
3074,11.30
3075,10.99
3076,10.50
3077,9.86
3078,9.03
3079,8.11
3080,7.10
3081,6.10
3082,5.07
3083,4.14
3084,3.27
3085,2.53
3086,1.84
3087,1.24
3088,0.66
3089,0.21
3090,-0.23
3091,-0.60
3092,-0.97
3093,-1.26
3094,-1.50
3095,-1.63
3096,-1.72
3097,-1.77
3098,-1.83
3099,-1.85
3100,-1.84
3101,-1.80
3102,-1.82
3103,-1.91
3104,-2.04
3105,-2.20
3106,-2.36
3107,-2.48
3108,-2.51
3109,-2.43
3110,-2.20
3111,-1.88
3112,-1.45
3113,-0.95
3114,-0.38
3115,0.18
3116,0.74
3117,1.24
3118,1.70
3119,2.08
3120,2.42
3121,2.74
3122,3.07
3123,3.40
3124,3.70
3125,3.94
3126,4.13
3127,4.21
3128,4.18
3129,4.04
3130,3.80
3131,3.53
3132,3.23
3133,2.94
3134,2.65
3135,2.41
3136,2.23
3137,2.09
3138,1.91
3139,1.62
3140,1.18
3141,0.64
3142,0.03
3143,-0.63
3144,-1.32
3145,-1.91
3146,-2.31
3147,-2.42
3148,-2.19
3149,-1.71
3150,-1.03
3151,-0.27
3152,0.47
3153,1.12
3154,1.67
3155,2.11
3156,2.52
3157,2.94
3158,3.50
3159,4.15
3160,4.88
3161,5.58
3162,6.19
3163,6.57
3164,6.68
3165,6.49
3166,6.12
3167,5.68
3168,5.29
3169,5.05
3170,5.00
3171,5.11
3172,5.23
3173,5.26
3174,5.07
3175,4.65
3176,3.97
3177,3.12
3178,2.12
3179,1.14
3180,0.18
3181,-0.66
3182,-1.45
3183,-2.21
3184,-3.10
3185,-4.04
3186,-5.03
3187,-5.94
3188,-6.81
3189,-7.51
3190,-8.05
3191,-8.33
3192,-8.45
3193,-8.42
3194,-8.38
3195,-8.34
3196,-8.37
3197,-8.48
3198,-8.71
3199,-8.97
3200,-9.23
3201,-9.45
3202,-9.62
3203,-9.71
3204,-9.65
3205,-9.45
3206,-9.13
3207,-8.77
3208,-8.35
3209,-7.88
3210,-7.36
3211,-6.83
3212,-6.28
3213,-5.78
3214,-5.31
3215,-4.97
3216,-4.72
3217,-4.59
3218,-4.44
3219,-4.33
3220,-4.15
3221,-3.92
3222,-3.52
3223,-2.98
3224,-2.27
3225,-1.53
3226,-0.74
3227,0.02
3228,0.76
3229,1.38
3230,1.91
3231,2.30
3232,2.66
3233,2.98
3234,3.36
3235,3.75
3236,4.21
3237,4.68
3238,5.21
3239,5.77
3240,6.34
3241,6.84
3242,7.28
3243,7.58
3244,7.72
3245,7.66
3246,7.42
3247,7.06
3248,6.61
3249,6.16
3250,5.74
3251,5.42
3252,5.17
3253,5.00
3254,4.83
3255,4.61
3256,4.26
3257,3.79
3258,3.17
3259,2.52
3260,1.89
3261,1.41
3262,1.10
3263,1.02
3264,1.17
3265,1.54
3266,2.04
3267,2.59
3268,3.09
3269,3.46
3270,3.62
3271,3.57
3272,3.27
3273,2.79
3274,2.17
3275,1.56
3276,0.98
3277,0.53
3278,0.20
3279,0.06
3280,0.11
3281,0.30
3282,0.49
3283,0.60
3284,0.56
3285,0.39
3286,0.02
3287,-0.44
3288,-0.98
3289,-1.42
3290,-1.79
3291,-1.98
3292,-2.14
3293,-2.29
3294,-2.63
3295,-3.18
3296,-4.01
3297,-5.04
3298,-6.31
3299,-7.62
3300,-8.89
3301,-9.90
3302,-10.64
3303,-11.06
3304,-11.29
3305,-11.33
3306,-11.30
3307,-11.23
3308,-11.20
3309,-11.23
3310,-11.31
3311,-11.41
3312,-11.47
3313,-11.49
3314,-11.36
3315,-11.11
3316,-10.68
3317,-10.12
3318,-9.37
3319,-8.49
3320,-7.45
3321,-6.36
3322,-5.17
3323,-3.99
3324,-2.82
3325,-1.79
3326,-0.85
3327,-0.05
3328,0.73
3329,1.40
3330,2.02
3331,2.49
3332,2.85
3333,3.03
3334,3.11
3335,3.07
3336,2.98
3337,2.85
3338,2.72
3339,2.66
3340,2.75
3341,2.94
3342,3.20
3343,3.45
3344,3.68
3345,3.88
3346,3.91
3347,3.80
3348,3.56
3349,3.33
3350,3.09
3351,2.87
3352,2.59
3353,2.27
3354,1.88
3355,1.44
3356,0.90
3357,0.31
3358,-0.31
3359,-0.85
3360,-1.29
3361,-1.58
3362,-1.73
3363,-1.79
3364,-1.82
3365,-1.87
3366,-1.96
3367,-2.08
3368,-2.27
3369,-2.49
3370,-2.62
3371,-2.63
3372,-2.47
3373,-2.17
3374,-1.73
3375,-1.21
3376,-0.60
3377,-0.04
3378,0.47
3379,0.89
3380,1.24
3381,1.50
3382,1.68
3383,1.80
3384,1.92
3385,2.07
3386,2.20
3387,2.30
3388,2.35
3389,2.35
3390,2.26
3391,2.02
3392,1.61
3393,1.04
3394,0.37
3395,-0.30
3396,-0.87
3397,-1.27
3398,-1.44
3399,-1.37
3400,-1.11
3401,-0.75
3402,-0.37
3403,-0.10
3404,0.05
3405,0.07
3406,0.02
3407,-0.02
3408,0.05
3409,0.31
3410,0.82
3411,1.48
3412,2.17
3413,2.75
3414,3.15
3415,3.35
3416,3.38
3417,3.27
3418,3.15
3419,3.11
3420,3.21
3421,3.42
3422,3.68
3423,3.91
3424,4.03
3425,4.02
3426,3.91
3427,3.72
3428,3.55
3429,3.45
3430,3.47
3431,3.62
3432,3.89
3433,4.23
3434,4.57
3435,4.87
3436,5.09
3437,5.21
3438,5.23
3439,5.14
3440,4.94
3441,4.67
3442,4.37
3443,4.14
3444,3.98
3445,3.93
3446,3.91
3447,3.90
3448,3.79
3449,3.57
3450,3.16
3451,2.56
3452,1.80
3453,1.02
3454,0.33
3455,-0.14
3456,-0.43
3457,-0.49
3458,-0.45
3459,-0.37
3460,-0.42
3461,-0.60
3462,-0.98
3463,-1.49
3464,-2.12
3465,-2.77
3466,-3.41
3467,-3.94
3468,-4.38
3469,-4.72
3470,-5.05
3471,-5.34
3472,-5.62
3473,-5.81
3474,-5.99
3475,-6.13
3476,-6.27
3477,-6.41
3478,-6.60
3479,-6.85
3480,-7.25
3481,-7.79
3482,-8.48
3483,-9.22
3484,-9.93
3485,-10.51
3486,-10.89
3487,-11.01
3488,-10.83
3489,-10.38
3490,-9.74
3491,-9.04
3492,-8.35
3493,-7.72
3494,-7.18
3495,-6.77
3496,-6.49
3497,-6.34
3498,-6.28
3499,-6.32
3500,-6.44
3501,-6.66
3502,-6.90
3503,-7.13
3504,-7.25
3505,-7.26
3506,-7.13
3507,-6.92
3508,-6.62
3509,-6.32
3510,-6.09
3511,-6.00
3512,-6.07
3513,-6.26
3514,-6.48
3515,-6.68
3516,-6.73
3517,-6.56
3518,-6.11
3519,-5.46
3520,-4.66
3521,-3.91
3522,-3.29
3523,-2.88
3524,-2.65
3525,-2.58
3526,-2.53
3527,-2.42
3528,-2.05
3529,-1.41
3530,-0.43
3531,0.70
3532,1.88
3533,2.84
3534,3.48
3535,3.67
3536,3.49
3537,3.04
3538,2.57
3539,2.25
3540,2.23
3541,2.53
3542,3.12
3543,3.79
3544,4.36
3545,4.61
3546,4.46
3547,3.97
3548,3.26
3549,2.56
3550,2.03
3551,1.80
3552,1.83
3553,2.07
3554,2.33
3555,2.51
3556,2.43
3557,2.06
3558,1.31
3559,0.35
3560,-0.71
3561,-1.66
3562,-2.49
3563,-3.09
3564,-3.54
3565,-3.85
3566,-4.14
3567,-4.45
3568,-4.88
3569,-5.41
3570,-6.04
3571,-6.64
3572,-7.14
3573,-7.40
3574,-7.44
3575,-7.24
3576,-6.92
3577,-6.51
3578,-6.12
3579,-5.84
3580,-5.78
3581,-5.94
3582,-6.24
3583,-6.61
3584,-6.95
3585,-7.21
3586,-7.28
3587,-7.17
3588,-6.86
3589,-6.44
3590,-5.94
3591,-5.47
3592,-5.05
3593,-4.70
3594,-4.33
3595,-3.93
3596,-3.44
3597,-2.85
3598,-2.11
3599,-1.24
3600,-0.31
3601,0.50
3602,1.10
3603,1.40
3604,1.38
3605,1.04
3606,0.46
3607,-0.21
3608,-0.81
3609,-1.24
3610,-1.46
3611,-1.51
3612,-1.46
3613,-1.45
3614,-1.61
3615,-2.01
3616,-2.69
3617,-3.50
3618,-4.34
3619,-5.04
3620,-5.51
3621,-5.68
3622,-5.58
3623,-5.30
3624,-4.95
3625,-4.64
3626,-4.45
3627,-4.40
3628,-4.44
3629,-4.48
3630,-4.41
3631,-4.19
3632,-3.77
3633,-3.20
3634,-2.49
3635,-1.81
3636,-1.21
3637,-0.74
3638,-0.32
3639,0.05
3640,0.41
3641,0.76
3642,1.17
3643,1.61
3644,2.05
3645,2.36
3646,2.46
3647,2.30
3648,1.93
3649,1.38
3650,0.75
3651,0.15
3652,-0.34
3653,-0.63
3654,-0.75
3655,-0.66
3656,-0.50
3657,-0.32
3658,-0.35
3659,-0.65
3660,-1.33
3661,-2.33
3662,-3.70
3663,-5.22
3664,-6.79
3665,-8.19
3666,-9.38
3667,-10.23
3668,-10.77
3669,-10.98
3670,-11.04
3671,-11.02
3672,-11.02
3673,-11.08
3674,-11.23
3675,-11.44
3676,-11.67
3677,-11.86
3678,-11.95
3679,-11.89
3680,-11.65
3681,-11.30
3682,-10.85
3683,-10.38
3684,-9.86
3685,-9.34
3686,-8.79
3687,-8.29
3688,-7.79
3689,-7.33
3690,-6.84
3691,-6.39
3692,-5.88
3693,-5.39
3694,-4.87
3695,-4.36
3696,-3.85
3697,-3.40
3698,-2.94
3699,-2.54
3700,-2.11
3701,-1.72
3702,-1.30
3703,-0.92
3704,-0.51
3705,-0.15
3706,0.24
3707,0.63
3708,1.18
3709,1.85
3710,2.65
3711,3.47
3712,4.39
3713,5.33
3714,6.29
3715,7.09
3716,7.74
3717,8.19
3718,8.57
3719,8.88
3720,9.19
3721,9.49
3722,9.79
3723,10.06
3724,10.27
3725,10.36
3726,10.31
3727,10.06
3728,9.65
3729,9.14
3730,8.58
3731,8.07
3732,7.63
3733,7.28
3734,7.01
3735,6.81
3736,6.62
3737,6.45
3738,6.26
3739,6.08
3740,5.94
3741,5.92
3742,6.00
3743,6.21
3744,6.52
3745,6.93
3746,7.38
3747,7.80
3748,8.10
3749,8.26
3750,8.27
3751,8.15
3752,7.86
3753,7.42
3754,6.86
3755,6.23
3756,5.52
3757,4.81
3758,4.14
3759,3.66
3760,3.41
3761,3.43
3762,3.62
3763,3.94
3764,4.24
3765,4.44
3766,4.42
3767,4.19
3768,3.74
3769,3.20
3770,2.64
3771,2.18
3772,1.77
3773,1.40
3774,0.96
3775,0.44
3776,-0.24
3777,-1.06
3778,-2.07
3779,-3.11
3780,-4.13
3781,-4.98
3782,-5.72
3783,-6.29
3784,-6.79
3785,-7.22
3786,-7.70
3787,-8.23
3788,-8.83
3789,-9.40
3790,-9.89
3791,-10.22
3792,-10.35
3793,-10.23
3794,-9.86
3795,-9.30
3796,-8.58
3797,-7.80
3798,-6.97
3799,-6.19
3800,-5.38
3801,-4.63
3802,-3.84
3803,-3.05
3804,-2.18
3805,-1.30
3806,-0.37
3807,0.51
3808,1.40
3809,2.19
3810,2.90
3811,3.46
3812,3.91
3813,4.20
3814,4.33
3815,4.22
3816,3.94
3817,3.55
3818,3.12
3819,2.68
3820,2.32
3821,2.11
3822,2.11
3823,2.33
3824,2.65
3825,3.00
3826,3.30
3827,3.50
3828,3.55
3829,3.45
3830,3.20
3831,2.87
3832,2.45
3833,1.98
3834,1.46
3835,0.94
3836,0.36
3837,-0.26
3838,-0.95
3839,-1.64
3840,-2.29
3841,-2.82
3842,-3.26
3843,-3.58
3844,-3.81
3845,-3.92
3846,-3.97
3847,-3.93
3848,-3.83
3849,-3.68
3850,-3.49
3851,-3.25
3852,-2.95
3853,-2.59
3854,-2.18
3855,-1.76
3856,-1.35
3857,-1.00
3858,-0.69
3859,-0.47
3860,-0.27
3861,-0.13
3862,0.02
3863,0.16
3864,0.32
3865,0.47
3866,0.60
3867,0.66
3868,0.63
3869,0.48
3870,0.20
3871,-0.22
3872,-0.76
3873,-1.37
3874,-1.97
3875,-2.51
3876,-2.96
3877,-3.30
3878,-3.49
3879,-3.54
3880,-3.47
3881,-3.32
3882,-3.15
3883,-2.99
3884,-2.88
3885,-2.85
3886,-2.93
3887,-3.05
3888,-3.11
3889,-3.07
3890,-2.88
3891,-2.55
3892,-2.04
3893,-1.46
3894,-0.85
3895,-0.34
3896,0.08
3897,0.40
3898,0.63
3899,0.76
3900,0.89
3901,1.02
3902,1.19
3903,1.34
3904,1.50
3905,1.66
3906,1.88
3907,2.14
3908,2.50
3909,2.97
3910,3.58
3911,4.26
3912,5.00
3913,5.68
3914,6.29
3915,6.80
3916,7.22
3917,7.48
3918,7.59
3919,7.58
3920,7.55
3921,7.55
3922,7.55
3923,7.52
3924,7.48
3925,7.42
3926,7.32
3927,7.14
3928,6.87
3929,6.52
3930,6.08
3931,5.61
3932,5.07
3933,4.52
3934,3.91
3935,3.33
3936,2.71
3937,2.14
3938,1.56
3939,1.03
3940,0.50
3941,0.02
3942,-0.50
3943,-0.98
3944,-1.54
3945,-2.08
3946,-2.67
3947,-3.21
3948,-3.83
3949,-4.43
3950,-5.08
3951,-5.65
3952,-6.26
3953,-6.83
3954,-7.46
3955,-8.07
3956,-8.74
3957,-9.41
3958,-10.15
3959,-10.92
3960,-11.73
3961,-12.50
3962,-13.19
3963,-13.76
3964,-14.21
3965,-14.51
3966,-14.61
3967,-14.46
3968,-14.09
3969,-13.55
3970,-12.88
3971,-12.12
3972,-11.33
3973,-10.61
3974,-10.04
3975,-9.65
3976,-9.42
3977,-9.34
3978,-9.37
3979,-9.48
3980,-9.54
3981,-9.52
3982,-9.38
3983,-9.19
3984,-9.03
3985,-8.98
3986,-9.03
3987,-9.22
3988,-9.50
3989,-9.81
3990,-10.03
3991,-10.15
3992,-10.09
3993,-9.88
3994,-9.48
3995,-8.98
3996,-8.44
3997,-7.97
3998,-7.52
3999,-7.10
4000,-6.58
4001,-5.97
4002,-5.18
4003,-4.36
4004,-3.52
4005,-2.78
4006,-2.11
4007,-1.57
4008,-1.07
4009,-0.62
4010,-0.06
4011,0.59
4012,1.33
4013,1.98
4014,2.46
4015,2.67
4016,2.64
4017,2.34
4018,1.87
4019,1.31
4020,0.89
4021,0.72
4022,0.87
4023,1.24
4024,1.73
4025,2.22
4026,2.60
4027,2.82
4028,2.85
4029,2.75
4030,2.59
4031,2.45
4032,2.32
4033,2.24
4034,2.17
4035,2.09
4036,1.91
4037,1.69
4038,1.40
4039,1.08
4040,0.66
4041,0.21
4042,-0.32
4043,-0.88
4044,-1.54
4045,-2.31
4046,-3.19
4047,-4.05
4048,-4.85
4049,-5.50
4050,-6.03
4051,-6.38
4052,-6.58
4053,-6.59
4054,-6.51
4055,-6.35
4056,-6.16
4057,-5.95
4058,-5.73
4059,-5.52
4060,-5.34
4061,-5.19
4062,-5.04
4063,-4.88
4064,-4.64
4065,-4.34
4066,-3.98
4067,-3.64
4068,-3.30
4069,-3.04
4070,-2.82
4071,-2.75
4072,-2.78
4073,-2.88
4074,-2.91
4075,-2.84
4076,-2.63
4077,-2.30
4078,-1.81
4079,-1.22
4080,-0.59
4081,-0.02
4082,0.47
4083,0.85
4084,1.13
4085,1.30
4086,1.42
4087,1.47
4088,1.48
4089,1.45
4090,1.41
4091,1.38
4092,1.32
4093,1.21
4094,1.01
4095,0.72
4096,0.31
4097,-0.16
4098,-0.67
4099,-1.08
4100,-1.36
4101,-1.47
4102,-1.50
4103,-1.53
4104,-1.58
4105,-1.70
4106,-1.93
4107,-2.30
4108,-2.73
4109,-3.11
4110,-3.26
4111,-3.11
4112,-2.69
4113,-2.09
4114,-1.37
4115,-0.62
4116,0.09
4117,0.66
4118,1.06
4119,1.34
4120,1.65
4121,2.06
4122,2.62
4123,3.25
4124,3.91
4125,4.52
4126,5.00
4127,5.28
4128,5.23
4129,4.91
4130,4.35
4131,3.64
4132,2.74
4133,1.71
4134,0.56
4135,-0.57
4136,-1.69
4137,-2.69
4138,-3.60
4139,-4.33
4140,-4.95
4141,-5.42
4142,-5.89
4143,-6.36
4144,-7.01
4145,-7.77
4146,-8.69
4147,-9.64
4148,-10.61
4149,-11.46
4150,-12.19
4151,-12.75
4152,-13.21
4153,-13.58
4154,-13.93
4155,-14.25
4156,-14.61
4157,-14.96
4158,-15.27
4159,-15.43
4160,-15.39
4161,-15.15
4162,-14.73
4163,-14.18
4164,-13.55
4165,-12.93
4166,-12.36
4167,-11.89
4168,-11.44
4169,-11.02
4170,-10.54
4171,-10.02
4172,-9.35
4173,-8.62
4174,-7.81
4175,-7.08
4176,-6.41
4177,-5.92
4178,-5.54
4179,-5.33
4180,-5.15
4181,-4.94
4182,-4.52
4183,-3.88
4184,-2.98
4185,-1.91
4186,-0.69
4187,0.43
4188,1.37
4189,1.95
4190,2.26
4191,2.28
4192,2.20
4193,2.08
4194,2.11
4195,2.33
4196,2.82
4197,3.47
4198,4.26
4199,5.04
4200,5.74
4201,6.30
4202,6.72
4203,6.98
4204,7.13
4205,7.17
4206,7.20
4207,7.23
4208,7.28
4209,7.31
4210,7.29
4211,7.19
4212,7.06
4213,6.90
4214,6.77
4215,6.65
4216,6.57
4217,6.54
4218,6.56
4219,6.65
4220,6.81
4221,7.06
4222,7.38
4223,7.71
4224,7.97
4225,8.13
4226,8.16
4227,8.07
4228,7.82
4229,7.44
4230,6.98
4231,6.52
4232,6.07
4233,5.70
4234,5.39
4235,5.15
4236,4.94
4237,4.77
4238,4.66
4239,4.70
4240,4.84
4241,5.13
4242,5.49
4243,5.91
4244,6.19
4245,6.22
4246,5.82
4247,5.07
4248,3.93
4249,2.59
4250,1.09
4251,-0.27
4252,-1.42
4253,-2.20
4254,-2.78
4255,-3.21
4256,-3.69
4257,-4.27
4258,-5.11
4259,-6.08
4260,-7.13
4261,-8.06
4262,-8.86
4263,-9.37
4264,-9.61
4265,-9.56
4266,-9.41
4267,-9.26
4268,-9.21
4269,-9.28
4270,-9.48
4271,-9.79
4272,-10.09
4273,-10.29
4274,-10.28
4275,-10.06
4276,-9.54
4277,-8.83
4278,-7.95
4279,-7.04
4280,-6.08
4281,-5.13
4282,-4.16
4283,-3.22
4284,-2.27
4285,-1.37
4286,-0.43
4287,0.48
4288,1.40
4289,2.20
4290,2.88
4291,3.36
4292,3.73
4293,3.94
4294,4.13
4295,4.29
4296,4.55
4297,4.96
4298,5.54
4299,6.21
4300,6.88
4301,7.40
4302,7.64
4303,7.52
4304,7.04
4305,6.29
4306,5.34
4307,4.35
4308,3.42
4309,2.68
4310,2.14
4311,1.83
4312,1.63
4313,1.50
4314,1.30
4315,1.03
4316,0.56
4317,-0.05
4318,-0.83
4319,-1.64
4320,-2.41
4321,-3.03
4322,-3.52
4323,-3.84
4324,-4.04
4325,-4.11
4326,-4.13
4327,-4.12
4328,-4.16
4329,-4.25
4330,-4.35
4331,-4.39
4332,-4.30
4333,-4.10
4334,-3.75
4335,-3.27
4336,-2.66
4337,-1.97
4338,-1.30
4339,-0.79
4340,-0.45
4341,-0.28
4342,-0.23
4343,-0.27
4344,-0.35
4345,-0.42
4346,-0.39
4347,-0.27
4348,-0.10
4349,0.03
4350,0.08
4351,0.01
4352,-0.15
4353,-0.37
4354,-0.60
4355,-0.81
4356,-0.99
4357,-1.13
4358,-1.25
4359,-1.40
4360,-1.63
4361,-1.93
4362,-2.27
4363,-2.53
4364,-2.69
4365,-2.72
4366,-2.65
4367,-2.43
4368,-2.08
4369,-1.65
4370,-1.25
4371,-0.94
4372,-0.72
4373,-0.59
4374,-0.53
4375,-0.60
4376,-0.74
4377,-0.94
4378,-1.11
4379,-1.24
4380,-1.26
4381,-1.14
4382,-0.85
4383,-0.40
4384,0.15
4385,0.72
4386,1.27
4387,1.74
4388,2.12
4389,2.42
4390,2.69
4391,2.94
4392,3.22
4393,3.52
4394,3.87
4395,4.26
4396,4.65
4397,4.96
4398,5.11
4399,5.07
4400,4.88
4401,4.54
4402,4.11
4403,3.66
4404,3.23
4405,2.88
4406,2.61
4407,2.43
4408,2.30
4409,2.24
4410,2.17
4411,2.14
4412,2.11
4413,2.10
4414,2.05
4415,1.98
4416,1.78
4417,1.48
4418,1.00
4419,0.38
4420,-0.41
4421,-1.27
4422,-2.18
4423,-3.01
4424,-3.78
4425,-4.45
4426,-5.07
4427,-5.56
4428,-5.98
4429,-6.29
4430,-6.58
4431,-6.87
4432,-7.23
4433,-7.60
4434,-8.01
4435,-8.42
4436,-8.86
4437,-9.31
4438,-9.74
4439,-10.10
4440,-10.38
4441,-10.55
4442,-10.64
4443,-10.64
4444,-10.54
4445,-10.37
4446,-10.12
4447,-9.81
4448,-9.47
4449,-9.12
4450,-8.76
4451,-8.43
4452,-8.12
4453,-7.85
4454,-7.64
4455,-7.49
4456,-7.38
4457,-7.27
4458,-7.13
4459,-6.97
4460,-6.84
4461,-6.78
4462,-6.79
4463,-6.88
4464,-7.06
4465,-7.38
4466,-7.76
4467,-8.13
4468,-8.38
4469,-8.51
4470,-8.52
4471,-8.43
4472,-8.21
4473,-7.91
4474,-7.61
4475,-7.43
4476,-7.36
4477,-7.41
4478,-7.49
4479,-7.57
4480,-7.51
4481,-7.27
4482,-6.72
4483,-5.95
4484,-5.00
4485,-4.08
4486,-3.23
4487,-2.59
4488,-2.11
4489,-1.80
4490,-1.54
4491,-1.30
4492,-0.95
4493,-0.51
4494,0.05
4495,0.57
4496,1.04
4497,1.37
4498,1.59
4499,1.69
4500,1.75
4501,1.82
4502,2.03
4503,2.33
4504,2.66
4505,2.90
4506,3.04
4507,3.06
4508,3.00
4509,2.87
4510,2.72
4511,2.63
4512,2.62
4513,2.72
4514,2.88
4515,3.01
4516,3.03
4517,2.92
4518,2.63
4519,2.20
4520,1.58
4521,0.87
4522,0.07
4523,-0.76
4524,-1.64
4525,-2.51
4526,-3.31
4527,-3.93
4528,-4.36
4529,-4.59
4530,-4.70
4531,-4.68
4532,-4.62
4533,-4.54
4534,-4.55
4535,-4.65
4536,-4.91
4537,-5.26
4538,-5.72
4539,-6.23
4540,-6.77
4541,-7.28
4542,-7.70
4543,-8.00
4544,-8.18
4545,-8.25
4546,-8.16
4547,-7.93
4548,-7.55
4549,-7.06
4550,-6.50
4551,-5.91
4552,-5.31
4553,-4.75
4554,-4.18
4555,-3.62
4556,-3.02
4557,-2.42
4558,-1.76
4559,-1.08
4560,-0.32
4561,0.45
4562,1.17
4563,1.70
4564,2.05
4565,2.19
4566,2.17
4567,1.97
4568,1.68
4569,1.34
4570,1.05
4571,0.90
4572,0.90
4573,1.03
4574,1.23
4575,1.42
4576,1.51
4577,1.46
4578,1.21
4579,0.82
4580,0.31
4581,-0.22
4582,-0.73
4583,-1.18
4584,-1.56
4585,-1.79
4586,-1.85
4587,-1.74
4588,-1.49
4589,-1.09
4590,-0.56
4591,0.05
4592,0.60
4593,1.00
4594,1.21
4595,1.24
4596,1.11
4597,0.85
4598,0.57
4599,0.37
4600,0.40
4601,0.66
4602,1.14
4603,1.72
4604,2.28
4605,2.69
4606,2.83
4607,2.69
4608,2.26
4609,1.72
4610,1.17
4611,0.79
4612,0.59
4613,0.58
4614,0.63
4615,0.66
4616,0.48
4617,0.05
4618,-0.72
4619,-1.70
4620,-2.84
4621,-3.94
4622,-4.97
4623,-5.81
4624,-6.52
4625,-7.09
4626,-7.71
4627,-8.36
4628,-9.16
4629,-10.02
4630,-10.97
4631,-11.86
4632,-12.63
4633,-13.15
4634,-13.48
4635,-13.62
4636,-13.64
4637,-13.57
4638,-13.47
4639,-13.38
4640,-13.32
4641,-13.24
4642,-13.07
4643,-12.81
4644,-12.44
4645,-12.03
4646,-11.54
4647,-11.01
4648,-10.41
4649,-9.83
4650,-9.24
4651,-8.64
4652,-7.99
4653,-7.35
4654,-6.75
4655,-6.30
4656,-5.98
4657,-5.84
4658,-5.89
4659,-6.17
4660,-6.58
4661,-7.06
4662,-7.46
4663,-7.78
4664,-7.92
4665,-7.84
4666,-7.45
4667,-6.84
4668,-6.03
4669,-5.17
4670,-4.22
4671,-3.24
4672,-2.27
4673,-1.41
4674,-0.63
4675,0.06
4676,0.76
4677,1.40
4678,2.03
4679,2.58
4680,3.12
4681,3.59
4682,4.01
4683,4.33
4684,4.57
4685,4.71
4686,4.79
4687,4.78
4688,4.71
4689,4.55
4690,4.36
4691,4.11
4692,3.85
4693,3.57
4694,3.33
4695,3.08
4696,2.85
4697,2.59
4698,2.38
4699,2.23
4700,2.16
4701,2.15
4702,2.24
4703,2.47
4704,2.93
4705,3.59
4706,4.39
4707,5.27
4708,6.17
4709,7.02
4710,7.66
4711,7.95
4712,7.79
4713,7.19
4714,6.19
4715,4.91
4716,3.52
4717,2.23
4718,1.18
4719,0.56
4720,0.36
4721,0.50
4722,0.81
4723,1.17
4724,1.41
4725,1.46
4726,1.18
4727,0.65
4728,-0.09
4729,-0.83
4730,-1.51
4731,-1.98
4732,-2.27
4733,-2.36
4734,-2.38
4735,-2.40
4736,-2.64
4737,-3.13
4738,-3.97
4739,-5.07
4740,-6.38
4741,-7.70
4742,-8.94
4743,-9.95
4744,-10.72
4745,-11.21
4746,-11.52
4747,-11.71
4748,-11.89
4749,-12.06
4750,-12.27
4751,-12.48
4752,-12.68
4753,-12.80
4754,-12.77
4755,-12.59
4756,-12.18
4757,-11.63
4758,-10.85
4759,-9.95
4760,-8.88
4761,-7.73
4762,-6.40
4763,-4.96
4764,-3.36
4765,-1.75
4766,-0.13
4767,1.38
4768,2.74
4769,3.77
4770,4.46
4771,4.70
4772,4.62
4773,4.20
4774,3.61
4775,2.90
4776,2.24
4777,1.72
4778,1.42
4779,1.35
4780,1.54
4781,1.95
4782,2.46
4783,2.98
4784,3.40
4785,3.72
4786,3.86
4787,3.86
4788,3.70
4789,3.47
4790,3.20
4791,2.94
4792,2.61
4793,2.24
4794,1.80
4795,1.30
4796,0.66
4797,-0.08
4798,-0.89
4799,-1.66
4800,-2.39
4801,-2.98
4802,-3.43
4803,-3.72
4804,-3.89
4805,-3.97
4806,-4.04
4807,-4.10
4808,-4.15
4809,-4.15
4810,-4.08
4811,-3.94
4812,-3.71
4813,-3.42
4814,-3.02
4815,-2.58
4816,-2.08
4817,-1.61
4818,-1.15
4819,-0.75
4820,-0.33
4821,0.11
4822,0.61
4823,1.15
4824,1.72
4825,2.30
4826,2.82
4827,3.22
4828,3.40
4829,3.32
4830,2.91
4831,2.22
4832,1.32
4833,0.30
4834,-0.80
4835,-1.91
4836,-2.97
4837,-3.87
4838,-4.54
4839,-4.95
4840,-5.14
4841,-5.10
4842,-4.88
4843,-4.52
4844,-4.10
4845,-3.73
4846,-3.46
4847,-3.25
4848,-3.08
4849,-2.88
4850,-2.59
4851,-2.17
4852,-1.61
4853,-0.98
4854,-0.37
4855,0.11
4856,0.42
4857,0.46
4858,0.30
4859,-0.02
4860,-0.32
4861,-0.49
4862,-0.43
4863,-0.17
4864,0.33
4865,0.95
4866,1.63
4867,2.22
4868,2.72
4869,3.06
4870,3.33
4871,3.52
4872,3.72
4873,3.95
4874,4.25
4875,4.55
4876,4.81
4877,5.00
4878,5.12
4879,5.17
4880,5.14
4881,5.06
4882,4.94
4883,4.83
4884,4.66
4885,4.41
4886,4.00
4887,3.47
4888,2.81
4889,2.07
4890,1.22
4891,0.34
4892,-0.59
4893,-1.46
4894,-2.33
4895,-3.09
4896,-3.79
4897,-4.37
4898,-4.91
4899,-5.34
4900,-5.72
4901,-6.00
4902,-6.26
4903,-6.48
4904,-6.76
4905,-7.08
4906,-7.48
4907,-7.90
4908,-8.30
4909,-8.61
4910,-8.90
4911,-9.09
4912,-9.23
4913,-9.31
4914,-9.41
4915,-9.54
4916,-9.76
4917,-10.02
4918,-10.38
4919,-10.80
4920,-11.25
4921,-11.67
4922,-12.03
4923,-12.33
4924,-12.54
4925,-12.66
4926,-12.69
4927,-12.60
4928,-12.39
4929,-12.06
4930,-11.62
4931,-11.11
4932,-10.58
4933,-10.10
4934,-9.67
4935,-9.32
4936,-9.02
4937,-8.78
4938,-8.60
4939,-8.45
4940,-8.32
4941,-8.21
4942,-8.09
4943,-8.00
4944,-7.93
4945,-7.94
4946,-8.03
4947,-8.18
4948,-8.37
4949,-8.58
4950,-8.80
4951,-9.02
4952,-9.19
4953,-9.28
4954,-9.28
4955,-9.26
4956,-9.22
4957,-9.13
4958,-8.93
4959,-8.68
4960,-8.38
4961,-8.06
4962,-7.61
4963,-7.06
4964,-6.40
4965,-5.74
4966,-5.08
4967,-4.48
4968,-3.88
4969,-3.36
4970,-2.85
4971,-2.38
4972,-1.91
4973,-1.48
4974,-1.03
4975,-0.62
4976,-0.23
4977,0.08
4978,0.36
4979,0.56
4980,0.76
4981,0.92
4982,1.10
4983,1.27
4984,1.45
4985,1.63
4986,1.82
4987,1.96
4988,2.06
4989,2.12
4990,2.15
4991,2.22
4992,2.32
4993,2.45
4994,2.53
4995,2.51
4996,2.36
4997,2.13
4998,1.79
4999,1.34
5000,0.76
5001,0.08
5002,-0.69
5003,-1.46
5004,-2.23
5005,-2.91
5006,-3.51
5007,-3.97
5008,-4.35
5009,-4.63
5010,-4.91
5011,-5.22
5012,-5.64
5013,-6.14
5014,-6.74
5015,-7.34
5016,-7.87
5017,-8.22
5018,-8.42
5019,-8.40
5020,-8.25
5021,-8.02
5022,-7.86
5023,-7.85
5024,-8.03
5025,-8.35
5026,-8.71
5027,-9.05
5028,-9.28
5029,-9.38
5030,-9.26
5031,-8.94
5032,-8.44
5033,-7.87
5034,-7.26
5035,-6.64
5036,-5.98
5037,-5.31
5038,-4.55
5039,-3.77
5040,-2.88
5041,-1.97
5042,-1.01
5043,-0.14
5044,0.56
5045,1.05
5046,1.33
5047,1.42
5048,1.40
5049,1.30
5050,1.24
5051,1.17
5052,1.08
5053,0.92
5054,0.74
5055,0.50
5056,0.17
5057,-0.24
5058,-0.71
5059,-1.10
5060,-1.38
5061,-1.53
5062,-1.59
5063,-1.63
5064,-1.74
5065,-1.97
5066,-2.36
5067,-2.85
5068,-3.34
5069,-3.71
5070,-3.86
5071,-3.75
5072,-3.36
5073,-2.78
5074,-2.11
5075,-1.50
5076,-1.08
5077,-0.87
5078,-0.83
5079,-0.91
5080,-1.00
5081,-1.05
5082,-0.93
5083,-0.66
5084,-0.28
5085,0.08
5086,0.34
5087,0.43
5088,0.36
5089,0.17
5090,-0.05
5091,-0.20
5092,-0.25
5093,-0.18
5094,-0.05
5095,0.10
5096,0.11
5097,-0.08
5098,-0.60
5099,-1.39
5100,-2.46
5101,-3.61
5102,-4.82
5103,-5.94
5104,-7.02
5105,-7.99
5106,-8.93
5107,-9.81
5108,-10.68
5109,-11.48
5110,-12.21
5111,-12.75
5112,-13.05
5113,-13.07
5114,-12.87
5115,-12.50
5116,-12.02
5117,-11.48
5118,-10.93
5119,-10.40
5120,-9.87
5121,-9.38
5122,-8.85
5123,-8.32
5124,-7.74
5125,-7.15
5126,-6.52
5127,-5.95
5128,-5.37
5129,-4.78
5130,-4.10
5131,-3.40
5132,-2.71
5133,-2.11
5134,-1.58
5135,-1.21
5136,-1.01
5137,-1.01
5138,-1.13
5139,-1.34
5140,-1.56
5141,-1.75
5142,-1.77
5143,-1.64
5144,-1.34
5145,-0.95
5146,-0.47
5147,0.08
5148,0.72
5149,1.34
5150,1.97
5151,2.59
5152,3.24
5153,3.89
5154,4.55
5155,5.17
5156,5.78
5157,6.36
5158,6.95
5159,7.48
5160,7.95
5161,8.27
5162,8.47
5163,8.52
5164,8.46
5165,8.28
5166,8.01
5167,7.68
5168,7.32
5169,6.99
5170,6.69
5171,6.45
5172,6.27
5173,6.13
5174,5.97
5175,5.79
5176,5.61
5177,5.45
5178,5.36
5179,5.33
5180,5.38
5181,5.49
5182,5.71
5183,6.00
5184,6.38
5185,6.80
5186,7.23
5187,7.66
5188,8.02
5189,8.26
5190,8.33
5191,8.19
5192,7.82
5193,7.28
5194,6.63
5195,5.94
5196,5.23
5197,4.58
5198,4.01
5199,3.62
5200,3.43
5201,3.48
5202,3.69
5203,4.07
5204,4.49
5205,4.90
5206,5.17
5207,5.25
5208,5.04
5209,4.56
5210,3.83
5211,3.03
5212,2.24
5213,1.62
5214,1.14
5215,0.85
5216,0.58
5217,0.26
5218,-0.32
5219,-1.14
5220,-2.24
5221,-3.43
5222,-4.66
5223,-5.76
5224,-6.74
5225,-7.48
5226,-8.08
5227,-8.53
5228,-9.01
5229,-9.56
5230,-10.24
5231,-10.89
5232,-11.47
5233,-11.86
5234,-12.08
5235,-12.10
5236,-11.93
5237,-11.63
5238,-11.27
5239,-10.94
5240,-10.64
5241,-10.31
5242,-9.90
5243,-9.37
5244,-8.71
5245,-7.96
5246,-7.12
5247,-6.35
5248,-5.74
5249,-5.42
5250,-5.31
5251,-5.40
5252,-5.62
5253,-5.93
5254,-6.18
5255,-6.32
5256,-6.29
5257,-6.17
5258,-5.94
5259,-5.62
5260,-5.21
5261,-4.74
5262,-4.20
5263,-3.67
5264,-3.14
5265,-2.66
5266,-2.23
5267,-1.87
5268,-1.60
5269,-1.43
5270,-1.30
5271,-1.22
5272,-1.16
5273,-1.12
5274,-1.12
5275,-1.14
5276,-1.25
5277,-1.49
5278,-1.90
5279,-2.50
5280,-3.27
5281,-4.14
5282,-5.05
5283,-5.92
5284,-6.68
5285,-7.19
5286,-7.39
5287,-7.23
5288,-6.78
5289,-6.11
5290,-5.31
5291,-4.47
5292,-3.66
5293,-3.01
5294,-2.56
5295,-2.30
5296,-2.13
5297,-1.96
5298,-1.72
5299,-1.39
5300,-0.95
5301,-0.44
5302,0.09
5303,0.54
5304,0.82
5305,0.85
5306,0.64
5307,0.22
5308,-0.37
5309,-1.07
5310,-1.79
5311,-2.45
5312,-3.04
5313,-3.56
5314,-4.05
5315,-4.50
5316,-4.91
5317,-5.23
5318,-5.48
5319,-5.58
5320,-5.58
5321,-5.42
5322,-5.16
5323,-4.78
5324,-4.39
5325,-4.06
5326,-3.84
5327,-3.75
5328,-3.77
5329,-3.85
5330,-3.88
5331,-3.86
5332,-3.72
5333,-3.45
5334,-3.07
5335,-2.69
5336,-2.38
5337,-2.27
5338,-2.31
5339,-2.48
5340,-2.66
5341,-2.81
5342,-2.76
5343,-2.51
5344,-1.98
5345,-1.26
5346,-0.42
5347,0.39
5348,1.11
5349,1.69
5350,2.20
5351,2.60
5352,2.96
5353,3.28
5354,3.62
5355,3.98
5356,4.32
5357,4.57
5358,4.68
5359,4.62
5360,4.38
5361,4.03
5362,3.59
5363,3.14
5364,2.66
5365,2.20
5366,1.72
5367,1.20
5368,0.52
5369,-0.27
5370,-1.16
5371,-2.01
5372,-2.85
5373,-3.61
5374,-4.34
5375,-4.91
5376,-5.40
5377,-5.79
5378,-6.27
5379,-6.77
5380,-7.39
5381,-8.03
5382,-8.80
5383,-9.64
5384,-10.60
5385,-11.60
5386,-12.70
5387,-13.79
5388,-14.90
5389,-15.93
5390,-16.93
5391,-17.78
5392,-18.49
5393,-19.02
5394,-19.45
5395,-19.73
5396,-19.91
5397,-19.96
5398,-19.96
5399,-19.95
5400,-19.94
5401,-19.93
5402,-19.85
5403,-19.74
5404,-19.56
5405,-19.31
5406,-18.89
5407,-18.32
5408,-17.49
5409,-16.48
5410,-15.27
5411,-13.99
5412,-12.68
5413,-11.46
5414,-10.35
5415,-9.47
5416,-8.79
5417,-8.39
5418,-8.19
5419,-8.15
5420,-8.13
5421,-8.16
5422,-8.16
5423,-8.17
5424,-8.10
5425,-8.00
5426,-7.85
5427,-7.74
5428,-7.62
5429,-7.52
5430,-7.35
5431,-7.13
5432,-6.77
5433,-6.37
5434,-5.91
5435,-5.51
5436,-5.11
5437,-4.77
5438,-4.40
5439,-4.04
5440,-3.58
5441,-3.03
5442,-2.29
5443,-1.44
5444,-0.47
5445,0.44
5446,1.30
5447,2.00
5448,2.59
5449,3.05
5450,3.48
5451,3.88
5452,4.36
5453,4.84
5454,5.38
5455,5.81
5456,6.15
5457,6.28
5458,6.29
5459,6.17
5460,6.10
5461,6.10
5462,6.31
5463,6.73
5464,7.35
5465,8.05
5466,8.71
5467,9.22
5468,9.57
5469,9.77
5470,9.83
5471,9.77
5472,9.61
5473,9.41
5474,9.17
5475,8.87
5476,8.46
5477,7.93
5478,7.31
5479,6.65
5480,5.94
5481,5.23
5482,4.53
5483,3.92
5484,3.33
5485,2.78
5486,2.19
5487,1.63
5488,1.08
5489,0.59
5490,0.11
5491,-0.32
5492,-0.76
5493,-1.14
5494,-1.50
5495,-1.75
5496,-1.93
5497,-2.01
5498,-2.07
5499,-2.11
5500,-2.20
5501,-2.31
5502,-2.48
5503,-2.72
5504,-3.04
5505,-3.40
5506,-3.74
5507,-3.98
5508,-4.10
5509,-4.10
5510,-3.98
5511,-3.78
5512,-3.49
5513,-3.20
5514,-2.91
5515,-2.66
5516,-2.37
5517,-1.98
5518,-1.43
5519,-0.72
5520,0.12
5521,0.98
5522,1.84
5523,2.62
5524,3.29
5525,3.77
5526,4.03
5527,4.04
5528,3.90
5529,3.65
5530,3.35
5531,3.00
5532,2.57
5533,2.10
5534,1.56
5535,1.01
5536,0.41
5537,-0.18
5538,-0.79
5539,-1.34
5540,-1.88
5541,-2.35
5542,-2.80
5543,-3.20
5544,-3.59
5545,-3.94
5546,-4.29
5547,-4.59
5548,-4.82
5549,-4.94
5550,-4.91
5551,-4.70
5552,-4.32
5553,-3.81
5554,-3.23
5555,-2.66
5556,-2.13
5557,-1.71
5558,-1.42
5559,-1.28
5560,-1.24
5561,-1.19
5562,-1.05
5563,-0.78
5564,-0.40
5565,0.03
5566,0.44
5567,0.74
5568,0.85
5569,0.76
5570,0.54
5571,0.30
5572,0.07
5573,-0.10
5574,-0.24
5575,-0.35
5576,-0.49
5577,-0.71
5578,-1.14
5579,-1.79
5580,-2.66
5581,-3.58
5582,-4.49
5583,-5.28
5584,-6.00
5585,-6.61
5586,-7.18
5587,-7.73
5588,-8.38
5589,-9.16
5590,-10.06
5591,-10.95
5592,-11.80
5593,-12.47
5594,-12.98
5595,-13.21
5596,-13.18
5597,-12.90
5598,-12.45
5599,-11.93
5600,-11.44
5601,-11.02
5602,-10.70
5603,-10.47
5604,-10.27
5605,-10.11
5606,-9.88
5607,-9.57
5608,-9.08
5609,-8.50
5610,-7.80
5611,-7.13
5612,-6.45
5613,-5.91
5614,-5.45
5615,-5.11
5616,-4.77
5617,-4.47
5618,-4.14
5619,-3.83
5620,-3.41
5621,-2.96
5622,-2.44
5623,-1.95
5624,-1.37
5625,-0.73
5626,0.03
5627,0.84
5628,1.77
5629,2.72
5630,3.68
5631,4.49
5632,5.20
5633,5.75
5634,6.24
5635,6.61
5636,6.91
5637,7.10
5638,7.29
5639,7.46
5640,7.64
5641,7.74
5642,7.82
5643,7.87
5644,7.95
5645,8.04
5646,8.13
5647,8.22
5648,8.30
5649,8.37
5650,8.36
5651,8.22
5652,7.90
5653,7.39
5654,6.70
5655,5.91
5656,5.17
5657,4.59
5658,4.28
5659,4.31
5660,4.67
5661,5.31
5662,6.11
5663,6.92
5664,7.52
5665,7.81
5666,7.69
5667,7.23
5668,6.53
5669,5.78
5670,5.10
5671,4.62
5672,4.34
5673,4.27
5674,4.33
5675,4.43
5676,4.43
5677,4.26
5678,3.91
5679,3.46
5680,2.97
5681,2.55
5682,2.24
5683,2.12
5684,2.20
5685,2.43
5686,2.66
5687,2.77
5688,2.64
5689,2.29
5690,1.69
5691,0.98
5692,0.23
5693,-0.39
5694,-0.87
5695,-1.14
5696,-1.34
5697,-1.51
5698,-1.88
5699,-2.45
5700,-3.33
5701,-4.43
5702,-5.74
5703,-7.05
5704,-8.26
5705,-9.18
5706,-9.85
5707,-10.28
5708,-10.54
5709,-10.65
5710,-10.68
5711,-10.68
5712,-10.67
5713,-10.59
5714,-10.33
5715,-9.86
5716,-9.18
5717,-8.34
5718,-7.37
5719,-6.36
5720,-5.33
5721,-4.41
5722,-3.59
5723,-2.98
5724,-2.53
5725,-2.22
5726,-1.96
5727,-1.75
5728,-1.49
5729,-1.23
5730,-0.89
5731,-0.55
5732,-0.18
5733,0.18
5734,0.53
5735,0.82
5736,1.03
5737,1.11
5738,1.14
5739,1.16
5740,1.19
5741,1.26
5742,1.35
5743,1.44
5744,1.50
5745,1.51
5746,1.45
5747,1.30
5748,1.01
5749,0.64
5750,0.21
5751,-0.21
5752,-0.66
5753,-1.11
5754,-1.63
5755,-2.13
5756,-2.62
5757,-3.07
5758,-3.49
5759,-3.86
5760,-4.24
5761,-4.65
5762,-5.16
5763,-5.75
5764,-6.42
5765,-7.09
5766,-7.68
5767,-8.12
5768,-8.27
5769,-8.03
5770,-7.36
5771,-6.36
5772,-5.20
5773,-4.02
5774,-2.91
5775,-1.96
5776,-1.21
5777,-0.74
5778,-0.48
5779,-0.38
5780,-0.33
5781,-0.31
5782,-0.28
5783,-0.25
5784,-0.21
5785,-0.18
5786,-0.18
5787,-0.21
5788,-0.27
5789,-0.41
5790,-0.70
5791,-1.14
5792,-1.74
5793,-2.43
5794,-3.21
5795,-4.01
5796,-4.78
5797,-5.43
5798,-6.00
5799,-6.45
5800,-6.74
5801,-6.83
5802,-6.73
5803,-6.48
5804,-6.13
5805,-5.71
5806,-5.25
5807,-4.76
5808,-4.30
5809,-3.88
5810,-3.51
5811,-3.19
5812,-2.88
5813,-2.59
5814,-2.29
5815,-1.99
5816,-1.71
5817,-1.54
5818,-1.50
5819,-1.59
5820,-1.75
5821,-1.95
5822,-2.13
5823,-2.26
5824,-2.24
5825,-2.08
5826,-1.75
5827,-1.33
5828,-0.80
5829,-0.21
5830,0.43
5831,1.12
5832,1.86
5833,2.61
5834,3.28
5835,3.77
5836,4.04
5837,4.07
5838,3.86
5839,3.47
5840,2.94
5841,2.33
5842,1.72
5843,1.19
5844,0.74
5845,0.39
5846,0.07
5847,-0.27
5848,-0.70
5849,-1.21
5850,-1.82
5851,-2.43
5852,-3.07
5853,-3.64
5854,-4.20
5855,-4.66
5856,-5.09
5857,-5.45
5858,-5.87
5859,-6.34
5860,-6.89
5861,-7.45
5862,-8.04
5863,-8.59
5864,-9.14
5865,-9.61
5866,-10.05
5867,-10.41
5868,-10.79
5869,-11.15
5870,-11.60
5871,-12.06
5872,-12.60
5873,-13.15
5874,-13.80
5875,-14.47
5876,-15.19
5877,-15.89
5878,-16.62
5879,-17.29
5880,-17.93
5881,-18.49
5882,-19.01
5883,-19.46
5884,-19.82
5885,-20.03
5886,-20.08
5887,-19.99
5888,-19.77
5889,-19.41
5890,-18.91
5891,-18.35
5892,-17.75
5893,-17.14
5894,-16.53
5895,-15.98
5896,-15.49
5897,-15.11
5898,-14.77
5899,-14.48
5900,-14.22
5901,-14.05
5902,-13.92
5903,-13.87
5904,-13.88
5905,-14.01
5906,-14.22
5907,-14.48
5908,-14.66
5909,-14.73
5910,-14.66
5911,-14.45
5912,-14.08
5913,-13.62
5914,-13.08
5915,-12.60
5916,-12.20
5917,-11.96
5918,-11.77
5919,-11.67
5920,-11.52
5921,-11.28
5922,-10.80
5923,-10.10
5924,-9.13
5925,-8.03
5926,-6.85
5927,-5.78
5928,-4.86
5929,-4.19
5930,-3.72
5931,-3.48
5932,-3.33
5933,-3.23
5934,-3.07
5935,-2.88
5936,-2.59
5937,-2.30
5938,-2.00
5939,-1.77
5940,-1.59
5941,-1.53
5942,-1.48
5943,-1.40
5944,-1.20
5945,-0.91
5946,-0.53
5947,-0.11
5948,0.36
5949,0.83
5950,1.27
5951,1.63
5952,1.93
5953,2.16
5954,2.33
5955,2.43
5956,2.45
5957,2.39
5958,2.24
5959,2.06
5960,1.88
5961,1.73
5962,1.61
5963,1.46
5964,1.23
5965,0.91
5966,0.49
5967,-0.02
5968,-0.64
5969,-1.32
5970,-2.01
5971,-2.61
5972,-3.08
5973,-3.40
5974,-3.60
5975,-3.65
5976,-3.61
5977,-3.51
5978,-3.41
5979,-3.31
5980,-3.23
5981,-3.17
5982,-3.18
5983,-3.33
5984,-3.61
5985,-3.97
5986,-4.37
5987,-4.75
5988,-5.00
5989,-5.10
5990,-4.96
5991,-4.64
5992,-4.19
5993,-3.68
5994,-3.11
5995,-2.54
5996,-2.04
5997,-1.63
5998,-1.22
5999,-0.72
6000,-0.08
6001,0.60
6002,1.28
6003,1.85
6004,2.28
6005,2.46
6006,2.34
6007,1.92
6008,1.27
6009,0.54
6010,-0.17
6011,-0.76
6012,-1.21
6013,-1.50
6014,-1.71
6015,-1.90
6016,-2.18
6017,-2.56
6018,-3.07
6019,-3.66
6020,-4.34
6021,-5.00
6022,-5.58
6023,-6.07
6024,-6.44
6025,-6.73
6026,-6.95
6027,-7.11
6028,-7.19
6029,-7.17
6030,-6.97
6031,-6.52
6032,-5.81
6033,-4.91
6034,-3.90
6035,-2.91
6036,-2.03
6037,-1.40
6038,-1.05
6039,-1.01
6040,-1.16
6041,-1.40
6042,-1.56
6043,-1.63
6044,-1.55
6045,-1.37
6046,-1.12
6047,-0.88
6048,-0.70
6049,-0.63
6050,-0.70
6051,-0.89
6052,-1.16
6053,-1.43
6054,-1.65
6055,-1.75
6056,-1.82
6057,-1.91
6058,-2.17
6059,-2.57
6060,-3.19
6061,-3.92
6062,-4.78
6063,-5.67
6064,-6.60
6065,-7.42
6066,-8.13
6067,-8.69
6068,-9.20
6069,-9.68
6070,-10.20
6071,-10.67
6072,-11.13
6073,-11.51
6074,-11.80
6075,-11.92
6076,-11.88
6077,-11.69
6078,-11.42
6079,-11.12
6080,-10.81
6081,-10.54
6082,-10.32
6083,-10.15
6084,-9.96
6085,-9.70
6086,-9.33
6087,-8.85
6088,-8.28
6089,-7.71
6090,-7.20
6091,-6.82
6092,-6.53
6093,-6.34
6094,-6.17
6095,-6.01
6096,-5.75
6097,-5.44
6098,-5.03
6099,-4.59
6100,-4.09
6101,-3.59
6102,-3.07
6103,-2.65
6104,-2.27
6105,-1.95
6106,-1.60
6107,-1.23
6108,-0.79
6109,-0.39
6110,0.02
6111,0.33
6112,0.59
6113,0.72
6114,0.81
6115,0.92
6116,1.13
6117,1.42
6118,1.78
6119,2.16
6120,2.59
6121,3.03
6122,3.49
6123,3.91
6124,4.29
6125,4.61
6126,4.90
6127,5.13
6128,5.31
6129,5.37
6130,5.27
6131,5.00
6132,4.59
6133,4.10
6134,3.62
6135,3.20
6136,2.89
6137,2.70
6138,2.65
6139,2.72
6140,2.87
6141,3.02
6142,3.13
6143,3.18
6144,3.23
6145,3.32
6146,3.44
6147,3.59
6148,3.78
6149,3.98
6150,4.22
6151,4.46
6152,4.70
6153,4.90
6154,5.06
6155,5.18
6156,5.28
6157,5.33
6158,5.34
6159,5.31
6160,5.29
6161,5.32
6162,5.36
6163,5.41
6164,5.39
6165,5.27
6166,5.02
6167,4.61
6168,4.02
6169,3.33
6170,2.61
6171,2.02
6172,1.61
6173,1.47
6174,1.54
6175,1.79
6176,2.00
6177,2.07
6178,1.77
6179,1.11
6180,0.00
6181,-1.34
6182,-2.85
6183,-4.31
6184,-5.68
6185,-6.80
6186,-7.68
6187,-8.32
6188,-8.89
6189,-9.44
6190,-10.01
6191,-10.55
6192,-11.05
6193,-11.41
6194,-11.55
6195,-11.38
6196,-10.86
6197,-10.09
6198,-9.11
6199,-8.06
6200,-6.95
6201,-5.91
6202,-4.88
6203,-3.91
6204,-2.86
6205,-1.79
6206,-0.62
6207,0.50
6208,1.66
6209,2.73
6210,3.77
6211,4.58
6212,5.25
6213,5.75
6214,6.26
6215,6.75
6216,7.28
6217,7.80
6218,8.40
6219,8.98
6220,9.54
6221,9.92
6222,10.12
6223,10.12
6224,9.96
6225,9.67
6226,9.35
6227,9.04
6228,8.82
6229,8.74
6230,8.80
6231,9.00
6232,9.20
6233,9.35
6234,9.30
6235,9.04
6236,8.49
6237,7.69
6238,6.64
6239,5.46
6240,4.19
6241,3.00
6242,1.92
6243,1.07
6244,0.40
6245,0.00
6246,-0.21
6247,-0.26
6248,-0.27
6249,-0.31
6250,-0.48
6251,-0.77
6252,-1.20
6253,-1.68
6254,-2.14
6255,-2.49
6256,-2.61
6257,-2.43
6258,-1.91
6259,-1.16
6260,-0.30
6261,0.50
6262,1.11
6263,1.43
6264,1.43
6265,1.19
6266,0.84
6267,0.52
6268,0.33
6269,0.31
6270,0.47
6271,0.74
6272,1.00
6273,1.14
6274,1.08
6275,0.80
6276,0.33
6277,-0.24
6278,-0.81
6279,-1.33
6280,-1.80
6281,-2.18
6282,-2.42
6283,-2.52
6284,-2.50
6285,-2.41
6286,-2.20
6287,-1.85
6288,-1.39
6289,-0.83
6290,-0.24
6291,0.33
6292,0.82
6293,1.21
6294,1.50
6295,1.67
6296,1.73
6297,1.63
6298,1.42
6299,1.10
6300,0.79
6301,0.53
6302,0.43
6303,0.51
6304,0.84
6305,1.40
6306,2.20
6307,3.10
6308,4.00
6309,4.75
6310,5.32
6311,5.66
6312,5.82
6313,5.87
6314,5.94
6315,6.10
6316,6.42
6317,6.81
6318,7.23
6319,7.62
6320,7.92
6321,8.04
6322,7.97
6323,7.69
6324,7.28
6325,6.82
6326,6.38
6327,6.00
6328,5.66
6329,5.40
6330,5.20
6331,5.06
6332,4.91
6333,4.78
6334,4.59
6335,4.33
6336,3.91
6337,3.37
6338,2.66
6339,1.85
6340,0.95
6341,0.08
6342,-0.74
6343,-1.36
6344,-1.82
6345,-2.09
6346,-2.28
6347,-2.41
6348,-2.64
6349,-3.00
6350,-3.60
6351,-4.36
6352,-5.29
6353,-6.21
6354,-7.10
6355,-7.83
6356,-8.46
6357,-8.98
6358,-9.46
6359,-9.86
6360,-10.27
6361,-10.64
6362,-11.04
6363,-11.36
6364,-11.60
6365,-11.68
6366,-11.65
6367,-11.52
6368,-11.35
6369,-11.16
6370,-10.99
6371,-10.85
6372,-10.72
6373,-10.54
6374,-10.26
6375,-9.88
6376,-9.41
6377,-8.89
6378,-8.35
6379,-7.91
6380,-7.64
6381,-7.58
6382,-7.70
6383,-8.01
6384,-8.46
6385,-8.96
6386,-9.32
6387,-9.45
6388,-9.32
6389,-8.98
6390,-8.48
6391,-7.91
6392,-7.35
6393,-6.94
6394,-6.70
6395,-6.65
6396,-6.71
6397,-6.85
6398,-6.96
6399,-6.95
6400,-6.68
6401,-6.16
6402,-5.39
6403,-4.49
6404,-3.49
6405,-2.51
6406,-1.62
6407,-0.96
6408,-0.52
6409,-0.34
6410,-0.32
6411,-0.37
6412,-0.30
6413,-0.11
6414,0.24
6415,0.72
6416,1.34
6417,2.02
6418,2.71
6419,3.27
6420,3.72
6421,4.06
6422,4.34
6423,4.55
6424,4.71
6425,4.78
6426,4.82
6427,4.78
6428,4.71
6429,4.59
6430,4.46
6431,4.40
6432,4.43
6433,4.56
6434,4.71
6435,4.81
6436,4.80
6437,4.63
6438,4.22
6439,3.60
6440,2.79
6441,1.93
6442,1.03
6443,0.21
6444,-0.54
6445,-1.15
6446,-1.68
6447,-2.11
6448,-2.55
6449,-2.98
6450,-3.49
6451,-4.04
6452,-4.68
6453,-5.33
6454,-5.96
6455,-6.43
6456,-6.74
6457,-6.82
6458,-6.70
6459,-6.39
6460,-5.99
6461,-5.61
6462,-5.42
6463,-5.47
6464,-5.78
6465,-6.29
6466,-6.98
6467,-7.74
6468,-8.41
6469,-8.87
6470,-9.06
6471,-9.00
6472,-8.73
6473,-8.36
6474,-7.96
6475,-7.61
6476,-7.31
6477,-7.08
6478,-6.84
6479,-6.52
6480,-6.07
6481,-5.47
6482,-4.71
6483,-3.92
6484,-3.15
6485,-2.52
6486,-2.03
6487,-1.71
6488,-1.53
6489,-1.52
6490,-1.59
6491,-1.69
6492,-1.72
6493,-1.75
6494,-1.85
6495,-2.04
6496,-2.38
6497,-2.86
6498,-3.52
6499,-4.30
6500,-5.10
6501,-5.80
6502,-6.33
6503,-6.63
6504,-6.66
6505,-6.48
6506,-6.16
6507,-5.82
6508,-5.50
6509,-5.21
6510,-4.94
6511,-4.61
6512,-4.17
6513,-3.57
6514,-2.82
6515,-2.01
6516,-1.21
6517,-0.55
6518,-0.14
6519,-0.08
6520,-0.35
6521,-0.91
6522,-1.61
6523,-2.29
6524,-2.75
6525,-2.87
6526,-2.65
6527,-2.18
6528,-1.64
6529,-1.17
6530,-0.93
6531,-0.98
6532,-1.38
6533,-2.07
6534,-2.96
6535,-3.83
6536,-4.57
6537,-5.03
6538,-5.27
6539,-5.33
6540,-5.38
6541,-5.44
6542,-5.66
6543,-6.02
6544,-6.64
6545,-7.43
6546,-8.44
6547,-9.48
6548,-10.50
6549,-11.41
6550,-12.29
6551,-13.08
6552,-13.79
6553,-14.30
6554,-14.63
6555,-14.80
6556,-14.85
6557,-14.82
6558,-14.73
6559,-14.58
6560,-14.34
6561,-14.00
6562,-13.50
6563,-12.85
6564,-12.00
6565,-11.05
6566,-10.03
6567,-9.08
6568,-8.18
6569,-7.45
6570,-6.89
6571,-6.54
6572,-6.32
6573,-6.19
6574,-6.07
6575,-5.93
6576,-5.70
6577,-5.44
6578,-5.17
6579,-5.06
6580,-5.10
6581,-5.35
6582,-5.63
6583,-5.91
6584,-5.97
6585,-5.78
6586,-5.20
6587,-4.29
6588,-3.06
6589,-1.75
6590,-0.47
6591,0.57
6592,1.36
6593,1.83
6594,2.16
6595,2.40
6596,2.73
6597,3.21
6598,3.96
6599,4.88
6600,5.95
6601,6.96
6602,7.87
6603,8.54
6604,9.02
6605,9.25
6606,9.28
6607,9.17
6608,9.06
6609,8.99
6610,8.97
6611,8.95
6612,8.88
6613,8.70
6614,8.38
6615,7.93
6616,7.38
6617,6.77
6618,6.16
6619,5.65
6620,5.35
6621,5.31
6622,5.55
6623,6.04
6624,6.71
6625,7.42
6626,8.09
6627,8.64
6628,9.06
6629,9.35
6630,9.53
6631,9.65
6632,9.76
6633,9.85
6634,9.87
6635,9.74
6636,9.36
6637,8.73
6638,7.85
6639,6.84
6640,5.78
6641,4.85
6642,4.10
6643,3.67
6644,3.56
6645,3.75
6646,4.07
6647,4.41
6648,4.58
6649,4.56
6650,4.27
6651,3.80
6652,3.19
6653,2.66
6654,2.26
6655,2.07
6656,2.00
6657,2.04
6658,1.99
6659,1.78
6660,1.20
6661,0.29
6662,-0.94
6663,-2.29
6664,-3.68
6665,-4.94
6666,-5.96
6667,-6.64
6668,-7.03
6669,-7.23
6670,-7.34
6671,-7.39
6672,-7.41
6673,-7.41
6674,-7.39
6675,-7.32
6676,-7.08
6677,-6.70
6678,-6.19
6679,-5.63
6680,-4.95
6681,-4.17
6682,-3.21
6683,-2.12
6684,-0.82
6685,0.60
6686,2.14
6687,3.61
6688,4.90
6689,5.81
6690,6.35
6691,6.42
6692,6.13
6693,5.50
6694,4.70
6695,3.81
6696,3.01
6697,2.37
6698,1.94
6699,1.70
6700,1.67
6701,1.82
6702,2.11
6703,2.47
6704,2.85
6705,3.22
6706,3.51
6707,3.73
6708,3.85
6709,3.88
6710,3.82
6711,3.68
6712,3.43
6713,3.11
6714,2.69
6715,2.22
6716,1.69
6717,1.12
6718,0.51
6719,-0.08
6720,-0.65
6721,-1.17
6722,-1.74
6723,-2.38
6724,-3.11
6725,-3.84
6726,-4.49
6727,-4.94
6728,-5.14
6729,-5.05
6730,-4.68
6731,-4.14
6732,-3.49
6733,-2.92
6734,-2.50
6735,-2.29
6736,-2.14
6737,-1.92
6738,-1.50
6739,-0.85
6740,0.05
6741,1.10
6742,2.27
6743,3.40
6744,4.37
6745,5.04
6746,5.38
6747,5.39
6748,5.12
6749,4.61
6750,3.93
6751,3.11
6752,2.20
6753,1.24
6754,0.31
6755,-0.53
6756,-1.24
6757,-1.78
6758,-2.11
6759,-2.23
6760,-2.16
6761,-1.95
6762,-1.64
6763,-1.28
6764,-0.90
6765,-0.51
6766,-0.12
6767,0.23
6768,0.56
6769,0.85
6770,1.15
6771,1.46
6772,1.88
6773,2.37
6774,2.98
6775,3.67
6776,4.43
6777,5.15
6778,5.75
6779,6.07
6780,6.11
6781,5.87
6782,5.52
6783,5.17
6784,5.00
6785,5.07
6786,5.44
6787,6.03
6788,6.84
6789,7.70
6790,8.54
6791,9.22
6792,9.76
6793,10.13
6794,10.42
6795,10.64
6796,10.89
6797,11.22
6798,11.65
6799,12.14
6800,12.60
6801,12.96
6802,13.18
6803,13.25
6804,13.11
6805,12.76
6806,12.17
6807,11.43
6808,10.58
6809,9.73
6810,8.83
6811,7.97
6812,7.16
6813,6.48
6814,5.91
6815,5.45
6816,5.01
6817,4.64
6818,4.27
6819,3.97
6820,3.62
6821,3.26
6822,2.78
6823,2.33
6824,1.83
6825,1.37
6826,0.83
6827,0.27
6828,-0.40
6829,-1.07
6830,-1.82
6831,-2.61
6832,-3.49
6833,-4.33
6834,-5.18
6835,-5.91
6836,-6.56
6837,-7.09
6838,-7.55
6839,-7.88
6840,-8.17
6841,-8.42
6842,-8.75
6843,-9.13
6844,-9.57
6845,-9.99
6846,-10.39
6847,-10.72
6848,-10.96
6849,-11.07
6850,-11.05
6851,-10.91
6852,-10.62
6853,-10.20
6854,-9.66
6855,-9.03
6856,-8.34
6857,-7.64
6858,-7.01
6859,-6.49
6860,-6.14
6861,-6.00
6862,-6.07
6863,-6.31
6864,-6.67
6865,-7.13
6866,-7.66
6867,-8.21
6868,-8.67
6869,-9.00
6870,-9.20
6871,-9.29
6872,-9.25
6873,-9.08
6874,-8.77
6875,-8.38
6876,-7.95
6877,-7.56
6878,-7.21
6879,-6.91
6880,-6.67
6881,-6.47
6882,-6.26
6883,-6.00
6884,-5.64
6885,-5.26
6886,-4.88
6887,-4.59
6888,-4.36
6889,-4.16
6890,-3.94
6891,-3.71
6892,-3.43
6893,-3.09
6894,-2.60
6895,-2.00
6896,-1.33
6897,-0.74
6898,-0.27
6899,0.02
6900,0.21
6901,0.31
6902,0.38
6903,0.43
6904,0.53
6905,0.67
6906,0.87
6907,1.08
6908,1.31
6909,1.54
6910,1.78
6911,2.02
6912,2.27
6913,2.50
6914,2.71
6915,2.88
6916,2.94
6917,2.92
6918,2.76
6919,2.54
6920,2.24
6921,1.97
6922,1.61
6923,1.15
6924,0.45
6925,-0.49
6926,-1.71
6927,-3.11
6928,-4.65
6929,-6.20
6930,-7.71
6931,-8.96
6932,-9.91
6933,-10.45
6934,-10.70
6935,-10.64
6936,-10.42
6937,-10.04
6938,-9.60
6939,-9.10
6940,-8.67
6941,-8.36
6942,-8.26
6943,-8.37
6944,-8.69
6945,-9.16
6946,-9.67
6947,-10.13
6948,-10.41
6949,-10.48
6950,-10.31
6951,-9.99
6952,-9.54
6953,-9.06
6954,-8.58
6955,-8.16
6956,-7.81
6957,-7.47
6958,-7.02
6959,-6.41
6960,-5.58
6961,-4.62
6962,-3.56
6963,-2.56
6964,-1.69
6965,-1.12
6966,-0.86
6967,-1.00
6968,-1.46
6969,-2.14
6970,-2.80
6971,-3.30
6972,-3.56
6973,-3.54
6974,-3.29
6975,-2.86
6976,-2.41
6977,-2.06
6978,-1.92
6979,-2.04
6980,-2.46
6981,-3.11
6982,-3.91
6983,-4.73
6984,-5.52
6985,-6.17
6986,-6.65
6987,-6.95
6988,-7.12
6989,-7.20
6990,-7.21
6991,-7.16
6992,-7.03
6993,-6.82
6994,-6.49
6995,-6.06
6996,-5.49
6997,-4.82
6998,-4.09
6999,-3.38
7000,-2.74
7001,-2.27
7002,-1.95
7003,-1.78
7004,-1.68
7005,-1.57
7006,-1.36
7007,-1.06
7008,-0.72
7009,-0.43
7010,-0.27
7011,-0.31
7012,-0.60
7013,-1.04
7014,-1.53
7015,-1.96
7016,-2.31
7017,-2.53
7018,-2.64
7019,-2.68
7020,-2.85
7021,-3.21
7022,-3.84
7023,-4.65
7024,-5.63
7025,-6.68
7026,-7.71
7027,-8.61
7028,-9.35
7029,-9.93
7030,-10.42
7031,-10.80
7032,-11.09
7033,-11.26
7034,-11.35
7035,-11.34
7036,-11.28
7037,-11.18
7038,-11.10
7039,-11.05
7040,-11.12
7041,-11.27
7042,-11.51
7043,-11.78
7044,-12.02
7045,-12.19
7046,-12.18
7047,-11.98
7048,-11.56
7049,-11.02
7050,-10.44
7051,-9.91
7052,-9.40
7053,-8.90
7054,-8.34
7055,-7.76
7056,-7.12
7057,-6.48
7058,-5.78
7059,-5.14
7060,-4.55
7061,-4.16
7062,-3.84
7063,-3.61
7064,-3.30
7065,-2.91
7066,-2.30
7067,-1.51
7068,-0.48
7069,0.61
7070,1.74
7071,2.71
7072,3.55
7073,4.18
7074,4.71
7075,5.10
7076,5.49
7077,5.91
7078,6.49
7079,7.16
7080,7.93
7081,8.61
7082,9.19
7083,9.52
7084,9.69
7085,9.67
7086,9.57
7087,9.48
7088,9.48
7089,9.72
7090,10.21
7091,10.89
7092,11.59
7093,12.11
7094,12.31
7095,12.14
7096,11.56
7097,10.62
7098,9.41
7099,8.14
7100,7.05
7101,6.36
7102,6.09
7103,6.23
7104,6.67
7105,7.26
7106,7.79
7107,8.13
7108,8.19
7109,8.01
7110,7.64
7111,7.26
7112,6.93
7113,6.75
7114,6.74
7115,6.87
7116,7.03
7117,7.11
7118,6.99
7119,6.63
7120,6.04
7121,5.34
7122,4.65
7123,4.15
7124,3.87
7125,3.85
7126,4.02
7127,4.32
7128,4.58
7129,4.69
7130,4.50
7131,4.03
7132,3.31
7133,2.56
7134,1.86
7135,1.37
7136,1.06
7137,0.93
7138,0.83
7139,0.69
7140,0.33
7141,-0.29
7142,-1.23
7143,-2.33
7144,-3.48
7145,-4.43
7146,-5.17
7147,-5.59
7148,-5.78
7149,-5.75
7150,-5.70
7151,-5.71
7152,-5.90
7153,-6.23
7154,-6.67
7155,-7.16
7156,-7.63
7157,-8.03
7158,-8.26
7159,-8.31
7160,-8.09
7161,-7.67
7162,-6.94
7163,-6.00
7164,-4.81
7165,-3.53
7166,-2.20
7167,-0.95
7168,0.23
7169,1.22
7170,2.04
7171,2.65
7172,3.17
7173,3.59
7174,4.02
7175,4.36
7176,4.67
7177,4.86
7178,4.99
7179,4.98
7180,4.84
7181,4.59
7182,4.33
7183,4.11
7184,3.99
7185,3.95
7186,4.01
7187,4.17
7188,4.40
7189,4.65
7190,4.79
7191,4.81
7192,4.68
7193,3.52
7194,3.40
7195,5.54
7196,6.02
7197,-0.25
7198,-6.08
7199,5.13
7200,21.20
