1,-21.42
2,-30.89
3,-31.51
4,-28.42
5,-27.40
6,-28.77
7,-29.56
8,-29.18
9,-28.74
10,-28.92
11,-29.07
12,-29.08
13,-28.93
14,-28.88
15,-28.82
16,-28.75
17,-28.66
18,-28.56
19,-28.44
20,-28.34
21,-28.25
22,-28.17
23,-28.09
24,-28.01
25,-27.95
26,-27.92
27,-27.91
28,-27.91
29,-27.92
30,-27.95
31,-28.00
32,-28.05
33,-28.11
34,-28.16
35,-28.21
36,-28.24
37,-28.25
38,-28.26
39,-28.25
40,-28.25
41,-28.23
42,-28.20
43,-28.16
44,-28.11
45,-28.07
46,-28.04
47,-28.03
48,-28.04
49,-28.06
50,-28.08
51,-28.10
52,-28.14
53,-28.20
54,-28.26
55,-28.32
56,-28.38
57,-28.45
58,-28.52
59,-28.59
60,-28.66
61,-28.72
62,-28.78
63,-28.83
64,-28.90
65,-28.97
66,-29.04
67,-29.12
68,-29.21
69,-29.29
70,-29.39
71,-29.50
72,-29.63
73,-29.75
74,-29.88
75,-30.00
76,-30.12
77,-30.24
78,-30.35
79,-30.43
80,-30.48
81,-30.51
82,-30.52
83,-30.52
84,-30.51
85,-30.49
86,-30.46
87,-30.41
88,-30.38
89,-30.37
90,-30.38
91,-30.40
92,-30.43
93,-30.47
94,-30.53
95,-30.60
96,-30.65
97,-30.70
98,-30.74
99,-30.78
100,-30.80
101,-30.79
102,-30.75
103,-30.69
104,-30.61
105,-30.51
106,-30.40
107,-30.28
108,-30.15
109,-30.02
110,-29.91
111,-29.83
112,-29.76
113,-29.70
114,-29.67
115,-29.65
116,-29.65
117,-29.67
118,-29.71
119,-29.77
120,-29.85
121,-29.92
122,-30.01
123,-30.11
124,-30.22
125,-30.32
126,-30.44
127,-30.56
128,-30.69
129,-30.82
130,-30.93
131,-31.03
132,-31.14
133,-31.24
134,-31.34
135,-31.42
136,-31.51
137,-31.56
138,-31.61
139,-31.65
140,-31.69
141,-31.73
142,-31.75
143,-31.76
144,-31.78
145,-31.81
146,-31.83
147,-31.83
148,-31.82
149,-31.81
150,-31.78
151,-31.73
152,-31.64
153,-31.56
154,-31.45
155,-31.34
156,-31.20
157,-31.05
158,-30.88
159,-30.71
160,-30.52
161,-30.35
162,-30.16
163,-29.98
164,-29.79
165,-29.60
166,-29.39
167,-29.20
168,-29.02
169,-28.86
170,-28.70
171,-28.56
172,-28.42
173,-28.31
174,-28.23
175,-28.17
176,-28.14
177,-28.13
178,-28.13
179,-28.15
180,-28.16
181,-28.18
182,-28.20
183,-28.21
184,-28.22
185,-28.23
186,-28.22
187,-28.20
188,-28.16
189,-28.12
190,-28.06
191,-28.02
192,-27.98
193,-27.94
194,-27.88
195,-27.81
196,-27.75
197,-27.69
198,-27.65
199,-27.60
200,-27.55
201,-27.52
202,-27.51
203,-27.52
204,-27.55
205,-27.60
206,-27.68
207,-27.76
208,-27.86
209,-27.97
210,-28.10
211,-28.24
212,-28.37
213,-28.46
214,-28.52
215,-28.57
216,-28.59
217,-28.59
218,-28.56
219,-28.52
220,-28.47
221,-28.41
222,-28.33
223,-28.23
224,-28.16
225,-28.10
226,-28.04
227,-27.98
228,-27.92
229,-27.86
230,-27.81
231,-27.76
232,-27.71
233,-27.67
234,-27.65
235,-27.63
236,-27.63
237,-27.63
238,-27.64
239,-27.66
240,-27.69
241,-27.75
242,-27.81
243,-27.88
244,-27.94
245,-28.01
246,-28.06
247,-28.12
248,-28.14
249,-28.14
250,-28.13
251,-28.09
252,-28.05
253,-27.99
254,-27.92
255,-27.85
256,-27.77
257,-27.69
258,-27.62
259,-27.57
260,-27.54
261,-27.51
262,-27.49
263,-27.50
264,-27.54
265,-27.61
266,-27.70
267,-27.79
268,-27.87
269,-27.97
270,-28.07
271,-28.16
272,-28.25
273,-28.32
274,-28.38
275,-28.45
276,-28.49
277,-28.49
278,-28.49
279,-28.47
280,-28.47
281,-28.47
282,-28.46
283,-28.44
284,-28.42
285,-28.42
286,-28.44
287,-28.45
288,-28.44
289,-28.43
290,-28.44
291,-28.45
292,-28.47
293,-28.49
294,-28.53
295,-28.59
296,-28.66
297,-28.74
298,-28.85
299,-28.98
300,-29.14
301,-29.29
302,-29.44
303,-29.60
304,-29.76
305,-29.91
306,-30.04
307,-30.15
308,-30.24
309,-30.31
310,-30.36
311,-30.40
312,-30.43
313,-30.45
314,-30.46
315,-30.46
316,-30.44
317,-30.43
318,-30.40
319,-30.38
320,-30.33
321,-30.26
322,-30.18
323,-30.08
324,-29.99
325,-29.89
326,-29.80
327,-29.71
328,-29.64
329,-29.57
330,-29.52
331,-29.50
332,-29.51
333,-29.55
334,-29.61
335,-29.67
336,-29.73
337,-29.81
338,-29.91
339,-30.00
340,-30.07
341,-30.11
342,-30.16
343,-30.21
344,-30.25
345,-30.26
346,-30.25
347,-30.24
348,-30.24
349,-30.24
350,-30.23
351,-30.22
352,-30.21
353,-30.20
354,-30.19
355,-30.18
356,-30.18
357,-30.18
358,-30.20
359,-30.22
360,-30.26
361,-30.30
362,-30.36
363,-30.43
364,-30.53
365,-30.65
366,-30.77
367,-30.89
368,-31.02
369,-31.16
370,-31.33
371,-31.50
372,-31.66
373,-31.80
374,-31.96
375,-32.13
376,-32.31
377,-32.48
378,-32.68
379,-32.87
380,-33.08
381,-33.28
382,-33.50
383,-33.71
384,-33.95
385,-34.19
386,-34.42
387,-34.62
388,-34.78
389,-34.90
390,-34.98
391,-35.01
392,-34.98
393,-34.89
394,-34.74
395,-34.54
396,-34.30
397,-34.02
398,-33.72
399,-33.40
400,-33.06
401,-32.71
402,-32.37
403,-32.06
404,-31.75
405,-31.47
406,-31.18
407,-30.93
408,-30.69
409,-30.50
410,-30.32
411,-30.15
412,-30.00
413,-29.88
414,-29.79
415,-29.74
416,-29.71
417,-29.71
418,-29.72
419,-29.75
420,-29.82
421,-29.91
422,-30.03
423,-30.14
424,-30.26
425,-30.38
426,-30.52
427,-30.65
428,-30.77
429,-30.88
430,-30.98
431,-31.07
432,-31.14
433,-31.21
434,-31.29
435,-31.37
436,-31.44
437,-31.48
438,-31.53
439,-31.57
440,-31.63
441,-31.69
442,-31.76
443,-31.81
444,-31.87
445,-31.92
446,-31.97
447,-32.03
448,-32.09
449,-32.15
450,-32.22
451,-32.30
452,-32.38
453,-32.45
454,-32.51
455,-32.57
456,-32.63
457,-32.68
458,-32.71
459,-32.73
460,-32.74
461,-32.74
462,-32.72
463,-32.70
464,-32.66
465,-32.61
466,-32.54
467,-32.45
468,-32.35
469,-32.26
470,-32.17
471,-32.10
472,-32.03
473,-31.97
474,-31.92
475,-31.88
476,-31.85
477,-31.85
478,-31.87
479,-31.90
480,-31.93
481,-31.97
482,-32.00
483,-32.03
484,-32.05
485,-32.06
486,-32.06
487,-32.06
488,-32.06
489,-32.03
490,-32.01
491,-31.99
492,-31.98
493,-31.95
494,-31.92
495,-31.88
496,-31.85
497,-31.80
498,-31.76
499,-31.71
500,-31.67
501,-31.62
502,-31.57
503,-31.53
504,-31.49
505,-31.47
506,-31.45
507,-31.44
508,-31.42
509,-31.42
510,-31.43
511,-31.44
512,-31.45
513,-31.49
514,-31.52
515,-31.56
516,-31.57
517,-31.57
518,-31.56
519,-31.56
520,-31.53
521,-31.48
522,-31.41
523,-31.31
524,-31.18
525,-31.03
526,-30.87
527,-30.71
528,-30.56
529,-30.43
530,-30.30
531,-30.18
532,-30.09
533,-30.04
534,-30.03
535,-30.05
536,-30.11
537,-30.19
538,-30.31
539,-30.44
540,-30.59
541,-30.75
542,-30.91
543,-31.07
544,-31.23
545,-31.37
546,-31.51
547,-31.63
548,-31.74
549,-31.85
550,-31.97
551,-32.08
552,-32.18
553,-32.27
554,-32.38
555,-32.49
556,-32.60
557,-32.69
558,-32.79
559,-32.89
560,-33.00
561,-33.08
562,-33.16
563,-33.22
564,-33.27
565,-33.29
566,-33.30
567,-33.31
568,-33.30
569,-33.26
570,-33.21
571,-33.16
572,-33.10
573,-33.05
574,-32.99
575,-32.94
576,-32.89
577,-32.84
578,-32.79
579,-32.74
580,-32.69
581,-32.63
582,-32.56
583,-32.48
584,-32.39
585,-32.29
586,-32.18
587,-32.07
588,-31.97
589,-31.88
590,-31.77
591,-31.66
592,-31.56
593,-31.49
594,-31.44
595,-31.41
596,-31.37
597,-31.34
598,-31.31
599,-31.29
600,-31.29
601,-31.29
602,-31.28
603,-31.25
604,-31.21
605,-31.16
606,-31.13
607,-31.10
608,-31.08
609,-31.05
610,-31.01
611,-30.97
612,-30.94
613,-30.93
614,-30.92
615,-30.91
616,-30.92
617,-30.96
618,-31.02
619,-31.05
620,-31.08
621,-31.11
622,-31.15
623,-31.20
624,-31.21
625,-31.19
626,-31.15
627,-31.10
628,-31.03
629,-30.95
630,-30.83
631,-30.71
632,-30.55
633,-30.40
634,-30.24
635,-30.09
636,-29.94
637,-29.81
638,-29.68
639,-29.57
640,-29.47
641,-29.40
642,-29.33
643,-29.28
644,-29.24
645,-29.21
646,-29.19
647,-29.17
648,-29.15
649,-29.12
650,-29.08
651,-29.06
652,-29.04
653,-29.02
654,-28.99
655,-28.95
656,-28.91
657,-28.88
658,-28.85
659,-28.82
660,-28.78
661,-28.75
662,-28.71
663,-28.68
664,-28.64
665,-28.59
666,-28.56
667,-28.53
668,-28.52
669,-28.49
670,-28.46
671,-28.45
672,-28.45
673,-28.48
674,-28.51
675,-28.54
676,-28.59
677,-28.65
678,-28.72
679,-28.78
680,-28.83
681,-28.89
682,-28.97
683,-29.05
684,-29.15
685,-29.24
686,-29.36
687,-29.49
688,-29.64
689,-29.80
690,-29.99
691,-30.19
692,-30.40
693,-30.61
694,-30.81
695,-31.00
696,-31.18
697,-31.35
698,-31.49
699,-31.59
700,-31.66
701,-31.68
702,-31.68
703,-31.64
704,-31.57
705,-31.48
706,-31.37
707,-31.24
708,-31.10
709,-30.96
710,-30.82
711,-30.69
712,-30.58
713,-30.48
714,-30.39
715,-30.31
716,-30.23
717,-30.16
718,-30.11
719,-30.09
720,-30.06
721,-30.03
722,-30.00
723,-29.98
724,-29.97
725,-29.97
726,-29.95
727,-29.92
728,-29.88
729,-29.84
730,-29.80
731,-29.75
732,-29.69
733,-29.61
734,-29.51
735,-29.43
736,-29.34
737,-29.25
738,-29.15
739,-29.06
740,-28.99
741,-28.94
742,-28.90
743,-28.86
744,-28.83
745,-28.82
746,-28.84
747,-28.87
748,-28.90
749,-28.93
750,-28.97
751,-29.03
752,-29.09
753,-29.15
754,-29.22
755,-29.29
756,-29.35
757,-29.40
758,-29.45
759,-29.52
760,-29.60
761,-29.67
762,-29.73
763,-29.79
764,-29.85
765,-29.91
766,-29.96
767,-30.01
768,-30.07
769,-30.11
770,-30.15
771,-30.17
772,-30.19
773,-30.19
774,-30.19
775,-30.17
776,-30.15
777,-30.14
778,-30.13
779,-30.12
780,-30.12
781,-30.14
782,-30.17
783,-30.19
784,-30.21
785,-30.24
786,-30.27
787,-30.30
788,-30.33
789,-30.36
790,-30.39
791,-30.42
792,-30.45
793,-30.49
794,-30.54
795,-30.59
796,-30.63
797,-30.69
798,-30.75
799,-30.80
800,-30.85
801,-30.87
802,-30.88
803,-30.87
804,-30.86
805,-30.82
806,-30.76
807,-30.71
808,-30.67
809,-30.63
810,-30.59
811,-30.56
812,-30.55
813,-30.56
814,-30.59
815,-30.63
816,-30.66
817,-30.69
818,-30.73
819,-30.78
820,-30.83
821,-30.87
822,-30.91
823,-30.94
824,-30.96
825,-30.99
826,-31.03
827,-31.07
828,-31.11
829,-31.14
830,-31.15
831,-31.16
832,-31.18
833,-31.19
834,-31.18
835,-31.16
836,-31.14
837,-31.13
838,-31.12
839,-31.10
840,-31.08
841,-31.06
842,-31.08
843,-31.13
844,-31.20
845,-31.29
846,-31.40
847,-31.53
848,-31.68
849,-31.82
850,-31.98
851,-32.12
852,-32.28
853,-32.43
854,-32.60
855,-32.75
856,-32.92
857,-33.07
858,-33.23
859,-33.38
860,-33.52
861,-33.66
862,-33.80
863,-33.92
864,-34.04
865,-34.12
866,-34.20
867,-34.26
868,-34.30
869,-34.33
870,-34.35
871,-34.37
872,-34.40
873,-34.42
874,-34.45
875,-34.49
876,-34.56
877,-34.64
878,-34.71
879,-34.78
880,-34.87
881,-34.98
882,-35.08
883,-35.16
884,-35.20
885,-35.22
886,-35.25
887,-35.26
888,-35.24
889,-35.20
890,-35.11
891,-35.00
892,-34.88
893,-34.74
894,-34.57
895,-34.39
896,-34.18
897,-33.97
898,-33.76
899,-33.57
900,-33.37
901,-33.19
902,-33.00
903,-32.82
904,-32.66
905,-32.52
906,-32.39
907,-32.29
908,-32.19
909,-32.11
910,-32.04
911,-31.98
912,-31.91
913,-31.85
914,-31.79
915,-31.73
916,-31.68
917,-31.64
918,-31.60
919,-31.57
920,-31.52
921,-31.50
922,-31.47
923,-31.45
924,-31.43
925,-31.40
926,-31.37
927,-31.34
928,-31.30
929,-31.26
930,-31.20
931,-31.14
932,-31.08
933,-31.02
934,-30.97
935,-30.93
936,-30.89
937,-30.85
938,-30.82
939,-30.80
940,-30.78
941,-30.78
942,-30.77
943,-30.76
944,-30.73
945,-30.70
946,-30.65
947,-30.59
948,-30.51
949,-30.39
950,-30.24
951,-30.08
952,-29.90
953,-29.72
954,-29.52
955,-29.32
956,-29.11
957,-28.91
958,-28.71
959,-28.53
960,-28.36
961,-28.22
962,-28.09
963,-28.00
964,-27.90
965,-27.82
966,-27.75
967,-27.71
968,-27.68
969,-27.64
970,-27.59
971,-27.56
972,-27.52
973,-27.48
974,-27.43
975,-27.37
976,-27.31
977,-27.26
978,-27.21
979,-27.17
980,-27.11
981,-27.07
982,-27.02
983,-26.98
984,-26.95
985,-26.93
986,-26.92
987,-26.91
988,-26.90
989,-26.87
990,-26.85
991,-26.83
992,-26.82
993,-26.80
994,-26.76
995,-26.72
996,-26.69
997,-26.66
998,-26.61
999,-26.58
1000,-26.57
1001,-26.58
1002,-26.61
1003,-26.63
1004,-26.67
1005,-26.71
1006,-26.77
1007,-26.84
1008,-26.94
1009,-27.04
1010,-27.14
1011,-27.23
1012,-27.34
1013,-27.46
1014,-27.59
1015,-27.71
1016,-27.85
1017,-28.00
1018,-28.17
1019,-28.34
1020,-28.52
1021,-28.70
1022,-28.90
1023,-29.09
1024,-29.28
1025,-29.48
1026,-29.68
1027,-29.86
1028,-30.06
1029,-30.25
1030,-30.46
1031,-30.65
1032,-30.85
1033,-31.05
1034,-31.26
1035,-31.46
1036,-31.67
1037,-31.85
1038,-32.04
1039,-32.20
1040,-32.35
1041,-32.46
1042,-32.57
1043,-32.66
1044,-32.72
1045,-32.76
1046,-32.80
1047,-32.83
1048,-32.87
1049,-32.89
1050,-32.91
1051,-32.92
1052,-32.94
1053,-32.96
1054,-32.99
1055,-33.01
1056,-33.05
1057,-33.08
1058,-33.11
1059,-33.13
1060,-33.17
1061,-33.21
1062,-33.26
1063,-33.32
1064,-33.38
1065,-33.45
1066,-33.53
1067,-33.61
1068,-33.69
1069,-33.78
1070,-33.87
1071,-33.96
1072,-34.05
1073,-34.13
1074,-34.20
1075,-34.27
1076,-34.34
1077,-34.41
1078,-34.48
1079,-34.54
1080,-34.58
1081,-34.61
1082,-34.63
1083,-34.65
1084,-34.67
1085,-34.69
1086,-34.70
1087,-34.71
1088,-34.73
1089,-34.75
1090,-34.80
1091,-34.85
1092,-34.95
1093,-35.06
1094,-35.21
1095,-35.38
1096,-35.61
1097,-35.87
1098,-36.18
1099,-36.50
1100,-36.87
1101,-37.26
1102,-37.70
1103,-38.12
1104,-38.54
1105,-38.93
1106,-39.32
1107,-39.69
1108,-40.03
1109,-40.31
1110,-40.55
1111,-40.73
1112,-40.85
1113,-40.91
1114,-40.91
1115,-40.86
1116,-40.76
1117,-40.63
1118,-40.44
1119,-40.23
1120,-39.97
1121,-39.69
1122,-39.36
1123,-39.04
1124,-38.66
1125,-38.29
1126,-37.85
1127,-37.42
1128,-36.94
1129,-36.48
1130,-35.97
1131,-35.47
1132,-34.92
1133,-34.42
1134,-33.91
1135,-33.45
1136,-32.97
1137,-32.54
1138,-32.10
1139,-31.73
1140,-31.36
1141,-31.03
1142,-30.71
1143,-30.43
1144,-30.15
1145,-29.92
1146,-29.68
1147,-29.48
1148,-29.28
1149,-29.10
1150,-28.92
1151,-28.76
1152,-28.61
1153,-28.48
1154,-28.34
1155,-28.21
1156,-28.09
1157,-27.97
1158,-27.85
1159,-27.73
1160,-27.62
1161,-27.52
1162,-27.44
1163,-27.37
1164,-27.31
1165,-27.27
1166,-27.26
1167,-27.27
1168,-27.33
1169,-27.40
1170,-27.51
1171,-27.66
1172,-27.85
1173,-28.06
1174,-28.31
1175,-28.57
1176,-28.89
1177,-29.22
1178,-29.58
1179,-29.94
1180,-30.33
1181,-30.71
1182,-31.10
1183,-31.47
1184,-31.86
1185,-32.23
1186,-32.60
1187,-32.94
1188,-33.29
1189,-33.58
1190,-33.87
1191,-34.10
1192,-34.32
1193,-34.49
1194,-34.62
1195,-34.70
1196,-34.75
1197,-34.78
1198,-34.77
1199,-34.72
1200,-34.65
1201,-34.58
1202,-34.50
1203,-34.41
1204,-34.31
1205,-34.21
1206,-34.12
1207,-34.03
1208,-33.94
1209,-33.87
1210,-33.78
1211,-33.69
1212,-33.61
1213,-33.53
1214,-33.45
1215,-33.37
1216,-33.29
1217,-33.22
1218,-33.16
1219,-33.10
1220,-33.04
1221,-33.00
1222,-32.95
1223,-32.92
1224,-32.87
1225,-32.83
1226,-32.76
1227,-32.68
1228,-32.59
1229,-32.49
1230,-32.38
1231,-32.25
1232,-32.10
1233,-31.95
1234,-31.82
1235,-31.69
1236,-31.54
1237,-31.40
1238,-31.27
1239,-31.18
1240,-31.11
1241,-31.04
1242,-30.98
1243,-30.95
1244,-30.95
1245,-30.98
1246,-31.03
1247,-31.09
1248,-31.18
1249,-31.28
1250,-31.40
1251,-31.52
1252,-31.66
1253,-31.81
1254,-31.99
1255,-32.15
1256,-32.32
1257,-32.49
1258,-32.66
1259,-32.82
1260,-32.97
1261,-33.11
1262,-33.26
1263,-33.40
1264,-33.54
1265,-33.67
1266,-33.82
1267,-33.98
1268,-34.16
1269,-34.35
1270,-34.56
1271,-34.77
1272,-34.99
1273,-35.21
1274,-35.42
1275,-35.59
1276,-35.75
1277,-35.89
1278,-36.00
1279,-36.07
1280,-36.10
1281,-36.09
1282,-36.04
1283,-35.97
1284,-35.89
1285,-35.79
1286,-35.70
1287,-35.62
1288,-35.57
1289,-35.55
1290,-35.55
1291,-35.57
1292,-35.62
1293,-35.70
1294,-35.80
1295,-35.92
1296,-36.07
1297,-36.22
1298,-36.38
1299,-36.54
1300,-36.71
1301,-36.88
1302,-37.07
1303,-37.26
1304,-37.46
1305,-37.67
1306,-37.88
1307,-38.06
1308,-38.25
1309,-38.43
1310,-38.63
1311,-38.79
1312,-38.93
1313,-39.02
1314,-39.11
1315,-39.18
1316,-39.22
1317,-39.22
1318,-39.23
1319,-39.24
1320,-39.24
1321,-39.23
1322,-39.22
1323,-39.23
1324,-39.25
1325,-39.28
1326,-39.33
1327,-39.37
1328,-39.42
1329,-39.47
1330,-39.54
1331,-39.61
1332,-39.67
1333,-39.71
1334,-39.73
1335,-39.76
1336,-39.79
1337,-39.83
1338,-39.84
1339,-39.85
1340,-39.87
1341,-39.89
1342,-39.90
1343,-39.90
1344,-39.88
1345,-39.86
1346,-39.83
1347,-39.79
1348,-39.72
1349,-39.65
1350,-39.56
1351,-39.47
1352,-39.36
1353,-39.26
1354,-39.15
1355,-39.05
1356,-38.95
1357,-38.85
1358,-38.76
1359,-38.68
1360,-38.61
1361,-38.53
1362,-38.44
1363,-38.37
1364,-38.30
1365,-38.24
1366,-38.17
1367,-38.12
1368,-38.08
1369,-38.06
1370,-38.04
1371,-38.03
1372,-38.05
1373,-38.10
1374,-38.16
1375,-38.21
1376,-38.25
1377,-38.30
1378,-38.36
1379,-38.42
1380,-38.46
1381,-38.47
1382,-38.47
1383,-38.47
1384,-38.46
1385,-38.43
1386,-38.39
1387,-38.32
1388,-38.26
1389,-38.20
1390,-38.15
1391,-38.12
1392,-38.10
1393,-38.09
1394,-38.10
1395,-38.12
1396,-38.14
1397,-38.18
1398,-38.21
1399,-38.24
1400,-38.26
1401,-38.24
1402,-38.18
1403,-38.08
1404,-37.94
1405,-37.78
1406,-37.56
1407,-37.31
1408,-37.00
1409,-36.69
1410,-36.33
1411,-35.98
1412,-35.59
1413,-35.21
1414,-34.80
1415,-34.42
1416,-34.02
1417,-33.65
1418,-33.25
1419,-32.86
1420,-32.45
1421,-32.07
1422,-31.70
1423,-31.35
1424,-30.97
1425,-30.61
1426,-30.22
1427,-29.87
1428,-29.52
1429,-29.19
1430,-28.86
1431,-28.55
1432,-28.22
1433,-27.91
1434,-27.60
1435,-27.33
1436,-27.06
1437,-26.83
1438,-26.58
1439,-26.36
1440,-26.13
1441,-25.91
1442,-25.67
1443,-25.46
1444,-25.25
1445,-25.05
1446,-24.82
1447,-24.61
1448,-24.39
1449,-24.20
1450,-24.01
1451,-23.84
1452,-23.69
1453,-23.58
1454,-23.48
1455,-23.41
1456,-23.36
1457,-23.35
1458,-23.36
1459,-23.39
1460,-23.43
1461,-23.47
1462,-23.51
1463,-23.56
1464,-23.61
1465,-23.65
1466,-23.68
1467,-23.70
1468,-23.72
1469,-23.73
1470,-23.72
1471,-23.70
1472,-23.69
1473,-23.68
1474,-23.64
1475,-23.59
1476,-23.53
1477,-23.48
1478,-23.41
1479,-23.33
1480,-23.22
1481,-23.12
1482,-23.02
1483,-22.92
1484,-22.80
1485,-22.67
1486,-22.56
1487,-22.46
1488,-22.38
1489,-22.32
1490,-22.27
1491,-22.24
1492,-22.24
1493,-22.24
1494,-22.27
1495,-22.32
1496,-22.41
1497,-22.51
1498,-22.63
1499,-22.74
1500,-22.89
1501,-23.06
1502,-23.28
1503,-23.50
1504,-23.76
1505,-24.04
1506,-24.37
1507,-24.70
1508,-25.10
1509,-25.52
1510,-25.99
1511,-26.46
1512,-26.95
1513,-27.43
1514,-27.93
1515,-28.41
1516,-28.88
1517,-29.29
1518,-29.68
1519,-30.01
1520,-30.34
1521,-30.61
1522,-30.85
1523,-31.04
1524,-31.21
1525,-31.35
1526,-31.50
1527,-31.63
1528,-31.77
1529,-31.89
1530,-32.03
1531,-32.14
1532,-32.30
1533,-32.46
1534,-32.66
1535,-32.86
1536,-33.09
1537,-33.32
1538,-33.59
1539,-33.86
1540,-34.15
1541,-34.43
1542,-34.73
1543,-35.02
1544,-35.32
1545,-35.59
1546,-35.87
1547,-36.12
1548,-36.37
1549,-36.57
1550,-36.76
1551,-36.91
1552,-37.06
1553,-37.18
1554,-37.29
1555,-37.35
1556,-37.41
1557,-37.44
1558,-37.47
1559,-37.48
1560,-37.52
1561,-37.54
1562,-37.56
1563,-37.59
1564,-37.65
1565,-37.72
1566,-37.82
1567,-37.94
1568,-38.10
1569,-38.28
1570,-38.49
1571,-38.72
1572,-38.97
1573,-39.23
1574,-39.53
1575,-39.84
1576,-40.19
1577,-40.53
1578,-40.92
1579,-41.31
1580,-41.74
1581,-42.17
1582,-42.67
1583,-43.16
1584,-43.70
1585,-44.22
1586,-44.78
1587,-45.31
1588,-45.87
1589,-46.41
1590,-46.97
1591,-47.48
1592,-47.98
1593,-48.39
1594,-48.78
1595,-49.10
1596,-49.39
1597,-49.59
1598,-49.72
1599,-49.78
1600,-49.79
1601,-49.74
1602,-49.65
1603,-49.51
1604,-49.34
1605,-49.15
1606,-48.93
1607,-48.69
1608,-48.46
1609,-48.25
1610,-48.03
1611,-47.83
1612,-47.61
1613,-47.42
1614,-47.20
1615,-46.99
1616,-46.74
1617,-46.51
1618,-46.25
1619,-46.00
1620,-45.70
1621,-45.40
1622,-45.07
1623,-44.74
1624,-44.38
1625,-44.05
1626,-43.68
1627,-43.33
1628,-42.97
1629,-42.63
1630,-42.29
1631,-41.98
1632,-41.67
1633,-41.39
1634,-41.10
1635,-40.86
1636,-40.60
1637,-40.37
1638,-40.14
1639,-39.93
1640,-39.70
1641,-39.49
1642,-39.28
1643,-39.10
1644,-38.91
1645,-38.74
1646,-38.57
1647,-38.41
1648,-38.24
1649,-38.11
1650,-37.97
1651,-37.84
1652,-37.69
1653,-37.52
1654,-37.33
1655,-37.14
1656,-36.93
1657,-36.69
1658,-36.43
1659,-36.18
1660,-35.91
1661,-35.66
1662,-35.40
1663,-35.15
1664,-34.92
1665,-34.73
1666,-34.56
1667,-34.43
1668,-34.33
1669,-34.27
1670,-34.25
1671,-34.25
1672,-34.27
1673,-34.34
1674,-34.42
1675,-34.53
1676,-34.66
1677,-34.80
1678,-34.95
1679,-35.12
1680,-35.31
1681,-35.50
1682,-35.72
1683,-35.94
1684,-36.16
1685,-36.36
1686,-36.57
1687,-36.76
1688,-36.93
1689,-37.07
1690,-37.17
1691,-37.23
1692,-37.25
1693,-37.23
1694,-37.17
1695,-37.08
1696,-36.96
1697,-36.81
1698,-36.63
1699,-36.42
1700,-36.19
1701,-35.96
1702,-35.70
1703,-35.45
1704,-35.18
1705,-34.92
1706,-34.68
1707,-34.46
1708,-34.26
1709,-34.09
1710,-33.96
1711,-33.87
1712,-33.82
1713,-33.80
1714,-33.82
1715,-33.89
1716,-33.99
1717,-34.11
1718,-34.25
1719,-34.40
1720,-34.56
1721,-34.72
1722,-34.88
1723,-35.03
1724,-35.19
1725,-35.34
1726,-35.49
1727,-35.64
1728,-35.82
1729,-35.98
1730,-36.16
1731,-36.33
1732,-36.52
1733,-36.72
1734,-36.93
1735,-37.12
1736,-37.31
1737,-37.49
1738,-37.67
1739,-37.84
1740,-37.97
1741,-38.08
1742,-38.20
1743,-38.31
1744,-38.41
1745,-38.48
1746,-38.55
1747,-38.64
1748,-38.73
1749,-38.80
1750,-38.90
1751,-39.00
1752,-39.12
1753,-39.26
1754,-39.43
1755,-39.61
1756,-39.83
1757,-40.04
1758,-40.27
1759,-40.50
1760,-40.77
1761,-41.04
1762,-41.33
1763,-41.60
1764,-41.89
1765,-42.15
1766,-42.40
1767,-42.62
1768,-42.81
1769,-42.97
1770,-43.09
1771,-43.15
1772,-43.15
1773,-43.11
1774,-43.00
1775,-42.83
1776,-42.59
1777,-42.30
1778,-41.93
1779,-41.53
1780,-41.09
1781,-40.66
1782,-40.21
1783,-39.78
1784,-39.34
1785,-38.95
1786,-38.60
1787,-38.31
1788,-38.06
1789,-37.87
1790,-37.73
1791,-37.65
1792,-37.61
1793,-37.61
1794,-37.62
1795,-37.65
1796,-37.69
1797,-37.72
1798,-37.74
1799,-37.77
1800,-37.78
1801,-37.79
1802,-37.79
1803,-37.79
1804,-37.79
1805,-37.81
1806,-37.86
1807,-37.92
1808,-38.02
1809,-38.12
1810,-38.26
1811,-38.42
1812,-38.60
1813,-38.78
1814,-38.99
1815,-39.19
1816,-39.41
1817,-39.60
1818,-39.79
1819,-39.95
1820,-40.12
1821,-40.26
1822,-40.41
1823,-40.54
1824,-40.68
1825,-40.81
1826,-40.93
1827,-41.04
1828,-41.18
1829,-41.32
1830,-41.48
1831,-41.63
1832,-41.79
1833,-41.95
1834,-42.12
1835,-42.27
1836,-42.42
1837,-42.56
1838,-42.70
1839,-42.79
1840,-42.87
1841,-42.93
1842,-42.97
1843,-42.99
1844,-42.98
1845,-42.94
1846,-42.89
1847,-42.84
1848,-42.79
1849,-42.73
1850,-42.67
1851,-42.62
1852,-42.57
1853,-42.53
1854,-42.50
1855,-42.50
1856,-42.50
1857,-42.50
1858,-42.50
1859,-42.50
1860,-42.50
1861,-42.50
1862,-42.49
1863,-42.49
1864,-42.50
1865,-42.52
1866,-42.55
1867,-42.59
1868,-42.65
1869,-42.73
1870,-42.82
1871,-42.90
1872,-42.97
1873,-43.05
1874,-43.14
1875,-43.23
1876,-43.30
1877,-43.33
1878,-43.37
1879,-43.41
1880,-43.44
1881,-43.47
1882,-43.47
1883,-43.47
1884,-43.47
1885,-43.48
1886,-43.50
1887,-43.51
1888,-43.51
1889,-43.51
1890,-43.51
1891,-43.51
1892,-43.50
1893,-43.47
1894,-43.43
1895,-43.39
1896,-43.35
1897,-43.33
1898,-43.29
1899,-43.24
1900,-43.19
1901,-43.14
1902,-43.09
1903,-43.04
1904,-42.98
1905,-42.91
1906,-42.83
1907,-42.73
1908,-42.62
1909,-42.49
1910,-42.33
1911,-42.18
1912,-42.03
1913,-41.88
1914,-41.71
1915,-41.53
1916,-41.37
1917,-41.24
1918,-41.13
1919,-41.05
1920,-40.97
1921,-40.92
1922,-40.90
1923,-40.90
1924,-40.91
1925,-40.95
1926,-40.99
1927,-41.04
1928,-41.09
1929,-41.14
1930,-41.19
1931,-41.25
1932,-41.31
1933,-41.38
1934,-41.43
1935,-41.48
1936,-41.53
1937,-41.57
1938,-41.64
1939,-41.69
1940,-41.74
1941,-41.77
1942,-41.80
1943,-41.82
1944,-41.85
1945,-41.88
1946,-41.88
1947,-41.86
1948,-41.82
1949,-41.77
1950,-41.72
1951,-41.68
1952,-41.64
1953,-41.59
1954,-41.54
1955,-41.49
1956,-41.43
1957,-41.36
1958,-41.30
1959,-41.26
1960,-41.22
1961,-41.18
1962,-41.15
1963,-41.13
1964,-41.12
1965,-41.13
1966,-41.17
1967,-41.23
1968,-41.31
1969,-41.39
1970,-41.49
1971,-41.59
1972,-41.69
1973,-41.78
1974,-41.86
1975,-41.93
1976,-41.98
1977,-42.01
1978,-42.03
1979,-42.03
1980,-42.00
1981,-41.96
1982,-41.93
1983,-41.88
1984,-41.83
1985,-41.78
1986,-41.74
1987,-41.71
1988,-41.68
1989,-41.65
1990,-41.60
1991,-41.56
1992,-41.52
1993,-41.48
1994,-41.45
1995,-41.43
1996,-41.42
1997,-41.43
1998,-41.46
1999,-41.51
2000,-41.58
2001,-41.66
2002,-41.75
2003,-41.83
2004,-41.93
2005,-42.02
2006,-42.11
2007,-42.19
2008,-42.24
2009,-42.27
2010,-42.29
2011,-42.28
2012,-42.26
2013,-42.22
2014,-42.18
2015,-42.14
2016,-42.09
2017,-42.04
2018,-42.00
2019,-41.98
2020,-41.98
2021,-41.99
2022,-42.01
2023,-42.04
2024,-42.08
2025,-42.11
2026,-42.13
2027,-42.15
2028,-42.17
2029,-42.19
2030,-42.20
2031,-42.19
2032,-42.17
2033,-42.14
2034,-42.09
2035,-42.06
2036,-42.03
2037,-42.02
2038,-42.01
2039,-42.00
2040,-42.01
2041,-42.04
2042,-42.07
2043,-42.11
2044,-42.14
2045,-42.18
2046,-42.21
2047,-42.23
2048,-42.25
2049,-42.25
2050,-42.25
2051,-42.25
2052,-42.23
2053,-42.21
2054,-42.18
2055,-42.14
2056,-42.09
2057,-42.04
2058,-42.00
2059,-41.96
2060,-41.92
2061,-41.87
2062,-41.82
2063,-41.78
2064,-41.74
2065,-41.70
2066,-41.66
2067,-41.62
2068,-41.58
2069,-41.55
2070,-41.49
2071,-41.44
2072,-41.37
2073,-41.31
2074,-41.25
2075,-41.18
2076,-41.11
2077,-41.04
2078,-40.97
2079,-40.93
2080,-40.90
2081,-40.89
2082,-40.88
2083,-40.89
2084,-40.89
2085,-40.90
2086,-40.92
2087,-40.94
2088,-40.96
2089,-40.98
2090,-41.00
2091,-41.00
2092,-41.00
2093,-41.01
2094,-41.02
2095,-41.02
2096,-41.02
2097,-41.01
2098,-41.01
2099,-41.02
2100,-41.04
2101,-41.07
2102,-41.09
2103,-41.11
2104,-41.11
2105,-41.11
2106,-41.10
2107,-41.08
2108,-41.05
2109,-41.01
2110,-40.97
2111,-40.91
2112,-40.82
2113,-40.73
2114,-40.66
2115,-40.59
2116,-40.54
2117,-40.48
2118,-40.43
2119,-40.40
2120,-40.40
2121,-40.42
2122,-40.44
2123,-40.47
2124,-40.51
2125,-40.56
2126,-40.62
2127,-40.68
2128,-40.74
2129,-40.79
2130,-40.83
2131,-40.87
2132,-40.90
2133,-40.91
2134,-40.91
2135,-40.91
2136,-40.91
2137,-40.90
2138,-40.88
2139,-40.84
2140,-40.78
2141,-40.72
2142,-40.66
2143,-40.59
2144,-40.52
2145,-40.44
2146,-40.35
2147,-40.26
2148,-40.16
2149,-40.08
2150,-40.00
2151,-39.93
2152,-39.85
2153,-39.78
2154,-39.70
2155,-39.64
2156,-39.56
2157,-39.47
2158,-39.37
2159,-39.29
2160,-39.20
2161,-39.12
2162,-39.05
2163,-39.00
2164,-38.97
2165,-38.96
2166,-38.97
2167,-39.00
2168,-39.06
2169,-39.14
2170,-39.22
2171,-39.30
2172,-39.39
2173,-39.49
2174,-39.58
2175,-39.65
2176,-39.70
2177,-39.72
2178,-39.76
2179,-39.77
2180,-39.77
2181,-39.74
2182,-39.71
2183,-39.70
2184,-39.69
2185,-39.69
2186,-39.68
2187,-39.67
2188,-39.69
2189,-39.72
2190,-39.76
2191,-39.80
2192,-39.82
2193,-39.82
2194,-39.83
2195,-39.84
2196,-39.86
2197,-39.85
2198,-39.83
2199,-39.79
2200,-39.75
2201,-39.70
2202,-39.67
2203,-39.65
2204,-39.63
2205,-39.60
2206,-39.56
2207,-39.54
2208,-39.54
2209,-39.54
2210,-39.54
2211,-39.54
2212,-39.54
2213,-39.54
2214,-39.54
2215,-39.55
2216,-39.56
2217,-39.56
2218,-39.56
2219,-39.55
2220,-39.52
2221,-39.48
2222,-39.45
2223,-39.44
2224,-39.43
2225,-39.40
2226,-39.37
2227,-39.36
2228,-39.36
2229,-39.39
2230,-39.42
2231,-39.46
2232,-39.50
2233,-39.56
2234,-39.64
2235,-39.73
2236,-39.82
2237,-39.89
2238,-39.95
2239,-40.00
2240,-40.02
2241,-40.02
2242,-40.01
2243,-39.98
2244,-39.92
2245,-39.83
2246,-39.73
2247,-39.61
2248,-39.50
2249,-39.38
2250,-39.28
2251,-39.19
2252,-39.12
2253,-39.07
2254,-39.03
2255,-39.02
2256,-39.03
2257,-39.04
2258,-39.08
2259,-39.14
2260,-39.22
2261,-39.31
2262,-39.41
2263,-39.49
2264,-39.58
2265,-39.68
2266,-39.79
2267,-39.90
2268,-40.01
2269,-40.12
2270,-40.23
2271,-40.33
2272,-40.41
2273,-40.45
2274,-40.50
2275,-40.54
2276,-40.56
2277,-40.55
2278,-40.52
2279,-40.50
2280,-40.48
2281,-40.48
2282,-40.47
2283,-40.47
2284,-40.48
2285,-40.49
2286,-40.54
2287,-40.60
2288,-40.69
2289,-40.79
2290,-40.91
2291,-41.04
2292,-41.17
2293,-41.30
2294,-41.42
2295,-41.54
2296,-41.67
2297,-41.79
2298,-41.89
2299,-41.96
2300,-42.01
2301,-42.04
2302,-42.07
2303,-42.08
2304,-42.07
2305,-42.04
2306,-41.99
2307,-41.93
2308,-41.88
2309,-41.83
2310,-41.77
2311,-41.70
2312,-41.63
2313,-41.57
2314,-41.51
2315,-41.46
2316,-41.40
2317,-41.36
2318,-41.33
2319,-41.30
2320,-41.28
2321,-41.27
2322,-41.27
2323,-41.27
2324,-41.26
2325,-41.26
2326,-41.27
2327,-41.30
2328,-41.35
2329,-41.40
2330,-41.45
2331,-41.49
2332,-41.55
2333,-41.62
2334,-41.71
2335,-41.82
2336,-41.94
2337,-42.07
2338,-42.21
2339,-42.35
2340,-42.52
2341,-42.70
2342,-42.88
2343,-43.06
2344,-43.24
2345,-43.42
2346,-43.59
2347,-43.74
2348,-43.87
2349,-43.97
2350,-44.05
2351,-44.09
2352,-44.10
2353,-44.09
2354,-44.05
2355,-44.00
2356,-43.92
2357,-43.84
2358,-43.74
2359,-43.65
2360,-43.56
2361,-43.46
2362,-43.36
2363,-43.26
2364,-43.16
2365,-43.06
2366,-42.97
2367,-42.87
2368,-42.75
2369,-42.64
2370,-42.53
2371,-42.44
2372,-42.35
2373,-42.26
2374,-42.18
2375,-42.11
2376,-42.05
2377,-42.00
2378,-41.96
2379,-41.92
2380,-41.88
2381,-41.83
2382,-41.77
2383,-41.69
2384,-41.60
2385,-41.50
2386,-41.39
2387,-41.27
2388,-41.13
2389,-41.00
2390,-40.86
2391,-40.73
2392,-40.57
2393,-40.41
2394,-40.26
2395,-40.12
2396,-39.98
2397,-39.84
2398,-39.68
2399,-39.53
2400,-39.39
2401,-39.25
2402,-39.11
2403,-38.99
2404,-38.87
2405,-38.77
2406,-38.68
2407,-38.60
2408,-38.53
2409,-38.47
2410,-38.42
2411,-38.39
2412,-38.35
2413,-38.32
2414,-38.30
2415,-38.29
2416,-38.30
2417,-38.31
2418,-38.34
2419,-38.35
2420,-38.39
2421,-38.43
2422,-38.50
2423,-38.58
2424,-38.68
2425,-38.78
2426,-38.91
2427,-39.04
2428,-39.21
2429,-39.38
2430,-39.57
2431,-39.76
2432,-39.97
2433,-40.18
2434,-40.40
2435,-40.61
2436,-40.86
2437,-41.10
2438,-41.34
2439,-41.56
2440,-41.78
2441,-42.00
2442,-42.23
2443,-42.43
2444,-42.65
2445,-42.84
2446,-43.06
2447,-43.25
2448,-43.44
2449,-43.62
2450,-43.80
2451,-43.97
2452,-44.16
2453,-44.32
2454,-44.47
2455,-44.59
2456,-44.70
2457,-44.81
2458,-44.90
2459,-44.97
2460,-45.03
2461,-45.06
2462,-45.08
2463,-45.08
2464,-45.07
2465,-45.06
2466,-45.05
2467,-45.04
2468,-45.03
2469,-45.02
2470,-45.02
2471,-45.02
2472,-45.01
2473,-44.99
2474,-44.97
2475,-44.96
2476,-44.95
2477,-44.93
2478,-44.90
2479,-44.85
2480,-44.77
2481,-44.68
2482,-44.56
2483,-44.45
2484,-44.31
2485,-44.15
2486,-43.97
2487,-43.79
2488,-43.59
2489,-43.39
2490,-43.19
2491,-42.99
2492,-42.80
2493,-42.62
2494,-42.44
2495,-42.29
2496,-42.15
2497,-42.05
2498,-41.94
2499,-41.85
2500,-41.76
2501,-41.69
2502,-41.62
2503,-41.57
2504,-41.53
2505,-41.51
2506,-41.49
2507,-41.45
2508,-41.41
2509,-41.39
2510,-41.38
2511,-41.37
2512,-41.36
2513,-41.34
2514,-41.31
2515,-41.28
2516,-41.25
2517,-41.23
2518,-41.18
2519,-41.11
2520,-41.02
2521,-40.92
2522,-40.82
2523,-40.72
2524,-40.62
2525,-40.52
2526,-40.44
2527,-40.37
2528,-40.33
2529,-40.30
2530,-40.29
2531,-40.32
2532,-40.39
2533,-40.48
2534,-40.57
2535,-40.65
2536,-40.74
2537,-40.84
2538,-40.93
2539,-41.00
2540,-41.06
2541,-41.09
2542,-41.12
2543,-41.13
2544,-41.13
2545,-41.12
2546,-41.09
2547,-41.05
2548,-41.00
2549,-40.95
2550,-40.91
2551,-40.87
2552,-40.81
2553,-40.75
2554,-40.72
2555,-40.70
2556,-40.71
2557,-40.72
2558,-40.75
2559,-40.81
2560,-40.89
2561,-40.99
2562,-41.10
2563,-41.23
2564,-41.34
2565,-41.44
2566,-41.52
2567,-41.58
2568,-41.63
2569,-41.64
2570,-41.63
2571,-41.58
2572,-41.51
2573,-41.42
2574,-41.31
2575,-41.21
2576,-41.09
2577,-40.97
2578,-40.85
2579,-40.74
2580,-40.64
2581,-40.56
2582,-40.46
2583,-40.36
2584,-40.23
2585,-40.12
2586,-39.99
2587,-39.88
2588,-39.75
2589,-39.61
2590,-39.46
2591,-39.32
2592,-39.17
2593,-39.04
2594,-38.89
2595,-38.74
2596,-38.60
2597,-38.46
2598,-38.31
2599,-38.17
2600,-38.02
2601,-37.90
2602,-37.76
2603,-37.62
2604,-37.50
2605,-37.40
2606,-37.31
2607,-37.23
2608,-37.17
2609,-37.13
2610,-37.11
2611,-37.12
2612,-37.16
2613,-37.20
2614,-37.24
2615,-37.28
2616,-37.31
2617,-37.34
2618,-37.38
2619,-37.41
2620,-37.41
2621,-37.37
2622,-37.31
2623,-37.25
2624,-37.18
2625,-37.09
2626,-36.99
2627,-36.90
2628,-36.82
2629,-36.75
2630,-36.69
2631,-36.65
2632,-36.63
2633,-36.63
2634,-36.65
2635,-36.69
2636,-36.75
2637,-36.82
2638,-36.90
2639,-36.99
2640,-37.08
2641,-37.16
2642,-37.24
2643,-37.30
2644,-37.33
2645,-37.35
2646,-37.37
2647,-37.39
2648,-37.40
2649,-37.39
2650,-37.37
2651,-37.35
2652,-37.33
2653,-37.31
2654,-37.29
2655,-37.27
2656,-37.25
2657,-37.25
2658,-37.27
2659,-37.27
2660,-37.28
2661,-37.30
2662,-37.35
2663,-37.41
2664,-37.49
2665,-37.57
2666,-37.67
2667,-37.79
2668,-37.91
2669,-38.02
2670,-38.13
2671,-38.21
2672,-38.28
2673,-38.33
2674,-38.37
2675,-38.39
2676,-38.38
2677,-38.32
2678,-38.23
2679,-38.12
2680,-37.99
2681,-37.84
2682,-37.67
2683,-37.51
2684,-37.33
2685,-37.16
2686,-37.00
2687,-36.84
2688,-36.67
2689,-36.52
2690,-36.38
2691,-36.26
2692,-36.14
2693,-36.04
2694,-35.95
2695,-35.89
2696,-35.83
2697,-35.79
2698,-35.76
2699,-35.76
2700,-35.77
2701,-35.78
2702,-35.81
2703,-35.88
2704,-35.97
2705,-36.06
2706,-36.15
2707,-36.25
2708,-36.37
2709,-36.52
2710,-36.68
2711,-36.85
2712,-37.04
2713,-37.23
2714,-37.45
2715,-37.67
2716,-37.92
2717,-38.17
2718,-38.44
2719,-38.68
2720,-38.92
2721,-39.13
2722,-39.35
2723,-39.55
2724,-39.76
2725,-39.93
2726,-40.10
2727,-40.25
2728,-40.41
2729,-40.57
2730,-40.74
2731,-40.91
2732,-41.11
2733,-41.33
2734,-41.57
2735,-41.82
2736,-42.07
2737,-42.30
2738,-42.50
2739,-42.65
2740,-42.74
2741,-42.75
2742,-42.68
2743,-42.52
2744,-42.23
2745,-41.84
2746,-41.32
2747,-40.74
2748,-40.09
2749,-39.42
2750,-38.70
2751,-37.98
2752,-37.26
2753,-36.60
2754,-35.98
2755,-35.45
2756,-34.95
2757,-34.54
2758,-34.19
2759,-33.94
2760,-33.75
2761,-33.62
2762,-33.51
2763,-33.46
2764,-33.44
2765,-33.45
2766,-33.48
2767,-33.51
2768,-33.53
2769,-33.56
2770,-33.62
2771,-33.68
2772,-33.76
2773,-33.85
2774,-33.97
2775,-34.10
2776,-34.26
2777,-34.43
2778,-34.62
2779,-34.84
2780,-35.08
2781,-35.32
2782,-35.58
2783,-35.81
2784,-36.04
2785,-36.24
2786,-36.45
2787,-36.63
2788,-36.81
2789,-36.95
2790,-37.09
2791,-37.21
2792,-37.35
2793,-37.49
2794,-37.66
2795,-37.82
2796,-38.01
2797,-38.22
2798,-38.45
2799,-38.67
2800,-38.89
2801,-39.11
2802,-39.31
2803,-39.49
2804,-39.63
2805,-39.72
2806,-39.76
2807,-39.77
2808,-39.74
2809,-39.65
2810,-39.51
2811,-39.33
2812,-39.11
2813,-38.86
2814,-38.60
2815,-38.34
2816,-38.07
2817,-37.81
2818,-37.55
2819,-37.32
2820,-37.12
2821,-36.95
2822,-36.81
2823,-36.72
2824,-36.68
2825,-36.69
2826,-36.72
2827,-36.79
2828,-36.88
2829,-37.00
2830,-37.16
2831,-37.32
2832,-37.50
2833,-37.66
2834,-37.84
2835,-38.03
2836,-38.24
2837,-38.43
2838,-38.62
2839,-38.80
2840,-39.01
2841,-39.21
2842,-39.43
2843,-39.64
2844,-39.88
2845,-40.11
2846,-40.36
2847,-40.60
2848,-40.86
2849,-41.11
2850,-41.38
2851,-41.62
2852,-41.87
2853,-42.10
2854,-42.34
2855,-42.56
2856,-42.79
2857,-43.00
2858,-43.19
2859,-43.34
2860,-43.48
2861,-43.60
2862,-43.69
2863,-43.75
2864,-43.79
2865,-43.78
2866,-43.74
2867,-43.67
2868,-43.55
2869,-43.43
2870,-43.27
2871,-43.09
2872,-42.89
2873,-42.68
2874,-42.43
2875,-42.18
2876,-41.91
2877,-41.65
2878,-41.39
2879,-41.14
2880,-40.87
2881,-40.62
2882,-40.37
2883,-40.17
2884,-39.97
2885,-39.80
2886,-39.64
2887,-39.51
2888,-39.40
2889,-39.32
2890,-39.24
2891,-39.19
2892,-39.14
2893,-39.12
2894,-39.08
2895,-39.05
2896,-39.00
2897,-38.94
2898,-38.87
2899,-38.78
2900,-38.67
2901,-38.54
2902,-38.40
2903,-38.25
2904,-38.09
2905,-37.91
2906,-37.72
2907,-37.54
2908,-37.38
2909,-37.24
2910,-37.11
2911,-37.00
2912,-36.92
2913,-36.89
2914,-36.87
2915,-36.87
2916,-36.89
2917,-36.93
2918,-36.99
2919,-37.07
2920,-37.16
2921,-37.25
2922,-37.35
2923,-37.45
2924,-37.54
2925,-37.63
2926,-37.73
2927,-37.83
2928,-37.95
2929,-38.07
2930,-38.23
2931,-38.39
2932,-38.59
2933,-38.80
2934,-39.06
2935,-39.33
2936,-39.67
2937,-40.03
2938,-40.45
2939,-40.87
2940,-41.34
2941,-41.82
2942,-42.36
2943,-42.89
2944,-43.44
2945,-43.94
2946,-44.44
2947,-44.90
2948,-45.32
2949,-45.67
2950,-45.95
2951,-46.15
2952,-46.26
2953,-46.27
2954,-46.19
2955,-46.02
2956,-45.75
2957,-45.41
2958,-44.99
2959,-44.54
2960,-44.02
2961,-43.47
2962,-42.88
2963,-42.31
2964,-41.73
2965,-41.20
2966,-40.70
2967,-40.26
2968,-39.85
2969,-39.51
2970,-39.22
2971,-39.02
2972,-38.86
2973,-38.76
2974,-38.70
2975,-38.70
2976,-38.75
2977,-38.83
2978,-38.93
2979,-39.06
2980,-39.22
2981,-39.40
2982,-39.59
2983,-39.77
2984,-39.95
2985,-40.12
2986,-40.30
2987,-40.46
2988,-40.59
2989,-40.69
2990,-40.77
2991,-40.83
2992,-40.87
2993,-40.88
2994,-40.86
2995,-40.83
2996,-40.79
2997,-40.74
2998,-40.68
2999,-40.61
3000,-40.53
3001,-40.44
3002,-40.34
3003,-40.22
3004,-40.10
3005,-39.98
3006,-39.85
3007,-39.72
3008,-39.60
3009,-39.49
3010,-39.40
3011,-39.32
3012,-39.28
3013,-39.26
3014,-39.26
3015,-39.30
3016,-39.35
3017,-39.42
3018,-39.50
3019,-39.59
3020,-39.69
3021,-39.79
3022,-39.88
3023,-39.97
3024,-40.03
3025,-40.07
3026,-40.08
3027,-40.08
3028,-40.07
3029,-40.04
3030,-39.99
3031,-39.92
3032,-39.83
3033,-39.74
3034,-39.62
3035,-39.48
3036,-39.32
3037,-39.15
3038,-38.98
3039,-38.82
3040,-38.67
3041,-38.51
3042,-38.35
3043,-38.22
3044,-38.09
3045,-37.98
3046,-37.84
3047,-37.71
3048,-37.56
3049,-37.43
3050,-37.27
3051,-37.10
3052,-36.90
3053,-36.69
3054,-36.47
3055,-36.27
3056,-36.06
3057,-35.86
3058,-35.68
3059,-35.51
3060,-35.36
3061,-35.25
3062,-35.18
3063,-35.14
3064,-35.12
3065,-35.12
3066,-35.17
3067,-35.25
3068,-35.36
3069,-35.49
3070,-35.63
3071,-35.78
3072,-35.95
3073,-36.11
3074,-36.26
3075,-36.41
3076,-36.56
3077,-36.69
3078,-36.83
3079,-36.93
3080,-37.02
3081,-37.10
3082,-37.19
3083,-37.26
3084,-37.33
3085,-37.37
3086,-37.44
3087,-37.52
3088,-37.63
3089,-37.75
3090,-37.89
3091,-38.02
3092,-38.16
3093,-38.30
3094,-38.46
3095,-38.61
3096,-38.75
3097,-38.87
3098,-38.99
3099,-39.09
3100,-39.18
3101,-39.25
3102,-39.32
3103,-39.37
3104,-39.43
3105,-39.47
3106,-39.50
3107,-39.51
3108,-39.53
3109,-39.56
3110,-39.60
3111,-39.65
3112,-39.71
3113,-39.75
3114,-39.80
3115,-39.85
3116,-39.91
3117,-39.97
3118,-40.03
3119,-40.08
3120,-40.11
3121,-40.14
3122,-40.17
3123,-40.20
3124,-40.23
3125,-40.24
3126,-40.23
3127,-40.21
3128,-40.19
3129,-40.17
3130,-40.14
3131,-40.09
3132,-40.02
3133,-39.96
3134,-39.89
3135,-39.81
3136,-39.70
3137,-39.57
3138,-39.44
3139,-39.32
3140,-39.18
3141,-39.04
3142,-38.86
3143,-38.71
3144,-38.54
3145,-38.37
3146,-38.18
3147,-38.00
3148,-37.82
3149,-37.64
3150,-37.44
3151,-37.24
3152,-37.03
3153,-36.82
3154,-36.58
3155,-36.35
3156,-36.11
3157,-35.89
3158,-35.68
3159,-35.49
3160,-35.29
3161,-35.11
3162,-34.92
3163,-34.77
3164,-34.63
3165,-34.51
3166,-34.41
3167,-34.32
3168,-34.25
3169,-34.19
3170,-34.13
3171,-34.09
3172,-34.04
3173,-34.01
3174,-34.00
3175,-34.00
3176,-34.01
3177,-34.03
3178,-34.06
3179,-34.11
3180,-34.18
3181,-34.27
3182,-34.37
3183,-34.45
3184,-34.55
3185,-34.65
3186,-34.75
3187,-34.84
3188,-34.92
3189,-35.00
3190,-35.08
3191,-35.13
3192,-35.17
3193,-35.20
3194,-35.24
3195,-35.29
3196,-35.33
3197,-35.35
3198,-35.37
3199,-35.39
3200,-35.42
3201,-35.45
3202,-35.46
3203,-35.46
3204,-35.44
3205,-35.41
3206,-35.38
3207,-35.35
3208,-35.31
3209,-35.28
3210,-35.23
3211,-35.20
3212,-35.20
3213,-35.22
3214,-35.24
3215,-35.28
3216,-35.32
3217,-35.39
3218,-35.47
3219,-35.55
3220,-35.64
3221,-35.71
3222,-35.78
3223,-35.82
3224,-35.85
3225,-35.89
3226,-35.93
3227,-35.97
3228,-36.02
3229,-36.06
3230,-36.11
3231,-36.15
3232,-36.19
3233,-36.25
3234,-36.31
3235,-36.36
3236,-36.41
3237,-36.46
3238,-36.51
3239,-36.56
3240,-36.61
3241,-36.65
3242,-36.67
3243,-36.69
3244,-36.72
3245,-36.77
3246,-36.83
3247,-36.90
3248,-36.98
3249,-37.06
3250,-37.18
3251,-37.31
3252,-37.47
3253,-37.62
3254,-37.81
3255,-38.01
3256,-38.25
3257,-38.50
3258,-38.79
3259,-39.09
3260,-39.43
3261,-39.76
3262,-40.11
3263,-40.46
3264,-40.85
3265,-41.23
3266,-41.62
3267,-41.97
3268,-42.32
3269,-42.64
3270,-42.94
3271,-43.20
3272,-43.42
3273,-43.59
3274,-43.71
3275,-43.79
3276,-43.83
3277,-43.83
3278,-43.78
3279,-43.69
3280,-43.56
3281,-43.41
3282,-43.21
3283,-43.00
3284,-42.75
3285,-42.51
3286,-42.25
3287,-42.00
3288,-41.73
3289,-41.46
3290,-41.18
3291,-40.92
3292,-40.66
3293,-40.43
3294,-40.19
3295,-39.98
3296,-39.78
3297,-39.61
3298,-39.46
3299,-39.34
3300,-39.23
3301,-39.15
3302,-39.09
3303,-39.06
3304,-39.03
3305,-39.01
3306,-39.00
3307,-38.99
3308,-38.98
3309,-38.96
3310,-38.92
3311,-38.87
3312,-38.82
3313,-38.75
3314,-38.70
3315,-38.64
3316,-38.60
3317,-38.57
3318,-38.57
3319,-38.59
3320,-38.66
3321,-38.76
3322,-38.89
3323,-39.03
3324,-39.22
3325,-39.44
3326,-39.71
3327,-40.00
3328,-40.31
3329,-40.62
3330,-40.96
3331,-41.29
3332,-41.64
3333,-41.98
3334,-42.34
3335,-42.67
3336,-42.98
3337,-43.25
3338,-43.51
3339,-43.74
3340,-43.95
3341,-44.09
3342,-44.19
3343,-44.25
3344,-44.27
3345,-44.27
3346,-44.25
3347,-44.20
3348,-44.12
3349,-44.02
3350,-43.91
3351,-43.81
3352,-43.69
3353,-43.56
3354,-43.42
3355,-43.26
3356,-43.08
3357,-42.88
3358,-42.63
3359,-42.36
3360,-42.03
3361,-41.70
3362,-41.31
3363,-40.92
3364,-40.50
3365,-40.09
3366,-39.67
3367,-39.29
3368,-38.91
3369,-38.57
3370,-38.26
3371,-38.01
3372,-37.77
3373,-37.59
3374,-37.41
3375,-37.29
3376,-37.18
3377,-37.10
3378,-37.02
3379,-36.97
3380,-36.90
3381,-36.85
3382,-36.80
3383,-36.74
3384,-36.69
3385,-36.65
3386,-36.61
3387,-36.59
3388,-36.57
3389,-36.56
3390,-36.58
3391,-36.61
3392,-36.67
3393,-36.74
3394,-36.83
3395,-36.94
3396,-37.05
3397,-37.16
3398,-37.29
3399,-37.42
3400,-37.56
3401,-37.66
3402,-37.77
3403,-37.86
3404,-37.96
3405,-38.05
3406,-38.13
3407,-38.20
3408,-38.27
3409,-38.33
3410,-38.41
3411,-38.49
3412,-38.57
3413,-38.66
3414,-38.75
3415,-38.82
3416,-38.88
3417,-38.93
3418,-38.96
3419,-38.98
3420,-38.99
3421,-38.97
3422,-38.95
3423,-38.91
3424,-38.86
3425,-38.82
3426,-38.79
3427,-38.77
3428,-38.77
3429,-38.80
3430,-38.85
3431,-38.91
3432,-38.99
3433,-39.09
3434,-39.19
3435,-39.31
3436,-39.42
3437,-39.53
3438,-39.62
3439,-39.68
3440,-39.72
3441,-39.74
3442,-39.73
3443,-39.69
3444,-39.63
3445,-39.55
3446,-39.44
3447,-39.32
3448,-39.21
3449,-39.10
3450,-38.99
3451,-38.87
3452,-38.75
3453,-38.64
3454,-38.54
3455,-38.46
3456,-38.39
3457,-38.33
3458,-38.26
3459,-38.18
3460,-38.08
3461,-37.97
3462,-37.86
3463,-37.74
3464,-37.60
3465,-37.45
3466,-37.27
3467,-37.09
3468,-36.90
3469,-36.72
3470,-36.54
3471,-36.37
3472,-36.19
3473,-36.03
3474,-35.87
3475,-35.76
3476,-35.67
3477,-35.59
3478,-35.51
3479,-35.43
3480,-35.36
3481,-35.30
3482,-35.24
3483,-35.19
3484,-35.13
3485,-35.08
3486,-35.03
3487,-34.99
3488,-34.96
3489,-34.93
3490,-34.91
3491,-34.89
3492,-34.87
3493,-34.85
3494,-34.82
3495,-34.79
3496,-34.77
3497,-34.74
3498,-34.69
3499,-34.62
3500,-34.54
3501,-34.47
3502,-34.41
3503,-34.34
3504,-34.27
3505,-34.20
3506,-34.13
3507,-34.07
3508,-34.03
3509,-34.00
3510,-33.96
3511,-33.93
3512,-33.88
3513,-33.85
3514,-33.80
3515,-33.74
3516,-33.67
3517,-33.59
3518,-33.50
3519,-33.43
3520,-33.36
3521,-33.30
3522,-33.24
3523,-33.18
3524,-33.13
3525,-33.11
3526,-33.11
3527,-33.10
3528,-33.07
3529,-33.05
3530,-33.02
3531,-33.00
3532,-32.97
3533,-32.93
3534,-32.90
3535,-32.87
3536,-32.83
3537,-32.79
3538,-32.77
3539,-32.75
3540,-32.75
3541,-32.73
3542,-32.70
3543,-32.69
3544,-32.70
3545,-32.71
3546,-32.71
3547,-32.70
3548,-32.70
3549,-32.71
3550,-32.75
3551,-32.80
3552,-32.86
3553,-32.93
3554,-33.03
3555,-33.14
3556,-33.28
3557,-33.43
3558,-33.63
3559,-33.86
3560,-34.14
3561,-34.43
3562,-34.77
3563,-35.14
3564,-35.57
3565,-36.01
3566,-36.48
3567,-36.95
3568,-37.45
3569,-37.94
3570,-38.44
3571,-38.91
3572,-39.34
3573,-39.70
3574,-40.01
3575,-40.23
3576,-40.40
3577,-40.48
3578,-40.50
3579,-40.43
3580,-40.28
3581,-40.06
3582,-39.77
3583,-39.44
3584,-39.05
3585,-38.63
3586,-38.14
3587,-37.64
3588,-37.08
3589,-36.53
3590,-35.93
3591,-35.32
3592,-34.67
3593,-34.05
3594,-33.41
3595,-32.79
3596,-32.12
3597,-31.48
3598,-30.83
3599,-30.25
3600,-29.65
3601,-29.10
3602,-28.56
3603,-28.08
3604,-27.62
3605,-27.22
3606,-26.86
3607,-26.57
3608,-26.30
3609,-26.10
3610,-25.93
3611,-25.85
3612,-25.81
3613,-25.80
3614,-25.82
3615,-25.87
3616,-25.95
3617,-26.05
3618,-26.17
3619,-26.31
3620,-26.45
3621,-26.59
3622,-26.74
3623,-26.89
3624,-27.07
3625,-27.24
3626,-27.44
3627,-27.66
3628,-27.93
3629,-28.20
3630,-28.50
3631,-28.81
3632,-29.17
3633,-29.52
3634,-29.91
3635,-30.29
3636,-30.71
3637,-31.12
3638,-31.57
3639,-31.99
3640,-32.42
3641,-32.82
3642,-33.24
3643,-33.63
3644,-34.02
3645,-34.37
3646,-34.70
3647,-34.97
3648,-35.23
3649,-35.44
3650,-35.62
3651,-35.76
3652,-35.87
3653,-35.94
3654,-35.99
3655,-36.01
3656,-36.01
3657,-36.00
3658,-35.98
3659,-35.96
3660,-35.94
3661,-35.93
3662,-35.93
3663,-35.93
3664,-35.92
3665,-35.90
3666,-35.89
3667,-35.88
3668,-35.86
3669,-35.81
3670,-35.74
3671,-35.66
3672,-35.56
3673,-35.46
3674,-35.33
3675,-35.20
3676,-35.04
3677,-34.88
3678,-34.72
3679,-34.56
3680,-34.36
3681,-34.17
3682,-33.97
3683,-33.77
3684,-33.55
3685,-33.33
3686,-33.09
3687,-32.86
3688,-32.60
3689,-32.35
3690,-32.09
3691,-31.86
3692,-31.63
3693,-31.43
3694,-31.22
3695,-31.05
3696,-30.89
3697,-30.78
3698,-30.69
3699,-30.63
3700,-30.59
3701,-30.58
3702,-30.57
3703,-30.58
3704,-30.60
3705,-30.63
3706,-30.67
3707,-30.71
3708,-30.75
3709,-30.77
3710,-30.77
3711,-30.76
3712,-30.75
3713,-30.73
3714,-30.69
3715,-30.64
3716,-30.59
3717,-30.54
3718,-30.48
3719,-30.43
3720,-30.41
3721,-30.41
3722,-30.45
3723,-30.51
3724,-30.61
3725,-30.73
3726,-30.89
3727,-31.08
3728,-31.31
3729,-31.56
3730,-31.84
3731,-32.10
3732,-32.38
3733,-32.65
3734,-32.93
3735,-33.18
3736,-33.45
3737,-33.69
3738,-33.94
3739,-34.16
3740,-34.41
3741,-34.66
3742,-34.93
3743,-35.17
3744,-35.42
3745,-35.67
3746,-35.95
3747,-36.22
3748,-36.51
3749,-36.77
3750,-37.04
3751,-37.27
3752,-37.48
3753,-37.67
3754,-37.85
3755,-38.00
3756,-38.13
3757,-38.23
3758,-38.31
3759,-38.38
3760,-38.44
3761,-38.48
3762,-38.51
3763,-38.53
3764,-38.53
3765,-38.51
3766,-38.47
3767,-38.43
3768,-38.38
3769,-38.31
3770,-38.22
3771,-38.12
3772,-38.02
3773,-37.92
3774,-37.82
3775,-37.72
3776,-37.63
3777,-37.55
3778,-37.48
3779,-37.42
3780,-37.38
3781,-37.36
3782,-37.35
3783,-37.35
3784,-37.36
3785,-37.38
3786,-37.41
3787,-37.45
3788,-37.51
3789,-37.58
3790,-37.68
3791,-37.79
3792,-37.92
3793,-38.08
3794,-38.26
3795,-38.45
3796,-38.64
3797,-38.85
3798,-39.09
3799,-39.35
3800,-39.61
3801,-39.83
3802,-40.05
3803,-40.25
3804,-40.46
3805,-40.67
3806,-40.87
3807,-41.04
3808,-41.21
3809,-41.35
3810,-41.51
3811,-41.65
3812,-41.79
3813,-41.90
3814,-41.99
3815,-42.06
3816,-42.10
3817,-42.11
3818,-42.09
3819,-42.02
3820,-41.89
3821,-41.73
3822,-41.52
3823,-41.29
3824,-41.04
3825,-40.79
3826,-40.51
3827,-40.23
3828,-39.93
3829,-39.65
3830,-39.35
3831,-39.07
3832,-38.78
3833,-38.50
3834,-38.20
3835,-37.91
3836,-37.60
3837,-37.30
3838,-36.97
3839,-36.64
3840,-36.30
3841,-36.00
3842,-35.69
3843,-35.42
3844,-35.17
3845,-34.98
3846,-34.82
3847,-34.70
3848,-34.61
3849,-34.56
3850,-34.53
3851,-34.53
3852,-34.54
3853,-34.56
3854,-34.56
3855,-34.59
3856,-34.61
3857,-34.64
3858,-34.67
3859,-34.69
3860,-34.71
3861,-34.75
3862,-34.80
3863,-34.86
3864,-34.93
3865,-35.01
3866,-35.10
3867,-35.21
3868,-35.34
3869,-35.47
3870,-35.63
3871,-35.78
3872,-35.94
3873,-36.10
3874,-36.29
3875,-36.47
3876,-36.68
3877,-36.88
3878,-37.12
3879,-37.38
3880,-37.69
3881,-37.99
3882,-38.35
3883,-38.71
3884,-39.13
3885,-39.54
3886,-40.02
3887,-40.49
3888,-41.00
3889,-41.50
3890,-42.04
3891,-42.55
3892,-43.07
3893,-43.53
3894,-43.98
3895,-44.36
3896,-44.67
3897,-44.89
3898,-45.03
3899,-45.08
3900,-45.02
3901,-44.87
3902,-44.62
3903,-44.30
3904,-43.90
3905,-43.43
3906,-42.88
3907,-42.32
3908,-41.72
3909,-41.14
3910,-40.53
3911,-39.97
3912,-39.40
3913,-38.87
3914,-38.35
3915,-37.88
3916,-37.43
3917,-37.04
3918,-36.64
3919,-36.29
3920,-35.95
3921,-35.66
3922,-35.40
3923,-35.19
3924,-34.99
3925,-34.83
3926,-34.70
3927,-34.63
3928,-34.60
3929,-34.62
3930,-34.67
3931,-34.75
3932,-34.87
3933,-35.01
3934,-35.19
3935,-35.39
3936,-35.62
3937,-35.86
3938,-36.12
3939,-36.40
3940,-36.69
3941,-36.97
3942,-37.27
3943,-37.57
3944,-37.90
3945,-38.21
3946,-38.53
3947,-38.82
3948,-39.10
3949,-39.35
3950,-39.58
3951,-39.78
3952,-39.93
3953,-40.03
3954,-40.08
3955,-40.09
3956,-40.06
3957,-39.98
3958,-39.86
3959,-39.71
3960,-39.52
3961,-39.29
3962,-39.04
3963,-38.77
3964,-38.49
3965,-38.21
3966,-37.92
3967,-37.64
3968,-37.36
3969,-37.09
3970,-36.83
3971,-36.60
3972,-36.38
3973,-36.20
3974,-36.01
3975,-35.86
3976,-35.69
3977,-35.55
3978,-35.40
3979,-35.25
3980,-35.09
3981,-34.93
3982,-34.75
3983,-34.59
3984,-34.41
3985,-34.25
3986,-34.08
3987,-33.93
3988,-33.77
3989,-33.62
3990,-33.47
3991,-33.33
3992,-33.18
3993,-33.04
3994,-32.91
3995,-32.79
3996,-32.64
3997,-32.50
3998,-32.35
3999,-32.21
4000,-32.06
4001,-31.89
4002,-31.72
4003,-31.57
4004,-31.40
4005,-31.23
4006,-31.03
4007,-30.83
4008,-30.62
4009,-30.41
4010,-30.17
4011,-29.92
4012,-29.63
4013,-29.36
4014,-29.10
4015,-28.85
4016,-28.59
4017,-28.34
4018,-28.09
4019,-27.90
4020,-27.73
4021,-27.61
4022,-27.51
4023,-27.43
4024,-27.36
4025,-27.33
4026,-27.31
4027,-27.32
4028,-27.31
4029,-27.31
4030,-27.29
4031,-27.27
4032,-27.25
4033,-27.21
4034,-27.15
4035,-27.09
4036,-27.04
4037,-26.99
4038,-26.92
4039,-26.84
4040,-26.77
4041,-26.72
4042,-26.68
4043,-26.65
4044,-26.64
4045,-26.65
4046,-26.67
4047,-26.70
4048,-26.75
4049,-26.83
4050,-26.92
4051,-27.01
4052,-27.11
4053,-27.22
4054,-27.33
4055,-27.44
4056,-27.56
4057,-27.68
4058,-27.80
4059,-27.90
4060,-28.01
4061,-28.10
4062,-28.20
4063,-28.29
4064,-28.37
4065,-28.44
4066,-28.50
4067,-28.55
4068,-28.58
4069,-28.59
4070,-28.59
4071,-28.60
4072,-28.62
4073,-28.62
4074,-28.63
4075,-28.65
4076,-28.69
4077,-28.72
4078,-28.77
4079,-28.80
4080,-28.85
4081,-28.91
4082,-28.98
4083,-29.06
4084,-29.15
4085,-29.24
4086,-29.36
4087,-29.50
4088,-29.66
4089,-29.81
4090,-29.98
4091,-30.15
4092,-30.36
4093,-30.57
4094,-30.77
4095,-30.94
4096,-31.12
4097,-31.29
4098,-31.44
4099,-31.56
4100,-31.66
4101,-31.73
4102,-31.79
4103,-31.83
4104,-31.82
4105,-31.78
4106,-31.71
4107,-31.61
4108,-31.48
4109,-31.31
4110,-31.11
4111,-30.88
4112,-30.62
4113,-30.33
4114,-30.02
4115,-29.72
4116,-29.40
4117,-29.10
4118,-28.79
4119,-28.51
4120,-28.24
4121,-28.03
4122,-27.84
4123,-27.70
4124,-27.58
4125,-27.49
4126,-27.43
4127,-27.39
4128,-27.37
4129,-27.36
4130,-27.36
4131,-27.37
4132,-27.38
4133,-27.40
4134,-27.44
4135,-27.46
4136,-27.48
4137,-27.50
4138,-27.54
4139,-27.58
4140,-27.64
4141,-27.70
4142,-27.79
4143,-27.89
4144,-28.01
4145,-28.11
4146,-28.24
4147,-28.38
4148,-28.52
4149,-28.66
4150,-28.80
4151,-28.96
4152,-29.14
4153,-29.30
4154,-29.45
4155,-29.57
4156,-29.68
4157,-29.78
4158,-29.85
4159,-29.89
4160,-29.90
4161,-29.90
4162,-29.86
4163,-29.80
4164,-29.72
4165,-29.62
4166,-29.50
4167,-29.39
4168,-29.27
4169,-29.15
4170,-29.02
4171,-28.89
4172,-28.77
4173,-28.65
4174,-28.52
4175,-28.41
4176,-28.30
4177,-28.21
4178,-28.13
4179,-28.07
4180,-27.99
4181,-27.94
4182,-27.90
4183,-27.89
4184,-27.89
4185,-27.90
4186,-27.90
4187,-27.92
4188,-27.94
4189,-27.98
4190,-28.02
4191,-28.04
4192,-28.05
4193,-28.04
4194,-28.04
4195,-28.02
4196,-27.99
4197,-27.93
4198,-27.87
4199,-27.83
4200,-27.79
4201,-27.73
4202,-27.66
4203,-27.60
4204,-27.55
4205,-27.53
4206,-27.51
4207,-27.48
4208,-27.46
4209,-27.45
4210,-27.47
4211,-27.51
4212,-27.56
4213,-27.63
4214,-27.72
4215,-27.83
4216,-27.96
4217,-28.10
4218,-28.28
4219,-28.47
4220,-28.67
4221,-28.86
4222,-29.07
4223,-29.26
4224,-29.46
4225,-29.67
4226,-29.89
4227,-30.09
4228,-30.29
4229,-30.48
4230,-30.67
4231,-30.86
4232,-31.04
4233,-31.20
4234,-31.34
4235,-31.47
4236,-31.58
4237,-31.68
4238,-31.77
4239,-31.83
4240,-31.85
4241,-31.84
4242,-31.81
4243,-31.77
4244,-31.72
4245,-31.66
4246,-31.59
4247,-31.50
4248,-31.43
4249,-31.37
4250,-31.32
4251,-31.29
4252,-31.29
4253,-31.30
4254,-31.35
4255,-31.41
4256,-31.48
4257,-31.60
4258,-31.74
4259,-31.88
4260,-32.03
4261,-32.16
4262,-32.29
4263,-32.42
4264,-32.53
4265,-32.62
4266,-32.70
4267,-32.76
4268,-32.79
4269,-32.77
4270,-32.74
4271,-32.70
4272,-32.65
4273,-32.58
4274,-32.49
4275,-32.40
4276,-32.32
4277,-32.25
4278,-32.18
4279,-32.11
4280,-32.05
4281,-32.01
4282,-31.99
4283,-32.00
4284,-32.00
4285,-32.00
4286,-32.01
4287,-32.03
4288,-32.04
4289,-32.06
4290,-32.07
4291,-32.09
4292,-32.11
4293,-32.12
4294,-32.12
4295,-32.11
4296,-32.09
4297,-32.06
4298,-32.02
4299,-31.97
4300,-31.92
4301,-31.86
4302,-31.78
4303,-31.68
4304,-31.57
4305,-31.46
4306,-31.35
4307,-31.26
4308,-31.15
4309,-31.07
4310,-31.00
4311,-30.96
4312,-30.93
4313,-30.91
4314,-30.92
4315,-30.95
4316,-30.98
4317,-30.99
4318,-31.00
4319,-31.01
4320,-31.00
4321,-30.97
4322,-30.89
4323,-30.78
4324,-30.64
4325,-30.47
4326,-30.24
4327,-29.99
4328,-29.69
4329,-29.40
4330,-29.09
4331,-28.78
4332,-28.48
4333,-28.19
4334,-27.91
4335,-27.67
4336,-27.45
4337,-27.28
4338,-27.11
4339,-26.97
4340,-26.84
4341,-26.73
4342,-26.63
4343,-26.54
4344,-26.47
4345,-26.42
4346,-26.35
4347,-26.27
4348,-26.19
4349,-26.13
4350,-26.10
4351,-26.08
4352,-26.05
4353,-26.02
4354,-26.01
4355,-26.02
4356,-26.03
4357,-26.04
4358,-26.02
4359,-26.01
4360,-26.01
4361,-26.00
4362,-25.98
4363,-25.95
4364,-25.92
4365,-25.88
4366,-25.85
4367,-25.84
4368,-25.83
4369,-25.84
4370,-25.85
4371,-25.87
4372,-25.92
4373,-25.97
4374,-26.04
4375,-26.11
4376,-26.20
4377,-26.31
4378,-26.42
4379,-26.51
4380,-26.62
4381,-26.72
4382,-26.84
4383,-26.95
4384,-27.05
4385,-27.15
4386,-27.25
4387,-27.33
4388,-27.42
4389,-27.51
4390,-27.61
4391,-27.69
4392,-27.77
4393,-27.84
4394,-27.91
4395,-27.98
4396,-28.04
4397,-28.09
4398,-28.14
4399,-28.17
4400,-28.20
4401,-28.24
4402,-28.28
4403,-28.31
4404,-28.34
4405,-28.35
4406,-28.36
4407,-28.37
4408,-28.38
4409,-28.37
4410,-28.33
4411,-28.28
4412,-28.23
4413,-28.18
4414,-28.12
4415,-28.06
4416,-28.01
4417,-27.97
4418,-27.93
4419,-27.91
4420,-27.90
4421,-27.90
4422,-27.92
4423,-27.94
4424,-27.98
4425,-28.03
4426,-28.08
4427,-28.11
4428,-28.11
4429,-28.10
4430,-28.09
4431,-28.06
4432,-28.00
4433,-27.91
4434,-27.80
4435,-27.69
4436,-27.58
4437,-27.46
4438,-27.33
4439,-27.22
4440,-27.11
4441,-27.02
4442,-26.93
4443,-26.86
4444,-26.79
4445,-26.73
4446,-26.66
4447,-26.59
4448,-26.52
4449,-26.47
4450,-26.41
4451,-26.35
4452,-26.31
4453,-26.28
4454,-26.25
4455,-26.22
4456,-26.19
4457,-26.17
4458,-26.16
4459,-26.15
4460,-26.14
4461,-26.13
4462,-26.14
4463,-26.15
4464,-26.17
4465,-26.19
4466,-26.19
4467,-26.19
4468,-26.18
4469,-26.17
4470,-26.14
4471,-26.11
4472,-26.06
4473,-26.00
4474,-25.90
4475,-25.79
4476,-25.67
4477,-25.54
4478,-25.41
4479,-25.27
4480,-25.13
4481,-24.99
4482,-24.85
4483,-24.71
4484,-24.58
4485,-24.46
4486,-24.35
4487,-24.25
4488,-24.16
4489,-24.07
4490,-23.98
4491,-23.90
4492,-23.84
4493,-23.79
4494,-23.74
4495,-23.69
4496,-23.65
4497,-23.62
4498,-23.60
4499,-23.58
4500,-23.56
4501,-23.54
4502,-23.51
4503,-23.49
4504,-23.46
4505,-23.43
4506,-23.39
4507,-23.33
4508,-23.26
4509,-23.19
4510,-23.11
4511,-23.03
4512,-22.96
4513,-22.91
4514,-22.87
4515,-22.83
4516,-22.81
4517,-22.81
4518,-22.85
4519,-22.90
4520,-22.96
4521,-23.03
4522,-23.12
4523,-23.22
4524,-23.32
4525,-23.42
4526,-23.51
4527,-23.60
4528,-23.66
4529,-23.70
4530,-23.71
4531,-23.71
4532,-23.71
4533,-23.70
4534,-23.68
4535,-23.64
4536,-23.59
4537,-23.54
4538,-23.47
4539,-23.42
4540,-23.37
4541,-23.35
4542,-23.31
4543,-23.26
4544,-23.21
4545,-23.16
4546,-23.10
4547,-23.05
4548,-22.98
4549,-22.90
4550,-22.81
4551,-22.72
4552,-22.63
4553,-22.56
4554,-22.47
4555,-22.39
4556,-22.33
4557,-22.30
4558,-22.30
4559,-22.30
4560,-22.30
4561,-22.32
4562,-22.37
4563,-22.44
4564,-22.52
4565,-22.60
4566,-22.68
4567,-22.75
4568,-22.80
4569,-22.83
4570,-22.84
4571,-22.84
4572,-22.82
4573,-22.78
4574,-22.74
4575,-22.68
4576,-22.63
4577,-22.56
4578,-22.52
4579,-22.50
4580,-22.49
4581,-22.49
4582,-22.51
4583,-22.54
4584,-22.57
4585,-22.60
4586,-22.63
4587,-22.67
4588,-22.68
4589,-22.68
4590,-22.67
4591,-22.65
4592,-22.62
4593,-22.56
4594,-22.48
4595,-22.39
4596,-22.30
4597,-22.21
4598,-22.11
4599,-22.01
4600,-21.91
4601,-21.84
4602,-21.77
4603,-21.72
4604,-21.68
4605,-21.66
4606,-21.67
4607,-21.70
4608,-21.74
4609,-21.78
4610,-21.83
4611,-21.89
4612,-21.95
4613,-22.00
4614,-22.05
4615,-22.09
4616,-22.11
4617,-22.12
4618,-22.12
4619,-22.11
4620,-22.09
4621,-22.07
4622,-22.05
4623,-22.03
4624,-22.02
4625,-22.03
4626,-22.05
4627,-22.06
4628,-22.06
4629,-22.06
4630,-22.06
4631,-22.06
4632,-22.06
4633,-22.06
4634,-22.06
4635,-22.04
4636,-22.00
4637,-21.96
4638,-21.93
4639,-21.90
4640,-21.86
4641,-21.83
4642,-21.78
4643,-21.75
4644,-21.70
4645,-21.64
4646,-21.56
4647,-21.49
4648,-21.41
4649,-21.34
4650,-21.27
4651,-21.18
4652,-21.08
4653,-20.99
4654,-20.91
4655,-20.83
4656,-20.75
4657,-20.67
4658,-20.60
4659,-20.54
4660,-20.49
4661,-20.45
4662,-20.42
4663,-20.40
4664,-20.39
4665,-20.39
4666,-20.40
4667,-20.43
4668,-20.47
4669,-20.50
4670,-20.52
4671,-20.54
4672,-20.57
4673,-20.60
4674,-20.61
4675,-20.62
4676,-20.61
4677,-20.61
4678,-20.60
4679,-20.57
4680,-20.54
4681,-20.49
4682,-20.46
4683,-20.43
4684,-20.40
4685,-20.38
4686,-20.37
4687,-20.36
4688,-20.35
4689,-20.35
4690,-20.37
4691,-20.40
4692,-20.42
4693,-20.43
4694,-20.44
4695,-20.45
4696,-20.46
4697,-20.48
4698,-20.50
4699,-20.52
4700,-20.54
4701,-20.57
4702,-20.61
4703,-20.65
4704,-20.69
4705,-20.72
4706,-20.75
4707,-20.78
4708,-20.81
4709,-20.84
4710,-20.86
4711,-20.87
4712,-20.87
4713,-20.86
4714,-20.84
4715,-20.81
4716,-20.77
4717,-20.72
4718,-20.67
4719,-20.63
4720,-20.59
4721,-20.54
4722,-20.48
4723,-20.42
4724,-20.37
4725,-20.33
4726,-20.30
4727,-20.27
4728,-20.23
4729,-20.19
4730,-20.17
4731,-20.16
4732,-20.14
4733,-20.13
4734,-20.11
4735,-20.12
4736,-20.15
4737,-20.17
4738,-20.18
4739,-20.21
4740,-20.27
4741,-20.34
4742,-20.40
4743,-20.45
4744,-20.51
4745,-20.59
4746,-20.67
4747,-20.74
4748,-20.80
4749,-20.86
4750,-20.93
4751,-20.99
4752,-21.06
4753,-21.13
4754,-21.21
4755,-21.30
4756,-21.39
4757,-21.48
4758,-21.59
4759,-21.70
4760,-21.82
4761,-21.92
4762,-22.01
4763,-22.08
4764,-22.16
4765,-22.23
4766,-22.29
4767,-22.32
4768,-22.32
4769,-22.30
4770,-22.26
4771,-22.21
4772,-22.16
4773,-22.09
4774,-21.99
4775,-21.88
4776,-21.74
4777,-21.59
4778,-21.42
4779,-21.24
4780,-21.02
4781,-20.81
4782,-20.57
4783,-20.32
4784,-20.03
4785,-19.75
4786,-19.46
4787,-19.19
4788,-18.90
4789,-18.63
4790,-18.36
4791,-18.14
4792,-17.93
4793,-17.75
4794,-17.57
4795,-17.43
4796,-17.29
4797,-17.18
4798,-17.06
4799,-16.96
4800,-16.85
4801,-16.74
4802,-16.63
4803,-16.51
4804,-16.37
4805,-16.23
4806,-16.07
4807,-15.94
4808,-15.81
4809,-15.69
4810,-15.58
4811,-15.48
4812,-15.40
4813,-15.34
4814,-15.29
4815,-15.24
4816,-15.20
4817,-15.17
4818,-15.15
4819,-15.12
4820,-15.07
4821,-15.01
4822,-14.92
4823,-14.81
4824,-14.67
4825,-14.50
4826,-14.31
4827,-14.11
4828,-13.90
4829,-13.70
4830,-13.49
4831,-13.32
4832,-13.15
4833,-13.02
4834,-12.91
4835,-12.83
4836,-12.77
4837,-12.74
4838,-12.74
4839,-12.75
4840,-12.76
4841,-12.76
4842,-12.75
4843,-12.75
4844,-12.73
4845,-12.69
4846,-12.62
4847,-12.54
4848,-12.46
4849,-12.38
4850,-12.29
4851,-12.19
4852,-12.11
4853,-12.07
4854,-12.05
4855,-12.04
4856,-12.05
4857,-12.09
4858,-12.16
4859,-12.23
4860,-12.30
4861,-12.37
4862,-12.44
4863,-12.51
4864,-12.56
4865,-12.58
4866,-12.58
4867,-12.58
4868,-12.58
4869,-12.57
4870,-12.55
4871,-12.53
4872,-12.51
4873,-12.49
4874,-12.48
4875,-12.47
4876,-12.49
4877,-12.52
4878,-12.56
4879,-12.62
4880,-12.70
4881,-12.78
4882,-12.90
4883,-13.02
4884,-13.17
4885,-13.31
4886,-13.47
4887,-13.65
4888,-13.86
4889,-14.07
4890,-14.29
4891,-14.50
4892,-14.72
4893,-14.94
4894,-15.17
4895,-15.38
4896,-15.58
4897,-15.76
4898,-15.95
4899,-16.11
4900,-16.28
4901,-16.42
4902,-16.56
4903,-16.67
4904,-16.79
4905,-16.88
4906,-16.97
4907,-17.03
4908,-17.10
4909,-17.14
4910,-17.17
4911,-17.17
4912,-17.16
4913,-17.14
4914,-17.11
4915,-17.07
4916,-17.03
4917,-17.00
4918,-16.97
4919,-16.95
4920,-16.93
4921,-16.93
4922,-16.97
4923,-17.03
4924,-17.09
4925,-17.15
4926,-17.22
4927,-17.29
4928,-17.38
4929,-17.45
4930,-17.52
4931,-17.58
4932,-17.65
4933,-17.69
4934,-17.75
4935,-17.81
4936,-17.90
4937,-17.99
4938,-18.11
4939,-18.24
4940,-18.44
4941,-18.66
4942,-18.95
4943,-19.24
4944,-19.61
4945,-20.02
4946,-20.49
4947,-20.97
4948,-21.49
4949,-22.01
4950,-22.56
4951,-23.09
4952,-23.58
4953,-24.01
4954,-24.37
4955,-24.65
4956,-24.83
4957,-24.89
4958,-24.80
4959,-24.57
4960,-24.19
4961,-23.69
4962,-23.06
4963,-22.33
4964,-21.47
4965,-20.56
4966,-19.53
4967,-18.50
4968,-17.41
4969,-16.36
4970,-15.27
4971,-14.24
4972,-13.19
4973,-12.23
4974,-11.29
4975,-10.47
4976,-9.69
4977,-9.03
4978,-8.42
4979,-7.93
4980,-7.50
4981,-7.20
4982,-6.97
4983,-6.84
4984,-6.77
4985,-6.78
4986,-6.84
4987,-6.95
4988,-7.09
4989,-7.25
4990,-7.43
4991,-7.61
4992,-7.82
4993,-8.04
4994,-8.28
4995,-8.51
4996,-8.75
4997,-8.99
4998,-9.27
4999,-9.53
5000,-9.83
5001,-10.11
5002,-10.42
5003,-10.73
5004,-11.06
5005,-11.36
5006,-11.66
5007,-11.95
5008,-12.26
5009,-12.54
5010,-12.82
5011,-13.10
5012,-13.39
5013,-13.66
5014,-13.92
5015,-14.16
5016,-14.39
5017,-14.58
5018,-14.74
5019,-14.86
5020,-14.96
5021,-15.02
5022,-15.05
5023,-15.04
5024,-15.01
5025,-14.95
5026,-14.88
5027,-14.79
5028,-14.71
5029,-14.65
5030,-14.60
5031,-14.56
5032,-14.54
5033,-14.56
5034,-14.60
5035,-14.65
5036,-14.72
5037,-14.79
5038,-14.85
5039,-14.90
5040,-14.94
5041,-14.97
5042,-14.98
5043,-14.98
5044,-14.97
5045,-14.96
5046,-14.96
5047,-14.95
5048,-14.97
5049,-15.00
5050,-15.05
5051,-15.09
5052,-15.15
5053,-15.21
5054,-15.28
5055,-15.34
5056,-15.37
5057,-15.37
5058,-15.35
5059,-15.32
5060,-15.26
5061,-15.19
5062,-15.10
5063,-15.01
5064,-14.91
5065,-14.82
5066,-14.75
5067,-14.70
5068,-14.67
5069,-14.67
5070,-14.69
5071,-14.72
5072,-14.77
5073,-14.83
5074,-14.89
5075,-14.95
5076,-15.01
5077,-15.07
5078,-15.12
5079,-15.15
5080,-15.17
5081,-15.18
5082,-15.18
5083,-15.16
5084,-15.12
5085,-15.07
5086,-15.02
5087,-14.98
5088,-14.94
5089,-14.89
5090,-14.84
5091,-14.80
5092,-14.76
5093,-14.71
5094,-14.66
5095,-14.62
5096,-14.58
5097,-14.54
5098,-14.47
5099,-14.38
5100,-14.28
5101,-14.17
5102,-14.04
5103,-13.89
5104,-13.70
5105,-13.50
5106,-13.28
5107,-13.06
5108,-12.82
5109,-12.57
5110,-12.30
5111,-12.04
5112,-11.78
5113,-11.54
5114,-11.31
5115,-11.09
5116,-10.87
5117,-10.67
5118,-10.48
5119,-10.31
5120,-10.14
5121,-10.00
5122,-9.88
5123,-9.77
5124,-9.64
5125,-9.52
5126,-9.41
5127,-9.33
5128,-9.25
5129,-9.19
5130,-9.10
5131,-9.03
5132,-8.97
5133,-8.93
5134,-8.88
5135,-8.83
5136,-8.76
5137,-8.72
5138,-8.66
5139,-8.61
5140,-8.54
5141,-8.46
5142,-8.36
5143,-8.24
5144,-8.11
5145,-7.98
5146,-7.86
5147,-7.75
5148,-7.63
5149,-7.52
5150,-7.42
5151,-7.36
5152,-7.31
5153,-7.25
5154,-7.20
5155,-7.17
5156,-7.16
5157,-7.15
5158,-7.14
5159,-7.11
5160,-7.09
5161,-7.07
5162,-7.06
5163,-7.07
5164,-7.10
5165,-7.12
5166,-7.17
5167,-7.24
5168,-7.34
5169,-7.45
5170,-7.59
5171,-7.72
5172,-7.87
5173,-8.03
5174,-8.21
5175,-8.37
5176,-8.52
5177,-8.66
5178,-8.81
5179,-8.97
5180,-9.12
5181,-9.24
5182,-9.39
5183,-9.52
5184,-9.67
5185,-9.81
5186,-9.97
5187,-10.15
5188,-10.32
5189,-10.46
5190,-10.58
5191,-10.69
5192,-10.82
5193,-10.93
5194,-11.02
5195,-11.08
5196,-11.14
5197,-11.18
5198,-11.24
5199,-11.30
5200,-11.36
5201,-11.43
5202,-11.51
5203,-11.60
5204,-11.69
5205,-11.78
5206,-11.88
5207,-12.00
5208,-12.12
5209,-12.21
5210,-12.28
5211,-12.34
5212,-12.39
5213,-12.43
5214,-12.45
5215,-12.44
5216,-12.41
5217,-12.36
5218,-12.32
5219,-12.27
5220,-12.21
5221,-12.13
5222,-12.04
5223,-11.96
5224,-11.89
5225,-11.82
5226,-11.74
5227,-11.67
5228,-11.60
5229,-11.54
5230,-11.47
5231,-11.39
5232,-11.31
5233,-11.24
5234,-11.18
5235,-11.13
5236,-11.05
5237,-10.98
5238,-10.89
5239,-10.82
5240,-10.73
5241,-10.64
5242,-10.55
5243,-10.46
5244,-10.37
5245,-10.26
5246,-10.13
5247,-10.03
5248,-9.94
5249,-9.87
5250,-9.80
5251,-9.73
5252,-9.68
5253,-9.66
5254,-9.66
5255,-9.67
5256,-9.70
5257,-9.76
5258,-9.84
5259,-9.92
5260,-10.00
5261,-10.08
5262,-10.16
5263,-10.24
5264,-10.32
5265,-10.39
5266,-10.44
5267,-10.48
5268,-10.53
5269,-10.57
5270,-10.61
5271,-10.63
5272,-10.65
5273,-10.68
5274,-10.71
5275,-10.72
5276,-10.72
5277,-10.72
5278,-10.71
5279,-10.70
5280,-10.69
5281,-10.68
5282,-10.66
5283,-10.63
5284,-10.57
5285,-10.50
5286,-10.42
5287,-10.33
5288,-10.22
5289,-10.09
5290,-9.95
5291,-9.82
5292,-9.66
5293,-9.50
5294,-9.31
5295,-9.14
5296,-8.96
5297,-8.80
5298,-8.66
5299,-8.54
5300,-8.41
5301,-8.31
5302,-8.20
5303,-8.12
5304,-8.04
5305,-7.99
5306,-7.93
5307,-7.86
5308,-7.78
5309,-7.70
5310,-7.61
5311,-7.52
5312,-7.39
5313,-7.27
5314,-7.15
5315,-7.04
5316,-6.92
5317,-6.82
5318,-6.72
5319,-6.65
5320,-6.60
5321,-6.56
5322,-6.54
5323,-6.54
5324,-6.55
5325,-6.58
5326,-6.60
5327,-6.64
5328,-6.65
5329,-6.66
5330,-6.65
5331,-6.63
5332,-6.59
5333,-6.53
5334,-6.46
5335,-6.39
5336,-6.31
5337,-6.23
5338,-6.15
5339,-6.09
5340,-6.03
5341,-5.99
5342,-5.96
5343,-5.96
5344,-5.95
5345,-5.95
5346,-5.95
5347,-5.94
5348,-5.93
5349,-5.90
5350,-5.85
5351,-5.79
5352,-5.73
5353,-5.66
5354,-5.57
5355,-5.47
5356,-5.37
5357,-5.29
5358,-5.23
5359,-5.17
5360,-5.11
5361,-5.06
5362,-4.99
5363,-4.92
5364,-4.85
5365,-4.76
5366,-4.64
5367,-4.51
5368,-4.35
5369,-4.17
5370,-3.96
5371,-3.72
5372,-3.48
5373,-3.25
5374,-3.02
5375,-2.80
5376,-2.57
5377,-2.36
5378,-2.16
5379,-1.99
5380,-1.83
5381,-1.72
5382,-1.61
5383,-1.53
5384,-1.45
5385,-1.38
5386,-1.31
5387,-1.25
5388,-1.19
5389,-1.15
5390,-1.11
5391,-1.07
5392,-1.04
5393,-1.00
5394,-0.98
5395,-0.96
5396,-0.95
5397,-0.96
5398,-0.98
5399,-1.00
5400,-1.03
5401,-1.06
5402,-1.09
5403,-1.14
5404,-1.17
5405,-1.20
5406,-1.22
5407,-1.25
5408,-1.27
5409,-1.28
5410,-1.25
5411,-1.21
5412,-1.15
5413,-1.10
5414,-1.00
5415,-0.88
5416,-0.72
5417,-0.54
5418,-0.33
5419,-0.11
5420,0.15
5421,0.41
5422,0.70
5423,0.98
5424,1.27
5425,1.55
5426,1.82
5427,2.06
5428,2.30
5429,2.51
5430,2.73
5431,2.92
5432,3.10
5433,3.26
5434,3.41
5435,3.57
5436,3.74
5437,3.89
5438,4.04
5439,4.17
5440,4.28
5441,4.39
5442,4.46
5443,4.49
5444,4.47
5445,4.40
5446,4.29
5447,4.15
5448,3.98
5449,3.78
5450,3.52
5451,3.26
5452,2.97
5453,2.68
5454,2.36
5455,2.05
5456,1.72
5457,1.41
5458,1.09
5459,0.79
5460,0.47
5461,0.17
5462,-0.14
5463,-0.42
5464,-0.69
5465,-0.91
5466,-1.12
5467,-1.31
5468,-1.48
5469,-1.60
5470,-1.69
5471,-1.76
5472,-1.82
5473,-1.88
5474,-1.93
5475,-1.96
5476,-1.98
5477,-2.02
5478,-2.08
5479,-2.15
5480,-2.22
5481,-2.27
5482,-2.34
5483,-2.41
5484,-2.47
5485,-2.53
5486,-2.56
5487,-2.58
5488,-2.59
5489,-2.59
5490,-2.58
5491,-2.54
5492,-2.46
5493,-2.37
5494,-2.21
5495,-2.03
5496,-1.78
5497,-1.49
5498,-1.10
5499,-0.67
5500,-0.13
5501,0.44
5502,1.10
5503,1.79
5504,2.57
5505,3.35
5506,4.19
5507,5.00
5508,5.82
5509,6.58
5510,7.34
5511,8.01
5512,8.68
5513,9.26
5514,9.82
5515,10.29
5516,10.74
5517,11.14
5518,11.52
5519,11.85
5520,12.16
5521,12.41
5522,12.67
5523,12.90
5524,13.13
5525,13.30
5526,13.45
5527,13.55
5528,13.62
5529,13.66
5530,13.64
5531,13.59
5532,13.47
5533,13.32
5534,13.11
5535,12.88
5536,12.59
5537,12.29
5538,11.95
5539,11.59
5540,11.18
5541,10.77
5542,10.35
5543,9.96
5544,9.55
5545,9.14
5546,8.72
5547,8.36
5548,8.02
5549,7.72
5550,7.43
5551,7.18
5552,6.95
5553,6.78
5554,6.62
5555,6.49
5556,6.36
5557,6.26
5558,6.16
5559,6.07
5560,5.98
5561,5.90
5562,5.80
5563,5.69
5564,5.57
5565,5.46
5566,5.33
5567,5.20
5568,5.06
5569,4.93
5570,4.79
5571,4.66
5572,4.54
5573,4.43
5574,4.34
5575,4.27
5576,4.21
5577,4.17
5578,4.15
5579,4.15
5580,4.18
5581,4.23
5582,4.29
5583,4.37
5584,4.47
5585,4.59
5586,4.73
5587,4.89
5588,5.08
5589,5.28
5590,5.51
5591,5.73
5592,5.98
5593,6.22
5594,6.44
5595,6.61
5596,6.72
5597,6.78
5598,6.79
5599,6.74
5600,6.61
5601,6.41
5602,6.13
5603,5.80
5604,5.42
5605,5.01
5606,4.55
5607,4.09
5608,3.61
5609,3.17
5610,2.73
5611,2.33
5612,1.91
5613,1.55
5614,1.23
5615,0.97
5616,0.72
5617,0.52
5618,0.31
5619,0.16
5620,0.03
5621,-0.06
5622,-0.15
5623,-0.22
5624,-0.30
5625,-0.38
5626,-0.47
5627,-0.55
5628,-0.64
5629,-0.73
5630,-0.82
5631,-0.92
5632,-1.03
5633,-1.13
5634,-1.21
5635,-1.26
5636,-1.29
5637,-1.32
5638,-1.29
5639,-1.23
5640,-1.13
5641,-1.01
5642,-0.89
5643,-0.75
5644,-0.60
5645,-0.44
5646,-0.28
5647,-0.15
5648,-0.02
5649,0.09
5650,0.19
5651,0.27
5652,0.36
5653,0.43
5654,0.52
5655,0.62
5656,0.73
5657,0.83
5658,0.95
5659,1.07
5660,1.20
5661,1.33
5662,1.44
5663,1.53
5664,1.60
5665,1.65
5666,1.67
5667,1.65
5668,1.61
5669,1.53
5670,1.43
5671,1.31
5672,1.19
5673,1.08
5674,0.97
5675,0.85
5676,0.74
5677,0.65
5678,0.58
5679,0.53
5680,0.50
5681,0.48
5682,0.46
5683,0.45
5684,0.46
5685,0.48
5686,0.50
5687,0.53
5688,0.57
5689,0.62
5690,0.68
5691,0.74
5692,0.81
5693,0.89
5694,0.97
5695,1.05
5696,1.12
5697,1.18
5698,1.24
5699,1.30
5700,1.35
5701,1.38
5702,1.40
5703,1.42
5704,1.44
5705,1.46
5706,1.48
5707,1.51
5708,1.54
5709,1.56
5710,1.57
5711,1.57
5712,1.55
5713,1.52
5714,1.45
5715,1.36
5716,1.25
5717,1.11
5718,0.95
5719,0.77
5720,0.57
5721,0.38
5722,0.21
5723,0.07
5724,-0.08
5725,-0.22
5726,-0.33
5727,-0.40
5728,-0.44
5729,-0.46
5730,-0.46
5731,-0.45
5732,-0.43
5733,-0.38
5734,-0.30
5735,-0.21
5736,-0.12
5737,-0.02
5738,0.10
5739,0.23
5740,0.40
5741,0.58
5742,0.81
5743,1.04
5744,1.33
5745,1.63
5746,1.97
5747,2.33
5748,2.71
5749,3.09
5750,3.49
5751,3.87
5752,4.25
5753,4.59
5754,4.93
5755,5.23
5756,5.51
5757,5.73
5758,5.93
5759,6.09
5760,6.25
5761,6.36
5762,6.44
5763,6.49
5764,6.57
5765,6.64
5766,6.71
5767,6.77
5768,6.85
5769,6.94
5770,7.06
5771,7.19
5772,7.34
5773,7.50
5774,7.68
5775,7.85
5776,8.02
5777,8.19
5778,8.35
5779,8.50
5780,8.64
5781,8.76
5782,8.85
5783,8.92
5784,8.97
5785,9.00
5786,9.01
5787,8.99
5788,8.94
5789,8.87
5790,8.78
5791,8.69
5792,8.60
5793,8.51
5794,8.42
5795,8.34
5796,8.28
5797,8.24
5798,8.22
5799,8.21
5800,8.21
5801,8.24
5802,8.30
5803,8.39
5804,8.51
5805,8.62
5806,8.75
5807,8.89
5808,9.04
5809,9.19
5810,9.33
5811,9.47
5812,9.61
5813,9.73
5814,9.81
5815,9.88
5816,9.93
5817,9.95
5818,9.95
5819,9.90
5820,9.83
5821,9.76
5822,9.67
5823,9.57
5824,9.44
5825,9.32
5826,9.20
5827,9.09
5828,8.97
5829,8.85
5830,8.71
5831,8.57
5832,8.41
5833,8.26
5834,8.08
5835,7.90
5836,7.69
5837,7.50
5838,7.29
5839,7.10
5840,6.90
5841,6.72
5842,6.52
5843,6.34
5844,6.16
5845,5.99
5846,5.83
5847,5.69
5848,5.54
5849,5.40
5850,5.23
5851,5.05
5852,4.83
5853,4.61
5854,4.35
5855,4.08
5856,3.76
5857,3.42
5858,3.04
5859,2.66
5860,2.26
5861,1.89
5862,1.51
5863,1.17
5864,0.85
5865,0.59
5866,0.40
5867,0.28
5868,0.23
5869,0.24
5870,0.31
5871,0.46
5872,0.69
5873,0.95
5874,1.25
5875,1.57
5876,1.93
5877,2.31
5878,2.71
5879,3.08
5880,3.43
5881,3.76
5882,4.09
5883,4.39
5884,4.66
5885,4.88
5886,5.08
5887,5.23
5888,5.36
5889,5.43
5890,5.44
5891,5.40
5892,5.33
5893,5.22
5894,5.08
5895,4.90
5896,4.66
5897,4.43
5898,4.18
5899,3.95
5900,3.70
5901,3.47
5902,3.24
5903,3.04
5904,2.87
5905,2.71
5906,2.55
5907,2.41
5908,2.28
5909,2.17
5910,2.06
5911,1.96
5912,1.85
5913,1.75
5914,1.65
5915,1.55
5916,1.46
5917,1.38
5918,1.32
5919,1.29
5920,1.28
5921,1.30
5922,1.36
5923,1.44
5924,1.56
5925,1.71
5926,1.90
5927,2.11
5928,2.35
5929,2.59
5930,2.84
5931,3.10
5932,3.36
5933,3.60
5934,3.85
5935,4.07
5936,4.29
5937,4.49
5938,4.67
5939,4.82
5940,4.98
5941,5.14
5942,5.29
5943,5.41
5944,5.53
5945,5.64
5946,5.75
5947,5.85
5948,5.97
5949,6.07
5950,6.19
5951,6.29
5952,6.40
5953,6.52
5954,6.66
5955,6.79
5956,6.93
5957,7.05
5958,7.19
5959,7.34
5960,7.50
5961,7.64
5962,7.79
5963,7.93
5964,8.05
5965,8.16
5966,8.26
5967,8.35
5968,8.43
5969,8.47
5970,8.50
5971,8.50
5972,8.49
5973,8.47
5974,8.43
5975,8.38
5976,8.33
5977,8.28
5978,8.26
5979,8.24
5980,8.23
5981,8.22
5982,8.24
5983,8.27
5984,8.32
5985,8.39
5986,8.46
5987,8.52
5988,8.58
5989,8.64
5990,8.69
5991,8.73
5992,8.76
5993,8.78
5994,8.79
5995,8.81
5996,8.84
5997,8.87
5998,8.90
5999,8.93
6000,8.97
6001,9.03
6002,9.10
6003,9.16
6004,9.20
6005,9.24
6006,9.29
6007,9.32
6008,9.35
6009,9.36
6010,9.37
6011,9.36
6012,9.35
6013,9.33
6014,9.32
6015,9.33
6016,9.35
6017,9.39
6018,9.45
6019,9.53
6020,9.63
6021,9.74
6022,9.87
6023,10.00
6024,10.15
6025,10.28
6026,10.42
6027,10.55
6028,10.66
6029,10.74
6030,10.80
6031,10.85
6032,10.89
6033,10.92
6034,10.93
6035,10.93
6036,10.94
6037,10.97
6038,11.00
6039,11.04
6040,11.11
6041,11.19
6042,11.30
6043,11.42
6044,11.55
6045,11.68
6046,11.81
6047,11.94
6048,12.06
6049,12.17
6050,12.26
6051,12.33
6052,12.38
6053,12.42
6054,12.45
6055,12.46
6056,12.46
6057,12.46
6058,12.46
6059,12.45
6060,12.46
6061,12.48
6062,12.51
6063,12.53
6064,12.55
6065,12.57
6066,12.63
6067,12.69
6068,12.73
6069,12.76
6070,12.79
6071,12.83
6072,12.89
6073,12.93
6074,12.95
6075,12.95
6076,12.97
6077,12.99
6078,13.01
6079,13.02
6080,13.03
6081,13.06
6082,13.11
6083,13.14
6084,13.17
6085,13.22
6086,13.28
6087,13.34
6088,13.41
6089,13.47
6090,13.54
6091,13.59
6092,13.63
6093,13.64
6094,13.64
6095,13.63
6096,13.62
6097,13.61
6098,13.60
6099,13.59
6100,13.60
6101,13.62
6102,13.67
6103,13.74
6104,13.84
6105,13.95
6106,14.06
6107,14.17
6108,14.28
6109,14.38
6110,14.46
6111,14.51
6112,14.54
6113,14.53
6114,14.50
6115,14.44
6116,14.37
6117,14.29
6118,14.22
6119,14.16
6120,14.10
6121,14.06
6122,14.03
6123,14.02
6124,14.04
6125,14.07
6126,14.10
6127,14.13
6128,14.17
6129,14.22
6130,14.26
6131,14.27
6132,14.25
6133,14.22
6134,14.18
6135,14.14
6136,14.06
6137,13.98
6138,13.88
6139,13.78
6140,13.67
6141,13.55
6142,13.44
6143,13.34
6144,13.24
6145,13.17
6146,13.11
6147,13.08
6148,13.06
6149,13.04
6150,13.02
6151,13.02
6152,13.01
6153,12.98
6154,12.92
6155,12.82
6156,12.69
6157,12.54
6158,12.37
6159,12.18
6160,11.94
6161,11.68
6162,11.41
6163,11.17
6164,10.93
6165,10.71
6166,10.48
6167,10.26
6168,10.05
6169,9.87
6170,9.69
6171,9.53
6172,9.36
6173,9.19
6174,9.01
6175,8.82
6176,8.63
6177,8.47
6178,8.31
6179,8.16
6180,8.01
6181,7.89
6182,7.79
6183,7.73
6184,7.69
6185,7.68
6186,7.71
6187,7.79
6188,7.91
6189,8.05
6190,8.22
6191,8.39
6192,8.59
6193,8.80
6194,9.01
6195,9.22
6196,9.42
6197,9.59
6198,9.77
6199,9.93
6200,10.09
6201,10.23
6202,10.37
6203,10.49
6204,10.61
6205,10.70
6206,10.81
6207,10.92
6208,11.05
6209,11.18
6210,11.32
6211,11.44
6212,11.56
6213,11.68
6214,11.81
6215,11.95
6216,12.09
6217,12.22
6218,12.34
6219,12.46
6220,12.57
6221,12.66
6222,12.77
6223,12.88
6224,12.99
6225,13.10
6226,13.20
6227,13.31
6228,13.43
6229,13.55
6230,13.67
6231,13.76
6232,13.85
6233,13.93
6234,14.01
6235,14.09
6236,14.15
6237,14.19
6238,14.23
6239,14.28
6240,14.32
6241,14.35
6242,14.38
6243,14.40
6244,14.44
6245,14.48
6246,14.52
6247,14.54
6248,14.54
6249,14.53
6250,14.51
6251,14.48
6252,14.44
6253,14.40
6254,14.32
6255,14.23
6256,14.13
6257,14.04
6258,13.96
6259,13.90
6260,13.83
6261,13.77
6262,13.72
6263,13.68
6264,13.65
6265,13.66
6266,13.68
6267,13.72
6268,13.76
6269,13.79
6270,13.83
6271,13.89
6272,13.95
6273,13.99
6274,14.02
6275,14.04
6276,14.05
6277,14.06
6278,14.07
6279,14.07
6280,14.06
6281,14.03
6282,14.01
6283,14.00
6284,14.01
6285,14.02
6286,14.03
6287,14.05
6288,14.08
6289,14.14
6290,14.18
6291,14.23
6292,14.26
6293,14.30
6294,14.34
6295,14.38
6296,14.42
6297,14.45
6298,14.47
6299,14.48
6300,14.49
6301,14.51
6302,14.54
6303,14.54
6304,14.52
6305,14.50
6306,14.48
6307,14.46
6308,14.41
6309,14.34
6310,14.27
6311,14.21
6312,14.14
6313,14.05
6314,13.97
6315,13.89
6316,13.83
6317,13.77
6318,13.73
6319,13.71
6320,13.70
6321,13.69
6322,13.69
6323,13.68
6324,13.68
6325,13.69
6326,13.69
6327,13.69
6328,13.68
6329,13.67
6330,13.67
6331,13.70
6332,13.75
6333,13.79
6334,13.83
6335,13.87
6336,13.90
6337,13.93
6338,13.97
6339,14.01
6340,14.03
6341,14.02
6342,14.00
6343,13.97
6344,13.95
6345,13.91
6346,13.87
6347,13.83
6348,13.82
6349,13.82
6350,13.84
6351,13.88
6352,13.93
6353,14.00
6354,14.08
6355,14.16
6356,14.25
6357,14.34
6358,14.42
6359,14.49
6360,14.56
6361,14.62
6362,14.69
6363,14.74
6364,14.78
6365,14.82
6366,14.86
6367,14.88
6368,14.91
6369,14.93
6370,14.94
6371,14.96
6372,14.96
6373,14.95
6374,14.91
6375,14.87
6376,14.82
6377,14.78
6378,14.74
6379,14.69
6380,14.62
6381,14.55
6382,14.49
6383,14.44
6384,14.40
6385,14.36
6386,14.32
6387,14.28
6388,14.25
6389,14.25
6390,14.27
6391,14.29
6392,14.31
6393,14.34
6394,14.39
6395,14.43
6396,14.48
6397,14.54
6398,14.62
6399,14.72
6400,14.83
6401,14.92
6402,15.03
6403,15.15
6404,15.27
6405,15.38
6406,15.48
6407,15.55
6408,15.63
6409,15.69
6410,15.73
6411,15.75
6412,15.75
6413,15.75
6414,15.75
6415,15.75
6416,15.75
6417,15.75
6418,15.76
6419,15.79
6420,15.82
6421,15.86
6422,15.92
6423,15.99
6424,16.07
6425,16.16
6426,16.26
6427,16.35
6428,16.45
6429,16.52
6430,16.57
6431,16.60
6432,16.64
6433,16.68
6434,16.72
6435,16.74
6436,16.75
6437,16.75
6438,16.77
6439,16.79
6440,16.81
6441,16.83
6442,16.85
6443,16.86
6444,16.90
6445,16.95
6446,17.01
6447,17.05
6448,17.07
6449,17.09
6450,17.11
6451,17.14
6452,17.17
6453,17.18
6454,17.18
6455,17.15
6456,17.12
6457,17.08
6458,17.03
6459,16.97
6460,16.91
6461,16.86
6462,16.82
6463,16.78
6464,16.74
6465,16.71
6466,16.70
6467,16.71
6468,16.73
6469,16.75
6470,16.78
6471,16.81
6472,16.87
6473,16.93
6474,16.99
6475,17.06
6476,17.14
6477,17.23
6478,17.32
6479,17.41
6480,17.50
6481,17.60
6482,17.71
6483,17.82
6484,17.93
6485,18.03
6486,18.10
6487,18.16
6488,18.23
6489,18.30
6490,18.34
6491,18.38
6492,18.42
6493,18.45
6494,18.43
6495,18.37
6496,18.29
6497,18.22
6498,18.17
6499,18.12
6500,18.05
6501,17.99
6502,17.93
6503,17.86
6504,17.79
6505,17.72
6506,17.65
6507,17.57
6508,17.48
6509,17.39
6510,17.30
6511,17.21
6512,17.11
6513,17.02
6514,16.92
6515,16.84
6516,16.77
6517,16.72
6518,16.67
6519,16.63
6520,16.60
6521,16.58
6522,16.57
6523,16.58
6524,16.60
6525,16.64
6526,16.67
6527,16.70
6528,16.72
6529,16.73
6530,16.73
6531,16.72
6532,16.70
6533,16.66
6534,16.60
6535,16.53
6536,16.46
6537,16.38
6538,16.28
6539,16.18
6540,16.09
6541,16.02
6542,15.96
6543,15.92
6544,15.88
6545,15.86
6546,15.85
6547,15.84
6548,15.84
6549,15.85
6550,15.86
6551,15.86
6552,15.85
6553,15.84
6554,15.83
6555,15.82
6556,15.81
6557,15.80
6558,15.79
6559,15.77
6560,15.75
6561,15.75
6562,15.76
6563,15.78
6564,15.81
6565,15.85
6566,15.90
6567,15.95
6568,15.99
6569,16.03
6570,16.08
6571,16.13
6572,16.17
6573,16.19
6574,16.20
6575,16.21
6576,16.21
6577,16.21
6578,16.22
6579,16.23
6580,16.24
6581,16.25
6582,16.27
6583,16.30
6584,16.32
6585,16.34
6586,16.37
6587,16.41
6588,16.44
6589,16.46
6590,16.46
6591,16.45
6592,16.45
6593,16.44
6594,16.43
6595,16.43
6596,16.43
6597,16.43
6598,16.44
6599,16.45
6600,16.46
6601,16.48
6602,16.52
6603,16.55
6604,16.54
6605,16.48
6606,16.41
6607,16.36
6608,16.34
6609,16.34
6610,16.35
6611,16.40
6612,16.47
6613,16.53
6614,16.54
6615,16.48
6616,16.40
6617,16.33
6618,16.25
6619,16.17
6620,16.08
6621,15.99
6622,15.91
6623,15.81
6624,15.71
6625,15.62
6626,15.54
6627,15.47
6628,15.41
6629,15.36
6630,15.33
6631,15.30
6632,15.29
6633,15.29
6634,15.32
6635,15.37
6636,15.43
6637,15.50
6638,15.58
6639,15.65
6640,15.74
6641,15.84
6642,15.95
6643,16.03
6644,16.10
6645,16.16
6646,16.23
6647,16.30
6648,16.36
6649,16.41
6650,16.46
6651,16.50
6652,16.56
6653,16.62
6654,16.69
6655,16.75
6656,16.82
6657,16.89
6658,16.97
6659,17.05
6660,17.11
6661,17.16
6662,17.22
6663,17.27
6664,17.33
6665,17.37
6666,17.41
6667,17.44
6668,17.48
6669,17.50
6670,17.51
6671,17.52
6672,17.52
6673,17.50
6674,17.47
6675,17.44
6676,17.41
6677,17.38
6678,17.34
6679,17.31
6680,17.27
6681,17.24
6682,17.20
6683,17.18
6684,17.17
6685,17.18
6686,17.19
6687,17.19
6688,17.18
6689,17.18
6690,17.18
6691,17.18
6692,17.16
6693,17.14
6694,17.12
6695,17.10
6696,17.08
6697,17.07
6698,17.07
6699,17.08
6700,17.10
6701,17.13
6702,17.16
6703,17.20
6704,17.25
6705,17.30
6706,17.35
6707,17.39
6708,17.42
6709,17.44
6710,17.45
6711,17.45
6712,17.45
6713,17.44
6714,17.44
6715,17.44
6716,17.45
6717,17.47
6718,17.49
6719,17.51
6720,17.54
6721,17.59
6722,17.65
6723,17.70
6724,17.74
6725,17.76
6726,17.77
6727,17.78
6728,17.78
6729,17.76
6730,17.72
6731,17.66
6732,17.58
6733,17.49
6734,17.40
6735,17.30
6736,17.19
6737,17.08
6738,16.98
6739,16.89
6740,16.81
6741,16.74
6742,16.68
6743,16.63
6744,16.59
6745,16.56
6746,16.54
6747,16.55
6748,16.55
6749,16.56
6750,16.58
6751,16.60
6752,16.63
6753,16.66
6754,16.68
6755,16.69
6756,16.70
6757,16.71
6758,16.71
6759,16.70
6760,16.68
6761,16.65
6762,16.61
6763,16.57
6764,16.53
6765,16.49
6766,16.45
6767,16.40
6768,16.35
6769,16.32
6770,16.30
6771,16.28
6772,16.27
6773,16.26
6774,16.25
6775,16.26
6776,16.25
6777,16.23
6778,16.20
6779,16.16
6780,16.11
6781,16.06
6782,16.02
6783,15.94
6784,15.79
6785,15.58
6786,15.34
6787,15.12
6788,14.95
6789,14.82
6790,14.71
6791,14.64
6792,14.59
6793,14.61
6794,14.69
6795,14.78
6796,14.79
6797,14.73
6798,14.65
6799,14.60
6800,14.57
6801,14.53
6802,14.49
6803,14.46
6804,14.44
6805,14.43
6806,14.43
6807,14.43
6808,14.43
6809,14.44
6810,14.46
6811,14.49
6812,14.54
6813,14.58
6814,14.62
6815,14.65
6816,14.69
6817,14.72
6818,14.76
6819,14.78
6820,14.79
6821,14.79
6822,14.78
6823,14.77
6824,14.76
6825,14.75
6826,14.75
6827,14.75
6828,14.74
6829,14.74
6830,14.76
6831,14.77
6832,14.79
6833,14.80
6834,14.80
6835,14.79
6836,14.79
6837,14.77
6838,14.75
6839,14.71
6840,14.67
6841,14.62
6842,14.58
6843,14.54
6844,14.51
6845,14.49
6846,14.48
6847,14.48
6848,14.49
6849,14.50
6850,14.53
6851,14.57
6852,14.60
6853,14.63
6854,14.67
6855,14.70
6856,14.73
6857,14.76
6858,14.78
6859,14.81
6860,14.83
6861,14.84
6862,14.85
6863,14.86
6864,14.87
6865,14.88
6866,14.89
6867,14.90
6868,14.91
6869,14.93
6870,14.96
6871,15.00
6872,15.05
6873,15.09
6874,15.16
6875,15.22
6876,15.30
6877,15.39
6878,15.49
6879,15.60
6880,15.71
6881,15.82
6882,15.94
6883,16.05
6884,16.17
6885,16.27
6886,16.36
6887,16.46
6888,16.56
6889,16.64
6890,16.70
6891,16.76
6892,16.82
6893,16.88
6894,16.94
6895,17.00
6896,17.06
6897,17.13
6898,17.20
6899,17.27
6900,17.34
6901,17.42
6902,17.50
6903,17.58
6904,17.66
6905,17.74
6906,17.82
6907,17.89
6908,17.96
6909,18.02
6910,18.08
6911,18.14
6912,18.19
6913,18.23
6914,18.27
6915,18.31
6916,18.37
6917,18.41
6918,18.45
6919,18.47
6920,18.48
6921,18.50
6922,18.53
6923,18.56
6924,18.59
6925,18.61
6926,18.62
6927,18.63
6928,18.64
6929,18.66
6930,18.68
6931,18.69
6932,18.69
6933,18.69
6934,18.70
6935,18.70
6936,18.69
6937,18.66
6938,18.64
6939,18.62
6940,18.62
6941,18.61
6942,18.61
6943,18.60
6944,18.60
6945,18.62
6946,18.64
6947,18.65
6948,18.66
6949,18.68
6950,18.70
6951,18.71
6952,18.71
6953,18.70
6954,18.69
6955,18.68
6956,18.66
6957,18.65
6958,18.63
6959,18.62
6960,18.60
6961,18.58
6962,18.57
6963,18.57
6964,18.57
6965,18.55
6966,18.52
6967,18.50
6968,18.48
6969,18.47
6970,18.44
6971,18.43
6972,18.40
6973,18.37
6974,18.34
6975,18.30
6976,18.26
6977,18.22
6978,18.18
6979,18.14
6980,18.09
6981,18.05
6982,18.00
6983,17.96
6984,17.92
6985,17.88
6986,17.84
6987,17.81
6988,17.79
6989,17.77
6990,17.76
6991,17.75
6992,17.73
6993,17.72
6994,17.72
6995,17.72
6996,17.72
6997,17.71
6998,17.70
6999,17.69
7000,17.67
7001,17.64
7002,17.60
7003,17.56
7004,17.52
7005,17.47
7006,17.42
7007,17.34
7008,17.26
7009,17.18
7010,17.12
7011,17.06
7012,16.99
7013,16.91
7014,16.83
7015,16.76
7016,16.69
7017,16.61
7018,16.53
7019,16.45
7020,16.37
7021,16.28
7022,16.19
7023,16.11
7024,16.03
7025,15.95
7026,15.88
7027,15.83
7028,15.80
7029,15.78
7030,15.77
7031,15.77
7032,15.78
7033,15.79
7034,15.81
7035,15.84
7036,15.87
7037,15.89
7038,15.90
7039,15.91
7040,15.92
7041,15.94
7042,15.97
7043,15.99
7044,16.00
7045,16.02
7046,16.05
7047,16.09
7048,16.14
7049,16.17
7050,16.21
7051,16.24
7052,16.28
7053,16.31
7054,16.35
7055,16.37
7056,16.38
7057,16.40
7058,16.42
7059,16.43
7060,16.44
7061,16.45
7062,16.46
7063,16.46
7064,16.45
7065,16.42
7066,16.40
7067,16.38
7068,16.36
7069,16.32
7070,16.27
7071,16.20
7072,16.14
7073,16.09
7074,16.06
7075,16.03
7076,16.01
7077,15.99
7078,15.97
7079,15.96
7080,15.96
7081,15.97
7082,15.98
7083,15.99
7084,16.00
7085,16.02
7086,16.04
7087,16.06
7088,16.06
7089,16.06
7090,16.06
7091,16.06
7092,16.05
7093,16.03
7094,16.00
7095,15.97
7096,15.94
7097,15.90
7098,15.85
7099,15.79
7100,15.72
7101,15.64
7102,15.55
7103,15.46
7104,15.38
7105,15.30
7106,15.22
7107,15.16
7108,15.13
7109,15.12
7110,15.12
7111,15.14
7112,15.18
7113,15.24
7114,15.33
7115,15.42
7116,15.53
7117,15.63
7118,15.73
7119,15.83
7120,15.92
7121,16.00
7122,16.07
7123,16.14
7124,16.21
7125,16.28
7126,16.34
7127,16.39
7128,16.45
7129,16.51
7130,16.58
7131,16.64
7132,16.71
7133,16.77
7134,16.84
7135,16.91
7136,16.99
7137,17.05
7138,17.11
7139,17.16
7140,17.21
7141,17.26
7142,17.30
7143,17.32
7144,17.34
7145,17.36
7146,17.36
7147,17.36
7148,17.34
7149,17.33
7150,17.32
7151,17.30
7152,17.27
7153,17.24
7154,17.21
7155,17.18
7156,17.15
7157,17.12
7158,17.09
7159,17.07
7160,17.07
7161,17.07
7162,17.06
7163,17.06
7164,17.07
7165,17.09
7166,17.12
7167,17.14
7168,17.15
7169,17.17
7170,17.20
7171,17.23
7172,17.25
7173,17.28
7174,17.30
7175,17.33
7176,17.35
7177,17.37
7178,17.40
7179,17.43
7180,17.46
7181,17.48
7182,17.49
7183,17.49
7184,17.47
7185,17.45
7186,17.44
7187,17.43
7188,17.41
7189,17.47
7190,17.46
7191,17.40
7192,17.34
7193,17.32
7194,17.73
7195,18.01
7196,17.73
7197,16.96
7198,17.27
7199,19.71
7200,18.66
