1,56.16
2,88.48
3,102.72
4,106.06
5,109.47
6,113.29
7,110.28
8,97.79
9,76.81
10,50.41
11,20.55
12,-7.27
13,-27.78
14,-35.68
15,-29.03
16,-8.90
17,21.38
18,55.77
19,89.43
20,116.83
21,136.19
22,145.50
23,145.97
24,137.69
25,122.11
26,99.59
27,71.24
28,38.47
29,3.82
30,-29.55
31,-57.77
32,-78.30
33,-88.93
34,-90.74
35,-84.95
36,-75.72
37,-65.49
38,-57.93
39,-53.43
40,-52.77
41,-54.07
42,-56.33
43,-57.75
44,-57.85
45,-56.55
46,-54.34
47,-52.10
48,-50.23
49,-49.26
50,-48.99
51,-49.26
52,-49.63
53,-49.93
54,-50.04
55,-50.03
56,-49.94
57,-49.89
58,-49.93
59,-50.15
60,-50.46
61,-50.81
62,-51.10
63,-51.32
64,-51.41
65,-51.35
66,-51.12
67,-50.70
68,-50.12
69,-49.43
70,-48.68
71,-48.00
72,-47.40
73,-46.94
74,-46.55
75,-46.24
76,-45.92
77,-45.61
78,-45.20
79,-44.78
80,-44.28
81,-43.79
82,-43.23
83,-42.68
84,-42.09
85,-41.51
86,-40.85
87,-40.15
88,-39.36
89,-38.60
90,-37.86
91,-37.24
92,-36.73
93,-36.42
94,-36.25
95,-36.22
96,-36.17
97,-36.11
98,-35.90
99,-35.62
100,-35.20
101,-34.74
102,-34.21
103,-33.68
104,-33.12
105,-32.60
106,-32.07
107,-31.55
108,-30.94
109,-30.30
110,-29.59
111,-28.95
112,-28.32
113,-27.77
114,-27.24
115,-26.85
116,-26.52
117,-26.31
118,-26.06
119,-25.79
120,-25.38
121,-24.89
122,-24.25
123,-23.54
124,-22.78
125,-22.06
126,-21.42
127,-20.94
128,-20.67
129,-20.62
130,-20.72
131,-20.92
132,-21.10
133,-21.26
134,-21.35
135,-21.42
136,-21.45
137,-21.49
138,-21.51
139,-21.56
140,-21.56
141,-21.52
142,-21.32
143,-20.98
144,-20.45
145,-19.81
146,-19.00
147,-18.11
148,-17.17
149,-16.21
150,-15.21
151,-14.20
152,-13.20
153,-12.31
154,-11.51
155,-10.86
156,-10.37
157,-10.13
158,-10.14
159,-10.39
160,-10.80
161,-11.29
162,-11.79
163,-12.26
164,-12.72
165,-13.16
166,-13.64
167,-14.13
168,-14.69
169,-15.28
170,-15.93
171,-16.54
172,-17.11
173,-17.56
174,-17.91
175,-18.16
176,-18.38
177,-18.61
178,-18.95
179,-19.39
180,-19.91
181,-20.42
182,-20.90
183,-21.26
184,-21.44
185,-21.42
186,-21.21
187,-20.90
188,-20.43
189,-19.88
190,-19.20
191,-18.48
192,-17.60
193,-16.62
194,-15.41
195,-14.12
196,-12.69
197,-11.28
198,-9.84
199,-8.56
200,-7.32
201,-6.29
202,-5.29
203,-4.38
204,-3.33
205,-2.20
206,-0.85
207,0.53
208,1.97
209,3.27
210,4.43
211,5.27
212,5.87
213,6.13
214,6.23
215,6.20
216,6.20
217,6.29
218,6.48
219,6.69
220,6.83
221,6.81
222,6.61
223,6.28
224,5.81
225,5.27
226,4.74
227,4.31
228,4.05
229,4.01
230,4.10
231,4.30
232,4.48
233,4.60
234,4.65
235,4.65
236,4.62
237,4.59
238,4.55
239,4.55
240,4.61
241,4.69
242,4.81
243,4.92
244,5.07
245,5.26
246,5.58
247,5.96
248,6.41
249,6.89
250,7.39
251,7.90
252,8.39
253,8.83
254,9.23
255,9.58
256,9.92
257,10.19
258,10.37
259,10.42
260,10.38
261,10.25
262,10.07
263,9.83
264,9.54
265,9.24
266,8.98
267,8.80
268,8.67
269,8.60
270,8.53
271,8.48
272,8.38
273,8.28
274,8.12
275,7.91
276,7.61
277,7.27
278,6.89
279,6.52
280,6.19
281,5.92
282,5.76
283,5.70
284,5.70
285,5.74
286,5.81
287,5.90
288,5.98
289,6.07
290,6.20
291,6.41
292,6.70
293,7.06
294,7.43
295,7.77
296,8.02
297,8.12
298,8.01
299,7.74
300,7.36
301,6.94
302,6.49
303,6.09
304,5.74
305,5.47
306,5.23
307,5.01
308,4.75
309,4.43
310,3.97
311,3.42
312,2.77
313,2.16
314,1.53
315,0.98
316,0.48
317,0.08
318,-0.34
319,-0.76
320,-1.27
321,-1.83
322,-2.51
323,-3.23
324,-4.04
325,-4.86
326,-5.78
327,-6.68
328,-7.60
329,-8.45
330,-9.32
331,-10.10
332,-10.86
333,-11.51
334,-12.08
335,-12.51
336,-12.85
337,-13.06
338,-13.27
339,-13.47
340,-13.71
341,-13.91
342,-14.07
343,-14.15
344,-14.22
345,-14.24
346,-14.20
347,-14.11
348,-14.04
349,-13.99
350,-13.98
351,-13.99
352,-14.03
353,-14.08
354,-14.14
355,-14.17
356,-14.18
357,-14.18
358,-14.17
359,-14.17
360,-14.21
361,-14.28
362,-14.41
363,-14.56
364,-14.76
365,-14.98
366,-15.27
367,-15.56
368,-15.87
369,-16.16
370,-16.49
371,-16.81
372,-17.11
373,-17.38
374,-17.65
375,-17.88
376,-18.05
377,-18.14
378,-18.21
379,-18.29
380,-18.38
381,-18.46
382,-18.58
383,-18.69
384,-18.82
385,-18.94
386,-19.07
387,-19.24
388,-19.49
389,-19.78
390,-20.13
391,-20.48
392,-20.83
393,-21.10
394,-21.29
395,-21.34
396,-21.27
397,-21.08
398,-20.83
399,-20.55
400,-20.31
401,-20.16
402,-20.13
403,-20.16
404,-20.20
405,-20.23
406,-20.26
407,-20.28
408,-20.31
409,-20.35
410,-20.39
411,-20.45
412,-20.52
413,-20.61
414,-20.74
415,-20.86
416,-20.90
417,-20.88
418,-20.82
419,-20.75
420,-20.68
421,-20.60
422,-20.50
423,-20.37
424,-20.23
425,-20.04
426,-19.86
427,-19.73
428,-19.69
429,-19.75
430,-19.92
431,-20.18
432,-20.55
433,-20.98
434,-21.41
435,-21.76
436,-22.03
437,-22.19
438,-22.32
439,-22.43
440,-22.58
441,-22.81
442,-23.16
443,-23.58
444,-24.03
445,-24.42
446,-24.73
447,-24.90
448,-24.96
449,-24.89
450,-24.73
451,-24.52
452,-24.31
453,-24.12
454,-23.99
455,-23.91
456,-23.83
457,-23.72
458,-23.51
459,-23.25
460,-22.95
461,-22.64
462,-22.34
463,-22.08
464,-21.88
465,-21.79
466,-21.77
467,-21.81
468,-21.88
469,-21.94
470,-21.96
471,-21.90
472,-21.76
473,-21.55
474,-21.29
475,-21.02
476,-20.79
477,-20.64
478,-20.59
479,-20.65
480,-20.83
481,-21.10
482,-21.42
483,-21.71
484,-21.94
485,-22.09
486,-22.19
487,-22.22
488,-22.17
489,-22.09
490,-22.00
491,-21.97
492,-21.98
493,-22.02
494,-22.06
495,-22.09
496,-22.07
497,-22.00
498,-21.84
499,-21.64
500,-21.34
501,-20.97
502,-20.48
503,-19.95
504,-19.33
505,-18.67
506,-17.90
507,-17.13
508,-16.36
509,-15.66
510,-14.95
511,-14.28
512,-13.60
513,-12.99
514,-12.37
515,-11.76
516,-11.09
517,-10.48
518,-9.90
519,-9.37
520,-8.83
521,-8.38
522,-7.99
523,-7.75
524,-7.61
525,-7.64
526,-7.77
527,-8.00
528,-8.15
529,-8.17
530,-7.98
531,-7.63
532,-7.11
533,-6.48
534,-5.80
535,-5.17
536,-4.65
537,-4.36
538,-4.28
539,-4.36
540,-4.46
541,-4.51
542,-4.39
543,-4.14
544,-3.66
545,-3.04
546,-2.28
547,-1.48
548,-0.69
549,0.00
550,0.53
551,0.85
552,0.99
553,0.95
554,0.81
555,0.61
556,0.47
557,0.40
558,0.43
559,0.49
560,0.57
561,0.66
562,0.76
563,0.81
564,0.81
565,0.78
566,0.79
567,0.90
568,1.12
569,1.43
570,1.76
571,2.08
572,2.30
573,2.38
574,2.33
575,2.21
576,2.05
577,1.91
578,1.75
579,1.62
580,1.47
581,1.30
582,1.05
583,0.73
584,0.33
585,-0.09
586,-0.53
587,-0.89
588,-1.22
589,-1.51
590,-1.86
591,-2.23
592,-2.65
593,-3.09
594,-3.65
595,-4.26
596,-4.91
597,-5.46
598,-6.00
599,-6.48
600,-6.97
601,-7.41
602,-7.83
603,-8.21
604,-8.59
605,-8.91
606,-9.17
607,-9.31
608,-9.38
609,-9.40
610,-9.41
611,-9.41
612,-9.43
613,-9.50
614,-9.70
615,-10.06
616,-10.59
617,-11.18
618,-11.79
619,-12.35
620,-12.91
621,-13.38
622,-13.72
623,-13.83
624,-13.79
625,-13.65
626,-13.50
627,-13.34
628,-13.23
629,-13.16
630,-13.18
631,-13.27
632,-13.42
633,-13.63
634,-13.90
635,-14.23
636,-14.59
637,-14.94
638,-15.30
639,-15.66
640,-15.99
641,-16.23
642,-16.36
643,-16.38
644,-16.37
645,-16.32
646,-16.29
647,-16.28
648,-16.37
649,-16.55
650,-16.78
651,-17.02
652,-17.27
653,-17.49
654,-17.72
655,-17.93
656,-18.14
657,-18.38
658,-18.68
659,-19.04
660,-19.43
661,-19.80
662,-20.08
663,-20.23
664,-20.22
665,-20.07
666,-19.81
667,-19.47
668,-19.10
669,-18.77
670,-18.55
671,-18.46
672,-18.44
673,-18.42
674,-18.36
675,-18.26
676,-18.15
677,-18.03
678,-17.93
679,-17.90
680,-17.96
681,-18.12
682,-18.33
683,-18.54
684,-18.71
685,-18.81
686,-18.80
687,-18.67
688,-18.46
689,-18.24
690,-18.12
691,-18.10
692,-18.23
693,-18.43
694,-18.74
695,-19.06
696,-19.38
697,-19.68
698,-19.99
699,-20.30
700,-20.66
701,-21.03
702,-21.48
703,-21.95
704,-22.44
705,-22.85
706,-23.19
707,-23.45
708,-23.68
709,-23.84
710,-23.99
711,-24.12
712,-24.35
713,-24.63
714,-25.02
715,-25.43
716,-25.89
717,-26.39
718,-26.95
719,-27.51
720,-28.07
721,-28.54
722,-28.93
723,-29.22
724,-29.49
725,-29.71
726,-29.93
727,-30.12
728,-30.38
729,-30.66
730,-31.00
731,-31.32
732,-31.66
733,-31.97
734,-32.30
735,-32.59
736,-32.88
737,-33.18
738,-33.50
739,-33.78
740,-34.04
741,-34.25
742,-34.45
743,-34.61
744,-34.77
745,-34.87
746,-35.05
747,-35.27
748,-35.55
749,-35.85
750,-36.19
751,-36.58
752,-36.99
753,-37.38
754,-37.74
755,-38.07
756,-38.37
757,-38.61
758,-38.76
759,-38.80
760,-38.70
761,-38.46
762,-38.06
763,-37.52
764,-36.90
765,-36.27
766,-35.65
767,-35.10
768,-34.57
769,-34.13
770,-33.74
771,-33.40
772,-33.00
773,-32.55
774,-31.95
775,-31.31
776,-30.59
777,-29.91
778,-29.24
779,-28.69
780,-28.26
781,-27.96
782,-27.72
783,-27.53
784,-27.37
785,-27.22
786,-27.01
787,-26.74
788,-26.48
789,-26.33
790,-26.30
791,-26.36
792,-26.50
793,-26.75
794,-27.08
795,-27.44
796,-27.76
797,-28.04
798,-28.29
799,-28.52
800,-28.72
801,-28.90
802,-29.08
803,-29.30
804,-29.53
805,-29.74
806,-29.91
807,-30.02
808,-30.10
809,-30.16
810,-30.20
811,-30.20
812,-30.14
813,-30.03
814,-29.85
815,-29.66
816,-29.39
817,-29.10
818,-28.78
819,-28.49
820,-28.20
821,-27.92
822,-27.55
823,-27.15
824,-26.67
825,-26.22
826,-25.71
827,-25.15
828,-24.48
829,-23.78
830,-23.03
831,-22.30
832,-21.50
833,-20.71
834,-19.94
835,-19.35
836,-18.89
837,-18.59
838,-18.33
839,-18.17
840,-18.01
841,-17.89
842,-17.68
843,-17.43
844,-17.07
845,-16.69
846,-16.27
847,-15.90
848,-15.53
849,-15.19
850,-14.82
851,-14.43
852,-14.02
853,-13.57
854,-13.08
855,-12.61
856,-12.16
857,-11.77
858,-11.42
859,-11.13
860,-10.89
861,-10.75
862,-10.69
863,-10.72
864,-10.83
865,-11.01
866,-11.25
867,-11.52
868,-11.81
869,-12.07
870,-12.30
871,-12.51
872,-12.76
873,-13.02
874,-13.28
875,-13.47
876,-13.68
877,-13.87
878,-14.10
879,-14.34
880,-14.62
881,-14.90
882,-15.20
883,-15.50
884,-15.84
885,-16.15
886,-16.43
887,-16.60
888,-16.75
889,-16.85
890,-16.94
891,-17.00
892,-17.06
893,-17.14
894,-17.28
895,-17.49
896,-17.78
897,-18.07
898,-18.33
899,-18.49
900,-18.53
901,-18.45
902,-18.18
903,-17.74
904,-17.12
905,-16.40
906,-15.63
907,-14.92
908,-14.29
909,-13.82
910,-13.47
911,-13.25
912,-13.07
913,-12.94
914,-12.76
915,-12.53
916,-12.20
917,-11.82
918,-11.37
919,-10.93
920,-10.51
921,-10.15
922,-9.86
923,-9.69
924,-9.63
925,-9.67
926,-9.72
927,-9.77
928,-9.74
929,-9.69
930,-9.58
931,-9.48
932,-9.35
933,-9.23
934,-9.09
935,-8.93
936,-8.69
937,-8.40
938,-8.00
939,-7.54
940,-6.99
941,-6.39
942,-5.76
943,-5.19
944,-4.72
945,-4.39
946,-4.17
947,-4.04
948,-3.94
949,-3.91
950,-3.92
951,-4.00
952,-4.11
953,-4.26
954,-4.42
955,-4.60
956,-4.84
957,-5.10
958,-5.36
959,-5.58
960,-5.77
961,-5.94
962,-6.08
963,-6.13
964,-6.12
965,-6.05
966,-5.99
967,-5.95
968,-5.97
969,-6.05
970,-6.26
971,-6.58
972,-7.02
973,-7.50
974,-7.99
975,-8.40
976,-8.73
977,-8.96
978,-9.15
979,-9.26
980,-9.32
981,-9.31
982,-9.30
983,-9.32
984,-9.39
985,-9.48
986,-9.57
987,-9.66
988,-9.77
989,-9.84
990,-9.92
991,-9.97
992,-10.06
993,-10.19
994,-10.41
995,-10.73
996,-11.19
997,-11.73
998,-12.32
999,-12.89
1000,-13.43
1001,-13.86
1002,-14.18
1003,-14.35
1004,-14.46
1005,-14.53
1006,-14.65
1007,-14.82
1008,-15.08
1009,-15.37
1010,-15.71
1011,-16.04
1012,-16.46
1013,-16.92
1014,-17.49
1015,-18.07
1016,-18.72
1017,-19.36
1018,-20.03
1019,-20.68
1020,-21.35
1021,-21.93
1022,-22.45
1023,-22.85
1024,-23.22
1025,-23.54
1026,-23.83
1027,-24.07
1028,-24.26
1029,-24.41
1030,-24.54
1031,-24.63
1032,-24.68
1033,-24.67
1034,-24.61
1035,-24.53
1036,-24.43
1037,-24.34
1038,-24.23
1039,-24.12
1040,-23.99
1041,-23.82
1042,-23.53
1043,-23.16
1044,-22.69
1045,-22.19
1046,-21.60
1047,-20.92
1048,-20.14
1049,-19.36
1050,-18.65
1051,-18.05
1052,-17.56
1053,-17.22
1054,-17.01
1055,-16.95
1056,-16.99
1057,-17.09
1058,-17.20
1059,-17.32
1060,-17.43
1061,-17.52
1062,-17.59
1063,-17.64
1064,-17.75
1065,-17.94
1066,-18.30
1067,-18.74
1068,-19.24
1069,-19.71
1070,-20.18
1071,-20.58
1072,-20.96
1073,-21.24
1074,-21.51
1075,-21.75
1076,-22.09
1077,-22.48
1078,-23.01
1079,-23.62
1080,-24.41
1081,-25.29
1082,-26.28
1083,-27.23
1084,-28.14
1085,-28.93
1086,-29.64
1087,-30.19
1088,-30.62
1089,-30.88
1090,-31.03
1091,-31.05
1092,-31.01
1093,-30.91
1094,-30.81
1095,-30.72
1096,-30.65
1097,-30.59
1098,-30.49
1099,-30.34
1100,-30.03
1101,-29.56
1102,-28.86
1103,-28.01
1104,-26.99
1105,-25.96
1106,-24.92
1107,-23.98
1108,-23.07
1109,-22.26
1110,-21.45
1111,-20.73
1112,-19.99
1113,-19.29
1114,-18.57
1115,-17.93
1116,-17.35
1117,-16.94
1118,-16.66
1119,-16.60
1120,-16.65
1121,-16.79
1122,-16.88
1123,-16.86
1124,-16.69
1125,-16.39
1126,-15.98
1127,-15.53
1128,-15.11
1129,-14.81
1130,-14.64
1131,-14.62
1132,-14.70
1133,-14.82
1134,-14.92
1135,-14.92
1136,-14.80
1137,-14.59
1138,-14.35
1139,-14.19
1140,-14.18
1141,-14.37
1142,-14.72
1143,-15.17
1144,-15.66
1145,-16.10
1146,-16.38
1147,-16.46
1148,-16.34
1149,-16.04
1150,-15.63
1151,-15.17
1152,-14.75
1153,-14.41
1154,-14.18
1155,-14.05
1156,-13.96
1157,-13.90
1158,-13.83
1159,-13.76
1160,-13.64
1161,-13.49
1162,-13.28
1163,-13.08
1164,-12.92
1165,-12.83
1166,-12.76
1167,-12.71
1168,-12.68
1169,-12.72
1170,-12.78
1171,-12.85
1172,-12.89
1173,-12.96
1174,-13.02
1175,-13.05
1176,-12.99
1177,-12.83
1178,-12.54
1179,-12.12
1180,-11.56
1181,-10.92
1182,-10.21
1183,-9.56
1184,-8.95
1185,-8.46
1186,-8.02
1187,-7.65
1188,-7.24
1189,-6.76
1190,-6.07
1191,-5.21
1192,-4.16
1193,-3.06
1194,-1.98
1195,-1.06
1196,-0.30
1197,0.18
1198,0.46
1199,0.52
1200,0.57
1201,0.69
1202,1.00
1203,1.41
1204,1.93
1205,2.46
1206,2.98
1207,3.43
1208,3.78
1209,4.01
1210,4.17
1211,4.29
1212,4.39
1213,4.49
1214,4.57
1215,4.60
1216,4.52
1217,4.32
1218,3.98
1219,3.54
1220,2.97
1221,2.35
1222,1.69
1223,1.08
1224,0.46
1225,-0.12
1226,-0.71
1227,-1.23
1228,-1.76
1229,-2.27
1230,-2.88
1231,-3.51
1232,-4.26
1233,-5.02
1234,-5.83
1235,-6.58
1236,-7.35
1237,-8.06
1238,-8.74
1239,-9.32
1240,-9.84
1241,-10.28
1242,-10.71
1243,-11.11
1244,-11.51
1245,-11.86
1246,-12.19
1247,-12.41
1248,-12.56
1249,-12.57
1250,-12.54
1251,-12.46
1252,-12.44
1253,-12.50
1254,-12.79
1255,-13.25
1256,-13.92
1257,-14.69
1258,-15.58
1259,-16.46
1260,-17.34
1261,-18.14
1262,-18.89
1263,-19.50
1264,-20.00
1265,-20.31
1266,-20.54
1267,-20.67
1268,-20.77
1269,-20.82
1270,-20.88
1271,-20.96
1272,-21.10
1273,-21.27
1274,-21.49
1275,-21.67
1276,-21.78
1277,-21.80
1278,-21.78
1279,-21.74
1280,-21.74
1281,-21.73
1282,-21.74
1283,-21.80
1284,-21.93
1285,-22.11
1286,-22.29
1287,-22.45
1288,-22.58
1289,-22.70
1290,-22.78
1291,-22.82
1292,-22.79
1293,-22.73
1294,-22.64
1295,-22.53
1296,-22.38
1297,-22.17
1298,-21.88
1299,-21.56
1300,-21.20
1301,-20.83
1302,-20.36
1303,-19.84
1304,-19.23
1305,-18.67
1306,-18.14
1307,-17.71
1308,-17.30
1309,-17.00
1310,-16.73
1311,-16.51
1312,-16.20
1313,-15.83
1314,-15.38
1315,-14.97
1316,-14.57
1317,-14.25
1318,-13.98
1319,-13.82
1320,-13.69
1321,-13.59
1322,-13.41
1323,-13.16
1324,-12.81
1325,-12.41
1326,-12.00
1327,-11.64
1328,-11.38
1329,-11.26
1330,-11.27
1331,-11.38
1332,-11.48
1333,-11.55
1334,-11.54
1335,-11.44
1336,-11.28
1337,-11.11
1338,-10.96
1339,-10.86
1340,-10.82
1341,-10.86
1342,-10.96
1343,-11.09
1344,-11.15
1345,-11.16
1346,-11.12
1347,-11.06
1348,-10.96
1349,-10.83
1350,-10.74
1351,-10.74
1352,-10.83
1353,-10.96
1354,-11.06
1355,-11.13
1356,-11.16
1357,-11.16
1358,-11.10
1359,-11.01
1360,-10.93
1361,-10.93
1362,-11.01
1363,-11.16
1364,-11.35
1365,-11.53
1366,-11.69
1367,-11.82
1368,-11.89
1369,-11.88
1370,-11.79
1371,-11.67
1372,-11.60
1373,-11.60
1374,-11.62
1375,-11.66
1376,-11.73
1377,-11.85
1378,-11.96
1379,-12.05
1380,-12.14
1381,-12.23
1382,-12.31
1383,-12.37
1384,-12.41
1385,-12.41
1386,-12.34
1387,-12.19
1388,-11.98
1389,-11.76
1390,-11.63
1391,-11.59
1392,-11.65
1393,-11.80
1394,-12.04
1395,-12.27
1396,-12.46
1397,-12.57
1398,-12.68
1399,-12.76
1400,-12.82
1401,-12.86
1402,-13.04
1403,-13.38
1404,-13.91
1405,-14.53
1406,-15.24
1407,-15.95
1408,-16.66
1409,-17.28
1410,-17.81
1411,-18.19
1412,-18.45
1413,-18.62
1414,-18.79
1415,-18.97
1416,-19.13
1417,-19.25
1418,-19.34
1419,-19.39
1420,-19.40
1421,-19.32
1422,-19.13
1423,-18.86
1424,-18.53
1425,-18.18
1426,-17.78
1427,-17.40
1428,-17.04
1429,-16.78
1430,-16.56
1431,-16.34
1432,-16.04
1433,-15.69
1434,-15.27
1435,-14.82
1436,-14.32
1437,-13.79
1438,-13.24
1439,-12.77
1440,-12.36
1441,-12.03
1442,-11.78
1443,-11.63
1444,-11.62
1445,-11.73
1446,-11.97
1447,-12.30
1448,-12.71
1449,-13.16
1450,-13.62
1451,-14.03
1452,-14.43
1453,-14.77
1454,-15.11
1455,-15.43
1456,-15.79
1457,-16.20
1458,-16.69
1459,-17.15
1460,-17.62
1461,-18.00
1462,-18.32
1463,-18.51
1464,-18.62
1465,-18.68
1466,-18.74
1467,-18.81
1468,-18.95
1469,-19.12
1470,-19.36
1471,-19.62
1472,-19.91
1473,-20.13
1474,-20.35
1475,-20.52
1476,-20.69
1477,-20.82
1478,-20.95
1479,-21.06
1480,-21.22
1481,-21.42
1482,-21.70
1483,-22.03
1484,-22.52
1485,-23.13
1486,-23.93
1487,-24.79
1488,-25.67
1489,-26.44
1490,-27.12
1491,-27.66
1492,-28.14
1493,-28.53
1494,-29.00
1495,-29.53
1496,-30.27
1497,-31.16
1498,-32.22
1499,-33.31
1500,-34.42
1501,-35.40
1502,-36.26
1503,-36.93
1504,-37.46
1505,-37.84
1506,-38.12
1507,-38.27
1508,-38.29
1509,-38.18
1510,-37.90
1511,-37.45
1512,-36.83
1513,-36.08
1514,-35.25
1515,-34.39
1516,-33.47
1517,-32.53
1518,-31.56
1519,-30.67
1520,-29.85
1521,-29.21
1522,-28.70
1523,-28.43
1524,-28.28
1525,-28.25
1526,-28.16
1527,-28.02
1528,-27.69
1529,-27.20
1530,-26.44
1531,-25.56
1532,-24.57
1533,-23.65
1534,-22.80
1535,-22.09
1536,-21.54
1537,-21.19
1538,-20.97
1539,-20.90
1540,-20.90
1541,-20.97
1542,-21.05
1543,-21.19
1544,-21.34
1545,-21.49
1546,-21.57
1547,-21.57
1548,-21.53
1549,-21.49
1550,-21.49
1551,-21.51
1552,-21.60
1553,-21.77
1554,-22.09
1555,-22.53
1556,-23.07
1557,-23.64
1558,-24.23
1559,-24.79
1560,-25.32
1561,-25.79
1562,-26.26
1563,-26.71
1564,-27.23
1565,-27.75
1566,-28.34
1567,-28.88
1568,-29.44
1569,-29.92
1570,-30.42
1571,-30.88
1572,-31.39
1573,-31.91
1574,-32.52
1575,-33.18
1576,-34.00
1577,-34.85
1578,-35.73
1579,-36.48
1580,-37.19
1581,-37.74
1582,-38.29
1583,-38.75
1584,-39.25
1585,-39.71
1586,-40.29
1587,-40.95
1588,-41.84
1589,-42.85
1590,-44.05
1591,-45.27
1592,-46.54
1593,-47.74
1594,-48.90
1595,-49.90
1596,-50.80
1597,-51.52
1598,-52.15
1599,-52.65
1600,-53.09
1601,-53.40
1602,-53.60
1603,-53.65
1604,-53.63
1605,-53.57
1606,-53.46
1607,-53.32
1608,-53.15
1609,-52.97
1610,-52.76
1611,-52.51
1612,-52.12
1613,-51.63
1614,-50.97
1615,-50.21
1616,-49.31
1617,-48.36
1618,-47.36
1619,-46.46
1620,-45.62
1621,-44.95
1622,-44.33
1623,-43.80
1624,-43.24
1625,-42.66
1626,-41.92
1627,-41.14
1628,-40.31
1629,-39.57
1630,-38.88
1631,-38.34
1632,-37.90
1633,-37.65
1634,-37.47
1635,-37.35
1636,-37.16
1637,-36.90
1638,-36.51
1639,-36.04
1640,-35.51
1641,-35.01
1642,-34.54
1643,-34.16
1644,-33.84
1645,-33.62
1646,-33.39
1647,-33.17
1648,-32.88
1649,-32.56
1650,-32.19
1651,-31.81
1652,-31.40
1653,-31.06
1654,-30.75
1655,-30.49
1656,-30.20
1657,-29.88
1658,-29.53
1659,-29.21
1660,-28.89
1661,-28.61
1662,-28.30
1663,-28.05
1664,-27.82
1665,-27.63
1666,-27.34
1667,-26.95
1668,-26.37
1669,-25.70
1670,-24.86
1671,-23.92
1672,-22.88
1673,-21.90
1674,-20.97
1675,-20.23
1676,-19.58
1677,-19.07
1678,-18.52
1679,-18.03
1680,-17.48
1681,-16.94
1682,-16.21
1683,-15.32
1684,-14.18
1685,-12.98
1686,-11.63
1687,-10.29
1688,-8.88
1689,-7.57
1690,-6.29
1691,-5.21
1692,-4.24
1693,-3.49
1694,-2.85
1695,-2.39
1696,-1.91
1697,-1.50
1698,-0.99
1699,-0.52
1700,0.03
1701,0.56
1702,1.21
1703,1.88
1704,2.62
1705,3.30
1706,3.94
1707,4.52
1708,5.13
1709,5.74
1710,6.39
1711,7.00
1712,7.65
1713,8.29
1714,8.96
1715,9.52
1716,9.96
1717,10.19
1718,10.24
1719,10.08
1720,9.77
1721,9.37
1722,9.00
1723,8.75
1724,8.65
1725,8.70
1726,8.82
1727,8.96
1728,8.98
1729,8.84
1730,8.47
1731,7.91
1732,7.16
1733,6.36
1734,5.55
1735,4.87
1736,4.32
1737,3.97
1738,3.78
1739,3.68
1740,3.54
1741,3.35
1742,3.04
1743,2.71
1744,2.27
1745,1.80
1746,1.27
1747,0.78
1748,0.31
1749,-0.10
1750,-0.53
1751,-0.95
1752,-1.42
1753,-1.89
1754,-2.45
1755,-2.99
1756,-3.54
1757,-4.04
1758,-4.59
1759,-5.12
1760,-5.69
1761,-6.25
1762,-6.90
1763,-7.59
1764,-8.35
1765,-9.09
1766,-9.88
1767,-10.64
1768,-11.39
1769,-12.03
1770,-12.63
1771,-13.15
1772,-13.66
1773,-14.10
1774,-14.47
1775,-14.73
1776,-14.93
1777,-15.01
1778,-14.96
1779,-14.76
1780,-14.44
1781,-14.03
1782,-13.58
1783,-13.13
1784,-12.76
1785,-12.54
1786,-12.47
1787,-12.54
1788,-12.74
1789,-13.01
1790,-13.28
1791,-13.47
1792,-13.55
1793,-13.51
1794,-13.37
1795,-13.19
1796,-13.03
1797,-12.93
1798,-12.93
1799,-13.02
1800,-13.20
1801,-13.44
1802,-13.70
1803,-13.91
1804,-14.07
1805,-14.18
1806,-14.28
1807,-14.39
1808,-14.53
1809,-14.71
1810,-14.95
1811,-15.21
1812,-15.49
1813,-15.75
1814,-16.04
1815,-16.30
1816,-16.52
1817,-16.67
1818,-16.79
1819,-16.90
1820,-17.01
1821,-17.13
1822,-17.30
1823,-17.56
1824,-17.94
1825,-18.36
1826,-18.78
1827,-19.10
1828,-19.33
1829,-19.44
1830,-19.46
1831,-19.39
1832,-19.27
1833,-19.16
1834,-19.10
1835,-19.09
1836,-19.13
1837,-19.18
1838,-19.29
1839,-19.40
1840,-19.49
1841,-19.52
1842,-19.53
1843,-19.59
1844,-19.71
1845,-19.81
1846,-19.93
1847,-20.04
1848,-20.22
1849,-20.42
1850,-20.62
1851,-20.81
1852,-21.00
1853,-21.22
1854,-21.50
1855,-21.79
1856,-22.16
1857,-22.57
1858,-23.01
1859,-23.45
1860,-23.95
1861,-24.44
1862,-24.95
1863,-25.43
1864,-25.90
1865,-26.28
1866,-26.54
1867,-26.68
1868,-26.79
1869,-26.89
1870,-27.02
1871,-27.12
1872,-27.31
1873,-27.59
1874,-28.02
1875,-28.53
1876,-29.08
1877,-29.59
1878,-30.03
1879,-30.31
1880,-30.48
1881,-30.53
1882,-30.57
1883,-30.66
1884,-30.91
1885,-31.29
1886,-31.85
1887,-32.50
1888,-33.22
1889,-33.87
1890,-34.45
1891,-34.85
1892,-35.10
1893,-35.19
1894,-35.16
1895,-35.06
1896,-34.94
1897,-34.85
1898,-34.83
1899,-34.86
1900,-34.91
1901,-34.94
1902,-34.92
1903,-34.80
1904,-34.59
1905,-34.29
1906,-33.92
1907,-33.53
1908,-33.14
1909,-32.84
1910,-32.67
1911,-32.65
1912,-32.73
1913,-32.90
1914,-33.07
1915,-33.20
1916,-33.18
1917,-33.05
1918,-32.79
1919,-32.49
1920,-32.14
1921,-31.78
1922,-31.45
1923,-31.11
1924,-30.75
1925,-30.33
1926,-29.88
1927,-29.41
1928,-29.05
1929,-28.88
1930,-29.02
1931,-29.47
1932,-30.21
1933,-31.14
1934,-32.20
1935,-33.22
1936,-34.11
1937,-34.73
1938,-35.08
1939,-35.17
1940,-35.18
1941,-35.15
1942,-35.22
1943,-35.38
1944,-35.72
1945,-36.19
1946,-36.82
1947,-37.49
1948,-38.22
1949,-38.92
1950,-39.65
1951,-40.35
1952,-41.06
1953,-41.67
1954,-42.25
1955,-42.73
1956,-43.21
1957,-43.60
1958,-44.01
1959,-44.40
1960,-44.91
1961,-45.56
1962,-46.42
1963,-47.44
1964,-48.54
1965,-49.59
1966,-50.52
1967,-51.22
1968,-51.59
1969,-51.57
1970,-51.13
1971,-50.42
1972,-49.48
1973,-48.48
1974,-47.40
1975,-46.35
1976,-45.23
1977,-44.12
1978,-42.92
1979,-41.73
1980,-40.42
1981,-39.15
1982,-37.77
1983,-36.47
1984,-35.10
1985,-33.77
1986,-32.27
1987,-30.73
1988,-29.02
1989,-27.39
1990,-25.73
1991,-24.28
1992,-22.90
1993,-21.77
1994,-20.76
1995,-19.95
1996,-19.07
1997,-18.14
1998,-16.92
1999,-15.59
2000,-14.04
2001,-12.48
2002,-10.88
2003,-9.51
2004,-8.29
2005,-7.36
2006,-6.46
2007,-5.65
2008,-4.71
2009,-3.76
2010,-2.63
2011,-1.46
2012,-0.21
2013,0.95
2014,2.00
2015,2.82
2016,3.46
2017,3.89
2018,4.19
2019,4.35
2020,4.45
2021,4.46
2022,4.46
2023,4.43
2024,4.39
2025,4.30
2026,4.15
2027,3.92
2028,3.55
2029,3.04
2030,2.40
2031,1.69
2032,0.95
2033,0.30
2034,-0.27
2035,-0.67
2036,-0.99
2037,-1.23
2038,-1.54
2039,-1.94
2040,-2.53
2041,-3.23
2042,-4.07
2043,-4.93
2044,-5.80
2045,-6.54
2046,-7.12
2047,-7.49
2048,-7.77
2049,-7.96
2050,-8.13
2051,-8.27
2052,-8.44
2053,-8.61
2054,-8.77
2055,-8.86
2056,-8.88
2057,-8.81
2058,-8.67
2059,-8.53
2060,-8.40
2061,-8.32
2062,-8.24
2063,-8.18
2064,-8.15
2065,-8.12
2066,-8.04
2067,-7.87
2068,-7.59
2069,-7.26
2070,-6.90
2071,-6.49
2072,-6.09
2073,-5.72
2074,-5.49
2075,-5.41
2076,-5.55
2077,-5.89
2078,-6.52
2079,-7.41
2080,-8.57
2081,-9.88
2082,-11.31
2083,-12.66
2084,-13.95
2085,-15.04
2086,-16.00
2087,-16.73
2088,-17.39
2089,-17.92
2090,-18.53
2091,-19.14
2092,-19.90
2093,-20.68
2094,-21.63
2095,-22.61
2096,-23.68
2097,-24.67
2098,-25.70
2099,-26.67
2100,-27.72
2101,-28.75
2102,-29.86
2103,-30.94
2104,-32.04
2105,-33.04
2106,-34.01
2107,-34.83
2108,-35.51
2109,-35.97
2110,-36.28
2111,-36.45
2112,-36.54
2113,-36.53
2114,-36.46
2115,-36.29
2116,-36.08
2117,-35.78
2118,-35.39
2119,-34.91
2120,-34.39
2121,-33.93
2122,-33.62
2123,-33.54
2124,-33.65
2125,-33.94
2126,-34.32
2127,-34.66
2128,-34.77
2129,-34.58
2130,-34.07
2131,-33.34
2132,-32.46
2133,-31.59
2134,-30.86
2135,-30.41
2136,-30.23
2137,-30.31
2138,-30.57
2139,-30.91
2140,-31.19
2141,-31.33
2142,-31.25
2143,-31.04
2144,-30.72
2145,-30.39
2146,-30.10
2147,-29.92
2148,-29.88
2149,-29.98
2150,-30.16
2151,-30.34
2152,-30.46
2153,-30.49
2154,-30.46
2155,-30.40
2156,-30.30
2157,-30.24
2158,-30.29
2159,-30.47
2160,-30.72
2161,-31.01
2162,-31.29
2163,-31.52
2164,-31.65
2165,-31.62
2166,-31.48
2167,-31.26
2168,-30.98
2169,-30.70
2170,-30.41
2171,-30.14
2172,-29.87
2173,-29.58
2174,-29.23
2175,-28.82
2176,-28.30
2177,-27.73
2178,-27.17
2179,-26.73
2180,-26.41
2181,-26.28
2182,-26.25
2183,-26.34
2184,-26.40
2185,-26.36
2186,-26.08
2187,-25.61
2188,-24.97
2189,-24.28
2190,-23.59
2191,-23.00
2192,-22.52
2193,-22.25
2194,-22.09
2195,-22.00
2196,-21.83
2197,-21.64
2198,-21.38
2199,-21.13
2200,-20.77
2201,-20.32
2202,-19.69
2203,-18.94
2204,-17.94
2205,-16.78
2206,-15.34
2207,-13.78
2208,-12.07
2209,-10.48
2210,-9.00
2211,-7.80
2212,-6.74
2213,-5.93
2214,-5.19
2215,-4.56
2216,-3.84
2217,-3.06
2218,-2.18
2219,-1.40
2220,-0.64
2221,-0.05
2222,0.47
2223,0.81
2224,1.06
2225,1.24
2226,1.52
2227,1.85
2228,2.30
2229,2.77
2230,3.29
2231,3.75
2232,4.18
2233,4.49
2234,4.76
2235,4.97
2236,5.26
2237,5.60
2238,6.07
2239,6.59
2240,7.22
2241,7.87
2242,8.54
2243,9.12
2244,9.65
2245,10.02
2246,10.29
2247,10.45
2248,10.61
2249,10.77
2250,11.02
2251,11.33
2252,11.79
2253,12.35
2254,13.02
2255,13.66
2256,14.27
2257,14.75
2258,15.11
2259,15.27
2260,15.25
2261,15.10
2262,14.93
2263,14.79
2264,14.72
2265,14.69
2266,14.74
2267,14.86
2268,15.01
2269,15.14
2270,15.19
2271,15.17
2272,15.05
2273,14.87
2274,14.64
2275,14.45
2276,14.26
2277,14.08
2278,13.85
2279,13.57
2280,13.21
2281,12.80
2282,12.27
2283,11.70
2284,11.07
2285,10.48
2286,9.84
2287,9.24
2288,8.64
2289,8.14
2290,7.65
2291,7.19
2292,6.73
2293,6.32
2294,5.91
2295,5.57
2296,5.29
2297,5.11
2298,4.97
2299,4.88
2300,4.77
2301,4.65
2302,4.47
2303,4.25
2304,3.97
2305,3.68
2306,3.33
2307,2.98
2308,2.62
2309,2.29
2310,1.85
2311,1.30
2312,0.56
2313,-0.29
2314,-1.29
2315,-2.32
2316,-3.40
2317,-4.36
2318,-5.26
2319,-5.98
2320,-6.65
2321,-7.21
2322,-7.81
2323,-8.38
2324,-9.03
2325,-9.67
2326,-10.36
2327,-11.00
2328,-11.62
2329,-12.11
2330,-12.56
2331,-12.95
2332,-13.40
2333,-13.86
2334,-14.38
2335,-14.85
2336,-15.28
2337,-15.63
2338,-15.94
2339,-16.20
2340,-16.44
2341,-16.64
2342,-16.82
2343,-16.93
2344,-17.01
2345,-17.03
2346,-17.04
2347,-17.03
2348,-17.03
2349,-17.07
2350,-17.27
2351,-17.58
2352,-18.04
2353,-18.54
2354,-19.10
2355,-19.62
2356,-20.11
2357,-20.45
2358,-20.73
2359,-20.94
2360,-21.24
2361,-21.66
2362,-22.32
2363,-23.14
2364,-24.13
2365,-25.15
2366,-26.16
2367,-27.08
2368,-27.91
2369,-28.56
2370,-29.05
2371,-29.33
2372,-29.49
2373,-29.56
2374,-29.63
2375,-29.71
2376,-29.84
2377,-29.98
2378,-30.16
2379,-30.34
2380,-30.50
2381,-30.59
2382,-30.59
2383,-30.51
2384,-30.33
2385,-30.03
2386,-29.58
2387,-29.01
2388,-28.38
2389,-27.75
2390,-27.14
2391,-26.61
2392,-26.18
2393,-25.92
2394,-25.79
2395,-25.80
2396,-25.89
2397,-25.99
2398,-25.98
2399,-25.84
2400,-25.57
2401,-25.23
2402,-24.88
2403,-24.57
2404,-24.38
2405,-24.31
2406,-24.39
2407,-24.57
2408,-24.86
2409,-25.21
2410,-25.63
2411,-26.10
2412,-26.64
2413,-27.22
2414,-27.90
2415,-28.63
2416,-29.46
2417,-30.28
2418,-31.11
2419,-31.87
2420,-32.68
2421,-33.45
2422,-34.27
2423,-35.05
2424,-35.90
2425,-36.75
2426,-37.65
2427,-38.44
2428,-39.16
2429,-39.77
2430,-40.37
2431,-40.92
2432,-41.47
2433,-41.95
2434,-42.48
2435,-42.96
2436,-43.44
2437,-43.86
2438,-44.25
2439,-44.55
2440,-44.71
2441,-44.71
2442,-44.59
2443,-44.40
2444,-44.17
2445,-43.91
2446,-43.60
2447,-43.28
2448,-42.91
2449,-42.53
2450,-42.13
2451,-41.73
2452,-41.24
2453,-40.76
2454,-40.23
2455,-39.77
2456,-39.29
2457,-38.84
2458,-38.31
2459,-37.73
2460,-36.99
2461,-36.16
2462,-35.15
2463,-34.13
2464,-33.04
2465,-32.01
2466,-30.98
2467,-30.02
2468,-29.02
2469,-28.04
2470,-26.95
2471,-25.86
2472,-24.73
2473,-23.70
2474,-22.74
2475,-21.97
2476,-21.26
2477,-20.68
2478,-20.14
2479,-19.62
2480,-19.02
2481,-18.38
2482,-17.68
2483,-17.06
2484,-16.53
2485,-16.21
2486,-16.08
2487,-16.16
2488,-16.35
2489,-16.60
2490,-16.83
2491,-17.01
2492,-17.13
2493,-17.18
2494,-17.20
2495,-17.24
2496,-17.31
2497,-17.43
2498,-17.58
2499,-17.77
2500,-17.97
2501,-18.19
2502,-18.34
2503,-18.39
2504,-18.28
2505,-18.04
2506,-17.68
2507,-17.23
2508,-16.72
2509,-16.20
2510,-15.63
2511,-15.10
2512,-14.59
2513,-14.17
2514,-13.72
2515,-13.27
2516,-12.70
2517,-12.09
2518,-11.40
2519,-10.70
2520,-9.90
2521,-9.14
2522,-8.29
2523,-7.45
2524,-6.46
2525,-5.42
2526,-4.23
2527,-3.04
2528,-1.72
2529,-0.41
2530,0.98
2531,2.23
2532,3.44
2533,4.45
2534,5.41
2535,6.26
2536,7.19
2537,8.15
2538,9.26
2539,10.41
2540,11.62
2541,12.68
2542,13.57
2543,14.14
2544,14.48
2545,14.53
2546,14.47
2547,14.39
2548,14.46
2549,14.70
2550,15.19
2551,15.82
2552,16.56
2553,17.28
2554,17.89
2555,18.28
2556,18.45
2557,18.41
2558,18.21
2559,17.94
2560,17.68
2561,17.49
2562,17.38
2563,17.30
2564,17.21
2565,17.08
2566,16.79
2567,16.36
2568,15.72
2569,14.98
2570,14.15
2571,13.33
2572,12.47
2573,11.71
2574,11.02
2575,10.50
2576,10.08
2577,9.78
2578,9.47
2579,9.16
2580,8.75
2581,8.32
2582,7.83
2583,7.32
2584,6.77
2585,6.28
2586,5.87
2587,5.63
2588,5.55
2589,5.63
2590,5.80
2591,6.05
2592,6.29
2593,6.48
2594,6.55
2595,6.49
2596,6.32
2597,6.07
2598,5.78
2599,5.52
2600,5.30
2601,5.16
2602,5.06
2603,5.01
2604,5.00
2605,4.96
2606,4.87
2607,4.76
2608,4.67
2609,4.63
2610,4.62
2611,4.63
2612,4.67
2613,4.77
2614,4.84
2615,4.86
2616,4.78
2617,4.62
2618,4.40
2619,4.17
2620,3.92
2621,3.67
2622,3.33
2623,2.96
2624,2.50
2625,2.01
2626,1.40
2627,0.73
2628,-0.03
2629,-0.77
2630,-1.50
2631,-2.14
2632,-2.72
2633,-3.18
2634,-3.62
2635,-3.94
2636,-4.26
2637,-4.54
2638,-4.92
2639,-5.34
2640,-5.87
2641,-6.39
2642,-6.98
2643,-7.59
2644,-8.26
2645,-8.92
2646,-9.56
2647,-10.09
2648,-10.49
2649,-10.71
2650,-10.83
2651,-10.88
2652,-10.95
2653,-10.99
2654,-11.04
2655,-11.07
2656,-11.12
2657,-11.17
2658,-11.20
2659,-11.20
2660,-11.22
2661,-11.27
2662,-11.34
2663,-11.44
2664,-11.57
2665,-11.74
2666,-11.95
2667,-12.15
2668,-12.41
2669,-12.73
2670,-13.11
2671,-13.53
2672,-13.99
2673,-14.44
2674,-14.85
2675,-15.14
2676,-15.34
2677,-15.42
2678,-15.43
2679,-15.36
2680,-15.25
2681,-15.18
2682,-15.25
2683,-15.42
2684,-15.64
2685,-15.85
2686,-16.09
2687,-16.32
2688,-16.51
2689,-16.60
2690,-16.64
2691,-16.65
2692,-16.69
2693,-16.82
2694,-17.06
2695,-17.42
2696,-17.85
2697,-18.29
2698,-18.75
2699,-19.21
2700,-19.61
2701,-19.84
2702,-19.89
2703,-19.80
2704,-19.64
2705,-19.45
2706,-19.24
2707,-19.00
2708,-18.79
2709,-18.65
2710,-18.63
2711,-18.72
2712,-18.94
2713,-19.27
2714,-19.68
2715,-20.13
2716,-20.59
2717,-21.04
2718,-21.47
2719,-21.82
2720,-22.10
2721,-22.33
2722,-22.60
2723,-22.88
2724,-23.21
2725,-23.50
2726,-23.79
2727,-24.05
2728,-24.30
2729,-24.51
2730,-24.67
2731,-24.79
2732,-24.89
2733,-24.97
2734,-25.04
2735,-25.11
2736,-25.16
2737,-25.16
2738,-25.05
2739,-24.85
2740,-24.60
2741,-24.39
2742,-24.21
2743,-24.07
2744,-23.94
2745,-23.83
2746,-23.67
2747,-23.42
2748,-22.99
2749,-22.42
2750,-21.74
2751,-21.03
2752,-20.31
2753,-19.65
2754,-19.08
2755,-18.67
2756,-18.41
2757,-18.26
2758,-18.16
2759,-18.08
2760,-18.00
2761,-17.91
2762,-17.78
2763,-17.60
2764,-17.41
2765,-17.28
2766,-17.27
2767,-17.43
2768,-17.75
2769,-18.23
2770,-18.80
2771,-19.41
2772,-20.00
2773,-20.48
2774,-20.76
2775,-20.82
2776,-20.73
2777,-20.53
2778,-20.29
2779,-20.05
2780,-19.88
2781,-19.84
2782,-19.95
2783,-20.18
2784,-20.45
2785,-20.70
2786,-20.80
2787,-20.76
2788,-20.55
2789,-20.22
2790,-19.73
2791,-19.14
2792,-18.49
2793,-17.88
2794,-17.23
2795,-16.62
2796,-16.02
2797,-15.50
2798,-15.00
2799,-14.60
2800,-14.25
2801,-14.03
2802,-13.85
2803,-13.72
2804,-13.53
2805,-13.32
2806,-12.98
2807,-12.55
2808,-11.98
2809,-11.36
2810,-10.70
2811,-10.11
2812,-9.57
2813,-9.15
2814,-8.72
2815,-8.32
2816,-7.88
2817,-7.42
2818,-6.85
2819,-6.26
2820,-5.65
2821,-5.13
2822,-4.65
2823,-4.24
2824,-3.87
2825,-3.58
2826,-3.33
2827,-3.14
2828,-2.92
2829,-2.72
2830,-2.54
2831,-2.44
2832,-2.46
2833,-2.58
2834,-2.81
2835,-3.14
2836,-3.56
2837,-4.04
2838,-4.52
2839,-4.90
2840,-5.21
2841,-5.46
2842,-5.75
2843,-6.10
2844,-6.53
2845,-7.03
2846,-7.64
2847,-8.29
2848,-8.94
2849,-9.45
2850,-9.81
2851,-10.04
2852,-10.21
2853,-10.31
2854,-10.41
2855,-10.53
2856,-10.72
2857,-10.96
2858,-11.16
2859,-11.28
2860,-11.23
2861,-11.03
2862,-10.60
2863,-9.98
2864,-9.19
2865,-8.35
2866,-7.51
2867,-6.71
2868,-5.93
2869,-5.23
2870,-4.56
2871,-4.01
2872,-3.51
2873,-3.11
2874,-2.75
2875,-2.49
2876,-2.30
2877,-2.26
2878,-2.30
2879,-2.41
2880,-2.44
2881,-2.37
2882,-2.14
2883,-1.75
2884,-1.20
2885,-0.54
2886,0.16
2887,0.79
2888,1.31
2889,1.63
2890,1.76
2891,1.72
2892,1.59
2893,1.43
2894,1.30
2895,1.24
2896,1.27
2897,1.36
2898,1.49
2899,1.58
2900,1.61
2901,1.57
2902,1.50
2903,1.40
2904,1.33
2905,1.30
2906,1.31
2907,1.37
2908,1.47
2909,1.56
2910,1.62
2911,1.66
2912,1.69
2913,1.68
2914,1.60
2915,1.49
2916,1.39
2917,1.33
2918,1.24
2919,1.11
2920,0.92
2921,0.70
2922,0.46
2923,0.20
2924,-0.06
2925,-0.27
2926,-0.46
2927,-0.60
2928,-0.69
2929,-0.72
2930,-0.74
2931,-0.79
2932,-0.90
2933,-1.08
2934,-1.34
2935,-1.63
2936,-1.95
2937,-2.24
2938,-2.53
2939,-2.77
2940,-2.92
2941,-2.98
2942,-3.00
2943,-3.01
2944,-3.07
2945,-3.13
2946,-3.20
2947,-3.26
2948,-3.30
2949,-3.30
2950,-3.26
2951,-3.16
2952,-3.04
2953,-2.95
2954,-2.92
2955,-2.98
2956,-3.11
2957,-3.27
2958,-3.42
2959,-3.50
2960,-3.50
2961,-3.41
2962,-3.27
2963,-3.10
2964,-2.99
2965,-2.98
2966,-3.14
2967,-3.44
2968,-3.84
2969,-4.23
2970,-4.58
2971,-4.81
2972,-4.92
2973,-4.89
2974,-4.74
2975,-4.49
2976,-4.21
2977,-3.97
2978,-3.83
2979,-3.79
2980,-3.84
2981,-3.97
2982,-4.18
2983,-4.41
2984,-4.60
2985,-4.71
2986,-4.83
2987,-4.93
2988,-5.06
2989,-5.17
2990,-5.34
2991,-5.56
2992,-5.88
2993,-6.27
2994,-6.75
2995,-7.28
2996,-7.84
2997,-8.34
2998,-8.82
2999,-9.22
3000,-9.57
3001,-9.86
3002,-10.17
3003,-10.48
3004,-10.84
3005,-11.15
3006,-11.47
3007,-11.76
3008,-12.08
3009,-12.39
3010,-12.73
3011,-13.05
3012,-13.41
3013,-13.82
3014,-14.31
3015,-14.80
3016,-15.34
3017,-15.84
3018,-16.29
3019,-16.64
3020,-16.94
3021,-17.17
3022,-17.35
3023,-17.46
3024,-17.57
3025,-17.68
3026,-17.81
3027,-17.86
3028,-17.84
3029,-17.72
3030,-17.54
3031,-17.32
3032,-17.10
3033,-16.88
3034,-16.71
3035,-16.62
3036,-16.64
3037,-16.75
3038,-16.95
3039,-17.20
3040,-17.45
3041,-17.69
3042,-17.89
3043,-18.01
3044,-18.04
3045,-18.01
3046,-17.96
3047,-17.85
3048,-17.72
3049,-17.59
3050,-17.57
3051,-17.69
3052,-17.91
3053,-18.14
3054,-18.40
3055,-18.68
3056,-18.94
3057,-19.13
3058,-19.17
3059,-19.11
3060,-19.00
3061,-18.90
3062,-18.83
3063,-18.81
3064,-18.84
3065,-18.93
3066,-19.07
3067,-19.22
3068,-19.38
3069,-19.51
3070,-19.54
3071,-19.45
3072,-19.24
3073,-18.97
3074,-18.68
3075,-18.42
3076,-18.17
3077,-17.98
3078,-17.90
3079,-17.91
3080,-17.92
3081,-17.88
3082,-17.71
3083,-17.47
3084,-17.17
3085,-16.85
3086,-16.47
3087,-16.12
3088,-15.85
3089,-15.70
3090,-15.62
3091,-15.56
3092,-15.52
3093,-15.50
3094,-15.46
3095,-15.43
3096,-15.40
3097,-15.40
3098,-15.46
3099,-15.61
3100,-15.85
3101,-16.16
3102,-16.49
3103,-16.76
3104,-16.91
3105,-16.91
3106,-16.78
3107,-16.57
3108,-16.30
3109,-16.03
3110,-15.80
3111,-15.66
3112,-15.57
3113,-15.53
3114,-15.43
3115,-15.26
3116,-14.97
3117,-14.59
3118,-14.10
3119,-13.53
3120,-12.89
3121,-12.27
3122,-11.70
3123,-11.23
3124,-10.81
3125,-10.50
3126,-10.28
3127,-10.16
3128,-10.06
3129,-9.96
3130,-9.83
3131,-9.71
3132,-9.57
3133,-9.37
3134,-9.07
3135,-8.74
3136,-8.44
3137,-8.23
3138,-8.10
3139,-8.04
3140,-8.07
3141,-8.19
3142,-8.38
3143,-8.62
3144,-8.90
3145,-9.20
3146,-9.51
3147,-9.80
3148,-10.09
3149,-10.38
3150,-10.73
3151,-11.07
3152,-11.42
3153,-11.73
3154,-12.10
3155,-12.50
3156,-12.99
3157,-13.49
3158,-14.02
3159,-14.56
3160,-15.11
3161,-15.60
3162,-16.07
3163,-16.44
3164,-16.79
3165,-17.11
3166,-17.44
3167,-17.75
3168,-18.10
3169,-18.42
3170,-18.72
3171,-18.93
3172,-19.04
3173,-19.03
3174,-18.94
3175,-18.82
3176,-18.71
3177,-18.65
3178,-18.64
3179,-18.69
3180,-18.84
3181,-19.04
3182,-19.29
3183,-19.50
3184,-19.65
3185,-19.74
3186,-19.78
3187,-19.81
3188,-19.84
3189,-19.90
3190,-20.00
3191,-20.12
3192,-20.25
3193,-20.37
3194,-20.47
3195,-20.53
3196,-20.53
3197,-20.47
3198,-20.35
3199,-20.20
3200,-20.05
3201,-19.93
3202,-19.84
3203,-19.74
3204,-19.65
3205,-19.55
3206,-19.49
3207,-19.43
3208,-19.36
3209,-19.26
3210,-19.22
3211,-19.29
3212,-19.54
3213,-19.90
3214,-20.35
3215,-20.86
3216,-21.41
3217,-21.92
3218,-22.35
3219,-22.67
3220,-22.91
3221,-23.09
3222,-23.24
3223,-23.32
3224,-23.32
3225,-23.28
3226,-23.19
3227,-23.04
3228,-22.74
3229,-22.31
3230,-21.77
3231,-21.19
3232,-20.58
3233,-19.99
3234,-19.46
3235,-19.08
3236,-18.78
3237,-18.56
3238,-18.35
3239,-18.17
3240,-18.02
3241,-17.91
3242,-17.79
3243,-17.65
3244,-17.45
3245,-17.24
3246,-17.04
3247,-16.87
3248,-16.71
3249,-16.59
3250,-16.51
3251,-16.51
3252,-16.59
3253,-16.75
3254,-16.94
3255,-17.15
3256,-17.37
3257,-17.58
3258,-17.76
3259,-17.88
3260,-17.94
3261,-17.97
3262,-18.01
3263,-18.08
3264,-18.24
3265,-18.45
3266,-18.71
3267,-18.97
3268,-19.23
3269,-19.46
3270,-19.72
3271,-19.98
3272,-20.24
3273,-20.48
3274,-20.72
3275,-20.95
3276,-21.18
3277,-21.36
3278,-21.51
3279,-21.62
3280,-21.71
3281,-21.80
3282,-21.89
3283,-21.95
3284,-21.97
3285,-21.90
3286,-21.76
3287,-21.55
3288,-21.30
3289,-21.00
3290,-20.66
3291,-20.36
3292,-20.16
3293,-20.07
3294,-20.06
3295,-20.13
3296,-20.29
3297,-20.52
3298,-20.79
3299,-21.03
3300,-21.25
3301,-21.42
3302,-21.55
3303,-21.61
3304,-21.60
3305,-21.57
3306,-21.55
3307,-21.55
3308,-21.56
3309,-21.56
3310,-21.53
3311,-21.50
3312,-21.50
3313,-21.56
3314,-21.67
3315,-21.78
3316,-21.90
3317,-22.00
3318,-22.04
3319,-22.01
3320,-21.90
3321,-21.75
3322,-21.59
3323,-21.51
3324,-21.51
3325,-21.61
3326,-21.73
3327,-21.86
3328,-21.96
3329,-22.00
3330,-21.90
3331,-21.67
3332,-21.32
3333,-20.92
3334,-20.51
3335,-20.13
3336,-19.78
3337,-19.49
3338,-19.20
3339,-18.93
3340,-18.59
3341,-18.20
3342,-17.73
3343,-17.24
3344,-16.71
3345,-16.19
3346,-15.60
3347,-15.01
3348,-14.41
3349,-13.91
3350,-13.50
3351,-13.21
3352,-13.01
3353,-12.91
3354,-12.85
3355,-12.83
3356,-12.76
3357,-12.66
3358,-12.47
3359,-12.25
3360,-11.90
3361,-11.53
3362,-11.12
3363,-10.74
3364,-10.34
3365,-9.96
3366,-9.61
3367,-9.28
3368,-8.91
3369,-8.51
3370,-8.06
3371,-7.65
3372,-7.23
3373,-6.86
3374,-6.51
3375,-6.21
3376,-5.93
3377,-5.67
3378,-5.42
3379,-5.18
3380,-4.93
3381,-4.69
3382,-4.50
3383,-4.41
3384,-4.43
3385,-4.59
3386,-4.86
3387,-5.26
3388,-5.72
3389,-6.17
3390,-6.55
3391,-6.83
3392,-7.01
3393,-7.06
3394,-6.95
3395,-6.71
3396,-6.42
3397,-6.10
3398,-5.79
3399,-5.47
3400,-5.17
3401,-4.89
3402,-4.62
3403,-4.36
3404,-4.14
3405,-3.98
3406,-3.89
3407,-3.87
3408,-3.91
3409,-4.03
3410,-4.19
3411,-4.34
3412,-4.48
3413,-4.56
3414,-4.59
3415,-4.59
3416,-4.60
3417,-4.65
3418,-4.78
3419,-4.99
3420,-5.28
3421,-5.62
3422,-5.95
3423,-6.26
3424,-6.49
3425,-6.65
3426,-6.65
3427,-6.51
3428,-6.20
3429,-5.75
3430,-5.20
3431,-4.62
3432,-4.12
3433,-3.76
3434,-3.54
3435,-3.46
3436,-3.48
3437,-3.58
3438,-3.67
3439,-3.68
3440,-3.55
3441,-3.30
3442,-3.02
3443,-2.83
3444,-2.82
3445,-3.02
3446,-3.46
3447,-4.10
3448,-4.88
3449,-5.65
3450,-6.32
3451,-6.77
3452,-7.00
3453,-7.04
3454,-7.00
3455,-6.93
3456,-6.93
3457,-7.00
3458,-7.19
3459,-7.42
3460,-7.71
3461,-8.00
3462,-8.30
3463,-8.52
3464,-8.74
3465,-8.96
3466,-9.31
3467,-9.74
3468,-10.27
3469,-10.86
3470,-11.57
3471,-12.30
3472,-13.03
3473,-13.66
3474,-14.23
3475,-14.68
3476,-15.03
3477,-15.27
3478,-15.50
3479,-15.74
3480,-16.06
3481,-16.41
3482,-16.86
3483,-17.33
3484,-17.79
3485,-18.17
3486,-18.52
3487,-18.81
3488,-19.07
3489,-19.26
3490,-19.46
3491,-19.66
3492,-19.88
3493,-20.06
3494,-20.17
3495,-20.21
3496,-20.18
3497,-20.05
3498,-19.81
3499,-19.52
3500,-19.25
3501,-19.03
3502,-18.82
3503,-18.63
3504,-18.46
3505,-18.32
3506,-18.09
3507,-17.78
3508,-17.37
3509,-16.95
3510,-16.49
3511,-16.03
3512,-15.53
3513,-15.06
3514,-14.60
3515,-14.19
3516,-13.80
3517,-13.48
3518,-13.22
3519,-13.02
3520,-12.81
3521,-12.63
3522,-12.51
3523,-12.52
3524,-12.61
3525,-12.78
3526,-12.96
3527,-13.18
3528,-13.37
3529,-13.57
3530,-13.69
3531,-13.73
3532,-13.64
3533,-13.46
3534,-13.19
3535,-12.87
3536,-12.47
3537,-12.03
3538,-11.55
3539,-11.08
3540,-10.58
3541,-10.11
3542,-9.67
3543,-9.31
3544,-9.03
3545,-8.87
3546,-8.76
3547,-8.71
3548,-8.64
3549,-8.57
3550,-8.44
3551,-8.26
3552,-8.06
3553,-7.87
3554,-7.75
3555,-7.78
3556,-7.98
3557,-8.32
3558,-8.72
3559,-9.12
3560,-9.44
3561,-9.64
3562,-9.74
3563,-9.74
3564,-9.67
3565,-9.60
3566,-9.61
3567,-9.69
3568,-9.86
3569,-10.10
3570,-10.41
3571,-10.70
3572,-10.93
3573,-11.05
3574,-11.12
3575,-11.13
3576,-11.12
3577,-11.09
3578,-11.12
3579,-11.19
3580,-11.32
3581,-11.47
3582,-11.67
3583,-11.87
3584,-12.05
3585,-12.18
3586,-12.25
3587,-12.25
3588,-12.15
3589,-11.98
3590,-11.72
3591,-11.42
3592,-11.09
3593,-10.74
3594,-10.35
3595,-9.96
3596,-9.60
3597,-9.30
3598,-9.06
3599,-8.90
3600,-8.77
3601,-8.69
3602,-8.57
3603,-8.43
3604,-8.25
3605,-8.05
3606,-7.77
3607,-7.42
3608,-7.00
3609,-6.57
3610,-6.18
3611,-5.89
3612,-5.71
3613,-5.65
3614,-5.68
3615,-5.78
3616,-5.91
3617,-6.03
3618,-6.09
3619,-6.06
3620,-5.97
3621,-5.84
3622,-5.74
3623,-5.70
3624,-5.78
3625,-5.99
3626,-6.31
3627,-6.68
3628,-7.01
3629,-7.26
3630,-7.39
3631,-7.37
3632,-7.26
3633,-7.07
3634,-6.90
3635,-6.77
3636,-6.69
3637,-6.66
3638,-6.73
3639,-6.87
3640,-7.06
3641,-7.25
3642,-7.41
3643,-7.52
3644,-7.60
3645,-7.62
3646,-7.62
3647,-7.64
3648,-7.74
3649,-7.88
3650,-8.09
3651,-8.35
3652,-8.71
3653,-9.09
3654,-9.46
3655,-9.76
3656,-10.03
3657,-10.29
3658,-10.55
3659,-10.78
3660,-11.03
3661,-11.28
3662,-11.58
3663,-11.88
3664,-12.18
3665,-12.44
3666,-12.66
3667,-12.81
3668,-12.92
3669,-12.96
3670,-12.99
3671,-13.05
3672,-13.18
3673,-13.42
3674,-13.75
3675,-14.14
3676,-14.58
3677,-15.00
3678,-15.34
3679,-15.52
3680,-15.53
3681,-15.43
3682,-15.31
3683,-15.24
3684,-15.28
3685,-15.43
3686,-15.68
3687,-16.01
3688,-16.38
3689,-16.72
3690,-16.96
3691,-17.04
3692,-17.00
3693,-16.90
3694,-16.83
3695,-16.86
3696,-16.99
3697,-17.20
3698,-17.46
3699,-17.67
3700,-17.79
3701,-17.76
3702,-17.59
3703,-17.32
3704,-16.98
3705,-16.65
3706,-16.37
3707,-16.18
3708,-16.14
3709,-16.20
3710,-16.30
3711,-16.34
3712,-16.27
3713,-16.10
3714,-15.79
3715,-15.40
3716,-14.98
3717,-14.63
3718,-14.34
3719,-14.14
3720,-13.97
3721,-13.80
3722,-13.57
3723,-13.25
3724,-12.79
3725,-12.23
3726,-11.59
3727,-10.99
3728,-10.47
3729,-10.15
3730,-10.03
3731,-10.10
3732,-10.27
3733,-10.46
3734,-10.60
3735,-10.67
3736,-10.61
3737,-10.44
3738,-10.15
3739,-9.82
3740,-9.50
3741,-9.22
3742,-9.01
3743,-8.87
3744,-8.80
3745,-8.80
3746,-8.82
3747,-8.86
3748,-8.90
3749,-8.96
3750,-9.00
3751,-9.00
3752,-8.99
3753,-9.02
3754,-9.11
3755,-9.26
3756,-9.44
3757,-9.66
3758,-9.91
3759,-10.15
3760,-10.31
3761,-10.38
3762,-10.36
3763,-10.29
3764,-10.18
3765,-10.03
3766,-9.87
3767,-9.72
3768,-9.57
3769,-9.39
3770,-9.20
3771,-9.02
3772,-8.86
3773,-8.71
3774,-8.58
3775,-8.51
3776,-8.54
3777,-8.69
3778,-8.95
3779,-9.25
3780,-9.55
3781,-9.78
3782,-9.98
3783,-10.15
3784,-10.34
3785,-10.47
3786,-10.58
3787,-10.70
3788,-10.90
3789,-11.15
3790,-11.45
3791,-11.70
3792,-12.01
3793,-12.34
3794,-12.76
3795,-13.17
3796,-13.63
3797,-14.11
3798,-14.73
3799,-15.40
3800,-16.14
3801,-16.90
3802,-17.80
3803,-18.75
3804,-19.80
3805,-20.80
3806,-21.84
3807,-22.83
3808,-23.82
3809,-24.64
3810,-25.34
3811,-25.87
3812,-26.40
3813,-26.88
3814,-27.41
3815,-27.92
3816,-28.53
3817,-29.17
3818,-29.90
3819,-30.58
3820,-31.18
3821,-31.62
3822,-31.96
3823,-32.18
3824,-32.33
3825,-32.38
3826,-32.39
3827,-32.34
3828,-32.32
3829,-32.28
3830,-32.26
3831,-32.22
3832,-32.19
3833,-32.19
3834,-32.24
3835,-32.30
3836,-32.33
3837,-32.30
3838,-32.25
3839,-32.22
3840,-32.20
3841,-32.21
3842,-32.23
3843,-32.26
3844,-32.28
3845,-32.29
3846,-32.23
3847,-32.13
3848,-31.94
3849,-31.67
3850,-31.30
3851,-30.88
3852,-30.46
3853,-30.07
3854,-29.69
3855,-29.37
3856,-29.12
3857,-28.98
3858,-28.88
3859,-28.85
3860,-28.81
3861,-28.82
3862,-28.80
3863,-28.76
3864,-28.63
3865,-28.43
3866,-28.11
3867,-27.73
3868,-27.29
3869,-26.82
3870,-26.25
3871,-25.59
3872,-24.77
3873,-23.88
3874,-22.90
3875,-21.93
3876,-20.96
3877,-20.10
3878,-19.34
3879,-18.76
3880,-18.29
3881,-17.99
3882,-17.75
3883,-17.56
3884,-17.30
3885,-17.02
3886,-16.68
3887,-16.37
3888,-16.01
3889,-15.63
3890,-15.21
3891,-14.79
3892,-14.40
3893,-14.08
3894,-13.80
3895,-13.60
3896,-13.44
3897,-13.35
3898,-13.34
3899,-13.41
3900,-13.51
3901,-13.63
3902,-13.76
3903,-13.95
3904,-14.18
3905,-14.40
3906,-14.51
3907,-14.48
3908,-14.31
3909,-14.04
3910,-13.69
3911,-13.29
3912,-12.91
3913,-12.63
3914,-12.54
3915,-12.66
3916,-12.99
3917,-13.46
3918,-14.04
3919,-14.67
3920,-15.34
3921,-15.92
3922,-16.41
3923,-16.78
3924,-17.20
3925,-17.68
3926,-18.28
3927,-18.91
3928,-19.58
3929,-20.18
3930,-20.75
3931,-21.16
3932,-21.45
3933,-21.57
3934,-21.64
3935,-21.71
3936,-21.93
3937,-22.32
3938,-22.98
3939,-23.77
3940,-24.71
3941,-25.66
3942,-26.60
3943,-27.43
3944,-28.14
3945,-28.66
3946,-29.07
3947,-29.34
3948,-29.59
3949,-29.84
3950,-30.20
3951,-30.62
3952,-31.19
3953,-31.80
3954,-32.49
3955,-33.16
3956,-33.86
3957,-34.50
3958,-35.13
3959,-35.65
3960,-36.13
3961,-36.49
3962,-36.83
3963,-37.12
3964,-37.41
3965,-37.67
3966,-37.92
3967,-38.12
3968,-38.33
3969,-38.55
3970,-38.84
3971,-39.16
3972,-39.54
3973,-39.92
3974,-40.33
3975,-40.67
3976,-40.97
3977,-41.18
3978,-41.34
3979,-41.47
3980,-41.63
3981,-41.87
3982,-42.24
3983,-42.69
3984,-43.13
3985,-43.47
3986,-43.66
3987,-43.62
3988,-43.31
3989,-42.74
3990,-42.02
3991,-41.28
3992,-40.63
3993,-40.15
3994,-39.92
3995,-40.01
3996,-40.41
3997,-41.01
3998,-41.72
3999,-42.41
4000,-43.02
4001,-43.47
4002,-43.74
4003,-43.82
4004,-43.79
4005,-43.65
4006,-43.49
4007,-43.36
4008,-43.35
4009,-43.50
4010,-43.81
4011,-44.26
4012,-44.82
4013,-45.46
4014,-46.07
4015,-46.54
4016,-46.77
4017,-46.78
4018,-46.55
4019,-46.17
4020,-45.60
4021,-44.93
4022,-44.14
4023,-43.35
4024,-42.52
4025,-41.71
4026,-40.80
4027,-39.85
4028,-38.71
4029,-37.52
4030,-36.16
4031,-34.78
4032,-33.33
4033,-31.98
4034,-30.68
4035,-29.58
4036,-28.53
4037,-27.62
4038,-26.66
4039,-25.72
4040,-24.60
4041,-23.48
4042,-22.22
4043,-21.00
4044,-19.69
4045,-18.46
4046,-17.29
4047,-16.33
4048,-15.46
4049,-14.76
4050,-14.08
4051,-13.54
4052,-13.01
4053,-12.54
4054,-11.96
4055,-11.34
4056,-10.64
4057,-9.95
4058,-9.21
4059,-8.51
4060,-7.82
4061,-7.23
4062,-6.72
4063,-6.38
4064,-6.16
4065,-6.08
4066,-6.08
4067,-6.18
4068,-6.34
4069,-6.56
4070,-6.77
4071,-6.93
4072,-7.00
4073,-7.03
4074,-7.03
4075,-7.03
4076,-7.03
4077,-7.03
4078,-7.04
4079,-7.10
4080,-7.21
4081,-7.33
4082,-7.43
4083,-7.51
4084,-7.53
4085,-7.50
4086,-7.37
4087,-7.16
4088,-6.91
4089,-6.64
4090,-6.33
4091,-6.00
4092,-5.69
4093,-5.42
4094,-5.17
4095,-5.00
4096,-4.94
4097,-5.03
4098,-5.23
4099,-5.55
4100,-5.90
4101,-6.23
4102,-6.45
4103,-6.50
4104,-6.32
4105,-5.96
4106,-5.44
4107,-4.88
4108,-4.33
4109,-3.91
4110,-3.63
4111,-3.53
4112,-3.55
4113,-3.66
4114,-3.72
4115,-3.65
4116,-3.34
4117,-2.85
4118,-2.12
4119,-1.27
4120,-0.29
4121,0.68
4122,1.68
4123,2.59
4124,3.46
4125,4.21
4126,4.93
4127,5.53
4128,6.12
4129,6.63
4130,7.18
4131,7.70
4132,8.25
4133,8.74
4134,9.23
4135,9.63
4136,9.98
4137,10.21
4138,10.35
4139,10.40
4140,10.43
4141,10.44
4142,10.50
4143,10.61
4144,10.86
4145,11.22
4146,11.65
4147,12.08
4148,12.41
4149,12.53
4150,12.41
4151,12.12
4152,11.70
4153,11.24
4154,10.77
4155,10.37
4156,10.04
4157,9.82
4158,9.57
4159,9.28
4160,8.82
4161,8.24
4162,7.42
4163,6.50
4164,5.41
4165,4.33
4166,3.17
4167,2.06
4168,0.92
4169,-0.19
4170,-1.40
4171,-2.62
4172,-3.96
4173,-5.25
4174,-6.56
4175,-7.73
4176,-8.82
4177,-9.72
4178,-10.54
4179,-11.19
4180,-11.79
4181,-12.22
4182,-12.56
4183,-12.72
4184,-12.76
4185,-12.64
4186,-12.51
4187,-12.37
4188,-12.31
4189,-12.30
4190,-12.41
4191,-12.62
4192,-12.89
4193,-13.18
4194,-13.37
4195,-13.44
4196,-13.34
4197,-13.10
4198,-12.75
4199,-12.36
4200,-11.96
4201,-11.60
4202,-11.28
4203,-11.02
4204,-10.82
4205,-10.67
4206,-10.52
4207,-10.38
4208,-10.25
4209,-10.13
4210,-9.98
4211,-9.80
4212,-9.63
4213,-9.48
4214,-9.33
4215,-9.22
4216,-9.15
4217,-9.12
4218,-9.09
4219,-9.06
4220,-9.05
4221,-9.08
4222,-9.16
4223,-9.25
4224,-9.33
4225,-9.41
4226,-9.53
4227,-9.67
4228,-9.85
4229,-10.00
4230,-10.14
4231,-10.28
4232,-10.47
4233,-10.64
4234,-10.77
4235,-10.83
4236,-10.85
4237,-10.82
4238,-10.73
4239,-10.55
4240,-10.28
4241,-9.99
4242,-9.70
4243,-9.45
4244,-9.25
4245,-9.07
4246,-8.93
4247,-8.81
4248,-8.70
4249,-8.58
4250,-8.46
4251,-8.34
4252,-8.20
4253,-8.09
4254,-8.04
4255,-8.09
4256,-8.22
4257,-8.42
4258,-8.65
4259,-8.92
4260,-9.16
4261,-9.35
4262,-9.48
4263,-9.57
4264,-9.57
4265,-9.45
4266,-9.22
4267,-8.93
4268,-8.68
4269,-8.47
4270,-8.33
4271,-8.26
4272,-8.33
4273,-8.62
4274,-9.19
4275,-9.93
4276,-10.76
4277,-11.57
4278,-12.37
4279,-13.03
4280,-13.56
4281,-13.87
4282,-14.10
4283,-14.25
4284,-14.43
4285,-14.66
4286,-15.05
4287,-15.61
4288,-16.32
4289,-17.01
4290,-17.62
4291,-18.05
4292,-18.36
4293,-18.53
4294,-18.61
4295,-18.58
4296,-18.46
4297,-18.30
4298,-18.16
4299,-18.04
4300,-17.92
4301,-17.78
4302,-17.58
4303,-17.31
4304,-16.95
4305,-16.55
4306,-16.08
4307,-15.61
4308,-15.08
4309,-14.56
4310,-14.03
4311,-13.56
4312,-13.11
4313,-12.70
4314,-12.30
4315,-11.95
4316,-11.63
4317,-11.41
4318,-11.20
4319,-11.03
4320,-10.86
4321,-10.68
4322,-10.46
4323,-10.19
4324,-9.92
4325,-9.66
4326,-9.50
4327,-9.48
4328,-9.75
4329,-10.27
4330,-11.05
4331,-11.98
4332,-13.04
4333,-14.09
4334,-15.14
4335,-16.04
4336,-16.91
4337,-17.68
4338,-18.50
4339,-19.32
4340,-20.23
4341,-21.14
4342,-22.09
4343,-22.96
4344,-23.85
4345,-24.66
4346,-25.47
4347,-26.19
4348,-26.90
4349,-27.51
4350,-28.07
4351,-28.47
4352,-28.77
4353,-28.93
4354,-29.07
4355,-29.19
4356,-29.40
4357,-29.66
4358,-30.01
4359,-30.40
4360,-30.80
4361,-31.14
4362,-31.46
4363,-31.72
4364,-31.97
4365,-32.19
4366,-32.47
4367,-32.78
4368,-33.18
4369,-33.58
4370,-34.01
4371,-34.39
4372,-34.78
4373,-35.12
4374,-35.45
4375,-35.74
4376,-36.06
4377,-36.39
4378,-36.82
4379,-37.28
4380,-37.86
4381,-38.50
4382,-39.25
4383,-40.03
4384,-40.93
4385,-41.87
4386,-42.89
4387,-43.83
4388,-44.72
4389,-45.46
4390,-46.20
4391,-46.87
4392,-47.52
4393,-48.10
4394,-48.71
4395,-49.28
4396,-49.89
4397,-50.44
4398,-50.99
4399,-51.45
4400,-51.85
4401,-52.19
4402,-52.60
4403,-53.09
4404,-53.72
4405,-54.43
4406,-55.24
4407,-56.03
4408,-56.78
4409,-57.38
4410,-57.86
4411,-58.14
4412,-58.24
4413,-58.20
4414,-58.16
4415,-58.20
4416,-58.36
4417,-58.54
4418,-58.75
4419,-58.91
4420,-59.05
4421,-59.14
4422,-59.18
4423,-59.15
4424,-59.05
4425,-58.89
4426,-58.72
4427,-58.60
4428,-58.57
4429,-58.60
4430,-58.64
4431,-58.68
4432,-58.72
4433,-58.77
4434,-58.83
4435,-58.86
4436,-58.86
4437,-58.83
4438,-58.78
4439,-58.76
4440,-58.76
4441,-58.75
4442,-58.72
4443,-58.70
4444,-58.72
4445,-58.78
4446,-58.81
4447,-58.79
4448,-58.73
4449,-58.63
4450,-58.47
4451,-58.24
4452,-57.95
4453,-57.68
4454,-57.44
4455,-57.27
4456,-57.17
4457,-57.17
4458,-57.26
4459,-57.45
4460,-57.69
4461,-57.98
4462,-58.19
4463,-58.30
4464,-58.23
4465,-57.99
4466,-57.57
4467,-57.04
4468,-56.42
4469,-55.76
4470,-55.07
4471,-54.42
4472,-53.82
4473,-53.30
4474,-52.77
4475,-52.25
4476,-51.68
4477,-51.19
4478,-50.74
4479,-50.44
4480,-50.16
4481,-49.96
4482,-49.68
4483,-49.32
4484,-48.73
4485,-47.94
4486,-46.88
4487,-45.64
4488,-44.22
4489,-42.85
4490,-41.62
4491,-40.73
4492,-40.15
4493,-39.89
4494,-39.80
4495,-39.85
4496,-39.88
4497,-39.86
4498,-39.73
4499,-39.54
4500,-39.28
4501,-39.05
4502,-38.83
4503,-38.73
4504,-38.72
4505,-38.83
4506,-38.92
4507,-38.98
4508,-38.89
4509,-38.68
4510,-38.20
4511,-37.54
4512,-36.65
4513,-35.68
4514,-34.57
4515,-33.47
4516,-32.32
4517,-31.31
4518,-30.29
4519,-29.32
4520,-28.16
4521,-26.86
4522,-25.26
4523,-23.49
4524,-21.47
4525,-19.44
4526,-17.39
4527,-15.59
4528,-14.00
4529,-12.84
4530,-12.02
4531,-11.58
4532,-11.27
4533,-11.05
4534,-10.71
4535,-10.35
4536,-9.85
4537,-9.35
4538,-8.76
4539,-8.24
4540,-7.75
4541,-7.42
4542,-7.16
4543,-7.02
4544,-6.82
4545,-6.55
4546,-6.06
4547,-5.39
4548,-4.47
4549,-3.39
4550,-2.08
4551,-0.72
4552,0.69
4553,2.06
4554,3.41
4555,4.62
4556,5.67
4557,6.46
4558,7.09
4559,7.55
4560,7.92
4561,8.14
4562,8.28
4563,8.29
4564,8.24
4565,8.08
4566,7.85
4567,7.54
4568,7.22
4569,6.93
4570,6.76
4571,6.72
4572,6.85
4573,7.09
4574,7.43
4575,7.85
4576,8.33
4577,8.81
4578,9.23
4579,9.59
4580,9.94
4581,10.30
4582,10.62
4583,10.86
4584,11.02
4585,11.10
4586,11.13
4587,11.08
4588,10.90
4589,10.64
4590,10.31
4591,9.99
4592,9.63
4593,9.22
4594,8.71
4595,8.13
4596,7.44
4597,6.69
4598,5.90
4599,5.11
4600,4.39
4601,3.82
4602,3.48
4603,3.38
4604,3.50
4605,3.80
4606,4.30
4607,4.95
4608,5.73
4609,6.52
4610,7.36
4611,8.18
4612,9.03
4613,9.82
4614,10.64
4615,11.41
4616,12.28
4617,13.14
4618,14.12
4619,15.14
4620,16.30
4621,17.44
4622,18.59
4623,19.62
4624,20.61
4625,21.48
4626,22.26
4627,22.90
4628,23.53
4629,24.09
4630,24.68
4631,25.18
4632,25.63
4633,25.98
4634,26.25
4635,26.41
4636,26.54
4637,26.66
4638,26.79
4639,26.94
4640,27.08
4641,27.24
4642,27.40
4643,27.53
4644,27.51
4645,27.33
4646,26.94
4647,26.44
4648,25.77
4649,24.99
4650,24.03
4651,23.10
4652,22.14
4653,21.25
4654,20.26
4655,19.26
4656,18.10
4657,16.88
4658,15.46
4659,13.98
4660,12.31
4661,10.67
4662,8.96
4663,7.39
4664,5.85
4665,4.52
4666,3.21
4667,2.04
4668,0.78
4669,-0.43
4670,-1.75
4671,-3.03
4672,-4.39
4673,-5.64
4674,-6.87
4675,-7.94
4676,-8.97
4677,-9.83
4678,-10.66
4679,-11.37
4680,-12.09
4681,-12.76
4682,-13.45
4683,-14.02
4684,-14.53
4685,-14.85
4686,-15.15
4687,-15.38
4688,-15.72
4689,-16.11
4690,-16.66
4691,-17.30
4692,-18.07
4693,-18.87
4694,-19.69
4695,-20.39
4696,-21.00
4697,-21.42
4698,-21.78
4699,-22.08
4700,-22.46
4701,-22.88
4702,-23.45
4703,-24.06
4704,-24.77
4705,-25.44
4706,-26.10
4707,-26.68
4708,-27.27
4709,-27.80
4710,-28.38
4711,-28.97
4712,-29.65
4713,-30.31
4714,-30.98
4715,-31.61
4716,-32.25
4717,-32.83
4718,-33.32
4719,-33.65
4720,-33.87
4721,-34.00
4722,-34.07
4723,-34.00
4724,-33.86
4725,-33.63
4726,-33.38
4727,-33.13
4728,-32.97
4729,-32.92
4730,-32.94
4731,-33.04
4732,-33.18
4733,-33.38
4734,-33.53
4735,-33.65
4736,-33.62
4737,-33.49
4738,-33.16
4739,-32.68
4740,-31.94
4741,-31.07
4742,-30.01
4743,-28.86
4744,-27.55
4745,-26.23
4746,-24.89
4747,-23.68
4748,-22.51
4749,-21.48
4750,-20.45
4751,-19.54
4752,-18.55
4753,-17.60
4754,-16.56
4755,-15.56
4756,-14.43
4757,-13.37
4758,-12.25
4759,-11.24
4760,-10.19
4761,-9.19
4762,-8.07
4763,-7.00
4764,-5.87
4765,-4.89
4766,-3.95
4767,-3.17
4768,-2.45
4769,-1.91
4770,-1.46
4771,-1.17
4772,-0.86
4773,-0.56
4774,-0.14
4775,0.32
4776,0.88
4777,1.42
4778,2.03
4779,2.63
4780,3.32
4781,3.98
4782,4.68
4783,5.31
4784,5.97
4785,6.61
4786,7.31
4787,7.94
4788,8.57
4789,9.11
4790,9.71
4791,10.35
4792,11.09
4793,11.85
4794,12.67
4795,13.44
4796,14.15
4797,14.68
4798,15.05
4799,15.24
4800,15.34
4801,15.32
4802,15.27
4803,15.27
4804,15.38
4805,15.59
4806,15.82
4807,15.99
4808,16.01
4809,15.85
4810,15.38
4811,14.62
4812,13.53
4813,12.28
4814,10.93
4815,9.72
4816,8.64
4817,7.80
4818,7.07
4819,6.45
4820,5.76
4821,5.04
4822,4.18
4823,3.27
4824,2.29
4825,1.44
4826,0.74
4827,0.34
4828,0.16
4829,0.22
4830,0.37
4831,0.56
4832,0.57
4833,0.38
4834,-0.09
4835,-0.68
4836,-1.36
4837,-1.97
4838,-2.55
4839,-3.01
4840,-3.40
4841,-3.71
4842,-4.06
4843,-4.47
4844,-5.09
4845,-5.85
4846,-6.80
4847,-7.80
4848,-8.89
4849,-9.92
4850,-10.93
4851,-11.83
4852,-12.73
4853,-13.54
4854,-14.34
4855,-15.01
4856,-15.59
4857,-16.00
4858,-16.27
4859,-16.34
4860,-16.28
4861,-16.12
4862,-15.95
4863,-15.80
4864,-15.66
4865,-15.52
4866,-15.37
4867,-15.17
4868,-14.79
4869,-14.25
4870,-13.50
4871,-12.64
4872,-11.65
4873,-10.69
4874,-9.73
4875,-8.95
4876,-8.26
4877,-7.73
4878,-7.19
4879,-6.66
4880,-5.93
4881,-5.01
4882,-3.75
4883,-2.30
4884,-0.67
4885,0.87
4886,2.27
4887,3.35
4888,4.20
4889,4.77
4890,5.20
4891,5.49
4892,5.84
4893,6.26
4894,6.88
4895,7.58
4896,8.35
4897,9.00
4898,9.51
4899,9.80
4900,9.92
4901,9.87
4902,9.76
4903,9.62
4904,9.58
4905,9.70
4906,9.96
4907,10.33
4908,10.73
4909,11.10
4910,11.38
4911,11.54
4912,11.48
4913,11.22
4914,10.75
4915,10.15
4916,9.47
4917,8.81
4918,8.24
4919,7.80
4920,7.44
4921,7.16
4922,6.87
4923,6.58
4924,6.24
4925,5.92
4926,5.63
4927,5.42
4928,5.27
4929,5.23
4930,5.28
4931,5.37
4932,5.38
4933,5.25
4934,4.96
4935,4.56
4936,4.07
4937,3.56
4938,3.14
4939,2.86
4940,2.72
4941,2.70
4942,2.78
4943,2.93
4944,3.11
4945,3.22
4946,3.27
4947,3.30
4948,3.35
4949,3.50
4950,3.78
4951,4.19
4952,4.73
4953,5.36
4954,6.07
4955,6.75
4956,7.36
4957,7.77
4958,8.00
4959,8.00
4960,7.90
4961,7.73
4962,7.64
4963,7.68
4964,7.96
4965,8.45
4966,9.19
4967,10.06
4968,10.99
4969,11.83
4970,12.49
4971,12.90
4972,13.11
4973,13.12
4974,13.03
4975,12.89
4976,12.86
4977,12.95
4978,13.26
4979,13.73
4980,14.40
4981,15.14
4982,15.89
4983,16.52
4984,17.00
4985,17.26
4986,17.28
4987,17.07
4988,16.72
4989,16.31
4990,15.94
4991,15.64
4992,15.44
4993,15.37
4994,15.36
4995,15.37
4996,15.31
4997,15.16
4998,14.81
4999,14.34
5000,13.73
5001,13.08
5002,12.40
5003,11.76
5004,11.09
5005,10.47
5006,9.77
5007,9.12
5008,8.38
5009,7.60
5010,6.65
5011,5.63
5012,4.46
5013,3.27
5014,1.92
5015,0.55
5016,-0.92
5017,-2.30
5018,-3.65
5019,-4.88
5020,-6.08
5021,-7.10
5022,-8.03
5023,-8.73
5024,-9.37
5025,-9.83
5026,-10.28
5027,-10.67
5028,-11.17
5029,-11.73
5030,-12.48
5031,-13.33
5032,-14.33
5033,-15.30
5034,-16.24
5035,-17.03
5036,-17.73
5037,-18.26
5038,-18.75
5039,-19.14
5040,-19.60
5041,-20.08
5042,-20.66
5043,-21.24
5044,-21.88
5045,-22.46
5046,-23.01
5047,-23.45
5048,-23.84
5049,-24.15
5050,-24.45
5051,-24.74
5052,-25.06
5053,-25.39
5054,-25.69
5055,-25.91
5056,-26.02
5057,-25.98
5058,-25.80
5059,-25.53
5060,-25.23
5061,-24.96
5062,-24.71
5063,-24.48
5064,-24.24
5065,-24.01
5066,-23.72
5067,-23.34
5068,-22.85
5069,-22.34
5070,-21.86
5071,-21.50
5072,-21.27
5073,-21.19
5074,-21.23
5075,-21.39
5076,-21.58
5077,-21.75
5078,-21.80
5079,-21.68
5080,-21.39
5081,-21.02
5082,-20.66
5083,-20.42
5084,-20.36
5085,-20.48
5086,-20.76
5087,-21.16
5088,-21.61
5089,-22.03
5090,-22.33
5091,-22.43
5092,-22.32
5093,-22.00
5094,-21.55
5095,-21.03
5096,-20.57
5097,-20.26
5098,-20.14
5099,-20.17
5100,-20.34
5101,-20.65
5102,-21.06
5103,-21.48
5104,-21.81
5105,-22.00
5106,-22.06
5107,-22.09
5108,-22.07
5109,-22.04
5110,-22.04
5111,-22.09
5112,-22.21
5113,-22.34
5114,-22.45
5115,-22.50
5116,-22.51
5117,-22.48
5118,-22.42
5119,-22.32
5120,-22.21
5121,-22.08
5122,-21.98
5123,-21.89
5124,-21.81
5125,-21.75
5126,-21.73
5127,-21.75
5128,-21.84
5129,-22.02
5130,-22.29
5131,-22.62
5132,-22.97
5133,-23.29
5134,-23.61
5135,-23.90
5136,-24.19
5137,-24.42
5138,-24.64
5139,-24.80
5140,-24.95
5141,-25.07
5142,-25.18
5143,-25.28
5144,-25.31
5145,-25.28
5146,-25.22
5147,-25.15
5148,-25.12
5149,-25.09
5150,-25.02
5151,-24.95
5152,-24.84
5153,-24.70
5154,-24.44
5155,-24.07
5156,-23.57
5157,-23.03
5158,-22.45
5159,-21.90
5160,-21.35
5161,-20.88
5162,-20.46
5163,-20.16
5164,-19.89
5165,-19.67
5166,-19.37
5167,-19.04
5168,-18.60
5169,-18.14
5170,-17.59
5171,-17.04
5172,-16.43
5173,-15.88
5174,-15.32
5175,-14.81
5176,-14.26
5177,-13.74
5178,-13.18
5179,-12.66
5180,-12.12
5181,-11.56
5182,-10.93
5183,-10.32
5184,-9.71
5185,-9.18
5186,-8.66
5187,-8.20
5188,-7.79
5189,-7.46
5190,-7.16
5191,-6.90
5192,-6.70
5193,-6.60
5194,-6.61
5195,-6.74
5196,-6.99
5197,-7.38
5198,-7.88
5199,-8.45
5200,-9.08
5201,-9.73
5202,-10.42
5203,-11.10
5204,-11.76
5205,-12.36
5206,-12.89
5207,-13.28
5208,-13.50
5209,-13.52
5210,-13.40
5211,-13.18
5212,-12.92
5213,-12.63
5214,-12.39
5215,-12.21
5216,-12.13
5217,-12.13
5218,-12.18
5219,-12.25
5220,-12.31
5221,-12.34
5222,-12.30
5223,-12.15
5224,-11.88
5225,-11.49
5226,-11.02
5227,-10.50
5228,-9.99
5229,-9.54
5230,-9.19
5231,-8.92
5232,-8.72
5233,-8.61
5234,-8.58
5235,-8.64
5236,-8.74
5237,-8.87
5238,-9.01
5239,-9.16
5240,-9.28
5241,-9.35
5242,-9.35
5243,-9.26
5244,-9.05
5245,-8.72
5246,-8.34
5247,-8.00
5248,-7.75
5249,-7.61
5250,-7.55
5251,-7.53
5252,-7.46
5253,-7.29
5254,-6.97
5255,-6.56
5256,-6.07
5257,-5.59
5258,-5.14
5259,-4.79
5260,-4.54
5261,-4.40
5262,-4.31
5263,-4.27
5264,-4.19
5265,-4.08
5266,-3.88
5267,-3.66
5268,-3.38
5269,-3.09
5270,-2.73
5271,-2.37
5272,-1.97
5273,-1.59
5274,-1.16
5275,-0.73
5276,-0.25
5277,0.22
5278,0.72
5279,1.21
5280,1.74
5281,2.26
5282,2.87
5283,3.48
5284,4.12
5285,4.68
5286,5.19
5287,5.62
5288,6.03
5289,6.39
5290,6.69
5291,6.88
5292,7.03
5293,7.13
5294,7.29
5295,7.52
5296,7.84
5297,8.17
5298,8.49
5299,8.78
5300,9.08
5301,9.35
5302,9.56
5303,9.64
5304,9.59
5305,9.41
5306,9.15
5307,8.84
5308,8.51
5309,8.19
5310,7.90
5311,7.73
5312,7.64
5313,7.65
5314,7.71
5315,7.77
5316,7.80
5317,7.77
5318,7.66
5319,7.48
5320,7.23
5321,6.90
5322,6.52
5323,6.16
5324,5.83
5325,5.60
5326,5.48
5327,5.49
5328,5.55
5329,5.63
5330,5.64
5331,5.58
5332,5.44
5333,5.23
5334,4.98
5335,4.74
5336,4.54
5337,4.46
5338,4.49
5339,4.61
5340,4.74
5341,4.78
5342,4.68
5343,4.44
5344,4.06
5345,3.65
5346,3.26
5347,3.00
5348,2.85
5349,2.86
5350,3.01
5351,3.25
5352,3.49
5353,3.65
5354,3.66
5355,3.55
5356,3.30
5357,2.95
5358,2.47
5359,1.94
5360,1.40
5361,0.92
5362,0.49
5363,0.18
5364,0.00
5365,0.00
5366,0.11
5367,0.29
5368,0.40
5369,0.41
5370,0.22
5371,-0.12
5372,-0.62
5373,-1.16
5374,-1.72
5375,-2.18
5376,-2.53
5377,-2.74
5378,-2.86
5379,-2.95
5380,-3.14
5381,-3.43
5382,-3.90
5383,-4.49
5384,-5.17
5385,-5.85
5386,-6.52
5387,-7.08
5388,-7.51
5389,-7.77
5390,-7.95
5391,-8.08
5392,-8.22
5393,-8.33
5394,-8.49
5395,-8.68
5396,-8.94
5397,-9.24
5398,-9.59
5399,-9.91
5400,-10.19
5401,-10.39
5402,-10.56
5403,-10.67
5404,-10.74
5405,-10.74
5406,-10.70
5407,-10.66
5408,-10.67
5409,-10.74
5410,-10.83
5411,-10.89
5412,-10.89
5413,-10.84
5414,-10.73
5415,-10.57
5416,-10.25
5417,-9.85
5418,-9.35
5419,-8.81
5420,-8.21
5421,-7.57
5422,-6.85
5423,-6.14
5424,-5.42
5425,-4.75
5426,-4.10
5427,-3.58
5428,-3.14
5429,-2.83
5430,-2.56
5431,-2.30
5432,-1.97
5433,-1.59
5434,-1.14
5435,-0.65
5436,-0.05
5437,0.57
5438,1.17
5439,1.63
5440,1.91
5441,2.02
5442,1.99
5443,1.84
5444,1.61
5445,1.37
5446,1.17
5447,1.05
5448,0.96
5449,0.85
5450,0.67
5451,0.40
5452,0.03
5453,-0.44
5454,-1.03
5455,-1.66
5456,-2.27
5457,-2.75
5458,-3.05
5459,-3.14
5460,-3.04
5461,-2.83
5462,-2.56
5463,-2.27
5464,-2.08
5465,-2.01
5466,-2.11
5467,-2.32
5468,-2.57
5469,-2.79
5470,-2.93
5471,-2.97
5472,-2.86
5473,-2.63
5474,-2.24
5475,-1.77
5476,-1.23
5477,-0.73
5478,-0.27
5479,0.14
5480,0.56
5481,0.97
5482,1.39
5483,1.83
5484,2.37
5485,2.95
5486,3.56
5487,4.07
5488,4.47
5489,4.67
5490,4.67
5491,4.49
5492,4.21
5493,3.92
5494,3.68
5495,3.55
5496,3.52
5497,3.59
5498,3.64
5499,3.63
5500,3.51
5501,3.30
5502,2.96
5503,2.55
5504,2.11
5505,1.72
5506,1.37
5507,1.08
5508,0.82
5509,0.56
5510,0.24
5511,-0.11
5512,-0.50
5513,-0.88
5514,-1.29
5515,-1.66
5516,-2.02
5517,-2.30
5518,-2.58
5519,-2.86
5520,-3.24
5521,-3.68
5522,-4.20
5523,-4.73
5524,-5.30
5525,-5.82
5526,-6.30
5527,-6.68
5528,-7.03
5529,-7.34
5530,-7.66
5531,-8.01
5532,-8.48
5533,-9.03
5534,-9.68
5535,-10.30
5536,-10.90
5537,-11.40
5538,-11.80
5539,-12.02
5540,-12.15
5541,-12.21
5542,-12.34
5543,-12.53
5544,-12.88
5545,-13.34
5546,-13.93
5547,-14.56
5548,-15.21
5549,-15.80
5550,-16.32
5551,-16.72
5552,-17.09
5553,-17.40
5554,-17.72
5555,-18.00
5556,-18.31
5557,-18.60
5558,-18.90
5559,-19.15
5560,-19.42
5561,-19.68
5562,-19.96
5563,-20.19
5564,-20.42
5565,-20.65
5566,-20.92
5567,-21.22
5568,-21.51
5569,-21.78
5570,-22.03
5571,-22.26
5572,-22.48
5573,-22.64
5574,-22.72
5575,-22.71
5576,-22.64
5577,-22.51
5578,-22.38
5579,-22.26
5580,-22.15
5581,-22.06
5582,-22.02
5583,-22.02
5584,-22.01
5585,-21.95
5586,-21.85
5587,-21.77
5588,-21.70
5589,-21.68
5590,-21.67
5591,-21.71
5592,-21.77
5593,-21.83
5594,-21.82
5595,-21.71
5596,-21.51
5597,-21.23
5598,-20.87
5599,-20.48
5600,-20.14
5601,-19.92
5602,-19.86
5603,-19.92
5604,-20.09
5605,-20.33
5606,-20.61
5607,-20.92
5608,-21.22
5609,-21.48
5610,-21.73
5611,-21.93
5612,-22.11
5613,-22.25
5614,-22.37
5615,-22.47
5616,-22.54
5617,-22.61
5618,-22.64
5619,-22.64
5620,-22.61
5621,-22.55
5622,-22.43
5623,-22.23
5624,-21.93
5625,-21.55
5626,-21.05
5627,-20.52
5628,-20.00
5629,-19.55
5630,-19.13
5631,-18.77
5632,-18.39
5633,-18.05
5634,-17.66
5635,-17.25
5636,-16.78
5637,-16.28
5638,-15.73
5639,-15.17
5640,-14.57
5641,-13.98
5642,-13.40
5643,-12.90
5644,-12.46
5645,-12.14
5646,-11.93
5647,-11.86
5648,-11.83
5649,-11.84
5650,-11.85
5651,-11.86
5652,-11.80
5653,-11.66
5654,-11.41
5655,-11.12
5656,-10.78
5657,-10.44
5658,-10.15
5659,-9.93
5660,-9.86
5661,-9.93
5662,-10.06
5663,-10.22
5664,-10.38
5665,-10.49
5666,-10.54
5667,-10.51
5668,-10.46
5669,-10.45
5670,-10.53
5671,-10.70
5672,-10.99
5673,-11.35
5674,-11.77
5675,-12.19
5676,-12.57
5677,-12.88
5678,-13.08
5679,-13.16
5680,-13.15
5681,-13.05
5682,-12.92
5683,-12.76
5684,-12.61
5685,-12.46
5686,-12.32
5687,-12.21
5688,-12.11
5689,-11.99
5690,-11.82
5691,-11.60
5692,-11.38
5693,-11.17
5694,-10.98
5695,-10.83
5696,-10.74
5697,-10.77
5698,-10.92
5699,-11.13
5700,-11.38
5701,-11.64
5702,-11.96
5703,-12.31
5704,-12.70
5705,-13.09
5706,-13.47
5707,-13.83
5708,-14.17
5709,-14.43
5710,-14.61
5711,-14.67
5712,-14.63
5713,-14.50
5714,-14.32
5715,-14.11
5716,-13.89
5717,-13.67
5718,-13.50
5719,-13.34
5720,-13.20
5721,-13.08
5722,-13.02
5723,-13.02
5724,-13.04
5725,-13.08
5726,-13.17
5727,-13.31
5728,-13.47
5729,-13.64
5730,-13.78
5731,-13.90
5732,-13.95
5733,-13.94
5734,-13.82
5735,-13.62
5736,-13.28
5737,-12.90
5738,-12.50
5739,-12.15
5740,-11.78
5741,-11.41
5742,-11.00
5743,-10.64
5744,-10.22
5745,-9.80
5746,-9.25
5747,-8.67
5748,-8.00
5749,-7.29
5750,-6.52
5751,-5.76
5752,-4.98
5753,-4.24
5754,-3.51
5755,-2.89
5756,-2.40
5757,-2.11
5758,-1.96
5759,-1.95
5760,-1.99
5761,-2.07
5762,-2.09
5763,-2.08
5764,-1.98
5765,-1.83
5766,-1.63
5767,-1.42
5768,-1.22
5769,-1.10
5770,-1.08
5771,-1.11
5772,-1.14
5773,-1.14
5774,-1.13
5775,-1.13
5776,-1.13
5777,-1.14
5778,-1.15
5779,-1.17
5780,-1.21
5781,-1.24
5782,-1.27
5783,-1.27
5784,-1.22
5785,-1.13
5786,-1.03
5787,-0.95
5788,-0.86
5789,-0.77
5790,-0.68
5791,-0.61
5792,-0.60
5793,-0.63
5794,-0.69
5795,-0.76
5796,-0.82
5797,-0.88
5798,-0.92
5799,-0.93
5800,-0.86
5801,-0.74
5802,-0.59
5803,-0.44
5804,-0.30
5805,-0.14
5806,0.02
5807,0.16
5808,0.30
5809,0.45
5810,0.63
5811,0.77
5812,0.83
5813,0.78
5814,0.63
5815,0.38
5816,0.05
5817,-0.29
5818,-0.53
5819,-0.56
5820,-0.37
5821,-0.01
5822,0.47
5823,0.96
5824,1.39
5825,1.66
5826,1.73
5827,1.63
5828,1.44
5829,1.22
5830,1.04
5831,0.95
5832,0.99
5833,1.17
5834,1.43
5835,1.72
5836,1.97
5837,2.11
5838,2.11
5839,2.02
5840,1.91
5841,1.82
5842,1.71
5843,1.63
5844,1.63
5845,1.72
5846,1.81
5847,1.82
5848,1.75
5849,1.63
5850,1.43
5851,1.17
5852,0.85
5853,0.56
5854,0.27
5855,0.05
5856,-0.17
5857,-0.34
5858,-0.51
5859,-0.71
5860,-1.02
5861,-1.43
5862,-1.92
5863,-2.43
5864,-2.96
5865,-3.46
5866,-3.91
5867,-4.23
5868,-4.45
5869,-4.55
5870,-4.64
5871,-4.71
5872,-4.83
5873,-5.00
5874,-5.30
5875,-5.71
5876,-6.22
5877,-6.76
5878,-7.31
5879,-7.80
5880,-8.27
5881,-8.65
5882,-8.96
5883,-9.16
5884,-9.29
5885,-9.38
5886,-9.47
5887,-9.54
5888,-9.61
5889,-9.67
5890,-9.78
5891,-9.92
5892,-10.09
5893,-10.24
5894,-10.38
5895,-10.53
5896,-10.67
5897,-10.79
5898,-10.90
5899,-10.99
5900,-11.04
5901,-11.04
5902,-10.99
5903,-10.89
5904,-10.77
5905,-10.60
5906,-10.48
5907,-10.42
5908,-10.44
5909,-10.54
5910,-10.67
5911,-10.85
5912,-11.09
5913,-11.38
5914,-11.72
5915,-12.05
5916,-12.37
5917,-12.63
5918,-12.83
5919,-12.92
5920,-12.93
5921,-12.88
5922,-12.86
5923,-12.91
5924,-13.12
5925,-13.47
5926,-13.94
5927,-14.45
5928,-14.98
5929,-15.46
5930,-15.82
5931,-16.00
5932,-16.03
5933,-15.93
5934,-15.73
5935,-15.46
5936,-15.17
5937,-14.87
5938,-14.55
5939,-14.26
5940,-14.02
5941,-13.83
5942,-13.66
5943,-13.52
5944,-13.44
5945,-13.44
5946,-13.50
5947,-13.60
5948,-13.69
5949,-13.82
5950,-13.94
5951,-14.02
5952,-13.95
5953,-13.75
5954,-13.42
5955,-13.07
5956,-12.67
5957,-12.30
5958,-11.90
5959,-11.49
5960,-11.01
5961,-10.48
5962,-9.87
5963,-9.19
5964,-8.41
5965,-7.61
5966,-6.82
5967,-6.16
5968,-5.65
5969,-5.33
5970,-5.20
5971,-5.29
5972,-5.56
5973,-5.93
5974,-6.31
5975,-6.67
5976,-7.02
5977,-7.37
5978,-7.74
5979,-8.11
5980,-8.55
5981,-9.08
5982,-9.78
5983,-10.54
5984,-11.35
5985,-12.12
5986,-12.90
5987,-13.63
5988,-14.34
5989,-14.95
5990,-15.56
5991,-16.13
5992,-16.75
5993,-17.36
5994,-18.02
5995,-18.60
5996,-19.14
5997,-19.58
5998,-19.97
5999,-20.28
6000,-20.57
6001,-20.80
6002,-21.02
6003,-21.22
6004,-21.42
6005,-21.58
6006,-21.64
6007,-21.61
6008,-21.48
6009,-21.24
6010,-20.90
6011,-20.48
6012,-20.00
6013,-19.53
6014,-19.07
6015,-18.65
6016,-18.29
6017,-17.99
6018,-17.73
6019,-17.54
6020,-17.36
6021,-17.19
6022,-16.97
6023,-16.71
6024,-16.40
6025,-16.07
6026,-15.72
6027,-15.43
6028,-15.21
6029,-15.06
6030,-14.94
6031,-14.83
6032,-14.69
6033,-14.55
6034,-14.38
6035,-14.24
6036,-14.13
6037,-14.07
6038,-14.05
6039,-14.08
6040,-14.18
6041,-14.33
6042,-14.48
6043,-14.60
6044,-14.71
6045,-14.82
6046,-14.95
6047,-15.08
6048,-15.17
6049,-15.24
6050,-15.27
6051,-15.27
6052,-15.24
6053,-15.17
6054,-15.08
6055,-14.99
6056,-14.92
6057,-14.86
6058,-14.79
6059,-14.69
6060,-14.49
6061,-14.20
6062,-13.77
6063,-13.31
6064,-12.81
6065,-12.36
6066,-11.94
6067,-11.60
6068,-11.30
6069,-11.07
6070,-10.83
6071,-10.58
6072,-10.26
6073,-9.90
6074,-9.50
6075,-9.07
6076,-8.66
6077,-8.34
6078,-8.13
6079,-8.08
6080,-8.14
6081,-8.29
6082,-8.51
6083,-8.79
6084,-9.05
6085,-9.27
6086,-9.44
6087,-9.57
6088,-9.72
6089,-9.90
6090,-10.12
6091,-10.36
6092,-10.60
6093,-10.80
6094,-11.00
6095,-11.20
6096,-11.45
6097,-11.74
6098,-12.09
6099,-12.51
6100,-13.01
6101,-13.52
6102,-13.98
6103,-14.28
6104,-14.38
6105,-14.26
6106,-13.93
6107,-13.45
6108,-12.87
6109,-12.28
6110,-11.67
6111,-11.14
6112,-10.70
6113,-10.37
6114,-10.13
6115,-9.96
6116,-9.80
6117,-9.66
6118,-9.51
6119,-9.40
6120,-9.31
6121,-9.23
6122,-9.09
6123,-8.92
6124,-8.72
6125,-8.51
6126,-8.26
6127,-8.00
6128,-7.74
6129,-7.57
6130,-7.47
6131,-7.45
6132,-7.46
6133,-7.49
6134,-7.52
6135,-7.48
6136,-7.38
6137,-7.19
6138,-6.97
6139,-6.75
6140,-6.58
6141,-6.52
6142,-6.65
6143,-6.96
6144,-7.45
6145,-8.05
6146,-8.78
6147,-9.55
6148,-10.30
6149,-10.89
6150,-11.35
6151,-11.66
6152,-11.91
6153,-12.10
6154,-12.34
6155,-12.61
6156,-13.05
6157,-13.57
6158,-14.19
6159,-14.78
6160,-15.33
6161,-15.70
6162,-15.94
6163,-16.00
6164,-16.02
6165,-16.05
6166,-16.25
6167,-16.62
6168,-17.26
6169,-18.11
6170,-19.21
6171,-20.40
6172,-21.62
6173,-22.68
6174,-23.60
6175,-24.31
6176,-24.86
6177,-25.23
6178,-25.49
6179,-25.66
6180,-25.83
6181,-26.00
6182,-26.17
6183,-26.27
6184,-26.25
6185,-26.11
6186,-25.80
6187,-25.35
6188,-24.76
6189,-24.09
6190,-23.31
6191,-22.51
6192,-21.68
6193,-20.92
6194,-20.21
6195,-19.63
6196,-19.10
6197,-18.67
6198,-18.27
6199,-17.97
6200,-17.62
6201,-17.23
6202,-16.69
6203,-16.08
6204,-15.37
6205,-14.63
6206,-13.82
6207,-13.05
6208,-12.35
6209,-11.84
6210,-11.42
6211,-11.11
6212,-10.81
6213,-10.60
6214,-10.38
6215,-10.13
6216,-9.71
6217,-9.20
6218,-8.58
6219,-7.93
6220,-7.18
6221,-6.42
6222,-5.65
6223,-4.97
6224,-4.33
6225,-3.75
6226,-3.20
6227,-2.76
6228,-2.37
6229,-2.04
6230,-1.64
6231,-1.24
6232,-0.80
6233,-0.39
6234,0.03
6235,0.43
6236,0.85
6237,1.24
6238,1.59
6239,1.82
6240,1.95
6241,1.97
6242,1.95
6243,1.88
6244,1.77
6245,1.62
6246,1.48
6247,1.38
6248,1.34
6249,1.34
6250,1.40
6251,1.52
6252,1.67
6253,1.85
6254,2.06
6255,2.29
6256,2.55
6257,2.76
6258,2.91
6259,2.95
6260,2.95
6261,2.95
6262,3.01
6263,3.11
6264,3.30
6265,3.53
6266,3.84
6267,4.14
6268,4.36
6269,4.45
6270,4.44
6271,4.33
6272,4.20
6273,4.07
6274,4.04
6275,4.14
6276,4.44
6277,4.89
6278,5.48
6279,6.07
6280,6.61
6281,7.03
6282,7.38
6283,7.66
6284,7.91
6285,8.13
6286,8.41
6287,8.70
6288,9.00
6289,9.25
6290,9.43
6291,9.54
6292,9.57
6293,9.54
6294,9.48
6295,9.41
6296,9.41
6297,9.47
6298,9.57
6299,9.67
6300,9.68
6301,9.60
6302,9.40
6303,9.12
6304,8.79
6305,8.46
6306,8.19
6307,7.98
6308,7.81
6309,7.69
6310,7.65
6311,7.75
6312,7.95
6313,8.20
6314,8.45
6315,8.70
6316,8.90
6317,9.03
6318,8.98
6319,8.72
6320,8.26
6321,7.65
6322,6.94
6323,6.20
6324,5.46
6325,4.84
6326,4.33
6327,3.97
6328,3.66
6329,3.40
6330,3.11
6331,2.82
6332,2.53
6333,2.27
6334,1.98
6335,1.74
6336,1.49
6337,1.27
6338,0.95
6339,0.56
6340,0.00
6341,-0.65
6342,-1.41
6343,-2.17
6344,-2.94
6345,-3.59
6346,-4.15
6347,-4.61
6348,-5.04
6349,-5.45
6350,-5.89
6351,-6.36
6352,-6.90
6353,-7.45
6354,-8.03
6355,-8.57
6356,-9.07
6357,-9.48
6358,-9.80
6359,-10.03
6360,-10.23
6361,-10.44
6362,-10.67
6363,-10.91
6364,-11.14
6365,-11.31
6366,-11.42
6367,-11.45
6368,-11.41
6369,-11.28
6370,-11.09
6371,-10.83
6372,-10.63
6373,-10.50
6374,-10.48
6375,-10.57
6376,-10.79
6377,-11.09
6378,-11.42
6379,-11.75
6380,-12.07
6381,-12.36
6382,-12.63
6383,-12.84
6384,-13.00
6385,-13.11
6386,-13.21
6387,-13.27
6388,-13.28
6389,-13.25
6390,-13.19
6391,-13.10
6392,-12.98
6393,-12.83
6394,-12.68
6395,-12.55
6396,-12.46
6397,-12.40
6398,-12.38
6399,-12.41
6400,-12.48
6401,-12.60
6402,-12.79
6403,-13.05
6404,-13.40
6405,-13.78
6406,-14.22
6407,-14.69
6408,-15.21
6409,-15.74
6410,-16.27
6411,-16.71
6412,-17.07
6413,-17.30
6414,-17.45
6415,-17.55
6416,-17.70
6417,-17.89
6418,-18.18
6419,-18.53
6420,-19.00
6421,-19.57
6422,-20.20
6423,-20.76
6424,-21.24
6425,-21.58
6426,-21.87
6427,-22.09
6428,-22.34
6429,-22.64
6430,-23.00
6431,-23.38
6432,-23.74
6433,-23.98
6434,-24.09
6435,-24.06
6436,-23.91
6437,-23.65
6438,-23.38
6439,-23.20
6440,-23.16
6441,-23.26
6442,-23.41
6443,-23.54
6444,-23.57
6445,-23.48
6446,-23.27
6447,-22.97
6448,-22.62
6449,-22.29
6450,-22.02
6451,-21.87
6452,-21.84
6453,-21.84
6454,-21.80
6455,-21.70
6456,-21.53
6457,-21.33
6458,-21.13
6459,-21.00
6460,-20.96
6461,-21.04
6462,-21.21
6463,-21.40
6464,-21.59
6465,-21.76
6466,-21.90
6467,-22.03
6468,-22.16
6469,-22.30
6470,-22.46
6471,-22.61
6472,-22.76
6473,-22.87
6474,-22.94
6475,-22.93
6476,-22.87
6477,-22.75
6478,-22.60
6479,-22.44
6480,-22.35
6481,-22.37
6482,-22.54
6483,-22.80
6484,-23.12
6485,-23.46
6486,-23.80
6487,-24.09
6488,-24.31
6489,-24.44
6490,-24.51
6491,-24.56
6492,-24.61
6493,-24.67
6494,-24.76
6495,-24.85
6496,-24.90
6497,-24.88
6498,-24.75
6499,-24.51
6500,-24.17
6501,-23.81
6502,-23.47
6503,-23.21
6504,-22.99
6505,-22.79
6506,-22.58
6507,-22.35
6508,-22.06
6509,-21.77
6510,-21.45
6511,-21.16
6512,-20.87
6513,-20.65
6514,-20.45
6515,-20.26
6516,-19.98
6517,-19.63
6518,-19.18
6519,-18.68
6520,-18.10
6521,-17.54
6522,-17.03
6523,-16.67
6524,-16.48
6525,-16.49
6526,-16.64
6527,-16.87
6528,-17.06
6529,-17.16
6530,-17.11
6531,-16.94
6532,-16.62
6533,-16.21
6534,-15.68
6535,-15.15
6536,-14.68
6537,-14.33
6538,-14.04
6539,-13.82
6540,-13.61
6541,-13.44
6542,-13.22
6543,-12.94
6544,-12.54
6545,-12.08
6546,-11.49
6547,-10.84
6548,-10.12
6549,-9.45
6550,-8.80
6551,-8.20
6552,-7.63
6553,-7.10
6554,-6.61
6555,-6.23
6556,-5.93
6557,-5.78
6558,-5.80
6559,-5.99
6560,-6.29
6561,-6.62
6562,-6.94
6563,-7.20
6564,-7.44
6565,-7.64
6566,-7.82
6567,-7.97
6568,-8.13
6569,-8.33
6570,-8.60
6571,-8.93
6572,-9.33
6573,-9.74
6574,-10.15
6575,-10.54
6576,-10.91
6577,-11.24
6578,-11.49
6579,-11.61
6580,-11.60
6581,-11.51
6582,-11.37
6583,-11.15
6584,-10.86
6585,-10.54
6586,-10.23
6587,-9.96
6588,-9.68
6589,-9.43
6590,-9.21
6591,-9.03
6592,-8.81
6593,-8.56
6594,-8.26
6595,-8.00
6596,-7.72
6597,-7.47
6598,-7.21
6599,-6.98
6600,-6.71
6601,-6.40
6602,-5.98
6603,-5.50
6604,-4.98
6605,-4.50
6606,-4.10
6607,-3.84
6608,-3.71
6609,-3.72
6610,-3.81
6611,-3.97
6612,-4.14
6613,-4.23
6614,-4.19
6615,-4.04
6616,-3.83
6617,-3.65
6618,-3.51
6619,-3.39
6620,-3.29
6621,-3.20
6622,-3.13
6623,-3.01
6624,-2.78
6625,-2.49
6626,-2.18
6627,-1.93
6628,-1.77
6629,-1.75
6630,-1.89
6631,-2.16
6632,-2.47
6633,-2.78
6634,-3.07
6635,-3.33
6636,-3.55
6637,-3.70
6638,-3.82
6639,-3.94
6640,-4.04
6641,-4.10
6642,-4.12
6643,-4.08
6644,-4.03
6645,-3.97
6646,-3.93
6647,-3.94
6648,-3.95
6649,-3.96
6650,-3.91
6651,-3.83
6652,-3.68
6653,-3.48
6654,-3.20
6655,-2.86
6656,-2.53
6657,-2.25
6658,-2.08
6659,-2.03
6660,-2.04
6661,-2.08
6662,-2.10
6663,-2.11
6664,-2.08
6665,-2.02
6666,-1.91
6667,-1.79
6668,-1.69
6669,-1.64
6670,-1.57
6671,-1.46
6672,-1.29
6673,-1.08
6674,-0.82
6675,-0.52
6676,-0.19
6677,0.11
6678,0.31
6679,0.37
6680,0.31
6681,0.12
6682,-0.14
6683,-0.43
6684,-0.74
6685,-1.01
6686,-1.25
6687,-1.43
6688,-1.55
6689,-1.63
6690,-1.73
6691,-1.88
6692,-2.09
6693,-2.33
6694,-2.56
6695,-2.75
6696,-2.85
6697,-2.86
6698,-2.75
6699,-2.54
6700,-2.22
6701,-1.85
6702,-1.39
6703,-0.88
6704,-0.31
6705,0.24
6706,0.80
6707,1.33
6708,1.88
6709,2.44
6710,3.01
6711,3.51
6712,3.97
6713,4.34
6714,4.68
6715,4.94
6716,5.14
6717,5.25
6718,5.34
6719,5.39
6720,5.45
6721,5.49
6722,5.58
6723,5.68
6724,5.85
6725,6.03
6726,6.23
6727,6.39
6728,6.57
6729,6.81
6730,7.15
6731,7.55
6732,7.90
6733,8.18
6734,8.37
6735,8.43
6736,8.29
6737,7.90
6738,7.32
6739,6.68
6740,6.04
6741,5.45
6742,4.91
6743,4.46
6744,4.14
6745,3.93
6746,3.79
6747,3.71
6748,3.65
6749,3.66
6750,3.72
6751,3.81
6752,3.88
6753,3.88
6754,3.83
6755,3.74
6756,3.62
6757,3.46
6758,3.31
6759,3.20
6760,3.13
6761,3.11
6762,3.07
6763,3.03
6764,2.92
6765,2.74
6766,2.45
6767,2.10
6768,1.73
6769,1.40
6770,1.08
6771,0.76
6772,0.45
6773,0.19
6774,-0.08
6775,-0.34
6776,-0.61
6777,-0.84
6778,-1.11
6779,-1.39
6780,-1.74
6781,-2.08
6782,-2.46
6783,-2.84
6784,-3.26
6785,-3.64
6786,-3.97
6787,-4.17
6788,-4.28
6789,-4.30
6790,-4.29
6791,-4.28
6792,-4.33
6793,-4.42
6794,-4.53
6795,-4.65
6796,-4.78
6797,-4.94
6798,-5.08
6799,-5.21
6800,-5.28
6801,-5.29
6802,-5.19
6803,-4.98
6804,-4.65
6805,-4.23
6806,-3.75
6807,-3.23
6808,-2.74
6809,-2.39
6810,-2.21
6811,-2.21
6812,-2.32
6813,-2.49
6814,-2.65
6815,-2.71
6816,-2.59
6817,-2.32
6818,-1.98
6819,-1.67
6820,-1.45
6821,-1.36
6822,-1.44
6823,-1.70
6824,-2.14
6825,-2.66
6826,-3.18
6827,-3.62
6828,-3.98
6829,-4.26
6830,-4.56
6831,-4.88
6832,-5.26
6833,-5.66
6834,-6.14
6835,-6.64
6836,-7.21
6837,-7.72
6838,-8.20
6839,-8.60
6840,-9.06
6841,-9.53
6842,-10.13
6843,-10.80
6844,-11.65
6845,-12.61
6846,-13.70
6847,-14.74
6848,-15.73
6849,-16.54
6850,-17.24
6851,-17.78
6852,-18.30
6853,-18.78
6854,-19.35
6855,-19.98
6856,-20.80
6857,-21.70
6858,-22.74
6859,-23.77
6860,-24.83
6861,-25.78
6862,-26.57
6863,-27.10
6864,-27.40
6865,-27.47
6866,-27.40
6867,-27.24
6868,-27.10
6869,-27.02
6870,-27.09
6871,-27.30
6872,-27.62
6873,-27.92
6874,-28.13
6875,-28.15
6876,-28.02
6877,-27.73
6878,-27.37
6879,-27.03
6880,-26.83
6881,-26.82
6882,-27.02
6883,-27.34
6884,-27.80
6885,-28.29
6886,-28.73
6887,-29.05
6888,-29.27
6889,-29.44
6890,-29.65
6891,-29.91
6892,-30.23
6893,-30.56
6894,-30.91
6895,-31.28
6896,-31.60
6897,-31.81
6898,-31.88
6899,-31.85
6900,-31.74
6901,-31.57
6902,-31.31
6903,-30.97
6904,-30.47
6905,-29.91
6906,-29.30
6907,-28.72
6908,-28.11
6909,-27.53
6910,-26.91
6911,-26.27
6912,-25.51
6913,-24.67
6914,-23.67
6915,-22.61
6916,-21.46
6917,-20.44
6918,-19.52
6919,-18.86
6920,-18.31
6921,-17.91
6922,-17.47
6923,-16.99
6924,-16.28
6925,-15.38
6926,-14.23
6927,-13.02
6928,-11.77
6929,-10.70
6930,-9.81
6931,-9.19
6932,-8.72
6933,-8.41
6934,-8.13
6935,-7.90
6936,-7.70
6937,-7.52
6938,-7.35
6939,-7.26
6940,-7.31
6941,-7.53
6942,-7.83
6943,-8.13
6944,-8.42
6945,-8.65
6946,-8.85
6947,-8.99
6948,-9.10
6949,-9.24
6950,-9.50
6951,-9.84
6952,-10.27
6953,-10.72
6954,-11.22
6955,-11.68
6956,-12.09
6957,-12.38
6958,-12.62
6959,-12.81
6960,-13.02
6961,-13.23
6962,-13.47
6963,-13.73
6964,-14.04
6965,-14.40
6966,-14.81
6967,-15.19
6968,-15.52
6969,-15.76
6970,-15.94
6971,-16.06
6972,-16.10
6973,-16.04
6974,-15.88
6975,-15.67
6976,-15.45
6977,-15.21
6978,-14.90
6979,-14.53
6980,-14.07
6981,-13.51
6982,-12.76
6983,-11.89
6984,-10.88
6985,-9.88
6986,-8.81
6987,-7.80
6988,-6.77
6989,-5.86
6990,-4.97
6991,-4.20
6992,-3.48
6993,-2.90
6994,-2.34
6995,-1.89
6996,-1.46
6997,-1.17
6998,-0.86
6999,-0.56
7000,-0.14
7001,0.35
7002,0.96
7003,1.60
7004,2.32
7005,2.99
7006,3.62
7007,4.12
7008,4.54
7009,4.88
7010,5.23
7011,5.59
7012,6.07
7013,6.63
7014,7.31
7015,8.02
7016,8.73
7017,9.35
7018,9.90
7019,10.28
7020,10.51
7021,10.59
7022,10.58
7023,10.52
7024,10.41
7025,10.23
7026,9.98
7027,9.65
7028,9.25
7029,8.80
7030,8.31
7031,7.87
7032,7.50
7033,7.26
7034,7.11
7035,7.04
7036,6.99
7037,6.94
7038,6.81
7039,6.58
7040,6.23
7041,5.81
7042,5.35
7043,4.91
7044,4.50
7045,4.20
7046,4.02
7047,3.97
7048,4.01
7049,4.11
7050,4.19
7051,4.23
7052,4.20
7053,4.10
7054,3.92
7055,3.68
7056,3.43
7057,3.17
7058,2.98
7059,2.86
7060,2.85
7061,2.97
7062,3.20
7063,3.49
7064,3.87
7065,4.29
7066,4.73
7067,5.14
7068,5.52
7069,5.81
7070,6.03
7071,6.19
7072,6.30
7073,6.38
7074,6.43
7075,6.45
7076,6.51
7077,6.59
7078,6.70
7079,6.79
7080,6.88
7081,6.97
7082,7.04
7083,7.04
7084,6.95
7085,6.80
7086,6.65
7087,6.55
7088,6.50
7089,6.48
7090,6.47
7091,6.48
7092,6.47
7093,6.42
7094,6.28
7095,6.07
7096,5.79
7097,5.49
7098,5.19
7099,4.91
7100,4.71
7101,4.59
7102,4.58
7103,4.63
7104,4.74
7105,4.90
7106,5.09
7107,5.30
7108,5.51
7109,5.68
7110,5.85
7111,6.00
7112,6.10
7113,6.14
7114,6.10
7115,5.97
7116,5.78
7117,5.51
7118,5.19
7119,4.91
7120,4.77
7121,4.76
7122,4.89
7123,5.10
7124,5.37
7125,5.65
7126,5.85
7127,5.94
7128,5.93
7129,5.83
7130,5.69
7131,5.57
7132,5.52
7133,5.57
7134,5.74
7135,5.99
7136,6.25
7137,6.47
7138,6.60
7139,6.63
7140,6.55
7141,6.37
7142,6.12
7143,5.87
7144,5.68
7145,5.59
7146,5.58
7147,5.66
7148,5.77
7149,5.87
7150,5.88
7151,5.80
7152,5.60
7153,5.33
7154,5.00
7155,4.68
7156,4.36
7157,4.07
7158,3.78
7159,3.49
7160,3.16
7161,2.81
7162,2.40
7163,2.04
7164,1.67
7165,1.33
7166,0.92
7167,0.52
7168,0.07
7169,-0.38
7170,-0.98
7171,-1.70
7172,-2.62
7173,-3.60
7174,-4.64
7175,-5.58
7176,-6.42
7177,-7.10
7178,-7.64
7179,-7.98
7180,-8.17
7181,-8.22
7182,-8.24
7183,-8.29
7184,-8.42
7185,-8.58
7186,-8.82
7187,-9.09
7188,-9.36
7189,-9.59
7190,-9.62
7191,-9.44
7192,-9.13
7193,-9.90
7194,-9.48
7195,-6.44
7196,-4.99
7197,-11.25
7198,-18.01
7199,-6.87
7200,12.25
