1,-172.74
2,-250.00
3,-250.00
4,-249.44
5,-240.18
6,-248.18
7,-250.00
8,-250.00
9,-235.59
10,-200.19
11,-146.23
12,-90.58
13,-49.30
14,-30.08
15,-31.23
16,-51.76
17,-91.86
18,-143.89
19,-195.19
20,-230.69
21,-247.40
22,-250.00
23,-250.00
24,-249.92
25,-241.65
26,-217.58
27,-178.59
28,-132.01
29,-85.72
30,-42.76
31,-4.99
32,25.56
33,44.86
34,53.33
35,51.76
36,44.88
37,34.98
38,26.62
39,20.52
40,18.55
41,18.81
42,20.77
43,22.19
44,22.52
45,21.29
46,18.97
47,16.45
48,14.23
49,12.93
50,12.31
51,12.28
52,12.32
53,12.24
54,11.85
55,11.23
56,10.38
57,9.53
58,8.69
59,8.04
60,7.45
61,6.94
62,6.36
63,5.76
64,5.05
65,4.29
66,3.38
67,2.45
68,1.49
69,0.63
70,-0.15
71,-0.70
72,-1.02
73,-1.02
74,-0.89
75,-0.66
76,-0.56
77,-0.60
78,-0.89
79,-1.40
80,-2.23
81,-3.22
82,-4.39
83,-5.58
84,-6.78
85,-7.90
86,-8.99
87,-9.99
88,-10.99
89,-11.92
90,-12.83
91,-13.64
92,-14.36
93,-14.88
94,-15.20
95,-15.28
96,-15.21
97,-14.99
98,-14.64
99,-14.19
100,-13.70
101,-13.23
102,-12.73
103,-12.21
104,-11.63
105,-11.04
106,-10.38
107,-9.69
108,-8.89
109,-8.09
110,-7.29
111,-6.55
112,-5.82
113,-5.19
114,-4.62
115,-4.18
116,-3.78
117,-3.45
118,-3.15
119,-2.95
120,-2.76
121,-2.63
122,-2.53
123,-2.51
124,-2.49
125,-2.48
126,-2.40
127,-2.27
128,-2.00
129,-1.58
130,-1.01
131,-0.37
132,0.22
133,0.73
134,1.17
135,1.50
136,1.66
137,1.67
138,1.55
139,1.37
140,1.12
141,0.78
142,0.27
143,-0.34
144,-1.09
145,-1.95
146,-2.98
147,-4.06
148,-5.19
149,-6.23
150,-7.23
151,-8.09
152,-8.90
153,-9.56
154,-10.20
155,-10.77
156,-11.37
157,-11.89
158,-12.41
159,-12.87
160,-13.34
161,-13.78
162,-14.20
163,-14.52
164,-14.75
165,-14.86
166,-14.90
167,-14.83
168,-14.69
169,-14.47
170,-14.24
171,-14.06
172,-13.94
173,-13.89
174,-13.88
175,-13.88
176,-13.85
177,-13.81
178,-13.68
179,-13.46
180,-13.08
181,-12.57
182,-11.93
183,-11.31
184,-10.73
185,-10.25
186,-9.87
187,-9.61
188,-9.47
189,-9.45
190,-9.45
191,-9.39
192,-9.24
193,-8.98
194,-8.72
195,-8.51
196,-8.55
197,-8.85
198,-9.54
199,-10.54
200,-11.89
201,-13.40
202,-15.03
203,-16.57
204,-18.06
205,-19.40
206,-20.71
207,-21.90
208,-23.11
209,-24.22
210,-25.31
211,-26.20
212,-26.88
213,-27.21
214,-27.28
215,-27.05
216,-26.64
217,-26.08
218,-25.49
219,-24.95
220,-24.49
221,-24.12
222,-23.75
223,-23.35
224,-22.82
225,-22.20
226,-21.45
227,-20.63
228,-19.70
229,-18.81
230,-18.01
231,-17.42
232,-17.01
233,-16.85
234,-16.88
235,-17.07
236,-17.30
237,-17.50
238,-17.59
239,-17.56
240,-17.40
241,-17.20
242,-16.99
243,-16.85
244,-16.72
245,-16.59
246,-16.37
247,-16.06
248,-15.56
249,-14.91
250,-14.11
251,-13.33
252,-12.66
253,-12.21
254,-11.97
255,-11.90
256,-11.92
257,-11.96
258,-11.91
259,-11.76
260,-11.57
261,-11.44
262,-11.45
263,-11.70
264,-12.18
265,-12.84
266,-13.59
267,-14.24
268,-14.73
269,-14.97
270,-14.97
271,-14.74
272,-14.41
273,-14.09
274,-13.94
275,-13.98
276,-14.26
277,-14.65
278,-15.13
279,-15.60
280,-16.03
281,-16.36
282,-16.59
283,-16.70
284,-16.73
285,-16.69
286,-16.65
287,-16.65
288,-16.71
289,-16.82
290,-16.99
291,-17.17
292,-17.36
293,-17.54
294,-17.71
295,-17.83
296,-17.87
297,-17.85
298,-17.76
299,-17.62
300,-17.35
301,-16.95
302,-16.39
303,-15.73
304,-14.97
305,-14.18
306,-13.35
307,-12.60
308,-11.93
309,-11.34
310,-10.77
311,-10.15
312,-9.45
313,-8.68
314,-7.85
315,-7.06
316,-6.42
317,-6.08
318,-6.16
319,-6.71
320,-7.65
321,-8.89
322,-10.30
323,-11.71
324,-12.99
325,-13.98
326,-14.65
327,-14.99
328,-15.09
329,-15.02
330,-14.88
331,-14.72
332,-14.58
333,-14.45
334,-14.37
335,-14.27
336,-14.16
337,-13.97
338,-13.75
339,-13.53
340,-13.38
341,-13.33
342,-13.46
343,-13.78
344,-14.35
345,-15.09
346,-15.98
347,-16.91
348,-17.87
349,-18.75
350,-19.55
351,-20.19
352,-20.77
353,-21.26
354,-21.71
355,-22.09
356,-22.44
357,-22.69
358,-22.90
359,-23.03
360,-23.18
361,-23.34
362,-23.58
363,-23.88
364,-24.23
365,-24.59
366,-24.91
367,-25.09
368,-25.10
369,-24.91
370,-24.60
371,-24.28
372,-24.08
373,-24.10
374,-24.42
375,-25.00
376,-25.73
377,-26.49
378,-27.19
379,-27.73
380,-28.04
381,-28.10
382,-27.96
383,-27.71
384,-27.44
385,-27.20
386,-27.02
387,-26.87
388,-26.70
389,-26.48
390,-26.14
391,-25.67
392,-25.00
393,-24.23
394,-23.40
395,-22.65
396,-22.01
397,-21.51
398,-21.12
399,-20.83
400,-20.59
401,-20.43
402,-20.29
403,-20.14
404,-19.98
405,-19.90
406,-19.92
407,-20.07
408,-20.28
409,-20.54
410,-20.81
411,-21.05
412,-21.16
413,-21.10
414,-20.94
415,-20.77
416,-20.67
417,-20.70
418,-20.94
419,-21.42
420,-22.06
421,-22.77
422,-23.40
423,-23.86
424,-24.08
425,-24.05
426,-23.78
427,-23.35
428,-22.85
429,-22.40
430,-22.04
431,-21.81
432,-21.67
433,-21.56
434,-21.42
435,-21.28
436,-21.11
437,-20.92
438,-20.59
439,-20.16
440,-19.60
441,-18.99
442,-18.25
443,-17.49
444,-16.70
445,-16.06
446,-15.52
447,-15.14
448,-14.76
449,-14.40
450,-13.92
451,-13.31
452,-12.44
453,-11.38
454,-10.15
455,-9.00
456,-7.96
457,-7.18
458,-6.67
459,-6.45
460,-6.44
461,-6.58
462,-6.72
463,-6.85
464,-6.94
465,-7.00
466,-7.03
467,-7.06
468,-7.13
469,-7.27
470,-7.49
471,-7.74
472,-7.97
473,-8.18
474,-8.39
475,-8.60
476,-8.75
477,-8.81
478,-8.80
479,-8.74
480,-8.61
481,-8.40
482,-8.13
483,-7.83
484,-7.53
485,-7.27
486,-7.16
487,-7.23
488,-7.56
489,-8.07
490,-8.73
491,-9.44
492,-10.19
493,-10.91
494,-11.56
495,-12.08
496,-12.55
497,-12.95
498,-13.37
499,-13.72
500,-14.03
501,-14.24
502,-14.34
503,-14.33
504,-14.24
505,-14.08
506,-13.93
507,-13.80
508,-13.72
509,-13.69
510,-13.73
511,-13.79
512,-13.82
513,-13.79
514,-13.72
515,-13.60
516,-13.43
517,-13.22
518,-12.99
519,-12.79
520,-12.60
521,-12.44
522,-12.23
523,-12.02
524,-11.81
525,-11.57
526,-11.25
527,-10.84
528,-10.35
529,-9.84
530,-9.32
531,-8.81
532,-8.36
533,-8.06
534,-7.93
535,-8.00
536,-8.20
537,-8.54
538,-8.97
539,-9.45
540,-9.91
541,-10.28
542,-10.52
543,-10.60
544,-10.54
545,-10.38
546,-10.23
547,-10.16
548,-10.23
549,-10.44
550,-10.78
551,-11.17
552,-11.54
553,-11.74
554,-11.77
555,-11.63
556,-11.45
557,-11.31
558,-11.34
559,-11.59
560,-12.16
561,-12.96
562,-13.94
563,-14.90
564,-15.77
565,-16.47
566,-17.10
567,-17.68
568,-18.32
569,-18.99
570,-19.72
571,-20.44
572,-21.12
573,-21.66
574,-22.00
575,-22.06
576,-21.84
577,-21.42
578,-20.86
579,-20.26
580,-19.63
581,-19.02
582,-18.40
583,-17.79
584,-17.07
585,-16.32
586,-15.49
587,-14.70
588,-13.85
589,-13.02
590,-12.11
591,-11.23
592,-10.32
593,-9.45
594,-8.52
595,-7.64
596,-6.78
597,-6.08
598,-5.49
599,-5.10
600,-4.79
601,-4.64
602,-4.54
603,-4.53
604,-4.49
605,-4.39
606,-4.15
607,-3.79
608,-3.33
609,-2.85
610,-2.40
611,-2.08
612,-1.91
613,-1.91
614,-2.04
615,-2.25
616,-2.50
617,-2.75
618,-2.96
619,-3.10
620,-3.20
621,-3.30
622,-3.52
623,-3.83
624,-4.27
625,-4.77
626,-5.35
627,-6.00
628,-6.76
629,-7.55
630,-8.38
631,-9.11
632,-9.81
633,-10.42
634,-11.01
635,-11.50
636,-11.94
637,-12.28
638,-12.62
639,-12.89
640,-13.18
641,-13.44
642,-13.73
643,-13.99
644,-14.19
645,-14.29
646,-14.30
647,-14.19
648,-13.98
649,-13.68
650,-13.36
651,-13.08
652,-12.89
653,-12.77
654,-12.73
655,-12.77
656,-12.86
657,-12.96
658,-12.99
659,-12.95
660,-12.76
661,-12.44
662,-11.96
663,-11.36
664,-10.66
665,-9.94
666,-9.25
667,-8.68
668,-8.25
669,-7.98
670,-7.89
671,-7.88
672,-7.92
673,-7.94
674,-8.02
675,-8.14
676,-8.41
677,-8.80
678,-9.46
679,-10.36
680,-11.57
681,-12.90
682,-14.34
683,-15.69
684,-17.00
685,-18.14
686,-19.23
687,-20.25
688,-21.32
689,-22.42
690,-23.57
691,-24.67
692,-25.68
693,-26.44
694,-26.98
695,-27.23
696,-27.28
697,-27.11
698,-26.82
699,-26.45
700,-26.08
701,-25.75
702,-25.46
703,-25.20
704,-24.93
705,-24.64
706,-24.28
707,-23.93
708,-23.60
709,-23.33
710,-23.09
711,-22.90
712,-22.73
713,-22.61
714,-22.50
715,-22.38
716,-22.25
717,-22.13
718,-22.06
719,-22.06
720,-22.13
721,-22.29
722,-22.48
723,-22.68
724,-22.79
725,-22.74
726,-22.45
727,-21.99
728,-21.34
729,-20.62
730,-19.85
731,-19.11
732,-18.41
733,-17.79
734,-17.21
735,-16.69
736,-16.18
737,-15.74
738,-15.34
739,-15.04
740,-14.86
741,-14.87
742,-15.05
743,-15.36
744,-15.70
745,-16.04
746,-16.35
747,-16.62
748,-16.82
749,-16.96
750,-17.08
751,-17.20
752,-17.33
753,-17.42
754,-17.46
755,-17.45
756,-17.46
757,-17.48
758,-17.52
759,-17.55
760,-17.61
761,-17.68
762,-17.79
763,-17.88
764,-17.96
765,-18.07
766,-18.26
767,-18.49
768,-18.78
769,-19.13
770,-19.60
771,-20.08
772,-20.48
773,-20.73
774,-20.81
775,-20.77
776,-20.64
777,-20.43
778,-20.20
779,-20.02
780,-19.87
781,-19.74
782,-19.54
783,-19.23
784,-18.73
785,-18.08
786,-17.24
787,-16.33
788,-15.35
789,-14.46
790,-13.65
791,-12.99
792,-12.37
793,-11.79
794,-11.15
795,-10.50
796,-9.86
797,-9.32
798,-8.90
799,-8.70
800,-8.74
801,-9.05
802,-9.52
803,-10.09
804,-10.62
805,-11.05
806,-11.27
807,-11.25
808,-10.96
809,-10.49
810,-9.86
811,-9.20
812,-8.57
813,-8.00
814,-7.50
815,-7.08
816,-6.74
817,-6.48
818,-6.25
819,-6.00
820,-5.75
821,-5.57
822,-5.53
823,-5.64
824,-5.89
825,-6.28
826,-6.87
827,-7.60
828,-8.45
829,-9.32
830,-10.22
831,-11.06
832,-11.88
833,-12.59
834,-13.24
835,-13.76
836,-14.18
837,-14.47
838,-14.69
839,-14.82
840,-14.93
841,-14.95
842,-14.95
843,-14.94
844,-14.97
845,-15.05
846,-15.23
847,-15.49
848,-15.83
849,-16.19
850,-16.55
851,-16.85
852,-17.04
853,-17.07
854,-16.92
855,-16.61
856,-16.24
857,-15.90
858,-15.69
859,-15.69
860,-15.92
861,-16.35
862,-16.89
863,-17.48
864,-17.98
865,-18.33
866,-18.39
867,-18.20
868,-17.74
869,-17.14
870,-16.43
871,-15.69
872,-14.92
873,-14.14
874,-13.37
875,-12.62
876,-11.89
877,-11.25
878,-10.68
879,-10.24
880,-9.89
881,-9.66
882,-9.51
883,-9.47
884,-9.47
885,-9.52
886,-9.66
887,-9.89
888,-10.24
889,-10.69
890,-11.23
891,-11.76
892,-12.26
893,-12.65
894,-12.94
895,-13.13
896,-13.31
897,-13.57
898,-14.02
899,-14.69
900,-15.59
901,-16.59
902,-17.58
903,-18.36
904,-18.81
905,-18.84
906,-18.49
907,-17.85
908,-17.01
909,-16.17
910,-15.46
911,-15.01
912,-14.82
913,-14.76
914,-14.75
915,-14.73
916,-14.67
917,-14.59
918,-14.43
919,-14.31
920,-14.19
921,-14.14
922,-14.04
923,-13.85
924,-13.52
925,-13.05
926,-12.38
927,-11.55
928,-10.57
929,-9.61
930,-8.78
931,-8.19
932,-7.79
933,-7.57
934,-7.44
935,-7.40
936,-7.35
937,-7.24
938,-7.01
939,-6.71
940,-6.39
941,-6.09
942,-5.82
943,-5.58
944,-5.38
945,-5.23
946,-5.13
947,-5.04
948,-4.97
949,-4.94
950,-4.98
951,-5.14
952,-5.33
953,-5.53
954,-5.66
955,-5.73
956,-5.67
957,-5.50
958,-5.20
959,-4.84
960,-4.45
961,-4.09
962,-3.77
963,-3.47
964,-3.17
965,-2.84
966,-2.47
967,-2.11
968,-1.85
969,-1.70
970,-1.76
971,-2.09
972,-2.75
973,-3.71
974,-4.86
975,-6.07
976,-7.28
977,-8.37
978,-9.32
979,-10.03
980,-10.54
981,-10.88
982,-11.14
983,-11.31
984,-11.46
985,-11.56
986,-11.66
987,-11.68
988,-11.64
989,-11.52
990,-11.35
991,-11.16
992,-10.99
993,-10.88
994,-10.83
995,-10.87
996,-10.93
997,-10.94
998,-10.83
999,-10.56
1000,-10.12
1001,-9.59
1002,-8.97
1003,-8.35
1004,-7.76
1005,-7.32
1006,-7.03
1007,-6.90
1008,-6.79
1009,-6.72
1010,-6.63
1011,-6.52
1012,-6.27
1013,-5.89
1014,-5.39
1015,-4.88
1016,-4.39
1017,-3.98
1018,-3.68
1019,-3.59
1020,-3.72
1021,-4.06
1022,-4.52
1023,-5.01
1024,-5.44
1025,-5.73
1026,-5.91
1027,-5.98
1028,-6.05
1029,-6.19
1030,-6.50
1031,-7.00
1032,-7.68
1033,-8.40
1034,-9.10
1035,-9.62
1036,-9.99
1037,-10.18
1038,-10.31
1039,-10.44
1040,-10.69
1041,-11.06
1042,-11.60
1043,-12.20
1044,-12.80
1045,-13.30
1046,-13.73
1047,-14.10
1048,-14.49
1049,-14.92
1050,-15.46
1051,-16.10
1052,-16.80
1053,-17.46
1054,-17.99
1055,-18.26
1056,-18.23
1057,-17.88
1058,-17.22
1059,-16.40
1060,-15.54
1061,-14.78
1062,-14.09
1063,-13.55
1064,-13.04
1065,-12.55
1066,-11.94
1067,-11.22
1068,-10.31
1069,-9.31
1070,-8.16
1071,-7.03
1072,-5.84
1073,-4.72
1074,-3.62
1075,-2.70
1076,-1.88
1077,-1.29
1078,-0.76
1079,-0.34
1080,0.10
1081,0.53
1082,1.05
1083,1.66
1084,2.43
1085,3.29
1086,4.20
1087,5.04
1088,5.74
1089,6.20
1090,6.35
1091,6.19
1092,5.78
1093,5.20
1094,4.52
1095,3.83
1096,3.23
1097,2.78
1098,2.46
1099,2.30
1100,2.23
1101,2.24
1102,2.25
1103,2.24
1104,2.13
1105,1.97
1106,1.70
1107,1.39
1108,0.97
1109,0.50
1110,-0.05
1111,-0.61
1112,-1.19
1113,-1.75
1114,-2.32
1115,-2.85
1116,-3.34
1117,-3.76
1118,-4.14
1119,-4.42
1120,-4.64
1121,-4.78
1122,-4.89
1123,-4.94
1124,-4.94
1125,-4.85
1126,-4.68
1127,-4.44
1128,-4.12
1129,-3.74
1130,-3.31
1131,-2.89
1132,-2.50
1133,-2.20
1134,-2.03
1135,-2.01
1136,-2.08
1137,-2.21
1138,-2.29
1139,-2.28
1140,-2.09
1141,-1.71
1142,-1.11
1143,-0.38
1144,0.37
1145,1.01
1146,1.43
1147,1.59
1148,1.43
1149,0.99
1150,0.30
1151,-0.44
1152,-1.17
1153,-1.75
1154,-2.28
1155,-2.69
1156,-3.12
1157,-3.62
1158,-4.44
1159,-5.51
1160,-6.89
1161,-8.37
1162,-10.01
1163,-11.58
1164,-13.13
1165,-14.47
1166,-15.78
1167,-16.99
1168,-18.28
1169,-19.56
1170,-20.96
1171,-22.34
1172,-23.74
1173,-24.95
1174,-25.97
1175,-26.67
1176,-27.12
1177,-27.28
1178,-27.22
1179,-26.97
1180,-26.63
1181,-26.25
1182,-25.92
1183,-25.65
1184,-25.46
1185,-25.28
1186,-25.07
1187,-24.81
1188,-24.49
1189,-24.17
1190,-23.79
1191,-23.38
1192,-22.92
1193,-22.51
1194,-22.16
1195,-21.93
1196,-21.76
1197,-21.64
1198,-21.48
1199,-21.31
1200,-21.05
1201,-20.74
1202,-20.31
1203,-19.89
1204,-19.42
1205,-18.96
1206,-18.40
1207,-17.84
1208,-17.19
1209,-16.53
1210,-15.70
1211,-14.80
1212,-13.79
1213,-12.81
1214,-11.84
1215,-10.97
1216,-10.15
1217,-9.45
1218,-8.78
1219,-8.20
1220,-7.64
1221,-7.19
1222,-6.77
1223,-6.45
1224,-6.20
1225,-6.09
1226,-6.09
1227,-6.20
1228,-6.30
1229,-6.38
1230,-6.36
1231,-6.27
1232,-6.10
1233,-5.86
1234,-5.59
1235,-5.35
1236,-5.15
1237,-5.03
1238,-5.00
1239,-5.10
1240,-5.29
1241,-5.57
1242,-5.87
1243,-6.14
1244,-6.36
1245,-6.54
1246,-6.68
1247,-6.80
1248,-6.91
1249,-7.00
1250,-7.06
1251,-7.12
1252,-7.19
1253,-7.24
1254,-7.28
1255,-7.31
1256,-7.35
1257,-7.45
1258,-7.56
1259,-7.67
1260,-7.69
1261,-7.61
1262,-7.35
1263,-6.92
1264,-6.26
1265,-5.46
1266,-4.57
1267,-3.73
1268,-2.99
1269,-2.43
1270,-2.03
1271,-1.83
1272,-1.75
1273,-1.77
1274,-1.79
1275,-1.79
1276,-1.75
1277,-1.73
1278,-1.75
1279,-1.84
1280,-1.99
1281,-2.24
1282,-2.56
1283,-2.96
1284,-3.36
1285,-3.70
1286,-3.91
1287,-4.00
1288,-3.98
1289,-3.86
1290,-3.62
1291,-3.29
1292,-2.91
1293,-2.54
1294,-2.23
1295,-1.98
1296,-1.85
1297,-1.81
1298,-1.89
1299,-2.09
1300,-2.46
1301,-2.95
1302,-3.59
1303,-4.30
1304,-5.10
1305,-5.92
1306,-6.80
1307,-7.65
1308,-8.52
1309,-9.31
1310,-10.08
1311,-10.77
1312,-11.50
1313,-12.20
1314,-12.95
1315,-13.64
1316,-14.33
1317,-14.92
1318,-15.43
1319,-15.82
1320,-16.08
1321,-16.15
1322,-16.10
1323,-15.93
1324,-15.75
1325,-15.59
1326,-15.50
1327,-15.46
1328,-15.53
1329,-15.68
1330,-15.88
1331,-16.10
1332,-16.30
1333,-16.48
1334,-16.59
1335,-16.63
1336,-16.59
1337,-16.46
1338,-16.24
1339,-15.98
1340,-15.71
1341,-15.44
1342,-15.13
1343,-14.79
1344,-14.40
1345,-13.98
1346,-13.50
1347,-13.02
1348,-12.50
1349,-11.99
1350,-11.42
1351,-10.82
1352,-10.13
1353,-9.43
1354,-8.64
1355,-7.85
1356,-7.07
1357,-6.42
1358,-5.87
1359,-5.49
1360,-5.25
1361,-5.17
1362,-5.19
1363,-5.26
1364,-5.32
1365,-5.42
1366,-5.56
1367,-5.80
1368,-6.11
1369,-6.51
1370,-6.96
1371,-7.41
1372,-7.79
1373,-8.03
1374,-8.14
1375,-8.13
1376,-8.05
1377,-7.98
1378,-8.01
1379,-8.19
1380,-8.52
1381,-8.90
1382,-9.17
1383,-9.25
1384,-9.05
1385,-8.60
1386,-7.92
1387,-7.17
1388,-6.44
1389,-5.88
1390,-5.47
1391,-5.23
1392,-5.02
1393,-4.82
1394,-4.46
1395,-3.94
1396,-3.17
1397,-2.23
1398,-1.11
1399,0.02
1400,1.14
1401,2.15
1402,3.18
1403,4.17
1404,5.22
1405,6.22
1406,7.23
1407,8.13
1408,8.98
1409,9.64
1410,10.19
1411,10.59
1412,10.95
1413,11.26
1414,11.58
1415,11.89
1416,12.16
1417,12.31
1418,12.28
1419,12.04
1420,11.63
1421,11.12
1422,10.49
1423,9.82
1424,9.13
1425,8.51
1426,7.90
1427,7.32
1428,6.71
1429,6.12
1430,5.54
1431,5.01
1432,4.49
1433,4.05
1434,3.70
1435,3.51
1436,3.38
1437,3.31
1438,3.23
1439,3.19
1440,3.11
1441,2.97
1442,2.70
1443,2.40
1444,2.02
1445,1.65
1446,1.17
1447,0.63
1448,-0.05
1449,-0.78
1450,-1.64
1451,-2.59
1452,-3.62
1453,-4.57
1454,-5.41
1455,-6.08
1456,-6.65
1457,-7.05
1458,-7.32
1459,-7.49
1460,-7.68
1461,-7.86
1462,-8.08
1463,-8.26
1464,-8.45
1465,-8.61
1466,-8.74
1467,-8.80
1468,-8.85
1469,-8.93
1470,-9.06
1471,-9.19
1472,-9.28
1473,-9.34
1474,-9.35
1475,-9.28
1476,-9.15
1477,-8.94
1478,-8.67
1479,-8.42
1480,-8.16
1481,-7.93
1482,-7.67
1483,-7.39
1484,-7.03
1485,-6.65
1486,-6.20
1487,-5.77
1488,-5.31
1489,-4.90
1490,-4.51
1491,-4.17
1492,-3.82
1493,-3.47
1494,-3.08
1495,-2.72
1496,-2.43
1497,-2.28
1498,-2.27
1499,-2.43
1500,-2.72
1501,-3.09
1502,-3.44
1503,-3.68
1504,-3.80
1505,-3.76
1506,-3.60
1507,-3.37
1508,-3.22
1509,-3.27
1510,-3.60
1511,-4.14
1512,-4.80
1513,-5.43
1514,-5.98
1515,-6.32
1516,-6.47
1517,-6.43
1518,-6.35
1519,-6.32
1520,-6.47
1521,-6.82
1522,-7.42
1523,-8.13
1524,-8.89
1525,-9.54
1526,-10.10
1527,-10.50
1528,-10.80
1529,-11.02
1530,-11.29
1531,-11.67
1532,-12.19
1533,-12.76
1534,-13.33
1535,-13.82
1536,-14.17
1537,-14.31
1538,-14.22
1539,-13.92
1540,-13.48
1541,-12.97
1542,-12.39
1543,-11.81
1544,-11.22
1545,-10.67
1546,-10.04
1547,-9.35
1548,-8.52
1549,-7.64
1550,-6.63
1551,-5.58
1552,-4.44
1553,-3.38
1554,-2.38
1555,-1.59
1556,-0.95
1557,-0.53
1558,-0.21
1559,0.03
1560,0.32
1561,0.63
1562,1.04
1563,1.44
1564,1.88
1565,2.27
1566,2.59
1567,2.79
1568,2.88
1569,2.90
1570,2.94
1571,3.06
1572,3.26
1573,3.50
1574,3.77
1575,4.04
1576,4.30
1577,4.47
1578,4.52
1579,4.47
1580,4.33
1581,4.15
1582,3.91
1583,3.69
1584,3.49
1585,3.33
1586,3.17
1587,3.01
1588,2.85
1589,2.67
1590,2.40
1591,2.02
1592,1.55
1593,1.04
1594,0.47
1595,-0.12
1596,-0.72
1597,-1.24
1598,-1.61
1599,-1.85
1600,-1.98
1601,-2.08
1602,-2.12
1603,-2.12
1604,-2.08
1605,-1.99
1606,-1.85
1607,-1.64
1608,-1.34
1609,-1.00
1610,-0.59
1611,-0.18
1612,0.29
1613,0.75
1614,1.24
1615,1.69
1616,2.24
1617,2.88
1618,3.66
1619,4.46
1620,5.28
1621,6.00
1622,6.72
1623,7.39
1624,8.08
1625,8.71
1626,9.39
1627,10.09
1628,10.88
1629,11.68
1630,12.47
1631,13.13
1632,13.62
1633,13.92
1634,14.05
1635,14.08
1636,14.03
1637,13.95
1638,13.79
1639,13.51
1640,13.01
1641,12.31
1642,11.36
1643,10.26
1644,9.02
1645,7.77
1646,6.54
1647,5.46
1648,4.43
1649,3.51
1650,2.55
1651,1.59
1652,0.51
1653,-0.58
1654,-1.72
1655,-2.72
1656,-3.58
1657,-4.19
1658,-4.62
1659,-4.84
1660,-4.92
1661,-4.87
1662,-4.81
1663,-4.77
1664,-4.78
1665,-4.78
1666,-4.77
1667,-4.73
1668,-4.69
1669,-4.63
1670,-4.55
1671,-4.38
1672,-4.18
1673,-3.96
1674,-3.81
1675,-3.77
1676,-3.88
1677,-4.15
1678,-4.60
1679,-5.20
1680,-5.88
1681,-6.58
1682,-7.26
1683,-7.89
1684,-8.44
1685,-8.85
1686,-9.11
1687,-9.17
1688,-9.03
1689,-8.66
1690,-8.10
1691,-7.44
1692,-6.76
1693,-6.12
1694,-5.58
1695,-5.20
1696,-5.00
1697,-5.01
1698,-5.12
1699,-5.25
1700,-5.33
1701,-5.36
1702,-5.34
1703,-5.29
1704,-5.18
1705,-5.09
1706,-5.07
1707,-5.19
1708,-5.45
1709,-5.81
1710,-6.24
1711,-6.69
1712,-7.10
1713,-7.41
1714,-7.58
1715,-7.64
1716,-7.61
1717,-7.54
1718,-7.49
1719,-7.48
1720,-7.58
1721,-7.75
1722,-7.99
1723,-8.22
1724,-8.46
1725,-8.67
1726,-8.84
1727,-8.96
1728,-9.00
1729,-8.97
1730,-8.90
1731,-8.81
1732,-8.71
1733,-8.59
1734,-8.48
1735,-8.39
1736,-8.28
1737,-8.17
1738,-8.08
1739,-8.03
1740,-7.93
1741,-7.77
1742,-7.47
1743,-7.10
1744,-6.61
1745,-6.07
1746,-5.36
1747,-4.57
1748,-3.67
1749,-2.78
1750,-1.87
1751,-1.05
1752,-0.31
1753,0.31
1754,0.85
1755,1.32
1756,1.75
1757,2.11
1758,2.40
1759,2.60
1760,2.72
1761,2.69
1762,2.50
1763,2.15
1764,1.75
1765,1.36
1766,1.04
1767,0.79
1768,0.66
1769,0.69
1770,0.89
1771,1.20
1772,1.50
1773,1.75
1774,1.91
1775,2.01
1776,2.01
1777,1.93
1778,1.76
1779,1.52
1780,1.19
1781,0.84
1782,0.50
1783,0.20
1784,-0.08
1785,-0.31
1786,-0.50
1787,-0.66
1788,-0.94
1789,-1.34
1790,-1.92
1791,-2.62
1792,-3.49
1793,-4.41
1794,-5.34
1795,-6.11
1796,-6.72
1797,-7.15
1798,-7.51
1799,-7.82
1800,-8.16
1801,-8.51
1802,-8.93
1803,-9.37
1804,-9.80
1805,-10.09
1806,-10.25
1807,-10.26
1808,-10.22
1809,-10.19
1810,-10.21
1811,-10.30
1812,-10.45
1813,-10.64
1814,-10.80
1815,-10.90
1816,-10.87
1817,-10.72
1818,-10.48
1819,-10.24
1820,-10.04
1821,-9.90
1822,-9.77
1823,-9.70
1824,-9.64
1825,-9.55
1826,-9.34
1827,-9.00
1828,-8.51
1829,-7.96
1830,-7.27
1831,-6.54
1832,-5.75
1833,-4.99
1834,-4.19
1835,-3.39
1836,-2.57
1837,-1.84
1838,-1.17
1839,-0.64
1840,-0.22
1841,0.04
1842,0.18
1843,0.20
1844,0.14
1845,0.02
1846,-0.13
1847,-0.31
1848,-0.54
1849,-0.81
1850,-1.08
1851,-1.29
1852,-1.43
1853,-1.48
1854,-1.50
1855,-1.47
1856,-1.54
1857,-1.76
1858,-2.25
1859,-2.98
1860,-3.95
1861,-5.04
1862,-6.14
1863,-7.10
1864,-7.82
1865,-8.21
1866,-8.31
1867,-8.19
1868,-8.00
1869,-7.82
1870,-7.71
1871,-7.71
1872,-7.81
1873,-7.91
1874,-7.90
1875,-7.68
1876,-7.18
1877,-6.46
1878,-5.57
1879,-4.68
1880,-3.82
1881,-3.16
1882,-2.62
1883,-2.24
1884,-1.82
1885,-1.37
1886,-0.76
1887,-0.03
1888,0.89
1889,1.86
1890,2.90
1891,3.81
1892,4.60
1893,5.17
1894,5.65
1895,6.01
1896,6.36
1897,6.64
1898,6.94
1899,7.19
1900,7.46
1901,7.63
1902,7.69
1903,7.66
1904,7.59
1905,7.52
1906,7.45
1907,7.40
1908,7.38
1909,7.42
1910,7.45
1911,7.42
1912,7.28
1913,7.03
1914,6.63
1915,6.12
1916,5.50
1917,4.88
1918,4.32
1919,3.87
1920,3.49
1921,3.24
1922,3.11
1923,3.14
1924,3.26
1925,3.43
1926,3.61
1927,3.79
1928,3.88
1929,3.84
1930,3.62
1931,3.30
1932,2.88
1933,2.43
1934,1.97
1935,1.58
1936,1.29
1937,1.12
1938,1.00
1939,0.86
1940,0.64
1941,0.34
1942,-0.02
1943,-0.41
1944,-0.79
1945,-1.06
1946,-1.17
1947,-1.11
1948,-0.92
1949,-0.65
1950,-0.32
1951,0.04
1952,0.40
1953,0.66
1954,0.82
1955,0.87
1956,0.89
1957,0.87
1958,0.88
1959,0.87
1960,0.90
1961,0.97
1962,1.17
1963,1.53
1964,2.08
1965,2.75
1966,3.54
1967,4.35
1968,5.17
1969,5.91
1970,6.54
1971,6.94
1972,7.17
1973,7.28
1974,7.39
1975,7.56
1976,7.81
1977,8.12
1978,8.46
1979,8.73
1980,8.83
1981,8.69
1982,8.32
1983,7.77
1984,7.06
1985,6.32
1986,5.62
1987,5.07
1988,4.60
1989,4.17
1990,3.64
1991,3.06
1992,2.41
1993,1.79
1994,1.16
1995,0.64
1996,0.23
1997,0.02
1998,-0.14
1999,-0.30
2000,-0.59
2001,-1.01
2002,-1.66
2003,-2.43
2004,-3.30
2005,-4.10
2006,-4.81
2007,-5.36
2008,-5.83
2009,-6.24
2010,-6.77
2011,-7.42
2012,-8.24
2013,-9.12
2014,-10.06
2015,-10.89
2016,-11.62
2017,-12.15
2018,-12.49
2019,-12.63
2020,-12.63
2021,-12.50
2022,-12.28
2023,-11.96
2024,-11.51
2025,-10.93
2026,-10.15
2027,-9.24
2028,-8.16
2029,-7.03
2030,-5.87
2031,-4.84
2032,-3.90
2033,-3.12
2034,-2.38
2035,-1.75
2036,-1.13
2037,-0.56
2038,0.10
2039,0.77
2040,1.49
2041,2.11
2042,2.63
2043,3.00
2044,3.29
2045,3.45
2046,3.55
2047,3.55
2048,3.60
2049,3.74
2050,4.04
2051,4.45
2052,4.94
2053,5.45
2054,5.99
2055,6.49
2056,6.91
2057,7.22
2058,7.43
2059,7.58
2060,7.64
2061,7.62
2062,7.50
2063,7.30
2064,6.97
2065,6.53
2066,5.95
2067,5.27
2068,4.46
2069,3.62
2070,2.69
2071,1.79
2072,0.82
2073,-0.11
2074,-1.08
2075,-2.02
2076,-3.02
2077,-3.96
2078,-4.85
2079,-5.62
2080,-6.31
2081,-6.84
2082,-7.19
2083,-7.33
2084,-7.34
2085,-7.26
2086,-7.16
2087,-6.98
2088,-6.72
2089,-6.39
2090,-6.03
2091,-5.67
2092,-5.29
2093,-4.93
2094,-4.65
2095,-4.50
2096,-4.46
2097,-4.55
2098,-4.68
2099,-4.84
2100,-4.89
2101,-4.82
2102,-4.59
2103,-4.24
2104,-3.71
2105,-3.04
2106,-2.22
2107,-1.32
2108,-0.34
2109,0.60
2110,1.49
2111,2.27
2112,2.98
2113,3.59
2114,4.10
2115,4.43
2116,4.61
2117,4.66
2118,4.61
2119,4.47
2120,4.23
2121,3.94
2122,3.56
2123,3.12
2124,2.59
2125,2.01
2126,1.29
2127,0.43
2128,-0.60
2129,-1.72
2130,-2.94
2131,-4.16
2132,-5.36
2133,-6.36
2134,-7.17
2135,-7.66
2136,-7.91
2137,-7.94
2138,-7.92
2139,-7.86
2140,-7.90
2141,-8.04
2142,-8.32
2143,-8.67
2144,-9.08
2145,-9.44
2146,-9.72
2147,-9.86
2148,-9.89
2149,-9.81
2150,-9.74
2151,-9.69
2152,-9.75
2153,-9.92
2154,-10.25
2155,-10.70
2156,-11.24
2157,-11.78
2158,-12.28
2159,-12.66
2160,-12.92
2161,-13.05
2162,-13.04
2163,-12.95
2164,-12.81
2165,-12.66
2166,-12.48
2167,-12.26
2168,-11.91
2169,-11.44
2170,-10.82
2171,-10.09
2172,-9.19
2173,-8.22
2174,-7.13
2175,-6.04
2176,-4.94
2177,-3.97
2178,-3.08
2179,-2.37
2180,-1.73
2181,-1.21
2182,-0.68
2183,-0.24
2184,0.21
2185,0.61
2186,1.08
2187,1.51
2188,1.88
2189,2.15
2190,2.40
2191,2.61
2192,2.82
2193,3.00
2194,3.23
2195,3.52
2196,3.85
2197,4.13
2198,4.31
2199,4.37
2200,4.30
2201,4.12
2202,3.83
2203,3.50
2204,3.18
2205,2.88
2206,2.56
2207,2.18
2208,1.74
2209,1.23
2210,0.62
2211,-0.03
2212,-0.68
2213,-1.22
2214,-1.65
2215,-1.87
2216,-1.90
2217,-1.81
2218,-1.72
2219,-1.71
2220,-1.78
2221,-1.94
2222,-2.19
2223,-2.50
2224,-2.72
2225,-2.70
2226,-2.37
2227,-1.77
2228,-0.96
2229,-0.05
2230,0.86
2231,1.65
2232,2.20
2233,2.49
2234,2.58
2235,2.56
2236,2.56
2237,2.62
2238,2.75
2239,2.91
2240,3.03
2241,3.00
2242,2.78
2243,2.40
2244,1.85
2245,1.24
2246,0.65
2247,0.14
2248,-0.24
2249,-0.44
2250,-0.50
2251,-0.47
2252,-0.40
2253,-0.31
2254,-0.19
2255,-0.01
2256,0.24
2257,0.61
2258,1.06
2259,1.59
2260,2.10
2261,2.53
2262,2.78
2263,2.85
2264,2.69
2265,2.34
2266,1.81
2267,1.19
2268,0.48
2269,-0.23
2270,-0.94
2271,-1.55
2272,-2.12
2273,-2.61
2274,-3.12
2275,-3.60
2276,-4.17
2277,-4.75
2278,-5.42
2279,-6.12
2280,-6.89
2281,-7.62
2282,-8.35
2283,-8.96
2284,-9.49
2285,-9.86
2286,-10.13
2287,-10.30
2288,-10.44
2289,-10.48
2290,-10.47
2291,-10.39
2292,-10.38
2293,-10.45
2294,-10.64
2295,-10.94
2296,-11.41
2297,-12.02
2298,-12.76
2299,-13.53
2300,-14.21
2301,-14.72
2302,-15.00
2303,-15.03
2304,-14.84
2305,-14.47
2306,-13.98
2307,-13.44
2308,-12.92
2309,-12.44
2310,-11.98
2311,-11.52
2312,-10.98
2313,-10.37
2314,-9.61
2315,-8.79
2316,-7.88
2317,-7.03
2318,-6.22
2319,-5.55
2320,-4.97
2321,-4.51
2322,-4.07
2323,-3.65
2324,-3.12
2325,-2.53
2326,-1.85
2327,-1.17
2328,-0.50
2329,0.06
2330,0.50
2331,0.76
2332,0.88
2333,0.86
2334,0.79
2335,0.67
2336,0.51
2337,0.30
2338,0.04
2339,-0.29
2340,-0.70
2341,-1.18
2342,-1.68
2343,-2.08
2344,-2.31
2345,-2.33
2346,-2.17
2347,-1.86
2348,-1.50
2349,-1.21
2350,-1.12
2351,-1.31
2352,-1.76
2353,-2.35
2354,-2.88
2355,-3.23
2356,-3.30
2357,-3.06
2358,-2.48
2359,-1.71
2360,-0.85
2361,-0.11
2362,0.51
2363,0.93
2364,1.27
2365,1.54
2366,1.92
2367,2.46
2368,3.29
2369,4.26
2370,5.38
2371,6.47
2372,7.56
2373,8.52
2374,9.41
2375,10.14
2376,10.78
2377,11.30
2378,11.79
2379,12.19
2380,12.56
2381,12.84
2382,13.12
2383,13.41
2384,13.75
2385,14.08
2386,14.35
2387,14.47
2388,14.41
2389,14.11
2390,13.57
2391,12.81
2392,11.92
2393,11.05
2394,10.29
2395,9.76
2396,9.45
2397,9.37
2398,9.46
2399,9.65
2400,9.83
2401,9.96
2402,10.02
2403,10.03
2404,9.93
2405,9.83
2406,9.70
2407,9.61
2408,9.41
2409,9.09
2410,8.61
2411,8.01
2412,7.30
2413,6.53
2414,5.69
2415,4.86
2416,4.06
2417,3.38
2418,2.79
2419,2.36
2420,2.04
2421,1.91
2422,1.88
2423,1.99
2424,2.14
2425,2.34
2426,2.50
2427,2.63
2428,2.67
2429,2.62
2430,2.46
2431,2.21
2432,1.91
2433,1.61
2434,1.36
2435,1.14
2436,0.98
2437,0.95
2438,1.11
2439,1.46
2440,1.98
2441,2.59
2442,3.25
2443,3.91
2444,4.51
2445,4.98
2446,5.33
2447,5.52
2448,5.62
2449,5.65
2450,5.65
2451,5.71
2452,5.85
2453,6.10
2454,6.39
2455,6.67
2456,6.87
2457,6.92
2458,6.84
2459,6.60
2460,6.23
2461,5.78
2462,5.28
2463,4.84
2464,4.49
2465,4.32
2466,4.27
2467,4.35
2468,4.45
2469,4.49
2470,4.35
2471,3.95
2472,3.24
2473,2.31
2474,1.24
2475,0.21
2476,-0.64
2477,-1.14
2478,-1.29
2479,-1.15
2480,-0.89
2481,-0.63
2482,-0.50
2483,-0.55
2484,-0.85
2485,-1.30
2486,-1.80
2487,-2.22
2488,-2.54
2489,-2.78
2490,-2.94
2491,-3.09
2492,-3.27
2493,-3.50
2494,-3.78
2495,-4.05
2496,-4.17
2497,-4.05
2498,-3.66
2499,-3.11
2500,-2.43
2501,-1.73
2502,-1.03
2503,-0.42
2504,0.11
2505,0.53
2506,1.04
2507,1.63
2508,2.42
2509,3.31
2510,4.33
2511,5.38
2512,6.38
2513,7.17
2514,7.76
2515,8.10
2516,8.30
2517,8.34
2518,8.30
2519,8.19
2520,8.13
2521,8.11
2522,8.19
2523,8.30
2524,8.50
2525,8.73
2526,9.00
2527,9.22
2528,9.44
2529,9.67
2530,9.98
2531,10.33
2532,10.70
2533,11.09
2534,11.54
2535,12.07
2536,12.66
2537,13.21
2538,13.68
2539,13.99
2540,14.14
2541,14.11
2542,13.98
2543,13.76
2544,13.47
2545,13.18
2546,12.94
2547,12.76
2548,12.56
2549,12.27
2550,11.87
2551,11.42
2552,10.93
2553,10.46
2554,9.99
2555,9.61
2556,9.32
2557,9.19
2558,9.14
2559,9.15
2560,9.15
2561,9.15
2562,9.16
2563,9.22
2564,9.34
2565,9.52
2566,9.77
2567,10.07
2568,10.39
2569,10.64
2570,10.73
2571,10.67
2572,10.48
2573,10.18
2574,9.77
2575,9.28
2576,8.83
2577,8.45
2578,8.22
2579,8.15
2580,8.31
2581,8.69
2582,9.31
2583,10.09
2584,10.97
2585,11.87
2586,12.73
2587,13.48
2588,14.11
2589,14.58
2590,14.92
2591,15.13
2592,15.22
2593,15.25
2594,15.24
2595,15.21
2596,15.14
2597,15.01
2598,14.76
2599,14.39
2600,13.79
2601,12.97
2602,11.87
2603,10.67
2604,9.35
2605,8.09
2606,6.79
2607,5.57
2608,4.31
2609,3.09
2610,1.73
2611,0.31
2612,-1.33
2613,-3.01
2614,-4.77
2615,-6.34
2616,-7.68
2617,-8.55
2618,-9.00
2619,-8.94
2620,-8.51
2621,-7.79
2622,-7.02
2623,-6.33
2624,-5.91
2625,-5.78
2626,-5.97
2627,-6.37
2628,-6.85
2629,-7.29
2630,-7.58
2631,-7.66
2632,-7.54
2633,-7.29
2634,-7.02
2635,-6.87
2636,-6.90
2637,-7.14
2638,-7.55
2639,-8.01
2640,-8.42
2641,-8.63
2642,-8.59
2643,-8.32
2644,-7.88
2645,-7.39
2646,-6.92
2647,-6.60
2648,-6.45
2649,-6.44
2650,-6.42
2651,-6.29
2652,-5.96
2653,-5.42
2654,-4.65
2655,-3.76
2656,-2.82
2657,-2.04
2658,-1.47
2659,-1.18
2660,-1.12
2661,-1.26
2662,-1.51
2663,-1.83
2664,-2.08
2665,-2.20
2666,-2.17
2667,-2.05
2668,-1.90
2669,-1.77
2670,-1.69
2671,-1.67
2672,-1.70
2673,-1.75
2674,-1.80
2675,-1.78
2676,-1.67
2677,-1.48
2678,-1.26
2679,-1.03
2680,-0.90
2681,-0.89
2682,-1.07
2683,-1.39
2684,-1.86
2685,-2.49
2686,-3.29
2687,-4.18
2688,-5.10
2689,-5.94
2690,-6.69
2691,-7.30
2692,-7.79
2693,-8.12
2694,-8.33
2695,-8.44
2696,-8.48
2697,-8.45
2698,-8.38
2699,-8.26
2700,-8.06
2701,-7.84
2702,-7.58
2703,-7.31
2704,-6.99
2705,-6.65
2706,-6.24
2707,-5.78
2708,-5.15
2709,-4.43
2710,-3.56
2711,-2.67
2712,-1.72
2713,-0.81
2714,0.06
2715,0.82
2716,1.56
2717,2.23
2718,2.88
2719,3.40
2720,3.85
2721,4.13
2722,4.31
2723,4.35
2724,4.31
2725,4.20
2726,4.14
2727,4.14
2728,4.21
2729,4.32
2730,4.46
2731,4.62
2732,4.79
2733,4.93
2734,5.01
2735,5.11
2736,5.29
2737,5.56
2738,5.83
2739,6.07
2740,6.22
2741,6.29
2742,6.16
2743,5.81
2744,5.24
2745,4.56
2746,3.75
2747,2.88
2748,1.87
2749,0.82
2750,-0.34
2751,-1.50
2752,-2.69
2753,-3.76
2754,-4.79
2755,-5.67
2756,-6.49
2757,-7.18
2758,-7.84
2759,-8.41
2760,-9.03
2761,-9.64
2762,-10.26
2763,-10.79
2764,-11.26
2765,-11.57
2766,-11.74
2767,-11.76
2768,-11.75
2769,-11.76
2770,-11.86
2771,-12.06
2772,-12.41
2773,-12.85
2774,-13.35
2775,-13.81
2776,-14.17
2777,-14.37
2778,-14.41
2779,-14.32
2780,-14.14
2781,-13.93
2782,-13.71
2783,-13.53
2784,-13.44
2785,-13.45
2786,-13.50
2787,-13.57
2788,-13.59
2789,-13.54
2790,-13.33
2791,-12.95
2792,-12.37
2793,-11.67
2794,-10.81
2795,-9.89
2796,-8.92
2797,-7.99
2798,-7.14
2799,-6.48
2800,-6.05
2801,-5.86
2802,-5.81
2803,-5.85
2804,-5.93
2805,-6.02
2806,-6.10
2807,-6.19
2808,-6.30
2809,-6.49
2810,-6.74
2811,-7.03
2812,-7.37
2813,-7.70
2814,-8.00
2815,-8.21
2816,-8.29
2817,-8.25
2818,-8.19
2819,-8.20
2820,-8.39
2821,-8.75
2822,-9.26
2823,-9.86
2824,-10.51
2825,-11.11
2826,-11.60
2827,-11.90
2828,-12.00
2829,-11.96
2830,-11.87
2831,-11.84
2832,-11.89
2833,-11.99
2834,-12.07
2835,-12.08
2836,-11.97
2837,-11.67
2838,-11.14
2839,-10.45
2840,-9.70
2841,-9.02
2842,-8.40
2843,-7.91
2844,-7.52
2845,-7.27
2846,-7.03
2847,-6.75
2848,-6.32
2849,-5.81
2850,-5.13
2851,-4.39
2852,-3.58
2853,-2.78
2854,-1.99
2855,-1.26
2856,-0.53
2857,0.11
2858,0.69
2859,1.13
2860,1.48
2861,1.72
2862,1.84
2863,1.82
2864,1.75
2865,1.65
2866,1.57
2867,1.45
2868,1.25
2869,0.95
2870,0.59
2871,0.19
2872,-0.21
2873,-0.57
2874,-0.84
2875,-0.96
2876,-0.95
2877,-0.78
2878,-0.52
2879,-0.21
2880,0.05
2881,0.21
2882,0.23
2883,0.14
2884,-0.04
2885,-0.25
2886,-0.48
2887,-0.68
2888,-0.85
2889,-0.99
2890,-1.15
2891,-1.35
2892,-1.66
2893,-2.04
2894,-2.52
2895,-3.02
2896,-3.54
2897,-4.01
2898,-4.46
2899,-4.83
2900,-5.16
2901,-5.42
2902,-5.68
2903,-5.91
2904,-6.12
2905,-6.23
2906,-6.26
2907,-6.24
2908,-6.16
2909,-6.00
2910,-5.77
2911,-5.50
2912,-5.26
2913,-5.13
2914,-5.00
2915,-4.87
2916,-4.66
2917,-4.39
2918,-4.05
2919,-3.64
2920,-3.12
2921,-2.53
2922,-1.86
2923,-1.22
2924,-0.60
2925,-0.10
2926,0.31
2927,0.56
2928,0.72
2929,0.80
2930,0.88
2931,0.92
2932,0.96
2933,0.98
2934,1.06
2935,1.24
2936,1.50
2937,1.75
2938,1.91
2939,2.01
2940,2.03
2941,1.98
2942,1.77
2943,1.46
2944,1.06
2945,0.70
2946,0.36
2947,0.05
2948,-0.27
2949,-0.66
2950,-1.21
2951,-1.88
2952,-2.66
2953,-3.43
2954,-4.21
2955,-4.82
2956,-5.24
2957,-5.37
2958,-5.35
2959,-5.23
2960,-5.17
2961,-5.23
2962,-5.58
2963,-6.16
2964,-6.96
2965,-7.80
2966,-8.63
2967,-9.27
2968,-9.72
2969,-10.01
2970,-10.27
2971,-10.57
2972,-11.00
2973,-11.54
2974,-12.22
2975,-12.91
2976,-13.47
2977,-13.76
2978,-13.73
2979,-13.37
2980,-12.77
2981,-12.02
2982,-11.27
2983,-10.64
2984,-10.13
2985,-9.83
2986,-9.65
2987,-9.52
2988,-9.24
2989,-8.79
2990,-8.13
2991,-7.35
2992,-6.44
2993,-5.50
2994,-4.55
2995,-3.76
2996,-3.07
2997,-2.50
2998,-1.91
2999,-1.34
3000,-0.67
3001,-0.01
3002,0.70
3003,1.34
3004,1.98
3005,2.49
3006,2.94
3007,3.27
3008,3.64
3009,4.00
3010,4.44
3011,4.94
3012,5.58
3013,6.31
3014,7.12
3015,7.90
3016,8.65
3017,9.30
3018,9.82
3019,10.14
3020,10.31
3021,10.33
3022,10.22
3023,10.04
3024,9.86
3025,9.74
3026,9.67
3027,9.64
3028,9.65
3029,9.66
3030,9.61
3031,9.46
3032,9.19
3033,8.90
3034,8.60
3035,8.34
3036,8.07
3037,7.81
3038,7.54
3039,7.27
3040,7.00
3041,6.67
3042,6.26
3043,5.84
3044,5.46
3045,5.15
3046,4.96
3047,4.90
3048,5.00
3049,5.26
3050,5.67
3051,6.15
3052,6.68
3053,7.21
3054,7.74
3055,8.24
3056,8.77
3057,9.28
3058,9.87
3059,10.48
3060,11.19
3061,11.92
3062,12.70
3063,13.46
3064,14.27
3065,15.05
3066,15.89
3067,16.68
3068,17.47
3069,18.20
3070,18.95
3071,19.63
3072,20.24
3073,20.75
3074,21.17
3075,21.49
3076,21.71
3077,21.81
3078,21.74
3079,21.48
3080,20.99
3081,20.29
3082,19.30
3083,18.13
3084,16.74
3085,15.32
3086,13.85
3087,12.50
3088,11.22
3089,10.15
3090,9.14
3091,8.26
3092,7.31
3093,6.39
3094,5.36
3095,4.39
3096,3.43
3097,2.62
3098,1.90
3099,1.35
3100,0.89
3101,0.58
3102,0.37
3103,0.29
3104,0.29
3105,0.40
3106,0.56
3107,0.81
3108,1.08
3109,1.37
3110,1.56
3111,1.63
3112,1.53
3113,1.30
3114,0.94
3115,0.49
3116,-0.03
3117,-0.54
3118,-0.99
3119,-1.32
3120,-1.54
3121,-1.68
3122,-1.77
3123,-1.83
3124,-1.88
3125,-1.95
3126,-2.01
3127,-2.04
3128,-2.01
3129,-1.88
3130,-1.69
3131,-1.45
3132,-1.19
3133,-0.95
3134,-0.75
3135,-0.63
3136,-0.59
3137,-0.56
3138,-0.49
3139,-0.38
3140,-0.24
3141,-0.12
3142,0.00
3143,0.08
3144,0.13
3145,0.15
3146,0.21
3147,0.33
3148,0.50
3149,0.71
3150,0.95
3151,1.22
3152,1.51
3153,1.75
3154,1.89
3155,1.87
3156,1.66
3157,1.30
3158,0.83
3159,0.33
3160,-0.20
3161,-0.68
3162,-1.10
3163,-1.39
3164,-1.57
3165,-1.67
3166,-1.81
3167,-2.00
3168,-2.32
3169,-2.73
3170,-3.27
3171,-3.87
3172,-4.47
3173,-4.98
3174,-5.39
3175,-5.65
3176,-5.78
3177,-5.74
3178,-5.58
3179,-5.36
3180,-5.18
3181,-5.07
3182,-4.97
3183,-4.86
3184,-4.68
3185,-4.43
3186,-4.01
3187,-3.43
3188,-2.64
3189,-1.75
3190,-0.76
3191,0.19
3192,1.09
3193,1.85
3194,2.53
3195,3.07
3196,3.57
3197,3.97
3198,4.36
3199,4.65
3200,4.86
3201,4.97
3202,5.04
3203,5.05
3204,5.06
3205,5.09
3206,5.18
3207,5.29
3208,5.38
3209,5.33
3210,5.09
3211,4.61
3212,3.88
3213,3.00
3214,2.13
3215,1.49
3216,1.20
3217,1.30
3218,1.72
3219,2.40
3220,3.20
3221,4.01
3222,4.61
3223,4.92
3224,4.89
3225,4.63
3226,4.16
3227,3.57
3228,2.83
3229,1.98
3230,0.95
3231,-0.20
3232,-1.50
3233,-2.83
3234,-4.20
3235,-5.48
3236,-6.63
3237,-7.51
3238,-8.17
3239,-8.51
3240,-8.61
3241,-8.48
3242,-8.33
3243,-8.19
3244,-8.17
3245,-8.24
3246,-8.49
3247,-8.90
3248,-9.50
3249,-10.15
3250,-10.79
3251,-11.30
3252,-11.68
3253,-11.94
3254,-12.10
3255,-12.16
3256,-12.15
3257,-12.12
3258,-12.09
3259,-12.09
3260,-12.09
3261,-12.05
3262,-11.88
3263,-11.55
3264,-11.03
3265,-10.41
3266,-9.77
3267,-9.23
3268,-8.77
3269,-8.47
3270,-8.26
3271,-8.19
3272,-8.13
3273,-8.05
3274,-7.77
3275,-7.31
3276,-6.60
3277,-5.74
3278,-4.72
3279,-3.68
3280,-2.65
3281,-1.69
3282,-0.82
3283,-0.14
3284,0.33
3285,0.53
3286,0.53
3287,0.28
3288,-0.21
3289,-0.97
3290,-1.91
3291,-2.91
3292,-3.86
3293,-4.67
3294,-5.29
3295,-5.63
3296,-5.74
3297,-5.67
3298,-5.53
3299,-5.42
3300,-5.46
3301,-5.62
3302,-5.97
3303,-6.45
3304,-7.03
3305,-7.57
3306,-8.00
3307,-8.20
3308,-8.19
3309,-8.00
3310,-7.73
3311,-7.45
3312,-7.26
3313,-7.26
3314,-7.48
3315,-7.90
3316,-8.32
3317,-8.58
3318,-8.51
3319,-8.10
3320,-7.33
3321,-6.32
3322,-5.12
3323,-3.98
3324,-3.01
3325,-2.37
3326,-1.98
3327,-1.78
3328,-1.58
3329,-1.37
3330,-0.99
3331,-0.50
3332,0.17
3333,0.90
3334,1.70
3335,2.49
3336,3.36
3337,4.27
3338,5.25
3339,6.21
3340,7.11
3341,7.83
3342,8.29
3343,8.37
3344,8.12
3345,7.55
3346,6.84
3347,6.06
3348,5.39
3349,4.91
3350,4.66
3351,4.58
3352,4.56
3353,4.57
3354,4.59
3355,4.68
3356,4.84
3357,5.08
3358,5.40
3359,5.77
3360,6.11
3361,6.36
3362,6.45
3363,6.36
3364,6.07
3365,5.62
3366,5.10
3367,4.62
3368,4.21
3369,3.95
3370,3.80
3371,3.72
3372,3.63
3373,3.49
3374,3.25
3375,2.92
3376,2.50
3377,2.06
3378,1.62
3379,1.26
3380,1.01
3381,0.89
3382,0.89
3383,0.95
3384,1.05
3385,1.14
3386,1.21
3387,1.24
3388,1.24
3389,1.24
3390,1.27
3391,1.35
3392,1.50
3393,1.74
3394,2.08
3395,2.47
3396,2.83
3397,3.07
3398,3.21
3399,3.26
3400,3.25
3401,3.16
3402,3.01
3403,2.82
3404,2.65
3405,2.55
3406,2.56
3407,2.71
3408,3.03
3409,3.49
3410,4.12
3411,4.81
3412,5.52
3413,6.12
3414,6.55
3415,6.80
3416,6.85
3417,6.71
3418,6.47
3419,6.19
3420,6.00
3421,5.90
3422,5.88
3423,5.92
3424,6.02
3425,6.17
3426,6.29
3427,6.33
3428,6.26
3429,6.13
3430,5.86
3431,5.46
3432,4.84
3433,4.10
3434,3.26
3435,2.48
3436,1.84
3437,1.46
3438,1.33
3439,1.43
3440,1.65
3441,1.85
3442,1.89
3443,1.72
3444,1.30
3445,0.74
3446,0.09
3447,-0.48
3448,-0.92
3449,-1.14
3450,-1.20
3451,-1.14
3452,-1.17
3453,-1.37
3454,-1.80
3455,-2.46
3456,-3.33
3457,-4.23
3458,-5.02
3459,-5.57
3460,-5.87
3461,-5.95
3462,-5.80
3463,-5.52
3464,-5.13
3465,-4.71
3466,-4.23
3467,-3.68
3468,-3.04
3469,-2.32
3470,-1.47
3471,-0.56
3472,0.41
3473,1.37
3474,2.33
3475,3.20
3476,4.01
3477,4.68
3478,5.33
3479,5.93
3480,6.53
3481,7.03
3482,7.48
3483,7.78
3484,8.02
3485,8.15
3486,8.29
3487,8.42
3488,8.61
3489,8.80
3490,9.06
3491,9.35
3492,9.71
3493,10.09
3494,10.48
3495,10.80
3496,11.05
3497,11.20
3498,11.28
3499,11.27
3500,11.22
3501,11.12
3502,11.02
3503,10.96
3504,10.95
3505,10.99
3506,11.02
3507,11.04
3508,10.99
3509,10.87
3510,10.65
3511,10.33
3512,9.90
3513,9.42
3514,8.90
3515,8.37
3516,7.80
3517,7.21
3518,6.57
3519,5.92
3520,5.23
3521,4.56
3522,3.88
3523,3.28
3524,2.80
3525,2.52
3526,2.38
3527,2.38
3528,2.47
3529,2.66
3530,2.93
3531,3.23
3532,3.49
3533,3.67
3534,3.80
3535,3.90
3536,4.05
3537,4.24
3538,4.55
3539,4.96
3540,5.51
3541,6.10
3542,6.74
3543,7.32
3544,7.87
3545,8.36
3546,8.89
3547,9.44
3548,10.09
3549,10.83
3550,11.69
3551,12.56
3552,13.37
3553,13.99
3554,14.42
3555,14.65
3556,14.76
3557,14.79
3558,14.75
3559,14.70
3560,14.61
3561,14.43
3562,13.97
3563,13.22
3564,12.12
3565,10.80
3566,9.29
3567,7.75
3568,6.18
3569,4.73
3570,3.38
3571,2.21
3572,1.11
3573,0.15
3574,-0.78
3575,-1.56
3576,-2.25
3577,-2.77
3578,-3.20
3579,-3.48
3580,-3.66
3581,-3.74
3582,-3.81
3583,-3.85
3584,-3.91
3585,-3.94
3586,-3.95
3587,-3.91
3588,-3.84
3589,-3.68
3590,-3.45
3591,-3.11
3592,-2.72
3593,-2.30
3594,-1.90
3595,-1.57
3596,-1.33
3597,-1.17
3598,-1.10
3599,-1.11
3600,-1.17
3601,-1.27
3602,-1.34
3603,-1.31
3604,-1.18
3605,-1.01
3606,-0.81
3607,-0.66
3608,-0.56
3609,-0.55
3610,-0.53
3611,-0.47
3612,-0.24
3613,0.14
3614,0.69
3615,1.35
3616,2.11
3617,2.88
3618,3.62
3619,4.19
3620,4.54
3621,4.65
3622,4.61
3623,4.47
3624,4.33
3625,4.17
3626,4.04
3627,3.91
3628,3.83
3629,3.81
3630,3.81
3631,3.85
3632,3.88
3633,3.94
3634,4.03
3635,4.14
3636,4.18
3637,4.17
3638,4.04
3639,3.77
3640,3.33
3641,2.81
3642,2.23
3643,1.66
3644,1.04
3645,0.43
3646,-0.17
3647,-0.75
3648,-1.46
3649,-2.28
3650,-3.20
3651,-4.10
3652,-4.99
3653,-5.81
3654,-6.58
3655,-7.16
3656,-7.60
3657,-7.86
3658,-8.01
3659,-8.06
3660,-8.03
3661,-7.96
3662,-7.80
3663,-7.57
3664,-7.19
3665,-6.73
3666,-6.17
3667,-5.55
3668,-4.78
3669,-3.93
3670,-3.01
3671,-2.15
3672,-1.30
3673,-0.55
3674,0.15
3675,0.71
3676,1.17
3677,1.54
3678,1.91
3679,2.27
3680,2.62
3681,2.88
3682,3.05
3683,3.07
3684,2.98
3685,2.74
3686,2.46
3687,2.17
3688,2.01
3689,1.97
3690,2.08
3691,2.29
3692,2.61
3693,2.99
3694,3.42
3695,3.85
3696,4.24
3697,4.60
3698,4.91
3699,5.19
3700,5.43
3701,5.59
3702,5.55
3703,5.33
3704,4.91
3705,4.42
3706,3.78
3707,3.01
3708,2.09
3709,1.08
3710,-0.02
3711,-1.14
3712,-2.32
3713,-3.43
3714,-4.54
3715,-5.53
3716,-6.51
3717,-7.34
3718,-8.12
3719,-8.75
3720,-9.38
3721,-9.95
3722,-10.54
3723,-11.02
3724,-11.50
3725,-11.86
3726,-12.18
3727,-12.37
3728,-12.54
3729,-12.67
3730,-12.84
3731,-13.05
3732,-13.31
3733,-13.60
3734,-13.92
3735,-14.23
3736,-14.46
3737,-14.56
3738,-14.48
3739,-14.24
3740,-13.87
3741,-13.42
3742,-12.91
3743,-12.42
3744,-11.92
3745,-11.49
3746,-11.04
3747,-10.62
3748,-10.11
3749,-9.51
3750,-8.67
3751,-7.68
3752,-6.50
3753,-5.31
3754,-4.10
3755,-3.01
3756,-2.04
3757,-1.35
3758,-0.85
3759,-0.55
3760,-0.28
3761,-0.04
3762,0.29
3763,0.67
3764,1.14
3765,1.59
3766,1.93
3767,2.02
3768,1.87
3769,1.47
3770,0.87
3771,0.18
3772,-0.51
3773,-1.08
3774,-1.51
3775,-1.79
3776,-2.00
3777,-2.13
3778,-2.30
3779,-2.56
3780,-3.00
3781,-3.58
3782,-4.30
3783,-5.07
3784,-5.92
3785,-6.74
3786,-7.51
3787,-8.09
3788,-8.57
3789,-8.91
3790,-9.19
3791,-9.38
3792,-9.57
3793,-9.80
3794,-10.12
3795,-10.52
3796,-10.93
3797,-11.28
3798,-11.45
3799,-11.40
3800,-11.07
3801,-10.54
3802,-9.82
3803,-9.02
3804,-8.16
3805,-7.30
3806,-6.43
3807,-5.61
3808,-4.78
3809,-3.99
3810,-3.17
3811,-2.41
3812,-1.67
3813,-1.07
3814,-0.52
3815,-0.10
3816,0.34
3817,0.78
3818,1.39
3819,2.12
3820,3.01
3821,3.89
3822,4.75
3823,5.47
3824,6.04
3825,6.39
3826,6.53
3827,6.48
3828,6.38
3829,6.23
3830,6.13
3831,6.03
3832,6.03
3833,6.10
3834,6.28
3835,6.52
3836,6.81
3837,7.07
3838,7.31
3839,7.51
3840,7.71
3841,7.89
3842,8.03
3843,8.12
3844,8.18
3845,8.27
3846,8.43
3847,8.61
3848,8.73
3849,8.77
3850,8.73
3851,8.61
3852,8.37
3853,7.98
3854,7.48
3855,6.97
3856,6.48
3857,6.03
3858,5.62
3859,5.33
3860,5.20
3861,5.23
3862,5.34
3863,5.54
3864,5.79
3865,6.06
3866,6.24
3867,6.32
3868,6.29
3869,6.13
3870,5.81
3871,5.33
3872,4.78
3873,4.27
3874,3.80
3875,3.39
3876,3.06
3877,2.87
3878,2.85
3879,3.01
3880,3.28
3881,3.62
3882,3.95
3883,4.26
3884,4.51
3885,4.69
3886,4.80
3887,4.81
3888,4.80
3889,4.78
3890,4.85
3891,5.00
3892,5.23
3893,5.50
3894,5.79
3895,6.10
3896,6.42
3897,6.71
3898,6.94
3899,7.10
3900,7.20
3901,7.26
3902,7.22
3903,7.02
3904,6.65
3905,6.16
3906,5.61
3907,5.07
3908,4.60
3909,4.28
3910,4.07
3911,3.90
3912,3.68
3913,3.42
3914,3.11
3915,2.82
3916,2.51
3917,2.31
3918,2.27
3919,2.46
3920,2.77
3921,3.07
3922,3.17
3923,2.98
3924,2.41
3925,1.55
3926,0.43
3927,-0.70
3928,-1.75
3929,-2.56
3930,-3.13
3931,-3.49
3932,-3.80
3933,-4.20
3934,-4.84
3935,-5.67
3936,-6.64
3937,-7.55
3938,-8.26
3939,-8.60
3940,-8.47
3941,-7.86
3942,-6.88
3943,-5.72
3944,-4.56
3945,-3.62
3946,-2.94
3947,-2.56
3948,-2.37
3949,-2.28
3950,-2.17
3951,-1.98
3952,-1.54
3953,-0.91
3954,-0.02
3955,1.01
3956,2.22
3957,3.43
3958,4.62
3959,5.65
3960,6.57
3961,7.29
3962,7.89
3963,8.29
3964,8.61
3965,8.81
3966,9.05
3967,9.26
3968,9.54
3969,9.83
3970,10.17
3971,10.52
3972,10.92
3973,11.32
3974,11.77
3975,12.28
3976,12.86
3977,13.43
3978,13.91
3979,14.21
3980,14.33
3981,14.24
3982,13.92
3983,13.44
3984,12.89
3985,12.34
3986,11.84
3987,11.44
3988,11.09
3989,10.80
3990,10.48
3991,10.07
3992,9.52
3993,8.90
3994,8.19
3995,7.49
3996,6.80
3997,6.27
3998,5.91
3999,5.74
4000,5.66
4001,5.62
4002,5.55
4003,5.44
4004,5.23
4005,4.88
4006,4.33
4007,3.71
4008,3.08
4009,2.59
4010,2.30
4011,2.24
4012,2.45
4013,2.91
4014,3.52
4015,4.17
4016,4.68
4017,4.98
4018,5.04
4019,4.88
4020,4.61
4021,4.31
4022,4.17
4023,4.20
4024,4.50
4025,4.97
4026,5.62
4027,6.37
4028,7.20
4029,8.00
4030,8.74
4031,9.36
4032,9.92
4033,10.45
4034,10.99
4035,11.50
4036,11.97
4037,12.41
4038,12.73
4039,12.89
4040,12.78
4041,12.36
4042,11.51
4043,10.30
4044,8.70
4045,6.91
4046,5.01
4047,3.20
4048,1.46
4049,0.00
4050,-1.25
4051,-2.21
4052,-3.06
4053,-3.77
4054,-4.47
4055,-5.07
4056,-5.67
4057,-6.16
4058,-6.61
4059,-6.92
4060,-7.14
4061,-7.27
4062,-7.42
4063,-7.58
4064,-7.80
4065,-8.02
4066,-8.21
4067,-8.33
4068,-8.34
4069,-8.19
4070,-7.87
4071,-7.38
4072,-6.80
4073,-6.22
4074,-5.73
4075,-5.37
4076,-5.13
4077,-5.04
4078,-5.01
4079,-5.05
4080,-5.06
4081,-5.01
4082,-4.88
4083,-4.71
4084,-4.46
4085,-4.23
4086,-4.06
4087,-4.04
4088,-4.08
4089,-4.14
4090,-4.09
4091,-3.92
4092,-3.55
4093,-2.98
4094,-2.24
4095,-1.43
4096,-0.63
4097,0.03
4098,0.49
4099,0.72
4100,0.80
4101,0.78
4102,0.74
4103,0.70
4104,0.75
4105,0.85
4106,1.05
4107,1.22
4108,1.37
4109,1.46
4110,1.50
4111,1.52
4112,1.58
4113,1.70
4114,1.89
4115,2.14
4116,2.39
4117,2.62
4118,2.71
4119,2.60
4120,2.21
4121,1.59
4122,0.78
4123,-0.12
4124,-1.09
4125,-2.01
4126,-2.82
4127,-3.37
4128,-3.76
4129,-4.01
4130,-4.22
4131,-4.34
4132,-4.49
4133,-4.68
4134,-5.04
4135,-5.51
4136,-6.03
4137,-6.52
4138,-6.98
4139,-7.39
4140,-7.71
4141,-7.90
4142,-7.97
4143,-8.03
4144,-8.09
4145,-8.13
4146,-8.09
4147,-7.92
4148,-7.56
4149,-7.03
4150,-6.28
4151,-5.33
4152,-4.20
4153,-2.99
4154,-1.79
4155,-0.76
4156,0.09
4157,0.71
4158,1.17
4159,1.45
4160,1.62
4161,1.63
4162,1.57
4163,1.40
4164,1.19
4165,0.92
4166,0.63
4167,0.32
4168,0.02
4169,-0.25
4170,-0.46
4171,-0.58
4172,-0.61
4173,-0.58
4174,-0.51
4175,-0.39
4176,-0.21
4177,0.03
4178,0.31
4179,0.61
4180,0.94
4181,1.27
4182,1.55
4183,1.74
4184,1.82
4185,1.83
4186,1.74
4187,1.57
4188,1.26
4189,0.82
4190,0.23
4191,-0.49
4192,-1.34
4193,-2.27
4194,-3.23
4195,-4.14
4196,-5.04
4197,-5.80
4198,-6.43
4199,-6.87
4200,-7.19
4201,-7.35
4202,-7.41
4203,-7.37
4204,-7.32
4205,-7.28
4206,-7.26
4207,-7.23
4208,-7.19
4209,-7.16
4210,-7.15
4211,-7.13
4212,-7.04
4213,-6.89
4214,-6.70
4215,-6.55
4216,-6.47
4217,-6.44
4218,-6.42
4219,-6.44
4220,-6.46
4221,-6.44
4222,-6.28
4223,-5.99
4224,-5.59
4225,-5.22
4226,-4.81
4227,-4.40
4228,-3.94
4229,-3.52
4230,-3.07
4231,-2.61
4232,-2.01
4233,-1.31
4234,-0.49
4235,0.37
4236,1.30
4237,2.21
4238,3.12
4239,3.89
4240,4.53
4241,4.96
4242,5.25
4243,5.39
4244,5.45
4245,5.44
4246,5.42
4247,5.35
4248,5.23
4249,5.06
4250,4.81
4251,4.49
4252,4.04
4253,3.49
4254,2.92
4255,2.41
4256,2.00
4257,1.74
4258,1.62
4259,1.66
4260,1.79
4261,1.93
4262,1.95
4263,1.82
4264,1.46
4265,0.95
4266,0.32
4267,-0.31
4268,-0.87
4269,-1.29
4270,-1.56
4271,-1.68
4272,-1.65
4273,-1.56
4274,-1.48
4275,-1.44
4276,-1.44
4277,-1.43
4278,-1.34
4279,-1.13
4280,-0.75
4281,-0.21
4282,0.43
4283,1.02
4284,1.53
4285,1.87
4286,2.13
4287,2.31
4288,2.56
4289,2.93
4290,3.55
4291,4.35
4292,5.30
4293,6.23
4294,7.08
4295,7.78
4296,8.36
4297,8.77
4298,9.06
4299,9.25
4300,9.45
4301,9.65
4302,9.85
4303,9.97
4304,10.02
4305,9.97
4306,9.88
4307,9.75
4308,9.65
4309,9.59
4310,9.57
4311,9.54
4312,9.48
4313,9.38
4314,9.27
4315,9.17
4316,9.15
4317,9.24
4318,9.46
4319,9.79
4320,10.22
4321,10.70
4322,11.18
4323,11.61
4324,11.93
4325,12.08
4326,12.03
4327,11.83
4328,11.49
4329,11.05
4330,10.46
4331,9.78
4332,9.05
4333,8.32
4334,7.59
4335,6.95
4336,6.43
4337,6.04
4338,5.68
4339,5.35
4340,5.01
4341,4.71
4342,4.39
4343,4.07
4344,3.79
4345,3.65
4346,3.61
4347,3.65
4348,3.72
4349,3.85
4350,3.98
4351,4.08
4352,4.09
4353,4.03
4354,3.93
4355,3.83
4356,3.78
4357,3.78
4358,3.83
4359,3.91
4360,4.04
4361,4.13
4362,4.17
4363,4.17
4364,4.17
4365,4.20
4366,4.36
4367,4.66
4368,5.12
4369,5.65
4370,6.23
4371,6.76
4372,7.27
4373,7.68
4374,7.97
4375,8.15
4376,8.29
4377,8.45
4378,8.69
4379,8.99
4380,9.35
4381,9.71
4382,10.01
4383,10.16
4384,10.15
4385,9.99
4386,9.74
4387,9.44
4388,9.11
4389,8.84
4390,8.68
4391,8.63
4392,8.60
4393,8.52
4394,8.35
4395,8.12
4396,7.81
4397,7.51
4398,7.26
4399,7.15
4400,7.17
4401,7.31
4402,7.43
4403,7.45
4404,7.25
4405,6.84
4406,6.21
4407,5.46
4408,4.66
4409,3.97
4410,3.46
4411,3.17
4412,3.01
4413,2.89
4414,2.65
4415,2.24
4416,1.63
4417,0.92
4418,0.14
4419,-0.60
4420,-1.21
4421,-1.62
4422,-1.80
4423,-1.80
4424,-1.69
4425,-1.51
4426,-1.24
4427,-0.87
4428,-0.34
4429,0.33
4430,1.23
4431,2.27
4432,3.41
4433,4.51
4434,5.59
4435,6.56
4436,7.45
4437,8.17
4438,8.83
4439,9.44
4440,10.11
4441,10.75
4442,11.36
4443,11.80
4444,12.10
4445,12.19
4446,12.17
4447,12.03
4448,11.90
4449,11.83
4450,11.90
4451,12.10
4452,12.41
4453,12.74
4454,13.08
4455,13.38
4456,13.59
4457,13.71
4458,13.79
4459,13.91
4460,14.08
4461,14.26
4462,14.42
4463,14.55
4464,14.60
4465,14.56
4466,14.35
4467,14.03
4468,13.60
4469,13.19
4470,12.76
4471,12.34
4472,11.83
4473,11.28
4474,10.60
4475,9.83
4476,8.94
4477,8.00
4478,6.97
4479,6.00
4480,5.10
4481,4.39
4482,3.83
4483,3.43
4484,3.10
4485,2.85
4486,2.58
4487,2.29
4488,1.94
4489,1.62
4490,1.34
4491,1.17
4492,1.08
4493,1.08
4494,1.20
4495,1.40
4496,1.65
4497,1.86
4498,2.04
4499,2.17
4500,2.33
4501,2.46
4502,2.63
4503,2.83
4504,3.14
4505,3.51
4506,3.97
4507,4.47
4508,5.08
4509,5.76
4510,6.48
4511,7.17
4512,7.83
4513,8.42
4514,8.93
4515,9.30
4516,9.49
4517,9.53
4518,9.39
4519,9.13
4520,8.72
4521,8.20
4522,7.52
4523,6.73
4524,5.73
4525,4.62
4526,3.35
4527,2.08
4528,0.76
4529,-0.50
4530,-1.77
4531,-2.93
4532,-4.10
4533,-5.24
4534,-6.48
4535,-7.71
4536,-8.97
4537,-10.06
4538,-10.99
4539,-11.63
4540,-12.05
4541,-12.17
4542,-12.09
4543,-11.83
4544,-11.54
4545,-11.29
4546,-11.14
4547,-11.01
4548,-10.89
4549,-10.78
4550,-10.68
4551,-10.53
4552,-10.26
4553,-9.88
4554,-9.44
4555,-9.04
4556,-8.71
4557,-8.51
4558,-8.46
4559,-8.55
4560,-8.71
4561,-8.91
4562,-9.08
4563,-9.18
4564,-9.11
4565,-8.89
4566,-8.52
4567,-8.13
4568,-7.73
4569,-7.41
4570,-7.17
4571,-7.03
4572,-6.90
4573,-6.74
4574,-6.46
4575,-6.08
4576,-5.57
4577,-5.01
4578,-4.43
4579,-3.92
4580,-3.49
4581,-3.17
4582,-2.93
4583,-2.77
4584,-2.59
4585,-2.40
4586,-2.13
4587,-1.86
4588,-1.60
4589,-1.40
4590,-1.23
4591,-1.10
4592,-0.95
4593,-0.78
4594,-0.53
4595,-0.24
4596,0.11
4597,0.50
4598,0.94
4599,1.37
4600,1.81
4601,2.23
4602,2.68
4603,3.14
4604,3.62
4605,4.01
4606,4.30
4607,4.44
4608,4.45
4609,4.33
4610,4.12
4611,3.84
4612,3.52
4613,3.19
4614,2.88
4615,2.61
4616,2.37
4617,2.20
4618,2.09
4619,2.09
4620,2.18
4621,2.33
4622,2.53
4623,2.71
4624,2.84
4625,2.89
4626,2.91
4627,2.89
4628,2.93
4629,3.06
4630,3.37
4631,3.85
4632,4.50
4633,5.24
4634,6.04
4635,6.79
4636,7.48
4637,8.06
4638,8.58
4639,9.03
4640,9.42
4641,9.71
4642,9.87
4643,9.86
4644,9.75
4645,9.53
4646,9.25
4647,8.93
4648,8.69
4649,8.56
4650,8.61
4651,8.74
4652,8.97
4653,9.27
4654,9.68
4655,10.15
4656,10.63
4657,11.12
4658,11.66
4659,12.25
4660,12.85
4661,13.37
4662,13.77
4663,14.08
4664,14.24
4665,14.25
4666,14.06
4667,13.68
4668,13.07
4669,12.31
4670,11.38
4671,10.37
4672,9.25
4673,8.16
4674,7.10
4675,6.17
4676,5.23
4677,4.31
4678,3.26
4679,2.18
4680,1.00
4681,-0.14
4682,-1.30
4683,-2.33
4684,-3.25
4685,-3.91
4686,-4.40
4687,-4.67
4688,-4.87
4689,-4.99
4690,-5.17
4691,-5.40
4692,-5.74
4693,-6.08
4694,-6.42
4695,-6.69
4696,-6.91
4697,-7.05
4698,-7.10
4699,-7.07
4700,-7.01
4701,-6.98
4702,-6.98
4703,-6.98
4704,-6.96
4705,-6.94
4706,-6.91
4707,-6.89
4708,-6.81
4709,-6.71
4710,-6.55
4711,-6.34
4712,-6.03
4713,-5.62
4714,-5.10
4715,-4.51
4716,-3.79
4717,-2.99
4718,-2.16
4719,-1.43
4720,-0.86
4721,-0.50
4722,-0.28
4723,-0.20
4724,-0.15
4725,-0.11
4726,0.01
4727,0.21
4728,0.53
4729,0.86
4730,1.11
4731,1.21
4732,1.16
4733,1.00
4734,0.75
4735,0.45
4736,0.16
4737,-0.05
4738,-0.18
4739,-0.21
4740,-0.27
4741,-0.37
4742,-0.63
4743,-1.03
4744,-1.63
4745,-2.38
4746,-3.24
4747,-4.08
4748,-4.84
4749,-5.43
4750,-5.89
4751,-6.21
4752,-6.44
4753,-6.61
4754,-6.77
4755,-6.99
4756,-7.22
4757,-7.39
4758,-7.37
4759,-7.11
4760,-6.57
4761,-5.76
4762,-4.70
4763,-3.53
4764,-2.37
4765,-1.39
4766,-0.60
4767,-0.03
4768,0.47
4769,0.92
4770,1.46
4771,2.04
4772,2.75
4773,3.48
4774,4.23
4775,4.87
4776,5.48
4777,5.99
4778,6.47
4779,6.88
4780,7.29
4781,7.70
4782,8.13
4783,8.51
4784,8.86
4785,9.12
4786,9.30
4787,9.38
4788,9.41
4789,9.41
4790,9.39
4791,9.32
4792,9.22
4793,9.06
4794,8.90
4795,8.74
4796,8.61
4797,8.55
4798,8.61
4799,8.80
4800,9.04
4801,9.28
4802,9.51
4803,9.73
4804,9.88
4805,9.91
4806,9.79
4807,9.56
4808,9.25
4809,8.92
4810,8.55
4811,8.20
4812,7.90
4813,7.69
4814,7.51
4815,7.35
4816,7.18
4817,6.97
4818,6.66
4819,6.28
4820,5.87
4821,5.54
4822,5.29
4823,5.18
4824,5.20
4825,5.33
4826,5.49
4827,5.65
4828,5.74
4829,5.74
4830,5.63
4831,5.42
4832,5.16
4833,4.95
4834,4.84
4835,4.80
4836,4.83
4837,4.91
4838,5.09
4839,5.33
4840,5.59
4841,5.83
4842,6.07
4843,6.32
4844,6.65
4845,7.03
4846,7.48
4847,7.92
4848,8.35
4849,8.73
4850,9.09
4851,9.42
4852,9.72
4853,9.95
4854,10.17
4855,10.36
4856,10.57
4857,10.81
4858,11.11
4859,11.47
4860,11.86
4861,12.16
4862,12.31
4863,12.25
4864,12.00
4865,11.58
4866,11.00
4867,10.38
4868,9.78
4869,9.32
4870,9.02
4871,8.86
4872,8.77
4873,8.66
4874,8.42
4875,8.00
4876,7.45
4877,6.90
4878,6.45
4879,6.21
4880,6.21
4881,6.47
4882,6.87
4883,7.29
4884,7.50
4885,7.44
4886,7.03
4887,6.33
4888,5.40
4889,4.45
4890,3.58
4891,2.92
4892,2.43
4893,2.11
4894,1.81
4895,1.50
4896,1.05
4897,0.48
4898,-0.16
4899,-0.77
4900,-1.28
4901,-1.64
4902,-1.79
4903,-1.74
4904,-1.50
4905,-1.14
4906,-0.67
4907,-0.12
4908,0.56
4909,1.34
4910,2.24
4911,3.17
4912,4.20
4913,5.20
4914,6.21
4915,7.11
4916,7.97
4917,8.72
4918,9.51
4919,10.30
4920,11.12
4921,11.89
4922,12.63
4923,13.28
4924,13.82
4925,14.14
4926,14.27
4927,14.19
4928,13.98
4929,13.66
4930,13.37
4931,13.15
4932,13.08
4933,13.18
4934,13.51
4935,14.00
4936,14.56
4937,15.08
4938,15.46
4939,15.70
4940,15.82
4941,15.85
4942,15.78
4943,15.63
4944,15.45
4945,15.27
4946,15.07
4947,14.82
4948,14.43
4949,13.93
4950,13.32
4951,12.66
4952,11.96
4953,11.28
4954,10.64
4955,10.09
4956,9.52
4957,8.94
4958,8.28
4959,7.61
4960,6.90
4961,6.29
4962,5.74
4963,5.36
4964,5.11
4965,5.00
4966,4.97
4967,5.00
4968,5.06
4969,5.12
4970,5.21
4971,5.35
4972,5.60
4973,6.01
4974,6.64
4975,7.42
4976,8.29
4977,9.16
4978,9.99
4979,10.67
4980,11.18
4981,11.47
4982,11.59
4983,11.54
4984,11.40
4985,11.16
4986,10.98
4987,10.86
4988,10.95
4989,11.21
4990,11.69
4991,12.34
4992,13.15
4993,14.00
4994,14.78
4995,15.39
4996,15.78
4997,15.96
4998,15.90
4999,15.68
5000,15.29
5001,14.82
5002,14.22
5003,13.57
5004,12.76
5005,11.89
5006,10.84
5007,9.73
5008,8.48
5009,7.22
5010,5.87
5011,4.55
5012,3.16
5013,1.85
5014,0.52
5015,-0.72
5016,-1.93
5017,-2.99
5018,-3.91
5019,-4.55
5020,-4.94
5021,-5.05
5022,-4.97
5023,-4.73
5024,-4.46
5025,-4.21
5026,-4.06
5027,-3.97
5028,-3.91
5029,-3.83
5030,-3.69
5031,-3.48
5032,-3.17
5033,-2.75
5034,-2.26
5035,-1.78
5036,-1.35
5037,-1.03
5038,-0.79
5039,-0.64
5040,-0.56
5041,-0.57
5042,-0.65
5043,-0.78
5044,-0.88
5045,-0.95
5046,-0.99
5047,-1.02
5048,-0.99
5049,-0.92
5050,-0.78
5051,-0.56
5052,-0.25
5053,0.10
5054,0.43
5055,0.73
5056,1.06
5057,1.40
5058,1.76
5059,2.10
5060,2.44
5061,2.79
5062,3.14
5063,3.44
5064,3.69
5065,3.87
5066,3.95
5067,3.91
5068,3.78
5069,3.56
5070,3.35
5071,3.13
5072,2.92
5073,2.77
5074,2.73
5075,2.81
5076,3.01
5077,3.28
5078,3.65
5079,4.06
5080,4.47
5081,4.83
5082,5.15
5083,5.41
5084,5.62
5085,5.76
5086,5.89
5087,6.00
5088,6.13
5089,6.20
5090,6.27
5091,6.35
5092,6.52
5093,6.74
5094,7.05
5095,7.39
5096,7.84
5097,8.33
5098,8.90
5099,9.45
5100,10.06
5101,10.63
5102,11.25
5103,11.82
5104,12.43
5105,13.00
5106,13.64
5107,14.30
5108,15.10
5109,15.98
5110,17.01
5111,18.06
5112,19.17
5113,20.23
5114,21.28
5115,22.19
5116,22.99
5117,23.63
5118,24.20
5119,24.67
5120,25.09
5121,25.41
5122,25.63
5123,25.75
5124,25.77
5125,25.65
5126,25.36
5127,24.90
5128,24.37
5129,23.86
5130,23.41
5131,23.06
5132,22.75
5133,22.50
5134,22.26
5135,22.06
5136,21.81
5137,21.54
5138,21.18
5139,20.81
5140,20.35
5141,19.91
5142,19.37
5143,18.83
5144,18.14
5145,17.40
5146,16.53
5147,15.69
5148,14.76
5149,13.85
5150,12.82
5151,11.80
5152,10.69
5153,9.60
5154,8.36
5155,7.12
5156,5.71
5157,4.28
5158,2.70
5159,1.18
5160,-0.34
5161,-1.68
5162,-2.98
5163,-4.07
5164,-5.06
5165,-5.81
5166,-6.49
5167,-7.07
5168,-7.72
5169,-8.38
5170,-9.19
5171,-10.00
5172,-10.85
5173,-11.55
5174,-12.14
5175,-12.54
5176,-12.82
5177,-12.98
5178,-13.11
5179,-13.21
5180,-13.38
5181,-13.61
5182,-13.92
5183,-14.26
5184,-14.57
5185,-14.82
5186,-14.95
5187,-14.98
5188,-14.92
5189,-14.73
5190,-14.43
5191,-14.05
5192,-13.61
5193,-13.11
5194,-12.47
5195,-11.73
5196,-10.94
5197,-10.16
5198,-9.35
5199,-8.60
5200,-7.89
5201,-7.32
5202,-6.86
5203,-6.49
5204,-6.16
5205,-5.87
5206,-5.57
5207,-5.31
5208,-5.06
5209,-4.85
5210,-4.66
5211,-4.52
5212,-4.44
5213,-4.44
5214,-4.51
5215,-4.61
5216,-4.68
5217,-4.67
5218,-4.59
5219,-4.46
5220,-4.38
5221,-4.33
5222,-4.36
5223,-4.48
5224,-4.75
5225,-5.19
5226,-5.78
5227,-6.42
5228,-7.04
5229,-7.55
5230,-7.89
5231,-8.07
5232,-8.15
5233,-8.16
5234,-8.18
5235,-8.26
5236,-8.47
5237,-8.75
5238,-8.98
5239,-9.03
5240,-8.79
5241,-8.29
5242,-7.54
5243,-6.67
5244,-5.76
5245,-5.03
5246,-4.47
5247,-4.11
5248,-3.75
5249,-3.34
5250,-2.72
5251,-1.94
5252,-0.87
5253,0.34
5254,1.66
5255,2.84
5256,3.89
5257,4.73
5258,5.48
5259,6.11
5260,6.74
5261,7.39
5262,8.14
5263,8.90
5264,9.64
5265,10.14
5266,10.41
5267,10.39
5268,10.15
5269,9.75
5270,9.29
5271,8.83
5272,8.45
5273,8.21
5274,8.13
5275,8.19
5276,8.36
5277,8.61
5278,8.89
5279,9.19
5280,9.48
5281,9.74
5282,9.88
5283,9.88
5284,9.69
5285,9.37
5286,8.96
5287,8.54
5288,8.10
5289,7.68
5290,7.34
5291,7.13
5292,7.04
5293,7.00
5294,6.89
5295,6.73
5296,6.48
5297,6.17
5298,5.82
5299,5.50
5300,5.23
5301,5.05
5302,4.90
5303,4.73
5304,4.52
5305,4.28
5306,4.02
5307,3.76
5308,3.62
5309,3.66
5310,3.98
5311,4.55
5312,5.32
5313,6.13
5314,6.93
5315,7.61
5316,8.16
5317,8.53
5318,8.80
5319,9.06
5320,9.41
5321,9.88
5322,10.48
5323,11.07
5324,11.65
5325,12.08
5326,12.37
5327,12.50
5328,12.61
5329,12.73
5330,12.99
5331,13.40
5332,14.02
5333,14.82
5334,15.79
5335,16.78
5336,17.70
5337,18.44
5338,19.02
5339,19.44
5340,19.69
5341,19.71
5342,19.53
5343,19.16
5344,18.68
5345,18.14
5346,17.56
5347,17.03
5348,16.60
5349,16.37
5350,16.28
5351,16.33
5352,16.41
5353,16.49
5354,16.44
5355,16.22
5356,15.74
5357,15.08
5358,14.31
5359,13.64
5360,13.08
5361,12.71
5362,12.43
5363,12.22
5364,11.92
5365,11.47
5366,10.69
5367,9.67
5368,8.41
5369,7.10
5370,5.74
5371,4.57
5372,3.59
5373,2.93
5374,2.40
5375,1.97
5376,1.46
5377,0.90
5378,0.23
5379,-0.49
5380,-1.22
5381,-1.88
5382,-2.42
5383,-2.82
5384,-3.04
5385,-3.07
5386,-2.87
5387,-2.46
5388,-1.85
5389,-1.04
5390,-0.01
5391,1.18
5392,2.48
5393,3.74
5394,4.92
5395,5.86
5396,6.55
5397,6.95
5398,7.21
5399,7.35
5400,7.51
5401,7.68
5402,7.97
5403,8.34
5404,8.80
5405,9.21
5406,9.57
5407,9.80
5408,9.92
5409,9.90
5410,9.83
5411,9.72
5412,9.69
5413,9.80
5414,10.12
5415,10.60
5416,11.21
5417,11.84
5418,12.44
5419,12.92
5420,13.22
5421,13.32
5422,13.21
5423,12.93
5424,12.52
5425,12.05
5426,11.53
5427,10.99
5428,10.42
5429,9.86
5430,9.32
5431,8.88
5432,8.48
5433,8.15
5434,7.80
5435,7.46
5436,7.02
5437,6.50
5438,5.84
5439,5.13
5440,4.38
5441,3.72
5442,3.20
5443,2.94
5444,2.91
5445,3.11
5446,3.43
5447,3.82
5448,4.24
5449,4.63
5450,4.96
5451,5.22
5452,5.48
5453,5.74
5454,6.03
5455,6.29
5456,6.53
5457,6.73
5458,6.97
5459,7.18
5460,7.42
5461,7.64
5462,7.97
5463,8.35
5464,8.87
5465,9.35
5466,9.92
5467,10.51
5468,11.28
5469,12.15
5470,13.21
5471,14.37
5472,15.66
5473,16.99
5474,18.37
5475,19.66
5476,20.80
5477,21.67
5478,22.22
5479,22.47
5480,22.38
5481,21.97
5482,21.18
5483,20.09
5484,18.72
5485,17.24
5486,15.60
5487,13.98
5488,12.38
5489,10.97
5490,9.64
5491,8.43
5492,7.12
5493,5.79
5494,4.28
5495,2.73
5496,1.02
5497,-0.60
5498,-2.13
5499,-3.34
5500,-4.28
5501,-4.81
5502,-5.04
5503,-4.97
5504,-4.85
5505,-4.71
5506,-4.62
5507,-4.55
5508,-4.55
5509,-4.52
5510,-4.40
5511,-4.10
5512,-3.62
5513,-3.04
5514,-2.46
5515,-1.95
5516,-1.51
5517,-1.20
5518,-1.00
5519,-0.92
5520,-0.87
5521,-0.80
5522,-0.63
5523,-0.40
5524,-0.08
5525,0.24
5526,0.56
5527,0.82
5528,1.06
5529,1.27
5530,1.57
5531,1.95
5532,2.48
5533,3.17
5534,4.01
5535,4.87
5536,5.68
5537,6.27
5538,6.65
5539,6.77
5540,6.74
5541,6.60
5542,6.52
5543,6.50
5544,6.61
5545,6.81
5546,7.16
5547,7.60
5548,8.09
5549,8.54
5550,8.93
5551,9.22
5552,9.44
5553,9.59
5554,9.70
5555,9.74
5556,9.76
5557,9.74
5558,9.67
5559,9.54
5560,9.35
5561,9.15
5562,8.98
5563,8.87
5564,8.72
5565,8.57
5566,8.37
5567,8.16
5568,7.84
5569,7.42
5570,6.86
5571,6.23
5572,5.52
5573,4.81
5574,4.13
5575,3.52
5576,3.00
5577,2.59
5578,2.32
5579,2.19
5580,2.17
5581,2.24
5582,2.41
5583,2.64
5584,2.89
5585,3.13
5586,3.40
5587,3.71
5588,4.11
5589,4.62
5590,5.30
5591,6.16
5592,7.17
5593,8.19
5594,9.14
5595,9.87
5596,10.43
5597,10.77
5598,10.99
5599,11.07
5600,11.18
5601,11.34
5602,11.68
5603,12.11
5604,12.63
5605,13.13
5606,13.64
5607,14.08
5608,14.45
5609,14.70
5610,14.93
5611,15.14
5612,15.43
5613,15.79
5614,16.25
5615,16.73
5616,17.28
5617,17.81
5618,18.37
5619,18.87
5620,19.31
5621,19.69
5622,20.11
5623,20.58
5624,21.09
5625,21.61
5626,22.11
5627,22.51
5628,22.66
5629,22.48
5630,21.88
5631,20.96
5632,19.71
5633,18.32
5634,16.80
5635,15.35
5636,13.94
5637,12.68
5638,11.49
5639,10.44
5640,9.41
5641,8.48
5642,7.56
5643,6.81
5644,6.19
5645,5.79
5646,5.50
5647,5.39
5648,5.33
5649,5.33
5650,5.21
5651,4.94
5652,4.40
5653,3.68
5654,2.80
5655,1.88
5656,0.95
5657,0.11
5658,-0.59
5659,-1.06
5660,-1.27
5661,-1.24
5662,-1.03
5663,-0.66
5664,-0.17
5665,0.39
5666,0.97
5667,1.50
5668,2.06
5669,2.60
5670,3.18
5671,3.73
5672,4.36
5673,5.04
5674,5.91
5675,6.87
5676,8.02
5677,9.22
5678,10.53
5679,11.83
5680,13.18
5681,14.45
5682,15.63
5683,16.60
5684,17.42
5685,18.03
5686,18.49
5687,18.75
5688,18.86
5689,18.84
5690,18.76
5691,18.59
5692,18.32
5693,17.92
5694,17.40
5695,16.81
5696,16.17
5697,15.55
5698,14.89
5699,14.32
5700,13.82
5701,13.51
5702,13.26
5703,13.09
5704,12.86
5705,12.56
5706,12.00
5707,11.22
5708,10.18
5709,9.05
5710,7.85
5711,6.72
5712,5.66
5713,4.78
5714,4.03
5715,3.42
5716,2.85
5717,2.33
5718,1.80
5719,1.39
5720,1.12
5721,1.13
5722,1.40
5723,1.88
5724,2.48
5725,3.09
5726,3.65
5727,4.06
5728,4.31
5729,4.41
5730,4.52
5731,4.74
5732,5.16
5733,5.71
5734,6.44
5735,7.21
5736,8.00
5737,8.68
5738,9.25
5739,9.67
5740,10.07
5741,10.43
5742,10.84
5743,11.25
5744,11.71
5745,12.18
5746,12.68
5747,13.12
5748,13.50
5749,13.79
5750,14.04
5751,14.21
5752,14.31
5753,14.34
5754,14.33
5755,14.30
5756,14.23
5757,14.08
5758,13.86
5759,13.61
5760,13.40
5761,13.24
5762,13.15
5763,13.13
5764,13.17
5765,13.30
5766,13.47
5767,13.66
5768,13.81
5769,13.91
5770,13.90
5771,13.79
5772,13.53
5773,13.12
5774,12.55
5775,11.86
5776,11.08
5777,10.28
5778,9.48
5779,8.76
5780,8.13
5781,7.68
5782,7.33
5783,7.11
5784,6.89
5785,6.70
5786,6.48
5787,6.29
5788,6.05
5789,5.80
5790,5.49
5791,5.20
5792,4.89
5793,4.58
5794,4.18
5795,3.74
5796,3.23
5797,2.73
5798,2.22
5799,1.75
5800,1.34
5801,1.03
5802,0.85
5803,0.82
5804,0.98
5805,1.34
5806,1.86
5807,2.53
5808,3.33
5809,4.19
5810,5.04
5811,5.79
5812,6.43
5813,6.94
5814,7.30
5815,7.50
5816,7.61
5817,7.69
5818,7.80
5819,7.94
5820,8.14
5821,8.35
5822,8.53
5823,8.63
5824,8.60
5825,8.42
5826,8.09
5827,7.71
5828,7.31
5829,6.94
5830,6.60
5831,6.32
5832,6.09
5833,5.86
5834,5.48
5835,4.93
5836,4.21
5837,3.43
5838,2.62
5839,1.95
5840,1.44
5841,1.24
5842,1.28
5843,1.52
5844,1.80
5845,2.04
5846,2.04
5847,1.79
5848,1.24
5849,0.55
5850,-0.20
5851,-0.89
5852,-1.49
5853,-1.96
5854,-2.31
5855,-2.58
5856,-2.83
5857,-3.13
5858,-3.48
5859,-3.85
5860,-4.15
5861,-4.32
5862,-4.24
5863,-3.92
5864,-3.33
5865,-2.57
5866,-1.63
5867,-0.60
5868,0.59
5869,1.79
5870,3.04
5871,4.26
5872,5.61
5873,6.95
5874,8.38
5875,9.70
5876,10.99
5877,12.15
5878,13.31
5879,14.33
5880,15.29
5881,16.09
5882,16.88
5883,17.57
5884,18.26
5885,18.87
5886,19.48
5887,20.00
5888,20.46
5889,20.81
5890,21.10
5891,21.29
5892,21.45
5893,21.56
5894,21.64
5895,21.68
5896,21.64
5897,21.51
5898,21.33
5899,21.09
5900,20.81
5901,20.54
5902,20.30
5903,20.16
5904,20.09
5905,20.07
5906,20.01
5907,19.91
5908,19.71
5909,19.42
5910,18.97
5911,18.42
5912,17.75
5913,17.11
5914,16.46
5915,15.88
5916,15.30
5917,14.77
5918,14.26
5919,13.85
5920,13.54
5921,13.36
5922,13.28
5923,13.32
5924,13.46
5925,13.64
5926,13.80
5927,13.92
5928,14.04
5929,14.18
5930,14.37
5931,14.60
5932,14.94
5933,15.37
5934,15.92
5935,16.55
5936,17.27
5937,17.97
5938,18.64
5939,19.13
5940,19.52
5941,19.76
5942,19.97
5943,20.13
5944,20.32
5945,20.52
5946,20.80
5947,21.17
5948,21.71
5949,22.35
5950,23.12
5951,23.93
5952,24.77
5953,25.51
5954,26.09
5955,26.44
5956,26.50
5957,26.35
5958,26.00
5959,25.56
5960,25.07
5961,24.64
5962,24.20
5963,23.80
5964,23.34
5965,22.80
5966,22.02
5967,21.03
5968,19.76
5969,18.37
5970,16.83
5971,15.37
5972,13.94
5973,12.72
5974,11.56
5975,10.52
5976,9.45
5977,8.39
5978,7.26
5979,6.17
5980,5.10
5981,4.22
5982,3.51
5983,3.11
5984,2.99
5985,3.22
5986,3.69
5987,4.34
5988,5.03
5989,5.73
5990,6.39
5991,7.00
5992,7.47
5993,7.80
5994,8.00
5995,8.06
5996,7.96
5997,7.69
5998,7.29
5999,6.81
6000,6.29
6001,5.78
6002,5.30
6003,4.91
6004,4.63
6005,4.49
6006,4.43
6007,4.40
6008,4.36
6009,4.30
6010,4.26
6011,4.26
6012,4.29
6013,4.33
6014,4.46
6015,4.69
6016,5.06
6017,5.51
6018,6.03
6019,6.53
6020,7.00
6021,7.42
6022,7.82
6023,8.17
6024,8.46
6025,8.67
6026,8.83
6027,8.97
6028,9.09
6029,9.16
6030,9.17
6031,9.14
6032,9.05
6033,8.90
6034,8.71
6035,8.56
6036,8.48
6037,8.48
6038,8.54
6039,8.67
6040,8.83
6041,8.99
6042,9.09
6043,9.10
6044,8.98
6045,8.80
6046,8.58
6047,8.38
6048,8.19
6049,8.02
6050,7.80
6051,7.52
6052,7.08
6053,6.46
6054,5.62
6055,4.61
6056,3.46
6057,2.32
6058,1.27
6059,0.43
6060,-0.16
6061,-0.48
6062,-0.59
6063,-0.54
6064,-0.45
6065,-0.36
6066,-0.31
6067,-0.24
6068,-0.12
6069,0.13
6070,0.58
6071,1.24
6072,2.13
6073,3.12
6074,4.11
6075,4.94
6076,5.61
6077,6.07
6078,6.39
6079,6.55
6080,6.66
6081,6.73
6082,6.84
6083,6.96
6084,7.07
6085,7.13
6086,7.16
6087,7.12
6088,7.03
6089,6.90
6090,6.79
6091,6.70
6092,6.61
6093,6.49
6094,6.33
6095,6.13
6096,5.88
6097,5.64
6098,5.44
6099,5.38
6100,5.51
6101,5.84
6102,6.32
6103,6.88
6104,7.42
6105,7.86
6106,8.04
6107,7.91
6108,7.37
6109,6.52
6110,5.36
6111,4.01
6112,2.50
6113,1.00
6114,-0.48
6115,-1.79
6116,-2.95
6117,-3.88
6118,-4.67
6119,-5.30
6120,-5.94
6121,-6.58
6122,-7.29
6123,-7.95
6124,-8.62
6125,-9.15
6126,-9.54
6127,-9.67
6128,-9.60
6129,-9.31
6130,-8.91
6131,-8.48
6132,-8.11
6133,-7.90
6134,-7.88
6135,-8.04
6136,-8.32
6137,-8.63
6138,-8.90
6139,-9.08
6140,-9.12
6141,-9.04
6142,-8.81
6143,-8.50
6144,-8.06
6145,-7.59
6146,-7.09
6147,-6.63
6148,-6.14
6149,-5.68
6150,-5.17
6151,-4.72
6152,-4.26
6153,-3.78
6154,-3.09
6155,-2.23
6156,-1.09
6157,0.18
6158,1.63
6159,3.04
6160,4.40
6161,5.50
6162,6.36
6163,6.87
6164,7.11
6165,7.09
6166,6.96
6167,6.78
6168,6.70
6169,6.72
6170,6.90
6171,7.13
6172,7.38
6173,7.56
6174,7.66
6175,7.65
6176,7.55
6177,7.36
6178,7.16
6179,7.00
6180,6.94
6181,6.94
6182,6.97
6183,7.00
6184,7.01
6185,6.95
6186,6.81
6187,6.56
6188,6.26
6189,5.97
6190,5.84
6191,5.88
6192,6.14
6193,6.56
6194,7.12
6195,7.71
6196,8.30
6197,8.80
6198,9.25
6199,9.66
6200,10.09
6201,10.55
6202,11.13
6203,11.75
6204,12.39
6205,12.85
6206,13.15
6207,13.20
6208,13.18
6209,13.15
6210,13.30
6211,13.69
6212,14.47
6213,15.63
6214,17.14
6215,18.79
6216,20.45
6217,21.84
6218,22.93
6219,23.60
6220,23.94
6221,24.00
6222,23.97
6223,23.91
6224,23.99
6225,24.19
6226,24.54
6227,24.96
6228,25.39
6229,25.71
6230,25.91
6231,25.97
6232,25.91
6233,25.73
6234,25.43
6235,25.07
6236,24.70
6237,24.36
6238,24.08
6239,23.88
6240,23.76
6241,23.70
6242,23.66
6243,23.64
6244,23.62
6245,23.63
6246,23.61
6247,23.60
6248,23.56
6249,23.57
6250,23.57
6251,23.55
6252,23.44
6253,23.23
6254,22.80
6255,22.13
6256,21.13
6257,19.88
6258,18.44
6259,17.01
6260,15.62
6261,14.43
6262,13.44
6263,12.75
6264,12.27
6265,11.96
6266,11.69
6267,11.43
6268,11.15
6269,10.92
6270,10.73
6271,10.68
6272,10.75
6273,10.99
6274,11.39
6275,11.86
6276,12.37
6277,12.82
6278,13.23
6279,13.58
6280,13.89
6281,14.14
6282,14.42
6283,14.68
6284,14.93
6285,15.12
6286,15.34
6287,15.56
6288,15.87
6289,16.24
6290,16.74
6291,17.33
6292,18.03
6293,18.78
6294,19.55
6295,20.26
6296,20.89
6297,21.35
6298,21.71
6299,21.89
6300,22.02
6301,22.09
6302,22.21
6303,22.35
6304,22.53
6305,22.77
6306,23.09
6307,23.49
6308,23.88
6309,24.19
6310,24.35
6311,24.39
6312,24.26
6313,23.94
6314,23.37
6315,22.57
6316,21.58
6317,20.51
6318,19.49
6319,18.69
6320,18.17
6321,18.01
6322,18.08
6323,18.36
6324,18.66
6325,18.89
6326,18.86
6327,18.55
6328,17.93
6329,17.15
6330,16.29
6331,15.55
6332,14.98
6333,14.63
6334,14.40
6335,14.23
6336,13.95
6337,13.50
6338,12.83
6339,12.02
6340,11.18
6341,10.48
6342,9.98
6343,9.75
6344,9.82
6345,10.15
6346,10.65
6347,11.15
6348,11.64
6349,12.07
6350,12.54
6351,13.05
6352,13.73
6353,14.55
6354,15.59
6355,16.74
6356,18.02
6357,19.26
6358,20.48
6359,21.53
6360,22.48
6361,23.30
6362,24.09
6363,24.81
6364,25.55
6365,26.23
6366,26.86
6367,27.34
6368,27.64
6369,27.66
6370,27.40
6371,26.82
6372,26.02
6373,25.10
6374,24.20
6375,23.41
6376,22.82
6377,22.47
6378,22.34
6379,22.38
6380,22.47
6381,22.52
6382,22.43
6383,22.20
6384,21.79
6385,21.27
6386,20.61
6387,19.94
6388,19.23
6389,18.61
6390,18.09
6391,17.75
6392,17.49
6393,17.32
6394,17.06
6395,16.73
6396,16.19
6397,15.47
6398,14.46
6399,13.27
6400,11.96
6401,10.73
6402,9.65
6403,8.80
6404,8.13
6405,7.70
6406,7.42
6407,7.29
6408,7.18
6409,7.07
6410,6.93
6411,6.81
6412,6.74
6413,6.80
6414,7.00
6415,7.32
6416,7.79
6417,8.35
6418,9.00
6419,9.68
6420,10.42
6421,11.16
6422,11.91
6423,12.58
6424,13.21
6425,13.73
6426,14.22
6427,14.62
6428,14.98
6429,15.26
6430,15.57
6431,15.90
6432,16.38
6433,16.96
6434,17.72
6435,18.54
6436,19.43
6437,20.26
6438,21.01
6439,21.61
6440,22.04
6441,22.32
6442,22.45
6443,22.48
6444,22.40
6445,22.23
6446,21.92
6447,21.45
6448,20.78
6449,19.95
6450,18.95
6451,17.93
6452,16.85
6453,15.85
6454,14.85
6455,13.95
6456,13.06
6457,12.21
6458,11.30
6459,10.39
6460,9.47
6461,8.67
6462,7.99
6463,7.50
6464,7.16
6465,6.99
6466,6.92
6467,6.94
6468,6.96
6469,6.99
6470,7.03
6471,7.12
6472,7.29
6473,7.52
6474,7.81
6475,8.15
6476,8.53
6477,8.91
6478,9.26
6479,9.57
6480,9.84
6481,10.07
6482,10.25
6483,10.34
6484,10.38
6485,10.36
6486,10.29
6487,10.14
6488,9.97
6489,9.80
6490,9.70
6491,9.64
6492,9.67
6493,9.80
6494,10.07
6495,10.46
6496,10.98
6497,11.54
6498,12.12
6499,12.68
6500,13.28
6501,13.86
6502,14.43
6503,14.90
6504,15.32
6505,15.67
6506,15.96
6507,16.14
6508,16.22
6509,16.20
6510,16.17
6511,16.11
6512,16.03
6513,15.96
6514,15.95
6515,16.01
6516,16.14
6517,16.29
6518,16.43
6519,16.56
6520,16.63
6521,16.65
6522,16.55
6523,16.35
6524,16.01
6525,15.59
6526,15.12
6527,14.63
6528,14.03
6529,13.38
6530,12.70
6531,12.07
6532,11.50
6533,11.00
6534,10.54
6535,10.16
6536,9.83
6537,9.61
6538,9.43
6539,9.32
6540,9.23
6541,9.21
6542,9.23
6543,9.29
6544,9.35
6545,9.39
6546,9.39
6547,9.32
6548,9.19
6549,9.00
6550,8.86
6551,8.84
6552,9.04
6553,9.45
6554,10.09
6555,10.87
6556,11.73
6557,12.57
6558,13.34
6559,13.99
6560,14.55
6561,15.01
6562,15.44
6563,15.85
6564,16.30
6565,16.74
6566,17.17
6567,17.45
6568,17.63
6569,17.67
6570,17.66
6571,17.60
6572,17.62
6573,17.72
6574,18.02
6575,18.46
6576,19.04
6577,19.66
6578,20.32
6579,20.91
6580,21.45
6581,21.89
6582,22.28
6583,22.64
6584,22.97
6585,23.31
6586,23.61
6587,23.83
6588,23.88
6589,23.74
6590,23.36
6591,22.77
6592,21.94
6593,21.00
6594,19.97
6595,19.03
6596,18.14
6597,17.42
6598,16.77
6599,16.22
6600,15.65
6601,15.08
6602,14.41
6603,13.71
6604,12.91
6605,12.12
6606,11.33
6607,10.68
6608,10.15
6609,9.78
6610,9.49
6611,9.27
6612,9.03
6613,8.77
6614,8.45
6615,8.13
6616,7.78
6617,7.45
6618,7.18
6619,7.03
6620,7.03
6621,7.15
6622,7.35
6623,7.60
6624,7.87
6625,8.11
6626,8.25
6627,8.27
6628,8.26
6629,8.25
6630,8.27
6631,8.29
6632,8.38
6633,8.57
6634,8.95
6635,9.48
6636,10.17
6637,10.94
6638,11.81
6639,12.70
6640,13.59
6641,14.40
6642,15.10
6643,15.66
6644,16.08
6645,16.32
6646,16.39
6647,16.29
6648,16.08
6649,15.79
6650,15.52
6651,15.27
6652,15.08
6653,14.90
6654,14.74
6655,14.56
6656,14.36
6657,14.14
6658,13.94
6659,13.76
6660,13.61
6661,13.53
6662,13.50
6663,13.54
6664,13.57
6665,13.53
6666,13.31
6667,12.93
6668,12.37
6669,11.68
6670,10.91
6671,10.18
6672,9.60
6673,9.27
6674,9.22
6675,9.38
6676,9.64
6677,9.92
6678,10.15
6679,10.31
6680,10.44
6681,10.57
6682,10.86
6683,11.34
6684,12.11
6685,13.06
6686,14.21
6687,15.35
6688,16.49
6689,17.46
6690,18.35
6691,19.11
6692,19.91
6693,20.72
6694,21.68
6695,22.71
6696,23.84
6697,24.89
6698,25.91
6699,26.73
6700,27.40
6701,27.85
6702,28.20
6703,28.41
6704,28.60
6705,28.77
6706,28.97
6707,29.14
6708,29.29
6709,29.34
6710,29.33
6711,29.26
6712,29.18
6713,29.08
6714,28.98
6715,28.86
6716,28.76
6717,28.69
6718,28.69
6719,28.71
6720,28.79
6721,28.93
6722,29.17
6723,29.51
6724,29.88
6725,30.26
6726,30.56
6727,30.77
6728,30.86
6729,30.84
6730,30.67
6731,30.38
6732,29.95
6733,29.41
6734,28.79
6735,28.10
6736,27.36
6737,26.62
6738,25.89
6739,25.23
6740,24.65
6741,24.25
6742,23.99
6743,23.89
6744,23.83
6745,23.78
6746,23.67
6747,23.56
6748,23.43
6749,23.32
6750,23.20
6751,23.13
6752,23.19
6753,23.40
6754,23.72
6755,24.09
6756,24.48
6757,24.86
6758,25.23
6759,25.53
6760,25.75
6761,25.92
6762,26.08
6763,26.20
6764,26.26
6765,26.22
6766,26.15
6767,26.06
6768,26.05
6769,26.14
6770,26.39
6771,26.76
6772,27.27
6773,27.84
6774,28.49
6775,29.13
6776,29.75
6777,30.29
6778,30.78
6779,31.22
6780,31.60
6781,31.94
6782,32.24
6783,32.51
6784,32.70
6785,32.77
6786,32.70
6787,32.52
6788,32.24
6789,31.89
6790,31.44
6791,30.94
6792,30.36
6793,29.78
6794,29.13
6795,28.47
6796,27.71
6797,26.92
6798,26.03
6799,25.21
6800,24.46
6801,23.93
6802,23.59
6803,23.44
6804,23.35
6805,23.32
6806,23.19
6807,22.91
6808,22.37
6809,21.66
6810,20.82
6811,20.06
6812,19.39
6813,18.95
6814,18.71
6815,18.65
6816,18.59
6817,18.41
6818,17.91
6819,17.12
6820,16.03
6821,14.76
6822,13.39
6823,12.13
6824,11.15
6825,10.54
6826,10.28
6827,10.32
6828,10.64
6829,11.17
6830,11.87
6831,12.62
6832,13.40
6833,14.20
6834,15.07
6835,15.98
6836,16.96
6837,17.94
6838,18.97
6839,19.94
6840,20.86
6841,21.65
6842,22.39
6843,23.00
6844,23.51
6845,23.86
6846,24.11
6847,24.24
6848,24.30
6849,24.23
6850,24.09
6851,23.86
6852,23.64
6853,23.45
6854,23.36
6855,23.35
6856,23.42
6857,23.54
6858,23.71
6859,23.89
6860,24.05
6861,24.14
6862,24.16
6863,24.13
6864,24.06
6865,24.01
6866,23.99
6867,24.02
6868,24.06
6869,24.13
6870,24.21
6871,24.31
6872,24.35
6873,24.31
6874,24.09
6875,23.72
6876,23.14
6877,22.42
6878,21.61
6879,20.80
6880,20.03
6881,19.39
6882,18.84
6883,18.46
6884,18.23
6885,18.12
6886,18.02
6887,17.88
6888,17.68
6889,17.46
6890,17.27
6891,17.17
6892,17.23
6893,17.46
6894,17.90
6895,18.47
6896,19.13
6897,19.78
6898,20.43
6899,21.01
6900,21.55
6901,22.01
6902,22.50
6903,22.99
6904,23.54
6905,24.09
6906,24.70
6907,25.28
6908,25.89
6909,26.43
6910,27.02
6911,27.63
6912,28.34
6913,29.10
6914,29.94
6915,30.75
6916,31.51
6917,32.10
6918,32.49
6919,32.63
6920,32.59
6921,32.44
6922,32.23
6923,32.05
6924,31.93
6925,31.89
6926,31.79
6927,31.59
6928,31.11
6929,30.32
6930,29.12
6931,27.64
6932,25.92
6933,24.20
6934,22.49
6935,20.96
6936,19.52
6937,18.30
6938,17.18
6939,16.19
6940,15.18
6941,14.28
6942,13.47
6943,12.88
6944,12.47
6945,12.28
6946,12.24
6947,12.34
6948,12.49
6949,12.66
6950,12.79
6951,12.90
6952,13.02
6953,13.16
6954,13.38
6955,13.68
6956,14.04
6957,14.40
6958,14.76
6959,15.08
6960,15.38
6961,15.64
6962,15.88
6963,16.08
6964,16.29
6965,16.50
6966,16.69
6967,16.80
6968,16.84
6969,16.80
6970,16.76
6971,16.69
6972,16.60
6973,16.49
6974,16.49
6975,16.62
6976,16.94
6977,17.42
6978,18.08
6979,18.88
6980,19.80
6981,20.72
6982,21.63
6983,22.47
6984,23.22
6985,23.80
6986,24.25
6987,24.57
6988,24.82
6989,24.96
6990,24.99
6991,24.84
6992,24.54
6993,24.14
6994,23.72
6995,23.32
6996,23.00
6997,22.80
6998,22.71
6999,22.75
7000,22.85
7001,22.97
7002,23.06
7003,23.11
7004,23.04
7005,22.87
7006,22.58
7007,22.25
7008,21.93
7009,21.67
7010,21.42
7011,21.22
7012,21.05
7013,20.94
7014,20.83
7015,20.66
7016,20.36
7017,19.94
7018,19.42
7019,18.89
7020,18.39
7021,17.99
7022,17.73
7023,17.71
7024,17.94
7025,18.36
7026,18.85
7027,19.24
7028,19.50
7029,19.58
7030,19.52
7031,19.34
7032,19.23
7033,19.26
7034,19.58
7035,20.14
7036,20.93
7037,21.83
7038,22.79
7039,23.65
7040,24.38
7041,24.94
7042,25.43
7043,25.88
7044,26.37
7045,26.87
7046,27.44
7047,27.97
7048,28.41
7049,28.62
7050,28.59
7051,28.30
7052,27.85
7053,27.32
7054,26.86
7055,26.54
7056,26.46
7057,26.58
7058,26.89
7059,27.32
7060,27.79
7061,28.25
7062,28.62
7063,28.90
7064,29.05
7065,29.08
7066,28.98
7067,28.85
7068,28.67
7069,28.45
7070,28.05
7071,27.50
7072,26.76
7073,25.90
7074,24.89
7075,23.83
7076,22.73
7077,21.72
7078,20.77
7079,20.00
7080,19.31
7081,18.74
7082,18.14
7083,17.54
7084,16.84
7085,16.11
7086,15.27
7087,14.48
7088,13.74
7089,13.19
7090,12.76
7091,12.49
7092,12.26
7093,12.10
7094,11.92
7095,11.73
7096,11.43
7097,11.05
7098,10.56
7099,10.03
7100,9.48
7101,9.00
7102,8.61
7103,8.38
7104,8.32
7105,8.40
7106,8.59
7107,8.84
7108,9.14
7109,9.43
7110,9.68
7111,9.89
7112,10.12
7113,10.37
7114,10.67
7115,10.96
7116,11.30
7117,11.65
7118,12.01
7119,12.34
7120,12.66
7121,12.95
7122,13.22
7123,13.45
7124,13.69
7125,13.92
7126,14.15
7127,14.36
7128,14.56
7129,14.73
7130,14.89
7131,15.01
7132,15.10
7133,15.16
7134,15.20
7135,15.23
7136,15.23
7137,15.21
7138,15.14
7139,15.06
7140,14.92
7141,14.76
7142,14.50
7143,14.18
7144,13.75
7145,13.22
7146,12.58
7147,11.86
7148,11.08
7149,10.34
7150,9.68
7151,9.21
7152,8.91
7153,8.80
7154,8.82
7155,8.95
7156,9.12
7157,9.27
7158,9.35
7159,9.34
7160,9.31
7161,9.32
7162,9.50
7163,9.91
7164,10.61
7165,11.50
7166,12.53
7167,13.53
7168,14.52
7169,15.36
7170,16.12
7171,16.75
7172,17.40
7173,18.06
7174,18.87
7175,19.71
7176,20.62
7177,21.44
7178,22.23
7179,22.89
7180,23.51
7181,24.01
7182,24.56
7183,25.13
7184,25.83
7185,26.50
7186,27.17
7187,27.72
7188,28.22
7189,28.76
7190,29.17
7191,29.46
7192,29.88
7193,30.16
7194,31.59
7195,33.90
7196,33.84
7197,29.66
7198,28.18
7199,39.17
7200,44.72
