1,-156.53
2,-223.99
3,-217.09
4,-165.07
5,-115.62
6,-76.56
7,-29.18
8,33.49
9,93.95
10,135.12
11,155.62
12,166.23
13,174.90
14,181.33
15,181.16
16,175.77
17,166.50
18,155.13
19,139.18
20,119.82
21,99.41
22,81.89
23,69.19
24,60.84
25,56.11
26,53.44
27,52.84
28,52.91
29,53.60
30,53.66
31,53.55
32,52.51
33,51.22
34,49.32
35,47.49
36,45.62
37,44.08
38,42.68
39,41.50
40,40.35
41,39.35
42,38.38
43,37.55
44,36.73
45,36.03
46,35.32
47,34.74
48,34.14
49,33.62
50,33.10
51,32.66
52,32.23
53,31.86
54,31.49
55,31.17
56,30.84
57,30.55
58,30.24
59,29.98
60,29.71
61,29.47
62,29.24
63,29.04
64,28.83
65,28.64
66,28.46
67,28.31
68,28.17
69,28.04
70,27.89
71,27.75
72,27.61
73,27.49
74,27.37
75,27.24
76,27.11
77,26.99
78,26.87
79,26.76
80,26.65
81,26.57
82,26.48
83,26.40
84,26.31
85,26.23
86,26.16
87,26.12
88,26.07
89,26.04
90,26.01
91,25.98
92,25.95
93,25.93
94,25.93
95,25.95
96,25.94
97,25.93
98,25.91
99,25.89
100,25.88
101,25.86
102,25.83
103,25.79
104,25.74
105,25.69
106,25.61
107,25.54
108,25.46
109,25.38
110,25.32
111,25.27
112,25.22
113,25.18
114,25.15
115,25.12
116,25.11
117,25.10
118,25.11
119,25.12
120,25.14
121,25.16
122,25.19
123,25.23
124,25.25
125,25.25
126,25.24
127,25.22
128,25.22
129,25.21
130,25.17
131,25.12
132,25.06
133,25.02
134,24.97
135,24.92
136,24.85
137,24.78
138,24.71
139,24.66
140,24.60
141,24.54
142,24.47
143,24.41
144,24.35
145,24.31
146,24.27
147,24.22
148,24.19
149,24.17
150,24.15
151,24.15
152,24.14
153,24.13
154,24.13
155,24.14
156,24.15
157,24.16
158,24.16
159,24.15
160,24.14
161,24.14
162,24.15
163,24.15
164,24.16
165,24.16
166,24.16
167,24.17
168,24.18
169,24.19
170,24.20
171,24.22
172,24.25
173,24.27
174,24.28
175,24.29
176,24.29
177,24.30
178,24.31
179,24.31
180,24.32
181,24.32
182,24.31
183,24.31
184,24.31
185,24.32
186,24.35
187,24.38
188,24.42
189,24.48
190,24.54
191,24.59
192,24.65
193,24.71
194,24.77
195,24.83
196,24.88
197,24.92
198,24.94
199,24.95
200,24.96
201,24.96
202,24.96
203,24.96
204,24.95
205,24.95
206,24.95
207,24.95
208,24.95
209,24.96
210,25.00
211,25.05
212,25.09
213,25.12
214,25.17
215,25.23
216,25.28
217,25.34
218,25.37
219,25.40
220,25.42
221,25.44
222,25.44
223,25.43
224,25.43
225,25.41
226,25.38
227,25.32
228,25.28
229,25.24
230,25.21
231,25.18
232,25.15
233,25.14
234,25.12
235,25.09
236,25.09
237,25.12
238,25.16
239,25.21
240,25.25
241,25.29
242,25.34
243,25.38
244,25.42
245,25.47
246,25.51
247,25.53
248,25.52
249,25.50
250,25.47
251,25.45
252,25.43
253,25.39
254,25.34
255,25.30
256,25.25
257,25.22
258,25.18
259,25.16
260,25.14
261,25.12
262,25.09
263,25.05
264,25.02
265,24.99
266,24.96
267,24.92
268,24.86
269,24.78
270,24.70
271,24.64
272,24.60
273,24.55
274,24.48
275,24.41
276,24.36
277,24.33
278,24.31
279,24.28
280,24.26
281,24.25
282,24.25
283,24.25
284,24.25
285,24.25
286,24.23
287,24.22
288,24.20
289,24.18
290,24.15
291,24.12
292,24.09
293,24.06
294,24.02
295,23.96
296,23.93
297,23.89
298,23.86
299,23.83
300,23.80
301,23.78
302,23.76
303,23.73
304,23.70
305,23.68
306,23.67
307,23.68
308,23.68
309,23.69
310,23.69
311,23.69
312,23.70
313,23.72
314,23.74
315,23.76
316,23.79
317,23.82
318,23.84
319,23.86
320,23.87
321,23.89
322,23.90
323,23.90
324,23.90
325,23.87
326,23.85
327,23.82
328,23.80
329,23.77
330,23.74
331,23.71
332,23.69
333,23.69
334,23.69
335,23.67
336,23.65
337,23.64
338,23.64
339,23.65
340,23.67
341,23.67
342,23.69
343,23.70
344,23.71
345,23.71
346,23.71
347,23.71
348,23.71
349,23.72
350,23.74
351,23.74
352,23.77
353,23.80
354,23.83
355,23.86
356,23.90
357,23.93
358,23.98
359,24.02
360,24.06
361,24.08
362,24.10
363,24.12
364,24.11
365,24.09
366,24.06
367,24.03
368,23.99
369,23.94
370,23.89
371,23.85
372,23.81
373,23.78
374,23.77
375,23.79
376,23.81
377,23.85
378,23.89
379,23.93
380,23.98
381,24.03
382,24.08
383,24.13
384,24.16
385,24.17
386,24.18
387,24.19
388,24.20
389,24.19
390,24.15
391,24.12
392,24.10
393,24.10
394,24.09
395,24.06
396,24.02
397,23.99
398,23.95
399,23.92
400,23.88
401,23.83
402,23.80
403,23.75
404,23.70
405,23.67
406,23.64
407,23.61
408,23.58
409,23.57
410,23.59
411,23.61
412,23.62
413,23.63
414,23.63
415,23.64
416,23.66
417,23.68
418,23.69
419,23.69
420,23.67
421,23.66
422,23.65
423,23.64
424,23.64
425,23.62
426,23.61
427,23.61
428,23.64
429,23.68
430,23.73
431,23.77
432,23.81
433,23.88
434,23.97
435,24.06
436,24.14
437,24.22
438,24.28
439,24.35
440,24.41
441,24.48
442,24.53
443,24.57
444,24.60
445,24.64
446,24.67
447,24.68
448,24.71
449,24.74
450,24.77
451,24.80
452,24.83
453,24.85
454,24.87
455,24.90
456,24.93
457,24.93
458,24.93
459,24.93
460,24.91
461,24.89
462,24.86
463,24.83
464,24.81
465,24.80
466,24.78
467,24.77
468,24.77
469,24.79
470,24.82
471,24.85
472,24.86
473,24.87
474,24.88
475,24.89
476,24.91
477,24.91
478,24.89
479,24.86
480,24.83
481,24.79
482,24.75
483,24.71
484,24.68
485,24.65
486,24.62
487,24.60
488,24.59
489,24.60
490,24.60
491,24.61
492,24.64
493,24.66
494,24.69
495,24.72
496,24.74
497,24.76
498,24.78
499,24.80
500,24.81
501,24.82
502,24.82
503,24.81
504,24.80
505,24.78
506,24.77
507,24.74
508,24.74
509,24.75
510,24.77
511,24.78
512,24.80
513,24.81
514,24.83
515,24.85
516,24.88
517,24.90
518,24.93
519,24.96
520,24.99
521,25.02
522,25.05
523,25.09
524,25.15
525,25.19
526,25.22
527,25.22
528,25.25
529,25.28
530,25.33
531,25.36
532,25.38
533,25.38
534,25.38
535,25.38
536,25.35
537,25.32
538,25.29
539,25.26
540,25.22
541,25.18
542,25.16
543,25.15
544,25.17
545,25.18
546,25.22
547,25.25
548,25.31
549,25.38
550,25.44
551,25.51
552,25.57
553,25.64
554,25.71
555,25.76
556,25.79
557,25.81
558,25.81
559,25.81
560,25.80
561,25.78
562,25.74
563,25.70
564,25.67
565,25.63
566,25.60
567,25.58
568,25.58
569,25.59
570,25.60
571,25.63
572,25.66
573,25.71
574,25.76
575,25.79
576,25.84
577,25.88
578,25.91
579,25.92
580,25.92
581,25.93
582,25.92
583,25.89
584,25.86
585,25.83
586,25.79
587,25.75
588,25.71
589,25.68
590,25.64
591,25.60
592,25.57
593,25.56
594,25.55
595,25.54
596,25.54
597,25.55
598,25.57
599,25.58
600,25.59
601,25.59
602,25.59
603,25.59
604,25.59
605,25.60
606,25.60
607,25.60
608,25.57
609,25.56
610,25.54
611,25.51
612,25.47
613,25.43
614,25.39
615,25.36
616,25.34
617,25.31
618,25.28
619,25.25
620,25.24
621,25.22
622,25.20
623,25.18
624,25.16
625,25.15
626,25.14
627,25.12
628,25.10
629,25.08
630,25.05
631,25.03
632,25.01
633,24.99
634,24.97
635,24.94
636,24.92
637,24.90
638,24.90
639,24.91
640,24.91
641,24.89
642,24.88
643,24.88
644,24.89
645,24.89
646,24.91
647,24.93
648,24.94
649,24.96
650,25.00
651,25.04
652,25.06
653,25.08
654,25.09
655,25.12
656,25.14
657,25.15
658,25.14
659,25.12
660,25.09
661,25.08
662,25.05
663,25.02
664,24.99
665,24.95
666,24.91
667,24.89
668,24.89
669,24.89
670,24.91
671,24.94
672,24.99
673,25.07
674,25.15
675,25.23
676,25.29
677,25.36
678,25.43
679,25.50
680,25.56
681,25.61
682,25.66
683,25.69
684,25.70
685,25.70
686,25.70
687,25.70
688,25.71
689,25.71
690,25.71
691,25.70
692,25.72
693,25.74
694,25.77
695,25.82
696,25.86
697,25.91
698,25.96
699,26.01
700,26.06
701,26.12
702,26.16
703,26.19
704,26.20
705,26.19
706,26.18
707,26.15
708,26.10
709,26.04
710,25.98
711,25.92
712,25.88
713,25.83
714,25.79
715,25.75
716,25.73
717,25.73
718,25.75
719,25.78
720,25.81
721,25.85
722,25.89
723,25.93
724,25.96
725,25.99
726,26.01
727,26.03
728,26.04
729,26.02
730,25.99
731,25.96
732,25.92
733,25.88
734,25.83
735,25.78
736,25.73
737,25.70
738,25.67
739,25.63
740,25.60
741,25.57
742,25.55
743,25.54
744,25.51
745,25.48
746,25.44
747,25.41
748,25.38
749,25.34
750,25.28
751,25.22
752,25.18
753,25.13
754,25.10
755,25.07
756,25.03
757,25.01
758,24.99
759,24.98
760,24.98
761,24.98
762,24.98
763,24.99
764,25.00
765,25.01
766,25.00
767,24.99
768,24.97
769,24.96
770,24.96
771,24.93
772,24.90
773,24.88
774,24.87
775,24.87
776,24.86
777,24.86
778,24.86
779,24.86
780,24.86
781,24.85
782,24.84
783,24.83
784,24.82
785,24.77
786,24.71
787,24.66
788,24.61
789,24.57
790,24.54
791,24.50
792,24.48
793,24.48
794,24.48
795,24.51
796,24.54
797,24.57
798,24.60
799,24.64
800,24.67
801,24.70
802,24.73
803,24.76
804,24.77
805,24.77
806,24.78
807,24.79
808,24.78
809,24.76
810,24.73
811,24.72
812,24.70
813,24.67
814,24.64
815,24.60
816,24.59
817,24.57
818,24.54
819,24.50
820,24.48
821,24.48
822,24.50
823,24.51
824,24.51
825,24.51
826,24.51
827,24.51
828,24.52
829,24.53
830,24.54
831,24.57
832,24.59
833,24.61
834,24.63
835,24.65
836,24.68
837,24.72
838,24.76
839,24.79
840,24.82
841,24.86
842,24.89
843,24.91
844,24.93
845,24.96
846,24.97
847,24.96
848,24.95
849,24.95
850,24.96
851,24.99
852,24.99
853,24.97
854,24.97
855,25.00
856,25.03
857,25.06
858,25.09
859,25.13
860,25.18
861,25.25
862,25.31
863,25.35
864,25.41
865,25.47
866,25.54
867,25.61
868,25.68
869,25.74
870,25.79
871,25.85
872,25.89
873,25.92
874,25.95
875,25.97
876,25.99
877,25.99
878,25.99
879,25.99
880,26.00
881,26.00
882,25.98
883,25.95
884,25.93
885,25.92
886,25.93
887,25.92
888,25.89
889,25.86
890,25.85
891,25.83
892,25.80
893,25.76
894,25.71
895,25.66
896,25.61
897,25.57
898,25.51
899,25.46
900,25.40
901,25.35
902,25.31
903,25.28
904,25.27
905,25.27
906,25.29
907,25.32
908,25.35
909,25.38
910,25.42
911,25.47
912,25.52
913,25.57
914,25.60
915,25.63
916,25.67
917,25.68
918,25.67
919,25.66
920,25.65
921,25.64
922,25.65
923,25.65
924,25.65
925,25.66
926,25.67
927,25.69
928,25.71
929,25.73
930,25.74
931,25.74
932,25.74
933,25.73
934,25.73
935,25.73
936,25.72
937,25.70
938,25.68
939,25.66
940,25.63
941,25.62
942,25.59
943,25.56
944,25.52
945,25.49
946,25.47
947,25.47
948,25.45
949,25.43
950,25.40
951,25.38
952,25.38
953,25.38
954,25.36
955,25.34
956,25.33
957,25.31
958,25.30
959,25.28
960,25.27
961,25.24
962,25.20
963,25.16
964,25.14
965,25.12
966,25.10
967,25.09
968,25.09
969,25.09
970,25.08
971,25.07
972,25.08
973,25.10
974,25.13
975,25.15
976,25.17
977,25.18
978,25.22
979,25.25
980,25.28
981,25.31
982,25.37
983,25.42
984,25.47
985,25.49
986,25.51
987,25.53
988,25.56
989,25.59
990,25.60
991,25.60
992,25.60
993,25.61
994,25.62
995,25.63
996,25.64
997,25.67
998,25.72
999,25.76
1000,25.79
1001,25.81
1002,25.84
1003,25.87
1004,25.89
1005,25.90
1006,25.91
1007,25.92
1008,25.92
1009,25.91
1010,25.86
1011,25.82
1012,25.76
1013,25.72
1014,25.67
1015,25.63
1016,25.57
1017,25.51
1018,25.46
1019,25.42
1020,25.40
1021,25.38
1022,25.38
1023,25.40
1024,25.42
1025,25.44
1026,25.47
1027,25.52
1028,25.60
1029,25.67
1030,25.72
1031,25.78
1032,25.85
1033,25.92
1034,25.96
1035,26.00
1036,26.03
1037,26.06
1038,26.08
1039,26.09
1040,26.10
1041,26.10
1042,26.11
1043,26.10
1044,26.08
1045,26.08
1046,26.08
1047,26.06
1048,26.04
1049,26.02
1050,26.01
1051,26.01
1052,26.01
1053,26.00
1054,25.99
1055,25.99
1056,26.00
1057,26.02
1058,26.02
1059,26.03
1060,26.03
1061,26.04
1062,26.04
1063,26.03
1064,26.02
1065,26.00
1066,25.99
1067,25.96
1068,25.93
1069,25.90
1070,25.88
1071,25.86
1072,25.85
1073,25.83
1074,25.83
1075,25.83
1076,25.85
1077,25.87
1078,25.90
1079,25.93
1080,25.96
1081,25.99
1082,26.00
1083,26.02
1084,26.02
1085,26.02
1086,26.02
1087,26.02
1088,26.00
1089,25.98
1090,25.94
1091,25.89
1092,25.85
1093,25.80
1094,25.77
1095,25.75
1096,25.73
1097,25.70
1098,25.69
1099,25.69
1100,25.71
1101,25.74
1102,25.76
1103,25.79
1104,25.83
1105,25.89
1106,25.94
1107,25.99
1108,26.02
1109,26.06
1110,26.09
1111,26.12
1112,26.12
1113,26.12
1114,26.10
1115,26.08
1116,26.05
1117,26.02
1118,25.99
1119,25.97
1120,25.95
1121,25.93
1122,25.91
1123,25.88
1124,25.86
1125,25.85
1126,25.84
1127,25.84
1128,25.83
1129,25.81
1130,25.79
1131,25.79
1132,25.78
1133,25.75
1134,25.71
1135,25.67
1136,25.65
1137,25.63
1138,25.60
1139,25.56
1140,25.53
1141,25.50
1142,25.50
1143,25.51
1144,25.52
1145,25.54
1146,25.55
1147,25.57
1148,25.57
1149,25.60
1150,25.62
1151,25.65
1152,25.67
1153,25.68
1154,25.69
1155,25.71
1156,25.73
1157,25.75
1158,25.76
1159,25.79
1160,25.83
1161,25.88
1162,25.92
1163,25.96
1164,25.99
1165,26.04
1166,26.08
1167,26.13
1168,26.17
1169,26.21
1170,26.26
1171,26.31
1172,26.37
1173,26.44
1174,26.50
1175,26.57
1176,26.63
1177,26.67
1178,26.72
1179,26.78
1180,26.83
1181,26.89
1182,26.92
1183,26.94
1184,26.94
1185,26.92
1186,26.89
1187,26.85
1188,26.79
1189,26.80
1190,26.72
1191,26.54
1192,26.37
1193,25.87
1194,26.47
1195,28.25
1196,27.90
1197,23.27
1198,21.01
1199,31.77
1200,38.96
