1,125.98
2,166.66
3,142.30
4,88.20
5,44.62
6,13.52
7,-26.28
8,-79.86
9,-137.21
10,-186.61
11,-220.37
12,-229.52
13,-206.73
14,-152.98
15,-76.11
16,7.48
17,83.65
18,137.33
19,163.51
20,160.77
21,135.86
22,95.83
23,48.00
24,-2.96
25,-55.73
26,-108.83
27,-161.47
28,-209.59
29,-247.62
30,-269.74
31,-271.00
32,-252.23
33,-216.64
34,-174.10
35,-133.12
36,-103.09
37,-87.13
38,-85.51
39,-93.54
40,-105.65
41,-116.33
42,-121.77
43,-121.73
44,-117.28
45,-112.15
46,-108.18
47,-107.42
48,-109.28
49,-112.85
50,-116.61
51,-119.23
52,-120.42
53,-120.33
54,-119.69
55,-118.90
56,-118.19
57,-117.74
58,-117.68
59,-117.95
60,-118.23
61,-118.23
62,-117.98
63,-117.74
64,-117.55
65,-117.34
66,-116.85
67,-116.18
68,-115.33
69,-114.38
70,-113.10
71,-111.72
72,-110.35
73,-109.41
74,-108.73
75,-108.37
76,-107.88
77,-107.21
78,-105.99
79,-104.37
80,-102.26
81,-99.91
82,-97.17
83,-94.33
84,-91.46
85,-89.11
86,-87.25
87,-85.88
88,-84.53
89,-83.19
90,-81.57
91,-79.96
92,-78.00
93,-75.93
94,-73.55
95,-71.17
96,-68.82
97,-66.96
98,-65.58
99,-64.91
100,-64.61
101,-64.67
102,-64.85
103,-65.16
104,-65.25
105,-65.06
106,-64.36
107,-63.42
108,-62.32
109,-61.40
110,-60.61
111,-59.94
112,-59.08
113,-58.17
114,-57.10
115,-55.97
116,-54.44
117,-52.55
118,-50.20
119,-47.88
120,-45.56
121,-43.46
122,-41.23
123,-39.18
124,-37.14
125,-35.28
126,-33.14
127,-30.82
128,-28.26
129,-25.88
130,-23.62
131,-21.79
132,-20.20
133,-19.04
134,-18.10
135,-17.43
136,-16.85
137,-16.42
138,-15.90
139,-15.26
140,-14.13
141,-12.73
142,-11.11
143,-9.67
144,-8.51
145,-7.81
146,-7.48
147,-7.51
148,-7.72
149,-8.03
150,-8.09
151,-7.84
152,-7.26
153,-6.53
154,-5.86
155,-5.37
156,-5.10
157,-5.10
158,-5.46
159,-6.20
160,-7.17
161,-8.15
162,-8.85
163,-9.34
164,-9.77
165,-10.22
166,-10.68
167,-11.17
168,-11.75
169,-12.45
170,-13.24
171,-13.95
172,-14.62
173,-15.29
174,-16.17
175,-17.09
176,-18.10
177,-19.04
178,-20.05
179,-20.97
180,-21.82
181,-22.52
182,-23.25
183,-23.93
184,-24.54
185,-24.99
186,-25.57
187,-26.25
188,-27.04
189,-27.74
190,-28.47
191,-29.14
192,-29.91
193,-30.61
194,-31.31
195,-31.98
196,-32.81
197,-33.78
198,-34.85
199,-35.80
200,-36.50
201,-36.96
202,-37.38
203,-37.60
204,-37.51
205,-37.05
206,-36.38
207,-35.61
208,-34.79
209,-34.06
210,-33.72
211,-33.72
212,-33.81
213,-33.84
214,-33.78
215,-33.78
216,-33.84
217,-33.81
218,-33.66
219,-33.69
220,-34.15
221,-34.82
222,-35.40
223,-35.71
224,-35.86
225,-35.80
226,-35.40
227,-34.70
228,-34.06
229,-33.72
230,-33.87
231,-34.39
232,-35.22
233,-36.19
234,-37.05
235,-37.54
236,-37.63
237,-37.32
238,-36.83
239,-36.35
240,-36.13
241,-36.10
242,-36.22
243,-36.47
244,-36.99
245,-37.66
246,-38.48
247,-39.22
248,-39.83
249,-40.28
250,-40.65
251,-40.86
252,-41.05
253,-41.26
254,-41.66
255,-42.11
256,-42.63
257,-43.09
258,-43.58
259,-44.04
260,-44.49
261,-44.71
262,-44.71
263,-44.43
264,-44.10
265,-43.85
266,-43.82
267,-44.04
268,-44.59
269,-45.29
270,-46.14
271,-47.09
272,-48.22
273,-49.44
274,-50.54
275,-51.24
276,-51.51
277,-51.45
278,-51.39
279,-51.42
280,-51.42
281,-51.18
282,-50.69
283,-50.20
284,-49.96
285,-49.99
286,-49.96
287,-49.71
288,-49.35
289,-49.10
290,-49.04
291,-49.04
292,-48.92
293,-48.71
294,-48.55
295,-48.55
296,-48.49
297,-48.28
298,-47.97
299,-47.73
300,-47.52
301,-47.27
302,-47.00
303,-46.72
304,-46.60
305,-46.60
306,-46.69
307,-46.69
308,-46.54
309,-46.30
310,-46.14
311,-46.14
312,-46.20
313,-46.42
314,-47.00
315,-47.94
316,-49.19
317,-50.42
318,-51.42
319,-52.09
320,-52.64
321,-53.10
322,-53.56
323,-54.02
324,-54.57
325,-55.27
326,-56.27
327,-57.43
328,-58.78
329,-60.21
330,-61.80
331,-63.20
332,-64.24
333,-64.70
334,-64.82
335,-64.79
336,-64.73
337,-64.48
338,-64.09
339,-63.84
340,-64.00
341,-64.48
342,-64.88
343,-64.91
344,-64.61
345,-64.12
346,-63.42
347,-62.47
348,-61.34
349,-60.42
350,-59.72
351,-59.23
352,-58.75
353,-58.35
354,-57.98
355,-57.46
356,-56.55
357,-55.45
358,-54.32
359,-53.31
360,-52.19
361,-51.03
362,-50.14
363,-49.62
364,-49.26
365,-48.86
366,-48.37
367,-48.13
368,-48.03
369,-48.07
370,-48.07
371,-48.10
372,-48.10
373,-48.07
374,-48.03
375,-48.07
376,-48.19
377,-48.43
378,-48.68
379,-48.89
380,-49.22
381,-49.71
382,-50.26
383,-50.75
384,-51.15
385,-51.33
386,-51.42
387,-51.42
388,-51.45
389,-51.67
390,-52.22
391,-53.19
392,-54.53
393,-55.97
394,-57.28
395,-58.26
396,-58.87
397,-59.08
398,-58.90
399,-58.41
400,-57.83
401,-57.31
402,-57.07
403,-57.07
404,-57.28
405,-57.56
406,-57.62
407,-57.40
408,-56.85
409,-56.15
410,-55.30
411,-54.35
412,-53.22
413,-52.06
414,-50.84
415,-49.68
416,-48.34
417,-46.91
418,-45.53
419,-44.62
420,-44.01
421,-43.58
422,-42.94
423,-42.27
424,-41.60
425,-41.14
426,-40.68
427,-40.25
428,-39.83
429,-39.58
430,-39.46
431,-39.49
432,-39.58
433,-39.86
434,-40.16
435,-40.44
436,-40.50
437,-40.22
438,-39.67
439,-38.97
440,-38.18
441,-37.20
442,-36.01
443,-34.82
444,-33.97
445,-33.66
446,-33.97
447,-34.73
448,-35.89
449,-37.32
450,-38.76
451,-40.01
452,-40.95
453,-41.41
454,-41.23
455,-40.53
456,-39.55
457,-38.54
458,-37.63
459,-36.93
460,-36.56
461,-36.53
462,-36.77
463,-37.26
464,-38.06
465,-39.00
466,-39.89
467,-40.62
468,-41.32
469,-41.99
470,-42.69
471,-43.46
472,-44.31
473,-45.23
474,-46.14
475,-46.91
476,-47.45
477,-47.67
478,-47.49
479,-47.00
480,-46.42
481,-45.68
482,-44.71
483,-43.52
484,-42.33
485,-41.38
486,-40.53
487,-39.61
488,-38.45
489,-37.29
490,-36.10
491,-34.91
492,-33.57
493,-32.17
494,-30.73
495,-29.30
496,-27.74
497,-26.09
498,-24.38
499,-22.95
500,-21.85
501,-21.15
502,-20.81
503,-20.81
504,-21.06
505,-21.58
506,-22.28
507,-23.01
508,-23.50
509,-23.77
510,-23.90
511,-24.11
512,-24.41
513,-24.66
514,-24.87
515,-25.05
516,-25.42
517,-25.91
518,-26.49
519,-26.95
520,-27.28
521,-27.44
522,-27.80
523,-28.50
524,-29.66
525,-31.10
526,-32.65
527,-34.09
528,-35.40
529,-36.56
530,-37.66
531,-38.60
532,-39.52
533,-40.44
534,-41.47
535,-42.69
536,-44.04
537,-45.20
538,-46.08
539,-46.51
540,-46.81
541,-47.03
542,-47.21
543,-47.18
544,-47.09
545,-47.06
546,-47.30
547,-47.76
548,-48.43
549,-49.13
550,-49.93
551,-50.84
552,-52.00
553,-53.25
554,-54.35
555,-54.99
556,-55.36
557,-55.57
558,-55.97
559,-56.40
560,-56.82
561,-57.28
562,-58.14
563,-59.27
564,-60.61
565,-61.83
566,-62.96
567,-63.87
568,-64.64
569,-65.09
570,-65.37
571,-65.61
572,-65.89
573,-66.10
574,-66.22
575,-66.19
576,-66.22
577,-66.19
578,-66.13
579,-65.86
580,-65.58
581,-65.58
582,-66.01
583,-66.68
584,-67.44
585,-68.18
586,-69.03
587,-69.95
588,-70.92
589,-71.84
590,-73.03
591,-74.43
592,-76.05
593,-77.45
594,-78.61
595,-79.59
596,-80.54
597,-81.18
598,-81.45
599,-81.45
600,-81.60
601,-82.03
602,-82.61
603,-83.13
604,-83.71
605,-84.35
606,-85.11
607,-85.88
608,-86.58
609,-87.04
610,-87.13
611,-86.88
612,-86.55
613,-86.27
614,-86.06
615,-85.82
616,-85.69
617,-85.69
618,-85.75
619,-85.75
620,-85.63
621,-85.39
622,-85.02
623,-84.56
624,-83.98
625,-83.50
626,-83.28
627,-83.53
628,-84.17
629,-84.93
630,-85.39
631,-85.42
632,-84.99
633,-84.26
634,-83.22
635,-82.03
636,-80.84
637,-79.86
638,-79.25
639,-79.01
640,-79.13
641,-79.65
642,-80.41
643,-81.12
644,-81.57
645,-81.85
646,-81.97
647,-81.97
648,-81.70
649,-81.24
650,-80.75
651,-80.47
652,-80.47
653,-80.72
654,-81.24
655,-81.97
656,-82.82
657,-83.53
658,-83.95
659,-84.20
660,-84.44
661,-84.66
662,-84.81
663,-84.81
664,-84.81
665,-85.02
666,-85.51
667,-86.00
668,-86.27
669,-86.27
670,-86.12
671,-85.88
672,-85.51
673,-85.02
674,-84.56
675,-84.32
676,-84.35
677,-84.59
678,-84.96
679,-85.45
680,-86.09
681,-86.82
682,-87.43
683,-87.68
684,-87.46
685,-87.01
686,-86.36
687,-85.60
688,-84.81
689,-84.11
690,-83.65
691,-83.40
692,-83.13
693,-82.70
694,-82.12
695,-81.36
696,-80.38
697,-79.44
698,-78.83
699,-78.80
700,-79.25
701,-80.05
702,-80.99
703,-81.97
704,-82.67
705,-82.95
706,-82.73
707,-82.24
708,-81.54
709,-80.84
710,-80.20
711,-79.74
712,-79.35
713,-78.92
714,-78.19
715,-77.27
716,-76.05
717,-74.68
718,-72.91
719,-71.01
720,-69.06
721,-67.44
722,-65.95
723,-64.61
724,-62.96
725,-61.10
726,-58.84
727,-56.52
728,-53.92
729,-51.39
730,-48.61
731,-46.02
732,-43.52
733,-41.47
734,-39.55
735,-37.69
736,-35.49
737,-33.42
738,-31.46
739,-29.82
740,-28.05
741,-26.49
742,-25.18
743,-24.51
744,-23.93
745,-23.28
746,-22.40
747,-21.45
748,-20.39
749,-19.20
750,-17.88
751,-16.72
752,-15.75
753,-15.05
754,-14.40
755,-13.98
756,-13.79
757,-13.79
758,-13.67
759,-13.49
760,-13.31
761,-13.28
762,-13.24
763,-13.06
764,-12.70
765,-12.18
766,-11.54
767,-10.83
768,-10.22
769,-9.70
770,-9.25
771,-9.06
772,-9.25
773,-9.67
774,-10.07
775,-10.38
776,-10.77
777,-11.17
778,-11.41
779,-11.44
780,-11.60
781,-11.99
782,-12.60
783,-13.37
784,-14.47
785,-15.81
786,-17.43
787,-19.10
788,-21.03
789,-22.86
790,-24.60
791,-26.00
792,-27.37
793,-28.75
794,-30.27
795,-31.68
796,-33.11
797,-34.48
798,-35.98
799,-37.38
800,-38.85
801,-39.98
802,-40.86
803,-41.53
804,-42.42
805,-43.55
806,-44.95
807,-46.39
808,-48.03
809,-49.65
810,-51.18
811,-52.37
812,-53.38
813,-54.05
814,-54.38
815,-54.38
816,-54.26
817,-54.20
818,-54.38
819,-54.63
820,-54.93
821,-55.15
822,-55.27
823,-55.24
824,-55.24
825,-55.21
826,-55.21
827,-55.21
828,-55.27
829,-55.51
830,-55.97
831,-56.73
832,-57.62
833,-58.35
834,-58.72
835,-58.72
836,-58.50
837,-58.23
838,-57.95
839,-57.71
840,-57.59
841,-57.59
842,-57.65
843,-57.65
844,-57.56
845,-57.34
846,-56.92
847,-56.18
848,-55.11
849,-53.92
850,-52.86
851,-52.09
852,-51.67
853,-51.73
854,-52.31
855,-53.22
856,-54.23
857,-55.24
858,-56.37
859,-57.50
860,-58.47
861,-59.27
862,-59.97
863,-60.64
864,-61.07
865,-61.13
866,-60.88
867,-60.33
868,-59.48
869,-58.50
870,-57.89
871,-57.86
872,-58.38
873,-59.11
874,-59.97
875,-60.91
876,-61.95
877,-62.93
878,-63.63
879,-63.84
880,-63.72
881,-63.45
882,-63.26
883,-63.26
884,-63.48
885,-63.96
886,-64.73
887,-65.64
888,-66.68
889,-67.66
890,-68.54
891,-69.24
892,-69.73
893,-69.95
894,-70.04
895,-70.01
896,-70.01
897,-70.01
898,-70.04
899,-70.25
900,-70.86
901,-71.84
902,-72.91
903,-73.64
904,-73.85
905,-73.61
906,-73.03
907,-72.27
908,-71.47
909,-70.77
910,-70.37
911,-70.31
912,-70.68
913,-71.41
914,-72.51
915,-73.70
916,-74.65
917,-75.13
918,-75.41
919,-75.59
920,-75.74
921,-75.74
922,-75.68
923,-75.62
924,-75.81
925,-76.26
926,-77.12
927,-78.06
928,-79.04
929,-79.71
930,-80.26
931,-80.96
932,-82.00
933,-83.16
934,-84.29
935,-85.27
936,-86.27
937,-87.16
938,-87.89
939,-88.38
940,-88.84
941,-89.26
942,-89.72
943,-90.18
944,-90.94
945,-91.83
946,-92.83
947,-93.81
948,-94.91
949,-96.07
950,-97.23
951,-98.18
952,-98.97
953,-99.67
954,-100.34
955,-100.80
956,-101.04
957,-101.04
958,-100.86
959,-100.62
960,-100.28
961,-99.82
962,-99.18
963,-98.45
964,-97.72
965,-97.29
966,-97.11
967,-97.11
968,-97.08
969,-97.11
970,-97.26
971,-97.53
972,-97.60
973,-97.38
974,-96.92
975,-96.44
976,-95.95
977,-95.49
978,-95.03
979,-94.54
980,-94.02
981,-93.57
982,-93.11
983,-92.65
984,-92.04
985,-91.34
986,-90.58
987,-89.90
988,-89.11
989,-88.17
990,-87.07
991,-86.12
992,-85.42
993,-84.96
994,-84.53
995,-84.08
996,-83.53
997,-83.07
998,-82.64
999,-82.21
1000,-81.48
1001,-80.57
1002,-79.47
1003,-78.52
1004,-77.67
1005,-76.97
1006,-76.32
1007,-75.90
1008,-75.59
1009,-75.38
1010,-75.04
1011,-74.86
1012,-74.83
1013,-75.10
1014,-75.29
1015,-75.38
1016,-75.16
1017,-74.68
1018,-73.70
1019,-72.30
1020,-70.59
1021,-68.91
1022,-67.35
1023,-65.89
1024,-64.58
1025,-63.66
1026,-63.23
1027,-63.26
1028,-63.35
1029,-63.39
1030,-63.35
1031,-63.35
1032,-63.26
1033,-63.05
1034,-62.62
1035,-62.16
1036,-61.68
1037,-61.22
1038,-60.70
1039,-60.24
1040,-59.81
1041,-59.33
1042,-58.65
1043,-57.98
1044,-57.40
1045,-56.88
1046,-56.24
1047,-55.57
1048,-55.11
1049,-54.84
1050,-54.50
1051,-54.11
1052,-53.71
1053,-53.44
1054,-53.04
1055,-52.34
1056,-51.48
1057,-50.72
1058,-50.20
1059,-49.71
1060,-49.26
1061,-49.01
1062,-49.19
1063,-49.87
1064,-51.03
1065,-52.49
1066,-54.29
1067,-56.15
1068,-57.98
1069,-59.63
1070,-61.43
1071,-63.29
1072,-65.22
1073,-66.86
1074,-68.36
1075,-69.52
1076,-70.40
1077,-70.83
1078,-70.98
1079,-70.95
1080,-71.04
1081,-71.23
1082,-71.66
1083,-72.36
1084,-73.55
1085,-74.98
1086,-76.35
1087,-77.33
1088,-77.88
1089,-78.09
1090,-78.09
1091,-77.85
1092,-77.36
1093,-76.87
1094,-76.63
1095,-76.63
1096,-76.60
1097,-76.42
1098,-76.05
1099,-75.59
1100,-74.83
1101,-73.67
1102,-71.99
1103,-70.07
1104,-68.05
1105,-66.16
1106,-64.30
1107,-62.65
1108,-61.28
1109,-60.33
1110,-59.66
1111,-59.27
1112,-58.84
1113,-58.38
1114,-57.74
1115,-57.04
1116,-56.27
1117,-55.60
1118,-54.81
1119,-53.86
1120,-52.76
1121,-51.82
1122,-51.09
1123,-50.60
1124,-50.29
1125,-50.05
1126,-49.99
1127,-50.20
1128,-50.75
1129,-51.45
1130,-52.31
1131,-53.25
1132,-54.44
1133,-55.85
1134,-57.50
1135,-59.14
1136,-60.76
1137,-62.16
1138,-63.54
1139,-64.67
1140,-65.73
1141,-66.65
1142,-67.72
1143,-68.82
1144,-70.16
1145,-71.56
1146,-73.33
1147,-75.20
1148,-77.09
1149,-78.74
1150,-80.41
1151,-82.03
1152,-83.59
1153,-84.81
1154,-85.63
1155,-86.06
1156,-86.24
1157,-86.21
1158,-86.18
1159,-86.18
1160,-86.21
1161,-86.21
1162,-86.18
1163,-86.15
1164,-86.24
1165,-86.52
1166,-86.91
1167,-87.16
1168,-86.98
1169,-86.55
1170,-85.97
1171,-85.27
1172,-84.08
1173,-82.46
1174,-80.51
1175,-78.61
1176,-76.63
1177,-74.77
1178,-73.03
1179,-71.90
1180,-71.11
1181,-70.50
1182,-69.37
1183,-67.78
1184,-65.55
1185,-63.02
1186,-59.72
1187,-55.97
1188,-51.67
1189,-47.67
1190,-43.98
1191,-40.99
1192,-37.99
1193,-35.03
1194,-31.62
1195,-28.11
1196,-24.17
1197,-20.20
1198,-15.93
1199,-11.93
1200,-8.09
1201,-5.10
1202,-2.72
1203,-1.13
1204,0.27
1205,1.31
1206,2.32
1207,3.20
1208,4.49
1209,6.10
1210,8.15
1211,10.31
1212,12.51
1213,14.37
1214,15.90
1215,16.82
1216,17.30
1217,17.27
1218,16.85
1219,16.08
1220,15.26
1221,14.56
1222,14.01
1223,13.55
1224,13.00
1225,12.30
1226,11.38
1227,10.47
1228,9.43
1229,8.30
1230,6.71
1231,4.82
1232,2.66
1233,0.61
1234,-1.50
1235,-3.63
1236,-6.01
1237,-8.36
1238,-10.59
1239,-12.45
1240,-14.28
1241,-15.87
1242,-17.36
1243,-18.52
1244,-19.68
1245,-20.78
1246,-22.03
1247,-23.22
1248,-24.51
1249,-25.60
1250,-26.70
1251,-27.62
1252,-28.63
1253,-29.51
1254,-30.36
1255,-31.04
1256,-31.86
1257,-33.02
1258,-34.70
1259,-36.56
1260,-38.64
1261,-40.74
1262,-43.09
1263,-45.44
1264,-47.76
1265,-49.62
1266,-51.24
1267,-52.61
1268,-54.14
1269,-55.48
1270,-56.82
1271,-57.98
1272,-59.33
1273,-60.67
1274,-62.07
1275,-63.23
1276,-64.45
1277,-65.58
1278,-66.74
1279,-67.66
1280,-68.57
1281,-69.52
1282,-70.56
1283,-71.44
1284,-72.27
1285,-73.00
1286,-73.76
1287,-74.46
1288,-74.95
1289,-75.20
1290,-75.38
1291,-75.59
1292,-75.81
1293,-75.81
1294,-75.59
1295,-75.38
1296,-75.20
1297,-74.95
1298,-74.46
1299,-73.76
1300,-72.97
1301,-72.24
1302,-71.50
1303,-70.86
1304,-70.19
1305,-69.46
1306,-68.54
1307,-67.63
1308,-66.74
1309,-66.07
1310,-65.31
1311,-64.36
1312,-63.23
1313,-62.01
1314,-60.79
1315,-59.63
1316,-58.47
1317,-57.53
1318,-56.85
1319,-56.61
1320,-56.76
1321,-57.28
1322,-57.92
1323,-58.44
1324,-58.56
1325,-58.32
1326,-57.86
1327,-57.37
1328,-56.92
1329,-56.46
1330,-55.91
1331,-55.42
1332,-55.11
1333,-55.08
1334,-55.36
1335,-55.88
1336,-56.58
1337,-57.25
1338,-57.89
1339,-58.62
1340,-59.57
1341,-60.76
1342,-62.01
1343,-62.99
1344,-63.66
1345,-64.12
1346,-64.45
1347,-64.67
1348,-64.82
1349,-64.79
1350,-64.70
1351,-64.67
1352,-64.94
1353,-65.40
1354,-66.04
1355,-66.77
1356,-67.54
1357,-68.27
1358,-68.79
1359,-69.03
1360,-69.06
1361,-69.06
1362,-69.06
1363,-69.09
1364,-69.00
1365,-68.76
1366,-68.36
1367,-67.87
1368,-67.38
1369,-66.93
1370,-66.44
1371,-65.98
1372,-65.49
1373,-65.03
1374,-64.48
1375,-63.78
1376,-62.84
1377,-61.86
1378,-61.07
1379,-60.61
1380,-60.33
1381,-60.09
1382,-59.91
1383,-59.91
1384,-60.12
1385,-60.36
1386,-60.52
1387,-60.52
1388,-60.46
1389,-60.49
1390,-60.46
1391,-60.18
1392,-59.69
1393,-59.23
1394,-58.99
1395,-58.99
1396,-58.99
1397,-59.02
1398,-59.20
1399,-59.66
1400,-60.27
1401,-60.79
1402,-61.13
1403,-61.34
1404,-61.52
1405,-61.80
1406,-62.07
1407,-62.32
1408,-62.41
1409,-62.44
1410,-62.38
1411,-62.13
1412,-61.52
1413,-60.61
1414,-59.45
1415,-58.26
1416,-56.88
1417,-55.48
1418,-54.17
1419,-53.19
1420,-52.52
1421,-52.06
1422,-51.76
1423,-51.54
1424,-51.24
1425,-50.78
1426,-50.08
1427,-49.38
1428,-48.71
1429,-48.25
1430,-47.91
1431,-47.70
1432,-47.58
1433,-47.58
1434,-47.70
1435,-47.94
1436,-48.22
1437,-48.49
1438,-48.68
1439,-48.68
1440,-48.37
1441,-47.91
1442,-47.45
1443,-46.97
1444,-46.20
1445,-45.29
1446,-44.37
1447,-43.64
1448,-42.97
1449,-42.30
1450,-41.50
1451,-40.83
1452,-40.16
1453,-39.49
1454,-38.51
1455,-37.35
1456,-36.01
1457,-34.82
1458,-33.78
1459,-32.84
1460,-31.86
1461,-30.91
1462,-30.09
1463,-29.63
1464,-29.45
1465,-29.48
1466,-29.51
1467,-29.54
1468,-29.51
1469,-29.51
1470,-29.48
1471,-29.51
1472,-29.60
1473,-29.82
1474,-30.15
1475,-30.64
1476,-31.34
1477,-32.04
1478,-32.59
1479,-32.81
1480,-32.84
1481,-32.84
1482,-32.90
1483,-32.87
1484,-32.78
1485,-32.71
1486,-33.14
1487,-34.03
1488,-35.49
1489,-37.17
1490,-39.06
1491,-40.92
1492,-42.82
1493,-44.46
1494,-45.96
1495,-47.12
1496,-48.10
1497,-48.77
1498,-49.29
1499,-49.74
1500,-50.35
1501,-51.03
1502,-51.82
1503,-52.52
1504,-53.16
1505,-53.65
1506,-54.02
1507,-54.23
1508,-54.32
1509,-54.32
1510,-54.29
1511,-54.26
1512,-54.29
1513,-54.32
1514,-54.26
1515,-54.02
1516,-53.56
1517,-53.10
1518,-52.73
1519,-52.52
1520,-52.22
1521,-51.76
1522,-51.09
1523,-50.42
1524,-49.59
1525,-48.65
1526,-47.49
1527,-46.30
1528,-45.20
1529,-44.25
1530,-43.33
1531,-42.66
1532,-42.21
1533,-41.99
1534,-41.69
1535,-41.26
1536,-40.62
1537,-39.92
1538,-39.06
1539,-38.12
1540,-37.11
1541,-36.38
1542,-36.13
1543,-36.38
1544,-36.90
1545,-37.41
1546,-37.81
1547,-38.02
1548,-38.09
1549,-38.09
1550,-38.18
1551,-38.36
1552,-38.76
1553,-39.49
1554,-40.65
1555,-42.08
1556,-43.55
1557,-44.77
1558,-45.75
1559,-46.39
1560,-46.78
1561,-47.03
1562,-47.39
1563,-47.82
1564,-48.22
1565,-48.46
1566,-48.80
1567,-49.22
1568,-49.77
1569,-50.26
1570,-50.69
1571,-51.15
1572,-51.73
1573,-52.46
1574,-53.28
1575,-53.99
1576,-54.47
1577,-54.75
1578,-54.81
1579,-54.57
1580,-53.86
1581,-52.92
1582,-51.97
1583,-51.27
1584,-50.63
1585,-49.93
1586,-49.10
1587,-48.40
1588,-47.88
1589,-47.42
1590,-46.69
1591,-45.78
1592,-44.83
1593,-44.10
1594,-43.49
1595,-43.06
1596,-42.79
1597,-42.79
1598,-42.91
1599,-42.94
1600,-42.69
1601,-42.18
1602,-41.63
1603,-41.11
1604,-40.74
1605,-40.56
1606,-40.50
1607,-40.47
1608,-40.44
1609,-40.44
1610,-40.65
1611,-41.11
1612,-41.69
1613,-42.18
1614,-42.60
1615,-43.06
1616,-43.58
1617,-44.07
1618,-44.46
1619,-44.68
1620,-44.83
1621,-45.07
1622,-45.50
1623,-45.96
1624,-46.36
1625,-46.57
1626,-46.78
1627,-47.00
1628,-47.24
1629,-47.49
1630,-47.82
1631,-48.28
1632,-48.92
1633,-49.59
1634,-50.42
1635,-51.36
1636,-52.52
1637,-53.68
1638,-54.75
1639,-55.73
1640,-56.82
1641,-57.98
1642,-59.05
1643,-59.78
1644,-60.24
1645,-60.46
1646,-60.39
1647,-60.15
1648,-59.91
1649,-59.91
1650,-60.12
1651,-60.36
1652,-60.55
1653,-60.82
1654,-61.28
1655,-61.71
1656,-61.92
1657,-61.95
1658,-62.07
1659,-62.23
1660,-62.32
1661,-62.35
1662,-62.59
1663,-63.05
1664,-63.48
1665,-63.72
1666,-64.03
1667,-64.45
1668,-65.00
1669,-65.52
1670,-65.98
1671,-66.47
1672,-66.86
1673,-67.08
1674,-67.14
1675,-67.14
1676,-67.20
1677,-67.17
1678,-66.99
1679,-66.53
1680,-65.89
1681,-65.12
1682,-64.30
1683,-63.63
1684,-63.23
1685,-62.93
1686,-62.62
1687,-62.41
1688,-62.56
1689,-63.02
1690,-63.51
1691,-63.75
1692,-63.93
1693,-64.15
1694,-64.33
1695,-64.36
1696,-64.21
1697,-63.93
1698,-63.66
1699,-63.66
1700,-64.09
1701,-64.79
1702,-65.64
1703,-66.38
1704,-66.99
1705,-67.44
1706,-67.72
1707,-67.72
1708,-67.50
1709,-67.20
1710,-67.08
1711,-67.35
1712,-68.05
1713,-69.00
1714,-69.95
1715,-70.68
1716,-71.23
1717,-71.44
1718,-71.29
1719,-70.80
1720,-70.28
1721,-70.01
1722,-70.07
1723,-70.31
1724,-70.68
1725,-71.17
1726,-71.75
1727,-72.24
1728,-72.39
1729,-72.17
1730,-71.66
1731,-70.92
1732,-69.95
1733,-69.03
1734,-68.27
1735,-67.81
1736,-67.38
1737,-66.93
1738,-66.50
1739,-66.25
1740,-66.10
1741,-65.89
1742,-65.52
1743,-65.03
1744,-64.45
1745,-64.00
1746,-63.63
1747,-63.42
1748,-63.29
1749,-63.29
1750,-63.42
1751,-63.66
1752,-63.96
1753,-64.21
1754,-64.30
1755,-64.30
1756,-64.30
1757,-64.30
1758,-64.24
1759,-63.96
1760,-63.60
1761,-63.39
1762,-63.45
1763,-63.66
1764,-63.84
1765,-63.87
1766,-63.84
1767,-63.81
1768,-63.69
1769,-63.48
1770,-63.29
1771,-63.29
1772,-63.39
1773,-63.42
1774,-63.20
1775,-62.74
1776,-61.95
1777,-61.00
1778,-59.94
1779,-58.99
1780,-58.26
1781,-57.77
1782,-57.43
1783,-57.22
1784,-57.13
1785,-57.16
1786,-57.07
1787,-56.82
1788,-56.49
1789,-56.27
1790,-56.18
1791,-56.18
1792,-56.15
1793,-56.18
1794,-56.34
1795,-56.58
1796,-56.64
1797,-56.43
1798,-56.00
1799,-55.51
1800,-54.90
1801,-54.20
1802,-53.50
1803,-52.98
1804,-52.73
1805,-52.76
1806,-52.98
1807,-53.19
1808,-53.41
1809,-53.68
1810,-54.02
1811,-54.23
1812,-54.17
1813,-53.92
1814,-53.86
1815,-54.05
1816,-54.44
1817,-54.96
1818,-55.60
1819,-56.27
1820,-56.98
1821,-57.71
1822,-58.56
1823,-59.51
1824,-60.42
1825,-61.13
1826,-61.74
1827,-62.44
1828,-63.35
1829,-64.30
1830,-65.16
1831,-65.64
1832,-65.77
1833,-65.52
1834,-64.91
1835,-63.93
1836,-62.77
1837,-61.80
1838,-61.22
1839,-61.00
1840,-60.88
1841,-60.70
1842,-60.27
1843,-59.54
1844,-58.41
1845,-57.01
1846,-55.45
1847,-53.99
1848,-52.70
1849,-51.79
1850,-51.12
1851,-50.69
1852,-50.17
1853,-49.47
1854,-48.52
1855,-47.58
1856,-46.72
1857,-45.99
1858,-45.41
1859,-45.20
1860,-45.44
1861,-46.17
1862,-47.09
1863,-47.82
1864,-48.25
1865,-48.52
1866,-48.65
1867,-48.65
1868,-48.37
1869,-47.91
1870,-47.45
1871,-47.18
1872,-47.12
1873,-47.15
1874,-47.18
1875,-47.18
1876,-47.09
1877,-46.84
1878,-46.45
1879,-45.96
1880,-45.44
1881,-44.98
1882,-44.53
1883,-44.04
1884,-43.55
1885,-43.09
1886,-42.69
1887,-42.42
1888,-42.36
1889,-42.60
1890,-43.27
1891,-44.22
1892,-45.26
1893,-46.23
1894,-47.12
1895,-47.82
1896,-48.19
1897,-47.97
1898,-47.18
1899,-45.93
1900,-44.56
1901,-43.30
1902,-42.54
1903,-42.27
1904,-42.57
1905,-43.27
1906,-44.37
1907,-45.81
1908,-47.55
1909,-49.19
1910,-50.66
1911,-51.82
1912,-53.04
1913,-54.41
1914,-56.00
1915,-57.46
1916,-58.75
1917,-59.63
1918,-60.27
1919,-60.76
1920,-61.28
1921,-61.71
1922,-62.04
1923,-62.26
1924,-62.59
1925,-63.05
1926,-63.63
1927,-64.12
1928,-64.45
1929,-64.67
1930,-64.85
1931,-65.09
1932,-65.40
1933,-65.64
1934,-65.80
1935,-65.80
1936,-65.67
1937,-65.43
1938,-65.03
1939,-64.54
1940,-64.09
1941,-63.84
1942,-63.87
1943,-64.15
1944,-64.45
1945,-64.70
1946,-64.82
1947,-64.82
1948,-64.64
1949,-64.15
1950,-63.39
1951,-62.44
1952,-61.43
1953,-60.46
1954,-59.48
1955,-58.53
1956,-57.74
1957,-57.28
1958,-57.04
1959,-57.07
1960,-57.28
1961,-57.77
1962,-58.47
1963,-59.17
1964,-59.78
1965,-60.27
1966,-60.73
1967,-61.19
1968,-61.55
1969,-61.83
1970,-62.07
1971,-62.26
1972,-62.44
1973,-62.68
1974,-63.17
1975,-63.87
1976,-64.67
1977,-65.40
1978,-66.07
1979,-66.77
1980,-67.47
1981,-67.96
1982,-68.15
1983,-68.12
1984,-68.18
1985,-68.39
1986,-68.73
1987,-68.97
1988,-69.15
1989,-69.40
1990,-69.67
1991,-69.92
1992,-70.01
1993,-70.04
1994,-70.04
1995,-70.01
1996,-69.89
1997,-69.67
1998,-69.43
1999,-69.15
2000,-68.88
2001,-68.63
2002,-68.60
2003,-68.82
2004,-69.24
2005,-69.76
2006,-70.31
2007,-70.77
2008,-70.98
2009,-71.01
2010,-70.98
2011,-70.95
2012,-70.80
2013,-70.62
2014,-70.50
2015,-70.47
2016,-70.37
2017,-70.16
2018,-69.95
2019,-69.64
2020,-69.21
2021,-68.76
2022,-68.57
2023,-68.79
2024,-69.24
2025,-69.73
2026,-70.34
2027,-71.04
2028,-71.75
2029,-72.24
2030,-72.54
2031,-72.72
2032,-73.03
2033,-73.52
2034,-74.19
2035,-74.92
2036,-75.53
2037,-76.02
2038,-76.45
2039,-76.66
2040,-76.51
2041,-76.05
2042,-75.44
2043,-74.95
2044,-74.58
2045,-74.37
2046,-74.25
2047,-74.25
2048,-74.28
2049,-74.31
2050,-74.25
2051,-74.01
2052,-73.55
2053,-73.09
2054,-72.75
2055,-72.51
2056,-72.14
2057,-71.72
2058,-71.26
2059,-70.74
2060,-70.10
2061,-69.43
2062,-68.82
2063,-68.30
2064,-67.81
2065,-67.38
2066,-67.02
2067,-66.77
2068,-66.47
2069,-66.04
2070,-65.43
2071,-64.70
2072,-63.84
2073,-62.87
2074,-61.89
2075,-61.22
2076,-60.82
2077,-60.58
2078,-60.24
2079,-59.78
2080,-59.36
2081,-59.08
2082,-58.93
2083,-58.96
2084,-59.23
2085,-59.69
2086,-60.21
2087,-60.70
2088,-61.31
2089,-62.01
2090,-62.65
2091,-62.90
2092,-62.74
2093,-62.44
2094,-62.41
2095,-62.65
2096,-63.02
2097,-63.26
2098,-63.45
2099,-63.66
2100,-63.96
2101,-64.21
2102,-64.30
2103,-64.30
2104,-64.36
2105,-64.58
2106,-64.91
2107,-65.16
2108,-65.31
2109,-65.25
2110,-65.19
2111,-65.19
2112,-65.34
2113,-65.58
2114,-65.86
2115,-66.07
2116,-66.31
2117,-66.77
2118,-67.57
2119,-68.57
2120,-69.49
2121,-70.22
2122,-70.77
2123,-71.23
2124,-71.66
2125,-71.87
2126,-71.84
2127,-71.59
2128,-71.35
2129,-71.08
2130,-70.74
2131,-70.25
2132,-69.82
2133,-69.55
2134,-69.52
2135,-69.79
2136,-70.31
2137,-71.04
2138,-71.84
2139,-72.57
2140,-73.12
2141,-73.36
2142,-73.21
2143,-72.72
2144,-72.02
2145,-71.32
2146,-70.62
2147,-69.89
2148,-69.12
2149,-68.45
2150,-67.84
2151,-67.38
2152,-66.86
2153,-66.41
2154,-66.01
2155,-65.83
2156,-65.61
2157,-65.12
2158,-64.24
2159,-63.08
2160,-61.71
2161,-60.27
2162,-58.69
2163,-57.28
2164,-56.27
2165,-55.76
2166,-55.60
2167,-55.66
2168,-55.88
2169,-56.09
2170,-56.12
2171,-55.91
2172,-55.60
2173,-55.33
2174,-55.02
2175,-54.84
2176,-54.84
2177,-55.05
2178,-55.33
2179,-55.60
2180,-55.88
2181,-56.12
2182,-56.21
2183,-55.97
2184,-55.36
2185,-54.63
2186,-54.02
2187,-53.50
2188,-53.07
2189,-52.83
2190,-53.07
2191,-53.74
2192,-54.72
2193,-55.73
2194,-56.73
2195,-57.68
2196,-58.41
2197,-58.87
2198,-59.20
2199,-59.66
2200,-60.42
2201,-61.40
2202,-62.38
2203,-63.11
2204,-63.57
2205,-63.78
2206,-63.78
2207,-63.54
2208,-63.17
2209,-62.65
2210,-62.07
2211,-61.61
2212,-61.31
2213,-61.10
2214,-60.76
2215,-60.27
2216,-59.72
2217,-59.23
2218,-58.84
2219,-58.35
2220,-57.77
2221,-57.28
2222,-57.13
2223,-57.34
2224,-57.83
2225,-58.35
2226,-58.81
2227,-59.27
2228,-59.81
2229,-60.52
2230,-61.43
2231,-62.38
2232,-63.32
2233,-64.00
2234,-64.51
2235,-64.97
2236,-65.64
2237,-66.31
2238,-66.93
2239,-67.38
2240,-68.02
2241,-68.91
2242,-70.07
2243,-71.04
2244,-71.81
2245,-72.20
2246,-72.51
2247,-72.72
2248,-73.09
2249,-73.52
2250,-74.10
2251,-74.80
2252,-75.78
2253,-76.97
2254,-78.28
2255,-79.47
2256,-80.51
2257,-81.18
2258,-81.57
2259,-81.79
2260,-82.09
2261,-82.52
2262,-83.22
2263,-83.92
2264,-84.66
2265,-85.36
2266,-86.12
2267,-86.82
2268,-87.43
2269,-87.92
2270,-88.29
2271,-88.50
2272,-88.56
2273,-88.56
2274,-88.62
2275,-88.87
2276,-89.23
2277,-89.48
2278,-89.51
2279,-89.26
2280,-88.87
2281,-88.35
2282,-87.80
2283,-87.34
2284,-87.10
2285,-87.10
2286,-87.16
2287,-87.19
2288,-87.19
2289,-87.13
2290,-87.10
2291,-87.10
2292,-87.28
2293,-87.49
2294,-87.59
2295,-87.59
2296,-87.77
2297,-88.20
2298,-88.84
2299,-89.57
2300,-90.52
2301,-91.71
2302,-93.02
2303,-94.21
2304,-95.25
2305,-95.95
2306,-96.31
2307,-96.28
2308,-96.07
2309,-95.76
2310,-95.67
2311,-95.92
2312,-96.59
2313,-97.53
2314,-98.60
2315,-99.82
2316,-101.23
2317,-102.66
2318,-103.88
2319,-104.58
2320,-104.86
2321,-104.83
2322,-104.74
2323,-104.46
2324,-104.00
2325,-103.55
2326,-103.27
2327,-103.24
2328,-103.36
2329,-103.64
2330,-104.16
2331,-104.86
2332,-105.47
2333,-105.74
2334,-105.65
2335,-105.13
2336,-104.28
2337,-103.33
2338,-102.48
2339,-101.99
2340,-101.87
2341,-102.14
2342,-102.75
2343,-103.52
2344,-104.03
2345,-104.03
2346,-103.49
2347,-102.78
2348,-102.11
2349,-101.62
2350,-101.20
2351,-101.01
2352,-101.10
2353,-101.35
2354,-101.32
2355,-100.86
2356,-100.16
2357,-99.43
2358,-98.57
2359,-97.66
2360,-96.68
2361,-95.95
2362,-95.49
2363,-95.28
2364,-95.25
2365,-95.28
2366,-95.18
2367,-94.94
2368,-94.51
2369,-94.06
2370,-93.63
2371,-93.38
2372,-93.23
2373,-93.29
2374,-93.44
2375,-93.44
2376,-92.99
2377,-92.07
2378,-90.79
2379,-89.32
2380,-87.68
2381,-86.03
2382,-84.56
2383,-83.59
2384,-83.13
2385,-83.16
2386,-83.62
2387,-84.38
2388,-85.08
2389,-85.57
2390,-85.82
2391,-86.06
2392,-86.36
2393,-86.58
2394,-86.64
2395,-86.64
2396,-86.88
2397,-87.34
2398,-87.77
2399,-87.80
2400,-87.43
2401,-86.91
2402,-86.40
2403,-85.97
2404,-85.51
2405,-85.02
2406,-84.50
2407,-84.05
2408,-83.62
2409,-83.16
2410,-82.46
2411,-81.79
2412,-81.21
2413,-80.75
2414,-80.05
2415,-79.19
2416,-78.06
2417,-76.87
2418,-75.41
2419,-73.79
2420,-72.02
2421,-70.34
2422,-68.70
2423,-67.32
2424,-66.13
2425,-65.22
2426,-64.30
2427,-63.42
2428,-62.29
2429,-61.19
2430,-59.78
2431,-58.17
2432,-56.00
2433,-53.68
2434,-51.18
2435,-48.83
2436,-46.33
2437,-44.04
2438,-41.84
2439,-39.95
2440,-38.06
2441,-36.16
2442,-34.33
2443,-32.90
2444,-31.86
2445,-31.19
2446,-30.70
2447,-30.49
2448,-30.46
2449,-30.73
2450,-31.16
2451,-31.65
2452,-32.10
2453,-32.59
2454,-33.14
2455,-33.84
2456,-34.73
2457,-35.68
2458,-36.71
2459,-37.66
2460,-38.48
2461,-39.15
2462,-39.89
2463,-40.59
2464,-41.26
2465,-41.69
2466,-42.08
2467,-42.54
2468,-43.30
2469,-44.22
2470,-45.29
2471,-46.20
2472,-47.09
2473,-47.79
2474,-48.34
2475,-48.52
2476,-48.52
2477,-48.49
2478,-48.83
2479,-49.50
2480,-50.48
2481,-51.67
2482,-53.25
2483,-55.18
2484,-57.19
2485,-58.84
2486,-60.12
2487,-61.04
2488,-61.86
2489,-62.53
2490,-63.14
2491,-63.60
2492,-64.09
2493,-64.51
2494,-64.94
2495,-65.16
2496,-65.31
2497,-65.28
2498,-65.16
2499,-64.88
2500,-64.67
2501,-64.61
2502,-64.97
2503,-65.67
2504,-66.74
2505,-67.90
2506,-69.18
2507,-70.37
2508,-71.47
2509,-72.17
2510,-72.42
2511,-72.39
2512,-72.51
2513,-72.94
2514,-73.73
2515,-74.71
2516,-75.87
2517,-77.03
2518,-78.19
2519,-79.13
2520,-79.90
2521,-80.35
2522,-80.51
2523,-80.47
2524,-80.54
2525,-80.75
2526,-81.21
2527,-81.70
2528,-82.09
2529,-82.31
2530,-82.46
2531,-82.43
2532,-82.31
2533,-82.03
2534,-81.82
2535,-81.82
2536,-82.09
2537,-82.55
2538,-83.13
2539,-83.89
2540,-84.81
2541,-85.75
2542,-86.49
2543,-87.01
2544,-87.37
2545,-87.59
2546,-87.52
2547,-87.07
2548,-86.27
2549,-85.30
2550,-84.26
2551,-83.28
2552,-82.46
2553,-82.00
2554,-81.97
2555,-82.21
2556,-82.49
2557,-82.79
2558,-82.98
2559,-82.95
2560,-82.55
2561,-81.88
2562,-81.09
2563,-80.35
2564,-79.59
2565,-78.92
2566,-78.40
2567,-78.13
2568,-77.97
2569,-77.82
2570,-77.51
2571,-77.00
2572,-76.14
2573,-75.23
2574,-74.46
2575,-73.97
2576,-73.55
2577,-73.12
2578,-72.75
2579,-72.75
2580,-73.00
2581,-73.27
2582,-73.33
2583,-73.09
2584,-72.54
2585,-71.87
2586,-71.01
2587,-70.04
2588,-68.88
2589,-67.69
2590,-66.71
2591,-65.98
2592,-65.40
2593,-64.94
2594,-64.67
2595,-64.64
2596,-64.76
2597,-65.06
2598,-65.55
2599,-66.25
2600,-67.02
2601,-67.75
2602,-68.51
2603,-69.21
2604,-69.67
2605,-69.67
2606,-69.34
2607,-68.82
2608,-68.30
2609,-67.81
2610,-67.44
2611,-67.20
2612,-67.11
2613,-67.08
2614,-67.20
2615,-67.44
2616,-67.84
2617,-68.33
2618,-68.73
2619,-68.97
2620,-69.12
2621,-69.37
2622,-69.70
2623,-69.95
2624,-69.95
2625,-69.70
2626,-69.40
2627,-69.15
2628,-68.91
2629,-68.70
2630,-68.54
2631,-68.54
2632,-68.57
2633,-68.57
2634,-68.57
2635,-68.60
2636,-68.51
2637,-68.30
2638,-67.87
2639,-67.41
2640,-66.96
2641,-66.47
2642,-65.80
2643,-65.12
2644,-64.51
2645,-64.03
2646,-63.45
2647,-62.77
2648,-62.07
2649,-61.55
2650,-61.22
2651,-61.04
2652,-60.97
2653,-60.94
2654,-60.88
2655,-60.91
2656,-61.16
2657,-61.58
2658,-62.10
2659,-62.62
2660,-63.20
2661,-63.87
2662,-64.61
2663,-65.34
2664,-66.19
2665,-67.11
2666,-68.05
2667,-68.76
2668,-69.31
2669,-69.73
2670,-70.31
2671,-71.01
2672,-71.90
2673,-72.85
2674,-73.82
2675,-74.77
2676,-75.74
2677,-76.69
2678,-77.58
2679,-78.31
2680,-78.83
2681,-79.04
2682,-79.01
2683,-78.74
2684,-78.43
2685,-78.19
2686,-78.03
2687,-77.79
2688,-77.42
2689,-76.93
2690,-76.42
2691,-75.93
2692,-75.47
2693,-75.01
2694,-74.52
2695,-74.04
2696,-73.52
2697,-73.09
2698,-72.72
2699,-72.48
2700,-72.20
2701,-71.99
2702,-71.90
2703,-71.87
2704,-71.78
2705,-71.81
2706,-72.17
2707,-72.88
2708,-73.61
2709,-74.13
2710,-74.46
2711,-74.68
2712,-74.74
2713,-74.49
2714,-74.07
2715,-73.55
2716,-73.12
2717,-72.91
2718,-72.94
2719,-73.15
2720,-73.52
2721,-73.97
2722,-74.62
2723,-75.35
2724,-76.02
2725,-76.48
2726,-76.81
2727,-77.03
2728,-77.24
2729,-77.51
2730,-77.79
2731,-78.00
2732,-78.13
2733,-78.13
2734,-78.09
2735,-78.06
2736,-78.09
2737,-78.13
2738,-78.06
2739,-77.82
2740,-77.36
2741,-76.90
2742,-76.51
2743,-76.26
2744,-76.05
2745,-75.84
2746,-75.62
2747,-75.35
2748,-75.04
2749,-74.83
2750,-74.83
2751,-75.07
2752,-75.35
2753,-75.59
2754,-75.93
2755,-76.39
2756,-76.87
2757,-77.15
2758,-77.12
2759,-76.81
2760,-76.48
2761,-76.26
2762,-76.23
2763,-76.23
2764,-76.08
2765,-75.84
2766,-75.68
2767,-75.68
2768,-75.62
2769,-75.41
2770,-75.10
2771,-74.83
2772,-74.68
2773,-74.68
2774,-74.89
2775,-75.35
2776,-76.11
2777,-77.06
2778,-78.16
2779,-79.35
2780,-80.72
2781,-82.12
2782,-83.53
2783,-84.69
2784,-85.75
2785,-86.70
2786,-87.62
2787,-88.26
2788,-88.78
2789,-89.26
2790,-89.94
2791,-90.61
2792,-91.16
2793,-91.37
2794,-91.52
2795,-91.74
2796,-92.07
2797,-92.32
2798,-92.38
2799,-92.38
2800,-92.44
2801,-92.68
2802,-93.02
2803,-93.26
2804,-93.38
2805,-93.35
2806,-93.29
2807,-93.32
2808,-93.38
2809,-93.38
2810,-93.14
2811,-92.68
2812,-92.10
2813,-91.37
2814,-90.39
2815,-89.23
2816,-87.92
2817,-86.70
2818,-85.66
2819,-84.96
2820,-84.69
2821,-84.96
2822,-85.60
2823,-86.33
2824,-86.85
2825,-87.16
2826,-87.19
2827,-86.94
2828,-86.21
2829,-85.02
2830,-83.59
2831,-82.43
2832,-81.54
2833,-80.84
2834,-80.05
2835,-79.41
2836,-78.86
2837,-78.43
2838,-77.55
2839,-76.17
2840,-74.37
2841,-72.45
2842,-70.31
2843,-68.21
2844,-66.16
2845,-64.51
2846,-63.08
2847,-61.98
2848,-60.91
2849,-60.03
2850,-58.99
2851,-58.07
2852,-57.19
2853,-56.52
2854,-55.88
2855,-55.21
2856,-54.26
2857,-53.10
2858,-51.64
2859,-49.93
2860,-48.03
2861,-46.11
2862,-44.43
2863,-43.21
2864,-42.60
2865,-42.57
2866,-43.21
2867,-44.43
2868,-46.08
2869,-47.76
2870,-49.19
2871,-50.38
2872,-51.61
2873,-52.98
2874,-54.63
2875,-56.30
2876,-58.04
2877,-59.66
2878,-61.28
2879,-62.65
2880,-64.03
2881,-65.16
2882,-66.28
2883,-67.17
2884,-68.05
2885,-68.97
2886,-70.13
2887,-71.29
2888,-72.42
2889,-73.36
2890,-74.34
2891,-75.20
2892,-76.17
2893,-77.12
2894,-78.25
2895,-79.41
2896,-80.54
2897,-81.51
2898,-82.40
2899,-83.04
2900,-83.50
2901,-83.74
2902,-83.98
2903,-84.17
2904,-84.26
2905,-84.26
2906,-84.50
2907,-84.93
2908,-85.42
2909,-85.69
2910,-85.78
2911,-85.75
2912,-85.60
2913,-85.36
2914,-85.17
2915,-85.14
2916,-85.33
2917,-85.54
2918,-85.91
2919,-86.36
2920,-87.01
2921,-87.71
2922,-88.44
2923,-89.14
2924,-89.97
2925,-90.88
2926,-91.92
2927,-92.86
2928,-93.78
2929,-94.42
2930,-94.94
2931,-95.40
2932,-96.16
2933,-97.08
2934,-98.02
2935,-98.97
2936,-100.28
2937,-101.90
2938,-103.67
2939,-105.13
2940,-106.29
2941,-107.18
2942,-108.03
2943,-108.73
2944,-109.34
2945,-109.80
2946,-110.23
2947,-110.69
2948,-111.30
2949,-112.00
2950,-112.76
2951,-113.46
2952,-114.17
2953,-114.87
2954,-115.60
2955,-116.30
2956,-117.07
2957,-117.77
2958,-118.41
2959,-118.87
2960,-119.20
2961,-119.45
2962,-119.69
2963,-119.93
2964,-120.06
2965,-120.06
2966,-120.00
2967,-120.03
2968,-120.03
2969,-119.81
2970,-119.14
2971,-118.19
2972,-117.13
2973,-116.18
2974,-115.26
2975,-114.35
2976,-113.28
2977,-112.09
2978,-110.69
2979,-109.28
2980,-107.91
2981,-106.75
2982,-105.65
2983,-104.74
2984,-103.85
2985,-103.15
2986,-102.51
2987,-102.05
2988,-101.75
2989,-101.56
2990,-101.23
2991,-100.74
2992,-100.19
2993,-99.98
2994,-100.19
2995,-100.68
2996,-101.10
2997,-101.41
2998,-101.53
2999,-101.53
3000,-101.23
3001,-100.52
3002,-99.49
3003,-98.30
3004,-96.92
3005,-95.52
3006,-94.02
3007,-92.59
3008,-91.25
3009,-90.09
3010,-88.99
3011,-88.07
3012,-87.19
3013,-86.49
3014,-85.88
3015,-85.48
3016,-84.99
3017,-84.56
3018,-83.95
3019,-83.28
3020,-82.37
3021,-81.21
3022,-79.59
3023,-77.73
3024,-75.65
3025,-73.73
3026,-72.02
3027,-70.89
3028,-70.28
3029,-70.07
3030,-69.79
3031,-69.40
3032,-68.76
3033,-68.05
3034,-67.05
3035,-65.92
3036,-64.61
3037,-63.42
3038,-62.29
3039,-61.40
3040,-60.64
3041,-59.97
3042,-58.99
3043,-57.83
3044,-56.52
3045,-55.36
3046,-54.11
3047,-52.70
3048,-51.06
3049,-49.62
3050,-48.61
3051,-48.19
3052,-47.94
3053,-47.79
3054,-47.49
3055,-47.24
3056,-47.00
3057,-46.81
3058,-46.48
3059,-45.99
3060,-45.35
3061,-44.65
3062,-43.91
3063,-43.21
3064,-42.48
3065,-41.75
3066,-41.14
3067,-40.65
3068,-40.28
3069,-40.01
3070,-40.04
3071,-40.47
3072,-41.47
3073,-42.91
3074,-44.74
3075,-46.60
3076,-48.58
3077,-50.48
3078,-52.37
3079,-53.99
3080,-55.42
3081,-56.55
3082,-57.86
3083,-59.20
3084,-60.73
3085,-62.16
3086,-63.63
3087,-65.03
3088,-66.41
3089,-67.57
3090,-68.66
3091,-69.58
3092,-70.43
3093,-71.14
3094,-71.75
3095,-72.20
3096,-72.57
3097,-72.78
3098,-72.97
3099,-73.18
3100,-73.58
3101,-74.04
3102,-74.46
3103,-74.71
3104,-74.80
3105,-74.80
3106,-74.74
3107,-74.46
3108,-73.97
3109,-73.49
3110,-73.33
3111,-73.58
3112,-74.01
3113,-74.52
3114,-75.13
3115,-75.84
3116,-76.45
3117,-76.72
3118,-76.54
3119,-76.02
3120,-75.35
3121,-74.65
3122,-73.94
3123,-73.18
3124,-72.48
3125,-72.02
3126,-71.93
3127,-72.14
3128,-72.51
3129,-73.00
3130,-73.82
3131,-74.98
3132,-76.32
3133,-77.55
3134,-78.64
3135,-79.59
3136,-80.32
3137,-80.81
3138,-81.12
3139,-81.30
3140,-81.51
3141,-81.73
3142,-82.09
3143,-82.52
3144,-83.19
3145,-83.89
3146,-84.66
3147,-85.33
3148,-86.09
3149,-87.01
3150,-88.32
3151,-89.69
3152,-91.16
3153,-92.56
3154,-94.21
3155,-95.83
3156,-97.38
3157,-98.57
3158,-99.61
3159,-100.49
3160,-101.32
3161,-102.02
3162,-102.84
3163,-103.79
3164,-104.74
3165,-105.47
3166,-105.93
3167,-106.14
3168,-106.26
3169,-106.26
3170,-106.11
3171,-105.87
3172,-105.59
3173,-105.35
3174,-105.10
3175,-104.89
3176,-104.68
3177,-104.46
3178,-104.03
3179,-103.33
3180,-102.29
3181,-101.10
3182,-99.82
3183,-98.60
3184,-97.56
3185,-96.86
3186,-96.62
3187,-96.86
3188,-97.38
3189,-98.11
3190,-99.06
3191,-100.01
3192,-100.80
3193,-101.26
3194,-101.59
3195,-102.02
3196,-102.81
3197,-103.76
3198,-104.74
3199,-105.65
3200,-106.84
3201,-108.22
3202,-109.80
3203,-111.24
3204,-112.55
3205,-113.68
3206,-114.93
3207,-116.09
3208,-117.22
3209,-118.13
3210,-119.05
3211,-119.93
3212,-121.03
3213,-122.22
3214,-123.54
3215,-124.69
3216,-125.73
3217,-126.65
3218,-127.72
3219,-128.63
3220,-129.30
3221,-129.49
3222,-129.61
3223,-129.79
3224,-130.25
3225,-130.95
3226,-132.05
3227,-133.48
3228,-135.10
3229,-136.51
3230,-137.70
3231,-138.64
3232,-139.53
3233,-140.23
3234,-140.56
3235,-140.56
3236,-140.47
3237,-140.47
3238,-140.47
3239,-140.23
3240,-139.74
3241,-139.25
3242,-138.95
3243,-138.70
3244,-138.37
3245,-137.91
3246,-137.36
3247,-136.90
3248,-136.35
3249,-135.68
3250,-134.74
3251,-133.82
3252,-132.87
3253,-131.96
3254,-130.83
3255,-129.67
3256,-128.51
3257,-127.56
3258,-126.71
3259,-126.01
3260,-125.46
3261,-125.24
3262,-125.31
3263,-125.55
3264,-125.82
3265,-126.07
3266,-126.31
3267,-126.59
3268,-126.71
3269,-126.74
3270,-126.62
3271,-126.37
3272,-125.98
3273,-125.49
3274,-125.03
3275,-124.82
3276,-124.76
3277,-124.76
3278,-124.69
3279,-124.73
3280,-124.91
3281,-125.15
3282,-125.18
3283,-125.00
3284,-124.57
3285,-124.11
3286,-123.44
3287,-122.50
3288,-121.34
3289,-120.39
3290,-119.75
3291,-119.29
3292,-118.71
3293,-118.04
3294,-117.28
3295,-116.58
3296,-115.66
3297,-114.50
3298,-113.10
3299,-111.94
3300,-111.02
3301,-110.38
3302,-109.59
3303,-108.67
3304,-107.54
3305,-106.35
3306,-104.98
3307,-103.61
3308,-102.14
3309,-100.77
3310,-99.18
3311,-97.60
3312,-95.79
3313,-94.18
3314,-92.50
3315,-90.88
3316,-89.05
3317,-87.22
3318,-85.17
3319,-83.10
3320,-80.60
3321,-78.03
3322,-75.35
3323,-73.03
3324,-70.77
3325,-68.73
3326,-66.53
3327,-64.45
3328,-62.19
3329,-60.15
3330,-57.98
3331,-55.94
3332,-53.56
3333,-51.24
3334,-48.86
3335,-46.81
3336,-44.59
3337,-42.30
3338,-39.49
3339,-36.47
3340,-33.02
3341,-29.48
3342,-25.67
3343,-22.16
3344,-18.95
3345,-16.39
3346,-14.10
3347,-12.30
3348,-10.65
3349,-9.31
3350,-7.66
3351,-5.83
3352,-3.69
3353,-1.80
3354,-0.18
3355,0.89
3356,1.77
3357,2.44
3358,3.17
3359,3.81
3360,4.61
3361,5.52
3362,6.84
3363,8.24
3364,9.64
3365,10.80
3366,11.96
3367,13.12
3368,14.37
3369,15.50
3370,16.75
3371,18.16
3372,19.96
3373,21.85
3374,23.62
3375,25.05
3376,26.34
3377,27.50
3378,28.53
3379,29.30
3380,29.63
3381,29.66
3382,29.30
3383,28.56
3384,27.44
3385,26.03
3386,24.35
3387,22.43
3388,20.26
3389,18.16
3390,16.20
3391,14.56
3392,12.85
3393,11.26
3394,9.77
3395,8.61
3396,7.42
3397,6.32
3398,5.10
3399,3.94
3400,2.53
3401,0.98
3402,-1.01
3403,-3.11
3404,-5.49
3405,-7.81
3406,-10.25
3407,-12.60
3408,-15.05
3409,-17.36
3410,-19.78
3411,-21.85
3412,-23.77
3413,-25.39
3414,-27.04
3415,-28.38
3416,-29.63
3417,-30.52
3418,-31.43
3419,-32.29
3420,-33.45
3421,-34.85
3422,-36.74
3423,-38.85
3424,-41.11
3425,-43.21
3426,-45.35
3427,-47.21
3428,-48.83
3429,-50.02
3430,-50.93
3431,-51.57
3432,-52.22
3433,-52.92
3434,-53.92
3435,-55.05
3436,-56.34
3437,-57.53
3438,-58.78
3439,-59.94
3440,-60.91
3441,-61.65
3442,-62.26
3443,-62.68
3444,-62.96
3445,-62.96
3446,-62.81
3447,-62.53
3448,-62.16
3449,-61.71
3450,-61.22
3451,-60.70
3452,-60.21
3453,-59.75
3454,-59.39
3455,-59.11
3456,-58.90
3457,-58.72
3458,-58.50
3459,-58.26
3460,-57.83
3461,-57.37
3462,-57.07
3463,-57.04
3464,-57.22
3465,-57.46
3466,-57.83
3467,-58.29
3468,-58.84
3469,-59.33
3470,-59.72
3471,-59.91
3472,-60.00
3473,-60.03
3474,-60.00
3475,-59.97
3476,-60.00
3477,-60.27
3478,-60.85
3479,-61.58
3480,-62.10
3481,-62.38
3482,-62.47
3483,-62.44
3484,-62.13
3485,-61.49
3486,-60.49
3487,-59.23
3488,-57.83
3489,-56.67
3490,-55.97
3491,-55.69
3492,-55.60
3493,-55.66
3494,-55.97
3495,-56.40
3496,-56.70
3497,-56.76
3498,-56.70
3499,-56.64
3500,-56.52
3501,-56.34
3502,-56.18
3503,-56.18
3504,-56.15
3505,-55.94
3506,-55.48
3507,-54.96
3508,-54.57
3509,-54.35
3510,-54.23
3511,-54.23
3512,-54.35
3513,-54.84
3514,-55.76
3515,-56.95
3516,-58.20
3517,-59.14
3518,-59.84
3519,-60.33
3520,-60.58
3521,-60.55
3522,-60.33
3523,-60.06
3524,-60.03
3525,-60.24
3526,-60.67
3527,-61.13
3528,-61.77
3529,-62.44
3530,-63.20
3531,-63.90
3532,-64.73
3533,-65.64
3534,-66.74
3535,-67.93
3536,-69.24
3537,-70.68
3538,-72.24
3539,-73.67
3540,-74.80
3541,-75.53
3542,-75.90
3543,-75.87
3544,-75.47
3545,-74.74
3546,-73.88
3547,-73.18
3548,-72.60
3549,-72.14
3550,-71.69
3551,-71.20
3552,-70.71
3553,-70.28
3554,-69.73
3555,-69.03
3556,-67.99
3557,-66.83
3558,-65.64
3559,-64.70
3560,-63.87
3561,-63.23
3562,-62.53
3563,-61.86
3564,-60.91
3565,-59.78
3566,-58.29
3567,-56.64
3568,-54.75
3569,-52.92
3570,-50.93
3571,-49.04
3572,-47.12
3573,-45.53
3574,-44.13
3575,-42.94
3576,-41.69
3577,-40.56
3578,-39.58
3579,-38.88
3580,-38.09
3581,-37.23
3582,-36.16
3583,-35.19
3584,-34.21
3585,-33.33
3586,-32.44
3587,-31.71
3588,-31.07
3589,-30.64
3590,-30.40
3591,-30.40
3592,-30.49
3593,-30.49
3594,-30.46
3595,-30.43
3596,-30.52
3597,-30.79
3598,-31.19
3599,-31.65
3600,-32.14
3601,-32.62
3602,-33.14
3603,-33.60
3604,-33.94
3605,-34.18
3606,-34.48
3607,-34.94
3608,-35.49
3609,-35.98
3610,-36.38
3611,-36.56
3612,-36.74
3613,-36.96
3614,-37.38
3615,-37.84
3616,-38.27
3617,-38.76
3618,-39.49
3619,-40.41
3620,-41.35
3621,-42.08
3622,-42.76
3623,-43.40
3624,-44.16
3625,-44.89
3626,-45.65
3627,-46.30
3628,-46.97
3629,-47.64
3630,-48.65
3631,-49.80
3632,-51.09
3633,-52.28
3634,-53.47
3635,-54.63
3636,-55.79
3637,-56.76
3638,-57.53
3639,-57.98
3640,-58.17
3641,-58.17
3642,-58.07
3643,-58.07
3644,-58.20
3645,-58.47
3646,-58.78
3647,-59.02
3648,-59.02
3649,-58.81
3650,-58.38
3651,-57.65
3652,-56.52
3653,-55.11
3654,-53.53
3655,-52.09
3656,-50.75
3657,-49.59
3658,-48.55
3659,-47.61
3660,-46.63
3661,-45.72
3662,-44.86
3663,-44.16
3664,-43.40
3665,-42.45
3666,-41.29
3667,-40.10
3668,-38.97
3669,-38.02
3670,-37.20
3671,-36.50
3672,-35.89
3673,-35.43
3674,-35.06
3675,-34.85
3676,-34.64
3677,-34.45
3678,-34.12
3679,-33.63
3680,-32.99
3681,-32.29
3682,-31.56
3683,-30.82
3684,-30.06
3685,-29.36
3686,-28.84
3687,-28.59
3688,-28.53
3689,-28.56
3690,-28.66
3691,-28.90
3692,-29.14
3693,-29.42
3694,-29.66
3695,-29.91
3696,-30.03
3697,-30.03
3698,-29.91
3699,-29.94
3700,-30.15
3701,-30.36
3702,-30.43
3703,-30.49
3704,-30.67
3705,-30.85
3706,-30.82
3707,-30.61
3708,-30.58
3709,-30.73
3710,-30.98
3711,-31.25
3712,-31.83
3713,-32.71
3714,-33.81
3715,-34.82
3716,-35.77
3717,-36.65
3718,-37.48
3719,-38.24
3720,-39.00
3721,-39.67
3722,-40.16
3723,-40.44
3724,-40.65
3725,-40.86
3726,-40.89
3727,-40.68
3728,-40.34
3729,-40.07
3730,-39.92
3731,-39.92
3732,-40.13
3733,-40.59
3734,-41.29
3735,-42.02
3736,-42.66
3737,-43.12
3738,-43.52
3739,-43.95
3740,-44.65
3741,-45.59
3742,-46.78
3743,-47.97
3744,-49.16
3745,-50.05
3746,-50.81
3747,-51.48
3748,-52.43
3749,-53.62
3750,-54.93
3751,-56.09
3752,-57.22
3753,-58.17
3754,-58.96
3755,-59.39
3756,-59.57
3757,-59.54
3758,-59.63
3759,-59.78
3760,-60.15
3761,-60.91
3762,-62.23
3763,-63.87
3764,-65.46
3765,-66.71
3766,-67.60
3767,-68.05
3768,-67.93
3769,-67.23
3770,-66.16
3771,-64.91
3772,-63.60
3773,-62.41
3774,-61.61
3775,-61.37
3776,-61.49
3777,-61.77
3778,-62.10
3779,-62.56
3780,-63.17
3781,-63.93
3782,-64.61
3783,-65.12
3784,-65.31
3785,-65.28
3786,-65.22
3787,-65.22
3788,-65.31
3789,-65.31
3790,-65.06
3791,-64.61
3792,-64.06
3793,-63.57
3794,-63.08
3795,-62.62
3796,-62.19
3797,-61.68
3798,-61.04
3799,-60.36
3800,-59.72
3801,-59.23
3802,-58.75
3803,-58.29
3804,-57.98
3805,-57.98
3806,-58.17
3807,-58.47
3808,-58.72
3809,-58.93
3810,-59.11
3811,-59.36
3812,-59.81
3813,-60.52
3814,-61.40
3815,-62.41
3816,-63.35
3817,-64.06
3818,-64.36
3819,-64.12
3820,-63.42
3821,-62.41
3822,-61.37
3823,-60.39
3824,-59.63
3825,-59.11
3826,-58.99
3827,-59.23
3828,-59.94
3829,-60.82
3830,-61.89
3831,-63.08
3832,-64.70
3833,-66.56
3834,-68.51
3835,-70.43
3836,-72.60
3837,-74.95
3838,-77.33
3839,-79.25
3840,-80.72
3841,-81.60
3842,-82.12
3843,-82.37
3844,-82.49
3845,-82.46
3846,-82.31
3847,-82.06
3848,-81.91
3849,-81.85
3850,-81.94
3851,-82.21
3852,-82.70
3853,-83.16
3854,-83.31
3855,-83.10
3856,-82.70
3857,-82.18
3858,-81.42
3859,-80.51
3860,-79.71
3861,-79.16
3862,-78.83
3863,-78.64
3864,-78.67
3865,-78.89
3866,-79.10
3867,-79.13
3868,-78.92
3869,-78.46
3870,-77.61
3871,-76.42
3872,-74.98
3873,-73.55
3874,-72.24
3875,-71.26
3876,-70.74
3877,-70.80
3878,-71.20
3879,-71.69
3880,-71.93
3881,-71.96
3882,-71.87
3883,-71.62
3884,-71.04
3885,-70.07
3886,-69.03
3887,-68.30
3888,-67.99
3889,-67.99
3890,-68.21
3891,-68.73
3892,-69.55
3893,-70.47
3894,-71.23
3895,-71.78
3896,-72.14
3897,-72.33
3898,-72.27
3899,-72.05
3900,-71.93
3901,-71.90
3902,-71.72
3903,-71.29
3904,-70.77
3905,-70.25
3906,-69.64
3907,-68.97
3908,-68.30
3909,-67.81
3910,-67.35
3911,-66.89
3912,-66.53
3913,-66.28
3914,-66.04
3915,-65.58
3916,-64.79
3917,-63.84
3918,-62.93
3919,-62.16
3920,-61.61
3921,-61.40
3922,-61.58
3923,-62.04
3924,-62.59
3925,-63.11
3926,-63.66
3927,-64.09
3928,-64.30
3929,-64.33
3930,-64.42
3931,-64.61
3932,-64.79
3933,-65.06
3934,-65.67
3935,-66.59
3936,-67.50
3937,-68.05
3938,-68.15
3939,-67.84
3940,-67.23
3941,-66.28
3942,-65.22
3943,-64.18
3944,-63.42
3945,-63.17
3946,-63.72
3947,-64.91
3948,-66.50
3949,-68.18
3950,-69.92
3951,-71.59
3952,-73.09
3953,-74.25
3954,-75.23
3955,-76.14
3956,-77.27
3957,-78.46
3958,-79.59
3959,-80.54
3960,-81.45
3961,-82.15
3962,-82.49
3963,-82.24
3964,-81.54
3965,-80.57
3966,-79.47
3967,-78.25
3968,-76.97
3969,-75.78
3970,-74.86
3971,-74.34
3972,-74.22
3973,-74.52
3974,-75.10
3975,-75.87
3976,-76.42
3977,-76.66
3978,-76.63
3979,-76.42
3980,-75.93
3981,-75.23
3982,-74.25
3983,-73.33
3984,-72.54
3985,-71.81
3986,-70.92
3987,-70.01
3988,-69.15
3989,-68.42
3990,-67.63
3991,-66.99
3992,-66.62
3993,-66.59
3994,-66.62
3995,-66.71
3996,-66.80
3997,-66.80
3998,-66.25
3999,-65.12
4000,-63.51
4001,-61.83
4002,-60.06
4003,-58.41
4004,-56.92
4005,-56.03
4006,-55.57
4007,-55.39
4008,-54.93
4009,-54.32
4010,-53.41
4011,-52.22
4012,-50.35
4013,-48.03
4014,-45.41
4015,-43.03
4016,-40.74
4017,-38.67
4018,-36.68
4019,-35.03
4020,-33.54
4021,-32.17
4022,-30.58
4023,-28.96
4024,-27.22
4025,-25.57
4026,-23.90
4027,-22.49
4028,-21.39
4029,-20.69
4030,-20.20
4031,-19.74
4032,-19.23
4033,-18.77
4034,-18.40
4035,-18.16
4036,-17.94
4037,-17.97
4038,-18.31
4039,-19.07
4040,-19.93
4041,-20.66
4042,-21.18
4043,-21.42
4044,-21.42
4045,-21.15
4046,-20.69
4047,-20.20
4048,-19.93
4049,-19.87
4050,-20.11
4051,-20.60
4052,-21.42
4053,-22.34
4054,-23.19
4055,-23.93
4056,-24.75
4057,-25.67
4058,-26.64
4059,-27.59
4060,-28.69
4061,-29.85
4062,-31.01
4063,-31.95
4064,-32.81
4065,-33.75
4066,-34.91
4067,-36.07
4068,-37.20
4069,-38.15
4070,-39.00
4071,-39.70
4072,-40.22
4073,-40.47
4074,-40.50
4075,-40.47
4076,-40.56
4077,-40.77
4078,-41.17
4079,-41.63
4080,-42.18
4081,-42.66
4082,-43.00
4083,-43.00
4084,-42.69
4085,-42.14
4086,-41.63
4087,-41.14
4088,-40.80
4089,-40.53
4090,-40.44
4091,-40.68
4092,-41.35
4093,-42.30
4094,-43.33
4095,-44.31
4096,-45.29
4097,-46.20
4098,-46.97
4099,-47.45
4100,-47.82
4101,-48.00
4102,-48.13
4103,-48.07
4104,-48.13
4105,-48.34
4106,-48.89
4107,-49.56
4108,-50.42
4109,-51.36
4110,-52.52
4111,-53.71
4112,-54.72
4113,-55.42
4114,-56.06
4115,-56.73
4116,-57.56
4117,-58.23
4118,-58.90
4119,-59.57
4120,-60.55
4121,-61.71
4122,-62.96
4123,-64.18
4124,-65.43
4125,-66.59
4126,-67.54
4127,-68.27
4128,-69.00
4129,-69.67
4130,-70.22
4131,-70.47
4132,-70.56
4133,-70.53
4134,-70.40
4135,-70.16
4136,-69.89
4137,-69.64
4138,-69.40
4139,-69.18
4140,-68.94
4141,-68.70
4142,-68.45
4143,-68.24
4144,-67.96
4145,-67.75
4146,-67.54
4147,-67.29
4148,-66.86
4149,-66.41
4150,-66.04
4151,-65.80
4152,-65.58
4153,-65.34
4154,-65.19
4155,-65.19
4156,-65.28
4157,-65.28
4158,-65.09
4159,-64.85
4160,-64.73
4161,-64.73
4162,-64.70
4163,-64.70
4164,-64.91
4165,-65.40
4166,-66.04
4167,-66.50
4168,-66.80
4169,-67.02
4170,-67.32
4171,-67.57
4172,-67.57
4173,-67.32
4174,-66.99
4175,-66.74
4176,-66.59
4177,-66.31
4178,-66.01
4179,-65.77
4180,-65.77
4181,-65.98
4182,-66.35
4183,-66.80
4184,-67.54
4185,-68.51
4186,-69.55
4187,-70.50
4188,-71.41
4189,-72.36
4190,-73.39
4191,-74.34
4192,-75.10
4193,-75.53
4194,-75.90
4195,-76.35
4196,-77.03
4197,-77.76
4198,-78.40
4199,-78.86
4200,-79.19
4201,-79.44
4202,-79.62
4203,-79.62
4204,-79.35
4205,-78.89
4206,-78.37
4207,-77.85
4208,-77.36
4209,-76.90
4210,-76.51
4211,-76.26
4212,-76.05
4213,-75.84
4214,-75.62
4215,-75.38
4216,-75.01
4217,-74.55
4218,-74.07
4219,-73.55
4220,-73.00
4221,-72.57
4222,-72.36
4223,-72.33
4224,-72.33
4225,-72.36
4226,-72.54
4227,-73.00
4228,-73.61
4229,-74.13
4230,-74.37
4231,-74.37
4232,-74.16
4233,-73.70
4234,-72.88
4235,-71.66
4236,-70.22
4237,-69.03
4238,-68.30
4239,-68.08
4240,-68.12
4241,-68.39
4242,-68.85
4243,-69.34
4244,-69.55
4245,-69.34
4246,-68.73
4247,-68.02
4248,-67.26
4249,-66.53
4250,-65.83
4251,-65.40
4252,-65.22
4253,-64.94
4254,-64.33
4255,-63.42
4256,-62.47
4257,-61.74
4258,-61.00
4259,-60.30
4260,-59.84
4261,-59.84
4262,-60.15
4263,-60.42
4264,-60.42
4265,-60.21
4266,-59.81
4267,-59.33
4268,-58.62
4269,-57.95
4270,-57.46
4271,-57.22
4272,-56.98
4273,-56.79
4274,-56.67
4275,-56.67
4276,-56.52
4277,-56.12
4278,-55.36
4279,-54.38
4280,-53.16
4281,-51.97
4282,-50.96
4283,-50.29
4284,-49.68
4285,-49.01
4286,-48.10
4287,-47.15
4288,-46.17
4289,-45.26
4290,-44.22
4291,-43.27
4292,-42.57
4293,-42.36
4294,-42.48
4295,-42.76
4296,-42.91
4297,-42.91
4298,-42.82
4299,-42.60
4300,-42.02
4301,-41.08
4302,-39.89
4303,-38.91
4304,-38.33
4305,-38.12
4306,-38.06
4307,-38.09
4308,-38.21
4309,-38.42
4310,-38.60
4311,-38.88
4312,-39.37
4313,-40.10
4314,-40.77
4315,-41.26
4316,-41.66
4317,-42.08
4318,-42.66
4319,-43.15
4320,-43.46
4321,-43.43
4322,-43.18
4323,-42.97
4324,-42.91
4325,-42.88
4326,-42.72
4327,-42.51
4328,-42.39
4329,-42.36
4330,-42.27
4331,-42.08
4332,-41.81
4333,-41.56
4334,-41.17
4335,-40.74
4336,-40.34
4337,-40.07
4338,-39.83
4339,-39.61
4340,-39.52
4341,-39.49
4342,-39.43
4343,-39.46
4344,-39.73
4345,-40.22
4346,-40.62
4347,-40.89
4348,-41.11
4349,-41.35
4350,-41.41
4351,-41.20
4352,-40.65
4353,-39.95
4354,-39.09
4355,-38.15
4356,-37.05
4357,-36.13
4358,-35.46
4359,-34.97
4360,-34.39
4361,-33.72
4362,-33.08
4363,-32.59
4364,-32.07
4365,-31.40
4366,-30.52
4367,-29.54
4368,-28.50
4369,-27.59
4370,-26.73
4371,-26.03
4372,-25.39
4373,-24.90
4374,-24.63
4375,-24.63
4376,-24.93
4377,-25.39
4378,-26.00
4379,-26.70
4380,-27.62
4381,-28.56
4382,-29.45
4383,-30.15
4384,-30.79
4385,-31.49
4386,-32.38
4387,-33.29
4388,-34.24
4389,-35.22
4390,-36.35
4391,-37.48
4392,-38.60
4393,-39.55
4394,-40.53
4395,-41.41
4396,-42.30
4397,-42.97
4398,-43.73
4399,-44.68
4400,-45.90
4401,-47.06
4402,-48.10
4403,-49.04
4404,-50.14
4405,-51.27
4406,-52.40
4407,-53.34
4408,-54.44
4409,-55.57
4410,-56.70
4411,-57.68
4412,-58.65
4413,-59.54
4414,-60.33
4415,-60.82
4416,-61.16
4417,-61.34
4418,-61.43
4419,-61.43
4420,-61.49
4421,-61.43
4422,-61.28
4423,-61.04
4424,-61.04
4425,-61.22
4426,-61.55
4427,-62.04
4428,-62.87
4429,-64.03
4430,-65.43
4431,-66.62
4432,-67.57
4433,-68.27
4434,-68.91
4435,-69.31
4436,-69.58
4437,-69.85
4438,-70.34
4439,-71.04
4440,-71.69
4441,-72.20
4442,-72.69
4443,-73.12
4444,-73.39
4445,-73.43
4446,-73.33
4447,-73.30
4448,-73.30
4449,-73.36
4450,-73.39
4451,-73.36
4452,-73.21
4453,-73.03
4454,-72.81
4455,-72.54
4456,-72.14
4457,-71.69
4458,-71.32
4459,-71.04
4460,-70.74
4461,-70.34
4462,-69.73
4463,-69.00
4464,-68.05
4465,-67.11
4466,-66.35
4467,-65.89
4468,-65.52
4469,-65.06
4470,-64.39
4471,-63.72
4472,-62.99
4473,-62.29
4474,-61.49
4475,-60.79
4476,-60.27
4477,-60.03
4478,-59.94
4479,-60.00
4480,-60.06
4481,-60.06
4482,-59.78
4483,-59.33
4484,-58.84
4485,-58.35
4486,-57.71
4487,-57.01
4488,-56.49
4489,-56.21
4490,-56.12
4491,-56.15
4492,-56.37
4493,-56.82
4494,-57.40
4495,-57.92
4496,-58.29
4497,-58.50
4498,-58.62
4499,-58.59
4500,-58.56
4501,-58.56
4502,-58.62
4503,-58.59
4504,-58.53
4505,-58.50
4506,-58.78
4507,-59.20
4508,-59.78
4509,-60.52
4510,-61.55
4511,-62.71
4512,-63.81
4513,-64.76
4514,-65.83
4515,-66.99
4516,-68.18
4517,-69.09
4518,-69.95
4519,-70.86
4520,-72.08
4521,-73.52
4522,-75.04
4523,-76.48
4524,-77.79
4525,-78.98
4526,-80.05
4527,-80.75
4528,-81.05
4529,-81.02
4530,-80.99
4531,-80.93
4532,-80.93
4533,-80.90
4534,-81.12
4535,-81.57
4536,-82.24
4537,-82.95
4538,-83.77
4539,-84.72
4540,-85.78
4541,-86.73
4542,-87.46
4543,-87.98
4544,-88.29
4545,-88.29
4546,-87.71
4547,-86.76
4548,-85.78
4549,-85.02
4550,-84.47
4551,-84.05
4552,-83.68
4553,-83.47
4554,-83.16
4555,-82.70
4556,-82.06
4557,-81.36
4558,-80.57
4559,-79.59
4560,-78.34
4561,-77.21
4562,-76.29
4563,-75.59
4564,-74.68
4565,-73.55
4566,-72.36
4567,-71.35
4568,-70.37
4569,-69.52
4570,-68.76
4571,-68.27
4572,-67.81
4573,-67.38
4574,-66.96
4575,-66.74
4576,-66.56
4577,-66.35
4578,-66.04
4579,-65.83
4580,-65.67
4581,-65.43
4582,-64.91
4583,-64.21
4584,-63.45
4585,-62.74
4586,-61.92
4587,-60.97
4588,-60.00
4589,-59.30
4590,-58.87
4591,-58.62
4592,-58.50
4593,-58.53
4594,-58.75
4595,-59.23
4596,-59.78
4597,-60.30
4598,-60.67
4599,-60.94
4600,-60.94
4601,-60.70
4602,-60.27
4603,-59.81
4604,-59.27
4605,-58.56
4606,-57.59
4607,-56.40
4608,-55.05
4609,-53.89
4610,-52.86
4611,-51.94
4612,-50.81
4613,-49.68
4614,-48.46
4615,-47.30
4616,-45.87
4617,-44.25
4618,-42.45
4619,-40.77
4620,-39.15
4621,-37.78
4622,-36.59
4623,-35.64
4624,-34.76
4625,-34.09
4626,-33.63
4627,-33.42
4628,-33.17
4629,-32.96
4630,-32.84
4631,-32.84
4632,-32.78
4633,-32.56
4634,-32.20
4635,-31.95
4636,-31.86
4637,-31.89
4638,-31.92
4639,-31.92
4640,-31.89
4641,-31.89
4642,-31.92
4643,-31.95
4644,-31.83
4645,-31.56
4646,-31.31
4647,-31.28
4648,-31.65
4649,-32.38
4650,-33.36
4651,-34.33
4652,-35.10
4653,-35.58
4654,-35.83
4655,-35.83
4656,-35.55
4657,-35.06
4658,-34.52
4659,-34.00
4660,-33.60
4661,-33.42
4662,-33.39
4663,-33.36
4664,-33.20
4665,-32.96
4666,-32.87
4667,-32.84
4668,-32.71
4669,-32.50
4670,-32.38
4671,-32.56
4672,-33.11
4673,-33.87
4674,-34.79
4675,-35.71
4676,-36.56
4677,-37.26
4678,-38.02
4679,-38.73
4680,-39.28
4681,-39.49
4682,-39.52
4683,-39.46
4684,-39.58
4685,-39.83
4686,-40.16
4687,-40.37
4688,-40.59
4689,-40.77
4690,-41.14
4691,-41.63
4692,-42.18
4693,-42.63
4694,-43.09
4695,-43.55
4696,-44.13
4697,-44.86
4698,-45.62
4699,-46.33
4700,-46.94
4701,-47.42
4702,-47.82
4703,-48.03
4704,-48.10
4705,-48.10
4706,-48.13
4707,-48.13
4708,-48.03
4709,-47.79
4710,-47.49
4711,-47.24
4712,-47.03
4713,-46.81
4714,-46.48
4715,-45.99
4716,-45.41
4717,-44.95
4718,-44.62
4719,-44.40
4720,-44.07
4721,-43.61
4722,-43.06
4723,-42.57
4724,-42.21
4725,-41.96
4726,-41.84
4727,-41.84
4728,-41.96
4729,-42.24
4730,-42.54
4731,-42.82
4732,-42.88
4733,-42.63
4734,-42.02
4735,-41.05
4736,-39.89
4737,-38.70
4738,-37.54
4739,-36.56
4740,-35.89
4741,-35.68
4742,-35.86
4743,-36.35
4744,-37.02
4745,-37.75
4746,-38.45
4747,-38.94
4748,-39.06
4749,-38.82
4750,-38.30
4751,-37.81
4752,-37.51
4753,-37.26
4754,-36.93
4755,-36.47
4756,-35.95
4757,-35.43
4758,-34.97
4759,-34.55
4760,-34.06
4761,-33.54
4762,-33.08
4763,-32.84
4764,-33.02
4765,-33.48
4766,-33.97
4767,-34.48
4768,-35.16
4769,-35.83
4770,-36.35
4771,-36.56
4772,-36.90
4773,-37.60
4774,-38.64
4775,-39.61
4776,-40.28
4777,-40.77
4778,-41.23
4779,-41.44
4780,-41.20
4781,-40.47
4782,-39.67
4783,-39.12
4784,-38.97
4785,-38.97
4786,-39.15
4787,-39.61
4788,-40.47
4789,-41.38
4790,-42.27
4791,-42.97
4792,-43.76
4793,-44.68
4794,-45.78
4795,-47.00
4796,-48.34
4797,-49.71
4798,-51.18
4799,-52.64
4800,-54.11
4801,-55.27
4802,-56.00
4803,-56.21
4804,-56.24
4805,-56.21
4806,-56.15
4807,-55.88
4808,-55.54
4809,-55.30
4810,-55.27
4811,-55.24
4812,-55.08
4813,-54.87
4814,-54.81
4815,-55.02
4816,-55.33
4817,-55.63
4818,-55.88
4819,-56.09
4820,-56.24
4821,-56.24
4822,-56.18
4823,-56.18
4824,-56.24
4825,-56.21
4826,-56.09
4827,-56.12
4828,-56.49
4829,-56.92
4830,-57.16
4831,-57.22
4832,-57.31
4833,-57.50
4834,-57.50
4835,-57.34
4836,-57.16
4837,-57.13
4838,-57.01
4839,-56.82
4840,-56.64
4841,-56.61
4842,-56.58
4843,-56.37
4844,-56.03
4845,-55.79
4846,-55.69
4847,-55.66
4848,-55.69
4849,-55.97
4850,-56.64
4851,-57.53
4852,-58.47
4853,-59.48
4854,-60.73
4855,-62.10
4856,-63.39
4857,-64.36
4858,-65.28
4859,-66.16
4860,-67.02
4861,-67.78
4862,-68.63
4863,-69.49
4864,-70.34
4865,-71.08
4866,-71.99
4867,-72.85
4868,-73.61
4869,-74.10
4870,-74.62
4871,-75.01
4872,-75.26
4873,-75.29
4874,-75.41
4875,-75.84
4876,-76.51
4877,-77.24
4878,-78.09
4879,-79.04
4880,-79.99
4881,-80.72
4882,-81.15
4883,-81.33
4884,-81.51
4885,-81.76
4886,-82.06
4887,-82.28
4888,-82.52
4889,-82.73
4890,-83.01
4891,-83.25
4892,-83.37
4893,-83.37
4894,-83.31
4895,-83.28
4896,-83.40
4897,-83.65
4898,-83.98
4899,-84.23
4900,-84.23
4901,-83.95
4902,-83.68
4903,-83.44
4904,-83.19
4905,-82.95
4906,-82.82
4907,-83.04
4908,-83.74
4909,-84.72
4910,-85.66
4911,-86.40
4912,-86.91
4913,-87.13
4914,-87.07
4915,-86.79
4916,-86.64
4917,-86.88
4918,-87.49
4919,-88.23
4920,-88.84
4921,-89.36
4922,-89.78
4923,-89.97
4924,-89.81
4925,-89.39
4926,-88.84
4927,-88.32
4928,-87.80
4929,-87.34
4930,-87.10
4931,-87.07
4932,-87.13
4933,-87.16
4934,-87.22
4935,-87.43
4936,-87.77
4937,-88.29
4938,-88.90
4939,-89.66
4940,-90.33
4941,-90.82
4942,-91.00
4943,-91.03
4944,-90.85
4945,-90.36
4946,-89.48
4947,-88.29
4948,-87.01
4949,-85.82
4950,-84.63
4951,-83.44
4952,-82.28
4953,-81.57
4954,-81.45
4955,-81.97
4956,-82.76
4957,-83.53
4958,-84.05
4959,-84.26
4960,-84.20
4961,-83.98
4962,-83.68
4963,-83.13
4964,-82.40
4965,-81.70
4966,-81.36
4967,-81.33
4968,-81.30
4969,-81.12
4970,-80.96
4971,-80.87
4972,-80.87
4973,-80.90
4974,-81.18
4975,-81.85
4976,-82.92
4977,-84.14
4978,-85.45
4979,-86.85
4980,-88.41
4981,-89.84
4982,-91.00
4983,-91.71
4984,-92.07
4985,-92.29
4986,-92.53
4987,-92.71
4988,-92.99
4989,-93.44
4990,-94.39
4991,-95.52
4992,-96.71
4993,-97.66
4994,-98.63
4995,-99.52
4996,-100.31
4997,-100.83
4998,-101.14
4999,-101.32
5000,-101.50
5001,-101.72
5002,-102.23
5003,-102.94
5004,-103.67
5005,-104.16
5006,-104.37
5007,-104.37
5008,-104.16
5009,-103.67
5010,-102.91
5011,-101.99
5012,-100.95
5013,-99.73
5014,-98.27
5015,-96.86
5016,-95.70
5017,-95.00
5018,-94.45
5019,-94.06
5020,-93.66
5021,-93.20
5022,-92.35
5023,-91.22
5024,-89.78
5025,-88.35
5026,-86.82
5027,-85.42
5028,-84.23
5029,-83.56
5030,-83.19
5031,-83.04
5032,-82.61
5033,-81.94
5034,-80.87
5035,-79.71
5036,-78.34
5037,-76.97
5038,-75.44
5039,-74.07
5040,-72.63
5041,-71.29
5042,-69.64
5043,-67.78
5044,-65.49
5045,-63.14
5046,-60.73
5047,-58.59
5048,-56.67
5049,-55.33
5050,-54.35
5051,-53.68
5052,-52.86
5053,-51.94
5054,-50.90
5055,-49.99
5056,-48.98
5057,-47.82
5058,-46.39
5059,-44.95
5060,-43.61
5061,-42.69
5062,-42.14
5063,-41.93
5064,-41.84
5065,-41.84
5066,-41.93
5067,-42.21
5068,-42.54
5069,-42.79
5070,-42.88
5071,-42.85
5072,-42.91
5073,-43.12
5074,-43.52
5075,-43.98
5076,-44.56
5077,-45.26
5078,-46.26
5079,-47.42
5080,-48.68
5081,-49.90
5082,-51.09
5083,-52.25
5084,-53.38
5085,-54.35
5086,-55.24
5087,-55.94
5088,-56.40
5089,-56.64
5090,-56.73
5091,-56.70
5092,-56.58
5093,-56.37
5094,-56.09
5095,-55.85
5096,-55.60
5097,-55.39
5098,-55.11
5099,-54.93
5100,-54.63
5101,-54.20
5102,-53.38
5103,-52.19
5104,-50.54
5105,-48.65
5106,-46.60
5107,-44.68
5108,-43.00
5109,-41.84
5110,-41.14
5111,-40.92
5112,-40.99
5113,-41.29
5114,-41.60
5115,-41.87
5116,-41.78
5117,-41.32
5118,-40.53
5119,-39.58
5120,-38.45
5121,-37.32
5122,-36.10
5123,-34.88
5124,-33.66
5125,-32.71
5126,-32.26
5127,-32.26
5128,-32.38
5129,-32.44
5130,-32.32
5131,-32.14
5132,-31.59
5133,-30.67
5134,-29.24
5135,-27.56
5136,-25.76
5137,-24.11
5138,-22.61
5139,-21.45
5140,-20.54
5141,-19.84
5142,-19.17
5143,-18.46
5144,-17.70
5145,-17.03
5146,-16.33
5147,-15.63
5148,-14.83
5149,-14.13
5150,-13.58
5151,-13.34
5152,-13.34
5153,-13.64
5154,-14.04
5155,-14.53
5156,-14.92
5157,-15.20
5158,-15.26
5159,-15.01
5160,-14.40
5161,-13.46
5162,-12.27
5163,-11.08
5164,-9.92
5165,-8.94
5166,-8.27
5167,-8.03
5168,-8.24
5169,-8.76
5170,-9.28
5171,-9.52
5172,-9.40
5173,-9.16
5174,-9.03
5175,-9.00
5176,-9.00
5177,-9.00
5178,-9.22
5179,-9.67
5180,-10.22
5181,-10.71
5182,-11.20
5183,-11.66
5184,-12.12
5185,-12.60
5186,-13.18
5187,-13.85
5188,-14.71
5189,-15.66
5190,-16.78
5191,-17.94
5192,-19.13
5193,-20.08
5194,-20.78
5195,-21.21
5196,-21.64
5197,-22.09
5198,-22.74
5199,-23.41
5200,-24.23
5201,-25.18
5202,-26.34
5203,-27.50
5204,-28.63
5205,-29.54
5206,-30.46
5207,-31.40
5208,-32.41
5209,-33.33
5210,-34.24
5211,-35.22
5212,-36.32
5213,-37.23
5214,-37.81
5215,-38.02
5216,-38.33
5217,-38.76
5218,-39.28
5219,-39.73
5220,-40.37
5221,-41.29
5222,-42.51
5223,-43.73
5224,-44.74
5225,-45.44
5226,-45.96
5227,-46.42
5228,-46.91
5229,-47.39
5230,-47.88
5231,-48.37
5232,-48.80
5233,-49.01
5234,-48.95
5235,-48.74
5236,-48.52
5237,-48.22
5238,-47.82
5239,-47.39
5240,-47.06
5241,-46.78
5242,-46.39
5243,-45.96
5244,-45.59
5245,-45.38
5246,-44.98
5247,-44.31
5248,-43.37
5249,-42.39
5250,-41.35
5251,-40.47
5252,-39.61
5253,-38.91
5254,-38.18
5255,-37.51
5256,-36.80
5257,-36.10
5258,-35.22
5259,-34.27
5260,-33.39
5261,-32.65
5262,-31.98
5263,-31.31
5264,-30.64
5265,-30.12
5266,-29.88
5267,-29.85
5268,-30.09
5269,-30.58
5270,-31.37
5271,-32.29
5272,-33.36
5273,-34.55
5274,-36.01
5275,-37.66
5276,-39.43
5277,-41.08
5278,-42.69
5279,-44.37
5280,-46.17
5281,-47.82
5282,-49.19
5283,-50.14
5284,-50.87
5285,-51.27
5286,-51.42
5287,-51.42
5288,-51.61
5289,-52.03
5290,-52.70
5291,-53.44
5292,-54.32
5293,-55.24
5294,-56.15
5295,-56.88
5296,-57.40
5297,-57.59
5298,-57.56
5299,-57.31
5300,-57.01
5301,-56.73
5302,-56.61
5303,-56.61
5304,-56.79
5305,-57.01
5306,-57.22
5307,-57.50
5308,-57.83
5309,-58.07
5310,-57.92
5311,-57.50
5312,-56.95
5313,-56.43
5314,-55.82
5315,-55.15
5316,-54.57
5317,-54.29
5318,-54.23
5319,-54.29
5320,-54.32
5321,-54.29
5322,-54.17
5323,-53.96
5324,-53.68
5325,-53.44
5326,-53.22
5327,-52.95
5328,-52.73
5329,-52.73
5330,-53.04
5331,-53.53
5332,-54.05
5333,-54.50
5334,-55.11
5335,-55.82
5336,-56.52
5337,-57.01
5338,-57.22
5339,-57.22
5340,-57.07
5341,-56.79
5342,-56.52
5343,-56.27
5344,-56.21
5345,-56.43
5346,-56.95
5347,-57.68
5348,-58.56
5349,-59.51
5350,-60.46
5351,-61.19
5352,-61.55
5353,-61.52
5354,-61.34
5355,-61.07
5356,-60.85
5357,-60.61
5358,-60.39
5359,-60.12
5360,-59.84
5361,-59.60
5362,-59.51
5363,-59.54
5364,-59.48
5365,-59.23
5366,-58.81
5367,-58.35
5368,-57.89
5369,-57.40
5370,-56.85
5371,-56.40
5372,-56.15
5373,-56.15
5374,-56.18
5375,-56.21
5376,-56.30
5377,-56.55
5378,-56.67
5379,-56.49
5380,-55.85
5381,-54.84
5382,-53.65
5383,-52.49
5384,-51.39
5385,-50.42
5386,-49.59
5387,-49.10
5388,-49.13
5389,-49.62
5390,-50.35
5391,-51.12
5392,-51.70
5393,-51.91
5394,-51.73
5395,-51.24
5396,-50.75
5397,-50.51
5398,-50.45
5399,-50.45
5400,-50.51
5401,-50.75
5402,-51.27
5403,-52.00
5404,-52.70
5405,-53.22
5406,-53.47
5407,-53.44
5408,-53.13
5409,-52.67
5410,-52.15
5411,-51.67
5412,-51.15
5413,-50.69
5414,-50.32
5415,-50.11
5416,-49.93
5417,-49.68
5418,-49.35
5419,-48.89
5420,-48.25
5421,-47.55
5422,-46.72
5423,-46.02
5424,-45.47
5425,-45.01
5426,-44.43
5427,-43.76
5428,-42.91
5429,-41.96
5430,-40.83
5431,-39.67
5432,-38.48
5433,-37.51
5434,-36.77
5435,-36.35
5436,-36.07
5437,-35.86
5438,-35.49
5439,-35.03
5440,-34.52
5441,-34.03
5442,-33.51
5443,-33.05
5444,-32.75
5445,-32.71
5446,-33.02
5447,-33.54
5448,-34.06
5449,-34.30
5450,-34.12
5451,-33.69
5452,-33.05
5453,-32.29
5454,-31.43
5455,-30.70
5456,-30.46
5457,-30.67
5458,-31.16
5459,-31.65
5460,-32.23
5461,-32.93
5462,-33.72
5463,-34.42
5464,-35.00
5465,-35.49
5466,-36.01
5467,-36.44
5468,-36.80
5469,-37.05
5470,-37.29
5471,-37.51
5472,-37.63
5473,-37.63
5474,-37.72
5475,-37.93
5476,-38.21
5477,-38.45
5478,-38.79
5479,-39.22
5480,-39.73
5481,-40.25
5482,-40.80
5483,-41.26
5484,-41.47
5485,-41.50
5486,-41.47
5487,-41.44
5488,-41.29
5489,-41.08
5490,-40.95
5491,-40.92
5492,-40.83
5493,-40.62
5494,-40.47
5495,-40.44
5496,-40.50
5497,-40.74
5498,-41.29
5499,-42.27
5500,-43.49
5501,-44.46
5502,-44.86
5503,-44.62
5504,-43.95
5505,-42.97
5506,-41.69
5507,-40.22
5508,-38.91
5509,-37.93
5510,-37.29
5511,-36.87
5512,-36.50
5513,-36.25
5514,-36.10
5515,-36.13
5516,-36.25
5517,-36.50
5518,-36.87
5519,-37.35
5520,-37.87
5521,-38.39
5522,-38.70
5523,-38.67
5524,-38.36
5525,-37.90
5526,-37.45
5527,-36.90
5528,-36.32
5529,-35.86
5530,-35.83
5531,-36.01
5532,-36.10
5533,-35.92
5534,-35.64
5535,-35.34
5536,-34.94
5537,-34.48
5538,-34.24
5539,-34.42
5540,-35.13
5541,-36.07
5542,-37.29
5543,-38.73
5544,-40.34
5545,-41.78
5546,-42.79
5547,-43.21
5548,-43.46
5549,-43.61
5550,-44.01
5551,-44.43
5552,-45.14
5553,-46.05
5554,-47.30
5555,-48.74
5556,-50.29
5557,-51.70
5558,-53.04
5559,-54.17
5560,-55.36
5561,-56.52
5562,-57.80
5563,-58.96
5564,-60.06
5565,-60.97
5566,-61.89
5567,-62.84
5568,-63.90
5569,-64.82
5570,-65.55
5571,-66.01
5572,-66.44
5573,-66.86
5574,-67.32
5575,-67.84
5576,-68.51
5577,-69.15
5578,-69.73
5579,-70.25
5580,-70.89
5581,-71.53
5582,-72.08
5583,-72.33
5584,-72.54
5585,-72.72
5586,-72.94
5587,-73.18
5588,-73.58
5589,-74.04
5590,-74.46
5591,-74.71
5592,-74.86
5593,-75.07
5594,-75.47
5595,-75.96
5596,-76.39
5597,-76.60
5598,-76.69
5599,-76.66
5600,-76.63
5601,-76.66
5602,-76.69
5603,-76.69
5604,-76.57
5605,-76.57
5606,-76.90
5607,-77.64
5608,-78.52
5609,-79.25
5610,-79.74
5611,-79.99
5612,-79.99
5613,-79.74
5614,-79.25
5615,-78.77
5616,-78.52
5617,-78.77
5618,-79.41
5619,-80.14
5620,-80.66
5621,-80.93
5622,-81.02
5623,-80.75
5624,-79.96
5625,-78.77
5626,-77.55
5627,-76.51
5628,-75.84
5629,-75.62
5630,-76.05
5631,-77.00
5632,-78.16
5633,-79.16
5634,-79.86
5635,-80.32
5636,-80.57
5637,-80.57
5638,-80.32
5639,-80.08
5640,-80.05
5641,-80.29
5642,-80.66
5643,-80.93
5644,-80.96
5645,-80.69
5646,-80.23
5647,-79.77
5648,-79.35
5649,-78.86
5650,-78.19
5651,-77.48
5652,-76.90
5653,-76.42
5654,-75.84
5655,-75.10
5656,-74.52
5657,-74.25
5658,-74.31
5659,-74.55
5660,-74.98
5661,-75.74
5662,-76.72
5663,-77.67
5664,-78.34
5665,-78.83
5666,-79.38
5667,-80.05
5668,-80.81
5669,-81.54
5670,-82.34
5671,-83.28
5672,-84.32
5673,-85.02
5674,-85.27
5675,-85.02
5676,-84.56
5677,-84.01
5678,-83.56
5679,-83.34
5680,-83.50
5681,-83.95
5682,-84.59
5683,-85.33
5684,-86.18
5685,-86.91
5686,-87.25
5687,-86.98
5688,-86.27
5689,-85.54
5690,-85.08
5691,-84.81
5692,-84.66
5693,-84.69
5694,-85.11
5695,-85.78
5696,-86.36
5697,-86.67
5698,-86.76
5699,-86.73
5700,-86.46
5701,-86.03
5702,-85.54
5703,-85.27
5704,-85.17
5705,-85.24
5706,-85.30
5707,-85.30
5708,-85.08
5709,-84.66
5710,-83.95
5711,-82.98
5712,-81.70
5713,-80.32
5714,-78.86
5715,-77.42
5716,-75.78
5717,-74.19
5718,-72.63
5719,-71.23
5720,-69.58
5721,-67.99
5722,-66.47
5723,-65.31
5724,-64.06
5725,-62.71
5726,-61.16
5727,-59.78
5728,-58.26
5729,-56.64
5730,-54.75
5731,-53.10
5732,-51.85
5733,-51.21
5734,-50.69
5735,-50.29
5736,-49.77
5737,-49.32
5738,-48.68
5739,-47.76
5740,-46.39
5741,-44.74
5742,-42.91
5743,-40.99
5744,-38.88
5745,-36.74
5746,-34.82
5747,-33.36
5748,-32.35
5749,-31.89
5750,-32.04
5751,-32.78
5752,-33.84
5753,-35.06
5754,-36.38
5755,-37.78
5756,-39.31
5757,-40.74
5758,-42.08
5759,-43.24
5760,-44.40
5761,-45.56
5762,-46.88
5763,-48.03
5764,-49.04
5765,-49.71
5766,-50.32
5767,-50.75
5768,-51.09
5769,-51.30
5770,-51.64
5771,-52.06
5772,-52.67
5773,-53.38
5774,-54.38
5775,-55.57
5776,-56.76
5777,-57.71
5778,-58.47
5779,-59.14
5780,-59.97
5781,-60.64
5782,-61.22
5783,-61.65
5784,-62.32
5785,-63.23
5786,-64.36
5787,-65.34
5788,-66.07
5789,-66.53
5790,-66.80
5791,-66.77
5792,-66.53
5793,-66.04
5794,-65.46
5795,-64.97
5796,-64.58
5797,-64.36
5798,-64.27
5799,-64.30
5800,-64.27
5801,-64.03
5802,-63.45
5803,-62.74
5804,-62.10
5805,-61.58
5806,-61.19
5807,-60.97
5808,-61.10
5809,-61.58
5810,-62.16
5811,-62.68
5812,-63.02
5813,-63.26
5814,-63.39
5815,-63.39
5816,-63.29
5817,-63.26
5818,-63.54
5819,-64.00
5820,-64.54
5821,-65.03
5822,-65.52
5823,-65.95
5824,-66.35
5825,-66.62
5826,-66.77
5827,-66.74
5828,-66.56
5829,-66.28
5830,-66.19
5831,-66.44
5832,-66.96
5833,-67.44
5834,-67.72
5835,-67.69
5836,-67.57
5837,-67.54
5838,-67.72
5839,-67.96
5840,-68.21
5841,-68.42
5842,-68.76
5843,-69.24
5844,-69.76
5845,-70.25
5846,-70.71
5847,-71.20
5848,-71.72
5849,-72.17
5850,-72.54
5851,-72.78
5852,-73.00
5853,-73.21
5854,-73.43
5855,-73.43
5856,-73.15
5857,-72.63
5858,-72.20
5859,-71.93
5860,-71.87
5861,-71.87
5862,-71.93
5863,-71.90
5864,-71.84
5865,-71.81
5866,-72.05
5867,-72.51
5868,-73.21
5869,-73.91
5870,-74.65
5871,-75.32
5872,-76.08
5873,-76.78
5874,-77.48
5875,-78.22
5876,-78.98
5877,-79.65
5878,-80.32
5879,-81.02
5880,-81.91
5881,-82.86
5882,-83.77
5883,-84.53
5884,-85.05
5885,-85.24
5886,-85.14
5887,-84.90
5888,-84.78
5889,-84.78
5890,-84.75
5891,-84.50
5892,-84.08
5893,-83.59
5894,-83.10
5895,-82.67
5896,-82.09
5897,-81.42
5898,-80.51
5899,-79.56
5900,-78.52
5901,-77.64
5902,-76.69
5903,-75.78
5904,-74.68
5905,-73.79
5906,-73.00
5907,-72.33
5908,-71.29
5909,-69.92
5910,-68.24
5911,-66.56
5912,-64.85
5913,-63.23
5914,-61.55
5915,-60.15
5916,-58.96
5917,-58.07
5918,-57.10
5919,-55.94
5920,-54.44
5921,-52.80
5922,-50.99
5923,-49.35
5924,-47.82
5925,-46.63
5926,-45.87
5927,-45.65
5928,-45.81
5929,-46.11
5930,-46.17
5931,-45.96
5932,-45.38
5933,-44.68
5934,-43.82
5935,-42.91
5936,-41.78
5937,-40.62
5938,-39.43
5939,-38.48
5940,-37.75
5941,-37.29
5942,-36.99
5943,-36.77
5944,-36.53
5945,-36.29
5946,-36.04
5947,-35.83
5948,-35.58
5949,-35.34
5950,-35.13
5951,-35.10
5952,-35.40
5953,-36.13
5954,-37.29
5955,-38.73
5956,-40.25
5957,-41.69
5958,-43.06
5959,-44.22
5960,-45.23
5961,-46.17
5962,-47.21
5963,-48.13
5964,-48.92
5965,-49.38
5966,-49.68
5967,-49.87
5968,-50.11
5969,-50.35
5970,-50.66
5971,-50.87
5972,-50.96
5973,-50.96
5974,-51.03
5975,-51.24
5976,-51.57
5977,-52.09
5978,-52.80
5979,-53.74
5980,-54.81
5981,-55.82
5982,-56.55
5983,-56.76
5984,-56.40
5985,-55.66
5986,-54.87
5987,-54.14
5988,-53.50
5989,-53.01
5990,-52.80
5991,-53.07
5992,-53.68
5993,-54.44
5994,-55.02
5995,-55.24
5996,-55.18
5997,-54.93
5998,-54.60
5999,-54.11
6000,-53.50
6001,-52.80
6002,-52.03
6003,-51.30
6004,-50.54
6005,-49.87
6006,-49.29
6007,-48.80
6008,-48.28
6009,-47.82
6010,-47.55
6011,-47.55
6012,-47.67
6013,-47.70
6014,-47.52
6015,-47.24
6016,-47.06
6017,-47.06
6018,-47.21
6019,-47.49
6020,-47.79
6021,-48.00
6022,-48.07
6023,-48.10
6024,-48.16
6025,-48.10
6026,-47.91
6027,-47.73
6028,-47.70
6029,-47.91
6030,-48.16
6031,-48.43
6032,-48.89
6033,-49.59
6034,-50.35
6035,-50.84
6036,-51.03
6037,-50.99
6038,-50.96
6039,-50.93
6040,-50.93
6041,-50.93
6042,-51.06
6043,-51.27
6044,-51.54
6045,-51.82
6046,-52.00
6047,-52.00
6048,-51.73
6049,-51.27
6050,-50.69
6051,-50.20
6052,-49.87
6053,-49.65
6054,-49.38
6055,-48.89
6056,-48.19
6057,-47.49
6058,-46.91
6059,-46.42
6060,-45.84
6061,-45.14
6062,-44.46
6063,-43.98
6064,-43.61
6065,-43.43
6066,-43.30
6067,-43.27
6068,-43.30
6069,-43.33
6070,-43.33
6071,-43.30
6072,-43.24
6073,-43.30
6074,-43.49
6075,-43.70
6076,-43.79
6077,-43.82
6078,-43.95
6079,-44.16
6080,-44.22
6081,-44.01
6082,-43.70
6083,-43.43
6084,-43.15
6085,-42.94
6086,-42.91
6087,-43.12
6088,-43.52
6089,-44.04
6090,-44.56
6091,-45.04
6092,-45.41
6093,-45.65
6094,-45.75
6095,-45.75
6096,-45.68
6097,-45.44
6098,-45.01
6099,-44.49
6100,-44.13
6101,-43.88
6102,-43.70
6103,-43.46
6104,-43.21
6105,-42.94
6106,-42.79
6107,-42.79
6108,-43.00
6109,-43.49
6110,-44.16
6111,-44.86
6112,-45.59
6113,-46.30
6114,-47.03
6115,-47.52
6116,-47.61
6117,-47.33
6118,-47.03
6119,-47.00
6120,-47.33
6121,-47.82
6122,-48.37
6123,-48.83
6124,-49.16
6125,-49.44
6126,-49.62
6127,-49.59
6128,-49.29
6129,-48.83
6130,-48.43
6131,-48.16
6132,-47.91
6133,-47.70
6134,-47.70
6135,-47.88
6136,-48.19
6137,-48.43
6138,-48.77
6139,-49.22
6140,-49.77
6141,-50.26
6142,-50.60
6143,-50.84
6144,-51.09
6145,-51.27
6146,-51.51
6147,-52.00
6148,-52.98
6149,-54.41
6150,-56.00
6151,-57.46
6152,-58.72
6153,-59.69
6154,-60.18
6155,-59.91
6156,-58.96
6157,-57.74
6158,-56.76
6159,-56.24
6160,-56.15
6161,-56.40
6162,-57.10
6163,-58.32
6164,-59.78
6165,-61.00
6166,-61.68
6167,-61.92
6168,-61.98
6169,-61.95
6170,-61.77
6171,-61.52
6172,-61.46
6173,-61.71
6174,-62.10
6175,-62.35
6176,-62.35
6177,-62.10
6178,-61.71
6179,-61.19
6180,-60.73
6181,-60.52
6182,-60.58
6183,-60.79
6184,-61.00
6185,-61.28
6186,-61.71
6187,-62.13
6188,-62.38
6189,-62.41
6190,-62.50
6191,-62.71
6192,-62.84
6193,-62.90
6194,-62.99
6195,-63.20
6196,-63.39
6197,-63.39
6198,-63.35
6199,-63.35
6200,-63.32
6201,-63.08
6202,-62.59
6203,-62.10
6204,-61.86
6205,-61.86
6206,-61.92
6207,-61.92
6208,-61.95
6209,-62.16
6210,-62.62
6211,-63.11
6212,-63.48
6213,-63.72
6214,-63.96
6215,-64.18
6216,-64.30
6217,-64.33
6218,-64.36
6219,-64.30
6220,-64.12
6221,-63.87
6222,-63.96
6223,-64.39
6224,-65.00
6225,-65.52
6226,-65.98
6227,-66.44
6228,-66.86
6229,-67.05
6230,-67.17
6231,-67.38
6232,-67.99
6233,-68.91
6234,-70.07
6235,-71.26
6236,-72.63
6237,-74.04
6238,-75.41
6239,-76.60
6240,-77.76
6241,-78.89
6242,-80.14
6243,-81.36
6244,-82.46
6245,-83.13
6246,-83.40
6247,-83.40
6248,-83.40
6249,-83.37
6250,-83.19
6251,-82.98
6252,-82.95
6253,-83.16
6254,-83.40
6255,-83.44
6256,-83.28
6257,-83.01
6258,-82.61
6259,-82.18
6260,-81.70
6261,-81.21
6262,-80.69
6263,-80.23
6264,-79.86
6265,-79.62
6266,-79.38
6267,-79.16
6268,-78.95
6269,-78.70
6270,-78.34
6271,-77.91
6272,-77.45
6273,-76.93
6274,-76.20
6275,-75.56
6276,-75.20
6277,-75.13
6278,-75.20
6279,-75.26
6280,-75.41
6281,-75.59
6282,-75.62
6283,-75.44
6284,-75.16
6285,-74.89
6286,-74.52
6287,-74.07
6288,-73.64
6289,-73.36
6290,-73.30
6291,-73.33
6292,-73.33
6293,-73.33
6294,-73.33
6295,-73.33
6296,-73.30
6297,-73.33
6298,-73.39
6299,-73.39
6300,-73.15
6301,-72.69
6302,-72.14
6303,-71.66
6304,-71.17
6305,-70.74
6306,-70.28
6307,-69.79
6308,-69.15
6309,-68.48
6310,-67.78
6311,-67.08
6312,-66.19
6313,-65.22
6314,-64.33
6315,-63.87
6316,-63.87
6317,-64.12
6318,-64.36
6319,-64.61
6320,-65.00
6321,-65.49
6322,-65.80
6323,-65.80
6324,-65.67
6325,-65.64
6326,-65.80
6327,-66.04
6328,-66.35
6329,-66.80
6330,-67.57
6331,-68.51
6332,-69.55
6333,-70.50
6334,-71.41
6335,-72.36
6336,-73.39
6337,-74.34
6338,-75.13
6339,-75.84
6340,-76.60
6341,-77.30
6342,-77.85
6343,-78.06
6344,-78.09
6345,-78.06
6346,-78.13
6347,-78.09
6348,-78.06
6349,-78.03
6350,-78.25
6351,-78.70
6352,-79.38
6353,-80.11
6354,-80.81
6355,-81.54
6356,-82.31
6357,-83.01
6358,-83.59
6359,-84.08
6360,-84.59
6361,-85.05
6362,-85.30
6363,-85.30
6364,-85.21
6365,-85.21
6366,-85.27
6367,-85.27
6368,-85.14
6369,-84.93
6370,-84.66
6371,-84.41
6372,-84.17
6373,-83.92
6374,-83.71
6375,-83.47
6376,-83.19
6377,-82.95
6378,-82.82
6379,-82.86
6380,-82.82
6381,-82.64
6382,-82.12
6383,-81.42
6384,-80.51
6385,-79.56
6386,-78.49
6387,-77.33
6388,-75.96
6389,-74.55
6390,-73.06
6391,-71.66
6392,-70.28
6393,-69.09
6394,-68.05
6395,-67.38
6396,-66.96
6397,-66.74
6398,-66.53
6399,-66.31
6400,-66.07
6401,-65.83
6402,-65.52
6403,-65.28
6404,-65.31
6405,-65.77
6406,-66.62
6407,-67.63
6408,-68.54
6409,-69.24
6410,-69.73
6411,-69.95
6412,-69.95
6413,-69.95
6414,-70.16
6415,-70.62
6416,-71.23
6417,-71.96
6418,-72.94
6419,-74.10
6420,-75.38
6421,-76.60
6422,-77.70
6423,-78.61
6424,-79.38
6425,-79.83
6426,-80.14
6427,-80.35
6428,-80.63
6429,-80.84
6430,-81.05
6431,-81.27
6432,-81.63
6433,-82.09
6434,-82.67
6435,-83.13
6436,-83.56
6437,-83.98
6438,-84.59
6439,-85.33
6440,-86.12
6441,-86.82
6442,-87.46
6443,-88.17
6444,-89.08
6445,-90.03
6446,-90.79
6447,-91.28
6448,-91.67
6449,-91.86
6450,-91.77
6451,-91.31
6452,-90.64
6453,-89.87
6454,-89.17
6455,-88.65
6456,-88.65
6457,-89.36
6458,-90.73
6459,-92.44
6460,-94.18
6461,-95.67
6462,-96.59
6463,-96.83
6464,-96.37
6465,-95.43
6466,-94.09
6467,-92.65
6468,-91.25
6469,-90.06
6470,-89.11
6471,-88.41
6472,-87.80
6473,-87.10
6474,-86.18
6475,-85.24
6476,-84.32
6477,-83.65
6478,-83.04
6479,-82.61
6480,-82.18
6481,-82.00
6482,-81.85
6483,-81.63
6484,-81.05
6485,-80.14
6486,-78.92
6487,-77.73
6488,-76.60
6489,-75.65
6490,-74.89
6491,-74.43
6492,-74.16
6493,-73.97
6494,-73.58
6495,-72.88
6496,-71.81
6497,-70.65
6498,-69.40
6499,-68.24
6500,-66.99
6501,-65.80
6502,-64.76
6503,-64.06
6504,-63.60
6505,-63.14
6506,-62.44
6507,-61.52
6508,-60.42
6509,-59.48
6510,-58.59
6511,-57.89
6512,-57.40
6513,-57.16
6514,-57.13
6515,-57.40
6516,-57.86
6517,-58.38
6518,-58.65
6519,-58.69
6520,-58.50
6521,-58.23
6522,-57.92
6523,-57.68
6524,-57.65
6525,-57.86
6526,-58.35
6527,-59.11
6528,-60.03
6529,-60.97
6530,-61.80
6531,-62.26
6532,-62.44
6533,-62.41
6534,-62.35
6535,-62.38
6536,-62.41
6537,-62.41
6538,-62.32
6539,-62.10
6540,-61.74
6541,-61.28
6542,-60.64
6543,-59.94
6544,-59.17
6545,-58.47
6546,-57.71
6547,-57.01
6548,-56.40
6549,-55.97
6550,-55.45
6551,-54.81
6552,-53.68
6553,-52.28
6554,-50.54
6555,-48.65
6556,-46.54
6557,-44.43
6558,-42.30
6559,-40.37
6560,-38.64
6561,-37.26
6562,-36.16
6563,-35.19
6564,-34.18
6565,-33.23
6566,-32.56
6567,-32.35
6568,-32.32
6569,-32.35
6570,-32.38
6571,-32.62
6572,-33.14
6573,-33.87
6574,-34.64
6575,-35.37
6576,-36.10
6577,-36.77
6578,-37.45
6579,-38.15
6580,-39.03
6581,-39.98
6582,-40.92
6583,-41.60
6584,-42.14
6585,-42.60
6586,-43.15
6587,-43.58
6588,-43.91
6589,-44.10
6590,-44.56
6591,-45.20
6592,-46.17
6593,-47.33
6594,-48.95
6595,-50.81
6596,-52.92
6597,-54.81
6598,-56.55
6599,-58.17
6600,-60.00
6601,-61.83
6602,-63.81
6603,-65.70
6604,-67.75
6605,-69.55
6606,-71.23
6607,-72.63
6608,-74.19
6609,-75.74
6610,-77.42
6611,-79.07
6612,-81.18
6613,-83.47
6614,-85.91
6615,-88.01
6616,-90.18
6617,-92.22
6618,-94.33
6619,-96.19
6620,-98.14
6621,-99.98
6622,-101.90
6623,-103.49
6624,-105.01
6625,-106.41
6626,-107.94
6627,-109.28
6628,-110.66
6629,-112.00
6630,-113.92
6631,-116.24
6632,-118.99
6633,-121.61
6634,-124.11
6635,-126.19
6636,-127.96
6637,-129.12
6638,-129.85
6639,-130.25
6640,-130.74
6641,-131.44
6642,-132.48
6643,-133.67
6644,-134.89
6645,-136.11
6646,-137.30
6647,-138.24
6648,-138.76
6649,-138.79
6650,-138.43
6651,-137.91
6652,-137.30
6653,-136.63
6654,-135.83
6655,-135.13
6656,-134.49
6657,-133.82
6658,-132.75
6659,-131.35
6660,-129.58
6661,-127.72
6662,-125.61
6663,-123.50
6664,-121.34
6665,-119.42
6666,-117.71
6667,-116.36
6668,-115.14
6669,-113.98
6670,-112.55
6671,-111.18
6672,-109.92
6673,-109.01
6674,-108.06
6675,-107.15
6676,-106.23
6677,-105.53
6678,-104.83
6679,-103.91
6680,-102.66
6681,-101.20
6682,-99.73
6683,-98.51
6684,-97.69
6685,-97.20
6686,-97.08
6687,-97.32
6688,-97.96
6689,-98.91
6690,-100.10
6691,-101.26
6692,-102.45
6693,-103.64
6694,-104.98
6695,-106.35
6696,-107.85
6697,-109.28
6698,-110.81
6699,-112.18
6700,-113.40
6701,-114.35
6702,-115.30
6703,-116.15
6704,-117.10
6705,-118.01
6706,-119.26
6707,-120.67
6708,-122.10
6709,-123.26
6710,-124.36
6711,-125.52
6712,-126.92
6713,-128.36
6714,-129.73
6715,-130.89
6716,-132.05
6717,-133.21
6718,-134.46
6719,-135.65
6720,-136.78
6721,-137.73
6722,-138.46
6723,-138.92
6724,-139.16
6725,-139.16
6726,-138.92
6727,-138.46
6728,-137.76
6729,-137.02
6730,-136.41
6731,-135.99
6732,-135.47
6733,-134.80
6734,-133.73
6735,-132.35
6736,-130.46
6737,-128.36
6738,-125.89
6739,-123.35
6740,-120.48
6741,-117.65
6742,-114.72
6743,-112.21
6744,-109.86
6745,-107.79
6746,-105.44
6747,-103.15
6748,-100.77
6749,-98.69
6750,-96.47
6751,-94.18
6752,-91.55
6753,-88.96
6754,-86.24
6755,-83.71
6756,-81.12
6757,-78.80
6758,-76.48
6759,-74.43
6760,-72.24
6761,-70.16
6762,-67.90
6763,-65.86
6764,-63.69
6765,-61.61
6766,-59.27
6767,-56.95
6768,-54.53
6769,-52.43
6770,-50.38
6771,-48.55
6772,-46.69
6773,-45.04
6774,-43.55
6775,-42.42
6776,-41.35
6777,-40.50
6778,-39.52
6779,-38.60
6780,-37.57
6781,-36.68
6782,-35.74
6783,-34.82
6784,-33.66
6785,-32.56
6786,-31.37
6787,-30.18
6788,-28.72
6789,-27.13
6790,-25.36
6791,-23.68
6792,-21.91
6793,-20.29
6794,-18.89
6795,-17.97
6796,-17.24
6797,-16.60
6798,-15.75
6799,-14.83
6800,-13.70
6801,-12.54
6802,-11.26
6803,-9.83
6804,-8.15
6805,-6.50
6806,-5.04
6807,-4.06
6808,-3.60
6809,-3.60
6810,-4.03
6811,-4.76
6812,-5.68
6813,-6.62
6814,-7.63
6815,-8.54
6816,-9.46
6817,-10.38
6818,-11.54
6819,-12.94
6820,-14.71
6821,-16.60
6822,-18.62
6823,-20.48
6824,-22.40
6825,-24.23
6826,-26.18
6827,-28.08
6828,-30.03
6829,-31.83
6830,-33.84
6831,-35.95
6832,-38.42
6833,-40.71
6834,-42.91
6835,-44.77
6836,-46.81
6837,-48.89
6838,-51.03
6839,-52.92
6840,-54.87
6841,-56.67
6842,-58.44
6843,-59.88
6844,-61.16
6845,-62.01
6846,-62.56
6847,-62.77
6848,-63.11
6849,-63.51
6850,-64.03
6851,-64.48
6852,-65.19
6853,-66.13
6854,-67.23
6855,-68.21
6856,-68.91
6857,-69.40
6858,-69.64
6859,-69.64
6860,-69.27
6861,-68.60
6862,-67.69
6863,-66.68
6864,-65.64
6865,-64.76
6866,-63.96
6867,-63.23
6868,-62.38
6869,-61.46
6870,-60.61
6871,-59.84
6872,-59.08
6873,-58.44
6874,-57.92
6875,-57.68
6876,-57.43
6877,-57.25
6878,-57.16
6879,-57.19
6880,-56.98
6881,-56.55
6882,-55.91
6883,-55.45
6884,-55.02
6885,-54.60
6886,-53.89
6887,-53.19
6888,-52.61
6889,-52.12
6890,-51.57
6891,-50.87
6892,-50.11
6893,-49.38
6894,-48.61
6895,-47.94
6896,-47.39
6897,-47.18
6898,-47.15
6899,-47.18
6900,-47.03
6901,-46.81
6902,-46.54
6903,-46.33
6904,-45.99
6905,-45.53
6906,-44.95
6907,-44.46
6908,-44.13
6909,-43.91
6910,-43.70
6911,-43.46
6912,-43.18
6913,-42.97
6914,-42.79
6915,-42.54
6916,-42.11
6917,-41.69
6918,-41.29
6919,-41.02
6920,-40.74
6921,-40.59
6922,-40.56
6923,-40.53
6924,-40.22
6925,-39.79
6926,-39.43
6927,-39.15
6928,-38.70
6929,-37.99
6930,-37.41
6931,-37.14
6932,-37.02
6933,-36.80
6934,-36.59
6935,-36.56
6936,-36.83
6937,-37.32
6938,-37.87
6939,-38.36
6940,-38.73
6941,-38.97
6942,-39.09
6943,-39.12
6944,-38.97
6945,-38.73
6946,-38.39
6947,-38.18
6948,-38.15
6949,-38.39
6950,-38.73
6951,-39.00
6952,-39.06
6953,-38.82
6954,-38.24
6955,-37.54
6956,-36.77
6957,-36.07
6958,-35.34
6959,-34.61
6960,-34.06
6961,-33.81
6962,-33.81
6963,-33.84
6964,-33.69
6965,-33.45
6966,-33.33
6967,-33.57
6968,-34.06
6969,-34.55
6970,-34.91
6971,-35.16
6972,-35.34
6973,-35.31
6974,-35.03
6975,-34.55
6976,-34.12
6977,-33.81
6978,-33.75
6979,-34.00
6980,-34.76
6981,-35.92
6982,-37.35
6983,-38.82
6984,-40.22
6985,-41.41
6986,-42.21
6987,-42.42
6988,-42.27
6989,-41.99
6990,-41.84
6991,-41.84
6992,-41.96
6993,-42.21
6994,-42.63
6995,-43.09
6996,-43.49
6997,-43.73
6998,-43.95
6999,-44.16
7000,-44.37
7001,-44.62
7002,-44.95
7003,-45.44
7004,-46.02
7005,-46.48
7006,-46.72
7007,-46.72
7008,-46.57
7009,-46.33
7010,-45.99
7011,-45.50
7012,-45.01
7013,-44.74
7014,-44.86
7015,-45.32
7016,-46.14
7017,-47.06
7018,-48.16
7019,-49.38
7020,-50.69
7021,-51.85
7022,-52.76
7023,-53.50
7024,-54.26
7025,-54.90
7026,-55.39
7027,-55.63
7028,-55.94
7029,-56.34
7030,-56.88
7031,-57.37
7032,-57.95
7033,-58.59
7034,-59.45
7035,-60.42
7036,-61.58
7037,-62.74
7038,-63.87
7039,-64.79
7040,-65.73
7041,-66.62
7042,-67.60
7043,-68.57
7044,-69.61
7045,-70.50
7046,-71.32
7047,-72.05
7048,-72.85
7049,-73.52
7050,-73.97
7051,-74.22
7052,-74.43
7053,-74.65
7054,-74.77
7055,-74.77
7056,-74.86
7057,-75.07
7058,-75.41
7059,-75.62
7060,-75.78
7061,-76.02
7062,-76.48
7063,-76.93
7064,-77.18
7065,-77.18
7066,-77.24
7067,-77.42
7068,-77.70
7069,-77.94
7070,-78.40
7071,-79.04
7072,-79.93
7073,-80.90
7074,-82.06
7075,-83.22
7076,-84.20
7077,-84.93
7078,-85.63
7079,-86.30
7080,-86.94
7081,-87.43
7082,-87.86
7083,-88.32
7084,-88.81
7085,-89.05
7086,-88.90
7087,-88.44
7088,-87.83
7089,-87.07
7090,-86.12
7091,-85.21
7092,-84.59
7093,-84.32
7094,-84.14
7095,-83.95
7096,-83.80
7097,-83.77
7098,-83.68
7099,-83.50
7100,-83.22
7101,-82.98
7102,-82.64
7103,-82.18
7104,-81.63
7105,-81.15
7106,-80.78
7107,-80.54
7108,-80.41
7109,-80.41
7110,-80.57
7111,-80.81
7112,-81.09
7113,-81.33
7114,-81.51
7115,-81.51
7116,-81.24
7117,-80.78
7118,-80.20
7119,-79.71
7120,-79.35
7121,-79.13
7122,-78.95
7123,-78.77
7124,-78.37
7125,-77.91
7126,-77.36
7127,-76.93
7128,-76.42
7129,-75.71
7130,-74.71
7131,-73.52
7132,-72.30
7133,-71.11
7134,-69.79
7135,-68.39
7136,-66.89
7137,-65.46
7138,-64.00
7139,-62.59
7140,-61.31
7141,-60.33
7142,-59.66
7143,-59.23
7144,-58.87
7145,-58.65
7146,-58.50
7147,-58.53
7148,-58.65
7149,-58.65
7150,-58.35
7151,-57.86
7152,-57.50
7153,-57.46
7154,-57.74
7155,-58.26
7156,-59.02
7157,-59.97
7158,-60.91
7159,-61.65
7160,-62.13
7161,-62.32
7162,-62.35
7163,-62.29
7164,-62.50
7165,-62.96
7166,-63.75
7167,-64.67
7168,-65.86
7169,-67.26
7170,-68.97
7171,-70.59
7172,-72.17
7173,-73.55
7174,-74.98
7175,-76.39
7176,-77.88
7177,-79.25
7178,-80.75
7179,-82.40
7180,-84.44
7181,-86.55
7182,-88.59
7183,-90.21
7184,-91.67
7185,-92.80
7186,-93.72
7187,-94.15
7188,-94.39
7189,-95.00
7190,-95.40
7191,-95.70
7192,-96.50
7193,-103.85
7194,-106.41
7195,-94.79
7196,-87.49
7197,-117.28
7198,-153.47
7199,-105.19
7200,-1.22
