1,113.45
2,171.10
3,186.92
4,181.63
5,181.77
6,188.61
7,187.07
8,172.87
9,149.90
10,122.94
11,92.33
12,63.17
13,40.88
14,31.49
15,36.83
16,55.83
17,85.16
18,118.59
19,151.20
20,177.33
21,195.29
22,203.17
23,202.54
24,193.76
25,178.55
26,157.24
27,130.80
28,100.26
29,67.80
30,36.19
31,9.05
32,-11.15
33,-22.14
34,-24.74
35,-19.94
36,-11.64
37,-2.13
38,5.10
39,9.62
40,10.67
41,9.97
42,8.41
43,7.61
44,8.06
45,9.79
46,12.36
47,14.85
48,16.90
49,18.01
50,18.52
51,18.59
52,18.69
53,18.97
54,19.52
55,20.24
56,21.10
57,21.86
58,22.46
59,22.77
60,22.91
61,22.91
62,22.89
63,22.85
64,22.87
65,22.91
66,23.03
67,23.17
68,23.37
69,23.54
70,23.67
71,23.72
72,23.75
73,23.77
74,23.80
75,23.85
76,23.99
77,24.22
78,24.57
79,25.02
80,25.56
81,26.12
82,26.70
83,27.26
84,27.82
85,28.35
86,28.88
87,29.32
88,29.68
89,29.91
90,30.07
91,30.18
92,30.28
93,30.33
94,30.36
95,30.39
96,30.42
97,30.43
98,30.36
99,30.21
100,29.98
101,29.72
102,29.43
103,29.15
104,28.92
105,28.77
106,28.73
107,28.76
108,28.79
109,28.81
110,28.79
111,28.76
112,28.67
113,28.56
114,28.45
115,28.36
116,28.27
117,28.21
118,28.22
119,28.28
120,28.34
121,28.34
122,28.31
123,28.21
124,28.03
125,27.79
126,27.54
127,27.33
128,27.18
129,27.08
130,27.07
131,27.12
132,27.26
133,27.47
134,27.74
135,28.04
136,28.34
137,28.64
138,28.95
139,29.24
140,29.52
141,29.75
142,29.98
143,30.18
144,30.37
145,30.52
146,30.63
147,30.72
148,30.80
149,30.85
150,30.89
151,30.94
152,31.07
153,31.28
154,31.56
155,31.85
156,32.17
157,32.52
158,32.94
159,33.39
160,33.84
161,34.26
162,34.66
163,35.04
164,35.40
165,35.71
166,35.91
167,35.97
168,35.87
169,35.64
170,35.29
171,34.87
172,34.36
173,33.82
174,33.33
175,32.94
176,32.62
177,32.39
178,32.24
179,32.18
180,32.16
181,32.14
182,32.11
183,32.14
184,32.25
185,32.42
186,32.65
187,32.88
188,33.15
189,33.44
190,33.78
191,34.10
192,34.43
193,34.77
194,35.22
195,35.74
196,36.39
197,37.09
198,37.89
199,38.68
200,39.51
201,40.27
202,40.99
203,41.53
204,41.98
205,42.28
206,42.57
207,42.83
208,43.11
209,43.37
210,43.66
211,43.98
212,44.36
213,44.72
214,45.01
215,45.19
216,45.25
217,45.17
218,44.90
219,44.45
220,43.84
221,43.14
222,42.44
223,41.82
224,41.28
225,40.86
226,40.54
227,40.32
228,40.12
229,39.92
230,39.67
231,39.40
232,39.16
233,39.01
234,38.93
235,38.90
236,38.94
237,39.06
238,39.25
239,39.46
240,39.67
241,39.85
242,39.99
243,40.11
244,40.24
245,40.37
246,40.53
247,40.69
248,40.84
249,40.96
250,41.02
251,41.05
252,41.08
253,41.15
254,41.19
255,41.18
256,41.05
257,40.86
258,40.52
259,40.06
260,39.41
261,38.64
262,37.77
263,36.93
264,36.15
265,35.51
266,34.96
267,34.53
268,34.14
269,33.84
270,33.52
271,33.22
272,32.79
273,32.31
274,31.72
275,31.11
276,30.39
277,29.66
278,28.89
279,28.17
280,27.38
281,26.60
282,25.77
283,25.02
284,24.24
285,23.52
286,22.77
287,22.10
288,21.46
289,20.92
290,20.36
291,19.82
292,19.17
293,18.48
294,17.65
295,16.81
296,15.89
297,15.05
298,14.23
299,13.55
300,12.97
301,12.57
302,12.28
303,12.09
304,11.88
305,11.70
306,11.52
307,11.44
308,11.38
309,11.40
310,11.47
311,11.60
312,11.69
313,11.71
314,11.59
315,11.32
316,10.84
317,10.19
318,9.43
319,8.67
320,7.97
321,7.43
322,7.13
323,7.10
324,7.29
325,7.61
326,7.94
327,8.26
328,8.46
329,8.56
330,8.52
331,8.41
332,8.26
333,8.17
334,8.14
335,8.17
336,8.26
337,8.35
338,8.40
339,8.34
340,8.14
341,7.80
342,7.41
343,7.03
344,6.76
345,6.63
346,6.74
347,7.08
348,7.68
349,8.45
350,9.38
351,10.32
352,11.28
353,12.09
354,12.84
355,13.44
356,14.01
357,14.51
358,15.09
359,15.69
360,16.44
361,17.25
362,18.23
363,19.25
364,20.38
365,21.49
366,22.64
367,23.70
368,24.73
369,25.57
370,26.28
371,26.75
372,27.13
373,27.37
374,27.59
375,27.71
376,27.88
377,28.09
378,28.47
379,28.93
380,29.49
381,30.02
382,30.56
383,31.02
384,31.42
385,31.72
386,31.94
387,32.07
388,32.17
389,32.25
390,32.39
391,32.59
392,32.85
393,33.12
394,33.42
395,33.71
396,33.97
397,34.12
398,34.17
399,34.13
400,34.03
401,33.88
402,33.72
403,33.58
404,33.55
405,33.61
406,33.76
407,33.94
408,34.13
409,34.31
410,34.49
411,34.67
412,34.81
413,34.90
414,34.96
415,34.97
416,34.87
417,34.68
418,34.33
419,33.88
420,33.35
421,32.82
422,32.31
423,31.90
424,31.54
425,31.27
426,30.96
427,30.56
428,29.95
429,29.19
430,28.27
431,27.32
432,26.33
433,25.42
434,24.57
435,23.88
436,23.23
437,22.65
438,22.09
439,21.63
440,21.19
441,20.83
442,20.46
443,20.17
444,19.92
445,19.76
446,19.60
447,19.44
448,19.20
449,18.91
450,18.56
451,18.21
452,17.83
453,17.49
454,17.17
455,16.93
456,16.74
457,16.57
458,16.36
459,16.06
460,15.66
461,15.20
462,14.79
463,14.47
464,14.31
465,14.37
466,14.70
467,15.29
468,16.11
469,16.97
470,17.85
471,18.63
472,19.41
473,20.13
474,20.90
475,21.74
476,22.80
477,23.97
478,25.29
479,26.56
480,27.80
481,28.85
482,29.78
483,30.43
484,30.92
485,31.28
486,31.72
487,32.23
488,32.87
489,33.48
490,34.13
491,34.70
492,35.23
493,35.62
494,36.00
495,36.35
496,36.84
497,37.41
498,38.19
499,39.09
500,40.19
501,41.31
502,42.43
503,43.43
504,44.39
505,45.19
506,45.94
507,46.60
508,47.36
509,48.13
510,48.98
511,49.80
512,50.67
513,51.51
514,52.36
515,53.03
516,53.57
517,53.93
518,54.28
519,54.57
520,54.92
521,55.30
522,55.79
523,56.34
524,56.95
525,57.50
526,57.93
527,58.16
528,58.19
529,58.03
530,57.80
531,57.58
532,57.41
533,57.36
534,57.43
535,57.63
536,57.82
537,57.90
538,57.75
539,57.37
540,56.73
541,55.92
542,54.98
543,54.06
544,53.22
545,52.61
546,52.16
547,51.90
548,51.67
549,51.43
550,51.00
551,50.41
552,49.53
553,48.49
554,47.29
555,46.08
556,44.86
557,43.77
558,42.78
559,42.00
560,41.34
561,40.80
562,40.20
563,39.57
564,38.86
565,38.19
566,37.48
567,36.84
568,36.22
569,35.71
570,35.20
571,34.74
572,34.26
573,33.83
574,33.40
575,33.09
576,32.85
577,32.72
578,32.62
579,32.54
580,32.42
581,32.26
582,31.96
583,31.58
584,31.14
585,30.75
586,30.42
587,30.16
588,29.94
589,29.78
590,29.59
591,29.40
592,29.11
593,28.80
594,28.43
595,28.08
596,27.71
597,27.34
598,26.93
599,26.52
600,26.05
601,25.56
602,25.01
603,24.49
604,23.95
605,23.49
606,23.06
607,22.72
608,22.38
609,22.02
610,21.51
611,20.90
612,20.13
613,19.36
614,18.50
615,17.70
616,16.84
617,16.08
618,15.25
619,14.43
620,13.38
621,12.21
622,10.73
623,9.10
624,7.13
625,5.09
626,2.89
627,0.83
628,-1.20
629,-2.96
630,-4.62
631,-6.05
632,-7.45
633,-8.71
634,-9.99
635,-11.13
636,-12.27
637,-13.28
638,-14.23
639,-14.96
640,-15.55
641,-15.91
642,-16.11
643,-16.17
644,-16.12
645,-15.94
646,-15.61
647,-15.14
648,-14.53
649,-13.84
650,-13.09
651,-12.37
652,-11.73
653,-11.27
654,-10.96
655,-10.83
656,-10.75
657,-10.70
658,-10.49
659,-10.17
660,-9.58
661,-8.80
662,-7.71
663,-6.52
664,-5.19
665,-3.94
666,-2.66
667,-1.46
668,-0.24
669,0.86
670,1.97
671,2.98
672,4.04
673,5.04
674,6.11
675,7.08
676,8.13
677,9.10
678,10.14
679,11.09
680,12.09
681,13.03
682,14.09
683,15.18
684,16.49
685,17.87
686,19.37
687,20.77
688,22.13
689,23.27
690,24.31
691,25.16
692,26.01
693,26.79
694,27.63
695,28.44
696,29.27
697,29.98
698,30.57
699,30.94
700,31.14
701,31.14
702,31.09
703,31.04
704,31.11
705,31.26
706,31.47
707,31.65
708,31.75
709,31.72
710,31.52
711,31.16
712,30.70
713,30.24
714,29.87
715,29.59
716,29.42
717,29.31
718,29.35
719,29.52
720,29.86
721,30.30
722,30.89
723,31.62
724,32.56
725,33.62
726,34.77
727,35.84
728,36.85
729,37.72
730,38.52
731,39.18
732,39.83
733,40.40
734,41.00
735,41.55
736,42.11
737,42.60
738,43.08
739,43.49
740,43.88
741,44.23
742,44.56
743,44.90
744,45.23
745,45.54
746,45.72
747,45.74
748,45.55
749,45.17
750,44.53
751,43.72
752,42.71
753,41.62
754,40.40
755,39.19
756,37.96
757,36.87
758,35.76
759,34.69
760,33.49
761,32.31
762,31.02
763,29.77
764,28.40
765,27.06
766,25.69
767,24.49
768,23.37
769,22.45
770,21.61
771,20.91
772,20.23
773,19.61
774,18.93
775,18.23
776,17.42
777,16.65
778,15.98
779,15.50
780,15.18
781,15.05
782,15.09
783,15.30
784,15.61
785,15.95
786,16.31
787,16.72
788,17.17
789,17.65
790,18.17
791,18.69
792,19.27
793,19.82
794,20.38
795,20.87
796,21.35
797,21.75
798,22.13
799,22.40
800,22.68
801,22.99
802,23.45
803,23.96
804,24.57
805,25.22
806,25.99
807,26.79
808,27.57
809,28.22
810,28.79
811,29.22
812,29.52
813,29.64
814,29.63
815,29.56
816,29.47
817,29.35
818,29.20
819,29.02
820,28.83
821,28.63
822,28.37
823,28.05
824,27.63
825,27.18
826,26.73
827,26.28
828,25.80
829,25.33
830,24.89
831,24.54
832,24.22
833,23.93
834,23.67
835,23.50
836,23.39
837,23.35
838,23.27
839,23.19
840,23.10
841,23.06
842,22.99
843,22.96
844,22.87
845,22.77
846,22.53
847,22.17
848,21.59
849,20.85
850,19.94
851,18.99
852,18.03
853,17.17
854,16.38
855,15.72
856,15.10
857,14.59
858,14.05
859,13.51
860,12.84
861,12.15
862,11.41
863,10.77
864,10.16
865,9.67
866,9.26
867,9.01
868,8.85
869,8.78
870,8.67
871,8.57
872,8.43
873,8.35
874,8.30
875,8.31
876,8.32
877,8.33
878,8.27
879,8.10
880,7.77
881,7.29
882,6.70
883,6.09
884,5.55
885,5.15
886,4.97
887,4.99
888,5.24
889,5.66
890,6.23
891,6.91
892,7.72
893,8.63
894,9.68
895,10.81
896,12.02
897,13.18
898,14.24
899,15.07
900,15.72
901,16.14
902,16.43
903,16.62
904,16.82
905,17.02
906,17.26
907,17.46
908,17.63
909,17.72
910,17.72
911,17.59
912,17.38
913,17.17
914,17.01
915,16.95
916,16.95
917,16.95
918,16.94
919,16.91
920,16.85
921,16.72
922,16.55
923,16.33
924,16.13
925,15.98
926,15.92
927,15.95
928,16.05
929,16.24
930,16.50
931,16.85
932,17.29
933,17.74
934,18.16
935,18.49
936,18.71
937,18.75
938,18.68
939,18.52
940,18.36
941,18.26
942,18.30
943,18.50
944,18.90
945,19.47
946,20.16
947,20.82
948,21.38
949,21.74
950,21.90
951,21.93
952,21.87
953,21.77
954,21.66
955,21.54
956,21.42
957,21.27
958,21.06
959,20.74
960,20.29
961,19.77
962,19.26
963,18.82
964,18.56
965,18.49
966,18.65
967,18.97
968,19.45
969,20.01
970,20.69
971,21.38
972,22.13
973,22.88
974,23.77
975,24.72
976,25.82
977,26.92
978,28.19
979,29.46
980,30.86
981,32.23
982,33.73
983,35.17
984,36.71
985,38.15
986,39.68
987,41.11
988,42.65
989,44.09
990,45.65
991,47.09
992,48.56
993,49.85
994,51.20
995,52.44
996,53.82
997,55.07
998,56.44
999,57.79
1000,59.36
1001,61.01
1002,62.90
1003,64.77
1004,66.75
1005,68.59
1006,70.40
1007,71.98
1008,73.46
1009,74.69
1010,75.85
1011,76.80
1012,77.71
1013,78.51
1014,79.33
1015,80.02
1016,80.67
1017,81.19
1018,81.64
1019,81.95
1020,82.18
1021,82.31
1022,82.44
1023,82.52
1024,82.55
1025,82.50
1026,82.35
1027,82.12
1028,81.75
1029,81.28
1030,80.73
1031,80.15
1032,79.57
1033,79.07
1034,78.67
1035,78.41
1036,78.20
1037,78.04
1038,77.91
1039,77.83
1040,77.69
1041,77.50
1042,77.23
1043,76.96
1044,76.71
1045,76.53
1046,76.43
1047,76.44
1048,76.50
1049,76.61
1050,76.69
1051,76.71
1052,76.55
1053,76.26
1054,75.85
1055,75.44
1056,75.03
1057,74.68
1058,74.36
1059,74.07
1060,73.74
1061,73.31
1062,72.69
1063,71.91
1064,71.03
1065,70.20
1066,69.43
1067,68.85
1068,68.42
1069,68.24
1070,68.20
1071,68.28
1072,68.31
1073,68.29
1074,68.10
1075,67.81
1076,67.34
1077,66.83
1078,66.26
1079,65.71
1080,65.06
1081,64.34
1082,63.49
1083,62.64
1084,61.71
1085,60.78
1086,59.78
1087,58.89
1088,58.15
1089,57.66
1090,57.32
1091,57.14
1092,57.01
1093,56.96
1094,56.91
1095,56.83
1096,56.66
1097,56.46
1098,56.25
1099,56.10
1100,56.02
1101,56.02
1102,56.12
1103,56.33
1104,56.63
1105,57.00
1106,57.38
1107,57.75
1108,58.04
1109,58.26
1110,58.39
1111,58.42
1112,58.31
1113,58.08
1114,57.72
1115,57.27
1116,56.74
1117,56.18
1118,55.61
1119,55.14
1120,54.74
1121,54.44
1122,54.12
1123,53.81
1124,53.42
1125,52.96
1126,52.32
1127,51.57
1128,50.67
1129,49.75
1130,48.80
1131,47.93
1132,47.07
1133,46.29
1134,45.46
1135,44.65
1136,43.75
1137,42.84
1138,41.89
1139,41.00
1140,40.15
1141,39.46
1142,38.86
1143,38.43
1144,38.09
1145,37.83
1146,37.57
1147,37.32
1148,37.05
1149,36.80
1150,36.61
1151,36.52
1152,36.57
1153,36.71
1154,36.90
1155,37.09
1156,37.29
1157,37.51
1158,37.78
1159,38.12
1160,38.56
1161,39.09
1162,39.67
1163,40.25
1164,40.81
1165,41.31
1166,41.73
1167,41.98
1168,42.14
1169,42.21
1170,42.28
1171,42.36
1172,42.50
1173,42.67
1174,42.93
1175,43.24
1176,43.65
1177,44.13
1178,44.67
1179,45.17
1180,45.58
1181,45.85
1182,46.03
1183,46.07
1184,46.00
1185,45.81
1186,45.62
1187,45.46
1188,45.35
1189,45.27
1190,45.19
1191,45.13
1192,45.10
1193,45.07
1194,45.01
1195,44.89
1196,44.71
1197,44.49
1198,44.27
1199,44.08
1200,43.90
1201,43.75
1202,43.59
1203,43.47
1204,43.45
1205,43.50
1206,43.57
1207,43.62
1208,43.62
1209,43.59
1210,43.46
1211,43.24
1212,42.91
1213,42.52
1214,42.08
1215,41.64
1216,41.21
1217,40.86
1218,40.54
1219,40.28
1220,40.05
1221,39.86
1222,39.63
1223,39.43
1224,39.22
1225,39.05
1226,38.88
1227,38.70
1228,38.52
1229,38.38
1230,38.26
1231,38.15
1232,37.99
1233,37.79
1234,37.54
1235,37.28
1236,36.94
1237,36.57
1238,36.16
1239,35.81
1240,35.48
1241,35.19
1242,34.90
1243,34.65
1244,34.36
1245,34.08
1246,33.74
1247,33.42
1248,33.08
1249,32.74
1250,32.33
1251,31.89
1252,31.39
1253,30.88
1254,30.39
1255,29.93
1256,29.56
1257,29.35
1258,29.34
1259,29.49
1260,29.77
1261,30.13
1262,30.55
1263,30.99
1264,31.46
1265,31.89
1266,32.36
1267,32.81
1268,33.35
1269,33.89
1270,34.54
1271,35.23
1272,36.06
1273,36.94
1274,37.90
1275,38.82
1276,39.70
1277,40.44
1278,41.05
1279,41.44
1280,41.71
1281,41.86
1282,42.08
1283,42.35
1284,42.77
1285,43.30
1286,43.97
1287,44.65
1288,45.29
1289,45.75
1290,45.98
1291,45.97
1292,45.73
1293,45.31
1294,44.81
1295,44.31
1296,43.89
1297,43.58
1298,43.33
1299,43.17
1300,42.98
1301,42.82
1302,42.65
1303,42.51
1304,42.31
1305,42.07
1306,41.69
1307,41.23
1308,40.62
1309,39.88
1310,38.98
1311,38.06
1312,37.19
1313,36.51
1314,36.00
1315,35.68
1316,35.51
1317,35.46
1318,35.45
1319,35.47
1320,35.43
1321,35.38
1322,35.31
1323,35.32
1324,35.38
1325,35.51
1326,35.66
1327,35.76
1328,35.73
1329,35.55
1330,35.22
1331,34.78
1332,34.22
1333,33.62
1334,33.04
1335,32.59
1336,32.30
1337,32.13
1338,32.01
1339,31.93
1340,31.87
1341,31.85
1342,31.79
1343,31.74
1344,31.68
1345,31.62
1346,31.55
1347,31.43
1348,31.26
1349,31.08
1350,30.93
1351,30.81
1352,30.71
1353,30.68
1354,30.78
1355,31.04
1356,31.42
1357,31.82
1358,32.18
1359,32.42
1360,32.50
1361,32.40
1362,32.19
1363,31.94
1364,31.75
1365,31.68
1366,31.77
1367,32.01
1368,32.39
1369,32.81
1370,33.20
1371,33.48
1372,33.62
1373,33.64
1374,33.58
1375,33.53
1376,33.50
1377,33.50
1378,33.47
1379,33.36
1380,33.15
1381,32.79
1382,32.25
1383,31.56
1384,30.80
1385,30.08
1386,29.42
1387,28.88
1388,28.49
1389,28.27
1390,28.14
1391,28.08
1392,28.06
1393,28.10
1394,28.19
1395,28.34
1396,28.53
1397,28.75
1398,28.96
1399,29.08
1400,29.03
1401,28.82
1402,28.53
1403,28.21
1404,27.94
1405,27.79
1406,27.85
1407,28.18
1408,28.72
1409,29.36
1410,30.01
1411,30.54
1412,30.93
1413,31.13
1414,31.20
1415,31.21
1416,31.27
1417,31.41
1418,31.68
1419,32.04
1420,32.45
1421,32.80
1422,33.10
1423,33.29
1424,33.45
1425,33.58
1426,33.78
1427,34.03
1428,34.41
1429,34.87
1430,35.46
1431,36.05
1432,36.65
1433,37.20
1434,37.77
1435,38.35
1436,39.02
1437,39.73
1438,40.50
1439,41.24
1440,41.95
1441,42.47
1442,42.82
1443,42.96
1444,42.96
1445,42.86
1446,42.71
1447,42.53
1448,42.34
1449,42.14
1450,41.88
1451,41.53
1452,41.05
1453,40.52
1454,39.95
1455,39.41
1456,38.91
1457,38.51
1458,38.15
1459,37.86
1460,37.55
1461,37.19
1462,36.69
1463,36.09
1464,35.38
1465,34.67
1466,34.03
1467,33.62
1468,33.39
1469,33.38
1470,33.51
1471,33.76
1472,34.05
1473,34.30
1474,34.44
1475,34.47
1476,34.42
1477,34.32
1478,34.22
1479,34.19
1480,34.27
1481,34.45
1482,34.68
1483,34.90
1484,35.09
1485,35.23
1486,35.30
1487,35.30
1488,35.27
1489,35.23
1490,35.20
1491,35.15
1492,35.06
1493,34.94
1494,34.79
1495,34.61
1496,34.39
1497,34.19
1498,34.01
1499,33.87
1500,33.72
1501,33.58
1502,33.43
1503,33.29
1504,33.08
1505,32.84
1506,32.51
1507,32.17
1508,31.72
1509,31.19
1510,30.55
1511,29.87
1512,29.15
1513,28.47
1514,27.80
1515,27.24
1516,26.81
1517,26.54
1518,26.41
1519,26.38
1520,26.44
1521,26.54
1522,26.60
1523,26.63
1524,26.68
1525,26.79
1526,26.98
1527,27.24
1528,27.63
1529,28.10
1530,28.67
1531,29.23
1532,29.76
1533,30.22
1534,30.71
1535,31.20
1536,31.75
1537,32.27
1538,32.84
1539,33.36
1540,33.85
1541,34.17
1542,34.34
1543,34.36
1544,34.32
1545,34.27
1546,34.29
1547,34.38
1548,34.57
1549,34.80
1550,35.04
1551,35.22
1552,35.32
1553,35.27
1554,35.13
1555,34.93
1556,34.82
1557,34.83
1558,35.05
1559,35.43
1560,35.98
1561,36.62
1562,37.38
1563,38.11
1564,38.86
1565,39.51
1566,40.20
1567,40.85
1568,41.61
1569,42.39
1570,43.32
1571,44.30
1572,45.44
1573,46.61
1574,47.89
1575,49.12
1576,50.35
1577,51.42
1578,52.44
1579,53.31
1580,54.14
1581,54.86
1582,55.60
1583,56.28
1584,57.04
1585,57.79
1586,58.65
1587,59.50
1588,60.35
1589,61.09
1590,61.74
1591,62.25
1592,62.60
1593,62.77
1594,62.79
1595,62.68
1596,62.44
1597,62.08
1598,61.59
1599,61.04
1600,60.39
1601,59.70
1602,58.82
1603,57.86
1604,56.76
1605,55.66
1606,54.43
1607,53.18
1608,51.79
1609,50.45
1610,49.06
1611,47.74
1612,46.36
1613,45.01
1614,43.66
1615,42.41
1616,41.21
1617,40.16
1618,39.24
1619,38.54
1620,37.96
1621,37.56
1622,37.32
1623,37.26
1624,37.33
1625,37.51
1626,37.81
1627,38.19
1628,38.65
1629,39.12
1630,39.66
1631,40.21
1632,40.82
1633,41.47
1634,42.21
1635,42.97
1636,43.79
1637,44.55
1638,45.29
1639,45.93
1640,46.53
1641,47.01
1642,47.47
1643,47.87
1644,48.32
1645,48.77
1646,49.29
1647,49.83
1648,50.39
1649,50.90
1650,51.31
1651,51.57
1652,51.73
1653,51.78
1654,51.75
1655,51.69
1656,51.67
1657,51.69
1658,51.73
1659,51.74
1660,51.68
1661,51.53
1662,51.26
1663,50.90
1664,50.50
1665,50.14
1666,49.86
1667,49.68
1668,49.58
1669,49.53
1670,49.50
1671,49.48
1672,49.39
1673,49.19
1674,48.84
1675,48.46
1676,48.07
1677,47.75
1678,47.45
1679,47.20
1680,46.97
1681,46.78
1682,46.63
1683,46.52
1684,46.44
1685,46.39
1686,46.30
1687,46.20
1688,46.04
1689,45.87
1690,45.65
1691,45.42
1692,45.14
1693,44.85
1694,44.53
1695,44.21
1696,43.85
1697,43.50
1698,43.15
1699,42.80
1700,42.38
1701,41.92
1702,41.39
1703,40.89
1704,40.39
1705,39.96
1706,39.55
1707,39.23
1708,38.97
1709,38.77
1710,38.55
1711,38.33
1712,38.06
1713,37.80
1714,37.51
1715,37.25
1716,37.01
1717,36.87
1718,36.80
1719,36.80
1720,36.74
1721,36.60
1722,36.32
1723,35.90
1724,35.33
1725,34.65
1726,33.88
1727,33.16
1728,32.55
1729,32.14
1730,31.91
1731,31.90
1732,32.04
1733,32.28
1734,32.54
1735,32.75
1736,32.90
1737,32.98
1738,33.04
1739,33.09
1740,33.20
1741,33.37
1742,33.62
1743,33.91
1744,34.28
1745,34.69
1746,35.17
1747,35.67
1748,36.21
1749,36.74
1750,37.28
1751,37.78
1752,38.26
1753,38.67
1754,39.02
1755,39.31
1756,39.58
1757,39.81
1758,40.04
1759,40.21
1760,40.36
1761,40.47
1762,40.57
1763,40.69
1764,40.86
1765,41.05
1766,41.29
1767,41.56
1768,41.89
1769,42.21
1770,42.50
1771,42.69
1772,42.74
1773,42.67
1774,42.53
1775,42.37
1776,42.24
1777,42.17
1778,42.11
1779,42.05
1780,41.97
1781,41.82
1782,41.57
1783,41.22
1784,40.75
1785,40.25
1786,39.73
1787,39.29
1788,38.90
1789,38.57
1790,38.31
1791,38.13
1792,38.04
1793,38.04
1794,38.11
1795,38.23
1796,38.41
1797,38.64
1798,38.92
1799,39.19
1800,39.47
1801,39.70
1802,39.91
1803,40.11
1804,40.37
1805,40.73
1806,41.18
1807,41.66
1808,42.11
1809,42.47
1810,42.70
1811,42.76
1812,42.69
1813,42.52
1814,42.34
1815,42.18
1816,42.11
1817,42.11
1818,42.17
1819,42.29
1820,42.47
1821,42.68
1822,42.89
1823,43.07
1824,43.20
1825,43.26
1826,43.25
1827,43.15
1828,42.98
1829,42.73
1830,42.47
1831,42.23
1832,42.05
1833,41.95
1834,41.97
1835,42.11
1836,42.40
1837,42.76
1838,43.13
1839,43.46
1840,43.77
1841,44.03
1842,44.24
1843,44.35
1844,44.42
1845,44.49
1846,44.65
1847,44.86
1848,45.10
1849,45.33
1850,45.59
1851,45.85
1852,46.13
1853,46.39
1854,46.65
1855,46.90
1856,47.15
1857,47.38
1858,47.58
1859,47.74
1860,47.85
1861,47.90
1862,47.88
1863,47.80
1864,47.67
1865,47.52
1866,47.31
1867,47.02
1868,46.64
1869,46.22
1870,45.76
1871,45.33
1872,44.90
1873,44.52
1874,44.15
1875,43.86
1876,43.62
1877,43.47
1878,43.30
1879,43.05
1880,42.59
1881,42.01
1882,41.31
1883,40.63
1884,39.95
1885,39.34
1886,38.76
1887,38.31
1888,37.87
1889,37.45
1890,36.90
1891,36.26
1892,35.48
1893,34.62
1894,33.65
1895,32.68
1896,31.73
1897,30.94
1898,30.23
1899,29.62
1900,29.03
1901,28.48
1902,27.90
1903,27.35
1904,26.77
1905,26.28
1906,25.85
1907,25.60
1908,25.47
1909,25.46
1910,25.45
1911,25.41
1912,25.25
1913,25.02
1914,24.72
1915,24.42
1916,24.14
1917,23.96
1918,23.89
1919,23.90
1920,23.90
1921,23.82
1922,23.63
1923,23.36
1924,23.02
1925,22.66
1926,22.32
1927,22.07
1928,21.98
1929,22.03
1930,22.22
1931,22.45
1932,22.72
1933,22.96
1934,23.19
1935,23.35
1936,23.50
1937,23.67
1938,23.96
1939,24.36
1940,24.89
1941,25.48
1942,26.16
1943,26.86
1944,27.63
1945,28.33
1946,28.98
1947,29.50
1948,30.00
1949,30.45
1950,30.94
1951,31.43
1952,32.02
1953,32.65
1954,33.39
1955,34.08
1956,34.81
1957,35.48
1958,36.14
1959,36.71
1960,37.31
1961,37.88
1962,38.54
1963,39.21
1964,39.92
1965,40.61
1966,41.29
1967,41.88
1968,42.35
1969,42.65
1970,42.81
1971,42.83
1972,42.72
1973,42.51
1974,42.25
1975,42.00
1976,41.81
1977,41.70
1978,41.63
1979,41.56
1980,41.37
1981,41.05
1982,40.57
1983,39.99
1984,39.25
1985,38.45
1986,37.61
1987,36.84
1988,36.10
1989,35.46
1990,34.87
1991,34.34
1992,33.82
1993,33.36
1994,32.93
1995,32.58
1996,32.26
1997,32.04
1998,31.87
1999,31.75
2000,31.63
2001,31.49
2002,31.33
2003,31.17
2004,31.03
2005,30.94
2006,30.97
2007,31.14
2008,31.46
2009,31.85
2010,32.29
2011,32.70
2012,33.07
2013,33.36
2014,33.62
2015,33.84
2016,34.11
2017,34.45
2018,34.95
2019,35.55
2020,36.20
2021,36.80
2022,37.31
2023,37.66
2024,37.88
2025,37.93
2026,37.86
2027,37.73
2028,37.62
2029,37.55
2030,37.54
2031,37.57
2032,37.66
2033,37.74
2034,37.78
2035,37.75
2036,37.72
2037,37.70
2038,37.72
2039,37.79
2040,37.94
2041,38.14
2042,38.33
2043,38.46
2044,38.56
2045,38.64
2046,38.67
2047,38.65
2048,38.60
2049,38.56
2050,38.55
2051,38.57
2052,38.67
2053,38.84
2054,39.12
2055,39.44
2056,39.82
2057,40.21
2058,40.61
2059,40.99
2060,41.35
2061,41.64
2062,41.88
2063,42.02
2064,42.11
2065,42.10
2066,42.04
2067,41.91
2068,41.74
2069,41.56
2070,41.40
2071,41.31
2072,41.30
2073,41.37
2074,41.47
2075,41.60
2076,41.72
2077,41.81
2078,41.82
2079,41.78
2080,41.64
2081,41.44
2082,41.13
2083,40.75
2084,40.30
2085,39.86
2086,39.42
2087,39.01
2088,38.57
2089,38.13
2090,37.68
2091,37.24
2092,36.76
2093,36.29
2094,35.84
2095,35.48
2096,35.19
2097,34.99
2098,34.87
2099,34.84
2100,34.87
2101,34.97
2102,35.14
2103,35.40
2104,35.75
2105,36.16
2106,36.66
2107,37.19
2108,37.77
2109,38.35
2110,39.00
2111,39.63
2112,40.31
2113,40.92
2114,41.54
2115,42.11
2116,42.72
2117,43.30
2118,43.95
2119,44.58
2120,45.25
2121,45.89
2122,46.62
2123,47.34
2124,48.08
2125,48.72
2126,49.35
2127,49.93
2128,50.50
2129,50.99
2130,51.49
2131,51.95
2132,52.42
2133,52.83
2134,53.22
2135,53.53
2136,53.81
2137,54.08
2138,54.38
2139,54.67
2140,54.93
2141,55.11
2142,55.24
2143,55.32
2144,55.33
2145,55.24
2146,55.10
2147,54.92
2148,54.67
2149,54.37
2150,54.05
2151,53.76
2152,53.48
2153,53.22
2154,52.93
2155,52.67
2156,52.42
2157,52.25
2158,52.13
2159,52.08
2160,52.06
2161,52.09
2162,52.17
2163,52.26
2164,52.34
2165,52.41
2166,52.45
2167,52.51
2168,52.57
2169,52.60
2170,52.60
2171,52.58
2172,52.51
2173,52.40
2174,52.22
2175,51.95
2176,51.59
2177,51.17
2178,50.70
2179,50.23
2180,49.75
2181,49.31
2182,48.89
2183,48.55
2184,48.22
2185,47.94
2186,47.63
2187,47.35
2188,47.02
2189,46.71
2190,46.35
2191,46.01
2192,45.63
2193,45.26
2194,44.83
2195,44.43
2196,44.01
2197,43.61
2198,43.13
2199,42.62
2200,41.99
2201,41.33
2202,40.54
2203,39.69
2204,38.72
2205,37.78
2206,36.86
2207,36.06
2208,35.32
2209,34.69
2210,34.10
2211,33.67
2212,33.33
2213,33.10
2214,32.93
2215,32.84
2216,32.84
2217,32.91
2218,32.99
2219,33.08
2220,33.20
2221,33.37
2222,33.62
2223,33.88
2224,34.16
2225,34.42
2226,34.73
2227,35.04
2228,35.39
2229,35.74
2230,36.16
2231,36.59
2232,37.08
2233,37.55
2234,38.02
2235,38.41
2236,38.69
2237,38.83
2238,38.87
2239,38.83
2240,38.75
2241,38.66
2242,38.60
2243,38.60
2244,38.64
2245,38.68
2246,38.69
2247,38.59
2248,38.36
2249,38.00
2250,37.57
2251,37.15
2252,36.77
2253,36.53
2254,36.48
2255,36.65
2256,36.91
2257,37.18
2258,37.29
2259,37.25
2260,36.96
2261,36.41
2262,35.52
2263,34.42
2264,33.19
2265,31.99
2266,30.87
2267,29.92
2268,29.14
2269,28.59
2270,28.18
2271,27.91
2272,27.64
2273,27.38
2274,27.08
2275,26.82
2276,26.62
2277,26.53
2278,26.54
2279,26.67
2280,26.88
2281,27.15
2282,27.45
2283,27.76
2284,28.05
2285,28.31
2286,28.55
2287,28.79
2288,29.08
2289,29.37
2290,29.62
2291,29.77
2292,29.85
2293,29.84
2294,29.74
2295,29.53
2296,29.25
2297,28.97
2298,28.76
2299,28.66
2300,28.69
2301,28.82
2302,29.01
2303,29.21
2304,29.41
2305,29.56
2306,29.69
2307,29.80
2308,29.91
2309,30.05
2310,30.32
2311,30.71
2312,31.28
2313,31.97
2314,32.80
2315,33.65
2316,34.48
2317,35.19
2318,35.85
2319,36.35
2320,36.76
2321,37.00
2322,37.26
2323,37.54
2324,38.03
2325,38.67
2326,39.58
2327,40.63
2328,41.82
2329,42.97
2330,44.14
2331,45.20
2332,46.17
2333,46.94
2334,47.67
2335,48.36
2336,49.15
2337,49.93
2338,50.74
2339,51.45
2340,52.09
2341,52.55
2342,52.85
2343,52.89
2344,52.79
2345,52.61
2346,52.51
2347,52.49
2348,52.62
2349,52.90
2350,53.31
2351,53.73
2352,54.05
2353,54.18
2354,54.13
2355,53.94
2356,53.61
2357,53.21
2358,52.73
2359,52.26
2360,51.75
2361,51.20
2362,50.54
2363,49.80
2364,48.97
2365,48.13
2366,47.33
2367,46.69
2368,46.19
2369,45.94
2370,45.85
2371,45.88
2372,45.85
2373,45.68
2374,45.30
2375,44.78
2376,44.10
2377,43.36
2378,42.54
2379,41.78
2380,41.08
2381,40.53
2382,40.04
2383,39.61
2384,39.17
2385,38.72
2386,38.25
2387,37.83
2388,37.50
2389,37.30
2390,37.19
2391,37.16
2392,37.22
2393,37.33
2394,37.49
2395,37.70
2396,37.99
2397,38.31
2398,38.66
2399,39.01
2400,39.44
2401,39.94
2402,40.50
2403,41.05
2404,41.67
2405,42.28
2406,42.91
2407,43.44
2408,43.90
2409,44.21
2410,44.42
2411,44.53
2412,44.62
2413,44.73
2414,44.90
2415,45.10
2416,45.38
2417,45.68
2418,45.96
2419,46.13
2420,46.19
2421,46.12
2422,45.99
2423,45.84
2424,45.70
2425,45.62
2426,45.56
2427,45.54
2428,45.49
2429,45.41
2430,45.27
2431,45.07
2432,44.77
2433,44.41
2434,44.00
2435,43.62
2436,43.29
2437,43.02
2438,42.78
2439,42.58
2440,42.40
2441,42.27
2442,42.10
2443,41.92
2444,41.73
2445,41.56
2446,41.38
2447,41.21
2448,41.02
2449,40.84
2450,40.67
2451,40.53
2452,40.40
2453,40.31
2454,40.27
2455,40.31
2456,40.41
2457,40.61
2458,40.79
2459,40.94
2460,40.93
2461,40.77
2462,40.37
2463,39.82
2464,39.08
2465,38.22
2466,37.20
2467,36.12
2468,34.96
2469,33.84
2470,32.68
2471,31.54
2472,30.34
2473,29.23
2474,28.11
2475,27.10
2476,26.09
2477,25.22
2478,24.41
2479,23.78
2480,23.21
2481,22.69
2482,22.13
2483,21.57
2484,21.01
2485,20.54
2486,20.13
2487,19.86
2488,19.78
2489,19.93
2490,20.29
2491,20.78
2492,21.29
2493,21.74
2494,22.13
2495,22.44
2496,22.74
2497,23.00
2498,23.38
2499,23.83
2500,24.48
2501,25.23
2502,26.18
2503,27.19
2504,28.39
2505,29.68
2506,31.14
2507,32.60
2508,34.13
2509,35.54
2510,36.93
2511,38.09
2512,39.09
2513,39.78
2514,40.42
2515,40.99
2516,41.76
2517,42.61
2518,43.70
2519,44.86
2520,46.20
2521,47.52
2522,48.88
2523,50.07
2524,51.19
2525,52.13
2526,53.09
2527,53.99
2528,54.91
2529,55.75
2530,56.61
2531,57.40
2532,58.17
2533,58.78
2534,59.27
2535,59.57
2536,59.80
2537,59.94
2538,60.04
2539,60.08
2540,60.15
2541,60.23
2542,60.35
2543,60.43
2544,60.49
2545,60.55
2546,60.66
2547,60.81
2548,60.94
2549,61.01
2550,61.00
2551,60.92
2552,60.70
2553,60.33
2554,59.75
2555,59.01
2556,58.08
2557,57.12
2558,56.09
2559,55.13
2560,54.15
2561,53.30
2562,52.43
2563,51.61
2564,50.60
2565,49.51
2566,48.19
2567,46.82
2568,45.27
2569,43.72
2570,42.08
2571,40.61
2572,39.16
2573,37.90
2574,36.58
2575,35.35
2576,34.03
2577,32.75
2578,31.34
2579,29.95
2580,28.47
2581,27.14
2582,25.83
2583,24.67
2584,23.48
2585,22.42
2586,21.38
2587,20.45
2588,19.47
2589,18.55
2590,17.62
2591,16.87
2592,16.19
2593,15.64
2594,15.15
2595,14.80
2596,14.57
2597,14.47
2598,14.41
2599,14.39
2600,14.37
2601,14.36
2602,14.40
2603,14.53
2604,14.76
2605,15.08
2606,15.47
2607,15.91
2608,16.46
2609,17.01
2610,17.56
2611,18.00
2612,18.40
2613,18.74
2614,19.08
2615,19.39
2616,19.76
2617,20.19
2618,20.77
2619,21.42
2620,22.14
2621,22.82
2622,23.45
2623,23.99
2624,24.44
2625,24.72
2626,24.83
2627,24.73
2628,24.53
2629,24.26
2630,24.04
2631,23.88
2632,23.89
2633,24.06
2634,24.38
2635,24.79
2636,25.30
2637,25.83
2638,26.38
2639,26.82
2640,27.15
2641,27.40
2642,27.70
2643,28.07
2644,28.59
2645,29.20
2646,29.98
2647,30.82
2648,31.78
2649,32.69
2650,33.58
2651,34.33
2652,35.03
2653,35.61
2654,36.13
2655,36.57
2656,36.99
2657,37.33
2658,37.63
2659,37.82
2660,37.98
2661,38.11
2662,38.31
2663,38.54
2664,38.83
2665,39.15
2666,39.54
2667,39.96
2668,40.37
2669,40.70
2670,40.92
2671,41.00
2672,41.00
2673,40.94
2674,40.82
2675,40.70
2676,40.59
2677,40.54
2678,40.53
2679,40.51
2680,40.39
2681,40.16
2682,39.79
2683,39.31
2684,38.71
2685,38.06
2686,37.41
2687,36.91
2688,36.54
2689,36.28
2690,36.08
2691,35.93
2692,35.80
2693,35.69
2694,35.56
2695,35.45
2696,35.36
2697,35.36
2698,35.45
2699,35.64
2700,35.88
2701,36.12
2702,36.33
2703,36.48
2704,36.56
2705,36.59
2706,36.59
2707,36.61
2708,36.71
2709,36.93
2710,37.24
2711,37.60
2712,37.96
2713,38.27
2714,38.48
2715,38.57
2716,38.51
2717,38.30
2718,37.99
2719,37.62
2720,37.22
2721,36.77
2722,36.29
2723,35.85
2724,35.46
2725,35.16
2726,34.94
2727,34.83
2728,34.81
2729,34.92
2730,35.06
2731,35.22
2732,35.32
2733,35.37
2734,35.29
2735,35.12
2736,34.84
2737,34.48
2738,34.04
2739,33.58
2740,33.07
2741,32.57
2742,32.04
2743,31.50
2744,30.98
2745,30.53
2746,30.17
2747,29.91
2748,29.69
2749,29.56
2750,29.50
2751,29.46
2752,29.37
2753,29.21
2754,28.98
2755,28.76
2756,28.54
2757,28.37
2758,28.31
2759,28.40
2760,28.59
2761,28.87
2762,29.22
2763,29.61
2764,29.98
2765,30.24
2766,30.42
2767,30.50
2768,30.52
2769,30.45
2770,30.35
2771,30.25
2772,30.23
2773,30.28
2774,30.42
2775,30.59
2776,30.82
2777,31.05
2778,31.30
2779,31.47
2780,31.56
2781,31.56
2782,31.51
2783,31.45
2784,31.36
2785,31.28
2786,31.20
2787,31.17
2788,31.18
2789,31.22
2790,31.24
2791,31.24
2792,31.22
2793,31.18
2794,31.16
2795,31.17
2796,31.19
2797,31.21
2798,31.24
2799,31.27
2800,31.33
2801,31.42
2802,31.52
2803,31.60
2804,31.69
2805,31.84
2806,32.08
2807,32.41
2808,32.81
2809,33.26
2810,33.74
2811,34.22
2812,34.67
2813,35.03
2814,35.29
2815,35.43
2816,35.48
2817,35.45
2818,35.35
2819,35.20
2820,35.03
2821,34.81
2822,34.55
2823,34.22
2824,33.84
2825,33.49
2826,33.16
2827,32.87
2828,32.59
2829,32.36
2830,32.13
2831,31.90
2832,31.62
2833,31.30
2834,30.91
2835,30.46
2836,29.97
2837,29.50
2838,29.05
2839,28.66
2840,28.31
2841,28.06
2842,27.89
2843,27.81
2844,27.74
2845,27.76
2846,27.88
2847,28.11
2848,28.37
2849,28.59
2850,28.76
2851,28.82
2852,28.70
2853,28.38
2854,27.87
2855,27.25
2856,26.64
2857,26.16
2858,25.90
2859,25.90
2860,26.13
2861,26.50
2862,26.92
2863,27.28
2864,27.50
2865,27.55
2866,27.50
2867,27.42
2868,27.41
2869,27.52
2870,27.85
2871,28.34
2872,29.01
2873,29.79
2874,30.69
2875,31.62
2876,32.60
2877,33.51
2878,34.43
2879,35.31
2880,36.20
2881,36.99
2882,37.73
2883,38.33
2884,38.89
2885,39.37
2886,39.90
2887,40.44
2888,41.09
2889,41.69
2890,42.30
2891,42.78
2892,43.24
2893,43.60
2894,43.97
2895,44.30
2896,44.75
2897,45.34
2898,46.23
2899,47.33
2900,48.62
2901,49.90
2902,51.12
2903,52.11
2904,52.93
2905,53.49
2906,53.95
2907,54.28
2908,54.63
2909,54.96
2910,55.40
2911,55.89
2912,56.49
2913,57.04
2914,57.53
2915,57.88
2916,58.17
2917,58.40
2918,58.56
2919,58.64
2920,58.73
2921,58.86
2922,59.11
2923,59.39
2924,59.75
2925,60.16
2926,60.66
2927,61.16
2928,61.64
2929,62.05
2930,62.46
2931,62.87
2932,63.30
2933,63.74
2934,64.23
2935,64.70
2936,65.12
2937,65.39
2938,65.52
2939,65.48
2940,65.31
2941,65.06
2942,64.84
2943,64.71
2944,64.69
2945,64.79
2946,64.99
2947,65.20
2948,65.32
2949,65.24
2950,64.92
2951,64.40
2952,63.76
2953,63.10
2954,62.48
2955,62.01
2956,61.69
2957,61.58
2958,61.64
2959,61.81
2960,61.94
2961,61.98
2962,61.88
2963,61.70
2964,61.46
2965,61.26
2966,61.12
2967,61.10
2968,61.16
2969,61.33
2970,61.50
2971,61.67
2972,61.74
2973,61.69
2974,61.45
2975,61.04
2976,60.49
2977,59.95
2978,59.45
2979,59.04
2980,58.69
2981,58.45
2982,58.22
2983,58.00
2984,57.63
2985,57.11
2986,56.39
2987,55.56
2988,54.63
2989,53.72
2990,52.82
2991,52.06
2992,51.41
2993,50.89
2994,50.39
2995,49.94
2996,49.42
2997,48.88
2998,48.19
2999,47.44
3000,46.57
3001,45.72
3002,44.84
3003,44.02
3004,43.21
3005,42.46
3006,41.68
3007,40.95
3008,40.21
3009,39.57
3010,38.99
3011,38.53
3012,38.10
3013,37.77
3014,37.45
3015,37.20
3016,36.90
3017,36.61
3018,36.22
3019,35.83
3020,35.31
3021,34.74
3022,34.06
3023,33.38
3024,32.67
3025,32.03
3026,31.42
3027,30.94
3028,30.48
3029,30.09
3030,29.62
3031,29.08
3032,28.34
3033,27.43
3034,26.30
3035,25.09
3036,23.80
3037,22.62
3038,21.53
3039,20.72
3040,20.16
3041,19.89
3042,19.71
3043,19.61
3044,19.42
3045,19.14
3046,18.60
3047,17.87
3048,16.97
3049,16.11
3050,15.32
3051,14.71
3052,14.26
3053,14.02
3054,13.94
3055,13.95
3056,13.96
3057,13.92
3058,13.79
3059,13.63
3060,13.48
3061,13.41
3062,13.49
3063,13.73
3064,14.13
3065,14.63
3066,15.24
3067,15.85
3068,16.48
3069,17.04
3070,17.58
3071,18.05
3072,18.59
3073,19.16
3074,19.91
3075,20.74
3076,21.74
3077,22.80
3078,23.98
3079,25.15
3080,26.35
3081,27.40
3082,28.37
3083,29.19
3084,29.96
3085,30.62
3086,31.25
3087,31.77
3088,32.26
3089,32.65
3090,33.01
3091,33.23
3092,33.39
3093,33.42
3094,33.44
3095,33.45
3096,33.58
3097,33.81
3098,34.17
3099,34.63
3100,35.13
3101,35.59
3102,35.88
3103,35.92
3104,35.68
3105,35.23
3106,34.60
3107,33.91
3108,33.23
3109,32.63
3110,32.11
3111,31.72
3112,31.38
3113,31.09
3114,30.75
3115,30.40
3116,30.07
3117,29.80
3118,29.56
3119,29.40
3120,29.30
3121,29.30
3122,29.34
3123,29.38
3124,29.40
3125,29.40
3126,29.35
3127,29.27
3128,29.17
3129,29.08
3130,28.96
3131,28.82
3132,28.65
3133,28.47
3134,28.28
3135,28.11
3136,27.95
3137,27.86
3138,27.83
3139,27.84
3140,27.85
3141,27.85
3142,27.85
3143,27.82
3144,27.73
3145,27.62
3146,27.49
3147,27.37
3148,27.23
3149,27.07
3150,26.82
3151,26.54
3152,26.15
3153,25.68
3154,25.12
3155,24.52
3156,23.91
3157,23.38
3158,22.93
3159,22.62
3160,22.37
3161,22.21
3162,22.04
3163,21.85
3164,21.53
3165,21.10
3166,20.51
3167,19.86
3168,19.14
3169,18.49
3170,17.97
3171,17.68
3172,17.56
3173,17.59
3174,17.62
3175,17.62
3176,17.56
3177,17.41
3178,17.15
3179,16.82
3180,16.49
3181,16.26
3182,16.24
3183,16.45
3184,16.90
3185,17.49
3186,18.18
3187,18.87
3188,19.54
3189,20.08
3190,20.54
3191,20.92
3192,21.35
3193,21.80
3194,22.32
3195,22.85
3196,23.48
3197,24.12
3198,24.73
3199,25.18
3200,25.51
3201,25.73
3202,25.89
3203,25.94
3204,25.94
3205,25.93
3206,25.98
3207,26.08
3208,26.27
3209,26.52
3210,26.82
3211,27.12
3212,27.34
3213,27.44
3214,27.40
3215,27.28
3216,27.09
3217,26.88
3218,26.70
3219,26.58
3220,26.50
3221,26.42
3222,26.27
3223,26.04
3224,25.70
3225,25.28
3226,24.80
3227,24.35
3228,23.98
3229,23.74
3230,23.61
3231,23.60
3232,23.64
3233,23.67
3234,23.64
3235,23.54
3236,23.45
3237,23.40
3238,23.47
3239,23.63
3240,23.97
3241,24.46
3242,25.18
3243,26.06
3244,27.13
3245,28.27
3246,29.56
3247,30.88
3248,32.26
3249,33.52
3250,34.74
3251,35.78
3252,36.79
3253,37.67
3254,38.59
3255,39.41
3256,40.33
3257,41.22
3258,42.22
3259,43.17
3260,44.16
3261,45.05
3262,46.00
3263,46.89
3264,47.83
3265,48.67
3266,49.50
3267,50.22
3268,50.93
3269,51.53
3270,52.12
3271,52.64
3272,53.18
3273,53.71
3274,54.37
3275,55.09
3276,55.97
3277,56.81
3278,57.64
3279,58.33
3280,59.01
3281,59.59
3282,60.22
3283,60.81
3284,61.58
3285,62.49
3286,63.71
3287,65.08
3288,66.72
3289,68.41
3290,70.11
3291,71.61
3292,72.97
3293,74.07
3294,75.04
3295,75.82
3296,76.57
3297,77.20
3298,77.78
3299,78.25
3300,78.66
3301,78.95
3302,79.11
3303,79.12
3304,78.97
3305,78.70
3306,78.29
3307,77.77
3308,77.10
3309,76.35
3310,75.40
3311,74.29
3312,72.91
3313,71.43
3314,69.89
3315,68.44
3316,67.01
3317,65.73
3318,64.51
3319,63.45
3320,62.32
3321,61.21
3322,59.94
3323,58.65
3324,57.23
3325,55.89
3326,54.60
3327,53.58
3328,52.71
3329,52.10
3330,51.61
3331,51.25
3332,50.81
3333,50.28
3334,49.52
3335,48.72
3336,47.90
3337,47.26
3338,46.78
3339,46.59
3340,46.63
3341,46.89
3342,47.24
3343,47.58
3344,47.81
3345,47.90
3346,47.85
3347,47.70
3348,47.49
3349,47.31
3350,47.19
3351,47.13
3352,47.11
3353,47.11
3354,47.16
3355,47.26
3356,47.48
3357,47.81
3358,48.26
3359,48.80
3360,49.37
3361,49.84
3362,50.19
3363,50.32
3364,50.33
3365,50.28
3366,50.31
3367,50.50
3368,50.95
3369,51.63
3370,52.54
3371,53.53
3372,54.52
3373,55.31
3374,55.89
3375,56.21
3376,56.36
3377,56.36
3378,56.34
3379,56.39
3380,56.64
3381,57.04
3382,57.58
3383,58.09
3384,58.56
3385,58.90
3386,59.12
3387,59.17
3388,59.11
3389,58.97
3390,58.87
3391,58.82
3392,58.92
3393,59.08
3394,59.31
3395,59.55
3396,59.83
3397,60.10
3398,60.43
3399,60.81
3400,61.35
3401,61.99
3402,62.72
3403,63.44
3404,64.16
3405,64.80
3406,65.37
3407,65.81
3408,66.19
3409,66.51
3410,66.80
3411,67.06
3412,67.34
3413,67.60
3414,67.86
3415,68.13
3416,68.41
3417,68.69
3418,68.91
3419,69.05
3420,69.02
3421,68.86
3422,68.50
3423,67.98
3424,67.21
3425,66.31
3426,65.24
3427,64.16
3428,62.97
3429,61.81
3430,60.58
3431,59.36
3432,57.96
3433,56.51
3434,54.88
3435,53.27
3436,51.57
3437,50.00
3438,48.45
3439,47.17
3440,46.03
3441,45.15
3442,44.33
3443,43.63
3444,42.85
3445,42.08
3446,41.18
3447,40.28
3448,39.33
3449,38.48
3450,37.69
3451,37.06
3452,36.49
3453,36.03
3454,35.58
3455,35.22
3456,34.86
3457,34.53
3458,34.23
3459,34.06
3460,34.03
3461,34.19
3462,34.46
3463,34.81
3464,35.18
3465,35.54
3466,35.82
3467,36.00
3468,36.10
3469,36.18
3470,36.29
3471,36.40
3472,36.54
3473,36.68
3474,36.88
3475,37.08
3476,37.28
3477,37.45
3478,37.64
3479,37.91
3480,38.28
3481,38.69
3482,39.12
3483,39.55
3484,39.96
3485,40.28
3486,40.47
3487,40.49
3488,40.42
3489,40.29
3490,40.15
3491,39.99
3492,39.88
3493,39.86
3494,40.01
3495,40.28
3496,40.65
3497,41.09
3498,41.63
3499,42.20
3500,42.74
3501,43.16
3502,43.45
3503,43.61
3504,43.73
3505,43.81
3506,43.90
3507,44.03
3508,44.33
3509,44.77
3510,45.33
3511,45.86
3512,46.36
3513,46.74
3514,47.01
3515,47.15
3516,47.20
3517,47.22
3518,47.29
3519,47.42
3520,47.70
3521,48.06
3522,48.46
3523,48.82
3524,49.11
3525,49.31
3526,49.47
3527,49.58
3528,49.65
3529,49.67
3530,49.71
3531,49.80
3532,49.96
3533,50.13
3534,50.29
3535,50.38
3536,50.42
3537,50.38
3538,50.28
3539,50.13
3540,49.97
3541,49.81
3542,49.67
3543,49.58
3544,49.59
3545,49.67
3546,49.80
3547,49.92
3548,50.07
3549,50.28
3550,50.51
3551,50.72
3552,50.91
3553,51.03
3554,51.06
3555,51.03
3556,50.99
3557,50.98
3558,51.03
3559,51.15
3560,51.36
3561,51.64
3562,51.88
3563,52.05
3564,52.07
3565,51.93
3566,51.57
3567,51.09
3568,50.56
3569,50.12
3570,49.78
3571,49.58
3572,49.46
3573,49.42
3574,49.38
3575,49.27
3576,48.98
3577,48.55
3578,47.97
3579,47.38
3580,46.75
3581,46.17
3582,45.62
3583,45.16
3584,44.69
3585,44.23
3586,43.74
3587,43.30
3588,42.86
3589,42.47
3590,42.03
3591,41.60
3592,41.10
3593,40.57
3594,39.96
3595,39.34
3596,38.72
3597,38.15
3598,37.65
3599,37.25
3600,37.01
3601,36.92
3602,36.98
3603,37.19
3604,37.57
3605,38.09
3606,38.80
3607,39.63
3608,40.57
3609,41.50
3610,42.35
3611,43.03
3612,43.59
3613,43.97
3614,44.29
3615,44.50
3616,44.78
3617,45.10
3618,45.60
3619,46.23
3620,47.10
3621,48.03
3622,49.04
3623,49.95
3624,50.84
3625,51.64
3626,52.47
3627,53.25
3628,54.10
3629,55.01
3630,56.09
3631,57.24
3632,58.45
3633,59.58
3634,60.65
3635,61.52
3636,62.23
3637,62.66
3638,62.87
3639,62.89
3640,62.80
3641,62.61
3642,62.39
3643,62.13
3644,61.92
3645,61.78
3646,61.67
3647,61.56
3648,61.38
3649,61.11
3650,60.75
3651,60.30
3652,59.77
3653,59.20
3654,58.62
3655,58.05
3656,57.51
3657,57.06
3658,56.75
3659,56.60
3660,56.57
3661,56.65
3662,56.79
3663,57.03
3664,57.33
3665,57.67
3666,58.01
3667,58.30
3668,58.54
3669,58.72
3670,58.88
3671,59.01
3672,59.16
3673,59.31
3674,59.49
3675,59.70
3676,59.91
3677,60.03
3678,60.04
3679,59.91
3680,59.70
3681,59.49
3682,59.31
3683,59.19
3684,59.13
3685,59.14
3686,59.18
3687,59.25
3688,59.29
3689,59.30
3690,59.23
3691,59.07
3692,58.75
3693,58.31
3694,57.71
3695,57.02
3696,56.28
3697,55.58
3698,54.89
3699,54.27
3700,53.70
3701,53.23
3702,52.83
3703,52.52
3704,52.19
3705,51.86
3706,51.43
3707,50.99
3708,50.51
3709,50.04
3710,49.56
3711,49.16
3712,48.81
3713,48.55
3714,48.29
3715,48.03
3716,47.78
3717,47.53
3718,47.29
3719,47.09
3720,46.94
3721,46.89
3722,46.88
3723,46.96
3724,47.10
3725,47.34
3726,47.62
3727,47.94
3728,48.24
3729,48.52
3730,48.68
3731,48.68
3732,48.53
3733,48.26
3734,47.90
3735,47.50
3736,47.10
3737,46.78
3738,46.55
3739,46.43
3740,46.37
3741,46.36
3742,46.38
3743,46.43
3744,46.48
3745,46.54
3746,46.67
3747,46.90
3748,47.23
3749,47.59
3750,47.96
3751,48.28
3752,48.57
3753,48.81
3754,49.03
3755,49.22
3756,49.44
3757,49.67
3758,49.96
3759,50.25
3760,50.51
3761,50.72
3762,50.93
3763,51.12
3764,51.32
3765,51.53
3766,51.81
3767,52.19
3768,52.67
3769,53.18
3770,53.70
3771,54.20
3772,54.69
3773,55.13
3774,55.56
3775,55.90
3776,56.21
3777,56.43
3778,56.65
3779,56.85
3780,57.08
3781,57.31
3782,57.54
3783,57.73
3784,57.85
3785,57.91
3786,57.89
3787,57.81
3788,57.64
3789,57.38
3790,57.01
3791,56.56
3792,56.03
3793,55.47
3794,54.86
3795,54.28
3796,53.69
3797,53.17
3798,52.66
3799,52.21
3800,51.68
3801,51.14
3802,50.48
3803,49.78
3804,49.00
3805,48.23
3806,47.45
3807,46.78
3808,46.18
3809,45.72
3810,45.34
3811,45.07
3812,44.76
3813,44.43
3814,43.96
3815,43.40
3816,42.74
3817,42.14
3818,41.66
3819,41.37
3820,41.23
3821,41.18
3822,41.14
3823,41.06
3824,40.89
3825,40.63
3826,40.27
3827,39.90
3828,39.62
3829,39.50
3830,39.54
3831,39.70
3832,39.92
3833,40.16
3834,40.40
3835,40.57
3836,40.68
3837,40.76
3838,40.90
3839,41.14
3840,41.46
3841,41.82
3842,42.19
3843,42.53
3844,42.79
3845,42.94
3846,42.94
3847,42.82
3848,42.64
3849,42.45
3850,42.27
3851,42.13
3852,42.03
3853,42.03
3854,42.14
3855,42.28
3856,42.41
3857,42.48
3858,42.48
3859,42.42
3860,42.29
3861,42.11
3862,41.92
3863,41.76
3864,41.68
3865,41.68
3866,41.76
3867,41.90
3868,42.12
3869,42.39
3870,42.69
3871,42.99
3872,43.27
3873,43.50
3874,43.70
3875,43.88
3876,44.07
3877,44.24
3878,44.40
3879,44.54
3880,44.75
3881,45.01
3882,45.31
3883,45.61
3884,45.93
3885,46.21
3886,46.48
3887,46.71
3888,46.97
3889,47.26
3890,47.59
3891,47.93
3892,48.25
3893,48.55
3894,48.81
3895,48.99
3896,49.05
3897,48.99
3898,48.83
3899,48.58
3900,48.28
3901,47.95
3902,47.63
3903,47.37
3904,47.13
3905,46.94
3906,46.74
3907,46.54
3908,46.30
3909,46.01
3910,45.63
3911,45.22
3912,44.75
3913,44.25
3914,43.69
3915,43.14
3916,42.56
3917,42.03
3918,41.50
3919,41.04
3920,40.61
3921,40.26
3922,39.93
3923,39.64
3924,39.35
3925,39.10
3926,38.84
3927,38.57
3928,38.28
3929,38.04
3930,37.94
3931,37.99
3932,38.15
3933,38.38
3934,38.64
3935,38.91
3936,39.10
3937,39.17
3938,39.15
3939,39.10
3940,39.09
3941,39.15
3942,39.31
3943,39.57
3944,39.79
3945,39.93
3946,39.90
3947,39.71
3948,39.40
3949,39.04
3950,38.68
3951,38.38
3952,38.13
3953,37.93
3954,37.77
3955,37.63
3956,37.45
3957,37.23
3958,37.03
3959,36.89
3960,36.79
3961,36.74
3962,36.68
3963,36.67
3964,36.65
3965,36.62
3966,36.53
3967,36.38
3968,36.22
3969,36.09
3970,36.02
3971,36.00
3972,36.02
3973,36.05
3974,36.05
3975,36.00
3976,35.87
3977,35.70
3978,35.45
3979,35.16
3980,34.84
3981,34.54
3982,34.25
3983,34.03
3984,33.82
3985,33.62
3986,33.33
3987,32.98
3988,32.59
3989,32.20
3990,31.79
3991,31.38
3992,30.98
3993,30.65
3994,30.37
3995,30.14
3996,29.95
3997,29.83
3998,29.79
3999,29.85
4000,30.02
4001,30.32
4002,30.72
4003,31.18
4004,31.66
4005,32.10
4006,32.48
4007,32.78
4008,33.03
4009,33.23
4010,33.40
4011,33.52
4012,33.59
4013,33.58
4014,33.51
4015,33.33
4016,33.05
4017,32.65
4018,32.17
4019,31.65
4020,31.19
4021,30.85
4022,30.70
4023,30.73
4024,30.94
4025,31.30
4026,31.78
4027,32.33
4028,32.86
4029,33.26
4030,33.55
4031,33.76
4032,33.97
4033,34.15
4034,34.37
4035,34.63
4036,35.03
4037,35.48
4038,36.01
4039,36.54
4040,37.16
4041,37.79
4042,38.44
4043,39.04
4044,39.63
4045,40.21
4046,40.82
4047,41.38
4048,41.92
4049,42.37
4050,42.83
4051,43.27
4052,43.75
4053,44.25
4054,44.78
4055,45.28
4056,45.78
4057,46.20
4058,46.50
4059,46.65
4060,46.64
4061,46.52
4062,46.30
4063,45.98
4064,45.53
4065,44.99
4066,44.40
4067,43.84
4068,43.30
4069,42.83
4070,42.40
4071,42.06
4072,41.73
4073,41.40
4074,40.92
4075,40.37
4076,39.70
4077,38.97
4078,38.11
4079,37.19
4080,36.25
4081,35.42
4082,34.70
4083,34.18
4084,33.78
4085,33.53
4086,33.32
4087,33.13
4088,32.89
4089,32.63
4090,32.31
4091,31.98
4092,31.66
4093,31.39
4094,31.20
4095,31.10
4096,31.14
4097,31.31
4098,31.65
4099,32.08
4100,32.63
4101,33.22
4102,33.89
4103,34.59
4104,35.35
4105,36.08
4106,36.85
4107,37.61
4108,38.43
4109,39.25
4110,40.14
4111,41.02
4112,41.95
4113,42.82
4114,43.70
4115,44.49
4116,45.23
4117,45.78
4118,46.17
4119,46.36
4120,46.46
4121,46.47
4122,46.49
4123,46.52
4124,46.56
4125,46.62
4126,46.69
4127,46.71
4128,46.67
4129,46.52
4130,46.31
4131,46.08
4132,45.90
4133,45.78
4134,45.78
4135,45.88
4136,46.10
4137,46.36
4138,46.71
4139,47.07
4140,47.52
4141,47.98
4142,48.54
4143,49.15
4144,49.87
4145,50.63
4146,51.50
4147,52.37
4148,53.31
4149,54.18
4150,55.08
4151,55.88
4152,56.69
4153,57.45
4154,58.26
4155,59.01
4156,59.75
4157,60.36
4158,60.93
4159,61.38
4160,61.78
4161,62.09
4162,62.42
4163,62.73
4164,63.06
4165,63.39
4166,63.76
4167,64.16
4168,64.62
4169,65.06
4170,65.51
4171,65.93
4172,66.31
4173,66.62
4174,66.80
4175,66.83
4176,66.68
4177,66.38
4178,65.98
4179,65.56
4180,65.15
4181,64.77
4182,64.38
4183,63.96
4184,63.48
4185,62.95
4186,62.36
4187,61.77
4188,61.15
4189,60.62
4190,60.22
4191,60.02
4192,59.96
4193,60.01
4194,60.09
4195,60.21
4196,60.32
4197,60.42
4198,60.50
4199,60.59
4200,60.70
4201,60.84
4202,61.04
4203,61.29
4204,61.55
4205,61.77
4206,61.88
4207,61.89
4208,61.78
4209,61.58
4210,61.23
4211,60.75
4212,60.16
4213,59.51
4214,58.78
4215,58.05
4216,57.29
4217,56.60
4218,56.03
4219,55.66
4220,55.40
4221,55.22
4222,54.97
4223,54.66
4224,54.21
4225,53.69
4226,53.05
4227,52.38
4228,51.62
4229,50.91
4230,50.29
4231,49.82
4232,49.44
4233,49.13
4234,48.81
4235,48.53
4236,48.23
4237,47.94
4238,47.61
4239,47.29
4240,46.96
4241,46.64
4242,46.30
4243,45.94
4244,45.58
4245,45.25
4246,44.98
4247,44.79
4248,44.71
4249,44.74
4250,44.88
4251,45.08
4252,45.34
4253,45.62
4254,45.91
4255,46.17
4256,46.39
4257,46.60
4258,46.84
4259,47.17
4260,47.58
4261,48.00
4262,48.42
4263,48.81
4264,49.13
4265,49.32
4266,49.29
4267,49.02
4268,48.55
4269,48.00
4270,47.44
4271,46.93
4272,46.53
4273,46.30
4274,46.22
4275,46.26
4276,46.33
4277,46.39
4278,46.32
4279,46.15
4280,45.80
4281,45.34
4282,44.75
4283,44.10
4284,43.35
4285,42.56
4286,41.70
4287,40.88
4288,40.08
4289,39.44
4290,38.90
4291,38.51
4292,38.12
4293,37.80
4294,37.40
4295,36.97
4296,36.42
4297,35.80
4298,35.12
4299,34.49
4300,33.94
4301,33.53
4302,33.26
4303,33.08
4304,32.94
4305,32.82
4306,32.74
4307,32.67
4308,32.61
4309,32.52
4310,32.45
4311,32.37
4312,32.33
4313,32.36
4314,32.54
4315,32.88
4316,33.42
4317,34.13
4318,35.06
4319,36.12
4320,37.15
4321,37.96
4322,38.50
4323,38.66
4324,38.50
4325,38.02
4326,37.41
4327,36.79
4328,36.32
4329,36.10
4330,36.22
4331,36.61
4332,37.19
4333,37.79
4334,38.34
4335,38.75
4336,39.03
4337,39.17
4338,39.24
4339,39.28
4340,39.41
4341,39.63
4342,39.99
4343,40.37
4344,40.77
4345,41.11
4346,41.47
4347,41.78
4348,42.10
4349,42.38
4350,42.71
4351,43.09
4352,43.57
4353,44.07
4354,44.57
4355,44.98
4356,45.34
4357,45.62
4358,45.90
4359,46.12
4360,46.36
4361,46.61
4362,46.96
4363,47.34
4364,47.74
4365,48.06
4366,48.36
4367,48.58
4368,48.76
4369,48.90
4370,49.07
4371,49.31
4372,49.61
4373,50.01
4374,50.48
4375,51.01
4376,51.45
4377,51.71
4378,51.67
4379,51.36
4380,50.73
4381,49.84
4382,48.68
4383,47.41
4384,46.04
4385,44.78
4386,43.56
4387,42.49
4388,41.42
4389,40.40
4390,39.31
4391,38.27
4392,37.17
4393,36.15
4394,35.13
4395,34.29
4396,33.58
4397,33.09
4398,32.70
4399,32.43
4400,32.17
4401,31.92
4402,31.56
4403,31.14
4404,30.61
4405,30.04
4406,29.42
4407,28.85
4408,28.42
4409,28.23
4410,28.32
4411,28.65
4412,29.21
4413,29.88
4414,30.65
4415,31.40
4416,32.10
4417,32.68
4418,33.20
4419,33.65
4420,34.19
4421,34.80
4422,35.55
4423,36.35
4424,37.22
4425,37.99
4426,38.73
4427,39.34
4428,39.95
4429,40.49
4430,41.01
4431,41.47
4432,41.98
4433,42.45
4434,42.85
4435,43.09
4436,43.18
4437,43.14
4438,43.00
4439,42.79
4440,42.56
4441,42.34
4442,42.16
4443,42.02
4444,41.90
4445,41.76
4446,41.53
4447,41.24
4448,40.90
4449,40.60
4450,40.33
4451,40.15
4452,40.09
4453,40.20
4454,40.39
4455,40.62
4456,40.76
4457,40.82
4458,40.67
4459,40.35
4460,39.81
4461,39.14
4462,38.35
4463,37.54
4464,36.72
4465,36.02
4466,35.44
4467,35.00
4468,34.59
4469,34.17
4470,33.65
4471,33.09
4472,32.44
4473,31.78
4474,31.06
4475,30.42
4476,29.81
4477,29.31
4478,28.88
4479,28.55
4480,28.22
4481,27.91
4482,27.52
4483,27.11
4484,26.66
4485,26.23
4486,25.76
4487,25.37
4488,24.98
4489,24.67
4490,24.34
4491,24.04
4492,23.68
4493,23.31
4494,22.84
4495,22.32
4496,21.67
4497,20.97
4498,20.18
4499,19.38
4500,18.56
4501,17.82
4502,17.17
4503,16.65
4504,16.18
4505,15.81
4506,15.48
4507,15.24
4508,15.08
4509,15.03
4510,15.08
4511,15.24
4512,15.42
4513,15.61
4514,15.78
4515,15.90
4516,15.95
4517,15.91
4518,15.85
4519,15.80
4520,15.85
4521,16.03
4522,16.36
4523,16.76
4524,17.25
4525,17.72
4526,18.21
4527,18.64
4528,19.05
4529,19.42
4530,19.86
4531,20.34
4532,20.96
4533,21.62
4534,22.42
4535,23.20
4536,24.02
4537,24.71
4538,25.34
4539,25.88
4540,26.51
4541,27.23
4542,28.11
4543,29.06
4544,30.11
4545,31.07
4546,31.94
4547,32.52
4548,32.88
4549,33.00
4550,33.03
4551,33.03
4552,33.19
4553,33.50
4554,34.00
4555,34.54
4556,35.05
4557,35.42
4558,35.71
4559,35.87
4560,35.98
4561,36.07
4562,36.32
4563,36.74
4564,37.43
4565,38.26
4566,39.20
4567,40.12
4568,41.02
4569,41.82
4570,42.52
4571,43.05
4572,43.45
4573,43.67
4574,43.78
4575,43.77
4576,43.71
4577,43.59
4578,43.52
4579,43.49
4580,43.54
4581,43.66
4582,43.82
4583,44.00
4584,44.19
4585,44.38
4586,44.53
4587,44.61
4588,44.63
4589,44.64
4590,44.64
4591,44.59
4592,44.40
4593,44.07
4594,43.65
4595,43.23
4596,42.82
4597,42.47
4598,42.15
4599,41.99
4600,41.96
4601,42.05
4602,42.06
4603,41.96
4604,41.67
4605,41.23
4606,40.61
4607,39.90
4608,39.12
4609,38.41
4610,37.78
4611,37.32
4612,36.96
4613,36.72
4614,36.45
4615,36.11
4616,35.60
4617,34.95
4618,34.13
4619,33.24
4620,32.30
4621,31.47
4622,30.83
4623,30.44
4624,30.27
4625,30.32
4626,30.53
4627,30.86
4628,31.23
4629,31.57
4630,31.85
4631,32.07
4632,32.29
4633,32.52
4634,32.81
4635,33.16
4636,33.62
4637,34.11
4638,34.67
4639,35.22
4640,35.84
4641,36.47
4642,37.18
4643,37.84
4644,38.54
4645,39.21
4646,39.93
4647,40.63
4648,41.37
4649,42.09
4650,42.89
4651,43.67
4652,44.51
4653,45.30
4654,46.12
4655,46.88
4656,47.60
4657,48.21
4658,48.80
4659,49.32
4660,49.80
4661,50.19
4662,50.49
4663,50.63
4664,50.61
4665,50.43
4666,50.13
4667,49.77
4668,49.35
4669,48.94
4670,48.57
4671,48.29
4672,48.13
4673,48.08
4674,48.10
4675,48.13
4676,48.13
4677,48.08
4678,47.94
4679,47.77
4680,47.55
4681,47.38
4682,47.25
4683,47.23
4684,47.29
4685,47.45
4686,47.63
4687,47.82
4688,47.98
4689,48.08
4690,48.05
4691,47.87
4692,47.55
4693,47.16
4694,46.75
4695,46.36
4696,46.01
4697,45.74
4698,45.57
4699,45.55
4700,45.63
4701,45.78
4702,45.96
4703,46.15
4704,46.33
4705,46.45
4706,46.46
4707,46.38
4708,46.23
4709,46.07
4710,45.91
4711,45.81
4712,45.75
4713,45.76
4714,45.76
4715,45.78
4716,45.78
4717,45.75
4718,45.62
4719,45.39
4720,45.04
4721,44.63
4722,44.13
4723,43.58
4724,42.95
4725,42.30
4726,41.60
4727,40.96
4728,40.33
4729,39.81
4730,39.35
4731,38.99
4732,38.60
4733,38.24
4734,37.79
4735,37.31
4736,36.68
4737,35.98
4738,35.18
4739,34.45
4740,33.77
4741,33.26
4742,32.81
4743,32.48
4744,32.13
4745,31.81
4746,31.34
4747,30.74
4748,29.88
4749,28.95
4750,27.95
4751,27.10
4752,26.34
4753,25.74
4754,25.23
4755,24.86
4756,24.51
4757,24.21
4758,23.85
4759,23.44
4760,22.92
4761,22.39
4762,21.88
4763,21.44
4764,21.00
4765,20.56
4766,20.13
4767,19.74
4768,19.39
4769,19.11
4770,18.97
4771,19.04
4772,19.30
4773,19.73
4774,20.24
4775,20.79
4776,21.32
4777,21.74
4778,21.98
4779,22.03
4780,22.00
4781,21.95
4782,21.95
4783,22.02
4784,22.16
4785,22.34
4786,22.50
4787,22.56
4788,22.52
4789,22.38
4790,22.22
4791,22.07
4792,21.99
4793,21.95
4794,21.93
4795,21.90
4796,21.90
4797,21.90
4798,21.85
4799,21.77
4800,21.68
4801,21.64
4802,21.67
4803,21.74
4804,21.80
4805,21.80
4806,21.71
4807,21.53
4808,21.31
4809,21.10
4810,20.94
4811,20.87
4812,20.94
4813,21.11
4814,21.35
4815,21.56
4816,21.73
4817,21.77
4818,21.73
4819,21.62
4820,21.61
4821,21.73
4822,22.08
4823,22.64
4824,23.46
4825,24.43
4826,25.52
4827,26.55
4828,27.57
4829,28.47
4830,29.32
4831,30.01
4832,30.65
4833,31.21
4834,31.87
4835,32.52
4836,33.28
4837,34.03
4838,34.90
4839,35.75
4840,36.71
4841,37.62
4842,38.65
4843,39.66
4844,40.77
4845,41.84
4846,43.01
4847,44.17
4848,45.44
4849,46.69
4850,48.04
4851,49.35
4852,50.74
4853,52.06
4854,53.39
4855,54.61
4856,55.85
4857,56.98
4858,58.11
4859,59.07
4860,59.95
4861,60.65
4862,61.23
4863,61.59
4864,61.81
4865,61.88
4866,61.92
4867,61.94
4868,61.98
4869,62.04
4870,62.12
4871,62.15
4872,62.09
4873,61.87
4874,61.52
4875,61.07
4876,60.55
4877,60.05
4878,59.59
4879,59.23
4880,58.98
4881,58.88
4882,58.86
4883,58.91
4884,58.91
4885,58.85
4886,58.59
4887,58.17
4888,57.59
4889,56.94
4890,56.24
4891,55.60
4892,54.99
4893,54.49
4894,54.05
4895,53.67
4896,53.31
4897,52.99
4898,52.70
4899,52.49
4900,52.37
4901,52.41
4902,52.60
4903,52.91
4904,53.23
4905,53.49
4906,53.60
4907,53.54
4908,53.28
4909,52.89
4910,52.44
4911,52.02
4912,51.65
4913,51.41
4914,51.35
4915,51.41
4916,51.51
4917,51.54
4918,51.51
4919,51.45
4920,51.37
4921,51.28
4922,51.17
4923,51.06
4924,50.95
4925,50.86
4926,50.75
4927,50.63
4928,50.54
4929,50.54
4930,50.64
4931,50.81
4932,51.07
4933,51.38
4934,51.69
4935,51.93
4936,52.04
4937,52.02
4938,51.90
4939,51.73
4940,51.57
4941,51.46
4942,51.40
4943,51.41
4944,51.41
4945,51.37
4946,51.22
4947,50.95
4948,50.53
4949,50.06
4950,49.58
4951,49.17
4952,48.76
4953,48.40
4954,48.02
4955,47.65
4956,47.16
4957,46.55
4958,45.78
4959,44.94
4960,44.08
4961,43.32
4962,42.63
4963,42.11
4964,41.69
4965,41.39
4966,41.04
4967,40.65
4968,40.13
4969,39.58
4970,38.94
4971,38.36
4972,37.84
4973,37.50
4974,37.26
4975,37.13
4976,36.99
4977,36.80
4978,36.45
4979,35.95
4980,35.28
4981,34.55
4982,33.89
4983,33.40
4984,33.14
4985,33.14
4986,33.42
4987,33.90
4988,34.52
4989,35.18
4990,35.85
4991,36.47
4992,37.04
4993,37.54
4994,38.02
4995,38.46
4996,38.88
4997,39.22
4998,39.54
4999,39.83
5000,40.15
5001,40.46
5002,40.82
5003,41.20
5004,41.66
5005,42.13
5006,42.56
5007,42.85
5008,43.05
5009,43.17
5010,43.22
5011,43.21
5012,43.20
5013,43.19
5014,43.23
5015,43.25
5016,43.25
5017,43.22
5018,43.21
5019,43.19
5020,43.19
5021,43.22
5022,43.35
5023,43.59
5024,43.87
5025,44.12
5026,44.30
5027,44.40
5028,44.37
5029,44.26
5030,44.05
5031,43.82
5032,43.54
5033,43.22
5034,42.79
5035,42.27
5036,41.63
5037,40.86
5038,39.89
5039,38.86
5040,37.83
5041,36.99
5042,36.32
5043,35.87
5044,35.58
5045,35.44
5046,35.34
5047,35.28
5048,35.16
5049,35.03
5050,34.81
5051,34.52
5052,34.13
5053,33.72
5054,33.27
5055,32.84
5056,32.38
5057,31.94
5058,31.48
5059,31.07
5060,30.69
5061,30.35
5062,29.97
5063,29.60
5064,29.20
5065,28.82
5066,28.39
5067,28.00
5068,27.60
5069,27.26
5070,26.86
5071,26.44
5072,25.91
5073,25.34
5074,24.72
5075,24.08
5076,23.38
5077,22.71
5078,22.04
5079,21.49
5080,21.00
5081,20.64
5082,20.29
5083,20.02
5084,19.73
5085,19.48
5086,19.17
5087,18.88
5088,18.47
5089,17.98
5090,17.30
5091,16.48
5092,15.50
5093,14.50
5094,13.44
5095,12.46
5096,11.58
5097,10.90
5098,10.41
5099,10.12
5100,10.00
5101,10.01
5102,10.07
5103,10.16
5104,10.28
5105,10.47
5106,10.70
5107,10.97
5108,11.27
5109,11.57
5110,11.86
5111,12.08
5112,12.27
5113,12.41
5114,12.57
5115,12.78
5116,13.03
5117,13.30
5118,13.60
5119,13.89
5120,14.17
5121,14.37
5122,14.53
5123,14.67
5124,14.85
5125,15.05
5126,15.27
5127,15.54
5128,15.90
5129,16.30
5130,16.74
5131,17.12
5132,17.49
5133,17.77
5134,18.00
5135,18.10
5136,18.17
5137,18.21
5138,18.33
5139,18.52
5140,18.87
5141,19.36
5142,20.05
5143,20.83
5144,21.64
5145,22.35
5146,22.93
5147,23.31
5148,23.51
5149,23.51
5150,23.48
5151,23.48
5152,23.67
5153,24.01
5154,24.56
5155,25.24
5156,26.08
5157,26.92
5158,27.76
5159,28.46
5160,29.13
5161,29.76
5162,30.45
5163,31.08
5164,31.75
5165,32.41
5166,33.20
5167,33.98
5168,34.78
5169,35.45
5170,36.06
5171,36.54
5172,36.99
5173,37.25
5174,37.45
5175,37.57
5176,37.80
5177,38.12
5178,38.64
5179,39.28
5180,40.16
5181,41.15
5182,42.23
5183,43.20
5184,44.12
5185,44.90
5186,45.62
5187,46.22
5188,46.85
5189,47.50
5190,48.32
5191,49.22
5192,50.29
5193,51.40
5194,52.64
5195,53.88
5196,55.14
5197,56.28
5198,57.37
5199,58.28
5200,59.03
5201,59.49
5202,59.73
5203,59.71
5204,59.54
5205,59.25
5206,58.94
5207,58.62
5208,58.37
5209,58.19
5210,58.11
5211,58.11
5212,58.16
5213,58.18
5214,58.20
5215,58.22
5216,58.30
5217,58.47
5218,58.78
5219,59.26
5220,59.92
5221,60.70
5222,61.53
5223,62.25
5224,62.80
5225,63.12
5226,63.26
5227,63.21
5228,63.03
5229,62.78
5230,62.61
5231,62.57
5232,62.65
5233,62.78
5234,62.92
5235,63.04
5236,63.12
5237,63.13
5238,63.03
5239,62.89
5240,62.68
5241,62.47
5242,62.28
5243,62.14
5244,62.00
5245,61.84
5246,61.55
5247,61.15
5248,60.61
5249,60.02
5250,59.33
5251,58.67
5252,58.00
5253,57.43
5254,56.85
5255,56.30
5256,55.69
5257,55.03
5258,54.20
5259,53.30
5260,52.27
5261,51.27
5262,50.25
5263,49.36
5264,48.47
5265,47.71
5266,46.91
5267,46.14
5268,45.23
5269,44.24
5270,43.08
5271,41.88
5272,40.55
5273,39.26
5274,37.99
5275,36.93
5276,36.05
5277,35.48
5278,35.11
5279,34.97
5280,34.89
5281,34.89
5282,34.83
5283,34.73
5284,34.47
5285,34.07
5286,33.48
5287,32.80
5288,32.05
5289,31.37
5290,30.75
5291,30.29
5292,29.97
5293,29.82
5294,29.80
5295,29.88
5296,29.96
5297,30.00
5298,29.92
5299,29.75
5300,29.48
5301,29.14
5302,28.79
5303,28.49
5304,28.31
5305,28.28
5306,28.36
5307,28.51
5308,28.74
5309,29.01
5310,29.26
5311,29.44
5312,29.56
5313,29.63
5314,29.72
5315,29.84
5316,30.02
5317,30.24
5318,30.56
5319,30.91
5320,31.33
5321,31.72
5322,32.16
5323,32.59
5324,33.10
5325,33.66
5326,34.28
5327,34.90
5328,35.57
5329,36.24
5330,36.95
5331,37.60
5332,38.20
5333,38.73
5334,39.23
5335,39.67
5336,40.06
5337,40.35
5338,40.60
5339,40.77
5340,40.86
5341,40.82
5342,40.71
5343,40.55
5344,40.38
5345,40.25
5346,40.11
5347,39.97
5348,39.76
5349,39.47
5350,39.06
5351,38.56
5352,37.93
5353,37.22
5354,36.45
5355,35.74
5356,35.10
5357,34.61
5358,34.18
5359,33.84
5360,33.52
5361,33.26
5362,33.01
5363,32.81
5364,32.62
5365,32.51
5366,32.46
5367,32.46
5368,32.49
5369,32.55
5370,32.67
5371,32.88
5372,33.17
5373,33.52
5374,33.95
5375,34.42
5376,34.95
5377,35.45
5378,35.92
5379,36.32
5380,36.77
5381,37.25
5382,37.84
5383,38.42
5384,39.05
5385,39.67
5386,40.31
5387,40.87
5388,41.34
5389,41.68
5390,42.00
5391,42.31
5392,42.66
5393,42.96
5394,43.18
5395,43.27
5396,43.22
5397,42.98
5398,42.56
5399,42.08
5400,41.62
5401,41.28
5402,41.08
5403,41.04
5404,41.11
5405,41.27
5406,41.41
5407,41.48
5408,41.44
5409,41.36
5410,41.22
5411,41.08
5412,40.92
5413,40.80
5414,40.75
5415,40.76
5416,40.75
5417,40.70
5418,40.57
5419,40.37
5420,40.05
5421,39.63
5422,39.13
5423,38.64
5424,38.13
5425,37.66
5426,37.19
5427,36.79
5428,36.41
5429,36.06
5430,35.67
5431,35.23
5432,34.73
5433,34.23
5434,33.69
5435,33.20
5436,32.72
5437,32.30
5438,31.94
5439,31.72
5440,31.62
5441,31.71
5442,31.97
5443,32.40
5444,32.94
5445,33.49
5446,33.92
5447,34.13
5448,34.13
5449,33.94
5450,33.64
5451,33.33
5452,33.12
5453,33.05
5454,33.13
5455,33.28
5456,33.49
5457,33.63
5458,33.66
5459,33.52
5460,33.32
5461,33.12
5462,33.05
5463,33.11
5464,33.42
5465,33.91
5466,34.67
5467,35.57
5468,36.65
5469,37.76
5470,38.99
5471,40.25
5472,41.62
5473,42.99
5474,44.48
5475,45.91
5476,47.36
5477,48.67
5478,50.01
5479,51.22
5480,52.44
5481,53.53
5482,54.69
5483,55.82
5484,57.03
5485,58.13
5486,59.21
5487,60.17
5488,61.14
5489,62.00
5490,62.84
5491,63.57
5492,64.28
5493,64.89
5494,65.41
5495,65.74
5496,65.89
5497,65.85
5498,65.66
5499,65.36
5500,64.99
5501,64.64
5502,64.28
5503,63.97
5504,63.64
5505,63.24
5506,62.64
5507,61.86
5508,60.84
5509,59.72
5510,58.47
5511,57.30
5512,56.15
5513,55.24
5514,54.42
5515,53.74
5516,52.98
5517,52.22
5518,51.32
5519,50.36
5520,49.18
5521,47.96
5522,46.70
5523,45.62
5524,44.59
5525,43.74
5526,42.95
5527,42.28
5528,41.58
5529,40.90
5530,40.12
5531,39.37
5532,38.56
5533,37.84
5534,37.15
5535,36.57
5536,36.00
5537,35.52
5538,35.06
5539,34.63
5540,34.10
5541,33.53
5542,32.88
5543,32.26
5544,31.62
5545,31.07
5546,30.60
5547,30.31
5548,30.15
5549,30.17
5550,30.31
5551,30.60
5552,30.91
5553,31.20
5554,31.37
5555,31.45
5556,31.36
5557,31.13
5558,30.72
5559,30.21
5560,29.65
5561,29.12
5562,28.60
5563,28.14
5564,27.67
5565,27.27
5566,26.89
5567,26.54
5568,26.15
5569,25.77
5570,25.41
5571,25.12
5572,24.83
5573,24.54
5574,24.23
5575,23.90
5576,23.54
5577,23.16
5578,22.77
5579,22.47
5580,22.29
5581,22.25
5582,22.38
5583,22.65
5584,23.03
5585,23.41
5586,23.78
5587,24.10
5588,24.43
5589,24.74
5590,25.09
5591,25.43
5592,25.89
5593,26.47
5594,27.20
5595,27.98
5596,28.78
5597,29.50
5598,30.21
5599,30.82
5600,31.39
5601,31.85
5602,32.30
5603,32.66
5604,33.00
5605,33.33
5606,33.71
5607,34.12
5608,34.55
5609,34.93
5610,35.30
5611,35.62
5612,35.87
5613,35.95
5614,35.90
5615,35.71
5616,35.46
5617,35.19
5618,34.92
5619,34.71
5620,34.58
5621,34.52
5622,34.50
5623,34.55
5624,34.61
5625,34.65
5626,34.57
5627,34.37
5628,34.06
5629,33.69
5630,33.27
5631,32.87
5632,32.50
5633,32.23
5634,32.02
5635,31.85
5636,31.68
5637,31.51
5638,31.31
5639,31.11
5640,30.91
5641,30.79
5642,30.76
5643,30.83
5644,30.93
5645,31.07
5646,31.20
5647,31.33
5648,31.36
5649,31.30
5650,31.17
5651,31.02
5652,30.85
5653,30.68
5654,30.49
5655,30.35
5656,30.24
5657,30.17
5658,30.03
5659,29.80
5660,29.44
5661,29.02
5662,28.56
5663,28.09
5664,27.59
5665,27.08
5666,26.58
5667,26.20
5668,25.92
5669,25.76
5670,25.63
5671,25.54
5672,25.51
5673,25.54
5674,25.62
5675,25.70
5676,25.79
5677,25.89
5678,25.99
5679,26.05
5680,26.03
5681,25.93
5682,25.84
5683,25.79
5684,25.84
5685,25.96
5686,26.19
5687,26.47
5688,26.82
5689,27.18
5690,27.56
5691,27.87
5692,28.13
5693,28.30
5694,28.47
5695,28.69
5696,29.04
5697,29.48
5698,30.05
5699,30.68
5700,31.33
5701,31.92
5702,32.45
5703,32.84
5704,33.06
5705,33.08
5706,32.94
5707,32.71
5708,32.40
5709,32.04
5710,31.62
5711,31.17
5712,30.72
5713,30.28
5714,29.80
5715,29.27
5716,28.66
5717,28.08
5718,27.52
5719,27.05
5720,26.60
5721,26.24
5722,25.89
5723,25.59
5724,25.18
5725,24.66
5726,23.96
5727,23.22
5728,22.46
5729,21.81
5730,21.26
5731,20.89
5732,20.65
5733,20.55
5734,20.49
5735,20.48
5736,20.43
5737,20.37
5738,20.30
5739,20.31
5740,20.40
5741,20.62
5742,20.90
5743,21.19
5744,21.37
5745,21.35
5746,21.06
5747,20.48
5748,19.68
5749,18.81
5750,17.97
5751,17.28
5752,16.78
5753,16.51
5754,16.47
5755,16.62
5756,16.91
5757,17.24
5758,17.59
5759,17.92
5760,18.20
5761,18.47
5762,18.77
5763,19.09
5764,19.44
5765,19.74
5766,19.98
5767,20.14
5768,20.29
5769,20.40
5770,20.53
5771,20.67
5772,20.86
5773,21.09
5774,21.40
5775,21.69
5776,21.93
5777,22.07
5778,22.17
5779,22.20
5780,22.26
5781,22.35
5782,22.64
5783,23.12
5784,23.90
5785,24.80
5786,25.88
5787,26.99
5788,28.21
5789,29.34
5790,30.46
5791,31.44
5792,32.47
5793,33.50
5794,34.69
5795,35.92
5796,37.28
5797,38.63
5798,40.03
5799,41.28
5800,42.47
5801,43.41
5802,44.27
5803,44.91
5804,45.50
5805,45.97
5806,46.52
5807,47.06
5808,47.81
5809,48.67
5810,49.82
5811,51.09
5812,52.57
5813,54.11
5814,55.81
5815,57.52
5816,59.20
5817,60.60
5818,61.72
5819,62.47
5820,62.92
5821,63.06
5822,63.00
5823,62.77
5824,62.48
5825,62.16
5826,61.91
5827,61.71
5828,61.48
5829,61.13
5830,60.59
5831,59.88
5832,59.01
5833,58.10
5834,57.12
5835,56.21
5836,55.33
5837,54.63
5838,54.07
5839,53.67
5840,53.31
5841,53.01
5842,52.68
5843,52.34
5844,51.86
5845,51.24
5846,50.48
5847,49.71
5848,48.97
5849,48.38
5850,47.94
5851,47.81
5852,47.95
5853,48.36
5854,48.87
5855,49.34
5856,49.63
5857,49.67
5858,49.39
5859,48.84
5860,48.13
5861,47.43
5862,46.88
5863,46.58
5864,46.55
5865,46.78
5866,47.15
5867,47.59
5868,47.95
5869,48.15
5870,48.07
5871,47.74
5872,47.23
5873,46.63
5874,45.97
5875,45.32
5876,44.69
5877,44.13
5878,43.59
5879,43.11
5880,42.58
5881,42.03
5882,41.37
5883,40.71
5884,39.99
5885,39.32
5886,38.64
5887,38.03
5888,37.44
5889,36.93
5890,36.38
5891,35.85
5892,35.19
5893,34.44
5894,33.47
5895,32.42
5896,31.26
5897,30.17
5898,29.10
5899,28.18
5900,27.31
5901,26.59
5902,25.89
5903,25.23
5904,24.49
5905,23.77
5906,22.99
5907,22.29
5908,21.62
5909,21.09
5910,20.58
5911,20.17
5912,19.66
5913,19.07
5914,18.24
5915,17.25
5916,16.02
5917,14.72
5918,13.35
5919,12.11
5920,11.01
5921,10.22
5922,9.70
5923,9.45
5924,9.33
5925,9.29
5926,9.23
5927,9.18
5928,9.09
5929,9.05
5930,9.04
5931,9.12
5932,9.30
5933,9.57
5934,9.94
5935,10.35
5936,10.80
5937,11.21
5938,11.61
5939,12.02
5940,12.50
5941,13.06
5942,13.72
5943,14.40
5944,15.12
5945,15.83
5946,16.53
5947,17.09
5948,17.51
5949,17.73
5950,17.83
5951,17.78
5952,17.65
5953,17.46
5954,17.29
5955,17.18
5956,17.23
5957,17.43
5958,17.83
5959,18.33
5960,18.88
5961,19.36
5962,19.75
5963,20.03
5964,20.27
5965,20.43
5966,20.61
5967,20.83
5968,21.19
5969,21.63
5970,22.15
5971,22.64
5972,23.17
5973,23.69
5974,24.24
5975,24.76
5976,25.33
5977,25.90
5978,26.56
5979,27.16
5980,27.78
5981,28.35
5982,29.01
5983,29.67
5984,30.42
5985,31.14
5986,31.91
5987,32.64
5988,33.40
5989,34.07
5990,34.69
5991,35.22
5992,35.85
5993,36.50
5994,37.27
5995,38.06
5996,38.98
5997,39.87
5998,40.77
5999,41.55
6000,42.36
6001,43.13
6002,43.98
6003,44.81
6004,45.80
6005,46.84
6006,48.02
6007,49.16
6008,50.33
6009,51.38
6010,52.38
6011,53.18
6012,53.91
6013,54.48
6014,55.03
6015,55.49
6016,55.91
6017,56.22
6018,56.50
6019,56.73
6020,56.94
6021,57.09
6022,57.18
6023,57.18
6024,57.08
6025,56.89
6026,56.66
6027,56.36
6028,55.95
6029,55.50
6030,54.99
6031,54.51
6032,54.02
6033,53.56
6034,53.11
6035,52.70
6036,52.25
6037,51.80
6038,51.28
6039,50.80
6040,50.24
6041,49.69
6042,49.12
6043,48.62
6044,48.13
6045,47.68
6046,47.18
6047,46.69
6048,46.12
6049,45.52
6050,44.80
6051,44.08
6052,43.28
6053,42.52
6054,41.74
6055,41.04
6056,40.37
6057,39.80
6058,39.19
6059,38.58
6060,37.92
6061,37.31
6062,36.71
6063,36.18
6064,35.69
6065,35.35
6066,35.12
6067,35.02
6068,34.93
6069,34.86
6070,34.75
6071,34.69
6072,34.68
6073,34.72
6074,34.76
6075,34.80
6076,34.82
6077,34.82
6078,34.77
6079,34.65
6080,34.49
6081,34.30
6082,34.10
6083,33.93
6084,33.81
6085,33.78
6086,33.81
6087,33.88
6088,33.96
6089,34.03
6090,34.02
6091,33.97
6092,33.87
6093,33.76
6094,33.57
6095,33.31
6096,32.99
6097,32.66
6098,32.31
6099,31.96
6100,31.59
6101,31.23
6102,30.88
6103,30.59
6104,30.33
6105,30.08
6106,29.75
6107,29.37
6108,28.92
6109,28.48
6110,28.04
6111,27.66
6112,27.31
6113,27.03
6114,26.73
6115,26.43
6116,26.01
6117,25.51
6118,24.91
6119,24.28
6120,23.67
6121,23.13
6122,22.68
6123,22.37
6124,22.16
6125,22.04
6126,21.96
6127,21.92
6128,21.87
6129,21.82
6130,21.70
6131,21.55
6132,21.41
6133,21.29
6134,21.16
6135,21.00
6136,20.77
6137,20.53
6138,20.26
6139,19.97
6140,19.62
6141,19.29
6142,19.02
6143,18.84
6144,18.75
6145,18.72
6146,18.76
6147,18.85
6148,18.96
6149,19.05
6150,19.10
6151,19.13
6152,19.15
6153,19.15
6154,19.14
6155,19.17
6156,19.28
6157,19.51
6158,19.87
6159,20.29
6160,20.74
6161,21.13
6162,21.42
6163,21.55
6164,21.58
6165,21.53
6166,21.55
6167,21.64
6168,21.93
6169,22.38
6170,23.10
6171,24.02
6172,25.13
6173,26.25
6174,27.36
6175,28.31
6176,29.12
6177,29.72
6178,30.20
6179,30.50
6180,30.77
6181,31.04
6182,31.49
6183,32.02
6184,32.72
6185,33.50
6186,34.38
6187,35.20
6188,35.90
6189,36.38
6190,36.68
6191,36.78
6192,36.71
6193,36.49
6194,36.25
6195,36.06
6196,35.93
6197,35.84
6198,35.82
6199,35.84
6200,35.90
6201,35.93
6202,35.94
6203,35.90
6204,35.82
6205,35.67
6206,35.49
6207,35.30
6208,35.13
6209,34.98
6210,34.88
6211,34.88
6212,35.01
6213,35.25
6214,35.55
6215,35.86
6216,36.13
6217,36.37
6218,36.56
6219,36.68
6220,36.73
6221,36.70
6222,36.61
6223,36.51
6224,36.44
6225,36.37
6226,36.33
6227,36.31
6228,36.29
6229,36.19
6230,36.00
6231,35.74
6232,35.45
6233,35.20
6234,34.99
6235,34.87
6236,34.91
6237,35.12
6238,35.43
6239,35.74
6240,36.00
6241,36.20
6242,36.36
6243,36.48
6244,36.58
6245,36.69
6246,36.88
6247,37.18
6248,37.58
6249,37.99
6250,38.37
6251,38.64
6252,38.83
6253,38.90
6254,38.89
6255,38.83
6256,38.80
6257,38.85
6258,38.97
6259,39.12
6260,39.31
6261,39.52
6262,39.72
6263,39.86
6264,39.99
6265,40.09
6266,40.24
6267,40.38
6268,40.55
6269,40.69
6270,40.82
6271,40.94
6272,41.06
6273,41.17
6274,41.30
6275,41.45
6276,41.63
6277,41.80
6278,41.97
6279,42.08
6280,42.15
6281,42.14
6282,42.11
6283,42.06
6284,42.09
6285,42.20
6286,42.42
6287,42.75
6288,43.21
6289,43.75
6290,44.30
6291,44.81
6292,45.27
6293,45.68
6294,46.07
6295,46.36
6296,46.56
6297,46.71
6298,46.88
6299,47.05
6300,47.16
6301,47.17
6302,47.11
6303,46.99
6304,46.77
6305,46.49
6306,46.15
6307,45.82
6308,45.46
6309,45.08
6310,44.66
6311,44.26
6312,43.79
6313,43.27
6314,42.63
6315,41.95
6316,41.24
6317,40.56
6318,39.89
6319,39.30
6320,38.77
6321,38.36
6322,38.02
6323,37.77
6324,37.53
6325,37.33
6326,37.16
6327,37.03
6328,36.96
6329,36.99
6330,37.17
6331,37.49
6332,37.94
6333,38.48
6334,39.11
6335,39.76
6336,40.41
6337,40.96
6338,41.49
6339,41.98
6340,42.53
6341,43.08
6342,43.69
6343,44.33
6344,45.05
6345,45.73
6346,46.35
6347,46.76
6348,47.00
6349,47.07
6350,47.07
6351,47.02
6352,47.02
6353,47.04
6354,47.11
6355,47.16
6356,47.21
6357,47.21
6358,47.15
6359,47.00
6360,46.76
6361,46.49
6362,46.23
6363,46.05
6364,45.94
6365,45.88
6366,45.89
6367,45.96
6368,46.02
6369,46.06
6370,46.04
6371,45.98
6372,45.87
6373,45.73
6374,45.55
6375,45.34
6376,45.10
6377,44.83
6378,44.53
6379,44.20
6380,43.85
6381,43.53
6382,43.27
6383,43.08
6384,42.95
6385,42.91
6386,42.93
6387,43.02
6388,43.11
6389,43.18
6390,43.24
6391,43.27
6392,43.22
6393,43.11
6394,42.93
6395,42.70
6396,42.36
6397,41.92
6398,41.38
6399,40.85
6400,40.34
6401,39.89
6402,39.49
6403,39.17
6404,38.93
6405,38.76
6406,38.56
6407,38.31
6408,37.97
6409,37.65
6410,37.33
6411,37.05
6412,36.72
6413,36.41
6414,36.07
6415,35.72
6416,35.29
6417,34.79
6418,34.23
6419,33.66
6420,33.06
6421,32.47
6422,31.91
6423,31.47
6424,31.13
6425,30.92
6426,30.85
6427,30.91
6428,31.09
6429,31.36
6430,31.68
6431,32.01
6432,32.36
6433,32.68
6434,32.97
6435,33.21
6436,33.42
6437,33.55
6438,33.65
6439,33.71
6440,33.79
6441,33.92
6442,34.15
6443,34.48
6444,34.93
6445,35.44
6446,35.93
6447,36.33
6448,36.58
6449,36.67
6450,36.60
6451,36.41
6452,36.19
6453,36.03
6454,36.00
6455,36.09
6456,36.29
6457,36.49
6458,36.68
6459,36.80
6460,36.85
6461,36.83
6462,36.72
6463,36.60
6464,36.48
6465,36.44
6466,36.40
6467,36.32
6468,36.13
6469,35.84
6470,35.45
6471,35.01
6472,34.45
6473,33.87
6474,33.28
6475,32.75
6476,32.20
6477,31.62
6478,30.97
6479,30.28
6480,29.53
6481,28.79
6482,28.09
6483,27.53
6484,27.11
6485,26.92
6486,26.89
6487,27.06
6488,27.32
6489,27.61
6490,27.82
6491,27.92
6492,27.85
6493,27.68
6494,27.40
6495,27.08
6496,26.69
6497,26.34
6498,26.05
6499,25.89
6500,25.75
6501,25.63
6502,25.43
6503,25.14
6504,24.65
6505,23.98
6506,23.12
6507,22.20
6508,21.21
6509,20.31
6510,19.50
6511,18.91
6512,18.49
6513,18.29
6514,18.17
6515,18.11
6516,17.90
6517,17.55
6518,16.94
6519,16.18
6520,15.20
6521,14.14
6522,13.00
6523,11.95
6524,10.94
6525,10.06
6526,9.22
6527,8.50
6528,7.81
6529,7.17
6530,6.45
6531,5.73
6532,5.00
6533,4.38
6534,3.80
6535,3.35
6536,2.98
6537,2.72
6538,2.45
6539,2.17
6540,1.86
6541,1.56
6542,1.23
6543,0.94
6544,0.75
6545,0.70
6546,0.82
6547,1.06
6548,1.43
6549,1.87
6550,2.37
6551,2.88
6552,3.43
6553,3.98
6554,4.56
6555,5.12
6556,5.72
6557,6.31
6558,6.88
6559,7.38
6560,7.86
6561,8.29
6562,8.72
6563,9.06
6564,9.35
6565,9.55
6566,9.74
6567,9.83
6568,9.89
6569,9.88
6570,9.89
6571,9.93
6572,10.06
6573,10.26
6574,10.59
6575,10.98
6576,11.36
6577,11.67
6578,11.88
6579,11.99
6580,12.01
6581,11.95
6582,11.86
6583,11.79
6584,11.79
6585,11.85
6586,11.96
6587,12.05
6588,12.08
6589,12.02
6590,11.89
6591,11.76
6592,11.68
6593,11.67
6594,11.76
6595,11.95
6596,12.24
6597,12.59
6598,12.98
6599,13.33
6600,13.66
6601,13.95
6602,14.23
6603,14.48
6604,14.79
6605,15.10
6606,15.46
6607,15.78
6608,16.09
6609,16.37
6610,16.72
6611,17.09
6612,17.50
6613,17.91
6614,18.40
6615,18.92
6616,19.48
6617,19.95
6618,20.36
6619,20.66
6620,20.96
6621,21.21
6622,21.49
6623,21.77
6624,22.16
6625,22.61
6626,23.20
6627,23.82
6628,24.48
6629,25.05
6630,25.61
6631,26.08
6632,26.60
6633,27.15
6634,27.85
6635,28.66
6636,29.66
6637,30.72
6638,31.88
6639,33.00
6640,34.08
6641,34.98
6642,35.78
6643,36.41
6644,37.02
6645,37.57
6646,38.26
6647,39.04
6648,40.02
6649,41.05
6650,42.15
6651,43.14
6652,44.05
6653,44.78
6654,45.42
6655,45.90
6656,46.33
6657,46.69
6658,47.14
6659,47.67
6660,48.28
6661,48.81
6662,49.21
6663,49.39
6664,49.38
6665,49.19
6666,48.85
6667,48.43
6668,48.02
6669,47.71
6670,47.55
6671,47.50
6672,47.48
6673,47.40
6674,47.17
6675,46.82
6676,46.35
6677,45.85
6678,45.32
6679,44.85
6680,44.43
6681,44.15
6682,43.93
6683,43.78
6684,43.56
6685,43.27
6686,42.85
6687,42.33
6688,41.66
6689,40.95
6690,40.21
6691,39.56
6692,39.02
6693,38.64
6694,38.36
6695,38.20
6696,38.10
6697,38.01
6698,37.85
6699,37.65
6700,37.47
6701,37.37
6702,37.34
6703,37.44
6704,37.73
6705,38.20
6706,38.77
6707,39.32
6708,39.79
6709,40.15
6710,40.37
6711,40.43
6712,40.37
6713,40.26
6714,40.21
6715,40.24
6716,40.33
6717,40.45
6718,40.61
6719,40.79
6720,40.97
6721,41.15
6722,41.34
6723,41.54
6724,41.76
6725,41.95
6726,42.06
6727,42.06
6728,41.92
6729,41.65
6730,41.31
6731,40.96
6732,40.69
6733,40.51
6734,40.44
6735,40.44
6736,40.48
6737,40.56
6738,40.59
6739,40.53
6740,40.35
6741,40.14
6742,39.97
6743,39.92
6744,39.94
6745,40.04
6746,40.18
6747,40.37
6748,40.55
6749,40.67
6750,40.69
6751,40.60
6752,40.42
6753,40.15
6754,39.80
6755,39.47
6756,39.24
6757,39.14
6758,39.18
6759,39.32
6760,39.60
6761,39.96
6762,40.34
6763,40.71
6764,41.05
6765,41.33
6766,41.59
6767,41.82
6768,42.09
6769,42.37
6770,42.70
6771,43.03
6772,43.39
6773,43.74
6774,44.08
6775,44.38
6776,44.65
6777,44.88
6778,45.10
6779,45.27
6780,45.42
6781,45.50
6782,45.53
6783,45.50
6784,45.41
6785,45.27
6786,45.07
6787,44.83
6788,44.55
6789,44.29
6790,44.04
6791,43.82
6792,43.51
6793,43.11
6794,42.56
6795,41.91
6796,41.13
6797,40.30
6798,39.44
6799,38.67
6800,37.97
6801,37.45
6802,37.09
6803,36.93
6804,36.85
6805,36.81
6806,36.70
6807,36.52
6808,36.26
6809,35.96
6810,35.65
6811,35.41
6812,35.32
6813,35.47
6814,35.86
6815,36.44
6816,37.13
6817,37.83
6818,38.41
6819,38.80
6820,38.98
6821,38.96
6822,38.83
6823,38.64
6824,38.49
6825,38.42
6826,38.49
6827,38.63
6828,38.83
6829,39.04
6830,39.28
6831,39.51
6832,39.71
6833,39.89
6834,40.10
6835,40.34
6836,40.57
6837,40.75
6838,40.89
6839,40.97
6840,40.99
6841,40.95
6842,40.96
6843,41.04
6844,41.19
6845,41.40
6846,41.70
6847,42.02
6848,42.31
6849,42.53
6850,42.69
6851,42.82
6852,42.97
6853,43.11
6854,43.30
6855,43.54
6856,43.82
6857,44.09
6858,44.33
6859,44.51
6860,44.60
6861,44.57
6862,44.43
6863,44.18
6864,43.86
6865,43.50
6866,43.15
6867,42.85
6868,42.63
6869,42.54
6870,42.59
6871,42.75
6872,42.95
6873,43.17
6874,43.34
6875,43.44
6876,43.40
6877,43.19
6878,42.82
6879,42.37
6880,41.90
6881,41.49
6882,41.12
6883,40.83
6884,40.57
6885,40.38
6886,40.20
6887,40.01
6888,39.72
6889,39.37
6890,38.95
6891,38.54
6892,38.10
6893,37.67
6894,37.17
6895,36.68
6896,36.15
6897,35.59
6898,34.93
6899,34.23
6900,33.49
6901,32.84
6902,32.26
6903,31.85
6904,31.60
6905,31.58
6906,31.75
6907,32.09
6908,32.52
6909,32.94
6910,33.30
6911,33.57
6912,33.76
6913,33.87
6914,33.94
6915,34.01
6916,34.21
6917,34.52
6918,34.98
6919,35.51
6920,36.14
6921,36.80
6922,37.44
6923,37.96
6924,38.42
6925,38.76
6926,39.05
6927,39.22
6928,39.31
6929,39.32
6930,39.36
6931,39.44
6932,39.60
6933,39.83
6934,40.17
6935,40.56
6936,40.96
6937,41.30
6938,41.50
6939,41.53
6940,41.40
6941,41.16
6942,40.84
6943,40.51
6944,40.21
6945,40.03
6946,39.96
6947,39.98
6948,39.98
6949,39.87
6950,39.59
6951,39.17
6952,38.64
6953,38.11
6954,37.57
6955,37.06
6956,36.61
6957,36.29
6958,36.09
6959,35.96
6960,35.87
6961,35.80
6962,35.85
6963,36.02
6964,36.32
6965,36.73
6966,37.30
6967,38.04
6968,38.96
6969,39.90
6970,40.86
6971,41.74
6972,42.66
6973,43.52
6974,44.40
6975,45.21
6976,46.10
6977,46.96
6978,47.87
6979,48.68
6980,49.51
6981,50.29
6982,51.09
6983,51.77
6984,52.47
6985,53.12
6986,53.91
6987,54.78
6988,55.82
6989,56.95
6990,58.17
6991,59.35
6992,60.48
6993,61.43
6994,62.23
6995,62.74
6996,63.00
6997,63.00
6998,62.83
6999,62.54
7000,62.19
7001,61.84
7002,61.53
7003,61.29
7004,61.06
7005,60.81
7006,60.50
7007,60.15
7008,59.67
7009,59.09
7010,58.38
7011,57.66
7012,56.94
7013,56.30
7014,55.73
7015,55.26
7016,54.82
7017,54.42
7018,54.02
7019,53.63
7020,53.22
7021,52.84
7022,52.49
7023,52.25
7024,52.12
7025,52.10
7026,52.16
7027,52.28
7028,52.43
7029,52.58
7030,52.73
7031,52.89
7032,53.02
7033,53.17
7034,53.37
7035,53.60
7036,53.85
7037,54.04
7038,54.15
7039,54.14
7040,54.03
7041,53.85
7042,53.63
7043,53.38
7044,53.12
7045,52.93
7046,52.80
7047,52.74
7048,52.67
7049,52.57
7050,52.43
7051,52.28
7052,52.07
7053,51.88
7054,51.71
7055,51.63
7056,51.54
7057,51.48
7058,51.35
7059,51.16
7060,50.80
7061,50.33
7062,49.77
7063,49.22
7064,48.60
7065,48.02
7066,47.47
7067,47.04
7068,46.62
7069,46.16
7070,45.56
7071,44.92
7072,44.20
7073,43.50
7074,42.76
7075,42.11
7076,41.59
7077,41.24
7078,40.98
7079,40.82
7080,40.72
7081,40.70
7082,40.66
7083,40.59
7084,40.45
7085,40.30
7086,40.14
7087,40.00
7088,39.86
7089,39.76
7090,39.62
7091,39.48
7092,39.31
7093,39.15
7094,38.91
7095,38.62
7096,38.25
7097,37.84
7098,37.35
7099,36.86
7100,36.34
7101,35.84
7102,35.32
7103,34.81
7104,34.33
7105,33.94
7106,33.64
7107,33.45
7108,33.32
7109,33.27
7110,33.25
7111,33.25
7112,33.26
7113,33.29
7114,33.33
7115,33.42
7116,33.58
7117,33.78
7118,34.03
7119,34.31
7120,34.62
7121,34.92
7122,35.13
7123,35.22
7124,35.22
7125,35.16
7126,35.13
7127,35.10
7128,35.11
7129,35.15
7130,35.30
7131,35.56
7132,35.96
7133,36.42
7134,36.86
7135,37.24
7136,37.63
7137,38.03
7138,38.48
7139,38.93
7140,39.41
7141,39.90
7142,40.42
7143,40.92
7144,41.43
7145,41.85
7146,42.14
7147,42.23
7148,42.14
7149,41.92
7150,41.62
7151,41.32
7152,41.05
7153,40.86
7154,40.69
7155,40.53
7156,40.28
7157,39.98
7158,39.52
7159,38.96
7160,38.24
7161,37.48
7162,36.67
7163,35.92
7164,35.11
7165,34.30
7166,33.43
7167,32.58
7168,31.65
7169,30.75
7170,29.82
7171,29.01
7172,28.24
7173,27.60
7174,27.02
7175,26.60
7176,26.22
7177,25.92
7178,25.57
7179,25.26
7180,24.95
7181,24.72
7182,24.54
7183,24.43
7184,24.35
7185,24.31
7186,24.22
7187,24.05
7188,23.74
7189,23.41
7190,22.88
7191,22.24
7192,21.65
7193,20.75
7194,21.09
7195,22.91
7196,22.87
7197,18.40
7198,16.11
7199,27.29
7200,35.96
