1,-188.79
2,-250.00
3,-250.00
4,-239.56
5,-234.47
6,-250.00
7,-250.00
8,-203.16
9,-60.93
10,99.40
11,214.00
12,249.99
13,249.99
14,248.47
15,246.25
16,249.59
17,249.99
18,249.99
19,249.99
20,237.84
21,202.57
22,160.69
23,125.02
24,100.35
25,84.18
26,72.81
27,66.62
28,63.39
29,62.53
30,61.41
31,60.40
32,57.73
33,54.53
34,49.76
35,45.01
36,39.75
37,35.16
38,30.72
39,26.95
40,23.27
41,20.01
42,16.76
43,13.90
44,11.03
45,8.51
46,5.96
47,3.76
48,1.55
49,-0.36
50,-2.30
51,-3.97
52,-5.69
53,-7.17
54,-8.67
55,-9.97
56,-11.37
57,-12.62
58,-13.92
59,-15.06
60,-16.27
61,-17.37
62,-18.59
63,-19.71
64,-20.90
65,-21.96
66,-23.04
67,-24.02
68,-25.04
69,-25.96
70,-26.89
71,-27.70
72,-28.48
73,-29.14
74,-29.80
75,-30.36
76,-30.94
77,-31.43
78,-31.93
79,-32.37
80,-32.86
81,-33.33
82,-33.85
83,-34.36
84,-34.92
85,-35.44
86,-36.00
87,-36.55
88,-37.12
89,-37.66
90,-38.19
91,-38.65
92,-39.09
93,-39.46
94,-39.83
95,-40.15
96,-40.44
97,-40.63
98,-40.81
99,-40.94
100,-41.08
101,-41.19
102,-41.33
103,-41.47
104,-41.62
105,-41.73
106,-41.84
107,-41.95
108,-42.11
109,-42.25
110,-42.37
111,-42.46
112,-42.54
113,-42.66
114,-42.82
115,-42.96
116,-43.10
117,-43.21
118,-43.36
119,-43.53
120,-43.74
121,-43.94
122,-44.16
123,-44.39
124,-44.65
125,-44.92
126,-45.18
127,-45.38
128,-45.55
129,-45.70
130,-45.86
131,-46.01
132,-46.12
133,-46.20
134,-46.33
135,-46.47
136,-46.60
137,-46.69
138,-46.79
139,-46.89
140,-47.01
141,-47.14
142,-47.30
143,-47.47
144,-47.62
145,-47.71
146,-47.79
147,-47.87
148,-47.95
149,-48.02
150,-48.07
151,-48.09
152,-48.08
153,-48.06
154,-48.03
155,-48.03
156,-48.03
157,-48.03
158,-48.03
159,-48.03
160,-48.04
161,-48.04
162,-48.00
163,-47.95
164,-47.90
165,-47.84
166,-47.74
167,-47.62
168,-47.51
169,-47.42
170,-47.33
171,-47.22
172,-47.08
173,-46.95
174,-46.84
175,-46.78
176,-46.69
177,-46.60
178,-46.48
179,-46.36
180,-46.26
181,-46.18
182,-46.07
183,-45.96
184,-45.84
185,-45.75
186,-45.67
187,-45.62
188,-45.59
189,-45.59
190,-45.60
191,-45.63
192,-45.68
193,-45.78
194,-45.88
195,-46.01
196,-46.14
197,-46.25
198,-46.35
199,-46.44
200,-46.55
201,-46.64
202,-46.68
203,-46.68
204,-46.69
205,-46.71
206,-46.71
207,-46.69
208,-46.67
209,-46.66
210,-46.67
211,-46.68
212,-46.68
213,-46.67
214,-46.67
215,-46.67
216,-46.68
217,-46.71
218,-46.75
219,-46.78
220,-46.80
221,-46.82
222,-46.84
223,-46.88
224,-46.94
225,-47.00
226,-47.03
227,-47.04
228,-47.03
229,-47.02
230,-47.00
231,-46.98
232,-46.95
233,-46.91
234,-46.87
235,-46.81
236,-46.78
237,-46.74
238,-46.69
239,-46.64
240,-46.59
241,-46.56
242,-46.52
243,-46.46
244,-46.40
245,-46.37
246,-46.36
247,-46.33
248,-46.28
249,-46.25
250,-46.25
251,-46.28
252,-46.33
253,-46.39
254,-46.48
255,-46.60
256,-46.75
257,-46.89
258,-47.04
259,-47.19
260,-47.35
261,-47.49
262,-47.61
263,-47.67
264,-47.68
265,-47.68
266,-47.68
267,-47.68
268,-47.66
269,-47.59
270,-47.52
271,-47.46
272,-47.42
273,-47.39
274,-47.39
275,-47.41
276,-47.45
277,-47.52
278,-47.60
279,-47.69
280,-47.78
281,-47.87
282,-47.98
283,-48.10
284,-48.20
285,-48.29
286,-48.39
287,-48.48
288,-48.55
289,-48.61
290,-48.67
291,-48.72
292,-48.77
293,-48.80
294,-48.82
295,-48.81
296,-48.79
297,-48.73
298,-48.64
299,-48.52
300,-48.39
301,-48.26
302,-48.17
303,-48.11
304,-48.07
305,-48.04
306,-48.03
307,-48.06
308,-48.13
309,-48.23
310,-48.31
311,-48.37
312,-48.43
313,-48.52
314,-48.62
315,-48.68
316,-48.68
317,-48.65
318,-48.62
319,-48.62
320,-48.61
321,-48.55
322,-48.48
323,-48.42
324,-48.38
325,-48.34
326,-48.32
327,-48.32
328,-48.36
329,-48.38
330,-48.39
331,-48.39
332,-48.42
333,-48.48
334,-48.54
335,-48.61
336,-48.68
337,-48.76
338,-48.84
339,-48.90
340,-48.98
341,-49.06
342,-49.13
343,-49.16
344,-49.19
345,-49.19
346,-49.13
347,-49.05
348,-48.95
349,-48.86
350,-48.74
351,-48.60
352,-48.45
353,-48.32
354,-48.20
355,-48.09
356,-47.99
357,-47.90
358,-47.81
359,-47.72
360,-47.66
361,-47.63
362,-47.58
363,-47.53
364,-47.48
365,-47.45
366,-47.42
367,-47.36
368,-47.29
369,-47.23
370,-47.19
371,-47.16
372,-47.13
373,-47.07
374,-46.97
375,-46.88
376,-46.82
377,-46.79
378,-46.77
379,-46.75
380,-46.73
381,-46.72
382,-46.71
383,-46.71
384,-46.75
385,-46.81
386,-46.89
387,-46.97
388,-47.07
389,-47.16
390,-47.26
391,-47.34
392,-47.41
393,-47.47
394,-47.53
395,-47.59
396,-47.63
397,-47.64
398,-47.60
399,-47.53
400,-47.45
401,-47.36
402,-47.28
403,-47.20
404,-47.09
405,-46.96
406,-46.84
407,-46.76
408,-46.70
409,-46.64
410,-46.57
411,-46.51
412,-46.49
413,-46.49
414,-46.46
415,-46.40
416,-46.34
417,-46.31
418,-46.30
419,-46.27
420,-46.22
421,-46.17
422,-46.12
423,-46.09
424,-46.05
425,-46.02
426,-46.02
427,-46.05
428,-46.09
429,-46.13
430,-46.16
431,-46.20
432,-46.29
433,-46.38
434,-46.47
435,-46.53
436,-46.56
437,-46.59
438,-46.63
439,-46.66
440,-46.67
441,-46.64
442,-46.58
443,-46.52
444,-46.46
445,-46.40
446,-46.32
447,-46.23
448,-46.17
449,-46.10
450,-46.03
451,-45.94
452,-45.87
453,-45.83
454,-45.82
455,-45.83
456,-45.85
457,-45.88
458,-45.90
459,-45.94
460,-45.98
461,-46.04
462,-46.10
463,-46.13
464,-46.15
465,-46.17
466,-46.20
467,-46.20
468,-46.17
469,-46.11
470,-46.03
471,-45.94
472,-45.85
473,-45.79
474,-45.75
475,-45.72
476,-45.71
477,-45.71
478,-45.71
479,-45.71
480,-45.71
481,-45.71
482,-45.71
483,-45.72
484,-45.72
485,-45.72
486,-45.72
487,-45.68
488,-45.62
489,-45.56
490,-45.53
491,-45.53
492,-45.51
493,-45.49
494,-45.49
495,-45.52
496,-45.52
497,-45.50
498,-45.48
499,-45.47
500,-45.47
501,-45.48
502,-45.49
503,-45.52
504,-45.53
505,-45.54
506,-45.55
507,-45.57
508,-45.61
509,-45.68
510,-45.76
511,-45.85
512,-45.91
513,-45.94
514,-45.98
515,-46.04
516,-46.09
517,-46.10
518,-46.06
519,-45.99
520,-45.91
521,-45.82
522,-45.72
523,-45.63
524,-45.56
525,-45.50
526,-45.47
527,-45.46
528,-45.48
529,-45.51
530,-45.56
531,-45.61
532,-45.68
533,-45.78
534,-45.90
535,-46.01
536,-46.12
537,-46.21
538,-46.30
539,-46.39
540,-46.46
541,-46.48
542,-46.49
543,-46.52
544,-46.59
545,-46.65
546,-46.68
547,-46.71
548,-46.75
549,-46.84
550,-46.97
551,-47.09
552,-47.20
553,-47.28
554,-47.37
555,-47.49
556,-47.63
557,-47.78
558,-47.94
559,-48.08
560,-48.23
561,-48.39
562,-48.52
563,-48.63
564,-48.74
565,-48.87
566,-48.99
567,-49.08
568,-49.13
569,-49.16
570,-49.18
571,-49.21
572,-49.25
573,-49.24
574,-49.20
575,-49.14
576,-49.09
577,-49.03
578,-48.94
579,-48.85
580,-48.79
581,-48.76
582,-48.72
583,-48.67
584,-48.61
585,-48.58
586,-48.58
587,-48.58
588,-48.55
589,-48.52
590,-48.52
591,-48.55
592,-48.57
593,-48.55
594,-48.50
595,-48.46
596,-48.44
597,-48.42
598,-48.38
599,-48.35
600,-48.32
601,-48.32
602,-48.34
603,-48.37
604,-48.42
605,-48.48
606,-48.54
607,-48.59
608,-48.68
609,-48.76
610,-48.84
611,-48.90
612,-48.98
613,-49.06
614,-49.14
615,-49.19
616,-49.26
617,-49.35
618,-49.45
619,-49.54
620,-49.64
621,-49.75
622,-49.89
623,-50.01
624,-50.09
625,-50.15
626,-50.24
627,-50.35
628,-50.47
629,-50.56
630,-50.64
631,-50.69
632,-50.71
633,-50.72
634,-50.74
635,-50.73
636,-50.67
637,-50.55
638,-50.42
639,-50.30
640,-50.17
641,-50.03
642,-49.86
643,-49.67
644,-49.48
645,-49.32
646,-49.16
647,-49.01
648,-48.84
649,-48.67
650,-48.48
651,-48.35
652,-48.20
653,-48.06
654,-47.90
655,-47.75
656,-47.61
657,-47.47
658,-47.28
659,-47.07
660,-46.85
661,-46.65
662,-46.45
663,-46.24
664,-46.01
665,-45.80
666,-45.65
667,-45.53
668,-45.41
669,-45.29
670,-45.20
671,-45.17
672,-45.16
673,-45.14
674,-45.10
675,-45.10
676,-45.13
677,-45.17
678,-45.18
679,-45.18
680,-45.17
681,-45.17
682,-45.17
683,-45.14
684,-45.11
685,-45.07
686,-45.04
687,-45.01
688,-45.00
689,-45.03
690,-45.08
691,-45.14
692,-45.20
693,-45.27
694,-45.33
695,-45.42
696,-45.52
697,-45.65
698,-45.78
699,-45.90
700,-46.01
701,-46.09
702,-46.17
703,-46.22
704,-46.29
705,-46.34
706,-46.39
707,-46.42
708,-46.45
709,-46.48
710,-46.49
711,-46.49
712,-46.50
713,-46.49
714,-46.46
715,-46.41
716,-46.34
717,-46.28
718,-46.21
719,-46.13
720,-46.02
721,-45.90
722,-45.76
723,-45.65
724,-45.55
725,-45.46
726,-45.37
727,-45.28
728,-45.20
729,-45.14
730,-45.10
731,-45.07
732,-45.03
733,-45.01
734,-45.00
735,-45.00
736,-44.98
737,-44.95
738,-44.94
739,-44.97
740,-45.01
741,-45.04
742,-45.07
743,-45.13
744,-45.24
745,-45.36
746,-45.46
747,-45.52
748,-45.59
749,-45.66
750,-45.73
751,-45.76
752,-45.80
753,-45.85
754,-45.92
755,-45.98
756,-46.06
757,-46.14
758,-46.23
759,-46.32
760,-46.43
761,-46.55
762,-46.65
763,-46.71
764,-46.75
765,-46.78
766,-46.79
767,-46.75
768,-46.68
769,-46.59
770,-46.52
771,-46.46
772,-46.38
773,-46.29
774,-46.23
775,-46.19
776,-46.16
777,-46.14
778,-46.14
779,-46.17
780,-46.19
781,-46.20
782,-46.19
783,-46.19
784,-46.17
785,-46.11
786,-46.05
787,-45.98
788,-45.91
789,-45.82
790,-45.72
791,-45.63
792,-45.56
793,-45.49
794,-45.45
795,-45.45
796,-45.51
797,-45.60
798,-45.70
799,-45.78
800,-45.88
801,-46.01
802,-46.15
803,-46.30
804,-46.42
805,-46.51
806,-46.59
807,-46.65
808,-46.69
809,-46.68
810,-46.65
811,-46.62
812,-46.62
813,-46.65
814,-46.67
815,-46.68
816,-46.69
817,-46.71
818,-46.74
819,-46.77
820,-46.83
821,-46.88
822,-46.89
823,-46.87
824,-46.84
825,-46.84
826,-46.83
827,-46.78
828,-46.69
829,-46.59
830,-46.49
831,-46.41
832,-46.35
833,-46.29
834,-46.19
835,-46.07
836,-45.98
837,-45.91
838,-45.85
839,-45.76
840,-45.68
841,-45.62
842,-45.56
843,-45.51
844,-45.46
845,-45.43
846,-45.41
847,-45.42
848,-45.43
849,-45.43
850,-45.39
851,-45.37
852,-45.36
853,-45.36
854,-45.33
855,-45.27
856,-45.23
857,-45.23
858,-45.21
859,-45.16
860,-45.10
861,-45.06
862,-45.03
863,-44.98
864,-44.91
865,-44.85
866,-44.79
867,-44.74
868,-44.68
869,-44.62
870,-44.53
871,-44.45
872,-44.37
873,-44.32
874,-44.25
875,-44.17
876,-44.05
877,-43.96
878,-43.90
879,-43.85
880,-43.76
881,-43.65
882,-43.51
883,-43.38
884,-43.27
885,-43.16
886,-43.05
887,-42.92
888,-42.79
889,-42.66
890,-42.59
891,-42.56
892,-42.56
893,-42.57
894,-42.56
895,-42.55
896,-42.58
897,-42.64
898,-42.70
899,-42.73
900,-42.74
901,-42.73
902,-42.72
903,-42.73
904,-42.76
905,-42.78
906,-42.79
907,-42.79
908,-42.82
909,-42.88
910,-42.94
911,-43.01
912,-43.09
913,-43.17
914,-43.24
915,-43.27
916,-43.29
917,-43.32
918,-43.33
919,-43.31
920,-43.24
921,-43.15
922,-43.04
923,-42.92
924,-42.80
925,-42.68
926,-42.55
927,-42.43
928,-42.34
929,-42.28
930,-42.24
931,-42.21
932,-42.21
933,-42.23
934,-42.27
935,-42.34
936,-42.43
937,-42.52
938,-42.57
939,-42.61
940,-42.65
941,-42.71
942,-42.74
943,-42.75
944,-42.73
945,-42.73
946,-42.73
947,-42.71
948,-42.65
949,-42.59
950,-42.54
951,-42.52
952,-42.48
953,-42.42
954,-42.35
955,-42.32
956,-42.34
957,-42.37
958,-42.37
959,-42.34
960,-42.32
961,-42.35
962,-42.40
963,-42.43
964,-42.44
965,-42.44
966,-42.46
967,-42.48
968,-42.50
969,-42.50
970,-42.53
971,-42.57
972,-42.66
973,-42.75
974,-42.85
975,-42.93
976,-43.01
977,-43.10
978,-43.22
979,-43.37
980,-43.53
981,-43.65
982,-43.74
983,-43.82
984,-43.92
985,-44.01
986,-44.08
987,-44.10
988,-44.12
989,-44.15
990,-44.19
991,-44.22
992,-44.24
993,-44.27
994,-44.32
995,-44.38
996,-44.43
997,-44.46
998,-44.47
999,-44.50
1000,-44.54
1001,-44.57
1002,-44.57
1003,-44.54
1004,-44.50
1005,-44.47
1006,-44.44
1007,-44.42
1008,-44.39
1009,-44.36
1010,-44.33
1011,-44.30
1012,-44.27
1013,-44.27
1014,-44.31
1015,-44.37
1016,-44.43
1017,-44.45
1018,-44.49
1019,-44.54
1020,-44.62
1021,-44.68
1022,-44.72
1023,-44.75
1024,-44.79
1025,-44.85
1026,-44.91
1027,-44.97
1028,-45.04
1029,-45.13
1030,-45.23
1031,-45.31
1032,-45.40
1033,-45.49
1034,-45.59
1035,-45.67
1036,-45.75
1037,-45.80
1038,-45.86
1039,-45.92
1040,-45.98
1041,-46.04
1042,-46.11
1043,-46.19
1044,-46.30
1045,-46.42
1046,-46.57
1047,-46.75
1048,-46.93
1049,-47.11
1050,-47.30
1051,-47.47
1052,-47.64
1053,-47.78
1054,-47.93
1055,-48.04
1056,-48.12
1057,-48.15
1058,-48.17
1059,-48.19
1060,-48.23
1061,-48.26
1062,-48.30
1063,-48.32
1064,-48.32
1065,-48.32
1066,-48.37
1067,-48.45
1068,-48.55
1069,-48.61
1070,-48.66
1071,-48.71
1072,-48.77
1073,-48.84
1074,-48.90
1075,-48.92
1076,-48.93
1077,-48.93
1078,-48.94
1079,-48.97
1080,-49.00
1081,-49.04
1082,-49.07
1083,-49.10
1084,-49.11
1085,-49.11
1086,-49.11
1087,-49.11
1088,-49.11
1089,-49.11
1090,-49.12
1091,-49.11
1092,-49.10
1093,-49.10
1094,-49.13
1095,-49.22
1096,-49.33
1097,-49.46
1098,-49.60
1099,-49.74
1100,-49.90
1101,-50.08
1102,-50.30
1103,-50.54
1104,-50.76
1105,-50.94
1106,-51.10
1107,-51.25
1108,-51.37
1109,-51.46
1110,-51.52
1111,-51.52
1112,-51.45
1113,-51.33
1114,-51.19
1115,-51.04
1116,-50.85
1117,-50.61
1118,-50.35
1119,-50.11
1120,-49.88
1121,-49.68
1122,-49.49
1123,-49.35
1124,-49.22
1125,-49.10
1126,-48.99
1127,-48.90
1128,-48.85
1129,-48.83
1130,-48.77
1131,-48.68
1132,-48.59
1133,-48.55
1134,-48.49
1135,-48.40
1136,-48.25
1137,-48.07
1138,-47.89
1139,-47.71
1140,-47.50
1141,-47.27
1142,-47.04
1143,-46.82
1144,-46.61
1145,-46.40
1146,-46.23
1147,-46.08
1148,-45.93
1149,-45.78
1150,-45.65
1151,-45.56
1152,-45.50
1153,-45.45
1154,-45.39
1155,-45.36
1156,-45.36
1157,-45.39
1158,-45.44
1159,-45.50
1160,-45.57
1161,-45.63
1162,-45.66
1163,-45.70
1164,-45.76
1165,-45.85
1166,-45.92
1167,-45.99
1168,-46.06
1169,-46.11
1170,-46.12
1171,-46.10
1172,-46.06
1173,-46.03
1174,-45.98
1175,-45.93
1176,-45.87
1177,-45.81
1178,-45.72
1179,-45.64
1180,-45.56
1181,-45.54
1182,-45.56
1183,-45.59
1184,-45.59
1185,-45.59
1186,-45.62
1187,-45.68
1188,-45.74
1189,-45.95
1190,-45.90
1191,-45.65
1192,-45.42
1193,-47.14
1194,-47.58
1195,-43.82
1196,-40.76
1197,-48.30
1198,-58.70
1199,-46.17
1200,-14.48
