1,-188.01
2,-250.00
3,-250.00
4,-250.00
5,-244.92
6,-223.47
7,-156.72
8,-52.09
9,54.15
10,137.89
11,193.76
12,222.71
13,229.84
14,225.45
15,217.90
16,208.27
17,189.35
18,158.80
19,119.30
20,80.63
21,48.17
22,23.80
23,6.14
24,-6.23
25,-12.79
26,-15.83
27,-15.73
28,-15.24
29,-13.92
30,-13.67
31,-13.68
32,-15.21
33,-17.15
34,-19.97
35,-22.67
36,-25.34
37,-27.54
38,-29.53
39,-31.21
40,-32.80
41,-34.17
42,-35.48
43,-36.61
44,-37.73
45,-38.71
46,-39.70
47,-40.54
48,-41.37
49,-42.06
50,-42.77
51,-43.40
52,-44.02
53,-44.55
54,-45.07
55,-45.52
56,-46.00
57,-46.40
58,-46.81
59,-47.14
60,-47.50
61,-47.82
62,-48.15
63,-48.42
64,-48.71
65,-48.97
66,-49.25
67,-49.51
68,-49.78
69,-50.01
70,-50.25
71,-50.45
72,-50.67
73,-50.89
74,-51.11
75,-51.32
76,-51.52
77,-51.70
78,-51.87
79,-52.02
80,-52.15
81,-52.25
82,-52.35
83,-52.42
84,-52.49
85,-52.54
86,-52.57
87,-52.60
88,-52.61
89,-52.62
90,-52.63
91,-52.64
92,-52.67
93,-52.68
94,-52.70
95,-52.73
96,-52.76
97,-52.78
98,-52.80
99,-52.82
100,-52.84
101,-52.86
102,-52.89
103,-52.92
104,-52.94
105,-52.96
106,-53.00
107,-53.03
108,-53.06
109,-53.09
110,-53.11
111,-53.15
112,-53.18
113,-53.22
114,-53.25
115,-53.28
116,-53.30
117,-53.32
118,-53.34
119,-53.34
120,-53.36
121,-53.38
122,-53.41
123,-53.43
124,-53.45
125,-53.47
126,-53.51
127,-53.54
128,-53.56
129,-53.56
130,-53.55
131,-53.55
132,-53.55
133,-53.55
134,-53.53
135,-53.50
136,-53.47
137,-53.44
138,-53.41
139,-53.38
140,-53.33
141,-53.28
142,-53.25
143,-53.24
144,-53.22
145,-53.22
146,-53.22
147,-53.25
148,-53.29
149,-53.33
150,-53.38
151,-53.44
152,-53.51
153,-53.57
154,-53.63
155,-53.69
156,-53.73
157,-53.77
158,-53.79
159,-53.83
160,-53.83
161,-53.83
162,-53.79
163,-53.75
164,-53.68
165,-53.61
166,-53.54
167,-53.46
168,-53.39
169,-53.33
170,-53.27
171,-53.21
172,-53.17
173,-53.16
174,-53.16
175,-53.18
176,-53.22
177,-53.28
178,-53.34
179,-53.41
180,-53.47
181,-53.53
182,-53.59
183,-53.63
184,-53.69
185,-53.75
186,-53.81
187,-53.86
188,-53.91
189,-53.94
190,-53.96
191,-53.97
192,-54.00
193,-54.02
194,-54.03
195,-54.02
196,-54.02
197,-54.02
198,-54.01
199,-53.99
200,-53.96
201,-53.95
202,-53.95
203,-53.93
204,-53.90
205,-53.86
206,-53.83
207,-53.82
208,-53.81
209,-53.79
210,-53.77
211,-53.76
212,-53.73
213,-53.73
214,-53.71
215,-53.69
216,-53.66
217,-53.63
218,-53.60
219,-53.58
220,-53.53
221,-53.47
222,-53.39
223,-53.32
224,-53.24
225,-53.13
226,-53.01
227,-52.89
228,-52.79
229,-52.68
230,-52.57
231,-52.47
232,-52.36
233,-52.28
234,-52.19
235,-52.12
236,-52.06
237,-52.01
238,-51.98
239,-51.96
240,-51.93
241,-51.89
242,-51.86
243,-51.86
244,-51.86
245,-51.83
246,-51.80
247,-51.77
248,-51.77
249,-51.78
250,-51.78
251,-51.76
252,-51.74
253,-51.74
254,-51.74
255,-51.73
256,-51.73
257,-51.73
258,-51.77
259,-51.77
260,-51.77
261,-51.77
262,-51.79
263,-51.81
264,-51.82
265,-51.82
266,-51.80
267,-51.80
268,-51.80
269,-51.82
270,-51.83
271,-51.85
272,-51.86
273,-51.86
274,-51.86
275,-51.87
276,-51.87
277,-51.87
278,-51.85
279,-51.83
280,-51.81
281,-51.79
282,-51.76
283,-51.71
284,-51.66
285,-51.61
286,-51.59
287,-51.57
288,-51.56
289,-51.53
290,-51.51
291,-51.50
292,-51.51
293,-51.51
294,-51.51
295,-51.51
296,-51.50
297,-51.50
298,-51.50
299,-51.48
300,-51.45
301,-51.44
302,-51.43
303,-51.41
304,-51.38
305,-51.32
306,-51.27
307,-51.22
308,-51.19
309,-51.16
310,-51.12
311,-51.08
312,-51.03
313,-50.98
314,-50.93
315,-50.90
316,-50.87
317,-50.85
318,-50.82
319,-50.80
320,-50.79
321,-50.80
322,-50.80
323,-50.80
324,-50.79
325,-50.77
326,-50.76
327,-50.74
328,-50.71
329,-50.69
330,-50.67
331,-50.65
332,-50.63
333,-50.60
334,-50.57
335,-50.54
336,-50.52
337,-50.51
338,-50.49
339,-50.46
340,-50.43
341,-50.41
342,-50.38
343,-50.37
344,-50.36
345,-50.36
346,-50.36
347,-50.37
348,-50.39
349,-50.43
350,-50.47
351,-50.50
352,-50.53
353,-50.58
354,-50.63
355,-50.68
356,-50.72
357,-50.74
358,-50.77
359,-50.81
360,-50.86
361,-50.89
362,-50.90
363,-50.89
364,-50.90
365,-50.91
366,-50.93
367,-50.95
368,-50.96
369,-50.97
370,-50.99
371,-51.00
372,-51.03
373,-51.06
374,-51.09
375,-51.12
376,-51.13
377,-51.14
378,-51.15
379,-51.16
380,-51.16
381,-51.17
382,-51.16
383,-51.15
384,-51.14
385,-51.15
386,-51.16
387,-51.18
388,-51.19
389,-51.20
390,-51.22
391,-51.25
392,-51.28
393,-51.30
394,-51.33
395,-51.38
396,-51.42
397,-51.46
398,-51.48
399,-51.50
400,-51.51
401,-51.51
402,-51.49
403,-51.45
404,-51.41
405,-51.36
406,-51.31
407,-51.25
408,-51.19
409,-51.11
410,-51.04
411,-50.98
412,-50.93
413,-50.90
414,-50.85
415,-50.82
416,-50.80
417,-50.81
418,-50.83
419,-50.87
420,-50.88
421,-50.89
422,-50.90
423,-50.93
424,-50.98
425,-51.03
426,-51.06
427,-51.09
428,-51.13
429,-51.17
430,-51.22
431,-51.26
432,-51.28
433,-51.30
434,-51.30
435,-51.30
436,-51.28
437,-51.25
438,-51.22
439,-51.18
440,-51.12
441,-51.07
442,-51.03
443,-50.99
444,-50.98
445,-50.96
446,-50.93
447,-50.91
448,-50.90
449,-50.90
450,-50.88
451,-50.85
452,-50.83
453,-50.81
454,-50.79
455,-50.76
456,-50.72
457,-50.70
458,-50.70
459,-50.73
460,-50.75
461,-50.77
462,-50.78
463,-50.80
464,-50.84
465,-50.89
466,-50.92
467,-50.95
468,-50.98
469,-51.02
470,-51.03
471,-50.99
472,-50.96
473,-50.93
474,-50.91
475,-50.90
476,-50.88
477,-50.86
478,-50.85
479,-50.87
480,-50.88
481,-50.92
482,-50.96
483,-51.01
484,-51.04
485,-51.06
486,-51.07
487,-51.10
488,-51.12
489,-51.09
490,-51.04
491,-50.98
492,-50.92
493,-50.87
494,-50.80
495,-50.74
496,-50.67
497,-50.64
498,-50.63
499,-50.63
500,-50.63
501,-50.65
502,-50.70
503,-50.75
504,-50.80
505,-50.84
506,-50.87
507,-50.89
508,-50.93
509,-50.96
510,-50.97
511,-50.96
512,-50.92
513,-50.87
514,-50.82
515,-50.76
516,-50.69
517,-50.63
518,-50.57
519,-50.51
520,-50.45
521,-50.42
522,-50.38
523,-50.35
524,-50.32
525,-50.29
526,-50.25
527,-50.24
528,-50.22
529,-50.22
530,-50.19
531,-50.13
532,-50.07
533,-50.03
534,-49.99
535,-49.96
536,-49.91
537,-49.87
538,-49.84
539,-49.81
540,-49.79
541,-49.77
542,-49.74
543,-49.71
544,-49.68
545,-49.66
546,-49.64
547,-49.63
548,-49.63
549,-49.62
550,-49.61
551,-49.61
552,-49.64
553,-49.68
554,-49.74
555,-49.81
556,-49.90
557,-50.00
558,-50.09
559,-50.17
560,-50.25
561,-50.34
562,-50.42
563,-50.49
564,-50.54
565,-50.56
566,-50.58
567,-50.59
568,-50.61
569,-50.62
570,-50.64
571,-50.64
572,-50.67
573,-50.68
574,-50.71
575,-50.75
576,-50.79
577,-50.84
578,-50.91
579,-50.97
580,-51.04
581,-51.10
582,-51.19
583,-51.25
584,-51.33
585,-51.40
586,-51.48
587,-51.54
588,-51.61
589,-51.69
590,-51.77
591,-51.84
592,-51.89
593,-51.92
594,-51.96
595,-52.00
596,-52.04
597,-52.06
598,-52.08
599,-52.08
600,-52.07
601,-52.06
602,-52.05
603,-52.02
604,-51.98
605,-51.93
606,-51.87
607,-51.85
608,-51.83
609,-51.78
610,-51.73
611,-51.68
612,-51.66
613,-51.66
614,-51.68
615,-51.71
616,-51.72
617,-51.74
618,-51.78
619,-51.83
620,-51.87
621,-51.90
622,-51.93
623,-51.98
624,-52.03
625,-52.08
626,-52.12
627,-52.15
628,-52.20
629,-52.24
630,-52.26
631,-52.28
632,-52.29
633,-52.31
634,-52.31
635,-52.32
636,-52.32
637,-52.32
638,-52.31
639,-52.28
640,-52.25
641,-52.25
642,-52.25
643,-52.24
644,-52.22
645,-52.22
646,-52.22
647,-52.24
648,-52.25
649,-52.26
650,-52.27
651,-52.27
652,-52.25
653,-52.25
654,-52.25
655,-52.26
656,-52.26
657,-52.25
658,-52.22
659,-52.20
660,-52.19
661,-52.17
662,-52.16
663,-52.16
664,-52.16
665,-52.17
666,-52.19
667,-52.22
668,-52.25
669,-52.27
670,-52.31
671,-52.35
672,-52.39
673,-52.43
674,-52.45
675,-52.47
676,-52.50
677,-52.51
678,-52.53
679,-52.54
680,-52.54
681,-52.53
682,-52.52
683,-52.54
684,-52.54
685,-52.55
686,-52.55
687,-52.56
688,-52.58
689,-52.61
690,-52.63
691,-52.64
692,-52.62
693,-52.59
694,-52.54
695,-52.49
696,-52.43
697,-52.37
698,-52.30
699,-52.22
700,-52.11
701,-52.01
702,-51.91
703,-51.84
704,-51.77
705,-51.71
706,-51.65
707,-51.60
708,-51.54
709,-51.51
710,-51.49
711,-51.48
712,-51.45
713,-51.43
714,-51.41
715,-51.38
716,-51.37
717,-51.35
718,-51.34
719,-51.32
720,-51.32
721,-51.33
722,-51.34
723,-51.34
724,-51.32
725,-51.32
726,-51.34
727,-51.35
728,-51.36
729,-51.35
730,-51.35
731,-51.36
732,-51.36
733,-51.35
734,-51.33
735,-51.34
736,-51.36
737,-51.39
738,-51.41
739,-51.42
740,-51.44
741,-51.47
742,-51.51
743,-51.54
744,-51.56
745,-51.56
746,-51.56
747,-51.57
748,-51.58
749,-51.58
750,-51.57
751,-51.55
752,-51.56
753,-51.56
754,-51.54
755,-51.52
756,-51.48
757,-51.44
758,-51.40
759,-51.36
760,-51.33
761,-51.32
762,-51.31
763,-51.29
764,-51.26
765,-51.22
766,-51.20
767,-51.19
768,-51.19
769,-51.18
770,-51.14
771,-51.09
772,-51.05
773,-51.01
774,-50.97
775,-50.94
776,-50.90
777,-50.86
778,-50.82
779,-50.80
780,-50.80
781,-50.80
782,-50.79
783,-50.77
784,-50.74
785,-50.74
786,-50.74
787,-50.74
788,-50.70
789,-50.65
790,-50.63
791,-50.64
792,-50.63
793,-50.59
794,-50.55
795,-50.54
796,-50.55
797,-50.58
798,-50.61
799,-50.64
800,-50.67
801,-50.70
802,-50.75
803,-50.80
804,-50.84
805,-50.87
806,-50.89
807,-50.89
808,-50.88
809,-50.87
810,-50.84
811,-50.83
812,-50.82
813,-50.80
814,-50.78
815,-50.77
816,-50.77
817,-50.78
818,-50.80
819,-50.80
820,-50.80
821,-50.82
822,-50.83
823,-50.84
824,-50.85
825,-50.86
826,-50.85
827,-50.85
828,-50.83
829,-50.82
830,-50.83
831,-50.84
832,-50.87
833,-50.88
834,-50.90
835,-50.95
836,-51.03
837,-51.13
838,-51.22
839,-51.31
840,-51.39
841,-51.48
842,-51.57
843,-51.65
844,-51.73
845,-51.80
846,-51.84
847,-51.86
848,-51.89
849,-51.90
850,-51.93
851,-51.95
852,-51.97
853,-52.01
854,-52.05
855,-52.09
856,-52.15
857,-52.22
858,-52.31
859,-52.37
860,-52.42
861,-52.47
862,-52.51
863,-52.55
864,-52.58
865,-52.60
866,-52.62
867,-52.63
868,-52.64
869,-52.67
870,-52.70
871,-52.73
872,-52.78
873,-52.82
874,-52.84
875,-52.87
876,-52.90
877,-52.93
878,-52.93
879,-52.91
880,-52.89
881,-52.86
882,-52.85
883,-52.83
884,-52.80
885,-52.76
886,-52.72
887,-52.68
888,-52.65
889,-52.64
890,-52.64
891,-52.62
892,-52.60
893,-52.57
894,-52.56
895,-52.54
896,-52.51
897,-52.51
898,-52.49
899,-52.47
900,-52.44
901,-52.42
902,-52.41
903,-52.43
904,-52.44
905,-52.47
906,-52.47
907,-52.48
908,-52.48
909,-52.50
910,-52.51
911,-52.53
912,-52.54
913,-52.54
914,-52.54
915,-52.53
916,-52.52
917,-52.52
918,-52.52
919,-52.52
920,-52.53
921,-52.54
922,-52.54
923,-52.54
924,-52.54
925,-52.56
926,-52.57
927,-52.60
928,-52.62
929,-52.64
930,-52.64
931,-52.62
932,-52.60
933,-52.58
934,-52.56
935,-52.54
936,-52.52
937,-52.50
938,-52.47
939,-52.41
940,-52.36
941,-52.31
942,-52.25
943,-52.22
944,-52.17
945,-52.13
946,-52.09
947,-52.05
948,-51.99
949,-51.95
950,-51.92
951,-51.90
952,-51.90
953,-51.89
954,-51.90
955,-51.93
956,-51.96
957,-51.99
958,-52.02
959,-52.09
960,-52.15
961,-52.21
962,-52.26
963,-52.31
964,-52.38
965,-52.43
966,-52.48
967,-52.52
968,-52.55
969,-52.57
970,-52.57
971,-52.54
972,-52.51
973,-52.46
974,-52.41
975,-52.36
976,-52.31
977,-52.26
978,-52.23
979,-52.22
980,-52.21
981,-52.22
982,-52.22
983,-52.25
984,-52.28
985,-52.33
986,-52.36
987,-52.37
988,-52.37
989,-52.38
990,-52.37
991,-52.35
992,-52.31
993,-52.25
994,-52.19
995,-52.12
996,-52.06
997,-51.99
998,-51.93
999,-51.88
1000,-51.84
1001,-51.82
1002,-51.80
1003,-51.78
1004,-51.73
1005,-51.68
1006,-51.64
1007,-51.60
1008,-51.57
1009,-51.53
1010,-51.48
1011,-51.42
1012,-51.38
1013,-51.35
1014,-51.32
1015,-51.28
1016,-51.23
1017,-51.19
1018,-51.18
1019,-51.19
1020,-51.22
1021,-51.24
1022,-51.27
1023,-51.32
1024,-51.38
1025,-51.45
1026,-51.51
1027,-51.57
1028,-51.61
1029,-51.64
1030,-51.67
1031,-51.70
1032,-51.74
1033,-51.77
1034,-51.79
1035,-51.81
1036,-51.84
1037,-51.87
1038,-51.90
1039,-51.93
1040,-51.97
1041,-52.02
1042,-52.06
1043,-52.09
1044,-52.11
1045,-52.12
1046,-52.15
1047,-52.16
1048,-52.17
1049,-52.17
1050,-52.16
1051,-52.16
1052,-52.16
1053,-52.16
1054,-52.17
1055,-52.16
1056,-52.15
1057,-52.16
1058,-52.22
1059,-52.28
1060,-52.34
1061,-52.37
1062,-52.42
1063,-52.48
1064,-52.55
1065,-52.61
1066,-52.68
1067,-52.76
1068,-52.83
1069,-52.90
1070,-52.96
1071,-53.01
1072,-53.05
1073,-53.09
1074,-53.12
1075,-53.15
1076,-53.17
1077,-53.15
1078,-53.12
1079,-53.09
1080,-53.05
1081,-53.02
1082,-52.97
1083,-52.91
1084,-52.86
1085,-52.80
1086,-52.75
1087,-52.70
1088,-52.66
1089,-52.64
1090,-52.64
1091,-52.65
1092,-52.67
1093,-52.70
1094,-52.75
1095,-52.81
1096,-52.88
1097,-52.96
1098,-53.05
1099,-53.15
1100,-53.25
1101,-53.35
1102,-53.44
1103,-53.53
1104,-53.63
1105,-53.73
1106,-53.83
1107,-53.91
1108,-53.99
1109,-54.08
1110,-54.15
1111,-54.21
1112,-54.24
1113,-54.28
1114,-54.30
1115,-54.31
1116,-54.30
1117,-54.28
1118,-54.24
1119,-54.22
1120,-54.18
1121,-54.12
1122,-54.03
1123,-53.95
1124,-53.88
1125,-53.83
1126,-53.79
1127,-53.76
1128,-53.72
1129,-53.66
1130,-53.60
1131,-53.54
1132,-53.50
1133,-53.47
1134,-53.47
1135,-53.47
1136,-53.47
1137,-53.46
1138,-53.45
1139,-53.45
1140,-53.47
1141,-53.50
1142,-53.52
1143,-53.53
1144,-53.51
1145,-53.50
1146,-53.49
1147,-53.47
1148,-53.43
1149,-53.37
1150,-53.32
1151,-53.29
1152,-53.28
1153,-53.25
1154,-53.18
1155,-53.12
1156,-53.08
1157,-53.05
1158,-53.02
1159,-52.99
1160,-52.95
1161,-52.92
1162,-52.91
1163,-52.90
1164,-52.89
1165,-52.87
1166,-52.85
1167,-52.83
1168,-52.80
1169,-52.79
1170,-52.76
1171,-52.74
1172,-52.70
1173,-52.66
1174,-52.63
1175,-52.60
1176,-52.57
1177,-52.52
1178,-52.49
1179,-52.48
1180,-52.47
1181,-52.47
1182,-52.47
1183,-52.49
1184,-52.51
1185,-52.51
1186,-52.50
1187,-52.50
1188,-52.51
1189,-52.71
1190,-52.63
1191,-52.31
1192,-51.99
1193,-53.76
1194,-54.24
1195,-50.30
1196,-46.93
1197,-54.58
1198,-65.54
1199,-53.00
1200,-19.52
