1,-189.54
2,-250.00
3,-250.00
4,-242.65
5,-242.45
6,-250.00
7,-200.19
8,-53.96
9,121.87
10,237.66
11,249.99
12,248.89
13,241.40
14,249.99
15,249.99
16,249.99
17,248.47
18,249.99
19,249.99
20,245.45
21,220.99
22,183.72
23,143.84
24,111.51
25,91.68
26,79.93
27,72.82
28,66.96
29,63.29
30,59.66
31,55.99
32,50.19
33,43.90
34,36.21
35,29.04
36,21.64
37,15.37
38,9.31
39,4.08
40,-1.11
41,-5.62
42,-10.09
43,-13.99
44,-17.97
45,-21.49
46,-25.08
47,-28.20
48,-31.38
49,-34.17
50,-37.03
51,-39.52
52,-42.06
53,-44.29
54,-46.56
55,-48.53
56,-50.53
57,-52.27
58,-54.05
59,-55.63
60,-57.24
61,-58.67
62,-60.14
63,-61.46
64,-62.85
65,-64.10
66,-65.41
67,-66.59
68,-67.83
69,-68.95
70,-70.10
71,-71.14
72,-72.22
73,-73.20
74,-74.17
75,-75.00
76,-75.84
77,-76.62
78,-77.42
79,-78.12
80,-78.78
81,-79.35
82,-79.95
83,-80.52
84,-81.15
85,-81.73
86,-82.31
87,-82.83
88,-83.37
89,-83.85
90,-84.36
91,-84.79
92,-85.22
93,-85.59
94,-85.95
95,-86.24
96,-86.49
97,-86.69
98,-86.88
99,-87.05
100,-87.23
101,-87.36
102,-87.51
103,-87.65
104,-87.85
105,-88.08
106,-88.33
107,-88.56
108,-88.82
109,-89.08
110,-89.36
111,-89.64
112,-89.90
113,-90.13
114,-90.33
115,-90.48
116,-90.60
117,-90.68
118,-90.73
119,-90.73
120,-90.71
121,-90.68
122,-90.61
123,-90.52
124,-90.45
125,-90.42
126,-90.40
127,-90.38
128,-90.33
129,-90.31
130,-90.30
131,-90.30
132,-90.29
133,-90.29
134,-90.32
135,-90.35
136,-90.35
137,-90.32
138,-90.31
139,-90.33
140,-90.38
141,-90.41
142,-90.43
143,-90.46
144,-90.48
145,-90.52
146,-90.55
147,-90.58
148,-90.59
149,-90.59
150,-90.60
151,-90.60
152,-90.57
153,-90.52
154,-90.44
155,-90.38
156,-90.33
157,-90.27
158,-90.20
159,-90.14
160,-90.11
161,-90.11
162,-90.11
163,-90.12
164,-90.13
165,-90.16
166,-90.18
167,-90.18
168,-90.19
169,-90.22
170,-90.26
171,-90.26
172,-90.21
173,-90.15
174,-90.10
175,-90.07
176,-90.03
177,-89.97
178,-89.90
179,-89.84
180,-89.79
181,-89.74
182,-89.68
183,-89.58
184,-89.45
185,-89.34
186,-89.26
187,-89.20
188,-89.13
189,-89.00
190,-88.85
191,-88.71
192,-88.57
193,-88.46
194,-88.33
195,-88.21
196,-88.10
197,-87.98
198,-87.84
199,-87.69
200,-87.54
201,-87.43
202,-87.33
203,-87.29
204,-87.25
205,-87.22
206,-87.18
207,-87.16
208,-87.14
209,-87.14
210,-87.14
211,-87.18
212,-87.23
213,-87.27
214,-87.24
215,-87.18
216,-87.11
217,-87.09
218,-87.08
219,-87.05
220,-86.97
221,-86.88
222,-86.83
223,-86.80
224,-86.75
225,-86.65
226,-86.58
227,-86.55
228,-86.55
229,-86.55
230,-86.54
231,-86.54
232,-86.56
233,-86.59
234,-86.61
235,-86.61
236,-86.62
237,-86.65
238,-86.69
239,-86.72
240,-86.73
241,-86.74
242,-86.72
243,-86.69
244,-86.65
245,-86.62
246,-86.60
247,-86.57
248,-86.52
249,-86.46
250,-86.40
251,-86.33
252,-86.27
253,-86.18
254,-86.09
255,-86.00
256,-85.90
257,-85.78
258,-85.65
259,-85.53
260,-85.43
261,-85.34
262,-85.25
263,-85.16
264,-85.06
265,-84.98
266,-84.91
267,-84.85
268,-84.79
269,-84.72
270,-84.68
271,-84.65
272,-84.63
273,-84.63
274,-84.66
275,-84.72
276,-84.79
277,-84.85
278,-84.91
279,-84.96
280,-85.04
281,-85.14
282,-85.20
283,-85.23
284,-85.25
285,-85.27
286,-85.31
287,-85.34
288,-85.37
289,-85.40
290,-85.43
291,-85.46
292,-85.49
293,-85.52
294,-85.58
295,-85.66
296,-85.75
297,-85.85
298,-85.95
299,-86.04
300,-86.09
301,-86.13
302,-86.16
303,-86.18
304,-86.17
305,-86.16
306,-86.14
307,-86.10
308,-86.02
309,-85.90
310,-85.78
311,-85.68
312,-85.62
313,-85.57
314,-85.51
315,-85.44
316,-85.38
317,-85.35
318,-85.38
319,-85.43
320,-85.50
321,-85.56
322,-85.65
323,-85.76
324,-85.88
325,-86.01
326,-86.15
327,-86.29
328,-86.43
329,-86.59
330,-86.77
331,-86.94
332,-87.07
333,-87.17
334,-87.27
335,-87.38
336,-87.47
337,-87.50
338,-87.50
339,-87.49
340,-87.50
341,-87.50
342,-87.51
343,-87.53
344,-87.59
345,-87.65
346,-87.71
347,-87.77
348,-87.84
349,-87.93
350,-88.02
351,-88.11
352,-88.20
353,-88.25
354,-88.27
355,-88.27
356,-88.29
357,-88.32
358,-88.34
359,-88.30
360,-88.23
361,-88.17
362,-88.16
363,-88.19
364,-88.22
365,-88.26
366,-88.32
367,-88.40
368,-88.49
369,-88.55
370,-88.60
371,-88.62
372,-88.62
373,-88.59
374,-88.56
375,-88.49
376,-88.39
377,-88.24
378,-88.10
379,-87.97
380,-87.84
381,-87.69
382,-87.55
383,-87.46
384,-87.42
385,-87.39
386,-87.36
387,-87.36
388,-87.40
389,-87.49
390,-87.62
391,-87.78
392,-87.93
393,-88.07
394,-88.23
395,-88.39
396,-88.51
397,-88.59
398,-88.68
399,-88.76
400,-88.83
401,-88.87
402,-88.87
403,-88.87
404,-88.85
405,-88.82
406,-88.80
407,-88.76
408,-88.71
409,-88.65
410,-88.62
411,-88.62
412,-88.62
413,-88.63
414,-88.65
415,-88.68
416,-88.70
417,-88.70
418,-88.68
419,-88.68
420,-88.70
421,-88.71
422,-88.66
423,-88.58
424,-88.47
425,-88.38
426,-88.29
427,-88.17
428,-88.01
429,-87.84
430,-87.65
431,-87.47
432,-87.30
433,-87.12
434,-86.91
435,-86.71
436,-86.51
437,-86.33
438,-86.15
439,-85.98
440,-85.81
441,-85.66
442,-85.52
443,-85.40
444,-85.32
445,-85.26
446,-85.20
447,-85.14
448,-85.10
449,-85.10
450,-85.14
451,-85.20
452,-85.26
453,-85.32
454,-85.40
455,-85.49
456,-85.55
457,-85.59
458,-85.62
459,-85.64
460,-85.66
461,-85.66
462,-85.67
463,-85.69
464,-85.72
465,-85.75
466,-85.81
467,-85.89
468,-86.00
469,-86.13
470,-86.27
471,-86.42
472,-86.52
473,-86.59
474,-86.64
475,-86.66
476,-86.65
477,-86.59
478,-86.52
479,-86.45
480,-86.40
481,-86.33
482,-86.28
483,-86.25
484,-86.26
485,-86.28
486,-86.31
487,-86.38
488,-86.49
489,-86.65
490,-86.78
491,-86.91
492,-87.04
493,-87.14
494,-87.23
495,-87.27
496,-87.29
497,-87.27
498,-87.22
499,-87.13
500,-87.07
501,-87.02
502,-86.99
503,-86.94
504,-86.90
505,-86.89
506,-86.91
507,-86.94
508,-86.99
509,-87.07
510,-87.21
511,-87.36
512,-87.52
513,-87.66
514,-87.81
515,-87.97
516,-88.11
517,-88.26
518,-88.42
519,-88.56
520,-88.68
521,-88.78
522,-88.85
523,-88.91
524,-88.94
525,-88.93
526,-88.94
527,-88.97
528,-89.01
529,-89.04
530,-89.06
531,-89.09
532,-89.14
533,-89.20
534,-89.24
535,-89.26
536,-89.30
537,-89.36
538,-89.44
539,-89.50
540,-89.55
541,-89.57
542,-89.60
543,-89.63
544,-89.67
545,-89.70
546,-89.71
547,-89.71
548,-89.71
549,-89.71
550,-89.71
551,-89.68
552,-89.60
553,-89.51
554,-89.42
555,-89.37
556,-89.32
557,-89.26
558,-89.18
559,-89.13
560,-89.12
561,-89.15
562,-89.17
563,-89.20
564,-89.28
565,-89.39
566,-89.50
567,-89.57
568,-89.61
569,-89.64
570,-89.63
571,-89.60
572,-89.58
573,-89.58
574,-89.58
575,-89.55
576,-89.50
577,-89.46
578,-89.47
579,-89.50
580,-89.55
581,-89.61
582,-89.69
583,-89.78
584,-89.87
585,-89.96
586,-90.03
587,-90.13
588,-90.23
589,-90.33
590,-90.38
591,-90.38
592,-90.35
593,-90.35
594,-90.38
595,-90.41
596,-90.41
597,-90.38
598,-90.37
599,-90.39
600,-90.42
601,-90.47
602,-90.51
603,-90.52
604,-90.52
605,-90.48
606,-90.48
607,-90.48
608,-90.45
609,-90.37
610,-90.25
611,-90.12
612,-89.99
613,-89.87
614,-89.78
615,-89.68
616,-89.60
617,-89.51
618,-89.42
619,-89.32
620,-89.25
621,-89.20
622,-89.16
623,-89.13
624,-89.08
625,-89.03
626,-88.96
627,-88.90
628,-88.83
629,-88.78
630,-88.72
631,-88.66
632,-88.58
633,-88.49
634,-88.43
635,-88.40
636,-88.37
637,-88.36
638,-88.33
639,-88.29
640,-88.23
641,-88.17
642,-88.15
643,-88.14
644,-88.13
645,-88.11
646,-88.10
647,-88.13
648,-88.17
649,-88.20
650,-88.24
651,-88.29
652,-88.36
653,-88.39
654,-88.40
655,-88.40
656,-88.38
657,-88.36
658,-88.33
659,-88.29
660,-88.23
661,-88.15
662,-88.05
663,-87.97
664,-87.87
665,-87.75
666,-87.61
667,-87.46
668,-87.30
669,-87.16
670,-87.01
671,-86.86
672,-86.70
673,-86.55
674,-86.43
675,-86.34
676,-86.27
677,-86.21
678,-86.17
679,-86.17
680,-86.21
681,-86.27
682,-86.33
683,-86.40
684,-86.47
685,-86.56
686,-86.63
687,-86.66
688,-86.69
689,-86.72
690,-86.73
691,-86.71
692,-86.64
693,-86.54
694,-86.43
695,-86.32
696,-86.19
697,-86.04
698,-85.85
699,-85.65
700,-85.45
701,-85.30
702,-85.17
703,-85.06
704,-84.95
705,-84.86
706,-84.78
707,-84.72
708,-84.68
709,-84.65
710,-84.62
711,-84.63
712,-84.67
713,-84.72
714,-84.77
715,-84.80
716,-84.86
717,-84.95
718,-85.03
719,-85.09
720,-85.14
721,-85.24
722,-85.36
723,-85.49
724,-85.59
725,-85.64
726,-85.67
727,-85.70
728,-85.73
729,-85.76
730,-85.77
731,-85.74
732,-85.67
733,-85.59
734,-85.49
735,-85.40
736,-85.30
737,-85.21
738,-85.15
739,-85.09
740,-85.01
741,-84.92
742,-84.86
743,-84.82
744,-84.81
745,-84.78
746,-84.75
747,-84.75
748,-84.77
749,-84.81
750,-84.83
751,-84.86
752,-84.91
753,-84.96
754,-85.03
755,-85.08
756,-85.16
757,-85.24
758,-85.35
759,-85.44
760,-85.51
761,-85.57
762,-85.62
763,-85.68
764,-85.73
765,-85.76
766,-85.78
767,-85.78
768,-85.75
769,-85.72
770,-85.70
771,-85.67
772,-85.62
773,-85.56
774,-85.53
775,-85.52
776,-85.53
777,-85.54
778,-85.55
779,-85.54
780,-85.52
781,-85.49
782,-85.49
783,-85.52
784,-85.55
785,-85.55
786,-85.53
787,-85.53
788,-85.55
789,-85.57
790,-85.60
791,-85.63
792,-85.69
793,-85.74
794,-85.78
795,-85.82
796,-85.85
797,-85.87
798,-85.91
799,-85.94
800,-85.97
801,-86.00
802,-86.02
803,-86.05
804,-86.11
805,-86.19
806,-86.30
807,-86.42
808,-86.56
809,-86.71
810,-86.85
811,-86.97
812,-87.08
813,-87.20
814,-87.32
815,-87.41
816,-87.46
817,-87.49
818,-87.52
819,-87.54
820,-87.56
821,-87.56
822,-87.55
823,-87.55
824,-87.59
825,-87.68
826,-87.80
827,-87.91
828,-88.03
829,-88.14
830,-88.29
831,-88.44
832,-88.57
833,-88.66
834,-88.74
835,-88.79
836,-88.79
837,-88.74
838,-88.65
839,-88.56
840,-88.46
841,-88.34
842,-88.23
843,-88.13
844,-88.04
845,-88.00
846,-87.98
847,-87.98
848,-87.96
849,-87.94
850,-87.94
851,-87.96
852,-87.97
853,-87.95
854,-87.91
855,-87.88
856,-87.84
857,-87.78
858,-87.70
859,-87.63
860,-87.60
861,-87.61
862,-87.62
863,-87.62
864,-87.61
865,-87.60
866,-87.64
867,-87.70
868,-87.77
869,-87.83
870,-87.88
871,-87.94
872,-88.01
873,-88.07
874,-88.11
875,-88.13
876,-88.17
877,-88.23
878,-88.31
879,-88.34
880,-88.30
881,-88.24
882,-88.21
883,-88.20
884,-88.19
885,-88.14
886,-88.07
887,-88.01
888,-87.94
889,-87.85
890,-87.77
891,-87.70
892,-87.64
893,-87.59
894,-87.54
895,-87.51
896,-87.47
897,-87.42
898,-87.35
899,-87.30
900,-87.23
901,-87.14
902,-87.01
903,-86.86
904,-86.72
905,-86.61
906,-86.49
907,-86.34
908,-86.15
909,-85.98
910,-85.83
911,-85.72
912,-85.57
913,-85.40
914,-85.21
915,-85.07
916,-84.92
917,-84.78
918,-84.61
919,-84.47
920,-84.35
921,-84.23
922,-84.08
923,-83.93
924,-83.83
925,-83.81
926,-83.79
927,-83.76
928,-83.73
929,-83.73
930,-83.79
931,-83.85
932,-83.87
933,-83.87
934,-83.89
935,-83.92
936,-83.92
937,-83.89
938,-83.85
939,-83.82
940,-83.79
941,-83.77
942,-83.74
943,-83.70
944,-83.68
945,-83.69
946,-83.71
947,-83.73
948,-83.75
949,-83.76
950,-83.76
951,-83.79
952,-83.82
953,-83.85
954,-83.90
955,-83.95
956,-84.01
957,-84.07
958,-84.16
959,-84.28
960,-84.41
961,-84.53
962,-84.64
963,-84.72
964,-84.79
965,-84.85
966,-84.92
967,-84.98
968,-85.02
969,-85.05
970,-85.07
971,-85.07
972,-85.05
973,-85.02
974,-84.99
975,-84.96
976,-84.92
977,-84.86
978,-84.78
979,-84.68
980,-84.60
981,-84.55
982,-84.50
983,-84.43
984,-84.39
985,-84.35
986,-84.35
987,-84.37
988,-84.45
989,-84.56
990,-84.72
991,-84.86
992,-85.01
993,-85.15
994,-85.33
995,-85.50
996,-85.67
997,-85.82
998,-85.98
999,-86.15
1000,-86.33
1001,-86.49
1002,-86.61
1003,-86.72
1004,-86.85
1005,-87.00
1006,-87.17
1007,-87.32
1008,-87.44
1009,-87.52
1010,-87.59
1011,-87.68
1012,-87.81
1013,-87.93
1014,-88.01
1015,-88.07
1016,-88.14
1017,-88.23
1018,-88.29
1019,-88.33
1020,-88.36
1021,-88.41
1022,-88.49
1023,-88.55
1024,-88.61
1025,-88.65
1026,-88.73
1027,-88.81
1028,-88.92
1029,-89.01
1030,-89.08
1031,-89.14
1032,-89.20
1033,-89.26
1034,-89.29
1035,-89.33
1036,-89.39
1037,-89.43
1038,-89.46
1039,-89.46
1040,-89.49
1041,-89.54
1042,-89.61
1043,-89.68
1044,-89.74
1045,-89.78
1046,-89.86
1047,-89.94
1048,-90.04
1049,-90.14
1050,-90.23
1051,-90.28
1052,-90.32
1053,-90.35
1054,-90.39
1055,-90.45
1056,-90.48
1057,-90.48
1058,-90.48
1059,-90.48
1060,-90.46
1061,-90.44
1062,-90.41
1063,-90.37
1064,-90.34
1065,-90.31
1066,-90.32
1067,-90.34
1068,-90.36
1069,-90.36
1070,-90.35
1071,-90.39
1072,-90.46
1073,-90.55
1074,-90.62
1075,-90.68
1076,-90.76
1077,-90.85
1078,-90.93
1079,-90.97
1080,-90.94
1081,-90.88
1082,-90.78
1083,-90.67
1084,-90.52
1085,-90.35
1086,-90.13
1087,-89.89
1088,-89.63
1089,-89.40
1090,-89.18
1091,-88.97
1092,-88.76
1093,-88.55
1094,-88.36
1095,-88.21
1096,-88.10
1097,-88.01
1098,-87.93
1099,-87.88
1100,-87.85
1101,-87.85
1102,-87.85
1103,-87.86
1104,-87.87
1105,-87.86
1106,-87.84
1107,-87.81
1108,-87.80
1109,-87.80
1110,-87.78
1111,-87.72
1112,-87.65
1113,-87.62
1114,-87.61
1115,-87.58
1116,-87.52
1117,-87.46
1118,-87.44
1119,-87.44
1120,-87.42
1121,-87.36
1122,-87.31
1123,-87.27
1124,-87.23
1125,-87.18
1126,-87.11
1127,-87.04
1128,-86.99
1129,-86.94
1130,-86.86
1131,-86.77
1132,-86.69
1133,-86.63
1134,-86.59
1135,-86.52
1136,-86.44
1137,-86.35
1138,-86.27
1139,-86.20
1140,-86.17
1141,-86.14
1142,-86.14
1143,-86.14
1144,-86.11
1145,-86.09
1146,-86.07
1147,-86.07
1148,-86.06
1149,-86.04
1150,-86.00
1151,-85.96
1152,-85.94
1153,-85.91
1154,-85.88
1155,-85.85
1156,-85.81
1157,-85.78
1158,-85.77
1159,-85.77
1160,-85.75
1161,-85.76
1162,-85.81
1163,-85.86
1164,-85.88
1165,-85.86
1166,-85.83
1167,-85.83
1168,-85.81
1169,-85.75
1170,-85.69
1171,-85.62
1172,-85.54
1173,-85.43
1174,-85.29
1175,-85.17
1176,-85.07
1177,-84.98
1178,-84.88
1179,-84.77
1180,-84.63
1181,-84.52
1182,-84.43
1183,-84.34
1184,-84.21
1185,-84.06
1186,-83.92
1187,-83.84
1188,-83.79
1189,-84.05
1190,-83.89
1191,-83.40
1192,-82.89
1193,-85.15
1194,-86.10
1195,-81.42
1196,-76.71
1197,-85.56
1198,-99.94
1199,-86.93
1200,-43.37
