1,11.12
2,17.27
3,21.03
4,25.92
5,34.66
6,46.27
7,56.85
8,64.00
9,66.27
10,63.76
11,56.50
12,46.77
13,36.70
14,29.34
15,26.13
16,28.02
17,34.41
18,44.11
19,55.57
20,67.06
21,77.61
22,85.84
23,91.49
24,93.50
25,91.71
26,85.35
27,74.67
28,59.97
29,42.70
30,24.44
31,7.48
32,-6.61
33,-16.23
34,-21.45
35,-22.49
36,-21.14
37,-18.42
38,-16.19
39,-14.75
40,-14.84
41,-15.64
42,-17.00
43,-17.94
44,-18.41
45,-18.17
46,-17.48
47,-16.61
48,-15.84
49,-15.40
50,-15.27
51,-15.40
52,-15.56
53,-15.60
54,-15.43
55,-15.07
56,-14.57
57,-14.03
58,-13.47
59,-12.97
60,-12.54
61,-12.22
62,-11.93
63,-11.66
64,-11.31
65,-10.93
66,-10.48
67,-10.04
68,-9.61
69,-9.22
70,-8.87
71,-8.61
72,-8.45
73,-8.40
74,-8.36
75,-8.32
76,-8.25
77,-8.18
78,-8.10
79,-8.02
80,-7.95
81,-7.94
82,-8.00
83,-8.13
84,-8.31
85,-8.52
86,-8.74
87,-8.91
88,-9.06
89,-9.16
90,-9.28
91,-9.42
92,-9.63
93,-9.90
94,-10.25
95,-10.64
96,-11.02
97,-11.38
98,-11.72
99,-12.04
100,-12.34
101,-12.58
102,-12.78
103,-12.95
104,-13.13
105,-13.28
106,-13.38
107,-13.44
108,-13.47
109,-13.47
110,-13.43
111,-13.31
112,-13.10
113,-12.86
114,-12.64
115,-12.46
116,-12.29
117,-12.18
118,-12.15
119,-12.24
120,-12.39
121,-12.52
122,-12.60
123,-12.59
124,-12.51
125,-12.39
126,-12.25
127,-12.12
128,-12.05
129,-12.02
130,-12.05
131,-12.16
132,-12.37
133,-12.63
134,-12.95
135,-13.28
136,-13.63
137,-13.98
138,-14.35
139,-14.72
140,-15.05
141,-15.28
142,-15.40
143,-15.43
144,-15.42
145,-15.39
146,-15.31
147,-15.17
148,-14.97
149,-14.79
150,-14.64
151,-14.53
152,-14.38
153,-14.18
154,-13.91
155,-13.63
156,-13.26
157,-12.83
158,-12.28
159,-11.69
160,-11.08
161,-10.52
162,-9.96
163,-9.48
164,-9.01
165,-8.64
166,-8.28
167,-7.97
168,-7.63
169,-7.32
170,-6.96
171,-6.61
172,-6.25
173,-5.93
174,-5.60
175,-5.29
176,-4.94
177,-4.65
178,-4.40
179,-4.23
180,-4.11
181,-4.02
182,-3.94
183,-3.88
184,-3.87
185,-3.86
186,-3.83
187,-3.78
188,-3.75
189,-3.74
190,-3.73
191,-3.74
192,-3.79
193,-3.90
194,-4.05
195,-4.20
196,-4.38
197,-4.52
198,-4.61
199,-4.64
200,-4.67
201,-4.71
202,-4.81
203,-4.95
204,-5.22
205,-5.55
206,-5.97
207,-6.42
208,-6.94
209,-7.40
210,-7.78
211,-8.05
212,-8.29
213,-8.51
214,-8.73
215,-8.90
216,-9.12
217,-9.41
218,-9.77
219,-10.09
220,-10.39
221,-10.62
222,-10.81
223,-10.96
224,-11.07
225,-11.15
226,-11.23
227,-11.29
228,-11.33
229,-11.33
230,-11.29
231,-11.23
232,-11.16
233,-11.09
234,-11.05
235,-11.02
236,-11.01
237,-10.99
238,-10.91
239,-10.77
240,-10.53
241,-10.22
242,-9.90
243,-9.60
244,-9.35
245,-9.16
246,-9.07
247,-9.08
248,-9.15
249,-9.25
250,-9.30
251,-9.27
252,-9.15
253,-8.97
254,-8.77
255,-8.60
256,-8.42
257,-8.29
258,-8.16
259,-8.07
260,-8.00
261,-7.94
262,-7.90
263,-7.87
264,-7.84
265,-7.78
266,-7.70
267,-7.61
268,-7.50
269,-7.39
270,-7.26
271,-7.11
272,-6.92
273,-6.68
274,-6.41
275,-6.14
276,-5.91
277,-5.74
278,-5.60
279,-5.51
280,-5.47
281,-5.47
282,-5.48
283,-5.45
284,-5.37
285,-5.25
286,-5.12
287,-4.99
288,-4.90
289,-4.86
290,-4.93
291,-5.10
292,-5.39
293,-5.74
294,-6.16
295,-6.60
296,-7.10
297,-7.62
298,-8.22
299,-8.87
300,-9.61
301,-10.37
302,-11.18
303,-11.94
304,-12.70
305,-13.36
306,-14.02
307,-14.60
308,-15.17
309,-15.69
310,-16.21
311,-16.68
312,-17.14
313,-17.54
314,-17.93
315,-18.28
316,-18.65
317,-18.99
318,-19.34
319,-19.66
320,-20.01
321,-20.32
322,-20.61
323,-20.78
324,-20.90
325,-20.97
326,-21.06
327,-21.15
328,-21.26
329,-21.38
330,-21.50
331,-21.63
332,-21.72
333,-21.73
334,-21.57
335,-21.25
336,-20.76
337,-20.16
338,-19.47
339,-18.79
340,-18.16
341,-17.65
342,-17.25
343,-16.93
344,-16.65
345,-16.43
346,-16.18
347,-15.92
348,-15.63
349,-15.36
350,-15.14
351,-15.05
352,-15.10
353,-15.28
354,-15.58
355,-15.94
356,-16.32
357,-16.69
358,-17.01
359,-17.23
360,-17.37
361,-17.46
362,-17.59
363,-17.75
364,-17.94
365,-18.14
366,-18.35
367,-18.58
368,-18.81
369,-18.98
370,-19.13
371,-19.24
372,-19.34
373,-19.39
374,-19.43
375,-19.42
376,-19.39
377,-19.36
378,-19.36
379,-19.34
380,-19.36
381,-19.41
382,-19.58
383,-19.87
384,-20.24
385,-20.63
386,-21.03
387,-21.42
388,-21.79
389,-22.08
390,-22.29
391,-22.43
392,-22.57
393,-22.71
394,-22.91
395,-23.16
396,-23.53
397,-24.00
398,-24.60
399,-25.22
400,-25.83
401,-26.33
402,-26.76
403,-27.08
404,-27.28
405,-27.36
406,-27.43
407,-27.50
408,-27.63
409,-27.82
410,-28.05
411,-28.32
412,-28.56
413,-28.76
414,-28.87
415,-28.90
416,-28.82
417,-28.64
418,-28.40
419,-28.13
420,-27.82
421,-27.53
422,-27.26
423,-27.06
424,-26.89
425,-26.73
426,-26.46
427,-26.08
428,-25.56
429,-24.96
430,-24.21
431,-23.38
432,-22.44
433,-21.55
434,-20.74
435,-20.14
436,-19.64
437,-19.25
438,-18.86
439,-18.52
440,-18.14
441,-17.77
442,-17.35
443,-16.96
444,-16.49
445,-16.02
446,-15.40
447,-14.67
448,-13.75
449,-12.75
450,-11.65
451,-10.60
452,-9.53
453,-8.59
454,-7.76
455,-7.16
456,-6.65
457,-6.27
458,-5.86
459,-5.46
460,-4.99
461,-4.50
462,-3.94
463,-3.39
464,-2.82
465,-2.34
466,-1.97
467,-1.75
468,-1.59
469,-1.49
470,-1.36
471,-1.20
472,-0.92
473,-0.55
474,-0.06
475,0.47
476,1.05
477,1.56
478,1.96
479,2.18
480,2.31
481,2.38
482,2.49
483,2.62
484,2.84
485,3.11
486,3.45
487,3.76
488,4.03
489,4.21
490,4.37
491,4.50
492,4.62
493,4.75
494,4.94
495,5.23
496,5.58
497,5.96
498,6.30
499,6.54
500,6.59
501,6.46
502,6.13
503,5.62
504,4.90
505,4.04
506,3.10
507,2.21
508,1.34
509,0.53
510,-0.26
511,-0.93
512,-1.57
513,-2.17
514,-2.85
515,-3.55
516,-4.32
517,-5.05
518,-5.79
519,-6.43
520,-7.01
521,-7.44
522,-7.77
523,-7.99
524,-8.21
525,-8.36
526,-8.51
527,-8.64
528,-8.91
529,-9.32
530,-9.86
531,-10.46
532,-11.12
533,-11.76
534,-12.39
535,-12.89
536,-13.28
537,-13.54
538,-13.73
539,-13.84
540,-13.90
541,-13.93
542,-13.95
543,-13.96
544,-13.89
545,-13.69
546,-13.32
547,-12.85
548,-12.28
549,-11.71
550,-11.18
551,-10.74
552,-10.34
553,-9.96
554,-9.54
555,-9.10
556,-8.62
557,-8.16
558,-7.69
559,-7.31
560,-7.00
561,-6.84
562,-6.77
563,-6.78
564,-6.77
565,-6.71
566,-6.63
567,-6.53
568,-6.42
569,-6.34
570,-6.34
571,-6.45
572,-6.67
573,-6.94
574,-7.25
575,-7.55
576,-7.81
577,-7.99
578,-8.08
579,-8.11
580,-8.12
581,-8.14
582,-8.22
583,-8.36
584,-8.58
585,-8.83
586,-9.04
587,-9.16
588,-9.16
589,-9.03
590,-8.83
591,-8.58
592,-8.34
593,-8.13
594,-7.99
595,-7.93
596,-7.94
597,-8.00
598,-8.09
599,-8.22
600,-8.36
601,-8.51
602,-8.62
603,-8.68
604,-8.74
605,-8.75
606,-8.73
607,-8.64
608,-8.54
609,-8.46
610,-8.45
611,-8.48
612,-8.58
613,-8.74
614,-9.00
615,-9.32
616,-9.74
617,-10.22
618,-10.73
619,-11.24
620,-11.76
621,-12.26
622,-12.73
623,-13.12
624,-13.40
625,-13.58
626,-13.68
627,-13.70
628,-13.67
629,-13.58
630,-13.45
631,-13.30
632,-13.13
633,-12.95
634,-12.77
635,-12.60
636,-12.41
637,-12.23
638,-12.07
639,-11.96
640,-11.86
641,-11.78
642,-11.66
643,-11.55
644,-11.45
645,-11.38
646,-11.22
647,-11.02
648,-10.80
649,-10.59
650,-10.33
651,-10.02
652,-9.62
653,-9.21
654,-8.77
655,-8.36
656,-7.95
657,-7.57
658,-7.19
659,-6.87
660,-6.59
661,-6.36
662,-6.12
663,-5.86
664,-5.56
665,-5.29
666,-5.05
667,-4.89
668,-4.78
669,-4.76
670,-4.76
671,-4.77
672,-4.76
673,-4.74
674,-4.65
675,-4.50
676,-4.29
677,-4.08
678,-3.91
679,-3.80
680,-3.69
681,-3.61
682,-3.57
683,-3.59
684,-3.65
685,-3.72
686,-3.81
687,-3.91
688,-4.07
689,-4.24
690,-4.48
691,-4.77
692,-5.13
693,-5.49
694,-5.82
695,-6.08
696,-6.32
697,-6.52
698,-6.69
699,-6.84
700,-7.02
701,-7.25
702,-7.55
703,-7.85
704,-8.11
705,-8.29
706,-8.39
707,-8.42
708,-8.37
709,-8.25
710,-8.08
711,-7.90
712,-7.72
713,-7.58
714,-7.45
715,-7.36
716,-7.30
717,-7.26
718,-7.24
719,-7.23
720,-7.20
721,-7.16
722,-7.10
723,-7.05
724,-7.03
725,-7.06
726,-7.09
727,-7.10
728,-7.09
729,-7.09
730,-7.06
731,-7.01
732,-6.91
733,-6.82
734,-6.74
735,-6.69
736,-6.65
737,-6.62
738,-6.60
739,-6.60
740,-6.61
741,-6.61
742,-6.60
743,-6.57
744,-6.55
745,-6.54
746,-6.55
747,-6.59
748,-6.65
749,-6.71
750,-6.73
751,-6.74
752,-6.74
753,-6.74
754,-6.69
755,-6.58
756,-6.43
757,-6.32
758,-6.20
759,-6.09
760,-5.94
761,-5.77
762,-5.55
763,-5.31
764,-5.06
765,-4.82
766,-4.61
767,-4.43
768,-4.29
769,-4.20
770,-4.17
771,-4.20
772,-4.26
773,-4.36
774,-4.46
775,-4.57
776,-4.73
777,-4.91
778,-5.09
779,-5.26
780,-5.47
781,-5.73
782,-6.08
783,-6.49
784,-6.99
785,-7.52
786,-8.07
787,-8.55
788,-8.92
789,-9.16
790,-9.29
791,-9.38
792,-9.45
793,-9.50
794,-9.56
795,-9.64
796,-9.78
797,-9.90
798,-9.94
799,-9.85
800,-9.68
801,-9.49
802,-9.32
803,-9.20
804,-9.14
805,-9.17
806,-9.31
807,-9.53
808,-9.77
809,-9.95
810,-10.03
811,-10.00
812,-9.86
813,-9.63
814,-9.28
815,-8.86
816,-8.42
817,-8.03
818,-7.68
819,-7.36
820,-7.06
821,-6.80
822,-6.55
823,-6.28
824,-5.96
825,-5.61
826,-5.23
827,-4.91
828,-4.62
829,-4.43
830,-4.28
831,-4.20
832,-4.14
833,-4.11
834,-4.12
835,-4.15
836,-4.17
837,-4.17
838,-4.18
839,-4.21
840,-4.23
841,-4.24
842,-4.23
843,-4.19
844,-4.14
845,-4.08
846,-4.03
847,-4.00
848,-3.98
849,-3.98
850,-4.00
851,-4.03
852,-4.07
853,-4.10
854,-4.10
855,-4.07
856,-4.02
857,-3.93
858,-3.81
859,-3.69
860,-3.59
861,-3.49
862,-3.43
863,-3.36
864,-3.33
865,-3.32
866,-3.36
867,-3.45
868,-3.59
869,-3.76
870,-4.01
871,-4.26
872,-4.54
873,-4.80
874,-5.11
875,-5.46
876,-5.87
877,-6.34
878,-6.92
879,-7.56
880,-8.26
881,-8.91
882,-9.54
883,-10.06
884,-10.51
885,-10.83
886,-11.05
887,-11.22
888,-11.43
889,-11.65
890,-11.91
891,-12.18
892,-12.50
893,-12.85
894,-13.21
895,-13.47
896,-13.65
897,-13.73
898,-13.78
899,-13.80
900,-13.83
901,-13.89
902,-14.01
903,-14.18
904,-14.39
905,-14.56
906,-14.71
907,-14.77
908,-14.72
909,-14.53
910,-14.28
911,-14.03
912,-13.85
913,-13.76
914,-13.78
915,-13.93
916,-14.18
917,-14.49
918,-14.78
919,-14.97
920,-15.01
921,-14.92
922,-14.72
923,-14.48
924,-14.23
925,-14.03
926,-13.85
927,-13.67
928,-13.45
929,-13.19
930,-12.89
931,-12.57
932,-12.16
933,-11.72
934,-11.28
935,-10.93
936,-10.62
937,-10.40
938,-10.22
939,-10.11
940,-9.99
941,-9.89
942,-9.75
943,-9.57
944,-9.32
945,-9.06
946,-8.83
947,-8.67
948,-8.55
949,-8.48
950,-8.47
951,-8.51
952,-8.61
953,-8.74
954,-8.90
955,-9.14
956,-9.42
957,-9.70
958,-9.95
959,-10.15
960,-10.31
961,-10.43
962,-10.51
963,-10.54
964,-10.52
965,-10.49
966,-10.48
967,-10.50
968,-10.58
969,-10.70
970,-10.85
971,-10.96
972,-11.05
973,-11.07
974,-11.05
975,-11.01
976,-11.02
977,-11.07
978,-11.18
979,-11.36
980,-11.64
981,-11.99
982,-12.40
983,-12.79
984,-13.15
985,-13.44
986,-13.68
987,-13.88
988,-14.10
989,-14.33
990,-14.59
991,-14.85
992,-15.18
993,-15.53
994,-15.89
995,-16.21
996,-16.54
997,-16.85
998,-17.20
999,-17.55
1000,-17.94
1001,-18.35
1002,-18.79
1003,-19.20
1004,-19.59
1005,-19.91
1006,-20.20
1007,-20.43
1008,-20.65
1009,-20.81
1010,-20.98
1011,-21.12
1012,-21.26
1013,-21.38
1014,-21.48
1015,-21.57
1016,-21.66
1017,-21.75
1018,-21.80
1019,-21.78
1020,-21.65
1021,-21.42
1022,-21.05
1023,-20.61
1024,-20.14
1025,-19.71
1026,-19.33
1027,-19.04
1028,-18.85
1029,-18.77
1030,-18.72
1031,-18.71
1032,-18.68
1033,-18.65
1034,-18.59
1035,-18.47
1036,-18.31
1037,-18.16
1038,-18.01
1039,-17.91
1040,-17.81
1041,-17.72
1042,-17.62
1043,-17.52
1044,-17.48
1045,-17.46
1046,-17.39
1047,-17.27
1048,-17.14
1049,-17.01
1050,-16.90
1051,-16.81
1052,-16.78
1053,-16.85
1054,-16.96
1055,-17.11
1056,-17.30
1057,-17.55
1058,-17.81
1059,-18.03
1060,-18.14
1061,-18.14
1062,-18.04
1063,-17.89
1064,-17.71
1065,-17.51
1066,-17.25
1067,-16.99
1068,-16.72
1069,-16.46
1070,-16.14
1071,-15.81
1072,-15.38
1073,-14.92
1074,-14.35
1075,-13.74
1076,-13.02
1077,-12.29
1078,-11.53
1079,-10.82
1080,-10.13
1081,-9.56
1082,-9.06
1083,-8.68
1084,-8.35
1085,-8.07
1086,-7.76
1087,-7.44
1088,-7.07
1089,-6.69
1090,-6.26
1091,-5.85
1092,-5.48
1093,-5.24
1094,-5.17
1095,-5.26
1096,-5.46
1097,-5.78
1098,-6.16
1099,-6.58
1100,-6.96
1101,-7.26
1102,-7.48
1103,-7.56
1104,-7.51
1105,-7.33
1106,-7.08
1107,-6.84
1108,-6.64
1109,-6.48
1110,-6.39
1111,-6.39
1112,-6.50
1113,-6.68
1114,-6.85
1115,-6.96
1116,-6.97
1117,-6.90
1118,-6.76
1119,-6.52
1120,-6.20
1121,-5.87
1122,-5.58
1123,-5.35
1124,-5.13
1125,-4.90
1126,-4.62
1127,-4.33
1128,-4.01
1129,-3.65
1130,-3.23
1131,-2.78
1132,-2.36
1133,-2.03
1134,-1.79
1135,-1.66
1136,-1.59
1137,-1.57
1138,-1.52
1139,-1.44
1140,-1.31
1141,-1.16
1142,-0.98
1143,-0.82
1144,-0.78
1145,-0.83
1146,-0.96
1147,-1.11
1148,-1.30
1149,-1.50
1150,-1.70
1151,-1.85
1152,-1.96
1153,-2.04
1154,-2.14
1155,-2.28
1156,-2.49
1157,-2.75
1158,-3.09
1159,-3.46
1160,-3.92
1161,-4.38
1162,-4.90
1163,-5.46
1164,-6.12
1165,-6.83
1166,-7.57
1167,-8.28
1168,-8.99
1169,-9.60
1170,-10.11
1171,-10.46
1172,-10.75
1173,-10.96
1174,-11.15
1175,-11.27
1176,-11.37
1177,-11.44
1178,-11.56
1179,-11.67
1180,-11.79
1181,-11.90
1182,-12.05
1183,-12.19
1184,-12.32
1185,-12.38
1186,-12.36
1187,-12.23
1188,-12.03
1189,-11.83
1190,-11.64
1191,-11.52
1192,-11.47
1193,-11.54
1194,-11.71
1195,-11.92
1196,-12.10
1197,-12.21
1198,-12.19
1199,-12.05
1200,-11.71
1201,-11.26
1202,-10.78
1203,-10.39
1204,-10.12
1205,-9.98
1206,-9.93
1207,-9.93
1208,-9.93
1209,-9.88
1210,-9.76
1211,-9.55
1212,-9.22
1213,-8.83
1214,-8.45
1215,-8.13
1216,-7.83
1217,-7.57
1218,-7.36
1219,-7.25
1220,-7.16
1221,-7.09
1222,-6.97
1223,-6.86
1224,-6.72
1225,-6.61
1226,-6.50
1227,-6.39
1228,-6.23
1229,-6.07
1230,-5.87
1231,-5.70
1232,-5.50
1233,-5.29
1234,-5.09
1235,-4.91
1236,-4.74
1237,-4.56
1238,-4.39
1239,-4.23
1240,-4.12
1241,-4.06
1242,-4.04
1243,-4.04
1244,-4.05
1245,-4.07
1246,-4.14
1247,-4.26
1248,-4.45
1249,-4.68
1250,-4.98
1251,-5.40
1252,-5.97
1253,-6.59
1254,-7.20
1255,-7.71
1256,-8.14
1257,-8.45
1258,-8.66
1259,-8.70
1260,-8.69
1261,-8.67
1262,-8.77
1263,-8.99
1264,-9.38
1265,-9.92
1266,-10.60
1267,-11.31
1268,-11.98
1269,-12.48
1270,-12.86
1271,-13.05
1272,-13.11
1273,-13.04
1274,-12.92
1275,-12.82
1276,-12.79
1277,-12.81
1278,-12.92
1279,-13.08
1280,-13.24
1281,-13.35
1282,-13.41
1283,-13.41
1284,-13.36
1285,-13.28
1286,-13.17
1287,-13.08
1288,-13.02
1289,-12.99
1290,-12.97
1291,-12.94
1292,-12.89
1293,-12.80
1294,-12.66
1295,-12.46
1296,-12.16
1297,-11.80
1298,-11.41
1299,-11.05
1300,-10.73
1301,-10.51
1302,-10.34
1303,-10.22
1304,-10.12
1305,-10.00
1306,-9.86
1307,-9.70
1308,-9.56
1309,-9.47
1310,-9.50
1311,-9.67
1312,-9.96
1313,-10.36
1314,-10.84
1315,-11.31
1316,-11.73
1317,-12.06
1318,-12.34
1319,-12.57
1320,-12.77
1321,-12.97
1322,-13.27
1323,-13.68
1324,-14.20
1325,-14.70
1326,-15.18
1327,-15.59
1328,-15.95
1329,-16.19
1330,-16.27
1331,-16.18
1332,-15.98
1333,-15.71
1334,-15.35
1335,-14.94
1336,-14.49
1337,-14.01
1338,-13.46
1339,-12.87
1340,-12.29
1341,-11.77
1342,-11.31
1343,-10.96
1344,-10.76
1345,-10.76
1346,-10.91
1347,-11.19
1348,-11.56
1349,-11.96
1350,-12.28
1351,-12.50
1352,-12.61
1353,-12.63
1354,-12.60
1355,-12.53
1356,-12.50
1357,-12.55
1358,-12.72
1359,-12.99
1360,-13.35
1361,-13.77
1362,-14.21
1363,-14.59
1364,-14.91
1365,-15.11
1366,-15.24
1367,-15.27
1368,-15.30
1369,-15.36
1370,-15.51
1371,-15.71
1372,-15.93
1373,-16.14
1374,-16.38
1375,-16.60
1376,-16.82
1377,-17.00
1378,-17.19
1379,-17.39
1380,-17.60
1381,-17.84
1382,-18.15
1383,-18.51
1384,-18.85
1385,-19.13
1386,-19.34
1387,-19.49
1388,-19.54
1389,-19.49
1390,-19.32
1391,-19.04
1392,-18.67
1393,-18.23
1394,-17.75
1395,-17.30
1396,-16.88
1397,-16.53
1398,-16.24
1399,-16.01
1400,-15.77
1401,-15.49
1402,-15.08
1403,-14.62
1404,-14.10
1405,-13.60
1406,-13.05
1407,-12.54
1408,-12.00
1409,-11.54
1410,-11.08
1411,-10.61
1412,-10.09
1413,-9.60
1414,-9.09
1415,-8.67
1416,-8.26
1417,-7.90
1418,-7.58
1419,-7.33
1420,-7.07
1421,-6.82
1422,-6.50
1423,-6.16
1424,-5.75
1425,-5.34
1426,-4.91
1427,-4.52
1428,-4.20
1429,-3.96
1430,-3.78
1431,-3.66
1432,-3.64
1433,-3.70
1434,-3.78
1435,-3.88
1436,-4.03
1437,-4.30
1438,-4.66
1439,-5.10
1440,-5.63
1441,-6.20
1442,-6.78
1443,-7.26
1444,-7.59
1445,-7.73
1446,-7.75
1447,-7.71
1448,-7.65
1449,-7.59
1450,-7.58
1451,-7.62
1452,-7.74
1453,-7.90
1454,-8.08
1455,-8.25
1456,-8.41
1457,-8.53
1458,-8.63
1459,-8.71
1460,-8.80
1461,-8.92
1462,-9.06
1463,-9.21
1464,-9.38
1465,-9.58
1466,-9.86
1467,-10.15
1468,-10.44
1469,-10.70
1470,-10.97
1471,-11.23
1472,-11.51
1473,-11.76
1474,-12.05
1475,-12.33
1476,-12.69
1477,-13.10
1478,-13.60
1479,-14.10
1480,-14.60
1481,-15.01
1482,-15.36
1483,-15.68
1484,-16.01
1485,-16.33
1486,-16.63
1487,-16.88
1488,-17.05
1489,-17.14
1490,-17.12
1491,-16.98
1492,-16.72
1493,-16.35
1494,-15.91
1495,-15.50
1496,-15.15
1497,-14.92
1498,-14.74
1499,-14.61
1500,-14.47
1501,-14.34
1502,-14.08
1503,-13.73
1504,-13.17
1505,-12.48
1506,-11.67
1507,-10.86
1508,-10.14
1509,-9.61
1510,-9.25
1511,-9.05
1512,-8.95
1513,-8.93
1514,-8.93
1515,-8.94
1516,-8.90
1517,-8.86
1518,-8.77
1519,-8.65
1520,-8.49
1521,-8.32
1522,-8.14
1523,-7.96
1524,-7.74
1525,-7.51
1526,-7.28
1527,-7.09
1528,-6.96
1529,-6.87
1530,-6.84
1531,-6.87
1532,-6.96
1533,-7.13
1534,-7.42
1535,-7.84
1536,-8.39
1537,-9.00
1538,-9.69
1539,-10.40
1540,-11.17
1541,-11.91
1542,-12.60
1543,-13.19
1544,-13.75
1545,-14.27
1546,-14.79
1547,-15.27
1548,-15.70
1549,-16.05
1550,-16.33
1551,-16.47
1552,-16.53
1553,-16.46
1554,-16.29
1555,-16.04
1556,-15.79
1557,-15.54
1558,-15.31
1559,-15.11
1560,-14.92
1561,-14.81
1562,-14.74
1563,-14.69
1564,-14.60
1565,-14.49
1566,-14.32
1567,-14.14
1568,-13.97
1569,-13.82
1570,-13.70
1571,-13.63
1572,-13.63
1573,-13.69
1574,-13.83
1575,-13.98
1576,-14.11
1577,-14.20
1578,-14.29
1579,-14.44
1580,-14.63
1581,-14.81
1582,-14.95
1583,-15.05
1584,-15.08
1585,-15.01
1586,-14.85
1587,-14.63
1588,-14.33
1589,-14.00
1590,-13.63
1591,-13.28
1592,-12.96
1593,-12.70
1594,-12.43
1595,-12.15
1596,-11.80
1597,-11.41
1598,-10.96
1599,-10.51
1600,-9.99
1601,-9.49
1602,-8.98
1603,-8.55
1604,-8.16
1605,-7.84
1606,-7.51
1607,-7.21
1608,-6.86
1609,-6.49
1610,-5.99
1611,-5.42
1612,-4.72
1613,-4.02
1614,-3.24
1615,-2.48
1616,-1.72
1617,-1.11
1618,-0.60
1619,-0.20
1620,0.21
1621,0.54
1622,0.86
1623,1.14
1624,1.52
1625,1.95
1626,2.43
1627,2.84
1628,3.20
1629,3.49
1630,3.72
1631,3.87
1632,3.96
1633,4.01
1634,4.07
1635,4.14
1636,4.28
1637,4.46
1638,4.69
1639,4.93
1640,5.17
1641,5.40
1642,5.65
1643,5.89
1644,6.09
1645,6.22
1646,6.25
1647,6.23
1648,6.13
1649,5.99
1650,5.76
1651,5.49
1652,5.20
1653,4.91
1654,4.57
1655,4.20
1656,3.76
1657,3.35
1658,2.94
1659,2.57
1660,2.17
1661,1.79
1662,1.42
1663,1.10
1664,0.77
1665,0.45
1666,0.11
1667,-0.21
1668,-0.52
1669,-0.76
1670,-0.89
1671,-0.89
1672,-0.79
1673,-0.60
1674,-0.38
1675,-0.13
1676,0.13
1677,0.37
1678,0.55
1679,0.66
1680,0.76
1681,0.84
1682,0.92
1683,0.98
1684,1.02
1685,0.98
1686,0.88
1687,0.72
1688,0.58
1689,0.50
1690,0.46
1691,0.46
1692,0.49
1693,0.55
1694,0.64
1695,0.74
1696,0.79
1697,0.76
1698,0.64
1699,0.46
1700,0.24
1701,0.01
1702,-0.28
1703,-0.58
1704,-0.83
1705,-1.01
1706,-1.16
1707,-1.27
1708,-1.33
1709,-1.30
1710,-1.22
1711,-1.11
1712,-1.03
1713,-0.98
1714,-0.98
1715,-1.06
1716,-1.21
1717,-1.40
1718,-1.62
1719,-1.82
1720,-1.96
1721,-1.99
1722,-1.95
1723,-1.84
1724,-1.72
1725,-1.64
1726,-1.63
1727,-1.67
1728,-1.79
1729,-1.98
1730,-2.24
1731,-2.53
1732,-2.80
1733,-2.98
1734,-3.11
1735,-3.15
1736,-3.13
1737,-3.06
1738,-3.07
1739,-3.14
1740,-3.29
1741,-3.46
1742,-3.73
1743,-4.11
1744,-4.60
1745,-5.14
1746,-5.71
1747,-6.24
1748,-6.72
1749,-7.04
1750,-7.20
1751,-7.23
1752,-7.20
1753,-7.16
1754,-7.13
1755,-7.13
1756,-7.21
1757,-7.41
1758,-7.73
1759,-8.06
1760,-8.34
1761,-8.52
1762,-8.61
1763,-8.61
1764,-8.51
1765,-8.36
1766,-8.22
1767,-8.16
1768,-8.16
1769,-8.27
1770,-8.44
1771,-8.61
1772,-8.72
1773,-8.74
1774,-8.64
1775,-8.46
1776,-8.18
1777,-7.82
1778,-7.44
1779,-7.11
1780,-6.83
1781,-6.60
1782,-6.38
1783,-6.17
1784,-5.96
1785,-5.72
1786,-5.46
1787,-5.18
1788,-4.95
1789,-4.84
1790,-4.84
1791,-4.94
1792,-5.07
1793,-5.23
1794,-5.38
1795,-5.53
1796,-5.65
1797,-5.71
1798,-5.71
1799,-5.71
1800,-5.73
1801,-5.79
1802,-5.87
1803,-5.94
1804,-5.97
1805,-5.97
1806,-5.94
1807,-5.88
1808,-5.78
1809,-5.67
1810,-5.57
1811,-5.51
1812,-5.46
1813,-5.44
1814,-5.43
1815,-5.41
1816,-5.26
1817,-5.01
1818,-4.65
1819,-4.22
1820,-3.73
1821,-3.23
1822,-2.76
1823,-2.40
1824,-2.14
1825,-2.00
1826,-1.97
1827,-2.07
1828,-2.25
1829,-2.46
1830,-2.65
1831,-2.80
1832,-2.91
1833,-3.00
1834,-3.07
1835,-3.15
1836,-3.32
1837,-3.58
1838,-3.95
1839,-4.36
1840,-4.81
1841,-5.22
1842,-5.62
1843,-5.94
1844,-6.19
1845,-6.36
1846,-6.53
1847,-6.70
1848,-6.87
1849,-7.05
1850,-7.29
1851,-7.55
1852,-7.81
1853,-8.02
1854,-8.20
1855,-8.37
1856,-8.54
1857,-8.73
1858,-8.91
1859,-9.06
1860,-9.16
1861,-9.22
1862,-9.26
1863,-9.29
1864,-9.30
1865,-9.30
1866,-9.32
1867,-9.35
1868,-9.36
1869,-9.31
1870,-9.15
1871,-8.90
1872,-8.63
1873,-8.36
1874,-8.08
1875,-7.82
1876,-7.55
1877,-7.32
1878,-7.09
1879,-6.86
1880,-6.61
1881,-6.39
1882,-6.14
1883,-5.94
1884,-5.75
1885,-5.58
1886,-5.36
1887,-5.12
1888,-4.77
1889,-4.33
1890,-3.74
1891,-3.06
1892,-2.33
1893,-1.71
1894,-1.19
1895,-0.81
1896,-0.53
1897,-0.33
1898,-0.16
1899,-0.02
1900,0.14
1901,0.28
1902,0.42
1903,0.50
1904,0.56
1905,0.59
1906,0.61
1907,0.61
1908,0.55
1909,0.43
1910,0.27
1911,0.10
1912,-0.12
1913,-0.35
1914,-0.60
1915,-0.86
1916,-1.19
1917,-1.54
1918,-1.89
1919,-2.18
1920,-2.47
1921,-2.75
1922,-3.09
1923,-3.44
1924,-3.84
1925,-4.22
1926,-4.59
1927,-4.92
1928,-5.23
1929,-5.49
1930,-5.71
1931,-5.88
1932,-6.04
1933,-6.18
1934,-6.34
1935,-6.52
1936,-6.72
1937,-6.92
1938,-7.13
1939,-7.30
1940,-7.49
1941,-7.66
1942,-7.80
1943,-7.92
1944,-8.08
1945,-8.27
1946,-8.51
1947,-8.74
1948,-9.01
1949,-9.30
1950,-9.62
1951,-9.92
1952,-10.19
1953,-10.42
1954,-10.64
1955,-10.81
1956,-10.97
1957,-11.11
1958,-11.28
1959,-11.49
1960,-11.73
1961,-11.93
1962,-12.12
1963,-12.26
1964,-12.39
1965,-12.44
1966,-12.41
1967,-12.31
1968,-12.24
1969,-12.21
1970,-12.19
1971,-12.17
1972,-12.15
1973,-12.15
1974,-12.13
1975,-12.08
1976,-11.96
1977,-11.74
1978,-11.46
1979,-11.20
1980,-10.97
1981,-10.80
1982,-10.61
1983,-10.42
1984,-10.19
1985,-9.93
1986,-9.56
1987,-9.12
1988,-8.64
1989,-8.22
1990,-7.87
1991,-7.61
1992,-7.43
1993,-7.32
1994,-7.20
1995,-7.10
1996,-6.96
1997,-6.82
1998,-6.64
1999,-6.43
2000,-6.21
2001,-6.06
2002,-6.01
2003,-6.04
2004,-6.09
2005,-6.13
2006,-6.16
2007,-6.19
2008,-6.17
2009,-6.11
2010,-6.05
2011,-6.00
2012,-6.02
2013,-6.08
2014,-6.22
2015,-6.45
2016,-6.78
2017,-7.17
2018,-7.61
2019,-8.03
2020,-8.40
2021,-8.72
2022,-9.03
2023,-9.28
2024,-9.51
2025,-9.69
2026,-9.85
2027,-9.99
2028,-10.13
2029,-10.22
2030,-10.24
2031,-10.18
2032,-10.07
2033,-9.96
2034,-9.84
2035,-9.72
2036,-9.57
2037,-9.39
2038,-9.19
2039,-8.99
2040,-8.77
2041,-8.52
2042,-8.27
2043,-8.06
2044,-7.93
2045,-7.93
2046,-8.05
2047,-8.22
2048,-8.44
2049,-8.65
2050,-8.86
2051,-9.00
2052,-9.07
2053,-9.09
2054,-9.14
2055,-9.28
2056,-9.55
2057,-9.91
2058,-10.35
2059,-10.83
2060,-11.31
2061,-11.73
2062,-12.05
2063,-12.22
2064,-12.28
2065,-12.25
2066,-12.14
2067,-11.99
2068,-11.85
2069,-11.72
2070,-11.60
2071,-11.50
2072,-11.39
2073,-11.27
2074,-11.08
2075,-10.86
2076,-10.60
2077,-10.33
2078,-9.99
2079,-9.61
2080,-9.22
2081,-8.88
2082,-8.63
2083,-8.46
2084,-8.35
2085,-8.33
2086,-8.35
2087,-8.39
2088,-8.38
2089,-8.27
2090,-8.03
2091,-7.73
2092,-7.41
2093,-7.15
2094,-6.93
2095,-6.75
2096,-6.60
2097,-6.48
2098,-6.39
2099,-6.27
2100,-6.10
2101,-5.89
2102,-5.69
2103,-5.56
2104,-5.55
2105,-5.67
2106,-5.91
2107,-6.25
2108,-6.62
2109,-6.99
2110,-7.29
2111,-7.49
2112,-7.61
2113,-7.67
2114,-7.70
2115,-7.72
2116,-7.77
2117,-7.87
2118,-7.98
2119,-8.06
2120,-8.10
2121,-8.04
2122,-7.90
2123,-7.71
2124,-7.53
2125,-7.41
2126,-7.39
2127,-7.47
2128,-7.65
2129,-7.90
2130,-8.16
2131,-8.40
2132,-8.60
2133,-8.77
2134,-8.98
2135,-9.21
2136,-9.46
2137,-9.69
2138,-9.96
2139,-10.25
2140,-10.57
2141,-10.86
2142,-11.15
2143,-11.44
2144,-11.80
2145,-12.21
2146,-12.67
2147,-13.12
2148,-13.53
2149,-13.83
2150,-13.99
2151,-13.99
2152,-13.87
2153,-13.65
2154,-13.36
2155,-13.07
2156,-12.80
2157,-12.56
2158,-12.31
2159,-12.02
2160,-11.69
2161,-11.32
2162,-10.90
2163,-10.46
2164,-10.04
2165,-9.74
2166,-9.55
2167,-9.51
2168,-9.56
2169,-9.66
2170,-9.72
2171,-9.76
2172,-9.77
2173,-9.81
2174,-9.80
2175,-9.76
2176,-9.64
2177,-9.53
2178,-9.42
2179,-9.33
2180,-9.22
2181,-9.11
2182,-9.01
2183,-8.96
2184,-8.91
2185,-8.87
2186,-8.76
2187,-8.58
2188,-8.29
2189,-7.92
2190,-7.44
2191,-6.91
2192,-6.30
2193,-5.71
2194,-5.15
2195,-4.71
2196,-4.33
2197,-4.03
2198,-3.71
2199,-3.40
2200,-3.03
2201,-2.62
2202,-2.14
2203,-1.61
2204,-1.00
2205,-0.39
2206,0.25
2207,0.84
2208,1.41
2209,1.91
2210,2.33
2211,2.63
2212,2.82
2213,2.90
2214,2.94
2215,2.92
2216,2.91
2217,2.91
2218,2.94
2219,2.98
2220,2.94
2221,2.83
2222,2.63
2223,2.37
2224,2.00
2225,1.53
2226,0.96
2227,0.40
2228,-0.15
2229,-0.62
2230,-1.05
2231,-1.43
2232,-1.81
2233,-2.17
2234,-2.62
2235,-3.08
2236,-3.62
2237,-4.18
2238,-4.78
2239,-5.33
2240,-5.82
2241,-6.21
2242,-6.53
2243,-6.75
2244,-6.90
2245,-6.96
2246,-6.99
2247,-7.00
2248,-7.05
2249,-7.11
2250,-7.21
2251,-7.32
2252,-7.42
2253,-7.49
2254,-7.49
2255,-7.44
2256,-7.30
2257,-7.10
2258,-6.83
2259,-6.55
2260,-6.32
2261,-6.17
2262,-6.10
2263,-6.07
2264,-6.06
2265,-6.03
2266,-5.99
2267,-5.93
2268,-5.84
2269,-5.74
2270,-5.68
2271,-5.68
2272,-5.77
2273,-5.95
2274,-6.20
2275,-6.49
2276,-6.85
2277,-7.21
2278,-7.53
2279,-7.74
2280,-7.85
2281,-7.87
2282,-7.84
2283,-7.77
2284,-7.71
2285,-7.68
2286,-7.70
2287,-7.77
2288,-7.84
2289,-7.90
2290,-7.92
2291,-7.90
2292,-7.83
2293,-7.74
2294,-7.61
2295,-7.43
2296,-7.22
2297,-7.01
2298,-6.84
2299,-6.72
2300,-6.61
2301,-6.53
2302,-6.47
2303,-6.44
2304,-6.42
2305,-6.39
2306,-6.38
2307,-6.39
2308,-6.47
2309,-6.61
2310,-6.87
2311,-7.19
2312,-7.58
2313,-8.00
2314,-8.45
2315,-8.85
2316,-9.23
2317,-9.57
2318,-9.98
2319,-10.44
2320,-11.00
2321,-11.56
2322,-12.14
2323,-12.66
2324,-13.15
2325,-13.50
2326,-13.73
2327,-13.81
2328,-13.80
2329,-13.73
2330,-13.66
2331,-13.59
2332,-13.57
2333,-13.63
2334,-13.78
2335,-13.99
2336,-14.22
2337,-14.43
2338,-14.61
2339,-14.73
2340,-14.79
2341,-14.79
2342,-14.73
2343,-14.66
2344,-14.52
2345,-14.35
2346,-14.11
2347,-13.81
2348,-13.45
2349,-13.07
2350,-12.63
2351,-12.17
2352,-11.65
2353,-11.14
2354,-10.67
2355,-10.33
2356,-10.05
2357,-9.83
2358,-9.58
2359,-9.38
2360,-9.22
2361,-9.11
2362,-8.98
2363,-8.84
2364,-8.67
2365,-8.53
2366,-8.38
2367,-8.25
2368,-8.08
2369,-7.90
2370,-7.70
2371,-7.49
2372,-7.28
2373,-7.06
2374,-6.87
2375,-6.73
2376,-6.61
2377,-6.52
2378,-6.47
2379,-6.46
2380,-6.55
2381,-6.69
2382,-6.90
2383,-7.13
2384,-7.41
2385,-7.71
2386,-8.01
2387,-8.27
2388,-8.51
2389,-8.75
2390,-9.00
2391,-9.27
2392,-9.54
2393,-9.77
2394,-9.99
2395,-10.13
2396,-10.22
2397,-10.21
2398,-10.16
2399,-10.09
2400,-10.04
2401,-10.01
2402,-10.00
2403,-10.00
2404,-9.99
2405,-9.94
2406,-9.79
2407,-9.55
2408,-9.25
2409,-8.99
2410,-8.78
2411,-8.66
2412,-8.61
2413,-8.65
2414,-8.74
2415,-8.84
2416,-8.86
2417,-8.77
2418,-8.60
2419,-8.38
2420,-8.15
2421,-7.94
2422,-7.83
2423,-7.85
2424,-8.00
2425,-8.22
2426,-8.47
2427,-8.64
2428,-8.67
2429,-8.57
2430,-8.35
2431,-8.04
2432,-7.65
2433,-7.23
2434,-6.86
2435,-6.65
2436,-6.60
2437,-6.66
2438,-6.80
2439,-6.98
2440,-7.18
2441,-7.39
2442,-7.59
2443,-7.77
2444,-7.93
2445,-8.04
2446,-8.14
2447,-8.23
2448,-8.32
2449,-8.41
2450,-8.49
2451,-8.55
2452,-8.58
2453,-8.54
2454,-8.48
2455,-8.38
2456,-8.30
2457,-8.28
2458,-8.30
2459,-8.37
2460,-8.44
2461,-8.51
2462,-8.52
2463,-8.45
2464,-8.18
2465,-7.74
2466,-7.12
2467,-6.42
2468,-5.62
2469,-4.82
2470,-4.03
2471,-3.36
2472,-2.76
2473,-2.27
2474,-1.79
2475,-1.36
2476,-0.92
2477,-0.49
2478,0.03
2479,0.61
2480,1.28
2481,1.90
2482,2.47
2483,2.94
2484,3.34
2485,3.62
2486,3.82
2487,3.94
2488,4.06
2489,4.23
2490,4.46
2491,4.71
2492,4.93
2493,5.08
2494,5.13
2495,5.05
2496,4.80
2497,4.39
2498,3.81
2499,3.15
2500,2.46
2501,1.84
2502,1.27
2503,0.75
2504,0.18
2505,-0.43
2506,-1.14
2507,-1.90
2508,-2.78
2509,-3.70
2510,-4.65
2511,-5.45
2512,-6.07
2513,-6.42
2514,-6.55
2515,-6.50
2516,-6.37
2517,-6.17
2518,-6.00
2519,-5.84
2520,-5.74
2521,-5.68
2522,-5.65
2523,-5.62
2524,-5.60
2525,-5.62
2526,-5.71
2527,-5.89
2528,-6.15
2529,-6.45
2530,-6.76
2531,-6.99
2532,-7.16
2533,-7.27
2534,-7.39
2535,-7.50
2536,-7.61
2537,-7.77
2538,-8.00
2539,-8.30
2540,-8.59
2541,-8.77
2542,-8.82
2543,-8.73
2544,-8.50
2545,-8.14
2546,-7.68
2547,-7.19
2548,-6.77
2549,-6.44
2550,-6.18
2551,-6.02
2552,-5.94
2553,-5.98
2554,-6.04
2555,-6.10
2556,-6.04
2557,-5.87
2558,-5.51
2559,-5.04
2560,-4.50
2561,-3.96
2562,-3.43
2563,-2.95
2564,-2.57
2565,-2.34
2566,-2.20
2567,-2.14
2568,-2.05
2569,-1.97
2570,-1.85
2571,-1.68
2572,-1.41
2573,-1.12
2574,-0.81
2575,-0.54
2576,-0.29
2577,-0.09
2578,0.06
2579,0.14
2580,0.21
2581,0.29
2582,0.40
2583,0.53
2584,0.66
2585,0.81
2586,0.96
2587,1.08
2588,1.15
2589,1.15
2590,1.09
2591,0.99
2592,0.89
2593,0.81
2594,0.73
2595,0.65
2596,0.53
2597,0.38
2598,0.20
2599,0.02
2600,-0.14
2601,-0.26
2602,-0.34
2603,-0.36
2604,-0.37
2605,-0.41
2606,-0.56
2607,-0.83
2608,-1.22
2609,-1.66
2610,-2.17
2611,-2.70
2612,-3.27
2613,-3.79
2614,-4.30
2615,-4.73
2616,-5.18
2617,-5.58
2618,-5.97
2619,-6.26
2620,-6.52
2621,-6.71
2622,-6.87
2623,-6.99
2624,-7.09
2625,-7.16
2626,-7.26
2627,-7.34
2628,-7.45
2629,-7.56
2630,-7.69
2631,-7.81
2632,-7.90
2633,-7.97
2634,-8.00
2635,-8.00
2636,-7.93
2637,-7.82
2638,-7.68
2639,-7.52
2640,-7.34
2641,-7.13
2642,-6.92
2643,-6.74
2644,-6.59
2645,-6.48
2646,-6.38
2647,-6.32
2648,-6.30
2649,-6.30
2650,-6.29
2651,-6.27
2652,-6.23
2653,-6.17
2654,-6.06
2655,-5.92
2656,-5.78
2657,-5.65
2658,-5.52
2659,-5.42
2660,-5.33
2661,-5.28
2662,-5.17
2663,-4.96
2664,-4.67
2665,-4.34
2666,-3.99
2667,-3.63
2668,-3.27
2669,-3.01
2670,-2.87
2671,-2.88
2672,-2.96
2673,-3.07
2674,-3.13
2675,-3.13
2676,-3.06
2677,-2.97
2678,-2.88
2679,-2.82
2680,-2.78
2681,-2.76
2682,-2.76
2683,-2.76
2684,-2.70
2685,-2.56
2686,-2.33
2687,-2.09
2688,-1.85
2689,-1.64
2690,-1.50
2691,-1.47
2692,-1.53
2693,-1.63
2694,-1.70
2695,-1.72
2696,-1.71
2697,-1.68
2698,-1.66
2699,-1.66
2700,-1.69
2701,-1.77
2702,-1.95
2703,-2.25
2704,-2.65
2705,-3.07
2706,-3.49
2707,-3.86
2708,-4.23
2709,-4.59
2710,-4.94
2711,-5.23
2712,-5.48
2713,-5.68
2714,-5.89
2715,-6.13
2716,-6.41
2717,-6.67
2718,-6.90
2719,-7.07
2720,-7.23
2721,-7.34
2722,-7.42
2723,-7.40
2724,-7.35
2725,-7.32
2726,-7.35
2727,-7.47
2728,-7.64
2729,-7.87
2730,-8.12
2731,-8.39
2732,-8.61
2733,-8.74
2734,-8.74
2735,-8.62
2736,-8.38
2737,-8.09
2738,-7.77
2739,-7.47
2740,-7.17
2741,-6.88
2742,-6.58
2743,-6.29
2744,-5.94
2745,-5.56
2746,-5.16
2747,-4.80
2748,-4.49
2749,-4.22
2750,-4.00
2751,-3.88
2752,-3.88
2753,-4.04
2754,-4.31
2755,-4.68
2756,-5.11
2757,-5.55
2758,-5.96
2759,-6.30
2760,-6.55
2761,-6.66
2762,-6.64
2763,-6.51
2764,-6.39
2765,-6.35
2766,-6.40
2767,-6.53
2768,-6.72
2769,-6.94
2770,-7.10
2771,-7.17
2772,-7.10
2773,-6.91
2774,-6.65
2775,-6.36
2776,-6.03
2777,-5.70
2778,-5.40
2779,-5.17
2780,-4.98
2781,-4.83
2782,-4.68
2783,-4.57
2784,-4.51
2785,-4.50
2786,-4.53
2787,-4.60
2788,-4.73
2789,-4.91
2790,-5.08
2791,-5.23
2792,-5.39
2793,-5.52
2794,-5.66
2795,-5.78
2796,-5.92
2797,-6.12
2798,-6.42
2799,-6.74
2800,-7.09
2801,-7.44
2802,-7.84
2803,-8.22
2804,-8.54
2805,-8.74
2806,-8.89
2807,-9.03
2808,-9.19
2809,-9.37
2810,-9.56
2811,-9.76
2812,-10.02
2813,-10.31
2814,-10.63
2815,-10.93
2816,-11.22
2817,-11.48
2818,-11.70
2819,-11.86
2820,-11.96
2821,-12.01
2822,-12.02
2823,-12.00
2824,-11.94
2825,-11.84
2826,-11.73
2827,-11.60
2828,-11.50
2829,-11.41
2830,-11.34
2831,-11.25
2832,-11.12
2833,-11.01
2834,-10.89
2835,-10.78
2836,-10.63
2837,-10.45
2838,-10.28
2839,-10.13
2840,-9.97
2841,-9.80
2842,-9.63
2843,-9.51
2844,-9.43
2845,-9.38
2846,-9.32
2847,-9.26
2848,-9.19
2849,-9.11
2850,-8.99
2851,-8.81
2852,-8.55
2853,-8.23
2854,-7.84
2855,-7.42
2856,-6.99
2857,-6.61
2858,-6.28
2859,-6.02
2860,-5.77
2861,-5.53
2862,-5.31
2863,-5.14
2864,-5.00
2865,-4.88
2866,-4.76
2867,-4.64
2868,-4.54
2869,-4.49
2870,-4.46
2871,-4.46
2872,-4.48
2873,-4.48
2874,-4.46
2875,-4.43
2876,-4.40
2877,-4.39
2878,-4.43
2879,-4.55
2880,-4.78
2881,-5.14
2882,-5.58
2883,-6.03
2884,-6.48
2885,-6.83
2886,-7.10
2887,-7.23
2888,-7.29
2889,-7.28
2890,-7.26
2891,-7.29
2892,-7.40
2893,-7.57
2894,-7.80
2895,-8.01
2896,-8.19
2897,-8.29
2898,-8.35
2899,-8.41
2900,-8.54
2901,-8.74
2902,-9.02
2903,-9.37
2904,-9.83
2905,-10.37
2906,-10.95
2907,-11.44
2908,-11.85
2909,-12.14
2910,-12.37
2911,-12.54
2912,-12.67
2913,-12.79
2914,-12.95
2915,-13.15
2916,-13.39
2917,-13.60
2918,-13.80
2919,-14.00
2920,-14.21
2921,-14.43
2922,-14.64
2923,-14.85
2924,-15.04
2925,-15.16
2926,-15.17
2927,-15.06
2928,-14.80
2929,-14.41
2930,-13.92
2931,-13.42
2932,-12.92
2933,-12.50
2934,-12.17
2935,-11.95
2936,-11.76
2937,-11.59
2938,-11.38
2939,-11.17
2940,-10.85
2941,-10.45
2942,-9.88
2943,-9.23
2944,-8.51
2945,-7.80
2946,-7.05
2947,-6.32
2948,-5.62
2949,-5.02
2950,-4.52
2951,-4.19
2952,-3.93
2953,-3.78
2954,-3.60
2955,-3.41
2956,-3.10
2957,-2.69
2958,-2.17
2959,-1.59
2960,-1.02
2961,-0.54
2962,-0.18
2963,0.01
2964,0.06
2965,0.00
2966,-0.11
2967,-0.24
2968,-0.37
2969,-0.47
2970,-0.56
2971,-0.65
2972,-0.80
2973,-0.99
2974,-1.25
2975,-1.55
2976,-1.94
2977,-2.37
2978,-2.83
2979,-3.25
2980,-3.67
2981,-4.07
2982,-4.49
2983,-4.91
2984,-5.35
2985,-5.79
2986,-6.24
2987,-6.62
2988,-6.94
2989,-7.18
2990,-7.35
2991,-7.42
2992,-7.43
2993,-7.36
2994,-7.29
2995,-7.26
2996,-7.29
2997,-7.37
2998,-7.51
2999,-7.66
3000,-7.80
3001,-7.89
3002,-7.93
3003,-7.94
3004,-8.00
3005,-8.11
3006,-8.35
3007,-8.64
3008,-8.96
3009,-9.29
3010,-9.64
3011,-9.96
3012,-10.25
3013,-10.48
3014,-10.73
3015,-11.02
3016,-11.37
3017,-11.76
3018,-12.21
3019,-12.64
3020,-13.05
3021,-13.37
3022,-13.65
3023,-13.85
3024,-13.99
3025,-14.02
3026,-13.95
3027,-13.82
3028,-13.70
3029,-13.58
3030,-13.44
3031,-13.29
3032,-13.18
3033,-13.12
3034,-13.06
3035,-12.99
3036,-12.85
3037,-12.67
3038,-12.44
3039,-12.14
3040,-11.79
3041,-11.43
3042,-11.08
3043,-10.81
3044,-10.66
3045,-10.63
3046,-10.69
3047,-10.79
3048,-10.87
3049,-10.93
3050,-10.95
3051,-10.93
3052,-10.85
3053,-10.73
3054,-10.58
3055,-10.43
3056,-10.28
3057,-10.16
3058,-10.09
3059,-10.06
3060,-10.06
3061,-10.06
3062,-10.04
3063,-9.95
3064,-9.77
3065,-9.56
3066,-9.39
3067,-9.32
3068,-9.38
3069,-9.56
3070,-9.88
3071,-10.30
3072,-10.75
3073,-11.15
3074,-11.46
3075,-11.66
3076,-11.76
3077,-11.77
3078,-11.81
3079,-11.89
3080,-12.06
3081,-12.29
3082,-12.61
3083,-12.92
3084,-13.24
3085,-13.50
3086,-13.76
3087,-13.98
3088,-14.22
3089,-14.48
3090,-14.82
3091,-15.23
3092,-15.73
3093,-16.27
3094,-16.83
3095,-17.36
3096,-17.85
3097,-18.26
3098,-18.64
3099,-18.96
3100,-19.27
3101,-19.56
3102,-19.86
3103,-20.13
3104,-20.36
3105,-20.50
3106,-20.58
3107,-20.57
3108,-20.51
3109,-20.39
3110,-20.22
3111,-20.04
3112,-19.85
3113,-19.68
3114,-19.49
3115,-19.29
3116,-19.05
3117,-18.78
3118,-18.48
3119,-18.17
3120,-17.80
3121,-17.41
3122,-16.98
3123,-16.60
3124,-16.29
3125,-16.09
3126,-15.93
3127,-15.82
3128,-15.72
3129,-15.64
3130,-15.52
3131,-15.35
3132,-15.10
3133,-14.81
3134,-14.47
3135,-14.14
3136,-13.84
3137,-13.61
3138,-13.44
3139,-13.33
3140,-13.21
3141,-13.11
3142,-12.98
3143,-12.84
3144,-12.63
3145,-12.37
3146,-12.06
3147,-11.76
3148,-11.47
3149,-11.22
3150,-10.96
3151,-10.73
3152,-10.46
3153,-10.18
3154,-9.85
3155,-9.50
3156,-9.07
3157,-8.61
3158,-8.09
3159,-7.62
3160,-7.16
3161,-6.74
3162,-6.37
3163,-6.08
3164,-5.83
3165,-5.61
3166,-5.34
3167,-5.05
3168,-4.71
3169,-4.39
3170,-4.07
3171,-3.85
3172,-3.68
3173,-3.63
3174,-3.64
3175,-3.68
3176,-3.70
3177,-3.70
3178,-3.68
3179,-3.65
3180,-3.60
3181,-3.53
3182,-3.50
3183,-3.52
3184,-3.63
3185,-3.81
3186,-4.08
3187,-4.41
3188,-4.78
3189,-5.13
3190,-5.47
3191,-5.76
3192,-6.03
3193,-6.26
3194,-6.50
3195,-6.73
3196,-7.00
3197,-7.26
3198,-7.52
3199,-7.72
3200,-7.87
3201,-7.97
3202,-8.01
3203,-8.00
3204,-7.96
3205,-7.90
3206,-7.85
3207,-7.86
3208,-7.88
3209,-7.93
3210,-7.93
3211,-7.87
3212,-7.71
3213,-7.45
3214,-7.07
3215,-6.64
3216,-6.11
3217,-5.55
3218,-4.94
3219,-4.38
3220,-3.88
3221,-3.43
3222,-2.98
3223,-2.59
3224,-2.22
3225,-1.92
3226,-1.61
3227,-1.29
3228,-1.00
3229,-0.79
3230,-0.63
3231,-0.52
3232,-0.45
3233,-0.45
3234,-0.52
3235,-0.65
3236,-0.81
3237,-1.01
3238,-1.27
3239,-1.57
3240,-1.89
3241,-2.14
3242,-2.23
3243,-2.14
3244,-1.91
3245,-1.58
3246,-1.16
3247,-0.72
3248,-0.28
3249,0.08
3250,0.36
3251,0.56
3252,0.72
3253,0.89
3254,1.13
3255,1.45
3256,1.88
3257,2.40
3258,2.94
3259,3.45
3260,3.88
3261,4.17
3262,4.33
3263,4.36
3264,4.30
3265,4.20
3266,4.10
3267,4.01
3268,3.96
3269,3.93
3270,3.91
3271,3.88
3272,3.82
3273,3.73
3274,3.62
3275,3.54
3276,3.46
3277,3.38
3278,3.27
3279,3.16
3280,3.01
3281,2.84
3282,2.62
3283,2.36
3284,2.02
3285,1.67
3286,1.30
3287,0.95
3288,0.59
3289,0.21
3290,-0.23
3291,-0.67
3292,-1.13
3293,-1.53
3294,-1.91
3295,-2.24
3296,-2.53
3297,-2.77
3298,-2.95
3299,-3.06
3300,-3.14
3301,-3.23
3302,-3.36
3303,-3.53
3304,-3.74
3305,-3.94
3306,-4.18
3307,-4.39
3308,-4.53
3309,-4.59
3310,-4.61
3311,-4.62
3312,-4.68
3313,-4.73
3314,-4.81
3315,-4.93
3316,-5.11
3317,-5.32
3318,-5.52
3319,-5.64
3320,-5.68
3321,-5.65
3322,-5.57
3323,-5.49
3324,-5.36
3325,-5.22
3326,-5.04
3327,-4.87
3328,-4.65
3329,-4.43
3330,-4.17
3331,-3.87
3332,-3.51
3333,-3.14
3334,-2.72
3335,-2.30
3336,-1.86
3337,-1.46
3338,-1.08
3339,-0.76
3340,-0.41
3341,-0.09
3342,0.18
3343,0.34
3344,0.48
3345,0.63
3346,0.80
3347,0.95
3348,1.05
3349,1.11
3350,1.17
3351,1.23
3352,1.24
3353,1.18
3354,1.09
3355,1.03
3356,0.98
3357,0.93
3358,0.84
3359,0.69
3360,0.47
3361,0.21
3362,-0.10
3363,-0.39
3364,-0.68
3365,-0.92
3366,-1.09
3367,-1.14
3368,-1.12
3369,-1.08
3370,-1.11
3371,-1.22
3372,-1.42
3373,-1.69
3374,-2.04
3375,-2.43
3376,-2.81
3377,-3.11
3378,-3.31
3379,-3.39
3380,-3.40
3381,-3.35
3382,-3.35
3383,-3.43
3384,-3.63
3385,-3.91
3386,-4.33
3387,-4.84
3388,-5.46
3389,-6.07
3390,-6.63
3391,-7.08
3392,-7.47
3393,-7.77
3394,-8.04
3395,-8.24
3396,-8.48
3397,-8.76
3398,-9.10
3399,-9.43
3400,-9.75
3401,-10.00
3402,-10.23
3403,-10.37
3404,-10.46
3405,-10.51
3406,-10.57
3407,-10.66
3408,-10.79
3409,-10.96
3410,-11.20
3411,-11.47
3412,-11.73
3413,-11.92
3414,-12.01
3415,-11.97
3416,-11.81
3417,-11.55
3418,-11.20
3419,-10.80
3420,-10.38
3421,-10.00
3422,-9.67
3423,-9.44
3424,-9.25
3425,-9.12
3426,-8.97
3427,-8.83
3428,-8.66
3429,-8.49
3430,-8.29
3431,-8.09
3432,-7.85
3433,-7.64
3434,-7.49
3435,-7.40
3436,-7.35
3437,-7.35
3438,-7.43
3439,-7.61
3440,-7.89
3441,-8.22
3442,-8.56
3443,-8.86
3444,-9.11
3445,-9.31
3446,-9.49
3447,-9.63
3448,-9.77
3449,-9.86
3450,-10.02
3451,-10.22
3452,-10.51
3453,-10.83
3454,-11.19
3455,-11.57
3456,-12.02
3457,-12.46
3458,-12.89
3459,-13.24
3460,-13.53
3461,-13.77
3462,-13.96
3463,-14.08
3464,-14.11
3465,-14.08
3466,-14.02
3467,-13.98
3468,-13.99
3469,-13.98
3470,-13.99
3471,-14.02
3472,-14.10
3473,-14.22
3474,-14.34
3475,-14.43
3476,-14.52
3477,-14.64
3478,-14.75
3479,-14.82
3480,-14.82
3481,-14.79
3482,-14.72
3483,-14.60
3484,-14.43
3485,-14.24
3486,-14.11
3487,-14.07
3488,-14.16
3489,-14.31
3490,-14.50
3491,-14.64
3492,-14.74
3493,-14.79
3494,-14.84
3495,-14.86
3496,-14.90
3497,-15.01
3498,-15.27
3499,-15.69
3500,-16.24
3501,-16.81
3502,-17.35
3503,-17.77
3504,-18.04
3505,-18.12
3506,-18.04
3507,-17.82
3508,-17.53
3509,-17.20
3510,-16.85
3511,-16.55
3512,-16.34
3513,-16.22
3514,-16.16
3515,-16.11
3516,-16.04
3517,-15.96
3518,-15.80
3519,-15.57
3520,-15.24
3521,-14.92
3522,-14.63
3523,-14.40
3524,-14.18
3525,-14.01
3526,-13.89
3527,-13.81
3528,-13.66
3529,-13.40
3530,-13.02
3531,-12.57
3532,-12.04
3533,-11.51
3534,-11.02
3535,-10.66
3536,-10.44
3537,-10.36
3538,-10.36
3539,-10.41
3540,-10.41
3541,-10.36
3542,-10.22
3543,-10.01
3544,-9.72
3545,-9.39
3546,-9.05
3547,-8.75
3548,-8.51
3549,-8.35
3550,-8.22
3551,-8.13
3552,-8.09
3553,-8.09
3554,-8.13
3555,-8.16
3556,-8.16
3557,-8.10
3558,-7.97
3559,-7.83
3560,-7.67
3561,-7.53
3562,-7.37
3563,-7.16
3564,-6.89
3565,-6.59
3566,-6.29
3567,-6.03
3568,-5.75
3569,-5.49
3570,-5.25
3571,-5.07
3572,-4.96
3573,-4.94
3574,-4.97
3575,-5.07
3576,-5.18
3577,-5.27
3578,-5.33
3579,-5.36
3580,-5.36
3581,-5.29
3582,-5.18
3583,-5.07
3584,-4.98
3585,-4.99
3586,-5.05
3587,-5.15
3588,-5.24
3589,-5.31
3590,-5.29
3591,-5.14
3592,-4.84
3593,-4.46
3594,-4.01
3595,-3.53
3596,-3.02
3597,-2.52
3598,-2.02
3599,-1.61
3600,-1.26
3601,-0.97
3602,-0.70
3603,-0.47
3604,-0.27
3605,-0.12
3606,-0.02
3607,0.03
3608,0.07
3609,0.09
3610,0.13
3611,0.18
3612,0.29
3613,0.43
3614,0.63
3615,0.87
3616,1.14
3617,1.38
3618,1.53
3619,1.59
3620,1.61
3621,1.59
3622,1.58
3623,1.58
3624,1.66
3625,1.82
3626,2.09
3627,2.39
3628,2.72
3629,3.01
3630,3.24
3631,3.36
3632,3.40
3633,3.35
3634,3.28
3635,3.24
3636,3.33
3637,3.59
3638,4.03
3639,4.57
3640,5.17
3641,5.74
3642,6.23
3643,6.55
3644,6.71
3645,6.71
3646,6.58
3647,6.37
3648,6.13
3649,5.92
3650,5.75
3651,5.62
3652,5.42
3653,5.17
3654,4.80
3655,4.33
3656,3.72
3657,3.04
3658,2.30
3659,1.63
3660,0.99
3661,0.47
3662,0.01
3663,-0.37
3664,-0.70
3665,-0.95
3666,-1.21
3667,-1.46
3668,-1.79
3669,-2.16
3670,-2.61
3671,-3.08
3672,-3.62
3673,-4.14
3674,-4.67
3675,-5.16
3676,-5.70
3677,-6.25
3678,-6.85
3679,-7.41
3680,-7.97
3681,-8.49
3682,-9.03
3683,-9.53
3684,-10.01
3685,-10.41
3686,-10.79
3687,-11.11
3688,-11.41
3689,-11.63
3690,-11.82
3691,-11.94
3692,-12.02
3693,-12.02
3694,-11.90
3695,-11.67
3696,-11.32
3697,-10.90
3698,-10.41
3699,-9.91
3700,-9.41
3701,-8.96
3702,-8.55
3703,-8.20
3704,-7.89
3705,-7.65
3706,-7.48
3707,-7.37
3708,-7.28
3709,-7.22
3710,-7.20
3711,-7.26
3712,-7.40
3713,-7.61
3714,-7.87
3715,-8.10
3716,-8.32
3717,-8.49
3718,-8.65
3719,-8.80
3720,-8.96
3721,-9.12
3722,-9.35
3723,-9.61
3724,-9.95
3725,-10.29
3726,-10.67
3727,-11.05
3728,-11.49
3729,-11.99
3730,-12.57
3731,-13.13
3732,-13.66
3733,-14.11
3734,-14.47
3735,-14.67
3736,-14.70
3737,-14.57
3738,-14.39
3739,-14.19
3740,-14.02
3741,-13.90
3742,-13.90
3743,-14.00
3744,-14.22
3745,-14.50
3746,-14.83
3747,-15.18
3748,-15.54
3749,-15.86
3750,-16.15
3751,-16.40
3752,-16.59
3753,-16.69
3754,-16.75
3755,-16.80
3756,-16.91
3757,-17.08
3758,-17.36
3759,-17.73
3760,-18.26
3761,-18.88
3762,-19.58
3763,-20.21
3764,-20.71
3765,-21.03
3766,-21.24
3767,-21.38
3768,-21.51
3769,-21.64
3770,-21.86
3771,-22.12
3772,-22.43
3773,-22.70
3774,-22.88
3775,-22.93
3776,-22.87
3777,-22.72
3778,-22.52
3779,-22.31
3780,-22.13
3781,-22.00
3782,-21.95
3783,-21.93
3784,-21.87
3785,-21.73
3786,-21.48
3787,-21.19
3788,-20.84
3789,-20.45
3790,-20.02
3791,-19.64
3792,-19.33
3793,-19.13
3794,-18.97
3795,-18.81
3796,-18.55
3797,-18.23
3798,-17.82
3799,-17.39
3800,-16.89
3801,-16.43
3802,-15.98
3803,-15.64
3804,-15.34
3805,-15.09
3806,-14.80
3807,-14.50
3808,-14.08
3809,-13.65
3810,-13.14
3811,-12.63
3812,-12.04
3813,-11.46
3814,-10.83
3815,-10.25
3816,-9.64
3817,-9.03
3818,-8.36
3819,-7.69
3820,-6.97
3821,-6.30
3822,-5.62
3823,-4.97
3824,-4.33
3825,-3.78
3826,-3.28
3827,-2.88
3828,-2.48
3829,-2.11
3830,-1.72
3831,-1.37
3832,-1.00
3833,-0.66
3834,-0.32
3835,-0.03
3836,0.27
3837,0.60
3838,0.95
3839,1.28
3840,1.55
3841,1.70
3842,1.72
3843,1.59
3844,1.35
3845,1.01
3846,0.62
3847,0.20
3848,-0.18
3849,-0.49
3850,-0.69
3851,-0.80
3852,-0.89
3853,-0.96
3854,-1.09
3855,-1.24
3856,-1.40
3857,-1.54
3858,-1.71
3859,-1.85
3860,-1.96
3861,-2.01
3862,-2.05
3863,-2.07
3864,-2.12
3865,-2.20
3866,-2.36
3867,-2.59
3868,-2.91
3869,-3.27
3870,-3.65
3871,-4.00
3872,-4.34
3873,-4.62
3874,-4.90
3875,-5.16
3876,-5.47
3877,-5.85
3878,-6.33
3879,-6.87
3880,-7.42
3881,-7.90
3882,-8.30
3883,-8.56
3884,-8.70
3885,-8.71
3886,-8.67
3887,-8.58
3888,-8.44
3889,-8.26
3890,-8.07
3891,-7.90
3892,-7.71
3893,-7.50
3894,-7.29
3895,-7.10
3896,-6.94
3897,-6.84
3898,-6.75
3899,-6.67
3900,-6.53
3901,-6.37
3902,-6.17
3903,-5.94
3904,-5.59
3905,-5.18
3906,-4.75
3907,-4.39
3908,-4.07
3909,-3.82
3910,-3.59
3911,-3.41
3912,-3.27
3913,-3.16
3914,-3.02
3915,-2.88
3916,-2.75
3917,-2.62
3918,-2.48
3919,-2.33
3920,-2.24
3921,-2.20
3922,-2.19
3923,-2.20
3924,-2.24
3925,-2.29
3926,-2.32
3927,-2.33
3928,-2.34
3929,-2.36
3930,-2.38
3931,-2.41
3932,-2.52
3933,-2.69
3934,-2.91
3935,-3.18
3936,-3.55
3937,-3.97
3938,-4.47
3939,-4.94
3940,-5.43
3941,-5.90
3942,-6.36
3943,-6.77
3944,-7.17
3945,-7.55
3946,-7.96
3947,-8.38
3948,-8.79
3949,-9.12
3950,-9.33
3951,-9.41
3952,-9.41
3953,-9.35
3954,-9.22
3955,-9.06
3956,-8.95
3957,-8.91
3958,-8.96
3959,-9.06
3960,-9.16
3961,-9.22
3962,-9.22
3963,-9.12
3964,-8.95
3965,-8.74
3966,-8.57
3967,-8.50
3968,-8.54
3969,-8.70
3970,-8.96
3971,-9.28
3972,-9.64
3973,-9.96
3974,-10.28
3975,-10.60
3976,-10.97
3977,-11.38
3978,-11.83
3979,-12.29
3980,-12.73
3981,-13.06
3982,-13.21
3983,-13.16
3984,-12.90
3985,-12.48
3986,-11.91
3987,-11.28
3988,-10.66
3989,-10.12
3990,-9.65
3991,-9.26
3992,-8.86
3993,-8.49
3994,-8.06
3995,-7.63
3996,-7.13
3997,-6.58
3998,-5.88
3999,-5.10
4000,-4.17
4001,-3.17
4002,-2.05
4003,-0.93
4004,0.17
4005,1.05
4006,1.72
4007,2.10
4008,2.26
4009,2.24
4010,2.17
4011,2.11
4012,2.20
4013,2.43
4014,2.82
4015,3.24
4016,3.65
4017,3.91
4018,4.01
4019,3.91
4020,3.66
4021,3.33
4022,2.96
4023,2.62
4024,2.37
4025,2.22
4026,2.16
4027,2.14
4028,2.11
4029,1.98
4030,1.77
4031,1.53
4032,1.34
4033,1.24
4034,1.26
4035,1.42
4036,1.69
4037,2.02
4038,2.30
4039,2.43
4040,2.40
4041,2.24
4042,1.99
4043,1.74
4044,1.63
4045,1.75
4046,2.07
4047,2.50
4048,2.94
4049,3.35
4050,3.62
4051,3.72
4052,3.58
4053,3.25
4054,2.78
4055,2.27
4056,1.75
4057,1.29
4058,0.86
4059,0.48
4060,0.08
4061,-0.32
4062,-0.76
4063,-1.17
4064,-1.58
4065,-1.93
4066,-2.26
4067,-2.55
4068,-2.80
4069,-2.98
4070,-3.10
4071,-3.17
4072,-3.26
4073,-3.34
4074,-3.44
4075,-3.52
4076,-3.65
4077,-3.78
4078,-3.94
4079,-4.10
4080,-4.23
4081,-4.26
4082,-4.15
4083,-3.97
4084,-3.81
4085,-3.71
4086,-3.68
4087,-3.72
4088,-3.83
4089,-4.02
4090,-4.17
4091,-4.22
4092,-4.10
4093,-3.86
4094,-3.52
4095,-3.13
4096,-2.71
4097,-2.36
4098,-2.11
4099,-1.99
4100,-1.97
4101,-1.98
4102,-1.95
4103,-1.91
4104,-1.79
4105,-1.58
4106,-1.25
4107,-0.87
4108,-0.47
4109,-0.11
4110,0.24
4111,0.56
4112,0.82
4113,1.04
4114,1.24
4115,1.40
4116,1.53
4117,1.59
4118,1.64
4119,1.69
4120,1.72
4121,1.70
4122,1.63
4123,1.50
4124,1.32
4125,1.11
4126,0.92
4127,0.73
4128,0.56
4129,0.41
4130,0.31
4131,0.26
4132,0.20
4133,0.09
4134,-0.11
4135,-0.41
4136,-0.81
4137,-1.23
4138,-1.63
4139,-1.92
4140,-2.13
4141,-2.20
4142,-2.18
4143,-2.11
4144,-2.10
4145,-2.20
4146,-2.47
4147,-2.85
4148,-3.36
4149,-3.92
4150,-4.54
4151,-5.13
4152,-5.69
4153,-6.16
4154,-6.58
4155,-6.92
4156,-7.24
4157,-7.53
4158,-7.84
4159,-8.13
4160,-8.42
4161,-8.64
4162,-8.87
4163,-9.06
4164,-9.26
4165,-9.45
4166,-9.61
4167,-9.76
4168,-9.88
4169,-9.96
4170,-10.04
4171,-10.10
4172,-10.15
4173,-10.19
4174,-10.16
4175,-10.08
4176,-9.92
4177,-9.68
4178,-9.35
4179,-9.00
4180,-8.65
4181,-8.39
4182,-8.17
4183,-7.97
4184,-7.75
4185,-7.52
4186,-7.24
4187,-6.89
4188,-6.42
4189,-5.91
4190,-5.42
4191,-5.07
4192,-4.83
4193,-4.70
4194,-4.61
4195,-4.59
4196,-4.61
4197,-4.68
4198,-4.73
4199,-4.77
4200,-4.77
4201,-4.74
4202,-4.65
4203,-4.55
4204,-4.42
4205,-4.26
4206,-4.05
4207,-3.79
4208,-3.49
4209,-3.22
4210,-3.00
4211,-2.85
4212,-2.78
4213,-2.79
4214,-2.82
4215,-2.85
4216,-2.88
4217,-2.91
4218,-2.93
4219,-2.94
4220,-2.88
4221,-2.77
4222,-2.59
4223,-2.41
4224,-2.24
4225,-2.13
4226,-2.07
4227,-2.07
4228,-2.14
4229,-2.28
4230,-2.49
4231,-2.73
4232,-3.00
4233,-3.23
4234,-3.42
4235,-3.53
4236,-3.62
4237,-3.70
4238,-3.81
4239,-3.95
4240,-4.18
4241,-4.46
4242,-4.81
4243,-5.14
4244,-5.46
4245,-5.74
4246,-6.03
4247,-6.32
4248,-6.68
4249,-7.05
4250,-7.48
4251,-7.92
4252,-8.40
4253,-8.85
4254,-9.22
4255,-9.46
4256,-9.58
4257,-9.62
4258,-9.67
4259,-9.75
4260,-9.92
4261,-10.12
4262,-10.37
4263,-10.64
4264,-10.95
4265,-11.24
4266,-11.47
4267,-11.62
4268,-11.74
4269,-11.83
4270,-11.83
4271,-11.74
4272,-11.61
4273,-11.46
4274,-11.25
4275,-10.99
4276,-10.71
4277,-10.47
4278,-10.25
4279,-10.08
4280,-9.94
4281,-9.86
4282,-9.80
4283,-9.78
4284,-9.75
4285,-9.70
4286,-9.57
4287,-9.37
4288,-9.08
4289,-8.75
4290,-8.38
4291,-8.03
4292,-7.70
4293,-7.45
4294,-7.22
4295,-7.03
4296,-6.76
4297,-6.45
4298,-6.04
4299,-5.61
4300,-5.09
4301,-4.53
4302,-3.92
4303,-3.30
4304,-2.64
4305,-2.04
4306,-1.57
4307,-1.27
4308,-1.12
4309,-1.14
4310,-1.27
4311,-1.52
4312,-1.81
4313,-2.12
4314,-2.42
4315,-2.62
4316,-2.69
4317,-2.69
4318,-2.73
4319,-2.86
4320,-3.08
4321,-3.38
4322,-3.82
4323,-4.34
4324,-4.92
4325,-5.40
4326,-5.79
4327,-6.03
4328,-6.22
4329,-6.37
4330,-6.65
4331,-7.01
4332,-7.54
4333,-8.16
4334,-8.92
4335,-9.70
4336,-10.51
4337,-11.22
4338,-11.86
4339,-12.35
4340,-12.73
4341,-12.99
4342,-13.22
4343,-13.44
4344,-13.71
4345,-14.03
4346,-14.47
4347,-14.95
4348,-15.50
4349,-16.04
4350,-16.59
4351,-17.06
4352,-17.42
4353,-17.62
4354,-17.74
4355,-17.75
4356,-17.68
4357,-17.52
4358,-17.40
4359,-17.32
4360,-17.33
4361,-17.40
4362,-17.50
4363,-17.65
4364,-17.83
4365,-18.01
4366,-18.17
4367,-18.26
4368,-18.26
4369,-18.20
4370,-18.09
4371,-17.94
4372,-17.78
4373,-17.59
4374,-17.42
4375,-17.27
4376,-17.15
4377,-17.04
4378,-16.89
4379,-16.72
4380,-16.49
4381,-16.24
4382,-15.88
4383,-15.48
4384,-14.98
4385,-14.46
4386,-13.86
4387,-13.28
4388,-12.70
4389,-12.21
4390,-11.73
4391,-11.33
4392,-10.94
4393,-10.63
4394,-10.31
4395,-10.00
4396,-9.62
4397,-9.25
4398,-8.85
4399,-8.50
4400,-8.16
4401,-7.90
4402,-7.74
4403,-7.65
4404,-7.56
4405,-7.45
4406,-7.32
4407,-7.20
4408,-7.08
4409,-6.94
4410,-6.74
4411,-6.53
4412,-6.32
4413,-6.14
4414,-6.00
4415,-5.91
4416,-5.89
4417,-5.95
4418,-6.09
4419,-6.30
4420,-6.57
4421,-6.84
4422,-7.06
4423,-7.23
4424,-7.29
4425,-7.29
4426,-7.23
4427,-7.15
4428,-7.06
4429,-6.97
4430,-6.85
4431,-6.71
4432,-6.54
4433,-6.33
4434,-6.04
4435,-5.73
4436,-5.39
4437,-5.10
4438,-4.78
4439,-4.47
4440,-4.12
4441,-3.77
4442,-3.38
4443,-2.97
4444,-2.52
4445,-2.08
4446,-1.63
4447,-1.24
4448,-0.95
4449,-0.77
4450,-0.66
4451,-0.59
4452,-0.47
4453,-0.37
4454,-0.26
4455,-0.21
4456,-0.18
4457,-0.21
4458,-0.31
4459,-0.50
4460,-0.70
4461,-0.90
4462,-1.01
4463,-1.00
4464,-0.76
4465,-0.33
4466,0.34
4467,1.14
4468,2.07
4469,3.02
4470,3.97
4471,4.80
4472,5.50
4473,6.03
4474,6.43
4475,6.71
4476,6.95
4477,7.14
4478,7.39
4479,7.64
4480,7.95
4481,8.23
4482,8.54
4483,8.80
4484,9.02
4485,9.16
4486,9.30
4487,9.47
4488,9.70
4489,9.96
4490,10.28
4491,10.60
4492,10.92
4493,11.19
4494,11.44
4495,11.63
4496,11.78
4497,11.88
4498,11.94
4499,11.97
4500,11.93
4501,11.84
4502,11.73
4503,11.61
4504,11.44
4505,11.21
4506,10.92
4507,10.61
4508,10.31
4509,10.02
4510,9.71
4511,9.48
4512,9.35
4513,9.32
4514,9.33
4515,9.38
4516,9.45
4517,9.54
4518,9.58
4519,9.57
4520,9.48
4521,9.38
4522,9.29
4523,9.24
4524,9.22
4525,9.22
4526,9.20
4527,9.15
4528,9.04
4529,8.90
4530,8.70
4531,8.46
4532,8.20
4533,8.00
4534,7.85
4535,7.77
4536,7.69
4537,7.58
4538,7.40
4539,7.20
4540,6.95
4541,6.66
4542,6.29
4543,5.91
4544,5.50
4545,5.09
4546,4.65
4547,4.21
4548,3.75
4549,3.32
4550,2.88
4551,2.46
4552,2.04
4553,1.70
4554,1.39
4555,1.14
4556,0.85
4557,0.56
4558,0.25
4559,-0.01
4560,-0.24
4561,-0.41
4562,-0.55
4563,-0.63
4564,-0.68
4565,-0.70
4566,-0.76
4567,-0.84
4568,-0.98
4569,-1.12
4570,-1.26
4571,-1.34
4572,-1.40
4573,-1.43
4574,-1.46
4575,-1.51
4576,-1.61
4577,-1.75
4578,-1.97
4579,-2.20
4580,-2.43
4581,-2.62
4582,-2.75
4583,-2.75
4584,-2.58
4585,-2.28
4586,-1.93
4587,-1.63
4588,-1.38
4589,-1.21
4590,-1.08
4591,-1.00
4592,-0.92
4593,-0.84
4594,-0.71
4595,-0.53
4596,-0.29
4597,0.01
4598,0.33
4599,0.60
4600,0.79
4601,0.89
4602,0.86
4603,0.71
4604,0.44
4605,0.11
4606,-0.21
4607,-0.45
4608,-0.63
4609,-0.74
4610,-0.79
4611,-0.79
4612,-0.79
4613,-0.80
4614,-0.89
4615,-1.07
4616,-1.34
4617,-1.66
4618,-2.02
4619,-2.38
4620,-2.77
4621,-3.14
4622,-3.51
4623,-3.84
4624,-4.18
4625,-4.49
4626,-4.79
4627,-5.06
4628,-5.35
4629,-5.63
4630,-5.94
4631,-6.20
4632,-6.45
4633,-6.68
4634,-6.93
4635,-7.16
4636,-7.36
4637,-7.51
4638,-7.63
4639,-7.71
4640,-7.75
4641,-7.78
4642,-7.86
4643,-8.00
4644,-8.22
4645,-8.49
4646,-8.82
4647,-9.18
4648,-9.51
4649,-9.72
4650,-9.80
4651,-9.77
4652,-9.65
4653,-9.50
4654,-9.35
4655,-9.22
4656,-9.14
4657,-9.09
4658,-9.03
4659,-8.94
4660,-8.81
4661,-8.63
4662,-8.38
4663,-8.09
4664,-7.74
4665,-7.39
4666,-7.03
4667,-6.73
4668,-6.52
4669,-6.40
4670,-6.36
4671,-6.39
4672,-6.51
4673,-6.72
4674,-6.99
4675,-7.27
4676,-7.50
4677,-7.64
4678,-7.71
4679,-7.74
4680,-7.76
4681,-7.78
4682,-7.80
4683,-7.84
4684,-7.93
4685,-8.07
4686,-8.24
4687,-8.39
4688,-8.54
4689,-8.67
4690,-8.72
4691,-8.70
4692,-8.58
4693,-8.44
4694,-8.26
4695,-8.06
4696,-7.79
4697,-7.46
4698,-7.07
4699,-6.68
4700,-6.30
4701,-5.96
4702,-5.60
4703,-5.25
4704,-4.90
4705,-4.57
4706,-4.26
4707,-3.99
4708,-3.78
4709,-3.67
4710,-3.61
4711,-3.62
4712,-3.65
4713,-3.69
4714,-3.68
4715,-3.63
4716,-3.52
4717,-3.33
4718,-3.09
4719,-2.85
4720,-2.69
4721,-2.66
4722,-2.72
4723,-2.82
4724,-2.91
4725,-2.93
4726,-2.89
4727,-2.81
4728,-2.68
4729,-2.52
4730,-2.36
4731,-2.27
4732,-2.33
4733,-2.50
4734,-2.73
4735,-2.91
4736,-3.05
4737,-3.16
4738,-3.28
4739,-3.40
4740,-3.53
4741,-3.71
4742,-3.94
4743,-4.21
4744,-4.49
4745,-4.72
4746,-4.91
4747,-5.00
4748,-5.00
4749,-4.93
4750,-4.84
4751,-4.80
4752,-4.89
4753,-5.10
4754,-5.41
4755,-5.80
4756,-6.26
4757,-6.74
4758,-7.17
4759,-7.48
4760,-7.65
4761,-7.70
4762,-7.67
4763,-7.61
4764,-7.56
4765,-7.52
4766,-7.48
4767,-7.43
4768,-7.36
4769,-7.24
4770,-7.03
4771,-6.73
4772,-6.39
4773,-6.05
4774,-5.74
4775,-5.45
4776,-5.17
4777,-4.97
4778,-4.82
4779,-4.75
4780,-4.67
4781,-4.58
4782,-4.46
4783,-4.33
4784,-4.23
4785,-4.14
4786,-4.07
4787,-4.01
4788,-3.99
4789,-4.01
4790,-4.10
4791,-4.25
4792,-4.46
4793,-4.70
4794,-4.94
4795,-5.11
4796,-5.23
4797,-5.25
4798,-5.23
4799,-5.19
4800,-5.21
4801,-5.33
4802,-5.54
4803,-5.84
4804,-6.22
4805,-6.58
4806,-6.85
4807,-6.97
4808,-6.94
4809,-6.74
4810,-6.45
4811,-6.11
4812,-5.82
4813,-5.64
4814,-5.59
4815,-5.65
4816,-5.81
4817,-6.02
4818,-6.25
4819,-6.45
4820,-6.63
4821,-6.75
4822,-6.83
4823,-6.89
4824,-6.95
4825,-7.03
4826,-7.16
4827,-7.31
4828,-7.48
4829,-7.62
4830,-7.74
4831,-7.84
4832,-7.90
4833,-7.92
4834,-7.90
4835,-7.87
4836,-7.85
4837,-7.82
4838,-7.77
4839,-7.68
4840,-7.55
4841,-7.43
4842,-7.33
4843,-7.28
4844,-7.26
4845,-7.26
4846,-7.26
4847,-7.27
4848,-7.26
4849,-7.20
4850,-7.06
4851,-6.85
4852,-6.63
4853,-6.45
4854,-6.28
4855,-6.15
4856,-6.04
4857,-5.96
4858,-5.81
4859,-5.60
4860,-5.25
4861,-4.81
4862,-4.23
4863,-3.62
4864,-2.98
4865,-2.43
4866,-1.90
4867,-1.44
4868,-0.95
4869,-0.43
4870,0.21
4871,0.92
4872,1.71
4873,2.47
4874,3.23
4875,3.86
4876,4.44
4877,4.90
4878,5.33
4879,5.69
4880,6.08
4881,6.45
4882,6.90
4883,7.30
4884,7.64
4885,7.85
4886,7.97
4887,8.01
4888,8.03
4889,8.05
4890,8.17
4891,8.40
4892,8.74
4893,9.11
4894,9.44
4895,9.64
4896,9.70
4897,9.57
4898,9.31
4899,8.94
4900,8.54
4901,8.22
4902,8.00
4903,7.88
4904,7.82
4905,7.77
4906,7.69
4907,7.55
4908,7.29
4909,6.97
4910,6.59
4911,6.23
4912,5.90
4913,5.61
4914,5.33
4915,5.07
4916,4.81
4917,4.54
4918,4.22
4919,3.90
4920,3.62
4921,3.44
4922,3.34
4923,3.30
4924,3.23
4925,3.16
4926,3.01
4927,2.82
4928,2.50
4929,2.13
4930,1.67
4931,1.24
4932,0.79
4933,0.38
4934,-0.05
4935,-0.47
4936,-0.98
4937,-1.53
4938,-2.18
4939,-2.89
4940,-3.71
4941,-4.57
4942,-5.46
4943,-6.25
4944,-6.97
4945,-7.52
4946,-7.94
4947,-8.17
4948,-8.23
4949,-8.13
4950,-7.93
4951,-7.67
4952,-7.36
4953,-7.06
4954,-6.80
4955,-6.55
4956,-6.31
4957,-6.04
4958,-5.76
4959,-5.49
4960,-5.25
4961,-5.08
4962,-4.97
4963,-4.95
4964,-4.94
4965,-4.94
4966,-4.82
4967,-4.56
4968,-4.09
4969,-3.43
4970,-2.63
4971,-1.79
4972,-0.96
4973,-0.24
4974,0.31
4975,0.63
4976,0.77
4977,0.76
4978,0.65
4979,0.50
4980,0.36
4981,0.27
4982,0.22
4983,0.17
4984,0.07
4985,-0.08
4986,-0.28
4987,-0.51
4988,-0.82
4989,-1.21
4990,-1.67
4991,-2.14
4992,-2.62
4993,-3.09
4994,-3.62
4995,-4.14
4996,-4.67
4997,-5.16
4998,-5.70
4999,-6.28
5000,-6.95
5001,-7.59
5002,-8.25
5003,-8.82
5004,-9.40
5005,-9.88
5006,-10.34
5007,-10.70
5008,-11.11
5009,-11.53
5010,-12.08
5011,-12.69
5012,-13.42
5013,-14.19
5014,-15.01
5015,-15.77
5016,-16.48
5017,-17.07
5018,-17.58
5019,-17.94
5020,-18.24
5021,-18.44
5022,-18.61
5023,-18.72
5024,-18.79
5025,-18.81
5026,-18.86
5027,-18.94
5028,-19.04
5029,-19.10
5030,-19.12
5031,-19.07
5032,-18.90
5033,-18.64
5034,-18.26
5035,-17.85
5036,-17.40
5037,-16.96
5038,-16.49
5039,-16.05
5040,-15.63
5041,-15.26
5042,-14.83
5043,-14.34
5044,-13.74
5045,-13.15
5046,-12.56
5047,-12.07
5048,-11.64
5049,-11.33
5050,-11.05
5051,-10.83
5052,-10.60
5053,-10.38
5054,-10.08
5055,-9.72
5056,-9.32
5057,-9.03
5058,-8.88
5059,-8.94
5060,-9.17
5061,-9.52
5062,-9.90
5063,-10.24
5064,-10.43
5065,-10.46
5066,-10.34
5067,-10.12
5068,-9.86
5069,-9.60
5070,-9.37
5071,-9.25
5072,-9.26
5073,-9.39
5074,-9.55
5075,-9.67
5076,-9.73
5077,-9.73
5078,-9.69
5079,-9.63
5080,-9.54
5081,-9.46
5082,-9.37
5083,-9.28
5084,-9.19
5085,-9.06
5086,-8.91
5087,-8.71
5088,-8.43
5089,-8.09
5090,-7.76
5091,-7.48
5092,-7.32
5093,-7.25
5094,-7.29
5095,-7.45
5096,-7.70
5097,-8.00
5098,-8.29
5099,-8.58
5100,-8.83
5101,-9.06
5102,-9.25
5103,-9.43
5104,-9.65
5105,-9.92
5106,-10.21
5107,-10.48
5108,-10.75
5109,-11.01
5110,-11.27
5111,-11.48
5112,-11.63
5113,-11.71
5114,-11.73
5115,-11.73
5116,-11.75
5117,-11.75
5118,-11.70
5119,-11.61
5120,-11.53
5121,-11.51
5122,-11.49
5123,-11.47
5124,-11.41
5125,-11.35
5126,-11.28
5127,-11.21
5128,-11.04
5129,-10.75
5130,-10.29
5131,-9.77
5132,-9.19
5133,-8.59
5134,-7.94
5135,-7.33
5136,-6.77
5137,-6.29
5138,-5.82
5139,-5.37
5140,-4.89
5141,-4.42
5142,-3.88
5143,-3.33
5144,-2.77
5145,-2.24
5146,-1.67
5147,-1.12
5148,-0.59
5149,-0.14
5150,0.27
5151,0.60
5152,0.91
5153,1.14
5154,1.34
5155,1.46
5156,1.48
5157,1.39
5158,1.21
5159,0.97
5160,0.67
5161,0.34
5162,0.01
5163,-0.30
5164,-0.55
5165,-0.76
5166,-0.93
5167,-1.10
5168,-1.30
5169,-1.50
5170,-1.71
5171,-1.88
5172,-2.05
5173,-2.20
5174,-2.33
5175,-2.46
5176,-2.54
5177,-2.57
5178,-2.54
5179,-2.46
5180,-2.30
5181,-2.09
5182,-1.84
5183,-1.59
5184,-1.42
5185,-1.33
5186,-1.32
5187,-1.34
5188,-1.40
5189,-1.50
5190,-1.65
5191,-1.82
5192,-1.97
5193,-2.08
5194,-2.24
5195,-2.44
5196,-2.69
5197,-2.89
5198,-3.06
5199,-3.17
5200,-3.27
5201,-3.35
5202,-3.43
5203,-3.51
5204,-3.65
5205,-3.85
5206,-4.16
5207,-4.54
5208,-5.00
5209,-5.51
5210,-6.07
5211,-6.63
5212,-7.21
5213,-7.73
5214,-8.21
5215,-8.58
5216,-8.91
5217,-9.13
5218,-9.31
5219,-9.42
5220,-9.53
5221,-9.61
5222,-9.67
5223,-9.73
5224,-9.83
5225,-9.97
5226,-10.14
5227,-10.26
5228,-10.32
5229,-10.31
5230,-10.27
5231,-10.21
5232,-10.16
5233,-10.15
5234,-10.23
5235,-10.37
5236,-10.58
5237,-10.83
5238,-11.08
5239,-11.25
5240,-11.34
5241,-11.34
5242,-11.29
5243,-11.26
5244,-11.26
5245,-11.30
5246,-11.33
5247,-11.34
5248,-11.29
5249,-11.21
5250,-11.04
5251,-10.78
5252,-10.38
5253,-9.88
5254,-9.29
5255,-8.73
5256,-8.20
5257,-7.77
5258,-7.35
5259,-7.00
5260,-6.70
5261,-6.47
5262,-6.26
5263,-6.07
5264,-5.83
5265,-5.60
5266,-5.36
5267,-5.16
5268,-4.95
5269,-4.78
5270,-4.65
5271,-4.62
5272,-4.69
5273,-4.84
5274,-5.02
5275,-5.18
5276,-5.28
5277,-5.30
5278,-5.26
5279,-5.20
5280,-5.18
5281,-5.23
5282,-5.39
5283,-5.65
5284,-6.05
5285,-6.51
5286,-6.94
5287,-7.24
5288,-7.39
5289,-7.42
5290,-7.36
5291,-7.26
5292,-7.15
5293,-7.10
5294,-7.14
5295,-7.26
5296,-7.38
5297,-7.42
5298,-7.35
5299,-7.23
5300,-7.05
5301,-6.84
5302,-6.64
5303,-6.48
5304,-6.42
5305,-6.48
5306,-6.65
5307,-6.86
5308,-7.06
5309,-7.18
5310,-7.21
5311,-7.15
5312,-7.02
5313,-6.87
5314,-6.74
5315,-6.64
5316,-6.59
5317,-6.62
5318,-6.75
5319,-7.00
5320,-7.30
5321,-7.58
5322,-7.76
5323,-7.83
5324,-7.77
5325,-7.58
5326,-7.29
5327,-6.93
5328,-6.58
5329,-6.30
5330,-6.11
5331,-6.03
5332,-6.05
5333,-6.14
5334,-6.23
5335,-6.28
5336,-6.23
5337,-6.11
5338,-5.89
5339,-5.60
5340,-5.25
5341,-4.95
5342,-4.74
5343,-4.66
5344,-4.65
5345,-4.71
5346,-4.72
5347,-4.67
5348,-4.48
5349,-4.19
5350,-3.79
5351,-3.35
5352,-2.84
5353,-2.34
5354,-1.88
5355,-1.53
5356,-1.25
5357,-1.06
5358,-0.85
5359,-0.66
5360,-0.43
5361,-0.16
5362,0.20
5363,0.60
5364,1.04
5365,1.46
5366,1.89
5367,2.30
5368,2.67
5369,2.91
5370,3.03
5371,3.05
5372,3.01
5373,2.89
5374,2.69
5375,2.38
5376,2.00
5377,1.61
5378,1.26
5379,0.96
5380,0.69
5381,0.49
5382,0.36
5383,0.31
5384,0.24
5385,0.10
5386,-0.12
5387,-0.39
5388,-0.69
5389,-1.02
5390,-1.37
5391,-1.67
5392,-1.86
5393,-1.92
5394,-1.90
5395,-1.83
5396,-1.74
5397,-1.65
5398,-1.60
5399,-1.63
5400,-1.74
5401,-1.92
5402,-2.16
5403,-2.40
5404,-2.59
5405,-2.69
5406,-2.68
5407,-2.58
5408,-2.43
5409,-2.27
5410,-2.17
5411,-2.15
5412,-2.16
5413,-2.16
5414,-2.14
5415,-2.11
5416,-2.09
5417,-2.08
5418,-2.11
5419,-2.17
5420,-2.30
5421,-2.50
5422,-2.75
5423,-3.00
5424,-3.19
5425,-3.32
5426,-3.36
5427,-3.33
5428,-3.21
5429,-3.04
5430,-2.83
5431,-2.62
5432,-2.39
5433,-2.16
5434,-1.92
5435,-1.71
5436,-1.53
5437,-1.37
5438,-1.27
5439,-1.21
5440,-1.18
5441,-1.13
5442,-1.00
5443,-0.82
5444,-0.63
5445,-0.49
5446,-0.37
5447,-0.28
5448,-0.24
5449,-0.24
5450,-0.25
5451,-0.23
5452,-0.12
5453,0.06
5454,0.30
5455,0.54
5456,0.76
5457,0.90
5458,0.97
5459,0.98
5460,0.90
5461,0.75
5462,0.53
5463,0.29
5464,0.08
5465,-0.10
5466,-0.28
5467,-0.48
5468,-0.70
5469,-0.92
5470,-1.13
5471,-1.30
5472,-1.43
5473,-1.48
5474,-1.53
5475,-1.60
5476,-1.74
5477,-1.92
5478,-2.15
5479,-2.38
5480,-2.62
5481,-2.83
5482,-3.01
5483,-3.12
5484,-3.18
5485,-3.20
5486,-3.26
5487,-3.33
5488,-3.46
5489,-3.64
5490,-3.90
5491,-4.19
5492,-4.51
5493,-4.80
5494,-5.10
5495,-5.39
5496,-5.70
5497,-5.99
5498,-6.27
5499,-6.53
5500,-6.84
5501,-7.16
5502,-7.50
5503,-7.83
5504,-8.16
5505,-8.48
5506,-8.80
5507,-9.03
5508,-9.18
5509,-9.21
5510,-9.14
5511,-8.98
5512,-8.77
5513,-8.59
5514,-8.49
5515,-8.45
5516,-8.45
5517,-8.46
5518,-8.47
5519,-8.47
5520,-8.40
5521,-8.22
5522,-7.94
5523,-7.64
5524,-7.37
5525,-7.19
5526,-7.12
5527,-7.15
5528,-7.27
5529,-7.45
5530,-7.65
5531,-7.80
5532,-7.89
5533,-7.89
5534,-7.82
5535,-7.70
5536,-7.54
5537,-7.42
5538,-7.36
5539,-7.39
5540,-7.49
5541,-7.62
5542,-7.74
5543,-7.81
5544,-7.74
5545,-7.51
5546,-7.11
5547,-6.60
5548,-6.01
5549,-5.45
5550,-4.96
5551,-4.64
5552,-4.48
5553,-4.46
5554,-4.48
5555,-4.46
5556,-4.35
5557,-4.14
5558,-3.81
5559,-3.47
5560,-3.12
5561,-2.82
5562,-2.56
5563,-2.42
5564,-2.40
5565,-2.43
5566,-2.41
5567,-2.30
5568,-2.12
5569,-1.90
5570,-1.65
5571,-1.41
5572,-1.26
5573,-1.25
5574,-1.38
5575,-1.60
5576,-1.86
5577,-2.10
5578,-2.29
5579,-2.40
5580,-2.48
5581,-2.53
5582,-2.59
5583,-2.68
5584,-2.84
5585,-3.07
5586,-3.40
5587,-3.75
5588,-4.13
5589,-4.48
5590,-4.81
5591,-5.10
5592,-5.38
5593,-5.62
5594,-5.81
5595,-5.96
5596,-6.07
5597,-6.12
5598,-6.16
5599,-6.15
5600,-6.13
5601,-6.09
5602,-6.07
5603,-6.07
5604,-6.10
5605,-6.16
5606,-6.26
5607,-6.37
5608,-6.50
5609,-6.65
5610,-6.84
5611,-7.06
5612,-7.25
5613,-7.38
5614,-7.39
5615,-7.29
5616,-7.11
5617,-6.84
5618,-6.48
5619,-6.07
5620,-5.64
5621,-5.28
5622,-4.97
5623,-4.75
5624,-4.57
5625,-4.46
5626,-4.37
5627,-4.28
5628,-4.16
5629,-4.02
5630,-3.87
5631,-3.74
5632,-3.65
5633,-3.62
5634,-3.67
5635,-3.76
5636,-3.85
5637,-3.92
5638,-3.97
5639,-3.99
5640,-3.97
5641,-3.91
5642,-3.87
5643,-3.87
5644,-3.89
5645,-3.92
5646,-3.97
5647,-4.03
5648,-4.07
5649,-4.07
5650,-4.03
5651,-3.97
5652,-3.92
5653,-3.90
5654,-3.86
5655,-3.77
5656,-3.60
5657,-3.40
5658,-3.19
5659,-2.98
5660,-2.73
5661,-2.46
5662,-2.22
5663,-2.07
5664,-2.00
5665,-1.98
5666,-1.98
5667,-2.00
5668,-2.07
5669,-2.19
5670,-2.35
5671,-2.49
5672,-2.61
5673,-2.70
5674,-2.81
5675,-2.91
5676,-3.02
5677,-3.11
5678,-3.23
5679,-3.40
5680,-3.65
5681,-3.91
5682,-4.19
5683,-4.49
5684,-4.84
5685,-5.25
5686,-5.71
5687,-6.19
5688,-6.71
5689,-7.21
5690,-7.65
5691,-8.01
5692,-8.35
5693,-8.60
5694,-8.74
5695,-8.71
5696,-8.59
5697,-8.39
5698,-8.13
5699,-7.81
5700,-7.46
5701,-7.13
5702,-6.84
5703,-6.61
5704,-6.40
5705,-6.23
5706,-6.03
5707,-5.81
5708,-5.51
5709,-5.19
5710,-4.83
5711,-4.48
5712,-4.11
5713,-3.79
5714,-3.49
5715,-3.27
5716,-3.07
5717,-2.90
5718,-2.70
5719,-2.46
5720,-2.18
5721,-1.88
5722,-1.57
5723,-1.31
5724,-1.08
5725,-0.91
5726,-0.79
5727,-0.73
5728,-0.72
5729,-0.76
5730,-0.79
5731,-0.79
5732,-0.76
5733,-0.70
5734,-0.61
5735,-0.50
5736,-0.34
5737,-0.16
5738,0.03
5739,0.21
5740,0.36
5741,0.49
5742,0.57
5743,0.60
5744,0.56
5745,0.47
5746,0.36
5747,0.24
5748,0.10
5749,-0.05
5750,-0.19
5751,-0.34
5752,-0.52
5753,-0.69
5754,-0.85
5755,-0.97
5756,-1.06
5757,-1.11
5758,-1.14
5759,-1.17
5760,-1.24
5761,-1.38
5762,-1.63
5763,-1.96
5764,-2.36
5765,-2.76
5766,-3.19
5767,-3.58
5768,-3.94
5769,-4.23
5770,-4.46
5771,-4.67
5772,-4.91
5773,-5.13
5774,-5.34
5775,-5.49
5776,-5.62
5777,-5.72
5778,-5.82
5779,-5.87
5780,-5.93
5781,-6.01
5782,-6.15
5783,-6.30
5784,-6.46
5785,-6.63
5786,-6.87
5787,-7.16
5788,-7.50
5789,-7.83
5790,-8.13
5791,-8.36
5792,-8.54
5793,-8.62
5794,-8.65
5795,-8.64
5796,-8.64
5797,-8.67
5798,-8.75
5799,-8.86
5800,-9.00
5801,-9.16
5802,-9.32
5803,-9.47
5804,-9.57
5805,-9.59
5806,-9.59
5807,-9.61
5808,-9.70
5809,-9.86
5810,-10.03
5811,-10.18
5812,-10.30
5813,-10.40
5814,-10.44
5815,-10.41
5816,-10.27
5817,-10.06
5818,-9.84
5819,-9.67
5820,-9.51
5821,-9.36
5822,-9.22
5823,-9.08
5824,-8.88
5825,-8.59
5826,-8.19
5827,-7.71
5828,-7.19
5829,-6.71
5830,-6.29
5831,-5.97
5832,-5.73
5833,-5.62
5834,-5.61
5835,-5.68
5836,-5.75
5837,-5.82
5838,-5.84
5839,-5.81
5840,-5.73
5841,-5.61
5842,-5.48
5843,-5.39
5844,-5.35
5845,-5.36
5846,-5.36
5847,-5.36
5848,-5.37
5849,-5.40
5850,-5.42
5851,-5.42
5852,-5.42
5853,-5.41
5854,-5.43
5855,-5.46
5856,-5.50
5857,-5.52
5858,-5.57
5859,-5.69
5860,-5.91
5861,-6.13
5862,-6.35
5863,-6.53
5864,-6.74
5865,-6.94
5866,-7.08
5867,-7.17
5868,-7.29
5869,-7.46
5870,-7.66
5871,-7.81
5872,-7.91
5873,-7.97
5874,-8.00
5875,-7.93
5876,-7.75
5877,-7.48
5878,-7.20
5879,-6.99
5880,-6.86
5881,-6.84
5882,-6.90
5883,-7.03
5884,-7.15
5885,-7.21
5886,-7.18
5887,-7.06
5888,-6.87
5889,-6.61
5890,-6.36
5891,-6.15
5892,-6.03
5893,-5.99
5894,-6.05
5895,-6.20
5896,-6.48
5897,-6.83
5898,-7.22
5899,-7.61
5900,-8.01
5901,-8.36
5902,-8.64
5903,-8.79
5904,-8.84
5905,-8.77
5906,-8.60
5907,-8.35
5908,-8.13
5909,-7.97
5910,-7.90
5911,-7.90
5912,-7.98
5913,-8.16
5914,-8.41
5915,-8.65
5916,-8.83
5917,-8.96
5918,-9.03
5919,-9.06
5920,-9.01
5921,-8.90
5922,-8.74
5923,-8.55
5924,-8.34
5925,-8.10
5926,-7.86
5927,-7.65
5928,-7.47
5929,-7.33
5930,-7.21
5931,-7.13
5932,-7.04
5933,-6.92
5934,-6.73
5935,-6.48
5936,-6.14
5937,-5.78
5938,-5.42
5939,-5.12
5940,-4.93
5941,-4.87
5942,-4.91
5943,-5.00
5944,-5.13
5945,-5.29
5946,-5.42
5947,-5.55
5948,-5.67
5949,-5.81
5950,-5.99
5951,-6.20
5952,-6.42
5953,-6.64
5954,-6.81
5955,-6.87
5956,-6.77
5957,-6.52
5958,-6.23
5959,-5.92
5960,-5.62
5961,-5.36
5962,-5.14
5963,-5.02
5964,-4.99
5965,-4.99
5966,-4.97
5967,-4.92
5968,-4.86
5969,-4.79
5970,-4.71
5971,-4.62
5972,-4.58
5973,-4.61
5974,-4.69
5975,-4.81
5976,-4.97
5977,-5.15
5978,-5.33
5979,-5.48
5980,-5.62
5981,-5.71
5982,-5.71
5983,-5.65
5984,-5.58
5985,-5.54
5986,-5.55
5987,-5.58
5988,-5.65
5989,-5.74
5990,-5.83
5991,-5.89
5992,-5.91
5993,-5.87
5994,-5.81
5995,-5.73
5996,-5.59
5997,-5.45
5998,-5.30
5999,-5.16
6000,-4.96
6001,-4.67
6002,-4.27
6003,-3.81
6004,-3.33
6005,-2.92
6006,-2.62
6007,-2.43
6008,-2.34
6009,-2.39
6010,-2.54
6011,-2.75
6012,-2.93
6013,-3.02
6014,-3.07
6015,-3.12
6016,-3.19
6017,-3.29
6018,-3.42
6019,-3.59
6020,-3.80
6021,-4.02
6022,-4.20
6023,-4.30
6024,-4.25
6025,-4.07
6026,-3.80
6027,-3.49
6028,-3.20
6029,-2.95
6030,-2.79
6031,-2.73
6032,-2.79
6033,-2.94
6034,-3.15
6035,-3.40
6036,-3.63
6037,-3.78
6038,-3.81
6039,-3.76
6040,-3.64
6041,-3.49
6042,-3.32
6043,-3.17
6044,-3.07
6045,-3.04
6046,-3.03
6047,-3.00
6048,-2.96
6049,-2.92
6050,-2.91
6051,-2.91
6052,-2.93
6053,-2.99
6054,-3.11
6055,-3.26
6056,-3.41
6057,-3.56
6058,-3.74
6059,-3.94
6060,-4.14
6061,-4.29
6062,-4.43
6063,-4.59
6064,-4.84
6065,-5.10
6066,-5.37
6067,-5.61
6068,-5.87
6069,-6.16
6070,-6.48
6071,-6.81
6072,-7.15
6073,-7.47
6074,-7.77
6075,-8.00
6076,-8.22
6077,-8.42
6078,-8.62
6079,-8.79
6080,-8.97
6081,-9.17
6082,-9.43
6083,-9.69
6084,-9.96
6085,-10.19
6086,-10.44
6087,-10.70
6088,-10.97
6089,-11.21
6090,-11.42
6091,-11.60
6092,-11.76
6093,-11.87
6094,-11.95
6095,-11.98
6096,-11.96
6097,-11.91
6098,-11.80
6099,-11.64
6100,-11.43
6101,-11.20
6102,-10.95
6103,-10.68
6104,-10.37
6105,-10.05
6106,-9.76
6107,-9.55
6108,-9.40
6109,-9.28
6110,-9.19
6111,-9.16
6112,-9.19
6113,-9.28
6114,-9.38
6115,-9.45
6116,-9.48
6117,-9.47
6118,-9.45
6119,-9.41
6120,-9.41
6121,-9.50
6122,-9.70
6123,-9.96
6124,-10.29
6125,-10.64
6126,-11.05
6127,-11.47
6128,-11.87
6129,-12.20
6130,-12.46
6131,-12.66
6132,-12.82
6133,-12.92
6134,-12.95
6135,-12.91
6136,-12.82
6137,-12.66
6138,-12.46
6139,-12.18
6140,-11.86
6141,-11.49
6142,-11.13
6143,-10.83
6144,-10.64
6145,-10.55
6146,-10.52
6147,-10.56
6148,-10.67
6149,-10.85
6150,-11.05
6151,-11.23
6152,-11.42
6153,-11.63
6154,-11.83
6155,-12.01
6156,-12.17
6157,-12.29
6158,-12.36
6159,-12.35
6160,-12.31
6161,-12.27
6162,-12.29
6163,-12.37
6164,-12.53
6165,-12.74
6166,-13.01
6167,-13.31
6168,-13.62
6169,-13.89
6170,-14.09
6171,-14.24
6172,-14.34
6173,-14.43
6174,-14.52
6175,-14.61
6176,-14.70
6177,-14.79
6178,-14.88
6179,-14.96
6180,-15.05
6181,-15.15
6182,-15.23
6183,-15.26
6184,-15.24
6185,-15.17
6186,-15.09
6187,-15.03
6188,-15.00
6189,-14.97
6190,-14.91
6191,-14.80
6192,-14.63
6193,-14.43
6194,-14.14
6195,-13.82
6196,-13.47
6197,-13.15
6198,-12.81
6199,-12.49
6200,-12.19
6201,-11.99
6202,-11.85
6203,-11.74
6204,-11.60
6205,-11.46
6206,-11.31
6207,-11.18
6208,-10.96
6209,-10.67
6210,-10.31
6211,-9.96
6212,-9.56
6213,-9.12
6214,-8.63
6215,-8.16
6216,-7.70
6217,-7.26
6218,-6.79
6219,-6.36
6220,-5.93
6221,-5.55
6222,-5.16
6223,-4.78
6224,-4.41
6225,-4.14
6226,-3.97
6227,-3.90
6228,-3.86
6229,-3.86
6230,-3.90
6231,-3.99
6232,-4.12
6233,-4.24
6234,-4.32
6235,-4.35
6236,-4.36
6237,-4.35
6238,-4.33
6239,-4.30
6240,-4.30
6241,-4.35
6242,-4.50
6243,-4.73
6244,-5.04
6245,-5.40
6246,-5.81
6247,-6.20
6248,-6.52
6249,-6.76
6250,-6.94
6251,-7.07
6252,-7.21
6253,-7.35
6254,-7.57
6255,-7.82
6256,-8.15
6257,-8.50
6258,-8.93
6259,-9.35
6260,-9.80
6261,-10.22
6262,-10.64
6263,-11.01
6264,-11.37
6265,-11.66
6266,-11.93
6267,-12.15
6268,-12.37
6269,-12.58
6270,-12.81
6271,-13.03
6272,-13.28
6273,-13.51
6274,-13.76
6275,-13.95
6276,-14.11
6277,-14.20
6278,-14.25
6279,-14.31
6280,-14.42
6281,-14.56
6282,-14.72
6283,-14.87
6284,-15.04
6285,-15.18
6286,-15.26
6287,-15.23
6288,-15.14
6289,-15.01
6290,-14.88
6291,-14.73
6292,-14.55
6293,-14.38
6294,-14.21
6295,-14.08
6296,-13.90
6297,-13.70
6298,-13.44
6299,-13.15
6300,-12.80
6301,-12.46
6302,-12.06
6303,-11.66
6304,-11.21
6305,-10.73
6306,-10.19
6307,-9.64
6308,-9.06
6309,-8.50
6310,-7.91
6311,-7.39
6312,-6.94
6313,-6.58
6314,-6.26
6315,-5.97
6316,-5.71
6317,-5.52
6318,-5.29
6319,-5.00
6320,-4.62
6321,-4.23
6322,-3.88
6323,-3.69
6324,-3.60
6325,-3.61
6326,-3.66
6327,-3.78
6328,-3.97
6329,-4.16
6330,-4.25
6331,-4.23
6332,-4.11
6333,-3.97
6334,-3.87
6335,-3.81
6336,-3.82
6337,-3.94
6338,-4.17
6339,-4.43
6340,-4.71
6341,-4.98
6342,-5.25
6343,-5.48
6344,-5.68
6345,-5.86
6346,-6.07
6347,-6.30
6348,-6.55
6349,-6.78
6350,-7.04
6351,-7.30
6352,-7.55
6353,-7.73
6354,-7.87
6355,-7.97
6356,-8.09
6357,-8.24
6358,-8.45
6359,-8.68
6360,-8.94
6361,-9.17
6362,-9.38
6363,-9.54
6364,-9.62
6365,-9.61
6366,-9.55
6367,-9.48
6368,-9.47
6369,-9.52
6370,-9.66
6371,-9.83
6372,-10.06
6373,-10.26
6374,-10.42
6375,-10.51
6376,-10.56
6377,-10.57
6378,-10.61
6379,-10.70
6380,-10.89
6381,-11.13
6382,-11.35
6383,-11.51
6384,-11.58
6385,-11.59
6386,-11.49
6387,-11.28
6388,-10.96
6389,-10.60
6390,-10.24
6391,-9.91
6392,-9.61
6393,-9.32
6394,-9.03
6395,-8.74
6396,-8.40
6397,-8.06
6398,-7.68
6399,-7.37
6400,-7.06
6401,-6.77
6402,-6.44
6403,-6.10
6404,-5.71
6405,-5.30
6406,-4.83
6407,-4.33
6408,-3.78
6409,-3.21
6410,-2.61
6411,-2.03
6412,-1.46
6413,-0.95
6414,-0.49
6415,-0.11
6416,0.19
6417,0.37
6418,0.46
6419,0.47
6420,0.47
6421,0.43
6422,0.40
6423,0.33
6424,0.24
6425,0.13
6426,0.01
6427,-0.15
6428,-0.37
6429,-0.60
6430,-0.80
6431,-0.92
6432,-1.01
6433,-1.05
6434,-1.09
6435,-1.11
6436,-1.20
6437,-1.36
6438,-1.66
6439,-2.04
6440,-2.51
6441,-2.98
6442,-3.44
6443,-3.79
6444,-4.06
6445,-4.19
6446,-4.24
6447,-4.23
6448,-4.26
6449,-4.36
6450,-4.61
6451,-4.96
6452,-5.46
6453,-6.02
6454,-6.60
6455,-7.10
6456,-7.54
6457,-7.89
6458,-8.19
6459,-8.41
6460,-8.62
6461,-8.85
6462,-9.18
6463,-9.55
6464,-9.98
6465,-10.39
6466,-10.83
6467,-11.25
6468,-11.60
6469,-11.83
6470,-12.00
6471,-12.11
6472,-12.19
6473,-12.25
6474,-12.31
6475,-12.36
6476,-12.44
6477,-12.52
6478,-12.60
6479,-12.66
6480,-12.71
6481,-12.70
6482,-12.63
6483,-12.51
6484,-12.37
6485,-12.25
6486,-12.15
6487,-12.09
6488,-12.08
6489,-12.12
6490,-12.17
6491,-12.22
6492,-12.30
6493,-12.39
6494,-12.48
6495,-12.55
6496,-12.57
6497,-12.54
6498,-12.47
6499,-12.37
6500,-12.28
6501,-12.19
6502,-12.10
6503,-12.02
6504,-11.92
6505,-11.76
6506,-11.54
6507,-11.28
6508,-10.99
6509,-10.73
6510,-10.46
6511,-10.23
6512,-10.03
6513,-9.89
6514,-9.77
6515,-9.66
6516,-9.51
6517,-9.35
6518,-9.11
6519,-8.85
6520,-8.54
6521,-8.25
6522,-7.97
6523,-7.77
6524,-7.63
6525,-7.58
6526,-7.56
6527,-7.54
6528,-7.46
6529,-7.32
6530,-7.08
6531,-6.78
6532,-6.42
6533,-6.06
6534,-5.78
6535,-5.62
6536,-5.61
6537,-5.69
6538,-5.87
6539,-6.12
6540,-6.40
6541,-6.67
6542,-6.89
6543,-7.03
6544,-7.14
6545,-7.26
6546,-7.41
6547,-7.58
6548,-7.80
6549,-8.09
6550,-8.48
6551,-8.96
6552,-9.51
6553,-10.05
6554,-10.54
6555,-10.96
6556,-11.32
6557,-11.57
6558,-11.75
6559,-11.86
6560,-12.00
6561,-12.17
6562,-12.37
6563,-12.58
6564,-12.83
6565,-13.09
6566,-13.33
6567,-13.48
6568,-13.55
6569,-13.56
6570,-13.47
6571,-13.29
6572,-13.02
6573,-12.72
6574,-12.44
6575,-12.21
6576,-11.96
6577,-11.74
6578,-11.52
6579,-11.31
6580,-11.04
6581,-10.70
6582,-10.26
6583,-9.82
6584,-9.35
6585,-8.91
6586,-8.51
6587,-8.22
6588,-7.99
6589,-7.83
6590,-7.65
6591,-7.48
6592,-7.29
6593,-7.16
6594,-7.03
6595,-6.92
6596,-6.77
6597,-6.60
6598,-6.41
6599,-6.20
6600,-5.92
6601,-5.58
6602,-5.16
6603,-4.74
6604,-4.33
6605,-3.99
6606,-3.68
6607,-3.41
6608,-3.15
6609,-2.92
6610,-2.70
6611,-2.50
6612,-2.24
6613,-1.95
6614,-1.63
6615,-1.34
6616,-1.03
6617,-0.71
6618,-0.36
6619,-0.01
6620,0.37
6621,0.75
6622,1.15
6623,1.51
6624,1.79
6625,1.94
6626,1.98
6627,1.91
6628,1.77
6629,1.56
6630,1.28
6631,0.95
6632,0.59
6633,0.24
6634,-0.11
6635,-0.43
6636,-0.78
6637,-1.12
6638,-1.50
6639,-1.85
6640,-2.22
6641,-2.56
6642,-2.92
6643,-3.29
6644,-3.77
6645,-4.32
6646,-5.00
6647,-5.70
6648,-6.46
6649,-7.20
6650,-7.92
6651,-8.50
6652,-8.98
6653,-9.32
6654,-9.64
6655,-9.91
6656,-10.22
6657,-10.50
6658,-10.84
6659,-11.19
6660,-11.56
6661,-11.86
6662,-12.07
6663,-12.15
6664,-12.14
6665,-12.04
6666,-11.90
6667,-11.75
6668,-11.62
6669,-11.56
6670,-11.58
6671,-11.65
6672,-11.69
6673,-11.66
6674,-11.57
6675,-11.45
6676,-11.29
6677,-11.08
6678,-10.83
6679,-10.62
6680,-10.51
6681,-10.51
6682,-10.59
6683,-10.72
6684,-10.85
6685,-10.95
6686,-10.94
6687,-10.83
6688,-10.60
6689,-10.37
6690,-10.15
6691,-9.97
6692,-9.82
6693,-9.67
6694,-9.51
6695,-9.31
6696,-9.01
6697,-8.60
6698,-8.06
6699,-7.45
6700,-6.84
6701,-6.33
6702,-5.99
6703,-5.81
6704,-5.74
6705,-5.72
6706,-5.73
6707,-5.76
6708,-5.79
6709,-5.82
6710,-5.86
6711,-5.94
6712,-6.10
6713,-6.32
6714,-6.54
6715,-6.71
6716,-6.87
6717,-6.95
6718,-6.99
6719,-6.97
6720,-6.97
6721,-7.06
6722,-7.27
6723,-7.56
6724,-7.92
6725,-8.31
6726,-8.76
6727,-9.19
6728,-9.58
6729,-9.88
6730,-10.15
6731,-10.41
6732,-10.67
6733,-10.91
6734,-11.14
6735,-11.33
6736,-11.53
6737,-11.70
6738,-11.90
6739,-12.09
6740,-12.32
6741,-12.55
6742,-12.83
6743,-13.15
6744,-13.53
6745,-13.88
6746,-14.23
6747,-14.55
6748,-14.88
6749,-15.20
6750,-15.53
6751,-15.85
6752,-16.19
6753,-16.51
6754,-16.85
6755,-17.16
6756,-17.50
6757,-17.82
6758,-18.14
6759,-18.43
6760,-18.73
6761,-18.99
6762,-19.22
6763,-19.36
6764,-19.42
6765,-19.42
6766,-19.38
6767,-19.28
6768,-19.17
6769,-19.10
6770,-19.17
6771,-19.37
6772,-19.68
6773,-20.02
6774,-20.33
6775,-20.57
6776,-20.71
6777,-20.74
6778,-20.68
6779,-20.58
6780,-20.48
6781,-20.39
6782,-20.36
6783,-20.39
6784,-20.47
6785,-20.57
6786,-20.64
6787,-20.67
6788,-20.67
6789,-20.67
6790,-20.68
6791,-20.68
6792,-20.65
6793,-20.59
6794,-20.50
6795,-20.35
6796,-20.12
6797,-19.78
6798,-19.39
6799,-18.99
6800,-18.67
6801,-18.46
6802,-18.36
6803,-18.40
6804,-18.54
6805,-18.75
6806,-19.00
6807,-19.27
6808,-19.55
6809,-19.81
6810,-20.07
6811,-20.31
6812,-20.53
6813,-20.73
6814,-20.94
6815,-21.13
6816,-21.26
6817,-21.35
6818,-21.42
6819,-21.50
6820,-21.61
6821,-21.74
6822,-21.87
6823,-22.02
6824,-22.16
6825,-22.29
6826,-22.36
6827,-22.37
6828,-22.29
6829,-22.13
6830,-21.92
6831,-21.69
6832,-21.43
6833,-21.17
6834,-20.87
6835,-20.58
6836,-20.30
6837,-20.05
6838,-19.70
6839,-19.28
6840,-18.71
6841,-18.10
6842,-17.37
6843,-16.61
6844,-15.79
6845,-15.01
6846,-14.17
6847,-13.32
6848,-12.40
6849,-11.48
6850,-10.56
6851,-9.74
6852,-9.00
6853,-8.45
6854,-8.02
6855,-7.80
6856,-7.71
6857,-7.76
6858,-7.84
6859,-7.91
6860,-7.89
6861,-7.80
6862,-7.67
6863,-7.52
6864,-7.35
6865,-7.24
6866,-7.20
6867,-7.23
6868,-7.29
6869,-7.32
6870,-7.30
6871,-7.22
6872,-7.06
6873,-6.84
6874,-6.59
6875,-6.42
6876,-6.39
6877,-6.55
6878,-6.80
6879,-7.11
6880,-7.43
6881,-7.71
6882,-7.84
6883,-7.75
6884,-7.46
6885,-7.06
6886,-6.61
6887,-6.14
6888,-5.67
6889,-5.25
6890,-4.91
6891,-4.68
6892,-4.52
6893,-4.41
6894,-4.29
6895,-4.20
6896,-4.16
6897,-4.17
6898,-4.15
6899,-4.14
6900,-4.10
6901,-4.07
6902,-4.02
6903,-3.93
6904,-3.80
6905,-3.65
6906,-3.49
6907,-3.31
6908,-3.10
6909,-2.89
6910,-2.72
6911,-2.57
6912,-2.42
6913,-2.27
6914,-2.17
6915,-2.15
6916,-2.15
6917,-2.18
6918,-2.26
6919,-2.38
6920,-2.49
6921,-2.53
6922,-2.46
6923,-2.31
6924,-2.09
6925,-1.81
6926,-1.53
6927,-1.27
6928,-1.14
6929,-1.13
6930,-1.27
6931,-1.54
6932,-1.97
6933,-2.47
6934,-3.01
6935,-3.48
6936,-3.91
6937,-4.26
6938,-4.54
6939,-4.75
6940,-4.91
6941,-5.05
6942,-5.18
6943,-5.30
6944,-5.44
6945,-5.58
6946,-5.72
6947,-5.85
6948,-5.97
6949,-6.06
6950,-6.09
6951,-6.07
6952,-5.97
6953,-5.83
6954,-5.62
6955,-5.39
6956,-5.10
6957,-4.81
6958,-4.50
6959,-4.20
6960,-3.90
6961,-3.61
6962,-3.31
6963,-2.98
6964,-2.61
6965,-2.22
6966,-1.87
6967,-1.63
6968,-1.50
6969,-1.47
6970,-1.55
6971,-1.73
6972,-1.97
6973,-2.25
6974,-2.52
6975,-2.76
6976,-2.95
6977,-3.11
6978,-3.22
6979,-3.31
6980,-3.36
6981,-3.33
6982,-3.22
6983,-3.01
6984,-2.71
6985,-2.34
6986,-1.95
6987,-1.56
6988,-1.21
6989,-0.95
6990,-0.76
6991,-0.70
6992,-0.76
6993,-0.92
6994,-1.10
6995,-1.23
6996,-1.25
6997,-1.19
6998,-1.06
6999,-0.92
7000,-0.77
7001,-0.68
7002,-0.66
7003,-0.72
7004,-0.84
7005,-1.00
7006,-1.17
7007,-1.28
7008,-1.31
7009,-1.25
7010,-1.14
7011,-1.02
7012,-0.89
7013,-0.76
7014,-0.70
7015,-0.72
7016,-0.84
7017,-0.98
7018,-1.17
7019,-1.37
7020,-1.63
7021,-1.89
7022,-2.14
7023,-2.34
7024,-2.57
7025,-2.82
7026,-3.13
7027,-3.49
7028,-3.94
7029,-4.48
7030,-5.04
7031,-5.55
7032,-5.99
7033,-6.34
7034,-6.62
7035,-6.76
7036,-6.78
7037,-6.71
7038,-6.65
7039,-6.64
7040,-6.73
7041,-6.88
7042,-7.09
7043,-7.29
7044,-7.48
7045,-7.64
7046,-7.72
7047,-7.72
7048,-7.63
7049,-7.51
7050,-7.42
7051,-7.35
7052,-7.30
7053,-7.25
7054,-7.17
7055,-7.06
7056,-6.88
7057,-6.61
7058,-6.24
7059,-5.83
7060,-5.39
7061,-5.00
7062,-4.67
7063,-4.44
7064,-4.28
7065,-4.20
7066,-4.14
7067,-4.08
7068,-4.01
7069,-3.92
7070,-3.83
7071,-3.77
7072,-3.76
7073,-3.85
7074,-4.05
7075,-4.33
7076,-4.61
7077,-4.85
7078,-5.03
7079,-5.08
7080,-5.02
7081,-4.82
7082,-4.58
7083,-4.36
7084,-4.26
7085,-4.28
7086,-4.45
7087,-4.72
7088,-5.07
7089,-5.39
7090,-5.66
7091,-5.81
7092,-5.86
7093,-5.85
7094,-5.84
7095,-5.82
7096,-5.86
7097,-5.95
7098,-6.11
7099,-6.28
7100,-6.44
7101,-6.55
7102,-6.69
7103,-6.83
7104,-6.98
7105,-7.12
7106,-7.32
7107,-7.58
7108,-7.89
7109,-8.19
7110,-8.48
7111,-8.78
7112,-9.09
7113,-9.38
7114,-9.65
7115,-9.88
7116,-10.14
7117,-10.39
7118,-10.68
7119,-10.97
7120,-11.33
7121,-11.73
7122,-12.21
7123,-12.69
7124,-13.15
7125,-13.59
7126,-14.07
7127,-14.56
7128,-15.08
7129,-15.54
7130,-16.03
7131,-16.49
7132,-16.94
7133,-17.33
7134,-17.68
7135,-17.97
7136,-18.20
7137,-18.34
7138,-18.45
7139,-18.56
7140,-18.73
7141,-18.91
7142,-19.06
7143,-19.16
7144,-19.20
7145,-19.17
7146,-19.04
7147,-18.80
7148,-18.46
7149,-18.07
7150,-17.65
7151,-17.27
7152,-16.93
7153,-16.64
7154,-16.31
7155,-15.98
7156,-15.60
7157,-15.24
7158,-14.85
7159,-14.49
7160,-14.12
7161,-13.83
7162,-13.53
7163,-13.30
7164,-13.05
7165,-12.79
7166,-12.41
7167,-11.99
7168,-11.51
7169,-11.07
7170,-10.56
7171,-10.06
7172,-9.51
7173,-9.02
7174,-8.45
7175,-7.85
7176,-7.16
7177,-6.45
7178,-5.66
7179,-4.85
7180,-3.97
7181,-3.15
7182,-2.35
7183,-1.68
7184,-1.09
7185,-0.66
7186,-0.32
7187,-0.09
7188,0.08
7189,0.18
7190,0.28
7191,0.37
7192,0.48
7193,-0.31
7194,0.13
7195,2.89
7196,3.97
7197,-1.79
7198,-7.16
7199,4.46
7200,20.90
