1,170.17
2,249.99
3,249.99
4,249.99
5,240.71
6,242.81
7,249.99
8,249.99
9,249.99
10,201.27
11,97.47
12,-14.50
13,-93.21
14,-116.96
15,-81.64
16,3.82
17,111.89
18,199.56
19,246.17
20,249.99
21,249.99
22,244.83
23,248.90
24,249.99
25,249.99
26,211.90
27,124.04
28,12.04
29,-95.37
30,-179.54
31,-233.23
32,-250.00
33,-250.00
34,-241.87
35,-208.96
36,-163.70
37,-114.20
38,-77.15
39,-60.14
40,-61.81
41,-71.22
42,-80.84
43,-86.05
44,-84.56
45,-77.46
46,-66.52
47,-56.66
48,-49.39
49,-46.51
50,-46.32
51,-47.78
52,-48.93
53,-49.03
54,-47.70
55,-45.52
56,-42.87
57,-40.62
58,-38.78
59,-37.63
60,-36.66
61,-35.78
62,-34.66
63,-33.45
64,-32.14
65,-30.95
66,-29.75
67,-28.66
68,-27.51
69,-26.47
70,-25.45
71,-24.57
72,-23.74
73,-23.06
74,-22.46
75,-22.03
76,-21.64
77,-21.38
78,-21.14
79,-20.99
80,-20.76
81,-20.49
82,-20.11
83,-19.70
84,-19.19
85,-18.68
86,-18.14
87,-17.67
88,-17.22
89,-16.85
90,-16.51
91,-16.22
92,-15.91
93,-15.59
94,-15.24
95,-14.88
96,-14.50
97,-14.16
98,-13.82
99,-13.53
100,-13.26
101,-13.03
102,-12.79
103,-12.60
104,-12.41
105,-12.28
106,-12.12
107,-11.99
108,-11.83
109,-11.69
110,-11.51
111,-11.28
112,-10.96
113,-10.55
114,-10.03
115,-9.48
116,-8.87
117,-8.35
118,-7.90
119,-7.58
120,-7.33
121,-7.16
122,-7.01
123,-6.88
124,-6.67
125,-6.34
126,-5.90
127,-5.42
128,-4.99
129,-4.68
130,-4.52
131,-4.55
132,-4.81
133,-5.23
134,-5.71
135,-6.14
136,-6.48
137,-6.72
138,-6.84
139,-6.87
140,-6.87
141,-6.90
142,-6.95
143,-6.99
144,-6.97
145,-6.88
146,-6.70
147,-6.43
148,-6.07
149,-5.65
150,-5.19
151,-4.77
152,-4.44
153,-4.20
154,-4.03
155,-3.88
156,-3.76
157,-3.71
158,-3.68
159,-3.70
160,-3.68
161,-3.62
162,-3.52
163,-3.40
164,-3.28
165,-3.13
166,-2.91
167,-2.69
168,-2.49
169,-2.39
170,-2.38
171,-2.45
172,-2.60
173,-2.81
174,-3.01
175,-3.14
176,-3.17
177,-3.14
178,-3.04
179,-2.87
180,-2.62
181,-2.32
182,-1.98
183,-1.70
184,-1.58
185,-1.64
186,-1.85
187,-2.15
188,-2.52
189,-2.88
190,-3.16
191,-3.29
192,-3.27
193,-3.13
194,-2.94
195,-2.76
196,-2.66
197,-2.66
198,-2.72
199,-2.78
200,-2.82
201,-2.79
202,-2.67
203,-2.45
204,-2.20
205,-2.01
206,-1.95
207,-2.05
208,-2.29
209,-2.62
210,-2.98
211,-3.31
212,-3.58
213,-3.73
214,-3.74
215,-3.65
216,-3.52
217,-3.43
218,-3.40
219,-3.43
220,-3.53
221,-3.68
222,-3.82
223,-3.92
224,-3.96
225,-3.96
226,-3.92
227,-3.87
228,-3.78
229,-3.70
230,-3.59
231,-3.42
232,-3.11
233,-2.70
234,-2.20
235,-1.66
236,-1.08
237,-0.52
238,-0.01
239,0.38
240,0.67
241,0.87
242,1.01
243,1.05
244,1.08
245,1.10
246,1.17
247,1.27
248,1.32
249,1.30
250,1.19
251,1.03
252,0.85
253,0.67
254,0.53
255,0.43
256,0.40
257,0.43
258,0.52
259,0.64
260,0.76
261,0.82
262,0.79
263,0.67
264,0.51
265,0.35
266,0.22
267,0.17
268,0.19
269,0.27
270,0.41
271,0.57
272,0.75
273,0.92
274,1.07
275,1.16
276,1.21
277,1.24
278,1.27
279,1.29
280,1.30
281,1.31
282,1.31
283,1.31
284,1.30
285,1.30
286,1.33
287,1.41
288,1.55
289,1.70
290,1.86
291,2.04
292,2.23
293,2.39
294,2.46
295,2.40
296,2.21
297,1.94
298,1.63
299,1.33
300,1.05
301,0.85
302,0.72
303,0.66
304,0.63
305,0.64
306,0.66
307,0.66
308,0.60
309,0.48
310,0.36
311,0.29
312,0.28
313,0.32
314,0.39
315,0.47
316,0.58
317,0.66
318,0.73
319,0.76
320,0.75
321,0.68
322,0.60
323,0.54
324,0.55
325,0.63
326,0.80
327,1.05
328,1.35
329,1.68
330,1.97
331,2.19
332,2.31
333,2.33
334,2.27
335,2.14
336,2.01
337,1.88
338,1.81
339,1.77
340,1.81
341,1.89
342,2.02
343,2.17
344,2.34
345,2.55
346,2.79
347,3.04
348,3.25
349,3.40
350,3.49
351,3.56
352,3.59
353,3.59
354,3.53
355,3.44
356,3.35
357,3.23
358,3.03
359,2.73
360,2.38
361,2.01
362,1.65
363,1.32
364,1.10
365,1.08
366,1.23
367,1.51
368,1.79
369,2.02
370,2.11
371,2.00
372,1.61
373,0.98
374,0.20
375,-0.60
376,-1.32
377,-1.91
378,-2.33
379,-2.54
380,-2.56
381,-2.42
382,-2.24
383,-2.05
384,-1.91
385,-1.82
386,-1.78
387,-1.79
388,-1.81
389,-1.81
390,-1.75
391,-1.66
392,-1.58
393,-1.52
394,-1.46
395,-1.41
396,-1.35
397,-1.30
398,-1.20
399,-1.06
400,-0.87
401,-0.69
402,-0.52
403,-0.40
404,-0.34
405,-0.31
406,-0.31
407,-0.28
408,-0.19
409,-0.04
410,0.16
411,0.34
412,0.45
413,0.45
414,0.35
415,0.20
416,0.03
417,-0.12
418,-0.25
419,-0.34
420,-0.37
421,-0.40
422,-0.47
423,-0.62
424,-0.82
425,-1.07
426,-1.34
427,-1.58
428,-1.75
429,-1.78
430,-1.67
431,-1.49
432,-1.29
433,-1.14
434,-1.04
435,-1.01
436,-1.05
437,-1.11
438,-1.14
439,-1.09
440,-0.93
441,-0.69
442,-0.37
443,-0.07
444,0.14
445,0.20
446,0.09
447,-0.12
448,-0.37
449,-0.59
450,-0.72
451,-0.76
452,-0.65
453,-0.48
454,-0.27
455,-0.08
456,0.08
457,0.19
458,0.23
459,0.22
460,0.27
461,0.41
462,0.66
463,0.96
464,1.31
465,1.70
466,2.10
467,2.43
468,2.63
469,2.66
470,2.56
471,2.34
472,2.03
473,1.66
474,1.30
475,1.04
476,0.89
477,0.83
478,0.82
479,0.83
480,0.83
481,0.80
482,0.71
483,0.56
484,0.38
485,0.24
486,0.12
487,0.05
488,-0.07
489,-0.24
490,-0.50
491,-0.79
492,-1.12
493,-1.45
494,-1.77
495,-2.01
496,-2.15
497,-2.20
498,-2.24
499,-2.28
500,-2.39
501,-2.57
502,-2.85
503,-3.18
504,-3.49
505,-3.73
506,-3.92
507,-4.04
508,-4.04
509,-3.92
510,-3.73
511,-3.48
512,-3.19
513,-2.89
514,-2.63
515,-2.45
516,-2.33
517,-2.28
518,-2.29
519,-2.36
520,-2.40
521,-2.38
522,-2.27
523,-2.09
524,-1.84
525,-1.54
526,-1.21
527,-0.89
528,-0.56
529,-0.24
530,0.11
531,0.43
532,0.73
533,0.97
534,1.15
535,1.27
536,1.32
537,1.31
538,1.30
539,1.32
540,1.43
541,1.65
542,1.95
543,2.24
544,2.48
545,2.61
546,2.61
547,2.48
548,2.24
549,1.98
550,1.75
551,1.62
552,1.59
553,1.63
554,1.71
555,1.80
556,1.86
557,1.89
558,1.91
559,1.94
560,1.97
561,2.04
562,2.14
563,2.26
564,2.35
565,2.39
566,2.37
567,2.27
568,2.09
569,1.88
570,1.72
571,1.65
572,1.67
573,1.74
574,1.83
575,1.91
576,1.98
577,1.98
578,1.93
579,1.80
580,1.62
581,1.42
582,1.33
583,1.38
584,1.59
585,1.87
586,2.16
587,2.43
588,2.66
589,2.85
590,2.94
591,2.94
592,2.89
593,2.85
594,2.85
595,2.88
596,2.94
597,3.01
598,3.05
599,3.01
600,2.91
601,2.75
602,2.61
603,2.52
604,2.48
605,2.54
606,2.70
607,2.95
608,3.22
609,3.41
610,3.44
611,3.29
612,2.98
613,2.56
614,2.06
615,1.58
616,1.18
617,0.90
618,0.75
619,0.73
620,0.83
621,0.99
622,1.10
623,1.14
624,1.11
625,1.05
626,0.95
627,0.79
628,0.62
629,0.50
630,0.48
631,0.56
632,0.71
633,0.90
634,1.14
635,1.40
636,1.64
637,1.80
638,1.88
639,1.89
640,1.89
641,1.89
642,1.93
643,1.98
644,2.03
645,2.13
646,2.30
647,2.54
648,2.78
649,2.97
650,3.11
651,3.19
652,3.20
653,3.07
654,2.85
655,2.57
656,2.30
657,2.05
658,1.88
659,1.82
660,1.91
661,2.12
662,2.37
663,2.59
664,2.75
665,2.87
666,2.92
667,2.94
668,2.91
669,2.87
670,2.82
671,2.77
672,2.70
673,2.55
674,2.27
675,1.88
676,1.46
677,1.06
678,0.69
679,0.39
680,0.23
681,0.23
682,0.34
683,0.47
684,0.58
685,0.70
686,0.84
687,0.98
688,1.13
689,1.25
690,1.35
691,1.44
692,1.50
693,1.50
694,1.43
695,1.31
696,1.17
697,1.04
698,0.98
699,1.05
700,1.24
701,1.50
702,1.81
703,2.11
704,2.40
705,2.63
706,2.79
707,2.82
708,2.74
709,2.58
710,2.43
711,2.33
712,2.32
713,2.34
714,2.41
715,2.56
716,2.82
717,3.14
718,3.47
719,3.72
720,3.86
721,3.88
722,3.81
723,3.66
724,3.49
725,3.36
726,3.30
727,3.30
728,3.36
729,3.43
730,3.44
731,3.36
732,3.14
733,2.82
734,2.37
735,1.89
736,1.46
737,1.15
738,1.01
739,1.05
740,1.24
741,1.48
742,1.68
743,1.82
744,1.87
745,1.83
746,1.69
747,1.51
748,1.36
749,1.30
750,1.30
751,1.34
752,1.40
753,1.53
754,1.66
755,1.73
756,1.66
757,1.50
758,1.35
759,1.25
760,1.24
761,1.30
762,1.46
763,1.69
764,1.96
765,2.22
766,2.42
767,2.53
768,2.54
769,2.49
770,2.41
771,2.35
772,2.27
773,2.19
774,2.11
775,2.04
776,1.98
777,1.90
778,1.82
779,1.72
780,1.58
781,1.41
782,1.21
783,0.97
784,0.63
785,0.18
786,-0.31
787,-0.72
788,-1.07
789,-1.30
790,-1.44
791,-1.46
792,-1.40
793,-1.27
794,-1.15
795,-1.08
796,-1.08
797,-1.12
798,-1.17
799,-1.20
800,-1.18
801,-1.09
802,-0.93
803,-0.75
804,-0.59
805,-0.47
806,-0.38
807,-0.35
808,-0.41
809,-0.56
810,-0.76
811,-0.92
812,-0.98
813,-0.92
814,-0.72
815,-0.43
816,-0.06
817,0.30
818,0.63
819,0.86
820,0.99
821,1.02
822,0.98
823,0.92
824,0.85
825,0.79
826,0.75
827,0.71
828,0.72
829,0.79
830,0.88
831,0.94
832,0.92
833,0.86
834,0.79
835,0.73
836,0.66
837,0.57
838,0.50
839,0.43
840,0.38
841,0.35
842,0.36
843,0.41
844,0.54
845,0.75
846,1.05
847,1.41
848,1.79
849,2.13
850,2.36
851,2.43
852,2.29
853,1.95
854,1.47
855,0.92
856,0.40
857,-0.03
858,-0.31
859,-0.46
860,-0.51
861,-0.53
862,-0.56
863,-0.59
864,-0.62
865,-0.58
866,-0.47
867,-0.30
868,-0.08
869,0.16
870,0.42
871,0.63
872,0.73
873,0.71
874,0.60
875,0.47
876,0.36
877,0.29
878,0.31
879,0.40
880,0.56
881,0.74
882,0.92
883,1.06
884,1.18
885,1.27
886,1.32
887,1.32
888,1.28
889,1.25
890,1.24
891,1.25
892,1.24
893,1.17
894,1.08
895,0.95
896,0.81
897,0.64
898,0.40
899,0.14
900,-0.13
901,-0.34
902,-0.50
903,-0.58
904,-0.61
905,-0.61
906,-0.60
907,-0.56
908,-0.51
909,-0.46
910,-0.40
911,-0.31
912,-0.14
913,0.09
914,0.32
915,0.48
916,0.58
917,0.63
918,0.64
919,0.61
920,0.59
921,0.58
922,0.61
923,0.69
924,0.86
925,1.08
926,1.28
927,1.40
928,1.43
929,1.36
930,1.24
931,1.11
932,1.02
933,0.99
934,1.05
935,1.14
936,1.22
937,1.25
938,1.24
939,1.21
940,1.15
941,1.09
942,1.07
943,1.15
944,1.36
945,1.65
946,1.89
947,1.99
948,1.87
949,1.53
950,1.04
951,0.49
952,-0.01
953,-0.34
954,-0.45
955,-0.30
956,0.08
957,0.61
958,1.14
959,1.57
960,1.82
961,1.91
962,1.88
963,1.79
964,1.63
965,1.48
966,1.42
967,1.44
968,1.49
969,1.50
970,1.49
971,1.45
972,1.36
973,1.22
974,1.05
975,0.89
976,0.76
977,0.64
978,0.56
979,0.50
980,0.42
981,0.31
982,0.14
983,-0.04
984,-0.22
985,-0.40
986,-0.58
987,-0.73
988,-0.82
989,-0.86
990,-0.83
991,-0.70
992,-0.46
993,-0.08
994,0.41
995,1.00
996,1.65
997,2.27
998,2.78
999,3.08
1000,3.18
1001,3.08
1002,2.82
1003,2.46
1004,2.08
1005,1.76
1006,1.58
1007,1.53
1008,1.58
1009,1.67
1010,1.75
1011,1.78
1012,1.80
1013,1.88
1014,2.03
1015,2.28
1016,2.60
1017,2.94
1018,3.20
1019,3.29
1020,3.20
1021,2.91
1022,2.51
1023,2.05
1024,1.64
1025,1.40
1026,1.38
1027,1.56
1028,1.88
1029,2.29
1030,2.72
1031,3.11
1032,3.36
1033,3.43
1034,3.33
1035,3.14
1036,2.92
1037,2.71
1038,2.53
1039,2.38
1040,2.26
1041,2.14
1042,2.01
1043,1.83
1044,1.59
1045,1.30
1046,0.95
1047,0.62
1048,0.34
1049,0.16
1050,0.11
1051,0.17
1052,0.28
1053,0.41
1054,0.51
1055,0.54
1056,0.49
1057,0.37
1058,0.20
1059,0.05
1060,-0.04
1061,-0.05
1062,0.05
1063,0.22
1064,0.48
1065,0.77
1066,1.11
1067,1.43
1068,1.75
1069,2.01
1070,2.24
1071,2.44
1072,2.68
1073,2.94
1074,3.24
1075,3.56
1076,3.94
1077,4.32
1078,4.69
1079,4.99
1080,5.21
1081,5.29
1082,5.27
1083,5.20
1084,5.18
1085,5.29
1086,5.58
1087,6.03
1088,6.60
1089,7.16
1090,7.54
1091,7.61
1092,7.29
1093,6.63
1094,5.71
1095,4.68
1096,3.67
1097,2.80
1098,2.12
1099,1.69
1100,1.42
1101,1.26
1102,1.10
1103,0.89
1104,0.61
1105,0.35
1106,0.13
1107,0.02
1108,-0.04
1109,0.00
1110,0.12
1111,0.31
1112,0.49
1113,0.61
1114,0.69
1115,0.76
1116,0.89
1117,1.07
1118,1.30
1119,1.54
1120,1.79
1121,1.95
1122,2.04
1123,2.03
1124,2.01
1125,1.99
1126,2.02
1127,2.08
1128,2.21
1129,2.41
1130,2.70
1131,3.03
1132,3.39
1133,3.75
1134,4.09
1135,4.39
1136,4.62
1137,4.80
1138,4.95
1139,5.10
1140,5.24
1141,5.30
1142,5.26
1143,5.13
1144,4.98
1145,4.85
1146,4.78
1147,4.72
1148,4.68
1149,4.64
1150,4.64
1151,4.68
1152,4.71
1153,4.69
1154,4.54
1155,4.30
1156,4.04
1157,3.78
1158,3.56
1159,3.40
1160,3.29
1161,3.25
1162,3.27
1163,3.31
1164,3.36
1165,3.39
1166,3.35
1167,3.27
1168,3.16
1169,3.07
1170,2.98
1171,2.87
1172,2.71
1173,2.50
1174,2.24
1175,1.94
1176,1.63
1177,1.37
1178,1.14
1179,0.99
1180,0.91
1181,0.92
1182,0.98
1183,1.08
1184,1.16
1185,1.19
1186,1.17
1187,1.14
1188,1.11
1189,1.11
1190,1.14
1191,1.20
1192,1.30
1193,1.45
1194,1.62
1195,1.77
1196,1.90
1197,2.01
1198,2.13
1199,2.25
1200,2.37
1201,2.49
1202,2.63
1203,2.84
1204,3.14
1205,3.52
1206,3.97
1207,4.43
1208,4.84
1209,5.13
1210,5.29
1211,5.29
1212,5.14
1213,4.84
1214,4.43
1215,3.97
1216,3.55
1217,3.21
1218,2.98
1219,2.83
1220,2.75
1221,2.72
1222,2.73
1223,2.73
1224,2.70
1225,2.64
1226,2.58
1227,2.59
1228,2.64
1229,2.73
1230,2.85
1231,3.01
1232,3.17
1233,3.33
1234,3.41
1235,3.38
1236,3.25
1237,3.07
1238,2.88
1239,2.66
1240,2.44
1241,2.26
1242,2.16
1243,2.12
1244,2.13
1245,2.17
1246,2.24
1247,2.33
1248,2.41
1249,2.48
1250,2.53
1251,2.59
1252,2.63
1253,2.66
1254,2.67
1255,2.64
1256,2.56
1257,2.46
1258,2.30
1259,2.11
1260,1.91
1261,1.74
1262,1.59
1263,1.51
1264,1.46
1265,1.43
1266,1.40
1267,1.31
1268,1.14
1269,0.87
1270,0.52
1271,0.13
1272,-0.26
1273,-0.60
1274,-0.82
1275,-0.89
1276,-0.77
1277,-0.53
1278,-0.21
1279,0.12
1280,0.43
1281,0.70
1282,0.92
1283,1.08
1284,1.15
1285,1.17
1286,1.21
1287,1.27
1288,1.34
1289,1.39
1290,1.45
1291,1.51
1292,1.56
1293,1.59
1294,1.60
1295,1.59
1296,1.61
1297,1.64
1298,1.68
1299,1.68
1300,1.63
1301,1.50
1302,1.32
1303,1.11
1304,0.90
1305,0.76
1306,0.69
1307,0.76
1308,0.92
1309,1.10
1310,1.25
1311,1.34
1312,1.38
1313,1.37
1314,1.33
1315,1.27
1316,1.26
1317,1.34
1318,1.50
1319,1.69
1320,1.88
1321,1.98
1322,2.00
1323,1.95
1324,1.87
1325,1.86
1326,1.96
1327,2.21
1328,2.59
1329,3.05
1330,3.46
1331,3.68
1332,3.64
1333,3.30
1334,2.69
1335,1.91
1336,1.05
1337,0.27
1338,-0.36
1339,-0.74
1340,-0.88
1341,-0.80
1342,-0.64
1343,-0.45
1344,-0.30
1345,-0.19
1346,-0.23
1347,-0.40
1348,-0.71
1349,-1.07
1350,-1.45
1351,-1.80
1352,-2.13
1353,-2.40
1354,-2.59
1355,-2.69
1356,-2.68
1357,-2.62
1358,-2.53
1359,-2.47
1360,-2.43
1361,-2.40
1362,-2.37
1363,-2.32
1364,-2.21
1365,-2.03
1366,-1.78
1367,-1.48
1368,-1.15
1369,-0.82
1370,-0.50
1371,-0.23
1372,-0.05
1373,0.04
1374,0.07
1375,0.07
1376,0.04
1377,-0.03
1378,-0.08
1379,-0.12
1380,-0.13
1381,-0.16
1382,-0.22
1383,-0.31
1384,-0.43
1385,-0.55
1386,-0.65
1387,-0.71
1388,-0.72
1389,-0.66
1390,-0.54
1391,-0.40
1392,-0.22
1393,-0.04
1394,0.12
1395,0.21
1396,0.21
1397,0.18
1398,0.18
1399,0.23
1400,0.34
1401,0.50
1402,0.70
1403,0.95
1404,1.17
1405,1.33
1406,1.37
1407,1.30
1408,1.18
1409,1.05
1410,0.97
1411,0.94
1412,0.96
1413,1.02
1414,1.11
1415,1.17
1416,1.17
1417,1.11
1418,1.02
1419,0.92
1420,0.83
1421,0.75
1422,0.68
1423,0.67
1424,0.76
1425,0.95
1426,1.19
1427,1.40
1428,1.53
1429,1.56
1430,1.51
1431,1.38
1432,1.19
1433,0.97
1434,0.83
1435,0.85
1436,1.08
1437,1.43
1438,1.88
1439,2.35
1440,2.75
1441,2.98
1442,3.02
1443,2.89
1444,2.70
1445,2.54
1446,2.46
1447,2.47
1448,2.57
1449,2.72
1450,2.83
1451,2.88
1452,2.84
1453,2.71
1454,2.48
1455,2.21
1456,1.98
1457,1.83
1458,1.72
1459,1.61
1460,1.47
1461,1.33
1462,1.14
1463,0.91
1464,0.61
1465,0.34
1466,0.14
1467,0.06
1468,0.05
1469,0.13
1470,0.24
1471,0.35
1472,0.43
1473,0.47
1474,0.48
1475,0.48
1476,0.43
1477,0.34
1478,0.24
1479,0.18
1480,0.17
1481,0.21
1482,0.27
1483,0.34
1484,0.34
1485,0.28
1486,0.17
1487,0.02
1488,-0.16
1489,-0.34
1490,-0.49
1491,-0.58
1492,-0.61
1493,-0.57
1494,-0.50
1495,-0.44
1496,-0.43
1497,-0.50
1498,-0.60
1499,-0.72
1500,-0.84
1501,-0.96
1502,-1.08
1503,-1.17
1504,-1.19
1505,-1.14
1506,-1.01
1507,-0.83
1508,-0.60
1509,-0.30
1510,0.06
1511,0.43
1512,0.74
1513,0.95
1514,1.03
1515,0.96
1516,0.76
1517,0.43
1518,0.03
1519,-0.37
1520,-0.66
1521,-0.76
1522,-0.62
1523,-0.25
1524,0.26
1525,0.81
1526,1.30
1527,1.63
1528,1.75
1529,1.62
1530,1.32
1531,0.95
1532,0.60
1533,0.33
1534,0.17
1535,0.14
1536,0.23
1537,0.38
1538,0.54
1539,0.66
1540,0.75
1541,0.80
1542,0.84
1543,0.87
1544,0.89
1545,0.92
1546,0.95
1547,0.95
1548,0.92
1549,0.85
1550,0.79
1551,0.72
1552,0.68
1553,0.70
1554,0.89
1555,1.21
1556,1.63
1557,2.05
1558,2.46
1559,2.82
1560,3.11
1561,3.28
1562,3.35
1563,3.34
1564,3.31
1565,3.33
1566,3.47
1567,3.71
1568,4.01
1569,4.29
1570,4.48
1571,4.54
1572,4.46
1573,4.29
1574,4.04
1575,3.76
1576,3.51
1577,3.36
1578,3.33
1579,3.36
1580,3.37
1581,3.29
1582,3.12
1583,2.88
1584,2.54
1585,2.12
1586,1.67
1587,1.31
1588,1.11
1589,1.05
1590,1.08
1591,1.17
1592,1.34
1593,1.55
1594,1.74
1595,1.89
1596,2.02
1597,2.14
1598,2.21
1599,2.22
1600,2.17
1601,2.08
1602,1.95
1603,1.83
1604,1.75
1605,1.79
1606,1.93
1607,2.15
1608,2.35
1609,2.46
1610,2.38
1611,2.14
1612,1.75
1613,1.27
1614,0.73
1615,0.22
1616,-0.21
1617,-0.50
1618,-0.66
1619,-0.72
1620,-0.73
1621,-0.72
1622,-0.71
1623,-0.68
1624,-0.66
1625,-0.63
1626,-0.54
1627,-0.40
1628,-0.23
1629,-0.04
1630,0.15
1631,0.34
1632,0.46
1633,0.50
1634,0.44
1635,0.35
1636,0.23
1637,0.09
1638,-0.10
1639,-0.34
1640,-0.63
1641,-0.92
1642,-1.21
1643,-1.48
1644,-1.75
1645,-2.02
1646,-2.27
1647,-2.48
1648,-2.66
1649,-2.83
1650,-3.01
1651,-3.17
1652,-3.27
1653,-3.30
1654,-3.26
1655,-3.15
1656,-3.06
1657,-2.99
1658,-2.98
1659,-2.97
1660,-2.98
1661,-3.01
1662,-3.07
1663,-3.13
1664,-3.19
1665,-3.24
1666,-3.34
1667,-3.52
1668,-3.78
1669,-4.07
1670,-4.39
1671,-4.69
1672,-4.97
1673,-5.15
1674,-5.17
1675,-5.03
1676,-4.75
1677,-4.41
1678,-4.07
1679,-3.77
1680,-3.53
1681,-3.36
1682,-3.21
1683,-3.07
1684,-2.88
1685,-2.64
1686,-2.34
1687,-1.98
1688,-1.57
1689,-1.17
1690,-0.88
1691,-0.75
1692,-0.85
1693,-1.19
1694,-1.72
1695,-2.38
1696,-3.13
1697,-3.88
1698,-4.55
1699,-5.09
1700,-5.49
1701,-5.71
1702,-5.80
1703,-5.74
1704,-5.60
1705,-5.43
1706,-5.30
1707,-5.22
1708,-5.19
1709,-5.22
1710,-5.29
1711,-5.38
1712,-5.46
1713,-5.49
1714,-5.47
1715,-5.40
1716,-5.30
1717,-5.19
1718,-5.09
1719,-5.02
1720,-5.00
1721,-5.03
1722,-5.13
1723,-5.28
1724,-5.42
1725,-5.55
1726,-5.65
1727,-5.74
1728,-5.78
1729,-5.78
1730,-5.78
1731,-5.81
1732,-5.87
1733,-5.97
1734,-6.06
1735,-6.15
1736,-6.23
1737,-6.26
1738,-6.20
1739,-6.02
1740,-5.76
1741,-5.49
1742,-5.23
1743,-5.05
1744,-4.98
1745,-5.07
1746,-5.32
1747,-5.68
1748,-6.10
1749,-6.53
1750,-6.93
1751,-7.22
1752,-7.37
1753,-7.40
1754,-7.37
1755,-7.31
1756,-7.20
1757,-7.08
1758,-7.01
1759,-7.04
1760,-7.13
1761,-7.24
1762,-7.30
1763,-7.34
1764,-7.30
1765,-7.16
1766,-6.85
1767,-6.45
1768,-5.96
1769,-5.48
1770,-5.00
1771,-4.56
1772,-4.17
1773,-3.85
1774,-3.52
1775,-3.18
1776,-2.78
1777,-2.37
1778,-1.94
1779,-1.56
1780,-1.21
1781,-0.93
1782,-0.63
1783,-0.35
1784,-0.02
1785,0.35
1786,0.87
1787,1.48
1788,2.18
1789,2.84
1790,3.44
1791,3.91
1792,4.26
1793,4.52
1794,4.78
1795,5.09
1796,5.54
1797,6.07
1798,6.66
1799,7.19
1800,7.64
1801,7.91
1802,7.98
1803,7.85
1804,7.63
1805,7.43
1806,7.38
1807,7.53
1808,7.88
1809,8.37
1810,8.87
1811,9.25
1812,9.38
1813,9.16
1814,8.61
1815,7.81
1816,6.94
1817,6.16
1818,5.53
1819,5.12
1820,4.91
1821,4.88
1822,4.87
1823,4.82
1824,4.67
1825,4.43
1826,4.10
1827,3.75
1828,3.40
1829,3.13
1830,2.96
1831,2.91
1832,2.92
1833,2.96
1834,2.98
1835,2.98
1836,2.98
1837,2.98
1838,2.96
1839,2.94
1840,2.89
1841,2.84
1842,2.72
1843,2.56
1844,2.32
1845,2.04
1846,1.75
1847,1.47
1848,1.27
1849,1.18
1850,1.21
1851,1.31
1852,1.39
1853,1.40
1854,1.32
1855,1.21
1856,1.04
1857,0.86
1858,0.67
1859,0.53
1860,0.43
1861,0.37
1862,0.31
1863,0.20
1864,0.02
1865,-0.19
1866,-0.43
1867,-0.63
1868,-0.80
1869,-0.92
1870,-1.00
1871,-1.01
1872,-1.02
1873,-1.08
1874,-1.24
1875,-1.48
1876,-1.75
1877,-1.99
1878,-2.21
1879,-2.36
1880,-2.37
1881,-2.26
1882,-2.06
1883,-1.83
1884,-1.61
1885,-1.43
1886,-1.36
1887,-1.38
1888,-1.50
1889,-1.65
1890,-1.82
1891,-1.97
1892,-2.08
1893,-2.14
1894,-2.17
1895,-2.18
1896,-2.24
1897,-2.36
1898,-2.55
1899,-2.79
1900,-3.06
1901,-3.27
1902,-3.40
1903,-3.46
1904,-3.46
1905,-3.43
1906,-3.35
1907,-3.26
1908,-3.22
1909,-3.30
1910,-3.52
1911,-3.83
1912,-4.17
1913,-4.47
1914,-4.71
1915,-4.89
1916,-5.00
1917,-5.06
1918,-5.09
1919,-5.14
1920,-5.26
1921,-5.44
1922,-5.64
1923,-5.77
1924,-5.77
1925,-5.61
1926,-5.33
1927,-4.96
1928,-4.57
1929,-4.23
1930,-4.01
1931,-3.98
1932,-4.17
1933,-4.53
1934,-4.99
1935,-5.45
1936,-5.87
1937,-6.23
1938,-6.51
1939,-6.71
1940,-6.87
1941,-7.08
1942,-7.39
1943,-7.74
1944,-8.08
1945,-8.35
1946,-8.58
1947,-8.76
1948,-8.85
1949,-8.82
1950,-8.71
1951,-8.54
1952,-8.37
1953,-8.19
1954,-8.03
1955,-7.87
1956,-7.74
1957,-7.62
1958,-7.51
1959,-7.39
1960,-7.26
1961,-7.11
1962,-6.95
1963,-6.84
1964,-6.77
1965,-6.77
1966,-6.81
1967,-6.87
1968,-6.96
1969,-7.05
1970,-7.13
1971,-7.19
1972,-7.20
1973,-7.20
1974,-7.23
1975,-7.29
1976,-7.35
1977,-7.42
1978,-7.51
1979,-7.65
1980,-7.84
1981,-7.99
1982,-8.07
1983,-8.10
1984,-8.13
1985,-8.16
1986,-8.13
1987,-8.04
1988,-7.95
1989,-7.88
1990,-7.83
1991,-7.74
1992,-7.64
1993,-7.54
1994,-7.49
1995,-7.52
1996,-7.64
1997,-7.86
1998,-8.12
1999,-8.39
2000,-8.64
2001,-8.82
2002,-8.93
2003,-8.92
2004,-8.80
2005,-8.62
2006,-8.44
2007,-8.32
2008,-8.25
2009,-8.22
2010,-8.24
2011,-8.27
2012,-8.27
2013,-8.22
2014,-8.10
2015,-7.92
2016,-7.68
2017,-7.41
2018,-7.13
2019,-6.87
2020,-6.58
2021,-6.32
2022,-6.10
2023,-5.95
2024,-5.84
2025,-5.81
2026,-5.78
2027,-5.76
2028,-5.67
2029,-5.49
2030,-5.21
2031,-4.87
2032,-4.43
2033,-3.92
2034,-3.33
2035,-2.78
2036,-2.27
2037,-1.89
2038,-1.56
2039,-1.31
2040,-1.11
2041,-0.97
2042,-0.81
2043,-0.62
2044,-0.34
2045,-0.02
2046,0.39
2047,0.83
2048,1.30
2049,1.72
2050,2.05
2051,2.27
2052,2.35
2053,2.32
2054,2.18
2055,1.96
2056,1.72
2057,1.47
2058,1.27
2059,1.08
2060,0.94
2061,0.85
2062,0.81
2063,0.79
2064,0.73
2065,0.67
2066,0.63
2067,0.66
2068,0.75
2069,0.84
2070,0.91
2071,0.95
2072,0.95
2073,0.91
2074,0.84
2075,0.79
2076,0.77
2077,0.80
2078,0.82
2079,0.83
2080,0.82
2081,0.79
2082,0.72
2083,0.57
2084,0.36
2085,0.14
2086,-0.01
2087,-0.04
2088,0.07
2089,0.28
2090,0.53
2091,0.75
2092,0.89
2093,0.92
2094,0.82
2095,0.60
2096,0.33
2097,0.08
2098,-0.05
2099,-0.05
2100,0.05
2101,0.24
2102,0.47
2103,0.68
2104,0.82
2105,0.85
2106,0.81
2107,0.70
2108,0.56
2109,0.42
2110,0.30
2111,0.18
2112,0.02
2113,-0.19
2114,-0.40
2115,-0.59
2116,-0.75
2117,-0.83
2118,-0.80
2119,-0.68
2120,-0.56
2121,-0.46
2122,-0.38
2123,-0.35
2124,-0.43
2125,-0.64
2126,-0.92
2127,-1.13
2128,-1.23
2129,-1.20
2130,-1.05
2131,-0.84
2132,-0.61
2133,-0.42
2134,-0.33
2135,-0.37
2136,-0.50
2137,-0.69
2138,-0.85
2139,-0.95
2140,-0.95
2141,-0.85
2142,-0.68
2143,-0.47
2144,-0.31
2145,-0.27
2146,-0.37
2147,-0.59
2148,-0.88
2149,-1.21
2150,-1.54
2151,-1.82
2152,-1.99
2153,-2.04
2154,-2.01
2155,-1.91
2156,-1.80
2157,-1.69
2158,-1.54
2159,-1.36
2160,-1.16
2161,-1.01
2162,-0.94
2163,-0.95
2164,-0.98
2165,-1.01
2166,-1.01
2167,-0.95
2168,-0.85
2169,-0.72
2170,-0.59
2171,-0.50
2172,-0.50
2173,-0.61
2174,-0.85
2175,-1.15
2176,-1.48
2177,-1.78
2178,-2.01
2179,-2.20
2180,-2.35
2181,-2.46
2182,-2.53
2183,-2.62
2184,-2.81
2185,-3.07
2186,-3.36
2187,-3.60
2188,-3.79
2189,-3.94
2190,-4.04
2191,-4.04
2192,-3.94
2193,-3.78
2194,-3.62
2195,-3.50
2196,-3.42
2197,-3.39
2198,-3.45
2199,-3.62
2200,-3.91
2201,-4.23
2202,-4.57
2203,-4.88
2204,-5.14
2205,-5.31
2206,-5.36
2207,-5.36
2208,-5.40
2209,-5.52
2210,-5.68
2211,-5.82
2212,-5.98
2213,-6.16
2214,-6.36
2215,-6.47
2216,-6.49
2217,-6.46
2218,-6.44
2219,-6.47
2220,-6.52
2221,-6.61
2222,-6.77
2223,-6.98
2224,-7.20
2225,-7.36
2226,-7.39
2227,-7.27
2228,-7.00
2229,-6.61
2230,-6.14
2231,-5.69
2232,-5.32
2233,-5.08
2234,-4.96
2235,-4.94
2236,-4.97
2237,-4.97
2238,-4.88
2239,-4.68
2240,-4.36
2241,-3.97
2242,-3.52
2243,-3.14
2244,-2.87
2245,-2.73
2246,-2.64
2247,-2.56
2248,-2.46
2249,-2.30
2250,-2.07
2251,-1.75
2252,-1.36
2253,-0.99
2254,-0.71
2255,-0.56
2256,-0.56
2257,-0.68
2258,-0.89
2259,-1.13
2260,-1.38
2261,-1.59
2262,-1.73
2263,-1.82
2264,-1.90
2265,-2.01
2266,-2.18
2267,-2.40
2268,-2.64
2269,-2.91
2270,-3.17
2271,-3.36
2272,-3.41
2273,-3.32
2274,-3.12
2275,-2.85
2276,-2.51
2277,-2.12
2278,-1.72
2279,-1.39
2280,-1.16
2281,-1.05
2282,-1.00
2283,-0.98
2284,-0.94
2285,-0.82
2286,-0.57
2287,-0.18
2288,0.32
2289,0.84
2290,1.27
2291,1.55
2292,1.61
2293,1.42
2294,0.99
2295,0.40
2296,-0.27
2297,-0.94
2298,-1.57
2299,-2.13
2300,-2.59
2301,-2.98
2302,-3.36
2303,-3.70
2304,-3.99
2305,-4.17
2306,-4.31
2307,-4.38
2308,-4.44
2309,-4.52
2310,-4.71
2311,-5.04
2312,-5.46
2313,-5.86
2314,-6.14
2315,-6.23
2316,-6.12
2317,-5.81
2318,-5.38
2319,-4.94
2320,-4.65
2321,-4.55
2322,-4.68
2323,-5.02
2324,-5.52
2325,-6.07
2326,-6.53
2327,-6.84
2328,-6.96
2329,-6.94
2330,-6.86
2331,-6.74
2332,-6.61
2333,-6.52
2334,-6.47
2335,-6.45
2336,-6.42
2337,-6.40
2338,-6.36
2339,-6.33
2340,-6.32
2341,-6.36
2342,-6.40
2343,-6.44
2344,-6.41
2345,-6.29
2346,-6.10
2347,-5.89
2348,-5.69
2349,-5.54
2350,-5.42
2351,-5.38
2352,-5.37
2353,-5.38
2354,-5.30
2355,-5.13
2356,-4.88
2357,-4.58
2358,-4.23
2359,-3.87
2360,-3.55
2361,-3.34
2362,-3.26
2363,-3.27
2364,-3.30
2365,-3.37
2366,-3.45
2367,-3.50
2368,-3.50
2369,-3.45
2370,-3.35
2371,-3.19
2372,-2.97
2373,-2.70
2374,-2.46
2375,-2.29
2376,-2.27
2377,-2.41
2378,-2.78
2379,-3.35
2380,-4.06
2381,-4.78
2382,-5.43
2383,-5.91
2384,-6.20
2385,-6.24
2386,-6.13
2387,-5.94
2388,-5.78
2389,-5.75
2390,-5.87
2391,-6.08
2392,-6.33
2393,-6.54
2394,-6.67
2395,-6.67
2396,-6.52
2397,-6.22
2398,-5.79
2399,-5.34
2400,-4.97
2401,-4.72
2402,-4.59
2403,-4.54
2404,-4.54
2405,-4.55
2406,-4.49
2407,-4.34
2408,-4.10
2409,-3.82
2410,-3.59
2411,-3.46
2412,-3.48
2413,-3.66
2414,-4.01
2415,-4.46
2416,-4.92
2417,-5.29
2418,-5.53
2419,-5.61
2420,-5.55
2421,-5.47
2422,-5.42
2423,-5.45
2424,-5.52
2425,-5.58
2426,-5.63
2427,-5.60
2428,-5.43
2429,-5.10
2430,-4.66
2431,-4.20
2432,-3.81
2433,-3.57
2434,-3.52
2435,-3.60
2436,-3.79
2437,-4.04
2438,-4.31
2439,-4.55
2440,-4.71
2441,-4.77
2442,-4.76
2443,-4.75
2444,-4.78
2445,-4.88
2446,-5.04
2447,-5.25
2448,-5.48
2449,-5.69
2450,-5.86
2451,-5.94
2452,-5.95
2453,-5.87
2454,-5.69
2455,-5.44
2456,-5.17
2457,-4.92
2458,-4.75
2459,-4.67
2460,-4.65
2461,-4.68
2462,-4.75
2463,-4.81
2464,-4.84
2465,-4.84
2466,-4.80
2467,-4.75
2468,-4.67
2469,-4.59
2470,-4.47
2471,-4.32
2472,-4.14
2473,-3.94
2474,-3.67
2475,-3.34
2476,-2.99
2477,-2.69
2478,-2.46
2479,-2.38
2480,-2.42
2481,-2.58
2482,-2.79
2483,-3.04
2484,-3.28
2485,-3.46
2486,-3.53
2487,-3.53
2488,-3.51
2489,-3.49
2490,-3.52
2491,-3.59
2492,-3.72
2493,-3.89
2494,-4.08
2495,-4.26
2496,-4.46
2497,-4.60
2498,-4.67
2499,-4.63
2500,-4.55
2501,-4.49
2502,-4.48
2503,-4.51
2504,-4.56
2505,-4.62
2506,-4.68
2507,-4.75
2508,-4.78
2509,-4.78
2510,-4.75
2511,-4.72
2512,-4.71
2513,-4.71
2514,-4.71
2515,-4.68
2516,-4.59
2517,-4.46
2518,-4.26
2519,-4.05
2520,-3.82
2521,-3.64
2522,-3.56
2523,-3.59
2524,-3.66
2525,-3.68
2526,-3.57
2527,-3.30
2528,-2.84
2529,-2.20
2530,-1.49
2531,-0.84
2532,-0.40
2533,-0.29
2534,-0.53
2535,-1.04
2536,-1.72
2537,-2.49
2538,-3.23
2539,-3.89
2540,-4.39
2541,-4.71
2542,-4.94
2543,-5.10
2544,-5.28
2545,-5.42
2546,-5.54
2547,-5.56
2548,-5.52
2549,-5.42
2550,-5.32
2551,-5.22
2552,-5.16
2553,-5.13
2554,-5.13
2555,-5.20
2556,-5.30
2557,-5.39
2558,-5.44
2559,-5.44
2560,-5.41
2561,-5.34
2562,-5.24
2563,-5.13
2564,-5.03
2565,-4.94
2566,-4.81
2567,-4.64
2568,-4.42
2569,-4.20
2570,-4.03
2571,-3.91
2572,-3.85
2573,-3.85
2574,-3.94
2575,-4.05
2576,-4.15
2577,-4.22
2578,-4.26
2579,-4.32
2580,-4.38
2581,-4.44
2582,-4.52
2583,-4.58
2584,-4.59
2585,-4.49
2586,-4.31
2587,-4.06
2588,-3.81
2589,-3.62
2590,-3.55
2591,-3.61
2592,-3.83
2593,-4.19
2594,-4.65
2595,-5.13
2596,-5.56
2597,-5.84
2598,-5.91
2599,-5.81
2600,-5.65
2601,-5.48
2602,-5.39
2603,-5.36
2604,-5.39
2605,-5.45
2606,-5.52
2607,-5.55
2608,-5.52
2609,-5.43
2610,-5.29
2611,-5.10
2612,-4.91
2613,-4.75
2614,-4.69
2615,-4.76
2616,-4.90
2617,-5.06
2618,-5.19
2619,-5.28
2620,-5.32
2621,-5.28
2622,-5.17
2623,-5.02
2624,-4.90
2625,-4.87
2626,-4.91
2627,-5.01
2628,-5.13
2629,-5.28
2630,-5.45
2631,-5.64
2632,-5.82
2633,-5.97
2634,-6.04
2635,-6.05
2636,-5.99
2637,-5.87
2638,-5.68
2639,-5.41
2640,-5.08
2641,-4.75
2642,-4.43
2643,-4.17
2644,-3.95
2645,-3.78
2646,-3.61
2647,-3.46
2648,-3.36
2649,-3.30
2650,-3.27
2651,-3.30
2652,-3.40
2653,-3.60
2654,-3.94
2655,-4.36
2656,-4.80
2657,-5.16
2658,-5.41
2659,-5.50
2660,-5.43
2661,-5.21
2662,-4.92
2663,-4.67
2664,-4.57
2665,-4.62
2666,-4.80
2667,-5.04
2668,-5.35
2669,-5.65
2670,-5.87
2671,-6.00
2672,-6.03
2673,-5.99
2674,-5.91
2675,-5.78
2676,-5.68
2677,-5.62
2678,-5.62
2679,-5.68
2680,-5.80
2681,-5.97
2682,-6.20
2683,-6.41
2684,-6.57
2685,-6.62
2686,-6.58
2687,-6.43
2688,-6.20
2689,-5.91
2690,-5.54
2691,-5.17
2692,-4.88
2693,-4.77
2694,-4.81
2695,-4.97
2696,-5.17
2697,-5.32
2698,-5.40
2699,-5.43
2700,-5.40
2701,-5.28
2702,-5.07
2703,-4.82
2704,-4.62
2705,-4.49
2706,-4.46
2707,-4.50
2708,-4.57
2709,-4.66
2710,-4.75
2711,-4.78
2712,-4.75
2713,-4.62
2714,-4.42
2715,-4.20
2716,-4.04
2717,-3.95
2718,-3.91
2719,-3.92
2720,-3.98
2721,-4.07
2722,-4.14
2723,-4.14
2724,-4.07
2725,-3.98
2726,-3.91
2727,-3.87
2728,-3.90
2729,-3.99
2730,-4.14
2731,-4.31
2732,-4.52
2733,-4.73
2734,-4.91
2735,-5.00
2736,-4.97
2737,-4.84
2738,-4.72
2739,-4.65
2740,-4.65
2741,-4.71
2742,-4.85
2743,-5.06
2744,-5.30
2745,-5.55
2746,-5.78
2747,-5.96
2748,-6.04
2749,-6.04
2750,-6.00
2751,-6.00
2752,-6.06
2753,-6.15
2754,-6.24
2755,-6.29
2756,-6.32
2757,-6.32
2758,-6.27
2759,-6.13
2760,-5.89
2761,-5.65
2762,-5.47
2763,-5.40
2764,-5.44
2765,-5.54
2766,-5.68
2767,-5.79
2768,-5.85
2769,-5.81
2770,-5.74
2771,-5.66
2772,-5.68
2773,-5.81
2774,-6.14
2775,-6.65
2776,-7.30
2777,-8.00
2778,-8.65
2779,-9.16
2780,-9.49
2781,-9.68
2782,-9.83
2783,-9.98
2784,-10.15
2785,-10.32
2786,-10.51
2787,-10.70
2788,-10.86
2789,-10.95
2790,-10.95
2791,-10.86
2792,-10.70
2793,-10.51
2794,-10.31
2795,-10.14
2796,-10.00
2797,-9.91
2798,-9.84
2799,-9.79
2800,-9.74
2801,-9.71
2802,-9.69
2803,-9.67
2804,-9.61
2805,-9.53
2806,-9.40
2807,-9.22
2808,-8.97
2809,-8.74
2810,-8.54
2811,-8.43
2812,-8.35
2813,-8.26
2814,-8.18
2815,-8.11
2816,-8.06
2817,-8.00
2818,-7.97
2819,-7.96
2820,-8.00
2821,-8.09
2822,-8.23
2823,-8.42
2824,-8.60
2825,-8.72
2826,-8.77
2827,-8.77
2828,-8.74
2829,-8.67
2830,-8.56
2831,-8.38
2832,-8.19
2833,-7.97
2834,-7.75
2835,-7.51
2836,-7.26
2837,-7.06
2838,-6.90
2839,-6.82
2840,-6.77
2841,-6.74
2842,-6.73
2843,-6.76
2844,-6.83
2845,-6.92
2846,-7.01
2847,-7.07
2848,-7.07
2849,-7.02
2850,-6.94
2851,-6.87
2852,-6.84
2853,-6.84
2854,-6.87
2855,-6.92
2856,-7.03
2857,-7.22
2858,-7.45
2859,-7.66
2860,-7.80
2861,-7.83
2862,-7.77
2863,-7.64
2864,-7.46
2865,-7.26
2866,-7.06
2867,-6.91
2868,-6.82
2869,-6.79
2870,-6.81
2871,-6.87
2872,-6.98
2873,-7.07
2874,-7.07
2875,-6.93
2876,-6.65
2877,-6.30
2878,-5.97
2879,-5.74
2880,-5.64
2881,-5.69
2882,-5.89
2883,-6.20
2884,-6.57
2885,-6.90
2886,-7.10
2887,-7.07
2888,-6.84
2889,-6.43
2890,-5.94
2891,-5.46
2892,-5.08
2893,-4.88
2894,-4.93
2895,-5.20
2896,-5.68
2897,-6.25
2898,-6.82
2899,-7.33
2900,-7.79
2901,-8.20
2902,-8.56
2903,-8.87
2904,-9.15
2905,-9.41
2906,-9.62
2907,-9.74
2908,-9.80
2909,-9.76
2910,-9.62
2911,-9.38
2912,-9.09
2913,-8.81
2914,-8.58
2915,-8.40
2916,-8.30
2917,-8.30
2918,-8.39
2919,-8.55
2920,-8.70
2921,-8.79
2922,-8.81
2923,-8.75
2924,-8.61
2925,-8.36
2926,-8.04
2927,-7.68
2928,-7.33
2929,-7.03
2930,-6.77
2931,-6.60
2932,-6.53
2933,-6.56
2934,-6.65
2935,-6.77
2936,-6.91
2937,-7.07
2938,-7.21
2939,-7.30
2940,-7.32
2941,-7.32
2942,-7.34
2943,-7.40
2944,-7.48
2945,-7.55
2946,-7.57
2947,-7.54
2948,-7.45
2949,-7.27
2950,-7.00
2951,-6.67
2952,-6.32
2953,-6.06
2954,-5.89
2955,-5.83
2956,-5.85
2957,-5.95
2958,-6.10
2959,-6.26
2960,-6.36
2961,-6.42
2962,-6.45
2963,-6.48
2964,-6.49
2965,-6.46
2966,-6.41
2967,-6.35
2968,-6.29
2969,-6.20
2970,-6.05
2971,-5.84
2972,-5.62
2973,-5.43
2974,-5.29
2975,-5.24
2976,-5.28
2977,-5.43
2978,-5.66
2979,-5.91
2980,-6.12
2981,-6.23
2982,-6.26
2983,-6.20
2984,-6.08
2985,-5.90
2986,-5.65
2987,-5.34
2988,-5.05
2989,-4.83
2990,-4.71
2991,-4.68
2992,-4.73
2993,-4.86
2994,-5.05
2995,-5.27
2996,-5.44
2997,-5.54
2998,-5.54
2999,-5.48
3000,-5.36
3001,-5.25
3002,-5.15
3003,-5.10
3004,-5.05
3005,-4.97
3006,-4.76
3007,-4.41
3008,-3.90
3009,-3.26
3010,-2.55
3011,-1.88
3012,-1.40
3013,-1.21
3014,-1.34
3015,-1.81
3016,-2.55
3017,-3.46
3018,-4.36
3019,-5.13
3020,-5.68
3021,-5.99
3022,-6.12
3023,-6.11
3024,-6.07
3025,-6.06
3026,-6.13
3027,-6.25
3028,-6.40
3029,-6.52
3030,-6.57
3031,-6.51
3032,-6.34
3033,-6.10
3034,-5.84
3035,-5.62
3036,-5.49
3037,-5.46
3038,-5.52
3039,-5.59
3040,-5.58
3041,-5.44
3042,-5.13
3043,-4.71
3044,-4.23
3045,-3.76
3046,-3.42
3047,-3.27
3048,-3.35
3049,-3.62
3050,-4.04
3051,-4.52
3052,-5.00
3053,-5.40
3054,-5.64
3055,-5.70
3056,-5.62
3057,-5.46
3058,-5.26
3059,-5.12
3060,-5.06
3061,-5.06
3062,-5.07
3063,-5.04
3064,-4.97
3065,-4.84
3066,-4.68
3067,-4.46
3068,-4.23
3069,-4.01
3070,-3.91
3071,-3.97
3072,-4.17
3073,-4.47
3074,-4.84
3075,-5.23
3076,-5.61
3077,-5.91
3078,-6.10
3079,-6.16
3080,-6.10
3081,-5.95
3082,-5.71
3083,-5.41
3084,-5.09
3085,-4.81
3086,-4.63
3087,-4.58
3088,-4.62
3089,-4.74
3090,-4.93
3091,-5.17
3092,-5.42
3093,-5.65
3094,-5.78
3095,-5.84
3096,-5.84
3097,-5.84
3098,-5.87
3099,-5.92
3100,-5.99
3101,-6.05
3102,-6.09
3103,-6.06
3104,-5.93
3105,-5.71
3106,-5.50
3107,-5.34
3108,-5.28
3109,-5.34
3110,-5.55
3111,-5.91
3112,-6.37
3113,-6.84
3114,-7.19
3115,-7.38
3116,-7.34
3117,-7.10
3118,-6.67
3119,-6.07
3120,-5.36
3121,-4.62
3122,-4.00
3123,-3.58
3124,-3.40
3125,-3.43
3126,-3.62
3127,-3.94
3128,-4.30
3129,-4.60
3130,-4.77
3131,-4.80
3132,-4.72
3133,-4.63
3134,-4.55
3135,-4.52
3136,-4.57
3137,-4.68
3138,-4.85
3139,-5.00
3140,-5.10
3141,-5.16
3142,-5.22
3143,-5.30
3144,-5.41
3145,-5.56
3146,-5.79
3147,-6.09
3148,-6.39
3149,-6.61
3150,-6.72
3151,-6.74
3152,-6.70
3153,-6.58
3154,-6.38
3155,-6.14
3156,-5.91
3157,-5.73
3158,-5.58
3159,-5.46
3160,-5.41
3161,-5.46
3162,-5.64
3163,-5.89
3164,-6.13
3165,-6.32
3166,-6.40
3167,-6.38
3168,-6.24
3169,-6.00
3170,-5.68
3171,-5.31
3172,-4.94
3173,-4.62
3174,-4.33
3175,-4.07
3176,-3.80
3177,-3.53
3178,-3.27
3179,-3.05
3180,-2.91
3181,-2.86
3182,-2.88
3183,-2.97
3184,-3.13
3185,-3.37
3186,-3.65
3187,-3.93
3188,-4.17
3189,-4.35
3190,-4.48
3191,-4.56
3192,-4.61
3193,-4.61
3194,-4.58
3195,-4.52
3196,-4.43
3197,-4.33
3198,-4.26
3199,-4.20
3200,-4.14
3201,-4.08
3202,-4.03
3203,-4.01
3204,-4.01
3205,-4.07
3206,-4.17
3207,-4.33
3208,-4.50
3209,-4.68
3210,-4.84
3211,-4.90
3212,-4.84
3213,-4.63
3214,-4.30
3215,-3.89
3216,-3.51
3217,-3.23
3218,-3.14
3219,-3.27
3220,-3.56
3221,-3.99
3222,-4.49
3223,-4.97
3224,-5.36
3225,-5.60
3226,-5.66
3227,-5.57
3228,-5.39
3229,-5.13
3230,-4.89
3231,-4.74
3232,-4.73
3233,-4.85
3234,-5.04
3235,-5.26
3236,-5.49
3237,-5.68
3238,-5.72
3239,-5.61
3240,-5.36
3241,-5.07
3242,-4.84
3243,-4.69
3244,-4.63
3245,-4.64
3246,-4.66
3247,-4.65
3248,-4.51
3249,-4.20
3250,-3.75
3251,-3.23
3252,-2.75
3253,-2.40
3254,-2.30
3255,-2.49
3256,-2.94
3257,-3.55
3258,-4.20
3259,-4.80
3260,-5.29
3261,-5.65
3262,-5.85
3263,-5.91
3264,-5.88
3265,-5.81
3266,-5.73
3267,-5.61
3268,-5.49
3269,-5.36
3270,-5.26
3271,-5.17
3272,-5.10
3273,-5.03
3274,-5.00
3275,-5.04
3276,-5.11
3277,-5.20
3278,-5.26
3279,-5.26
3280,-5.23
3281,-5.20
3282,-5.17
3283,-5.14
3284,-5.13
3285,-5.13
3286,-5.12
3287,-5.06
3288,-4.95
3289,-4.83
3290,-4.70
3291,-4.58
3292,-4.50
3293,-4.50
3294,-4.60
3295,-4.78
3296,-5.00
3297,-5.23
3298,-5.49
3299,-5.74
3300,-5.93
3301,-6.01
3302,-6.00
3303,-5.97
3304,-5.97
3305,-5.99
3306,-6.03
3307,-6.10
3308,-6.20
3309,-6.32
3310,-6.40
3311,-6.37
3312,-6.25
3313,-6.12
3314,-6.07
3315,-6.13
3316,-6.27
3317,-6.45
3318,-6.67
3319,-6.87
3320,-7.02
3321,-7.03
3322,-6.89
3323,-6.65
3324,-6.35
3325,-6.07
3326,-5.86
3327,-5.77
3328,-5.84
3329,-6.05
3330,-6.36
3331,-6.72
3332,-7.13
3333,-7.51
3334,-7.82
3335,-8.01
3336,-8.08
3337,-8.04
3338,-7.90
3339,-7.67
3340,-7.37
3341,-7.06
3342,-6.77
3343,-6.57
3344,-6.45
3345,-6.39
3346,-6.36
3347,-6.30
3348,-6.23
3349,-6.14
3350,-5.98
3351,-5.74
3352,-5.46
3353,-5.22
3354,-5.05
3355,-5.00
3356,-5.04
3357,-5.16
3358,-5.33
3359,-5.52
3360,-5.66
3361,-5.72
3362,-5.71
3363,-5.65
3364,-5.56
3365,-5.43
3366,-5.27
3367,-5.10
3368,-4.94
3369,-4.78
3370,-4.62
3371,-4.46
3372,-4.41
3373,-4.49
3374,-4.69
3375,-4.97
3376,-5.30
3377,-5.66
3378,-6.00
3379,-6.25
3380,-6.34
3381,-6.27
3382,-6.13
3383,-5.96
3384,-5.85
3385,-5.84
3386,-6.00
3387,-6.29
3388,-6.69
3389,-7.13
3390,-7.54
3391,-7.86
3392,-8.07
3393,-8.19
3394,-8.26
3395,-8.32
3396,-8.37
3397,-8.43
3398,-8.51
3399,-8.63
3400,-8.74
3401,-8.84
3402,-8.91
3403,-8.94
3404,-8.90
3405,-8.82
3406,-8.69
3407,-8.54
3408,-8.35
3409,-8.15
3410,-7.94
3411,-7.77
3412,-7.61
3413,-7.50
3414,-7.42
3415,-7.35
3416,-7.29
3417,-7.22
3418,-7.06
3419,-6.83
3420,-6.50
3421,-6.14
3422,-5.80
3423,-5.52
3424,-5.33
3425,-5.22
3426,-5.17
3427,-5.17
3428,-5.20
3429,-5.23
3430,-5.26
3431,-5.31
3432,-5.42
3433,-5.58
3434,-5.74
3435,-5.92
3436,-6.12
3437,-6.32
3438,-6.53
3439,-6.68
3440,-6.77
3441,-6.83
3442,-6.90
3443,-6.98
3444,-7.07
3445,-7.16
3446,-7.28
3447,-7.45
3448,-7.68
3449,-7.93
3450,-8.18
3451,-8.41
3452,-8.62
3453,-8.77
3454,-8.85
3455,-8.84
3456,-8.77
3457,-8.69
3458,-8.62
3459,-8.55
3460,-8.47
3461,-8.35
3462,-8.22
3463,-8.13
3464,-8.06
3465,-8.01
3466,-7.97
3467,-7.93
3468,-7.91
3469,-7.92
3470,-7.93
3471,-7.98
3472,-7.99
3473,-7.96
3474,-7.87
3475,-7.79
3476,-7.71
3477,-7.62
3478,-7.48
3479,-7.31
3480,-7.14
3481,-6.99
3482,-6.81
3483,-6.61
3484,-6.39
3485,-6.18
3486,-5.96
3487,-5.72
3488,-5.49
3489,-5.25
3490,-5.00
3491,-4.75
3492,-4.55
3493,-4.46
3494,-4.52
3495,-4.73
3496,-5.05
3497,-5.45
3498,-5.88
3499,-6.33
3500,-6.74
3501,-7.04
3502,-7.21
3503,-7.26
3504,-7.29
3505,-7.38
3506,-7.55
3507,-7.75
3508,-7.97
3509,-8.21
3510,-8.49
3511,-8.75
3512,-8.96
3513,-9.08
3514,-9.15
3515,-9.16
3516,-9.15
3517,-9.09
3518,-9.04
3519,-9.03
3520,-9.07
3521,-9.12
3522,-9.22
3523,-9.34
3524,-9.48
3525,-9.57
3526,-9.57
3527,-9.48
3528,-9.35
3529,-9.19
3530,-9.01
3531,-8.83
3532,-8.71
3533,-8.69
3534,-8.82
3535,-9.06
3536,-9.41
3537,-9.83
3538,-10.29
3539,-10.71
3540,-11.03
3541,-11.21
3542,-11.28
3543,-11.27
3544,-11.24
3545,-11.23
3546,-11.31
3547,-11.51
3548,-11.86
3549,-12.32
3550,-12.79
3551,-13.16
3552,-13.35
3553,-13.31
3554,-13.06
3555,-12.66
3556,-12.23
3557,-11.83
3558,-11.52
3559,-11.38
3560,-11.42
3561,-11.63
3562,-11.93
3563,-12.21
3564,-12.41
3565,-12.53
3566,-12.57
3567,-12.57
3568,-12.55
3569,-12.55
3570,-12.60
3571,-12.68
3572,-12.80
3573,-12.92
3574,-13.04
3575,-13.13
3576,-13.18
3577,-13.15
3578,-13.04
3579,-12.89
3580,-12.73
3581,-12.57
3582,-12.44
3583,-12.34
3584,-12.32
3585,-12.38
3586,-12.50
3587,-12.66
3588,-12.81
3589,-12.93
3590,-13.01
3591,-13.04
3592,-13.03
3593,-12.99
3594,-12.95
3595,-12.92
3596,-12.92
3597,-12.92
3598,-12.92
3599,-12.92
3600,-12.92
3601,-12.92
3602,-12.90
3603,-12.87
3604,-12.84
3605,-12.81
3606,-12.78
3607,-12.72
3608,-12.62
3609,-12.47
3610,-12.28
3611,-12.06
3612,-11.88
3613,-11.74
3614,-11.72
3615,-11.84
3616,-12.12
3617,-12.51
3618,-12.95
3619,-13.36
3620,-13.77
3621,-14.19
3622,-14.64
3623,-15.05
3624,-15.40
3625,-15.66
3626,-15.88
3627,-16.00
3628,-15.98
3629,-15.79
3630,-15.53
3631,-15.30
3632,-15.21
3633,-15.27
3634,-15.47
3635,-15.78
3636,-16.14
3637,-16.47
3638,-16.69
3639,-16.76
3640,-16.68
3641,-16.49
3642,-16.24
3643,-15.95
3644,-15.72
3645,-15.57
3646,-15.53
3647,-15.56
3648,-15.63
3649,-15.68
3650,-15.75
3651,-15.87
3652,-16.04
3653,-16.25
3654,-16.48
3655,-16.70
3656,-16.87
3657,-16.95
3658,-16.95
3659,-16.93
3660,-16.90
3661,-16.90
3662,-16.91
3663,-16.94
3664,-16.98
3665,-17.02
3666,-17.01
3667,-16.90
3668,-16.66
3669,-16.33
3670,-15.94
3671,-15.54
3672,-15.18
3673,-14.93
3674,-14.75
3675,-14.64
3676,-14.52
3677,-14.39
3678,-14.19
3679,-13.96
3680,-13.65
3681,-13.30
3682,-12.89
3683,-12.51
3684,-12.13
3685,-11.82
3686,-11.53
3687,-11.26
3688,-10.98
3689,-10.70
3690,-10.38
3691,-10.03
3692,-9.60
3693,-9.16
3694,-8.74
3695,-8.41
3696,-8.14
3697,-7.98
3698,-7.90
3699,-7.91
3700,-7.93
3701,-7.91
3702,-7.79
3703,-7.59
3704,-7.29
3705,-6.94
3706,-6.51
3707,-6.07
3708,-5.63
3709,-5.24
3710,-4.91
3711,-4.63
3712,-4.44
3713,-4.36
3714,-4.36
3715,-4.43
3716,-4.51
3717,-4.61
3718,-4.71
3719,-4.80
3720,-4.81
3721,-4.73
3722,-4.56
3723,-4.34
3724,-4.10
3725,-3.83
3726,-3.55
3727,-3.27
3728,-3.05
3729,-2.90
3730,-2.84
3731,-2.88
3732,-3.11
3733,-3.52
3734,-4.15
3735,-4.93
3736,-5.80
3737,-6.63
3738,-7.39
3739,-8.01
3740,-8.53
3741,-8.90
3742,-9.17
3743,-9.34
3744,-9.52
3745,-9.75
3746,-10.06
3747,-10.35
3748,-10.63
3749,-10.86
3750,-11.06
3751,-11.17
3752,-11.19
3753,-11.12
3754,-11.04
3755,-10.97
3756,-10.96
3757,-10.99
3758,-11.06
3759,-11.18
3760,-11.33
3761,-11.45
3762,-11.51
3763,-11.51
3764,-11.48
3765,-11.44
3766,-11.41
3767,-11.38
3768,-11.38
3769,-11.40
3770,-11.47
3771,-11.59
3772,-11.80
3773,-12.06
3774,-12.36
3775,-12.66
3776,-12.98
3777,-13.31
3778,-13.58
3779,-13.71
3780,-13.63
3781,-13.32
3782,-12.86
3783,-12.31
3784,-11.74
3785,-11.19
3786,-10.73
3787,-10.44
3788,-10.32
3789,-10.36
3790,-10.47
3791,-10.57
3792,-10.61
3793,-10.61
3794,-10.55
3795,-10.50
3796,-10.47
3797,-10.50
3798,-10.56
3799,-10.63
3800,-10.70
3801,-10.73
3802,-10.68
3803,-10.56
3804,-10.39
3805,-10.21
3806,-10.02
3807,-9.85
3808,-9.70
3809,-9.57
3810,-9.45
3811,-9.34
3812,-9.25
3813,-9.19
3814,-9.14
3815,-9.12
3816,-9.14
3817,-9.25
3818,-9.43
3819,-9.62
3820,-9.77
3821,-9.83
3822,-9.78
3823,-9.60
3824,-9.31
3825,-8.98
3826,-8.67
3827,-8.42
3828,-8.26
3829,-8.22
3830,-8.37
3831,-8.67
3832,-9.08
3833,-9.51
3834,-9.90
3835,-10.25
3836,-10.57
3837,-10.81
3838,-10.92
3839,-10.93
3840,-10.89
3841,-10.85
3842,-10.80
3843,-10.70
3844,-10.64
3845,-10.59
3846,-10.58
3847,-10.59
3848,-10.61
3849,-10.63
3850,-10.67
3851,-10.76
3852,-10.97
3853,-11.31
3854,-11.76
3855,-12.25
3856,-12.79
3857,-13.28
3858,-13.67
3859,-13.85
3860,-13.86
3861,-13.76
3862,-13.63
3863,-13.53
3864,-13.53
3865,-13.64
3866,-13.91
3867,-14.27
3868,-14.66
3869,-15.03
3870,-15.30
3871,-15.46
3872,-15.47
3873,-15.37
3874,-15.22
3875,-15.05
3876,-14.84
3877,-14.60
3878,-14.32
3879,-14.02
3880,-13.72
3881,-13.44
3882,-13.21
3883,-13.10
3884,-13.13
3885,-13.28
3886,-13.50
3887,-13.72
3888,-13.91
3889,-14.05
3890,-14.14
3891,-14.17
3892,-14.16
3893,-14.19
3894,-14.29
3895,-14.42
3896,-14.47
3897,-14.39
3898,-14.17
3899,-13.82
3900,-13.41
3901,-12.96
3902,-12.53
3903,-12.19
3904,-12.01
3905,-12.02
3906,-12.18
3907,-12.47
3908,-12.78
3909,-13.08
3910,-13.33
3911,-13.48
3912,-13.50
3913,-13.41
3914,-13.26
3915,-13.08
3916,-12.87
3917,-12.63
3918,-12.37
3919,-12.10
3920,-11.84
3921,-11.57
3922,-11.27
3923,-10.94
3924,-10.62
3925,-10.38
3926,-10.24
3927,-10.22
3928,-10.28
3929,-10.41
3930,-10.52
3931,-10.59
3932,-10.57
3933,-10.46
3934,-10.22
3935,-9.88
3936,-9.53
3937,-9.22
3938,-9.03
3939,-9.00
3940,-9.16
3941,-9.48
3942,-9.92
3943,-10.41
3944,-10.92
3945,-11.40
3946,-11.79
3947,-12.05
3948,-12.21
3949,-12.30
3950,-12.34
3951,-12.37
3952,-12.41
3953,-12.44
3954,-12.43
3955,-12.31
3956,-12.06
3957,-11.74
3958,-11.37
3959,-11.02
3960,-10.67
3961,-10.38
3962,-10.14
3963,-10.00
3964,-9.90
3965,-9.79
3966,-9.61
3967,-9.38
3968,-9.07
3969,-8.71
3970,-8.32
3971,-7.96
3972,-7.67
3973,-7.53
3974,-7.54
3975,-7.69
3976,-7.90
3977,-8.14
3978,-8.29
3979,-8.32
3980,-8.18
3981,-7.91
3982,-7.59
3983,-7.29
3984,-7.02
3985,-6.81
3986,-6.70
3987,-6.67
3988,-6.67
3989,-6.68
3990,-6.67
3991,-6.61
3992,-6.45
3993,-6.23
3994,-5.94
3995,-5.68
3996,-5.42
3997,-5.19
3998,-4.95
3999,-4.75
4000,-4.57
4001,-4.39
4002,-4.17
4003,-3.94
4004,-3.72
4005,-3.53
4006,-3.36
4007,-3.22
4008,-3.14
4009,-3.14
4010,-3.15
4011,-3.17
4012,-3.18
4013,-3.20
4014,-3.20
4015,-3.21
4016,-3.27
4017,-3.38
4018,-3.52
4019,-3.67
4020,-3.88
4021,-4.14
4022,-4.40
4023,-4.59
4024,-4.71
4025,-4.79
4026,-4.86
4027,-4.91
4028,-4.99
4029,-5.10
4030,-5.29
4031,-5.49
4032,-5.70
4033,-5.87
4034,-6.05
4035,-6.20
4036,-6.30
4037,-6.33
4038,-6.32
4039,-6.27
4040,-6.24
4041,-6.25
4042,-6.31
4043,-6.39
4044,-6.46
4045,-6.52
4046,-6.61
4047,-6.69
4048,-6.74
4049,-6.74
4050,-6.74
4051,-6.76
4052,-6.83
4053,-6.91
4054,-7.03
4055,-7.21
4056,-7.48
4057,-7.80
4058,-8.16
4059,-8.46
4060,-8.71
4061,-8.87
4062,-8.96
4063,-8.97
4064,-8.90
4065,-8.75
4066,-8.51
4067,-8.20
4068,-7.91
4069,-7.67
4070,-7.46
4071,-7.26
4072,-7.04
4073,-6.87
4074,-6.74
4075,-6.68
4076,-6.68
4077,-6.74
4078,-6.85
4079,-7.01
4080,-7.17
4081,-7.29
4082,-7.34
4083,-7.31
4084,-7.23
4085,-7.13
4086,-7.06
4087,-6.97
4088,-6.86
4089,-6.73
4090,-6.62
4091,-6.52
4092,-6.45
4093,-6.39
4094,-6.36
4095,-6.42
4096,-6.60
4097,-6.89
4098,-7.30
4099,-7.78
4100,-8.32
4101,-8.80
4102,-9.25
4103,-9.63
4104,-10.02
4105,-10.39
4106,-10.77
4107,-11.13
4108,-11.52
4109,-11.89
4110,-12.25
4111,-12.52
4112,-12.74
4113,-12.91
4114,-13.05
4115,-13.16
4116,-13.30
4117,-13.47
4118,-13.68
4119,-13.89
4120,-14.08
4121,-14.19
4122,-14.25
4123,-14.24
4124,-14.21
4125,-14.18
4126,-14.15
4127,-14.12
4128,-14.08
4129,-14.05
4130,-14.05
4131,-14.08
4132,-14.13
4133,-14.19
4134,-14.27
4135,-14.40
4136,-14.54
4137,-14.69
4138,-14.82
4139,-14.92
4140,-14.95
4141,-14.92
4142,-14.85
4143,-14.79
4144,-14.77
4145,-14.82
4146,-14.95
4147,-15.13
4148,-15.34
4149,-15.53
4150,-15.65
4151,-15.67
4152,-15.65
4153,-15.61
4154,-15.58
4155,-15.59
4156,-15.63
4157,-15.72
4158,-15.84
4159,-15.96
4160,-16.05
4161,-16.09
4162,-16.05
4163,-15.92
4164,-15.70
4165,-15.41
4166,-15.10
4167,-14.79
4168,-14.51
4169,-14.31
4170,-14.20
4171,-14.20
4172,-14.27
4173,-14.39
4174,-14.58
4175,-14.82
4176,-15.06
4177,-15.27
4178,-15.44
4179,-15.56
4180,-15.62
4181,-15.59
4182,-15.47
4183,-15.28
4184,-15.06
4185,-14.82
4186,-14.59
4187,-14.37
4188,-14.21
4189,-14.15
4190,-14.21
4191,-14.36
4192,-14.56
4193,-14.84
4194,-15.18
4195,-15.57
4196,-15.95
4197,-16.26
4198,-16.45
4199,-16.50
4200,-16.43
4201,-16.26
4202,-16.02
4203,-15.76
4204,-15.57
4205,-15.51
4206,-15.63
4207,-15.86
4208,-16.14
4209,-16.36
4210,-16.49
4211,-16.51
4212,-16.41
4213,-16.23
4214,-16.06
4215,-15.98
4216,-16.06
4217,-16.27
4218,-16.60
4219,-16.96
4220,-17.30
4221,-17.57
4222,-17.78
4223,-17.89
4224,-17.92
4225,-17.88
4226,-17.85
4227,-17.85
4228,-17.88
4229,-17.91
4230,-17.91
4231,-17.91
4232,-17.96
4233,-18.01
4234,-18.04
4235,-18.08
4236,-18.16
4237,-18.26
4238,-18.36
4239,-18.40
4240,-18.40
4241,-18.36
4242,-18.26
4243,-18.09
4244,-17.89
4245,-17.70
4246,-17.51
4247,-17.30
4248,-17.12
4249,-17.00
4250,-16.94
4251,-16.98
4252,-17.09
4253,-17.28
4254,-17.48
4255,-17.67
4256,-17.80
4257,-17.83
4258,-17.72
4259,-17.49
4260,-17.17
4261,-16.86
4262,-16.62
4263,-16.48
4264,-16.42
4265,-16.45
4266,-16.54
4267,-16.65
4268,-16.68
4269,-16.59
4270,-16.34
4271,-16.00
4272,-15.56
4273,-15.09
4274,-14.53
4275,-13.98
4276,-13.44
4277,-13.00
4278,-12.59
4279,-12.21
4280,-11.84
4281,-11.52
4282,-11.22
4283,-10.97
4284,-10.70
4285,-10.41
4286,-10.06
4287,-9.71
4288,-9.34
4289,-9.00
4290,-8.64
4291,-8.35
4292,-8.11
4293,-7.94
4294,-7.78
4295,-7.61
4296,-7.39
4297,-7.13
4298,-6.81
4299,-6.45
4300,-6.04
4301,-5.66
4302,-5.33
4303,-5.07
4304,-4.80
4305,-4.56
4306,-4.39
4307,-4.30
4308,-4.25
4309,-4.23
4310,-4.27
4311,-4.43
4312,-4.64
4313,-4.86
4314,-5.03
4315,-5.16
4316,-5.23
4317,-5.21
4318,-5.11
4319,-4.97
4320,-4.81
4321,-4.70
4322,-4.59
4323,-4.48
4324,-4.36
4325,-4.26
4326,-4.20
4327,-4.17
4328,-4.17
4329,-4.20
4330,-4.26
4331,-4.35
4332,-4.48
4333,-4.65
4334,-4.90
4335,-5.19
4336,-5.52
4337,-5.88
4338,-6.29
4339,-6.73
4340,-7.21
4341,-7.66
4342,-8.05
4343,-8.35
4344,-8.57
4345,-8.70
4346,-8.79
4347,-8.85
4348,-8.93
4349,-9.01
4350,-9.10
4351,-9.19
4352,-9.30
4353,-9.38
4354,-9.41
4355,-9.32
4356,-9.14
4357,-8.92
4358,-8.72
4359,-8.61
4360,-8.58
4361,-8.61
4362,-8.67
4363,-8.79
4364,-9.00
4365,-9.26
4366,-9.54
4367,-9.79
4368,-9.99
4369,-10.17
4370,-10.31
4371,-10.40
4372,-10.45
4373,-10.44
4374,-10.39
4375,-10.30
4376,-10.20
4377,-10.11
4378,-10.02
4379,-9.93
4380,-9.87
4381,-9.86
4382,-9.91
4383,-10.01
4384,-10.14
4385,-10.29
4386,-10.44
4387,-10.57
4388,-10.63
4389,-10.60
4390,-10.46
4391,-10.25
4392,-9.99
4393,-9.76
4394,-9.55
4395,-9.38
4396,-9.22
4397,-9.10
4398,-9.01
4399,-8.92
4400,-8.82
4401,-8.74
4402,-8.69
4403,-8.71
4404,-8.80
4405,-8.96
4406,-9.16
4407,-9.38
4408,-9.55
4409,-9.64
4410,-9.64
4411,-9.52
4412,-9.27
4413,-8.87
4414,-8.38
4415,-7.90
4416,-7.51
4417,-7.30
4418,-7.27
4419,-7.42
4420,-7.74
4421,-8.20
4422,-8.72
4423,-9.21
4424,-9.58
4425,-9.80
4426,-9.83
4427,-9.74
4428,-9.54
4429,-9.30
4430,-9.06
4431,-8.87
4432,-8.80
4433,-8.80
4434,-8.83
4435,-8.87
4436,-8.87
4437,-8.84
4438,-8.78
4439,-8.73
4440,-8.67
4441,-8.62
4442,-8.54
4443,-8.42
4444,-8.25
4445,-8.02
4446,-7.69
4447,-7.27
4448,-6.77
4449,-6.30
4450,-5.88
4451,-5.55
4452,-5.29
4453,-5.18
4454,-5.24
4455,-5.49
4456,-5.83
4457,-6.17
4458,-6.45
4459,-6.65
4460,-6.79
4461,-6.84
4462,-6.85
4463,-6.84
4464,-6.89
4465,-7.00
4466,-7.19
4467,-7.44
4468,-7.71
4469,-7.92
4470,-8.01
4471,-7.97
4472,-7.89
4473,-7.81
4474,-7.80
4475,-7.83
4476,-7.92
4477,-8.07
4478,-8.26
4479,-8.45
4480,-8.58
4481,-8.67
4482,-8.72
4483,-8.72
4484,-8.67
4485,-8.58
4486,-8.48
4487,-8.32
4488,-8.09
4489,-7.82
4490,-7.60
4491,-7.47
4492,-7.42
4493,-7.43
4494,-7.48
4495,-7.61
4496,-7.77
4497,-7.89
4498,-7.93
4499,-7.90
4500,-7.84
4501,-7.77
4502,-7.72
4503,-7.76
4504,-7.91
4505,-8.18
4506,-8.48
4507,-8.74
4508,-8.89
4509,-8.89
4510,-8.68
4511,-8.23
4512,-7.58
4513,-6.85
4514,-6.15
4515,-5.57
4516,-5.20
4517,-5.11
4518,-5.34
4519,-5.82
4520,-6.44
4521,-7.06
4522,-7.57
4523,-7.90
4524,-8.00
4525,-7.93
4526,-7.80
4527,-7.66
4528,-7.61
4529,-7.63
4530,-7.78
4531,-8.05
4532,-8.42
4533,-8.77
4534,-9.06
4535,-9.25
4536,-9.35
4537,-9.36
4538,-9.32
4539,-9.23
4540,-9.14
4541,-9.07
4542,-9.03
4543,-9.03
4544,-9.10
4545,-9.22
4546,-9.38
4547,-9.52
4548,-9.65
4549,-9.74
4550,-9.79
4551,-9.78
4552,-9.76
4553,-9.72
4554,-9.70
4555,-9.70
4556,-9.72
4557,-9.75
4558,-9.80
4559,-9.87
4560,-9.89
4561,-9.83
4562,-9.70
4563,-9.55
4564,-9.41
4565,-9.28
4566,-9.18
4567,-9.09
4568,-9.02
4569,-8.90
4570,-8.68
4571,-8.38
4572,-8.07
4573,-7.81
4574,-7.67
4575,-7.70
4576,-7.98
4577,-8.52
4578,-9.24
4579,-10.03
4580,-10.82
4581,-11.47
4582,-11.91
4583,-12.08
4584,-12.05
4585,-11.92
4586,-11.79
4587,-11.72
4588,-11.76
4589,-11.91
4590,-12.17
4591,-12.47
4592,-12.78
4593,-13.01
4594,-13.16
4595,-13.25
4596,-13.30
4597,-13.29
4598,-13.24
4599,-13.18
4600,-13.17
4601,-13.19
4602,-13.21
4603,-13.21
4604,-13.24
4605,-13.29
4606,-13.35
4607,-13.38
4608,-13.40
4609,-13.40
4610,-13.36
4611,-13.28
4612,-13.17
4613,-13.08
4614,-13.00
4615,-12.97
4616,-13.01
4617,-13.13
4618,-13.32
4619,-13.51
4620,-13.60
4621,-13.50
4622,-13.23
4623,-12.82
4624,-12.29
4625,-11.72
4626,-11.15
4627,-10.67
4628,-10.35
4629,-10.22
4630,-10.29
4631,-10.54
4632,-10.93
4633,-11.41
4634,-11.89
4635,-12.32
4636,-12.67
4637,-12.94
4638,-13.10
4639,-13.13
4640,-13.06
4641,-12.93
4642,-12.78
4643,-12.63
4644,-12.51
4645,-12.45
4646,-12.45
4647,-12.52
4648,-12.61
4649,-12.70
4650,-12.75
4651,-12.75
4652,-12.73
4653,-12.70
4654,-12.67
4655,-12.67
4656,-12.69
4657,-12.73
4658,-12.76
4659,-12.79
4660,-12.78
4661,-12.70
4662,-12.52
4663,-12.25
4664,-11.89
4665,-11.54
4666,-11.24
4667,-10.99
4668,-10.80
4669,-10.65
4670,-10.57
4671,-10.58
4672,-10.59
4673,-10.60
4674,-10.60
4675,-10.64
4676,-10.66
4677,-10.64
4678,-10.54
4679,-10.33
4680,-10.00
4681,-9.62
4682,-9.22
4683,-8.83
4684,-8.43
4685,-8.08
4686,-7.82
4687,-7.67
4688,-7.56
4689,-7.45
4690,-7.34
4691,-7.27
4692,-7.25
4693,-7.25
4694,-7.28
4695,-7.34
4696,-7.44
4697,-7.55
4698,-7.70
4699,-7.87
4700,-8.12
4701,-8.44
4702,-8.86
4703,-9.33
4704,-9.86
4705,-10.40
4706,-10.93
4707,-11.34
4708,-11.60
4709,-11.72
4710,-11.73
4711,-11.67
4712,-11.54
4713,-11.36
4714,-11.18
4715,-11.02
4716,-10.90
4717,-10.79
4718,-10.67
4719,-10.59
4720,-10.51
4721,-10.46
4722,-10.39
4723,-10.31
4724,-10.16
4725,-9.96
4726,-9.68
4727,-9.35
4728,-9.00
4729,-8.74
4730,-8.58
4731,-8.54
4732,-8.63
4733,-8.85
4734,-9.18
4735,-9.54
4736,-9.82
4737,-9.93
4738,-9.83
4739,-9.56
4740,-9.10
4741,-8.56
4742,-8.05
4743,-7.68
4744,-7.51
4745,-7.54
4746,-7.76
4747,-8.13
4748,-8.53
4749,-8.87
4750,-9.07
4751,-9.09
4752,-8.97
4753,-8.79
4754,-8.62
4755,-8.49
4756,-8.43
4757,-8.47
4758,-8.61
4759,-8.82
4760,-9.01
4761,-9.14
4762,-9.22
4763,-9.28
4764,-9.30
4765,-9.27
4766,-9.20
4767,-9.14
4768,-9.09
4769,-9.06
4770,-9.03
4771,-9.00
4772,-9.00
4773,-9.03
4774,-9.09
4775,-9.15
4776,-9.21
4777,-9.30
4778,-9.43
4779,-9.57
4780,-9.70
4781,-9.77
4782,-9.77
4783,-9.71
4784,-9.54
4785,-9.28
4786,-8.96
4787,-8.65
4788,-8.40
4789,-8.25
4790,-8.22
4791,-8.35
4792,-8.61
4793,-8.94
4794,-9.27
4795,-9.54
4796,-9.75
4797,-9.87
4798,-9.88
4799,-9.76
4800,-9.53
4801,-9.29
4802,-9.08
4803,-8.90
4804,-8.72
4805,-8.54
4806,-8.39
4807,-8.27
4808,-8.16
4809,-8.05
4810,-7.93
4811,-7.81
4812,-7.65
4813,-7.48
4814,-7.32
4815,-7.22
4816,-7.19
4817,-7.29
4818,-7.52
4819,-7.86
4820,-8.22
4821,-8.55
4822,-8.85
4823,-9.09
4824,-9.24
4825,-9.30
4826,-9.28
4827,-9.25
4828,-9.23
4829,-9.27
4830,-9.35
4831,-9.41
4832,-9.39
4833,-9.27
4834,-9.08
4835,-8.83
4836,-8.55
4837,-8.26
4838,-7.97
4839,-7.78
4840,-7.73
4841,-7.79
4842,-7.93
4843,-8.12
4844,-8.32
4845,-8.53
4846,-8.74
4847,-8.91
4848,-9.07
4849,-9.22
4850,-9.38
4851,-9.54
4852,-9.77
4853,-10.03
4854,-10.35
4855,-10.64
4856,-10.90
4857,-11.05
4858,-11.09
4859,-10.99
4860,-10.79
4861,-10.51
4862,-10.23
4863,-9.98
4864,-9.83
4865,-9.83
4866,-9.99
4867,-10.31
4868,-10.66
4869,-10.97
4870,-11.18
4871,-11.26
4872,-11.22
4873,-11.11
4874,-10.94
4875,-10.76
4876,-10.57
4877,-10.42
4878,-10.35
4879,-10.35
4880,-10.36
4881,-10.38
4882,-10.38
4883,-10.38
4884,-10.33
4885,-10.25
4886,-10.13
4887,-10.01
4888,-9.85
4889,-9.65
4890,-9.41
4891,-9.16
4892,-8.93
4893,-8.75
4894,-8.66
4895,-8.66
4896,-8.75
4897,-8.90
4898,-9.09
4899,-9.30
4900,-9.52
4901,-9.74
4902,-9.92
4903,-10.09
4904,-10.29
4905,-10.50
4906,-10.68
4907,-10.77
4908,-10.77
4909,-10.67
4910,-10.52
4911,-10.34
4912,-10.17
4913,-10.07
4914,-10.08
4915,-10.20
4916,-10.44
4917,-10.75
4918,-11.03
4919,-11.19
4920,-11.15
4921,-10.94
4922,-10.60
4923,-10.21
4924,-9.81
4925,-9.48
4926,-9.28
4927,-9.25
4928,-9.35
4929,-9.48
4930,-9.54
4931,-9.45
4932,-9.22
4933,-8.89
4934,-8.51
4935,-8.19
4936,-8.05
4937,-8.11
4938,-8.37
4939,-8.77
4940,-9.22
4941,-9.65
4942,-9.98
4943,-10.15
4944,-10.18
4945,-10.11
4946,-10.03
4947,-9.99
4948,-10.04
4949,-10.15
4950,-10.36
4951,-10.60
4952,-10.83
4953,-10.95
4954,-10.95
4955,-10.85
4956,-10.71
4957,-10.56
4958,-10.41
4959,-10.30
4960,-10.22
4961,-10.15
4962,-10.07
4963,-9.99
4964,-9.93
4965,-9.94
4966,-9.96
4967,-9.99
4968,-10.04
4969,-10.09
4970,-10.12
4971,-10.08
4972,-9.91
4973,-9.64
4974,-9.30
4975,-8.96
4976,-8.68
4977,-8.47
4978,-8.33
4979,-8.31
4980,-8.40
4981,-8.59
4982,-8.80
4983,-8.99
4984,-9.11
4985,-9.21
4986,-9.25
4987,-9.25
4988,-9.20
4989,-9.11
4990,-9.01
4991,-8.91
4992,-8.83
4993,-8.77
4994,-8.77
4995,-8.83
4996,-8.92
4997,-9.00
4998,-9.11
4999,-9.22
5000,-9.35
5001,-9.43
5002,-9.48
5003,-9.51
5004,-9.56
5005,-9.61
5006,-9.67
5007,-9.74
5008,-9.83
5009,-9.98
5010,-10.14
5011,-10.29
5012,-10.45
5013,-10.60
5014,-10.71
5015,-10.73
5016,-10.68
5017,-10.56
5018,-10.42
5019,-10.26
5020,-10.09
5021,-9.95
5022,-9.86
5023,-9.83
5024,-9.83
5025,-9.86
5026,-9.93
5027,-10.05
5028,-10.19
5029,-10.31
5030,-10.41
5031,-10.53
5032,-10.67
5033,-10.79
5034,-10.86
5035,-10.89
5036,-10.89
5037,-10.86
5038,-10.81
5039,-10.75
5040,-10.69
5041,-10.64
5042,-10.57
5043,-10.45
5044,-10.26
5045,-10.03
5046,-9.76
5047,-9.49
5048,-9.22
5049,-8.97
5050,-8.78
5051,-8.67
5052,-8.61
5053,-8.62
5054,-8.67
5055,-8.76
5056,-8.87
5057,-9.03
5058,-9.22
5059,-9.39
5060,-9.51
5061,-9.54
5062,-9.51
5063,-9.41
5064,-9.28
5065,-9.12
5066,-9.00
5067,-8.97
5068,-9.04
5069,-9.19
5070,-9.39
5071,-9.58
5072,-9.70
5073,-9.70
5074,-9.55
5075,-9.28
5076,-8.96
5077,-8.65
5078,-8.39
5079,-8.22
5080,-8.15
5081,-8.18
5082,-8.26
5083,-8.32
5084,-8.35
5085,-8.35
5086,-8.30
5087,-8.22
5088,-8.11
5089,-7.99
5090,-7.86
5091,-7.74
5092,-7.64
5093,-7.55
5094,-7.47
5095,-7.41
5096,-7.39
5097,-7.41
5098,-7.49
5099,-7.64
5100,-7.86
5101,-8.09
5102,-8.32
5103,-8.51
5104,-8.65
5105,-8.73
5106,-8.76
5107,-8.73
5108,-8.68
5109,-8.64
5110,-8.64
5111,-8.71
5112,-8.85
5113,-9.06
5114,-9.29
5115,-9.51
5116,-9.66
5117,-9.72
5118,-9.68
5119,-9.56
5120,-9.38
5121,-9.20
5122,-9.04
5123,-8.91
5124,-8.83
5125,-8.81
5126,-8.84
5127,-8.90
5128,-8.96
5129,-9.03
5130,-9.09
5131,-9.18
5132,-9.29
5133,-9.41
5134,-9.54
5135,-9.62
5136,-9.66
5137,-9.63
5138,-9.54
5139,-9.42
5140,-9.27
5141,-9.09
5142,-8.90
5143,-8.79
5144,-8.77
5145,-8.82
5146,-8.91
5147,-9.04
5148,-9.21
5149,-9.35
5150,-9.42
5151,-9.41
5152,-9.33
5153,-9.22
5154,-9.10
5155,-9.02
5156,-9.03
5157,-9.17
5158,-9.43
5159,-9.71
5160,-9.95
5161,-10.07
5162,-10.02
5163,-9.80
5164,-9.49
5165,-9.15
5166,-8.85
5167,-8.64
5168,-8.56
5169,-8.59
5170,-8.70
5171,-8.83
5172,-8.92
5173,-8.91
5174,-8.77
5175,-8.57
5176,-8.38
5177,-8.28
5178,-8.29
5179,-8.42
5180,-8.65
5181,-8.94
5182,-9.25
5183,-9.56
5184,-9.86
5185,-10.16
5186,-10.42
5187,-10.63
5188,-10.81
5189,-10.99
5190,-11.14
5191,-11.18
5192,-11.04
5193,-10.74
5194,-10.34
5195,-9.91
5196,-9.52
5197,-9.22
5198,-9.05
5199,-9.05
5200,-9.22
5201,-9.51
5202,-9.77
5203,-9.90
5204,-9.83
5205,-9.59
5206,-9.22
5207,-8.78
5208,-8.38
5209,-8.08
5210,-7.94
5211,-7.97
5212,-8.13
5213,-8.37
5214,-8.68
5215,-9.02
5216,-9.30
5217,-9.51
5218,-9.66
5219,-9.77
5220,-9.88
5221,-9.97
5222,-10.04
5223,-10.06
5224,-10.06
5225,-10.03
5226,-9.99
5227,-9.95
5228,-9.96
5229,-10.01
5230,-10.13
5231,-10.28
5232,-10.44
5233,-10.59
5234,-10.73
5235,-10.88
5236,-11.05
5237,-11.19
5238,-11.31
5239,-11.40
5240,-11.47
5241,-11.54
5242,-11.56
5243,-11.54
5244,-11.47
5245,-11.40
5246,-11.36
5247,-11.40
5248,-11.51
5249,-11.63
5250,-11.69
5251,-11.66
5252,-11.55
5253,-11.41
5254,-11.19
5255,-10.93
5256,-10.65
5257,-10.44
5258,-10.31
5259,-10.27
5260,-10.22
5261,-10.13
5262,-9.96
5263,-9.77
5264,-9.52
5265,-9.26
5266,-8.95
5267,-8.66
5268,-8.42
5269,-8.24
5270,-8.05
5271,-7.86
5272,-7.65
5273,-7.48
5274,-7.29
5275,-7.09
5276,-6.87
5277,-6.70
5278,-6.52
5279,-6.36
5280,-6.15
5281,-5.89
5282,-5.55
5283,-5.16
5284,-4.74
5285,-4.34
5286,-4.01
5287,-3.78
5288,-3.63
5289,-3.57
5290,-3.57
5291,-3.61
5292,-3.65
5293,-3.68
5294,-3.68
5295,-3.68
5296,-3.73
5297,-3.88
5298,-4.11
5299,-4.42
5300,-4.78
5301,-5.20
5302,-5.65
5303,-6.10
5304,-6.54
5305,-6.92
5306,-7.24
5307,-7.45
5308,-7.55
5309,-7.48
5310,-7.27
5311,-6.97
5312,-6.64
5313,-6.36
5314,-6.20
5315,-6.20
5316,-6.37
5317,-6.74
5318,-7.25
5319,-7.80
5320,-8.26
5321,-8.49
5322,-8.49
5323,-8.27
5324,-7.93
5325,-7.55
5326,-7.25
5327,-7.06
5328,-7.03
5329,-7.13
5330,-7.29
5331,-7.45
5332,-7.56
5333,-7.62
5334,-7.62
5335,-7.58
5336,-7.56
5337,-7.62
5338,-7.77
5339,-7.99
5340,-8.21
5341,-8.39
5342,-8.53
5343,-8.58
5344,-8.54
5345,-8.38
5346,-8.19
5347,-8.00
5348,-7.85
5349,-7.80
5350,-7.85
5351,-7.97
5352,-8.11
5353,-8.26
5354,-8.43
5355,-8.62
5356,-8.76
5357,-8.82
5358,-8.80
5359,-8.74
5360,-8.65
5361,-8.53
5362,-8.38
5363,-8.20
5364,-8.02
5365,-7.86
5366,-7.76
5367,-7.70
5368,-7.67
5369,-7.67
5370,-7.72
5371,-7.80
5372,-7.90
5373,-8.00
5374,-8.10
5375,-8.22
5376,-8.34
5377,-8.46
5378,-8.58
5379,-8.70
5380,-8.81
5381,-8.90
5382,-8.98
5383,-9.03
5384,-9.07
5385,-9.10
5386,-9.14
5387,-9.19
5388,-9.28
5389,-9.37
5390,-9.47
5391,-9.52
5392,-9.52
5393,-9.50
5394,-9.48
5395,-9.47
5396,-9.44
5397,-9.41
5398,-9.45
5399,-9.57
5400,-9.70
5401,-9.78
5402,-9.76
5403,-9.63
5404,-9.38
5405,-9.09
5406,-8.80
5407,-8.59
5408,-8.45
5409,-8.40
5410,-8.43
5411,-8.52
5412,-8.61
5413,-8.61
5414,-8.54
5415,-8.37
5416,-8.14
5417,-7.90
5418,-7.74
5419,-7.67
5420,-7.69
5421,-7.79
5422,-7.97
5423,-8.20
5424,-8.45
5425,-8.71
5426,-8.94
5427,-9.18
5428,-9.41
5429,-9.62
5430,-9.80
5431,-9.93
5432,-9.96
5433,-9.89
5434,-9.78
5435,-9.65
5436,-9.53
5437,-9.44
5438,-9.42
5439,-9.54
5440,-9.78
5441,-10.06
5442,-10.28
5443,-10.38
5444,-10.32
5445,-10.12
5446,-9.75
5447,-9.29
5448,-8.83
5449,-8.46
5450,-8.25
5451,-8.20
5452,-8.26
5453,-8.39
5454,-8.51
5455,-8.58
5456,-8.54
5457,-8.42
5458,-8.25
5459,-8.09
5460,-8.02
5461,-8.02
5462,-8.08
5463,-8.17
5464,-8.27
5465,-8.36
5466,-8.42
5467,-8.45
5468,-8.45
5469,-8.45
5470,-8.48
5471,-8.57
5472,-8.73
5473,-8.90
5474,-9.06
5475,-9.19
5476,-9.28
5477,-9.37
5478,-9.45
5479,-9.54
5480,-9.64
5481,-9.80
5482,-10.00
5483,-10.24
5484,-10.48
5485,-10.69
5486,-10.86
5487,-10.97
5488,-11.05
5489,-11.09
5490,-11.18
5491,-11.32
5492,-11.55
5493,-11.85
5494,-12.23
5495,-12.64
5496,-13.07
5497,-13.46
5498,-13.79
5499,-14.03
5500,-14.16
5501,-14.18
5502,-14.14
5503,-14.08
5504,-14.03
5505,-14.00
5506,-13.96
5507,-13.90
5508,-13.85
5509,-13.79
5510,-13.71
5511,-13.62
5512,-13.53
5513,-13.47
5514,-13.42
5515,-13.37
5516,-13.31
5517,-13.28
5518,-13.26
5519,-13.24
5520,-13.20
5521,-13.18
5522,-13.16
5523,-13.13
5524,-13.03
5525,-12.86
5526,-12.62
5527,-12.34
5528,-12.05
5529,-11.77
5530,-11.59
5531,-11.50
5532,-11.48
5533,-11.52
5534,-11.60
5535,-11.67
5536,-11.74
5537,-11.77
5538,-11.81
5539,-11.89
5540,-12.04
5541,-12.25
5542,-12.53
5543,-12.86
5544,-13.21
5545,-13.53
5546,-13.83
5547,-14.09
5548,-14.37
5549,-14.66
5550,-14.99
5551,-15.35
5552,-15.75
5553,-16.13
5554,-16.48
5555,-16.75
5556,-16.92
5557,-16.98
5558,-16.93
5559,-16.78
5560,-16.56
5561,-16.31
5562,-16.08
5563,-15.91
5564,-15.79
5565,-15.69
5566,-15.61
5567,-15.53
5568,-15.44
5569,-15.36
5570,-15.21
5571,-14.98
5572,-14.66
5573,-14.34
5574,-13.98
5575,-13.66
5576,-13.37
5577,-13.17
5578,-13.05
5579,-12.99
5580,-12.95
5581,-12.93
5582,-12.89
5583,-12.83
5584,-12.76
5585,-12.67
5586,-12.57
5587,-12.45
5588,-12.29
5589,-12.15
5590,-12.04
5591,-11.95
5592,-11.85
5593,-11.76
5594,-11.72
5595,-11.75
5596,-11.80
5597,-11.88
5598,-11.96
5599,-12.04
5600,-12.10
5601,-12.13
5602,-12.15
5603,-12.15
5604,-12.10
5605,-12.02
5606,-11.94
5607,-11.94
5608,-12.02
5609,-12.17
5610,-12.37
5611,-12.59
5612,-12.79
5613,-12.94
5614,-12.99
5615,-12.94
5616,-12.76
5617,-12.50
5618,-12.14
5619,-11.73
5620,-11.26
5621,-10.79
5622,-10.28
5623,-9.78
5624,-9.28
5625,-8.83
5626,-8.45
5627,-8.20
5628,-8.03
5629,-7.96
5630,-7.89
5631,-7.84
5632,-7.76
5633,-7.69
5634,-7.55
5635,-7.35
5636,-7.05
5637,-6.76
5638,-6.50
5639,-6.31
5640,-6.07
5641,-5.80
5642,-5.41
5643,-4.94
5644,-4.33
5645,-3.66
5646,-2.92
5647,-2.20
5648,-1.50
5649,-0.88
5650,-0.35
5651,0.05
5652,0.41
5653,0.73
5654,1.03
5655,1.26
5656,1.46
5657,1.64
5658,1.82
5659,1.90
5660,1.85
5661,1.64
5662,1.31
5663,0.92
5664,0.48
5665,0.07
5666,-0.28
5667,-0.52
5668,-0.67
5669,-0.76
5670,-0.80
5671,-0.80
5672,-0.76
5673,-0.73
5674,-0.74
5675,-0.76
5676,-0.79
5677,-0.76
5678,-0.68
5679,-0.56
5680,-0.40
5681,-0.25
5682,-0.13
5683,-0.04
5684,0.04
5685,0.09
5686,0.11
5687,0.12
5688,0.14
5689,0.17
5690,0.16
5691,0.08
5692,-0.11
5693,-0.41
5694,-0.81
5695,-1.23
5696,-1.63
5697,-1.93
5698,-2.11
5699,-2.14
5700,-2.03
5701,-1.84
5702,-1.63
5703,-1.44
5704,-1.33
5705,-1.30
5706,-1.35
5707,-1.44
5708,-1.54
5709,-1.60
5710,-1.63
5711,-1.63
5712,-1.59
5713,-1.56
5714,-1.58
5715,-1.66
5716,-1.79
5717,-1.95
5718,-2.13
5719,-2.30
5720,-2.45
5721,-2.53
5722,-2.59
5723,-2.65
5724,-2.74
5725,-2.85
5726,-2.99
5727,-3.14
5728,-3.33
5729,-3.60
5730,-3.92
5731,-4.26
5732,-4.58
5733,-4.84
5734,-5.04
5735,-5.23
5736,-5.39
5737,-5.51
5738,-5.55
5739,-5.49
5740,-5.37
5741,-5.24
5742,-5.13
5743,-5.00
5744,-4.90
5745,-4.81
5746,-4.73
5747,-4.68
5748,-4.62
5749,-4.56
5750,-4.49
5751,-4.44
5752,-4.39
5753,-4.36
5754,-4.36
5755,-4.39
5756,-4.44
5757,-4.50
5758,-4.58
5759,-4.67
5760,-4.75
5761,-4.78
5762,-4.71
5763,-4.54
5764,-4.28
5765,-3.97
5766,-3.67
5767,-3.46
5768,-3.40
5769,-3.45
5770,-3.59
5771,-3.75
5772,-3.89
5773,-3.95
5774,-3.88
5775,-3.65
5776,-3.36
5777,-3.08
5778,-2.90
5779,-2.87
5780,-3.02
5781,-3.35
5782,-3.82
5783,-4.33
5784,-4.81
5785,-5.20
5786,-5.51
5787,-5.71
5788,-5.82
5789,-5.85
5790,-5.86
5791,-5.85
5792,-5.82
5793,-5.74
5794,-5.61
5795,-5.42
5796,-5.18
5797,-4.91
5798,-4.65
5799,-4.43
5800,-4.27
5801,-4.15
5802,-4.07
5803,-4.04
5804,-4.08
5805,-4.17
5806,-4.28
5807,-4.41
5808,-4.55
5809,-4.69
5810,-4.82
5811,-4.91
5812,-4.99
5813,-5.04
5814,-5.08
5815,-5.08
5816,-5.07
5817,-5.03
5818,-4.99
5819,-5.00
5820,-5.05
5821,-5.14
5822,-5.20
5823,-5.21
5824,-5.17
5825,-5.10
5826,-5.03
5827,-4.91
5828,-4.74
5829,-4.55
5830,-4.40
5831,-4.28
5832,-4.17
5833,-4.08
5834,-4.04
5835,-4.07
5836,-4.19
5837,-4.36
5838,-4.57
5839,-4.78
5840,-5.00
5841,-5.17
5842,-5.29
5843,-5.39
5844,-5.49
5845,-5.60
5846,-5.71
5847,-5.81
5848,-5.89
5849,-5.97
5850,-6.05
5851,-6.08
5852,-6.07
5853,-6.03
5854,-6.00
5855,-5.97
5856,-5.95
5857,-5.92
5858,-5.89
5859,-5.89
5860,-5.93
5861,-5.96
5862,-5.95
5863,-5.89
5864,-5.80
5865,-5.70
5866,-5.62
5867,-5.56
5868,-5.53
5869,-5.52
5870,-5.56
5871,-5.62
5872,-5.71
5873,-5.83
5874,-5.98
5875,-6.16
5876,-6.37
5877,-6.58
5878,-6.76
5879,-6.88
5880,-6.95
5881,-6.99
5882,-6.95
5883,-6.80
5884,-6.52
5885,-6.13
5886,-5.68
5887,-5.20
5888,-4.67
5889,-4.17
5890,-3.75
5891,-3.45
5892,-3.22
5893,-3.07
5894,-3.06
5895,-3.20
5896,-3.48
5897,-3.87
5898,-4.38
5899,-4.98
5900,-5.61
5901,-6.15
5902,-6.58
5903,-6.90
5904,-7.15
5905,-7.29
5906,-7.35
5907,-7.31
5908,-7.23
5909,-7.16
5910,-7.16
5911,-7.23
5912,-7.31
5913,-7.34
5914,-7.31
5915,-7.25
5916,-7.18
5917,-7.06
5918,-6.85
5919,-6.61
5920,-6.41
5921,-6.26
5922,-6.12
5923,-6.00
5924,-5.95
5925,-5.98
5926,-6.03
5927,-6.07
5928,-6.09
5929,-6.12
5930,-6.16
5931,-6.20
5932,-6.18
5933,-6.12
5934,-6.06
5935,-5.99
5936,-5.90
5937,-5.79
5938,-5.69
5939,-5.62
5940,-5.57
5941,-5.52
5942,-5.46
5943,-5.37
5944,-5.21
5945,-4.97
5946,-4.68
5947,-4.44
5948,-4.28
5949,-4.21
5950,-4.27
5951,-4.49
5952,-4.85
5953,-5.30
5954,-5.75
5955,-6.15
5956,-6.49
5957,-6.76
5958,-6.90
5959,-6.90
5960,-6.81
5961,-6.64
5962,-6.46
5963,-6.32
5964,-6.24
5965,-6.23
5966,-6.29
5967,-6.39
5968,-6.49
5969,-6.61
5970,-6.72
5971,-6.75
5972,-6.69
5973,-6.56
5974,-6.43
5975,-6.34
5976,-6.31
5977,-6.34
5978,-6.43
5979,-6.58
5980,-6.77
5981,-6.96
5982,-7.09
5983,-7.14
5984,-7.13
5985,-7.10
5986,-7.09
5987,-7.09
5988,-7.10
5989,-7.16
5990,-7.28
5991,-7.46
5992,-7.68
5993,-7.90
5994,-8.05
5995,-8.12
5996,-8.09
5997,-7.93
5998,-7.63
5999,-7.21
6000,-6.74
6001,-6.29
6002,-5.87
6003,-5.51
6004,-5.25
6005,-5.13
6006,-5.16
6007,-5.31
6008,-5.52
6009,-5.78
6010,-6.02
6011,-6.23
6012,-6.37
6013,-6.43
6014,-6.44
6015,-6.42
6016,-6.45
6017,-6.50
6018,-6.61
6019,-6.77
6020,-6.94
6021,-7.12
6022,-7.30
6023,-7.47
6024,-7.64
6025,-7.78
6026,-7.95
6027,-8.13
6028,-8.32
6029,-8.50
6030,-8.67
6031,-8.81
6032,-8.93
6033,-8.98
6034,-8.99
6035,-8.96
6036,-8.91
6037,-8.85
6038,-8.77
6039,-8.68
6040,-8.62
6041,-8.58
6042,-8.56
6043,-8.54
6044,-8.51
6045,-8.48
6046,-8.42
6047,-8.41
6048,-8.42
6049,-8.48
6050,-8.53
6051,-8.54
6052,-8.51
6053,-8.42
6054,-8.21
6055,-7.85
6056,-7.38
6057,-6.88
6058,-6.48
6059,-6.24
6060,-6.18
6061,-6.30
6062,-6.61
6063,-7.06
6064,-7.60
6065,-8.11
6066,-8.54
6067,-8.90
6068,-9.22
6069,-9.47
6070,-9.67
6071,-9.83
6072,-9.99
6073,-10.09
6074,-10.11
6075,-9.99
6076,-9.81
6077,-9.61
6078,-9.44
6079,-9.29
6080,-9.22
6081,-9.28
6082,-9.45
6083,-9.67
6084,-9.86
6085,-9.96
6086,-9.90
6087,-9.69
6088,-9.33
6089,-8.91
6090,-8.51
6091,-8.18
6092,-7.92
6093,-7.74
6094,-7.67
6095,-7.71
6096,-7.77
6097,-7.81
6098,-7.77
6099,-7.68
6100,-7.58
6101,-7.48
6102,-7.39
6103,-7.31
6104,-7.22
6105,-7.10
6106,-6.92
6107,-6.65
6108,-6.30
6109,-5.94
6110,-5.64
6111,-5.46
6112,-5.41
6113,-5.50
6114,-5.73
6115,-6.07
6116,-6.45
6117,-6.78
6118,-6.98
6119,-7.04
6120,-6.99
6121,-6.87
6122,-6.70
6123,-6.55
6124,-6.46
6125,-6.46
6126,-6.53
6127,-6.63
6128,-6.71
6129,-6.74
6130,-6.71
6131,-6.58
6132,-6.37
6133,-6.13
6134,-5.91
6135,-5.80
6136,-5.81
6137,-5.95
6138,-6.23
6139,-6.65
6140,-7.18
6141,-7.72
6142,-8.19
6143,-8.52
6144,-8.71
6145,-8.77
6146,-8.69
6147,-8.51
6148,-8.32
6149,-8.22
6150,-8.26
6151,-8.45
6152,-8.72
6153,-9.03
6154,-9.32
6155,-9.50
6156,-9.51
6157,-9.30
6158,-8.90
6159,-8.38
6160,-7.83
6161,-7.28
6162,-6.80
6163,-6.44
6164,-6.23
6165,-6.18
6166,-6.23
6167,-6.36
6168,-6.53
6169,-6.74
6170,-6.95
6171,-7.13
6172,-7.26
6173,-7.35
6174,-7.42
6175,-7.44
6176,-7.45
6177,-7.44
6178,-7.48
6179,-7.55
6180,-7.71
6181,-7.91
6182,-8.19
6183,-8.49
6184,-8.78
6185,-9.01
6186,-9.20
6187,-9.37
6188,-9.58
6189,-9.78
6190,-9.94
6191,-10.03
6192,-10.11
6193,-10.20
6194,-10.28
6195,-10.31
6196,-10.29
6197,-10.29
6198,-10.32
6199,-10.38
6200,-10.43
6201,-10.44
6202,-10.39
6203,-10.28
6204,-10.06
6205,-9.76
6206,-9.44
6207,-9.16
6208,-8.96
6209,-8.84
6210,-8.83
6211,-8.89
6212,-8.96
6213,-9.01
6214,-8.96
6215,-8.82
6216,-8.57
6217,-8.27
6218,-7.96
6219,-7.69
6220,-7.46
6221,-7.29
6222,-7.13
6223,-7.00
6224,-6.80
6225,-6.50
6226,-6.11
6227,-5.68
6228,-5.29
6229,-5.02
6230,-4.91
6231,-4.97
6232,-5.20
6233,-5.57
6234,-6.00
6235,-6.42
6236,-6.78
6237,-7.06
6238,-7.22
6239,-7.28
6240,-7.24
6241,-7.16
6242,-7.03
6243,-6.85
6244,-6.57
6245,-6.22
6246,-5.85
6247,-5.49
6248,-5.09
6249,-4.71
6250,-4.43
6251,-4.26
6252,-4.16
6253,-4.05
6254,-3.96
6255,-3.93
6256,-3.94
6257,-3.94
6258,-3.93
6259,-3.96
6260,-4.06
6261,-4.23
6262,-4.46
6263,-4.70
6264,-4.96
6265,-5.23
6266,-5.49
6267,-5.72
6268,-5.97
6269,-6.20
6270,-6.44
6271,-6.65
6272,-6.81
6273,-6.93
6274,-7.03
6275,-7.12
6276,-7.19
6277,-7.24
6278,-7.29
6279,-7.35
6280,-7.42
6281,-7.45
6282,-7.42
6283,-7.29
6284,-7.12
6285,-6.93
6286,-6.78
6287,-6.75
6288,-6.90
6289,-7.23
6290,-7.69
6291,-8.24
6292,-8.81
6293,-9.28
6294,-9.57
6295,-9.60
6296,-9.44
6297,-9.15
6298,-8.83
6299,-8.56
6300,-8.40
6301,-8.37
6302,-8.44
6303,-8.57
6304,-8.73
6305,-8.88
6306,-8.96
6307,-8.97
6308,-8.88
6309,-8.74
6310,-8.54
6311,-8.37
6312,-8.19
6313,-8.02
6314,-7.82
6315,-7.62
6316,-7.39
6317,-7.13
6318,-6.81
6319,-6.48
6320,-6.20
6321,-6.04
6322,-6.00
6323,-6.04
6324,-6.11
6325,-6.17
6326,-6.20
6327,-6.21
6328,-6.19
6329,-6.16
6330,-6.12
6331,-6.12
6332,-6.18
6333,-6.27
6334,-6.35
6335,-6.38
6336,-6.37
6337,-6.34
6338,-6.27
6339,-6.16
6340,-5.99
6341,-5.84
6342,-5.74
6343,-5.78
6344,-5.94
6345,-6.17
6346,-6.47
6347,-6.80
6348,-7.15
6349,-7.45
6350,-7.66
6351,-7.71
6352,-7.63
6353,-7.48
6354,-7.30
6355,-7.12
6356,-6.95
6357,-6.83
6358,-6.80
6359,-6.87
6360,-6.97
6361,-7.07
6362,-7.10
6363,-7.08
6364,-6.98
6365,-6.80
6366,-6.52
6367,-6.20
6368,-5.87
6369,-5.59
6370,-5.37
6371,-5.20
6372,-5.06
6373,-4.91
6374,-4.71
6375,-4.51
6376,-4.33
6377,-4.20
6378,-4.14
6379,-4.17
6380,-4.33
6381,-4.63
6382,-5.00
6383,-5.41
6384,-5.81
6385,-6.16
6386,-6.44
6387,-6.61
6388,-6.74
6389,-6.84
6390,-6.98
6391,-7.13
6392,-7.29
6393,-7.41
6394,-7.48
6395,-7.48
6396,-7.42
6397,-7.29
6398,-7.11
6399,-6.90
6400,-6.71
6401,-6.58
6402,-6.56
6403,-6.65
6404,-6.84
6405,-7.08
6406,-7.33
6407,-7.52
6408,-7.57
6409,-7.49
6410,-7.28
6411,-6.98
6412,-6.59
6413,-6.17
6414,-5.78
6415,-5.52
6416,-5.36
6417,-5.33
6418,-5.29
6419,-5.24
6420,-5.12
6421,-4.95
6422,-4.68
6423,-4.33
6424,-3.88
6425,-3.40
6426,-2.94
6427,-2.55
6428,-2.22
6429,-1.96
6430,-1.76
6431,-1.65
6432,-1.57
6433,-1.56
6434,-1.58
6435,-1.64
6436,-1.69
6437,-1.75
6438,-1.84
6439,-1.93
6440,-1.98
6441,-1.95
6442,-1.87
6443,-1.76
6444,-1.69
6445,-1.66
6446,-1.72
6447,-1.87
6448,-2.08
6449,-2.32
6450,-2.58
6451,-2.85
6452,-3.11
6453,-3.32
6454,-3.45
6455,-3.47
6456,-3.45
6457,-3.38
6458,-3.30
6459,-3.24
6460,-3.23
6461,-3.29
6462,-3.40
6463,-3.58
6464,-3.84
6465,-4.14
6466,-4.43
6467,-4.67
6468,-4.85
6469,-5.00
6470,-5.15
6471,-5.29
6472,-5.42
6473,-5.51
6474,-5.60
6475,-5.68
6476,-5.76
6477,-5.82
6478,-5.87
6479,-5.93
6480,-5.98
6481,-6.01
6482,-6.02
6483,-5.99
6484,-5.92
6485,-5.81
6486,-5.65
6487,-5.46
6488,-5.26
6489,-5.05
6490,-4.84
6491,-4.64
6492,-4.43
6493,-4.25
6494,-4.10
6495,-3.98
6496,-3.88
6497,-3.82
6498,-3.83
6499,-3.93
6500,-4.07
6501,-4.26
6502,-4.45
6503,-4.66
6504,-4.88
6505,-5.07
6506,-5.17
6507,-5.23
6508,-5.28
6509,-5.33
6510,-5.36
6511,-5.37
6512,-5.37
6513,-5.36
6514,-5.33
6515,-5.25
6516,-5.12
6517,-4.99
6518,-4.91
6519,-4.91
6520,-5.01
6521,-5.19
6522,-5.41
6523,-5.65
6524,-5.91
6525,-6.12
6526,-6.25
6527,-6.31
6528,-6.35
6529,-6.43
6530,-6.56
6531,-6.73
6532,-6.87
6533,-6.93
6534,-6.88
6535,-6.73
6536,-6.48
6537,-6.18
6538,-5.85
6539,-5.55
6540,-5.33
6541,-5.21
6542,-5.18
6543,-5.18
6544,-5.18
6545,-5.16
6546,-5.09
6547,-4.97
6548,-4.78
6549,-4.57
6550,-4.39
6551,-4.33
6552,-4.40
6553,-4.59
6554,-4.82
6555,-5.05
6556,-5.20
6557,-5.23
6558,-5.11
6559,-4.87
6560,-4.55
6561,-4.22
6562,-3.90
6563,-3.60
6564,-3.33
6565,-3.12
6566,-2.97
6567,-2.89
6568,-2.84
6569,-2.78
6570,-2.69
6571,-2.60
6572,-2.55
6573,-2.54
6574,-2.58
6575,-2.67
6576,-2.87
6577,-3.19
6578,-3.62
6579,-4.11
6580,-4.60
6581,-5.01
6582,-5.31
6583,-5.46
6584,-5.49
6585,-5.39
6586,-5.20
6587,-4.98
6588,-4.84
6589,-4.81
6590,-4.85
6591,-4.91
6592,-4.98
6593,-5.07
6594,-5.18
6595,-5.28
6596,-5.31
6597,-5.32
6598,-5.33
6599,-5.38
6600,-5.46
6601,-5.56
6602,-5.65
6603,-5.71
6604,-5.69
6605,-5.55
6606,-5.27
6607,-4.88
6608,-4.41
6609,-3.96
6610,-3.59
6611,-3.35
6612,-3.23
6613,-3.24
6614,-3.34
6615,-3.49
6616,-3.65
6617,-3.80
6618,-3.96
6619,-4.17
6620,-4.43
6621,-4.76
6622,-5.13
6623,-5.53
6624,-5.92
6625,-6.22
6626,-6.39
6627,-6.37
6628,-6.26
6629,-6.12
6630,-6.07
6631,-6.13
6632,-6.28
6633,-6.52
6634,-6.87
6635,-7.23
6636,-7.51
6637,-7.67
6638,-7.71
6639,-7.70
6640,-7.65
6641,-7.59
6642,-7.56
6643,-7.56
6644,-7.58
6645,-7.58
6646,-7.55
6647,-7.45
6648,-7.32
6649,-7.13
6650,-6.92
6651,-6.74
6652,-6.64
6653,-6.65
6654,-6.70
6655,-6.77
6656,-6.83
6657,-6.88
6658,-6.93
6659,-6.97
6660,-6.99
6661,-6.99
6662,-6.94
6663,-6.86
6664,-6.74
6665,-6.58
6666,-6.41
6667,-6.26
6668,-6.16
6669,-6.13
6670,-6.13
6671,-6.14
6672,-6.14
6673,-6.15
6674,-6.12
6675,-6.06
6676,-5.98
6677,-5.92
6678,-5.90
6679,-5.90
6680,-5.91
6681,-5.91
6682,-5.89
6683,-5.83
6684,-5.71
6685,-5.50
6686,-5.23
6687,-4.92
6688,-4.61
6689,-4.33
6690,-4.16
6691,-4.13
6692,-4.24
6693,-4.46
6694,-4.72
6695,-5.00
6696,-5.26
6697,-5.47
6698,-5.58
6699,-5.58
6700,-5.51
6701,-5.41
6702,-5.33
6703,-5.26
6704,-5.24
6705,-5.22
6706,-5.14
6707,-4.99
6708,-4.78
6709,-4.53
6710,-4.30
6711,-4.11
6712,-4.02
6713,-4.04
6714,-4.21
6715,-4.49
6716,-4.82
6717,-5.15
6718,-5.45
6719,-5.68
6720,-5.87
6721,-5.99
6722,-6.03
6723,-6.00
6724,-5.91
6725,-5.79
6726,-5.67
6727,-5.55
6728,-5.42
6729,-5.29
6730,-5.21
6731,-5.15
6732,-5.10
6733,-5.01
6734,-4.87
6735,-4.68
6736,-4.52
6737,-4.39
6738,-4.33
6739,-4.36
6740,-4.49
6741,-4.70
6742,-4.94
6743,-5.15
6744,-5.34
6745,-5.49
6746,-5.58
6747,-5.64
6748,-5.71
6749,-5.85
6750,-6.08
6751,-6.39
6752,-6.72
6753,-7.03
6754,-7.26
6755,-7.38
6756,-7.39
6757,-7.29
6758,-7.11
6759,-6.87
6760,-6.61
6761,-6.40
6762,-6.26
6763,-6.16
6764,-6.11
6765,-6.09
6766,-6.07
6767,-6.03
6768,-5.97
6769,-5.91
6770,-5.91
6771,-5.97
6772,-6.05
6773,-6.11
6774,-6.16
6775,-6.22
6776,-6.32
6777,-6.40
6778,-6.45
6779,-6.48
6780,-6.55
6781,-6.70
6782,-6.89
6783,-7.07
6784,-7.24
6785,-7.39
6786,-7.51
6787,-7.57
6788,-7.56
6789,-7.50
6790,-7.42
6791,-7.35
6792,-7.31
6793,-7.31
6794,-7.39
6795,-7.51
6796,-7.61
6797,-7.62
6798,-7.51
6799,-7.26
6800,-6.89
6801,-6.44
6802,-5.97
6803,-5.57
6804,-5.29
6805,-5.21
6806,-5.35
6807,-5.65
6808,-6.01
6809,-6.39
6810,-6.73
6811,-7.00
6812,-7.13
6813,-7.10
6814,-6.97
6815,-6.74
6816,-6.45
6817,-6.20
6818,-6.03
6819,-5.99
6820,-6.03
6821,-6.10
6822,-6.22
6823,-6.33
6824,-6.36
6825,-6.25
6826,-6.03
6827,-5.78
6828,-5.55
6829,-5.40
6830,-5.37
6831,-5.43
6832,-5.51
6833,-5.55
6834,-5.53
6835,-5.43
6836,-5.26
6837,-5.05
6838,-4.88
6839,-4.84
6840,-4.97
6841,-5.24
6842,-5.62
6843,-6.03
6844,-6.34
6845,-6.44
6846,-6.25
6847,-5.83
6848,-5.25
6849,-4.65
6850,-4.08
6851,-3.63
6852,-3.33
6853,-3.19
6854,-3.14
6855,-3.08
6856,-2.96
6857,-2.75
6858,-2.49
6859,-2.24
6860,-2.08
6861,-2.07
6862,-2.28
6863,-2.73
6864,-3.39
6865,-4.14
6866,-4.91
6867,-5.59
6868,-6.17
6869,-6.62
6870,-6.94
6871,-7.11
6872,-7.16
6873,-7.13
6874,-7.07
6875,-6.98
6876,-6.84
6877,-6.66
6878,-6.46
6879,-6.28
6880,-6.12
6881,-6.00
6882,-5.93
6883,-5.87
6884,-5.79
6885,-5.68
6886,-5.54
6887,-5.39
6888,-5.20
6889,-5.03
6890,-4.90
6891,-4.87
6892,-4.91
6893,-5.01
6894,-5.14
6895,-5.26
6896,-5.31
6897,-5.23
6898,-5.00
6899,-4.70
6900,-4.38
6901,-4.14
6902,-4.01
6903,-4.01
6904,-4.14
6905,-4.36
6906,-4.59
6907,-4.81
6908,-4.95
6909,-4.98
6910,-4.87
6911,-4.59
6912,-4.20
6913,-3.78
6914,-3.39
6915,-3.08
6916,-2.88
6917,-2.82
6918,-2.95
6919,-3.25
6920,-3.68
6921,-4.16
6922,-4.67
6923,-5.14
6924,-5.55
6925,-5.85
6926,-6.07
6927,-6.25
6928,-6.41
6929,-6.52
6930,-6.56
6931,-6.53
6932,-6.46
6933,-6.34
6934,-6.16
6935,-5.92
6936,-5.65
6937,-5.41
6938,-5.22
6939,-5.10
6940,-5.06
6941,-5.06
6942,-5.08
6943,-5.12
6944,-5.14
6945,-5.14
6946,-5.07
6947,-4.96
6948,-4.82
6949,-4.73
6950,-4.70
6951,-4.73
6952,-4.81
6953,-4.90
6954,-4.98
6955,-5.04
6956,-5.10
6957,-5.19
6958,-5.31
6959,-5.49
6960,-5.74
6961,-6.08
6962,-6.45
6963,-6.80
6964,-7.00
6965,-6.97
6966,-6.68
6967,-6.16
6968,-5.51
6969,-4.78
6970,-4.05
6971,-3.44
6972,-3.08
6973,-3.01
6974,-3.22
6975,-3.59
6976,-4.06
6977,-4.60
6978,-5.17
6979,-5.71
6980,-6.16
6981,-6.48
6982,-6.73
6983,-6.90
6984,-7.04
6985,-7.16
6986,-7.28
6987,-7.42
6988,-7.61
6989,-7.82
6990,-8.03
6991,-8.21
6992,-8.33
6993,-8.35
6994,-8.30
6995,-8.22
6996,-8.14
6997,-8.07
6998,-8.02
6999,-8.00
7000,-8.00
7001,-8.00
7002,-7.93
7003,-7.78
7004,-7.59
7005,-7.44
7006,-7.35
7007,-7.32
7008,-7.35
7009,-7.45
7010,-7.60
7011,-7.74
7012,-7.82
7013,-7.79
7014,-7.69
7015,-7.54
7016,-7.34
7017,-7.13
7018,-6.97
7019,-6.90
7020,-6.94
7021,-7.03
7022,-7.16
7023,-7.28
7024,-7.35
7025,-7.36
7026,-7.28
7027,-7.12
7028,-6.94
7029,-6.74
7030,-6.61
7031,-6.58
7032,-6.68
7033,-6.88
7034,-7.19
7035,-7.51
7036,-7.85
7037,-8.15
7038,-8.39
7039,-8.58
7040,-8.70
7041,-8.78
7042,-8.87
7043,-8.95
7044,-9.03
7045,-9.09
7046,-9.16
7047,-9.18
7048,-9.16
7049,-9.09
7050,-9.04
7051,-9.03
7052,-9.07
7053,-9.14
7054,-9.23
7055,-9.32
7056,-9.37
7057,-9.34
7058,-9.24
7059,-9.08
7060,-8.89
7061,-8.68
7062,-8.48
7063,-8.35
7064,-8.35
7065,-8.47
7066,-8.71
7067,-9.00
7068,-9.35
7069,-9.71
7070,-10.06
7071,-10.33
7072,-10.50
7073,-10.56
7074,-10.54
7075,-10.47
7076,-10.39
7077,-10.36
7078,-10.41
7079,-10.50
7080,-10.57
7081,-10.54
7082,-10.42
7083,-10.17
7084,-9.80
7085,-9.32
7086,-8.79
7087,-8.27
7088,-7.82
7089,-7.52
7090,-7.44
7091,-7.56
7092,-7.80
7093,-8.08
7094,-8.36
7095,-8.63
7096,-8.87
7097,-9.07
7098,-9.28
7099,-9.55
7100,-9.88
7101,-10.24
7102,-10.61
7103,-10.97
7104,-11.32
7105,-11.61
7106,-11.84
7107,-11.98
7108,-12.09
7109,-12.21
7110,-12.35
7111,-12.50
7112,-12.64
7113,-12.76
7114,-12.85
7115,-12.85
7116,-12.76
7117,-12.57
7118,-12.31
7119,-12.05
7120,-11.79
7121,-11.58
7122,-11.42
7123,-11.34
7124,-11.31
7125,-11.33
7126,-11.27
7127,-11.13
7128,-10.92
7129,-10.68
7130,-10.40
7131,-10.11
7132,-9.80
7133,-9.54
7134,-9.28
7135,-9.06
7136,-8.81
7137,-8.52
7138,-8.11
7139,-7.68
7140,-7.26
7141,-6.90
7142,-6.54
7143,-6.20
7144,-5.87
7145,-5.61
7146,-5.33
7147,-5.04
7148,-4.74
7149,-4.47
7150,-4.24
7151,-4.10
7152,-4.02
7153,-4.07
7154,-4.19
7155,-4.39
7156,-4.55
7157,-4.59
7158,-4.43
7159,-4.11
7160,-3.64
7161,-3.11
7162,-2.50
7163,-1.91
7164,-1.35
7165,-0.94
7166,-0.66
7167,-0.50
7168,-0.34
7169,-0.21
7170,-0.04
7171,0.16
7172,0.45
7173,0.80
7174,1.21
7175,1.56
7176,1.87
7177,2.08
7178,2.17
7179,2.17
7180,2.08
7181,1.97
7182,1.85
7183,1.76
7184,1.68
7185,1.63
7186,1.59
7187,1.53
7188,1.38
7189,1.11
7190,0.76
7191,0.42
7192,0.16
7193,-0.95
7194,-0.85
7195,1.60
7196,2.53
7197,-3.07
7198,-8.30
7199,2.90
7200,18.86
