1,188.10
2,249.99
3,249.99
4,242.95
5,234.89
6,249.99
7,249.99
8,222.79
9,120.40
10,-15.36
11,-144.82
12,-226.84
13,-239.40
14,-179.26
15,-61.23
16,78.12
17,194.31
18,249.99
19,249.99
20,247.72
21,244.42
22,249.99
23,249.99
24,243.50
25,188.50
26,84.14
27,-49.59
28,-167.32
29,-234.68
30,-250.00
31,-250.00
32,-250.00
33,-250.00
34,-237.89
35,-197.63
36,-143.58
37,-95.44
38,-70.63
39,-68.95
40,-82.05
41,-97.45
42,-106.59
43,-106.70
44,-97.82
45,-84.59
46,-70.72
47,-61.39
48,-57.12
49,-57.87
50,-60.55
51,-63.14
52,-63.86
53,-62.54
54,-59.59
55,-56.18
56,-52.90
57,-50.68
58,-49.28
59,-48.63
60,-48.03
61,-47.36
62,-46.43
63,-45.49
64,-44.46
65,-43.50
66,-42.44
67,-41.49
68,-40.48
69,-39.59
70,-38.70
71,-37.93
72,-37.19
73,-36.54
74,-35.90
75,-35.35
76,-34.74
77,-34.16
78,-33.50
79,-32.89
80,-32.26
81,-31.72
82,-31.20
83,-30.78
84,-30.36
85,-29.98
86,-29.53
87,-29.05
88,-28.46
89,-27.82
90,-27.12
91,-26.47
92,-25.86
93,-25.40
94,-25.02
95,-24.76
96,-24.58
97,-24.51
98,-24.42
99,-24.33
100,-24.16
101,-23.97
102,-23.73
103,-23.49
104,-23.22
105,-22.98
106,-22.77
107,-22.60
108,-22.45
109,-22.30
110,-22.10
111,-21.88
112,-21.58
113,-21.28
114,-20.92
115,-20.57
116,-20.18
117,-19.80
118,-19.37
119,-18.94
120,-18.42
121,-17.91
122,-17.35
123,-16.82
124,-16.24
125,-15.71
126,-15.16
127,-14.69
128,-14.21
129,-13.76
130,-13.26
131,-12.76
132,-12.18
133,-11.61
134,-10.99
135,-10.40
136,-9.75
137,-9.13
138,-8.47
139,-7.84
140,-7.19
141,-6.58
142,-5.93
143,-5.34
144,-4.73
145,-4.17
146,-3.59
147,-3.04
148,-2.45
149,-1.91
150,-1.39
151,-0.92
152,-0.47
153,-0.05
154,0.37
155,0.74
156,1.10
157,1.39
158,1.64
159,1.80
160,1.88
161,1.84
162,1.72
163,1.54
164,1.37
165,1.21
166,1.11
167,1.02
168,0.98
169,0.96
170,0.95
171,0.92
172,0.92
173,0.93
174,1.02
175,1.18
176,1.43
177,1.75
178,2.14
179,2.53
180,2.91
181,3.20
182,3.41
183,3.52
184,3.62
185,3.70
186,3.83
187,4.01
188,4.28
189,4.61
190,5.00
191,5.35
192,5.63
193,5.81
194,5.89
195,5.89
196,5.83
197,5.72
198,5.63
199,5.57
200,5.55
201,5.55
202,5.53
203,5.49
204,5.44
205,5.36
206,5.26
207,5.15
208,5.09
209,5.13
210,5.26
211,5.46
212,5.72
213,6.03
214,6.36
215,6.65
216,6.85
217,6.95
218,6.98
219,6.97
220,6.93
221,6.87
222,6.83
223,6.82
224,6.82
225,6.81
226,6.76
227,6.65
228,6.48
229,6.27
230,6.03
231,5.81
232,5.61
233,5.46
234,5.36
235,5.32
236,5.30
237,5.31
238,5.31
239,5.32
240,5.29
241,5.27
242,5.19
243,5.07
244,4.88
245,4.62
246,4.29
247,3.91
248,3.49
249,3.09
250,2.67
251,2.27
252,1.81
253,1.35
254,0.85
255,0.37
256,-0.14
257,-0.62
258,-1.08
259,-1.46
260,-1.78
261,-2.03
262,-2.27
263,-2.46
264,-2.66
265,-2.84
266,-3.05
267,-3.25
268,-3.46
269,-3.62
270,-3.77
271,-3.88
272,-3.98
273,-4.09
274,-4.20
275,-4.30
276,-4.39
277,-4.45
278,-4.47
279,-4.43
280,-4.33
281,-4.16
282,-3.95
283,-3.73
284,-3.55
285,-3.42
286,-3.37
287,-3.40
288,-3.49
289,-3.65
290,-3.83
291,-4.04
292,-4.24
293,-4.42
294,-4.56
295,-4.66
296,-4.73
297,-4.78
298,-4.82
299,-4.86
300,-4.91
301,-4.97
302,-5.04
303,-5.10
304,-5.17
305,-5.23
306,-5.32
307,-5.42
308,-5.52
309,-5.58
310,-5.63
311,-5.65
312,-5.66
313,-5.64
314,-5.62
315,-5.59
316,-5.60
317,-5.64
318,-5.71
319,-5.78
320,-5.87
321,-5.94
322,-5.99
323,-5.99
324,-5.98
325,-5.97
326,-5.98
327,-6.03
328,-6.11
329,-6.22
330,-6.34
331,-6.46
332,-6.56
333,-6.62
334,-6.64
335,-6.59
336,-6.51
337,-6.42
338,-6.33
339,-6.28
340,-6.24
341,-6.22
342,-6.18
343,-6.14
344,-6.10
345,-6.03
346,-5.92
347,-5.78
348,-5.62
349,-5.46
350,-5.27
351,-5.11
352,-4.96
353,-4.86
354,-4.80
355,-4.78
356,-4.78
357,-4.78
358,-4.72
359,-4.62
360,-4.46
361,-4.25
362,-4.00
363,-3.74
364,-3.49
365,-3.30
366,-3.17
367,-3.11
368,-3.11
369,-3.12
370,-3.14
371,-3.14
372,-3.13
373,-3.10
374,-3.02
375,-2.91
376,-2.74
377,-2.56
378,-2.38
379,-2.20
380,-2.01
381,-1.82
382,-1.67
383,-1.56
384,-1.46
385,-1.39
386,-1.36
387,-1.38
388,-1.43
389,-1.47
390,-1.50
391,-1.53
392,-1.61
393,-1.72
394,-1.84
395,-1.98
396,-2.16
397,-2.37
398,-2.62
399,-2.88
400,-3.13
401,-3.34
402,-3.51
403,-3.62
404,-3.67
405,-3.67
406,-3.63
407,-3.56
408,-3.49
409,-3.46
410,-3.49
411,-3.56
412,-3.69
413,-3.85
414,-4.00
415,-4.11
416,-4.17
417,-4.18
418,-4.17
419,-4.16
420,-4.17
421,-4.20
422,-4.30
423,-4.47
424,-4.69
425,-4.93
426,-5.17
427,-5.38
428,-5.55
429,-5.68
430,-5.77
431,-5.81
432,-5.83
433,-5.81
434,-5.81
435,-5.81
436,-5.84
437,-5.90
438,-5.98
439,-6.07
440,-6.15
441,-6.22
442,-6.29
443,-6.36
444,-6.40
445,-6.43
446,-6.45
447,-6.44
448,-6.42
449,-6.37
450,-6.32
451,-6.28
452,-6.26
453,-6.24
454,-6.27
455,-6.36
456,-6.49
457,-6.65
458,-6.82
459,-6.96
460,-7.08
461,-7.16
462,-7.18
463,-7.16
464,-7.13
465,-7.13
466,-7.19
467,-7.27
468,-7.41
469,-7.57
470,-7.77
471,-7.94
472,-8.09
473,-8.19
474,-8.29
475,-8.37
476,-8.46
477,-8.58
478,-8.73
479,-8.93
480,-9.15
481,-9.38
482,-9.61
483,-9.82
484,-10.01
485,-10.15
486,-10.26
487,-10.34
488,-10.40
489,-10.44
490,-10.48
491,-10.53
492,-10.60
493,-10.69
494,-10.82
495,-11.00
496,-11.22
497,-11.44
498,-11.60
499,-11.72
500,-11.75
501,-11.72
502,-11.62
503,-11.48
504,-11.34
505,-11.23
506,-11.15
507,-11.09
508,-11.00
509,-10.89
510,-10.76
511,-10.60
512,-10.41
513,-10.22
514,-10.01
515,-9.86
516,-9.74
517,-9.64
518,-9.54
519,-9.41
520,-9.27
521,-9.12
522,-8.97
523,-8.84
524,-8.74
525,-8.70
526,-8.68
527,-8.68
528,-8.68
529,-8.67
530,-8.63
531,-8.58
532,-8.53
533,-8.50
534,-8.50
535,-8.54
536,-8.61
537,-8.68
538,-8.72
539,-8.69
540,-8.58
541,-8.42
542,-8.20
543,-7.99
544,-7.80
545,-7.68
546,-7.60
547,-7.56
548,-7.51
549,-7.44
550,-7.32
551,-7.17
552,-6.96
553,-6.73
554,-6.47
555,-6.23
556,-5.98
557,-5.78
558,-5.58
559,-5.39
560,-5.13
561,-4.82
562,-4.44
563,-4.03
564,-3.56
565,-3.07
566,-2.59
567,-2.15
568,-1.76
569,-1.44
570,-1.15
571,-0.92
572,-0.69
573,-0.50
574,-0.27
575,-0.09
576,0.05
577,0.14
578,0.20
579,0.23
580,0.27
581,0.30
582,0.37
583,0.45
584,0.57
585,0.71
586,0.89
587,1.10
588,1.32
589,1.52
590,1.69
591,1.82
592,1.91
593,1.98
594,1.99
595,1.99
596,2.01
597,2.06
598,2.12
599,2.16
600,2.17
601,2.15
602,2.09
603,1.98
604,1.81
605,1.63
606,1.44
607,1.31
608,1.24
609,1.24
610,1.27
611,1.30
612,1.31
613,1.26
614,1.14
615,0.99
616,0.81
617,0.65
618,0.53
619,0.50
620,0.52
621,0.57
622,0.62
623,0.64
624,0.61
625,0.54
626,0.44
627,0.35
628,0.27
629,0.24
630,0.24
631,0.24
632,0.21
633,0.14
634,0.02
635,-0.15
636,-0.37
637,-0.57
638,-0.74
639,-0.83
640,-0.85
641,-0.82
642,-0.75
643,-0.67
644,-0.60
645,-0.56
646,-0.56
647,-0.59
648,-0.65
649,-0.72
650,-0.77
651,-0.79
652,-0.79
653,-0.77
654,-0.76
655,-0.75
656,-0.77
657,-0.84
658,-0.93
659,-1.03
660,-1.11
661,-1.17
662,-1.21
663,-1.20
664,-1.16
665,-1.08
666,-1.01
667,-0.94
668,-0.88
669,-0.82
670,-0.77
671,-0.76
672,-0.82
673,-0.93
674,-1.08
675,-1.25
676,-1.44
677,-1.63
678,-1.82
679,-1.96
680,-2.06
681,-2.13
682,-2.19
683,-2.26
684,-2.37
685,-2.49
686,-2.67
687,-2.88
688,-3.12
689,-3.34
690,-3.53
691,-3.68
692,-3.81
693,-3.93
694,-4.07
695,-4.24
696,-4.46
697,-4.70
698,-4.97
699,-5.23
700,-5.52
701,-5.81
702,-6.11
703,-6.39
704,-6.70
705,-7.00
706,-7.30
707,-7.54
708,-7.75
709,-7.91
710,-8.07
711,-8.22
712,-8.38
713,-8.58
714,-8.86
715,-9.16
716,-9.48
717,-9.75
718,-9.98
719,-10.12
720,-10.17
721,-10.15
722,-10.10
723,-10.06
724,-10.04
725,-10.08
726,-10.19
727,-10.34
728,-10.51
729,-10.66
730,-10.76
731,-10.80
732,-10.80
733,-10.73
734,-10.65
735,-10.56
736,-10.49
737,-10.44
738,-10.41
739,-10.38
740,-10.37
741,-10.39
742,-10.45
743,-10.53
744,-10.61
745,-10.70
746,-10.80
747,-10.92
748,-11.05
749,-11.16
750,-11.26
751,-11.35
752,-11.44
753,-11.52
754,-11.59
755,-11.63
756,-11.67
757,-11.67
758,-11.66
759,-11.63
760,-11.60
761,-11.58
762,-11.57
763,-11.58
764,-11.63
765,-11.71
766,-11.81
767,-11.92
768,-12.01
769,-12.08
770,-12.14
771,-12.16
772,-12.16
773,-12.15
774,-12.12
775,-12.09
776,-12.04
777,-11.99
778,-11.92
779,-11.85
780,-11.73
781,-11.60
782,-11.46
783,-11.32
784,-11.15
785,-10.97
786,-10.74
787,-10.51
788,-10.23
789,-9.93
790,-9.57
791,-9.19
792,-8.77
793,-8.35
794,-7.92
795,-7.53
796,-7.16
797,-6.87
798,-6.62
799,-6.44
800,-6.28
801,-6.17
802,-6.06
803,-5.94
804,-5.75
805,-5.54
806,-5.27
807,-5.03
808,-4.79
809,-4.60
810,-4.46
811,-4.36
812,-4.29
813,-4.25
814,-4.20
815,-4.13
816,-4.01
817,-3.85
818,-3.68
819,-3.51
820,-3.36
821,-3.25
822,-3.16
823,-3.10
824,-3.06
825,-3.05
826,-3.07
827,-3.14
828,-3.25
829,-3.40
830,-3.58
831,-3.75
832,-3.93
833,-4.08
834,-4.20
835,-4.27
836,-4.30
837,-4.28
838,-4.26
839,-4.23
840,-4.21
841,-4.20
842,-4.20
843,-4.20
844,-4.19
845,-4.14
846,-4.07
847,-3.98
848,-3.88
849,-3.77
850,-3.64
851,-3.50
852,-3.40
853,-3.34
854,-3.35
855,-3.43
856,-3.58
857,-3.81
858,-4.10
859,-4.40
860,-4.70
861,-4.94
862,-5.14
863,-5.27
864,-5.36
865,-5.42
866,-5.48
867,-5.55
868,-5.67
869,-5.81
870,-5.99
871,-6.20
872,-6.44
873,-6.67
874,-6.87
875,-7.03
876,-7.17
877,-7.27
878,-7.32
879,-7.30
880,-7.23
881,-7.14
882,-7.05
883,-6.94
884,-6.86
885,-6.82
886,-6.87
887,-6.97
888,-7.15
889,-7.34
890,-7.58
891,-7.82
892,-8.11
893,-8.42
894,-8.79
895,-9.21
896,-9.73
897,-10.29
898,-10.92
899,-11.54
900,-12.17
901,-12.73
902,-13.23
903,-13.64
904,-14.02
905,-14.33
906,-14.63
907,-14.88
908,-15.17
909,-15.47
910,-15.81
911,-16.13
912,-16.46
913,-16.74
914,-16.98
915,-17.11
916,-17.17
917,-17.16
918,-17.11
919,-17.02
920,-16.90
921,-16.75
922,-16.63
923,-16.55
924,-16.52
925,-16.52
926,-16.53
927,-16.55
928,-16.55
929,-16.53
930,-16.43
931,-16.28
932,-16.08
933,-15.86
934,-15.67
935,-15.53
936,-15.42
937,-15.37
938,-15.38
939,-15.44
940,-15.50
941,-15.51
942,-15.45
943,-15.33
944,-15.16
945,-14.99
946,-14.82
947,-14.67
948,-14.52
949,-14.39
950,-14.22
951,-14.02
952,-13.71
953,-13.31
954,-12.79
955,-12.21
956,-11.55
957,-10.88
958,-10.16
959,-9.48
960,-8.77
961,-8.09
962,-7.41
963,-6.77
964,-6.13
965,-5.56
966,-5.01
967,-4.55
968,-4.10
969,-3.73
970,-3.34
971,-2.98
972,-2.62
973,-2.31
974,-2.01
975,-1.78
976,-1.57
977,-1.43
978,-1.35
979,-1.34
980,-1.35
981,-1.39
982,-1.45
983,-1.53
984,-1.63
985,-1.75
986,-1.89
987,-2.04
988,-2.19
989,-2.27
990,-2.31
991,-2.28
992,-2.24
993,-2.22
994,-2.28
995,-2.42
996,-2.67
997,-3.01
998,-3.46
999,-3.94
1000,-4.42
1001,-4.84
1002,-5.22
1003,-5.54
1004,-5.84
1005,-6.12
1006,-6.41
1007,-6.68
1008,-6.96
1009,-7.21
1010,-7.46
1011,-7.66
1012,-7.85
1013,-8.01
1014,-8.19
1015,-8.36
1016,-8.56
1017,-8.78
1018,-9.04
1019,-9.30
1020,-9.55
1021,-9.76
1022,-9.97
1023,-10.18
1024,-10.39
1025,-10.58
1026,-10.73
1027,-10.83
1028,-10.89
1029,-10.91
1030,-10.89
1031,-10.83
1032,-10.73
1033,-10.59
1034,-10.44
1035,-10.30
1036,-10.15
1037,-9.99
1038,-9.80
1039,-9.57
1040,-9.30
1041,-9.00
1042,-8.64
1043,-8.26
1044,-7.85
1045,-7.46
1046,-7.07
1047,-6.76
1048,-6.48
1049,-6.24
1050,-6.02
1051,-5.81
1052,-5.60
1053,-5.39
1054,-5.16
1055,-4.91
1056,-4.65
1057,-4.40
1058,-4.17
1059,-3.97
1060,-3.81
1061,-3.70
1062,-3.62
1063,-3.59
1064,-3.55
1065,-3.54
1066,-3.53
1067,-3.53
1068,-3.48
1069,-3.38
1070,-3.24
1071,-3.09
1072,-2.94
1073,-2.80
1074,-2.69
1075,-2.62
1076,-2.61
1077,-2.63
1078,-2.66
1079,-2.69
1080,-2.70
1081,-2.72
1082,-2.76
1083,-2.82
1084,-2.88
1085,-2.95
1086,-3.04
1087,-3.14
1088,-3.22
1089,-3.29
1090,-3.34
1091,-3.40
1092,-3.47
1093,-3.56
1094,-3.62
1095,-3.65
1096,-3.62
1097,-3.52
1098,-3.30
1099,-2.99
1100,-2.60
1101,-2.19
1102,-1.73
1103,-1.28
1104,-0.82
1105,-0.40
1106,0.00
1107,0.35
1108,0.70
1109,1.00
1110,1.27
1111,1.46
1112,1.64
1113,1.78
1114,1.90
1115,2.00
1116,2.14
1117,2.33
1118,2.59
1119,2.90
1120,3.28
1121,3.68
1122,4.13
1123,4.55
1124,4.95
1125,5.27
1126,5.55
1127,5.76
1128,5.96
1129,6.10
1130,6.23
1131,6.35
1132,6.52
1133,6.71
1134,6.94
1135,7.19
1136,7.49
1137,7.81
1138,8.16
1139,8.45
1140,8.73
1141,8.98
1142,9.22
1143,9.45
1144,9.67
1145,9.90
1146,10.14
1147,10.38
1148,10.63
1149,10.84
1150,11.05
1151,11.23
1152,11.43
1153,11.61
1154,11.80
1155,11.94
1156,12.09
1157,12.23
1158,12.37
1159,12.52
1160,12.71
1161,12.94
1162,13.21
1163,13.50
1164,13.80
1165,14.10
1166,14.34
1167,14.48
1168,14.51
1169,14.43
1170,14.26
1171,13.99
1172,13.68
1173,13.39
1174,13.15
1175,13.00
1176,12.91
1177,12.86
1178,12.82
1179,12.76
1180,12.65
1181,12.48
1182,12.22
1183,11.92
1184,11.55
1185,11.18
1186,10.83
1187,10.54
1188,10.31
1189,10.13
1190,9.99
1191,9.91
1192,9.86
1193,9.85
1194,9.84
1195,9.86
1196,9.88
1197,9.94
1198,10.01
1199,10.06
1200,10.06
1201,9.99
1202,9.83
1203,9.61
1204,9.31
1205,8.99
1206,8.64
1207,8.32
1208,8.00
1209,7.75
1210,7.51
1211,7.32
1212,7.07
1213,6.81
1214,6.45
1215,6.06
1216,5.58
1217,5.10
1218,4.56
1219,4.07
1220,3.60
1221,3.20
1222,2.79
1223,2.42
1224,2.02
1225,1.64
1226,1.24
1227,0.85
1228,0.43
1229,0.04
1230,-0.35
1231,-0.69
1232,-1.00
1233,-1.26
1234,-1.51
1235,-1.72
1236,-1.93
1237,-2.11
1238,-2.30
1239,-2.45
1240,-2.60
1241,-2.72
1242,-2.85
1243,-2.94
1244,-3.04
1245,-3.14
1246,-3.24
1247,-3.33
1248,-3.43
1249,-3.53
1250,-3.66
1251,-3.80
1252,-3.93
1253,-4.04
1254,-4.14
1255,-4.23
1256,-4.33
1257,-4.43
1258,-4.54
1259,-4.68
1260,-4.84
1261,-5.00
1262,-5.15
1263,-5.29
1264,-5.41
1265,-5.46
1266,-5.45
1267,-5.38
1268,-5.31
1269,-5.24
1270,-5.19
1271,-5.14
1272,-5.12
1273,-5.10
1274,-5.06
1275,-4.97
1276,-4.84
1277,-4.70
1278,-4.53
1279,-4.36
1280,-4.15
1281,-3.94
1282,-3.74
1283,-3.55
1284,-3.34
1285,-3.14
1286,-2.96
1287,-2.80
1288,-2.65
1289,-2.53
1290,-2.42
1291,-2.34
1292,-2.27
1293,-2.20
1294,-2.13
1295,-2.07
1296,-2.01
1297,-1.95
1298,-1.86
1299,-1.75
1300,-1.59
1301,-1.42
1302,-1.20
1303,-0.95
1304,-0.70
1305,-0.49
1306,-0.33
1307,-0.23
1308,-0.17
1309,-0.14
1310,-0.11
1311,-0.11
1312,-0.11
1313,-0.09
1314,-0.04
1315,0.04
1316,0.13
1317,0.21
1318,0.30
1319,0.39
1320,0.50
1321,0.60
1322,0.73
1323,0.89
1324,1.08
1325,1.29
1326,1.53
1327,1.77
1328,2.02
1329,2.27
1330,2.54
1331,2.79
1332,3.06
1333,3.32
1334,3.57
1335,3.79
1336,3.97
1337,4.10
1338,4.19
1339,4.24
1340,4.29
1341,4.32
1342,4.32
1343,4.30
1344,4.26
1345,4.17
1346,4.02
1347,3.78
1348,3.46
1349,3.07
1350,2.62
1351,2.16
1352,1.69
1353,1.28
1354,0.94
1355,0.69
1356,0.48
1357,0.33
1358,0.18
1359,0.04
1360,-0.11
1361,-0.26
1362,-0.40
1363,-0.50
1364,-0.53
1365,-0.48
1366,-0.34
1367,-0.11
1368,0.14
1369,0.40
1370,0.61
1371,0.77
1372,0.86
1373,0.90
1374,0.87
1375,0.80
1376,0.69
1377,0.55
1378,0.38
1379,0.20
1380,0.00
1381,-0.21
1382,-0.45
1383,-0.67
1384,-0.85
1385,-0.97
1386,-1.04
1387,-1.07
1388,-1.08
1389,-1.08
1390,-1.09
1391,-1.12
1392,-1.21
1393,-1.30
1394,-1.42
1395,-1.53
1396,-1.67
1397,-1.84
1398,-2.04
1399,-2.28
1400,-2.56
1401,-2.85
1402,-3.14
1403,-3.41
1404,-3.68
1405,-3.92
1406,-4.17
1407,-4.38
1408,-4.61
1409,-4.82
1410,-5.04
1411,-5.23
1412,-5.40
1413,-5.55
1414,-5.70
1415,-5.83
1416,-6.00
1417,-6.21
1418,-6.48
1419,-6.79
1420,-7.13
1421,-7.44
1422,-7.72
1423,-7.95
1424,-8.16
1425,-8.35
1426,-8.54
1427,-8.71
1428,-8.90
1429,-9.07
1430,-9.26
1431,-9.43
1432,-9.62
1433,-9.80
1434,-10.00
1435,-10.21
1436,-10.47
1437,-10.73
1438,-11.02
1439,-11.27
1440,-11.49
1441,-11.66
1442,-11.78
1443,-11.87
1444,-11.96
1445,-12.06
1446,-12.19
1447,-12.33
1448,-12.44
1449,-12.52
1450,-12.54
1451,-12.53
1452,-12.46
1453,-12.37
1454,-12.28
1455,-12.22
1456,-12.21
1457,-12.22
1458,-12.21
1459,-12.18
1460,-12.08
1461,-11.94
1462,-11.75
1463,-11.57
1464,-11.39
1465,-11.25
1466,-11.12
1467,-10.98
1468,-10.78
1469,-10.54
1470,-10.23
1471,-9.90
1472,-9.53
1473,-9.19
1474,-8.87
1475,-8.64
1476,-8.42
1477,-8.25
1478,-8.06
1479,-7.87
1480,-7.60
1481,-7.26
1482,-6.88
1483,-6.52
1484,-6.17
1485,-5.85
1486,-5.52
1487,-5.21
1488,-4.89
1489,-4.59
1490,-4.25
1491,-3.91
1492,-3.56
1493,-3.24
1494,-2.95
1495,-2.75
1496,-2.56
1497,-2.41
1498,-2.23
1499,-2.01
1500,-1.69
1501,-1.29
1502,-0.79
1503,-0.27
1504,0.29
1505,0.79
1506,1.27
1507,1.66
1508,2.09
1509,2.52
1510,3.07
1511,3.68
1512,4.42
1513,5.17
1514,5.98
1515,6.74
1516,7.48
1517,8.07
1518,8.58
1519,8.98
1520,9.37
1521,9.74
1522,10.15
1523,10.54
1524,10.94
1525,11.31
1526,11.67
1527,11.96
1528,12.20
1529,12.37
1530,12.54
1531,12.73
1532,12.92
1533,13.10
1534,13.23
1535,13.29
1536,13.28
1537,13.21
1538,13.13
1539,13.04
1540,12.95
1541,12.86
1542,12.79
1543,12.73
1544,12.63
1545,12.47
1546,12.21
1547,11.91
1548,11.54
1549,11.15
1550,10.77
1551,10.45
1552,10.17
1553,9.95
1554,9.72
1555,9.47
1556,9.13
1557,8.74
1558,8.29
1559,7.87
1560,7.44
1561,7.08
1562,6.77
1563,6.56
1564,6.37
1565,6.20
1566,5.94
1567,5.62
1568,5.22
1569,4.81
1570,4.34
1571,3.88
1572,3.42
1573,3.01
1574,2.62
1575,2.29
1576,1.95
1577,1.62
1578,1.26
1579,0.94
1580,0.64
1581,0.41
1582,0.20
1583,0.02
1584,-0.19
1585,-0.38
1586,-0.60
1587,-0.82
1588,-1.11
1589,-1.40
1590,-1.68
1591,-1.88
1592,-2.02
1593,-2.10
1594,-2.14
1595,-2.15
1596,-2.18
1597,-2.23
1598,-2.34
1599,-2.49
1600,-2.69
1601,-2.89
1602,-3.10
1603,-3.27
1604,-3.42
1605,-3.52
1606,-3.59
1607,-3.66
1608,-3.73
1609,-3.82
1610,-3.95
1611,-4.10
1612,-4.23
1613,-4.34
1614,-4.41
1615,-4.43
1616,-4.43
1617,-4.40
1618,-4.36
1619,-4.31
1620,-4.28
1621,-4.27
1622,-4.26
1623,-4.26
1624,-4.23
1625,-4.17
1626,-4.08
1627,-3.97
1628,-3.85
1629,-3.73
1630,-3.59
1631,-3.43
1632,-3.28
1633,-3.13
1634,-2.96
1635,-2.79
1636,-2.60
1637,-2.42
1638,-2.22
1639,-2.04
1640,-1.87
1641,-1.72
1642,-1.58
1643,-1.44
1644,-1.30
1645,-1.18
1646,-1.05
1647,-0.93
1648,-0.80
1649,-0.70
1650,-0.60
1651,-0.49
1652,-0.34
1653,-0.15
1654,0.06
1655,0.26
1656,0.46
1657,0.61
1658,0.75
1659,0.84
1660,0.94
1661,1.04
1662,1.17
1663,1.35
1664,1.55
1665,1.72
1666,1.85
1667,1.91
1668,1.95
1669,1.95
1670,1.95
1671,1.95
1672,2.01
1673,2.14
1674,2.32
1675,2.51
1676,2.71
1677,2.87
1678,3.01
1679,3.11
1680,3.23
1681,3.36
1682,3.54
1683,3.75
1684,3.99
1685,4.21
1686,4.40
1687,4.51
1688,4.52
1689,4.46
1690,4.36
1691,4.26
1692,4.24
1693,4.32
1694,4.52
1695,4.81
1696,5.17
1697,5.54
1698,5.87
1699,6.13
1700,6.31
1701,6.43
1702,6.52
1703,6.58
1704,6.68
1705,6.79
1706,6.91
1707,7.02
1708,7.13
1709,7.23
1710,7.35
1711,7.45
1712,7.55
1713,7.64
1714,7.70
1715,7.74
1716,7.74
1717,7.73
1718,7.68
1719,7.61
1720,7.53
1721,7.43
1722,7.32
1723,7.21
1724,7.06
1725,6.91
1726,6.75
1727,6.60
1728,6.45
1729,6.34
1730,6.27
1731,6.26
1732,6.28
1733,6.29
1734,6.26
1735,6.22
1736,6.11
1737,5.97
1738,5.76
1739,5.53
1740,5.27
1741,5.03
1742,4.78
1743,4.56
1744,4.35
1745,4.15
1746,3.93
1747,3.72
1748,3.52
1749,3.35
1750,3.17
1751,2.98
1752,2.72
1753,2.45
1754,2.12
1755,1.80
1756,1.46
1757,1.14
1758,0.79
1759,0.49
1760,0.21
1761,0.03
1762,-0.10
1763,-0.18
1764,-0.24
1765,-0.28
1766,-0.34
1767,-0.40
1768,-0.50
1769,-0.63
1770,-0.79
1771,-0.95
1772,-1.11
1773,-1.25
1774,-1.39
1775,-1.53
1776,-1.69
1777,-1.85
1778,-2.04
1779,-2.24
1780,-2.45
1781,-2.62
1782,-2.73
1783,-2.78
1784,-2.81
1785,-2.79
1786,-2.76
1787,-2.74
1788,-2.75
1789,-2.79
1790,-2.85
1791,-2.94
1792,-3.04
1793,-3.15
1794,-3.24
1795,-3.30
1796,-3.35
1797,-3.41
1798,-3.49
1799,-3.57
1800,-3.68
1801,-3.81
1802,-3.97
1803,-4.15
1804,-4.33
1805,-4.53
1806,-4.74
1807,-4.93
1808,-5.10
1809,-5.21
1810,-5.27
1811,-5.27
1812,-5.22
1813,-5.13
1814,-5.01
1815,-4.90
1816,-4.81
1817,-4.77
1818,-4.76
1819,-4.78
1820,-4.78
1821,-4.78
1822,-4.74
1823,-4.69
1824,-4.61
1825,-4.51
1826,-4.40
1827,-4.31
1828,-4.25
1829,-4.20
1830,-4.17
1831,-4.12
1832,-4.04
1833,-3.93
1834,-3.78
1835,-3.62
1836,-3.46
1837,-3.30
1838,-3.14
1839,-3.02
1840,-2.93
1841,-2.88
1842,-2.82
1843,-2.75
1844,-2.68
1845,-2.62
1846,-2.56
1847,-2.54
1848,-2.53
1849,-2.56
1850,-2.64
1851,-2.75
1852,-2.86
1853,-2.94
1854,-2.99
1855,-3.01
1856,-3.01
1857,-2.99
1858,-2.98
1859,-2.95
1860,-2.93
1861,-2.90
1862,-2.87
1863,-2.87
1864,-2.87
1865,-2.88
1866,-2.90
1867,-2.91
1868,-2.94
1869,-2.94
1870,-2.91
1871,-2.84
1872,-2.71
1873,-2.55
1874,-2.36
1875,-2.17
1876,-2.03
1877,-1.94
1878,-1.89
1879,-1.89
1880,-1.90
1881,-1.90
1882,-1.88
1883,-1.84
1884,-1.77
1885,-1.70
1886,-1.64
1887,-1.60
1888,-1.59
1889,-1.63
1890,-1.65
1891,-1.67
1892,-1.69
1893,-1.69
1894,-1.68
1895,-1.67
1896,-1.71
1897,-1.83
1898,-2.03
1899,-2.28
1900,-2.55
1901,-2.78
1902,-2.95
1903,-3.03
1904,-3.01
1905,-2.91
1906,-2.77
1907,-2.62
1908,-2.53
1909,-2.50
1910,-2.55
1911,-2.64
1912,-2.78
1913,-2.94
1914,-3.12
1915,-3.27
1916,-3.39
1917,-3.48
1918,-3.56
1919,-3.64
1920,-3.71
1921,-3.75
1922,-3.79
1923,-3.82
1924,-3.84
1925,-3.84
1926,-3.85
1927,-3.86
1928,-3.88
1929,-3.89
1930,-3.91
1931,-3.93
1932,-3.95
1933,-3.97
1934,-4.00
1935,-4.04
1936,-4.10
1937,-4.18
1938,-4.29
1939,-4.38
1940,-4.46
1941,-4.52
1942,-4.58
1943,-4.63
1944,-4.69
1945,-4.75
1946,-4.81
1947,-4.89
1948,-4.97
1949,-5.02
1950,-5.05
1951,-5.07
1952,-5.07
1953,-5.08
1954,-5.10
1955,-5.12
1956,-5.15
1957,-5.17
1958,-5.19
1959,-5.21
1960,-5.23
1961,-5.26
1962,-5.32
1963,-5.42
1964,-5.55
1965,-5.71
1966,-5.86
1967,-5.99
1968,-6.08
1969,-6.10
1970,-6.04
1971,-5.92
1972,-5.79
1973,-5.68
1974,-5.58
1975,-5.53
1976,-5.52
1977,-5.56
1978,-5.65
1979,-5.77
1980,-5.87
1981,-5.97
1982,-6.07
1983,-6.17
1984,-6.25
1985,-6.29
1986,-6.29
1987,-6.26
1988,-6.20
1989,-6.12
1990,-6.04
1991,-5.98
1992,-5.97
1993,-5.99
1994,-6.04
1995,-6.13
1996,-6.23
1997,-6.32
1998,-6.39
1999,-6.42
2000,-6.42
2001,-6.39
2002,-6.32
2003,-6.23
2004,-6.13
2005,-6.03
2006,-5.96
2007,-5.90
2008,-5.84
2009,-5.78
2010,-5.71
2011,-5.64
2012,-5.58
2013,-5.53
2014,-5.49
2015,-5.46
2016,-5.45
2017,-5.46
2018,-5.45
2019,-5.44
2020,-5.42
2021,-5.39
2022,-5.32
2023,-5.23
2024,-5.13
2025,-5.09
2026,-5.08
2027,-5.09
2028,-5.11
2029,-5.13
2030,-5.14
2031,-5.10
2032,-5.00
2033,-4.88
2034,-4.78
2035,-4.73
2036,-4.74
2037,-4.80
2038,-4.93
2039,-5.12
2040,-5.31
2041,-5.46
2042,-5.55
2043,-5.56
2044,-5.49
2045,-5.37
2046,-5.25
2047,-5.16
2048,-5.12
2049,-5.13
2050,-5.21
2051,-5.33
2052,-5.45
2053,-5.53
2054,-5.56
2055,-5.54
2056,-5.44
2057,-5.31
2058,-5.17
2059,-5.04
2060,-4.93
2061,-4.85
2062,-4.80
2063,-4.78
2064,-4.74
2065,-4.68
2066,-4.56
2067,-4.38
2068,-4.12
2069,-3.81
2070,-3.46
2071,-3.14
2072,-2.85
2073,-2.63
2074,-2.49
2075,-2.42
2076,-2.37
2077,-2.32
2078,-2.26
2079,-2.17
2080,-2.08
2081,-2.00
2082,-1.97
2083,-2.00
2084,-2.12
2085,-2.31
2086,-2.56
2087,-2.82
2088,-3.06
2089,-3.27
2090,-3.43
2091,-3.56
2092,-3.65
2093,-3.75
2094,-3.87
2095,-4.04
2096,-4.24
2097,-4.44
2098,-4.59
2099,-4.66
2100,-4.68
2101,-4.62
2102,-4.51
2103,-4.35
2104,-4.20
2105,-4.10
2106,-4.06
2107,-4.08
2108,-4.17
2109,-4.30
2110,-4.46
2111,-4.59
2112,-4.69
2113,-4.77
2114,-4.85
2115,-4.94
2116,-5.07
2117,-5.19
2118,-5.35
2119,-5.53
2120,-5.75
2121,-5.95
2122,-6.16
2123,-6.35
2124,-6.58
2125,-6.83
2126,-7.13
2127,-7.46
2128,-7.86
2129,-8.29
2130,-8.78
2131,-9.28
2132,-9.77
2133,-10.18
2134,-10.54
2135,-10.80
2136,-11.02
2137,-11.21
2138,-11.44
2139,-11.68
2140,-11.99
2141,-12.28
2142,-12.60
2143,-12.86
2144,-13.09
2145,-13.24
2146,-13.37
2147,-13.49
2148,-13.64
2149,-13.82
2150,-14.06
2151,-14.31
2152,-14.58
2153,-14.79
2154,-14.90
2155,-14.89
2156,-14.77
2157,-14.59
2158,-14.38
2159,-14.20
2160,-14.07
2161,-14.00
2162,-13.99
2163,-14.03
2164,-14.09
2165,-14.14
2166,-14.14
2167,-14.11
2168,-14.02
2169,-13.93
2170,-13.84
2171,-13.76
2172,-13.65
2173,-13.53
2174,-13.42
2175,-13.33
2176,-13.22
2177,-13.10
2178,-12.94
2179,-12.78
2180,-12.58
2181,-12.35
2182,-12.08
2183,-11.79
2184,-11.49
2185,-11.22
2186,-10.95
2187,-10.68
2188,-10.43
2189,-10.22
2190,-10.01
2191,-9.81
2192,-9.59
2193,-9.40
2194,-9.21
2195,-9.03
2196,-8.83
2197,-8.64
2198,-8.42
2199,-8.24
2200,-8.05
2201,-7.88
2202,-7.74
2203,-7.67
2204,-7.64
2205,-7.64
2206,-7.61
2207,-7.53
2208,-7.38
2209,-7.15
2210,-6.81
2211,-6.42
2212,-5.98
2213,-5.55
2214,-5.13
2215,-4.78
2216,-4.49
2217,-4.27
2218,-4.04
2219,-3.79
2220,-3.46
2221,-3.11
2222,-2.69
2223,-2.28
2224,-1.87
2225,-1.53
2226,-1.24
2227,-1.04
2228,-0.88
2229,-0.76
2230,-0.61
2231,-0.46
2232,-0.23
2233,0.04
2234,0.37
2235,0.68
2236,0.97
2237,1.17
2238,1.34
2239,1.44
2240,1.56
2241,1.69
2242,1.94
2243,2.26
2244,2.69
2245,3.17
2246,3.70
2247,4.20
2248,4.69
2249,5.10
2250,5.49
2251,5.85
2252,6.24
2253,6.62
2254,7.08
2255,7.55
2256,8.06
2257,8.49
2258,8.89
2259,9.19
2260,9.41
2261,9.53
2262,9.64
2263,9.73
2264,9.90
2265,10.13
2266,10.45
2267,10.80
2268,11.16
2269,11.49
2270,11.79
2271,12.02
2272,12.18
2273,12.25
2274,12.28
2275,12.25
2276,12.23
2277,12.21
2278,12.22
2279,12.28
2280,12.39
2281,12.51
2282,12.63
2283,12.72
2284,12.80
2285,12.87
2286,12.89
2287,12.87
2288,12.84
2289,12.84
2290,12.85
2291,12.89
2292,12.96
2293,13.08
2294,13.19
2295,13.27
2296,13.29
2297,13.24
2298,13.12
2299,12.94
2300,12.67
2301,12.37
2302,12.02
2303,11.69
2304,11.34
2305,11.03
2306,10.73
2307,10.44
2308,10.15
2309,9.88
2310,9.61
2311,9.38
2312,9.15
2313,8.91
2314,8.63
2315,8.32
2316,7.94
2317,7.51
2318,7.03
2319,6.54
2320,6.03
2321,5.58
2322,5.10
2323,4.68
2324,4.26
2325,3.89
2326,3.52
2327,3.17
2328,2.78
2329,2.43
2330,2.10
2331,1.82
2332,1.50
2333,1.19
2334,0.78
2335,0.34
2336,-0.14
2337,-0.63
2338,-1.14
2339,-1.60
2340,-2.01
2341,-2.32
2342,-2.59
2343,-2.84
2344,-3.11
2345,-3.39
2346,-3.68
2347,-3.94
2348,-4.21
2349,-4.44
2350,-4.65
2351,-4.77
2352,-4.84
2353,-4.86
2354,-4.90
2355,-4.95
2356,-5.04
2357,-5.16
2358,-5.29
2359,-5.42
2360,-5.54
2361,-5.60
2362,-5.60
2363,-5.52
2364,-5.38
2365,-5.20
2366,-5.03
2367,-4.86
2368,-4.69
2369,-4.54
2370,-4.41
2371,-4.33
2372,-4.26
2373,-4.20
2374,-4.17
2375,-4.18
2376,-4.23
2377,-4.32
2378,-4.41
2379,-4.50
2380,-4.59
2381,-4.65
2382,-4.68
2383,-4.68
2384,-4.66
2385,-4.66
2386,-4.71
2387,-4.81
2388,-4.93
2389,-5.06
2390,-5.18
2391,-5.28
2392,-5.33
2393,-5.29
2394,-5.20
2395,-5.07
2396,-4.95
2397,-4.88
2398,-4.89
2399,-4.99
2400,-5.17
2401,-5.38
2402,-5.62
2403,-5.82
2404,-5.98
2405,-6.07
2406,-6.10
2407,-6.08
2408,-6.05
2409,-6.03
2410,-6.07
2411,-6.14
2412,-6.29
2413,-6.52
2414,-6.77
2415,-7.03
2416,-7.29
2417,-7.49
2418,-7.66
2419,-7.75
2420,-7.77
2421,-7.74
2422,-7.67
2423,-7.58
2424,-7.49
2425,-7.41
2426,-7.36
2427,-7.35
2428,-7.38
2429,-7.42
2430,-7.48
2431,-7.56
2432,-7.63
2433,-7.68
2434,-7.72
2435,-7.74
2436,-7.72
2437,-7.68
2438,-7.61
2439,-7.53
2440,-7.47
2441,-7.43
2442,-7.44
2443,-7.50
2444,-7.63
2445,-7.80
2446,-7.99
2447,-8.16
2448,-8.29
2449,-8.35
2450,-8.33
2451,-8.26
2452,-8.16
2453,-8.06
2454,-7.96
2455,-7.89
2456,-7.84
2457,-7.81
2458,-7.77
2459,-7.67
2460,-7.51
2461,-7.31
2462,-7.08
2463,-6.87
2464,-6.68
2465,-6.56
2466,-6.51
2467,-6.54
2468,-6.58
2469,-6.65
2470,-6.66
2471,-6.65
2472,-6.59
2473,-6.52
2474,-6.42
2475,-6.32
2476,-6.23
2477,-6.16
2478,-6.08
2479,-5.96
2480,-5.78
2481,-5.57
2482,-5.30
2483,-5.00
2484,-4.66
2485,-4.35
2486,-4.05
2487,-3.81
2488,-3.63
2489,-3.50
2490,-3.36
2491,-3.22
2492,-3.04
2493,-2.87
2494,-2.71
2495,-2.56
2496,-2.40
2497,-2.24
2498,-2.08
2499,-1.94
2500,-1.80
2501,-1.67
2502,-1.56
2503,-1.50
2504,-1.49
2505,-1.50
2506,-1.52
2507,-1.53
2508,-1.53
2509,-1.49
2510,-1.40
2511,-1.29
2512,-1.14
2513,-1.00
2514,-0.88
2515,-0.79
2516,-0.75
2517,-0.72
2518,-0.71
2519,-0.71
2520,-0.72
2521,-0.72
2522,-0.74
2523,-0.75
2524,-0.76
2525,-0.76
2526,-0.77
2527,-0.79
2528,-0.83
2529,-0.89
2530,-0.97
2531,-1.08
2532,-1.24
2533,-1.43
2534,-1.67
2535,-1.91
2536,-2.17
2537,-2.43
2538,-2.74
2539,-3.05
2540,-3.40
2541,-3.76
2542,-4.14
2543,-4.50
2544,-4.82
2545,-5.07
2546,-5.23
2547,-5.33
2548,-5.40
2549,-5.44
2550,-5.46
2551,-5.46
2552,-5.44
2553,-5.40
2554,-5.34
2555,-5.24
2556,-5.11
2557,-4.95
2558,-4.78
2559,-4.63
2560,-4.50
2561,-4.39
2562,-4.28
2563,-4.17
2564,-4.00
2565,-3.81
2566,-3.58
2567,-3.33
2568,-3.08
2569,-2.86
2570,-2.65
2571,-2.49
2572,-2.35
2573,-2.25
2574,-2.13
2575,-1.99
2576,-1.82
2577,-1.65
2578,-1.48
2579,-1.36
2580,-1.27
2581,-1.24
2582,-1.24
2583,-1.27
2584,-1.31
2585,-1.34
2586,-1.35
2587,-1.35
2588,-1.35
2589,-1.34
2590,-1.27
2591,-1.18
2592,-1.05
2593,-0.89
2594,-0.68
2595,-0.42
2596,-0.11
2597,0.22
2598,0.53
2599,0.82
2600,1.08
2601,1.30
2602,1.48
2603,1.59
2604,1.63
2605,1.59
2606,1.53
2607,1.41
2608,1.27
2609,1.11
2610,0.97
2611,0.86
2612,0.79
2613,0.75
2614,0.72
2615,0.70
2616,0.65
2617,0.56
2618,0.38
2619,0.14
2620,-0.17
2621,-0.49
2622,-0.83
2623,-1.15
2624,-1.48
2625,-1.78
2626,-2.07
2627,-2.32
2628,-2.55
2629,-2.75
2630,-2.91
2631,-3.04
2632,-3.12
2633,-3.14
2634,-3.11
2635,-3.01
2636,-2.91
2637,-2.82
2638,-2.78
2639,-2.78
2640,-2.85
2641,-2.95
2642,-3.11
2643,-3.32
2644,-3.54
2645,-3.74
2646,-3.92
2647,-4.07
2648,-4.17
2649,-4.22
2650,-4.23
2651,-4.23
2652,-4.20
2653,-4.18
2654,-4.17
2655,-4.17
2656,-4.20
2657,-4.22
2658,-4.26
2659,-4.29
2660,-4.33
2661,-4.39
2662,-4.46
2663,-4.54
2664,-4.65
2665,-4.79
2666,-4.96
2667,-5.13
2668,-5.31
2669,-5.49
2670,-5.70
2671,-5.91
2672,-6.09
2673,-6.20
2674,-6.26
2675,-6.26
2676,-6.21
2677,-6.12
2678,-6.03
2679,-5.96
2680,-5.96
2681,-6.01
2682,-6.10
2683,-6.23
2684,-6.36
2685,-6.49
2686,-6.58
2687,-6.60
2688,-6.55
2689,-6.48
2690,-6.41
2691,-6.37
2692,-6.35
2693,-6.36
2694,-6.42
2695,-6.51
2696,-6.58
2697,-6.65
2698,-6.70
2699,-6.74
2700,-6.75
2701,-6.75
2702,-6.74
2703,-6.69
2704,-6.60
2705,-6.47
2706,-6.29
2707,-6.11
2708,-5.91
2709,-5.69
2710,-5.45
2711,-5.23
2712,-5.01
2713,-4.85
2714,-4.68
2715,-4.52
2716,-4.32
2717,-4.10
2718,-3.83
2719,-3.51
2720,-3.13
2721,-2.73
2722,-2.32
2723,-1.95
2724,-1.60
2725,-1.34
2726,-1.14
2727,-1.02
2728,-0.96
2729,-0.95
2730,-0.96
2731,-0.96
2732,-0.89
2733,-0.74
2734,-0.50
2735,-0.24
2736,0.06
2737,0.35
2738,0.64
2739,0.89
2740,1.09
2741,1.25
2742,1.41
2743,1.59
2744,1.82
2745,2.10
2746,2.42
2747,2.72
2748,3.02
2749,3.27
2750,3.43
2751,3.48
2752,3.46
2753,3.37
2754,3.26
2755,3.14
2756,3.04
2757,2.99
2758,2.98
2759,3.01
2760,3.08
2761,3.16
2762,3.26
2763,3.37
2764,3.49
2765,3.61
2766,3.71
2767,3.79
2768,3.86
2769,3.90
2770,3.91
2771,3.93
2772,3.98
2773,4.06
2774,4.17
2775,4.26
2776,4.34
2777,4.36
2778,4.35
2779,4.29
2780,4.22
2781,4.17
2782,4.21
2783,4.34
2784,4.59
2785,4.91
2786,5.31
2787,5.72
2788,6.16
2789,6.56
2790,6.97
2791,7.35
2792,7.77
2793,8.19
2794,8.66
2795,9.13
2796,9.61
2797,10.01
2798,10.36
2799,10.60
2800,10.80
2801,10.91
2802,10.99
2803,11.02
2804,11.00
2805,10.92
2806,10.79
2807,10.61
2808,10.43
2809,10.25
2810,10.10
2811,9.97
2812,9.88
2813,9.83
2814,9.84
2815,9.89
2816,9.94
2817,9.99
2818,10.04
2819,10.07
2820,10.07
2821,10.05
2822,10.02
2823,10.00
2824,9.99
2825,9.99
2826,10.02
2827,10.09
2828,10.19
2829,10.33
2830,10.48
2831,10.66
2832,10.83
2833,10.97
2834,11.06
2835,11.09
2836,11.02
2837,10.87
2838,10.67
2839,10.41
2840,10.14
2841,9.86
2842,9.63
2843,9.46
2844,9.35
2845,9.28
2846,9.25
2847,9.27
2848,9.32
2849,9.39
2850,9.48
2851,9.55
2852,9.61
2853,9.64
2854,9.65
2855,9.64
2856,9.59
2857,9.51
2858,9.40
2859,9.28
2860,9.17
2861,9.11
2862,9.09
2863,9.12
2864,9.21
2865,9.33
2866,9.47
2867,9.59
2868,9.67
2869,9.68
2870,9.64
2871,9.53
2872,9.36
2873,9.18
2874,9.00
2875,8.85
2876,8.74
2877,8.63
2878,8.51
2879,8.38
2880,8.24
2881,8.10
2882,7.94
2883,7.79
2884,7.62
2885,7.48
2886,7.32
2887,7.16
2888,6.94
2889,6.68
2890,6.36
2891,6.04
2892,5.72
2893,5.42
2894,5.14
2895,4.91
2896,4.73
2897,4.61
2898,4.52
2899,4.46
2900,4.41
2901,4.38
2902,4.35
2903,4.33
2904,4.33
2905,4.36
2906,4.45
2907,4.58
2908,4.75
2909,4.94
2910,5.16
2911,5.37
2912,5.59
2913,5.80
2914,6.00
2915,6.15
2916,6.29
2917,6.40
2918,6.52
2919,6.65
2920,6.78
2921,6.91
2922,7.03
2923,7.13
2924,7.17
2925,7.16
2926,7.13
2927,7.07
2928,7.00
2929,6.94
2930,6.90
2931,6.90
2932,6.89
2933,6.87
2934,6.84
2935,6.78
2936,6.71
2937,6.64
2938,6.58
2939,6.57
2940,6.57
2941,6.58
2942,6.59
2943,6.60
2944,6.58
2945,6.52
2946,6.44
2947,6.35
2948,6.26
2949,6.16
2950,6.03
2951,5.91
2952,5.81
2953,5.74
2954,5.68
2955,5.60
2956,5.48
2957,5.33
2958,5.16
2959,4.97
2960,4.78
2961,4.59
2962,4.41
2963,4.28
2964,4.18
2965,4.13
2966,4.07
2967,4.02
2968,3.92
2969,3.79
2970,3.59
2971,3.35
2972,3.09
2973,2.85
2974,2.65
2975,2.48
2976,2.34
2977,2.25
2978,2.18
2979,2.12
2980,2.06
2981,2.00
2982,1.95
2983,1.91
2984,1.91
2985,1.91
2986,1.95
2987,2.02
2988,2.11
2989,2.18
2990,2.23
2991,2.24
2992,2.23
2993,2.20
2994,2.14
2995,2.08
2996,2.04
2997,2.02
2998,2.04
2999,2.06
3000,2.10
3001,2.14
3002,2.16
3003,2.18
3004,2.19
3005,2.18
3006,2.17
3007,2.16
3008,2.14
3009,2.12
3010,2.05
3011,1.93
3012,1.75
3013,1.56
3014,1.34
3015,1.12
3016,0.93
3017,0.79
3018,0.68
3019,0.61
3020,0.54
3021,0.48
3022,0.39
3023,0.29
3024,0.18
3025,0.06
3026,-0.05
3027,-0.14
3028,-0.21
3029,-0.24
3030,-0.23
3031,-0.18
3032,-0.10
3033,0.01
3034,0.13
3035,0.25
3036,0.37
3037,0.47
3038,0.53
3039,0.53
3040,0.50
3041,0.46
3042,0.41
3043,0.38
3044,0.39
3045,0.43
3046,0.53
3047,0.63
3048,0.75
3049,0.83
3050,0.89
3051,0.92
3052,0.92
3053,0.93
3054,0.95
3055,1.01
3056,1.08
3057,1.14
3058,1.19
3059,1.21
3060,1.21
3061,1.20
3062,1.13
3063,1.04
3064,0.94
3065,0.84
3066,0.75
3067,0.64
3068,0.53
3069,0.42
3070,0.29
3071,0.16
3072,0.03
3073,-0.07
3074,-0.14
3075,-0.18
3076,-0.20
3077,-0.20
3078,-0.24
3079,-0.32
3080,-0.47
3081,-0.66
3082,-0.89
3083,-1.14
3084,-1.40
3085,-1.63
3086,-1.86
3087,-2.07
3088,-2.30
3089,-2.56
3090,-2.89
3091,-3.27
3092,-3.71
3093,-4.15
3094,-4.62
3095,-5.03
3096,-5.39
3097,-5.68
3098,-5.89
3099,-6.04
3100,-6.17
3101,-6.28
3102,-6.39
3103,-6.49
3104,-6.60
3105,-6.70
3106,-6.79
3107,-6.85
3108,-6.89
3109,-6.90
3110,-6.91
3111,-6.91
3112,-6.90
3113,-6.86
3114,-6.81
3115,-6.77
3116,-6.77
3117,-6.80
3118,-6.84
3119,-6.87
3120,-6.88
3121,-6.88
3122,-6.85
3123,-6.78
3124,-6.67
3125,-6.52
3126,-6.32
3127,-6.10
3128,-5.85
3129,-5.60
3130,-5.34
3131,-5.08
3132,-4.77
3133,-4.42
3134,-4.00
3135,-3.56
3136,-3.11
3137,-2.70
3138,-2.30
3139,-1.96
3140,-1.66
3141,-1.45
3142,-1.29
3143,-1.16
3144,-1.01
3145,-0.89
3146,-0.80
3147,-0.75
3148,-0.71
3149,-0.69
3150,-0.69
3151,-0.73
3152,-0.81
3153,-0.90
3154,-1.02
3155,-1.16
3156,-1.31
3157,-1.49
3158,-1.69
3159,-1.89
3160,-2.06
3161,-2.19
3162,-2.30
3163,-2.38
3164,-2.43
3165,-2.46
3166,-2.46
3167,-2.46
3168,-2.50
3169,-2.56
3170,-2.65
3171,-2.77
3172,-2.91
3173,-3.05
3174,-3.20
3175,-3.33
3176,-3.45
3177,-3.54
3178,-3.59
3179,-3.59
3180,-3.59
3181,-3.56
3182,-3.53
3183,-3.49
3184,-3.43
3185,-3.37
3186,-3.32
3187,-3.30
3188,-3.30
3189,-3.35
3190,-3.43
3191,-3.50
3192,-3.58
3193,-3.62
3194,-3.63
3195,-3.59
3196,-3.51
3197,-3.42
3198,-3.36
3199,-3.33
3200,-3.36
3201,-3.43
3202,-3.49
3203,-3.53
3204,-3.55
3205,-3.52
3206,-3.46
3207,-3.39
3208,-3.33
3209,-3.30
3210,-3.31
3211,-3.36
3212,-3.47
3213,-3.61
3214,-3.76
3215,-3.91
3216,-4.06
3217,-4.21
3218,-4.36
3219,-4.49
3220,-4.59
3221,-4.62
3222,-4.59
3223,-4.46
3224,-4.25
3225,-3.97
3226,-3.68
3227,-3.43
3228,-3.29
3229,-3.26
3230,-3.33
3231,-3.52
3232,-3.78
3233,-4.07
3234,-4.33
3235,-4.52
3236,-4.68
3237,-4.78
3238,-4.82
3239,-4.80
3240,-4.75
3241,-4.71
3242,-4.66
3243,-4.59
3244,-4.45
3245,-4.28
3246,-4.10
3247,-3.92
3248,-3.75
3249,-3.59
3250,-3.45
3251,-3.33
3252,-3.22
3253,-3.11
3254,-2.98
3255,-2.86
3256,-2.74
3257,-2.66
3258,-2.59
3259,-2.55
3260,-2.49
3261,-2.45
3262,-2.35
3263,-2.20
3264,-1.95
3265,-1.65
3266,-1.27
3267,-0.85
3268,-0.43
3269,-0.03
3270,0.32
3271,0.58
3272,0.77
3273,0.87
3274,0.90
3275,0.87
3276,0.80
3277,0.71
3278,0.61
3279,0.53
3280,0.47
3281,0.44
3282,0.45
3283,0.47
3284,0.43
3285,0.34
3286,0.19
3287,-0.01
3288,-0.26
3289,-0.55
3290,-0.86
3291,-1.15
3292,-1.43
3293,-1.66
3294,-1.88
3295,-2.06
3296,-2.21
3297,-2.33
3298,-2.41
3299,-2.47
3300,-2.50
3301,-2.49
3302,-2.45
3303,-2.35
3304,-2.17
3305,-1.95
3306,-1.68
3307,-1.42
3308,-1.16
3309,-0.92
3310,-0.71
3311,-0.53
3312,-0.36
3313,-0.19
3314,0.01
3315,0.22
3316,0.50
3317,0.79
3318,1.09
3319,1.36
3320,1.59
3321,1.79
3322,1.97
3323,2.10
3324,2.22
3325,2.33
3326,2.45
3327,2.59
3328,2.76
3329,2.93
3330,3.09
3331,3.25
3332,3.41
3333,3.56
3334,3.68
3335,3.77
3336,3.81
3337,3.82
3338,3.80
3339,3.75
3340,3.68
3341,3.61
3342,3.52
3343,3.42
3344,3.30
3345,3.15
3346,2.98
3347,2.78
3348,2.56
3349,2.32
3350,2.09
3351,1.91
3352,1.75
3353,1.68
3354,1.66
3355,1.68
3356,1.71
3357,1.72
3358,1.72
3359,1.67
3360,1.57
3361,1.43
3362,1.27
3363,1.11
3364,0.94
3365,0.78
3366,0.61
3367,0.44
3368,0.26
3369,0.07
3370,-0.14
3371,-0.33
3372,-0.50
3373,-0.62
3374,-0.75
3375,-0.87
3376,-1.04
3377,-1.24
3378,-1.49
3379,-1.75
3380,-2.07
3381,-2.37
3382,-2.69
3383,-2.94
3384,-3.18
3385,-3.36
3386,-3.54
3387,-3.70
3388,-3.86
3389,-3.99
3390,-4.13
3391,-4.24
3392,-4.38
3393,-4.49
3394,-4.62
3395,-4.75
3396,-4.89
3397,-5.03
3398,-5.13
3399,-5.18
3400,-5.17
3401,-5.10
3402,-5.04
3403,-4.99
3404,-4.99
3405,-5.01
3406,-5.05
3407,-5.09
3408,-5.13
3409,-5.14
3410,-5.07
3411,-4.89
3412,-4.64
3413,-4.36
3414,-4.07
3415,-3.82
3416,-3.59
3417,-3.38
3418,-3.20
3419,-3.03
3420,-2.85
3421,-2.67
3422,-2.47
3423,-2.29
3424,-2.12
3425,-2.01
3426,-1.91
3427,-1.85
3428,-1.82
3429,-1.84
3430,-1.86
3431,-1.87
3432,-1.82
3433,-1.72
3434,-1.58
3435,-1.41
3436,-1.21
3437,-0.98
3438,-0.76
3439,-0.53
3440,-0.31
3441,-0.11
3442,0.11
3443,0.34
3444,0.61
3445,0.89
3446,1.18
3447,1.45
3448,1.72
3449,1.99
3450,2.26
3451,2.52
3452,2.82
3453,3.14
3454,3.47
3455,3.78
3456,4.05
3457,4.24
3458,4.35
3459,4.33
3460,4.21
3461,3.99
3462,3.73
3463,3.46
3464,3.23
3465,3.07
3466,2.98
3467,2.95
3468,2.99
3469,3.07
3470,3.17
3471,3.23
3472,3.29
3473,3.33
3474,3.37
3475,3.44
3476,3.58
3477,3.77
3478,4.05
3479,4.37
3480,4.77
3481,5.20
3482,5.69
3483,6.20
3484,6.73
3485,7.25
3486,7.78
3487,8.27
3488,8.75
3489,9.17
3490,9.54
3491,9.80
3492,9.94
3493,9.99
3494,10.03
3495,10.08
3496,10.17
3497,10.28
3498,10.50
3499,10.77
3500,11.12
3501,11.47
3502,11.80
3503,12.06
3504,12.26
3505,12.38
3506,12.47
3507,12.55
3508,12.67
3509,12.85
3510,13.13
3511,13.48
3512,13.89
3513,14.26
3514,14.58
3515,14.79
3516,14.92
3517,14.92
3518,14.85
3519,14.71
3520,14.61
3521,14.57
3522,14.66
3523,14.82
3524,15.07
3525,15.36
3526,15.67
3527,15.95
3528,16.19
3529,16.40
3530,16.57
3531,16.73
3532,16.90
3533,17.09
3534,17.32
3535,17.56
3536,17.78
3537,17.93
3538,18.03
3539,18.07
3540,18.09
3541,18.08
3542,18.08
3543,18.09
3544,18.10
3545,18.14
3546,18.20
3547,18.25
3548,18.28
3549,18.30
3550,18.33
3551,18.36
3552,18.39
3553,18.46
3554,18.54
3555,18.67
3556,18.83
3557,19.00
3558,19.17
3559,19.30
3560,19.36
3561,19.31
3562,19.17
3563,18.96
3564,18.71
3565,18.47
3566,18.29
3567,18.19
3568,18.15
3569,18.16
3570,18.14
3571,18.09
3572,17.93
3573,17.68
3574,17.31
3575,16.92
3576,16.51
3577,16.15
3578,15.82
3579,15.56
3580,15.30
3581,15.05
3582,14.73
3583,14.37
3584,13.96
3585,13.57
3586,13.16
3587,12.79
3588,12.43
3589,12.12
3590,11.83
3591,11.56
3592,11.27
3593,10.99
3594,10.70
3595,10.45
3596,10.18
3597,9.92
3598,9.64
3599,9.37
3600,9.06
3601,8.74
3602,8.39
3603,8.08
3604,7.77
3605,7.50
3606,7.24
3607,7.00
3608,6.71
3609,6.37
3610,5.97
3611,5.55
3612,5.15
3613,4.81
3614,4.49
3615,4.26
3616,4.10
3617,4.04
3618,4.00
3619,3.95
3620,3.88
3621,3.81
3622,3.73
3623,3.69
3624,3.68
3625,3.70
3626,3.74
3627,3.80
3628,3.86
3629,3.91
3630,3.94
3631,3.92
3632,3.87
3633,3.81
3634,3.78
3635,3.76
3636,3.75
3637,3.73
3638,3.71
3639,3.68
3640,3.64
3641,3.59
3642,3.53
3643,3.51
3644,3.51
3645,3.54
3646,3.58
3647,3.61
3648,3.60
3649,3.57
3650,3.49
3651,3.40
3652,3.28
3653,3.15
3654,3.00
3655,2.84
3656,2.65
3657,2.46
3658,2.24
3659,2.01
3660,1.72
3661,1.42
3662,1.08
3663,0.73
3664,0.34
3665,-0.05
3666,-0.46
3667,-0.79
3668,-1.04
3669,-1.20
3670,-1.30
3671,-1.32
3672,-1.27
3673,-1.16
3674,-1.05
3675,-0.96
3676,-0.92
3677,-0.88
3678,-0.86
3679,-0.85
3680,-0.84
3681,-0.81
3682,-0.73
3683,-0.63
3684,-0.49
3685,-0.36
3686,-0.23
3687,-0.13
3688,-0.05
3689,-0.01
3690,0.04
3691,0.08
3692,0.18
3693,0.31
3694,0.49
3695,0.72
3696,0.98
3697,1.25
3698,1.53
3699,1.79
3700,2.04
3701,2.24
3702,2.41
3703,2.53
3704,2.62
3705,2.69
3706,2.74
3707,2.76
3708,2.78
3709,2.80
3710,2.82
3711,2.83
3712,2.85
3713,2.89
3714,2.96
3715,3.04
3716,3.10
3717,3.14
3718,3.14
3719,3.12
3720,3.09
3721,3.04
3722,2.98
3723,2.90
3724,2.85
3725,2.85
3726,2.89
3727,2.94
3728,3.01
3729,3.05
3730,3.11
3731,3.17
3732,3.26
3733,3.38
3734,3.57
3735,3.81
3736,4.14
3737,4.49
3738,4.90
3739,5.29
3740,5.68
3741,5.99
3742,6.24
3743,6.39
3744,6.43
3745,6.37
3746,6.26
3747,6.10
3748,5.94
3749,5.76
3750,5.63
3751,5.57
3752,5.59
3753,5.68
3754,5.81
3755,5.96
3756,6.10
3757,6.17
3758,6.16
3759,6.07
3760,5.93
3761,5.79
3762,5.67
3763,5.60
3764,5.59
3765,5.65
3766,5.75
3767,5.85
3768,5.93
3769,5.94
3770,5.89
3771,5.78
3772,5.64
3773,5.49
3774,5.36
3775,5.23
3776,5.14
3777,5.09
3778,5.08
3779,5.09
3780,5.10
3781,5.12
3782,5.13
3783,5.13
3784,5.12
3785,5.07
3786,4.99
3787,4.92
3788,4.88
3789,4.88
3790,4.90
3791,4.96
3792,5.06
3793,5.20
3794,5.39
3795,5.60
3796,5.84
3797,6.10
3798,6.33
3799,6.54
3800,6.70
3801,6.80
3802,6.81
3803,6.75
3804,6.63
3805,6.48
3806,6.34
3807,6.22
3808,6.13
3809,6.08
3810,6.03
3811,5.97
3812,5.88
3813,5.75
3814,5.59
3815,5.40
3816,5.22
3817,5.08
3818,5.04
3819,5.08
3820,5.21
3821,5.39
3822,5.59
3823,5.81
3824,6.03
3825,6.27
3826,6.55
3827,6.86
3828,7.18
3829,7.48
3830,7.75
3831,7.98
3832,8.15
3833,8.26
3834,8.31
3835,8.32
3836,8.32
3837,8.32
3838,8.35
3839,8.41
3840,8.49
3841,8.56
3842,8.59
3843,8.57
3844,8.51
3845,8.45
3846,8.38
3847,8.31
3848,8.27
3849,8.26
3850,8.28
3851,8.31
3852,8.35
3853,8.39
3854,8.44
3855,8.49
3856,8.54
3857,8.58
3858,8.55
3859,8.48
3860,8.32
3861,8.12
3862,7.86
3863,7.58
3864,7.33
3865,7.14
3866,7.00
3867,6.90
3868,6.84
3869,6.80
3870,6.71
3871,6.59
3872,6.44
3873,6.29
3874,6.12
3875,5.97
3876,5.84
3877,5.76
3878,5.73
3879,5.73
3880,5.74
3881,5.76
3882,5.74
3883,5.70
3884,5.62
3885,5.53
3886,5.46
3887,5.41
3888,5.39
3889,5.42
3890,5.52
3891,5.66
3892,5.80
3893,5.87
3894,5.89
3895,5.87
3896,5.80
3897,5.68
3898,5.54
3899,5.42
3900,5.39
3901,5.42
3902,5.54
3903,5.70
3904,5.90
3905,6.12
3906,6.36
3907,6.57
3908,6.78
3909,7.00
3910,7.23
3911,7.46
3912,7.72
3913,7.99
3914,8.27
3915,8.54
3916,8.80
3917,9.03
3918,9.25
3919,9.44
3920,9.60
3921,9.68
3922,9.70
3923,9.69
3924,9.65
3925,9.59
3926,9.51
3927,9.44
3928,9.38
3929,9.36
3930,9.38
3931,9.41
3932,9.42
3933,9.42
3934,9.42
3935,9.42
3936,9.41
3937,9.38
3938,9.32
3939,9.24
3940,9.12
3941,8.97
3942,8.77
3943,8.54
3944,8.30
3945,8.11
3946,7.97
3947,7.87
3948,7.80
3949,7.74
3950,7.62
3951,7.45
3952,7.18
3953,6.87
3954,6.52
3955,6.23
3956,6.00
3957,5.90
3958,5.87
3959,5.90
3960,5.93
3961,5.94
3962,5.92
3963,5.87
3964,5.78
3965,5.70
3966,5.63
3967,5.63
3968,5.70
3969,5.83
3970,5.94
3971,6.00
3972,5.99
3973,5.91
3974,5.74
3975,5.52
3976,5.24
3977,5.00
3978,4.80
3979,4.62
3980,4.46
3981,4.30
3982,4.15
3983,4.00
3984,3.85
3985,3.74
3986,3.67
3987,3.67
3988,3.72
3989,3.82
3990,3.95
3991,4.09
3992,4.19
3993,4.23
3994,4.20
3995,4.11
3996,3.94
3997,3.73
3998,3.50
3999,3.28
4000,3.11
4001,3.01
4002,2.96
4003,2.98
4004,3.04
4005,3.11
4006,3.14
4007,3.15
4008,3.11
4009,3.06
4010,2.98
4011,2.91
4012,2.82
4013,2.76
4014,2.74
4015,2.75
4016,2.77
4017,2.77
4018,2.75
4019,2.72
4020,2.67
4021,2.61
4022,2.55
4023,2.49
4024,2.47
4025,2.49
4026,2.54
4027,2.58
4028,2.62
4029,2.66
4030,2.72
4031,2.78
4032,2.85
4033,2.92
4034,3.01
4035,3.11
4036,3.20
4037,3.25
4038,3.29
4039,3.31
4040,3.33
4041,3.35
4042,3.37
4043,3.40
4044,3.44
4045,3.52
4046,3.64
4047,3.77
4048,3.91
4049,4.05
4050,4.17
4051,4.24
4052,4.25
4053,4.20
4054,4.13
4055,4.04
4056,3.94
4057,3.86
4058,3.81
4059,3.81
4060,3.81
4061,3.80
4062,3.77
4063,3.73
4064,3.68
4065,3.63
4066,3.59
4067,3.55
4068,3.53
4069,3.53
4070,3.52
4071,3.49
4072,3.45
4073,3.42
4074,3.43
4075,3.49
4076,3.59
4077,3.72
4078,3.90
4079,4.08
4080,4.23
4081,4.33
4082,4.39
4083,4.40
4084,4.39
4085,4.36
4086,4.36
4087,4.39
4088,4.46
4089,4.54
4090,4.60
4091,4.62
4092,4.56
4093,4.44
4094,4.28
4095,4.10
4096,3.95
4097,3.83
4098,3.75
4099,3.74
4100,3.79
4101,3.88
4102,4.01
4103,4.16
4104,4.33
4105,4.50
4106,4.70
4107,4.88
4108,5.07
4109,5.26
4110,5.46
4111,5.65
4112,5.84
4113,6.00
4114,6.13
4115,6.23
4116,6.35
4117,6.45
4118,6.52
4119,6.56
4120,6.58
4121,6.58
4122,6.57
4123,6.50
4124,6.38
4125,6.23
4126,6.06
4127,5.89
4128,5.73
4129,5.58
4130,5.44
4131,5.33
4132,5.25
4133,5.18
4134,5.10
4135,5.01
4136,4.91
4137,4.81
4138,4.70
4139,4.59
4140,4.52
4141,4.49
4142,4.55
4143,4.70
4144,4.91
4145,5.15
4146,5.39
4147,5.57
4148,5.68
4149,5.71
4150,5.66
4151,5.55
4152,5.41
4153,5.26
4154,5.16
4155,5.11
4156,5.11
4157,5.15
4158,5.18
4159,5.18
4160,5.13
4161,5.02
4162,4.87
4163,4.71
4164,4.55
4165,4.45
4166,4.41
4167,4.43
4168,4.50
4169,4.60
4170,4.71
4171,4.81
4172,4.88
4173,4.92
4174,4.94
4175,4.98
4176,5.03
4177,5.08
4178,5.13
4179,5.18
4180,5.21
4181,5.22
4182,5.21
4183,5.19
4184,5.17
4185,5.15
4186,5.14
4187,5.15
4188,5.15
4189,5.14
4190,5.09
4191,5.02
4192,4.95
4193,4.91
4194,4.87
4195,4.84
4196,4.83
4197,4.83
4198,4.80
4199,4.72
4200,4.57
4201,4.37
4202,4.16
4203,3.94
4204,3.74
4205,3.56
4206,3.43
4207,3.33
4208,3.26
4209,3.16
4210,3.04
4211,2.92
4212,2.84
4213,2.81
4214,2.84
4215,2.94
4216,3.11
4217,3.30
4218,3.49
4219,3.59
4220,3.65
4221,3.65
4222,3.68
4223,3.75
4224,3.86
4225,4.03
4226,4.26
4227,4.50
4228,4.72
4229,4.88
4230,4.98
4231,5.03
4232,5.04
4233,5.04
4234,5.06
4235,5.13
4236,5.24
4237,5.37
4238,5.49
4239,5.57
4240,5.62
4241,5.65
4242,5.68
4243,5.69
4244,5.72
4245,5.78
4246,5.86
4247,5.97
4248,6.04
4249,6.07
4250,6.08
4251,6.06
4252,6.03
4253,5.97
4254,5.91
4255,5.87
4256,5.87
4257,5.90
4258,5.94
4259,6.00
4260,6.04
4261,6.06
4262,6.03
4263,5.96
4264,5.84
4265,5.65
4266,5.42
4267,5.17
4268,4.93
4269,4.74
4270,4.62
4271,4.55
4272,4.52
4273,4.53
4274,4.57
4275,4.60
4276,4.62
4277,4.62
4278,4.64
4279,4.71
4280,4.87
4281,5.07
4282,5.34
4283,5.64
4284,5.94
4285,6.19
4286,6.35
4287,6.39
4288,6.34
4289,6.24
4290,6.13
4291,6.03
4292,5.97
4293,5.94
4294,5.97
4295,6.00
4296,6.02
4297,5.98
4298,5.90
4299,5.79
4300,5.67
4301,5.54
4302,5.39
4303,5.28
4304,5.20
4305,5.16
4306,5.13
4307,5.12
4308,5.13
4309,5.20
4310,5.29
4311,5.39
4312,5.46
4313,5.54
4314,5.62
4315,5.69
4316,5.74
4317,5.79
4318,5.85
4319,5.94
4320,6.03
4321,6.08
4322,6.09
4323,6.03
4324,5.92
4325,5.74
4326,5.55
4327,5.38
4328,5.29
4329,5.30
4330,5.41
4331,5.59
4332,5.83
4333,6.10
4334,6.34
4335,6.52
4336,6.58
4337,6.54
4338,6.41
4339,6.23
4340,6.00
4341,5.76
4342,5.52
4343,5.31
4344,5.17
4345,5.08
4346,5.07
4347,5.10
4348,5.16
4349,5.21
4350,5.26
4351,5.28
4352,5.27
4353,5.25
4354,5.21
4355,5.18
4356,5.15
4357,5.16
4358,5.18
4359,5.23
4360,5.26
4361,5.26
4362,5.19
4363,5.07
4364,4.90
4365,4.68
4366,4.40
4367,4.12
4368,3.84
4369,3.62
4370,3.43
4371,3.30
4372,3.20
4373,3.14
4374,3.08
4375,3.03
4376,2.92
4377,2.78
4378,2.56
4379,2.31
4380,2.03
4381,1.76
4382,1.51
4383,1.30
4384,1.10
4385,0.94
4386,0.80
4387,0.71
4388,0.63
4389,0.55
4390,0.46
4391,0.37
4392,0.26
4393,0.15
4394,0.03
4395,-0.09
4396,-0.22
4397,-0.34
4398,-0.47
4399,-0.60
4400,-0.73
4401,-0.86
4402,-0.98
4403,-1.08
4404,-1.18
4405,-1.27
4406,-1.39
4407,-1.50
4408,-1.60
4409,-1.70
4410,-1.81
4411,-1.91
4412,-2.06
4413,-2.22
4414,-2.40
4415,-2.59
4416,-2.79
4417,-2.99
4418,-3.17
4419,-3.28
4420,-3.33
4421,-3.33
4422,-3.32
4423,-3.32
4424,-3.36
4425,-3.45
4426,-3.59
4427,-3.78
4428,-4.01
4429,-4.23
4430,-4.43
4431,-4.58
4432,-4.69
4433,-4.77
4434,-4.82
4435,-4.85
4436,-4.91
4437,-4.97
4438,-5.07
4439,-5.17
4440,-5.25
4441,-5.33
4442,-5.39
4443,-5.43
4444,-5.41
4445,-5.33
4446,-5.21
4447,-5.06
4448,-4.88
4449,-4.68
4450,-4.47
4451,-4.30
4452,-4.16
4453,-4.04
4454,-3.93
4455,-3.85
4456,-3.77
4457,-3.72
4458,-3.65
4459,-3.59
4460,-3.52
4461,-3.48
4462,-3.41
4463,-3.33
4464,-3.22
4465,-3.07
4466,-2.87
4467,-2.62
4468,-2.33
4469,-2.03
4470,-1.72
4471,-1.45
4472,-1.20
4473,-0.99
4474,-0.79
4475,-0.63
4476,-0.45
4477,-0.28
4478,-0.03
4479,0.27
4480,0.65
4481,1.05
4482,1.52
4483,2.00
4484,2.53
4485,3.02
4486,3.51
4487,3.93
4488,4.36
4489,4.75
4490,5.17
4491,5.60
4492,6.11
4493,6.65
4494,7.24
4495,7.81
4496,8.38
4497,8.85
4498,9.29
4499,9.62
4500,9.90
4501,10.11
4502,10.33
4503,10.55
4504,10.86
4505,11.22
4506,11.67
4507,12.12
4508,12.60
4509,13.03
4510,13.41
4511,13.72
4512,13.95
4513,14.11
4514,14.24
4515,14.33
4516,14.43
4517,14.52
4518,14.60
4519,14.64
4520,14.63
4521,14.56
4522,14.39
4523,14.17
4524,13.87
4525,13.53
4526,13.13
4527,12.73
4528,12.32
4529,11.94
4530,11.53
4531,11.14
4532,10.73
4533,10.35
4534,9.92
4535,9.45
4536,8.93
4537,8.45
4538,7.99
4539,7.62
4540,7.32
4541,7.14
4542,7.06
4543,7.08
4544,7.17
4545,7.30
4546,7.42
4547,7.53
4548,7.60
4549,7.64
4550,7.64
4551,7.59
4552,7.51
4553,7.40
4554,7.28
4555,7.15
4556,7.02
4557,6.89
4558,6.74
4559,6.55
4560,6.37
4561,6.22
4562,6.10
4563,6.00
4564,5.93
4565,5.87
4566,5.83
4567,5.79
4568,5.76
4569,5.75
4570,5.77
4571,5.81
4572,5.88
4573,5.96
4574,6.06
4575,6.16
4576,6.25
4577,6.32
4578,6.40
4579,6.47
4580,6.55
4581,6.64
4582,6.73
4583,6.84
4584,6.96
4585,7.06
4586,7.13
4587,7.13
4588,7.08
4589,7.00
4590,6.90
4591,6.81
4592,6.73
4593,6.71
4594,6.77
4595,6.90
4596,7.11
4597,7.34
4598,7.58
4599,7.77
4600,7.90
4601,7.96
4602,8.00
4603,8.01
4604,8.09
4605,8.22
4606,8.45
4607,8.75
4608,9.10
4609,9.45
4610,9.76
4611,10.00
4612,10.16
4613,10.22
4614,10.25
4615,10.28
4616,10.37
4617,10.51
4618,10.68
4619,10.87
4620,11.06
4621,11.20
4622,11.25
4623,11.21
4624,11.08
4625,10.91
4626,10.75
4627,10.64
4628,10.58
4629,10.57
4630,10.57
4631,10.57
4632,10.52
4633,10.41
4634,10.22
4635,9.96
4636,9.66
4637,9.37
4638,9.09
4639,8.84
4640,8.62
4641,8.45
4642,8.31
4643,8.22
4644,8.16
4645,8.11
4646,8.05
4647,7.97
4648,7.82
4649,7.65
4650,7.47
4651,7.31
4652,7.17
4653,7.08
4654,7.04
4655,7.05
4656,7.09
4657,7.12
4658,7.11
4659,7.06
4660,6.99
4661,6.90
4662,6.81
4663,6.71
4664,6.61
4665,6.55
4666,6.52
4667,6.49
4668,6.44
4669,6.36
4670,6.27
4671,6.19
4672,6.12
4673,6.07
4674,6.03
4675,6.04
4676,6.05
4677,6.04
4678,5.96
4679,5.81
4680,5.59
4681,5.37
4682,5.17
4683,5.05
4684,5.00
4685,5.03
4686,5.09
4687,5.18
4688,5.25
4689,5.27
4690,5.20
4691,5.06
4692,4.88
4693,4.73
4694,4.63
4695,4.60
4696,4.61
4697,4.66
4698,4.69
4699,4.68
4700,4.56
4701,4.33
4702,3.96
4703,3.53
4704,3.07
4705,2.63
4706,2.23
4707,1.88
4708,1.57
4709,1.31
4710,1.06
4711,0.84
4712,0.62
4713,0.43
4714,0.21
4715,-0.01
4716,-0.27
4717,-0.53
4718,-0.83
4719,-1.14
4720,-1.53
4721,-1.94
4722,-2.37
4723,-2.78
4724,-3.17
4725,-3.51
4726,-3.82
4727,-4.08
4728,-4.33
4729,-4.56
4730,-4.83
4731,-5.10
4732,-5.37
4733,-5.62
4734,-5.84
4735,-5.99
4736,-6.08
4737,-6.09
4738,-6.07
4739,-6.00
4740,-5.94
4741,-5.88
4742,-5.84
4743,-5.83
4744,-5.87
4745,-5.95
4746,-6.07
4747,-6.20
4748,-6.32
4749,-6.44
4750,-6.55
4751,-6.63
4752,-6.67
4753,-6.68
4754,-6.68
4755,-6.69
4756,-6.73
4757,-6.78
4758,-6.86
4759,-6.96
4760,-7.09
4761,-7.20
4762,-7.27
4763,-7.30
4764,-7.27
4765,-7.19
4766,-7.06
4767,-6.88
4768,-6.68
4769,-6.52
4770,-6.37
4771,-6.27
4772,-6.19
4773,-6.13
4774,-6.06
4775,-5.97
4776,-5.84
4777,-5.66
4778,-5.42
4779,-5.18
4780,-4.92
4781,-4.70
4782,-4.49
4783,-4.31
4784,-4.13
4785,-3.97
4786,-3.81
4787,-3.66
4788,-3.46
4789,-3.26
4790,-3.05
4791,-2.91
4792,-2.81
4793,-2.77
4794,-2.75
4795,-2.75
4796,-2.75
4797,-2.78
4798,-2.78
4799,-2.75
4800,-2.69
4801,-2.61
4802,-2.50
4803,-2.37
4804,-2.20
4805,-2.02
4806,-1.83
4807,-1.65
4808,-1.46
4809,-1.27
4810,-1.08
4811,-0.94
4812,-0.84
4813,-0.80
4814,-0.82
4815,-0.87
4816,-0.95
4817,-1.07
4818,-1.21
4819,-1.34
4820,-1.42
4821,-1.44
4822,-1.40
4823,-1.32
4824,-1.17
4825,-0.98
4826,-0.74
4827,-0.49
4828,-0.23
4829,0.02
4830,0.28
4831,0.53
4832,0.77
4833,0.98
4834,1.19
4835,1.38
4836,1.58
4837,1.76
4838,1.96
4839,2.14
4840,2.33
4841,2.52
4842,2.73
4843,2.91
4844,3.10
4845,3.27
4846,3.48
4847,3.74
4848,4.05
4849,4.37
4850,4.69
4851,4.97
4852,5.19
4853,5.31
4854,5.36
4855,5.33
4856,5.26
4857,5.17
4858,5.12
4859,5.13
4860,5.26
4861,5.44
4862,5.66
4863,5.87
4864,6.09
4865,6.27
4866,6.45
4867,6.58
4868,6.73
4869,6.87
4870,7.06
4871,7.25
4872,7.49
4873,7.75
4874,8.05
4875,8.37
4876,8.74
4877,9.13
4878,9.55
4879,9.96
4880,10.38
4881,10.77
4882,11.15
4883,11.44
4884,11.70
4885,11.89
4886,12.08
4887,12.26
4888,12.49
4889,12.73
4890,13.00
4891,13.29
4892,13.60
4893,13.92
4894,14.22
4895,14.49
4896,14.72
4897,14.92
4898,15.06
4899,15.14
4900,15.17
4901,15.14
4902,15.10
4903,15.04
4904,14.99
4905,14.95
4906,14.96
4907,15.00
4908,15.05
4909,15.10
4910,15.13
4911,15.14
4912,15.14
4913,15.13
4914,15.14
4915,15.19
4916,15.31
4917,15.48
4918,15.69
4919,15.88
4920,16.01
4921,16.07
4922,16.04
4923,15.94
4924,15.82
4925,15.72
4926,15.66
4927,15.67
4928,15.73
4929,15.82
4930,15.89
4931,15.91
4932,15.82
4933,15.66
4934,15.44
4935,15.21
4936,14.99
4937,14.82
4938,14.68
4939,14.59
4940,14.49
4941,14.37
4942,14.20
4943,13.98
4944,13.73
4945,13.49
4946,13.28
4947,13.14
4948,13.03
4949,12.95
4950,12.88
4951,12.80
4952,12.66
4953,12.48
4954,12.22
4955,11.94
4956,11.63
4957,11.34
4958,11.02
4959,10.72
4960,10.41
4961,10.12
4962,9.80
4963,9.47
4964,9.12
4965,8.81
4966,8.50
4967,8.21
4968,7.95
4969,7.76
4970,7.61
4971,7.53
4972,7.48
4973,7.48
4974,7.48
4975,7.47
4976,7.42
4977,7.36
4978,7.29
4979,7.22
4980,7.12
4981,7.03
4982,6.97
4983,6.96
4984,6.97
4985,7.00
4986,7.04
4987,7.10
4988,7.13
4989,7.11
4990,7.02
4991,6.87
4992,6.68
4993,6.47
4994,6.23
4995,6.03
4996,5.87
4997,5.78
4998,5.73
4999,5.70
5000,5.69
5001,5.69
5002,5.67
5003,5.62
5004,5.55
5005,5.46
5006,5.36
5007,5.28
5008,5.20
5009,5.14
5010,5.07
5011,4.97
5012,4.80
5013,4.56
5014,4.26
5015,3.96
5016,3.65
5017,3.37
5018,3.13
5019,2.94
5020,2.78
5021,2.66
5022,2.56
5023,2.46
5024,2.36
5025,2.25
5026,2.11
5027,1.98
5028,1.84
5029,1.70
5030,1.55
5031,1.43
5032,1.33
5033,1.26
5034,1.21
5035,1.18
5036,1.18
5037,1.21
5038,1.24
5039,1.27
5040,1.30
5041,1.31
5042,1.34
5043,1.37
5044,1.42
5045,1.47
5046,1.53
5047,1.58
5048,1.59
5049,1.58
5050,1.54
5051,1.46
5052,1.33
5053,1.17
5054,1.02
5055,0.94
5056,0.92
5057,0.94
5058,0.99
5059,1.08
5060,1.17
5061,1.27
5062,1.35
5063,1.40
5064,1.40
5065,1.41
5066,1.43
5067,1.49
5068,1.55
5069,1.59
5070,1.64
5071,1.66
5072,1.66
5073,1.59
5074,1.48
5075,1.34
5076,1.17
5077,1.01
5078,0.89
5079,0.81
5080,0.78
5081,0.78
5082,0.83
5083,0.93
5084,1.09
5085,1.30
5086,1.54
5087,1.81
5088,2.09
5089,2.34
5090,2.55
5091,2.70
5092,2.82
5093,2.89
5094,2.96
5095,3.01
5096,3.09
5097,3.17
5098,3.26
5099,3.33
5100,3.38
5101,3.40
5102,3.39
5103,3.36
5104,3.33
5105,3.32
5106,3.34
5107,3.40
5108,3.47
5109,3.56
5110,3.64
5111,3.69
5112,3.71
5113,3.68
5114,3.62
5115,3.50
5116,3.31
5117,3.08
5118,2.82
5119,2.56
5120,2.28
5121,2.03
5122,1.79
5123,1.63
5124,1.50
5125,1.42
5126,1.33
5127,1.25
5128,1.19
5129,1.14
5130,1.07
5131,0.99
5132,0.93
5133,0.89
5134,0.89
5135,0.90
5136,0.96
5137,1.05
5138,1.18
5139,1.33
5140,1.49
5141,1.63
5142,1.75
5143,1.84
5144,1.92
5145,1.99
5146,2.06
5147,2.13
5148,2.20
5149,2.28
5150,2.39
5151,2.50
5152,2.64
5153,2.79
5154,2.96
5155,3.11
5156,3.23
5157,3.31
5158,3.33
5159,3.27
5160,3.18
5161,3.04
5162,2.91
5163,2.78
5164,2.72
5165,2.74
5166,2.84
5167,3.00
5168,3.20
5169,3.40
5170,3.59
5171,3.74
5172,3.91
5173,4.08
5174,4.33
5175,4.62
5176,4.99
5177,5.40
5178,5.87
5179,6.30
5180,6.70
5181,7.00
5182,7.25
5183,7.41
5184,7.52
5185,7.59
5186,7.67
5187,7.75
5188,7.85
5189,7.95
5190,8.07
5191,8.20
5192,8.36
5193,8.51
5194,8.64
5195,8.73
5196,8.80
5197,8.86
5198,8.89
5199,8.89
5200,8.87
5201,8.83
5202,8.86
5203,8.94
5204,9.09
5205,9.28
5206,9.48
5207,9.65
5208,9.80
5209,9.87
5210,9.88
5211,9.83
5212,9.78
5213,9.75
5214,9.75
5215,9.79
5216,9.86
5217,9.95
5218,10.04
5219,10.12
5220,10.17
5221,10.21
5222,10.22
5223,10.20
5224,10.14
5225,10.05
5226,9.90
5227,9.74
5228,9.55
5229,9.41
5230,9.32
5231,9.29
5232,9.30
5233,9.33
5234,9.36
5235,9.37
5236,9.31
5237,9.18
5238,8.96
5239,8.71
5240,8.40
5241,8.09
5242,7.79
5243,7.51
5244,7.23
5245,6.96
5246,6.70
5247,6.46
5248,6.25
5249,6.10
5250,6.01
5251,6.01
5252,6.05
5253,6.11
5254,6.16
5255,6.19
5256,6.15
5257,6.05
5258,5.89
5259,5.71
5260,5.55
5261,5.46
5262,5.43
5263,5.47
5264,5.55
5265,5.65
5266,5.73
5267,5.78
5268,5.78
5269,5.73
5270,5.65
5271,5.54
5272,5.44
5273,5.36
5274,5.32
5275,5.33
5276,5.39
5277,5.48
5278,5.59
5279,5.71
5280,5.82
5281,5.89
5282,5.91
5283,5.87
5284,5.82
5285,5.76
5286,5.70
5287,5.68
5288,5.73
5289,5.86
5290,6.02
5291,6.18
5292,6.30
5293,6.37
5294,6.36
5295,6.26
5296,6.07
5297,5.84
5298,5.58
5299,5.36
5300,5.19
5301,5.06
5302,4.96
5303,4.88
5304,4.78
5305,4.67
5306,4.49
5307,4.30
5308,4.07
5309,3.85
5310,3.64
5311,3.47
5312,3.36
5313,3.32
5314,3.33
5315,3.37
5316,3.40
5317,3.45
5318,3.49
5319,3.54
5320,3.58
5321,3.60
5322,3.63
5323,3.69
5324,3.78
5325,3.87
5326,3.97
5327,4.09
5328,4.20
5329,4.30
5330,4.39
5331,4.46
5332,4.53
5333,4.58
5334,4.61
5335,4.62
5336,4.63
5337,4.65
5338,4.69
5339,4.74
5340,4.81
5341,4.88
5342,4.96
5343,5.04
5344,5.11
5345,5.22
5346,5.36
5347,5.49
5348,5.62
5349,5.74
5350,5.84
5351,5.89
5352,5.90
5353,5.87
5354,5.81
5355,5.75
5356,5.70
5357,5.65
5358,5.62
5359,5.61
5360,5.58
5361,5.54
5362,5.46
5363,5.34
5364,5.19
5365,5.06
5366,4.97
5367,4.94
5368,4.95
5369,5.01
5370,5.12
5371,5.25
5372,5.33
5373,5.36
5374,5.34
5375,5.31
5376,5.29
5377,5.29
5378,5.29
5379,5.33
5380,5.40
5381,5.48
5382,5.56
5383,5.62
5384,5.65
5385,5.67
5386,5.66
5387,5.65
5388,5.61
5389,5.58
5390,5.55
5391,5.52
5392,5.45
5393,5.33
5394,5.17
5395,4.98
5396,4.79
5397,4.62
5398,4.47
5399,4.37
5400,4.30
5401,4.25
5402,4.19
5403,4.09
5404,3.95
5405,3.78
5406,3.56
5407,3.33
5408,3.11
5409,2.96
5410,2.88
5411,2.86
5412,2.84
5413,2.80
5414,2.70
5415,2.55
5416,2.33
5417,2.06
5418,1.77
5419,1.51
5420,1.27
5421,1.09
5422,0.96
5423,0.91
5424,0.90
5425,0.93
5426,0.98
5427,1.05
5428,1.09
5429,1.11
5430,1.13
5431,1.13
5432,1.12
5433,1.11
5434,1.10
5435,1.11
5436,1.15
5437,1.23
5438,1.33
5439,1.43
5440,1.54
5441,1.66
5442,1.77
5443,1.89
5444,2.01
5445,2.12
5446,2.25
5447,2.37
5448,2.49
5449,2.59
5450,2.69
5451,2.77
5452,2.85
5453,2.93
5454,3.01
5455,3.09
5456,3.20
5457,3.32
5458,3.48
5459,3.64
5460,3.81
5461,3.99
5462,4.18
5463,4.39
5464,4.61
5465,4.82
5466,5.05
5467,5.29
5468,5.54
5469,5.77
5470,5.97
5471,6.13
5472,6.24
5473,6.29
5474,6.30
5475,6.26
5476,6.18
5477,6.11
5478,6.08
5479,6.10
5480,6.16
5481,6.22
5482,6.28
5483,6.32
5484,6.32
5485,6.26
5486,6.10
5487,5.87
5488,5.65
5489,5.43
5490,5.26
5491,5.13
5492,5.06
5493,5.04
5494,5.04
5495,5.07
5496,5.07
5497,5.07
5498,5.04
5499,5.01
5500,4.98
5501,4.94
5502,4.88
5503,4.82
5504,4.77
5505,4.71
5506,4.69
5507,4.69
5508,4.73
5509,4.82
5510,4.97
5511,5.19
5512,5.42
5513,5.65
5514,5.85
5515,6.01
5516,6.13
5517,6.20
5518,6.21
5519,6.18
5520,6.14
5521,6.09
5522,6.03
5523,5.96
5524,5.88
5525,5.81
5526,5.73
5527,5.62
5528,5.49
5529,5.33
5530,5.16
5531,4.96
5532,4.73
5533,4.49
5534,4.26
5535,4.08
5536,3.92
5537,3.81
5538,3.70
5539,3.63
5540,3.55
5541,3.46
5542,3.32
5543,3.17
5544,3.00
5545,2.85
5546,2.72
5547,2.62
5548,2.54
5549,2.48
5550,2.42
5551,2.37
5552,2.30
5553,2.24
5554,2.17
5555,2.12
5556,2.11
5557,2.13
5558,2.14
5559,2.13
5560,2.13
5561,2.11
5562,2.09
5563,2.04
5564,2.01
5565,2.01
5566,2.05
5567,2.13
5568,2.24
5569,2.37
5570,2.54
5571,2.72
5572,2.93
5573,3.16
5574,3.43
5575,3.70
5576,3.97
5577,4.23
5578,4.46
5579,4.61
5580,4.66
5581,4.62
5582,4.51
5583,4.35
5584,4.15
5585,3.94
5586,3.74
5587,3.57
5588,3.46
5589,3.40
5590,3.37
5591,3.38
5592,3.39
5593,3.39
5594,3.36
5595,3.32
5596,3.23
5597,3.11
5598,2.95
5599,2.81
5600,2.69
5601,2.62
5602,2.59
5603,2.62
5604,2.70
5605,2.82
5606,2.95
5607,3.06
5608,3.10
5609,3.07
5610,2.98
5611,2.84
5612,2.69
5613,2.53
5614,2.41
5615,2.33
5616,2.29
5617,2.29
5618,2.33
5619,2.39
5620,2.43
5621,2.44
5622,2.43
5623,2.44
5624,2.46
5625,2.51
5626,2.59
5627,2.69
5628,2.83
5629,2.99
5630,3.17
5631,3.31
5632,3.42
5633,3.49
5634,3.55
5635,3.59
5636,3.62
5637,3.65
5638,3.68
5639,3.74
5640,3.81
5641,3.88
5642,3.92
5643,3.93
5644,3.88
5645,3.79
5646,3.67
5647,3.55
5648,3.43
5649,3.33
5650,3.24
5651,3.17
5652,3.11
5653,3.05
5654,2.99
5655,2.93
5656,2.89
5657,2.88
5658,2.91
5659,2.95
5660,2.99
5661,3.00
5662,3.00
5663,2.99
5664,2.96
5665,2.90
5666,2.83
5667,2.78
5668,2.76
5669,2.78
5670,2.82
5671,2.88
5672,2.94
5673,2.99
5674,3.01
5675,2.99
5676,2.93
5677,2.86
5678,2.81
5679,2.78
5680,2.79
5681,2.86
5682,3.00
5683,3.17
5684,3.40
5685,3.62
5686,3.85
5687,4.08
5688,4.35
5689,4.64
5690,4.95
5691,5.27
5692,5.62
5693,6.00
5694,6.36
5695,6.67
5696,6.90
5697,7.06
5698,7.17
5699,7.23
5700,7.28
5701,7.30
5702,7.32
5703,7.29
5704,7.26
5705,7.18
5706,7.06
5707,6.91
5708,6.74
5709,6.56
5710,6.39
5711,6.29
5712,6.26
5713,6.29
5714,6.36
5715,6.45
5716,6.52
5717,6.54
5718,6.50
5719,6.42
5720,6.34
5721,6.28
5722,6.26
5723,6.29
5724,6.40
5725,6.58
5726,6.82
5727,7.08
5728,7.38
5729,7.70
5730,8.03
5731,8.33
5732,8.64
5733,8.93
5734,9.22
5735,9.50
5736,9.79
5737,10.05
5738,10.30
5739,10.54
5740,10.77
5741,10.98
5742,11.17
5743,11.32
5744,11.44
5745,11.52
5746,11.57
5747,11.60
5748,11.62
5749,11.62
5750,11.61
5751,11.57
5752,11.51
5753,11.41
5754,11.25
5755,11.07
5756,10.84
5757,10.60
5758,10.36
5759,10.12
5760,9.91
5761,9.73
5762,9.55
5763,9.38
5764,9.16
5765,8.96
5766,8.75
5767,8.58
5768,8.43
5769,8.32
5770,8.22
5771,8.16
5772,8.09
5773,8.00
5774,7.84
5775,7.62
5776,7.35
5777,7.06
5778,6.77
5779,6.51
5780,6.28
5781,6.10
5782,5.97
5783,5.90
5784,5.82
5785,5.74
5786,5.62
5787,5.49
5788,5.33
5789,5.17
5790,4.97
5791,4.78
5792,4.54
5793,4.29
5794,4.03
5795,3.79
5796,3.56
5797,3.37
5798,3.21
5799,3.11
5800,3.07
5801,3.07
5802,3.10
5803,3.13
5804,3.16
5805,3.18
5806,3.20
5807,3.20
5808,3.19
5809,3.18
5810,3.18
5811,3.20
5812,3.23
5813,3.28
5814,3.32
5815,3.33
5816,3.30
5817,3.24
5818,3.20
5819,3.15
5820,3.11
5821,3.09
5822,3.13
5823,3.23
5824,3.36
5825,3.53
5826,3.71
5827,3.85
5828,3.92
5829,3.92
5830,3.89
5831,3.85
5832,3.83
5833,3.82
5834,3.85
5835,3.94
5836,4.10
5837,4.28
5838,4.45
5839,4.58
5840,4.65
5841,4.70
5842,4.72
5843,4.71
5844,4.68
5845,4.65
5846,4.65
5847,4.68
5848,4.74
5849,4.81
5850,4.88
5851,4.95
5852,5.00
5853,5.04
5854,5.08
5855,5.13
5856,5.21
5857,5.30
5858,5.44
5859,5.62
5860,5.82
5861,6.03
5862,6.23
5863,6.39
5864,6.49
5865,6.54
5866,6.52
5867,6.47
5868,6.39
5869,6.29
5870,6.20
5871,6.09
5872,5.97
5873,5.84
5874,5.71
5875,5.55
5876,5.40
5877,5.26
5878,5.15
5879,5.08
5880,5.02
5881,4.97
5882,4.93
5883,4.91
5884,4.88
5885,4.88
5886,4.91
5887,4.96
5888,5.04
5889,5.13
5890,5.20
5891,5.23
5892,5.20
5893,5.10
5894,4.93
5895,4.72
5896,4.51
5897,4.33
5898,4.23
5899,4.21
5900,4.26
5901,4.35
5902,4.45
5903,4.52
5904,4.55
5905,4.51
5906,4.43
5907,4.36
5908,4.32
5909,4.33
5910,4.38
5911,4.47
5912,4.59
5913,4.74
5914,4.90
5915,5.04
5916,5.11
5917,5.13
5918,5.12
5919,5.12
5920,5.15
5921,5.19
5922,5.25
5923,5.33
5924,5.40
5925,5.46
5926,5.46
5927,5.40
5928,5.29
5929,5.17
5930,5.02
5931,4.88
5932,4.77
5933,4.71
5934,4.67
5935,4.63
5936,4.55
5937,4.43
5938,4.26
5939,4.07
5940,3.85
5941,3.66
5942,3.54
5943,3.52
5944,3.56
5945,3.65
5946,3.73
5947,3.76
5948,3.70
5949,3.54
5950,3.30
5951,3.03
5952,2.78
5953,2.59
5954,2.49
5955,2.47
5956,2.53
5957,2.62
5958,2.67
5959,2.66
5960,2.56
5961,2.37
5962,2.14
5963,1.91
5964,1.72
5965,1.59
5966,1.56
5967,1.63
5968,1.76
5969,1.93
5970,2.09
5971,2.24
5972,2.33
5973,2.40
5974,2.42
5975,2.45
5976,2.48
5977,2.52
5978,2.55
5979,2.56
5980,2.54
5981,2.49
5982,2.40
5983,2.27
5984,2.09
5985,1.91
5986,1.73
5987,1.62
5988,1.55
5989,1.53
5990,1.50
5991,1.48
5992,1.43
5993,1.36
5994,1.24
5995,1.10
5996,0.95
5997,0.82
5998,0.72
5999,0.66
6000,0.61
6001,0.56
6002,0.49
6003,0.36
6004,0.18
6005,-0.01
6006,-0.18
6007,-0.30
6008,-0.37
6009,-0.39
6010,-0.39
6011,-0.36
6012,-0.33
6013,-0.34
6014,-0.41
6015,-0.55
6016,-0.72
6017,-0.89
6018,-1.01
6019,-1.11
6020,-1.12
6021,-1.07
6022,-0.95
6023,-0.81
6024,-0.64
6025,-0.48
6026,-0.31
6027,-0.17
6028,-0.02
6029,0.12
6030,0.29
6031,0.47
6032,0.66
6033,0.83
6034,1.01
6035,1.15
6036,1.29
6037,1.40
6038,1.52
6039,1.66
6040,1.83
6041,2.04
6042,2.29
6043,2.53
6044,2.78
6045,2.99
6046,3.17
6047,3.28
6048,3.35
6049,3.39
6050,3.45
6051,3.54
6052,3.69
6053,3.89
6054,4.15
6055,4.43
6056,4.70
6057,4.91
6058,5.07
6059,5.15
6060,5.20
6061,5.20
6062,5.19
6063,5.18
6064,5.22
6065,5.29
6066,5.41
6067,5.55
6068,5.71
6069,5.86
6070,6.00
6071,6.14
6072,6.27
6073,6.38
6074,6.46
6075,6.50
6076,6.52
6077,6.52
6078,6.51
6079,6.48
6080,6.45
6081,6.39
6082,6.36
6083,6.36
6084,6.45
6085,6.61
6086,6.82
6087,7.08
6088,7.40
6089,7.75
6090,8.12
6091,8.46
6092,8.80
6093,9.09
6094,9.40
6095,9.68
6096,9.99
6097,10.31
6098,10.63
6099,10.89
6100,11.12
6101,11.28
6102,11.43
6103,11.53
6104,11.60
6105,11.62
6106,11.63
6107,11.66
6108,11.69
6109,11.70
6110,11.67
6111,11.60
6112,11.48
6113,11.33
6114,11.11
6115,10.83
6116,10.49
6117,10.10
6118,9.66
6119,9.21
6120,8.71
6121,8.25
6122,7.80
6123,7.43
6124,7.14
6125,6.97
6126,6.87
6127,6.84
6128,6.80
6129,6.75
6130,6.67
6131,6.58
6132,6.43
6133,6.26
6134,6.05
6135,5.84
6136,5.64
6137,5.44
6138,5.23
6139,5.00
6140,4.75
6141,4.51
6142,4.29
6143,4.10
6144,3.94
6145,3.84
6146,3.77
6147,3.76
6148,3.75
6149,3.76
6150,3.72
6151,3.67
6152,3.54
6153,3.37
6154,3.13
6155,2.85
6156,2.52
6157,2.16
6158,1.78
6159,1.42
6160,1.08
6161,0.82
6162,0.60
6163,0.47
6164,0.40
6165,0.40
6166,0.47
6167,0.60
6168,0.76
6169,0.95
6170,1.11
6171,1.24
6172,1.32
6173,1.36
6174,1.36
6175,1.32
6176,1.24
6177,1.14
6178,1.05
6179,0.99
6180,0.96
6181,0.95
6182,0.93
6183,0.87
6184,0.77
6185,0.62
6186,0.43
6187,0.24
6188,0.06
6189,-0.07
6190,-0.13
6191,-0.11
6192,-0.02
6193,0.11
6194,0.27
6195,0.44
6196,0.60
6197,0.73
6198,0.80
6199,0.81
6200,0.79
6201,0.73
6202,0.66
6203,0.58
6204,0.49
6205,0.42
6206,0.40
6207,0.43
6208,0.56
6209,0.74
6210,0.96
6211,1.21
6212,1.46
6213,1.66
6214,1.74
6215,1.69
6216,1.52
6217,1.27
6218,1.00
6219,0.76
6220,0.62
6221,0.61
6222,0.75
6223,0.96
6224,1.20
6225,1.38
6226,1.48
6227,1.46
6228,1.36
6229,1.18
6230,0.99
6231,0.85
6232,0.80
6233,0.84
6234,0.95
6235,1.12
6236,1.34
6237,1.56
6238,1.79
6239,1.98
6240,2.13
6241,2.26
6242,2.34
6243,2.37
6244,2.33
6245,2.20
6246,1.99
6247,1.73
6248,1.45
6249,1.19
6250,0.98
6251,0.84
6252,0.76
6253,0.73
6254,0.72
6255,0.74
6256,0.77
6257,0.81
6258,0.85
6259,0.89
6260,0.95
6261,1.05
6262,1.16
6263,1.28
6264,1.40
6265,1.46
6266,1.49
6267,1.48
6268,1.45
6269,1.43
6270,1.42
6271,1.44
6272,1.50
6273,1.56
6274,1.62
6275,1.63
6276,1.62
6277,1.59
6278,1.55
6279,1.52
6280,1.51
6281,1.55
6282,1.66
6283,1.82
6284,2.04
6285,2.27
6286,2.51
6287,2.75
6288,2.99
6289,3.19
6290,3.36
6291,3.47
6292,3.55
6293,3.57
6294,3.58
6295,3.56
6296,3.52
6297,3.49
6298,3.46
6299,3.43
6300,3.41
6301,3.40
6302,3.39
6303,3.37
6304,3.37
6305,3.39
6306,3.40
6307,3.40
6308,3.38
6309,3.36
6310,3.33
6311,3.30
6312,3.25
6313,3.20
6314,3.15
6315,3.13
6316,3.12
6317,3.14
6318,3.14
6319,3.17
6320,3.19
6321,3.23
6322,3.27
6323,3.33
6324,3.43
6325,3.54
6326,3.68
6327,3.81
6328,3.94
6329,4.01
6330,4.03
6331,3.97
6332,3.84
6333,3.64
6334,3.41
6335,3.20
6336,3.06
6337,2.97
6338,2.92
6339,2.93
6340,2.96
6341,2.98
6342,2.95
6343,2.88
6344,2.78
6345,2.69
6346,2.62
6347,2.63
6348,2.69
6349,2.79
6350,2.91
6351,2.99
6352,3.02
6353,2.99
6354,2.91
6355,2.82
6356,2.75
6357,2.71
6358,2.72
6359,2.77
6360,2.83
6361,2.88
6362,2.88
6363,2.79
6364,2.63
6365,2.42
6366,2.18
6367,1.96
6368,1.75
6369,1.56
6370,1.37
6371,1.17
6372,0.95
6373,0.71
6374,0.44
6375,0.19
6376,-0.04
6377,-0.24
6378,-0.41
6379,-0.56
6380,-0.70
6381,-0.83
6382,-0.98
6383,-1.17
6384,-1.40
6385,-1.63
6386,-1.82
6387,-1.95
6388,-2.01
6389,-1.99
6390,-1.90
6391,-1.75
6392,-1.58
6393,-1.42
6394,-1.30
6395,-1.21
6396,-1.17
6397,-1.14
6398,-1.11
6399,-1.06
6400,-0.95
6401,-0.81
6402,-0.62
6403,-0.42
6404,-0.21
6405,-0.04
6406,0.10
6407,0.17
6408,0.19
6409,0.18
6410,0.17
6411,0.18
6412,0.23
6413,0.32
6414,0.49
6415,0.71
6416,0.94
6417,1.11
6418,1.21
6419,1.22
6420,1.15
6421,1.01
6422,0.82
6423,0.62
6424,0.44
6425,0.31
6426,0.18
6427,0.07
6428,-0.07
6429,-0.21
6430,-0.36
6431,-0.53
6432,-0.72
6433,-0.91
6434,-1.08
6435,-1.20
6436,-1.30
6437,-1.39
6438,-1.49
6439,-1.58
6440,-1.70
6441,-1.83
6442,-1.98
6443,-2.12
6444,-2.25
6445,-2.37
6446,-2.54
6447,-2.75
6448,-2.99
6449,-3.26
6450,-3.56
6451,-3.85
6452,-4.09
6453,-4.26
6454,-4.36
6455,-4.39
6456,-4.40
6457,-4.39
6458,-4.43
6459,-4.48
6460,-4.56
6461,-4.65
6462,-4.74
6463,-4.78
6464,-4.78
6465,-4.74
6466,-4.68
6467,-4.62
6468,-4.61
6469,-4.67
6470,-4.81
6471,-5.04
6472,-5.30
6473,-5.56
6474,-5.79
6475,-5.96
6476,-6.06
6477,-6.09
6478,-6.07
6479,-6.01
6480,-5.92
6481,-5.84
6482,-5.74
6483,-5.63
6484,-5.47
6485,-5.25
6486,-4.94
6487,-4.57
6488,-4.11
6489,-3.63
6490,-3.11
6491,-2.59
6492,-2.06
6493,-1.59
6494,-1.17
6495,-0.82
6496,-0.50
6497,-0.21
6498,0.08
6499,0.30
6500,0.50
6501,0.63
6502,0.78
6503,0.91
6504,1.05
6505,1.20
6506,1.38
6507,1.56
6508,1.80
6509,2.06
6510,2.37
6511,2.69
6512,3.06
6513,3.43
6514,3.85
6515,4.25
6516,4.66
6517,5.04
6518,5.42
6519,5.78
6520,6.16
6521,6.55
6522,7.00
6523,7.47
6524,8.02
6525,8.58
6526,9.18
6527,9.74
6528,10.31
6529,10.78
6530,11.22
6531,11.61
6532,12.02
6533,12.41
6534,12.86
6535,13.26
6536,13.69
6537,14.08
6538,14.49
6539,14.82
6540,15.14
6541,15.41
6542,15.72
6543,16.06
6544,16.49
6545,16.98
6546,17.54
6547,18.12
6548,18.72
6549,19.29
6550,19.82
6551,20.29
6552,20.69
6553,21.00
6554,21.23
6555,21.36
6556,21.41
6557,21.37
6558,21.28
6559,21.13
6560,20.93
6561,20.69
6562,20.45
6563,20.24
6564,20.06
6565,19.88
6566,19.73
6567,19.62
6568,19.53
6569,19.50
6570,19.50
6571,19.55
6572,19.64
6573,19.73
6574,19.78
6575,19.79
6576,19.73
6577,19.62
6578,19.48
6579,19.33
6580,19.19
6581,19.10
6582,19.04
6583,19.05
6584,19.09
6585,19.13
6586,19.12
6587,19.04
6588,18.89
6589,18.68
6590,18.43
6591,18.18
6592,17.93
6593,17.72
6594,17.54
6595,17.43
6596,17.33
6597,17.25
6598,17.14
6599,17.02
6600,16.85
6601,16.62
6602,16.33
6603,15.98
6604,15.59
6605,15.22
6606,14.90
6607,14.67
6608,14.53
6609,14.50
6610,14.50
6611,14.51
6612,14.51
6613,14.49
6614,14.43
6615,14.37
6616,14.31
6617,14.29
6618,14.27
6619,14.29
6620,14.30
6621,14.28
6622,14.20
6623,14.05
6624,13.81
6625,13.53
6626,13.24
6627,12.97
6628,12.73
6629,12.55
6630,12.41
6631,12.31
6632,12.24
6633,12.21
6634,12.23
6635,12.28
6636,12.34
6637,12.44
6638,12.54
6639,12.64
6640,12.72
6641,12.75
6642,12.76
6643,12.75
6644,12.73
6645,12.71
6646,12.69
6647,12.66
6648,12.64
6649,12.63
6650,12.61
6651,12.60
6652,12.58
6653,12.57
6654,12.56
6655,12.52
6656,12.44
6657,12.32
6658,12.15
6659,11.96
6660,11.73
6661,11.50
6662,11.25
6663,11.02
6664,10.86
6665,10.80
6666,10.79
6667,10.81
6668,10.85
6669,10.92
6670,10.96
6671,10.98
6672,10.92
6673,10.80
6674,10.61
6675,10.38
6676,10.12
6677,9.87
6678,9.62
6679,9.38
6680,9.12
6681,8.87
6682,8.60
6683,8.34
6684,8.06
6685,7.78
6686,7.48
6687,7.23
6688,7.05
6689,6.98
6690,6.99
6691,7.06
6692,7.13
6693,7.17
6694,7.13
6695,7.00
6696,6.77
6697,6.49
6698,6.18
6699,5.91
6700,5.69
6701,5.57
6702,5.52
6703,5.51
6704,5.50
6705,5.49
6706,5.44
6707,5.38
6708,5.34
6709,5.35
6710,5.41
6711,5.51
6712,5.64
6713,5.77
6714,5.87
6715,5.90
6716,5.86
6717,5.78
6718,5.73
6719,5.74
6720,5.85
6721,6.03
6722,6.29
6723,6.56
6724,6.83
6725,7.05
6726,7.21
6727,7.29
6728,7.32
6729,7.31
6730,7.31
6731,7.32
6732,7.32
6733,7.30
6734,7.29
6735,7.25
6736,7.21
6737,7.16
6738,7.14
6739,7.16
6740,7.22
6741,7.31
6742,7.41
6743,7.48
6744,7.50
6745,7.48
6746,7.45
6747,7.42
6748,7.42
6749,7.45
6750,7.54
6751,7.67
6752,7.81
6753,7.93
6754,7.97
6755,7.93
6756,7.80
6757,7.62
6758,7.39
6759,7.16
6760,6.96
6761,6.79
6762,6.65
6763,6.52
6764,6.40
6765,6.29
6766,6.15
6767,5.99
6768,5.79
6769,5.59
6770,5.42
6771,5.28
6772,5.14
6773,5.00
6774,4.85
6775,4.69
6776,4.48
6777,4.25
6778,4.02
6779,3.84
6780,3.71
6781,3.65
6782,3.66
6783,3.75
6784,3.85
6785,3.96
6786,4.05
6787,4.10
6788,4.13
6789,4.11
6790,4.12
6791,4.16
6792,4.26
6793,4.44
6794,4.69
6795,5.00
6796,5.32
6797,5.62
6798,5.91
6799,6.15
6800,6.36
6801,6.48
6802,6.57
6803,6.59
6804,6.61
6805,6.60
6806,6.62
6807,6.68
6808,6.79
6809,6.94
6810,7.14
6811,7.35
6812,7.58
6813,7.80
6814,8.03
6815,8.21
6816,8.38
6817,8.54
6818,8.71
6819,8.88
6820,9.05
6821,9.18
6822,9.26
6823,9.28
6824,9.22
6825,9.08
6826,8.87
6827,8.61
6828,8.32
6829,8.03
6830,7.78
6831,7.60
6832,7.45
6833,7.35
6834,7.26
6835,7.18
6836,7.10
6837,7.03
6838,6.97
6839,6.93
6840,6.87
6841,6.82
6842,6.77
6843,6.72
6844,6.67
6845,6.61
6846,6.52
6847,6.45
6848,6.40
6849,6.37
6850,6.34
6851,6.32
6852,6.27
6853,6.21
6854,6.10
6855,5.97
6856,5.83
6857,5.71
6858,5.60
6859,5.53
6860,5.52
6861,5.59
6862,5.71
6863,5.84
6864,5.98
6865,6.12
6866,6.27
6867,6.44
6868,6.61
6869,6.76
6870,6.91
6871,7.05
6872,7.15
6873,7.19
6874,7.19
6875,7.18
6876,7.16
6877,7.13
6878,7.11
6879,7.08
6880,7.06
6881,7.00
6882,6.91
6883,6.78
6884,6.64
6885,6.52
6886,6.46
6887,6.49
6888,6.60
6889,6.76
6890,6.96
6891,7.18
6892,7.39
6893,7.57
6894,7.71
6895,7.82
6896,7.94
6897,8.06
6898,8.20
6899,8.35
6900,8.52
6901,8.70
6902,8.86
6903,8.97
6904,9.06
6905,9.14
6906,9.20
6907,9.25
6908,9.30
6909,9.34
6910,9.34
6911,9.31
6912,9.25
6913,9.17
6914,9.09
6915,9.03
6916,9.00
6917,9.00
6918,9.00
6919,9.02
6920,9.03
6921,9.03
6922,9.00
6923,8.93
6924,8.83
6925,8.71
6926,8.58
6927,8.45
6928,8.33
6929,8.24
6930,8.18
6931,8.15
6932,8.16
6933,8.22
6934,8.31
6935,8.40
6936,8.45
6937,8.45
6938,8.39
6939,8.32
6940,8.22
6941,8.14
6942,8.05
6943,7.97
6944,7.90
6945,7.84
6946,7.78
6947,7.71
6948,7.60
6949,7.48
6950,7.33
6951,7.17
6952,7.02
6953,6.87
6954,6.72
6955,6.58
6956,6.45
6957,6.38
6958,6.37
6959,6.42
6960,6.50
6961,6.61
6962,6.73
6963,6.84
6964,6.91
6965,6.94
6966,6.92
6967,6.87
6968,6.81
6969,6.77
6970,6.77
6971,6.81
6972,6.88
6973,6.96
6974,7.03
6975,7.08
6976,7.09
6977,7.06
6978,7.00
6979,6.94
6980,6.93
6981,6.96
6982,7.03
6983,7.16
6984,7.32
6985,7.50
6986,7.67
6987,7.80
6988,7.92
6989,8.00
6990,8.08
6991,8.16
6992,8.30
6993,8.49
6994,8.75
6995,9.03
6996,9.32
6997,9.61
6998,9.92
6999,10.17
7000,10.37
7001,10.48
7002,10.55
7003,10.58
7004,10.58
7005,10.54
7006,10.48
7007,10.44
7008,10.47
7009,10.54
7010,10.65
7011,10.78
7012,10.92
7013,11.05
7014,11.17
7015,11.25
7016,11.26
7017,11.19
7018,11.02
7019,10.79
7020,10.51
7021,10.20
7022,9.85
7023,9.49
7024,9.16
7025,8.87
7026,8.63
7027,8.42
7028,8.24
7029,8.11
7030,8.01
7031,7.97
7032,7.92
7033,7.88
7034,7.84
7035,7.80
7036,7.76
7037,7.72
7038,7.64
7039,7.55
7040,7.42
7041,7.29
7042,7.13
7043,6.95
7044,6.80
7045,6.69
7046,6.63
7047,6.61
7048,6.67
7049,6.78
7050,6.97
7051,7.19
7052,7.45
7053,7.68
7054,7.90
7055,8.07
7056,8.22
7057,8.35
7058,8.50
7059,8.65
7060,8.86
7061,9.11
7062,9.42
7063,9.75
7064,10.07
7065,10.34
7066,10.54
7067,10.63
7068,10.64
7069,10.56
7070,10.48
7071,10.44
7072,10.47
7073,10.57
7074,10.74
7075,10.95
7076,11.17
7077,11.37
7078,11.55
7079,11.67
7080,11.70
7081,11.67
7082,11.61
7083,11.57
7084,11.51
7085,11.42
7086,11.32
7087,11.22
7088,11.14
7089,11.07
7090,11.02
7091,11.00
7092,11.01
7093,11.03
7094,11.07
7095,11.12
7096,11.14
7097,11.14
7098,11.12
7099,11.11
7100,11.09
7101,11.06
7102,11.01
7103,10.93
7104,10.82
7105,10.68
7106,10.50
7107,10.29
7108,10.06
7109,9.83
7110,9.61
7111,9.41
7112,9.26
7113,9.16
7114,9.05
7115,8.95
7116,8.84
7117,8.73
7118,8.61
7119,8.48
7120,8.37
7121,8.27
7122,8.18
7123,8.11
7124,8.05
7125,7.98
7126,7.88
7127,7.77
7128,7.70
7129,7.68
7130,7.71
7131,7.79
7132,7.93
7133,8.14
7134,8.41
7135,8.67
7136,8.91
7137,9.10
7138,9.22
7139,9.25
7140,9.20
7141,9.09
7142,8.95
7143,8.82
7144,8.71
7145,8.62
7146,8.60
7147,8.64
7148,8.71
7149,8.80
7150,8.91
7151,9.03
7152,9.16
7153,9.30
7154,9.45
7155,9.59
7156,9.70
7157,9.80
7158,9.88
7159,9.94
7160,9.96
7161,9.91
7162,9.83
7163,9.73
7164,9.63
7165,9.52
7166,9.41
7167,9.35
7168,9.34
7169,9.39
7170,9.48
7171,9.58
7172,9.69
7173,9.79
7174,9.85
7175,9.86
7176,9.83
7177,9.76
7178,9.66
7179,9.54
7180,9.45
7181,9.37
7182,9.30
7183,9.23
7184,9.18
7185,9.15
7186,9.13
7187,9.12
7188,9.15
7189,9.25
7190,9.33
7191,9.39
7192,9.45
7193,8.77
7194,9.19
7195,11.45
7196,11.87
7197,6.43
7198,2.11
7199,13.29
7200,26.41
