1,187.56
2,249.99
3,249.99
4,245.10
5,236.34
6,249.99
7,249.99
8,238.33
9,186.38
10,121.37
11,59.15
12,15.71
13,-1.77
14,13.61
15,65.82
16,144.07
17,218.51
18,249.99
19,249.99
20,248.95
21,245.50
22,248.79
23,249.99
24,249.99
25,237.79
26,199.45
27,138.33
28,69.66
29,9.30
30,-37.70
31,-70.21
32,-87.51
33,-86.52
34,-71.72
35,-49.26
36,-27.78
37,-11.02
38,-2.62
39,-0.92
40,-4.55
41,-9.15
42,-12.44
43,-12.62
44,-9.77
45,-5.42
46,-0.77
47,2.37
48,3.94
49,3.85
50,3.13
51,2.40
52,2.26
53,2.78
54,3.88
55,5.17
56,6.43
57,7.36
58,8.04
59,8.49
60,8.87
61,9.19
62,9.48
63,9.69
64,9.80
65,9.79
66,9.71
67,9.58
68,9.45
69,9.28
70,9.14
71,9.02
72,8.93
73,8.87
74,8.83
75,8.83
76,8.89
77,9.00
78,9.17
79,9.37
80,9.65
81,10.00
82,10.44
83,10.86
84,11.24
85,11.55
86,11.87
87,12.19
88,12.54
89,12.86
90,13.18
91,13.47
92,13.78
93,14.07
94,14.34
95,14.53
96,14.73
97,14.92
98,15.17
99,15.42
100,15.75
101,16.13
102,16.59
103,17.06
104,17.52
105,17.94
106,18.35
107,18.73
108,19.08
109,19.37
110,19.65
111,19.91
112,20.19
113,20.42
114,20.62
115,20.75
116,20.87
117,20.95
118,21.06
119,21.17
120,21.31
121,21.45
122,21.62
123,21.77
124,21.88
125,21.93
126,21.97
127,22.02
128,22.11
129,22.23
130,22.38
131,22.56
132,22.76
133,22.94
134,23.09
135,23.21
136,23.32
137,23.44
138,23.56
139,23.68
140,23.80
141,23.89
142,23.92
143,23.83
144,23.61
145,23.25
146,22.79
147,22.31
148,21.84
149,21.46
150,21.16
151,20.95
152,20.81
153,20.74
154,20.68
155,20.60
156,20.42
157,20.16
158,19.80
159,19.42
160,19.00
161,18.63
162,18.25
163,17.87
164,17.46
165,17.08
166,16.72
167,16.40
168,16.05
169,15.74
170,15.44
171,15.24
172,15.08
173,14.95
174,14.77
175,14.57
176,14.31
177,13.98
178,13.58
179,13.17
180,12.78
181,12.47
182,12.25
183,12.15
184,12.13
185,12.17
186,12.18
187,12.15
188,12.12
189,12.08
190,12.02
191,11.96
192,11.95
193,11.96
194,12.02
195,12.12
196,12.28
197,12.50
198,12.80
199,13.12
200,13.53
201,13.99
202,14.54
203,15.10
204,15.70
205,16.28
206,16.88
207,17.44
208,18.02
209,18.59
210,19.24
211,19.88
212,20.56
213,21.16
214,21.76
215,22.28
216,22.82
217,23.31
218,23.80
219,24.24
220,24.69
221,25.09
222,25.45
223,25.75
224,26.05
225,26.33
226,26.60
227,26.85
228,27.08
229,27.28
230,27.42
231,27.45
232,27.40
233,27.28
234,27.09
235,26.86
236,26.57
237,26.27
238,25.96
239,25.67
240,25.38
241,25.15
242,24.96
243,24.84
244,24.78
245,24.78
246,24.84
247,24.97
248,25.13
249,25.28
250,25.38
251,25.44
252,25.50
253,25.54
254,25.60
255,25.67
256,25.74
257,25.83
258,25.92
259,26.02
260,26.12
261,26.23
262,26.36
263,26.49
264,26.57
265,26.57
266,26.49
267,26.34
268,26.12
269,25.82
270,25.46
271,25.13
272,24.89
273,24.78
274,24.73
275,24.72
276,24.67
277,24.59
278,24.38
279,24.05
280,23.51
281,22.89
282,22.20
283,21.55
284,20.95
285,20.42
286,19.91
287,19.48
288,19.08
289,18.73
290,18.36
291,17.97
292,17.59
293,17.28
294,16.98
295,16.69
296,16.34
297,15.95
298,15.56
299,15.24
300,14.97
301,14.79
302,14.70
303,14.69
304,14.80
305,15.01
306,15.34
307,15.75
308,16.23
309,16.74
310,17.30
311,17.82
312,18.30
313,18.66
314,18.92
315,19.03
316,19.00
317,18.88
318,18.75
319,18.68
320,18.68
321,18.74
322,18.89
323,19.10
324,19.30
325,19.45
326,19.55
327,19.58
328,19.53
329,19.48
330,19.47
331,19.55
332,19.71
333,19.90
334,20.09
335,20.24
336,20.29
337,20.20
338,19.99
339,19.71
340,19.44
341,19.23
342,19.08
343,19.00
344,18.97
345,19.00
346,19.07
347,19.13
348,19.13
349,19.04
350,18.89
351,18.71
352,18.51
353,18.30
354,18.11
355,18.00
356,17.94
357,17.94
358,17.97
359,18.07
360,18.24
361,18.42
362,18.52
363,18.53
364,18.46
365,18.34
366,18.14
367,17.88
368,17.61
369,17.39
370,17.20
371,17.04
372,16.87
373,16.75
374,16.68
375,16.65
376,16.63
377,16.64
378,16.69
379,16.78
380,16.88
381,16.94
382,16.94
383,16.85
384,16.67
385,16.46
386,16.27
387,16.11
388,16.01
389,15.95
390,15.93
391,15.92
392,15.93
393,15.97
394,16.05
395,16.17
396,16.28
397,16.41
398,16.56
399,16.74
400,16.88
401,16.99
402,17.05
403,17.07
404,17.01
405,16.87
406,16.68
407,16.50
408,16.33
409,16.15
410,15.97
411,15.82
412,15.73
413,15.71
414,15.68
415,15.63
416,15.53
417,15.40
418,15.27
419,15.12
420,14.96
421,14.82
422,14.70
423,14.60
424,14.52
425,14.47
426,14.45
427,14.44
428,14.42
429,14.37
430,14.31
431,14.27
432,14.26
433,14.29
434,14.38
435,14.54
436,14.72
437,14.86
438,14.96
439,15.06
440,15.17
441,15.28
442,15.37
443,15.43
444,15.53
445,15.64
446,15.72
447,15.72
448,15.71
449,15.73
450,15.78
451,15.82
452,15.85
453,15.88
454,15.88
455,15.83
456,15.67
457,15.43
458,15.15
459,14.85
460,14.52
461,14.20
462,13.91
463,13.69
464,13.53
465,13.43
466,13.34
467,13.24
468,13.12
469,12.99
470,12.83
471,12.71
472,12.61
473,12.56
474,12.54
475,12.57
476,12.62
477,12.69
478,12.78
479,12.87
480,12.92
481,12.92
482,12.91
483,12.93
484,12.99
485,13.02
486,13.02
487,13.02
488,13.04
489,13.06
490,13.09
491,13.11
492,13.17
493,13.22
494,13.26
495,13.26
496,13.27
497,13.25
498,13.24
499,13.20
500,13.21
501,13.32
502,13.57
503,13.92
504,14.39
505,14.90
506,15.42
507,15.88
508,16.32
509,16.71
510,17.07
511,17.36
512,17.59
513,17.78
514,18.04
515,18.33
516,18.64
517,18.94
518,19.26
519,19.62
520,19.99
521,20.31
522,20.61
523,20.90
524,21.22
525,21.51
526,21.77
527,21.97
528,22.16
529,22.33
530,22.52
531,22.69
532,22.88
533,23.08
534,23.34
535,23.63
536,23.96
537,24.29
538,24.59
539,24.83
540,25.01
541,25.10
542,25.09
543,24.96
544,24.76
545,24.49
546,24.16
547,23.80
548,23.44
549,23.11
550,22.84
551,22.66
552,22.56
553,22.54
554,22.56
555,22.62
556,22.67
557,22.71
558,22.73
559,22.73
560,22.69
561,22.64
562,22.58
563,22.54
564,22.54
565,22.58
566,22.64
567,22.70
568,22.72
569,22.70
570,22.62
571,22.51
572,22.32
573,22.08
574,21.82
575,21.61
576,21.46
577,21.37
578,21.34
579,21.39
580,21.57
581,21.84
582,22.17
583,22.50
584,22.82
585,23.15
586,23.49
587,23.78
588,23.99
589,24.11
590,24.22
591,24.35
592,24.52
593,24.70
594,24.96
595,25.30
596,25.76
597,26.20
598,26.60
599,26.89
600,27.13
601,27.29
602,27.40
603,27.49
604,27.63
605,27.82
606,28.08
607,28.35
608,28.66
609,28.98
610,29.30
611,29.57
612,29.79
613,29.93
614,30.01
615,30.03
616,30.07
617,30.14
618,30.33
619,30.60
620,30.94
621,31.29
622,31.65
623,32.01
624,32.37
625,32.67
626,32.86
627,32.95
628,32.99
629,33.01
630,33.01
631,32.98
632,32.97
633,32.96
634,32.95
635,32.93
636,32.88
637,32.79
638,32.62
639,32.42
640,32.22
641,32.04
642,31.84
643,31.67
644,31.55
645,31.49
646,31.41
647,31.28
648,31.08
649,30.84
650,30.53
651,30.18
652,29.81
653,29.44
654,29.07
655,28.72
656,28.42
657,28.21
658,28.06
659,27.92
660,27.75
661,27.57
662,27.40
663,27.28
664,27.21
665,27.22
666,27.31
667,27.45
668,27.62
669,27.78
670,27.91
671,27.98
672,28.02
673,28.02
674,28.04
675,28.05
676,28.08
677,28.11
678,28.18
679,28.26
680,28.37
681,28.47
682,28.51
683,28.51
684,28.49
685,28.44
686,28.43
687,28.48
688,28.63
689,28.88
690,29.20
691,29.53
692,29.85
693,30.14
694,30.42
695,30.62
696,30.74
697,30.76
698,30.77
699,30.82
700,30.95
701,31.17
702,31.45
703,31.77
704,32.14
705,32.50
706,32.82
707,33.06
708,33.21
709,33.30
710,33.35
711,33.34
712,33.29
713,33.20
714,33.10
715,32.99
716,32.78
717,32.50
718,32.11
719,31.66
720,31.14
721,30.61
722,30.09
723,29.65
724,29.27
725,28.98
726,28.75
727,28.61
728,28.51
729,28.47
730,28.41
731,28.37
732,28.26
733,28.12
734,27.91
735,27.65
736,27.30
737,26.92
738,26.50
739,26.13
740,25.76
741,25.44
742,25.14
743,24.88
744,24.62
745,24.39
746,24.14
747,23.88
748,23.57
749,23.26
750,22.91
751,22.59
752,22.27
753,22.02
754,21.78
755,21.58
756,21.35
757,21.13
758,20.86
759,20.60
760,20.32
761,20.06
762,19.81
763,19.63
764,19.50
765,19.43
766,19.36
767,19.23
768,19.00
769,18.71
770,18.42
771,18.17
772,17.97
773,17.89
774,17.96
775,18.17
776,18.44
777,18.69
778,18.91
779,19.07
780,19.19
781,19.25
782,19.30
783,19.39
784,19.54
785,19.74
786,19.99
787,20.23
788,20.44
789,20.55
790,20.58
791,20.52
792,20.42
793,20.34
794,20.36
795,20.52
796,20.81
797,21.16
798,21.53
799,21.87
800,22.16
801,22.32
802,22.35
803,22.26
804,22.13
805,22.00
806,21.90
807,21.84
808,21.86
809,21.94
810,22.06
811,22.22
812,22.42
813,22.63
814,22.78
815,22.84
816,22.84
817,22.80
818,22.74
819,22.66
820,22.55
821,22.46
822,22.42
823,22.38
824,22.35
825,22.32
826,22.32
827,22.35
828,22.37
829,22.40
830,22.48
831,22.63
832,22.80
833,22.99
834,23.17
835,23.35
836,23.51
837,23.57
838,23.53
839,23.43
840,23.35
841,23.32
842,23.32
843,23.32
844,23.32
845,23.35
846,23.41
847,23.48
848,23.49
849,23.43
850,23.33
851,23.24
852,23.16
853,23.11
854,23.06
855,23.03
856,23.01
857,22.99
858,22.93
859,22.84
860,22.71
861,22.58
862,22.53
863,22.58
864,22.74
865,22.96
866,23.21
867,23.41
868,23.55
869,23.61
870,23.62
871,23.61
872,23.64
873,23.68
874,23.79
875,23.93
876,24.14
877,24.34
878,24.52
879,24.63
880,24.74
881,24.90
882,25.20
883,25.58
884,26.05
885,26.56
886,27.12
887,27.69
888,28.22
889,28.63
890,28.94
891,29.16
892,29.39
893,29.59
894,29.79
895,29.96
896,30.16
897,30.39
898,30.65
899,30.88
900,31.12
901,31.33
902,31.49
903,31.56
904,31.49
905,31.34
906,31.14
907,30.92
908,30.72
909,30.52
910,30.30
911,30.09
912,29.89
913,29.72
914,29.53
915,29.34
916,29.09
917,28.86
918,28.61
919,28.39
920,28.12
921,27.85
922,27.48
923,27.07
924,26.56
925,26.05
926,25.49
927,24.93
928,24.30
929,23.69
930,23.10
931,22.64
932,22.21
933,21.80
934,21.37
935,20.97
936,20.53
937,20.10
938,19.62
939,19.17
940,18.79
941,18.52
942,18.33
943,18.26
944,18.28
945,18.37
946,18.46
947,18.49
948,18.48
949,18.45
950,18.42
951,18.41
952,18.47
953,18.62
954,18.88
955,19.20
956,19.58
957,20.00
958,20.44
959,20.88
960,21.34
961,21.77
962,22.25
963,22.72
964,23.21
965,23.64
966,24.05
967,24.44
968,24.84
969,25.18
970,25.47
971,25.67
972,25.88
973,26.07
974,26.25
975,26.40
976,26.58
977,26.80
978,27.09
979,27.39
980,27.70
981,28.02
982,28.38
983,28.74
984,29.09
985,29.38
986,29.63
987,29.84
988,30.01
989,30.13
990,30.20
991,30.19
992,30.14
993,30.04
994,29.91
995,29.76
996,29.62
997,29.53
998,29.52
999,29.58
1000,29.69
1001,29.84
1002,30.01
1003,30.19
1004,30.36
1005,30.47
1006,30.56
1007,30.61
1008,30.67
1009,30.76
1010,30.88
1011,31.03
1012,31.20
1013,31.38
1014,31.59
1015,31.80
1016,31.97
1017,32.10
1018,32.17
1019,32.17
1020,32.06
1021,31.82
1022,31.47
1023,31.09
1024,30.69
1025,30.30
1026,29.91
1027,29.56
1028,29.24
1029,28.92
1030,28.51
1031,28.05
1032,27.54
1033,27.07
1034,26.57
1035,26.08
1036,25.57
1037,25.15
1038,24.85
1039,24.65
1040,24.46
1041,24.27
1042,24.04
1043,23.83
1044,23.64
1045,23.50
1046,23.39
1047,23.34
1048,23.28
1049,23.23
1050,23.13
1051,22.99
1052,22.79
1053,22.51
1054,22.20
1055,21.89
1056,21.68
1057,21.58
1058,21.61
1059,21.73
1060,21.93
1061,22.19
1062,22.54
1063,22.92
1064,23.35
1065,23.78
1066,24.29
1067,24.83
1068,25.48
1069,26.16
1070,26.92
1071,27.64
1072,28.37
1073,29.05
1074,29.74
1075,30.37
1076,31.01
1077,31.60
1078,32.20
1079,32.72
1080,33.16
1081,33.45
1082,33.67
1083,33.80
1084,33.93
1085,34.06
1086,34.28
1087,34.58
1088,34.92
1089,35.22
1090,35.44
1091,35.52
1092,35.50
1093,35.40
1094,35.29
1095,35.20
1096,35.14
1097,35.11
1098,35.11
1099,35.14
1100,35.19
1101,35.19
1102,35.11
1103,34.90
1104,34.58
1105,34.19
1106,33.76
1107,33.35
1108,32.94
1109,32.59
1110,32.27
1111,32.01
1112,31.77
1113,31.58
1114,31.38
1115,31.18
1116,30.90
1117,30.59
1118,30.20
1119,29.80
1120,29.33
1121,28.87
1122,28.40
1123,27.97
1124,27.47
1125,26.92
1126,26.28
1127,25.64
1128,24.92
1129,24.17
1130,23.28
1131,22.42
1132,21.51
1133,20.69
1134,19.84
1135,19.08
1136,18.30
1137,17.57
1138,16.75
1139,15.95
1140,15.11
1141,14.34
1142,13.58
1143,12.91
1144,12.31
1145,11.89
1146,11.54
1147,11.28
1148,11.05
1149,10.89
1150,10.77
1151,10.70
1152,10.69
1153,10.75
1154,10.94
1155,11.25
1156,11.68
1157,12.16
1158,12.72
1159,13.30
1160,13.91
1161,14.46
1162,15.02
1163,15.60
1164,16.30
1165,17.01
1166,17.82
1167,18.62
1168,19.47
1169,20.26
1170,20.99
1171,21.60
1172,22.20
1173,22.74
1174,23.29
1175,23.79
1176,24.31
1177,24.79
1178,25.28
1179,25.69
1180,26.08
1181,26.40
1182,26.65
1183,26.79
1184,26.89
1185,26.96
1186,27.05
1187,27.15
1188,27.25
1189,27.36
1190,27.48
1191,27.57
1192,27.63
1193,27.62
1194,27.59
1195,27.52
1196,27.44
1197,27.35
1198,27.28
1199,27.21
1200,27.17
1201,27.15
1202,27.12
1203,27.05
1204,26.92
1205,26.74
1206,26.60
1207,26.54
1208,26.52
1209,26.56
1210,26.68
1211,26.88
1212,27.12
1213,27.37
1214,27.61
1215,27.82
1216,27.95
1217,27.98
1218,27.95
1219,27.85
1220,27.70
1221,27.50
1222,27.24
1223,26.94
1224,26.60
1225,26.21
1226,25.78
1227,25.33
1228,24.88
1229,24.50
1230,24.18
1231,23.98
1232,23.86
1233,23.84
1234,23.86
1235,23.86
1236,23.80
1237,23.70
1238,23.54
1239,23.32
1240,23.05
1241,22.78
1242,22.58
1243,22.46
1244,22.37
1245,22.29
1246,22.23
1247,22.22
1248,22.25
1249,22.28
1250,22.35
1251,22.45
1252,22.62
1253,22.83
1254,23.09
1255,23.35
1256,23.62
1257,23.84
1258,24.09
1259,24.38
1260,24.76
1261,25.13
1262,25.54
1263,25.98
1264,26.51
1265,27.13
1266,27.83
1267,28.52
1268,29.19
1269,29.81
1270,30.40
1271,30.90
1272,31.31
1273,31.61
1274,31.81
1275,31.90
1276,31.88
1277,31.75
1278,31.57
1279,31.39
1280,31.21
1281,31.01
1282,30.75
1283,30.43
1284,30.01
1285,29.51
1286,28.92
1287,28.26
1288,27.53
1289,26.86
1290,26.25
1291,25.82
1292,25.47
1293,25.25
1294,25.09
1295,24.99
1296,24.83
1297,24.61
1298,24.27
1299,23.85
1300,23.37
1301,22.93
1302,22.53
1303,22.24
1304,22.02
1305,21.88
1306,21.80
1307,21.77
1308,21.75
1309,21.73
1310,21.70
1311,21.66
1312,21.62
1313,21.60
1314,21.60
1315,21.63
1316,21.67
1317,21.74
1318,21.83
1319,21.95
1320,22.06
1321,22.13
1322,22.13
1323,22.06
1324,21.93
1325,21.76
1326,21.55
1327,21.35
1328,21.13
1329,20.91
1330,20.74
1331,20.63
1332,20.53
1333,20.42
1334,20.24
1335,20.03
1336,19.82
1337,19.66
1338,19.58
1339,19.59
1340,19.68
1341,19.82
1342,20.03
1343,20.26
1344,20.55
1345,20.84
1346,21.13
1347,21.39
1348,21.66
1349,21.92
1350,22.20
1351,22.47
1352,22.74
1353,23.03
1354,23.40
1355,23.80
1356,24.25
1357,24.64
1358,24.98
1359,25.23
1360,25.44
1361,25.57
1362,25.70
1363,25.79
1364,25.98
1365,26.23
1366,26.63
1367,27.09
1368,27.63
1369,28.18
1370,28.72
1371,29.17
1372,29.56
1373,29.86
1374,30.11
1375,30.31
1376,30.47
1377,30.59
1378,30.72
1379,30.85
1380,31.02
1381,31.20
1382,31.43
1383,31.69
1384,31.96
1385,32.17
1386,32.31
1387,32.38
1388,32.33
1389,32.16
1390,31.85
1391,31.46
1392,31.03
1393,30.64
1394,30.29
1395,30.01
1396,29.73
1397,29.47
1398,29.17
1399,28.87
1400,28.48
1401,28.05
1402,27.49
1403,26.92
1404,26.31
1405,25.72
1406,25.06
1407,24.39
1408,23.70
1409,23.09
1410,22.47
1411,21.90
1412,21.29
1413,20.74
1414,20.20
1415,19.71
1416,19.17
1417,18.65
1418,18.11
1419,17.62
1420,17.09
1421,16.60
1422,16.12
1423,15.74
1424,15.43
1425,15.20
1426,14.99
1427,14.82
1428,14.66
1429,14.51
1430,14.36
1431,14.21
1432,14.10
1433,14.06
1434,14.12
1435,14.23
1436,14.41
1437,14.68
1438,15.08
1439,15.58
1440,16.16
1441,16.75
1442,17.39
1443,17.97
1444,18.51
1445,18.92
1446,19.26
1447,19.51
1448,19.70
1449,19.81
1450,19.94
1451,20.03
1452,20.15
1453,20.26
1454,20.45
1455,20.74
1456,21.13
1457,21.55
1458,22.00
1459,22.42
1460,22.88
1461,23.32
1462,23.80
1463,24.22
1464,24.64
1465,25.02
1466,25.44
1467,25.87
1468,26.36
1469,26.82
1470,27.32
1471,27.78
1472,28.24
1473,28.63
1474,28.94
1475,29.17
1476,29.37
1477,29.57
1478,29.81
1479,30.08
1480,30.40
1481,30.75
1482,31.13
1483,31.48
1484,31.81
1485,32.07
1486,32.30
1487,32.47
1488,32.62
1489,32.70
1490,32.75
1491,32.81
1492,32.90
1493,33.02
1494,33.15
1495,33.27
1496,33.37
1497,33.43
1498,33.43
1499,33.35
1500,33.15
1501,32.89
1502,32.57
1503,32.22
1504,31.80
1505,31.36
1506,30.88
1507,30.45
1508,30.01
1509,29.56
1510,29.08
1511,28.62
1512,28.14
1513,27.73
1514,27.37
1515,27.11
1516,26.92
1517,26.84
1518,26.83
1519,26.87
1520,26.88
1521,26.86
1522,26.79
1523,26.70
1524,26.60
1525,26.51
1526,26.46
1527,26.46
1528,26.49
1529,26.56
1530,26.64
1531,26.70
1532,26.70
1533,26.60
1534,26.46
1535,26.27
1536,26.07
1537,25.89
1538,25.76
1539,25.73
1540,25.79
1541,25.92
1542,26.09
1543,26.27
1544,26.42
1545,26.54
1546,26.66
1547,26.77
1548,26.87
1549,26.97
1550,27.07
1551,27.19
1552,27.30
1553,27.37
1554,27.36
1555,27.24
1556,27.00
1557,26.64
1558,26.17
1559,25.64
1560,25.05
1561,24.47
1562,23.84
1563,23.25
1564,22.70
1565,22.23
1566,21.79
1567,21.42
1568,21.07
1569,20.79
1570,20.48
1571,20.18
1572,19.78
1573,19.34
1574,18.82
1575,18.30
1576,17.73
1577,17.18
1578,16.60
1579,16.05
1580,15.47
1581,14.92
1582,14.34
1583,13.79
1584,13.22
1585,12.70
1586,12.15
1587,11.67
1588,11.20
1589,10.82
1590,10.48
1591,10.19
1592,9.92
1593,9.71
1594,9.57
1595,9.55
1596,9.63
1597,9.81
1598,10.05
1599,10.32
1600,10.60
1601,10.85
1602,11.01
1603,11.07
1604,11.04
1605,10.98
1606,10.93
1607,10.89
1608,10.89
1609,10.92
1610,10.96
1611,10.99
1612,10.99
1613,10.93
1614,10.86
1615,10.82
1616,10.86
1617,10.97
1618,11.17
1619,11.41
1620,11.67
1621,11.87
1622,12.03
1623,12.11
1624,12.13
1625,12.08
1626,12.06
1627,12.08
1628,12.21
1629,12.44
1630,12.78
1631,13.15
1632,13.61
1633,14.11
1634,14.66
1635,15.18
1636,15.72
1637,16.24
1638,16.82
1639,17.37
1640,17.94
1641,18.43
1642,18.91
1643,19.37
1644,19.90
1645,20.45
1646,21.08
1647,21.72
1648,22.42
1649,23.09
1650,23.77
1651,24.35
1652,24.89
1653,25.31
1654,25.71
1655,26.05
1656,26.42
1657,26.76
1658,27.13
1659,27.48
1660,27.87
1661,28.21
1662,28.53
1663,28.76
1664,28.97
1665,29.14
1666,29.26
1667,29.31
1668,29.37
1669,29.45
1670,29.58
1671,29.70
1672,29.79
1673,29.78
1674,29.69
1675,29.54
1676,29.38
1677,29.22
1678,29.07
1679,28.95
1680,28.92
1681,28.98
1682,29.07
1683,29.14
1684,29.17
1685,29.17
1686,29.09
1687,28.98
1688,28.88
1689,28.84
1690,28.86
1691,28.95
1692,29.15
1693,29.42
1694,29.70
1695,29.91
1696,30.05
1697,30.13
1698,30.19
1699,30.22
1700,30.24
1701,30.27
1702,30.30
1703,30.36
1704,30.47
1705,30.62
1706,30.76
1707,30.85
1708,30.90
1709,30.93
1710,30.94
1711,30.91
1712,30.85
1713,30.75
1714,30.66
1715,30.56
1716,30.45
1717,30.33
1718,30.25
1719,30.22
1720,30.20
1721,30.17
1722,30.17
1723,30.22
1724,30.35
1725,30.53
1726,30.75
1727,30.98
1728,31.25
1729,31.51
1730,31.76
1731,31.97
1732,32.17
1733,32.34
1734,32.49
1735,32.57
1736,32.65
1737,32.76
1738,32.91
1739,33.06
1740,33.22
1741,33.39
1742,33.62
1743,33.91
1744,34.28
1745,34.66
1746,35.08
1747,35.49
1748,35.91
1749,36.29
1750,36.63
1751,36.87
1752,37.03
1753,37.07
1754,37.04
1755,36.95
1756,36.85
1757,36.76
1758,36.67
1759,36.58
1760,36.51
1761,36.48
1762,36.44
1763,36.36
1764,36.22
1765,36.04
1766,35.80
1767,35.55
1768,35.28
1769,35.03
1770,34.81
1771,34.65
1772,34.52
1773,34.47
1774,34.41
1775,34.33
1776,34.22
1777,34.13
1778,34.04
1779,33.94
1780,33.74
1781,33.49
1782,33.15
1783,32.80
1784,32.40
1785,32.00
1786,31.55
1787,31.10
1788,30.64
1789,30.23
1790,29.88
1791,29.62
1792,29.38
1793,29.18
1794,29.03
1795,28.98
1796,28.97
1797,29.01
1798,29.07
1799,29.16
1800,29.23
1801,29.27
1802,29.25
1803,29.17
1804,28.98
1805,28.72
1806,28.39
1807,28.05
1808,27.77
1809,27.59
1810,27.52
1811,27.56
1812,27.66
1813,27.82
1814,27.99
1815,28.14
1816,28.22
1817,28.19
1818,28.07
1819,27.89
1820,27.67
1821,27.46
1822,27.28
1823,27.19
1824,27.21
1825,27.34
1826,27.52
1827,27.69
1828,27.86
1829,28.01
1830,28.14
1831,28.26
1832,28.37
1833,28.50
1834,28.63
1835,28.77
1836,28.93
1837,29.08
1838,29.21
1839,29.29
1840,29.34
1841,29.37
1842,29.43
1843,29.50
1844,29.62
1845,29.76
1846,29.98
1847,30.24
1848,30.52
1849,30.76
1850,31.00
1851,31.23
1852,31.47
1853,31.73
1854,32.07
1855,32.48
1856,32.97
1857,33.48
1858,33.99
1859,34.45
1860,34.91
1861,35.29
1862,35.61
1863,35.81
1864,35.93
1865,35.98
1866,36.03
1867,36.05
1868,36.06
1869,36.06
1870,36.07
1871,36.07
1872,36.04
1873,35.95
1874,35.80
1875,35.59
1876,35.33
1877,35.04
1878,34.68
1879,34.31
1880,33.88
1881,33.48
1882,33.06
1883,32.69
1884,32.30
1885,31.93
1886,31.47
1887,30.99
1888,30.43
1889,29.84
1890,29.15
1891,28.45
1892,27.72
1893,27.05
1894,26.36
1895,25.70
1896,24.99
1897,24.35
1898,23.72
1899,23.17
1900,22.64
1901,22.20
1902,21.82
1903,21.54
1904,21.28
1905,21.06
1906,20.80
1907,20.54
1908,20.24
1909,19.97
1910,19.78
1911,19.68
1912,19.69
1913,19.79
1914,19.95
1915,20.13
1916,20.29
1917,20.41
1918,20.50
1919,20.58
1920,20.69
1921,20.84
1922,21.05
1923,21.32
1924,21.61
1925,21.91
1926,22.22
1927,22.48
1928,22.69
1929,22.81
1930,22.86
1931,22.85
1932,22.83
1933,22.83
1934,22.87
1935,22.95
1936,23.11
1937,23.31
1938,23.57
1939,23.83
1940,24.11
1941,24.37
1942,24.64
1943,24.94
1944,25.27
1945,25.60
1946,25.91
1947,26.17
1948,26.41
1949,26.62
1950,26.79
1951,26.87
1952,26.89
1953,26.85
1954,26.80
1955,26.76
1956,26.79
1957,26.86
1958,27.05
1959,27.32
1960,27.65
1961,27.98
1962,28.29
1963,28.56
1964,28.77
1965,28.89
1966,28.92
1967,28.88
1968,28.85
1969,28.85
1970,28.85
1971,28.86
1972,28.86
1973,28.86
1974,28.83
1975,28.76
1976,28.59
1977,28.34
1978,28.05
1979,27.75
1980,27.49
1981,27.29
1982,27.09
1983,26.92
1984,26.74
1985,26.54
1986,26.26
1987,25.88
1988,25.37
1989,24.81
1990,24.19
1991,23.61
1992,23.03
1993,22.53
1994,22.10
1995,21.78
1996,21.52
1997,21.32
1998,21.14
1999,21.00
2000,20.87
2001,20.78
2002,20.74
2003,20.74
2004,20.78
2005,20.87
2006,21.00
2007,21.19
2008,21.40
2009,21.58
2010,21.68
2011,21.68
2012,21.61
2013,21.51
2014,21.41
2015,21.29
2016,21.19
2017,21.12
2018,21.13
2019,21.22
2020,21.40
2021,21.63
2022,21.92
2023,22.24
2024,22.64
2025,23.07
2026,23.55
2027,24.00
2028,24.42
2029,24.73
2030,24.96
2031,25.11
2032,25.23
2033,25.31
2034,25.35
2035,25.34
2036,25.38
2037,25.45
2038,25.58
2039,25.70
2040,25.81
2041,25.93
2042,26.06
2043,26.15
2044,26.18
2045,26.16
2046,26.21
2047,26.32
2048,26.50
2049,26.71
2050,26.96
2051,27.23
2052,27.50
2053,27.71
2054,27.85
2055,27.94
2056,27.98
2057,27.98
2058,27.95
2059,27.89
2060,27.82
2061,27.76
2062,27.71
2063,27.68
2064,27.66
2065,27.63
2066,27.58
2067,27.53
2068,27.44
2069,27.33
2070,27.16
2071,26.99
2072,26.80
2073,26.63
2074,26.42
2075,26.22
2076,26.04
2077,25.92
2078,25.83
2079,25.75
2080,25.66
2081,25.57
2082,25.44
2083,25.28
2084,25.04
2085,24.78
2086,24.47
2087,24.11
2088,23.70
2089,23.32
2090,22.98
2091,22.72
2092,22.48
2093,22.29
2094,22.10
2095,21.96
2096,21.80
2097,21.59
2098,21.32
2099,21.02
2100,20.71
2101,20.44
2102,20.26
2103,20.16
2104,20.16
2105,20.25
2106,20.46
2107,20.79
2108,21.19
2109,21.58
2110,21.96
2111,22.31
2112,22.64
2113,22.93
2114,23.22
2115,23.51
2116,23.85
2117,24.15
2118,24.48
2119,24.79
2120,25.19
2121,25.62
2122,26.12
2123,26.60
2124,27.20
2125,27.84
2126,28.53
2127,29.19
2128,29.84
2129,30.41
2130,30.97
2131,31.46
2132,31.97
2133,32.46
2134,32.99
2135,33.49
2136,33.99
2137,34.45
2138,34.92
2139,35.33
2140,35.71
2141,36.03
2142,36.34
2143,36.66
2144,37.03
2145,37.38
2146,37.70
2147,37.94
2148,38.11
2149,38.19
2150,38.20
2151,38.12
2152,37.93
2153,37.69
2154,37.42
2155,37.12
2156,36.76
2157,36.35
2158,35.91
2159,35.52
2160,35.16
2161,34.84
2162,34.55
2163,34.31
2164,34.11
2165,33.97
2166,33.87
2167,33.81
2168,33.76
2169,33.71
2170,33.64
2171,33.58
2172,33.52
2173,33.49
2174,33.50
2175,33.57
2176,33.67
2177,33.79
2178,33.91
2179,34.00
2180,34.04
2181,34.01
2182,33.90
2183,33.73
2184,33.51
2185,33.27
2186,33.02
2187,32.78
2188,32.58
2189,32.43
2190,32.31
2191,32.20
2192,32.04
2193,31.88
2194,31.66
2195,31.43
2196,31.14
2197,30.86
2198,30.56
2199,30.30
2200,30.01
2201,29.70
2202,29.34
2203,28.98
2204,28.59
2205,28.23
2206,27.82
2207,27.41
2208,26.95
2209,26.52
2210,26.08
2211,25.68
2212,25.22
2213,24.76
2214,24.26
2215,23.83
2216,23.41
2217,23.06
2218,22.75
2219,22.52
2220,22.33
2221,22.19
2222,22.06
2223,21.94
2224,21.83
2225,21.74
2226,21.69
2227,21.69
2228,21.73
2229,21.78
2230,21.89
2231,22.06
2232,22.32
2233,22.59
2234,22.81
2235,22.99
2236,23.19
2237,23.39
2238,23.57
2239,23.69
2240,23.80
2241,23.90
2242,24.02
2243,24.08
2244,24.10
2245,24.09
2246,24.10
2247,24.15
2248,24.28
2249,24.49
2250,24.79
2251,25.14
2252,25.55
2253,25.96
2254,26.37
2255,26.73
2256,27.02
2257,27.20
2258,27.28
2259,27.31
2260,27.31
2261,27.34
2262,27.40
2263,27.42
2264,27.40
2265,27.35
2266,27.29
2267,27.20
2268,27.02
2269,26.76
2270,26.45
2271,26.14
2272,25.85
2273,25.61
2274,25.47
2275,25.44
2276,25.47
2277,25.54
2278,25.63
2279,25.73
2280,25.75
2281,25.70
2282,25.60
2283,25.50
2284,25.43
2285,25.41
2286,25.42
2287,25.45
2288,25.47
2289,25.44
2290,25.38
2291,25.31
2292,25.26
2293,25.23
2294,25.22
2295,25.25
2296,25.34
2297,25.50
2298,25.65
2299,25.74
2300,25.75
2301,25.67
2302,25.59
2303,25.53
2304,25.52
2305,25.54
2306,25.60
2307,25.70
2308,25.83
2309,25.94
2310,26.05
2311,26.12
2312,26.25
2313,26.42
2314,26.66
2315,26.89
2316,27.11
2317,27.25
2318,27.37
2319,27.44
2320,27.52
2321,27.57
2322,27.63
2323,27.68
2324,27.77
2325,27.92
2326,28.13
2327,28.37
2328,28.61
2329,28.82
2330,29.02
2331,29.23
2332,29.42
2333,29.57
2334,29.69
2335,29.78
2336,29.84
2337,29.86
2338,29.86
2339,29.85
2340,29.89
2341,29.98
2342,30.11
2343,30.27
2344,30.40
2345,30.49
2346,30.53
2347,30.49
2348,30.42
2349,30.30
2350,30.14
2351,29.96
2352,29.77
2353,29.60
2354,29.43
2355,29.25
2356,29.05
2357,28.85
2358,28.63
2359,28.40
2360,28.11
2361,27.82
2362,27.53
2363,27.26
2364,26.99
2365,26.70
2366,26.37
2367,26.05
2368,25.69
2369,25.34
2370,25.00
2371,24.74
2372,24.53
2373,24.37
2374,24.18
2375,23.98
2376,23.70
2377,23.35
2378,22.89
2379,22.35
2380,21.78
2381,21.27
2382,20.86
2383,20.60
2384,20.48
2385,20.48
2386,20.55
2387,20.61
2388,20.66
2389,20.69
2390,20.68
2391,20.65
2392,20.62
2393,20.61
2394,20.68
2395,20.83
2396,21.04
2397,21.28
2398,21.54
2399,21.80
2400,22.09
2401,22.42
2402,22.80
2403,23.22
2404,23.64
2405,24.03
2406,24.41
2407,24.73
2408,24.98
2409,25.12
2410,25.21
2411,25.28
2412,25.41
2413,25.56
2414,25.70
2415,25.82
2416,25.94
2417,26.08
2418,26.26
2419,26.44
2420,26.62
2421,26.79
2422,26.99
2423,27.23
2424,27.51
2425,27.80
2426,28.10
2427,28.37
2428,28.63
2429,28.87
2430,29.08
2431,29.21
2432,29.30
2433,29.36
2434,29.43
2435,29.48
2436,29.54
2437,29.59
2438,29.69
2439,29.83
2440,30.04
2441,30.24
2442,30.42
2443,30.54
2444,30.62
2445,30.61
2446,30.51
2447,30.33
2448,30.15
2449,30.02
2450,29.95
2451,29.96
2452,30.04
2453,30.19
2454,30.37
2455,30.56
2456,30.72
2457,30.82
2458,30.82
2459,30.69
2460,30.44
2461,30.12
2462,29.74
2463,29.32
2464,28.84
2465,28.34
2466,27.83
2467,27.36
2468,26.89
2469,26.48
2470,26.14
2471,25.88
2472,25.60
2473,25.33
2474,25.00
2475,24.67
2476,24.31
2477,23.93
2478,23.55
2479,23.23
2480,22.93
2481,22.71
2482,22.51
2483,22.37
2484,22.23
2485,22.12
2486,22.03
2487,21.97
2488,21.91
2489,21.83
2490,21.71
2491,21.59
2492,21.47
2493,21.32
2494,21.11
2495,20.84
2496,20.55
2497,20.28
2498,20.04
2499,19.86
2500,19.78
2501,19.81
2502,19.94
2503,20.15
2504,20.42
2505,20.76
2506,21.11
2507,21.45
2508,21.71
2509,21.89
2510,22.01
2511,22.06
2512,22.05
2513,21.98
2514,21.93
2515,21.93
2516,21.98
2517,22.03
2518,22.09
2519,22.15
2520,22.23
2521,22.29
2522,22.29
2523,22.19
2524,22.06
2525,21.94
2526,21.83
2527,21.74
2528,21.71
2529,21.80
2530,22.01
2531,22.31
2532,22.64
2533,22.94
2534,23.22
2535,23.39
2536,23.44
2537,23.37
2538,23.28
2539,23.24
2540,23.28
2541,23.38
2542,23.52
2543,23.70
2544,23.88
2545,24.01
2546,24.02
2547,23.94
2548,23.77
2549,23.55
2550,23.32
2551,23.09
2552,22.86
2553,22.62
2554,22.34
2555,22.06
2556,21.74
2557,21.42
2558,21.03
2559,20.65
2560,20.32
2561,20.09
2562,19.85
2563,19.61
2564,19.33
2565,19.06
2566,18.76
2567,18.48
2568,18.20
2569,17.97
2570,17.72
2571,17.46
2572,17.18
2573,16.91
2574,16.64
2575,16.37
2576,16.11
2577,15.87
2578,15.65
2579,15.51
2580,15.45
2581,15.49
2582,15.56
2583,15.66
2584,15.75
2585,15.87
2586,16.02
2587,16.17
2588,16.31
2589,16.46
2590,16.63
2591,16.84
2592,17.05
2593,17.23
2594,17.40
2595,17.57
2596,17.76
2597,17.96
2598,18.20
2599,18.46
2600,18.78
2601,19.10
2602,19.45
2603,19.83
2604,20.29
2605,20.75
2606,21.25
2607,21.68
2608,22.09
2609,22.46
2610,22.84
2611,23.19
2612,23.57
2613,23.94
2614,24.38
2615,24.84
2616,25.38
2617,25.94
2618,26.51
2619,27.02
2620,27.47
2621,27.82
2622,28.09
2623,28.26
2624,28.37
2625,28.42
2626,28.48
2627,28.55
2628,28.69
2629,28.87
2630,29.10
2631,29.34
2632,29.56
2633,29.71
2634,29.77
2635,29.74
2636,29.63
2637,29.44
2638,29.20
2639,28.93
2640,28.67
2641,28.40
2642,28.08
2643,27.73
2644,27.37
2645,27.07
2646,26.81
2647,26.60
2648,26.50
2649,26.55
2650,26.76
2651,27.11
2652,27.53
2653,27.95
2654,28.27
2655,28.47
2656,28.53
2657,28.46
2658,28.26
2659,27.99
2660,27.76
2661,27.60
2662,27.47
2663,27.37
2664,27.28
2665,27.22
2666,27.15
2667,27.04
2668,26.86
2669,26.65
2670,26.42
2671,26.22
2672,26.02
2673,25.81
2674,25.58
2675,25.35
2676,25.10
2677,24.84
2678,24.52
2679,24.18
2680,23.77
2681,23.36
2682,22.92
2683,22.48
2684,22.02
2685,21.58
2686,21.13
2687,20.73
2688,20.31
2689,19.91
2690,19.44
2691,18.97
2692,18.49
2693,18.05
2694,17.64
2695,17.32
2696,17.07
2697,16.96
2698,16.95
2699,17.02
2700,17.11
2701,17.18
2702,17.20
2703,17.20
2704,17.16
2705,17.14
2706,17.14
2707,17.20
2708,17.28
2709,17.39
2710,17.48
2711,17.52
2712,17.41
2713,17.14
2714,16.76
2715,16.34
2716,15.88
2717,15.41
2718,14.92
2719,14.47
2720,14.08
2721,13.77
2722,13.45
2723,13.14
2724,12.79
2725,12.47
2726,12.15
2727,11.86
2728,11.58
2729,11.31
2730,11.02
2731,10.74
2732,10.44
2733,10.14
2734,9.82
2735,9.53
2736,9.29
2737,9.17
2738,9.13
2739,9.18
2740,9.26
2741,9.35
2742,9.41
2743,9.38
2744,9.28
2745,9.19
2746,9.12
2747,9.12
2748,9.21
2749,9.35
2750,9.56
2751,9.80
2752,10.06
2753,10.33
2754,10.58
2755,10.79
2756,10.97
2757,11.14
2758,11.34
2759,11.57
2760,11.87
2761,12.19
2762,12.56
2763,12.95
2764,13.37
2765,13.78
2766,14.17
2767,14.50
2768,14.77
2769,14.97
2770,15.11
2771,15.19
2772,15.27
2773,15.36
2774,15.46
2775,15.55
2776,15.66
2777,15.76
2778,15.88
2779,15.96
2780,16.04
2781,16.10
2782,16.14
2783,16.20
2784,16.30
2785,16.48
2786,16.72
2787,16.99
2788,17.27
2789,17.49
2790,17.70
2791,17.85
2792,17.97
2793,18.07
2794,18.23
2795,18.46
2796,18.81
2797,19.26
2798,19.77
2799,20.25
2800,20.68
2801,20.99
2802,21.21
2803,21.38
2804,21.59
2805,21.85
2806,22.17
2807,22.48
2808,22.85
2809,23.25
2810,23.63
2811,23.90
2812,24.01
2813,24.00
2814,23.97
2815,23.93
2816,23.87
2817,23.80
2818,23.72
2819,23.66
2820,23.57
2821,23.43
2822,23.22
2823,22.95
2824,22.59
2825,22.19
2826,21.73
2827,21.26
2828,20.71
2829,20.13
2830,19.50
2831,18.91
2832,18.32
2833,17.77
2834,17.21
2835,16.73
2836,16.24
2837,15.75
2838,15.17
2839,14.60
2840,13.98
2841,13.43
2842,12.86
2843,12.35
2844,11.80
2845,11.28
2846,10.70
2847,10.09
2848,9.41
2849,8.73
2850,8.05
2851,7.46
2852,6.94
2853,6.56
2854,6.30
2855,6.16
2856,6.07
2857,6.00
2858,5.87
2859,5.66
2860,5.37
2861,5.07
2862,4.81
2863,4.66
2864,4.62
2865,4.69
2866,4.83
2867,5.00
2868,5.20
2869,5.38
2870,5.55
2871,5.73
2872,5.91
2873,6.12
2874,6.37
2875,6.64
2876,6.88
2877,7.03
2878,7.11
2879,7.10
2880,7.05
2881,6.98
2882,6.96
2883,7.02
2884,7.16
2885,7.34
2886,7.50
2887,7.60
2888,7.61
2889,7.55
2890,7.41
2891,7.23
2892,7.06
2893,6.94
2894,6.86
2895,6.81
2896,6.75
2897,6.66
2898,6.53
2899,6.34
2900,6.12
2901,5.91
2902,5.76
2903,5.73
2904,5.81
2905,5.99
2906,6.24
2907,6.55
2908,6.90
2909,7.25
2910,7.58
2911,7.85
2912,8.08
2913,8.25
2914,8.39
2915,8.51
2916,8.64
2917,8.78
2918,8.95
2919,9.12
2920,9.32
2921,9.56
2922,9.83
2923,10.11
2924,10.35
2925,10.52
2926,10.64
2927,10.72
2928,10.81
2929,10.93
2930,11.09
2931,11.27
2932,11.44
2933,11.63
2934,11.83
2935,12.01
2936,12.12
2937,12.16
2938,12.12
2939,12.06
2940,11.97
2941,11.86
2942,11.70
2943,11.53
2944,11.31
2945,11.05
2946,10.70
2947,10.25
2948,9.73
2949,9.20
2950,8.66
2951,8.12
2952,7.56
2953,7.07
2954,6.63
2955,6.26
2956,5.85
2957,5.45
2958,5.04
2959,4.68
2960,4.33
2961,4.01
2962,3.73
2963,3.59
2964,3.56
2965,3.61
2966,3.64
2967,3.65
2968,3.59
2969,3.44
2970,3.17
2971,2.82
2972,2.39
2973,1.94
2974,1.50
2975,1.14
2976,0.89
2977,0.75
2978,0.66
2979,0.60
2980,0.59
2981,0.62
2982,0.68
2983,0.77
2984,0.89
2985,1.04
2986,1.21
2987,1.36
2988,1.46
2989,1.52
2990,1.56
2991,1.63
2992,1.69
2993,1.75
2994,1.81
2995,1.84
2996,1.85
2997,1.82
2998,1.73
2999,1.61
3000,1.46
3001,1.31
3002,1.19
3003,1.12
3004,1.15
3005,1.27
3006,1.46
3007,1.67
3008,1.89
3009,2.10
3010,2.27
3011,2.39
3012,2.47
3013,2.53
3014,2.56
3015,2.59
3016,2.63
3017,2.69
3018,2.77
3019,2.85
3020,2.98
3021,3.13
3022,3.30
3023,3.45
3024,3.54
3025,3.61
3026,3.68
3027,3.77
3028,3.81
3029,3.79
3030,3.70
3031,3.56
3032,3.33
3033,3.00
3034,2.56
3035,2.09
3036,1.63
3037,1.21
3038,0.79
3039,0.43
3040,0.08
3041,-0.22
3042,-0.53
3043,-0.83
3044,-1.21
3045,-1.62
3046,-2.12
3047,-2.64
3048,-3.18
3049,-3.65
3050,-4.11
3051,-4.48
3052,-4.79
3053,-4.99
3054,-5.16
3055,-5.32
3056,-5.55
3057,-5.81
3058,-6.10
3059,-6.40
3060,-6.74
3061,-7.10
3062,-7.43
3063,-7.71
3064,-7.90
3065,-7.98
3066,-7.97
3067,-7.88
3068,-7.72
3069,-7.51
3070,-7.26
3071,-7.00
3072,-6.73
3073,-6.52
3074,-6.37
3075,-6.26
3076,-6.13
3077,-5.99
3078,-5.83
3079,-5.65
3080,-5.42
3081,-5.20
3082,-4.97
3083,-4.81
3084,-4.60
3085,-4.38
3086,-4.10
3087,-3.78
3088,-3.34
3089,-2.85
3090,-2.30
3091,-1.78
3092,-1.22
3093,-0.70
3094,-0.16
3095,0.33
3096,0.85
3097,1.40
3098,2.07
3099,2.71
3100,3.32
3101,3.81
3102,4.29
3103,4.71
3104,5.13
3105,5.50
3106,5.93
3107,6.42
3108,7.04
3109,7.66
3110,8.26
3111,8.72
3112,9.12
3113,9.43
3114,9.70
3115,9.90
3116,10.09
3117,10.28
3118,10.57
3119,10.92
3120,11.33
3121,11.76
3122,12.18
3123,12.53
3124,12.77
3125,12.89
3126,12.93
3127,12.92
3128,12.87
3129,12.78
3130,12.70
3131,12.66
3132,12.70
3133,12.78
3134,12.93
3135,13.11
3136,13.31
3137,13.46
3138,13.52
3139,13.50
3140,13.37
3141,13.17
3142,12.86
3143,12.51
3144,12.14
3145,11.81
3146,11.51
3147,11.29
3148,11.11
3149,10.99
3150,10.88
3151,10.76
3152,10.53
3153,10.21
3154,9.74
3155,9.19
3156,8.54
3157,7.89
3158,7.20
3159,6.55
3160,5.95
3161,5.49
3162,5.11
3163,4.84
3164,4.55
3165,4.30
3166,4.01
3167,3.73
3168,3.40
3169,3.02
3170,2.53
3171,2.01
3172,1.43
3173,0.92
3174,0.40
3175,-0.03
3176,-0.45
3177,-0.79
3178,-1.14
3179,-1.51
3180,-1.98
3181,-2.51
3182,-3.11
3183,-3.70
3184,-4.30
3185,-4.83
3186,-5.29
3187,-5.58
3188,-5.72
3189,-5.74
3190,-5.73
3191,-5.68
3192,-5.64
3193,-5.61
3194,-5.65
3195,-5.73
3196,-5.83
3197,-5.90
3198,-5.92
3199,-5.89
3200,-5.77
3201,-5.59
3202,-5.40
3203,-5.28
3204,-5.21
3205,-5.17
3206,-5.09
3207,-4.98
3208,-4.80
3209,-4.53
3210,-4.14
3211,-3.66
3212,-3.15
3213,-2.68
3214,-2.21
3215,-1.78
3216,-1.33
3217,-0.92
3218,-0.53
3219,-0.17
3220,0.16
3221,0.40
3222,0.51
3223,0.47
3224,0.34
3225,0.18
3226,0.05
3227,-0.07
3228,-0.18
3229,-0.27
3230,-0.33
3231,-0.33
3232,-0.28
3233,-0.22
3234,-0.16
3235,-0.10
3236,-0.02
3237,0.04
3238,0.06
3239,0.06
3240,0.05
3241,0.05
3242,0.05
3243,0.02
3244,-0.02
3245,-0.09
3246,-0.16
3247,-0.21
3248,-0.27
3249,-0.32
3250,-0.43
3251,-0.60
3252,-0.84
3253,-1.10
3254,-1.42
3255,-1.77
3256,-2.18
3257,-2.59
3258,-3.01
3259,-3.43
3260,-3.85
3261,-4.20
3262,-4.47
3263,-4.64
3264,-4.79
3265,-4.93
3266,-5.08
3267,-5.23
3268,-5.40
3269,-5.61
3270,-5.84
3271,-6.05
3272,-6.22
3273,-6.37
3274,-6.52
3275,-6.65
3276,-6.68
3277,-6.61
3278,-6.51
3279,-6.39
3280,-6.24
3281,-6.03
3282,-5.77
3283,-5.48
3284,-5.12
3285,-4.71
3286,-4.23
3287,-3.73
3288,-3.21
3289,-2.75
3290,-2.26
3291,-1.80
3292,-1.33
3293,-0.89
3294,-0.41
3295,0.08
3296,0.62
3297,1.15
3298,1.71
3299,2.20
3300,2.66
3301,3.01
3302,3.29
3303,3.45
3304,3.54
3305,3.56
3306,3.60
3307,3.68
3308,3.83
3309,4.01
3310,4.20
3311,4.41
3312,4.63
3313,4.84
3314,5.03
3315,5.18
3316,5.29
3317,5.35
3318,5.35
3319,5.29
3320,5.18
3321,5.03
3322,4.83
3323,4.60
3324,4.31
3325,3.99
3326,3.60
3327,3.20
3328,2.76
3329,2.35
3330,1.91
3331,1.51
3332,1.11
3333,0.77
3334,0.40
3335,0.03
3336,-0.41
3337,-0.88
3338,-1.40
3339,-1.91
3340,-2.40
3341,-2.80
3342,-3.15
3343,-3.38
3344,-3.52
3345,-3.56
3346,-3.62
3347,-3.69
3348,-3.83
3349,-3.98
3350,-4.14
3351,-4.26
3352,-4.32
3353,-4.29
3354,-4.16
3355,-3.98
3356,-3.79
3357,-3.60
3358,-3.43
3359,-3.29
3360,-3.19
3361,-3.14
3362,-3.04
3363,-2.88
3364,-2.61
3365,-2.28
3366,-1.89
3367,-1.50
3368,-1.14
3369,-0.89
3370,-0.72
3371,-0.66
3372,-0.67
3373,-0.75
3374,-0.82
3375,-0.83
3376,-0.68
3377,-0.40
3378,0.02
3379,0.47
3380,0.96
3381,1.40
3382,1.75
3383,1.98
3384,2.17
3385,2.36
3386,2.62
3387,2.92
3388,3.28
3389,3.65
3390,4.07
3391,4.48
3392,4.91
3393,5.28
3394,5.64
3395,5.95
3396,6.30
3397,6.65
3398,7.03
3399,7.41
3400,7.83
3401,8.27
3402,8.74
3403,9.19
3404,9.60
3405,9.95
3406,10.28
3407,10.57
3408,10.85
3409,11.08
3410,11.30
3411,11.47
3412,11.59
3413,11.62
3414,11.57
3415,11.45
3416,11.28
3417,11.08
3418,10.80
3419,10.48
3420,10.10
3421,9.73
3422,9.32
3423,8.89
3424,8.33
3425,7.69
3426,6.93
3427,6.13
3428,5.27
3429,4.45
3430,3.64
3431,2.96
3432,2.40
3433,2.04
3434,1.75
3435,1.53
3436,1.27
3437,1.02
3438,0.73
3439,0.44
3440,0.11
3441,-0.18
3442,-0.42
3443,-0.56
3444,-0.63
3445,-0.65
3446,-0.67
3447,-0.72
3448,-0.88
3449,-1.11
3450,-1.40
3451,-1.70
3452,-2.01
3453,-2.30
3454,-2.59
3455,-2.86
3456,-3.11
3457,-3.34
3458,-3.59
3459,-3.82
3460,-4.05
3461,-4.22
3462,-4.35
3463,-4.43
3464,-4.52
3465,-4.60
3466,-4.70
3467,-4.81
3468,-4.98
3469,-5.18
3470,-5.42
3471,-5.63
3472,-5.81
3473,-5.94
3474,-6.09
3475,-6.26
3476,-6.51
3477,-6.79
3478,-7.16
3479,-7.57
3480,-8.06
3481,-8.57
3482,-9.06
3483,-9.45
3484,-9.73
3485,-9.90
3486,-9.99
3487,-10.06
3488,-10.11
3489,-10.14
3490,-10.11
3491,-10.03
3492,-9.89
3493,-9.70
3494,-9.45
3495,-9.10
3496,-8.65
3497,-8.16
3498,-7.70
3499,-7.31
3500,-7.00
3501,-6.81
3502,-6.68
3503,-6.59
3504,-6.50
3505,-6.39
3506,-6.23
3507,-6.05
3508,-5.86
3509,-5.68
3510,-5.52
3511,-5.39
3512,-5.35
3513,-5.42
3514,-5.55
3515,-5.71
3516,-5.85
3517,-5.97
3518,-6.06
3519,-6.10
3520,-6.16
3521,-6.21
3522,-6.33
3523,-6.52
3524,-6.83
3525,-7.22
3526,-7.71
3527,-8.24
3528,-8.79
3529,-9.26
3530,-9.65
3531,-9.94
3532,-10.20
3533,-10.43
3534,-10.65
3535,-10.86
3536,-11.09
3537,-11.35
3538,-11.66
3539,-11.95
3540,-12.23
3541,-12.47
3542,-12.66
3543,-12.78
3544,-12.82
3545,-12.75
3546,-12.62
3547,-12.44
3548,-12.23
3549,-12.01
3550,-11.81
3551,-11.67
3552,-11.58
3553,-11.53
3554,-11.45
3555,-11.37
3556,-11.27
3557,-11.18
3558,-11.09
3559,-11.02
3560,-10.92
3561,-10.86
3562,-10.83
3563,-10.84
3564,-10.85
3565,-10.80
3566,-10.60
3567,-10.28
3568,-9.84
3569,-9.33
3570,-8.76
3571,-8.20
3572,-7.68
3573,-7.28
3574,-6.91
3575,-6.58
3576,-6.20
3577,-5.81
3578,-5.39
3579,-4.98
3580,-4.55
3581,-4.15
3582,-3.72
3583,-3.31
3584,-2.89
3585,-2.51
3586,-2.15
3587,-1.82
3588,-1.50
3589,-1.24
3590,-1.05
3591,-0.98
3592,-0.95
3593,-0.92
3594,-0.87
3595,-0.81
3596,-0.76
3597,-0.72
3598,-0.71
3599,-0.72
3600,-0.73
3601,-0.77
3602,-0.79
3603,-0.79
3604,-0.77
3605,-0.71
3606,-0.60
3607,-0.45
3608,-0.27
3609,-0.13
3610,-0.02
3611,0.08
3612,0.17
3613,0.24
3614,0.32
3615,0.38
3616,0.44
3617,0.50
3618,0.56
3619,0.59
3620,0.60
3621,0.61
3622,0.57
3623,0.48
3624,0.32
3625,0.11
3626,-0.11
3627,-0.36
3628,-0.62
3629,-0.89
3630,-1.14
3631,-1.34
3632,-1.53
3633,-1.66
3634,-1.77
3635,-1.85
3636,-1.98
3637,-2.16
3638,-2.38
3639,-2.62
3640,-2.88
3641,-3.11
3642,-3.33
3643,-3.49
3644,-3.65
3645,-3.83
3646,-4.05
3647,-4.29
3648,-4.53
3649,-4.77
3650,-5.03
3651,-5.29
3652,-5.55
3653,-5.75
3654,-5.93
3655,-6.07
3656,-6.21
3657,-6.33
3658,-6.43
3659,-6.48
3660,-6.48
3661,-6.43
3662,-6.33
3663,-6.22
3664,-6.07
3665,-5.86
3666,-5.58
3667,-5.22
3668,-4.80
3669,-4.36
3670,-3.88
3671,-3.40
3672,-2.94
3673,-2.59
3674,-2.34
3675,-2.23
3676,-2.19
3677,-2.20
3678,-2.21
3679,-2.19
3680,-2.08
3681,-1.87
3682,-1.59
3683,-1.31
3684,-1.08
3685,-0.95
3686,-0.88
3687,-0.89
3688,-0.94
3689,-1.03
3690,-1.12
3691,-1.19
3692,-1.17
3693,-1.08
3694,-0.94
3695,-0.79
3696,-0.66
3697,-0.57
3698,-0.52
3699,-0.51
3700,-0.58
3701,-0.73
3702,-0.96
3703,-1.23
3704,-1.53
3705,-1.85
3706,-2.24
3707,-2.62
3708,-2.97
3709,-3.23
3710,-3.46
3711,-3.65
3712,-3.85
3713,-4.04
3714,-4.21
3715,-4.36
3716,-4.46
3717,-4.52
3718,-4.55
3719,-4.55
3720,-4.51
3721,-4.42
3722,-4.30
3723,-4.17
3724,-4.07
3725,-4.04
3726,-4.08
3727,-4.14
3728,-4.19
3729,-4.22
3730,-4.25
3731,-4.31
3732,-4.39
3733,-4.46
3734,-4.48
3735,-4.51
3736,-4.59
3737,-4.74
3738,-4.90
3739,-5.03
3740,-5.12
3741,-5.14
3742,-5.09
3743,-4.97
3744,-4.83
3745,-4.70
3746,-4.59
3747,-4.51
3748,-4.47
3749,-4.47
3750,-4.47
3751,-4.49
3752,-4.49
3753,-4.49
3754,-4.43
3755,-4.33
3756,-4.15
3757,-3.94
3758,-3.68
3759,-3.40
3760,-3.07
3761,-2.75
3762,-2.37
3763,-1.96
3764,-1.51
3765,-1.08
3766,-0.61
3767,-0.14
3768,0.36
3769,0.80
3770,1.18
3771,1.46
3772,1.74
3773,1.98
3774,2.28
3775,2.57
3776,2.90
3777,3.21
3778,3.56
3779,3.91
3780,4.30
3781,4.68
3782,5.07
3783,5.42
3784,5.76
3785,6.06
3786,6.30
3787,6.48
3788,6.61
3789,6.63
3790,6.56
3791,6.41
3792,6.21
3793,6.00
3794,5.78
3795,5.57
3796,5.40
3797,5.29
3798,5.17
3799,5.04
3800,4.84
3801,4.68
3802,4.49
3803,4.30
3804,4.01
3805,3.64
3806,3.14
3807,2.59
3808,1.91
3809,1.19
3810,0.34
3811,-0.50
3812,-1.42
3813,-2.29
3814,-3.20
3815,-4.10
3816,-5.10
3817,-6.08
3818,-7.14
3819,-8.17
3820,-9.25
3821,-10.23
3822,-11.18
3823,-11.96
3824,-12.70
3825,-13.29
3826,-13.86
3827,-14.35
3828,-14.86
3829,-15.35
3830,-15.87
3831,-16.34
3832,-16.77
3833,-17.10
3834,-17.31
3835,-17.36
3836,-17.26
3837,-17.02
3838,-16.70
3839,-16.36
3840,-16.05
3841,-15.82
3842,-15.66
3843,-15.55
3844,-15.41
3845,-15.21
3846,-14.90
3847,-14.52
3848,-14.05
3849,-13.53
3850,-13.03
3851,-12.62
3852,-12.31
3853,-12.12
3854,-11.93
3855,-11.77
3856,-11.60
3857,-11.45
3858,-11.28
3859,-11.12
3860,-10.93
3861,-10.72
3862,-10.48
3863,-10.22
3864,-9.92
3865,-9.61
3866,-9.22
3867,-8.80
3868,-8.37
3869,-8.01
3870,-7.74
3871,-7.57
3872,-7.47
3873,-7.42
3874,-7.35
3875,-7.28
3876,-7.13
3877,-6.94
3878,-6.65
3879,-6.32
3880,-5.96
3881,-5.65
3882,-5.34
3883,-5.05
3884,-4.71
3885,-4.36
3886,-4.01
3887,-3.68
3888,-3.34
3889,-2.99
3890,-2.63
3891,-2.33
3892,-2.09
3893,-1.92
3894,-1.79
3895,-1.66
3896,-1.54
3897,-1.46
3898,-1.43
3899,-1.46
3900,-1.50
3901,-1.54
3902,-1.59
3903,-1.68
3904,-1.79
3905,-1.90
3906,-2.05
3907,-2.26
3908,-2.52
3909,-2.79
3910,-3.04
3911,-3.22
3912,-3.34
3913,-3.40
3914,-3.40
3915,-3.37
3916,-3.33
3917,-3.30
3918,-3.28
3919,-3.29
3920,-3.29
3921,-3.26
3922,-3.17
3923,-3.05
3924,-2.91
3925,-2.76
3926,-2.62
3927,-2.49
3928,-2.41
3929,-2.38
3930,-2.40
3931,-2.46
3932,-2.56
3933,-2.68
3934,-2.82
3935,-2.97
3936,-3.11
3937,-3.23
3938,-3.33
3939,-3.43
3940,-3.48
3941,-3.49
3942,-3.42
3943,-3.27
3944,-3.06
3945,-2.82
3946,-2.56
3947,-2.31
3948,-2.11
3949,-2.00
3950,-1.96
3951,-1.99
3952,-2.07
3953,-2.18
3954,-2.35
3955,-2.53
3956,-2.71
3957,-2.88
3958,-3.08
3959,-3.28
3960,-3.51
3961,-3.74
3962,-4.04
3963,-4.38
3964,-4.81
3965,-5.25
3966,-5.72
3967,-6.13
3968,-6.49
3969,-6.78
3970,-7.06
3971,-7.32
3972,-7.57
3973,-7.80
3974,-8.07
3975,-8.32
3976,-8.56
3977,-8.71
3978,-8.83
3979,-8.90
3980,-8.95
3981,-9.00
3982,-9.15
3983,-9.38
3984,-9.70
3985,-10.06
3986,-10.46
3987,-10.85
3988,-11.17
3989,-11.34
3990,-11.38
3991,-11.32
3992,-11.20
3993,-11.05
3994,-10.88
3995,-10.73
3996,-10.60
3997,-10.49
3998,-10.35
3999,-10.18
4000,-9.96
4001,-9.71
4002,-9.45
4003,-9.19
4004,-8.93
4005,-8.69
4006,-8.47
4007,-8.29
4008,-8.16
4009,-8.11
4010,-8.11
4011,-8.17
4012,-8.28
4013,-8.43
4014,-8.61
4015,-8.76
4016,-8.85
4017,-8.86
4018,-8.79
4019,-8.69
4020,-8.60
4021,-8.54
4022,-8.52
4023,-8.56
4024,-8.61
4025,-8.69
4026,-8.71
4027,-8.66
4028,-8.48
4029,-8.19
4030,-7.77
4031,-7.30
4032,-6.75
4033,-6.19
4034,-5.63
4035,-5.17
4036,-4.75
4037,-4.44
4038,-4.15
4039,-3.93
4040,-3.72
4041,-3.56
4042,-3.34
4043,-3.11
4044,-2.84
4045,-2.58
4046,-2.30
4047,-2.00
4048,-1.69
4049,-1.42
4050,-1.23
4051,-1.14
4052,-1.13
4053,-1.22
4054,-1.43
4055,-1.77
4056,-2.17
4057,-2.53
4058,-2.82
4059,-3.04
4060,-3.28
4061,-3.54
4062,-3.85
4063,-4.17
4064,-4.53
4065,-4.91
4066,-5.36
4067,-5.76
4068,-6.13
4069,-6.41
4070,-6.71
4071,-7.01
4072,-7.42
4073,-7.86
4074,-8.38
4075,-8.90
4076,-9.45
4077,-9.91
4078,-10.31
4079,-10.60
4080,-10.84
4081,-11.02
4082,-11.15
4083,-11.26
4084,-11.39
4085,-11.54
4086,-11.70
4087,-11.79
4088,-11.78
4089,-11.65
4090,-11.45
4091,-11.21
4092,-10.96
4093,-10.71
4094,-10.50
4095,-10.35
4096,-10.28
4097,-10.28
4098,-10.33
4099,-10.39
4100,-10.45
4101,-10.51
4102,-10.58
4103,-10.63
4104,-10.67
4105,-10.73
4106,-10.85
4107,-10.99
4108,-11.15
4109,-11.30
4110,-11.47
4111,-11.64
4112,-11.82
4113,-11.96
4114,-12.10
4115,-12.25
4116,-12.42
4117,-12.59
4118,-12.77
4119,-12.95
4120,-13.15
4121,-13.33
4122,-13.45
4123,-13.50
4124,-13.55
4125,-13.60
4126,-13.66
4127,-13.73
4128,-13.80
4129,-13.89
4130,-13.98
4131,-14.05
4132,-14.08
4133,-14.11
4134,-14.14
4135,-14.14
4136,-14.10
4137,-14.05
4138,-13.97
4139,-13.89
4140,-13.73
4141,-13.47
4142,-13.08
4143,-12.63
4144,-12.15
4145,-11.67
4146,-11.20
4147,-10.76
4148,-10.34
4149,-9.96
4150,-9.57
4151,-9.20
4152,-8.77
4153,-8.33
4154,-7.87
4155,-7.46
4156,-7.09
4157,-6.80
4158,-6.55
4159,-6.39
4160,-6.26
4161,-6.22
4162,-6.18
4163,-6.16
4164,-6.10
4165,-6.08
4166,-6.10
4167,-6.16
4168,-6.22
4169,-6.26
4170,-6.26
4171,-6.23
4172,-6.13
4173,-5.96
4174,-5.72
4175,-5.46
4176,-5.26
4177,-5.14
4178,-5.13
4179,-5.19
4180,-5.29
4181,-5.44
4182,-5.67
4183,-5.96
4184,-6.29
4185,-6.66
4186,-7.08
4187,-7.51
4188,-7.94
4189,-8.30
4190,-8.62
4191,-8.88
4192,-9.09
4193,-9.20
4194,-9.28
4195,-9.32
4196,-9.38
4197,-9.44
4198,-9.50
4199,-9.53
4200,-9.52
4201,-9.46
4202,-9.35
4203,-9.23
4204,-9.12
4205,-9.03
4206,-8.95
4207,-8.92
4208,-8.98
4209,-9.13
4210,-9.32
4211,-9.48
4212,-9.57
4213,-9.63
4214,-9.67
4215,-9.70
4216,-9.71
4217,-9.70
4218,-9.74
4219,-9.83
4220,-9.97
4221,-10.12
4222,-10.22
4223,-10.25
4224,-10.23
4225,-10.14
4226,-9.98
4227,-9.77
4228,-9.54
4229,-9.36
4230,-9.25
4231,-9.19
4232,-9.16
4233,-9.14
4234,-9.09
4235,-9.04
4236,-8.94
4237,-8.83
4238,-8.69
4239,-8.54
4240,-8.38
4241,-8.22
4242,-8.00
4243,-7.74
4244,-7.38
4245,-6.97
4246,-6.49
4247,-5.98
4248,-5.44
4249,-4.97
4250,-4.61
4251,-4.34
4252,-4.09
4253,-3.87
4254,-3.68
4255,-3.53
4256,-3.33
4257,-3.08
4258,-2.79
4259,-2.54
4260,-2.33
4261,-2.20
4262,-2.14
4263,-2.14
4264,-2.14
4265,-2.15
4266,-2.17
4267,-2.19
4268,-2.20
4269,-2.17
4270,-2.16
4271,-2.20
4272,-2.35
4273,-2.56
4274,-2.83
4275,-3.16
4276,-3.52
4277,-3.85
4278,-4.10
4279,-4.25
4280,-4.35
4281,-4.39
4282,-4.41
4283,-4.42
4284,-4.45
4285,-4.50
4286,-4.56
4287,-4.62
4288,-4.70
4289,-4.76
4290,-4.75
4291,-4.63
4292,-4.45
4293,-4.26
4294,-4.09
4295,-3.94
4296,-3.81
4297,-3.72
4298,-3.68
4299,-3.68
4300,-3.69
4301,-3.69
4302,-3.70
4303,-3.72
4304,-3.79
4305,-3.91
4306,-4.10
4307,-4.37
4308,-4.69
4309,-5.00
4310,-5.24
4311,-5.39
4312,-5.44
4313,-5.40
4314,-5.31
4315,-5.19
4316,-5.07
4317,-4.99
4318,-4.92
4319,-4.86
4320,-4.80
4321,-4.75
4322,-4.68
4323,-4.60
4324,-4.46
4325,-4.27
4326,-4.08
4327,-3.90
4328,-3.72
4329,-3.58
4330,-3.47
4331,-3.45
4332,-3.47
4333,-3.51
4334,-3.52
4335,-3.52
4336,-3.51
4337,-3.52
4338,-3.52
4339,-3.49
4340,-3.41
4341,-3.30
4342,-3.17
4343,-3.09
4344,-2.99
4345,-2.88
4346,-2.74
4347,-2.63
4348,-2.51
4349,-2.33
4350,-2.07
4351,-1.77
4352,-1.49
4353,-1.25
4354,-1.01
4355,-0.75
4356,-0.47
4357,-0.21
4358,0.10
4359,0.41
4360,0.76
4361,1.08
4362,1.40
4363,1.66
4364,1.89
4365,2.06
4366,2.21
4367,2.32
4368,2.43
4369,2.59
4370,2.78
4371,3.03
4372,3.26
4373,3.42
4374,3.47
4375,3.41
4376,3.21
4377,2.92
4378,2.54
4379,2.11
4380,1.57
4381,1.01
4382,0.43
4383,-0.11
4384,-0.63
4385,-1.15
4386,-1.73
4387,-2.32
4388,-2.94
4389,-3.53
4390,-4.10
4391,-4.57
4392,-4.95
4393,-5.23
4394,-5.52
4395,-5.77
4396,-6.03
4397,-6.26
4398,-6.54
4399,-6.79
4400,-7.01
4401,-7.13
4402,-7.18
4403,-7.10
4404,-6.92
4405,-6.68
4406,-6.46
4407,-6.36
4408,-6.41
4409,-6.56
4410,-6.80
4411,-7.10
4412,-7.45
4413,-7.74
4414,-7.94
4415,-8.03
4416,-8.06
4417,-8.09
4418,-8.13
4419,-8.16
4420,-8.18
4421,-8.19
4422,-8.15
4423,-8.03
4424,-7.78
4425,-7.43
4426,-7.00
4427,-6.55
4428,-6.10
4429,-5.68
4430,-5.31
4431,-5.02
4432,-4.75
4433,-4.50
4434,-4.19
4435,-3.84
4436,-3.43
4437,-3.04
4438,-2.69
4439,-2.43
4440,-2.25
4441,-2.18
4442,-2.12
4443,-2.11
4444,-2.10
4445,-2.11
4446,-2.05
4447,-1.88
4448,-1.56
4449,-1.21
4450,-0.84
4451,-0.49
4452,-0.11
4453,0.24
4454,0.54
4455,0.74
4456,0.91
4457,1.08
4458,1.30
4459,1.56
4460,1.90
4461,2.25
4462,2.62
4463,2.95
4464,3.21
4465,3.35
4466,3.40
4467,3.36
4468,3.30
4469,3.27
4470,3.27
4471,3.27
4472,3.27
4473,3.30
4474,3.38
4475,3.47
4476,3.52
4477,3.49
4478,3.41
4479,3.30
4480,3.11
4481,2.85
4482,2.48
4483,2.08
4484,1.61
4485,1.13
4486,0.63
4487,0.20
4488,-0.18
4489,-0.43
4490,-0.66
4491,-0.85
4492,-1.08
4493,-1.30
4494,-1.59
4495,-1.90
4496,-2.31
4497,-2.82
4498,-3.42
4499,-4.01
4500,-4.55
4501,-4.96
4502,-5.31
4503,-5.57
4504,-5.74
4505,-5.77
4506,-5.68
4507,-5.52
4508,-5.33
4509,-5.11
4510,-4.93
4511,-4.78
4512,-4.65
4513,-4.54
4514,-4.42
4515,-4.33
4516,-4.27
4517,-4.25
4518,-4.21
4519,-4.13
4520,-3.97
4521,-3.80
4522,-3.61
4523,-3.41
4524,-3.14
4525,-2.82
4526,-2.46
4527,-2.11
4528,-1.69
4529,-1.27
4530,-0.79
4531,-0.32
4532,0.22
4533,0.77
4534,1.34
4535,1.83
4536,2.32
4537,2.75
4538,3.17
4539,3.52
4540,3.85
4541,4.14
4542,4.43
4543,4.72
4544,5.05
4545,5.36
4546,5.70
4547,6.02
4548,6.37
4549,6.71
4550,7.07
4551,7.40
4552,7.71
4553,7.97
4554,8.18
4555,8.30
4556,8.35
4557,8.32
4558,8.19
4559,8.04
4560,7.92
4561,7.83
4562,7.74
4563,7.62
4564,7.48
4565,7.39
4566,7.37
4567,7.37
4568,7.36
4569,7.33
4570,7.31
4571,7.33
4572,7.42
4573,7.55
4574,7.67
4575,7.76
4576,7.80
4577,7.81
4578,7.77
4579,7.68
4580,7.55
4581,7.42
4582,7.32
4583,7.27
4584,7.27
4585,7.31
4586,7.32
4587,7.30
4588,7.19
4589,7.02
4590,6.77
4591,6.48
4592,6.12
4593,5.74
4594,5.33
4595,4.97
4596,4.55
4597,4.13
4598,3.59
4599,2.98
4600,2.24
4601,1.51
4602,0.77
4603,0.10
4604,-0.60
4605,-1.26
4606,-1.95
4607,-2.59
4608,-3.30
4609,-3.98
4610,-4.71
4611,-5.39
4612,-6.09
4613,-6.71
4614,-7.32
4615,-7.86
4616,-8.38
4617,-8.84
4618,-9.25
4619,-9.54
4620,-9.77
4621,-9.91
4622,-9.97
4623,-9.94
4624,-9.86
4625,-9.77
4626,-9.67
4627,-9.55
4628,-9.38
4629,-9.19
4630,-8.93
4631,-8.63
4632,-8.26
4633,-7.84
4634,-7.43
4635,-7.06
4636,-6.74
4637,-6.48
4638,-6.31
4639,-6.22
4640,-6.16
4641,-6.14
4642,-6.14
4643,-6.17
4644,-6.22
4645,-6.28
4646,-6.36
4647,-6.45
4648,-6.54
4649,-6.62
4650,-6.71
4651,-6.81
4652,-6.90
4653,-6.98
4654,-7.07
4655,-7.15
4656,-7.27
4657,-7.44
4658,-7.71
4659,-8.03
4660,-8.42
4661,-8.87
4662,-9.38
4663,-9.91
4664,-10.44
4665,-10.92
4666,-11.38
4667,-11.76
4668,-12.03
4669,-12.15
4670,-12.16
4671,-12.10
4672,-11.95
4673,-11.67
4674,-11.31
4675,-10.93
4676,-10.54
4677,-10.15
4678,-9.74
4679,-9.29
4680,-8.84
4681,-8.46
4682,-8.11
4683,-7.82
4684,-7.55
4685,-7.35
4686,-7.18
4687,-7.01
4688,-6.79
4689,-6.53
4690,-6.23
4691,-5.92
4692,-5.64
4693,-5.41
4694,-5.21
4695,-5.07
4696,-4.96
4697,-4.90
4698,-4.88
4699,-4.88
4700,-4.88
4701,-4.92
4702,-4.99
4703,-5.11
4704,-5.25
4705,-5.41
4706,-5.57
4707,-5.72
4708,-5.83
4709,-5.89
4710,-5.93
4711,-5.95
4712,-5.95
4713,-5.94
4714,-5.87
4715,-5.78
4716,-5.65
4717,-5.51
4718,-5.35
4719,-5.20
4720,-5.05
4721,-4.91
4722,-4.76
4723,-4.65
4724,-4.52
4725,-4.41
4726,-4.31
4727,-4.25
4728,-4.21
4729,-4.22
4730,-4.27
4731,-4.34
4732,-4.34
4733,-4.26
4734,-4.07
4735,-3.81
4736,-3.43
4737,-2.96
4738,-2.43
4739,-1.91
4740,-1.45
4741,-1.07
4742,-0.76
4743,-0.55
4744,-0.43
4745,-0.37
4746,-0.35
4747,-0.36
4748,-0.38
4749,-0.44
4750,-0.50
4751,-0.57
4752,-0.64
4753,-0.70
4754,-0.70
4755,-0.65
4756,-0.56
4757,-0.43
4758,-0.26
4759,-0.05
4760,0.14
4761,0.26
4762,0.31
4763,0.34
4764,0.36
4765,0.33
4766,0.21
4767,0.04
4768,-0.14
4769,-0.31
4770,-0.43
4771,-0.52
4772,-0.53
4773,-0.43
4774,-0.29
4775,-0.16
4776,-0.11
4777,-0.18
4778,-0.34
4779,-0.57
4780,-0.89
4781,-1.21
4782,-1.52
4783,-1.76
4784,-1.94
4785,-2.05
4786,-2.12
4787,-2.16
4788,-2.17
4789,-2.17
4790,-2.13
4791,-2.04
4792,-1.91
4793,-1.73
4794,-1.49
4795,-1.20
4796,-0.87
4797,-0.53
4798,-0.18
4799,0.18
4800,0.50
4801,0.76
4802,1.01
4803,1.27
4804,1.56
4805,1.82
4806,2.09
4807,2.36
4808,2.66
4809,2.91
4810,3.13
4811,3.27
4812,3.40
4813,3.50
4814,3.61
4815,3.68
4816,3.82
4817,4.01
4818,4.31
4819,4.67
4820,5.12
4821,5.58
4822,6.04
4823,6.46
4824,6.88
4825,7.28
4826,7.69
4827,8.06
4828,8.48
4829,8.91
4830,9.41
4831,9.91
4832,10.41
4833,10.82
4834,11.19
4835,11.47
4836,11.70
4837,11.88
4838,12.06
4839,12.26
4840,12.50
4841,12.73
4842,12.95
4843,13.14
4844,13.28
4845,13.34
4846,13.30
4847,13.21
4848,13.12
4849,13.09
4850,13.11
4851,13.15
4852,13.17
4853,13.18
4854,13.12
4855,13.05
4856,12.89
4857,12.63
4858,12.20
4859,11.68
4860,11.08
4861,10.50
4862,9.85
4863,9.19
4864,8.42
4865,7.67
4866,6.86
4867,6.07
4868,5.23
4869,4.45
4870,3.65
4871,2.89
4872,2.05
4873,1.21
4874,0.34
4875,-0.42
4876,-1.15
4877,-1.76
4878,-2.27
4879,-2.59
4880,-2.78
4881,-2.88
4882,-2.98
4883,-3.09
4884,-3.24
4885,-3.44
4886,-3.76
4887,-4.14
4888,-4.55
4889,-4.94
4890,-5.33
4891,-5.65
4892,-5.87
4893,-6.00
4894,-6.07
4895,-6.11
4896,-6.15
4897,-6.16
4898,-6.13
4899,-6.07
4900,-5.95
4901,-5.81
4902,-5.66
4903,-5.51
4904,-5.30
4905,-5.05
4906,-4.74
4907,-4.38
4908,-3.92
4909,-3.39
4910,-2.82
4911,-2.34
4912,-1.98
4913,-1.75
4914,-1.62
4915,-1.60
4916,-1.63
4917,-1.70
4918,-1.74
4919,-1.75
4920,-1.70
4921,-1.65
4922,-1.58
4923,-1.56
4924,-1.59
4925,-1.71
4926,-1.88
4927,-2.01
4928,-2.01
4929,-1.89
4930,-1.69
4931,-1.45
4932,-1.17
4933,-0.91
4934,-0.69
4935,-0.61
4936,-0.60
4937,-0.65
4938,-0.66
4939,-0.64
4940,-0.53
4941,-0.37
4942,-0.11
4943,0.19
4944,0.51
4945,0.78
4946,0.95
4947,1.01
4948,1.01
4949,0.94
4950,0.80
4951,0.63
4952,0.47
4953,0.34
4954,0.21
4955,0.08
4956,-0.05
4957,-0.18
4958,-0.34
4959,-0.54
4960,-0.76
4961,-0.96
4962,-1.21
4963,-1.50
4964,-1.84
4965,-2.16
4966,-2.49
4967,-2.78
4968,-3.05
4969,-3.28
4970,-3.52
4971,-3.75
4972,-4.03
4973,-4.32
4974,-4.62
4975,-4.89
4976,-5.13
4977,-5.33
4978,-5.52
4979,-5.66
4980,-5.79
4981,-5.94
4982,-6.13
4983,-6.37
4984,-6.62
4985,-6.81
4986,-6.88
4987,-6.82
4988,-6.62
4989,-6.32
4990,-5.95
4991,-5.59
4992,-5.28
4993,-5.04
4994,-4.87
4995,-4.77
4996,-4.67
4997,-4.56
4998,-4.36
4999,-4.07
5000,-3.68
5001,-3.27
5002,-2.80
5003,-2.37
5004,-1.97
5005,-1.69
5006,-1.44
5007,-1.22
5008,-0.92
5009,-0.58
5010,-0.13
5011,0.37
5012,0.95
5013,1.53
5014,2.15
5015,2.70
5016,3.23
5017,3.69
5018,4.15
5019,4.55
5020,4.96
5021,5.30
5022,5.64
5023,5.91
5024,6.10
5025,6.18
5026,6.16
5027,6.07
5028,5.97
5029,5.87
5030,5.80
5031,5.78
5032,5.78
5033,5.78
5034,5.74
5035,5.62
5036,5.42
5037,5.19
5038,4.91
5039,4.64
5040,4.39
5041,4.23
5042,4.13
5043,4.07
5044,3.98
5045,3.85
5046,3.64
5047,3.39
5048,3.11
5049,2.85
5050,2.62
5051,2.50
5052,2.49
5053,2.59
5054,2.78
5055,3.02
5056,3.25
5057,3.47
5058,3.68
5059,3.85
5060,3.95
5061,4.02
5062,4.09
5063,4.17
5064,4.23
5065,4.23
5066,4.20
5067,4.17
5068,4.17
5069,4.16
5070,4.14
5071,4.13
5072,4.24
5073,4.46
5074,4.79
5075,5.19
5076,5.68
5077,6.24
5078,6.81
5079,7.32
5080,7.78
5081,8.16
5082,8.47
5083,8.67
5084,8.83
5085,8.96
5086,9.14
5087,9.34
5088,9.58
5089,9.82
5090,10.04
5091,10.19
5092,10.27
5093,10.29
5094,10.28
5095,10.27
5096,10.32
5097,10.46
5098,10.75
5099,11.14
5100,11.58
5101,11.97
5102,12.28
5103,12.47
5104,12.61
5105,12.72
5106,12.88
5107,13.11
5108,13.46
5109,13.87
5110,14.34
5111,14.82
5112,15.28
5113,15.63
5114,15.85
5115,15.91
5116,15.85
5117,15.79
5118,15.76
5119,15.79
5120,15.86
5121,15.92
5122,15.97
5123,15.97
5124,15.90
5125,15.72
5126,15.43
5127,15.07
5128,14.69
5129,14.36
5130,14.09
5131,13.95
5132,13.93
5133,14.05
5134,14.27
5135,14.52
5136,14.73
5137,14.92
5138,15.05
5139,15.14
5140,15.16
5141,15.11
5142,15.00
5143,14.88
5144,14.76
5145,14.64
5146,14.50
5147,14.36
5148,14.21
5149,14.06
5150,13.89
5151,13.71
5152,13.54
5153,13.42
5154,13.35
5155,13.30
5156,13.21
5157,13.10
5158,12.97
5159,12.84
5160,12.72
5161,12.63
5162,12.60
5163,12.61
5164,12.60
5165,12.58
5166,12.54
5167,12.51
5168,12.46
5169,12.41
5170,12.37
5171,12.39
5172,12.48
5173,12.62
5174,12.72
5175,12.72
5176,12.57
5177,12.31
5178,11.96
5179,11.60
5180,11.25
5181,10.97
5182,10.83
5183,10.86
5184,11.07
5185,11.34
5186,11.57
5187,11.72
5188,11.84
5189,11.92
5190,11.95
5191,11.94
5192,12.02
5193,12.25
5194,12.63
5195,13.08
5196,13.58
5197,14.05
5198,14.48
5199,14.80
5200,15.05
5201,15.25
5202,15.45
5203,15.65
5204,15.89
5205,16.14
5206,16.47
5207,16.82
5208,17.20
5209,17.56
5210,17.90
5211,18.21
5212,18.57
5213,18.92
5214,19.27
5215,19.59
5216,19.94
5217,20.26
5218,20.54
5219,20.71
5220,20.81
5221,20.86
5222,20.94
5223,21.09
5224,21.30
5225,21.55
5226,21.78
5227,21.97
5228,22.06
5229,22.03
5230,21.85
5231,21.50
5232,20.95
5233,20.29
5234,19.58
5235,18.94
5236,18.36
5237,17.92
5238,17.56
5239,17.31
5240,17.11
5241,16.94
5242,16.69
5243,16.39
5244,15.99
5245,15.58
5246,15.10
5247,14.65
5248,14.20
5249,13.82
5250,13.41
5251,13.02
5252,12.59
5253,12.15
5254,11.61
5255,11.03
5256,10.40
5257,9.78
5258,9.11
5259,8.43
5260,7.75
5261,7.16
5262,6.64
5263,6.20
5264,5.81
5265,5.53
5266,5.31
5267,5.17
5268,5.02
5269,4.88
5270,4.76
5271,4.66
5272,4.59
5273,4.56
5274,4.62
5275,4.76
5276,4.97
5277,5.22
5278,5.49
5279,5.79
5280,6.10
5281,6.36
5282,6.59
5283,6.79
5284,7.00
5285,7.23
5286,7.52
5287,7.84
5288,8.19
5289,8.52
5290,8.84
5291,9.09
5292,9.31
5293,9.46
5294,9.58
5295,9.67
5296,9.73
5297,9.77
5298,9.86
5299,10.04
5300,10.33
5301,10.65
5302,11.00
5303,11.32
5304,11.64
5305,11.93
5306,12.20
5307,12.44
5308,12.70
5309,12.98
5310,13.33
5311,13.72
5312,14.14
5313,14.52
5314,14.85
5315,15.07
5316,15.26
5317,15.40
5318,15.54
5319,15.65
5320,15.77
5321,15.91
5322,16.12
5323,16.36
5324,16.59
5325,16.77
5326,16.91
5327,17.01
5328,17.14
5329,17.23
5330,17.27
5331,17.27
5332,17.26
5333,17.25
5334,17.27
5335,17.30
5336,17.35
5337,17.37
5338,17.36
5339,17.33
5340,17.32
5341,17.34
5342,17.40
5343,17.47
5344,17.53
5345,17.56
5346,17.52
5347,17.42
5348,17.22
5349,16.95
5350,16.58
5351,16.17
5352,15.75
5353,15.35
5354,14.98
5355,14.66
5356,14.41
5357,14.26
5358,14.16
5359,14.08
5360,14.00
5361,13.94
5362,13.90
5363,13.90
5364,13.94
5365,14.00
5366,14.06
5367,14.13
5368,14.20
5369,14.29
5370,14.38
5371,14.44
5372,14.46
5373,14.43
5374,14.36
5375,14.23
5376,14.06
5377,13.89
5378,13.76
5379,13.72
5380,13.77
5381,13.95
5382,14.29
5383,14.70
5384,15.13
5385,15.49
5386,15.82
5387,16.11
5388,16.33
5389,16.49
5390,16.60
5391,16.69
5392,16.74
5393,16.76
5394,16.81
5395,16.90
5396,17.04
5397,17.17
5398,17.33
5399,17.52
5400,17.72
5401,17.87
5402,17.91
5403,17.81
5404,17.65
5405,17.46
5406,17.27
5407,17.12
5408,17.07
5409,17.13
5410,17.26
5411,17.39
5412,17.47
5413,17.50
5414,17.46
5415,17.35
5416,17.15
5417,16.94
5418,16.76
5419,16.71
5420,16.77
5421,16.89
5422,16.99
5423,17.04
5424,16.98
5425,16.84
5426,16.56
5427,16.18
5428,15.71
5429,15.23
5430,14.76
5431,14.38
5432,14.08
5433,13.92
5434,13.83
5435,13.82
5436,13.78
5437,13.69
5438,13.53
5439,13.33
5440,13.05
5441,12.76
5442,12.46
5443,12.16
5444,11.87
5445,11.63
5446,11.46
5447,11.34
5448,11.25
5449,11.20
5450,11.18
5451,11.22
5452,11.25
5453,11.26
5454,11.22
5455,11.16
5456,11.08
5457,10.99
5458,10.89
5459,10.80
5460,10.75
5461,10.72
5462,10.68
5463,10.62
5464,10.55
5465,10.48
5466,10.45
5467,10.44
5468,10.48
5469,10.57
5470,10.73
5471,10.90
5472,11.09
5473,11.26
5474,11.47
5475,11.73
5476,12.06
5477,12.38
5478,12.72
5479,13.06
5480,13.49
5481,13.95
5482,14.47
5483,14.96
5484,15.50
5485,16.02
5486,16.57
5487,17.03
5488,17.46
5489,17.83
5490,18.23
5491,18.63
5492,19.08
5493,19.55
5494,20.12
5495,20.75
5496,21.49
5497,22.26
5498,23.09
5499,23.89
5500,24.64
5501,25.26
5502,25.77
5503,26.15
5504,26.46
5505,26.68
5506,26.88
5507,27.02
5508,27.15
5509,27.26
5510,27.38
5511,27.50
5512,27.63
5513,27.75
5514,27.82
5515,27.82
5516,27.74
5517,27.63
5518,27.49
5519,27.34
5520,27.16
5521,26.95
5522,26.73
5523,26.52
5524,26.31
5525,26.15
5526,25.99
5527,25.88
5528,25.77
5529,25.69
5530,25.62
5531,25.60
5532,25.58
5533,25.56
5534,25.47
5535,25.34
5536,25.14
5537,24.89
5538,24.58
5539,24.27
5540,23.96
5541,23.73
5542,23.51
5543,23.31
5544,23.12
5545,22.95
5546,22.72
5547,22.44
5548,22.06
5549,21.68
5550,21.29
5551,20.97
5552,20.69
5553,20.53
5554,20.45
5555,20.42
5556,20.36
5557,20.26
5558,20.09
5559,19.85
5560,19.50
5561,19.05
5562,18.55
5563,18.14
5564,17.81
5565,17.58
5566,17.38
5567,17.25
5568,17.17
5569,17.10
5570,17.00
5571,16.89
5572,16.82
5573,16.81
5574,16.85
5575,16.91
5576,17.02
5577,17.17
5578,17.33
5579,17.45
5580,17.54
5581,17.59
5582,17.61
5583,17.60
5584,17.62
5585,17.68
5586,17.80
5587,17.94
5588,18.10
5589,18.29
5590,18.50
5591,18.71
5592,18.86
5593,18.95
5594,19.04
5595,19.11
5596,19.19
5597,19.26
5598,19.33
5599,19.41
5600,19.48
5601,19.51
5602,19.53
5603,19.52
5604,19.49
5605,19.39
5606,19.29
5607,19.19
5608,19.14
5609,19.17
5610,19.28
5611,19.46
5612,19.69
5613,19.93
5614,20.16
5615,20.41
5616,20.65
5617,20.87
5618,21.02
5619,21.10
5620,21.14
5621,21.17
5622,21.19
5623,21.17
5624,21.06
5625,20.82
5626,20.43
5627,19.96
5628,19.45
5629,18.97
5630,18.49
5631,18.09
5632,17.79
5633,17.64
5634,17.56
5635,17.52
5636,17.46
5637,17.34
5638,17.13
5639,16.87
5640,16.59
5641,16.34
5642,16.14
5643,16.03
5644,16.02
5645,16.11
5646,16.25
5647,16.41
5648,16.56
5649,16.68
5650,16.73
5651,16.71
5652,16.62
5653,16.53
5654,16.42
5655,16.30
5656,16.20
5657,16.11
5658,16.01
5659,15.86
5660,15.67
5661,15.46
5662,15.24
5663,15.03
5664,14.84
5665,14.69
5666,14.59
5667,14.56
5668,14.58
5669,14.61
5670,14.64
5671,14.68
5672,14.71
5673,14.74
5674,14.75
5675,14.75
5676,14.76
5677,14.79
5678,14.82
5679,14.82
5680,14.80
5681,14.76
5682,14.75
5683,14.80
5684,14.98
5685,15.27
5686,15.67
5687,16.11
5688,16.62
5689,17.13
5690,17.58
5691,17.91
5692,18.13
5693,18.23
5694,18.29
5695,18.30
5696,18.36
5697,18.51
5698,18.79
5699,19.20
5700,19.73
5701,20.30
5702,20.85
5703,21.27
5704,21.53
5705,21.58
5706,21.48
5707,21.26
5708,20.98
5709,20.70
5710,20.50
5711,20.44
5712,20.55
5713,20.77
5714,21.00
5715,21.19
5716,21.28
5717,21.29
5718,21.16
5719,20.94
5720,20.58
5721,20.20
5722,19.79
5723,19.45
5724,19.13
5725,18.87
5726,18.61
5727,18.36
5728,18.04
5729,17.69
5730,17.29
5731,16.88
5732,16.45
5733,16.07
5734,15.71
5735,15.40
5736,15.05
5737,14.71
5738,14.32
5739,13.95
5740,13.56
5741,13.18
5742,12.75
5743,12.34
5744,11.96
5745,11.64
5746,11.31
5747,11.00
5748,10.65
5749,10.31
5750,9.90
5751,9.43
5752,8.87
5753,8.32
5754,7.73
5755,7.18
5756,6.61
5757,6.08
5758,5.59
5759,5.22
5760,4.91
5761,4.68
5762,4.47
5763,4.30
5764,4.12
5765,3.92
5766,3.66
5767,3.37
5768,3.03
5769,2.67
5770,2.30
5771,1.97
5772,1.73
5773,1.64
5774,1.69
5775,1.84
5776,2.08
5777,2.37
5778,2.74
5779,3.15
5780,3.59
5781,4.01
5782,4.42
5783,4.82
5784,5.27
5785,5.71
5786,6.17
5787,6.60
5788,7.07
5789,7.54
5790,8.05
5791,8.54
5792,9.07
5793,9.59
5794,10.15
5795,10.69
5796,11.19
5797,11.59
5798,11.96
5799,12.28
5800,12.60
5801,12.88
5802,13.18
5803,13.47
5804,13.81
5805,14.17
5806,14.50
5807,14.76
5808,14.99
5809,15.19
5810,15.38
5811,15.53
5812,15.64
5813,15.69
5814,15.73
5815,15.75
5816,15.79
5817,15.82
5818,15.83
5819,15.80
5820,15.73
5821,15.65
5822,15.56
5823,15.43
5824,15.24
5825,15.01
5826,14.76
5827,14.56
5828,14.35
5829,14.12
5830,13.84
5831,13.55
5832,13.24
5833,12.91
5834,12.50
5835,12.07
5836,11.62
5837,11.23
5838,10.88
5839,10.60
5840,10.35
5841,10.18
5842,10.06
5843,10.01
5844,9.99
5845,9.99
5846,9.96
5847,9.95
5848,9.93
5849,9.94
5850,9.89
5851,9.78
5852,9.61
5853,9.43
5854,9.22
5855,9.02
5856,8.85
5857,8.72
5858,8.63
5859,8.58
5860,8.56
5861,8.56
5862,8.55
5863,8.51
5864,8.49
5865,8.52
5866,8.63
5867,8.80
5868,9.04
5869,9.32
5870,9.61
5871,9.88
5872,10.08
5873,10.17
5874,10.17
5875,10.13
5876,10.11
5877,10.10
5878,10.12
5879,10.15
5880,10.21
5881,10.26
5882,10.30
5883,10.26
5884,10.17
5885,10.07
5886,10.08
5887,10.21
5888,10.50
5889,10.92
5890,11.48
5891,12.07
5892,12.62
5893,13.02
5894,13.27
5895,13.39
5896,13.47
5897,13.55
5898,13.76
5899,14.10
5900,14.61
5901,15.18
5902,15.77
5903,16.28
5904,16.65
5905,16.80
5906,16.73
5907,16.50
5908,16.23
5909,15.99
5910,15.80
5911,15.66
5912,15.53
5913,15.40
5914,15.17
5915,14.85
5916,14.39
5917,13.90
5918,13.37
5919,12.91
5920,12.43
5921,12.01
5922,11.57
5923,11.18
5924,10.69
5925,10.15
5926,9.49
5927,8.81
5928,8.08
5929,7.42
5930,6.77
5931,6.23
5932,5.65
5933,5.09
5934,4.43
5935,3.72
5936,2.88
5937,2.04
5938,1.18
5939,0.45
5940,-0.21
5941,-0.74
5942,-1.16
5943,-1.41
5944,-1.58
5945,-1.72
5946,-1.91
5947,-2.08
5948,-2.20
5949,-2.24
5950,-2.22
5951,-2.11
5952,-1.90
5953,-1.61
5954,-1.32
5955,-1.10
5956,-0.92
5957,-0.79
5958,-0.69
5959,-0.63
5960,-0.55
5961,-0.46
5962,-0.29
5963,-0.08
5964,0.21
5965,0.55
5966,0.95
5967,1.37
5968,1.85
5969,2.31
5970,2.76
5971,3.14
5972,3.51
5973,3.85
5974,4.23
5975,4.59
5976,5.04
5977,5.53
5978,6.14
5979,6.75
5980,7.39
5981,7.94
5982,8.47
5983,8.90
5984,9.28
5985,9.56
5986,9.84
5987,10.09
5988,10.35
5989,10.61
5990,10.92
5991,11.24
5992,11.58
5993,11.89
5994,12.12
5995,12.27
5996,12.34
5997,12.33
5998,12.28
5999,12.15
6000,11.97
6001,11.76
6002,11.57
6003,11.44
6004,11.38
6005,11.38
6006,11.46
6007,11.61
6008,11.82
6009,12.03
6010,12.21
6011,12.33
6012,12.38
6013,12.41
6014,12.44
6015,12.44
6016,12.40
6017,12.34
6018,12.31
6019,12.28
6020,12.21
6021,12.09
6022,11.94
6023,11.80
6024,11.61
6025,11.38
6026,11.07
6027,10.76
6028,10.42
6029,10.10
6030,9.73
6031,9.35
6032,8.99
6033,8.67
6034,8.30
6035,7.93
6036,7.52
6037,7.12
6038,6.65
6039,6.16
6040,5.62
6041,5.12
6042,4.61
6043,4.19
6044,3.79
6045,3.45
6046,3.05
6047,2.62
6048,2.11
6049,1.59
6050,1.01
6051,0.40
6052,-0.30
6053,-0.94
6054,-1.54
6055,-2.04
6056,-2.50
6057,-2.91
6058,-3.28
6059,-3.60
6060,-3.93
6061,-4.24
6062,-4.55
6063,-4.79
6064,-5.00
6065,-5.13
6066,-5.20
6067,-5.20
6068,-5.19
6069,-5.18
6070,-5.20
6071,-5.23
6072,-5.28
6073,-5.36
6074,-5.50
6075,-5.65
6076,-5.79
6077,-5.88
6078,-5.92
6079,-5.93
6080,-5.87
6081,-5.76
6082,-5.57
6083,-5.33
6084,-5.04
6085,-4.75
6086,-4.43
6087,-4.12
6088,-3.76
6089,-3.34
6090,-2.84
6091,-2.30
6092,-1.78
6093,-1.31
6094,-0.84
6095,-0.40
6096,0.01
6097,0.30
6098,0.52
6099,0.68
6100,0.85
6101,1.03
6102,1.23
6103,1.40
6104,1.55
6105,1.60
6106,1.57
6107,1.45
6108,1.28
6109,1.06
6110,0.81
6111,0.57
6112,0.40
6113,0.31
6114,0.26
6115,0.24
6116,0.23
6117,0.19
6118,0.11
6119,0.00
6120,-0.11
6121,-0.21
6122,-0.31
6123,-0.35
6124,-0.34
6125,-0.25
6126,-0.14
6127,-0.05
6128,0.05
6129,0.17
6130,0.27
6131,0.30
6132,0.25
6133,0.17
6134,0.07
6135,-0.02
6136,-0.11
6137,-0.20
6138,-0.25
6139,-0.26
6140,-0.24
6141,-0.24
6142,-0.27
6143,-0.34
6144,-0.39
6145,-0.43
6146,-0.45
6147,-0.45
6148,-0.38
6149,-0.24
6150,-0.02
6151,0.25
6152,0.60
6153,0.95
6154,1.27
6155,1.54
6156,1.79
6157,2.01
6158,2.23
6159,2.37
6160,2.52
6161,2.68
6162,2.91
6163,3.21
6164,3.57
6165,3.92
6166,4.27
6167,4.60
6168,4.92
6169,5.17
6170,5.37
6171,5.49
6172,5.57
6173,5.62
6174,5.65
6175,5.68
6176,5.74
6177,5.82
6178,5.94
6179,6.06
6180,6.20
6181,6.34
6182,6.48
6183,6.61
6184,6.71
6185,6.77
6186,6.76
6187,6.68
6188,6.50
6189,6.29
6190,6.07
6191,5.87
6192,5.66
6193,5.46
6194,5.26
6195,5.09
6196,4.88
6197,4.62
6198,4.29
6199,3.93
6200,3.56
6201,3.23
6202,2.96
6203,2.79
6204,2.67
6205,2.60
6206,2.50
6207,2.37
6208,2.12
6209,1.80
6210,1.40
6211,0.98
6212,0.56
6213,0.18
6214,-0.16
6215,-0.42
6216,-0.67
6217,-0.92
6218,-1.26
6219,-1.64
6220,-2.06
6221,-2.45
6222,-2.80
6223,-3.07
6224,-3.24
6225,-3.30
6226,-3.27
6227,-3.19
6228,-3.16
6229,-3.21
6230,-3.40
6231,-3.67
6232,-3.98
6233,-4.26
6234,-4.42
6235,-4.45
6236,-4.35
6237,-4.13
6238,-3.84
6239,-3.54
6240,-3.30
6241,-3.11
6242,-2.95
6243,-2.85
6244,-2.80
6245,-2.84
6246,-2.87
6247,-2.85
6248,-2.75
6249,-2.66
6250,-2.59
6251,-2.56
6252,-2.57
6253,-2.59
6254,-2.67
6255,-2.78
6256,-2.95
6257,-3.13
6258,-3.31
6259,-3.49
6260,-3.67
6261,-3.85
6262,-4.01
6263,-4.12
6264,-4.23
6265,-4.32
6266,-4.37
6267,-4.37
6268,-4.33
6269,-4.26
6270,-4.20
6271,-4.13
6272,-4.10
6273,-4.14
6274,-4.21
6275,-4.31
6276,-4.40
6277,-4.43
6278,-4.36
6279,-4.24
6280,-4.12
6281,-4.03
6282,-3.96
6283,-3.90
6284,-3.88
6285,-3.91
6286,-3.97
6287,-3.97
6288,-3.86
6289,-3.65
6290,-3.40
6291,-3.19
6292,-3.02
6293,-2.91
6294,-2.84
6295,-2.85
6296,-2.90
6297,-2.97
6298,-2.98
6299,-2.89
6300,-2.70
6301,-2.45
6302,-2.19
6303,-1.95
6304,-1.76
6305,-1.63
6306,-1.60
6307,-1.67
6308,-1.82
6309,-2.02
6310,-2.27
6311,-2.54
6312,-2.86
6313,-3.21
6314,-3.56
6315,-3.87
6316,-4.11
6317,-4.26
6318,-4.30
6319,-4.23
6320,-4.12
6321,-4.02
6322,-3.98
6323,-4.01
6324,-4.12
6325,-4.30
6326,-4.53
6327,-4.77
6328,-4.99
6329,-5.13
6330,-5.22
6331,-5.24
6332,-5.25
6333,-5.30
6334,-5.45
6335,-5.66
6336,-5.91
6337,-6.16
6338,-6.36
6339,-6.52
6340,-6.57
6341,-6.52
6342,-6.35
6343,-6.10
6344,-5.81
6345,-5.52
6346,-5.21
6347,-4.92
6348,-4.62
6349,-4.36
6350,-4.13
6351,-3.94
6352,-3.81
6353,-3.75
6354,-3.79
6355,-3.88
6356,-3.97
6357,-4.04
6358,-4.09
6359,-4.15
6360,-4.18
6361,-4.17
6362,-4.19
6363,-4.27
6364,-4.45
6365,-4.66
6366,-4.86
6367,-4.98
6368,-5.02
6369,-4.99
6370,-4.91
6371,-4.78
6372,-4.63
6373,-4.49
6374,-4.37
6375,-4.31
6376,-4.26
6377,-4.22
6378,-4.12
6379,-3.94
6380,-3.65
6381,-3.33
6382,-3.03
6383,-2.81
6384,-2.69
6385,-2.70
6386,-2.85
6387,-3.12
6388,-3.42
6389,-3.70
6390,-3.95
6391,-4.14
6392,-4.26
6393,-4.33
6394,-4.40
6395,-4.47
6396,-4.57
6397,-4.72
6398,-5.00
6399,-5.33
6400,-5.70
6401,-6.03
6402,-6.41
6403,-6.81
6404,-7.22
6405,-7.58
6406,-7.95
6407,-8.32
6408,-8.70
6409,-8.99
6410,-9.25
6411,-9.47
6412,-9.71
6413,-9.91
6414,-10.09
6415,-10.23
6416,-10.42
6417,-10.62
6418,-10.80
6419,-10.96
6420,-11.12
6421,-11.25
6422,-11.33
6423,-11.31
6424,-11.22
6425,-11.12
6426,-11.05
6427,-11.02
6428,-11.04
6429,-11.07
6430,-11.09
6431,-11.06
6432,-10.98
6433,-10.83
6434,-10.57
6435,-10.25
6436,-9.89
6437,-9.56
6438,-9.28
6439,-9.08
6440,-8.94
6441,-8.87
6442,-8.76
6443,-8.63
6444,-8.42
6445,-8.16
6446,-7.79
6447,-7.39
6448,-6.92
6449,-6.45
6450,-5.94
6451,-5.42
6452,-4.86
6453,-4.33
6454,-3.78
6455,-3.26
6456,-2.70
6457,-2.14
6458,-1.54
6459,-0.99
6460,-0.47
6461,-0.02
6462,0.39
6463,0.70
6464,0.92
6465,1.01
6466,1.03
6467,0.98
6468,0.88
6469,0.70
6470,0.52
6471,0.36
6472,0.22
6473,0.08
6474,-0.08
6475,-0.29
6476,-0.57
6477,-0.92
6478,-1.35
6479,-1.83
6480,-2.37
6481,-2.90
6482,-3.42
6483,-3.88
6484,-4.34
6485,-4.72
6486,-5.04
6487,-5.23
6488,-5.38
6489,-5.46
6490,-5.50
6491,-5.46
6492,-5.37
6493,-5.28
6494,-5.25
6495,-5.26
6496,-5.33
6497,-5.41
6498,-5.58
6499,-5.81
6500,-6.07
6501,-6.31
6502,-6.55
6503,-6.78
6504,-7.05
6505,-7.30
6506,-7.59
6507,-7.94
6508,-8.44
6509,-9.03
6510,-9.66
6511,-10.26
6512,-10.85
6513,-11.38
6514,-11.83
6515,-12.15
6516,-12.41
6517,-12.60
6518,-12.77
6519,-12.92
6520,-13.07
6521,-13.21
6522,-13.35
6523,-13.44
6524,-13.50
6525,-13.52
6526,-13.53
6527,-13.53
6528,-13.50
6529,-13.48
6530,-13.46
6531,-13.47
6532,-13.47
6533,-13.44
6534,-13.35
6535,-13.24
6536,-13.08
6537,-12.87
6538,-12.59
6539,-12.33
6540,-12.15
6541,-12.09
6542,-12.07
6543,-12.06
6544,-12.03
6545,-11.97
6546,-11.80
6547,-11.51
6548,-11.12
6549,-10.67
6550,-10.15
6551,-9.59
6552,-9.03
6553,-8.53
6554,-8.02
6555,-7.52
6556,-7.02
6557,-6.58
6558,-6.19
6559,-5.87
6560,-5.60
6561,-5.46
6562,-5.40
6563,-5.42
6564,-5.39
6565,-5.29
6566,-5.07
6567,-4.75
6568,-4.30
6569,-3.82
6570,-3.36
6571,-3.01
6572,-2.72
6573,-2.53
6574,-2.37
6575,-2.24
6576,-2.04
6577,-1.78
6578,-1.43
6579,-1.08
6580,-0.74
6581,-0.47
6582,-0.27
6583,-0.15
6584,-0.12
6585,-0.19
6586,-0.30
6587,-0.42
6588,-0.54
6589,-0.66
6590,-0.77
6591,-0.89
6592,-1.04
6593,-1.21
6594,-1.41
6595,-1.59
6596,-1.75
6597,-1.87
6598,-1.95
6599,-2.01
6600,-2.08
6601,-2.17
6602,-2.24
6603,-2.27
6604,-2.27
6605,-2.23
6606,-2.18
6607,-2.12
6608,-2.08
6609,-2.04
6610,-2.03
6611,-2.02
6612,-2.05
6613,-2.14
6614,-2.30
6615,-2.49
6616,-2.62
6617,-2.69
6618,-2.70
6619,-2.67
6620,-2.56
6621,-2.39
6622,-2.17
6623,-1.91
6624,-1.65
6625,-1.39
6626,-1.14
6627,-0.91
6628,-0.64
6629,-0.34
6630,-0.04
6631,0.23
6632,0.47
6633,0.70
6634,0.95
6635,1.16
6636,1.30
6637,1.36
6638,1.36
6639,1.33
6640,1.28
6641,1.24
6642,1.27
6643,1.35
6644,1.48
6645,1.64
6646,1.82
6647,1.99
6648,2.13
6649,2.19
6650,2.18
6651,2.11
6652,2.03
6653,1.97
6654,1.96
6655,2.01
6656,2.14
6657,2.33
6658,2.56
6659,2.79
6660,3.03
6661,3.24
6662,3.40
6663,3.50
6664,3.50
6665,3.41
6666,3.23
6667,3.00
6668,2.70
6669,2.38
6670,2.03
6671,1.70
6672,1.39
6673,1.11
6674,0.79
6675,0.44
6676,0.02
6677,-0.44
6678,-0.99
6679,-1.58
6680,-2.27
6681,-2.97
6682,-3.71
6683,-4.40
6684,-5.15
6685,-5.87
6686,-6.63
6687,-7.30
6688,-7.95
6689,-8.47
6690,-8.90
6691,-9.22
6692,-9.51
6693,-9.74
6694,-10.02
6695,-10.31
6696,-10.72
6697,-11.21
6698,-11.79
6699,-12.36
6700,-12.90
6701,-13.31
6702,-13.57
6703,-13.69
6704,-13.71
6705,-13.68
6706,-13.59
6707,-13.44
6708,-13.27
6709,-13.11
6710,-12.98
6711,-12.85
6712,-12.65
6713,-12.39
6714,-12.02
6715,-11.59
6716,-11.05
6717,-10.46
6718,-9.77
6719,-9.07
6720,-8.34
6721,-7.63
6722,-6.89
6723,-6.19
6724,-5.52
6725,-4.99
6726,-4.55
6727,-4.27
6728,-4.08
6729,-4.01
6730,-3.97
6731,-3.92
6732,-3.81
6733,-3.63
6734,-3.39
6735,-3.11
6736,-2.84
6737,-2.59
6738,-2.43
6739,-2.37
6740,-2.41
6741,-2.54
6742,-2.71
6743,-2.85
6744,-2.98
6745,-3.12
6746,-3.34
6747,-3.63
6748,-4.00
6749,-4.42
6750,-4.91
6751,-5.44
6752,-6.00
6753,-6.50
6754,-6.96
6755,-7.31
6756,-7.58
6757,-7.74
6758,-7.87
6759,-7.99
6760,-8.12
6761,-8.26
6762,-8.43
6763,-8.61
6764,-8.80
6765,-8.95
6766,-9.02
6767,-8.96
6768,-8.77
6769,-8.48
6770,-8.09
6771,-7.67
6772,-7.24
6773,-6.89
6774,-6.62
6775,-6.45
6776,-6.31
6777,-6.20
6778,-6.08
6779,-5.94
6780,-5.71
6781,-5.46
6782,-5.15
6783,-4.85
6784,-4.53
6785,-4.24
6786,-4.01
6787,-3.86
6788,-3.76
6789,-3.70
6790,-3.72
6791,-3.85
6792,-4.04
6793,-4.29
6794,-4.55
6795,-4.82
6796,-5.06
6797,-5.25
6798,-5.33
6799,-5.30
6800,-5.16
6801,-4.94
6802,-4.72
6803,-4.51
6804,-4.31
6805,-4.14
6806,-4.01
6807,-3.94
6808,-3.92
6809,-3.93
6810,-3.94
6811,-3.97
6812,-4.01
6813,-4.04
6814,-4.09
6815,-4.18
6816,-4.29
6817,-4.39
6818,-4.43
6819,-4.40
6820,-4.30
6821,-4.16
6822,-3.95
6823,-3.68
6824,-3.33
6825,-2.98
6826,-2.65
6827,-2.35
6828,-2.08
6829,-1.85
6830,-1.65
6831,-1.50
6832,-1.36
6833,-1.25
6834,-1.16
6835,-1.10
6836,-1.02
6837,-0.92
6838,-0.77
6839,-0.59
6840,-0.36
6841,-0.12
6842,0.09
6843,0.24
6844,0.34
6845,0.36
6846,0.31
6847,0.23
6848,0.14
6849,0.04
6850,-0.06
6851,-0.15
6852,-0.19
6853,-0.19
6854,-0.21
6855,-0.26
6856,-0.34
6857,-0.43
6858,-0.54
6859,-0.63
6860,-0.66
6861,-0.63
6862,-0.57
6863,-0.50
6864,-0.46
6865,-0.43
6866,-0.43
6867,-0.48
6868,-0.61
6869,-0.82
6870,-1.10
6871,-1.37
6872,-1.61
6873,-1.82
6874,-2.01
6875,-2.15
6876,-2.24
6877,-2.27
6878,-2.29
6879,-2.31
6880,-2.33
6881,-2.30
6882,-2.24
6883,-2.14
6884,-2.02
6885,-1.90
6886,-1.82
6887,-1.78
6888,-1.77
6889,-1.80
6890,-1.94
6891,-2.16
6892,-2.47
6893,-2.83
6894,-3.28
6895,-3.78
6896,-4.30
6897,-4.78
6898,-5.25
6899,-5.65
6900,-5.99
6901,-6.23
6902,-6.43
6903,-6.62
6904,-6.84
6905,-7.07
6906,-7.37
6907,-7.69
6908,-8.03
6909,-8.33
6910,-8.58
6911,-8.75
6912,-8.87
6913,-8.92
6914,-8.94
6915,-8.96
6916,-9.05
6917,-9.19
6918,-9.41
6919,-9.65
6920,-9.89
6921,-10.09
6922,-10.27
6923,-10.39
6924,-10.44
6925,-10.45
6926,-10.41
6927,-10.35
6928,-10.25
6929,-10.14
6930,-10.03
6931,-9.90
6932,-9.74
6933,-9.54
6934,-9.30
6935,-9.00
6936,-8.60
6937,-8.13
6938,-7.62
6939,-7.14
6940,-6.67
6941,-6.23
6942,-5.82
6943,-5.51
6944,-5.23
6945,-4.97
6946,-4.65
6947,-4.34
6948,-4.01
6949,-3.68
6950,-3.30
6951,-2.93
6952,-2.59
6953,-2.35
6954,-2.18
6955,-2.08
6956,-2.00
6957,-1.97
6958,-1.97
6959,-2.01
6960,-2.05
6961,-2.11
6962,-2.18
6963,-2.27
6964,-2.38
6965,-2.50
6966,-2.62
6967,-2.74
6968,-2.87
6969,-2.99
6970,-3.07
6971,-3.10
6972,-3.10
6973,-3.09
6974,-3.11
6975,-3.14
6976,-3.18
6977,-3.23
6978,-3.35
6979,-3.51
6980,-3.76
6981,-4.06
6982,-4.40
6983,-4.72
6984,-5.03
6985,-5.28
6986,-5.57
6987,-5.88
6988,-6.28
6989,-6.70
6990,-7.13
6991,-7.53
6992,-7.95
6993,-8.32
6994,-8.71
6995,-9.02
6996,-9.32
6997,-9.57
6998,-9.86
6999,-10.14
7000,-10.45
7001,-10.77
7002,-11.18
7003,-11.60
7004,-12.08
7005,-12.52
7006,-12.99
7007,-13.48
7008,-14.03
7009,-14.60
7010,-15.18
7011,-15.75
7012,-16.28
7013,-16.69
7014,-16.99
7015,-17.16
7016,-17.27
7017,-17.29
7018,-17.25
7019,-17.16
7020,-17.05
7021,-16.99
7022,-16.98
7023,-17.02
7024,-17.05
7025,-17.06
7026,-17.01
7027,-16.90
7028,-16.65
7029,-16.30
7030,-15.85
7031,-15.34
7032,-14.78
7033,-14.21
7034,-13.68
7035,-13.26
7036,-12.96
7037,-12.80
7038,-12.71
7039,-12.66
7040,-12.57
7041,-12.47
7042,-12.31
7043,-12.14
7044,-11.89
7045,-11.60
7046,-11.26
7047,-10.94
7048,-10.62
7049,-10.30
7050,-9.95
7051,-9.60
7052,-9.24
7053,-8.92
7054,-8.59
7055,-8.30
7056,-8.03
7057,-7.80
7058,-7.55
7059,-7.32
7060,-7.11
7061,-6.96
7062,-6.85
7063,-6.83
7064,-6.92
7065,-7.16
7066,-7.49
7067,-7.87
7068,-8.22
7069,-8.54
7070,-8.84
7071,-9.08
7072,-9.26
7073,-9.41
7074,-9.54
7075,-9.68
7076,-9.87
7077,-10.08
7078,-10.29
7079,-10.44
7080,-10.51
7081,-10.48
7082,-10.38
7083,-10.25
7084,-10.12
7085,-10.03
7086,-9.99
7087,-10.02
7088,-10.12
7089,-10.27
7090,-10.46
7091,-10.64
7092,-10.78
7093,-10.90
7094,-11.02
7095,-11.14
7096,-11.25
7097,-11.38
7098,-11.51
7099,-11.69
7100,-11.92
7101,-12.16
7102,-12.38
7103,-12.53
7104,-12.58
7105,-12.51
7106,-12.35
7107,-12.12
7108,-11.83
7109,-11.56
7110,-11.32
7111,-11.18
7112,-11.14
7113,-11.15
7114,-11.12
7115,-11.04
7116,-10.88
7117,-10.67
7118,-10.39
7119,-10.05
7120,-9.61
7121,-9.16
7122,-8.71
7123,-8.27
7124,-7.82
7125,-7.38
7126,-6.94
7127,-6.55
7128,-6.20
7129,-5.92
7130,-5.65
7131,-5.46
7132,-5.28
7133,-5.12
7134,-4.88
7135,-4.59
7136,-4.23
7137,-3.88
7138,-3.50
7139,-3.09
7140,-2.62
7141,-2.15
7142,-1.69
7143,-1.27
7144,-0.88
7145,-0.53
7146,-0.24
7147,-0.08
7148,-0.07
7149,-0.18
7150,-0.31
7151,-0.43
7152,-0.52
7153,-0.56
7154,-0.51
7155,-0.40
7156,-0.21
7157,-0.02
7158,0.11
7159,0.17
7160,0.19
7161,0.18
7162,0.14
7163,0.09
7164,0.05
7165,0.02
7166,-0.05
7167,-0.16
7168,-0.32
7169,-0.53
7170,-0.82
7171,-1.17
7172,-1.55
7173,-1.88
7174,-2.20
7175,-2.52
7176,-2.85
7177,-3.14
7178,-3.43
7179,-3.72
7180,-4.04
7181,-4.33
7182,-4.61
7183,-4.81
7184,-4.95
7185,-5.04
7186,-5.12
7187,-5.23
7188,-5.39
7189,-5.63
7190,-5.91
7191,-6.19
7192,-6.48
7193,-7.79
7194,-7.82
7195,-5.13
7196,-3.85
7197,-9.77
7198,-15.73
7199,-3.91
7200,14.85
