1,36.09
2,50.00
3,50.00
4,25.33
5,-27.24
6,-50.00
7,-50.00
8,-42.84
9,-33.96
10,-39.86
11,-48.18
12,-48.41
13,-43.44
14,-42.41
15,-46.62
16,-49.82
17,-46.78
18,-41.69
19,-40.64
20,-43.62
21,-45.09
22,-42.37
23,-39.21
24,-39.82
25,-42.82
26,-43.37
27,-40.45
28,-37.72
29,-38.25
30,-40.42
31,-41.74
32,-41.83
33,-42.12
34,-42.43
35,-41.85
36,-39.61
37,-36.23
38,-32.28
39,-28.21
40,-23.79
41,-18.66
42,-12.82
43,-7.08
44,-2.77
45,-0.81
46,-1.36
47,-4.00
48,-8.27
49,-13.82
50,-20.23
51,-26.85
52,-33.09
53,-38.51
54,-43.04
55,-46.45
56,-48.55
57,-49.01
58,-48.34
59,-47.23
60,-46.53
61,-45.96
62,-44.89
63,-42.65
64,-39.83
65,-37.60
66,-36.67
67,-36.60
68,-36.23
69,-35.16
70,-33.83
71,-33.17
72,-33.18
73,-33.30
74,-32.92
75,-32.25
76,-31.62
77,-31.09
78,-30.22
79,-28.99
80,-27.87
81,-27.49
82,-27.80
83,-28.34
84,-28.51
85,-28.25
86,-27.92
87,-28.05
88,-28.78
89,-29.76
90,-30.25
91,-29.78
92,-28.57
93,-27.46
94,-27.17
95,-27.63
96,-28.13
97,-28.03
98,-27.47
99,-27.12
100,-27.36
101,-27.82
102,-27.97
103,-27.90
104,-28.14
105,-28.83
106,-29.31
107,-28.85
108,-27.63
109,-26.73
110,-26.73
111,-27.06
112,-26.66
113,-25.46
114,-24.51
115,-24.72
116,-25.70
117,-26.28
118,-25.92
119,-25.32
120,-25.42
121,-26.32
122,-27.15
123,-27.14
124,-26.44
125,-25.80
126,-25.54
127,-25.28
128,-24.64
129,-23.95
130,-23.92
131,-24.69
132,-25.55
133,-25.70
134,-25.19
135,-24.82
136,-25.08
137,-25.55
138,-25.36
139,-24.36
140,-23.39
141,-23.46
142,-24.56
143,-25.57
144,-25.59
145,-24.81
146,-24.18
147,-24.17
148,-24.25
149,-23.72
150,-22.76
151,-22.38
152,-23.10
153,-24.24
154,-24.68
155,-24.15
156,-23.50
157,-23.60
158,-24.26
159,-24.61
160,-24.20
161,-23.51
162,-23.23
163,-23.41
164,-23.53
165,-23.22
166,-22.66
167,-22.17
168,-21.75
169,-21.27
170,-20.84
171,-20.87
172,-21.51
173,-22.38
174,-22.80
175,-22.47
176,-21.76
177,-21.35
178,-21.53
179,-22.03
180,-22.24
181,-21.94
182,-21.47
183,-21.34
184,-21.68
185,-22.05
186,-21.84
187,-20.95
188,-19.89
189,-19.40
190,-19.78
191,-20.66
192,-21.42
193,-21.68
194,-21.59
195,-21.49
196,-21.43
197,-21.18
198,-20.70
199,-20.39
200,-20.72
201,-21.49
202,-21.91
203,-21.41
204,-20.43
205,-20.05
206,-20.76
207,-21.85
208,-22.21
209,-21.64
210,-21.01
211,-21.16
212,-21.83
213,-22.13
214,-21.71
215,-21.16
216,-21.09
217,-21.25
218,-20.88
219,-19.78
220,-18.71
221,-18.52
222,-19.10
223,-19.70
224,-19.75
225,-19.45
226,-19.30
227,-19.54
228,-19.91
229,-20.10
230,-19.96
231,-19.60
232,-19.07
233,-18.46
234,-17.96
235,-17.75
236,-17.88
237,-18.30
238,-18.90
239,-19.56
240,-20.11
241,-20.27
242,-19.86
243,-19.05
244,-18.34
245,-18.19
246,-18.53
247,-18.81
248,-18.53
249,-17.76
250,-17.11
251,-17.10
252,-17.74
253,-18.62
254,-19.26
255,-19.49
256,-19.30
257,-18.74
258,-17.86
259,-16.89
260,-16.23
261,-16.30
262,-16.98
263,-17.62
264,-17.71
265,-17.38
266,-17.36
267,-18.04
268,-18.93
269,-19.16
270,-18.41
271,-17.30
272,-16.66
273,-16.64
274,-16.80
275,-16.76
276,-16.64
277,-16.67
278,-16.70
279,-16.41
280,-15.82
281,-15.37
282,-15.42
283,-15.92
284,-16.54
285,-17.18
286,-17.84
287,-18.30
288,-18.14
289,-17.24
290,-16.15
291,-15.59
292,-15.66
293,-15.81
294,-15.62
295,-15.33
296,-15.53
297,-16.32
298,-17.13
299,-17.38
300,-17.03
301,-16.46
302,-16.11
303,-16.23
304,-16.74
305,-17.25
306,-17.29
307,-16.74
308,-16.05
309,-15.91
310,-16.66
311,-17.85
312,-18.56
313,-18.13
314,-16.83
315,-15.79
316,-15.95
317,-17.16
318,-18.30
319,-18.36
320,-17.27
321,-15.93
322,-15.29
323,-15.63
324,-16.42
325,-16.88
326,-16.63
327,-16.01
328,-15.75
329,-16.21
330,-17.03
331,-17.38
332,-16.80
333,-15.69
334,-14.89
335,-14.94
336,-15.59
337,-16.22
338,-16.50
339,-16.62
340,-16.74
341,-16.65
342,-15.95
343,-14.72
344,-13.68
345,-13.58
346,-14.38
347,-15.24
348,-15.41
349,-14.91
350,-14.46
351,-14.62
352,-15.36
353,-16.16
354,-16.51
355,-16.23
356,-15.52
357,-14.91
358,-14.90
359,-15.57
360,-16.45
361,-16.90
362,-16.49
363,-15.36
364,-14.07
365,-13.29
366,-13.40
367,-14.15
368,-14.82
369,-14.82
370,-14.20
371,-13.72
372,-14.07
373,-15.11
374,-15.93
375,-15.75
376,-14.74
377,-13.88
378,-13.86
379,-14.39
380,-14.72
381,-14.65
382,-14.66
383,-15.17
384,-15.91
385,-16.27
386,-16.03
387,-15.52
388,-15.02
389,-14.50
390,-13.89
391,-13.42
392,-13.46
393,-13.93
394,-14.40
395,-14.58
396,-14.57
397,-14.48
398,-14.16
399,-13.59
400,-13.27
401,-13.87
402,-15.31
403,-16.48
404,-16.23
405,-14.62
406,-12.99
407,-12.69
408,-13.72
409,-14.83
410,-14.88
411,-13.95
412,-12.98
413,-12.76
414,-13.18
415,-13.63
416,-13.69
417,-13.47
418,-13.23
419,-13.11
420,-13.08
421,-12.97
422,-12.62
423,-11.94
424,-11.12
425,-10.62
426,-10.77
427,-11.39
428,-11.94
429,-12.09
430,-12.07
431,-12.26
432,-12.80
433,-13.45
434,-14.03
435,-14.53
436,-14.97
437,-15.12
438,-14.61
439,-13.40
440,-12.14
441,-11.74
442,-12.53
443,-13.85
444,-14.68
445,-14.47
446,-13.61
447,-12.88
448,-12.83
449,-13.47
450,-14.29
451,-14.64
452,-14.24
453,-13.51
454,-13.17
455,-13.39
456,-13.69
457,-13.51
458,-13.06
459,-13.04
460,-13.78
461,-14.71
462,-15.05
463,-14.63
464,-14.13
465,-14.24
466,-14.85
467,-15.32
468,-15.35
469,-15.29
470,-15.62
471,-16.23
472,-16.53
473,-16.15
474,-15.34
475,-14.63
476,-14.29
477,-14.26
478,-14.45
479,-14.85
480,-15.32
481,-15.56
482,-15.32
483,-14.77
484,-14.37
485,-14.45
486,-14.82
487,-15.04
488,-14.79
489,-14.18
490,-13.51
491,-13.00
492,-12.63
493,-12.24
494,-11.89
495,-11.94
496,-12.60
497,-13.60
498,-14.23
499,-14.08
500,-13.50
501,-13.33
502,-13.99
503,-15.00
504,-15.37
505,-14.60
506,-13.29
507,-12.59
508,-13.09
509,-14.19
510,-14.88
511,-14.78
512,-14.40
513,-14.34
514,-14.56
515,-14.57
516,-14.19
517,-13.83
518,-14.02
519,-14.72
520,-15.29
521,-15.17
522,-14.46
523,-13.79
524,-13.65
525,-13.91
526,-14.04
527,-13.77
528,-13.29
529,-13.04
530,-13.19
531,-13.60
532,-14.00
533,-14.29
534,-14.31
535,-13.92
536,-13.11
537,-12.30
538,-12.01
539,-12.44
540,-13.08
541,-13.27
542,-12.70
543,-11.74
544,-10.91
545,-10.51
546,-10.32
547,-10.02
548,-9.52
549,-9.22
550,-9.50
551,-10.39
552,-11.38
553,-11.98
554,-12.00
555,-11.62
556,-11.00
557,-10.22
558,-9.39
559,-8.81
560,-8.75
561,-9.13
562,-9.38
563,-8.87
564,-7.57
565,-6.19
566,-5.59
567,-6.08
568,-7.12
569,-7.91
570,-8.00
571,-7.66
572,-7.44
573,-7.70
574,-8.33
575,-8.85
576,-8.91
577,-8.57
578,-8.29
579,-8.46
580,-8.93
581,-9.03
582,-8.39
583,-7.49
584,-7.22
585,-7.92
586,-9.10
587,-10.02
588,-10.39
589,-10.27
590,-9.70
591,-8.62
592,-7.37
593,-6.63
594,-6.88
595,-7.80
596,-8.43
597,-8.17
598,-7.42
599,-7.19
600,-7.94
601,-9.14
602,-9.81
603,-9.65
604,-9.16
605,-8.99
606,-9.18
607,-9.24
608,-8.81
609,-8.04
610,-7.27
611,-6.62
612,-6.03
613,-5.64
614,-5.78
615,-6.55
616,-7.48
617,-7.89
618,-7.59
619,-7.08
620,-7.11
621,-7.91
622,-8.82
623,-8.95
624,-8.06
625,-6.89
626,-6.50
627,-7.25
628,-8.52
629,-9.28
630,-9.04
631,-8.09
632,-7.15
633,-6.78
634,-6.90
635,-7.05
636,-6.86
637,-6.49
638,-6.39
639,-6.74
640,-7.15
641,-7.10
642,-6.55
643,-6.07
644,-6.09
645,-6.34
646,-6.16
647,-5.37
648,-4.54
649,-4.39
650,-4.82
651,-5.05
652,-4.54
653,-3.67
654,-3.38
655,-4.20
656,-5.76
657,-7.24
658,-7.96
659,-7.64
660,-6.39
661,-4.71
662,-3.42
663,-3.20
664,-4.04
665,-5.17
666,-5.66
667,-5.24
668,-4.48
669,-4.12
670,-4.38
671,-4.83
672,-4.93
673,-4.56
674,-3.92
675,-3.26
676,-2.65
677,-2.16
678,-1.93
679,-2.09
680,-2.54
681,-3.07
682,-3.54
683,-3.99
684,-4.50
685,-4.97
686,-5.10
687,-4.80
688,-4.35
689,-4.26
690,-4.66
691,-5.07
692,-4.92
693,-4.12
694,-3.33
695,-3.26
696,-3.90
697,-4.50
698,-4.38
699,-3.65
700,-3.11
701,-3.41
702,-4.39
703,-5.28
704,-5.46
705,-4.97
706,-4.41
707,-4.32
708,-4.79
709,-5.37
710,-5.52
711,-4.97
712,-3.96
713,-3.08
714,-2.88
715,-3.44
716,-4.25
717,-4.68
718,-4.57
719,-4.42
720,-4.81
721,-5.70
722,-6.37
723,-6.16
724,-5.16
725,-4.14
726,-3.83
727,-4.27
728,-4.85
729,-4.92
730,-4.41
731,-3.88
732,-3.78
733,-3.99
734,-4.07
735,-3.86
736,-3.54
737,-3.34
738,-3.16
739,-2.85
740,-2.44
741,-2.17
742,-2.15
743,-2.32
744,-2.50
745,-2.55
746,-2.38
747,-2.10
748,-1.77
749,-1.44
750,-1.21
751,-1.36
752,-2.04
753,-3.01
754,-3.63
755,-3.39
756,-2.39
757,-1.22
758,-0.53
759,-0.58
760,-1.22
761,-2.09
762,-2.65
763,-2.39
764,-1.25
765,0.14
766,0.83
767,0.46
768,-0.38
769,-0.82
770,-0.61
771,-0.33
772,-0.60
773,-1.41
774,-2.20
775,-2.56
776,-2.61
777,-2.64
778,-2.68
779,-2.50
780,-2.09
781,-1.78
782,-1.93
783,-2.45
784,-2.96
785,-3.05
786,-2.75
787,-2.29
788,-1.90
789,-1.58
790,-1.30
791,-1.08
792,-0.97
793,-1.04
794,-1.34
795,-1.96
796,-2.85
797,-3.73
798,-4.18
799,-4.00
800,-3.41
801,-2.83
802,-2.49
803,-2.34
804,-2.22
805,-2.07
806,-1.97
807,-1.98
808,-2.07
809,-2.22
810,-2.51
811,-2.99
812,-3.52
813,-3.71
814,-3.34
815,-2.59
816,-1.94
817,-1.71
818,-1.96
819,-2.58
820,-3.30
821,-3.69
822,-3.36
823,-2.46
824,-1.66
825,-1.52
826,-1.85
827,-1.96
828,-1.54
829,-1.05
830,-1.14
831,-1.78
832,-2.30
833,-2.22
834,-1.82
835,-1.72
836,-1.99
837,-2.15
838,-1.88
839,-1.56
840,-1.86
841,-2.90
842,-3.93
843,-4.05
844,-3.10
845,-1.78
846,-1.00
847,-1.15
848,-1.87
849,-2.51
850,-2.66
851,-2.43
852,-2.14
853,-1.95
854,-1.78
855,-1.62
856,-1.65
857,-2.15
858,-2.95
859,-3.48
860,-3.22
861,-2.25
862,-1.18
863,-0.53
864,-0.34
865,-0.41
866,-0.69
867,-1.28
868,-1.98
869,-2.31
870,-2.10
871,-1.86
872,-2.20
873,-2.97
874,-3.33
875,-2.74
876,-1.67
877,-1.01
878,-1.13
879,-1.52
880,-1.62
881,-1.39
882,-1.34
883,-1.77
884,-2.40
885,-2.67
886,-2.45
887,-2.22
888,-2.50
889,-3.19
890,-3.60
891,-3.20
892,-2.28
893,-1.82
894,-2.44
895,-3.69
896,-4.39
897,-3.76
898,-2.24
899,-1.12
900,-1.30
901,-2.47
902,-3.50
903,-3.61
904,-3.03
905,-2.60
906,-2.73
907,-2.95
908,-2.67
909,-1.95
910,-1.39
911,-1.34
912,-1.63
913,-2.03
914,-2.65
915,-3.54
916,-4.35
917,-4.48
918,-3.88
919,-3.19
920,-3.12
921,-3.68
922,-4.21
923,-4.07
924,-3.35
925,-2.65
926,-2.51
927,-3.00
928,-3.83
929,-4.60
930,-4.98
931,-4.84
932,-4.28
933,-3.70
934,-3.56
935,-3.99
936,-4.66
937,-5.13
938,-5.24
939,-5.22
940,-5.30
941,-5.34
942,-4.92
943,-3.90
944,-2.65
945,-1.78
946,-1.64
947,-2.08
948,-2.66
949,-2.99
950,-3.01
951,-2.97
952,-3.12
953,-3.42
954,-3.63
955,-3.57
956,-3.30
957,-3.10
958,-3.20
959,-3.62
960,-4.07
961,-4.10
962,-3.47
963,-2.53
964,-2.05
965,-2.51
966,-3.54
967,-4.08
968,-3.43
969,-2.00
970,-0.93
971,-0.99
972,-1.91
973,-2.75
974,-2.91
975,-2.60
976,-2.40
977,-2.64
978,-3.07
979,-3.26
980,-3.20
981,-3.33
982,-3.91
983,-4.60
984,-4.74
985,-4.11
986,-3.20
987,-2.62
988,-2.56
989,-2.73
990,-2.83
991,-2.78
992,-2.73
993,-2.82
994,-3.04
995,-3.34
996,-3.67
997,-4.02
998,-4.17
999,-3.85
1000,-3.02
1001,-2.12
1002,-1.76
1003,-2.25
1004,-3.15
1005,-3.69
1006,-3.31
1007,-2.22
1008,-1.12
1009,-0.74
1010,-1.14
1011,-1.73
1012,-1.82
1013,-1.26
1014,-0.41
1015,0.34
1016,0.98
1017,1.58
1018,1.87
1019,1.45
1020,0.38
1021,-0.58
1022,-0.62
1023,0.27
1024,1.19
1025,1.27
1026,0.51
1027,-0.36
1028,-0.74
1029,-0.71
1030,-0.70
1031,-0.81
1032,-0.82
1033,-0.56
1034,-0.28
1035,-0.29
1036,-0.45
1037,-0.22
1038,0.66
1039,1.72
1040,2.07
1041,1.28
1042,-0.13
1043,-1.13
1044,-1.14
1045,-0.51
1046,0.00
1047,-0.04
1048,-0.36
1049,-0.54
1050,-0.34
1051,0.12
1052,0.64
1053,1.01
1054,1.00
1055,0.54
1056,-0.06
1057,-0.19
1058,0.49
1059,1.67
1060,2.65
1061,3.07
1062,3.19
1063,3.39
1064,3.52
1065,3.02
1066,1.75
1067,0.47
1068,0.12
1069,0.79
1070,1.67
1071,1.96
1072,1.76
1073,1.68
1074,1.90
1075,1.96
1076,1.52
1077,1.00
1078,1.08
1079,1.80
1080,2.49
1081,2.66
1082,2.64
1083,2.96
1084,3.61
1085,4.01
1086,3.80
1087,3.28
1088,3.02
1089,3.23
1090,3.61
1091,3.81
1092,3.81
1093,3.75
1094,3.77
1095,3.83
1096,3.92
1097,3.96
1098,3.87
1099,3.68
1100,3.58
1101,3.77
1102,4.19
1103,4.44
1104,4.22
1105,3.74
1106,3.50
1107,3.71
1108,3.85
1109,3.31
1110,2.31
1111,1.87
1112,2.75
1113,4.41
1114,5.45
1115,5.03
1116,3.67
1117,2.55
1118,2.30
1119,2.60
1120,2.88
1121,3.00
1122,3.14
1123,3.35
1124,3.54
1125,3.74
1126,4.23
1127,4.94
1128,5.30
1129,4.79
1130,3.70
1131,3.11
1132,3.73
1133,5.13
1134,6.23
1135,6.47
1136,6.34
1137,6.50
1138,6.94
1139,7.00
1140,6.33
1141,5.40
1142,4.90
1143,4.99
1144,5.21
1145,5.13
1146,4.87
1147,4.77
1148,4.95
1149,5.13
1150,5.07
1151,4.85
1152,4.75
1153,4.92
1154,5.16
1155,5.09
1156,4.64
1157,4.23
1158,4.42
1159,5.35
1160,6.45
1161,6.86
1162,6.24
1163,5.12
1164,4.36
1165,4.38
1166,4.89
1167,5.32
1168,5.52
1169,5.72
1170,6.08
1171,6.37
1172,6.22
1173,5.60
1174,4.91
1175,4.62
1176,4.88
1177,5.45
1178,6.06
1179,6.59
1180,6.97
1181,7.07
1182,6.65
1183,5.72
1184,4.66
1185,4.05
1186,4.11
1187,4.59
1188,4.85
1189,4.49
1190,3.59
1191,2.66
1192,2.09
1193,1.84
1194,2.05
1195,2.53
1196,2.81
1197,2.17
1198,1.43
1199,2.61
1200,4.23
