1,185.17
2,249.99
3,249.99
4,232.27
5,157.01
6,64.61
7,-33.08
8,-102.04
9,-115.57
10,-84.47
11,-39.98
12,-4.19
13,15.49
14,17.38
15,4.41
16,-17.33
17,-36.75
18,-48.95
19,-50.90
20,-45.71
21,-37.14
22,-29.35
23,-25.31
24,-25.29
25,-28.37
26,-32.81
27,-36.70
28,-39.38
29,-40.34
30,-40.27
31,-39.83
32,-39.72
33,-40.10
34,-40.72
35,-41.33
36,-41.92
37,-42.56
38,-43.32
39,-44.11
40,-44.85
41,-45.45
42,-45.78
43,-45.81
44,-45.46
45,-44.75
46,-43.66
47,-42.26
48,-40.59
49,-38.79
50,-36.94
51,-35.19
52,-33.58
53,-32.20
54,-31.09
55,-30.30
56,-29.91
57,-29.88
58,-30.24
59,-30.95
60,-32.07
61,-33.55
62,-35.41
63,-37.50
64,-39.78
65,-42.05
66,-44.30
67,-46.32
68,-48.11
69,-49.52
70,-50.62
71,-51.35
72,-51.82
73,-51.99
74,-52.01
75,-51.82
76,-51.54
77,-51.14
78,-50.68
79,-50.16
80,-49.61
81,-49.06
82,-48.54
83,-48.07
84,-47.59
85,-47.13
86,-46.64
87,-46.18
88,-45.72
89,-45.30
90,-44.88
91,-44.47
92,-44.04
93,-43.62
94,-43.17
95,-42.77
96,-42.36
97,-42.01
98,-41.70
99,-41.50
100,-41.37
101,-41.34
102,-41.35
103,-41.40
104,-41.40
105,-41.33
106,-41.15
107,-40.92
108,-40.64
109,-40.35
110,-40.08
111,-39.86
112,-39.70
113,-39.63
114,-39.54
115,-39.44
116,-39.31
117,-39.19
118,-39.09
119,-38.99
120,-38.87
121,-38.75
122,-38.62
123,-38.49
124,-38.36
125,-38.22
126,-38.08
127,-37.93
128,-37.85
129,-37.86
130,-37.99
131,-38.19
132,-38.48
133,-38.79
134,-39.13
135,-39.48
136,-39.86
137,-40.20
138,-40.57
139,-40.96
140,-41.45
141,-42.01
142,-42.64
143,-43.30
144,-43.99
145,-44.65
146,-45.27
147,-45.76
148,-46.14
149,-46.39
150,-46.57
151,-46.63
152,-46.64
153,-46.58
154,-46.52
155,-46.45
156,-46.41
157,-46.39
158,-46.44
159,-46.57
160,-46.78
161,-47.07
162,-47.42
163,-47.83
164,-48.26
165,-48.65
166,-49.03
167,-49.37
168,-49.67
169,-49.91
170,-50.09
171,-50.22
172,-50.34
173,-50.44
174,-50.51
175,-50.54
176,-50.54
177,-50.51
178,-50.45
179,-50.37
180,-50.32
181,-50.29
182,-50.32
183,-50.38
184,-50.48
185,-50.63
186,-50.81
187,-50.99
188,-51.14
189,-51.20
190,-51.18
191,-51.07
192,-50.90
193,-50.67
194,-50.41
195,-50.19
196,-50.02
197,-49.92
198,-49.84
199,-49.80
200,-49.79
201,-49.80
202,-49.82
203,-49.77
204,-49.68
205,-49.57
206,-49.48
207,-49.47
208,-49.54
209,-49.68
210,-49.92
211,-50.25
212,-50.67
213,-51.11
214,-51.54
215,-51.92
216,-52.25
217,-52.51
218,-52.71
219,-52.87
220,-53.05
221,-53.25
222,-53.49
223,-53.73
224,-53.98
225,-54.22
226,-54.47
227,-54.64
228,-54.76
229,-54.81
230,-54.85
231,-54.87
232,-54.89
233,-54.89
234,-54.86
235,-54.84
236,-54.83
237,-54.81
238,-54.75
239,-54.65
240,-54.55
241,-54.50
242,-54.50
243,-54.53
244,-54.54
245,-54.56
246,-54.57
247,-54.54
248,-54.44
249,-54.27
250,-54.01
251,-53.70
252,-53.39
253,-53.11
254,-52.87
255,-52.70
256,-52.56
257,-52.46
258,-52.35
259,-52.25
260,-52.10
261,-51.92
262,-51.65
263,-51.37
264,-51.08
265,-50.83
266,-50.61
267,-50.42
268,-50.19
269,-49.96
270,-49.68
271,-49.36
272,-48.97
273,-48.55
274,-48.07
275,-47.62
276,-47.16
277,-46.74
278,-46.31
279,-45.92
280,-45.51
281,-45.11
282,-44.65
283,-44.18
284,-43.66
285,-43.15
286,-42.62
287,-42.11
288,-41.58
289,-41.13
290,-40.74
291,-40.48
292,-40.31
293,-40.23
294,-40.21
295,-40.23
296,-40.25
297,-40.25
298,-40.22
299,-40.15
300,-40.01
301,-39.84
302,-39.70
303,-39.62
304,-39.63
305,-39.74
306,-39.92
307,-40.15
308,-40.41
309,-40.67
310,-40.93
311,-41.17
312,-41.40
313,-41.63
314,-41.88
315,-42.10
316,-42.32
317,-42.52
318,-42.71
319,-42.85
320,-42.93
321,-42.95
322,-42.95
323,-42.95
324,-43.02
325,-43.16
326,-43.36
327,-43.58
328,-43.82
329,-44.05
330,-44.27
331,-44.46
332,-44.59
333,-44.64
334,-44.65
335,-44.64
336,-44.68
337,-44.74
338,-44.84
339,-44.94
340,-45.08
341,-45.22
342,-45.38
343,-45.53
344,-45.75
345,-45.99
346,-46.28
347,-46.59
348,-46.94
349,-47.33
350,-47.74
351,-48.14
352,-48.52
353,-48.82
354,-49.09
355,-49.29
356,-49.45
357,-49.55
358,-49.62
359,-49.65
360,-49.71
361,-49.77
362,-49.91
363,-50.09
364,-50.35
365,-50.66
366,-51.04
367,-51.44
368,-51.78
369,-52.04
370,-52.19
371,-52.22
372,-52.12
373,-51.88
374,-51.50
375,-51.02
376,-50.49
377,-49.96
378,-49.45
379,-49.00
380,-48.59
381,-48.26
382,-47.94
383,-47.65
384,-47.36
385,-47.14
386,-46.97
387,-46.87
388,-46.83
389,-46.87
390,-46.95
391,-47.08
392,-47.20
393,-47.29
394,-47.36
395,-47.40
396,-47.41
397,-47.40
398,-47.38
399,-47.35
400,-47.29
401,-47.23
402,-47.19
403,-47.16
404,-47.12
405,-47.07
406,-47.04
407,-47.07
408,-47.16
409,-47.27
410,-47.37
411,-47.43
412,-47.45
413,-47.45
414,-47.43
415,-47.40
416,-47.42
417,-47.49
418,-47.66
419,-47.89
420,-48.17
421,-48.45
422,-48.77
423,-49.06
424,-49.39
425,-49.67
426,-50.00
427,-50.34
428,-50.74
429,-51.15
430,-51.59
431,-52.02
432,-52.53
433,-53.07
434,-53.67
435,-54.24
436,-54.80
437,-55.30
438,-55.78
439,-56.18
440,-56.54
441,-56.80
442,-57.04
443,-57.27
444,-57.53
445,-57.77
446,-58.00
447,-58.17
448,-58.29
449,-58.33
450,-58.27
451,-58.10
452,-57.87
453,-57.61
454,-57.33
455,-57.09
456,-56.89
457,-56.74
458,-56.58
459,-56.41
460,-56.22
461,-56.03
462,-55.80
463,-55.56
464,-55.29
465,-55.07
466,-54.89
467,-54.76
468,-54.66
469,-54.54
470,-54.37
471,-54.18
472,-53.92
473,-53.64
474,-53.31
475,-52.99
476,-52.69
477,-52.45
478,-52.26
479,-52.14
480,-52.05
481,-51.99
482,-51.93
483,-51.85
484,-51.72
485,-51.54
486,-51.32
487,-51.08
488,-50.85
489,-50.65
490,-50.48
491,-50.35
492,-50.25
493,-50.18
494,-50.11
495,-50.03
496,-49.90
497,-49.78
498,-49.70
499,-49.66
500,-49.68
501,-49.77
502,-49.96
503,-50.27
504,-50.68
505,-51.13
506,-51.61
507,-52.04
508,-52.47
509,-52.81
510,-53.14
511,-53.41
512,-53.74
513,-54.12
514,-54.60
515,-55.15
516,-55.76
517,-56.34
518,-56.93
519,-57.43
520,-57.85
521,-58.14
522,-58.35
523,-58.51
524,-58.65
525,-58.78
526,-58.91
527,-58.97
528,-58.95
529,-58.86
530,-58.70
531,-58.48
532,-58.18
533,-57.85
534,-57.53
535,-57.23
536,-56.93
537,-56.66
538,-56.41
539,-56.21
540,-55.97
541,-55.75
542,-55.54
543,-55.40
544,-55.25
545,-55.14
546,-55.02
547,-54.93
548,-54.82
549,-54.67
550,-54.44
551,-54.15
552,-53.82
553,-53.47
554,-53.09
555,-52.69
556,-52.25
557,-51.83
558,-51.39
559,-50.99
560,-50.57
561,-50.17
562,-49.77
563,-49.42
564,-49.03
565,-48.65
566,-48.24
567,-47.87
568,-47.56
569,-47.33
570,-47.13
571,-46.98
572,-46.84
573,-46.75
574,-46.65
575,-46.55
576,-46.42
577,-46.27
578,-46.12
579,-45.98
580,-45.87
581,-45.79
582,-45.70
583,-45.62
584,-45.52
585,-45.43
586,-45.33
587,-45.24
588,-45.13
589,-44.99
590,-44.82
591,-44.64
592,-44.49
593,-44.38
594,-44.31
595,-44.27
596,-44.27
597,-44.33
598,-44.43
599,-44.59
600,-44.76
601,-44.95
602,-45.16
603,-45.35
604,-45.54
605,-45.72
606,-45.90
607,-46.09
608,-46.30
609,-46.52
610,-46.76
611,-47.00
612,-47.29
613,-47.59
614,-47.95
615,-48.30
616,-48.67
617,-49.00
618,-49.35
619,-49.71
620,-50.12
621,-50.53
622,-50.96
623,-51.38
624,-51.78
625,-52.12
626,-52.41
627,-52.63
628,-52.81
629,-52.98
630,-53.16
631,-53.36
632,-53.58
633,-53.79
634,-53.96
635,-54.02
636,-53.96
637,-53.76
638,-53.49
639,-53.18
640,-52.92
641,-52.76
642,-52.70
643,-52.74
644,-52.81
645,-52.91
646,-53.00
647,-53.05
648,-52.98
649,-52.81
650,-52.56
651,-52.29
652,-51.99
653,-51.69
654,-51.38
655,-51.09
656,-50.83
657,-50.59
658,-50.37
659,-50.18
660,-50.00
661,-49.83
662,-49.64
663,-49.45
664,-49.26
665,-49.08
666,-48.89
667,-48.75
668,-48.65
669,-48.58
670,-48.48
671,-48.32
672,-48.13
673,-47.93
674,-47.71
675,-47.51
676,-47.33
677,-47.24
678,-47.25
679,-47.33
680,-47.45
681,-47.58
682,-47.71
683,-47.81
684,-47.89
685,-47.94
686,-48.02
687,-48.15
688,-48.35
689,-48.60
690,-48.92
691,-49.26
692,-49.61
693,-49.91
694,-50.15
695,-50.32
696,-50.45
697,-50.54
698,-50.59
699,-50.61
700,-50.65
701,-50.71
702,-50.78
703,-50.84
704,-50.90
705,-50.95
706,-50.96
707,-50.91
708,-50.82
709,-50.70
710,-50.61
711,-50.53
712,-50.50
713,-50.53
714,-50.62
715,-50.74
716,-50.87
717,-51.00
718,-51.16
719,-51.32
720,-51.47
721,-51.59
722,-51.69
723,-51.77
724,-51.87
725,-51.99
726,-52.15
727,-52.31
728,-52.45
729,-52.58
730,-52.68
731,-52.76
732,-52.78
733,-52.73
734,-52.64
735,-52.48
736,-52.28
737,-52.04
738,-51.79
739,-51.55
740,-51.32
741,-51.09
742,-50.83
743,-50.59
744,-50.32
745,-50.04
746,-49.72
747,-49.41
748,-49.06
749,-48.74
750,-48.34
751,-47.88
752,-47.31
753,-46.69
754,-45.98
755,-45.23
756,-44.41
757,-43.60
758,-42.78
759,-42.04
760,-41.31
761,-40.67
762,-40.05
763,-39.51
764,-39.01
765,-38.60
766,-38.18
767,-37.80
768,-37.44
769,-37.12
770,-36.78
771,-36.48
772,-36.21
773,-36.02
774,-35.90
775,-35.85
776,-35.90
777,-36.05
778,-36.29
779,-36.55
780,-36.82
781,-37.03
782,-37.19
783,-37.32
784,-37.45
785,-37.60
786,-37.84
787,-38.15
788,-38.54
789,-38.95
790,-39.40
791,-39.84
792,-40.28
793,-40.66
794,-41.02
795,-41.34
796,-41.63
797,-41.89
798,-42.19
799,-42.47
800,-42.76
801,-43.02
802,-43.32
803,-43.62
804,-43.95
805,-44.25
806,-44.58
807,-44.91
808,-45.28
809,-45.64
810,-45.98
811,-46.26
812,-46.54
813,-46.79
814,-47.04
815,-47.22
816,-47.36
817,-47.41
818,-47.43
819,-47.42
820,-47.39
821,-47.38
822,-47.41
823,-47.48
824,-47.58
825,-47.67
826,-47.76
827,-47.81
828,-47.82
829,-47.81
830,-47.82
831,-47.90
832,-48.07
833,-48.31
834,-48.63
835,-49.02
836,-49.44
837,-49.82
838,-50.12
839,-50.29
840,-50.35
841,-50.33
842,-50.28
843,-50.20
844,-50.09
845,-49.97
846,-49.88
847,-49.87
848,-49.93
849,-50.04
850,-50.14
851,-50.21
852,-50.20
853,-50.13
854,-49.97
855,-49.71
856,-49.32
857,-48.86
858,-48.38
859,-47.97
860,-47.64
861,-47.39
862,-47.21
863,-47.07
864,-46.91
865,-46.72
866,-46.49
867,-46.23
868,-45.97
869,-45.77
870,-45.69
871,-45.75
872,-45.94
873,-46.20
874,-46.55
875,-46.96
876,-47.39
877,-47.77
878,-48.05
879,-48.23
880,-48.31
881,-48.32
882,-48.26
883,-48.14
884,-48.00
885,-47.84
886,-47.76
887,-47.74
888,-47.82
889,-47.99
890,-48.28
891,-48.66
892,-49.10
893,-49.55
894,-49.97
895,-50.35
896,-50.74
897,-51.07
898,-51.35
899,-51.54
900,-51.69
901,-51.76
902,-51.80
903,-51.80
904,-51.80
905,-51.83
906,-51.95
907,-52.14
908,-52.41
909,-52.72
910,-53.07
911,-53.41
912,-53.72
913,-53.95
914,-54.08
915,-54.12
916,-54.11
917,-54.04
918,-53.93
919,-53.79
920,-53.61
921,-53.42
922,-53.19
923,-52.91
924,-52.57
925,-52.22
926,-51.83
927,-51.47
928,-51.10
929,-50.80
930,-50.51
931,-50.26
932,-49.97
933,-49.67
934,-49.32
935,-48.96
936,-48.53
937,-48.07
938,-47.52
939,-46.97
940,-46.42
941,-45.94
942,-45.51
943,-45.17
944,-44.88
945,-44.68
946,-44.56
947,-44.54
948,-44.64
949,-44.85
950,-45.11
951,-45.44
952,-45.81
953,-46.19
954,-46.55
955,-46.87
956,-47.12
957,-47.27
958,-47.36
959,-47.39
960,-47.39
961,-47.39
962,-47.38
963,-47.38
964,-47.42
965,-47.46
966,-47.55
967,-47.67
968,-47.90
969,-48.22
970,-48.63
971,-49.04
972,-49.47
973,-49.88
974,-50.30
975,-50.68
976,-51.04
977,-51.35
978,-51.65
979,-51.93
980,-52.23
981,-52.50
982,-52.76
983,-52.96
984,-53.15
985,-53.33
986,-53.54
987,-53.81
988,-54.13
989,-54.47
990,-54.83
991,-55.18
992,-55.47
993,-55.69
994,-55.85
995,-55.92
996,-55.92
997,-55.87
998,-55.82
999,-55.79
1000,-55.70
1001,-55.55
1002,-55.35
1003,-55.14
1004,-54.94
1005,-54.78
1006,-54.65
1007,-54.57
1008,-54.50
1009,-54.43
1010,-54.31
1011,-54.16
1012,-53.93
1013,-53.66
1014,-53.29
1015,-52.89
1016,-52.48
1017,-52.11
1018,-51.77
1019,-51.45
1020,-51.17
1021,-50.94
1022,-50.74
1023,-50.56
1024,-50.38
1025,-50.22
1026,-50.09
1027,-50.04
1028,-50.09
1029,-50.22
1030,-50.39
1031,-50.59
1032,-50.77
1033,-50.92
1034,-51.03
1035,-51.11
1036,-51.16
1037,-51.19
1038,-51.25
1039,-51.32
1040,-51.44
1041,-51.59
1042,-51.75
1043,-51.88
1044,-51.98
1045,-52.04
1046,-52.07
1047,-52.06
1048,-51.99
1049,-51.89
1050,-51.81
1051,-51.80
1052,-51.86
1053,-51.96
1054,-52.09
1055,-52.25
1056,-52.41
1057,-52.57
1058,-52.66
1059,-52.64
1060,-52.52
1061,-52.31
1062,-52.09
1063,-51.87
1064,-51.72
1065,-51.66
1066,-51.70
1067,-51.84
1068,-52.03
1069,-52.24
1070,-52.40
1071,-52.49
1072,-52.49
1073,-52.44
1074,-52.34
1075,-52.25
1076,-52.17
1077,-52.13
1078,-52.12
1079,-52.12
1080,-52.11
1081,-52.09
1082,-52.03
1083,-51.94
1084,-51.79
1085,-51.62
1086,-51.44
1087,-51.26
1088,-51.05
1089,-50.80
1090,-50.51
1091,-50.25
1092,-49.99
1093,-49.75
1094,-49.54
1095,-49.37
1096,-49.28
1097,-49.28
1098,-49.37
1099,-49.55
1100,-49.80
1101,-50.09
1102,-50.38
1103,-50.67
1104,-50.93
1105,-51.16
1106,-51.32
1107,-51.41
1108,-51.45
1109,-51.45
1110,-51.42
1111,-51.39
1112,-51.36
1113,-51.30
1114,-51.20
1115,-51.03
1116,-50.82
1117,-50.54
1118,-50.23
1119,-49.91
1120,-49.65
1121,-49.49
1122,-49.45
1123,-49.55
1124,-49.77
1125,-50.06
1126,-50.35
1127,-50.59
1128,-50.72
1129,-50.74
1130,-50.60
1131,-50.36
1132,-50.07
1133,-49.79
1134,-49.51
1135,-49.28
1136,-49.08
1137,-48.93
1138,-48.76
1139,-48.58
1140,-48.33
1141,-48.04
1142,-47.66
1143,-47.25
1144,-46.82
1145,-46.46
1146,-46.13
1147,-45.87
1148,-45.63
1149,-45.45
1150,-45.27
1151,-45.10
1152,-44.90
1153,-44.69
1154,-44.49
1155,-44.35
1156,-44.24
1157,-44.17
1158,-44.12
1159,-44.08
1160,-44.01
1161,-43.90
1162,-43.71
1163,-43.46
1164,-43.17
1165,-42.92
1166,-42.76
1167,-42.70
1168,-42.76
1169,-42.94
1170,-43.16
1171,-43.40
1172,-43.63
1173,-43.83
1174,-43.96
1175,-43.97
1176,-43.88
1177,-43.74
1178,-43.60
1179,-43.53
1180,-43.53
1181,-43.62
1182,-43.79
1183,-44.04
1184,-44.36
1185,-44.66
1186,-44.93
1187,-45.10
1188,-45.19
1189,-45.20
1190,-45.18
1191,-45.17
1192,-45.20
1193,-45.30
1194,-45.46
1195,-45.64
1196,-45.79
1197,-45.88
1198,-45.92
1199,-45.91
1200,-45.88
1201,-45.85
1202,-45.86
1203,-45.93
1204,-46.05
1205,-46.20
1206,-46.39
1207,-46.54
1208,-46.67
1209,-46.74
1210,-46.80
1211,-46.87
1212,-46.96
1213,-47.09
1214,-47.28
1215,-47.51
1216,-47.73
1217,-47.89
1218,-48.01
1219,-48.09
1220,-48.16
1221,-48.22
1222,-48.29
1223,-48.37
1224,-48.49
1225,-48.64
1226,-48.81
1227,-48.97
1228,-49.06
1229,-49.09
1230,-49.08
1231,-49.05
1232,-49.00
1233,-48.93
1234,-48.87
1235,-48.85
1236,-48.86
1237,-48.86
1238,-48.81
1239,-48.68
1240,-48.47
1241,-48.23
1242,-47.97
1243,-47.73
1244,-47.53
1245,-47.42
1246,-47.42
1247,-47.52
1248,-47.66
1249,-47.79
1250,-47.87
1251,-47.87
1252,-47.77
1253,-47.59
1254,-47.36
1255,-47.13
1256,-46.91
1257,-46.75
1258,-46.62
1259,-46.52
1260,-46.40
1261,-46.24
1262,-46.01
1263,-45.73
1264,-45.40
1265,-45.07
1266,-44.77
1267,-44.56
1268,-44.46
1269,-44.50
1270,-44.69
1271,-45.00
1272,-45.36
1273,-45.70
1274,-46.00
1275,-46.25
1276,-46.47
1277,-46.65
1278,-46.80
1279,-46.92
1280,-47.10
1281,-47.31
1282,-47.58
1283,-47.87
1284,-48.22
1285,-48.55
1286,-48.88
1287,-49.13
1288,-49.33
1289,-49.47
1290,-49.58
1291,-49.65
1292,-49.71
1293,-49.73
1294,-49.75
1295,-49.75
1296,-49.71
1297,-49.62
1298,-49.48
1299,-49.28
1300,-49.06
1301,-48.86
1302,-48.73
1303,-48.68
1304,-48.73
1305,-48.85
1306,-49.03
1307,-49.28
1308,-49.55
1309,-49.81
1310,-50.07
1311,-50.29
1312,-50.48
1313,-50.61
1314,-50.70
1315,-50.74
1316,-50.77
1317,-50.77
1318,-50.78
1319,-50.80
1320,-50.88
1321,-51.01
1322,-51.22
1323,-51.48
1324,-51.75
1325,-52.00
1326,-52.23
1327,-52.43
1328,-52.58
1329,-52.72
1330,-52.85
1331,-52.98
1332,-53.11
1333,-53.20
1334,-53.23
1335,-53.19
1336,-53.06
1337,-52.83
1338,-52.52
1339,-52.18
1340,-51.86
1341,-51.59
1342,-51.33
1343,-51.07
1344,-50.80
1345,-50.51
1346,-50.20
1347,-49.86
1348,-49.49
1349,-49.19
1350,-48.93
1351,-48.77
1352,-48.61
1353,-48.47
1354,-48.31
1355,-48.13
1356,-47.93
1357,-47.71
1358,-47.52
1359,-47.40
1360,-47.38
1361,-47.45
1362,-47.62
1363,-47.84
1364,-48.11
1365,-48.34
1366,-48.46
1367,-48.46
1368,-48.39
1369,-48.30
1370,-48.23
1371,-48.17
1372,-48.16
1373,-48.23
1374,-48.39
1375,-48.61
1376,-48.89
1377,-49.20
1378,-49.58
1379,-49.96
1380,-50.32
1381,-50.59
1382,-50.83
1383,-51.06
1384,-51.32
1385,-51.58
1386,-51.88
1387,-52.19
1388,-52.60
1389,-53.03
1390,-53.52
1391,-54.00
1392,-54.52
1393,-55.00
1394,-55.47
1395,-55.88
1396,-56.27
1397,-56.63
1398,-57.01
1399,-57.37
1400,-57.71
1401,-57.99
1402,-58.21
1403,-58.38
1404,-58.49
1405,-58.51
1406,-58.45
1407,-58.30
1408,-58.07
1409,-57.81
1410,-57.50
1411,-57.13
1412,-56.68
1413,-56.21
1414,-55.73
1415,-55.29
1416,-54.91
1417,-54.60
1418,-54.35
1419,-54.19
1420,-54.08
1421,-54.02
1422,-53.96
1423,-53.89
1424,-53.78
1425,-53.67
1426,-53.59
1427,-53.57
1428,-53.60
1429,-53.71
1430,-53.86
1431,-54.02
1432,-54.20
1433,-54.34
1434,-54.40
1435,-54.37
1436,-54.26
1437,-54.11
1438,-53.92
1439,-53.75
1440,-53.61
1441,-53.52
1442,-53.44
1443,-53.34
1444,-53.22
1445,-53.06
1446,-52.88
1447,-52.69
1448,-52.51
1449,-52.41
1450,-52.38
1451,-52.46
1452,-52.61
1453,-52.81
1454,-53.02
1455,-53.22
1456,-53.32
1457,-53.33
1458,-53.28
1459,-53.20
1460,-53.12
1461,-53.08
1462,-53.05
1463,-53.09
1464,-53.19
1465,-53.32
1466,-53.44
1467,-53.50
1468,-53.54
1469,-53.53
1470,-53.47
1471,-53.40
1472,-53.39
1473,-53.49
1474,-53.72
1475,-54.05
1476,-54.50
1477,-54.97
1478,-55.41
1479,-55.72
1480,-55.87
1481,-55.88
1482,-55.77
1483,-55.60
1484,-55.44
1485,-55.37
1486,-55.39
1487,-55.50
1488,-55.66
1489,-55.82
1490,-55.89
1491,-55.81
1492,-55.55
1493,-55.16
1494,-54.66
1495,-54.14
1496,-53.63
1497,-53.18
1498,-52.80
1499,-52.50
1500,-52.22
1501,-51.94
1502,-51.63
1503,-51.30
1504,-50.91
1505,-50.53
1506,-50.14
1507,-49.84
1508,-49.61
1509,-49.51
1510,-49.51
1511,-49.55
1512,-49.55
1513,-49.48
1514,-49.33
1515,-49.13
1516,-48.85
1517,-48.55
1518,-48.21
1519,-47.90
1520,-47.60
1521,-47.31
1522,-46.99
1523,-46.65
1524,-46.20
1525,-45.72
1526,-45.17
1527,-44.63
1528,-44.08
1529,-43.59
1530,-43.17
1531,-42.84
1532,-42.52
1533,-42.24
1534,-41.94
1535,-41.65
1536,-41.31
1537,-40.92
1538,-40.44
1539,-39.97
1540,-39.51
1541,-39.12
1542,-38.82
1543,-38.64
1544,-38.54
1545,-38.53
1546,-38.56
1547,-38.63
1548,-38.70
1549,-38.74
1550,-38.73
1551,-38.70
1552,-38.64
1553,-38.61
1554,-38.60
1555,-38.64
1556,-38.70
1557,-38.78
1558,-38.83
1559,-38.83
1560,-38.77
1561,-38.65
1562,-38.50
1563,-38.35
1564,-38.27
1565,-38.25
1566,-38.31
1567,-38.44
1568,-38.60
1569,-38.76
1570,-38.93
1571,-39.09
1572,-39.28
1573,-39.51
1574,-39.79
1575,-40.11
1576,-40.45
1577,-40.77
1578,-41.07
1579,-41.32
1580,-41.56
1581,-41.77
1582,-41.99
1583,-42.19
1584,-42.39
1585,-42.56
1586,-42.70
1587,-42.78
1588,-42.80
1589,-42.77
1590,-42.74
1591,-42.69
1592,-42.67
1593,-42.66
1594,-42.74
1595,-42.88
1596,-43.08
1597,-43.26
1598,-43.43
1599,-43.60
1600,-43.79
1601,-44.00
1602,-44.24
1603,-44.49
1604,-44.76
1605,-45.03
1606,-45.28
1607,-45.47
1608,-45.61
1609,-45.70
1610,-45.75
1611,-45.75
1612,-45.75
1613,-45.72
1614,-45.68
1615,-45.62
1616,-45.53
1617,-45.43
1618,-45.30
1619,-45.17
1620,-45.02
1621,-44.86
1622,-44.68
1623,-44.52
1624,-44.38
1625,-44.28
1626,-44.20
1627,-44.15
1628,-44.15
1629,-44.20
1630,-44.25
1631,-44.27
1632,-44.22
1633,-44.10
1634,-43.94
1635,-43.77
1636,-43.62
1637,-43.53
1638,-43.53
1639,-43.61
1640,-43.80
1641,-44.05
1642,-44.36
1643,-44.64
1644,-44.87
1645,-44.98
1646,-45.00
1647,-44.94
1648,-44.89
1649,-44.87
1650,-44.91
1651,-45.02
1652,-45.24
1653,-45.55
1654,-45.95
1655,-46.39
1656,-46.83
1657,-47.22
1658,-47.54
1659,-47.79
1660,-48.00
1661,-48.16
1662,-48.32
1663,-48.47
1664,-48.64
1665,-48.79
1666,-48.89
1667,-48.90
1668,-48.83
1669,-48.68
1670,-48.47
1671,-48.26
1672,-48.09
1673,-48.00
1674,-47.98
1675,-48.05
1676,-48.16
1677,-48.25
1678,-48.26
1679,-48.16
1680,-47.96
1681,-47.72
1682,-47.46
1683,-47.22
1684,-47.02
1685,-46.91
1686,-46.93
1687,-47.05
1688,-47.23
1689,-47.44
1690,-47.62
1691,-47.81
1692,-47.97
1693,-48.11
1694,-48.20
1695,-48.26
1696,-48.29
1697,-48.33
1698,-48.34
1699,-48.32
1700,-48.23
1701,-48.10
1702,-47.91
1703,-47.69
1704,-47.43
1705,-47.13
1706,-46.79
1707,-46.43
1708,-46.07
1709,-45.77
1710,-45.49
1711,-45.30
1712,-45.15
1713,-45.07
1714,-45.01
1715,-44.98
1716,-44.91
1717,-44.85
1718,-44.72
1719,-44.56
1720,-44.30
1721,-44.02
1722,-43.72
1723,-43.44
1724,-43.17
1725,-42.94
1726,-42.74
1727,-42.59
1728,-42.48
1729,-42.40
1730,-42.30
1731,-42.18
1732,-42.05
1733,-41.95
1734,-41.88
1735,-41.88
1736,-41.96
1737,-42.10
1738,-42.24
1739,-42.35
1740,-42.41
1741,-42.39
1742,-42.27
1743,-42.06
1744,-41.82
1745,-41.61
1746,-41.50
1747,-41.50
1748,-41.63
1749,-41.89
1750,-42.30
1751,-42.80
1752,-43.33
1753,-43.83
1754,-44.26
1755,-44.57
1756,-44.81
1757,-44.95
1758,-45.04
1759,-45.07
1760,-45.12
1761,-45.17
1762,-45.27
1763,-45.36
1764,-45.48
1765,-45.61
1766,-45.78
1767,-45.94
1768,-46.13
1769,-46.34
1770,-46.62
1771,-46.97
1772,-47.37
1773,-47.78
1774,-48.20
1775,-48.57
1776,-48.85
1777,-49.00
1778,-49.03
1779,-48.93
1780,-48.74
1781,-48.46
1782,-48.16
1783,-47.87
1784,-47.64
1785,-47.46
1786,-47.33
1787,-47.20
1788,-47.10
1789,-47.04
1790,-46.97
1791,-46.92
1792,-46.84
1793,-46.76
1794,-46.64
1795,-46.52
1796,-46.41
1797,-46.30
1798,-46.15
1799,-45.97
1800,-45.69
1801,-45.37
1802,-45.01
1803,-44.63
1804,-44.26
1805,-43.95
1806,-43.72
1807,-43.63
1808,-43.66
1809,-43.79
1810,-43.96
1811,-44.15
1812,-44.30
1813,-44.40
1814,-44.39
1815,-44.27
1816,-44.01
1817,-43.68
1818,-43.29
1819,-42.88
1820,-42.44
1821,-42.02
1822,-41.62
1823,-41.28
1824,-41.00
1825,-40.79
1826,-40.65
1827,-40.60
1828,-40.67
1829,-40.86
1830,-41.13
1831,-41.47
1832,-41.89
1833,-42.33
1834,-42.79
1835,-43.22
1836,-43.62
1837,-43.97
1838,-44.26
1839,-44.45
1840,-44.53
1841,-44.53
1842,-44.50
1843,-44.48
1844,-44.47
1845,-44.49
1846,-44.55
1847,-44.67
1848,-44.82
1849,-44.96
1850,-45.05
1851,-45.07
1852,-44.97
1853,-44.77
1854,-44.49
1855,-44.20
1856,-43.92
1857,-43.71
1858,-43.57
1859,-43.53
1860,-43.59
1861,-43.74
1862,-43.94
1863,-44.13
1864,-44.34
1865,-44.53
1866,-44.74
1867,-44.97
1868,-45.31
1869,-45.73
1870,-46.23
1871,-46.74
1872,-47.29
1873,-47.83
1874,-48.36
1875,-48.77
1876,-49.13
1877,-49.39
1878,-49.59
1879,-49.69
1880,-49.71
1881,-49.66
1882,-49.67
1883,-49.76
1884,-49.96
1885,-50.22
1886,-50.54
1887,-50.85
1888,-51.10
1889,-51.25
1890,-51.31
1891,-51.25
1892,-51.12
1893,-50.95
1894,-50.80
1895,-50.72
1896,-50.72
1897,-50.76
1898,-50.80
1899,-50.79
1900,-50.74
1901,-50.67
1902,-50.60
1903,-50.54
1904,-50.54
1905,-50.58
1906,-50.70
1907,-50.88
1908,-51.07
1909,-51.22
1910,-51.33
1911,-51.38
1912,-51.41
1913,-51.45
1914,-51.50
1915,-51.61
1916,-51.74
1917,-51.90
1918,-52.03
1919,-52.09
1920,-52.06
1921,-51.93
1922,-51.70
1923,-51.41
1924,-51.09
1925,-50.83
1926,-50.63
1927,-50.50
1928,-50.40
1929,-50.32
1930,-50.23
1931,-50.16
1932,-50.07
1933,-49.96
1934,-49.80
1935,-49.64
1936,-49.49
1937,-49.39
1938,-49.30
1939,-49.22
1940,-49.18
1941,-49.15
1942,-49.12
1943,-49.02
1944,-48.87
1945,-48.70
1946,-48.58
1947,-48.54
1948,-48.64
1949,-48.89
1950,-49.31
1951,-49.84
1952,-50.45
1953,-51.02
1954,-51.52
1955,-51.92
1956,-52.24
1957,-52.45
1958,-52.60
1959,-52.71
1960,-52.87
1961,-53.09
1962,-53.36
1963,-53.63
1964,-53.89
1965,-54.09
1966,-54.24
1967,-54.35
1968,-54.41
1969,-54.43
1970,-54.38
1971,-54.26
1972,-54.08
1973,-53.83
1974,-53.54
1975,-53.20
1976,-52.81
1977,-52.42
1978,-52.06
1979,-51.80
1980,-51.62
1981,-51.54
1982,-51.51
1983,-51.54
1984,-51.57
1985,-51.63
1986,-51.63
1987,-51.61
1988,-51.57
1989,-51.54
1990,-51.51
1991,-51.48
1992,-51.46
1993,-51.45
1994,-51.41
1995,-51.34
1996,-51.22
1997,-51.07
1998,-50.90
1999,-50.74
2000,-50.58
2001,-50.48
2002,-50.42
2003,-50.37
2004,-50.29
2005,-50.18
2006,-50.06
2007,-49.98
2008,-49.92
2009,-49.88
2010,-49.83
2011,-49.80
2012,-49.74
2013,-49.70
2014,-49.59
2015,-49.42
2016,-49.14
2017,-48.81
2018,-48.45
2019,-48.12
2020,-47.80
2021,-47.52
2022,-47.26
2023,-47.02
2024,-46.80
2025,-46.60
2026,-46.36
2027,-46.10
2028,-45.78
2029,-45.46
2030,-45.14
2031,-44.86
2032,-44.60
2033,-44.40
2034,-44.26
2035,-44.24
2036,-44.30
2037,-44.40
2038,-44.46
2039,-44.46
2040,-44.43
2041,-44.38
2042,-44.31
2043,-44.20
2044,-44.07
2045,-43.90
2046,-43.72
2047,-43.56
2048,-43.41
2049,-43.24
2050,-43.05
2051,-42.89
2052,-42.82
2053,-42.87
2054,-43.02
2055,-43.24
2056,-43.51
2057,-43.79
2058,-44.03
2059,-44.14
2060,-44.17
2061,-44.17
2062,-44.18
2063,-44.25
2064,-44.42
2065,-44.72
2066,-45.15
2067,-45.62
2068,-46.04
2069,-46.33
2070,-46.46
2071,-46.44
2072,-46.27
2073,-45.97
2074,-45.57
2075,-45.14
2076,-44.71
2077,-44.33
2078,-44.01
2079,-43.77
2080,-43.59
2081,-43.48
2082,-43.43
2083,-43.43
2084,-43.43
2085,-43.44
2086,-43.40
2087,-43.33
2088,-43.17
2089,-42.98
2090,-42.66
2091,-42.30
2092,-41.88
2093,-41.44
2094,-40.99
2095,-40.53
2096,-40.09
2097,-39.72
2098,-39.41
2099,-39.19
2100,-39.05
2101,-39.03
2102,-39.09
2103,-39.18
2104,-39.27
2105,-39.34
2106,-39.36
2107,-39.38
2108,-39.38
2109,-39.34
2110,-39.28
2111,-39.22
2112,-39.19
2113,-39.13
2114,-39.00
2115,-38.78
2116,-38.57
2117,-38.40
2118,-38.35
2119,-38.38
2120,-38.56
2121,-38.86
2122,-39.27
2123,-39.71
2124,-40.17
2125,-40.57
2126,-40.92
2127,-41.19
2128,-41.42
2129,-41.60
2130,-41.82
2131,-42.03
2132,-42.27
2133,-42.53
2134,-42.81
2135,-43.07
2136,-43.30
2137,-43.49
2138,-43.66
2139,-43.82
2140,-43.98
2141,-44.10
2142,-44.16
2143,-44.17
2144,-44.17
2145,-44.17
2146,-44.16
2147,-44.17
2148,-44.27
2149,-44.43
2150,-44.68
2151,-44.97
2152,-45.30
2153,-45.61
2154,-45.85
2155,-45.94
2156,-45.96
2157,-45.94
2158,-45.91
2159,-45.89
2160,-45.91
2161,-45.98
2162,-46.12
2163,-46.30
2164,-46.51
2165,-46.71
2166,-46.88
2167,-47.03
2168,-47.15
2169,-47.23
2170,-47.23
2171,-47.15
2172,-47.02
2173,-46.84
2174,-46.62
2175,-46.36
2176,-46.10
2177,-45.90
2178,-45.80
2179,-45.82
2180,-45.94
2181,-46.14
2182,-46.38
2183,-46.59
2184,-46.72
2185,-46.75
2186,-46.64
2187,-46.43
2188,-46.14
2189,-45.85
2190,-45.55
2191,-45.30
2192,-45.07
2193,-44.88
2194,-44.65
2195,-44.40
2196,-44.11
2197,-43.76
2198,-43.38
2199,-43.04
2200,-42.76
2201,-42.57
2202,-42.43
2203,-42.32
2204,-42.22
2205,-42.13
2206,-42.01
2207,-41.89
2208,-41.76
2209,-41.63
2210,-41.50
2211,-41.40
2212,-41.39
2213,-41.48
2214,-41.67
2215,-41.92
2216,-42.23
2217,-42.61
2218,-43.04
2219,-43.44
2220,-43.82
2221,-44.11
2222,-44.33
2223,-44.44
2224,-44.48
2225,-44.44
2226,-44.39
2227,-44.33
2228,-44.32
2229,-44.34
2230,-44.44
2231,-44.56
2232,-44.72
2233,-44.87
2234,-45.04
2235,-45.19
2236,-45.33
2237,-45.46
2238,-45.58
2239,-45.68
2240,-45.74
2241,-45.75
2242,-45.75
2243,-45.75
2244,-45.73
2245,-45.72
2246,-45.74
2247,-45.81
2248,-45.93
2249,-46.08
2250,-46.26
2251,-46.47
2252,-46.68
2253,-46.88
2254,-47.06
2255,-47.24
2256,-47.42
2257,-47.58
2258,-47.73
2259,-47.86
2260,-47.99
2261,-48.07
2262,-48.11
2263,-48.08
2264,-48.02
2265,-47.93
2266,-47.84
2267,-47.78
2268,-47.79
2269,-47.87
2270,-48.02
2271,-48.22
2272,-48.51
2273,-48.87
2274,-49.28
2275,-49.67
2276,-50.05
2277,-50.37
2278,-50.63
2279,-50.81
2280,-50.93
2281,-50.96
2282,-50.95
2283,-50.90
2284,-50.86
2285,-50.82
2286,-50.79
2287,-50.77
2288,-50.74
2289,-50.72
2290,-50.70
2291,-50.67
2292,-50.65
2293,-50.62
2294,-50.56
2295,-50.44
2296,-50.29
2297,-50.13
2298,-49.99
2299,-49.87
2300,-49.77
2301,-49.72
2302,-49.70
2303,-49.70
2304,-49.71
2305,-49.74
2306,-49.81
2307,-49.96
2308,-50.18
2309,-50.45
2310,-50.76
2311,-51.09
2312,-51.41
2313,-51.67
2314,-51.83
2315,-51.86
2316,-51.82
2317,-51.73
2318,-51.61
2319,-51.48
2320,-51.33
2321,-51.18
2322,-51.03
2323,-50.87
2324,-50.67
2325,-50.45
2326,-50.23
2327,-50.09
2328,-50.04
2329,-50.11
2330,-50.26
2331,-50.47
2332,-50.66
2333,-50.77
2334,-50.80
2335,-50.76
2336,-50.67
2337,-50.58
2338,-50.57
2339,-50.66
2340,-50.87
2341,-51.13
2342,-51.41
2343,-51.62
2344,-51.78
2345,-51.86
2346,-51.87
2347,-51.82
2348,-51.78
2349,-51.79
2350,-51.85
2351,-51.94
2352,-52.06
2353,-52.20
2354,-52.32
2355,-52.40
2356,-52.44
2357,-52.44
2358,-52.45
2359,-52.49
2360,-52.53
2361,-52.57
2362,-52.55
2363,-52.47
2364,-52.30
2365,-52.05
2366,-51.69
2367,-51.28
2368,-50.80
2369,-50.32
2370,-49.81
2371,-49.35
2372,-48.90
2373,-48.54
2374,-48.21
2375,-47.92
2376,-47.60
2377,-47.27
2378,-46.89
2379,-46.52
2380,-46.09
2381,-45.68
2382,-45.29
2383,-44.98
2384,-44.74
2385,-44.59
2386,-44.49
2387,-44.48
2388,-44.53
2389,-44.61
2390,-44.67
2391,-44.71
2392,-44.71
2393,-44.71
2394,-44.71
2395,-44.75
2396,-44.85
2397,-45.03
2398,-45.24
2399,-45.46
2400,-45.62
2401,-45.71
2402,-45.73
2403,-45.67
2404,-45.52
2405,-45.30
2406,-45.03
2407,-44.75
2408,-44.50
2409,-44.29
2410,-44.11
2411,-43.98
2412,-43.89
2413,-43.85
2414,-43.89
2415,-44.01
2416,-44.21
2417,-44.49
2418,-44.86
2419,-45.29
2420,-45.73
2421,-46.13
2422,-46.46
2423,-46.67
2424,-46.78
2425,-46.80
2426,-46.78
2427,-46.76
2428,-46.78
2429,-46.84
2430,-46.99
2431,-47.18
2432,-47.42
2433,-47.67
2434,-47.93
2435,-48.19
2436,-48.48
2437,-48.75
2438,-49.03
2439,-49.31
2440,-49.59
2441,-49.87
2442,-50.14
2443,-50.39
2444,-50.64
2445,-50.85
2446,-50.99
2447,-51.06
2448,-51.04
2449,-50.96
2450,-50.81
2451,-50.59
2452,-50.32
2453,-50.03
2454,-49.74
2455,-49.46
2456,-49.19
2457,-48.97
2458,-48.71
2459,-48.44
2460,-48.10
2461,-47.74
2462,-47.32
2463,-46.88
2464,-46.40
2465,-45.92
2466,-45.40
2467,-44.88
2468,-44.36
2469,-43.92
2470,-43.54
2471,-43.27
2472,-43.05
2473,-42.90
2474,-42.76
2475,-42.67
2476,-42.58
2477,-42.49
2478,-42.34
2479,-42.18
2480,-41.95
2481,-41.71
2482,-41.45
2483,-41.19
2484,-40.90
2485,-40.60
2486,-40.28
2487,-39.94
2488,-39.60
2489,-39.25
2490,-38.91
2491,-38.60
2492,-38.34
2493,-38.12
2494,-37.93
2495,-37.80
2496,-37.72
2497,-37.70
2498,-37.69
2499,-37.64
2500,-37.54
2501,-37.44
2502,-37.30
2503,-37.15
2504,-37.04
2505,-37.01
2506,-37.12
2507,-37.34
2508,-37.68
2509,-38.08
2510,-38.52
2511,-38.94
2512,-39.33
2513,-39.65
2514,-39.92
2515,-40.14
2516,-40.37
2517,-40.66
2518,-41.02
2519,-41.41
2520,-41.81
2521,-42.13
2522,-42.39
2523,-42.51
2524,-42.53
2525,-42.40
2526,-42.22
2527,-42.03
2528,-41.95
2529,-42.01
2530,-42.25
2531,-42.63
2532,-43.12
2533,-43.66
2534,-44.20
2535,-44.64
2536,-44.97
2537,-45.14
2538,-45.20
2539,-45.19
2540,-45.19
2541,-45.24
2542,-45.45
2543,-45.79
2544,-46.26
2545,-46.78
2546,-47.32
2547,-47.81
2548,-48.26
2549,-48.58
2550,-48.78
2551,-48.87
2552,-48.94
2553,-49.02
2554,-49.15
2555,-49.28
2556,-49.42
2557,-49.51
2558,-49.58
2559,-49.59
2560,-49.57
2561,-49.51
2562,-49.51
2563,-49.56
2564,-49.71
2565,-49.92
2566,-50.22
2567,-50.55
2568,-50.88
2569,-51.14
2570,-51.29
2571,-51.33
2572,-51.29
2573,-51.19
2574,-51.02
2575,-50.80
2576,-50.54
2577,-50.27
2578,-49.96
2579,-49.64
2580,-49.24
2581,-48.81
2582,-48.34
2583,-47.89
2584,-47.44
2585,-47.03
2586,-46.62
2587,-46.25
2588,-45.92
2589,-45.65
2590,-45.36
2591,-45.04
2592,-44.66
2593,-44.30
2594,-43.93
2595,-43.61
2596,-43.31
2597,-43.08
2598,-42.90
2599,-42.78
2600,-42.65
2601,-42.49
2602,-42.27
2603,-42.02
2604,-41.73
2605,-41.40
2606,-41.05
2607,-40.78
2608,-40.63
2609,-40.62
2610,-40.69
2611,-40.82
2612,-40.99
2613,-41.21
2614,-41.40
2615,-41.53
2616,-41.63
2617,-41.72
2618,-41.86
2619,-42.02
2620,-42.20
2621,-42.36
2622,-42.53
2623,-42.69
2624,-42.85
2625,-42.98
2626,-43.11
2627,-43.27
2628,-43.48
2629,-43.73
2630,-44.01
2631,-44.30
2632,-44.58
2633,-44.78
2634,-44.91
2635,-44.93
2636,-44.89
2637,-44.81
2638,-44.72
2639,-44.65
2640,-44.66
2641,-44.75
2642,-44.92
2643,-45.14
2644,-45.40
2645,-45.65
2646,-45.90
2647,-46.10
2648,-46.28
2649,-46.42
2650,-46.58
2651,-46.74
2652,-46.91
2653,-47.07
2654,-47.22
2655,-47.36
2656,-47.49
2657,-47.59
2658,-47.66
2659,-47.67
2660,-47.63
2661,-47.57
2662,-47.52
2663,-47.49
2664,-47.44
2665,-47.34
2666,-47.20
2667,-47.09
2668,-46.98
2669,-46.87
2670,-46.71
2671,-46.51
2672,-46.30
2673,-46.13
2674,-45.96
2675,-45.78
2676,-45.54
2677,-45.30
2678,-45.07
2679,-44.90
2680,-44.75
2681,-44.62
2682,-44.50
2683,-44.43
2684,-44.39
2685,-44.34
2686,-44.28
2687,-44.24
2688,-44.23
2689,-44.26
2690,-44.30
2691,-44.36
2692,-44.47
2693,-44.61
2694,-44.79
2695,-44.98
2696,-45.20
2697,-45.46
2698,-45.81
2699,-46.20
2700,-46.67
2701,-47.12
2702,-47.58
2703,-47.99
2704,-48.38
2705,-48.68
2706,-48.92
2707,-49.10
2708,-49.33
2709,-49.61
2710,-50.00
2711,-50.45
2712,-51.02
2713,-51.63
2714,-52.29
2715,-52.90
2716,-53.47
2717,-53.92
2718,-54.28
2719,-54.52
2720,-54.72
2721,-54.85
2722,-54.97
2723,-55.07
2724,-55.21
2725,-55.40
2726,-55.62
2727,-55.82
2728,-55.97
2729,-56.03
2730,-55.98
2731,-55.84
2732,-55.60
2733,-55.31
2734,-55.02
2735,-54.74
2736,-54.50
2737,-54.37
2738,-54.30
2739,-54.28
2740,-54.20
2741,-54.04
2742,-53.76
2743,-53.41
2744,-53.01
2745,-52.64
2746,-52.34
2747,-52.16
2748,-52.09
2749,-52.09
2750,-52.15
2751,-52.25
2752,-52.32
2753,-52.32
2754,-52.24
2755,-52.10
2756,-51.96
2757,-51.88
2758,-51.89
2759,-51.98
2760,-52.13
2761,-52.31
2762,-52.51
2763,-52.69
2764,-52.83
2765,-52.95
2766,-53.07
2767,-53.22
2768,-53.41
2769,-53.66
2770,-53.99
2771,-54.40
2772,-54.84
2773,-55.26
2774,-55.63
2775,-55.88
2776,-56.01
2777,-55.99
2778,-55.85
2779,-55.66
2780,-55.44
2781,-55.26
2782,-55.12
2783,-55.04
2784,-54.98
2785,-54.92
2786,-54.78
2787,-54.53
2788,-54.13
2789,-53.66
2790,-53.16
2791,-52.73
2792,-52.35
2793,-52.12
2794,-51.98
2795,-51.97
2796,-51.96
2797,-51.92
2798,-51.75
2799,-51.50
2800,-51.11
2801,-50.66
2802,-50.13
2803,-49.58
2804,-49.00
2805,-48.46
2806,-47.93
2807,-47.45
2808,-46.96
2809,-46.46
2810,-45.92
2811,-45.41
2812,-44.90
2813,-44.41
2814,-43.90
2815,-43.43
2816,-43.02
2817,-42.71
2818,-42.47
2819,-42.31
2820,-42.23
2821,-42.24
2822,-42.34
2823,-42.49
2824,-42.70
2825,-42.97
2826,-43.29
2827,-43.65
2828,-44.04
2829,-44.47
2830,-44.96
2831,-45.49
2832,-46.07
2833,-46.62
2834,-47.13
2835,-47.52
2836,-47.83
2837,-48.01
2838,-48.13
2839,-48.16
2840,-48.17
2841,-48.17
2842,-48.17
2843,-48.18
2844,-48.25
2845,-48.36
2846,-48.49
2847,-48.58
2848,-48.56
2849,-48.45
2850,-48.23
2851,-47.97
2852,-47.62
2853,-47.26
2854,-46.88
2855,-46.55
2856,-46.26
2857,-46.02
2858,-45.78
2859,-45.56
2860,-45.33
2861,-45.09
2862,-44.86
2863,-44.69
2864,-44.56
2865,-44.53
2866,-44.55
2867,-44.64
2868,-44.79
2869,-44.98
2870,-45.14
2871,-45.28
2872,-45.39
2873,-45.49
2874,-45.60
2875,-45.72
2876,-45.85
2877,-46.01
2878,-46.23
2879,-46.51
2880,-46.84
2881,-47.13
2882,-47.39
2883,-47.56
2884,-47.70
2885,-47.79
2886,-47.87
2887,-47.95
2888,-48.03
2889,-48.10
2890,-48.16
2891,-48.18
2892,-48.16
2893,-48.08
2894,-47.94
2895,-47.72
2896,-47.48
2897,-47.24
2898,-47.08
2899,-46.99
2900,-46.96
2901,-46.99
2902,-47.09
2903,-47.25
2904,-47.45
2905,-47.64
2906,-47.78
2907,-47.84
2908,-47.86
2909,-47.85
2910,-47.87
2911,-47.90
2912,-48.01
2913,-48.19
2914,-48.52
2915,-48.96
2916,-49.53
2917,-50.11
2918,-50.66
2919,-51.10
2920,-51.46
2921,-51.72
2922,-51.90
2923,-51.99
2924,-52.07
2925,-52.13
2926,-52.25
2927,-52.39
2928,-52.59
2929,-52.80
2930,-52.99
2931,-53.12
2932,-53.15
2933,-53.06
2934,-52.87
2935,-52.62
2936,-52.35
2937,-52.09
2938,-51.86
2939,-51.67
2940,-51.53
2941,-51.48
2942,-51.45
2943,-51.42
2944,-51.32
2945,-51.16
2946,-50.93
2947,-50.66
2948,-50.37
2949,-50.10
2950,-49.87
2951,-49.73
2952,-49.64
2953,-49.61
2954,-49.57
2955,-49.51
2956,-49.43
2957,-49.34
2958,-49.18
2959,-48.97
2960,-48.72
2961,-48.45
2962,-48.16
2963,-47.86
2964,-47.51
2965,-47.13
2966,-46.73
2967,-46.33
2968,-45.94
2969,-45.58
2970,-45.27
2971,-45.08
2972,-45.01
2973,-45.07
2974,-45.23
2975,-45.45
2976,-45.70
2977,-45.94
2978,-46.12
2979,-46.23
2980,-46.27
2981,-46.28
2982,-46.28
2983,-46.31
2984,-46.39
2985,-46.56
2986,-46.80
2987,-47.04
2988,-47.23
2989,-47.36
2990,-47.41
2991,-47.39
2992,-47.31
2993,-47.18
2994,-47.07
2995,-47.04
2996,-47.11
2997,-47.29
2998,-47.49
2999,-47.65
3000,-47.70
3001,-47.65
3002,-47.45
3003,-47.13
3004,-46.66
3005,-46.11
3006,-45.51
3007,-44.91
3008,-44.31
3009,-43.77
3010,-43.28
3011,-42.89
3012,-42.60
3013,-42.44
3014,-42.40
3015,-42.47
3016,-42.57
3017,-42.69
3018,-42.79
3019,-42.85
3020,-42.84
3021,-42.79
3022,-42.71
3023,-42.68
3024,-42.70
3025,-42.79
3026,-42.89
3027,-43.01
3028,-43.12
3029,-43.21
3030,-43.29
3031,-43.37
3032,-43.43
3033,-43.48
3034,-43.50
3035,-43.49
3036,-43.42
3037,-43.28
3038,-43.10
3039,-42.88
3040,-42.63
3041,-42.38
3042,-42.18
3043,-42.05
3044,-41.98
3045,-42.00
3046,-42.00
3047,-41.97
3048,-41.83
3049,-41.62
3050,-41.31
3051,-40.94
3052,-40.49
3053,-40.01
3054,-39.48
3055,-38.96
3056,-38.43
3057,-37.92
3058,-37.41
3059,-36.96
3060,-36.58
3061,-36.30
3062,-36.12
3063,-36.03
3064,-36.00
3065,-36.03
3066,-36.08
3067,-36.16
3068,-36.23
3069,-36.26
3070,-36.25
3071,-36.22
3072,-36.19
3073,-36.18
3074,-36.16
3075,-36.16
3076,-36.20
3077,-36.25
3078,-36.29
3079,-36.27
3080,-36.19
3081,-36.06
3082,-35.90
3083,-35.72
3084,-35.55
3085,-35.44
3086,-35.44
3087,-35.57
3088,-35.83
3089,-36.16
3090,-36.51
3091,-36.82
3092,-37.09
3093,-37.30
3094,-37.45
3095,-37.57
3096,-37.69
3097,-37.84
3098,-38.08
3099,-38.35
3100,-38.67
3101,-38.96
3102,-39.18
3103,-39.31
3104,-39.35
3105,-39.34
3106,-39.32
3107,-39.33
3108,-39.43
3109,-39.60
3110,-39.90
3111,-40.25
3112,-40.63
3113,-40.95
3114,-41.25
3115,-41.49
3116,-41.70
3117,-41.88
3118,-42.08
3119,-42.35
3120,-42.73
3121,-43.20
3122,-43.74
3123,-44.28
3124,-44.81
3125,-45.26
3126,-45.65
3127,-45.93
3128,-46.13
3129,-46.26
3130,-46.39
3131,-46.53
3132,-46.68
3133,-46.82
3134,-46.97
3135,-47.07
3136,-47.13
3137,-47.07
3138,-46.93
3139,-46.71
3140,-46.42
3141,-46.12
3142,-45.81
3143,-45.57
3144,-45.33
3145,-45.12
3146,-44.90
3147,-44.70
3148,-44.47
3149,-44.21
3150,-43.88
3151,-43.55
3152,-43.20
3153,-42.88
3154,-42.55
3155,-42.20
3156,-41.80
3157,-41.40
3158,-40.99
3159,-40.56
3160,-40.08
3161,-39.65
3162,-39.25
3163,-38.91
3164,-38.58
3165,-38.28
3166,-38.00
3167,-37.77
3168,-37.53
3169,-37.31
3170,-37.12
3171,-37.02
3172,-36.99
3173,-37.04
3174,-37.13
3175,-37.27
3176,-37.46
3177,-37.68
3178,-37.90
3179,-38.11
3180,-38.33
3181,-38.54
3182,-38.77
3183,-38.97
3184,-39.18
3185,-39.39
3186,-39.60
3187,-39.77
3188,-39.94
3189,-40.10
3190,-40.33
3191,-40.57
3192,-40.86
3193,-41.14
3194,-41.44
3195,-41.74
3196,-42.08
3197,-42.42
3198,-42.75
3199,-43.01
3200,-43.24
3201,-43.38
3202,-43.46
3203,-43.46
3204,-43.43
3205,-43.39
3206,-43.36
3207,-43.37
3208,-43.45
3209,-43.62
3210,-43.85
3211,-44.11
3212,-44.33
3213,-44.49
3214,-44.57
3215,-44.56
3216,-44.46
3217,-44.29
3218,-44.14
3219,-44.03
3220,-43.95
3221,-43.88
3222,-43.83
3223,-43.79
3224,-43.75
3225,-43.71
3226,-43.69
3227,-43.70
3228,-43.73
3229,-43.78
3230,-43.87
3231,-44.02
3232,-44.26
3233,-44.56
3234,-44.92
3235,-45.31
3236,-45.70
3237,-46.03
3238,-46.29
3239,-46.46
3240,-46.57
3241,-46.62
3242,-46.59
3243,-46.53
3244,-46.46
3245,-46.43
3246,-46.43
3247,-46.46
3248,-46.48
3249,-46.49
3250,-46.48
3251,-46.42
3252,-46.31
3253,-46.15
3254,-45.94
3255,-45.71
3256,-45.44
3257,-45.16
3258,-44.85
3259,-44.53
3260,-44.17
3261,-43.78
3262,-43.36
3263,-42.98
3264,-42.65
3265,-42.42
3266,-42.29
3267,-42.28
3268,-42.38
3269,-42.56
3270,-42.73
3271,-42.88
3272,-43.01
3273,-43.10
3274,-43.14
3275,-43.16
3276,-43.18
3277,-43.25
3278,-43.37
3279,-43.52
3280,-43.70
3281,-43.87
3282,-43.97
3283,-43.98
3284,-43.88
3285,-43.69
3286,-43.45
3287,-43.22
3288,-43.07
3289,-43.04
3290,-43.13
3291,-43.31
3292,-43.55
3293,-43.80
3294,-44.06
3295,-44.28
3296,-44.43
3297,-44.51
3298,-44.55
3299,-44.58
3300,-44.65
3301,-44.75
3302,-44.90
3303,-45.06
3304,-45.24
3305,-45.42
3306,-45.60
3307,-45.77
3308,-45.96
3309,-46.17
3310,-46.41
3311,-46.69
3312,-47.03
3313,-47.37
3314,-47.68
3315,-47.90
3316,-48.05
3317,-48.13
3318,-48.19
3319,-48.22
3320,-48.22
3321,-48.22
3322,-48.25
3323,-48.34
3324,-48.47
3325,-48.61
3326,-48.71
3327,-48.74
3328,-48.70
3329,-48.57
3330,-48.33
3331,-48.01
3332,-47.59
3333,-47.13
3334,-46.63
3335,-46.14
3336,-45.65
3337,-45.20
3338,-44.75
3339,-44.31
3340,-43.83
3341,-43.34
3342,-42.78
3343,-42.20
3344,-41.62
3345,-41.15
3346,-40.79
3347,-40.60
3348,-40.54
3349,-40.63
3350,-40.82
3351,-41.06
3352,-41.30
3353,-41.50
3354,-41.64
3355,-41.75
3356,-41.82
3357,-41.89
3358,-41.99
3359,-42.13
3360,-42.30
3361,-42.46
3362,-42.60
3363,-42.69
3364,-42.73
3365,-42.72
3366,-42.69
3367,-42.63
3368,-42.58
3369,-42.56
3370,-42.62
3371,-42.71
3372,-42.84
3373,-42.95
3374,-43.05
3375,-43.08
3376,-43.11
3377,-43.11
3378,-43.15
3379,-43.24
3380,-43.45
3381,-43.74
3382,-44.14
3383,-44.60
3384,-45.11
3385,-45.60
3386,-46.06
3387,-46.42
3388,-46.72
3389,-46.94
3390,-47.11
3391,-47.28
3392,-47.52
3393,-47.83
3394,-48.20
3395,-48.58
3396,-49.00
3397,-49.39
3398,-49.77
3399,-50.03
3400,-50.25
3401,-50.42
3402,-50.62
3403,-50.83
3404,-51.09
3405,-51.32
3406,-51.56
3407,-51.78
3408,-51.96
3409,-52.09
3410,-52.15
3411,-52.15
3412,-52.09
3413,-51.99
3414,-51.81
3415,-51.60
3416,-51.33
3417,-51.02
3418,-50.64
3419,-50.24
3420,-49.86
3421,-49.57
3422,-49.38
3423,-49.28
3424,-49.25
3425,-49.27
3426,-49.31
3427,-49.34
3428,-49.34
3429,-49.32
3430,-49.26
3431,-49.17
3432,-49.04
3433,-48.92
3434,-48.84
3435,-48.81
3436,-48.82
3437,-48.86
3438,-48.89
3439,-48.93
3440,-48.93
3441,-48.89
3442,-48.78
3443,-48.62
3444,-48.39
3445,-48.13
3446,-47.84
3447,-47.55
3448,-47.22
3449,-46.90
3450,-46.59
3451,-46.30
3452,-46.02
3453,-45.76
3454,-45.52
3455,-45.36
3456,-45.25
3457,-45.22
3458,-45.20
3459,-45.21
3460,-45.19
3461,-45.13
3462,-44.97
3463,-44.75
3464,-44.49
3465,-44.25
3466,-44.04
3467,-43.88
3468,-43.75
3469,-43.66
3470,-43.62
3471,-43.58
3472,-43.48
3473,-43.30
3474,-43.08
3475,-42.86
3476,-42.68
3477,-42.56
3478,-42.47
3479,-42.40
3480,-42.35
3481,-42.30
3482,-42.28
3483,-42.28
3484,-42.29
3485,-42.30
3486,-42.34
3487,-42.39
3488,-42.50
3489,-42.63
3490,-42.79
3491,-42.95
3492,-43.12
3493,-43.30
3494,-43.56
3495,-43.88
3496,-44.27
3497,-44.64
3498,-45.00
3499,-45.29
3500,-45.53
3501,-45.70
3502,-45.85
3503,-45.99
3504,-46.18
3505,-46.41
3506,-46.70
3507,-47.00
3508,-47.30
3509,-47.57
3510,-47.79
3511,-47.94
3512,-48.02
3513,-48.04
3514,-48.03
3515,-48.00
3516,-47.97
3517,-47.95
3518,-47.94
3519,-47.89
3520,-47.82
3521,-47.72
3522,-47.63
3523,-47.55
3524,-47.52
3525,-47.54
3526,-47.59
3527,-47.70
3528,-47.86
3529,-48.07
3530,-48.30
3531,-48.53
3532,-48.74
3533,-48.89
3534,-48.94
3535,-48.87
3536,-48.68
3537,-48.42
3538,-48.13
3539,-47.82
3540,-47.55
3541,-47.33
3542,-47.17
3543,-47.12
3544,-47.13
3545,-47.18
3546,-47.22
3547,-47.24
3548,-47.22
3549,-47.14
3550,-47.00
3551,-46.81
3552,-46.59
3553,-46.38
3554,-46.18
3555,-46.02
3556,-45.90
3557,-45.83
3558,-45.79
3559,-45.78
3560,-45.78
3561,-45.80
3562,-45.81
3563,-45.81
3564,-45.81
3565,-45.83
3566,-45.90
3567,-46.01
3568,-46.13
3569,-46.26
3570,-46.42
3571,-46.59
3572,-46.81
3573,-47.04
3574,-47.31
3575,-47.58
3576,-47.84
3577,-48.07
3578,-48.32
3579,-48.54
3580,-48.73
3581,-48.89
3582,-49.05
3583,-49.19
3584,-49.31
3585,-49.38
3586,-49.39
3587,-49.32
3588,-49.19
3589,-49.02
3590,-48.85
3591,-48.70
3592,-48.58
3593,-48.47
3594,-48.39
3595,-48.38
3596,-48.42
3597,-48.52
3598,-48.63
3599,-48.72
3600,-48.78
3601,-48.82
3602,-48.85
3603,-48.85
3604,-48.81
3605,-48.71
3606,-48.55
3607,-48.39
3608,-48.24
3609,-48.16
3610,-48.11
3611,-48.13
3612,-48.15
3613,-48.19
3614,-48.18
3615,-48.12
3616,-47.94
3617,-47.65
3618,-47.21
3619,-46.71
3620,-46.17
3621,-45.65
3622,-45.11
3623,-44.60
3624,-44.13
3625,-43.78
3626,-43.50
3627,-43.33
3628,-43.17
3629,-43.06
3630,-42.94
3631,-42.82
3632,-42.65
3633,-42.43
3634,-42.14
3635,-41.86
3636,-41.60
3637,-41.41
3638,-41.28
3639,-41.22
3640,-41.23
3641,-41.31
3642,-41.46
3643,-41.61
3644,-41.74
3645,-41.83
3646,-41.93
3647,-42.04
3648,-42.17
3649,-42.32
3650,-42.53
3651,-42.79
3652,-43.10
3653,-43.40
3654,-43.75
3655,-44.10
3656,-44.48
3657,-44.85
3658,-45.23
3659,-45.59
3660,-45.97
3661,-46.33
3662,-46.65
3663,-46.91
3664,-47.13
3665,-47.27
3666,-47.37
3667,-47.40
3668,-47.43
3669,-47.47
3670,-47.57
3671,-47.72
3672,-47.96
3673,-48.25
3674,-48.61
3675,-48.97
3676,-49.31
3677,-49.58
3678,-49.81
3679,-50.00
3680,-50.19
3681,-50.38
3682,-50.58
3683,-50.80
3684,-51.07
3685,-51.34
3686,-51.57
3687,-51.72
3688,-51.80
3689,-51.80
3690,-51.77
3691,-51.72
3692,-51.71
3693,-51.77
3694,-51.90
3695,-52.07
3696,-52.29
3697,-52.50
3698,-52.67
3699,-52.76
3700,-52.78
3701,-52.71
3702,-52.57
3703,-52.37
3704,-52.16
3705,-52.01
3706,-51.95
3707,-51.98
3708,-52.09
3709,-52.24
3710,-52.42
3711,-52.62
3712,-52.81
3713,-52.94
3714,-52.99
3715,-53.00
3716,-52.98
3717,-52.93
3718,-52.83
3719,-52.70
3720,-52.57
3721,-52.44
3722,-52.31
3723,-52.15
3724,-51.96
3725,-51.78
3726,-51.64
3727,-51.57
3728,-51.55
3729,-51.60
3730,-51.70
3731,-51.83
3732,-51.91
3733,-51.95
3734,-51.93
3735,-51.86
3736,-51.70
3737,-51.41
3738,-51.01
3739,-50.57
3740,-50.12
3741,-49.71
3742,-49.34
3743,-49.00
3744,-48.68
3745,-48.39
3746,-48.11
3747,-47.89
3748,-47.65
3749,-47.42
3750,-47.16
3751,-46.96
3752,-46.84
3753,-46.84
3754,-46.84
3755,-46.83
3756,-46.76
3757,-46.66
3758,-46.47
3759,-46.21
3760,-45.87
3761,-45.51
3762,-45.15
3763,-44.85
3764,-44.59
3765,-44.38
3766,-44.20
3767,-44.06
3768,-43.92
3769,-43.79
3770,-43.66
3771,-43.52
3772,-43.37
3773,-43.25
3774,-43.14
3775,-43.03
3776,-42.92
3777,-42.81
3778,-42.75
3779,-42.75
3780,-42.79
3781,-42.87
3782,-42.98
3783,-43.10
3784,-43.21
3785,-43.27
3786,-43.33
3787,-43.42
3788,-43.55
3789,-43.72
3790,-43.96
3791,-44.26
3792,-44.63
3793,-45.04
3794,-45.49
3795,-45.87
3796,-46.20
3797,-46.41
3798,-46.55
3799,-46.62
3800,-46.66
3801,-46.72
3802,-46.91
3803,-47.20
3804,-47.60
3805,-48.07
3806,-48.55
3807,-48.99
3808,-49.31
3809,-49.48
3810,-49.49
3811,-49.37
3812,-49.13
3813,-48.82
3814,-48.53
3815,-48.29
3816,-48.10
3817,-47.97
3818,-47.90
3819,-47.90
3820,-47.87
3821,-47.78
3822,-47.62
3823,-47.44
3824,-47.21
3825,-46.97
3826,-46.71
3827,-46.48
3828,-46.29
3829,-46.13
3830,-46.01
3831,-45.89
3832,-45.81
3833,-45.76
3834,-45.72
3835,-45.68
3836,-45.64
3837,-45.62
3838,-45.62
3839,-45.64
3840,-45.62
3841,-45.58
3842,-45.49
3843,-45.39
3844,-45.26
3845,-45.10
3846,-44.94
3847,-44.82
3848,-44.73
3849,-44.69
3850,-44.65
3851,-44.62
3852,-44.62
3853,-44.62
3854,-44.59
3855,-44.49
3856,-44.38
3857,-44.30
3858,-44.29
3859,-44.33
3860,-44.49
3861,-44.73
3862,-45.12
3863,-45.58
3864,-46.09
3865,-46.59
3866,-47.10
3867,-47.56
3868,-48.02
3869,-48.42
3870,-48.79
3871,-49.13
3872,-49.52
3873,-49.95
3874,-50.49
3875,-51.07
3876,-51.75
3877,-52.46
3878,-53.21
3879,-53.90
3880,-54.54
3881,-55.04
3882,-55.42
3883,-55.65
3884,-55.79
3885,-55.83
3886,-55.84
3887,-55.82
3888,-55.81
3889,-55.83
3890,-55.86
3891,-55.85
3892,-55.76
3893,-55.60
3894,-55.37
3895,-55.10
3896,-54.76
3897,-54.40
3898,-54.02
3899,-53.69
3900,-53.41
3901,-53.19
3902,-53.01
3903,-52.89
3904,-52.77
3905,-52.68
3906,-52.54
3907,-52.37
3908,-52.15
3909,-51.93
3910,-51.70
3911,-51.54
3912,-51.40
3913,-51.32
3914,-51.25
3915,-51.25
3916,-51.26
3917,-51.30
3918,-51.32
3919,-51.35
3920,-51.33
3921,-51.27
3922,-51.10
3923,-50.86
3924,-50.51
3925,-50.13
3926,-49.69
3927,-49.25
3928,-48.80
3929,-48.42
3930,-48.10
3931,-47.84
3932,-47.63
3933,-47.48
3934,-47.38
3935,-47.34
3936,-47.29
3937,-47.26
3938,-47.22
3939,-47.19
3940,-47.13
3941,-47.05
3942,-46.96
3943,-46.84
3944,-46.71
3945,-46.59
3946,-46.53
3947,-46.56
3948,-46.65
3949,-46.75
3950,-46.88
3951,-46.99
3952,-47.12
3953,-47.25
3954,-47.40
3955,-47.58
3956,-47.85
3957,-48.20
3958,-48.66
3959,-49.16
3960,-49.65
3961,-50.06
3962,-50.39
3963,-50.58
3964,-50.67
3965,-50.68
3966,-50.69
3967,-50.73
3968,-50.85
3969,-51.04
3970,-51.31
3971,-51.61
3972,-51.93
3973,-52.22
3974,-52.48
3975,-52.69
3976,-52.86
3977,-52.99
3978,-53.15
3979,-53.30
3980,-53.42
3981,-53.47
3982,-53.44
3983,-53.34
3984,-53.22
3985,-53.06
3986,-52.89
3987,-52.76
3988,-52.70
3989,-52.70
3990,-52.72
3991,-52.71
3992,-52.66
3993,-52.57
3994,-52.41
3995,-52.22
3996,-52.02
3997,-51.89
3998,-51.83
3999,-51.84
4000,-51.84
4001,-51.83
4002,-51.75
4003,-51.63
4004,-51.40
4005,-51.09
4006,-50.70
4007,-50.31
4008,-49.96
4009,-49.68
4010,-49.43
4011,-49.19
4012,-48.90
4013,-48.60
4014,-48.24
4015,-47.83
4016,-47.34
4017,-46.83
4018,-46.34
4019,-45.94
4020,-45.63
4021,-45.44
4022,-45.36
4023,-45.36
4024,-45.40
4025,-45.45
4026,-45.43
4027,-45.39
4028,-45.31
4029,-45.23
4030,-45.14
4031,-45.10
4032,-45.10
4033,-45.15
4034,-45.20
4035,-45.25
4036,-45.30
4037,-45.36
4038,-45.40
4039,-45.42
4040,-45.43
4041,-45.42
4042,-45.41
4043,-45.36
4044,-45.28
4045,-45.15
4046,-45.02
4047,-44.94
4048,-44.99
4049,-45.16
4050,-45.44
4051,-45.78
4052,-46.14
4053,-46.51
4054,-46.81
4055,-46.99
4056,-47.05
4057,-47.03
4058,-46.97
4059,-46.89
4060,-46.82
4061,-46.79
4062,-46.81
4063,-46.84
4064,-46.84
4065,-46.80
4066,-46.74
4067,-46.68
4068,-46.65
4069,-46.64
4070,-46.65
4071,-46.70
4072,-46.75
4073,-46.79
4074,-46.84
4075,-46.90
4076,-46.97
4077,-47.07
4078,-47.23
4079,-47.43
4080,-47.70
4081,-47.98
4082,-48.28
4083,-48.54
4084,-48.77
4085,-48.96
4086,-49.15
4087,-49.32
4088,-49.50
4089,-49.67
4090,-49.87
4091,-50.06
4092,-50.25
4093,-50.43
4094,-50.59
4095,-50.72
4096,-50.83
4097,-50.89
4098,-50.90
4099,-50.86
4100,-50.75
4101,-50.60
4102,-50.42
4103,-50.24
4104,-50.08
4105,-50.00
4106,-49.97
4107,-50.01
4108,-50.06
4109,-50.08
4110,-50.03
4111,-49.92
4112,-49.72
4113,-49.43
4114,-49.01
4115,-48.54
4116,-48.04
4117,-47.58
4118,-47.13
4119,-46.69
4120,-46.25
4121,-45.86
4122,-45.46
4123,-45.04
4124,-44.54
4125,-44.03
4126,-43.46
4127,-42.95
4128,-42.44
4129,-42.02
4130,-41.61
4131,-41.31
4132,-41.10
4133,-41.01
4134,-40.95
4135,-40.92
4136,-40.88
4137,-40.87
4138,-40.86
4139,-40.86
4140,-40.87
4141,-40.91
4142,-40.92
4143,-40.91
4144,-40.87
4145,-40.80
4146,-40.76
4147,-40.73
4148,-40.78
4149,-40.94
4150,-41.24
4151,-41.64
4152,-42.11
4153,-42.53
4154,-42.88
4155,-43.09
4156,-43.19
4157,-43.20
4158,-43.19
4159,-43.21
4160,-43.31
4161,-43.50
4162,-43.86
4163,-44.34
4164,-44.94
4165,-45.56
4166,-46.16
4167,-46.67
4168,-47.13
4169,-47.49
4170,-47.81
4171,-48.07
4172,-48.30
4173,-48.48
4174,-48.70
4175,-48.93
4176,-49.19
4177,-49.42
4178,-49.62
4179,-49.75
4180,-49.84
4181,-49.86
4182,-49.83
4183,-49.74
4184,-49.63
4185,-49.52
4186,-49.47
4187,-49.47
4188,-49.53
4189,-49.64
4190,-49.77
4191,-49.92
4192,-50.09
4193,-50.29
4194,-50.51
4195,-50.77
4196,-51.03
4197,-51.26
4198,-51.48
4199,-51.64
4200,-51.73
4201,-51.73
4202,-51.67
4203,-51.56
4204,-51.43
4205,-51.30
4206,-51.16
4207,-51.08
4208,-51.03
4209,-51.03
4210,-50.99
4211,-50.87
4212,-50.66
4213,-50.38
4214,-50.03
4215,-49.67
4216,-49.26
4217,-48.87
4218,-48.54
4219,-48.30
4220,-48.13
4221,-48.00
4222,-47.90
4223,-47.81
4224,-47.72
4225,-47.64
4226,-47.53
4227,-47.42
4228,-47.29
4229,-47.20
4230,-47.14
4231,-47.12
4232,-47.11
4233,-47.13
4234,-47.16
4235,-47.22
4236,-47.33
4237,-47.46
4238,-47.59
4239,-47.68
4240,-47.72
4241,-47.71
4242,-47.65
4243,-47.54
4244,-47.40
4245,-47.26
4246,-47.16
4247,-47.08
4248,-47.04
4249,-47.04
4250,-47.07
4251,-47.11
4252,-47.16
4253,-47.19
4254,-47.23
4255,-47.28
4256,-47.38
4257,-47.54
4258,-47.78
4259,-48.07
4260,-48.37
4261,-48.64
4262,-48.86
4263,-48.99
4264,-49.03
4265,-48.97
4266,-48.88
4267,-48.78
4268,-48.73
4269,-48.74
4270,-48.85
4271,-49.04
4272,-49.31
4273,-49.58
4274,-49.87
4275,-50.10
4276,-50.32
4277,-50.48
4278,-50.64
4279,-50.81
4280,-51.00
4281,-51.22
4282,-51.46
4283,-51.71
4284,-51.99
4285,-52.27
4286,-52.49
4287,-52.63
4288,-52.67
4289,-52.62
4290,-52.50
4291,-52.31
4292,-52.05
4293,-51.74
4294,-51.45
4295,-51.20
4296,-51.02
4297,-50.90
4298,-50.78
4299,-50.65
4300,-50.48
4301,-50.27
4302,-50.03
4303,-49.77
4304,-49.50
4305,-49.23
4306,-49.00
4307,-48.87
4308,-48.82
4309,-48.87
4310,-49.00
4311,-49.17
4312,-49.33
4313,-49.48
4314,-49.57
4315,-49.61
4316,-49.61
4317,-49.55
4318,-49.45
4319,-49.36
4320,-49.29
4321,-49.22
4322,-49.12
4323,-48.98
4324,-48.83
4325,-48.65
4326,-48.42
4327,-48.16
4328,-47.87
4329,-47.63
4330,-47.45
4331,-47.37
4332,-47.35
4333,-47.39
4334,-47.44
4335,-47.47
4336,-47.45
4337,-47.36
4338,-47.23
4339,-47.08
4340,-46.96
4341,-46.88
4342,-46.84
4343,-46.88
4344,-47.01
4345,-47.21
4346,-47.42
4347,-47.62
4348,-47.80
4349,-47.97
4350,-48.16
4351,-48.38
4352,-48.67
4353,-48.98
4354,-49.36
4355,-49.76
4356,-50.19
4357,-50.62
4358,-51.05
4359,-51.43
4360,-51.80
4361,-52.18
4362,-52.60
4363,-53.02
4364,-53.42
4365,-53.73
4366,-53.93
4367,-54.01
4368,-53.98
4369,-53.85
4370,-53.65
4371,-53.41
4372,-53.18
4373,-52.98
4374,-52.81
4375,-52.67
4376,-52.53
4377,-52.38
4378,-52.19
4379,-51.96
4380,-51.67
4381,-51.41
4382,-51.17
4383,-51.00
4384,-50.86
4385,-50.75
4386,-50.64
4387,-50.51
4388,-50.31
4389,-50.06
4390,-49.78
4391,-49.54
4392,-49.34
4393,-49.20
4394,-49.10
4395,-49.00
4396,-48.90
4397,-48.79
4398,-48.66
4399,-48.56
4400,-48.48
4401,-48.44
4402,-48.42
4403,-48.48
4404,-48.57
4405,-48.65
4406,-48.61
4407,-48.45
4408,-48.16
4409,-47.75
4410,-47.23
4411,-46.65
4412,-46.04
4413,-45.48
4414,-44.97
4415,-44.55
4416,-44.16
4417,-43.83
4418,-43.51
4419,-43.26
4420,-43.00
4421,-42.76
4422,-42.47
4423,-42.14
4424,-41.72
4425,-41.28
4426,-40.81
4427,-40.39
4428,-40.04
4429,-39.80
4430,-39.69
4431,-39.70
4432,-39.76
4433,-39.88
4434,-40.01
4435,-40.16
4436,-40.31
4437,-40.44
4438,-40.59
4439,-40.75
4440,-40.94
4441,-41.13
4442,-41.31
4443,-41.40
4444,-41.44
4445,-41.37
4446,-41.24
4447,-41.10
4448,-41.01
4449,-40.98
4450,-41.05
4451,-41.18
4452,-41.41
4453,-41.72
4454,-42.10
4455,-42.50
4456,-42.92
4457,-43.31
4458,-43.69
4459,-44.03
4460,-44.36
4461,-44.67
4462,-44.98
4463,-45.27
4464,-45.56
4465,-45.82
4466,-46.10
4467,-46.38
4468,-46.65
4469,-46.86
4470,-47.01
4471,-47.08
4472,-47.10
4473,-47.06
4474,-47.00
4475,-46.96
4476,-46.94
4477,-46.94
4478,-46.94
4479,-46.95
4480,-46.93
4481,-46.87
4482,-46.75
4483,-46.61
4484,-46.43
4485,-46.27
4486,-46.13
4487,-46.02
4488,-45.96
4489,-45.95
4490,-45.95
4491,-45.94
4492,-45.90
4493,-45.81
4494,-45.67
4495,-45.52
4496,-45.39
4497,-45.28
4498,-45.21
4499,-45.20
4500,-45.25
4501,-45.36
4502,-45.54
4503,-45.74
4504,-45.93
4505,-46.10
4506,-46.23
4507,-46.30
4508,-46.31
4509,-46.30
4510,-46.28
4511,-46.26
4512,-46.24
4513,-46.21
4514,-46.20
4515,-46.19
4516,-46.20
4517,-46.20
4518,-46.20
4519,-46.16
4520,-46.10
4521,-46.02
4522,-45.96
4523,-45.92
4524,-45.91
4525,-45.91
4526,-45.94
4527,-45.97
4528,-46.05
4529,-46.16
4530,-46.31
4531,-46.49
4532,-46.72
4533,-46.97
4534,-47.26
4535,-47.58
4536,-47.90
4537,-48.19
4538,-48.48
4539,-48.73
4540,-48.95
4541,-49.12
4542,-49.22
4543,-49.26
4544,-49.25
4545,-49.19
4546,-49.11
4547,-49.03
4548,-48.95
4549,-48.90
4550,-48.92
4551,-48.97
4552,-49.05
4553,-49.12
4554,-49.17
4555,-49.21
4556,-49.24
4557,-49.28
4558,-49.38
4559,-49.55
4560,-49.74
4561,-49.94
4562,-50.13
4563,-50.27
4564,-50.38
4565,-50.42
4566,-50.40
4567,-50.35
4568,-50.34
4569,-50.38
4570,-50.47
4571,-50.58
4572,-50.74
4573,-50.92
4574,-51.11
4575,-51.28
4576,-51.38
4577,-51.42
4578,-51.38
4579,-51.26
4580,-51.06
4581,-50.79
4582,-50.47
4583,-50.16
4584,-49.86
4585,-49.58
4586,-49.31
4587,-49.08
4588,-48.86
4589,-48.63
4590,-48.32
4591,-47.97
4592,-47.52
4593,-47.04
4594,-46.46
4595,-45.87
4596,-45.24
4597,-44.68
4598,-44.14
4599,-43.68
4600,-43.24
4601,-42.85
4602,-42.45
4603,-42.08
4604,-41.67
4605,-41.30
4606,-40.89
4607,-40.52
4608,-40.14
4609,-39.83
4610,-39.59
4611,-39.47
4612,-39.41
4613,-39.44
4614,-39.49
4615,-39.53
4616,-39.51
4617,-39.44
4618,-39.31
4619,-39.15
4620,-39.00
4621,-38.91
4622,-38.93
4623,-39.04
4624,-39.24
4625,-39.45
4626,-39.67
4627,-39.83
4628,-39.95
4629,-39.97
4630,-39.96
4631,-39.92
4632,-39.96
4633,-40.10
4634,-40.41
4635,-40.83
4636,-41.40
4637,-42.00
4638,-42.64
4639,-43.23
4640,-43.79
4641,-44.25
4642,-44.69
4643,-45.08
4644,-45.51
4645,-45.94
4646,-46.47
4647,-47.00
4648,-47.59
4649,-48.13
4650,-48.66
4651,-49.13
4652,-49.57
4653,-49.96
4654,-50.35
4655,-50.71
4656,-51.08
4657,-51.40
4658,-51.71
4659,-51.97
4660,-52.21
4661,-52.39
4662,-52.56
4663,-52.68
4664,-52.80
4665,-52.90
4666,-53.00
4667,-53.09
4668,-53.16
4669,-53.22
4670,-53.28
4671,-53.34
4672,-53.40
4673,-53.47
4674,-53.57
4675,-53.70
4676,-53.86
4677,-54.02
4678,-54.22
4679,-54.43
4680,-54.62
4681,-54.76
4682,-54.89
4683,-54.95
4684,-54.96
4685,-54.90
4686,-54.80
4687,-54.71
4688,-54.64
4689,-54.60
4690,-54.60
4691,-54.65
4692,-54.79
4693,-55.00
4694,-55.26
4695,-55.52
4696,-55.73
4697,-55.85
4698,-55.85
4699,-55.73
4700,-55.50
4701,-55.21
4702,-54.86
4703,-54.49
4704,-54.15
4705,-53.89
4706,-53.77
4707,-53.79
4708,-53.91
4709,-54.12
4710,-54.34
4711,-54.60
4712,-54.81
4713,-54.96
4714,-55.02
4715,-54.99
4716,-54.89
4717,-54.73
4718,-54.50
4719,-54.25
4720,-53.98
4721,-53.70
4722,-53.40
4723,-53.12
4724,-52.85
4725,-52.59
4726,-52.30
4727,-51.99
4728,-51.64
4729,-51.29
4730,-50.92
4731,-50.58
4732,-50.19
4733,-49.83
4734,-49.48
4735,-49.19
4736,-48.97
4737,-48.81
4738,-48.64
4739,-48.48
4740,-48.30
4741,-48.14
4742,-48.00
4743,-47.87
4744,-47.78
4745,-47.71
4746,-47.71
4747,-47.76
4748,-47.83
4749,-47.88
4750,-47.96
4751,-48.08
4752,-48.32
4753,-48.66
4754,-49.10
4755,-49.59
4756,-50.12
4757,-50.63
4758,-51.09
4759,-51.43
4760,-51.65
4761,-51.78
4762,-51.86
4763,-51.91
4764,-51.96
4765,-52.00
4766,-52.08
4767,-52.16
4768,-52.24
4769,-52.27
4770,-52.26
4771,-52.20
4772,-52.09
4773,-51.93
4774,-51.72
4775,-51.51
4776,-51.30
4777,-51.09
4778,-50.88
4779,-50.69
4780,-50.52
4781,-50.38
4782,-50.22
4783,-50.04
4784,-49.82
4785,-49.61
4786,-49.45
4787,-49.34
4788,-49.30
4789,-49.33
4790,-49.45
4791,-49.66
4792,-49.92
4793,-50.19
4794,-50.41
4795,-50.54
4796,-50.56
4797,-50.47
4798,-50.32
4799,-50.15
4800,-49.98
4801,-49.86
4802,-49.82
4803,-49.87
4804,-49.96
4805,-50.04
4806,-50.07
4807,-50.04
4808,-49.93
4809,-49.74
4810,-49.49
4811,-49.26
4812,-49.10
4813,-49.03
4814,-49.03
4815,-49.08
4816,-49.16
4817,-49.25
4818,-49.31
4819,-49.33
4820,-49.29
4821,-49.20
4822,-49.07
4823,-48.94
4824,-48.87
4825,-48.87
4826,-48.93
4827,-49.03
4828,-49.14
4829,-49.27
4830,-49.42
4831,-49.56
4832,-49.65
4833,-49.67
4834,-49.67
4835,-49.68
4836,-49.74
4837,-49.86
4838,-50.06
4839,-50.34
4840,-50.70
4841,-51.11
4842,-51.52
4843,-51.90
4844,-52.20
4845,-52.41
4846,-52.47
4847,-52.36
4848,-52.07
4849,-51.66
4850,-51.17
4851,-50.67
4852,-50.13
4853,-49.60
4854,-49.07
4855,-48.59
4856,-48.07
4857,-47.51
4858,-46.82
4859,-46.10
4860,-45.28
4861,-44.46
4862,-43.58
4863,-42.79
4864,-42.08
4865,-41.54
4866,-41.09
4867,-40.76
4868,-40.45
4869,-40.19
4870,-39.91
4871,-39.63
4872,-39.31
4873,-39.04
4874,-38.76
4875,-38.52
4876,-38.28
4877,-38.06
4878,-37.83
4879,-37.64
4880,-37.42
4881,-37.24
4882,-37.06
4883,-36.94
4884,-36.89
4885,-36.89
4886,-36.90
4887,-36.93
4888,-36.94
4889,-36.91
4890,-36.82
4891,-36.67
4892,-36.50
4893,-36.35
4894,-36.22
4895,-36.12
4896,-36.05
4897,-36.06
4898,-36.16
4899,-36.32
4900,-36.47
4901,-36.58
4902,-36.64
4903,-36.67
4904,-36.65
4905,-36.60
4906,-36.51
4907,-36.41
4908,-36.34
4909,-36.29
4910,-36.26
4911,-36.23
4912,-36.23
4913,-36.27
4914,-36.35
4915,-36.46
4916,-36.58
4917,-36.71
4918,-36.87
4919,-37.05
4920,-37.25
4921,-37.42
4922,-37.58
4923,-37.70
4924,-37.83
4925,-37.98
4926,-38.16
4927,-38.33
4928,-38.51
4929,-38.67
4930,-38.86
4931,-39.03
4932,-39.22
4933,-39.38
4934,-39.58
4935,-39.83
4936,-40.17
4937,-40.53
4938,-40.98
4939,-41.45
4940,-41.95
4941,-42.44
4942,-42.92
4943,-43.36
4944,-43.79
4945,-44.20
4946,-44.57
4947,-44.88
4948,-45.14
4949,-45.32
4950,-45.45
4951,-45.49
4952,-45.46
4953,-45.33
4954,-45.14
4955,-44.88
4956,-44.67
4957,-44.53
4958,-44.47
4959,-44.51
4960,-44.64
4961,-44.84
4962,-45.04
4963,-45.18
4964,-45.23
4965,-45.17
4966,-44.99
4967,-44.72
4968,-44.39
4969,-44.08
4970,-43.88
4971,-43.85
4972,-43.91
4973,-44.05
4974,-44.17
4975,-44.26
4976,-44.24
4977,-44.11
4978,-43.84
4979,-43.45
4980,-42.98
4981,-42.51
4982,-42.09
4983,-41.79
4984,-41.62
4985,-41.59
4986,-41.66
4987,-41.79
4988,-41.94
4989,-42.06
4990,-42.15
4991,-42.23
4992,-42.28
4993,-42.30
4994,-42.33
4995,-42.37
4996,-42.47
4997,-42.63
4998,-42.85
4999,-43.11
5000,-43.38
5001,-43.62
5002,-43.80
5003,-43.94
5004,-44.06
5005,-44.16
5006,-44.27
5007,-44.42
5008,-44.69
5009,-45.05
5010,-45.49
5011,-45.91
5012,-46.31
5013,-46.68
5014,-47.07
5015,-47.41
5016,-47.71
5017,-47.97
5018,-48.23
5019,-48.47
5020,-48.68
5021,-48.81
5022,-48.88
5023,-48.92
5024,-48.95
5025,-48.96
5026,-48.97
5027,-48.97
5028,-48.97
5029,-48.99
5030,-48.99
5031,-48.95
5032,-48.85
5033,-48.71
5034,-48.51
5035,-48.29
5036,-48.03
5037,-47.78
5038,-47.52
5039,-47.27
5040,-47.02
5041,-46.78
5042,-46.55
5043,-46.35
5044,-46.16
5045,-46.00
5046,-45.85
5047,-45.73
5048,-45.65
5049,-45.61
5050,-45.60
5051,-45.62
5052,-45.63
5053,-45.65
5054,-45.66
5055,-45.67
5056,-45.63
5057,-45.56
5058,-45.41
5059,-45.19
5060,-44.86
5061,-44.48
5062,-44.06
5063,-43.67
5064,-43.29
5065,-42.95
5066,-42.63
5067,-42.40
5068,-42.18
5069,-42.02
5070,-41.81
5071,-41.56
5072,-41.21
5073,-40.80
5074,-40.35
5075,-39.92
5076,-39.48
5077,-39.05
5078,-38.65
5079,-38.31
5080,-37.99
5081,-37.70
5082,-37.41
5083,-37.13
5084,-36.83
5085,-36.57
5086,-36.37
5087,-36.29
5088,-36.34
5089,-36.52
5090,-36.83
5091,-37.25
5092,-37.73
5093,-38.19
5094,-38.57
5095,-38.84
5096,-39.00
5097,-39.06
5098,-39.08
5099,-39.06
5100,-39.12
5101,-39.24
5102,-39.46
5103,-39.76
5104,-40.15
5105,-40.58
5106,-41.02
5107,-41.40
5108,-41.75
5109,-42.04
5110,-42.31
5111,-42.56
5112,-42.81
5113,-43.06
5114,-43.33
5115,-43.60
5116,-43.84
5117,-44.00
5118,-44.10
5119,-44.13
5120,-44.14
5121,-44.15
5122,-44.20
5123,-44.29
5124,-44.41
5125,-44.56
5126,-44.75
5127,-44.93
5128,-45.05
5129,-45.13
5130,-45.20
5131,-45.27
5132,-45.30
5133,-45.31
5134,-45.34
5135,-45.43
5136,-45.52
5137,-45.56
5138,-45.53
5139,-45.45
5140,-45.30
5141,-45.12
5142,-44.91
5143,-44.72
5144,-44.52
5145,-44.34
5146,-44.20
5147,-44.08
5148,-43.96
5149,-43.86
5150,-43.79
5151,-43.72
5152,-43.65
5153,-43.56
5154,-43.47
5155,-43.42
5156,-43.37
5157,-43.33
5158,-43.30
5159,-43.29
5160,-43.32
5161,-43.38
5162,-43.46
5163,-43.57
5164,-43.70
5165,-43.83
5166,-43.97
5167,-44.12
5168,-44.29
5169,-44.47
5170,-44.63
5171,-44.74
5172,-44.78
5173,-44.76
5174,-44.70
5175,-44.62
5176,-44.50
5177,-44.38
5178,-44.27
5179,-44.21
5180,-44.20
5181,-44.23
5182,-44.21
5183,-44.15
5184,-44.01
5185,-43.78
5186,-43.46
5187,-43.10
5188,-42.77
5189,-42.53
5190,-42.36
5191,-42.26
5192,-42.24
5193,-42.30
5194,-42.39
5195,-42.47
5196,-42.47
5197,-42.44
5198,-42.38
5199,-42.31
5200,-42.22
5201,-42.14
5202,-42.04
5203,-41.92
5204,-41.76
5205,-41.57
5206,-41.37
5207,-41.18
5208,-40.97
5209,-40.78
5210,-40.61
5211,-40.50
5212,-40.44
5213,-40.42
5214,-40.43
5215,-40.47
5216,-40.53
5217,-40.57
5218,-40.60
5219,-40.61
5220,-40.65
5221,-40.70
5222,-40.79
5223,-40.95
5224,-41.22
5225,-41.58
5226,-41.98
5227,-42.33
5228,-42.61
5229,-42.82
5230,-43.01
5231,-43.14
5232,-43.27
5233,-43.39
5234,-43.53
5235,-43.69
5236,-43.88
5237,-44.09
5238,-44.31
5239,-44.53
5240,-44.75
5241,-44.92
5242,-45.08
5243,-45.23
5244,-45.38
5245,-45.52
5246,-45.67
5247,-45.80
5248,-45.94
5249,-46.09
5250,-46.24
5251,-46.39
5252,-46.54
5253,-46.66
5254,-46.73
5255,-46.71
5256,-46.62
5257,-46.43
5258,-46.17
5259,-45.86
5260,-45.52
5261,-45.20
5262,-44.91
5263,-44.70
5264,-44.56
5265,-44.50
5266,-44.47
5267,-44.45
5268,-44.44
5269,-44.45
5270,-44.46
5271,-44.46
5272,-44.47
5273,-44.50
5274,-44.55
5275,-44.60
5276,-44.68
5277,-44.76
5278,-44.89
5279,-45.04
5280,-45.20
5281,-45.34
5282,-45.50
5283,-45.68
5284,-45.88
5285,-46.09
5286,-46.32
5287,-46.55
5288,-46.79
5289,-47.00
5290,-47.16
5291,-47.24
5292,-47.29
5293,-47.29
5294,-47.30
5295,-47.29
5296,-47.30
5297,-47.36
5298,-47.50
5299,-47.67
5300,-47.85
5301,-47.99
5302,-48.10
5303,-48.18
5304,-48.26
5305,-48.32
5306,-48.42
5307,-48.50
5308,-48.58
5309,-48.68
5310,-48.79
5311,-48.92
5312,-49.05
5313,-49.16
5314,-49.26
5315,-49.37
5316,-49.50
5317,-49.64
5318,-49.77
5319,-49.89
5320,-50.00
5321,-50.11
5322,-50.19
5323,-50.26
5324,-50.29
5325,-50.33
5326,-50.35
5327,-50.37
5328,-50.29
5329,-50.10
5330,-49.77
5331,-49.35
5332,-48.81
5333,-48.18
5334,-47.48
5335,-46.80
5336,-46.13
5337,-45.52
5338,-44.89
5339,-44.28
5340,-43.66
5341,-43.10
5342,-42.56
5343,-42.08
5344,-41.61
5345,-41.22
5346,-40.86
5347,-40.60
5348,-40.34
5349,-40.11
5350,-39.82
5351,-39.51
5352,-39.17
5353,-38.86
5354,-38.57
5355,-38.35
5356,-38.15
5357,-38.04
5358,-37.99
5359,-38.01
5360,-38.06
5361,-38.15
5362,-38.22
5363,-38.28
5364,-38.32
5365,-38.36
5366,-38.38
5367,-38.40
5368,-38.40
5369,-38.38
5370,-38.35
5371,-38.25
5372,-38.09
5373,-37.87
5374,-37.62
5375,-37.38
5376,-37.22
5377,-37.14
5378,-37.18
5379,-37.32
5380,-37.52
5381,-37.77
5382,-37.99
5383,-38.15
5384,-38.19
5385,-38.14
5386,-38.04
5387,-37.95
5388,-37.90
5389,-37.90
5390,-37.93
5391,-37.96
5392,-37.99
5393,-37.98
5394,-37.96
5395,-37.94
5396,-37.97
5397,-38.10
5398,-38.36
5399,-38.73
5400,-39.21
5401,-39.71
5402,-40.22
5403,-40.67
5404,-41.04
5405,-41.31
5406,-41.50
5407,-41.63
5408,-41.76
5409,-41.84
5410,-41.92
5411,-41.95
5412,-41.99
5413,-42.02
5414,-42.05
5415,-42.07
5416,-42.11
5417,-42.20
5418,-42.34
5419,-42.50
5420,-42.69
5421,-42.83
5422,-42.95
5423,-43.00
5424,-43.01
5425,-42.98
5426,-42.92
5427,-42.88
5428,-42.85
5429,-42.84
5430,-42.83
5431,-42.83
5432,-42.83
5433,-42.82
5434,-42.78
5435,-42.67
5436,-42.50
5437,-42.31
5438,-42.11
5439,-41.95
5440,-41.82
5441,-41.73
5442,-41.69
5443,-41.71
5444,-41.75
5445,-41.79
5446,-41.78
5447,-41.71
5448,-41.53
5449,-41.28
5450,-40.98
5451,-40.69
5452,-40.46
5453,-40.34
5454,-40.34
5455,-40.44
5456,-40.58
5457,-40.70
5458,-40.79
5459,-40.80
5460,-40.73
5461,-40.57
5462,-40.33
5463,-40.11
5464,-39.92
5465,-39.80
5466,-39.73
5467,-39.71
5468,-39.71
5469,-39.71
5470,-39.68
5471,-39.60
5472,-39.46
5473,-39.29
5474,-39.10
5475,-38.91
5476,-38.72
5477,-38.54
5478,-38.35
5479,-38.19
5480,-38.07
5481,-37.99
5482,-37.95
5483,-37.93
5484,-37.99
5485,-38.15
5486,-38.41
5487,-38.73
5488,-39.06
5489,-39.38
5490,-39.67
5491,-39.91
5492,-40.07
5493,-40.14
5494,-40.18
5495,-40.24
5496,-40.39
5497,-40.61
5498,-40.89
5499,-41.18
5500,-41.45
5501,-41.67
5502,-41.82
5503,-41.83
5504,-41.79
5505,-41.71
5506,-41.70
5507,-41.76
5508,-41.89
5509,-42.06
5510,-42.31
5511,-42.57
5512,-42.82
5513,-42.99
5514,-43.15
5515,-43.30
5516,-43.50
5517,-43.78
5518,-44.18
5519,-44.67
5520,-45.21
5521,-45.72
5522,-46.18
5523,-46.49
5524,-46.62
5525,-46.59
5526,-46.46
5527,-46.28
5528,-46.13
5529,-46.04
5530,-46.03
5531,-46.09
5532,-46.18
5533,-46.25
5534,-46.24
5535,-46.16
5536,-45.97
5537,-45.72
5538,-45.41
5539,-45.11
5540,-44.87
5541,-44.71
5542,-44.60
5543,-44.56
5544,-44.52
5545,-44.50
5546,-44.43
5547,-44.33
5548,-44.14
5549,-43.93
5550,-43.64
5551,-43.31
5552,-42.88
5553,-42.41
5554,-41.89
5555,-41.34
5556,-40.73
5557,-40.11
5558,-39.42
5559,-38.78
5560,-38.15
5561,-37.60
5562,-37.04
5563,-36.54
5564,-36.04
5565,-35.58
5566,-35.12
5567,-34.68
5568,-34.27
5569,-33.97
5570,-33.79
5571,-33.80
5572,-33.97
5573,-34.29
5574,-34.69
5575,-35.13
5576,-35.53
5577,-35.85
5578,-36.02
5579,-36.03
5580,-35.93
5581,-35.79
5582,-35.64
5583,-35.54
5584,-35.51
5585,-35.55
5586,-35.67
5587,-35.81
5588,-35.97
5589,-36.09
5590,-36.15
5591,-36.13
5592,-36.06
5593,-35.96
5594,-35.90
5595,-35.87
5596,-35.93
5597,-36.08
5598,-36.32
5599,-36.61
5600,-36.96
5601,-37.31
5602,-37.62
5603,-37.88
5604,-38.13
5605,-38.38
5606,-38.66
5607,-38.98
5608,-39.38
5609,-39.84
5610,-40.35
5611,-40.83
5612,-41.30
5613,-41.66
5614,-41.95
5615,-42.17
5616,-42.37
5617,-42.57
5618,-42.79
5619,-43.02
5620,-43.31
5621,-43.62
5622,-43.95
5623,-44.20
5624,-44.41
5625,-44.53
5626,-44.64
5627,-44.75
5628,-44.90
5629,-45.10
5630,-45.43
5631,-45.85
5632,-46.37
5633,-46.91
5634,-47.43
5635,-47.87
5636,-48.19
5637,-48.36
5638,-48.41
5639,-48.36
5640,-48.26
5641,-48.14
5642,-48.02
5643,-47.90
5644,-47.78
5645,-47.65
5646,-47.48
5647,-47.27
5648,-47.03
5649,-46.78
5650,-46.49
5651,-46.20
5652,-45.83
5653,-45.46
5654,-45.02
5655,-44.57
5656,-44.07
5657,-43.56
5658,-43.05
5659,-42.59
5660,-42.12
5661,-41.72
5662,-41.34
5663,-41.02
5664,-40.70
5665,-40.42
5666,-40.11
5667,-39.81
5668,-39.53
5669,-39.29
5670,-39.12
5671,-39.01
5672,-38.98
5673,-39.04
5674,-39.18
5675,-39.40
5676,-39.64
5677,-39.86
5678,-40.06
5679,-40.22
5680,-40.37
5681,-40.51
5682,-40.67
5683,-40.84
5684,-41.08
5685,-41.37
5686,-41.73
5687,-42.06
5688,-42.40
5689,-42.71
5690,-43.00
5691,-43.26
5692,-43.54
5693,-43.85
5694,-44.20
5695,-44.57
5696,-44.96
5697,-45.30
5698,-45.59
5699,-45.80
5700,-45.97
5701,-46.08
5702,-46.18
5703,-46.26
5704,-46.38
5705,-46.53
5706,-46.77
5707,-47.04
5708,-47.37
5709,-47.68
5710,-47.97
5711,-48.25
5712,-48.55
5713,-48.84
5714,-49.15
5715,-49.45
5716,-49.79
5717,-50.14
5718,-50.53
5719,-50.92
5720,-51.29
5721,-51.62
5722,-51.90
5723,-52.10
5724,-52.26
5725,-52.35
5726,-52.36
5727,-52.31
5728,-52.23
5729,-52.12
5730,-51.99
5731,-51.80
5732,-51.54
5733,-51.26
5734,-50.94
5735,-50.62
5736,-50.29
5737,-49.98
5738,-49.69
5739,-49.45
5740,-49.25
5741,-49.07
5742,-48.90
5743,-48.75
5744,-48.56
5745,-48.39
5746,-48.23
5747,-48.11
5748,-48.02
5749,-47.96
5750,-47.89
5751,-47.83
5752,-47.78
5753,-47.73
5754,-47.68
5755,-47.62
5756,-47.51
5757,-47.40
5758,-47.33
5759,-47.29
5760,-47.30
5761,-47.33
5762,-47.33
5763,-47.32
5764,-47.28
5765,-47.23
5766,-47.11
5767,-46.94
5768,-46.70
5769,-46.42
5770,-46.14
5771,-45.88
5772,-45.62
5773,-45.43
5774,-45.31
5775,-45.27
5776,-45.28
5777,-45.35
5778,-45.44
5779,-45.52
5780,-45.53
5781,-45.49
5782,-45.41
5783,-45.31
5784,-45.20
5785,-45.12
5786,-45.09
5787,-45.13
5788,-45.24
5789,-45.38
5790,-45.52
5791,-45.65
5792,-45.78
5793,-45.88
5794,-45.96
5795,-46.04
5796,-46.13
5797,-46.26
5798,-46.43
5799,-46.62
5800,-46.80
5801,-46.95
5802,-47.04
5803,-47.09
5804,-47.10
5805,-47.07
5806,-46.97
5807,-46.79
5808,-46.50
5809,-46.14
5810,-45.69
5811,-45.17
5812,-44.54
5813,-43.88
5814,-43.14
5815,-42.46
5816,-41.80
5817,-41.23
5818,-40.67
5819,-40.17
5820,-39.66
5821,-39.19
5822,-38.71
5823,-38.30
5824,-37.91
5825,-37.60
5826,-37.27
5827,-36.99
5828,-36.74
5829,-36.54
5830,-36.35
5831,-36.15
5832,-35.95
5833,-35.80
5834,-35.67
5835,-35.56
5836,-35.47
5837,-35.45
5838,-35.46
5839,-35.51
5840,-35.56
5841,-35.61
5842,-35.64
5843,-35.66
5844,-35.67
5845,-35.67
5846,-35.65
5847,-35.62
5848,-35.58
5849,-35.52
5850,-35.44
5851,-35.32
5852,-35.16
5853,-34.97
5854,-34.79
5855,-34.63
5856,-34.48
5857,-34.40
5858,-34.39
5859,-34.45
5860,-34.54
5861,-34.64
5862,-34.71
5863,-34.77
5864,-34.75
5865,-34.67
5866,-34.48
5867,-34.24
5868,-33.98
5869,-33.74
5870,-33.54
5871,-33.36
5872,-33.24
5873,-33.18
5874,-33.20
5875,-33.29
5876,-33.42
5877,-33.56
5878,-33.71
5879,-33.91
5880,-34.15
5881,-34.43
5882,-34.73
5883,-34.98
5884,-35.19
5885,-35.30
5886,-35.34
5887,-35.27
5888,-35.14
5889,-34.95
5890,-34.77
5891,-34.66
5892,-34.68
5893,-34.81
5894,-35.03
5895,-35.29
5896,-35.57
5897,-35.84
5898,-36.05
5899,-36.19
5900,-36.26
5901,-36.32
5902,-36.36
5903,-36.41
5904,-36.47
5905,-36.54
5906,-36.64
5907,-36.76
5908,-36.89
5909,-36.99
5910,-37.05
5911,-37.04
5912,-36.94
5913,-36.77
5914,-36.52
5915,-36.25
5916,-35.96
5917,-35.73
5918,-35.55
5919,-35.47
5920,-35.45
5921,-35.49
5922,-35.52
5923,-35.53
5924,-35.42
5925,-35.22
5926,-34.89
5927,-34.48
5928,-33.99
5929,-33.50
5930,-32.99
5931,-32.51
5932,-32.03
5933,-31.61
5934,-31.21
5935,-30.85
5936,-30.46
5937,-30.07
5938,-29.64
5939,-29.27
5940,-28.90
5941,-28.59
5942,-28.33
5943,-28.13
5944,-27.96
5945,-27.82
5946,-27.66
5947,-27.50
5948,-27.38
5949,-27.31
5950,-27.28
5951,-27.33
5952,-27.47
5953,-27.69
5954,-28.00
5955,-28.35
5956,-28.74
5957,-29.12
5958,-29.51
5959,-29.85
5960,-30.20
5961,-30.52
5962,-30.86
5963,-31.20
5964,-31.61
5965,-32.01
5966,-32.46
5967,-32.88
5968,-33.31
5969,-33.69
5970,-34.10
5971,-34.47
5972,-34.88
5973,-35.26
5974,-35.69
5975,-36.16
5976,-36.74
5977,-37.37
5978,-38.04
5979,-38.67
5980,-39.32
5981,-39.89
5982,-40.38
5983,-40.70
5984,-40.92
5985,-41.03
5986,-41.11
5987,-41.16
5988,-41.24
5989,-41.35
5990,-41.53
5991,-41.75
5992,-42.03
5993,-42.31
5994,-42.56
5995,-42.72
5996,-42.82
5997,-42.82
5998,-42.77
5999,-42.69
6000,-42.65
6001,-42.63
6002,-42.63
6003,-42.64
6004,-42.69
6005,-42.75
6006,-42.78
6007,-42.77
6008,-42.73
6009,-42.70
6010,-42.66
6011,-42.61
6012,-42.55
6013,-42.50
6014,-42.39
6015,-42.22
6016,-41.94
6017,-41.60
6018,-41.15
6019,-40.67
6020,-40.12
6021,-39.54
6022,-38.93
6023,-38.32
6024,-37.70
6025,-37.12
6026,-36.54
6027,-36.03
6028,-35.54
6029,-35.14
6030,-34.75
6031,-34.42
6032,-34.02
6033,-33.62
6034,-33.16
6035,-32.68
6036,-32.14
6037,-31.64
6038,-31.11
6039,-30.65
6040,-30.19
6041,-29.79
6042,-29.40
6043,-29.07
6044,-28.74
6045,-28.47
6046,-28.21
6047,-28.02
6048,-27.82
6049,-27.65
6050,-27.47
6051,-27.37
6052,-27.36
6053,-27.44
6054,-27.55
6055,-27.69
6056,-27.88
6057,-28.09
6058,-28.31
6059,-28.50
6060,-28.66
6061,-28.79
6062,-28.95
6063,-29.10
6064,-29.33
6065,-29.62
6066,-30.03
6067,-30.46
6068,-30.91
6069,-31.31
6070,-31.65
6071,-31.88
6072,-32.04
6073,-32.17
6074,-32.33
6075,-32.51
6076,-32.73
6077,-32.95
6078,-33.21
6079,-33.45
6080,-33.68
6081,-33.81
6082,-33.89
6083,-33.95
6084,-34.03
6085,-34.13
6086,-34.23
6087,-34.33
6088,-34.42
6089,-34.45
6090,-34.42
6091,-34.32
6092,-34.18
6093,-34.01
6094,-33.85
6095,-33.72
6096,-33.63
6097,-33.61
6098,-33.62
6099,-33.66
6100,-33.66
6101,-33.62
6102,-33.52
6103,-33.37
6104,-33.16
6105,-32.91
6106,-32.62
6107,-32.38
6108,-32.24
6109,-32.24
6110,-32.37
6111,-32.60
6112,-32.88
6113,-33.15
6114,-33.39
6115,-33.58
6116,-33.68
6117,-33.69
6118,-33.63
6119,-33.55
6120,-33.50
6121,-33.51
6122,-33.60
6123,-33.75
6124,-33.94
6125,-34.13
6126,-34.27
6127,-34.38
6128,-34.44
6129,-34.47
6130,-34.48
6131,-34.45
6132,-34.40
6133,-34.30
6134,-34.16
6135,-34.00
6136,-33.80
6137,-33.59
6138,-33.38
6139,-33.19
6140,-33.02
6141,-32.91
6142,-32.82
6143,-32.78
6144,-32.76
6145,-32.71
6146,-32.57
6147,-32.36
6148,-32.11
6149,-31.89
6150,-31.69
6151,-31.54
6152,-31.45
6153,-31.43
6154,-31.44
6155,-31.49
6156,-31.56
6157,-31.62
6158,-31.65
6159,-31.65
6160,-31.63
6161,-31.65
6162,-31.70
6163,-31.80
6164,-31.91
6165,-32.04
6166,-32.14
6167,-32.23
6168,-32.30
6169,-32.34
6170,-32.36
6171,-32.36
6172,-32.37
6173,-32.38
6174,-32.37
6175,-32.33
6176,-32.27
6177,-32.22
6178,-32.17
6179,-32.15
6180,-32.17
6181,-32.27
6182,-32.44
6183,-32.65
6184,-32.90
6185,-33.13
6186,-33.34
6187,-33.47
6188,-33.55
6189,-33.60
6190,-33.69
6191,-33.80
6192,-33.95
6193,-34.13
6194,-34.40
6195,-34.73
6196,-35.09
6197,-35.39
6198,-35.61
6199,-35.74
6200,-35.81
6201,-35.85
6202,-35.88
6203,-35.91
6204,-35.96
6205,-36.00
6206,-36.03
6207,-36.03
6208,-36.01
6209,-35.96
6210,-35.89
6211,-35.80
6212,-35.69
6213,-35.58
6214,-35.45
6215,-35.31
6216,-35.10
6217,-34.84
6218,-34.50
6219,-34.10
6220,-33.65
6221,-33.22
6222,-32.82
6223,-32.48
6224,-32.17
6225,-31.93
6226,-31.72
6227,-31.56
6228,-31.36
6229,-31.15
6230,-30.94
6231,-30.82
6232,-30.75
6233,-30.76
6234,-30.81
6235,-30.90
6236,-31.01
6237,-31.11
6238,-31.13
6239,-31.05
6240,-30.92
6241,-30.79
6242,-30.71
6243,-30.67
6244,-30.66
6245,-30.69
6246,-30.76
6247,-30.88
6248,-31.02
6249,-31.13
6250,-31.18
6251,-31.18
6252,-31.15
6253,-31.08
6254,-30.99
6255,-30.88
6256,-30.81
6257,-30.80
6258,-30.88
6259,-31.04
6260,-31.30
6261,-31.62
6262,-31.96
6263,-32.29
6264,-32.60
6265,-32.88
6266,-33.14
6267,-33.36
6268,-33.61
6269,-33.88
6270,-34.24
6271,-34.62
6272,-35.02
6273,-35.37
6274,-35.71
6275,-36.01
6276,-36.31
6277,-36.58
6278,-36.89
6279,-37.19
6280,-37.51
6281,-37.80
6282,-38.10
6283,-38.37
6284,-38.65
6285,-38.92
6286,-39.21
6287,-39.50
6288,-39.81
6289,-40.14
6290,-40.48
6291,-40.79
6292,-41.05
6293,-41.19
6294,-41.24
6295,-41.19
6296,-41.05
6297,-40.84
6298,-40.61
6299,-40.37
6300,-40.10
6301,-39.85
6302,-39.65
6303,-39.55
6304,-39.52
6305,-39.54
6306,-39.58
6307,-39.64
6308,-39.70
6309,-39.72
6310,-39.67
6311,-39.59
6312,-39.47
6313,-39.35
6314,-39.23
6315,-39.15
6316,-39.09
6317,-39.05
6318,-38.99
6319,-38.94
6320,-38.88
6321,-38.80
6322,-38.68
6323,-38.55
6324,-38.45
6325,-38.39
6326,-38.34
6327,-38.28
6328,-38.23
6329,-38.19
6330,-38.17
6331,-38.14
6332,-38.12
6333,-38.12
6334,-38.14
6335,-38.19
6336,-38.25
6337,-38.31
6338,-38.36
6339,-38.41
6340,-38.44
6341,-38.47
6342,-38.50
6343,-38.53
6344,-38.56
6345,-38.59
6346,-38.63
6347,-38.68
6348,-38.76
6349,-38.86
6350,-38.94
6351,-39.00
6352,-39.04
6353,-39.03
6354,-39.01
6355,-38.96
6356,-38.91
6357,-38.89
6358,-38.93
6359,-39.00
6360,-39.16
6361,-39.37
6362,-39.63
6363,-39.89
6364,-40.16
6365,-40.43
6366,-40.70
6367,-40.96
6368,-41.22
6369,-41.48
6370,-41.80
6371,-42.11
6372,-42.45
6373,-42.73
6374,-43.05
6375,-43.41
6376,-43.88
6377,-44.36
6378,-44.87
6379,-45.36
6380,-45.86
6381,-46.33
6382,-46.75
6383,-47.10
6384,-47.39
6385,-47.60
6386,-47.77
6387,-47.89
6388,-47.97
6389,-48.00
6390,-47.95
6391,-47.81
6392,-47.62
6393,-47.38
6394,-47.09
6395,-46.76
6396,-46.41
6397,-46.08
6398,-45.77
6399,-45.48
6400,-45.18
6401,-44.91
6402,-44.69
6403,-44.53
6404,-44.36
6405,-44.19
6406,-43.96
6407,-43.73
6408,-43.48
6409,-43.26
6410,-43.01
6411,-42.78
6412,-42.54
6413,-42.36
6414,-42.17
6415,-41.96
6416,-41.65
6417,-41.27
6418,-40.76
6419,-40.20
6420,-39.54
6421,-38.89
6422,-38.22
6423,-37.65
6424,-37.13
6425,-36.72
6426,-36.33
6427,-35.97
6428,-35.55
6429,-35.10
6430,-34.60
6431,-34.13
6432,-33.68
6433,-33.29
6434,-32.97
6435,-32.77
6436,-32.66
6437,-32.69
6438,-32.79
6439,-32.94
6440,-33.07
6441,-33.14
6442,-33.15
6443,-33.12
6444,-33.07
6445,-33.01
6446,-32.94
6447,-32.88
6448,-32.86
6449,-32.93
6450,-33.12
6451,-33.40
6452,-33.75
6453,-34.13
6454,-34.51
6455,-34.87
6456,-35.18
6457,-35.41
6458,-35.55
6459,-35.61
6460,-35.64
6461,-35.64
6462,-35.64
6463,-35.63
6464,-35.63
6465,-35.60
6466,-35.53
6467,-35.41
6468,-35.26
6469,-35.10
6470,-34.97
6471,-34.88
6472,-34.85
6473,-34.88
6474,-34.95
6475,-35.03
6476,-35.10
6477,-35.11
6478,-35.06
6479,-34.96
6480,-34.81
6481,-34.65
6482,-34.45
6483,-34.22
6484,-33.95
6485,-33.67
6486,-33.34
6487,-33.00
6488,-32.61
6489,-32.23
6490,-31.81
6491,-31.45
6492,-31.14
6493,-30.98
6494,-30.88
6495,-30.88
6496,-30.91
6497,-30.97
6498,-30.98
6499,-30.91
6500,-30.74
6501,-30.46
6502,-30.05
6503,-29.58
6504,-29.08
6505,-28.61
6506,-28.18
6507,-27.83
6508,-27.57
6509,-27.42
6510,-27.34
6511,-27.31
6512,-27.28
6513,-27.20
6514,-27.06
6515,-26.89
6516,-26.69
6517,-26.51
6518,-26.37
6519,-26.28
6520,-26.24
6521,-26.28
6522,-26.35
6523,-26.43
6524,-26.47
6525,-26.47
6526,-26.47
6527,-26.47
6528,-26.51
6529,-26.60
6530,-26.82
6531,-27.17
6532,-27.68
6533,-28.26
6534,-28.88
6535,-29.47
6536,-30.04
6537,-30.55
6538,-31.01
6539,-31.36
6540,-31.68
6541,-31.93
6542,-32.17
6543,-32.37
6544,-32.59
6545,-32.76
6546,-32.96
6547,-33.16
6548,-33.42
6549,-33.73
6550,-34.15
6551,-34.60
6552,-35.10
6553,-35.57
6554,-36.05
6555,-36.51
6556,-36.95
6557,-37.31
6558,-37.62
6559,-37.86
6560,-38.09
6561,-38.28
6562,-38.45
6563,-38.59
6564,-38.73
6565,-38.86
6566,-39.01
6567,-39.18
6568,-39.41
6569,-39.65
6570,-39.94
6571,-40.20
6572,-40.45
6573,-40.68
6574,-40.95
6575,-41.21
6576,-41.53
6577,-41.87
6578,-42.25
6579,-42.63
6580,-43.03
6581,-43.40
6582,-43.80
6583,-44.16
6584,-44.53
6585,-44.87
6586,-45.26
6587,-45.66
6588,-46.13
6589,-46.61
6590,-47.14
6591,-47.68
6592,-48.29
6593,-48.89
6594,-49.50
6595,-50.03
6596,-50.57
6597,-51.03
6598,-51.48
6599,-51.83
6600,-52.22
6601,-52.59
6602,-53.09
6603,-53.63
6604,-54.31
6605,-55.00
6606,-55.80
6607,-56.60
6608,-57.44
6609,-58.19
6610,-58.88
6611,-59.46
6612,-60.01
6613,-60.46
6614,-60.91
6615,-61.30
6616,-61.68
6617,-62.03
6618,-62.41
6619,-62.76
6620,-63.09
6621,-63.32
6622,-63.47
6623,-63.51
6624,-63.50
6625,-63.40
6626,-63.28
6627,-63.13
6628,-63.02
6629,-62.97
6630,-62.96
6631,-62.98
6632,-62.98
6633,-62.95
6634,-62.85
6635,-62.71
6636,-62.47
6637,-62.19
6638,-61.82
6639,-61.45
6640,-60.99
6641,-60.50
6642,-59.92
6643,-59.30
6644,-58.55
6645,-57.72
6646,-56.76
6647,-55.79
6648,-54.76
6649,-53.79
6650,-52.83
6651,-51.94
6652,-51.04
6653,-50.22
6654,-49.42
6655,-48.73
6656,-48.06
6657,-47.52
6658,-47.04
6659,-46.68
6660,-46.34
6661,-46.05
6662,-45.72
6663,-45.41
6664,-45.05
6665,-44.69
6666,-44.30
6667,-44.00
6668,-43.75
6669,-43.62
6670,-43.59
6671,-43.66
6672,-43.79
6673,-43.96
6674,-44.12
6675,-44.25
6676,-44.31
6677,-44.33
6678,-44.31
6679,-44.27
6680,-44.17
6681,-44.06
6682,-43.93
6683,-43.82
6684,-43.69
6685,-43.56
6686,-43.36
6687,-43.11
6688,-42.76
6689,-42.33
6690,-41.79
6691,-41.21
6692,-40.57
6693,-39.95
6694,-39.29
6695,-38.70
6696,-38.12
6697,-37.62
6698,-37.10
6699,-36.60
6700,-36.00
6701,-35.39
6702,-34.68
6703,-33.95
6704,-33.13
6705,-32.35
6706,-31.54
6707,-30.83
6708,-30.14
6709,-29.52
6710,-28.86
6711,-28.24
6712,-27.60
6713,-27.01
6714,-26.39
6715,-25.82
6716,-25.27
6717,-24.82
6718,-24.44
6719,-24.15
6720,-23.89
6721,-23.72
6722,-23.57
6723,-23.45
6724,-23.25
6725,-23.03
6726,-22.78
6727,-22.56
6728,-22.32
6729,-22.11
6730,-21.93
6731,-21.83
6732,-21.76
6733,-21.71
6734,-21.64
6735,-21.55
6736,-21.44
6737,-21.31
6738,-21.15
6739,-21.01
6740,-20.92
6741,-20.90
6742,-20.94
6743,-21.01
6744,-21.08
6745,-21.14
6746,-21.19
6747,-21.21
6748,-21.24
6749,-21.25
6750,-21.26
6751,-21.29
6752,-21.42
6753,-21.63
6754,-21.97
6755,-22.40
6756,-22.93
6757,-23.52
6758,-24.15
6759,-24.75
6760,-25.31
6761,-25.76
6762,-26.14
6763,-26.37
6764,-26.54
6765,-26.70
6766,-26.93
6767,-27.24
6768,-27.66
6769,-28.14
6770,-28.70
6771,-29.27
6772,-29.77
6773,-30.13
6774,-30.34
6775,-30.43
6776,-30.41
6777,-30.32
6778,-30.19
6779,-30.03
6780,-29.87
6781,-29.71
6782,-29.56
6783,-29.40
6784,-29.24
6785,-29.05
6786,-28.82
6787,-28.57
6788,-28.29
6789,-28.02
6790,-27.78
6791,-27.62
6792,-27.52
6793,-27.53
6794,-27.63
6795,-27.83
6796,-28.07
6797,-28.29
6798,-28.44
6799,-28.51
6800,-28.46
6801,-28.33
6802,-28.11
6803,-27.88
6804,-27.62
6805,-27.39
6806,-27.18
6807,-26.96
6808,-26.72
6809,-26.45
6810,-26.18
6811,-25.95
6812,-25.73
6813,-25.54
6814,-25.40
6815,-25.34
6816,-25.34
6817,-25.38
6818,-25.41
6819,-25.42
6820,-25.43
6821,-25.43
6822,-25.42
6823,-25.42
6824,-25.45
6825,-25.54
6826,-25.68
6827,-25.88
6828,-26.12
6829,-26.37
6830,-26.60
6831,-26.77
6832,-26.86
6833,-26.87
6834,-26.82
6835,-26.75
6836,-26.68
6837,-26.64
6838,-26.66
6839,-26.73
6840,-26.87
6841,-27.04
6842,-27.20
6843,-27.33
6844,-27.44
6845,-27.50
6846,-27.55
6847,-27.54
6848,-27.51
6849,-27.49
6850,-27.54
6851,-27.66
6852,-27.83
6853,-28.02
6854,-28.26
6855,-28.56
6856,-28.95
6857,-29.36
6858,-29.77
6859,-30.15
6860,-30.52
6861,-30.82
6862,-31.08
6863,-31.27
6864,-31.42
6865,-31.52
6866,-31.64
6867,-31.72
6868,-31.80
6869,-31.84
6870,-31.85
6871,-31.80
6872,-31.70
6873,-31.55
6874,-31.39
6875,-31.24
6876,-31.14
6877,-31.11
6878,-31.19
6879,-31.35
6880,-31.58
6881,-31.83
6882,-32.11
6883,-32.41
6884,-32.71
6885,-32.96
6886,-33.16
6887,-33.30
6888,-33.42
6889,-33.50
6890,-33.60
6891,-33.70
6892,-33.81
6893,-33.93
6894,-34.07
6895,-34.23
6896,-34.42
6897,-34.58
6898,-34.69
6899,-34.71
6900,-34.64
6901,-34.50
6902,-34.31
6903,-34.07
6904,-33.79
6905,-33.54
6906,-33.33
6907,-33.16
6908,-33.04
6909,-32.95
6910,-32.91
6911,-32.91
6912,-32.93
6913,-32.99
6914,-33.05
6915,-33.13
6916,-33.17
6917,-33.18
6918,-33.12
6919,-32.99
6920,-32.77
6921,-32.49
6922,-32.16
6923,-31.83
6924,-31.52
6925,-31.27
6926,-31.08
6927,-31.01
6928,-31.04
6929,-31.17
6930,-31.39
6931,-31.65
6932,-31.93
6933,-32.17
6934,-32.33
6935,-32.42
6936,-32.46
6937,-32.48
6938,-32.52
6939,-32.60
6940,-32.73
6941,-32.91
6942,-33.13
6943,-33.38
6944,-33.58
6945,-33.73
6946,-33.77
6947,-33.69
6948,-33.51
6949,-33.25
6950,-32.97
6951,-32.69
6952,-32.44
6953,-32.22
6954,-32.04
6955,-31.91
6956,-31.80
6957,-31.70
6958,-31.56
6959,-31.39
6960,-31.17
6961,-30.93
6962,-30.68
6963,-30.45
6964,-30.28
6965,-30.16
6966,-30.08
6967,-30.04
6968,-30.04
6969,-30.10
6970,-30.19
6971,-30.30
6972,-30.43
6973,-30.58
6974,-30.72
6975,-30.86
6976,-30.99
6977,-31.10
6978,-31.15
6979,-31.14
6980,-31.07
6981,-30.98
6982,-30.88
6983,-30.78
6984,-30.67
6985,-30.59
6986,-30.49
6987,-30.40
6988,-30.27
6989,-30.14
6990,-29.97
6991,-29.75
6992,-29.47
6993,-29.17
6994,-28.82
6995,-28.48
6996,-28.14
6997,-27.85
6998,-27.59
6999,-27.39
7000,-27.21
7001,-27.06
7002,-26.86
7003,-26.62
7004,-26.29
7005,-25.92
7006,-25.51
7007,-25.09
7008,-24.68
7009,-24.36
7010,-24.12
7011,-23.97
7012,-23.89
7013,-23.86
7014,-23.90
7015,-24.02
7016,-24.20
7017,-24.39
7018,-24.57
7019,-24.72
7020,-24.86
7021,-24.96
7022,-25.08
7023,-25.21
7024,-25.43
7025,-25.74
7026,-26.18
7027,-26.70
7028,-27.32
7029,-27.96
7030,-28.59
7031,-29.10
7032,-29.52
7033,-29.80
7034,-30.01
7035,-30.15
7036,-30.27
7037,-30.36
7038,-30.48
7039,-30.56
7040,-30.63
7041,-30.67
7042,-30.72
7043,-30.80
7044,-30.94
7045,-31.14
7046,-31.46
7047,-31.84
7048,-32.28
7049,-32.73
7050,-33.17
7051,-33.54
7052,-33.84
7053,-34.02
7054,-34.14
7055,-34.22
7056,-34.32
7057,-34.46
7058,-34.67
7059,-34.89
7060,-35.13
7061,-35.32
7062,-35.51
7063,-35.63
7064,-35.72
7065,-35.78
7066,-35.84
7067,-35.86
7068,-35.86
7069,-35.84
7070,-35.85
7071,-35.90
7072,-35.96
7073,-36.00
7074,-36.02
7075,-35.99
7076,-35.93
7077,-35.84
7078,-35.77
7079,-35.73
7080,-35.73
7081,-35.77
7082,-35.85
7083,-35.96
7084,-36.09
7085,-36.21
7086,-36.29
7087,-36.31
7088,-36.27
7089,-36.18
7090,-36.01
7091,-35.78
7092,-35.48
7093,-35.18
7094,-34.84
7095,-34.47
7096,-34.06
7097,-33.66
7098,-33.27
7099,-32.95
7100,-32.64
7101,-32.36
7102,-32.06
7103,-31.75
7104,-31.38
7105,-30.99
7106,-30.57
7107,-30.20
7108,-29.87
7109,-29.62
7110,-29.46
7111,-29.39
7112,-29.38
7113,-29.43
7114,-29.50
7115,-29.56
7116,-29.59
7117,-29.57
7118,-29.53
7119,-29.49
7120,-29.46
7121,-29.44
7122,-29.43
7123,-29.42
7124,-29.42
7125,-29.43
7126,-29.43
7127,-29.46
7128,-29.51
7129,-29.57
7130,-29.63
7131,-29.68
7132,-29.76
7133,-29.85
7134,-29.95
7135,-30.03
7136,-30.14
7137,-30.28
7138,-30.49
7139,-30.74
7140,-31.07
7141,-31.43
7142,-31.76
7143,-32.03
7144,-32.27
7145,-32.49
7146,-32.68
7147,-32.83
7148,-32.96
7149,-33.07
7150,-33.20
7151,-33.33
7152,-33.53
7153,-33.75
7154,-34.00
7155,-34.23
7156,-34.45
7157,-34.62
7158,-34.79
7159,-34.92
7160,-35.01
7161,-35.06
7162,-35.09
7163,-35.14
7164,-35.23
7165,-35.35
7166,-35.49
7167,-35.61
7168,-35.68
7169,-35.67
7170,-35.60
7171,-35.46
7172,-35.24
7173,-34.97
7174,-34.70
7175,-34.44
7176,-34.20
7177,-34.00
7178,-33.82
7179,-33.67
7180,-33.54
7181,-33.46
7182,-33.47
7183,-33.56
7184,-33.70
7185,-33.86
7186,-34.00
7187,-34.12
7188,-34.20
7189,-34.37
7190,-34.33
7191,-34.14
7192,-33.96
7193,-35.53
7194,-35.94
7195,-32.70
7196,-30.36
7197,-37.51
7198,-46.68
7199,-34.53
7200,-6.72
