1,3.17
2,4.52
3,4.54
4,4.07
5,3.98
6,4.29
7,4.49
8,4.43
9,4.31
10,4.28
11,4.29
12,4.35
13,4.39
14,4.42
15,4.38
16,4.30
17,4.22
18,4.21
19,4.28
20,4.41
21,4.55
22,4.68
23,4.78
24,4.83
25,4.86
26,4.85
27,4.83
28,4.81
29,4.80
30,4.81
31,4.84
32,4.89
33,4.96
34,5.05
35,5.14
36,5.21
37,5.24
38,5.26
39,5.29
40,5.33
41,5.36
42,5.36
43,5.32
44,5.28
45,5.28
46,5.35
47,5.44
48,5.50
49,5.46
50,5.32
51,5.15
52,5.04
53,5.03
54,5.10
55,5.17
56,5.17
57,5.07
58,4.90
59,4.74
60,4.64
61,4.60
62,4.62
63,4.67
64,4.73
65,4.81
66,4.87
67,4.91
68,4.91
69,4.87
70,4.82
71,4.78
72,4.75
73,4.75
74,4.74
75,4.74
76,4.74
77,4.75
78,4.79
79,4.82
80,4.83
81,4.80
82,4.74
83,4.69
84,4.67
85,4.71
86,4.78
87,4.85
88,4.89
89,4.90
90,4.90
91,4.92
92,4.96
93,5.01
94,5.03
95,5.04
96,5.05
97,5.11
98,5.19
99,5.28
100,5.33
101,5.32
102,5.30
103,5.32
104,5.39
105,5.47
106,5.50
107,5.48
108,5.45
109,5.45
110,5.50
111,5.55
112,5.55
113,5.49
114,5.41
115,5.35
116,5.36
117,5.42
118,5.49
119,5.52
120,5.52
121,5.51
122,5.51
123,5.51
124,5.50
125,5.45
126,5.37
127,5.30
128,5.26
129,5.27
130,5.30
131,5.32
132,5.32
133,5.30
134,5.27
135,5.26
136,5.25
137,5.25
138,5.22
139,5.18
140,5.17
141,5.20
142,5.28
143,5.38
144,5.47
145,5.51
146,5.51
147,5.47
148,5.44
149,5.42
150,5.41
151,5.43
152,5.45
153,5.47
154,5.48
155,5.49
156,5.50
157,5.51
158,5.50
159,5.48
160,5.44
161,5.40
162,5.35
163,5.31
164,5.28
165,5.28
166,5.29
167,5.31
168,5.32
169,5.29
170,5.25
171,5.19
172,5.15
173,5.11
174,5.10
175,5.08
176,5.08
177,5.11
178,5.15
179,5.22
180,5.27
181,5.28
182,5.25
183,5.20
184,5.16
185,5.18
186,5.26
187,5.35
188,5.41
189,5.43
190,5.41
191,5.38
192,5.37
193,5.36
194,5.35
195,5.34
196,5.34
197,5.36
198,5.41
199,5.46
200,5.50
201,5.51
202,5.51
203,5.50
204,5.51
205,5.54
206,5.58
207,5.61
208,5.65
209,5.68
210,5.72
211,5.74
212,5.73
213,5.66
214,5.57
215,5.48
216,5.44
217,5.46
218,5.53
219,5.61
220,5.65
221,5.66
222,5.63
223,5.61
224,5.60
225,5.62
226,5.62
227,5.59
228,5.52
229,5.44
230,5.39
231,5.40
232,5.46
233,5.52
234,5.53
235,5.49
236,5.40
237,5.32
238,5.29
239,5.30
240,5.33
241,5.32
242,5.28
243,5.23
244,5.21
245,5.23
246,5.29
247,5.35
248,5.40
249,5.47
250,5.56
251,5.70
252,5.83
253,5.92
254,5.92
255,5.85
256,5.76
257,5.70
258,5.69
259,5.69
260,5.67
261,5.64
262,5.60
263,5.58
264,5.58
265,5.60
266,5.59
267,5.56
268,5.53
269,5.53
270,5.57
271,5.62
272,5.64
273,5.59
274,5.50
275,5.41
276,5.38
277,5.40
278,5.45
279,5.47
280,5.44
281,5.36
282,5.31
283,5.31
284,5.37
285,5.46
286,5.51
287,5.50
288,5.45
289,5.40
290,5.40
291,5.46
292,5.56
293,5.66
294,5.73
295,5.75
296,5.74
297,5.74
298,5.75
299,5.78
300,5.82
301,5.84
302,5.84
303,5.81
304,5.77
305,5.75
306,5.76
307,5.80
308,5.82
309,5.81
310,5.76
311,5.69
312,5.63
313,5.62
314,5.64
315,5.69
316,5.73
317,5.76
318,5.76
319,5.75
320,5.72
321,5.69
322,5.64
323,5.60
324,5.57
325,5.57
326,5.61
327,5.66
328,5.71
329,5.75
330,5.78
331,5.79
332,5.80
333,5.81
334,5.81
335,5.79
336,5.75
337,5.69
338,5.62
339,5.57
340,5.54
341,5.54
342,5.58
343,5.64
344,5.71
345,5.76
346,5.81
347,5.84
348,5.85
349,5.84
350,5.83
351,5.83
352,5.84
353,5.86
354,5.87
355,5.85
356,5.81
357,5.72
358,5.60
359,5.46
360,5.33
361,5.24
362,5.21
363,5.24
364,5.29
365,5.35
366,5.37
367,5.36
368,5.32
369,5.28
370,5.25
371,5.24
372,5.23
373,5.22
374,5.21
375,5.19
376,5.19
377,5.19
378,5.18
379,5.18
380,5.18
381,5.21
382,5.26
383,5.31
384,5.35
385,5.36
386,5.35
387,5.33
388,5.32
389,5.33
390,5.35
391,5.35
392,5.32
393,5.26
394,5.21
395,5.18
396,5.19
397,5.24
398,5.28
399,5.29
400,5.26
401,5.22
402,5.18
403,5.17
404,5.19
405,5.22
406,5.22
407,5.22
408,5.21
409,5.22
410,5.24
411,5.27
412,5.29
413,5.30
414,5.30
415,5.29
416,5.28
417,5.27
418,5.29
419,5.33
420,5.40
421,5.48
422,5.56
423,5.62
424,5.66
425,5.69
426,5.71
427,5.74
428,5.77
429,5.80
430,5.84
431,5.90
432,5.98
433,6.08
434,6.15
435,6.20
436,6.21
437,6.21
438,6.24
439,6.28
440,6.33
441,6.34
442,6.30
443,6.20
444,6.10
445,6.05
446,6.06
447,6.13
448,6.20
449,6.21
450,6.17
451,6.08
452,5.99
453,5.94
454,5.93
455,5.94
456,5.96
457,5.96
458,5.95
459,5.93
460,5.93
461,5.94
462,5.98
463,6.00
464,6.00
465,5.96
466,5.90
467,5.85
468,5.85
469,5.91
470,6.01
471,6.11
472,6.19
473,6.22
474,6.22
475,6.20
476,6.18
477,6.17
478,6.18
479,6.19
480,6.20
481,6.22
482,6.23
483,6.25
484,6.27
485,6.28
486,6.27
487,6.23
488,6.16
489,6.11
490,6.06
491,6.03
492,6.00
493,5.96
494,5.91
495,5.87
496,5.84
497,5.83
498,5.82
499,5.81
500,5.79
501,5.77
502,5.75
503,5.74
504,5.72
505,5.69
506,5.65
507,5.62
508,5.60
509,5.60
510,5.65
511,5.71
512,5.78
513,5.83
514,5.84
515,5.80
516,5.71
517,5.59
518,5.48
519,5.39
520,5.34
521,5.35
522,5.39
523,5.43
524,5.46
525,5.45
526,5.45
527,5.45
528,5.47
529,5.46
530,5.44
531,5.40
532,5.37
533,5.39
534,5.43
535,5.45
536,5.42
537,5.34
538,5.25
539,5.19
540,5.18
541,5.24
542,5.31
543,5.35
544,5.34
545,5.29
546,5.24
547,5.21
548,5.23
549,5.27
550,5.31
551,5.33
552,5.33
553,5.34
554,5.37
555,5.42
556,5.48
557,5.51
558,5.50
559,5.47
560,5.47
561,5.51
562,5.57
563,5.64
564,5.67
565,5.65
566,5.61
567,5.57
568,5.58
569,5.62
570,5.67
571,5.70
572,5.71
573,5.70
574,5.66
575,5.60
576,5.51
577,5.43
578,5.36
579,5.30
580,5.26
581,5.23
582,5.18
583,5.12
584,5.06
585,5.00
586,4.95
587,4.92
588,4.90
589,4.89
590,4.89
591,4.92
592,4.97
593,5.03
594,5.05
595,5.04
596,5.01
597,5.00
598,5.03
599,5.07
600,5.09
601,5.06
602,5.00
603,4.93
604,4.90
605,4.93
606,4.97
607,5.02
608,5.04
609,5.04
610,5.05
611,5.08
612,5.09
613,5.09
614,5.08
615,5.07
616,5.08
617,5.13
618,5.19
619,5.24
620,5.26
621,5.28
622,5.31
623,5.37
624,5.44
625,5.49
626,5.51
627,5.51
628,5.49
629,5.48
630,5.49
631,5.50
632,5.53
633,5.58
634,5.62
635,5.66
636,5.67
637,5.67
638,5.67
639,5.69
640,5.73
641,5.80
642,5.87
643,5.94
644,6.00
645,6.04
646,6.06
647,6.05
648,6.04
649,6.05
650,6.09
651,6.16
652,6.24
653,6.28
654,6.26
655,6.19
656,6.12
657,6.07
658,6.09
659,6.15
660,6.23
661,6.28
662,6.30
663,6.29
664,6.28
665,6.27
666,6.26
667,6.23
668,6.18
669,6.13
670,6.12
671,6.15
672,6.22
673,6.28
674,6.30
675,6.28
676,6.26
677,6.26
678,6.27
679,6.28
680,6.24
681,6.15
682,6.06
683,6.02
684,6.04
685,6.11
686,6.19
687,6.25
688,6.30
689,6.34
690,6.37
691,6.40
692,6.41
693,6.40
694,6.36
695,6.30
696,6.25
697,6.20
698,6.17
699,6.17
700,6.18
701,6.18
702,6.16
703,6.10
704,6.02
705,5.94
706,5.89
707,5.88
708,5.87
709,5.85
710,5.80
711,5.75
712,5.74
713,5.77
714,5.81
715,5.83
716,5.80
717,5.74
718,5.68
719,5.65
720,5.65
721,5.67
722,5.70
723,5.73
724,5.75
725,5.78
726,5.79
727,5.79
728,5.76
729,5.70
730,5.65
731,5.59
732,5.55
733,5.54
734,5.54
735,5.56
736,5.58
737,5.60
738,5.61
739,5.61
740,5.60
741,5.60
742,5.62
743,5.62
744,5.61
745,5.56
746,5.51
747,5.47
748,5.47
749,5.51
750,5.54
751,5.52
752,5.47
753,5.39
754,5.32
755,5.28
756,5.27
757,5.29
758,5.29
759,5.29
760,5.28
761,5.25
762,5.23
763,5.23
764,5.25
765,5.28
766,5.30
767,5.32
768,5.32
769,5.32
770,5.33
771,5.33
772,5.34
773,5.34
774,5.38
775,5.46
776,5.59
777,5.73
778,5.83
779,5.87
780,5.86
781,5.86
782,5.90
783,6.01
784,6.14
785,6.23
786,6.24
787,6.20
788,6.16
789,6.18
790,6.26
791,6.35
792,6.40
793,6.38
794,6.33
795,6.27
796,6.24
797,6.26
798,6.29
799,6.30
800,6.30
801,6.29
802,6.27
803,6.24
804,6.21
805,6.17
806,6.14
807,6.12
808,6.11
809,6.10
810,6.07
811,6.02
812,5.97
813,5.96
814,5.98
815,6.02
816,6.02
817,5.96
818,5.84
819,5.73
820,5.68
821,5.71
822,5.77
823,5.81
824,5.79
825,5.71
826,5.61
827,5.55
828,5.56
829,5.62
830,5.71
831,5.77
832,5.79
833,5.78
834,5.79
835,5.83
836,5.88
837,5.93
838,5.95
839,5.93
840,5.87
841,5.83
842,5.82
843,5.85
844,5.91
845,5.95
846,5.95
847,5.92
848,5.89
849,5.86
850,5.84
851,5.83
852,5.84
853,5.88
854,5.94
855,6.02
856,6.09
857,6.14
858,6.17
859,6.20
860,6.23
861,6.25
862,6.25
863,6.23
864,6.19
865,6.15
866,6.15
867,6.18
868,6.22
869,6.25
870,6.23
871,6.18
872,6.12
873,6.09
874,6.08
875,6.06
876,6.02
877,5.95
878,5.87
879,5.82
880,5.82
881,5.86
882,5.91
883,5.96
884,5.99
885,6.00
886,5.99
887,5.97
888,5.93
889,5.87
890,5.81
891,5.76
892,5.73
893,5.73
894,5.74
895,5.75
896,5.75
897,5.74
898,5.74
899,5.75
900,5.76
901,5.77
902,5.77
903,5.79
904,5.82
905,5.88
906,5.93
907,5.95
908,5.92
909,5.86
910,5.80
911,5.77
912,5.78
913,5.81
914,5.85
915,5.86
916,5.83
917,5.80
918,5.78
919,5.80
920,5.83
921,5.87
922,5.86
923,5.81
924,5.74
925,5.70
926,5.71
927,5.74
928,5.75
929,5.71
930,5.62
931,5.53
932,5.48
933,5.50
934,5.55
935,5.58
936,5.56
937,5.48
938,5.40
939,5.35
940,5.35
941,5.37
942,5.36
943,5.32
944,5.29
945,5.30
946,5.39
947,5.51
948,5.62
949,5.65
950,5.60
951,5.53
952,5.49
953,5.51
954,5.58
955,5.65
956,5.67
957,5.65
958,5.60
959,5.57
960,5.56
961,5.56
962,5.56
963,5.55
964,5.54
965,5.53
966,5.55
967,5.58
968,5.60
969,5.60
970,5.54
971,5.46
972,5.40
973,5.40
974,5.44
975,5.51
976,5.53
977,5.49
978,5.40
979,5.33
980,5.32
981,5.37
982,5.44
983,5.49
984,5.49
985,5.47
986,5.46
987,5.45
988,5.45
989,5.47
990,5.51
991,5.58
992,5.66
993,5.73
994,5.74
995,5.69
996,5.61
997,5.55
998,5.55
999,5.60
1000,5.65
1001,5.68
1002,5.65
1003,5.61
1004,5.59
1005,5.63
1006,5.69
1007,5.70
1008,5.66
1009,5.58
1010,5.51
1011,5.47
1012,5.46
1013,5.44
1014,5.38
1015,5.32
1016,5.27
1017,5.26
1018,5.27
1019,5.31
1020,5.36
1021,5.41
1022,5.44
1023,5.45
1024,5.45
1025,5.44
1026,5.45
1027,5.46
1028,5.48
1029,5.50
1030,5.52
1031,5.55
1032,5.57
1033,5.59
1034,5.60
1035,5.57
1036,5.52
1037,5.46
1038,5.43
1039,5.43
1040,5.46
1041,5.49
1042,5.50
1043,5.49
1044,5.48
1045,5.48
1046,5.48
1047,5.47
1048,5.44
1049,5.40
1050,5.40
1051,5.44
1052,5.51
1053,5.59
1054,5.61
1055,5.57
1056,5.48
1057,5.39
1058,5.33
1059,5.32
1060,5.33
1061,5.33
1062,5.30
1063,5.28
1064,5.27
1065,5.29
1066,5.33
1067,5.38
1068,5.41
1069,5.44
1070,5.48
1071,5.52
1072,5.54
1073,5.51
1074,5.47
1075,5.41
1076,5.39
1077,5.40
1078,5.43
1079,5.47
1080,5.51
1081,5.55
1082,5.58
1083,5.60
1084,5.61
1085,5.62
1086,5.62
1087,5.64
1088,5.68
1089,5.73
1090,5.75
1091,5.74
1092,5.71
1093,5.70
1094,5.74
1095,5.80
1096,5.85
1097,5.86
1098,5.83
1099,5.78
1100,5.75
1101,5.74
1102,5.76
1103,5.76
1104,5.74
1105,5.70
1106,5.66
1107,5.64
1108,5.64
1109,5.63
1110,5.60
1111,5.56
1112,5.52
1113,5.52
1114,5.55
1115,5.59
1116,5.62
1117,5.63
1118,5.62
1119,5.64
1120,5.68
1121,5.74
1122,5.78
1123,5.80
1124,5.81
1125,5.85
1126,5.93
1127,6.00
1128,6.03
1129,5.98
1130,5.90
1131,5.83
1132,5.81
1133,5.84
1134,5.88
1135,5.86
1136,5.80
1137,5.72
1138,5.69
1139,5.72
1140,5.79
1141,5.84
1142,5.83
1143,5.76
1144,5.68
1145,5.62
1146,5.61
1147,5.61
1148,5.59
1149,5.51
1150,5.39
1151,5.26
1152,5.18
1153,5.14
1154,5.14
1155,5.15
1156,5.15
1157,5.12
1158,5.05
1159,4.99
1160,4.97
1161,5.00
1162,5.08
1163,5.15
1164,5.19
1165,5.19
1166,5.15
1167,5.09
1168,5.05
1169,5.04
1170,5.08
1171,5.12
1172,5.16
1173,5.18
1174,5.20
1175,5.25
1176,5.33
1177,5.42
1178,5.49
1179,5.52
1180,5.54
1181,5.54
1182,5.58
1183,5.64
1184,5.72
1185,5.78
1186,5.81
1187,5.82
1188,5.84
1189,5.90
1190,5.99
1191,6.06
1192,6.09
1193,6.08
1194,6.07
1195,6.06
1196,6.09
1197,6.14
1198,6.20
1199,6.24
1200,6.28
1201,6.30
1202,6.29
1203,6.25
1204,6.18
1205,6.10
1206,6.01
1207,5.95
1208,5.94
1209,5.96
1210,6.01
1211,6.08
1212,6.13
1213,6.14
1214,6.10
1215,6.01
1216,5.91
1217,5.85
1218,5.87
1219,5.95
1220,6.07
1221,6.15
1222,6.17
1223,6.13
1224,6.06
1225,6.00
1226,5.97
1227,5.95
1228,5.93
1229,5.89
1230,5.84
1231,5.79
1232,5.76
1233,5.74
1234,5.73
1235,5.70
1236,5.67
1237,5.64
1238,5.62
1239,5.62
1240,5.62
1241,5.63
1242,5.62
1243,5.63
1244,5.64
1245,5.65
1246,5.65
1247,5.61
1248,5.53
1249,5.45
1250,5.38
1251,5.36
1252,5.40
1253,5.48
1254,5.59
1255,5.72
1256,5.83
1257,5.89
1258,5.87
1259,5.76
1260,5.59
1261,5.45
1262,5.36
1263,5.36
1264,5.40
1265,5.44
1266,5.46
1267,5.44
1268,5.41
1269,5.40
1270,5.40
1271,5.43
1272,5.44
1273,5.42
1274,5.39
1275,5.36
1276,5.35
1277,5.34
1278,5.33
1279,5.32
1280,5.28
1281,5.22
1282,5.13
1283,5.02
1284,4.92
1285,4.86
1286,4.86
1287,4.91
1288,4.98
1289,5.04
1290,5.09
1291,5.11
1292,5.13
1293,5.13
1294,5.11
1295,5.08
1296,5.03
1297,5.00
1298,4.98
1299,5.00
1300,5.04
1301,5.08
1302,5.13
1303,5.15
1304,5.16
1305,5.14
1306,5.09
1307,5.04
1308,5.00
1309,4.99
1310,5.02
1311,5.05
1312,5.06
1313,5.05
1314,5.05
1315,5.10
1316,5.20
1317,5.32
1318,5.40
1319,5.40
1320,5.33
1321,5.25
1322,5.20
1323,5.22
1324,5.26
1325,5.28
1326,5.26
1327,5.21
1328,5.17
1329,5.18
1330,5.21
1331,5.23
1332,5.18
1333,5.08
1334,4.97
1335,4.89
1336,4.88
1337,4.90
1338,4.92
1339,4.88
1340,4.79
1341,4.72
1342,4.70
1343,4.72
1344,4.76
1345,4.77
1346,4.70
1347,4.59
1348,4.50
1349,4.47
1350,4.51
1351,4.59
1352,4.63
1353,4.62
1354,4.58
1355,4.56
1356,4.60
1357,4.70
1358,4.82
1359,4.89
1360,4.86
1361,4.75
1362,4.65
1363,4.64
1364,4.73
1365,4.87
1366,4.99
1367,5.02
1368,4.98
1369,4.94
1370,4.97
1371,5.09
1372,5.24
1373,5.34
1374,5.38
1375,5.36
1376,5.35
1377,5.41
1378,5.53
1379,5.65
1380,5.71
1381,5.68
1382,5.60
1383,5.55
1384,5.59
1385,5.73
1386,5.90
1387,6.01
1388,6.03
1389,5.99
1390,5.96
1391,6.00
1392,6.13
1393,6.26
1394,6.33
1395,6.29
1396,6.19
1397,6.12
1398,6.12
1399,6.16
1400,6.16
1401,6.07
1402,5.90
1403,5.73
1404,5.67
1405,5.73
1406,5.87
1407,5.99
1408,6.03
1409,5.97
1410,5.87
1411,5.78
1412,5.74
1413,5.77
1414,5.82
1415,5.87
1416,5.89
1417,5.86
1418,5.80
1419,5.73
1420,5.69
1421,5.71
1422,5.73
1423,5.72
1424,5.64
1425,5.54
1426,5.46
1427,5.44
1428,5.47
1429,5.52
1430,5.56
1431,5.60
1432,5.65
1433,5.73
1434,5.83
1435,5.90
1436,5.92
1437,5.89
1438,5.80
1439,5.69
1440,5.58
1441,5.51
1442,5.50
1443,5.55
1444,5.63
1445,5.70
1446,5.71
1447,5.67
1448,5.59
1449,5.53
1450,5.52
1451,5.55
1452,5.59
1453,5.61
1454,5.57
1455,5.49
1456,5.40
1457,5.33
1458,5.29
1459,5.29
1460,5.29
1461,5.27
1462,5.20
1463,5.09
1464,4.95
1465,4.84
1466,4.77
1467,4.77
1468,4.82
1469,4.88
1470,4.90
1471,4.87
1472,4.78
1473,4.68
1474,4.61
1475,4.61
1476,4.67
1477,4.75
1478,4.79
1479,4.76
1480,4.67
1481,4.58
1482,4.52
1483,4.53
1484,4.56
1485,4.58
1486,4.57
1487,4.53
1488,4.51
1489,4.54
1490,4.60
1491,4.65
1492,4.65
1493,4.61
1494,4.56
1495,4.52
1496,4.51
1497,4.51
1498,4.49
1499,4.45
1500,4.40
1501,4.34
1502,4.27
1503,4.20
1504,4.15
1505,4.17
1506,4.27
1507,4.41
1508,4.51
1509,4.52
1510,4.46
1511,4.38
1512,4.37
1513,4.45
1514,4.57
1515,4.66
1516,4.68
1517,4.62
1518,4.54
1519,4.46
1520,4.39
1521,4.33
1522,4.29
1523,4.31
1524,4.40
1525,4.56
1526,4.71
1527,4.79
1528,4.79
1529,4.75
1530,4.73
1531,4.76
1532,4.82
1533,4.86
1534,4.82
1535,4.72
1536,4.61
1537,4.55
1538,4.56
1539,4.63
1540,4.71
1541,4.77
1542,4.80
1543,4.80
1544,4.79
1545,4.77
1546,4.75
1547,4.74
1548,4.74
1549,4.77
1550,4.81
1551,4.88
1552,4.97
1553,5.06
1554,5.14
1555,5.18
1556,5.16
1557,5.10
1558,5.03
1559,4.97
1560,4.97
1561,5.01
1562,5.08
1563,5.14
1564,5.18
1565,5.18
1566,5.17
1567,5.17
1568,5.18
1569,5.20
1570,5.22
1571,5.21
1572,5.17
1573,5.11
1574,5.05
1575,4.99
1576,4.95
1577,4.95
1578,4.99
1579,5.06
1580,5.13
1581,5.17
1582,5.16
1583,5.13
1584,5.11
1585,5.12
1586,5.18
1587,5.25
1588,5.30
1589,5.33
1590,5.35
1591,5.37
1592,5.41
1593,5.47
1594,5.53
1595,5.55
1596,5.52
1597,5.47
1598,5.41
1599,5.39
1600,5.40
1601,5.45
1602,5.52
1603,5.61
1604,5.70
1605,5.76
1606,5.79
1607,5.75
1608,5.69
1609,5.65
1610,5.63
1611,5.64
1612,5.64
1613,5.61
1614,5.55
1615,5.51
1616,5.50
1617,5.50
1618,5.48
1619,5.42
1620,5.31
1621,5.20
1622,5.12
1623,5.09
1624,5.09
1625,5.08
1626,5.05
1627,4.99
1628,4.90
1629,4.82
1630,4.77
1631,4.76
1632,4.79
1633,4.83
1634,4.86
1635,4.86
1636,4.81
1637,4.72
1638,4.61
1639,4.51
1640,4.46
1641,4.48
1642,4.55
1643,4.65
1644,4.74
1645,4.79
1646,4.80
1647,4.77
1648,4.75
1649,4.76
1650,4.85
1651,4.97
1652,5.08
1653,5.11
1654,5.07
1655,4.96
1656,4.83
1657,4.75
1658,4.72
1659,4.74
1660,4.76
1661,4.77
1662,4.75
1663,4.70
1664,4.66
1665,4.63
1666,4.62
1667,4.64
1668,4.67
1669,4.69
1670,4.70
1671,4.70
1672,4.69
1673,4.73
1674,4.82
1675,4.93
1676,5.04
1677,5.08
1678,5.04
1679,4.97
1680,4.91
1681,4.89
1682,4.88
1683,4.89
1684,4.89
1685,4.87
1686,4.87
1687,4.86
1688,4.86
1689,4.84
1690,4.80
1691,4.76
1692,4.72
1693,4.67
1694,4.61
1695,4.56
1696,4.51
1697,4.49
1698,4.50
1699,4.54
1700,4.58
1701,4.61
1702,4.60
1703,4.58
1704,4.53
1705,4.48
1706,4.43
1707,4.41
1708,4.42
1709,4.46
1710,4.50
1711,4.47
1712,4.39
1713,4.28
1714,4.20
1715,4.19
1716,4.25
1717,4.35
1718,4.41
1719,4.44
1720,4.44
1721,4.47
1722,4.57
1723,4.69
1724,4.79
1725,4.81
1726,4.75
1727,4.66
1728,4.63
1729,4.67
1730,4.75
1731,4.82
1732,4.84
1733,4.83
1734,4.81
1735,4.82
1736,4.85
1737,4.87
1738,4.87
1739,4.83
1740,4.78
1741,4.73
1742,4.70
1743,4.69
1744,4.70
1745,4.74
1746,4.79
1747,4.83
1748,4.85
1749,4.83
1750,4.78
1751,4.72
1752,4.69
1753,4.69
1754,4.70
1755,4.71
1756,4.72
1757,4.74
1758,4.77
1759,4.79
1760,4.80
1761,4.78
1762,4.73
1763,4.69
1764,4.67
1765,4.69
1766,4.75
1767,4.81
1768,4.85
1769,4.85
1770,4.82
1771,4.79
1772,4.79
1773,4.83
1774,4.87
1775,4.87
1776,4.80
1777,4.68
1778,4.56
1779,4.49
1780,4.49
1781,4.52
1782,4.53
1783,4.48
1784,4.40
1785,4.32
1786,4.31
1787,4.36
1788,4.42
1789,4.45
1790,4.40
1791,4.32
1792,4.26
1793,4.28
1794,4.39
1795,4.50
1796,4.56
1797,4.53
1798,4.42
1799,4.27
1800,4.16
1801,4.09
1802,4.08
1803,4.10
1804,4.12
1805,4.13
1806,4.14
1807,4.17
1808,4.21
1809,4.24
1810,4.26
1811,4.25
1812,4.23
1813,4.20
1814,4.18
1815,4.17
1816,4.17
1817,4.19
1818,4.21
1819,4.26
1820,4.31
1821,4.34
1822,4.35
1823,4.32
1824,4.26
1825,4.21
1826,4.19
1827,4.18
1828,4.14
1829,4.06
1830,3.95
1831,3.85
1832,3.79
1833,3.81
1834,3.88
1835,3.97
1836,4.03
1837,4.06
1838,4.06
1839,4.06
1840,4.09
1841,4.13
1842,4.14
1843,4.11
1844,4.03
1845,3.94
1846,3.89
1847,3.92
1848,4.00
1849,4.10
1850,4.15
1851,4.14
1852,4.07
1853,4.02
1854,3.99
1855,3.99
1856,4.01
1857,4.01
1858,3.98
1859,3.93
1860,3.88
1861,3.82
1862,3.75
1863,3.67
1864,3.61
1865,3.57
1866,3.54
1867,3.50
1868,3.44
1869,3.38
1870,3.37
1871,3.41
1872,3.48
1873,3.55
1874,3.57
1875,3.54
1876,3.46
1877,3.38
1878,3.32
1879,3.28
1880,3.27
1881,3.30
1882,3.34
1883,3.38
1884,3.39
1885,3.33
1886,3.23
1887,3.15
1888,3.13
1889,3.19
1890,3.26
1891,3.30
1892,3.27
1893,3.19
1894,3.11
1895,3.08
1896,3.11
1897,3.16
1898,3.18
1899,3.15
1900,3.08
1901,3.05
1902,3.08
1903,3.17
1904,3.27
1905,3.32
1906,3.29
1907,3.21
1908,3.12
1909,3.06
1910,3.05
1911,3.07
1912,3.09
1913,3.12
1914,3.15
1915,3.19
1916,3.23
1917,3.26
1918,3.26
1919,3.24
1920,3.20
1921,3.12
1922,3.03
1923,2.93
1924,2.85
1925,2.84
1926,2.88
1927,2.97
1928,3.05
1929,3.08
1930,3.05
1931,2.98
1932,2.91
1933,2.86
1934,2.84
1935,2.85
1936,2.87
1937,2.89
1938,2.93
1939,2.97
1940,2.99
1941,2.95
1942,2.88
1943,2.79
1944,2.73
1945,2.73
1946,2.78
1947,2.85
1948,2.92
1949,2.99
1950,3.04
1951,3.09
1952,3.13
1953,3.15
1954,3.17
1955,3.20
1956,3.26
1957,3.34
1958,3.42
1959,3.48
1960,3.51
1961,3.52
1962,3.56
1963,3.61
1964,3.67
1965,3.71
1966,3.74
1967,3.73
1968,3.74
1969,3.74
1970,3.76
1971,3.74
1972,3.70
1973,3.65
1974,3.62
1975,3.63
1976,3.68
1977,3.75
1978,3.81
1979,3.84
1980,3.85
1981,3.85
1982,3.86
1983,3.87
1984,3.87
1985,3.86
1986,3.84
1987,3.81
1988,3.78
1989,3.77
1990,3.78
1991,3.80
1992,3.81
1993,3.81
1994,3.78
1995,3.74
1996,3.71
1997,3.72
1998,3.73
1999,3.73
2000,3.68
2001,3.60
2002,3.51
2003,3.45
2004,3.38
2005,3.31
2006,3.23
2007,3.17
2008,3.16
2009,3.23
2010,3.32
2011,3.37
2012,3.29
2013,3.10
2014,2.88
2015,2.73
2016,2.71
2017,2.79
2018,2.91
2019,2.98
2020,2.97
2021,2.91
2022,2.85
2023,2.82
2024,2.82
2025,2.82
2026,2.80
2027,2.75
2028,2.70
2029,2.68
2030,2.67
2031,2.70
2032,2.74
2033,2.80
2034,2.86
2035,2.91
2036,2.93
2037,2.90
2038,2.84
2039,2.75
2040,2.68
2041,2.66
2042,2.66
2043,2.68
2044,2.67
2045,2.65
2046,2.66
2047,2.71
2048,2.79
2049,2.87
2050,2.87
2051,2.82
2052,2.73
2053,2.67
2054,2.64
2055,2.62
2056,2.55
2057,2.46
2058,2.38
2059,2.38
2060,2.46
2061,2.58
2062,2.66
2063,2.66
2064,2.58
2065,2.51
2066,2.50
2067,2.56
2068,2.65
2069,2.70
2070,2.71
2071,2.71
2072,2.75
2073,2.84
2074,2.95
2075,3.02
2076,3.02
2077,2.95
2078,2.89
2079,2.90
2080,3.02
2081,3.19
2082,3.31
2083,3.35
2084,3.29
2085,3.20
2086,3.16
2087,3.17
2088,3.20
2089,3.18
2090,3.10
2091,3.00
2092,2.94
2093,2.94
2094,2.98
2095,3.00
2096,2.98
2097,2.94
2098,2.94
2099,3.02
2100,3.15
2101,3.28
2102,3.36
2103,3.35
2104,3.30
2105,3.24
2106,3.20
2107,3.17
2108,3.16
2109,3.14
2110,3.13
2111,3.12
2112,3.11
2113,3.08
2114,3.04
2115,3.01
2116,3.03
2117,3.10
2118,3.19
2119,3.24
2120,3.25
2121,3.23
2122,3.22
2123,3.26
2124,3.32
2125,3.35
2126,3.30
2127,3.19
2128,3.10
2129,3.11
2130,3.23
2131,3.39
2132,3.53
2133,3.60
2134,3.60
2135,3.59
2136,3.61
2137,3.70
2138,3.81
2139,3.91
2140,3.96
2141,3.95
2142,3.91
2143,3.87
2144,3.84
2145,3.81
2146,3.80
2147,3.81
2148,3.84
2149,3.88
2150,3.90
2151,3.90
2152,3.90
2153,3.93
2154,4.01
2155,4.10
2156,4.16
2157,4.16
2158,4.10
2159,3.99
2160,3.87
2161,3.79
2162,3.75
2163,3.74
2164,3.74
2165,3.72
2166,3.67
2167,3.63
2168,3.59
2169,3.56
2170,3.53
2171,3.50
2172,3.46
2173,3.43
2174,3.42
2175,3.44
2176,3.44
2177,3.38
2178,3.26
2179,3.11
2180,3.02
2181,3.01
2182,3.09
2183,3.17
2184,3.20
2185,3.15
2186,3.05
2187,2.94
2188,2.90
2189,2.91
2190,2.93
2191,2.94
2192,2.94
2193,2.98
2194,3.09
2195,3.24
2196,3.40
2197,3.49
2198,3.51
2199,3.48
2200,3.44
2201,3.43
2202,3.46
2203,3.51
2204,3.55
2205,3.55
2206,3.51
2207,3.47
2208,3.46
2209,3.48
2210,3.49
2211,3.48
2212,3.44
2213,3.38
2214,3.35
2215,3.36
2216,3.38
2217,3.39
2218,3.36
2219,3.28
2220,3.17
2221,3.07
2222,2.99
2223,2.95
2224,2.94
2225,2.93
2226,2.90
2227,2.84
2228,2.76
2229,2.69
2230,2.61
2231,2.55
2232,2.52
2233,2.51
2234,2.50
2235,2.45
2236,2.37
2237,2.25
2238,2.13
2239,2.03
2240,1.97
2241,1.97
2242,1.98
2243,2.00
2244,1.99
2245,1.98
2246,1.99
2247,2.03
2248,2.08
2249,2.10
2250,2.08
2251,2.02
2252,1.96
2253,1.95
2254,2.00
2255,2.07
2256,2.12
2257,2.12
2258,2.09
2259,2.09
2260,2.15
2261,2.28
2262,2.44
2263,2.58
2264,2.68
2265,2.74
2266,2.80
2267,2.86
2268,2.92
2269,2.95
2270,2.98
2271,3.00
2272,3.07
2273,3.16
2274,3.24
2275,3.27
2276,3.27
2277,3.22
2278,3.17
2279,3.15
2280,3.14
2281,3.14
2282,3.14
2283,3.14
2284,3.15
2285,3.17
2286,3.21
2287,3.26
2288,3.29
2289,3.31
2290,3.32
2291,3.34
2292,3.36
2293,3.38
2294,3.40
2295,3.40
2296,3.36
2297,3.32
2298,3.29
2299,3.32
2300,3.41
2301,3.54
2302,3.66
2303,3.69
2304,3.59
2305,3.41
2306,3.22
2307,3.10
2308,3.10
2309,3.19
2310,3.28
2311,3.32
2312,3.30
2313,3.24
2314,3.18
2315,3.13
2316,3.08
2317,3.02
2318,2.94
2319,2.89
2320,2.86
2321,2.85
2322,2.85
2323,2.84
2324,2.81
2325,2.78
2326,2.76
2327,2.76
2328,2.75
2329,2.73
2330,2.68
2331,2.64
2332,2.64
2333,2.67
2334,2.74
2335,2.79
2336,2.81
2337,2.78
2338,2.70
2339,2.61
2340,2.54
2341,2.52
2342,2.57
2343,2.64
2344,2.71
2345,2.74
2346,2.73
2347,2.69
2348,2.66
2349,2.68
2350,2.74
2351,2.83
2352,2.90
2353,2.94
2354,2.94
2355,2.91
2356,2.87
2357,2.83
2358,2.78
2359,2.75
2360,2.75
2361,2.79
2362,2.87
2363,2.94
2364,2.98
2365,2.98
2366,2.93
2367,2.84
2368,2.74
2369,2.64
2370,2.58
2371,2.57
2372,2.59
2373,2.59
2374,2.56
2375,2.49
2376,2.43
2377,2.41
2378,2.44
2379,2.47
2380,2.48
2381,2.44
2382,2.37
2383,2.29
2384,2.22
2385,2.17
2386,2.11
2387,2.08
2388,2.08
2389,2.12
2390,2.20
2391,2.25
2392,2.24
2393,2.14
2394,2.01
2395,1.93
2396,1.94
2397,2.04
2398,2.17
2399,2.25
2400,2.26
2401,2.22
2402,2.16
2403,2.10
2404,2.05
2405,2.01
2406,2.01
2407,2.06
2408,2.17
2409,2.29
2410,2.37
2411,2.35
2412,2.26
2413,2.15
2414,2.08
2415,2.08
2416,2.11
2417,2.14
2418,2.12
2419,2.05
2420,2.00
2421,2.01
2422,2.10
2423,2.24
2424,2.35
2425,2.40
2426,2.37
2427,2.29
2428,2.21
2429,2.15
2430,2.12
2431,2.09
2432,2.04
2433,1.96
2434,1.90
2435,1.90
2436,1.94
2437,2.00
2438,2.01
2439,1.97
2440,1.91
2441,1.89
2442,1.93
2443,1.99
2444,2.03
2445,1.98
2446,1.86
2447,1.75
2448,1.70
2449,1.72
2450,1.78
2451,1.79
2452,1.73
2453,1.63
2454,1.55
2455,1.54
2456,1.58
2457,1.61
2458,1.60
2459,1.55
2460,1.50
2461,1.49
2462,1.53
2463,1.58
2464,1.58
2465,1.52
2466,1.44
2467,1.39
2468,1.42
2469,1.49
2470,1.57
2471,1.61
2472,1.61
2473,1.59
2474,1.60
2475,1.64
2476,1.72
2477,1.79
2478,1.83
2479,1.84
2480,1.85
2481,1.86
2482,1.89
2483,1.93
2484,2.00
2485,2.04
2486,2.07
2487,2.07
2488,2.06
2489,2.04
2490,2.03
2491,2.04
2492,2.07
2493,2.09
2494,2.12
2495,2.15
2496,2.18
2497,2.18
2498,2.14
2499,2.08
2500,2.01
2501,1.98
2502,2.01
2503,2.08
2504,2.13
2505,2.11
2506,2.01
2507,1.90
2508,1.82
2509,1.82
2510,1.87
2511,1.93
2512,1.93
2513,1.87
2514,1.78
2515,1.70
2516,1.67
2517,1.67
2518,1.68
2519,1.68
2520,1.68
2521,1.70
2522,1.74
2523,1.79
2524,1.81
2525,1.78
2526,1.71
2527,1.65
2528,1.64
2529,1.68
2530,1.75
2531,1.82
2532,1.86
2533,1.86
2534,1.83
2535,1.82
2536,1.84
2537,1.90
2538,1.97
2539,2.02
2540,2.02
2541,1.97
2542,1.91
2543,1.87
2544,1.87
2545,1.90
2546,1.93
2547,1.93
2548,1.88
2549,1.82
2550,1.80
2551,1.82
2552,1.91
2553,2.01
2554,2.09
2555,2.12
2556,2.09
2557,2.03
2558,1.99
2559,1.98
2560,2.00
2561,2.04
2562,2.05
2563,2.03
2564,1.97
2565,1.88
2566,1.81
2567,1.78
2568,1.79
2569,1.83
2570,1.85
2571,1.82
2572,1.75
2573,1.66
2574,1.61
2575,1.59
2576,1.59
2577,1.58
2578,1.53
2579,1.47
2580,1.43
2581,1.43
2582,1.48
2583,1.54
2584,1.54
2585,1.50
2586,1.42
2587,1.36
2588,1.35
2589,1.39
2590,1.44
2591,1.46
2592,1.45
2593,1.41
2594,1.38
2595,1.39
2596,1.46
2597,1.55
2598,1.64
2599,1.71
2600,1.73
2601,1.73
2602,1.72
2603,1.70
2604,1.69
2605,1.68
2606,1.68
2607,1.71
2608,1.74
2609,1.78
2610,1.82
2611,1.85
2612,1.91
2613,1.98
2614,2.09
2615,2.20
2616,2.29
2617,2.34
2618,2.31
2619,2.23
2620,2.14
2621,2.09
2622,2.13
2623,2.22
2624,2.31
2625,2.36
2626,2.33
2627,2.25
2628,2.17
2629,2.12
2630,2.09
2631,2.08
2632,2.06
2633,2.07
2634,2.10
2635,2.15
2636,2.21
2637,2.22
2638,2.19
2639,2.10
2640,2.02
2641,1.98
2642,1.98
2643,1.99
2644,1.96
2645,1.90
2646,1.82
2647,1.80
2648,1.86
2649,1.98
2650,2.10
2651,2.17
2652,2.15
2653,2.06
2654,1.94
2655,1.86
2656,1.85
2657,1.89
2658,1.94
2659,1.97
2660,1.96
2661,1.91
2662,1.88
2663,1.87
2664,1.88
2665,1.90
2666,1.90
2667,1.90
2668,1.90
2669,1.90
2670,1.92
2671,1.93
2672,1.91
2673,1.87
2674,1.82
2675,1.80
2676,1.83
2677,1.91
2678,2.00
2679,2.05
2680,2.04
2681,2.00
2682,1.93
2683,1.87
2684,1.85
2685,1.86
2686,1.86
2687,1.82
2688,1.72
2689,1.60
2690,1.49
2691,1.44
2692,1.47
2693,1.54
2694,1.62
2695,1.67
2696,1.68
2697,1.65
2698,1.63
2699,1.62
2700,1.63
2701,1.65
2702,1.67
2703,1.68
2704,1.66
2705,1.61
2706,1.54
2707,1.48
2708,1.45
2709,1.43
2710,1.40
2711,1.36
2712,1.30
2713,1.26
2714,1.25
2715,1.27
2716,1.31
2717,1.34
2718,1.36
2719,1.37
2720,1.38
2721,1.40
2722,1.40
2723,1.37
2724,1.32
2725,1.28
2726,1.26
2727,1.27
2728,1.31
2729,1.36
2730,1.42
2731,1.48
2732,1.51
2733,1.50
2734,1.46
2735,1.40
2736,1.35
2737,1.35
2738,1.37
2739,1.39
2740,1.39
2741,1.36
2742,1.34
2743,1.35
2744,1.39
2745,1.45
2746,1.49
2747,1.50
2748,1.51
2749,1.55
2750,1.63
2751,1.73
2752,1.82
2753,1.88
2754,1.91
2755,1.95
2756,1.99
2757,2.06
2758,2.15
2759,2.23
2760,2.31
2761,2.35
2762,2.37
2763,2.36
2764,2.33
2765,2.29
2766,2.26
2767,2.24
2768,2.26
2769,2.29
2770,2.32
2771,2.31
2772,2.25
2773,2.16
2774,2.08
2775,2.04
2776,2.06
2777,2.08
2778,2.04
2779,1.93
2780,1.75
2781,1.61
2782,1.54
2783,1.54
2784,1.58
2785,1.60
2786,1.54
2787,1.44
2788,1.35
2789,1.32
2790,1.33
2791,1.36
2792,1.36
2793,1.34
2794,1.32
2795,1.32
2796,1.33
2797,1.34
2798,1.33
2799,1.30
2800,1.24
2801,1.19
2802,1.16
2803,1.16
2804,1.18
2805,1.23
2806,1.30
2807,1.37
2808,1.43
2809,1.47
2810,1.50
2811,1.51
2812,1.52
2813,1.53
2814,1.54
2815,1.54
2816,1.55
2817,1.58
2818,1.66
2819,1.77
2820,1.87
2821,1.92
2822,1.88
2823,1.80
2824,1.74
2825,1.73
2826,1.78
2827,1.85
2828,1.89
2829,1.88
2830,1.84
2831,1.79
2832,1.79
2833,1.82
2834,1.86
2835,1.91
2836,1.94
2837,1.97
2838,1.97
2839,1.97
2840,1.95
2841,1.93
2842,1.91
2843,1.90
2844,1.90
2845,1.92
2846,1.93
2847,1.90
2848,1.85
2849,1.77
2850,1.69
2851,1.61
2852,1.53
2853,1.46
2854,1.41
2855,1.38
2856,1.36
2857,1.35
2858,1.32
2859,1.28
2860,1.26
2861,1.28
2862,1.34
2863,1.40
2864,1.43
2865,1.40
2866,1.33
2867,1.25
2868,1.21
2869,1.21
2870,1.26
2871,1.31
2872,1.33
2873,1.32
2874,1.27
2875,1.22
2876,1.20
2877,1.22
2878,1.28
2879,1.36
2880,1.43
2881,1.45
2882,1.39
2883,1.27
2884,1.14
2885,1.08
2886,1.07
2887,1.10
2888,1.13
2889,1.13
2890,1.12
2891,1.11
2892,1.13
2893,1.15
2894,1.16
2895,1.14
2896,1.10
2897,1.07
2898,1.06
2899,1.10
2900,1.15
2901,1.18
2902,1.17
2903,1.11
2904,1.04
2905,1.01
2906,1.02
2907,1.07
2908,1.11
2909,1.10
2910,1.06
2911,0.98
2912,0.92
2913,0.92
2914,1.00
2915,1.13
2916,1.25
2917,1.33
2918,1.35
2919,1.33
2920,1.30
2921,1.26
2922,1.22
2923,1.16
2924,1.07
2925,1.01
2926,0.99
2927,1.06
2928,1.17
2929,1.26
2930,1.27
2931,1.16
2932,0.97
2933,0.81
2934,0.74
2935,0.75
2936,0.80
2937,0.82
2938,0.80
2939,0.77
2940,0.78
2941,0.84
2942,0.94
2943,1.01
2944,1.02
2945,0.97
2946,0.89
2947,0.82
2948,0.80
2949,0.82
2950,0.87
2951,0.91
2952,0.90
2953,0.85
2954,0.78
2955,0.75
2956,0.78
2957,0.87
2958,0.96
2959,0.98
2960,0.92
2961,0.83
2962,0.78
2963,0.81
2964,0.89
2965,0.97
2966,1.02
2967,1.03
2968,1.03
2969,1.04
2970,1.09
2971,1.13
2972,1.14
2973,1.13
2974,1.10
2975,1.09
2976,1.12
2977,1.16
2978,1.18
2979,1.17
2980,1.14
2981,1.11
2982,1.11
2983,1.16
2984,1.21
2985,1.25
2986,1.25
2987,1.24
2988,1.23
2989,1.26
2990,1.30
2991,1.35
2992,1.35
2993,1.32
2994,1.26
2995,1.22
2996,1.22
2997,1.27
2998,1.36
2999,1.47
3000,1.57
3001,1.64
3002,1.68
3003,1.68
3004,1.65
3005,1.62
3006,1.59
3007,1.60
3008,1.62
3009,1.64
3010,1.64
3011,1.61
3012,1.56
3013,1.50
3014,1.46
3015,1.43
3016,1.42
3017,1.42
3018,1.43
3019,1.47
3020,1.51
3021,1.55
3022,1.56
3023,1.54
3024,1.49
3025,1.43
3026,1.38
3027,1.34
3028,1.31
3029,1.28
3030,1.24
3031,1.18
3032,1.14
3033,1.12
3034,1.15
3035,1.21
3036,1.26
3037,1.27
3038,1.23
3039,1.15
3040,1.09
3041,1.08
3042,1.13
3043,1.19
3044,1.23
3045,1.23
3046,1.21
3047,1.21
3048,1.25
3049,1.32
3050,1.38
3051,1.39
3052,1.33
3053,1.24
3054,1.15
3055,1.14
3056,1.20
3057,1.31
3058,1.42
3059,1.45
3060,1.41
3061,1.32
3062,1.25
3063,1.25
3064,1.33
3065,1.44
3066,1.53
3067,1.55
3068,1.53
3069,1.51
3070,1.53
3071,1.57
3072,1.62
3073,1.64
3074,1.63
3075,1.60
3076,1.59
3077,1.61
3078,1.65
3079,1.68
3080,1.69
3081,1.71
3082,1.74
3083,1.79
3084,1.81
3085,1.81
3086,1.79
3087,1.78
3088,1.83
3089,1.90
3090,1.97
3091,1.98
3092,1.94
3093,1.90
3094,1.91
3095,1.96
3096,2.00
3097,1.98
3098,1.90
3099,1.82
3100,1.79
3101,1.85
3102,1.96
3103,2.06
3104,2.11
3105,2.09
3106,2.06
3107,2.05
3108,2.05
3109,2.05
3110,2.03
3111,1.98
3112,1.93
3113,1.91
3114,1.93
3115,1.98
3116,2.04
3117,2.11
3118,2.19
3119,2.26
3120,2.31
3121,2.31
3122,2.26
3123,2.19
3124,2.15
3125,2.15
3126,2.20
3127,2.27
3128,2.33
3129,2.37
3130,2.41
3131,2.44
3132,2.45
3133,2.42
3134,2.33
3135,2.19
3136,2.08
3137,2.04
3138,2.08
3139,2.15
3140,2.20
3141,2.17
3142,2.10
3143,2.05
3144,2.06
3145,2.15
3146,2.24
3147,2.28
3148,2.25
3149,2.17
3150,2.13
3151,2.13
3152,2.16
3153,2.15
3154,2.07
3155,1.95
3156,1.87
3157,1.89
3158,2.00
3159,2.12
3160,2.16
3161,2.10
3162,1.99
3163,1.90
3164,1.89
3165,1.94
3166,1.99
3167,1.99
3168,1.94
3169,1.90
3170,1.92
3171,2.00
3172,2.09
3173,2.14
3174,2.12
3175,2.08
3176,2.07
3177,2.11
3178,2.16
3179,2.16
3180,2.08
3181,1.95
3182,1.85
3183,1.84
3184,1.92
3185,2.01
3186,2.03
3187,1.96
3188,1.84
3189,1.74
3190,1.72
3191,1.77
3192,1.84
3193,1.88
3194,1.87
3195,1.84
3196,1.81
3197,1.79
3198,1.79
3199,1.79
3200,1.76
3201,1.72
3202,1.68
3203,1.65
3204,1.66
3205,1.71
3206,1.77
3207,1.80
3208,1.78
3209,1.71
3210,1.64
3211,1.63
3212,1.70
3213,1.82
3214,1.93
3215,1.97
3216,1.93
3217,1.84
3218,1.77
3219,1.75
3220,1.79
3221,1.87
3222,1.95
3223,2.03
3224,2.09
3225,2.12
3226,2.11
3227,2.07
3228,1.99
3229,1.95
3230,1.96
3231,2.05
3232,2.17
3233,2.25
3234,2.25
3235,2.17
3236,2.06
3237,1.97
3238,1.92
3239,1.89
3240,1.84
3241,1.79
3242,1.74
3243,1.73
3244,1.76
3245,1.81
3246,1.84
3247,1.85
3248,1.86
3249,1.89
3250,1.93
3251,1.97
3252,1.96
3253,1.91
3254,1.85
3255,1.83
3256,1.89
3257,2.01
3258,2.12
3259,2.17
3260,2.14
3261,2.08
3262,2.05
3263,2.08
3264,2.14
3265,2.18
3266,2.15
3267,2.05
3268,1.95
3269,1.91
3270,1.95
3271,2.03
3272,2.08
3273,2.04
3274,1.94
3275,1.85
3276,1.82
3277,1.87
3278,1.96
3279,2.05
3280,2.12
3281,2.16
3282,2.21
3283,2.24
3284,2.23
3285,2.18
3286,2.08
3287,2.02
3288,2.03
3289,2.11
3290,2.24
3291,2.33
3292,2.35
3293,2.29
3294,2.21
3295,2.14
3296,2.11
3297,2.11
3298,2.10
3299,2.09
3300,2.09
3301,2.11
3302,2.15
3303,2.19
3304,2.19
3305,2.13
3306,2.05
3307,1.98
3308,1.94
3309,1.93
3310,1.90
3311,1.84
3312,1.76
3313,1.68
3314,1.61
3315,1.56
3316,1.53
3317,1.52
3318,1.53
3319,1.57
3320,1.64
3321,1.72
3322,1.75
3323,1.71
3324,1.62
3325,1.54
3326,1.52
3327,1.57
3328,1.65
3329,1.67
3330,1.59
3331,1.44
3332,1.29
3333,1.19
3334,1.19
3335,1.26
3336,1.34
3337,1.39
3338,1.38
3339,1.33
3340,1.26
3341,1.21
3342,1.19
3343,1.21
3344,1.26
3345,1.31
3346,1.34
3347,1.34
3348,1.34
3349,1.34
3350,1.36
3351,1.40
3352,1.45
3353,1.48
3354,1.48
3355,1.46
3356,1.44
3357,1.42
3358,1.40
3359,1.36
3360,1.29
3361,1.22
3362,1.17
3363,1.16
3364,1.20
3365,1.27
3366,1.32
3367,1.33
3368,1.30
3369,1.26
3370,1.25
3371,1.31
3372,1.37
3373,1.41
3374,1.40
3375,1.39
3376,1.40
3377,1.47
3378,1.55
3379,1.58
3380,1.52
3381,1.40
3382,1.28
3383,1.21
3384,1.17
3385,1.16
3386,1.14
3387,1.11
3388,1.08
3389,1.08
3390,1.11
3391,1.14
3392,1.16
3393,1.17
3394,1.18
3395,1.21
3396,1.22
3397,1.20
3398,1.14
3399,1.05
3400,0.99
3401,0.99
3402,1.03
3403,1.07
3404,1.09
3405,1.10
3406,1.12
3407,1.17
3408,1.25
3409,1.29
3410,1.28
3411,1.25
3412,1.23
3413,1.29
3414,1.43
3415,1.60
3416,1.74
3417,1.81
3418,1.82
3419,1.81
3420,1.84
3421,1.92
3422,2.00
3423,2.05
3424,2.05
3425,2.01
3426,1.98
3427,1.99
3428,2.03
3429,2.08
3430,2.11
3431,2.11
3432,2.11
3433,2.11
3434,2.13
3435,2.15
3436,2.15
3437,2.13
3438,2.08
3439,2.03
3440,1.99
3441,2.00
3442,2.04
3443,2.10
3444,2.14
3445,2.15
3446,2.11
3447,2.07
3448,2.05
3449,2.07
3450,2.13
3451,2.20
3452,2.26
3453,2.28
3454,2.28
3455,2.28
3456,2.29
3457,2.31
3458,2.36
3459,2.43
3460,2.49
3461,2.54
3462,2.54
3463,2.50
3464,2.43
3465,2.35
3466,2.29
3467,2.26
3468,2.21
3469,2.14
3470,2.03
3471,1.90
3472,1.80
3473,1.75
3474,1.75
3475,1.76
3476,1.73
3477,1.66
3478,1.58
3479,1.53
3480,1.51
3481,1.52
3482,1.53
3483,1.54
3484,1.55
3485,1.59
3486,1.64
3487,1.69
3488,1.72
3489,1.75
3490,1.80
3491,1.88
3492,1.98
3493,2.06
3494,2.11
3495,2.11
3496,2.12
3497,2.16
3498,2.25
3499,2.38
3500,2.51
3501,2.60
3502,2.64
3503,2.64
3504,2.62
3505,2.59
3506,2.58
3507,2.57
3508,2.58
3509,2.60
3510,2.59
3511,2.57
3512,2.52
3513,2.47
3514,2.45
3515,2.44
3516,2.44
3517,2.40
3518,2.33
3519,2.25
3520,2.17
3521,2.15
3522,2.17
3523,2.21
3524,2.22
3525,2.18
3526,2.08
3527,1.97
3528,1.87
3529,1.81
3530,1.78
3531,1.77
3532,1.75
3533,1.72
3534,1.68
3535,1.66
3536,1.67
3537,1.70
3538,1.74
3539,1.76
3540,1.76
3541,1.74
3542,1.70
3543,1.65
3544,1.58
3545,1.53
3546,1.51
3547,1.53
3548,1.60
3549,1.70
3550,1.79
3551,1.86
3552,1.89
3553,1.90
3554,1.88
3555,1.86
3556,1.82
3557,1.78
3558,1.74
3559,1.74
3560,1.80
3561,1.89
3562,1.97
3563,2.00
3564,1.99
3565,1.97
3566,1.99
3567,2.04
3568,2.12
3569,2.16
3570,2.14
3571,2.07
3572,2.00
3573,1.97
3574,2.01
3575,2.07
3576,2.14
3577,2.18
3578,2.19
3579,2.19
3580,2.20
3581,2.22
3582,2.25
3583,2.28
3584,2.29
3585,2.28
3586,2.28
3587,2.30
3588,2.36
3589,2.42
3590,2.47
3591,2.46
3592,2.42
3593,2.36
3594,2.34
3595,2.35
3596,2.39
3597,2.40
3598,2.36
3599,2.30
3600,2.25
3601,2.22
3602,2.23
3603,2.25
3604,2.27
3605,2.29
3606,2.35
3607,2.44
3608,2.55
3609,2.63
3610,2.67
3611,2.66
3612,2.62
3613,2.59
3614,2.56
3615,2.53
3616,2.48
3617,2.42
3618,2.38
3619,2.36
3620,2.37
3621,2.39
3622,2.40
3623,2.39
3624,2.37
3625,2.37
3626,2.39
3627,2.39
3628,2.35
3629,2.27
3630,2.19
3631,2.13
3632,2.14
3633,2.19
3634,2.26
3635,2.30
3636,2.32
3637,2.31
3638,2.29
3639,2.29
3640,2.28
3641,2.27
3642,2.25
3643,2.22
3644,2.21
3645,2.23
3646,2.27
3647,2.30
3648,2.32
3649,2.30
3650,2.25
3651,2.18
3652,2.11
3653,2.08
3654,2.11
3655,2.17
3656,2.24
3657,2.29
3658,2.32
3659,2.34
3660,2.38
3661,2.44
3662,2.48
3663,2.49
3664,2.44
3665,2.34
3666,2.27
3667,2.28
3668,2.38
3669,2.53
3670,2.64
3671,2.67
3672,2.63
3673,2.59
3674,2.60
3675,2.69
3676,2.82
3677,2.92
3678,2.97
3679,2.96
3680,2.94
3681,2.94
3682,2.96
3683,2.99
3684,3.01
3685,3.01
3686,3.01
3687,3.01
3688,3.01
3689,3.02
3690,3.03
3691,3.06
3692,3.13
3693,3.21
3694,3.25
3695,3.22
3696,3.10
3697,2.93
3698,2.78
3699,2.72
3700,2.75
3701,2.82
3702,2.87
3703,2.84
3704,2.75
3705,2.64
3706,2.61
3707,2.66
3708,2.79
3709,2.91
3710,2.98
3711,2.98
3712,2.94
3713,2.90
3714,2.90
3715,2.95
3716,3.01
3717,3.04
3718,3.03
3719,2.99
3720,2.94
3721,2.92
3722,2.94
3723,3.01
3724,3.10
3725,3.20
3726,3.26
3727,3.27
3728,3.23
3729,3.18
3730,3.15
3731,3.16
3732,3.17
3733,3.17
3734,3.12
3735,3.05
3736,3.02
3737,3.06
3738,3.14
3739,3.22
3740,3.23
3741,3.16
3742,3.05
3743,2.99
3744,3.00
3745,3.06
3746,3.13
3747,3.14
3748,3.12
3749,3.09
3750,3.10
3751,3.11
3752,3.10
3753,3.04
3754,2.94
3755,2.87
3756,2.86
3757,2.90
3758,2.98
3759,3.05
3760,3.10
3761,3.11
3762,3.09
3763,3.05
3764,2.97
3765,2.86
3766,2.76
3767,2.70
3768,2.71
3769,2.75
3770,2.79
3771,2.77
3772,2.71
3773,2.62
3774,2.57
3775,2.58
3776,2.66
3777,2.75
3778,2.81
3779,2.80
3780,2.73
3781,2.63
3782,2.53
3783,2.47
3784,2.47
3785,2.50
3786,2.53
3787,2.54
3788,2.53
3789,2.52
3790,2.52
3791,2.55
3792,2.58
3793,2.58
3794,2.55
3795,2.51
3796,2.48
3797,2.51
3798,2.57
3799,2.65
3800,2.69
3801,2.71
3802,2.69
3803,2.67
3804,2.65
3805,2.62
3806,2.58
3807,2.54
3808,2.51
3809,2.50
3810,2.53
3811,2.56
3812,2.58
3813,2.57
3814,2.55
3815,2.54
3816,2.55
3817,2.56
3818,2.58
3819,2.57
3820,2.56
3821,2.56
3822,2.57
3823,2.58
3824,2.58
3825,2.56
3826,2.52
3827,2.46
3828,2.38
3829,2.30
3830,2.23
3831,2.19
3832,2.22
3833,2.28
3834,2.35
3835,2.40
3836,2.41
3837,2.39
3838,2.40
3839,2.43
3840,2.49
3841,2.52
3842,2.51
3843,2.44
3844,2.36
3845,2.31
3846,2.32
3847,2.40
3848,2.50
3849,2.58
3850,2.63
3851,2.65
3852,2.65
3853,2.65
3854,2.65
3855,2.62
3856,2.56
3857,2.48
3858,2.42
3859,2.40
3860,2.44
3861,2.50
3862,2.52
3863,2.47
3864,2.36
3865,2.23
3866,2.13
3867,2.09
3868,2.09
3869,2.11
3870,2.13
3871,2.15
3872,2.19
3873,2.26
3874,2.34
3875,2.43
3876,2.50
3877,2.55
3878,2.57
3879,2.55
3880,2.48
3881,2.40
3882,2.35
3883,2.36
3884,2.40
3885,2.47
3886,2.50
3887,2.49
3888,2.47
3889,2.48
3890,2.51
3891,2.56
3892,2.58
3893,2.57
3894,2.54
3895,2.53
3896,2.55
3897,2.58
3898,2.58
3899,2.55
3900,2.51
3901,2.49
3902,2.53
3903,2.59
3904,2.64
3905,2.66
3906,2.63
3907,2.58
3908,2.53
3909,2.48
3910,2.42
3911,2.34
3912,2.28
3913,2.26
3914,2.26
3915,2.27
3916,2.24
3917,2.17
3918,2.08
3919,2.03
3920,2.02
3921,2.02
3922,2.00
3923,1.94
3924,1.89
3925,1.87
3926,1.93
3927,2.01
3928,2.08
3929,2.09
3930,2.06
3931,2.03
3932,2.04
3933,2.11
3934,2.20
3935,2.28
3936,2.31
3937,2.30
3938,2.28
3939,2.27
3940,2.29
3941,2.34
3942,2.41
3943,2.48
3944,2.54
3945,2.59
3946,2.63
3947,2.66
3948,2.65
3949,2.60
3950,2.55
3951,2.52
3952,2.53
3953,2.58
3954,2.63
3955,2.66
3956,2.65
3957,2.64
3958,2.66
3959,2.71
3960,2.78
3961,2.83
3962,2.83
3963,2.77
3964,2.67
3965,2.58
3966,2.54
3967,2.56
3968,2.63
3969,2.74
3970,2.83
3971,2.89
3972,2.89
3973,2.85
3974,2.80
3975,2.76
3976,2.75
3977,2.75
3978,2.73
3979,2.69
3980,2.61
3981,2.53
3982,2.48
3983,2.49
3984,2.53
3985,2.57
3986,2.59
3987,2.59
3988,2.58
3989,2.59
3990,2.63
3991,2.69
3992,2.75
3993,2.80
3994,2.82
3995,2.80
3996,2.77
3997,2.75
3998,2.76
3999,2.81
4000,2.88
4001,2.94
4002,2.97
4003,2.97
4004,2.95
4005,2.96
4006,3.00
4007,3.05
4008,3.08
4009,3.07
4010,3.02
4011,2.98
4012,2.97
4013,2.96
4014,2.97
4015,2.98
4016,3.03
4017,3.11
4018,3.21
4019,3.27
4020,3.26
4021,3.19
4022,3.12
4023,3.11
4024,3.20
4025,3.34
4026,3.46
4027,3.51
4028,3.50
4029,3.48
4030,3.49
4031,3.53
4032,3.59
4033,3.64
4034,3.64
4035,3.59
4036,3.52
4037,3.43
4038,3.35
4039,3.31
4040,3.31
4041,3.38
4042,3.47
4043,3.56
4044,3.59
4045,3.56
4046,3.49
4047,3.44
4048,3.43
4049,3.49
4050,3.58
4051,3.64
4052,3.65
4053,3.63
4054,3.62
4055,3.62
4056,3.63
4057,3.62
4058,3.58
4059,3.52
4060,3.47
4061,3.46
4062,3.52
4063,3.59
4064,3.66
4065,3.67
4066,3.64
4067,3.62
4068,3.63
4069,3.68
4070,3.73
4071,3.75
4072,3.72
4073,3.67
4074,3.63
4075,3.64
4076,3.68
4077,3.72
4078,3.74
4079,3.73
4080,3.72
4081,3.74
4082,3.79
4083,3.84
4084,3.85
4085,3.82
4086,3.79
4087,3.78
4088,3.83
4089,3.91
4090,3.95
4091,3.93
4092,3.86
4093,3.78
4094,3.74
4095,3.74
4096,3.78
4097,3.81
4098,3.82
4099,3.82
4100,3.81
4101,3.80
4102,3.79
4103,3.77
4104,3.72
4105,3.67
4106,3.64
4107,3.66
4108,3.70
4109,3.74
4110,3.75
4111,3.72
4112,3.68
4113,3.67
4114,3.70
4115,3.77
4116,3.83
4117,3.85
4118,3.82
4119,3.76
4120,3.71
4121,3.72
4122,3.79
4123,3.88
4124,3.96
4125,3.98
4126,3.96
4127,3.92
4128,3.91
4129,3.94
4130,3.99
4131,4.02
4132,4.01
4133,3.97
4134,3.93
4135,3.92
4136,3.93
4137,3.96
4138,3.96
4139,3.92
4140,3.85
4141,3.80
4142,3.78
4143,3.80
4144,3.83
4145,3.85
4146,3.86
4147,3.85
4148,3.83
4149,3.81
4150,3.79
4151,3.77
4152,3.77
4153,3.78
4154,3.81
4155,3.83
4156,3.85
4157,3.85
4158,3.85
4159,3.85
4160,3.87
4161,3.88
4162,3.91
4163,3.96
4164,4.02
4165,4.09
4166,4.13
4167,4.11
4168,4.02
4169,3.89
4170,3.79
4171,3.75
4172,3.78
4173,3.82
4174,3.84
4175,3.82
4176,3.79
4177,3.79
4178,3.86
4179,3.96
4180,4.04
4181,4.06
4182,4.01
4183,3.95
4184,3.89
4185,3.87
4186,3.87
4187,3.86
4188,3.84
4189,3.80
4190,3.74
4191,3.69
4192,3.66
4193,3.68
4194,3.73
4195,3.78
4196,3.81
4197,3.80
4198,3.75
4199,3.73
4200,3.75
4201,3.81
4202,3.88
4203,3.90
4204,3.86
4205,3.81
4206,3.79
4207,3.85
4208,3.95
4209,4.03
4210,4.06
4211,4.03
4212,4.00
4213,4.03
4214,4.14
4215,4.28
4216,4.39
4217,4.43
4218,4.40
4219,4.34
4220,4.29
4221,4.26
4222,4.23
4223,4.17
4224,4.06
4225,3.93
4226,3.83
4227,3.82
4228,3.90
4229,4.02
4230,4.10
4231,4.12
4232,4.07
4233,4.00
4234,3.94
4235,3.91
4236,3.88
4237,3.83
4238,3.75
4239,3.67
4240,3.64
4241,3.67
4242,3.72
4243,3.75
4244,3.74
4245,3.68
4246,3.63
4247,3.62
4248,3.65
4249,3.69
4250,3.70
4251,3.64
4252,3.52
4253,3.36
4254,3.20
4255,3.08
4256,3.02
4257,3.02
4258,3.07
4259,3.16
4260,3.25
4261,3.33
4262,3.38
4263,3.38
4264,3.31
4265,3.20
4266,3.11
4267,3.09
4268,3.15
4269,3.26
4270,3.34
4271,3.34
4272,3.26
4273,3.16
4274,3.10
4275,3.12
4276,3.19
4277,3.26
4278,3.26
4279,3.19
4280,3.09
4281,3.00
4282,2.97
4283,3.00
4284,3.06
4285,3.11
4286,3.15
4287,3.16
4288,3.13
4289,3.09
4290,3.07
4291,3.06
4292,3.07
4293,3.06
4294,3.03
4295,2.98
4296,2.93
4297,2.94
4298,3.03
4299,3.14
4300,3.23
4301,3.26
4302,3.23
4303,3.18
4304,3.15
4305,3.15
4306,3.15
4307,3.12
4308,3.08
4309,3.05
4310,3.08
4311,3.16
4312,3.27
4313,3.35
4314,3.38
4315,3.35
4316,3.31
4317,3.31
4318,3.34
4319,3.38
4320,3.41
4321,3.40
4322,3.36
4323,3.31
4324,3.27
4325,3.27
4326,3.31
4327,3.39
4328,3.46
4329,3.50
4330,3.50
4331,3.48
4332,3.49
4333,3.56
4334,3.68
4335,3.80
4336,3.86
4337,3.85
4338,3.76
4339,3.66
4340,3.57
4341,3.51
4342,3.45
4343,3.38
4344,3.27
4345,3.16
4346,3.05
4347,2.97
4348,2.92
4349,2.90
4350,2.89
4351,2.90
4352,2.91
4353,2.92
4354,2.92
4355,2.90
4356,2.83
4357,2.75
4358,2.67
4359,2.66
4360,2.71
4361,2.78
4362,2.83
4363,2.81
4364,2.75
4365,2.67
4366,2.62
4367,2.63
4368,2.66
4369,2.68
4370,2.67
4371,2.64
4372,2.63
4373,2.65
4374,2.69
4375,2.71
4376,2.66
4377,2.55
4378,2.43
4379,2.34
4380,2.32
4381,2.36
4382,2.41
4383,2.45
4384,2.47
4385,2.46
4386,2.46
4387,2.46
4388,2.46
4389,2.43
4390,2.41
4391,2.40
4392,2.45
4393,2.54
4394,2.66
4395,2.76
4396,2.81
4397,2.81
4398,2.80
4399,2.81
4400,2.86
4401,2.91
4402,2.95
4403,2.94
4404,2.89
4405,2.83
4406,2.78
4407,2.76
4408,2.77
4409,2.81
4410,2.84
4411,2.86
4412,2.84
4413,2.80
4414,2.76
4415,2.73
4416,2.73
4417,2.76
4418,2.79
4419,2.82
4420,2.85
4421,2.89
4422,2.92
4423,2.93
4424,2.91
4425,2.87
4426,2.84
4427,2.84
4428,2.87
4429,2.93
4430,2.98
4431,3.03
4432,3.08
4433,3.13
4434,3.20
4435,3.28
4436,3.34
4437,3.37
4438,3.37
4439,3.36
4440,3.35
4441,3.33
4442,3.30
4443,3.24
4444,3.19
4445,3.18
4446,3.23
4447,3.34
4448,3.43
4449,3.47
4450,3.43
4451,3.35
4452,3.26
4453,3.17
4454,3.10
4455,3.04
4456,2.98
4457,2.96
4458,3.00
4459,3.06
4460,3.11
4461,3.09
4462,3.00
4463,2.91
4464,2.87
4465,2.92
4466,3.03
4467,3.13
4468,3.16
4469,3.13
4470,3.10
4471,3.13
4472,3.23
4473,3.34
4474,3.40
4475,3.38
4476,3.30
4477,3.19
4478,3.12
4479,3.12
4480,3.18
4481,3.27
4482,3.36
4483,3.40
4484,3.37
4485,3.29
4486,3.17
4487,3.08
4488,3.03
4489,3.02
4490,3.00
4491,2.94
4492,2.86
4493,2.79
4494,2.78
4495,2.85
4496,2.95
4497,3.00
4498,2.99
4499,2.92
4500,2.88
4501,2.89
4502,2.95
4503,2.99
4504,2.97
4505,2.88
4506,2.77
4507,2.70
4508,2.71
4509,2.78
4510,2.87
4511,2.94
4512,2.99
4513,3.02
4514,3.04
4515,3.05
4516,3.04
4517,3.01
4518,2.97
4519,2.94
4520,2.94
4521,2.96
4522,3.01
4523,3.08
4524,3.16
4525,3.26
4526,3.32
4527,3.33
4528,3.31
4529,3.28
4530,3.33
4531,3.44
4532,3.61
4533,3.74
4534,3.80
4535,3.75
4536,3.65
4537,3.55
4538,3.54
4539,3.62
4540,3.78
4541,3.92
4542,3.99
4543,3.96
4544,3.84
4545,3.71
4546,3.65
4547,3.67
4548,3.76
4549,3.84
4550,3.86
4551,3.84
4552,3.81
4553,3.81
4554,3.84
4555,3.87
4556,3.85
4557,3.79
4558,3.71
4559,3.65
4560,3.63
4561,3.65
4562,3.68
4563,3.70
4564,3.70
4565,3.70
4566,3.70
4567,3.69
4568,3.67
4569,3.63
4570,3.57
4571,3.49
4572,3.43
4573,3.41
4574,3.45
4575,3.53
4576,3.63
4577,3.69
4578,3.70
4579,3.68
4580,3.66
4581,3.65
4582,3.67
4583,3.68
4584,3.66
4585,3.61
4586,3.56
4587,3.55
4588,3.60
4589,3.69
4590,3.77
4591,3.79
4592,3.75
4593,3.67
4594,3.60
4595,3.59
4596,3.64
4597,3.70
4598,3.74
4599,3.73
4600,3.68
4601,3.65
4602,3.68
4603,3.76
4604,3.85
4605,3.89
4606,3.88
4607,3.82
4608,3.78
4609,3.78
4610,3.82
4611,3.87
4612,3.88
4613,3.83
4614,3.76
4615,3.71
4616,3.71
4617,3.76
4618,3.81
4619,3.81
4620,3.78
4621,3.74
4622,3.74
4623,3.80
4624,3.88
4625,3.95
4626,3.99
4627,4.01
4628,4.03
4629,4.05
4630,4.09
4631,4.11
4632,4.10
4633,4.06
4634,4.02
4635,4.00
4636,4.03
4637,4.09
4638,4.14
4639,4.17
4640,4.18
4641,4.17
4642,4.17
4643,4.17
4644,4.18
4645,4.20
4646,4.21
4647,4.22
4648,4.22
4649,4.18
4650,4.13
4651,4.07
4652,4.05
4653,4.07
4654,4.11
4655,4.14
4656,4.12
4657,4.06
4658,3.97
4659,3.90
4660,3.88
4661,3.88
4662,3.87
4663,3.82
4664,3.72
4665,3.62
4666,3.57
4667,3.57
4668,3.59
4669,3.60
4670,3.59
4671,3.58
4672,3.60
4673,3.69
4674,3.80
4675,3.89
4676,3.92
4677,3.89
4678,3.84
4679,3.79
4680,3.75
4681,3.72
4682,3.69
4683,3.67
4684,3.67
4685,3.68
4686,3.68
4687,3.64
4688,3.55
4689,3.43
4690,3.34
4691,3.32
4692,3.36
4693,3.42
4694,3.46
4695,3.46
4696,3.44
4697,3.44
4698,3.49
4699,3.56
4700,3.61
4701,3.63
4702,3.61
4703,3.59
4704,3.58
4705,3.59
4706,3.59
4707,3.56
4708,3.49
4709,3.42
4710,3.39
4711,3.41
4712,3.49
4713,3.57
4714,3.62
4715,3.61
4716,3.56
4717,3.51
4718,3.48
4719,3.49
4720,3.52
4721,3.54
4722,3.54
4723,3.52
4724,3.51
4725,3.53
4726,3.58
4727,3.62
4728,3.64
4729,3.61
4730,3.55
4731,3.50
4732,3.49
4733,3.52
4734,3.58
4735,3.60
4736,3.59
4737,3.54
4738,3.50
4739,3.50
4740,3.52
4741,3.52
4742,3.46
4743,3.36
4744,3.27
4745,3.26
4746,3.36
4747,3.51
4748,3.64
4749,3.66
4750,3.58
4751,3.45
4752,3.38
4753,3.38
4754,3.42
4755,3.45
4756,3.42
4757,3.37
4758,3.33
4759,3.34
4760,3.41
4761,3.46
4762,3.45
4763,3.36
4764,3.22
4765,3.09
4766,3.02
4767,2.97
4768,2.93
4769,2.90
4770,2.88
4771,2.89
4772,2.94
4773,3.00
4774,3.03
4775,3.05
4776,3.06
4777,3.10
4778,3.16
4779,3.21
4780,3.20
4781,3.11
4782,2.99
4783,2.90
4784,2.88
4785,2.94
4786,3.04
4787,3.12
4788,3.16
4789,3.17
4790,3.21
4791,3.29
4792,3.39
4793,3.50
4794,3.56
4795,3.59
4796,3.57
4797,3.56
4798,3.56
4799,3.60
4800,3.66
4801,3.69
4802,3.65
4803,3.57
4804,3.48
4805,3.45
4806,3.49
4807,3.58
4808,3.65
4809,3.63
4810,3.53
4811,3.40
4812,3.29
4813,3.27
4814,3.31
4815,3.36
4816,3.38
4817,3.35
4818,3.31
4819,3.29
4820,3.31
4821,3.36
4822,3.38
4823,3.35
4824,3.26
4825,3.13
4826,3.02
4827,2.97
4828,2.97
4829,3.01
4830,3.06
4831,3.10
4832,3.12
4833,3.14
4834,3.19
4835,3.28
4836,3.37
4837,3.43
4838,3.44
4839,3.41
4840,3.38
4841,3.37
4842,3.39
4843,3.42
4844,3.44
4845,3.43
4846,3.41
4847,3.41
4848,3.46
4849,3.56
4850,3.68
4851,3.78
4852,3.84
4853,3.82
4854,3.75
4855,3.65
4856,3.55
4857,3.47
4858,3.43
4859,3.42
4860,3.42
4861,3.42
4862,3.38
4863,3.28
4864,3.16
4865,3.05
4866,2.99
4867,2.99
4868,3.01
4869,3.02
4870,2.98
4871,2.93
4872,2.88
4873,2.85
4874,2.83
4875,2.80
4876,2.77
4877,2.75
4878,2.74
4879,2.76
4880,2.81
4881,2.84
4882,2.85
4883,2.82
4884,2.77
4885,2.72
4886,2.66
4887,2.62
4888,2.62
4889,2.66
4890,2.74
4891,2.83
4892,2.89
4893,2.90
4894,2.89
4895,2.89
4896,2.95
4897,3.04
4898,3.14
4899,3.19
4900,3.17
4901,3.10
4902,3.03
4903,3.01
4904,3.04
4905,3.09
4906,3.13
4907,3.15
4908,3.14
4909,3.14
4910,3.17
4911,3.22
4912,3.28
4913,3.31
4914,3.30
4915,3.25
4916,3.19
4917,3.14
4918,3.11
4919,3.11
4920,3.13
4921,3.19
4922,3.26
4923,3.33
4924,3.38
4925,3.42
4926,3.45
4927,3.45
4928,3.45
4929,3.41
4930,3.38
4931,3.34
4932,3.34
4933,3.37
4934,3.41
4935,3.43
4936,3.42
4937,3.40
4938,3.40
4939,3.46
4940,3.56
4941,3.65
4942,3.69
4943,3.64
4944,3.52
4945,3.39
4946,3.31
4947,3.27
4948,3.25
4949,3.23
4950,3.21
4951,3.19
4952,3.19
4953,3.21
4954,3.23
4955,3.26
4956,3.26
4957,3.24
4958,3.20
4959,3.15
4960,3.11
4961,3.08
4962,3.08
4963,3.08
4964,3.11
4965,3.15
4966,3.20
4967,3.26
4968,3.30
4969,3.31
4970,3.30
4971,3.26
4972,3.20
4973,3.16
4974,3.14
4975,3.16
4976,3.19
4977,3.23
4978,3.31
4979,3.41
4980,3.55
4981,3.66
4982,3.70
4983,3.67
4984,3.60
4985,3.53
4986,3.51
4987,3.52
4988,3.54
4989,3.53
4990,3.49
4991,3.44
4992,3.41
4993,3.40
4994,3.39
4995,3.38
4996,3.34
4997,3.31
4998,3.30
4999,3.30
5000,3.31
5001,3.32
5002,3.35
5003,3.39
5004,3.45
5005,3.50
5006,3.53
5007,3.52
5008,3.50
5009,3.49
5010,3.50
5011,3.54
5012,3.60
5013,3.69
5014,3.76
5015,3.81
5016,3.80
5017,3.75
5018,3.68
5019,3.63
5020,3.63
5021,3.68
5022,3.73
5023,3.76
5024,3.76
5025,3.75
5026,3.77
5027,3.81
5028,3.83
5029,3.78
5030,3.66
5031,3.52
5032,3.44
5033,3.45
5034,3.55
5035,3.65
5036,3.70
5037,3.68
5038,3.65
5039,3.66
5040,3.73
5041,3.82
5042,3.90
5043,3.92
5044,3.88
5045,3.83
5046,3.82
5047,3.85
5048,3.92
5049,3.99
5050,4.02
5051,4.03
5052,4.01
5053,4.00
5054,4.01
5055,4.03
5056,4.08
5057,4.13
5058,4.18
5059,4.19
5060,4.16
5061,4.08
5062,3.99
5063,3.95
5064,3.96
5065,3.99
5066,4.03
5067,4.03
5068,4.01
5069,3.99
5070,3.99
5071,4.03
5072,4.08
5073,4.11
5074,4.10
5075,4.07
5076,4.04
5077,4.02
5078,4.03
5079,4.07
5080,4.13
5081,4.20
5082,4.25
5083,4.28
5084,4.27
5085,4.25
5086,4.23
5087,4.22
5088,4.21
5089,4.17
5090,4.10
5091,4.03
5092,4.01
5093,4.06
5094,4.15
5095,4.22
5096,4.22
5097,4.14
5098,4.03
5099,3.95
5100,3.92
5101,3.93
5102,3.93
5103,3.90
5104,3.85
5105,3.82
5106,3.82
5107,3.84
5108,3.83
5109,3.79
5110,3.74
5111,3.72
5112,3.72
5113,3.72
5114,3.67
5115,3.59
5116,3.53
5117,3.55
5118,3.65
5119,3.78
5120,3.83
5121,3.76
5122,3.63
5123,3.55
5124,3.59
5125,3.73
5126,3.89
5127,3.96
5128,3.91
5129,3.81
5130,3.75
5131,3.77
5132,3.85
5133,3.94
5134,4.00
5135,4.05
5136,4.11
5137,4.17
5138,4.20
5139,4.15
5140,4.03
5141,3.90
5142,3.85
5143,3.90
5144,4.03
5145,4.17
5146,4.24
5147,4.23
5148,4.16
5149,4.09
5150,4.05
5151,4.04
5152,4.03
5153,3.99
5154,3.95
5155,3.94
5156,3.97
5157,4.06
5158,4.16
5159,4.24
5160,4.27
5161,4.27
5162,4.23
5163,4.18
5164,4.13
5165,4.10
5166,4.08
5167,4.08
5168,4.08
5169,4.07
5170,4.05
5171,4.02
5172,4.02
5173,4.07
5174,4.20
5175,4.35
5176,4.46
5177,4.48
5178,4.44
5179,4.37
5180,4.35
5181,4.39
5182,4.48
5183,4.54
5184,4.54
5185,4.47
5186,4.39
5187,4.35
5188,4.34
5189,4.36
5190,4.38
5191,4.39
5192,4.39
5193,4.39
5194,4.38
5195,4.35
5196,4.31
5197,4.24
5198,4.17
5199,4.10
5200,4.06
5201,4.05
5202,4.04
5203,4.02
5204,3.97
5205,3.90
5206,3.82
5207,3.76
5208,3.74
5209,3.77
5210,3.82
5211,3.87
5212,3.87
5213,3.83
5214,3.78
5215,3.78
5216,3.83
5217,3.90
5218,3.95
5219,3.93
5220,3.85
5221,3.76
5222,3.72
5223,3.77
5224,3.88
5225,3.99
5226,4.04
5227,4.02
5228,3.96
5229,3.91
5230,3.88
5231,3.86
5232,3.83
5233,3.78
5234,3.71
5235,3.67
5236,3.69
5237,3.75
5238,3.83
5239,3.89
5240,3.91
5241,3.90
5242,3.88
5243,3.89
5244,3.92
5245,3.95
5246,3.93
5247,3.85
5248,3.74
5249,3.65
5250,3.61
5251,3.62
5252,3.64
5253,3.65
5254,3.63
5255,3.58
5256,3.53
5257,3.47
5258,3.40
5259,3.31
5260,3.20
5261,3.13
5262,3.11
5263,3.14
5264,3.20
5265,3.22
5266,3.19
5267,3.09
5268,2.97
5269,2.85
5270,2.78
5271,2.76
5272,2.79
5273,2.86
5274,2.93
5275,2.98
5276,3.00
5277,2.96
5278,2.88
5279,2.79
5280,2.72
5281,2.71
5282,2.76
5283,2.85
5284,2.92
5285,2.96
5286,2.95
5287,2.93
5288,2.94
5289,3.00
5290,3.09
5291,3.15
5292,3.16
5293,3.09
5294,2.97
5295,2.84
5296,2.74
5297,2.69
5298,2.68
5299,2.67
5300,2.66
5301,2.62
5302,2.56
5303,2.51
5304,2.47
5305,2.44
5306,2.41
5307,2.40
5308,2.42
5309,2.47
5310,2.53
5311,2.58
5312,2.58
5313,2.54
5314,2.47
5315,2.42
5316,2.42
5317,2.47
5318,2.54
5319,2.59
5320,2.61
5321,2.60
5322,2.60
5323,2.61
5324,2.62
5325,2.61
5326,2.56
5327,2.50
5328,2.47
5329,2.49
5330,2.57
5331,2.67
5332,2.74
5333,2.75
5334,2.71
5335,2.65
5336,2.57
5337,2.50
5338,2.43
5339,2.37
5340,2.35
5341,2.40
5342,2.52
5343,2.70
5344,2.90
5345,3.04
5346,3.09
5347,3.05
5348,2.97
5349,2.93
5350,2.99
5351,3.13
5352,3.31
5353,3.46
5354,3.56
5355,3.58
5356,3.57
5357,3.55
5358,3.55
5359,3.59
5360,3.65
5361,3.73
5362,3.80
5363,3.82
5364,3.79
5365,3.71
5366,3.63
5367,3.59
5368,3.61
5369,3.67
5370,3.72
5371,3.70
5372,3.62
5373,3.50
5374,3.41
5375,3.39
5376,3.44
5377,3.53
5378,3.59
5379,3.60
5380,3.55
5381,3.48
5382,3.43
5383,3.40
5384,3.36
5385,3.29
5386,3.19
5387,3.07
5388,2.99
5389,2.97
5390,2.98
5391,2.96
5392,2.89
5393,2.80
5394,2.75
5395,2.78
5396,2.86
5397,2.93
5398,2.93
5399,2.87
5400,2.79
5401,2.75
5402,2.75
5403,2.77
5404,2.76
5405,2.73
5406,2.69
5407,2.69
5408,2.73
5409,2.75
5410,2.73
5411,2.67
5412,2.61
5413,2.60
5414,2.65
5415,2.73
5416,2.79
5417,2.83
5418,2.85
5419,2.86
5420,2.89
5421,2.93
5422,2.97
5423,3.02
5424,3.07
5425,3.09
5426,3.07
5427,2.99
5428,2.90
5429,2.84
5430,2.87
5431,2.97
5432,3.09
5433,3.14
5434,3.13
5435,3.07
5436,3.05
5437,3.11
5438,3.24
5439,3.38
5440,3.49
5441,3.53
5442,3.54
5443,3.56
5444,3.62
5445,3.71
5446,3.82
5447,3.90
5448,3.96
5449,3.99
5450,4.01
5451,4.03
5452,4.06
5453,4.11
5454,4.20
5455,4.31
5456,4.44
5457,4.59
5458,4.72
5459,4.81
5460,4.84
5461,4.81
5462,4.76
5463,4.75
5464,4.80
5465,4.90
5466,5.01
5467,5.08
5468,5.07
5469,5.01
5470,4.94
5471,4.90
5472,4.90
5473,4.92
5474,4.91
5475,4.85
5476,4.77
5477,4.70
5478,4.68
5479,4.71
5480,4.78
5481,4.83
5482,4.85
5483,4.85
5484,4.84
5485,4.84
5486,4.82
5487,4.79
5488,4.75
5489,4.72
5490,4.71
5491,4.70
5492,4.67
5493,4.59
5494,4.49
5495,4.40
5496,4.37
5497,4.38
5498,4.41
5499,4.43
5500,4.43
5501,4.42
5502,4.43
5503,4.43
5504,4.43
5505,4.39
5506,4.33
5507,4.30
5508,4.32
5509,4.39
5510,4.45
5511,4.47
5512,4.43
5513,4.37
5514,4.36
5515,4.40
5516,4.48
5517,4.54
5518,4.55
5519,4.50
5520,4.45
5521,4.44
5522,4.47
5523,4.50
5524,4.49
5525,4.44
5526,4.38
5527,4.35
5528,4.38
5529,4.42
5530,4.45
5531,4.44
5532,4.40
5533,4.35
5534,4.31
5535,4.29
5536,4.28
5537,4.29
5538,4.32
5539,4.39
5540,4.48
5541,4.57
5542,4.61
5543,4.60
5544,4.55
5545,4.49
5546,4.47
5547,4.48
5548,4.50
5549,4.48
5550,4.42
5551,4.34
5552,4.29
5553,4.31
5554,4.40
5555,4.51
5556,4.60
5557,4.63
5558,4.59
5559,4.54
5560,4.52
5561,4.56
5562,4.63
5563,4.71
5564,4.74
5565,4.74
5566,4.71
5567,4.68
5568,4.67
5569,4.66
5570,4.67
5571,4.68
5572,4.70
5573,4.76
5574,4.84
5575,4.91
5576,4.93
5577,4.89
5578,4.81
5579,4.73
5580,4.70
5581,4.71
5582,4.75
5583,4.77
5584,4.77
5585,4.74
5586,4.71
5587,4.70
5588,4.70
5589,4.70
5590,4.67
5591,4.62
5592,4.57
5593,4.53
5594,4.52
5595,4.53
5596,4.55
5597,4.53
5598,4.51
5599,4.48
5600,4.47
5601,4.45
5602,4.43
5603,4.39
5604,4.37
5605,4.41
5606,4.50
5607,4.62
5608,4.71
5609,4.75
5610,4.74
5611,4.73
5612,4.75
5613,4.80
5614,4.86
5615,4.90
5616,4.93
5617,4.94
5618,4.95
5619,4.95
5620,4.94
5621,4.90
5622,4.85
5623,4.82
5624,4.83
5625,4.86
5626,4.88
5627,4.86
5628,4.80
5629,4.73
5630,4.68
5631,4.67
5632,4.66
5633,4.64
5634,4.57
5635,4.48
5636,4.38
5637,4.29
5638,4.22
5639,4.17
5640,4.12
5641,4.09
5642,4.08
5643,4.09
5644,4.11
5645,4.13
5646,4.14
5647,4.17
5648,4.22
5649,4.30
5650,4.37
5651,4.41
5652,4.40
5653,4.38
5654,4.37
5655,4.40
5656,4.47
5657,4.54
5658,4.58
5659,4.57
5660,4.55
5661,4.56
5662,4.61
5663,4.69
5664,4.77
5665,4.81
5666,4.82
5667,4.79
5668,4.74
5669,4.68
5670,4.65
5671,4.64
5672,4.63
5673,4.61
5674,4.58
5675,4.54
5676,4.53
5677,4.57
5678,4.64
5679,4.71
5680,4.74
5681,4.68
5682,4.55
5683,4.41
5684,4.31
5685,4.27
5686,4.27
5687,4.28
5688,4.27
5689,4.25
5690,4.24
5691,4.25
5692,4.28
5693,4.32
5694,4.33
5695,4.32
5696,4.29
5697,4.23
5698,4.14
5699,4.03
5700,3.94
5701,3.89
5702,3.91
5703,3.96
5704,3.98
5705,3.96
5706,3.86
5707,3.75
5708,3.67
5709,3.62
5710,3.60
5711,3.58
5712,3.53
5713,3.44
5714,3.35
5715,3.29
5716,3.27
5717,3.28
5718,3.28
5719,3.27
5720,3.26
5721,3.25
5722,3.26
5723,3.29
5724,3.33
5725,3.35
5726,3.34
5727,3.31
5728,3.27
5729,3.23
5730,3.22
5731,3.26
5732,3.32
5733,3.38
5734,3.40
5735,3.38
5736,3.34
5737,3.32
5738,3.36
5739,3.45
5740,3.53
5741,3.57
5742,3.53
5743,3.46
5744,3.42
5745,3.47
5746,3.59
5747,3.73
5748,3.81
5749,3.81
5750,3.79
5751,3.80
5752,3.85
5753,3.91
5754,3.92
5755,3.85
5756,3.76
5757,3.70
5758,3.71
5759,3.76
5760,3.82
5761,3.83
5762,3.78
5763,3.70
5764,3.65
5765,3.66
5766,3.73
5767,3.84
5768,3.94
5769,4.01
5770,4.07
5771,4.13
5772,4.19
5773,4.25
5774,4.30
5775,4.32
5776,4.29
5777,4.23
5778,4.17
5779,4.14
5780,4.17
5781,4.21
5782,4.24
5783,4.23
5784,4.18
5785,4.11
5786,4.04
5787,3.99
5788,3.95
5789,3.93
5790,3.92
5791,3.93
5792,3.97
5793,4.02
5794,4.06
5795,4.06
5796,4.02
5797,3.98
5798,3.95
5799,3.95
5800,3.98
5801,4.03
5802,4.07
5803,4.12
5804,4.17
5805,4.24
5806,4.29
5807,4.32
5808,4.29
5809,4.22
5810,4.15
5811,4.13
5812,4.15
5813,4.22
5814,4.28
5815,4.33
5816,4.35
5817,4.36
5818,4.41
5819,4.50
5820,4.61
5821,4.73
5822,4.82
5823,4.88
5824,4.92
5825,4.95
5826,4.98
5827,5.00
5828,5.02
5829,5.03
5830,5.05
5831,5.06
5832,5.03
5833,4.96
5834,4.87
5835,4.81
5836,4.82
5837,4.91
5838,5.03
5839,5.09
5840,5.06
5841,4.95
5842,4.81
5843,4.70
5844,4.64
5845,4.62
5846,4.61
5847,4.62
5848,4.65
5849,4.71
5850,4.77
5851,4.80
5852,4.77
5853,4.70
5854,4.63
5855,4.60
5856,4.63
5857,4.71
5858,4.79
5859,4.83
5860,4.85
5861,4.87
5862,4.92
5863,4.99
5864,5.04
5865,5.03
5866,4.97
5867,4.91
5868,4.91
5869,4.99
5870,5.09
5871,5.14
5872,5.12
5873,5.04
5874,4.99
5875,5.05
5876,5.23
5877,5.44
5878,5.60
5879,5.64
5880,5.59
5881,5.53
5882,5.52
5883,5.55
5884,5.59
5885,5.58
5886,5.53
5887,5.45
5888,5.40
5889,5.40
5890,5.44
5891,5.49
5892,5.52
5893,5.52
5894,5.51
5895,5.53
5896,5.58
5897,5.65
5898,5.70
5899,5.69
5900,5.63
5901,5.52
5902,5.42
5903,5.36
5904,5.33
5905,5.31
5906,5.28
5907,5.27
5908,5.28
5909,5.35
5910,5.44
5911,5.51
5912,5.52
5913,5.49
5914,5.45
5915,5.46
5916,5.51
5917,5.57
5918,5.58
5919,5.55
5920,5.50
5921,5.51
5922,5.57
5923,5.65
5924,5.70
5925,5.68
5926,5.64
5927,5.64
5928,5.70
5929,5.78
5930,5.80
5931,5.71
5932,5.58
5933,5.50
5934,5.55
5935,5.71
5936,5.90
5937,6.03
5938,6.07
5939,6.06
5940,6.08
5941,6.15
5942,6.23
5943,6.27
5944,6.27
5945,6.26
5946,6.30
5947,6.41
5948,6.56
5949,6.65
5950,6.64
5951,6.55
5952,6.45
5953,6.43
5954,6.52
5955,6.63
5956,6.67
5957,6.59
5958,6.38
5959,6.14
5960,5.97
5961,5.91
5962,5.94
5963,5.99
5964,6.00
5965,5.98
5966,5.95
5967,6.00
5968,6.11
5969,6.24
5970,6.31
5971,6.29
5972,6.20
5973,6.12
5974,6.09
5975,6.11
5976,6.15
5977,6.14
5978,6.11
5979,6.07
5980,6.07
5981,6.12
5982,6.16
5983,6.14
5984,6.08
5985,6.00
5986,5.96
5987,5.99
5988,6.08
5989,6.16
5990,6.23
5991,6.27
5992,6.32
5993,6.38
5994,6.43
5995,6.46
5996,6.46
5997,6.44
5998,6.45
5999,6.48
6000,6.55
6001,6.60
6002,6.60
6003,6.56
6004,6.51
6005,6.51
6006,6.55
6007,6.61
6008,6.65
6009,6.63
6010,6.59
6011,6.55
6012,6.55
6013,6.60
6014,6.64
6015,6.64
6016,6.58
6017,6.49
6018,6.44
6019,6.45
6020,6.53
6021,6.64
6022,6.73
6023,6.76
6024,6.72
6025,6.63
6026,6.56
6027,6.53
6028,6.57
6029,6.65
6030,6.73
6031,6.79
6032,6.84
6033,6.86
6034,6.87
6035,6.88
6036,6.91
6037,6.95
6038,6.99
6039,7.01
6040,7.02
6041,6.99
6042,6.95
6043,6.92
6044,6.89
6045,6.87
6046,6.86
6047,6.85
6048,6.87
6049,6.92
6050,6.97
6051,7.00
6052,6.98
6053,6.93
6054,6.87
6055,6.84
6056,6.86
6057,6.91
6058,6.95
6059,6.98
6060,7.00
6061,7.05
6062,7.14
6063,7.20
6064,7.21
6065,7.12
6066,6.99
6067,6.88
6068,6.85
6069,6.91
6070,7.01
6071,7.10
6072,7.14
6073,7.13
6074,7.09
6075,7.05
6076,7.01
6077,7.00
6078,7.00
6079,7.04
6080,7.10
6081,7.15
6082,7.18
6083,7.17
6084,7.14
6085,7.11
6086,7.12
6087,7.17
6088,7.21
6089,7.22
6090,7.21
6091,7.18
6092,7.17
6093,7.15
6094,7.14
6095,7.11
6096,7.09
6097,7.08
6098,7.10
6099,7.17
6100,7.24
6101,7.31
6102,7.35
6103,7.36
6104,7.35
6105,7.34
6106,7.32
6107,7.29
6108,7.25
6109,7.23
6110,7.23
6111,7.26
6112,7.31
6113,7.36
6114,7.42
6115,7.44
6116,7.42
6117,7.38
6118,7.32
6119,7.27
6120,7.25
6121,7.23
6122,7.19
6123,7.15
6124,7.13
6125,7.15
6126,7.18
6127,7.21
6128,7.21
6129,7.21
6130,7.21
6131,7.24
6132,7.31
6133,7.38
6134,7.42
6135,7.42
6136,7.40
6137,7.37
6138,7.37
6139,7.38
6140,7.40
6141,7.42
6142,7.45
6143,7.48
6144,7.51
6145,7.52
6146,7.51
6147,7.47
6148,7.42
6149,7.37
6150,7.35
6151,7.36
6152,7.40
6153,7.45
6154,7.49
6155,7.52
6156,7.53
6157,7.56
6158,7.58
6159,7.61
6160,7.64
6161,7.66
6162,7.66
6163,7.65
6164,7.63
6165,7.60
6166,7.54
6167,7.45
6168,7.37
6169,7.33
6170,7.36
6171,7.46
6172,7.57
6173,7.62
6174,7.60
6175,7.50
6176,7.41
6177,7.38
6178,7.44
6179,7.56
6180,7.66
6181,7.69
6182,7.62
6183,7.47
6184,7.32
6185,7.22
6186,7.21
6187,7.25
6188,7.32
6189,7.35
6190,7.34
6191,7.32
6192,7.30
6193,7.31
6194,7.31
6195,7.27
6196,7.17
6197,7.05
6198,6.94
6199,6.89
6200,6.89
6201,6.93
6202,6.95
6203,6.95
6204,6.94
6205,6.93
6206,6.93
6207,6.94
6208,6.94
6209,6.93
6210,6.95
6211,6.98
6212,7.01
6213,7.00
6214,6.93
6215,6.84
6216,6.77
6217,6.76
6218,6.80
6219,6.86
6220,6.87
6221,6.82
6222,6.75
6223,6.69
6224,6.65
6225,6.63
6226,6.59
6227,6.54
6228,6.50
6229,6.50
6230,6.57
6231,6.66
6232,6.74
6233,6.78
6234,6.76
6235,6.70
6236,6.66
6237,6.66
6238,6.71
6239,6.79
6240,6.89
6241,6.96
6242,7.00
6243,7.02
6244,7.04
6245,7.10
6246,7.21
6247,7.36
6248,7.50
6249,7.61
6250,7.68
6251,7.74
6252,7.83
6253,7.96
6254,8.12
6255,8.24
6256,8.29
6257,8.24
6258,8.16
6259,8.10
6260,8.09
6261,8.14
6262,8.22
6263,8.28
6264,8.33
6265,8.37
6266,8.43
6267,8.50
6268,8.54
6269,8.53
6270,8.44
6271,8.32
6272,8.22
6273,8.19
6274,8.23
6275,8.30
6276,8.36
6277,8.35
6278,8.30
6279,8.24
6280,8.24
6281,8.32
6282,8.47
6283,8.58
6284,8.60
6285,8.49
6286,8.30
6287,8.13
6288,8.06
6289,8.11
6290,8.20
6291,8.28
6292,8.26
6293,8.18
6294,8.08
6295,8.05
6296,8.11
6297,8.22
6298,8.30
6299,8.29
6300,8.20
6301,8.07
6302,7.98
6303,7.97
6304,7.99
6305,8.00
6306,7.94
6307,7.85
6308,7.76
6309,7.72
6310,7.72
6311,7.73
6312,7.71
6313,7.65
6314,7.60
6315,7.61
6316,7.67
6317,7.75
6318,7.78
6319,7.72
6320,7.62
6321,7.53
6322,7.50
6323,7.54
6324,7.61
6325,7.64
6326,7.59
6327,7.50
6328,7.44
6329,7.45
6330,7.53
6331,7.66
6332,7.75
6333,7.76
6334,7.72
6335,7.69
6336,7.73
6337,7.82
6338,7.90
6339,7.93
6340,7.87
6341,7.75
6342,7.65
6343,7.61
6344,7.65
6345,7.74
6346,7.82
6347,7.86
6348,7.89
6349,7.92
6350,7.98
6351,8.07
6352,8.17
6353,8.25
6354,8.30
6355,8.33
6356,8.38
6357,8.45
6358,8.57
6359,8.69
6360,8.82
6361,8.91
6362,8.95
6363,8.95
6364,8.93
6365,8.90
6366,8.90
6367,8.92
6368,8.98
6369,9.04
6370,9.09
6371,9.13
6372,9.17
6373,9.22
6374,9.27
6375,9.28
6376,9.25
6377,9.18
6378,9.12
6379,9.10
6380,9.13
6381,9.17
6382,9.19
6383,9.17
6384,9.10
6385,9.05
6386,9.04
6387,9.10
6388,9.18
6389,9.23
6390,9.19
6391,9.06
6392,8.87
6393,8.71
6394,8.63
6395,8.67
6396,8.78
6397,8.91
6398,8.97
6399,8.94
6400,8.86
6401,8.78
6402,8.75
6403,8.79
6404,8.88
6405,8.99
6406,9.08
6407,9.12
6408,9.11
6409,9.05
6410,8.97
6411,8.94
6412,8.99
6413,9.13
6414,9.30
6415,9.41
6416,9.41
6417,9.33
6418,9.21
6419,9.14
6420,9.16
6421,9.24
6422,9.34
6423,9.40
6424,9.44
6425,9.45
6426,9.47
6427,9.48
6428,9.49
6429,9.52
6430,9.57
6431,9.63
6432,9.66
6433,9.63
6434,9.56
6435,9.48
6436,9.44
6437,9.46
6438,9.53
6439,9.59
6440,9.58
6441,9.49
6442,9.37
6443,9.27
6444,9.23
6445,9.24
6446,9.26
6447,9.27
6448,9.27
6449,9.27
6450,9.29
6451,9.34
6452,9.38
6453,9.41
6454,9.43
6455,9.45
6456,9.49
6457,9.52
6458,9.53
6459,9.51
6460,9.50
6461,9.53
6462,9.61
6463,9.71
6464,9.80
6465,9.85
6466,9.87
6467,9.89
6468,9.93
6469,10.00
6470,10.07
6471,10.12
6472,10.15
6473,10.19
6474,10.24
6475,10.30
6476,10.34
6477,10.36
6478,10.39
6479,10.44
6480,10.55
6481,10.70
6482,10.85
6483,10.96
6484,11.02
6485,11.04
6486,11.06
6487,11.10
6488,11.17
6489,11.23
6490,11.27
6491,11.26
6492,11.23
6493,11.20
6494,11.18
6495,11.20
6496,11.26
6497,11.32
6498,11.37
6499,11.37
6500,11.34
6501,11.29
6502,11.26
6503,11.28
6504,11.33
6505,11.37
6506,11.35
6507,11.27
6508,11.18
6509,11.13
6510,11.16
6511,11.25
6512,11.34
6513,11.37
6514,11.32
6515,11.21
6516,11.09
6517,11.01
6518,10.97
6519,10.96
6520,10.97
6521,10.98
6522,10.99
6523,11.01
6524,11.05
6525,11.11
6526,11.16
6527,11.18
6528,11.18
6529,11.18
6530,11.19
6531,11.22
6532,11.24
6533,11.24
6534,11.21
6535,11.17
6536,11.13
6537,11.11
6538,11.13
6539,11.17
6540,11.20
6541,11.19
6542,11.16
6543,11.12
6544,11.11
6545,11.12
6546,11.15
6547,11.16
6548,11.13
6549,11.10
6550,11.08
6551,11.11
6552,11.17
6553,11.22
6554,11.23
6555,11.19
6556,11.14
6557,11.14
6558,11.19
6559,11.29
6560,11.38
6561,11.42
6562,11.41
6563,11.38
6564,11.38
6565,11.40
6566,11.43
6567,11.44
6568,11.40
6569,11.33
6570,11.27
6571,11.23
6572,11.23
6573,11.25
6574,11.25
6575,11.23
6576,11.18
6577,11.13
6578,11.07
6579,11.05
6580,11.05
6581,11.07
6582,11.09
6583,11.11
6584,11.11
6585,11.11
6586,11.07
6587,11.02
6588,10.97
6589,10.96
6590,11.01
6591,11.08
6592,11.13
6593,11.12
6594,11.05
6595,10.96
6596,10.94
6597,11.00
6598,11.14
6599,11.27
6600,11.34
6601,11.34
6602,11.32
6603,11.32
6604,11.38
6605,11.47
6606,11.53
6607,11.55
6608,11.56
6609,11.58
6610,11.65
6611,11.77
6612,11.90
6613,12.00
6614,12.06
6615,12.08
6616,12.08
6617,12.07
6618,12.05
6619,12.05
6620,12.09
6621,12.17
6622,12.30
6623,12.41
6624,12.48
6625,12.48
6626,12.43
6627,12.36
6628,12.32
6629,12.31
6630,12.32
6631,12.33
6632,12.31
6633,12.28
6634,12.26
6635,12.24
6636,12.24
6637,12.26
6638,12.32
6639,12.41
6640,12.48
6641,12.52
6642,12.48
6643,12.38
6644,12.27
6645,12.19
6646,12.19
6647,12.25
6648,12.34
6649,12.40
6650,12.39
6651,12.31
6652,12.21
6653,12.14
6654,12.15
6655,12.23
6656,12.35
6657,12.46
6658,12.51
6659,12.48
6660,12.39
6661,12.27
6662,12.16
6663,12.09
6664,12.08
6665,12.13
6666,12.20
6667,12.24
6668,12.24
6669,12.21
6670,12.16
6671,12.13
6672,12.13
6673,12.14
6674,12.14
6675,12.12
6676,12.11
6677,12.12
6678,12.18
6679,12.26
6680,12.33
6681,12.35
6682,12.33
6683,12.29
6684,12.29
6685,12.35
6686,12.45
6687,12.52
6688,12.55
6689,12.52
6690,12.49
6691,12.48
6692,12.51
6693,12.52
6694,12.49
6695,12.40
6696,12.29
6697,12.21
6698,12.21
6699,12.27
6700,12.36
6701,12.41
6702,12.42
6703,12.40
6704,12.39
6705,12.45
6706,12.56
6707,12.71
6708,12.82
6709,12.86
6710,12.82
6711,12.75
6712,12.70
6713,12.73
6714,12.82
6715,12.91
6716,12.96
6717,12.93
6718,12.87
6719,12.80
6720,12.77
6721,12.80
6722,12.84
6723,12.88
6724,12.92
6725,12.95
6726,13.00
6727,13.06
6728,13.15
6729,13.23
6730,13.29
6731,13.31
6732,13.29
6733,13.25
6734,13.23
6735,13.25
6736,13.33
6737,13.44
6738,13.53
6739,13.57
6740,13.56
6741,13.53
6742,13.50
6743,13.49
6744,13.52
6745,13.53
6746,13.54
6747,13.52
6748,13.51
6749,13.53
6750,13.58
6751,13.65
6752,13.72
6753,13.75
6754,13.78
6755,13.82
6756,13.87
6757,13.91
6758,13.92
6759,13.88
6760,13.81
6761,13.77
6762,13.80
6763,13.90
6764,14.02
6765,14.07
6766,14.04
6767,13.94
6768,13.86
6769,13.86
6770,13.94
6771,14.03
6772,14.07
6773,14.04
6774,13.99
6775,13.97
6776,14.03
6777,14.14
6778,14.23
6779,14.25
6780,14.21
6781,14.14
6782,14.14
6783,14.22
6784,14.36
6785,14.52
6786,14.61
6787,14.61
6788,14.54
6789,14.46
6790,14.41
6791,14.42
6792,14.46
6793,14.50
6794,14.51
6795,14.49
6796,14.44
6797,14.38
6798,14.29
6799,14.20
6800,14.11
6801,14.05
6802,14.03
6803,14.04
6804,14.04
6805,14.03
6806,14.01
6807,14.00
6808,14.04
6809,14.14
6810,14.24
6811,14.29
6812,14.25
6813,14.14
6814,14.00
6815,13.91
6816,13.88
6817,13.89
6818,13.90
6819,13.89
6820,13.87
6821,13.85
6822,13.85
6823,13.89
6824,13.96
6825,14.03
6826,14.10
6827,14.15
6828,14.18
6829,14.20
6830,14.23
6831,14.26
6832,14.31
6833,14.33
6834,14.34
6835,14.33
6836,14.35
6837,14.40
6838,14.49
6839,14.58
6840,14.66
6841,14.70
6842,14.71
6843,14.72
6844,14.76
6845,14.81
6846,14.85
6847,14.87
6848,14.86
6849,14.87
6850,14.92
6851,15.00
6852,15.06
6853,15.07
6854,15.02
6855,14.95
6856,14.92
6857,14.97
6858,15.09
6859,15.21
6860,15.26
6861,15.22
6862,15.11
6863,15.02
6864,15.01
6865,15.08
6866,15.16
6867,15.17
6868,15.09
6869,14.94
6870,14.84
6871,14.85
6872,14.96
6873,15.12
6874,15.25
6875,15.31
6876,15.31
6877,15.32
6878,15.36
6879,15.45
6880,15.55
6881,15.63
6882,15.64
6883,15.59
6884,15.50
6885,15.44
6886,15.45
6887,15.52
6888,15.63
6889,15.73
6890,15.77
6891,15.77
6892,15.75
6893,15.74
6894,15.73
6895,15.71
6896,15.64
6897,15.55
6898,15.48
6899,15.51
6900,15.66
6901,15.85
6902,16.00
6903,16.02
6904,15.91
6905,15.74
6906,15.61
6907,15.57
6908,15.65
6909,15.78
6910,15.91
6911,15.99
6912,16.02
6913,16.00
6914,15.97
6915,15.94
6916,15.92
6917,15.92
6918,15.92
6919,15.93
6920,15.96
6921,16.01
6922,16.05
6923,16.06
6924,16.00
6925,15.90
6926,15.81
6927,15.78
6928,15.84
6929,15.94
6930,16.00
6931,15.98
6932,15.90
6933,15.83
6934,15.84
6935,15.91
6936,16.00
6937,16.03
6938,15.99
6939,15.92
6940,15.89
6941,15.93
6942,16.01
6943,16.11
6944,16.19
6945,16.23
6946,16.24
6947,16.22
6948,16.20
6949,16.18
6950,16.19
6951,16.25
6952,16.37
6953,16.50
6954,16.61
6955,16.68
6956,16.72
6957,16.77
6958,16.83
6959,16.89
6960,16.91
6961,16.91
6962,16.90
6963,16.92
6964,16.97
6965,17.04
6966,17.11
6967,17.14
6968,17.16
6969,17.18
6970,17.21
6971,17.24
6972,17.24
6973,17.21
6974,17.19
6975,17.19
6976,17.22
6977,17.28
6978,17.30
6979,17.28
6980,17.21
6981,17.15
6982,17.09
6983,17.03
6984,16.96
6985,16.86
6986,16.76
6987,16.70
6988,16.67
6989,16.68
6990,16.69
6991,16.67
6992,16.64
6993,16.59
6994,16.59
6995,16.62
6996,16.67
6997,16.70
6998,16.69
6999,16.68
7000,16.72
7001,16.82
7002,16.98
7003,17.13
7004,17.25
7005,17.32
7006,17.35
7007,17.39
7008,17.43
7009,17.46
7010,17.47
7011,17.44
7012,17.40
7013,17.37
7014,17.37
7015,17.41
7016,17.46
7017,17.48
7018,17.48
7019,17.48
7020,17.51
7021,17.56
7022,17.64
7023,17.71
7024,17.76
7025,17.78
7026,17.78
7027,17.75
7028,17.72
7029,17.72
7030,17.79
7031,17.89
7032,17.98
7033,18.02
7034,17.96
7035,17.84
7036,17.72
7037,17.66
7038,17.71
7039,17.82
7040,17.93
7041,17.95
7042,17.88
7043,17.73
7044,17.59
7045,17.48
7046,17.41
7047,17.37
7048,17.33
7049,17.30
7050,17.28
7051,17.29
7052,17.31
7053,17.32
7054,17.29
7055,17.22
7056,17.14
7057,17.09
7058,17.10
7059,17.15
7060,17.19
7061,17.16
7062,17.05
7063,16.91
7064,16.80
7065,16.77
7066,16.78
7067,16.80
7068,16.79
7069,16.76
7070,16.74
7071,16.76
7072,16.81
7073,16.86
7074,16.86
7075,16.83
7076,16.81
7077,16.84
7078,16.94
7079,17.07
7080,17.18
7081,17.22
7082,17.23
7083,17.23
7084,17.24
7085,17.27
7086,17.30
7087,17.33
7088,17.40
7089,17.49
7090,17.61
7091,17.71
7092,17.76
7093,17.76
7094,17.75
7095,17.77
7096,17.86
7097,17.96
7098,18.04
7099,18.04
7100,17.99
7101,17.91
7102,17.86
7103,17.83
7104,17.83
7105,17.81
7106,17.79
7107,17.76
7108,17.76
7109,17.77
7110,17.78
7111,17.77
7112,17.75
7113,17.72
7114,17.69
7115,17.66
7116,17.61
7117,17.52
7118,17.40
7119,17.29
7120,17.21
7121,17.18
7122,17.18
7123,17.20
7124,17.21
7125,17.21
7126,17.20
7127,17.20
7128,17.19
7129,17.19
7130,17.18
7131,17.17
7132,17.17
7133,17.21
7134,17.32
7135,17.47
7136,17.59
7137,17.63
7138,17.58
7139,17.46
7140,17.34
7141,17.26
7142,17.22
7143,17.21
7144,17.18
7145,17.13
7146,17.10
7147,17.11
7148,17.18
7149,17.30
7150,17.43
7151,17.52
7152,17.54
7153,17.53
7154,17.51
7155,17.51
7156,17.56
7157,17.65
7158,17.77
7159,17.91
7160,18.05
7161,18.17
7162,18.23
7163,18.23
7164,18.20
7165,18.18
7166,18.23
7167,18.37
7168,18.54
7169,18.67
7170,18.71
7171,18.66
7172,18.56
7173,18.47
7174,18.42
7175,18.41
7176,18.38
7177,18.33
7178,18.26
7179,18.19
7180,18.17
7181,18.18
7182,18.20
7183,18.19
7184,18.14
7185,18.10
7186,18.08
7187,18.10
7188,18.13
7189,18.19
7190,18.11
7191,17.91
7192,17.75
7193,17.68
7194,18.10
7195,18.38
7196,18.06
7197,17.18
7198,17.27
7199,19.36
7200,18.07
