1,475.16
2,681.98
3,683.69
4,581.76
5,502.23
6,452.79
7,368.62
8,235.53
9,82.55
10,-59.94
11,-179.87
12,-254.55
13,-262.27
14,-193.45
15,-56.95
16,118.01
17,302.19
18,457.43
19,564.48
20,607.94
21,594.70
22,533.33
23,441.07
24,329.62
25,207.43
26,79.90
27,-49.65
28,-173.58
29,-281.83
30,-362.40
31,-403.32
32,-402.13
33,-359.86
34,-292.36
35,-213.81
36,-145.23
37,-96.34
38,-74.34
39,-73.82
40,-87.10
41,-102.81
42,-112.52
43,-112.92
44,-103.64
45,-90.42
46,-76.48
47,-67.44
48,-63.29
49,-64.21
50,-66.93
51,-69.46
52,-70.04
53,-68.54
54,-65.34
55,-61.61
56,-57.95
57,-55.30
58,-53.41
59,-52.28
60,-51.27
61,-50.29
62,-49.19
63,-48.19
64,-47.18
65,-46.33
66,-45.38
67,-44.56
68,-43.67
69,-42.97
70,-42.30
71,-41.69
72,-40.99
73,-40.31
74,-39.58
75,-38.94
76,-38.21
77,-37.48
78,-36.68
79,-35.95
80,-35.19
81,-34.55
82,-33.87
83,-33.33
84,-32.78
85,-32.35
86,-31.89
87,-31.49
88,-31.04
89,-30.58
90,-30.06
91,-29.57
92,-28.99
93,-28.44
94,-27.80
95,-27.22
96,-26.58
97,-25.97
98,-25.33
99,-24.75
100,-24.17
101,-23.68
102,-23.19
103,-22.77
104,-22.37
105,-22.06
106,-21.73
107,-21.48
108,-21.21
109,-21.00
110,-20.78
111,-20.54
112,-20.26
113,-19.93
114,-19.56
115,-19.23
116,-18.89
117,-18.65
118,-18.37
119,-18.16
120,-17.88
121,-17.70
122,-17.52
123,-17.36
124,-17.18
125,-16.94
126,-16.69
127,-16.45
128,-16.20
129,-16.02
130,-15.84
131,-15.72
132,-15.66
133,-15.66
134,-15.69
135,-15.72
136,-15.72
137,-15.63
138,-15.53
139,-15.44
140,-15.26
141,-15.11
142,-14.95
143,-14.86
144,-14.80
145,-14.74
146,-14.68
147,-14.62
148,-14.53
149,-14.43
150,-14.31
151,-14.19
152,-14.01
153,-13.85
154,-13.67
155,-13.52
156,-13.34
157,-13.15
158,-12.97
159,-12.79
160,-12.54
161,-12.27
162,-11.99
163,-11.78
164,-11.60
165,-11.41
166,-11.26
167,-11.11
168,-11.05
169,-10.96
170,-10.83
171,-10.62
172,-10.44
173,-10.28
174,-10.13
175,-9.95
176,-9.74
177,-9.55
178,-9.40
179,-9.31
180,-9.28
181,-9.28
182,-9.28
183,-9.25
184,-9.22
185,-9.19
186,-9.06
187,-8.94
188,-8.76
189,-8.54
190,-8.30
191,-8.09
192,-7.90
193,-7.78
194,-7.69
195,-7.57
196,-7.48
197,-7.42
198,-7.39
199,-7.35
200,-7.26
201,-7.14
202,-6.99
203,-6.90
204,-6.84
205,-6.77
206,-6.68
207,-6.56
208,-6.47
209,-6.47
210,-6.53
211,-6.62
212,-6.71
213,-6.84
214,-6.93
215,-7.05
216,-7.14
217,-7.26
218,-7.35
219,-7.42
220,-7.42
221,-7.39
222,-7.39
223,-7.42
224,-7.45
225,-7.45
226,-7.48
227,-7.51
228,-7.54
229,-7.51
230,-7.48
231,-7.42
232,-7.35
233,-7.32
234,-7.32
235,-7.32
236,-7.32
237,-7.29
238,-7.20
239,-7.11
240,-7.02
241,-6.93
242,-6.84
243,-6.74
244,-6.71
245,-6.74
246,-6.77
247,-6.84
248,-6.87
249,-6.84
250,-6.77
251,-6.74
252,-6.74
253,-6.77
254,-6.84
255,-6.93
256,-6.99
257,-7.05
258,-7.08
259,-7.05
260,-6.96
261,-6.87
262,-6.77
263,-6.65
264,-6.50
265,-6.35
266,-6.23
267,-6.20
268,-6.23
269,-6.26
270,-6.32
271,-6.35
272,-6.35
273,-6.32
274,-6.23
275,-6.16
276,-6.10
277,-6.04
278,-5.98
279,-5.92
280,-5.92
281,-5.95
282,-6.01
283,-6.10
284,-6.16
285,-6.23
286,-6.32
287,-6.38
288,-6.41
289,-6.44
290,-6.47
291,-6.44
292,-6.41
293,-6.35
294,-6.32
295,-6.32
296,-6.32
297,-6.32
298,-6.35
299,-6.41
300,-6.47
301,-6.50
302,-6.53
303,-6.50
304,-6.41
305,-6.35
306,-6.26
307,-6.16
308,-6.07
309,-6.01
310,-5.95
311,-5.92
312,-5.89
313,-5.92
314,-5.95
315,-5.98
316,-5.95
317,-5.92
318,-5.98
319,-6.04
320,-6.10
321,-6.13
322,-6.13
323,-6.16
324,-6.20
325,-6.26
326,-6.29
327,-6.29
328,-6.26
329,-6.26
330,-6.29
331,-6.29
332,-6.26
333,-6.20
334,-6.20
335,-6.23
336,-6.26
337,-6.32
338,-6.35
339,-6.41
340,-6.50
341,-6.56
342,-6.65
343,-6.74
344,-6.87
345,-6.99
346,-7.11
347,-7.17
348,-7.29
349,-7.39
350,-7.42
351,-7.39
352,-7.26
353,-7.17
354,-7.08
355,-7.02
356,-6.99
357,-6.99
358,-6.99
359,-6.99
360,-6.96
361,-6.93
362,-6.87
363,-6.81
364,-6.77
365,-6.74
366,-6.77
367,-6.84
368,-6.90
369,-6.93
370,-6.90
371,-6.81
372,-6.71
373,-6.65
374,-6.59
375,-6.56
376,-6.53
377,-6.50
378,-6.47
379,-6.44
380,-6.38
381,-6.32
382,-6.26
383,-6.26
384,-6.26
385,-6.23
386,-6.16
387,-6.10
388,-6.07
389,-6.01
390,-5.98
391,-5.95
392,-5.92
393,-5.92
394,-5.98
395,-6.10
396,-6.32
397,-6.50
398,-6.71
399,-6.84
400,-6.96
401,-7.05
402,-7.11
403,-7.11
404,-7.11
405,-7.11
406,-7.17
407,-7.26
408,-7.32
409,-7.35
410,-7.35
411,-7.35
412,-7.39
413,-7.39
414,-7.35
415,-7.35
416,-7.35
417,-7.39
418,-7.42
419,-7.42
420,-7.45
421,-7.51
422,-7.51
423,-7.51
424,-7.57
425,-7.66
426,-7.81
427,-8.00
428,-8.21
429,-8.36
430,-8.48
431,-8.58
432,-8.64
433,-8.67
434,-8.70
435,-8.64
436,-8.51
437,-8.42
438,-8.36
439,-8.33
440,-8.27
441,-8.15
442,-8.03
443,-7.93
444,-7.90
445,-7.90
446,-7.87
447,-7.87
448,-7.84
449,-7.84
450,-7.81
451,-7.72
452,-7.63
453,-7.51
454,-7.42
455,-7.32
456,-7.23
457,-7.11
458,-6.99
459,-6.90
460,-6.87
461,-6.81
462,-6.71
463,-6.59
464,-6.53
465,-6.44
466,-6.32
467,-6.13
468,-5.95
469,-5.80
470,-5.65
471,-5.52
472,-5.43
473,-5.37
474,-5.31
475,-5.19
476,-5.04
477,-4.85
478,-4.70
479,-4.58
480,-4.58
481,-4.61
482,-4.70
483,-4.73
484,-4.76
485,-4.73
486,-4.70
487,-4.64
488,-4.61
489,-4.55
490,-4.52
491,-4.46
492,-4.43
493,-4.39
494,-4.36
495,-4.33
496,-4.27
497,-4.18
498,-4.06
499,-3.97
500,-3.91
501,-3.88
502,-3.91
503,-3.91
504,-3.94
505,-4.00
506,-4.03
507,-4.06
508,-4.09
509,-4.09
510,-4.06
511,-4.06
512,-4.03
513,-4.03
514,-4.06
515,-4.09
516,-4.12
517,-4.12
518,-4.15
519,-4.12
520,-4.15
521,-4.15
522,-4.24
523,-4.33
524,-4.46
525,-4.58
526,-4.73
527,-4.91
528,-5.07
529,-5.22
530,-5.37
531,-5.52
532,-5.65
533,-5.74
534,-5.77
535,-5.86
536,-5.98
537,-6.13
538,-6.29
539,-6.47
540,-6.65
541,-6.84
542,-7.02
543,-7.14
544,-7.17
545,-7.20
546,-7.17
547,-7.14
548,-7.05
549,-7.02
550,-7.02
551,-7.02
552,-7.02
553,-6.99
554,-6.99
555,-6.96
556,-6.96
557,-6.93
558,-6.87
559,-6.84
560,-6.81
561,-6.81
562,-6.81
563,-6.77
564,-6.74
565,-6.68
566,-6.65
567,-6.65
568,-6.65
569,-6.65
570,-6.62
571,-6.59
572,-6.50
573,-6.41
574,-6.32
575,-6.23
576,-6.07
577,-5.92
578,-5.80
579,-5.71
580,-5.62
581,-5.46
582,-5.25
583,-5.04
584,-4.82
585,-4.70
586,-4.64
587,-4.61
588,-4.58
589,-4.58
590,-4.61
591,-4.64
592,-4.64
593,-4.58
594,-4.49
595,-4.39
596,-4.36
597,-4.30
598,-4.24
599,-4.18
600,-4.12
601,-4.06
602,-4.00
603,-3.94
604,-3.94
605,-3.97
606,-3.97
607,-3.97
608,-3.94
609,-3.94
610,-3.91
611,-3.85
612,-3.75
613,-3.69
614,-3.60
615,-3.51
616,-3.42
617,-3.36
618,-3.36
619,-3.36
620,-3.36
621,-3.33
622,-3.30
623,-3.23
624,-3.14
625,-3.08
626,-2.99
627,-2.93
628,-2.87
629,-2.81
630,-2.72
631,-2.59
632,-2.47
633,-2.35
634,-2.26
635,-2.23
636,-2.23
637,-2.32
638,-2.41
639,-2.44
640,-2.44
641,-2.41
642,-2.38
643,-2.29
644,-2.20
645,-2.11
646,-2.04
647,-2.04
648,-2.14
649,-2.26
650,-2.35
651,-2.41
652,-2.50
653,-2.62
654,-2.75
655,-2.84
656,-2.93
657,-3.05
658,-3.17
659,-3.27
660,-3.36
661,-3.39
662,-3.42
663,-3.45
664,-3.48
665,-3.45
666,-3.36
667,-3.23
668,-3.14
669,-3.05
670,-3.02
671,-2.99
672,-3.02
673,-3.05
674,-3.14
675,-3.23
676,-3.30
677,-3.36
678,-3.42
679,-3.48
680,-3.57
681,-3.60
682,-3.60
683,-3.57
684,-3.54
685,-3.51
686,-3.48
687,-3.42
688,-3.33
689,-3.27
690,-3.27
691,-3.27
692,-3.27
693,-3.30
694,-3.30
695,-3.33
696,-3.36
697,-3.36
698,-3.33
699,-3.30
700,-3.23
701,-3.17
702,-3.11
703,-3.05
704,-2.99
705,-2.96
706,-2.96
707,-2.99
708,-3.05
709,-3.11
710,-3.14
711,-3.14
712,-3.08
713,-2.99
714,-2.96
715,-2.93
716,-2.90
717,-2.84
718,-2.78
719,-2.75
720,-2.69
721,-2.62
722,-2.56
723,-2.56
724,-2.50
725,-2.44
726,-2.38
727,-2.32
728,-2.29
729,-2.23
730,-2.20
731,-2.14
732,-2.17
733,-2.23
734,-2.32
735,-2.38
736,-2.44
737,-2.50
738,-2.53
739,-2.56
740,-2.59
741,-2.59
742,-2.59
743,-2.62
744,-2.66
745,-2.72
746,-2.81
747,-2.87
748,-2.93
749,-2.96
750,-3.05
751,-3.17
752,-3.33
753,-3.42
754,-3.48
755,-3.51
756,-3.57
757,-3.66
758,-3.78
759,-3.88
760,-3.94
761,-4.03
762,-4.12
763,-4.21
764,-4.30
765,-4.39
766,-4.46
767,-4.49
768,-4.46
769,-4.39
770,-4.36
771,-4.33
772,-4.36
773,-4.39
774,-4.43
775,-4.46
776,-4.46
777,-4.49
778,-4.49
779,-4.52
780,-4.55
781,-4.58
782,-4.58
783,-4.55
784,-4.49
785,-4.36
786,-4.24
787,-4.09
788,-3.97
789,-3.85
790,-3.72
791,-3.66
792,-3.72
793,-3.81
794,-3.94
795,-4.03
796,-4.09
797,-4.15
798,-4.18
799,-4.15
800,-4.12
801,-4.03
802,-3.94
803,-3.85
804,-3.78
805,-3.72
806,-3.69
807,-3.63
808,-3.60
809,-3.60
810,-3.63
811,-3.66
812,-3.69
813,-3.69
814,-3.66
815,-3.63
816,-3.54
817,-3.48
818,-3.42
819,-3.39
820,-3.36
821,-3.36
822,-3.33
823,-3.36
824,-3.39
825,-3.48
826,-3.57
827,-3.69
828,-3.78
829,-3.88
830,-3.94
831,-4.03
832,-4.15
833,-4.24
834,-4.30
835,-4.30
836,-4.30
837,-4.27
838,-4.27
839,-4.24
840,-4.15
841,-4.03
842,-3.91
843,-3.81
844,-3.81
845,-3.85
846,-3.88
847,-3.91
848,-3.94
849,-4.03
850,-4.06
851,-4.06
852,-4.03
853,-3.97
854,-3.94
855,-3.94
856,-3.91
857,-3.88
858,-3.88
859,-3.94
860,-4.00
861,-3.97
862,-3.94
863,-3.91
864,-3.94
865,-3.97
866,-4.00
867,-3.97
868,-3.94
869,-3.91
870,-3.94
871,-4.00
872,-4.09
873,-4.15
874,-4.24
875,-4.24
876,-4.24
877,-4.24
878,-4.30
879,-4.33
880,-4.33
881,-4.36
882,-4.46
883,-4.61
884,-4.79
885,-4.91
886,-5.00
887,-5.04
888,-5.07
889,-5.04
890,-4.97
891,-4.91
892,-4.85
893,-4.82
894,-4.79
895,-4.82
896,-4.79
897,-4.76
898,-4.67
899,-4.52
900,-4.36
901,-4.24
902,-4.12
903,-4.03
904,-3.97
905,-3.97
906,-4.03
907,-4.09
908,-4.15
909,-4.21
910,-4.27
911,-4.36
912,-4.36
913,-4.27
914,-4.18
915,-4.15
916,-4.12
917,-4.09
918,-4.06
919,-4.06
920,-4.09
921,-4.12
922,-4.15
923,-4.15
924,-4.12
925,-4.06
926,-3.97
927,-3.94
928,-3.91
929,-3.91
930,-3.88
931,-3.88
932,-3.85
933,-3.85
934,-3.88
935,-3.88
936,-3.88
937,-3.88
938,-3.91
939,-3.94
940,-3.97
941,-4.00
942,-4.06
943,-4.12
944,-4.18
945,-4.18
946,-4.09
947,-3.94
948,-3.75
949,-3.60
950,-3.48
951,-3.39
952,-3.36
953,-3.36
954,-3.39
955,-3.45
956,-3.54
957,-3.60
958,-3.66
959,-3.69
960,-3.66
961,-3.63
962,-3.51
963,-3.42
964,-3.36
965,-3.36
966,-3.39
967,-3.48
968,-3.63
969,-3.85
970,-4.03
971,-4.18
972,-4.27
973,-4.36
974,-4.39
975,-4.39
976,-4.39
977,-4.39
978,-4.36
979,-4.33
980,-4.30
981,-4.30
982,-4.27
983,-4.27
984,-4.27
985,-4.30
986,-4.33
987,-4.36
988,-4.43
989,-4.46
990,-4.46
991,-4.39
992,-4.33
993,-4.33
994,-4.30
995,-4.24
996,-4.18
997,-4.18
998,-4.21
999,-4.24
1000,-4.27
1001,-4.33
1002,-4.39
1003,-4.49
1004,-4.52
1005,-4.55
1006,-4.52
1007,-4.46
1008,-4.39
1009,-4.36
1010,-4.36
1011,-4.39
1012,-4.39
1013,-4.39
1014,-4.43
1015,-4.46
1016,-4.49
1017,-4.49
1018,-4.46
1019,-4.39
1020,-4.36
1021,-4.30
1022,-4.27
1023,-4.24
1024,-4.21
1025,-4.18
1026,-4.18
1027,-4.21
1028,-4.24
1029,-4.27
1030,-4.30
1031,-4.30
1032,-4.24
1033,-4.18
1034,-4.09
1035,-4.03
1036,-3.94
1037,-3.85
1038,-3.78
1039,-3.75
1040,-3.75
1041,-3.72
1042,-3.66
1043,-3.57
1044,-3.48
1045,-3.39
1046,-3.27
1047,-3.11
1048,-2.93
1049,-2.75
1050,-2.59
1051,-2.50
1052,-2.44
1053,-2.38
1054,-2.32
1055,-2.23
1056,-2.11
1057,-1.98
1058,-1.86
1059,-1.77
1060,-1.62
1061,-1.46
1062,-1.28
1063,-1.16
1064,-1.10
1065,-1.07
1066,-1.01
1067,-0.92
1068,-0.82
1069,-0.76
1070,-0.64
1071,-0.49
1072,-0.34
1073,-0.18
1074,-0.03
1075,0.12
1076,0.21
1077,0.27
1078,0.31
1079,0.34
1080,0.34
1081,0.34
1082,0.31
1083,0.24
1084,0.12
1085,-0.03
1086,-0.18
1087,-0.34
1088,-0.49
1089,-0.58
1090,-0.61
1091,-0.58
1092,-0.58
1093,-0.52
1094,-0.46
1095,-0.37
1096,-0.40
1097,-0.52
1098,-0.76
1099,-1.01
1100,-1.22
1101,-1.40
1102,-1.59
1103,-1.77
1104,-1.92
1105,-2.04
1106,-2.20
1107,-2.32
1108,-2.53
1109,-2.78
1110,-2.99
1111,-3.17
1112,-3.33
1113,-3.45
1114,-3.54
1115,-3.57
1116,-3.60
1117,-3.63
1118,-3.66
1119,-3.72
1120,-3.81
1121,-3.94
1122,-4.03
1123,-4.09
1124,-4.18
1125,-4.30
1126,-4.39
1127,-4.49
1128,-4.55
1129,-4.58
1130,-4.61
1131,-4.58
1132,-4.55
1133,-4.52
1134,-4.55
1135,-4.55
1136,-4.58
1137,-4.55
1138,-4.46
1139,-4.33
1140,-4.27
1141,-4.21
1142,-4.18
1143,-4.12
1144,-4.06
1145,-4.06
1146,-4.09
1147,-4.15
1148,-4.15
1149,-4.15
1150,-4.15
1151,-4.09
1152,-4.00
1153,-3.91
1154,-3.81
1155,-3.75
1156,-3.75
1157,-3.85
1158,-4.00
1159,-4.15
1160,-4.30
1161,-4.43
1162,-4.49
1163,-4.52
1164,-4.46
1165,-4.30
1166,-4.12
1167,-4.00
1168,-3.91
1169,-3.91
1170,-3.91
1171,-3.94
1172,-3.94
1173,-3.91
1174,-3.81
1175,-3.75
1176,-3.72
1177,-3.72
1178,-3.72
1179,-3.72
1180,-3.72
1181,-3.69
1182,-3.66
1183,-3.63
1184,-3.60
1185,-3.51
1186,-3.42
1187,-3.30
1188,-3.14
1189,-2.96
1190,-2.75
1191,-2.56
1192,-2.41
1193,-2.26
1194,-2.17
1195,-2.14
1196,-2.11
1197,-2.04
1198,-1.92
1199,-1.71
1200,-1.50
1201,-1.25
1202,-1.04
1203,-0.82
1204,-0.67
1205,-0.58
1206,-0.55
1207,-0.58
1208,-0.58
1209,-0.55
1210,-0.46
1211,-0.37
1212,-0.27
1213,-0.15
1214,-0.03
1215,0.06
1216,0.12
1217,0.06
1218,-0.03
1219,-0.12
1220,-0.15
1221,-0.18
1222,-0.18
1223,-0.18
1224,-0.09
1225,0.03
1226,0.12
1227,0.18
1228,0.15
1229,0.09
1230,0.00
1231,-0.09
1232,-0.21
1233,-0.37
1234,-0.52
1235,-0.61
1236,-0.64
1237,-0.67
1238,-0.70
1239,-0.73
1240,-0.73
1241,-0.73
1242,-0.76
1243,-0.85
1244,-0.95
1245,-1.04
1246,-1.10
1247,-1.13
1248,-1.16
1249,-1.16
1250,-1.13
1251,-1.07
1252,-1.04
1253,-1.01
1254,-1.01
1255,-1.04
1256,-1.07
1257,-1.10
1258,-1.13
1259,-1.19
1260,-1.28
1261,-1.37
1262,-1.46
1263,-1.56
1264,-1.65
1265,-1.74
1266,-1.77
1267,-1.80
1268,-1.86
1269,-1.92
1270,-2.01
1271,-2.08
1272,-2.14
1273,-2.17
1274,-2.20
1275,-2.20
1276,-2.23
1277,-2.23
1278,-2.17
1279,-2.08
1280,-2.01
1281,-1.98
1282,-1.95
1283,-1.92
1284,-1.89
1285,-1.89
1286,-1.92
1287,-1.92
1288,-1.89
1289,-1.92
1290,-1.98
1291,-2.11
1292,-2.23
1293,-2.38
1294,-2.50
1295,-2.62
1296,-2.72
1297,-2.78
1298,-2.87
1299,-2.96
1300,-3.02
1301,-2.99
1302,-2.96
1303,-2.93
1304,-2.90
1305,-2.84
1306,-2.78
1307,-2.75
1308,-2.81
1309,-2.87
1310,-2.93
1311,-2.99
1312,-3.08
1313,-3.17
1314,-3.23
1315,-3.20
1316,-3.14
1317,-3.11
1318,-3.14
1319,-3.17
1320,-3.20
1321,-3.27
1322,-3.30
1323,-3.36
1324,-3.45
1325,-3.57
1326,-3.69
1327,-3.85
1328,-3.97
1329,-4.09
1330,-4.18
1331,-4.27
1332,-4.33
1333,-4.39
1334,-4.43
1335,-4.46
1336,-4.49
1337,-4.46
1338,-4.43
1339,-4.36
1340,-4.33
1341,-4.30
1342,-4.27
1343,-4.21
1344,-4.18
1345,-4.18
1346,-4.15
1347,-4.15
1348,-4.12
1349,-4.09
1350,-4.06
1351,-4.06
1352,-4.06
1353,-4.09
1354,-4.12
1355,-4.18
1356,-4.30
1357,-4.36
1358,-4.39
1359,-4.36
1360,-4.30
1361,-4.27
1362,-4.24
1363,-4.24
1364,-4.27
1365,-4.30
1366,-4.36
1367,-4.36
1368,-4.36
1369,-4.36
1370,-4.33
1371,-4.27
1372,-4.21
1373,-4.18
1374,-4.21
1375,-4.21
1376,-4.18
1377,-4.15
1378,-4.12
1379,-4.03
1380,-3.94
1381,-3.81
1382,-3.66
1383,-3.57
1384,-3.51
1385,-3.48
1386,-3.48
1387,-3.48
1388,-3.54
1389,-3.63
1390,-3.69
1391,-3.78
1392,-3.85
1393,-3.88
1394,-3.88
1395,-3.81
1396,-3.75
1397,-3.66
1398,-3.60
1399,-3.48
1400,-3.39
1401,-3.33
1402,-3.30
1403,-3.27
1404,-3.30
1405,-3.39
1406,-3.54
1407,-3.69
1408,-3.75
1409,-3.78
1410,-3.81
1411,-3.81
1412,-3.81
1413,-3.75
1414,-3.75
1415,-3.78
1416,-3.88
1417,-3.91
1418,-3.88
1419,-3.78
1420,-3.72
1421,-3.66
1422,-3.63
1423,-3.66
1424,-3.72
1425,-3.85
1426,-3.91
1427,-3.97
1428,-3.97
1429,-3.97
1430,-3.94
1431,-3.81
1432,-3.66
1433,-3.51
1434,-3.39
1435,-3.30
1436,-3.23
1437,-3.20
1438,-3.20
1439,-3.23
1440,-3.27
1441,-3.30
1442,-3.30
1443,-3.30
1444,-3.27
1445,-3.27
1446,-3.27
1447,-3.27
1448,-3.30
1449,-3.33
1450,-3.36
1451,-3.36
1452,-3.36
1453,-3.33
1454,-3.30
1455,-3.20
1456,-3.14
1457,-3.14
1458,-3.14
1459,-3.20
1460,-3.23
1461,-3.27
1462,-3.33
1463,-3.39
1464,-3.45
1465,-3.45
1466,-3.42
1467,-3.39
1468,-3.36
1469,-3.36
1470,-3.33
1471,-3.30
1472,-3.27
1473,-3.27
1474,-3.30
1475,-3.30
1476,-3.23
1477,-3.17
1478,-3.08
1479,-3.02
1480,-2.93
1481,-2.84
1482,-2.78
1483,-2.84
1484,-2.93
1485,-3.05
1486,-3.14
1487,-3.23
1488,-3.36
1489,-3.48
1490,-3.57
1491,-3.60
1492,-3.63
1493,-3.66
1494,-3.69
1495,-3.75
1496,-3.78
1497,-3.85
1498,-3.88
1499,-3.94
1500,-4.00
1501,-4.09
1502,-4.18
1503,-4.24
1504,-4.33
1505,-4.46
1506,-4.61
1507,-4.73
1508,-4.88
1509,-5.00
1510,-5.07
1511,-5.04
1512,-4.94
1513,-4.85
1514,-4.76
1515,-4.70
1516,-4.70
1517,-4.73
1518,-4.82
1519,-4.88
1520,-4.91
1521,-4.91
1522,-4.94
1523,-4.94
1524,-4.97
1525,-4.97
1526,-4.94
1527,-4.94
1528,-4.91
1529,-4.91
1530,-4.88
1531,-4.85
1532,-4.82
1533,-4.76
1534,-4.70
1535,-4.70
1536,-4.70
1537,-4.73
1538,-4.67
1539,-4.61
1540,-4.49
1541,-4.39
1542,-4.27
1543,-4.09
1544,-3.91
1545,-3.81
1546,-3.78
1547,-3.78
1548,-3.81
1549,-3.81
1550,-3.78
1551,-3.72
1552,-3.57
1553,-3.39
1554,-3.20
1555,-3.08
1556,-2.99
1557,-2.96
1558,-2.93
1559,-2.93
1560,-2.90
1561,-2.84
1562,-2.75
1563,-2.66
1564,-2.50
1565,-2.32
1566,-2.20
1567,-2.08
1568,-1.98
1569,-1.89
1570,-1.83
1571,-1.80
1572,-1.77
1573,-1.71
1574,-1.65
1575,-1.59
1576,-1.56
1577,-1.53
1578,-1.50
1579,-1.46
1580,-1.43
1581,-1.43
1582,-1.43
1583,-1.46
1584,-1.43
1585,-1.37
1586,-1.31
1587,-1.28
1588,-1.22
1589,-1.13
1590,-0.98
1591,-0.85
1592,-0.73
1593,-0.64
1594,-0.58
1595,-0.58
1596,-0.64
1597,-0.70
1598,-0.70
1599,-0.64
1600,-0.52
1601,-0.37
1602,-0.18
1603,0.00
1604,0.18
1605,0.31
1606,0.37
1607,0.37
1608,0.34
1609,0.34
1610,0.31
1611,0.27
1612,0.24
1613,0.21
1614,0.18
1615,0.18
1616,0.15
1617,0.09
1618,0.03
1619,0.00
1620,-0.03
1621,-0.03
1622,-0.06
1623,-0.06
1624,-0.03
1625,0.00
1626,0.03
1627,0.09
1628,0.12
1629,0.12
1630,0.09
1631,0.03
1632,0.00
1633,0.00
1634,0.00
1635,0.00
1636,0.00
1637,-0.03
1638,-0.03
1639,-0.06
1640,-0.15
1641,-0.21
1642,-0.31
1643,-0.34
1644,-0.34
1645,-0.31
1646,-0.27
1647,-0.18
1648,-0.15
1649,-0.12
1650,-0.18
1651,-0.27
1652,-0.37
1653,-0.43
1654,-0.40
1655,-0.34
1656,-0.31
1657,-0.31
1658,-0.27
1659,-0.27
1660,-0.24
1661,-0.18
1662,-0.09
1663,0.03
1664,0.15
1665,0.27
1666,0.37
1667,0.46
1668,0.52
1669,0.55
1670,0.58
1671,0.58
1672,0.55
1673,0.55
1674,0.52
1675,0.49
1676,0.46
1677,0.46
1678,0.49
1679,0.49
1680,0.52
1681,0.55
1682,0.55
1683,0.52
1684,0.49
1685,0.52
1686,0.55
1687,0.64
1688,0.67
1689,0.73
1690,0.76
1691,0.82
1692,0.92
1693,1.01
1694,1.01
1695,0.95
1696,0.85
1697,0.76
1698,0.70
1699,0.64
1700,0.61
1701,0.61
1702,0.64
1703,0.70
1704,0.79
1705,0.89
1706,0.92
1707,0.95
1708,0.95
1709,0.92
1710,0.85
1711,0.70
1712,0.55
1713,0.43
1714,0.27
1715,0.12
1716,-0.03
1717,-0.21
1718,-0.37
1719,-0.52
1720,-0.61
1721,-0.64
1722,-0.67
1723,-0.67
1724,-0.64
1725,-0.64
1726,-0.67
1727,-0.70
1728,-0.79
1729,-0.92
1730,-1.07
1731,-1.25
1732,-1.40
1733,-1.56
1734,-1.62
1735,-1.65
1736,-1.68
1737,-1.71
1738,-1.74
1739,-1.74
1740,-1.77
1741,-1.86
1742,-1.95
1743,-2.01
1744,-2.04
1745,-2.04
1746,-2.04
1747,-2.04
1748,-2.08
1749,-2.11
1750,-2.20
1751,-2.29
1752,-2.41
1753,-2.53
1754,-2.66
1755,-2.72
1756,-2.72
1757,-2.69
1758,-2.62
1759,-2.66
1760,-2.69
1761,-2.75
1762,-2.78
1763,-2.81
1764,-2.84
1765,-2.84
1766,-2.81
1767,-2.72
1768,-2.62
1769,-2.53
1770,-2.50
1771,-2.47
1772,-2.50
1773,-2.56
1774,-2.59
1775,-2.62
1776,-2.69
1777,-2.75
1778,-2.78
1779,-2.75
1780,-2.66
1781,-2.62
1782,-2.62
1783,-2.69
1784,-2.75
1785,-2.81
1786,-2.87
1787,-2.93
1788,-2.99
1789,-2.99
1790,-2.96
1791,-2.90
1792,-2.84
1793,-2.78
1794,-2.72
1795,-2.75
1796,-2.81
1797,-2.87
1798,-2.93
1799,-2.99
1800,-3.08
1801,-3.14
1802,-3.17
1803,-3.14
1804,-3.11
1805,-3.11
1806,-3.17
1807,-3.23
1808,-3.30
1809,-3.39
1810,-3.45
1811,-3.51
1812,-3.51
1813,-3.45
1814,-3.45
1815,-3.48
1816,-3.57
1817,-3.69
1818,-3.81
1819,-3.94
1820,-4.09
1821,-4.18
1822,-4.21
1823,-4.15
1824,-4.12
1825,-4.06
1826,-4.03
1827,-4.03
1828,-4.09
1829,-4.18
1830,-4.33
1831,-4.46
1832,-4.61
1833,-4.67
1834,-4.73
1835,-4.73
1836,-4.76
1837,-4.79
1838,-4.85
1839,-4.91
1840,-5.00
1841,-5.10
1842,-5.19
1843,-5.31
1844,-5.43
1845,-5.49
1846,-5.49
1847,-5.46
1848,-5.46
1849,-5.49
1850,-5.58
1851,-5.65
1852,-5.71
1853,-5.77
1854,-5.80
1855,-5.83
1856,-5.80
1857,-5.74
1858,-5.74
1859,-5.77
1860,-5.80
1861,-5.80
1862,-5.80
1863,-5.83
1864,-5.86
1865,-5.89
1866,-5.89
1867,-5.89
1868,-5.92
1869,-5.98
1870,-6.01
1871,-5.98
1872,-5.92
1873,-5.83
1874,-5.77
1875,-5.74
1876,-5.71
1877,-5.68
1878,-5.65
1879,-5.62
1880,-5.52
1881,-5.43
1882,-5.34
1883,-5.31
1884,-5.22
1885,-5.13
1886,-5.00
1887,-4.88
1888,-4.79
1889,-4.70
1890,-4.58
1891,-4.43
1892,-4.30
1893,-4.24
1894,-4.18
1895,-4.09
1896,-4.03
1897,-4.00
1898,-4.00
1899,-4.03
1900,-4.03
1901,-4.03
1902,-4.06
1903,-4.09
1904,-4.06
1905,-4.03
1906,-4.00
1907,-3.94
1908,-3.91
1909,-3.85
1910,-3.81
1911,-3.78
1912,-3.75
1913,-3.75
1914,-3.78
1915,-3.78
1916,-3.75
1917,-3.75
1918,-3.81
1919,-3.88
1920,-3.94
1921,-4.00
1922,-4.06
1923,-4.12
1924,-4.18
1925,-4.21
1926,-4.24
1927,-4.21
1928,-4.24
1929,-4.27
1930,-4.36
1931,-4.43
1932,-4.52
1933,-4.58
1934,-4.67
1935,-4.79
1936,-4.91
1937,-5.04
1938,-5.13
1939,-5.22
1940,-5.25
1941,-5.22
1942,-5.19
1943,-5.16
1944,-5.07
1945,-4.94
1946,-4.85
1947,-4.79
1948,-4.73
1949,-4.67
1950,-4.58
1951,-4.52
1952,-4.46
1953,-4.39
1954,-4.36
1955,-4.30
1956,-4.24
1957,-4.21
1958,-4.15
1959,-4.09
1960,-4.00
1961,-3.94
1962,-3.88
1963,-3.85
1964,-3.78
1965,-3.69
1966,-3.63
1967,-3.60
1968,-3.54
1969,-3.48
1970,-3.36
1971,-3.23
1972,-3.11
1973,-2.99
1974,-2.90
1975,-2.87
1976,-2.90
1977,-2.96
1978,-3.05
1979,-3.17
1980,-3.27
1981,-3.36
1982,-3.45
1983,-3.48
1984,-3.48
1985,-3.48
1986,-3.45
1987,-3.45
1988,-3.42
1989,-3.42
1990,-3.45
1991,-3.51
1992,-3.60
1993,-3.66
1994,-3.72
1995,-3.78
1996,-3.88
1997,-3.94
1998,-3.94
1999,-3.94
2000,-3.94
2001,-3.91
2002,-3.78
2003,-3.63
2004,-3.42
2005,-3.27
2006,-3.14
2007,-3.08
2008,-3.08
2009,-3.14
2010,-3.23
2011,-3.36
2012,-3.45
2013,-3.48
2014,-3.48
2015,-3.45
2016,-3.39
2017,-3.33
2018,-3.23
2019,-3.17
2020,-3.08
2021,-3.02
2022,-2.96
2023,-2.93
2024,-2.93
2025,-2.96
2026,-2.99
2027,-3.05
2028,-3.14
2029,-3.23
2030,-3.30
2031,-3.33
2032,-3.39
2033,-3.42
2034,-3.42
2035,-3.42
2036,-3.42
2037,-3.42
2038,-3.39
2039,-3.33
2040,-3.30
2041,-3.30
2042,-3.27
2043,-3.27
2044,-3.27
2045,-3.27
2046,-3.30
2047,-3.27
2048,-3.20
2049,-3.08
2050,-2.99
2051,-2.90
2052,-2.87
2053,-2.87
2054,-2.90
2055,-2.96
2056,-3.02
2057,-3.08
2058,-3.11
2059,-3.14
2060,-3.11
2061,-3.08
2062,-3.05
2063,-2.99
2064,-2.96
2065,-2.99
2066,-3.02
2067,-3.11
2068,-3.17
2069,-3.17
2070,-3.17
2071,-3.14
2072,-3.08
2073,-3.02
2074,-2.93
2075,-2.87
2076,-2.84
2077,-2.84
2078,-2.84
2079,-2.84
2080,-2.78
2081,-2.69
2082,-2.56
2083,-2.38
2084,-2.20
2085,-2.04
2086,-1.89
2087,-1.77
2088,-1.68
2089,-1.65
2090,-1.62
2091,-1.59
2092,-1.59
2093,-1.59
2094,-1.59
2095,-1.62
2096,-1.62
2097,-1.65
2098,-1.59
2099,-1.53
2100,-1.53
2101,-1.56
2102,-1.65
2103,-1.74
2104,-1.83
2105,-1.92
2106,-1.95
2107,-1.95
2108,-1.89
2109,-1.77
2110,-1.71
2111,-1.65
2112,-1.65
2113,-1.68
2114,-1.74
2115,-1.86
2116,-1.95
2117,-1.98
2118,-1.95
2119,-1.89
2120,-1.83
2121,-1.77
2122,-1.68
2123,-1.59
2124,-1.43
2125,-1.31
2126,-1.19
2127,-1.13
2128,-1.04
2129,-0.95
2130,-0.89
2131,-0.85
2132,-0.79
2133,-0.67
2134,-0.46
2135,-0.31
2136,-0.24
2137,-0.21
2138,-0.18
2139,-0.15
2140,-0.15
2141,-0.18
2142,-0.18
2143,-0.18
2144,-0.24
2145,-0.31
2146,-0.37
2147,-0.43
2148,-0.46
2149,-0.52
2150,-0.58
2151,-0.64
2152,-0.67
2153,-0.67
2154,-0.70
2155,-0.73
2156,-0.76
2157,-0.82
2158,-0.92
2159,-0.98
2160,-1.07
2161,-1.13
2162,-1.16
2163,-1.22
2164,-1.28
2165,-1.31
2166,-1.31
2167,-1.31
2168,-1.37
2169,-1.43
2170,-1.56
2171,-1.65
2172,-1.74
2173,-1.86
2174,-1.98
2175,-2.08
2176,-2.14
2177,-2.20
2178,-2.29
2179,-2.41
2180,-2.53
2181,-2.62
2182,-2.75
2183,-2.81
2184,-2.87
2185,-2.84
2186,-2.84
2187,-2.84
2188,-2.87
2189,-2.90
2190,-2.93
2191,-2.96
2192,-2.99
2193,-2.99
2194,-2.96
2195,-2.87
2196,-2.78
2197,-2.72
2198,-2.66
2199,-2.62
2200,-2.62
2201,-2.66
2202,-2.72
2203,-2.75
2204,-2.75
2205,-2.75
2206,-2.72
2207,-2.72
2208,-2.69
2209,-2.69
2210,-2.69
2211,-2.75
2212,-2.81
2213,-2.81
2214,-2.78
2215,-2.69
2216,-2.53
2217,-2.38
2218,-2.17
2219,-1.95
2220,-1.83
2221,-1.74
2222,-1.65
2223,-1.53
2224,-1.43
2225,-1.37
2226,-1.31
2227,-1.16
2228,-1.01
2229,-0.89
2230,-0.82
2231,-0.79
2232,-0.79
2233,-0.79
2234,-0.82
2235,-0.85
2236,-0.92
2237,-0.98
2238,-1.04
2239,-1.10
2240,-1.13
2241,-1.13
2242,-1.16
2243,-1.19
2244,-1.19
2245,-1.07
2246,-0.92
2247,-0.76
2248,-0.61
2249,-0.46
2250,-0.37
2251,-0.34
2252,-0.34
2253,-0.37
2254,-0.40
2255,-0.43
2256,-0.43
2257,-0.40
2258,-0.37
2259,-0.31
2260,-0.21
2261,-0.15
2262,-0.12
2263,-0.12
2264,-0.09
2265,-0.06
2266,-0.03
2267,-0.06
2268,-0.09
2269,-0.12
2270,-0.09
2271,-0.06
2272,-0.03
2273,-0.03
2274,-0.06
2275,-0.06
2276,0.00
2277,0.12
2278,0.27
2279,0.40
2280,0.55
2281,0.67
2282,0.76
2283,0.79
2284,0.79
2285,0.76
2286,0.67
2287,0.55
2288,0.46
2289,0.43
2290,0.46
2291,0.55
2292,0.58
2293,0.61
2294,0.61
2295,0.61
2296,0.61
2297,0.58
2298,0.55
2299,0.52
2300,0.49
2301,0.49
2302,0.52
2303,0.55
2304,0.55
2305,0.55
2306,0.46
2307,0.37
2308,0.21
2309,0.09
2310,0.03
2311,-0.03
2312,-0.09
2313,-0.18
2314,-0.34
2315,-0.46
2316,-0.58
2317,-0.70
2318,-0.85
2319,-1.04
2320,-1.19
2321,-1.28
2322,-1.37
2323,-1.40
2324,-1.43
2325,-1.46
2326,-1.56
2327,-1.68
2328,-1.83
2329,-1.92
2330,-2.01
2331,-2.14
2332,-2.26
2333,-2.32
2334,-2.38
2335,-2.41
2336,-2.47
2337,-2.59
2338,-2.72
2339,-2.78
2340,-2.81
2341,-2.81
2342,-2.78
2343,-2.72
2344,-2.62
2345,-2.50
2346,-2.35
2347,-2.20
2348,-2.08
2349,-1.98
2350,-1.92
2351,-1.89
2352,-1.89
2353,-1.92
2354,-1.95
2355,-2.01
2356,-2.01
2357,-2.04
2358,-2.04
2359,-2.04
2360,-1.98
2361,-1.89
2362,-1.80
2363,-1.77
2364,-1.80
2365,-1.86
2366,-1.92
2367,-1.95
2368,-1.95
2369,-1.92
2370,-1.89
2371,-1.83
2372,-1.80
2373,-1.74
2374,-1.68
2375,-1.65
2376,-1.62
2377,-1.62
2378,-1.56
2379,-1.53
2380,-1.53
2381,-1.59
2382,-1.65
2383,-1.71
2384,-1.74
2385,-1.74
2386,-1.74
2387,-1.68
2388,-1.65
2389,-1.62
2390,-1.59
2391,-1.59
2392,-1.65
2393,-1.74
2394,-1.80
2395,-1.86
2396,-1.89
2397,-1.95
2398,-1.98
2399,-2.01
2400,-2.08
2401,-2.14
2402,-2.20
2403,-2.26
2404,-2.32
2405,-2.38
2406,-2.44
2407,-2.50
2408,-2.56
2409,-2.66
2410,-2.72
2411,-2.78
2412,-2.84
2413,-2.90
2414,-2.90
2415,-2.84
2416,-2.78
2417,-2.69
2418,-2.56
2419,-2.47
2420,-2.35
2421,-2.29
2422,-2.23
2423,-2.23
2424,-2.23
2425,-2.29
2426,-2.32
2427,-2.32
2428,-2.29
2429,-2.26
2430,-2.23
2431,-2.20
2432,-2.23
2433,-2.29
2434,-2.32
2435,-2.38
2436,-2.44
2437,-2.50
2438,-2.53
2439,-2.53
2440,-2.53
2441,-2.53
2442,-2.56
2443,-2.59
2444,-2.56
2445,-2.47
2446,-2.32
2447,-2.20
2448,-2.08
2449,-1.98
2450,-1.95
2451,-1.92
2452,-1.92
2453,-1.95
2454,-1.98
2455,-2.04
2456,-2.14
2457,-2.20
2458,-2.29
2459,-2.38
2460,-2.47
2461,-2.56
2462,-2.66
2463,-2.72
2464,-2.78
2465,-2.84
2466,-2.90
2467,-2.96
2468,-2.99
2469,-2.96
2470,-2.93
2471,-2.90
2472,-2.87
2473,-2.84
2474,-2.78
2475,-2.69
2476,-2.59
2477,-2.53
2478,-2.50
2479,-2.47
2480,-2.38
2481,-2.26
2482,-2.20
2483,-2.14
2484,-2.08
2485,-1.95
2486,-1.89
2487,-1.83
2488,-1.77
2489,-1.74
2490,-1.68
2491,-1.65
2492,-1.59
2493,-1.56
2494,-1.50
2495,-1.43
2496,-1.37
2497,-1.31
2498,-1.25
2499,-1.22
2500,-1.22
2501,-1.22
2502,-1.19
2503,-1.16
2504,-1.10
2505,-1.04
2506,-0.98
2507,-0.92
2508,-0.82
2509,-0.73
2510,-0.61
2511,-0.49
2512,-0.37
2513,-0.24
2514,-0.15
2515,-0.12
2516,-0.12
2517,-0.15
2518,-0.18
2519,-0.21
2520,-0.18
2521,-0.18
2522,-0.15
2523,-0.09
2524,-0.06
2525,0.00
2526,0.03
2527,0.09
2528,0.18
2529,0.27
2530,0.40
2531,0.52
2532,0.58
2533,0.61
2534,0.64
2535,0.67
2536,0.67
2537,0.61
2538,0.52
2539,0.46
2540,0.37
2541,0.34
2542,0.34
2543,0.37
2544,0.43
2545,0.46
2546,0.49
2547,0.46
2548,0.43
2549,0.37
2550,0.27
2551,0.21
2552,0.12
2553,0.09
2554,0.12
2555,0.18
2556,0.21
2557,0.21
2558,0.27
2559,0.37
2560,0.46
2561,0.52
2562,0.61
2563,0.70
2564,0.79
2565,0.85
2566,0.92
2567,1.01
2568,1.16
2569,1.31
2570,1.40
2571,1.43
2572,1.50
2573,1.50
2574,1.43
2575,1.34
2576,1.28
2577,1.28
2578,1.28
2579,1.25
2580,1.22
2581,1.19
2582,1.13
2583,1.07
2584,1.04
2585,1.07
2586,1.13
2587,1.22
2588,1.31
2589,1.46
2590,1.56
2591,1.62
2592,1.62
2593,1.53
2594,1.43
2595,1.34
2596,1.31
2597,1.34
2598,1.37
2599,1.43
2600,1.50
2601,1.56
2602,1.59
2603,1.62
2604,1.65
2605,1.71
2606,1.77
2607,1.80
2608,1.80
2609,1.80
2610,1.83
2611,1.89
2612,1.89
2613,1.89
2614,1.89
2615,1.95
2616,2.01
2617,2.08
2618,2.11
2619,2.14
2620,2.14
2621,2.11
2622,2.04
2623,2.01
2624,2.04
2625,2.08
2626,2.11
2627,2.11
2628,2.11
2629,2.11
2630,2.11
2631,2.11
2632,2.08
2633,2.01
2634,2.01
2635,2.04
2636,2.14
2637,2.26
2638,2.38
2639,2.50
2640,2.56
2641,2.62
2642,2.69
2643,2.69
2644,2.66
2645,2.62
2646,2.66
2647,2.75
2648,2.87
2649,2.96
2650,3.05
2651,3.17
2652,3.33
2653,3.42
2654,3.48
2655,3.51
2656,3.51
2657,3.48
2658,3.42
2659,3.36
2660,3.30
2661,3.27
2662,3.23
2663,3.27
2664,3.30
2665,3.33
2666,3.33
2667,3.27
2668,3.17
2669,3.08
2670,2.99
2671,2.93
2672,2.87
2673,2.81
2674,2.78
2675,2.72
2676,2.69
2677,2.59
2678,2.47
2679,2.29
2680,2.17
2681,2.08
2682,1.95
2683,1.86
2684,1.74
2685,1.68
2686,1.62
2687,1.56
2688,1.46
2689,1.37
2690,1.28
2691,1.22
2692,1.16
2693,1.13
2694,1.07
2695,1.01
2696,0.95
2697,0.92
2698,0.85
2699,0.73
2700,0.61
2701,0.55
2702,0.52
2703,0.52
2704,0.52
2705,0.58
2706,0.70
2707,0.82
2708,0.92
2709,0.98
2710,1.01
2711,1.01
2712,0.95
2713,0.79
2714,0.67
2715,0.55
2716,0.52
2717,0.46
2718,0.43
2719,0.43
2720,0.52
2721,0.67
2722,0.82
2723,0.92
2724,1.01
2725,1.07
2726,1.16
2727,1.19
2728,1.16
2729,1.04
2730,0.95
2731,0.89
2732,0.85
2733,0.82
2734,0.70
2735,0.58
2736,0.46
2737,0.43
2738,0.40
2739,0.34
2740,0.31
2741,0.27
2742,0.31
2743,0.37
2744,0.49
2745,0.61
2746,0.76
2747,0.89
2748,0.98
2749,1.07
2750,1.10
2751,1.07
2752,0.98
2753,0.82
2754,0.67
2755,0.49
2756,0.34
2757,0.24
2758,0.18
2759,0.15
2760,0.18
2761,0.24
2762,0.27
2763,0.24
2764,0.15
2765,0.06
2766,-0.09
2767,-0.21
2768,-0.37
2769,-0.49
2770,-0.58
2771,-0.61
2772,-0.58
2773,-0.58
2774,-0.58
2775,-0.58
2776,-0.61
2777,-0.70
2778,-0.82
2779,-0.95
2780,-1.04
2781,-1.10
2782,-1.13
2783,-1.13
2784,-1.16
2785,-1.13
2786,-1.10
2787,-1.04
2788,-1.01
2789,-0.98
2790,-0.95
2791,-0.92
2792,-0.89
2793,-0.92
2794,-0.95
2795,-0.98
2796,-1.01
2797,-1.01
2798,-0.98
2799,-0.95
2800,-0.92
2801,-0.85
2802,-0.76
2803,-0.73
2804,-0.70
2805,-0.73
2806,-0.76
2807,-0.82
2808,-0.89
2809,-0.98
2810,-1.10
2811,-1.19
2812,-1.25
2813,-1.31
2814,-1.34
2815,-1.37
2816,-1.37
2817,-1.31
2818,-1.22
2819,-1.19
2820,-1.19
2821,-1.19
2822,-1.19
2823,-1.13
2824,-1.07
2825,-1.04
2826,-1.01
2827,-0.98
2828,-0.95
2829,-0.98
2830,-1.04
2831,-1.13
2832,-1.22
2833,-1.31
2834,-1.43
2835,-1.59
2836,-1.71
2837,-1.80
2838,-1.83
2839,-1.83
2840,-1.83
2841,-1.83
2842,-1.86
2843,-1.89
2844,-1.98
2845,-2.08
2846,-2.17
2847,-2.23
2848,-2.26
2849,-2.29
2850,-2.26
2851,-2.23
2852,-2.20
2853,-2.14
2854,-2.11
2855,-2.11
2856,-2.14
2857,-2.14
2858,-2.17
2859,-2.23
2860,-2.26
2861,-2.32
2862,-2.38
2863,-2.44
2864,-2.47
2865,-2.44
2866,-2.41
2867,-2.38
2868,-2.35
2869,-2.32
2870,-2.29
2871,-2.29
2872,-2.32
2873,-2.35
2874,-2.38
2875,-2.41
2876,-2.35
2877,-2.29
2878,-2.17
2879,-2.01
2880,-1.89
2881,-1.77
2882,-1.71
2883,-1.65
2884,-1.59
2885,-1.56
2886,-1.56
2887,-1.56
2888,-1.56
2889,-1.59
2890,-1.65
2891,-1.68
2892,-1.71
2893,-1.74
2894,-1.80
2895,-1.86
2896,-1.86
2897,-1.83
2898,-1.77
2899,-1.74
2900,-1.68
2901,-1.56
2902,-1.43
2903,-1.40
2904,-1.43
2905,-1.46
2906,-1.53
2907,-1.62
2908,-1.74
2909,-1.83
2910,-1.89
2911,-1.92
2912,-1.92
2913,-1.89
2914,-1.89
2915,-1.89
2916,-1.86
2917,-1.83
2918,-1.74
2919,-1.68
2920,-1.65
2921,-1.65
2922,-1.65
2923,-1.62
2924,-1.59
2925,-1.50
2926,-1.40
2927,-1.28
2928,-1.13
2929,-1.01
2930,-0.95
2931,-0.92
2932,-0.95
2933,-0.98
2934,-1.07
2935,-1.16
2936,-1.16
2937,-1.10
2938,-1.01
2939,-0.92
2940,-0.89
2941,-0.92
2942,-0.95
2943,-0.95
2944,-0.98
2945,-1.07
2946,-1.22
2947,-1.34
2948,-1.43
2949,-1.46
2950,-1.50
2951,-1.53
2952,-1.59
2953,-1.65
2954,-1.65
2955,-1.65
2956,-1.71
2957,-1.77
2958,-1.83
2959,-1.86
2960,-1.89
2961,-1.92
2962,-1.95
2963,-2.01
2964,-2.11
2965,-2.17
2966,-2.26
2967,-2.32
2968,-2.41
2969,-2.50
2970,-2.66
2971,-2.81
2972,-2.96
2973,-3.08
2974,-3.17
2975,-3.20
2976,-3.20
2977,-3.17
2978,-3.11
2979,-3.08
2980,-3.08
2981,-3.11
2982,-3.14
2983,-3.17
2984,-3.20
2985,-3.27
2986,-3.33
2987,-3.36
2988,-3.30
2989,-3.23
2990,-3.20
2991,-3.23
2992,-3.33
2993,-3.39
2994,-3.48
2995,-3.57
2996,-3.66
2997,-3.69
2998,-3.69
2999,-3.66
3000,-3.57
3001,-3.48
3002,-3.33
3003,-3.14
3004,-3.02
3005,-2.96
3006,-2.93
3007,-2.93
3008,-2.96
3009,-3.02
3010,-3.05
3011,-3.05
3012,-3.02
3013,-2.93
3014,-2.81
3015,-2.72
3016,-2.66
3017,-2.66
3018,-2.72
3019,-2.78
3020,-2.81
3021,-2.84
3022,-2.84
3023,-2.81
3024,-2.75
3025,-2.72
3026,-2.66
3027,-2.62
3028,-2.62
3029,-2.66
3030,-2.69
3031,-2.72
3032,-2.66
3033,-2.56
3034,-2.44
3035,-2.38
3036,-2.32
3037,-2.23
3038,-2.17
3039,-2.11
3040,-2.11
3041,-2.11
3042,-2.08
3043,-2.01
3044,-1.89
3045,-1.77
3046,-1.68
3047,-1.59
3048,-1.53
3049,-1.46
3050,-1.43
3051,-1.43
3052,-1.50
3053,-1.56
3054,-1.62
3055,-1.65
3056,-1.65
3057,-1.62
3058,-1.56
3059,-1.50
3060,-1.37
3061,-1.25
3062,-1.16
3063,-1.10
3064,-1.07
3065,-1.01
3066,-0.92
3067,-0.85
3068,-0.85
3069,-0.85
3070,-0.85
3071,-0.85
3072,-0.89
3073,-0.95
3074,-1.01
3075,-0.98
3076,-0.95
3077,-0.89
3078,-0.79
3079,-0.70
3080,-0.64
3081,-0.64
3082,-0.73
3083,-0.85
3084,-1.04
3085,-1.22
3086,-1.34
3087,-1.40
3088,-1.43
3089,-1.43
3090,-1.40
3091,-1.34
3092,-1.31
3093,-1.28
3094,-1.31
3095,-1.34
3096,-1.40
3097,-1.53
3098,-1.71
3099,-1.83
3100,-1.89
3101,-1.89
3102,-1.89
3103,-1.89
3104,-1.83
3105,-1.71
3106,-1.65
3107,-1.65
3108,-1.68
3109,-1.65
3110,-1.62
3111,-1.56
3112,-1.53
3113,-1.46
3114,-1.37
3115,-1.25
3116,-1.10
3117,-0.98
3118,-0.85
3119,-0.76
3120,-0.67
3121,-0.61
3122,-0.52
3123,-0.46
3124,-0.37
3125,-0.21
3126,-0.06
3127,0.09
3128,0.18
3129,0.24
3130,0.27
3131,0.27
3132,0.31
3133,0.31
3134,0.31
3135,0.31
3136,0.34
3137,0.43
3138,0.52
3139,0.55
3140,0.58
3141,0.58
3142,0.61
3143,0.64
3144,0.61
3145,0.55
3146,0.49
3147,0.49
3148,0.52
3149,0.49
3150,0.43
3151,0.37
3152,0.27
3153,0.24
3154,0.21
3155,0.15
3156,0.06
3157,0.00
3158,-0.06
3159,-0.09
3160,-0.15
3161,-0.24
3162,-0.37
3163,-0.46
3164,-0.55
3165,-0.64
3166,-0.73
3167,-0.82
3168,-0.89
3169,-0.95
3170,-1.01
3171,-1.07
3172,-1.10
3173,-1.13
3174,-1.13
3175,-1.13
3176,-1.16
3177,-1.19
3178,-1.22
3179,-1.19
3180,-1.16
3181,-1.07
3182,-0.98
3183,-0.92
3184,-0.89
3185,-0.89
3186,-0.92
3187,-0.95
3188,-1.04
3189,-1.13
3190,-1.19
3191,-1.25
3192,-1.28
3193,-1.31
3194,-1.31
3195,-1.28
3196,-1.25
3197,-1.28
3198,-1.31
3199,-1.34
3200,-1.37
3201,-1.34
3202,-1.25
3203,-1.13
3204,-1.01
3205,-0.92
3206,-0.89
3207,-0.89
3208,-0.85
3209,-0.89
3210,-0.95
3211,-1.07
3212,-1.19
3213,-1.25
3214,-1.25
3215,-1.19
3216,-1.13
3217,-1.07
3218,-1.04
3219,-1.07
3220,-1.10
3221,-1.13
3222,-1.10
3223,-1.07
3224,-1.04
3225,-1.01
3226,-1.01
3227,-0.98
3228,-0.95
3229,-0.92
3230,-0.92
3231,-1.01
3232,-1.07
3233,-1.16
3234,-1.22
3235,-1.28
3236,-1.28
3237,-1.28
3238,-1.28
3239,-1.31
3240,-1.40
3241,-1.53
3242,-1.68
3243,-1.83
3244,-2.04
3245,-2.23
3246,-2.44
3247,-2.59
3248,-2.69
3249,-2.69
3250,-2.66
3251,-2.59
3252,-2.56
3253,-2.50
3254,-2.47
3255,-2.47
3256,-2.47
3257,-2.47
3258,-2.47
3259,-2.44
3260,-2.44
3261,-2.41
3262,-2.35
3263,-2.29
3264,-2.29
3265,-2.32
3266,-2.35
3267,-2.38
3268,-2.38
3269,-2.38
3270,-2.38
3271,-2.38
3272,-2.35
3273,-2.32
3274,-2.29
3275,-2.29
3276,-2.32
3277,-2.35
3278,-2.35
3279,-2.35
3280,-2.32
3281,-2.32
3282,-2.29
3283,-2.29
3284,-2.32
3285,-2.38
3286,-2.44
3287,-2.50
3288,-2.53
3289,-2.56
3290,-2.56
3291,-2.53
3292,-2.44
3293,-2.35
3294,-2.20
3295,-2.04
3296,-1.86
3297,-1.71
3298,-1.59
3299,-1.50
3300,-1.40
3301,-1.34
3302,-1.28
3303,-1.28
3304,-1.28
3305,-1.31
3306,-1.31
3307,-1.31
3308,-1.31
3309,-1.31
3310,-1.31
3311,-1.28
3312,-1.22
3313,-1.16
3314,-1.10
3315,-1.01
3316,-0.89
3317,-0.79
3318,-0.67
3319,-0.61
3320,-0.58
3321,-0.55
3322,-0.58
3323,-0.67
3324,-0.79
3325,-0.92
3326,-1.01
3327,-1.04
3328,-1.04
3329,-1.01
3330,-0.95
3331,-0.89
3332,-0.79
3333,-0.73
3334,-0.70
3335,-0.70
3336,-0.67
3337,-0.64
3338,-0.64
3339,-0.67
3340,-0.70
3341,-0.73
3342,-0.76
3343,-0.82
3344,-0.89
3345,-0.92
3346,-0.89
3347,-0.85
3348,-0.85
3349,-0.85
3350,-0.85
3351,-0.82
3352,-0.76
3353,-0.73
3354,-0.70
3355,-0.73
3356,-0.76
3357,-0.82
3358,-0.92
3359,-1.07
3360,-1.22
3361,-1.43
3362,-1.59
3363,-1.71
3364,-1.77
3365,-1.80
3366,-1.83
3367,-1.89
3368,-1.92
3369,-1.98
3370,-2.11
3371,-2.23
3372,-2.32
3373,-2.35
3374,-2.41
3375,-2.47
3376,-2.56
3377,-2.59
3378,-2.56
3379,-2.56
3380,-2.53
3381,-2.53
3382,-2.50
3383,-2.41
3384,-2.29
3385,-2.20
3386,-2.14
3387,-2.11
3388,-2.11
3389,-2.08
3390,-2.08
3391,-2.14
3392,-2.29
3393,-2.44
3394,-2.59
3395,-2.75
3396,-2.87
3397,-2.90
3398,-2.93
3399,-2.90
3400,-2.87
3401,-2.81
3402,-2.81
3403,-2.81
3404,-2.84
3405,-2.84
3406,-2.84
3407,-2.81
3408,-2.78
3409,-2.72
3410,-2.69
3411,-2.62
3412,-2.56
3413,-2.50
3414,-2.41
3415,-2.44
3416,-2.50
3417,-2.66
3418,-2.81
3419,-2.90
3420,-2.99
3421,-3.08
3422,-3.14
3423,-3.17
3424,-3.08
3425,-2.96
3426,-2.81
3427,-2.69
3428,-2.53
3429,-2.41
3430,-2.32
3431,-2.23
3432,-2.20
3433,-2.20
3434,-2.20
3435,-2.23
3436,-2.29
3437,-2.35
3438,-2.41
3439,-2.38
3440,-2.35
3441,-2.32
3442,-2.26
3443,-2.17
3444,-2.08
3445,-1.95
3446,-1.80
3447,-1.62
3448,-1.50
3449,-1.40
3450,-1.34
3451,-1.31
3452,-1.28
3453,-1.31
3454,-1.34
3455,-1.40
3456,-1.46
3457,-1.53
3458,-1.56
3459,-1.56
3460,-1.59
3461,-1.56
3462,-1.53
3463,-1.46
3464,-1.46
3465,-1.46
3466,-1.50
3467,-1.46
3468,-1.43
3469,-1.40
3470,-1.37
3471,-1.37
3472,-1.40
3473,-1.43
3474,-1.53
3475,-1.68
3476,-1.89
3477,-2.11
3478,-2.23
3479,-2.32
3480,-2.41
3481,-2.50
3482,-2.56
3483,-2.59
3484,-2.62
3485,-2.69
3486,-2.78
3487,-2.90
3488,-2.99
3489,-3.08
3490,-3.20
3491,-3.30
3492,-3.36
3493,-3.42
3494,-3.48
3495,-3.54
3496,-3.63
3497,-3.72
3498,-3.75
3499,-3.78
3500,-3.81
3501,-3.81
3502,-3.78
3503,-3.75
3504,-3.66
3505,-3.60
3506,-3.57
3507,-3.57
3508,-3.60
3509,-3.54
3510,-3.42
3511,-3.30
3512,-3.17
3513,-3.05
3514,-2.93
3515,-2.75
3516,-2.62
3517,-2.53
3518,-2.50
3519,-2.47
3520,-2.44
3521,-2.38
3522,-2.29
3523,-2.20
3524,-2.08
3525,-1.92
3526,-1.74
3527,-1.53
3528,-1.28
3529,-1.04
3530,-0.82
3531,-0.61
3532,-0.40
3533,-0.21
3534,-0.06
3535,0.06
3536,0.12
3537,0.15
3538,0.21
3539,0.27
3540,0.37
3541,0.43
3542,0.52
3543,0.64
3544,0.76
3545,0.92
3546,1.04
3547,1.16
3548,1.25
3549,1.28
3550,1.31
3551,1.31
3552,1.28
3553,1.22
3554,1.16
3555,1.16
3556,1.19
3557,1.16
3558,1.13
3559,1.07
3560,0.98
3561,0.82
3562,0.61
3563,0.43
3564,0.31
3565,0.31
3566,0.34
3567,0.40
3568,0.43
3569,0.43
3570,0.37
3571,0.27
3572,0.06
3573,-0.18
3574,-0.43
3575,-0.64
3576,-0.85
3577,-1.04
3578,-1.25
3579,-1.37
3580,-1.50
3581,-1.59
3582,-1.68
3583,-1.80
3584,-1.89
3585,-1.98
3586,-2.04
3587,-2.11
3588,-2.14
3589,-2.17
3590,-2.17
3591,-2.17
3592,-2.23
3593,-2.32
3594,-2.44
3595,-2.53
3596,-2.59
3597,-2.66
3598,-2.69
3599,-2.69
3600,-2.66
3601,-2.62
3602,-2.56
3603,-2.50
3604,-2.41
3605,-2.32
3606,-2.23
3607,-2.11
3608,-1.95
3609,-1.83
3610,-1.74
3611,-1.65
3612,-1.56
3613,-1.53
3614,-1.50
3615,-1.53
3616,-1.56
3617,-1.59
3618,-1.62
3619,-1.62
3620,-1.59
3621,-1.56
3622,-1.46
3623,-1.40
3624,-1.34
3625,-1.25
3626,-1.13
3627,-0.95
3628,-0.76
3629,-0.67
3630,-0.58
3631,-0.49
3632,-0.49
3633,-0.52
3634,-0.55
3635,-0.55
3636,-0.52
3637,-0.43
3638,-0.40
3639,-0.37
3640,-0.34
3641,-0.31
3642,-0.34
3643,-0.40
3644,-0.46
3645,-0.52
3646,-0.49
3647,-0.46
3648,-0.43
3649,-0.43
3650,-0.46
3651,-0.49
3652,-0.58
3653,-0.70
3654,-0.79
3655,-0.82
3656,-0.85
3657,-0.82
3658,-0.79
3659,-0.76
3660,-0.73
3661,-0.73
3662,-0.70
3663,-0.70
3664,-0.67
3665,-0.67
3666,-0.64
3667,-0.61
3668,-0.58
3669,-0.55
3670,-0.49
3671,-0.46
3672,-0.46
3673,-0.49
3674,-0.49
3675,-0.49
3676,-0.43
3677,-0.37
3678,-0.34
3679,-0.34
3680,-0.34
3681,-0.34
3682,-0.31
3683,-0.31
3684,-0.27
3685,-0.21
3686,-0.15
3687,-0.09
3688,0.00
3689,0.06
3690,0.06
3691,0.00
3692,-0.09
3693,-0.18
3694,-0.21
3695,-0.21
3696,-0.21
3697,-0.21
3698,-0.18
3699,-0.12
3700,-0.06
3701,-0.06
3702,-0.09
3703,-0.15
3704,-0.24
3705,-0.34
3706,-0.34
3707,-0.31
3708,-0.27
3709,-0.34
3710,-0.43
3711,-0.58
3712,-0.73
3713,-0.89
3714,-1.04
3715,-1.19
3716,-1.31
3717,-1.34
3718,-1.37
3719,-1.34
3720,-1.37
3721,-1.37
3722,-1.46
3723,-1.59
3724,-1.74
3725,-1.86
3726,-1.95
3727,-2.08
3728,-2.17
3729,-2.26
3730,-2.29
3731,-2.29
3732,-2.26
3733,-2.26
3734,-2.26
3735,-2.29
3736,-2.32
3737,-2.38
3738,-2.41
3739,-2.47
3740,-2.50
3741,-2.53
3742,-2.50
3743,-2.44
3744,-2.38
3745,-2.32
3746,-2.29
3747,-2.23
3748,-2.17
3749,-2.11
3750,-2.14
3751,-2.23
3752,-2.35
3753,-2.41
3754,-2.47
3755,-2.50
3756,-2.56
3757,-2.59
3758,-2.56
3759,-2.47
3760,-2.38
3761,-2.38
3762,-2.41
3763,-2.50
3764,-2.53
3765,-2.53
3766,-2.53
3767,-2.56
3768,-2.62
3769,-2.69
3770,-2.75
3771,-2.75
3772,-2.78
3773,-2.87
3774,-2.96
3775,-3.02
3776,-3.02
3777,-2.99
3778,-2.90
3779,-2.84
3780,-2.81
3781,-2.81
3782,-2.78
3783,-2.72
3784,-2.66
3785,-2.62
3786,-2.59
3787,-2.53
3788,-2.44
3789,-2.32
3790,-2.23
3791,-2.14
3792,-2.11
3793,-2.08
3794,-2.04
3795,-2.01
3796,-2.04
3797,-2.11
3798,-2.14
3799,-2.11
3800,-2.08
3801,-2.11
3802,-2.17
3803,-2.26
3804,-2.32
3805,-2.35
3806,-2.35
3807,-2.35
3808,-2.35
3809,-2.26
3810,-2.17
3811,-2.11
3812,-2.11
3813,-2.11
3814,-2.11
3815,-2.04
3816,-1.92
3817,-1.80
3818,-1.71
3819,-1.62
3820,-1.53
3821,-1.43
3822,-1.37
3823,-1.34
3824,-1.37
3825,-1.40
3826,-1.43
3827,-1.40
3828,-1.43
3829,-1.43
3830,-1.46
3831,-1.43
3832,-1.46
3833,-1.50
3834,-1.59
3835,-1.71
3836,-1.83
3837,-1.92
3838,-1.98
3839,-2.04
3840,-2.04
3841,-2.01
3842,-1.98
3843,-1.95
3844,-1.89
3845,-1.80
3846,-1.74
3847,-1.74
3848,-1.77
3849,-1.83
3850,-1.92
3851,-2.01
3852,-2.14
3853,-2.26
3854,-2.38
3855,-2.47
3856,-2.50
3857,-2.50
3858,-2.53
3859,-2.53
3860,-2.53
3861,-2.50
3862,-2.50
3863,-2.50
3864,-2.59
3865,-2.69
3866,-2.81
3867,-2.90
3868,-2.96
3869,-2.93
3870,-2.90
3871,-2.84
3872,-2.81
3873,-2.72
3874,-2.62
3875,-2.47
3876,-2.38
3877,-2.29
3878,-2.26
3879,-2.20
3880,-2.17
3881,-2.17
3882,-2.20
3883,-2.23
3884,-2.20
3885,-2.14
3886,-2.11
3887,-2.04
3888,-1.98
3889,-1.89
3890,-1.74
3891,-1.59
3892,-1.46
3893,-1.37
3894,-1.28
3895,-1.25
3896,-1.22
3897,-1.25
3898,-1.34
3899,-1.40
3900,-1.50
3901,-1.56
3902,-1.59
3903,-1.59
3904,-1.59
3905,-1.59
3906,-1.65
3907,-1.71
3908,-1.77
3909,-1.80
3910,-1.83
3911,-1.89
3912,-1.92
3913,-1.92
3914,-1.92
3915,-1.95
3916,-1.98
3917,-2.04
3918,-2.11
3919,-2.23
3920,-2.32
3921,-2.41
3922,-2.44
3923,-2.47
3924,-2.50
3925,-2.50
3926,-2.53
3927,-2.53
3928,-2.50
3929,-2.50
3930,-2.47
3931,-2.47
3932,-2.47
3933,-2.47
3934,-2.44
3935,-2.38
3936,-2.29
3937,-2.17
3938,-2.08
3939,-1.95
3940,-1.86
3941,-1.77
3942,-1.74
3943,-1.74
3944,-1.74
3945,-1.74
3946,-1.74
3947,-1.80
3948,-1.83
3949,-1.80
3950,-1.68
3951,-1.59
3952,-1.46
3953,-1.37
3954,-1.25
3955,-1.13
3956,-1.04
3957,-1.01
3958,-1.01
3959,-1.01
3960,-1.01
3961,-1.04
3962,-1.07
3963,-1.07
3964,-1.04
3965,-1.04
3966,-1.04
3967,-1.04
3968,-0.98
3969,-0.89
3970,-0.79
3971,-0.76
3972,-0.73
3973,-0.70
3974,-0.67
3975,-0.67
3976,-0.64
3977,-0.64
3978,-0.67
3979,-0.73
3980,-0.76
3981,-0.79
3982,-0.85
3983,-0.95
3984,-1.01
3985,-1.04
3986,-1.07
3987,-1.07
3988,-1.01
3989,-0.92
3990,-0.79
3991,-0.70
3992,-0.64
3993,-0.61
3994,-0.58
3995,-0.58
3996,-0.61
3997,-0.58
3998,-0.52
3999,-0.40
4000,-0.21
4001,0.03
4002,0.24
4003,0.40
4004,0.49
4005,0.52
4006,0.49
4007,0.46
4008,0.37
4009,0.27
4010,0.21
4011,0.18
4012,0.21
4013,0.24
4014,0.21
4015,0.15
4016,0.09
4017,0.06
4018,0.00
4019,-0.06
4020,-0.06
4021,-0.06
4022,-0.06
4023,-0.09
4024,-0.15
4025,-0.18
4026,-0.21
4027,-0.21
4028,-0.15
4029,-0.03
4030,0.09
4031,0.15
4032,0.18
4033,0.15
4034,0.09
4035,0.00
4036,-0.09
4037,-0.21
4038,-0.31
4039,-0.37
4040,-0.43
4041,-0.49
4042,-0.52
4043,-0.55
4044,-0.55
4045,-0.49
4046,-0.43
4047,-0.37
4048,-0.31
4049,-0.27
4050,-0.27
4051,-0.27
4052,-0.31
4053,-0.37
4054,-0.43
4055,-0.46
4056,-0.43
4057,-0.40
4058,-0.43
4059,-0.46
4060,-0.49
4061,-0.52
4062,-0.61
4063,-0.76
4064,-0.95
4065,-1.13
4066,-1.28
4067,-1.40
4068,-1.50
4069,-1.59
4070,-1.65
4071,-1.68
4072,-1.71
4073,-1.71
4074,-1.68
4075,-1.68
4076,-1.68
4077,-1.65
4078,-1.59
4079,-1.50
4080,-1.40
4081,-1.37
4082,-1.37
4083,-1.43
4084,-1.46
4085,-1.53
4086,-1.59
4087,-1.65
4088,-1.65
4089,-1.62
4090,-1.59
4091,-1.59
4092,-1.56
4093,-1.53
4094,-1.59
4095,-1.68
4096,-1.83
4097,-1.92
4098,-2.01
4099,-2.08
4100,-2.17
4101,-2.26
4102,-2.35
4103,-2.35
4104,-2.35
4105,-2.35
4106,-2.38
4107,-2.44
4108,-2.47
4109,-2.50
4110,-2.56
4111,-2.62
4112,-2.66
4113,-2.62
4114,-2.59
4115,-2.56
4116,-2.59
4117,-2.62
4118,-2.72
4119,-2.78
4120,-2.87
4121,-2.99
4122,-3.08
4123,-3.11
4124,-3.11
4125,-3.11
4126,-3.14
4127,-3.20
4128,-3.20
4129,-3.20
4130,-3.20
4131,-3.23
4132,-3.30
4133,-3.33
4134,-3.23
4135,-3.11
4136,-2.96
4137,-2.87
4138,-2.81
4139,-2.75
4140,-2.66
4141,-2.56
4142,-2.50
4143,-2.44
4144,-2.38
4145,-2.29
4146,-2.17
4147,-2.08
4148,-1.98
4149,-1.92
4150,-1.86
4151,-1.80
4152,-1.74
4153,-1.65
4154,-1.59
4155,-1.53
4156,-1.46
4157,-1.46
4158,-1.40
4159,-1.34
4160,-1.28
4161,-1.31
4162,-1.37
4163,-1.43
4164,-1.40
4165,-1.37
4166,-1.34
4167,-1.28
4168,-1.22
4169,-1.16
4170,-1.10
4171,-1.04
4172,-1.07
4173,-1.07
4174,-1.16
4175,-1.28
4176,-1.43
4177,-1.62
4178,-1.80
4179,-1.95
4180,-2.08
4181,-2.20
4182,-2.29
4183,-2.38
4184,-2.44
4185,-2.47
4186,-2.53
4187,-2.56
4188,-2.62
4189,-2.69
4190,-2.81
4191,-2.90
4192,-3.02
4193,-3.11
4194,-3.17
4195,-3.27
4196,-3.33
4197,-3.36
4198,-3.36
4199,-3.36
4200,-3.36
4201,-3.30
4202,-3.27
4203,-3.27
4204,-3.23
4205,-3.20
4206,-3.17
4207,-3.20
4208,-3.23
4209,-3.27
4210,-3.27
4211,-3.23
4212,-3.20
4213,-3.17
4214,-3.14
4215,-3.08
4216,-3.02
4217,-2.99
4218,-2.96
4219,-2.99
4220,-3.02
4221,-3.05
4222,-3.02
4223,-3.02
4224,-3.02
4225,-3.02
4226,-3.05
4227,-3.02
4228,-2.96
4229,-2.90
4230,-2.87
4231,-2.87
4232,-2.87
4233,-2.84
4234,-2.81
4235,-2.81
4236,-2.84
4237,-2.84
4238,-2.87
4239,-2.87
4240,-2.90
4241,-2.99
4242,-3.14
4243,-3.27
4244,-3.39
4245,-3.48
4246,-3.57
4247,-3.63
4248,-3.66
4249,-3.69
4250,-3.66
4251,-3.60
4252,-3.57
4253,-3.54
4254,-3.54
4255,-3.57
4256,-3.57
4257,-3.57
4258,-3.57
4259,-3.54
4260,-3.54
4261,-3.51
4262,-3.48
4263,-3.48
4264,-3.48
4265,-3.48
4266,-3.48
4267,-3.45
4268,-3.45
4269,-3.45
4270,-3.45
4271,-3.42
4272,-3.42
4273,-3.42
4274,-3.45
4275,-3.54
4276,-3.63
4277,-3.75
4278,-3.78
4279,-3.75
4280,-3.72
4281,-3.66
4282,-3.63
4283,-3.54
4284,-3.45
4285,-3.36
4286,-3.33
4287,-3.33
4288,-3.36
4289,-3.36
4290,-3.33
4291,-3.36
4292,-3.45
4293,-3.57
4294,-3.72
4295,-3.81
4296,-3.91
4297,-3.97
4298,-4.06
4299,-4.12
4300,-4.21
4301,-4.27
4302,-4.33
4303,-4.43
4304,-4.52
4305,-4.58
4306,-4.61
4307,-4.58
4308,-4.49
4309,-4.36
4310,-4.24
4311,-4.12
4312,-4.03
4313,-3.97
4314,-3.97
4315,-4.03
4316,-4.09
4317,-4.12
4318,-4.15
4319,-4.15
4320,-4.18
4321,-4.15
4322,-4.12
4323,-4.06
4324,-4.06
4325,-4.03
4326,-4.03
4327,-4.00
4328,-4.00
4329,-4.06
4330,-4.12
4331,-4.18
4332,-4.21
4333,-4.24
4334,-4.27
4335,-4.30
4336,-4.30
4337,-4.27
4338,-4.24
4339,-4.18
4340,-4.09
4341,-4.00
4342,-3.91
4343,-3.81
4344,-3.75
4345,-3.69
4346,-3.63
4347,-3.54
4348,-3.48
4349,-3.45
4350,-3.45
4351,-3.39
4352,-3.30
4353,-3.27
4354,-3.23
4355,-3.23
4356,-3.27
4357,-3.30
4358,-3.39
4359,-3.51
4360,-3.57
4361,-3.63
4362,-3.69
4363,-3.72
4364,-3.72
4365,-3.63
4366,-3.54
4367,-3.51
4368,-3.48
4369,-3.48
4370,-3.51
4371,-3.51
4372,-3.54
4373,-3.57
4374,-3.63
4375,-3.72
4376,-3.81
4377,-3.94
4378,-4.06
4379,-4.18
4380,-4.27
4381,-4.33
4382,-4.36
4383,-4.43
4384,-4.46
4385,-4.49
4386,-4.46
4387,-4.46
4388,-4.49
4389,-4.52
4390,-4.55
4391,-4.55
4392,-4.52
4393,-4.52
4394,-4.55
4395,-4.61
4396,-4.70
4397,-4.79
4398,-4.91
4399,-5.04
4400,-5.13
4401,-5.19
4402,-5.25
4403,-5.31
4404,-5.34
4405,-5.34
4406,-5.40
4407,-5.46
4408,-5.58
4409,-5.71
4410,-5.74
4411,-5.77
4412,-5.74
4413,-5.71
4414,-5.71
4415,-5.68
4416,-5.68
4417,-5.68
4418,-5.68
4419,-5.68
4420,-5.68
4421,-5.62
4422,-5.52
4423,-5.46
4424,-5.40
4425,-5.34
4426,-5.31
4427,-5.28
4428,-5.25
4429,-5.25
4430,-5.31
4431,-5.34
4432,-5.34
4433,-5.25
4434,-5.16
4435,-5.07
4436,-5.04
4437,-5.00
4438,-4.97
4439,-4.91
4440,-4.85
4441,-4.82
4442,-4.82
4443,-4.82
4444,-4.82
4445,-4.79
4446,-4.73
4447,-4.67
4448,-4.64
4449,-4.58
4450,-4.52
4451,-4.52
4452,-4.55
4453,-4.61
4454,-4.67
4455,-4.73
4456,-4.82
4457,-4.94
4458,-5.04
4459,-5.07
4460,-5.00
4461,-4.91
4462,-4.82
4463,-4.70
4464,-4.55
4465,-4.39
4466,-4.27
4467,-4.18
4468,-4.12
4469,-4.09
4470,-4.09
4471,-4.09
4472,-4.09
4473,-4.06
4474,-4.00
4475,-4.00
4476,-4.00
4477,-4.06
4478,-4.06
4479,-4.03
4480,-3.97
4481,-3.91
4482,-3.85
4483,-3.75
4484,-3.60
4485,-3.48
4486,-3.42
4487,-3.36
4488,-3.30
4489,-3.27
4490,-3.20
4491,-3.17
4492,-3.11
4493,-3.11
4494,-3.11
4495,-3.17
4496,-3.23
4497,-3.27
4498,-3.27
4499,-3.27
4500,-3.27
4501,-3.23
4502,-3.14
4503,-3.05
4504,-2.96
4505,-2.90
4506,-2.87
4507,-2.78
4508,-2.75
4509,-2.75
4510,-2.81
4511,-2.87
4512,-2.93
4513,-2.96
4514,-2.99
4515,-3.08
4516,-3.11
4517,-3.08
4518,-3.02
4519,-2.96
4520,-2.93
4521,-2.93
4522,-2.90
4523,-2.87
4524,-2.84
4525,-2.81
4526,-2.78
4527,-2.72
4528,-2.69
4529,-2.69
4530,-2.66
4531,-2.66
4532,-2.69
4533,-2.75
4534,-2.84
4535,-2.93
4536,-2.99
4537,-3.05
4538,-3.11
4539,-3.20
4540,-3.27
4541,-3.30
4542,-3.27
4543,-3.23
4544,-3.20
4545,-3.17
4546,-3.14
4547,-3.08
4548,-3.02
4549,-2.99
4550,-2.99
4551,-2.99
4552,-3.02
4553,-3.02
4554,-3.05
4555,-3.11
4556,-3.20
4557,-3.23
4558,-3.20
4559,-3.14
4560,-3.11
4561,-3.08
4562,-3.05
4563,-3.02
4564,-2.99
4565,-2.93
4566,-2.84
4567,-2.78
4568,-2.69
4569,-2.62
4570,-2.59
4571,-2.53
4572,-2.50
4573,-2.47
4574,-2.47
4575,-2.47
4576,-2.44
4577,-2.41
4578,-2.38
4579,-2.41
4580,-2.44
4581,-2.50
4582,-2.56
4583,-2.62
4584,-2.72
4585,-2.81
4586,-2.90
4587,-2.93
4588,-2.96
4589,-2.96
4590,-2.99
4591,-3.02
4592,-3.05
4593,-3.05
4594,-3.02
4595,-2.99
4596,-2.96
4597,-2.96
4598,-2.96
4599,-2.96
4600,-2.96
4601,-2.99
4602,-3.08
4603,-3.17
4604,-3.23
4605,-3.30
4606,-3.33
4607,-3.39
4608,-3.45
4609,-3.51
4610,-3.54
4611,-3.54
4612,-3.57
4613,-3.60
4614,-3.66
4615,-3.69
4616,-3.69
4617,-3.69
4618,-3.72
4619,-3.78
4620,-3.81
4621,-3.81
4622,-3.78
4623,-3.78
4624,-3.78
4625,-3.78
4626,-3.81
4627,-3.88
4628,-3.91
4629,-3.97
4630,-4.00
4631,-4.03
4632,-4.06
4633,-4.09
4634,-4.06
4635,-4.00
4636,-3.94
4637,-3.94
4638,-3.97
4639,-3.97
4640,-4.00
4641,-4.03
4642,-4.06
4643,-4.12
4644,-4.21
4645,-4.30
4646,-4.43
4647,-4.58
4648,-4.73
4649,-4.85
4650,-5.04
4651,-5.19
4652,-5.31
4653,-5.43
4654,-5.49
4655,-5.55
4656,-5.62
4657,-5.68
4658,-5.74
4659,-5.80
4660,-5.80
4661,-5.80
4662,-5.80
4663,-5.83
4664,-5.86
4665,-5.89
4666,-5.95
4667,-6.07
4668,-6.20
4669,-6.29
4670,-6.38
4671,-6.44
4672,-6.47
4673,-6.47
4674,-6.44
4675,-6.44
4676,-6.47
4677,-6.53
4678,-6.56
4679,-6.59
4680,-6.65
4681,-6.71
4682,-6.74
4683,-6.74
4684,-6.77
4685,-6.84
4686,-6.93
4687,-7.02
4688,-7.14
4689,-7.26
4690,-7.35
4691,-7.39
4692,-7.35
4693,-7.32
4694,-7.23
4695,-7.11
4696,-6.99
4697,-6.87
4698,-6.77
4699,-6.71
4700,-6.65
4701,-6.59
4702,-6.50
4703,-6.44
4704,-6.35
4705,-6.29
4706,-6.23
4707,-6.16
4708,-6.07
4709,-5.95
4710,-5.89
4711,-5.89
4712,-5.92
4713,-5.98
4714,-6.01
4715,-6.07
4716,-6.16
4717,-6.20
4718,-6.20
4719,-6.13
4720,-6.10
4721,-6.13
4722,-6.16
4723,-6.20
4724,-6.23
4725,-6.26
4726,-6.29
4727,-6.32
4728,-6.29
4729,-6.29
4730,-6.29
4731,-6.35
4732,-6.35
4733,-6.35
4734,-6.35
4735,-6.35
4736,-6.38
4737,-6.35
4738,-6.26
4739,-6.23
4740,-6.26
4741,-6.35
4742,-6.44
4743,-6.50
4744,-6.53
4745,-6.62
4746,-6.71
4747,-6.84
4748,-6.93
4749,-6.96
4750,-6.96
4751,-6.93
4752,-6.90
4753,-6.81
4754,-6.71
4755,-6.62
4756,-6.56
4757,-6.53
4758,-6.50
4759,-6.50
4760,-6.50
4761,-6.56
4762,-6.59
4763,-6.59
4764,-6.56
4765,-6.50
4766,-6.44
4767,-6.41
4768,-6.35
4769,-6.29
4770,-6.23
4771,-6.23
4772,-6.23
4773,-6.29
4774,-6.35
4775,-6.32
4776,-6.29
4777,-6.23
4778,-6.16
4779,-6.07
4780,-6.01
4781,-5.98
4782,-6.01
4783,-6.07
4784,-6.10
4785,-6.10
4786,-5.98
4787,-5.74
4788,-5.46
4789,-5.19
4790,-4.97
4791,-4.76
4792,-4.61
4793,-4.58
4794,-4.64
4795,-4.76
4796,-4.85
4797,-4.85
4798,-4.79
4799,-4.70
4800,-4.58
4801,-4.46
4802,-4.30
4803,-4.15
4804,-4.09
4805,-4.06
4806,-4.09
4807,-4.15
4808,-4.24
4809,-4.33
4810,-4.36
4811,-4.30
4812,-4.21
4813,-4.12
4814,-4.06
4815,-4.06
4816,-4.12
4817,-4.18
4818,-4.27
4819,-4.33
4820,-4.43
4821,-4.55
4822,-4.64
4823,-4.70
4824,-4.79
4825,-4.85
4826,-4.91
4827,-4.91
4828,-4.94
4829,-4.97
4830,-5.00
4831,-5.04
4832,-5.04
4833,-5.04
4834,-5.04
4835,-5.07
4836,-5.13
4837,-5.22
4838,-5.28
4839,-5.34
4840,-5.37
4841,-5.37
4842,-5.34
4843,-5.28
4844,-5.16
4845,-5.07
4846,-4.94
4847,-4.85
4848,-4.76
4849,-4.67
4850,-4.61
4851,-4.64
4852,-4.73
4853,-4.82
4854,-4.91
4855,-5.04
4856,-5.19
4857,-5.28
4858,-5.34
4859,-5.34
4860,-5.37
4861,-5.43
4862,-5.46
4863,-5.46
4864,-5.49
4865,-5.52
4866,-5.62
4867,-5.71
4868,-5.77
4869,-5.80
4870,-5.77
4871,-5.71
4872,-5.62
4873,-5.49
4874,-5.40
4875,-5.37
4876,-5.43
4877,-5.58
4878,-5.71
4879,-5.83
4880,-5.95
4881,-6.04
4882,-6.07
4883,-6.01
4884,-5.92
4885,-5.86
4886,-5.77
4887,-5.68
4888,-5.62
4889,-5.62
4890,-5.68
4891,-5.74
4892,-5.77
4893,-5.80
4894,-5.83
4895,-5.86
4896,-5.86
4897,-5.83
4898,-5.83
4899,-5.83
4900,-5.86
4901,-5.86
4902,-5.83
4903,-5.77
4904,-5.68
4905,-5.55
4906,-5.46
4907,-5.37
4908,-5.37
4909,-5.40
4910,-5.46
4911,-5.55
4912,-5.62
4913,-5.68
4914,-5.74
4915,-5.74
4916,-5.71
4917,-5.58
4918,-5.43
4919,-5.28
4920,-5.22
4921,-5.16
4922,-5.10
4923,-5.04
4924,-5.04
4925,-5.07
4926,-5.04
4927,-4.97
4928,-4.88
4929,-4.82
4930,-4.82
4931,-4.85
4932,-4.85
4933,-4.88
4934,-4.91
4935,-4.94
4936,-4.97
4937,-5.00
4938,-4.97
4939,-4.94
4940,-4.85
4941,-4.79
4942,-4.73
4943,-4.67
4944,-4.64
4945,-4.61
4946,-4.61
4947,-4.67
4948,-4.70
4949,-4.67
4950,-4.64
4951,-4.64
4952,-4.61
4953,-4.58
4954,-4.52
4955,-4.43
4956,-4.39
4957,-4.36
4958,-4.36
4959,-4.36
4960,-4.33
4961,-4.21
4962,-4.06
4963,-3.85
4964,-3.63
4965,-3.51
4966,-3.45
4967,-3.45
4968,-3.48
4969,-3.54
4970,-3.63
4971,-3.72
4972,-3.78
4973,-3.78
4974,-3.78
4975,-3.75
4976,-3.69
4977,-3.69
4978,-3.72
4979,-3.85
4980,-4.00
4981,-4.12
4982,-4.24
4983,-4.33
4984,-4.43
4985,-4.46
4986,-4.43
4987,-4.39
4988,-4.30
4989,-4.21
4990,-4.12
4991,-4.06
4992,-4.00
4993,-3.94
4994,-3.85
4995,-3.81
4996,-3.81
4997,-3.85
4998,-3.94
4999,-4.06
5000,-4.15
5001,-4.21
5002,-4.24
5003,-4.27
5004,-4.21
5005,-4.12
5006,-4.00
5007,-3.94
5008,-3.97
5009,-4.06
5010,-4.18
5011,-4.27
5012,-4.36
5013,-4.43
5014,-4.49
5015,-4.52
5016,-4.52
5017,-4.49
5018,-4.39
5019,-4.30
5020,-4.21
5021,-4.21
5022,-4.21
5023,-4.21
5024,-4.21
5025,-4.21
5026,-4.24
5027,-4.27
5028,-4.30
5029,-4.33
5030,-4.36
5031,-4.36
5032,-4.33
5033,-4.33
5034,-4.39
5035,-4.49
5036,-4.55
5037,-4.55
5038,-4.52
5039,-4.43
5040,-4.39
5041,-4.33
5042,-4.30
5043,-4.24
5044,-4.15
5045,-4.09
5046,-4.03
5047,-4.00
5048,-3.88
5049,-3.72
5050,-3.54
5051,-3.45
5052,-3.36
5053,-3.30
5054,-3.23
5055,-3.23
5056,-3.27
5057,-3.33
5058,-3.39
5059,-3.48
5060,-3.54
5061,-3.57
5062,-3.60
5063,-3.60
5064,-3.63
5065,-3.69
5066,-3.72
5067,-3.72
5068,-3.72
5069,-3.75
5070,-3.78
5071,-3.85
5072,-3.94
5073,-4.06
5074,-4.15
5075,-4.24
5076,-4.27
5077,-4.33
5078,-4.36
5079,-4.39
5080,-4.39
5081,-4.36
5082,-4.33
5083,-4.27
5084,-4.24
5085,-4.21
5086,-4.18
5087,-4.21
5088,-4.30
5089,-4.49
5090,-4.70
5091,-4.91
5092,-5.07
5093,-5.13
5094,-5.16
5095,-5.13
5096,-5.04
5097,-4.88
5098,-4.73
5099,-4.55
5100,-4.46
5101,-4.43
5102,-4.46
5103,-4.46
5104,-4.43
5105,-4.36
5106,-4.33
5107,-4.24
5108,-4.12
5109,-4.00
5110,-3.94
5111,-3.94
5112,-4.00
5113,-4.06
5114,-4.09
5115,-4.12
5116,-4.15
5117,-4.15
5118,-4.09
5119,-4.00
5120,-3.85
5121,-3.72
5122,-3.63
5123,-3.60
5124,-3.57
5125,-3.57
5126,-3.63
5127,-3.69
5128,-3.75
5129,-3.75
5130,-3.72
5131,-3.69
5132,-3.69
5133,-3.72
5134,-3.75
5135,-3.81
5136,-3.85
5137,-3.91
5138,-4.00
5139,-4.09
5140,-4.15
5141,-4.15
5142,-4.15
5143,-4.15
5144,-4.18
5145,-4.21
5146,-4.24
5147,-4.33
5148,-4.46
5149,-4.58
5150,-4.67
5151,-4.73
5152,-4.82
5153,-4.91
5154,-4.97
5155,-5.00
5156,-5.00
5157,-5.04
5158,-5.07
5159,-5.07
5160,-5.04
5161,-5.00
5162,-4.97
5163,-4.97
5164,-4.94
5165,-4.91
5166,-4.88
5167,-4.91
5168,-4.94
5169,-5.00
5170,-5.04
5171,-5.07
5172,-5.04
5173,-4.97
5174,-4.94
5175,-4.94
5176,-4.94
5177,-4.91
5178,-4.88
5179,-4.91
5180,-4.94
5181,-4.97
5182,-4.94
5183,-4.94
5184,-4.91
5185,-4.94
5186,-4.97
5187,-5.04
5188,-5.13
5189,-5.25
5190,-5.34
5191,-5.43
5192,-5.46
5193,-5.46
5194,-5.43
5195,-5.43
5196,-5.43
5197,-5.43
5198,-5.46
5199,-5.55
5200,-5.68
5201,-5.83
5202,-5.98
5203,-6.13
5204,-6.23
5205,-6.32
5206,-6.41
5207,-6.44
5208,-6.47
5209,-6.47
5210,-6.53
5211,-6.56
5212,-6.56
5213,-6.50
5214,-6.41
5215,-6.29
5216,-6.16
5217,-6.07
5218,-6.01
5219,-6.01
5220,-6.04
5221,-6.10
5222,-6.20
5223,-6.32
5224,-6.41
5225,-6.44
5226,-6.47
5227,-6.44
5228,-6.38
5229,-6.29
5230,-6.20
5231,-6.07
5232,-5.95
5233,-5.83
5234,-5.74
5235,-5.68
5236,-5.65
5237,-5.65
5238,-5.68
5239,-5.71
5240,-5.74
5241,-5.71
5242,-5.68
5243,-5.65
5244,-5.68
5245,-5.74
5246,-5.83
5247,-5.92
5248,-6.01
5249,-6.10
5250,-6.20
5251,-6.29
5252,-6.41
5253,-6.50
5254,-6.62
5255,-6.71
5256,-6.84
5257,-6.93
5258,-6.93
5259,-6.90
5260,-6.90
5261,-6.99
5262,-7.05
5263,-7.11
5264,-7.17
5265,-7.20
5266,-7.26
5267,-7.29
5268,-7.32
5269,-7.35
5270,-7.42
5271,-7.51
5272,-7.60
5273,-7.69
5274,-7.78
5275,-7.81
5276,-7.84
5277,-7.84
5278,-7.81
5279,-7.75
5280,-7.69
5281,-7.66
5282,-7.69
5283,-7.75
5284,-7.84
5285,-7.87
5286,-7.90
5287,-7.90
5288,-7.93
5289,-7.97
5290,-8.00
5291,-8.03
5292,-8.03
5293,-7.97
5294,-7.90
5295,-7.81
5296,-7.75
5297,-7.72
5298,-7.72
5299,-7.72
5300,-7.72
5301,-7.75
5302,-7.84
5303,-7.93
5304,-8.03
5305,-8.06
5306,-8.09
5307,-8.06
5308,-8.09
5309,-8.12
5310,-8.18
5311,-8.24
5312,-8.27
5313,-8.27
5314,-8.27
5315,-8.27
5316,-8.30
5317,-8.27
5318,-8.24
5319,-8.18
5320,-8.18
5321,-8.21
5322,-8.24
5323,-8.24
5324,-8.27
5325,-8.27
5326,-8.21
5327,-8.06
5328,-7.90
5329,-7.75
5330,-7.63
5331,-7.54
5332,-7.45
5333,-7.39
5334,-7.39
5335,-7.48
5336,-7.54
5337,-7.60
5338,-7.72
5339,-7.84
5340,-7.97
5341,-8.03
5342,-8.06
5343,-8.12
5344,-8.15
5345,-8.18
5346,-8.15
5347,-8.09
5348,-8.03
5349,-8.00
5350,-8.03
5351,-8.00
5352,-7.97
5353,-7.93
5354,-7.97
5355,-8.03
5356,-8.06
5357,-8.06
5358,-8.12
5359,-8.15
5360,-8.15
5361,-8.12
5362,-8.06
5363,-7.97
5364,-7.84
5365,-7.72
5366,-7.66
5367,-7.69
5368,-7.72
5369,-7.75
5370,-7.75
5371,-7.75
5372,-7.78
5373,-7.75
5374,-7.66
5375,-7.54
5376,-7.42
5377,-7.35
5378,-7.32
5379,-7.29
5380,-7.26
5381,-7.23
5382,-7.20
5383,-7.20
5384,-7.17
5385,-7.05
5386,-6.96
5387,-6.87
5388,-6.81
5389,-6.77
5390,-6.74
5391,-6.68
5392,-6.65
5393,-6.62
5394,-6.56
5395,-6.44
5396,-6.29
5397,-6.20
5398,-6.13
5399,-6.10
5400,-6.07
5401,-6.04
5402,-6.04
5403,-6.07
5404,-6.07
5405,-5.98
5406,-5.83
5407,-5.71
5408,-5.62
5409,-5.52
5410,-5.49
5411,-5.46
5412,-5.49
5413,-5.58
5414,-5.68
5415,-5.77
5416,-5.77
5417,-5.77
5418,-5.77
5419,-5.80
5420,-5.83
5421,-5.86
5422,-5.89
5423,-5.95
5424,-5.98
5425,-6.07
5426,-6.20
5427,-6.32
5428,-6.41
5429,-6.50
5430,-6.53
5431,-6.59
5432,-6.65
5433,-6.68
5434,-6.62
5435,-6.56
5436,-6.50
5437,-6.47
5438,-6.41
5439,-6.32
5440,-6.23
5441,-6.13
5442,-6.04
5443,-5.89
5444,-5.74
5445,-5.58
5446,-5.52
5447,-5.49
5448,-5.46
5449,-5.43
5450,-5.43
5451,-5.52
5452,-5.62
5453,-5.71
5454,-5.74
5455,-5.74
5456,-5.80
5457,-5.86
5458,-5.92
5459,-5.95
5460,-5.98
5461,-6.01
5462,-6.10
5463,-6.16
5464,-6.23
5465,-6.26
5466,-6.32
5467,-6.41
5468,-6.53
5469,-6.62
5470,-6.68
5471,-6.77
5472,-6.87
5473,-6.90
5474,-6.93
5475,-6.90
5476,-6.93
5477,-6.96
5478,-6.99
5479,-7.05
5480,-7.08
5481,-7.11
5482,-7.14
5483,-7.20
5484,-7.23
5485,-7.20
5486,-7.14
5487,-7.08
5488,-7.02
5489,-7.05
5490,-7.08
5491,-7.08
5492,-7.11
5493,-7.14
5494,-7.08
5495,-6.99
5496,-6.90
5497,-6.84
5498,-6.81
5499,-6.74
5500,-6.68
5501,-6.62
5502,-6.53
5503,-6.44
5504,-6.32
5505,-6.20
5506,-6.07
5507,-5.98
5508,-5.89
5509,-5.83
5510,-5.80
5511,-5.77
5512,-5.80
5513,-5.83
5514,-5.80
5515,-5.74
5516,-5.62
5517,-5.52
5518,-5.46
5519,-5.40
5520,-5.31
5521,-5.22
5522,-5.16
5523,-5.13
5524,-5.07
5525,-4.97
5526,-4.85
5527,-4.73
5528,-4.64
5529,-4.58
5530,-4.55
5531,-4.58
5532,-4.61
5533,-4.67
5534,-4.67
5535,-4.64
5536,-4.55
5537,-4.46
5538,-4.36
5539,-4.33
5540,-4.33
5541,-4.39
5542,-4.49
5543,-4.61
5544,-4.73
5545,-4.85
5546,-4.94
5547,-4.94
5548,-4.91
5549,-4.82
5550,-4.79
5551,-4.76
5552,-4.79
5553,-4.82
5554,-4.91
5555,-5.00
5556,-5.13
5557,-5.25
5558,-5.37
5559,-5.43
5560,-5.52
5561,-5.62
5562,-5.68
5563,-5.68
5564,-5.65
5565,-5.58
5566,-5.52
5567,-5.43
5568,-5.37
5569,-5.34
5570,-5.37
5571,-5.43
5572,-5.49
5573,-5.55
5574,-5.65
5575,-5.71
5576,-5.77
5577,-5.83
5578,-5.89
5579,-5.95
5580,-6.04
5581,-6.13
5582,-6.23
5583,-6.29
5584,-6.32
5585,-6.38
5586,-6.44
5587,-6.50
5588,-6.59
5589,-6.65
5590,-6.68
5591,-6.71
5592,-6.77
5593,-6.84
5594,-6.90
5595,-6.93
5596,-6.93
5597,-6.93
5598,-6.96
5599,-7.02
5600,-7.08
5601,-7.14
5602,-7.17
5603,-7.20
5604,-7.23
5605,-7.26
5606,-7.29
5607,-7.29
5608,-7.32
5609,-7.35
5610,-7.42
5611,-7.51
5612,-7.63
5613,-7.75
5614,-7.90
5615,-8.00
5616,-8.09
5617,-8.12
5618,-8.09
5619,-8.00
5620,-7.90
5621,-7.84
5622,-7.75
5623,-7.69
5624,-7.66
5625,-7.69
5626,-7.72
5627,-7.75
5628,-7.78
5629,-7.84
5630,-7.93
5631,-8.06
5632,-8.15
5633,-8.24
5634,-8.36
5635,-8.48
5636,-8.61
5637,-8.67
5638,-8.70
5639,-8.70
5640,-8.67
5641,-8.64
5642,-8.58
5643,-8.51
5644,-8.48
5645,-8.42
5646,-8.39
5647,-8.33
5648,-8.27
5649,-8.21
5650,-8.18
5651,-8.12
5652,-8.03
5653,-7.90
5654,-7.81
5655,-7.75
5656,-7.72
5657,-7.75
5658,-7.78
5659,-7.81
5660,-7.84
5661,-7.90
5662,-7.93
5663,-7.90
5664,-7.84
5665,-7.75
5666,-7.60
5667,-7.48
5668,-7.39
5669,-7.32
5670,-7.32
5671,-7.39
5672,-7.48
5673,-7.60
5674,-7.75
5675,-7.84
5676,-7.90
5677,-7.90
5678,-7.87
5679,-7.81
5680,-7.78
5681,-7.72
5682,-7.72
5683,-7.78
5684,-7.90
5685,-8.06
5686,-8.15
5687,-8.18
5688,-8.21
5689,-8.21
5690,-8.21
5691,-8.18
5692,-8.15
5693,-8.09
5694,-8.06
5695,-8.00
5696,-7.97
5697,-7.90
5698,-7.87
5699,-7.81
5700,-7.72
5701,-7.63
5702,-7.57
5703,-7.51
5704,-7.48
5705,-7.48
5706,-7.54
5707,-7.66
5708,-7.78
5709,-7.90
5710,-7.97
5711,-7.97
5712,-7.90
5713,-7.81
5714,-7.66
5715,-7.54
5716,-7.45
5717,-7.39
5718,-7.29
5719,-7.23
5720,-7.17
5721,-7.20
5722,-7.23
5723,-7.29
5724,-7.39
5725,-7.48
5726,-7.54
5727,-7.57
5728,-7.54
5729,-7.51
5730,-7.48
5731,-7.45
5732,-7.42
5733,-7.39
5734,-7.35
5735,-7.35
5736,-7.32
5737,-7.32
5738,-7.29
5739,-7.32
5740,-7.39
5741,-7.45
5742,-7.51
5743,-7.60
5744,-7.72
5745,-7.78
5746,-7.81
5747,-7.78
5748,-7.72
5749,-7.69
5750,-7.66
5751,-7.63
5752,-7.63
5753,-7.66
5754,-7.75
5755,-7.84
5756,-7.93
5757,-7.97
5758,-7.93
5759,-7.90
5760,-7.87
5761,-7.87
5762,-7.90
5763,-7.97
5764,-8.06
5765,-8.21
5766,-8.36
5767,-8.48
5768,-8.64
5769,-8.76
5770,-8.88
5771,-8.97
5772,-9.06
5773,-9.09
5774,-9.12
5775,-9.09
5776,-9.03
5777,-8.97
5778,-8.91
5779,-8.94
5780,-9.00
5781,-9.09
5782,-9.19
5783,-9.31
5784,-9.46
5785,-9.55
5786,-9.55
5787,-9.52
5788,-9.43
5789,-9.37
5790,-9.28
5791,-9.22
5792,-9.19
5793,-9.19
5794,-9.16
5795,-9.12
5796,-9.03
5797,-8.88
5798,-8.70
5799,-8.51
5800,-8.36
5801,-8.21
5802,-8.03
5803,-7.87
5804,-7.75
5805,-7.72
5806,-7.75
5807,-7.75
5808,-7.72
5809,-7.66
5810,-7.57
5811,-7.48
5812,-7.32
5813,-7.17
5814,-6.96
5815,-6.81
5816,-6.71
5817,-6.71
5818,-6.74
5819,-6.77
5820,-6.74
5821,-6.71
5822,-6.65
5823,-6.56
5824,-6.47
5825,-6.38
5826,-6.29
5827,-6.23
5828,-6.20
5829,-6.20
5830,-6.20
5831,-6.23
5832,-6.26
5833,-6.32
5834,-6.38
5835,-6.41
5836,-6.44
5837,-6.44
5838,-6.47
5839,-6.47
5840,-6.47
5841,-6.47
5842,-6.47
5843,-6.44
5844,-6.41
5845,-6.32
5846,-6.23
5847,-6.16
5848,-6.10
5849,-6.04
5850,-6.01
5851,-5.95
5852,-5.89
5853,-5.83
5854,-5.80
5855,-5.77
5856,-5.74
5857,-5.74
5858,-5.74
5859,-5.74
5860,-5.74
5861,-5.71
5862,-5.65
5863,-5.62
5864,-5.62
5865,-5.65
5866,-5.65
5867,-5.65
5868,-5.62
5869,-5.55
5870,-5.46
5871,-5.34
5872,-5.16
5873,-4.94
5874,-4.73
5875,-4.58
5876,-4.43
5877,-4.36
5878,-4.33
5879,-4.36
5880,-4.39
5881,-4.43
5882,-4.46
5883,-4.49
5884,-4.49
5885,-4.49
5886,-4.49
5887,-4.52
5888,-4.55
5889,-4.55
5890,-4.58
5891,-4.61
5892,-4.64
5893,-4.70
5894,-4.73
5895,-4.76
5896,-4.79
5897,-4.85
5898,-4.94
5899,-5.00
5900,-5.04
5901,-5.13
5902,-5.25
5903,-5.37
5904,-5.43
5905,-5.43
5906,-5.43
5907,-5.43
5908,-5.46
5909,-5.49
5910,-5.55
5911,-5.62
5912,-5.71
5913,-5.80
5914,-5.83
5915,-5.83
5916,-5.80
5917,-5.77
5918,-5.74
5919,-5.65
5920,-5.55
5921,-5.40
5922,-5.22
5923,-5.07
5924,-4.94
5925,-4.85
5926,-4.79
5927,-4.70
5928,-4.61
5929,-4.49
5930,-4.36
5931,-4.24
5932,-4.15
5933,-4.09
5934,-4.06
5935,-4.06
5936,-4.03
5937,-4.03
5938,-4.09
5939,-4.12
5940,-4.18
5941,-4.18
5942,-4.21
5943,-4.27
5944,-4.27
5945,-4.24
5946,-4.21
5947,-4.18
5948,-4.12
5949,-4.09
5950,-4.03
5951,-4.00
5952,-3.94
5953,-3.91
5954,-3.91
5955,-3.94
5956,-4.00
5957,-4.09
5958,-4.21
5959,-4.36
5960,-4.52
5961,-4.61
5962,-4.67
5963,-4.70
5964,-4.73
5965,-4.79
5966,-4.82
5967,-4.85
5968,-4.91
5969,-5.00
5970,-5.13
5971,-5.22
5972,-5.34
5973,-5.43
5974,-5.49
5975,-5.55
5976,-5.62
5977,-5.68
5978,-5.74
5979,-5.77
5980,-5.77
5981,-5.74
5982,-5.77
5983,-5.77
5984,-5.74
5985,-5.74
5986,-5.77
5987,-5.80
5988,-5.80
5989,-5.80
5990,-5.77
5991,-5.77
5992,-5.74
5993,-5.68
5994,-5.58
5995,-5.46
5996,-5.31
5997,-5.22
5998,-5.19
5999,-5.19
6000,-5.22
6001,-5.22
6002,-5.25
6003,-5.31
6004,-5.34
6005,-5.31
6006,-5.25
6007,-5.16
6008,-5.00
6009,-4.79
6010,-4.58
6011,-4.43
6012,-4.30
6013,-4.24
6014,-4.21
6015,-4.21
6016,-4.21
6017,-4.21
6018,-4.24
6019,-4.24
6020,-4.21
6021,-4.15
6022,-4.12
6023,-4.06
6024,-3.97
6025,-3.88
6026,-3.81
6027,-3.78
6028,-3.81
6029,-3.91
6030,-4.03
6031,-4.15
6032,-4.24
6033,-4.30
6034,-4.36
6035,-4.43
6036,-4.52
6037,-4.58
6038,-4.67
6039,-4.76
6040,-4.91
6041,-5.07
6042,-5.19
6043,-5.25
6044,-5.25
6045,-5.22
6046,-5.16
6047,-5.10
6048,-5.04
6049,-4.94
6050,-4.91
6051,-4.94
6052,-5.07
6053,-5.19
6054,-5.28
6055,-5.37
6056,-5.46
6057,-5.55
6058,-5.52
6059,-5.43
6060,-5.37
6061,-5.40
6062,-5.46
6063,-5.49
6064,-5.49
6065,-5.49
6066,-5.58
6067,-5.65
6068,-5.68
6069,-5.68
6070,-5.71
6071,-5.77
6072,-5.86
6073,-5.98
6074,-6.13
6075,-6.32
6076,-6.47
6077,-6.59
6078,-6.74
6079,-6.90
6080,-7.02
6081,-7.14
6082,-7.26
6083,-7.39
6084,-7.54
6085,-7.69
6086,-7.90
6087,-8.12
6088,-8.30
6089,-8.39
6090,-8.48
6091,-8.54
6092,-8.58
6093,-8.64
6094,-8.70
6095,-8.79
6096,-8.88
6097,-8.97
6098,-9.03
6099,-9.06
6100,-9.09
6101,-9.12
6102,-9.16
6103,-9.22
6104,-9.25
6105,-9.31
6106,-9.37
6107,-9.43
6108,-9.43
6109,-9.37
6110,-9.22
6111,-9.12
6112,-9.09
6113,-9.12
6114,-9.16
6115,-9.19
6116,-9.25
6117,-9.31
6118,-9.37
6119,-9.40
6120,-9.40
6121,-9.43
6122,-9.43
6123,-9.40
6124,-9.37
6125,-9.37
6126,-9.34
6127,-9.31
6128,-9.25
6129,-9.22
6130,-9.12
6131,-9.00
6132,-8.91
6133,-8.88
6134,-8.85
6135,-8.82
6136,-8.79
6137,-8.76
6138,-8.70
6139,-8.61
6140,-8.48
6141,-8.39
6142,-8.30
6143,-8.30
6144,-8.36
6145,-8.42
6146,-8.48
6147,-8.51
6148,-8.48
6149,-8.45
6150,-8.42
6151,-8.42
6152,-8.39
6153,-8.42
6154,-8.48
6155,-8.61
6156,-8.70
6157,-8.73
6158,-8.76
6159,-8.76
6160,-8.73
6161,-8.70
6162,-8.70
6163,-8.73
6164,-8.79
6165,-8.82
6166,-8.85
6167,-8.88
6168,-8.91
6169,-8.97
6170,-9.06
6171,-9.12
6172,-9.19
6173,-9.28
6174,-9.40
6175,-9.58
6176,-9.74
6177,-9.83
6178,-9.92
6179,-9.98
6180,-10.07
6181,-10.13
6182,-10.07
6183,-10.01
6184,-9.95
6185,-9.95
6186,-9.98
6187,-9.98
6188,-10.04
6189,-10.10
6190,-10.13
6191,-10.10
6192,-10.07
6193,-10.04
6194,-10.04
6195,-10.04
6196,-9.98
6197,-9.92
6198,-9.86
6199,-9.86
6200,-9.80
6201,-9.74
6202,-9.61
6203,-9.49
6204,-9.40
6205,-9.31
6206,-9.28
6207,-9.28
6208,-9.28
6209,-9.31
6210,-9.34
6211,-9.40
6212,-9.43
6213,-9.40
6214,-9.31
6215,-9.22
6216,-9.12
6217,-8.97
6218,-8.82
6219,-8.67
6220,-8.54
6221,-8.42
6222,-8.33
6223,-8.21
6224,-8.12
6225,-8.03
6226,-7.93
6227,-7.87
6228,-7.75
6229,-7.66
6230,-7.54
6231,-7.42
6232,-7.29
6233,-7.17
6234,-7.08
6235,-7.05
6236,-6.99
6237,-6.93
6238,-6.87
6239,-6.87
6240,-6.90
6241,-6.93
6242,-6.90
6243,-6.81
6244,-6.71
6245,-6.68
6246,-6.65
6247,-6.56
6248,-6.44
6249,-6.32
6250,-6.23
6251,-6.16
6252,-6.10
6253,-6.07
6254,-6.04
6255,-6.01
6256,-5.95
6257,-5.86
6258,-5.74
6259,-5.65
6260,-5.52
6261,-5.37
6262,-5.25
6263,-5.22
6264,-5.16
6265,-5.13
6266,-5.07
6267,-5.07
6268,-5.10
6269,-5.07
6270,-5.00
6271,-4.91
6272,-4.82
6273,-4.76
6274,-4.67
6275,-4.61
6276,-4.58
6277,-4.55
6278,-4.52
6279,-4.46
6280,-4.36
6281,-4.27
6282,-4.15
6283,-4.06
6284,-4.00
6285,-3.94
6286,-3.81
6287,-3.72
6288,-3.60
6289,-3.54
6290,-3.48
6291,-3.48
6292,-3.48
6293,-3.51
6294,-3.57
6295,-3.60
6296,-3.66
6297,-3.75
6298,-3.88
6299,-3.97
6300,-4.03
6301,-4.09
6302,-4.15
6303,-4.15
6304,-4.12
6305,-4.12
6306,-4.09
6307,-4.09
6308,-4.12
6309,-4.15
6310,-4.18
6311,-4.21
6312,-4.24
6313,-4.30
6314,-4.33
6315,-4.43
6316,-4.52
6317,-4.61
6318,-4.67
6319,-4.73
6320,-4.76
6321,-4.79
6322,-4.76
6323,-4.64
6324,-4.55
6325,-4.49
6326,-4.49
6327,-4.55
6328,-4.64
6329,-4.79
6330,-4.88
6331,-4.97
6332,-5.00
6333,-4.94
6334,-4.79
6335,-4.61
6336,-4.49
6337,-4.36
6338,-4.30
6339,-4.27
6340,-4.27
6341,-4.27
6342,-4.30
6343,-4.30
6344,-4.33
6345,-4.33
6346,-4.36
6347,-4.36
6348,-4.39
6349,-4.43
6350,-4.43
6351,-4.39
6352,-4.30
6353,-4.24
6354,-4.21
6355,-4.18
6356,-4.15
6357,-4.12
6358,-4.09
6359,-4.06
6360,-4.09
6361,-4.12
6362,-4.12
6363,-4.09
6364,-4.06
6365,-4.00
6366,-3.94
6367,-3.85
6368,-3.78
6369,-3.75
6370,-3.72
6371,-3.72
6372,-3.78
6373,-3.88
6374,-4.03
6375,-4.15
6376,-4.24
6377,-4.33
6378,-4.36
6379,-4.36
6380,-4.36
6381,-4.36
6382,-4.39
6383,-4.39
6384,-4.43
6385,-4.46
6386,-4.58
6387,-4.70
6388,-4.82
6389,-4.88
6390,-4.91
6391,-4.85
6392,-4.73
6393,-4.55
6394,-4.43
6395,-4.33
6396,-4.30
6397,-4.33
6398,-4.33
6399,-4.33
6400,-4.30
6401,-4.27
6402,-4.24
6403,-4.18
6404,-4.09
6405,-4.00
6406,-3.94
6407,-3.94
6408,-3.94
6409,-3.91
6410,-3.91
6411,-3.94
6412,-3.97
6413,-3.97
6414,-3.94
6415,-3.94
6416,-3.97
6417,-3.97
6418,-4.00
6419,-3.97
6420,-3.94
6421,-3.91
6422,-3.88
6423,-3.91
6424,-3.94
6425,-4.00
6426,-4.03
6427,-4.06
6428,-4.06
6429,-4.06
6430,-4.09
6431,-4.12
6432,-4.15
6433,-4.15
6434,-4.15
6435,-4.18
6436,-4.24
6437,-4.27
6438,-4.27
6439,-4.27
6440,-4.27
6441,-4.30
6442,-4.33
6443,-4.39
6444,-4.43
6445,-4.43
6446,-4.46
6447,-4.46
6448,-4.43
6449,-4.33
6450,-4.24
6451,-4.15
6452,-4.09
6453,-4.00
6454,-3.91
6455,-3.85
6456,-3.88
6457,-3.97
6458,-4.09
6459,-4.18
6460,-4.24
6461,-4.30
6462,-4.39
6463,-4.43
6464,-4.43
6465,-4.39
6466,-4.30
6467,-4.21
6468,-4.12
6469,-4.06
6470,-4.00
6471,-3.94
6472,-3.85
6473,-3.78
6474,-3.75
6475,-3.78
6476,-3.81
6477,-3.85
6478,-3.88
6479,-3.85
6480,-3.88
6481,-3.88
6482,-3.91
6483,-3.91
6484,-3.94
6485,-3.97
6486,-4.03
6487,-4.09
6488,-4.09
6489,-4.06
6490,-4.06
6491,-4.09
6492,-4.09
6493,-4.09
6494,-4.06
6495,-4.06
6496,-4.03
6497,-3.97
6498,-3.94
6499,-3.94
6500,-4.00
6501,-4.12
6502,-4.18
6503,-4.18
6504,-4.15
6505,-4.12
6506,-4.12
6507,-4.12
6508,-4.15
6509,-4.18
6510,-4.21
6511,-4.30
6512,-4.49
6513,-4.64
6514,-4.76
6515,-4.82
6516,-4.88
6517,-4.91
6518,-4.94
6519,-4.97
6520,-5.04
6521,-5.16
6522,-5.34
6523,-5.52
6524,-5.77
6525,-6.04
6526,-6.29
6527,-6.47
6528,-6.62
6529,-6.77
6530,-6.96
6531,-7.08
6532,-7.20
6533,-7.29
6534,-7.42
6535,-7.54
6536,-7.63
6537,-7.66
6538,-7.66
6539,-7.69
6540,-7.72
6541,-7.72
6542,-7.66
6543,-7.54
6544,-7.45
6545,-7.39
6546,-7.35
6547,-7.29
6548,-7.26
6549,-7.26
6550,-7.32
6551,-7.39
6552,-7.45
6553,-7.51
6554,-7.51
6555,-7.48
6556,-7.39
6557,-7.23
6558,-7.05
6559,-6.90
6560,-6.74
6561,-6.65
6562,-6.59
6563,-6.56
6564,-6.53
6565,-6.59
6566,-6.65
6567,-6.71
6568,-6.74
6569,-6.71
6570,-6.62
6571,-6.56
6572,-6.47
6573,-6.41
6574,-6.32
6575,-6.26
6576,-6.23
6577,-6.20
6578,-6.23
6579,-6.23
6580,-6.26
6581,-6.26
6582,-6.23
6583,-6.16
6584,-6.07
6585,-6.04
6586,-6.07
6587,-6.13
6588,-6.23
6589,-6.32
6590,-6.35
6591,-6.38
6592,-6.41
6593,-6.38
6594,-6.29
6595,-6.16
6596,-6.07
6597,-5.98
6598,-5.95
6599,-5.89
6600,-5.86
6601,-5.83
6602,-5.80
6603,-5.80
6604,-5.77
6605,-5.71
6606,-5.65
6607,-5.62
6608,-5.62
6609,-5.65
6610,-5.71
6611,-5.77
6612,-5.80
6613,-5.86
6614,-5.92
6615,-6.01
6616,-6.10
6617,-6.13
6618,-6.10
6619,-6.01
6620,-5.92
6621,-5.86
6622,-5.77
6623,-5.71
6624,-5.65
6625,-5.62
6626,-5.65
6627,-5.71
6628,-5.80
6629,-5.86
6630,-5.89
6631,-5.95
6632,-6.07
6633,-6.23
6634,-6.38
6635,-6.50
6636,-6.62
6637,-6.71
6638,-6.87
6639,-6.93
6640,-6.99
6641,-7.05
6642,-7.14
6643,-7.26
6644,-7.39
6645,-7.45
6646,-7.48
6647,-7.51
6648,-7.54
6649,-7.57
6650,-7.60
6651,-7.63
6652,-7.66
6653,-7.72
6654,-7.78
6655,-7.81
6656,-7.81
6657,-7.75
6658,-7.66
6659,-7.57
6660,-7.48
6661,-7.45
6662,-7.42
6663,-7.39
6664,-7.29
6665,-7.23
6666,-7.23
6667,-7.26
6668,-7.32
6669,-7.32
6670,-7.29
6671,-7.29
6672,-7.26
6673,-7.29
6674,-7.29
6675,-7.26
6676,-7.23
6677,-7.17
6678,-7.14
6679,-7.08
6680,-6.99
6681,-6.90
6682,-6.84
6683,-6.90
6684,-6.99
6685,-7.08
6686,-7.14
6687,-7.20
6688,-7.23
6689,-7.32
6690,-7.35
6691,-7.39
6692,-7.35
6693,-7.32
6694,-7.26
6695,-7.17
6696,-7.14
6697,-7.08
6698,-7.05
6699,-7.02
6700,-6.99
6701,-6.99
6702,-6.99
6703,-7.02
6704,-7.05
6705,-7.05
6706,-7.08
6707,-7.08
6708,-7.05
6709,-7.05
6710,-7.05
6711,-7.08
6712,-7.17
6713,-7.26
6714,-7.35
6715,-7.42
6716,-7.51
6717,-7.57
6718,-7.57
6719,-7.60
6720,-7.60
6721,-7.63
6722,-7.63
6723,-7.60
6724,-7.60
6725,-7.63
6726,-7.66
6727,-7.72
6728,-7.78
6729,-7.87
6730,-8.00
6731,-8.12
6732,-8.27
6733,-8.39
6734,-8.51
6735,-8.61
6736,-8.64
6737,-8.64
6738,-8.64
6739,-8.67
6740,-8.70
6741,-8.73
6742,-8.79
6743,-8.88
6744,-9.00
6745,-9.09
6746,-9.12
6747,-9.16
6748,-9.12
6749,-9.09
6750,-9.03
6751,-8.94
6752,-8.91
6753,-8.88
6754,-8.88
6755,-8.88
6756,-8.91
6757,-8.91
6758,-8.88
6759,-8.85
6760,-8.76
6761,-8.64
6762,-8.51
6763,-8.45
6764,-8.45
6765,-8.45
6766,-8.42
6767,-8.33
6768,-8.24
6769,-8.09
6770,-7.93
6771,-7.72
6772,-7.51
6773,-7.32
6774,-7.14
6775,-6.99
6776,-6.84
6777,-6.74
6778,-6.65
6779,-6.56
6780,-6.41
6781,-6.29
6782,-6.16
6783,-6.07
6784,-5.95
6785,-5.86
6786,-5.80
6787,-5.80
6788,-5.83
6789,-5.89
6790,-5.86
6791,-5.80
6792,-5.71
6793,-5.58
6794,-5.49
6795,-5.40
6796,-5.31
6797,-5.28
6798,-5.28
6799,-5.37
6800,-5.43
6801,-5.43
6802,-5.40
6803,-5.34
6804,-5.25
6805,-5.16
6806,-5.00
6807,-4.88
6808,-4.85
6809,-4.88
6810,-4.88
6811,-4.91
6812,-4.97
6813,-5.07
6814,-5.10
6815,-5.07
6816,-4.94
6817,-4.82
6818,-4.67
6819,-4.55
6820,-4.43
6821,-4.30
6822,-4.21
6823,-4.12
6824,-4.03
6825,-3.97
6826,-3.91
6827,-3.85
6828,-3.72
6829,-3.57
6830,-3.42
6831,-3.33
6832,-3.23
6833,-3.20
6834,-3.17
6835,-3.17
6836,-3.14
6837,-3.14
6838,-3.11
6839,-3.11
6840,-3.08
6841,-3.05
6842,-3.08
6843,-3.14
6844,-3.23
6845,-3.33
6846,-3.39
6847,-3.42
6848,-3.45
6849,-3.48
6850,-3.48
6851,-3.48
6852,-3.54
6853,-3.66
6854,-3.85
6855,-4.09
6856,-4.33
6857,-4.55
6858,-4.73
6859,-4.82
6860,-4.94
6861,-5.07
6862,-5.22
6863,-5.34
6864,-5.49
6865,-5.62
6866,-5.77
6867,-5.86
6868,-5.89
6869,-5.86
6870,-5.83
6871,-5.77
6872,-5.68
6873,-5.58
6874,-5.52
6875,-5.55
6876,-5.68
6877,-5.77
6878,-5.83
6879,-5.83
6880,-5.77
6881,-5.71
6882,-5.62
6883,-5.49
6884,-5.37
6885,-5.28
6886,-5.19
6887,-5.10
6888,-5.00
6889,-4.94
6890,-4.88
6891,-4.82
6892,-4.73
6893,-4.73
6894,-4.79
6895,-4.91
6896,-5.07
6897,-5.19
6898,-5.28
6899,-5.40
6900,-5.49
6901,-5.62
6902,-5.77
6903,-5.92
6904,-6.04
6905,-6.16
6906,-6.29
6907,-6.35
6908,-6.41
6909,-6.41
6910,-6.44
6911,-6.50
6912,-6.59
6913,-6.65
6914,-6.71
6915,-6.77
6916,-6.87
6917,-6.99
6918,-7.11
6919,-7.20
6920,-7.23
6921,-7.26
6922,-7.29
6923,-7.35
6924,-7.45
6925,-7.54
6926,-7.63
6927,-7.72
6928,-7.84
6929,-7.97
6930,-8.06
6931,-8.12
6932,-8.21
6933,-8.27
6934,-8.33
6935,-8.33
6936,-8.36
6937,-8.42
6938,-8.48
6939,-8.54
6940,-8.61
6941,-8.64
6942,-8.67
6943,-8.67
6944,-8.67
6945,-8.67
6946,-8.70
6947,-8.73
6948,-8.76
6949,-8.73
6950,-8.64
6951,-8.51
6952,-8.42
6953,-8.36
6954,-8.27
6955,-8.18
6956,-8.12
6957,-8.09
6958,-8.06
6959,-8.03
6960,-7.90
6961,-7.78
6962,-7.66
6963,-7.63
6964,-7.66
6965,-7.75
6966,-7.84
6967,-7.87
6968,-7.90
6969,-7.90
6970,-7.87
6971,-7.84
6972,-7.84
6973,-7.81
6974,-7.81
6975,-7.81
6976,-7.81
6977,-7.81
6978,-7.81
6979,-7.78
6980,-7.69
6981,-7.63
6982,-7.54
6983,-7.42
6984,-7.32
6985,-7.23
6986,-7.20
6987,-7.23
6988,-7.26
6989,-7.26
6990,-7.26
6991,-7.26
6992,-7.29
6993,-7.35
6994,-7.39
6995,-7.42
6996,-7.48
6997,-7.57
6998,-7.66
6999,-7.69
7000,-7.72
7001,-7.66
7002,-7.57
7003,-7.45
7004,-7.32
7005,-7.23
7006,-7.20
7007,-7.20
7008,-7.17
7009,-7.17
7010,-7.20
7011,-7.29
7012,-7.39
7013,-7.45
7014,-7.54
7015,-7.60
7016,-7.69
7017,-7.75
7018,-7.84
7019,-7.93
7020,-8.03
7021,-8.09
7022,-8.12
7023,-8.12
7024,-8.15
7025,-8.18
7026,-8.21
7027,-8.18
7028,-8.09
7029,-7.97
7030,-7.87
7031,-7.78
7032,-7.75
7033,-7.75
7034,-7.78
7035,-7.75
7036,-7.69
7037,-7.63
7038,-7.57
7039,-7.48
7040,-7.35
7041,-7.20
7042,-7.08
7043,-7.05
7044,-7.08
7045,-7.17
7046,-7.20
7047,-7.23
7048,-7.23
7049,-7.23
7050,-7.17
7051,-7.11
7052,-7.02
7053,-6.96
7054,-6.93
7055,-6.90
7056,-6.90
7057,-6.93
7058,-6.96
7059,-6.93
7060,-6.84
7061,-6.74
7062,-6.59
7063,-6.47
7064,-6.38
7065,-6.35
7066,-6.38
7067,-6.41
7068,-6.44
7069,-6.47
7070,-6.47
7071,-6.44
7072,-6.38
7073,-6.35
7074,-6.35
7075,-6.38
7076,-6.47
7077,-6.53
7078,-6.62
7079,-6.65
7080,-6.62
7081,-6.53
7082,-6.38
7083,-6.23
7084,-6.07
7085,-5.95
7086,-5.86
7087,-5.86
7088,-5.92
7089,-6.01
7090,-6.16
7091,-6.29
7092,-6.38
7093,-6.38
7094,-6.35
7095,-6.29
7096,-6.26
7097,-6.23
7098,-6.16
7099,-6.10
7100,-6.04
7101,-6.01
7102,-5.95
7103,-5.89
7104,-5.83
7105,-5.77
7106,-5.71
7107,-5.65
7108,-5.55
7109,-5.49
7110,-5.43
7111,-5.37
7112,-5.34
7113,-5.34
7114,-5.37
7115,-5.43
7116,-5.49
7117,-5.52
7118,-5.55
7119,-5.52
7120,-5.49
7121,-5.46
7122,-5.46
7123,-5.52
7124,-5.62
7125,-5.74
7126,-5.83
7127,-5.86
7128,-5.89
7129,-5.92
7130,-5.92
7131,-5.86
7132,-5.77
7133,-5.68
7134,-5.65
7135,-5.62
7136,-5.58
7137,-5.52
7138,-5.49
7139,-5.46
7140,-5.40
7141,-5.34
7142,-5.28
7143,-5.22
7144,-5.19
7145,-5.19
7146,-5.25
7147,-5.37
7148,-5.52
7149,-5.65
7150,-5.77
7151,-5.89
7152,-5.98
7153,-6.07
7154,-6.10
7155,-6.13
7156,-6.10
7157,-6.04
7158,-6.01
7159,-5.98
7160,-6.01
7161,-6.01
7162,-6.04
7163,-6.10
7164,-6.13
7165,-6.20
7166,-6.29
7167,-6.38
7168,-6.47
7169,-6.53
7170,-6.53
7171,-6.56
7172,-6.62
7173,-6.68
7174,-6.68
7175,-6.65
7176,-6.65
7177,-6.65
7178,-6.65
7179,-6.65
7180,-6.65
7181,-6.74
7182,-6.84
7183,-6.96
7184,-7.08
7185,-7.17
7186,-7.23
7187,-7.29
7188,-7.35
7189,-7.42
7190,-7.39
7191,-7.35
7192,-7.23
7193,-11.08
7194,-10.16
7195,0.34
7196,4.39
7197,-19.10
7198,-41.35
7199,5.19
7200,73.49
