1,187.57
2,249.99
3,249.99
4,248.39
5,238.80
6,245.89
7,239.94
8,210.97
9,161.19
10,90.43
11,-1.40
12,-91.09
13,-140.98
14,-118.72
15,-23.82
16,104.26
17,211.11
18,249.99
19,249.99
20,246.19
21,245.31
22,249.99
23,249.99
24,231.72
25,190.74
26,131.60
27,55.58
28,-30.22
29,-111.95
30,-173.52
31,-205.44
32,-213.81
33,-207.95
34,-192.83
35,-161.27
36,-112.59
37,-58.93
38,-22.84
39,-13.48
40,-24.09
41,-38.86
42,-48.32
43,-50.17
44,-44.11
45,-32.91
46,-19.38
47,-9.08
48,-3.18
49,-2.43
50,-4.07
51,-6.43
52,-7.46
53,-6.69
54,-4.14
55,-0.78
56,2.85
57,5.75
58,8.06
59,9.60
60,10.94
61,12.12
62,13.34
63,14.40
64,15.41
65,16.24
66,17.13
67,17.93
68,18.81
69,19.62
70,20.48
71,21.26
72,22.03
73,22.67
74,23.27
75,23.80
76,24.38
77,24.94
78,25.61
79,26.29
80,27.04
81,27.72
82,28.36
83,28.89
84,29.42
85,29.88
86,30.32
87,30.66
88,30.98
89,31.27
90,31.58
91,31.85
92,32.10
93,32.34
94,32.67
95,33.05
96,33.51
97,33.97
98,34.42
99,34.77
100,35.01
101,35.10
102,35.12
103,35.03
104,34.92
105,34.79
106,34.76
107,34.87
108,35.13
109,35.49
110,35.94
111,36.38
112,36.81
113,37.18
114,37.48
115,37.67
116,37.75
117,37.74
118,37.74
119,37.81
120,37.98
121,38.22
122,38.54
123,38.92
124,39.31
125,39.63
126,39.83
127,39.89
128,39.84
129,39.71
130,39.55
131,39.40
132,39.33
133,39.36
134,39.52
135,39.78
136,40.14
137,40.51
138,40.88
139,41.19
140,41.48
141,41.71
142,41.90
143,42.04
144,42.16
145,42.29
146,42.47
147,42.69
148,42.95
149,43.23
150,43.50
151,43.72
152,43.96
153,44.15
154,44.30
155,44.34
156,44.36
157,44.42
158,44.56
159,44.75
160,44.99
161,45.25
162,45.55
163,45.82
164,46.04
165,46.13
166,46.17
167,46.17
168,46.20
169,46.21
170,46.25
171,46.30
172,46.41
173,46.52
174,46.64
175,46.74
176,46.84
177,46.96
178,47.09
179,47.20
180,47.32
181,47.43
182,47.57
183,47.69
184,47.77
185,47.77
186,47.70
187,47.60
188,47.49
189,47.36
190,47.24
191,47.13
192,47.09
193,47.10
194,47.18
195,47.29
196,47.40
197,47.52
198,47.63
199,47.74
200,47.89
201,48.07
202,48.29
203,48.50
204,48.71
205,48.91
206,49.10
207,49.26
208,49.38
209,49.41
210,49.39
211,49.34
212,49.32
213,49.33
214,49.40
215,49.51
216,49.72
217,50.00
218,50.32
219,50.61
220,50.88
221,51.11
222,51.34
223,51.56
224,51.77
225,51.96
226,52.17
227,52.38
228,52.63
229,52.87
230,53.15
231,53.40
232,53.67
233,53.91
234,54.19
235,54.48
236,54.82
237,55.17
238,55.54
239,55.90
240,56.25
241,56.54
242,56.77
243,56.88
244,56.91
245,56.83
246,56.72
247,56.58
248,56.43
249,56.29
250,56.19
251,56.14
252,56.17
253,56.27
254,56.45
255,56.69
256,56.96
257,57.22
258,57.45
259,57.65
260,57.82
261,57.93
262,58.00
263,58.04
264,58.08
265,58.11
266,58.14
267,58.18
268,58.28
269,58.37
270,58.38
271,58.32
272,58.30
273,58.39
274,58.58
275,58.77
276,58.91
277,58.96
278,58.97
279,58.97
280,58.98
281,59.00
282,59.01
283,59.01
284,59.03
285,59.04
286,59.04
287,59.00
288,58.94
289,58.86
290,58.74
291,58.58
292,58.40
293,58.25
294,58.17
295,58.13
296,58.13
297,58.17
298,58.26
299,58.33
300,58.36
301,58.30
302,58.19
303,58.04
304,57.86
305,57.69
306,57.55
307,57.49
308,57.50
309,57.56
310,57.66
311,57.79
312,57.91
313,58.04
314,58.13
315,58.19
316,58.20
317,58.17
318,58.06
319,57.88
320,57.65
321,57.39
322,57.11
323,56.86
324,56.63
325,56.46
326,56.30
327,56.17
328,56.04
329,55.93
330,55.79
331,55.63
332,55.45
333,55.27
334,55.11
335,54.97
336,54.85
337,54.73
338,54.61
339,54.48
340,54.38
341,54.33
342,54.31
343,54.31
344,54.31
345,54.26
346,54.20
347,54.14
348,54.10
349,54.10
350,54.15
351,54.24
352,54.39
353,54.57
354,54.79
355,54.99
356,55.13
357,55.18
358,55.18
359,55.18
360,55.20
361,55.21
362,55.23
363,55.25
364,55.31
365,55.38
366,55.46
367,55.48
368,55.45
369,55.39
370,55.31
371,55.26
372,55.21
373,55.18
374,55.11
375,55.04
376,54.93
377,54.79
378,54.62
379,54.42
380,54.21
381,54.02
382,53.83
383,53.67
384,53.55
385,53.49
386,53.49
387,53.55
388,53.67
389,53.81
390,53.94
391,54.00
392,53.96
393,53.80
394,53.54
395,53.24
396,52.94
397,52.72
398,52.63
399,52.68
400,52.88
401,53.19
402,53.55
403,53.87
404,54.08
405,54.16
406,54.15
407,54.05
408,53.92
409,53.76
410,53.62
411,53.52
412,53.44
413,53.38
414,53.35
415,53.40
416,53.50
417,53.63
418,53.71
419,53.73
420,53.71
421,53.65
422,53.52
423,53.36
424,53.24
425,53.22
426,53.31
427,53.47
428,53.65
429,53.81
430,53.92
431,53.97
432,53.92
433,53.78
434,53.59
435,53.41
436,53.26
437,53.18
438,53.16
439,53.15
440,53.09
441,52.96
442,52.78
443,52.59
444,52.41
445,52.28
446,52.22
447,52.27
448,52.43
449,52.64
450,52.86
451,53.02
452,53.15
453,53.22
454,53.23
455,53.19
456,53.15
457,53.18
458,53.32
459,53.50
460,53.69
461,53.85
462,54.01
463,54.14
464,54.21
465,54.20
466,54.11
467,53.98
468,53.86
469,53.77
470,53.78
471,53.89
472,54.11
473,54.40
474,54.73
475,55.01
476,55.17
477,55.18
478,55.03
479,54.78
480,54.48
481,54.19
482,53.99
483,53.89
484,53.87
485,53.90
486,53.95
487,53.94
488,53.86
489,53.70
490,53.51
491,53.36
492,53.29
493,53.36
494,53.57
495,53.87
496,54.17
497,54.40
498,54.55
499,54.60
500,54.54
501,54.40
502,54.24
503,54.15
504,54.18
505,54.30
506,54.50
507,54.74
508,55.01
509,55.27
510,55.50
511,55.68
512,55.79
513,55.87
514,55.95
515,56.02
516,56.09
517,56.13
518,56.15
519,56.13
520,56.06
521,55.94
522,55.79
523,55.63
524,55.46
525,55.32
526,55.24
527,55.24
528,55.30
529,55.40
530,55.56
531,55.73
532,55.89
533,55.96
534,55.98
535,55.96
536,55.92
537,55.87
538,55.86
539,55.90
540,56.00
541,56.16
542,56.37
543,56.59
544,56.79
545,56.93
546,57.01
547,56.98
548,56.85
549,56.63
550,56.37
551,56.13
552,55.93
553,55.78
554,55.63
555,55.50
556,55.36
557,55.22
558,55.06
559,54.89
560,54.68
561,54.49
562,54.31
563,54.15
564,54.01
565,53.91
566,53.86
567,53.89
568,53.96
569,54.05
570,54.18
571,54.32
572,54.45
573,54.53
574,54.57
575,54.56
576,54.54
577,54.52
578,54.52
579,54.55
580,54.65
581,54.81
582,55.02
583,55.24
584,55.43
585,55.53
586,55.56
587,55.47
588,55.29
589,55.07
590,54.86
591,54.72
592,54.66
593,54.68
594,54.78
595,54.92
596,55.05
597,55.14
598,55.17
599,55.15
600,55.08
601,54.99
602,54.93
603,54.91
604,54.92
605,54.97
606,55.04
607,55.09
608,55.11
609,55.10
610,55.07
611,55.04
612,55.04
613,55.10
614,55.24
615,55.44
616,55.66
617,55.86
618,56.04
619,56.18
620,56.27
621,56.28
622,56.25
623,56.23
624,56.25
625,56.32
626,56.45
627,56.61
628,56.82
629,57.01
630,57.16
631,57.27
632,57.37
633,57.43
634,57.45
635,57.40
636,57.37
637,57.38
638,57.41
639,57.40
640,57.33
641,57.23
642,57.11
643,56.97
644,56.82
645,56.69
646,56.58
647,56.54
648,56.56
649,56.63
650,56.69
651,56.70
652,56.71
653,56.72
654,56.77
655,56.87
656,57.02
657,57.21
658,57.38
659,57.52
660,57.60
661,57.64
662,57.66
663,57.62
664,57.57
665,57.53
666,57.55
667,57.64
668,57.82
669,58.01
670,58.24
671,58.49
672,58.79
673,59.11
674,59.43
675,59.71
676,59.97
677,60.21
678,60.49
679,60.78
680,61.11
681,61.43
682,61.72
683,61.94
684,62.10
685,62.17
686,62.14
687,62.00
688,61.78
689,61.54
690,61.33
691,61.14
692,60.98
693,60.87
694,60.81
695,60.78
696,60.77
697,60.74
698,60.68
699,60.59
700,60.46
701,60.30
702,60.18
703,60.12
704,60.08
705,60.04
706,60.04
707,60.07
708,60.14
709,60.23
710,60.31
711,60.41
712,60.52
713,60.66
714,60.82
715,60.98
716,61.14
717,61.27
718,61.39
719,61.49
720,61.60
721,61.73
722,61.91
723,62.17
724,62.52
725,62.90
726,63.24
727,63.47
728,63.58
729,63.57
730,63.44
731,63.23
732,63.04
733,62.92
734,62.87
735,62.86
736,62.87
737,62.89
738,62.88
739,62.82
740,62.64
741,62.40
742,62.12
743,61.88
744,61.71
745,61.60
746,61.45
747,61.26
748,61.04
749,60.83
750,60.64
751,60.47
752,60.33
753,60.22
754,60.15
755,60.13
756,60.17
757,60.25
758,60.35
759,60.48
760,60.63
761,60.79
762,60.91
763,60.95
764,60.94
765,60.87
766,60.75
767,60.57
768,60.38
769,60.23
770,60.16
771,60.12
772,60.10
773,60.08
774,60.05
775,60.01
776,59.96
777,59.89
778,59.84
779,59.87
780,59.98
781,60.17
782,60.35
783,60.48
784,60.54
785,60.58
786,60.62
787,60.65
788,60.70
789,60.75
790,60.85
791,60.99
792,61.16
793,61.30
794,61.39
795,61.40
796,61.39
797,61.33
798,61.26
799,61.19
800,61.13
801,61.13
802,61.16
803,61.19
804,61.19
805,61.19
806,61.20
807,61.22
808,61.23
809,61.23
810,61.23
811,61.26
812,61.28
813,61.30
814,61.30
815,61.30
816,61.32
817,61.34
818,61.34
819,61.30
820,61.23
821,61.18
822,61.14
823,61.10
824,61.02
825,60.87
826,60.68
827,60.50
828,60.38
829,60.30
830,60.23
831,60.13
832,60.01
833,59.84
834,59.63
835,59.40
836,59.16
837,58.96
838,58.81
839,58.73
840,58.72
841,58.79
842,58.90
843,59.04
844,59.20
845,59.34
846,59.42
847,59.43
848,59.35
849,59.21
850,59.01
851,58.82
852,58.65
853,58.56
854,58.50
855,58.45
856,58.33
857,58.19
858,58.01
859,57.83
860,57.62
861,57.41
862,57.19
863,57.00
864,56.80
865,56.58
866,56.33
867,56.11
868,55.97
869,55.97
870,56.08
871,56.27
872,56.47
873,56.68
874,56.87
875,57.03
876,57.13
877,57.19
878,57.24
879,57.32
880,57.40
881,57.51
882,57.65
883,57.80
884,57.95
885,58.05
886,58.13
887,58.18
888,58.22
889,58.24
890,58.27
891,58.31
892,58.42
893,58.58
894,58.80
895,59.06
896,59.32
897,59.54
898,59.72
899,59.81
900,59.84
901,59.80
902,59.70
903,59.59
904,59.54
905,59.58
906,59.70
907,59.85
908,59.97
909,59.98
910,59.88
911,59.65
912,59.37
913,59.09
914,58.83
915,58.63
916,58.52
917,58.50
918,58.54
919,58.59
920,58.59
921,58.51
922,58.36
923,58.20
924,58.05
925,57.97
926,57.98
927,58.09
928,58.24
929,58.38
930,58.50
931,58.58
932,58.60
933,58.58
934,58.54
935,58.54
936,58.60
937,58.72
938,58.88
939,59.04
940,59.18
941,59.24
942,59.21
943,59.08
944,58.90
945,58.72
946,58.58
947,58.49
948,58.48
949,58.50
950,58.54
951,58.56
952,58.54
953,58.50
954,58.47
955,58.46
956,58.50
957,58.61
958,58.78
959,59.02
960,59.28
961,59.52
962,59.66
963,59.70
964,59.62
965,59.43
966,59.20
967,58.95
968,58.74
969,58.59
970,58.56
971,58.62
972,58.75
973,58.91
974,59.07
975,59.20
976,59.26
977,59.23
978,59.13
979,58.97
980,58.80
981,58.67
982,58.63
983,58.74
984,58.99
985,59.35
986,59.74
987,60.08
988,60.35
989,60.51
990,60.54
991,60.44
992,60.25
993,60.04
994,59.87
995,59.75
996,59.70
997,59.70
998,59.72
999,59.72
1000,59.68
1001,59.61
1002,59.49
1003,59.37
1004,59.26
1005,59.18
1006,59.14
1007,59.12
1008,59.10
1009,59.07
1010,59.01
1011,58.97
1012,58.94
1013,58.96
1014,59.04
1015,59.18
1016,59.39
1017,59.59
1018,59.73
1019,59.77
1020,59.72
1021,59.62
1022,59.48
1023,59.33
1024,59.23
1025,59.21
1026,59.28
1027,59.40
1028,59.55
1029,59.68
1030,59.81
1031,59.91
1032,59.97
1033,60.01
1034,60.06
1035,60.11
1036,60.18
1037,60.23
1038,60.22
1039,60.14
1040,59.98
1041,59.78
1042,59.57
1043,59.39
1044,59.25
1045,59.19
1046,59.22
1047,59.32
1048,59.45
1049,59.58
1050,59.68
1051,59.78
1052,59.88
1053,59.99
1054,60.09
1055,60.20
1056,60.29
1057,60.35
1058,60.36
1059,60.27
1060,60.10
1061,59.88
1062,59.64
1063,59.42
1064,59.23
1065,59.10
1066,59.01
1067,58.97
1068,58.98
1069,59.04
1070,59.14
1071,59.28
1072,59.45
1073,59.62
1074,59.81
1075,59.99
1076,60.15
1077,60.24
1078,60.30
1079,60.33
1080,60.39
1081,60.53
1082,60.75
1083,61.02
1084,61.29
1085,61.50
1086,61.66
1087,61.74
1088,61.74
1089,61.65
1090,61.52
1091,61.39
1092,61.32
1093,61.35
1094,61.52
1095,61.80
1096,62.15
1097,62.48
1098,62.71
1099,62.78
1100,62.74
1101,62.60
1102,62.45
1103,62.30
1104,62.23
1105,62.26
1106,62.44
1107,62.74
1108,63.12
1109,63.53
1110,63.90
1111,64.16
1112,64.27
1113,64.23
1114,64.09
1115,63.87
1116,63.64
1117,63.39
1118,63.19
1119,63.05
1120,62.96
1121,62.90
1122,62.88
1123,62.89
1124,62.96
1125,63.09
1126,63.26
1127,63.46
1128,63.63
1129,63.77
1130,63.91
1131,64.03
1132,64.09
1133,64.12
1134,64.15
1135,64.22
1136,64.35
1137,64.50
1138,64.64
1139,64.70
1140,64.70
1141,64.59
1142,64.43
1143,64.24
1144,64.07
1145,63.97
1146,63.96
1147,64.03
1148,64.12
1149,64.20
1150,64.29
1151,64.39
1152,64.47
1153,64.51
1154,64.54
1155,64.55
1156,64.57
1157,64.59
1158,64.63
1159,64.68
1160,64.77
1161,64.84
1162,64.91
1163,64.97
1164,65.03
1165,65.06
1166,65.09
1167,65.11
1168,65.13
1169,65.16
1170,65.17
1171,65.16
1172,65.15
1173,65.13
1174,65.12
1175,65.06
1176,64.88
1177,64.62
1178,64.35
1179,64.19
1180,64.14
1181,64.17
1182,64.23
1183,64.29
1184,64.32
1185,64.29
1186,64.16
1187,64.00
1188,63.84
1189,63.72
1190,63.64
1191,63.60
1192,63.61
1193,63.67
1194,63.77
1195,63.87
1196,63.95
1197,64.03
1198,64.13
1199,64.26
1200,64.43
1201,64.62
1202,64.82
1203,64.99
1204,65.13
1205,65.27
1206,65.39
1207,65.42
1208,65.28
1209,65.00
1210,64.70
1211,64.50
1212,64.37
1213,64.30
1214,64.29
1215,64.33
1216,64.39
1217,64.41
1218,64.31
1219,64.11
1220,63.78
1221,63.39
1222,62.95
1223,62.55
1224,62.20
1225,61.91
1226,61.62
1227,61.34
1228,61.02
1229,60.70
1230,60.38
1231,60.07
1232,59.81
1233,59.66
1234,59.63
1235,59.68
1236,59.79
1237,59.94
1238,60.14
1239,60.39
1240,60.67
1241,60.91
1242,61.14
1243,61.39
1244,61.69
1245,61.98
1246,62.26
1247,62.50
1248,62.74
1249,62.97
1250,63.19
1251,63.36
1252,63.54
1253,63.71
1254,63.89
1255,64.03
1256,64.13
1257,64.18
1258,64.22
1259,64.21
1260,64.18
1261,64.11
1262,64.05
1263,63.99
1264,63.93
1265,63.87
1266,63.81
1267,63.74
1268,63.69
1269,63.65
1270,63.64
1271,63.64
1272,63.64
1273,63.67
1274,63.79
1275,63.95
1276,64.09
1277,64.20
1278,64.29
1279,64.39
1280,64.46
1281,64.48
1282,64.48
1283,64.45
1284,64.41
1285,64.33
1286,64.21
1287,64.04
1288,63.86
1289,63.68
1290,63.53
1291,63.40
1292,63.32
1293,63.28
1294,63.29
1295,63.33
1296,63.38
1297,63.40
1298,63.40
1299,63.42
1300,63.48
1301,63.63
1302,63.83
1303,64.03
1304,64.19
1305,64.28
1306,64.34
1307,64.36
1308,64.35
1309,64.30
1310,64.25
1311,64.25
1312,64.32
1313,64.44
1314,64.58
1315,64.70
1316,64.78
1317,64.80
1318,64.77
1319,64.70
1320,64.67
1321,64.70
1322,64.81
1323,64.99
1324,65.24
1325,65.52
1326,65.80
1327,66.02
1328,66.16
1329,66.22
1330,66.22
1331,66.20
1332,66.15
1333,66.07
1334,65.99
1335,65.90
1336,65.82
1337,65.72
1338,65.61
1339,65.53
1340,65.48
1341,65.46
1342,65.48
1343,65.51
1344,65.57
1345,65.64
1346,65.68
1347,65.70
1348,65.69
1349,65.65
1350,65.61
1351,65.58
1352,65.60
1353,65.67
1354,65.83
1355,65.99
1356,66.10
1357,66.15
1358,66.18
1359,66.26
1360,66.38
1361,66.46
1362,66.43
1363,66.31
1364,66.14
1365,65.94
1366,65.68
1367,65.39
1368,65.09
1369,64.78
1370,64.47
1371,64.13
1372,63.77
1373,63.42
1374,63.06
1375,62.72
1376,62.44
1377,62.28
1378,62.24
1379,62.33
1380,62.50
1381,62.75
1382,63.02
1383,63.26
1384,63.42
1385,63.46
1386,63.42
1387,63.33
1388,63.24
1389,63.19
1390,63.17
1391,63.19
1392,63.21
1393,63.19
1394,63.13
1395,62.98
1396,62.77
1397,62.50
1398,62.25
1399,62.04
1400,61.90
1401,61.85
1402,61.89
1403,61.99
1404,62.10
1405,62.19
1406,62.23
1407,62.23
1408,62.18
1409,62.13
1410,62.07
1411,62.05
1412,62.05
1413,62.07
1414,62.13
1415,62.21
1416,62.29
1417,62.36
1418,62.39
1419,62.36
1420,62.29
1421,62.19
1422,62.08
1423,61.97
1424,61.81
1425,61.61
1426,61.40
1427,61.22
1428,61.05
1429,60.87
1430,60.68
1431,60.52
1432,60.42
1433,60.40
1434,60.47
1435,60.62
1436,60.79
1437,60.97
1438,61.13
1439,61.24
1440,61.26
1441,61.17
1442,61.01
1443,60.84
1444,60.74
1445,60.70
1446,60.71
1447,60.74
1448,60.75
1449,60.75
1450,60.72
1451,60.69
1452,60.65
1453,60.60
1454,60.57
1455,60.62
1456,60.75
1457,60.96
1458,61.14
1459,61.25
1460,61.27
1461,61.20
1462,61.04
1463,60.81
1464,60.55
1465,60.32
1466,60.13
1467,60.04
1468,60.06
1469,60.13
1470,60.20
1471,60.18
1472,60.11
1473,60.00
1474,59.87
1475,59.77
1476,59.78
1477,59.91
1478,60.16
1479,60.46
1480,60.81
1481,61.14
1482,61.42
1483,61.60
1484,61.70
1485,61.71
1486,61.67
1487,61.62
1488,61.65
1489,61.76
1490,61.96
1491,62.19
1492,62.48
1493,62.77
1494,63.06
1495,63.29
1496,63.51
1497,63.71
1498,63.90
1499,64.05
1500,64.16
1501,64.24
1502,64.32
1503,64.38
1504,64.40
1505,64.40
1506,64.41
1507,64.48
1508,64.63
1509,64.81
1510,65.01
1511,65.17
1512,65.26
1513,65.25
1514,65.11
1515,64.89
1516,64.63
1517,64.38
1518,64.17
1519,64.04
1520,64.00
1521,64.02
1522,64.03
1523,64.01
1524,63.91
1525,63.77
1526,63.57
1527,63.35
1528,63.15
1529,63.00
1530,62.92
1531,62.91
1532,62.96
1533,63.02
1534,63.04
1535,63.06
1536,63.06
1537,63.08
1538,63.05
1539,63.00
1540,62.95
1541,62.89
1542,62.77
1543,62.60
1544,62.42
1545,62.26
1546,62.09
1547,61.91
1548,61.76
1549,61.65
1550,61.60
1551,61.58
1552,61.60
1553,61.68
1554,61.82
1555,61.97
1556,62.05
1557,62.05
1558,61.99
1559,61.90
1560,61.81
1561,61.75
1562,61.72
1563,61.74
1564,61.84
1565,62.00
1566,62.20
1567,62.36
1568,62.45
1569,62.45
1570,62.39
1571,62.29
1572,62.13
1573,61.97
1574,61.94
1575,62.10
1576,62.43
1577,62.84
1578,63.25
1579,63.57
1580,63.77
1581,63.87
1582,63.88
1583,63.80
1584,63.66
1585,63.48
1586,63.35
1587,63.31
1588,63.38
1589,63.49
1590,63.61
1591,63.71
1592,63.82
1593,63.95
1594,64.11
1595,64.27
1596,64.45
1597,64.61
1598,64.82
1599,65.05
1600,65.34
1601,65.66
1602,65.99
1603,66.28
1604,66.54
1605,66.73
1606,66.91
1607,67.02
1608,67.09
1609,67.11
1610,67.12
1611,67.12
1612,67.16
1613,67.22
1614,67.32
1615,67.46
1616,67.63
1617,67.80
1618,68.00
1619,68.20
1620,68.39
1621,68.57
1622,68.73
1623,68.89
1624,69.05
1625,69.17
1626,69.21
1627,69.17
1628,69.08
1629,68.98
1630,68.89
1631,68.82
1632,68.81
1633,68.87
1634,69.01
1635,69.19
1636,69.37
1637,69.53
1638,69.66
1639,69.72
1640,69.70
1641,69.62
1642,69.50
1643,69.41
1644,69.40
1645,69.47
1646,69.58
1647,69.69
1648,69.82
1649,69.97
1650,70.11
1651,70.17
1652,70.08
1653,69.83
1654,69.53
1655,69.26
1656,69.07
1657,68.97
1658,68.98
1659,69.08
1660,69.24
1661,69.38
1662,69.47
1663,69.47
1664,69.37
1665,69.21
1666,69.02
1667,68.83
1668,68.71
1669,68.65
1670,68.63
1671,68.65
1672,68.73
1673,68.87
1674,69.05
1675,69.21
1676,69.33
1677,69.37
1678,69.33
1679,69.21
1680,69.04
1681,68.83
1682,68.63
1683,68.47
1684,68.39
1685,68.39
1686,68.43
1687,68.49
1688,68.55
1689,68.60
1690,68.58
1691,68.50
1692,68.39
1693,68.33
1694,68.32
1695,68.30
1696,68.18
1697,68.00
1698,67.83
1699,67.72
1700,67.68
1701,67.67
1702,67.64
1703,67.64
1704,67.67
1705,67.71
1706,67.75
1707,67.77
1708,67.79
1709,67.81
1710,67.80
1711,67.76
1712,67.72
1713,67.70
1714,67.71
1715,67.75
1716,67.81
1717,67.89
1718,67.98
1719,68.05
1720,68.06
1721,68.05
1722,67.98
1723,67.88
1724,67.74
1725,67.59
1726,67.42
1727,67.24
1728,67.04
1729,66.86
1730,66.72
1731,66.62
1732,66.55
1733,66.51
1734,66.52
1735,66.58
1736,66.67
1737,66.75
1738,66.82
1739,66.86
1740,66.86
1741,66.82
1742,66.74
1743,66.62
1744,66.47
1745,66.31
1746,66.15
1747,66.06
1748,66.03
1749,66.07
1750,66.15
1751,66.25
1752,66.35
1753,66.46
1754,66.53
1755,66.54
1756,66.47
1757,66.36
1758,66.27
1759,66.22
1760,66.25
1761,66.28
1762,66.32
1763,66.37
1764,66.42
1765,66.47
1766,66.51
1767,66.56
1768,66.64
1769,66.76
1770,66.84
1771,66.89
1772,66.92
1773,66.93
1774,66.92
1775,66.86
1776,66.78
1777,66.70
1778,66.60
1779,66.53
1780,66.49
1781,66.48
1782,66.51
1783,66.53
1784,66.55
1785,66.57
1786,66.57
1787,66.57
1788,66.61
1789,66.69
1790,66.76
1791,66.83
1792,66.90
1793,66.97
1794,67.02
1795,67.03
1796,67.01
1797,66.98
1798,66.96
1799,66.94
1800,66.96
1801,67.03
1802,67.15
1803,67.31
1804,67.53
1805,67.74
1806,67.92
1807,68.00
1808,68.00
1809,67.95
1810,67.89
1811,67.86
1812,67.85
1813,67.87
1814,67.89
1815,67.92
1816,67.94
1817,67.92
1818,67.84
1819,67.73
1820,67.60
1821,67.47
1822,67.34
1823,67.29
1824,67.34
1825,67.48
1826,67.63
1827,67.75
1828,67.79
1829,67.79
1830,67.71
1831,67.56
1832,67.34
1833,67.12
1834,66.90
1835,66.73
1836,66.60
1837,66.57
1838,66.60
1839,66.67
1840,66.73
1841,66.80
1842,66.81
1843,66.76
1844,66.60
1845,66.41
1846,66.19
1847,66.04
1848,65.95
1849,65.93
1850,65.96
1851,66.02
1852,66.10
1853,66.14
1854,66.12
1855,66.01
1856,65.88
1857,65.75
1858,65.67
1859,65.63
1860,65.64
1861,65.69
1862,65.80
1863,65.96
1864,66.17
1865,66.37
1866,66.53
1867,66.63
1868,66.68
1869,66.66
1870,66.55
1871,66.39
1872,66.24
1873,66.13
1874,66.06
1875,66.03
1876,66.02
1877,66.05
1878,66.06
1879,66.02
1880,65.93
1881,65.78
1882,65.63
1883,65.48
1884,65.38
1885,65.36
1886,65.45
1887,65.64
1888,65.84
1889,66.00
1890,66.11
1891,66.15
1892,66.09
1893,65.93
1894,65.70
1895,65.50
1896,65.39
1897,65.39
1898,65.48
1899,65.62
1900,65.80
1901,65.99
1902,66.10
1903,66.10
1904,65.99
1905,65.81
1906,65.58
1907,65.32
1908,65.06
1909,64.88
1910,64.83
1911,64.90
1912,65.08
1913,65.30
1914,65.57
1915,65.80
1916,65.96
1917,66.00
1918,65.96
1919,65.90
1920,65.83
1921,65.80
1922,65.88
1923,66.06
1924,66.31
1925,66.56
1926,66.72
1927,66.76
1928,66.69
1929,66.50
1930,66.23
1931,65.93
1932,65.67
1933,65.57
1934,65.64
1935,65.86
1936,66.21
1937,66.60
1938,67.01
1939,67.35
1940,67.60
1941,67.72
1942,67.71
1943,67.63
1944,67.52
1945,67.41
1946,67.33
1947,67.27
1948,67.25
1949,67.29
1950,67.38
1951,67.48
1952,67.58
1953,67.63
1954,67.63
1955,67.57
1956,67.50
1957,67.41
1958,67.32
1959,67.26
1960,67.27
1961,67.34
1962,67.47
1963,67.60
1964,67.69
1965,67.73
1966,67.72
1967,67.65
1968,67.56
1969,67.46
1970,67.37
1971,67.31
1972,67.28
1973,67.28
1974,67.31
1975,67.38
1976,67.44
1977,67.47
1978,67.51
1979,67.54
1980,67.60
1981,67.67
1982,67.80
1983,67.99
1984,68.18
1985,68.37
1986,68.50
1987,68.58
1988,68.61
1989,68.57
1990,68.46
1991,68.28
1992,68.06
1993,67.88
1994,67.76
1995,67.70
1996,67.68
1997,67.71
1998,67.76
1999,67.80
2000,67.79
2001,67.70
2002,67.59
2003,67.48
2004,67.41
2005,67.38
2006,67.38
2007,67.42
2008,67.47
2009,67.54
2010,67.60
2011,67.66
2012,67.70
2013,67.74
2014,67.81
2015,67.89
2016,67.96
2017,68.00
2018,68.02
2019,68.05
2020,68.05
2021,68.02
2022,67.92
2023,67.77
2024,67.62
2025,67.46
2026,67.28
2027,67.05
2028,66.84
2029,66.67
2030,66.57
2031,66.56
2032,66.64
2033,66.82
2034,67.09
2035,67.38
2036,67.68
2037,67.92
2038,68.08
2039,68.14
2040,68.12
2041,68.05
2042,67.99
2043,67.97
2044,67.99
2045,68.05
2046,68.15
2047,68.25
2048,68.31
2049,68.32
2050,68.28
2051,68.21
2052,68.10
2053,67.99
2054,67.89
2055,67.83
2056,67.78
2057,67.79
2058,67.85
2059,67.93
2060,67.96
2061,67.91
2062,67.79
2063,67.66
2064,67.57
2065,67.53
2066,67.54
2067,67.63
2068,67.76
2069,67.90
2070,68.02
2071,68.08
2072,68.08
2073,67.99
2074,67.85
2075,67.71
2076,67.61
2077,67.51
2078,67.35
2079,67.14
2080,66.93
2081,66.77
2082,66.64
2083,66.51
2084,66.35
2085,66.20
2086,66.08
2087,66.05
2088,66.09
2089,66.17
2090,66.18
2091,66.06
2092,65.83
2093,65.55
2094,65.24
2095,64.92
2096,64.57
2097,64.28
2098,64.07
2099,63.98
2100,63.93
2101,63.89
2102,63.77
2103,63.60
2104,63.34
2105,63.02
2106,62.67
2107,62.37
2108,62.16
2109,62.06
2110,62.06
2111,62.13
2112,62.22
2113,62.28
2114,62.28
2115,62.23
2116,62.19
2117,62.18
2118,62.24
2119,62.39
2120,62.61
2121,62.87
2122,63.13
2123,63.31
2124,63.39
2125,63.35
2126,63.18
2127,62.92
2128,62.63
2129,62.36
2130,62.15
2131,61.99
2132,61.90
2133,61.88
2134,61.90
2135,61.94
2136,61.90
2137,61.77
2138,61.51
2139,61.17
2140,60.81
2141,60.48
2142,60.21
2143,60.04
2144,59.96
2145,59.99
2146,60.07
2147,60.16
2148,60.20
2149,60.23
2150,60.23
2151,60.25
2152,60.29
2153,60.37
2154,60.52
2155,60.72
2156,60.92
2157,61.05
2158,61.05
2159,60.88
2160,60.57
2161,60.16
2162,59.75
2163,59.43
2164,59.23
2165,59.17
2166,59.22
2167,59.33
2168,59.46
2169,59.56
2170,59.59
2171,59.55
2172,59.47
2173,59.41
2174,59.39
2175,59.43
2176,59.54
2177,59.70
2178,59.87
2179,60.02
2180,60.11
2181,60.15
2182,60.13
2183,60.06
2184,59.99
2185,59.94
2186,59.88
2187,59.82
2188,59.75
2189,59.69
2190,59.67
2191,59.65
2192,59.68
2193,59.76
2194,59.94
2195,60.16
2196,60.34
2197,60.42
2198,60.45
2199,60.48
2200,60.55
2201,60.68
2202,60.84
2203,61.04
2204,61.27
2205,61.52
2206,61.74
2207,61.90
2208,61.98
2209,61.98
2210,61.90
2211,61.76
2212,61.55
2213,61.32
2214,61.08
2215,60.87
2216,60.72
2217,60.64
2218,60.65
2219,60.75
2220,60.92
2221,61.14
2222,61.40
2223,61.66
2224,61.89
2225,62.07
2226,62.22
2227,62.35
2228,62.48
2229,62.61
2230,62.79
2231,63.01
2232,63.27
2233,63.52
2234,63.76
2235,63.93
2236,64.06
2237,64.12
2238,64.13
2239,64.12
2240,64.16
2241,64.26
2242,64.49
2243,64.79
2244,65.15
2245,65.52
2246,65.91
2247,66.28
2248,66.64
2249,66.87
2250,66.97
2251,66.91
2252,66.80
2253,66.66
2254,66.58
2255,66.53
2256,66.55
2257,66.64
2258,66.86
2259,67.12
2260,67.44
2261,67.73
2262,68.02
2263,68.30
2264,68.58
2265,68.86
2266,69.13
2267,69.36
2268,69.57
2269,69.76
2270,69.98
2271,70.21
2272,70.48
2273,70.73
2274,70.99
2275,71.19
2276,71.33
2277,71.43
2278,71.53
2279,71.61
2280,71.69
2281,71.75
2282,71.82
2283,71.90
2284,71.98
2285,72.04
2286,72.09
2287,72.14
2288,72.22
2289,72.28
2290,72.30
2291,72.27
2292,72.16
2293,72.02
2294,71.86
2295,71.68
2296,71.49
2297,71.35
2298,71.30
2299,71.34
2300,71.43
2301,71.54
2302,71.64
2303,71.70
2304,71.68
2305,71.56
2306,71.37
2307,71.17
2308,70.95
2309,70.71
2310,70.47
2311,70.25
2312,70.07
2313,69.91
2314,69.74
2315,69.56
2316,69.39
2317,69.27
2318,69.20
2319,69.17
2320,69.15
2321,69.16
2322,69.15
2323,69.14
2324,69.09
2325,69.03
2326,68.96
2327,68.88
2328,68.79
2329,68.66
2330,68.53
2331,68.39
2332,68.27
2333,68.14
2334,68.02
2335,67.96
2336,68.01
2337,68.16
2338,68.39
2339,68.66
2340,68.95
2341,69.25
2342,69.52
2343,69.72
2344,69.86
2345,69.98
2346,70.08
2347,70.16
2348,70.21
2349,70.21
2350,70.16
2351,70.06
2352,69.92
2353,69.71
2354,69.45
2355,69.19
2356,68.98
2357,68.86
2358,68.80
2359,68.79
2360,68.83
2361,68.93
2362,69.05
2363,69.18
2364,69.29
2365,69.34
2366,69.34
2367,69.26
2368,69.14
2369,69.02
2370,68.89
2371,68.82
2372,68.81
2373,68.87
2374,68.96
2375,69.07
2376,69.17
2377,69.25
2378,69.28
2379,69.28
2380,69.27
2381,69.27
2382,69.26
2383,69.24
2384,69.23
2385,69.23
2386,69.24
2387,69.21
2388,69.17
2389,69.10
2390,69.06
2391,69.05
2392,69.11
2393,69.23
2394,69.43
2395,69.69
2396,69.97
2397,70.24
2398,70.46
2399,70.61
2400,70.69
2401,70.72
2402,70.69
2403,70.65
2404,70.62
2405,70.62
2406,70.66
2407,70.72
2408,70.78
2409,70.82
2410,70.83
2411,70.79
2412,70.69
2413,70.53
2414,70.35
2415,70.17
2416,69.99
2417,69.85
2418,69.76
2419,69.71
2420,69.65
2421,69.56
2422,69.49
2423,69.42
2424,69.38
2425,69.36
2426,69.37
2427,69.44
2428,69.54
2429,69.66
2430,69.76
2431,69.82
2432,69.85
2433,69.82
2434,69.76
2435,69.64
2436,69.49
2437,69.35
2438,69.23
2439,69.15
2440,69.11
2441,69.09
2442,69.06
2443,69.00
2444,68.91
2445,68.81
2446,68.71
2447,68.63
2448,68.57
2449,68.55
2450,68.59
2451,68.67
2452,68.76
2453,68.82
2454,68.86
2455,68.85
2456,68.81
2457,68.78
2458,68.76
2459,68.78
2460,68.81
2461,68.86
2462,68.92
2463,69.00
2464,69.06
2465,69.08
2466,69.07
2467,69.03
2468,68.96
2469,68.87
2470,68.73
2471,68.55
2472,68.31
2473,68.06
2474,67.82
2475,67.60
2476,67.38
2477,67.21
2478,67.07
2479,66.99
2480,66.94
2481,66.89
2482,66.82
2483,66.76
2484,66.71
2485,66.67
2486,66.64
2487,66.64
2488,66.70
2489,66.84
2490,67.04
2491,67.25
2492,67.41
2493,67.54
2494,67.59
2495,67.57
2496,67.47
2497,67.34
2498,67.18
2499,67.03
2500,66.93
2501,66.92
2502,66.99
2503,67.11
2504,67.22
2505,67.29
2506,67.28
2507,67.20
2508,67.04
2509,66.81
2510,66.57
2511,66.39
2512,66.31
2513,66.35
2514,66.52
2515,66.83
2516,67.22
2517,67.65
2518,68.01
2519,68.26
2520,68.37
2521,68.37
2522,68.25
2523,68.05
2524,67.83
2525,67.64
2526,67.51
2527,67.41
2528,67.34
2529,67.28
2530,67.23
2531,67.19
2532,67.15
2533,67.09
2534,67.01
2535,66.93
2536,66.86
2537,66.84
2538,66.86
2539,66.91
2540,66.96
2541,66.99
2542,67.04
2543,67.09
2544,67.18
2545,67.30
2546,67.46
2547,67.62
2548,67.74
2549,67.83
2550,67.87
2551,67.89
2552,67.87
2553,67.79
2554,67.68
2555,67.55
2556,67.43
2557,67.31
2558,67.19
2559,67.09
2560,67.01
2561,66.93
2562,66.84
2563,66.79
2564,66.79
2565,66.84
2566,66.93
2567,67.06
2568,67.24
2569,67.45
2570,67.67
2571,67.88
2572,68.07
2573,68.24
2574,68.38
2575,68.44
2576,68.43
2577,68.32
2578,68.15
2579,67.92
2580,67.70
2581,67.51
2582,67.40
2583,67.37
2584,67.39
2585,67.43
2586,67.46
2587,67.46
2588,67.43
2589,67.38
2590,67.28
2591,67.18
2592,67.09
2593,67.05
2594,67.07
2595,67.13
2596,67.21
2597,67.26
2598,67.31
2599,67.37
2600,67.46
2601,67.57
2602,67.72
2603,67.86
2604,68.01
2605,68.14
2606,68.26
2607,68.38
2608,68.51
2609,68.61
2610,68.63
2611,68.56
2612,68.41
2613,68.24
2614,68.08
2615,67.93
2616,67.84
2617,67.81
2618,67.90
2619,68.10
2620,68.39
2621,68.73
2622,69.12
2623,69.51
2624,69.90
2625,70.25
2626,70.59
2627,70.92
2628,71.19
2629,71.37
2630,71.45
2631,71.40
2632,71.27
2633,71.10
2634,70.97
2635,70.89
2636,70.92
2637,71.01
2638,71.22
2639,71.47
2640,71.74
2641,71.95
2642,72.06
2643,72.08
2644,72.03
2645,71.95
2646,71.88
2647,71.86
2648,71.87
2649,71.87
2650,71.88
2651,71.89
2652,71.91
2653,71.89
2654,71.83
2655,71.72
2656,71.62
2657,71.53
2658,71.49
2659,71.50
2660,71.53
2661,71.57
2662,71.59
2663,71.56
2664,71.53
2665,71.46
2666,71.37
2667,71.27
2668,71.18
2669,71.14
2670,71.17
2671,71.26
2672,71.35
2673,71.44
2674,71.50
2675,71.54
2676,71.53
2677,71.47
2678,71.40
2679,71.33
2680,71.29
2681,71.25
2682,71.21
2683,71.14
2684,71.08
2685,71.02
2686,70.96
2687,70.88
2688,70.77
2689,70.63
2690,70.48
2691,70.34
2692,70.21
2693,70.07
2694,69.92
2695,69.78
2696,69.68
2697,69.62
2698,69.58
2699,69.56
2700,69.56
2701,69.56
2702,69.54
2703,69.51
2704,69.47
2705,69.43
2706,69.37
2707,69.29
2708,69.21
2709,69.13
2710,69.04
2711,68.95
2712,68.83
2713,68.73
2714,68.65
2715,68.59
2716,68.55
2717,68.55
2718,68.60
2719,68.70
2720,68.85
2721,69.01
2722,69.15
2723,69.27
2724,69.39
2725,69.50
2726,69.61
2727,69.70
2728,69.82
2729,70.01
2730,70.24
2731,70.47
2732,70.60
2733,70.61
2734,70.56
2735,70.48
2736,70.46
2737,70.50
2738,70.62
2739,70.79
2740,71.01
2741,71.24
2742,71.44
2743,71.62
2744,71.75
2745,71.83
2746,71.87
2747,71.88
2748,71.92
2749,71.98
2750,72.05
2751,72.14
2752,72.22
2753,72.26
2754,72.23
2755,72.14
2756,72.04
2757,71.98
2758,71.96
2759,71.95
2760,71.92
2761,71.91
2762,71.89
2763,71.89
2764,71.91
2765,71.97
2766,72.07
2767,72.24
2768,72.43
2769,72.57
2770,72.62
2771,72.56
2772,72.40
2773,72.12
2774,71.71
2775,71.25
2776,70.83
2777,70.56
2778,70.40
2779,70.37
2780,70.43
2781,70.56
2782,70.68
2783,70.75
2784,70.71
2785,70.59
2786,70.40
2787,70.18
2788,69.95
2789,69.73
2790,69.54
2791,69.40
2792,69.31
2793,69.27
2794,69.30
2795,69.37
2796,69.47
2797,69.62
2798,69.82
2799,70.08
2800,70.34
2801,70.54
2802,70.71
2803,70.82
2804,70.88
2805,70.88
2806,70.85
2807,70.85
2808,70.88
2809,70.96
2810,71.10
2811,71.26
2812,71.41
2813,71.52
2814,71.55
2815,71.50
2816,71.40
2817,71.25
2818,71.11
2819,71.01
2820,70.97
2821,71.03
2822,71.21
2823,71.46
2824,71.75
2825,72.04
2826,72.30
2827,72.54
2828,72.72
2829,72.83
2830,72.85
2831,72.76
2832,72.61
2833,72.40
2834,72.20
2835,72.01
2836,71.87
2837,71.77
2838,71.72
2839,71.70
2840,71.69
2841,71.67
2842,71.64
2843,71.58
2844,71.47
2845,71.33
2846,71.20
2847,71.11
2848,71.10
2849,71.14
2850,71.22
2851,71.33
2852,71.51
2853,71.73
2854,71.97
2855,72.19
2856,72.40
2857,72.59
2858,72.80
2859,73.00
2860,73.17
2861,73.31
2862,73.42
2863,73.49
2864,73.54
2865,73.53
2866,73.51
2867,73.46
2868,73.42
2869,73.36
2870,73.29
2871,73.23
2872,73.19
2873,73.21
2874,73.30
2875,73.43
2876,73.62
2877,73.82
2878,74.01
2879,74.17
2880,74.29
2881,74.33
2882,74.26
2883,74.09
2884,73.83
2885,73.59
2886,73.41
2887,73.34
2888,73.33
2889,73.32
2890,73.23
2891,73.08
2892,72.84
2893,72.54
2894,72.19
2895,71.85
2896,71.56
2897,71.37
2898,71.24
2899,71.13
2900,70.97
2901,70.76
2902,70.47
2903,70.18
2904,69.88
2905,69.60
2906,69.34
2907,69.14
2908,68.95
2909,68.77
2910,68.57
2911,68.32
2912,68.00
2913,67.67
2914,67.31
2915,66.99
2916,66.73
2917,66.56
2918,66.44
2919,66.37
2920,66.29
2921,66.22
2922,66.13
2923,66.06
2924,65.99
2925,65.94
2926,65.95
2927,66.01
2928,66.12
2929,66.28
2930,66.49
2931,66.74
2932,67.05
2933,67.37
2934,67.69
2935,67.99
2936,68.28
2937,68.51
2938,68.66
2939,68.70
2940,68.64
2941,68.52
2942,68.36
2943,68.18
2944,67.99
2945,67.78
2946,67.60
2947,67.46
2948,67.38
2949,67.34
2950,67.34
2951,67.36
2952,67.38
2953,67.38
2954,67.34
2955,67.31
2956,67.28
2957,67.28
2958,67.28
2959,67.31
2960,67.38
2961,67.50
2962,67.61
2963,67.65
2964,67.64
2965,67.60
2966,67.53
2967,67.43
2968,67.33
2969,67.26
2970,67.25
2971,67.31
2972,67.44
2973,67.57
2974,67.70
2975,67.80
2976,67.88
2977,67.96
2978,68.05
2979,68.13
2980,68.18
2981,68.24
2982,68.36
2983,68.50
2984,68.67
2985,68.83
2986,69.01
2987,69.16
2988,69.27
2989,69.34
2990,69.39
2991,69.46
2992,69.57
2993,69.72
2994,69.89
2995,70.06
2996,70.24
2997,70.42
2998,70.61
2999,70.75
3000,70.77
3001,70.66
3002,70.43
3003,70.16
3004,69.89
3005,69.65
3006,69.49
3007,69.42
3008,69.46
3009,69.59
3010,69.77
3011,69.92
3012,70.01
3013,70.05
3014,70.09
3015,70.14
3016,70.22
3017,70.34
3018,70.56
3019,70.89
3020,71.32
3021,71.72
3022,72.04
3023,72.19
3024,72.20
3025,72.07
3026,71.87
3027,71.65
3028,71.44
3029,71.30
3030,71.25
3031,71.29
3032,71.40
3033,71.55
3034,71.68
3035,71.78
3036,71.85
3037,71.89
3038,71.90
3039,71.87
3040,71.83
3041,71.79
3042,71.76
3043,71.72
3044,71.66
3045,71.56
3046,71.46
3047,71.37
3048,71.31
3049,71.31
3050,71.40
3051,71.56
3052,71.75
3053,71.97
3054,72.15
3055,72.30
3056,72.34
3057,72.28
3058,72.13
3059,71.91
3060,71.63
3061,71.35
3062,71.11
3063,70.95
3064,70.87
3065,70.83
3066,70.81
3067,70.77
3068,70.70
3069,70.60
3070,70.49
3071,70.39
3072,70.31
3073,70.32
3074,70.41
3075,70.58
3076,70.72
3077,70.80
3078,70.75
3079,70.58
3080,70.33
3081,70.03
3082,69.71
3083,69.44
3084,69.23
3085,69.11
3086,69.06
3087,69.07
3088,69.10
3089,69.15
3090,69.16
3091,69.15
3092,69.08
3093,69.02
3094,68.99
3095,69.01
3096,69.05
3097,69.06
3098,69.08
3099,69.12
3100,69.20
3101,69.30
3102,69.40
3103,69.54
3104,69.75
3105,70.02
3106,70.36
3107,70.72
3108,71.08
3109,71.40
3110,71.66
3111,71.78
3112,71.82
3113,71.78
3114,71.71
3115,71.62
3116,71.53
3117,71.46
3118,71.40
3119,71.36
3120,71.31
3121,71.24
3122,71.13
3123,71.01
3124,70.86
3125,70.72
3126,70.61
3127,70.53
3128,70.47
3129,70.47
3130,70.50
3131,70.56
3132,70.59
3133,70.57
3134,70.53
3135,70.49
3136,70.42
3137,70.30
3138,70.13
3139,69.93
3140,69.73
3141,69.53
3142,69.32
3143,69.12
3144,68.97
3145,68.91
3146,68.92
3147,69.01
3148,69.15
3149,69.31
3150,69.48
3151,69.64
3152,69.78
3153,69.89
3154,70.00
3155,70.10
3156,70.21
3157,70.30
3158,70.40
3159,70.52
3160,70.68
3161,70.83
3162,70.95
3163,71.01
3164,71.04
3165,71.05
3166,71.04
3167,70.98
3168,70.91
3169,70.86
3170,70.88
3171,70.94
3172,71.03
3173,71.15
3174,71.30
3175,71.44
3176,71.54
3177,71.56
3178,71.50
3179,71.36
3180,71.14
3181,70.92
3182,70.76
3183,70.69
3184,70.74
3185,70.88
3186,71.10
3187,71.32
3188,71.50
3189,71.56
3190,71.49
3191,71.28
3192,70.98
3193,70.66
3194,70.38
3195,70.21
3196,70.20
3197,70.30
3198,70.48
3199,70.71
3200,70.93
3201,71.09
3202,71.15
3203,71.12
3204,71.01
3205,70.84
3206,70.63
3207,70.40
3208,70.16
3209,69.98
3210,69.86
3211,69.80
3212,69.79
3213,69.84
3214,69.90
3215,69.97
3216,69.99
3217,69.96
3218,69.86
3219,69.72
3220,69.53
3221,69.31
3222,69.08
3223,68.86
3224,68.66
3225,68.48
3226,68.34
3227,68.26
3228,68.23
3229,68.25
3230,68.31
3231,68.35
3232,68.34
3233,68.28
3234,68.20
3235,68.11
3236,68.05
3237,68.03
3238,68.07
3239,68.17
3240,68.32
3241,68.52
3242,68.76
3243,69.05
3244,69.36
3245,69.68
3246,69.97
3247,70.21
3248,70.40
3249,70.52
3250,70.56
3251,70.50
3252,70.34
3253,70.12
3254,69.85
3255,69.61
3256,69.45
3257,69.41
3258,69.47
3259,69.57
3260,69.68
3261,69.76
3262,69.81
3263,69.79
3264,69.68
3265,69.52
3266,69.37
3267,69.31
3268,69.34
3269,69.47
3270,69.66
3271,69.85
3272,70.03
3273,70.11
3274,70.08
3275,69.92
3276,69.63
3277,69.31
3278,69.03
3279,68.83
3280,68.70
3281,68.64
3282,68.67
3283,68.77
3284,68.89
3285,68.94
3286,68.87
3287,68.70
3288,68.42
3289,68.09
3290,67.76
3291,67.45
3292,67.22
3293,67.09
3294,67.02
3295,67.00
3296,67.04
3297,67.14
3298,67.28
3299,67.43
3300,67.56
3301,67.68
3302,67.78
3303,67.89
3304,67.97
3305,68.03
3306,68.05
3307,68.01
3308,67.92
3309,67.80
3310,67.63
3311,67.44
3312,67.21
3313,67.02
3314,66.87
3315,66.77
3316,66.70
3317,66.67
3318,66.64
3319,66.63
3320,66.59
3321,66.53
3322,66.45
3323,66.39
3324,66.38
3325,66.41
3326,66.51
3327,66.65
3328,66.81
3329,66.98
3330,67.12
3331,67.22
3332,67.26
3333,67.22
3334,67.12
3335,66.96
3336,66.75
3337,66.53
3338,66.31
3339,66.13
3340,65.99
3341,65.92
3342,65.90
3343,65.92
3344,65.96
3345,65.99
3346,65.97
3347,65.88
3348,65.73
3349,65.57
3350,65.47
3351,65.46
3352,65.57
3353,65.77
3354,66.06
3355,66.44
3356,66.88
3357,67.30
3358,67.63
3359,67.85
3360,67.99
3361,68.08
3362,68.18
3363,68.24
3364,68.32
3365,68.41
3366,68.58
3367,68.82
3368,69.11
3369,69.41
3370,69.70
3371,69.95
3372,70.17
3373,70.31
3374,70.37
3375,70.30
3376,70.14
3377,69.93
3378,69.76
3379,69.66
3380,69.61
3381,69.62
3382,69.66
3383,69.72
3384,69.78
3385,69.82
3386,69.84
3387,69.84
3388,69.81
3389,69.78
3390,69.75
3391,69.73
3392,69.68
3393,69.56
3394,69.37
3395,69.16
3396,68.90
3397,68.60
3398,68.26
3399,67.92
3400,67.63
3401,67.41
3402,67.26
3403,67.17
3404,67.11
3405,67.07
3406,67.01
3407,66.93
3408,66.84
3409,66.76
3410,66.70
3411,66.66
3412,66.64
3413,66.69
3414,66.80
3415,66.96
3416,67.13
3417,67.31
3418,67.53
3419,67.80
3420,68.13
3421,68.44
3422,68.76
3423,69.05
3424,69.35
3425,69.60
3426,69.80
3427,69.94
3428,70.07
3429,70.19
3430,70.33
3431,70.43
3432,70.51
3433,70.55
3434,70.53
3435,70.45
3436,70.34
3437,70.24
3438,70.13
3439,70.01
3440,69.90
3441,69.79
3442,69.63
3443,69.41
3444,69.14
3445,68.83
3446,68.51
3447,68.21
3448,67.99
3449,67.88
3450,67.92
3451,68.12
3452,68.39
3453,68.68
3454,68.89
3455,69.02
3456,69.05
3457,68.99
3458,68.81
3459,68.55
3460,68.28
3461,68.04
3462,67.80
3463,67.57
3464,67.36
3465,67.20
3466,67.05
3467,66.94
3468,66.86
3469,66.84
3470,66.86
3471,66.93
3472,67.02
3473,67.12
3474,67.21
3475,67.28
3476,67.31
3477,67.34
3478,67.32
3479,67.28
3480,67.21
3481,67.09
3482,66.93
3483,66.74
3484,66.58
3485,66.44
3486,66.31
3487,66.25
3488,66.29
3489,66.39
3490,66.50
3491,66.56
3492,66.60
3493,66.63
3494,66.67
3495,66.76
3496,66.89
3497,67.10
3498,67.41
3499,67.79
3500,68.23
3501,68.65
3502,68.99
3503,69.18
3504,69.27
3505,69.27
3506,69.27
3507,69.27
3508,69.30
3509,69.37
3510,69.53
3511,69.70
3512,69.85
3513,69.90
3514,69.83
3515,69.66
3516,69.43
3517,69.18
3518,68.98
3519,68.90
3520,68.95
3521,69.15
3522,69.43
3523,69.73
3524,69.99
3525,70.15
3526,70.20
3527,70.15
3528,70.05
3529,69.90
3530,69.77
3531,69.66
3532,69.61
3533,69.60
3534,69.60
3535,69.60
3536,69.57
3537,69.47
3538,69.28
3539,69.05
3540,68.81
3541,68.60
3542,68.44
3543,68.32
3544,68.26
3545,68.24
3546,68.22
3547,68.18
3548,68.15
3549,68.15
3550,68.17
3551,68.21
3552,68.28
3553,68.37
3554,68.50
3555,68.65
3556,68.79
3557,68.91
3558,69.01
3559,69.08
3560,69.15
3561,69.21
3562,69.26
3563,69.28
3564,69.26
3565,69.20
3566,69.11
3567,69.02
3568,68.91
3569,68.79
3570,68.66
3571,68.51
3572,68.37
3573,68.24
3574,68.09
3575,67.93
3576,67.76
3577,67.63
3578,67.54
3579,67.47
3580,67.41
3581,67.31
3582,67.19
3583,67.08
3584,66.94
3585,66.80
3586,66.67
3587,66.57
3588,66.49
3589,66.46
3590,66.47
3591,66.49
3592,66.49
3593,66.45
3594,66.39
3595,66.35
3596,66.32
3597,66.33
3598,66.35
3599,66.38
3600,66.38
3601,66.31
3602,66.18
3603,65.97
3604,65.76
3605,65.58
3606,65.52
3607,65.58
3608,65.77
3609,66.03
3610,66.31
3611,66.58
3612,66.80
3613,66.93
3614,66.98
3615,66.96
3616,66.95
3617,66.99
3618,67.11
3619,67.28
3620,67.50
3621,67.73
3622,67.93
3623,68.03
3624,68.05
3625,67.99
3626,67.86
3627,67.67
3628,67.48
3629,67.33
3630,67.26
3631,67.27
3632,67.34
3633,67.46
3634,67.60
3635,67.74
3636,67.87
3637,67.97
3638,68.02
3639,67.99
3640,67.93
3641,67.89
3642,67.90
3643,67.99
3644,68.12
3645,68.25
3646,68.38
3647,68.47
3648,68.48
3649,68.42
3650,68.30
3651,68.16
3652,68.04
3653,67.94
3654,67.84
3655,67.74
3656,67.63
3657,67.50
3658,67.30
3659,67.06
3660,66.82
3661,66.61
3662,66.47
3663,66.40
3664,66.38
3665,66.42
3666,66.48
3667,66.55
3668,66.62
3669,66.67
3670,66.69
3671,66.70
3672,66.70
3673,66.70
3674,66.66
3675,66.56
3676,66.44
3677,66.33
3678,66.28
3679,66.28
3680,66.34
3681,66.48
3682,66.70
3683,66.97
3684,67.18
3685,67.29
3686,67.26
3687,67.08
3688,66.77
3689,66.41
3690,66.06
3691,65.77
3692,65.57
3693,65.45
3694,65.41
3695,65.43
3696,65.51
3697,65.63
3698,65.77
3699,65.91
3700,66.06
3701,66.19
3702,66.31
3703,66.39
3704,66.45
3705,66.51
3706,66.57
3707,66.67
3708,66.83
3709,67.00
3710,67.15
3711,67.26
3712,67.33
3713,67.37
3714,67.34
3715,67.27
3716,67.17
3717,67.11
3718,67.08
3719,67.06
3720,67.04
3721,67.01
3722,66.94
3723,66.84
3724,66.70
3725,66.54
3726,66.39
3727,66.29
3728,66.23
3729,66.20
3730,66.16
3731,66.11
3732,66.01
3733,65.85
3734,65.61
3735,65.34
3736,65.06
3737,64.86
3738,64.73
3739,64.70
3740,64.75
3741,64.83
3742,64.87
3743,64.83
3744,64.68
3745,64.46
3746,64.13
3747,63.73
3748,63.33
3749,63.01
3750,62.76
3751,62.59
3752,62.48
3753,62.45
3754,62.44
3755,62.40
3756,62.32
3757,62.22
3758,62.12
3759,62.06
3760,62.05
3761,62.11
3762,62.26
3763,62.48
3764,62.74
3765,63.00
3766,63.24
3767,63.45
3768,63.67
3769,63.86
3770,64.04
3771,64.20
3772,64.35
3773,64.45
3774,64.46
3775,64.36
3776,64.18
3777,63.93
3778,63.67
3779,63.44
3780,63.32
3781,63.33
3782,63.51
3783,63.81
3784,64.21
3785,64.63
3786,65.01
3787,65.27
3788,65.38
3789,65.36
3790,65.23
3791,65.03
3792,64.79
3793,64.54
3794,64.35
3795,64.25
3796,64.25
3797,64.35
3798,64.45
3799,64.51
3800,64.49
3801,64.41
3802,64.29
3803,64.13
3804,63.93
3805,63.73
3806,63.57
3807,63.49
3808,63.48
3809,63.55
3810,63.67
3811,63.84
3812,64.00
3813,64.11
3814,64.17
3815,64.17
3816,64.13
3817,64.03
3818,63.86
3819,63.65
3820,63.48
3821,63.39
3822,63.44
3823,63.60
3824,63.87
3825,64.19
3826,64.51
3827,64.80
3828,65.00
3829,65.06
3830,64.95
3831,64.70
3832,64.40
3833,64.12
3834,63.89
3835,63.74
3836,63.72
3837,63.84
3838,64.09
3839,64.40
3840,64.69
3841,64.92
3842,65.06
3843,65.09
3844,65.02
3845,64.89
3846,64.80
3847,64.79
3848,64.89
3849,65.05
3850,65.24
3851,65.42
3852,65.57
3853,65.66
3854,65.65
3855,65.56
3856,65.44
3857,65.38
3858,65.42
3859,65.54
3860,65.70
3861,65.87
3862,66.02
3863,66.09
3864,66.06
3865,65.93
3866,65.73
3867,65.55
3868,65.38
3869,65.22
3870,65.09
3871,65.01
3872,64.98
3873,64.96
3874,64.93
3875,64.87
3876,64.80
3877,64.78
3878,64.80
3879,64.84
3880,64.90
3881,64.99
3882,65.08
3883,65.18
3884,65.27
3885,65.33
3886,65.35
3887,65.31
3888,65.22
3889,65.06
3890,64.83
3891,64.59
3892,64.38
3893,64.25
3894,64.24
3895,64.35
3896,64.54
3897,64.80
3898,65.08
3899,65.31
3900,65.45
3901,65.49
3902,65.41
3903,65.25
3904,65.04
3905,64.86
3906,64.74
3907,64.73
3908,64.80
3909,64.93
3910,65.04
3911,65.11
3912,65.09
3913,65.02
3914,64.87
3915,64.67
3916,64.43
3917,64.19
3918,63.96
3919,63.77
3920,63.61
3921,63.49
3922,63.39
3923,63.25
3924,63.07
3925,62.87
3926,62.66
3927,62.48
3928,62.35
3929,62.27
3930,62.24
3931,62.29
3932,62.41
3933,62.57
3934,62.71
3935,62.82
3936,62.87
3937,62.89
3938,62.87
3939,62.78
3940,62.66
3941,62.50
3942,62.32
3943,62.13
3944,61.98
3945,61.86
3946,61.78
3947,61.76
3948,61.79
3949,61.89
3950,62.06
3951,62.26
3952,62.48
3953,62.72
3954,62.97
3955,63.18
3956,63.36
3957,63.49
3958,63.62
3959,63.74
3960,63.86
3961,63.97
3962,64.13
3963,64.32
3964,64.55
3965,64.81
3966,65.09
3967,65.40
3968,65.70
3969,65.91
3970,66.03
3971,66.05
3972,65.99
3973,65.89
3974,65.75
3975,65.61
3976,65.50
3977,65.43
3978,65.42
3979,65.44
3980,65.49
3981,65.53
3982,65.54
3983,65.52
3984,65.48
3985,65.50
3986,65.61
3987,65.86
3988,66.22
3989,66.64
3990,67.06
3991,67.45
3992,67.76
3993,67.96
3994,68.00
3995,67.90
3996,67.73
3997,67.52
3998,67.28
3999,67.04
4000,66.86
4001,66.76
4002,66.70
4003,66.67
4004,66.68
4005,66.76
4006,66.86
4007,66.96
4008,66.99
4009,66.99
4010,66.94
4011,66.86
4012,66.77
4013,66.67
4014,66.56
4015,66.48
4016,66.46
4017,66.48
4018,66.48
4019,66.46
4020,66.39
4021,66.28
4022,66.12
4023,65.93
4024,65.73
4025,65.57
4026,65.41
4027,65.26
4028,65.12
4029,65.03
4030,64.96
4031,64.90
4032,64.83
4033,64.73
4034,64.61
4035,64.47
4036,64.32
4037,64.17
4038,64.07
4039,64.06
4040,64.11
4041,64.21
4042,64.34
4043,64.48
4044,64.62
4045,64.75
4046,64.81
4047,64.82
4048,64.78
4049,64.73
4050,64.69
4051,64.67
4052,64.69
4053,64.71
4054,64.70
4055,64.63
4056,64.48
4057,64.25
4058,63.94
4059,63.60
4060,63.24
4061,62.92
4062,62.61
4063,62.37
4064,62.16
4065,62.00
4066,61.84
4067,61.67
4068,61.49
4069,61.31
4070,61.12
4071,60.92
4072,60.73
4073,60.62
4074,60.57
4075,60.62
4076,60.72
4077,60.87
4078,61.01
4079,61.15
4080,61.20
4081,61.14
4082,60.94
4083,60.67
4084,60.36
4085,60.08
4086,59.81
4087,59.58
4088,59.39
4089,59.26
4090,59.10
4091,58.92
4092,58.69
4093,58.46
4094,58.26
4095,58.08
4096,57.92
4097,57.83
4098,57.80
4099,57.81
4100,57.79
4101,57.74
4102,57.64
4103,57.50
4104,57.30
4105,57.08
4106,56.88
4107,56.72
4108,56.60
4109,56.55
4110,56.54
4111,56.60
4112,56.72
4113,56.86
4114,56.98
4115,57.06
4116,57.14
4117,57.19
4118,57.21
4119,57.18
4120,57.17
4121,57.21
4122,57.30
4123,57.43
4124,57.56
4125,57.67
4126,57.79
4127,57.86
4128,57.90
4129,57.89
4130,57.89
4131,57.92
4132,58.02
4133,58.16
4134,58.33
4135,58.49
4136,58.62
4137,58.70
4138,58.72
4139,58.68
4140,58.62
4141,58.55
4142,58.49
4143,58.45
4144,58.46
4145,58.51
4146,58.60
4147,58.69
4148,58.75
4149,58.81
4150,58.88
4151,58.98
4152,59.10
4153,59.21
4154,59.34
4155,59.47
4156,59.63
4157,59.79
4158,59.94
4159,60.06
4160,60.16
4161,60.21
4162,60.23
4163,60.20
4164,60.20
4165,60.21
4166,60.26
4167,60.34
4168,60.43
4169,60.52
4170,60.56
4171,60.57
4172,60.52
4173,60.39
4174,60.20
4175,59.96
4176,59.73
4177,59.55
4178,59.40
4179,59.31
4180,59.27
4181,59.27
4182,59.28
4183,59.30
4184,59.33
4185,59.36
4186,59.43
4187,59.51
4188,59.59
4189,59.63
4190,59.62
4191,59.56
4192,59.46
4193,59.33
4194,59.23
4195,59.14
4196,59.09
4197,59.09
4198,59.17
4199,59.33
4200,59.56
4201,59.80
4202,60.01
4203,60.14
4204,60.20
4205,60.20
4206,60.17
4207,60.13
4208,60.09
4209,60.07
4210,60.10
4211,60.13
4212,60.16
4213,60.13
4214,60.09
4215,60.05
4216,60.01
4217,59.99
4218,60.01
4219,60.09
4220,60.20
4221,60.31
4222,60.37
4223,60.35
4224,60.24
4225,60.07
4226,59.91
4227,59.76
4228,59.67
4229,59.62
4230,59.66
4231,59.78
4232,59.97
4233,60.19
4234,60.41
4235,60.59
4236,60.73
4237,60.86
4238,61.04
4239,61.24
4240,61.52
4241,61.86
4242,62.27
4243,62.68
4244,63.06
4245,63.36
4246,63.60
4247,63.77
4248,63.90
4249,64.02
4250,64.16
4251,64.31
4252,64.48
4253,64.67
4254,64.86
4255,65.00
4256,65.12
4257,65.18
4258,65.22
4259,65.25
4260,65.28
4261,65.30
4262,65.32
4263,65.35
4264,65.34
4265,65.28
4266,65.18
4267,65.03
4268,64.84
4269,64.65
4270,64.48
4271,64.36
4272,64.27
4273,64.19
4274,64.14
4275,64.12
4276,64.10
4277,64.09
4278,64.06
4279,64.03
4280,64.05
4281,64.11
4282,64.21
4283,64.33
4284,64.47
4285,64.61
4286,64.73
4287,64.80
4288,64.85
4289,64.87
4290,64.87
4291,64.87
4292,64.88
4293,64.92
4294,64.99
4295,65.06
4296,65.15
4297,65.21
4298,65.25
4299,65.25
4300,65.20
4301,65.14
4302,65.08
4303,65.04
4304,65.02
4305,65.00
4306,64.98
4307,64.96
4308,64.93
4309,64.89
4310,64.85
4311,64.83
4312,64.84
4313,64.88
4314,64.93
4315,65.02
4316,65.14
4317,65.27
4318,65.40
4319,65.51
4320,65.59
4321,65.63
4322,65.59
4323,65.48
4324,65.31
4325,65.12
4326,64.93
4327,64.77
4328,64.68
4329,64.68
4330,64.74
4331,64.83
4332,64.91
4333,64.99
4334,65.05
4335,65.05
4336,64.99
4337,64.93
4338,64.90
4339,64.93
4340,64.99
4341,65.03
4342,65.02
4343,64.96
4344,64.87
4345,64.74
4346,64.59
4347,64.41
4348,64.22
4349,64.05
4350,63.85
4351,63.62
4352,63.33
4353,63.03
4354,62.75
4355,62.55
4356,62.44
4357,62.40
4358,62.42
4359,62.49
4360,62.56
4361,62.59
4362,62.52
4363,62.36
4364,62.16
4365,62.00
4366,61.87
4367,61.79
4368,61.80
4369,61.91
4370,62.10
4371,62.32
4372,62.50
4373,62.61
4374,62.67
4375,62.68
4376,62.69
4377,62.71
4378,62.74
4379,62.77
4380,62.77
4381,62.77
4382,62.77
4383,62.74
4384,62.68
4385,62.56
4386,62.44
4387,62.35
4388,62.31
4389,62.36
4390,62.48
4391,62.68
4392,62.85
4393,62.97
4394,63.03
4395,63.01
4396,62.90
4397,62.67
4398,62.38
4399,62.11
4400,61.95
4401,61.90
4402,61.97
4403,62.09
4404,62.26
4405,62.46
4406,62.68
4407,62.86
4408,62.97
4409,63.03
4410,63.06
4411,63.14
4412,63.30
4413,63.51
4414,63.76
4415,63.96
4416,64.11
4417,64.19
4418,64.19
4419,64.08
4420,63.90
4421,63.74
4422,63.66
4423,63.70
4424,63.84
4425,64.04
4426,64.28
4427,64.48
4428,64.59
4429,64.54
4430,64.38
4431,64.16
4432,63.93
4433,63.77
4434,63.67
4435,63.66
4436,63.72
4437,63.84
4438,63.98
4439,64.07
4440,64.06
4441,63.91
4442,63.67
4443,63.39
4444,63.11
4445,62.90
4446,62.73
4447,62.64
4448,62.60
4449,62.62
4450,62.68
4451,62.74
4452,62.79
4453,62.83
4454,62.86
4455,62.91
4456,63.02
4457,63.18
4458,63.38
4459,63.58
4460,63.77
4461,63.91
4462,64.00
4463,64.01
4464,64.00
4465,63.99
4466,64.03
4467,64.13
4468,64.29
4469,64.47
4470,64.64
4471,64.74
4472,64.74
4473,64.65
4474,64.45
4475,64.19
4476,63.87
4477,63.58
4478,63.33
4479,63.15
4480,63.01
4481,62.92
4482,62.88
4483,62.88
4484,62.87
4485,62.81
4486,62.73
4487,62.64
4488,62.56
4489,62.50
4490,62.48
4491,62.55
4492,62.69
4493,62.89
4494,63.13
4495,63.37
4496,63.59
4497,63.75
4498,63.81
4499,63.77
4500,63.68
4501,63.60
4502,63.51
4503,63.46
4504,63.45
4505,63.50
4506,63.62
4507,63.74
4508,63.84
4509,63.86
4510,63.80
4511,63.70
4512,63.59
4513,63.51
4514,63.45
4515,63.48
4516,63.61
4517,63.82
4518,64.06
4519,64.29
4520,64.52
4521,64.71
4522,64.83
4523,64.83
4524,64.77
4525,64.65
4526,64.51
4527,64.35
4528,64.22
4529,64.09
4530,63.97
4531,63.85
4532,63.77
4533,63.72
4534,63.71
4535,63.69
4536,63.67
4537,63.67
4538,63.71
4539,63.79
4540,63.87
4541,63.96
4542,64.05
4543,64.11
4544,64.11
4545,64.05
4546,63.96
4547,63.92
4548,63.92
4549,63.97
4550,64.04
4551,64.12
4552,64.18
4553,64.21
4554,64.19
4555,64.10
4556,63.96
4557,63.78
4558,63.58
4559,63.43
4560,63.30
4561,63.21
4562,63.12
4563,63.03
4564,62.91
4565,62.79
4566,62.65
4567,62.49
4568,62.31
4569,62.11
4570,61.91
4571,61.74
4572,61.58
4573,61.45
4574,61.39
4575,61.44
4576,61.58
4577,61.81
4578,62.04
4579,62.27
4580,62.46
4581,62.56
4582,62.52
4583,62.32
4584,62.03
4585,61.73
4586,61.42
4587,61.16
4588,60.99
4589,60.94
4590,61.04
4591,61.20
4592,61.39
4593,61.55
4594,61.67
4595,61.71
4596,61.65
4597,61.58
4598,61.52
4599,61.49
4600,61.49
4601,61.49
4602,61.52
4603,61.58
4604,61.65
4605,61.71
4606,61.78
4607,61.87
4608,61.98
4609,62.08
4610,62.19
4611,62.29
4612,62.35
4613,62.33
4614,62.23
4615,62.02
4616,61.74
4617,61.43
4618,61.18
4619,61.04
4620,61.04
4621,61.17
4622,61.45
4623,61.83
4624,62.28
4625,62.73
4626,63.11
4627,63.39
4628,63.56
4629,63.65
4630,63.70
4631,63.74
4632,63.81
4633,63.93
4634,64.08
4635,64.22
4636,64.32
4637,64.39
4638,64.41
4639,64.36
4640,64.24
4641,64.06
4642,63.88
4643,63.71
4644,63.56
4645,63.41
4646,63.24
4647,63.07
4648,62.85
4649,62.61
4650,62.37
4651,62.17
4652,62.02
4653,61.90
4654,61.80
4655,61.71
4656,61.61
4657,61.54
4658,61.45
4659,61.36
4660,61.25
4661,61.15
4662,61.05
4663,60.97
4664,60.93
4665,60.93
4666,60.95
4667,60.98
4668,60.99
4669,60.97
4670,60.90
4671,60.78
4672,60.61
4673,60.41
4674,60.20
4675,60.02
4676,59.90
4677,59.88
4678,59.97
4679,60.15
4680,60.38
4681,60.59
4682,60.72
4683,60.74
4684,60.64
4685,60.50
4686,60.39
4687,60.33
4688,60.36
4689,60.49
4690,60.72
4691,60.99
4692,61.17
4693,61.20
4694,61.05
4695,60.77
4696,60.40
4697,60.01
4698,59.66
4699,59.43
4700,59.33
4701,59.33
4702,59.35
4703,59.34
4704,59.30
4705,59.21
4706,59.07
4707,58.89
4708,58.71
4709,58.57
4710,58.47
4711,58.40
4712,58.33
4713,58.25
4714,58.14
4715,57.98
4716,57.78
4717,57.59
4718,57.49
4719,57.47
4720,57.50
4721,57.59
4722,57.74
4723,57.94
4724,58.14
4725,58.28
4726,58.34
4727,58.32
4728,58.24
4729,58.09
4730,57.92
4731,57.78
4732,57.70
4733,57.68
4734,57.69
4735,57.70
4736,57.78
4737,57.91
4738,58.09
4739,58.25
4740,58.39
4741,58.53
4742,58.70
4743,58.90
4744,59.09
4745,59.26
4746,59.39
4747,59.49
4748,59.49
4749,59.39
4750,59.17
4751,58.87
4752,58.47
4753,58.01
4754,57.54
4755,57.14
4756,56.82
4757,56.62
4758,56.47
4759,56.38
4760,56.28
4761,56.19
4762,56.08
4763,55.97
4764,55.82
4765,55.66
4766,55.51
4767,55.40
4768,55.37
4769,55.39
4770,55.46
4771,55.56
4772,55.68
4773,55.80
4774,55.92
4775,56.05
4776,56.16
4777,56.26
4778,56.34
4779,56.37
4780,56.38
4781,56.36
4782,56.31
4783,56.26
4784,56.20
4785,56.13
4786,56.07
4787,56.01
4788,55.95
4789,55.87
4790,55.78
4791,55.67
4792,55.57
4793,55.49
4794,55.46
4795,55.47
4796,55.55
4797,55.69
4798,55.89
4799,56.15
4800,56.46
4801,56.79
4802,57.07
4803,57.26
4804,57.30
4805,57.19
4806,56.98
4807,56.74
4808,56.52
4809,56.36
4810,56.27
4811,56.24
4812,56.21
4813,56.18
4814,56.11
4815,56.01
4816,55.86
4817,55.69
4818,55.56
4819,55.50
4820,55.52
4821,55.59
4822,55.66
4823,55.70
4824,55.70
4825,55.66
4826,55.57
4827,55.45
4828,55.32
4829,55.20
4830,55.10
4831,55.02
4832,54.95
4833,54.88
4834,54.77
4835,54.63
4836,54.47
4837,54.34
4838,54.30
4839,54.35
4840,54.53
4841,54.79
4842,55.11
4843,55.47
4844,55.84
4845,56.14
4846,56.35
4847,56.47
4848,56.53
4849,56.57
4850,56.68
4851,56.85
4852,57.12
4853,57.50
4854,57.98
4855,58.47
4856,58.93
4857,59.29
4858,59.59
4859,59.79
4860,59.91
4861,59.94
4862,59.97
4863,60.02
4864,60.12
4865,60.28
4866,60.52
4867,60.82
4868,61.14
4869,61.45
4870,61.73
4871,61.96
4872,62.11
4873,62.16
4874,62.10
4875,61.97
4876,61.80
4877,61.59
4878,61.42
4879,61.26
4880,61.18
4881,61.16
4882,61.23
4883,61.36
4884,61.55
4885,61.78
4886,62.01
4887,62.25
4888,62.49
4889,62.71
4890,62.90
4891,63.08
4892,63.27
4893,63.46
4894,63.67
4895,63.84
4896,64.00
4897,64.09
4898,64.14
4899,64.09
4900,63.96
4901,63.75
4902,63.55
4903,63.36
4904,63.21
4905,63.11
4906,63.08
4907,63.14
4908,63.26
4909,63.36
4910,63.42
4911,63.39
4912,63.32
4913,63.19
4914,63.03
4915,62.87
4916,62.77
4917,62.78
4918,62.93
4919,63.19
4920,63.55
4921,63.96
4922,64.45
4923,64.92
4924,65.35
4925,65.68
4926,65.98
4927,66.25
4928,66.49
4929,66.69
4930,66.89
4931,67.08
4932,67.26
4933,67.40
4934,67.50
4935,67.55
4936,67.59
4937,67.57
4938,67.56
4939,67.55
4940,67.61
4941,67.71
4942,67.81
4943,67.89
4944,67.99
4945,68.12
4946,68.28
4947,68.44
4948,68.63
4949,68.82
4950,69.00
4951,69.15
4952,69.26
4953,69.34
4954,69.34
4955,69.29
4956,69.20
4957,69.11
4958,69.04
4959,68.98
4960,68.95
4961,68.93
4962,68.90
4963,68.88
4964,68.89
4965,68.94
4966,68.96
4967,68.95
4968,68.90
4969,68.84
4970,68.74
4971,68.63
4972,68.52
4973,68.44
4974,68.36
4975,68.27
4976,68.14
4977,67.99
4978,67.76
4979,67.49
4980,67.17
4981,66.85
4982,66.55
4983,66.31
4984,66.13
4985,66.04
4986,66.02
4987,66.04
4988,66.06
4989,66.06
4990,66.06
4991,66.06
4992,66.06
4993,66.11
4994,66.19
4995,66.31
4996,66.44
4997,66.55
4998,66.60
4999,66.59
5000,66.57
5001,66.54
5002,66.52
5003,66.46
5004,66.36
5005,66.22
5006,66.06
5007,65.88
5008,65.67
5009,65.48
5010,65.32
5011,65.26
5012,65.28
5013,65.40
5014,65.54
5015,65.69
5016,65.77
5017,65.76
5018,65.63
5019,65.38
5020,65.05
5021,64.69
5022,64.35
5023,64.09
5024,63.90
5025,63.79
5026,63.75
5027,63.77
5028,63.82
5029,63.88
5030,63.96
5031,64.03
5032,64.09
5033,64.12
5034,64.10
5035,64.04
5036,63.94
5037,63.83
5038,63.71
5039,63.62
5040,63.60
5041,63.64
5042,63.73
5043,63.88
5044,64.05
5045,64.19
5046,64.25
5047,64.21
5048,64.09
5049,63.94
5050,63.83
5051,63.79
5052,63.83
5053,63.93
5054,64.08
5055,64.24
5056,64.38
5057,64.44
5058,64.41
5059,64.35
5060,64.29
5061,64.25
5062,64.23
5063,64.24
5064,64.24
5065,64.21
5066,64.09
5067,63.90
5068,63.61
5069,63.25
5070,62.84
5071,62.42
5072,62.02
5073,61.68
5074,61.39
5075,61.16
5076,60.97
5077,60.84
5078,60.72
5079,60.65
5080,60.61
5081,60.64
5082,60.68
5083,60.71
5084,60.70
5085,60.68
5086,60.65
5087,60.61
5088,60.55
5089,60.52
5090,60.49
5091,60.48
5092,60.45
5093,60.41
5094,60.36
5095,60.30
5096,60.23
5097,60.17
5098,60.13
5099,60.13
5100,60.16
5101,60.19
5102,60.20
5103,60.17
5104,60.11
5105,60.01
5106,59.88
5107,59.72
5108,59.55
5109,59.39
5110,59.24
5111,59.13
5112,59.04
5113,58.98
5114,58.94
5115,58.94
5116,58.96
5117,58.97
5118,58.94
5119,58.90
5120,58.88
5121,58.89
5122,58.95
5123,59.06
5124,59.19
5125,59.34
5126,59.45
5127,59.47
5128,59.35
5129,59.10
5130,58.72
5131,58.28
5132,57.79
5133,57.36
5134,57.02
5135,56.82
5136,56.72
5137,56.70
5138,56.70
5139,56.70
5140,56.66
5141,56.58
5142,56.50
5143,56.47
5144,56.53
5145,56.69
5146,56.96
5147,57.30
5148,57.68
5149,57.99
5150,58.23
5151,58.36
5152,58.43
5153,58.43
5154,58.36
5155,58.26
5156,58.17
5157,58.10
5158,58.06
5159,58.04
5160,58.07
5161,58.15
5162,58.26
5163,58.37
5164,58.52
5165,58.70
5166,58.91
5167,59.09
5168,59.20
5169,59.23
5170,59.18
5171,59.03
5172,58.75
5173,58.40
5174,58.04
5175,57.73
5176,57.46
5177,57.26
5178,57.13
5179,57.08
5180,57.08
5181,57.10
5182,57.10
5183,57.12
5184,57.13
5185,57.14
5186,57.13
5187,57.11
5188,57.07
5189,56.99
5190,56.88
5191,56.71
5192,56.50
5193,56.26
5194,56.03
5195,55.82
5196,55.66
5197,55.54
5198,55.49
5199,55.53
5200,55.65
5201,55.81
5202,55.98
5203,56.17
5204,56.37
5205,56.56
5206,56.73
5207,56.82
5208,56.88
5209,56.92
5210,56.95
5211,56.95
5212,56.91
5213,56.84
5214,56.80
5215,56.82
5216,56.91
5217,57.04
5218,57.23
5219,57.46
5220,57.77
5221,58.09
5222,58.39
5223,58.62
5224,58.82
5225,58.99
5226,59.17
5227,59.31
5228,59.46
5229,59.62
5230,59.81
5231,60.03
5232,60.26
5233,60.46
5234,60.63
5235,60.77
5236,60.87
5237,60.90
5238,60.89
5239,60.87
5240,60.88
5241,60.93
5242,61.03
5243,61.16
5244,61.39
5245,61.64
5246,61.88
5247,62.07
5248,62.19
5249,62.26
5250,62.30
5251,62.35
5252,62.43
5253,62.56
5254,62.74
5255,62.97
5256,63.22
5257,63.48
5258,63.70
5259,63.82
5260,63.85
5261,63.80
5262,63.71
5263,63.58
5264,63.46
5265,63.36
5266,63.29
5267,63.25
5268,63.26
5269,63.32
5270,63.42
5271,63.51
5272,63.60
5273,63.67
5274,63.76
5275,63.82
5276,63.84
5277,63.82
5278,63.80
5279,63.81
5280,63.87
5281,63.95
5282,64.06
5283,64.21
5284,64.33
5285,64.41
5286,64.45
5287,64.42
5288,64.37
5289,64.29
5290,64.19
5291,64.08
5292,64.00
5293,63.93
5294,63.81
5295,63.65
5296,63.45
5297,63.28
5298,63.16
5299,63.12
5300,63.13
5301,63.24
5302,63.43
5303,63.68
5304,63.90
5305,64.03
5306,64.03
5307,63.90
5308,63.67
5309,63.35
5310,62.99
5311,62.62
5312,62.29
5313,62.01
5314,61.81
5315,61.67
5316,61.56
5317,61.49
5318,61.44
5319,61.42
5320,61.40
5321,61.36
5322,61.31
5323,61.27
5324,61.25
5325,61.25
5326,61.26
5327,61.28
5328,61.32
5329,61.38
5330,61.46
5331,61.58
5332,61.74
5333,61.92
5334,62.10
5335,62.29
5336,62.47
5337,62.64
5338,62.80
5339,62.92
5340,63.01
5341,63.06
5342,63.10
5343,63.12
5344,63.14
5345,63.18
5346,63.23
5347,63.28
5348,63.28
5349,63.22
5350,63.10
5351,62.94
5352,62.74
5353,62.56
5354,62.43
5355,62.39
5356,62.45
5357,62.57
5358,62.73
5359,62.89
5360,63.02
5361,63.08
5362,63.06
5363,62.98
5364,62.87
5365,62.78
5366,62.75
5367,62.77
5368,62.85
5369,62.95
5370,63.06
5371,63.16
5372,63.24
5373,63.29
5374,63.33
5375,63.38
5376,63.45
5377,63.50
5378,63.52
5379,63.51
5380,63.48
5381,63.43
5382,63.35
5383,63.26
5384,63.19
5385,63.18
5386,63.23
5387,63.34
5388,63.49
5389,63.67
5390,63.84
5391,63.93
5392,63.96
5393,63.90
5394,63.77
5395,63.61
5396,63.44
5397,63.33
5398,63.35
5399,63.50
5400,63.71
5401,63.94
5402,64.13
5403,64.23
5404,64.19
5405,64.02
5406,63.73
5407,63.38
5408,63.03
5409,62.77
5410,62.64
5411,62.61
5412,62.68
5413,62.76
5414,62.84
5415,62.88
5416,62.87
5417,62.85
5418,62.87
5419,62.98
5420,63.21
5421,63.49
5422,63.78
5423,64.03
5424,64.19
5425,64.25
5426,64.19
5427,64.03
5428,63.80
5429,63.58
5430,63.39
5431,63.28
5432,63.24
5433,63.24
5434,63.23
5435,63.18
5436,63.06
5437,62.86
5438,62.55
5439,62.18
5440,61.79
5441,61.47
5442,61.23
5443,61.07
5444,61.00
5445,61.03
5446,61.10
5447,61.21
5448,61.32
5449,61.40
5450,61.42
5451,61.34
5452,61.16
5453,60.94
5454,60.71
5455,60.49
5456,60.28
5457,60.10
5458,59.97
5459,59.89
5460,59.85
5461,59.86
5462,59.89
5463,59.97
5464,60.10
5465,60.26
5466,60.42
5467,60.56
5468,60.66
5469,60.69
5470,60.61
5471,60.41
5472,60.12
5473,59.79
5474,59.49
5475,59.29
5476,59.23
5477,59.30
5478,59.49
5479,59.74
5480,60.00
5481,60.22
5482,60.36
5483,60.41
5484,60.36
5485,60.23
5486,60.07
5487,59.94
5488,59.91
5489,59.95
5490,60.02
5491,60.07
5492,60.06
5493,59.97
5494,59.83
5495,59.62
5496,59.39
5497,59.19
5498,59.07
5499,59.05
5500,59.10
5501,59.20
5502,59.29
5503,59.36
5504,59.40
5505,59.39
5506,59.31
5507,59.21
5508,59.10
5509,58.98
5510,58.84
5511,58.66
5512,58.48
5513,58.31
5514,58.18
5515,58.08
5516,58.02
5517,58.02
5518,58.07
5519,58.17
5520,58.31
5521,58.49
5522,58.70
5523,58.91
5524,59.07
5525,59.17
5526,59.21
5527,59.20
5528,59.18
5529,59.14
5530,59.09
5531,59.03
5532,58.97
5533,58.91
5534,58.84
5535,58.76
5536,58.69
5537,58.62
5538,58.57
5539,58.55
5540,58.59
5541,58.72
5542,58.88
5543,59.04
5544,59.19
5545,59.27
5546,59.26
5547,59.16
5548,59.00
5549,58.82
5550,58.62
5551,58.44
5552,58.32
5553,58.28
5554,58.30
5555,58.35
5556,58.36
5557,58.34
5558,58.31
5559,58.29
5560,58.27
5561,58.26
5562,58.24
5563,58.21
5564,58.18
5565,58.13
5566,58.04
5567,57.91
5568,57.77
5569,57.63
5570,57.50
5571,57.38
5572,57.28
5573,57.23
5574,57.20
5575,57.18
5576,57.15
5577,57.09
5578,57.01
5579,56.95
5580,56.92
5581,56.94
5582,57.01
5583,57.13
5584,57.29
5585,57.50
5586,57.72
5587,57.92
5588,58.07
5589,58.14
5590,58.17
5591,58.17
5592,58.14
5593,58.12
5594,58.15
5595,58.24
5596,58.40
5597,58.60
5598,58.85
5599,59.12
5600,59.43
5601,59.72
5602,60.01
5603,60.26
5604,60.49
5605,60.67
5606,60.81
5607,60.91
5608,60.97
5609,60.99
5610,60.95
5611,60.84
5612,60.72
5613,60.62
5614,60.57
5615,60.59
5616,60.68
5617,60.81
5618,60.99
5619,61.17
5620,61.36
5621,61.49
5622,61.55
5623,61.60
5624,61.65
5625,61.73
5626,61.81
5627,61.85
5628,61.87
5629,61.84
5630,61.77
5631,61.65
5632,61.52
5633,61.41
5634,61.36
5635,61.36
5636,61.40
5637,61.46
5638,61.53
5639,61.58
5640,61.65
5641,61.70
5642,61.77
5643,61.85
5644,61.94
5645,62.06
5646,62.22
5647,62.42
5648,62.63
5649,62.81
5650,62.95
5651,63.01
5652,62.99
5653,62.87
5654,62.66
5655,62.42
5656,62.17
5657,61.99
5658,61.90
5659,61.90
5660,61.98
5661,62.15
5662,62.36
5663,62.57
5664,62.71
5665,62.77
5666,62.77
5667,62.76
5668,62.78
5669,62.84
5670,62.93
5671,63.01
5672,63.07
5673,63.07
5674,63.00
5675,62.85
5676,62.68
5677,62.52
5678,62.41
5679,62.39
5680,62.45
5681,62.58
5682,62.71
5683,62.82
5684,62.85
5685,62.79
5686,62.64
5687,62.43
5688,62.23
5689,62.09
5690,62.05
5691,62.11
5692,62.25
5693,62.41
5694,62.57
5695,62.68
5696,62.74
5697,62.74
5698,62.71
5699,62.66
5700,62.65
5701,62.69
5702,62.77
5703,62.90
5704,63.04
5705,63.16
5706,63.24
5707,63.24
5708,63.16
5709,63.02
5710,62.83
5711,62.63
5712,62.42
5713,62.26
5714,62.12
5715,62.02
5716,61.94
5717,61.84
5718,61.71
5719,61.58
5720,61.41
5721,61.23
5722,61.04
5723,60.84
5724,60.65
5725,60.49
5726,60.39
5727,60.36
5728,60.41
5729,60.49
5730,60.59
5731,60.68
5732,60.80
5733,60.94
5734,61.10
5735,61.26
5736,61.41
5737,61.58
5738,61.74
5739,61.88
5740,61.97
5741,62.00
5742,62.04
5743,62.09
5744,62.17
5745,62.27
5746,62.41
5747,62.57
5748,62.72
5749,62.82
5750,62.85
5751,62.81
5752,62.72
5753,62.59
5754,62.45
5755,62.36
5756,62.34
5757,62.40
5758,62.49
5759,62.60
5760,62.72
5761,62.84
5762,62.90
5763,62.89
5764,62.81
5765,62.70
5766,62.60
5767,62.50
5768,62.39
5769,62.32
5770,62.29
5771,62.28
5772,62.28
5773,62.29
5774,62.32
5775,62.38
5776,62.43
5777,62.47
5778,62.53
5779,62.63
5780,62.74
5781,62.78
5782,62.72
5783,62.58
5784,62.39
5785,62.13
5786,61.80
5787,61.42
5788,61.04
5789,60.76
5790,60.59
5791,60.54
5792,60.56
5793,60.65
5794,60.75
5795,60.81
5796,60.81
5797,60.71
5798,60.52
5799,60.32
5800,60.16
5801,60.07
5802,60.08
5803,60.16
5804,60.31
5805,60.51
5806,60.74
5807,60.94
5808,61.09
5809,61.20
5810,61.33
5811,61.50
5812,61.74
5813,62.02
5814,62.33
5815,62.67
5816,63.03
5817,63.37
5818,63.64
5819,63.82
5820,63.94
5821,63.99
5822,63.99
5823,63.95
5824,63.93
5825,63.94
5826,63.95
5827,63.92
5828,63.84
5829,63.74
5830,63.62
5831,63.50
5832,63.39
5833,63.31
5834,63.27
5835,63.29
5836,63.36
5837,63.45
5838,63.50
5839,63.50
5840,63.46
5841,63.38
5842,63.24
5843,63.06
5844,62.88
5845,62.71
5846,62.58
5847,62.52
5848,62.57
5849,62.69
5850,62.83
5851,62.95
5852,63.08
5853,63.22
5854,63.32
5855,63.39
5856,63.42
5857,63.44
5858,63.43
5859,63.42
5860,63.40
5861,63.35
5862,63.26
5863,63.15
5864,63.04
5865,62.97
5866,62.94
5867,62.95
5868,63.01
5869,63.17
5870,63.40
5871,63.63
5872,63.78
5873,63.84
5874,63.83
5875,63.74
5876,63.59
5877,63.42
5878,63.25
5879,63.12
5880,63.06
5881,63.06
5882,63.13
5883,63.25
5884,63.38
5885,63.50
5886,63.63
5887,63.77
5888,63.90
5889,63.98
5890,64.00
5891,63.97
5892,63.96
5893,63.98
5894,64.00
5895,64.02
5896,64.07
5897,64.16
5898,64.32
5899,64.50
5900,64.70
5901,64.91
5902,65.16
5903,65.40
5904,65.61
5905,65.77
5906,65.86
5907,65.89
5908,65.82
5909,65.70
5910,65.56
5911,65.46
5912,65.41
5913,65.37
5914,65.32
5915,65.26
5916,65.20
5917,65.14
5918,65.08
5919,64.99
5920,64.90
5921,64.82
5922,64.77
5923,64.75
5924,64.74
5925,64.73
5926,64.70
5927,64.67
5928,64.67
5929,64.71
5930,64.81
5931,64.99
5932,65.24
5933,65.54
5934,65.86
5935,66.14
5936,66.37
5937,66.48
5938,66.47
5939,66.36
5940,66.16
5941,65.92
5942,65.64
5943,65.41
5944,65.25
5945,65.19
5946,65.18
5947,65.19
5948,65.22
5949,65.28
5950,65.30
5951,65.22
5952,65.06
5953,64.90
5954,64.78
5955,64.72
5956,64.68
5957,64.67
5958,64.70
5959,64.76
5960,64.80
5961,64.83
5962,64.83
5963,64.79
5964,64.69
5965,64.54
5966,64.41
5967,64.33
5968,64.29
5969,64.27
5970,64.29
5971,64.35
5972,64.44
5973,64.54
5974,64.65
5975,64.77
5976,64.88
5977,64.96
5978,65.01
5979,65.01
5980,64.96
5981,64.83
5982,64.67
5983,64.48
5984,64.32
5985,64.22
5986,64.19
5987,64.25
5988,64.41
5989,64.63
5990,64.87
5991,65.10
5992,65.28
5993,65.37
5994,65.38
5995,65.29
5996,65.16
5997,64.99
5998,64.80
5999,64.63
6000,64.52
6001,64.49
6002,64.52
6003,64.59
6004,64.69
6005,64.81
6006,64.92
6007,64.98
6008,64.99
6009,64.97
6010,64.93
6011,64.85
6012,64.71
6013,64.53
6014,64.35
6015,64.19
6016,64.03
6017,63.87
6018,63.74
6019,63.68
6020,63.69
6021,63.76
6022,63.84
6023,63.87
6024,63.87
6025,63.81
6026,63.71
6027,63.58
6028,63.46
6029,63.41
6030,63.42
6031,63.48
6032,63.54
6033,63.57
6034,63.56
6035,63.51
6036,63.42
6037,63.30
6038,63.20
6039,63.18
6040,63.25
6041,63.39
6042,63.58
6043,63.80
6044,64.03
6045,64.25
6046,64.45
6047,64.61
6048,64.74
6049,64.84
6050,64.88
6051,64.84
6052,64.71
6053,64.51
6054,64.28
6055,64.03
6056,63.81
6057,63.65
6058,63.58
6059,63.58
6060,63.62
6061,63.66
6062,63.69
6063,63.70
6064,63.64
6065,63.52
6066,63.35
6067,63.19
6068,63.09
6069,63.04
6070,63.03
6071,63.06
6072,63.13
6073,63.23
6074,63.31
6075,63.33
6076,63.32
6077,63.29
6078,63.26
6079,63.22
6080,63.19
6081,63.17
6082,63.17
6083,63.21
6084,63.29
6085,63.43
6086,63.62
6087,63.85
6088,64.07
6089,64.22
6090,64.21
6091,64.06
6092,63.77
6093,63.38
6094,62.93
6095,62.46
6096,62.07
6097,61.81
6098,61.68
6099,61.67
6100,61.73
6101,61.86
6102,62.02
6103,62.18
6104,62.30
6105,62.39
6106,62.45
6107,62.51
6108,62.52
6109,62.49
6110,62.42
6111,62.32
6112,62.18
6113,61.96
6114,61.65
6115,61.28
6116,60.94
6117,60.65
6118,60.43
6119,60.32
6120,60.33
6121,60.49
6122,60.76
6123,61.09
6124,61.45
6125,61.78
6126,62.04
6127,62.21
6128,62.29
6129,62.29
6130,62.27
6131,62.23
6132,62.22
6133,62.19
6134,62.14
6135,62.03
6136,61.94
6137,61.84
6138,61.79
6139,61.74
6140,61.74
6141,61.80
6142,61.94
6143,62.13
6144,62.29
6145,62.41
6146,62.39
6147,62.27
6148,62.04
6149,61.74
6150,61.39
6151,61.06
6152,60.77
6153,60.55
6154,60.39
6155,60.27
6156,60.18
6157,60.12
6158,60.10
6159,60.11
6160,60.18
6161,60.30
6162,60.48
6163,60.70
6164,60.94
6165,61.19
6166,61.41
6167,61.61
6168,61.78
6169,61.90
6170,61.95
6171,61.92
6172,61.86
6173,61.78
6174,61.69
6175,61.61
6176,61.56
6177,61.59
6178,61.75
6179,62.03
6180,62.41
6181,62.83
6182,63.27
6183,63.67
6184,63.99
6185,64.21
6186,64.33
6187,64.34
6188,64.26
6189,64.13
6190,63.96
6191,63.83
6192,63.71
6193,63.61
6194,63.54
6195,63.51
6196,63.53
6197,63.55
6198,63.55
6199,63.56
6200,63.57
6201,63.58
6202,63.53
6203,63.44
6204,63.30
6205,63.18
6206,63.07
6207,62.98
6208,62.87
6209,62.77
6210,62.69
6211,62.63
6212,62.55
6213,62.47
6214,62.36
6215,62.26
6216,62.15
6217,62.06
6218,62.00
6219,61.99
6220,62.03
6221,62.16
6222,62.38
6223,62.70
6224,63.06
6225,63.39
6226,63.63
6227,63.75
6228,63.74
6229,63.61
6230,63.42
6231,63.21
6232,63.06
6233,62.97
6234,62.97
6235,63.05
6236,63.22
6237,63.42
6238,63.58
6239,63.69
6240,63.75
6241,63.79
6242,63.79
6243,63.75
6244,63.69
6245,63.62
6246,63.58
6247,63.56
6248,63.59
6249,63.68
6250,63.85
6251,64.09
6252,64.41
6253,64.73
6254,64.98
6255,65.12
6256,65.16
6257,65.07
6258,64.87
6259,64.59
6260,64.29
6261,64.05
6262,63.90
6263,63.87
6264,63.92
6265,64.05
6266,64.20
6267,64.37
6268,64.51
6269,64.59
6270,64.57
6271,64.46
6272,64.25
6273,63.95
6274,63.55
6275,63.11
6276,62.70
6277,62.36
6278,62.07
6279,61.87
6280,61.81
6281,61.84
6282,61.91
6283,61.94
6284,61.90
6285,61.83
6286,61.71
6287,61.55
6288,61.36
6289,61.19
6290,61.11
6291,61.16
6292,61.29
6293,61.50
6294,61.73
6295,61.97
6296,62.20
6297,62.38
6298,62.50
6299,62.56
6300,62.58
6301,62.58
6302,62.57
6303,62.56
6304,62.58
6305,62.62
6306,62.67
6307,62.71
6308,62.76
6309,62.80
6310,62.79
6311,62.74
6312,62.64
6313,62.55
6314,62.42
6315,62.26
6316,62.10
6317,62.00
6318,61.97
6319,62.00
6320,62.11
6321,62.28
6322,62.48
6323,62.68
6324,62.83
6325,62.89
6326,62.86
6327,62.75
6328,62.61
6329,62.47
6330,62.37
6331,62.35
6332,62.43
6333,62.61
6334,62.85
6335,63.10
6336,63.31
6337,63.45
6338,63.48
6339,63.42
6340,63.31
6341,63.16
6342,63.00
6343,62.81
6344,62.65
6345,62.53
6346,62.45
6347,62.41
6348,62.42
6349,62.46
6350,62.50
6351,62.55
6352,62.61
6353,62.67
6354,62.68
6355,62.60
6356,62.45
6357,62.29
6358,62.13
6359,62.01
6360,61.94
6361,61.94
6362,62.01
6363,62.14
6364,62.28
6365,62.39
6366,62.42
6367,62.40
6368,62.33
6369,62.25
6370,62.16
6371,62.10
6372,62.09
6373,62.12
6374,62.23
6375,62.39
6376,62.60
6377,62.82
6378,63.02
6379,63.17
6380,63.31
6381,63.47
6382,63.66
6383,63.84
6384,63.96
6385,64.03
6386,64.07
6387,64.12
6388,64.19
6389,64.30
6390,64.45
6391,64.61
6392,64.79
6393,64.92
6394,64.99
6395,64.98
6396,64.90
6397,64.76
6398,64.60
6399,64.45
6400,64.35
6401,64.31
6402,64.34
6403,64.44
6404,64.58
6405,64.70
6406,64.80
6407,64.86
6408,64.87
6409,64.87
6410,64.88
6411,64.92
6412,64.99
6413,65.06
6414,65.16
6415,65.22
6416,65.22
6417,65.14
6418,65.00
6419,64.83
6420,64.66
6421,64.54
6422,64.51
6423,64.57
6424,64.69
6425,64.83
6426,64.99
6427,65.09
6428,65.08
6429,64.96
6430,64.80
6431,64.62
6432,64.48
6433,64.41
6434,64.44
6435,64.58
6436,64.76
6437,64.93
6438,65.06
6439,65.13
6440,65.14
6441,65.09
6442,64.97
6443,64.85
6444,64.74
6445,64.64
6446,64.56
6447,64.50
6448,64.45
6449,64.44
6450,64.44
6451,64.46
6452,64.49
6453,64.54
6454,64.58
6455,64.60
6456,64.58
6457,64.52
6458,64.43
6459,64.33
6460,64.20
6461,64.05
6462,63.86
6463,63.64
6464,63.40
6465,63.16
6466,62.95
6467,62.79
6468,62.68
6469,62.64
6470,62.68
6471,62.76
6472,62.84
6473,62.89
6474,62.87
6475,62.82
6476,62.71
6477,62.55
6478,62.36
6479,62.19
6480,62.07
6481,62.02
6482,62.02
6483,62.07
6484,62.12
6485,62.16
6486,62.16
6487,62.14
6488,62.12
6489,62.12
6490,62.14
6491,62.23
6492,62.38
6493,62.54
6494,62.66
6495,62.72
6496,62.74
6497,62.71
6498,62.64
6499,62.54
6500,62.47
6501,62.44
6502,62.45
6503,62.45
6504,62.45
6505,62.41
6506,62.32
6507,62.17
6508,62.02
6509,61.92
6510,61.89
6511,61.93
6512,62.03
6513,62.18
6514,62.33
6515,62.43
6516,62.43
6517,62.33
6518,62.18
6519,62.01
6520,61.84
6521,61.68
6522,61.58
6523,61.56
6524,61.59
6525,61.66
6526,61.74
6527,61.81
6528,61.81
6529,61.75
6530,61.64
6531,61.45
6532,61.19
6533,60.85
6534,60.50
6535,60.20
6536,59.95
6537,59.75
6538,59.60
6539,59.49
6540,59.39
6541,59.30
6542,59.17
6543,59.05
6544,58.95
6545,58.92
6546,58.91
6547,58.94
6548,58.98
6549,59.04
6550,59.10
6551,59.11
6552,59.02
6553,58.84
6554,58.59
6555,58.38
6556,58.20
6557,58.09
6558,58.01
6559,57.99
6560,58.05
6561,58.20
6562,58.36
6563,58.49
6564,58.53
6565,58.46
6566,58.31
6567,58.11
6568,57.90
6569,57.68
6570,57.45
6571,57.24
6572,57.04
6573,56.88
6574,56.72
6575,56.57
6576,56.43
6577,56.34
6578,56.26
6579,56.23
6580,56.22
6581,56.24
6582,56.25
6583,56.24
6584,56.20
6585,56.16
6586,56.12
6587,56.08
6588,56.04
6589,56.02
6590,56.03
6591,56.03
6592,55.98
6593,55.85
6594,55.71
6595,55.56
6596,55.44
6597,55.34
6598,55.28
6599,55.33
6600,55.47
6601,55.69
6602,55.92
6603,56.13
6604,56.31
6605,56.45
6606,56.52
6607,56.54
6608,56.56
6609,56.56
6610,56.56
6611,56.56
6612,56.55
6613,56.54
6614,56.50
6615,56.40
6616,56.21
6617,55.98
6618,55.74
6619,55.55
6620,55.43
6621,55.39
6622,55.37
6623,55.34
6624,55.27
6625,55.18
6626,55.04
6627,54.86
6628,54.63
6629,54.41
6630,54.24
6631,54.12
6632,54.04
6633,53.96
6634,53.87
6635,53.77
6636,53.66
6637,53.54
6638,53.44
6639,53.37
6640,53.36
6641,53.42
6642,53.57
6643,53.80
6644,54.12
6645,54.46
6646,54.79
6647,55.08
6648,55.37
6649,55.63
6650,55.83
6651,55.95
6652,56.02
6653,56.05
6654,56.08
6655,56.11
6656,56.18
6657,56.23
6658,56.29
6659,56.36
6660,56.49
6661,56.69
6662,56.94
6663,57.21
6664,57.46
6665,57.67
6666,57.85
6667,57.99
6668,58.10
6669,58.13
6670,58.11
6671,58.06
6672,58.05
6673,58.11
6674,58.23
6675,58.39
6676,58.59
6677,58.81
6678,59.03
6679,59.22
6680,59.39
6681,59.56
6682,59.72
6683,59.88
6684,60.01
6685,60.08
6686,60.12
6687,60.11
6688,60.10
6689,60.11
6690,60.20
6691,60.37
6692,60.67
6693,61.07
6694,61.55
6695,62.03
6696,62.46
6697,62.77
6698,62.97
6699,63.03
6700,62.98
6701,62.85
6702,62.68
6703,62.49
6704,62.36
6705,62.32
6706,62.35
6707,62.39
6708,62.43
6709,62.43
6710,62.39
6711,62.33
6712,62.26
6713,62.16
6714,62.01
6715,61.84
6716,61.63
6717,61.43
6718,61.24
6719,61.07
6720,60.89
6721,60.75
6722,60.66
6723,60.61
6724,60.57
6725,60.52
6726,60.48
6727,60.46
6728,60.49
6729,60.57
6730,60.68
6731,60.82
6732,61.00
6733,61.20
6734,61.37
6735,61.45
6736,61.45
6737,61.38
6738,61.20
6739,60.94
6740,60.64
6741,60.36
6742,60.11
6743,59.92
6744,59.75
6745,59.62
6746,59.48
6747,59.35
6748,59.20
6749,59.08
6750,58.98
6751,58.93
6752,58.92
6753,58.94
6754,58.96
6755,58.97
6756,58.94
6757,58.89
6758,58.77
6759,58.61
6760,58.44
6761,58.32
6762,58.26
6763,58.24
6764,58.24
6765,58.27
6766,58.30
6767,58.36
6768,58.44
6769,58.49
6770,58.53
6771,58.54
6772,58.60
6773,58.72
6774,58.86
6775,59.01
6776,59.16
6777,59.29
6778,59.40
6779,59.46
6780,59.49
6781,59.48
6782,59.46
6783,59.46
6784,59.49
6785,59.55
6786,59.62
6787,59.72
6788,59.87
6789,60.07
6790,60.31
6791,60.59
6792,60.90
6793,61.20
6794,61.47
6795,61.67
6796,61.78
6797,61.75
6798,61.61
6799,61.37
6800,61.07
6801,60.77
6802,60.49
6803,60.26
6804,60.13
6805,60.07
6806,60.08
6807,60.14
6808,60.23
6809,60.36
6810,60.48
6811,60.59
6812,60.65
6813,60.68
6814,60.65
6815,60.59
6816,60.49
6817,60.38
6818,60.23
6819,60.02
6820,59.79
6821,59.57
6822,59.39
6823,59.26
6824,59.14
6825,59.04
6826,58.96
6827,58.92
6828,58.91
6829,58.91
6830,58.92
6831,58.92
6832,58.90
6833,58.91
6834,58.95
6835,59.01
6836,59.04
6837,59.00
6838,58.91
6839,58.81
6840,58.69
6841,58.55
6842,58.43
6843,58.38
6844,58.44
6845,58.60
6846,58.85
6847,59.10
6848,59.36
6849,59.58
6850,59.76
6851,59.94
6852,60.13
6853,60.33
6854,60.52
6855,60.65
6856,60.66
6857,60.54
6858,60.30
6859,59.97
6860,59.62
6861,59.27
6862,58.99
6863,58.85
6864,58.87
6865,59.02
6866,59.22
6867,59.39
6868,59.45
6869,59.43
6870,59.36
6871,59.28
6872,59.17
6873,59.07
6874,58.96
6875,58.88
6876,58.78
6877,58.63
6878,58.40
6879,58.11
6880,57.82
6881,57.56
6882,57.34
6883,57.21
6884,57.16
6885,57.17
6886,57.23
6887,57.27
6888,57.30
6889,57.30
6890,57.27
6891,57.22
6892,57.21
6893,57.27
6894,57.40
6895,57.60
6896,57.87
6897,58.19
6898,58.53
6899,58.85
6900,59.14
6901,59.36
6902,59.49
6903,59.55
6904,59.56
6905,59.52
6906,59.40
6907,59.26
6908,59.17
6909,59.16
6910,59.25
6911,59.43
6912,59.70
6913,60.02
6914,60.35
6915,60.61
6916,60.78
6917,60.86
6918,60.84
6919,60.78
6920,60.71
6921,60.65
6922,60.60
6923,60.55
6924,60.54
6925,60.57
6926,60.62
6927,60.64
6928,60.59
6929,60.51
6930,60.45
6931,60.45
6932,60.49
6933,60.53
6934,60.55
6935,60.56
6936,60.51
6937,60.39
6938,60.20
6939,59.94
6940,59.65
6941,59.36
6942,59.13
6943,58.99
6944,58.95
6945,59.02
6946,59.14
6947,59.27
6948,59.33
6949,59.33
6950,59.21
6951,59.01
6952,58.73
6953,58.47
6954,58.29
6955,58.25
6956,58.33
6957,58.48
6958,58.65
6959,58.78
6960,58.86
6961,58.85
6962,58.73
6963,58.54
6964,58.33
6965,58.14
6966,58.06
6967,58.09
6968,58.24
6969,58.48
6970,58.84
6971,59.23
6972,59.60
6973,59.88
6974,60.10
6975,60.26
6976,60.40
6977,60.49
6978,60.60
6979,60.74
6980,60.93
6981,61.14
6982,61.38
6983,61.62
6984,61.85
6985,62.00
6986,62.07
6987,62.04
6988,62.01
6989,62.02
6990,62.10
6991,62.19
6992,62.32
6993,62.46
6994,62.59
6995,62.65
6996,62.62
6997,62.52
6998,62.39
6999,62.29
7000,62.23
7001,62.23
7002,62.29
7003,62.42
7004,62.55
7005,62.65
7006,62.71
7007,62.74
7008,62.79
7009,62.85
7010,62.93
7011,63.00
7012,63.09
7013,63.15
7014,63.16
7015,63.09
7016,62.90
7017,62.66
7018,62.42
7019,62.21
7020,62.05
7021,61.95
7022,61.94
7023,62.03
7024,62.16
7025,62.26
7026,62.30
7027,62.32
7028,62.34
7029,62.34
7030,62.29
7031,62.21
7032,62.14
7033,62.12
7034,62.14
7035,62.19
7036,62.25
7037,62.32
7038,62.42
7039,62.53
7040,62.68
7041,62.87
7042,63.06
7043,63.19
7044,63.27
7045,63.29
7046,63.28
7047,63.22
7048,63.10
7049,62.90
7050,62.64
7051,62.39
7052,62.20
7053,62.10
7054,62.10
7055,62.16
7056,62.27
7057,62.43
7058,62.63
7059,62.85
7060,63.05
7061,63.20
7062,63.28
7063,63.29
7064,63.26
7065,63.20
7066,63.15
7067,63.10
7068,63.06
7069,63.04
7070,63.07
7071,63.15
7072,63.26
7073,63.36
7074,63.45
7075,63.51
7076,63.50
7077,63.45
7078,63.39
7079,63.33
7080,63.30
7081,63.31
7082,63.37
7083,63.49
7084,63.61
7085,63.71
7086,63.72
7087,63.67
7088,63.51
7089,63.27
7090,62.96
7091,62.64
7092,62.36
7093,62.13
7094,61.98
7095,61.86
7096,61.78
7097,61.74
7098,61.74
7099,61.76
7100,61.77
7101,61.79
7102,61.85
7103,61.99
7104,62.19
7105,62.41
7106,62.66
7107,62.93
7108,63.22
7109,63.46
7110,63.66
7111,63.79
7112,63.87
7113,63.87
7114,63.88
7115,63.88
7116,63.96
7117,64.09
7118,64.33
7119,64.64
7120,65.03
7121,65.44
7122,65.89
7123,66.30
7124,66.69
7125,67.02
7126,67.32
7127,67.54
7128,67.73
7129,67.87
7130,67.99
7131,68.05
7132,68.10
7133,68.14
7134,68.22
7135,68.33
7136,68.47
7137,68.61
7138,68.76
7139,68.90
7140,68.99
7141,69.02
7142,68.99
7143,68.95
7144,68.89
7145,68.80
7146,68.73
7147,68.69
7148,68.68
7149,68.69
7150,68.68
7151,68.64
7152,68.56
7153,68.44
7154,68.28
7155,68.13
7156,67.96
7157,67.81
7158,67.64
7159,67.45
7160,67.21
7161,66.95
7162,66.68
7163,66.44
7164,66.26
7165,66.15
7166,66.13
7167,66.20
7168,66.34
7169,66.51
7170,66.62
7171,66.65
7172,66.57
7173,66.42
7174,66.25
7175,66.12
7176,66.02
7177,65.98
7178,65.99
7179,66.03
7180,66.09
7181,66.13
7182,66.14
7183,66.10
7184,66.01
7185,65.91
7186,65.82
7187,65.79
7188,65.80
7189,66.10
7190,66.11
7191,65.83
7192,65.52
7193,65.66
7194,66.75
7195,67.43
7196,65.19
7197,61.81
7198,63.58
7199,73.57
7200,68.21
