1,36.45
2,47.46
3,50.00
4,50.00
5,50.00
6,16.96
7,-27.72
8,-39.30
9,-20.76
10,-12.31
11,-29.13
12,-43.35
13,-33.25
14,-15.42
15,-13.43
16,-23.62
17,-26.83
18,-19.60
19,-13.25
20,-15.35
21,-20.52
22,-20.93
23,-16.79
24,-14.30
25,-16.36
26,-19.38
27,-19.77
28,-18.49
29,-18.22
30,-18.86
31,-18.92
32,-18.13
33,-17.89
34,-18.69
35,-20.08
36,-20.73
37,-20.05
38,-17.86
39,-14.68
40,-10.77
41,-6.22
42,-1.04
43,4.42
44,9.48
45,13.48
46,16.09
47,17.30
48,16.94
49,14.68
50,10.14
51,3.54
52,-4.14
53,-11.40
54,-17.10
55,-20.86
56,-23.26
57,-24.95
58,-26.46
59,-27.53
60,-27.92
61,-27.20
62,-25.75
63,-23.96
64,-22.47
65,-21.26
66,-20.05
67,-18.50
68,-16.75
69,-15.41
70,-15.00
71,-15.51
72,-16.00
73,-15.55
74,-13.89
75,-12.00
76,-11.02
77,-11.41
78,-12.33
79,-12.75
80,-12.19
81,-11.21
82,-10.40
83,-9.93
84,-9.49
85,-8.96
86,-8.51
87,-8.39
88,-8.48
89,-8.52
90,-8.41
91,-8.36
92,-8.51
93,-8.84
94,-9.12
95,-9.24
96,-9.28
97,-9.40
98,-9.63
99,-9.84
100,-9.96
101,-10.07
102,-10.14
103,-9.94
104,-9.30
105,-8.48
106,-8.03
107,-8.16
108,-8.58
109,-8.82
110,-8.63
111,-8.06
112,-7.31
113,-6.68
114,-6.54
115,-7.13
116,-8.22
117,-9.21
118,-9.53
119,-9.18
120,-8.71
121,-8.67
122,-9.08
123,-9.51
124,-9.57
125,-9.29
126,-8.97
127,-8.83
128,-8.87
129,-9.01
130,-9.14
131,-9.11
132,-8.74
133,-8.07
134,-7.39
135,-7.04
136,-7.10
137,-7.34
138,-7.44
139,-7.32
140,-7.06
141,-6.80
142,-6.57
143,-6.50
144,-6.70
145,-7.17
146,-7.67
147,-7.84
148,-7.49
149,-6.70
150,-5.70
151,-4.71
152,-3.92
153,-3.55
154,-3.65
155,-4.10
156,-4.54
157,-4.75
158,-4.70
159,-4.48
160,-4.17
161,-3.92
162,-3.94
163,-4.36
164,-4.89
165,-4.98
166,-4.38
167,-3.51
168,-3.19
169,-3.79
170,-4.84
171,-5.42
172,-5.17
173,-4.56
174,-4.34
175,-4.70
176,-5.22
177,-5.42
178,-5.24
179,-4.93
180,-4.66
181,-4.45
182,-4.36
183,-4.57
184,-5.08
185,-5.57
186,-5.66
187,-5.27
188,-4.82
189,-4.76
190,-5.20
191,-5.81
192,-6.17
193,-6.11
194,-5.81
195,-5.55
196,-5.58
197,-5.88
198,-6.09
199,-5.80
200,-5.07
201,-4.66
202,-5.24
203,-6.54
204,-7.46
205,-7.21
206,-6.10
207,-5.17
208,-4.88
209,-4.76
210,-4.18
211,-3.35
212,-3.20
213,-4.25
214,-5.78
215,-6.47
216,-5.78
217,-4.61
218,-4.22
219,-4.92
220,-5.89
221,-6.25
222,-5.91
223,-5.32
224,-4.87
225,-4.59
226,-4.61
227,-5.08
228,-5.95
229,-6.71
230,-6.73
231,-5.93
232,-4.96
233,-4.69
234,-5.47
235,-6.91
236,-8.25
237,-8.89
238,-8.71
239,-7.91
240,-6.96
241,-6.26
242,-6.16
243,-6.69
244,-7.50
245,-8.08
246,-8.16
247,-7.96
248,-8.05
249,-8.73
250,-9.68
251,-10.14
252,-9.63
253,-8.52
254,-7.73
255,-7.86
256,-8.63
257,-9.17
258,-8.87
259,-7.98
260,-7.27
261,-7.36
262,-8.17
263,-9.06
264,-9.28
265,-8.55
266,-7.22
267,-6.12
268,-5.88
269,-6.50
270,-7.44
271,-8.24
272,-8.68
273,-8.63
274,-8.09
275,-7.33
276,-6.88
277,-7.06
278,-7.55
279,-7.68
280,-7.18
281,-6.58
282,-6.78
283,-8.00
284,-9.48
285,-9.98
286,-8.98
287,-7.10
288,-5.71
289,-5.85
290,-7.36
291,-9.12
292,-10.12
293,-10.27
294,-10.28
295,-10.61
296,-10.98
297,-10.74
298,-9.83
299,-8.94
300,-8.70
301,-8.91
302,-9.01
303,-8.89
304,-9.05
305,-9.77
306,-10.57
307,-10.71
308,-10.13
309,-9.49
310,-9.22
311,-9.03
312,-8.38
313,-7.48
314,-7.06
315,-7.56
316,-8.28
317,-8.19
318,-7.03
319,-5.72
320,-5.27
321,-5.82
322,-6.46
323,-6.32
324,-5.31
325,-4.10
326,-3.26
327,-2.91
328,-2.87
329,-3.07
330,-3.41
331,-3.66
332,-3.41
333,-2.67
334,-2.05
335,-2.32
336,-3.46
337,-4.48
338,-4.44
339,-3.50
340,-2.78
341,-3.08
342,-4.08
343,-4.74
344,-4.65
345,-4.37
346,-4.60
347,-5.20
348,-5.48
349,-5.17
350,-4.80
351,-4.98
352,-5.52
353,-5.75
354,-5.40
355,-4.98
356,-5.06
357,-5.46
358,-5.48
359,-4.76
360,-3.72
361,-2.99
362,-2.75
363,-2.74
364,-2.79
365,-2.98
366,-3.39
367,-3.92
368,-4.46
369,-5.02
370,-5.63
371,-6.05
372,-5.96
373,-5.36
374,-4.78
375,-4.74
376,-5.33
377,-6.14
378,-6.85
379,-7.36
380,-7.70
381,-7.69
382,-7.14
383,-6.25
384,-5.64
385,-5.82
386,-6.69
387,-7.69
388,-8.17
389,-7.86
390,-6.99
391,-6.07
392,-5.64
393,-5.87
394,-6.54
395,-7.19
396,-7.40
397,-7.04
398,-6.41
399,-5.97
400,-6.04
401,-6.52
402,-7.03
403,-7.30
404,-7.41
405,-7.56
406,-7.84
407,-8.11
408,-8.26
409,-8.37
410,-8.55
411,-8.76
412,-8.69
413,-8.09
414,-7.02
415,-5.92
416,-5.20
417,-4.99
418,-5.12
419,-5.35
420,-5.48
421,-5.40
422,-5.04
423,-4.50
424,-4.06
425,-4.06
426,-4.56
427,-5.26
428,-5.67
429,-5.58
430,-5.10
431,-4.62
432,-4.38
433,-4.35
434,-4.40
435,-4.46
436,-4.68
437,-5.18
438,-5.81
439,-6.09
440,-5.70
441,-4.85
442,-4.13
443,-3.97
444,-4.27
445,-4.60
446,-4.69
447,-4.66
448,-4.77
449,-5.11
450,-5.51
451,-5.73
452,-5.65
453,-5.36
454,-5.00
455,-4.66
456,-4.42
457,-4.30
458,-4.34
459,-4.47
460,-4.49
461,-4.10
462,-3.34
463,-2.62
464,-2.53
465,-3.27
466,-4.32
467,-4.92
468,-4.84
469,-4.66
470,-5.07
471,-6.05
472,-6.84
473,-6.83
474,-6.14
475,-5.39
476,-4.96
477,-4.75
478,-4.44
479,-3.92
480,-3.46
481,-3.50
482,-4.21
483,-5.23
484,-5.89
485,-5.72
486,-4.84
487,-3.86
488,-3.45
489,-3.87
490,-4.76
491,-5.43
492,-5.38
493,-4.72
494,-4.13
495,-4.25
496,-5.09
497,-5.99
498,-6.30
499,-5.92
500,-5.30
501,-4.83
502,-4.54
503,-4.34
504,-4.25
505,-4.42
506,-4.87
507,-5.39
508,-5.76
509,-5.89
510,-5.79
511,-5.44
512,-4.88
513,-4.35
514,-4.14
515,-4.34
516,-4.68
517,-4.85
518,-4.81
519,-4.79
520,-4.93
521,-5.09
522,-5.01
523,-4.63
524,-4.19
525,-3.92
526,-3.88
527,-3.97
528,-4.06
529,-4.08
530,-3.99
531,-3.78
532,-3.60
533,-3.64
534,-4.01
535,-4.60
536,-5.09
537,-5.24
538,-5.08
539,-4.87
540,-4.97
541,-5.48
542,-6.12
543,-6.34
544,-5.78
545,-4.61
546,-3.53
547,-3.21
548,-3.79
549,-4.73
550,-5.34
551,-5.35
552,-4.97
553,-4.60
554,-4.60
555,-5.15
556,-6.00
557,-6.48
558,-5.88
559,-4.30
560,-2.79
561,-2.51
562,-3.57
563,-4.88
564,-5.29
565,-4.70
566,-3.98
567,-3.99
568,-4.67
569,-5.30
570,-5.35
571,-4.94
572,-4.46
573,-4.08
574,-3.81
575,-3.67
576,-3.81
577,-4.21
578,-4.49
579,-4.29
580,-3.68
581,-3.23
582,-3.38
583,-4.01
584,-4.44
585,-4.15
586,-3.36
587,-2.94
588,-3.40
589,-4.29
590,-4.64
591,-4.05
592,-3.07
593,-2.50
594,-2.53
595,-2.68
596,-2.56
597,-2.35
598,-2.55
599,-3.35
600,-4.20
601,-4.43
602,-3.89
603,-3.25
604,-3.14
605,-3.58
606,-3.99
607,-3.96
608,-3.49
609,-2.72
610,-1.69
611,-0.49
612,0.57
613,1.17
614,1.21
615,0.79
616,0.15
617,-0.47
618,-0.92
619,-1.24
620,-1.53
621,-1.76
622,-1.68
623,-1.12
624,-0.25
625,0.40
626,0.29
627,-0.69
628,-1.99
629,-2.70
630,-2.36
631,-1.35
632,-0.50
633,-0.26
634,-0.45
635,-0.65
636,-0.70
637,-0.67
638,-0.60
639,-0.41
640,-0.17
641,-0.03
642,-0.12
643,-0.45
644,-0.85
645,-1.21
646,-1.52
647,-1.86
648,-2.15
649,-2.21
650,-1.95
651,-1.54
652,-1.21
653,-0.97
654,-0.70
655,-0.40
656,-0.22
657,-0.26
658,-0.37
659,-0.44
660,-0.41
661,-0.36
662,-0.37
663,-0.58
664,-0.95
665,-1.20
666,-0.93
667,-0.14
668,0.73
669,1.16
670,1.20
671,1.41
672,2.26
673,3.53
674,4.43
675,4.35
676,3.57
677,2.97
678,3.10
679,3.62
680,3.74
681,3.09
682,2.00
683,0.94
684,0.09
685,-0.57
686,-0.86
687,-0.47
688,0.59
689,1.89
690,2.82
691,3.14
692,2.99
693,2.59
694,2.03
695,1.46
696,1.13
697,1.23
698,1.56
699,1.60
700,1.10
701,0.35
702,-0.08
703,0.05
704,0.44
705,0.71
706,0.87
707,1.24
708,1.89
709,2.37
710,2.19
711,1.40
712,0.73
713,0.83
714,1.66
715,2.47
716,2.58
717,1.98
718,1.28
719,1.04
720,1.29
721,1.59
722,1.61
723,1.39
724,1.13
725,0.87
726,0.49
727,0.00
728,-0.36
729,-0.39
730,-0.19
731,0.00
732,0.12
733,0.34
734,0.72
735,0.99
736,0.88
737,0.50
738,0.25
739,0.33
740,0.44
741,0.19
742,-0.33
743,-0.61
744,-0.45
745,-0.26
746,-0.56
747,-1.17
748,-1.48
749,-1.19
750,-0.74
751,-0.68
752,-0.89
753,-0.81
754,-0.33
755,-0.10
756,-0.71
757,-1.85
758,-2.56
759,-2.29
760,-1.56
761,-1.32
762,-1.74
763,-2.04
764,-1.62
765,-0.84
766,-0.60
767,-1.09
768,-1.60
769,-1.35
770,-0.56
771,-0.04
772,-0.23
773,-0.75
774,-0.99
775,-0.89
776,-0.92
777,-1.42
778,-2.22
779,-2.79
780,-2.82
781,-2.40
782,-1.64
783,-0.53
784,0.61
785,1.05
786,0.20
787,-1.49
788,-2.85
789,-3.05
790,-2.35
791,-1.55
792,-1.13
793,-1.01
794,-1.03
795,-1.24
796,-1.92
797,-3.10
798,-4.32
799,-4.84
800,-4.40
801,-3.52
802,-3.13
803,-3.56
804,-4.28
805,-4.47
806,-3.92
807,-3.15
808,-2.93
809,-3.47
810,-4.19
811,-4.26
812,-3.54
813,-2.75
814,-2.78
815,-3.70
816,-4.67
817,-4.79
818,-4.08
819,-3.31
820,-3.25
821,-3.93
822,-4.77
823,-5.18
824,-5.00
825,-4.52
826,-4.10
827,-4.01
828,-4.39
829,-5.13
830,-5.82
831,-5.89
832,-5.15
833,-4.06
834,-3.37
835,-3.41
836,-3.92
837,-4.47
838,-4.84
839,-5.06
840,-5.13
841,-5.05
842,-4.91
843,-4.83
844,-4.78
845,-4.57
846,-4.21
847,-4.11
848,-4.57
849,-5.21
850,-5.20
851,-4.18
852,-2.75
853,-1.98
854,-2.34
855,-3.37
856,-4.23
857,-4.45
858,-4.17
859,-3.80
860,-3.60
861,-3.58
862,-3.71
863,-4.00
864,-4.39
865,-4.72
866,-4.80
867,-4.58
868,-4.16
869,-3.64
870,-3.15
871,-2.85
872,-2.80
873,-2.81
874,-2.48
875,-1.67
876,-0.87
877,-0.87
878,-1.93
879,-3.40
880,-4.20
881,-3.76
882,-2.44
883,-1.14
884,-0.47
885,-0.53
886,-1.13
887,-2.05
888,-2.99
889,-3.56
890,-3.48
891,-2.88
892,-2.31
893,-2.25
894,-2.57
895,-2.69
896,-2.39
897,-2.17
898,-2.66
899,-3.68
900,-4.32
901,-3.91
902,-2.82
903,-2.12
904,-2.34
905,-3.03
906,-3.20
907,-2.35
908,-0.99
909,-0.20
910,-0.53
911,-1.57
912,-2.29
913,-2.08
914,-1.16
915,-0.33
916,-0.18
917,-0.72
918,-1.38
919,-1.54
920,-0.90
921,0.23
922,1.21
923,1.51
924,1.04
925,0.23
926,-0.29
927,-0.11
928,0.62
929,1.23
930,1.07
931,0.07
932,-1.21
933,-2.08
934,-2.24
935,-1.91
936,-1.46
937,-1.04
938,-0.60
939,-0.10
940,0.26
941,0.22
942,-0.30
943,-0.89
944,-0.96
945,-0.19
946,1.09
947,2.05
948,1.98
949,0.87
950,-0.52
951,-1.40
952,-1.53
953,-1.33
954,-1.28
955,-1.40
956,-1.27
957,-0.65
958,0.09
959,0.29
960,-0.30
961,-1.13
962,-1.44
963,-1.03
964,-0.43
965,-0.29
966,-0.69
967,-1.21
968,-1.35
969,-0.99
970,-0.43
971,-0.18
972,-0.39
973,-0.66
974,-0.52
975,-0.08
976,0.14
977,-0.14
978,-0.45
979,-0.23
980,0.61
981,1.45
982,1.72
983,1.41
984,1.06
985,1.16
986,1.62
987,1.94
988,1.80
989,1.49
990,1.63
991,2.55
992,3.80
993,4.51
994,4.08
995,2.69
996,1.24
997,0.53
998,0.64
999,0.84
1000,0.54
1001,-0.07
1002,-0.33
1003,0.09
1004,0.71
1005,0.99
1006,0.84
1007,0.69
1008,0.81
1009,1.08
1010,1.14
1011,0.79
1012,0.01
1013,-0.99
1014,-1.85
1015,-2.08
1016,-1.56
1017,-0.78
1018,-0.47
1019,-0.85
1020,-1.31
1021,-1.18
1022,-0.59
1023,-0.33
1024,-0.89
1025,-1.79
1026,-2.12
1027,-1.51
1028,-0.51
1029,0.15
1030,0.28
1031,0.25
1032,0.35
1033,0.52
1034,0.52
1035,0.26
1036,-0.21
1037,-0.89
1038,-1.78
1039,-2.60
1040,-2.82
1041,-2.15
1042,-0.88
1043,0.31
1044,0.89
1045,0.85
1046,0.48
1047,0.03
1048,-0.45
1049,-0.92
1050,-1.17
1051,-0.99
1052,-0.34
1053,0.58
1054,1.54
1055,2.23
1056,2.36
1057,1.71
1058,0.64
1059,-0.04
1060,0.26
1061,1.16
1062,1.74
1063,1.63
1064,1.39
1065,1.68
1066,2.47
1067,3.11
1068,3.15
1069,2.67
1070,2.11
1071,1.76
1072,1.68
1073,1.79
1074,2.02
1075,2.27
1076,2.44
1077,2.49
1078,2.56
1079,2.73
1080,2.87
1081,2.65
1082,2.04
1083,1.48
1084,1.61
1085,2.54
1086,3.58
1087,3.81
1088,3.05
1089,2.06
1090,1.80
1091,2.41
1092,3.13
1093,3.22
1094,2.75
1095,2.45
1096,2.84
1097,3.67
1098,4.27
1099,4.29
1100,3.87
1101,3.36
1102,2.83
1103,2.19
1104,1.59
1105,1.49
1106,2.02
1107,2.67
1108,2.63
1109,1.72
1110,0.63
1111,0.31
1112,0.96
1113,2.01
1114,2.62
1115,2.44
1116,1.63
1117,0.59
1118,-0.23
1119,-0.40
1120,0.14
1121,0.76
1122,0.58
1123,-0.65
1124,-2.16
1125,-2.90
1126,-2.49
1127,-1.50
1128,-0.74
1129,-0.50
1130,-0.56
1131,-0.63
1132,-0.69
1133,-0.81
1134,-0.84
1135,-0.57
1136,-0.18
1137,-0.24
1138,-1.03
1139,-2.09
1140,-2.59
1141,-2.25
1142,-1.53
1143,-0.99
1144,-0.75
1145,-0.60
1146,-0.45
1147,-0.41
1148,-0.54
1149,-0.74
1150,-0.91
1151,-1.04
1152,-1.16
1153,-1.16
1154,-0.87
1155,-0.34
1156,0.11
1157,0.13
1158,-0.15
1159,-0.34
1160,-0.36
1161,-0.68
1162,-1.57
1163,-2.38
1164,-2.10
1165,-0.51
1166,1.31
1167,2.10
1168,1.56
1169,0.40
1170,-0.50
1171,-0.87
1172,-0.93
1173,-0.97
1174,-0.96
1175,-0.76
1176,-0.45
1177,-0.41
1178,-0.80
1179,-1.31
1180,-1.46
1181,-1.08
1182,-0.43
1183,0.18
1184,0.54
1185,0.48
1186,-0.09
1187,-0.83
1188,-1.00
1189,-0.18
1190,1.17
1191,1.96
1192,1.52
1193,0.07
1194,-0.94
1195,-0.74
1196,0.09
1197,-0.02
1198,-0.69
1199,0.44
1200,2.56
