1,-186.96
2,-250.00
3,-250.00
4,-249.24
5,-237.82
6,-245.54
7,-250.00
8,-250.00
9,-250.00
10,-227.65
11,-172.20
12,-110.31
13,-65.38
14,-50.67
15,-67.82
16,-112.44
17,-170.56
18,-219.45
19,-246.88
20,-250.00
21,-250.00
22,-247.09
23,-249.15
24,-250.00
25,-250.00
26,-236.95
27,-196.19
28,-142.49
29,-88.47
30,-40.60
31,-1.78
32,26.47
33,40.51
34,41.54
35,31.73
36,17.14
37,1.52
38,-10.22
39,-17.43
40,-19.06
41,-17.84
42,-15.34
43,-14.13
44,-14.96
45,-17.68
46,-21.59
47,-25.24
48,-28.14
49,-29.56
50,-30.03
51,-29.82
52,-29.79
53,-30.14
54,-31.14
55,-32.51
56,-34.20
57,-35.77
58,-37.25
59,-38.38
60,-39.46
61,-40.47
62,-41.69
63,-42.96
64,-44.43
65,-45.94
66,-47.67
67,-49.42
68,-51.31
69,-53.06
70,-54.76
71,-56.22
72,-57.57
73,-58.67
74,-59.65
75,-60.37
76,-61.06
77,-61.61
78,-62.20
79,-62.71
80,-63.26
81,-63.76
82,-64.37
83,-65.00
84,-65.73
85,-66.43
86,-67.16
87,-67.86
88,-68.57
89,-69.22
90,-69.82
91,-70.30
92,-70.64
93,-70.82
94,-70.85
95,-70.72
96,-70.47
97,-70.18
98,-69.85
99,-69.56
100,-69.27
101,-68.93
102,-68.44
103,-67.86
104,-67.16
105,-66.47
106,-65.66
107,-64.79
108,-63.76
109,-62.71
110,-61.58
111,-60.46
112,-59.26
113,-58.07
114,-56.94
115,-55.99
116,-55.22
117,-54.70
118,-54.37
119,-54.27
120,-54.31
121,-54.51
122,-54.76
123,-55.07
124,-55.41
125,-55.76
126,-56.10
127,-56.40
128,-56.69
129,-56.92
130,-57.09
131,-57.20
132,-57.36
133,-57.57
134,-57.88
135,-58.17
136,-58.49
137,-58.76
138,-59.04
139,-59.26
140,-59.56
141,-59.88
142,-60.33
143,-60.91
144,-61.78
145,-62.89
146,-64.26
147,-65.69
148,-67.17
149,-68.58
150,-69.99
151,-71.30
152,-72.51
153,-73.51
154,-74.32
155,-74.91
156,-75.36
157,-75.58
158,-75.57
159,-75.32
160,-74.97
161,-74.52
162,-74.01
163,-73.43
164,-72.81
165,-72.20
166,-71.57
167,-70.93
168,-70.28
169,-69.74
170,-69.32
171,-69.09
172,-69.05
173,-69.18
174,-69.36
175,-69.50
176,-69.53
177,-69.46
178,-69.31
179,-69.13
180,-68.98
181,-68.92
182,-68.94
183,-69.07
184,-69.31
185,-69.60
186,-69.90
187,-70.21
188,-70.53
189,-70.82
190,-71.03
191,-71.16
192,-71.27
193,-71.39
194,-71.45
195,-71.40
196,-71.21
197,-70.91
198,-70.50
199,-69.95
200,-69.31
201,-68.65
202,-68.05
203,-67.56
204,-67.21
205,-67.04
206,-67.05
207,-67.22
208,-67.53
209,-67.91
210,-68.29
211,-68.59
212,-68.73
213,-68.73
214,-68.68
215,-68.67
216,-68.70
217,-68.77
218,-68.89
219,-69.06
220,-69.27
221,-69.47
222,-69.59
223,-69.59
224,-69.41
225,-69.12
226,-68.76
227,-68.33
228,-67.82
229,-67.23
230,-66.60
231,-65.99
232,-65.42
233,-64.96
234,-64.61
235,-64.43
236,-64.38
237,-64.51
238,-64.83
239,-65.25
240,-65.62
241,-65.88
242,-66.02
243,-66.00
244,-65.80
245,-65.43
246,-65.08
247,-64.87
248,-64.92
249,-65.20
250,-65.80
251,-66.70
252,-67.87
253,-69.13
254,-70.34
255,-71.28
256,-71.97
257,-72.36
258,-72.60
259,-72.67
260,-72.79
261,-72.99
262,-73.52
263,-74.33
264,-75.48
265,-76.77
266,-78.24
267,-79.71
268,-81.23
269,-82.57
270,-83.79
271,-84.85
272,-85.91
273,-86.90
274,-87.82
275,-88.60
276,-89.32
277,-89.90
278,-90.29
279,-90.42
280,-90.32
281,-90.00
282,-89.46
283,-88.69
284,-87.73
285,-86.64
286,-85.49
287,-84.41
288,-83.53
289,-82.98
290,-82.79
291,-82.94
292,-83.32
293,-83.89
294,-84.43
295,-84.88
296,-85.07
297,-84.97
298,-84.49
299,-83.79
300,-82.89
301,-82.02
302,-81.11
303,-80.22
304,-79.31
305,-78.43
306,-77.55
307,-76.67
308,-75.68
309,-74.68
310,-73.68
311,-72.85
312,-72.17
313,-71.72
314,-71.40
315,-71.18
316,-70.93
317,-70.66
318,-70.27
319,-69.80
320,-69.21
321,-68.63
322,-68.08
323,-67.67
324,-67.32
325,-67.04
326,-66.79
327,-66.56
328,-66.25
329,-65.83
330,-65.34
331,-64.84
332,-64.44
333,-64.20
334,-64.18
335,-64.36
336,-64.69
337,-65.10
338,-65.61
339,-66.15
340,-66.65
341,-66.99
342,-67.23
343,-67.38
344,-67.63
345,-68.02
346,-68.67
347,-69.55
348,-70.76
349,-72.17
350,-73.79
351,-75.40
352,-76.97
353,-78.32
354,-79.50
355,-80.44
356,-81.22
357,-81.79
358,-82.25
359,-82.59
360,-82.93
361,-83.21
362,-83.46
363,-83.57
364,-83.58
365,-83.45
366,-83.21
367,-82.85
368,-82.40
369,-81.92
370,-81.44
371,-81.10
372,-80.86
373,-80.77
374,-80.68
375,-80.53
376,-80.14
377,-79.51
378,-78.51
379,-77.21
380,-75.58
381,-73.92
382,-72.34
383,-71.09
384,-70.13
385,-69.51
386,-69.11
387,-68.83
388,-68.46
389,-68.01
390,-67.47
391,-67.05
392,-66.77
393,-66.78
394,-67.10
395,-67.72
396,-68.45
397,-69.07
398,-69.40
399,-69.40
400,-69.11
401,-68.66
402,-68.24
403,-68.05
404,-68.27
405,-68.92
406,-69.94
407,-71.15
408,-72.43
409,-73.57
410,-74.44
411,-74.98
412,-75.23
413,-75.28
414,-75.17
415,-75.00
416,-74.81
417,-74.62
418,-74.41
419,-74.11
420,-73.75
421,-73.33
422,-72.84
423,-72.30
424,-71.77
425,-71.35
426,-71.04
427,-70.88
428,-70.80
429,-70.74
430,-70.66
431,-70.55
432,-70.40
433,-70.21
434,-69.98
435,-69.81
436,-69.76
437,-69.88
438,-70.10
439,-70.41
440,-70.82
441,-71.29
442,-71.76
443,-72.19
444,-72.59
445,-72.94
446,-73.22
447,-73.40
448,-73.51
449,-73.55
450,-73.56
451,-73.49
452,-73.41
453,-73.27
454,-73.15
455,-73.01
456,-72.93
457,-72.85
458,-72.85
459,-72.96
460,-73.27
461,-73.79
462,-74.56
463,-75.51
464,-76.66
465,-77.92
466,-79.22
467,-80.41
468,-81.44
469,-82.21
470,-82.76
471,-83.03
472,-83.14
473,-83.11
474,-83.12
475,-83.16
476,-83.29
477,-83.47
478,-83.72
479,-84.01
480,-84.31
481,-84.56
482,-84.72
483,-84.79
484,-84.72
485,-84.55
486,-84.26
487,-83.91
488,-83.50
489,-83.09
490,-82.63
491,-82.18
492,-81.65
493,-81.08
494,-80.35
495,-79.54
496,-78.54
497,-77.44
498,-76.10
499,-74.62
500,-72.99
501,-71.40
502,-69.80
503,-68.39
504,-67.12
505,-66.12
506,-65.33
507,-64.76
508,-64.27
509,-63.87
510,-63.48
511,-63.19
512,-62.99
513,-62.93
514,-63.02
515,-63.27
516,-63.65
517,-64.13
518,-64.65
519,-65.14
520,-65.56
521,-65.85
522,-66.01
523,-66.06
524,-66.10
525,-66.21
526,-66.42
527,-66.73
528,-67.12
529,-67.45
530,-67.73
531,-67.90
532,-68.08
533,-68.23
534,-68.38
535,-68.56
536,-68.90
537,-69.35
538,-69.89
539,-70.37
540,-70.84
541,-71.29
542,-71.78
543,-72.24
544,-72.78
545,-73.35
546,-74.03
547,-74.73
548,-75.52
549,-76.27
550,-77.03
551,-77.67
552,-78.26
553,-78.71
554,-79.12
555,-79.45
556,-79.85
557,-80.31
558,-80.91
559,-81.55
560,-82.28
561,-83.04
562,-83.90
563,-84.73
564,-85.46
565,-85.94
566,-86.18
567,-86.16
568,-85.94
569,-85.56
570,-85.20
571,-84.93
572,-84.88
573,-85.05
574,-85.51
575,-86.17
576,-86.93
577,-87.67
578,-88.29
579,-88.71
580,-88.84
581,-88.67
582,-88.23
583,-87.56
584,-86.68
585,-85.61
586,-84.40
587,-83.14
588,-81.88
589,-80.75
590,-79.80
591,-79.15
592,-78.74
593,-78.60
594,-78.57
595,-78.66
596,-78.69
597,-78.61
598,-78.19
599,-77.43
600,-76.29
601,-74.96
602,-73.62
603,-72.54
604,-71.84
605,-71.67
606,-72.01
607,-72.81
608,-73.87
609,-74.98
610,-75.90
611,-76.45
612,-76.49
613,-76.13
614,-75.53
615,-74.84
616,-74.19
617,-73.65
618,-73.33
619,-73.26
620,-73.41
621,-73.65
622,-73.96
623,-74.23
624,-74.53
625,-74.81
626,-75.17
627,-75.62
628,-76.30
629,-77.23
630,-78.56
631,-80.22
632,-82.23
633,-84.39
634,-86.57
635,-88.49
636,-90.00
637,-90.89
638,-91.17
639,-90.90
640,-90.27
641,-89.42
642,-88.48
643,-87.51
644,-86.57
645,-85.69
646,-84.81
647,-83.85
648,-82.75
649,-81.57
650,-80.37
651,-79.33
652,-78.53
653,-78.13
654,-78.16
655,-78.58
656,-79.24
657,-79.99
658,-80.73
659,-81.32
660,-81.67
661,-81.80
662,-81.81
663,-81.79
664,-81.76
665,-81.77
666,-81.89
667,-82.06
668,-82.17
669,-82.07
670,-81.73
671,-81.18
672,-80.44
673,-79.61
674,-78.78
675,-78.19
676,-77.86
677,-77.87
678,-78.13
679,-78.52
680,-78.80
681,-78.77
682,-78.24
683,-77.22
684,-75.80
685,-74.27
686,-72.93
687,-72.08
688,-71.90
689,-72.46
690,-73.59
691,-75.08
692,-76.55
693,-77.66
694,-78.13
695,-77.88
696,-77.00
697,-75.78
698,-74.50
699,-73.48
700,-72.83
701,-72.61
702,-72.72
703,-72.99
704,-73.16
705,-73.06
706,-72.56
707,-71.72
708,-70.63
709,-69.47
710,-68.40
711,-67.63
712,-67.24
713,-67.19
714,-67.31
715,-67.46
716,-67.52
717,-67.46
718,-67.21
719,-66.78
720,-66.31
721,-65.99
722,-65.99
723,-66.35
724,-67.01
725,-67.86
726,-68.81
727,-69.70
728,-70.47
729,-71.07
730,-71.56
731,-72.01
732,-72.55
733,-73.19
734,-73.97
735,-74.69
736,-75.23
737,-75.32
738,-75.04
739,-74.39
740,-73.69
741,-73.03
742,-72.73
743,-72.93
744,-73.91
745,-75.56
746,-77.83
747,-80.34
748,-82.98
749,-85.49
750,-87.77
751,-89.60
752,-91.03
753,-92.07
754,-92.95
755,-93.64
756,-94.22
757,-94.64
758,-94.94
759,-95.09
760,-95.14
761,-95.02
762,-94.74
763,-94.25
764,-93.54
765,-92.64
766,-91.65
767,-90.74
768,-90.02
769,-89.61
770,-89.52
771,-89.78
772,-90.24
773,-90.81
774,-91.30
775,-91.62
776,-91.65
777,-91.42
778,-90.93
779,-90.33
780,-89.69
781,-89.10
782,-88.53
783,-88.03
784,-87.48
785,-86.90
786,-86.17
787,-85.36
788,-84.42
789,-83.48
790,-82.46
791,-81.47
792,-80.44
793,-79.44
794,-78.36
795,-77.25
796,-76.06
797,-74.92
798,-73.91
799,-73.20
800,-72.83
801,-72.91
802,-73.33
803,-74.02
804,-74.80
805,-75.54
806,-76.06
807,-76.30
808,-76.25
809,-75.94
810,-75.43
811,-74.77
812,-74.04
813,-73.30
814,-72.65
815,-72.16
816,-71.96
817,-72.06
818,-72.50
819,-73.23
820,-74.18
821,-75.20
822,-76.16
823,-76.93
824,-77.55
825,-78.00
826,-78.38
827,-78.71
828,-79.18
829,-79.80
830,-80.71
831,-81.78
832,-83.00
833,-84.12
834,-85.09
835,-85.79
836,-86.36
837,-86.80
838,-87.25
839,-87.72
840,-88.29
841,-88.95
842,-89.64
843,-90.26
844,-90.69
845,-90.81
846,-90.53
847,-89.87
848,-88.91
849,-87.83
850,-86.72
851,-85.69
852,-84.85
853,-84.32
854,-84.10
855,-84.13
856,-84.20
857,-84.23
858,-84.08
859,-83.79
860,-83.30
861,-82.66
862,-81.84
863,-81.01
864,-80.21
865,-79.56
866,-79.03
867,-78.57
868,-78.06
869,-77.47
870,-76.79
871,-76.13
872,-75.55
873,-75.20
874,-75.10
875,-75.28
876,-75.69
877,-76.25
878,-76.82
879,-77.25
880,-77.42
881,-77.29
882,-76.93
883,-76.43
884,-75.95
885,-75.64
886,-75.65
887,-76.07
888,-76.87
889,-77.96
890,-79.23
891,-80.50
892,-81.57
893,-82.31
894,-82.61
895,-82.48
896,-81.98
897,-81.25
898,-80.46
899,-79.80
900,-79.33
901,-79.09
902,-79.04
903,-79.12
904,-79.21
905,-79.10
906,-78.61
907,-77.71
908,-76.52
909,-75.24
910,-74.04
911,-73.14
912,-72.71
913,-72.89
914,-73.63
915,-74.79
916,-76.17
917,-77.58
918,-78.79
919,-79.63
920,-80.02
921,-80.07
922,-79.95
923,-79.82
924,-79.73
925,-79.69
926,-79.63
927,-79.44
928,-79.07
929,-78.47
930,-77.71
931,-76.85
932,-76.00
933,-75.28
934,-74.80
935,-74.62
936,-74.68
937,-74.89
938,-75.09
939,-75.21
940,-75.22
941,-75.22
942,-75.29
943,-75.45
944,-75.72
945,-76.10
946,-76.56
947,-77.04
948,-77.42
949,-77.59
950,-77.64
951,-77.62
952,-77.61
953,-77.66
954,-77.86
955,-78.22
956,-78.71
957,-79.19
958,-79.57
959,-79.81
960,-79.96
961,-80.00
962,-79.96
963,-79.90
964,-79.93
965,-80.11
966,-80.38
967,-80.65
968,-80.79
969,-80.80
970,-80.63
971,-80.34
972,-79.91
973,-79.45
974,-78.90
975,-78.34
976,-77.61
977,-76.75
978,-75.58
979,-74.17
980,-72.46
981,-70.67
982,-68.87
983,-67.27
984,-65.86
985,-64.80
986,-64.06
987,-63.67
988,-63.45
989,-63.29
990,-63.07
991,-62.90
992,-62.83
993,-62.94
994,-63.22
995,-63.67
996,-64.22
997,-64.81
998,-65.37
999,-65.80
1000,-66.09
1001,-66.25
1002,-66.35
1003,-66.44
1004,-66.71
1005,-67.18
1006,-67.85
1007,-68.57
1008,-69.27
1009,-69.79
1010,-70.15
1011,-70.25
1012,-70.19
1013,-70.04
1014,-69.99
1015,-70.09
1016,-70.42
1017,-70.88
1018,-71.52
1019,-72.22
1020,-73.01
1021,-73.71
1022,-74.35
1023,-74.85
1024,-75.36
1025,-75.94
1026,-76.73
1027,-77.66
1028,-78.76
1029,-79.88
1030,-81.09
1031,-82.26
1032,-83.40
1033,-84.40
1034,-85.37
1035,-86.23
1036,-87.10
1037,-87.91
1038,-88.79
1039,-89.67
1040,-90.58
1041,-91.33
1042,-91.96
1043,-92.42
1044,-92.83
1045,-93.11
1046,-93.28
1047,-93.26
1048,-93.19
1049,-93.10
1050,-93.12
1051,-93.24
1052,-93.45
1053,-93.76
1054,-94.13
1055,-94.57
1056,-94.96
1057,-95.21
1058,-95.21
1059,-94.99
1060,-94.54
1061,-93.95
1062,-93.17
1063,-92.29
1064,-91.29
1065,-90.28
1066,-89.25
1067,-88.26
1068,-87.21
1069,-86.15
1070,-85.01
1071,-83.97
1072,-82.98
1073,-82.16
1074,-81.41
1075,-80.84
1076,-80.40
1077,-80.12
1078,-79.83
1079,-79.44
1080,-78.84
1081,-78.13
1082,-77.31
1083,-76.54
1084,-75.87
1085,-75.45
1086,-75.33
1087,-75.52
1088,-75.93
1089,-76.43
1090,-76.87
1091,-77.17
1092,-77.29
1093,-77.29
1094,-77.22
1095,-77.15
1096,-77.12
1097,-77.12
1098,-77.18
1099,-77.22
1100,-77.26
1101,-77.24
1102,-77.31
1103,-77.46
1104,-77.77
1105,-78.25
1106,-78.97
1107,-79.86
1108,-80.83
1109,-81.73
1110,-82.57
1111,-83.34
1112,-84.03
1113,-84.63
1114,-85.17
1115,-85.65
1116,-86.00
1117,-86.13
1118,-85.98
1119,-85.56
1120,-84.90
1121,-84.12
1122,-83.28
1123,-82.50
1124,-81.83
1125,-81.29
1126,-80.86
1127,-80.45
1128,-79.98
1129,-79.44
1130,-78.89
1131,-78.41
1132,-78.04
1133,-77.87
1134,-77.88
1135,-78.13
1136,-78.54
1137,-79.05
1138,-79.49
1139,-79.79
1140,-79.92
1141,-79.93
1142,-79.83
1143,-79.64
1144,-79.39
1145,-79.21
1146,-79.21
1147,-79.38
1148,-79.64
1149,-79.83
1150,-79.91
1151,-79.85
1152,-79.63
1153,-79.27
1154,-78.83
1155,-78.40
1156,-78.06
1157,-77.88
1158,-77.89
1159,-78.02
1160,-78.14
1161,-78.16
1162,-78.00
1163,-77.69
1164,-77.27
1165,-76.85
1166,-76.54
1167,-76.41
1168,-76.47
1169,-76.74
1170,-77.12
1171,-77.48
1172,-77.67
1173,-77.62
1174,-77.37
1175,-77.00
1176,-76.55
1177,-76.07
1178,-75.64
1179,-75.34
1180,-75.16
1181,-75.07
1182,-74.93
1183,-74.69
1184,-74.31
1185,-73.84
1186,-73.29
1187,-72.69
1188,-72.04
1189,-71.46
1190,-70.96
1191,-70.61
1192,-70.34
1193,-70.18
1194,-70.10
1195,-70.11
1196,-70.09
1197,-69.98
1198,-69.76
1199,-69.52
1200,-69.29
1201,-69.11
1202,-68.98
1203,-68.92
1204,-68.96
1205,-69.07
1206,-69.23
1207,-69.40
1208,-69.66
1209,-69.93
1210,-70.27
1211,-70.68
1212,-71.27
1213,-72.01
1214,-72.98
1215,-74.06
1216,-75.25
1217,-76.35
1218,-77.37
1219,-78.13
1220,-78.74
1221,-79.18
1222,-79.61
1223,-80.05
1224,-80.73
1225,-81.59
1226,-82.73
1227,-83.97
1228,-85.33
1229,-86.62
1230,-87.89
1231,-89.01
1232,-90.03
1233,-90.90
1234,-91.74
1235,-92.50
1236,-93.24
1237,-93.83
1238,-94.25
1239,-94.42
1240,-94.39
1241,-94.14
1242,-93.69
1243,-93.02
1244,-92.22
1245,-91.37
1246,-90.57
1247,-89.85
1248,-89.22
1249,-88.75
1250,-88.46
1251,-88.42
1252,-88.50
1253,-88.65
1254,-88.71
1255,-88.68
1256,-88.41
1257,-87.95
1258,-87.26
1259,-86.49
1260,-85.68
1261,-84.98
1262,-84.35
1263,-83.85
1264,-83.29
1265,-82.66
1266,-81.83
1267,-80.83
1268,-79.59
1269,-78.22
1270,-76.76
1271,-75.39
1272,-74.17
1273,-73.23
1274,-72.53
1275,-72.14
1276,-71.94
1277,-71.90
1278,-71.88
1279,-71.91
1280,-71.89
1281,-71.85
1282,-71.66
1283,-71.44
1284,-71.21
1285,-71.03
1286,-70.84
1287,-70.61
1288,-70.36
1289,-70.11
1290,-69.85
1291,-69.56
1292,-69.23
1293,-68.92
1294,-68.70
1295,-68.57
1296,-68.56
1297,-68.67
1298,-68.97
1299,-69.38
1300,-69.87
1301,-70.34
1302,-70.85
1303,-71.42
1304,-72.15
1305,-73.03
1306,-74.14
1307,-75.39
1308,-76.76
1309,-78.06
1310,-79.28
1311,-80.28
1312,-81.14
1313,-81.76
1314,-82.25
1315,-82.65
1316,-83.12
1317,-83.64
1318,-84.23
1319,-84.83
1320,-85.47
1321,-86.06
1322,-86.52
1323,-86.70
1324,-86.60
1325,-86.23
1326,-85.64
1327,-84.92
1328,-84.15
1329,-83.44
1330,-82.80
1331,-82.32
1332,-82.02
1333,-81.98
1334,-82.12
1335,-82.40
1336,-82.58
1337,-82.61
1338,-82.34
1339,-81.82
1340,-80.99
1341,-79.98
1342,-78.84
1343,-77.77
1344,-76.80
1345,-76.03
1346,-75.42
1347,-74.90
1348,-74.34
1349,-73.76
1350,-73.14
1351,-72.53
1352,-71.96
1353,-71.55
1354,-71.39
1355,-71.56
1356,-72.01
1357,-72.63
1358,-73.32
1359,-73.98
1360,-74.53
1361,-74.89
1362,-75.07
1363,-75.11
1364,-75.13
1365,-75.17
1366,-75.33
1367,-75.64
1368,-76.09
1369,-76.56
1370,-76.97
1371,-77.28
1372,-77.51
1373,-77.68
1374,-77.76
1375,-77.71
1376,-77.55
1377,-77.35
1378,-77.18
1379,-77.01
1380,-76.79
1381,-76.49
1382,-76.11
1383,-75.69
1384,-75.26
1385,-74.84
1386,-74.42
1387,-74.07
1388,-73.82
1389,-73.70
1390,-73.66
1391,-73.67
1392,-73.72
1393,-73.77
1394,-73.81
1395,-73.81
1396,-73.80
1397,-73.84
1398,-74.04
1399,-74.39
1400,-74.91
1401,-75.64
1402,-76.58
1403,-77.59
1404,-78.54
1405,-79.26
1406,-79.76
1407,-79.98
1408,-79.96
1409,-79.70
1410,-79.35
1411,-79.03
1412,-78.85
1413,-78.78
1414,-78.86
1415,-79.03
1416,-79.32
1417,-79.62
1418,-79.86
1419,-80.03
1420,-80.21
1421,-80.44
1422,-80.75
1423,-81.11
1424,-81.53
1425,-81.99
1426,-82.53
1427,-83.07
1428,-83.59
1429,-83.99
1430,-84.31
1431,-84.53
1432,-84.76
1433,-84.99
1434,-85.24
1435,-85.48
1436,-85.73
1437,-85.96
1438,-86.18
1439,-86.36
1440,-86.50
1441,-86.63
1442,-86.72
1443,-86.78
1444,-86.80
1445,-86.81
1446,-86.77
1447,-86.60
1448,-86.20
1449,-85.62
1450,-84.88
1451,-84.11
1452,-83.29
1453,-82.60
1454,-82.00
1455,-81.56
1456,-81.05
1457,-80.43
1458,-79.54
1459,-78.42
1460,-76.97
1461,-75.31
1462,-73.49
1463,-71.82
1464,-70.41
1465,-69.41
1466,-68.70
1467,-68.26
1468,-67.95
1469,-67.72
1470,-67.44
1471,-67.16
1472,-66.89
1473,-66.76
1474,-66.81
1475,-67.07
1476,-67.50
1477,-68.05
1478,-68.58
1479,-69.02
1480,-69.28
1481,-69.33
1482,-69.18
1483,-68.92
1484,-68.75
1485,-68.73
1486,-68.89
1487,-69.21
1488,-69.66
1489,-70.13
1490,-70.51
1491,-70.69
1492,-70.72
1493,-70.64
1494,-70.50
1495,-70.31
1496,-70.18
1497,-70.08
1498,-70.16
1499,-70.32
1500,-70.63
1501,-71.04
1502,-71.60
1503,-72.30
1504,-73.20
1505,-74.26
1506,-75.53
1507,-76.83
1508,-78.13
1509,-79.32
1510,-80.43
1511,-81.30
1512,-81.95
1513,-82.28
1514,-82.47
1515,-82.55
1516,-82.69
1517,-82.84
1518,-83.15
1519,-83.54
1520,-84.10
1521,-84.73
1522,-85.53
1523,-86.42
1524,-87.41
1525,-88.35
1526,-89.23
1527,-90.00
1528,-90.72
1529,-91.30
1530,-91.75
1531,-92.05
1532,-92.27
1533,-92.44
1534,-92.55
1535,-92.62
1536,-92.67
1537,-92.67
1538,-92.55
1539,-92.32
1540,-91.99
1541,-91.58
1542,-91.01
1543,-90.31
1544,-89.47
1545,-88.64
1546,-87.81
1547,-87.06
1548,-86.29
1549,-85.60
1550,-84.89
1551,-84.21
1552,-83.37
1553,-82.44
1554,-81.37
1555,-80.30
1556,-79.21
1557,-78.20
1558,-77.27
1559,-76.52
1560,-75.87
1561,-75.35
1562,-74.87
1563,-74.52
1564,-74.32
1565,-74.38
1566,-74.71
1567,-75.33
1568,-76.12
1569,-76.97
1570,-77.74
1571,-78.29
1572,-78.54
1573,-78.46
1574,-78.13
1575,-77.63
1576,-77.15
1577,-76.76
1578,-76.61
1579,-76.65
1580,-76.95
1581,-77.41
1582,-78.07
1583,-78.83
1584,-79.73
1585,-80.67
1586,-81.71
1587,-82.77
1588,-83.89
1589,-84.96
1590,-86.01
1591,-86.94
1592,-87.82
1593,-88.65
1594,-89.49
1595,-90.26
1596,-90.90
1597,-91.26
1598,-91.33
1599,-91.09
1600,-90.55
1601,-89.77
1602,-88.81
1603,-87.86
1604,-86.95
1605,-86.13
1606,-85.30
1607,-84.47
1608,-83.63
1609,-82.80
1610,-81.92
1611,-81.02
1612,-80.16
1613,-79.51
1614,-79.11
1615,-79.01
1616,-79.07
1617,-79.27
1618,-79.55
1619,-79.91
1620,-80.30
1621,-80.73
1622,-81.20
1623,-81.73
1624,-82.31
1625,-82.87
1626,-83.31
1627,-83.55
1628,-83.56
1629,-83.31
1630,-82.86
1631,-82.24
1632,-81.58
1633,-80.98
1634,-80.51
1635,-80.21
1636,-80.05
1637,-80.01
1638,-79.99
1639,-79.94
1640,-79.77
1641,-79.48
1642,-79.08
1643,-78.66
1644,-78.24
1645,-77.95
1646,-77.83
1647,-77.96
1648,-78.25
1649,-78.64
1650,-78.97
1651,-79.23
1652,-79.30
1653,-79.13
1654,-78.65
1655,-77.93
1656,-77.06
1657,-76.22
1658,-75.49
1659,-74.96
1660,-74.61
1661,-74.45
1662,-74.39
1663,-74.41
1664,-74.39
1665,-74.29
1666,-73.99
1667,-73.52
1668,-72.88
1669,-72.23
1670,-71.60
1671,-71.07
1672,-70.61
1673,-70.26
1674,-70.01
1675,-69.90
1676,-69.85
1677,-69.87
1678,-69.90
1679,-69.96
1680,-70.00
1681,-70.01
1682,-69.98
1683,-69.91
1684,-69.83
1685,-69.76
1686,-69.77
1687,-69.82
1688,-69.93
1689,-70.10
1690,-70.42
1691,-70.88
1692,-71.50
1693,-72.21
1694,-73.05
1695,-73.92
1696,-74.87
1697,-75.75
1698,-76.61
1699,-77.29
1700,-77.90
1701,-78.41
1702,-78.99
1703,-79.61
1704,-80.39
1705,-81.20
1706,-82.15
1707,-83.08
1708,-84.02
1709,-84.84
1710,-85.65
1711,-86.39
1712,-87.19
1713,-88.07
1714,-89.16
1715,-90.42
1716,-91.74
1717,-92.96
1718,-93.94
1719,-94.53
1720,-94.67
1721,-94.29
1722,-93.52
1723,-92.48
1724,-91.33
1725,-90.19
1726,-89.15
1727,-88.26
1728,-87.50
1729,-86.92
1730,-86.47
1731,-86.19
1732,-85.96
1733,-85.82
1734,-85.62
1735,-85.40
1736,-85.02
1737,-84.52
1738,-83.80
1739,-82.98
1740,-82.01
1741,-81.08
1742,-80.18
1743,-79.41
1744,-78.67
1745,-78.00
1746,-77.27
1747,-76.52
1748,-75.55
1749,-74.45
1750,-73.17
1751,-71.92
1752,-70.69
1753,-69.64
1754,-68.73
1755,-68.09
1756,-67.66
1757,-67.44
1758,-67.32
1759,-67.28
1760,-67.22
1761,-67.18
1762,-67.09
1763,-67.05
1764,-66.98
1765,-66.87
1766,-66.67
1767,-66.44
1768,-66.21
1769,-66.03
1770,-65.86
1771,-65.69
1772,-65.50
1773,-65.32
1774,-65.14
1775,-64.96
1776,-64.79
1777,-64.66
1778,-64.62
1779,-64.67
1780,-64.86
1781,-65.14
1782,-65.59
1783,-66.18
1784,-66.93
1785,-67.70
1786,-68.46
1787,-69.16
1788,-69.90
1789,-70.66
1790,-71.47
1791,-72.24
1792,-73.01
1793,-73.77
1794,-74.58
1795,-75.35
1796,-76.06
1797,-76.64
1798,-77.18
1799,-77.64
1800,-78.07
1801,-78.43
1802,-78.74
1803,-78.96
1804,-79.13
1805,-79.19
1806,-79.13
1807,-78.89
1808,-78.45
1809,-77.85
1810,-77.15
1811,-76.48
1812,-75.97
1813,-75.74
1814,-75.77
1815,-76.03
1816,-76.35
1817,-76.57
1818,-76.45
1819,-75.92
1820,-74.93
1821,-73.67
1822,-72.29
1823,-71.03
1824,-69.97
1825,-69.20
1826,-68.71
1827,-68.49
1828,-68.42
1829,-68.37
1830,-68.22
1831,-67.99
1832,-67.73
1833,-67.58
1834,-67.67
1835,-68.03
1836,-68.68
1837,-69.52
1838,-70.46
1839,-71.35
1840,-72.19
1841,-72.89
1842,-73.51
1843,-74.03
1844,-74.57
1845,-75.16
1846,-75.82
1847,-76.48
1848,-77.10
1849,-77.57
1850,-77.89
1851,-78.00
1852,-77.93
1853,-77.68
1854,-77.31
1855,-76.89
1856,-76.47
1857,-76.06
1858,-75.60
1859,-75.13
1860,-74.66
1861,-74.25
1862,-73.84
1863,-73.45
1864,-72.98
1865,-72.52
1866,-72.01
1867,-71.54
1868,-71.07
1869,-70.60
1870,-70.07
1871,-69.47
1872,-68.82
1873,-68.15
1874,-67.55
1875,-67.06
1876,-66.77
1877,-66.76
1878,-67.12
1879,-67.90
1880,-69.08
1881,-70.52
1882,-72.11
1883,-73.67
1884,-75.10
1885,-76.24
1886,-76.99
1887,-77.22
1888,-76.97
1889,-76.29
1890,-75.36
1891,-74.36
1892,-73.59
1893,-73.14
1894,-73.13
1895,-73.50
1896,-74.20
1897,-74.97
1898,-75.62
1899,-76.00
1900,-76.10
1901,-75.95
1902,-75.65
1903,-75.39
1904,-75.43
1905,-75.90
1906,-76.78
1907,-77.88
1908,-79.01
1909,-79.97
1910,-80.67
1911,-81.02
1912,-81.04
1913,-80.78
1914,-80.41
1915,-80.02
1916,-79.78
1917,-79.78
1918,-80.07
1919,-80.62
1920,-81.32
1921,-82.05
1922,-82.71
1923,-83.20
1924,-83.42
1925,-83.37
1926,-83.02
1927,-82.43
1928,-81.59
1929,-80.58
1930,-79.42
1931,-78.23
1932,-77.03
1933,-75.97
1934,-75.04
1935,-74.34
1936,-73.81
1937,-73.49
1938,-73.19
1939,-72.93
1940,-72.51
1941,-71.95
1942,-71.08
1943,-69.95
1944,-68.56
1945,-67.13
1946,-65.77
1947,-64.65
1948,-63.70
1949,-62.94
1950,-62.32
1951,-61.92
1952,-61.66
1953,-61.56
1954,-61.54
1955,-61.67
1956,-61.93
1957,-62.30
1958,-62.64
1959,-62.84
1960,-62.81
1961,-62.56
1962,-62.16
1963,-61.73
1964,-61.41
1965,-61.34
1966,-61.59
1967,-62.13
1968,-62.88
1969,-63.67
1970,-64.38
1971,-64.85
1972,-65.07
1973,-65.06
1974,-64.93
1975,-64.78
1976,-64.76
1977,-64.86
1978,-65.19
1979,-65.65
1980,-66.25
1981,-66.90
1982,-67.63
1983,-68.32
1984,-69.02
1985,-69.59
1986,-70.16
1987,-70.66
1988,-71.22
1989,-71.79
1990,-72.53
1991,-73.33
1992,-74.30
1993,-75.34
1994,-76.61
1995,-77.96
1996,-79.40
1997,-80.70
1998,-81.89
1999,-82.89
2000,-83.79
2001,-84.53
2002,-85.23
2003,-85.81
2004,-86.36
2005,-86.75
2006,-87.01
2007,-87.00
2008,-86.78
2009,-86.40
2010,-86.01
2011,-85.75
2012,-85.76
2013,-86.12
2014,-86.83
2015,-87.75
2016,-88.65
2017,-89.28
2018,-89.43
2019,-89.08
2020,-88.23
2021,-87.09
2022,-85.80
2023,-84.61
2024,-83.55
2025,-82.74
2026,-82.08
2027,-81.52
2028,-80.81
2029,-79.96
2030,-78.81
2031,-77.51
2032,-76.01
2033,-74.53
2034,-73.15
2035,-72.14
2036,-71.50
2037,-71.31
2038,-71.34
2039,-71.51
2040,-71.51
2041,-71.24
2042,-70.54
2043,-69.53
2044,-68.27
2045,-66.99
2046,-65.89
2047,-65.16
2048,-64.95
2049,-65.32
2050,-66.20
2051,-67.41
2052,-68.75
2053,-70.01
2054,-71.11
2055,-71.94
2056,-72.50
2057,-72.78
2058,-72.91
2059,-72.93
2060,-73.03
2061,-73.17
2062,-73.52
2063,-73.97
2064,-74.62
2065,-75.25
2066,-75.92
2067,-76.55
2068,-77.29
2069,-78.09
2070,-79.08
2071,-80.22
2072,-81.53
2073,-82.90
2074,-84.23
2075,-85.37
2076,-86.28
2077,-86.81
2078,-86.90
2079,-86.48
2080,-85.65
2081,-84.55
2082,-83.31
2083,-82.05
2084,-80.86
2085,-79.84
2086,-79.01
2087,-78.35
2088,-77.84
2089,-77.50
2090,-77.28
2091,-77.16
2092,-77.09
2093,-77.03
2094,-77.00
2095,-77.06
2096,-77.22
2097,-77.46
2098,-77.75
2099,-78.12
2100,-78.58
2101,-79.05
2102,-79.46
2103,-79.76
2104,-80.02
2105,-80.31
2106,-80.64
2107,-80.99
2108,-81.44
2109,-81.97
2110,-82.56
2111,-83.05
2112,-83.33
2113,-83.33
2114,-83.05
2115,-82.57
2116,-81.95
2117,-81.28
2118,-80.66
2119,-80.18
2120,-79.89
2121,-79.78
2122,-79.74
2123,-79.70
2124,-79.57
2125,-79.34
2126,-78.96
2127,-78.49
2128,-77.93
2129,-77.39
2130,-76.91
2131,-76.57
2132,-76.31
2133,-76.14
2134,-76.00
2135,-75.90
2136,-75.77
2137,-75.59
2138,-75.33
2139,-75.04
2140,-74.75
2141,-74.46
2142,-74.07
2143,-73.61
2144,-73.08
2145,-72.60
2146,-72.15
2147,-71.75
2148,-71.36
2149,-71.01
2150,-70.66
2151,-70.38
2152,-70.11
2153,-69.82
2154,-69.42
2155,-68.95
2156,-68.45
2157,-68.02
2158,-67.69
2159,-67.46
2160,-67.31
2161,-67.25
2162,-67.25
2163,-67.32
2164,-67.44
2165,-67.55
2166,-67.63
2167,-67.67
2168,-67.83
2169,-68.10
2170,-68.56
2171,-69.15
2172,-69.95
2173,-70.88
2174,-71.98
2175,-73.10
2176,-74.28
2177,-75.33
2178,-76.25
2179,-76.89
2180,-77.36
2181,-77.61
2182,-77.82
2183,-78.03
2184,-78.48
2185,-79.15
2186,-80.15
2187,-81.34
2188,-82.78
2189,-84.24
2190,-85.69
2191,-86.87
2192,-87.87
2193,-88.61
2194,-89.21
2195,-89.67
2196,-90.15
2197,-90.67
2198,-91.26
2199,-91.79
2200,-92.27
2201,-92.62
2202,-92.84
2203,-92.84
2204,-92.58
2205,-92.10
2206,-91.48
2207,-90.81
2208,-90.15
2209,-89.57
2210,-89.06
2211,-88.65
2212,-88.26
2213,-87.92
2214,-87.59
2215,-87.30
2216,-86.98
2217,-86.65
2218,-86.21
2219,-85.77
2220,-85.18
2221,-84.49
2222,-83.56
2223,-82.52
2224,-81.29
2225,-79.99
2226,-78.54
2227,-77.13
2228,-75.76
2229,-74.58
2230,-73.52
2231,-72.65
2232,-71.88
2233,-71.31
2234,-70.85
2235,-70.58
2236,-70.37
2237,-70.28
2238,-70.21
2239,-70.18
2240,-70.01
2241,-69.73
2242,-69.31
2243,-68.83
2244,-68.28
2245,-67.70
2246,-67.06
2247,-66.46
2248,-65.93
2249,-65.53
2250,-65.19
2251,-64.90
2252,-64.61
2253,-64.36
2254,-64.22
2255,-64.16
2256,-64.16
2257,-64.21
2258,-64.38
2259,-64.66
2260,-65.08
2261,-65.56
2262,-66.09
2263,-66.61
2264,-67.18
2265,-67.76
2266,-68.45
2267,-69.20
2268,-70.09
2269,-71.03
2270,-72.07
2271,-73.07
2272,-74.03
2273,-74.85
2274,-75.64
2275,-76.33
2276,-76.99
2277,-77.57
2278,-78.19
2279,-78.83
2280,-79.53
2281,-80.12
2282,-80.56
2283,-80.74
2284,-80.67
2285,-80.29
2286,-79.64
2287,-78.80
2288,-77.89
2289,-77.04
2290,-76.32
2291,-75.86
2292,-75.68
2293,-75.81
2294,-76.12
2295,-76.58
2296,-77.01
2297,-77.35
2298,-77.34
2299,-76.94
2300,-76.07
2301,-74.87
2302,-73.43
2303,-71.95
2304,-70.46
2305,-69.15
2306,-68.05
2307,-67.23
2308,-66.60
2309,-66.07
2310,-65.54
2311,-65.01
2312,-64.49
2313,-64.07
2314,-63.79
2315,-63.79
2316,-64.16
2317,-64.93
2318,-66.03
2319,-67.26
2320,-68.42
2321,-69.31
2322,-69.88
2323,-70.10
2324,-70.12
2325,-70.03
2326,-69.98
2327,-70.03
2328,-70.29
2329,-70.70
2330,-71.21
2331,-71.70
2332,-72.11
2333,-72.34
2334,-72.37
2335,-72.19
2336,-71.85
2337,-71.42
2338,-70.96
2339,-70.49
2340,-70.00
2341,-69.52
2342,-69.08
2343,-68.72
2344,-68.44
2345,-68.27
2346,-68.17
2347,-68.12
2348,-68.06
2349,-68.01
2350,-67.93
2351,-67.82
2352,-67.62
2353,-67.38
2354,-67.17
2355,-67.04
2356,-67.01
2357,-67.08
2358,-67.25
2359,-67.47
2360,-67.73
2361,-67.99
2362,-68.21
2363,-68.39
2364,-68.49
2365,-68.55
2366,-68.61
2367,-68.67
2368,-68.68
2369,-68.63
2370,-68.53
2371,-68.40
2372,-68.25
2373,-68.06
2374,-67.89
2375,-67.76
2376,-67.73
2377,-67.78
2378,-67.92
2379,-68.16
2380,-68.54
2381,-69.00
2382,-69.55
2383,-70.14
2384,-70.85
2385,-71.62
2386,-72.40
2387,-73.12
2388,-73.79
2389,-74.38
2390,-74.87
2391,-75.22
2392,-75.48
2393,-75.64
2394,-75.79
2395,-75.89
2396,-76.02
2397,-76.19
2398,-76.47
2399,-76.83
2400,-77.22
2401,-77.52
2402,-77.71
2403,-77.76
2404,-77.71
2405,-77.58
2406,-77.42
2407,-77.24
2408,-77.06
2409,-76.90
2410,-76.68
2411,-76.46
2412,-76.19
2413,-75.91
2414,-75.51
2415,-75.05
2416,-74.49
2417,-73.92
2418,-73.20
2419,-72.34
2420,-71.17
2421,-69.82
2422,-68.27
2423,-66.66
2424,-64.99
2425,-63.45
2426,-62.09
2427,-61.03
2428,-60.17
2429,-59.55
2430,-59.04
2431,-58.63
2432,-58.21
2433,-57.86
2434,-57.64
2435,-57.64
2436,-57.82
2437,-58.20
2438,-58.73
2439,-59.40
2440,-60.10
2441,-60.71
2442,-61.16
2443,-61.45
2444,-61.65
2445,-61.81
2446,-62.00
2447,-62.23
2448,-62.56
2449,-62.91
2450,-63.26
2451,-63.49
2452,-63.61
2453,-63.60
2454,-63.53
2455,-63.39
2456,-63.26
2457,-63.19
2458,-63.30
2459,-63.57
2460,-64.04
2461,-64.64
2462,-65.40
2463,-66.22
2464,-67.05
2465,-67.76
2466,-68.43
2467,-68.98
2468,-69.55
2469,-70.13
2470,-70.89
2471,-71.81
2472,-72.96
2473,-74.21
2474,-75.61
2475,-76.96
2476,-78.22
2477,-79.23
2478,-80.06
2479,-80.63
2480,-80.97
2481,-81.08
2482,-81.10
2483,-81.08
2484,-81.06
2485,-81.00
2486,-80.93
2487,-80.86
2488,-80.82
2489,-80.75
2490,-80.68
2491,-80.63
2492,-80.60
2493,-80.60
2494,-80.58
2495,-80.60
2496,-80.63
2497,-80.64
2498,-80.51
2499,-80.29
2500,-79.98
2501,-79.63
2502,-79.14
2503,-78.58
2504,-77.90
2505,-77.26
2506,-76.53
2507,-75.80
2508,-74.93
2509,-73.99
2510,-72.87
2511,-71.70
2512,-70.47
2513,-69.29
2514,-68.06
2515,-66.95
2516,-65.96
2517,-65.27
2518,-64.73
2519,-64.34
2520,-63.99
2521,-63.71
2522,-63.40
2523,-63.05
2524,-62.60
2525,-62.19
2526,-61.90
2527,-61.83
2528,-61.97
2529,-62.34
2530,-62.97
2531,-63.74
2532,-64.54
2533,-65.19
2534,-65.73
2535,-66.12
2536,-66.47
2537,-66.75
2538,-67.07
2539,-67.41
2540,-67.83
2541,-68.24
2542,-68.66
2543,-68.98
2544,-69.31
2545,-69.65
2546,-70.18
2547,-70.85
2548,-71.78
2549,-72.85
2550,-74.11
2551,-75.42
2552,-76.69
2553,-77.76
2554,-78.65
2555,-79.36
2556,-79.92
2557,-80.28
2558,-80.42
2559,-80.36
2560,-80.13
2561,-79.77
2562,-79.27
2563,-78.61
2564,-77.81
2565,-76.97
2566,-76.15
2567,-75.38
2568,-74.61
2569,-73.84
2570,-73.06
2571,-72.28
2572,-71.48
2573,-70.71
2574,-70.02
2575,-69.53
2576,-69.30
2577,-69.44
2578,-69.95
2579,-70.86
2580,-72.01
2581,-73.24
2582,-74.33
2583,-75.06
2584,-75.28
2585,-74.97
2586,-74.27
2587,-73.39
2588,-72.59
2589,-72.04
2590,-71.89
2591,-72.20
2592,-72.88
2593,-73.74
2594,-74.55
2595,-75.11
2596,-75.27
2597,-75.09
2598,-74.65
2599,-74.16
2600,-73.73
2601,-73.43
2602,-73.27
2603,-73.16
2604,-73.03
2605,-72.81
2606,-72.41
2607,-71.86
2608,-71.22
2609,-70.69
2610,-70.35
2611,-70.30
2612,-70.43
2613,-70.65
2614,-70.75
2615,-70.66
2616,-70.21
2617,-69.44
2618,-68.36
2619,-67.21
2620,-66.18
2621,-65.45
2622,-65.07
2623,-65.05
2624,-65.25
2625,-65.56
2626,-65.81
2627,-65.96
2628,-65.95
2629,-65.83
2630,-65.54
2631,-65.27
2632,-65.06
2633,-65.00
2634,-64.97
2635,-64.94
2636,-64.85
2637,-64.67
2638,-64.29
2639,-63.64
2640,-62.76
2641,-61.72
2642,-60.61
2643,-59.52
2644,-58.61
2645,-57.99
2646,-57.78
2647,-58.01
2648,-58.74
2649,-59.88
2650,-61.32
2651,-62.82
2652,-64.28
2653,-65.57
2654,-66.76
2655,-67.76
2656,-68.62
2657,-69.25
2658,-69.78
2659,-70.16
2660,-70.56
2661,-70.89
2662,-71.25
2663,-71.52
2664,-71.82
2665,-72.14
2666,-72.66
2667,-73.36
2668,-74.29
2669,-75.29
2670,-76.39
2671,-77.44
2672,-78.51
2673,-79.51
2674,-80.50
2675,-81.38
2676,-82.18
2677,-82.89
2678,-83.57
2679,-84.16
2680,-84.63
2681,-84.86
2682,-84.89
2683,-84.71
2684,-84.31
2685,-83.71
2686,-82.95
2687,-82.17
2688,-81.46
2689,-80.92
2690,-80.57
2691,-80.47
2692,-80.56
2693,-80.83
2694,-81.06
2695,-81.15
2696,-80.92
2697,-80.34
2698,-79.34
2699,-78.09
2700,-76.69
2701,-75.37
2702,-74.20
2703,-73.32
2704,-72.71
2705,-72.44
2706,-72.35
2707,-72.33
2708,-72.12
2709,-71.74
2710,-71.10
2711,-70.33
2712,-69.38
2713,-68.44
2714,-67.56
2715,-66.85
2716,-66.25
2717,-65.79
2718,-65.43
2719,-65.21
2720,-65.03
2721,-64.87
2722,-64.64
2723,-64.48
2724,-64.36
2725,-64.32
2726,-64.21
2727,-64.04
2728,-63.83
2729,-63.58
2730,-63.27
2731,-62.85
2732,-62.36
2733,-61.87
2734,-61.46
2735,-61.22
2736,-61.20
2737,-61.36
2738,-61.74
2739,-62.26
2740,-62.98
2741,-63.80
2742,-64.74
2743,-65.69
2744,-66.70
2745,-67.76
2746,-68.95
2747,-70.19
2748,-71.49
2749,-72.69
2750,-73.72
2751,-74.42
2752,-74.78
2753,-74.76
2754,-74.52
2755,-74.06
2756,-73.56
2757,-73.12
2758,-72.94
2759,-73.12
2760,-73.62
2761,-74.30
2762,-75.00
2763,-75.61
2764,-76.01
2765,-76.15
2766,-75.92
2767,-75.33
2768,-74.38
2769,-73.25
2770,-72.04
2771,-70.97
2772,-70.07
2773,-69.44
2774,-68.95
2775,-68.63
2776,-68.28
2777,-67.90
2778,-67.31
2779,-66.50
2780,-65.32
2781,-63.91
2782,-62.27
2783,-60.62
2784,-58.88
2785,-57.29
2786,-55.86
2787,-54.74
2788,-53.82
2789,-53.13
2790,-52.60
2791,-52.25
2792,-51.99
2793,-51.81
2794,-51.76
2795,-51.93
2796,-52.38
2797,-53.04
2798,-53.86
2799,-54.76
2800,-55.72
2801,-56.66
2802,-57.60
2803,-58.43
2804,-59.17
2805,-59.81
2806,-60.43
2807,-60.96
2808,-61.37
2809,-61.54
2810,-61.53
2811,-61.32
2812,-61.05
2813,-60.78
2814,-60.69
2815,-60.80
2816,-61.16
2817,-61.76
2818,-62.61
2819,-63.63
2820,-64.70
2821,-65.67
2822,-66.41
2823,-66.83
2824,-66.91
2825,-66.67
2826,-66.15
2827,-65.41
2828,-64.57
2829,-63.72
2830,-63.01
2831,-62.46
2832,-62.07
2833,-61.83
2834,-61.81
2835,-61.98
2836,-62.29
2837,-62.67
2838,-63.03
2839,-63.39
2840,-63.73
2841,-64.03
2842,-64.29
2843,-64.53
2844,-64.74
2845,-64.92
2846,-65.07
2847,-65.19
2848,-65.29
2849,-65.35
2850,-65.36
2851,-65.35
2852,-65.38
2853,-65.50
2854,-65.70
2855,-65.94
2856,-66.18
2857,-66.35
2858,-66.48
2859,-66.54
2860,-66.55
2861,-66.53
2862,-66.57
2863,-66.74
2864,-67.12
2865,-67.66
2866,-68.28
2867,-68.89
2868,-69.44
2869,-69.84
2870,-70.11
2871,-70.21
2872,-70.27
2873,-70.37
2874,-70.63
2875,-70.97
2876,-71.40
2877,-71.82
2878,-72.24
2879,-72.58
2880,-72.88
2881,-73.12
2882,-73.33
2883,-73.57
2884,-73.84
2885,-74.15
2886,-74.44
2887,-74.63
2888,-74.63
2889,-74.41
2890,-73.91
2891,-73.20
2892,-72.27
2893,-71.27
2894,-70.21
2895,-69.21
2896,-68.19
2897,-67.28
2898,-66.33
2899,-65.35
2900,-64.09
2901,-62.64
2902,-60.93
2903,-59.14
2904,-57.23
2905,-55.40
2906,-53.71
2907,-52.41
2908,-51.43
2909,-50.80
2910,-50.40
2911,-50.25
2912,-50.21
2913,-50.29
2914,-50.40
2915,-50.64
2916,-51.03
2917,-51.58
2918,-52.21
2919,-52.81
2920,-53.35
2921,-53.76
2922,-54.05
2923,-54.21
2924,-54.35
2925,-54.51
2926,-54.82
2927,-55.29
2928,-55.94
2929,-56.65
2930,-57.39
2931,-57.98
2932,-58.39
2933,-58.54
2934,-58.59
2935,-58.55
2936,-58.62
2937,-58.83
2938,-59.33
2939,-60.03
2940,-60.94
2941,-61.88
2942,-62.88
2943,-63.82
2944,-64.72
2945,-65.48
2946,-66.18
2947,-66.81
2948,-67.50
2949,-68.14
2950,-68.76
2951,-69.22
2952,-69.56
2953,-69.72
2954,-69.78
2955,-69.76
2956,-69.79
2957,-69.89
2958,-70.12
2959,-70.41
2960,-70.79
2961,-71.14
2962,-71.46
2963,-71.69
2964,-71.85
2965,-71.97
2966,-72.10
2967,-72.26
2968,-72.52
2969,-72.88
2970,-73.34
2971,-73.83
2972,-74.26
2973,-74.56
2974,-74.72
2975,-74.79
2976,-74.74
2977,-74.64
2978,-74.42
2979,-74.15
2980,-73.72
2981,-73.14
2982,-72.31
2983,-71.33
2984,-70.11
2985,-68.82
2986,-67.36
2987,-65.90
2988,-64.37
2989,-62.91
2990,-61.36
2991,-59.84
2992,-58.26
2993,-56.79
2994,-55.35
2995,-54.06
2996,-52.84
2997,-51.85
2998,-51.02
2999,-50.45
3000,-50.01
3001,-49.73
3002,-49.54
3003,-49.49
3004,-49.55
3005,-49.74
3006,-50.01
3007,-50.37
3008,-50.83
3009,-51.37
3010,-51.96
3011,-52.50
3012,-52.93
3013,-53.22
3014,-53.44
3015,-53.53
3016,-53.57
3017,-53.56
3018,-53.60
3019,-53.63
3020,-53.71
3021,-53.76
3022,-53.89
3023,-54.09
3024,-54.48
3025,-55.00
3026,-55.73
3027,-56.61
3028,-57.68
3029,-58.81
3030,-60.00
3031,-61.12
3032,-62.20
3033,-63.20
3034,-64.19
3035,-65.13
3036,-66.08
3037,-66.91
3038,-67.60
3039,-68.02
3040,-68.14
3041,-67.89
3042,-67.29
3043,-66.44
3044,-65.50
3045,-64.65
3046,-63.99
3047,-63.58
3048,-63.38
3049,-63.28
3050,-63.11
3051,-62.77
3052,-62.16
3053,-61.33
3054,-60.30
3055,-59.20
3056,-58.20
3057,-57.54
3058,-57.34
3059,-57.59
3060,-58.12
3061,-58.80
3062,-59.55
3063,-60.27
3064,-60.84
3065,-61.20
3066,-61.39
3067,-61.56
3068,-61.81
3069,-62.10
3070,-62.42
3071,-62.72
3072,-63.03
3073,-63.26
3074,-63.36
3075,-63.30
3076,-63.13
3077,-62.88
3078,-62.58
3079,-62.21
3080,-61.84
3081,-61.54
3082,-61.33
3083,-61.22
3084,-61.18
3085,-61.23
3086,-61.40
3087,-61.71
3088,-62.11
3089,-62.54
3090,-62.92
3091,-63.22
3092,-63.45
3093,-63.57
3094,-63.55
3095,-63.37
3096,-63.06
3097,-62.69
3098,-62.32
3099,-61.97
3100,-61.61
3101,-61.26
3102,-60.89
3103,-60.55
3104,-60.17
3105,-59.70
3106,-59.07
3107,-58.36
3108,-57.62
3109,-56.96
3110,-56.38
3111,-55.92
3112,-55.53
3113,-55.24
3114,-54.99
3115,-54.76
3116,-54.52
3117,-54.29
3118,-54.01
3119,-53.72
3120,-53.41
3121,-53.18
3122,-53.02
3123,-52.90
3124,-52.79
3125,-52.66
3126,-52.57
3127,-52.56
3128,-52.68
3129,-52.91
3130,-53.28
3131,-53.76
3132,-54.37
3133,-55.00
3134,-55.66
3135,-56.30
3136,-57.08
3137,-57.88
3138,-58.72
3139,-59.49
3140,-60.30
3141,-61.04
3142,-61.78
3143,-62.41
3144,-63.10
3145,-63.84
3146,-64.74
3147,-65.67
3148,-66.73
3149,-67.78
3150,-68.89
3151,-69.89
3152,-70.80
3153,-71.50
3154,-72.05
3155,-72.51
3156,-73.03
3157,-73.62
3158,-74.26
3159,-74.87
3160,-75.39
3161,-75.68
3162,-75.68
3163,-75.39
3164,-74.84
3165,-74.12
3166,-73.24
3167,-72.29
3168,-71.31
3169,-70.42
3170,-69.60
3171,-68.89
3172,-68.28
3173,-67.82
3174,-67.44
3175,-67.16
3176,-66.87
3177,-66.66
3178,-66.47
3179,-66.31
3180,-66.02
3181,-65.64
3182,-65.09
3183,-64.50
3184,-63.82
3185,-63.13
3186,-62.36
3187,-61.59
3188,-60.79
3189,-60.03
3190,-59.26
3191,-58.56
3192,-57.87
3193,-57.23
3194,-56.56
3195,-55.92
3196,-55.27
3197,-54.74
3198,-54.34
3199,-54.11
3200,-53.99
3201,-54.02
3202,-54.11
3203,-54.24
3204,-54.29
3205,-54.24
3206,-54.07
3207,-53.83
3208,-53.52
3209,-53.17
3210,-52.78
3211,-52.41
3212,-52.12
3213,-51.94
3214,-51.88
3215,-51.87
3216,-51.92
3217,-51.96
3218,-52.07
3219,-52.24
3220,-52.51
3221,-52.86
3222,-53.34
3223,-53.92
3224,-54.67
3225,-55.56
3226,-56.60
3227,-57.67
3228,-58.73
3229,-59.66
3230,-60.55
3231,-61.38
3232,-62.19
3233,-62.89
3234,-63.51
3235,-64.03
3236,-64.58
3237,-65.09
3238,-65.60
3239,-66.02
3240,-66.41
3241,-66.75
3242,-67.05
3243,-67.30
3244,-67.48
3245,-67.54
3246,-67.41
3247,-67.05
3248,-66.51
3249,-65.91
3250,-65.32
3251,-64.78
3252,-64.30
3253,-63.95
3254,-63.74
3255,-63.71
3256,-63.68
3257,-63.60
3258,-63.25
3259,-62.68
3260,-61.80
3261,-60.68
3262,-59.26
3263,-57.72
3264,-56.13
3265,-54.70
3266,-53.42
3267,-52.38
3268,-51.47
3269,-50.70
3270,-49.96
3271,-49.26
3272,-48.60
3273,-48.06
3274,-47.62
3275,-47.38
3276,-47.42
3277,-47.84
3278,-48.62
3279,-49.64
3280,-50.80
3281,-51.93
3282,-53.05
3283,-54.04
3284,-54.95
3285,-55.72
3286,-56.43
3287,-57.07
3288,-57.69
3289,-58.27
3290,-58.94
3291,-59.63
3292,-60.36
3293,-61.02
3294,-61.61
3295,-62.02
3296,-62.22
3297,-62.14
3298,-61.90
3299,-61.52
3300,-61.09
3301,-60.60
3302,-60.13
3303,-59.77
3304,-59.58
3305,-59.51
3306,-59.50
3307,-59.52
3308,-59.55
3309,-59.60
3310,-59.64
3311,-59.64
3312,-59.65
3313,-59.71
3314,-59.80
3315,-59.91
3316,-60.10
3317,-60.40
3318,-60.81
3319,-61.29
3320,-61.80
3321,-62.28
3322,-62.72
3323,-63.07
3324,-63.31
3325,-63.43
3326,-63.48
3327,-63.47
3328,-63.39
3329,-63.28
3330,-63.19
3331,-63.11
3332,-63.05
3333,-62.98
3334,-63.00
3335,-63.11
3336,-63.29
3337,-63.48
3338,-63.67
3339,-63.89
3340,-64.22
3341,-64.62
3342,-65.15
3343,-65.74
3344,-66.41
3345,-67.05
3346,-67.67
3347,-68.15
3348,-68.51
3349,-68.66
3350,-68.66
3351,-68.52
3352,-68.45
3353,-68.54
3354,-68.87
3355,-69.36
3356,-69.98
3357,-70.63
3358,-71.24
3359,-71.72
3360,-72.07
3361,-72.24
3362,-72.26
3363,-72.19
3364,-72.14
3365,-72.14
3366,-72.17
3367,-72.17
3368,-72.12
3369,-72.01
3370,-71.81
3371,-71.53
3372,-71.09
3373,-70.58
3374,-69.92
3375,-69.23
3376,-68.38
3377,-67.53
3378,-66.55
3379,-65.51
3380,-64.18
3381,-62.67
3382,-60.90
3383,-59.05
3384,-57.10
3385,-55.28
3386,-53.60
3387,-52.24
3388,-51.11
3389,-50.30
3390,-49.73
3391,-49.40
3392,-49.12
3393,-48.90
3394,-48.70
3395,-48.65
3396,-48.74
3397,-49.06
3398,-49.55
3399,-50.22
3400,-50.98
3401,-51.70
3402,-52.28
3403,-52.57
3404,-52.60
3405,-52.34
3406,-51.91
3407,-51.41
3408,-51.01
3409,-50.82
3410,-50.90
3411,-51.19
3412,-51.67
3413,-52.22
3414,-52.79
3415,-53.25
3416,-53.58
3417,-53.75
3418,-53.87
3419,-53.96
3420,-54.11
3421,-54.28
3422,-54.57
3423,-54.96
3424,-55.53
3425,-56.17
3426,-56.95
3427,-57.82
3428,-58.87
3429,-60.00
3430,-61.20
3431,-62.33
3432,-63.34
3433,-64.10
3434,-64.67
3435,-65.01
3436,-65.22
3437,-65.25
3438,-65.23
3439,-65.21
3440,-65.32
3441,-65.54
3442,-65.91
3443,-66.33
3444,-66.78
3445,-67.13
3446,-67.35
3447,-67.40
3448,-67.36
3449,-67.30
3450,-67.24
3451,-67.18
3452,-67.13
3453,-67.14
3454,-67.19
3455,-67.33
3456,-67.45
3457,-67.54
3458,-67.44
3459,-67.10
3460,-66.40
3461,-65.41
3462,-64.09
3463,-62.60
3464,-60.97
3465,-59.43
3466,-58.04
3467,-56.92
3468,-55.96
3469,-55.23
3470,-54.57
3471,-54.01
3472,-53.31
3473,-52.50
3474,-51.51
3475,-50.51
3476,-49.45
3477,-48.39
3478,-47.29
3479,-46.35
3480,-45.62
3481,-45.14
3482,-44.83
3483,-44.74
3484,-44.86
3485,-45.21
3486,-45.69
3487,-46.26
3488,-46.87
3489,-47.45
3490,-47.94
3491,-48.24
3492,-48.42
3493,-48.52
3494,-48.60
3495,-48.71
3496,-48.96
3497,-49.29
3498,-49.74
3499,-50.22
3500,-50.76
3501,-51.21
3502,-51.54
3503,-51.70
3504,-51.89
3505,-52.14
3506,-52.63
3507,-53.34
3508,-54.38
3509,-55.68
3510,-57.20
3511,-58.70
3512,-60.08
3513,-61.14
3514,-61.89
3515,-62.29
3516,-62.46
3517,-62.44
3518,-62.34
3519,-62.21
3520,-62.13
3521,-62.07
3522,-61.97
3523,-61.74
3524,-61.36
3525,-60.88
3526,-60.31
3527,-59.72
3528,-59.11
3529,-58.58
3530,-58.11
3531,-57.77
3532,-57.48
3533,-57.26
3534,-57.01
3535,-56.66
3536,-56.14
3537,-55.48
3538,-54.76
3539,-54.08
3540,-53.55
3541,-53.25
3542,-53.23
3543,-53.47
3544,-53.90
3545,-54.46
3546,-55.06
3547,-55.61
3548,-55.98
3549,-56.15
3550,-56.23
3551,-56.40
3552,-56.76
3553,-57.30
3554,-57.95
3555,-58.62
3556,-59.26
3557,-59.74
3558,-59.93
3559,-59.75
3560,-59.27
3561,-58.59
3562,-57.85
3563,-57.20
3564,-56.69
3565,-56.40
3566,-56.27
3567,-56.23
3568,-56.14
3569,-55.99
3570,-55.65
3571,-55.06
3572,-54.12
3573,-52.93
3574,-51.61
3575,-50.33
3576,-49.19
3577,-48.37
3578,-47.95
3579,-48.02
3580,-48.45
3581,-49.14
3582,-49.93
3583,-50.67
3584,-51.13
3585,-51.22
3586,-50.85
3587,-50.18
3588,-49.33
3589,-48.49
3590,-47.76
3591,-47.22
3592,-46.88
3593,-46.78
3594,-46.84
3595,-46.97
3596,-47.03
3597,-46.99
3598,-46.81
3599,-46.52
3600,-46.03
3601,-45.38
3602,-44.61
3603,-43.82
3604,-43.07
3605,-42.40
3606,-41.92
3607,-41.74
3608,-41.89
3609,-42.30
3610,-42.92
3611,-43.63
3612,-44.47
3613,-45.36
3614,-46.26
3615,-47.09
3616,-47.91
3617,-48.72
3618,-49.62
3619,-50.50
3620,-51.38
3621,-52.15
3622,-52.83
3623,-53.34
3624,-53.77
3625,-54.10
3626,-54.50
3627,-54.95
3628,-55.55
3629,-56.18
3630,-56.92
3631,-57.68
3632,-58.53
3633,-59.29
3634,-59.95
3635,-60.48
3636,-60.98
3637,-61.50
3638,-62.08
3639,-62.68
3640,-63.32
3641,-63.91
3642,-64.40
3643,-64.64
3644,-64.59
3645,-64.22
3646,-63.61
3647,-62.82
3648,-61.96
3649,-61.18
3650,-60.55
3651,-60.15
3652,-59.88
3653,-59.73
3654,-59.57
3655,-59.42
3656,-59.14
3657,-58.74
3658,-58.13
3659,-57.43
3660,-56.63
3661,-55.88
3662,-55.10
3663,-54.42
3664,-53.70
3665,-53.02
3666,-52.19
3667,-51.28
3668,-50.12
3669,-48.83
3670,-47.34
3671,-45.86
3672,-44.41
3673,-43.17
3674,-42.09
3675,-41.29
3676,-40.65
3677,-40.21
3678,-39.78
3679,-39.38
3680,-38.92
3681,-38.53
3682,-38.14
3683,-37.80
3684,-37.41
3685,-37.07
3686,-36.77
3687,-36.54
3688,-36.29
3689,-36.00
3690,-35.65
3691,-35.29
3692,-34.92
3693,-34.56
3694,-34.22
3695,-33.91
3696,-33.69
3697,-33.55
3698,-33.58
3699,-33.81
3700,-34.32
3701,-35.09
3702,-36.11
3703,-37.29
3704,-38.66
3705,-40.08
3706,-41.57
3707,-42.92
3708,-44.17
3709,-45.22
3710,-46.23
3711,-47.08
3712,-47.89
3713,-48.58
3714,-49.33
3715,-50.07
3716,-50.88
3717,-51.64
3718,-52.44
3719,-53.21
3720,-53.92
3721,-54.51
3722,-55.02
3723,-55.44
3724,-55.74
3725,-55.79
3726,-55.57
3727,-55.08
3728,-54.43
3729,-53.63
3730,-52.76
3731,-51.93
3732,-51.26
3733,-50.90
3734,-50.83
3735,-51.10
3736,-51.61
3737,-52.31
3738,-52.89
3739,-53.23
3740,-53.10
3741,-52.54
3742,-51.42
3743,-49.87
3744,-47.93
3745,-45.89
3746,-43.95
3747,-42.34
3748,-41.05
3749,-40.12
3750,-39.44
3751,-38.99
3752,-38.60
3753,-38.19
3754,-37.68
3755,-37.21
3756,-36.87
3757,-36.80
3758,-37.02
3759,-37.57
3760,-38.46
3761,-39.60
3762,-40.83
3763,-41.98
3764,-42.98
3765,-43.73
3766,-44.28
3767,-44.63
3768,-44.92
3769,-45.20
3770,-45.54
3771,-45.95
3772,-46.49
3773,-47.09
3774,-47.67
3775,-48.09
3776,-48.30
3777,-48.29
3778,-48.12
3779,-47.81
3780,-47.41
3781,-46.92
3782,-46.41
3783,-45.94
3784,-45.53
3785,-45.17
3786,-44.81
3787,-44.45
3788,-44.14
3789,-43.88
3790,-43.71
3791,-43.66
3792,-43.76
3793,-44.00
3794,-44.30
3795,-44.67
3796,-45.12
3797,-45.59
3798,-46.01
3799,-46.31
3800,-46.55
3801,-46.78
3802,-47.03
3803,-47.26
3804,-47.51
3805,-47.74
3806,-47.98
3807,-48.22
3808,-48.45
3809,-48.63
3810,-48.73
3811,-48.72
3812,-48.65
3813,-48.51
3814,-48.36
3815,-48.23
3816,-48.22
3817,-48.26
3818,-48.38
3819,-48.55
3820,-48.90
3821,-49.41
3822,-50.10
3823,-50.88
3824,-51.77
3825,-52.70
3826,-53.70
3827,-54.66
3828,-55.56
3829,-56.33
3830,-56.99
3831,-57.51
3832,-57.96
3833,-58.31
3834,-58.60
3835,-58.76
3836,-58.85
3837,-58.85
3838,-58.78
3839,-58.59
3840,-58.27
3841,-57.85
3842,-57.43
3843,-57.07
3844,-56.76
3845,-56.53
3846,-56.38
3847,-56.34
3848,-56.28
3849,-56.21
3850,-55.92
3851,-55.47
3852,-54.73
3853,-53.86
3854,-52.81
3855,-51.76
3856,-50.64
3857,-49.60
3858,-48.52
3859,-47.49
3860,-46.30
3861,-45.02
3862,-43.53
3863,-41.94
3864,-40.15
3865,-38.38
3866,-36.65
3867,-35.17
3868,-33.87
3869,-32.89
3870,-32.16
3871,-31.70
3872,-31.34
3873,-31.07
3874,-30.82
3875,-30.70
3876,-30.72
3877,-30.96
3878,-31.46
3879,-32.18
3880,-33.04
3881,-33.88
3882,-34.67
3883,-35.31
3884,-35.83
3885,-36.17
3886,-36.44
3887,-36.64
3888,-36.95
3889,-37.35
3890,-37.93
3891,-38.51
3892,-39.07
3893,-39.41
3894,-39.59
3895,-39.55
3896,-39.46
3897,-39.38
3898,-39.48
3899,-39.75
3900,-40.28
3901,-40.97
3902,-41.92
3903,-42.98
3904,-44.13
3905,-45.12
3906,-46.02
3907,-46.76
3908,-47.52
3909,-48.27
3910,-49.13
3911,-50.00
3912,-50.99
3913,-52.04
3914,-53.22
3915,-54.34
3916,-55.40
3917,-56.21
3918,-56.84
3919,-57.23
3920,-57.53
3921,-57.67
3922,-57.79
3923,-57.88
3924,-58.15
3925,-58.54
3926,-59.09
3927,-59.68
3928,-60.36
3929,-61.07
3930,-61.78
3931,-62.38
3932,-62.84
3933,-63.14
3934,-63.28
3935,-63.28
3936,-63.16
3937,-62.99
3938,-62.75
3939,-62.47
3940,-62.04
3941,-61.45
3942,-60.66
3943,-59.72
3944,-58.60
3945,-57.42
3946,-56.17
3947,-55.05
3948,-54.06
3949,-53.31
3950,-52.65
3951,-52.16
3952,-51.67
3953,-51.16
3954,-50.41
3955,-49.49
3956,-48.36
3957,-47.16
3958,-45.90
3959,-44.78
3960,-43.85
3961,-43.21
3962,-42.75
3963,-42.47
3964,-42.33
3965,-42.33
3966,-42.40
3967,-42.54
3968,-42.69
3969,-42.88
3970,-43.04
3971,-43.16
3972,-43.25
3973,-43.30
3974,-43.35
3975,-43.40
3976,-43.52
3977,-43.74
3978,-44.15
3979,-44.68
3980,-45.31
3981,-45.90
3982,-46.44
3983,-46.84
3984,-47.16
3985,-47.37
3986,-47.62
3987,-47.95
3988,-48.53
3989,-49.29
3990,-50.26
3991,-51.32
3992,-52.51
3993,-53.71
3994,-54.86
3995,-55.80
3996,-56.56
3997,-57.14
3998,-57.65
3999,-58.00
4000,-58.14
4001,-58.02
4002,-57.69
4003,-57.21
4004,-56.59
4005,-55.86
4006,-55.10
4007,-54.44
4008,-53.97
4009,-53.73
4010,-53.65
4011,-53.67
4012,-53.73
4013,-53.80
4014,-53.76
4015,-53.59
4016,-53.30
4017,-52.99
4018,-52.73
4019,-52.54
4020,-52.47
4021,-52.53
4022,-52.73
4023,-53.04
4024,-53.37
4025,-53.68
4026,-53.94
4027,-54.18
4028,-54.39
4029,-54.57
4030,-54.72
4031,-54.84
4032,-54.94
4033,-54.99
4034,-55.00
4035,-54.95
4036,-54.83
4037,-54.64
4038,-54.37
4039,-54.08
4040,-53.81
4041,-53.57
4042,-53.31
4043,-53.02
4044,-52.73
4045,-52.48
4046,-52.26
4047,-52.03
4048,-51.79
4049,-51.61
4050,-51.52
4051,-51.59
4052,-51.77
4053,-52.02
4054,-52.25
4055,-52.38
4056,-52.34
4057,-52.11
4058,-51.67
4059,-51.06
4060,-50.36
4061,-49.70
4062,-49.16
4063,-48.81
4064,-48.59
4065,-48.43
4066,-48.23
4067,-48.00
4068,-47.69
4069,-47.40
4070,-47.13
4071,-46.97
4072,-46.86
4073,-46.82
4074,-46.75
4075,-46.65
4076,-46.42
4077,-46.07
4078,-45.57
4079,-44.97
4080,-44.29
4081,-43.63
4082,-43.06
4083,-42.64
4084,-42.37
4085,-42.24
4086,-42.30
4087,-42.53
4088,-42.95
4089,-43.49
4090,-44.11
4091,-44.77
4092,-45.46
4093,-46.10
4094,-46.70
4095,-47.23
4096,-47.81
4097,-48.44
4098,-49.17
4099,-49.94
4100,-50.80
4101,-51.56
4102,-52.18
4103,-52.51
4104,-52.70
4105,-52.77
4106,-52.97
4107,-53.30
4108,-53.89
4109,-54.72
4110,-55.82
4111,-56.94
4112,-57.98
4113,-58.75
4114,-59.30
4115,-59.63
4116,-59.88
4117,-60.08
4118,-60.46
4119,-61.04
4120,-61.88
4121,-62.78
4122,-63.60
4123,-64.13
4124,-64.38
4125,-64.36
4126,-64.19
4127,-63.93
4128,-63.73
4129,-63.66
4130,-63.78
4131,-64.03
4132,-64.30
4133,-64.45
4134,-64.32
4135,-63.90
4136,-63.20
4137,-62.37
4138,-61.46
4139,-60.64
4140,-59.87
4141,-59.25
4142,-58.65
4143,-58.08
4144,-57.34
4145,-56.48
4146,-55.40
4147,-54.23
4148,-52.86
4149,-51.45
4150,-50.01
4151,-48.77
4152,-47.68
4153,-46.81
4154,-46.05
4155,-45.49
4156,-45.02
4157,-44.69
4158,-44.32
4159,-43.93
4160,-43.43
4161,-42.91
4162,-42.29
4163,-41.72
4164,-41.18
4165,-40.77
4166,-40.42
4167,-40.20
4168,-40.08
4169,-40.09
4170,-40.12
4171,-40.08
4172,-39.89
4173,-39.53
4174,-38.96
4175,-38.17
4176,-37.25
4177,-36.32
4178,-35.59
4179,-35.15
4180,-35.15
4181,-35.61
4182,-36.61
4183,-38.03
4184,-39.84
4185,-41.81
4186,-43.88
4187,-45.77
4188,-47.46
4189,-48.81
4190,-49.96
4191,-50.87
4192,-51.74
4193,-52.48
4194,-53.26
4195,-54.01
4196,-54.86
4197,-55.66
4198,-56.49
4199,-57.18
4200,-57.83
4201,-58.35
4202,-58.79
4203,-59.09
4204,-59.25
4205,-59.23
4206,-59.08
4207,-58.78
4208,-58.36
4209,-57.82
4210,-57.15
4211,-56.43
4212,-55.76
4213,-55.29
4214,-55.01
4215,-54.97
4216,-55.10
4217,-55.44
4218,-55.79
4219,-56.07
4220,-56.01
4221,-55.56
4222,-54.59
4223,-53.23
4224,-51.48
4225,-49.64
4226,-47.79
4227,-46.19
4228,-44.82
4229,-43.69
4230,-42.71
4231,-41.84
4232,-40.99
4233,-40.14
4234,-39.31
4235,-38.64
4236,-38.33
4237,-38.55
4238,-39.38
4239,-40.76
4240,-42.64
4241,-44.82
4242,-47.05
4243,-48.97
4244,-50.41
4245,-51.28
4246,-51.77
4247,-51.96
4248,-52.09
4249,-52.19
4250,-52.41
4251,-52.69
4252,-53.05
4253,-53.34
4254,-53.57
4255,-53.62
4256,-53.47
4257,-53.15
4258,-52.83
4259,-52.58
4260,-52.43
4261,-52.31
4262,-52.22
4263,-52.09
4264,-51.93
4265,-51.69
4266,-51.39
4267,-51.08
4268,-50.84
4269,-50.78
4270,-50.92
4271,-51.22
4272,-51.61
4273,-51.98
4274,-52.27
4275,-52.44
4276,-52.52
4277,-52.52
4278,-52.48
4279,-52.47
4280,-52.56
4281,-52.80
4282,-53.21
4283,-53.76
4284,-54.34
4285,-54.82
4286,-55.12
4287,-55.12
4288,-54.79
4289,-54.12
4290,-53.22
4291,-52.22
4292,-51.38
4293,-50.88
4294,-50.90
4295,-51.43
4296,-52.46
4297,-53.78
4298,-55.26
4299,-56.71
4300,-58.00
4301,-58.94
4302,-59.51
4303,-59.66
4304,-59.59
4305,-59.37
4306,-59.21
4307,-59.13
4308,-59.27
4309,-59.67
4310,-60.41
4311,-61.36
4312,-62.45
4313,-63.46
4314,-64.37
4315,-65.07
4316,-65.61
4317,-65.96
4318,-66.17
4319,-66.28
4320,-66.38
4321,-66.49
4322,-66.64
4323,-66.83
4324,-67.01
4325,-67.15
4326,-67.13
4327,-66.89
4328,-66.38
4329,-65.68
4330,-64.80
4331,-63.85
4332,-62.81
4333,-61.81
4334,-60.87
4335,-60.12
4336,-59.43
4337,-58.88
4338,-58.32
4339,-57.87
4340,-57.37
4341,-56.82
4342,-55.98
4343,-54.88
4344,-53.36
4345,-51.57
4346,-49.57
4347,-47.58
4348,-45.77
4349,-44.34
4350,-43.35
4351,-42.88
4352,-42.88
4353,-43.26
4354,-43.87
4355,-44.60
4356,-45.36
4357,-46.13
4358,-46.95
4359,-47.84
4360,-48.83
4361,-49.84
4362,-50.87
4363,-51.76
4364,-52.48
4365,-52.95
4366,-53.22
4367,-53.32
4368,-53.35
4369,-53.33
4370,-53.36
4371,-53.41
4372,-53.50
4373,-53.49
4374,-53.38
4375,-53.18
4376,-53.02
4377,-52.94
4378,-53.02
4379,-53.18
4380,-53.50
4381,-53.96
4382,-54.64
4383,-55.40
4384,-56.23
4385,-56.99
4386,-57.78
4387,-58.59
4388,-59.52
4389,-60.52
4390,-61.65
4391,-62.76
4392,-63.90
4393,-64.96
4394,-65.98
4395,-66.80
4396,-67.44
4397,-67.83
4398,-68.12
4399,-68.33
4400,-68.62
4401,-68.95
4402,-69.41
4403,-69.88
4404,-70.36
4405,-70.78
4406,-71.11
4407,-71.28
4408,-71.29
4409,-71.16
4410,-71.02
4411,-70.94
4412,-70.98
4413,-71.17
4414,-71.51
4415,-71.93
4416,-72.33
4417,-72.65
4418,-72.82
4419,-72.82
4420,-72.59
4421,-72.19
4422,-71.66
4423,-71.06
4424,-70.35
4425,-69.59
4426,-68.79
4427,-68.09
4428,-67.40
4429,-66.71
4430,-65.89
4431,-65.02
4432,-64.03
4433,-63.03
4434,-61.93
4435,-60.81
4436,-59.65
4437,-58.59
4438,-57.60
4439,-56.78
4440,-56.09
4441,-55.56
4442,-55.14
4443,-54.85
4444,-54.68
4445,-54.68
4446,-54.85
4447,-55.21
4448,-55.76
4449,-56.42
4450,-57.12
4451,-57.79
4452,-58.40
4453,-58.86
4454,-59.16
4455,-59.26
4456,-59.33
4457,-59.41
4458,-59.64
4459,-59.99
4460,-60.54
4461,-61.18
4462,-61.90
4463,-62.48
4464,-62.96
4465,-63.29
4466,-63.61
4467,-63.94
4468,-64.41
4469,-64.99
4470,-65.77
4471,-66.65
4472,-67.63
4473,-68.51
4474,-69.31
4475,-69.95
4476,-70.55
4477,-71.13
4478,-71.75
4479,-72.40
4480,-73.12
4481,-73.91
4482,-74.69
4483,-75.29
4484,-75.58
4485,-75.47
4486,-74.97
4487,-74.18
4488,-73.17
4489,-72.10
4490,-71.04
4491,-70.14
4492,-69.41
4493,-68.89
4494,-68.53
4495,-68.31
4496,-68.08
4497,-67.79
4498,-67.41
4499,-67.05
4500,-66.80
4501,-66.80
4502,-67.05
4503,-67.55
4504,-68.19
4505,-68.86
4506,-69.43
4507,-69.79
4508,-69.92
4509,-69.79
4510,-69.47
4511,-69.03
4512,-68.61
4513,-68.30
4514,-68.17
4515,-68.18
4516,-68.26
4517,-68.33
4518,-68.31
4519,-68.26
4520,-68.18
4521,-68.12
4522,-68.05
4523,-68.01
4524,-67.99
4525,-67.93
4526,-67.71
4527,-67.30
4528,-66.75
4529,-66.14
4530,-65.48
4531,-64.90
4532,-64.46
4533,-64.27
4534,-64.31
4535,-64.51
4536,-64.79
4537,-65.10
4538,-65.35
4539,-65.54
4540,-65.65
4541,-65.78
4542,-65.89
4543,-65.96
4544,-65.92
4545,-65.75
4546,-65.41
4547,-64.94
4548,-64.32
4549,-63.66
4550,-63.05
4551,-62.63
4552,-62.41
4553,-62.37
4554,-62.39
4555,-62.41
4556,-62.33
4557,-62.15
4558,-61.86
4559,-61.55
4560,-61.33
4561,-61.27
4562,-61.34
4563,-61.48
4564,-61.61
4565,-61.65
4566,-61.63
4567,-61.55
4568,-61.55
4569,-61.65
4570,-61.94
4571,-62.41
4572,-63.10
4573,-63.93
4574,-64.88
4575,-65.83
4576,-66.76
4577,-67.58
4578,-68.35
4579,-69.04
4580,-69.77
4581,-70.47
4582,-71.19
4583,-71.76
4584,-72.25
4585,-72.58
4586,-72.90
4587,-73.16
4588,-73.49
4589,-73.88
4590,-74.50
4591,-75.25
4592,-76.16
4593,-77.05
4594,-77.93
4595,-78.69
4596,-79.38
4597,-79.95
4598,-80.55
4599,-81.26
4600,-82.14
4601,-83.10
4602,-84.05
4603,-84.83
4604,-85.40
4605,-85.62
4606,-85.49
4607,-85.01
4608,-84.27
4609,-83.43
4610,-82.56
4611,-81.73
4612,-80.93
4613,-80.22
4614,-79.57
4615,-78.98
4616,-78.39
4617,-77.88
4618,-77.39
4619,-77.00
4620,-76.57
4621,-76.18
4622,-75.73
4623,-75.29
4624,-74.69
4625,-74.01
4626,-73.12
4627,-72.18
4628,-71.15
4629,-70.16
4630,-69.15
4631,-68.21
4632,-67.28
4633,-66.47
4634,-65.68
4635,-64.93
4636,-64.07
4637,-63.19
4638,-62.31
4639,-61.61
4640,-61.01
4641,-60.56
4642,-60.16
4643,-59.88
4644,-59.68
4645,-59.57
4646,-59.44
4647,-59.29
4648,-59.04
4649,-58.75
4650,-58.35
4651,-57.88
4652,-57.37
4653,-56.88
4654,-56.44
4655,-56.02
4656,-55.64
4657,-55.39
4658,-55.36
4659,-55.53
4660,-55.88
4661,-56.35
4662,-57.01
4663,-57.78
4664,-58.62
4665,-59.45
4666,-60.30
4667,-61.18
4668,-62.16
4669,-63.10
4670,-64.01
4671,-64.83
4672,-65.67
4673,-66.41
4674,-67.12
4675,-67.70
4676,-68.28
4677,-68.79
4678,-69.30
4679,-69.70
4680,-70.08
4681,-70.42
4682,-70.77
4683,-71.06
4684,-71.30
4685,-71.48
4686,-71.63
4687,-71.73
4688,-71.82
4689,-71.88
4690,-71.96
4691,-72.01
4692,-72.01
4693,-71.96
4694,-71.90
4695,-71.89
4696,-71.92
4697,-72.01
4698,-72.09
4699,-72.16
4700,-72.10
4701,-71.89
4702,-71.43
4703,-70.73
4704,-69.68
4705,-68.44
4706,-67.08
4707,-65.77
4708,-64.47
4709,-63.31
4710,-62.22
4711,-61.21
4712,-60.14
4713,-59.03
4714,-57.87
4715,-56.85
4716,-56.02
4717,-55.56
4718,-55.47
4719,-55.85
4720,-56.59
4721,-57.56
4722,-58.58
4723,-59.49
4724,-60.21
4725,-60.69
4726,-60.90
4727,-60.89
4728,-60.78
4729,-60.71
4730,-60.75
4731,-60.94
4732,-61.26
4733,-61.68
4734,-62.15
4735,-62.58
4736,-62.86
4737,-62.93
4738,-62.74
4739,-62.31
4740,-61.69
4741,-60.97
4742,-60.26
4743,-59.65
4744,-59.19
4745,-58.95
4746,-58.97
4747,-59.21
4748,-59.59
4749,-60.03
4750,-60.43
4751,-60.72
4752,-60.88
4753,-60.94
4754,-60.97
4755,-61.02
4756,-61.11
4757,-61.22
4758,-61.42
4759,-61.71
4760,-62.12
4761,-62.60
4762,-63.12
4763,-63.59
4764,-64.01
4765,-64.37
4766,-64.69
4767,-64.92
4768,-65.04
4769,-65.04
4770,-64.97
4771,-64.83
4772,-64.66
4773,-64.48
4774,-64.38
4775,-64.36
4776,-64.40
4777,-64.46
4778,-64.63
4779,-64.84
4780,-65.09
4781,-65.32
4782,-65.65
4783,-66.11
4784,-66.74
4785,-67.46
4786,-68.28
4787,-69.15
4788,-70.15
4789,-71.15
4790,-72.17
4791,-73.04
4792,-73.84
4793,-74.47
4794,-75.05
4795,-75.50
4796,-75.91
4797,-76.26
4798,-76.64
4799,-76.98
4800,-77.28
4801,-77.45
4802,-77.56
4803,-77.61
4804,-77.64
4805,-77.64
4806,-77.62
4807,-77.63
4808,-77.64
4809,-77.66
4810,-77.58
4811,-77.35
4812,-76.89
4813,-76.26
4814,-75.42
4815,-74.47
4816,-73.37
4817,-72.33
4818,-71.33
4819,-70.52
4820,-69.71
4821,-68.93
4822,-67.98
4823,-66.88
4824,-65.39
4825,-63.63
4826,-61.58
4827,-59.55
4828,-57.62
4829,-56.09
4830,-54.97
4831,-54.34
4832,-53.99
4833,-53.86
4834,-53.76
4835,-53.64
4836,-53.39
4837,-53.10
4838,-52.88
4839,-52.86
4840,-53.09
4841,-53.58
4842,-54.34
4843,-55.23
4844,-56.14
4845,-56.92
4846,-57.62
4847,-58.25
4848,-58.88
4849,-59.47
4850,-60.08
4851,-60.66
4852,-61.23
4853,-61.65
4854,-61.89
4855,-61.87
4856,-61.66
4857,-61.33
4858,-61.08
4859,-61.00
4860,-61.18
4861,-61.52
4862,-62.06
4863,-62.69
4864,-63.51
4865,-64.39
4866,-65.33
4867,-66.21
4868,-67.12
4869,-67.99
4870,-68.91
4871,-69.78
4872,-70.72
4873,-71.65
4874,-72.65
4875,-73.58
4876,-74.52
4877,-75.33
4878,-76.08
4879,-76.59
4880,-76.93
4881,-77.02
4882,-77.04
4883,-77.06
4884,-77.26
4885,-77.67
4886,-78.37
4887,-79.27
4888,-80.27
4889,-81.18
4890,-81.88
4891,-82.22
4892,-82.21
4893,-81.91
4894,-81.43
4895,-80.87
4896,-80.31
4897,-79.84
4898,-79.52
4899,-79.35
4900,-79.22
4901,-79.12
4902,-79.02
4903,-78.96
4904,-78.87
4905,-78.79
4906,-78.61
4907,-78.34
4908,-77.80
4909,-76.99
4910,-75.83
4911,-74.46
4912,-72.91
4913,-71.37
4914,-69.85
4915,-68.56
4916,-67.44
4917,-66.57
4918,-65.83
4919,-65.19
4920,-64.52
4921,-63.90
4922,-63.24
4923,-62.65
4924,-62.08
4925,-61.62
4926,-61.26
4927,-61.10
4928,-61.04
4929,-61.11
4930,-61.29
4931,-61.53
4932,-61.74
4933,-61.87
4934,-61.90
4935,-61.83
4936,-61.72
4937,-61.65
4938,-61.72
4939,-62.00
4940,-62.56
4941,-63.27
4942,-64.09
4943,-64.93
4944,-65.77
4945,-66.47
4946,-67.02
4947,-67.36
4948,-67.63
4949,-67.90
4950,-68.31
4951,-68.76
4952,-69.34
4953,-69.92
4954,-70.57
4955,-71.21
4956,-71.88
4957,-72.59
4958,-73.41
4959,-74.36
4960,-75.45
4961,-76.58
4962,-77.70
4963,-78.67
4964,-79.39
4965,-79.69
4966,-79.49
4967,-78.82
4968,-77.83
4969,-76.68
4970,-75.47
4971,-74.34
4972,-73.35
4973,-72.57
4974,-71.98
4975,-71.58
4976,-71.31
4977,-71.19
4978,-71.17
4979,-71.25
4980,-71.36
4981,-71.48
4982,-71.58
4983,-71.71
4984,-71.88
4985,-72.05
4986,-72.20
4987,-72.33
4988,-72.47
4989,-72.65
4990,-72.79
4991,-72.86
4992,-72.87
4993,-72.88
4994,-72.84
4995,-72.66
4996,-72.28
4997,-71.75
4998,-71.14
4999,-70.54
5000,-69.94
5001,-69.40
5002,-68.98
5003,-68.75
5004,-68.64
5005,-68.60
5006,-68.51
5007,-68.28
5008,-67.83
5009,-67.16
5010,-66.38
5011,-65.66
5012,-65.09
5013,-64.85
5014,-64.99
5015,-65.55
5016,-66.41
5017,-67.39
5018,-68.29
5019,-68.96
5020,-69.29
5021,-69.29
5022,-68.99
5023,-68.51
5024,-67.92
5025,-67.32
5026,-66.74
5027,-66.22
5028,-65.72
5029,-65.24
5030,-64.74
5031,-64.27
5032,-63.85
5033,-63.49
5034,-63.15
5035,-62.87
5036,-62.64
5037,-62.52
5038,-62.44
5039,-62.39
5040,-62.39
5041,-62.45
5042,-62.52
5043,-62.58
5044,-62.64
5045,-62.70
5046,-62.77
5047,-62.82
5048,-62.86
5049,-62.90
5050,-63.08
5051,-63.35
5052,-63.77
5053,-64.24
5054,-64.83
5055,-65.54
5056,-66.39
5057,-67.34
5058,-68.41
5059,-69.53
5060,-70.72
5061,-71.78
5062,-72.68
5063,-73.26
5064,-73.59
5065,-73.61
5066,-73.47
5067,-73.18
5068,-73.04
5069,-73.11
5070,-73.64
5071,-74.57
5072,-76.00
5073,-77.72
5074,-79.67
5075,-81.58
5076,-83.39
5077,-84.93
5078,-86.22
5079,-87.21
5080,-88.01
5081,-88.58
5082,-89.04
5083,-89.27
5084,-89.27
5085,-88.96
5086,-88.42
5087,-87.68
5088,-86.84
5089,-85.94
5090,-85.07
5091,-84.35
5092,-83.79
5093,-83.46
5094,-83.25
5095,-83.16
5096,-83.04
5097,-82.88
5098,-82.58
5099,-82.25
5100,-81.80
5101,-81.29
5102,-80.57
5103,-79.70
5104,-78.63
5105,-77.45
5106,-76.10
5107,-74.75
5108,-73.39
5109,-72.21
5110,-71.14
5111,-70.29
5112,-69.50
5113,-68.87
5114,-68.26
5115,-67.76
5116,-67.25
5117,-66.80
5118,-66.28
5119,-65.77
5120,-65.16
5121,-64.52
5122,-63.78
5123,-63.00
5124,-62.23
5125,-61.58
5126,-61.07
5127,-60.71
5128,-60.47
5129,-60.36
5130,-60.39
5131,-60.58
5132,-60.81
5133,-61.07
5134,-61.31
5135,-61.49
5136,-61.55
5137,-61.48
5138,-61.36
5139,-61.28
5140,-61.35
5141,-61.51
5142,-61.81
5143,-62.20
5144,-62.84
5145,-63.65
5146,-64.68
5147,-65.74
5148,-66.87
5149,-67.98
5150,-69.15
5151,-70.27
5152,-71.38
5153,-72.37
5154,-73.34
5155,-74.21
5156,-75.08
5157,-75.89
5158,-76.74
5159,-77.57
5160,-78.41
5161,-79.17
5162,-79.86
5163,-80.39
5164,-80.80
5165,-81.02
5166,-81.10
5167,-81.04
5168,-80.88
5169,-80.64
5170,-80.31
5171,-79.90
5172,-79.39
5173,-78.87
5174,-78.32
5175,-77.85
5176,-77.44
5177,-77.17
5178,-76.91
5179,-76.71
5180,-76.37
5181,-75.87
5182,-75.01
5183,-73.84
5184,-72.28
5185,-70.49
5186,-68.53
5187,-66.69
5188,-65.04
5189,-63.73
5190,-62.71
5191,-62.02
5192,-61.58
5193,-61.35
5194,-61.20
5195,-61.16
5196,-61.23
5197,-61.52
5198,-62.06
5199,-62.84
5200,-63.86
5201,-65.06
5202,-66.37
5203,-67.56
5204,-68.54
5205,-69.25
5206,-69.80
5207,-70.18
5208,-70.49
5209,-70.72
5210,-71.02
5211,-71.36
5212,-71.72
5213,-72.03
5214,-72.28
5215,-72.46
5216,-72.53
5217,-72.46
5218,-72.30
5219,-72.12
5220,-71.95
5221,-71.77
5222,-71.56
5223,-71.33
5224,-71.04
5225,-70.69
5226,-70.22
5227,-69.68
5228,-69.15
5229,-68.72
5230,-68.44
5231,-68.33
5232,-68.37
5233,-68.54
5234,-68.84
5235,-69.21
5236,-69.59
5237,-69.95
5238,-70.27
5239,-70.56
5240,-70.88
5241,-71.24
5242,-71.62
5243,-71.98
5244,-72.30
5245,-72.54
5246,-72.66
5247,-72.59
5248,-72.38
5249,-72.06
5250,-71.75
5251,-71.49
5252,-71.40
5253,-71.57
5254,-72.07
5255,-72.85
5256,-73.82
5257,-74.84
5258,-75.85
5259,-76.68
5260,-77.29
5261,-77.63
5262,-77.83
5263,-77.91
5264,-78.03
5265,-78.20
5266,-78.51
5267,-78.92
5268,-79.43
5269,-79.96
5270,-80.54
5271,-81.12
5272,-81.73
5273,-82.25
5274,-82.74
5275,-83.15
5276,-83.51
5277,-83.74
5278,-83.84
5279,-83.78
5280,-83.62
5281,-83.42
5282,-83.27
5283,-83.21
5284,-83.26
5285,-83.38
5286,-83.52
5287,-83.66
5288,-83.74
5289,-83.69
5290,-83.40
5291,-82.94
5292,-82.33
5293,-81.69
5294,-80.92
5295,-80.12
5296,-79.21
5297,-78.34
5298,-77.38
5299,-76.47
5300,-75.45
5301,-74.41
5302,-73.17
5303,-71.77
5304,-70.07
5305,-68.24
5306,-66.28
5307,-64.43
5308,-62.74
5309,-61.44
5310,-60.55
5311,-60.14
5312,-60.11
5313,-60.39
5314,-60.78
5315,-61.16
5316,-61.36
5317,-61.41
5318,-61.43
5319,-61.60
5320,-62.03
5321,-62.68
5322,-63.51
5323,-64.48
5324,-65.56
5325,-66.57
5326,-67.39
5327,-67.92
5328,-68.27
5329,-68.48
5330,-68.63
5331,-68.68
5332,-68.71
5333,-68.69
5334,-68.70
5335,-68.67
5336,-68.72
5337,-68.81
5338,-69.07
5339,-69.46
5340,-70.08
5341,-70.85
5342,-71.78
5343,-72.72
5344,-73.70
5345,-74.62
5346,-75.60
5347,-76.53
5348,-77.49
5349,-78.37
5350,-79.25
5351,-80.05
5352,-80.89
5353,-81.71
5354,-82.60
5355,-83.47
5356,-84.39
5357,-85.27
5358,-86.18
5359,-86.99
5360,-87.74
5361,-88.32
5362,-88.83
5363,-89.22
5364,-89.56
5365,-89.78
5366,-90.00
5367,-90.15
5368,-90.33
5369,-90.50
5370,-90.71
5371,-90.94
5372,-91.22
5373,-91.51
5374,-91.86
5375,-92.22
5376,-92.53
5377,-92.73
5378,-92.72
5379,-92.49
5380,-92.00
5381,-91.34
5382,-90.58
5383,-89.87
5384,-89.21
5385,-88.70
5386,-88.26
5387,-87.94
5388,-87.52
5389,-87.03
5390,-86.28
5391,-85.34
5392,-84.11
5393,-82.76
5394,-81.28
5395,-79.86
5396,-78.48
5397,-77.30
5398,-76.32
5399,-75.63
5400,-75.07
5401,-74.62
5402,-74.17
5403,-73.83
5404,-73.55
5405,-73.37
5406,-73.28
5407,-73.35
5408,-73.60
5409,-74.02
5410,-74.53
5411,-75.08
5412,-75.63
5413,-76.11
5414,-76.44
5415,-76.55
5416,-76.52
5417,-76.43
5418,-76.46
5419,-76.62
5420,-76.98
5421,-77.44
5422,-78.03
5423,-78.62
5424,-79.19
5425,-79.58
5426,-79.90
5427,-80.17
5428,-80.58
5429,-81.15
5430,-81.99
5431,-83.05
5432,-84.42
5433,-85.96
5434,-87.60
5435,-89.10
5436,-90.38
5437,-91.32
5438,-91.97
5439,-92.31
5440,-92.44
5441,-92.43
5442,-92.36
5443,-92.24
5444,-92.06
5445,-91.76
5446,-91.33
5447,-90.81
5448,-90.15
5449,-89.37
5450,-88.46
5451,-87.50
5452,-86.56
5453,-85.73
5454,-84.98
5455,-84.33
5456,-83.77
5457,-83.37
5458,-83.08
5459,-82.91
5460,-82.79
5461,-82.80
5462,-82.95
5463,-83.26
5464,-83.63
5465,-84.01
5466,-84.33
5467,-84.58
5468,-84.66
5469,-84.55
5470,-84.24
5471,-83.82
5472,-83.31
5473,-82.79
5474,-82.24
5475,-81.70
5476,-81.16
5477,-80.64
5478,-80.08
5479,-79.50
5480,-78.81
5481,-78.10
5482,-77.38
5483,-76.79
5484,-76.33
5485,-76.05
5486,-75.86
5487,-75.76
5488,-75.66
5489,-75.56
5490,-75.37
5491,-75.14
5492,-74.87
5493,-74.63
5494,-74.42
5495,-74.26
5496,-74.06
5497,-73.84
5498,-73.54
5499,-73.19
5500,-72.74
5501,-72.20
5502,-71.59
5503,-71.00
5504,-70.46
5505,-70.05
5506,-69.73
5507,-69.50
5508,-69.31
5509,-69.15
5510,-68.93
5511,-68.70
5512,-68.43
5513,-68.14
5514,-67.79
5515,-67.44
5516,-67.12
5517,-66.87
5518,-66.69
5519,-66.57
5520,-66.54
5521,-66.59
5522,-66.73
5523,-66.91
5524,-67.13
5525,-67.29
5526,-67.41
5527,-67.53
5528,-67.74
5529,-68.02
5530,-68.35
5531,-68.70
5532,-69.21
5533,-69.85
5534,-70.62
5535,-71.39
5536,-72.19
5537,-73.00
5538,-73.92
5539,-74.87
5540,-75.83
5541,-76.64
5542,-77.36
5543,-77.87
5544,-78.29
5545,-78.49
5546,-78.61
5547,-78.63
5548,-78.80
5549,-79.12
5550,-79.71
5551,-80.54
5552,-81.69
5553,-82.98
5554,-84.36
5555,-85.61
5556,-86.77
5557,-87.75
5558,-88.63
5559,-89.40
5560,-90.17
5561,-90.93
5562,-91.69
5563,-92.36
5564,-92.90
5565,-93.12
5566,-92.97
5567,-92.43
5568,-91.63
5569,-90.71
5570,-89.77
5571,-88.94
5572,-88.29
5573,-87.94
5574,-87.81
5575,-87.84
5576,-87.89
5577,-87.91
5578,-87.77
5579,-87.55
5580,-87.23
5581,-86.88
5582,-86.43
5583,-85.92
5584,-85.29
5585,-84.58
5586,-83.71
5587,-82.78
5588,-81.78
5589,-80.84
5590,-79.86
5591,-78.93
5592,-78.01
5593,-77.26
5594,-76.55
5595,-75.94
5596,-75.26
5597,-74.63
5598,-73.94
5599,-73.30
5600,-72.63
5601,-72.01
5602,-71.31
5603,-70.55
5604,-69.63
5605,-68.69
5606,-67.76
5607,-66.98
5608,-66.36
5609,-66.02
5610,-65.96
5611,-66.22
5612,-66.62
5613,-67.01
5614,-67.21
5615,-67.15
5616,-66.81
5617,-66.31
5618,-65.83
5619,-65.51
5620,-65.47
5621,-65.70
5622,-66.25
5623,-66.96
5624,-67.76
5625,-68.53
5626,-69.31
5627,-70.00
5628,-70.65
5629,-71.23
5630,-71.90
5631,-72.65
5632,-73.55
5633,-74.49
5634,-75.54
5635,-76.60
5636,-77.68
5637,-78.62
5638,-79.43
5639,-80.07
5640,-80.67
5641,-81.18
5642,-81.64
5643,-82.00
5644,-82.33
5645,-82.60
5646,-82.86
5647,-83.04
5648,-83.20
5649,-83.31
5650,-83.34
5651,-83.28
5652,-83.20
5653,-83.14
5654,-83.05
5655,-82.97
5656,-82.78
5657,-82.49
5658,-81.98
5659,-81.29
5660,-80.38
5661,-79.31
5662,-78.00
5663,-76.59
5664,-75.11
5665,-73.75
5666,-72.44
5667,-71.33
5668,-70.39
5669,-69.68
5670,-69.09
5671,-68.65
5672,-68.26
5673,-67.90
5674,-67.49
5675,-67.08
5676,-66.75
5677,-66.60
5678,-66.73
5679,-67.21
5680,-68.12
5681,-69.37
5682,-70.86
5683,-72.36
5684,-73.78
5685,-74.97
5686,-75.90
5687,-76.48
5688,-76.80
5689,-76.89
5690,-76.96
5691,-77.06
5692,-77.26
5693,-77.50
5694,-77.77
5695,-78.00
5696,-78.17
5697,-78.24
5698,-78.19
5699,-78.00
5700,-77.68
5701,-77.26
5702,-76.80
5703,-76.32
5704,-75.81
5705,-75.34
5706,-74.94
5707,-74.64
5708,-74.39
5709,-74.23
5710,-74.13
5711,-74.13
5712,-74.17
5713,-74.17
5714,-74.13
5715,-74.01
5716,-73.80
5717,-73.49
5718,-73.16
5719,-72.91
5720,-72.85
5721,-73.01
5722,-73.45
5723,-74.17
5724,-75.20
5725,-76.39
5726,-77.61
5727,-78.70
5728,-79.61
5729,-80.25
5730,-80.60
5731,-80.60
5732,-80.31
5733,-79.87
5734,-79.44
5735,-79.06
5736,-78.81
5737,-78.69
5738,-78.74
5739,-78.90
5740,-79.20
5741,-79.61
5742,-80.18
5743,-80.83
5744,-81.54
5745,-82.19
5746,-82.79
5747,-83.33
5748,-83.81
5749,-84.16
5750,-84.38
5751,-84.43
5752,-84.38
5753,-84.30
5754,-84.30
5755,-84.35
5756,-84.48
5757,-84.66
5758,-84.88
5759,-85.06
5760,-85.17
5761,-85.17
5762,-85.07
5763,-84.95
5764,-84.85
5765,-84.80
5766,-84.72
5767,-84.69
5768,-84.64
5769,-84.54
5770,-84.20
5771,-83.57
5772,-82.60
5773,-81.41
5774,-80.00
5775,-78.58
5776,-77.19
5777,-76.07
5778,-75.22
5779,-74.72
5780,-74.35
5781,-74.10
5782,-73.73
5783,-73.23
5784,-72.40
5785,-71.28
5786,-69.84
5787,-68.30
5788,-66.71
5789,-65.35
5790,-64.24
5791,-63.48
5792,-62.97
5793,-62.70
5794,-62.52
5795,-62.42
5796,-62.30
5797,-62.19
5798,-62.07
5799,-62.07
5800,-62.25
5801,-62.68
5802,-63.30
5803,-64.03
5804,-64.75
5805,-65.35
5806,-65.80
5807,-66.09
5808,-66.28
5809,-66.38
5810,-66.46
5811,-66.57
5812,-66.81
5813,-67.11
5814,-67.37
5815,-67.41
5816,-67.31
5817,-67.11
5818,-66.95
5819,-66.87
5820,-66.96
5821,-67.31
5822,-68.02
5823,-68.97
5824,-70.05
5825,-71.01
5826,-71.81
5827,-72.31
5828,-72.59
5829,-72.63
5830,-72.60
5831,-72.55
5832,-72.72
5833,-73.17
5834,-74.09
5835,-75.39
5836,-77.03
5837,-78.76
5838,-80.53
5839,-82.12
5840,-83.52
5841,-84.59
5842,-85.38
5843,-85.82
5844,-86.03
5845,-86.07
5846,-86.15
5847,-86.24
5848,-86.36
5849,-86.42
5850,-86.49
5851,-86.53
5852,-86.54
5853,-86.49
5854,-86.40
5855,-86.34
5856,-86.27
5857,-86.23
5858,-86.18
5859,-86.14
5860,-85.99
5861,-85.71
5862,-85.24
5863,-84.65
5864,-83.92
5865,-83.17
5866,-82.32
5867,-81.50
5868,-80.66
5869,-79.91
5870,-79.14
5871,-78.39
5872,-77.55
5873,-76.68
5874,-75.71
5875,-74.77
5876,-73.79
5877,-72.92
5878,-72.11
5879,-71.47
5880,-70.91
5881,-70.46
5882,-70.01
5883,-69.55
5884,-68.97
5885,-68.32
5886,-67.60
5887,-66.94
5888,-66.40
5889,-66.09
5890,-66.09
5891,-66.39
5892,-66.96
5893,-67.69
5894,-68.48
5895,-69.20
5896,-69.79
5897,-70.20
5898,-70.47
5899,-70.69
5900,-71.02
5901,-71.48
5902,-72.11
5903,-72.76
5904,-73.43
5905,-73.94
5906,-74.33
5907,-74.49
5908,-74.54
5909,-74.51
5910,-74.55
5911,-74.71
5912,-75.11
5913,-75.77
5914,-76.68
5915,-77.63
5916,-78.49
5917,-79.16
5918,-79.66
5919,-79.99
5920,-80.19
5921,-80.31
5922,-80.48
5923,-80.72
5924,-80.94
5925,-81.02
5926,-80.86
5927,-80.44
5928,-79.73
5929,-78.77
5930,-77.64
5931,-76.49
5932,-75.44
5933,-74.59
5934,-74.02
5935,-73.75
5936,-73.66
5937,-73.67
5938,-73.65
5939,-73.67
5940,-73.75
5941,-73.92
5942,-74.13
5943,-74.39
5944,-74.68
5945,-75.04
5946,-75.41
5947,-75.71
5948,-75.94
5949,-76.04
5950,-76.07
5951,-76.06
5952,-76.10
5953,-76.22
5954,-76.40
5955,-76.58
5956,-76.75
5957,-76.92
5958,-77.15
5959,-77.45
5960,-77.80
5961,-78.16
5962,-78.50
5963,-78.79
5964,-79.05
5965,-79.22
5966,-79.33
5967,-79.38
5968,-79.45
5969,-79.56
5970,-79.73
5971,-79.98
5972,-80.28
5973,-80.58
5974,-80.82
5975,-80.95
5976,-80.96
5977,-80.83
5978,-80.56
5979,-80.19
5980,-79.85
5981,-79.61
5982,-79.44
5983,-79.34
5984,-79.24
5985,-79.19
5986,-79.17
5987,-79.17
5988,-79.14
5989,-79.09
5990,-79.02
5991,-78.96
5992,-78.87
5993,-78.76
5994,-78.63
5995,-78.51
5996,-78.38
5997,-78.27
5998,-78.18
5999,-78.11
6000,-78.06
6001,-78.06
6002,-78.15
6003,-78.26
6004,-78.35
6005,-78.35
6006,-78.32
6007,-78.30
6008,-78.32
6009,-78.38
6010,-78.54
6011,-78.75
6012,-79.07
6013,-79.41
6014,-79.88
6015,-80.44
6016,-81.23
6017,-82.16
6018,-83.35
6019,-84.70
6020,-86.28
6021,-87.94
6022,-89.68
6023,-91.28
6024,-92.72
6025,-93.77
6026,-94.50
6027,-94.87
6028,-95.14
6029,-95.32
6030,-95.66
6031,-96.11
6032,-96.82
6033,-97.70
6034,-98.74
6035,-99.75
6036,-100.71
6037,-101.46
6038,-102.07
6039,-102.53
6040,-102.98
6041,-103.45
6042,-103.97
6043,-104.51
6044,-105.05
6045,-105.48
6046,-105.66
6047,-105.48
6048,-104.93
6049,-104.15
6050,-103.26
6051,-102.42
6052,-101.65
6053,-101.01
6054,-100.49
6055,-100.16
6056,-99.87
6057,-99.60
6058,-99.20
6059,-98.74
6060,-98.16
6061,-97.53
6062,-96.73
6063,-95.79
6064,-94.64
6065,-93.41
6066,-92.06
6067,-90.69
6068,-89.29
6069,-88.07
6070,-87.01
6071,-86.27
6072,-85.63
6073,-85.14
6074,-84.64
6075,-84.19
6076,-83.63
6077,-83.07
6078,-82.42
6079,-81.85
6080,-81.25
6081,-80.76
6082,-80.20
6083,-79.63
6084,-78.90
6085,-78.09
6086,-77.16
6087,-76.15
6088,-74.98
6089,-73.81
6090,-72.68
6091,-71.72
6092,-70.88
6093,-70.18
6094,-69.62
6095,-69.26
6096,-69.05
6097,-68.95
6098,-68.88
6099,-68.82
6100,-68.75
6101,-68.68
6102,-68.68
6103,-68.78
6104,-69.11
6105,-69.68
6106,-70.60
6107,-71.78
6108,-73.23
6109,-74.71
6110,-76.18
6111,-77.48
6112,-78.69
6113,-79.73
6114,-80.71
6115,-81.58
6116,-82.50
6117,-83.42
6118,-84.45
6119,-85.45
6120,-86.47
6121,-87.35
6122,-88.10
6123,-88.61
6124,-89.00
6125,-89.27
6126,-89.55
6127,-89.78
6128,-90.00
6129,-90.17
6130,-90.32
6131,-90.44
6132,-90.52
6133,-90.58
6134,-90.62
6135,-90.63
6136,-90.56
6137,-90.46
6138,-90.28
6139,-90.06
6140,-89.70
6141,-89.24
6142,-88.61
6143,-87.85
6144,-86.86
6145,-85.69
6146,-84.27
6147,-82.79
6148,-81.25
6149,-79.82
6150,-78.53
6151,-77.52
6152,-76.81
6153,-76.40
6154,-76.19
6155,-76.14
6156,-76.25
6157,-76.48
6158,-76.81
6159,-77.22
6160,-77.81
6161,-78.64
6162,-79.73
6163,-80.99
6164,-82.34
6165,-83.59
6166,-84.69
6167,-85.50
6168,-86.12
6169,-86.52
6170,-86.81
6171,-87.03
6172,-87.29
6173,-87.56
6174,-87.94
6175,-88.36
6176,-88.79
6177,-89.15
6178,-89.41
6179,-89.52
6180,-89.52
6181,-89.38
6182,-89.17
6183,-88.93
6184,-88.70
6185,-88.52
6186,-88.39
6187,-88.33
6188,-88.36
6189,-88.47
6190,-88.68
6191,-88.98
6192,-89.36
6193,-89.78
6194,-90.20
6195,-90.56
6196,-90.84
6197,-91.02
6198,-91.10
6199,-91.09
6200,-91.05
6201,-90.97
6202,-90.93
6203,-90.92
6204,-91.01
6205,-91.18
6206,-91.45
6207,-91.75
6208,-92.06
6209,-92.29
6210,-92.43
6211,-92.48
6212,-92.52
6213,-92.57
6214,-92.67
6215,-92.77
6216,-92.95
6217,-93.17
6218,-93.50
6219,-93.85
6220,-94.23
6221,-94.57
6222,-94.96
6223,-95.42
6224,-96.03
6225,-96.74
6226,-97.56
6227,-98.39
6228,-99.21
6229,-99.92
6230,-100.52
6231,-100.91
6232,-101.19
6233,-101.34
6234,-101.53
6235,-101.75
6236,-102.09
6237,-102.49
6238,-103.00
6239,-103.54
6240,-104.06
6241,-104.48
6242,-104.77
6243,-104.93
6244,-105.07
6245,-105.25
6246,-105.50
6247,-105.80
6248,-106.11
6249,-106.36
6250,-106.48
6251,-106.50
6252,-106.35
6253,-106.07
6254,-105.58
6255,-105.00
6256,-104.30
6257,-103.62
6258,-102.83
6259,-101.97
6260,-100.87
6261,-99.65
6262,-98.21
6263,-96.68
6264,-94.94
6265,-93.12
6266,-91.15
6267,-89.25
6268,-87.43
6269,-85.90
6270,-84.62
6271,-83.74
6272,-83.19
6273,-82.99
6274,-82.94
6275,-82.96
6276,-82.92
6277,-82.87
6278,-82.82
6279,-82.88
6280,-83.08
6281,-83.50
6282,-84.17
6283,-85.07
6284,-86.14
6285,-87.23
6286,-88.21
6287,-88.98
6288,-89.55
6289,-89.89
6290,-90.07
6291,-90.04
6292,-89.94
6293,-89.74
6294,-89.55
6295,-89.35
6296,-89.24
6297,-89.22
6298,-89.38
6299,-89.66
6300,-90.11
6301,-90.64
6302,-91.25
6303,-91.83
6304,-92.41
6305,-92.93
6306,-93.50
6307,-94.12
6308,-94.95
6309,-95.95
6310,-97.19
6311,-98.49
6312,-99.82
6313,-101.00
6314,-102.08
6315,-102.94
6316,-103.69
6317,-104.32
6318,-105.00
6319,-105.69
6320,-106.45
6321,-107.15
6322,-107.86
6323,-108.44
6324,-108.91
6325,-109.19
6326,-109.38
6327,-109.47
6328,-109.57
6329,-109.68
6330,-109.88
6331,-110.17
6332,-110.57
6333,-110.99
6334,-111.40
6335,-111.69
6336,-111.86
6337,-111.93
6338,-111.88
6339,-111.70
6340,-111.36
6341,-110.96
6342,-110.52
6343,-110.11
6344,-109.63
6345,-109.13
6346,-108.53
6347,-107.88
6348,-107.09
6349,-106.22
6350,-105.22
6351,-104.23
6352,-103.14
6353,-102.09
6354,-101.04
6355,-100.10
6356,-99.18
6357,-98.38
6358,-97.60
6359,-96.89
6360,-96.18
6361,-95.54
6362,-94.96
6363,-94.50
6364,-94.02
6365,-93.57
6366,-93.09
6367,-92.68
6368,-92.29
6369,-91.93
6370,-91.64
6371,-91.51
6372,-91.61
6373,-91.91
6374,-92.38
6375,-92.93
6376,-93.48
6377,-94.02
6378,-94.54
6379,-95.01
6380,-95.45
6381,-95.86
6382,-96.29
6383,-96.76
6384,-97.30
6385,-97.77
6386,-98.13
6387,-98.30
6388,-98.37
6389,-98.40
6390,-98.52
6391,-98.80
6392,-99.38
6393,-100.21
6394,-101.23
6395,-102.26
6396,-103.19
6397,-103.84
6398,-104.16
6399,-104.16
6400,-103.93
6401,-103.61
6402,-103.32
6403,-103.16
6404,-103.10
6405,-103.12
6406,-103.07
6407,-102.85
6408,-102.33
6409,-101.49
6410,-100.36
6411,-99.11
6412,-97.83
6413,-96.69
6414,-95.71
6415,-95.02
6416,-94.60
6417,-94.44
6418,-94.35
6419,-94.25
6420,-94.06
6421,-93.83
6422,-93.51
6423,-93.09
6424,-92.58
6425,-92.10
6426,-91.77
6427,-91.64
6428,-91.69
6429,-91.95
6430,-92.41
6431,-93.02
6432,-93.58
6433,-94.03
6434,-94.31
6435,-94.42
6436,-94.32
6437,-94.02
6438,-93.60
6439,-93.17
6440,-92.80
6441,-92.50
6442,-92.27
6443,-92.09
6444,-91.97
6445,-91.86
6446,-91.67
6447,-91.45
6448,-91.18
6449,-90.95
6450,-90.72
6451,-90.55
6452,-90.43
6453,-90.45
6454,-90.52
6455,-90.61
6456,-90.54
6457,-90.31
6458,-89.90
6459,-89.42
6460,-88.91
6461,-88.45
6462,-87.98
6463,-87.58
6464,-87.20
6465,-86.86
6466,-86.46
6467,-86.00
6468,-85.43
6469,-84.85
6470,-84.21
6471,-83.63
6472,-83.08
6473,-82.68
6474,-82.36
6475,-82.08
6476,-81.69
6477,-81.17
6478,-80.47
6479,-79.64
6480,-78.64
6481,-77.57
6482,-76.49
6483,-75.59
6484,-74.91
6485,-74.50
6486,-74.34
6487,-74.40
6488,-74.65
6489,-75.00
6490,-75.45
6491,-75.98
6492,-76.64
6493,-77.35
6494,-78.06
6495,-78.71
6496,-79.38
6497,-80.01
6498,-80.69
6499,-81.31
6500,-82.03
6501,-82.90
6502,-84.09
6503,-85.45
6504,-86.91
6505,-88.21
6506,-89.38
6507,-90.26
6508,-90.84
6509,-91.06
6510,-91.06
6511,-90.97
6512,-90.99
6513,-91.15
6514,-91.52
6515,-91.99
6516,-92.54
6517,-93.09
6518,-93.57
6519,-93.93
6520,-94.15
6521,-94.32
6522,-94.55
6523,-94.86
6524,-95.12
6525,-95.27
6526,-95.20
6527,-94.90
6528,-94.33
6529,-93.56
6530,-92.64
6531,-91.75
6532,-90.89
6533,-90.14
6534,-89.40
6535,-88.71
6536,-87.94
6537,-87.14
6538,-86.20
6539,-85.26
6540,-84.27
6541,-83.47
6542,-82.80
6543,-82.43
6544,-82.12
6545,-81.87
6546,-81.42
6547,-80.82
6548,-79.85
6549,-78.62
6550,-77.03
6551,-75.33
6552,-73.52
6553,-71.81
6554,-70.08
6555,-68.51
6556,-67.02
6557,-65.80
6558,-64.67
6559,-63.77
6560,-62.94
6561,-62.32
6562,-61.70
6563,-61.22
6564,-60.71
6565,-60.26
6566,-59.68
6567,-59.05
6568,-58.32
6569,-57.55
6570,-56.66
6571,-55.72
6572,-54.77
6573,-53.92
6574,-53.21
6575,-52.73
6576,-52.57
6577,-52.81
6578,-53.41
6579,-54.27
6580,-55.24
6581,-56.21
6582,-57.08
6583,-57.79
6584,-58.35
6585,-58.82
6586,-59.30
6587,-59.77
6588,-60.20
6589,-60.49
6590,-60.68
6591,-60.65
6592,-60.49
6593,-60.17
6594,-59.84
6595,-59.71
6596,-59.94
6597,-60.53
6598,-61.42
6599,-62.45
6600,-63.52
6601,-64.49
6602,-65.19
6603,-65.49
6604,-65.40
6605,-65.03
6606,-64.51
6607,-63.96
6608,-63.45
6609,-62.98
6610,-62.52
6611,-62.06
6612,-61.53
6613,-60.94
6614,-60.23
6615,-59.47
6616,-58.65
6617,-57.96
6618,-57.32
6619,-56.82
6620,-56.29
6621,-55.79
6622,-55.16
6623,-54.49
6624,-53.59
6625,-52.48
6626,-51.00
6627,-49.30
6628,-47.36
6629,-45.39
6630,-43.40
6631,-41.56
6632,-39.92
6633,-38.69
6634,-37.79
6635,-37.22
6636,-36.80
6637,-36.60
6638,-36.51
6639,-36.58
6640,-36.72
6641,-37.04
6642,-37.55
6643,-38.28
6644,-39.07
6645,-39.82
6646,-40.40
6647,-40.76
6648,-40.82
6649,-40.59
6650,-40.12
6651,-39.57
6652,-39.03
6653,-38.62
6654,-38.35
6655,-38.24
6656,-38.22
6657,-38.25
6658,-38.19
6659,-38.02
6660,-37.67
6661,-37.20
6662,-36.61
6663,-35.96
6664,-35.20
6665,-34.45
6666,-33.68
6667,-32.97
6668,-32.24
6669,-31.54
6670,-30.87
6671,-30.35
6672,-29.91
6673,-29.58
6674,-29.21
6675,-28.88
6676,-28.53
6677,-28.18
6678,-27.74
6679,-27.29
6680,-26.79
6681,-26.33
6682,-25.79
6683,-25.22
6684,-24.55
6685,-23.86
6686,-23.03
6687,-22.16
6688,-21.18
6689,-20.19
6690,-19.10
6691,-18.05
6692,-16.97
6693,-15.98
6694,-14.96
6695,-13.98
6696,-12.91
6697,-11.86
6698,-10.75
6699,-9.68
6700,-8.64
6701,-7.83
6702,-7.23
6703,-6.95
6704,-6.86
6705,-6.96
6706,-7.10
6707,-7.25
6708,-7.20
6709,-6.98
6710,-6.58
6711,-6.16
6712,-5.77
6713,-5.48
6714,-5.26
6715,-5.15
6716,-5.10
6717,-5.07
6718,-4.89
6719,-4.54
6720,-4.01
6721,-3.49
6722,-2.99
6723,-2.66
6724,-2.38
6725,-2.24
6726,-2.08
6727,-1.88
6728,-1.40
6729,-0.66
6730,0.45
6731,1.73
6732,3.23
6733,4.75
6734,6.39
6735,7.88
6736,9.39
6737,10.77
6738,12.30
6739,13.79
6740,15.44
6741,17.05
6742,18.90
6743,20.81
6744,23.00
6745,25.22
6746,27.65
6747,30.10
6748,32.78
6749,35.37
6750,37.91
6751,40.03
6752,41.81
6753,43.07
6754,44.02
6755,44.57
6756,44.93
6757,45.01
6758,44.98
6759,44.83
6760,44.70
6761,44.50
6762,44.27
6763,43.95
6764,43.66
6765,43.40
6766,43.25
6767,43.18
6768,43.24
6769,43.40
6770,43.72
6771,44.20
6772,44.85
6773,45.56
6774,46.29
6775,47.00
6776,47.76
6777,48.47
6778,49.05
6779,49.42
6780,49.61
6781,49.65
6782,49.58
6783,49.40
6784,49.17
6785,48.92
6786,48.68
6787,48.45
6788,48.20
6789,47.90
6790,47.52
6791,47.04
6792,46.49
6793,45.95
6794,45.46
6795,45.04
6796,44.67
6797,44.37
6798,44.20
6799,44.19
6800,44.36
6801,44.66
6802,45.07
6803,45.56
6804,46.07
6805,46.55
6806,46.95
6807,47.25
6808,47.45
6809,47.56
6810,47.62
6811,47.59
6812,47.62
6813,47.71
6814,48.00
6815,48.39
6816,48.96
6817,49.59
6818,50.39
6819,51.25
6820,52.26
6821,53.25
6822,54.31
6823,55.29
6824,56.30
6825,57.21
6826,58.20
6827,59.17
6828,60.35
6829,61.60
6830,63.16
6831,64.92
6832,67.02
6833,69.21
6834,71.44
6835,73.44
6836,75.32
6837,76.89
6838,78.27
6839,79.31
6840,80.18
6841,80.85
6842,81.54
6843,82.15
6844,82.85
6845,83.47
6846,84.14
6847,84.71
6848,85.25
6849,85.66
6850,85.96
6851,86.12
6852,86.23
6853,86.33
6854,86.54
6855,86.83
6856,87.18
6857,87.55
6858,87.92
6859,88.21
6860,88.37
6861,88.31
6862,88.06
6863,87.68
6864,87.29
6865,86.98
6866,86.87
6867,86.99
6868,87.31
6869,87.74
6870,88.16
6871,88.48
6872,88.58
6873,88.40
6874,87.91
6875,87.24
6876,86.58
6877,86.08
6878,85.82
6879,85.76
6880,85.90
6881,86.13
6882,86.43
6883,86.65
6884,86.83
6885,86.93
6886,87.07
6887,87.34
6888,87.91
6889,88.80
6890,90.04
6891,91.48
6892,93.01
6893,94.44
6894,95.73
6895,96.74
6896,97.47
6897,97.87
6898,98.05
6899,98.02
6900,97.89
6901,97.64
6902,97.35
6903,96.98
6904,96.54
6905,96.05
6906,95.63
6907,95.31
6908,95.14
6909,95.07
6910,95.16
6911,95.40
6912,95.77
6913,96.19
6914,96.60
6915,96.96
6916,97.28
6917,97.57
6918,97.86
6919,98.15
6920,98.50
6921,98.91
6922,99.40
6923,99.93
6924,100.52
6925,101.11
6926,101.71
6927,102.23
6928,102.73
6929,103.13
6930,103.49
6931,103.71
6932,103.85
6933,103.89
6934,103.94
6935,103.97
6936,104.09
6937,104.25
6938,104.55
6939,105.02
6940,105.72
6941,106.54
6942,107.44
6943,108.27
6944,109.08
6945,109.71
6946,110.18
6947,110.46
6948,110.74
6949,111.06
6950,111.53
6951,112.12
6952,112.91
6953,113.85
6954,114.94
6955,115.96
6956,116.81
6957,117.40
6958,117.77
6959,117.94
6960,117.97
6961,117.90
6962,117.81
6963,117.74
6964,117.74
6965,117.73
6966,117.72
6967,117.67
6968,117.54
6969,117.30
6970,116.94
6971,116.52
6972,116.11
6973,115.82
6974,115.59
6975,115.45
6976,115.26
6977,115.05
6978,114.64
6979,114.01
6980,113.04
6981,111.79
6982,110.27
6983,108.66
6984,107.06
6985,105.75
6986,104.78
6987,104.27
6988,104.09
6989,104.19
6990,104.35
6991,104.50
6992,104.45
6993,104.17
6994,103.58
6995,102.80
6996,101.93
6997,101.21
6998,100.73
6999,100.50
7000,100.41
7001,100.37
7002,100.29
7003,100.11
7004,99.80
7005,99.37
7006,98.92
7007,98.60
7008,98.58
7009,98.92
7010,99.67
7011,100.71
7012,101.90
7013,103.03
7014,104.00
7015,104.71
7016,105.21
7017,105.48
7018,105.63
7019,105.67
7020,105.76
7021,105.92
7022,106.21
7023,106.49
7024,106.80
7025,107.07
7026,107.44
7027,107.90
7028,108.51
7029,109.21
7030,110.06
7031,111.00
7032,112.08
7033,113.14
7034,114.18
7035,115.06
7036,115.83
7037,116.41
7038,116.87
7039,117.14
7040,117.32
7041,117.42
7042,117.59
7043,117.81
7044,118.12
7045,118.48
7046,118.91
7047,119.38
7048,119.85
7049,120.28
7050,120.66
7051,120.95
7052,121.13
7053,121.19
7054,121.18
7055,121.12
7056,120.99
7057,120.83
7058,120.60
7059,120.36
7060,120.09
7061,119.80
7062,119.46
7063,119.13
7064,118.71
7065,118.26
7066,117.65
7067,116.95
7068,116.12
7069,115.23
7070,114.25
7071,113.31
7072,112.41
7073,111.65
7074,110.94
7075,110.37
7076,109.86
7077,109.48
7078,109.03
7079,108.53
7080,107.84
7081,107.07
7082,106.21
7083,105.32
7084,104.39
7085,103.49
7086,102.68
7087,102.09
7088,101.74
7089,101.68
7090,101.89
7091,102.33
7092,102.89
7093,103.50
7094,104.03
7095,104.39
7096,104.57
7097,104.48
7098,104.19
7099,103.75
7100,103.39
7101,103.16
7102,103.24
7103,103.58
7104,104.32
7105,105.38
7106,106.77
7107,108.31
7108,110.02
7109,111.75
7110,113.45
7111,114.94
7112,116.17
7113,117.07
7114,117.67
7115,117.95
7116,117.94
7117,117.71
7118,117.31
7119,116.77
7120,116.01
7121,115.01
7122,113.78
7123,112.39
7124,110.87
7125,109.33
7126,107.81
7127,106.49
7128,105.42
7129,104.78
7130,104.56
7131,104.77
7132,105.19
7133,105.71
7134,106.12
7135,106.45
7136,106.57
7137,106.46
7138,106.06
7139,105.47
7140,104.75
7141,103.97
7142,103.10
7143,102.21
7144,101.37
7145,100.65
7146,100.03
7147,99.56
7148,99.27
7149,99.22
7150,99.32
7151,99.52
7152,99.73
7153,99.98
7154,100.23
7155,100.48
7156,100.66
7157,100.74
7158,100.62
7159,100.32
7160,99.88
7161,99.40
7162,98.92
7163,98.50
7164,98.16
7165,97.93
7166,97.78
7167,97.66
7168,97.52
7169,97.35
7170,97.15
7171,96.91
7172,96.61
7173,96.31
7174,96.08
7175,96.02
7176,96.12
7177,96.31
7178,96.50
7179,96.64
7180,96.63
7181,96.40
7182,95.88
7183,95.09
7184,94.15
7185,93.24
7186,92.51
7187,92.10
7188,92.00
7189,92.58
7190,93.00
7191,93.19
7192,93.21
7193,93.86
7194,95.06
7195,94.74
7196,90.73
7197,86.93
7198,89.62
7199,98.31
7200,85.55
