1,37.39
2,50.00
3,50.00
4,49.45
5,47.56
6,49.86
7,50.00
8,50.00
9,49.61
10,49.87
11,50.00
12,50.00
13,50.00
14,50.00
15,50.00
16,50.00
17,50.00
18,50.00
19,50.00
20,49.99
21,50.00
22,50.00
23,50.00
24,49.87
25,50.00
26,50.00
27,49.65
28,47.08
29,42.94
30,38.26
31,34.09
32,30.13
33,26.06
34,21.92
35,18.39
36,15.68
37,13.67
38,11.99
39,10.90
40,10.64
41,11.70
42,13.79
43,16.81
44,20.16
45,23.88
46,27.31
47,30.17
48,31.52
49,31.18
50,28.75
51,24.58
52,18.69
53,11.70
54,3.98
55,-3.64
56,-10.89
57,-17.29
58,-22.88
59,-27.21
60,-30.35
61,-32.00
62,-32.71
63,-32.52
64,-31.98
65,-30.98
66,-29.92
67,-28.76
68,-27.83
69,-27.05
70,-26.49
71,-26.04
72,-25.74
73,-25.57
74,-25.42
75,-25.21
76,-24.93
77,-24.77
78,-24.85
79,-25.16
80,-25.40
81,-25.37
82,-25.07
83,-24.74
84,-24.64
85,-24.87
86,-25.29
87,-25.65
88,-25.79
89,-25.72
90,-25.64
91,-25.71
92,-25.94
93,-26.12
94,-26.09
95,-25.86
96,-25.66
97,-25.71
98,-26.04
99,-26.41
100,-26.62
101,-26.64
102,-26.60
103,-26.53
104,-26.36
105,-26.11
106,-25.94
107,-26.06
108,-26.43
109,-26.81
110,-26.98
111,-26.94
112,-26.90
113,-27.01
114,-27.18
115,-27.19
116,-26.90
117,-26.53
118,-26.35
119,-26.50
120,-26.79
121,-26.96
122,-26.90
123,-26.71
124,-26.57
125,-26.52
126,-26.48
127,-26.37
128,-26.20
129,-26.09
130,-26.12
131,-26.22
132,-26.26
133,-26.14
134,-25.89
135,-25.64
136,-25.48
137,-25.43
138,-25.43
139,-25.43
140,-25.45
141,-25.55
142,-25.71
143,-25.83
144,-25.76
145,-25.48
146,-25.14
147,-24.93
148,-24.94
149,-25.09
150,-25.24
151,-25.29
152,-25.22
153,-25.04
154,-24.79
155,-24.51
156,-24.29
157,-24.25
158,-24.39
159,-24.57
160,-24.64
161,-24.65
162,-24.73
163,-24.97
164,-25.23
165,-25.27
166,-24.99
167,-24.61
168,-24.34
169,-24.21
170,-24.07
171,-23.84
172,-23.68
173,-23.74
174,-23.96
175,-24.11
176,-24.02
177,-23.81
178,-23.70
179,-23.83
180,-24.05
181,-24.06
182,-23.73
183,-23.28
184,-22.99
185,-22.96
186,-22.99
187,-22.87
188,-22.60
189,-22.39
190,-22.35
191,-22.41
192,-22.38
193,-22.23
194,-22.10
195,-22.16
196,-22.36
197,-22.50
198,-22.45
199,-22.29
200,-22.21
201,-22.26
202,-22.33
203,-22.27
204,-22.05
205,-21.80
206,-21.65
207,-21.66
208,-21.77
209,-21.89
210,-21.89
211,-21.73
212,-21.44
213,-21.15
214,-20.98
215,-21.04
216,-21.30
217,-21.57
218,-21.64
219,-21.42
220,-21.07
221,-20.86
222,-20.92
223,-21.11
224,-21.19
225,-21.04
226,-20.75
227,-20.50
228,-20.38
229,-20.36
230,-20.34
231,-20.34
232,-20.40
233,-20.49
234,-20.54
235,-20.51
236,-20.41
237,-20.24
238,-19.99
239,-19.73
240,-19.56
241,-19.56
242,-19.60
243,-19.56
244,-19.41
245,-19.33
246,-19.45
247,-19.72
248,-19.89
249,-19.79
250,-19.48
251,-19.27
252,-19.29
253,-19.41
254,-19.33
255,-18.97
256,-18.57
257,-18.40
258,-18.51
259,-18.67
260,-18.64
261,-18.41
262,-18.13
263,-17.97
264,-17.90
265,-17.89
266,-17.92
267,-18.00
268,-18.08
269,-18.07
270,-17.92
271,-17.70
272,-17.56
273,-17.52
274,-17.52
275,-17.46
276,-17.34
277,-17.22
278,-17.14
279,-17.10
280,-17.08
281,-17.15
282,-17.32
283,-17.54
284,-17.64
285,-17.60
286,-17.50
287,-17.45
288,-17.41
289,-17.31
290,-17.15
291,-17.06
292,-17.09
293,-17.10
294,-16.93
295,-16.67
296,-16.58
297,-16.78
298,-17.07
299,-17.11
300,-16.86
301,-16.60
302,-16.65
303,-16.96
304,-17.17
305,-17.01
306,-16.63
307,-16.44
308,-16.67
309,-17.15
310,-17.47
311,-17.41
312,-17.09
313,-16.81
314,-16.75
315,-16.88
316,-17.06
317,-17.23
318,-17.36
319,-17.40
320,-17.29
321,-17.07
322,-16.87
323,-16.86
324,-17.05
325,-17.29
326,-17.36
327,-17.20
328,-16.89
329,-16.67
330,-16.67
331,-16.82
332,-16.87
333,-16.68
334,-16.31
335,-16.06
336,-16.06
337,-16.23
338,-16.30
339,-16.18
340,-16.03
341,-16.07
342,-16.29
343,-16.43
344,-16.29
345,-15.99
346,-15.79
347,-15.79
348,-15.86
349,-15.84
350,-15.74
351,-15.67
352,-15.59
353,-15.43
354,-15.17
355,-14.99
356,-15.05
357,-15.26
358,-15.42
359,-15.43
360,-15.39
361,-15.48
362,-15.62
363,-15.63
364,-15.36
365,-15.01
366,-14.85
367,-15.01
368,-15.34
369,-15.57
370,-15.57
371,-15.36
372,-15.06
373,-14.80
374,-14.66
375,-14.66
376,-14.76
377,-14.95
378,-15.13
379,-15.19
380,-15.08
381,-14.94
382,-14.97
383,-15.23
384,-15.52
385,-15.65
386,-15.60
387,-15.45
388,-15.30
389,-15.19
390,-15.10
391,-15.06
392,-15.16
393,-15.42
394,-15.67
395,-15.64
396,-15.24
397,-14.74
398,-14.56
399,-14.82
400,-15.21
401,-15.30
402,-15.01
403,-14.60
404,-14.35
405,-14.33
406,-14.35
407,-14.27
408,-14.08
409,-13.93
410,-13.92
411,-14.02
412,-14.17
413,-14.30
414,-14.42
415,-14.50
416,-14.47
417,-14.31
418,-14.04
419,-13.83
420,-13.81
421,-14.01
422,-14.29
423,-14.45
424,-14.37
425,-14.12
426,-13.88
427,-13.72
428,-13.63
429,-13.58
430,-13.61
431,-13.78
432,-13.98
433,-14.04
434,-13.92
435,-13.81
436,-13.95
437,-14.33
438,-14.65
439,-14.61
440,-14.20
441,-13.70
442,-13.36
443,-13.17
444,-12.98
445,-12.76
446,-12.64
447,-12.75
448,-12.95
449,-13.00
450,-12.81
451,-12.64
452,-12.77
453,-13.20
454,-13.58
455,-13.58
456,-13.30
457,-13.10
458,-13.19
459,-13.36
460,-13.24
461,-12.78
462,-12.35
463,-12.33
464,-12.66
465,-12.95
466,-12.88
467,-12.48
468,-12.06
469,-11.97
470,-12.28
471,-12.78
472,-13.10
473,-13.02
474,-12.64
475,-12.36
476,-12.45
477,-12.71
478,-12.69
479,-12.15
480,-11.41
481,-11.11
482,-11.48
483,-12.14
484,-12.48
485,-12.29
486,-11.90
487,-11.76
488,-11.94
489,-12.15
490,-12.17
491,-12.02
492,-11.82
493,-11.65
494,-11.52
495,-11.50
496,-11.66
497,-11.91
498,-12.02
499,-11.86
500,-11.55
501,-11.33
502,-11.32
503,-11.41
504,-11.42
505,-11.27
506,-11.02
507,-10.81
508,-10.70
509,-10.65
510,-10.59
511,-10.52
512,-10.46
513,-10.39
514,-10.31
515,-10.31
516,-10.47
517,-10.75
518,-10.95
519,-10.87
520,-10.54
521,-10.16
522,-9.96
523,-10.01
524,-10.19
525,-10.29
526,-10.15
527,-9.84
528,-9.60
529,-9.66
530,-10.00
531,-10.34
532,-10.38
533,-10.14
534,-9.88
535,-9.84
536,-9.94
537,-9.98
538,-9.86
539,-9.72
540,-9.69
541,-9.79
542,-9.93
543,-10.07
544,-10.22
545,-10.33
546,-10.29
547,-10.07
548,-9.80
549,-9.64
550,-9.58
551,-9.51
552,-9.41
553,-9.36
554,-9.43
555,-9.57
556,-9.61
557,-9.51
558,-9.33
559,-9.17
560,-9.02
561,-8.87
562,-8.77
563,-8.80
564,-8.90
565,-8.91
566,-8.70
567,-8.38
568,-8.16
569,-8.15
570,-8.22
571,-8.22
572,-8.09
573,-7.98
574,-8.01
575,-8.13
576,-8.16
577,-8.05
578,-7.88
579,-7.82
580,-7.82
581,-7.74
582,-7.50
583,-7.24
584,-7.14
585,-7.20
586,-7.16
587,-6.86
588,-6.41
589,-6.12
590,-6.16
591,-6.45
592,-6.77
593,-7.01
594,-7.18
595,-7.30
596,-7.29
597,-7.10
598,-6.83
599,-6.65
600,-6.64
601,-6.67
602,-6.55
603,-6.27
604,-6.03
605,-6.02
606,-6.22
607,-6.45
608,-6.49
609,-6.33
610,-6.13
611,-6.08
612,-6.19
613,-6.28
614,-6.12
615,-5.71
616,-5.26
617,-5.00
618,-5.00
619,-5.15
620,-5.30
621,-5.36
622,-5.33
623,-5.22
624,-5.04
625,-4.82
626,-4.61
627,-4.51
628,-4.61
629,-4.90
630,-5.18
631,-5.21
632,-4.93
633,-4.56
634,-4.39
635,-4.47
636,-4.52
637,-4.33
638,-3.98
639,-3.81
640,-4.00
641,-4.38
642,-4.58
643,-4.45
644,-4.16
645,-3.99
646,-4.01
647,-4.09
648,-4.10
649,-4.13
650,-4.30
651,-4.57
652,-4.75
653,-4.75
654,-4.66
655,-4.68
656,-4.75
657,-4.70
658,-4.42
659,-4.09
660,-3.98
661,-4.17
662,-4.42
663,-4.44
664,-4.16
665,-3.85
666,-3.77
667,-3.94
668,-4.17
669,-4.24
670,-4.10
671,-3.85
672,-3.65
673,-3.59
674,-3.66
675,-3.72
676,-3.69
677,-3.63
678,-3.67
679,-3.79
680,-3.79
681,-3.53
682,-3.13
683,-2.88
684,-2.96
685,-3.25
686,-3.49
687,-3.51
688,-3.35
689,-3.19
690,-3.17
691,-3.36
692,-3.65
693,-3.79
694,-3.61
695,-3.21
696,-2.90
697,-2.95
698,-3.21
699,-3.28
700,-2.98
701,-2.57
702,-2.49
703,-2.79
704,-3.10
705,-3.05
706,-2.73
707,-2.50
708,-2.50
709,-2.59
710,-2.57
711,-2.51
712,-2.60
713,-2.83
714,-2.89
715,-2.60
716,-2.17
717,-2.00
718,-2.19
719,-2.46
720,-2.42
721,-2.08
722,-1.81
723,-1.98
724,-2.50
725,-2.92
726,-2.85
727,-2.38
728,-1.89
729,-1.71
730,-1.77
731,-1.81
732,-1.69
733,-1.55
734,-1.60
735,-1.82
736,-2.02
737,-2.06
738,-2.01
739,-2.05
740,-2.21
741,-2.29
742,-2.14
743,-1.89
744,-1.80
745,-1.96
746,-2.20
747,-2.33
748,-2.36
749,-2.44
750,-2.61
751,-2.68
752,-2.55
753,-2.38
754,-2.41
755,-2.64
756,-2.77
757,-2.49
758,-1.94
759,-1.55
760,-1.61
761,-1.96
762,-2.19
763,-2.07
764,-1.72
765,-1.46
766,-1.43
767,-1.56
768,-1.72
769,-1.85
770,-1.94
771,-1.99
772,-1.99
773,-1.95
774,-1.92
775,-1.90
776,-1.81
777,-1.61
778,-1.32
779,-1.10
780,-1.07
781,-1.23
782,-1.42
783,-1.54
784,-1.57
785,-1.56
786,-1.50
787,-1.39
788,-1.29
789,-1.28
790,-1.42
791,-1.59
792,-1.68
793,-1.67
794,-1.68
795,-1.82
796,-2.04
797,-2.16
798,-2.07
799,-1.85
800,-1.65
801,-1.54
802,-1.52
803,-1.52
804,-1.53
805,-1.52
806,-1.52
807,-1.57
808,-1.71
809,-1.88
810,-1.96
811,-1.88
812,-1.75
813,-1.75
814,-1.90
815,-2.07
816,-2.09
817,-1.91
818,-1.60
819,-1.30
820,-1.19
821,-1.36
822,-1.76
823,-2.15
824,-2.22
825,-1.85
826,-1.32
827,-1.00
828,-1.11
829,-1.48
830,-1.81
831,-1.91
832,-1.84
833,-1.74
834,-1.71
835,-1.71
836,-1.69
837,-1.66
838,-1.65
839,-1.73
840,-1.88
841,-2.03
842,-2.06
843,-1.95
844,-1.78
845,-1.72
846,-1.82
847,-1.99
848,-2.08
849,-2.05
850,-2.01
851,-2.08
852,-2.23
853,-2.34
854,-2.34
855,-2.29
856,-2.25
857,-2.21
858,-2.11
859,-1.99
860,-1.99
861,-2.20
862,-2.51
863,-2.71
864,-2.74
865,-2.69
866,-2.76
867,-2.90
868,-2.95
869,-2.80
870,-2.52
871,-2.31
872,-2.22
873,-2.17
874,-2.13
875,-2.20
876,-2.46
877,-2.79
878,-2.95
879,-2.80
880,-2.55
881,-2.50
882,-2.76
883,-3.17
884,-3.41
885,-3.35
886,-3.13
887,-3.00
888,-3.07
889,-3.25
890,-3.35
891,-3.38
892,-3.45
893,-3.62
894,-3.75
895,-3.69
896,-3.44
897,-3.18
898,-3.05
899,-3.10
900,-3.19
901,-3.24
902,-3.25
903,-3.31
904,-3.45
905,-3.56
906,-3.60
907,-3.59
908,-3.61
909,-3.57
910,-3.33
911,-2.90
912,-2.50
913,-2.38
914,-2.58
915,-2.89
916,-3.05
917,-3.00
918,-2.80
919,-2.61
920,-2.52
921,-2.58
922,-2.73
923,-2.91
924,-3.00
925,-2.93
926,-2.73
927,-2.51
928,-2.39
929,-2.42
930,-2.50
931,-2.52
932,-2.46
933,-2.38
934,-2.38
935,-2.41
936,-2.41
937,-2.36
938,-2.33
939,-2.37
940,-2.42
941,-2.45
942,-2.46
943,-2.51
944,-2.59
945,-2.64
946,-2.61
947,-2.56
948,-2.57
949,-2.66
950,-2.74
951,-2.67
952,-2.47
953,-2.35
954,-2.41
955,-2.52
956,-2.46
957,-2.22
958,-2.03
959,-2.12
960,-2.33
961,-2.35
962,-2.08
963,-1.80
964,-1.84
965,-2.22
966,-2.57
967,-2.61
968,-2.39
969,-2.17
970,-2.08
971,-2.03
972,-1.89
973,-1.71
974,-1.71
975,-1.98
976,-2.43
977,-2.84
978,-3.02
979,-2.94
980,-2.66
981,-2.36
982,-2.19
983,-2.21
984,-2.29
985,-2.24
986,-2.04
987,-1.86
988,-1.92
989,-2.15
990,-2.24
991,-1.96
992,-1.47
993,-1.20
994,-1.34
995,-1.68
996,-1.82
997,-1.64
998,-1.32
999,-1.16
1000,-1.16
1001,-1.12
1002,-0.89
1003,-0.59
1004,-0.43
1005,-0.47
1006,-0.57
1007,-0.58
1008,-0.52
1009,-0.55
1010,-0.76
1011,-1.02
1012,-1.11
1013,-1.02
1014,-0.94
1015,-1.06
1016,-1.34
1017,-1.48
1018,-1.32
1019,-0.97
1020,-0.74
1021,-0.76
1022,-0.93
1023,-0.99
1024,-0.86
1025,-0.66
1026,-0.58
1027,-0.67
1028,-0.89
1029,-1.12
1030,-1.28
1031,-1.31
1032,-1.18
1033,-1.00
1034,-0.85
1035,-0.79
1036,-0.79
1037,-0.86
1038,-1.00
1039,-1.15
1040,-1.13
1041,-0.79
1042,-0.23
1043,0.24
1044,0.36
1045,0.13
1046,-0.13
1047,-0.15
1048,0.02
1049,0.10
1050,-0.03
1051,-0.17
1052,0.00
1053,0.41
1054,0.70
1055,0.54
1056,0.04
1057,-0.41
1058,-0.52
1059,-0.34
1060,-0.13
1061,-0.06
1062,-0.08
1063,-0.06
1064,0.07
1065,0.17
1066,0.18
1067,0.15
1068,0.21
1069,0.39
1070,0.56
1071,0.62
1072,0.63
1073,0.69
1074,0.80
1075,0.87
1076,0.81
1077,0.64
1078,0.50
1079,0.56
1080,0.79
1081,1.03
1082,1.07
1083,0.92
1084,0.76
1085,0.81
1086,1.07
1087,1.30
1088,1.28
1089,1.03
1090,0.75
1091,0.59
1092,0.54
1093,0.48
1094,0.41
1095,0.43
1096,0.62
1097,0.93
1098,1.18
1099,1.22
1100,1.03
1101,0.78
1102,0.65
1103,0.71
1104,0.90
1105,1.14
1106,1.40
1107,1.73
1108,2.08
1109,2.33
1110,2.33
1111,2.11
1112,1.83
1113,1.66
1114,1.66
1115,1.72
1116,1.66
1117,1.38
1118,0.97
1119,0.69
1120,0.75
1121,1.11
1122,1.44
1123,1.43
1124,1.12
1125,0.82
1126,0.78
1127,0.93
1128,1.00
1129,0.85
1130,0.68
1131,0.75
1132,1.07
1133,1.38
1134,1.50
1135,1.48
1136,1.52
1137,1.65
1138,1.75
1139,1.72
1140,1.65
1141,1.69
1142,1.86
1143,2.02
1144,2.00
1145,1.77
1146,1.44
1147,1.21
1148,1.24
1149,1.52
1150,1.87
1151,2.05
1152,1.99
1153,1.82
1154,1.77
1155,1.92
1156,2.17
1157,2.31
1158,2.22
1159,1.99
1160,1.73
1161,1.56
1162,1.54
1163,1.66
1164,1.86
1165,2.01
1166,2.04
1167,2.05
1168,2.19
1169,2.42
1170,2.52
1171,2.31
1172,1.89
1173,1.57
1174,1.57
1175,1.86
1176,2.20
1177,2.40
1178,2.44
1179,2.37
1180,2.25
1181,2.11
1182,2.03
1183,2.06
1184,2.19
1185,2.33
1186,2.37
1187,2.28
1188,2.18
1189,2.15
1190,2.19
1191,2.26
1192,2.35
1193,2.42
1194,2.42
1195,2.32
1196,2.18
1197,2.14
1198,2.29
1199,2.55
1200,2.72
1201,2.70
1202,2.57
1203,2.50
1204,2.55
1205,2.65
1206,2.69
1207,2.68
1208,2.67
1209,2.71
1210,2.76
1211,2.74
1212,2.65
1213,2.53
1214,2.42
1215,2.32
1216,2.18
1217,2.02
1218,1.87
1219,1.77
1220,1.71
1221,1.69
1222,1.71
1223,1.78
1224,1.84
1225,1.81
1226,1.69
1227,1.59
1228,1.62
1229,1.71
1230,1.66
1231,1.38
1232,1.05
1233,0.96
1234,1.15
1235,1.41
1236,1.51
1237,1.43
1238,1.35
1239,1.38
1240,1.43
1241,1.34
1242,1.14
1243,1.04
1244,1.14
1245,1.32
1246,1.37
1247,1.29
1248,1.25
1249,1.37
1250,1.58
1251,1.65
1252,1.49
1253,1.19
1254,0.91
1255,0.75
1256,0.72
1257,0.85
1258,1.10
1259,1.38
1260,1.55
1261,1.56
1262,1.46
1263,1.40
1264,1.37
1265,1.29
1266,1.11
1267,0.94
1268,0.88
1269,0.94
1270,0.91
1271,0.66
1272,0.28
1273,0.05
1274,0.17
1275,0.52
1276,0.73
1277,0.56
1278,0.12
1279,-0.21
1280,-0.16
1281,0.18
1282,0.50
1283,0.56
1284,0.41
1285,0.30
1286,0.36
1287,0.51
1288,0.61
1289,0.55
1290,0.37
1291,0.17
1292,0.05
1293,0.01
1294,0.02
1295,-0.01
1296,-0.09
1297,-0.16
1298,-0.10
1299,0.10
1300,0.29
1301,0.23
1302,-0.11
1303,-0.49
1304,-0.57
1305,-0.25
1306,0.16
1307,0.26
1308,-0.03
1309,-0.36
1310,-0.38
1311,-0.09
1312,0.13
1313,0.03
1314,-0.24
1315,-0.34
1316,-0.13
1317,0.18
1318,0.25
1319,0.00
1320,-0.36
1321,-0.53
1322,-0.46
1323,-0.31
1324,-0.29
1325,-0.45
1326,-0.65
1327,-0.71
1328,-0.54
1329,-0.25
1330,-0.02
1331,0.00
1332,-0.16
1333,-0.37
1334,-0.52
1335,-0.62
1336,-0.68
1337,-0.69
1338,-0.61
1339,-0.46
1340,-0.34
1341,-0.33
1342,-0.39
1343,-0.41
1344,-0.39
1345,-0.45
1346,-0.66
1347,-0.88
1348,-0.85
1349,-0.47
1350,0.04
1351,0.32
1352,0.25
1353,0.00
1354,-0.15
1355,-0.10
1356,0.02
1357,0.04
1358,-0.01
1359,-0.02
1360,0.09
1361,0.22
1362,0.25
1363,0.15
1364,0.03
1365,0.02
1366,0.13
1367,0.30
1368,0.49
1369,0.72
1370,0.99
1371,1.20
1372,1.19
1373,0.91
1374,0.59
1375,0.47
1376,0.63
1377,0.78
1378,0.64
1379,0.17
1380,-0.32
1381,-0.52
1382,-0.41
1383,-0.22
1384,-0.19
1385,-0.28
1386,-0.34
1387,-0.22
1388,0.03
1389,0.30
1390,0.50
1391,0.58
1392,0.51
1393,0.33
1394,0.17
1395,0.13
1396,0.21
1397,0.23
1398,0.04
1399,-0.24
1400,-0.38
1401,-0.33
1402,-0.22
1403,-0.22
1404,-0.33
1405,-0.44
1406,-0.45
1407,-0.34
1408,-0.08
1409,0.24
1410,0.47
1411,0.43
1412,0.10
1413,-0.34
1414,-0.65
1415,-0.75
1416,-0.70
1417,-0.61
1418,-0.51
1419,-0.38
1420,-0.29
1421,-0.32
1422,-0.43
1423,-0.49
1424,-0.35
1425,-0.09
1426,0.08
1427,0.00
1428,-0.24
1429,-0.45
1430,-0.44
1431,-0.22
1432,0.10
1433,0.36
1434,0.46
1435,0.37
1436,0.16
1437,-0.05
1438,-0.20
1439,-0.30
1440,-0.39
1441,-0.40
1442,-0.21
1443,0.20
1444,0.62
1445,0.72
1446,0.43
1447,0.04
1448,-0.10
1449,0.09
1450,0.36
1451,0.51
1452,0.56
1453,0.68
1454,0.93
1455,1.13
1456,1.15
1457,1.00
1458,0.83
1459,0.71
1460,0.65
1461,0.62
1462,0.72
1463,0.97
1464,1.26
1465,1.39
1466,1.30
1467,1.11
1468,0.98
1469,0.86
1470,0.62
1471,0.33
1472,0.25
1473,0.56
1474,1.06
1475,1.36
1476,1.31
1477,1.11
1478,1.07
1479,1.26
1480,1.45
1481,1.40
1482,1.15
1483,0.98
1484,1.16
1485,1.62
1486,2.06
1487,2.15
1488,1.85
1489,1.38
1490,1.08
1491,1.14
1492,1.47
1493,1.79
1494,1.86
1495,1.60
1496,1.19
1497,0.90
1498,0.87
1499,1.03
1500,1.12
1501,0.93
1502,0.57
1503,0.34
1504,0.43
1505,0.74
1506,0.95
1507,0.91
1508,0.79
1509,0.85
1510,1.08
1511,1.18
1512,1.00
1513,0.73
1514,0.74
1515,1.11
1516,1.45
1517,1.35
1518,0.83
1519,0.32
1520,0.23
1521,0.57
1522,0.99
1523,1.19
1524,1.15
1525,1.02
1526,0.91
1527,0.86
1528,0.89
1529,1.04
1530,1.27
1531,1.41
1532,1.36
1533,1.19
1534,1.11
1535,1.15
1536,1.20
1537,1.15
1538,1.12
1539,1.36
1540,1.87
1541,2.31
1542,2.32
1543,1.91
1544,1.47
1545,1.34
1546,1.52
1547,1.74
1548,1.77
1549,1.62
1550,1.45
1551,1.37
1552,1.39
1553,1.47
1554,1.54
1555,1.54
1556,1.49
1557,1.43
1558,1.43
1559,1.47
1560,1.48
1561,1.41
1562,1.29
1563,1.22
1564,1.24
1565,1.34
1566,1.54
1567,1.84
1568,2.23
1569,2.53
1570,2.61
1571,2.47
1572,2.25
1573,2.07
1574,1.96
1575,1.96
1576,2.09
1577,2.32
1578,2.50
1579,2.49
1580,2.32
1581,2.17
1582,2.15
1583,2.19
1584,2.14
1585,2.04
1586,2.09
1587,2.38
1588,2.73
1589,2.87
1590,2.68
1591,2.32
1592,2.04
1593,2.01
1594,2.18
1595,2.45
1596,2.66
1597,2.67
1598,2.51
1599,2.33
1600,2.36
1601,2.57
1602,2.73
1603,2.69
1604,2.55
1605,2.53
1606,2.68
1607,2.82
1608,2.77
1609,2.59
1610,2.46
1611,2.47
1612,2.55
1613,2.62
1614,2.68
1615,2.76
1616,2.76
1617,2.64
1618,2.50
1619,2.57
1620,2.87
1621,3.09
1622,2.89
1623,2.39
1624,2.07
1625,2.25
1626,2.74
1627,3.05
1628,2.96
1629,2.71
1630,2.66
1631,2.92
1632,3.23
1633,3.33
1634,3.20
1635,3.04
1636,2.98
1637,3.00
1638,3.03
1639,3.10
1640,3.26
1641,3.46
1642,3.54
1643,3.41
1644,3.16
1645,2.95
1646,2.83
1647,2.76
1648,2.70
1649,2.70
1650,2.82
1651,3.05
1652,3.27
1653,3.39
1654,3.41
1655,3.41
1656,3.37
1657,3.23
1658,2.97
1659,2.69
1660,2.57
1661,2.63
1662,2.78
1663,2.86
1664,2.82
1665,2.71
1666,2.57
1667,2.44
1668,2.39
1669,2.57
1670,2.98
1671,3.33
1672,3.29
1673,2.82
1674,2.27
1675,2.10
1676,2.37
1677,2.75
1678,2.92
1679,2.89
1680,2.86
1681,2.94
1682,3.06
1683,3.11
1684,3.15
1685,3.25
1686,3.34
1687,3.26
1688,2.97
1689,2.66
1690,2.54
1691,2.61
1692,2.71
1693,2.75
1694,2.77
1695,2.79
1696,2.70
1697,2.46
1698,2.25
1699,2.39
1700,2.92
1701,3.48
1702,3.61
1703,3.18
1704,2.53
1705,2.10
1706,2.07
1707,2.27
1708,2.47
1709,2.57
1710,2.62
1711,2.69
1712,2.78
1713,2.81
1714,2.73
1715,2.60
1716,2.52
1717,2.61
1718,2.84
1719,3.06
1720,3.07
1721,2.82
1722,2.46
1723,2.26
1724,2.36
1725,2.63
1726,2.83
1727,2.83
1728,2.70
1729,2.55
1730,2.44
1731,2.41
1732,2.47
1733,2.58
1734,2.63
1735,2.55
1736,2.37
1737,2.23
1738,2.20
1739,2.23
1740,2.18
1741,1.99
1742,1.77
1743,1.66
1744,1.70
1745,1.74
1746,1.66
1747,1.50
1748,1.43
1749,1.54
1750,1.74
1751,1.85
1752,1.84
1753,1.84
1754,1.86
1755,1.76
1756,1.43
1757,1.08
1758,1.05
1759,1.40
1760,1.76
1761,1.69
1762,1.25
1763,0.94
1764,1.12
1765,1.59
1766,1.84
1767,1.72
1768,1.48
1769,1.45
1770,1.57
1771,1.55
1772,1.29
1773,0.98
1774,0.89
1775,1.04
1776,1.22
1777,1.21
1778,1.03
1779,0.85
1780,0.78
1781,0.84
1782,0.91
1783,0.92
1784,0.88
1785,0.87
1786,0.96
1787,1.10
1788,1.14
1789,1.00
1790,0.76
1791,0.70
1792,0.92
1793,1.25
1794,1.37
1795,1.21
1796,0.98
1797,0.94
1798,1.05
1799,1.08
1800,0.84
1801,0.45
1802,0.17
1803,0.22
1804,0.50
1805,0.73
1806,0.68
1807,0.44
1808,0.23
1809,0.20
1810,0.27
1811,0.28
1812,0.20
1813,0.11
1814,0.11
1815,0.20
1816,0.25
1817,0.23
1818,0.19
1819,0.25
1820,0.44
1821,0.65
1822,0.70
1823,0.49
1824,0.14
1825,-0.12
1826,-0.13
1827,0.02
1828,0.13
1829,0.09
1830,-0.02
1831,-0.03
1832,0.07
1833,0.15
1834,0.12
1835,0.10
1836,0.20
1837,0.39
1838,0.43
1839,0.20
1840,-0.18
1841,-0.48
1842,-0.63
1843,-0.68
1844,-0.67
1845,-0.56
1846,-0.42
1847,-0.37
1848,-0.54
1849,-0.82
1850,-1.00
1851,-0.97
1852,-0.85
1853,-0.81
1854,-0.81
1855,-0.67
1856,-0.32
1857,0.09
1858,0.30
1859,0.20
1860,-0.07
1861,-0.28
1862,-0.33
1863,-0.30
1864,-0.29
1865,-0.32
1866,-0.33
1867,-0.34
1868,-0.42
1869,-0.63
1870,-0.84
1871,-0.83
1872,-0.53
1873,-0.14
1874,0.01
1875,-0.15
1876,-0.39
1877,-0.44
1878,-0.32
1879,-0.32
1880,-0.60
1881,-0.96
1882,-1.05
1883,-0.81
1884,-0.57
1885,-0.62
1886,-0.91
1887,-1.16
1888,-1.23
1889,-1.19
1890,-1.21
1891,-1.28
1892,-1.26
1893,-1.08
1894,-0.92
1895,-0.96
1896,-1.21
1897,-1.46
1898,-1.50
1899,-1.29
1900,-0.95
1901,-0.64
1902,-0.50
1903,-0.60
1904,-0.88
1905,-1.20
1906,-1.37
1907,-1.31
1908,-1.14
1909,-1.05
1910,-1.05
1911,-0.97
1912,-0.68
1913,-0.30
1914,-0.10
1915,-0.21
1916,-0.44
1917,-0.48
1918,-0.24
1919,0.05
1920,0.15
1921,0.08
1922,0.07
1923,0.16
1924,0.19
1925,-0.02
1926,-0.38
1927,-0.57
1928,-0.41
1929,-0.09
1930,0.10
1931,0.05
1932,-0.02
1933,0.14
1934,0.53
1935,0.87
1936,0.85
1937,0.48
1938,0.07
1939,-0.08
1940,0.06
1941,0.28
1942,0.34
1943,0.21
1944,0.00
1945,-0.16
1946,-0.23
1947,-0.21
1948,-0.12
1949,0.01
1950,0.13
1951,0.18
1952,0.12
1953,-0.02
1954,-0.14
1955,-0.14
1956,0.01
1957,0.26
1958,0.45
1959,0.45
1960,0.28
1961,0.02
1962,-0.18
1963,-0.30
1964,-0.38
1965,-0.45
1966,-0.46
1967,-0.37
1968,-0.20
1969,-0.12
1970,-0.21
1971,-0.39
1972,-0.46
1973,-0.37
1974,-0.22
1975,-0.20
1976,-0.28
1977,-0.29
1978,-0.13
1979,0.10
1980,0.22
1981,0.17
1982,0.07
1983,0.06
1984,0.17
1985,0.33
1986,0.49
1987,0.60
1988,0.56
1989,0.31
1990,-0.05
1991,-0.25
1992,-0.06
1993,0.49
1994,1.03
1995,1.19
1996,0.93
1997,0.56
1998,0.42
1999,0.59
2000,0.90
2001,1.11
2002,1.12
2003,0.99
2004,0.82
2005,0.74
2006,0.84
2007,1.15
2008,1.48
2009,1.54
2010,1.19
2011,0.67
2012,0.32
2013,0.25
2014,0.27
2015,0.19
2016,0.11
2017,0.29
2018,0.77
2019,1.25
2020,1.38
2021,1.16
2022,0.91
2023,0.92
2024,1.16
2025,1.39
2026,1.46
2027,1.41
2028,1.37
2029,1.31
2030,1.19
2031,1.01
2032,0.89
2033,0.89
2034,0.98
2035,1.02
2036,0.99
2037,0.96
2038,1.03
2039,1.23
2040,1.46
2041,1.55
2042,1.43
2043,1.21
2044,1.12
2045,1.33
2046,1.76
2047,2.16
2048,2.33
2049,2.28
2050,2.18
2051,2.10
2052,1.93
2053,1.55
2054,1.09
2055,0.85
2056,1.02
2057,1.43
2058,1.75
2059,1.79
2060,1.66
2061,1.54
2062,1.55
2063,1.67
2064,1.91
2065,2.28
2066,2.67
2067,2.84
2068,2.66
2069,2.22
2070,1.83
2071,1.64
2072,1.61
2073,1.63
2074,1.66
2075,1.74
2076,1.80
2077,1.76
2078,1.60
2079,1.46
2080,1.44
2081,1.54
2082,1.62
2083,1.61
2084,1.56
2085,1.54
2086,1.50
2087,1.37
2088,1.17
2089,1.08
2090,1.19
2091,1.36
2092,1.34
2093,1.07
2094,0.77
2095,0.70
2096,0.91
2097,1.22
2098,1.48
2099,1.69
2100,1.90
2101,2.04
2102,1.99
2103,1.80
2104,1.59
2105,1.46
2106,1.39
2107,1.34
2108,1.39
2109,1.58
2110,1.86
2111,1.99
2112,1.85
2113,1.54
2114,1.30
2115,1.35
2116,1.66
2117,2.00
2118,2.16
2119,2.11
2120,1.98
2121,1.94
2122,2.02
2123,2.12
2124,2.17
2125,2.22
2126,2.33
2127,2.40
2128,2.30
2129,2.00
2130,1.74
2131,1.75
2132,1.99
2133,2.15
2134,2.03
2135,1.75
2136,1.62
2137,1.81
2138,2.15
2139,2.31
2140,2.17
2141,1.95
2142,1.92
2143,2.17
2144,2.52
2145,2.75
2146,2.74
2147,2.55
2148,2.32
2149,2.26
2150,2.44
2151,2.73
2152,2.85
2153,2.68
2154,2.39
2155,2.23
2156,2.32
2157,2.54
2158,2.71
2159,2.74
2160,2.68
2161,2.60
2162,2.57
2163,2.62
2164,2.75
2165,2.87
2166,2.90
2167,2.84
2168,2.77
2169,2.76
2170,2.75
2171,2.67
2172,2.60
2173,2.69
2174,2.99
2175,3.30
2176,3.35
2177,3.11
2178,2.85
2179,2.88
2180,3.12
2181,3.23
2182,2.98
2183,2.57
2184,2.39
2185,2.54
2186,2.73
2187,2.61
2188,2.21
2189,1.86
2190,1.76
2191,1.84
2192,1.87
2193,1.82
2194,1.87
2195,2.13
2196,2.43
2197,2.59
2198,2.55
2199,2.45
2200,2.35
2201,2.23
2202,2.07
2203,1.95
2204,1.93
2205,1.94
2206,1.83
2207,1.65
2208,1.60
2209,1.78
2210,2.01
2211,2.01
2212,1.71
2213,1.37
2214,1.30
2215,1.48
2216,1.70
2217,1.76
2218,1.67
2219,1.55
2220,1.50
2221,1.55
2222,1.69
2223,1.89
2224,2.06
2225,2.11
2226,1.97
2227,1.67
2228,1.30
2229,1.02
2230,0.97
2231,1.18
2232,1.53
2233,1.85
2234,1.97
2235,1.87
2236,1.60
2237,1.31
2238,1.10
2239,1.02
2240,1.06
2241,1.15
2242,1.16
2243,1.08
2244,0.95
2245,0.88
2246,0.93
2247,1.05
2248,1.15
2249,1.16
2250,1.05
2251,0.79
2252,0.42
2253,0.16
2254,0.23
2255,0.65
2256,1.08
2257,1.18
2258,0.89
2259,0.55
2260,0.47
2261,0.64
2262,0.82
2263,0.83
2264,0.74
2265,0.79
2266,0.98
2267,1.11
2268,0.99
2269,0.66
2270,0.30
2271,0.10
2272,0.03
2273,0.02
2274,-0.01
2275,-0.05
2276,-0.13
2277,-0.26
2278,-0.45
2279,-0.63
2280,-0.68
2281,-0.56
2282,-0.32
2283,-0.09
2284,-0.02
2285,-0.24
2286,-0.67
2287,-1.07
2288,-1.14
2289,-0.85
2290,-0.40
2291,-0.10
2292,-0.08
2293,-0.29
2294,-0.59
2295,-0.84
2296,-0.95
2297,-0.86
2298,-0.64
2299,-0.40
2300,-0.24
2301,-0.14
2302,-0.05
2303,-0.05
2304,-0.25
2305,-0.66
2306,-1.08
2307,-1.27
2308,-1.20
2309,-1.03
2310,-0.95
2311,-0.91
2312,-0.86
2313,-0.80
2314,-0.83
2315,-0.92
2316,-0.92
2317,-0.77
2318,-0.66
2319,-0.77
2320,-1.06
2321,-1.35
2322,-1.46
2323,-1.40
2324,-1.28
2325,-1.14
2326,-0.96
2327,-0.76
2328,-0.69
2329,-0.83
2330,-1.09
2331,-1.27
2332,-1.21
2333,-0.92
2334,-0.67
2335,-0.70
2336,-1.04
2337,-1.41
2338,-1.47
2339,-1.14
2340,-0.69
2341,-0.55
2342,-0.85
2343,-1.34
2344,-1.64
2345,-1.67
2346,-1.61
2347,-1.64
2348,-1.74
2349,-1.81
2350,-1.81
2351,-1.73
2352,-1.50
2353,-1.08
2354,-0.63
2355,-0.40
2356,-0.50
2357,-0.71
2358,-0.72
2359,-0.49
2360,-0.32
2361,-0.46
2362,-0.81
2363,-1.03
2364,-0.95
2365,-0.71
2366,-0.58
2367,-0.67
2368,-0.83
2369,-0.86
2370,-0.71
2371,-0.49
2372,-0.36
2373,-0.38
2374,-0.46
2375,-0.48
2376,-0.39
2377,-0.26
2378,-0.27
2379,-0.57
2380,-1.07
2381,-1.50
2382,-1.60
2383,-1.35
2384,-0.98
2385,-0.70
2386,-0.63
2387,-0.70
2388,-0.81
2389,-0.89
2390,-0.91
2391,-0.86
2392,-0.74
2393,-0.56
2394,-0.35
2395,-0.21
2396,-0.15
2397,-0.08
2398,0.04
2399,0.08
2400,-0.13
2401,-0.59
2402,-1.01
2403,-1.12
2404,-0.92
2405,-0.66
2406,-0.60
2407,-0.79
2408,-1.03
2409,-1.09
2410,-0.90
2411,-0.61
2412,-0.44
2413,-0.43
2414,-0.50
2415,-0.52
2416,-0.44
2417,-0.31
2418,-0.18
2419,-0.09
2420,-0.12
2421,-0.37
2422,-0.83
2423,-1.32
2424,-1.50
2425,-1.20
2426,-0.59
2427,-0.14
2428,-0.13
2429,-0.48
2430,-0.81
2431,-0.87
2432,-0.71
2433,-0.55
2434,-0.54
2435,-0.62
2436,-0.72
2437,-0.76
2438,-0.69
2439,-0.44
2440,-0.09
2441,0.11
2442,-0.05
2443,-0.51
2444,-0.92
2445,-1.00
2446,-0.87
2447,-0.81
2448,-0.92
2449,-1.00
2450,-0.80
2451,-0.38
2452,0.01
2453,0.12
2454,-0.06
2455,-0.36
2456,-0.64
2457,-0.84
2458,-0.87
2459,-0.71
2460,-0.44
2461,-0.25
2462,-0.25
2463,-0.39
2464,-0.45
2465,-0.32
2466,-0.10
2467,0.04
2468,0.00
2469,-0.14
2470,-0.25
2471,-0.21
2472,-0.03
2473,0.17
2474,0.31
2475,0.34
2476,0.33
2477,0.34
2478,0.34
2479,0.26
2480,0.17
2481,0.27
2482,0.64
2483,1.07
2484,1.19
2485,0.91
2486,0.54
2487,0.46
2488,0.74
2489,1.07
2490,1.13
2491,0.90
2492,0.60
2493,0.41
2494,0.36
2495,0.41
2496,0.58
2497,0.86
2498,1.14
2499,1.30
2500,1.29
2501,1.19
2502,1.07
2503,1.00
2504,1.05
2505,1.28
2506,1.60
2507,1.76
2508,1.56
2509,1.13
2510,0.84
2511,0.83
2512,0.95
2513,0.96
2514,0.87
2515,0.90
2516,1.13
2517,1.39
2518,1.46
2519,1.37
2520,1.35
2521,1.57
2522,1.92
2523,2.12
2524,2.03
2525,1.76
2526,1.55
2527,1.54
2528,1.72
2529,1.93
2530,1.99
2531,1.80
2532,1.41
2533,1.09
2534,1.08
2535,1.34
2536,1.60
2537,1.66
2538,1.54
2539,1.45
2540,1.54
2541,1.79
2542,2.05
2543,2.15
2544,2.01
2545,1.73
2546,1.55
2547,1.67
2548,2.02
2549,2.31
2550,2.30
2551,2.05
2552,1.85
2553,1.89
2554,2.08
2555,2.17
2556,2.10
2557,1.98
2558,1.91
2559,1.85
2560,1.72
2561,1.64
2562,1.77
2563,2.07
2564,2.31
2565,2.33
2566,2.26
2567,2.32
2568,2.46
2569,2.44
2570,2.14
2571,1.78
2572,1.68
2573,1.90
2574,2.19
2575,2.30
2576,2.24
2577,2.18
2578,2.18
2579,2.17
2580,2.07
2581,1.96
2582,1.94
2583,1.98
2584,1.96
2585,1.88
2586,1.83
2587,1.84
2588,1.82
2589,1.75
2590,1.76
2591,1.93
2592,2.15
2593,2.19
2594,1.95
2595,1.63
2596,1.49
2597,1.67
2598,2.02
2599,2.29
2600,2.35
2601,2.28
2602,2.21
2603,2.18
2604,2.11
2605,1.97
2606,1.80
2607,1.65
2608,1.53
2609,1.43
2610,1.41
2611,1.51
2612,1.69
2613,1.81
2614,1.76
2615,1.61
2616,1.52
2617,1.62
2618,1.82
2619,1.91
2620,1.86
2621,1.80
2622,1.93
2623,2.21
2624,2.35
2625,2.11
2626,1.65
2627,1.37
2628,1.52
2629,1.90
2630,2.12
2631,2.04
2632,1.88
2633,1.87
2634,1.98
2635,1.99
2636,1.82
2637,1.65
2638,1.72
2639,2.10
2640,2.59
2641,2.89
2642,2.94
2643,2.86
2644,2.84
2645,2.87
2646,2.88
2647,2.79
2648,2.68
2649,2.60
2650,2.55
2651,2.53
2652,2.51
2653,2.45
2654,2.32
2655,2.17
2656,2.14
2657,2.27
2658,2.47
2659,2.62
2660,2.66
2661,2.60
2662,2.47
2663,2.34
2664,2.27
2665,2.35
2666,2.58
2667,2.78
2668,2.79
2669,2.56
2670,2.31
2671,2.31
2672,2.59
2673,2.91
2674,2.94
2675,2.63
2676,2.22
2677,2.06
2678,2.25
2679,2.61
2680,2.82
2681,2.76
2682,2.53
2683,2.38
2684,2.44
2685,2.58
2686,2.61
2687,2.48
2688,2.32
2689,2.25
2690,2.17
2691,1.99
2692,1.77
2693,1.73
2694,2.02
2695,2.46
2696,2.68
2697,2.51
2698,2.15
2699,1.89
2700,1.85
2701,1.85
2702,1.71
2703,1.47
2704,1.37
2705,1.56
2706,1.89
2707,2.12
2708,2.10
2709,1.89
2710,1.64
2711,1.48
2712,1.40
2713,1.35
2714,1.28
2715,1.19
2716,1.09
2717,1.00
2718,0.91
2719,0.86
2720,0.84
2721,0.83
2722,0.82
2723,0.93
2724,1.21
2725,1.54
2726,1.72
2727,1.61
2728,1.34
2729,1.10
2730,0.96
2731,0.87
2732,0.79
2733,0.74
2734,0.78
2735,0.89
2736,1.04
2737,1.24
2738,1.51
2739,1.78
2740,1.89
2741,1.78
2742,1.54
2743,1.30
2744,1.14
2745,1.08
2746,1.13
2747,1.27
2748,1.41
2749,1.41
2750,1.24
2751,1.05
2752,1.01
2753,1.08
2754,1.13
2755,1.10
2756,1.13
2757,1.27
2758,1.42
2759,1.40
2760,1.23
2761,1.15
2762,1.35
2763,1.67
2764,1.83
2765,1.72
2766,1.55
2767,1.54
2768,1.63
2769,1.61
2770,1.40
2771,1.18
2772,1.17
2773,1.38
2774,1.59
2775,1.57
2776,1.34
2777,1.12
2778,1.11
2779,1.27
2780,1.41
2781,1.41
2782,1.32
2783,1.28
2784,1.28
2785,1.23
2786,1.02
2787,0.76
2788,0.59
2789,0.55
2790,0.55
2791,0.49
2792,0.39
2793,0.41
2794,0.61
2795,0.86
2796,0.94
2797,0.78
2798,0.53
2799,0.40
2800,0.47
2801,0.60
2802,0.61
2803,0.45
2804,0.20
2805,-0.01
2806,-0.07
2807,0.06
2808,0.32
2809,0.61
2810,0.74
2811,0.61
2812,0.23
2813,-0.21
2814,-0.48
2815,-0.49
2816,-0.36
2817,-0.29
2818,-0.38
2819,-0.56
2820,-0.66
2821,-0.57
2822,-0.38
2823,-0.30
2824,-0.41
2825,-0.61
2826,-0.71
2827,-0.59
2828,-0.33
2829,-0.09
2830,0.06
2831,0.11
2832,0.06
2833,-0.13
2834,-0.38
2835,-0.49
2836,-0.29
2837,0.07
2838,0.25
2839,0.07
2840,-0.26
2841,-0.35
2842,-0.08
2843,0.29
2844,0.40
2845,0.22
2846,0.02
2847,0.02
2848,0.15
2849,0.17
2850,0.00
2851,-0.20
2852,-0.27
2853,-0.22
2854,-0.14
2855,-0.08
2856,0.02
2857,0.13
2858,0.15
2859,0.03
2860,-0.17
2861,-0.30
2862,-0.28
2863,-0.12
2864,0.11
2865,0.35
2866,0.49
2867,0.45
2868,0.24
2869,-0.06
2870,-0.30
2871,-0.34
2872,-0.21
2873,0.00
2874,0.15
2875,0.21
2876,0.18
2877,0.07
2878,-0.12
2879,-0.32
2880,-0.38
2881,-0.22
2882,0.07
2883,0.26
2884,0.23
2885,0.05
2886,-0.10
2887,-0.12
2888,-0.04
2889,0.06
2890,0.13
2891,0.12
2892,0.02
2893,-0.12
2894,-0.15
2895,0.07
2896,0.43
2897,0.63
2898,0.50
2899,0.16
2900,-0.06
2901,0.02
2902,0.22
2903,0.28
2904,0.13
2905,-0.08
2906,-0.17
2907,-0.11
2908,0.01
2909,0.13
2910,0.26
2911,0.38
2912,0.49
2913,0.58
2914,0.66
2915,0.67
2916,0.55
2917,0.34
2918,0.20
2919,0.25
2920,0.35
2921,0.24
2922,-0.13
2923,-0.49
2924,-0.51
2925,-0.18
2926,0.17
2927,0.22
2928,0.05
2929,-0.03
2930,0.13
2931,0.36
2932,0.40
2933,0.24
2934,0.19
2935,0.41
2936,0.72
2937,0.75
2938,0.43
2939,0.07
2940,0.00
2941,0.19
2942,0.32
2943,0.18
2944,-0.08
2945,-0.20
2946,-0.14
2947,-0.10
2948,-0.18
2949,-0.30
2950,-0.31
2951,-0.17
2952,0.03
2953,0.21
2954,0.33
2955,0.40
2956,0.40
2957,0.35
2958,0.33
2959,0.41
2960,0.59
2961,0.75
2962,0.83
2963,0.84
2964,0.86
2965,0.88
2966,0.89
2967,0.86
2968,0.86
2969,0.94
2970,1.08
2971,1.25
2972,1.37
2973,1.43
2974,1.45
2975,1.40
2976,1.32
2977,1.27
2978,1.30
2979,1.43
2980,1.56
2981,1.55
2982,1.32
2983,0.99
2984,0.78
2985,0.86
2986,1.16
2987,1.42
2988,1.40
2989,1.10
2990,0.78
2991,0.72
2992,0.97
2993,1.30
2994,1.50
2995,1.51
2996,1.45
2997,1.43
2998,1.46
2999,1.50
3000,1.54
3001,1.63
3002,1.74
3003,1.81
3004,1.83
3005,1.85
3006,1.92
3007,1.99
3008,1.96
3009,1.82
3010,1.68
3011,1.57
3012,1.47
3013,1.34
3014,1.23
3015,1.24
3016,1.37
3017,1.50
3018,1.51
3019,1.45
3020,1.42
3021,1.47
3022,1.51
3023,1.44
3024,1.30
3025,1.22
3026,1.28
3027,1.37
3028,1.36
3029,1.27
3030,1.25
3031,1.36
3032,1.53
3033,1.60
3034,1.57
3035,1.55
3036,1.67
3037,1.86
3038,1.98
3039,1.95
3040,1.82
3041,1.70
3042,1.69
3043,1.78
3044,1.94
3045,2.08
3046,2.11
3047,2.00
3048,1.81
3049,1.62
3050,1.57
3051,1.71
3052,1.92
3053,1.95
3054,1.72
3055,1.43
3056,1.47
3057,1.93
3058,2.51
3059,2.77
3060,2.66
3061,2.47
3062,2.47
3063,2.58
3064,2.57
3065,2.35
3066,2.14
3067,2.13
3068,2.26
3069,2.29
3070,2.20
3071,2.18
3072,2.40
3073,2.79
3074,3.12
3075,3.22
3076,3.15
3077,3.04
3078,2.99
3079,3.01
3080,3.15
3081,3.36
3082,3.47
3083,3.32
3084,2.96
3085,2.72
3086,2.92
3087,3.52
3088,4.10
3089,4.28
3090,4.04
3091,3.71
3092,3.58
3093,3.66
3094,3.75
3095,3.71
3096,3.60
3097,3.59
3098,3.76
3099,3.94
3100,3.98
3101,3.89
3102,3.81
3103,3.84
3104,3.91
3105,3.88
3106,3.75
3107,3.65
3108,3.72
3109,4.03
3110,4.40
3111,4.53
3112,4.32
3113,3.95
3114,3.76
3115,3.85
3116,4.09
3117,4.25
3118,4.33
3119,4.44
3120,4.58
3121,4.57
3122,4.32
3123,4.02
3124,3.93
3125,4.06
3126,4.14
3127,3.98
3128,3.71
3129,3.67
3130,3.99
3131,4.39
3132,4.58
3133,4.53
3134,4.46
3135,4.46
3136,4.43
3137,4.27
3138,4.08
3139,3.99
3140,3.98
3141,3.93
3142,3.81
3143,3.74
3144,3.87
3145,4.19
3146,4.42
3147,4.34
3148,4.01
3149,3.73
3150,3.74
3151,3.95
3152,4.02
3153,3.73
3154,3.22
3155,2.88
3156,2.92
3157,3.23
3158,3.45
3159,3.36
3160,3.06
3161,2.83
3162,2.82
3163,2.95
3164,3.04
3165,3.01
3166,2.94
3167,2.98
3168,3.16
3169,3.38
3170,3.52
3171,3.55
3172,3.55
3173,3.58
3174,3.60
3175,3.48
3176,3.21
3177,2.91
3178,2.80
3179,2.94
3180,3.15
3181,3.19
3182,3.04
3183,2.93
3184,3.06
3185,3.37
3186,3.54
3187,3.37
3188,3.03
3189,2.84
3190,2.98
3191,3.30
3192,3.49
3193,3.40
3194,3.11
3195,2.82
3196,2.64
3197,2.53
3198,2.41
3199,2.31
3200,2.32
3201,2.46
3202,2.64
3203,2.76
3204,2.79
3205,2.85
3206,2.97
3207,3.07
3208,2.93
3209,2.52
3210,2.03
3211,1.84
3212,2.04
3213,2.36
3214,2.36
3215,1.99
3216,1.58
3217,1.47
3218,1.68
3219,1.89
3220,1.91
3221,1.83
3222,1.87
3223,2.05
3224,2.12
3225,1.89
3226,1.48
3227,1.24
3228,1.36
3229,1.68
3230,1.95
3231,2.06
3232,2.04
3233,1.90
3234,1.61
3235,1.26
3236,1.10
3237,1.25
3238,1.48
3239,1.45
3240,1.06
3241,0.60
3242,0.42
3243,0.63
3244,1.00
3245,1.31
3246,1.45
3247,1.50
3248,1.41
3249,1.17
3250,0.87
3251,0.76
3252,0.94
3253,1.14
3254,0.99
3255,0.49
3256,0.06
3257,0.11
3258,0.51
3259,0.79
3260,0.67
3261,0.37
3262,0.31
3263,0.57
3264,0.83
3265,0.72
3266,0.31
3267,0.00
3268,0.03
3269,0.22
3270,0.23
3271,-0.04
3272,-0.35
3273,-0.41
3274,-0.14
3275,0.30
3276,0.68
3277,0.81
3278,0.65
3279,0.30
3280,0.00
3281,-0.11
3282,-0.04
3283,0.01
3284,-0.13
3285,-0.36
3286,-0.47
3287,-0.31
3288,0.03
3289,0.39
3290,0.61
3291,0.61
3292,0.42
3293,0.13
3294,-0.08
3295,-0.14
3296,-0.07
3297,0.01
3298,0.00
3299,-0.13
3300,-0.35
3301,-0.55
3302,-0.65
3303,-0.62
3304,-0.56
3305,-0.58
3306,-0.74
3307,-0.92
3308,-0.94
3309,-0.79
3310,-0.62
3311,-0.58
3312,-0.69
3313,-0.79
3314,-0.78
3315,-0.71
3316,-0.68
3317,-0.66
3318,-0.52
3319,-0.24
3320,0.12
3321,0.43
3322,0.61
3323,0.58
3324,0.31
3325,-0.11
3326,-0.47
3327,-0.62
3328,-0.60
3329,-0.56
3330,-0.55
3331,-0.52
3332,-0.38
3333,-0.15
3334,0.01
3335,-0.02
3336,-0.20
3337,-0.36
3338,-0.35
3339,-0.13
3340,0.13
3341,0.22
3342,0.03
3343,-0.39
3344,-0.79
3345,-0.89
3346,-0.60
3347,-0.09
3348,0.25
3349,0.16
3350,-0.33
3351,-0.92
3352,-1.22
3353,-1.10
3354,-0.73
3355,-0.41
3356,-0.31
3357,-0.38
3358,-0.42
3359,-0.38
3360,-0.34
3361,-0.36
3362,-0.42
3363,-0.44
3364,-0.44
3365,-0.49
3366,-0.56
3367,-0.56
3368,-0.40
3369,-0.19
3370,-0.12
3371,-0.25
3372,-0.44
3373,-0.57
3374,-0.59
3375,-0.55
3376,-0.45
3377,-0.27
3378,-0.03
3379,0.14
3380,0.15
3381,-0.03
3382,-0.31
3383,-0.51
3384,-0.48
3385,-0.19
3386,0.21
3387,0.48
3388,0.50
3389,0.39
3390,0.35
3391,0.39
3392,0.28
3393,-0.14
3394,-0.68
3395,-0.92
3396,-0.68
3397,-0.22
3398,0.04
3399,-0.02
3400,-0.20
3401,-0.26
3402,-0.22
3403,-0.21
3404,-0.28
3405,-0.31
3406,-0.23
3407,-0.12
3408,-0.08
3409,-0.13
3410,-0.21
3411,-0.34
3412,-0.57
3413,-0.80
3414,-0.86
3415,-0.63
3416,-0.34
3417,-0.33
3418,-0.70
3419,-1.12
3420,-1.23
3421,-1.07
3422,-0.98
3423,-1.14
3424,-1.35
3425,-1.32
3426,-1.02
3427,-0.65
3428,-0.38
3429,-0.15
3430,0.09
3431,0.29
3432,0.34
3433,0.21
3434,0.04
3435,-0.06
3436,-0.08
3437,-0.11
3438,-0.21
3439,-0.32
3440,-0.34
3441,-0.18
3442,0.19
3443,0.65
3444,1.00
3445,1.00
3446,0.65
3447,0.22
3448,0.01
3449,0.03
3450,0.06
3451,-0.03
3452,-0.06
3453,0.16
3454,0.54
3455,0.76
3456,0.59
3457,0.22
3458,0.01
3459,0.09
3460,0.29
3461,0.39
3462,0.38
3463,0.35
3464,0.35
3465,0.31
3466,0.25
3467,0.29
3468,0.54
3469,0.89
3470,1.12
3471,1.10
3472,0.90
3473,0.74
3474,0.67
3475,0.61
3476,0.51
3477,0.46
3478,0.59
3479,0.90
3480,1.19
3481,1.24
3482,0.99
3483,0.62
3484,0.30
3485,0.17
3486,0.24
3487,0.49
3488,0.75
3489,0.84
3490,0.68
3491,0.47
3492,0.49
3493,0.83
3494,1.20
3495,1.26
3496,0.99
3497,0.75
3498,0.83
3499,1.14
3500,1.27
3501,1.06
3502,0.75
3503,0.71
3504,0.97
3505,1.17
3506,1.01
3507,0.66
3508,0.56
3509,0.90
3510,1.39
3511,1.61
3512,1.43
3513,1.10
3514,0.95
3515,1.09
3516,1.40
3517,1.63
3518,1.60
3519,1.33
3520,1.01
3521,0.85
3522,0.90
3523,1.01
3524,1.00
3525,0.90
3526,0.94
3527,1.25
3528,1.65
3529,1.73
3530,1.35
3531,0.78
3532,0.47
3533,0.58
3534,0.90
3535,1.12
3536,1.19
3537,1.18
3538,1.15
3539,1.09
3540,1.03
3541,1.07
3542,1.27
3543,1.51
3544,1.64
3545,1.55
3546,1.32
3547,1.08
3548,0.89
3549,0.78
3550,0.77
3551,0.94
3552,1.26
3553,1.54
3554,1.64
3555,1.56
3556,1.47
3557,1.46
3558,1.47
3559,1.44
3560,1.42
3561,1.46
3562,1.55
3563,1.64
3564,1.71
3565,1.75
3566,1.75
3567,1.70
3568,1.63
3569,1.65
3570,1.78
3571,1.91
3572,1.83
3573,1.48
3574,1.03
3575,0.75
3576,0.79
3577,1.06
3578,1.34
3579,1.43
3580,1.29
3581,1.05
3582,0.90
3583,0.95
3584,1.19
3585,1.48
3586,1.67
3587,1.67
3588,1.51
3589,1.32
3590,1.23
3591,1.28
3592,1.39
3593,1.48
3594,1.52
3595,1.52
3596,1.52
3597,1.49
3598,1.40
3599,1.23
3600,1.05
3601,0.94
3602,0.98
3603,1.14
3604,1.33
3605,1.41
3606,1.29
3607,1.10
3608,1.04
3609,1.23
3610,1.55
3611,1.84
3612,1.97
3613,1.98
3614,1.94
3615,1.88
3616,1.84
3617,1.80
3618,1.73
3619,1.55
3620,1.27
3621,1.02
3622,0.97
3623,1.14
3624,1.34
3625,1.37
3626,1.23
3627,1.08
3628,1.03
3629,1.01
3630,0.93
3631,0.81
3632,0.76
3633,0.75
3634,0.70
3635,0.66
3636,0.80
3637,1.14
3638,1.44
3639,1.44
3640,1.22
3641,1.11
3642,1.29
3643,1.55
3644,1.58
3645,1.42
3646,1.37
3647,1.49
3648,1.54
3649,1.28
3650,0.90
3651,0.76
3652,0.90
3653,0.99
3654,0.75
3655,0.33
3656,0.18
3657,0.53
3658,1.10
3659,1.42
3660,1.34
3661,1.14
3662,1.14
3663,1.33
3664,1.47
3665,1.38
3666,1.15
3667,1.00
3668,1.03
3669,1.23
3670,1.51
3671,1.71
3672,1.66
3673,1.36
3674,1.03
3675,0.91
3676,1.06
3677,1.25
3678,1.25
3679,1.03
3680,0.81
3681,0.79
3682,0.92
3683,1.05
3684,1.08
3685,1.09
3686,1.15
3687,1.24
3688,1.28
3689,1.17
3690,0.96
3691,0.79
3692,0.79
3693,0.99
3694,1.25
3695,1.34
3696,1.17
3697,0.90
3698,0.84
3699,1.09
3700,1.44
3701,1.55
3702,1.29
3703,0.86
3704,0.53
3705,0.41
3706,0.44
3707,0.53
3708,0.65
3709,0.83
3710,1.00
3711,1.05
3712,0.98
3713,0.88
3714,0.84
3715,0.86
3716,0.83
3717,0.68
3718,0.43
3719,0.18
3720,0.05
3721,0.07
3722,0.20
3723,0.35
3724,0.40
3725,0.32
3726,0.21
3727,0.21
3728,0.37
3729,0.56
3730,0.63
3731,0.51
3732,0.38
3733,0.42
3734,0.62
3735,0.76
3736,0.65
3737,0.36
3738,0.21
3739,0.42
3740,0.82
3741,1.06
3742,0.94
3743,0.67
3744,0.62
3745,0.87
3746,1.10
3747,0.96
3748,0.43
3749,-0.09
3750,-0.27
3751,-0.11
3752,0.05
3753,0.00
3754,-0.22
3755,-0.37
3756,-0.32
3757,-0.14
3758,0.00
3759,0.02
3760,-0.12
3761,-0.36
3762,-0.63
3763,-0.78
3764,-0.71
3765,-0.44
3766,-0.17
3767,-0.12
3768,-0.31
3769,-0.51
3770,-0.50
3771,-0.32
3772,-0.22
3773,-0.37
3774,-0.60
3775,-0.63
3776,-0.37
3777,-0.12
3778,-0.16
3779,-0.47
3780,-0.72
3781,-0.65
3782,-0.38
3783,-0.21
3784,-0.31
3785,-0.52
3786,-0.62
3787,-0.57
3788,-0.49
3789,-0.45
3790,-0.40
3791,-0.27
3792,-0.11
3793,-0.07
3794,-0.20
3795,-0.41
3796,-0.54
3797,-0.49
3798,-0.36
3799,-0.35
3800,-0.58
3801,-0.94
3802,-1.17
3803,-1.13
3804,-0.90
3805,-0.71
3806,-0.71
3807,-0.83
3808,-0.96
3809,-1.08
3810,-1.25
3811,-1.38
3812,-1.34
3813,-1.08
3814,-0.77
3815,-0.62
3816,-0.67
3817,-0.81
3818,-0.88
3819,-0.83
3820,-0.71
3821,-0.60
3822,-0.58
3823,-0.64
3824,-0.68
3825,-0.59
3826,-0.35
3827,-0.13
3828,-0.15
3829,-0.45
3830,-0.88
3831,-1.15
3832,-1.14
3833,-0.98
3834,-0.91
3835,-1.10
3836,-1.40
3837,-1.54
3838,-1.32
3839,-0.87
3840,-0.47
3841,-0.41
3842,-0.67
3843,-1.02
3844,-1.17
3845,-1.04
3846,-0.78
3847,-0.64
3848,-0.70
3849,-0.81
3850,-0.79
3851,-0.57
3852,-0.34
3853,-0.30
3854,-0.48
3855,-0.67
3856,-0.67
3857,-0.46
3858,-0.24
3859,-0.19
3860,-0.33
3861,-0.50
3862,-0.58
3863,-0.63
3864,-0.73
3865,-0.90
3866,-1.06
3867,-1.15
3868,-1.21
3869,-1.27
3870,-1.34
3871,-1.38
3872,-1.37
3873,-1.29
3874,-1.14
3875,-0.97
3876,-0.90
3877,-0.93
3878,-0.94
3879,-0.81
3880,-0.56
3881,-0.44
3882,-0.63
3883,-1.06
3884,-1.46
3885,-1.72
3886,-1.90
3887,-2.07
3888,-2.15
3889,-1.96
3890,-1.57
3891,-1.22
3892,-1.14
3893,-1.33
3894,-1.54
3895,-1.59
3896,-1.43
3897,-1.16
3898,-0.91
3899,-0.82
3900,-0.94
3901,-1.20
3902,-1.39
3903,-1.40
3904,-1.35
3905,-1.42
3906,-1.62
3907,-1.69
3908,-1.47
3909,-1.13
3910,-1.02
3911,-1.26
3912,-1.63
3913,-1.86
3914,-1.96
3915,-2.08
3916,-2.22
3917,-2.22
3918,-2.02
3919,-1.80
3920,-1.79
3921,-1.94
3922,-1.93
3923,-1.56
3924,-1.04
3925,-0.80
3926,-1.02
3927,-1.46
3928,-1.68
3929,-1.55
3930,-1.23
3931,-1.05
3932,-1.10
3933,-1.30
3934,-1.48
3935,-1.57
3936,-1.56
3937,-1.48
3938,-1.30
3939,-1.03
3940,-0.71
3941,-0.49
3942,-0.42
3943,-0.41
3944,-0.33
3945,-0.13
3946,0.02
3947,-0.05
3948,-0.39
3949,-0.78
3950,-0.96
3951,-0.85
3952,-0.58
3953,-0.33
3954,-0.18
3955,-0.11
3956,-0.13
3957,-0.28
3958,-0.55
3959,-0.79
3960,-0.81
3961,-0.56
3962,-0.18
3963,0.12
3964,0.21
3965,0.05
3966,-0.27
3967,-0.64
3968,-0.83
3969,-0.71
3970,-0.34
3971,-0.01
3972,0.02
3973,-0.18
3974,-0.31
3975,-0.14
3976,0.22
3977,0.46
3978,0.40
3979,0.22
3980,0.19
3981,0.44
3982,0.79
3983,0.97
3984,0.89
3985,0.65
3986,0.50
3987,0.60
3988,0.93
3989,1.25
3990,1.31
3991,1.03
3992,0.67
3993,0.54
3994,0.76
3995,1.11
3996,1.33
3997,1.37
3998,1.41
3999,1.49
4000,1.52
4001,1.39
4002,1.24
4003,1.30
4004,1.64
4005,2.03
4006,2.18
4007,2.04
4008,1.84
4009,1.81
4010,1.97
4011,2.16
4012,2.28
4013,2.35
4014,2.39
4015,2.41
4016,2.31
4017,2.06
4018,1.73
4019,1.46
4020,1.37
4021,1.51
4022,1.79
4023,1.98
4024,1.93
4025,1.66
4026,1.40
4027,1.35
4028,1.46
4029,1.55
4030,1.61
4031,1.78
4032,2.19
4033,2.67
4034,2.84
4035,2.46
4036,1.74
4037,1.17
4038,1.07
4039,1.38
4040,1.76
4041,1.90
4042,1.72
4043,1.36
4044,1.03
4045,0.93
4046,1.17
4047,1.65
4048,2.10
4049,2.22
4050,1.95
4051,1.48
4052,1.15
4053,1.13
4054,1.32
4055,1.44
4056,1.35
4057,1.12
4058,1.01
4059,1.19
4060,1.58
4061,1.96
4062,2.12
4063,2.02
4064,1.79
4065,1.62
4066,1.58
4067,1.62
4068,1.65
4069,1.72
4070,1.88
4071,2.08
4072,2.18
4073,2.07
4074,1.87
4075,1.81
4076,1.98
4077,2.20
4078,2.16
4079,1.78
4080,1.26
4081,1.02
4082,1.20
4083,1.56
4084,1.74
4085,1.60
4086,1.38
4087,1.36
4088,1.56
4089,1.74
4090,1.71
4091,1.56
4092,1.50
4093,1.68
4094,1.96
4095,2.07
4096,1.90
4097,1.58
4098,1.39
4099,1.53
4100,1.86
4101,2.08
4102,1.99
4103,1.64
4104,1.37
4105,1.43
4106,1.81
4107,2.21
4108,2.34
4109,2.13
4110,1.81
4111,1.63
4112,1.73
4113,2.06
4114,2.42
4115,2.62
4116,2.55
4117,2.29
4118,2.01
4119,1.85
4120,1.84
4121,1.86
4122,1.78
4123,1.59
4124,1.39
4125,1.34
4126,1.52
4127,1.88
4128,2.24
4129,2.39
4130,2.24
4131,1.90
4132,1.57
4133,1.40
4134,1.36
4135,1.31
4136,1.21
4137,1.19
4138,1.39
4139,1.76
4140,2.04
4141,2.00
4142,1.73
4143,1.53
4144,1.57
4145,1.73
4146,1.73
4147,1.51
4148,1.30
4149,1.32
4150,1.51
4151,1.62
4152,1.49
4153,1.21
4154,1.01
4155,0.99
4156,1.05
4157,1.04
4158,0.91
4159,0.77
4160,0.71
4161,0.71
4162,0.72
4163,0.70
4164,0.68
4165,0.63
4166,0.51
4167,0.39
4168,0.34
4169,0.43
4170,0.59
4171,0.75
4172,0.86
4173,0.91
4174,0.91
4175,0.89
4176,0.84
4177,0.72
4178,0.50
4179,0.23
4180,0.00
4181,-0.13
4182,-0.20
4183,-0.27
4184,-0.28
4185,-0.17
4186,0.02
4187,0.07
4188,-0.17
4189,-0.55
4190,-0.76
4191,-0.59
4192,-0.19
4193,0.07
4194,0.02
4195,-0.18
4196,-0.28
4197,-0.28
4198,-0.38
4199,-0.66
4200,-0.91
4201,-0.88
4202,-0.56
4203,-0.24
4204,-0.19
4205,-0.38
4206,-0.53
4207,-0.48
4208,-0.27
4209,-0.12
4210,-0.12
4211,-0.20
4212,-0.27
4213,-0.30
4214,-0.36
4215,-0.44
4216,-0.44
4217,-0.29
4218,-0.05
4219,0.13
4220,0.12
4221,-0.07
4222,-0.30
4223,-0.40
4224,-0.33
4225,-0.21
4226,-0.13
4227,-0.13
4228,-0.19
4229,-0.35
4230,-0.61
4231,-0.84
4232,-0.77
4233,-0.35
4234,0.16
4235,0.33
4236,0.01
4237,-0.54
4238,-0.87
4239,-0.74
4240,-0.34
4241,-0.08
4242,-0.19
4243,-0.59
4244,-1.00
4245,-1.12
4246,-0.87
4247,-0.41
4248,-0.07
4249,-0.13
4250,-0.53
4251,-0.87
4252,-0.80
4253,-0.40
4254,-0.07
4255,-0.10
4256,-0.34
4257,-0.45
4258,-0.34
4259,-0.18
4260,-0.16
4261,-0.26
4262,-0.32
4263,-0.27
4264,-0.18
4265,-0.19
4266,-0.28
4267,-0.34
4268,-0.33
4269,-0.25
4270,-0.17
4271,-0.09
4272,-0.02
4273,0.03
4274,0.04
4275,0.06
4276,0.14
4277,0.29
4278,0.42
4279,0.43
4280,0.28
4281,0.05
4282,-0.14
4283,-0.27
4284,-0.41
4285,-0.65
4286,-0.96
4287,-1.13
4288,-1.02
4289,-0.66
4290,-0.35
4291,-0.28
4292,-0.45
4293,-0.66
4294,-0.74
4295,-0.65
4296,-0.47
4297,-0.31
4298,-0.27
4299,-0.37
4300,-0.58
4301,-0.83
4302,-1.03
4303,-1.14
4304,-1.16
4305,-1.12
4306,-1.04
4307,-0.94
4308,-0.82
4309,-0.71
4310,-0.69
4311,-0.79
4312,-0.99
4313,-1.16
4314,-1.16
4315,-1.01
4316,-0.88
4317,-0.97
4318,-1.28
4319,-1.53
4320,-1.49
4321,-1.18
4322,-0.90
4323,-0.91
4324,-1.14
4325,-1.31
4326,-1.25
4327,-1.05
4328,-0.93
4329,-0.99
4330,-1.15
4331,-1.26
4332,-1.30
4333,-1.29
4334,-1.24
4335,-1.15
4336,-0.99
4337,-0.80
4338,-0.66
4339,-0.71
4340,-0.98
4341,-1.30
4342,-1.46
4343,-1.39
4344,-1.29
4345,-1.33
4346,-1.50
4347,-1.62
4348,-1.55
4349,-1.33
4350,-1.15
4351,-1.12
4352,-1.18
4353,-1.25
4354,-1.28
4355,-1.32
4356,-1.38
4357,-1.41
4358,-1.33
4359,-1.21
4360,-1.10
4361,-0.99
4362,-0.82
4363,-0.66
4364,-0.68
4365,-0.95
4366,-1.29
4367,-1.45
4368,-1.37
4369,-1.26
4370,-1.30
4371,-1.44
4372,-1.45
4373,-1.25
4374,-1.02
4375,-1.01
4376,-1.21
4377,-1.36
4378,-1.25
4379,-0.99
4380,-0.86
4381,-0.95
4382,-1.07
4383,-0.97
4384,-0.63
4385,-0.32
4386,-0.23
4387,-0.29
4388,-0.31
4389,-0.21
4390,-0.09
4391,-0.04
4392,0.01
4393,0.14
4394,0.34
4395,0.48
4396,0.45
4397,0.26
4398,0.02
4399,-0.15
4400,-0.17
4401,-0.06
4402,0.11
4403,0.27
4404,0.38
4405,0.41
4406,0.39
4407,0.35
4408,0.36
4409,0.46
4410,0.64
4411,0.86
4412,0.98
4413,0.89
4414,0.62
4415,0.38
4416,0.39
4417,0.62
4418,0.84
4419,0.85
4420,0.67
4421,0.55
4422,0.65
4423,0.86
4424,0.91
4425,0.70
4426,0.38
4427,0.21
4428,0.28
4429,0.47
4430,0.59
4431,0.64
4432,0.68
4433,0.76
4434,0.83
4435,0.81
4436,0.76
4437,0.71
4438,0.73
4439,0.79
4440,0.90
4441,0.99
4442,1.01
4443,0.92
4444,0.80
4445,0.76
4446,0.91
4447,1.19
4448,1.43
4449,1.46
4450,1.27
4451,1.01
4452,0.83
4453,0.84
4454,0.97
4455,1.11
4456,1.15
4457,1.05
4458,0.84
4459,0.66
4460,0.62
4461,0.69
4462,0.73
4463,0.72
4464,0.73
4465,0.83
4466,0.99
4467,1.09
4468,1.05
4469,0.89
4470,0.74
4471,0.74
4472,0.90
4473,1.06
4474,1.05
4475,0.81
4476,0.52
4477,0.39
4478,0.50
4479,0.74
4480,0.87
4481,0.79
4482,0.52
4483,0.26
4484,0.13
4485,0.13
4486,0.21
4487,0.34
4488,0.51
4489,0.67
4490,0.73
4491,0.65
4492,0.50
4493,0.42
4494,0.50
4495,0.70
4496,0.92
4497,1.03
4498,0.96
4499,0.77
4500,0.58
4501,0.52
4502,0.67
4503,0.97
4504,1.27
4505,1.43
4506,1.36
4507,1.08
4508,0.71
4509,0.37
4510,0.24
4511,0.45
4512,0.98
4513,1.56
4514,1.89
4515,1.84
4516,1.58
4517,1.30
4518,1.12
4519,1.05
4520,1.07
4521,1.14
4522,1.20
4523,1.19
4524,1.18
4525,1.27
4526,1.49
4527,1.74
4528,1.86
4529,1.81
4530,1.63
4531,1.36
4532,1.04
4533,0.80
4534,0.83
4535,1.20
4536,1.72
4537,2.07
4538,2.07
4539,1.82
4540,1.55
4541,1.40
4542,1.29
4543,1.15
4544,1.03
4545,1.05
4546,1.22
4547,1.35
4548,1.33
4549,1.24
4550,1.23
4551,1.32
4552,1.33
4553,1.16
4554,0.88
4555,0.68
4556,0.61
4557,0.60
4558,0.58
4559,0.57
4560,0.61
4561,0.70
4562,0.79
4563,0.81
4564,0.79
4565,0.82
4566,0.93
4567,1.08
4568,1.17
4569,1.11
4570,0.90
4571,0.63
4572,0.49
4573,0.63
4574,1.02
4575,1.39
4576,1.47
4577,1.27
4578,1.03
4579,0.96
4580,1.01
4581,0.96
4582,0.73
4583,0.51
4584,0.57
4585,0.96
4586,1.48
4587,1.77
4588,1.68
4589,1.32
4590,1.00
4591,0.92
4592,1.05
4593,1.14
4594,1.00
4595,0.72
4596,0.60
4597,0.79
4598,1.11
4599,1.20
4600,0.97
4601,0.71
4602,0.75
4603,1.00
4604,1.11
4605,0.90
4606,0.62
4607,0.65
4608,0.97
4609,1.21
4610,1.11
4611,0.83
4612,0.72
4613,0.89
4614,1.11
4615,1.14
4616,1.02
4617,0.98
4618,1.10
4619,1.24
4620,1.27
4621,1.23
4622,1.30
4623,1.46
4624,1.51
4625,1.28
4626,0.84
4627,0.46
4628,0.39
4629,0.62
4630,1.00
4631,1.33
4632,1.51
4633,1.56
4634,1.53
4635,1.46
4636,1.37
4637,1.21
4638,0.99
4639,0.81
4640,0.73
4641,0.75
4642,0.74
4643,0.61
4644,0.48
4645,0.58
4646,0.93
4647,1.30
4648,1.35
4649,1.03
4650,0.66
4651,0.57
4652,0.78
4653,1.01
4654,0.96
4655,0.63
4656,0.27
4657,0.13
4658,0.23
4659,0.40
4660,0.48
4661,0.46
4662,0.47
4663,0.57
4664,0.67
4665,0.63
4666,0.48
4667,0.41
4668,0.63
4669,1.10
4670,1.52
4671,1.60
4672,1.34
4673,1.00
4674,0.82
4675,0.81
4676,0.81
4677,0.69
4678,0.50
4679,0.38
4680,0.37
4681,0.47
4682,0.60
4683,0.67
4684,0.59
4685,0.36
4686,0.19
4687,0.31
4688,0.70
4689,1.04
4690,0.98
4691,0.56
4692,0.19
4693,0.22
4694,0.62
4695,1.05
4696,1.23
4697,1.13
4698,0.90
4699,0.68
4700,0.56
4701,0.58
4702,0.69
4703,0.82
4704,0.84
4705,0.64
4706,0.23
4707,-0.23
4708,-0.49
4709,-0.41
4710,-0.08
4711,0.23
4712,0.25
4713,-0.07
4714,-0.54
4715,-0.80
4716,-0.71
4717,-0.44
4718,-0.35
4719,-0.59
4720,-0.96
4721,-1.17
4722,-1.08
4723,-0.85
4724,-0.69
4725,-0.69
4726,-0.76
4727,-0.79
4728,-0.73
4729,-0.61
4730,-0.41
4731,-0.14
4732,0.09
4733,0.11
4734,-0.14
4735,-0.48
4736,-0.64
4737,-0.49
4738,-0.21
4739,-0.09
4740,-0.25
4741,-0.54
4742,-0.67
4743,-0.53
4744,-0.26
4745,-0.11
4746,-0.19
4747,-0.40
4748,-0.52
4749,-0.46
4750,-0.32
4751,-0.31
4752,-0.47
4753,-0.61
4754,-0.52
4755,-0.28
4756,-0.17
4757,-0.38
4758,-0.77
4759,-0.98
4760,-0.86
4761,-0.61
4762,-0.55
4763,-0.72
4764,-0.94
4765,-1.04
4766,-1.05
4767,-1.07
4768,-1.14
4769,-1.20
4770,-1.27
4771,-1.41
4772,-1.59
4773,-1.68
4774,-1.59
4775,-1.41
4776,-1.35
4777,-1.47
4778,-1.60
4779,-1.53
4780,-1.25
4781,-0.94
4782,-0.79
4783,-0.86
4784,-1.06
4785,-1.28
4786,-1.41
4787,-1.36
4788,-1.18
4789,-1.03
4790,-1.07
4791,-1.26
4792,-1.34
4793,-1.13
4794,-0.78
4795,-0.60
4796,-0.76
4797,-1.07
4798,-1.24
4799,-1.22
4800,-1.17
4801,-1.20
4802,-1.19
4803,-0.94
4804,-0.55
4805,-0.35
4806,-0.60
4807,-1.18
4808,-1.67
4809,-1.74
4810,-1.46
4811,-1.13
4812,-1.02
4813,-1.12
4814,-1.26
4815,-1.28
4816,-1.15
4817,-0.95
4818,-0.78
4819,-0.67
4820,-0.69
4821,-0.87
4822,-1.15
4823,-1.45
4824,-1.65
4825,-1.71
4826,-1.71
4827,-1.75
4828,-1.83
4829,-1.79
4830,-1.54
4831,-1.19
4832,-0.99
4833,-1.05
4834,-1.21
4835,-1.25
4836,-1.16
4837,-1.14
4838,-1.37
4839,-1.66
4840,-1.67
4841,-1.27
4842,-0.72
4843,-0.44
4844,-0.53
4845,-0.74
4846,-0.79
4847,-0.74
4848,-0.83
4849,-1.08
4850,-1.26
4851,-1.15
4852,-0.88
4853,-0.74
4854,-0.77
4855,-0.80
4856,-0.71
4857,-0.63
4858,-0.74
4859,-1.00
4860,-1.16
4861,-1.03
4862,-0.71
4863,-0.47
4864,-0.42
4865,-0.48
4866,-0.54
4867,-0.54
4868,-0.56
4869,-0.64
4870,-0.83
4871,-1.14
4872,-1.45
4873,-1.58
4874,-1.38
4875,-1.02
4876,-0.84
4877,-1.01
4878,-1.36
4879,-1.51
4880,-1.34
4881,-1.07
4882,-0.99
4883,-1.11
4884,-1.21
4885,-1.15
4886,-1.03
4887,-1.03
4888,-1.13
4889,-1.14
4890,-0.93
4891,-0.62
4892,-0.51
4893,-0.83
4894,-1.48
4895,-2.17
4896,-2.61
4897,-2.70
4898,-2.64
4899,-2.69
4900,-2.93
4901,-3.13
4902,-2.99
4903,-2.49
4904,-1.99
4905,-1.85
4906,-2.18
4907,-2.66
4908,-2.95
4909,-2.89
4910,-2.57
4911,-2.21
4912,-1.90
4913,-1.64
4914,-1.39
4915,-1.17
4916,-1.04
4917,-1.02
4918,-1.08
4919,-1.18
4920,-1.30
4921,-1.41
4922,-1.45
4923,-1.38
4924,-1.23
4925,-1.12
4926,-1.17
4927,-1.41
4928,-1.71
4929,-1.93
4930,-1.99
4931,-1.92
4932,-1.75
4933,-1.45
4934,-0.99
4935,-0.46
4936,-0.08
4937,0.01
4938,-0.13
4939,-0.33
4940,-0.47
4941,-0.56
4942,-0.65
4943,-0.76
4944,-0.81
4945,-0.78
4946,-0.65
4947,-0.49
4948,-0.36
4949,-0.33
4950,-0.38
4951,-0.44
4952,-0.44
4953,-0.41
4954,-0.42
4955,-0.57
4956,-0.77
4957,-0.83
4958,-0.70
4959,-0.52
4960,-0.49
4961,-0.61
4962,-0.66
4963,-0.52
4964,-0.26
4965,-0.09
4966,0.00
4967,0.14
4968,0.41
4969,0.64
4970,0.63
4971,0.39
4972,0.14
4973,0.08
4974,0.15
4975,0.18
4976,0.12
4977,0.05
4978,0.10
4979,0.23
4980,0.34
4981,0.37
4982,0.37
4983,0.41
4984,0.53
4985,0.69
4986,0.84
4987,0.90
4988,0.85
4989,0.73
4990,0.69
4991,0.81
4992,1.07
4993,1.32
4994,1.44
4995,1.39
4996,1.23
4997,1.03
4998,0.86
4999,0.75
5000,0.68
5001,0.61
5002,0.50
5003,0.39
5004,0.39
5005,0.50
5006,0.65
5007,0.74
5008,0.68
5009,0.48
5010,0.21
5011,-0.03
5012,-0.13
5013,-0.08
5014,0.01
5015,0.03
5016,-0.02
5017,-0.01
5018,0.17
5019,0.49
5020,0.73
5021,0.69
5022,0.38
5023,0.05
5024,-0.08
5025,-0.06
5026,-0.04
5027,-0.05
5028,0.05
5029,0.32
5030,0.61
5031,0.74
5032,0.68
5033,0.59
5034,0.66
5035,0.87
5036,1.07
5037,1.14
5038,1.12
5039,1.12
5040,1.26
5041,1.49
5042,1.62
5043,1.48
5044,1.13
5045,0.87
5046,1.01
5047,1.53
5048,2.01
5049,2.04
5050,1.59
5051,1.05
5052,0.81
5053,0.96
5054,1.22
5055,1.30
5056,1.21
5057,1.16
5058,1.29
5059,1.47
5060,1.43
5061,1.06
5062,0.58
5063,0.37
5064,0.58
5065,1.00
5066,1.24
5067,1.08
5068,0.67
5069,0.32
5070,0.25
5071,0.42
5072,0.64
5073,0.79
5074,0.87
5075,0.98
5076,1.16
5077,1.36
5078,1.51
5079,1.52
5080,1.37
5081,1.08
5082,0.79
5083,0.67
5084,0.74
5085,0.81
5086,0.66
5087,0.31
5088,0.05
5089,0.12
5090,0.43
5091,0.70
5092,0.73
5093,0.54
5094,0.36
5095,0.35
5096,0.47
5097,0.55
5098,0.45
5099,0.18
5100,-0.08
5101,-0.20
5102,-0.14
5103,0.02
5104,0.20
5105,0.34
5106,0.43
5107,0.45
5108,0.42
5109,0.46
5110,0.58
5111,0.70
5112,0.68
5113,0.49
5114,0.25
5115,0.06
5116,-0.14
5117,-0.46
5118,-0.84
5119,-1.01
5120,-0.81
5121,-0.38
5122,-0.13
5123,-0.27
5124,-0.64
5125,-0.87
5126,-0.80
5127,-0.60
5128,-0.50
5129,-0.47
5130,-0.36
5131,-0.16
5132,-0.10
5133,-0.34
5134,-0.75
5135,-1.01
5136,-0.98
5137,-0.78
5138,-0.68
5139,-0.82
5140,-1.13
5141,-1.42
5142,-1.52
5143,-1.35
5144,-1.03
5145,-0.79
5146,-0.85
5147,-1.12
5148,-1.30
5149,-1.16
5150,-0.86
5151,-0.87
5152,-1.48
5153,-2.45
5154,-3.20
5155,-3.31
5156,-2.91
5157,-2.49
5158,-2.36
5159,-2.38
5160,-2.26
5161,-1.91
5162,-1.57
5163,-1.54
5164,-1.79
5165,-2.00
5166,-1.94
5167,-1.73
5168,-1.69
5169,-1.96
5170,-2.33
5171,-2.49
5172,-2.31
5173,-1.95
5174,-1.66
5175,-1.57
5176,-1.64
5177,-1.77
5178,-1.85
5179,-1.78
5180,-1.48
5181,-1.01
5182,-0.63
5183,-0.67
5184,-1.17
5185,-1.74
5186,-1.90
5187,-1.59
5188,-1.20
5189,-1.16
5190,-1.48
5191,-1.82
5192,-1.92
5193,-1.84
5194,-1.84
5195,-2.02
5196,-2.25
5197,-2.28
5198,-2.06
5199,-1.75
5200,-1.58
5201,-1.68
5202,-1.94
5203,-2.15
5204,-2.15
5205,-1.93
5206,-1.66
5207,-1.56
5208,-1.67
5209,-1.83
5210,-1.88
5211,-1.82
5212,-1.84
5213,-2.06
5214,-2.31
5215,-2.32
5216,-1.98
5217,-1.55
5218,-1.37
5219,-1.54
5220,-1.84
5221,-1.94
5222,-1.84
5223,-1.75
5224,-1.81
5225,-1.87
5226,-1.71
5227,-1.36
5228,-1.12
5229,-1.24
5230,-1.60
5231,-1.92
5232,-2.05
5233,-2.06
5234,-2.10
5235,-2.19
5236,-2.17
5237,-1.97
5238,-1.66
5239,-1.41
5240,-1.33
5241,-1.36
5242,-1.41
5243,-1.47
5244,-1.56
5245,-1.70
5246,-1.77
5247,-1.65
5248,-1.36
5249,-1.04
5250,-0.88
5251,-1.00
5252,-1.32
5253,-1.64
5254,-1.81
5255,-1.81
5256,-1.77
5257,-1.80
5258,-1.92
5259,-2.12
5260,-2.32
5261,-2.38
5262,-2.23
5263,-1.90
5264,-1.58
5265,-1.42
5266,-1.39
5267,-1.37
5268,-1.33
5269,-1.38
5270,-1.64
5271,-2.03
5272,-2.33
5273,-2.31
5274,-1.99
5275,-1.67
5276,-1.57
5277,-1.65
5278,-1.68
5279,-1.51
5280,-1.32
5281,-1.39
5282,-1.80
5283,-2.31
5284,-2.55
5285,-2.35
5286,-1.84
5287,-1.35
5288,-1.17
5289,-1.35
5290,-1.69
5291,-1.90
5292,-1.81
5293,-1.54
5294,-1.36
5295,-1.45
5296,-1.73
5297,-1.91
5298,-1.79
5299,-1.43
5300,-1.09
5301,-0.98
5302,-1.06
5303,-1.08
5304,-0.89
5305,-0.61
5306,-0.51
5307,-0.75
5308,-1.14
5309,-1.36
5310,-1.28
5311,-1.09
5312,-1.04
5313,-1.21
5314,-1.42
5315,-1.50
5316,-1.46
5317,-1.43
5318,-1.44
5319,-1.38
5320,-1.17
5321,-0.96
5322,-1.03
5323,-1.47
5324,-2.04
5325,-2.38
5326,-2.27
5327,-1.86
5328,-1.43
5329,-1.17
5330,-1.14
5331,-1.35
5332,-1.68
5333,-1.91
5334,-1.82
5335,-1.37
5336,-0.89
5337,-0.72
5338,-0.93
5339,-1.25
5340,-1.30
5341,-0.97
5342,-0.48
5343,-0.17
5344,-0.21
5345,-0.48
5346,-0.77
5347,-0.93
5348,-0.97
5349,-0.99
5350,-1.07
5351,-1.22
5352,-1.39
5353,-1.54
5354,-1.59
5355,-1.46
5356,-1.15
5357,-0.80
5358,-0.65
5359,-0.78
5360,-1.03
5361,-1.18
5362,-1.14
5363,-0.98
5364,-0.81
5365,-0.68
5366,-0.58
5367,-0.47
5368,-0.39
5369,-0.41
5370,-0.57
5371,-0.80
5372,-0.94
5373,-0.89
5374,-0.65
5375,-0.41
5376,-0.35
5377,-0.56
5378,-0.89
5379,-1.11
5380,-1.08
5381,-0.86
5382,-0.65
5383,-0.58
5384,-0.62
5385,-0.65
5386,-0.63
5387,-0.62
5388,-0.70
5389,-0.79
5390,-0.78
5391,-0.65
5392,-0.54
5393,-0.54
5394,-0.62
5395,-0.62
5396,-0.50
5397,-0.41
5398,-0.52
5399,-0.81
5400,-1.09
5401,-1.15
5402,-1.03
5403,-0.92
5404,-1.01
5405,-1.25
5406,-1.43
5407,-1.41
5408,-1.16
5409,-0.80
5410,-0.48
5411,-0.34
5412,-0.50
5413,-0.89
5414,-1.28
5415,-1.46
5416,-1.39
5417,-1.25
5418,-1.27
5419,-1.48
5420,-1.78
5421,-2.04
5422,-2.21
5423,-2.25
5424,-2.13
5425,-1.85
5426,-1.58
5427,-1.49
5428,-1.63
5429,-1.75
5430,-1.62
5431,-1.23
5432,-0.88
5433,-0.88
5434,-1.20
5435,-1.50
5436,-1.51
5437,-1.32
5438,-1.24
5439,-1.46
5440,-1.74
5441,-1.75
5442,-1.44
5443,-1.11
5444,-1.13
5445,-1.52
5446,-1.99
5447,-2.27
5448,-2.31
5449,-2.25
5450,-2.11
5451,-1.84
5452,-1.44
5453,-1.10
5454,-0.99
5455,-1.04
5456,-1.04
5457,-0.88
5458,-0.67
5459,-0.53
5460,-0.38
5461,-0.11
5462,0.25
5463,0.46
5464,0.40
5465,0.18
5466,0.05
5467,0.16
5468,0.33
5469,0.35
5470,0.13
5471,-0.14
5472,-0.28
5473,-0.21
5474,-0.04
5475,0.11
5476,0.19
5477,0.20
5478,0.14
5479,0.00
5480,-0.19
5481,-0.26
5482,-0.17
5483,0.03
5484,0.16
5485,0.20
5486,0.21
5487,0.27
5488,0.24
5489,-0.05
5490,-0.61
5491,-1.16
5492,-1.34
5493,-1.02
5494,-0.45
5495,0.00
5496,0.14
5497,0.06
5498,-0.04
5499,-0.05
5500,0.00
5501,0.04
5502,0.01
5503,-0.08
5504,-0.19
5505,-0.27
5506,-0.30
5507,-0.27
5508,-0.24
5509,-0.29
5510,-0.48
5511,-0.79
5512,-1.15
5513,-1.42
5514,-1.55
5515,-1.55
5516,-1.55
5517,-1.68
5518,-1.95
5519,-2.22
5520,-2.26
5521,-1.97
5522,-1.48
5523,-1.01
5524,-0.76
5525,-0.76
5526,-0.91
5527,-1.01
5528,-0.93
5529,-0.70
5530,-0.50
5531,-0.50
5532,-0.71
5533,-0.99
5534,-1.16
5535,-1.24
5536,-1.33
5537,-1.52
5538,-1.69
5539,-1.66
5540,-1.36
5541,-0.96
5542,-0.74
5543,-0.82
5544,-1.05
5545,-1.22
5546,-1.25
5547,-1.25
5548,-1.35
5549,-1.54
5550,-1.70
5551,-1.74
5552,-1.62
5553,-1.37
5554,-1.05
5555,-0.75
5556,-0.58
5557,-0.56
5558,-0.54
5559,-0.39
5560,-0.10
5561,0.12
5562,0.16
5563,0.12
5564,0.25
5565,0.56
5566,0.85
5567,0.89
5568,0.71
5569,0.53
5570,0.47
5571,0.40
5572,0.18
5573,-0.12
5574,-0.21
5575,0.05
5576,0.48
5577,0.75
5578,0.69
5579,0.51
5580,0.45
5581,0.63
5582,0.88
5583,1.01
5584,0.92
5585,0.66
5586,0.33
5587,0.04
5588,-0.07
5589,0.11
5590,0.53
5591,0.93
5592,1.06
5593,0.89
5594,0.67
5595,0.60
5596,0.70
5597,0.77
5598,0.67
5599,0.43
5600,0.14
5601,-0.14
5602,-0.38
5603,-0.53
5604,-0.57
5605,-0.47
5606,-0.30
5607,-0.14
5608,-0.04
5609,0.01
5610,-0.03
5611,-0.21
5612,-0.52
5613,-0.84
5614,-0.99
5615,-0.85
5616,-0.54
5617,-0.26
5618,-0.19
5619,-0.33
5620,-0.52
5621,-0.61
5622,-0.58
5623,-0.59
5624,-0.76
5625,-1.05
5626,-1.26
5627,-1.18
5628,-0.90
5629,-0.69
5630,-0.75
5631,-0.97
5632,-1.08
5633,-0.95
5634,-0.74
5635,-0.71
5636,-0.92
5637,-1.18
5638,-1.30
5639,-1.25
5640,-1.16
5641,-1.19
5642,-1.37
5643,-1.63
5644,-1.84
5645,-1.82
5646,-1.50
5647,-0.97
5648,-0.53
5649,-0.44
5650,-0.73
5651,-1.14
5652,-1.39
5653,-1.46
5654,-1.56
5655,-1.85
5656,-2.23
5657,-2.39
5658,-2.21
5659,-1.90
5660,-1.81
5661,-2.02
5662,-2.24
5663,-2.10
5664,-1.61
5665,-1.14
5666,-1.07
5667,-1.40
5668,-1.76
5669,-1.82
5670,-1.62
5671,-1.54
5672,-1.80
5673,-2.21
5674,-2.39
5675,-2.15
5676,-1.72
5677,-1.45
5678,-1.47
5679,-1.65
5680,-1.71
5681,-1.53
5682,-1.25
5683,-1.14
5684,-1.39
5685,-1.85
5686,-2.23
5687,-2.36
5688,-2.31
5689,-2.24
5690,-2.23
5691,-2.22
5692,-2.16
5693,-2.00
5694,-1.75
5695,-1.48
5696,-1.33
5697,-1.43
5698,-1.75
5699,-2.10
5700,-2.22
5701,-2.11
5702,-1.97
5703,-2.05
5704,-2.31
5705,-2.46
5706,-2.24
5707,-1.79
5708,-1.39
5709,-1.18
5710,-1.04
5711,-0.84
5712,-0.63
5713,-0.52
5714,-0.47
5715,-0.32
5716,-0.01
5717,0.30
5718,0.34
5719,0.05
5720,-0.40
5721,-0.69
5722,-0.69
5723,-0.49
5724,-0.29
5725,-0.28
5726,-0.42
5727,-0.54
5728,-0.53
5729,-0.46
5730,-0.52
5731,-0.76
5732,-1.02
5733,-1.10
5734,-1.00
5735,-0.91
5736,-0.99
5737,-1.17
5738,-1.28
5739,-1.18
5740,-0.95
5741,-0.78
5742,-0.77
5743,-0.83
5744,-0.85
5745,-0.93
5746,-1.20
5747,-1.63
5748,-1.95
5749,-1.99
5750,-1.82
5751,-1.67
5752,-1.62
5753,-1.51
5754,-1.21
5755,-0.82
5756,-0.62
5757,-0.77
5758,-1.12
5759,-1.37
5760,-1.38
5761,-1.26
5762,-1.21
5763,-1.29
5764,-1.40
5765,-1.51
5766,-1.61
5767,-1.65
5768,-1.51
5769,-1.17
5770,-0.85
5771,-0.80
5772,-1.07
5773,-1.37
5774,-1.47
5775,-1.42
5776,-1.50
5777,-1.82
5778,-2.12
5779,-2.06
5780,-1.61
5781,-1.09
5782,-0.85
5783,-0.96
5784,-1.22
5785,-1.39
5786,-1.46
5787,-1.52
5788,-1.66
5789,-1.83
5790,-1.87
5791,-1.70
5792,-1.40
5793,-1.20
5794,-1.27
5795,-1.56
5796,-1.79
5797,-1.80
5798,-1.62
5799,-1.47
5800,-1.46
5801,-1.54
5802,-1.58
5803,-1.56
5804,-1.50
5805,-1.44
5806,-1.33
5807,-1.13
5808,-0.95
5809,-0.93
5810,-1.11
5811,-1.36
5812,-1.45
5813,-1.26
5814,-0.90
5815,-0.60
5816,-0.57
5817,-0.85
5818,-1.23
5819,-1.36
5820,-1.10
5821,-0.69
5822,-0.56
5823,-0.85
5824,-1.26
5825,-1.35
5826,-1.03
5827,-0.64
5828,-0.52
5829,-0.74
5830,-1.03
5831,-1.14
5832,-1.07
5833,-0.96
5834,-0.90
5835,-0.83
5836,-0.69
5837,-0.54
5838,-0.52
5839,-0.66
5840,-0.84
5841,-0.94
5842,-0.97
5843,-0.99
5844,-1.08
5845,-1.17
5846,-1.21
5847,-1.15
5848,-1.00
5849,-0.82
5850,-0.67
5851,-0.61
5852,-0.61
5853,-0.62
5854,-0.57
5855,-0.46
5856,-0.39
5857,-0.43
5858,-0.54
5859,-0.58
5860,-0.42
5861,-0.14
5862,0.07
5863,0.07
5864,-0.09
5865,-0.32
5866,-0.53
5867,-0.71
5868,-0.84
5869,-0.89
5870,-0.84
5871,-0.72
5872,-0.60
5873,-0.53
5874,-0.52
5875,-0.61
5876,-0.78
5877,-0.88
5878,-0.74
5879,-0.34
5880,0.11
5881,0.33
5882,0.28
5883,0.17
5884,0.23
5885,0.44
5886,0.60
5887,0.60
5888,0.47
5889,0.32
5890,0.11
5891,-0.16
5892,-0.41
5893,-0.48
5894,-0.32
5895,-0.08
5896,0.04
5897,-0.02
5898,-0.21
5899,-0.37
5900,-0.41
5901,-0.31
5902,-0.07
5903,0.29
5904,0.68
5905,0.99
5906,1.11
5907,0.99
5908,0.74
5909,0.50
5910,0.43
5911,0.54
5912,0.76
5913,0.98
5914,1.13
5915,1.19
5916,1.18
5917,1.08
5918,0.92
5919,0.74
5920,0.65
5921,0.74
5922,0.97
5923,1.24
5924,1.42
5925,1.50
5926,1.54
5927,1.57
5928,1.60
5929,1.63
5930,1.68
5931,1.76
5932,1.84
5933,1.80
5934,1.60
5935,1.25
5936,0.88
5937,0.58
5938,0.41
5939,0.41
5940,0.59
5941,0.94
5942,1.30
5943,1.47
5944,1.34
5945,1.05
5946,0.94
5947,1.24
5948,1.77
5949,2.10
5950,1.93
5951,1.38
5952,0.89
5953,0.77
5954,0.93
5955,1.03
5956,0.86
5957,0.56
5958,0.49
5959,0.80
5960,1.26
5961,1.50
5962,1.41
5963,1.30
5964,1.49
5965,1.87
5966,2.06
5967,1.81
5968,1.40
5969,1.27
5970,1.51
5971,1.82
5972,1.87
5973,1.71
5974,1.70
5975,1.99
5976,2.35
5977,2.42
5978,2.17
5979,1.98
5980,2.13
5981,2.42
5982,2.46
5983,2.16
5984,1.86
5985,1.91
5986,2.19
5987,2.26
5988,1.95
5989,1.54
5990,1.41
5991,1.67
5992,2.04
5993,2.22
5994,2.22
5995,2.26
5996,2.46
5997,2.67
5998,2.69
5999,2.52
6000,2.35
6001,2.38
6002,2.59
6003,2.78
6004,2.78
6005,2.58
6006,2.33
6007,2.14
6008,2.05
6009,2.04
6010,2.08
6011,2.18
6012,2.28
6013,2.29
6014,2.17
6015,2.03
6016,2.03
6017,2.15
6018,2.22
6019,2.09
6020,1.86
6021,1.83
6022,2.07
6023,2.34
6024,2.32
6025,2.00
6026,1.70
6027,1.74
6028,2.06
6029,2.38
6030,2.48
6031,2.37
6032,2.19
6033,2.06
6034,1.98
6035,1.87
6036,1.67
6037,1.47
6038,1.42
6039,1.58
6040,1.83
6041,2.00
6042,2.00
6043,1.85
6044,1.68
6045,1.61
6046,1.64
6047,1.75
6048,1.90
6049,2.10
6050,2.33
6051,2.49
6052,2.49
6053,2.38
6054,2.24
6055,2.13
6056,1.99
6057,1.76
6058,1.51
6059,1.42
6060,1.58
6061,1.93
6062,2.17
6063,2.08
6064,1.65
6065,1.17
6066,0.99
6067,1.20
6068,1.53
6069,1.64
6070,1.41
6071,1.07
6072,0.92
6073,1.09
6074,1.37
6075,1.51
6076,1.48
6077,1.46
6078,1.65
6079,1.99
6080,2.25
6081,2.29
6082,2.14
6083,1.88
6084,1.55
6085,1.16
6086,0.79
6087,0.60
6088,0.63
6089,0.75
6090,0.76
6091,0.62
6092,0.51
6093,0.63
6094,0.89
6095,1.01
6096,0.84
6097,0.55
6098,0.47
6099,0.69
6100,0.97
6101,1.04
6102,0.94
6103,0.87
6104,0.90
6105,0.90
6106,0.71
6107,0.38
6108,0.14
6109,0.20
6110,0.50
6111,0.83
6112,1.09
6113,1.26
6114,1.34
6115,1.18
6116,0.75
6117,0.25
6118,-0.01
6119,0.11
6120,0.44
6121,0.71
6122,0.77
6123,0.69
6124,0.54
6125,0.39
6126,0.26
6127,0.18
6128,0.18
6129,0.23
6130,0.24
6131,0.13
6132,-0.07
6133,-0.27
6134,-0.33
6135,-0.20
6136,0.02
6137,0.16
6138,0.10
6139,-0.05
6140,-0.08
6141,0.11
6142,0.37
6143,0.38
6144,0.03
6145,-0.48
6146,-0.72
6147,-0.44
6148,0.18
6149,0.68
6150,0.73
6151,0.46
6152,0.16
6153,0.01
6154,-0.14
6155,-0.43
6156,-0.76
6157,-0.85
6158,-0.59
6159,-0.20
6160,-0.04
6161,-0.24
6162,-0.62
6163,-0.87
6164,-0.85
6165,-0.62
6166,-0.36
6167,-0.12
6168,0.09
6169,0.16
6170,-0.03
6171,-0.39
6172,-0.62
6173,-0.46
6174,-0.03
6175,0.27
6176,0.19
6177,-0.16
6178,-0.42
6179,-0.48
6180,-0.49
6181,-0.62
6182,-0.81
6183,-0.85
6184,-0.70
6185,-0.53
6186,-0.47
6187,-0.52
6188,-0.54
6189,-0.44
6190,-0.26
6191,-0.14
6192,-0.11
6193,-0.09
6194,0.04
6195,0.25
6196,0.45
6197,0.53
6198,0.48
6199,0.33
6200,0.16
6201,0.03
6202,-0.03
6203,-0.04
6204,-0.04
6205,-0.11
6206,-0.22
6207,-0.23
6208,-0.08
6209,0.18
6210,0.38
6211,0.40
6212,0.27
6213,0.10
6214,-0.01
6215,-0.01
6216,0.12
6217,0.29
6218,0.34
6219,0.12
6220,-0.32
6221,-0.75
6222,-0.93
6223,-0.85
6224,-0.75
6225,-0.79
6226,-0.94
6227,-1.02
6228,-0.94
6229,-0.79
6230,-0.62
6231,-0.43
6232,-0.25
6233,-0.26
6234,-0.60
6235,-1.11
6236,-1.40
6237,-1.20
6238,-0.69
6239,-0.30
6240,-0.30
6241,-0.63
6242,-1.07
6243,-1.48
6244,-1.79
6245,-1.86
6246,-1.60
6247,-1.10
6248,-0.67
6249,-0.59
6250,-0.87
6251,-1.21
6252,-1.35
6253,-1.24
6254,-0.98
6255,-0.69
6256,-0.38
6257,-0.18
6258,-0.21
6259,-0.53
6260,-0.91
6261,-0.97
6262,-0.60
6263,-0.07
6264,0.22
6265,0.15
6266,-0.05
6267,-0.07
6268,0.06
6269,0.07
6270,-0.23
6271,-0.65
6272,-0.86
6273,-0.75
6274,-0.54
6275,-0.53
6276,-0.77
6277,-1.10
6278,-1.33
6279,-1.37
6280,-1.22
6281,-0.98
6282,-0.80
6283,-0.83
6284,-1.08
6285,-1.37
6286,-1.49
6287,-1.45
6288,-1.41
6289,-1.43
6290,-1.34
6291,-1.01
6292,-0.56
6293,-0.34
6294,-0.49
6295,-0.80
6296,-0.96
6297,-0.85
6298,-0.70
6299,-0.70
6300,-0.79
6301,-0.80
6302,-0.70
6303,-0.69
6304,-0.94
6305,-1.38
6306,-1.76
6307,-1.89
6308,-1.75
6309,-1.43
6310,-1.03
6311,-0.64
6312,-0.40
6313,-0.37
6314,-0.45
6315,-0.40
6316,-0.11
6317,0.23
6318,0.33
6319,0.08
6320,-0.31
6321,-0.54
6322,-0.50
6323,-0.29
6324,-0.06
6325,0.13
6326,0.31
6327,0.45
6328,0.45
6329,0.21
6330,-0.19
6331,-0.56
6332,-0.69
6333,-0.50
6334,-0.13
6335,0.16
6336,0.23
6337,0.16
6338,0.14
6339,0.23
6340,0.34
6341,0.31
6342,0.15
6343,0.01
6344,0.02
6345,0.19
6346,0.45
6347,0.71
6348,0.94
6349,1.12
6350,1.25
6351,1.29
6352,1.14
6353,0.75
6354,0.21
6355,-0.20
6356,-0.19
6357,0.26
6358,0.86
6359,1.19
6360,1.11
6361,0.82
6362,0.65
6363,0.70
6364,0.85
6365,0.91
6366,0.83
6367,0.74
6368,0.74
6369,0.79
6370,0.82
6371,0.84
6372,0.92
6373,1.06
6374,1.12
6375,0.94
6376,0.57
6377,0.24
6378,0.26
6379,0.69
6380,1.28
6381,1.65
6382,1.65
6383,1.49
6384,1.42
6385,1.48
6386,1.42
6387,1.14
6388,0.85
6389,0.92
6390,1.37
6391,1.77
6392,1.64
6393,0.96
6394,0.24
6395,0.11
6396,0.61
6397,1.22
6398,1.40
6399,1.10
6400,0.76
6401,0.77
6402,1.08
6403,1.30
6404,1.22
6405,1.05
6406,1.06
6407,1.28
6408,1.39
6409,1.15
6410,0.70
6411,0.51
6412,0.78
6413,1.19
6414,1.29
6415,0.99
6416,0.67
6417,0.69
6418,1.03
6419,1.31
6420,1.32
6421,1.08
6422,0.79
6423,0.57
6424,0.41
6425,0.29
6426,0.26
6427,0.35
6428,0.54
6429,0.78
6430,1.01
6431,1.14
6432,1.11
6433,0.94
6434,0.71
6435,0.53
6436,0.52
6437,0.69
6438,0.98
6439,1.26
6440,1.41
6441,1.38
6442,1.20
6443,0.97
6444,0.80
6445,0.73
6446,0.73
6447,0.75
6448,0.80
6449,0.94
6450,1.14
6451,1.27
6452,1.26
6453,1.14
6454,1.07
6455,1.16
6456,1.35
6457,1.44
6458,1.31
6459,1.01
6460,0.74
6461,0.70
6462,0.93
6463,1.32
6464,1.70
6465,1.84
6466,1.72
6467,1.50
6468,1.44
6469,1.63
6470,1.90
6471,2.00
6472,1.82
6473,1.50
6474,1.28
6475,1.34
6476,1.59
6477,1.78
6478,1.72
6479,1.46
6480,1.24
6481,1.22
6482,1.34
6483,1.43
6484,1.39
6485,1.22
6486,0.98
6487,0.74
6488,0.58
6489,0.59
6490,0.79
6491,1.01
6492,0.98
6493,0.57
6494,-0.06
6495,-0.48
6496,-0.38
6497,0.14
6498,0.67
6499,0.87
6500,0.71
6501,0.40
6502,0.12
6503,-0.03
6504,-0.01
6505,0.17
6506,0.37
6507,0.40
6508,0.18
6509,-0.17
6510,-0.36
6511,-0.23
6512,0.08
6513,0.29
6514,0.23
6515,-0.01
6516,-0.26
6517,-0.38
6518,-0.29
6519,0.02
6520,0.42
6521,0.63
6522,0.41
6523,-0.16
6524,-0.68
6525,-0.80
6526,-0.54
6527,-0.23
6528,-0.13
6529,-0.18
6530,-0.14
6531,0.07
6532,0.27
6533,0.25
6534,0.11
6535,0.06
6536,0.19
6537,0.30
6538,0.23
6539,0.11
6540,0.18
6541,0.43
6542,0.62
6543,0.60
6544,0.48
6545,0.46
6546,0.51
6547,0.48
6548,0.31
6549,0.15
6550,0.17
6551,0.36
6552,0.56
6553,0.68
6554,0.72
6555,0.71
6556,0.66
6557,0.59
6558,0.55
6559,0.63
6560,0.75
6561,0.75
6562,0.59
6563,0.40
6564,0.23
6565,-0.15
6566,-0.92
6567,-1.83
6568,-2.28
6569,-1.88
6570,-0.92
6571,-0.05
6572,0.29
6573,0.20
6574,0.06
6575,0.12
6576,0.31
6577,0.43
6578,0.37
6579,0.14
6580,-0.18
6581,-0.46
6582,-0.58
6583,-0.47
6584,-0.24
6585,-0.13
6586,-0.29
6587,-0.57
6588,-0.68
6589,-0.45
6590,-0.07
6591,0.11
6592,-0.06
6593,-0.36
6594,-0.44
6595,-0.23
6596,-0.05
6597,-0.24
6598,-0.74
6599,-1.11
6600,-0.96
6601,-0.45
6602,-0.08
6603,-0.20
6604,-0.63
6605,-0.88
6606,-0.71
6607,-0.38
6608,-0.30
6609,-0.58
6610,-0.93
6611,-1.02
6612,-0.82
6613,-0.58
6614,-0.56
6615,-0.78
6616,-1.01
6617,-1.00
6618,-0.71
6619,-0.40
6620,-0.37
6621,-0.64
6622,-0.99
6623,-1.13
6624,-1.05
6625,-0.91
6626,-0.85
6627,-0.85
6628,-0.79
6629,-0.65
6630,-0.60
6631,-0.70
6632,-0.91
6633,-0.97
6634,-0.80
6635,-0.52
6636,-0.50
6637,-0.90
6638,-1.63
6639,-2.36
6640,-2.91
6641,-3.29
6642,-3.59
6643,-3.82
6644,-3.89
6645,-3.77
6646,-3.64
6647,-3.71
6648,-4.06
6649,-4.48
6650,-4.78
6651,-4.90
6652,-4.95
6653,-4.97
6654,-4.93
6655,-4.77
6656,-4.59
6657,-4.53
6658,-4.61
6659,-4.74
6660,-4.87
6661,-5.05
6662,-5.36
6663,-5.68
6664,-5.84
6665,-5.79
6666,-5.68
6667,-5.64
6668,-5.65
6669,-5.59
6670,-5.40
6671,-5.16
6672,-4.96
6673,-4.80
6674,-4.70
6675,-4.78
6676,-5.16
6677,-5.74
6678,-6.16
6679,-6.08
6680,-5.55
6681,-4.97
6682,-4.73
6683,-4.92
6684,-5.30
6685,-5.59
6686,-5.67
6687,-5.55
6688,-5.39
6689,-5.35
6690,-5.50
6691,-5.71
6692,-5.73
6693,-5.54
6694,-5.35
6695,-5.39
6696,-5.62
6697,-5.70
6698,-5.41
6699,-4.88
6700,-4.47
6701,-4.43
6702,-4.69
6703,-4.96
6704,-5.00
6705,-4.83
6706,-4.55
6707,-4.34
6708,-4.29
6709,-4.43
6710,-4.73
6711,-5.09
6712,-5.34
6713,-5.35
6714,-5.13
6715,-4.86
6716,-4.72
6717,-4.82
6718,-5.00
6719,-4.99
6720,-4.54
6721,-3.70
6722,-2.76
6723,-2.10
6724,-1.84
6725,-1.76
6726,-1.64
6727,-1.52
6728,-1.55
6729,-1.71
6730,-1.69
6731,-1.31
6732,-0.83
6733,-0.81
6734,-1.51
6735,-2.60
6736,-3.43
6737,-3.67
6738,-3.59
6739,-3.70
6740,-4.18
6741,-4.71
6742,-4.91
6743,-4.69
6744,-4.36
6745,-4.21
6746,-4.28
6747,-4.42
6748,-4.54
6749,-4.62
6750,-4.66
6751,-4.62
6752,-4.55
6753,-4.56
6754,-4.74
6755,-5.00
6756,-5.11
6757,-4.95
6758,-4.62
6759,-4.39
6760,-4.34
6761,-4.37
6762,-4.28
6763,-4.07
6764,-3.90
6765,-3.95
6766,-4.16
6767,-4.33
6768,-4.29
6769,-4.06
6770,-3.81
6771,-3.75
6772,-3.91
6773,-4.17
6774,-4.33
6775,-4.35
6776,-4.32
6777,-4.30
6778,-4.28
6779,-4.21
6780,-4.10
6781,-4.01
6782,-4.04
6783,-4.17
6784,-4.34
6785,-4.50
6786,-4.56
6787,-4.49
6788,-4.31
6789,-4.17
6790,-4.17
6791,-4.28
6792,-4.32
6793,-4.21
6794,-4.02
6795,-3.91
6796,-3.83
6797,-3.63
6798,-3.20
6799,-2.76
6800,-2.55
6801,-2.64
6802,-2.80
6803,-2.78
6804,-2.54
6805,-2.26
6806,-2.08
6807,-2.00
6808,-1.96
6809,-1.97
6810,-2.08
6811,-2.25
6812,-2.35
6813,-2.32
6814,-2.22
6815,-2.17
6816,-2.16
6817,-2.08
6818,-1.88
6819,-1.66
6820,-1.55
6821,-1.61
6822,-1.77
6823,-1.92
6824,-1.97
6825,-1.82
6826,-1.49
6827,-1.21
6828,-1.23
6829,-1.56
6830,-1.92
6831,-2.08
6832,-2.06
6833,-2.07
6834,-2.16
6835,-2.19
6836,-2.03
6837,-1.79
6838,-1.72
6839,-1.91
6840,-2.15
6841,-2.08
6842,-1.66
6843,-1.18
6844,-0.93
6845,-0.84
6846,-0.68
6847,-0.44
6848,-0.34
6849,-0.49
6850,-0.78
6851,-0.99
6852,-1.14
6853,-1.39
6854,-1.71
6855,-1.88
6856,-1.70
6857,-1.32
6858,-1.12
6859,-1.32
6860,-1.75
6861,-2.00
6862,-1.91
6863,-1.70
6864,-1.64
6865,-1.72
6866,-1.63
6867,-1.22
6868,-0.75
6869,-0.67
6870,-1.13
6871,-1.73
6872,-1.92
6873,-1.46
6874,-0.70
6875,-0.26
6876,-0.40
6877,-0.84
6878,-1.13
6879,-1.12
6880,-1.02
6881,-1.10
6882,-1.34
6883,-1.53
6884,-1.60
6885,-1.64
6886,-1.71
6887,-1.66
6888,-1.37
6889,-0.96
6890,-0.76
6891,-0.95
6892,-1.34
6893,-1.56
6894,-1.48
6895,-1.31
6896,-1.29
6897,-1.48
6898,-1.70
6899,-1.77
6900,-1.64
6901,-1.39
6902,-1.15
6903,-1.05
6904,-1.10
6905,-1.18
6906,-1.14
6907,-0.95
6908,-0.83
6909,-1.00
6910,-1.44
6911,-1.86
6912,-2.02
6913,-1.97
6914,-1.97
6915,-2.17
6916,-2.43
6917,-2.55
6918,-2.47
6919,-2.29
6920,-2.07
6921,-1.82
6922,-1.58
6923,-1.44
6924,-1.43
6925,-1.45
6926,-1.31
6927,-0.98
6928,-0.63
6929,-0.50
6930,-0.63
6931,-0.88
6932,-1.08
6933,-1.22
6934,-1.35
6935,-1.46
6936,-1.51
6937,-1.45
6938,-1.36
6939,-1.33
6940,-1.32
6941,-1.20
6942,-0.91
6943,-0.61
6944,-0.55
6945,-0.80
6946,-1.19
6947,-1.45
6948,-1.51
6949,-1.54
6950,-1.70
6951,-1.93
6952,-2.04
6953,-1.91
6954,-1.70
6955,-1.58
6956,-1.52
6957,-1.30
6958,-0.81
6959,-0.22
6960,0.16
6961,0.21
6962,0.13
6963,0.14
6964,0.24
6965,0.23
6966,0.00
6967,-0.31
6968,-0.43
6969,-0.29
6970,-0.02
6971,0.15
6972,0.17
6973,0.19
6974,0.36
6975,0.66
6976,1.01
6977,1.38
6978,1.77
6979,2.14
6980,2.36
6981,2.38
6982,2.32
6983,2.38
6984,2.60
6985,2.74
6986,2.41
6987,1.48
6988,0.27
6989,-0.53
6990,-0.49
6991,0.24
6992,1.01
6993,1.34
6994,1.26
6995,1.15
6996,1.20
6997,1.21
6998,0.89
6999,0.32
7000,-0.16
7001,-0.26
7002,-0.13
7003,-0.07
7004,-0.25
7005,-0.50
7006,-0.63
7007,-0.62
7008,-0.58
7009,-0.55
7010,-0.54
7011,-0.51
7012,-0.54
7013,-0.60
7014,-0.63
7015,-0.62
7016,-0.68
7017,-0.93
7018,-1.24
7019,-1.35
7020,-1.13
7021,-0.77
7022,-0.66
7023,-0.95
7024,-1.42
7025,-1.69
7026,-1.62
7027,-1.35
7028,-1.14
7029,-1.05
7030,-1.03
7031,-0.97
7032,-0.81
7033,-0.52
7034,-0.14
7035,0.13
7036,0.09
7037,-0.26
7038,-0.67
7039,-0.86
7040,-0.79
7041,-0.67
7042,-0.67
7043,-0.75
7044,-0.82
7045,-0.89
7046,-1.04
7047,-1.25
7048,-1.28
7049,-0.96
7050,-0.51
7051,-0.38
7052,-0.83
7053,-1.51
7054,-1.80
7055,-1.43
7056,-0.75
7057,-0.39
7058,-0.56
7059,-0.92
7060,-1.07
7061,-0.97
7062,-0.95
7063,-1.19
7064,-1.53
7065,-1.62
7066,-1.45
7067,-1.28
7068,-1.34
7069,-1.54
7070,-1.63
7071,-1.52
7072,-1.41
7073,-1.45
7074,-1.58
7075,-1.63
7076,-1.64
7077,-1.80
7078,-2.16
7079,-2.48
7080,-2.47
7081,-2.12
7082,-1.78
7083,-1.73
7084,-1.91
7085,-2.09
7086,-2.10
7087,-1.98
7088,-1.85
7089,-1.76
7090,-1.74
7091,-1.89
7092,-2.25
7093,-2.62
7094,-2.74
7095,-2.56
7096,-2.33
7097,-2.34
7098,-2.53
7099,-2.57
7100,-2.29
7101,-1.96
7102,-1.94
7103,-2.26
7104,-2.59
7105,-2.64
7106,-2.43
7107,-2.17
7108,-2.00
7109,-1.99
7110,-2.23
7111,-2.77
7112,-3.49
7113,-4.04
7114,-4.12
7115,-3.74
7116,-3.21
7117,-2.90
7118,-2.85
7119,-2.82
7120,-2.64
7121,-2.37
7122,-2.22
7123,-2.28
7124,-2.40
7125,-2.40
7126,-2.27
7127,-2.12
7128,-2.05
7129,-2.08
7130,-2.21
7131,-2.47
7132,-2.84
7133,-3.19
7134,-3.31
7135,-3.09
7136,-2.66
7137,-2.27
7138,-2.16
7139,-2.35
7140,-2.67
7141,-2.88
7142,-2.89
7143,-2.80
7144,-2.75
7145,-2.74
7146,-2.68
7147,-2.56
7148,-2.37
7149,-2.15
7150,-1.86
7151,-1.61
7152,-1.57
7153,-1.85
7154,-2.32
7155,-2.71
7156,-2.81
7157,-2.64
7158,-2.36
7159,-2.07
7160,-1.79
7161,-1.55
7162,-1.51
7163,-1.75
7164,-2.19
7165,-2.46
7166,-2.38
7167,-2.15
7168,-2.20
7169,-2.69
7170,-3.30
7171,-3.60
7172,-3.51
7173,-3.29
7174,-3.23
7175,-3.28
7176,-3.26
7177,-3.08
7178,-2.91
7179,-2.96
7180,-3.23
7181,-3.47
7182,-3.44
7183,-3.15
7184,-2.80
7185,-2.64
7186,-2.77
7187,-3.07
7188,-3.34
7189,-3.41
7190,-3.22
7191,-2.94
7192,-2.73
7193,-2.90
7194,-2.89
7195,-2.44
7196,-2.05
7197,-3.07
7198,-4.61
7199,-3.52
7200,-0.18
