1,146.30
2,219.81
3,238.37
4,228.50
5,225.00
6,229.23
7,220.78
8,193.13
9,152.34
10,106.81
11,59.36
12,17.50
13,-11.29
14,-19.87
15,-6.59
16,26.11
17,74.09
18,127.16
19,175.21
20,207.95
21,226.21
22,232.58
23,230.66
24,217.24
25,191.53
26,155.15
27,112.45
28,66.17
29,18.96
30,-25.66
31,-62.39
32,-88.12
33,-100.23
34,-100.88
35,-91.84
36,-79.09
37,-65.77
38,-56.73
39,-52.09
40,-52.55
41,-55.23
42,-58.71
43,-60.65
44,-60.62
45,-58.72
46,-55.79
47,-53.13
48,-51.30
49,-50.81
50,-51.22
51,-52.15
52,-53.03
53,-53.57
54,-53.70
55,-53.53
56,-53.24
57,-53.05
58,-53.05
59,-53.28
60,-53.63
61,-54.00
62,-54.32
63,-54.54
64,-54.66
65,-54.70
66,-54.70
67,-54.67
68,-54.61
69,-54.50
70,-54.35
71,-54.19
72,-54.04
73,-53.90
74,-53.76
75,-53.60
76,-53.43
77,-53.25
78,-53.05
79,-52.88
80,-52.73
81,-52.64
82,-52.63
83,-52.71
84,-52.86
85,-53.06
86,-53.25
87,-53.38
88,-53.32
89,-53.07
90,-52.54
91,-51.83
92,-50.96
93,-50.05
94,-49.14
95,-48.36
96,-47.65
97,-47.09
98,-46.56
99,-46.12
100,-45.60
101,-45.07
102,-44.37
103,-43.62
104,-42.73
105,-41.83
106,-40.83
107,-39.88
108,-38.89
109,-37.99
110,-37.08
111,-36.27
112,-35.48
113,-34.77
114,-34.01
115,-33.28
116,-32.49
117,-31.75
118,-30.97
119,-30.25
120,-29.53
121,-28.94
122,-28.40
123,-27.97
124,-27.57
125,-27.23
126,-26.87
127,-26.52
128,-26.15
129,-25.79
130,-25.45
131,-25.18
132,-25.01
133,-24.97
134,-25.05
135,-25.25
136,-25.54
137,-25.86
138,-26.16
139,-26.46
140,-26.70
141,-26.85
142,-26.87
143,-26.78
144,-26.62
145,-26.42
146,-26.18
147,-25.93
148,-25.72
149,-25.57
150,-25.46
151,-25.37
152,-25.29
153,-25.23
154,-25.19
155,-25.18
156,-25.18
157,-25.22
158,-25.28
159,-25.37
160,-25.47
161,-25.58
162,-25.66
163,-25.66
164,-25.57
165,-25.39
166,-25.20
167,-25.00
168,-24.88
169,-24.82
170,-24.91
171,-25.15
172,-25.59
173,-26.16
174,-26.84
175,-27.55
176,-28.27
177,-28.95
178,-29.55
179,-30.01
180,-30.39
181,-30.64
182,-30.85
183,-31.02
184,-31.21
185,-31.39
186,-31.59
187,-31.77
188,-31.95
189,-32.09
190,-32.19
191,-32.23
192,-32.25
193,-32.27
194,-32.32
195,-32.36
196,-32.42
197,-32.47
198,-32.52
199,-32.53
200,-32.53
201,-32.52
202,-32.55
203,-32.62
204,-32.75
205,-32.91
206,-33.11
207,-33.30
208,-33.49
209,-33.63
210,-33.74
211,-33.84
212,-33.92
213,-34.00
214,-34.10
215,-34.24
216,-34.42
217,-34.60
218,-34.74
219,-34.80
220,-34.79
221,-34.72
222,-34.62
223,-34.50
224,-34.38
225,-34.25
226,-34.16
227,-34.15
228,-34.21
229,-34.32
230,-34.48
231,-34.62
232,-34.79
233,-34.94
234,-35.11
235,-35.28
236,-35.51
237,-35.80
238,-36.18
239,-36.62
240,-37.16
241,-37.74
242,-38.39
243,-39.01
244,-39.62
245,-40.15
246,-40.64
247,-41.05
248,-41.44
249,-41.76
250,-42.08
251,-42.36
252,-42.63
253,-42.84
254,-43.07
255,-43.27
256,-43.51
257,-43.70
258,-43.91
259,-44.11
260,-44.34
261,-44.58
262,-44.90
263,-45.31
264,-45.86
265,-46.49
266,-47.21
267,-47.97
268,-48.78
269,-49.55
270,-50.24
271,-50.76
272,-51.15
273,-51.40
274,-51.57
275,-51.65
276,-51.70
277,-51.73
278,-51.80
279,-51.85
280,-51.90
281,-51.93
282,-51.96
283,-51.96
284,-51.96
285,-51.96
286,-51.99
287,-52.06
288,-52.17
289,-52.33
290,-52.51
291,-52.70
292,-52.82
293,-52.84
294,-52.74
295,-52.54
296,-52.20
297,-51.80
298,-51.37
299,-50.97
300,-50.59
301,-50.28
302,-49.99
303,-49.75
304,-49.48
305,-49.15
306,-48.68
307,-48.17
308,-47.61
309,-47.07
310,-46.50
311,-45.97
312,-45.46
313,-45.02
314,-44.56
315,-44.10
316,-43.59
317,-43.08
318,-42.50
319,-41.96
320,-41.39
321,-40.92
322,-40.48
323,-40.12
324,-39.70
325,-39.28
326,-38.75
327,-38.15
328,-37.36
329,-36.46
330,-35.38
331,-34.27
332,-33.07
333,-31.94
334,-30.82
335,-29.83
336,-28.88
337,-28.07
338,-27.24
339,-26.47
340,-25.64
341,-24.83
342,-23.97
343,-23.21
344,-22.48
345,-21.88
346,-21.35
347,-21.01
348,-20.77
349,-20.65
350,-20.46
351,-20.23
352,-19.84
353,-19.38
354,-18.76
355,-18.09
356,-17.36
357,-16.69
358,-16.02
359,-15.45
360,-14.89
361,-14.38
362,-13.77
363,-13.09
364,-12.25
365,-11.39
366,-10.47
367,-9.60
368,-8.76
369,-8.03
370,-7.41
371,-6.97
372,-6.64
373,-6.41
374,-6.19
375,-5.97
376,-5.75
377,-5.55
378,-5.39
379,-5.29
380,-5.28
381,-5.41
382,-5.70
383,-6.11
384,-6.65
385,-7.23
386,-7.83
387,-8.36
388,-8.82
389,-9.16
390,-9.43
391,-9.64
392,-9.83
393,-10.05
394,-10.37
395,-10.77
396,-11.29
397,-11.83
398,-12.42
399,-12.97
400,-13.52
401,-13.97
402,-14.35
403,-14.63
404,-14.85
405,-14.99
406,-15.14
407,-15.33
408,-15.63
409,-16.03
410,-16.56
411,-17.12
412,-17.71
413,-18.20
414,-18.57
415,-18.75
416,-18.80
417,-18.75
418,-18.73
419,-18.77
420,-18.97
421,-19.30
422,-19.80
423,-20.33
424,-20.85
425,-21.24
426,-21.50
427,-21.60
428,-21.59
429,-21.52
430,-21.49
431,-21.54
432,-21.70
433,-21.90
434,-22.17
435,-22.41
436,-22.57
437,-22.61
438,-22.58
439,-22.55
440,-22.59
441,-22.72
442,-22.97
443,-23.35
444,-23.84
445,-24.41
446,-25.01
447,-25.53
448,-25.94
449,-26.24
450,-26.44
451,-26.57
452,-26.65
453,-26.66
454,-26.65
455,-26.64
456,-26.65
457,-26.66
458,-26.69
459,-26.72
460,-26.76
461,-26.79
462,-26.85
463,-26.92
464,-27.02
465,-27.10
466,-27.12
467,-27.08
468,-26.98
469,-26.82
470,-26.63
471,-26.45
472,-26.31
473,-26.24
474,-26.23
475,-26.27
476,-26.37
477,-26.50
478,-26.67
479,-26.84
480,-27.03
481,-27.21
482,-27.44
483,-27.72
484,-28.08
485,-28.53
486,-29.05
487,-29.59
488,-30.17
489,-30.69
490,-31.14
491,-31.48
492,-31.75
493,-31.95
494,-32.17
495,-32.40
496,-32.69
497,-33.00
498,-33.41
499,-33.87
500,-34.36
501,-34.80
502,-35.13
503,-35.32
504,-35.40
505,-35.39
506,-35.34
507,-35.29
508,-35.29
509,-35.35
510,-35.46
511,-35.60
512,-35.68
513,-35.65
514,-35.48
515,-35.19
516,-34.83
517,-34.45
518,-34.09
519,-33.75
520,-33.41
521,-33.06
522,-32.66
523,-32.23
524,-31.75
525,-31.26
526,-30.76
527,-30.33
528,-30.01
529,-29.88
530,-29.93
531,-30.17
532,-30.49
533,-30.85
534,-31.17
535,-31.42
536,-31.59
537,-31.66
538,-31.66
539,-31.60
540,-31.50
541,-31.40
542,-31.39
543,-31.48
544,-31.70
545,-32.01
546,-32.37
547,-32.76
548,-33.14
549,-33.44
550,-33.62
551,-33.67
552,-33.61
553,-33.46
554,-33.26
555,-33.06
556,-32.88
557,-32.76
558,-32.68
559,-32.64
560,-32.59
561,-32.55
562,-32.46
563,-32.33
564,-32.10
565,-31.78
566,-31.30
567,-30.68
568,-29.93
569,-29.18
570,-28.41
571,-27.74
572,-27.12
573,-26.63
574,-26.14
575,-25.70
576,-25.13
577,-24.51
578,-23.68
579,-22.77
580,-21.68
581,-20.58
582,-19.38
583,-18.29
584,-17.21
585,-16.28
586,-15.34
587,-14.46
588,-13.51
589,-12.60
590,-11.63
591,-10.70
592,-9.70
593,-8.77
594,-7.84
595,-7.07
596,-6.41
597,-5.93
598,-5.58
599,-5.39
600,-5.33
601,-5.42
602,-5.60
603,-5.87
604,-6.16
605,-6.48
606,-6.77
607,-7.02
608,-7.22
609,-7.33
610,-7.35
611,-7.29
612,-7.19
613,-7.09
614,-7.04
615,-7.03
616,-7.10
617,-7.26
618,-7.55
619,-7.96
620,-8.49
621,-9.07
622,-9.68
623,-10.24
624,-10.75
625,-11.17
626,-11.56
627,-11.89
628,-12.23
629,-12.57
630,-13.00
631,-13.53
632,-14.18
633,-14.86
634,-15.55
635,-16.15
636,-16.69
637,-17.10
638,-17.42
639,-17.62
640,-17.79
641,-17.90
642,-18.01
643,-18.07
644,-18.13
645,-18.14
646,-18.14
647,-18.10
648,-18.05
649,-18.02
650,-18.03
651,-18.07
652,-18.14
653,-18.19
654,-18.25
655,-18.31
656,-18.34
657,-18.33
658,-18.27
659,-18.17
660,-18.04
661,-17.86
662,-17.67
663,-17.49
664,-17.36
665,-17.32
666,-17.33
667,-17.36
668,-17.40
669,-17.43
670,-17.39
671,-17.30
672,-17.17
673,-17.02
674,-16.91
675,-16.85
676,-16.86
677,-16.90
678,-16.98
679,-17.04
680,-17.12
681,-17.20
682,-17.33
683,-17.49
684,-17.76
685,-18.13
686,-18.63
687,-19.21
688,-19.85
689,-20.47
690,-21.06
691,-21.60
692,-22.09
693,-22.51
694,-22.90
695,-23.24
696,-23.57
697,-23.86
698,-24.14
699,-24.35
700,-24.51
701,-24.57
702,-24.60
703,-24.57
704,-24.56
705,-24.55
706,-24.57
707,-24.59
708,-24.66
709,-24.72
710,-24.80
711,-24.86
712,-24.93
713,-25.02
714,-25.17
715,-25.38
716,-25.67
717,-25.99
718,-26.33
719,-26.66
720,-26.92
721,-27.08
722,-27.05
723,-26.85
724,-26.46
725,-25.97
726,-25.41
727,-24.88
728,-24.38
729,-24.00
730,-23.72
731,-23.55
732,-23.41
733,-23.25
734,-22.99
735,-22.69
736,-22.31
737,-21.89
738,-21.44
739,-21.02
740,-20.68
741,-20.47
742,-20.39
743,-20.42
744,-20.55
745,-20.76
746,-21.01
747,-21.25
748,-21.47
749,-21.66
750,-21.84
751,-22.02
752,-22.21
753,-22.45
754,-22.76
755,-23.12
756,-23.54
757,-23.96
758,-24.38
759,-24.73
760,-25.02
761,-25.22
762,-25.40
763,-25.57
764,-25.81
765,-26.06
766,-26.40
767,-26.79
768,-27.29
769,-27.82
770,-28.37
771,-28.85
772,-29.32
773,-29.75
774,-30.19
775,-30.59
776,-30.97
777,-31.32
778,-31.68
779,-32.03
780,-32.39
781,-32.71
782,-33.01
783,-33.27
784,-33.52
785,-33.72
786,-33.91
787,-34.04
788,-34.18
789,-34.27
790,-34.36
791,-34.41
792,-34.48
793,-34.58
794,-34.74
795,-34.90
796,-35.09
797,-35.26
798,-35.48
799,-35.69
800,-35.89
801,-36.03
802,-36.19
803,-36.35
804,-36.56
805,-36.76
806,-37.00
807,-37.23
808,-37.45
809,-37.61
810,-37.74
811,-37.85
812,-37.99
813,-38.15
814,-38.36
815,-38.60
816,-38.91
817,-39.25
818,-39.63
819,-39.98
820,-40.31
821,-40.59
822,-40.85
823,-41.07
824,-41.31
825,-41.53
826,-41.82
827,-42.14
828,-42.53
829,-42.92
830,-43.33
831,-43.72
832,-44.09
833,-44.43
834,-44.75
835,-45.01
836,-45.24
837,-45.39
838,-45.49
839,-45.49
840,-45.42
841,-45.30
842,-45.17
843,-45.02
844,-44.88
845,-44.75
846,-44.61
847,-44.49
848,-44.42
849,-44.40
850,-44.41
851,-44.43
852,-44.44
853,-44.46
854,-44.46
855,-44.42
856,-44.33
857,-44.20
858,-44.07
859,-43.93
860,-43.82
861,-43.72
862,-43.68
863,-43.68
864,-43.72
865,-43.83
866,-43.98
867,-44.14
868,-44.23
869,-44.24
870,-44.16
871,-44.01
872,-43.84
873,-43.68
874,-43.56
875,-43.52
876,-43.50
877,-43.52
878,-43.52
879,-43.47
880,-43.35
881,-43.14
882,-42.88
883,-42.62
884,-42.39
885,-42.23
886,-42.15
887,-42.18
888,-42.30
889,-42.50
890,-42.70
891,-42.88
892,-42.98
893,-42.99
894,-42.89
895,-42.71
896,-42.47
897,-42.21
898,-41.98
899,-41.79
900,-41.63
901,-41.53
902,-41.47
903,-41.46
904,-41.47
905,-41.48
906,-41.44
907,-41.35
908,-41.20
909,-41.02
910,-40.83
911,-40.64
912,-40.41
913,-40.18
914,-39.96
915,-39.83
916,-39.72
917,-39.63
918,-39.54
919,-39.47
920,-39.44
921,-39.42
922,-39.37
923,-39.28
924,-39.15
925,-38.97
926,-38.67
927,-38.27
928,-37.76
929,-37.25
930,-36.74
931,-36.25
932,-35.77
933,-35.36
934,-35.02
935,-34.77
936,-34.57
937,-34.42
938,-34.29
939,-34.19
940,-34.07
941,-33.94
942,-33.78
943,-33.64
944,-33.45
945,-33.22
946,-32.91
947,-32.59
948,-32.19
949,-31.75
950,-31.23
951,-30.68
952,-30.11
953,-29.62
954,-29.15
955,-28.73
956,-28.30
957,-27.89
958,-27.47
959,-27.05
960,-26.62
961,-26.20
962,-25.77
963,-25.42
964,-25.13
965,-24.96
966,-24.89
967,-24.91
968,-24.97
969,-25.05
970,-25.13
971,-25.24
972,-25.37
973,-25.54
974,-25.79
975,-26.10
976,-26.47
977,-26.85
978,-27.20
979,-27.47
980,-27.66
981,-27.75
982,-27.78
983,-27.77
984,-27.79
985,-27.82
986,-27.89
987,-27.95
988,-28.08
989,-28.26
990,-28.46
991,-28.63
992,-28.77
993,-28.88
994,-28.98
995,-29.08
996,-29.24
997,-29.41
998,-29.58
999,-29.73
1000,-29.87
1001,-29.97
1002,-30.01
1003,-29.96
1004,-29.86
1005,-29.73
1006,-29.62
1007,-29.53
1008,-29.46
1009,-29.42
1010,-29.49
1011,-29.66
1012,-29.92
1013,-30.22
1014,-30.56
1015,-30.91
1016,-31.30
1017,-31.71
1018,-32.17
1019,-32.63
1020,-33.14
1021,-33.65
1022,-34.16
1023,-34.64
1024,-35.12
1025,-35.55
1026,-36.00
1027,-36.38
1028,-36.77
1029,-37.11
1030,-37.49
1031,-37.88
1032,-38.31
1033,-38.73
1034,-39.20
1035,-39.67
1036,-40.16
1037,-40.60
1038,-41.01
1039,-41.34
1040,-41.63
1041,-41.86
1042,-42.07
1043,-42.24
1044,-42.42
1045,-42.59
1046,-42.77
1047,-42.90
1048,-43.05
1049,-43.19
1050,-43.37
1051,-43.55
1052,-43.78
1053,-44.04
1054,-44.39
1055,-44.78
1056,-45.22
1057,-45.64
1058,-46.06
1059,-46.46
1060,-46.80
1061,-47.05
1062,-47.24
1063,-47.39
1064,-47.49
1065,-47.52
1066,-47.42
1067,-47.23
1068,-46.95
1069,-46.65
1070,-46.33
1071,-46.00
1072,-45.63
1073,-45.28
1074,-44.91
1075,-44.56
1076,-44.14
1077,-43.66
1078,-43.06
1079,-42.40
1080,-41.65
1081,-40.91
1082,-40.17
1083,-39.54
1084,-39.01
1085,-38.64
1086,-38.39
1087,-38.28
1088,-38.22
1089,-38.22
1090,-38.19
1091,-38.17
1092,-38.14
1093,-38.14
1094,-38.16
1095,-38.25
1096,-38.39
1097,-38.57
1098,-38.73
1099,-38.81
1100,-38.79
1101,-38.67
1102,-38.46
1103,-38.18
1104,-37.90
1105,-37.69
1106,-37.66
1107,-37.83
1108,-38.22
1109,-38.73
1110,-39.38
1111,-40.03
1112,-40.66
1113,-41.16
1114,-41.56
1115,-41.82
1116,-42.04
1117,-42.18
1118,-42.34
1119,-42.52
1120,-42.82
1121,-43.18
1122,-43.61
1123,-44.03
1124,-44.44
1125,-44.82
1126,-45.18
1127,-45.46
1128,-45.68
1129,-45.80
1130,-45.85
1131,-45.84
1132,-45.78
1133,-45.72
1134,-45.68
1135,-45.68
1136,-45.78
1137,-45.96
1138,-46.22
1139,-46.49
1140,-46.70
1141,-46.81
1142,-46.81
1143,-46.68
1144,-46.42
1145,-46.08
1146,-45.72
1147,-45.42
1148,-45.19
1149,-45.02
1150,-44.95
1151,-44.99
1152,-45.14
1153,-45.33
1154,-45.56
1155,-45.83
1156,-46.15
1157,-46.49
1158,-46.83
1159,-47.13
1160,-47.40
1161,-47.62
1162,-47.84
1163,-48.04
1164,-48.29
1165,-48.59
1166,-49.00
1167,-49.48
1168,-50.08
1169,-50.67
1170,-51.22
1171,-51.61
1172,-51.90
1173,-52.02
1174,-52.07
1175,-52.05
1176,-52.04
1177,-52.09
1178,-52.22
1179,-52.39
1180,-52.57
1181,-52.69
1182,-52.71
1183,-52.59
1184,-52.34
1185,-52.02
1186,-51.68
1187,-51.40
1188,-51.18
1189,-51.04
1190,-50.95
1191,-50.88
1192,-50.79
1193,-50.69
1194,-50.57
1195,-50.46
1196,-50.38
1197,-50.36
1198,-50.38
1199,-50.43
1200,-50.46
1201,-50.46
1202,-50.38
1203,-50.19
1204,-49.90
1205,-49.54
1206,-49.18
1207,-48.92
1208,-48.78
1209,-48.76
1210,-48.82
1211,-48.92
1212,-48.98
1213,-48.97
1214,-48.86
1215,-48.66
1216,-48.42
1217,-48.18
1218,-48.02
1219,-48.01
1220,-48.23
1221,-48.61
1222,-49.13
1223,-49.64
1224,-50.16
1225,-50.62
1226,-51.11
1227,-51.60
1228,-52.15
1229,-52.79
1230,-53.57
1231,-54.44
1232,-55.39
1233,-56.28
1234,-57.10
1235,-57.75
1236,-58.25
1237,-58.57
1238,-58.76
1239,-58.83
1240,-58.87
1241,-58.88
1242,-58.89
1243,-58.89
1244,-58.85
1245,-58.74
1246,-58.52
1247,-58.17
1248,-57.69
1249,-57.11
1250,-56.47
1251,-55.84
1252,-55.25
1253,-54.80
1254,-54.49
1255,-54.34
1256,-54.24
1257,-54.21
1258,-54.12
1259,-53.96
1260,-53.63
1261,-53.18
1262,-52.59
1263,-51.99
1264,-51.35
1265,-50.74
1266,-50.06
1267,-49.39
1268,-48.66
1269,-47.94
1270,-47.18
1271,-46.44
1272,-45.65
1273,-44.94
1274,-44.25
1275,-43.66
1276,-43.08
1277,-42.56
1278,-42.02
1279,-41.54
1280,-41.02
1281,-40.50
1282,-39.92
1283,-39.39
1284,-38.83
1285,-38.29
1286,-37.71
1287,-37.12
1288,-36.51
1289,-35.93
1290,-35.40
1291,-34.99
1292,-34.68
1293,-34.53
1294,-34.49
1295,-34.55
1296,-34.59
1297,-34.64
1298,-34.65
1299,-34.67
1300,-34.65
1301,-34.62
1302,-34.61
1303,-34.64
1304,-34.71
1305,-34.81
1306,-34.97
1307,-35.15
1308,-35.39
1309,-35.61
1310,-35.87
1311,-36.18
1312,-36.58
1313,-37.03
1314,-37.55
1315,-38.11
1316,-38.77
1317,-39.49
1318,-40.28
1319,-41.05
1320,-41.82
1321,-42.47
1322,-43.04
1323,-43.43
1324,-43.69
1325,-43.80
1326,-43.89
1327,-44.00
1328,-44.26
1329,-44.66
1330,-45.27
1331,-46.01
1332,-46.86
1333,-47.71
1334,-48.53
1335,-49.20
1336,-49.75
1337,-50.14
1338,-50.46
1339,-50.67
1340,-50.87
1341,-50.99
1342,-51.17
1343,-51.35
1344,-51.58
1345,-51.80
1346,-52.09
1347,-52.41
1348,-52.85
1349,-53.34
1350,-53.88
1351,-54.43
1352,-54.99
1353,-55.50
1354,-55.97
1355,-56.34
1356,-56.65
1357,-56.87
1358,-57.05
1359,-57.16
1360,-57.27
1361,-57.34
1362,-57.41
1363,-57.46
1364,-57.57
1365,-57.73
1366,-58.00
1367,-58.32
1368,-58.72
1369,-59.20
1370,-59.75
1371,-60.24
1372,-60.62
1373,-60.81
1374,-60.84
1375,-60.74
1376,-60.55
1377,-60.32
1378,-60.13
1379,-60.05
1380,-60.11
1381,-60.29
1382,-60.56
1383,-60.88
1384,-61.22
1385,-61.52
1386,-61.75
1387,-61.91
1388,-62.03
1389,-62.10
1390,-62.13
1391,-62.11
1392,-62.05
1393,-61.97
1394,-61.87
1395,-61.74
1396,-61.59
1397,-61.42
1398,-61.28
1399,-61.16
1400,-61.04
1401,-60.92
1402,-60.82
1403,-60.78
1404,-60.78
1405,-60.85
1406,-60.94
1407,-61.04
1408,-61.10
1409,-61.07
1410,-60.94
1411,-60.77
1412,-60.55
1413,-60.30
1414,-60.01
1415,-59.72
1416,-59.48
1417,-59.32
1418,-59.20
1419,-59.10
1420,-58.98
1421,-58.85
1422,-58.72
1423,-58.64
1424,-58.56
1425,-58.53
1426,-58.52
1427,-58.54
1428,-58.53
1429,-58.45
1430,-58.28
1431,-58.07
1432,-57.81
1433,-57.52
1434,-57.19
1435,-56.89
1436,-56.64
1437,-56.46
1438,-56.35
1439,-56.30
1440,-56.27
1441,-56.24
1442,-56.18
1443,-56.06
1444,-55.91
1445,-55.76
1446,-55.63
1447,-55.55
1448,-55.54
1449,-55.63
1450,-55.83
1451,-56.13
1452,-56.50
1453,-56.88
1454,-57.21
1455,-57.45
1456,-57.61
1457,-57.70
1458,-57.79
1459,-57.88
1460,-58.03
1461,-58.25
1462,-58.56
1463,-58.91
1464,-59.24
1465,-59.50
1466,-59.66
1467,-59.68
1468,-59.52
1469,-59.26
1470,-58.91
1471,-58.56
1472,-58.24
1473,-57.97
1474,-57.78
1475,-57.66
1476,-57.57
1477,-57.50
1478,-57.40
1479,-57.29
1480,-57.16
1481,-57.04
1482,-56.95
1483,-56.95
1484,-57.01
1485,-57.14
1486,-57.32
1487,-57.52
1488,-57.72
1489,-57.88
1490,-58.01
1491,-58.07
1492,-58.12
1493,-58.14
1494,-58.17
1495,-58.20
1496,-58.25
1497,-58.33
1498,-58.48
1499,-58.67
1500,-58.91
1501,-59.17
1502,-59.48
1503,-59.78
1504,-60.04
1505,-60.25
1506,-60.42
1507,-60.53
1508,-60.61
1509,-60.63
1510,-60.63
1511,-60.62
1512,-60.58
1513,-60.54
1514,-60.50
1515,-60.46
1516,-60.38
1517,-60.25
1518,-60.05
1519,-59.81
1520,-59.54
1521,-59.27
1522,-59.01
1523,-58.75
1524,-58.51
1525,-58.32
1526,-58.20
1527,-58.14
1528,-58.11
1529,-58.07
1530,-58.02
1531,-57.98
1532,-57.90
1533,-57.79
1534,-57.65
1535,-57.52
1536,-57.37
1537,-57.24
1538,-57.06
1539,-56.84
1540,-56.54
1541,-56.19
1542,-55.79
1543,-55.37
1544,-54.94
1545,-54.53
1546,-54.12
1547,-53.74
1548,-53.34
1549,-52.93
1550,-52.50
1551,-52.10
1552,-51.71
1553,-51.38
1554,-51.08
1555,-50.83
1556,-50.59
1557,-50.38
1558,-50.16
1559,-49.95
1560,-49.75
1561,-49.60
1562,-49.53
1563,-49.55
1564,-49.62
1565,-49.72
1566,-49.80
1567,-49.87
1568,-49.90
1569,-49.88
1570,-49.80
1571,-49.70
1572,-49.61
1573,-49.56
1574,-49.55
1575,-49.58
1576,-49.67
1577,-49.80
1578,-49.96
1579,-50.12
1580,-50.24
1581,-50.32
1582,-50.34
1583,-50.31
1584,-50.22
1585,-50.09
1586,-49.92
1587,-49.75
1588,-49.61
1589,-49.52
1590,-49.48
1591,-49.47
1592,-49.52
1593,-49.61
1594,-49.74
1595,-49.88
1596,-50.00
1597,-50.09
1598,-50.22
1599,-50.38
1600,-50.58
1601,-50.78
1602,-51.03
1603,-51.25
1604,-51.48
1605,-51.65
1606,-51.80
1607,-51.90
1608,-51.96
1609,-51.97
1610,-52.03
1611,-52.14
1612,-52.34
1613,-52.59
1614,-52.91
1615,-53.25
1616,-53.61
1617,-53.98
1618,-54.37
1619,-54.74
1620,-55.14
1621,-55.53
1622,-55.98
1623,-56.43
1624,-56.92
1625,-57.36
1626,-57.76
1627,-58.08
1628,-58.34
1629,-58.53
1630,-58.68
1631,-58.78
1632,-58.92
1633,-59.10
1634,-59.37
1635,-59.66
1636,-59.98
1637,-60.26
1638,-60.51
1639,-60.68
1640,-60.85
1641,-60.96
1642,-61.07
1643,-61.19
1644,-61.41
1645,-61.71
1646,-62.12
1647,-62.58
1648,-63.10
1649,-63.62
1650,-64.09
1651,-64.43
1652,-64.66
1653,-64.80
1654,-64.93
1655,-65.05
1656,-65.19
1657,-65.33
1658,-65.53
1659,-65.73
1660,-65.93
1661,-66.03
1662,-66.11
1663,-66.16
1664,-66.24
1665,-66.33
1666,-66.47
1667,-66.65
1668,-66.89
1669,-67.13
1670,-67.38
1671,-67.57
1672,-67.79
1673,-68.03
1674,-68.36
1675,-68.74
1676,-69.20
1677,-69.67
1678,-70.14
1679,-70.55
1680,-70.88
1681,-71.09
1682,-71.23
1683,-71.29
1684,-71.34
1685,-71.44
1686,-71.65
1687,-71.89
1688,-72.14
1689,-72.34
1690,-72.50
1691,-72.59
1692,-72.61
1693,-72.55
1694,-72.48
1695,-72.43
1696,-72.39
1697,-72.36
1698,-72.36
1699,-72.44
1700,-72.62
1701,-72.88
1702,-73.21
1703,-73.61
1704,-74.10
1705,-74.62
1706,-75.14
1707,-75.60
1708,-75.99
1709,-76.28
1710,-76.51
1711,-76.67
1712,-76.86
1713,-77.10
1714,-77.47
1715,-77.90
1716,-78.36
1717,-78.81
1718,-79.25
1719,-79.61
1720,-79.87
1721,-80.00
1722,-80.08
1723,-80.12
1724,-80.17
1725,-80.18
1726,-80.21
1727,-80.24
1728,-80.31
1729,-80.40
1730,-80.51
1731,-80.64
1732,-80.80
1733,-80.93
1734,-81.01
1735,-80.97
1736,-80.86
1737,-80.68
1738,-80.51
1739,-80.41
1740,-80.41
1741,-80.54
1742,-80.80
1743,-81.18
1744,-81.66
1745,-82.13
1746,-82.48
1747,-82.66
1748,-82.63
1749,-82.44
1750,-82.05
1751,-81.54
1752,-80.99
1753,-80.52
1754,-80.17
1755,-79.96
1756,-79.85
1757,-79.83
1758,-79.82
1759,-79.82
1760,-79.77
1761,-79.67
1762,-79.48
1763,-79.23
1764,-78.94
1765,-78.67
1766,-78.42
1767,-78.22
1768,-78.05
1769,-77.90
1770,-77.71
1771,-77.49
1772,-77.19
1773,-76.86
1774,-76.49
1775,-76.14
1776,-75.76
1777,-75.42
1778,-75.08
1779,-74.81
1780,-74.53
1781,-74.28
1782,-74.01
1783,-73.76
1784,-73.50
1785,-73.30
1786,-73.15
1787,-73.07
1788,-73.00
1789,-72.95
1790,-72.90
1791,-72.86
1792,-72.78
1793,-72.68
1794,-72.49
1795,-72.29
1796,-72.06
1797,-71.85
1798,-71.61
1799,-71.40
1800,-71.20
1801,-71.01
1802,-70.77
1803,-70.49
1804,-70.12
1805,-69.69
1806,-69.15
1807,-68.57
1808,-67.94
1809,-67.31
1810,-66.67
1811,-66.05
1812,-65.48
1813,-65.02
1814,-64.63
1815,-64.30
1816,-63.96
1817,-63.68
1818,-63.40
1819,-63.16
1820,-62.90
1821,-62.66
1822,-62.42
1823,-62.25
1824,-62.10
1825,-62.01
1826,-61.93
1827,-61.86
1828,-61.75
1829,-61.63
1830,-61.48
1831,-61.32
1832,-61.10
1833,-60.87
1834,-60.65
1835,-60.46
1836,-60.30
1837,-60.16
1838,-60.05
1839,-60.02
1840,-60.05
1841,-60.12
1842,-60.19
1843,-60.26
1844,-60.33
1845,-60.38
1846,-60.39
1847,-60.38
1848,-60.34
1849,-60.26
1850,-60.15
1851,-59.97
1852,-59.73
1853,-59.45
1854,-59.14
1855,-58.83
1856,-58.58
1857,-58.40
1858,-58.34
1859,-58.40
1860,-58.59
1861,-58.84
1862,-59.07
1863,-59.21
1864,-59.22
1865,-59.11
1866,-58.91
1867,-58.65
1868,-58.36
1869,-58.09
1870,-57.90
1871,-57.81
1872,-57.79
1873,-57.83
1874,-57.91
1875,-58.01
1876,-58.11
1877,-58.19
1878,-58.24
1879,-58.27
1880,-58.28
1881,-58.27
1882,-58.27
1883,-58.30
1884,-58.39
1885,-58.52
1886,-58.69
1887,-58.90
1888,-59.15
1889,-59.39
1890,-59.58
1891,-59.69
1892,-59.78
1893,-59.84
1894,-59.92
1895,-60.01
1896,-60.13
1897,-60.32
1898,-60.60
1899,-60.94
1900,-61.33
1901,-61.68
1902,-62.00
1903,-62.29
1904,-62.59
1905,-62.85
1906,-63.11
1907,-63.32
1908,-63.54
1909,-63.74
1910,-63.94
1911,-64.13
1912,-64.34
1913,-64.56
1914,-64.82
1915,-65.08
1916,-65.34
1917,-65.55
1918,-65.70
1919,-65.76
1920,-65.71
1921,-65.56
1922,-65.34
1923,-65.09
1924,-64.87
1925,-64.71
1926,-64.67
1927,-64.74
1928,-64.93
1929,-65.16
1930,-65.37
1931,-65.52
1932,-65.61
1933,-65.63
1934,-65.61
1935,-65.55
1936,-65.52
1937,-65.56
1938,-65.73
1939,-65.99
1940,-66.35
1941,-66.75
1942,-67.21
1943,-67.67
1944,-68.08
1945,-68.36
1946,-68.53
1947,-68.61
1948,-68.64
1949,-68.60
1950,-68.53
1951,-68.43
1952,-68.38
1953,-68.41
1954,-68.57
1955,-68.82
1956,-69.17
1957,-69.55
1958,-69.96
1959,-70.34
1960,-70.66
1961,-70.93
1962,-71.14
1963,-71.30
1964,-71.43
1965,-71.52
1966,-71.64
1967,-71.78
1968,-71.99
1969,-72.20
1970,-72.43
1971,-72.63
1972,-72.87
1973,-73.13
1974,-73.42
1975,-73.72
1976,-74.05
1977,-74.39
1978,-74.77
1979,-75.11
1980,-75.43
1981,-75.69
1982,-75.90
1983,-76.05
1984,-76.18
1985,-76.29
1986,-76.39
1987,-76.48
1988,-76.58
1989,-76.64
1990,-76.69
1991,-76.70
1992,-76.70
1993,-76.71
1994,-76.77
1995,-76.85
1996,-76.97
1997,-77.10
1998,-77.25
1999,-77.36
2000,-77.45
2001,-77.47
2002,-77.48
2003,-77.49
2004,-77.58
2005,-77.71
2006,-77.90
2007,-78.12
2008,-78.38
2009,-78.66
2010,-78.93
2011,-79.15
2012,-79.36
2013,-79.56
2014,-79.81
2015,-80.10
2016,-80.47
2017,-80.86
2018,-81.30
2019,-81.71
2020,-82.10
2021,-82.41
2022,-82.65
2023,-82.83
2024,-83.01
2025,-83.18
2026,-83.38
2027,-83.57
2028,-83.76
2029,-83.92
2030,-84.05
2031,-84.11
2032,-84.17
2033,-84.21
2034,-84.25
2035,-84.30
2036,-84.34
2037,-84.39
2038,-84.43
2039,-84.45
2040,-84.43
2041,-84.37
2042,-84.27
2043,-84.17
2044,-84.06
2045,-83.95
2046,-83.83
2047,-83.69
2048,-83.57
2049,-83.44
2050,-83.34
2051,-83.28
2052,-83.38
2053,-83.63
2054,-84.07
2055,-84.63
2056,-85.35
2057,-86.15
2058,-86.98
2059,-87.70
2060,-88.29
2061,-88.69
2062,-88.97
2063,-89.14
2064,-89.26
2065,-89.33
2066,-89.44
2067,-89.59
2068,-89.85
2069,-90.14
2070,-90.46
2071,-90.73
2072,-90.94
2073,-91.09
2074,-91.17
2075,-91.20
2076,-91.19
2077,-91.16
2078,-91.12
2079,-91.06
2080,-90.99
2081,-90.90
2082,-90.77
2083,-90.57
2084,-90.25
2085,-89.84
2086,-89.33
2087,-88.80
2088,-88.23
2089,-87.68
2090,-87.16
2091,-86.72
2092,-86.35
2093,-86.09
2094,-85.89
2095,-85.77
2096,-85.66
2097,-85.56
2098,-85.39
2099,-85.21
2100,-84.97
2101,-84.76
2102,-84.54
2103,-84.33
2104,-84.05
2105,-83.76
2106,-83.40
2107,-83.02
2108,-82.57
2109,-82.07
2110,-81.50
2111,-80.95
2112,-80.38
2113,-79.86
2114,-79.38
2115,-78.96
2116,-78.54
2117,-78.16
2118,-77.72
2119,-77.25
2120,-76.74
2121,-76.26
2122,-75.84
2123,-75.51
2124,-75.29
2125,-75.26
2126,-75.37
2127,-75.64
2128,-75.97
2129,-76.29
2130,-76.48
2131,-76.52
2132,-76.37
2133,-76.10
2134,-75.74
2135,-75.34
2136,-74.99
2137,-74.78
2138,-74.74
2139,-74.82
2140,-74.94
2141,-75.04
2142,-75.07
2143,-75.04
2144,-74.93
2145,-74.75
2146,-74.53
2147,-74.33
2148,-74.21
2149,-74.19
2150,-74.29
2151,-74.48
2152,-74.76
2153,-75.08
2154,-75.45
2155,-75.81
2156,-76.21
2157,-76.58
2158,-76.97
2159,-77.34
2160,-77.73
2161,-78.11
2162,-78.57
2163,-79.08
2164,-79.70
2165,-80.38
2166,-81.12
2167,-81.81
2168,-82.47
2169,-82.99
2170,-83.43
2171,-83.72
2172,-83.89
2173,-83.95
2174,-83.98
2175,-83.99
2176,-84.07
2177,-84.16
2178,-84.30
2179,-84.43
2180,-84.63
2181,-84.84
2182,-85.11
2183,-85.37
2184,-85.65
2185,-85.88
2186,-86.12
2187,-86.30
2188,-86.50
2189,-86.69
2190,-86.95
2191,-87.23
2192,-87.62
2193,-88.07
2194,-88.67
2195,-89.29
2196,-89.98
2197,-90.64
2198,-91.33
2199,-91.98
2200,-92.66
2201,-93.29
2202,-93.97
2203,-94.62
2204,-95.32
2205,-95.98
2206,-96.66
2207,-97.28
2208,-97.91
2209,-98.46
2210,-99.00
2211,-99.47
2212,-99.93
2213,-100.33
2214,-100.70
2215,-100.96
2216,-101.11
2217,-101.14
2218,-101.09
2219,-101.01
2220,-100.92
2221,-100.85
2222,-100.80
2223,-100.78
2224,-100.77
2225,-100.78
2226,-100.72
2227,-100.48
2228,-99.95
2229,-99.24
2230,-98.43
2231,-97.70
2232,-97.02
2233,-96.44
2234,-95.89
2235,-95.41
2236,-94.96
2237,-94.53
2238,-93.99
2239,-93.42
2240,-92.72
2241,-92.00
2242,-91.23
2243,-90.52
2244,-89.81
2245,-89.21
2246,-88.63
2247,-88.14
2248,-87.65
2249,-87.21
2250,-86.72
2251,-86.24
2252,-85.69
2253,-85.14
2254,-84.57
2255,-84.06
2256,-83.59
2257,-83.21
2258,-82.88
2259,-82.62
2260,-82.41
2261,-82.24
2262,-82.11
2263,-82.04
2264,-82.05
2265,-82.13
2266,-82.28
2267,-82.50
2268,-82.76
2269,-83.05
2270,-83.37
2271,-83.70
2272,-84.07
2273,-84.45
2274,-84.85
2275,-85.24
2276,-85.62
2277,-85.98
2278,-86.29
2279,-86.50
2280,-86.66
2281,-86.77
2282,-86.88
2283,-86.98
2284,-87.16
2285,-87.39
2286,-87.71
2287,-88.06
2288,-88.45
2289,-88.80
2290,-89.13
2291,-89.39
2292,-89.60
2293,-89.76
2294,-89.97
2295,-90.21
2296,-90.53
2297,-90.84
2298,-91.19
2299,-91.55
2300,-91.93
2301,-92.32
2302,-92.70
2303,-93.08
2304,-93.50
2305,-93.93
2306,-94.36
2307,-94.75
2308,-95.10
2309,-95.39
2310,-95.65
2311,-95.86
2312,-96.07
2313,-96.25
2314,-96.47
2315,-96.69
2316,-96.92
2317,-97.11
2318,-97.25
2319,-97.31
2320,-97.27
2321,-97.15
2322,-96.98
2323,-96.75
2324,-96.47
2325,-96.18
2326,-95.88
2327,-95.61
2328,-95.38
2329,-95.20
2330,-95.09
2331,-95.06
2332,-95.08
2333,-95.15
2334,-95.23
2335,-95.31
2336,-95.34
2337,-95.31
2338,-95.23
2339,-95.14
2340,-95.06
2341,-95.02
2342,-95.00
2343,-95.02
2344,-95.06
2345,-95.12
2346,-95.19
2347,-95.25
2348,-95.29
2349,-95.32
2350,-95.35
2351,-95.38
2352,-95.41
2353,-95.44
2354,-95.47
2355,-95.50
2356,-95.47
2357,-95.41
2358,-95.32
2359,-95.23
2360,-95.14
2361,-95.09
2362,-95.07
2363,-95.11
2364,-95.15
2365,-95.18
2366,-95.13
2367,-95.02
2368,-94.86
2369,-94.66
2370,-94.40
2371,-94.15
2372,-93.93
2373,-93.80
2374,-93.71
2375,-93.65
2376,-93.59
2377,-93.54
2378,-93.48
2379,-93.40
2380,-93.30
2381,-93.23
2382,-93.15
2383,-93.06
2384,-92.96
2385,-92.85
2386,-92.70
2387,-92.52
2388,-92.31
2389,-92.12
2390,-92.03
2391,-92.04
2392,-92.16
2393,-92.35
2394,-92.58
2395,-92.85
2396,-93.11
2397,-93.35
2398,-93.51
2399,-93.54
2400,-93.36
2401,-93.05
2402,-92.70
2403,-92.41
2404,-92.12
2405,-91.78
2406,-91.38
2407,-91.01
2408,-90.68
2409,-90.44
2410,-90.23
2411,-90.12
2412,-90.10
2413,-90.19
2414,-90.29
2415,-90.37
2416,-90.34
2417,-90.19
2418,-89.90
2419,-89.52
2420,-89.05
2421,-88.53
2422,-87.95
2423,-87.36
2424,-86.76
2425,-86.21
2426,-85.70
2427,-85.27
2428,-84.92
2429,-84.63
2430,-84.40
2431,-84.25
2432,-84.14
2433,-84.11
2434,-84.11
2435,-84.14
2436,-84.24
2437,-84.39
2438,-84.59
2439,-84.82
2440,-85.13
2441,-85.46
2442,-85.85
2443,-86.30
2444,-86.83
2445,-87.43
2446,-88.11
2447,-88.86
2448,-89.68
2449,-90.49
2450,-91.28
2451,-91.93
2452,-92.48
2453,-92.89
2454,-93.17
2455,-93.32
2456,-93.37
2457,-93.36
2458,-93.34
2459,-93.30
2460,-93.27
2461,-93.25
2462,-93.21
2463,-93.17
2464,-93.09
2465,-92.97
2466,-92.77
2467,-92.46
2468,-91.99
2469,-91.38
2470,-90.65
2471,-89.88
2472,-89.05
2473,-88.24
2474,-87.43
2475,-86.74
2476,-86.08
2477,-85.50
2478,-84.91
2479,-84.36
2480,-83.81
2481,-83.32
2482,-82.87
2483,-82.53
2484,-82.31
2485,-82.22
2486,-82.17
2487,-82.15
2488,-82.12
2489,-82.08
2490,-82.01
2491,-81.88
2492,-81.74
2493,-81.67
2494,-81.70
2495,-81.83
2496,-82.04
2497,-82.30
2498,-82.60
2499,-82.89
2500,-83.14
2501,-83.31
2502,-83.44
2503,-83.53
2504,-83.66
2505,-83.79
2506,-84.00
2507,-84.26
2508,-84.56
2509,-84.85
2510,-85.11
2511,-85.30
2512,-85.38
2513,-85.35
2514,-85.27
2515,-85.20
2516,-85.18
2517,-85.25
2518,-85.39
2519,-85.59
2520,-85.80
2521,-85.98
2522,-86.04
2523,-85.98
2524,-85.73
2525,-85.33
2526,-84.72
2527,-84.01
2528,-83.21
2529,-82.43
2530,-81.66
2531,-80.97
2532,-80.30
2533,-79.72
2534,-79.17
2535,-78.68
2536,-78.15
2537,-77.61
2538,-77.03
2539,-76.46
2540,-75.84
2541,-75.24
2542,-74.65
2543,-74.15
2544,-73.73
2545,-73.43
2546,-73.20
2547,-73.04
2548,-72.91
2549,-72.81
2550,-72.66
2551,-72.50
2552,-72.30
2553,-72.11
2554,-71.94
2555,-71.82
2556,-71.76
2557,-71.78
2558,-71.88
2559,-72.04
2560,-72.26
2561,-72.49
2562,-72.75
2563,-72.98
2564,-73.20
2565,-73.37
2566,-73.53
2567,-73.66
2568,-73.78
2569,-73.84
2570,-73.91
2571,-74.00
2572,-74.17
2573,-74.43
2574,-74.81
2575,-75.28
2576,-75.82
2577,-76.40
2578,-77.01
2579,-77.56
2580,-78.00
2581,-78.27
2582,-78.38
2583,-78.35
2584,-78.25
2585,-78.10
2586,-78.02
2587,-78.00
2588,-78.08
2589,-78.19
2590,-78.31
2591,-78.36
2592,-78.34
2593,-78.19
2594,-78.00
2595,-77.80
2596,-77.70
2597,-77.72
2598,-77.91
2599,-78.25
2600,-78.72
2601,-79.19
2602,-79.64
2603,-79.95
2604,-80.21
2605,-80.38
2606,-80.57
2607,-80.83
2608,-81.30
2609,-81.95
2610,-82.84
2611,-83.82
2612,-84.88
2613,-85.90
2614,-86.88
2615,-87.73
2616,-88.51
2617,-89.16
2618,-89.78
2619,-90.31
2620,-90.82
2621,-91.24
2622,-91.63
2623,-91.92
2624,-92.19
2625,-92.41
2626,-92.68
2627,-92.99
2628,-93.33
2629,-93.65
2630,-93.98
2631,-94.28
2632,-94.53
2633,-94.67
2634,-94.73
2635,-94.73
2636,-94.76
2637,-94.83
2638,-94.89
2639,-94.92
2640,-94.92
2641,-94.88
2642,-94.75
2643,-94.52
2644,-94.16
2645,-93.75
2646,-93.28
2647,-92.83
2648,-92.36
2649,-91.94
2650,-91.52
2651,-91.15
2652,-90.77
2653,-90.42
2654,-90.07
2655,-89.77
2656,-89.46
2657,-89.20
2658,-88.89
2659,-88.56
2660,-88.13
2661,-87.68
2662,-87.21
2663,-86.78
2664,-86.40
2665,-86.10
2666,-85.91
2667,-85.88
2668,-85.99
2669,-86.19
2670,-86.41
2671,-86.61
2672,-86.77
2673,-86.86
2674,-86.86
2675,-86.75
2676,-86.63
2677,-86.52
2678,-86.53
2679,-86.62
2680,-86.85
2681,-87.23
2682,-87.81
2683,-88.52
2684,-89.37
2685,-90.24
2686,-91.20
2687,-92.15
2688,-93.11
2689,-93.97
2690,-94.86
2691,-95.67
2692,-96.50
2693,-97.23
2694,-97.99
2695,-98.71
2696,-99.44
2697,-100.07
2698,-100.71
2699,-101.28
2700,-101.88
2701,-102.41
2702,-102.95
2703,-103.42
2704,-103.90
2705,-104.33
2706,-104.78
2707,-105.17
2708,-105.55
2709,-105.85
2710,-106.12
2711,-106.33
2712,-106.53
2713,-106.67
2714,-106.84
2715,-106.99
2716,-107.19
2717,-107.43
2718,-107.78
2719,-108.19
2720,-108.67
2721,-109.15
2722,-109.66
2723,-110.15
2724,-110.63
2725,-111.04
2726,-111.40
2727,-111.69
2728,-111.94
2729,-112.14
2730,-112.33
2731,-112.44
2732,-112.50
2733,-112.46
2734,-112.37
2735,-112.24
2736,-112.11
2737,-111.93
2738,-111.77
2739,-111.67
2740,-111.69
2741,-111.82
2742,-112.00
2743,-112.21
2744,-112.45
2745,-112.70
2746,-112.95
2747,-113.16
2748,-113.33
2749,-113.45
2750,-113.57
2751,-113.70
2752,-113.88
2753,-114.08
2754,-114.32
2755,-114.54
2756,-114.78
2757,-115.01
2758,-115.26
2759,-115.49
2760,-115.70
2761,-115.84
2762,-115.97
2763,-116.07
2764,-116.20
2765,-116.35
2766,-116.54
2767,-116.76
2768,-117.03
2769,-117.32
2770,-117.65
2771,-117.97
2772,-118.29
2773,-118.56
2774,-118.77
2775,-118.88
2776,-118.91
2777,-118.86
2778,-118.79
2779,-118.72
2780,-118.68
2781,-118.68
2782,-118.74
2783,-118.84
2784,-118.97
2785,-119.10
2786,-119.26
2787,-119.39
2788,-119.54
2789,-119.67
2790,-119.82
2791,-120.00
2792,-120.19
2793,-120.38
2794,-120.54
2795,-120.67
2796,-120.77
2797,-120.81
2798,-120.80
2799,-120.74
2800,-120.64
2801,-120.52
2802,-120.38
2803,-120.25
2804,-120.14
2805,-120.06
2806,-120.03
2807,-120.04
2808,-120.09
2809,-120.22
2810,-120.41
2811,-120.67
2812,-120.93
2813,-121.15
2814,-121.30
2815,-121.37
2816,-121.37
2817,-121.30
2818,-121.17
2819,-121.01
2820,-120.85
2821,-120.74
2822,-120.69
2823,-120.70
2824,-120.74
2825,-120.78
2826,-120.80
2827,-120.77
2828,-120.64
2829,-120.41
2830,-120.08
2831,-119.71
2832,-119.29
2833,-118.87
2834,-118.48
2835,-118.17
2836,-117.95
2837,-117.82
2838,-117.74
2839,-117.69
2840,-117.65
2841,-117.61
2842,-117.52
2843,-117.39
2844,-117.21
2845,-117.03
2846,-116.85
2847,-116.67
2848,-116.44
2849,-116.20
2850,-115.95
2851,-115.75
2852,-115.60
2853,-115.52
2854,-115.50
2855,-115.54
2856,-115.62
2857,-115.68
2858,-115.68
2859,-115.55
2860,-115.34
2861,-115.07
2862,-114.82
2863,-114.61
2864,-114.48
2865,-114.46
2866,-114.59
2867,-114.84
2868,-115.18
2869,-115.55
2870,-115.89
2871,-116.16
2872,-116.34
2873,-116.45
2874,-116.49
2875,-116.51
2876,-116.48
2877,-116.41
2878,-116.29
2879,-116.12
2880,-115.92
2881,-115.69
2882,-115.46
2883,-115.23
2884,-115.03
2885,-114.87
2886,-114.75
2887,-114.67
2888,-114.64
2889,-114.66
2890,-114.72
2891,-114.83
2892,-114.96
2893,-115.09
2894,-115.23
2895,-115.35
2896,-115.45
2897,-115.50
2898,-115.52
2899,-115.54
2900,-115.58
2901,-115.59
2902,-115.51
2903,-115.36
2904,-115.22
2905,-115.11
2906,-114.97
2907,-114.77
2908,-114.46
2909,-114.11
2910,-113.69
2911,-113.29
2912,-112.88
2913,-112.55
2914,-112.23
2915,-111.95
2916,-111.63
2917,-111.26
2918,-110.76
2919,-110.16
2920,-109.42
2921,-108.63
2922,-107.73
2923,-106.87
2924,-106.02
2925,-105.26
2926,-104.51
2927,-103.81
2928,-103.10
2929,-102.45
2930,-101.78
2931,-101.14
2932,-100.46
2933,-99.85
2934,-99.22
2935,-98.65
2936,-98.05
2937,-97.53
2938,-97.02
2939,-96.59
2940,-96.12
2941,-95.68
2942,-95.25
2943,-94.92
2944,-94.67
2945,-94.49
2946,-94.33
2947,-94.24
2948,-94.17
2949,-94.08
2950,-93.86
2951,-93.53
2952,-93.08
2953,-92.60
2954,-92.09
2955,-91.63
2956,-91.26
2957,-91.09
2958,-91.10
2959,-91.25
2960,-91.42
2961,-91.56
2962,-91.63
2963,-91.60
2964,-91.48
2965,-91.32
2966,-91.19
2967,-91.18
2968,-91.30
2969,-91.50
2970,-91.72
2971,-91.90
2972,-92.03
2973,-92.06
2974,-92.01
2975,-91.87
2976,-91.71
2977,-91.57
2978,-91.48
2979,-91.48
2980,-91.52
2981,-91.61
2982,-91.71
2983,-91.84
2984,-91.99
2985,-92.16
2986,-92.35
2987,-92.55
2988,-92.76
2989,-92.91
2990,-93.01
2991,-93.03
2992,-93.07
2993,-93.11
2994,-93.22
2995,-93.38
2996,-93.69
2997,-94.09
2998,-94.61
2999,-95.16
3000,-95.76
3001,-96.34
3002,-96.95
3003,-97.50
3004,-98.05
3005,-98.56
3006,-99.14
3007,-99.74
3008,-100.40
3009,-101.03
3010,-101.68
3011,-102.27
3012,-102.87
3013,-103.36
3014,-103.78
3015,-104.10
3016,-104.37
3017,-104.58
3018,-104.80
3019,-104.99
3020,-105.23
3021,-105.45
3022,-105.70
3023,-105.91
3024,-106.13
3025,-106.33
3026,-106.54
3027,-106.76
3028,-107.03
3029,-107.33
3030,-107.69
3031,-108.06
3032,-108.45
3033,-108.83
3034,-109.22
3035,-109.56
3036,-109.86
3037,-110.10
3038,-110.34
3039,-110.53
3040,-110.67
3041,-110.75
3042,-110.82
3043,-110.89
3044,-110.98
3045,-111.06
3046,-111.17
3047,-111.27
3048,-111.42
3049,-111.57
3050,-111.72
3051,-111.85
3052,-111.92
3053,-111.96
3054,-111.98
3055,-111.98
3056,-111.97
3057,-111.95
3058,-111.93
3059,-111.91
3060,-111.86
3061,-111.79
3062,-111.67
3063,-111.54
3064,-111.40
3065,-111.25
3066,-111.08
3067,-110.92
3068,-110.76
3069,-110.65
3070,-110.57
3071,-110.51
3072,-110.45
3073,-110.40
3074,-110.34
3075,-110.31
3076,-110.30
3077,-110.28
3078,-110.27
3079,-110.25
3080,-110.24
3081,-110.25
3082,-110.24
3083,-110.21
3084,-110.16
3085,-110.11
3086,-110.04
3087,-109.98
3088,-109.93
3089,-109.90
3090,-109.86
3091,-109.78
3092,-109.63
3093,-109.43
3094,-109.23
3095,-109.08
3096,-108.99
3097,-108.98
3098,-109.04
3099,-109.17
3100,-109.31
3101,-109.41
3102,-109.39
3103,-109.25
3104,-108.98
3105,-108.63
3106,-108.22
3107,-107.82
3108,-107.47
3109,-107.22
3110,-107.04
3111,-106.92
3112,-106.80
3113,-106.67
3114,-106.55
3115,-106.45
3116,-106.30
3117,-106.14
3118,-105.96
3119,-105.83
3120,-105.74
3121,-105.71
3122,-105.69
3123,-105.70
3124,-105.70
3125,-105.69
3126,-105.62
3127,-105.48
3128,-105.26
3129,-104.97
3130,-104.61
3131,-104.24
3132,-103.90
3133,-103.64
3134,-103.48
3135,-103.42
3136,-103.46
3137,-103.60
3138,-103.81
3139,-104.09
3140,-104.37
3141,-104.62
3142,-104.84
3143,-105.01
3144,-105.12
3145,-105.14
3146,-105.10
3147,-105.00
3148,-104.90
3149,-104.83
3150,-104.85
3151,-104.93
3152,-105.09
3153,-105.32
3154,-105.61
3155,-105.93
3156,-106.28
3157,-106.61
3158,-106.93
3159,-107.22
3160,-107.51
3161,-107.78
3162,-108.08
3163,-108.37
3164,-108.67
3165,-108.93
3166,-109.17
3167,-109.36
3168,-109.54
3169,-109.71
3170,-109.91
3171,-110.12
3172,-110.33
3173,-110.53
3174,-110.68
3175,-110.76
3176,-110.79
3177,-110.75
3178,-110.64
3179,-110.50
3180,-110.36
3181,-110.24
3182,-110.14
3183,-110.04
3184,-109.91
3185,-109.74
3186,-109.56
3187,-109.38
3188,-109.21
3189,-109.09
3190,-109.04
3191,-109.07
3192,-109.18
3193,-109.35
3194,-109.54
3195,-109.70
3196,-109.77
3197,-109.76
3198,-109.66
3199,-109.51
3200,-109.31
3201,-109.13
3202,-108.95
3203,-108.80
3204,-108.67
3205,-108.54
3206,-108.39
3207,-108.21
3208,-107.92
3209,-107.56
3210,-107.11
3211,-106.66
3212,-106.16
3213,-105.67
3214,-105.13
3215,-104.59
3216,-104.00
3217,-103.40
3218,-102.74
3219,-102.07
3220,-101.39
3221,-100.79
3222,-100.25
3223,-99.82
3224,-99.43
3225,-99.11
3226,-98.76
3227,-98.43
3228,-98.05
3229,-97.67
3230,-97.30
3231,-97.01
3232,-96.77
3233,-96.62
3234,-96.50
3235,-96.44
3236,-96.37
3237,-96.26
3238,-96.05
3239,-95.76
3240,-95.39
3241,-95.05
3242,-94.75
3243,-94.53
3244,-94.38
3245,-94.31
3246,-94.23
3247,-94.14
3248,-93.96
3249,-93.71
3250,-93.38
3251,-92.99
3252,-92.54
3253,-92.10
3254,-91.70
3255,-91.35
3256,-91.04
3257,-90.75
3258,-90.47
3259,-90.20
3260,-89.93
3261,-89.68
3262,-89.46
3263,-89.32
3264,-89.20
3265,-89.13
3266,-89.06
3267,-89.01
3268,-88.90
3269,-88.72
3270,-88.42
3271,-88.01
3272,-87.46
3273,-86.85
3274,-86.21
3275,-85.65
3276,-85.17
3277,-84.89
3278,-84.77
3279,-84.85
3280,-85.02
3281,-85.24
3282,-85.34
3283,-85.28
3284,-84.98
3285,-84.53
3286,-83.92
3287,-83.28
3288,-82.64
3289,-82.12
3290,-81.76
3291,-81.57
3292,-81.48
3293,-81.42
3294,-81.32
3295,-81.18
3296,-80.96
3297,-80.70
3298,-80.38
3299,-80.10
3300,-79.90
3301,-79.80
3302,-79.80
3303,-79.89
3304,-80.03
3305,-80.22
3306,-80.44
3307,-80.61
3308,-80.76
3309,-80.85
3310,-80.94
3311,-81.02
3312,-81.15
3313,-81.28
3314,-81.48
3315,-81.73
3316,-82.05
3317,-82.44
3318,-82.93
3319,-83.47
3320,-84.06
3321,-84.65
3322,-85.24
3323,-85.80
3324,-86.36
3325,-86.88
3326,-87.41
3327,-87.87
3328,-88.33
3329,-88.74
3330,-89.20
3331,-89.65
3332,-90.13
3333,-90.58
3334,-91.05
3335,-91.51
3336,-92.03
3337,-92.53
3338,-93.08
3339,-93.60
3340,-94.17
3341,-94.72
3342,-95.30
3343,-95.84
3344,-96.39
3345,-96.87
3346,-97.31
3347,-97.65
3348,-97.97
3349,-98.22
3350,-98.46
3351,-98.65
3352,-98.80
3353,-98.92
3354,-99.04
3355,-99.15
3356,-99.25
3357,-99.32
3358,-99.40
3359,-99.50
3360,-99.63
3361,-99.75
3362,-99.85
3363,-99.90
3364,-99.95
3365,-99.95
3366,-99.93
3367,-99.88
3368,-99.85
3369,-99.88
3370,-99.97
3371,-100.11
3372,-100.27
3373,-100.46
3374,-100.64
3375,-100.78
3376,-100.82
3377,-100.73
3378,-100.52
3379,-100.26
3380,-99.95
3381,-99.62
3382,-99.27
3383,-98.95
3384,-98.66
3385,-98.44
3386,-98.24
3387,-98.05
3388,-97.79
3389,-97.50
3390,-97.16
3391,-96.82
3392,-96.47
3393,-96.20
3394,-95.99
3395,-95.89
3396,-95.85
3397,-95.85
3398,-95.84
3399,-95.84
3400,-95.76
3401,-95.63
3402,-95.41
3403,-95.17
3404,-94.92
3405,-94.69
3406,-94.44
3407,-94.21
3408,-93.99
3409,-93.77
3410,-93.49
3411,-93.19
3412,-92.87
3413,-92.62
3414,-92.41
3415,-92.27
3416,-92.19
3417,-92.19
3418,-92.21
3419,-92.20
3420,-92.14
3421,-92.03
3422,-91.84
3423,-91.62
3424,-91.37
3425,-91.15
3426,-90.99
3427,-90.91
3428,-90.91
3429,-90.97
3430,-91.07
3431,-91.17
3432,-91.22
3433,-91.20
3434,-91.13
3435,-91.03
3436,-90.90
3437,-90.78
3438,-90.68
3439,-90.63
3440,-90.60
3441,-90.59
3442,-90.55
3443,-90.46
3444,-90.32
3445,-90.15
3446,-89.91
3447,-89.67
3448,-89.42
3449,-89.20
3450,-88.97
3451,-88.78
3452,-88.57
3453,-88.40
3454,-88.23
3455,-88.04
3456,-87.81
3457,-87.59
3458,-87.39
3459,-87.23
3460,-87.06
3461,-86.91
3462,-86.75
3463,-86.62
3464,-86.47
3465,-86.32
3466,-86.14
3467,-85.97
3468,-85.77
3469,-85.55
3470,-85.30
3471,-85.05
3472,-84.79
3473,-84.56
3474,-84.34
3475,-84.17
3476,-84.01
3477,-83.90
3478,-83.82
3479,-83.79
3480,-83.79
3481,-83.82
3482,-83.83
3483,-83.82
3484,-83.75
3485,-83.65
3486,-83.52
3487,-83.39
3488,-83.21
3489,-83.02
3490,-82.79
3491,-82.54
3492,-82.30
3493,-82.05
3494,-81.85
3495,-81.73
3496,-81.70
3497,-81.79
3498,-81.99
3499,-82.24
3500,-82.54
3501,-82.85
3502,-83.13
3503,-83.37
3504,-83.53
3505,-83.63
3506,-83.70
3507,-83.74
3508,-83.78
3509,-83.83
3510,-83.94
3511,-84.08
3512,-84.27
3513,-84.46
3514,-84.67
3515,-84.88
3516,-85.08
3517,-85.24
3518,-85.44
3519,-85.65
3520,-85.91
3521,-86.19
3522,-86.51
3523,-86.81
3524,-87.14
3525,-87.46
3526,-87.81
3527,-88.18
3528,-88.58
3529,-88.98
3530,-89.44
3531,-89.93
3532,-90.45
3533,-90.91
3534,-91.35
3535,-91.72
3536,-92.05
3537,-92.29
3538,-92.49
3539,-92.66
3540,-92.86
3541,-93.07
3542,-93.31
3543,-93.51
3544,-93.73
3545,-93.89
3546,-94.02
3547,-94.11
3548,-94.21
3549,-94.33
3550,-94.50
3551,-94.67
3552,-94.83
3553,-94.92
3554,-94.96
3555,-94.93
3556,-94.86
3557,-94.77
3558,-94.71
3559,-94.70
3560,-94.75
3561,-94.86
3562,-94.98
3563,-95.05
3564,-95.07
3565,-95.00
3566,-94.89
3567,-94.76
3568,-94.68
3569,-94.70
3570,-94.87
3571,-95.15
3572,-95.52
3573,-95.93
3574,-96.36
3575,-96.75
3576,-97.05
3577,-97.27
3578,-97.47
3579,-97.66
3580,-97.91
3581,-98.16
3582,-98.40
3583,-98.61
3584,-98.79
3585,-98.93
3586,-99.00
3587,-98.97
3588,-98.88
3589,-98.77
3590,-98.69
3591,-98.60
3592,-98.53
3593,-98.43
3594,-98.38
3595,-98.41
3596,-98.56
3597,-98.86
3598,-99.33
3599,-99.91
3600,-100.57
3601,-101.16
3602,-101.62
3603,-101.94
3604,-102.18
3605,-102.35
3606,-102.49
3607,-102.57
3608,-102.64
3609,-102.68
3610,-102.71
3611,-102.70
3612,-102.68
3613,-102.62
3614,-102.57
3615,-102.52
3616,-102.52
3617,-102.57
3618,-102.70
3619,-102.86
3620,-103.05
3621,-103.23
3622,-103.40
3623,-103.54
3624,-103.67
3625,-103.80
3626,-103.97
3627,-104.19
3628,-104.47
3629,-104.80
3630,-105.18
3631,-105.58
3632,-105.98
3633,-106.35
3634,-106.70
3635,-107.03
3636,-107.33
3637,-107.60
3638,-107.83
3639,-108.02
3640,-108.18
3641,-108.27
3642,-108.29
3643,-108.24
3644,-108.16
3645,-108.06
3646,-107.98
3647,-107.90
3648,-107.84
3649,-107.79
3650,-107.70
3651,-107.58
3652,-107.44
3653,-107.32
3654,-107.17
3655,-107.03
3656,-106.86
3657,-106.70
3658,-106.52
3659,-106.35
3660,-106.12
3661,-105.85
3662,-105.51
3663,-105.17
3664,-104.81
3665,-104.51
3666,-104.20
3667,-103.94
3668,-103.66
3669,-103.40
3670,-103.10
3671,-102.79
3672,-102.41
3673,-102.04
3674,-101.62
3675,-101.22
3676,-100.75
3677,-100.30
3678,-99.79
3679,-99.33
3680,-98.85
3681,-98.38
3682,-97.87
3683,-97.37
3684,-96.80
3685,-96.24
3686,-95.61
3687,-94.99
3688,-94.36
3689,-93.83
3690,-93.42
3691,-93.18
3692,-93.05
3693,-93.06
3694,-93.17
3695,-93.36
3696,-93.54
3697,-93.69
3698,-93.77
3699,-93.81
3700,-93.81
3701,-93.78
3702,-93.74
3703,-93.69
3704,-93.66
3705,-93.64
3706,-93.65
3707,-93.69
3708,-93.79
3709,-93.93
3710,-94.13
3711,-94.38
3712,-94.69
3713,-94.99
3714,-95.27
3715,-95.50
3716,-95.70
3717,-95.88
3718,-96.05
3719,-96.20
3720,-96.38
3721,-96.58
3722,-96.83
3723,-97.08
3724,-97.33
3725,-97.53
3726,-97.72
3727,-97.90
3728,-98.13
3729,-98.35
3730,-98.64
3731,-98.98
3732,-99.46
3733,-99.98
3734,-100.57
3735,-101.15
3736,-101.74
3737,-102.28
3738,-102.78
3739,-103.19
3740,-103.56
3741,-103.88
3742,-104.17
3743,-104.42
3744,-104.65
3745,-104.84
3746,-105.00
3747,-105.07
3748,-105.08
3749,-105.01
3750,-104.89
3751,-104.72
3752,-104.55
3753,-104.38
3754,-104.23
3755,-104.10
3756,-103.97
3757,-103.85
3758,-103.66
3759,-103.40
3760,-103.05
3761,-102.65
3762,-102.18
3763,-101.72
3764,-101.24
3765,-100.83
3766,-100.45
3767,-100.11
3768,-99.73
3769,-99.33
3770,-98.84
3771,-98.30
3772,-97.72
3773,-97.16
3774,-96.62
3775,-96.15
3776,-95.71
3777,-95.34
3778,-94.99
3779,-94.67
3780,-94.32
3781,-93.96
3782,-93.55
3783,-93.19
3784,-92.84
3785,-92.57
3786,-92.34
3787,-92.18
3788,-92.07
3789,-92.00
3790,-91.93
3791,-91.87
3792,-91.77
3793,-91.70
3794,-91.65
3795,-91.67
3796,-91.74
3797,-91.90
3798,-92.12
3799,-92.41
3800,-92.74
3801,-93.03
3802,-93.28
3803,-93.44
3804,-93.53
3805,-93.52
3806,-93.45
3807,-93.35
3808,-93.24
3809,-93.15
3810,-93.08
3811,-93.00
3812,-92.92
3813,-92.83
3814,-92.68
3815,-92.48
3816,-92.16
3817,-91.77
3818,-91.31
3819,-90.82
3820,-90.25
3821,-89.66
3822,-89.08
3823,-88.56
3824,-88.07
3825,-87.62
3826,-87.20
3827,-86.88
3828,-86.60
3829,-86.36
3830,-86.09
3831,-85.82
3832,-85.51
3833,-85.23
3834,-84.88
3835,-84.54
3836,-84.18
3837,-83.86
3838,-83.54
3839,-83.24
3840,-82.91
3841,-82.60
3842,-82.30
3843,-82.02
3844,-81.74
3845,-81.50
3846,-81.28
3847,-81.12
3848,-80.99
3849,-80.89
3850,-80.79
3851,-80.67
3852,-80.52
3853,-80.36
3854,-80.20
3855,-80.05
3856,-79.90
3857,-79.78
3858,-79.72
3859,-79.70
3860,-79.70
3861,-79.72
3862,-79.78
3863,-79.87
3864,-80.02
3865,-80.22
3866,-80.48
3867,-80.83
3868,-81.21
3869,-81.60
3870,-81.99
3871,-82.32
3872,-82.61
3873,-82.82
3874,-82.98
3875,-83.11
3876,-83.28
3877,-83.45
3878,-83.66
3879,-83.88
3880,-84.12
3881,-84.35
3882,-84.58
3883,-84.78
3884,-85.01
3885,-85.27
3886,-85.59
3887,-85.93
3888,-86.30
3889,-86.65
3890,-87.06
3891,-87.46
3892,-87.85
3893,-88.19
3894,-88.50
3895,-88.78
3896,-89.09
3897,-89.35
3898,-89.59
3899,-89.80
3900,-90.05
3901,-90.32
3902,-90.65
3903,-90.98
3904,-91.36
3905,-91.75
3906,-92.21
3907,-92.70
3908,-93.22
3909,-93.73
3910,-94.28
3911,-94.82
3912,-95.38
3913,-95.85
3914,-96.24
3915,-96.48
3916,-96.61
3917,-96.63
3918,-96.61
3919,-96.56
3920,-96.57
3921,-96.63
3922,-96.81
3923,-97.05
3924,-97.39
3925,-97.74
3926,-98.11
3927,-98.43
3928,-98.72
3929,-98.95
3930,-99.16
3931,-99.33
3932,-99.49
3933,-99.59
3934,-99.66
3935,-99.75
3936,-99.88
3937,-100.06
3938,-100.27
3939,-100.47
3940,-100.69
3941,-100.89
3942,-101.03
3943,-101.07
3944,-100.96
3945,-100.73
3946,-100.39
3947,-99.99
3948,-99.56
3949,-99.16
3950,-98.79
3951,-98.47
3952,-98.25
3953,-98.14
3954,-98.08
3955,-98.11
3956,-98.11
3957,-98.09
3958,-97.95
3959,-97.71
3960,-97.36
3961,-96.95
3962,-96.50
3963,-96.07
3964,-95.70
3965,-95.46
3966,-95.36
3967,-95.40
3968,-95.54
3969,-95.74
3970,-95.92
3971,-96.08
3972,-96.14
3973,-96.12
3974,-96.02
3975,-95.89
3976,-95.75
3977,-95.64
3978,-95.56
3979,-95.47
3980,-95.39
3981,-95.31
3982,-95.24
3983,-95.16
3984,-95.10
3985,-95.07
3986,-95.07
3987,-95.12
3988,-95.20
3989,-95.31
3990,-95.42
3991,-95.50
3992,-95.57
3993,-95.61
3994,-95.65
3995,-95.70
3996,-95.82
3997,-95.98
3998,-96.18
3999,-96.43
4000,-96.71
4001,-97.01
4002,-97.27
4003,-97.49
4004,-97.65
4005,-97.76
4006,-97.85
4007,-97.89
4008,-97.92
4009,-97.96
4010,-98.01
4011,-98.05
4012,-98.04
4013,-97.98
4014,-97.86
4015,-97.66
4016,-97.40
4017,-97.06
4018,-96.75
4019,-96.50
4020,-96.40
4021,-96.47
4022,-96.74
4023,-97.20
4024,-97.85
4025,-98.63
4026,-99.49
4027,-100.34
4028,-101.16
4029,-101.87
4030,-102.46
4031,-102.91
4032,-103.23
4033,-103.41
4034,-103.52
4035,-103.52
4036,-103.48
4037,-103.44
4038,-103.47
4039,-103.58
4040,-103.78
4041,-104.04
4042,-104.32
4043,-104.56
4044,-104.65
4045,-104.58
4046,-104.30
4047,-103.88
4048,-103.32
4049,-102.71
4050,-102.05
4051,-101.43
4052,-100.80
4053,-100.20
4054,-99.54
4055,-98.89
4056,-98.15
4057,-97.43
4058,-96.64
4059,-95.90
4060,-95.13
4061,-94.42
4062,-93.70
4063,-93.00
4064,-92.22
4065,-91.42
4066,-90.56
4067,-89.77
4068,-89.00
4069,-88.36
4070,-87.81
4071,-87.40
4072,-87.08
4073,-86.88
4074,-86.72
4075,-86.64
4076,-86.59
4077,-86.58
4078,-86.59
4079,-86.65
4080,-86.71
4081,-86.79
4082,-86.85
4083,-86.89
4084,-86.85
4085,-86.74
4086,-86.54
4087,-86.30
4088,-86.02
4089,-85.72
4090,-85.37
4091,-85.04
4092,-84.75
4093,-84.53
4094,-84.36
4095,-84.24
4096,-84.19
4097,-84.22
4098,-84.33
4099,-84.48
4100,-84.63
4101,-84.74
4102,-84.81
4103,-84.82
4104,-84.75
4105,-84.63
4106,-84.44
4107,-84.27
4108,-84.11
4109,-83.97
4110,-83.85
4111,-83.77
4112,-83.70
4113,-83.63
4114,-83.53
4115,-83.42
4116,-83.27
4117,-83.13
4118,-82.96
4119,-82.78
4120,-82.55
4121,-82.31
4122,-82.00
4123,-81.65
4124,-81.19
4125,-80.69
4126,-80.12
4127,-79.56
4128,-78.97
4129,-78.41
4130,-77.88
4131,-77.45
4132,-77.09
4133,-76.81
4134,-76.55
4135,-76.32
4136,-76.07
4137,-75.81
4138,-75.52
4139,-75.23
4140,-74.91
4141,-74.62
4142,-74.34
4143,-74.13
4144,-73.98
4145,-73.91
4146,-73.85
4147,-73.80
4148,-73.70
4149,-73.53
4150,-73.32
4151,-73.10
4152,-72.93
4153,-72.82
4154,-72.81
4155,-72.88
4156,-73.06
4157,-73.34
4158,-73.70
4159,-74.07
4160,-74.45
4161,-74.77
4162,-75.04
4163,-75.25
4164,-75.42
4165,-75.58
4166,-75.76
4167,-75.96
4168,-76.21
4169,-76.52
4170,-76.91
4171,-77.31
4172,-77.70
4173,-78.01
4174,-78.27
4175,-78.46
4176,-78.62
4177,-78.72
4178,-78.81
4179,-78.89
4180,-78.99
4181,-79.09
4182,-79.22
4183,-79.32
4184,-79.42
4185,-79.49
4186,-79.59
4187,-79.71
4188,-79.90
4189,-80.12
4190,-80.44
4191,-80.81
4192,-81.23
4193,-81.64
4194,-82.06
4195,-82.44
4196,-82.81
4197,-83.13
4198,-83.43
4199,-83.71
4200,-83.99
4201,-84.24
4202,-84.45
4203,-84.56
4204,-84.63
4205,-84.63
4206,-84.63
4207,-84.60
4208,-84.59
4209,-84.63
4210,-84.70
4211,-84.81
4212,-84.91
4213,-84.95
4214,-84.94
4215,-84.86
4216,-84.72
4217,-84.56
4218,-84.40
4219,-84.26
4220,-84.17
4221,-84.13
4222,-84.13
4223,-84.15
4224,-84.19
4225,-84.22
4226,-84.24
4227,-84.26
4228,-84.26
4229,-84.27
4230,-84.27
4231,-84.29
4232,-84.29
4233,-84.27
4234,-84.21
4235,-84.12
4236,-83.98
4237,-83.82
4238,-83.65
4239,-83.48
4240,-83.33
4241,-83.20
4242,-83.08
4243,-83.00
4244,-82.92
4245,-82.85
4246,-82.76
4247,-82.64
4248,-82.48
4249,-82.28
4250,-82.08
4251,-81.89
4252,-81.75
4253,-81.67
4254,-81.64
4255,-81.67
4256,-81.74
4257,-81.83
4258,-81.94
4259,-82.06
4260,-82.24
4261,-82.42
4262,-82.65
4263,-82.89
4264,-83.20
4265,-83.51
4266,-83.88
4267,-84.25
4268,-84.70
4269,-85.16
4270,-85.68
4271,-86.19
4272,-86.75
4273,-87.30
4274,-87.89
4275,-88.42
4276,-88.97
4277,-89.45
4278,-89.98
4279,-90.49
4280,-91.03
4281,-91.56
4282,-92.11
4283,-92.64
4284,-93.16
4285,-93.61
4286,-93.96
4287,-94.18
4288,-94.30
4289,-94.30
4290,-94.18
4291,-93.95
4292,-93.64
4293,-93.28
4294,-92.83
4295,-92.32
4296,-91.68
4297,-91.03
4298,-90.33
4299,-89.68
4300,-88.97
4301,-88.28
4302,-87.52
4303,-86.78
4304,-85.98
4305,-85.18
4306,-84.30
4307,-83.46
4308,-82.58
4309,-81.79
4310,-80.97
4311,-80.22
4312,-79.44
4313,-78.74
4314,-78.02
4315,-77.40
4316,-76.81
4317,-76.35
4318,-75.94
4319,-75.64
4320,-75.35
4321,-75.10
4322,-74.78
4323,-74.40
4324,-73.95
4325,-73.49
4326,-73.01
4327,-72.58
4328,-72.25
4329,-72.10
4330,-72.12
4331,-72.30
4332,-72.55
4333,-72.83
4334,-73.08
4335,-73.27
4336,-73.32
4337,-73.25
4338,-73.07
4339,-72.82
4340,-72.55
4341,-72.31
4342,-72.16
4343,-72.10
4344,-72.10
4345,-72.14
4346,-72.19
4347,-72.24
4348,-72.22
4349,-72.16
4350,-72.04
4351,-71.90
4352,-71.75
4353,-71.62
4354,-71.52
4355,-71.45
4356,-71.37
4357,-71.28
4358,-71.12
4359,-70.92
4360,-70.64
4361,-70.33
4362,-69.98
4363,-69.67
4364,-69.40
4365,-69.20
4366,-69.05
4367,-68.95
4368,-68.86
4369,-68.77
4370,-68.67
4371,-68.57
4372,-68.48
4373,-68.41
4374,-68.38
4375,-68.40
4376,-68.47
4377,-68.60
4378,-68.79
4379,-69.01
4380,-69.29
4381,-69.59
4382,-69.95
4383,-70.32
4384,-70.79
4385,-71.29
4386,-71.88
4387,-72.51
4388,-73.19
4389,-73.86
4390,-74.55
4391,-75.19
4392,-75.85
4393,-76.44
4394,-77.00
4395,-77.47
4396,-77.93
4397,-78.32
4398,-78.70
4399,-79.03
4400,-79.41
4401,-79.76
4402,-80.13
4403,-80.47
4404,-80.89
4405,-81.32
4406,-81.85
4407,-82.39
4408,-83.02
4409,-83.67
4410,-84.37
4411,-85.03
4412,-85.66
4413,-86.20
4414,-86.65
4415,-86.98
4416,-87.22
4417,-87.39
4418,-87.52
4419,-87.64
4420,-87.75
4421,-87.88
4422,-88.00
4423,-87.97
4424,-87.72
4425,-87.30
4426,-86.83
4427,-86.43
4428,-86.05
4429,-85.70
4430,-85.30
4431,-84.91
4432,-84.47
4433,-84.04
4434,-83.56
4435,-83.11
4436,-82.64
4437,-82.21
4438,-81.76
4439,-81.37
4440,-80.93
4441,-80.51
4442,-80.01
4443,-79.49
4444,-78.87
4445,-78.25
4446,-77.48
4447,-76.66
4448,-75.66
4449,-74.64
4450,-73.55
4451,-72.55
4452,-71.53
4453,-70.58
4454,-69.63
4455,-68.77
4456,-67.92
4457,-67.17
4458,-66.42
4459,-65.77
4460,-65.15
4461,-64.63
4462,-64.13
4463,-63.74
4464,-63.38
4465,-63.13
4466,-62.90
4467,-62.71
4468,-62.54
4469,-62.42
4470,-62.32
4471,-62.26
4472,-62.21
4473,-62.17
4474,-62.16
4475,-62.19
4476,-62.23
4477,-62.30
4478,-62.37
4479,-62.42
4480,-62.45
4481,-62.44
4482,-62.39
4483,-62.32
4484,-62.28
4485,-62.29
4486,-62.41
4487,-62.62
4488,-62.95
4489,-63.35
4490,-63.84
4491,-64.38
4492,-64.92
4493,-65.39
4494,-65.80
4495,-66.10
4496,-66.37
4497,-66.58
4498,-66.83
4499,-67.18
4500,-67.67
4501,-68.18
4502,-68.55
4503,-68.73
4504,-68.84
4505,-68.98
4506,-69.21
4507,-69.45
4508,-69.73
4509,-70.02
4510,-70.37
4511,-70.72
4512,-71.04
4513,-71.27
4514,-71.43
4515,-71.50
4516,-71.50
4517,-71.45
4518,-71.39
4519,-71.33
4520,-71.33
4521,-71.40
4522,-71.50
4523,-71.62
4524,-71.74
4525,-71.81
4526,-71.84
4527,-71.82
4528,-71.79
4529,-71.78
4530,-71.84
4531,-71.95
4532,-72.14
4533,-72.41
4534,-72.75
4535,-73.14
4536,-73.50
4537,-73.78
4538,-73.97
4539,-74.07
4540,-74.11
4541,-74.13
4542,-74.13
4543,-74.12
4544,-74.13
4545,-74.14
4546,-74.17
4547,-74.14
4548,-74.09
4549,-73.99
4550,-73.89
4551,-73.81
4552,-73.80
4553,-73.85
4554,-74.01
4555,-74.23
4556,-74.56
4557,-74.94
4558,-75.39
4559,-75.82
4560,-76.23
4561,-76.55
4562,-76.81
4563,-77.00
4564,-77.14
4565,-77.22
4566,-77.28
4567,-77.32
4568,-77.37
4569,-77.43
4570,-77.49
4571,-77.55
4572,-77.61
4573,-77.66
4574,-77.67
4575,-77.64
4576,-77.55
4577,-77.41
4578,-77.21
4579,-76.95
4580,-76.64
4581,-76.35
4582,-76.11
4583,-75.89
4584,-75.58
4585,-75.22
4586,-74.84
4587,-74.55
4588,-74.33
4589,-74.13
4590,-73.86
4591,-73.55
4592,-73.19
4593,-72.82
4594,-72.43
4595,-72.08
4596,-71.75
4597,-71.48
4598,-71.29
4599,-71.17
4600,-71.11
4601,-71.07
4602,-71.03
4603,-71.01
4604,-70.98
4605,-70.93
4606,-70.88
4607,-70.84
4608,-70.85
4609,-70.93
4610,-71.07
4611,-71.25
4612,-71.44
4613,-71.61
4614,-71.74
4615,-71.81
4616,-71.85
4617,-71.85
4618,-71.86
4619,-71.95
4620,-72.12
4621,-72.36
4622,-72.59
4623,-72.77
4624,-72.89
4625,-72.99
4626,-73.00
4627,-72.91
4628,-72.72
4629,-72.54
4630,-72.35
4631,-72.12
4632,-71.69
4633,-71.03
4634,-70.18
4635,-69.31
4636,-68.41
4637,-67.58
4638,-66.73
4639,-65.94
4640,-65.17
4641,-64.51
4642,-63.91
4643,-63.41
4644,-62.92
4645,-62.51
4646,-62.10
4647,-61.78
4648,-61.48
4649,-61.29
4650,-61.14
4651,-61.09
4652,-61.03
4653,-60.95
4654,-60.79
4655,-60.57
4656,-60.22
4657,-59.78
4658,-59.21
4659,-58.62
4660,-58.03
4661,-57.53
4662,-57.10
4663,-56.78
4664,-56.55
4665,-56.43
4666,-56.40
4667,-56.43
4668,-56.46
4669,-56.51
4670,-56.54
4671,-56.56
4672,-56.55
4673,-56.50
4674,-56.38
4675,-56.25
4676,-56.11
4677,-55.98
4678,-55.88
4679,-55.78
4680,-55.67
4681,-55.57
4682,-55.47
4683,-55.40
4684,-55.35
4685,-55.33
4686,-55.34
4687,-55.39
4688,-55.48
4689,-55.61
4690,-55.79
4691,-55.96
4692,-56.14
4693,-56.27
4694,-56.37
4695,-56.43
4696,-56.51
4697,-56.59
4698,-56.71
4699,-56.90
4700,-57.22
4701,-57.64
4702,-58.16
4703,-58.68
4704,-59.21
4705,-59.69
4706,-60.13
4707,-60.46
4708,-60.75
4709,-60.99
4710,-61.25
4711,-61.51
4712,-61.82
4713,-62.16
4714,-62.53
4715,-62.89
4716,-63.22
4717,-63.46
4718,-63.64
4719,-63.72
4720,-63.73
4721,-63.65
4722,-63.51
4723,-63.35
4724,-63.19
4725,-63.07
4726,-63.03
4727,-63.04
4728,-63.12
4729,-63.21
4730,-63.29
4731,-63.32
4732,-63.30
4733,-63.23
4734,-63.16
4735,-63.14
4736,-63.22
4737,-63.38
4738,-63.61
4739,-63.88
4740,-64.19
4741,-64.47
4742,-64.71
4743,-64.87
4744,-64.97
4745,-65.03
4746,-65.12
4747,-65.25
4748,-65.45
4749,-65.69
4750,-65.96
4751,-66.18
4752,-66.34
4753,-66.39
4754,-66.37
4755,-66.28
4756,-66.19
4757,-66.15
4758,-66.23
4759,-66.42
4760,-66.72
4761,-67.06
4762,-67.44
4763,-67.76
4764,-68.00
4765,-68.11
4766,-68.10
4767,-68.02
4768,-67.89
4769,-67.74
4770,-67.59
4771,-67.47
4772,-67.40
4773,-67.38
4774,-67.35
4775,-67.31
4776,-67.22
4777,-67.10
4778,-66.92
4779,-66.70
4780,-66.41
4781,-66.08
4782,-65.67
4783,-65.25
4784,-64.78
4785,-64.38
4786,-64.03
4787,-63.79
4788,-63.63
4789,-63.55
4790,-63.45
4791,-63.35
4792,-63.13
4793,-62.79
4794,-62.26
4795,-61.62
4796,-60.91
4797,-60.24
4798,-59.63
4799,-59.15
4800,-58.76
4801,-58.48
4802,-58.20
4803,-57.91
4804,-57.56
4805,-57.17
4806,-56.69
4807,-56.21
4808,-55.73
4809,-55.36
4810,-55.10
4811,-54.99
4812,-55.00
4813,-55.12
4814,-55.32
4815,-55.58
4816,-55.87
4817,-56.18
4818,-56.46
4819,-56.71
4820,-56.95
4821,-57.18
4822,-57.43
4823,-57.70
4824,-58.00
4825,-58.29
4826,-58.59
4827,-58.84
4828,-59.04
4829,-59.14
4830,-59.14
4831,-59.01
4832,-58.81
4833,-58.56
4834,-58.33
4835,-58.15
4836,-58.04
4837,-57.96
4838,-57.90
4839,-57.88
4840,-57.89
4841,-57.94
4842,-57.97
4843,-57.96
4844,-57.91
4845,-57.87
4846,-57.81
4847,-57.75
4848,-57.69
4849,-57.63
4850,-57.57
4851,-57.49
4852,-57.36
4853,-57.19
4854,-57.00
4855,-56.81
4856,-56.62
4857,-56.45
4858,-56.34
4859,-56.29
4860,-56.31
4861,-56.41
4862,-56.55
4863,-56.71
4864,-56.82
4865,-56.87
4866,-56.82
4867,-56.72
4868,-56.58
4869,-56.47
4870,-56.38
4871,-56.36
4872,-56.37
4873,-56.42
4874,-56.48
4875,-56.51
4876,-56.47
4877,-56.31
4878,-56.03
4879,-55.66
4880,-55.19
4881,-54.73
4882,-54.31
4883,-53.99
4884,-53.73
4885,-53.54
4886,-53.34
4887,-53.14
4888,-52.89
4889,-52.60
4890,-52.23
4891,-51.84
4892,-51.48
4893,-51.21
4894,-51.03
4895,-50.97
4896,-50.98
4897,-51.03
4898,-51.07
4899,-51.09
4900,-51.03
4901,-50.92
4902,-50.70
4903,-50.46
4904,-50.19
4905,-49.93
4906,-49.61
4907,-49.28
4908,-48.90
4909,-48.52
4910,-48.10
4911,-47.66
4912,-47.19
4913,-46.75
4914,-46.33
4915,-46.03
4916,-45.80
4917,-45.68
4918,-45.61
4919,-45.61
4920,-45.61
4921,-45.61
4922,-45.52
4923,-45.37
4924,-45.11
4925,-44.77
4926,-44.34
4927,-43.91
4928,-43.53
4929,-43.27
4930,-43.10
4931,-43.05
4932,-43.06
4933,-43.12
4934,-43.15
4935,-43.14
4936,-43.00
4937,-42.77
4938,-42.43
4939,-42.05
4940,-41.62
4941,-41.24
4942,-40.91
4943,-40.65
4944,-40.37
4945,-40.08
4946,-39.71
4947,-39.30
4948,-38.80
4949,-38.25
4950,-37.65
4951,-37.06
4952,-36.48
4953,-36.01
4954,-35.66
4955,-35.48
4956,-35.46
4957,-35.58
4958,-35.77
4959,-36.03
4960,-36.30
4961,-36.54
4962,-36.67
4963,-36.69
4964,-36.61
4965,-36.47
4966,-36.30
4967,-36.14
4968,-35.99
4969,-35.86
4970,-35.73
4971,-35.60
4972,-35.44
4973,-35.25
4974,-35.01
4975,-34.76
4976,-34.50
4977,-34.26
4978,-34.04
4979,-33.88
4980,-33.77
4981,-33.70
4982,-33.65
4983,-33.63
4984,-33.60
4985,-33.61
4986,-33.64
4987,-33.73
4988,-33.87
4989,-34.04
4990,-34.19
4991,-34.30
4992,-34.34
4993,-34.29
4994,-34.10
4995,-33.78
4996,-33.38
4997,-32.95
4998,-32.56
4999,-32.26
5000,-32.09
5001,-32.08
5002,-32.20
5003,-32.38
5004,-32.59
5005,-32.76
5006,-32.91
5007,-33.00
5008,-33.08
5009,-33.15
5010,-33.26
5011,-33.41
5012,-33.65
5013,-33.93
5014,-34.28
5015,-34.63
5016,-34.97
5017,-35.22
5018,-35.45
5019,-35.64
5020,-35.81
5021,-35.96
5022,-36.10
5023,-36.23
5024,-36.35
5025,-36.44
5026,-36.52
5027,-36.58
5028,-36.64
5029,-36.68
5030,-36.75
5031,-36.83
5032,-36.94
5033,-37.06
5034,-37.21
5035,-37.38
5036,-37.58
5037,-37.80
5038,-38.07
5039,-38.38
5040,-38.73
5041,-39.08
5042,-39.40
5043,-39.66
5044,-39.83
5045,-39.90
5046,-39.89
5047,-39.81
5048,-39.67
5049,-39.50
5050,-39.28
5051,-39.04
5052,-38.78
5053,-38.54
5054,-38.29
5055,-38.05
5056,-37.80
5057,-37.58
5058,-37.41
5059,-37.29
5060,-37.19
5061,-37.12
5062,-37.03
5063,-36.96
5064,-36.87
5065,-36.75
5066,-36.62
5067,-36.50
5068,-36.39
5069,-36.29
5070,-36.18
5071,-36.11
5072,-36.08
5073,-36.08
5074,-36.09
5075,-36.07
5076,-36.03
5077,-35.96
5078,-35.90
5079,-35.84
5080,-35.79
5081,-35.74
5082,-35.73
5083,-35.76
5084,-35.82
5085,-35.92
5086,-36.03
5087,-36.13
5088,-36.20
5089,-36.25
5090,-36.28
5091,-36.29
5092,-36.29
5093,-36.28
5094,-36.25
5095,-36.22
5096,-36.17
5097,-36.09
5098,-35.96
5099,-35.85
5100,-35.74
5101,-35.67
5102,-35.61
5103,-35.57
5104,-35.55
5105,-35.54
5106,-35.48
5107,-35.39
5108,-35.24
5109,-35.04
5110,-34.79
5111,-34.51
5112,-34.23
5113,-33.97
5114,-33.71
5115,-33.45
5116,-33.19
5117,-32.96
5118,-32.73
5119,-32.55
5120,-32.38
5121,-32.26
5122,-32.17
5123,-32.09
5124,-31.98
5125,-31.86
5126,-31.66
5127,-31.41
5128,-31.11
5129,-30.83
5130,-30.59
5131,-30.41
5132,-30.27
5133,-30.18
5134,-30.09
5135,-29.99
5136,-29.85
5137,-29.67
5138,-29.45
5139,-29.24
5140,-29.08
5141,-28.98
5142,-28.98
5143,-29.06
5144,-29.18
5145,-29.31
5146,-29.39
5147,-29.40
5148,-29.35
5149,-29.25
5150,-29.11
5151,-28.95
5152,-28.81
5153,-28.70
5154,-28.67
5155,-28.72
5156,-28.81
5157,-28.95
5158,-29.13
5159,-29.34
5160,-29.56
5161,-29.79
5162,-30.01
5163,-30.20
5164,-30.33
5165,-30.37
5166,-30.30
5167,-30.13
5168,-29.89
5169,-29.62
5170,-29.36
5171,-29.14
5172,-28.99
5173,-28.92
5174,-28.92
5175,-28.98
5176,-29.02
5177,-29.03
5178,-28.95
5179,-28.81
5180,-28.62
5181,-28.43
5182,-28.21
5183,-28.04
5184,-27.92
5185,-27.90
5186,-27.84
5187,-27.66
5188,-27.24
5189,-26.68
5190,-26.03
5191,-25.41
5192,-24.76
5193,-24.09
5194,-23.38
5195,-22.70
5196,-22.02
5197,-21.39
5198,-20.76
5199,-20.20
5200,-19.65
5201,-19.18
5202,-18.75
5203,-18.40
5204,-18.12
5205,-17.95
5206,-17.85
5207,-17.81
5208,-17.79
5209,-17.80
5210,-17.80
5211,-17.80
5212,-17.80
5213,-17.81
5214,-17.87
5215,-17.97
5216,-18.11
5217,-18.30
5218,-18.52
5219,-18.76
5220,-18.97
5221,-19.14
5222,-19.26
5223,-19.36
5224,-19.41
5225,-19.45
5226,-19.46
5227,-19.48
5228,-19.46
5229,-19.42
5230,-19.36
5231,-19.23
5232,-19.03
5233,-18.73
5234,-18.36
5235,-17.99
5236,-17.62
5237,-17.30
5238,-17.01
5239,-16.75
5240,-16.49
5241,-16.30
5242,-16.10
5243,-15.94
5244,-15.75
5245,-15.56
5246,-15.27
5247,-14.96
5248,-14.58
5249,-14.17
5250,-13.69
5251,-13.20
5252,-12.73
5253,-12.33
5254,-11.98
5255,-11.68
5256,-11.38
5257,-11.10
5258,-10.81
5259,-10.53
5260,-10.19
5261,-9.86
5262,-9.51
5263,-9.20
5264,-8.90
5265,-8.68
5266,-8.50
5267,-8.38
5268,-8.28
5269,-8.19
5270,-8.09
5271,-8.03
5272,-7.93
5273,-7.84
5274,-7.66
5275,-7.45
5276,-7.19
5277,-6.91
5278,-6.55
5279,-6.13
5280,-5.67
5281,-5.20
5282,-4.75
5283,-4.36
5284,-4.00
5285,-3.66
5286,-3.35
5287,-3.09
5288,-2.89
5289,-2.74
5290,-2.61
5291,-2.52
5292,-2.53
5293,-2.64
5294,-2.82
5295,-3.06
5296,-3.35
5297,-3.70
5298,-4.11
5299,-4.51
5300,-4.90
5301,-5.29
5302,-5.69
5303,-6.08
5304,-6.43
5305,-6.70
5306,-6.89
5307,-6.99
5308,-7.00
5309,-6.94
5310,-6.85
5311,-6.78
5312,-6.77
5313,-6.80
5314,-6.86
5315,-6.92
5316,-6.95
5317,-6.94
5318,-6.87
5319,-6.75
5320,-6.58
5321,-6.42
5322,-6.24
5323,-6.10
5324,-5.94
5325,-5.77
5326,-5.55
5327,-5.26
5328,-4.92
5329,-4.56
5330,-4.23
5331,-3.97
5332,-3.77
5333,-3.62
5334,-3.47
5335,-3.33
5336,-3.16
5337,-3.00
5338,-2.85
5339,-2.75
5340,-2.66
5341,-2.61
5342,-2.58
5343,-2.59
5344,-2.59
5345,-2.56
5346,-2.49
5347,-2.40
5348,-2.32
5349,-2.30
5350,-2.37
5351,-2.50
5352,-2.69
5353,-2.91
5354,-3.17
5355,-3.41
5356,-3.60
5357,-3.67
5358,-3.62
5359,-3.48
5360,-3.32
5361,-3.16
5362,-3.02
5363,-2.90
5364,-2.84
5365,-2.83
5366,-2.88
5367,-2.92
5368,-2.97
5369,-3.01
5370,-3.11
5371,-3.26
5372,-3.47
5373,-3.73
5374,-4.07
5375,-4.46
5376,-4.89
5377,-5.27
5378,-5.61
5379,-5.87
5380,-6.11
5381,-6.34
5382,-6.57
5383,-6.77
5384,-6.99
5385,-7.20
5386,-7.44
5387,-7.68
5388,-7.92
5389,-8.15
5390,-8.40
5391,-8.64
5392,-8.93
5393,-9.20
5394,-9.47
5395,-9.67
5396,-9.86
5397,-9.99
5398,-10.11
5399,-10.16
5400,-10.22
5401,-10.26
5402,-10.33
5403,-10.41
5404,-10.54
5405,-10.70
5406,-10.90
5407,-11.12
5408,-11.33
5409,-11.54
5410,-11.73
5411,-11.89
5412,-11.99
5413,-12.01
5414,-11.98
5415,-11.88
5416,-11.75
5417,-11.63
5418,-11.54
5419,-11.50
5420,-11.48
5421,-11.51
5422,-11.54
5423,-11.58
5424,-11.55
5425,-11.44
5426,-11.23
5427,-10.95
5428,-10.59
5429,-10.19
5430,-9.82
5431,-9.52
5432,-9.31
5433,-9.18
5434,-9.11
5435,-9.09
5436,-9.12
5437,-9.17
5438,-9.22
5439,-9.24
5440,-9.20
5441,-9.13
5442,-9.03
5443,-8.89
5444,-8.71
5445,-8.50
5446,-8.29
5447,-8.14
5448,-8.05
5449,-8.03
5450,-8.05
5451,-8.13
5452,-8.23
5453,-8.29
5454,-8.29
5455,-8.21
5456,-8.09
5457,-7.91
5458,-7.74
5459,-7.59
5460,-7.55
5461,-7.64
5462,-7.86
5463,-8.16
5464,-8.52
5465,-8.91
5466,-9.29
5467,-9.62
5468,-9.89
5469,-10.09
5470,-10.22
5471,-10.30
5472,-10.36
5473,-10.41
5474,-10.44
5475,-10.42
5476,-10.33
5477,-10.17
5478,-9.96
5479,-9.74
5480,-9.49
5481,-9.25
5482,-9.03
5483,-8.90
5484,-8.87
5485,-8.91
5486,-9.01
5487,-9.11
5488,-9.22
5489,-9.32
5490,-9.42
5491,-9.53
5492,-9.64
5493,-9.77
5494,-9.93
5495,-10.09
5496,-10.27
5497,-10.43
5498,-10.59
5499,-10.73
5500,-10.82
5501,-10.86
5502,-10.86
5503,-10.82
5504,-10.73
5505,-10.63
5506,-10.51
5507,-10.38
5508,-10.22
5509,-10.03
5510,-9.78
5511,-9.53
5512,-9.29
5513,-9.10
5514,-8.93
5515,-8.82
5516,-8.76
5517,-8.77
5518,-8.79
5519,-8.80
5520,-8.76
5521,-8.72
5522,-8.67
5523,-8.61
5524,-8.51
5525,-8.41
5526,-8.29
5527,-8.17
5528,-8.02
5529,-7.84
5530,-7.60
5531,-7.30
5532,-6.90
5533,-6.42
5534,-5.85
5535,-5.27
5536,-4.66
5537,-4.08
5538,-3.50
5539,-2.99
5540,-2.48
5541,-2.02
5542,-1.56
5543,-1.14
5544,-0.69
5545,-0.27
5546,0.18
5547,0.58
5548,0.95
5549,1.24
5550,1.50
5551,1.69
5552,1.87
5553,1.98
5554,2.08
5555,2.14
5556,2.21
5557,2.28
5558,2.37
5559,2.46
5560,2.55
5561,2.64
5562,2.74
5563,2.85
5564,2.92
5565,2.94
5566,2.89
5567,2.78
5568,2.63
5569,2.46
5570,2.24
5571,2.01
5572,1.74
5573,1.46
5574,1.17
5575,0.91
5576,0.66
5577,0.44
5578,0.21
5579,0.02
5580,-0.18
5581,-0.33
5582,-0.51
5583,-0.73
5584,-1.06
5585,-1.44
5586,-1.89
5587,-2.35
5588,-2.83
5589,-3.29
5590,-3.73
5591,-4.12
5592,-4.50
5593,-4.84
5594,-5.16
5595,-5.39
5596,-5.60
5597,-5.74
5598,-5.87
5599,-5.97
5600,-6.10
5601,-6.23
5602,-6.46
5603,-6.77
5604,-7.16
5605,-7.57
5606,-7.97
5607,-8.30
5608,-8.58
5609,-8.80
5610,-9.00
5611,-9.21
5612,-9.51
5613,-9.86
5614,-10.28
5615,-10.72
5616,-11.20
5617,-11.61
5618,-11.92
5619,-12.05
5620,-12.05
5621,-11.96
5622,-11.85
5623,-11.73
5624,-11.67
5625,-11.65
5626,-11.72
5627,-11.85
5628,-12.04
5629,-12.28
5630,-12.56
5631,-12.85
5632,-13.08
5633,-13.26
5634,-13.35
5635,-13.34
5636,-13.23
5637,-13.04
5638,-12.81
5639,-12.60
5640,-12.41
5641,-12.25
5642,-12.12
5643,-12.02
5644,-11.91
5645,-11.75
5646,-11.49
5647,-11.15
5648,-10.74
5649,-10.33
5650,-9.93
5651,-9.61
5652,-9.35
5653,-9.18
5654,-9.03
5655,-8.89
5656,-8.73
5657,-8.54
5658,-8.29
5659,-8.00
5660,-7.67
5661,-7.36
5662,-7.12
5663,-6.96
5664,-6.87
5665,-6.87
5666,-6.94
5667,-7.04
5668,-7.19
5669,-7.33
5670,-7.48
5671,-7.60
5672,-7.69
5673,-7.77
5674,-7.87
5675,-7.99
5676,-8.14
5677,-8.29
5678,-8.44
5679,-8.58
5680,-8.75
5681,-8.91
5682,-9.06
5683,-9.16
5684,-9.25
5685,-9.37
5686,-9.51
5687,-9.64
5688,-9.78
5689,-9.94
5690,-10.14
5691,-10.34
5692,-10.49
5693,-10.57
5694,-10.55
5695,-10.44
5696,-10.26
5697,-10.03
5698,-9.73
5699,-9.39
5700,-9.05
5701,-8.75
5702,-8.53
5703,-8.40
5704,-8.33
5705,-8.29
5706,-8.26
5707,-8.24
5708,-8.18
5709,-8.11
5710,-8.03
5711,-7.96
5712,-7.87
5713,-7.81
5714,-7.75
5715,-7.71
5716,-7.58
5717,-7.39
5718,-7.06
5719,-6.68
5720,-6.17
5721,-5.62
5722,-4.97
5723,-4.35
5724,-3.70
5725,-3.06
5726,-2.34
5727,-1.61
5728,-0.85
5729,-0.19
5730,0.42
5731,0.90
5732,1.34
5733,1.66
5734,1.98
5735,2.28
5736,2.69
5737,3.15
5738,3.72
5739,4.30
5740,4.86
5741,5.33
5742,5.73
5743,6.00
5744,6.18
5745,6.27
5746,6.36
5747,6.50
5748,6.74
5749,7.00
5750,7.28
5751,7.51
5752,7.67
5753,7.71
5754,7.62
5755,7.44
5756,7.22
5757,7.01
5758,6.86
5759,6.77
5760,6.77
5761,6.83
5762,6.91
5763,7.00
5764,7.05
5765,7.07
5766,7.02
5767,6.90
5768,6.68
5769,6.39
5770,6.05
5771,5.70
5772,5.33
5773,4.97
5774,4.60
5775,4.23
5776,3.80
5777,3.36
5778,2.88
5779,2.37
5780,1.84
5781,1.34
5782,0.88
5783,0.52
5784,0.22
5785,0.04
5786,-0.09
5787,-0.14
5788,-0.22
5789,-0.32
5790,-0.54
5791,-0.82
5792,-1.21
5793,-1.61
5794,-2.04
5795,-2.43
5796,-2.78
5797,-3.05
5798,-3.25
5799,-3.40
5800,-3.52
5801,-3.61
5802,-3.72
5803,-3.84
5804,-3.99
5805,-4.14
5806,-4.24
5807,-4.26
5808,-4.20
5809,-4.04
5810,-3.78
5811,-3.44
5812,-3.07
5813,-2.72
5814,-2.40
5815,-2.14
5816,-1.93
5817,-1.79
5818,-1.68
5819,-1.58
5820,-1.43
5821,-1.21
5822,-0.91
5823,-0.55
5824,-0.14
5825,0.24
5826,0.57
5827,0.80
5828,0.92
5829,0.95
5830,0.88
5831,0.76
5832,0.63
5833,0.54
5834,0.47
5835,0.43
5836,0.42
5837,0.40
5838,0.34
5839,0.22
5840,0.08
5841,-0.03
5842,-0.14
5843,-0.25
5844,-0.32
5845,-0.32
5846,-0.25
5847,-0.15
5848,-0.10
5849,-0.09
5850,-0.15
5851,-0.29
5852,-0.51
5853,-0.79
5854,-1.11
5855,-1.40
5856,-1.69
5857,-1.91
5858,-2.07
5859,-2.15
5860,-2.19
5861,-2.20
5862,-2.20
5863,-2.20
5864,-2.22
5865,-2.25
5866,-2.27
5867,-2.29
5868,-2.30
5869,-2.34
5870,-2.37
5871,-2.39
5872,-2.37
5873,-2.33
5874,-2.27
5875,-2.16
5876,-1.98
5877,-1.75
5878,-1.47
5879,-1.17
5880,-0.84
5881,-0.52
5882,-0.21
5883,0.00
5884,0.16
5885,0.25
5886,0.32
5887,0.36
5888,0.42
5889,0.51
5890,0.69
5891,0.94
5892,1.27
5893,1.63
5894,1.99
5895,2.33
5896,2.66
5897,2.96
5898,3.29
5899,3.61
5900,3.95
5901,4.30
5902,4.70
5903,5.10
5904,5.49
5905,5.83
5906,6.13
5907,6.37
5908,6.61
5909,6.82
5910,7.05
5911,7.27
5912,7.50
5913,7.71
5914,7.87
5915,7.98
5916,8.03
5917,8.03
5918,8.00
5919,7.98
5920,8.00
5921,8.07
5922,8.19
5923,8.32
5924,8.39
5925,8.37
5926,8.22
5927,7.94
5928,7.58
5929,7.20
5930,6.87
5931,6.61
5932,6.44
5933,6.38
5934,6.39
5935,6.42
5936,6.41
5937,6.34
5938,6.16
5939,5.93
5940,5.60
5941,5.23
5942,4.83
5943,4.45
5944,4.07
5945,3.72
5946,3.37
5947,3.05
5948,2.72
5949,2.41
5950,2.11
5951,1.88
5952,1.70
5953,1.64
5954,1.64
5955,1.72
5956,1.85
5957,1.97
5958,2.06
5959,2.09
5960,2.08
5961,2.03
5962,1.96
5963,1.90
5964,1.85
5965,1.86
5966,1.91
5967,1.97
5968,2.01
5969,2.00
5970,1.93
5971,1.79
5972,1.59
5973,1.35
5974,1.11
5975,0.92
5976,0.76
5977,0.65
5978,0.55
5979,0.46
5980,0.30
5981,0.06
5982,-0.32
5983,-0.78
5984,-1.30
5985,-1.81
5986,-2.30
5987,-2.72
5988,-3.11
5989,-3.43
5990,-3.72
5991,-3.97
5992,-4.25
5993,-4.52
5994,-4.83
5995,-5.10
5996,-5.31
5997,-5.40
5998,-5.42
5999,-5.35
6000,-5.25
6001,-5.13
6002,-5.05
6003,-5.03
6004,-5.13
6005,-5.33
6006,-5.62
6007,-5.94
6008,-6.27
6009,-6.55
6010,-6.77
6011,-6.92
6012,-7.02
6013,-7.08
6014,-7.08
6015,-7.02
6016,-6.92
6017,-6.81
6018,-6.65
6019,-6.45
6020,-6.16
6021,-5.83
6022,-5.49
6023,-5.17
6024,-4.83
6025,-4.47
6026,-4.09
6027,-3.73
6028,-3.43
6029,-3.20
6030,-3.06
6031,-3.00
6032,-3.03
6033,-3.15
6034,-3.35
6035,-3.58
6036,-3.78
6037,-3.96
6038,-4.07
6039,-4.13
6040,-4.14
6041,-4.12
6042,-4.10
6043,-4.10
6044,-4.13
6045,-4.14
6046,-4.12
6047,-4.04
6048,-3.93
6049,-3.78
6050,-3.65
6051,-3.54
6052,-3.50
6053,-3.54
6054,-3.67
6055,-3.86
6056,-4.12
6057,-4.41
6058,-4.74
6059,-5.05
6060,-5.35
6061,-5.60
6062,-5.87
6063,-6.16
6064,-6.54
6065,-6.98
6066,-7.50
6067,-8.06
6068,-8.69
6069,-9.33
6070,-9.96
6071,-10.47
6072,-10.88
6073,-11.14
6074,-11.28
6075,-11.28
6076,-11.21
6077,-11.07
6078,-10.98
6079,-10.95
6080,-11.04
6081,-11.23
6082,-11.54
6083,-11.92
6084,-12.38
6085,-12.91
6086,-13.48
6087,-14.06
6088,-14.63
6089,-15.11
6090,-15.53
6091,-15.80
6092,-15.95
6093,-15.98
6094,-15.94
6095,-15.84
6096,-15.71
6097,-15.53
6098,-15.32
6099,-15.12
6100,-14.95
6101,-14.81
6102,-14.64
6103,-14.44
6104,-14.20
6105,-13.95
6106,-13.72
6107,-13.50
6108,-13.29
6109,-13.11
6110,-12.97
6111,-12.86
6112,-12.78
6113,-12.73
6114,-12.69
6115,-12.65
6116,-12.59
6117,-12.48
6118,-12.33
6119,-12.15
6120,-11.96
6121,-11.82
6122,-11.70
6123,-11.63
6124,-11.59
6125,-11.57
6126,-11.53
6127,-11.47
6128,-11.33
6129,-11.12
6130,-10.82
6131,-10.50
6132,-10.19
6133,-9.95
6134,-9.75
6135,-9.58
6136,-9.41
6137,-9.25
6138,-9.06
6139,-8.84
6140,-8.59
6141,-8.32
6142,-8.03
6143,-7.79
6144,-7.60
6145,-7.49
6146,-7.43
6147,-7.39
6148,-7.32
6149,-7.24
6150,-7.14
6151,-7.03
6152,-6.90
6153,-6.81
6154,-6.71
6155,-6.65
6156,-6.65
6157,-6.70
6158,-6.76
6159,-6.81
6160,-6.81
6161,-6.76
6162,-6.62
6163,-6.42
6164,-6.12
6165,-5.72
6166,-5.22
6167,-4.67
6168,-4.09
6169,-3.55
6170,-3.02
6171,-2.57
6172,-2.16
6173,-1.82
6174,-1.51
6175,-1.23
6176,-0.91
6177,-0.59
6178,-0.24
6179,0.09
6180,0.46
6181,0.78
6182,1.11
6183,1.40
6184,1.70
6185,1.99
6186,2.31
6187,2.61
6188,2.92
6189,3.20
6190,3.49
6191,3.75
6192,3.99
6193,4.20
6194,4.38
6195,4.52
6196,4.64
6197,4.74
6198,4.84
6199,4.91
6200,4.95
6201,4.91
6202,4.84
6203,4.75
6204,4.66
6205,4.59
6206,4.58
6207,4.65
6208,4.82
6209,5.04
6210,5.29
6211,5.53
6212,5.81
6213,6.07
6214,6.35
6215,6.60
6216,6.89
6217,7.23
6218,7.60
6219,7.98
6220,8.34
6221,8.64
6222,8.84
6223,8.93
6224,8.91
6225,8.80
6226,8.64
6227,8.43
6228,8.19
6229,7.93
6230,7.65
6231,7.36
6232,7.04
6233,6.71
6234,6.36
6235,6.06
6236,5.81
6237,5.67
6238,5.59
6239,5.58
6240,5.62
6241,5.68
6242,5.67
6243,5.61
6244,5.46
6245,5.30
6246,5.10
6247,4.94
6248,4.79
6249,4.70
6250,4.65
6251,4.63
6252,4.60
6253,4.55
6254,4.41
6255,4.20
6256,3.89
6257,3.54
6258,3.14
6259,2.78
6260,2.43
6261,2.16
6262,1.91
6263,1.68
6264,1.41
6265,1.12
6266,0.76
6267,0.36
6268,-0.14
6269,-0.67
6270,-1.21
6271,-1.69
6272,-2.11
6273,-2.43
6274,-2.73
6275,-2.98
6276,-3.28
6277,-3.60
6278,-4.01
6279,-4.47
6280,-5.01
6281,-5.55
6282,-6.10
6283,-6.60
6284,-7.10
6285,-7.54
6286,-8.00
6287,-8.42
6288,-8.86
6289,-9.28
6290,-9.72
6291,-10.13
6292,-10.52
6293,-10.83
6294,-11.13
6295,-11.37
6296,-11.60
6297,-11.80
6298,-12.02
6299,-12.22
6300,-12.41
6301,-12.59
6302,-12.79
6303,-12.99
6304,-13.21
6305,-13.39
6306,-13.57
6307,-13.69
6308,-13.79
6309,-13.83
6310,-13.84
6311,-13.82
6312,-13.82
6313,-13.85
6314,-13.95
6315,-14.10
6316,-14.31
6317,-14.54
6318,-14.80
6319,-15.05
6320,-15.24
6321,-15.37
6322,-15.45
6323,-15.47
6324,-15.48
6325,-15.48
6326,-15.49
6327,-15.50
6328,-15.51
6329,-15.50
6330,-15.46
6331,-15.39
6332,-15.31
6333,-15.22
6334,-15.14
6335,-15.08
6336,-15.04
6337,-15.01
6338,-15.05
6339,-15.12
6340,-15.24
6341,-15.44
6342,-15.72
6343,-16.08
6344,-16.48
6345,-16.85
6346,-17.17
6347,-17.40
6348,-17.53
6349,-17.59
6350,-17.59
6351,-17.56
6352,-17.52
6353,-17.49
6354,-17.47
6355,-17.48
6356,-17.47
6357,-17.40
6358,-17.22
6359,-16.93
6360,-16.53
6361,-16.06
6362,-15.54
6363,-15.04
6364,-14.56
6365,-14.17
6366,-13.83
6367,-13.57
6368,-13.34
6369,-13.18
6370,-13.08
6371,-13.03
6372,-12.95
6373,-12.87
6374,-12.73
6375,-12.59
6376,-12.40
6377,-12.21
6378,-12.04
6379,-11.92
6380,-11.82
6381,-11.73
6382,-11.61
6383,-11.49
6384,-11.29
6385,-11.02
6386,-10.70
6387,-10.35
6388,-10.00
6389,-9.69
6390,-9.44
6391,-9.26
6392,-9.12
6393,-9.02
6394,-8.91
6395,-8.83
6396,-8.77
6397,-8.73
6398,-8.72
6399,-8.78
6400,-8.90
6401,-9.07
6402,-9.26
6403,-9.43
6404,-9.54
6405,-9.55
6406,-9.48
6407,-9.37
6408,-9.26
6409,-9.18
6410,-9.17
6411,-9.24
6412,-9.41
6413,-9.65
6414,-9.93
6415,-10.21
6416,-10.43
6417,-10.57
6418,-10.65
6419,-10.66
6420,-10.65
6421,-10.66
6422,-10.72
6423,-10.86
6424,-11.13
6425,-11.51
6426,-12.00
6427,-12.50
6428,-12.99
6429,-13.40
6430,-13.80
6431,-14.18
6432,-14.59
6433,-15.00
6434,-15.43
6435,-15.85
6436,-16.33
6437,-16.79
6438,-17.27
6439,-17.68
6440,-18.05
6441,-18.36
6442,-18.68
6443,-18.95
6444,-19.21
6445,-19.41
6446,-19.61
6447,-19.78
6448,-19.94
6449,-20.05
6450,-20.15
6451,-20.25
6452,-20.38
6453,-20.51
6454,-20.65
6455,-20.76
6456,-20.86
6457,-20.92
6458,-20.93
6459,-20.87
6460,-20.74
6461,-20.58
6462,-20.40
6463,-20.25
6464,-20.13
6465,-20.07
6466,-20.04
6467,-20.06
6468,-20.05
6469,-20.03
6470,-19.95
6471,-19.84
6472,-19.68
6473,-19.55
6474,-19.49
6475,-19.48
6476,-19.37
6477,-19.14
6478,-18.79
6479,-18.43
6480,-18.04
6481,-17.61
6482,-17.10
6483,-16.57
6484,-16.01
6485,-15.48
6486,-14.93
6487,-14.42
6488,-13.86
6489,-13.33
6490,-12.75
6491,-12.20
6492,-11.62
6493,-11.07
6494,-10.48
6495,-9.90
6496,-9.25
6497,-8.62
6498,-7.93
6499,-7.29
6500,-6.63
6501,-6.03
6502,-5.46
6503,-4.95
6504,-4.45
6505,-4.02
6506,-3.62
6507,-3.28
6508,-2.95
6509,-2.67
6510,-2.40
6511,-2.17
6512,-1.98
6513,-1.82
6514,-1.63
6515,-1.48
6516,-1.32
6517,-1.17
6518,-1.02
6519,-0.89
6520,-0.79
6521,-0.72
6522,-0.71
6523,-0.75
6524,-0.80
6525,-0.86
6526,-0.90
6527,-0.94
6528,-0.97
6529,-0.98
6530,-0.96
6531,-0.92
6532,-0.89
6533,-0.92
6534,-0.98
6535,-1.08
6536,-1.20
6537,-1.37
6538,-1.57
6539,-1.78
6540,-1.96
6541,-2.11
6542,-2.24
6543,-2.37
6544,-2.46
6545,-2.52
6546,-2.55
6547,-2.55
6548,-2.50
6549,-2.41
6550,-2.24
6551,-2.03
6552,-1.78
6553,-1.50
6554,-1.17
6555,-0.81
6556,-0.38
6557,0.08
6558,0.57
6559,1.06
6560,1.55
6561,1.96
6562,2.30
6563,2.51
6564,2.66
6565,2.72
6566,2.82
6567,2.91
6568,3.11
6569,3.36
6570,3.68
6571,4.02
6572,4.36
6573,4.65
6574,4.92
6575,5.12
6576,5.28
6577,5.41
6578,5.55
6579,5.70
6580,5.84
6581,5.94
6582,6.02
6583,6.04
6584,6.03
6585,5.99
6586,5.94
6587,5.91
6588,5.90
6589,5.87
6590,5.78
6591,5.60
6592,5.34
6593,5.04
6594,4.71
6595,4.42
6596,4.18
6597,4.04
6598,4.01
6599,4.04
6600,4.12
6601,4.22
6602,4.27
6603,4.26
6604,4.17
6605,4.02
6606,3.83
6607,3.64
6608,3.44
6609,3.24
6610,3.01
6611,2.76
6612,2.47
6613,2.17
6614,1.82
6615,1.45
6616,1.03
6617,0.64
6618,0.34
6619,0.20
6620,0.15
6621,0.17
6622,0.17
6623,0.17
6624,0.18
6625,0.23
6626,0.29
6627,0.37
6628,0.46
6629,0.55
6630,0.63
6631,0.67
6632,0.68
6633,0.65
6634,0.59
6635,0.50
6636,0.37
6637,0.24
6638,0.11
6639,-0.01
6640,-0.14
6641,-0.25
6642,-0.34
6643,-0.40
6644,-0.47
6645,-0.52
6646,-0.54
6647,-0.53
6648,-0.53
6649,-0.55
6650,-0.64
6651,-0.77
6652,-1.00
6653,-1.30
6654,-1.69
6655,-2.09
6656,-2.50
6657,-2.88
6658,-3.24
6659,-3.55
6660,-3.84
6661,-4.07
6662,-4.32
6663,-4.55
6664,-4.82
6665,-5.07
6666,-5.35
6667,-5.62
6668,-5.91
6669,-6.16
6670,-6.40
6671,-6.59
6672,-6.77
6673,-6.94
6674,-7.10
6675,-7.23
6676,-7.32
6677,-7.39
6678,-7.44
6679,-7.45
6680,-7.45
6681,-7.43
6682,-7.41
6683,-7.38
6684,-7.35
6685,-7.32
6686,-7.28
6687,-7.26
6688,-7.23
6689,-7.21
6690,-7.13
6691,-7.01
6692,-6.83
6693,-6.61
6694,-6.37
6695,-6.10
6696,-5.81
6697,-5.52
6698,-5.22
6699,-4.94
6700,-4.65
6701,-4.36
6702,-4.10
6703,-3.88
6704,-3.70
6705,-3.58
6706,-3.51
6707,-3.50
6708,-3.55
6709,-3.65
6710,-3.81
6711,-4.03
6712,-4.31
6713,-4.69
6714,-5.12
6715,-5.47
6716,-5.58
6717,-5.50
6718,-5.34
6719,-5.21
6720,-5.06
6721,-4.83
6722,-4.46
6723,-4.02
6724,-3.46
6725,-2.85
6726,-2.14
6727,-1.44
6728,-0.72
6729,-0.04
6730,0.63
6731,1.20
6732,1.71
6733,2.14
6734,2.53
6735,2.85
6736,3.15
6737,3.38
6738,3.59
6739,3.75
6740,3.86
6741,3.88
6742,3.86
6743,3.77
6744,3.66
6745,3.55
6746,3.49
6747,3.52
6748,3.63
6749,3.78
6750,3.96
6751,4.12
6752,4.26
6753,4.38
6754,4.51
6755,4.64
6756,4.76
6757,4.91
6758,5.07
6759,5.26
6760,5.38
6761,5.39
6762,5.26
6763,4.97
6764,4.51
6765,3.94
6766,3.27
6767,2.61
6768,1.98
6769,1.50
6770,1.18
6771,1.05
6772,0.98
6773,0.92
6774,0.80
6775,0.63
6776,0.35
6777,-0.02
6778,-0.49
6779,-0.95
6780,-1.36
6781,-1.65
6782,-1.85
6783,-1.96
6784,-2.01
6785,-2.01
6786,-2.00
6787,-2.01
6788,-2.04
6789,-2.10
6790,-2.19
6791,-2.27
6792,-2.37
6793,-2.44
6794,-2.56
6795,-2.70
6796,-2.88
6797,-3.11
6798,-3.42
6799,-3.81
6800,-4.29
6801,-4.81
6802,-5.37
6803,-5.92
6804,-6.44
6805,-6.85
6806,-7.18
6807,-7.40
6808,-7.59
6809,-7.77
6810,-8.03
6811,-8.37
6812,-8.86
6813,-9.41
6814,-9.99
6815,-10.51
6816,-10.92
6817,-11.18
6818,-11.29
6819,-11.28
6820,-11.18
6821,-11.05
6822,-10.93
6823,-10.82
6824,-10.69
6825,-10.54
6826,-10.35
6827,-10.11
6828,-9.76
6829,-9.33
6830,-8.83
6831,-8.38
6832,-7.97
6833,-7.62
6834,-7.25
6835,-6.87
6836,-6.42
6837,-5.96
6838,-5.39
6839,-4.75
6840,-3.97
6841,-3.18
6842,-2.37
6843,-1.63
6844,-0.92
6845,-0.28
6846,0.31
6847,0.79
6848,1.23
6849,1.57
6850,1.88
6851,2.09
6852,2.25
6853,2.34
6854,2.43
6855,2.51
6856,2.62
6857,2.75
6858,2.92
6859,3.08
6860,3.21
6861,3.29
6862,3.31
6863,3.26
6864,3.15
6865,3.01
6866,2.89
6867,2.85
6868,2.88
6869,2.97
6870,3.11
6871,3.25
6872,3.41
6873,3.54
6874,3.64
6875,3.68
6876,3.68
6877,3.68
6878,3.70
6879,3.75
6880,3.81
6881,3.91
6882,4.07
6883,4.26
6884,4.49
6885,4.68
6886,4.88
6887,5.04
6888,5.20
6889,5.33
6890,5.49
6891,5.66
6892,5.90
6893,6.19
6894,6.56
6895,6.99
6896,7.48
6897,7.99
6898,8.50
6899,8.94
6900,9.32
6901,9.61
6902,9.85
6903,10.00
6904,10.12
6905,10.19
6906,10.24
6907,10.28
6908,10.31
6909,10.31
6910,10.29
6911,10.24
6912,10.17
6913,10.06
6914,9.93
6915,9.80
6916,9.67
6917,9.56
6918,9.43
6919,9.30
6920,9.16
6921,9.06
6922,8.98
6923,8.93
6924,8.86
6925,8.78
6926,8.65
6927,8.51
6928,8.32
6929,8.12
6930,7.84
6931,7.51
6932,7.13
6933,6.72
6934,6.26
6935,5.77
6936,5.23
6937,4.75
6938,4.32
6939,3.99
6940,3.69
6941,3.43
6942,3.13
6943,2.83
6944,2.45
6945,2.03
6946,1.52
6947,1.02
6948,0.53
6949,0.15
6950,-0.14
6951,-0.34
6952,-0.49
6953,-0.58
6954,-0.69
6955,-0.79
6956,-0.95
6957,-1.12
6958,-1.33
6959,-1.52
6960,-1.69
6961,-1.82
6962,-1.93
6963,-2.00
6964,-2.06
6965,-2.13
6966,-2.22
6967,-2.33
6968,-2.46
6969,-2.59
6970,-2.72
6971,-2.84
6972,-2.94
6973,-3.01
6974,-2.99
6975,-2.91
6976,-2.82
6977,-2.69
6978,-2.54
6979,-2.37
6980,-2.18
6981,-2.01
6982,-1.85
6983,-1.71
6984,-1.58
6985,-1.48
6986,-1.37
6987,-1.26
6988,-1.13
6989,-1.02
6990,-0.95
6991,-0.89
6992,-0.82
6993,-0.76
6994,-0.74
6995,-0.77
6996,-0.82
6997,-0.89
6998,-0.98
6999,-1.08
7000,-1.18
7001,-1.26
7002,-1.30
7003,-1.29
7004,-1.27
7005,-1.25
7006,-1.27
7007,-1.30
7008,-1.37
7009,-1.44
7010,-1.56
7011,-1.72
7012,-1.90
7013,-2.07
7014,-2.22
7015,-2.37
7016,-2.50
7017,-2.64
7018,-2.78
7019,-2.91
7020,-3.04
7021,-3.13
7022,-3.20
7023,-3.27
7024,-3.33
7025,-3.34
7026,-3.30
7027,-3.23
7028,-3.15
7029,-3.09
7030,-3.04
7031,-3.01
7032,-2.96
7033,-2.91
7034,-2.86
7035,-2.78
7036,-2.67
7037,-2.51
7038,-2.31
7039,-2.08
7040,-1.85
7041,-1.62
7042,-1.43
7043,-1.33
7044,-1.31
7045,-1.37
7046,-1.48
7047,-1.59
7048,-1.68
7049,-1.72
7050,-1.72
7051,-1.69
7052,-1.66
7053,-1.65
7054,-1.69
7055,-1.78
7056,-1.92
7057,-2.08
7058,-2.25
7059,-2.38
7060,-2.49
7061,-2.56
7062,-2.60
7063,-2.62
7064,-2.63
7065,-2.66
7066,-2.70
7067,-2.74
7068,-2.79
7069,-2.85
7070,-2.93
7071,-3.04
7072,-3.22
7073,-3.44
7074,-3.71
7075,-3.97
7076,-4.25
7077,-4.49
7078,-4.71
7079,-4.88
7080,-5.00
7081,-5.10
7082,-5.20
7083,-5.33
7084,-5.46
7085,-5.61
7086,-5.75
7087,-5.87
7088,-5.97
7089,-6.01
7090,-6.01
7091,-5.94
7092,-5.83
7093,-5.68
7094,-5.53
7095,-5.40
7096,-5.32
7097,-5.29
7098,-5.33
7099,-5.46
7100,-5.67
7101,-5.91
7102,-6.16
7103,-6.39
7104,-6.57
7105,-6.68
7106,-6.76
7107,-6.79
7108,-6.84
7109,-6.93
7110,-7.08
7111,-7.29
7112,-7.55
7113,-7.84
7114,-8.13
7115,-8.38
7116,-8.57
7117,-8.68
7118,-8.75
7119,-8.76
7120,-8.72
7121,-8.67
7122,-8.67
7123,-8.69
7124,-8.74
7125,-8.78
7126,-8.85
7127,-8.93
7128,-9.03
7129,-9.12
7130,-9.22
7131,-9.30
7132,-9.38
7133,-9.42
7134,-9.45
7135,-9.50
7136,-9.57
7137,-9.67
7138,-9.80
7139,-9.94
7140,-10.06
7141,-10.14
7142,-10.15
7143,-10.08
7144,-9.90
7145,-9.64
7146,-9.28
7147,-8.87
7148,-8.46
7149,-8.10
7150,-7.81
7151,-7.64
7152,-7.57
7153,-7.60
7154,-7.64
7155,-7.69
7156,-7.66
7157,-7.58
7158,-7.40
7159,-7.14
7160,-6.77
7161,-6.38
7162,-5.96
7163,-5.57
7164,-5.15
7165,-4.75
7166,-4.32
7167,-3.90
7168,-3.42
7169,-2.94
7170,-2.44
7171,-1.99
7172,-1.51
7173,-1.04
7174,-0.52
7175,-0.01
7176,0.56
7177,1.14
7178,1.78
7179,2.41
7180,3.07
7181,3.69
7182,4.26
7183,4.72
7184,5.10
7185,5.37
7186,5.57
7187,5.68
7188,5.75
7189,5.80
7190,5.82
7191,5.77
7192,5.67
7193,4.64
7194,4.67
7195,6.76
7196,7.11
7197,1.11
7198,-4.12
7199,7.03
7200,22.03
