1,-42.00
2,-60.58
3,-61.78
4,-55.68
5,-53.61
6,-56.27
7,-57.83
8,-57.11
9,-56.26
10,-56.65
11,-57.04
12,-57.21
13,-57.10
14,-57.19
15,-57.28
16,-57.37
17,-57.43
18,-57.49
19,-57.51
20,-57.53
21,-57.53
22,-57.51
23,-57.49
24,-57.47
25,-57.45
26,-57.43
27,-57.41
28,-57.40
29,-57.41
30,-57.43
31,-57.47
32,-57.53
33,-57.60
34,-57.68
35,-57.74
36,-57.82
37,-57.89
38,-57.97
39,-58.04
40,-58.11
41,-58.17
42,-58.22
43,-58.26
44,-58.29
45,-58.32
46,-58.34
47,-58.36
48,-58.39
49,-58.42
50,-58.45
51,-58.48
52,-58.51
53,-58.53
54,-58.57
55,-58.62
56,-58.68
57,-58.75
58,-58.83
59,-58.92
60,-59.02
61,-59.14
62,-59.27
63,-59.40
64,-59.53
65,-59.66
66,-59.79
67,-59.92
68,-60.04
69,-60.15
70,-60.25
71,-60.33
72,-60.39
73,-60.42
74,-60.42
75,-60.40
76,-60.35
77,-60.27
78,-60.18
79,-60.08
80,-59.99
81,-59.92
82,-59.85
83,-59.81
84,-59.79
85,-59.79
86,-59.82
87,-59.88
88,-59.96
89,-60.06
90,-60.17
91,-60.28
92,-60.40
93,-60.51
94,-60.60
95,-60.67
96,-60.73
97,-60.78
98,-60.81
99,-60.82
100,-60.81
101,-60.79
102,-60.77
103,-60.74
104,-60.69
105,-60.63
106,-60.57
107,-60.50
108,-60.41
109,-60.31
110,-60.21
111,-60.11
112,-60.01
113,-59.91
114,-59.82
115,-59.75
116,-59.70
117,-59.67
118,-59.66
119,-59.68
120,-59.73
121,-59.79
122,-59.86
123,-59.94
124,-60.03
125,-60.11
126,-60.20
127,-60.28
128,-60.35
129,-60.41
130,-60.46
131,-60.50
132,-60.53
133,-60.55
134,-60.57
135,-60.59
136,-60.61
137,-60.63
138,-60.64
139,-60.65
140,-60.66
141,-60.66
142,-60.65
143,-60.64
144,-60.60
145,-60.55
146,-60.48
147,-60.40
148,-60.31
149,-60.21
150,-60.10
151,-59.99
152,-59.86
153,-59.74
154,-59.62
155,-59.51
156,-59.38
157,-59.27
158,-59.14
159,-59.03
160,-58.91
161,-58.80
162,-58.66
163,-58.52
164,-58.35
165,-58.18
166,-58.01
167,-57.84
168,-57.67
169,-57.52
170,-57.37
171,-57.24
172,-57.12
173,-57.03
174,-56.95
175,-56.91
176,-56.90
177,-56.91
178,-56.94
179,-56.98
180,-57.04
181,-57.11
182,-57.17
183,-57.22
184,-57.27
185,-57.32
186,-57.36
187,-57.40
188,-57.45
189,-57.47
190,-57.48
191,-57.47
192,-57.46
193,-57.45
194,-57.43
195,-57.40
196,-57.37
197,-57.32
198,-57.28
199,-57.21
200,-57.15
201,-57.10
202,-57.07
203,-57.05
204,-57.04
205,-57.05
206,-57.08
207,-57.13
208,-57.20
209,-57.29
210,-57.40
211,-57.51
212,-57.61
213,-57.70
214,-57.78
215,-57.83
216,-57.84
217,-57.82
218,-57.77
219,-57.70
220,-57.61
221,-57.50
222,-57.38
223,-57.23
224,-57.10
225,-56.99
226,-56.90
227,-56.84
228,-56.81
229,-56.81
230,-56.85
231,-56.92
232,-57.01
233,-57.12
234,-57.25
235,-57.40
236,-57.56
237,-57.70
238,-57.82
239,-57.93
240,-58.03
241,-58.12
242,-58.18
243,-58.22
244,-58.26
245,-58.28
246,-58.31
247,-58.33
248,-58.34
249,-58.36
250,-58.39
251,-58.42
252,-58.46
253,-58.50
254,-58.53
255,-58.56
256,-58.58
257,-58.58
258,-58.56
259,-58.53
260,-58.49
261,-58.45
262,-58.42
263,-58.40
264,-58.39
265,-58.37
266,-58.38
267,-58.41
268,-58.46
269,-58.52
270,-58.58
271,-58.65
272,-58.73
273,-58.80
274,-58.86
275,-58.90
276,-58.93
277,-58.96
278,-58.98
279,-58.99
280,-59.00
281,-59.02
282,-59.04
283,-59.05
284,-59.05
285,-59.05
286,-59.05
287,-59.07
288,-59.07
289,-59.05
290,-59.01
291,-58.97
292,-58.93
293,-58.90
294,-58.87
295,-58.84
296,-58.83
297,-58.82
298,-58.84
299,-58.88
300,-58.95
301,-59.04
302,-59.14
303,-59.23
304,-59.34
305,-59.44
306,-59.53
307,-59.62
308,-59.71
309,-59.79
310,-59.86
311,-59.92
312,-59.96
313,-59.98
314,-59.99
315,-59.99
316,-59.98
317,-59.96
318,-59.92
319,-59.86
320,-59.78
321,-59.70
322,-59.63
323,-59.55
324,-59.46
325,-59.38
326,-59.32
327,-59.29
328,-59.29
329,-59.30
330,-59.32
331,-59.35
332,-59.39
333,-59.44
334,-59.49
335,-59.52
336,-59.53
337,-59.53
338,-59.52
339,-59.49
340,-59.44
341,-59.38
342,-59.32
343,-59.27
344,-59.22
345,-59.16
346,-59.10
347,-59.07
348,-59.03
349,-58.99
350,-58.94
351,-58.90
352,-58.84
353,-58.79
354,-58.71
355,-58.64
356,-58.56
357,-58.47
358,-58.38
359,-58.29
360,-58.22
361,-58.17
362,-58.13
363,-58.11
364,-58.09
365,-58.10
366,-58.13
367,-58.18
368,-58.26
369,-58.35
370,-58.43
371,-58.50
372,-58.56
373,-58.62
374,-58.68
375,-58.72
376,-58.75
377,-58.76
378,-58.78
379,-58.79
380,-58.80
381,-58.80
382,-58.79
383,-58.78
384,-58.77
385,-58.76
386,-58.74
387,-58.70
388,-58.64
389,-58.58
390,-58.49
391,-58.39
392,-58.28
393,-58.17
394,-58.07
395,-57.97
396,-57.87
397,-57.78
398,-57.70
399,-57.64
400,-57.59
401,-57.56
402,-57.53
403,-57.51
404,-57.49
405,-57.47
406,-57.44
407,-57.42
408,-57.39
409,-57.38
410,-57.34
411,-57.31
412,-57.27
413,-57.24
414,-57.21
415,-57.17
416,-57.12
417,-57.08
418,-57.04
419,-57.01
420,-56.96
421,-56.93
422,-56.88
423,-56.85
424,-56.81
425,-56.77
426,-56.72
427,-56.66
428,-56.59
429,-56.54
430,-56.48
431,-56.44
432,-56.39
433,-56.34
434,-56.28
435,-56.23
436,-56.20
437,-56.18
438,-56.16
439,-56.16
440,-56.15
441,-56.16
442,-56.19
443,-56.23
444,-56.27
445,-56.31
446,-56.35
447,-56.39
448,-56.42
449,-56.44
450,-56.46
451,-56.48
452,-56.49
453,-56.49
454,-56.50
455,-56.52
456,-56.55
457,-56.56
458,-56.57
459,-56.58
460,-56.61
461,-56.65
462,-56.67
463,-56.69
464,-56.70
465,-56.71
466,-56.70
467,-56.66
468,-56.60
469,-56.54
470,-56.47
471,-56.38
472,-56.27
473,-56.15
474,-56.04
475,-55.94
476,-55.85
477,-55.79
478,-55.73
479,-55.67
480,-55.64
481,-55.63
482,-55.65
483,-55.69
484,-55.73
485,-55.78
486,-55.86
487,-55.94
488,-56.03
489,-56.11
490,-56.20
491,-56.30
492,-56.39
493,-56.47
494,-56.55
495,-56.64
496,-56.74
497,-56.81
498,-56.88
499,-56.92
500,-56.98
501,-57.03
502,-57.09
503,-57.12
504,-57.14
505,-57.14
506,-57.14
507,-57.13
508,-57.12
509,-57.10
510,-57.10
511,-57.11
512,-57.14
513,-57.17
514,-57.20
515,-57.25
516,-57.32
517,-57.37
518,-57.42
519,-57.47
520,-57.53
521,-57.59
522,-57.63
523,-57.64
524,-57.64
525,-57.64
526,-57.64
527,-57.61
528,-57.59
529,-57.57
530,-57.56
531,-57.57
532,-57.59
533,-57.62
534,-57.67
535,-57.73
536,-57.82
537,-57.92
538,-58.03
539,-58.14
540,-58.26
541,-58.37
542,-58.50
543,-58.60
544,-58.70
545,-58.79
546,-58.89
547,-58.98
548,-59.07
549,-59.14
550,-59.20
551,-59.27
552,-59.34
553,-59.40
554,-59.45
555,-59.49
556,-59.53
557,-59.57
558,-59.60
559,-59.62
560,-59.63
561,-59.65
562,-59.68
563,-59.70
564,-59.71
565,-59.71
566,-59.70
567,-59.69
568,-59.67
569,-59.64
570,-59.61
571,-59.58
572,-59.54
573,-59.48
574,-59.41
575,-59.35
576,-59.30
577,-59.27
578,-59.22
579,-59.18
580,-59.16
581,-59.16
582,-59.16
583,-59.17
584,-59.17
585,-59.18
586,-59.18
587,-59.18
588,-59.17
589,-59.16
590,-59.13
591,-59.11
592,-59.08
593,-59.06
594,-59.03
595,-58.99
596,-58.96
597,-58.95
598,-58.95
599,-58.95
600,-58.95
601,-58.95
602,-58.94
603,-58.94
604,-58.92
605,-58.90
606,-58.87
607,-58.82
608,-58.77
609,-58.72
610,-58.66
611,-58.60
612,-58.56
613,-58.55
614,-58.56
615,-58.58
616,-58.61
617,-58.66
618,-58.73
619,-58.81
620,-58.89
621,-58.96
622,-59.02
623,-59.07
624,-59.11
625,-59.12
626,-59.09
627,-59.05
628,-58.97
629,-58.88
630,-58.78
631,-58.66
632,-58.53
633,-58.40
634,-58.26
635,-58.11
636,-57.97
637,-57.84
638,-57.71
639,-57.60
640,-57.48
641,-57.38
642,-57.28
643,-57.19
644,-57.09
645,-57.01
646,-56.93
647,-56.86
648,-56.78
649,-56.69
650,-56.62
651,-56.56
652,-56.49
653,-56.43
654,-56.36
655,-56.30
656,-56.24
657,-56.20
658,-56.15
659,-56.11
660,-56.08
661,-56.04
662,-55.98
663,-55.94
664,-55.90
665,-55.86
666,-55.80
667,-55.73
668,-55.67
669,-55.62
670,-55.57
671,-55.52
672,-55.47
673,-55.44
674,-55.40
675,-55.37
676,-55.34
677,-55.31
678,-55.29
679,-55.26
680,-55.22
681,-55.18
682,-55.14
683,-55.10
684,-55.07
685,-55.05
686,-55.03
687,-55.00
688,-54.97
689,-54.97
690,-54.99
691,-55.02
692,-55.05
693,-55.08
694,-55.12
695,-55.17
696,-55.23
697,-55.29
698,-55.34
699,-55.38
700,-55.43
701,-55.48
702,-55.55
703,-55.59
704,-55.64
705,-55.70
706,-55.77
707,-55.84
708,-55.90
709,-55.95
710,-56.01
711,-56.06
712,-56.12
713,-56.16
714,-56.19
715,-56.21
716,-56.25
717,-56.29
718,-56.33
719,-56.36
720,-56.42
721,-56.50
722,-56.59
723,-56.68
724,-56.78
725,-56.87
726,-56.98
727,-57.09
728,-57.20
729,-57.29
730,-57.35
731,-57.40
732,-57.44
733,-57.47
734,-57.49
735,-57.49
736,-57.48
737,-57.46
738,-57.46
739,-57.46
740,-57.47
741,-57.49
742,-57.51
743,-57.54
744,-57.59
745,-57.63
746,-57.68
747,-57.72
748,-57.76
749,-57.81
750,-57.86
751,-57.89
752,-57.91
753,-57.93
754,-57.94
755,-57.95
756,-57.97
757,-57.97
758,-57.97
759,-57.97
760,-57.98
761,-58.00
762,-58.03
763,-58.06
764,-58.11
765,-58.16
766,-58.22
767,-58.29
768,-58.35
769,-58.41
770,-58.45
771,-58.48
772,-58.51
773,-58.51
774,-58.51
775,-58.46
776,-58.40
777,-58.34
778,-58.29
779,-58.24
780,-58.19
781,-58.15
782,-58.12
783,-58.12
784,-58.16
785,-58.22
786,-58.29
787,-58.38
788,-58.50
789,-58.62
790,-58.75
791,-58.87
792,-58.99
793,-59.10
794,-59.19
795,-59.26
796,-59.31
797,-59.34
798,-59.34
799,-59.30
800,-59.23
801,-59.14
802,-59.04
803,-58.93
804,-58.80
805,-58.67
806,-58.56
807,-58.47
808,-58.39
809,-58.32
810,-58.28
811,-58.27
812,-58.28
813,-58.30
814,-58.33
815,-58.37
816,-58.42
817,-58.48
818,-58.54
819,-58.58
820,-58.61
821,-58.65
822,-58.69
823,-58.72
824,-58.74
825,-58.75
826,-58.76
827,-58.77
828,-58.77
829,-58.75
830,-58.71
831,-58.66
832,-58.60
833,-58.53
834,-58.45
835,-58.36
836,-58.26
837,-58.15
838,-58.04
839,-57.94
840,-57.86
841,-57.80
842,-57.76
843,-57.73
844,-57.71
845,-57.72
846,-57.76
847,-57.82
848,-57.89
849,-57.96
850,-58.04
851,-58.13
852,-58.22
853,-58.30
854,-58.37
855,-58.44
856,-58.50
857,-58.55
858,-58.59
859,-58.62
860,-58.64
861,-58.64
862,-58.62
863,-58.59
864,-58.55
865,-58.51
866,-58.44
867,-58.36
868,-58.26
869,-58.17
870,-58.07
871,-57.98
872,-57.89
873,-57.79
874,-57.69
875,-57.62
876,-57.54
877,-57.46
878,-57.38
879,-57.31
880,-57.26
881,-57.22
882,-57.18
883,-57.14
884,-57.11
885,-57.09
886,-57.07
887,-57.06
888,-57.04
889,-57.03
890,-57.02
891,-57.01
892,-57.00
893,-56.99
894,-56.98
895,-56.97
896,-56.95
897,-56.92
898,-56.89
899,-56.86
900,-56.84
901,-56.82
902,-56.80
903,-56.78
904,-56.76
905,-56.75
906,-56.75
907,-56.76
908,-56.77
909,-56.77
910,-56.76
911,-56.75
912,-56.74
913,-56.73
914,-56.68
915,-56.61
916,-56.53
917,-56.45
918,-56.36
919,-56.27
920,-56.16
921,-56.07
922,-55.99
923,-55.92
924,-55.87
925,-55.84
926,-55.83
927,-55.85
928,-55.89
929,-55.94
930,-56.01
931,-56.07
932,-56.15
933,-56.22
934,-56.28
935,-56.34
936,-56.40
937,-56.46
938,-56.52
939,-56.56
940,-56.59
941,-56.62
942,-56.64
943,-56.66
944,-56.67
945,-56.66
946,-56.64
947,-56.61
948,-56.56
949,-56.49
950,-56.41
951,-56.33
952,-56.25
953,-56.16
954,-56.07
955,-55.99
956,-55.91
957,-55.84
958,-55.79
959,-55.76
960,-55.75
961,-55.75
962,-55.77
963,-55.81
964,-55.86
965,-55.92
966,-55.99
967,-56.07
968,-56.16
969,-56.25
970,-56.33
971,-56.39
972,-56.43
973,-56.47
974,-56.51
975,-56.54
976,-56.56
977,-56.57
978,-56.57
979,-56.57
980,-56.58
981,-56.58
982,-56.59
983,-56.59
984,-56.59
985,-56.60
986,-56.62
987,-56.64
988,-56.67
989,-56.69
990,-56.71
991,-56.73
992,-56.74
993,-56.74
994,-56.75
995,-56.75
996,-56.75
997,-56.75
998,-56.74
999,-56.72
1000,-56.70
1001,-56.69
1002,-56.67
1003,-56.64
1004,-56.62
1005,-56.61
1006,-56.60
1007,-56.59
1008,-56.59
1009,-56.61
1010,-56.64
1011,-56.67
1012,-56.71
1013,-56.75
1014,-56.78
1015,-56.82
1016,-56.88
1017,-56.93
1018,-56.99
1019,-57.04
1020,-57.09
1021,-57.14
1022,-57.19
1023,-57.24
1024,-57.29
1025,-57.34
1026,-57.39
1027,-57.43
1028,-57.49
1029,-57.55
1030,-57.61
1031,-57.67
1032,-57.74
1033,-57.81
1034,-57.90
1035,-57.98
1036,-58.06
1037,-58.14
1038,-58.21
1039,-58.27
1040,-58.33
1041,-58.38
1042,-58.44
1043,-58.48
1044,-58.51
1045,-58.54
1046,-58.57
1047,-58.60
1048,-58.62
1049,-58.63
1050,-58.63
1051,-58.63
1052,-58.63
1053,-58.63
1054,-58.63
1055,-58.62
1056,-58.60
1057,-58.57
1058,-58.54
1059,-58.51
1060,-58.47
1061,-58.43
1062,-58.40
1063,-58.37
1064,-58.34
1065,-58.31
1066,-58.28
1067,-58.25
1068,-58.23
1069,-58.21
1070,-58.18
1071,-58.14
1072,-58.11
1073,-58.08
1074,-58.06
1075,-58.02
1076,-57.97
1077,-57.93
1078,-57.91
1079,-57.90
1080,-57.89
1081,-57.89
1082,-57.91
1083,-57.95
1084,-58.00
1085,-58.07
1086,-58.12
1087,-58.18
1088,-58.25
1089,-58.33
1090,-58.42
1091,-58.51
1092,-58.59
1093,-58.66
1094,-58.72
1095,-58.77
1096,-58.81
1097,-58.84
1098,-58.86
1099,-58.86
1100,-58.85
1101,-58.83
1102,-58.79
1103,-58.75
1104,-58.72
1105,-58.69
1106,-58.65
1107,-58.62
1108,-58.57
1109,-58.54
1110,-58.50
1111,-58.45
1112,-58.37
1113,-58.29
1114,-58.20
1115,-58.11
1116,-58.00
1117,-57.87
1118,-57.74
1119,-57.62
1120,-57.50
1121,-57.37
1122,-57.24
1123,-57.11
1124,-56.98
1125,-56.87
1126,-56.75
1127,-56.66
1128,-56.56
1129,-56.48
1130,-56.38
1131,-56.29
1132,-56.21
1133,-56.14
1134,-56.08
1135,-56.02
1136,-55.97
1137,-55.94
1138,-55.93
1139,-55.93
1140,-55.93
1141,-55.93
1142,-55.94
1143,-55.96
1144,-55.98
1145,-55.99
1146,-56.00
1147,-56.01
1148,-56.02
1149,-56.01
1150,-55.98
1151,-55.94
1152,-55.90
1153,-55.85
1154,-55.77
1155,-55.69
1156,-55.59
1157,-55.51
1158,-55.41
1159,-55.30
1160,-55.17
1161,-55.06
1162,-54.95
1163,-54.86
1164,-54.78
1165,-54.70
1166,-54.64
1167,-54.62
1168,-54.62
1169,-54.62
1170,-54.63
1171,-54.66
1172,-54.70
1173,-54.74
1174,-54.78
1175,-54.81
1176,-54.84
1177,-54.86
1178,-54.86
1179,-54.86
1180,-54.87
1181,-54.87
1182,-54.89
1183,-54.90
1184,-54.91
1185,-54.94
1186,-54.99
1187,-55.05
1188,-55.11
1189,-55.17
1190,-55.22
1191,-55.26
1192,-55.31
1193,-55.34
1194,-55.36
1195,-55.34
1196,-55.30
1197,-55.26
1198,-55.21
1199,-55.15
1200,-55.10
1201,-55.05
1202,-55.02
1203,-55.00
1204,-55.01
1205,-55.05
1206,-55.11
1207,-55.18
1208,-55.26
1209,-55.35
1210,-55.45
1211,-55.56
1212,-55.68
1213,-55.78
1214,-55.88
1215,-55.96
1216,-56.03
1217,-56.10
1218,-56.16
1219,-56.21
1220,-56.25
1221,-56.29
1222,-56.33
1223,-56.38
1224,-56.45
1225,-56.51
1226,-56.58
1227,-56.64
1228,-56.70
1229,-56.76
1230,-56.81
1231,-56.85
1232,-56.88
1233,-56.92
1234,-56.93
1235,-56.93
1236,-56.92
1237,-56.90
1238,-56.88
1239,-56.85
1240,-56.84
1241,-56.83
1242,-56.83
1243,-56.84
1244,-56.86
1245,-56.90
1246,-56.95
1247,-57.01
1248,-57.09
1249,-57.16
1250,-57.24
1251,-57.31
1252,-57.38
1253,-57.45
1254,-57.52
1255,-57.57
1256,-57.63
1257,-57.67
1258,-57.69
1259,-57.69
1260,-57.67
1261,-57.65
1262,-57.64
1263,-57.62
1264,-57.61
1265,-57.60
1266,-57.60
1267,-57.61
1268,-57.63
1269,-57.67
1270,-57.73
1271,-57.80
1272,-57.88
1273,-57.95
1274,-58.00
1275,-58.06
1276,-58.10
1277,-58.12
1278,-58.11
1279,-58.08
1280,-58.04
1281,-57.97
1282,-57.89
1283,-57.81
1284,-57.72
1285,-57.64
1286,-57.56
1287,-57.50
1288,-57.43
1289,-57.38
1290,-57.34
1291,-57.31
1292,-57.30
1293,-57.30
1294,-57.30
1295,-57.31
1296,-57.30
1297,-57.29
1298,-57.27
1299,-57.24
1300,-57.21
1301,-57.18
1302,-57.15
1303,-57.11
1304,-57.06
1305,-57.01
1306,-56.96
1307,-56.92
1308,-56.89
1309,-56.87
1310,-56.87
1311,-56.88
1312,-56.89
1313,-56.90
1314,-56.92
1315,-56.95
1316,-56.98
1317,-57.00
1318,-57.01
1319,-57.02
1320,-57.03
1321,-57.03
1322,-57.01
1323,-56.98
1324,-56.96
1325,-56.94
1326,-56.91
1327,-56.87
1328,-56.83
1329,-56.80
1330,-56.78
1331,-56.77
1332,-56.77
1333,-56.78
1334,-56.80
1335,-56.83
1336,-56.86
1337,-56.90
1338,-56.96
1339,-57.02
1340,-57.07
1341,-57.11
1342,-57.14
1343,-57.18
1344,-57.22
1345,-57.24
1346,-57.24
1347,-57.22
1348,-57.19
1349,-57.16
1350,-57.13
1351,-57.09
1352,-57.04
1353,-56.99
1354,-56.94
1355,-56.91
1356,-56.87
1357,-56.85
1358,-56.81
1359,-56.77
1360,-56.73
1361,-56.72
1362,-56.70
1363,-56.66
1364,-56.59
1365,-56.51
1366,-56.43
1367,-56.35
1368,-56.27
1369,-56.18
1370,-56.08
1371,-55.97
1372,-55.87
1373,-55.79
1374,-55.72
1375,-55.66
1376,-55.62
1377,-55.59
1378,-55.56
1379,-55.55
1380,-55.54
1381,-55.54
1382,-55.54
1383,-55.53
1384,-55.51
1385,-55.48
1386,-55.44
1387,-55.39
1388,-55.33
1389,-55.27
1390,-55.21
1391,-55.16
1392,-55.11
1393,-55.08
1394,-55.05
1395,-55.03
1396,-55.00
1397,-54.98
1398,-54.95
1399,-54.93
1400,-54.90
1401,-54.86
1402,-54.82
1403,-54.79
1404,-54.78
1405,-54.78
1406,-54.79
1407,-54.79
1408,-54.81
1409,-54.85
1410,-54.92
1411,-54.99
1412,-55.05
1413,-55.11
1414,-55.17
1415,-55.23
1416,-55.28
1417,-55.31
1418,-55.33
1419,-55.32
1420,-55.31
1421,-55.29
1422,-55.27
1423,-55.24
1424,-55.21
1425,-55.18
1426,-55.15
1427,-55.12
1428,-55.09
1429,-55.06
1430,-55.02
1431,-54.98
1432,-54.94
1433,-54.89
1434,-54.83
1435,-54.79
1436,-54.75
1437,-54.72
1438,-54.69
1439,-54.66
1440,-54.63
1441,-54.62
1442,-54.63
1443,-54.65
1444,-54.68
1445,-54.72
1446,-54.77
1447,-54.83
1448,-54.89
1449,-54.96
1450,-55.05
1451,-55.14
1452,-55.22
1453,-55.29
1454,-55.35
1455,-55.40
1456,-55.43
1457,-55.45
1458,-55.47
1459,-55.47
1460,-55.47
1461,-55.46
1462,-55.46
1463,-55.45
1464,-55.46
1465,-55.48
1466,-55.52
1467,-55.58
1468,-55.65
1469,-55.73
1470,-55.83
1471,-55.93
1472,-56.05
1473,-56.16
1474,-56.26
1475,-56.35
1476,-56.43
1477,-56.50
1478,-56.56
1479,-56.59
1480,-56.63
1481,-56.66
1482,-56.68
1483,-56.69
1484,-56.69
1485,-56.69
1486,-56.69
1487,-56.70
1488,-56.71
1489,-56.72
1490,-56.74
1491,-56.76
1492,-56.78
1493,-56.81
1494,-56.85
1495,-56.90
1496,-56.95
1497,-56.99
1498,-57.03
1499,-57.06
1500,-57.11
1501,-57.17
1502,-57.24
1503,-57.31
1504,-57.38
1505,-57.45
1506,-57.56
1507,-57.68
1508,-57.80
1509,-57.91
1510,-58.01
1511,-58.12
1512,-58.23
1513,-58.32
1514,-58.38
1515,-58.40
1516,-58.40
1517,-58.36
1518,-58.29
1519,-58.19
1520,-58.08
1521,-57.97
1522,-57.86
1523,-57.75
1524,-57.65
1525,-57.57
1526,-57.52
1527,-57.50
1528,-57.50
1529,-57.51
1530,-57.54
1531,-57.59
1532,-57.64
1533,-57.70
1534,-57.74
1535,-57.77
1536,-57.79
1537,-57.80
1538,-57.81
1539,-57.80
1540,-57.79
1541,-57.77
1542,-57.76
1543,-57.76
1544,-57.76
1545,-57.76
1546,-57.76
1547,-57.77
1548,-57.79
1549,-57.81
1550,-57.83
1551,-57.84
1552,-57.83
1553,-57.82
1554,-57.82
1555,-57.83
1556,-57.84
1557,-57.84
1558,-57.84
1559,-57.85
1560,-57.86
1561,-57.88
1562,-57.92
1563,-57.95
1564,-58.00
1565,-58.04
1566,-58.07
1567,-58.11
1568,-58.16
1569,-58.20
1570,-58.23
1571,-58.26
1572,-58.29
1573,-58.31
1574,-58.33
1575,-58.33
1576,-58.33
1577,-58.33
1578,-58.34
1579,-58.35
1580,-58.36
1581,-58.37
1582,-58.38
1583,-58.40
1584,-58.43
1585,-58.45
1586,-58.46
1587,-58.47
1588,-58.48
1589,-58.49
1590,-58.49
1591,-58.46
1592,-58.41
1593,-58.34
1594,-58.25
1595,-58.14
1596,-58.01
1597,-57.86
1598,-57.69
1599,-57.51
1600,-57.33
1601,-57.15
1602,-56.97
1603,-56.79
1604,-56.63
1605,-56.48
1606,-56.34
1607,-56.24
1608,-56.15
1609,-56.09
1610,-56.05
1611,-56.02
1612,-56.01
1613,-56.01
1614,-56.01
1615,-56.02
1616,-56.05
1617,-56.08
1618,-56.10
1619,-56.10
1620,-56.09
1621,-56.09
1622,-56.09
1623,-56.09
1624,-56.06
1625,-56.03
1626,-55.99
1627,-55.94
1628,-55.88
1629,-55.82
1630,-55.73
1631,-55.65
1632,-55.55
1633,-55.45
1634,-55.35
1635,-55.25
1636,-55.15
1637,-55.05
1638,-54.96
1639,-54.90
1640,-54.86
1641,-54.82
1642,-54.79
1643,-54.75
1644,-54.73
1645,-54.72
1646,-54.72
1647,-54.72
1648,-54.72
1649,-54.72
1650,-54.72
1651,-54.72
1652,-54.73
1653,-54.74
1654,-54.75
1655,-54.76
1656,-54.78
1657,-54.79
1658,-54.80
1659,-54.82
1660,-54.84
1661,-54.88
1662,-54.92
1663,-54.95
1664,-54.98
1665,-55.01
1666,-55.03
1667,-55.04
1668,-55.05
1669,-55.06
1670,-55.06
1671,-55.05
1672,-55.03
1673,-55.01
1674,-54.99
1675,-54.97
1676,-54.95
1677,-54.92
1678,-54.88
1679,-54.85
1680,-54.84
1681,-54.83
1682,-54.85
1683,-54.86
1684,-54.90
1685,-54.96
1686,-55.04
1687,-55.13
1688,-55.23
1689,-55.34
1690,-55.45
1691,-55.58
1692,-55.70
1693,-55.82
1694,-55.93
1695,-56.02
1696,-56.13
1697,-56.21
1698,-56.28
1699,-56.32
1700,-56.35
1701,-56.38
1702,-56.40
1703,-56.40
1704,-56.38
1705,-56.35
1706,-56.32
1707,-56.28
1708,-56.26
1709,-56.23
1710,-56.20
1711,-56.18
1712,-56.17
1713,-56.18
1714,-56.20
1715,-56.24
1716,-56.30
1717,-56.37
1718,-56.45
1719,-56.53
1720,-56.60
1721,-56.66
1722,-56.71
1723,-56.75
1724,-56.78
1725,-56.79
1726,-56.79
1727,-56.77
1728,-56.76
1729,-56.74
1730,-56.73
1731,-56.74
1732,-56.76
1733,-56.79
1734,-56.83
1735,-56.89
1736,-56.97
1737,-57.06
1738,-57.14
1739,-57.22
1740,-57.31
1741,-57.40
1742,-57.48
1743,-57.54
1744,-57.58
1745,-57.62
1746,-57.66
1747,-57.70
1748,-57.74
1749,-57.76
1750,-57.80
1751,-57.84
1752,-57.88
1753,-57.91
1754,-57.93
1755,-57.95
1756,-57.97
1757,-57.99
1758,-58.00
1759,-58.00
1760,-58.00
1761,-57.98
1762,-57.97
1763,-57.94
1764,-57.90
1765,-57.86
1766,-57.82
1767,-57.81
1768,-57.79
1769,-57.77
1770,-57.75
1771,-57.74
1772,-57.75
1773,-57.76
1774,-57.76
1775,-57.75
1776,-57.73
1777,-57.72
1778,-57.71
1779,-57.70
1780,-57.66
1781,-57.62
1782,-57.58
1783,-57.55
1784,-57.53
1785,-57.50
1786,-57.47
1787,-57.44
1788,-57.40
1789,-57.36
1790,-57.32
1791,-57.28
1792,-57.24
1793,-57.18
1794,-57.11
1795,-57.04
1796,-56.97
1797,-56.90
1798,-56.83
1799,-56.76
1800,-56.70
1801,-56.65
1802,-56.61
1803,-56.59
1804,-56.59
1805,-56.60
1806,-56.62
1807,-56.65
1808,-56.69
1809,-56.74
1810,-56.79
1811,-56.84
1812,-56.90
1813,-56.96
1814,-57.01
1815,-57.04
1816,-57.05
1817,-57.03
1818,-57.02
1819,-56.99
1820,-56.93
1821,-56.85
1822,-56.77
1823,-56.69
1824,-56.60
1825,-56.52
1826,-56.42
1827,-56.34
1828,-56.25
1829,-56.17
1830,-56.10
1831,-56.05
1832,-56.01
1833,-55.98
1834,-55.93
1835,-55.90
1836,-55.85
1837,-55.80
1838,-55.75
1839,-55.68
1840,-55.59
1841,-55.51
1842,-55.42
1843,-55.34
1844,-55.26
1845,-55.17
1846,-55.08
1847,-55.00
1848,-54.92
1849,-54.86
1850,-54.79
1851,-54.75
1852,-54.70
1853,-54.66
1854,-54.63
1855,-54.60
1856,-54.57
1857,-54.53
1858,-54.48
1859,-54.45
1860,-54.41
1861,-54.38
1862,-54.35
1863,-54.32
1864,-54.31
1865,-54.31
1866,-54.30
1867,-54.31
1868,-54.32
1869,-54.35
1870,-54.37
1871,-54.39
1872,-54.39
1873,-54.39
1874,-54.38
1875,-54.35
1876,-54.31
1877,-54.25
1878,-54.20
1879,-54.14
1880,-54.08
1881,-54.02
1882,-53.96
1883,-53.92
1884,-53.91
1885,-53.92
1886,-53.94
1887,-53.97
1888,-54.02
1889,-54.09
1890,-54.16
1891,-54.22
1892,-54.28
1893,-54.35
1894,-54.42
1895,-54.48
1896,-54.53
1897,-54.55
1898,-54.58
1899,-54.60
1900,-54.61
1901,-54.62
1902,-54.63
1903,-54.64
1904,-54.64
1905,-54.65
1906,-54.64
1907,-54.63
1908,-54.61
1909,-54.60
1910,-54.58
1911,-54.56
1912,-54.52
1913,-54.46
1914,-54.39
1915,-54.33
1916,-54.28
1917,-54.22
1918,-54.16
1919,-54.09
1920,-54.05
1921,-54.03
1922,-54.03
1923,-54.05
1924,-54.09
1925,-54.15
1926,-54.23
1927,-54.33
1928,-54.44
1929,-54.56
1930,-54.69
1931,-54.82
1932,-54.93
1933,-55.04
1934,-55.13
1935,-55.22
1936,-55.29
1937,-55.36
1938,-55.41
1939,-55.45
1940,-55.50
1941,-55.53
1942,-55.55
1943,-55.57
1944,-55.58
1945,-55.59
1946,-55.61
1947,-55.62
1948,-55.64
1949,-55.65
1950,-55.67
1951,-55.69
1952,-55.70
1953,-55.71
1954,-55.72
1955,-55.74
1956,-55.77
1957,-55.80
1958,-55.83
1959,-55.86
1960,-55.89
1961,-55.92
1962,-55.94
1963,-55.95
1964,-55.96
1965,-55.95
1966,-55.95
1967,-55.94
1968,-55.94
1969,-55.94
1970,-55.93
1971,-55.92
1972,-55.91
1973,-55.91
1974,-55.91
1975,-55.91
1976,-55.92
1977,-55.93
1978,-55.94
1979,-55.96
1980,-55.99
1981,-56.03
1982,-56.08
1983,-56.14
1984,-56.20
1985,-56.27
1986,-56.36
1987,-56.47
1988,-56.58
1989,-56.68
1990,-56.79
1991,-56.89
1992,-56.99
1993,-57.06
1994,-57.12
1995,-57.15
1996,-57.17
1997,-57.16
1998,-57.14
1999,-57.10
2000,-57.06
2001,-57.03
2002,-56.99
2003,-56.97
2004,-56.97
2005,-56.99
2006,-57.03
2007,-57.09
2008,-57.16
2009,-57.23
2010,-57.30
2011,-57.38
2012,-57.45
2013,-57.51
2014,-57.57
2015,-57.62
2016,-57.66
2017,-57.68
2018,-57.69
2019,-57.70
2020,-57.70
2021,-57.70
2022,-57.70
2023,-57.70
2024,-57.71
2025,-57.71
2026,-57.72
2027,-57.73
2028,-57.71
2029,-57.70
2030,-57.66
2031,-57.63
2032,-57.58
2033,-57.52
2034,-57.44
2035,-57.36
2036,-57.28
2037,-57.21
2038,-57.15
2039,-57.09
2040,-57.04
2041,-57.01
2042,-57.01
2043,-57.03
2044,-57.06
2045,-57.10
2046,-57.16
2047,-57.24
2048,-57.33
2049,-57.41
2050,-57.48
2051,-57.53
2052,-57.59
2053,-57.63
2054,-57.66
2055,-57.68
2056,-57.68
2057,-57.68
2058,-57.68
2059,-57.65
2060,-57.63
2061,-57.60
2062,-57.57
2063,-57.55
2064,-57.53
2065,-57.53
2066,-57.52
2067,-57.50
2068,-57.46
2069,-57.41
2070,-57.36
2071,-57.30
2072,-57.22
2073,-57.13
2074,-57.00
2075,-56.88
2076,-56.74
2077,-56.59
2078,-56.43
2079,-56.29
2080,-56.14
2081,-56.01
2082,-55.86
2083,-55.73
2084,-55.59
2085,-55.47
2086,-55.36
2087,-55.27
2088,-55.17
2089,-55.10
2090,-55.03
2091,-54.97
2092,-54.92
2093,-54.87
2094,-54.82
2095,-54.78
2096,-54.75
2097,-54.75
2098,-54.74
2099,-54.75
2100,-54.74
2101,-54.75
2102,-54.75
2103,-54.75
2104,-54.74
2105,-54.73
2106,-54.72
2107,-54.71
2108,-54.69
2109,-54.67
2110,-54.62
2111,-54.57
2112,-54.52
2113,-54.46
2114,-54.39
2115,-54.32
2116,-54.26
2117,-54.21
2118,-54.16
2119,-54.10
2120,-54.04
2121,-54.00
2122,-53.98
2123,-53.97
2124,-53.97
2125,-53.98
2126,-54.01
2127,-54.03
2128,-54.06
2129,-54.08
2130,-54.11
2131,-54.15
2132,-54.18
2133,-54.19
2134,-54.20
2135,-54.19
2136,-54.17
2137,-54.14
2138,-54.09
2139,-54.03
2140,-53.98
2141,-53.92
2142,-53.86
2143,-53.78
2144,-53.72
2145,-53.67
2146,-53.64
2147,-53.64
2148,-53.66
2149,-53.69
2150,-53.74
2151,-53.80
2152,-53.87
2153,-53.95
2154,-54.03
2155,-54.11
2156,-54.18
2157,-54.23
2158,-54.27
2159,-54.31
2160,-54.34
2161,-54.36
2162,-54.38
2163,-54.41
2164,-54.45
2165,-54.50
2166,-54.56
2167,-54.64
2168,-54.73
2169,-54.83
2170,-54.94
2171,-55.05
2172,-55.15
2173,-55.24
2174,-55.33
2175,-55.39
2176,-55.44
2177,-55.45
2178,-55.47
2179,-55.49
2180,-55.50
2181,-55.50
2182,-55.51
2183,-55.54
2184,-55.57
2185,-55.62
2186,-55.66
2187,-55.72
2188,-55.79
2189,-55.86
2190,-55.93
2191,-56.00
2192,-56.06
2193,-56.11
2194,-56.16
2195,-56.20
2196,-56.22
2197,-56.23
2198,-56.24
2199,-56.23
2200,-56.22
2201,-56.19
2202,-56.16
2203,-56.12
2204,-56.07
2205,-56.02
2206,-55.97
2207,-55.94
2208,-55.93
2209,-55.92
2210,-55.90
2211,-55.89
2212,-55.91
2213,-55.93
2214,-55.96
2215,-55.98
2216,-56.01
2217,-56.04
2218,-56.06
2219,-56.09
2220,-56.11
2221,-56.13
2222,-56.16
2223,-56.18
2224,-56.21
2225,-56.24
2226,-56.30
2227,-56.35
2228,-56.40
2229,-56.44
2230,-56.50
2231,-56.56
2232,-56.62
2233,-56.68
2234,-56.73
2235,-56.77
2236,-56.81
2237,-56.84
2238,-56.85
2239,-56.85
2240,-56.85
2241,-56.85
2242,-56.85
2243,-56.84
2244,-56.81
2245,-56.78
2246,-56.76
2247,-56.74
2248,-56.72
2249,-56.70
2250,-56.68
2251,-56.65
2252,-56.60
2253,-56.54
2254,-56.49
2255,-56.44
2256,-56.37
2257,-56.29
2258,-56.23
2259,-56.17
2260,-56.12
2261,-56.06
2262,-56.01
2263,-55.98
2264,-55.97
2265,-55.97
2266,-55.98
2267,-56.00
2268,-56.02
2269,-56.05
2270,-56.07
2271,-56.09
2272,-56.09
2273,-56.09
2274,-56.06
2275,-56.03
2276,-55.99
2277,-55.93
2278,-55.87
2279,-55.81
2280,-55.74
2281,-55.67
2282,-55.60
2283,-55.53
2284,-55.47
2285,-55.41
2286,-55.35
2287,-55.32
2288,-55.29
2289,-55.27
2290,-55.24
2291,-55.21
2292,-55.19
2293,-55.19
2294,-55.20
2295,-55.20
2296,-55.20
2297,-55.20
2298,-55.20
2299,-55.22
2300,-55.22
2301,-55.22
2302,-55.22
2303,-55.19
2304,-55.16
2305,-55.13
2306,-55.08
2307,-55.03
2308,-54.97
2309,-54.93
2310,-54.88
2311,-54.85
2312,-54.80
2313,-54.75
2314,-54.70
2315,-54.65
2316,-54.60
2317,-54.53
2318,-54.44
2319,-54.37
2320,-54.29
2321,-54.21
2322,-54.11
2323,-54.00
2324,-53.87
2325,-53.75
2326,-53.63
2327,-53.52
2328,-53.39
2329,-53.27
2330,-53.15
2331,-53.03
2332,-52.93
2333,-52.84
2334,-52.76
2335,-52.68
2336,-52.61
2337,-52.56
2338,-52.52
2339,-52.50
2340,-52.47
2341,-52.45
2342,-52.44
2343,-52.43
2344,-52.42
2345,-52.41
2346,-52.39
2347,-52.37
2348,-52.32
2349,-52.27
2350,-52.22
2351,-52.16
2352,-52.09
2353,-52.02
2354,-51.95
2355,-51.88
2356,-51.81
2357,-51.74
2358,-51.68
2359,-51.62
2360,-51.55
2361,-51.50
2362,-51.45
2363,-51.42
2364,-51.40
2365,-51.38
2366,-51.37
2367,-51.38
2368,-51.40
2369,-51.44
2370,-51.49
2371,-51.55
2372,-51.63
2373,-51.72
2374,-51.81
2375,-51.90
2376,-52.00
2377,-52.09
2378,-52.19
2379,-52.27
2380,-52.34
2381,-52.41
2382,-52.47
2383,-52.50
2384,-52.51
2385,-52.51
2386,-52.50
2387,-52.48
2388,-52.44
2389,-52.38
2390,-52.32
2391,-52.26
2392,-52.19
2393,-52.11
2394,-52.03
2395,-51.96
2396,-51.90
2397,-51.84
2398,-51.78
2399,-51.72
2400,-51.70
2401,-51.69
2402,-51.68
2403,-51.68
2404,-51.70
2405,-51.73
2406,-51.76
2407,-51.80
2408,-51.85
2409,-51.91
2410,-51.99
2411,-52.07
2412,-52.14
2413,-52.19
2414,-52.26
2415,-52.34
2416,-52.42
2417,-52.49
2418,-52.55
2419,-52.60
2420,-52.64
2421,-52.69
2422,-52.75
2423,-52.80
2424,-52.84
2425,-52.85
2426,-52.87
2427,-52.88
2428,-52.91
2429,-52.94
2430,-52.97
2431,-52.99
2432,-53.01
2433,-53.02
2434,-53.05
2435,-53.09
2436,-53.14
2437,-53.18
2438,-53.22
2439,-53.25
2440,-53.30
2441,-53.35
2442,-53.41
2443,-53.46
2444,-53.52
2445,-53.56
2446,-53.59
2447,-53.63
2448,-53.67
2449,-53.68
2450,-53.70
2451,-53.72
2452,-53.74
2453,-53.76
2454,-53.78
2455,-53.81
2456,-53.86
2457,-53.90
2458,-53.95
2459,-53.98
2460,-54.05
2461,-54.12
2462,-54.20
2463,-54.27
2464,-54.35
2465,-54.43
2466,-54.53
2467,-54.62
2468,-54.70
2469,-54.78
2470,-54.87
2471,-54.97
2472,-55.07
2473,-55.15
2474,-55.22
2475,-55.30
2476,-55.38
2477,-55.44
2478,-55.51
2479,-55.57
2480,-55.62
2481,-55.65
2482,-55.67
2483,-55.69
2484,-55.71
2485,-55.71
2486,-55.71
2487,-55.72
2488,-55.73
2489,-55.73
2490,-55.73
2491,-55.72
2492,-55.72
2493,-55.72
2494,-55.71
2495,-55.69
2496,-55.66
2497,-55.63
2498,-55.60
2499,-55.56
2500,-55.51
2501,-55.46
2502,-55.41
2503,-55.36
2504,-55.32
2505,-55.28
2506,-55.25
2507,-55.24
2508,-55.24
2509,-55.25
2510,-55.27
2511,-55.30
2512,-55.33
2513,-55.36
2514,-55.39
2515,-55.41
2516,-55.43
2517,-55.44
2518,-55.43
2519,-55.40
2520,-55.37
2521,-55.34
2522,-55.33
2523,-55.32
2524,-55.33
2525,-55.36
2526,-55.43
2527,-55.51
2528,-55.61
2529,-55.73
2530,-55.87
2531,-56.02
2532,-56.16
2533,-56.29
2534,-56.42
2535,-56.54
2536,-56.63
2537,-56.69
2538,-56.73
2539,-56.74
2540,-56.75
2541,-56.73
2542,-56.69
2543,-56.64
2544,-56.59
2545,-56.54
2546,-56.48
2547,-56.41
2548,-56.33
2549,-56.25
2550,-56.18
2551,-56.10
2552,-56.00
2553,-55.91
2554,-55.81
2555,-55.74
2556,-55.65
2557,-55.57
2558,-55.47
2559,-55.39
2560,-55.29
2561,-55.21
2562,-55.11
2563,-55.02
2564,-54.91
2565,-54.79
2566,-54.65
2567,-54.51
2568,-54.35
2569,-54.19
2570,-54.01
2571,-53.82
2572,-53.65
2573,-53.50
2574,-53.36
2575,-53.25
2576,-53.16
2577,-53.10
2578,-53.09
2579,-53.10
2580,-53.14
2581,-53.20
2582,-53.28
2583,-53.38
2584,-53.49
2585,-53.59
2586,-53.67
2587,-53.74
2588,-53.77
2589,-53.78
2590,-53.76
2591,-53.72
2592,-53.66
2593,-53.58
2594,-53.48
2595,-53.36
2596,-53.24
2597,-53.13
2598,-53.03
2599,-52.94
2600,-52.86
2601,-52.79
2602,-52.73
2603,-52.68
2604,-52.65
2605,-52.64
2606,-52.64
2607,-52.65
2608,-52.68
2609,-52.72
2610,-52.76
2611,-52.80
2612,-52.85
2613,-52.91
2614,-52.96
2615,-53.01
2616,-53.03
2617,-53.04
2618,-53.04
2619,-53.02
2620,-52.98
2621,-52.92
2622,-52.84
2623,-52.76
2624,-52.68
2625,-52.61
2626,-52.55
2627,-52.51
2628,-52.50
2629,-52.51
2630,-52.54
2631,-52.58
2632,-52.63
2633,-52.70
2634,-52.78
2635,-52.86
2636,-52.93
2637,-52.99
2638,-53.05
2639,-53.10
2640,-53.16
2641,-53.21
2642,-53.26
2643,-53.29
2644,-53.34
2645,-53.40
2646,-53.47
2647,-53.55
2648,-53.65
2649,-53.75
2650,-53.86
2651,-53.96
2652,-54.06
2653,-54.15
2654,-54.23
2655,-54.29
2656,-54.32
2657,-54.34
2658,-54.35
2659,-54.35
2660,-54.35
2661,-54.33
2662,-54.32
2663,-54.33
2664,-54.37
2665,-54.43
2666,-54.50
2667,-54.58
2668,-54.68
2669,-54.78
2670,-54.90
2671,-55.01
2672,-55.10
2673,-55.16
2674,-55.20
2675,-55.22
2676,-55.21
2677,-55.17
2678,-55.12
2679,-55.05
2680,-54.98
2681,-54.92
2682,-54.86
2683,-54.82
2684,-54.79
2685,-54.77
2686,-54.77
2687,-54.80
2688,-54.85
2689,-54.90
2690,-54.95
2691,-55.01
2692,-55.07
2693,-55.12
2694,-55.16
2695,-55.18
2696,-55.21
2697,-55.23
2698,-55.24
2699,-55.24
2700,-55.24
2701,-55.26
2702,-55.30
2703,-55.33
2704,-55.38
2705,-55.43
2706,-55.50
2707,-55.58
2708,-55.65
2709,-55.72
2710,-55.80
2711,-55.89
2712,-55.97
2713,-56.04
2714,-56.11
2715,-56.16
2716,-56.21
2717,-56.23
2718,-56.23
2719,-56.22
2720,-56.20
2721,-56.17
2722,-56.14
2723,-56.10
2724,-56.04
2725,-55.97
2726,-55.90
2727,-55.84
2728,-55.79
2729,-55.73
2730,-55.66
2731,-55.61
2732,-55.55
2733,-55.52
2734,-55.48
2735,-55.44
2736,-55.40
2737,-55.36
2738,-55.32
2739,-55.28
2740,-55.23
2741,-55.18
2742,-55.11
2743,-55.04
2744,-54.96
2745,-54.88
2746,-54.80
2747,-54.72
2748,-54.64
2749,-54.58
2750,-54.51
2751,-54.47
2752,-54.43
2753,-54.40
2754,-54.37
2755,-54.35
2756,-54.35
2757,-54.35
2758,-54.35
2759,-54.35
2760,-54.35
2761,-54.36
2762,-54.36
2763,-54.35
2764,-54.34
2765,-54.34
2766,-54.36
2767,-54.38
2768,-54.39
2769,-54.41
2770,-54.45
2771,-54.50
2772,-54.55
2773,-54.61
2774,-54.67
2775,-54.73
2776,-54.79
2777,-54.85
2778,-54.88
2779,-54.90
2780,-54.91
2781,-54.92
2782,-54.92
2783,-54.89
2784,-54.83
2785,-54.76
2786,-54.68
2787,-54.61
2788,-54.52
2789,-54.42
2790,-54.31
2791,-54.20
2792,-54.10
2793,-54.01
2794,-53.93
2795,-53.88
2796,-53.83
2797,-53.79
2798,-53.75
2799,-53.72
2800,-53.70
2801,-53.70
2802,-53.69
2803,-53.68
2804,-53.67
2805,-53.65
2806,-53.62
2807,-53.59
2808,-53.56
2809,-53.53
2810,-53.49
2811,-53.44
2812,-53.39
2813,-53.35
2814,-53.32
2815,-53.30
2816,-53.25
2817,-53.19
2818,-53.13
2819,-53.07
2820,-53.01
2821,-52.95
2822,-52.88
2823,-52.81
2824,-52.75
2825,-52.71
2826,-52.68
2827,-52.66
2828,-52.63
2829,-52.64
2830,-52.65
2831,-52.66
2832,-52.66
2833,-52.65
2834,-52.63
2835,-52.62
2836,-52.58
2837,-52.55
2838,-52.51
2839,-52.46
2840,-52.42
2841,-52.37
2842,-52.33
2843,-52.29
2844,-52.27
2845,-52.26
2846,-52.27
2847,-52.29
2848,-52.31
2849,-52.33
2850,-52.36
2851,-52.39
2852,-52.42
2853,-52.45
2854,-52.47
2855,-52.47
2856,-52.45
2857,-52.44
2858,-52.41
2859,-52.38
2860,-52.34
2861,-52.29
2862,-52.24
2863,-52.20
2864,-52.16
2865,-52.11
2866,-52.07
2867,-52.04
2868,-52.01
2869,-51.98
2870,-51.95
2871,-51.92
2872,-51.89
2873,-51.85
2874,-51.80
2875,-51.75
2876,-51.70
2877,-51.64
2878,-51.58
2879,-51.52
2880,-51.45
2881,-51.38
2882,-51.33
2883,-51.30
2884,-51.28
2885,-51.27
2886,-51.28
2887,-51.32
2888,-51.38
2889,-51.46
2890,-51.56
2891,-51.67
2892,-51.79
2893,-51.93
2894,-52.08
2895,-52.22
2896,-52.35
2897,-52.47
2898,-52.58
2899,-52.66
2900,-52.74
2901,-52.78
2902,-52.81
2903,-52.82
2904,-52.82
2905,-52.81
2906,-52.78
2907,-52.74
2908,-52.71
2909,-52.69
2910,-52.67
2911,-52.66
2912,-52.66
2913,-52.67
2914,-52.69
2915,-52.73
2916,-52.79
2917,-52.85
2918,-52.91
2919,-52.98
2920,-53.05
2921,-53.11
2922,-53.16
2923,-53.22
2924,-53.29
2925,-53.34
2926,-53.40
2927,-53.45
2928,-53.50
2929,-53.55
2930,-53.60
2931,-53.65
2932,-53.70
2933,-53.74
2934,-53.80
2935,-53.85
2936,-53.92
2937,-54.00
2938,-54.10
2939,-54.18
2940,-54.27
2941,-54.35
2942,-54.43
2943,-54.51
2944,-54.61
2945,-54.71
2946,-54.81
2947,-54.90
2948,-54.98
2949,-55.06
2950,-55.15
2951,-55.25
2952,-55.35
2953,-55.43
2954,-55.49
2955,-55.53
2956,-55.58
2957,-55.63
2958,-55.68
2959,-55.70
2960,-55.69
2961,-55.67
2962,-55.65
2963,-55.62
2964,-55.58
2965,-55.53
2966,-55.47
2967,-55.41
2968,-55.35
2969,-55.29
2970,-55.24
2971,-55.20
2972,-55.17
2973,-55.15
2974,-55.14
2975,-55.14
2976,-55.14
2977,-55.15
2978,-55.17
2979,-55.19
2980,-55.21
2981,-55.23
2982,-55.25
2983,-55.26
2984,-55.26
2985,-55.27
2986,-55.29
2987,-55.29
2988,-55.30
2989,-55.30
2990,-55.29
2991,-55.28
2992,-55.28
2993,-55.28
2994,-55.27
2995,-55.26
2996,-55.22
2997,-55.19
2998,-55.17
2999,-55.15
3000,-55.12
3001,-55.08
3002,-55.05
3003,-55.01
3004,-54.98
3005,-54.96
3006,-54.94
3007,-54.94
3008,-54.94
3009,-54.95
3010,-54.98
3011,-55.02
3012,-55.06
3013,-55.10
3014,-55.15
3015,-55.20
3016,-55.24
3017,-55.27
3018,-55.29
3019,-55.30
3020,-55.30
3021,-55.30
3022,-55.29
3023,-55.27
3024,-55.25
3025,-55.23
3026,-55.21
3027,-55.18
3028,-55.15
3029,-55.12
3030,-55.08
3031,-55.05
3032,-55.00
3033,-54.95
3034,-54.88
3035,-54.80
3036,-54.69
3037,-54.59
3038,-54.46
3039,-54.32
3040,-54.17
3041,-54.03
3042,-53.88
3043,-53.74
3044,-53.61
3045,-53.49
3046,-53.38
3047,-53.28
3048,-53.19
3049,-53.11
3050,-53.04
3051,-52.98
3052,-52.94
3053,-52.90
3054,-52.85
3055,-52.80
3056,-52.76
3057,-52.72
3058,-52.68
3059,-52.63
3060,-52.58
3061,-52.54
3062,-52.51
3063,-52.49
3064,-52.47
3065,-52.45
3066,-52.43
3067,-52.41
3068,-52.40
3069,-52.41
3070,-52.42
3071,-52.43
3072,-52.42
3073,-52.42
3074,-52.42
3075,-52.41
3076,-52.39
3077,-52.36
3078,-52.33
3079,-52.30
3080,-52.27
3081,-52.23
3082,-52.18
3083,-52.13
3084,-52.08
3085,-52.04
3086,-52.01
3087,-51.98
3088,-51.96
3089,-51.95
3090,-51.94
3091,-51.93
3092,-51.93
3093,-51.94
3094,-51.95
3095,-51.95
3096,-51.95
3097,-51.94
3098,-51.94
3099,-51.94
3100,-51.95
3101,-51.96
3102,-51.97
3103,-51.97
3104,-51.97
3105,-52.00
3106,-52.05
3107,-52.10
3108,-52.15
3109,-52.21
3110,-52.28
3111,-52.35
3112,-52.41
3113,-52.47
3114,-52.53
3115,-52.58
3116,-52.61
3117,-52.62
3118,-52.62
3119,-52.62
3120,-52.62
3121,-52.61
3122,-52.60
3123,-52.61
3124,-52.63
3125,-52.67
3126,-52.73
3127,-52.81
3128,-52.91
3129,-53.02
3130,-53.14
3131,-53.26
3132,-53.38
3133,-53.49
3134,-53.61
3135,-53.72
3136,-53.82
3137,-53.88
3138,-53.94
3139,-53.97
3140,-54.01
3141,-54.04
3142,-54.06
3143,-54.08
3144,-54.10
3145,-54.14
3146,-54.19
3147,-54.24
3148,-54.29
3149,-54.34
3150,-54.39
3151,-54.46
3152,-54.51
3153,-54.55
3154,-54.57
3155,-54.57
3156,-54.56
3157,-54.54
3158,-54.51
3159,-54.48
3160,-54.45
3161,-54.42
3162,-54.39
3163,-54.37
3164,-54.36
3165,-54.37
3166,-54.40
3167,-54.44
3168,-54.49
3169,-54.54
3170,-54.58
3171,-54.62
3172,-54.67
3173,-54.70
3174,-54.74
3175,-54.77
3176,-54.80
3177,-54.84
3178,-54.89
3179,-54.92
3180,-54.96
3181,-55.00
3182,-55.05
3183,-55.11
3184,-55.17
3185,-55.24
3186,-55.32
3187,-55.40
3188,-55.47
3189,-55.53
3190,-55.58
3191,-55.62
3192,-55.66
3193,-55.69
3194,-55.70
3195,-55.69
3196,-55.67
3197,-55.65
3198,-55.61
3199,-55.55
3200,-55.49
3201,-55.42
3202,-55.33
3203,-55.25
3204,-55.16
3205,-55.08
3206,-55.00
3207,-54.92
3208,-54.84
3209,-54.78
3210,-54.71
3211,-54.66
3212,-54.59
3213,-54.53
3214,-54.48
3215,-54.43
3216,-54.37
3217,-54.32
3218,-54.26
3219,-54.22
3220,-54.19
3221,-54.17
3222,-54.16
3223,-54.15
3224,-54.15
3225,-54.17
3226,-54.21
3227,-54.25
3228,-54.29
3229,-54.33
3230,-54.36
3231,-54.38
3232,-54.39
3233,-54.40
3234,-54.37
3235,-54.31
3236,-54.22
3237,-54.11
3238,-53.99
3239,-53.87
3240,-53.74
3241,-53.62
3242,-53.49
3243,-53.38
3244,-53.29
3245,-53.22
3246,-53.18
3247,-53.17
3248,-53.19
3249,-53.23
3250,-53.28
3251,-53.34
3252,-53.41
3253,-53.49
3254,-53.57
3255,-53.65
3256,-53.73
3257,-53.80
3258,-53.87
3259,-53.92
3260,-53.98
3261,-54.03
3262,-54.07
3263,-54.10
3264,-54.11
3265,-54.11
3266,-54.11
3267,-54.11
3268,-54.10
3269,-54.06
3270,-54.01
3271,-53.95
3272,-53.87
3273,-53.80
3274,-53.71
3275,-53.63
3276,-53.55
3277,-53.47
3278,-53.40
3279,-53.34
3280,-53.29
3281,-53.24
3282,-53.20
3283,-53.16
3284,-53.11
3285,-53.06
3286,-53.02
3287,-52.98
3288,-52.94
3289,-52.90
3290,-52.86
3291,-52.82
3292,-52.78
3293,-52.75
3294,-52.72
3295,-52.70
3296,-52.70
3297,-52.73
3298,-52.75
3299,-52.77
3300,-52.79
3301,-52.84
3302,-52.88
3303,-52.93
3304,-52.94
3305,-52.94
3306,-52.94
3307,-52.93
3308,-52.91
3309,-52.87
3310,-52.80
3311,-52.73
3312,-52.67
3313,-52.61
3314,-52.54
3315,-52.46
3316,-52.40
3317,-52.36
3318,-52.32
3319,-52.28
3320,-52.25
3321,-52.23
3322,-52.22
3323,-52.21
3324,-52.20
3325,-52.20
3326,-52.21
3327,-52.22
3328,-52.23
3329,-52.26
3330,-52.30
3331,-52.34
3332,-52.38
3333,-52.42
3334,-52.46
3335,-52.50
3336,-52.54
3337,-52.57
3338,-52.59
3339,-52.59
3340,-52.57
3341,-52.54
3342,-52.51
3343,-52.47
3344,-52.41
3345,-52.34
3346,-52.27
3347,-52.21
3348,-52.15
3349,-52.11
3350,-52.07
3351,-52.04
3352,-52.01
3353,-51.97
3354,-51.93
3355,-51.90
3356,-51.87
3357,-51.83
3358,-51.78
3359,-51.72
3360,-51.67
3361,-51.64
3362,-51.61
3363,-51.58
3364,-51.56
3365,-51.55
3366,-51.55
3367,-51.57
3368,-51.61
3369,-51.66
3370,-51.72
3371,-51.79
3372,-51.86
3373,-51.94
3374,-52.03
3375,-52.11
3376,-52.22
3377,-52.33
3378,-52.44
3379,-52.54
3380,-52.62
3381,-52.70
3382,-52.79
3383,-52.88
3384,-52.95
3385,-52.99
3386,-53.01
3387,-53.03
3388,-53.04
3389,-53.04
3390,-53.03
3391,-53.02
3392,-53.02
3393,-53.01
3394,-53.02
3395,-53.04
3396,-53.08
3397,-53.13
3398,-53.19
3399,-53.24
3400,-53.31
3401,-53.38
3402,-53.46
3403,-53.53
3404,-53.60
3405,-53.65
3406,-53.71
3407,-53.78
3408,-53.84
3409,-53.89
3410,-53.93
3411,-53.98
3412,-54.04
3413,-54.10
3414,-54.15
3415,-54.19
3416,-54.24
3417,-54.29
3418,-54.35
3419,-54.39
3420,-54.42
3421,-54.43
3422,-54.46
3423,-54.49
3424,-54.52
3425,-54.53
3426,-54.56
3427,-54.60
3428,-54.65
3429,-54.72
3430,-54.81
3431,-54.88
3432,-54.96
3433,-55.03
3434,-55.11
3435,-55.18
3436,-55.25
3437,-55.29
3438,-55.32
3439,-55.32
3440,-55.30
3441,-55.25
3442,-55.19
3443,-55.13
3444,-55.07
3445,-54.99
3446,-54.90
3447,-54.83
3448,-54.78
3449,-54.76
3450,-54.76
3451,-54.77
3452,-54.80
3453,-54.85
3454,-54.92
3455,-55.00
3456,-55.08
3457,-55.15
3458,-55.22
3459,-55.29
3460,-55.34
3461,-55.38
3462,-55.38
3463,-55.37
3464,-55.35
3465,-55.32
3466,-55.28
3467,-55.23
3468,-55.16
3469,-55.10
3470,-55.04
3471,-54.99
3472,-54.93
3473,-54.88
3474,-54.82
3475,-54.75
3476,-54.68
3477,-54.62
3478,-54.56
3479,-54.50
3480,-54.43
3481,-54.36
3482,-54.30
3483,-54.26
3484,-54.22
3485,-54.18
3486,-54.16
3487,-54.16
3488,-54.17
3489,-54.21
3490,-54.26
3491,-54.32
3492,-54.41
3493,-54.50
3494,-54.60
3495,-54.69
3496,-54.79
3497,-54.88
3498,-54.96
3499,-55.03
3500,-55.09
3501,-55.13
3502,-55.15
3503,-55.16
3504,-55.16
3505,-55.15
3506,-55.13
3507,-55.11
3508,-55.10
3509,-55.08
3510,-55.04
3511,-54.99
3512,-54.93
3513,-54.88
3514,-54.81
3515,-54.73
3516,-54.64
3517,-54.54
3518,-54.43
3519,-54.31
3520,-54.18
3521,-54.06
3522,-53.92
3523,-53.80
3524,-53.67
3525,-53.55
3526,-53.44
3527,-53.34
3528,-53.24
3529,-53.16
3530,-53.08
3531,-53.01
3532,-52.94
3533,-52.87
3534,-52.80
3535,-52.73
3536,-52.66
3537,-52.59
3538,-52.53
3539,-52.48
3540,-52.44
3541,-52.41
3542,-52.39
3543,-52.38
3544,-52.40
3545,-52.44
3546,-52.48
3547,-52.54
3548,-52.60
3549,-52.66
3550,-52.73
3551,-52.78
3552,-52.83
3553,-52.85
3554,-52.85
3555,-52.81
3556,-52.74
3557,-52.65
3558,-52.55
3559,-52.44
3560,-52.32
3561,-52.18
3562,-52.04
3563,-51.91
3564,-51.79
3565,-51.69
3566,-51.61
3567,-51.57
3568,-51.53
3569,-51.51
3570,-51.51
3571,-51.54
3572,-51.59
3573,-51.64
3574,-51.69
3575,-51.74
3576,-51.80
3577,-51.87
3578,-51.94
3579,-52.00
3580,-52.05
3581,-52.10
3582,-52.15
3583,-52.19
3584,-52.22
3585,-52.25
3586,-52.28
3587,-52.31
3588,-52.34
3589,-52.36
3590,-52.37
3591,-52.37
3592,-52.37
3593,-52.36
3594,-52.36
3595,-52.36
3596,-52.37
3597,-52.39
3598,-52.40
3599,-52.41
3600,-52.44
3601,-52.49
3602,-52.55
3603,-52.61
3604,-52.68
3605,-52.78
3606,-52.90
3607,-53.02
3608,-53.14
3609,-53.25
3610,-53.38
3611,-53.51
3612,-53.63
3613,-53.74
3614,-53.85
3615,-53.95
3616,-54.03
3617,-54.07
3618,-54.11
3619,-54.15
3620,-54.18
3621,-54.20
3622,-54.21
3623,-54.21
3624,-54.20
3625,-54.19
3626,-54.19
3627,-54.19
3628,-54.19
3629,-54.19
3630,-54.19
3631,-54.20
3632,-54.22
3633,-54.25
3634,-54.29
3635,-54.33
3636,-54.37
3637,-54.41
3638,-54.45
3639,-54.50
3640,-54.55
3641,-54.61
3642,-54.68
3643,-54.74
3644,-54.79
3645,-54.82
3646,-54.86
3647,-54.90
3648,-54.94
3649,-54.96
3650,-54.96
3651,-54.93
3652,-54.91
3653,-54.89
3654,-54.87
3655,-54.84
3656,-54.81
3657,-54.79
3658,-54.77
3659,-54.76
3660,-54.77
3661,-54.80
3662,-54.85
3663,-54.91
3664,-54.97
3665,-55.04
3666,-55.12
3667,-55.20
3668,-55.28
3669,-55.35
3670,-55.41
3671,-55.46
3672,-55.49
3673,-55.52
3674,-55.56
3675,-55.58
3676,-55.60
3677,-55.60
3678,-55.60
3679,-55.62
3680,-55.65
3681,-55.67
3682,-55.69
3683,-55.72
3684,-55.75
3685,-55.78
3686,-55.80
3687,-55.82
3688,-55.81
3689,-55.80
3690,-55.79
3691,-55.76
3692,-55.72
3693,-55.66
3694,-55.61
3695,-55.55
3696,-55.49
3697,-55.43
3698,-55.37
3699,-55.32
3700,-55.28
3701,-55.25
3702,-55.23
3703,-55.22
3704,-55.23
3705,-55.25
3706,-55.27
3707,-55.30
3708,-55.34
3709,-55.37
3710,-55.39
3711,-55.39
3712,-55.37
3713,-55.34
3714,-55.29
3715,-55.22
3716,-55.14
3717,-55.05
3718,-54.94
3719,-54.82
3720,-54.71
3721,-54.60
3722,-54.49
3723,-54.39
3724,-54.31
3725,-54.24
3726,-54.21
3727,-54.20
3728,-54.21
3729,-54.24
3730,-54.30
3731,-54.36
3732,-54.45
3733,-54.54
3734,-54.64
3735,-54.73
3736,-54.79
3737,-54.83
3738,-54.86
3739,-54.88
3740,-54.87
3741,-54.83
3742,-54.78
3743,-54.71
3744,-54.65
3745,-54.58
3746,-54.51
3747,-54.44
3748,-54.37
3749,-54.32
3750,-54.26
3751,-54.21
3752,-54.16
3753,-54.10
3754,-54.04
3755,-53.98
3756,-53.92
3757,-53.86
3758,-53.80
3759,-53.75
3760,-53.71
3761,-53.70
3762,-53.68
3763,-53.68
3764,-53.67
3765,-53.67
3766,-53.67
3767,-53.68
3768,-53.67
3769,-53.65
3770,-53.62
3771,-53.59
3772,-53.55
3773,-53.51
3774,-53.48
3775,-53.45
3776,-53.41
3777,-53.38
3778,-53.34
3779,-53.32
3780,-53.30
3781,-53.29
3782,-53.27
3783,-53.26
3784,-53.24
3785,-53.20
3786,-53.15
3787,-53.10
3788,-53.05
3789,-53.01
3790,-52.95
3791,-52.89
3792,-52.83
3793,-52.80
3794,-52.76
3795,-52.74
3796,-52.70
3797,-52.67
3798,-52.65
3799,-52.65
3800,-52.63
3801,-52.62
3802,-52.59
3803,-52.56
3804,-52.52
3805,-52.48
3806,-52.44
3807,-52.39
3808,-52.34
3809,-52.31
3810,-52.29
3811,-52.27
3812,-52.25
3813,-52.24
3814,-52.25
3815,-52.27
3816,-52.30
3817,-52.33
3818,-52.36
3819,-52.40
3820,-52.44
3821,-52.48
3822,-52.52
3823,-52.54
3824,-52.55
3825,-52.55
3826,-52.54
3827,-52.52
3828,-52.48
3829,-52.45
3830,-52.40
3831,-52.35
3832,-52.29
3833,-52.21
3834,-52.12
3835,-52.02
3836,-51.91
3837,-51.79
3838,-51.67
3839,-51.56
3840,-51.45
3841,-51.35
3842,-51.27
3843,-51.21
3844,-51.17
3845,-51.16
3846,-51.19
3847,-51.25
3848,-51.33
3849,-51.42
3850,-51.53
3851,-51.66
3852,-51.79
3853,-51.91
3854,-52.03
3855,-52.13
3856,-52.22
3857,-52.29
3858,-52.36
3859,-52.43
3860,-52.50
3861,-52.55
3862,-52.61
3863,-52.66
3864,-52.74
3865,-52.82
3866,-52.90
3867,-52.98
3868,-53.06
3869,-53.14
3870,-53.21
3871,-53.27
3872,-53.33
3873,-53.37
3874,-53.41
3875,-53.44
3876,-53.47
3877,-53.50
3878,-53.53
3879,-53.55
3880,-53.56
3881,-53.57
3882,-53.58
3883,-53.59
3884,-53.60
3885,-53.59
3886,-53.59
3887,-53.59
3888,-53.60
3889,-53.59
3890,-53.59
3891,-53.57
3892,-53.58
3893,-53.61
3894,-53.65
3895,-53.70
3896,-53.77
3897,-53.86
3898,-53.96
3899,-54.07
3900,-54.19
3901,-54.30
3902,-54.43
3903,-54.54
3904,-54.66
3905,-54.77
3906,-54.88
3907,-54.96
3908,-55.04
3909,-55.10
3910,-55.15
3911,-55.18
3912,-55.21
3913,-55.23
3914,-55.25
3915,-55.26
3916,-55.26
3917,-55.26
3918,-55.27
3919,-55.27
3920,-55.28
3921,-55.28
3922,-55.29
3923,-55.29
3924,-55.30
3925,-55.30
3926,-55.31
3927,-55.33
3928,-55.34
3929,-55.35
3930,-55.37
3931,-55.40
3932,-55.44
3933,-55.49
3934,-55.54
3935,-55.58
3936,-55.62
3937,-55.67
3938,-55.72
3939,-55.77
3940,-55.82
3941,-55.87
3942,-55.92
3943,-55.97
3944,-56.02
3945,-56.05
3946,-56.06
3947,-56.06
3948,-56.05
3949,-56.04
3950,-56.02
3951,-55.99
3952,-55.96
3953,-55.92
3954,-55.87
3955,-55.82
3956,-55.76
3957,-55.72
3958,-55.68
3959,-55.65
3960,-55.61
3961,-55.56
3962,-55.53
3963,-55.50
3964,-55.48
3965,-55.45
3966,-55.43
3967,-55.43
3968,-55.44
3969,-55.47
3970,-55.52
3971,-55.59
3972,-55.68
3973,-55.79
3974,-55.93
3975,-56.07
3976,-56.23
3977,-56.38
3978,-56.53
3979,-56.67
3980,-56.78
3981,-56.88
3982,-56.94
3983,-56.98
3984,-56.99
3985,-56.97
3986,-56.93
3987,-56.87
3988,-56.78
3989,-56.69
3990,-56.57
3991,-56.45
3992,-56.32
3993,-56.20
3994,-56.07
3995,-55.97
3996,-55.86
3997,-55.75
3998,-55.64
3999,-55.53
4000,-55.43
4001,-55.34
4002,-55.26
4003,-55.19
4004,-55.13
4005,-55.07
4006,-55.01
4007,-54.95
4008,-54.89
4009,-54.83
4010,-54.76
4011,-54.69
4012,-54.60
4013,-54.51
4014,-54.42
4015,-54.33
4016,-54.24
4017,-54.17
4018,-54.09
4019,-54.03
4020,-53.99
4021,-53.96
4022,-53.94
4023,-53.93
4024,-53.93
4025,-53.93
4026,-53.93
4027,-53.93
4028,-53.92
4029,-53.91
4030,-53.88
4031,-53.84
4032,-53.78
4033,-53.71
4034,-53.63
4035,-53.56
4036,-53.48
4037,-53.40
4038,-53.31
4039,-53.23
4040,-53.16
4041,-53.10
4042,-53.05
4043,-53.02
4044,-52.98
4045,-52.96
4046,-52.96
4047,-52.97
4048,-52.98
4049,-52.99
4050,-53.00
4051,-53.01
4052,-53.02
4053,-53.02
4054,-53.01
4055,-52.99
4056,-52.97
4057,-52.94
4058,-52.90
4059,-52.86
4060,-52.83
4061,-52.82
4062,-52.82
4063,-52.82
4064,-52.82
4065,-52.85
4066,-52.92
4067,-53.00
4068,-53.07
4069,-53.14
4070,-53.22
4071,-53.31
4072,-53.40
4073,-53.46
4074,-53.49
4075,-53.50
4076,-53.49
4077,-53.45
4078,-53.42
4079,-53.37
4080,-53.30
4081,-53.20
4082,-53.11
4083,-53.03
4084,-52.97
4085,-52.93
4086,-52.91
4087,-52.89
4088,-52.91
4089,-52.94
4090,-53.02
4091,-53.12
4092,-53.23
4093,-53.35
4094,-53.47
4095,-53.59
4096,-53.71
4097,-53.83
4098,-53.94
4099,-54.03
4100,-54.11
4101,-54.16
4102,-54.21
4103,-54.25
4104,-54.28
4105,-54.31
4106,-54.34
4107,-54.37
4108,-54.41
4109,-54.44
4110,-54.49
4111,-54.54
4112,-54.58
4113,-54.62
4114,-54.67
4115,-54.71
4116,-54.73
4117,-54.75
4118,-54.78
4119,-54.81
4120,-54.84
4121,-54.86
4122,-54.87
4123,-54.90
4124,-54.95
4125,-55.00
4126,-55.04
4127,-55.09
4128,-55.15
4129,-55.22
4130,-55.29
4131,-55.36
4132,-55.43
4133,-55.50
4134,-55.58
4135,-55.64
4136,-55.71
4137,-55.76
4138,-55.82
4139,-55.87
4140,-55.92
4141,-55.95
4142,-55.99
4143,-56.03
4144,-56.09
4145,-56.14
4146,-56.20
4147,-56.24
4148,-56.30
4149,-56.37
4150,-56.45
4151,-56.52
4152,-56.59
4153,-56.66
4154,-56.72
4155,-56.77
4156,-56.81
4157,-56.86
4158,-56.91
4159,-56.94
4160,-56.95
4161,-56.95
4162,-56.94
4163,-56.91
4164,-56.87
4165,-56.84
4166,-56.82
4167,-56.79
4168,-56.74
4169,-56.68
4170,-56.63
4171,-56.59
4172,-56.55
4173,-56.50
4174,-56.45
4175,-56.39
4176,-56.34
4177,-56.30
4178,-56.25
4179,-56.20
4180,-56.14
4181,-56.09
4182,-56.05
4183,-56.03
4184,-56.03
4185,-56.05
4186,-56.06
4187,-56.09
4188,-56.13
4189,-56.17
4190,-56.21
4191,-56.24
4192,-56.27
4193,-56.27
4194,-56.26
4195,-56.22
4196,-56.16
4197,-56.08
4198,-55.98
4199,-55.85
4200,-55.71
4201,-55.55
4202,-55.39
4203,-55.24
4204,-55.09
4205,-54.97
4206,-54.87
4207,-54.79
4208,-54.74
4209,-54.73
4210,-54.75
4211,-54.79
4212,-54.86
4213,-54.94
4214,-55.06
4215,-55.18
4216,-55.30
4217,-55.42
4218,-55.53
4219,-55.65
4220,-55.75
4221,-55.84
4222,-55.91
4223,-55.95
4224,-56.00
4225,-56.04
4226,-56.06
4227,-56.06
4228,-56.05
4229,-56.03
4230,-56.00
4231,-55.97
4232,-55.94
4233,-55.90
4234,-55.85
4235,-55.80
4236,-55.74
4237,-55.67
4238,-55.60
4239,-55.53
4240,-55.46
4241,-55.40
4242,-55.33
4243,-55.26
4244,-55.18
4245,-55.11
4246,-55.05
4247,-54.99
4248,-54.93
4249,-54.86
4250,-54.79
4251,-54.75
4252,-54.70
4253,-54.65
4254,-54.60
4255,-54.55
4256,-54.50
4257,-54.47
4258,-54.42
4259,-54.37
4260,-54.33
4261,-54.30
4262,-54.27
4263,-54.23
4264,-54.19
4265,-54.15
4266,-54.10
4267,-54.04
4268,-53.97
4269,-53.92
4270,-53.87
4271,-53.83
4272,-53.78
4273,-53.72
4274,-53.67
4275,-53.64
4276,-53.62
4277,-53.60
4278,-53.59
4279,-53.58
4280,-53.56
4281,-53.56
4282,-53.56
4283,-53.57
4284,-53.57
4285,-53.57
4286,-53.57
4287,-53.57
4288,-53.57
4289,-53.56
4290,-53.55
4291,-53.55
4292,-53.56
4293,-53.57
4294,-53.58
4295,-53.60
4296,-53.63
4297,-53.66
4298,-53.69
4299,-53.72
4300,-53.74
4301,-53.76
4302,-53.78
4303,-53.79
4304,-53.79
4305,-53.77
4306,-53.74
4307,-53.71
4308,-53.68
4309,-53.64
4310,-53.58
4311,-53.52
4312,-53.47
4313,-53.42
4314,-53.37
4315,-53.31
4316,-53.24
4317,-53.17
4318,-53.10
4319,-53.03
4320,-52.97
4321,-52.91
4322,-52.84
4323,-52.79
4324,-52.74
4325,-52.71
4326,-52.69
4327,-52.68
4328,-52.69
4329,-52.73
4330,-52.80
4331,-52.88
4332,-52.99
4333,-53.13
4334,-53.27
4335,-53.42
4336,-53.56
4337,-53.70
4338,-53.84
4339,-53.97
4340,-54.09
4341,-54.19
4342,-54.26
4343,-54.31
4344,-54.35
4345,-54.36
4346,-54.36
4347,-54.35
4348,-54.35
4349,-54.35
4350,-54.35
4351,-54.36
4352,-54.38
4353,-54.42
4354,-54.47
4355,-54.52
4356,-54.57
4357,-54.62
4358,-54.67
4359,-54.72
4360,-54.76
4361,-54.78
4362,-54.79
4363,-54.79
4364,-54.78
4365,-54.77
4366,-54.76
4367,-54.75
4368,-54.74
4369,-54.75
4370,-54.78
4371,-54.82
4372,-54.87
4373,-54.93
4374,-55.00
4375,-55.08
4376,-55.16
4377,-55.25
4378,-55.35
4379,-55.45
4380,-55.54
4381,-55.62
4382,-55.70
4383,-55.77
4384,-55.85
4385,-55.93
4386,-56.03
4387,-56.12
4388,-56.22
4389,-56.32
4390,-56.44
4391,-56.56
4392,-56.69
4393,-56.78
4394,-56.87
4395,-56.95
4396,-57.02
4397,-57.07
4398,-57.10
4399,-57.12
4400,-57.13
4401,-57.13
4402,-57.13
4403,-57.13
4404,-57.12
4405,-57.11
4406,-57.10
4407,-57.10
4408,-57.10
4409,-57.10
4410,-57.07
4411,-57.06
4412,-57.04
4413,-57.02
4414,-56.99
4415,-56.95
4416,-56.91
4417,-56.88
4418,-56.85
4419,-56.82
4420,-56.80
4421,-56.79
4422,-56.78
4423,-56.80
4424,-56.82
4425,-56.86
4426,-56.91
4427,-56.95
4428,-56.99
4429,-57.04
4430,-57.09
4431,-57.12
4432,-57.13
4433,-57.14
4434,-57.15
4435,-57.14
4436,-57.11
4437,-57.06
4438,-56.99
4439,-56.93
4440,-56.84
4441,-56.74
4442,-56.63
4443,-56.53
4444,-56.45
4445,-56.38
4446,-56.32
4447,-56.28
4448,-56.27
4449,-56.29
4450,-56.33
4451,-56.41
4452,-56.50
4453,-56.62
4454,-56.76
4455,-56.90
4456,-57.03
4457,-57.16
4458,-57.28
4459,-57.39
4460,-57.50
4461,-57.57
4462,-57.62
4463,-57.65
4464,-57.67
4465,-57.68
4466,-57.67
4467,-57.64
4468,-57.60
4469,-57.56
4470,-57.52
4471,-57.47
4472,-57.42
4473,-57.36
4474,-57.29
4475,-57.22
4476,-57.15
4477,-57.10
4478,-57.03
4479,-56.96
4480,-56.89
4481,-56.82
4482,-56.75
4483,-56.66
4484,-56.56
4485,-56.45
4486,-56.33
4487,-56.22
4488,-56.08
4489,-55.95
4490,-55.80
4491,-55.66
4492,-55.53
4493,-55.40
4494,-55.28
4495,-55.17
4496,-55.07
4497,-55.00
4498,-54.93
4499,-54.89
4500,-54.84
4501,-54.80
4502,-54.77
4503,-54.74
4504,-54.70
4505,-54.65
4506,-54.61
4507,-54.57
4508,-54.52
4509,-54.46
4510,-54.39
4511,-54.34
4512,-54.28
4513,-54.23
4514,-54.18
4515,-54.13
4516,-54.09
4517,-54.05
4518,-54.00
4519,-53.96
4520,-53.91
4521,-53.88
4522,-53.85
4523,-53.83
4524,-53.80
4525,-53.78
4526,-53.77
4527,-53.76
4528,-53.74
4529,-53.73
4530,-53.74
4531,-53.75
4532,-53.78
4533,-53.81
4534,-53.86
4535,-53.90
4536,-53.94
4537,-53.97
4538,-54.02
4539,-54.07
4540,-54.14
4541,-54.19
4542,-54.24
4543,-54.28
4544,-54.32
4545,-54.35
4546,-54.38
4547,-54.41
4548,-54.44
4549,-54.47
4550,-54.50
4551,-54.53
4552,-54.56
4553,-54.59
4554,-54.62
4555,-54.65
4556,-54.68
4557,-54.69
4558,-54.71
4559,-54.75
4560,-54.78
4561,-54.81
4562,-54.83
4563,-54.84
4564,-54.85
4565,-54.86
4566,-54.86
4567,-54.83
4568,-54.82
4569,-54.82
4570,-54.82
4571,-54.84
4572,-54.85
4573,-54.87
4574,-54.90
4575,-54.93
4576,-55.00
4577,-55.07
4578,-55.17
4579,-55.27
4580,-55.37
4581,-55.48
4582,-55.59
4583,-55.69
4584,-55.78
4585,-55.85
4586,-55.90
4587,-55.93
4588,-55.94
4589,-55.94
4590,-55.92
4591,-55.88
4592,-55.83
4593,-55.78
4594,-55.73
4595,-55.66
4596,-55.61
4597,-55.57
4598,-55.54
4599,-55.52
4600,-55.51
4601,-55.52
4602,-55.55
4603,-55.59
4604,-55.64
4605,-55.70
4606,-55.77
4607,-55.84
4608,-55.91
4609,-55.98
4610,-56.05
4611,-56.11
4612,-56.16
4613,-56.18
4614,-56.20
4615,-56.20
4616,-56.19
4617,-56.17
4618,-56.17
4619,-56.18
4620,-56.20
4621,-56.24
4622,-56.30
4623,-56.38
4624,-56.48
4625,-56.60
4626,-56.74
4627,-56.89
4628,-57.04
4629,-57.19
4630,-57.33
4631,-57.47
4632,-57.61
4633,-57.72
4634,-57.79
4635,-57.84
4636,-57.88
4637,-57.91
4638,-57.92
4639,-57.90
4640,-57.86
4641,-57.81
4642,-57.74
4643,-57.67
4644,-57.58
4645,-57.49
4646,-57.39
4647,-57.28
4648,-57.17
4649,-57.07
4650,-56.97
4651,-56.88
4652,-56.77
4653,-56.68
4654,-56.58
4655,-56.49
4656,-56.41
4657,-56.33
4658,-56.26
4659,-56.20
4660,-56.14
4661,-56.08
4662,-56.03
4663,-55.99
4664,-55.96
4665,-55.94
4666,-55.93
4667,-55.94
4668,-55.96
4669,-56.00
4670,-56.03
4671,-56.07
4672,-56.11
4673,-56.16
4674,-56.19
4675,-56.22
4676,-56.23
4677,-56.24
4678,-56.23
4679,-56.21
4680,-56.16
4681,-56.10
4682,-56.02
4683,-55.94
4684,-55.85
4685,-55.76
4686,-55.67
4687,-55.59
4688,-55.52
4689,-55.47
4690,-55.40
4691,-55.36
4692,-55.33
4693,-55.33
4694,-55.35
4695,-55.37
4696,-55.40
4697,-55.44
4698,-55.48
4699,-55.54
4700,-55.58
4701,-55.61
4702,-55.63
4703,-55.64
4704,-55.63
4705,-55.59
4706,-55.52
4707,-55.44
4708,-55.35
4709,-55.25
4710,-55.11
4711,-54.95
4712,-54.78
4713,-54.63
4714,-54.50
4715,-54.37
4716,-54.25
4717,-54.15
4718,-54.07
4719,-54.03
4720,-54.00
4721,-53.99
4722,-53.98
4723,-53.99
4724,-54.00
4725,-54.02
4726,-54.03
4727,-54.02
4728,-54.00
4729,-53.97
4730,-53.92
4731,-53.87
4732,-53.81
4733,-53.74
4734,-53.67
4735,-53.59
4736,-53.52
4737,-53.46
4738,-53.41
4739,-53.38
4740,-53.33
4741,-53.28
4742,-53.23
4743,-53.18
4744,-53.13
4745,-53.07
4746,-53.01
4747,-52.95
4748,-52.88
4749,-52.80
4750,-52.72
4751,-52.65
4752,-52.59
4753,-52.54
4754,-52.50
4755,-52.48
4756,-52.49
4757,-52.51
4758,-52.53
4759,-52.56
4760,-52.60
4761,-52.64
4762,-52.67
4763,-52.69
4764,-52.67
4765,-52.65
4766,-52.63
4767,-52.61
4768,-52.58
4769,-52.55
4770,-52.50
4771,-52.47
4772,-52.45
4773,-52.45
4774,-52.47
4775,-52.50
4776,-52.54
4777,-52.58
4778,-52.62
4779,-52.66
4780,-52.69
4781,-52.72
4782,-52.73
4783,-52.74
4784,-52.74
4785,-52.73
4786,-52.71
4787,-52.68
4788,-52.65
4789,-52.63
4790,-52.62
4791,-52.61
4792,-52.60
4793,-52.60
4794,-52.60
4795,-52.60
4796,-52.60
4797,-52.59
4798,-52.58
4799,-52.57
4800,-52.55
4801,-52.54
4802,-52.51
4803,-52.47
4804,-52.44
4805,-52.42
4806,-52.42
4807,-52.44
4808,-52.48
4809,-52.54
4810,-52.62
4811,-52.72
4812,-52.84
4813,-52.99
4814,-53.16
4815,-53.33
4816,-53.50
4817,-53.66
4818,-53.81
4819,-53.94
4820,-54.03
4821,-54.09
4822,-54.13
4823,-54.16
4824,-54.17
4825,-54.16
4826,-54.14
4827,-54.10
4828,-54.08
4829,-54.07
4830,-54.07
4831,-54.09
4832,-54.13
4833,-54.17
4834,-54.24
4835,-54.32
4836,-54.41
4837,-54.51
4838,-54.61
4839,-54.71
4840,-54.78
4841,-54.84
4842,-54.89
4843,-54.93
4844,-54.95
4845,-54.95
4846,-54.94
4847,-54.92
4848,-54.88
4849,-54.84
4850,-54.82
4851,-54.79
4852,-54.76
4853,-54.74
4854,-54.72
4855,-54.73
4856,-54.75
4857,-54.78
4858,-54.83
4859,-54.90
4860,-54.98
4861,-55.07
4862,-55.17
4863,-55.28
4864,-55.40
4865,-55.51
4866,-55.65
4867,-55.78
4868,-55.92
4869,-56.05
4870,-56.18
4871,-56.31
4872,-56.43
4873,-56.54
4874,-56.64
4875,-56.71
4876,-56.77
4877,-56.81
4878,-56.85
4879,-56.86
4880,-56.86
4881,-56.83
4882,-56.80
4883,-56.77
4884,-56.75
4885,-56.72
4886,-56.70
4887,-56.69
4888,-56.69
4889,-56.71
4890,-56.74
4891,-56.78
4892,-56.84
4893,-56.89
4894,-56.96
4895,-57.02
4896,-57.07
4897,-57.12
4898,-57.16
4899,-57.19
4900,-57.22
4901,-57.24
4902,-57.25
4903,-57.26
4904,-57.27
4905,-57.25
4906,-57.23
4907,-57.20
4908,-57.17
4909,-57.14
4910,-57.10
4911,-57.05
4912,-57.00
4913,-56.95
4914,-56.89
4915,-56.82
4916,-56.76
4917,-56.71
4918,-56.67
4919,-56.63
4920,-56.59
4921,-56.59
4922,-56.59
4923,-56.61
4924,-56.64
4925,-56.70
4926,-56.77
4927,-56.86
4928,-56.95
4929,-57.04
4930,-57.13
4931,-57.21
4932,-57.28
4933,-57.34
4934,-57.39
4935,-57.43
4936,-57.46
4937,-57.48
4938,-57.49
4939,-57.50
4940,-57.50
4941,-57.49
4942,-57.48
4943,-57.47
4944,-57.46
4945,-57.45
4946,-57.43
4947,-57.42
4948,-57.39
4949,-57.36
4950,-57.32
4951,-57.26
4952,-57.20
4953,-57.14
4954,-57.06
4955,-56.99
4956,-56.91
4957,-56.83
4958,-56.74
4959,-56.66
4960,-56.56
4961,-56.48
4962,-56.39
4963,-56.30
4964,-56.20
4965,-56.10
4966,-56.01
4967,-55.92
4968,-55.82
4969,-55.73
4970,-55.63
4971,-55.54
4972,-55.45
4973,-55.36
4974,-55.28
4975,-55.21
4976,-55.15
4977,-55.10
4978,-55.06
4979,-55.03
4980,-55.02
4981,-55.02
4982,-55.02
4983,-55.02
4984,-55.03
4985,-55.04
4986,-55.04
4987,-55.06
4988,-55.07
4989,-55.09
4990,-55.11
4991,-55.12
4992,-55.12
4993,-55.12
4994,-55.12
4995,-55.11
4996,-55.09
4997,-55.06
4998,-55.02
4999,-54.96
5000,-54.88
5001,-54.79
5002,-54.69
5003,-54.59
5004,-54.50
5005,-54.41
5006,-54.32
5007,-54.25
5008,-54.21
5009,-54.21
5010,-54.25
5011,-54.31
5012,-54.39
5013,-54.49
5014,-54.61
5015,-54.73
5016,-54.87
5017,-55.00
5018,-55.11
5019,-55.18
5020,-55.22
5021,-55.24
5022,-55.24
5023,-55.21
5024,-55.15
5025,-55.07
5026,-54.98
5027,-54.89
5028,-54.80
5029,-54.72
5030,-54.65
5031,-54.60
5032,-54.57
5033,-54.56
5034,-54.57
5035,-54.58
5036,-54.59
5037,-54.60
5038,-54.61
5039,-54.65
5040,-54.68
5041,-54.70
5042,-54.70
5043,-54.70
5044,-54.71
5045,-54.73
5046,-54.75
5047,-54.76
5048,-54.77
5049,-54.80
5050,-54.85
5051,-54.90
5052,-54.95
5053,-55.01
5054,-55.08
5055,-55.15
5056,-55.21
5057,-55.27
5058,-55.33
5059,-55.36
5060,-55.38
5061,-55.38
5062,-55.39
5063,-55.39
5064,-55.39
5065,-55.37
5066,-55.36
5067,-55.35
5068,-55.36
5069,-55.37
5070,-55.40
5071,-55.44
5072,-55.48
5073,-55.52
5074,-55.56
5075,-55.60
5076,-55.64
5077,-55.68
5078,-55.71
5079,-55.73
5080,-55.76
5081,-55.79
5082,-55.83
5083,-55.86
5084,-55.90
5085,-55.94
5086,-56.00
5087,-56.06
5088,-56.12
5089,-56.20
5090,-56.27
5091,-56.34
5092,-56.39
5093,-56.43
5094,-56.48
5095,-56.51
5096,-56.54
5097,-56.55
5098,-56.55
5099,-56.56
5100,-56.58
5101,-56.60
5102,-56.62
5103,-56.65
5104,-56.69
5105,-56.74
5106,-56.80
5107,-56.87
5108,-56.95
5109,-57.04
5110,-57.13
5111,-57.20
5112,-57.25
5113,-57.30
5114,-57.35
5115,-57.39
5116,-57.41
5117,-57.41
5118,-57.40
5119,-57.38
5120,-57.34
5121,-57.29
5122,-57.24
5123,-57.19
5124,-57.14
5125,-57.09
5126,-57.04
5127,-56.99
5128,-56.95
5129,-56.91
5130,-56.87
5131,-56.84
5132,-56.81
5133,-56.80
5134,-56.77
5135,-56.76
5136,-56.74
5137,-56.72
5138,-56.69
5139,-56.67
5140,-56.64
5141,-56.61
5142,-56.56
5143,-56.50
5144,-56.44
5145,-56.39
5146,-56.34
5147,-56.29
5148,-56.22
5149,-56.16
5150,-56.11
5151,-56.07
5152,-56.03
5153,-55.99
5154,-55.96
5155,-55.94
5156,-55.92
5157,-55.89
5158,-55.86
5159,-55.83
5160,-55.80
5161,-55.77
5162,-55.74
5163,-55.71
5164,-55.68
5165,-55.67
5166,-55.68
5167,-55.70
5168,-55.73
5169,-55.75
5170,-55.81
5171,-55.89
5172,-55.98
5173,-56.07
5174,-56.15
5175,-56.23
5176,-56.32
5177,-56.39
5178,-56.45
5179,-56.49
5180,-56.53
5181,-56.56
5182,-56.57
5183,-56.56
5184,-56.54
5185,-56.52
5186,-56.49
5187,-56.45
5188,-56.38
5189,-56.30
5190,-56.24
5191,-56.18
5192,-56.12
5193,-56.06
5194,-56.00
5195,-55.94
5196,-55.89
5197,-55.85
5198,-55.81
5199,-55.78
5200,-55.73
5201,-55.70
5202,-55.65
5203,-55.61
5204,-55.55
5205,-55.49
5206,-55.42
5207,-55.34
5208,-55.26
5209,-55.16
5210,-55.08
5211,-55.00
5212,-54.92
5213,-54.84
5214,-54.76
5215,-54.69
5216,-54.64
5217,-54.62
5218,-54.59
5219,-54.55
5220,-54.50
5221,-54.45
5222,-54.40
5223,-54.37
5224,-54.33
5225,-54.28
5226,-54.21
5227,-54.14
5228,-54.08
5229,-54.03
5230,-53.99
5231,-53.95
5232,-53.92
5233,-53.91
5234,-53.91
5235,-53.92
5236,-53.94
5237,-53.96
5238,-53.98
5239,-54.00
5240,-54.02
5241,-54.03
5242,-54.03
5243,-54.03
5244,-54.03
5245,-54.02
5246,-54.00
5247,-53.99
5248,-53.99
5249,-54.00
5250,-54.02
5251,-54.05
5252,-54.09
5253,-54.13
5254,-54.18
5255,-54.25
5256,-54.32
5257,-54.38
5258,-54.43
5259,-54.46
5260,-54.47
5261,-54.46
5262,-54.43
5263,-54.38
5264,-54.31
5265,-54.22
5266,-54.11
5267,-53.99
5268,-53.88
5269,-53.77
5270,-53.65
5271,-53.54
5272,-53.45
5273,-53.38
5274,-53.33
5275,-53.28
5276,-53.23
5277,-53.22
5278,-53.22
5279,-53.23
5280,-53.23
5281,-53.23
5282,-53.25
5283,-53.27
5284,-53.30
5285,-53.32
5286,-53.35
5287,-53.39
5288,-53.43
5289,-53.47
5290,-53.52
5291,-53.58
5292,-53.64
5293,-53.71
5294,-53.80
5295,-53.88
5296,-53.97
5297,-54.06
5298,-54.16
5299,-54.24
5300,-54.32
5301,-54.39
5302,-54.46
5303,-54.53
5304,-54.60
5305,-54.65
5306,-54.71
5307,-54.77
5308,-54.84
5309,-54.92
5310,-55.01
5311,-55.10
5312,-55.18
5313,-55.26
5314,-55.34
5315,-55.42
5316,-55.49
5317,-55.54
5318,-55.57
5319,-55.58
5320,-55.57
5321,-55.55
5322,-55.53
5323,-55.51
5324,-55.48
5325,-55.44
5326,-55.40
5327,-55.38
5328,-55.37
5329,-55.37
5330,-55.39
5331,-55.42
5332,-55.46
5333,-55.51
5334,-55.56
5335,-55.62
5336,-55.69
5337,-55.77
5338,-55.85
5339,-55.92
5340,-55.98
5341,-56.03
5342,-56.08
5343,-56.12
5344,-56.15
5345,-56.18
5346,-56.20
5347,-56.20
5348,-56.22
5349,-56.25
5350,-56.29
5351,-56.33
5352,-56.37
5353,-56.43
5354,-56.52
5355,-56.61
5356,-56.72
5357,-56.81
5358,-56.92
5359,-57.03
5360,-57.14
5361,-57.23
5362,-57.29
5363,-57.33
5364,-57.36
5365,-57.38
5366,-57.39
5367,-57.39
5368,-57.38
5369,-57.37
5370,-57.36
5371,-57.35
5372,-57.34
5373,-57.34
5374,-57.35
5375,-57.36
5376,-57.37
5377,-57.38
5378,-57.39
5379,-57.40
5380,-57.41
5381,-57.42
5382,-57.42
5383,-57.40
5384,-57.36
5385,-57.32
5386,-57.28
5387,-57.24
5388,-57.19
5389,-57.14
5390,-57.08
5391,-57.03
5392,-56.98
5393,-56.93
5394,-56.88
5395,-56.84
5396,-56.81
5397,-56.79
5398,-56.78
5399,-56.77
5400,-56.77
5401,-56.77
5402,-56.77
5403,-56.77
5404,-56.77
5405,-56.79
5406,-56.82
5407,-56.84
5408,-56.86
5409,-56.89
5410,-56.92
5411,-56.95
5412,-56.99
5413,-57.02
5414,-57.07
5415,-57.12
5416,-57.17
5417,-57.23
5418,-57.30
5419,-57.35
5420,-57.40
5421,-57.44
5422,-57.49
5423,-57.52
5424,-57.55
5425,-57.57
5426,-57.59
5427,-57.60
5428,-57.59
5429,-57.56
5430,-57.49
5431,-57.41
5432,-57.31
5433,-57.19
5434,-57.06
5435,-56.92
5436,-56.77
5437,-56.63
5438,-56.47
5439,-56.33
5440,-56.18
5441,-56.04
5442,-55.91
5443,-55.81
5444,-55.70
5445,-55.59
5446,-55.49
5447,-55.40
5448,-55.32
5449,-55.24
5450,-55.15
5451,-55.08
5452,-55.00
5453,-54.95
5454,-54.89
5455,-54.85
5456,-54.80
5457,-54.77
5458,-54.75
5459,-54.75
5460,-54.75
5461,-54.76
5462,-54.77
5463,-54.78
5464,-54.79
5465,-54.79
5466,-54.78
5467,-54.76
5468,-54.73
5469,-54.69
5470,-54.64
5471,-54.61
5472,-54.57
5473,-54.54
5474,-54.51
5475,-54.49
5476,-54.49
5477,-54.50
5478,-54.52
5479,-54.54
5480,-54.56
5481,-54.58
5482,-54.59
5483,-54.59
5484,-54.57
5485,-54.55
5486,-54.51
5487,-54.46
5488,-54.39
5489,-54.30
5490,-54.20
5491,-54.11
5492,-54.03
5493,-53.94
5494,-53.84
5495,-53.74
5496,-53.64
5497,-53.57
5498,-53.50
5499,-53.44
5500,-53.38
5501,-53.32
5502,-53.27
5503,-53.24
5504,-53.23
5505,-53.22
5506,-53.22
5507,-53.24
5508,-53.27
5509,-53.31
5510,-53.36
5511,-53.43
5512,-53.52
5513,-53.61
5514,-53.69
5515,-53.77
5516,-53.85
5517,-53.93
5518,-54.00
5519,-54.04
5520,-54.06
5521,-54.07
5522,-54.06
5523,-54.03
5524,-53.99
5525,-53.94
5526,-53.88
5527,-53.82
5528,-53.77
5529,-53.72
5530,-53.70
5531,-53.70
5532,-53.72
5533,-53.76
5534,-53.83
5535,-53.92
5536,-54.03
5537,-54.14
5538,-54.27
5539,-54.39
5540,-54.50
5541,-54.61
5542,-54.72
5543,-54.82
5544,-54.90
5545,-54.94
5546,-54.98
5547,-55.02
5548,-55.06
5549,-55.09
5550,-55.11
5551,-55.13
5552,-55.15
5553,-55.18
5554,-55.22
5555,-55.26
5556,-55.30
5557,-55.34
5558,-55.38
5559,-55.42
5560,-55.46
5561,-55.48
5562,-55.51
5563,-55.54
5564,-55.58
5565,-55.60
5566,-55.63
5567,-55.65
5568,-55.67
5569,-55.70
5570,-55.73
5571,-55.76
5572,-55.80
5573,-55.83
5574,-55.87
5575,-55.91
5576,-55.96
5577,-56.01
5578,-56.06
5579,-56.11
5580,-56.16
5581,-56.21
5582,-56.25
5583,-56.29
5584,-56.34
5585,-56.38
5586,-56.43
5587,-56.47
5588,-56.51
5589,-56.56
5590,-56.62
5591,-56.68
5592,-56.74
5593,-56.80
5594,-56.86
5595,-56.93
5596,-56.99
5597,-57.03
5598,-57.06
5599,-57.07
5600,-57.06
5601,-57.03
5602,-56.98
5603,-56.91
5604,-56.83
5605,-56.74
5606,-56.63
5607,-56.52
5608,-56.42
5609,-56.33
5610,-56.25
5611,-56.20
5612,-56.16
5613,-56.15
5614,-56.15
5615,-56.16
5616,-56.18
5617,-56.20
5618,-56.22
5619,-56.23
5620,-56.23
5621,-56.23
5622,-56.23
5623,-56.20
5624,-56.18
5625,-56.16
5626,-56.15
5627,-56.15
5628,-56.15
5629,-56.15
5630,-56.16
5631,-56.17
5632,-56.18
5633,-56.19
5634,-56.19
5635,-56.18
5636,-56.16
5637,-56.13
5638,-56.09
5639,-56.03
5640,-55.95
5641,-55.86
5642,-55.77
5643,-55.69
5644,-55.62
5645,-55.55
5646,-55.49
5647,-55.46
5648,-55.46
5649,-55.48
5650,-55.51
5651,-55.57
5652,-55.63
5653,-55.71
5654,-55.80
5655,-55.87
5656,-55.92
5657,-55.96
5658,-55.99
5659,-56.00
5660,-55.97
5661,-55.91
5662,-55.84
5663,-55.76
5664,-55.67
5665,-55.57
5666,-55.47
5667,-55.38
5668,-55.30
5669,-55.26
5670,-55.23
5671,-55.23
5672,-55.24
5673,-55.25
5674,-55.27
5675,-55.30
5676,-55.33
5677,-55.35
5678,-55.36
5679,-55.36
5680,-55.35
5681,-55.32
5682,-55.28
5683,-55.23
5684,-55.16
5685,-55.10
5686,-55.03
5687,-54.97
5688,-54.91
5689,-54.84
5690,-54.77
5691,-54.70
5692,-54.63
5693,-54.57
5694,-54.52
5695,-54.48
5696,-54.45
5697,-54.44
5698,-54.42
5699,-54.40
5700,-54.38
5701,-54.36
5702,-54.34
5703,-54.33
5704,-54.32
5705,-54.30
5706,-54.27
5707,-54.23
5708,-54.18
5709,-54.12
5710,-54.05
5711,-53.99
5712,-53.92
5713,-53.86
5714,-53.80
5715,-53.74
5716,-53.69
5717,-53.66
5718,-53.63
5719,-53.61
5720,-53.58
5721,-53.56
5722,-53.54
5723,-53.52
5724,-53.50
5725,-53.49
5726,-53.46
5727,-53.45
5728,-53.42
5729,-53.40
5730,-53.39
5731,-53.39
5732,-53.40
5733,-53.42
5734,-53.45
5735,-53.49
5736,-53.54
5737,-53.60
5738,-53.67
5739,-53.74
5740,-53.81
5741,-53.86
5742,-53.91
5743,-53.95
5744,-53.99
5745,-54.02
5746,-54.03
5747,-54.02
5748,-54.01
5749,-53.99
5750,-53.98
5751,-53.95
5752,-53.91
5753,-53.88
5754,-53.86
5755,-53.84
5756,-53.82
5757,-53.80
5758,-53.78
5759,-53.76
5760,-53.74
5761,-53.71
5762,-53.67
5763,-53.65
5764,-53.62
5765,-53.60
5766,-53.59
5767,-53.59
5768,-53.61
5769,-53.65
5770,-53.69
5771,-53.74
5772,-53.81
5773,-53.90
5774,-54.00
5775,-54.11
5776,-54.23
5777,-54.34
5778,-54.46
5779,-54.57
5780,-54.68
5781,-54.78
5782,-54.87
5783,-54.94
5784,-55.02
5785,-55.10
5786,-55.18
5787,-55.25
5788,-55.31
5789,-55.36
5790,-55.40
5791,-55.44
5792,-55.47
5793,-55.50
5794,-55.50
5795,-55.49
5796,-55.47
5797,-55.45
5798,-55.43
5799,-55.40
5800,-55.36
5801,-55.32
5802,-55.28
5803,-55.26
5804,-55.27
5805,-55.29
5806,-55.31
5807,-55.34
5808,-55.39
5809,-55.46
5810,-55.54
5811,-55.62
5812,-55.70
5813,-55.79
5814,-55.87
5815,-55.94
5816,-56.00
5817,-56.05
5818,-56.10
5819,-56.15
5820,-56.19
5821,-56.22
5822,-56.25
5823,-56.27
5824,-56.31
5825,-56.35
5826,-56.40
5827,-56.47
5828,-56.55
5829,-56.64
5830,-56.74
5831,-56.84
5832,-56.94
5833,-57.03
5834,-57.14
5835,-57.24
5836,-57.33
5837,-57.41
5838,-57.48
5839,-57.55
5840,-57.61
5841,-57.66
5842,-57.70
5843,-57.74
5844,-57.78
5845,-57.83
5846,-57.89
5847,-57.93
5848,-57.98
5849,-58.02
5850,-58.06
5851,-58.10
5852,-58.13
5853,-58.15
5854,-58.16
5855,-58.16
5856,-58.15
5857,-58.15
5858,-58.16
5859,-58.17
5860,-58.18
5861,-58.19
5862,-58.21
5863,-58.25
5864,-58.30
5865,-58.35
5866,-58.40
5867,-58.45
5868,-58.50
5869,-58.56
5870,-58.62
5871,-58.67
5872,-58.70
5873,-58.72
5874,-58.75
5875,-58.76
5876,-58.77
5877,-58.76
5878,-58.75
5879,-58.74
5880,-58.72
5881,-58.70
5882,-58.69
5883,-58.69
5884,-58.69
5885,-58.68
5886,-58.67
5887,-58.67
5888,-58.67
5889,-58.67
5890,-58.67
5891,-58.67
5892,-58.67
5893,-58.68
5894,-58.70
5895,-58.72
5896,-58.73
5897,-58.73
5898,-58.74
5899,-58.77
5900,-58.80
5901,-58.84
5902,-58.87
5903,-58.91
5904,-58.95
5905,-58.98
5906,-59.00
5907,-59.02
5908,-59.03
5909,-59.04
5910,-59.02
5911,-58.99
5912,-58.94
5913,-58.87
5914,-58.79
5915,-58.70
5916,-58.60
5917,-58.48
5918,-58.35
5919,-58.21
5920,-58.06
5921,-57.92
5922,-57.76
5923,-57.61
5924,-57.43
5925,-57.27
5926,-57.10
5927,-56.96
5928,-56.81
5929,-56.68
5930,-56.54
5931,-56.41
5932,-56.29
5933,-56.20
5934,-56.10
5935,-56.02
5936,-55.93
5937,-55.87
5938,-55.80
5939,-55.74
5940,-55.69
5941,-55.65
5942,-55.62
5943,-55.61
5944,-55.58
5945,-55.56
5946,-55.56
5947,-55.58
5948,-55.60
5949,-55.61
5950,-55.63
5951,-55.65
5952,-55.69
5953,-55.72
5954,-55.75
5955,-55.78
5956,-55.80
5957,-55.83
5958,-55.85
5959,-55.86
5960,-55.85
5961,-55.83
5962,-55.81
5963,-55.79
5964,-55.76
5965,-55.72
5966,-55.67
5967,-55.62
5968,-55.57
5969,-55.53
5970,-55.50
5971,-55.48
5972,-55.47
5973,-55.47
5974,-55.48
5975,-55.50
5976,-55.53
5977,-55.56
5978,-55.59
5979,-55.62
5980,-55.65
5981,-55.67
5982,-55.69
5983,-55.71
5984,-55.71
5985,-55.70
5986,-55.70
5987,-55.69
5988,-55.69
5989,-55.68
5990,-55.67
5991,-55.67
5992,-55.68
5993,-55.68
5994,-55.67
5995,-55.66
5996,-55.65
5997,-55.65
5998,-55.66
5999,-55.67
6000,-55.68
6001,-55.69
6002,-55.71
6003,-55.73
6004,-55.75
6005,-55.76
6006,-55.79
6007,-55.80
6008,-55.83
6009,-55.84
6010,-55.87
6011,-55.88
6012,-55.91
6013,-55.94
6014,-55.97
6015,-56.01
6016,-56.07
6017,-56.13
6018,-56.20
6019,-56.27
6020,-56.35
6021,-56.43
6022,-56.50
6023,-56.55
6024,-56.59
6025,-56.63
6026,-56.66
6027,-56.67
6028,-56.67
6029,-56.68
6030,-56.70
6031,-56.73
6032,-56.76
6033,-56.79
6034,-56.84
6035,-56.90
6036,-56.94
6037,-56.98
6038,-57.00
6039,-57.03
6040,-57.05
6041,-57.04
6042,-57.02
6043,-56.99
6044,-56.97
6045,-56.93
6046,-56.88
6047,-56.84
6048,-56.81
6049,-56.79
6050,-56.79
6051,-56.78
6052,-56.78
6053,-56.78
6054,-56.80
6055,-56.83
6056,-56.86
6057,-56.88
6058,-56.90
6059,-56.94
6060,-56.99
6061,-57.05
6062,-57.11
6063,-57.17
6064,-57.24
6065,-57.30
6066,-57.38
6067,-57.46
6068,-57.55
6069,-57.64
6070,-57.72
6071,-57.79
6072,-57.86
6073,-57.93
6074,-58.01
6075,-58.08
6076,-58.16
6077,-58.23
6078,-58.32
6079,-58.40
6080,-58.47
6081,-58.53
6082,-58.58
6083,-58.62
6084,-58.64
6085,-58.65
6086,-58.65
6087,-58.64
6088,-58.62
6089,-58.58
6090,-58.53
6091,-58.49
6092,-58.46
6093,-58.43
6094,-58.40
6095,-58.38
6096,-58.37
6097,-58.36
6098,-58.34
6099,-58.32
6100,-58.27
6101,-58.23
6102,-58.16
6103,-58.09
6104,-57.99
6105,-57.88
6106,-57.76
6107,-57.63
6108,-57.49
6109,-57.36
6110,-57.24
6111,-57.16
6112,-57.10
6113,-57.06
6114,-57.04
6115,-57.04
6116,-57.05
6117,-57.09
6118,-57.12
6119,-57.16
6120,-57.17
6121,-57.16
6122,-57.13
6123,-57.08
6124,-57.01
6125,-56.93
6126,-56.84
6127,-56.74
6128,-56.64
6129,-56.57
6130,-56.53
6131,-56.51
6132,-56.51
6133,-56.55
6134,-56.63
6135,-56.75
6136,-56.90
6137,-57.06
6138,-57.22
6139,-57.37
6140,-57.51
6141,-57.64
6142,-57.75
6143,-57.83
6144,-57.88
6145,-57.87
6146,-57.84
6147,-57.78
6148,-57.70
6149,-57.59
6150,-57.46
6151,-57.32
6152,-57.17
6153,-57.04
6154,-56.89
6155,-56.77
6156,-56.66
6157,-56.57
6158,-56.49
6159,-56.41
6160,-56.33
6161,-56.28
6162,-56.23
6163,-56.20
6164,-56.15
6165,-56.09
6166,-56.02
6167,-55.96
6168,-55.91
6169,-55.86
6170,-55.80
6171,-55.75
6172,-55.68
6173,-55.63
6174,-55.61
6175,-55.60
6176,-55.59
6177,-55.59
6178,-55.60
6179,-55.62
6180,-55.65
6181,-55.65
6182,-55.66
6183,-55.66
6184,-55.66
6185,-55.64
6186,-55.58
6187,-55.51
6188,-55.42
6189,-55.34
6190,-55.25
6191,-55.14
6192,-55.03
6193,-54.94
6194,-54.86
6195,-54.79
6196,-54.75
6197,-54.72
6198,-54.71
6199,-54.72
6200,-54.74
6201,-54.78
6202,-54.82
6203,-54.88
6204,-54.93
6205,-54.98
6206,-55.02
6207,-55.06
6208,-55.09
6209,-55.11
6210,-55.12
6211,-55.11
6212,-55.08
6213,-55.03
6214,-54.98
6215,-54.93
6216,-54.88
6217,-54.83
6218,-54.78
6219,-54.74
6220,-54.71
6221,-54.69
6222,-54.68
6223,-54.67
6224,-54.67
6225,-54.69
6226,-54.72
6227,-54.74
6228,-54.75
6229,-54.76
6230,-54.77
6231,-54.79
6232,-54.80
6233,-54.80
6234,-54.77
6235,-54.74
6236,-54.70
6237,-54.66
6238,-54.59
6239,-54.51
6240,-54.41
6241,-54.30
6242,-54.19
6243,-54.08
6244,-53.97
6245,-53.87
6246,-53.80
6247,-53.74
6248,-53.72
6249,-53.72
6250,-53.75
6251,-53.82
6252,-53.92
6253,-54.05
6254,-54.21
6255,-54.38
6256,-54.55
6257,-54.72
6258,-54.89
6259,-55.05
6260,-55.18
6261,-55.28
6262,-55.37
6263,-55.44
6264,-55.50
6265,-55.52
6266,-55.53
6267,-55.53
6268,-55.54
6269,-55.54
6270,-55.54
6271,-55.54
6272,-55.54
6273,-55.55
6274,-55.56
6275,-55.57
6276,-55.59
6277,-55.61
6278,-55.63
6279,-55.65
6280,-55.67
6281,-55.69
6282,-55.70
6283,-55.70
6284,-55.69
6285,-55.67
6286,-55.65
6287,-55.64
6288,-55.62
6289,-55.60
6290,-55.59
6291,-55.60
6292,-55.63
6293,-55.67
6294,-55.73
6295,-55.78
6296,-55.85
6297,-55.91
6298,-55.99
6299,-56.07
6300,-56.15
6301,-56.22
6302,-56.27
6303,-56.31
6304,-56.35
6305,-56.39
6306,-56.42
6307,-56.44
6308,-56.46
6309,-56.49
6310,-56.53
6311,-56.56
6312,-56.61
6313,-56.67
6314,-56.75
6315,-56.84
6316,-56.94
6317,-57.03
6318,-57.14
6319,-57.24
6320,-57.33
6321,-57.41
6322,-57.48
6323,-57.53
6324,-57.59
6325,-57.63
6326,-57.64
6327,-57.63
6328,-57.61
6329,-57.58
6330,-57.53
6331,-57.48
6332,-57.42
6333,-57.36
6334,-57.32
6335,-57.27
6336,-57.23
6337,-57.21
6338,-57.20
6339,-57.21
6340,-57.24
6341,-57.28
6342,-57.33
6343,-57.39
6344,-57.46
6345,-57.54
6346,-57.63
6347,-57.72
6348,-57.80
6349,-57.87
6350,-57.92
6351,-57.95
6352,-57.97
6353,-57.95
6354,-57.91
6355,-57.86
6356,-57.79
6357,-57.69
6358,-57.57
6359,-57.45
6360,-57.33
6361,-57.22
6362,-57.10
6363,-56.98
6364,-56.89
6365,-56.82
6366,-56.78
6367,-56.74
6368,-56.72
6369,-56.72
6370,-56.74
6371,-56.78
6372,-56.83
6373,-56.89
6374,-56.97
6375,-57.04
6376,-57.12
6377,-57.19
6378,-57.26
6379,-57.33
6380,-57.39
6381,-57.43
6382,-57.46
6383,-57.48
6384,-57.48
6385,-57.46
6386,-57.43
6387,-57.40
6388,-57.36
6389,-57.30
6390,-57.23
6391,-57.16
6392,-57.09
6393,-57.02
6394,-56.95
6395,-56.88
6396,-56.82
6397,-56.77
6398,-56.71
6399,-56.66
6400,-56.60
6401,-56.56
6402,-56.50
6403,-56.43
6404,-56.35
6405,-56.29
6406,-56.22
6407,-56.15
6408,-56.08
6409,-56.00
6410,-55.90
6411,-55.81
6412,-55.71
6413,-55.61
6414,-55.50
6415,-55.40
6416,-55.29
6417,-55.20
6418,-55.11
6419,-55.04
6420,-54.97
6421,-54.92
6422,-54.88
6423,-54.86
6424,-54.83
6425,-54.83
6426,-54.82
6427,-54.81
6428,-54.79
6429,-54.78
6430,-54.75
6431,-54.71
6432,-54.65
6433,-54.58
6434,-54.51
6435,-54.46
6436,-54.40
6437,-54.35
6438,-54.31
6439,-54.28
6440,-54.25
6441,-54.22
6442,-54.20
6443,-54.19
6444,-54.18
6445,-54.15
6446,-54.10
6447,-54.04
6448,-53.97
6449,-53.89
6450,-53.81
6451,-53.73
6452,-53.65
6453,-53.58
6454,-53.53
6455,-53.51
6456,-53.52
6457,-53.55
6458,-53.60
6459,-53.67
6460,-53.76
6461,-53.87
6462,-53.98
6463,-54.08
6464,-54.17
6465,-54.25
6466,-54.31
6467,-54.35
6468,-54.38
6469,-54.40
6470,-54.40
6471,-54.39
6472,-54.39
6473,-54.39
6474,-54.39
6475,-54.39
6476,-54.39
6477,-54.42
6478,-54.47
6479,-54.52
6480,-54.57
6481,-54.61
6482,-54.68
6483,-54.75
6484,-54.82
6485,-54.89
6486,-54.96
6487,-55.03
6488,-55.13
6489,-55.23
6490,-55.33
6491,-55.43
6492,-55.53
6493,-55.64
6494,-55.76
6495,-55.86
6496,-55.96
6497,-56.04
6498,-56.11
6499,-56.18
6500,-56.24
6501,-56.29
6502,-56.33
6503,-56.36
6504,-56.38
6505,-56.39
6506,-56.40
6507,-56.42
6508,-56.44
6509,-56.46
6510,-56.48
6511,-56.50
6512,-56.52
6513,-56.54
6514,-56.56
6515,-56.57
6516,-56.57
6517,-56.57
6518,-56.57
6519,-56.57
6520,-56.57
6521,-56.57
6522,-56.57
6523,-56.57
6524,-56.56
6525,-56.55
6526,-56.55
6527,-56.56
6528,-56.58
6529,-56.60
6530,-56.61
6531,-56.61
6532,-56.62
6533,-56.63
6534,-56.66
6535,-56.68
6536,-56.71
6537,-56.74
6538,-56.79
6539,-56.84
6540,-56.90
6541,-56.97
6542,-57.04
6543,-57.11
6544,-57.18
6545,-57.25
6546,-57.32
6547,-57.38
6548,-57.43
6549,-57.46
6550,-57.50
6551,-57.53
6552,-57.55
6553,-57.57
6554,-57.59
6555,-57.61
6556,-57.63
6557,-57.62
6558,-57.61
6559,-57.61
6560,-57.60
6561,-57.59
6562,-57.57
6563,-57.53
6564,-57.48
6565,-57.43
6566,-57.37
6567,-57.30
6568,-57.23
6569,-57.16
6570,-57.09
6571,-57.03
6572,-56.99
6573,-56.97
6574,-56.96
6575,-56.95
6576,-56.94
6577,-56.94
6578,-56.94
6579,-56.95
6580,-56.95
6581,-56.94
6582,-56.91
6583,-56.87
6584,-56.82
6585,-56.76
6586,-56.69
6587,-56.62
6588,-56.56
6589,-56.49
6590,-56.45
6591,-56.41
6592,-56.38
6593,-56.35
6594,-56.35
6595,-56.36
6596,-56.39
6597,-56.41
6598,-56.44
6599,-56.45
6600,-56.46
6601,-56.48
6602,-56.50
6603,-56.51
6604,-56.51
6605,-56.51
6606,-56.50
6607,-56.49
6608,-56.49
6609,-56.50
6610,-56.52
6611,-56.54
6612,-56.56
6613,-56.58
6614,-56.60
6615,-56.63
6616,-56.66
6617,-56.68
6618,-56.70
6619,-56.72
6620,-56.73
6621,-56.74
6622,-56.75
6623,-56.76
6624,-56.77
6625,-56.77
6626,-56.77
6627,-56.78
6628,-56.79
6629,-56.78
6630,-56.76
6631,-56.74
6632,-56.72
6633,-56.70
6634,-56.68
6635,-56.65
6636,-56.61
6637,-56.56
6638,-56.50
6639,-56.44
6640,-56.38
6641,-56.31
6642,-56.23
6643,-56.15
6644,-56.07
6645,-56.01
6646,-55.95
6647,-55.90
6648,-55.84
6649,-55.78
6650,-55.73
6651,-55.71
6652,-55.68
6653,-55.67
6654,-55.65
6655,-55.64
6656,-55.62
6657,-55.61
6658,-55.58
6659,-55.57
6660,-55.55
6661,-55.52
6662,-55.48
6663,-55.44
6664,-55.40
6665,-55.35
6666,-55.28
6667,-55.22
6668,-55.15
6669,-55.10
6670,-55.02
6671,-54.93
6672,-54.85
6673,-54.79
6674,-54.73
6675,-54.68
6676,-54.62
6677,-54.58
6678,-54.54
6679,-54.50
6680,-54.47
6681,-54.45
6682,-54.43
6683,-54.42
6684,-54.40
6685,-54.39
6686,-54.38
6687,-54.36
6688,-54.34
6689,-54.32
6690,-54.30
6691,-54.29
6692,-54.28
6693,-54.27
6694,-54.27
6695,-54.27
6696,-54.27
6697,-54.27
6698,-54.27
6699,-54.28
6700,-54.29
6701,-54.30
6702,-54.32
6703,-54.34
6704,-54.36
6705,-54.39
6706,-54.41
6707,-54.44
6708,-54.46
6709,-54.50
6710,-54.51
6711,-54.51
6712,-54.51
6713,-54.50
6714,-54.46
6715,-54.40
6716,-54.34
6717,-54.26
6718,-54.19
6719,-54.10
6720,-54.00
6721,-53.91
6722,-53.83
6723,-53.75
6724,-53.68
6725,-53.63
6726,-53.60
6727,-53.60
6728,-53.61
6729,-53.63
6730,-53.67
6731,-53.73
6732,-53.81
6733,-53.88
6734,-53.98
6735,-54.07
6736,-54.18
6737,-54.29
6738,-54.40
6739,-54.51
6740,-54.62
6741,-54.71
6742,-54.81
6743,-54.89
6744,-54.95
6745,-54.97
6746,-54.99
6747,-55.00
6748,-55.00
6749,-54.98
6750,-54.93
6751,-54.87
6752,-54.82
6753,-54.77
6754,-54.75
6755,-54.74
6756,-54.75
6757,-54.77
6758,-54.80
6759,-54.85
6760,-54.92
6761,-55.02
6762,-55.14
6763,-55.25
6764,-55.35
6765,-55.45
6766,-55.55
6767,-55.63
6768,-55.72
6769,-55.77
6770,-55.81
6771,-55.84
6772,-55.87
6773,-55.90
6774,-55.92
6775,-55.93
6776,-55.94
6777,-55.96
6778,-55.99
6779,-56.03
6780,-56.09
6781,-56.14
6782,-56.20
6783,-56.26
6784,-56.34
6785,-56.42
6786,-56.51
6787,-56.59
6788,-56.67
6789,-56.74
6790,-56.83
6791,-56.90
6792,-56.99
6793,-57.08
6794,-57.17
6795,-57.27
6796,-57.38
6797,-57.47
6798,-57.57
6799,-57.67
6800,-57.77
6801,-57.86
6802,-57.94
6803,-58.00
6804,-58.07
6805,-58.11
6806,-58.16
6807,-58.18
6808,-58.21
6809,-58.23
6810,-58.25
6811,-58.26
6812,-58.28
6813,-58.30
6814,-58.34
6815,-58.39
6816,-58.43
6817,-58.47
6818,-58.52
6819,-58.58
6820,-58.63
6821,-58.67
6822,-58.72
6823,-58.77
6824,-58.80
6825,-58.83
6826,-58.84
6827,-58.85
6828,-58.84
6829,-58.82
6830,-58.81
6831,-58.80
6832,-58.78
6833,-58.74
6834,-58.69
6835,-58.66
6836,-58.64
6837,-58.61
6838,-58.58
6839,-58.54
6840,-58.52
6841,-58.50
6842,-58.48
6843,-58.46
6844,-58.44
6845,-58.44
6846,-58.43
6847,-58.43
6848,-58.44
6849,-58.45
6850,-58.46
6851,-58.48
6852,-58.51
6853,-58.55
6854,-58.60
6855,-58.65
6856,-58.69
6857,-58.72
6858,-58.75
6859,-58.78
6860,-58.80
6861,-58.81
6862,-58.81
6863,-58.81
6864,-58.80
6865,-58.77
6866,-58.73
6867,-58.69
6868,-58.65
6869,-58.63
6870,-58.60
6871,-58.57
6872,-58.54
6873,-58.51
6874,-58.47
6875,-58.44
6876,-58.39
6877,-58.33
6878,-58.25
6879,-58.17
6880,-58.07
6881,-57.97
6882,-57.86
6883,-57.73
6884,-57.59
6885,-57.46
6886,-57.34
6887,-57.22
6888,-57.11
6889,-57.00
6890,-56.89
6891,-56.79
6892,-56.70
6893,-56.63
6894,-56.55
6895,-56.47
6896,-56.39
6897,-56.32
6898,-56.26
6899,-56.21
6900,-56.17
6901,-56.16
6902,-56.15
6903,-56.16
6904,-56.18
6905,-56.21
6906,-56.26
6907,-56.30
6908,-56.35
6909,-56.39
6910,-56.43
6911,-56.46
6912,-56.47
6913,-56.45
6914,-56.41
6915,-56.38
6916,-56.32
6917,-56.25
6918,-56.17
6919,-56.09
6920,-56.02
6921,-55.94
6922,-55.86
6923,-55.79
6924,-55.73
6925,-55.69
6926,-55.66
6927,-55.65
6928,-55.66
6929,-55.68
6930,-55.71
6931,-55.76
6932,-55.80
6933,-55.84
6934,-55.87
6935,-55.90
6936,-55.92
6937,-55.93
6938,-55.94
6939,-55.94
6940,-55.92
6941,-55.88
6942,-55.84
6943,-55.79
6944,-55.75
6945,-55.71
6946,-55.69
6947,-55.67
6948,-55.67
6949,-55.69
6950,-55.72
6951,-55.76
6952,-55.82
6953,-55.90
6954,-55.98
6955,-56.07
6956,-56.15
6957,-56.22
6958,-56.28
6959,-56.33
6960,-56.37
6961,-56.41
6962,-56.45
6963,-56.46
6964,-56.47
6965,-56.47
6966,-56.47
6967,-56.48
6968,-56.50
6969,-56.52
6970,-56.55
6971,-56.57
6972,-56.60
6973,-56.63
6974,-56.67
6975,-56.71
6976,-56.75
6977,-56.79
6978,-56.83
6979,-56.87
6980,-56.90
6981,-56.93
6982,-56.96
6983,-56.98
6984,-56.99
6985,-56.99
6986,-56.99
6987,-56.99
6988,-56.98
6989,-56.97
6990,-56.97
6991,-56.96
6992,-56.96
6993,-56.97
6994,-56.97
6995,-56.98
6996,-56.99
6997,-57.01
6998,-57.04
6999,-57.08
7000,-57.13
7001,-57.17
7002,-57.24
7003,-57.30
7004,-57.37
7005,-57.44
7006,-57.53
7007,-57.61
7008,-57.70
7009,-57.78
7010,-57.86
7011,-57.93
7012,-58.01
7013,-58.08
7014,-58.15
7015,-58.21
7016,-58.26
7017,-58.31
7018,-58.36
7019,-58.41
7020,-58.47
7021,-58.53
7022,-58.57
7023,-58.60
7024,-58.63
7025,-58.65
7026,-58.65
7027,-58.64
7028,-58.62
7029,-58.60
7030,-58.58
7031,-58.55
7032,-58.51
7033,-58.48
7034,-58.47
7035,-58.47
7036,-58.49
7037,-58.53
7038,-58.58
7039,-58.64
7040,-58.71
7041,-58.78
7042,-58.84
7043,-58.89
7044,-58.92
7045,-58.93
7046,-58.93
7047,-58.91
7048,-58.87
7049,-58.81
7050,-58.74
7051,-58.67
7052,-58.59
7053,-58.51
7054,-58.44
7055,-58.38
7056,-58.33
7057,-58.28
7058,-58.24
7059,-58.22
7060,-58.21
7061,-58.20
7062,-58.19
7063,-58.19
7064,-58.20
7065,-58.21
7066,-58.22
7067,-58.24
7068,-58.26
7069,-58.28
7070,-58.31
7071,-58.35
7072,-58.39
7073,-58.42
7074,-58.45
7075,-58.49
7076,-58.53
7077,-58.56
7078,-58.58
7079,-58.59
7080,-58.59
7081,-58.57
7082,-58.54
7083,-58.51
7084,-58.47
7085,-58.42
7086,-58.36
7087,-58.30
7088,-58.25
7089,-58.21
7090,-58.18
7091,-58.15
7092,-58.12
7093,-58.10
7094,-58.10
7095,-58.11
7096,-58.12
7097,-58.13
7098,-58.15
7099,-58.19
7100,-58.24
7101,-58.28
7102,-58.31
7103,-58.35
7104,-58.40
7105,-58.45
7106,-58.50
7107,-58.54
7108,-58.57
7109,-58.58
7110,-58.57
7111,-58.55
7112,-58.52
7113,-58.47
7114,-58.39
7115,-58.29
7116,-58.18
7117,-58.07
7118,-57.96
7119,-57.86
7120,-57.74
7121,-57.63
7122,-57.53
7123,-57.44
7124,-57.36
7125,-57.28
7126,-57.20
7127,-57.12
7128,-57.05
7129,-56.99
7130,-56.93
7131,-56.87
7132,-56.79
7133,-56.71
7134,-56.63
7135,-56.55
7136,-56.47
7137,-56.40
7138,-56.34
7139,-56.28
7140,-56.22
7141,-56.17
7142,-56.13
7143,-56.09
7144,-56.05
7145,-56.01
7146,-55.97
7147,-55.93
7148,-55.89
7149,-55.87
7150,-55.85
7151,-55.84
7152,-55.83
7153,-55.83
7154,-55.84
7155,-55.87
7156,-55.91
7157,-55.96
7158,-55.99
7159,-56.02
7160,-56.05
7161,-56.07
7162,-56.08
7163,-56.06
7164,-56.00
7165,-55.92
7166,-55.83
7167,-55.74
7168,-55.65
7169,-55.56
7170,-55.47
7171,-55.39
7172,-55.33
7173,-55.29
7174,-55.26
7175,-55.26
7176,-55.27
7177,-55.31
7178,-55.36
7179,-55.41
7180,-55.46
7181,-55.51
7182,-55.56
7183,-55.60
7184,-55.63
7185,-55.64
7186,-55.63
7187,-55.63
7188,-55.61
7189,-55.79
7190,-55.68
7191,-55.33
7192,-54.97
7193,-56.19
7194,-56.82
7195,-54.60
7196,-51.51
7197,-55.09
7198,-62.85
7199,-58.87
7200,-35.72
