1,-187.79
2,-250.00
3,-250.00
4,-243.95
5,-222.90
6,-205.63
7,-158.50
8,-74.69
9,17.78
10,91.26
11,138.58
12,167.15
13,185.36
14,194.95
15,193.98
16,184.39
17,168.42
18,148.40
19,121.38
20,88.20
21,52.54
22,21.80
23,-0.04
24,-14.05
25,-22.20
26,-27.03
27,-28.09
28,-27.65
29,-25.92
30,-25.14
31,-24.56
32,-25.47
33,-26.91
34,-29.46
35,-32.04
36,-34.77
37,-37.05
38,-39.06
39,-40.72
40,-42.27
41,-43.63
42,-44.91
43,-45.99
44,-47.04
45,-47.91
46,-48.76
47,-49.42
48,-50.03
49,-50.52
50,-51.05
51,-51.50
52,-51.96
53,-52.34
54,-52.68
55,-52.96
56,-53.27
57,-53.57
58,-53.94
59,-54.29
60,-54.64
61,-54.97
62,-55.30
63,-55.58
64,-55.84
65,-56.05
66,-56.24
67,-56.41
68,-56.57
69,-56.69
70,-56.79
71,-56.87
72,-56.95
73,-57.00
74,-57.08
75,-57.17
76,-57.25
77,-57.30
78,-57.35
79,-57.40
80,-57.50
81,-57.59
82,-57.66
83,-57.69
84,-57.69
85,-57.65
86,-57.60
87,-57.54
88,-57.47
89,-57.40
90,-57.37
91,-57.37
92,-57.39
93,-57.39
94,-57.37
95,-57.37
96,-57.41
97,-57.47
98,-57.52
99,-57.56
100,-57.59
101,-57.62
102,-57.60
103,-57.55
104,-57.50
105,-57.46
106,-57.41
107,-57.36
108,-57.31
109,-57.28
110,-57.24
111,-57.18
112,-57.14
113,-57.14
114,-57.17
115,-57.24
116,-57.30
117,-57.37
118,-57.40
119,-57.43
120,-57.46
121,-57.50
122,-57.50
123,-57.46
124,-57.43
125,-57.43
126,-57.46
127,-57.49
128,-57.52
129,-57.55
130,-57.59
131,-57.65
132,-57.73
133,-57.85
134,-58.01
135,-58.16
136,-58.28
137,-58.37
138,-58.45
139,-58.53
140,-58.61
141,-58.64
142,-58.62
143,-58.56
144,-58.49
145,-58.43
146,-58.36
147,-58.27
148,-58.18
149,-58.08
150,-57.98
151,-57.90
152,-57.84
153,-57.82
154,-57.80
155,-57.80
156,-57.82
157,-57.85
158,-57.88
159,-57.91
160,-57.92
161,-57.92
162,-57.92
163,-57.92
164,-57.92
165,-57.91
166,-57.91
167,-57.91
168,-57.95
169,-58.00
170,-58.07
171,-58.17
172,-58.30
173,-58.44
174,-58.59
175,-58.70
176,-58.82
177,-58.94
178,-59.06
179,-59.11
180,-59.10
181,-59.04
182,-58.96
183,-58.91
184,-58.85
185,-58.75
186,-58.63
187,-58.51
188,-58.43
189,-58.40
190,-58.41
191,-58.44
192,-58.47
193,-58.53
194,-58.63
195,-58.75
196,-58.86
197,-58.93
198,-58.96
199,-58.98
200,-59.01
201,-59.01
202,-59.00
203,-58.97
204,-58.91
205,-58.86
206,-58.78
207,-58.69
208,-58.59
209,-58.50
210,-58.42
211,-58.33
212,-58.23
213,-58.11
214,-57.98
215,-57.87
216,-57.75
217,-57.63
218,-57.49
219,-57.37
220,-57.30
221,-57.24
222,-57.16
223,-57.08
224,-57.02
225,-57.02
226,-57.02
227,-56.99
228,-56.96
229,-56.96
230,-56.98
231,-57.01
232,-57.04
233,-57.08
234,-57.11
235,-57.14
236,-57.15
237,-57.15
238,-57.16
239,-57.15
240,-57.12
241,-57.07
242,-57.02
243,-56.98
244,-56.95
245,-56.89
246,-56.82
247,-56.76
248,-56.69
249,-56.61
250,-56.51
251,-56.42
252,-56.34
253,-56.24
254,-56.14
255,-56.03
256,-55.90
257,-55.78
258,-55.66
259,-55.54
260,-55.42
261,-55.31
262,-55.19
263,-55.11
264,-55.04
265,-54.98
266,-54.89
267,-54.82
268,-54.75
269,-54.69
270,-54.59
271,-54.47
272,-54.37
273,-54.31
274,-54.25
275,-54.17
276,-54.06
277,-53.96
278,-53.92
279,-53.92
280,-53.94
281,-53.98
282,-54.02
283,-54.08
284,-54.14
285,-54.20
286,-54.28
287,-54.37
288,-54.43
289,-54.47
290,-54.49
291,-54.51
292,-54.53
293,-54.53
294,-54.54
295,-54.53
296,-54.51
297,-54.49
298,-54.48
299,-54.47
300,-54.44
301,-54.38
302,-54.34
303,-54.31
304,-54.26
305,-54.18
306,-54.07
307,-53.98
308,-53.89
309,-53.80
310,-53.71
311,-53.62
312,-53.54
313,-53.49
314,-53.44
315,-53.41
316,-53.39
317,-53.39
318,-53.42
319,-53.48
320,-53.56
321,-53.62
322,-53.67
323,-53.73
324,-53.79
325,-53.85
326,-53.90
327,-53.93
328,-53.93
329,-53.90
330,-53.86
331,-53.79
332,-53.70
333,-53.59
334,-53.47
335,-53.34
336,-53.21
337,-53.06
338,-52.91
339,-52.76
340,-52.59
341,-52.41
342,-52.25
343,-52.13
344,-52.04
345,-51.96
346,-51.86
347,-51.80
348,-51.80
349,-51.82
350,-51.86
351,-51.93
352,-52.04
353,-52.19
354,-52.34
355,-52.49
356,-52.65
357,-52.80
358,-52.92
359,-53.01
360,-53.09
361,-53.14
362,-53.15
363,-53.12
364,-53.08
365,-53.01
366,-52.94
367,-52.85
368,-52.76
369,-52.70
370,-52.67
371,-52.67
372,-52.70
373,-52.73
374,-52.76
375,-52.83
376,-52.92
377,-53.00
378,-53.07
379,-53.10
380,-53.12
381,-53.11
382,-53.09
383,-53.06
384,-53.04
385,-53.01
386,-52.95
387,-52.86
388,-52.77
389,-52.70
390,-52.65
391,-52.60
392,-52.55
393,-52.54
394,-52.59
395,-52.65
396,-52.71
397,-52.76
398,-52.86
399,-52.97
400,-53.12
401,-53.27
402,-53.41
403,-53.57
404,-53.72
405,-53.86
406,-54.01
407,-54.12
408,-54.21
409,-54.31
410,-54.41
411,-54.53
412,-54.65
413,-54.73
414,-54.79
415,-54.85
416,-54.94
417,-55.06
418,-55.18
419,-55.27
420,-55.34
421,-55.40
422,-55.47
423,-55.52
424,-55.54
425,-55.54
426,-55.55
427,-55.53
428,-55.51
429,-55.50
430,-55.50
431,-55.53
432,-55.52
433,-55.49
434,-55.50
435,-55.56
436,-55.62
437,-55.66
438,-55.67
439,-55.70
440,-55.74
441,-55.77
442,-55.79
443,-55.79
444,-55.79
445,-55.79
446,-55.77
447,-55.75
448,-55.69
449,-55.63
450,-55.56
451,-55.47
452,-55.38
453,-55.29
454,-55.20
455,-55.11
456,-55.03
457,-54.97
458,-54.91
459,-54.85
460,-54.81
461,-54.81
462,-54.85
463,-54.91
464,-54.96
465,-54.99
466,-55.02
467,-55.04
468,-55.09
469,-55.15
470,-55.21
471,-55.24
472,-55.25
473,-55.24
474,-55.25
475,-55.28
476,-55.34
477,-55.40
478,-55.44
479,-55.47
480,-55.51
481,-55.56
482,-55.61
483,-55.65
484,-55.69
485,-55.71
486,-55.71
487,-55.68
488,-55.66
489,-55.66
490,-55.65
491,-55.60
492,-55.50
493,-55.37
494,-55.24
495,-55.12
496,-55.02
497,-54.94
498,-54.82
499,-54.67
500,-54.51
501,-54.40
502,-54.31
503,-54.23
504,-54.12
505,-53.99
506,-53.90
507,-53.84
508,-53.77
509,-53.69
510,-53.60
511,-53.52
512,-53.39
513,-53.22
514,-52.99
515,-52.78
516,-52.60
517,-52.43
518,-52.22
519,-51.98
520,-51.73
521,-51.53
522,-51.33
523,-51.16
524,-51.01
525,-50.90
526,-50.77
527,-50.67
528,-50.55
529,-50.46
530,-50.39
531,-50.34
532,-50.26
533,-50.18
534,-50.07
535,-49.99
536,-49.92
537,-49.87
538,-49.79
539,-49.69
540,-49.61
541,-49.55
542,-49.52
543,-49.49
544,-49.44
545,-49.38
546,-49.33
547,-49.30
548,-49.27
549,-49.25
550,-49.25
551,-49.27
552,-49.30
553,-49.30
554,-49.29
555,-49.29
556,-49.29
557,-49.29
558,-49.31
559,-49.34
560,-49.37
561,-49.40
562,-49.43
563,-49.46
564,-49.47
565,-49.44
566,-49.39
567,-49.36
568,-49.35
569,-49.32
570,-49.25
571,-49.16
572,-49.10
573,-49.06
574,-49.02
575,-48.97
576,-48.92
577,-48.88
578,-48.86
579,-48.83
580,-48.82
581,-48.85
582,-48.90
583,-48.97
584,-49.02
585,-49.08
586,-49.15
587,-49.25
588,-49.35
589,-49.44
590,-49.48
591,-49.52
592,-49.57
593,-49.62
594,-49.64
595,-49.62
596,-49.58
597,-49.54
598,-49.48
599,-49.41
600,-49.32
601,-49.26
602,-49.20
603,-49.17
604,-49.20
605,-49.26
606,-49.31
607,-49.38
608,-49.49
609,-49.67
610,-49.84
611,-50.00
612,-50.16
613,-50.33
614,-50.50
615,-50.66
616,-50.80
617,-50.91
618,-50.99
619,-51.02
620,-51.03
621,-51.06
622,-51.10
623,-51.13
624,-51.15
625,-51.14
626,-51.15
627,-51.17
628,-51.22
629,-51.28
630,-51.35
631,-51.45
632,-51.54
633,-51.63
634,-51.73
635,-51.85
636,-51.97
637,-52.06
638,-52.12
639,-52.18
640,-52.25
641,-52.31
642,-52.35
643,-52.35
644,-52.31
645,-52.28
646,-52.26
647,-52.23
648,-52.18
649,-52.12
650,-52.07
651,-52.03
652,-52.01
653,-52.01
654,-52.06
655,-52.15
656,-52.25
657,-52.35
658,-52.44
659,-52.55
660,-52.70
661,-52.86
662,-52.99
663,-53.10
664,-53.22
665,-53.34
666,-53.46
667,-53.54
668,-53.61
669,-53.67
670,-53.73
671,-53.79
672,-53.83
673,-53.82
674,-53.81
675,-53.81
676,-53.82
677,-53.82
678,-53.80
679,-53.77
680,-53.74
681,-53.71
682,-53.68
683,-53.66
684,-53.65
685,-53.64
686,-53.61
687,-53.56
688,-53.50
689,-53.47
690,-53.44
691,-53.38
692,-53.29
693,-53.20
694,-53.13
695,-53.08
696,-53.00
697,-52.92
698,-52.83
699,-52.77
700,-52.70
701,-52.58
702,-52.44
703,-52.32
704,-52.22
705,-52.14
706,-52.03
707,-51.91
708,-51.80
709,-51.70
710,-51.65
711,-51.62
712,-51.61
713,-51.61
714,-51.62
715,-51.65
716,-51.70
717,-51.77
718,-51.80
719,-51.84
720,-51.87
721,-51.90
722,-51.91
723,-51.88
724,-51.83
725,-51.77
726,-51.71
727,-51.65
728,-51.57
729,-51.48
730,-51.39
731,-51.34
732,-51.28
733,-51.23
734,-51.16
735,-51.11
736,-51.07
737,-51.04
738,-50.97
739,-50.89
740,-50.81
741,-50.74
742,-50.67
743,-50.59
744,-50.51
745,-50.45
746,-50.39
747,-50.33
748,-50.29
749,-50.29
750,-50.32
751,-50.38
752,-50.47
753,-50.55
754,-50.66
755,-50.78
756,-50.90
757,-50.99
758,-51.03
759,-51.07
760,-51.12
761,-51.17
762,-51.21
763,-51.22
764,-51.20
765,-51.20
766,-51.19
767,-51.16
768,-51.12
769,-51.09
770,-51.08
771,-51.08
772,-51.07
773,-51.04
774,-51.01
775,-50.97
776,-50.93
777,-50.91
778,-50.90
779,-50.90
780,-50.89
781,-50.89
782,-50.92
783,-50.98
784,-51.05
785,-51.12
786,-51.17
787,-51.23
788,-51.28
789,-51.31
790,-51.31
791,-51.32
792,-51.33
793,-51.32
794,-51.29
795,-51.24
796,-51.18
797,-51.15
798,-51.13
799,-51.10
800,-51.06
801,-51.03
802,-51.03
803,-51.06
804,-51.10
805,-51.13
806,-51.16
807,-51.18
808,-51.22
809,-51.25
810,-51.28
811,-51.31
812,-51.34
813,-51.36
814,-51.38
815,-51.38
816,-51.37
817,-51.34
818,-51.28
819,-51.22
820,-51.18
821,-51.15
822,-51.13
823,-51.09
824,-51.06
825,-51.06
826,-51.11
827,-51.17
828,-51.22
829,-51.28
830,-51.35
831,-51.44
832,-51.53
833,-51.63
834,-51.75
835,-51.86
836,-51.93
837,-51.97
838,-52.00
839,-52.06
840,-52.10
841,-52.11
842,-52.08
843,-52.04
844,-52.01
845,-51.99
846,-51.96
847,-51.93
848,-51.89
849,-51.86
850,-51.87
851,-51.90
852,-51.90
853,-51.87
854,-51.85
855,-51.85
856,-51.84
857,-51.82
858,-51.78
859,-51.74
860,-51.73
861,-51.74
862,-51.73
863,-51.70
864,-51.65
865,-51.59
866,-51.51
867,-51.41
868,-51.34
869,-51.28
870,-51.22
871,-51.17
872,-51.12
873,-51.05
874,-50.97
875,-50.92
876,-50.90
877,-50.93
878,-50.96
879,-51.00
880,-51.06
881,-51.14
882,-51.25
883,-51.37
884,-51.50
885,-51.61
886,-51.73
887,-51.81
888,-51.90
889,-51.97
890,-52.09
891,-52.21
892,-52.34
893,-52.45
894,-52.57
895,-52.68
896,-52.81
897,-52.93
898,-53.04
899,-53.12
900,-53.19
901,-53.25
902,-53.30
903,-53.33
904,-53.35
905,-53.34
906,-53.32
907,-53.29
908,-53.28
909,-53.28
910,-53.26
911,-53.23
912,-53.22
913,-53.25
914,-53.29
915,-53.33
916,-53.37
917,-53.39
918,-53.40
919,-53.41
920,-53.42
921,-53.45
922,-53.45
923,-53.43
924,-53.40
925,-53.36
926,-53.29
927,-53.21
928,-53.13
929,-53.07
930,-52.99
931,-52.88
932,-52.75
933,-52.66
934,-52.58
935,-52.50
936,-52.39
937,-52.28
938,-52.15
939,-52.03
940,-51.90
941,-51.75
942,-51.61
943,-51.48
944,-51.38
945,-51.28
946,-51.23
947,-51.21
948,-51.20
949,-51.20
950,-51.19
951,-51.22
952,-51.31
953,-51.43
954,-51.54
955,-51.64
956,-51.74
957,-51.85
958,-51.93
959,-51.97
960,-51.99
961,-52.01
962,-52.04
963,-52.08
964,-52.11
965,-52.14
966,-52.16
967,-52.19
968,-52.24
969,-52.31
970,-52.36
971,-52.40
972,-52.38
973,-52.36
974,-52.31
975,-52.25
976,-52.15
977,-52.00
978,-51.80
979,-51.60
980,-51.39
981,-51.19
982,-50.97
983,-50.77
984,-50.58
985,-50.42
986,-50.30
987,-50.22
988,-50.16
989,-50.14
990,-50.09
991,-50.04
992,-49.98
993,-49.93
994,-49.83
995,-49.68
996,-49.49
997,-49.32
998,-49.15
999,-48.97
1000,-48.77
1001,-48.56
1002,-48.36
1003,-48.23
1004,-48.11
1005,-48.03
1006,-47.93
1007,-47.84
1008,-47.77
1009,-47.71
1010,-47.65
1011,-47.63
1012,-47.63
1013,-47.63
1014,-47.59
1015,-47.54
1016,-47.51
1017,-47.51
1018,-47.49
1019,-47.43
1020,-47.35
1021,-47.28
1022,-47.26
1023,-47.27
1024,-47.25
1025,-47.19
1026,-47.10
1027,-47.01
1028,-46.94
1029,-46.88
1030,-46.83
1031,-46.77
1032,-46.69
1033,-46.60
1034,-46.51
1035,-46.45
1036,-46.43
1037,-46.43
1038,-46.44
1039,-46.43
1040,-46.45
1041,-46.50
1042,-46.60
1043,-46.73
1044,-46.85
1045,-46.97
1046,-47.10
1047,-47.21
1048,-47.31
1049,-47.41
1050,-47.50
1051,-47.55
1052,-47.57
1053,-47.53
1054,-47.50
1055,-47.51
1056,-47.52
1057,-47.49
1058,-47.40
1059,-47.31
1060,-47.24
1061,-47.18
1062,-47.10
1063,-47.01
1064,-46.95
1065,-46.96
1066,-47.00
1067,-47.02
1068,-47.03
1069,-47.05
1070,-47.16
1071,-47.30
1072,-47.45
1073,-47.57
1074,-47.71
1075,-47.88
1076,-48.07
1077,-48.22
1078,-48.34
1079,-48.45
1080,-48.60
1081,-48.74
1082,-48.87
1083,-48.96
1084,-49.04
1085,-49.13
1086,-49.20
1087,-49.26
1088,-49.35
1089,-49.43
1090,-49.49
1091,-49.52
1092,-49.56
1093,-49.61
1094,-49.67
1095,-49.74
1096,-49.80
1097,-49.85
1098,-49.93
1099,-50.01
1100,-50.13
1101,-50.24
1102,-50.35
1103,-50.48
1104,-50.63
1105,-50.77
1106,-50.89
1107,-50.98
1108,-51.08
1109,-51.20
1110,-51.30
1111,-51.36
1112,-51.39
1113,-51.41
1114,-51.45
1115,-51.49
1116,-51.49
1117,-51.46
1118,-51.41
1119,-51.34
1120,-51.28
1121,-51.22
1122,-51.17
1123,-51.11
1124,-51.05
1125,-50.99
1126,-50.94
1127,-50.91
1128,-50.88
1129,-50.85
1130,-50.83
1131,-50.87
1132,-50.94
1133,-51.03
1134,-51.12
1135,-51.18
1136,-51.21
1137,-51.24
1138,-51.28
1139,-51.34
1140,-51.39
1141,-51.42
1142,-51.45
1143,-51.48
1144,-51.50
1145,-51.49
1146,-51.50
1147,-51.52
1148,-51.60
1149,-51.68
1150,-51.78
1151,-51.86
1152,-51.96
1153,-52.07
1154,-52.23
1155,-52.41
1156,-52.61
1157,-52.83
1158,-53.03
1159,-53.20
1160,-53.34
1161,-53.47
1162,-53.59
1163,-53.70
1164,-53.79
1165,-53.86
1166,-53.90
1167,-53.93
1168,-53.92
1169,-53.90
1170,-53.86
1171,-53.83
1172,-53.78
1173,-53.73
1174,-53.69
1175,-53.65
1176,-53.60
1177,-53.55
1178,-53.53
1179,-53.52
1180,-53.49
1181,-53.44
1182,-53.39
1183,-53.35
1184,-53.30
1185,-53.22
1186,-53.11
1187,-52.99
1188,-52.86
1189,-52.95
1190,-52.79
1191,-52.44
1192,-52.05
1193,-53.69
1194,-54.06
1195,-50.13
1196,-46.80
1197,-54.39
1198,-65.25
1199,-52.86
1200,-19.74
