1,-188.89
2,-250.00
3,-250.00
4,-246.96
5,-243.19
6,-243.80
7,-192.60
8,-69.53
9,79.80
10,193.95
11,245.69
12,249.99
13,249.73
14,249.99
15,249.99
16,249.99
17,249.99
18,249.99
19,245.86
20,218.52
21,174.62
22,132.35
23,103.94
24,87.78
25,77.61
26,69.63
27,65.95
28,64.79
29,64.86
30,63.40
31,61.52
32,58.05
33,54.24
34,49.16
35,44.35
36,39.54
37,35.56
38,31.78
39,28.46
40,25.16
41,22.31
42,19.54
43,17.14
44,14.72
45,12.60
46,10.44
47,8.56
48,6.62
49,4.91
50,3.13
51,1.53
52,-0.14
53,-1.63
54,-3.17
55,-4.53
56,-5.94
57,-7.21
58,-8.52
59,-9.67
60,-10.78
61,-11.70
62,-12.60
63,-13.40
64,-14.22
65,-14.91
66,-15.57
67,-16.14
68,-16.75
69,-17.32
70,-17.91
71,-18.43
72,-18.97
73,-19.48
74,-20.03
75,-20.56
76,-21.13
77,-21.64
78,-22.13
79,-22.53
80,-22.96
81,-23.37
82,-23.76
83,-24.03
84,-24.31
85,-24.59
86,-24.96
87,-25.30
88,-25.62
89,-25.91
90,-26.27
91,-26.67
92,-27.12
93,-27.54
94,-27.96
95,-28.36
96,-28.76
97,-29.12
98,-29.46
99,-29.75
100,-29.99
101,-30.17
102,-30.32
103,-30.43
104,-30.52
105,-30.56
106,-30.64
107,-30.75
108,-30.92
109,-31.10
110,-31.27
111,-31.45
112,-31.68
113,-31.91
114,-32.10
115,-32.22
116,-32.34
117,-32.45
118,-32.52
119,-32.52
120,-32.50
121,-32.49
122,-32.50
123,-32.50
124,-32.52
125,-32.57
126,-32.66
127,-32.78
128,-32.94
129,-33.12
130,-33.31
131,-33.49
132,-33.65
133,-33.76
134,-33.84
135,-33.91
136,-33.95
137,-33.94
138,-33.89
139,-33.83
140,-33.81
141,-33.81
142,-33.78
143,-33.72
144,-33.69
145,-33.74
146,-33.88
147,-34.07
148,-34.26
149,-34.43
150,-34.60
151,-34.77
152,-35.01
153,-35.24
154,-35.42
155,-35.55
156,-35.67
157,-35.77
158,-35.86
159,-35.93
160,-36.02
161,-36.12
162,-36.22
163,-36.29
164,-36.37
165,-36.47
166,-36.59
167,-36.72
168,-36.88
169,-37.05
170,-37.20
171,-37.32
172,-37.46
173,-37.63
174,-37.83
175,-38.01
176,-38.19
177,-38.35
178,-38.54
179,-38.72
180,-38.91
181,-39.08
182,-39.24
183,-39.42
184,-39.65
185,-39.89
186,-40.08
187,-40.20
188,-40.30
189,-40.41
190,-40.54
191,-40.66
192,-40.76
193,-40.82
194,-40.84
195,-40.84
196,-40.85
197,-40.84
198,-40.81
199,-40.76
200,-40.70
201,-40.63
202,-40.53
203,-40.44
204,-40.32
205,-40.19
206,-39.99
207,-39.77
208,-39.56
209,-39.37
210,-39.15
211,-38.93
212,-38.73
213,-38.60
214,-38.50
215,-38.39
216,-38.29
217,-38.22
218,-38.19
219,-38.21
220,-38.25
221,-38.31
222,-38.34
223,-38.34
224,-38.32
225,-38.32
226,-38.34
227,-38.34
228,-38.31
229,-38.25
230,-38.18
231,-38.12
232,-38.09
233,-38.09
234,-38.09
235,-38.09
236,-38.11
237,-38.18
238,-38.26
239,-38.31
240,-38.33
241,-38.33
242,-38.35
243,-38.42
244,-38.48
245,-38.48
246,-38.43
247,-38.36
248,-38.31
249,-38.25
250,-38.18
251,-38.12
252,-38.09
253,-38.09
254,-38.09
255,-38.09
256,-38.10
257,-38.17
258,-38.28
259,-38.40
260,-38.49
261,-38.55
262,-38.60
263,-38.66
264,-38.70
265,-38.71
266,-38.67
267,-38.61
268,-38.52
269,-38.40
270,-38.26
271,-38.15
272,-38.06
273,-37.99
274,-37.94
275,-37.90
276,-37.83
277,-37.76
278,-37.70
279,-37.72
280,-37.78
281,-37.84
282,-37.83
283,-37.77
284,-37.73
285,-37.73
286,-37.70
287,-37.66
288,-37.62
289,-37.61
290,-37.60
291,-37.54
292,-37.47
293,-37.40
294,-37.34
295,-37.28
296,-37.25
297,-37.25
298,-37.27
299,-37.27
300,-37.25
301,-37.25
302,-37.28
303,-37.34
304,-37.41
305,-37.47
306,-37.52
307,-37.58
308,-37.67
309,-37.79
310,-37.92
311,-38.03
312,-38.15
313,-38.27
314,-38.38
315,-38.50
316,-38.65
317,-38.83
318,-39.02
319,-39.20
320,-39.38
321,-39.55
322,-39.74
323,-39.92
324,-40.08
325,-40.19
326,-40.28
327,-40.34
328,-40.38
329,-40.44
330,-40.52
331,-40.58
332,-40.60
333,-40.60
334,-40.61
335,-40.67
336,-40.76
337,-40.82
338,-40.84
339,-40.84
340,-40.84
341,-40.84
342,-40.81
343,-40.76
344,-40.67
345,-40.55
346,-40.37
347,-40.20
348,-40.07
349,-40.01
350,-39.97
351,-39.91
352,-39.86
353,-39.86
354,-39.89
355,-39.96
356,-40.05
357,-40.16
358,-40.31
359,-40.50
360,-40.70
361,-40.87
362,-41.03
363,-41.21
364,-41.43
365,-41.66
366,-41.89
367,-42.07
368,-42.24
369,-42.40
370,-42.59
371,-42.76
372,-42.96
373,-43.13
374,-43.28
375,-43.40
376,-43.51
377,-43.63
378,-43.74
379,-43.80
380,-43.81
381,-43.80
382,-43.84
383,-43.90
384,-43.94
385,-43.94
386,-43.95
387,-43.99
388,-44.10
389,-44.22
390,-44.35
391,-44.46
392,-44.59
393,-44.70
394,-44.83
395,-44.94
396,-45.04
397,-45.10
398,-45.14
399,-45.14
400,-45.10
401,-45.04
402,-44.95
403,-44.83
404,-44.69
405,-44.58
406,-44.49
407,-44.43
408,-44.36
409,-44.31
410,-44.27
411,-44.27
412,-44.28
413,-44.29
414,-44.28
415,-44.28
416,-44.28
417,-44.28
418,-44.28
419,-44.28
420,-44.29
421,-44.29
422,-44.27
423,-44.20
424,-44.13
425,-44.07
426,-44.04
427,-44.04
428,-44.05
429,-44.05
430,-44.03
431,-44.04
432,-44.08
433,-44.14
434,-44.16
435,-44.17
436,-44.20
437,-44.25
438,-44.27
439,-44.28
440,-44.34
441,-44.45
442,-44.56
443,-44.62
444,-44.70
445,-44.80
446,-44.93
447,-45.06
448,-45.21
449,-45.38
450,-45.55
451,-45.68
452,-45.76
453,-45.81
454,-45.85
455,-45.85
456,-45.82
457,-45.76
458,-45.66
459,-45.55
460,-45.41
461,-45.23
462,-44.99
463,-44.70
464,-44.38
465,-44.08
466,-43.78
467,-43.50
468,-43.20
469,-42.90
470,-42.56
471,-42.21
472,-41.86
473,-41.57
474,-41.27
475,-40.99
476,-40.70
477,-40.47
478,-40.24
479,-40.01
480,-39.76
481,-39.52
482,-39.29
483,-39.12
484,-38.99
485,-38.88
486,-38.72
487,-38.54
488,-38.38
489,-38.26
490,-38.15
491,-38.03
492,-37.93
493,-37.87
494,-37.83
495,-37.77
496,-37.70
497,-37.64
498,-37.61
499,-37.61
500,-37.62
501,-37.63
502,-37.61
503,-37.62
504,-37.63
505,-37.63
506,-37.60
507,-37.54
508,-37.47
509,-37.41
510,-37.35
511,-37.29
512,-37.24
513,-37.17
514,-37.10
515,-37.05
516,-37.02
517,-37.02
518,-37.03
519,-37.03
520,-37.03
521,-37.03
522,-37.03
523,-37.03
524,-37.03
525,-37.03
526,-37.02
527,-37.02
528,-37.04
529,-37.10
530,-37.19
531,-37.25
532,-37.26
533,-37.26
534,-37.29
535,-37.35
536,-37.39
537,-37.39
538,-37.38
539,-37.37
540,-37.38
541,-37.39
542,-37.35
543,-37.30
544,-37.24
545,-37.18
546,-37.09
547,-36.97
548,-36.84
549,-36.72
550,-36.61
551,-36.49
552,-36.36
553,-36.24
554,-36.14
555,-36.09
556,-36.07
557,-36.07
558,-36.06
559,-36.06
560,-36.09
561,-36.15
562,-36.22
563,-36.28
564,-36.34
565,-36.41
566,-36.45
567,-36.45
568,-36.39
569,-36.33
570,-36.31
571,-36.29
572,-36.29
573,-36.30
574,-36.35
575,-36.46
576,-36.61
577,-36.80
578,-37.06
579,-37.34
580,-37.62
581,-37.86
582,-38.11
583,-38.34
584,-38.53
585,-38.66
586,-38.75
587,-38.80
588,-38.80
589,-38.74
590,-38.67
591,-38.60
592,-38.51
593,-38.40
594,-38.30
595,-38.23
596,-38.19
597,-38.13
598,-38.08
599,-38.01
600,-37.91
601,-37.80
602,-37.70
603,-37.64
604,-37.59
605,-37.54
606,-37.47
607,-37.41
608,-37.35
609,-37.28
610,-37.24
611,-37.25
612,-37.30
613,-37.35
614,-37.38
615,-37.38
616,-37.40
617,-37.46
618,-37.51
619,-37.52
620,-37.48
621,-37.41
622,-37.35
623,-37.29
624,-37.24
625,-37.19
626,-37.09
627,-36.97
628,-36.84
629,-36.73
630,-36.61
631,-36.49
632,-36.36
633,-36.25
634,-36.13
635,-36.01
636,-35.87
637,-35.75
638,-35.70
639,-35.70
640,-35.71
641,-35.71
642,-35.74
643,-35.86
644,-36.03
645,-36.22
646,-36.39
647,-36.57
648,-36.77
649,-37.01
650,-37.26
651,-37.51
652,-37.75
653,-37.97
654,-38.21
655,-38.44
656,-38.70
657,-38.94
658,-39.13
659,-39.24
660,-39.34
661,-39.45
662,-39.59
663,-39.71
664,-39.81
665,-39.86
666,-39.89
667,-39.95
668,-40.08
669,-40.26
670,-40.46
671,-40.63
672,-40.79
673,-40.98
674,-41.18
675,-41.36
676,-41.48
677,-41.54
678,-41.57
679,-41.57
680,-41.52
681,-41.40
682,-41.21
683,-40.97
684,-40.70
685,-40.40
686,-40.08
687,-39.79
688,-39.51
689,-39.27
690,-39.06
691,-38.89
692,-38.73
693,-38.61
694,-38.53
695,-38.48
696,-38.41
697,-38.35
698,-38.31
699,-38.31
700,-38.35
701,-38.41
702,-38.48
703,-38.54
704,-38.60
705,-38.66
706,-38.70
707,-38.77
708,-38.87
709,-38.99
710,-39.09
711,-39.15
712,-39.20
713,-39.26
714,-39.30
715,-39.29
716,-39.28
717,-39.28
718,-39.31
719,-39.30
720,-39.25
721,-39.18
722,-39.18
723,-39.25
724,-39.29
725,-39.29
726,-39.29
727,-39.35
728,-39.47
729,-39.60
730,-39.67
731,-39.73
732,-39.83
733,-39.95
734,-40.02
735,-40.02
736,-40.01
737,-40.00
738,-39.99
739,-39.93
740,-39.83
741,-39.70
742,-39.58
743,-39.46
744,-39.36
745,-39.30
746,-39.28
747,-39.28
748,-39.28
749,-39.28
750,-39.30
751,-39.37
752,-39.46
753,-39.51
754,-39.50
755,-39.44
756,-39.41
757,-39.40
758,-39.38
759,-39.33
760,-39.25
761,-39.18
762,-39.14
763,-39.14
764,-39.20
765,-39.32
766,-39.50
767,-39.67
768,-39.83
769,-40.02
770,-40.25
771,-40.48
772,-40.69
773,-40.80
774,-40.87
775,-40.93
776,-40.99
777,-40.99
778,-40.91
779,-40.79
780,-40.66
781,-40.53
782,-40.38
783,-40.21
784,-40.05
785,-39.92
786,-39.80
787,-39.69
788,-39.63
789,-39.63
790,-39.63
791,-39.63
792,-39.67
793,-39.78
794,-39.99
795,-40.23
796,-40.47
797,-40.70
798,-41.01
799,-41.36
800,-41.72
801,-42.02
802,-42.29
803,-42.52
804,-42.70
805,-42.82
806,-42.90
807,-42.96
808,-43.01
809,-43.01
810,-42.94
811,-42.82
812,-42.67
813,-42.49
814,-42.27
815,-42.03
816,-41.79
817,-41.56
818,-41.28
819,-40.99
820,-40.71
821,-40.47
822,-40.23
823,-39.99
824,-39.79
825,-39.67
826,-39.60
827,-39.55
828,-39.47
829,-39.42
830,-39.41
831,-39.47
832,-39.57
833,-39.70
834,-39.83
835,-39.95
836,-40.02
837,-40.08
838,-40.18
839,-40.29
840,-40.41
841,-40.46
842,-40.50
843,-40.55
844,-40.65
845,-40.77
846,-40.89
847,-41.00
848,-41.15
849,-41.33
850,-41.53
851,-41.70
852,-41.87
853,-42.05
854,-42.27
855,-42.50
856,-42.72
857,-42.89
858,-43.08
859,-43.25
860,-43.40
861,-43.52
862,-43.63
863,-43.75
864,-43.88
865,-43.99
866,-44.10
867,-44.21
868,-44.38
869,-44.56
870,-44.70
871,-44.82
872,-44.97
873,-45.14
874,-45.31
875,-45.43
876,-45.52
877,-45.57
878,-45.62
879,-45.61
880,-45.56
881,-45.51
882,-45.46
883,-45.39
884,-45.29
885,-45.17
886,-45.11
887,-45.10
888,-45.11
889,-45.11
890,-45.16
891,-45.27
892,-45.44
893,-45.62
894,-45.81
895,-45.99
896,-46.14
897,-46.26
898,-46.35
899,-46.41
900,-46.45
901,-46.45
902,-46.38
903,-46.26
904,-46.13
905,-46.01
906,-45.88
907,-45.77
908,-45.68
909,-45.62
910,-45.55
911,-45.49
912,-45.49
913,-45.55
914,-45.62
915,-45.68
916,-45.76
917,-45.88
918,-46.02
919,-46.14
920,-46.23
921,-46.28
922,-46.35
923,-46.47
924,-46.64
925,-46.82
926,-46.98
927,-47.10
928,-47.20
929,-47.32
930,-47.46
931,-47.58
932,-47.62
933,-47.63
934,-47.64
935,-47.64
936,-47.55
937,-47.38
938,-47.17
939,-46.98
940,-46.81
941,-46.65
942,-46.46
943,-46.28
944,-46.09
945,-45.91
946,-45.77
947,-45.66
948,-45.51
949,-45.34
950,-45.14
951,-44.98
952,-44.77
953,-44.55
954,-44.26
955,-43.97
956,-43.66
957,-43.37
958,-43.05
959,-42.76
960,-42.49
961,-42.25
962,-42.04
963,-41.87
964,-41.73
965,-41.61
966,-41.47
967,-41.36
968,-41.28
969,-41.22
970,-41.15
971,-41.03
972,-40.89
973,-40.76
974,-40.66
975,-40.54
976,-40.39
977,-40.21
978,-40.03
979,-39.85
980,-39.65
981,-39.48
982,-39.37
983,-39.30
984,-39.24
985,-39.19
986,-39.16
987,-39.15
988,-39.14
989,-39.15
990,-39.22
991,-39.34
992,-39.44
993,-39.51
994,-39.54
995,-39.60
996,-39.68
997,-39.74
998,-39.76
999,-39.76
1000,-39.77
1001,-39.76
1002,-39.73
1003,-39.67
1004,-39.65
1005,-39.64
1006,-39.61
1007,-39.56
1008,-39.51
1009,-39.51
1010,-39.52
1011,-39.52
1012,-39.54
1013,-39.60
1014,-39.70
1015,-39.82
1016,-39.94
1017,-40.06
1018,-40.18
1019,-40.30
1020,-40.43
1021,-40.54
1022,-40.65
1023,-40.70
1024,-40.70
1025,-40.65
1026,-40.55
1027,-40.43
1028,-40.30
1029,-40.18
1030,-40.06
1031,-39.94
1032,-39.82
1033,-39.70
1034,-39.60
1035,-39.54
1036,-39.51
1037,-39.45
1038,-39.34
1039,-39.22
1040,-39.13
1041,-39.07
1042,-39.00
1043,-38.89
1044,-38.74
1045,-38.61
1046,-38.52
1047,-38.47
1048,-38.45
1049,-38.45
1050,-38.44
1051,-38.44
1052,-38.48
1053,-38.53
1054,-38.60
1055,-38.66
1056,-38.72
1057,-38.78
1058,-38.85
1059,-38.89
1060,-38.94
1061,-39.01
1062,-39.12
1063,-39.24
1064,-39.29
1065,-39.29
1066,-39.31
1067,-39.37
1068,-39.43
1069,-39.44
1070,-39.37
1071,-39.31
1072,-39.28
1073,-39.28
1074,-39.26
1075,-39.20
1076,-39.15
1077,-39.15
1078,-39.18
1079,-39.18
1080,-39.13
1081,-39.08
1082,-39.04
1083,-39.04
1084,-39.05
1085,-39.05
1086,-39.05
1087,-39.05
1088,-39.03
1089,-39.04
1090,-39.09
1091,-39.14
1092,-39.15
1093,-39.15
1094,-39.22
1095,-39.33
1096,-39.44
1097,-39.51
1098,-39.56
1099,-39.61
1100,-39.66
1101,-39.67
1102,-39.62
1103,-39.56
1104,-39.49
1105,-39.44
1106,-39.38
1107,-39.31
1108,-39.25
1109,-39.19
1110,-39.13
1111,-39.07
1112,-39.02
1113,-39.03
1114,-39.08
1115,-39.13
1116,-39.17
1117,-39.24
1118,-39.38
1119,-39.54
1120,-39.70
1121,-39.83
1122,-39.98
1123,-40.14
1124,-40.30
1125,-40.42
1126,-40.57
1127,-40.73
1128,-40.91
1129,-41.02
1130,-41.12
1131,-41.24
1132,-41.38
1133,-41.50
1134,-41.58
1135,-41.63
1136,-41.73
1137,-41.84
1138,-41.93
1139,-42.00
1140,-42.09
1141,-42.20
1142,-42.29
1143,-42.36
1144,-42.44
1145,-42.56
1146,-42.66
1147,-42.72
1148,-42.77
1149,-42.82
1150,-42.89
1151,-42.95
1152,-42.98
1153,-42.98
1154,-42.98
1155,-42.98
1156,-42.97
1157,-42.98
1158,-43.00
1159,-43.05
1160,-43.12
1161,-43.19
1162,-43.25
1163,-43.31
1164,-43.35
1165,-43.36
1166,-43.32
1167,-43.26
1168,-43.17
1169,-43.05
1170,-42.89
1171,-42.72
1172,-42.53
1173,-42.35
1174,-42.16
1175,-41.98
1176,-41.84
1177,-41.72
1178,-41.60
1179,-41.49
1180,-41.40
1181,-41.33
1182,-41.27
1183,-41.21
1184,-41.19
1185,-41.19
1186,-41.17
1187,-41.11
1188,-41.05
1189,-41.14
1190,-41.03
1191,-40.77
1192,-40.50
1193,-42.02
1194,-42.24
1195,-38.54
1196,-35.72
1197,-42.97
1198,-52.66
1199,-40.34
1200,-10.72
