1,-187.68
2,-250.00
3,-250.00
4,-250.00
5,-250.00
6,-186.90
7,-31.94
8,136.89
9,237.60
10,249.99
11,249.99
12,246.18
13,248.59
14,249.99
15,249.99
16,249.99
17,249.45
18,249.99
19,249.99
20,249.99
21,249.99
22,249.99
23,249.99
24,249.99
25,249.99
26,249.99
27,249.99
28,249.99
29,249.99
30,249.99
31,249.99
32,249.99
33,249.99
34,249.99
35,249.99
36,249.99
37,249.99
38,249.99
39,249.99
40,249.99
41,249.99
42,249.99
43,249.99
44,249.99
45,249.99
46,249.99
47,249.99
48,249.99
49,249.99
50,249.99
51,249.99
52,249.99
53,249.99
54,249.99
55,249.99
56,249.99
57,249.99
58,249.99
59,249.99
60,249.99
61,249.99
62,249.99
63,249.99
64,249.99
65,249.99
66,249.99
67,249.99
68,249.99
69,249.99
70,249.99
71,249.99
72,249.99
73,249.99
74,249.99
75,249.99
76,249.99
77,249.92
78,249.45
79,248.74
80,247.99
81,247.38
82,246.86
83,246.41
84,245.99
85,245.64
86,245.25
87,244.86
88,244.41
89,244.00
90,243.58
91,243.19
92,242.72
93,242.26
94,241.77
95,241.29
96,240.79
97,240.33
98,239.90
99,239.55
100,239.21
101,238.92
102,238.69
103,238.58
104,238.51
105,238.47
106,238.40
107,238.33
108,238.30
109,238.30
110,238.32
111,238.33
112,238.29
113,238.24
114,238.17
115,238.11
116,238.04
117,237.98
118,237.95
119,237.95
120,237.95
121,237.95
122,237.98
123,238.04
124,238.11
125,238.18
126,238.21
127,238.21
128,238.18
129,238.12
130,238.02
131,237.91
132,237.78
133,237.66
134,237.54
135,237.43
136,237.30
137,237.17
138,237.08
139,237.02
140,237.00
141,237.01
142,237.01
143,237.01
144,237.01
145,237.08
146,237.20
147,237.31
148,237.36
149,237.37
150,237.40
151,237.45
152,237.47
153,237.41
154,237.33
155,237.26
156,237.21
157,237.16
158,237.09
159,237.03
160,237.00
161,236.99
162,237.02
163,237.08
164,237.18
165,237.30
166,237.40
167,237.53
168,237.70
169,237.88
170,238.00
171,238.07
172,238.11
173,238.17
174,238.22
175,238.22
176,238.17
177,238.11
178,238.05
179,237.98
180,237.92
181,237.86
182,237.85
183,237.85
184,237.81
185,237.75
186,237.72
187,237.72
188,237.70
189,237.65
190,237.56
191,237.50
192,237.46
193,237.40
194,237.30
195,237.17
196,237.11
197,237.11
198,237.13
199,237.14
200,237.12
201,237.11
202,237.14
203,237.21
204,237.30
205,237.35
206,237.34
207,237.30
208,237.21
209,237.09
210,236.89
211,236.66
212,236.43
213,236.19
214,235.89
215,235.53
216,235.17
217,234.87
218,234.61
219,234.38
220,234.16
221,233.99
222,233.85
223,233.73
224,233.60
225,233.48
226,233.42
227,233.42
228,233.43
229,233.44
230,233.46
231,233.51
232,233.57
233,233.64
234,233.73
235,233.84
236,233.97
237,234.09
238,234.21
239,234.32
240,234.44
241,234.57
242,234.70
243,234.82
244,234.90
245,234.95
246,235.02
247,235.08
248,235.12
249,235.12
250,235.09
251,235.09
252,235.14
253,235.20
254,235.23
255,235.24
256,235.23
257,235.23
258,235.21
259,235.15
260,235.07
261,235.01
262,234.95
263,234.91
264,234.82
265,234.70
266,234.57
267,234.44
268,234.32
269,234.21
270,234.10
271,233.98
272,233.82
273,233.64
274,233.48
275,233.37
276,233.26
277,233.15
278,233.01
279,232.89
280,232.80
281,232.74
282,232.68
283,232.63
284,232.59
285,232.59
286,232.60
287,232.60
288,232.60
289,232.60
290,232.58
291,232.59
292,232.64
293,232.70
294,232.70
295,232.65
296,232.58
297,232.52
298,232.41
299,232.24
300,232.03
301,231.85
302,231.68
303,231.51
304,231.31
305,231.13
306,230.99
307,230.87
308,230.74
309,230.62
310,230.55
311,230.55
312,230.61
313,230.67
314,230.72
315,230.77
316,230.87
317,230.99
318,231.12
319,231.24
320,231.35
321,231.47
322,231.59
323,231.72
324,231.83
325,231.89
326,231.88
327,231.82
328,231.73
329,231.61
330,231.44
331,231.21
332,230.92
333,230.63
334,230.31
335,229.96
336,229.52
337,229.05
338,228.55
339,228.08
340,227.58
341,227.12
342,226.66
343,226.26
344,225.84
345,225.43
346,225.01
347,224.66
348,224.36
349,224.13
350,223.92
351,223.75
352,223.59
353,223.46
354,223.40
355,223.41
356,223.46
357,223.53
358,223.56
359,223.63
360,223.75
361,223.93
362,224.09
363,224.21
364,224.35
365,224.52
366,224.72
367,224.90
368,225.07
369,225.24
370,225.44
371,225.62
372,225.76
373,225.88
374,226.02
375,226.19
376,226.39
377,226.56
378,226.74
379,226.91
380,227.11
381,227.28
382,227.43
383,227.55
384,227.67
385,227.78
386,227.87
387,227.94
388,228.00
389,228.06
390,228.10
391,228.10
392,228.08
393,228.07
394,228.10
395,228.10
396,228.05
397,227.99
398,227.94
399,227.94
400,227.97
401,227.97
402,227.94
403,227.94
404,228.00
405,228.12
406,228.26
407,228.38
408,228.49
409,228.60
410,228.76
411,228.94
412,229.12
413,229.29
414,229.48
415,229.66
416,229.81
417,229.93
418,230.05
419,230.16
420,230.26
421,230.31
422,230.38
423,230.49
424,230.66
425,230.83
426,231.04
427,231.25
428,231.56
429,231.90
430,232.35
431,232.80
432,233.35
433,233.92
434,234.63
435,235.38
436,236.24
437,237.12
438,238.11
439,239.09
440,240.15
441,241.21
442,242.36
443,243.47
444,244.57
445,245.57
446,246.57
447,247.51
448,248.40
449,249.11
450,249.65
451,249.94
452,249.99
453,249.99
454,249.99
455,249.99
456,249.99
457,249.99
458,249.99
459,249.99
460,249.99
461,249.99
462,249.97
463,249.79
464,249.44
465,248.96
466,248.37
467,247.80
468,247.21
469,246.62
470,245.94
471,245.24
472,244.52
473,243.88
474,243.21
475,242.58
476,241.94
477,241.42
478,240.92
479,240.47
480,239.97
481,239.50
482,239.03
483,238.63
484,238.24
485,237.90
486,237.53
487,237.18
488,236.84
489,236.55
490,236.27
491,236.05
492,235.82
493,235.65
494,235.51
495,235.39
496,235.26
497,235.15
498,235.08
499,235.08
500,235.09
501,235.10
502,235.12
503,235.18
504,235.24
505,235.31
506,235.39
507,235.50
508,235.63
509,235.76
510,235.89
511,235.99
512,236.11
513,236.23
514,236.36
515,236.48
516,236.56
517,236.63
518,236.68
519,236.74
520,236.79
521,236.79
522,236.73
523,236.67
524,236.65
525,236.65
526,236.63
527,236.57
528,236.49
529,236.43
530,236.41
531,236.42
532,236.39
533,236.34
534,236.26
535,236.21
536,236.12
537,236.02
538,235.86
539,235.67
540,235.48
541,235.31
542,235.15
543,234.97
544,234.74
545,234.50
546,234.29
547,234.12
548,233.92
549,233.76
550,233.62
551,233.50
552,233.34
553,233.18
554,233.02
555,232.89
556,232.75
557,232.58
558,232.42
559,232.29
560,232.18
561,232.06
562,231.97
563,231.91
564,231.85
565,231.80
566,231.76
567,231.76
568,231.77
569,231.77
570,231.77
571,231.77
572,231.77
573,231.77
574,231.77
575,231.77
576,231.76
577,231.70
578,231.59
579,231.47
580,231.37
581,231.31
582,231.26
583,231.21
584,231.15
585,231.09
586,231.01
587,230.95
588,230.95
589,231.01
590,231.09
591,231.15
592,231.20
593,231.25
594,231.33
595,231.45
596,231.62
597,231.80
598,231.96
599,232.08
600,232.17
601,232.28
602,232.45
603,232.64
604,232.80
605,232.91
606,233.02
607,233.12
608,233.25
609,233.38
610,233.51
611,233.62
612,233.70
613,233.76
614,233.83
615,233.89
616,233.91
617,233.91
618,233.94
619,233.99
620,234.05
621,234.05
622,234.02
623,234.02
624,234.05
625,234.12
626,234.18
627,234.25
628,234.29
629,234.35
630,234.43
631,234.48
632,234.51
633,234.51
634,234.51
635,234.51
636,234.48
637,234.43
638,234.36
639,234.29
640,234.23
641,234.18
642,234.15
643,234.14
644,234.13
645,234.14
646,234.19
647,234.31
648,234.44
649,234.57
650,234.70
651,234.82
652,234.88
653,234.89
654,234.86
655,234.79
656,234.66
657,234.49
658,234.31
659,234.12
660,233.90
661,233.67
662,233.48
663,233.35
664,233.25
665,233.20
666,233.23
667,233.35
668,233.50
669,233.69
670,233.93
671,234.22
672,234.51
673,234.76
674,234.99
675,235.21
676,235.45
677,235.63
678,235.75
679,235.80
680,235.84
681,235.90
682,235.98
683,236.05
684,236.05
685,235.98
686,235.89
687,235.84
688,235.81
689,235.75
690,235.63
691,235.44
692,235.24
693,235.06
694,234.89
695,234.73
696,234.53
697,234.34
698,234.21
699,234.15
700,234.14
701,234.14
702,234.15
703,234.22
704,234.34
705,234.46
706,234.50
707,234.51
708,234.54
709,234.60
710,234.61
711,234.56
712,234.47
713,234.41
714,234.34
715,234.30
716,234.26
717,234.26
718,234.28
719,234.28
720,234.26
721,234.26
722,234.30
723,234.35
724,234.39
725,234.40
726,234.38
727,234.38
728,234.38
729,234.38
730,234.41
731,234.47
732,234.54
733,234.60
734,234.65
735,234.70
736,234.79
737,234.92
738,235.03
739,235.09
740,235.11
741,235.11
742,235.11
743,235.11
744,235.08
745,235.03
746,234.94
747,234.82
748,234.65
749,234.47
750,234.32
751,234.21
752,234.07
753,233.89
754,233.69
755,233.52
756,233.36
757,233.18
758,232.95
759,232.72
760,232.51
761,232.34
762,232.13
763,231.90
764,231.66
765,231.48
766,231.34
767,231.23
768,231.11
769,230.99
770,230.88
771,230.83
772,230.81
773,230.82
774,230.80
775,230.74
776,230.64
777,230.53
778,230.39
779,230.28
780,230.16
781,230.05
782,229.90
783,229.71
784,229.54
785,229.42
786,229.38
787,229.38
788,229.38
789,229.39
790,229.42
791,229.47
792,229.52
793,229.59
794,229.70
795,229.81
796,229.88
797,229.89
798,229.87
799,229.87
800,229.84
801,229.78
802,229.73
803,229.73
804,229.76
805,229.77
806,229.72
807,229.65
808,229.61
809,229.61
810,229.63
811,229.64
812,229.61
813,229.55
814,229.45
815,229.35
816,229.20
817,229.02
818,228.78
819,228.55
820,228.34
821,228.16
822,227.98
823,227.80
824,227.67
825,227.60
826,227.59
827,227.59
828,227.61
829,227.67
830,227.80
831,227.97
832,228.16
833,228.35
834,228.53
835,228.71
836,228.86
837,228.97
838,229.08
839,229.20
840,229.35
841,229.46
842,229.53
843,229.59
844,229.69
845,229.80
846,229.90
847,229.96
848,230.04
849,230.15
850,230.26
851,230.32
852,230.37
853,230.42
854,230.51
855,230.56
856,230.58
857,230.58
858,230.60
859,230.65
860,230.73
861,230.79
862,230.84
863,230.89
864,230.98
865,231.09
866,231.26
867,231.43
868,231.61
869,231.80
870,231.99
871,232.16
872,232.30
873,232.42
874,232.59
875,232.76
876,232.89
877,232.95
878,232.99
879,233.05
880,233.09
881,233.09
882,233.09
883,233.08
884,233.07
885,233.08
886,233.10
887,233.15
888,233.23
889,233.29
890,233.35
891,233.41
892,233.47
893,233.54
894,233.56
895,233.56
896,233.55
897,233.56
898,233.55
899,233.49
900,233.37
901,233.25
902,233.17
903,233.11
904,233.02
905,232.91
906,232.80
907,232.74
908,232.69
909,232.64
910,232.57
911,232.51
912,232.46
913,232.39
914,232.31
915,232.26
916,232.28
917,232.33
918,232.35
919,232.36
920,232.41
921,232.53
922,232.63
923,232.70
924,232.77
925,232.89
926,233.01
927,233.07
928,233.08
929,233.07
930,233.11
931,233.16
932,233.20
933,233.20
934,233.22
935,233.27
936,233.35
937,233.41
938,233.45
939,233.51
940,233.62
941,233.73
942,233.82
943,233.89
944,233.96
945,234.09
946,234.20
947,234.27
948,234.28
949,234.27
950,234.27
951,234.28
952,234.27
953,234.21
954,234.06
955,233.88
956,233.72
957,233.60
958,233.49
959,233.38
960,233.28
961,233.21
962,233.16
963,233.18
964,233.25
965,233.37
966,233.48
967,233.61
968,233.76
969,233.95
970,234.09
971,234.15
972,234.15
973,234.15
974,234.16
975,234.17
976,234.11
977,233.99
978,233.84
979,233.72
980,233.63
981,233.58
982,233.53
983,233.47
984,233.40
985,233.34
986,233.31
987,233.31
988,233.31
989,233.32
990,233.31
991,233.31
992,233.31
993,233.31
994,233.31
995,233.31
996,233.33
997,233.33
998,233.28
999,233.22
1000,233.18
1001,233.18
1002,233.20
1003,233.20
1004,233.18
1005,233.19
1006,233.21
1007,233.22
1008,233.15
1009,233.03
1010,232.89
1011,232.78
1012,232.66
1013,232.48
1014,232.22
1015,231.92
1016,231.64
1017,231.41
1018,231.15
1019,230.86
1020,230.56
1021,230.32
1022,230.12
1023,229.95
1024,229.79
1025,229.67
1026,229.58
1027,229.53
1028,229.47
1029,229.42
1030,229.36
1031,229.30
1032,229.22
1033,229.17
1034,229.16
1035,229.16
1036,229.10
1037,228.99
1038,228.88
1039,228.81
1040,228.73
1041,228.62
1042,228.52
1043,228.45
1044,228.39
1045,228.27
1046,228.13
1047,228.00
1048,227.92
1049,227.86
1050,227.80
1051,227.75
1052,227.71
1053,227.71
1054,227.72
1055,227.71
1056,227.73
1057,227.79
1058,227.90
1059,228.02
1060,228.13
1061,228.25
1062,228.41
1063,228.58
1064,228.74
1065,228.87
1066,228.97
1067,229.09
1068,229.19
1069,229.26
1070,229.29
1071,229.27
1072,229.27
1073,229.27
1074,229.28
1075,229.27
1076,229.26
1077,229.26
1078,229.31
1079,229.36
1080,229.38
1081,229.38
1082,229.44
1083,229.55
1084,229.66
1085,229.73
1086,229.78
1087,229.84
1088,229.89
1089,229.89
1090,229.84
1091,229.78
1092,229.73
1093,229.66
1094,229.56
1095,229.45
1096,229.35
1097,229.29
1098,229.23
1099,229.18
1100,229.16
1101,229.15
1102,229.12
1103,229.06
1104,229.03
1105,229.02
1106,229.01
1107,228.96
1108,228.88
1109,228.81
1110,228.77
1111,228.71
1112,228.63
1113,228.50
1114,228.36
1115,228.24
1116,228.16
1117,228.10
1118,228.04
1119,227.98
1120,227.95
1121,227.95
1122,227.95
1123,227.96
1124,227.99
1125,228.04
1126,228.10
1127,228.16
1128,228.26
1129,228.37
1130,228.46
1131,228.53
1132,228.61
1133,228.73
1134,228.83
1135,228.90
1136,228.96
1137,229.01
1138,229.02
1139,228.96
1140,228.88
1141,228.81
1142,228.77
1143,228.71
1144,228.64
1145,228.58
1146,228.55
1147,228.55
1148,228.54
1149,228.55
1150,228.61
1151,228.71
1152,228.84
1153,228.97
1154,229.13
1155,229.29
1156,229.44
1157,229.57
1158,229.72
1159,229.89
1160,230.03
1161,230.10
1162,230.14
1163,230.12
1164,230.04
1165,229.93
1166,229.85
1167,229.78
1168,229.66
1169,229.49
1170,229.32
1171,229.19
1172,229.08
1173,228.97
1174,228.87
1175,228.81
1176,228.76
1177,228.71
1178,228.65
1179,228.58
1180,228.51
1181,228.45
1182,228.43
1183,228.43
1184,228.42
1185,228.36
1186,228.28
1187,228.23
1188,228.17
1189,228.97
1190,228.65
1191,227.38
1192,226.18
1193,229.10
1194,232.64
1195,229.10
1196,219.37
1197,222.31
1198,242.11
1199,248.73
1200,189.44
