1,163.86
2,246.48
3,249.99
4,249.46
5,241.71
6,249.94
7,249.99
8,248.25
9,228.94
10,200.08
11,161.56
12,121.22
13,87.16
14,67.44
15,64.67
16,79.89
17,112.58
18,156.18
19,200.62
20,232.60
21,248.02
22,249.99
23,249.99
24,249.99
25,247.48
26,229.84
27,197.57
28,156.88
29,115.04
30,74.65
31,37.51
32,6.38
33,-13.79
34,-22.51
35,-20.39
36,-12.08
37,-0.43
38,9.58
39,16.58
40,18.53
41,17.33
42,13.84
43,10.75
44,8.89
45,8.93
46,10.35
47,12.24
48,13.87
49,14.53
50,14.28
51,13.37
52,12.37
53,11.68
54,11.45
55,11.67
56,12.18
57,12.79
58,13.31
59,13.60
60,13.72
61,13.69
62,13.65
63,13.63
64,13.74
65,13.97
66,14.36
67,14.82
68,15.39
69,15.98
70,16.62
71,17.20
72,17.73
73,18.13
74,18.50
75,18.84
76,19.22
77,19.56
78,19.93
79,20.26
80,20.67
81,21.07
82,21.51
83,21.92
84,22.33
85,22.74
86,23.21
87,23.67
88,24.11
89,24.39
90,24.59
91,24.69
92,24.82
93,24.96
94,25.25
95,25.65
96,26.28
97,27.04
98,27.95
99,28.83
100,29.69
101,30.46
102,31.17
103,31.74
104,32.24
105,32.65
106,33.07
107,33.39
108,33.68
109,33.84
110,34.00
111,34.10
112,34.16
113,34.15
114,34.18
115,34.28
116,34.50
117,34.80
118,35.19
119,35.66
120,36.21
121,36.80
122,37.47
123,38.12
124,38.73
125,39.21
126,39.55
127,39.71
128,39.74
129,39.60
130,39.39
131,39.14
132,38.96
133,38.88
134,38.96
135,39.20
136,39.63
137,40.16
138,40.72
139,41.20
140,41.62
141,41.96
142,42.27
143,42.56
144,42.93
145,43.38
146,43.98
147,44.62
148,45.36
149,46.07
150,46.72
151,47.18
152,47.52
153,47.74
154,47.94
155,48.10
156,48.28
157,48.45
158,48.68
159,48.90
160,49.13
161,49.29
162,49.49
163,49.77
164,50.23
165,50.87
166,51.76
167,52.83
168,54.08
169,55.34
170,56.47
171,57.31
172,57.85
173,58.06
174,58.05
175,57.91
176,57.82
177,57.81
178,57.88
179,57.93
180,58.00
181,58.03
182,58.11
183,58.15
184,58.23
185,58.32
186,58.57
187,59.04
188,59.80
189,60.74
190,61.84
191,62.97
192,64.16
193,65.27
194,66.31
195,67.19
196,68.02
197,68.77
198,69.53
199,70.18
200,70.76
201,71.21
202,71.64
203,72.04
204,72.49
205,72.89
206,73.27
207,73.58
208,73.79
209,73.85
210,73.71
211,73.36
212,72.81
213,72.15
214,71.38
215,70.62
216,69.89
217,69.24
218,68.58
219,67.89
220,67.07
221,66.20
222,65.19
223,64.13
224,62.97
225,61.91
226,60.97
227,60.27
228,59.72
229,59.34
230,58.98
231,58.64
232,58.20
233,57.69
234,57.02
235,56.32
236,55.55
237,54.85
238,54.18
239,53.60
240,53.03
241,52.51
242,51.99
243,51.53
244,51.06
245,50.59
246,50.06
247,49.53
248,49.02
249,48.61
250,48.25
251,47.97
252,47.71
253,47.55
254,47.44
255,47.45
256,47.55
257,47.74
258,47.93
259,48.07
260,48.08
261,47.97
262,47.67
263,47.20
264,46.55
265,45.77
266,44.91
267,44.14
268,43.50
269,43.10
270,42.86
271,42.82
272,42.89
273,43.03
274,43.09
275,43.05
276,42.85
277,42.56
278,42.15
279,41.69
280,41.13
281,40.53
282,39.90
283,39.31
284,38.79
285,38.37
286,38.02
287,37.80
288,37.68
289,37.69
290,37.72
291,37.73
292,37.70
293,37.63
294,37.54
295,37.48
296,37.51
297,37.61
298,37.82
299,38.12
300,38.55
301,39.09
302,39.68
303,40.22
304,40.68
305,41.02
306,41.31
307,41.54
308,41.76
309,41.93
310,42.08
311,42.19
312,42.34
313,42.50
314,42.71
315,42.89
316,43.04
317,43.09
318,43.03
319,42.85
320,42.61
321,42.37
322,42.14
323,42.05
324,42.03
325,42.11
326,42.14
327,42.11
328,41.91
329,41.57
330,40.96
331,40.09
332,38.89
333,37.52
334,36.03
335,34.61
336,33.26
337,32.09
338,31.01
339,30.17
340,29.37
341,28.69
342,27.92
343,27.13
344,26.15
345,25.12
346,23.86
347,22.51
348,21.02
349,19.62
350,18.26
351,17.10
352,15.96
353,15.00
354,14.06
355,13.20
356,12.18
357,11.09
358,9.83
359,8.59
360,7.30
361,6.14
362,5.07
363,4.20
364,3.37
365,2.62
366,1.86
367,1.16
368,0.45
369,-0.19
370,-0.77
371,-1.19
372,-1.41
373,-1.41
374,-1.20
375,-0.85
376,-0.37
377,0.15
378,0.76
379,1.34
380,1.93
381,2.50
382,3.20
383,4.01
384,5.02
385,6.08
386,7.22
387,8.27
388,9.29
389,10.16
390,10.97
391,11.60
392,12.15
393,12.53
394,12.89
395,13.21
396,13.69
397,14.24
398,15.04
399,16.02
400,17.36
401,18.88
402,20.58
403,22.23
404,23.95
405,25.52
406,26.99
407,28.21
408,29.40
409,30.50
410,31.62
411,32.61
412,33.59
413,34.46
414,35.27
415,35.85
416,36.23
417,36.32
418,36.25
419,36.04
420,35.86
421,35.73
422,35.71
423,35.77
424,35.87
425,35.93
426,35.93
427,35.80
428,35.56
429,35.26
430,34.97
431,34.77
432,34.73
433,34.84
434,35.16
435,35.57
436,36.04
437,36.51
438,37.04
439,37.56
440,38.08
441,38.54
442,39.07
443,39.65
444,40.32
445,40.95
446,41.63
447,42.33
448,43.17
449,44.05
450,44.94
451,45.70
452,46.42
453,46.98
454,47.45
455,47.73
456,47.96
457,48.10
458,48.29
459,48.57
460,49.10
461,49.80
462,50.62
463,51.39
464,52.16
465,52.86
466,53.50
467,53.96
468,54.31
469,54.53
470,54.75
471,54.91
472,55.05
473,55.16
474,55.32
475,55.48
476,55.66
477,55.76
478,55.88
479,56.04
480,56.34
481,56.67
482,57.08
483,57.48
484,57.98
485,58.49
486,59.07
487,59.65
488,60.36
489,61.17
490,62.15
491,63.16
492,64.18
493,65.07
494,65.80
495,66.28
496,66.50
497,66.42
498,66.15
499,65.77
500,65.44
501,65.25
502,65.25
503,65.44
504,65.77
505,66.15
506,66.41
507,66.48
508,66.31
509,65.88
510,65.22
511,64.45
512,63.67
513,63.01
514,62.45
515,62.06
516,61.78
517,61.61
518,61.43
519,61.22
520,60.88
521,60.48
522,59.93
523,59.35
524,58.74
525,58.22
526,57.71
527,57.25
528,56.79
529,56.39
530,55.98
531,55.59
532,55.06
533,54.49
534,53.82
535,53.12
536,52.28
537,51.41
538,50.48
539,49.67
540,48.90
541,48.28
542,47.68
543,47.17
544,46.60
545,45.97
546,45.14
547,44.15
548,42.92
549,41.56
550,40.05
551,38.63
552,37.35
553,36.42
554,35.76
555,35.44
556,35.27
557,35.25
558,35.18
559,35.10
560,34.83
561,34.43
562,33.82
563,33.12
564,32.32
565,31.56
566,30.80
567,30.09
568,29.40
569,28.82
570,28.33
571,27.98
572,27.70
573,27.55
574,27.44
575,27.40
576,27.30
577,27.13
578,26.86
579,26.50
580,26.05
581,25.56
582,25.14
583,24.89
584,24.86
585,24.98
586,25.20
587,25.49
588,25.92
589,26.44
590,27.08
591,27.79
592,28.62
593,29.50
594,30.46
595,31.33
596,32.17
597,32.93
598,33.72
599,34.48
600,35.25
601,35.93
602,36.67
603,37.43
604,38.28
605,39.03
606,39.71
607,40.23
608,40.70
609,41.09
610,41.47
611,41.82
612,42.24
613,42.69
614,43.23
615,43.75
616,44.33
617,44.85
618,45.35
619,45.76
620,46.12
621,46.41
622,46.66
623,46.90
624,47.16
625,47.47
626,47.75
627,47.94
628,47.97
629,47.80
630,47.39
631,46.74
632,45.82
633,44.76
634,43.56
635,42.38
636,41.18
637,40.06
638,38.98
639,38.06
640,37.17
641,36.36
642,35.47
643,34.60
644,33.70
645,32.88
646,32.07
647,31.37
648,30.77
649,30.36
650,30.08
651,29.92
652,29.83
653,29.84
654,29.88
655,29.96
656,29.98
657,29.94
658,29.77
659,29.53
660,29.25
661,29.01
662,28.82
663,28.71
664,28.67
665,28.73
666,28.87
667,29.07
668,29.22
669,29.22
670,29.02
671,28.66
672,28.21
673,27.79
674,27.41
675,27.11
676,26.92
677,26.86
678,26.93
679,27.12
680,27.38
681,27.69
682,27.98
683,28.28
684,28.59
685,28.90
686,29.13
687,29.19
688,29.07
689,28.76
690,28.34
691,27.84
692,27.36
693,26.92
694,26.64
695,26.57
696,26.78
697,27.19
698,27.77
699,28.42
700,29.17
701,29.93
702,30.70
703,31.39
704,32.14
705,32.95
706,33.95
707,35.00
708,36.15
709,37.26
710,38.44
711,39.55
712,40.63
713,41.56
714,42.47
715,43.27
716,44.08
717,44.78
718,45.42
719,45.87
720,46.23
721,46.45
722,46.64
723,46.74
724,46.79
725,46.78
726,46.78
727,46.84
728,46.97
729,47.08
730,47.16
731,47.22
732,47.29
733,47.42
734,47.56
735,47.69
736,47.75
737,47.76
738,47.69
739,47.58
740,47.40
741,47.17
742,46.84
743,46.43
744,45.91
745,45.34
746,44.62
747,43.81
748,42.81
749,41.81
750,40.83
751,40.02
752,39.25
753,38.62
754,38.05
755,37.61
756,37.09
757,36.48
758,35.57
759,34.51
760,33.31
761,32.19
762,31.13
763,30.25
764,29.52
765,29.05
766,28.81
767,28.77
768,28.79
769,28.81
770,28.74
771,28.61
772,28.47
773,28.41
774,28.49
775,28.72
776,29.11
777,29.65
778,30.35
779,31.12
780,31.90
781,32.55
782,33.11
783,33.50
784,33.81
785,34.02
786,34.29
787,34.63
788,35.14
789,35.71
790,36.40
791,37.09
792,37.89
793,38.64
794,39.39
795,40.03
796,40.67
797,41.30
798,42.02
799,42.79
800,43.62
801,44.40
802,45.08
803,45.60
804,46.02
805,46.31
806,46.51
807,46.55
808,46.49
809,46.36
810,46.27
811,46.21
812,46.13
813,46.02
814,45.90
815,45.84
816,45.81
817,45.83
818,45.82
819,45.78
820,45.60
821,45.27
822,44.68
823,43.91
824,42.95
825,41.95
826,40.90
827,39.90
828,38.89
829,37.96
830,37.03
831,36.16
832,35.20
833,34.22
834,33.13
835,32.14
836,31.18
837,30.36
838,29.60
839,28.98
840,28.38
841,27.86
842,27.31
843,26.80
844,26.26
845,25.80
846,25.36
847,25.02
848,24.73
849,24.56
850,24.46
851,24.41
852,24.33
853,24.15
854,23.87
855,23.50
856,23.11
857,22.80
858,22.67
859,22.72
860,22.96
861,23.38
862,23.99
863,24.64
864,25.26
865,25.73
866,26.13
867,26.52
868,27.02
869,27.60
870,28.34
871,29.14
872,30.12
873,31.12
874,32.17
875,33.10
876,34.00
877,34.80
878,35.66
879,36.59
880,37.72
881,38.89
882,40.09
883,41.17
884,42.16
885,42.91
886,43.41
887,43.64
888,43.75
889,43.79
890,43.79
891,43.72
892,43.69
893,43.68
894,43.66
895,43.54
896,43.33
897,43.09
898,42.88
899,42.76
900,42.71
901,42.74
902,42.75
903,42.71
904,42.45
905,42.00
906,41.28
907,40.40
908,39.30
909,38.12
910,36.88
911,35.77
912,34.71
913,33.78
914,32.88
915,32.07
916,31.25
917,30.50
918,29.69
919,28.88
920,27.95
921,27.02
922,26.04
923,25.17
924,24.35
925,23.64
926,22.97
927,22.46
928,22.06
929,21.77
930,21.48
931,21.26
932,21.13
933,21.19
934,21.38
935,21.63
936,21.91
937,22.26
938,22.71
939,23.19
940,23.64
941,23.99
942,24.31
943,24.59
944,24.90
945,25.25
946,25.70
947,26.22
948,26.86
949,27.51
950,28.16
951,28.75
952,29.31
953,29.78
954,30.17
955,30.40
956,30.53
957,30.56
958,30.62
959,30.73
960,30.94
961,31.18
962,31.39
963,31.52
964,31.53
965,31.42
966,31.14
967,30.72
968,30.22
969,29.79
970,29.51
971,29.40
972,29.39
973,29.40
974,29.37
975,29.27
976,29.01
977,28.59
978,28.02
979,27.43
980,26.88
981,26.41
982,25.92
983,25.47
984,25.02
985,24.60
986,24.12
987,23.61
988,23.05
989,22.58
990,22.16
991,21.81
992,21.48
993,21.19
994,20.90
995,20.61
996,20.29
997,20.00
998,19.74
999,19.63
1000,19.67
1001,19.86
1002,20.10
1003,20.36
1004,20.57
1005,20.75
1006,20.87
1007,20.87
1008,20.75
1009,20.57
1010,20.37
1011,20.20
1012,20.00
1013,19.84
1014,19.68
1015,19.51
1016,19.25
1017,18.91
1018,18.46
1019,17.98
1020,17.44
1021,16.92
1022,16.42
1023,16.01
1024,15.64
1025,15.30
1026,14.91
1027,14.51
1028,14.03
1029,13.52
1030,12.86
1031,12.16
1032,11.39
1033,10.70
1034,10.01
1035,9.38
1036,8.67
1037,8.00
1038,7.23
1039,6.42
1040,5.42
1041,4.36
1042,3.26
1043,2.26
1044,1.28
1045,0.43
1046,-0.40
1047,-1.09
1048,-1.79
1049,-2.40
1050,-3.07
1051,-3.69
1052,-4.43
1053,-5.20
1054,-6.01
1055,-6.71
1056,-7.30
1057,-7.76
1058,-8.22
1059,-8.61
1060,-8.95
1061,-9.17
1062,-9.43
1063,-9.69
1064,-10.05
1065,-10.44
1066,-11.05
1067,-11.86
1068,-12.93
1069,-14.06
1070,-15.21
1071,-16.21
1072,-17.11
1073,-17.73
1074,-18.14
1075,-18.30
1076,-18.39
1077,-18.48
1078,-18.66
1079,-18.89
1080,-19.25
1081,-19.65
1082,-20.10
1083,-20.50
1084,-20.93
1085,-21.39
1086,-21.97
1087,-22.61
1088,-23.35
1089,-24.12
1090,-24.94
1091,-25.71
1092,-26.39
1093,-26.86
1094,-27.15
1095,-27.19
1096,-27.07
1097,-26.79
1098,-26.54
1099,-26.34
1100,-26.31
1101,-26.35
1102,-26.47
1103,-26.65
1104,-26.97
1105,-27.36
1106,-27.81
1107,-28.28
1108,-28.92
1109,-29.66
1110,-30.54
1111,-31.49
1112,-32.62
1113,-33.84
1114,-35.16
1115,-36.33
1116,-37.47
1117,-38.44
1118,-39.38
1119,-40.19
1120,-41.02
1121,-41.82
1122,-42.74
1123,-43.68
1124,-44.69
1125,-45.68
1126,-46.73
1127,-47.68
1128,-48.48
1129,-48.94
1130,-49.10
1131,-48.97
1132,-48.65
1133,-48.16
1134,-47.52
1135,-46.81
1136,-46.12
1137,-45.59
1138,-45.18
1139,-44.98
1140,-44.85
1141,-44.88
1142,-44.89
1143,-44.88
1144,-44.62
1145,-44.07
1146,-43.00
1147,-41.54
1148,-39.62
1149,-37.56
1150,-35.34
1151,-33.29
1152,-31.33
1153,-29.72
1154,-28.22
1155,-26.92
1156,-25.44
1157,-23.91
1158,-22.01
1159,-20.00
1160,-17.57
1161,-15.01
1162,-12.10
1163,-9.24
1164,-6.26
1165,-3.52
1166,-0.79
1167,1.63
1168,4.03
1169,6.03
1170,7.91
1171,9.45
1172,11.04
1173,12.50
1174,14.14
1175,15.82
1176,17.84
1177,19.92
1178,22.16
1179,24.22
1180,26.24
1181,27.97
1182,29.55
1183,30.75
1184,31.85
1185,32.80
1186,33.88
1187,34.97
1188,36.22
1189,37.45
1190,38.72
1191,39.76
1192,40.63
1193,41.20
1194,41.63
1195,41.89
1196,42.12
1197,42.34
1198,42.69
1199,43.14
1200,43.73
1201,44.33
1202,44.94
1203,45.39
1204,45.70
1205,45.86
1206,46.05
1207,46.26
1208,46.53
1209,46.81
1210,47.25
1211,47.76
1212,48.38
1213,48.96
1214,49.61
1215,50.29
1216,51.12
1217,52.06
1218,53.17
1219,54.36
1220,55.63
1221,56.75
1222,57.69
1223,58.32
1224,58.77
1225,59.04
1226,59.27
1227,59.42
1228,59.60
1229,59.83
1230,60.20
1231,60.61
1232,60.98
1233,61.22
1234,61.37
1235,61.40
1236,61.38
1237,61.30
1238,61.33
1239,61.47
1240,61.84
1241,62.39
1242,63.12
1243,63.94
1244,64.81
1245,65.65
1246,66.47
1247,67.18
1248,67.73
1249,68.08
1250,68.32
1251,68.47
1252,68.63
1253,68.74
1254,68.87
1255,68.97
1256,69.10
1257,69.27
1258,69.56
1259,69.98
1260,70.49
1261,71.04
1262,71.56
1263,71.98
1264,72.20
1265,72.16
1266,71.83
1267,71.21
1268,70.37
1269,69.47
1270,68.68
1271,68.13
1272,67.83
1273,67.80
1274,67.96
1275,68.21
1276,68.37
1277,68.34
1278,68.00
1279,67.47
1280,66.76
1281,66.06
1282,65.38
1283,64.85
1284,64.42
1285,64.16
1286,63.93
1287,63.72
1288,63.33
1289,62.81
1290,62.16
1291,61.51
1292,60.84
1293,60.27
1294,59.75
1295,59.41
1296,59.17
1297,59.03
1298,58.78
1299,58.40
1300,57.72
1301,56.85
1302,55.70
1303,54.41
1304,52.93
1305,51.53
1306,50.18
1307,49.08
1308,48.07
1309,47.23
1310,46.34
1311,45.43
1312,44.22
1313,42.85
1314,41.16
1315,39.39
1316,37.45
1317,35.64
1318,33.94
1319,32.61
1320,31.42
1321,30.48
1322,29.53
1323,28.63
1324,27.44
1325,26.14
1326,24.56
1327,22.98
1328,21.23
1329,19.63
1330,18.05
1331,16.72
1332,15.37
1333,14.07
1334,12.55
1335,10.99
1336,9.16
1337,7.23
1338,5.09
1339,3.09
1340,1.22
1341,-0.29
1342,-1.60
1343,-2.57
1344,-3.33
1345,-3.83
1346,-4.33
1347,-4.83
1348,-5.42
1349,-5.95
1350,-6.45
1351,-6.77
1352,-7.00
1353,-7.04
1354,-6.99
1355,-6.91
1356,-6.95
1357,-7.10
1358,-7.43
1359,-7.92
1360,-8.57
1361,-9.22
1362,-9.76
1363,-10.06
1364,-10.18
1365,-10.15
1366,-10.06
1367,-9.91
1368,-9.88
1369,-9.97
1370,-10.28
1371,-10.68
1372,-11.22
1373,-11.79
1374,-12.50
1375,-13.24
1376,-14.12
1377,-15.05
1378,-16.17
1379,-17.40
1380,-18.78
1381,-20.13
1382,-21.52
1383,-22.80
1384,-24.09
1385,-25.24
1386,-26.41
1387,-27.50
1388,-28.71
1389,-29.92
1390,-31.28
1391,-32.55
1392,-33.84
1393,-35.00
1394,-36.19
1395,-37.28
1396,-38.43
1397,-39.52
1398,-40.76
1399,-42.03
1400,-43.46
1401,-44.88
1402,-46.33
1403,-47.62
1404,-48.75
1405,-49.57
1406,-50.19
1407,-50.63
1408,-51.06
1409,-51.46
1410,-51.93
1411,-52.40
1412,-52.86
1413,-53.22
1414,-53.42
1415,-53.37
1416,-53.02
1417,-52.42
1418,-51.61
1419,-50.78
1420,-50.02
1421,-49.37
1422,-48.70
1423,-48.02
1424,-47.25
1425,-46.42
1426,-45.40
1427,-44.30
1428,-43.12
1429,-42.06
1430,-41.04
1431,-40.25
1432,-39.61
1433,-39.23
1434,-38.84
1435,-38.43
1436,-37.74
1437,-36.88
1438,-35.67
1439,-34.28
1440,-32.62
1441,-30.91
1442,-29.08
1443,-27.32
1444,-25.58
1445,-24.07
1446,-22.61
1447,-21.37
1448,-20.08
1449,-18.88
1450,-17.52
1451,-16.27
1452,-14.96
1453,-13.82
1454,-12.58
1455,-11.42
1456,-10.04
1457,-8.61
1458,-6.81
1459,-4.85
1460,-2.53
1461,-0.22
1462,2.33
1463,4.75
1464,7.30
1465,9.60
1466,11.99
1467,14.21
1468,16.73
1469,19.20
1470,21.95
1471,24.60
1472,27.53
1473,30.42
1474,33.60
1475,36.67
1476,39.97
1477,43.15
1478,46.61
1479,49.92
1480,53.37
1481,56.51
1482,59.66
1483,62.43
1484,65.12
1485,67.43
1486,69.73
1487,71.72
1488,73.72
1489,75.45
1490,77.20
1491,78.75
1492,80.25
1493,81.47
1494,82.57
1495,83.41
1496,84.17
1497,84.66
1498,85.04
1499,85.18
1500,85.24
1501,85.14
1502,85.07
1503,85.03
1504,85.24
1505,85.69
1506,86.49
1507,87.55
1508,88.87
1509,90.30
1510,91.81
1511,93.18
1512,94.35
1513,95.24
1514,95.91
1515,96.37
1516,96.70
1517,96.92
1518,97.12
1519,97.30
1520,97.47
1521,97.51
1522,97.41
1523,97.18
1524,96.88
1525,96.50
1526,96.02
1527,95.42
1528,94.81
1529,94.26
1530,93.80
1531,93.44
1532,93.22
1533,93.23
1534,93.44
1535,93.82
1536,94.22
1537,94.60
1538,94.89
1539,95.07
1540,95.09
1541,94.91
1542,94.57
1543,94.20
1544,93.92
1545,93.80
1546,93.83
1547,93.97
1548,94.12
1549,94.26
1550,94.25
1551,94.04
1552,93.49
1553,92.67
1554,91.56
1555,90.38
1556,89.14
1557,88.03
1558,86.98
1559,86.11
1560,85.32
1561,84.63
1562,83.89
1563,83.08
1564,82.08
1565,81.02
1566,79.90
1567,78.90
1568,77.99
1569,77.29
1570,76.77
1571,76.50
1572,76.35
1573,76.31
1574,76.25
1575,76.22
1576,76.14
1577,76.03
1578,75.78
1579,75.45
1580,75.03
1581,74.62
1582,74.14
1583,73.69
1584,73.25
1585,72.90
1586,72.53
1587,72.20
1588,71.86
1589,71.53
1590,71.01
1591,70.33
1592,69.37
1593,68.31
1594,67.12
1595,65.96
1596,64.74
1597,63.62
1598,62.56
1599,61.69
1600,60.90
1601,60.21
1602,59.50
1603,58.87
1604,58.24
1605,57.72
1606,57.24
1607,56.83
1608,56.47
1609,56.18
1610,55.92
1611,55.70
1612,55.44
1613,55.21
1614,55.01
1615,54.89
1616,54.84
1617,54.84
1618,54.89
1619,54.95
1620,55.01
1621,55.06
1622,55.14
1623,55.24
1624,55.45
1625,55.74
1626,56.14
1627,56.62
1628,57.17
1629,57.71
1630,58.17
1631,58.53
1632,58.83
1633,59.05
1634,59.22
1635,59.33
1636,59.51
1637,59.79
1638,60.20
1639,60.62
1640,61.03
1641,61.39
1642,61.68
1643,61.86
1644,61.89
1645,61.84
1646,61.74
1647,61.55
1648,61.23
1649,60.77
1650,60.17
1651,59.52
1652,58.75
1653,57.94
1654,57.07
1655,56.30
1656,55.60
1657,55.03
1658,54.48
1659,53.97
1660,53.36
1661,52.73
1662,52.00
1663,51.31
1664,50.55
1665,49.87
1666,49.18
1667,48.60
1668,48.03
1669,47.53
1670,46.95
1671,46.32
1672,45.51
1673,44.63
1674,43.69
1675,42.85
1676,42.13
1677,41.63
1678,41.24
1679,41.03
1680,40.84
1681,40.70
1682,40.47
1683,40.18
1684,39.73
1685,39.21
1686,38.64
1687,38.12
1688,37.54
1689,36.96
1690,36.38
1691,35.84
1692,35.29
1693,34.77
1694,34.28
1695,33.94
1696,33.68
1697,33.54
1698,33.35
1699,33.14
1700,32.76
1701,32.26
1702,31.49
1703,30.56
1704,29.40
1705,28.23
1706,27.00
1707,25.83
1708,24.61
1709,23.45
1710,22.25
1711,21.16
1712,20.02
1713,18.98
1714,17.90
1715,16.99
1716,16.12
1717,15.38
1718,14.54
1719,13.70
1720,12.70
1721,11.66
1722,10.37
1723,8.98
1724,7.43
1725,5.96
1726,4.48
1727,3.14
1728,1.86
1729,0.82
1730,-0.12
1731,-0.85
1732,-1.54
1733,-2.11
1734,-2.68
1735,-3.19
1736,-3.74
1737,-4.26
1738,-4.80
1739,-5.26
1740,-5.68
1741,-6.03
1742,-6.38
1743,-6.67
1744,-6.90
1745,-7.01
1746,-7.04
1747,-7.04
1748,-7.02
1749,-6.97
1750,-6.83
1751,-6.58
1752,-6.28
1753,-5.97
1754,-5.71
1755,-5.49
1756,-5.23
1757,-4.94
1758,-4.59
1759,-4.23
1760,-3.85
1761,-3.51
1762,-3.17
1763,-2.87
1764,-2.60
1765,-2.44
1766,-2.37
1767,-2.38
1768,-2.36
1769,-2.32
1770,-2.24
1771,-2.13
1772,-1.88
1773,-1.54
1774,-1.11
1775,-0.70
1776,-0.24
1777,0.27
1778,0.91
1779,1.61
1780,2.43
1781,3.26
1782,4.08
1783,4.79
1784,5.39
1785,5.85
1786,6.28
1787,6.62
1788,6.90
1789,7.14
1790,7.40
1791,7.63
1792,7.79
1793,7.79
1794,7.66
1795,7.41
1796,7.07
1797,6.64
1798,6.19
1799,5.82
1800,5.63
1801,5.57
1802,5.56
1803,5.51
1804,5.41
1805,5.28
1806,5.13
1807,5.02
1808,4.99
1809,5.10
1810,5.36
1811,5.79
1812,6.36
1813,6.95
1814,7.49
1815,7.85
1816,8.03
1817,8.02
1818,7.87
1819,7.67
1820,7.59
1821,7.69
1822,8.03
1823,8.50
1824,9.10
1825,9.70
1826,10.24
1827,10.59
1828,10.74
1829,10.72
1830,10.69
1831,10.72
1832,10.93
1833,11.27
1834,11.82
1835,12.52
1836,13.44
1837,14.38
1838,15.29
1839,16.05
1840,16.78
1841,17.46
1842,18.20
1843,18.89
1844,19.68
1845,20.48
1846,21.39
1847,22.25
1848,23.19
1849,24.05
1850,24.94
1851,25.75
1852,26.61
1853,27.40
1854,28.25
1855,28.99
1856,29.77
1857,30.44
1858,31.17
1859,31.85
1860,32.67
1861,33.58
1862,34.77
1863,36.12
1864,37.67
1865,39.21
1866,40.75
1867,42.08
1868,43.32
1869,44.35
1870,45.38
1871,46.28
1872,47.22
1873,48.07
1874,49.07
1875,50.03
1876,51.08
1877,52.04
1878,53.19
1879,54.44
1880,56.02
1881,57.70
1882,59.66
1883,61.64
1884,63.80
1885,65.84
1886,67.90
1887,69.75
1888,71.65
1889,73.43
1890,75.36
1891,77.22
1892,79.20
1893,81.12
1894,83.18
1895,85.10
1896,87.00
1897,88.63
1898,90.15
1899,91.42
1900,92.61
1901,93.59
1902,94.51
1903,95.26
1904,95.92
1905,96.37
1906,96.71
1907,96.89
1908,96.90
1909,96.73
1910,96.34
1911,95.82
1912,95.15
1913,94.38
1914,93.42
1915,92.38
1916,91.20
1917,90.04
1918,88.71
1919,87.33
1920,85.76
1921,84.24
1922,82.63
1923,81.13
1924,79.57
1925,78.13
1926,76.59
1927,75.09
1928,73.43
1929,71.80
1930,70.07
1931,68.44
1932,66.75
1933,65.25
1934,63.82
1935,62.67
1936,61.58
1937,60.68
1938,59.77
1939,58.91
1940,57.90
1941,56.93
1942,55.94
1943,55.12
1944,54.35
1945,53.74
1946,53.16
1947,52.65
1948,52.02
1949,51.28
1950,50.32
1951,49.31
1952,48.27
1953,47.39
1954,46.65
1955,46.13
1956,45.76
1957,45.61
1958,45.59
1959,45.67
1960,45.70
1961,45.65
1962,45.49
1963,45.32
1964,45.12
1965,44.89
1966,44.57
1967,44.22
1968,43.86
1969,43.50
1970,43.11
1971,42.69
1972,42.30
1973,41.99
1974,41.79
1975,41.74
1976,41.86
1977,42.17
1978,42.57
1979,43.01
1980,43.37
1981,43.56
1982,43.50
1983,43.14
1984,42.50
1985,41.72
1986,40.89
1987,40.11
1988,39.40
1989,38.87
1990,38.55
1991,38.46
1992,38.41
1993,38.32
1994,38.06
1995,37.71
1996,37.25
1997,36.80
1998,36.27
1999,35.75
2000,35.17
2001,34.60
2002,33.94
2003,33.25
2004,32.42
2005,31.53
2006,30.59
2007,29.71
2008,28.85
2009,28.09
2010,27.37
2011,26.80
2012,26.29
2013,25.90
2014,25.48
2015,25.09
2016,24.62
2017,24.17
2018,23.65
2019,23.14
2020,22.52
2021,21.90
2022,21.16
2023,20.40
2024,19.53
2025,18.66
2026,17.77
2027,16.94
2028,16.11
2029,15.42
2030,14.86
2031,14.52
2032,14.23
2033,14.03
2034,13.84
2035,13.68
2036,13.37
2037,12.92
2038,12.27
2039,11.56
2040,10.76
2041,9.94
2042,9.09
2043,8.30
2044,7.64
2045,7.17
2046,6.87
2047,6.70
2048,6.58
2049,6.52
2050,6.55
2051,6.67
2052,6.84
2053,7.00
2054,7.24
2055,7.58
2056,8.13
2057,8.76
2058,9.51
2059,10.27
2060,11.16
2061,12.08
2062,13.08
2063,14.08
2064,15.23
2065,16.45
2066,17.79
2067,19.09
2068,20.42
2069,21.64
2070,22.82
2071,23.75
2072,24.53
2073,25.09
2074,25.60
2075,25.99
2076,26.35
2077,26.62
2078,26.96
2079,27.35
2080,27.87
2081,28.40
2082,28.96
2083,29.47
2084,30.01
2085,30.54
2086,31.09
2087,31.56
2088,31.94
2089,32.23
2090,32.52
2091,32.80
2092,33.11
2093,33.39
2094,33.74
2095,34.14
2096,34.66
2097,35.26
2098,35.93
2099,36.58
2100,37.18
2101,37.67
2102,38.02
2103,38.20
2104,38.16
2105,37.92
2106,37.54
2107,37.12
2108,36.67
2109,36.21
2110,35.66
2111,35.01
2112,34.22
2113,33.39
2114,32.55
2115,31.78
2116,31.03
2117,30.40
2118,29.86
2119,29.51
2120,29.27
2121,29.17
2122,29.17
2123,29.31
2124,29.46
2125,29.60
2126,29.63
2127,29.53
2128,29.18
2129,28.59
2130,27.76
2131,26.80
2132,25.79
2133,24.83
2134,23.96
2135,23.25
2136,22.74
2137,22.45
2138,22.27
2139,22.17
2140,22.08
2141,22.02
2142,21.97
2143,21.98
2144,22.04
2145,22.16
2146,22.30
2147,22.42
2148,22.54
2149,22.64
2150,22.79
2151,22.96
2152,23.21
2153,23.50
2154,23.85
2155,24.21
2156,24.57
2157,24.93
2158,25.29
2159,25.64
2160,25.99
2161,26.28
2162,26.56
2163,26.79
2164,26.98
2165,27.11
2166,27.15
2167,27.02
2168,26.70
2169,26.21
2170,25.70
2171,25.21
2172,24.74
2173,24.33
2174,24.03
2175,23.97
2176,24.13
2177,24.44
2178,24.81
2179,25.18
2180,25.51
2181,25.76
2182,25.83
2183,25.73
2184,25.41
2185,24.93
2186,24.28
2187,23.58
2188,22.86
2189,22.21
2190,21.57
2191,20.99
2192,20.44
2193,19.97
2194,19.51
2195,19.05
2196,18.53
2197,17.99
2198,17.43
2199,16.97
2200,16.60
2201,16.37
2202,16.21
2203,16.17
2204,16.22
2205,16.35
2206,16.44
2207,16.45
2208,16.37
2209,16.25
2210,16.08
2211,15.83
2212,15.55
2213,15.30
2214,15.18
2215,15.17
2216,15.27
2217,15.45
2218,15.72
2219,16.08
2220,16.49
2221,16.90
2222,17.34
2223,17.81
2224,18.36
2225,18.94
2226,19.60
2227,20.31
2228,21.11
2229,21.87
2230,22.56
2231,23.09
2232,23.54
2233,23.88
2234,24.14
2235,24.30
2236,24.52
2237,24.85
2238,25.39
2239,26.05
2240,26.79
2241,27.50
2242,28.15
2243,28.69
2244,29.14
2245,29.49
2246,29.74
2247,29.91
2248,30.08
2249,30.19
2250,30.22
2251,30.10
2252,29.86
2253,29.56
2254,29.23
2255,28.87
2256,28.50
2257,28.20
2258,28.04
2259,28.05
2260,28.12
2261,28.21
2262,28.18
2263,28.08
2264,27.81
2265,27.40
2266,26.82
2267,26.18
2268,25.47
2269,24.83
2270,24.20
2271,23.69
2272,23.22
2273,22.83
2274,22.35
2275,21.84
2276,21.21
2277,20.51
2278,19.66
2279,18.78
2280,17.88
2281,17.11
2282,16.46
2283,16.01
2284,15.66
2285,15.45
2286,15.22
2287,14.95
2288,14.49
2289,13.85
2290,12.99
2291,12.10
2292,11.23
2293,10.54
2294,9.93
2295,9.48
2296,9.09
2297,8.81
2298,8.53
2299,8.19
2300,7.67
2301,7.03
2302,6.28
2303,5.50
2304,4.65
2305,3.83
2306,3.08
2307,2.48
2308,1.99
2309,1.64
2310,1.46
2311,1.53
2312,1.77
2313,2.15
2314,2.59
2315,3.07
2316,3.54
2317,3.97
2318,4.33
2319,4.62
2320,4.88
2321,5.10
2322,5.36
2323,5.65
2324,6.02
2325,6.39
2326,6.66
2327,6.72
2328,6.55
2329,6.17
2330,5.70
2331,5.22
2332,4.78
2333,4.42
2334,4.14
2335,3.97
2336,3.88
2337,3.83
2338,3.72
2339,3.56
2340,3.34
2341,3.16
2342,3.00
2343,2.96
2344,3.03
2345,3.22
2346,3.40
2347,3.48
2348,3.36
2349,3.07
2350,2.57
2351,1.91
2352,1.14
2353,0.37
2354,-0.34
2355,-0.86
2356,-1.26
2357,-1.54
2358,-1.79
2359,-2.02
2360,-2.28
2361,-2.57
2362,-2.92
2363,-3.28
2364,-3.62
2365,-3.85
2366,-3.97
2367,-3.96
2368,-3.89
2369,-3.77
2370,-3.59
2371,-3.36
2372,-3.08
2373,-2.84
2374,-2.66
2375,-2.61
2376,-2.67
2377,-2.79
2378,-2.91
2379,-2.98
2380,-2.98
2381,-2.85
2382,-2.56
2383,-2.14
2384,-1.69
2385,-1.32
2386,-1.09
2387,-1.04
2388,-1.14
2389,-1.39
2390,-1.71
2391,-2.01
2392,-2.24
2393,-2.37
2394,-2.39
2395,-2.33
2396,-2.17
2397,-1.95
2398,-1.63
2399,-1.27
2400,-0.88
2401,-0.53
2402,-0.20
2403,0.15
2404,0.56
2405,0.98
2406,1.34
2407,1.59
2408,1.73
2409,1.78
2410,1.74
2411,1.62
2412,1.46
2413,1.28
2414,1.05
2415,0.82
2416,0.62
2417,0.50
2418,0.43
2419,0.37
2420,0.31
2421,0.25
2422,0.19
2423,0.14
2424,0.07
2425,0.01
2426,-0.01
2427,0.05
2428,0.18
2429,0.35
2430,0.56
2431,0.75
2432,0.87
2433,0.86
2434,0.74
2435,0.54
2436,0.40
2437,0.39
2438,0.56
2439,0.92
2440,1.48
2441,2.20
2442,3.01
2443,3.79
2444,4.49
2445,5.00
2446,5.41
2447,5.69
2448,5.96
2449,6.23
2450,6.62
2451,7.10
2452,7.67
2453,8.20
2454,8.63
2455,8.87
2456,8.95
2457,8.87
2458,8.70
2459,8.51
2460,8.42
2461,8.47
2462,8.67
2463,8.98
2464,9.35
2465,9.70
2466,9.99
2467,10.12
2468,10.05
2469,9.80
2470,9.44
2471,9.07
2472,8.79
2473,8.59
2474,8.53
2475,8.59
2476,8.79
2477,9.02
2478,9.23
2479,9.40
2480,9.64
2481,9.99
2482,10.44
2483,10.90
2484,11.44
2485,12.02
2486,12.72
2487,13.41
2488,14.14
2489,14.85
2490,15.63
2491,16.51
2492,17.54
2493,18.60
2494,19.68
2495,20.63
2496,21.45
2497,22.03
2498,22.42
2499,22.58
2500,22.61
2501,22.58
2502,22.68
2503,22.96
2504,23.50
2505,24.14
2506,24.86
2507,25.51
2508,26.12
2509,26.57
2510,26.91
2511,27.07
2512,27.18
2513,27.26
2514,27.49
2515,27.82
2516,28.38
2517,29.07
2518,29.98
2519,30.97
2520,32.10
2521,33.22
2522,34.34
2523,35.34
2524,36.29
2525,37.16
2526,38.07
2527,38.96
2528,39.84
2529,40.60
2530,41.28
2531,41.80
2532,42.22
2533,42.44
2534,42.50
2535,42.37
2536,42.13
2537,41.76
2538,41.28
2539,40.74
2540,40.23
2541,39.82
2542,39.46
2543,39.18
2544,38.93
2545,38.76
2546,38.60
2547,38.46
2548,38.18
2549,37.79
2550,37.15
2551,36.34
2552,35.27
2553,34.03
2554,32.55
2555,30.95
2556,29.25
2557,27.65
2558,26.18
2559,24.99
2560,24.05
2561,23.48
2562,23.22
2563,23.25
2564,23.33
2565,23.43
2566,23.43
2567,23.32
2568,22.99
2569,22.52
2570,22.00
2571,21.58
2572,21.27
2573,21.10
2574,21.04
2575,21.13
2576,21.25
2577,21.32
2578,21.20
2579,20.92
2580,20.47
2581,19.94
2582,19.28
2583,18.57
2584,17.87
2585,17.27
2586,16.77
2587,16.42
2588,16.20
2589,16.15
2590,16.19
2591,16.26
2592,16.31
2593,16.38
2594,16.46
2595,16.58
2596,16.71
2597,16.90
2598,17.17
2599,17.54
2600,17.88
2601,18.14
2602,18.26
2603,18.26
2604,18.11
2605,17.89
2606,17.59
2607,17.24
2608,16.76
2609,16.18
2610,15.46
2611,14.70
2612,13.83
2613,12.89
2614,11.82
2615,10.76
2616,9.71
2617,8.83
2618,8.06
2619,7.48
2620,7.03
2621,6.75
2622,6.54
2623,6.39
2624,6.16
2625,5.87
2626,5.48
2627,5.07
2628,4.68
2629,4.37
2630,4.17
2631,4.13
2632,4.23
2633,4.48
2634,4.75
2635,5.01
2636,5.19
2637,5.26
2638,5.13
2639,4.84
2640,4.41
2641,3.99
2642,3.63
2643,3.40
2644,3.26
2645,3.20
2646,3.20
2647,3.21
2648,3.17
2649,3.05
2650,2.85
2651,2.62
2652,2.35
2653,2.11
2654,1.93
2655,1.88
2656,1.94
2657,2.13
2658,2.37
2659,2.69
2660,3.02
2661,3.33
2662,3.51
2663,3.52
2664,3.33
2665,2.97
2666,2.45
2667,1.86
2668,1.22
2669,0.63
2670,0.08
2671,-0.38
2672,-0.79
2673,-1.13
2674,-1.48
2675,-1.88
2676,-2.46
2677,-3.15
2678,-4.01
2679,-4.89
2680,-5.84
2681,-6.72
2682,-7.52
2683,-8.11
2684,-8.54
2685,-8.80
2686,-9.07
2687,-9.35
2688,-9.74
2689,-10.21
2690,-10.77
2691,-11.38
2692,-11.96
2693,-12.44
2694,-12.76
2695,-12.88
2696,-12.83
2697,-12.65
2698,-12.35
2699,-12.01
2700,-11.60
2701,-11.20
2702,-10.71
2703,-10.14
2704,-9.38
2705,-8.51
2706,-7.45
2707,-6.33
2708,-5.09
2709,-3.86
2710,-2.59
2711,-1.43
2712,-0.26
2713,0.82
2714,2.01
2715,3.18
2716,4.41
2717,5.50
2718,6.60
2719,7.64
2720,8.81
2721,9.97
2722,11.17
2723,12.28
2724,13.45
2725,14.56
2726,15.62
2727,16.45
2728,17.08
2729,17.48
2730,17.72
2731,17.76
2732,17.70
2733,17.56
2734,17.44
2735,17.32
2736,17.20
2737,17.02
2738,16.75
2739,16.40
2740,15.95
2741,15.49
2742,14.99
2743,14.54
2744,14.02
2745,13.50
2746,12.89
2747,12.34
2748,11.72
2749,11.10
2750,10.25
2751,9.28
2752,8.06
2753,6.73
2754,5.10
2755,3.33
2756,1.43
2757,-0.34
2758,-2.01
2759,-3.47
2760,-4.87
2761,-6.07
2762,-7.25
2763,-8.29
2764,-9.37
2765,-10.35
2766,-11.30
2767,-12.05
2768,-12.72
2769,-13.23
2770,-13.69
2771,-14.03
2772,-14.30
2773,-14.47
2774,-14.60
2775,-14.66
2776,-14.61
2777,-14.43
2778,-14.16
2779,-13.85
2780,-13.54
2781,-13.30
2782,-13.18
2783,-13.25
2784,-13.44
2785,-13.69
2786,-13.91
2787,-14.05
2788,-14.04
2789,-13.86
2790,-13.47
2791,-12.93
2792,-12.32
2793,-11.73
2794,-11.12
2795,-10.53
2796,-9.96
2797,-9.48
2798,-9.08
2799,-8.73
2800,-8.41
2801,-8.16
2802,-8.03
2803,-8.03
2804,-8.16
2805,-8.39
2806,-8.77
2807,-9.31
2808,-9.99
2809,-10.71
2810,-11.38
2811,-11.92
2812,-12.37
2813,-12.71
2814,-12.97
2815,-13.15
2816,-13.31
2817,-13.47
2818,-13.69
2819,-13.87
2820,-13.98
2821,-13.98
2822,-13.85
2823,-13.62
2824,-13.28
2825,-12.84
2826,-12.36
2827,-11.94
2828,-11.70
2829,-11.62
2830,-11.69
2831,-11.87
2832,-12.21
2833,-12.68
2834,-13.24
2835,-13.78
2836,-14.33
2837,-14.85
2838,-15.37
2839,-15.85
2840,-16.30
2841,-16.71
2842,-17.09
2843,-17.44
2844,-17.84
2845,-18.23
2846,-18.66
2847,-19.07
2848,-19.52
2849,-19.93
2850,-20.27
2851,-20.44
2852,-20.48
2853,-20.40
2854,-20.30
2855,-20.16
2856,-20.08
2857,-20.11
2858,-20.44
2859,-21.08
2860,-22.06
2861,-23.20
2862,-24.41
2863,-25.48
2864,-26.36
2865,-26.95
2866,-27.29
2867,-27.39
2868,-27.36
2869,-27.27
2870,-27.31
2871,-27.53
2872,-28.01
2873,-28.60
2874,-29.26
2875,-29.85
2876,-30.36
2877,-30.71
2878,-30.90
2879,-30.88
2880,-30.76
2881,-30.62
2882,-30.60
2883,-30.69
2884,-30.98
2885,-31.45
2886,-32.18
2887,-33.07
2888,-34.07
2889,-35.01
2890,-35.93
2891,-36.75
2892,-37.52
2893,-38.17
2894,-38.71
2895,-39.12
2896,-39.47
2897,-39.75
2898,-40.02
2899,-40.27
2900,-40.47
2901,-40.59
2902,-40.59
2903,-40.47
2904,-40.27
2905,-40.03
2906,-39.74
2907,-39.46
2908,-39.15
2909,-38.87
2910,-38.51
2911,-38.06
2912,-37.38
2913,-36.58
2914,-35.58
2915,-34.53
2916,-33.32
2917,-32.08
2918,-30.80
2919,-29.63
2920,-28.47
2921,-27.37
2922,-26.17
2923,-24.94
2924,-23.61
2925,-22.32
2926,-21.00
2927,-19.83
2928,-18.77
2929,-17.95
2930,-17.30
2931,-16.91
2932,-16.69
2933,-16.72
2934,-16.86
2935,-17.14
2936,-17.39
2937,-17.59
2938,-17.59
2939,-17.44
2940,-17.07
2941,-16.55
2942,-15.78
2943,-14.83
2944,-13.74
2945,-12.66
2946,-11.65
2947,-10.83
2948,-10.16
2949,-9.70
2950,-9.37
2951,-9.15
2952,-8.93
2953,-8.71
2954,-8.41
2955,-8.06
2956,-7.63
2957,-7.23
2958,-6.84
2959,-6.55
2960,-6.32
2961,-6.16
2962,-5.98
2963,-5.82
2964,-5.61
2965,-5.33
2966,-4.87
2967,-4.29
2968,-3.56
2969,-2.80
2970,-1.95
2971,-1.14
2972,-0.32
2973,0.37
2974,1.01
2975,1.52
2976,2.00
2977,2.39
2978,2.83
2979,3.28
2980,3.85
2981,4.49
2982,5.28
2983,6.15
2984,7.16
2985,8.16
2986,9.18
2987,10.05
2988,10.83
2989,11.46
2990,12.09
2991,12.66
2992,13.24
2993,13.75
2994,14.36
2995,14.98
2996,15.69
2997,16.39
2998,17.16
2999,17.91
3000,18.71
3001,19.47
3002,20.26
3003,21.01
3004,21.83
3005,22.64
3006,23.53
3007,24.41
3008,25.33
3009,26.14
3010,26.90
3011,27.53
3012,28.16
3013,28.68
3014,29.12
3015,29.46
3016,29.85
3017,30.31
3018,30.88
3019,31.49
3020,32.07
3021,32.56
3022,32.86
3023,32.87
3024,32.52
3025,31.87
3026,30.94
3027,29.94
3028,28.88
3029,27.95
3030,27.08
3031,26.40
3032,25.75
3033,25.13
3034,24.33
3035,23.41
3036,22.25
3037,21.03
3038,19.62
3039,18.23
3040,16.75
3041,15.41
3042,14.11
3043,12.94
3044,11.78
3045,10.74
3046,9.72
3047,8.86
3048,8.01
3049,7.34
3050,6.72
3051,6.28
3052,5.81
3053,5.39
3054,4.80
3055,4.12
3056,3.17
3057,2.06
3058,0.76
3059,-0.54
3060,-1.84
3061,-2.95
3062,-3.90
3063,-4.59
3064,-5.17
3065,-5.61
3066,-6.07
3067,-6.54
3068,-7.08
3069,-7.61
3070,-8.09
3071,-8.45
3072,-8.68
3073,-8.73
3074,-8.61
3075,-8.29
3076,-7.90
3077,-7.52
3078,-7.29
3079,-7.22
3080,-7.33
3081,-7.58
3082,-7.91
3083,-8.21
3084,-8.42
3085,-8.46
3086,-8.41
3087,-8.27
3088,-8.15
3089,-8.07
3090,-8.15
3091,-8.43
3092,-9.00
3093,-9.78
3094,-10.68
3095,-11.52
3096,-12.25
3097,-12.76
3098,-13.15
3099,-13.36
3100,-13.53
3101,-13.69
3102,-13.96
3103,-14.36
3104,-14.98
3105,-15.75
3106,-16.68
3107,-17.63
3108,-18.53
3109,-19.33
3110,-19.99
3111,-20.46
3112,-20.67
3113,-20.62
3114,-20.36
3115,-19.94
3116,-19.31
3117,-18.54
3118,-17.69
3119,-16.85
3120,-16.01
3121,-15.18
3122,-14.36
3123,-13.66
3124,-13.03
3125,-12.44
3126,-11.80
3127,-11.23
3128,-10.73
3129,-10.38
3130,-10.06
3131,-9.79
3132,-9.52
3133,-9.30
3134,-9.00
3135,-8.60
3136,-8.05
3137,-7.46
3138,-6.84
3139,-6.24
3140,-5.66
3141,-5.20
3142,-4.85
3143,-4.68
3144,-4.60
3145,-4.55
3146,-4.48
3147,-4.37
3148,-4.17
3149,-3.88
3150,-3.46
3151,-3.05
3152,-2.70
3153,-2.46
3154,-2.30
3155,-2.25
3156,-2.32
3157,-2.50
3158,-2.70
3159,-2.83
3160,-2.86
3161,-2.79
3162,-2.64
3163,-2.45
3164,-2.34
3165,-2.38
3166,-2.66
3167,-3.12
3168,-3.79
3169,-4.57
3170,-5.42
3171,-6.13
3172,-6.62
3173,-6.84
3174,-6.97
3175,-7.10
3176,-7.44
3177,-8.02
3178,-8.96
3179,-10.12
3180,-11.51
3181,-12.88
3182,-14.25
3183,-15.40
3184,-16.41
3185,-17.20
3186,-18.09
3187,-19.04
3188,-20.26
3189,-21.62
3190,-23.22
3191,-24.86
3192,-26.52
3193,-27.95
3194,-29.17
3195,-30.03
3196,-30.61
3197,-30.88
3198,-31.05
3199,-31.13
3200,-31.26
3201,-31.43
3202,-31.75
3203,-32.15
3204,-32.61
3205,-33.04
3206,-33.41
3207,-33.65
3208,-33.68
3209,-33.51
3210,-33.16
3211,-32.74
3212,-32.27
3213,-31.87
3214,-31.53
3215,-31.30
3216,-31.07
3217,-30.79
3218,-30.40
3219,-29.86
3220,-29.14
3221,-28.31
3222,-27.43
3223,-26.66
3224,-25.97
3225,-25.45
3226,-25.05
3227,-24.84
3228,-24.70
3229,-24.59
3230,-24.41
3231,-24.19
3232,-23.91
3233,-23.61
3234,-23.25
3235,-22.90
3236,-22.61
3237,-22.50
3238,-22.53
3239,-22.66
3240,-22.81
3241,-23.01
3242,-23.19
3243,-23.33
3244,-23.27
3245,-22.98
3246,-22.45
3247,-21.72
3248,-20.85
3249,-19.89
3250,-18.92
3251,-18.07
3252,-17.45
3253,-17.15
3254,-17.19
3255,-17.56
3256,-18.19
3257,-18.97
3258,-19.82
3259,-20.60
3260,-21.23
3261,-21.65
3262,-21.87
3263,-21.98
3264,-22.09
3265,-22.32
3266,-22.74
3267,-23.33
3268,-24.09
3269,-24.87
3270,-25.59
3271,-26.07
3272,-26.25
3273,-26.12
3274,-25.78
3275,-25.29
3276,-24.70
3277,-24.09
3278,-23.59
3279,-23.22
3280,-22.97
3281,-22.75
3282,-22.49
3283,-22.19
3284,-21.84
3285,-21.48
3286,-21.13
3287,-20.84
3288,-20.59
3289,-20.42
3290,-20.30
3291,-20.25
3292,-20.23
3293,-20.30
3294,-20.43
3295,-20.61
3296,-20.79
3297,-20.92
3298,-20.96
3299,-20.90
3300,-20.74
3301,-20.49
3302,-20.22
3303,-19.98
3304,-19.79
3305,-19.68
3306,-19.63
3307,-19.63
3308,-19.66
3309,-19.73
3310,-19.80
3311,-19.87
3312,-19.90
3313,-19.90
3314,-19.87
3315,-19.89
3316,-19.91
3317,-19.93
3318,-19.81
3319,-19.60
3320,-19.23
3321,-18.71
3322,-17.89
3323,-16.84
3324,-15.54
3325,-14.18
3326,-12.73
3327,-11.38
3328,-10.11
3329,-9.12
3330,-8.32
3331,-7.71
3332,-7.03
3333,-6.30
3334,-5.33
3335,-4.16
3336,-2.65
3337,-1.07
3338,0.53
3339,1.88
3340,3.07
3341,3.92
3342,4.52
3343,4.78
3344,4.97
3345,5.16
3346,5.56
3347,6.14
3348,7.01
3349,8.00
3350,9.09
3351,10.09
3352,11.04
3353,11.78
3354,12.41
3355,12.85
3356,13.31
3357,13.80
3358,14.55
3359,15.46
3360,16.69
3361,18.09
3362,19.80
3363,21.56
3364,23.35
3365,24.93
3366,26.44
3367,27.72
3368,28.85
3369,29.71
3370,30.51
3371,31.23
3372,32.10
3373,32.95
3374,33.94
3375,34.91
3376,36.03
3377,37.13
3378,38.30
3379,39.34
3380,40.38
3381,41.36
3382,42.43
3383,43.47
3384,44.59
3385,45.64
3386,46.71
3387,47.70
3388,48.69
3389,49.55
3390,50.40
3391,51.15
3392,51.94
3393,52.68
3394,53.48
3395,54.24
3396,55.04
3397,55.73
3398,56.35
3399,56.82
3400,57.21
3401,57.42
3402,57.50
3403,57.49
3404,57.55
3405,57.71
3406,57.98
3407,58.28
3408,58.65
3409,59.01
3410,59.27
3411,59.34
3412,59.18
3413,58.82
3414,58.28
3415,57.70
3416,57.09
3417,56.56
3418,56.05
3419,55.60
3420,55.11
3421,54.54
3422,53.70
3423,52.60
3424,51.16
3425,49.56
3426,47.78
3427,46.15
3428,44.64
3429,43.50
3430,42.49
3431,41.72
3432,40.89
3433,40.13
3434,39.09
3435,37.85
3436,36.09
3437,34.12
3438,31.81
3439,29.54
3440,27.11
3441,24.85
3442,22.57
3443,20.55
3444,18.48
3445,16.53
3446,14.36
3447,12.16
3448,9.67
3449,7.16
3450,4.44
3451,1.87
3452,-0.69
3453,-2.90
3454,-4.92
3455,-6.48
3456,-7.76
3457,-8.59
3458,-9.28
3459,-9.75
3460,-10.28
3461,-10.78
3462,-11.41
3463,-12.04
3464,-12.76
3465,-13.46
3466,-14.18
3467,-14.82
3468,-15.42
3469,-15.89
3470,-16.24
3471,-16.42
3472,-16.41
3473,-16.16
3474,-15.71
3475,-15.10
3476,-14.43
3477,-13.82
3478,-13.37
3479,-13.14
3480,-13.11
3481,-13.23
3482,-13.44
3483,-13.70
3484,-13.91
3485,-13.98
3486,-13.80
3487,-13.44
3488,-12.99
3489,-12.56
3490,-12.20
3491,-11.90
3492,-11.69
3493,-11.56
3494,-11.54
3495,-11.60
3496,-11.72
3497,-11.89
3498,-12.16
3499,-12.52
3500,-12.96
3501,-13.44
3502,-13.94
3503,-14.42
3504,-14.85
3505,-15.14
3506,-15.28
3507,-15.26
3508,-15.24
3509,-15.27
3510,-15.46
3511,-15.81
3512,-16.37
3513,-17.08
3514,-17.93
3515,-18.75
3516,-19.55
3517,-20.26
3518,-20.96
3519,-21.59
3520,-22.19
3521,-22.72
3522,-23.28
3523,-23.80
3524,-24.27
3525,-24.57
3526,-24.70
3527,-24.69
3528,-24.60
3529,-24.41
3530,-24.15
3531,-23.84
3532,-23.57
3533,-23.39
3534,-23.29
3535,-23.25
3536,-23.19
3537,-23.14
3538,-23.05
3539,-22.94
3540,-22.76
3541,-22.54
3542,-22.23
3543,-21.88
3544,-21.44
3545,-20.97
3546,-20.46
3547,-19.99
3548,-19.54
3549,-19.13
3550,-18.71
3551,-18.31
3552,-17.88
3553,-17.47
3554,-17.04
3555,-16.69
3556,-16.45
3557,-16.40
3558,-16.46
3559,-16.59
3560,-16.73
3561,-16.85
3562,-16.91
3563,-16.85
3564,-16.66
3565,-16.40
3566,-16.24
3567,-16.21
3568,-16.43
3569,-16.84
3570,-17.48
3571,-18.24
3572,-19.13
3573,-20.02
3574,-20.92
3575,-21.74
3576,-22.51
3577,-23.22
3578,-23.96
3579,-24.71
3580,-25.52
3581,-26.29
3582,-27.06
3583,-27.71
3584,-28.21
3585,-28.50
3586,-28.64
3587,-28.63
3588,-28.50
3589,-28.26
3590,-27.96
3591,-27.66
3592,-27.37
3593,-27.08
3594,-26.75
3595,-26.40
3596,-25.99
3597,-25.58
3598,-25.15
3599,-24.73
3600,-24.31
3601,-23.97
3602,-23.66
3603,-23.38
3604,-23.02
3605,-22.55
3606,-21.94
3607,-21.22
3608,-20.42
3609,-19.71
3610,-19.17
3611,-18.94
3612,-18.97
3613,-19.29
3614,-19.79
3615,-20.36
3616,-20.78
3617,-20.98
3618,-20.85
3619,-20.44
3620,-19.74
3621,-18.91
3622,-18.02
3623,-17.24
3624,-16.62
3625,-16.22
3626,-15.96
3627,-15.80
3628,-15.62
3629,-15.40
3630,-15.05
3631,-14.57
3632,-13.95
3633,-13.31
3634,-12.66
3635,-12.12
3636,-11.70
3637,-11.47
3638,-11.45
3639,-11.64
3640,-11.92
3641,-12.24
3642,-12.54
3643,-12.78
3644,-12.86
3645,-12.76
3646,-12.45
3647,-12.03
3648,-11.54
3649,-11.06
3650,-10.64
3651,-10.35
3652,-10.17
3653,-10.12
3654,-10.14
3655,-10.23
3656,-10.25
3657,-10.15
3658,-9.80
3659,-9.28
3660,-8.58
3661,-7.82
3662,-6.93
3663,-5.98
3664,-4.99
3665,-4.10
3666,-3.32
3667,-2.69
3668,-2.09
3669,-1.58
3670,-1.06
3671,-0.61
3672,-0.08
3673,0.47
3674,1.18
3675,1.94
3676,2.82
3677,3.69
3678,4.60
3679,5.42
3680,6.21
3681,6.90
3682,7.58
3683,8.16
3684,8.71
3685,9.23
3686,9.83
3687,10.48
3688,11.17
3689,11.83
3690,12.44
3691,12.91
3692,13.21
3693,13.26
3694,13.10
3695,12.79
3696,12.43
3697,12.05
3698,11.75
3699,11.57
3700,11.57
3701,11.76
3702,12.05
3703,12.37
3704,12.60
3705,12.74
3706,12.67
3707,12.45
3708,12.02
3709,11.51
3710,10.86
3711,10.22
3712,9.54
3713,8.91
3714,8.22
3715,7.48
3716,6.49
3717,5.32
3718,3.92
3719,2.51
3720,1.05
3721,-0.29
3722,-1.60
3723,-2.70
3724,-3.68
3725,-4.49
3726,-5.32
3727,-6.11
3728,-6.98
3729,-7.80
3730,-8.67
3731,-9.48
3732,-10.26
3733,-10.91
3734,-11.48
3735,-11.94
3736,-12.34
3737,-12.69
3738,-13.05
3739,-13.41
3740,-13.74
3741,-13.98
3742,-14.13
3743,-14.20
3744,-14.14
3745,-13.92
3746,-13.44
3747,-12.78
3748,-12.01
3749,-11.24
3750,-10.43
3751,-9.62
3752,-8.73
3753,-7.84
3754,-6.93
3755,-6.06
3756,-5.13
3757,-4.19
3758,-3.17
3759,-2.24
3760,-1.37
3761,-0.67
3762,-0.04
3763,0.47
3764,0.92
3765,1.25
3766,1.59
3767,1.92
3768,2.35
3769,2.82
3770,3.36
3771,3.88
3772,4.43
3773,4.88
3774,5.29
3775,5.58
3776,5.78
3777,5.89
3778,5.99
3779,6.10
3780,6.29
3781,6.56
3782,7.02
3783,7.68
3784,8.54
3785,9.44
3786,10.23
3787,10.77
3788,11.07
3789,11.11
3790,10.96
3791,10.64
3792,10.28
3793,9.97
3794,9.80
3795,9.74
3796,9.78
3797,9.83
3798,9.88
3799,9.86
3800,9.83
3801,9.77
3802,9.70
3803,9.62
3804,9.61
3805,9.65
3806,9.84
3807,10.11
3808,10.56
3809,11.13
3810,11.96
3811,12.93
3812,14.18
3813,15.58
3814,17.30
3815,19.11
3816,21.05
3817,22.87
3818,24.71
3819,26.46
3820,28.27
3821,29.95
3822,31.68
3823,33.30
3824,35.02
3825,36.58
3826,38.11
3827,39.39
3828,40.60
3829,41.63
3830,42.64
3831,43.56
3832,44.56
3833,45.55
3834,46.59
3835,47.46
3836,48.19
3837,48.66
3838,48.91
3839,48.90
3840,48.65
3841,48.22
3842,47.74
3843,47.32
3844,46.99
3845,46.70
3846,46.35
3847,45.95
3848,45.47
3849,44.94
3850,44.27
3851,43.57
3852,42.88
3853,42.29
3854,41.70
3855,41.13
3856,40.52
3857,39.92
3858,39.31
3859,38.72
3860,38.18
3861,37.77
3862,37.46
3863,37.29
3864,37.21
3865,37.23
3866,37.26
3867,37.28
3868,37.18
3869,37.01
3870,36.77
3871,36.47
3872,36.08
3873,35.67
3874,35.30
3875,35.06
3876,34.90
3877,34.80
3878,34.71
3879,34.67
3880,34.58
3881,34.48
3882,34.29
3883,34.07
3884,33.76
3885,33.42
3886,32.97
3887,32.52
3888,32.01
3889,31.49
3890,30.84
3891,30.09
3892,29.15
3893,28.11
3894,26.83
3895,25.49
3896,24.03
3897,22.69
3898,21.36
3899,20.21
3900,19.10
3901,18.18
3902,17.29
3903,16.51
3904,15.59
3905,14.56
3906,13.21
3907,11.76
3908,10.13
3909,8.54
3910,6.87
3911,5.37
3912,3.96
3913,2.80
3914,1.66
3915,0.64
3916,-0.40
3917,-1.32
3918,-2.29
3919,-3.20
3920,-4.17
3921,-5.04
3922,-5.92
3923,-6.79
3924,-7.78
3925,-8.77
3926,-9.77
3927,-10.67
3928,-11.49
3929,-12.13
3930,-12.57
3931,-12.74
3932,-12.75
3933,-12.66
3934,-12.59
3935,-12.52
3936,-12.52
3937,-12.58
3938,-12.67
3939,-12.74
3940,-12.73
3941,-12.61
3942,-12.38
3943,-12.09
3944,-11.73
3945,-11.38
3946,-11.04
3947,-10.82
3948,-10.65
3949,-10.55
3950,-10.41
3951,-10.19
3952,-9.78
3953,-9.21
3954,-8.39
3955,-7.45
3956,-6.35
3957,-5.24
3958,-4.07
3959,-2.97
3960,-1.81
3961,-0.70
3962,0.46
3963,1.56
3964,2.70
3965,3.81
3966,5.00
3967,6.10
3968,7.19
3969,8.12
3970,9.00
3971,9.69
3972,10.24
3973,10.57
3974,10.85
3975,11.05
3976,11.30
3977,11.51
3978,11.82
3979,12.15
3980,12.60
3981,13.07
3982,13.59
3983,14.13
3984,14.66
3985,15.15
3986,15.53
3987,15.78
3988,15.86
3989,15.81
3990,15.59
3991,15.24
3992,14.72
3993,14.02
3994,13.05
3995,11.93
3996,10.67
3997,9.41
3998,8.17
3999,7.05
4000,6.07
4001,5.29
4002,4.68
4003,4.22
4004,3.85
4005,3.56
4006,3.29
4007,3.11
4008,3.07
4009,3.18
4010,3.43
4011,3.80
4012,4.27
4013,4.81
4014,5.36
4015,5.91
4016,6.45
4017,6.97
4018,7.50
4019,8.03
4020,8.64
4021,9.28
4022,9.95
4023,10.48
4024,10.89
4025,11.16
4026,11.44
4027,11.72
4028,12.07
4029,12.47
4030,13.02
4031,13.66
4032,14.42
4033,15.13
4034,15.77
4035,16.24
4036,16.57
4037,16.72
4038,16.78
4039,16.77
4040,16.78
4041,16.82
4042,16.97
4043,17.19
4044,17.57
4045,18.10
4046,18.81
4047,19.58
4048,20.38
4049,21.10
4050,21.71
4051,22.11
4052,22.32
4053,22.30
4054,22.20
4055,22.11
4056,22.19
4057,22.47
4058,23.05
4059,23.83
4060,24.72
4061,25.51
4062,26.06
4063,26.30
4064,26.22
4065,25.84
4066,25.28
4067,24.66
4068,24.17
4069,23.91
4070,23.96
4071,24.27
4072,24.77
4073,25.37
4074,26.00
4075,26.60
4076,27.18
4077,27.70
4078,28.21
4079,28.69
4080,29.15
4081,29.50
4082,29.71
4083,29.77
4084,29.75
4085,29.68
4086,29.56
4087,29.39
4088,29.18
4089,29.00
4090,28.84
4091,28.67
4092,28.43
4093,28.14
4094,27.78
4095,27.43
4096,27.08
4097,26.80
4098,26.50
4099,26.21
4100,25.91
4101,25.63
4102,25.28
4103,24.89
4104,24.35
4105,23.77
4106,23.10
4107,22.39
4108,21.61
4109,20.86
4110,20.10
4111,19.39
4112,18.65
4113,17.97
4114,17.27
4115,16.69
4116,16.13
4117,15.62
4118,15.07
4119,14.55
4120,13.98
4121,13.47
4122,12.94
4123,12.47
4124,12.00
4125,11.60
4126,11.24
4127,10.96
4128,10.65
4129,10.31
4130,9.88
4131,9.40
4132,8.89
4133,8.40
4134,8.00
4135,7.76
4136,7.73
4137,7.90
4138,8.26
4139,8.80
4140,9.52
4141,10.29
4142,11.07
4143,11.78
4144,12.48
4145,13.18
4146,13.92
4147,14.63
4148,15.34
4149,15.98
4150,16.61
4151,17.13
4152,17.57
4153,17.86
4154,18.04
4155,18.08
4156,18.06
4157,17.97
4158,17.97
4159,18.07
4160,18.37
4161,18.78
4162,19.30
4163,19.83
4164,20.37
4165,20.84
4166,21.25
4167,21.54
4168,21.75
4169,21.93
4170,22.12
4171,22.29
4172,22.42
4173,22.48
4174,22.51
4175,22.43
4176,22.25
4177,22.01
4178,21.83
4179,21.75
4180,21.78
4181,21.91
4182,22.17
4183,22.53
4184,22.87
4185,23.13
4186,23.27
4187,23.33
4188,23.28
4189,23.11
4190,22.82
4191,22.52
4192,22.25
4193,22.09
4194,21.95
4195,21.78
4196,21.50
4197,21.16
4198,20.71
4199,20.20
4200,19.49
4201,18.67
4202,17.75
4203,16.91
4204,16.17
4205,15.59
4206,15.11
4207,14.78
4208,14.49
4209,14.27
4210,14.01
4211,13.66
4212,13.17
4213,12.63
4214,12.12
4215,11.70
4216,11.34
4217,11.06
4218,10.83
4219,10.72
4220,10.68
4221,10.69
4222,10.70
4223,10.70
4224,10.67
4225,10.60
4226,10.52
4227,10.45
4228,10.47
4229,10.57
4230,10.83
4231,11.23
4232,11.87
4233,12.70
4234,13.70
4235,14.77
4236,15.91
4237,16.97
4238,17.96
4239,18.78
4240,19.50
4241,20.13
4242,20.81
4243,21.51
4244,22.29
4245,22.99
4246,23.62
4247,24.09
4248,24.45
4249,24.67
4250,24.80
4251,24.86
4252,24.92
4253,25.02
4254,25.19
4255,25.38
4256,25.55
4257,25.61
4258,25.51
4259,25.21
4260,24.74
4261,24.19
4262,23.64
4263,23.16
4264,22.81
4265,22.64
4266,22.59
4267,22.61
4268,22.59
4269,22.48
4270,22.21
4271,21.87
4272,21.45
4273,21.03
4274,20.58
4275,20.18
4276,19.84
4277,19.61
4278,19.39
4279,19.16
4280,18.91
4281,18.68
4282,18.42
4283,18.12
4284,17.77
4285,17.47
4286,17.29
4287,17.23
4288,17.24
4289,17.31
4290,17.45
4291,17.68
4292,17.99
4293,18.30
4294,18.58
4295,18.81
4296,18.99
4297,19.10
4298,19.20
4299,19.25
4300,19.27
4301,19.27
4302,19.29
4303,19.34
4304,19.45
4305,19.63
4306,19.88
4307,20.19
4308,20.49
4309,20.73
4310,20.88
4311,20.94
4312,20.93
4313,20.80
4314,20.55
4315,20.26
4316,20.00
4317,19.80
4318,19.67
4319,19.62
4320,19.69
4321,19.86
4322,20.07
4323,20.26
4324,20.42
4325,20.53
4326,20.58
4327,20.65
4328,20.82
4329,21.16
4330,21.68
4331,22.29
4332,22.96
4333,23.56
4334,23.95
4335,24.01
4336,23.76
4337,23.27
4338,22.64
4339,21.97
4340,21.38
4341,21.01
4342,20.94
4343,21.13
4344,21.47
4345,21.85
4346,22.15
4347,22.33
4348,22.37
4349,22.31
4350,22.19
4351,22.06
4352,21.96
4353,21.90
4354,21.89
4355,21.90
4356,21.87
4357,21.74
4358,21.53
4359,21.29
4360,21.09
4361,20.97
4362,20.90
4363,20.91
4364,20.98
4365,21.11
4366,21.23
4367,21.30
4368,21.26
4369,21.15
4370,20.96
4371,20.79
4372,20.63
4373,20.52
4374,20.41
4375,20.30
4376,20.16
4377,20.00
4378,19.71
4379,19.32
4380,18.74
4381,18.09
4382,17.36
4383,16.67
4384,15.92
4385,15.17
4386,14.31
4387,13.43
4388,12.50
4389,11.62
4390,10.73
4391,9.97
4392,9.32
4393,8.87
4394,8.48
4395,8.16
4396,7.74
4397,7.29
4398,6.70
4399,6.05
4400,5.31
4401,4.59
4402,3.97
4403,3.56
4404,3.36
4405,3.37
4406,3.49
4407,3.69
4408,3.90
4409,4.07
4410,4.19
4411,4.24
4412,4.30
4413,4.41
4414,4.60
4415,4.84
4416,5.14
4417,5.49
4418,5.91
4419,6.32
4420,6.74
4421,7.10
4422,7.39
4423,7.55
4424,7.62
4425,7.61
4426,7.61
4427,7.58
4428,7.60
4429,7.66
4430,7.84
4431,8.13
4432,8.50
4433,8.92
4434,9.41
4435,9.93
4436,10.48
4437,10.95
4438,11.40
4439,11.80
4440,12.21
4441,12.61
4442,13.08
4443,13.61
4444,14.26
4445,14.90
4446,15.51
4447,16.04
4448,16.59
4449,17.04
4450,17.39
4451,17.57
4452,17.68
4453,17.72
4454,17.69
4455,17.58
4456,17.42
4457,17.28
4458,17.23
4459,17.30
4460,17.47
4461,17.72
4462,17.96
4463,18.16
4464,18.24
4465,18.18
4466,17.94
4467,17.59
4468,17.16
4469,16.75
4470,16.33
4471,15.92
4472,15.49
4473,15.09
4474,14.65
4475,14.12
4476,13.40
4477,12.58
4478,11.70
4479,10.86
4480,10.04
4481,9.35
4482,8.78
4483,8.43
4484,8.21
4485,8.11
4486,8.06
4487,8.00
4488,7.86
4489,7.63
4490,7.33
4491,7.02
4492,6.72
4493,6.48
4494,6.39
4495,6.44
4496,6.63
4497,6.94
4498,7.36
4499,7.90
4500,8.48
4501,8.96
4502,9.29
4503,9.46
4504,9.55
4505,9.53
4506,9.45
4507,9.32
4508,9.25
4509,9.29
4510,9.51
4511,9.86
4512,10.37
4513,10.97
4514,11.63
4515,12.21
4516,12.70
4517,13.05
4518,13.34
4519,13.57
4520,13.77
4521,14.01
4522,14.37
4523,14.84
4524,15.34
4525,15.78
4526,16.11
4527,16.27
4528,16.25
4529,16.08
4530,15.84
4531,15.58
4532,15.31
4533,15.08
4534,14.97
4535,14.96
4536,14.96
4537,14.92
4538,14.85
4539,14.79
4540,14.67
4541,14.50
4542,14.27
4543,14.03
4544,13.79
4545,13.56
4546,13.31
4547,13.08
4548,12.86
4549,12.67
4550,12.51
4551,12.41
4552,12.34
4553,12.34
4554,12.37
4555,12.44
4556,12.57
4557,12.74
4558,12.91
4559,13.04
4560,13.12
4561,13.18
4562,13.21
4563,13.21
4564,13.18
4565,13.18
4566,13.24
4567,13.36
4568,13.53
4569,13.71
4570,13.87
4571,13.98
4572,14.08
4573,14.13
4574,14.15
4575,14.15
4576,14.15
4577,14.14
4578,14.14
4579,14.14
4580,14.18
4581,14.23
4582,14.29
4583,14.41
4584,14.66
4585,15.02
4586,15.40
4587,15.70
4588,15.95
4589,16.12
4590,16.19
4591,16.13
4592,15.98
4593,15.86
4594,15.82
4595,15.88
4596,15.99
4597,16.12
4598,16.24
4599,16.29
4600,16.27
4601,16.15
4602,15.98
4603,15.79
4604,15.61
4605,15.50
4606,15.46
4607,15.53
4608,15.63
4609,15.70
4610,15.66
4611,15.55
4612,15.38
4613,15.20
4614,14.99
4615,14.81
4616,14.71
4617,14.70
4618,14.79
4619,14.91
4620,15.05
4621,15.23
4622,15.46
4623,15.70
4624,15.91
4625,16.08
4626,16.27
4627,16.50
4628,16.80
4629,17.09
4630,17.40
4631,17.68
4632,18.01
4633,18.36
4634,18.74
4635,19.08
4636,19.45
4637,19.86
4638,20.38
4639,20.96
4640,21.64
4641,22.35
4642,23.12
4643,23.90
4644,24.62
4645,25.16
4646,25.51
4647,25.61
4648,25.53
4649,25.28
4650,24.93
4651,24.57
4652,24.25
4653,24.01
4654,23.85
4655,23.74
4656,23.60
4657,23.37
4658,23.00
4659,22.54
4660,21.94
4661,21.29
4662,20.58
4663,19.93
4664,19.36
4665,18.96
4666,18.66
4667,18.50
4668,18.39
4669,18.35
4670,18.28
4671,18.18
4672,17.96
4673,17.68
4674,17.30
4675,16.89
4676,16.42
4677,15.95
4678,15.46
4679,15.01
4680,14.49
4681,13.91
4682,13.17
4683,12.35
4684,11.44
4685,10.56
4686,9.65
4687,8.83
4688,8.07
4689,7.43
4690,6.81
4691,6.24
4692,5.63
4693,5.04
4694,4.43
4695,3.84
4696,3.29
4697,2.87
4698,2.58
4699,2.47
4700,2.53
4701,2.71
4702,2.95
4703,3.20
4704,3.42
4705,3.59
4706,3.72
4707,3.83
4708,4.01
4709,4.31
4710,4.71
4711,5.13
4712,5.55
4713,5.97
4714,6.40
4715,6.81
4716,7.19
4717,7.48
4718,7.74
4719,7.97
4720,8.19
4721,8.35
4722,8.51
4723,8.63
4724,8.71
4725,8.71
4726,8.62
4727,8.50
4728,8.41
4729,8.40
4730,8.50
4731,8.69
4732,8.93
4733,9.16
4734,9.34
4735,9.41
4736,9.34
4737,9.04
4738,8.46
4739,7.68
4740,6.84
4741,6.11
4742,5.55
4743,5.26
4744,5.27
4745,5.58
4746,6.07
4747,6.63
4748,7.10
4749,7.42
4750,7.48
4751,7.31
4752,6.91
4753,6.43
4754,5.97
4755,5.59
4756,5.34
4757,5.23
4758,5.26
4759,5.39
4760,5.49
4761,5.51
4762,5.39
4763,5.21
4764,4.97
4765,4.67
4766,4.32
4767,3.96
4768,3.65
4769,3.40
4770,3.23
4771,3.17
4772,3.28
4773,3.57
4774,4.02
4775,4.56
4776,5.17
4777,5.77
4778,6.31
4779,6.72
4780,7.03
4781,7.26
4782,7.48
4783,7.71
4784,8.00
4785,8.30
4786,8.56
4787,8.74
4788,8.86
4789,8.92
4790,8.91
4791,8.79
4792,8.53
4793,8.18
4794,7.76
4795,7.34
4796,6.93
4797,6.58
4798,6.29
4799,6.06
4800,5.81
4801,5.52
4802,5.17
4803,4.82
4804,4.41
4805,3.94
4806,3.38
4807,2.78
4808,2.20
4809,1.72
4810,1.36
4811,1.13
4812,1.00
4813,0.95
4814,0.91
4815,0.86
4816,0.76
4817,0.66
4818,0.50
4819,0.32
4820,0.11
4821,-0.05
4822,-0.17
4823,-0.23
4824,-0.27
4825,-0.26
4826,-0.20
4827,-0.08
4828,0.06
4829,0.24
4830,0.46
4831,0.69
4832,0.92
4833,1.10
4834,1.26
4835,1.43
4836,1.65
4837,1.88
4838,2.12
4839,2.30
4840,2.43
4841,2.47
4842,2.48
4843,2.46
4844,2.53
4845,2.69
4846,3.02
4847,3.50
4848,4.13
4849,4.79
4850,5.37
4851,5.73
4852,5.86
4853,5.78
4854,5.61
4855,5.42
4856,5.31
4857,5.37
4858,5.61
4859,5.98
4860,6.37
4861,6.68
4862,6.84
4863,6.77
4864,6.48
4865,6.00
4866,5.39
4867,4.79
4868,4.25
4869,3.84
4870,3.55
4871,3.38
4872,3.26
4873,3.15
4874,2.99
4875,2.75
4876,2.42
4877,2.00
4878,1.53
4879,1.04
4880,0.60
4881,0.30
4882,0.19
4883,0.31
4884,0.65
4885,1.18
4886,1.89
4887,2.68
4888,3.46
4889,4.12
4890,4.62
4891,4.97
4892,5.23
4893,5.46
4894,5.71
4895,6.02
4896,6.38
4897,6.74
4898,7.02
4899,7.15
4900,7.10
4901,6.86
4902,6.41
4903,5.81
4904,5.13
4905,4.54
4906,4.04
4907,3.63
4908,3.23
4909,2.83
4910,2.39
4911,1.91
4912,1.34
4913,0.75
4914,0.19
4915,-0.22
4916,-0.48
4917,-0.60
4918,-0.59
4919,-0.40
4920,-0.05
4921,0.43
4922,0.95
4923,1.43
4924,1.85
4925,2.21
4926,2.50
4927,2.67
4928,2.75
4929,2.73
4930,2.72
4931,2.71
4932,2.75
4933,2.80
4934,2.88
4935,3.00
4936,3.19
4937,3.43
4938,3.68
4939,3.93
4940,4.15
4941,4.39
4942,4.63
4943,4.82
4944,4.88
4945,4.77
4946,4.47
4947,3.99
4948,3.31
4949,2.54
4950,1.76
4951,1.11
4952,0.55
4953,0.16
4954,-0.11
4955,-0.27
4956,-0.47
4957,-0.76
4958,-1.17
4959,-1.65
4960,-2.17
4961,-2.70
4962,-3.28
4963,-3.81
4964,-4.24
4965,-4.48
4966,-4.55
4967,-4.49
4968,-4.31
4969,-4.07
4970,-3.83
4971,-3.65
4972,-3.52
4973,-3.41
4974,-3.26
4975,-3.10
4976,-2.87
4977,-2.53
4978,-1.92
4979,-1.10
4980,-0.09
4981,0.92
4982,1.90
4983,2.73
4984,3.38
4985,3.72
4986,3.81
4987,3.65
4988,3.49
4989,3.34
4990,3.32
4991,3.36
4992,3.54
4993,3.84
4994,4.26
4995,4.75
4996,5.21
4997,5.64
4998,6.01
4999,6.32
5000,6.46
5001,6.41
5002,6.16
5003,5.80
5004,5.36
5005,4.89
5006,4.38
5007,3.90
5008,3.48
5009,3.19
5010,3.01
5011,2.90
5012,2.77
5013,2.61
5014,2.36
5015,2.01
5016,1.50
5017,0.91
5018,0.29
5019,-0.24
5020,-0.72
5021,-1.11
5022,-1.49
5023,-1.84
5024,-2.24
5025,-2.64
5026,-3.05
5027,-3.47
5028,-3.96
5029,-4.42
5030,-4.82
5031,-5.11
5032,-5.40
5033,-5.68
5034,-5.95
5035,-6.13
5036,-6.27
5037,-6.38
5038,-6.48
5039,-6.54
5040,-6.57
5041,-6.55
5042,-6.55
5043,-6.55
5044,-6.56
5045,-6.55
5046,-6.53
5047,-6.47
5048,-6.39
5049,-6.32
5050,-6.29
5051,-6.36
5052,-6.55
5053,-6.85
5054,-7.18
5055,-7.49
5056,-7.76
5057,-7.93
5058,-7.97
5059,-7.84
5060,-7.65
5061,-7.45
5062,-7.30
5063,-7.18
5064,-7.13
5065,-7.18
5066,-7.35
5067,-7.58
5068,-7.89
5069,-8.18
5070,-8.46
5071,-8.68
5072,-8.91
5073,-9.12
5074,-9.45
5075,-9.90
5076,-10.63
5077,-11.57
5078,-12.73
5079,-13.98
5080,-15.33
5081,-16.62
5082,-17.87
5083,-18.93
5084,-19.87
5085,-20.62
5086,-21.26
5087,-21.72
5088,-22.07
5089,-22.23
5090,-22.29
5091,-22.20
5092,-22.09
5093,-22.03
5094,-22.08
5095,-22.25
5096,-22.54
5097,-22.90
5098,-23.30
5099,-23.61
5100,-23.70
5101,-23.52
5102,-23.10
5103,-22.57
5104,-21.98
5105,-21.45
5106,-20.97
5107,-20.70
5108,-20.60
5109,-20.68
5110,-20.73
5111,-20.71
5112,-20.49
5113,-20.10
5114,-19.33
5115,-18.30
5116,-16.94
5117,-15.45
5118,-13.82
5119,-12.22
5120,-10.67
5121,-9.38
5122,-8.29
5123,-7.48
5124,-6.82
5125,-6.31
5126,-5.81
5127,-5.35
5128,-4.85
5129,-4.39
5130,-3.92
5131,-3.51
5132,-3.14
5133,-2.91
5134,-2.82
5135,-2.88
5136,-3.06
5137,-3.30
5138,-3.60
5139,-3.89
5140,-4.16
5141,-4.38
5142,-4.68
5143,-5.07
5144,-5.67
5145,-6.43
5146,-7.42
5147,-8.55
5148,-9.80
5149,-10.93
5150,-11.84
5151,-12.43
5152,-12.77
5153,-12.86
5154,-12.81
5155,-12.65
5156,-12.63
5157,-12.77
5158,-13.22
5159,-13.80
5160,-14.51
5161,-15.21
5162,-15.98
5163,-16.72
5164,-17.54
5165,-18.41
5166,-19.51
5167,-20.73
5168,-22.11
5169,-23.41
5170,-24.65
5171,-25.57
5172,-26.22
5173,-26.48
5174,-26.60
5175,-26.66
5176,-26.95
5177,-27.50
5178,-28.56
5179,-30.04
5180,-31.93
5181,-33.91
5182,-35.82
5183,-37.43
5184,-38.70
5185,-39.58
5186,-40.15
5187,-40.43
5188,-40.55
5189,-40.54
5190,-40.44
5191,-40.21
5192,-39.82
5193,-39.23
5194,-38.37
5195,-37.31
5196,-36.04
5197,-34.75
5198,-33.37
5199,-32.03
5200,-30.61
5201,-29.28
5202,-27.90
5203,-26.63
5204,-25.28
5205,-24.02
5206,-22.67
5207,-21.41
5208,-19.98
5209,-18.55
5210,-16.92
5211,-15.30
5212,-13.48
5213,-11.76
5214,-9.95
5215,-8.26
5216,-6.47
5217,-4.81
5218,-3.10
5219,-1.53
5220,0.16
5221,1.82
5222,3.62
5223,5.31
5224,7.08
5225,8.77
5226,10.50
5227,12.07
5228,13.61
5229,14.95
5230,16.20
5231,17.20
5232,17.99
5233,18.44
5234,18.65
5235,18.62
5236,18.50
5237,18.37
5238,18.34
5239,18.39
5240,18.51
5241,18.64
5242,18.75
5243,18.75
5244,18.54
5245,18.07
5246,17.35
5247,16.52
5248,15.61
5249,14.72
5250,13.83
5251,13.07
5252,12.44
5253,11.97
5254,11.54
5255,11.15
5256,10.73
5257,10.32
5258,9.86
5259,9.40
5260,8.91
5261,8.51
5262,8.14
5263,7.87
5264,7.59
5265,7.35
5266,7.13
5267,6.96
5268,6.82
5269,6.65
5270,6.36
5271,5.93
5272,5.46
5273,5.01
5274,4.71
5275,4.58
5276,4.72
5277,5.19
5278,6.03
5279,7.10
5280,8.32
5281,9.51
5282,10.68
5283,11.73
5284,12.70
5285,13.53
5286,14.30
5287,14.99
5288,15.69
5289,16.27
5290,16.79
5291,17.17
5292,17.55
5293,17.88
5294,18.31
5295,18.76
5296,19.32
5297,19.91
5298,20.57
5299,21.15
5300,21.62
5301,21.92
5302,22.12
5303,22.22
5304,22.25
5305,22.24
5306,22.32
5307,22.48
5308,22.71
5309,22.90
5310,23.03
5311,23.02
5312,22.87
5313,22.56
5314,22.18
5315,21.80
5316,21.53
5317,21.41
5318,21.46
5319,21.66
5320,21.89
5321,22.08
5322,22.14
5323,22.09
5324,21.93
5325,21.68
5326,21.35
5327,21.01
5328,20.65
5329,20.31
5330,19.87
5331,19.35
5332,18.71
5333,18.06
5334,17.40
5335,16.81
5336,16.27
5337,15.87
5338,15.55
5339,15.34
5340,15.11
5341,14.83
5342,14.37
5343,13.85
5344,13.28
5345,12.82
5346,12.39
5347,12.05
5348,11.76
5349,11.60
5350,11.47
5351,11.31
5352,10.97
5353,10.45
5354,9.75
5355,9.03
5356,8.33
5357,7.81
5358,7.46
5359,7.29
5360,7.18
5361,7.09
5362,6.93
5363,6.71
5364,6.32
5365,5.78
5366,5.13
5367,4.53
5368,4.05
5369,3.77
5370,3.60
5371,3.57
5372,3.58
5373,3.60
5374,3.47
5375,3.20
5376,2.72
5377,2.13
5378,1.40
5379,0.63
5380,-0.14
5381,-0.79
5382,-1.33
5383,-1.79
5384,-2.28
5385,-2.74
5386,-3.20
5387,-3.61
5388,-4.07
5389,-4.52
5390,-4.98
5391,-5.41
5392,-5.83
5393,-6.17
5394,-6.38
5395,-6.39
5396,-6.24
5397,-5.98
5398,-5.65
5399,-5.30
5400,-4.98
5401,-4.73
5402,-4.55
5403,-4.45
5404,-4.40
5405,-4.41
5406,-4.37
5407,-4.26
5408,-4.07
5409,-3.82
5410,-3.53
5411,-3.23
5412,-2.97
5413,-2.78
5414,-2.70
5415,-2.70
5416,-2.77
5417,-2.89
5418,-3.07
5419,-3.24
5420,-3.38
5421,-3.43
5422,-3.46
5423,-3.51
5424,-3.66
5425,-3.89
5426,-4.20
5427,-4.56
5428,-4.98
5429,-5.45
5430,-5.97
5431,-6.51
5432,-7.06
5433,-7.60
5434,-8.11
5435,-8.51
5436,-8.83
5437,-9.07
5438,-9.31
5439,-9.53
5440,-9.74
5441,-9.93
5442,-10.12
5443,-10.29
5444,-10.38
5445,-10.34
5446,-10.13
5447,-9.77
5448,-9.23
5449,-8.58
5450,-7.88
5451,-7.28
5452,-6.79
5453,-6.45
5454,-6.20
5455,-6.03
5456,-5.85
5457,-5.62
5458,-5.30
5459,-4.88
5460,-4.36
5461,-3.81
5462,-3.36
5463,-3.12
5464,-3.11
5465,-3.30
5466,-3.60
5467,-3.97
5468,-4.37
5469,-4.72
5470,-4.97
5471,-5.10
5472,-5.14
5473,-5.12
5474,-5.07
5475,-5.00
5476,-5.06
5477,-5.21
5478,-5.49
5479,-5.84
5480,-6.35
5481,-6.92
5482,-7.55
5483,-8.14
5484,-8.77
5485,-9.40
5486,-10.11
5487,-10.80
5488,-11.58
5489,-12.39
5490,-13.33
5491,-14.24
5492,-15.26
5493,-16.24
5494,-17.35
5495,-18.45
5496,-19.64
5497,-20.81
5498,-22.09
5499,-23.38
5500,-24.70
5501,-25.88
5502,-26.97
5503,-27.89
5504,-28.79
5505,-29.53
5506,-30.24
5507,-30.81
5508,-31.36
5509,-31.81
5510,-32.22
5511,-32.45
5512,-32.53
5513,-32.45
5514,-32.31
5515,-32.11
5516,-31.92
5517,-31.73
5518,-31.64
5519,-31.68
5520,-31.92
5521,-32.28
5522,-32.72
5523,-33.20
5524,-33.72
5525,-34.26
5526,-34.77
5527,-35.26
5528,-35.71
5529,-36.13
5530,-36.48
5531,-36.72
5532,-36.85
5533,-36.86
5534,-36.68
5535,-36.33
5536,-35.81
5537,-35.22
5538,-34.55
5539,-33.91
5540,-33.25
5541,-32.60
5542,-31.92
5543,-31.27
5544,-30.66
5545,-30.14
5546,-29.62
5547,-29.17
5548,-28.72
5549,-28.37
5550,-28.05
5551,-27.78
5552,-27.45
5553,-27.05
5554,-26.47
5555,-25.76
5556,-24.97
5557,-24.25
5558,-23.61
5559,-23.16
5560,-22.83
5561,-22.62
5562,-22.35
5563,-22.02
5564,-21.54
5565,-21.01
5566,-20.41
5567,-19.83
5568,-19.23
5569,-18.78
5570,-18.41
5571,-18.21
5572,-17.98
5573,-17.66
5574,-17.05
5575,-16.24
5576,-15.18
5577,-14.07
5578,-12.85
5579,-11.68
5580,-10.48
5581,-9.38
5582,-8.25
5583,-7.16
5584,-5.92
5585,-4.64
5586,-3.21
5587,-1.87
5588,-0.55
5589,0.53
5590,1.54
5591,2.40
5592,3.32
5593,4.22
5594,5.29
5595,6.46
5596,7.88
5597,9.34
5598,10.83
5599,12.12
5600,13.33
5601,14.31
5602,15.13
5603,15.69
5604,16.20
5605,16.63
5606,17.17
5607,17.68
5608,18.25
5609,18.76
5610,19.31
5611,19.77
5612,20.18
5613,20.45
5614,20.72
5615,21.04
5616,21.58
5617,22.29
5618,23.18
5619,24.12
5620,25.14
5621,26.15
5622,27.14
5623,27.96
5624,28.62
5625,29.08
5626,29.48
5627,29.81
5628,30.15
5629,30.49
5630,30.98
5631,31.62
5632,32.45
5633,33.29
5634,34.03
5635,34.58
5636,34.90
5637,34.97
5638,34.70
5639,34.10
5640,33.25
5641,32.28
5642,31.27
5643,30.32
5644,29.46
5645,28.82
5646,28.37
5647,28.16
5648,28.01
5649,27.91
5650,27.77
5651,27.62
5652,27.30
5653,26.78
5654,25.97
5655,24.96
5656,23.81
5657,22.72
5658,21.81
5659,21.29
5660,21.17
5661,21.42
5662,21.88
5663,22.44
5664,22.99
5665,23.41
5666,23.60
5667,23.54
5668,23.32
5669,23.12
5670,23.07
5671,23.25
5672,23.68
5673,24.28
5674,24.97
5675,25.57
5676,26.02
5677,26.31
5678,26.52
5679,26.69
5680,26.86
5681,27.10
5682,27.44
5683,27.88
5684,28.29
5685,28.55
5686,28.53
5687,28.23
5688,27.68
5689,27.02
5690,26.30
5691,25.60
5692,24.86
5693,24.17
5694,23.45
5695,22.77
5696,21.96
5697,21.10
5698,20.07
5699,19.02
5700,17.85
5701,16.75
5702,15.64
5703,14.66
5704,13.63
5705,12.66
5706,11.62
5707,10.64
5708,9.54
5709,8.45
5710,7.23
5711,6.08
5712,4.84
5713,3.69
5714,2.47
5715,1.33
5716,0.06
5717,-1.20
5718,-2.63
5719,-4.09
5720,-5.68
5721,-7.21
5722,-8.74
5723,-10.09
5724,-11.34
5725,-12.37
5726,-13.33
5727,-14.14
5728,-14.95
5729,-15.63
5730,-16.26
5731,-16.72
5732,-17.11
5733,-17.39
5734,-17.61
5735,-17.71
5736,-17.78
5737,-17.83
5738,-17.91
5739,-17.96
5740,-17.99
5741,-17.99
5742,-17.97
5743,-17.91
5744,-17.78
5745,-17.54
5746,-17.19
5747,-16.76
5748,-16.34
5749,-15.98
5750,-15.71
5751,-15.59
5752,-15.64
5753,-15.89
5754,-16.27
5755,-16.70
5756,-17.08
5757,-17.39
5758,-17.60
5759,-17.72
5760,-17.72
5761,-17.67
5762,-17.62
5763,-17.61
5764,-17.63
5765,-17.65
5766,-17.59
5767,-17.41
5768,-17.07
5769,-16.59
5770,-16.05
5771,-15.56
5772,-15.17
5773,-14.94
5774,-14.88
5775,-15.01
5776,-15.23
5777,-15.48
5778,-15.69
5779,-15.81
5780,-15.82
5781,-15.76
5782,-15.68
5783,-15.61
5784,-15.56
5785,-15.57
5786,-15.66
5787,-15.77
5788,-15.87
5789,-15.92
5790,-16.01
5791,-16.19
5792,-16.43
5793,-16.67
5794,-16.89
5795,-17.07
5796,-17.19
5797,-17.19
5798,-17.05
5799,-16.80
5800,-16.54
5801,-16.34
5802,-16.30
5803,-16.42
5804,-16.69
5805,-17.04
5806,-17.46
5807,-17.87
5808,-18.30
5809,-18.70
5810,-19.13
5811,-19.58
5812,-20.20
5813,-20.96
5814,-21.94
5815,-23.00
5816,-24.12
5817,-25.18
5818,-26.25
5819,-27.19
5820,-28.01
5821,-28.59
5822,-29.03
5823,-29.37
5824,-29.70
5825,-30.00
5826,-30.25
5827,-30.36
5828,-30.34
5829,-30.20
5830,-30.04
5831,-29.85
5832,-29.67
5833,-29.48
5834,-29.34
5835,-29.27
5836,-29.32
5837,-29.44
5838,-29.62
5839,-29.79
5840,-29.96
5841,-30.13
5842,-30.34
5843,-30.57
5844,-30.84
5845,-31.07
5846,-31.29
5847,-31.45
5848,-31.62
5849,-31.78
5850,-32.05
5851,-32.44
5852,-33.07
5853,-33.89
5854,-34.96
5855,-36.14
5856,-37.41
5857,-38.60
5858,-39.68
5859,-40.50
5860,-41.11
5861,-41.50
5862,-41.85
5863,-42.17
5864,-42.63
5865,-43.22
5866,-43.99
5867,-44.75
5868,-45.45
5869,-45.97
5870,-46.43
5871,-46.78
5872,-46.99
5873,-47.04
5874,-47.03
5875,-47.01
5876,-47.04
5877,-47.04
5878,-46.99
5879,-46.87
5880,-46.71
5881,-46.52
5882,-46.31
5883,-46.07
5884,-45.85
5885,-45.65
5886,-45.54
5887,-45.55
5888,-45.68
5889,-45.92
5890,-46.21
5891,-46.52
5892,-46.81
5893,-47.07
5894,-47.19
5895,-47.12
5896,-46.88
5897,-46.58
5898,-46.32
5899,-46.13
5900,-46.00
5901,-45.96
5902,-46.01
5903,-46.13
5904,-46.20
5905,-46.22
5906,-46.19
5907,-46.12
5908,-45.96
5909,-45.73
5910,-45.49
5911,-45.30
5912,-45.17
5913,-45.12
5914,-45.17
5915,-45.28
5916,-45.42
5917,-45.55
5918,-45.65
5919,-45.78
5920,-45.88
5921,-45.96
5922,-45.94
5923,-45.82
5924,-45.60
5925,-45.30
5926,-44.93
5927,-44.52
5928,-44.06
5929,-43.59
5930,-43.08
5931,-42.61
5932,-42.18
5933,-41.89
5934,-41.70
5935,-41.61
5936,-41.49
5937,-41.32
5938,-41.04
5939,-40.69
5940,-40.25
5941,-39.78
5942,-39.25
5943,-38.78
5944,-38.41
5945,-38.18
5946,-38.00
5947,-37.91
5948,-37.84
5949,-37.80
5950,-37.63
5951,-37.35
5952,-36.93
5953,-36.46
5954,-35.87
5955,-35.23
5956,-34.55
5957,-33.88
5958,-33.24
5959,-32.65
5960,-32.11
5961,-31.69
5962,-31.42
5963,-31.30
5964,-31.33
5965,-31.52
5966,-31.82
5967,-32.17
5968,-32.55
5969,-32.91
5970,-33.28
5971,-33.68
5972,-34.19
5973,-34.77
5974,-35.48
5975,-36.25
5976,-37.09
5977,-37.86
5978,-38.54
5979,-39.06
5980,-39.53
5981,-39.92
5982,-40.31
5983,-40.67
5984,-41.05
5985,-41.41
5986,-41.69
5987,-41.84
5988,-41.73
5989,-41.39
5990,-40.73
5991,-39.92
5992,-38.93
5993,-37.88
5994,-36.64
5995,-35.30
5996,-33.73
5997,-32.09
5998,-30.29
5999,-28.47
6000,-26.50
6001,-24.62
6002,-22.81
6003,-21.35
6004,-20.11
6005,-19.21
6006,-18.42
6007,-17.82
6008,-17.14
6009,-16.41
6010,-15.43
6011,-14.38
6012,-13.24
6013,-12.26
6014,-11.35
6015,-10.68
6016,-10.09
6017,-9.73
6018,-9.36
6019,-9.00
6020,-8.32
6021,-7.35
6022,-5.91
6023,-4.14
6024,-1.98
6025,0.26
6026,2.51
6027,4.52
6028,6.39
6029,7.96
6030,9.33
6031,10.44
6032,11.51
6033,12.49
6034,13.44
6035,14.21
6036,14.82
6037,15.11
6038,15.04
6039,14.49
6040,13.53
6041,12.31
6042,11.04
6043,9.89
6044,8.94
6045,8.29
6046,7.97
6047,7.98
6048,8.17
6049,8.38
6050,8.43
6051,8.31
6052,8.03
6053,7.66
6054,7.27
6055,6.96
6056,6.84
6057,7.01
6058,7.53
6059,8.30
6060,9.29
6061,10.35
6062,11.51
6063,12.63
6064,13.73
6065,14.65
6066,15.52
6067,16.26
6068,17.04
6069,17.78
6070,18.62
6071,19.40
6072,20.34
6073,21.32
6074,22.48
6075,23.63
6076,24.89
6077,26.12
6078,27.44
6079,28.70
6080,30.04
6081,31.33
6082,32.71
6083,34.03
6084,35.42
6085,36.71
6086,38.05
6087,39.32
6088,40.65
6089,41.86
6090,43.11
6091,44.28
6092,45.46
6093,46.51
6094,47.51
6095,48.38
6096,49.22
6097,49.93
6098,50.50
6099,50.84
6100,51.03
6101,51.08
6102,51.07
6103,51.00
6104,50.89
6105,50.71
6106,50.46
6107,50.12
6108,49.60
6109,48.96
6110,48.16
6111,47.34
6112,46.46
6113,45.64
6114,44.84
6115,44.15
6116,43.44
6117,42.76
6118,41.97
6119,41.09
6120,40.02
6121,38.91
6122,37.74
6123,36.68
6124,35.64
6125,34.72
6126,33.84
6127,33.08
6128,32.32
6129,31.62
6130,30.98
6131,30.50
6132,30.18
6133,30.07
6134,30.16
6135,30.47
6136,30.93
6137,31.41
6138,31.84
6139,32.20
6140,32.53
6141,32.87
6142,33.26
6143,33.74
6144,34.39
6145,35.13
6146,35.98
6147,36.75
6148,37.50
6149,38.12
6150,38.70
6151,39.22
6152,39.83
6153,40.51
6154,41.37
6155,42.30
6156,43.43
6157,44.59
6158,45.82
6159,46.94
6160,48.02
6161,48.93
6162,49.83
6163,50.69
6164,51.72
6165,52.83
6166,54.05
6167,55.24
6168,56.42
6169,57.42
6170,58.21
6171,58.68
6172,58.90
6173,58.87
6174,58.71
6175,58.45
6176,58.22
6177,58.08
6178,58.12
6179,58.24
6180,58.39
6181,58.45
6182,58.40
6183,58.28
6184,58.13
6185,58.01
6186,57.94
6187,58.01
6188,58.20
6189,58.46
6190,58.62
6191,58.57
6192,58.27
6193,57.80
6194,57.14
6195,56.37
6196,55.50
6197,54.67
6198,53.91
6199,53.25
6200,52.66
6201,52.14
6202,51.67
6203,51.25
6204,50.82
6205,50.42
6206,50.04
6207,49.73
6208,49.48
6209,49.32
6210,49.26
6211,49.31
6212,49.43
6213,49.61
6214,49.90
6215,50.31
6216,50.82
6217,51.35
6218,51.96
6219,52.67
6220,53.54
6221,54.48
6222,55.50
6223,56.51
6224,57.55
6225,58.49
6226,59.27
6227,59.76
6228,59.94
6229,59.80
6230,59.40
6231,58.87
6232,58.32
6233,57.83
6234,57.39
6235,57.04
6236,56.82
6237,56.70
6238,56.57
6239,56.37
6240,56.00
6241,55.53
6242,54.88
6243,54.12
6244,53.25
6245,52.43
6246,51.61
6247,50.87
6248,50.09
6249,49.35
6250,48.48
6251,47.56
6252,46.42
6253,45.20
6254,43.80
6255,42.40
6256,40.92
6257,39.57
6258,38.27
6259,37.18
6260,36.16
6261,35.31
6262,34.40
6263,33.55
6264,32.61
6265,31.68
6266,30.61
6267,29.51
6268,28.31
6269,27.20
6270,26.10
6271,25.17
6272,24.35
6273,23.78
6274,23.37
6275,23.16
6276,22.99
6277,22.91
6278,22.75
6279,22.53
6280,22.16
6281,21.69
6282,21.13
6283,20.59
6284,20.11
6285,19.76
6286,19.52
6287,19.42
6288,19.39
6289,19.41
6290,19.36
6291,19.26
6292,19.03
6293,18.75
6294,18.36
6295,17.90
6296,17.30
6297,16.66
6298,15.95
6299,15.26
6300,14.47
6301,13.65
6302,12.76
6303,11.96
6304,11.12
6305,10.31
6306,9.40
6307,8.47
6308,7.45
6309,6.52
6310,5.62
6311,4.88
6312,4.14
6313,3.53
6314,2.89
6315,2.27
6316,1.46
6317,0.55
6318,-0.58
6319,-1.82
6320,-3.24
6321,-4.65
6322,-6.03
6323,-7.15
6324,-8.07
6325,-8.71
6326,-9.12
6327,-9.27
6328,-9.30
6329,-9.22
6330,-9.14
6331,-9.00
6332,-8.87
6333,-8.74
6334,-8.68
6335,-8.68
6336,-8.69
6337,-8.64
6338,-8.50
6339,-8.32
6340,-8.13
6341,-7.95
6342,-7.75
6343,-7.53
6344,-7.23
6345,-6.87
6346,-6.43
6347,-5.96
6348,-5.48
6349,-5.06
6350,-4.71
6351,-4.49
6352,-4.35
6353,-4.30
6354,-4.25
6355,-4.14
6356,-3.92
6357,-3.62
6358,-3.29
6359,-3.05
6360,-2.95
6361,-3.01
6362,-3.19
6363,-3.44
6364,-3.72
6365,-3.97
6366,-4.09
6367,-4.04
6368,-3.78
6369,-3.43
6370,-3.02
6371,-2.66
6372,-2.36
6373,-2.13
6374,-1.94
6375,-1.83
6376,-1.77
6377,-1.71
6378,-1.58
6379,-1.35
6380,-1.01
6381,-0.59
6382,-0.08
6383,0.46
6384,0.92
6385,1.24
6386,1.34
6387,1.22
6388,0.85
6389,0.26
6390,-0.50
6391,-1.34
6392,-2.24
6393,-3.13
6394,-3.99
6395,-4.76
6396,-5.46
6397,-6.05
6398,-6.54
6399,-6.89
6400,-7.17
6401,-7.32
6402,-7.42
6403,-7.48
6404,-7.58
6405,-7.69
6406,-7.77
6407,-7.84
6408,-7.93
6409,-8.05
6410,-8.12
6411,-8.08
6412,-7.87
6413,-7.51
6414,-6.98
6415,-6.34
6416,-5.58
6417,-4.81
6418,-4.03
6419,-3.33
6420,-2.64
6421,-2.01
6422,-1.34
6423,-0.70
6424,-0.02
6425,0.67
6426,1.46
6427,2.20
6428,2.98
6429,3.67
6430,4.41
6431,5.15
6432,6.03
6433,6.94
6434,8.05
6435,9.22
6436,10.51
6437,11.69
6438,12.75
6439,13.56
6440,14.27
6441,14.82
6442,15.37
6443,15.88
6444,16.51
6445,17.20
6446,18.04
6447,18.86
6448,19.68
6449,20.32
6450,20.81
6451,21.02
6452,21.06
6453,20.98
6454,20.94
6455,20.92
6456,20.94
6457,20.94
6458,20.97
6459,21.02
6460,21.06
6461,21.06
6462,21.08
6463,21.12
6464,21.21
6465,21.32
6466,21.53
6467,21.80
6468,22.19
6469,22.59
6470,23.09
6471,23.66
6472,24.41
6473,25.28
6474,26.37
6475,27.61
6476,29.04
6477,30.45
6478,31.85
6479,33.07
6480,34.26
6481,35.36
6482,36.52
6483,37.64
6484,38.77
6485,39.82
6486,40.89
6487,41.88
6488,42.85
6489,43.67
6490,44.39
6491,44.90
6492,45.29
6493,45.50
6494,45.68
6495,45.77
6496,45.85
6497,45.90
6498,46.01
6499,46.17
6500,46.43
6501,46.72
6502,47.07
6503,47.41
6504,47.80
6505,48.15
6506,48.47
6507,48.76
6508,49.10
6509,49.51
6510,49.99
6511,50.48
6512,50.95
6513,51.38
6514,51.68
6515,51.81
6516,51.71
6517,51.42
6518,50.92
6519,50.28
6520,49.45
6521,48.51
6522,47.42
6523,46.30
6524,45.12
6525,43.95
6526,42.68
6527,41.44
6528,40.21
6529,39.16
6530,38.21
6531,37.46
6532,36.81
6533,36.36
6534,36.00
6535,35.80
6536,35.58
6537,35.39
6538,35.03
6539,34.50
6540,33.72
6541,32.84
6542,31.91
6543,31.07
6544,30.33
6545,29.80
6546,29.53
6547,29.54
6548,29.69
6549,29.88
6550,30.09
6551,30.33
6552,30.58
6553,30.82
6554,31.04
6555,31.29
6556,31.53
6557,31.71
6558,31.78
6559,31.79
6560,31.78
6561,31.77
6562,31.75
6563,31.76
6564,31.85
6565,32.02
6566,32.21
6567,32.36
6568,32.38
6569,32.26
6570,31.94
6571,31.48
6572,30.89
6573,30.29
6574,29.68
6575,29.09
6576,28.52
6577,27.99
6578,27.45
6579,26.93
6580,26.37
6581,25.86
6582,25.31
6583,24.86
6584,24.41
6585,24.09
6586,23.75
6587,23.42
6588,22.94
6589,22.36
6590,21.64
6591,20.88
6592,20.01
6593,19.14
6594,18.23
6595,17.40
6596,16.65
6597,16.14
6598,15.82
6599,15.73
6600,15.66
6601,15.59
6602,15.30
6603,14.86
6604,14.08
6605,13.03
6606,11.64
6607,10.15
6608,8.67
6609,7.42
6610,6.41
6611,5.71
6612,5.25
6613,5.05
6614,4.92
6615,4.77
6616,4.39
6617,3.87
6618,3.24
6619,2.63
6620,2.08
6621,1.66
6622,1.46
6623,1.53
6624,1.79
6625,2.15
6626,2.59
6627,3.06
6628,3.57
6629,4.04
6630,4.46
6631,4.81
6632,5.17
6633,5.51
6634,5.84
6635,6.13
6636,6.48
6637,6.81
6638,7.17
6639,7.46
6640,7.77
6641,8.10
6642,8.56
6643,9.15
6644,9.93
6645,10.83
6646,11.76
6647,12.60
6648,13.30
6649,13.76
6650,14.02
6651,14.01
6652,13.80
6653,13.49
6654,13.20
6655,13.01
6656,12.96
6657,13.10
6658,13.35
6659,13.61
6660,13.69
6661,13.54
6662,13.07
6663,12.37
6664,11.38
6665,10.25
6666,9.04
6667,7.99
6668,7.04
6669,6.32
6670,5.60
6671,4.93
6672,4.07
6673,3.11
6674,1.82
6675,0.31
6676,-1.56
6677,-3.56
6678,-5.71
6679,-7.77
6680,-9.85
6681,-11.78
6682,-13.69
6683,-15.46
6684,-17.20
6685,-18.71
6686,-20.07
6687,-21.06
6688,-21.79
6689,-22.18
6690,-22.32
6691,-22.19
6692,-21.88
6693,-21.45
6694,-20.98
6695,-20.55
6696,-20.23
6697,-20.00
6698,-19.78
6699,-19.58
6700,-19.24
6701,-18.78
6702,-18.07
6703,-17.20
6704,-16.13
6705,-15.00
6706,-13.80
6707,-12.69
6708,-11.65
6709,-10.83
6710,-10.15
6711,-9.64
6712,-9.17
6713,-8.72
6714,-8.14
6715,-7.51
6716,-6.77
6717,-6.07
6718,-5.36
6719,-4.79
6720,-4.30
6721,-3.97
6722,-3.66
6723,-3.40
6724,-3.01
6725,-2.50
6726,-1.72
6727,-0.79
6728,0.33
6729,1.44
6730,2.56
6731,3.56
6732,4.49
6733,5.24
6734,5.89
6735,6.34
6736,6.71
6737,6.99
6738,7.29
6739,7.57
6740,7.87
6741,8.16
6742,8.51
6743,8.90
6744,9.40
6745,9.92
6746,10.54
6747,11.18
6748,11.87
6749,12.51
6750,13.16
6751,13.73
6752,14.31
6753,14.82
6754,15.40
6755,15.96
6756,16.63
6757,17.33
6758,18.14
6759,18.95
6760,19.83
6761,20.64
6762,21.46
6763,22.22
6764,23.00
6765,23.69
6766,24.35
6767,24.93
6768,25.54
6769,26.12
6770,26.69
6771,27.15
6772,27.59
6773,27.98
6774,28.43
6775,28.90
6776,29.41
6777,29.95
6778,30.53
6779,31.05
6780,31.50
6781,31.79
6782,31.99
6783,32.01
6784,31.94
6785,31.75
6786,31.60
6787,31.51
6788,31.55
6789,31.73
6790,32.14
6791,32.71
6792,33.44
6793,34.23
6794,35.07
6795,35.90
6796,36.63
6797,37.17
6798,37.55
6799,37.78
6800,37.87
6801,37.81
6802,37.65
6803,37.40
6804,37.09
6805,36.80
6806,36.55
6807,36.38
6808,36.21
6809,35.98
6810,35.64
6811,35.22
6812,34.72
6813,34.19
6814,33.63
6815,33.15
6816,32.81
6817,32.70
6818,32.77
6819,32.97
6820,33.18
6821,33.37
6822,33.48
6823,33.48
6824,33.36
6825,33.18
6826,33.00
6827,32.87
6828,32.83
6829,32.89
6830,33.05
6831,33.29
6832,33.58
6833,33.88
6834,34.19
6835,34.48
6836,34.76
6837,35.06
6838,35.42
6839,35.83
6840,36.27
6841,36.68
6842,37.12
6843,37.51
6844,37.90
6845,38.27
6846,38.65
6847,38.99
6848,39.26
6849,39.45
6850,39.60
6851,39.63
6852,39.56
6853,39.38
6854,39.22
6855,39.15
6856,39.15
6857,39.22
6858,39.38
6859,39.62
6860,39.86
6861,39.99
6862,39.96
6863,39.79
6864,39.44
6865,38.99
6866,38.35
6867,37.57
6868,36.67
6869,35.78
6870,34.95
6871,34.26
6872,33.57
6873,32.94
6874,32.28
6875,31.65
6876,30.91
6877,30.11
6878,29.12
6879,28.13
6880,27.09
6881,26.15
6882,25.22
6883,24.42
6884,23.67
6885,23.03
6886,22.37
6887,21.74
6888,21.10
6889,20.58
6890,20.09
6891,19.70
6892,19.33
6893,19.04
6894,18.75
6895,18.49
6896,18.14
6897,17.72
6898,17.21
6899,16.75
6900,16.38
6901,16.20
6902,16.15
6903,16.24
6904,16.40
6905,16.59
6906,16.65
6907,16.49
6908,16.04
6909,15.39
6910,14.54
6911,13.63
6912,12.79
6913,12.19
6914,11.90
6915,11.92
6916,12.11
6917,12.37
6918,12.59
6919,12.72
6920,12.67
6921,12.43
6922,12.01
6923,11.59
6924,11.30
6925,11.25
6926,11.37
6927,11.63
6928,11.94
6929,12.26
6930,12.43
6931,12.38
6932,12.05
6933,11.59
6934,11.03
6935,10.49
6936,9.96
6937,9.49
6938,9.09
6939,8.74
6940,8.34
6941,7.88
6942,7.33
6943,6.73
6944,6.05
6945,5.41
6946,4.84
6947,4.42
6948,4.10
6949,3.88
6950,3.73
6951,3.67
6952,3.65
6953,3.66
6954,3.70
6955,3.81
6956,4.01
6957,4.33
6958,4.71
6959,5.13
6960,5.54
6961,5.84
6962,6.00
6963,6.00
6964,5.84
6965,5.54
6966,5.13
6967,4.70
6968,4.33
6969,4.08
6970,4.01
6971,4.14
6972,4.44
6973,4.86
6974,5.32
6975,5.74
6976,6.13
6977,6.41
6978,6.62
6979,6.79
6980,7.02
6981,7.29
6982,7.66
6983,8.08
6984,8.61
6985,9.13
6986,9.60
6987,9.90
6988,10.08
6989,10.18
6990,10.25
6991,10.31
6992,10.39
6993,10.51
6994,10.68
6995,10.93
6996,11.21
6997,11.46
6998,11.58
6999,11.53
7000,11.28
7001,10.93
7002,10.48
7003,10.02
7004,9.50
7005,8.97
7006,8.36
7007,7.73
7008,7.00
7009,6.25
7010,5.36
7011,4.41
7012,3.40
7013,2.51
7014,1.79
7015,1.32
7016,1.04
7017,0.95
7018,0.94
7019,0.94
7020,0.85
7021,0.68
7022,0.49
7023,0.36
7024,0.31
7025,0.35
7026,0.62
7027,1.14
7028,1.95
7029,2.85
7030,3.74
7031,4.51
7032,5.21
7033,5.79
7034,6.26
7035,6.61
7036,6.96
7037,7.35
7038,7.88
7039,8.47
7040,9.13
7041,9.77
7042,10.45
7043,11.09
7044,11.72
7045,12.24
7046,12.72
7047,13.04
7048,13.31
7049,13.46
7050,13.66
7051,13.79
7052,14.00
7053,14.27
7054,14.84
7055,15.69
7056,16.93
7057,18.42
7058,20.20
7059,22.03
7060,23.85
7061,25.46
7062,26.89
7063,27.99
7064,28.80
7065,29.26
7066,29.54
7067,29.69
7068,29.83
7069,29.95
7070,30.08
7071,30.19
7072,30.26
7073,30.21
7074,29.99
7075,29.58
7076,28.94
7077,28.18
7078,27.30
7079,26.41
7080,25.47
7081,24.60
7082,23.75
7083,22.99
7084,22.19
7085,21.39
7086,20.47
7087,19.53
7088,18.50
7089,17.49
7090,16.55
7091,15.84
7092,15.35
7093,15.14
7094,15.09
7095,15.23
7096,15.46
7097,15.72
7098,15.86
7099,15.87
7100,15.74
7101,15.55
7102,15.37
7103,15.24
7104,15.24
7105,15.41
7106,15.81
7107,16.33
7108,16.94
7109,17.55
7110,18.16
7111,18.67
7112,19.07
7113,19.30
7114,19.49
7115,19.56
7116,19.62
7117,19.65
7118,19.92
7119,20.42
7120,21.22
7121,22.22
7122,23.54
7123,25.01
7124,26.57
7125,28.00
7126,29.36
7127,30.52
7128,31.54
7129,32.28
7130,32.91
7131,33.47
7132,34.15
7133,34.84
7134,35.61
7135,36.31
7136,37.02
7137,37.64
7138,38.26
7139,38.84
7140,39.48
7141,40.05
7142,40.60
7143,41.06
7144,41.56
7145,42.08
7146,42.65
7147,43.17
7148,43.72
7149,44.24
7150,44.80
7151,45.33
7152,45.82
7153,46.17
7154,46.40
7155,46.50
7156,46.57
7157,46.62
7158,46.69
7159,46.81
7160,47.01
7161,47.24
7162,47.47
7163,47.65
7164,47.81
7165,47.92
7166,47.99
7167,47.98
7168,47.94
7169,47.87
7170,47.82
7171,47.76
7172,47.67
7173,47.55
7174,47.44
7175,47.37
7176,47.35
7177,47.35
7178,47.38
7179,47.43
7180,47.54
7181,47.71
7182,47.98
7183,48.34
7184,48.79
7185,49.32
7186,49.95
7187,50.61
7188,51.24
7189,51.91
7190,52.15
7191,51.99
7192,51.70
7193,51.47
7194,52.19
7195,53.03
7196,51.36
7197,47.68
7198,48.52
7199,59.55
7200,59.07
