1,-74.90
2,-100.00
3,-100.00
4,-100.00
5,-100.00
6,-69.59
7,-0.62
8,66.92
9,100.00
10,100.00
11,98.50
12,98.59
13,100.00
14,100.00
15,100.00
16,100.00
17,99.93
18,100.00
19,100.00
20,100.00
21,100.00
22,100.00
23,100.00
24,100.00
25,100.00
26,100.00
27,100.00
28,100.00
29,100.00
30,100.00
31,100.00
32,100.00
33,100.00
34,100.00
35,100.00
36,100.00
37,100.00
38,100.00
39,100.00
40,100.00
41,100.00
42,99.97
43,100.00
44,100.00
45,100.00
46,99.66
47,99.01
48,98.24
49,97.63
50,97.07
51,96.48
52,95.63
53,94.60
54,93.31
55,91.97
56,90.58
57,89.34
58,88.09
59,86.94
60,85.74
61,84.65
62,83.53
63,82.51
64,81.43
65,80.47
66,79.48
67,78.58
68,77.55
69,76.52
70,75.38
71,74.34
72,73.28
73,72.34
74,71.35
75,70.46
76,69.53
77,68.70
78,67.81
79,66.94
80,65.95
81,64.97
82,63.94
83,62.99
84,62.02
85,61.13
86,60.20
87,59.36
88,58.49
89,57.70
90,56.88
91,56.14
92,55.38
93,54.70
94,53.99
95,53.34
96,52.67
97,52.06
98,51.41
99,50.83
100,50.22
101,49.66
102,49.07
103,48.54
104,47.99
105,47.49
106,46.98
107,46.51
108,46.01
109,45.56
110,45.09
111,44.67
112,44.22
113,43.80
114,43.36
115,42.95
116,42.53
117,42.14
118,41.74
119,41.38
120,41.01
121,40.69
122,40.36
123,40.06
124,39.76
125,39.51
126,39.26
127,39.04
128,38.81
129,38.60
130,38.39
131,38.19
132,37.99
133,37.81
134,37.63
135,37.47
136,37.30
137,37.16
138,37.01
139,36.89
140,36.77
141,36.66
142,36.55
143,36.46
144,36.37
145,36.29
146,36.19
147,36.11
148,36.01
149,35.93
150,35.84
151,35.76
152,35.68
153,35.59
154,35.48
155,35.39
156,35.27
157,35.16
158,35.02
159,34.88
160,34.71
161,34.53
162,34.34
163,34.16
164,33.95
165,33.75
166,33.53
167,33.31
168,33.10
169,32.91
170,32.72
171,32.55
172,32.39
173,32.26
174,32.14
175,32.04
176,31.95
177,31.87
178,31.80
179,31.73
180,31.67
181,31.62
182,31.56
183,31.50
184,31.43
185,31.35
186,31.26
187,31.18
188,31.08
189,30.97
190,30.85
191,30.74
192,30.63
193,30.53
194,30.44
195,30.37
196,30.31
197,30.26
198,30.23
199,30.22
200,30.20
201,30.19
202,30.17
203,30.16
204,30.15
205,30.15
206,30.12
207,30.09
208,30.04
209,30.00
210,29.96
211,29.92
212,29.87
213,29.82
214,29.77
215,29.74
216,29.71
217,29.69
218,29.67
219,29.66
220,29.64
221,29.64
222,29.64
223,29.65
224,29.65
225,29.66
226,29.65
227,29.65
228,29.65
229,29.65
230,29.63
231,29.60
232,29.56
233,29.51
234,29.46
235,29.38
236,29.29
237,29.21
238,29.12
239,29.03
240,28.93
241,28.84
242,28.75
243,28.68
244,28.60
245,28.53
246,28.46
247,28.41
248,28.36
249,28.31
250,28.24
251,28.18
252,28.13
253,28.08
254,28.02
255,27.96
256,27.91
257,27.86
258,27.82
259,27.78
260,27.73
261,27.70
262,27.66
263,27.62
264,27.58
265,27.55
266,27.50
267,27.45
268,27.39
269,27.33
270,27.27
271,27.20
272,27.12
273,27.04
274,26.97
275,26.90
276,26.81
277,26.73
278,26.66
279,26.60
280,26.53
281,26.46
282,26.39
283,26.33
284,26.28
285,26.25
286,26.22
287,26.19
288,26.15
289,26.12
290,26.10
291,26.09
292,26.09
293,26.09
294,26.09
295,26.10
296,26.10
297,26.10
298,26.10
299,26.10
300,26.10
301,26.10
302,26.10
303,26.11
304,26.11
305,26.12
306,26.13
307,26.14
308,26.15
309,26.16
310,26.17
311,26.18
312,26.20
313,26.22
314,26.23
315,26.24
316,26.25
317,26.26
318,26.26
319,26.25
320,26.24
321,26.22
322,26.21
323,26.18
324,26.14
325,26.11
326,26.07
327,26.04
328,26.00
329,25.95
330,25.90
331,25.85
332,25.81
333,25.77
334,25.72
335,25.67
336,25.62
337,25.58
338,25.52
339,25.47
340,25.41
341,25.34
342,25.27
343,25.19
344,25.10
345,25.01
346,24.91
347,24.83
348,24.74
349,24.66
350,24.57
351,24.50
352,24.44
353,24.39
354,24.35
355,24.32
356,24.29
357,24.27
358,24.25
359,24.22
360,24.19
361,24.15
362,24.09
363,24.02
364,23.94
365,23.86
366,23.76
367,23.66
368,23.55
369,23.45
370,23.35
371,23.26
372,23.16
373,23.07
374,22.97
375,22.89
376,22.80
377,22.73
378,22.65
379,22.57
380,22.49
381,22.41
382,22.32
383,22.24
384,22.15
385,22.06
386,21.96
387,21.88
388,21.79
389,21.71
390,21.61
391,21.52
392,21.42
393,21.32
394,21.20
395,21.07
396,20.92
397,20.78
398,20.62
399,20.47
400,20.30
401,20.13
402,19.95
403,19.78
404,19.61
405,19.46
406,19.31
407,19.19
408,19.07
409,18.97
410,18.88
411,18.80
412,18.74
413,18.68
414,18.61
415,18.54
416,18.47
417,18.41
418,18.34
419,18.27
420,18.18
421,18.09
422,17.98
423,17.87
424,17.76
425,17.65
426,17.54
427,17.44
428,17.34
429,17.24
430,17.14
431,17.05
432,16.97
433,16.90
434,16.84
435,16.78
436,16.74
437,16.70
438,16.67
439,16.64
440,16.62
441,16.60
442,16.58
443,16.58
444,16.57
445,16.56
446,16.54
447,16.51
448,16.49
449,16.47
450,16.44
451,16.40
452,16.36
453,16.31
454,16.27
455,16.22
456,16.17
457,16.12
458,16.07
459,16.02
460,15.98
461,15.95
462,15.93
463,15.93
464,15.94
465,15.95
466,15.99
467,16.05
468,16.13
469,16.22
470,16.34
471,16.46
472,16.60
473,16.73
474,16.87
475,17.01
476,17.16
477,17.30
478,17.43
479,17.56
480,17.68
481,17.80
482,17.91
483,18.01
484,18.13
485,18.23
486,18.35
487,18.46
488,18.57
489,18.68
490,18.79
491,18.88
492,18.98
493,19.06
494,19.15
495,19.22
496,19.27
497,19.31
498,19.34
499,19.35
500,19.38
501,19.39
502,19.40
503,19.40
504,19.39
505,19.38
506,19.36
507,19.34
508,19.31
509,19.28
510,19.24
511,19.20
512,19.14
513,19.07
514,18.99
515,18.90
516,18.81
517,18.73
518,18.64
519,18.56
520,18.48
521,18.40
522,18.32
523,18.25
524,18.18
525,18.12
526,18.05
527,17.99
528,17.93
529,17.86
530,17.80
531,17.73
532,17.65
533,17.56
534,17.47
535,17.38
536,17.29
537,17.22
538,17.14
539,17.06
540,16.99
541,16.92
542,16.84
543,16.77
544,16.70
545,16.64
546,16.57
547,16.52
548,16.46
549,16.41
550,16.36
551,16.33
552,16.31
553,16.31
554,16.32
555,16.35
556,16.38
557,16.41
558,16.46
559,16.52
560,16.58
561,16.64
562,16.68
563,16.72
564,16.75
565,16.78
566,16.79
567,16.79
568,16.80
569,16.79
570,16.79
571,16.79
572,16.78
573,16.78
574,16.78
575,16.79
576,16.79
577,16.78
578,16.78
579,16.80
580,16.84
581,16.88
582,16.92
583,16.96
584,17.01
585,17.06
586,17.11
587,17.16
588,17.20
589,17.24
590,17.28
591,17.31
592,17.34
593,17.37
594,17.39
595,17.41
596,17.44
597,17.47
598,17.51
599,17.54
600,17.59
601,17.64
602,17.70
603,17.76
604,17.82
605,17.89
606,17.97
607,18.05
608,18.12
609,18.18
610,18.22
611,18.26
612,18.29
613,18.31
614,18.33
615,18.36
616,18.39
617,18.42
618,18.45
619,18.48
620,18.52
621,18.55
622,18.59
623,18.62
624,18.65
625,18.69
626,18.73
627,18.77
628,18.80
629,18.84
630,18.89
631,18.95
632,19.00
633,19.04
634,19.09
635,19.13
636,19.19
637,19.24
638,19.30
639,19.35
640,19.41
641,19.45
642,19.52
643,19.57
644,19.64
645,19.70
646,19.76
647,19.82
648,19.87
649,19.92
650,19.98
651,20.02
652,20.06
653,20.10
654,20.15
655,20.21
656,20.25
657,20.29
658,20.33
659,20.38
660,20.44
661,20.50
662,20.57
663,20.64
664,20.72
665,20.80
666,20.90
667,21.00
668,21.11
669,21.20
670,21.30
671,21.39
672,21.48
673,21.56
674,21.63
675,21.67
676,21.70
677,21.71
678,21.71
679,21.68
680,21.63
681,21.55
682,21.48
683,21.40
684,21.32
685,21.23
686,21.15
687,21.06
688,20.99
689,20.94
690,20.91
691,20.90
692,20.92
693,20.95
694,20.99
695,21.04
696,21.11
697,21.19
698,21.29
699,21.40
700,21.51
701,21.62
702,21.73
703,21.83
704,21.94
705,22.05
706,22.16
707,22.25
708,22.34
709,22.42
710,22.49
711,22.55
712,22.60
713,22.64
714,22.67
715,22.68
716,22.69
717,22.68
718,22.68
719,22.66
720,22.64
721,22.61
722,22.59
723,22.58
724,22.59
725,22.60
726,22.63
727,22.67
728,22.71
729,22.78
730,22.85
731,22.94
732,23.05
733,23.16
734,23.27
735,23.38
736,23.49
737,23.60
738,23.71
739,23.80
740,23.89
741,23.95
742,23.99
743,24.01
744,24.03
745,24.03
746,24.02
747,23.99
748,23.97
749,23.93
750,23.91
751,23.89
752,23.87
753,23.87
754,23.89
755,23.92
756,23.95
757,23.99
758,24.04
759,24.08
760,24.13
761,24.15
762,24.17
763,24.18
764,24.19
765,24.17
766,24.14
767,24.11
768,24.07
769,24.03
770,23.98
771,23.94
772,23.91
773,23.89
774,23.88
775,23.88
776,23.88
777,23.88
778,23.88
779,23.89
780,23.89
781,23.90
782,23.90
783,23.90
784,23.89
785,23.88
786,23.85
787,23.80
788,23.75
789,23.71
790,23.66
791,23.61
792,23.57
793,23.52
794,23.48
795,23.44
796,23.41
797,23.38
798,23.37
799,23.37
800,23.37
801,23.37
802,23.38
803,23.39
804,23.39
805,23.40
806,23.41
807,23.41
808,23.42
809,23.42
810,23.42
811,23.43
812,23.45
813,23.47
814,23.49
815,23.52
816,23.55
817,23.58
818,23.64
819,23.72
820,23.80
821,23.88
822,23.95
823,24.02
824,24.11
825,24.19
826,24.26
827,24.33
828,24.38
829,24.42
830,24.45
831,24.47
832,24.48
833,24.47
834,24.46
835,24.46
836,24.46
837,24.46
838,24.45
839,24.44
840,24.44
841,24.43
842,24.44
843,24.44
844,24.44
845,24.43
846,24.43
847,24.44
848,24.45
849,24.44
850,24.44
851,24.43
852,24.44
853,24.44
854,24.44
855,24.42
856,24.41
857,24.39
858,24.37
859,24.33
860,24.28
861,24.23
862,24.17
863,24.10
864,24.01
865,23.92
866,23.81
867,23.70
868,23.57
869,23.43
870,23.28
871,23.13
872,22.96
873,22.79
874,22.62
875,22.45
876,22.29
877,22.14
878,21.99
879,21.86
880,21.73
881,21.61
882,21.51
883,21.42
884,21.32
885,21.22
886,21.11
887,21.02
888,20.93
889,20.84
890,20.74
891,20.64
892,20.53
893,20.43
894,20.34
895,20.25
896,20.16
897,20.08
898,20.01
899,19.95
900,19.88
901,19.82
902,19.76
903,19.70
904,19.63
905,19.55
906,19.46
907,19.38
908,19.28
909,19.18
910,19.08
911,19.00
912,18.92
913,18.86
914,18.80
915,18.74
916,18.70
917,18.66
918,18.63
919,18.59
920,18.54
921,18.49
922,18.43
923,18.36
924,18.26
925,18.15
926,18.03
927,17.90
928,17.76
929,17.63
930,17.49
931,17.37
932,17.25
933,17.15
934,17.06
935,17.00
936,16.94
937,16.90
938,16.86
939,16.84
940,16.82
941,16.82
942,16.82
943,16.82
944,16.81
945,16.82
946,16.85
947,16.88
948,16.92
949,16.96
950,17.01
951,17.07
952,17.14
953,17.21
954,17.29
955,17.36
956,17.43
957,17.50
958,17.57
959,17.63
960,17.68
961,17.73
962,17.78
963,17.83
964,17.87
965,17.92
966,17.98
967,18.05
968,18.12
969,18.18
970,18.25
971,18.32
972,18.40
973,18.47
974,18.56
975,18.64
976,18.73
977,18.80
978,18.88
979,18.95
980,19.04
981,19.12
982,19.20
983,19.26
984,19.32
985,19.38
986,19.43
987,19.46
988,19.47
989,19.48
990,19.47
991,19.46
992,19.42
993,19.38
994,19.32
995,19.25
996,19.18
997,19.10
998,19.01
999,18.91
1000,18.82
1001,18.73
1002,18.63
1003,18.53
1004,18.43
1005,18.33
1006,18.25
1007,18.17
1008,18.10
1009,18.05
1010,17.99
1011,17.96
1012,17.92
1013,17.88
1014,17.85
1015,17.82
1016,17.78
1017,17.74
1018,17.68
1019,17.60
1020,17.49
1021,17.36
1022,17.22
1023,17.09
1024,16.96
1025,16.83
1026,16.70
1027,16.58
1028,16.48
1029,16.39
1030,16.31
1031,16.26
1032,16.22
1033,16.22
1034,16.23
1035,16.26
1036,16.30
1037,16.35
1038,16.42
1039,16.48
1040,16.53
1041,16.56
1042,16.58
1043,16.60
1044,16.63
1045,16.66
1046,16.70
1047,16.74
1048,16.81
1049,16.88
1050,16.96
1051,17.04
1052,17.13
1053,17.21
1054,17.28
1055,17.35
1056,17.42
1057,17.48
1058,17.54
1059,17.58
1060,17.62
1061,17.65
1062,17.68
1063,17.72
1064,17.75
1065,17.79
1066,17.83
1067,17.87
1068,17.92
1069,17.97
1070,18.03
1071,18.09
1072,18.15
1073,18.22
1074,18.28
1075,18.33
1076,18.39
1077,18.44
1078,18.49
1079,18.54
1080,18.59
1081,18.63
1082,18.66
1083,18.70
1084,18.73
1085,18.76
1086,18.78
1087,18.78
1088,18.79
1089,18.79
1090,18.79
1091,18.80
1092,18.80
1093,18.79
1094,18.77
1095,18.76
1096,18.75
1097,18.74
1098,18.72
1099,18.69
1100,18.66
1101,18.63
1102,18.59
1103,18.56
1104,18.52
1105,18.48
1106,18.45
1107,18.42
1108,18.40
1109,18.38
1110,18.38
1111,18.38
1112,18.39
1113,18.42
1114,18.47
1115,18.51
1116,18.56
1117,18.61
1118,18.67
1119,18.72
1120,18.76
1121,18.79
1122,18.82
1123,18.85
1124,18.89
1125,18.92
1126,18.95
1127,18.98
1128,19.03
1129,19.09
1130,19.15
1131,19.22
1132,19.29
1133,19.36
1134,19.44
1135,19.52
1136,19.60
1137,19.67
1138,19.73
1139,19.78
1140,19.83
1141,19.89
1142,19.94
1143,19.98
1144,20.04
1145,20.11
1146,20.20
1147,20.28
1148,20.37
1149,20.46
1150,20.57
1151,20.68
1152,20.79
1153,20.88
1154,20.97
1155,21.04
1156,21.11
1157,21.17
1158,21.21
1159,21.24
1160,21.26
1161,21.26
1162,21.26
1163,21.25
1164,21.24
1165,21.24
1166,21.25
1167,21.26
1168,21.28
1169,21.31
1170,21.34
1171,21.37
1172,21.42
1173,21.47
1174,21.53
1175,21.58
1176,21.62
1177,21.65
1178,21.67
1179,21.69
1180,21.72
1181,21.73
1182,21.75
1183,21.76
1184,21.77
1185,21.78
1186,21.80
1187,21.81
1188,21.83
1189,21.92
1190,21.92
1191,21.84
1192,21.74
1193,21.73
1194,22.14
1195,22.27
1196,21.75
1197,20.99
1198,21.55
1199,23.85
1200,21.61
