1,15.17
2,21.88
3,22.31
4,20.11
5,19.35
6,20.29
7,20.81
8,20.48
9,20.08
10,20.10
11,20.11
12,20.00
13,19.78
14,19.61
15,19.45
16,19.29
17,19.16
18,19.03
19,18.93
20,18.86
21,18.83
22,18.82
23,18.82
24,18.84
25,18.89
26,18.94
27,18.99
28,19.03
29,19.06
30,19.07
31,19.07
32,19.07
33,19.07
34,19.06
35,19.05
36,19.04
37,19.04
38,19.04
39,19.04
40,19.04
41,19.04
42,19.04
43,19.04
44,19.04
45,19.02
46,18.99
47,18.97
48,18.94
49,18.91
50,18.87
51,18.82
52,18.79
53,18.77
54,18.77
55,18.77
56,18.78
57,18.81
58,18.85
59,18.90
60,18.94
61,18.99
62,19.04
63,19.08
64,19.10
65,19.10
66,19.10
67,19.10
68,19.09
69,19.06
70,19.02
71,18.98
72,18.92
73,18.85
74,18.76
75,18.66
76,18.59
77,18.51
78,18.43
79,18.34
80,18.26
81,18.19
82,18.16
83,18.14
84,18.15
85,18.20
86,18.28
87,18.40
88,18.55
89,18.72
90,18.88
91,19.05
92,19.22
93,19.38
94,19.53
95,19.64
96,19.75
97,19.83
98,19.91
99,19.96
100,20.02
101,20.06
102,20.11
103,20.16
104,20.24
105,20.32
106,20.44
107,20.55
108,20.68
109,20.81
110,20.95
111,21.10
112,21.27
113,21.43
114,21.58
115,21.71
116,21.85
117,22.00
118,22.15
119,22.28
120,22.40
121,22.50
122,22.60
123,22.69
124,22.77
125,22.81
126,22.83
127,22.81
128,22.77
129,22.71
130,22.63
131,22.54
132,22.44
133,22.34
134,22.24
135,22.13
136,22.02
137,21.92
138,21.83
139,21.75
140,21.68
141,21.61
142,21.54
143,21.48
144,21.41
145,21.32
146,21.22
147,21.14
148,21.05
149,20.98
150,20.90
151,20.82
152,20.71
153,20.61
154,20.51
155,20.43
156,20.33
157,20.23
158,20.11
159,19.97
160,19.84
161,19.72
162,19.61
163,19.51
164,19.40
165,19.31
166,19.26
167,19.26
168,19.29
169,19.33
170,19.40
171,19.51
172,19.65
173,19.80
174,19.94
175,20.07
176,20.23
177,20.39
178,20.54
179,20.65
180,20.77
181,20.88
182,21.00
183,21.09
184,21.16
185,21.23
186,21.32
187,21.41
188,21.49
189,21.55
190,21.60
191,21.66
192,21.72
193,21.78
194,21.84
195,21.89
196,21.97
197,22.04
198,22.11
199,22.17
200,22.23
201,22.29
202,22.33
203,22.35
204,22.34
205,22.31
206,22.26
207,22.22
208,22.17
209,22.13
210,22.08
211,22.04
212,22.00
213,21.98
214,21.99
215,22.01
216,22.02
217,22.04
218,22.06
219,22.07
220,22.08
221,22.07
222,22.02
223,21.96
224,21.90
225,21.84
226,21.77
227,21.68
228,21.58
229,21.51
230,21.46
231,21.43
232,21.41
233,21.41
234,21.43
235,21.48
236,21.55
237,21.62
238,21.69
239,21.77
240,21.85
241,21.92
242,21.98
243,22.03
244,22.07
245,22.11
246,22.15
247,22.16
248,22.17
249,22.16
250,22.16
251,22.14
252,22.13
253,22.11
254,22.10
255,22.09
256,22.06
257,22.03
258,22.01
259,21.99
260,21.98
261,21.98
262,21.99
263,22.00
264,22.03
265,22.07
266,22.14
267,22.21
268,22.29
269,22.36
270,22.44
271,22.53
272,22.63
273,22.72
274,22.80
275,22.86
276,22.89
277,22.91
278,22.92
279,22.92
280,22.88
281,22.81
282,22.73
283,22.67
284,22.61
285,22.54
286,22.45
287,22.37
288,22.32
289,22.29
290,22.28
291,22.28
292,22.28
293,22.28
294,22.30
295,22.33
296,22.35
297,22.37
298,22.38
299,22.39
300,22.40
301,22.40
302,22.40
303,22.40
304,22.39
305,22.38
306,22.37
307,22.37
308,22.38
309,22.38
310,22.36
311,22.33
312,22.29
313,22.25
314,22.21
315,22.14
316,22.05
317,21.95
318,21.86
319,21.79
320,21.69
321,21.58
322,21.46
323,21.37
324,21.30
325,21.22
326,21.14
327,21.07
328,21.00
329,20.95
330,20.87
331,20.80
332,20.73
333,20.68
334,20.61
335,20.54
336,20.46
337,20.39
338,20.31
339,20.24
340,20.17
341,20.11
342,20.05
343,19.99
344,19.94
345,19.90
346,19.85
347,19.79
348,19.72
349,19.67
350,19.61
351,19.55
352,19.48
353,19.41
354,19.33
355,19.26
356,19.17
357,19.09
358,19.00
359,18.93
360,18.84
361,18.76
362,18.68
363,18.60
364,18.52
365,18.41
366,18.30
367,18.19
368,18.10
369,18.01
370,17.93
371,17.85
372,17.78
373,17.72
374,17.69
375,17.69
376,17.71
377,17.76
378,17.83
379,17.94
380,18.06
381,18.18
382,18.29
383,18.39
384,18.50
385,18.60
386,18.70
387,18.79
388,18.87
389,18.95
390,19.02
391,19.07
392,19.13
393,19.17
394,19.21
395,19.24
396,19.26
397,19.27
398,19.29
399,19.29
400,19.26
401,19.20
402,19.12
403,19.03
404,18.94
405,18.83
406,18.71
407,18.58
408,18.44
409,18.31
410,18.17
411,18.04
412,17.90
413,17.81
414,17.72
415,17.65
416,17.55
417,17.46
418,17.36
419,17.29
420,17.20
421,17.11
422,17.00
423,16.91
424,16.81
425,16.71
426,16.63
427,16.56
428,16.51
429,16.46
430,16.45
431,16.46
432,16.48
433,16.50
434,16.53
435,16.57
436,16.62
437,16.67
438,16.71
439,16.75
440,16.80
441,16.84
442,16.90
443,16.97
444,17.06
445,17.14
446,17.25
447,17.38
448,17.54
449,17.72
450,17.92
451,18.12
452,18.35
453,18.59
454,18.84
455,19.09
456,19.35
457,19.58
458,19.80
459,19.99
460,20.18
461,20.35
462,20.52
463,20.66
464,20.81
465,20.94
466,21.08
467,21.19
468,21.29
469,21.38
470,21.48
471,21.58
472,21.67
473,21.73
474,21.77
475,21.82
476,21.86
477,21.88
478,21.85
479,21.81
480,21.75
481,21.69
482,21.62
483,21.55
484,21.48
485,21.40
486,21.32
487,21.25
488,21.18
489,21.12
490,21.07
491,21.02
492,20.98
493,20.96
494,20.93
495,20.88
496,20.83
497,20.77
498,20.71
499,20.65
500,20.58
501,20.51
502,20.43
503,20.36
504,20.28
505,20.20
506,20.15
507,20.12
508,20.10
509,20.08
510,20.08
511,20.11
512,20.17
513,20.25
514,20.33
515,20.40
516,20.47
517,20.54
518,20.64
519,20.74
520,20.84
521,20.92
522,20.97
523,21.01
524,21.06
525,21.11
526,21.14
527,21.15
528,21.15
529,21.14
530,21.11
531,21.06
532,21.01
533,20.97
534,20.92
535,20.86
536,20.78
537,20.69
538,20.61
539,20.52
540,20.41
541,20.28
542,20.12
543,19.96
544,19.80
545,19.65
546,19.49
547,19.33
548,19.16
549,19.03
550,18.94
551,18.90
552,18.87
553,18.86
554,18.87
555,18.91
556,18.98
557,19.06
558,19.13
559,19.19
560,19.25
561,19.29
562,19.32
563,19.32
564,19.29
565,19.25
566,19.19
567,19.13
568,19.06
569,19.01
570,18.97
571,18.95
572,18.95
573,18.97
574,19.00
575,19.04
576,19.09
577,19.13
578,19.19
579,19.24
580,19.31
581,19.37
582,19.42
583,19.46
584,19.51
585,19.57
586,19.65
587,19.74
588,19.82
589,19.89
590,19.99
591,20.09
592,20.18
593,20.26
594,20.34
595,20.42
596,20.50
597,20.55
598,20.57
599,20.58
600,20.60
601,20.60
602,20.57
603,20.53
604,20.48
605,20.43
606,20.39
607,20.32
608,20.25
609,20.18
610,20.10
611,20.03
612,19.95
613,19.89
614,19.86
615,19.82
616,19.79
617,19.76
618,19.75
619,19.78
620,19.84
621,19.90
622,19.97
623,20.06
624,20.16
625,20.27
626,20.37
627,20.47
628,20.58
629,20.67
630,20.75
631,20.79
632,20.79
633,20.78
634,20.76
635,20.73
636,20.68
637,20.62
638,20.57
639,20.55
640,20.56
641,20.58
642,20.60
643,20.63
644,20.68
645,20.74
646,20.78
647,20.80
648,20.79
649,20.78
650,20.74
651,20.67
652,20.56
653,20.45
654,20.32
655,20.19
656,20.03
657,19.87
658,19.71
659,19.58
660,19.45
661,19.32
662,19.19
663,19.09
664,18.98
665,18.89
666,18.78
667,18.68
668,18.56
669,18.44
670,18.33
671,18.23
672,18.13
673,18.05
674,17.95
675,17.86
676,17.78
677,17.71
678,17.63
679,17.56
680,17.48
681,17.41
682,17.34
683,17.28
684,17.22
685,17.16
686,17.12
687,17.10
688,17.11
689,17.12
690,17.14
691,17.19
692,17.27
693,17.37
694,17.48
695,17.58
696,17.70
697,17.83
698,17.98
699,18.13
700,18.30
701,18.45
702,18.60
703,18.75
704,18.92
705,19.13
706,19.37
707,19.58
708,19.81
709,20.02
710,20.27
711,20.54
712,20.82
713,21.08
714,21.34
715,21.59
716,21.84
717,22.06
718,22.26
719,22.42
720,22.57
721,22.68
722,22.77
723,22.81
724,22.83
725,22.81
726,22.77
727,22.71
728,22.64
729,22.55
730,22.43
731,22.30
732,22.16
733,22.02
734,21.88
735,21.73
736,21.60
737,21.48
738,21.36
739,21.24
740,21.13
741,21.04
742,20.96
743,20.89
744,20.82
745,20.76
746,20.72
747,20.69
748,20.65
749,20.61
750,20.57
751,20.56
752,20.55
753,20.55
754,20.57
755,20.60
756,20.64
757,20.69
758,20.72
759,20.75
760,20.79
761,20.83
762,20.87
763,20.89
764,20.89
765,20.87
766,20.84
767,20.78
768,20.69
769,20.59
770,20.47
771,20.33
772,20.19
773,20.04
774,19.89
775,19.75
776,19.65
777,19.57
778,19.51
779,19.45
780,19.41
781,19.42
782,19.45
783,19.49
784,19.54
785,19.58
786,19.63
787,19.68
788,19.71
789,19.73
790,19.73
791,19.71
792,19.67
793,19.61
794,19.54
795,19.49
796,19.43
797,19.37
798,19.30
799,19.22
800,19.17
801,19.14
802,19.12
803,19.11
804,19.09
805,19.09
806,19.10
807,19.12
808,19.15
809,19.18
810,19.20
811,19.21
812,19.24
813,19.26
814,19.28
815,19.27
816,19.23
817,19.19
818,19.13
819,19.07
820,19.01
821,18.93
822,18.85
823,18.76
824,18.66
825,18.58
826,18.50
827,18.44
828,18.37
829,18.32
830,18.29
831,18.29
832,18.29
833,18.28
834,18.26
835,18.26
836,18.27
837,18.28
838,18.26
839,18.23
840,18.18
841,18.11
842,18.01
843,17.91
844,17.78
845,17.64
846,17.47
847,17.31
848,17.13
849,16.96
850,16.78
851,16.64
852,16.50
853,16.39
854,16.28
855,16.19
856,16.13
857,16.10
858,16.09
859,16.11
860,16.14
861,16.17
862,16.19
863,16.20
864,16.23
865,16.26
866,16.28
867,16.28
868,16.26
869,16.23
870,16.20
871,16.18
872,16.18
873,16.18
874,16.19
875,16.22
876,16.27
877,16.33
878,16.39
879,16.43
880,16.48
881,16.54
882,16.60
883,16.65
884,16.67
885,16.67
886,16.66
887,16.66
888,16.66
889,16.66
890,16.65
891,16.64
892,16.63
893,16.63
894,16.62
895,16.59
896,16.56
897,16.53
898,16.49
899,16.43
900,16.35
901,16.28
902,16.21
903,16.16
904,16.09
905,16.01
906,15.94
907,15.88
908,15.84
909,15.81
910,15.78
911,15.77
912,15.77
913,15.78
914,15.80
915,15.81
916,15.85
917,15.91
918,15.97
919,16.02
920,16.06
921,16.12
922,16.19
923,16.27
924,16.34
925,16.41
926,16.48
927,16.56
928,16.64
929,16.73
930,16.82
931,16.91
932,17.01
933,17.11
934,17.20
935,17.28
936,17.36
937,17.45
938,17.53
939,17.59
940,17.63
941,17.64
942,17.64
943,17.64
944,17.64
945,17.64
946,17.64
947,17.62
948,17.61
949,17.61
950,17.62
951,17.63
952,17.65
953,17.68
954,17.74
955,17.81
956,17.87
957,17.94
958,18.01
959,18.11
960,18.23
961,18.35
962,18.48
963,18.61
964,18.76
965,18.91
966,19.05
967,19.19
968,19.32
969,19.44
970,19.53
971,19.59
972,19.62
973,19.60
974,19.55
975,19.48
976,19.38
977,19.28
978,19.17
979,19.03
980,18.87
981,18.73
982,18.60
983,18.50
984,18.39
985,18.27
986,18.15
987,18.03
988,17.91
989,17.79
990,17.67
991,17.55
992,17.43
993,17.31
994,17.20
995,17.11
996,17.03
997,16.96
998,16.89
999,16.87
1000,16.87
1001,16.89
1002,16.90
1003,16.92
1004,16.95
1005,16.99
1006,17.03
1007,17.07
1008,17.10
1009,17.12
1010,17.13
1011,17.12
1012,17.10
1013,17.05
1014,16.97
1015,16.89
1016,16.80
1017,16.72
1018,16.63
1019,16.53
1020,16.45
1021,16.38
1022,16.33
1023,16.29
1024,16.27
1025,16.28
1026,16.31
1027,16.34
1028,16.39
1029,16.46
1030,16.55
1031,16.62
1032,16.70
1033,16.79
1034,16.88
1035,16.97
1036,17.07
1037,17.15
1038,17.23
1039,17.31
1040,17.39
1041,17.48
1042,17.57
1043,17.64
1044,17.70
1045,17.76
1046,17.82
1047,17.86
1048,17.89
1049,17.91
1050,17.91
1051,17.91
1052,17.90
1053,17.87
1054,17.82
1055,17.76
1056,17.70
1057,17.63
1058,17.53
1059,17.40
1060,17.29
1061,17.20
1062,17.13
1063,17.05
1064,16.98
1065,16.92
1066,16.89
1067,16.89
1068,16.90
1069,16.92
1070,16.94
1071,16.97
1072,16.99
1073,16.99
1074,16.98
1075,16.98
1076,16.99
1077,16.99
1078,16.97
1079,16.94
1080,16.92
1081,16.90
1082,16.89
1083,16.88
1084,16.86
1085,16.86
1086,16.87
1087,16.88
1088,16.85
1089,16.81
1090,16.74
1091,16.67
1092,16.59
1093,16.50
1094,16.39
1095,16.27
1096,16.15
1097,16.04
1098,15.97
1099,15.92
1100,15.91
1101,15.92
1102,15.97
1103,16.04
1104,16.15
1105,16.28
1106,16.44
1107,16.60
1108,16.78
1109,16.95
1110,17.14
1111,17.32
1112,17.49
1113,17.63
1114,17.77
1115,17.88
1116,18.00
1117,18.10
1118,18.19
1119,18.26
1120,18.34
1121,18.41
1122,18.47
1123,18.52
1124,18.57
1125,18.62
1126,18.66
1127,18.68
1128,18.70
1129,18.72
1130,18.75
1131,18.77
1132,18.78
1133,18.78
1134,18.82
1135,18.88
1136,18.97
1137,19.07
1138,19.18
1139,19.28
1140,19.41
1141,19.56
1142,19.71
1143,19.85
1144,19.97
1145,20.07
1146,20.14
1147,20.19
1148,20.22
1149,20.23
1150,20.22
1151,20.19
1152,20.16
1153,20.13
1154,20.10
1155,20.07
1156,20.03
1157,20.00
1158,19.98
1159,19.97
1160,19.96
1161,19.95
1162,19.92
1163,19.89
1164,19.85
1165,19.81
1166,19.76
1167,19.72
1168,19.67
1169,19.63
1170,19.58
1171,19.52
1172,19.45
1173,19.40
1174,19.34
1175,19.27
1176,19.16
1177,19.05
1178,18.92
1179,18.80
1180,18.66
1181,18.52
1182,18.38
1183,18.26
1184,18.14
1185,18.02
1186,17.92
1187,17.86
1188,17.83
1189,17.82
1190,17.82
1191,17.83
1192,17.87
1193,17.92
1194,17.95
1195,17.97
1196,17.98
1197,18.01
1198,18.04
1199,18.06
1200,18.06
1201,18.06
1202,18.05
1203,18.04
1204,18.01
1205,17.98
1206,17.96
1207,17.94
1208,17.93
1209,17.91
1210,17.90
1211,17.90
1212,17.91
1213,17.91
1214,17.90
1215,17.90
1216,17.92
1217,17.93
1218,17.94
1219,17.94
1220,17.94
1221,17.95
1222,17.99
1223,18.03
1224,18.08
1225,18.14
1226,18.21
1227,18.30
1228,18.41
1229,18.52
1230,18.60
1231,18.68
1232,18.76
1233,18.83
1234,18.88
1235,18.89
1236,18.90
1237,18.91
1238,18.92
1239,18.91
1240,18.88
1241,18.85
1242,18.80
1243,18.75
1244,18.69
1245,18.62
1246,18.55
1247,18.48
1248,18.41
1249,18.35
1250,18.30
1251,18.26
1252,18.22
1253,18.21
1254,18.21
1255,18.23
1256,18.25
1257,18.29
1258,18.36
1259,18.45
1260,18.56
1261,18.66
1262,18.76
1263,18.85
1264,18.93
1265,19.01
1266,19.08
1267,19.14
1268,19.18
1269,19.19
1270,19.20
1271,19.19
1272,19.19
1273,19.19
1274,19.20
1275,19.20
1276,19.17
1277,19.14
1278,19.14
1279,19.15
1280,19.15
1281,19.12
1282,19.10
1283,19.09
1284,19.09
1285,19.06
1286,19.03
1287,18.99
1288,18.96
1289,18.94
1290,18.91
1291,18.88
1292,18.83
1293,18.79
1294,18.77
1295,18.75
1296,18.71
1297,18.66
1298,18.60
1299,18.56
1300,18.50
1301,18.41
1302,18.30
1303,18.18
1304,18.05
1305,17.92
1306,17.78
1307,17.64
1308,17.47
1309,17.31
1310,17.15
1311,17.00
1312,16.84
1313,16.68
1314,16.52
1315,16.39
1316,16.28
1317,16.19
1318,16.12
1319,16.04
1320,15.96
1321,15.89
1322,15.84
1323,15.81
1324,15.78
1325,15.75
1326,15.73
1327,15.71
1328,15.70
1329,15.67
1330,15.62
1331,15.58
1332,15.55
1333,15.53
1334,15.51
1335,15.48
1336,15.46
1337,15.44
1338,15.43
1339,15.40
1340,15.37
1341,15.36
1342,15.35
1343,15.33
1344,15.30
1345,15.27
1346,15.26
1347,15.24
1348,15.21
1349,15.17
1350,15.13
1351,15.11
1352,15.10
1353,15.09
1354,15.08
1355,15.10
1356,15.12
1357,15.15
1358,15.20
1359,15.27
1360,15.37
1361,15.45
1362,15.53
1363,15.61
1364,15.70
1365,15.78
1366,15.86
1367,15.90
1368,15.94
1369,15.95
1370,15.93
1371,15.90
1372,15.88
1373,15.86
1374,15.84
1375,15.81
1376,15.80
1377,15.81
1378,15.82
1379,15.83
1380,15.84
1381,15.88
1382,15.93
1383,15.99
1384,16.03
1385,16.07
1386,16.10
1387,16.12
1388,16.14
1389,16.18
1390,16.23
1391,16.26
1392,16.29
1393,16.32
1394,16.34
1395,16.36
1396,16.37
1397,16.38
1398,16.39
1399,16.39
1400,16.39
1401,16.37
1402,16.35
1403,16.34
1404,16.34
1405,16.35
1406,16.38
1407,16.42
1408,16.48
1409,16.56
1410,16.64
1411,16.73
1412,16.82
1413,16.92
1414,17.00
1415,17.06
1416,17.09
1417,17.11
1418,17.11
1419,17.09
1420,17.05
1421,17.01
1422,16.97
1423,16.96
1424,16.95
1425,16.95
1426,16.96
1427,16.99
1428,17.05
1429,17.12
1430,17.21
1431,17.29
1432,17.35
1433,17.39
1434,17.41
1435,17.41
1436,17.39
1437,17.35
1438,17.28
1439,17.18
1440,17.08
1441,16.98
1442,16.87
1443,16.75
1444,16.62
1445,16.50
1446,16.40
1447,16.31
1448,16.23
1449,16.14
1450,16.05
1451,15.98
1452,15.91
1453,15.85
1454,15.80
1455,15.76
1456,15.72
1457,15.69
1458,15.65
1459,15.63
1460,15.63
1461,15.62
1462,15.59
1463,15.55
1464,15.52
1465,15.50
1466,15.48
1467,15.42
1468,15.35
1469,15.28
1470,15.23
1471,15.19
1472,15.16
1473,15.12
1474,15.10
1475,15.08
1476,15.09
1477,15.10
1478,15.12
1479,15.15
1480,15.20
1481,15.28
1482,15.35
1483,15.43
1484,15.52
1485,15.61
1486,15.68
1487,15.74
1488,15.80
1489,15.84
1490,15.86
1491,15.87
1492,15.86
1493,15.84
1494,15.81
1495,15.74
1496,15.67
1497,15.60
1498,15.52
1499,15.43
1500,15.33
1501,15.23
1502,15.12
1503,15.03
1504,14.95
1505,14.88
1506,14.81
1507,14.75
1508,14.70
1509,14.67
1510,14.66
1511,14.66
1512,14.67
1513,14.69
1514,14.71
1515,14.76
1516,14.81
1517,14.87
1518,14.94
1519,14.99
1520,15.05
1521,15.11
1522,15.17
1523,15.23
1524,15.29
1525,15.33
1526,15.37
1527,15.41
1528,15.47
1529,15.51
1530,15.53
1531,15.53
1532,15.54
1533,15.57
1534,15.60
1535,15.60
1536,15.58
1537,15.56
1538,15.56
1539,15.58
1540,15.60
1541,15.59
1542,15.58
1543,15.56
1544,15.56
1545,15.56
1546,15.55
1547,15.52
1548,15.48
1549,15.45
1550,15.41
1551,15.37
1552,15.34
1553,15.30
1554,15.27
1555,15.22
1556,15.19
1557,15.17
1558,15.17
1559,15.19
1560,15.21
1561,15.24
1562,15.28
1563,15.33
1564,15.37
1565,15.42
1566,15.46
1567,15.49
1568,15.51
1569,15.53
1570,15.52
1571,15.49
1572,15.45
1573,15.39
1574,15.31
1575,15.21
1576,15.08
1577,14.94
1578,14.81
1579,14.67
1580,14.54
1581,14.40
1582,14.28
1583,14.17
1584,14.09
1585,14.03
1586,14.00
1587,14.00
1588,14.02
1589,14.05
1590,14.09
1591,14.14
1592,14.18
1593,14.23
1594,14.27
1595,14.32
1596,14.36
1597,14.37
1598,14.36
1599,14.35
1600,14.33
1601,14.32
1602,14.29
1603,14.25
1604,14.20
1605,14.15
1606,14.10
1607,14.06
1608,14.03
1609,14.01
1610,14.00
1611,13.99
1612,13.98
1613,14.00
1614,14.03
1615,14.07
1616,14.13
1617,14.19
1618,14.25
1619,14.33
1620,14.41
1621,14.48
1622,14.54
1623,14.59
1624,14.62
1625,14.64
1626,14.63
1627,14.62
1628,14.60
1629,14.58
1630,14.57
1631,14.54
1632,14.50
1633,14.47
1634,14.46
1635,14.46
1636,14.45
1637,14.42
1638,14.37
1639,14.33
1640,14.29
1641,14.25
1642,14.19
1643,14.11
1644,14.03
1645,13.94
1646,13.83
1647,13.74
1648,13.65
1649,13.57
1650,13.49
1651,13.40
1652,13.33
1653,13.28
1654,13.24
1655,13.20
1656,13.16
1657,13.13
1658,13.10
1659,13.07
1660,13.04
1661,13.03
1662,13.03
1663,13.03
1664,13.01
1665,13.00
1666,13.02
1667,13.06
1668,13.11
1669,13.16
1670,13.21
1671,13.28
1672,13.36
1673,13.46
1674,13.57
1675,13.68
1676,13.79
1677,13.88
1678,13.97
1679,14.06
1680,14.13
1681,14.18
1682,14.21
1683,14.23
1684,14.26
1685,14.28
1686,14.27
1687,14.25
1688,14.25
1689,14.26
1690,14.28
1691,14.30
1692,14.32
1693,14.36
1694,14.43
1695,14.51
1696,14.58
1697,14.65
1698,14.73
1699,14.82
1700,14.93
1701,15.03
1702,15.12
1703,15.20
1704,15.27
1705,15.34
1706,15.42
1707,15.51
1708,15.61
1709,15.71
1710,15.82
1711,15.94
1712,16.07
1713,16.22
1714,16.39
1715,16.55
1716,16.70
1717,16.84
1718,16.97
1719,17.08
1720,17.18
1721,17.24
1722,17.27
1723,17.27
1724,17.24
1725,17.20
1726,17.13
1727,17.04
1728,16.93
1729,16.81
1730,16.69
1731,16.59
1732,16.50
1733,16.42
1734,16.36
1735,16.31
1736,16.30
1737,16.31
1738,16.35
1739,16.42
1740,16.49
1741,16.56
1742,16.62
1743,16.69
1744,16.76
1745,16.83
1746,16.88
1747,16.90
1748,16.90
1749,16.90
1750,16.88
1751,16.85
1752,16.83
1753,16.81
1754,16.80
1755,16.79
1756,16.77
1757,16.76
1758,16.74
1759,16.73
1760,16.70
1761,16.67
1762,16.65
1763,16.62
1764,16.57
1765,16.50
1766,16.40
1767,16.31
1768,16.23
1769,16.14
1770,16.04
1771,15.94
1772,15.84
1773,15.77
1774,15.70
1775,15.65
1776,15.59
1777,15.55
1778,15.50
1779,15.46
1780,15.42
1781,15.38
1782,15.31
1783,15.24
1784,15.16
1785,15.09
1786,15.01
1787,14.90
1788,14.78
1789,14.66
1790,14.55
1791,14.45
1792,14.34
1793,14.22
1794,14.10
1795,13.98
1796,13.86
1797,13.77
1798,13.67
1799,13.56
1800,13.44
1801,13.33
1802,13.22
1803,13.13
1804,13.03
1805,12.93
1806,12.83
1807,12.74
1808,12.66
1809,12.60
1810,12.56
1811,12.55
1812,12.56
1813,12.59
1814,12.63
1815,12.69
1816,12.77
1817,12.86
1818,12.95
1819,13.04
1820,13.14
1821,13.23
1822,13.31
1823,13.36
1824,13.40
1825,13.43
1826,13.46
1827,13.49
1828,13.52
1829,13.57
1830,13.63
1831,13.71
1832,13.78
1833,13.85
1834,13.94
1835,14.04
1836,14.15
1837,14.25
1838,14.31
1839,14.36
1840,14.38
1841,14.38
1842,14.36
1843,14.31
1844,14.25
1845,14.15
1846,14.04
1847,13.92
1848,13.81
1849,13.71
1850,13.59
1851,13.46
1852,13.32
1853,13.20
1854,13.08
1855,12.97
1856,12.85
1857,12.75
1858,12.65
1859,12.56
1860,12.49
1861,12.43
1862,12.37
1863,12.33
1864,12.31
1865,12.30
1866,12.32
1867,12.35
1868,12.40
1869,12.44
1870,12.47
1871,12.49
1872,12.50
1873,12.53
1874,12.58
1875,12.62
1876,12.66
1877,12.70
1878,12.77
1879,12.84
1880,12.92
1881,13.01
1882,13.12
1883,13.25
1884,13.41
1885,13.57
1886,13.73
1887,13.88
1888,14.04
1889,14.20
1890,14.35
1891,14.49
1892,14.61
1893,14.71
1894,14.79
1895,14.85
1896,14.90
1897,14.94
1898,14.97
1899,14.99
1900,15.01
1901,15.04
1902,15.06
1903,15.08
1904,15.10
1905,15.13
1906,15.15
1907,15.15
1908,15.15
1909,15.16
1910,15.19
1911,15.20
1912,15.20
1913,15.18
1914,15.16
1915,15.15
1916,15.14
1917,15.14
1918,15.15
1919,15.15
1920,15.14
1921,15.14
1922,15.15
1923,15.17
1924,15.17
1925,15.16
1926,15.12
1927,15.08
1928,15.03
1929,14.97
1930,14.89
1931,14.80
1932,14.71
1933,14.62
1934,14.53
1935,14.44
1936,14.36
1937,14.30
1938,14.26
1939,14.23
1940,14.20
1941,14.18
1942,14.14
1943,14.12
1944,14.08
1945,14.02
1946,13.94
1947,13.85
1948,13.75
1949,13.65
1950,13.53
1951,13.42
1952,13.30
1953,13.18
1954,13.05
1955,12.93
1956,12.83
1957,12.78
1958,12.75
1959,12.73
1960,12.73
1961,12.73
1962,12.74
1963,12.77
1964,12.81
1965,12.85
1966,12.91
1967,12.97
1968,13.02
1969,13.06
1970,13.11
1971,13.18
1972,13.24
1973,13.28
1974,13.31
1975,13.34
1976,13.38
1977,13.41
1978,13.41
1979,13.38
1980,13.35
1981,13.32
1982,13.26
1983,13.17
1984,13.07
1985,12.96
1986,12.85
1987,12.72
1988,12.56
1989,12.41
1990,12.28
1991,12.16
1992,12.05
1993,11.94
1994,11.85
1995,11.78
1996,11.71
1997,11.66
1998,11.61
1999,11.56
2000,11.52
2001,11.49
2002,11.47
2003,11.48
2004,11.48
2005,11.48
2006,11.48
2007,11.50
2008,11.53
2009,11.57
2010,11.63
2011,11.67
2012,11.70
2013,11.73
2014,11.77
2015,11.83
2016,11.90
2017,11.96
2018,12.02
2019,12.09
2020,12.18
2021,12.29
2022,12.40
2023,12.50
2024,12.59
2025,12.68
2026,12.79
2027,12.91
2028,13.02
2029,13.11
2030,13.19
2031,13.26
2032,13.34
2033,13.41
2034,13.48
2035,13.53
2036,13.60
2037,13.65
2038,13.71
2039,13.77
2040,13.85
2041,13.93
2042,14.03
2043,14.11
2044,14.21
2045,14.31
2046,14.43
2047,14.53
2048,14.62
2049,14.69
2050,14.77
2051,14.84
2052,14.90
2053,14.93
2054,14.94
2055,14.94
2056,14.93
2057,14.91
2058,14.90
2059,14.88
2060,14.86
2061,14.83
2062,14.81
2063,14.81
2064,14.82
2065,14.84
2066,14.85
2067,14.87
2068,14.89
2069,14.92
2070,14.94
2071,14.97
2072,15.01
2073,15.06
2074,15.09
2075,15.13
2076,15.17
2077,15.21
2078,15.24
2079,15.26
2080,15.27
2081,15.30
2082,15.33
2083,15.35
2084,15.35
2085,15.35
2086,15.35
2087,15.33
2088,15.30
2089,15.27
2090,15.25
2091,15.25
2092,15.27
2093,15.30
2094,15.34
2095,15.38
2096,15.43
2097,15.49
2098,15.57
2099,15.64
2100,15.71
2101,15.77
2102,15.83
2103,15.87
2104,15.90
2105,15.91
2106,15.92
2107,15.92
2108,15.91
2109,15.88
2110,15.84
2111,15.78
2112,15.69
2113,15.59
2114,15.47
2115,15.36
2116,15.22
2117,15.08
2118,14.91
2119,14.73
2120,14.54
2121,14.33
2122,14.11
2123,13.89
2124,13.65
2125,13.42
2126,13.17
2127,12.95
2128,12.74
2129,12.57
2130,12.42
2131,12.30
2132,12.21
2133,12.16
2134,12.17
2135,12.23
2136,12.34
2137,12.45
2138,12.59
2139,12.76
2140,12.94
2141,13.12
2142,13.29
2143,13.42
2144,13.53
2145,13.61
2146,13.69
2147,13.75
2148,13.79
2149,13.81
2150,13.85
2151,13.91
2152,13.99
2153,14.08
2154,14.19
2155,14.32
2156,14.49
2157,14.66
2158,14.84
2159,15.02
2160,15.21
2161,15.39
2162,15.54
2163,15.66
2164,15.77
2165,15.85
2166,15.91
2167,15.94
2168,15.96
2169,15.95
2170,15.93
2171,15.88
2172,15.84
2173,15.81
2174,15.77
2175,15.71
2176,15.65
2177,15.60
2178,15.57
2179,15.55
2180,15.51
2181,15.46
2182,15.41
2183,15.37
2184,15.33
2185,15.29
2186,15.23
2187,15.17
2188,15.12
2189,15.06
2190,14.97
2191,14.89
2192,14.81
2193,14.75
2194,14.69
2195,14.64
2196,14.58
2197,14.56
2198,14.53
2199,14.51
2200,14.47
2201,14.42
2202,14.38
2203,14.33
2204,14.27
2205,14.20
2206,14.12
2207,14.03
2208,13.92
2209,13.80
2210,13.70
2211,13.60
2212,13.50
2213,13.40
2214,13.32
2215,13.28
2216,13.26
2217,13.26
2218,13.28
2219,13.32
2220,13.38
2221,13.44
2222,13.52
2223,13.60
2224,13.70
2225,13.77
2226,13.83
2227,13.87
2228,13.92
2229,13.96
2230,14.00
2231,14.03
2232,14.05
2233,14.07
2234,14.07
2235,14.07
2236,14.08
2237,14.09
2238,14.09
2239,14.08
2240,14.07
2241,14.07
2242,14.06
2243,14.03
2244,14.00
2245,13.98
2246,13.97
2247,13.96
2248,13.94
2249,13.91
2250,13.87
2251,13.85
2252,13.82
2253,13.80
2254,13.74
2255,13.67
2256,13.59
2257,13.52
2258,13.43
2259,13.31
2260,13.16
2261,13.00
2262,12.83
2263,12.65
2264,12.45
2265,12.24
2266,12.04
2267,11.86
2268,11.69
2269,11.53
2270,11.36
2271,11.24
2272,11.15
2273,11.09
2274,11.03
2275,10.99
2276,10.97
2277,10.97
2278,10.96
2279,10.95
2280,10.95
2281,10.96
2282,10.97
2283,10.97
2284,10.97
2285,10.99
2286,11.03
2287,11.09
2288,11.16
2289,11.23
2290,11.33
2291,11.44
2292,11.57
2293,11.69
2294,11.81
2295,11.93
2296,12.04
2297,12.13
2298,12.20
2299,12.24
2300,12.27
2301,12.28
2302,12.29
2303,12.29
2304,12.28
2305,12.27
2306,12.25
2307,12.23
2308,12.22
2309,12.22
2310,12.23
2311,12.25
2312,12.27
2313,12.28
2314,12.29
2315,12.31
2316,12.32
2317,12.33
2318,12.30
2319,12.26
2320,12.19
2321,12.12
2322,12.04
2323,11.96
2324,11.89
2325,11.83
2326,11.79
2327,11.74
2328,11.70
2329,11.66
2330,11.65
2331,11.67
2332,11.71
2333,11.74
2334,11.76
2335,11.77
2336,11.80
2337,11.83
2338,11.85
2339,11.85
2340,11.83
2341,11.82
2342,11.81
2343,11.79
2344,11.76
2345,11.71
2346,11.68
2347,11.66
2348,11.64
2349,11.62
2350,11.60
2351,11.60
2352,11.59
2353,11.58
2354,11.57
2355,11.57
2356,11.57
2357,11.57
2358,11.58
2359,11.59
2360,11.61
2361,11.64
2362,11.67
2363,11.72
2364,11.78
2365,11.86
2366,11.93
2367,11.99
2368,12.05
2369,12.12
2370,12.21
2371,12.30
2372,12.38
2373,12.44
2374,12.50
2375,12.57
2376,12.65
2377,12.73
2378,12.81
2379,12.88
2380,12.94
2381,12.98
2382,13.02
2383,13.06
2384,13.11
2385,13.16
2386,13.19
2387,13.21
2388,13.21
2389,13.21
2390,13.21
2391,13.21
2392,13.20
2393,13.17
2394,13.14
2395,13.12
2396,13.11
2397,13.08
2398,13.04
2399,12.99
2400,12.95
2401,12.90
2402,12.86
2403,12.81
2404,12.76
2405,12.72
2406,12.69
2407,12.69
2408,12.72
2409,12.76
2410,12.82
2411,12.89
2412,12.99
2413,13.09
2414,13.20
2415,13.30
2416,13.42
2417,13.55
2418,13.69
2419,13.79
2420,13.86
2421,13.93
2422,13.99
2423,14.04
2424,14.09
2425,14.12
2426,14.15
2427,14.20
2428,14.24
2429,14.26
2430,14.29
2431,14.34
2432,14.40
2433,14.45
2434,14.47
2435,14.47
2436,14.46
2437,14.46
2438,14.45
2439,14.42
2440,14.37
2441,14.31
2442,14.25
2443,14.19
2444,14.13
2445,14.09
2446,14.05
2447,14.04
2448,14.04
2449,14.06
2450,14.08
2451,14.10
2452,14.10
2453,14.10
2454,14.10
2455,14.10
2456,14.10
2457,14.07
2458,14.01
2459,13.95
2460,13.90
2461,13.88
2462,13.84
2463,13.80
2464,13.75
2465,13.71
2466,13.66
2467,13.62
2468,13.57
2469,13.51
2470,13.43
2471,13.33
2472,13.20
2473,13.07
2474,12.92
2475,12.75
2476,12.59
2477,12.46
2478,12.34
2479,12.26
2480,12.20
2481,12.18
2482,12.22
2483,12.30
2484,12.39
2485,12.50
2486,12.61
2487,12.73
2488,12.85
2489,12.96
2490,13.03
2491,13.06
2492,13.05
2493,13.01
2494,12.93
2495,12.83
2496,12.70
2497,12.57
2498,12.42
2499,12.27
2500,12.13
2501,12.01
2502,11.90
2503,11.83
2504,11.80
2505,11.78
2506,11.77
2507,11.79
2508,11.84
2509,11.91
2510,11.99
2511,12.05
2512,12.11
2513,12.18
2514,12.27
2515,12.34
2516,12.40
2517,12.44
2518,12.48
2519,12.53
2520,12.57
2521,12.60
2522,12.62
2523,12.62
2524,12.61
2525,12.61
2526,12.61
2527,12.59
2528,12.57
2529,12.56
2530,12.55
2531,12.55
2532,12.55
2533,12.55
2534,12.57
2535,12.59
2536,12.61
2537,12.61
2538,12.63
2539,12.66
2540,12.67
2541,12.68
2542,12.67
2543,12.67
2544,12.67
2545,12.65
2546,12.63
2547,12.60
2548,12.57
2549,12.54
2550,12.49
2551,12.44
2552,12.38
2553,12.34
2554,12.28
2555,12.23
2556,12.17
2557,12.14
2558,12.12
2559,12.11
2560,12.10
2561,12.10
2562,12.11
2563,12.14
2564,12.19
2565,12.27
2566,12.35
2567,12.45
2568,12.55
2569,12.67
2570,12.79
2571,12.89
2572,12.99
2573,13.07
2574,13.17
2575,13.24
2576,13.29
2577,13.30
2578,13.30
2579,13.26
2580,13.20
2581,13.11
2582,13.01
2583,12.90
2584,12.79
2585,12.69
2586,12.59
2587,12.50
2588,12.43
2589,12.38
2590,12.37
2591,12.38
2592,12.42
2593,12.46
2594,12.53
2595,12.60
2596,12.67
2597,12.73
2598,12.79
2599,12.83
2600,12.87
2601,12.89
2602,12.93
2603,12.95
2604,12.98
2605,12.99
2606,13.01
2607,13.02
2608,13.04
2609,13.07
2610,13.12
2611,13.18
2612,13.23
2613,13.27
2614,13.34
2615,13.42
2616,13.52
2617,13.59
2618,13.67
2619,13.74
2620,13.80
2621,13.85
2622,13.89
2623,13.91
2624,13.92
2625,13.91
2626,13.88
2627,13.85
2628,13.81
2629,13.76
2630,13.74
2631,13.73
2632,13.75
2633,13.77
2634,13.77
2635,13.78
2636,13.83
2637,13.91
2638,13.98
2639,14.04
2640,14.11
2641,14.18
2642,14.24
2643,14.29
2644,14.34
2645,14.40
2646,14.45
2647,14.50
2648,14.54
2649,14.60
2650,14.67
2651,14.73
2652,14.78
2653,14.82
2654,14.87
2655,14.93
2656,14.99
2657,15.05
2658,15.12
2659,15.19
2660,15.27
2661,15.36
2662,15.46
2663,15.56
2664,15.69
2665,15.82
2666,15.95
2667,16.07
2668,16.18
2669,16.28
2670,16.38
2671,16.46
2672,16.50
2673,16.52
2674,16.50
2675,16.47
2676,16.43
2677,16.37
2678,16.29
2679,16.19
2680,16.08
2681,15.97
2682,15.86
2683,15.74
2684,15.62
2685,15.52
2686,15.41
2687,15.32
2688,15.20
2689,15.08
2690,14.95
2691,14.84
2692,14.73
2693,14.63
2694,14.51
2695,14.40
2696,14.29
2697,14.20
2698,14.11
2699,14.03
2700,13.93
2701,13.84
2702,13.75
2703,13.69
2704,13.63
2705,13.57
2706,13.49
2707,13.42
2708,13.36
2709,13.33
2710,13.31
2711,13.30
2712,13.30
2713,13.29
2714,13.29
2715,13.29
2716,13.31
2717,13.34
2718,13.36
2719,13.38
2720,13.39
2721,13.39
2722,13.38
2723,13.36
2724,13.36
2725,13.37
2726,13.40
2727,13.43
2728,13.47
2729,13.52
2730,13.60
2731,13.69
2732,13.80
2733,13.92
2734,14.04
2735,14.18
2736,14.33
2737,14.49
2738,14.65
2739,14.79
2740,14.91
2741,15.01
2742,15.09
2743,15.16
2744,15.20
2745,15.21
2746,15.19
2747,15.13
2748,15.04
2749,14.94
2750,14.80
2751,14.64
2752,14.45
2753,14.26
2754,14.06
2755,13.85
2756,13.64
2757,13.43
2758,13.22
2759,13.01
2760,12.80
2761,12.62
2762,12.44
2763,12.28
2764,12.10
2765,11.95
2766,11.80
2767,11.69
2768,11.57
2769,11.45
2770,11.33
2771,11.23
2772,11.14
2773,11.05
2774,10.95
2775,10.85
2776,10.75
2777,10.66
2778,10.57
2779,10.48
2780,10.39
2781,10.32
2782,10.26
2783,10.22
2784,10.17
2785,10.15
2786,10.15
2787,10.18
2788,10.21
2789,10.24
2790,10.30
2791,10.38
2792,10.49
2793,10.60
2794,10.71
2795,10.82
2796,10.94
2797,11.05
2798,11.15
2799,11.23
2800,11.31
2801,11.39
2802,11.47
2803,11.52
2804,11.55
2805,11.55
2806,11.55
2807,11.56
2808,11.58
2809,11.58
2810,11.57
2811,11.57
2812,11.58
2813,11.59
2814,11.60
2815,11.61
2816,11.61
2817,11.60
2818,11.59
2819,11.58
2820,11.57
2821,11.55
2822,11.52
2823,11.49
2824,11.48
2825,11.47
2826,11.48
2827,11.48
2828,11.49
2829,11.52
2830,11.57
2831,11.62
2832,11.69
2833,11.75
2834,11.81
2835,11.87
2836,11.93
2837,12.01
2838,12.09
2839,12.16
2840,12.23
2841,12.30
2842,12.40
2843,12.52
2844,12.64
2845,12.74
2846,12.85
2847,12.95
2848,13.04
2849,13.12
2850,13.18
2851,13.24
2852,13.29
2853,13.32
2854,13.33
2855,13.32
2856,13.33
2857,13.35
2858,13.36
2859,13.38
2860,13.40
2861,13.43
2862,13.47
2863,13.51
2864,13.56
2865,13.59
2866,13.60
2867,13.58
2868,13.55
2869,13.50
2870,13.45
2871,13.37
2872,13.27
2873,13.17
2874,13.07
2875,12.98
2876,12.90
2877,12.84
2878,12.81
2879,12.79
2880,12.79
2881,12.79
2882,12.80
2883,12.83
2884,12.86
2885,12.90
2886,12.92
2887,12.92
2888,12.89
2889,12.85
2890,12.79
2891,12.72
2892,12.62
2893,12.50
2894,12.37
2895,12.22
2896,12.05
2897,11.89
2898,11.74
2899,11.61
2900,11.47
2901,11.34
2902,11.20
2903,11.09
2904,10.99
2905,10.92
2906,10.84
2907,10.77
2908,10.71
2909,10.67
2910,10.62
2911,10.56
2912,10.51
2913,10.48
2914,10.46
2915,10.43
2916,10.39
2917,10.36
2918,10.35
2919,10.35
2920,10.35
2921,10.37
2922,10.39
2923,10.42
2924,10.46
2925,10.50
2926,10.56
2927,10.62
2928,10.67
2929,10.70
2930,10.72
2931,10.73
2932,10.74
2933,10.75
2934,10.72
2935,10.68
2936,10.62
2937,10.54
2938,10.46
2939,10.37
2940,10.28
2941,10.19
2942,10.10
2943,10.01
2944,9.92
2945,9.83
2946,9.74
2947,9.67
2948,9.61
2949,9.55
2950,9.48
2951,9.40
2952,9.34
2953,9.30
2954,9.27
2955,9.23
2956,9.20
2957,9.19
2958,9.21
2959,9.25
2960,9.29
2961,9.34
2962,9.41
2963,9.52
2964,9.62
2965,9.72
2966,9.80
2967,9.87
2968,9.93
2969,9.96
2970,9.97
2971,9.95
2972,9.91
2973,9.87
2974,9.83
2975,9.78
2976,9.72
2977,9.66
2978,9.63
2979,9.63
2980,9.63
2981,9.63
2982,9.66
2983,9.70
2984,9.73
2985,9.75
2986,9.77
2987,9.79
2988,9.82
2989,9.84
2990,9.85
2991,9.86
2992,9.88
2993,9.91
2994,9.97
2995,10.04
2996,10.12
2997,10.20
2998,10.27
2999,10.32
3000,10.37
3001,10.42
3002,10.47
3003,10.51
3004,10.53
3005,10.51
3006,10.49
3007,10.48
3008,10.45
3009,10.41
3010,10.36
3011,10.31
3012,10.26
3013,10.19
3014,10.11
3015,10.03
3016,9.95
3017,9.86
3018,9.77
3019,9.68
3020,9.59
3021,9.50
3022,9.42
3023,9.36
3024,9.32
3025,9.29
3026,9.27
3027,9.25
3028,9.24
3029,9.26
3030,9.30
3031,9.36
3032,9.43
3033,9.50
3034,9.59
3035,9.69
3036,9.82
3037,9.95
3038,10.10
3039,10.24
3040,10.40
3041,10.54
3042,10.69
3043,10.84
3044,10.99
3045,11.14
3046,11.29
3047,11.43
3048,11.60
3049,11.76
3050,11.91
3051,12.04
3052,12.18
3053,12.32
3054,12.48
3055,12.63
3056,12.78
3057,12.91
3058,13.03
3059,13.13
3060,13.23
3061,13.31
3062,13.39
3063,13.44
3064,13.46
3065,13.45
3066,13.44
3067,13.43
3068,13.41
3069,13.38
3070,13.33
3071,13.28
3072,13.20
3073,13.13
3074,13.06
3075,13.00
3076,12.93
3077,12.84
3078,12.75
3079,12.67
3080,12.60
3081,12.53
3082,12.46
3083,12.42
3084,12.38
3085,12.36
3086,12.33
3087,12.30
3088,12.27
3089,12.24
3090,12.21
3091,12.18
3092,12.16
3093,12.14
3094,12.13
3095,12.12
3096,12.09
3097,12.08
3098,12.08
3099,12.08
3100,12.06
3101,12.03
3102,12.02
3103,12.03
3104,12.05
3105,12.05
3106,12.05
3107,12.06
3108,12.09
3109,12.16
3110,12.24
3111,12.34
3112,12.47
3113,12.60
3114,12.74
3115,12.89
3116,13.05
3117,13.20
3118,13.34
3119,13.46
3120,13.56
3121,13.63
3122,13.67
3123,13.71
3124,13.73
3125,13.74
3126,13.74
3127,13.72
3128,13.71
3129,13.71
3130,13.73
3131,13.77
3132,13.83
3133,13.91
3134,14.00
3135,14.11
3136,14.21
3137,14.32
3138,14.42
3139,14.53
3140,14.62
3141,14.70
3142,14.76
3143,14.80
3144,14.83
3145,14.83
3146,14.80
3147,14.76
3148,14.70
3149,14.64
3150,14.57
3151,14.48
3152,14.37
3153,14.25
3154,14.14
3155,14.03
3156,13.93
3157,13.84
3158,13.77
3159,13.73
3160,13.69
3161,13.66
3162,13.66
3163,13.69
3164,13.73
3165,13.79
3166,13.88
3167,13.98
3168,14.09
3169,14.20
3170,14.31
3171,14.42
3172,14.54
3173,14.65
3174,14.76
3175,14.86
3176,14.94
3177,15.00
3178,15.06
3179,15.14
3180,15.20
3181,15.23
3182,15.24
3183,15.26
3184,15.32
3185,15.36
3186,15.40
3187,15.41
3188,15.42
3189,15.45
3190,15.50
3191,15.54
3192,15.56
3193,15.57
3194,15.56
3195,15.56
3196,15.55
3197,15.51
3198,15.44
3199,15.34
3200,15.23
3201,15.12
3202,14.99
3203,14.86
3204,14.70
3205,14.54
3206,14.37
3207,14.21
3208,14.04
3209,13.89
3210,13.72
3211,13.57
3212,13.43
3213,13.31
3214,13.17
3215,13.04
3216,12.90
3217,12.79
3218,12.69
3219,12.60
3220,12.50
3221,12.40
3222,12.30
3223,12.23
3224,12.16
3225,12.07
3226,11.96
3227,11.86
3228,11.76
3229,11.66
3230,11.54
3231,11.40
3232,11.27
3233,11.15
3234,11.04
3235,10.96
3236,10.87
3237,10.80
3238,10.73
3239,10.69
3240,10.67
3241,10.67
3242,10.68
3243,10.70
3244,10.70
3245,10.72
3246,10.76
3247,10.82
3248,10.88
3249,10.94
3250,11.02
3251,11.11
3252,11.19
3253,11.27
3254,11.34
3255,11.41
3256,11.48
3257,11.53
3258,11.56
3259,11.57
3260,11.57
3261,11.55
3262,11.53
3263,11.50
3264,11.46
3265,11.42
3266,11.37
3267,11.32
3268,11.29
3269,11.27
3270,11.28
3271,11.32
3272,11.35
3273,11.38
3274,11.40
3275,11.42
3276,11.43
3277,11.43
3278,11.40
3279,11.38
3280,11.36
3281,11.33
3282,11.27
3283,11.20
3284,11.12
3285,11.06
3286,11.00
3287,10.93
3288,10.86
3289,10.81
3290,10.78
3291,10.75
3292,10.71
3293,10.67
3294,10.64
3295,10.61
3296,10.56
3297,10.50
3298,10.43
3299,10.38
3300,10.32
3301,10.26
3302,10.19
3303,10.11
3304,10.06
3305,10.03
3306,10.01
3307,9.99
3308,10.00
3309,10.03
3310,10.06
3311,10.10
3312,10.13
3313,10.17
3314,10.22
3315,10.27
3316,10.31
3317,10.36
3318,10.41
3319,10.45
3320,10.49
3321,10.51
3322,10.54
3323,10.57
3324,10.60
3325,10.63
3326,10.67
3327,10.71
3328,10.77
3329,10.84
3330,10.93
3331,11.04
3332,11.16
3333,11.29
3334,11.43
3335,11.58
3336,11.74
3337,11.89
3338,12.01
3339,12.12
3340,12.23
3341,12.33
3342,12.41
3343,12.46
3344,12.48
3345,12.47
3346,12.45
3347,12.41
3348,12.34
3349,12.27
3350,12.18
3351,12.07
3352,11.96
3353,11.86
3354,11.76
3355,11.69
3356,11.62
3357,11.58
3358,11.57
3359,11.58
3360,11.62
3361,11.68
3362,11.76
3363,11.84
3364,11.94
3365,12.05
3366,12.16
3367,12.27
3368,12.35
3369,12.43
3370,12.50
3371,12.58
3372,12.64
3373,12.68
3374,12.72
3375,12.76
3376,12.82
3377,12.90
3378,12.99
3379,13.07
3380,13.16
3381,13.24
3382,13.36
3383,13.47
3384,13.59
3385,13.67
3386,13.76
3387,13.85
3388,13.93
3389,14.01
3390,14.07
3391,14.11
3392,14.15
3393,14.18
3394,14.20
3395,14.21
3396,14.24
3397,14.26
3398,14.29
3399,14.30
3400,14.32
3401,14.33
3402,14.35
3403,14.36
3404,14.38
3405,14.39
3406,14.40
3407,14.42
3408,14.44
3409,14.47
3410,14.51
3411,14.53
3412,14.55
3413,14.57
3414,14.58
3415,14.60
3416,14.61
3417,14.61
3418,14.60
3419,14.58
3420,14.57
3421,14.55
3422,14.54
3423,14.53
3424,14.51
3425,14.50
3426,14.47
3427,14.44
3428,14.42
3429,14.40
3430,14.39
3431,14.36
3432,14.31
3433,14.25
3434,14.19
3435,14.13
3436,14.07
3437,14.02
3438,13.94
3439,13.85
3440,13.77
3441,13.69
3442,13.60
3443,13.52
3444,13.44
3445,13.38
3446,13.31
3447,13.24
3448,13.18
3449,13.13
3450,13.10
3451,13.07
3452,13.04
3453,13.01
3454,12.99
3455,13.00
3456,13.00
3457,13.00
3458,13.00
3459,13.00
3460,13.00
3461,13.00
3462,12.99
3463,12.98
3464,12.96
3465,12.95
3466,12.93
3467,12.92
3468,12.90
3469,12.90
3470,12.92
3471,12.95
3472,12.98
3473,13.01
3474,13.05
3475,13.11
3476,13.18
3477,13.24
3478,13.29
3479,13.35
3480,13.42
3481,13.48
3482,13.52
3483,13.53
3484,13.54
3485,13.56
3486,13.57
3487,13.55
3488,13.52
3489,13.47
3490,13.42
3491,13.36
3492,13.27
3493,13.17
3494,13.07
3495,12.98
3496,12.88
3497,12.78
3498,12.70
3499,12.63
3500,12.58
3501,12.52
3502,12.47
3503,12.44
3504,12.42
3505,12.41
3506,12.40
3507,12.40
3508,12.40
3509,12.38
3510,12.36
3511,12.35
3512,12.35
3513,12.35
3514,12.33
3515,12.30
3516,12.28
3517,12.28
3518,12.29
3519,12.31
3520,12.33
3521,12.36
3522,12.40
3523,12.44
3524,12.49
3525,12.53
3526,12.58
3527,12.64
3528,12.71
3529,12.77
3530,12.81
3531,12.83
3532,12.82
3533,12.81
3534,12.77
3535,12.71
3536,12.63
3537,12.53
3538,12.39
3539,12.23
3540,12.05
3541,11.87
3542,11.68
3543,11.49
3544,11.30
3545,11.12
3546,10.95
3547,10.81
3548,10.67
3549,10.55
3550,10.44
3551,10.35
3552,10.29
3553,10.26
3554,10.25
3555,10.26
3556,10.27
3557,10.28
3558,10.29
3559,10.31
3560,10.34
3561,10.39
3562,10.42
3563,10.46
3564,10.49
3565,10.53
3566,10.58
3567,10.62
3568,10.68
3569,10.75
3570,10.84
3571,10.91
3572,10.98
3573,11.05
3574,11.15
3575,11.25
3576,11.35
3577,11.42
3578,11.49
3579,11.56
3580,11.64
3581,11.70
3582,11.74
3583,11.75
3584,11.75
3585,11.73
3586,11.71
3587,11.68
3588,11.64
3589,11.58
3590,11.51
3591,11.44
3592,11.40
3593,11.39
3594,11.40
3595,11.41
3596,11.43
3597,11.48
3598,11.55
3599,11.64
3600,11.73
3601,11.82
3602,11.92
3603,12.01
3604,12.08
3605,12.12
3606,12.16
3607,12.20
3608,12.25
3609,12.27
3610,12.30
3611,12.32
3612,12.37
3613,12.43
3614,12.50
3615,12.57
3616,12.65
3617,12.74
3618,12.85
3619,12.95
3620,13.04
3621,13.13
3622,13.24
3623,13.34
3624,13.42
3625,13.46
3626,13.49
3627,13.53
3628,13.60
3629,13.66
3630,13.71
3631,13.75
3632,13.80
3633,13.85
3634,13.93
3635,14.02
3636,14.12
3637,14.22
3638,14.33
3639,14.45
3640,14.58
3641,14.72
3642,14.86
3643,14.99
3644,15.11
3645,15.20
3646,15.27
3647,15.33
3648,15.37
3649,15.37
3650,15.33
3651,15.25
3652,15.16
3653,15.05
3654,14.93
3655,14.78
3656,14.61
3657,14.45
3658,14.30
3659,14.16
3660,14.03
3661,13.92
3662,13.82
3663,13.75
3664,13.67
3665,13.58
3666,13.49
3667,13.42
3668,13.35
3669,13.28
3670,13.19
3671,13.08
3672,12.98
3673,12.89
3674,12.81
3675,12.74
3676,12.66
3677,12.60
3678,12.57
3679,12.59
3680,12.63
3681,12.70
3682,12.77
3683,12.86
3684,12.96
3685,13.07
3686,13.16
3687,13.22
3688,13.26
3689,13.29
3690,13.30
3691,13.27
3692,13.21
3693,13.15
3694,13.09
3695,13.02
3696,12.92
3697,12.81
3698,12.73
3699,12.66
3700,12.61
3701,12.56
3702,12.49
3703,12.43
3704,12.37
3705,12.32
3706,12.25
3707,12.18
3708,12.09
3709,12.00
3710,11.91
3711,11.83
3712,11.74
3713,11.65
3714,11.55
3715,11.46
3716,11.39
3717,11.33
3718,11.27
3719,11.21
3720,11.16
3721,11.13
3722,11.11
3723,11.10
3724,11.09
3725,11.11
3726,11.14
3727,11.19
3728,11.23
3729,11.28
3730,11.33
3731,11.40
3732,11.49
3733,11.58
3734,11.68
3735,11.76
3736,11.85
3737,11.94
3738,12.04
3739,12.12
3740,12.20
3741,12.28
3742,12.35
3743,12.43
3744,12.50
3745,12.55
3746,12.61
3747,12.67
3748,12.73
3749,12.77
3750,12.80
3751,12.83
3752,12.88
3753,12.94
3754,12.99
3755,13.04
3756,13.09
3757,13.15
3758,13.20
3759,13.24
3760,13.24
3761,13.23
3762,13.19
3763,13.14
3764,13.09
3765,13.04
3766,12.96
3767,12.88
3768,12.77
3769,12.65
3770,12.52
3771,12.41
3772,12.29
3773,12.17
3774,12.04
3775,11.91
3776,11.77
3777,11.64
3778,11.51
3779,11.39
3780,11.28
3781,11.19
3782,11.12
3783,11.06
3784,11.00
3785,10.96
3786,10.94
3787,10.94
3788,10.93
3789,10.92
3790,10.92
3791,10.93
3792,10.95
3793,10.95
3794,10.94
3795,10.94
3796,10.94
3797,10.94
3798,10.95
3799,10.98
3800,11.04
3801,11.11
3802,11.20
3803,11.28
3804,11.38
3805,11.50
3806,11.65
3807,11.81
3808,11.98
3809,12.14
3810,12.32
3811,12.51
3812,12.71
3813,12.90
3814,13.10
3815,13.29
3816,13.47
3817,13.64
3818,13.81
3819,13.96
3820,14.11
3821,14.22
3822,14.34
3823,14.44
3824,14.52
3825,14.58
3826,14.64
3827,14.70
3828,14.75
3829,14.78
3830,14.79
3831,14.80
3832,14.83
3833,14.84
3834,14.84
3835,14.84
3836,14.87
3837,14.89
3838,14.90
3839,14.90
3840,14.93
3841,14.96
3842,15.00
3843,15.02
3844,15.04
3845,15.08
3846,15.13
3847,15.18
3848,15.23
3849,15.29
3850,15.34
3851,15.39
3852,15.44
3853,15.49
3854,15.56
3855,15.63
3856,15.68
3857,15.70
3858,15.70
3859,15.69
3860,15.67
3861,15.65
3862,15.58
3863,15.48
3864,15.35
3865,15.23
3866,15.10
3867,14.96
3868,14.79
3869,14.62
3870,14.46
3871,14.33
3872,14.23
3873,14.14
3874,14.05
3875,13.98
3876,13.95
3877,13.96
3878,13.98
3879,14.02
3880,14.08
3881,14.18
3882,14.30
3883,14.41
3884,14.51
3885,14.63
3886,14.76
3887,14.88
3888,14.99
3889,15.08
3890,15.15
3891,15.21
3892,15.26
3893,15.29
3894,15.28
3895,15.25
3896,15.22
3897,15.17
3898,15.10
3899,15.00
3900,14.88
3901,14.76
3902,14.62
3903,14.48
3904,14.32
3905,14.19
3906,14.07
3907,13.95
3908,13.83
3909,13.73
3910,13.64
3911,13.59
3912,13.54
3913,13.50
3914,13.45
3915,13.41
3916,13.36
3917,13.32
3918,13.27
3919,13.19
3920,13.10
3921,12.99
3922,12.89
3923,12.79
3924,12.67
3925,12.55
3926,12.45
3927,12.37
3928,12.32
3929,12.29
3930,12.29
3931,12.32
3932,12.37
3933,12.45
3934,12.54
3935,12.64
3936,12.76
3937,12.88
3938,13.00
3939,13.10
3940,13.19
3941,13.24
3942,13.29
3943,13.31
3944,13.34
3945,13.35
3946,13.36
3947,13.36
3948,13.35
3949,13.33
3950,13.31
3951,13.29
3952,13.31
3953,13.36
3954,13.40
3955,13.44
3956,13.46
3957,13.49
3958,13.52
3959,13.55
3960,13.58
3961,13.61
3962,13.63
3963,13.63
3964,13.63
3965,13.64
3966,13.66
3967,13.66
3968,13.65
3969,13.63
3970,13.61
3971,13.62
3972,13.64
3973,13.67
3974,13.69
3975,13.69
3976,13.69
3977,13.69
3978,13.67
3979,13.63
3980,13.57
3981,13.53
3982,13.48
3983,13.42
3984,13.34
3985,13.24
3986,13.11
3987,12.98
3988,12.84
3989,12.73
3990,12.62
3991,12.52
3992,12.40
3993,12.28
3994,12.17
3995,12.10
3996,12.05
3997,12.03
3998,12.00
3999,11.99
4000,11.99
4001,12.02
4002,12.07
4003,12.12
4004,12.21
4005,12.31
4006,12.43
4007,12.55
4008,12.68
4009,12.82
4010,12.99
4011,13.16
4012,13.31
4013,13.46
4014,13.62
4015,13.78
4016,13.95
4017,14.09
4018,14.22
4019,14.32
4020,14.41
4021,14.48
4022,14.55
4023,14.61
4024,14.66
4025,14.72
4026,14.79
4027,14.87
4028,14.94
4029,14.99
4030,15.06
4031,15.13
4032,15.21
4033,15.26
4034,15.32
4035,15.36
4036,15.40
4037,15.41
4038,15.41
4039,15.37
4040,15.33
4041,15.28
4042,15.23
4043,15.18
4044,15.11
4045,15.05
4046,15.00
4047,14.95
4048,14.92
4049,14.89
4050,14.86
4051,14.85
4052,14.84
4053,14.84
4054,14.84
4055,14.82
4056,14.81
4057,14.81
4058,14.82
4059,14.83
4060,14.85
4061,14.87
4062,14.89
4063,14.92
4064,14.94
4065,14.96
4066,14.98
4067,15.01
4068,15.03
4069,15.05
4070,15.06
4071,15.08
4072,15.08
4073,15.06
4074,15.05
4075,15.04
4076,15.06
4077,15.09
4078,15.13
4079,15.17
4080,15.23
4081,15.31
4082,15.39
4083,15.48
4084,15.58
4085,15.68
4086,15.78
4087,15.88
4088,15.96
4089,16.04
4090,16.08
4091,16.10
4092,16.10
4093,16.08
4094,16.04
4095,16.00
4096,15.96
4097,15.91
4098,15.84
4099,15.76
4100,15.66
4101,15.59
4102,15.53
4103,15.46
4104,15.35
4105,15.24
4106,15.11
4107,14.98
4108,14.82
4109,14.66
4110,14.50
4111,14.35
4112,14.20
4113,14.04
4114,13.87
4115,13.72
4116,13.60
4117,13.49
4118,13.39
4119,13.29
4120,13.20
4121,13.14
4122,13.09
4123,13.05
4124,13.01
4125,12.98
4126,12.95
4127,12.92
4128,12.89
4129,12.86
4130,12.84
4131,12.82
4132,12.81
4133,12.81
4134,12.84
4135,12.89
4136,12.99
4137,13.09
4138,13.20
4139,13.34
4140,13.51
4141,13.70
4142,13.90
4143,14.09
4144,14.29
4145,14.50
4146,14.71
4147,14.89
4148,15.03
4149,15.13
4150,15.21
4151,15.25
4152,15.27
4153,15.24
4154,15.16
4155,15.05
4156,14.94
4157,14.82
4158,14.68
4159,14.52
4160,14.34
4161,14.18
4162,14.03
4163,13.91
4164,13.81
4165,13.74
4166,13.69
4167,13.68
4168,13.69
4169,13.74
4170,13.81
4171,13.92
4172,14.05
4173,14.17
4174,14.27
4175,14.36
4176,14.45
4177,14.54
4178,14.60
4179,14.60
4180,14.56
4181,14.50
4182,14.42
4183,14.32
4184,14.18
4185,14.04
4186,13.87
4187,13.71
4188,13.54
4189,13.36
4190,13.17
4191,13.00
4192,12.82
4193,12.66
4194,12.50
4195,12.34
4196,12.17
4197,12.01
4198,11.83
4199,11.67
4200,11.53
4201,11.43
4202,11.35
4203,11.28
4204,11.20
4205,11.14
4206,11.11
4207,11.12
4208,11.12
4209,11.12
4210,11.12
4211,11.14
4212,11.17
4213,11.20
4214,11.22
4215,11.23
4216,11.26
4217,11.31
4218,11.35
4219,11.38
4220,11.41
4221,11.45
4222,11.51
4223,11.58
4224,11.62
4225,11.65
4226,11.67
4227,11.69
4228,11.69
4229,11.66
4230,11.60
4231,11.53
4232,11.43
4233,11.33
4234,11.21
4235,11.08
4236,10.93
4237,10.80
4238,10.68
4239,10.56
4240,10.43
4241,10.30
4242,10.16
4243,10.05
4244,9.93
4245,9.82
4246,9.69
4247,9.56
4248,9.42
4249,9.30
4250,9.19
4251,9.09
4252,8.99
4253,8.90
4254,8.82
4255,8.78
4256,8.77
4257,8.79
4258,8.81
4259,8.83
4260,8.84
4261,8.86
4262,8.86
4263,8.85
4264,8.81
4265,8.76
4266,8.72
4267,8.68
4268,8.62
4269,8.56
4270,8.51
4271,8.46
4272,8.44
4273,8.43
4274,8.47
4275,8.52
4276,8.61
4277,8.73
4278,8.89
4279,9.06
4280,9.25
4281,9.45
4282,9.65
4283,9.84
4284,10.03
4285,10.18
4286,10.34
4287,10.49
4288,10.63
4289,10.75
4290,10.85
4291,10.93
4292,11.02
4293,11.11
4294,11.20
4295,11.29
4296,11.38
4297,11.47
4298,11.56
4299,11.65
4300,11.72
4301,11.76
4302,11.80
4303,11.83
4304,11.84
4305,11.83
4306,11.81
4307,11.79
4308,11.76
4309,11.70
4310,11.61
4311,11.52
4312,11.45
4313,11.39
4314,11.33
4315,11.27
4316,11.22
4317,11.17
4318,11.14
4319,11.11
4320,11.09
4321,11.09
4322,11.11
4323,11.15
4324,11.20
4325,11.25
4326,11.30
4327,11.36
4328,11.42
4329,11.48
4330,11.54
4331,11.60
4332,11.65
4333,11.68
4334,11.69
4335,11.69
4336,11.68
4337,11.69
4338,11.70
4339,11.71
4340,11.71
4341,11.70
4342,11.69
4343,11.69
4344,11.68
4345,11.67
4346,11.66
4347,11.66
4348,11.64
4349,11.60
4350,11.56
4351,11.54
4352,11.53
4353,11.50
4354,11.47
4355,11.45
4356,11.44
4357,11.45
4358,11.46
4359,11.47
4360,11.49
4361,11.52
4362,11.57
4363,11.62
4364,11.69
4365,11.75
4366,11.82
4367,11.89
4368,11.96
4369,12.02
4370,12.07
4371,12.12
4372,12.15
4373,12.18
4374,12.21
4375,12.22
4376,12.23
4377,12.23
4378,12.23
4379,12.23
4380,12.23
4381,12.21
4382,12.18
4383,12.13
4384,12.08
4385,12.02
4386,11.95
4387,11.88
4388,11.80
4389,11.72
4390,11.65
4391,11.58
4392,11.51
4393,11.46
4394,11.44
4395,11.44
4396,11.45
4397,11.46
4398,11.51
4399,11.58
4400,11.66
4401,11.74
4402,11.83
4403,11.93
4404,12.04
4405,12.12
4406,12.21
4407,12.28
4408,12.34
4409,12.39
4410,12.42
4411,12.43
4412,12.43
4413,12.41
4414,12.40
4415,12.38
4416,12.37
4417,12.35
4418,12.33
4419,12.32
4420,12.32
4421,12.34
4422,12.34
4423,12.36
4424,12.40
4425,12.46
4426,12.52
4427,12.58
4428,12.65
4429,12.72
4430,12.79
4431,12.85
4432,12.91
4433,12.97
4434,13.02
4435,13.05
4436,13.06
4437,13.08
4438,13.11
4439,13.13
4440,13.15
4441,13.15
4442,13.16
4443,13.17
4444,13.18
4445,13.18
4446,13.19
4447,13.20
4448,13.21
4449,13.21
4450,13.21
4451,13.23
4452,13.25
4453,13.27
4454,13.26
4455,13.25
4456,13.24
4457,13.24
4458,13.24
4459,13.22
4460,13.20
4461,13.17
4462,13.13
4463,13.10
4464,13.07
4465,13.05
4466,13.01
4467,12.97
4468,12.91
4469,12.85
4470,12.79
4471,12.71
4472,12.62
4473,12.52
4474,12.41
4475,12.31
4476,12.20
4477,12.09
4478,12.01
4479,11.96
4480,11.95
4481,11.97
4482,12.01
4483,12.06
4484,12.15
4485,12.27
4486,12.42
4487,12.58
4488,12.75
4489,12.92
4490,13.08
4491,13.24
4492,13.40
4493,13.55
4494,13.70
4495,13.85
4496,14.00
4497,14.14
4498,14.31
4499,14.48
4500,14.67
4501,14.84
4502,15.03
4503,15.22
4504,15.42
4505,15.60
4506,15.75
4507,15.87
4508,15.98
4509,16.06
4510,16.12
4511,16.12
4512,16.08
4513,16.02
4514,15.94
4515,15.83
4516,15.69
4517,15.55
4518,15.41
4519,15.29
4520,15.16
4521,15.01
4522,14.86
4523,14.73
4524,14.61
4525,14.49
4526,14.36
4527,14.25
4528,14.14
4529,14.03
4530,13.92
4531,13.81
4532,13.69
4533,13.58
4534,13.49
4535,13.42
4536,13.36
4537,13.31
4538,13.28
4539,13.25
4540,13.23
4541,13.22
4542,13.19
4543,13.14
4544,13.09
4545,13.05
4546,13.00
4547,12.95
4548,12.87
4549,12.78
4550,12.69
4551,12.62
4552,12.55
4553,12.49
4554,12.43
4555,12.39
4556,12.37
4557,12.37
4558,12.36
4559,12.33
4560,12.31
4561,12.31
4562,12.31
4563,12.30
4564,12.27
4565,12.24
4566,12.21
4567,12.19
4568,12.20
4569,12.23
4570,12.28
4571,12.34
4572,12.41
4573,12.50
4574,12.61
4575,12.73
4576,12.84
4577,12.95
4578,13.06
4579,13.16
4580,13.24
4581,13.28
4582,13.32
4583,13.35
4584,13.35
4585,13.32
4586,13.28
4587,13.23
4588,13.18
4589,13.14
4590,13.10
4591,13.07
4592,13.05
4593,13.05
4594,13.07
4595,13.10
4596,13.13
4597,13.18
4598,13.24
4599,13.28
4600,13.31
4601,13.32
4602,13.34
4603,13.34
4604,13.31
4605,13.25
4606,13.17
4607,13.10
4608,13.03
4609,12.95
4610,12.85
4611,12.75
4612,12.67
4613,12.63
4614,12.59
4615,12.56
4616,12.55
4617,12.56
4618,12.60
4619,12.65
4620,12.69
4621,12.74
4622,12.79
4623,12.83
4624,12.86
4625,12.89
4626,12.93
4627,12.98
4628,13.02
4629,13.04
4630,13.08
4631,13.12
4632,13.17
4633,13.21
4634,13.26
4635,13.32
4636,13.40
4637,13.47
4638,13.53
4639,13.59
4640,13.67
4641,13.75
4642,13.84
4643,13.93
4644,14.05
4645,14.18
4646,14.31
4647,14.43
4648,14.55
4649,14.67
4650,14.78
4651,14.87
4652,14.93
4653,14.96
4654,14.97
4655,14.95
4656,14.91
4657,14.83
4658,14.74
4659,14.63
4660,14.52
4661,14.40
4662,14.28
4663,14.16
4664,14.04
4665,13.93
4666,13.80
4667,13.69
4668,13.56
4669,13.43
4670,13.28
4671,13.12
4672,12.94
4673,12.75
4674,12.53
4675,12.33
4676,12.13
4677,11.94
4678,11.73
4679,11.51
4680,11.28
4681,11.07
4682,10.87
4683,10.71
4684,10.53
4685,10.37
4686,10.20
4687,10.04
4688,9.89
4689,9.79
4690,9.71
4691,9.64
4692,9.56
4693,9.48
4694,9.45
4695,9.44
4696,9.45
4697,9.47
4698,9.51
4699,9.59
4700,9.69
4701,9.79
4702,9.90
4703,10.03
4704,10.20
4705,10.38
4706,10.55
4707,10.70
4708,10.85
4709,11.00
4710,11.12
4711,11.21
4712,11.28
4713,11.34
4714,11.38
4715,11.40
4716,11.39
4717,11.37
4718,11.35
4719,11.32
4720,11.29
4721,11.28
4722,11.27
4723,11.27
4724,11.27
4725,11.29
4726,11.33
4727,11.39
4728,11.45
4729,11.51
4730,11.58
4731,11.65
4732,11.71
4733,11.76
4734,11.81
4735,11.87
4736,11.92
4737,11.95
4738,11.96
4739,11.96
4740,11.95
4741,11.94
4742,11.92
4743,11.89
4744,11.84
4745,11.79
4746,11.72
4747,11.64
4748,11.55
4749,11.45
4750,11.34
4751,11.24
4752,11.12
4753,11.01
4754,10.89
4755,10.78
4756,10.70
4757,10.64
4758,10.59
4759,10.57
4760,10.56
4761,10.57
4762,10.60
4763,10.63
4764,10.68
4765,10.75
4766,10.84
4767,10.93
4768,11.01
4769,11.08
4770,11.18
4771,11.28
4772,11.38
4773,11.47
4774,11.56
4775,11.65
4776,11.72
4777,11.78
4778,11.84
4779,11.90
4780,11.95
4781,11.98
4782,12.00
4783,12.01
4784,12.03
4785,12.04
4786,12.05
4787,12.05
4788,12.05
4789,12.05
4790,12.04
4791,12.01
4792,11.98
4793,11.97
4794,11.94
4795,11.90
4796,11.83
4797,11.76
4798,11.68
4799,11.59
4800,11.50
4801,11.41
4802,11.32
4803,11.23
4804,11.14
4805,11.05
4806,10.96
4807,10.89
4808,10.84
4809,10.81
4810,10.78
4811,10.75
4812,10.72
4813,10.71
4814,10.71
4815,10.71
4816,10.71
4817,10.70
4818,10.71
4819,10.72
4820,10.75
4821,10.78
4822,10.81
4823,10.82
4824,10.83
4825,10.85
4826,10.86
4827,10.86
4828,10.85
4829,10.83
4830,10.82
4831,10.83
4832,10.82
4833,10.81
4834,10.78
4835,10.77
4836,10.77
4837,10.79
4838,10.80
4839,10.80
4840,10.80
4841,10.81
4842,10.84
4843,10.87
4844,10.90
4845,10.95
4846,11.00
4847,11.06
4848,11.12
4849,11.18
4850,11.25
4851,11.32
4852,11.39
4853,11.45
4854,11.51
4855,11.57
4856,11.62
4857,11.67
4858,11.72
4859,11.78
4860,11.84
4861,11.88
4862,11.91
4863,11.94
4864,11.98
4865,11.99
4866,11.98
4867,11.93
4868,11.87
4869,11.81
4870,11.75
4871,11.68
4872,11.58
4873,11.48
4874,11.37
4875,11.26
4876,11.15
4877,11.05
4878,10.96
4879,10.89
4880,10.82
4881,10.74
4882,10.68
4883,10.65
4884,10.64
4885,10.64
4886,10.64
4887,10.66
4888,10.70
4889,10.76
4890,10.83
4891,10.90
4892,11.00
4893,11.10
4894,11.20
4895,11.27
4896,11.34
4897,11.39
4898,11.44
4899,11.49
4900,11.53
4901,11.56
4902,11.58
4903,11.59
4904,11.61
4905,11.66
4906,11.72
4907,11.78
4908,11.83
4909,11.87
4910,11.94
4911,12.02
4912,12.12
4913,12.19
4914,12.27
4915,12.34
4916,12.40
4917,12.46
4918,12.54
4919,12.62
4920,12.72
4921,12.81
4922,12.90
4923,12.97
4924,13.03
4925,13.09
4926,13.15
4927,13.19
4928,13.21
4929,13.21
4930,13.21
4931,13.21
4932,13.20
4933,13.17
4934,13.13
4935,13.10
4936,13.06
4937,13.02
4938,12.98
4939,12.95
4940,12.92
4941,12.90
4942,12.86
4943,12.83
4944,12.81
4945,12.80
4946,12.77
4947,12.75
4948,12.72
4949,12.71
4950,12.69
4951,12.66
4952,12.63
4953,12.59
4954,12.57
4955,12.54
4956,12.51
4957,12.48
4958,12.45
4959,12.44
4960,12.42
4961,12.41
4962,12.40
4963,12.40
4964,12.41
4965,12.42
4966,12.45
4967,12.48
4968,12.50
4969,12.52
4970,12.54
4971,12.57
4972,12.59
4973,12.59
4974,12.59
4975,12.58
4976,12.58
4977,12.58
4978,12.60
4979,12.62
4980,12.65
4981,12.66
4982,12.69
4983,12.73
4984,12.80
4985,12.87
4986,12.95
4987,13.04
4988,13.14
4989,13.24
4990,13.35
4991,13.47
4992,13.61
4993,13.76
4994,13.89
4995,14.01
4996,14.13
4997,14.25
4998,14.36
4999,14.44
5000,14.48
5001,14.49
5002,14.49
5003,14.46
5004,14.40
5005,14.29
5006,14.15
5007,13.99
5008,13.80
5009,13.59
5010,13.36
5011,13.12
5012,12.88
5013,12.66
5014,12.45
5015,12.26
5016,12.08
5017,11.93
5018,11.80
5019,11.70
5020,11.61
5021,11.56
5022,11.52
5023,11.49
5024,11.46
5025,11.43
5026,11.41
5027,11.40
5028,11.38
5029,11.37
5030,11.35
5031,11.34
5032,11.33
5033,11.33
5034,11.34
5035,11.35
5036,11.37
5037,11.40
5038,11.45
5039,11.51
5040,11.56
5041,11.61
5042,11.66
5043,11.72
5044,11.77
5045,11.82
5046,11.86
5047,11.92
5048,12.00
5049,12.07
5050,12.14
5051,12.19
5052,12.26
5053,12.33
5054,12.42
5055,12.51
5056,12.60
5057,12.69
5058,12.77
5059,12.84
5060,12.92
5061,13.02
5062,13.10
5063,13.16
5064,13.19
5065,13.20
5066,13.22
5067,13.21
5068,13.19
5069,13.15
5070,13.09
5071,13.03
5072,12.97
5073,12.91
5074,12.85
5075,12.81
5076,12.77
5077,12.74
5078,12.73
5079,12.73
5080,12.74
5081,12.76
5082,12.77
5083,12.79
5084,12.80
5085,12.80
5086,12.78
5087,12.73
5088,12.67
5089,12.61
5090,12.55
5091,12.48
5092,12.39
5093,12.30
5094,12.20
5095,12.10
5096,12.01
5097,11.95
5098,11.90
5099,11.88
5100,11.86
5101,11.86
5102,11.88
5103,11.91
5104,11.94
5105,11.97
5106,12.01
5107,12.06
5108,12.09
5109,12.10
5110,12.11
5111,12.12
5112,12.14
5113,12.16
5114,12.17
5115,12.19
5116,12.20
5117,12.21
5118,12.24
5119,12.29
5120,12.34
5121,12.40
5122,12.47
5123,12.54
5124,12.62
5125,12.69
5126,12.77
5127,12.86
5128,12.96
5129,13.07
5130,13.16
5131,13.24
5132,13.30
5133,13.36
5134,13.41
5135,13.44
5136,13.45
5137,13.43
5138,13.40
5139,13.36
5140,13.28
5141,13.20
5142,13.11
5143,13.02
5144,12.91
5145,12.80
5146,12.68
5147,12.55
5148,12.42
5149,12.30
5150,12.17
5151,12.05
5152,11.91
5153,11.77
5154,11.61
5155,11.48
5156,11.36
5157,11.23
5158,11.07
5159,10.93
5160,10.80
5161,10.69
5162,10.59
5163,10.51
5164,10.44
5165,10.40
5166,10.36
5167,10.32
5168,10.26
5169,10.21
5170,10.13
5171,10.06
5172,9.98
5173,9.89
5174,9.79
5175,9.69
5176,9.58
5177,9.48
5178,9.38
5179,9.31
5180,9.25
5181,9.21
5182,9.17
5183,9.16
5184,9.17
5185,9.20
5186,9.24
5187,9.27
5188,9.29
5189,9.30
5190,9.31
5191,9.31
5192,9.30
5193,9.27
5194,9.24
5195,9.21
5196,9.16
5197,9.12
5198,9.09
5199,9.07
5200,9.06
5201,9.06
5202,9.09
5203,9.13
5204,9.18
5205,9.22
5206,9.29
5207,9.38
5208,9.47
5209,9.53
5210,9.56
5211,9.59
5212,9.62
5213,9.63
5214,9.64
5215,9.62
5216,9.59
5217,9.54
5218,9.49
5219,9.45
5220,9.41
5221,9.36
5222,9.32
5223,9.29
5224,9.26
5225,9.23
5226,9.22
5227,9.20
5228,9.17
5229,9.11
5230,9.04
5231,8.96
5232,8.88
5233,8.77
5234,8.65
5235,8.54
5236,8.42
5237,8.31
5238,8.22
5239,8.14
5240,8.10
5241,8.08
5242,8.09
5243,8.12
5244,8.18
5245,8.28
5246,8.43
5247,8.59
5248,8.77
5249,8.94
5250,9.13
5251,9.33
5252,9.53
5253,9.72
5254,9.90
5255,10.06
5256,10.23
5257,10.37
5258,10.50
5259,10.61
5260,10.69
5261,10.75
5262,10.78
5263,10.81
5264,10.85
5265,10.87
5266,10.89
5267,10.91
5268,10.93
5269,10.97
5270,11.03
5271,11.09
5272,11.16
5273,11.23
5274,11.31
5275,11.38
5276,11.46
5277,11.54
5278,11.60
5279,11.65
5280,11.68
5281,11.71
5282,11.72
5283,11.70
5284,11.68
5285,11.65
5286,11.61
5287,11.56
5288,11.53
5289,11.49
5290,11.46
5291,11.43
5292,11.43
5293,11.45
5294,11.50
5295,11.54
5296,11.61
5297,11.69
5298,11.80
5299,11.90
5300,12.02
5301,12.13
5302,12.25
5303,12.35
5304,12.45
5305,12.54
5306,12.62
5307,12.69
5308,12.77
5309,12.84
5310,12.91
5311,12.98
5312,13.09
5313,13.21
5314,13.38
5315,13.53
5316,13.71
5317,13.90
5318,14.13
5319,14.36
5320,14.61
5321,14.83
5322,15.05
5323,15.25
5324,15.45
5325,15.63
5326,15.78
5327,15.90
5328,15.99
5329,16.06
5330,16.13
5331,16.19
5332,16.23
5333,16.24
5334,16.25
5335,16.24
5336,16.24
5337,16.24
5338,16.26
5339,16.27
5340,16.26
5341,16.24
5342,16.20
5343,16.17
5344,16.12
5345,16.05
5346,15.97
5347,15.89
5348,15.82
5349,15.75
5350,15.66
5351,15.57
5352,15.48
5353,15.39
5354,15.32
5355,15.28
5356,15.23
5357,15.19
5358,15.16
5359,15.14
5360,15.14
5361,15.14
5362,15.15
5363,15.16
5364,15.18
5365,15.20
5366,15.20
5367,15.20
5368,15.20
5369,15.20
5370,15.20
5371,15.19
5372,15.15
5373,15.10
5374,15.06
5375,15.03
5376,15.01
5377,14.97
5378,14.95
5379,14.95
5380,14.98
5381,15.02
5382,15.08
5383,15.17
5384,15.30
5385,15.47
5386,15.65
5387,15.81
5388,15.96
5389,16.11
5390,16.26
5391,16.41
5392,16.54
5393,16.61
5394,16.64
5395,16.66
5396,16.66
5397,16.64
5398,16.60
5399,16.54
5400,16.49
5401,16.44
5402,16.40
5403,16.37
5404,16.36
5405,16.37
5406,16.41
5407,16.46
5408,16.51
5409,16.57
5410,16.63
5411,16.69
5412,16.75
5413,16.79
5414,16.82
5415,16.82
5416,16.81
5417,16.79
5418,16.76
5419,16.70
5420,16.61
5421,16.52
5422,16.44
5423,16.37
5424,16.29
5425,16.20
5426,16.10
5427,16.03
5428,15.99
5429,15.98
5430,15.97
5431,15.95
5432,15.94
5433,15.96
5434,15.99
5435,16.04
5436,16.08
5437,16.11
5438,16.14
5439,16.17
5440,16.19
5441,16.19
5442,16.18
5443,16.18
5444,16.18
5445,16.17
5446,16.13
5447,16.09
5448,16.05
5449,16.02
5450,15.98
5451,15.92
5452,15.86
5453,15.79
5454,15.74
5455,15.68
5456,15.62
5457,15.54
5458,15.46
5459,15.38
5460,15.32
5461,15.28
5462,15.24
5463,15.21
5464,15.18
5465,15.17
5466,15.19
5467,15.21
5468,15.23
5469,15.25
5470,15.29
5471,15.35
5472,15.40
5473,15.44
5474,15.45
5475,15.46
5476,15.47
5477,15.45
5478,15.43
5479,15.40
5480,15.37
5481,15.34
5482,15.30
5483,15.25
5484,15.22
5485,15.21
5486,15.19
5487,15.18
5488,15.16
5489,15.15
5490,15.14
5491,15.11
5492,15.05
5493,14.98
5494,14.90
5495,14.79
5496,14.64
5497,14.47
5498,14.28
5499,14.12
5500,13.96
5501,13.80
5502,13.63
5503,13.48
5504,13.35
5505,13.25
5506,13.16
5507,13.09
5508,13.03
5509,12.99
5510,12.95
5511,12.91
5512,12.84
5513,12.78
5514,12.75
5515,12.74
5516,12.71
5517,12.66
5518,12.63
5519,12.63
5520,12.64
5521,12.66
5522,12.69
5523,12.73
5524,12.78
5525,12.84
5526,12.92
5527,13.02
5528,13.14
5529,13.27
5530,13.39
5531,13.50
5532,13.61
5533,13.73
5534,13.88
5535,14.03
5536,14.16
5537,14.26
5538,14.36
5539,14.44
5540,14.52
5541,14.58
5542,14.64
5543,14.69
5544,14.75
5545,14.79
5546,14.83
5547,14.88
5548,14.94
5549,15.01
5550,15.09
5551,15.17
5552,15.23
5553,15.29
5554,15.35
5555,15.41
5556,15.47
5557,15.49
5558,15.49
5559,15.48
5560,15.47
5561,15.45
5562,15.42
5563,15.38
5564,15.34
5565,15.30
5566,15.27
5567,15.23
5568,15.19
5569,15.16
5570,15.12
5571,15.10
5572,15.08
5573,15.06
5574,15.03
5575,14.99
5576,14.94
5577,14.90
5578,14.85
5579,14.80
5580,14.77
5581,14.76
5582,14.74
5583,14.71
5584,14.68
5585,14.67
5586,14.67
5587,14.67
5588,14.66
5589,14.64
5590,14.64
5591,14.63
5592,14.63
5593,14.62
5594,14.60
5595,14.58
5596,14.57
5597,14.57
5598,14.59
5599,14.62
5600,14.65
5601,14.68
5602,14.71
5603,14.74
5604,14.78
5605,14.82
5606,14.86
5607,14.89
5608,14.92
5609,14.95
5610,14.97
5611,14.99
5612,15.01
5613,15.04
5614,15.06
5615,15.08
5616,15.09
5617,15.09
5618,15.07
5619,15.04
5620,15.01
5621,14.98
5622,14.93
5623,14.86
5624,14.78
5625,14.69
5626,14.58
5627,14.45
5628,14.29
5629,14.11
5630,13.90
5631,13.68
5632,13.46
5633,13.24
5634,12.99
5635,12.74
5636,12.48
5637,12.23
5638,11.98
5639,11.73
5640,11.47
5641,11.24
5642,11.01
5643,10.82
5644,10.65
5645,10.51
5646,10.37
5647,10.26
5648,10.15
5649,10.06
5650,9.97
5651,9.88
5652,9.82
5653,9.77
5654,9.72
5655,9.65
5656,9.57
5657,9.51
5658,9.46
5659,9.40
5660,9.34
5661,9.29
5662,9.27
5663,9.28
5664,9.33
5665,9.39
5666,9.48
5667,9.59
5668,9.74
5669,9.92
5670,10.14
5671,10.39
5672,10.66
5673,10.93
5674,11.21
5675,11.47
5676,11.72
5677,11.92
5678,12.12
5679,12.30
5680,12.45
5681,12.55
5682,12.60
5683,12.61
5684,12.63
5685,12.64
5686,12.63
5687,12.60
5688,12.58
5689,12.56
5690,12.54
5691,12.52
5692,12.48
5693,12.45
5694,12.42
5695,12.37
5696,12.30
5697,12.23
5698,12.17
5699,12.11
5700,12.03
5701,11.94
5702,11.87
5703,11.84
5704,11.83
5705,11.82
5706,11.82
5707,11.84
5708,11.88
5709,11.93
5710,11.99
5711,12.05
5712,12.10
5713,12.14
5714,12.19
5715,12.25
5716,12.31
5717,12.36
5718,12.45
5719,12.57
5720,12.70
5721,12.83
5722,12.99
5723,13.18
5724,13.41
5725,13.65
5726,13.90
5727,14.15
5728,14.41
5729,14.64
5730,14.86
5731,15.05
5732,15.24
5733,15.41
5734,15.59
5735,15.73
5736,15.86
5737,15.96
5738,16.06
5739,16.15
5740,16.22
5741,16.26
5742,16.29
5743,16.32
5744,16.36
5745,16.39
5746,16.39
5747,16.36
5748,16.31
5749,16.27
5750,16.23
5751,16.19
5752,16.11
5753,16.02
5754,15.94
5755,15.87
5756,15.77
5757,15.66
5758,15.53
5759,15.41
5760,15.29
5761,15.16
5762,15.01
5763,14.86
5764,14.71
5765,14.56
5766,14.41
5767,14.26
5768,14.12
5769,13.99
5770,13.85
5771,13.72
5772,13.60
5773,13.51
5774,13.44
5775,13.39
5776,13.32
5777,13.27
5778,13.21
5779,13.17
5780,13.13
5781,13.10
5782,13.07
5783,13.04
5784,13.03
5785,13.02
5786,13.02
5787,13.00
5788,13.01
5789,13.03
5790,13.07
5791,13.10
5792,13.14
5793,13.21
5794,13.31
5795,13.42
5796,13.54
5797,13.67
5798,13.82
5799,13.98
5800,14.15
5801,14.33
5802,14.53
5803,14.72
5804,14.90
5805,15.05
5806,15.18
5807,15.30
5808,15.41
5809,15.48
5810,15.51
5811,15.51
5812,15.49
5813,15.46
5814,15.42
5815,15.36
5816,15.29
5817,15.23
5818,15.18
5819,15.14
5820,15.08
5821,15.02
5822,14.97
5823,14.93
5824,14.87
5825,14.80
5826,14.71
5827,14.62
5828,14.52
5829,14.42
5830,14.31
5831,14.21
5832,14.11
5833,14.02
5834,13.94
5835,13.86
5836,13.80
5837,13.74
5838,13.69
5839,13.66
5840,13.64
5841,13.63
5842,13.61
5843,13.60
5844,13.58
5845,13.58
5846,13.60
5847,13.64
5848,13.67
5849,13.70
5850,13.74
5851,13.79
5852,13.87
5853,13.94
5854,14.02
5855,14.09
5856,14.17
5857,14.26
5858,14.36
5859,14.45
5860,14.53
5861,14.59
5862,14.62
5863,14.64
5864,14.64
5865,14.64
5866,14.63
5867,14.60
5868,14.55
5869,14.51
5870,14.47
5871,14.42
5872,14.36
5873,14.31
5874,14.25
5875,14.21
5876,14.16
5877,14.10
5878,14.04
5879,14.00
5880,13.96
5881,13.92
5882,13.87
5883,13.84
5884,13.82
5885,13.81
5886,13.80
5887,13.80
5888,13.80
5889,13.81
5890,13.80
5891,13.78
5892,13.76
5893,13.73
5894,13.71
5895,13.67
5896,13.62
5897,13.55
5898,13.46
5899,13.39
5900,13.32
5901,13.27
5902,13.20
5903,13.14
5904,13.10
5905,13.08
5906,13.08
5907,13.10
5908,13.14
5909,13.21
5910,13.31
5911,13.42
5912,13.54
5913,13.67
5914,13.81
5915,13.94
5916,14.09
5917,14.27
5918,14.47
5919,14.66
5920,14.85
5921,15.04
5922,15.26
5923,15.48
5924,15.70
5925,15.90
5926,16.12
5927,16.31
5928,16.47
5929,16.59
5930,16.68
5931,16.75
5932,16.80
5933,16.80
5934,16.76
5935,16.69
5936,16.62
5937,16.55
5938,16.47
5939,16.38
5940,16.29
5941,16.20
5942,16.11
5943,16.04
5944,15.98
5945,15.93
5946,15.90
5947,15.87
5948,15.84
5949,15.83
5950,15.82
5951,15.83
5952,15.83
5953,15.83
5954,15.83
5955,15.83
5956,15.83
5957,15.83
5958,15.82
5959,15.79
5960,15.74
5961,15.67
5962,15.56
5963,15.45
5964,15.33
5965,15.21
5966,15.06
5967,14.90
5968,14.74
5969,14.59
5970,14.42
5971,14.25
5972,14.08
5973,13.95
5974,13.82
5975,13.69
5976,13.56
5977,13.46
5978,13.38
5979,13.32
5980,13.27
5981,13.24
5982,13.24
5983,13.28
5984,13.37
5985,13.47
5986,13.59
5987,13.71
5988,13.84
5989,14.00
5990,14.19
5991,14.37
5992,14.53
5993,14.66
5994,14.80
5995,14.94
5996,15.09
5997,15.23
5998,15.36
5999,15.47
6000,15.59
6001,15.69
6002,15.79
6003,15.89
6004,16.00
6005,16.09
6006,16.15
6007,16.20
6008,16.23
6009,16.26
6010,16.28
6011,16.30
6012,16.31
6013,16.31
6014,16.29
6015,16.26
6016,16.23
6017,16.21
6018,16.21
6019,16.20
6020,16.17
6021,16.14
6022,16.12
6023,16.12
6024,16.13
6025,16.13
6026,16.13
6027,16.15
6028,16.16
6029,16.16
6030,16.15
6031,16.14
6032,16.11
6033,16.07
6034,16.00
6035,15.93
6036,15.84
6037,15.76
6038,15.65
6039,15.54
6040,15.40
6041,15.27
6042,15.13
6043,15.00
6044,14.87
6045,14.76
6046,14.64
6047,14.54
6048,14.44
6049,14.35
6050,14.25
6051,14.17
6052,14.10
6053,14.04
6054,13.98
6055,13.92
6056,13.86
6057,13.82
6058,13.78
6059,13.74
6060,13.69
6061,13.65
6062,13.60
6063,13.55
6064,13.52
6065,13.49
6066,13.47
6067,13.45
6068,13.44
6069,13.44
6070,13.46
6071,13.49
6072,13.53
6073,13.55
6074,13.57
6075,13.60
6076,13.65
6077,13.69
6078,13.73
6079,13.76
6080,13.79
6081,13.83
6082,13.88
6083,13.93
6084,13.99
6085,14.06
6086,14.14
6087,14.21
6088,14.29
6089,14.38
6090,14.48
6091,14.57
6092,14.65
6093,14.72
6094,14.79
6095,14.85
6096,14.90
6097,14.93
6098,14.93
6099,14.90
6100,14.87
6101,14.83
6102,14.79
6103,14.73
6104,14.67
6105,14.62
6106,14.58
6107,14.54
6108,14.50
6109,14.47
6110,14.44
6111,14.42
6112,14.38
6113,14.35
6114,14.33
6115,14.31
6116,14.30
6117,14.29
6118,14.27
6119,14.24
6120,14.20
6121,14.17
6122,14.16
6123,14.16
6124,14.16
6125,14.14
6126,14.11
6127,14.09
6128,14.05
6129,14.01
6130,13.94
6131,13.86
6132,13.76
6133,13.65
6134,13.53
6135,13.40
6136,13.26
6137,13.15
6138,13.03
6139,12.91
6140,12.79
6141,12.67
6142,12.55
6143,12.41
6144,12.27
6145,12.14
6146,12.01
6147,11.90
6148,11.77
6149,11.65
6150,11.55
6151,11.47
6152,11.42
6153,11.40
6154,11.40
6155,11.42
6156,11.47
6157,11.55
6158,11.65
6159,11.77
6160,11.90
6161,12.02
6162,12.14
6163,12.24
6164,12.33
6165,12.38
6166,12.42
6167,12.44
6168,12.42
6169,12.38
6170,12.31
6171,12.23
6172,12.16
6173,12.07
6174,11.97
6175,11.86
6176,11.76
6177,11.69
6178,11.62
6179,11.57
6180,11.52
6181,11.49
6182,11.48
6183,11.48
6184,11.47
6185,11.47
6186,11.49
6187,11.52
6188,11.56
6189,11.59
6190,11.61
6191,11.66
6192,11.73
6193,11.80
6194,11.86
6195,11.90
6196,11.95
6197,12.01
6198,12.08
6199,12.14
6200,12.19
6201,12.23
6202,12.28
6203,12.32
6204,12.36
6205,12.41
6206,12.47
6207,12.52
6208,12.58
6209,12.62
6210,12.67
6211,12.74
6212,12.83
6213,12.92
6214,13.02
6215,13.12
6216,13.22
6217,13.31
6218,13.41
6219,13.51
6220,13.60
6221,13.68
6222,13.76
6223,13.82
6224,13.89
6225,13.95
6226,14.03
6227,14.13
6228,14.25
6229,14.35
6230,14.44
6231,14.53
6232,14.63
6233,14.74
6234,14.82
6235,14.87
6236,14.89
6237,14.87
6238,14.80
6239,14.71
6240,14.58
6241,14.43
6242,14.24
6243,14.02
6244,13.78
6245,13.55
6246,13.34
6247,13.13
6248,12.92
6249,12.73
6250,12.55
6251,12.41
6252,12.29
6253,12.20
6254,12.13
6255,12.07
6256,12.02
6257,11.99
6258,11.98
6259,11.98
6260,11.99
6261,11.99
6262,11.98
6263,11.98
6264,11.99
6265,11.99
6266,11.99
6267,11.98
6268,11.99
6269,12.00
6270,12.04
6271,12.09
6272,12.18
6273,12.27
6274,12.37
6275,12.48
6276,12.63
6277,12.79
6278,12.96
6279,13.13
6280,13.29
6281,13.46
6282,13.61
6283,13.75
6284,13.85
6285,13.94
6286,14.03
6287,14.12
6288,14.19
6289,14.25
6290,14.32
6291,14.37
6292,14.42
6293,14.45
6294,14.48
6295,14.52
6296,14.56
6297,14.57
6298,14.58
6299,14.60
6300,14.61
6301,14.61
6302,14.60
6303,14.58
6304,14.57
6305,14.56
6306,14.54
6307,14.51
6308,14.47
6309,14.44
6310,14.42
6311,14.39
6312,14.33
6313,14.26
6314,14.19
6315,14.13
6316,14.05
6317,13.97
6318,13.89
6319,13.83
6320,13.76
6321,13.69
6322,13.62
6323,13.57
6324,13.55
6325,13.54
6326,13.53
6327,13.53
6328,13.53
6329,13.53
6330,13.53
6331,13.53
6332,13.53
6333,13.52
6334,13.48
6335,13.43
6336,13.40
6337,13.39
6338,13.37
6339,13.36
6340,13.36
6341,13.39
6342,13.45
6343,13.52
6344,13.61
6345,13.71
6346,13.83
6347,13.97
6348,14.11
6349,14.23
6350,14.32
6351,14.38
6352,14.42
6353,14.43
6354,14.41
6355,14.35
6356,14.26
6357,14.15
6358,14.05
6359,13.94
6360,13.84
6361,13.75
6362,13.69
6363,13.65
6364,13.65
6365,13.69
6366,13.75
6367,13.82
6368,13.89
6369,13.97
6370,14.06
6371,14.15
6372,14.22
6373,14.26
6374,14.30
6375,14.34
6376,14.39
6377,14.42
6378,14.44
6379,14.45
6380,14.46
6381,14.46
6382,14.46
6383,14.44
6384,14.41
6385,14.36
6386,14.32
6387,14.29
6388,14.28
6389,14.26
6390,14.22
6391,14.18
6392,14.16
6393,14.14
6394,14.10
6395,14.06
6396,14.04
6397,14.04
6398,14.03
6399,14.00
6400,13.98
6401,13.97
6402,13.97
6403,13.98
6404,14.00
6405,14.04
6406,14.10
6407,14.18
6408,14.27
6409,14.39
6410,14.52
6411,14.66
6412,14.79
6413,14.91
6414,15.02
6415,15.11
6416,15.18
6417,15.22
6418,15.24
6419,15.24
6420,15.23
6421,15.19
6422,15.15
6423,15.10
6424,15.06
6425,15.03
6426,15.01
6427,15.00
6428,15.00
6429,15.01
6430,15.04
6431,15.06
6432,15.10
6433,15.15
6434,15.20
6435,15.26
6436,15.30
6437,15.34
6438,15.37
6439,15.40
6440,15.41
6441,15.38
6442,15.33
6443,15.29
6444,15.23
6445,15.16
6446,15.08
6447,14.99
6448,14.88
6449,14.76
6450,14.63
6451,14.52
6452,14.40
6453,14.28
6454,14.15
6455,14.04
6456,13.94
6457,13.86
6458,13.79
6459,13.72
6460,13.65
6461,13.61
6462,13.58
6463,13.57
6464,13.57
6465,13.58
6466,13.60
6467,13.64
6468,13.67
6469,13.70
6470,13.73
6471,13.78
6472,13.82
6473,13.85
6474,13.86
6475,13.86
6476,13.86
6477,13.88
6478,13.90
6479,13.92
6480,13.93
6481,13.94
6482,13.98
6483,14.03
6484,14.10
6485,14.16
6486,14.22
6487,14.29
6488,14.38
6489,14.47
6490,14.55
6491,14.63
6492,14.72
6493,14.80
6494,14.88
6495,14.94
6496,15.00
6497,15.06
6498,15.10
6499,15.12
6500,15.12
6501,15.11
6502,15.11
6503,15.10
6504,15.06
6505,15.02
6506,14.97
6507,14.93
6508,14.88
6509,14.84
6510,14.79
6511,14.77
6512,14.74
6513,14.71
6514,14.68
6515,14.65
6516,14.63
6517,14.61
6518,14.59
6519,14.57
6520,14.53
6521,14.49
6522,14.42
6523,14.34
6524,14.22
6525,14.11
6526,13.97
6527,13.83
6528,13.65
6529,13.47
6530,13.31
6531,13.16
6532,13.01
6533,12.88
6534,12.77
6535,12.69
6536,12.65
6537,12.64
6538,12.64
6539,12.65
6540,12.70
6541,12.76
6542,12.82
6543,12.86
6544,12.89
6545,12.92
6546,12.95
6547,12.99
6548,13.01
6549,13.02
6550,13.03
6551,13.05
6552,13.07
6553,13.10
6554,13.13
6555,13.14
6556,13.16
6557,13.17
6558,13.18
6559,13.18
6560,13.17
6561,13.17
6562,13.18
6563,13.20
6564,13.21
6565,13.23
6566,13.26
6567,13.30
6568,13.35
6569,13.40
6570,13.44
6571,13.49
6572,13.52
6573,13.56
6574,13.57
6575,13.56
6576,13.50
6577,13.42
6578,13.30
6579,13.16
6580,13.00
6581,12.83
6582,12.64
6583,12.45
6584,12.24
6585,12.03
6586,11.83
6587,11.65
6588,11.49
6589,11.36
6590,11.25
6591,11.16
6592,11.10
6593,11.06
6594,11.00
6595,10.96
6596,10.93
6597,10.93
6598,10.95
6599,10.97
6600,10.97
6601,10.96
6602,10.93
6603,10.92
6604,10.90
6605,10.88
6606,10.84
6607,10.79
6608,10.74
6609,10.70
6610,10.67
6611,10.64
6612,10.59
6613,10.55
6614,10.52
6615,10.52
6616,10.53
6617,10.55
6618,10.57
6619,10.62
6620,10.69
6621,10.76
6622,10.83
6623,10.90
6624,11.00
6625,11.09
6626,11.15
6627,11.18
6628,11.19
6629,11.19
6630,11.15
6631,11.08
6632,11.00
6633,10.90
6634,10.80
6635,10.68
6636,10.57
6637,10.48
6638,10.40
6639,10.35
6640,10.30
6641,10.29
6642,10.30
6643,10.33
6644,10.36
6645,10.40
6646,10.43
6647,10.46
6648,10.47
6649,10.48
6650,10.46
6651,10.43
6652,10.38
6653,10.32
6654,10.26
6655,10.20
6656,10.15
6657,10.09
6658,10.02
6659,9.96
6660,9.92
6661,9.89
6662,9.86
6663,9.83
6664,9.80
6665,9.79
6666,9.77
6667,9.76
6668,9.75
6669,9.75
6670,9.77
6671,9.79
6672,9.83
6673,9.88
6674,9.93
6675,10.01
6676,10.10
6677,10.21
6678,10.31
6679,10.39
6680,10.49
6681,10.59
6682,10.70
6683,10.79
6684,10.86
6685,10.91
6686,10.97
6687,11.03
6688,11.10
6689,11.17
6690,11.25
6691,11.34
6692,11.45
6693,11.58
6694,11.74
6695,11.92
6696,12.12
6697,12.32
6698,12.55
6699,12.77
6700,12.99
6701,13.18
6702,13.35
6703,13.48
6704,13.59
6705,13.66
6706,13.70
6707,13.70
6708,13.67
6709,13.59
6710,13.48
6711,13.36
6712,13.25
6713,13.14
6714,13.03
6715,12.92
6716,12.80
6717,12.69
6718,12.58
6719,12.47
6720,12.34
6721,12.24
6722,12.15
6723,12.06
6724,11.97
6725,11.88
6726,11.79
6727,11.70
6728,11.62
6729,11.58
6730,11.56
6731,11.57
6732,11.58
6733,11.59
6734,11.61
6735,11.66
6736,11.72
6737,11.80
6738,11.88
6739,11.95
6740,12.02
6741,12.06
6742,12.09
6743,12.10
6744,12.12
6745,12.13
6746,12.13
6747,12.10
6748,12.05
6749,12.01
6750,11.98
6751,11.94
6752,11.90
6753,11.86
6754,11.83
6755,11.83
6756,11.83
6757,11.83
6758,11.87
6759,11.94
6760,12.03
6761,12.12
6762,12.21
6763,12.32
6764,12.43
6765,12.53
6766,12.63
6767,12.72
6768,12.81
6769,12.90
6770,12.97
6771,13.02
6772,13.05
6773,13.08
6774,13.09
6775,13.10
6776,13.09
6777,13.07
6778,13.04
6779,12.99
6780,12.96
6781,12.93
6782,12.88
6783,12.82
6784,12.78
6785,12.75
6786,12.71
6787,12.65
6788,12.58
6789,12.52
6790,12.47
6791,12.43
6792,12.38
6793,12.32
6794,12.24
6795,12.17
6796,12.11
6797,12.05
6798,11.97
6799,11.88
6800,11.80
6801,11.74
6802,11.69
6803,11.63
6804,11.58
6805,11.53
6806,11.48
6807,11.44
6808,11.40
6809,11.39
6810,11.40
6811,11.41
6812,11.43
6813,11.44
6814,11.46
6815,11.49
6816,11.53
6817,11.58
6818,11.62
6819,11.67
6820,11.71
6821,11.76
6822,11.80
6823,11.85
6824,11.89
6825,11.91
6826,11.93
6827,11.95
6828,11.97
6829,11.98
6830,11.98
6831,11.97
6832,11.95
6833,11.95
6834,11.96
6835,11.96
6836,11.95
6837,11.95
6838,11.97
6839,12.00
6840,12.03
6841,12.07
6842,12.09
6843,12.12
6844,12.14
6845,12.16
6846,12.17
6847,12.17
6848,12.16
6849,12.13
6850,12.08
6851,12.02
6852,11.95
6853,11.86
6854,11.76
6855,11.64
6856,11.50
6857,11.35
6858,11.20
6859,11.05
6860,10.89
6861,10.73
6862,10.57
6863,10.46
6864,10.36
6865,10.29
6866,10.23
6867,10.20
6868,10.21
6869,10.26
6870,10.31
6871,10.36
6872,10.40
6873,10.45
6874,10.49
6875,10.52
6876,10.53
6877,10.53
6878,10.52
6879,10.48
6880,10.45
6881,10.42
6882,10.40
6883,10.39
6884,10.37
6885,10.37
6886,10.40
6887,10.46
6888,10.53
6889,10.61
6890,10.69
6891,10.80
6892,10.92
6893,11.06
6894,11.19
6895,11.31
6896,11.42
6897,11.51
6898,11.57
6899,11.61
6900,11.65
6901,11.68
6902,11.69
6903,11.68
6904,11.64
6905,11.60
6906,11.55
6907,11.51
6908,11.46
6909,11.41
6910,11.38
6911,11.35
6912,11.31
6913,11.27
6914,11.22
6915,11.19
6916,11.17
6917,11.16
6918,11.15
6919,11.14
6920,11.11
6921,11.08
6922,11.06
6923,11.06
6924,11.07
6925,11.09
6926,11.10
6927,11.10
6928,11.08
6929,11.05
6930,11.02
6931,10.99
6932,10.95
6933,10.89
6934,10.83
6935,10.75
6936,10.65
6937,10.55
6938,10.46
6939,10.38
6940,10.31
6941,10.24
6942,10.17
6943,10.13
6944,10.09
6945,10.06
6946,10.06
6947,10.08
6948,10.13
6949,10.20
6950,10.27
6951,10.35
6952,10.46
6953,10.58
6954,10.72
6955,10.87
6956,11.02
6957,11.15
6958,11.27
6959,11.37
6960,11.47
6961,11.54
6962,11.61
6963,11.66
6964,11.71
6965,11.74
6966,11.77
6967,11.80
6968,11.82
6969,11.81
6970,11.81
6971,11.83
6972,11.85
6973,11.88
6974,11.91
6975,11.92
6976,11.92
6977,11.92
6978,11.94
6979,11.96
6980,11.94
6981,11.90
6982,11.85
6983,11.82
6984,11.80
6985,11.75
6986,11.68
6987,11.61
6988,11.54
6989,11.50
6990,11.47
6991,11.45
6992,11.45
6993,11.48
6994,11.55
6995,11.62
6996,11.69
6997,11.75
6998,11.82
6999,11.89
7000,11.95
7001,11.98
7002,11.99
7003,11.98
7004,11.93
7005,11.84
7006,11.72
7007,11.60
7008,11.49
7009,11.39
7010,11.27
7011,11.15
7012,11.05
7013,10.99
7014,10.95
7015,10.93
7016,10.91
7017,10.91
7018,10.92
7019,10.94
7020,10.96
7021,10.98
7022,11.02
7023,11.07
7024,11.12
7025,11.16
7026,11.20
7027,11.25
7028,11.31
7029,11.36
7030,11.41
7031,11.44
7032,11.47
7033,11.50
7034,11.52
7035,11.52
7036,11.50
7037,11.47
7038,11.43
7039,11.39
7040,11.34
7041,11.29
7042,11.25
7043,11.21
7044,11.17
7045,11.15
7046,11.15
7047,11.18
7048,11.20
7049,11.23
7050,11.25
7051,11.25
7052,11.24
7053,11.21
7054,11.15
7055,11.06
7056,10.95
7057,10.82
7058,10.64
7059,10.42
7060,10.17
7061,9.95
7062,9.74
7063,9.53
7064,9.33
7065,9.13
7066,8.95
7067,8.80
7068,8.69
7069,8.60
7070,8.52
7071,8.47
7072,8.43
7073,8.40
7074,8.36
7075,8.32
7076,8.28
7077,8.26
7078,8.22
7079,8.16
7080,8.08
7081,8.00
7082,7.94
7083,7.88
7084,7.82
7085,7.74
7086,7.66
7087,7.58
7088,7.53
7089,7.50
7090,7.48
7091,7.47
7092,7.46
7093,7.47
7094,7.52
7095,7.60
7096,7.68
7097,7.77
7098,7.88
7099,8.01
7100,8.16
7101,8.31
7102,8.46
7103,8.61
7104,8.76
7105,8.87
7106,8.97
7107,9.06
7108,9.15
7109,9.22
7110,9.26
7111,9.27
7112,9.24
7113,9.21
7114,9.16
7115,9.09
7116,9.00
7117,8.91
7118,8.81
7119,8.71
7120,8.61
7121,8.52
7122,8.44
7123,8.36
7124,8.29
7125,8.23
7126,8.18
7127,8.13
7128,8.10
7129,8.11
7130,8.13
7131,8.18
7132,8.23
7133,8.29
7134,8.37
7135,8.45
7136,8.55
7137,8.66
7138,8.77
7139,8.87
7140,8.96
7141,9.02
7142,9.06
7143,9.09
7144,9.10
7145,9.10
7146,9.10
7147,9.09
7148,9.10
7149,9.11
7150,9.16
7151,9.25
7152,9.36
7153,9.49
7154,9.67
7155,9.88
7156,10.11
7157,10.34
7158,10.60
7159,10.85
7160,11.08
7161,11.28
7162,11.45
7163,11.61
7164,11.77
7165,11.92
7166,12.05
7167,12.15
7168,12.24
7169,12.32
7170,12.42
7171,12.53
7172,12.64
7173,12.74
7174,12.83
7175,12.91
7176,12.98
7177,13.03
7178,13.08
7179,13.09
7180,13.09
7181,13.07
7182,13.05
7183,13.02
7184,12.99
7185,12.97
7186,12.98
7187,12.99
7188,13.00
7189,13.05
7190,13.04
7191,12.98
7192,12.90
7193,12.68
7194,12.88
7195,13.20
7196,13.04
7197,11.79
7198,11.11
7199,13.46
7200,14.34
