1,-7.68
2,-10.62
3,-10.69
4,-10.69
5,-12.68
6,-15.15
7,-14.85
8,-11.23
9,-6.95
10,-5.23
11,-6.68
12,-9.51
13,-11.48
14,-12.06
15,-12.10
16,-12.53
17,-13.26
18,-13.62
19,-13.17
20,-12.41
21,-12.51
22,-14.04
23,-16.14
24,-17.23
25,-16.29
26,-14.08
27,-12.30
28,-12.14
29,-13.14
30,-14.00
31,-13.77
32,-12.91
33,-12.57
34,-13.57
35,-15.52
36,-17.36
37,-18.12
38,-17.82
39,-17.33
40,-17.75
41,-19.45
42,-21.55
43,-22.51
44,-21.69
45,-20.21
46,-20.05
47,-21.94
48,-24.42
49,-25.18
50,-23.41
51,-20.61
52,-18.88
53,-18.92
54,-19.64
55,-19.72
56,-18.99
57,-18.28
58,-17.87
59,-17.13
60,-15.61
61,-14.09
62,-13.90
63,-15.27
64,-16.66
65,-16.45
66,-14.73
67,-13.33
68,-13.83
69,-16.10
70,-18.65
71,-20.30
72,-20.92
73,-20.96
74,-20.56
75,-19.65
76,-18.35
77,-17.01
78,-15.80
79,-14.67
80,-13.67
81,-13.24
82,-13.77
83,-14.94
84,-15.66
85,-15.05
86,-13.40
87,-12.01
88,-11.80
89,-12.44
90,-12.90
91,-12.73
92,-12.34
93,-12.29
94,-12.79
95,-13.89
96,-15.57
97,-17.45
98,-18.70
99,-18.72
100,-17.77
101,-16.66
102,-15.63
103,-14.08
104,-11.66
105,-9.31
106,-8.65
107,-10.11
108,-12.25
109,-13.07
110,-12.19
111,-11.14
112,-11.49
113,-13.26
114,-14.87
115,-15.16
116,-14.54
117,-14.49
118,-15.59
119,-16.80
120,-16.47
121,-14.08
122,-10.91
123,-8.79
124,-8.34
125,-8.50
126,-8.13
127,-7.33
128,-7.06
129,-7.77
130,-8.97
131,-10.23
132,-11.75
133,-13.73
134,-15.42
135,-15.82
136,-14.89
137,-13.91
138,-13.88
139,-14.29
140,-13.57
141,-11.16
142,-8.43
143,-7.33
144,-8.19
145,-9.50
146,-9.60
147,-8.46
148,-7.33
149,-7.13
150,-7.24
151,-6.47
152,-4.41
153,-2.16
154,-1.10
155,-1.82
156,-3.63
157,-5.38
158,-6.29
159,-6.35
160,-5.79
161,-4.86
162,-3.82
163,-3.38
164,-4.23
165,-6.46
166,-8.71
167,-9.08
168,-6.97
169,-3.96
170,-2.29
171,-2.62
172,-3.56
173,-3.50
174,-2.11
175,-0.26
176,1.19
177,1.91
178,1.88
179,1.17
180,0.31
181,-0.09
182,0.28
183,0.72
184,0.33
185,-1.03
186,-2.54
187,-3.34
188,-3.39
189,-3.11
190,-2.46
191,-0.95
192,1.26
193,2.86
194,2.49
195,0.37
196,-1.68
197,-2.01
198,-0.78
199,0.52
200,0.86
201,0.62
202,0.81
203,1.76
204,2.82
205,3.17
206,2.50
207,1.01
208,-0.99
209,-2.93
210,-4.11
211,-4.12
212,-3.31
213,-2.55
214,-2.58
215,-3.35
216,-4.19
217,-4.52
218,-4.30
219,-3.92
220,-3.63
221,-3.36
222,-2.93
223,-2.37
224,-1.62
225,-0.41
226,1.63
227,4.25
228,6.57
229,7.53
230,6.69
231,4.42
232,1.81
233,0.14
234,-0.03
235,0.87
236,1.87
237,2.52
238,3.13
239,3.98
240,4.58
241,3.92
242,1.54
243,-1.72
244,-4.22
245,-4.74
246,-3.55
247,-2.04
248,-1.29
249,-1.12
250,-0.71
251,0.18
252,1.06
253,1.48
254,1.51
255,1.30
256,0.81
257,-0.09
258,-1.05
259,-1.64
260,-1.47
261,-0.56
262,0.90
263,2.44
264,3.36
265,3.23
266,2.98
267,4.50
268,8.61
269,13.26
270,14.84
271,11.75
272,6.29
273,2.62
274,2.70
275,4.78
276,6.06
277,5.69
278,4.81
279,4.18
280,3.12
281,0.99
282,-1.44
283,-2.43
284,-1.49
285,0.49
286,2.05
287,2.62
288,2.45
289,1.88
290,0.89
291,-0.53
292,-2.20
293,-3.65
294,-4.40
295,-4.06
296,-2.85
297,-1.81
298,-1.86
299,-2.77
300,-3.34
301,-2.76
302,-1.76
303,-1.55
304,-2.20
305,-2.30
306,-0.53
307,2.58
308,4.88
309,4.56
310,1.75
311,-1.80
312,-4.07
313,-4.10
314,-2.32
315,-0.31
316,0.38
317,-0.78
318,-2.76
319,-3.97
320,-3.79
321,-3.12
322,-2.81
323,-2.32
324,-0.34
325,2.95
326,5.33
327,4.57
328,1.48
329,-0.63
330,0.98
331,5.34
332,8.82
333,8.57
334,5.33
335,2.26
336,2.28
337,5.60
338,10.24
339,13.45
340,13.85
341,11.98
342,9.53
343,7.74
344,6.98
345,7.01
346,7.73
347,9.17
348,11.11
349,12.77
350,13.31
351,12.33
352,10.46
353,8.98
354,8.97
355,10.44
356,11.99
357,11.93
358,10.02
359,8.00
360,7.89
361,9.80
362,11.91
363,12.43
364,11.24
365,9.50
366,8.04
367,6.98
368,6.40
369,6.76
370,8.04
371,9.25
372,9.46
373,9.21
374,9.76
375,11.23
376,11.85
377,10.18
378,7.21
379,5.78
380,7.32
381,10.21
382,11.32
383,9.28
384,5.68
385,3.17
386,3.03
387,4.53
388,5.93
389,5.83
390,3.85
391,1.03
392,-0.31
393,1.69
394,6.39
395,10.30
396,10.18
397,6.32
398,2.16
399,0.70
400,2.06
401,4.56
402,6.88
403,8.81
404,10.32
405,11.08
406,11.06
407,10.68
408,10.27
409,9.50
410,7.56
411,4.64
412,2.31
413,2.34
414,4.70
415,7.39
416,8.02
417,6.09
418,2.92
419,0.38
420,-0.83
421,-0.93
422,-0.79
423,-1.07
424,-1.98
425,-3.01
426,-3.36
427,-2.78
428,-1.91
429,-1.77
430,-2.96
431,-5.01
432,-6.65
433,-6.50
434,-4.15
435,-0.65
436,2.15
437,2.98
438,1.99
439,0.40
440,-0.44
441,-0.10
442,0.97
443,1.81
444,1.63
445,0.33
446,-1.29
447,-2.09
448,-0.99
449,1.90
450,5.23
451,6.96
452,6.01
453,3.07
454,0.34
455,-0.38
456,1.25
457,3.91
458,6.18
459,7.29
460,7.72
461,8.16
462,9.18
463,10.52
464,11.71
465,12.34
466,12.51
467,12.71
468,13.60
469,15.32
470,17.34
471,18.54
472,18.35
473,17.25
474,16.26
475,15.85
476,15.38
477,14.13
478,12.14
479,10.54
480,10.20
481,10.93
482,11.22
483,9.75
484,6.54
485,3.26
486,1.23
487,0.36
488,-0.40
489,-1.25
490,-1.59
491,-1.16
492,-1.07
493,-2.38
494,-4.17
495,-3.99
496,-0.70
497,3.74
498,6.00
499,5.03
500,3.17
501,3.46
502,6.23
503,8.89
504,9.48
505,8.75
506,8.49
507,8.55
508,7.28
509,4.19
510,1.66
511,2.14
512,5.04
513,7.08
514,6.13
515,3.62
516,2.91
517,5.52
518,9.63
519,12.26
520,12.22
521,10.56
522,8.76
523,7.33
524,6.37
525,6.25
526,7.40
527,9.18
528,10.33
529,10.19
530,9.63
531,9.76
532,10.60
533,11.13
534,10.80
535,10.40
536,11.04
537,12.71
538,14.23
539,14.52
540,13.80
541,12.91
542,12.21
543,11.34
544,10.33
545,9.94
546,10.72
547,11.97
548,12.51
549,12.37
550,13.07
551,15.63
552,18.92
553,20.57
554,19.32
555,16.38
556,14.04
557,13.44
558,13.98
559,14.40
560,14.18
561,13.44
562,12.25
563,10.50
564,8.71
565,8.09
566,9.67
567,13.03
568,16.27
569,17.47
570,16.32
571,14.23
572,12.88
573,12.88
574,13.78
575,14.95
576,16.35
577,17.98
578,19.29
579,19.18
580,17.34
581,14.80
582,13.20
583,13.31
584,14.28
585,14.78
586,14.74
587,15.36
588,17.19
589,18.71
590,17.91
591,14.82
592,11.86
593,11.33
594,12.81
595,14.04
596,13.66
597,12.72
598,13.08
599,14.99
600,16.68
601,16.45
602,14.74
603,13.62
604,14.33
605,15.77
606,15.81
607,13.57
608,10.61
609,9.36
610,10.93
611,14.36
612,17.87
613,20.27
614,21.22
615,20.78
616,19.47
617,18.38
618,18.66
619,20.26
620,21.64
621,21.30
622,19.53
623,18.24
624,18.97
625,21.05
626,22.19
627,20.70
628,17.17
629,13.91
630,12.88
631,14.20
632,16.39
633,17.67
634,17.39
635,16.26
636,15.30
637,14.87
638,14.68
639,14.63
640,15.21
641,17.04
642,19.86
643,22.39
644,23.34
645,22.53
646,21.00
647,19.98
648,19.66
649,19.11
650,17.61
651,15.57
652,14.17
653,13.96
654,14.46
655,14.86
656,15.20
657,16.03
658,17.54
659,18.94
660,19.18
661,18.09
662,16.93
663,17.29
664,19.65
665,22.71
666,24.75
667,25.10
668,24.64
669,24.40
670,24.64
671,24.77
672,24.56
673,24.41
674,24.62
675,24.74
676,24.17
677,23.20
678,22.99
679,24.22
680,26.13
681,27.18
682,26.43
683,24.37
684,22.17
685,20.87
686,20.32
687,19.73
688,18.56
689,17.54
690,17.74
691,19.41
692,20.79
693,19.64
694,15.35
695,10.31
696,7.70
697,8.79
698,11.41
699,12.45
700,10.56
701,7.49
702,5.67
703,6.18
704,7.84
705,9.06
706,9.00
707,8.07
708,6.61
709,4.74
710,2.66
711,1.09
712,0.45
713,0.30
714,-0.47
715,-2.03
716,-3.22
717,-2.63
718,-0.28
719,2.28
720,3.28
721,2.34
722,0.45
723,-1.07
724,-1.47
725,-0.72
726,0.79
727,2.33
728,2.97
729,2.26
730,1.15
731,1.44
732,3.90
733,6.90
734,7.67
735,5.11
736,1.31
737,-0.47
738,0.96
739,3.50
740,4.28
741,2.62
742,0.62
743,0.60
744,2.71
745,5.01
746,6.06
747,6.34
748,7.03
749,8.04
750,7.98
751,6.09
752,3.97
753,4.16
754,7.25
755,10.75
756,11.37
757,8.24
758,3.79
759,1.35
760,2.26
761,5.11
762,7.61
763,8.47
764,8.03
765,7.42
766,7.31
767,7.54
768,7.59
769,7.28
770,6.87
771,6.87
772,7.54
773,8.62
774,9.34
775,8.80
776,6.95
777,4.88
778,4.11
779,5.16
780,6.98
781,7.93
782,7.26
783,5.80
784,5.02
785,5.69
786,7.38
787,8.97
788,9.48
789,8.56
790,6.63
791,4.67
792,3.70
793,4.08
794,5.27
795,6.31
796,6.67
797,6.62
798,7.03
799,8.38
800,10.19
801,11.25
802,10.84
803,9.54
804,8.30
805,7.46
806,6.83
807,6.57
808,7.28
809,8.90
810,9.99
811,9.01
812,5.97
813,2.74
814,1.27
815,1.94
816,3.43
817,4.40
818,4.65
819,4.89
820,5.24
821,4.86
822,3.21
823,1.22
824,0.38
825,1.21
826,2.55
827,3.18
828,3.00
829,2.85
830,3.31
831,4.17
832,4.78
833,4.70
834,3.72
835,1.97
836,0.03
837,-1.16
838,-0.92
839,0.25
840,0.91
841,-0.08
842,-2.22
843,-3.84
844,-3.74
845,-2.28
846,-0.61
847,0.69
848,1.89
849,3.23
850,4.35
851,4.82
852,4.74
853,4.53
854,4.38
855,4.24
856,4.21
857,4.50
858,5.03
859,5.00
860,3.87
861,1.95
862,0.40
863,-0.15
864,0.03
865,0.33
866,0.83
867,2.13
868,4.42
869,6.97
870,8.85
871,9.79
872,10.09
873,10.06
874,9.66
875,8.96
876,8.46
877,8.52
878,8.72
879,8.03
880,6.03
881,3.53
882,1.88
883,1.67
884,2.28
885,2.98
886,3.75
887,5.15
888,6.86
889,7.58
890,6.40
891,4.17
892,2.76
893,3.10
894,4.21
895,4.54
896,3.79
897,3.11
898,3.53
899,4.76
900,5.66
901,5.46
902,4.49
903,3.51
904,3.08
905,3.33
906,3.99
907,4.51
908,4.66
909,4.91
910,6.10
911,8.20
912,9.84
913,9.34
914,6.57
915,3.41
916,2.21
917,3.63
918,6.01
919,7.00
920,5.85
921,3.98
922,3.25
923,4.14
924,5.30
925,5.20
926,3.62
927,1.98
928,1.71
929,2.99
930,4.15
931,3.29
932,0.15
933,-3.06
934,-3.86
935,-1.84
936,0.65
937,1.04
938,-0.98
939,-3.22
940,-3.85
941,-3.21
942,-3.06
943,-4.06
944,-5.04
945,-4.52
946,-2.94
947,-2.15
948,-3.09
949,-4.63
950,-5.17
951,-4.63
952,-4.37
953,-5.04
954,-5.58
955,-4.56
956,-2.05
957,0.48
958,1.91
959,2.25
960,2.03
961,1.21
962,-0.35
963,-2.13
964,-3.00
965,-2.63
966,-1.80
967,-1.34
968,-0.64
969,1.43
970,4.59
971,6.60
972,5.72
973,2.98
974,1.24
975,1.91
976,3.63
977,4.16
978,3.01
979,1.44
980,0.72
981,1.00
982,1.49
983,1.63
984,1.62
985,2.27
986,3.89
987,5.76
988,6.37
989,4.66
990,1.28
991,-1.72
992,-2.76
993,-2.27
994,-1.92
995,-2.54
996,-3.02
997,-1.81
998,0.97
999,3.45
1000,4.10
1001,3.46
1002,2.96
1003,3.22
1004,3.46
1005,3.15
1006,2.92
1007,3.45
1008,3.93
1009,2.65
1010,-0.80
1011,-4.42
1012,-5.65
1013,-3.97
1014,-1.39
1015,-0.18
1016,-0.80
1017,-2.10
1018,-3.06
1019,-3.69
1020,-4.29
1021,-4.68
1022,-4.37
1023,-3.29
1024,-1.71
1025,0.13
1026,2.14
1027,3.79
1028,4.30
1029,3.49
1030,2.51
1031,2.81
1032,4.66
1033,6.74
1034,7.29
1035,5.76
1036,3.27
1037,1.50
1038,1.32
1039,2.34
1040,3.54
1041,4.10
1042,3.49
1043,1.63
1044,-0.79
1045,-2.36
1046,-2.21
1047,-1.03
1048,-0.26
1049,-0.28
1050,-0.08
1051,1.26
1052,3.10
1053,3.95
1054,3.24
1055,2.01
1056,1.71
1057,2.77
1058,4.08
1059,4.19
1060,2.81
1061,1.02
1062,0.12
1063,0.30
1064,0.77
1065,0.71
1066,0.16
1067,-0.27
1068,0.06
1069,1.24
1070,2.64
1071,3.17
1072,2.50
1073,1.57
1074,1.82
1075,3.50
1076,5.45
1077,6.32
1078,6.00
1079,5.33
1080,5.08
1081,5.22
1082,5.44
1083,5.55
1084,5.81
1085,6.27
1086,6.65
1087,6.46
1088,5.92
1089,5.75
1090,6.29
1091,6.90
1092,6.75
1093,6.10
1094,6.32
1095,8.31
1096,11.14
1097,12.68
1098,11.72
1099,9.19
1100,7.22
1101,7.06
1102,7.93
1103,7.99
1104,6.31
1105,3.77
1106,2.38
1107,3.56
1108,6.82
1109,10.06
1110,11.02
1111,9.22
1112,6.13
1113,4.02
1114,3.83
1115,4.59
1116,4.48
1117,2.83
1118,0.56
1119,-0.80
1120,-0.73
1121,0.03
1122,0.60
1123,0.80
1124,0.91
1125,0.91
1126,0.60
1127,0.20
1128,0.40
1129,1.50
1130,3.05
1131,4.37
1132,5.27
1133,5.93
1134,6.52
1135,7.00
1136,7.46
1137,8.09
1138,8.94
1139,9.60
1140,9.31
1141,7.62
1142,4.82
1143,1.89
1144,-0.12
1145,-0.75
1146,-0.46
1147,-0.30
1148,-1.16
1149,-2.97
1150,-4.81
1151,-5.53
1152,-4.79
1153,-3.17
1154,-1.58
1155,-0.31
1156,1.08
1157,2.95
1158,4.69
1159,5.05
1160,3.54
1161,1.37
1162,0.58
1163,1.97
1164,4.55
1165,6.34
1166,6.13
1167,4.02
1168,1.17
1169,-1.01
1170,-1.53
1171,-0.33
1172,1.73
1173,3.52
1174,4.28
1175,4.07
1176,3.44
1177,2.84
1178,2.18
1179,1.26
1180,0.42
1181,0.60
1182,1.86
1183,2.72
1184,1.56
1185,-1.22
1186,-3.28
1187,-2.77
1188,-0.56
1189,0.82
1190,0.02
1191,-1.72
1192,-2.38
1193,-1.77
1194,-0.87
1195,-0.84
1196,-1.83
1197,-3.65
1198,-4.74
1199,-2.73
1200,0.96
