1,75.15
2,100.00
3,100.00
4,98.45
5,95.92
6,100.00
7,100.00
8,97.01
9,99.44
10,100.00
11,90.54
12,40.41
13,-20.39
14,-45.22
15,-14.89
16,44.14
17,90.72
18,100.00
19,100.00
20,97.03
21,99.30
22,100.00
23,100.00
24,94.77
25,97.68
26,100.00
27,100.00
28,71.50
29,0.61
30,-65.91
31,-98.46
32,-100.00
33,-98.67
34,-100.00
35,-100.00
36,-94.48
37,-74.31
38,-52.33
39,-38.98
40,-39.44
41,-48.68
42,-59.32
43,-64.87
44,-63.56
45,-57.01
46,-47.80
47,-39.24
48,-33.10
49,-30.65
50,-30.82
51,-32.37
52,-33.64
53,-33.91
54,-32.95
55,-31.19
56,-29.02
57,-27.17
58,-25.71
59,-24.83
60,-24.16
61,-23.63
62,-23.09
63,-22.63
64,-22.25
65,-22.04
66,-21.88
67,-21.80
68,-21.68
69,-21.58
70,-21.45
71,-21.35
72,-21.26
73,-21.21
74,-21.19
75,-21.22
76,-21.21
77,-21.16
78,-21.03
79,-20.86
80,-20.61
81,-20.33
82,-20.03
83,-19.75
84,-19.49
85,-19.27
86,-19.06
87,-18.84
88,-18.59
89,-18.30
90,-17.94
91,-17.60
92,-17.24
93,-16.93
94,-16.65
95,-16.44
96,-16.26
97,-16.12
98,-15.95
99,-15.76
100,-15.49
101,-15.19
102,-14.80
103,-14.37
104,-13.84
105,-13.29
106,-12.65
107,-12.00
108,-11.28
109,-10.61
110,-9.95
111,-9.38
112,-8.84
113,-8.35
114,-7.83
115,-7.32
116,-6.76
117,-6.19
118,-5.58
119,-5.00
120,-4.47
121,-4.07
122,-3.80
123,-3.70
124,-3.69
125,-3.78
126,-3.89
127,-4.01
128,-4.12
129,-4.23
130,-4.34
131,-4.46
132,-4.58
133,-4.73
134,-4.93
135,-5.19
136,-5.53
137,-5.88
138,-6.26
139,-6.63
140,-7.01
141,-7.36
142,-7.67
143,-7.91
144,-8.10
145,-8.26
146,-8.41
147,-8.55
148,-8.73
149,-8.93
150,-9.17
151,-9.39
152,-9.59
153,-9.74
154,-9.83
155,-9.85
156,-9.85
157,-9.81
158,-9.77
159,-9.74
160,-9.75
161,-9.81
162,-9.90
163,-10.03
164,-10.16
165,-10.28
166,-10.36
167,-10.38
168,-10.32
169,-10.17
170,-9.93
171,-9.63
172,-9.30
173,-9.01
174,-8.75
175,-8.54
176,-8.37
177,-8.24
178,-8.13
179,-8.03
180,-7.91
181,-7.77
182,-7.59
183,-7.43
184,-7.28
185,-7.15
186,-7.01
187,-6.88
188,-6.69
189,-6.48
190,-6.19
191,-5.88
192,-5.55
193,-5.26
194,-4.98
195,-4.74
196,-4.48
197,-4.19
198,-3.83
199,-3.44
200,-2.99
201,-2.56
202,-2.16
203,-1.86
204,-1.69
205,-1.66
206,-1.69
207,-1.75
208,-1.76
209,-1.71
210,-1.54
211,-1.30
212,-0.95
213,-0.57
214,-0.16
215,0.22
216,0.60
217,0.95
218,1.31
219,1.68
220,2.08
221,2.49
222,2.92
223,3.32
224,3.70
225,4.01
226,4.24
227,4.38
228,4.41
229,4.36
230,4.26
231,4.12
232,3.97
233,3.82
234,3.69
235,3.56
236,3.39
237,3.19
238,2.93
239,2.63
240,2.29
241,1.93
242,1.59
243,1.31
244,1.07
245,0.89
246,0.78
247,0.70
248,0.65
249,0.61
250,0.58
251,0.57
252,0.60
253,0.68
254,0.82
255,1.03
256,1.28
257,1.53
258,1.73
259,1.86
260,1.93
261,1.95
262,1.91
263,1.83
264,1.74
265,1.68
266,1.66
267,1.68
268,1.70
269,1.72
270,1.72
271,1.69
272,1.61
273,1.52
274,1.40
275,1.30
276,1.19
277,1.08
278,0.96
279,0.84
280,0.70
281,0.56
282,0.40
283,0.24
284,0.03
285,-0.23
286,-0.55
287,-0.88
288,-1.21
289,-1.52
290,-1.80
291,-2.03
292,-2.21
293,-2.33
294,-2.43
295,-2.53
296,-2.67
297,-2.85
298,-3.05
299,-3.24
300,-3.37
301,-3.41
302,-3.30
303,-3.06
304,-2.71
305,-2.31
306,-1.87
307,-1.44
308,-1.02
309,-0.64
310,-0.27
311,0.11
312,0.55
313,1.04
314,1.58
315,2.08
316,2.54
317,2.88
318,3.10
319,3.16
320,3.12
321,2.99
322,2.85
323,2.72
324,2.64
325,2.62
326,2.63
327,2.64
328,2.58
329,2.43
330,2.19
331,1.92
332,1.64
333,1.41
334,1.21
335,1.10
336,1.06
337,1.10
338,1.16
339,1.23
340,1.26
341,1.26
342,1.18
343,1.04
344,0.79
345,0.49
346,0.11
347,-0.30
348,-0.80
349,-1.35
350,-1.97
351,-2.58
352,-3.19
353,-3.74
354,-4.22
355,-4.59
356,-4.87
357,-5.05
358,-5.19
359,-5.31
360,-5.42
361,-5.50
362,-5.57
363,-5.60
364,-5.60
365,-5.54
366,-5.41
367,-5.23
368,-5.02
369,-4.79
370,-4.55
371,-4.32
372,-4.09
373,-3.87
374,-3.62
375,-3.33
376,-2.98
377,-2.62
378,-2.21
379,-1.80
380,-1.35
381,-0.93
382,-0.50
383,-0.11
384,0.28
385,0.63
386,0.97
387,1.28
388,1.58
389,1.84
390,2.08
391,2.24
392,2.39
393,2.52
394,2.67
395,2.82
396,3.01
397,3.22
398,3.46
399,3.70
400,3.90
401,4.05
402,4.17
403,4.24
404,4.25
405,4.19
406,4.09
407,3.98
408,3.86
409,3.74
410,3.58
411,3.42
412,3.24
413,3.08
414,2.93
415,2.81
416,2.72
417,2.68
418,2.69
419,2.75
420,2.84
421,2.94
422,3.00
423,3.04
424,3.02
425,2.96
426,2.86
427,2.76
428,2.65
429,2.57
430,2.50
431,2.44
432,2.35
433,2.22
434,2.05
435,1.86
436,1.63
437,1.37
438,1.06
439,0.73
440,0.40
441,0.11
442,-0.16
443,-0.38
444,-0.57
445,-0.69
446,-0.78
447,-0.83
448,-0.92
449,-1.03
450,-1.25
451,-1.54
452,-1.94
453,-2.37
454,-2.80
455,-3.17
456,-3.50
457,-3.74
458,-3.92
459,-4.03
460,-4.15
461,-4.28
462,-4.48
463,-4.71
464,-5.02
465,-5.33
466,-5.61
467,-5.81
468,-5.91
469,-5.92
470,-5.85
471,-5.70
472,-5.48
473,-5.24
474,-5.01
475,-4.80
476,-4.61
477,-4.42
478,-4.22
479,-4.02
480,-3.78
481,-3.54
482,-3.32
483,-3.14
484,-2.98
485,-2.82
486,-2.66
487,-2.50
488,-2.30
489,-2.06
490,-1.82
491,-1.64
492,-1.54
493,-1.58
494,-1.73
495,-1.99
496,-2.29
497,-2.59
498,-2.82
499,-2.96
500,-2.98
501,-2.92
502,-2.80
503,-2.71
504,-2.67
505,-2.70
506,-2.73
507,-2.70
508,-2.58
509,-2.39
510,-2.14
511,-1.87
512,-1.58
513,-1.31
514,-1.10
515,-1.00
516,-0.98
517,-0.99
518,-0.97
519,-0.90
520,-0.76
521,-0.57
522,-0.31
523,-0.04
524,0.26
525,0.52
526,0.78
527,1.00
528,1.25
529,1.50
530,1.79
531,2.09
532,2.42
533,2.73
534,3.05
535,3.34
536,3.62
537,3.86
538,4.05
539,4.17
540,4.22
541,4.19
542,4.06
543,3.81
544,3.44
545,2.99
546,2.48
547,1.94
548,1.39
549,0.87
550,0.38
551,-0.04
552,-0.43
553,-0.78
554,-1.13
555,-1.45
556,-1.76
557,-2.01
558,-2.21
559,-2.33
560,-2.37
561,-2.35
562,-2.30
563,-2.24
564,-2.17
565,-2.08
566,-1.98
567,-1.86
568,-1.71
569,-1.53
570,-1.34
571,-1.16
572,-1.00
573,-0.93
574,-0.95
575,-1.07
576,-1.21
577,-1.34
578,-1.39
579,-1.34
580,-1.14
581,-0.80
582,-0.32
583,0.22
584,0.78
585,1.28
586,1.72
587,2.07
588,2.37
589,2.61
590,2.87
591,3.17
592,3.57
593,4.03
594,4.53
595,5.01
596,5.46
597,5.80
598,6.06
599,6.21
600,6.28
601,6.30
602,6.30
603,6.30
604,6.34
605,6.38
606,6.40
607,6.38
608,6.30
609,6.18
610,6.00
611,5.76
612,5.48
613,5.17
614,4.80
615,4.39
616,3.93
617,3.49
618,3.06
619,2.69
620,2.37
621,2.16
622,2.01
623,1.92
624,1.80
625,1.66
626,1.42
627,1.13
628,0.76
629,0.38
630,-0.02
631,-0.39
632,-0.75
633,-1.08
634,-1.43
635,-1.79
636,-2.16
637,-2.51
638,-2.85
639,-3.10
640,-3.26
641,-3.31
642,-3.29
643,-3.21
644,-3.12
645,-3.02
646,-2.95
647,-2.89
648,-2.83
649,-2.73
650,-2.56
651,-2.33
652,-2.07
653,-1.82
654,-1.59
655,-1.41
656,-1.29
657,-1.25
658,-1.27
659,-1.34
660,-1.40
661,-1.44
662,-1.42
663,-1.36
664,-1.26
665,-1.11
666,-0.91
667,-0.68
668,-0.39
669,-0.09
670,0.26
671,0.61
672,0.98
673,1.34
674,1.68
675,1.97
676,2.23
677,2.43
678,2.63
679,2.80
680,2.97
681,3.13
682,3.30
683,3.48
684,3.66
685,3.80
686,3.92
687,4.03
688,4.18
689,4.33
690,4.52
691,4.70
692,4.94
693,5.22
694,5.55
695,5.88
696,6.26
697,6.64
698,7.05
699,7.43
700,7.79
701,8.13
702,8.48
703,8.82
704,9.14
705,9.39
706,9.59
707,9.72
708,9.79
709,9.79
710,9.71
711,9.56
712,9.35
713,9.09
714,8.81
715,8.53
716,8.26
717,8.02
718,7.81
719,7.65
720,7.53
721,7.45
722,7.35
723,7.24
724,7.09
725,6.91
726,6.70
727,6.50
728,6.29
729,6.12
730,5.96
731,5.83
732,5.72
733,5.65
734,5.60
735,5.60
736,5.64
737,5.74
738,5.87
739,6.03
740,6.15
741,6.23
742,6.26
743,6.26
744,6.21
745,6.12
746,6.03
747,6.00
748,6.02
749,6.07
750,6.13
751,6.18
752,6.18
753,6.13
754,5.99
755,5.78
756,5.51
757,5.22
758,4.89
759,4.56
760,4.25
761,4.01
762,3.80
763,3.64
764,3.51
765,3.40
766,3.25
767,3.06
768,2.80
769,2.49
770,2.14
771,1.79
772,1.48
773,1.25
774,1.07
775,0.96
776,0.88
777,0.83
778,0.83
779,0.85
780,0.91
781,1.00
782,1.14
783,1.33
784,1.58
785,1.86
786,2.18
787,2.47
788,2.74
789,2.96
790,3.16
791,3.32
792,3.51
793,3.70
794,3.92
795,4.17
796,4.45
797,4.71
798,4.97
799,5.19
800,5.39
801,5.53
802,5.65
803,5.75
804,5.85
805,5.96
806,6.06
807,6.12
808,6.12
809,6.05
810,5.89
811,5.67
812,5.39
813,5.11
814,4.84
815,4.65
816,4.53
817,4.50
818,4.48
819,4.47
820,4.39
821,4.25
822,3.99
823,3.68
824,3.28
825,2.87
826,2.41
827,1.96
828,1.48
829,1.00
830,0.46
831,-0.08
832,-0.63
833,-1.14
834,-1.60
835,-1.95
836,-2.20
837,-2.32
838,-2.39
839,-2.44
840,-2.52
841,-2.62
842,-2.75
843,-2.89
844,-3.01
845,-3.11
846,-3.14
847,-3.10
848,-2.96
849,-2.73
850,-2.45
851,-2.15
852,-1.85
853,-1.56
854,-1.25
855,-0.94
856,-0.62
857,-0.32
858,0.01
859,0.31
860,0.63
861,0.95
862,1.32
863,1.71
864,2.15
865,2.59
866,3.05
867,3.49
868,3.94
869,4.32
870,4.64
871,4.85
872,5.02
873,5.14
874,5.27
875,5.36
876,5.45
877,5.54
878,5.67
879,5.83
880,6.01
881,6.17
882,6.32
883,6.42
884,6.46
885,6.44
886,6.34
887,6.21
888,6.04
889,5.84
890,5.63
891,5.44
892,5.28
893,5.16
894,5.07
895,5.03
896,5.03
897,5.10
898,5.20
899,5.33
900,5.44
901,5.53
902,5.58
903,5.61
904,5.57
905,5.48
906,5.34
907,5.16
908,4.94
909,4.71
910,4.45
911,4.20
912,3.94
913,3.70
914,3.44
915,3.18
916,2.87
917,2.57
918,2.25
919,1.96
920,1.65
921,1.36
922,1.09
923,0.94
924,0.87
925,0.89
926,0.95
927,1.03
928,1.04
929,0.98
930,0.76
931,0.43
932,-0.02
933,-0.53
934,-1.09
935,-1.62
936,-2.11
937,-2.51
938,-2.85
939,-3.14
940,-3.41
941,-3.64
942,-3.87
943,-4.06
944,-4.22
945,-4.33
946,-4.43
947,-4.48
948,-4.51
949,-4.53
950,-4.54
951,-4.54
952,-4.51
953,-4.43
954,-4.32
955,-4.17
956,-3.98
957,-3.76
958,-3.50
959,-3.24
960,-2.96
961,-2.69
962,-2.43
963,-2.20
964,-1.98
965,-1.79
966,-1.60
967,-1.46
968,-1.35
969,-1.32
970,-1.31
971,-1.33
972,-1.36
973,-1.40
974,-1.46
975,-1.52
976,-1.58
977,-1.64
978,-1.69
979,-1.69
980,-1.63
981,-1.50
982,-1.31
983,-1.11
984,-0.94
985,-0.84
986,-0.80
987,-0.84
988,-0.89
989,-0.95
990,-0.95
991,-0.87
992,-0.65
993,-0.34
994,0.03
995,0.39
996,0.71
997,0.93
998,1.06
999,1.10
1000,1.10
1001,1.08
1002,1.11
1003,1.18
1004,1.33
1005,1.54
1006,1.79
1007,2.05
1008,2.35
1009,2.66
1010,2.99
1011,3.31
1012,3.64
1013,3.95
1014,4.27
1015,4.58
1016,4.88
1017,5.14
1018,5.34
1019,5.49
1020,5.58
1021,5.60
1022,5.51
1023,5.32
1024,5.01
1025,4.63
1026,4.17
1027,3.70
1028,3.20
1029,2.73
1030,2.28
1031,1.90
1032,1.54
1033,1.23
1034,0.91
1035,0.61
1036,0.33
1037,0.10
1038,-0.09
1039,-0.23
1040,-0.32
1041,-0.36
1042,-0.36
1043,-0.34
1044,-0.34
1045,-0.33
1046,-0.33
1047,-0.32
1048,-0.29
1049,-0.23
1050,-0.12
1051,0.04
1052,0.24
1053,0.42
1054,0.56
1055,0.63
1056,0.65
1057,0.61
1058,0.57
1059,0.56
1060,0.65
1061,0.85
1062,1.17
1063,1.54
1064,1.96
1065,2.34
1066,2.69
1067,2.96
1068,3.22
1069,3.47
1070,3.78
1071,4.17
1072,4.67
1073,5.23
1074,5.83
1075,6.38
1076,6.89
1077,7.30
1078,7.60
1079,7.78
1080,7.86
1081,7.85
1082,7.78
1083,7.66
1084,7.53
1085,7.39
1086,7.25
1087,7.12
1088,6.99
1089,6.89
1090,6.79
1091,6.68
1092,6.52
1093,6.33
1094,6.09
1095,5.83
1096,5.53
1097,5.24
1098,4.93
1099,4.63
1100,4.30
1101,3.98
1102,3.62
1103,3.24
1104,2.81
1105,2.37
1106,1.90
1107,1.48
1108,1.09
1109,0.78
1110,0.52
1111,0.31
1112,0.10
1113,-0.06
1114,-0.24
1115,-0.43
1116,-0.66
1117,-0.90
1118,-1.13
1119,-1.30
1120,-1.44
1121,-1.53
1122,-1.58
1123,-1.59
1124,-1.57
1125,-1.52
1126,-1.46
1127,-1.38
1128,-1.30
1129,-1.19
1130,-1.07
1131,-0.92
1132,-0.75
1133,-0.60
1134,-0.49
1135,-0.44
1136,-0.46
1137,-0.56
1138,-0.72
1139,-0.92
1140,-1.10
1141,-1.24
1142,-1.33
1143,-1.37
1144,-1.36
1145,-1.30
1146,-1.21
1147,-1.12
1148,-1.04
1149,-0.98
1150,-0.94
1151,-0.90
1152,-0.83
1153,-0.72
1154,-0.52
1155,-0.28
1156,0.04
1157,0.39
1158,0.81
1159,1.22
1160,1.61
1161,1.89
1162,2.07
1163,2.13
1164,2.13
1165,2.06
1166,1.97
1167,1.89
1168,1.87
1169,1.90
1170,2.03
1171,2.22
1172,2.50
1173,2.82
1174,3.17
1175,3.50
1176,3.81
1177,4.07
1178,4.30
1179,4.46
1180,4.57
1181,4.68
1182,4.79
1183,4.92
1184,5.08
1185,5.24
1186,5.40
1187,5.53
1188,5.58
1189,5.55
1190,5.43
1191,5.23
1192,5.00
1193,4.76
1194,4.52
1195,4.32
1196,4.14
1197,4.00
1198,3.84
1199,3.63
1200,3.37
1201,3.09
1202,2.80
1203,2.56
1204,2.38
1205,2.30
1206,2.30
1207,2.39
1208,2.47
1209,2.55
1210,2.56
1211,2.51
1212,2.39
1213,2.23
1214,2.06
1215,1.93
1216,1.82
1217,1.73
1218,1.66
1219,1.60
1220,1.54
1221,1.50
1222,1.47
1223,1.49
1224,1.55
1225,1.68
1226,1.84
1227,2.01
1228,2.14
1229,2.21
1230,2.17
1231,2.04
1232,1.82
1233,1.58
1234,1.33
1235,1.13
1236,0.97
1237,0.89
1238,0.84
1239,0.82
1240,0.78
1241,0.71
1242,0.59
1243,0.42
1244,0.16
1245,-0.17
1246,-0.57
1247,-0.99
1248,-1.45
1249,-1.88
1250,-2.28
1251,-2.61
1252,-2.86
1253,-3.04
1254,-3.16
1255,-3.23
1256,-3.27
1257,-3.28
1258,-3.27
1259,-3.24
1260,-3.20
1261,-3.15
1262,-3.04
1263,-2.88
1264,-2.66
1265,-2.43
1266,-2.15
1267,-1.86
1268,-1.54
1269,-1.21
1270,-0.81
1271,-0.40
1272,0.03
1273,0.45
1274,0.87
1275,1.26
1276,1.64
1277,1.95
1278,2.21
1279,2.41
1280,2.58
1281,2.66
1282,2.68
1283,2.62
1284,2.50
1285,2.33
1286,2.12
1287,1.88
1288,1.64
1289,1.45
1290,1.30
1291,1.22
1292,1.17
1293,1.16
1294,1.16
1295,1.17
1296,1.15
1297,1.11
1298,1.02
1299,0.88
1300,0.66
1301,0.42
1302,0.12
1303,-0.20
1304,-0.58
1305,-0.99
1306,-1.45
1307,-1.87
1308,-2.29
1309,-2.69
1310,-3.10
1311,-3.50
1312,-3.89
1313,-4.24
1314,-4.58
1315,-4.87
1316,-5.14
1317,-5.35
1318,-5.48
1319,-5.53
1320,-5.49
1321,-5.39
1322,-5.21
1323,-4.96
1324,-4.63
1325,-4.26
1326,-3.85
1327,-3.41
1328,-2.91
1329,-2.41
1330,-1.90
1331,-1.47
1332,-1.05
1333,-0.70
1334,-0.33
1335,0.01
1336,0.42
1337,0.88
1338,1.46
1339,2.11
1340,2.83
1341,3.52
1342,4.18
1343,4.72
1344,5.20
1345,5.56
1346,5.90
1347,6.19
1348,6.56
1349,6.95
1350,7.45
1351,7.94
1352,8.49
1353,9.01
1354,9.55
1355,10.03
1356,10.49
1357,10.88
1358,11.25
1359,11.56
1360,11.89
1361,12.19
1362,12.49
1363,12.76
1364,13.02
1365,13.23
1366,13.41
1367,13.50
1368,13.50
1369,13.39
1370,13.18
1371,12.90
1372,12.57
1373,12.24
1374,11.92
1375,11.66
1376,11.45
1377,11.32
1378,11.23
1379,11.17
1380,11.07
1381,10.95
1382,10.75
1383,10.52
1384,10.25
1385,9.98
1386,9.70
1387,9.46
1388,9.24
1389,9.05
1390,8.84
1391,8.62
1392,8.34
1393,8.07
1394,7.74
1395,7.39
1396,7.00
1397,6.64
1398,6.26
1399,5.91
1400,5.56
1401,5.26
1402,4.98
1403,4.79
1404,4.63
1405,4.53
1406,4.45
1407,4.39
1408,4.28
1409,4.13
1410,3.87
1411,3.54
1412,3.12
1413,2.67
1414,2.20
1415,1.80
1416,1.44
1417,1.16
1418,0.91
1419,0.68
1420,0.44
1421,0.20
1422,-0.11
1423,-0.45
1424,-0.81
1425,-1.16
1426,-1.47
1427,-1.71
1428,-1.86
1429,-1.90
1430,-1.85
1431,-1.72
1432,-1.56
1433,-1.36
1434,-1.15
1435,-0.93
1436,-0.70
1437,-0.48
1438,-0.25
1439,-0.03
1440,0.19
1441,0.40
1442,0.62
1443,0.85
1444,1.11
1445,1.35
1446,1.56
1447,1.74
1448,1.89
1449,1.99
1450,2.04
1451,2.02
1452,1.96
1453,1.86
1454,1.77
1455,1.66
1456,1.55
1457,1.46
1458,1.42
1459,1.45
1460,1.52
1461,1.63
1462,1.76
1463,1.91
1464,2.06
1465,2.16
1466,2.22
1467,2.25
1468,2.26
1469,2.25
1470,2.26
1471,2.30
1472,2.40
1473,2.53
1474,2.70
1475,2.86
1476,3.02
1477,3.15
1478,3.26
1479,3.35
1480,3.42
1481,3.47
1482,3.55
1483,3.64
1484,3.80
1485,3.99
1486,4.22
1487,4.47
1488,4.77
1489,5.09
1490,5.43
1491,5.76
1492,6.09
1493,6.36
1494,6.58
1495,6.73
1496,6.84
1497,6.91
1498,6.93
1499,6.92
1500,6.89
1501,6.85
1502,6.77
1503,6.65
1504,6.51
1505,6.36
1506,6.19
1507,6.00
1508,5.78
1509,5.57
1510,5.31
1511,5.04
1512,4.70
1513,4.32
1514,3.87
1515,3.39
1516,2.90
1517,2.46
1518,2.06
1519,1.76
1520,1.52
1521,1.34
1522,1.20
1523,1.12
1524,1.08
1525,1.09
1526,1.09
1527,1.09
1528,1.11
1529,1.15
1530,1.21
1531,1.27
1532,1.35
1533,1.47
1534,1.62
1535,1.76
1536,1.91
1537,2.04
1538,2.17
1539,2.27
1540,2.34
1541,2.39
1542,2.49
1543,2.64
1544,2.89
1545,3.21
1546,3.64
1547,4.13
1548,4.67
1549,5.18
1550,5.69
1551,6.11
1552,6.48
1553,6.78
1554,7.08
1555,7.38
1556,7.73
1557,8.11
1558,8.57
1559,9.04
1560,9.51
1561,9.90
1562,10.19
1563,10.35
1564,10.39
1565,10.31
1566,10.16
1567,9.99
1568,9.85
1569,9.78
1570,9.75
1571,9.75
1572,9.70
1573,9.61
1574,9.42
1575,9.12
1576,8.69
1577,8.19
1578,7.64
1579,7.14
1580,6.67
1581,6.28
1582,5.94
1583,5.69
1584,5.43
1585,5.18
1586,4.86
1587,4.50
1588,4.10
1589,3.69
1590,3.26
1591,2.83
1592,2.40
1593,2.00
1594,1.63
1595,1.32
1596,1.06
1597,0.87
1598,0.75
1599,0.71
1600,0.71
1601,0.75
1602,0.78
1603,0.81
1604,0.77
1605,0.67
1606,0.50
1607,0.32
1608,0.16
1609,0.07
1610,0.06
1611,0.15
1612,0.34
1613,0.56
1614,0.78
1615,0.93
1616,1.00
1617,1.00
1618,0.96
1619,0.90
1620,0.89
1621,0.96
1622,1.14
1623,1.41
1624,1.74
1625,2.05
1626,2.33
1627,2.54
1628,2.73
1629,2.88
1630,3.07
1631,3.27
1632,3.51
1633,3.76
1634,4.04
1635,4.32
1636,4.60
1637,4.84
1638,5.09
1639,5.34
1640,5.61
1641,5.87
1642,6.13
1643,6.32
1644,6.45
1645,6.49
1646,6.45
1647,6.37
1648,6.32
1649,6.34
1650,6.47
1651,6.69
1652,7.02
1653,7.42
1654,7.85
1655,8.26
1656,8.63
1657,8.95
1658,9.24
1659,9.47
1660,9.68
1661,9.89
1662,10.11
1663,10.31
1664,10.51
1665,10.65
1666,10.76
1667,10.82
1668,10.83
1669,10.80
1670,10.73
1671,10.64
1672,10.55
1673,10.49
1674,10.47
1675,10.50
1676,10.55
1677,10.59
1678,10.58
1679,10.51
1680,10.35
1681,10.11
1682,9.80
1683,9.49
1684,9.21
1685,9.00
1686,8.85
1687,8.77
1688,8.72
1689,8.68
1690,8.61
1691,8.50
1692,8.40
1693,8.33
1694,8.33
1695,8.39
1696,8.52
1697,8.70
1698,8.91
1699,9.08
1700,9.15
1701,9.11
1702,8.96
1703,8.76
1704,8.54
1705,8.35
1706,8.21
1707,8.14
1708,8.11
1709,8.12
1710,8.11
1711,8.09
1712,8.02
1713,7.92
1714,7.77
1715,7.59
1716,7.41
1717,7.24
1718,7.09
1719,6.95
1720,6.80
1721,6.69
1722,6.58
1723,6.50
1724,6.42
1725,6.34
1726,6.20
1727,6.03
1728,5.80
1729,5.50
1730,5.12
1731,4.67
1732,4.18
1733,3.72
1734,3.31
1735,2.99
1736,2.80
1737,2.74
1738,2.80
1739,2.98
1740,3.20
1741,3.46
1742,3.72
1743,3.94
1744,4.13
1745,4.27
1746,4.41
1747,4.57
1748,4.78
1749,5.04
1750,5.38
1751,5.76
1752,6.19
1753,6.59
1754,6.96
1755,7.27
1756,7.53
1757,7.76
1758,8.00
1759,8.22
1760,8.43
1761,8.55
1762,8.62
1763,8.62
1764,8.57
1765,8.47
1766,8.36
1767,8.29
1768,8.28
1769,8.34
1770,8.44
1771,8.55
1772,8.63
1773,8.63
1774,8.53
1775,8.34
1776,8.07
1777,7.79
1778,7.51
1779,7.29
1780,7.12
1781,7.02
1782,6.90
1783,6.75
1784,6.49
1785,6.16
1786,5.72
1787,5.27
1788,4.78
1789,4.31
1790,3.84
1791,3.41
1792,3.02
1793,2.69
1794,2.37
1795,2.09
1796,1.82
1797,1.57
1798,1.33
1799,1.10
1800,0.84
1801,0.60
1802,0.35
1803,0.14
1804,-0.04
1805,-0.15
1806,-0.20
1807,-0.17
1808,-0.09
1809,0.05
1810,0.24
1811,0.46
1812,0.70
1813,0.93
1814,1.21
1815,1.51
1816,1.86
1817,2.20
1818,2.56
1819,2.92
1820,3.30
1821,3.64
1822,3.96
1823,4.20
1824,4.40
1825,4.53
1826,4.69
1827,4.87
1828,5.14
1829,5.46
1830,5.85
1831,6.28
1832,6.76
1833,7.21
1834,7.63
1835,7.94
1836,8.16
1837,8.27
1838,8.31
1839,8.29
1840,8.28
1841,8.30
1842,8.37
1843,8.51
1844,8.71
1845,8.97
1846,9.22
1847,9.39
1848,9.44
1849,9.33
1850,9.09
1851,8.74
1852,8.32
1853,7.92
1854,7.58
1855,7.37
1856,7.29
1857,7.35
1858,7.48
1859,7.67
1860,7.84
1861,7.94
1862,7.91
1863,7.78
1864,7.55
1865,7.28
1866,7.01
1867,6.77
1868,6.55
1869,6.35
1870,6.14
1871,5.94
1872,5.73
1873,5.54
1874,5.33
1875,5.15
1876,4.97
1877,4.82
1878,4.68
1879,4.51
1880,4.28
1881,4.02
1882,3.71
1883,3.40
1884,3.09
1885,2.84
1886,2.66
1887,2.58
1888,2.55
1889,2.56
1890,2.55
1891,2.50
1892,2.35
1893,2.14
1894,1.83
1895,1.48
1896,1.07
1897,0.66
1898,0.24
1899,-0.13
1900,-0.46
1901,-0.72
1902,-0.95
1903,-1.12
1904,-1.27
1905,-1.40
1906,-1.54
1907,-1.65
1908,-1.75
1909,-1.83
1910,-1.88
1911,-1.87
1912,-1.79
1913,-1.65
1914,-1.46
1915,-1.25
1916,-1.01
1917,-0.76
1918,-0.50
1919,-0.24
1920,0.00
1921,0.21
1922,0.36
1923,0.43
1924,0.46
1925,0.44
1926,0.38
1927,0.30
1928,0.26
1929,0.28
1930,0.38
1931,0.51
1932,0.68
1933,0.81
1934,0.87
1935,0.83
1936,0.71
1937,0.55
1938,0.38
1939,0.24
1940,0.21
1941,0.29
1942,0.48
1943,0.71
1944,0.95
1945,1.17
1946,1.36
1947,1.51
1948,1.63
1949,1.71
1950,1.78
1951,1.86
1952,1.95
1953,2.05
1954,2.15
1955,2.24
1956,2.35
1957,2.49
1958,2.69
1959,2.89
1960,3.11
1961,3.31
1962,3.52
1963,3.69
1964,3.85
1965,3.99
1966,4.16
1967,4.38
1968,4.69
1969,5.07
1970,5.53
1971,6.01
1972,6.48
1973,6.90
1974,7.24
1975,7.44
1976,7.53
1977,7.54
1978,7.53
1979,7.51
1980,7.48
1981,7.44
1982,7.38
1983,7.29
1984,7.15
1985,6.95
1986,6.67
1987,6.37
1988,6.07
1989,5.80
1990,5.56
1991,5.36
1992,5.17
1993,5.00
1994,4.79
1995,4.53
1996,4.20
1997,3.84
1998,3.45
1999,3.09
2000,2.74
2001,2.46
2002,2.24
2003,2.11
2004,2.06
2005,2.09
2006,2.17
2007,2.27
2008,2.36
2009,2.44
2010,2.55
2011,2.68
2012,2.85
2013,3.04
2014,3.26
2015,3.49
2016,3.69
2017,3.82
2018,3.88
2019,3.84
2020,3.76
2021,3.67
2022,3.65
2023,3.68
2024,3.83
2025,4.06
2026,4.39
2027,4.76
2028,5.16
2029,5.54
2030,5.93
2031,6.32
2032,6.77
2033,7.22
2034,7.71
2035,8.21
2036,8.76
2037,9.29
2038,9.80
2039,10.24
2040,10.64
2041,10.96
2042,11.22
2043,11.36
2044,11.42
2045,11.39
2046,11.28
2047,11.10
2048,10.86
2049,10.60
2050,10.35
2051,10.13
2052,9.91
2053,9.70
2054,9.46
2055,9.22
2056,8.91
2057,8.58
2058,8.19
2059,7.78
2060,7.32
2061,6.85
2062,6.35
2063,5.88
2064,5.41
2065,5.00
2066,4.65
2067,4.40
2068,4.22
2069,4.12
2070,4.02
2071,3.93
2072,3.77
2073,3.54
2074,3.21
2075,2.83
2076,2.41
2077,2.02
2078,1.67
2079,1.41
2080,1.22
2081,1.12
2082,1.07
2083,1.03
2084,0.98
2085,0.94
2086,0.90
2087,0.90
2088,0.95
2089,1.04
2090,1.16
2091,1.30
2092,1.44
2093,1.56
2094,1.63
2095,1.65
2096,1.61
2097,1.53
2098,1.43
2099,1.34
2100,1.28
2101,1.26
2102,1.31
2103,1.41
2104,1.57
2105,1.73
2106,1.89
2107,2.02
2108,2.14
2109,2.24
2110,2.33
2111,2.38
2112,2.43
2113,2.48
2114,2.58
2115,2.74
2116,2.97
2117,3.25
2118,3.59
2119,3.95
2120,4.32
2121,4.67
2122,4.95
2123,5.15
2124,5.25
2125,5.26
2126,5.21
2127,5.11
2128,5.01
2129,4.93
2130,4.91
2131,4.93
2132,5.00
2133,5.11
2134,5.26
2135,5.44
2136,5.68
2137,5.93
2138,6.21
2139,6.49
2140,6.77
2141,7.03
2142,7.24
2143,7.42
2144,7.58
2145,7.72
2146,7.87
2147,8.00
2148,8.12
2149,8.21
2150,8.28
2151,8.29
2152,8.22
2153,8.06
2154,7.82
2155,7.52
2156,7.17
2157,6.79
2158,6.42
2159,6.09
2160,5.81
2161,5.60
2162,5.40
2163,5.23
2164,5.05
2165,4.88
2166,4.69
2167,4.51
2168,4.35
2169,4.21
2170,4.11
2171,4.06
2172,4.03
2173,4.03
2174,4.04
2175,4.06
2176,4.07
2177,4.07
2178,4.06
2179,4.05
2180,4.04
2181,4.04
2182,4.04
2183,4.06
2184,4.09
2185,4.14
2186,4.18
2187,4.21
2188,4.17
2189,4.09
2190,3.93
2191,3.72
2192,3.47
2193,3.22
2194,2.97
2195,2.75
2196,2.55
2197,2.41
2198,2.29
2199,2.22
2200,2.12
2201,2.04
2202,1.94
2203,1.88
2204,1.81
2205,1.76
2206,1.68
2207,1.56
2208,1.34
2209,1.02
2210,0.56
2211,0.00
2212,-0.62
2213,-1.20
2214,-1.69
2215,-2.03
2216,-2.24
2217,-2.33
2218,-2.32
2219,-2.24
2220,-2.13
2221,-2.01
2222,-1.88
2223,-1.72
2224,-1.50
2225,-1.25
2226,-0.96
2227,-0.65
2228,-0.29
2229,0.05
2230,0.39
2231,0.68
2232,0.99
2233,1.32
2234,1.72
2235,2.15
2236,2.62
2237,3.10
2238,3.56
2239,3.95
2240,4.23
2241,4.37
2242,4.41
2243,4.37
2244,4.32
2245,4.28
2246,4.28
2247,4.29
2248,4.34
2249,4.39
2250,4.40
2251,4.36
2252,4.26
2253,4.13
2254,3.96
2255,3.76
2256,3.56
2257,3.40
2258,3.28
2259,3.21
2260,3.08
2261,2.90
2262,2.63
2263,2.32
2264,1.93
2265,1.50
2266,0.99
2267,0.49
2268,0.00
2269,-0.44
2270,-0.89
2271,-1.32
2272,-1.79
2273,-2.22
2274,-2.66
2275,-3.06
2276,-3.44
2277,-3.74
2278,-3.99
2279,-4.17
2280,-4.30
2281,-4.43
2282,-4.59
2283,-4.75
2284,-4.88
2285,-4.93
2286,-4.88
2287,-4.71
2288,-4.43
2289,-4.06
2290,-3.63
2291,-3.18
2292,-2.73
2293,-2.34
2294,-1.98
2295,-1.68
2296,-1.35
2297,-1.00
2298,-0.55
2299,-0.07
2300,0.49
2301,1.04
2302,1.61
2303,2.12
2304,2.63
2305,3.10
2306,3.60
2307,4.08
2308,4.61
2309,5.14
2310,5.75
2311,6.34
2312,6.97
2313,7.55
2314,8.15
2315,8.67
2316,9.17
2317,9.60
2318,10.04
2319,10.44
2320,10.86
2321,11.25
2322,11.66
2323,12.05
2324,12.40
2325,12.65
2326,12.81
2327,12.85
2328,12.84
2329,12.77
2330,12.69
2331,12.61
2332,12.57
2333,12.58
2334,12.66
2335,12.79
2336,12.97
2337,13.16
2338,13.37
2339,13.56
2340,13.75
2341,13.94
2342,14.14
2343,14.36
2344,14.57
2345,14.77
2346,14.92
2347,15.01
2348,15.03
2349,14.97
2350,14.82
2351,14.60
2352,14.32
2353,14.01
2354,13.64
2355,13.27
2356,12.87
2357,12.50
2358,12.14
2359,11.82
2360,11.51
2361,11.24
2362,10.94
2363,10.62
2364,10.26
2365,9.89
2366,9.49
2367,9.11
2368,8.76
2369,8.48
2370,8.24
2371,8.06
2372,7.90
2373,7.76
2374,7.57
2375,7.32
2376,7.01
2377,6.69
2378,6.33
2379,5.98
2380,5.62
2381,5.30
2382,5.00
2383,4.74
2384,4.46
2385,4.18
2386,3.92
2387,3.70
2388,3.48
2389,3.26
2390,3.05
2391,2.89
2392,2.76
2393,2.67
2394,2.63
2395,2.64
2396,2.71
2397,2.83
2398,2.99
2399,3.17
2400,3.36
2401,3.52
2402,3.66
2403,3.74
2404,3.79
2405,3.80
2406,3.81
2407,3.82
2408,3.85
2409,3.89
2410,3.97
2411,4.07
2412,4.19
2413,4.28
2414,4.33
2415,4.33
2416,4.27
2417,4.17
2418,4.04
2419,3.92
2420,3.80
2421,3.68
2422,3.59
2423,3.52
2424,3.49
2425,3.48
2426,3.49
2427,3.51
2428,3.55
2429,3.59
2430,3.66
2431,3.76
2432,3.90
2433,4.07
2434,4.25
2435,4.45
2436,4.66
2437,4.86
2438,5.06
2439,5.22
2440,5.35
2441,5.42
2442,5.46
2443,5.46
2444,5.49
2445,5.54
2446,5.65
2447,5.81
2448,6.05
2449,6.34
2450,6.69
2451,7.05
2452,7.41
2453,7.74
2454,8.02
2455,8.22
2456,8.38
2457,8.49
2458,8.58
2459,8.65
2460,8.67
2461,8.65
2462,8.61
2463,8.55
2464,8.46
2465,8.35
2466,8.19
2467,7.99
2468,7.71
2469,7.37
2470,6.95
2471,6.48
2472,5.94
2473,5.40
2474,4.90
2475,4.50
2476,4.19
2477,3.99
2478,3.88
2479,3.86
2480,3.85
2481,3.82
2482,3.70
2483,3.51
2484,3.25
2485,2.96
2486,2.68
2487,2.47
2488,2.37
2489,2.41
2490,2.60
2491,2.89
2492,3.23
2493,3.56
2494,3.84
2495,4.03
2496,4.14
2497,4.16
2498,4.14
2499,4.10
2500,4.11
2501,4.19
2502,4.38
2503,4.64
2504,5.00
2505,5.38
2506,5.80
2507,6.19
2508,6.59
2509,6.95
2510,7.32
2511,7.68
2512,8.08
2513,8.49
2514,8.94
2515,9.38
2516,9.84
2517,10.26
2518,10.68
2519,11.05
2520,11.37
2521,11.62
2522,11.82
2523,11.95
2524,12.01
2525,12.00
2526,11.92
2527,11.80
2528,11.65
2529,11.51
2530,11.36
2531,11.22
2532,11.03
2533,10.77
2534,10.40
2535,9.97
2536,9.47
2537,8.94
2538,8.37
2539,7.84
2540,7.35
2541,6.97
2542,6.67
2543,6.45
2544,6.23
2545,6.03
2546,5.79
2547,5.55
2548,5.26
2549,4.94
2550,4.56
2551,4.16
2552,3.75
2553,3.38
2554,3.04
2555,2.73
2556,2.44
2557,2.17
2558,1.93
2559,1.74
2560,1.58
2561,1.47
2562,1.39
2563,1.34
2564,1.32
2565,1.32
2566,1.35
2567,1.39
2568,1.46
2569,1.56
2570,1.71
2571,1.90
2572,2.14
2573,2.37
2574,2.61
2575,2.80
2576,2.96
2577,3.06
2578,3.12
2579,3.14
2580,3.18
2581,3.24
2582,3.37
2583,3.49
2584,3.64
2585,3.75
2586,3.85
2587,3.90
2588,3.93
2589,3.95
2590,4.03
2591,4.19
2592,4.43
2593,4.71
2594,5.04
2595,5.36
2596,5.68
2597,5.96
2598,6.23
2599,6.49
2600,6.78
2601,7.06
2602,7.33
2603,7.53
2604,7.67
2605,7.71
2606,7.68
2607,7.56
2608,7.42
2609,7.25
2610,7.16
2611,7.14
2612,7.27
2613,7.50
2614,7.86
2615,8.31
2616,8.83
2617,9.34
2618,9.86
2619,10.33
2620,10.78
2621,11.16
2622,11.49
2623,11.72
2624,11.90
2625,12.06
2626,12.22
2627,12.37
2628,12.50
2629,12.62
2630,12.74
2631,12.83
2632,12.86
2633,12.80
2634,12.66
2635,12.48
2636,12.27
2637,12.05
2638,11.80
2639,11.54
2640,11.25
2641,10.96
2642,10.70
2643,10.46
2644,10.24
2645,10.03
2646,9.84
2647,9.70
2648,9.57
2649,9.47
2650,9.38
2651,9.33
2652,9.31
2653,9.35
2654,9.45
2655,9.62
2656,9.83
2657,10.05
2658,10.22
2659,10.33
2660,10.35
2661,10.32
2662,10.26
2663,10.21
2664,10.21
2665,10.27
2666,10.40
2667,10.58
2668,10.78
2669,10.93
2670,11.00
2671,10.95
2672,10.80
2673,10.56
2674,10.24
2675,9.88
2676,9.52
2677,9.20
2678,8.97
2679,8.84
2680,8.77
2681,8.79
2682,8.83
2683,8.91
2684,8.91
2685,8.85
2686,8.69
2687,8.43
2688,8.07
2689,7.66
2690,7.22
2691,6.82
2692,6.44
2693,6.12
2694,5.84
2695,5.62
2696,5.43
2697,5.24
2698,5.04
2699,4.84
2700,4.65
2701,4.49
2702,4.37
2703,4.32
2704,4.38
2705,4.52
2706,4.75
2707,5.07
2708,5.48
2709,5.94
2710,6.40
2711,6.81
2712,7.17
2713,7.47
2714,7.73
2715,7.94
2716,8.13
2717,8.29
2718,8.47
2719,8.65
2720,8.86
2721,9.06
2722,9.25
2723,9.38
2724,9.48
2725,9.53
2726,9.56
2727,9.58
2728,9.58
2729,9.56
2730,9.53
2731,9.47
2732,9.38
2733,9.26
2734,9.14
2735,9.03
2736,8.93
2737,8.85
2738,8.78
2739,8.74
2740,8.69
2741,8.62
2742,8.51
2743,8.37
2744,8.17
2745,7.93
2746,7.60
2747,7.23
2748,6.81
2749,6.40
2750,5.96
2751,5.53
2752,5.05
2753,4.57
2754,4.05
2755,3.55
2756,3.05
2757,2.58
2758,2.10
2759,1.68
2760,1.30
2761,1.00
2762,0.78
2763,0.65
2764,0.60
2765,0.64
2766,0.71
2767,0.80
2768,0.91
2769,1.04
2770,1.21
2771,1.41
2772,1.68
2773,1.98
2774,2.36
2775,2.78
2776,3.22
2777,3.63
2778,4.03
2779,4.34
2780,4.62
2781,4.83
2782,5.04
2783,5.23
2784,5.49
2785,5.77
2786,6.11
2787,6.45
2788,6.82
2789,7.15
2790,7.46
2791,7.72
2792,7.99
2793,8.26
2794,8.58
2795,8.92
2796,9.28
2797,9.62
2798,9.94
2799,10.17
2800,10.33
2801,10.38
2802,10.39
2803,10.38
2804,10.41
2805,10.46
2806,10.54
2807,10.62
2808,10.70
2809,10.76
2810,10.75
2811,10.65
2812,10.46
2813,10.20
2814,9.90
2815,9.62
2816,9.37
2817,9.19
2818,9.08
2819,9.05
2820,9.10
2821,9.21
2822,9.34
2823,9.44
2824,9.46
2825,9.40
2826,9.27
2827,9.11
2828,8.91
2829,8.70
2830,8.50
2831,8.33
2832,8.15
2833,7.98
2834,7.77
2835,7.52
2836,7.22
2837,6.89
2838,6.54
2839,6.22
2840,5.92
2841,5.69
2842,5.51
2843,5.41
2844,5.36
2845,5.37
2846,5.41
2847,5.50
2848,5.55
2849,5.58
2850,5.54
2851,5.43
2852,5.20
2853,4.89
2854,4.51
2855,4.12
2856,3.73
2857,3.36
2858,3.01
2859,2.71
2860,2.41
2861,2.13
2862,1.84
2863,1.55
2864,1.25
2865,0.98
2866,0.74
2867,0.56
2868,0.40
2869,0.27
2870,0.13
2871,0.02
2872,-0.07
2873,-0.12
2874,-0.13
2875,-0.10
2876,-0.01
2877,0.13
2878,0.33
2879,0.54
2880,0.77
2881,0.98
2882,1.20
2883,1.40
2884,1.64
2885,1.89
2886,2.14
2887,2.37
2888,2.64
2889,2.92
2890,3.19
2891,3.40
2892,3.55
2893,3.63
2894,3.66
2895,3.59
2896,3.46
2897,3.27
2898,3.09
2899,2.95
2900,2.89
2901,2.92
2902,3.04
2903,3.22
2904,3.45
2905,3.67
2906,3.85
2907,3.94
2908,3.95
2909,3.88
2910,3.78
2911,3.67
2912,3.59
2913,3.59
2914,3.68
2915,3.86
2916,4.11
2917,4.38
2918,4.65
2919,4.89
2920,5.09
2921,5.22
2922,5.29
2923,5.33
2924,5.38
2925,5.46
2926,5.62
2927,5.80
2928,6.03
2929,6.29
2930,6.58
2931,6.87
2932,7.14
2933,7.33
2934,7.49
2935,7.60
2936,7.69
2937,7.78
2938,7.89
2939,8.05
2940,8.25
2941,8.47
2942,8.67
2943,8.81
2944,8.82
2945,8.69
2946,8.42
2947,8.03
2948,7.54
2949,7.02
2950,6.51
2951,6.09
2952,5.76
2953,5.52
2954,5.31
2955,5.13
2956,4.90
2957,4.63
2958,4.28
2959,3.91
2960,3.52
2961,3.20
2962,2.94
2963,2.80
2964,2.74
2965,2.76
2966,2.82
2967,2.89
2968,2.92
2969,2.92
2970,2.89
2971,2.86
2972,2.85
2973,2.86
2974,2.89
2975,2.94
2976,3.01
2977,3.08
2978,3.14
2979,3.18
2980,3.23
2981,3.31
2982,3.47
2983,3.70
2984,4.04
2985,4.45
2986,4.95
2987,5.46
2988,6.00
2989,6.48
2990,6.95
2991,7.34
2992,7.69
2993,7.97
2994,8.27
2995,8.58
2996,8.93
2997,9.30
2998,9.70
2999,10.10
3000,10.49
3001,10.83
3002,11.11
3003,11.30
3004,11.41
3005,11.42
3006,11.35
3007,11.20
3008,10.99
3009,10.75
3010,10.49
3011,10.26
3012,10.05
3013,9.91
3014,9.80
3015,9.72
3016,9.62
3017,9.49
3018,9.30
3019,9.07
3020,8.77
3021,8.43
3022,8.04
3023,7.67
3024,7.27
3025,6.89
3026,6.49
3027,6.10
3028,5.68
3029,5.31
3030,4.93
3031,4.58
3032,4.21
3033,3.88
3034,3.56
3035,3.25
3036,2.91
3037,2.58
3038,2.24
3039,1.96
3040,1.72
3041,1.57
3042,1.48
3043,1.48
3044,1.54
3045,1.65
3046,1.79
3047,1.93
3048,2.04
3049,2.11
3050,2.17
3051,2.24
3052,2.33
3053,2.44
3054,2.56
3055,2.66
3056,2.73
3057,2.75
3058,2.72
3059,2.63
3060,2.53
3061,2.43
3062,2.42
3063,2.48
3064,2.63
3065,2.82
3066,3.08
3067,3.34
3068,3.59
3069,3.78
3070,3.95
3071,4.06
3072,4.18
3073,4.29
3074,4.46
3075,4.66
3076,4.90
3077,5.15
3078,5.44
3079,5.75
3080,6.09
3081,6.41
3082,6.72
3083,6.98
3084,7.23
3085,7.43
3086,7.60
3087,7.69
3088,7.76
3089,7.81
3090,7.91
3091,8.04
3092,8.26
3093,8.52
3094,8.88
3095,9.29
3096,9.74
3097,10.17
3098,10.59
3099,10.97
3100,11.33
3101,11.60
3102,11.83
3103,11.98
3104,12.12
3105,12.22
3106,12.30
3107,12.36
3108,12.39
3109,12.39
3110,12.37
3111,12.31
3112,12.20
3113,12.05
3114,11.86
3115,11.65
3116,11.44
3117,11.22
3118,10.96
3119,10.70
3120,10.42
3121,10.15
3122,9.89
3123,9.67
3124,9.50
3125,9.41
3126,9.39
3127,9.43
3128,9.49
3129,9.56
3130,9.59
3131,9.56
3132,9.45
3133,9.30
3134,9.15
3135,9.02
3136,8.94
3137,8.92
3138,8.94
3139,8.98
3140,9.02
3141,9.04
3142,9.05
3143,9.08
3144,9.11
3145,9.16
3146,9.24
3147,9.36
3148,9.51
3149,9.66
3150,9.78
3151,9.85
3152,9.83
3153,9.72
3154,9.54
3155,9.31
3156,9.08
3157,8.89
3158,8.74
3159,8.64
3160,8.56
3161,8.51
3162,8.44
3163,8.33
3164,8.13
3165,7.87
3166,7.53
3167,7.18
3168,6.80
3169,6.45
3170,6.11
3171,5.83
3172,5.59
3173,5.39
3174,5.18
3175,4.94
3176,4.68
3177,4.43
3178,4.18
3179,3.94
3180,3.72
3181,3.52
3182,3.38
3183,3.30
3184,3.31
3185,3.41
3186,3.61
3187,3.88
3188,4.20
3189,4.51
3190,4.81
3191,5.04
3192,5.23
3193,5.37
3194,5.51
3195,5.67
3196,5.89
3197,6.17
3198,6.52
3199,6.89
3200,7.25
3201,7.54
3202,7.73
3203,7.82
3204,7.81
3205,7.73
3206,7.63
3207,7.52
3208,7.42
3209,7.32
3210,7.21
3211,7.06
3212,6.84
3213,6.54
3214,6.19
3215,5.88
3216,5.64
3217,5.51
3218,5.45
3219,5.49
3220,5.54
3221,5.58
3222,5.49
3223,5.25
3224,4.85
3225,4.35
3226,3.78
3227,3.22
3228,2.71
3229,2.34
3230,2.08
3231,1.92
3232,1.76
3233,1.59
3234,1.30
3235,0.92
3236,0.41
3237,-0.16
3238,-0.80
3239,-1.39
3240,-1.92
3241,-2.34
3242,-2.67
3243,-2.90
3244,-3.05
3245,-3.10
3246,-3.10
3247,-3.04
3248,-2.92
3249,-2.74
3250,-2.51
3251,-2.27
3252,-2.03
3253,-1.82
3254,-1.66
3255,-1.56
3256,-1.49
3257,-1.44
3258,-1.35
3259,-1.21
3260,-0.99
3261,-0.71
3262,-0.37
3263,-0.03
3264,0.32
3265,0.62
3266,0.90
3267,1.13
3268,1.37
3269,1.62
3270,1.95
3271,2.33
3272,2.80
3273,3.30
3274,3.85
3275,4.38
3276,4.87
3277,5.27
3278,5.60
3279,5.82
3280,5.93
3281,5.94
3282,5.91
3283,5.87
3284,5.86
3285,5.86
3286,5.87
3287,5.90
3288,5.94
3289,5.97
3290,5.97
3291,5.92
3292,5.79
3293,5.59
3294,5.34
3295,5.07
3296,4.80
3297,4.58
3298,4.42
3299,4.33
3300,4.30
3301,4.34
3302,4.41
3303,4.49
3304,4.54
3305,4.55
3306,4.48
3307,4.37
3308,4.19
3309,3.97
3310,3.70
3311,3.42
3312,3.12
3313,2.83
3314,2.53
3315,2.25
3316,1.98
3317,1.77
3318,1.57
3319,1.40
3320,1.20
3321,1.00
3322,0.78
3323,0.58
3324,0.35
3325,0.14
3326,-0.08
3327,-0.25
3328,-0.42
3329,-0.55
3330,-0.70
3331,-0.84
3332,-1.02
3333,-1.20
3334,-1.43
3335,-1.64
3336,-1.88
3337,-2.09
3338,-2.32
3339,-2.54
3340,-2.77
3341,-2.99
3342,-3.20
3343,-3.39
3344,-3.58
3345,-3.76
3346,-3.93
3347,-4.07
3348,-4.21
3349,-4.34
3350,-4.49
3351,-4.64
3352,-4.77
3353,-4.85
3354,-4.85
3355,-4.77
3356,-4.57
3357,-4.29
3358,-3.93
3359,-3.56
3360,-3.20
3361,-2.88
3362,-2.61
3363,-2.41
3364,-2.26
3365,-2.18
3366,-2.09
3367,-1.97
3368,-1.78
3369,-1.54
3370,-1.24
3371,-0.94
3372,-0.63
3373,-0.40
3374,-0.22
3375,-0.12
3376,-0.08
3377,-0.08
3378,-0.03
3379,0.08
3380,0.29
3381,0.57
3382,0.91
3383,1.25
3384,1.59
3385,1.86
3386,2.08
3387,2.22
3388,2.35
3389,2.47
3390,2.65
3391,2.87
3392,3.20
3393,3.58
3394,4.03
3395,4.47
3396,4.91
3397,5.29
3398,5.64
3399,5.93
3400,6.19
3401,6.40
3402,6.63
3403,6.86
3404,7.12
3405,7.35
3406,7.64
3407,7.95
3408,8.35
3409,8.80
3410,9.35
3411,9.95
3412,10.64
3413,11.35
3414,12.09
3415,12.77
3416,13.39
3417,13.89
3418,14.31
3419,14.61
3420,14.83
3421,14.93
3422,14.95
3423,14.90
3424,14.79
3425,14.60
3426,14.31
3427,13.94
3428,13.49
3429,13.01
3430,12.52
3431,12.10
3432,11.73
3433,11.47
3434,11.27
3435,11.11
3436,10.89
3437,10.60
3438,10.19
3439,9.70
3440,9.15
3441,8.65
3442,8.21
3443,7.90
3444,7.71
3445,7.66
3446,7.69
3447,7.75
3448,7.75
3449,7.69
3450,7.59
3451,7.48
3452,7.38
3453,7.35
3454,7.42
3455,7.59
3456,7.81
3457,8.02
3458,8.19
3459,8.28
3460,8.29
3461,8.22
3462,8.13
3463,8.07
3464,8.14
3465,8.33
3466,8.70
3467,9.16
3468,9.71
3469,10.26
3470,10.78
3471,11.21
3472,11.56
3473,11.83
3474,12.08
3475,12.31
3476,12.56
3477,12.81
3478,13.08
3479,13.35
3480,13.62
3481,13.89
3482,14.14
3483,14.37
3484,14.55
3485,14.65
3486,14.67
3487,14.60
3488,14.44
3489,14.22
3490,13.91
3491,13.55
3492,13.18
3493,12.84
3494,12.51
3495,12.21
3496,11.89
3497,11.57
3498,11.22
3499,10.89
3500,10.53
3501,10.18
3502,9.81
3503,9.46
3504,9.10
3505,8.79
3506,8.46
3507,8.13
3508,7.74
3509,7.35
3510,6.93
3511,6.53
3512,6.13
3513,5.77
3514,5.42
3515,5.13
3516,4.84
3517,4.55
3518,4.24
3519,3.95
3520,3.66
3521,3.41
3522,3.20
3523,3.05
3524,2.95
3525,2.90
3526,2.88
3527,2.89
3528,2.92
3529,2.97
3530,3.05
3531,3.18
3532,3.36
3533,3.59
3534,3.86
3535,4.16
3536,4.45
3537,4.68
3538,4.83
3539,4.88
3540,4.84
3541,4.72
3542,4.57
3543,4.41
3544,4.28
3545,4.20
3546,4.21
3547,4.30
3548,4.43
3549,4.56
3550,4.65
3551,4.72
3552,4.77
3553,4.78
3554,4.78
3555,4.78
3556,4.80
3557,4.86
3558,4.97
3559,5.13
3560,5.34
3561,5.56
3562,5.79
3563,6.00
3564,6.18
3565,6.33
3566,6.45
3567,6.52
3568,6.56
3569,6.55
3570,6.54
3571,6.56
3572,6.67
3573,6.85
3574,7.14
3575,7.48
3576,7.86
3577,8.22
3578,8.54
3579,8.79
3580,8.98
3581,9.09
3582,9.18
3583,9.28
3584,9.41
3585,9.56
3586,9.72
3587,9.87
3588,9.99
3589,10.09
3590,10.14
3591,10.17
3592,10.17
3593,10.16
3594,10.14
3595,10.10
3596,9.99
3597,9.84
3598,9.62
3599,9.36
3600,9.06
3601,8.74
3602,8.40
3603,8.11
3604,7.85
3605,7.64
3606,7.47
3607,7.34
3608,7.23
3609,7.15
3610,7.06
3611,6.99
3612,6.93
3613,6.89
3614,6.85
3615,6.81
3616,6.76
3617,6.73
3618,6.71
3619,6.72
3620,6.74
3621,6.77
3622,6.78
3623,6.77
3624,6.72
3625,6.63
3626,6.51
3627,6.38
3628,6.23
3629,6.13
3630,6.09
3631,6.13
3632,6.25
3633,6.41
3634,6.55
3635,6.65
3636,6.65
3637,6.55
3638,6.33
3639,6.03
3640,5.69
3641,5.40
3642,5.15
3643,4.99
3644,4.91
3645,4.89
3646,4.87
3647,4.83
3648,4.72
3649,4.53
3650,4.24
3651,3.87
3652,3.44
3653,3.02
3654,2.63
3655,2.32
3656,2.10
3657,1.95
3658,1.83
3659,1.74
3660,1.64
3661,1.55
3662,1.45
3663,1.36
3664,1.32
3665,1.36
3666,1.48
3667,1.66
3668,1.91
3669,2.20
3670,2.55
3671,2.89
3672,3.21
3673,3.50
3674,3.81
3675,4.13
3676,4.49
3677,4.82
3678,5.16
3679,5.45
3680,5.73
3681,5.96
3682,6.18
3683,6.36
3684,6.56
3685,6.74
3686,6.95
3687,7.13
3688,7.26
3689,7.32
3690,7.30
3691,7.18
3692,6.96
3693,6.69
3694,6.42
3695,6.21
3696,6.06
3697,6.01
3698,6.04
3699,6.13
3700,6.23
3701,6.31
3702,6.29
3703,6.18
3704,5.93
3705,5.59
3706,5.18
3707,4.76
3708,4.34
3709,3.96
3710,3.61
3711,3.31
3712,2.98
3713,2.66
3714,2.33
3715,2.02
3716,1.72
3717,1.47
3718,1.28
3719,1.17
3720,1.14
3721,1.17
3722,1.20
3723,1.21
3724,1.21
3725,1.18
3726,1.19
3727,1.23
3728,1.39
3729,1.65
3730,2.05
3731,2.55
3732,3.15
3733,3.74
3734,4.33
3735,4.85
3736,5.36
3737,5.83
3738,6.30
3739,6.72
3740,7.20
3741,7.67
3742,8.22
3743,8.74
3744,9.28
3745,9.75
3746,10.23
3747,10.66
3748,11.12
3749,11.55
3750,12.01
3751,12.46
3752,12.96
3753,13.45
3754,13.97
3755,14.43
3756,14.84
3757,15.17
3758,15.47
3759,15.73
3760,16.01
3761,16.29
3762,16.62
3763,16.98
3764,17.37
3765,17.73
3766,18.00
3767,18.11
3768,18.05
3769,17.86
3770,17.60
3771,17.28
3772,16.93
3773,16.59
3774,16.28
3775,16.02
3776,15.75
3777,15.47
3778,15.17
3779,14.88
3780,14.57
3781,14.27
3782,13.99
3783,13.78
3784,13.61
3785,13.50
3786,13.39
3787,13.30
3788,13.19
3789,13.09
3790,12.96
3791,12.84
3792,12.69
3793,12.53
3794,12.32
3795,12.06
3796,11.73
3797,11.38
3798,10.97
3799,10.56
3800,10.15
3801,9.78
3802,9.43
3803,9.14
3804,8.90
3805,8.75
3806,8.63
3807,8.57
3808,8.51
3809,8.46
3810,8.36
3811,8.24
3812,8.04
3813,7.82
3814,7.53
3815,7.21
3816,6.81
3817,6.41
3818,5.97
3819,5.56
3820,5.14
3821,4.74
3822,4.36
3823,4.04
3824,3.75
3825,3.52
3826,3.31
3827,3.14
3828,2.98
3829,2.85
3830,2.73
3831,2.66
3832,2.63
3833,2.63
3834,2.64
3835,2.66
3836,2.69
3837,2.75
3838,2.82
3839,2.90
3840,3.00
3841,3.11
3842,3.24
3843,3.41
3844,3.62
3845,3.84
3846,4.05
3847,4.20
3848,4.31
3849,4.37
3850,4.42
3851,4.45
3852,4.49
3853,4.56
3854,4.66
3855,4.77
3856,4.87
3857,4.94
3858,4.97
3859,4.92
3860,4.83
3861,4.70
3862,4.57
3863,4.51
3864,4.56
3865,4.72
3866,4.96
3867,5.21
3868,5.43
3869,5.56
3870,5.58
3871,5.47
3872,5.29
3873,5.12
3874,5.00
3875,4.98
3876,5.10
3877,5.33
3878,5.61
3879,5.88
3880,6.11
3881,6.24
3882,6.27
3883,6.22
3884,6.16
3885,6.13
3886,6.21
3887,6.38
3888,6.67
3889,7.04
3890,7.49
3891,7.94
3892,8.33
3893,8.63
3894,8.85
3895,9.02
3896,9.17
3897,9.29
3898,9.40
3899,9.50
3900,9.61
3901,9.70
3902,9.75
3903,9.75
3904,9.70
3905,9.56
3906,9.34
3907,9.07
3908,8.80
3909,8.59
3910,8.44
3911,8.37
3912,8.29
3913,8.20
3914,8.02
3915,7.76
3916,7.39
3917,6.94
3918,6.42
3919,5.90
3920,5.41
3921,5.01
3922,4.69
3923,4.44
3924,4.23
3925,4.06
3926,3.90
3927,3.78
3928,3.71
3929,3.71
3930,3.80
3931,3.96
3932,4.17
3933,4.42
3934,4.68
3935,4.91
3936,5.11
3937,5.24
3938,5.33
3939,5.36
3940,5.39
3941,5.38
3942,5.39
3943,5.43
3944,5.59
3945,5.83
3946,6.18
3947,6.60
3948,7.09
3949,7.59
3950,8.08
3951,8.49
3952,8.87
3953,9.18
3954,9.48
3955,9.76
3956,10.07
3957,10.40
3958,10.79
3959,11.21
3960,11.65
3961,12.04
3962,12.41
3963,12.72
3964,12.99
3965,13.20
3966,13.32
3967,13.35
3968,13.32
3969,13.22
3970,13.06
3971,12.83
3972,12.53
3973,12.19
3974,11.78
3975,11.32
3976,10.82
3977,10.33
3978,9.84
3979,9.41
3980,8.99
3981,8.64
3982,8.32
3983,8.05
3984,7.77
3985,7.52
3986,7.22
3987,6.92
3988,6.57
3989,6.20
3990,5.80
3991,5.43
3992,5.04
3993,4.69
3994,4.35
3995,4.03
3996,3.70
3997,3.41
3998,3.13
3999,2.90
4000,2.69
4001,2.53
4002,2.40
4003,2.32
4004,2.25
4005,2.19
4006,2.15
4007,2.11
4008,2.10
4009,2.11
4010,2.19
4011,2.35
4012,2.59
4013,2.89
4014,3.24
4015,3.60
4016,3.93
4017,4.21
4018,4.41
4019,4.52
4020,4.54
4021,4.49
4022,4.44
4023,4.42
4024,4.45
4025,4.53
4026,4.71
4027,4.94
4028,5.22
4029,5.49
4030,5.74
4031,5.94
4032,6.12
4033,6.23
4034,6.31
4035,6.36
4036,6.44
4037,6.55
4038,6.72
4039,6.94
4040,7.24
4041,7.56
4042,7.90
4043,8.19
4044,8.45
4045,8.64
4046,8.77
4047,8.82
4048,8.83
4049,8.81
4050,8.81
4051,8.82
4052,8.91
4053,9.05
4054,9.29
4055,9.58
4056,9.93
4057,10.30
4058,10.70
4059,11.08
4060,11.44
4061,11.76
4062,12.04
4063,12.27
4064,12.46
4065,12.61
4066,12.76
4067,12.92
4068,13.09
4069,13.24
4070,13.36
4071,13.45
4072,13.50
4073,13.49
4074,13.39
4075,13.24
4076,13.07
4077,12.89
4078,12.68
4079,12.46
4080,12.23
4081,12.03
4082,11.83
4083,11.64
4084,11.44
4085,11.27
4086,11.11
4087,10.99
4088,10.89
4089,10.82
4090,10.77
4091,10.73
4092,10.67
4093,10.58
4094,10.48
4095,10.40
4096,10.37
4097,10.37
4098,10.40
4099,10.46
4100,10.54
4101,10.61
4102,10.67
4103,10.69
4104,10.67
4105,10.62
4106,10.54
4107,10.47
4108,10.43
4109,10.43
4110,10.44
4111,10.43
4112,10.39
4113,10.33
4114,10.24
4115,10.11
4116,9.93
4117,9.74
4118,9.54
4119,9.38
4120,9.26
4121,9.17
4122,9.09
4123,9.00
4124,8.92
4125,8.85
4126,8.75
4127,8.61
4128,8.39
4129,8.13
4130,7.80
4131,7.43
4132,7.00
4133,6.56
4134,6.12
4135,5.73
4136,5.39
4137,5.13
4138,4.93
4139,4.81
4140,4.75
4141,4.73
4142,4.71
4143,4.71
4144,4.75
4145,4.85
4146,5.01
4147,5.24
4148,5.54
4149,5.88
4150,6.24
4151,6.58
4152,6.92
4153,7.21
4154,7.53
4155,7.83
4156,8.18
4157,8.53
4158,8.89
4159,9.20
4160,9.47
4161,9.67
4162,9.83
4163,9.94
4164,10.06
4165,10.19
4166,10.35
4167,10.53
4168,10.72
4169,10.89
4170,10.99
4171,10.99
4172,10.87
4173,10.64
4174,10.35
4175,10.03
4176,9.74
4177,9.50
4178,9.32
4179,9.21
4180,9.12
4181,9.05
4182,8.97
4183,8.88
4184,8.72
4185,8.52
4186,8.25
4187,7.94
4188,7.58
4189,7.19
4190,6.72
4191,6.25
4192,5.77
4193,5.35
4194,4.95
4195,4.61
4196,4.25
4197,3.92
4198,3.57
4199,3.22
4200,2.81
4201,2.38
4202,1.96
4203,1.63
4204,1.41
4205,1.32
4206,1.36
4207,1.53
4208,1.79
4209,2.10
4210,2.39
4211,2.66
4212,2.92
4213,3.16
4214,3.41
4215,3.64
4216,3.92
4217,4.20
4218,4.53
4219,4.86
4220,5.20
4221,5.51
4222,5.84
4223,6.14
4224,6.48
4225,6.79
4226,7.11
4227,7.39
4228,7.67
4229,7.93
4230,8.19
4231,8.42
4232,8.65
4233,8.85
4234,9.06
4235,9.26
4236,9.48
4237,9.72
4238,9.99
4239,10.25
4240,10.50
4241,10.71
4242,10.88
4243,10.98
4244,11.01
4245,11.00
4246,10.97
4247,10.97
4248,10.99
4249,11.02
4250,11.05
4251,11.05
4252,11.01
4253,10.89
4254,10.67
4255,10.35
4256,9.99
4257,9.66
4258,9.39
4259,9.23
4260,9.18
4261,9.23
4262,9.34
4263,9.47
4264,9.56
4265,9.61
4266,9.59
4267,9.51
4268,9.34
4269,9.13
4270,8.91
4271,8.70
4272,8.49
4273,8.30
4274,8.13
4275,7.97
4276,7.77
4277,7.56
4278,7.31
4279,7.06
4280,6.78
4281,6.52
4282,6.28
4283,6.11
4284,5.96
4285,5.80
4286,5.61
4287,5.39
4288,5.13
4289,4.85
4290,4.54
4291,4.24
4292,3.98
4293,3.79
4294,3.66
4295,3.61
4296,3.60
4297,3.63
4298,3.62
4299,3.55
4300,3.38
4301,3.11
4302,2.76
4303,2.36
4304,1.91
4305,1.49
4306,1.14
4307,0.90
4308,0.76
4309,0.71
4310,0.73
4311,0.81
4312,0.90
4313,1.01
4314,1.13
4315,1.27
4316,1.46
4317,1.67
4318,1.89
4319,2.10
4320,2.29
4321,2.42
4322,2.50
4323,2.52
4324,2.52
4325,2.53
4326,2.61
4327,2.77
4328,3.01
4329,3.30
4330,3.61
4331,3.94
4332,4.26
4333,4.52
4334,4.68
4335,4.74
4336,4.70
4337,4.54
4338,4.30
4339,3.99
4340,3.70
4341,3.47
4342,3.33
4343,3.32
4344,3.43
4345,3.65
4346,3.90
4347,4.13
4348,4.29
4349,4.33
4350,4.25
4351,4.10
4352,3.93
4353,3.79
4354,3.70
4355,3.67
4356,3.72
4357,3.82
4358,3.96
4359,4.10
4360,4.21
4361,4.30
4362,4.39
4363,4.45
4364,4.51
4365,4.57
4366,4.67
4367,4.79
4368,4.95
4369,5.14
4370,5.42
4371,5.78
4372,6.23
4373,6.72
4374,7.20
4375,7.61
4376,7.95
4377,8.19
4378,8.34
4379,8.41
4380,8.42
4381,8.39
4382,8.35
4383,8.32
4384,8.28
4385,8.23
4386,8.14
4387,7.99
4388,7.75
4389,7.43
4390,7.02
4391,6.57
4392,6.09
4393,5.62
4394,5.15
4395,4.75
4396,4.42
4397,4.17
4398,3.98
4399,3.86
4400,3.75
4401,3.67
4402,3.57
4403,3.44
4404,3.25
4405,3.03
4406,2.78
4407,2.53
4408,2.29
4409,2.08
4410,1.91
4411,1.81
4412,1.77
4413,1.77
4414,1.77
4415,1.76
4416,1.75
4417,1.76
4418,1.78
4419,1.78
4420,1.78
4421,1.80
4422,1.89
4423,2.02
4424,2.19
4425,2.38
4426,2.61
4427,2.85
4428,3.14
4429,3.45
4430,3.80
4431,4.15
4432,4.52
4433,4.87
4434,5.24
4435,5.61
4436,5.99
4437,6.35
4438,6.74
4439,7.14
4440,7.56
4441,7.94
4442,8.29
4443,8.56
4444,8.74
4445,8.81
4446,8.79
4447,8.68
4448,8.51
4449,8.32
4450,8.12
4451,7.93
4452,7.72
4453,7.49
4454,7.20
4455,6.86
4456,6.45
4457,5.98
4458,5.43
4459,4.90
4460,4.40
4461,3.99
4462,3.64
4463,3.39
4464,3.17
4465,3.01
4466,2.80
4467,2.55
4468,2.21
4469,1.82
4470,1.36
4471,0.90
4472,0.42
4473,0.00
4474,-0.44
4475,-0.84
4476,-1.24
4477,-1.61
4478,-1.97
4479,-2.30
4480,-2.57
4481,-2.73
4482,-2.80
4483,-2.80
4484,-2.74
4485,-2.63
4486,-2.50
4487,-2.36
4488,-2.24
4489,-2.13
4490,-2.04
4491,-1.95
4492,-1.86
4493,-1.79
4494,-1.73
4495,-1.67
4496,-1.60
4497,-1.53
4498,-1.45
4499,-1.39
4500,-1.34
4501,-1.32
4502,-1.31
4503,-1.35
4504,-1.39
4505,-1.43
4506,-1.41
4507,-1.35
4508,-1.21
4509,-1.02
4510,-0.75
4511,-0.44
4512,-0.12
4513,0.16
4514,0.42
4515,0.63
4516,0.83
4517,0.99
4518,1.15
4519,1.32
4520,1.54
4521,1.77
4522,2.04
4523,2.31
4524,2.56
4525,2.75
4526,2.88
4527,2.93
4528,2.96
4529,2.96
4530,2.98
4531,3.00
4532,3.08
4533,3.19
4534,3.36
4535,3.56
4536,3.82
4537,4.11
4538,4.46
4539,4.81
4540,5.19
4541,5.57
4542,5.97
4543,6.33
4544,6.63
4545,6.83
4546,6.98
4547,7.07
4548,7.16
4549,7.23
4550,7.30
4551,7.36
4552,7.39
4553,7.38
4554,7.31
4555,7.16
4556,6.93
4557,6.64
4558,6.32
4559,6.01
4560,5.72
4561,5.48
4562,5.29
4563,5.18
4564,5.12
4565,5.09
4566,5.06
4567,5.01
4568,4.91
4569,4.77
4570,4.61
4571,4.46
4572,4.35
4573,4.29
4574,4.28
4575,4.34
4576,4.47
4577,4.67
4578,4.90
4579,5.09
4580,5.24
4581,5.31
4582,5.32
4583,5.27
4584,5.19
4585,5.10
4586,5.02
4587,4.99
4588,5.00
4589,5.07
4590,5.18
4591,5.29
4592,5.39
4593,5.42
4594,5.39
4595,5.29
4596,5.16
4597,4.99
4598,4.83
4599,4.74
4600,4.75
4601,4.88
4602,5.14
4603,5.49
4604,5.87
4605,6.24
4606,6.53
4607,6.71
4608,6.77
4609,6.70
4610,6.56
4611,6.39
4612,6.22
4613,6.05
4614,5.90
4615,5.76
4616,5.67
4617,5.62
4618,5.60
4619,5.60
4620,5.65
4621,5.74
4622,5.91
4623,6.12
4624,6.44
4625,6.81
4626,7.28
4627,7.76
4628,8.30
4629,8.84
4630,9.40
4631,9.91
4632,10.42
4633,10.90
4634,11.41
4635,11.92
4636,12.48
4637,13.04
4638,13.62
4639,14.15
4640,14.64
4641,15.02
4642,15.31
4643,15.48
4644,15.58
4645,15.63
4646,15.68
4647,15.73
4648,15.81
4649,15.88
4650,15.97
4651,16.03
4652,16.02
4653,15.92
4654,15.72
4655,15.46
4656,15.19
4657,14.95
4658,14.76
4659,14.67
4660,14.62
4661,14.62
4662,14.59
4663,14.51
4664,14.33
4665,14.06
4666,13.64
4667,13.13
4668,12.51
4669,11.89
4670,11.26
4671,10.69
4672,10.15
4673,9.67
4674,9.19
4675,8.74
4676,8.27
4677,7.85
4678,7.43
4679,7.04
4680,6.63
4681,6.27
4682,5.92
4683,5.61
4684,5.30
4685,5.04
4686,4.83
4687,4.70
4688,4.63
4689,4.63
4690,4.73
4691,4.92
4692,5.18
4693,5.45
4694,5.72
4695,5.97
4696,6.22
4697,6.45
4698,6.69
4699,6.94
4700,7.23
4701,7.57
4702,7.96
4703,8.35
4704,8.71
4705,9.00
4706,9.25
4707,9.41
4708,9.55
4709,9.66
4710,9.80
4711,9.97
4712,10.21
4713,10.50
4714,10.87
4715,11.27
4716,11.70
4717,12.10
4718,12.46
4719,12.72
4720,12.91
4721,13.01
4722,13.05
4723,13.05
4724,13.01
4725,12.96
4726,12.94
4727,12.93
4728,12.95
4729,12.97
4730,12.97
4731,12.91
4732,12.77
4733,12.57
4734,12.29
4735,11.99
4736,11.69
4737,11.44
4738,11.25
4739,11.15
4740,11.11
4741,11.14
4742,11.17
4743,11.18
4744,11.11
4745,10.98
4746,10.78
4747,10.56
4748,10.33
4749,10.14
4750,9.98
4751,9.89
4752,9.81
4753,9.75
4754,9.63
4755,9.44
4756,9.17
4757,8.84
4758,8.45
4759,8.07
4760,7.71
4761,7.41
4762,7.17
4763,6.98
4764,6.83
4765,6.73
4766,6.65
4767,6.60
4768,6.54
4769,6.48
4770,6.37
4771,6.27
4772,6.11
4773,5.93
4774,5.65
4775,5.33
4776,4.96
4777,4.57
4778,4.16
4779,3.75
4780,3.34
4781,2.97
4782,2.63
4783,2.33
4784,2.06
4785,1.82
4786,1.62
4787,1.46
4788,1.32
4789,1.22
4790,1.17
4791,1.18
4792,1.25
4793,1.36
4794,1.55
4795,1.80
4796,2.11
4797,2.42
4798,2.75
4799,3.04
4800,3.29
4801,3.45
4802,3.56
4803,3.60
4804,3.65
4805,3.70
4806,3.81
4807,3.97
4808,4.19
4809,4.43
4810,4.68
4811,4.90
4812,5.08
4813,5.17
4814,5.16
4815,5.07
4816,4.91
4817,4.73
4818,4.55
4819,4.42
4820,4.34
4821,4.30
4822,4.32
4823,4.36
4824,4.45
4825,4.55
4826,4.65
4827,4.74
4828,4.83
4829,4.93
4830,5.05
4831,5.15
4832,5.24
4833,5.28
4834,5.29
4835,5.25
4836,5.21
4837,5.18
4838,5.18
4839,5.23
4840,5.38
4841,5.58
4842,5.83
4843,6.05
4844,6.26
4845,6.43
4846,6.57
4847,6.66
4848,6.74
4849,6.83
4850,6.99
4851,7.22
4852,7.54
4853,7.91
4854,8.33
4855,8.73
4856,9.11
4857,9.39
4858,9.56
4859,9.65
4860,9.70
4861,9.72
4862,9.73
4863,9.74
4864,9.74
4865,9.72
4866,9.67
4867,9.56
4868,9.36
4869,9.09
4870,8.73
4871,8.33
4872,7.86
4873,7.38
4874,6.88
4875,6.40
4876,5.93
4877,5.51
4878,5.12
4879,4.77
4880,4.44
4881,4.18
4882,3.96
4883,3.81
4884,3.67
4885,3.61
4886,3.59
4887,3.65
4888,3.71
4889,3.78
4890,3.83
4891,3.89
4892,3.96
4893,4.03
4894,4.11
4895,4.20
4896,4.30
4897,4.39
4898,4.46
4899,4.50
4900,4.53
4901,4.51
4902,4.51
4903,4.53
4904,4.64
4905,4.82
4906,5.10
4907,5.44
4908,5.88
4909,6.38
4910,6.92
4911,7.42
4912,7.93
4913,8.39
4914,8.83
4915,9.19
4916,9.56
4917,9.91
4918,10.32
4919,10.75
4920,11.22
4921,11.68
4922,12.11
4923,12.47
4924,12.75
4925,12.91
4926,12.96
4927,12.91
4928,12.80
4929,12.64
4930,12.41
4931,12.12
4932,11.80
4933,11.48
4934,11.13
4935,10.78
4936,10.41
4937,10.08
4938,9.74
4939,9.42
4940,9.06
4941,8.72
4942,8.37
4943,8.06
4944,7.75
4945,7.50
4946,7.27
4947,7.10
4948,6.92
4949,6.71
4950,6.43
4951,6.12
4952,5.75
4953,5.36
4954,4.94
4955,4.57
4956,4.24
4957,3.98
4958,3.75
4959,3.55
4960,3.33
4961,3.12
4962,2.88
4963,2.66
4964,2.45
4965,2.30
4966,2.22
4967,2.22
4968,2.30
4969,2.44
4970,2.61
4971,2.77
4972,2.93
4973,3.08
4974,3.22
4975,3.37
4976,3.54
4977,3.72
4978,3.88
4979,4.01
4980,4.08
4981,4.09
4982,4.04
4983,3.96
4984,3.91
4985,3.89
4986,3.96
4987,4.07
4988,4.27
4989,4.47
4990,4.65
4991,4.75
4992,4.80
4993,4.80
4994,4.83
4995,4.91
4996,5.10
4997,5.39
4998,5.81
4999,6.29
5000,6.79
5001,7.22
5002,7.56
5003,7.79
5004,7.96
5005,8.05
5006,8.11
5007,8.13
5008,8.18
5009,8.26
5010,8.39
5011,8.50
5012,8.64
5013,8.77
5014,8.95
5015,9.17
5016,9.47
5017,9.86
5018,10.31
5019,10.79
5020,11.27
5021,11.68
5022,11.98
5023,12.13
5024,12.18
5025,12.14
5026,12.08
5027,12.05
5028,12.08
5029,12.18
5030,12.35
5031,12.53
5032,12.68
5033,12.74
5034,12.71
5035,12.57
5036,12.34
5037,12.09
5038,11.85
5039,11.65
5040,11.49
5041,11.36
5042,11.27
5043,11.21
5044,11.13
5045,11.01
5046,10.88
5047,10.74
5048,10.59
5049,10.45
5050,10.33
5051,10.25
5052,10.21
5053,10.23
5054,10.31
5055,10.46
5056,10.66
5057,10.89
5058,11.11
5059,11.28
5060,11.36
5061,11.33
5062,11.19
5063,10.98
5064,10.74
5065,10.51
5066,10.33
5067,10.23
5068,10.19
5069,10.21
5070,10.25
5071,10.29
5072,10.28
5073,10.22
5074,10.10
5075,9.95
5076,9.80
5077,9.67
5078,9.54
5079,9.44
5080,9.38
5081,9.36
5082,9.38
5083,9.42
5084,9.44
5085,9.43
5086,9.36
5087,9.22
5088,8.96
5089,8.64
5090,8.26
5091,7.89
5092,7.52
5093,7.20
5094,6.91
5095,6.66
5096,6.41
5097,6.16
5098,5.90
5099,5.65
5100,5.40
5101,5.16
5102,4.95
5103,4.79
5104,4.71
5105,4.71
5106,4.80
5107,4.96
5108,5.22
5109,5.54
5110,5.93
5111,6.37
5112,6.84
5113,7.29
5114,7.74
5115,8.14
5116,8.51
5117,8.83
5118,9.12
5119,9.35
5120,9.57
5121,9.74
5122,9.89
5123,9.99
5124,10.06
5125,10.12
5126,10.18
5127,10.23
5128,10.30
5129,10.36
5130,10.40
5131,10.41
5132,10.34
5133,10.19
5134,9.96
5135,9.68
5136,9.43
5137,9.25
5138,9.16
5139,9.22
5140,9.38
5141,9.63
5142,9.88
5143,10.06
5144,10.09
5145,9.96
5146,9.63
5147,9.18
5148,8.60
5149,8.00
5150,7.35
5151,6.77
5152,6.23
5153,5.79
5154,5.40
5155,5.07
5156,4.74
5157,4.42
5158,4.06
5159,3.68
5160,3.26
5161,2.84
5162,2.44
5163,2.08
5164,1.77
5165,1.55
5166,1.42
5167,1.38
5168,1.41
5169,1.50
5170,1.65
5171,1.86
5172,2.11
5173,2.40
5174,2.71
5175,3.03
5176,3.38
5177,3.75
5178,4.17
5179,4.63
5180,5.11
5181,5.54
5182,5.92
5183,6.17
5184,6.35
5185,6.41
5186,6.43
5187,6.41
5188,6.44
5189,6.54
5190,6.76
5191,7.06
5192,7.45
5193,7.85
5194,8.27
5195,8.65
5196,9.01
5197,9.31
5198,9.60
5199,9.84
5200,10.08
5201,10.28
5202,10.49
5203,10.66
5204,10.81
5205,10.91
5206,10.98
5207,11.02
5208,11.05
5209,11.08
5210,11.13
5211,11.19
5212,11.23
5213,11.22
5214,11.14
5215,10.99
5216,10.76
5217,10.48
5218,10.17
5219,9.88
5220,9.63
5221,9.46
5222,9.37
5223,9.36
5224,9.38
5225,9.41
5226,9.39
5227,9.33
5228,9.22
5229,9.07
5230,8.89
5231,8.70
5232,8.48
5233,8.25
5234,7.99
5235,7.73
5236,7.42
5237,7.09
5238,6.71
5239,6.33
5240,5.92
5241,5.55
5242,5.17
5243,4.83
5244,4.50
5245,4.22
5246,3.95
5247,3.70
5248,3.41
5249,3.13
5250,2.83
5251,2.55
5252,2.24
5253,1.92
5254,1.60
5255,1.31
5256,0.99
5257,0.68
5258,0.34
5259,0.02
5260,-0.33
5261,-0.67
5262,-1.00
5263,-1.28
5264,-1.51
5265,-1.68
5266,-1.83
5267,-1.95
5268,-2.05
5269,-2.13
5270,-2.24
5271,-2.37
5272,-2.53
5273,-2.70
5274,-2.85
5275,-2.98
5276,-3.09
5277,-3.14
5278,-3.09
5279,-2.95
5280,-2.70
5281,-2.38
5282,-2.02
5283,-1.68
5284,-1.38
5285,-1.15
5286,-1.01
5287,-0.96
5288,-0.96
5289,-0.99
5290,-1.02
5291,-1.01
5292,-0.95
5293,-0.88
5294,-0.80
5295,-0.75
5296,-0.76
5297,-0.83
5298,-0.97
5299,-1.14
5300,-1.31
5301,-1.45
5302,-1.52
5303,-1.51
5304,-1.46
5305,-1.38
5306,-1.31
5307,-1.28
5308,-1.30
5309,-1.38
5310,-1.48
5311,-1.57
5312,-1.58
5313,-1.51
5314,-1.33
5315,-1.08
5316,-0.76
5317,-0.41
5318,-0.08
5319,0.20
5320,0.42
5321,0.56
5322,0.67
5323,0.74
5324,0.79
5325,0.83
5326,0.90
5327,0.98
5328,1.09
5329,1.22
5330,1.41
5331,1.64
5332,1.93
5333,2.27
5334,2.69
5335,3.15
5336,3.62
5337,4.04
5338,4.40
5339,4.66
5340,4.85
5341,4.93
5342,4.93
5343,4.87
5344,4.78
5345,4.67
5346,4.56
5347,4.46
5348,4.35
5349,4.21
5350,3.99
5351,3.69
5352,3.32
5353,2.91
5354,2.44
5355,1.96
5356,1.50
5357,1.10
5358,0.75
5359,0.48
5360,0.24
5361,0.09
5362,-0.03
5363,-0.12
5364,-0.26
5365,-0.45
5366,-0.72
5367,-1.04
5368,-1.41
5369,-1.78
5370,-2.09
5371,-2.28
5372,-2.33
5373,-2.24
5374,-2.04
5375,-1.78
5376,-1.50
5377,-1.25
5378,-1.06
5379,-0.97
5380,-0.96
5381,-0.98
5382,-0.99
5383,-0.95
5384,-0.83
5385,-0.66
5386,-0.43
5387,-0.20
5388,0.07
5389,0.35
5390,0.72
5391,1.12
5392,1.61
5393,2.14
5394,2.74
5395,3.34
5396,3.97
5397,4.56
5398,5.12
5399,5.60
5400,6.05
5401,6.42
5402,6.78
5403,7.09
5404,7.37
5405,7.61
5406,7.80
5407,7.91
5408,7.97
5409,7.96
5410,7.93
5411,7.85
5412,7.73
5413,7.57
5414,7.36
5415,7.10
5416,6.80
5417,6.49
5418,6.20
5419,5.94
5420,5.72
5421,5.58
5422,5.51
5423,5.55
5424,5.62
5425,5.71
5426,5.76
5427,5.80
5428,5.78
5429,5.70
5430,5.53
5431,5.30
5432,5.04
5433,4.75
5434,4.46
5435,4.17
5436,3.92
5437,3.72
5438,3.61
5439,3.59
5440,3.66
5441,3.77
5442,3.89
5443,4.00
5444,4.12
5445,4.24
5446,4.37
5447,4.52
5448,4.70
5449,4.91
5450,5.21
5451,5.56
5452,5.98
5453,6.45
5454,6.94
5455,7.40
5456,7.80
5457,8.12
5458,8.36
5459,8.49
5460,8.56
5461,8.55
5462,8.54
5463,8.54
5464,8.59
5465,8.66
5466,8.78
5467,8.90
5468,9.00
5469,9.04
5470,9.03
5471,8.99
5472,8.98
5473,9.00
5474,9.08
5475,9.23
5476,9.48
5477,9.81
5478,10.17
5479,10.50
5480,10.80
5481,11.05
5482,11.25
5483,11.36
5484,11.41
5485,11.42
5486,11.42
5487,11.40
5488,11.37
5489,11.32
5490,11.30
5491,11.29
5492,11.31
5493,11.34
5494,11.40
5495,11.51
5496,11.70
5497,11.96
5498,12.26
5499,12.55
5500,12.84
5501,13.10
5502,13.31
5503,13.46
5504,13.55
5505,13.62
5506,13.70
5507,13.80
5508,13.93
5509,14.07
5510,14.19
5511,14.25
5512,14.23
5513,14.11
5514,13.89
5515,13.61
5516,13.28
5517,12.94
5518,12.59
5519,12.30
5520,12.05
5521,11.86
5522,11.71
5523,11.63
5524,11.58
5525,11.59
5526,11.61
5527,11.62
5528,11.56
5529,11.43
5530,11.21
5531,10.89
5532,10.51
5533,10.13
5534,9.83
5535,9.66
5536,9.63
5537,9.73
5538,9.92
5539,10.18
5540,10.44
5541,10.63
5542,10.69
5543,10.61
5544,10.42
5545,10.20
5546,9.98
5547,9.82
5548,9.70
5549,9.65
5550,9.65
5551,9.70
5552,9.75
5553,9.77
5554,9.73
5555,9.63
5556,9.45
5557,9.23
5558,8.97
5559,8.72
5560,8.48
5561,8.27
5562,8.09
5563,7.97
5564,7.87
5565,7.82
5566,7.77
5567,7.72
5568,7.62
5569,7.48
5570,7.26
5571,6.98
5572,6.63
5573,6.25
5574,5.81
5575,5.38
5576,4.98
5577,4.64
5578,4.35
5579,4.11
5580,3.92
5581,3.77
5582,3.65
5583,3.56
5584,3.51
5585,3.54
5586,3.67
5587,3.89
5588,4.20
5589,4.59
5590,5.06
5591,5.53
5592,5.97
5593,6.34
5594,6.69
5595,6.99
5596,7.27
5597,7.51
5598,7.79
5599,8.10
5600,8.44
5601,8.76
5602,9.02
5603,9.19
5604,9.30
5605,9.32
5606,9.28
5607,9.19
5608,9.09
5609,9.01
5610,8.95
5611,8.91
5612,8.90
5613,8.91
5614,8.92
5615,8.88
5616,8.77
5617,8.62
5618,8.46
5619,8.33
5620,8.22
5621,8.17
5622,8.15
5623,8.18
5624,8.16
5625,8.11
5626,7.95
5627,7.70
5628,7.31
5629,6.84
5630,6.32
5631,5.83
5632,5.35
5633,4.95
5634,4.59
5635,4.33
5636,4.10
5637,3.88
5638,3.60
5639,3.27
5640,2.88
5641,2.47
5642,2.04
5643,1.65
5644,1.32
5645,1.10
5646,0.99
5647,1.02
5648,1.12
5649,1.28
5650,1.44
5651,1.57
5652,1.66
5653,1.68
5654,1.68
5655,1.65
5656,1.68
5657,1.79
5658,2.03
5659,2.37
5660,2.81
5661,3.31
5662,3.88
5663,4.41
5664,4.90
5665,5.31
5666,5.69
5667,6.01
5668,6.35
5669,6.68
5670,7.08
5671,7.50
5672,7.97
5673,8.39
5674,8.79
5675,9.11
5676,9.38
5677,9.56
5678,9.70
5679,9.82
5680,9.95
5681,10.10
5682,10.26
5683,10.42
5684,10.60
5685,10.78
5686,10.93
5687,11.04
5688,11.10
5689,11.11
5690,11.08
5691,11.00
5692,10.89
5693,10.78
5694,10.65
5695,10.52
5696,10.37
5697,10.21
5698,10.02
5699,9.81
5700,9.57
5701,9.30
5702,9.01
5703,8.74
5704,8.52
5705,8.39
5706,8.33
5707,8.35
5708,8.44
5709,8.57
5710,8.66
5711,8.69
5712,8.60
5713,8.46
5714,8.26
5715,8.04
5716,7.78
5717,7.51
5718,7.24
5719,6.98
5720,6.69
5721,6.40
5722,6.09
5723,5.83
5724,5.60
5725,5.46
5726,5.39
5727,5.40
5728,5.44
5729,5.49
5730,5.50
5731,5.45
5732,5.30
5733,5.10
5734,4.83
5735,4.55
5736,4.25
5737,3.94
5738,3.61
5739,3.27
5740,2.91
5741,2.56
5742,2.20
5743,1.89
5744,1.61
5745,1.40
5746,1.21
5747,1.06
5748,0.89
5749,0.71
5750,0.52
5751,0.34
5752,0.19
5753,0.12
5754,0.12
5755,0.20
5756,0.33
5757,0.48
5758,0.63
5759,0.77
5760,0.88
5761,0.96
5762,1.06
5763,1.16
5764,1.28
5765,1.44
5766,1.66
5767,1.92
5768,2.18
5769,2.39
5770,2.54
5771,2.62
5772,2.66
5773,2.64
5774,2.59
5775,2.51
5776,2.42
5777,2.31
5778,2.22
5779,2.14
5780,2.08
5781,2.05
5782,2.06
5783,2.10
5784,2.19
5785,2.31
5786,2.45
5787,2.60
5788,2.74
5789,2.85
5790,2.90
5791,2.90
5792,2.86
5793,2.79
5794,2.74
5795,2.74
5796,2.80
5797,2.92
5798,3.08
5799,3.23
5800,3.36
5801,3.46
5802,3.54
5803,3.61
5804,3.70
5805,3.80
5806,3.95
5807,4.11
5808,4.33
5809,4.58
5810,4.90
5811,5.21
5812,5.53
5813,5.80
5814,6.10
5815,6.41
5816,6.72
5817,7.02
5818,7.33
5819,7.60
5820,7.84
5821,8.01
5822,8.12
5823,8.21
5824,8.28
5825,8.33
5826,8.34
5827,8.31
5828,8.22
5829,8.06
5830,7.80
5831,7.45
5832,6.99
5833,6.50
5834,6.00
5835,5.56
5836,5.15
5837,4.82
5838,4.53
5839,4.32
5840,4.12
5841,3.93
5842,3.72
5843,3.52
5844,3.32
5845,3.18
5846,3.06
5847,2.99
5848,2.95
5849,2.92
5850,2.90
5851,2.88
5852,2.89
5853,2.91
5854,2.97
5855,3.06
5856,3.19
5857,3.37
5858,3.59
5859,3.80
5860,3.97
5861,4.08
5862,4.19
5863,4.28
5864,4.39
5865,4.51
5866,4.73
5867,5.01
5868,5.39
5869,5.78
5870,6.24
5871,6.71
5872,7.20
5873,7.64
5874,8.06
5875,8.44
5876,8.80
5877,9.11
5878,9.39
5879,9.60
5880,9.79
5881,9.96
5882,10.17
5883,10.40
5884,10.67
5885,10.96
5886,11.25
5887,11.52
5888,11.74
5889,11.87
5890,11.91
5891,11.85
5892,11.70
5893,11.48
5894,11.18
5895,10.86
5896,10.52
5897,10.19
5898,9.84
5899,9.50
5900,9.13
5901,8.78
5902,8.40
5903,8.04
5904,7.67
5905,7.33
5906,7.00
5907,6.70
5908,6.38
5909,6.07
5910,5.70
5911,5.30
5912,4.86
5913,4.42
5914,3.97
5915,3.58
5916,3.20
5917,2.88
5918,2.59
5919,2.34
5920,2.10
5921,1.89
5922,1.67
5923,1.46
5924,1.26
5925,1.10
5926,0.98
5927,0.92
5928,0.92
5929,0.97
5930,1.05
5931,1.16
5932,1.29
5933,1.43
5934,1.58
5935,1.72
5936,1.85
5937,1.97
5938,2.06
5939,2.12
5940,2.16
5941,2.17
5942,2.14
5943,2.08
5944,2.03
5945,1.97
5946,1.93
5947,1.88
5948,1.87
5949,1.91
5950,2.01
5951,2.14
5952,2.31
5953,2.48
5954,2.68
5955,2.85
5956,3.02
5957,3.19
5958,3.42
5959,3.71
5960,4.08
5961,4.50
5962,4.96
5963,5.41
5964,5.82
5965,6.11
5966,6.30
5967,6.36
5968,6.36
5969,6.31
5970,6.31
5971,6.36
5972,6.50
5973,6.70
5974,6.99
5975,7.32
5976,7.66
5977,7.96
5978,8.21
5979,8.41
5980,8.60
5981,8.75
5982,8.91
5983,9.06
5984,9.29
5985,9.56
5986,9.89
5987,10.23
5988,10.54
5989,10.79
5990,10.96
5991,11.04
5992,11.03
5993,10.95
5994,10.82
5995,10.66
5996,10.46
5997,10.28
5998,10.09
5999,9.89
6000,9.67
6001,9.42
6002,9.14
6003,8.88
6004,8.62
6005,8.37
6006,8.09
6007,7.83
6008,7.59
6009,7.38
6010,7.17
6011,6.99
6012,6.82
6013,6.74
6014,6.70
6015,6.69
6016,6.68
6017,6.68
6018,6.70
6019,6.72
6020,6.71
6021,6.67
6022,6.59
6023,6.52
6024,6.44
6025,6.35
6026,6.25
6027,6.15
6028,6.05
6029,5.98
6030,5.91
6031,5.86
6032,5.80
6033,5.78
6034,5.76
6035,5.76
6036,5.71
6037,5.63
6038,5.48
6039,5.28
6040,4.99
6041,4.63
6042,4.23
6043,3.86
6044,3.54
6045,3.32
6046,3.17
6047,3.10
6048,3.04
6049,2.98
6050,2.82
6051,2.56
6052,2.18
6053,1.75
6054,1.27
6055,0.83
6056,0.43
6057,0.13
6058,-0.12
6059,-0.31
6060,-0.47
6061,-0.59
6062,-0.68
6063,-0.73
6064,-0.76
6065,-0.75
6066,-0.68
6067,-0.56
6068,-0.40
6069,-0.25
6070,-0.13
6071,-0.04
6072,0.03
6073,0.08
6074,0.15
6075,0.24
6076,0.41
6077,0.65
6078,0.97
6079,1.36
6080,1.79
6081,2.24
6082,2.69
6083,3.10
6084,3.43
6085,3.65
6086,3.77
6087,3.81
6088,3.81
6089,3.78
6090,3.72
6091,3.64
6092,3.56
6093,3.47
6094,3.37
6095,3.25
6096,3.12
6097,2.98
6098,2.85
6099,2.75
6100,2.67
6101,2.66
6102,2.65
6103,2.66
6104,2.62
6105,2.51
6106,2.28
6107,1.96
6108,1.54
6109,1.08
6110,0.57
6111,0.08
6112,-0.43
6113,-0.92
6114,-1.41
6115,-1.88
6116,-2.34
6117,-2.77
6118,-3.19
6119,-3.53
6120,-3.83
6121,-4.03
6122,-4.18
6123,-4.26
6124,-4.31
6125,-4.33
6126,-4.39
6127,-4.49
6128,-4.64
6129,-4.82
6130,-5.00
6131,-5.14
6132,-5.21
6133,-5.18
6134,-5.05
6135,-4.86
6136,-4.61
6137,-4.33
6138,-4.00
6139,-3.63
6140,-3.22
6141,-2.79
6142,-2.34
6143,-1.91
6144,-1.50
6145,-1.14
6146,-0.84
6147,-0.61
6148,-0.42
6149,-0.25
6150,-0.04
6151,0.20
6152,0.51
6153,0.83
6154,1.20
6155,1.54
6156,1.88
6157,2.16
6158,2.41
6159,2.62
6160,2.85
6161,3.08
6162,3.35
6163,3.60
6164,3.82
6165,3.97
6166,4.06
6167,4.10
6168,4.10
6169,4.10
6170,4.13
6171,4.19
6172,4.25
6173,4.30
6174,4.32
6175,4.25
6176,4.10
6177,3.84
6178,3.53
6179,3.20
6180,2.92
6181,2.73
6182,2.65
6183,2.70
6184,2.84
6185,3.01
6186,3.16
6187,3.27
6188,3.31
6189,3.31
6190,3.28
6191,3.23
6192,3.18
6193,3.13
6194,3.12
6195,3.11
6196,3.12
6197,3.10
6198,3.08
6199,3.06
6200,3.05
6201,3.05
6202,3.08
6203,3.13
6204,3.23
6205,3.35
6206,3.49
6207,3.62
6208,3.76
6209,3.87
6210,3.96
6211,4.03
6212,4.07
6213,4.10
6214,4.10
6215,4.05
6216,3.98
6217,3.90
6218,3.82
6219,3.75
6220,3.68
6221,3.62
6222,3.56
6223,3.51
6224,3.44
6225,3.38
6226,3.34
6227,3.32
6228,3.34
6229,3.41
6230,3.56
6231,3.77
6232,4.01
6233,4.23
6234,4.44
6235,4.63
6236,4.82
6237,4.99
6238,5.18
6239,5.40
6240,5.69
6241,6.01
6242,6.36
6243,6.67
6244,6.94
6245,7.11
6246,7.20
6247,7.19
6248,7.16
6249,7.14
6250,7.16
6251,7.24
6252,7.35
6253,7.49
6254,7.62
6255,7.73
6256,7.79
6257,7.77
6258,7.68
6259,7.53
6260,7.35
6261,7.17
6262,6.99
6263,6.83
6264,6.67
6265,6.56
6266,6.49
6267,6.48
6268,6.48
6269,6.52
6270,6.58
6271,6.64
6272,6.67
6273,6.64
6274,6.56
6275,6.45
6276,6.33
6277,6.24
6278,6.20
6279,6.23
6280,6.33
6281,6.46
6282,6.62
6283,6.77
6284,6.90
6285,6.98
6286,7.04
6287,7.08
6288,7.14
6289,7.24
6290,7.40
6291,7.60
6292,7.87
6293,8.17
6294,8.48
6295,8.78
6296,9.06
6297,9.30
6298,9.50
6299,9.66
6300,9.80
6301,9.92
6302,10.02
6303,10.09
6304,10.14
6305,10.17
6306,10.12
6307,9.99
6308,9.75
6309,9.42
6310,9.01
6311,8.55
6312,8.03
6313,7.52
6314,7.03
6315,6.63
6316,6.27
6317,5.98
6318,5.68
6319,5.39
6320,5.04
6321,4.67
6322,4.24
6323,3.84
6324,3.46
6325,3.17
6326,2.98
6327,2.93
6328,2.95
6329,3.04
6330,3.15
6331,3.26
6332,3.31
6333,3.32
6334,3.29
6335,3.25
6336,3.22
6337,3.19
6338,3.19
6339,3.21
6340,3.26
6341,3.31
6342,3.35
6343,3.40
6344,3.50
6345,3.64
6346,3.84
6347,4.08
6348,4.37
6349,4.67
6350,5.00
6351,5.31
6352,5.62
6353,5.92
6354,6.27
6355,6.65
6356,7.11
6357,7.60
6358,8.16
6359,8.71
6360,9.26
6361,9.74
6362,10.17
6363,10.51
6364,10.79
6365,10.97
6366,11.08
6367,11.11
6368,11.09
6369,11.03
6370,10.91
6371,10.74
6372,10.51
6373,10.26
6374,9.97
6375,9.68
6376,9.36
6377,9.04
6378,8.68
6379,8.32
6380,7.92
6381,7.51
6382,7.06
6383,6.65
6384,6.27
6385,6.02
6386,5.84
6387,5.75
6388,5.66
6389,5.58
6390,5.40
6391,5.16
6392,4.80
6393,4.39
6394,3.94
6395,3.55
6396,3.24
6397,3.05
6398,2.90
6399,2.79
6400,2.66
6401,2.51
6402,2.29
6403,2.02
6404,1.71
6405,1.44
6406,1.25
6407,1.17
6408,1.15
6409,1.19
6410,1.26
6411,1.35
6412,1.41
6413,1.42
6414,1.37
6415,1.30
6416,1.25
6417,1.26
6418,1.37
6419,1.56
6420,1.83
6421,2.14
6422,2.49
6423,2.82
6424,3.11
6425,3.30
6426,3.38
6427,3.36
6428,3.30
6429,3.24
6430,3.25
6431,3.33
6432,3.52
6433,3.79
6434,4.12
6435,4.45
6436,4.75
6437,4.99
6438,5.16
6439,5.29
6440,5.43
6441,5.60
6442,5.84
6443,6.14
6444,6.48
6445,6.82
6446,7.15
6447,7.42
6448,7.61
6449,7.69
6450,7.71
6451,7.67
6452,7.62
6453,7.57
6454,7.55
6455,7.57
6456,7.67
6457,7.81
6458,8.03
6459,8.31
6460,8.66
6461,9.05
6462,9.45
6463,9.83
6464,10.22
6465,10.57
6466,10.88
6467,11.11
6468,11.32
6469,11.49
6470,11.64
6471,11.73
6472,11.77
6473,11.76
6474,11.75
6475,11.73
6476,11.72
6477,11.72
6478,11.72
6479,11.69
6480,11.61
6481,11.43
6482,11.15
6483,10.81
6484,10.44
6485,10.13
6486,9.88
6487,9.73
6488,9.68
6489,9.72
6490,9.77
6491,9.79
6492,9.70
6493,9.50
6494,9.22
6495,8.91
6496,8.65
6497,8.48
6498,8.44
6499,8.53
6500,8.74
6501,9.02
6502,9.28
6503,9.47
6504,9.55
6505,9.55
6506,9.47
6507,9.35
6508,9.20
6509,9.05
6510,8.93
6511,8.85
6512,8.83
6513,8.85
6514,8.87
6515,8.89
6516,8.90
6517,8.87
6518,8.77
6519,8.62
6520,8.40
6521,8.16
6522,7.90
6523,7.70
6524,7.57
6525,7.55
6526,7.57
6527,7.62
6528,7.62
6529,7.55
6530,7.34
6531,6.99
6532,6.49
6533,5.94
6534,5.36
6535,4.81
6536,4.32
6537,3.95
6538,3.69
6539,3.56
6540,3.52
6541,3.55
6542,3.57
6543,3.59
6544,3.59
6545,3.57
6546,3.55
6547,3.54
6548,3.60
6549,3.74
6550,4.00
6551,4.34
6552,4.76
6553,5.22
6554,5.72
6555,6.17
6556,6.60
6557,6.98
6558,7.35
6559,7.71
6560,8.05
6561,8.35
6562,8.61
6563,8.81
6564,8.98
6565,9.09
6566,9.17
6567,9.21
6568,9.24
6569,9.26
6570,9.24
6571,9.16
6572,9.03
6573,8.85
6574,8.65
6575,8.44
6576,8.22
6577,8.07
6578,8.03
6579,8.11
6580,8.25
6581,8.40
6582,8.49
6583,8.50
6584,8.36
6585,8.11
6586,7.70
6587,7.24
6588,6.75
6589,6.31
6590,5.91
6591,5.58
6592,5.26
6593,4.95
6594,4.61
6595,4.25
6596,3.82
6597,3.37
6598,2.86
6599,2.36
6600,1.86
6601,1.42
6602,1.02
6603,0.69
6604,0.44
6605,0.30
6606,0.24
6607,0.26
6608,0.33
6609,0.45
6610,0.61
6611,0.81
6612,1.02
6613,1.23
6614,1.43
6615,1.62
6616,1.81
6617,1.98
6618,2.18
6619,2.39
6620,2.67
6621,2.98
6622,3.39
6623,3.81
6624,4.25
6625,4.64
6626,4.98
6627,5.23
6628,5.45
6629,5.62
6630,5.80
6631,6.02
6632,6.31
6633,6.65
6634,7.03
6635,7.41
6636,7.81
6637,8.19
6638,8.58
6639,8.95
6640,9.32
6641,9.66
6642,9.97
6643,10.23
6644,10.40
6645,10.46
6646,10.41
6647,10.27
6648,10.08
6649,9.88
6650,9.70
6651,9.58
6652,9.53
6653,9.55
6654,9.61
6655,9.66
6656,9.65
6657,9.58
6658,9.45
6659,9.28
6660,9.09
6661,8.91
6662,8.77
6663,8.70
6664,8.68
6665,8.72
6666,8.80
6667,8.89
6668,8.94
6669,8.93
6670,8.86
6671,8.74
6672,8.55
6673,8.32
6674,8.04
6675,7.75
6676,7.48
6677,7.24
6678,7.04
6679,6.89
6680,6.73
6681,6.54
6682,6.28
6683,5.97
6684,5.62
6685,5.29
6686,5.00
6687,4.79
6688,4.69
6689,4.70
6690,4.75
6691,4.81
6692,4.82
6693,4.77
6694,4.61
6695,4.36
6696,4.02
6697,3.66
6698,3.31
6699,3.02
6700,2.77
6701,2.57
6702,2.35
6703,2.09
6704,1.76
6705,1.37
6706,0.92
6707,0.46
6708,0.03
6709,-0.28
6710,-0.41
6711,-0.36
6712,-0.17
6713,0.08
6714,0.31
6715,0.46
6716,0.52
6717,0.49
6718,0.38
6719,0.27
6720,0.22
6721,0.27
6722,0.40
6723,0.58
6724,0.79
6725,0.98
6726,1.14
6727,1.23
6728,1.25
6729,1.23
6730,1.22
6731,1.25
6732,1.32
6733,1.41
6734,1.51
6735,1.57
6736,1.54
6737,1.41
6738,1.20
6739,0.94
6740,0.66
6741,0.41
6742,0.20
6743,0.09
6744,0.04
6745,0.05
6746,0.07
6747,0.10
6748,0.13
6749,0.13
6750,0.08
6751,-0.01
6752,-0.13
6753,-0.25
6754,-0.36
6755,-0.43
6756,-0.45
6757,-0.39
6758,-0.26
6759,-0.06
6760,0.17
6761,0.40
6762,0.60
6763,0.76
6764,0.89
6765,0.99
6766,1.07
6767,1.11
6768,1.14
6769,1.17
6770,1.21
6771,1.24
6772,1.31
6773,1.41
6774,1.57
6775,1.79
6776,2.07
6777,2.40
6778,2.79
6779,3.19
6780,3.58
6781,3.91
6782,4.17
6783,4.33
6784,4.39
6785,4.35
6786,4.21
6787,4.00
6788,3.71
6789,3.38
6790,3.00
6791,2.63
6792,2.24
6793,1.86
6794,1.49
6795,1.15
6796,0.80
6797,0.45
6798,0.08
6799,-0.29
6800,-0.68
6801,-1.04
6802,-1.40
6803,-1.71
6804,-1.99
6805,-2.21
6806,-2.38
6807,-2.46
6808,-2.49
6809,-2.50
6810,-2.53
6811,-2.58
6812,-2.61
6813,-2.59
6814,-2.53
6815,-2.43
6816,-2.28
6817,-2.12
6818,-1.94
6819,-1.80
6820,-1.68
6821,-1.61
6822,-1.56
6823,-1.51
6824,-1.40
6825,-1.24
6826,-0.96
6827,-0.64
6828,-0.26
6829,0.12
6830,0.52
6831,0.93
6832,1.39
6833,1.86
6834,2.37
6835,2.88
6836,3.44
6837,3.97
6838,4.46
6839,4.84
6840,5.15
6841,5.39
6842,5.61
6843,5.81
6844,6.05
6845,6.30
6846,6.56
6847,6.77
6848,6.91
6849,6.92
6850,6.79
6851,6.54
6852,6.20
6853,5.83
6854,5.49
6855,5.19
6856,4.94
6857,4.78
6858,4.64
6859,4.52
6860,4.32
6861,4.03
6862,3.63
6863,3.17
6864,2.65
6865,2.17
6866,1.72
6867,1.35
6868,1.04
6869,0.80
6870,0.57
6871,0.36
6872,0.09
6873,-0.23
6874,-0.62
6875,-1.02
6876,-1.43
6877,-1.80
6878,-2.12
6879,-2.37
6880,-2.57
6881,-2.73
6882,-2.88
6883,-3.02
6884,-3.18
6885,-3.34
6886,-3.51
6887,-3.66
6888,-3.77
6889,-3.82
6890,-3.80
6891,-3.70
6892,-3.55
6893,-3.34
6894,-3.09
6895,-2.84
6896,-2.58
6897,-2.33
6898,-2.08
6899,-1.86
6900,-1.66
6901,-1.50
6902,-1.37
6903,-1.26
6904,-1.12
6905,-0.97
6906,-0.75
6907,-0.49
6908,-0.15
6909,0.21
6910,0.60
6911,0.94
6912,1.30
6913,1.62
6914,2.00
6915,2.37
6916,2.80
6917,3.27
6918,3.82
6919,4.42
6920,5.10
6921,5.75
6922,6.37
6923,6.89
6924,7.38
6925,7.78
6926,8.15
6927,8.43
6928,8.70
6929,8.92
6930,9.16
6931,9.37
6932,9.59
6933,9.77
6934,9.98
6935,10.18
6936,10.47
6937,10.79
6938,11.23
6939,11.74
6940,12.38
6941,13.11
6942,13.91
6943,14.70
6944,15.45
6945,16.07
6946,16.58
6947,16.93
6948,17.14
6949,17.20
6950,17.19
6951,17.13
6952,17.10
6953,17.11
6954,17.19
6955,17.31
6956,17.45
6957,17.57
6958,17.65
6959,17.65
6960,17.56
6961,17.38
6962,17.13
6963,16.83
6964,16.49
6965,16.13
6966,15.76
6967,15.42
6968,15.11
6969,14.83
6970,14.54
6971,14.23
6972,13.90
6973,13.61
6974,13.35
6975,13.14
6976,12.98
6977,12.89
6978,12.89
6979,12.96
6980,13.03
6981,13.07
6982,13.04
6983,12.93
6984,12.74
6985,12.50
6986,12.26
6987,12.07
6988,11.91
6989,11.82
6990,11.76
6991,11.72
6992,11.64
6993,11.53
6994,11.37
6995,11.19
6996,10.99
6997,10.79
6998,10.57
6999,10.35
7000,10.12
7001,9.90
7002,9.67
7003,9.45
7004,9.23
7005,9.08
7006,8.96
7007,8.91
7008,8.87
7009,8.83
7010,8.70
7011,8.50
7012,8.19
7013,7.81
7014,7.35
7015,6.89
7016,6.43
7017,6.02
7018,5.65
7019,5.36
7020,5.11
7021,4.89
7022,4.68
7023,4.48
7024,4.31
7025,4.21
7026,4.18
7027,4.23
7028,4.33
7029,4.47
7030,4.69
7031,4.97
7032,5.32
7033,5.70
7034,6.12
7035,6.56
7036,7.07
7037,7.60
7038,8.15
7039,8.64
7040,9.07
7041,9.41
7042,9.68
7043,9.88
7044,10.05
7045,10.19
7046,10.34
7047,10.47
7048,10.59
7049,10.66
7050,10.68
7051,10.64
7052,10.54
7053,10.40
7054,10.24
7055,10.07
7056,9.93
7057,9.86
7058,9.84
7059,9.87
7060,9.89
7061,9.91
7062,9.89
7063,9.84
7064,9.71
7065,9.52
7066,9.21
7067,8.86
7068,8.46
7069,8.07
7070,7.64
7071,7.21
7072,6.77
7073,6.34
7074,5.84
7075,5.33
7076,4.79
7077,4.28
7078,3.80
7079,3.38
7080,2.99
7081,2.70
7082,2.47
7083,2.33
7084,2.26
7085,2.23
7086,2.19
7087,2.14
7088,2.07
7089,2.01
7090,1.95
7091,1.92
7092,1.94
7093,2.01
7094,2.15
7095,2.34
7096,2.61
7097,2.93
7098,3.30
7099,3.67
7100,4.04
7101,4.36
7102,4.65
7103,4.90
7104,5.14
7105,5.32
7106,5.48
7107,5.60
7108,5.77
7109,5.98
7110,6.28
7111,6.63
7112,7.06
7113,7.51
7114,8.02
7115,8.51
7116,8.96
7117,9.30
7118,9.60
7119,9.83
7120,10.04
7121,10.21
7122,10.39
7123,10.59
7124,10.85
7125,11.11
7126,11.37
7127,11.56
7128,11.69
7129,11.75
7130,11.74
7131,11.65
7132,11.49
7133,11.28
7134,11.03
7135,10.75
7136,10.49
7137,10.27
7138,10.11
7139,10.03
7140,10.03
7141,10.09
7142,10.21
7143,10.35
7144,10.45
7145,10.49
7146,10.43
7147,10.26
7148,10.01
7149,9.72
7150,9.45
7151,9.22
7152,9.05
7153,8.95
7154,8.92
7155,8.93
7156,8.91
7157,8.82
7158,8.65
7159,8.43
7160,8.16
7161,7.86
7162,7.53
7163,7.23
7164,6.94
7165,6.71
7166,6.49
7167,6.29
7168,6.08
7169,5.86
7170,5.60
7171,5.36
7172,5.13
7173,4.99
7174,4.90
7175,4.90
7176,4.93
7177,4.97
7178,4.93
7179,4.79
7180,4.53
7181,4.19
7182,3.76
7183,3.30
7184,2.84
7185,2.43
7186,2.10
7187,1.87
7188,1.71
7189,1.60
7190,1.48
7191,1.36
7192,1.23
7193,0.77
7194,0.78
7195,1.37
7196,1.76
7197,0.36
7198,-1.09
7199,1.78
7200,6.26
