1,-43.78
2,-63.10
3,-64.28
4,-57.82
5,-55.57
6,-58.25
7,-59.77
8,-58.89
9,-57.89
10,-58.19
11,-58.49
12,-58.54
13,-58.30
14,-58.27
15,-58.26
16,-58.24
17,-58.22
18,-58.19
19,-58.17
20,-58.16
21,-58.16
22,-58.17
23,-58.18
24,-58.19
25,-58.21
26,-58.23
27,-58.26
28,-58.27
29,-58.29
30,-58.32
31,-58.34
32,-58.35
33,-58.35
34,-58.34
35,-58.34
36,-58.34
37,-58.33
38,-58.31
39,-58.29
40,-58.28
41,-58.28
42,-58.28
43,-58.27
44,-58.26
45,-58.26
46,-58.27
47,-58.28
48,-58.29
49,-58.29
50,-58.29
51,-58.29
52,-58.28
53,-58.27
54,-58.26
55,-58.25
56,-58.24
57,-58.23
58,-58.22
59,-58.21
60,-58.20
61,-58.21
62,-58.21
63,-58.21
64,-58.20
65,-58.20
66,-58.21
67,-58.22
68,-58.22
69,-58.22
70,-58.23
71,-58.23
72,-58.22
73,-58.20
74,-58.18
75,-58.15
76,-58.13
77,-58.10
78,-58.07
79,-58.04
80,-58.01
81,-57.98
82,-57.95
83,-57.92
84,-57.90
85,-57.90
86,-57.90
87,-57.91
88,-57.91
89,-57.93
90,-57.96
91,-57.99
92,-58.02
93,-58.04
94,-58.06
95,-58.09
96,-58.11
97,-58.14
98,-58.16
99,-58.17
100,-58.19
101,-58.20
102,-58.21
103,-58.22
104,-58.23
105,-58.24
106,-58.26
107,-58.27
108,-58.29
109,-58.31
110,-58.34
111,-58.36
112,-58.40
113,-58.43
114,-58.46
115,-58.49
116,-58.51
117,-58.55
118,-58.58
119,-58.61
120,-58.62
121,-58.62
122,-58.62
123,-58.61
124,-58.58
125,-58.55
126,-58.51
127,-58.46
128,-58.42
129,-58.37
130,-58.33
131,-58.29
132,-58.27
133,-58.26
134,-58.24
135,-58.24
136,-58.26
137,-58.29
138,-58.32
139,-58.35
140,-58.38
141,-58.41
142,-58.44
143,-58.46
144,-58.47
145,-58.47
146,-58.46
147,-58.45
148,-58.44
149,-58.42
150,-58.40
151,-58.38
152,-58.35
153,-58.32
154,-58.29
155,-58.27
156,-58.26
157,-58.25
158,-58.24
159,-58.23
160,-58.22
161,-58.21
162,-58.20
163,-58.19
164,-58.18
165,-58.18
166,-58.18
167,-58.17
168,-58.16
169,-58.15
170,-58.14
171,-58.13
172,-58.12
173,-58.10
174,-58.08
175,-58.06
176,-58.03
177,-58.00
178,-57.97
179,-57.94
180,-57.91
181,-57.88
182,-57.85
183,-57.82
184,-57.79
185,-57.76
186,-57.74
187,-57.72
188,-57.69
189,-57.67
190,-57.64
191,-57.62
192,-57.60
193,-57.57
194,-57.53
195,-57.52
196,-57.50
197,-57.50
198,-57.48
199,-57.47
200,-57.47
201,-57.48
202,-57.50
203,-57.52
204,-57.55
205,-57.59
206,-57.63
207,-57.67
208,-57.70
209,-57.73
210,-57.77
211,-57.80
212,-57.81
213,-57.82
214,-57.81
215,-57.80
216,-57.77
217,-57.73
218,-57.69
219,-57.65
220,-57.61
221,-57.57
222,-57.53
223,-57.50
224,-57.48
225,-57.47
226,-57.47
227,-57.48
228,-57.50
229,-57.52
230,-57.54
231,-57.56
232,-57.58
233,-57.59
234,-57.59
235,-57.59
236,-57.58
237,-57.57
238,-57.53
239,-57.49
240,-57.45
241,-57.40
242,-57.35
243,-57.29
244,-57.25
245,-57.22
246,-57.20
247,-57.18
248,-57.17
249,-57.17
250,-57.18
251,-57.20
252,-57.23
253,-57.25
254,-57.29
255,-57.33
256,-57.37
257,-57.42
258,-57.48
259,-57.54
260,-57.60
261,-57.66
262,-57.72
263,-57.78
264,-57.84
265,-57.89
266,-57.93
267,-57.95
268,-57.98
269,-58.01
270,-58.04
271,-58.07
272,-58.10
273,-58.12
274,-58.14
275,-58.15
276,-58.18
277,-58.20
278,-58.22
279,-58.23
280,-58.26
281,-58.29
282,-58.31
283,-58.33
284,-58.36
285,-58.39
286,-58.42
287,-58.45
288,-58.47
289,-58.49
290,-58.51
291,-58.52
292,-58.52
293,-58.51
294,-58.50
295,-58.49
296,-58.47
297,-58.44
298,-58.40
299,-58.36
300,-58.33
301,-58.30
302,-58.28
303,-58.26
304,-58.23
305,-58.21
306,-58.20
307,-58.20
308,-58.21
309,-58.22
310,-58.23
311,-58.24
312,-58.25
313,-58.26
314,-58.27
315,-58.29
316,-58.32
317,-58.35
318,-58.37
319,-58.40
320,-58.42
321,-58.44
322,-58.48
323,-58.51
324,-58.54
325,-58.55
326,-58.57
327,-58.59
328,-58.61
329,-58.62
330,-58.62
331,-58.62
332,-58.62
333,-58.64
334,-58.65
335,-58.65
336,-58.67
337,-58.69
338,-58.71
339,-58.73
340,-58.75
341,-58.77
342,-58.78
343,-58.78
344,-58.78
345,-58.77
346,-58.75
347,-58.72
348,-58.68
349,-58.63
350,-58.57
351,-58.50
352,-58.43
353,-58.37
354,-58.32
355,-58.27
356,-58.22
357,-58.18
358,-58.15
359,-58.13
360,-58.13
361,-58.14
362,-58.15
363,-58.16
364,-58.18
365,-58.19
366,-58.21
367,-58.22
368,-58.23
369,-58.24
370,-58.24
371,-58.23
372,-58.22
373,-58.21
374,-58.21
375,-58.21
376,-58.20
377,-58.19
378,-58.19
379,-58.20
380,-58.21
381,-58.22
382,-58.23
383,-58.25
384,-58.27
385,-58.29
386,-58.32
387,-58.33
388,-58.35
389,-58.37
390,-58.40
391,-58.43
392,-58.46
393,-58.47
394,-58.50
395,-58.52
396,-58.56
397,-58.60
398,-58.64
399,-58.68
400,-58.72
401,-58.76
402,-58.80
403,-58.83
404,-58.85
405,-58.86
406,-58.87
407,-58.87
408,-58.88
409,-58.88
410,-58.87
411,-58.86
412,-58.86
413,-58.86
414,-58.86
415,-58.86
416,-58.86
417,-58.86
418,-58.86
419,-58.87
420,-58.89
421,-58.90
422,-58.90
423,-58.89
424,-58.87
425,-58.85
426,-58.83
427,-58.81
428,-58.79
429,-58.76
430,-58.73
431,-58.71
432,-58.69
433,-58.68
434,-58.69
435,-58.70
436,-58.74
437,-58.78
438,-58.82
439,-58.87
440,-58.93
441,-58.98
442,-59.05
443,-59.11
444,-59.17
445,-59.22
446,-59.26
447,-59.28
448,-59.31
449,-59.33
450,-59.34
451,-59.35
452,-59.36
453,-59.37
454,-59.38
455,-59.39
456,-59.40
457,-59.41
458,-59.42
459,-59.44
460,-59.47
461,-59.50
462,-59.53
463,-59.55
464,-59.56
465,-59.59
466,-59.60
467,-59.61
468,-59.61
469,-59.61
470,-59.61
471,-59.61
472,-59.61
473,-59.60
474,-59.59
475,-59.58
476,-59.57
477,-59.57
478,-59.57
479,-59.57
480,-59.57
481,-59.59
482,-59.60
483,-59.62
484,-59.64
485,-59.66
486,-59.69
487,-59.73
488,-59.77
489,-59.81
490,-59.86
491,-59.91
492,-59.95
493,-59.99
494,-60.03
495,-60.06
496,-60.08
497,-60.10
498,-60.12
499,-60.12
500,-60.10
501,-60.09
502,-60.06
503,-60.02
504,-59.97
505,-59.92
506,-59.86
507,-59.81
508,-59.74
509,-59.67
510,-59.60
511,-59.54
512,-59.49
513,-59.45
514,-59.42
515,-59.40
516,-59.39
517,-59.39
518,-59.40
519,-59.42
520,-59.46
521,-59.51
522,-59.56
523,-59.61
524,-59.66
525,-59.72
526,-59.78
527,-59.83
528,-59.87
529,-59.90
530,-59.93
531,-59.96
532,-59.98
533,-59.99
534,-59.99
535,-59.98
536,-59.96
537,-59.94
538,-59.92
539,-59.90
540,-59.88
541,-59.85
542,-59.82
543,-59.79
544,-59.76
545,-59.73
546,-59.70
547,-59.66
548,-59.62
549,-59.58
550,-59.53
551,-59.48
552,-59.43
553,-59.38
554,-59.33
555,-59.28
556,-59.23
557,-59.19
558,-59.16
559,-59.14
560,-59.12
561,-59.12
562,-59.12
563,-59.14
564,-59.17
565,-59.19
566,-59.21
567,-59.24
568,-59.27
569,-59.30
570,-59.34
571,-59.37
572,-59.42
573,-59.45
574,-59.49
575,-59.54
576,-59.61
577,-59.69
578,-59.77
579,-59.86
580,-59.96
581,-60.07
582,-60.18
583,-60.29
584,-60.40
585,-60.50
586,-60.59
587,-60.67
588,-60.74
589,-60.80
590,-60.85
591,-60.87
592,-60.89
593,-60.91
594,-60.93
595,-60.94
596,-60.95
597,-60.96
598,-60.97
599,-60.98
600,-60.99
601,-61.00
602,-61.01
603,-61.02
604,-61.03
605,-61.04
606,-61.05
607,-61.07
608,-61.09
609,-61.11
610,-61.13
611,-61.16
612,-61.20
613,-61.23
614,-61.25
615,-61.26
616,-61.27
617,-61.28
618,-61.27
619,-61.25
620,-61.23
621,-61.20
622,-61.16
623,-61.12
624,-61.08
625,-61.04
626,-61.00
627,-60.97
628,-60.95
629,-60.94
630,-60.95
631,-60.97
632,-61.00
633,-61.04
634,-61.09
635,-61.15
636,-61.21
637,-61.27
638,-61.33
639,-61.40
640,-61.47
641,-61.53
642,-61.58
643,-61.61
644,-61.63
645,-61.65
646,-61.66
647,-61.65
648,-61.63
649,-61.61
650,-61.59
651,-61.57
652,-61.54
653,-61.51
654,-61.49
655,-61.47
656,-61.45
657,-61.43
658,-61.41
659,-61.40
660,-61.40
661,-61.39
662,-61.37
663,-61.35
664,-61.33
665,-61.31
666,-61.29
667,-61.27
668,-61.25
669,-61.22
670,-61.18
671,-61.16
672,-61.13
673,-61.10
674,-61.06
675,-61.02
676,-60.98
677,-60.94
678,-60.90
679,-60.86
680,-60.82
681,-60.78
682,-60.74
683,-60.69
684,-60.64
685,-60.59
686,-60.54
687,-60.50
688,-60.47
689,-60.44
690,-60.42
691,-60.40
692,-60.38
693,-60.36
694,-60.34
695,-60.32
696,-60.30
697,-60.28
698,-60.26
699,-60.24
700,-60.22
701,-60.19
702,-60.15
703,-60.11
704,-60.07
705,-60.03
706,-59.99
707,-59.95
708,-59.92
709,-59.90
710,-59.89
711,-59.88
712,-59.86
713,-59.85
714,-59.85
715,-59.87
716,-59.87
717,-59.87
718,-59.88
719,-59.88
720,-59.90
721,-59.91
722,-59.92
723,-59.92
724,-59.94
725,-59.95
726,-59.95
727,-59.94
728,-59.93
729,-59.92
730,-59.90
731,-59.88
732,-59.86
733,-59.83
734,-59.79
735,-59.75
736,-59.72
737,-59.69
738,-59.66
739,-59.64
740,-59.63
741,-59.63
742,-59.63
743,-59.63
744,-59.64
745,-59.66
746,-59.69
747,-59.71
748,-59.72
749,-59.73
750,-59.74
751,-59.76
752,-59.77
753,-59.77
754,-59.77
755,-59.78
756,-59.80
757,-59.82
758,-59.84
759,-59.87
760,-59.91
761,-59.95
762,-60.00
763,-60.06
764,-60.12
765,-60.19
766,-60.27
767,-60.34
768,-60.39
769,-60.44
770,-60.49
771,-60.54
772,-60.59
773,-60.62
774,-60.63
775,-60.64
776,-60.65
777,-60.66
778,-60.66
779,-60.65
780,-60.64
781,-60.63
782,-60.62
783,-60.61
784,-60.60
785,-60.59
786,-60.58
787,-60.57
788,-60.56
789,-60.55
790,-60.54
791,-60.52
792,-60.49
793,-60.48
794,-60.46
795,-60.44
796,-60.42
797,-60.40
798,-60.38
799,-60.37
800,-60.36
801,-60.35
802,-60.35
803,-60.35
804,-60.35
805,-60.34
806,-60.32
807,-60.30
808,-60.28
809,-60.26
810,-60.24
811,-60.21
812,-60.17
813,-60.13
814,-60.09
815,-60.05
816,-60.01
817,-59.98
818,-59.96
819,-59.95
820,-59.95
821,-59.95
822,-59.95
823,-59.96
824,-59.98
825,-60.02
826,-60.04
827,-60.06
828,-60.08
829,-60.09
830,-60.09
831,-60.09
832,-60.08
833,-60.06
834,-60.03
835,-59.99
836,-59.95
837,-59.91
838,-59.87
839,-59.83
840,-59.79
841,-59.77
842,-59.74
843,-59.72
844,-59.71
845,-59.71
846,-59.72
847,-59.74
848,-59.77
849,-59.80
850,-59.83
851,-59.86
852,-59.89
853,-59.92
854,-59.94
855,-59.95
856,-59.95
857,-59.93
858,-59.90
859,-59.85
860,-59.81
861,-59.76
862,-59.71
863,-59.66
864,-59.61
865,-59.57
866,-59.54
867,-59.52
868,-59.51
869,-59.51
870,-59.52
871,-59.54
872,-59.57
873,-59.60
874,-59.63
875,-59.66
876,-59.69
877,-59.71
878,-59.72
879,-59.73
880,-59.74
881,-59.74
882,-59.73
883,-59.72
884,-59.71
885,-59.70
886,-59.68
887,-59.66
888,-59.65
889,-59.63
890,-59.59
891,-59.56
892,-59.52
893,-59.48
894,-59.42
895,-59.36
896,-59.29
897,-59.23
898,-59.16
899,-59.08
900,-59.00
901,-58.93
902,-58.86
903,-58.80
904,-58.73
905,-58.67
906,-58.61
907,-58.55
908,-58.49
909,-58.43
910,-58.37
911,-58.33
912,-58.28
913,-58.26
914,-58.24
915,-58.22
916,-58.22
917,-58.23
918,-58.26
919,-58.30
920,-58.35
921,-58.40
922,-58.44
923,-58.50
924,-58.55
925,-58.60
926,-58.63
927,-58.65
928,-58.67
929,-58.68
930,-58.68
931,-58.65
932,-58.63
933,-58.61
934,-58.59
935,-58.57
936,-58.56
937,-58.56
938,-58.57
939,-58.59
940,-58.62
941,-58.67
942,-58.73
943,-58.79
944,-58.85
945,-58.91
946,-58.97
947,-59.02
948,-59.05
949,-59.07
950,-59.09
951,-59.10
952,-59.09
953,-59.07
954,-59.05
955,-59.01
956,-58.98
957,-58.95
958,-58.92
959,-58.91
960,-58.90
961,-58.90
962,-58.90
963,-58.89
964,-58.88
965,-58.88
966,-58.88
967,-58.88
968,-58.87
969,-58.85
970,-58.83
971,-58.82
972,-58.81
973,-58.79
974,-58.78
975,-58.78
976,-58.78
977,-58.78
978,-58.79
979,-58.82
980,-58.86
981,-58.90
982,-58.94
983,-58.99
984,-59.04
985,-59.09
986,-59.15
987,-59.20
988,-59.27
989,-59.33
990,-59.39
991,-59.45
992,-59.50
993,-59.55
994,-59.60
995,-59.66
996,-59.72
997,-59.78
998,-59.84
999,-59.90
1000,-59.96
1001,-60.03
1002,-60.11
1003,-60.17
1004,-60.21
1005,-60.25
1006,-60.29
1007,-60.32
1008,-60.33
1009,-60.32
1010,-60.29
1011,-60.24
1012,-60.18
1013,-60.10
1014,-60.00
1015,-59.88
1016,-59.74
1017,-59.61
1018,-59.46
1019,-59.31
1020,-59.17
1021,-59.04
1022,-58.91
1023,-58.80
1024,-58.68
1025,-58.58
1026,-58.50
1027,-58.43
1028,-58.38
1029,-58.34
1030,-58.31
1031,-58.29
1032,-58.28
1033,-58.28
1034,-58.29
1035,-58.30
1036,-58.31
1037,-58.32
1038,-58.33
1039,-58.34
1040,-58.35
1041,-58.36
1042,-58.36
1043,-58.35
1044,-58.34
1045,-58.34
1046,-58.34
1047,-58.33
1048,-58.32
1049,-58.30
1050,-58.31
1051,-58.32
1052,-58.33
1053,-58.34
1054,-58.35
1055,-58.37
1056,-58.40
1057,-58.43
1058,-58.46
1059,-58.50
1060,-58.54
1061,-58.59
1062,-58.65
1063,-58.70
1064,-58.75
1065,-58.79
1066,-58.82
1067,-58.83
1068,-58.84
1069,-58.84
1070,-58.83
1071,-58.81
1072,-58.79
1073,-58.76
1074,-58.72
1075,-58.69
1076,-58.67
1077,-58.64
1078,-58.61
1079,-58.58
1080,-58.55
1081,-58.54
1082,-58.54
1083,-58.55
1084,-58.57
1085,-58.59
1086,-58.62
1087,-58.66
1088,-58.70
1089,-58.74
1090,-58.78
1091,-58.82
1092,-58.85
1093,-58.88
1094,-58.92
1095,-58.95
1096,-58.96
1097,-58.96
1098,-58.96
1099,-58.96
1100,-58.96
1101,-58.94
1102,-58.94
1103,-58.93
1104,-58.91
1105,-58.89
1106,-58.87
1107,-58.83
1108,-58.80
1109,-58.78
1110,-58.74
1111,-58.70
1112,-58.66
1113,-58.63
1114,-58.61
1115,-58.59
1116,-58.58
1117,-58.58
1118,-58.59
1119,-58.61
1120,-58.64
1121,-58.68
1122,-58.72
1123,-58.77
1124,-58.83
1125,-58.87
1126,-58.92
1127,-58.97
1128,-59.03
1129,-59.07
1130,-59.12
1131,-59.16
1132,-59.20
1133,-59.24
1134,-59.27
1135,-59.30
1136,-59.33
1137,-59.35
1138,-59.36
1139,-59.36
1140,-59.36
1141,-59.36
1142,-59.35
1143,-59.33
1144,-59.30
1145,-59.28
1146,-59.27
1147,-59.26
1148,-59.25
1149,-59.25
1150,-59.26
1151,-59.27
1152,-59.29
1153,-59.30
1154,-59.33
1155,-59.35
1156,-59.36
1157,-59.36
1158,-59.35
1159,-59.32
1160,-59.27
1161,-59.23
1162,-59.17
1163,-59.11
1164,-59.05
1165,-59.00
1166,-58.95
1167,-58.91
1168,-58.89
1169,-58.89
1170,-58.91
1171,-58.93
1172,-58.95
1173,-58.99
1174,-59.04
1175,-59.09
1176,-59.14
1177,-59.18
1178,-59.22
1179,-59.24
1180,-59.26
1181,-59.27
1182,-59.28
1183,-59.29
1184,-59.30
1185,-59.29
1186,-59.27
1187,-59.26
1188,-59.26
1189,-59.26
1190,-59.25
1191,-59.24
1192,-59.23
1193,-59.22
1194,-59.21
1195,-59.19
1196,-59.17
1197,-59.15
1198,-59.12
1199,-59.10
1200,-59.09
1201,-59.09
1202,-59.10
1203,-59.10
1204,-59.10
1205,-59.11
1206,-59.13
1207,-59.16
1208,-59.20
1209,-59.24
1210,-59.27
1211,-59.30
1212,-59.33
1213,-59.36
1214,-59.38
1215,-59.40
1216,-59.40
1217,-59.38
1218,-59.37
1219,-59.34
1220,-59.30
1221,-59.26
1222,-59.22
1223,-59.18
1224,-59.13
1225,-59.08
1226,-59.04
1227,-59.01
1228,-58.98
1229,-58.95
1230,-58.93
1231,-58.91
1232,-58.89
1233,-58.87
1234,-58.85
1235,-58.84
1236,-58.83
1237,-58.82
1238,-58.82
1239,-58.81
1240,-58.83
1241,-58.84
1242,-58.87
1243,-58.91
1244,-58.93
1245,-58.96
1246,-59.00
1247,-59.04
1248,-59.08
1249,-59.11
1250,-59.12
1251,-59.13
1252,-59.15
1253,-59.16
1254,-59.16
1255,-59.14
1256,-59.13
1257,-59.13
1258,-59.14
1259,-59.14
1260,-59.14
1261,-59.14
1262,-59.14
1263,-59.14
1264,-59.14
1265,-59.14
1266,-59.13
1267,-59.13
1268,-59.14
1269,-59.15
1270,-59.16
1271,-59.17
1272,-59.18
1273,-59.19
1274,-59.21
1275,-59.24
1276,-59.27
1277,-59.31
1278,-59.36
1279,-59.39
1280,-59.43
1281,-59.47
1282,-59.52
1283,-59.56
1284,-59.59
1285,-59.61
1286,-59.62
1287,-59.63
1288,-59.63
1289,-59.63
1290,-59.60
1291,-59.57
1292,-59.53
1293,-59.48
1294,-59.42
1295,-59.37
1296,-59.30
1297,-59.25
1298,-59.18
1299,-59.12
1300,-59.04
1301,-58.97
1302,-58.91
1303,-58.85
1304,-58.79
1305,-58.73
1306,-58.68
1307,-58.64
1308,-58.60
1309,-58.56
1310,-58.53
1311,-58.51
1312,-58.49
1313,-58.48
1314,-58.49
1315,-58.51
1316,-58.54
1317,-58.58
1318,-58.63
1319,-58.69
1320,-58.76
1321,-58.82
1322,-58.89
1323,-58.97
1324,-59.07
1325,-59.15
1326,-59.23
1327,-59.30
1328,-59.38
1329,-59.45
1330,-59.52
1331,-59.59
1332,-59.65
1333,-59.71
1334,-59.79
1335,-59.86
1336,-59.93
1337,-59.99
1338,-60.06
1339,-60.13
1340,-60.21
1341,-60.28
1342,-60.34
1343,-60.40
1344,-60.45
1345,-60.49
1346,-60.52
1347,-60.54
1348,-60.55
1349,-60.55
1350,-60.54
1351,-60.53
1352,-60.52
1353,-60.49
1354,-60.48
1355,-60.47
1356,-60.46
1357,-60.45
1358,-60.44
1359,-60.43
1360,-60.42
1361,-60.40
1362,-60.37
1363,-60.33
1364,-60.28
1365,-60.23
1366,-60.15
1367,-60.06
1368,-59.96
1369,-59.88
1370,-59.78
1371,-59.69
1372,-59.59
1373,-59.49
1374,-59.41
1375,-59.35
1376,-59.28
1377,-59.23
1378,-59.16
1379,-59.11
1380,-59.05
1381,-59.00
1382,-58.96
1383,-58.93
1384,-58.91
1385,-58.91
1386,-58.93
1387,-58.95
1388,-59.01
1389,-59.09
1390,-59.19
1391,-59.31
1392,-59.44
1393,-59.57
1394,-59.74
1395,-59.90
1396,-60.07
1397,-60.23
1398,-60.39
1399,-60.55
1400,-60.70
1401,-60.84
1402,-60.97
1403,-61.10
1404,-61.22
1405,-61.31
1406,-61.41
1407,-61.51
1408,-61.61
1409,-61.71
1410,-61.81
1411,-61.89
1412,-61.98
1413,-62.05
1414,-62.14
1415,-62.23
1416,-62.31
1417,-62.39
1418,-62.47
1419,-62.54
1420,-62.60
1421,-62.66
1422,-62.72
1423,-62.77
1424,-62.81
1425,-62.84
1426,-62.86
1427,-62.88
1428,-62.89
1429,-62.90
1430,-62.91
1431,-62.92
1432,-62.93
1433,-62.94
1434,-62.95
1435,-62.96
1436,-62.98
1437,-63.00
1438,-63.01
1439,-63.02
1440,-63.03
1441,-63.03
1442,-63.02
1443,-63.02
1444,-63.00
1445,-62.98
1446,-62.95
1447,-62.92
1448,-62.89
1449,-62.85
1450,-62.80
1451,-62.75
1452,-62.71
1453,-62.67
1454,-62.63
1455,-62.59
1456,-62.55
1457,-62.52
1458,-62.49
1459,-62.45
1460,-62.41
1461,-62.36
1462,-62.30
1463,-62.25
1464,-62.18
1465,-62.10
1466,-62.01
1467,-61.91
1468,-61.79
1469,-61.66
1470,-61.51
1471,-61.36
1472,-61.19
1473,-61.02
1474,-60.83
1475,-60.64
1476,-60.45
1477,-60.27
1478,-60.07
1479,-59.88
1480,-59.70
1481,-59.54
1482,-59.37
1483,-59.21
1484,-59.06
1485,-58.94
1486,-58.82
1487,-58.73
1488,-58.64
1489,-58.56
1490,-58.49
1491,-58.43
1492,-58.38
1493,-58.34
1494,-58.31
1495,-58.29
1496,-58.28
1497,-58.29
1498,-58.32
1499,-58.36
1500,-58.41
1501,-58.47
1502,-58.54
1503,-58.62
1504,-58.71
1505,-58.80
1506,-58.92
1507,-59.03
1508,-59.16
1509,-59.27
1510,-59.39
1511,-59.51
1512,-59.64
1513,-59.75
1514,-59.86
1515,-59.96
1516,-60.06
1517,-60.16
1518,-60.25
1519,-60.33
1520,-60.40
1521,-60.46
1522,-60.52
1523,-60.57
1524,-60.60
1525,-60.63
1526,-60.66
1527,-60.68
1528,-60.69
1529,-60.70
1530,-60.71
1531,-60.71
1532,-60.71
1533,-60.70
1534,-60.71
1535,-60.72
1536,-60.73
1537,-60.74
1538,-60.75
1539,-60.76
1540,-60.77
1541,-60.78
1542,-60.79
1543,-60.80
1544,-60.80
1545,-60.79
1546,-60.77
1547,-60.74
1548,-60.70
1549,-60.65
1550,-60.60
1551,-60.54
1552,-60.48
1553,-60.42
1554,-60.36
1555,-60.31
1556,-60.27
1557,-60.24
1558,-60.22
1559,-60.21
1560,-60.21
1561,-60.23
1562,-60.27
1563,-60.31
1564,-60.35
1565,-60.38
1566,-60.39
1567,-60.41
1568,-60.41
1569,-60.40
1570,-60.37
1571,-60.32
1572,-60.25
1573,-60.17
1574,-60.08
1575,-59.98
1576,-59.88
1577,-59.78
1578,-59.68
1579,-59.58
1580,-59.48
1581,-59.40
1582,-59.32
1583,-59.26
1584,-59.21
1585,-59.17
1586,-59.14
1587,-59.12
1588,-59.12
1589,-59.12
1590,-59.12
1591,-59.12
1592,-59.12
1593,-59.12
1594,-59.12
1595,-59.11
1596,-59.09
1597,-59.06
1598,-59.01
1599,-58.95
1600,-58.88
1601,-58.81
1602,-58.74
1603,-58.68
1604,-58.61
1605,-58.54
1606,-58.50
1607,-58.48
1608,-58.48
1609,-58.51
1610,-58.54
1611,-58.60
1612,-58.68
1613,-58.78
1614,-58.90
1615,-59.02
1616,-59.13
1617,-59.24
1618,-59.35
1619,-59.45
1620,-59.54
1621,-59.60
1622,-59.66
1623,-59.71
1624,-59.75
1625,-59.79
1626,-59.83
1627,-59.86
1628,-59.89
1629,-59.91
1630,-59.95
1631,-59.99
1632,-60.03
1633,-60.07
1634,-60.11
1635,-60.16
1636,-60.22
1637,-60.28
1638,-60.34
1639,-60.39
1640,-60.43
1641,-60.47
1642,-60.50
1643,-60.53
1644,-60.56
1645,-60.58
1646,-60.60
1647,-60.62
1648,-60.63
1649,-60.64
1650,-60.65
1651,-60.66
1652,-60.68
1653,-60.69
1654,-60.71
1655,-60.74
1656,-60.75
1657,-60.78
1658,-60.79
1659,-60.81
1660,-60.84
1661,-60.87
1662,-60.90
1663,-60.93
1664,-60.96
1665,-60.97
1666,-60.99
1667,-61.01
1668,-61.03
1669,-61.04
1670,-61.04
1671,-61.03
1672,-61.02
1673,-61.01
1674,-60.99
1675,-60.96
1676,-60.93
1677,-60.91
1678,-60.89
1679,-60.87
1680,-60.86
1681,-60.84
1682,-60.85
1683,-60.87
1684,-60.90
1685,-60.93
1686,-60.96
1687,-61.00
1688,-61.05
1689,-61.10
1690,-61.14
1691,-61.16
1692,-61.16
1693,-61.16
1694,-61.15
1695,-61.12
1696,-61.08
1697,-61.03
1698,-60.98
1699,-60.93
1700,-60.88
1701,-60.84
1702,-60.81
1703,-60.80
1704,-60.81
1705,-60.82
1706,-60.86
1707,-60.91
1708,-60.97
1709,-61.03
1710,-61.09
1711,-61.15
1712,-61.22
1713,-61.27
1714,-61.32
1715,-61.36
1716,-61.40
1717,-61.44
1718,-61.47
1719,-61.49
1720,-61.51
1721,-61.53
1722,-61.55
1723,-61.57
1724,-61.58
1725,-61.60
1726,-61.64
1727,-61.67
1728,-61.72
1729,-61.76
1730,-61.80
1731,-61.86
1732,-61.92
1733,-61.98
1734,-62.05
1735,-62.12
1736,-62.18
1737,-62.24
1738,-62.30
1739,-62.36
1740,-62.42
1741,-62.47
1742,-62.51
1743,-62.54
1744,-62.56
1745,-62.59
1746,-62.63
1747,-62.66
1748,-62.67
1749,-62.69
1750,-62.70
1751,-62.70
1752,-62.70
1753,-62.70
1754,-62.69
1755,-62.69
1756,-62.69
1757,-62.67
1758,-62.66
1759,-62.65
1760,-62.64
1761,-62.63
1762,-62.63
1763,-62.63
1764,-62.63
1765,-62.64
1766,-62.66
1767,-62.69
1768,-62.73
1769,-62.77
1770,-62.81
1771,-62.86
1772,-62.92
1773,-62.97
1774,-63.04
1775,-63.11
1776,-63.17
1777,-63.22
1778,-63.27
1779,-63.31
1780,-63.34
1781,-63.35
1782,-63.34
1783,-63.32
1784,-63.28
1785,-63.25
1786,-63.20
1787,-63.16
1788,-63.09
1789,-63.02
1790,-62.96
1791,-62.91
1792,-62.86
1793,-62.81
1794,-62.77
1795,-62.73
1796,-62.69
1797,-62.65
1798,-62.61
1799,-62.57
1800,-62.52
1801,-62.48
1802,-62.43
1803,-62.39
1804,-62.34
1805,-62.29
1806,-62.23
1807,-62.18
1808,-62.13
1809,-62.08
1810,-62.03
1811,-61.98
1812,-61.93
1813,-61.88
1814,-61.83
1815,-61.77
1816,-61.71
1817,-61.65
1818,-61.58
1819,-61.51
1820,-61.44
1821,-61.39
1822,-61.33
1823,-61.29
1824,-61.24
1825,-61.20
1826,-61.17
1827,-61.15
1828,-61.13
1829,-61.12
1830,-61.12
1831,-61.13
1832,-61.15
1833,-61.17
1834,-61.19
1835,-61.21
1836,-61.23
1837,-61.24
1838,-61.24
1839,-61.24
1840,-61.24
1841,-61.25
1842,-61.27
1843,-61.29
1844,-61.32
1845,-61.36
1846,-61.40
1847,-61.45
1848,-61.50
1849,-61.55
1850,-61.60
1851,-61.65
1852,-61.70
1853,-61.74
1854,-61.77
1855,-61.78
1856,-61.77
1857,-61.76
1858,-61.75
1859,-61.74
1860,-61.73
1861,-61.72
1862,-61.72
1863,-61.74
1864,-61.77
1865,-61.80
1866,-61.83
1867,-61.87
1868,-61.92
1869,-61.96
1870,-61.99
1871,-62.02
1872,-62.04
1873,-62.06
1874,-62.08
1875,-62.10
1876,-62.12
1877,-62.13
1878,-62.14
1879,-62.16
1880,-62.19
1881,-62.20
1882,-62.22
1883,-62.24
1884,-62.27
1885,-62.29
1886,-62.30
1887,-62.30
1888,-62.29
1889,-62.29
1890,-62.29
1891,-62.29
1892,-62.30
1893,-62.30
1894,-62.31
1895,-62.33
1896,-62.35
1897,-62.37
1898,-62.40
1899,-62.42
1900,-62.44
1901,-62.46
1902,-62.48
1903,-62.49
1904,-62.49
1905,-62.49
1906,-62.48
1907,-62.46
1908,-62.44
1909,-62.42
1910,-62.40
1911,-62.38
1912,-62.36
1913,-62.34
1914,-62.33
1915,-62.33
1916,-62.33
1917,-62.33
1918,-62.34
1919,-62.35
1920,-62.39
1921,-62.43
1922,-62.47
1923,-62.52
1924,-62.58
1925,-62.65
1926,-62.73
1927,-62.82
1928,-62.91
1929,-62.99
1930,-63.06
1931,-63.14
1932,-63.23
1933,-63.29
1934,-63.35
1935,-63.39
1936,-63.42
1937,-63.45
1938,-63.47
1939,-63.48
1940,-63.49
1941,-63.49
1942,-63.48
1943,-63.47
1944,-63.46
1945,-63.46
1946,-63.46
1947,-63.45
1948,-63.43
1949,-63.42
1950,-63.42
1951,-63.43
1952,-63.45
1953,-63.46
1954,-63.47
1955,-63.49
1956,-63.52
1957,-63.56
1958,-63.60
1959,-63.65
1960,-63.71
1961,-63.77
1962,-63.83
1963,-63.88
1964,-63.92
1965,-63.95
1966,-63.97
1967,-63.99
1968,-64.00
1969,-64.00
1970,-63.99
1971,-63.97
1972,-63.94
1973,-63.91
1974,-63.89
1975,-63.85
1976,-63.82
1977,-63.78
1978,-63.75
1979,-63.71
1980,-63.68
1981,-63.64
1982,-63.60
1983,-63.57
1984,-63.55
1985,-63.53
1986,-63.51
1987,-63.48
1988,-63.45
1989,-63.42
1990,-63.39
1991,-63.36
1992,-63.33
1993,-63.30
1994,-63.27
1995,-63.25
1996,-63.24
1997,-63.23
1998,-63.21
1999,-63.21
2000,-63.21
2001,-63.22
2002,-63.23
2003,-63.23
2004,-63.22
2005,-63.21
2006,-63.20
2007,-63.17
2008,-63.12
2009,-63.06
2010,-62.99
2011,-62.91
2012,-62.82
2013,-62.72
2014,-62.62
2015,-62.52
2016,-62.42
2017,-62.32
2018,-62.22
2019,-62.13
2020,-62.06
2021,-62.00
2022,-61.95
2023,-61.91
2024,-61.88
2025,-61.86
2026,-61.86
2027,-61.87
2028,-61.88
2029,-61.89
2030,-61.91
2031,-61.94
2032,-61.97
2033,-61.99
2034,-62.00
2035,-62.01
2036,-62.02
2037,-62.02
2038,-62.01
2039,-62.00
2040,-61.98
2041,-61.97
2042,-61.94
2043,-61.92
2044,-61.90
2045,-61.88
2046,-61.86
2047,-61.84
2048,-61.83
2049,-61.82
2050,-61.81
2051,-61.80
2052,-61.79
2053,-61.78
2054,-61.77
2055,-61.76
2056,-61.76
2057,-61.76
2058,-61.75
2059,-61.74
2060,-61.74
2061,-61.75
2062,-61.76
2063,-61.77
2064,-61.78
2065,-61.80
2066,-61.83
2067,-61.86
2068,-61.89
2069,-61.91
2070,-61.92
2071,-61.93
2072,-61.94
2073,-61.94
2074,-61.92
2075,-61.88
2076,-61.83
2077,-61.77
2078,-61.69
2079,-61.61
2080,-61.51
2081,-61.42
2082,-61.33
2083,-61.26
2084,-61.19
2085,-61.14
2086,-61.10
2087,-61.08
2088,-61.08
2089,-61.10
2090,-61.14
2091,-61.18
2092,-61.23
2093,-61.29
2094,-61.35
2095,-61.40
2096,-61.43
2097,-61.45
2098,-61.47
2099,-61.47
2100,-61.48
2101,-61.47
2102,-61.45
2103,-61.41
2104,-61.38
2105,-61.36
2106,-61.36
2107,-61.36
2108,-61.36
2109,-61.37
2110,-61.39
2111,-61.42
2112,-61.46
2113,-61.51
2114,-61.57
2115,-61.61
2116,-61.65
2117,-61.69
2118,-61.74
2119,-61.79
2120,-61.83
2121,-61.86
2122,-61.89
2123,-61.92
2124,-61.95
2125,-61.98
2126,-62.01
2127,-62.02
2128,-62.04
2129,-62.05
2130,-62.06
2131,-62.07
2132,-62.08
2133,-62.08
2134,-62.07
2135,-62.06
2136,-62.05
2137,-62.03
2138,-62.00
2139,-61.98
2140,-61.97
2141,-61.96
2142,-61.95
2143,-61.95
2144,-61.96
2145,-61.97
2146,-61.98
2147,-62.00
2148,-62.03
2149,-62.07
2150,-62.12
2151,-62.16
2152,-62.19
2153,-62.23
2154,-62.28
2155,-62.32
2156,-62.38
2157,-62.43
2158,-62.48
2159,-62.51
2160,-62.55
2161,-62.58
2162,-62.60
2163,-62.62
2164,-62.63
2165,-62.63
2166,-62.63
2167,-62.63
2168,-62.63
2169,-62.62
2170,-62.60
2171,-62.59
2172,-62.59
2173,-62.59
2174,-62.59
2175,-62.60
2176,-62.62
2177,-62.65
2178,-62.69
2179,-62.71
2180,-62.74
2181,-62.77
2182,-62.81
2183,-62.85
2184,-62.88
2185,-62.90
2186,-62.92
2187,-62.94
2188,-62.95
2189,-62.96
2190,-62.97
2191,-62.97
2192,-62.97
2193,-62.98
2194,-62.99
2195,-62.99
2196,-62.99
2197,-63.01
2198,-63.04
2199,-63.07
2200,-63.10
2201,-63.13
2202,-63.16
2203,-63.19
2204,-63.22
2205,-63.24
2206,-63.25
2207,-63.26
2208,-63.26
2209,-63.25
2210,-63.24
2211,-63.22
2212,-63.19
2213,-63.16
2214,-63.13
2215,-63.10
2216,-63.07
2217,-63.05
2218,-63.04
2219,-63.04
2220,-63.05
2221,-63.07
2222,-63.10
2223,-63.15
2224,-63.21
2225,-63.28
2226,-63.37
2227,-63.46
2228,-63.54
2229,-63.61
2230,-63.67
2231,-63.73
2232,-63.79
2233,-63.83
2234,-63.85
2235,-63.86
2236,-63.86
2237,-63.85
2238,-63.83
2239,-63.81
2240,-63.79
2241,-63.76
2242,-63.72
2243,-63.68
2244,-63.64
2245,-63.60
2246,-63.56
2247,-63.53
2248,-63.51
2249,-63.49
2250,-63.47
2251,-63.45
2252,-63.43
2253,-63.42
2254,-63.42
2255,-63.44
2256,-63.44
2257,-63.44
2258,-63.45
2259,-63.46
2260,-63.46
2261,-63.46
2262,-63.46
2263,-63.45
2264,-63.44
2265,-63.43
2266,-63.42
2267,-63.39
2268,-63.37
2269,-63.34
2270,-63.31
2271,-63.29
2272,-63.27
2273,-63.25
2274,-63.24
2275,-63.24
2276,-63.25
2277,-63.26
2278,-63.27
2279,-63.29
2280,-63.31
2281,-63.35
2282,-63.38
2283,-63.41
2284,-63.43
2285,-63.46
2286,-63.50
2287,-63.54
2288,-63.58
2289,-63.62
2290,-63.66
2291,-63.71
2292,-63.77
2293,-63.83
2294,-63.89
2295,-63.95
2296,-64.00
2297,-64.06
2298,-64.10
2299,-64.14
2300,-64.18
2301,-64.21
2302,-64.23
2303,-64.24
2304,-64.23
2305,-64.22
2306,-64.21
2307,-64.19
2308,-64.16
2309,-64.12
2310,-64.08
2311,-64.04
2312,-64.00
2313,-63.95
2314,-63.89
2315,-63.84
2316,-63.79
2317,-63.76
2318,-63.72
2319,-63.70
2320,-63.67
2321,-63.64
2322,-63.61
2323,-63.59
2324,-63.57
2325,-63.57
2326,-63.56
2327,-63.55
2328,-63.53
2329,-63.51
2330,-63.49
2331,-63.47
2332,-63.45
2333,-63.42
2334,-63.39
2335,-63.36
2336,-63.32
2337,-63.27
2338,-63.21
2339,-63.15
2340,-63.10
2341,-63.05
2342,-63.00
2343,-62.96
2344,-62.94
2345,-62.92
2346,-62.92
2347,-62.93
2348,-62.96
2349,-63.01
2350,-63.07
2351,-63.14
2352,-63.23
2353,-63.32
2354,-63.40
2355,-63.49
2356,-63.57
2357,-63.64
2358,-63.71
2359,-63.76
2360,-63.80
2361,-63.83
2362,-63.85
2363,-63.85
2364,-63.84
2365,-63.82
2366,-63.78
2367,-63.74
2368,-63.71
2369,-63.67
2370,-63.64
2371,-63.61
2372,-63.59
2373,-63.58
2374,-63.59
2375,-63.60
2376,-63.63
2377,-63.66
2378,-63.70
2379,-63.75
2380,-63.80
2381,-63.85
2382,-63.91
2383,-63.95
2384,-64.00
2385,-64.04
2386,-64.07
2387,-64.11
2388,-64.13
2389,-64.14
2390,-64.13
2391,-64.12
2392,-64.11
2393,-64.10
2394,-64.09
2395,-64.07
2396,-64.04
2397,-64.01
2398,-63.99
2399,-63.97
2400,-63.95
2401,-63.94
2402,-63.93
2403,-63.92
2404,-63.92
2405,-63.92
2406,-63.92
2407,-63.92
2408,-63.92
2409,-63.91
2410,-63.89
2411,-63.87
2412,-63.85
2413,-63.82
2414,-63.77
2415,-63.71
2416,-63.65
2417,-63.59
2418,-63.52
2419,-63.45
2420,-63.37
2421,-63.29
2422,-63.23
2423,-63.17
2424,-63.12
2425,-63.08
2426,-63.05
2427,-63.03
2428,-63.02
2429,-63.02
2430,-63.03
2431,-63.05
2432,-63.08
2433,-63.11
2434,-63.14
2435,-63.17
2436,-63.20
2437,-63.23
2438,-63.26
2439,-63.28
2440,-63.29
2441,-63.30
2442,-63.31
2443,-63.32
2444,-63.33
2445,-63.34
2446,-63.35
2447,-63.36
2448,-63.37
2449,-63.38
2450,-63.38
2451,-63.38
2452,-63.39
2453,-63.39
2454,-63.41
2455,-63.43
2456,-63.46
2457,-63.49
2458,-63.51
2459,-63.54
2460,-63.58
2461,-63.63
2462,-63.69
2463,-63.74
2464,-63.78
2465,-63.83
2466,-63.88
2467,-63.92
2468,-63.95
2469,-63.97
2470,-63.99
2471,-64.00
2472,-64.00
2473,-64.00
2474,-64.00
2475,-64.00
2476,-64.00
2477,-64.00
2478,-63.99
2479,-63.98
2480,-63.98
2481,-63.97
2482,-63.98
2483,-63.98
2484,-63.98
2485,-63.98
2486,-63.98
2487,-63.98
2488,-63.98
2489,-63.98
2490,-63.98
2491,-63.97
2492,-63.95
2493,-63.92
2494,-63.88
2495,-63.84
2496,-63.80
2497,-63.75
2498,-63.69
2499,-63.62
2500,-63.55
2501,-63.49
2502,-63.43
2503,-63.37
2504,-63.32
2505,-63.28
2506,-63.25
2507,-63.23
2508,-63.22
2509,-63.24
2510,-63.25
2511,-63.28
2512,-63.29
2513,-63.31
2514,-63.34
2515,-63.35
2516,-63.37
2517,-63.38
2518,-63.39
2519,-63.39
2520,-63.37
2521,-63.35
2522,-63.34
2523,-63.32
2524,-63.32
2525,-63.32
2526,-63.33
2527,-63.33
2528,-63.35
2529,-63.39
2530,-63.42
2531,-63.46
2532,-63.50
2533,-63.54
2534,-63.58
2535,-63.61
2536,-63.63
2537,-63.64
2538,-63.64
2539,-63.63
2540,-63.61
2541,-63.58
2542,-63.54
2543,-63.50
2544,-63.46
2545,-63.42
2546,-63.39
2547,-63.34
2548,-63.31
2549,-63.28
2550,-63.26
2551,-63.25
2552,-63.24
2553,-63.23
2554,-63.22
2555,-63.21
2556,-63.20
2557,-63.18
2558,-63.15
2559,-63.12
2560,-63.09
2561,-63.05
2562,-63.00
2563,-62.95
2564,-62.90
2565,-62.85
2566,-62.81
2567,-62.78
2568,-62.75
2569,-62.72
2570,-62.70
2571,-62.70
2572,-62.70
2573,-62.71
2574,-62.71
2575,-62.72
2576,-62.73
2577,-62.73
2578,-62.73
2579,-62.73
2580,-62.72
2581,-62.70
2582,-62.67
2583,-62.65
2584,-62.61
2585,-62.57
2586,-62.52
2587,-62.48
2588,-62.43
2589,-62.39
2590,-62.35
2591,-62.31
2592,-62.27
2593,-62.24
2594,-62.22
2595,-62.20
2596,-62.18
2597,-62.16
2598,-62.15
2599,-62.15
2600,-62.15
2601,-62.14
2602,-62.13
2603,-62.13
2604,-62.13
2605,-62.14
2606,-62.13
2607,-62.12
2608,-62.10
2609,-62.08
2610,-62.07
2611,-62.06
2612,-62.05
2613,-62.04
2614,-62.03
2615,-62.03
2616,-62.03
2617,-62.05
2618,-62.07
2619,-62.11
2620,-62.15
2621,-62.19
2622,-62.23
2623,-62.27
2624,-62.31
2625,-62.34
2626,-62.37
2627,-62.39
2628,-62.43
2629,-62.45
2630,-62.48
2631,-62.51
2632,-62.55
2633,-62.58
2634,-62.64
2635,-62.71
2636,-62.78
2637,-62.86
2638,-62.96
2639,-63.06
2640,-63.18
2641,-63.29
2642,-63.40
2643,-63.51
2644,-63.65
2645,-63.77
2646,-63.90
2647,-64.02
2648,-64.14
2649,-64.27
2650,-64.40
2651,-64.53
2652,-64.66
2653,-64.78
2654,-64.92
2655,-65.06
2656,-65.19
2657,-65.31
2658,-65.43
2659,-65.54
2660,-65.63
2661,-65.69
2662,-65.73
2663,-65.76
2664,-65.77
2665,-65.76
2666,-65.73
2667,-65.68
2668,-65.61
2669,-65.53
2670,-65.44
2671,-65.34
2672,-65.23
2673,-65.14
2674,-65.04
2675,-64.94
2676,-64.83
2677,-64.74
2678,-64.65
2679,-64.58
2680,-64.52
2681,-64.46
2682,-64.41
2683,-64.38
2684,-64.36
2685,-64.34
2686,-64.32
2687,-64.32
2688,-64.32
2689,-64.32
2690,-64.31
2691,-64.29
2692,-64.26
2693,-64.23
2694,-64.20
2695,-64.18
2696,-64.14
2697,-64.09
2698,-64.03
2699,-63.98
2700,-63.93
2701,-63.89
2702,-63.84
2703,-63.79
2704,-63.73
2705,-63.67
2706,-63.62
2707,-63.57
2708,-63.51
2709,-63.45
2710,-63.40
2711,-63.36
2712,-63.32
2713,-63.28
2714,-63.25
2715,-63.23
2716,-63.21
2717,-63.21
2718,-63.21
2719,-63.22
2720,-63.23
2721,-63.24
2722,-63.25
2723,-63.27
2724,-63.29
2725,-63.31
2726,-63.34
2727,-63.35
2728,-63.37
2729,-63.38
2730,-63.39
2731,-63.40
2732,-63.40
2733,-63.39
2734,-63.38
2735,-63.37
2736,-63.36
2737,-63.35
2738,-63.33
2739,-63.31
2740,-63.30
2741,-63.30
2742,-63.30
2743,-63.29
2744,-63.28
2745,-63.28
2746,-63.28
2747,-63.27
2748,-63.26
2749,-63.25
2750,-63.24
2751,-63.23
2752,-63.22
2753,-63.21
2754,-63.20
2755,-63.19
2756,-63.18
2757,-63.17
2758,-63.16
2759,-63.16
2760,-63.17
2761,-63.18
2762,-63.19
2763,-63.20
2764,-63.21
2765,-63.24
2766,-63.25
2767,-63.26
2768,-63.27
2769,-63.28
2770,-63.29
2771,-63.31
2772,-63.33
2773,-63.35
2774,-63.38
2775,-63.39
2776,-63.41
2777,-63.43
2778,-63.46
2779,-63.50
2780,-63.54
2781,-63.57
2782,-63.60
2783,-63.64
2784,-63.67
2785,-63.71
2786,-63.74
2787,-63.77
2788,-63.79
2789,-63.80
2790,-63.81
2791,-63.82
2792,-63.82
2793,-63.81
2794,-63.79
2795,-63.76
2796,-63.72
2797,-63.67
2798,-63.61
2799,-63.55
2800,-63.49
2801,-63.43
2802,-63.38
2803,-63.31
2804,-63.25
2805,-63.19
2806,-63.14
2807,-63.11
2808,-63.09
2809,-63.07
2810,-63.06
2811,-63.06
2812,-63.07
2813,-63.09
2814,-63.11
2815,-63.13
2816,-63.15
2817,-63.17
2818,-63.20
2819,-63.22
2820,-63.23
2821,-63.23
2822,-63.22
2823,-63.21
2824,-63.20
2825,-63.18
2826,-63.15
2827,-63.11
2828,-63.07
2829,-63.04
2830,-63.01
2831,-62.97
2832,-62.93
2833,-62.88
2834,-62.84
2835,-62.81
2836,-62.77
2837,-62.74
2838,-62.71
2839,-62.68
2840,-62.65
2841,-62.63
2842,-62.59
2843,-62.56
2844,-62.54
2845,-62.52
2846,-62.50
2847,-62.49
2848,-62.49
2849,-62.49
2850,-62.49
2851,-62.49
2852,-62.49
2853,-62.50
2854,-62.51
2855,-62.52
2856,-62.54
2857,-62.56
2858,-62.58
2859,-62.60
2860,-62.63
2861,-62.65
2862,-62.68
2863,-62.70
2864,-62.72
2865,-62.74
2866,-62.76
2867,-62.77
2868,-62.77
2869,-62.77
2870,-62.77
2871,-62.77
2872,-62.76
2873,-62.74
2874,-62.72
2875,-62.70
2876,-62.68
2877,-62.65
2878,-62.61
2879,-62.58
2880,-62.56
2881,-62.54
2882,-62.52
2883,-62.51
2884,-62.51
2885,-62.51
2886,-62.52
2887,-62.52
2888,-62.53
2889,-62.54
2890,-62.56
2891,-62.58
2892,-62.59
2893,-62.59
2894,-62.59
2895,-62.59
2896,-62.59
2897,-62.58
2898,-62.56
2899,-62.55
2900,-62.55
2901,-62.55
2902,-62.55
2903,-62.56
2904,-62.58
2905,-62.60
2906,-62.63
2907,-62.67
2908,-62.71
2909,-62.75
2910,-62.79
2911,-62.81
2912,-62.84
2913,-62.86
2914,-62.87
2915,-62.88
2916,-62.89
2917,-62.89
2918,-62.88
2919,-62.87
2920,-62.87
2921,-62.87
2922,-62.87
2923,-62.87
2924,-62.87
2925,-62.87
2926,-62.87
2927,-62.87
2928,-62.87
2929,-62.86
2930,-62.84
2931,-62.82
2932,-62.80
2933,-62.78
2934,-62.76
2935,-62.73
2936,-62.69
2937,-62.66
2938,-62.64
2939,-62.62
2940,-62.60
2941,-62.58
2942,-62.56
2943,-62.55
2944,-62.54
2945,-62.53
2946,-62.53
2947,-62.53
2948,-62.53
2949,-62.54
2950,-62.56
2951,-62.59
2952,-62.63
2953,-62.67
2954,-62.71
2955,-62.76
2956,-62.82
2957,-62.88
2958,-62.93
2959,-62.98
2960,-63.03
2961,-63.08
2962,-63.12
2963,-63.15
2964,-63.18
2965,-63.21
2966,-63.23
2967,-63.23
2968,-63.22
2969,-63.22
2970,-63.22
2971,-63.21
2972,-63.20
2973,-63.19
2974,-63.18
2975,-63.18
2976,-63.19
2977,-63.20
2978,-63.21
2979,-63.23
2980,-63.26
2981,-63.30
2982,-63.34
2983,-63.37
2984,-63.40
2985,-63.43
2986,-63.46
2987,-63.48
2988,-63.48
2989,-63.46
2990,-63.43
2991,-63.39
2992,-63.34
2993,-63.28
2994,-63.21
2995,-63.14
2996,-63.06
2997,-62.99
2998,-62.91
2999,-62.85
3000,-62.80
3001,-62.76
3002,-62.73
3003,-62.73
3004,-62.73
3005,-62.75
3006,-62.79
3007,-62.84
3008,-62.89
3009,-62.95
3010,-63.02
3011,-63.09
3012,-63.17
3013,-63.24
3014,-63.32
3015,-63.40
3016,-63.49
3017,-63.57
3018,-63.64
3019,-63.70
3020,-63.75
3021,-63.79
3022,-63.81
3023,-63.81
3024,-63.79
3025,-63.77
3026,-63.75
3027,-63.71
3028,-63.65
3029,-63.58
3030,-63.50
3031,-63.44
3032,-63.37
3033,-63.31
3034,-63.26
3035,-63.22
3036,-63.19
3037,-63.18
3038,-63.18
3039,-63.20
3040,-63.22
3041,-63.24
3042,-63.28
3043,-63.32
3044,-63.37
3045,-63.43
3046,-63.49
3047,-63.53
3048,-63.56
3049,-63.60
3050,-63.64
3051,-63.68
3052,-63.71
3053,-63.73
3054,-63.75
3055,-63.78
3056,-63.81
3057,-63.83
3058,-63.85
3059,-63.88
3060,-63.91
3061,-63.93
3062,-63.95
3063,-63.96
3064,-63.99
3065,-64.01
3066,-64.02
3067,-64.04
3068,-64.05
3069,-64.05
3070,-64.05
3071,-64.04
3072,-64.04
3073,-64.04
3074,-64.04
3075,-64.03
3076,-64.01
3077,-63.99
3078,-63.97
3079,-63.96
3080,-63.95
3081,-63.93
3082,-63.91
3083,-63.89
3084,-63.87
3085,-63.86
3086,-63.85
3087,-63.85
3088,-63.86
3089,-63.88
3090,-63.88
3091,-63.88
3092,-63.88
3093,-63.86
3094,-63.85
3095,-63.83
3096,-63.80
3097,-63.78
3098,-63.75
3099,-63.71
3100,-63.68
3101,-63.64
3102,-63.60
3103,-63.57
3104,-63.55
3105,-63.54
3106,-63.54
3107,-63.54
3108,-63.54
3109,-63.55
3110,-63.57
3111,-63.59
3112,-63.60
3113,-63.61
3114,-63.63
3115,-63.65
3116,-63.67
3117,-63.69
3118,-63.71
3119,-63.74
3120,-63.77
3121,-63.80
3122,-63.84
3123,-63.88
3124,-63.92
3125,-63.96
3126,-64.00
3127,-64.05
3128,-64.10
3129,-64.12
3130,-64.15
3131,-64.18
3132,-64.21
3133,-64.23
3134,-64.25
3135,-64.26
3136,-64.29
3137,-64.31
3138,-64.33
3139,-64.36
3140,-64.39
3141,-64.40
3142,-64.43
3143,-64.44
3144,-64.46
3145,-64.47
3146,-64.48
3147,-64.48
3148,-64.47
3149,-64.46
3150,-64.45
3151,-64.42
3152,-64.40
3153,-64.38
3154,-64.37
3155,-64.38
3156,-64.40
3157,-64.43
3158,-64.48
3159,-64.55
3160,-64.64
3161,-64.74
3162,-64.85
3163,-64.97
3164,-65.10
3165,-65.23
3166,-65.35
3167,-65.46
3168,-65.56
3169,-65.63
3170,-65.69
3171,-65.72
3172,-65.73
3173,-65.72
3174,-65.69
3175,-65.64
3176,-65.57
3177,-65.50
3178,-65.43
3179,-65.35
3180,-65.26
3181,-65.19
3182,-65.12
3183,-65.06
3184,-65.00
3185,-64.95
3186,-64.90
3187,-64.87
3188,-64.84
3189,-64.82
3190,-64.80
3191,-64.78
3192,-64.76
3193,-64.74
3194,-64.72
3195,-64.70
3196,-64.68
3197,-64.66
3198,-64.64
3199,-64.61
3200,-64.58
3201,-64.56
3202,-64.55
3203,-64.54
3204,-64.53
3205,-64.52
3206,-64.51
3207,-64.51
3208,-64.51
3209,-64.53
3210,-64.54
3211,-64.56
3212,-64.58
3213,-64.59
3214,-64.60
3215,-64.62
3216,-64.65
3217,-64.67
3218,-64.68
3219,-64.69
3220,-64.70
3221,-64.71
3222,-64.71
3223,-64.70
3224,-64.68
3225,-64.66
3226,-64.64
3227,-64.61
3228,-64.58
3229,-64.54
3230,-64.49
3231,-64.45
3232,-64.42
3233,-64.39
3234,-64.36
3235,-64.34
3236,-64.32
3237,-64.32
3238,-64.32
3239,-64.34
3240,-64.36
3241,-64.39
3242,-64.41
3243,-64.43
3244,-64.44
3245,-64.44
3246,-64.43
3247,-64.40
3248,-64.35
3249,-64.31
3250,-64.25
3251,-64.18
3252,-64.10
3253,-64.02
3254,-63.94
3255,-63.87
3256,-63.80
3257,-63.73
3258,-63.67
3259,-63.62
3260,-63.58
3261,-63.54
3262,-63.50
3263,-63.46
3264,-63.42
3265,-63.37
3266,-63.32
3267,-63.28
3268,-63.24
3269,-63.19
3270,-63.14
3271,-63.11
3272,-63.10
3273,-63.10
3274,-63.11
3275,-63.13
3276,-63.16
3277,-63.20
3278,-63.25
3279,-63.31
3280,-63.38
3281,-63.45
3282,-63.52
3283,-63.59
3284,-63.65
3285,-63.71
3286,-63.77
3287,-63.82
3288,-63.86
3289,-63.91
3290,-63.97
3291,-64.03
3292,-64.08
3293,-64.13
3294,-64.19
3295,-64.26
3296,-64.32
3297,-64.37
3298,-64.43
3299,-64.48
3300,-64.54
3301,-64.58
3302,-64.62
3303,-64.65
3304,-64.69
3305,-64.72
3306,-64.75
3307,-64.79
3308,-64.83
3309,-64.87
3310,-64.91
3311,-64.95
3312,-64.99
3313,-65.03
3314,-65.07
3315,-65.10
3316,-65.12
3317,-65.14
3318,-65.16
3319,-65.18
3320,-65.19
3321,-65.20
3322,-65.22
3323,-65.23
3324,-65.26
3325,-65.28
3326,-65.30
3327,-65.33
3328,-65.37
3329,-65.43
3330,-65.50
3331,-65.57
3332,-65.64
3333,-65.73
3334,-65.84
3335,-65.93
3336,-66.03
3337,-66.10
3338,-66.18
3339,-66.25
3340,-66.31
3341,-66.36
3342,-66.40
3343,-66.44
3344,-66.47
3345,-66.49
3346,-66.50
3347,-66.51
3348,-66.53
3349,-66.54
3350,-66.57
3351,-66.60
3352,-66.63
3353,-66.66
3354,-66.69
3355,-66.72
3356,-66.74
3357,-66.75
3358,-66.76
3359,-66.76
3360,-66.75
3361,-66.74
3362,-66.72
3363,-66.70
3364,-66.69
3365,-66.68
3366,-66.67
3367,-66.66
3368,-66.66
3369,-66.67
3370,-66.68
3371,-66.69
3372,-66.71
3373,-66.74
3374,-66.77
3375,-66.80
3376,-66.83
3377,-66.86
3378,-66.89
3379,-66.91
3380,-66.91
3381,-66.90
3382,-66.89
3383,-66.87
3384,-66.83
3385,-66.77
3386,-66.70
3387,-66.62
3388,-66.53
3389,-66.45
3390,-66.35
3391,-66.25
3392,-66.15
3393,-66.08
3394,-66.01
3395,-65.95
3396,-65.90
3397,-65.86
3398,-65.82
3399,-65.80
3400,-65.77
3401,-65.74
3402,-65.70
3403,-65.66
3404,-65.63
3405,-65.59
3406,-65.54
3407,-65.48
3408,-65.41
3409,-65.36
3410,-65.30
3411,-65.24
3412,-65.18
3413,-65.12
3414,-65.06
3415,-65.01
3416,-64.97
3417,-64.93
3418,-64.89
3419,-64.85
3420,-64.82
3421,-64.79
3422,-64.75
3423,-64.71
3424,-64.67
3425,-64.63
3426,-64.59
3427,-64.55
3428,-64.51
3429,-64.47
3430,-64.43
3431,-64.40
3432,-64.36
3433,-64.32
3434,-64.27
3435,-64.22
3436,-64.18
3437,-64.14
3438,-64.09
3439,-64.06
3440,-64.03
3441,-64.00
3442,-63.99
3443,-63.98
3444,-63.98
3445,-63.99
3446,-64.01
3447,-64.04
3448,-64.07
3449,-64.11
3450,-64.16
3451,-64.19
3452,-64.24
3453,-64.28
3454,-64.31
3455,-64.34
3456,-64.36
3457,-64.39
3458,-64.41
3459,-64.44
3460,-64.47
3461,-64.50
3462,-64.53
3463,-64.57
3464,-64.61
3465,-64.65
3466,-64.69
3467,-64.72
3468,-64.74
3469,-64.76
3470,-64.78
3471,-64.79
3472,-64.79
3473,-64.79
3474,-64.79
3475,-64.78
3476,-64.77
3477,-64.76
3478,-64.75
3479,-64.75
3480,-64.76
3481,-64.78
3482,-64.80
3483,-64.83
3484,-64.88
3485,-64.94
3486,-65.00
3487,-65.06
3488,-65.12
3489,-65.19
3490,-65.27
3491,-65.35
3492,-65.42
3493,-65.48
3494,-65.54
3495,-65.61
3496,-65.67
3497,-65.72
3498,-65.77
3499,-65.83
3500,-65.89
3501,-65.94
3502,-65.98
3503,-66.02
3504,-66.06
3505,-66.10
3506,-66.13
3507,-66.15
3508,-66.17
3509,-66.18
3510,-66.18
3511,-66.18
3512,-66.18
3513,-66.17
3514,-66.15
3515,-66.13
3516,-66.11
3517,-66.11
3518,-66.13
3519,-66.15
3520,-66.17
3521,-66.20
3522,-66.24
3523,-66.29
3524,-66.34
3525,-66.38
3526,-66.42
3527,-66.46
3528,-66.49
3529,-66.51
3530,-66.52
3531,-66.51
3532,-66.49
3533,-66.47
3534,-66.45
3535,-66.43
3536,-66.41
3537,-66.38
3538,-66.34
3539,-66.31
3540,-66.29
3541,-66.27
3542,-66.25
3543,-66.24
3544,-66.24
3545,-66.23
3546,-66.21
3547,-66.19
3548,-66.17
3549,-66.17
3550,-66.15
3551,-66.13
3552,-66.11
3553,-66.10
3554,-66.09
3555,-66.09
3556,-66.08
3557,-66.07
3558,-66.06
3559,-66.05
3560,-66.03
3561,-66.01
3562,-65.99
3563,-65.96
3564,-65.92
3565,-65.89
3566,-65.84
3567,-65.79
3568,-65.73
3569,-65.67
3570,-65.62
3571,-65.58
3572,-65.54
3573,-65.50
3574,-65.48
3575,-65.47
3576,-65.46
3577,-65.47
3578,-65.47
3579,-65.48
3580,-65.48
3581,-65.49
3582,-65.48
3583,-65.49
3584,-65.48
3585,-65.46
3586,-65.43
3587,-65.40
3588,-65.38
3589,-65.36
3590,-65.33
3591,-65.30
3592,-65.28
3593,-65.28
3594,-65.29
3595,-65.29
3596,-65.29
3597,-65.31
3598,-65.34
3599,-65.38
3600,-65.43
3601,-65.47
3602,-65.51
3603,-65.55
3604,-65.59
3605,-65.62
3606,-65.66
3607,-65.70
3608,-65.74
3609,-65.76
3610,-65.77
3611,-65.76
3612,-65.77
3613,-65.77
3614,-65.76
3615,-65.73
3616,-65.72
3617,-65.70
3618,-65.70
3619,-65.70
3620,-65.71
3621,-65.72
3622,-65.73
3623,-65.75
3624,-65.77
3625,-65.79
3626,-65.81
3627,-65.82
3628,-65.83
3629,-65.83
3630,-65.81
3631,-65.78
3632,-65.74
3633,-65.70
3634,-65.66
3635,-65.62
3636,-65.59
3637,-65.56
3638,-65.54
3639,-65.52
3640,-65.53
3641,-65.55
3642,-65.58
3643,-65.62
3644,-65.66
3645,-65.71
3646,-65.78
3647,-65.84
3648,-65.91
3649,-65.98
3650,-66.02
3651,-66.06
3652,-66.10
3653,-66.13
3654,-66.15
3655,-66.15
3656,-66.14
3657,-66.13
3658,-66.12
3659,-66.11
3660,-66.09
3661,-66.08
3662,-66.05
3663,-66.02
3664,-65.99
3665,-65.97
3666,-65.95
3667,-65.93
3668,-65.91
3669,-65.88
3670,-65.85
3671,-65.83
3672,-65.82
3673,-65.81
3674,-65.80
3675,-65.80
3676,-65.81
3677,-65.82
3678,-65.83
3679,-65.85
3680,-65.88
3681,-65.91
3682,-65.93
3683,-65.95
3684,-65.97
3685,-65.99
3686,-66.01
3687,-66.02
3688,-66.03
3689,-66.04
3690,-66.04
3691,-66.03
3692,-66.02
3693,-66.02
3694,-66.02
3695,-66.01
3696,-65.99
3697,-65.99
3698,-65.98
3699,-65.98
3700,-65.98
3701,-65.98
3702,-65.99
3703,-65.99
3704,-66.01
3705,-66.03
3706,-66.06
3707,-66.09
3708,-66.11
3709,-66.14
3710,-66.18
3711,-66.22
3712,-66.25
3713,-66.27
3714,-66.29
3715,-66.30
3716,-66.30
3717,-66.29
3718,-66.26
3719,-66.22
3720,-66.18
3721,-66.14
3722,-66.10
3723,-66.05
3724,-65.99
3725,-65.94
3726,-65.91
3727,-65.89
3728,-65.87
3729,-65.87
3730,-65.87
3731,-65.87
3732,-65.89
3733,-65.91
3734,-65.94
3735,-65.98
3736,-66.02
3737,-66.05
3738,-66.08
3739,-66.12
3740,-66.16
3741,-66.20
3742,-66.24
3743,-66.28
3744,-66.31
3745,-66.34
3746,-66.38
3747,-66.43
3748,-66.48
3749,-66.51
3750,-66.53
3751,-66.56
3752,-66.59
3753,-66.61
3754,-66.62
3755,-66.60
3756,-66.59
3757,-66.57
3758,-66.54
3759,-66.50
3760,-66.46
3761,-66.42
3762,-66.38
3763,-66.34
3764,-66.31
3765,-66.28
3766,-66.27
3767,-66.26
3768,-66.26
3769,-66.26
3770,-66.26
3771,-66.27
3772,-66.28
3773,-66.29
3774,-66.31
3775,-66.31
3776,-66.32
3777,-66.32
3778,-66.32
3779,-66.32
3780,-66.31
3781,-66.31
3782,-66.29
3783,-66.27
3784,-66.24
3785,-66.21
3786,-66.19
3787,-66.16
3788,-66.12
3789,-66.08
3790,-66.05
3791,-66.01
3792,-65.99
3793,-65.97
3794,-65.96
3795,-65.96
3796,-65.96
3797,-65.96
3798,-65.97
3799,-65.99
3800,-66.01
3801,-66.02
3802,-66.02
3803,-66.03
3804,-66.05
3805,-66.06
3806,-66.06
3807,-66.06
3808,-66.06
3809,-66.06
3810,-66.06
3811,-66.05
3812,-66.03
3813,-66.01
3814,-66.00
3815,-65.99
3816,-65.97
3817,-65.94
3818,-65.91
3819,-65.88
3820,-65.85
3821,-65.82
3822,-65.79
3823,-65.76
3824,-65.73
3825,-65.73
3826,-65.72
3827,-65.72
3828,-65.73
3829,-65.73
3830,-65.75
3831,-65.77
3832,-65.80
3833,-65.83
3834,-65.85
3835,-65.87
3836,-65.89
3837,-65.91
3838,-65.93
3839,-65.94
3840,-65.95
3841,-65.95
3842,-65.97
3843,-65.99
3844,-66.01
3845,-66.02
3846,-66.03
3847,-66.04
3848,-66.04
3849,-66.04
3850,-66.04
3851,-66.04
3852,-66.04
3853,-66.03
3854,-66.01
3855,-65.99
3856,-65.98
3857,-65.96
3858,-65.95
3859,-65.95
3860,-65.95
3861,-65.95
3862,-65.97
3863,-65.98
3864,-65.99
3865,-66.01
3866,-66.03
3867,-66.06
3868,-66.07
3869,-66.08
3870,-66.08
3871,-66.07
3872,-66.06
3873,-66.03
3874,-66.01
3875,-65.98
3876,-65.94
3877,-65.90
3878,-65.86
3879,-65.81
3880,-65.76
3881,-65.70
3882,-65.66
3883,-65.63
3884,-65.61
3885,-65.60
3886,-65.61
3887,-65.64
3888,-65.69
3889,-65.73
3890,-65.79
3891,-65.86
3892,-65.94
3893,-66.02
3894,-66.10
3895,-66.18
3896,-66.26
3897,-66.31
3898,-66.36
3899,-66.39
3900,-66.41
3901,-66.42
3902,-66.42
3903,-66.40
3904,-66.39
3905,-66.38
3906,-66.38
3907,-66.38
3908,-66.38
3909,-66.39
3910,-66.41
3911,-66.45
3912,-66.51
3913,-66.57
3914,-66.66
3915,-66.76
3916,-66.87
3917,-66.98
3918,-67.09
3919,-67.20
3920,-67.30
3921,-67.40
3922,-67.49
3923,-67.56
3924,-67.62
3925,-67.65
3926,-67.68
3927,-67.67
3928,-67.66
3929,-67.65
3930,-67.64
3931,-67.62
3932,-67.59
3933,-67.58
3934,-67.57
3935,-67.57
3936,-67.57
3937,-67.57
3938,-67.57
3939,-67.57
3940,-67.57
3941,-67.56
3942,-67.54
3943,-67.52
3944,-67.50
3945,-67.48
3946,-67.46
3947,-67.44
3948,-67.43
3949,-67.43
3950,-67.43
3951,-67.44
3952,-67.46
3953,-67.47
3954,-67.50
3955,-67.52
3956,-67.54
3957,-67.55
3958,-67.54
3959,-67.54
3960,-67.52
3961,-67.50
3962,-67.47
3963,-67.43
3964,-67.39
3965,-67.36
3966,-67.33
3967,-67.30
3968,-67.28
3969,-67.25
3970,-67.24
3971,-67.23
3972,-67.23
3973,-67.23
3974,-67.23
3975,-67.23
3976,-67.23
3977,-67.23
3978,-67.22
3979,-67.21
3980,-67.21
3981,-67.20
3982,-67.18
3983,-67.15
3984,-67.12
3985,-67.09
3986,-67.05
3987,-67.00
3988,-66.95
3989,-66.90
3990,-66.85
3991,-66.80
3992,-66.74
3993,-66.69
3994,-66.63
3995,-66.58
3996,-66.53
3997,-66.47
3998,-66.41
3999,-66.35
4000,-66.29
4001,-66.24
4002,-66.20
4003,-66.16
4004,-66.12
4005,-66.09
4006,-66.08
4007,-66.08
4008,-66.08
4009,-66.08
4010,-66.09
4011,-66.11
4012,-66.13
4013,-66.14
4014,-66.15
4015,-66.16
4016,-66.16
4017,-66.16
4018,-66.16
4019,-66.15
4020,-66.13
4021,-66.11
4022,-66.09
4023,-66.06
4024,-66.02
4025,-65.99
4026,-65.97
4027,-65.95
4028,-65.93
4029,-65.92
4030,-65.92
4031,-65.93
4032,-65.95
4033,-65.97
4034,-65.99
4035,-66.02
4036,-66.06
4037,-66.11
4038,-66.17
4039,-66.22
4040,-66.26
4041,-66.30
4042,-66.34
4043,-66.38
4044,-66.41
4045,-66.43
4046,-66.45
4047,-66.46
4048,-66.46
4049,-66.44
4050,-66.40
4051,-66.36
4052,-66.32
4053,-66.28
4054,-66.24
4055,-66.21
4056,-66.19
4057,-66.18
4058,-66.18
4059,-66.20
4060,-66.24
4061,-66.28
4062,-66.32
4063,-66.37
4064,-66.42
4065,-66.49
4066,-66.55
4067,-66.60
4068,-66.63
4069,-66.64
4070,-66.64
4071,-66.63
4072,-66.60
4073,-66.56
4074,-66.51
4075,-66.45
4076,-66.38
4077,-66.31
4078,-66.24
4079,-66.17
4080,-66.11
4081,-66.05
4082,-65.99
4083,-65.95
4084,-65.89
4085,-65.85
4086,-65.80
4087,-65.76
4088,-65.72
4089,-65.68
4090,-65.65
4091,-65.62
4092,-65.59
4093,-65.55
4094,-65.50
4095,-65.46
4096,-65.43
4097,-65.40
4098,-65.37
4099,-65.34
4100,-65.32
4101,-65.31
4102,-65.30
4103,-65.29
4104,-65.29
4105,-65.29
4106,-65.29
4107,-65.29
4108,-65.29
4109,-65.29
4110,-65.29
4111,-65.28
4112,-65.26
4113,-65.23
4114,-65.19
4115,-65.16
4116,-65.13
4117,-65.09
4118,-65.05
4119,-65.01
4120,-64.97
4121,-64.94
4122,-64.92
4123,-64.90
4124,-64.88
4125,-64.87
4126,-64.87
4127,-64.87
4128,-64.87
4129,-64.88
4130,-64.90
4131,-64.92
4132,-64.94
4133,-64.97
4134,-65.01
4135,-65.03
4136,-65.07
4137,-65.11
4138,-65.15
4139,-65.19
4140,-65.23
4141,-65.26
4142,-65.28
4143,-65.30
4144,-65.31
4145,-65.31
4146,-65.31
4147,-65.30
4148,-65.27
4149,-65.25
4150,-65.21
4151,-65.18
4152,-65.15
4153,-65.12
4154,-65.10
4155,-65.08
4156,-65.06
4157,-65.04
4158,-65.03
4159,-65.04
4160,-65.06
4161,-65.08
4162,-65.10
4163,-65.13
4164,-65.16
4165,-65.21
4166,-65.26
4167,-65.30
4168,-65.35
4169,-65.38
4170,-65.43
4171,-65.48
4172,-65.53
4173,-65.57
4174,-65.60
4175,-65.63
4176,-65.66
4177,-65.68
4178,-65.69
4179,-65.70
4180,-65.70
4181,-65.70
4182,-65.71
4183,-65.70
4184,-65.70
4185,-65.69
4186,-65.68
4187,-65.68
4188,-65.69
4189,-65.70
4190,-65.71
4191,-65.73
4192,-65.76
4193,-65.79
4194,-65.82
4195,-65.84
4196,-65.88
4197,-65.92
4198,-65.96
4199,-66.00
4200,-66.04
4201,-66.08
4202,-66.13
4203,-66.17
4204,-66.23
4205,-66.29
4206,-66.35
4207,-66.40
4208,-66.44
4209,-66.46
4210,-66.49
4211,-66.51
4212,-66.52
4213,-66.51
4214,-66.49
4215,-66.47
4216,-66.44
4217,-66.42
4218,-66.38
4219,-66.35
4220,-66.32
4221,-66.29
4222,-66.27
4223,-66.26
4224,-66.25
4225,-66.24
4226,-66.24
4227,-66.24
4228,-66.24
4229,-66.23
4230,-66.21
4231,-66.19
4232,-66.17
4233,-66.14
4234,-66.10
4235,-66.06
4236,-66.02
4237,-65.97
4238,-65.92
4239,-65.88
4240,-65.84
4241,-65.80
4242,-65.77
4243,-65.75
4244,-65.74
4245,-65.74
4246,-65.74
4247,-65.75
4248,-65.78
4249,-65.82
4250,-65.86
4251,-65.90
4252,-65.94
4253,-65.99
4254,-66.06
4255,-66.11
4256,-66.16
4257,-66.20
4258,-66.25
4259,-66.29
4260,-66.33
4261,-66.37
4262,-66.40
4263,-66.44
4264,-66.47
4265,-66.49
4266,-66.51
4267,-66.54
4268,-66.57
4269,-66.59
4270,-66.60
4271,-66.60
4272,-66.60
4273,-66.60
4274,-66.59
4275,-66.57
4276,-66.55
4277,-66.54
4278,-66.53
4279,-66.51
4280,-66.49
4281,-66.49
4282,-66.50
4283,-66.50
4284,-66.50
4285,-66.49
4286,-66.50
4287,-66.51
4288,-66.53
4289,-66.55
4290,-66.56
4291,-66.58
4292,-66.61
4293,-66.64
4294,-66.67
4295,-66.70
4296,-66.73
4297,-66.76
4298,-66.79
4299,-66.82
4300,-66.84
4301,-66.85
4302,-66.85
4303,-66.85
4304,-66.85
4305,-66.82
4306,-66.80
4307,-66.79
4308,-66.80
4309,-66.81
4310,-66.82
4311,-66.84
4312,-66.87
4313,-66.92
4314,-66.98
4315,-67.04
4316,-67.10
4317,-67.16
4318,-67.22
4319,-67.26
4320,-67.28
4321,-67.29
4322,-67.29
4323,-67.28
4324,-67.26
4325,-67.23
4326,-67.18
4327,-67.14
4328,-67.09
4329,-67.05
4330,-67.01
4331,-66.97
4332,-66.94
4333,-66.92
4334,-66.90
4335,-66.88
4336,-66.87
4337,-66.87
4338,-66.87
4339,-66.86
4340,-66.85
4341,-66.84
4342,-66.83
4343,-66.81
4344,-66.78
4345,-66.75
4346,-66.72
4347,-66.70
4348,-66.68
4349,-66.65
4350,-66.63
4351,-66.62
4352,-66.61
4353,-66.62
4354,-66.62
4355,-66.63
4356,-66.64
4357,-66.65
4358,-66.67
4359,-66.68
4360,-66.70
4361,-66.72
4362,-66.75
4363,-66.78
4364,-66.81
4365,-66.84
4366,-66.86
4367,-66.89
4368,-66.94
4369,-66.99
4370,-67.03
4371,-67.07
4372,-67.12
4373,-67.17
4374,-67.21
4375,-67.24
4376,-67.27
4377,-67.29
4378,-67.32
4379,-67.33
4380,-67.33
4381,-67.32
4382,-67.30
4383,-67.28
4384,-67.26
4385,-67.25
4386,-67.24
4387,-67.23
4388,-67.23
4389,-67.23
4390,-67.23
4391,-67.24
4392,-67.26
4393,-67.29
4394,-67.32
4395,-67.35
4396,-67.39
4397,-67.43
4398,-67.47
4399,-67.50
4400,-67.52
4401,-67.53
4402,-67.53
4403,-67.53
4404,-67.52
4405,-67.50
4406,-67.47
4407,-67.43
4408,-67.39
4409,-67.35
4410,-67.31
4411,-67.27
4412,-67.23
4413,-67.19
4414,-67.15
4415,-67.14
4416,-67.13
4417,-67.13
4418,-67.13
4419,-67.14
4420,-67.16
4421,-67.18
4422,-67.20
4423,-67.22
4424,-67.24
4425,-67.27
4426,-67.30
4427,-67.33
4428,-67.36
4429,-67.39
4430,-67.42
4431,-67.45
4432,-67.48
4433,-67.51
4434,-67.54
4435,-67.57
4436,-67.60
4437,-67.63
4438,-67.67
4439,-67.69
4440,-67.71
4441,-67.72
4442,-67.74
4443,-67.76
4444,-67.77
4445,-67.77
4446,-67.77
4447,-67.78
4448,-67.79
4449,-67.79
4450,-67.79
4451,-67.78
4452,-67.79
4453,-67.80
4454,-67.80
4455,-67.79
4456,-67.78
4457,-67.77
4458,-67.76
4459,-67.74
4460,-67.71
4461,-67.67
4462,-67.62
4463,-67.58
4464,-67.52
4465,-67.45
4466,-67.37
4467,-67.29
4468,-67.21
4469,-67.13
4470,-67.05
4471,-66.97
4472,-66.89
4473,-66.83
4474,-66.76
4475,-66.70
4476,-66.65
4477,-66.61
4478,-66.59
4479,-66.58
4480,-66.57
4481,-66.57
4482,-66.59
4483,-66.61
4484,-66.66
4485,-66.71
4486,-66.76
4487,-66.81
4488,-66.86
4489,-66.90
4490,-66.93
4491,-66.95
4492,-66.96
4493,-66.97
4494,-66.97
4495,-66.96
4496,-66.95
4497,-66.95
4498,-66.95
4499,-66.95
4500,-66.96
4501,-66.98
4502,-67.01
4503,-67.05
4504,-67.09
4505,-67.13
4506,-67.18
4507,-67.22
4508,-67.27
4509,-67.31
4510,-67.34
4511,-67.36
4512,-67.37
4513,-67.37
4514,-67.36
4515,-67.34
4516,-67.32
4517,-67.30
4518,-67.27
4519,-67.23
4520,-67.20
4521,-67.18
4522,-67.16
4523,-67.15
4524,-67.15
4525,-67.17
4526,-67.21
4527,-67.25
4528,-67.29
4529,-67.34
4530,-67.40
4531,-67.45
4532,-67.52
4533,-67.59
4534,-67.66
4535,-67.71
4536,-67.75
4537,-67.77
4538,-67.80
4539,-67.82
4540,-67.84
4541,-67.86
4542,-67.87
4543,-67.88
4544,-67.89
4545,-67.90
4546,-67.91
4547,-67.92
4548,-67.94
4549,-67.95
4550,-67.97
4551,-67.97
4552,-67.96
4553,-67.96
4554,-67.96
4555,-67.95
4556,-67.93
4557,-67.90
4558,-67.87
4559,-67.84
4560,-67.82
4561,-67.79
4562,-67.77
4563,-67.76
4564,-67.74
4565,-67.74
4566,-67.75
4567,-67.75
4568,-67.75
4569,-67.76
4570,-67.77
4571,-67.78
4572,-67.79
4573,-67.79
4574,-67.79
4575,-67.79
4576,-67.79
4577,-67.79
4578,-67.78
4579,-67.77
4580,-67.77
4581,-67.78
4582,-67.79
4583,-67.80
4584,-67.82
4585,-67.85
4586,-67.87
4587,-67.90
4588,-67.92
4589,-67.95
4590,-67.97
4591,-68.00
4592,-68.01
4593,-68.03
4594,-68.05
4595,-68.05
4596,-68.04
4597,-68.04
4598,-68.04
4599,-68.04
4600,-68.05
4601,-68.04
4602,-68.04
4603,-68.04
4604,-68.05
4605,-68.06
4606,-68.07
4607,-68.08
4608,-68.08
4609,-68.08
4610,-68.09
4611,-68.10
4612,-68.11
4613,-68.12
4614,-68.13
4615,-68.15
4616,-68.17
4617,-68.20
4618,-68.24
4619,-68.29
4620,-68.35
4621,-68.41
4622,-68.48
4623,-68.54
4624,-68.62
4625,-68.68
4626,-68.75
4627,-68.82
4628,-68.89
4629,-68.95
4630,-69.00
4631,-69.05
4632,-69.10
4633,-69.14
4634,-69.17
4635,-69.19
4636,-69.21
4637,-69.23
4638,-69.24
4639,-69.23
4640,-69.20
4641,-69.17
4642,-69.13
4643,-69.10
4644,-69.06
4645,-69.01
4646,-68.94
4647,-68.88
4648,-68.80
4649,-68.73
4650,-68.66
4651,-68.58
4652,-68.50
4653,-68.42
4654,-68.33
4655,-68.25
4656,-68.16
4657,-68.08
4658,-68.00
4659,-67.94
4660,-67.88
4661,-67.83
4662,-67.78
4663,-67.74
4664,-67.72
4665,-67.71
4666,-67.70
4667,-67.71
4668,-67.71
4669,-67.72
4670,-67.73
4671,-67.76
4672,-67.77
4673,-67.79
4674,-67.82
4675,-67.84
4676,-67.85
4677,-67.85
4678,-67.84
4679,-67.83
4680,-67.82
4681,-67.80
4682,-67.77
4683,-67.73
4684,-67.69
4685,-67.66
4686,-67.63
4687,-67.61
4688,-67.60
4689,-67.59
4690,-67.59
4691,-67.60
4692,-67.61
4693,-67.63
4694,-67.66
4695,-67.69
4696,-67.72
4697,-67.74
4698,-67.76
4699,-67.79
4700,-67.81
4701,-67.82
4702,-67.84
4703,-67.86
4704,-67.87
4705,-67.87
4706,-67.87
4707,-67.88
4708,-67.89
4709,-67.89
4710,-67.88
4711,-67.87
4712,-67.86
4713,-67.85
4714,-67.83
4715,-67.80
4716,-67.78
4717,-67.76
4718,-67.73
4719,-67.70
4720,-67.67
4721,-67.64
4722,-67.61
4723,-67.58
4724,-67.56
4725,-67.55
4726,-67.55
4727,-67.56
4728,-67.58
4729,-67.59
4730,-67.62
4731,-67.65
4732,-67.68
4733,-67.72
4734,-67.77
4735,-67.82
4736,-67.87
4737,-67.92
4738,-67.98
4739,-68.05
4740,-68.12
4741,-68.19
4742,-68.26
4743,-68.34
4744,-68.43
4745,-68.52
4746,-68.60
4747,-68.66
4748,-68.74
4749,-68.80
4750,-68.87
4751,-68.91
4752,-68.96
4753,-69.00
4754,-69.03
4755,-69.05
4756,-69.07
4757,-69.09
4758,-69.10
4759,-69.11
4760,-69.13
4761,-69.14
4762,-69.16
4763,-69.17
4764,-69.18
4765,-69.20
4766,-69.23
4767,-69.25
4768,-69.26
4769,-69.27
4770,-69.28
4771,-69.30
4772,-69.33
4773,-69.36
4774,-69.39
4775,-69.42
4776,-69.45
4777,-69.48
4778,-69.51
4779,-69.54
4780,-69.56
4781,-69.57
4782,-69.57
4783,-69.56
4784,-69.54
4785,-69.52
4786,-69.50
4787,-69.47
4788,-69.44
4789,-69.42
4790,-69.40
4791,-69.39
4792,-69.39
4793,-69.40
4794,-69.42
4795,-69.44
4796,-69.47
4797,-69.50
4798,-69.52
4799,-69.53
4800,-69.53
4801,-69.51
4802,-69.48
4803,-69.45
4804,-69.41
4805,-69.36
4806,-69.31
4807,-69.27
4808,-69.24
4809,-69.22
4810,-69.22
4811,-69.24
4812,-69.27
4813,-69.31
4814,-69.36
4815,-69.41
4816,-69.45
4817,-69.50
4818,-69.53
4819,-69.54
4820,-69.52
4821,-69.48
4822,-69.42
4823,-69.35
4824,-69.27
4825,-69.17
4826,-69.06
4827,-68.94
4828,-68.81
4829,-68.69
4830,-68.55
4831,-68.41
4832,-68.27
4833,-68.15
4834,-68.02
4835,-67.90
4836,-67.79
4837,-67.69
4838,-67.60
4839,-67.52
4840,-67.46
4841,-67.42
4842,-67.40
4843,-67.39
4844,-67.39
4845,-67.41
4846,-67.45
4847,-67.50
4848,-67.55
4849,-67.61
4850,-67.68
4851,-67.76
4852,-67.84
4853,-67.92
4854,-68.01
4855,-68.08
4856,-68.16
4857,-68.23
4858,-68.30
4859,-68.38
4860,-68.46
4861,-68.52
4862,-68.60
4863,-68.67
4864,-68.76
4865,-68.84
4866,-68.91
4867,-68.99
4868,-69.08
4869,-69.16
4870,-69.23
4871,-69.28
4872,-69.34
4873,-69.39
4874,-69.43
4875,-69.46
4876,-69.48
4877,-69.50
4878,-69.52
4879,-69.54
4880,-69.56
4881,-69.56
4882,-69.58
4883,-69.61
4884,-69.65
4885,-69.69
4886,-69.73
4887,-69.78
4888,-69.84
4889,-69.90
4890,-69.96
4891,-70.02
4892,-70.08
4893,-70.12
4894,-70.17
4895,-70.19
4896,-70.22
4897,-70.24
4898,-70.25
4899,-70.26
4900,-70.26
4901,-70.25
4902,-70.24
4903,-70.23
4904,-70.22
4905,-70.21
4906,-70.20
4907,-70.19
4908,-70.18
4909,-70.18
4910,-70.18
4911,-70.18
4912,-70.19
4913,-70.21
4914,-70.23
4915,-70.25
4916,-70.28
4917,-70.31
4918,-70.34
4919,-70.37
4920,-70.39
4921,-70.40
4922,-70.41
4923,-70.42
4924,-70.43
4925,-70.42
4926,-70.39
4927,-70.36
4928,-70.33
4929,-70.30
4930,-70.27
4931,-70.23
4932,-70.19
4933,-70.15
4934,-70.10
4935,-70.07
4936,-70.03
4937,-70.01
4938,-70.00
4939,-69.99
4940,-69.99
4941,-70.00
4942,-70.01
4943,-70.02
4944,-70.03
4945,-70.06
4946,-70.07
4947,-70.09
4948,-70.09
4949,-70.09
4950,-70.08
4951,-70.07
4952,-70.06
4953,-70.04
4954,-70.01
4955,-69.98
4956,-69.96
4957,-69.94
4958,-69.92
4959,-69.90
4960,-69.88
4961,-69.86
4962,-69.84
4963,-69.82
4964,-69.80
4965,-69.78
4966,-69.76
4967,-69.74
4968,-69.71
4969,-69.67
4970,-69.63
4971,-69.59
4972,-69.55
4973,-69.49
4974,-69.42
4975,-69.35
4976,-69.28
4977,-69.22
4978,-69.17
4979,-69.12
4980,-69.07
4981,-69.03
4982,-69.01
4983,-69.00
4984,-68.99
4985,-68.99
4986,-69.00
4987,-69.01
4988,-69.02
4989,-69.02
4990,-69.02
4991,-69.00
4992,-68.98
4993,-68.94
4994,-68.90
4995,-68.85
4996,-68.81
4997,-68.77
4998,-68.74
4999,-68.72
5000,-68.71
5001,-68.71
5002,-68.73
5003,-68.76
5004,-68.80
5005,-68.85
5006,-68.91
5007,-68.96
5008,-69.02
5009,-69.07
5010,-69.11
5011,-69.14
5012,-69.17
5013,-69.19
5014,-69.20
5015,-69.20
5016,-69.19
5017,-69.18
5018,-69.17
5019,-69.15
5020,-69.12
5021,-69.09
5022,-69.06
5023,-69.03
5024,-69.01
5025,-68.99
5026,-68.96
5027,-68.93
5028,-68.90
5029,-68.88
5030,-68.87
5031,-68.86
5032,-68.85
5033,-68.85
5034,-68.87
5035,-68.88
5036,-68.91
5037,-68.93
5038,-68.95
5039,-68.98
5040,-69.02
5041,-69.06
5042,-69.09
5043,-69.12
5044,-69.15
5045,-69.18
5046,-69.20
5047,-69.21
5048,-69.22
5049,-69.23
5050,-69.24
5051,-69.24
5052,-69.23
5053,-69.22
5054,-69.20
5055,-69.19
5056,-69.17
5057,-69.15
5058,-69.12
5059,-69.09
5060,-69.06
5061,-69.04
5062,-69.02
5063,-68.99
5064,-68.96
5065,-68.93
5066,-68.91
5067,-68.88
5068,-68.86
5069,-68.84
5070,-68.83
5071,-68.82
5072,-68.81
5073,-68.80
5074,-68.80
5075,-68.80
5076,-68.80
5077,-68.80
5078,-68.80
5079,-68.81
5080,-68.82
5081,-68.83
5082,-68.84
5083,-68.85
5084,-68.86
5085,-68.87
5086,-68.88
5087,-68.89
5088,-68.90
5089,-68.91
5090,-68.92
5091,-68.92
5092,-68.91
5093,-68.91
5094,-68.88
5095,-68.85
5096,-68.82
5097,-68.79
5098,-68.76
5099,-68.72
5100,-68.68
5101,-68.65
5102,-68.62
5103,-68.59
5104,-68.57
5105,-68.56
5106,-68.55
5107,-68.55
5108,-68.57
5109,-68.60
5110,-68.63
5111,-68.68
5112,-68.73
5113,-68.78
5114,-68.85
5115,-68.91
5116,-68.97
5117,-69.02
5118,-69.08
5119,-69.13
5120,-69.17
5121,-69.21
5122,-69.25
5123,-69.29
5124,-69.33
5125,-69.36
5126,-69.39
5127,-69.42
5128,-69.45
5129,-69.46
5130,-69.48
5131,-69.49
5132,-69.50
5133,-69.49
5134,-69.49
5135,-69.48
5136,-69.47
5137,-69.46
5138,-69.44
5139,-69.41
5140,-69.38
5141,-69.36
5142,-69.34
5143,-69.31
5144,-69.28
5145,-69.26
5146,-69.25
5147,-69.24
5148,-69.23
5149,-69.23
5150,-69.24
5151,-69.24
5152,-69.23
5153,-69.22
5154,-69.21
5155,-69.20
5156,-69.19
5157,-69.17
5158,-69.14
5159,-69.11
5160,-69.08
5161,-69.05
5162,-69.02
5163,-68.99
5164,-68.96
5165,-68.93
5166,-68.90
5167,-68.88
5168,-68.87
5169,-68.86
5170,-68.86
5171,-68.86
5172,-68.86
5173,-68.86
5174,-68.85
5175,-68.84
5176,-68.83
5177,-68.81
5178,-68.78
5179,-68.74
5180,-68.70
5181,-68.67
5182,-68.64
5183,-68.61
5184,-68.59
5185,-68.56
5186,-68.55
5187,-68.55
5188,-68.57
5189,-68.59
5190,-68.61
5191,-68.63
5192,-68.65
5193,-68.66
5194,-68.66
5195,-68.66
5196,-68.66
5197,-68.65
5198,-68.62
5199,-68.59
5200,-68.57
5201,-68.55
5202,-68.54
5203,-68.54
5204,-68.54
5205,-68.55
5206,-68.57
5207,-68.60
5208,-68.64
5209,-68.68
5210,-68.72
5211,-68.76
5212,-68.80
5213,-68.85
5214,-68.90
5215,-68.94
5216,-68.97
5217,-69.00
5218,-69.03
5219,-69.05
5220,-69.06
5221,-69.06
5222,-69.06
5223,-69.06
5224,-69.05
5225,-69.03
5226,-69.01
5227,-68.99
5228,-68.96
5229,-68.93
5230,-68.91
5231,-68.90
5232,-68.89
5233,-68.87
5234,-68.85
5235,-68.85
5236,-68.86
5237,-68.86
5238,-68.86
5239,-68.86
5240,-68.86
5241,-68.87
5242,-68.88
5243,-68.89
5244,-68.91
5245,-68.91
5246,-68.91
5247,-68.91
5248,-68.92
5249,-68.93
5250,-68.94
5251,-68.94
5252,-68.93
5253,-68.92
5254,-68.91
5255,-68.89
5256,-68.87
5257,-68.84
5258,-68.83
5259,-68.81
5260,-68.79
5261,-68.77
5262,-68.75
5263,-68.74
5264,-68.74
5265,-68.74
5266,-68.74
5267,-68.75
5268,-68.77
5269,-68.79
5270,-68.80
5271,-68.83
5272,-68.85
5273,-68.88
5274,-68.90
5275,-68.91
5276,-68.92
5277,-68.93
5278,-68.94
5279,-68.93
5280,-68.91
5281,-68.87
5282,-68.84
5283,-68.81
5284,-68.79
5285,-68.77
5286,-68.74
5287,-68.71
5288,-68.69
5289,-68.68
5290,-68.67
5291,-68.66
5292,-68.65
5293,-68.64
5294,-68.63
5295,-68.63
5296,-68.64
5297,-68.65
5298,-68.67
5299,-68.69
5300,-68.71
5301,-68.74
5302,-68.78
5303,-68.82
5304,-68.85
5305,-68.88
5306,-68.91
5307,-68.94
5308,-68.96
5309,-68.98
5310,-68.98
5311,-68.98
5312,-68.97
5313,-68.96
5314,-68.95
5315,-68.94
5316,-68.93
5317,-68.92
5318,-68.91
5319,-68.90
5320,-68.90
5321,-68.90
5322,-68.90
5323,-68.90
5324,-68.90
5325,-68.90
5326,-68.90
5327,-68.91
5328,-68.92
5329,-68.93
5330,-68.94
5331,-68.95
5332,-68.96
5333,-68.98
5334,-69.01
5335,-69.02
5336,-69.04
5337,-69.06
5338,-69.09
5339,-69.12
5340,-69.15
5341,-69.18
5342,-69.21
5343,-69.24
5344,-69.27
5345,-69.30
5346,-69.33
5347,-69.35
5348,-69.35
5349,-69.35
5350,-69.32
5351,-69.29
5352,-69.26
5353,-69.22
5354,-69.17
5355,-69.12
5356,-69.07
5357,-69.03
5358,-69.00
5359,-68.98
5360,-68.97
5361,-68.97
5362,-68.98
5363,-68.99
5364,-69.00
5365,-69.02
5366,-69.05
5367,-69.07
5368,-69.08
5369,-69.08
5370,-69.07
5371,-69.06
5372,-69.05
5373,-69.04
5374,-69.03
5375,-69.02
5376,-69.02
5377,-69.02
5378,-69.05
5379,-69.08
5380,-69.11
5381,-69.15
5382,-69.20
5383,-69.25
5384,-69.29
5385,-69.34
5386,-69.37
5387,-69.40
5388,-69.42
5389,-69.43
5390,-69.43
5391,-69.43
5392,-69.43
5393,-69.42
5394,-69.40
5395,-69.38
5396,-69.37
5397,-69.35
5398,-69.35
5399,-69.34
5400,-69.33
5401,-69.32
5402,-69.31
5403,-69.30
5404,-69.30
5405,-69.31
5406,-69.31
5407,-69.31
5408,-69.31
5409,-69.31
5410,-69.31
5411,-69.30
5412,-69.29
5413,-69.28
5414,-69.26
5415,-69.23
5416,-69.20
5417,-69.18
5418,-69.16
5419,-69.14
5420,-69.13
5421,-69.13
5422,-69.13
5423,-69.14
5424,-69.13
5425,-69.13
5426,-69.13
5427,-69.14
5428,-69.13
5429,-69.12
5430,-69.10
5431,-69.09
5432,-69.06
5433,-69.03
5434,-69.00
5435,-68.96
5436,-68.92
5437,-68.89
5438,-68.86
5439,-68.83
5440,-68.80
5441,-68.78
5442,-68.77
5443,-68.76
5444,-68.75
5445,-68.75
5446,-68.76
5447,-68.78
5448,-68.81
5449,-68.85
5450,-68.90
5451,-68.95
5452,-69.01
5453,-69.06
5454,-69.13
5455,-69.18
5456,-69.25
5457,-69.32
5458,-69.38
5459,-69.44
5460,-69.50
5461,-69.56
5462,-69.62
5463,-69.68
5464,-69.73
5465,-69.77
5466,-69.81
5467,-69.85
5468,-69.89
5469,-69.92
5470,-69.94
5471,-69.96
5472,-69.97
5473,-69.97
5474,-69.97
5475,-69.97
5476,-69.97
5477,-69.97
5478,-69.96
5479,-69.94
5480,-69.92
5481,-69.91
5482,-69.91
5483,-69.91
5484,-69.90
5485,-69.89
5486,-69.89
5487,-69.89
5488,-69.89
5489,-69.89
5490,-69.89
5491,-69.90
5492,-69.91
5493,-69.91
5494,-69.91
5495,-69.93
5496,-69.96
5497,-69.99
5498,-70.03
5499,-70.07
5500,-70.11
5501,-70.16
5502,-70.21
5503,-70.27
5504,-70.33
5505,-70.39
5506,-70.46
5507,-70.51
5508,-70.57
5509,-70.61
5510,-70.64
5511,-70.68
5512,-70.72
5513,-70.75
5514,-70.77
5515,-70.79
5516,-70.81
5517,-70.83
5518,-70.85
5519,-70.86
5520,-70.86
5521,-70.86
5522,-70.85
5523,-70.83
5524,-70.81
5525,-70.78
5526,-70.74
5527,-70.69
5528,-70.63
5529,-70.57
5530,-70.51
5531,-70.44
5532,-70.37
5533,-70.30
5534,-70.23
5535,-70.19
5536,-70.15
5537,-70.12
5538,-70.09
5539,-70.09
5540,-70.09
5541,-70.11
5542,-70.14
5543,-70.17
5544,-70.21
5545,-70.25
5546,-70.28
5547,-70.30
5548,-70.31
5549,-70.32
5550,-70.33
5551,-70.33
5552,-70.32
5553,-70.29
5554,-70.29
5555,-70.28
5556,-70.28
5557,-70.28
5558,-70.30
5559,-70.32
5560,-70.36
5561,-70.40
5562,-70.45
5563,-70.51
5564,-70.57
5565,-70.63
5566,-70.69
5567,-70.75
5568,-70.81
5569,-70.86
5570,-70.90
5571,-70.94
5572,-70.98
5573,-71.01
5574,-71.03
5575,-71.05
5576,-71.07
5577,-71.09
5578,-71.11
5579,-71.13
5580,-71.14
5581,-71.15
5582,-71.17
5583,-71.19
5584,-71.20
5585,-71.22
5586,-71.22
5587,-71.23
5588,-71.24
5589,-71.25
5590,-71.26
5591,-71.27
5592,-71.28
5593,-71.28
5594,-71.28
5595,-71.28
5596,-71.27
5597,-71.24
5598,-71.19
5599,-71.13
5600,-71.06
5601,-70.98
5602,-70.90
5603,-70.81
5604,-70.71
5605,-70.60
5606,-70.49
5607,-70.39
5608,-70.30
5609,-70.22
5610,-70.14
5611,-70.08
5612,-70.02
5613,-69.98
5614,-69.95
5615,-69.92
5616,-69.89
5617,-69.86
5618,-69.83
5619,-69.81
5620,-69.77
5621,-69.73
5622,-69.69
5623,-69.65
5624,-69.61
5625,-69.58
5626,-69.56
5627,-69.55
5628,-69.55
5629,-69.56
5630,-69.59
5631,-69.65
5632,-69.73
5633,-69.82
5634,-69.92
5635,-70.02
5636,-70.15
5637,-70.29
5638,-70.44
5639,-70.57
5640,-70.71
5641,-70.85
5642,-70.99
5643,-71.13
5644,-71.26
5645,-71.39
5646,-71.52
5647,-71.65
5648,-71.78
5649,-71.90
5650,-72.05
5651,-72.19
5652,-72.34
5653,-72.48
5654,-72.63
5655,-72.77
5656,-72.91
5657,-73.03
5658,-73.14
5659,-73.24
5660,-73.32
5661,-73.37
5662,-73.40
5663,-73.42
5664,-73.42
5665,-73.39
5666,-73.34
5667,-73.28
5668,-73.20
5669,-73.11
5670,-73.02
5671,-72.93
5672,-72.83
5673,-72.74
5674,-72.64
5675,-72.56
5676,-72.49
5677,-72.42
5678,-72.36
5679,-72.31
5680,-72.27
5681,-72.24
5682,-72.22
5683,-72.21
5684,-72.20
5685,-72.19
5686,-72.19
5687,-72.20
5688,-72.21
5689,-72.21
5690,-72.21
5691,-72.22
5692,-72.24
5693,-72.24
5694,-72.26
5695,-72.27
5696,-72.27
5697,-72.27
5698,-72.27
5699,-72.27
5700,-72.26
5701,-72.24
5702,-72.22
5703,-72.20
5704,-72.18
5705,-72.16
5706,-72.14
5707,-72.13
5708,-72.13
5709,-72.12
5710,-72.14
5711,-72.18
5712,-72.24
5713,-72.31
5714,-72.39
5715,-72.48
5716,-72.58
5717,-72.68
5718,-72.77
5719,-72.85
5720,-72.92
5721,-72.98
5722,-73.02
5723,-73.04
5724,-73.05
5725,-73.04
5726,-73.04
5727,-73.02
5728,-72.99
5729,-72.96
5730,-72.94
5731,-72.92
5732,-72.92
5733,-72.91
5734,-72.91
5735,-72.92
5736,-72.93
5737,-72.94
5738,-72.95
5739,-72.96
5740,-72.96
5741,-72.97
5742,-72.96
5743,-72.94
5744,-72.91
5745,-72.88
5746,-72.85
5747,-72.82
5748,-72.78
5749,-72.74
5750,-72.67
5751,-72.61
5752,-72.53
5753,-72.44
5754,-72.33
5755,-72.22
5756,-72.09
5757,-71.96
5758,-71.82
5759,-71.68
5760,-71.55
5761,-71.43
5762,-71.32
5763,-71.24
5764,-71.16
5765,-71.10
5766,-71.06
5767,-71.05
5768,-71.06
5769,-71.08
5770,-71.11
5771,-71.14
5772,-71.18
5773,-71.23
5774,-71.28
5775,-71.32
5776,-71.36
5777,-71.39
5778,-71.44
5779,-71.48
5780,-71.51
5781,-71.54
5782,-71.57
5783,-71.60
5784,-71.63
5785,-71.66
5786,-71.69
5787,-71.71
5788,-71.72
5789,-71.73
5790,-71.74
5791,-71.75
5792,-71.75
5793,-71.73
5794,-71.70
5795,-71.68
5796,-71.67
5797,-71.65
5798,-71.62
5799,-71.59
5800,-71.56
5801,-71.53
5802,-71.50
5803,-71.48
5804,-71.47
5805,-71.47
5806,-71.48
5807,-71.49
5808,-71.51
5809,-71.54
5810,-71.58
5811,-71.62
5812,-71.66
5813,-71.69
5814,-71.73
5815,-71.76
5816,-71.78
5817,-71.79
5818,-71.80
5819,-71.81
5820,-71.81
5821,-71.80
5822,-71.79
5823,-71.79
5824,-71.79
5825,-71.79
5826,-71.80
5827,-71.80
5828,-71.82
5829,-71.84
5830,-71.87
5831,-71.90
5832,-71.92
5833,-71.95
5834,-71.99
5835,-72.04
5836,-72.09
5837,-72.13
5838,-72.17
5839,-72.21
5840,-72.24
5841,-72.27
5842,-72.31
5843,-72.33
5844,-72.36
5845,-72.38
5846,-72.40
5847,-72.42
5848,-72.44
5849,-72.46
5850,-72.48
5851,-72.50
5852,-72.52
5853,-72.54
5854,-72.56
5855,-72.58
5856,-72.60
5857,-72.62
5858,-72.63
5859,-72.64
5860,-72.65
5861,-72.64
5862,-72.62
5863,-72.59
5864,-72.55
5865,-72.50
5866,-72.44
5867,-72.37
5868,-72.29
5869,-72.22
5870,-72.16
5871,-72.10
5872,-72.05
5873,-72.01
5874,-71.98
5875,-71.97
5876,-71.97
5877,-71.99
5878,-72.03
5879,-72.09
5880,-72.16
5881,-72.24
5882,-72.30
5883,-72.37
5884,-72.45
5885,-72.52
5886,-72.57
5887,-72.61
5888,-72.65
5889,-72.69
5890,-72.72
5891,-72.74
5892,-72.76
5893,-72.78
5894,-72.80
5895,-72.82
5896,-72.83
5897,-72.84
5898,-72.85
5899,-72.85
5900,-72.83
5901,-72.81
5902,-72.77
5903,-72.73
5904,-72.68
5905,-72.61
5906,-72.53
5907,-72.44
5908,-72.34
5909,-72.24
5910,-72.14
5911,-72.06
5912,-71.96
5913,-71.89
5914,-71.82
5915,-71.78
5916,-71.76
5917,-71.74
5918,-71.73
5919,-71.73
5920,-71.74
5921,-71.76
5922,-71.78
5923,-71.79
5924,-71.80
5925,-71.80
5926,-71.82
5927,-71.83
5928,-71.84
5929,-71.84
5930,-71.83
5931,-71.83
5932,-71.83
5933,-71.83
5934,-71.83
5935,-71.83
5936,-71.84
5937,-71.83
5938,-71.83
5939,-71.83
5940,-71.84
5941,-71.84
5942,-71.86
5943,-71.87
5944,-71.88
5945,-71.89
5946,-71.90
5947,-71.91
5948,-71.92
5949,-71.93
5950,-71.94
5951,-71.95
5952,-71.96
5953,-71.96
5954,-71.95
5955,-71.94
5956,-71.93
5957,-71.92
5958,-71.90
5959,-71.87
5960,-71.84
5961,-71.81
5962,-71.77
5963,-71.74
5964,-71.69
5965,-71.66
5966,-71.62
5967,-71.58
5968,-71.53
5969,-71.48
5970,-71.43
5971,-71.37
5972,-71.30
5973,-71.23
5974,-71.16
5975,-71.09
5976,-71.02
5977,-70.94
5978,-70.86
5979,-70.79
5980,-70.73
5981,-70.67
5982,-70.62
5983,-70.58
5984,-70.55
5985,-70.54
5986,-70.54
5987,-70.56
5988,-70.57
5989,-70.59
5990,-70.62
5991,-70.66
5992,-70.70
5993,-70.72
5994,-70.72
5995,-70.72
5996,-70.72
5997,-70.71
5998,-70.69
5999,-70.65
6000,-70.60
6001,-70.55
6002,-70.50
6003,-70.46
6004,-70.43
6005,-70.39
6006,-70.37
6007,-70.36
6008,-70.37
6009,-70.39
6010,-70.42
6011,-70.45
6012,-70.48
6013,-70.52
6014,-70.56
6015,-70.60
6016,-70.64
6017,-70.68
6018,-70.72
6019,-70.75
6020,-70.77
6021,-70.78
6022,-70.79
6023,-70.80
6024,-70.80
6025,-70.80
6026,-70.80
6027,-70.80
6028,-70.81
6029,-70.83
6030,-70.85
6031,-70.87
6032,-70.90
6033,-70.94
6034,-70.98
6035,-71.03
6036,-71.09
6037,-71.15
6038,-71.21
6039,-71.26
6040,-71.33
6041,-71.40
6042,-71.48
6043,-71.55
6044,-71.63
6045,-71.70
6046,-71.77
6047,-71.84
6048,-71.91
6049,-71.98
6050,-72.05
6051,-72.10
6052,-72.15
6053,-72.18
6054,-72.20
6055,-72.22
6056,-72.24
6057,-72.24
6058,-72.23
6059,-72.20
6060,-72.18
6061,-72.15
6062,-72.11
6063,-72.07
6064,-72.03
6065,-71.98
6066,-71.93
6067,-71.88
6068,-71.83
6069,-71.79
6070,-71.76
6071,-71.73
6072,-71.70
6073,-71.68
6074,-71.67
6075,-71.67
6076,-71.68
6077,-71.70
6078,-71.72
6079,-71.74
6080,-71.77
6081,-71.80
6082,-71.82
6083,-71.84
6084,-71.87
6085,-71.90
6086,-71.92
6087,-71.93
6088,-71.94
6089,-71.95
6090,-71.95
6091,-71.95
6092,-71.95
6093,-71.96
6094,-71.98
6095,-72.00
6096,-72.02
6097,-72.05
6098,-72.09
6099,-72.14
6100,-72.20
6101,-72.25
6102,-72.33
6103,-72.42
6104,-72.52
6105,-72.60
6106,-72.69
6107,-72.76
6108,-72.85
6109,-72.92
6110,-72.99
6111,-73.04
6112,-73.09
6113,-73.11
6114,-73.13
6115,-73.13
6116,-73.12
6117,-73.11
6118,-73.09
6119,-73.07
6120,-73.06
6121,-73.04
6122,-73.01
6123,-72.97
6124,-72.92
6125,-72.89
6126,-72.84
6127,-72.79
6128,-72.74
6129,-72.68
6130,-72.61
6131,-72.56
6132,-72.50
6133,-72.45
6134,-72.41
6135,-72.37
6136,-72.33
6137,-72.30
6138,-72.28
6139,-72.26
6140,-72.24
6141,-72.22
6142,-72.20
6143,-72.18
6144,-72.16
6145,-72.13
6146,-72.10
6147,-72.07
6148,-72.03
6149,-71.99
6150,-71.95
6151,-71.94
6152,-71.93
6153,-71.92
6154,-71.91
6155,-71.89
6156,-71.89
6157,-71.91
6158,-71.91
6159,-71.91
6160,-71.91
6161,-71.91
6162,-71.91
6163,-71.91
6164,-71.91
6165,-71.90
6166,-71.88
6167,-71.88
6168,-71.87
6169,-71.88
6170,-71.91
6171,-71.93
6172,-71.97
6173,-72.01
6174,-72.06
6175,-72.13
6176,-72.20
6177,-72.26
6178,-72.31
6179,-72.35
6180,-72.38
6181,-72.39
6182,-72.38
6183,-72.35
6184,-72.31
6185,-72.26
6186,-72.20
6187,-72.13
6188,-72.06
6189,-72.01
6190,-71.97
6191,-71.94
6192,-71.93
6193,-71.94
6194,-71.97
6195,-72.01
6196,-72.06
6197,-72.12
6198,-72.18
6199,-72.23
6200,-72.27
6201,-72.30
6202,-72.32
6203,-72.34
6204,-72.35
6205,-72.35
6206,-72.35
6207,-72.34
6208,-72.32
6209,-72.30
6210,-72.28
6211,-72.28
6212,-72.30
6213,-72.32
6214,-72.34
6215,-72.35
6216,-72.38
6217,-72.42
6218,-72.46
6219,-72.50
6220,-72.52
6221,-72.54
6222,-72.55
6223,-72.56
6224,-72.57
6225,-72.58
6226,-72.59
6227,-72.60
6228,-72.61
6229,-72.63
6230,-72.66
6231,-72.69
6232,-72.72
6233,-72.75
6234,-72.78
6235,-72.81
6236,-72.84
6237,-72.86
6238,-72.86
6239,-72.85
6240,-72.84
6241,-72.81
6242,-72.79
6243,-72.75
6244,-72.70
6245,-72.65
6246,-72.61
6247,-72.58
6248,-72.55
6249,-72.53
6250,-72.52
6251,-72.52
6252,-72.53
6253,-72.56
6254,-72.58
6255,-72.60
6256,-72.61
6257,-72.62
6258,-72.63
6259,-72.64
6260,-72.65
6261,-72.65
6262,-72.63
6263,-72.62
6264,-72.60
6265,-72.59
6266,-72.58
6267,-72.57
6268,-72.56
6269,-72.55
6270,-72.54
6271,-72.53
6272,-72.52
6273,-72.50
6274,-72.47
6275,-72.44
6276,-72.42
6277,-72.38
6278,-72.35
6279,-72.32
6280,-72.30
6281,-72.29
6282,-72.28
6283,-72.28
6284,-72.29
6285,-72.31
6286,-72.34
6287,-72.38
6288,-72.43
6289,-72.47
6290,-72.50
6291,-72.53
6292,-72.56
6293,-72.58
6294,-72.60
6295,-72.60
6296,-72.60
6297,-72.61
6298,-72.61
6299,-72.61
6300,-72.60
6301,-72.59
6302,-72.59
6303,-72.60
6304,-72.61
6305,-72.62
6306,-72.63
6307,-72.64
6308,-72.65
6309,-72.66
6310,-72.67
6311,-72.67
6312,-72.67
6313,-72.68
6314,-72.69
6315,-72.70
6316,-72.71
6317,-72.72
6318,-72.73
6319,-72.75
6320,-72.78
6321,-72.82
6322,-72.86
6323,-72.90
6324,-72.96
6325,-73.03
6326,-73.09
6327,-73.15
6328,-73.22
6329,-73.29
6330,-73.38
6331,-73.46
6332,-73.54
6333,-73.62
6334,-73.70
6335,-73.78
6336,-73.86
6337,-73.94
6338,-74.01
6339,-74.07
6340,-74.13
6341,-74.18
6342,-74.24
6343,-74.29
6344,-74.34
6345,-74.39
6346,-74.44
6347,-74.48
6348,-74.54
6349,-74.60
6350,-74.66
6351,-74.71
6352,-74.76
6353,-74.80
6354,-74.85
6355,-74.89
6356,-74.93
6357,-74.95
6358,-74.98
6359,-75.00
6360,-75.02
6361,-75.04
6362,-75.06
6363,-75.08
6364,-75.10
6365,-75.12
6366,-75.13
6367,-75.15
6368,-75.19
6369,-75.23
6370,-75.26
6371,-75.29
6372,-75.33
6373,-75.38
6374,-75.42
6375,-75.45
6376,-75.48
6377,-75.51
6378,-75.53
6379,-75.53
6380,-75.52
6381,-75.50
6382,-75.47
6383,-75.42
6384,-75.35
6385,-75.27
6386,-75.18
6387,-75.09
6388,-75.00
6389,-74.91
6390,-74.82
6391,-74.73
6392,-74.66
6393,-74.60
6394,-74.54
6395,-74.49
6396,-74.45
6397,-74.42
6398,-74.40
6399,-74.39
6400,-74.39
6401,-74.39
6402,-74.39
6403,-74.39
6404,-74.40
6405,-74.40
6406,-74.41
6407,-74.43
6408,-74.44
6409,-74.46
6410,-74.48
6411,-74.49
6412,-74.49
6413,-74.49
6414,-74.49
6415,-74.48
6416,-74.46
6417,-74.44
6418,-74.41
6419,-74.37
6420,-74.33
6421,-74.28
6422,-74.23
6423,-74.18
6424,-74.12
6425,-74.06
6426,-74.01
6427,-73.97
6428,-73.93
6429,-73.90
6430,-73.86
6431,-73.84
6432,-73.82
6433,-73.80
6434,-73.79
6435,-73.79
6436,-73.80
6437,-73.81
6438,-73.83
6439,-73.84
6440,-73.87
6441,-73.90
6442,-73.94
6443,-73.98
6444,-74.04
6445,-74.10
6446,-74.17
6447,-74.25
6448,-74.34
6449,-74.44
6450,-74.55
6451,-74.67
6452,-74.79
6453,-74.91
6454,-75.02
6455,-75.13
6456,-75.24
6457,-75.35
6458,-75.45
6459,-75.53
6460,-75.60
6461,-75.64
6462,-75.68
6463,-75.71
6464,-75.73
6465,-75.74
6466,-75.75
6467,-75.76
6468,-75.76
6469,-75.76
6470,-75.77
6471,-75.77
6472,-75.78
6473,-75.80
6474,-75.81
6475,-75.83
6476,-75.85
6477,-75.86
6478,-75.87
6479,-75.87
6480,-75.85
6481,-75.81
6482,-75.75
6483,-75.69
6484,-75.62
6485,-75.55
6486,-75.46
6487,-75.37
6488,-75.27
6489,-75.17
6490,-75.08
6491,-75.01
6492,-74.96
6493,-74.92
6494,-74.89
6495,-74.87
6496,-74.86
6497,-74.86
6498,-74.87
6499,-74.90
6500,-74.91
6501,-74.93
6502,-74.93
6503,-74.93
6504,-74.92
6505,-74.89
6506,-74.84
6507,-74.78
6508,-74.72
6509,-74.65
6510,-74.57
6511,-74.49
6512,-74.41
6513,-74.33
6514,-74.26
6515,-74.20
6516,-74.14
6517,-74.08
6518,-74.03
6519,-73.98
6520,-73.93
6521,-73.88
6522,-73.83
6523,-73.78
6524,-73.73
6525,-73.68
6526,-73.64
6527,-73.60
6528,-73.56
6529,-73.52
6530,-73.48
6531,-73.44
6532,-73.40
6533,-73.36
6534,-73.32
6535,-73.27
6536,-73.21
6537,-73.15
6538,-73.09
6539,-73.02
6540,-72.95
6541,-72.89
6542,-72.83
6543,-72.77
6544,-72.72
6545,-72.69
6546,-72.68
6547,-72.68
6548,-72.70
6549,-72.73
6550,-72.76
6551,-72.81
6552,-72.85
6553,-72.89
6554,-72.92
6555,-72.94
6556,-72.95
6557,-72.95
6558,-72.94
6559,-72.92
6560,-72.89
6561,-72.85
6562,-72.80
6563,-72.75
6564,-72.70
6565,-72.66
6566,-72.63
6567,-72.60
6568,-72.58
6569,-72.56
6570,-72.54
6571,-72.52
6572,-72.50
6573,-72.48
6574,-72.45
6575,-72.42
6576,-72.40
6577,-72.38
6578,-72.35
6579,-72.32
6580,-72.30
6581,-72.28
6582,-72.26
6583,-72.24
6584,-72.22
6585,-72.21
6586,-72.21
6587,-72.22
6588,-72.23
6589,-72.23
6590,-72.23
6591,-72.23
6592,-72.23
6593,-72.24
6594,-72.25
6595,-72.27
6596,-72.27
6597,-72.28
6598,-72.29
6599,-72.31
6600,-72.32
6601,-72.32
6602,-72.33
6603,-72.33
6604,-72.33
6605,-72.33
6606,-72.32
6607,-72.32
6608,-72.31
6609,-72.30
6610,-72.28
6611,-72.25
6612,-72.21
6613,-72.17
6614,-72.13
6615,-72.09
6616,-72.05
6617,-71.99
6618,-71.92
6619,-71.85
6620,-71.77
6621,-71.71
6622,-71.64
6623,-71.59
6624,-71.53
6625,-71.48
6626,-71.43
6627,-71.41
6628,-71.39
6629,-71.39
6630,-71.40
6631,-71.41
6632,-71.43
6633,-71.44
6634,-71.46
6635,-71.46
6636,-71.45
6637,-71.43
6638,-71.40
6639,-71.37
6640,-71.34
6641,-71.31
6642,-71.28
6643,-71.23
6644,-71.20
6645,-71.18
6646,-71.17
6647,-71.17
6648,-71.18
6649,-71.19
6650,-71.21
6651,-71.22
6652,-71.25
6653,-71.28
6654,-71.31
6655,-71.34
6656,-71.37
6657,-71.41
6658,-71.46
6659,-71.49
6660,-71.54
6661,-71.59
6662,-71.65
6663,-71.71
6664,-71.80
6665,-71.88
6666,-71.98
6667,-72.08
6668,-72.18
6669,-72.27
6670,-72.35
6671,-72.44
6672,-72.53
6673,-72.61
6674,-72.68
6675,-72.74
6676,-72.79
6677,-72.84
6678,-72.89
6679,-72.92
6680,-72.97
6681,-73.00
6682,-73.04
6683,-73.07
6684,-73.10
6685,-73.14
6686,-73.18
6687,-73.22
6688,-73.25
6689,-73.28
6690,-73.32
6691,-73.36
6692,-73.39
6693,-73.41
6694,-73.43
6695,-73.45
6696,-73.46
6697,-73.45
6698,-73.43
6699,-73.41
6700,-73.38
6701,-73.33
6702,-73.27
6703,-73.20
6704,-73.12
6705,-73.04
6706,-72.96
6707,-72.89
6708,-72.80
6709,-72.72
6710,-72.65
6711,-72.59
6712,-72.54
6713,-72.50
6714,-72.47
6715,-72.45
6716,-72.44
6717,-72.43
6718,-72.42
6719,-72.41
6720,-72.41
6721,-72.41
6722,-72.40
6723,-72.38
6724,-72.35
6725,-72.32
6726,-72.30
6727,-72.28
6728,-72.25
6729,-72.23
6730,-72.20
6731,-72.18
6732,-72.16
6733,-72.14
6734,-72.13
6735,-72.11
6736,-72.10
6737,-72.09
6738,-72.09
6739,-72.09
6740,-72.09
6741,-72.08
6742,-72.06
6743,-72.06
6744,-72.05
6745,-72.04
6746,-72.02
6747,-71.99
6748,-71.95
6749,-71.89
6750,-71.82
6751,-71.74
6752,-71.65
6753,-71.54
6754,-71.41
6755,-71.27
6756,-71.13
6757,-70.99
6758,-70.84
6759,-70.70
6760,-70.55
6761,-70.42
6762,-70.31
6763,-70.22
6764,-70.15
6765,-70.10
6766,-70.08
6767,-70.09
6768,-70.12
6769,-70.16
6770,-70.21
6771,-70.29
6772,-70.39
6773,-70.50
6774,-70.62
6775,-70.74
6776,-70.86
6777,-70.97
6778,-71.07
6779,-71.17
6780,-71.26
6781,-71.34
6782,-71.41
6783,-71.48
6784,-71.55
6785,-71.61
6786,-71.66
6787,-71.71
6788,-71.76
6789,-71.82
6790,-71.88
6791,-71.94
6792,-72.01
6793,-72.07
6794,-72.15
6795,-72.21
6796,-72.28
6797,-72.35
6798,-72.42
6799,-72.48
6800,-72.53
6801,-72.58
6802,-72.63
6803,-72.68
6804,-72.73
6805,-72.77
6806,-72.80
6807,-72.83
6808,-72.86
6809,-72.88
6810,-72.89
6811,-72.89
6812,-72.89
6813,-72.88
6814,-72.89
6815,-72.89
6816,-72.89
6817,-72.88
6818,-72.88
6819,-72.88
6820,-72.89
6821,-72.90
6822,-72.92
6823,-72.94
6824,-72.95
6825,-72.96
6826,-72.97
6827,-72.98
6828,-72.98
6829,-72.97
6830,-72.96
6831,-72.94
6832,-72.91
6833,-72.87
6834,-72.82
6835,-72.78
6836,-72.75
6837,-72.72
6838,-72.69
6839,-72.66
6840,-72.64
6841,-72.64
6842,-72.64
6843,-72.65
6844,-72.65
6845,-72.66
6846,-72.68
6847,-72.70
6848,-72.71
6849,-72.72
6850,-72.73
6851,-72.74
6852,-72.75
6853,-72.76
6854,-72.77
6855,-72.78
6856,-72.79
6857,-72.79
6858,-72.79
6859,-72.80
6860,-72.81
6861,-72.82
6862,-72.83
6863,-72.84
6864,-72.84
6865,-72.84
6866,-72.85
6867,-72.86
6868,-72.87
6869,-72.88
6870,-72.88
6871,-72.88
6872,-72.89
6873,-72.90
6874,-72.91
6875,-72.91
6876,-72.90
6877,-72.90
6878,-72.91
6879,-72.91
6880,-72.90
6881,-72.89
6882,-72.88
6883,-72.88
6884,-72.88
6885,-72.89
6886,-72.89
6887,-72.89
6888,-72.88
6889,-72.87
6890,-72.86
6891,-72.85
6892,-72.84
6893,-72.84
6894,-72.85
6895,-72.86
6896,-72.88
6897,-72.90
6898,-72.94
6899,-72.98
6900,-73.02
6901,-73.06
6902,-73.10
6903,-73.13
6904,-73.15
6905,-73.16
6906,-73.15
6907,-73.14
6908,-73.11
6909,-73.08
6910,-73.04
6911,-73.00
6912,-72.97
6913,-72.94
6914,-72.91
6915,-72.89
6916,-72.88
6917,-72.89
6918,-72.92
6919,-72.94
6920,-72.95
6921,-72.96
6922,-72.97
6923,-72.98
6924,-72.99
6925,-72.99
6926,-72.98
6927,-72.97
6928,-72.96
6929,-72.96
6930,-72.97
6931,-72.98
6932,-72.99
6933,-73.02
6934,-73.07
6935,-73.14
6936,-73.22
6937,-73.30
6938,-73.39
6939,-73.47
6940,-73.57
6941,-73.65
6942,-73.74
6943,-73.83
6944,-73.92
6945,-74.00
6946,-74.07
6947,-74.11
6948,-74.16
6949,-74.19
6950,-74.23
6951,-74.26
6952,-74.28
6953,-74.30
6954,-74.33
6955,-74.36
6956,-74.39
6957,-74.42
6958,-74.45
6959,-74.49
6960,-74.53
6961,-74.57
6962,-74.61
6963,-74.65
6964,-74.69
6965,-74.72
6966,-74.74
6967,-74.75
6968,-74.75
6969,-74.74
6970,-74.73
6971,-74.72
6972,-74.70
6973,-74.68
6974,-74.66
6975,-74.64
6976,-74.62
6977,-74.62
6978,-74.60
6979,-74.58
6980,-74.56
6981,-74.54
6982,-74.52
6983,-74.49
6984,-74.45
6985,-74.41
6986,-74.37
6987,-74.33
6988,-74.30
6989,-74.26
6990,-74.24
6991,-74.23
6992,-74.23
6993,-74.24
6994,-74.26
6995,-74.29
6996,-74.33
6997,-74.38
6998,-74.44
6999,-74.49
7000,-74.53
7001,-74.57
7002,-74.61
7003,-74.64
7004,-74.66
7005,-74.68
7006,-74.69
7007,-74.70
7008,-74.72
7009,-74.73
7010,-74.73
7011,-74.74
7012,-74.76
7013,-74.78
7014,-74.80
7015,-74.82
7016,-74.83
7017,-74.83
7018,-74.82
7019,-74.80
7020,-74.77
7021,-74.73
7022,-74.69
7023,-74.64
7024,-74.58
7025,-74.53
7026,-74.49
7027,-74.45
7028,-74.41
7029,-74.38
7030,-74.37
7031,-74.37
7032,-74.38
7033,-74.40
7034,-74.42
7035,-74.44
7036,-74.46
7037,-74.48
7038,-74.50
7039,-74.51
7040,-74.51
7041,-74.50
7042,-74.48
7043,-74.47
7044,-74.44
7045,-74.41
7046,-74.37
7047,-74.33
7048,-74.29
7049,-74.25
7050,-74.21
7051,-74.17
7052,-74.13
7053,-74.09
7054,-74.06
7055,-74.03
7056,-74.00
7057,-73.97
7058,-73.94
7059,-73.91
7060,-73.87
7061,-73.83
7062,-73.77
7063,-73.71
7064,-73.65
7065,-73.59
7066,-73.53
7067,-73.47
7068,-73.41
7069,-73.36
7070,-73.32
7071,-73.28
7072,-73.25
7073,-73.23
7074,-73.22
7075,-73.23
7076,-73.25
7077,-73.27
7078,-73.29
7079,-73.32
7080,-73.36
7081,-73.39
7082,-73.42
7083,-73.44
7084,-73.47
7085,-73.49
7086,-73.51
7087,-73.53
7088,-73.55
7089,-73.58
7090,-73.62
7091,-73.67
7092,-73.72
7093,-73.78
7094,-73.86
7095,-73.94
7096,-74.04
7097,-74.14
7098,-74.24
7099,-74.34
7100,-74.44
7101,-74.54
7102,-74.63
7103,-74.71
7104,-74.79
7105,-74.87
7106,-74.94
7107,-75.00
7108,-75.06
7109,-75.12
7110,-75.17
7111,-75.21
7112,-75.25
7113,-75.28
7114,-75.32
7115,-75.34
7116,-75.35
7117,-75.35
7118,-75.34
7119,-75.32
7120,-75.29
7121,-75.26
7122,-75.23
7123,-75.19
7124,-75.15
7125,-75.13
7126,-75.13
7127,-75.13
7128,-75.13
7129,-75.14
7130,-75.15
7131,-75.17
7132,-75.20
7133,-75.22
7134,-75.23
7135,-75.24
7136,-75.25
7137,-75.25
7138,-75.24
7139,-75.23
7140,-75.22
7141,-75.20
7142,-75.17
7143,-75.16
7144,-75.13
7145,-75.11
7146,-75.07
7147,-75.03
7148,-74.99
7149,-74.94
7150,-74.87
7151,-74.79
7152,-74.71
7153,-74.62
7154,-74.52
7155,-74.41
7156,-74.30
7157,-74.20
7158,-74.10
7159,-74.02
7160,-73.94
7161,-73.88
7162,-73.84
7163,-73.82
7164,-73.82
7165,-73.83
7166,-73.84
7167,-73.86
7168,-73.90
7169,-73.95
7170,-74.00
7171,-74.04
7172,-74.07
7173,-74.10
7174,-74.12
7175,-74.15
7176,-74.16
7177,-74.17
7178,-74.17
7179,-74.16
7180,-74.15
7181,-74.14
7182,-74.13
7183,-74.12
7184,-74.11
7185,-74.08
7186,-74.06
7187,-74.04
7188,-74.02
7189,-74.29
7190,-74.19
7191,-73.80
7192,-73.39
7193,-74.97
7194,-75.94
7195,-73.34
7196,-69.49
7197,-73.80
7198,-83.62
7199,-79.49
7200,-50.42
