Filename,SampleFreq,Test,Modality,Channel,Description,StimIntensity,Position,RecordingTime,RecordingTimeText,Notes
00011128_12_01_4_0001_-10000.txt,24000,12,1,4,12 :  1 : test stim em 4 : test pel,6.63,-10000,44396.415893,09:58:53,
00011128_12_01_3_0001_-10000.txt,24000,12,1,3,12 : 3 1 : test stim em 3 : test pel,6.63,-10000,44396.415893,09:58:53,
00011128_12_01_2_0001_-10000.txt,24000,12,1,2,12 : 2 1 : test stim em 2 : test pel,6.63,-10000,44396.415893,09:58:53,
00011128_12_01_1_0001_-10000.txt,24000,12,1,1,12 : 1 1 : test stim em 1 : test pel,6.63,-10000,44396.415893,09:58:53,
00011128_12_01_4_0002_-10000.txt,24000,12,1,4,12 :  1 : test stim em 4 : test pel,6.78,-10000,44396.418404,10:02:30,
00011128_12_01_3_0002_-10000.txt,24000,12,1,3,12 : 3 1 : test stim em 3 : test pel,6.78,-10000,44396.418404,10:02:30,
00011128_12_01_1_0002_-10000.txt,24000,12,1,1,12 : 1 1 : test stim em 1 : test pel,6.78,-10000,44396.418404,10:02:30,
00011128_12_01_2_0002_-10000.txt,24000,12,1,2,12 : 2 1 : test stim em 2 : test pel,6.78,-10000,44396.418404,10:02:30,
