1,-18.37
2,-26.51
3,-27.04
4,-24.36
5,-23.43
6,-24.55
7,-25.18
8,-24.80
9,-24.35
10,-24.44
11,-24.52
12,-24.50
13,-24.37
14,-24.33
15,-24.31
16,-24.31
17,-24.32
18,-24.34
19,-24.37
20,-24.43
21,-24.49
22,-24.56
23,-24.62
24,-24.69
25,-24.75
26,-24.79
27,-24.82
28,-24.84
29,-24.84
30,-24.83
31,-24.81
32,-24.77
33,-24.73
34,-24.69
35,-24.65
36,-24.59
37,-24.55
38,-24.51
39,-24.47
40,-24.44
41,-24.43
42,-24.40
43,-24.39
44,-24.37
45,-24.37
46,-24.36
47,-24.36
48,-24.36
49,-24.36
50,-24.35
51,-24.36
52,-24.37
53,-24.39
54,-24.42
55,-24.44
56,-24.47
57,-24.51
58,-24.55
59,-24.60
60,-24.64
61,-24.68
62,-24.71
63,-24.73
64,-24.74
65,-24.75
66,-24.74
67,-24.73
68,-24.71
69,-24.68
70,-24.63
71,-24.58
72,-24.54
73,-24.49
74,-24.44
75,-24.38
76,-24.33
77,-24.29
78,-24.23
79,-24.19
80,-24.14
81,-24.10
82,-24.06
83,-24.03
84,-24.00
85,-23.98
86,-23.96
87,-23.96
88,-23.96
89,-23.97
90,-23.98
91,-23.99
92,-24.01
93,-24.02
94,-24.04
95,-24.07
96,-24.08
97,-24.08
98,-24.06
99,-24.04
100,-24.02
101,-24.00
102,-23.96
103,-23.92
104,-23.86
105,-23.81
106,-23.78
107,-23.74
108,-23.70
109,-23.66
110,-23.62
111,-23.60
112,-23.57
113,-23.54
114,-23.49
115,-23.44
116,-23.40
117,-23.36
118,-23.32
119,-23.26
120,-23.20
121,-23.14
122,-23.09
123,-23.03
124,-22.97
125,-22.92
126,-22.87
127,-22.84
128,-22.81
129,-22.78
130,-22.75
131,-22.74
132,-22.74
133,-22.75
134,-22.77
135,-22.79
136,-22.82
137,-22.86
138,-22.89
139,-22.93
140,-22.98
141,-23.03
142,-23.09
143,-23.13
144,-23.18
145,-23.23
146,-23.28
147,-23.33
148,-23.39
149,-23.46
150,-23.54
151,-23.61
152,-23.69
153,-23.78
154,-23.86
155,-23.91
156,-23.97
157,-24.03
158,-24.10
159,-24.14
160,-24.17
161,-24.18
162,-24.19
163,-24.21
164,-24.24
165,-24.27
166,-24.31
167,-24.34
168,-24.39
169,-24.44
170,-24.51
171,-24.58
172,-24.65
173,-24.72
174,-24.78
175,-24.84
176,-24.89
177,-24.93
178,-24.95
179,-24.96
180,-24.97
181,-24.97
182,-24.96
183,-24.95
184,-24.95
185,-24.97
186,-24.98
187,-25.00
188,-25.03
189,-25.07
190,-25.12
191,-25.17
192,-25.23
193,-25.29
194,-25.35
195,-25.41
196,-25.46
197,-25.51
198,-25.55
199,-25.58
200,-25.61
201,-25.64
202,-25.67
203,-25.67
204,-25.67
205,-25.67
206,-25.67
207,-25.67
208,-25.65
209,-25.63
210,-25.62
211,-25.61
212,-25.60
213,-25.58
214,-25.56
215,-25.54
216,-25.52
217,-25.50
218,-25.50
219,-25.50
220,-25.50
221,-25.51
222,-25.52
223,-25.55
224,-25.58
225,-25.60
226,-25.63
227,-25.65
228,-25.67
229,-25.70
230,-25.72
231,-25.75
232,-25.77
233,-25.78
234,-25.78
235,-25.78
236,-25.79
237,-25.80
238,-25.82
239,-25.84
240,-25.85
241,-25.86
242,-25.86
243,-25.86
244,-25.88
245,-25.90
246,-25.92
247,-25.93
248,-25.93
249,-25.93
250,-25.93
251,-25.95
252,-25.96
253,-25.97
254,-25.98
255,-25.99
256,-26.00
257,-26.01
258,-26.00
259,-26.00
260,-25.99
261,-25.99
262,-25.97
263,-25.94
264,-25.92
265,-25.91
266,-25.89
267,-25.89
268,-25.89
269,-25.90
270,-25.91
271,-25.92
272,-25.94
273,-25.96
274,-25.98
275,-25.99
276,-26.00
277,-25.99
278,-25.98
279,-25.96
280,-25.92
281,-25.87
282,-25.81
283,-25.75
284,-25.68
285,-25.60
286,-25.52
287,-25.45
288,-25.38
289,-25.30
290,-25.22
291,-25.14
292,-25.08
293,-25.04
294,-25.01
295,-24.98
296,-24.98
297,-24.98
298,-25.00
299,-25.03
300,-25.07
301,-25.12
302,-25.18
303,-25.24
304,-25.29
305,-25.35
306,-25.40
307,-25.44
308,-25.47
309,-25.49
310,-25.49
311,-25.48
312,-25.45
313,-25.42
314,-25.38
315,-25.34
316,-25.29
317,-25.23
318,-25.17
319,-25.11
320,-25.05
321,-24.99
322,-24.95
323,-24.92
324,-24.89
325,-24.87
326,-24.86
327,-24.87
328,-24.89
329,-24.93
330,-24.98
331,-25.03
332,-25.09
333,-25.15
334,-25.20
335,-25.25
336,-25.30
337,-25.34
338,-25.36
339,-25.38
340,-25.38
341,-25.38
342,-25.36
343,-25.34
344,-25.32
345,-25.28
346,-25.25
347,-25.21
348,-25.16
349,-25.12
350,-25.09
351,-25.06
352,-25.04
353,-25.02
354,-25.01
355,-25.00
356,-25.00
357,-25.01
358,-25.02
359,-25.03
360,-25.05
361,-25.08
362,-25.09
363,-25.10
364,-25.10
365,-25.09
366,-25.06
367,-25.03
368,-24.99
369,-24.95
370,-24.89
371,-24.83
372,-24.77
373,-24.72
374,-24.67
375,-24.63
376,-24.59
377,-24.57
378,-24.56
379,-24.57
380,-24.59
381,-24.61
382,-24.63
383,-24.66
384,-24.69
385,-24.72
386,-24.73
387,-24.74
388,-24.74
389,-24.74
390,-24.74
391,-24.73
392,-24.73
393,-24.72
394,-24.72
395,-24.72
396,-24.71
397,-24.70
398,-24.70
399,-24.72
400,-24.74
401,-24.77
402,-24.79
403,-24.82
404,-24.85
405,-24.88
406,-24.92
407,-24.95
408,-24.98
409,-25.00
410,-25.03
411,-25.05
412,-25.07
413,-25.08
414,-25.09
415,-25.10
416,-25.13
417,-25.15
418,-25.16
419,-25.16
420,-25.16
421,-25.16
422,-25.16
423,-25.14
424,-25.10
425,-25.05
426,-25.00
427,-24.95
428,-24.90
429,-24.84
430,-24.77
431,-24.71
432,-24.66
433,-24.62
434,-24.58
435,-24.56
436,-24.55
437,-24.55
438,-24.57
439,-24.59
440,-24.61
441,-24.64
442,-24.67
443,-24.70
444,-24.74
445,-24.77
446,-24.80
447,-24.81
448,-24.82
449,-24.83
450,-24.84
451,-24.86
452,-24.87
453,-24.87
454,-24.88
455,-24.89
456,-24.91
457,-24.92
458,-24.93
459,-24.93
460,-24.94
461,-24.94
462,-24.93
463,-24.91
464,-24.89
465,-24.85
466,-24.81
467,-24.78
468,-24.75
469,-24.72
470,-24.69
471,-24.66
472,-24.65
473,-24.65
474,-24.67
475,-24.70
476,-24.73
477,-24.77
478,-24.81
479,-24.87
480,-24.92
481,-24.96
482,-25.00
483,-25.02
484,-25.04
485,-25.05
486,-25.05
487,-25.04
488,-25.02
489,-25.00
490,-24.98
491,-24.96
492,-24.94
493,-24.92
494,-24.90
495,-24.89
496,-24.90
497,-24.92
498,-24.95
499,-24.99
500,-25.03
501,-25.08
502,-25.13
503,-25.19
504,-25.24
505,-25.29
506,-25.34
507,-25.38
508,-25.41
509,-25.44
510,-25.45
511,-25.46
512,-25.45
513,-25.43
514,-25.41
515,-25.38
516,-25.35
517,-25.31
518,-25.28
519,-25.25
520,-25.22
521,-25.18
522,-25.15
523,-25.14
524,-25.14
525,-25.15
526,-25.16
527,-25.19
528,-25.23
529,-25.27
530,-25.31
531,-25.36
532,-25.41
533,-25.47
534,-25.52
535,-25.57
536,-25.61
537,-25.64
538,-25.66
539,-25.66
540,-25.67
541,-25.67
542,-25.66
543,-25.63
544,-25.60
545,-25.56
546,-25.52
547,-25.48
548,-25.44
549,-25.39
550,-25.35
551,-25.31
552,-25.26
553,-25.21
554,-25.17
555,-25.14
556,-25.12
557,-25.09
558,-25.05
559,-25.02
560,-24.98
561,-24.95
562,-24.91
563,-24.88
564,-24.84
565,-24.80
566,-24.77
567,-24.74
568,-24.72
569,-24.70
570,-24.69
571,-24.69
572,-24.68
573,-24.68
574,-24.68
575,-24.70
576,-24.72
577,-24.73
578,-24.74
579,-24.74
580,-24.75
581,-24.75
582,-24.73
583,-24.70
584,-24.67
585,-24.64
586,-24.61
587,-24.56
588,-24.50
589,-24.44
590,-24.36
591,-24.30
592,-24.24
593,-24.17
594,-24.10
595,-24.02
596,-23.94
597,-23.86
598,-23.78
599,-23.70
600,-23.61
601,-23.54
602,-23.46
603,-23.40
604,-23.34
605,-23.29
606,-23.25
607,-23.22
608,-23.21
609,-23.21
610,-23.21
611,-23.22
612,-23.25
613,-23.29
614,-23.34
615,-23.40
616,-23.46
617,-23.53
618,-23.60
619,-23.67
620,-23.75
621,-23.83
622,-23.90
623,-23.96
624,-24.02
625,-24.08
626,-24.15
627,-24.19
628,-24.23
629,-24.26
630,-24.28
631,-24.30
632,-24.31
633,-24.30
634,-24.29
635,-24.28
636,-24.26
637,-24.25
638,-24.24
639,-24.25
640,-24.26
641,-24.29
642,-24.33
643,-24.37
644,-24.44
645,-24.51
646,-24.58
647,-24.65
648,-24.73
649,-24.82
650,-24.91
651,-24.98
652,-25.02
653,-25.06
654,-25.08
655,-25.09
656,-25.09
657,-25.07
658,-25.05
659,-25.02
660,-25.00
661,-24.98
662,-24.96
663,-24.94
664,-24.94
665,-24.95
666,-24.99
667,-25.04
668,-25.12
669,-25.20
670,-25.30
671,-25.41
672,-25.53
673,-25.66
674,-25.78
675,-25.90
676,-25.99
677,-26.07
678,-26.14
679,-26.17
680,-26.19
681,-26.18
682,-26.16
683,-26.11
684,-26.06
685,-26.00
686,-25.95
687,-25.89
688,-25.83
689,-25.78
690,-25.76
691,-25.75
692,-25.76
693,-25.78
694,-25.79
695,-25.82
696,-25.87
697,-25.92
698,-25.97
699,-26.02
700,-26.06
701,-26.09
702,-26.11
703,-26.12
704,-26.12
705,-26.11
706,-26.10
707,-26.10
708,-26.08
709,-26.06
710,-26.04
711,-26.03
712,-26.02
713,-26.02
714,-26.03
715,-26.04
716,-26.06
717,-26.08
718,-26.10
719,-26.12
720,-26.14
721,-26.15
722,-26.15
723,-26.14
724,-26.13
725,-26.11
726,-26.08
727,-26.04
728,-26.00
729,-25.96
730,-25.92
731,-25.89
732,-25.85
733,-25.81
734,-25.80
735,-25.79
736,-25.79
737,-25.78
738,-25.78
739,-25.79
740,-25.81
741,-25.83
742,-25.85
743,-25.87
744,-25.89
745,-25.90
746,-25.92
747,-25.95
748,-25.97
749,-25.98
750,-25.97
751,-25.97
752,-25.96
753,-25.96
754,-25.93
755,-25.89
756,-25.84
757,-25.80
758,-25.75
759,-25.70
760,-25.63
761,-25.58
762,-25.53
763,-25.48
764,-25.43
765,-25.38
766,-25.34
767,-25.30
768,-25.27
769,-25.24
770,-25.22
771,-25.19
772,-25.17
773,-25.15
774,-25.14
775,-25.13
776,-25.11
777,-25.10
778,-25.09
779,-25.09
780,-25.10
781,-25.11
782,-25.11
783,-25.11
784,-25.12
785,-25.13
786,-25.15
787,-25.16
788,-25.17
789,-25.18
790,-25.19
791,-25.19
792,-25.18
793,-25.16
794,-25.13
795,-25.12
796,-25.09
797,-25.05
798,-25.00
799,-24.96
800,-24.91
801,-24.87
802,-24.84
803,-24.81
804,-24.78
805,-24.76
806,-24.75
807,-24.75
808,-24.76
809,-24.78
810,-24.80
811,-24.83
812,-24.87
813,-24.91
814,-24.96
815,-25.01
816,-25.06
817,-25.12
818,-25.17
819,-25.23
820,-25.27
821,-25.30
822,-25.33
823,-25.35
824,-25.36
825,-25.37
826,-25.37
827,-25.37
828,-25.35
829,-25.32
830,-25.28
831,-25.25
832,-25.21
833,-25.18
834,-25.15
835,-25.12
836,-25.09
837,-25.07
838,-25.05
839,-25.03
840,-25.01
841,-25.00
842,-25.00
843,-25.00
844,-25.00
845,-25.01
846,-25.02
847,-25.03
848,-25.05
849,-25.06
850,-25.08
851,-25.10
852,-25.13
853,-25.16
854,-25.18
855,-25.21
856,-25.24
857,-25.27
858,-25.29
859,-25.31
860,-25.32
861,-25.33
862,-25.34
863,-25.35
864,-25.36
865,-25.37
866,-25.37
867,-25.37
868,-25.38
869,-25.40
870,-25.41
871,-25.41
872,-25.41
873,-25.42
874,-25.42
875,-25.42
876,-25.43
877,-25.43
878,-25.42
879,-25.41
880,-25.39
881,-25.38
882,-25.38
883,-25.38
884,-25.37
885,-25.36
886,-25.34
887,-25.34
888,-25.34
889,-25.34
890,-25.33
891,-25.31
892,-25.30
893,-25.29
894,-25.29
895,-25.29
896,-25.30
897,-25.31
898,-25.34
899,-25.38
900,-25.42
901,-25.47
902,-25.53
903,-25.59
904,-25.65
905,-25.70
906,-25.75
907,-25.78
908,-25.82
909,-25.84
910,-25.85
911,-25.85
912,-25.84
913,-25.81
914,-25.78
915,-25.75
916,-25.72
917,-25.69
918,-25.67
919,-25.65
920,-25.63
921,-25.62
922,-25.62
923,-25.62
924,-25.63
925,-25.65
926,-25.68
927,-25.72
928,-25.76
929,-25.80
930,-25.85
931,-25.92
932,-25.99
933,-26.05
934,-26.11
935,-26.17
936,-26.23
937,-26.28
938,-26.32
939,-26.35
940,-26.36
941,-26.38
942,-26.38
943,-26.36
944,-26.33
945,-26.28
946,-26.24
947,-26.18
948,-26.13
949,-26.08
950,-26.04
951,-26.01
952,-26.00
953,-25.99
954,-26.00
955,-26.03
956,-26.08
957,-26.14
958,-26.21
959,-26.28
960,-26.36
961,-26.43
962,-26.48
963,-26.54
964,-26.58
965,-26.61
966,-26.61
967,-26.60
968,-26.57
969,-26.54
970,-26.51
971,-26.48
972,-26.44
973,-26.40
974,-26.37
975,-26.36
976,-26.36
977,-26.38
978,-26.40
979,-26.44
980,-26.49
981,-26.54
982,-26.60
983,-26.67
984,-26.73
985,-26.79
986,-26.85
987,-26.90
988,-26.94
989,-26.97
990,-26.98
991,-26.98
992,-26.98
993,-26.96
994,-26.92
995,-26.87
996,-26.81
997,-26.75
998,-26.68
999,-26.61
1000,-26.54
1001,-26.47
1002,-26.41
1003,-26.35
1004,-26.30
1005,-26.26
1006,-26.24
1007,-26.23
1008,-26.24
1009,-26.25
1010,-26.27
1011,-26.31
1012,-26.35
1013,-26.41
1014,-26.47
1015,-26.53
1016,-26.58
1017,-26.64
1018,-26.69
1019,-26.73
1020,-26.77
1021,-26.79
1022,-26.81
1023,-26.83
1024,-26.84
1025,-26.84
1026,-26.82
1027,-26.80
1028,-26.79
1029,-26.78
1030,-26.76
1031,-26.74
1032,-26.71
1033,-26.67
1034,-26.62
1035,-26.58
1036,-26.55
1037,-26.52
1038,-26.47
1039,-26.43
1040,-26.37
1041,-26.31
1042,-26.25
1043,-26.18
1044,-26.11
1045,-26.03
1046,-25.96
1047,-25.90
1048,-25.85
1049,-25.80
1050,-25.76
1051,-25.74
1052,-25.74
1053,-25.75
1054,-25.78
1055,-25.84
1056,-25.91
1057,-25.98
1058,-26.05
1059,-26.11
1060,-26.17
1061,-26.22
1062,-26.24
1063,-26.24
1064,-26.21
1065,-26.18
1066,-26.11
1067,-26.03
1068,-25.92
1069,-25.81
1070,-25.71
1071,-25.62
1072,-25.54
1073,-25.47
1074,-25.42
1075,-25.39
1076,-25.37
1077,-25.36
1078,-25.36
1079,-25.39
1080,-25.41
1081,-25.44
1082,-25.45
1083,-25.46
1084,-25.45
1085,-25.42
1086,-25.38
1087,-25.33
1088,-25.28
1089,-25.22
1090,-25.16
1091,-25.09
1092,-25.02
1093,-24.97
1094,-24.93
1095,-24.90
1096,-24.88
1097,-24.87
1098,-24.88
1099,-24.91
1100,-24.95
1101,-24.99
1102,-25.05
1103,-25.12
1104,-25.20
1105,-25.27
1106,-25.34
1107,-25.41
1108,-25.49
1109,-25.56
1110,-25.62
1111,-25.67
1112,-25.70
1113,-25.73
1114,-25.74
1115,-25.75
1116,-25.74
1117,-25.71
1118,-25.69
1119,-25.65
1120,-25.62
1121,-25.58
1122,-25.55
1123,-25.53
1124,-25.54
1125,-25.55
1126,-25.58
1127,-25.63
1128,-25.69
1129,-25.76
1130,-25.85
1131,-25.93
1132,-26.01
1133,-26.08
1134,-26.15
1135,-26.21
1136,-26.26
1137,-26.28
1138,-26.30
1139,-26.29
1140,-26.29
1141,-26.29
1142,-26.29
1143,-26.28
1144,-26.28
1145,-26.29
1146,-26.31
1147,-26.34
1148,-26.37
1149,-26.42
1150,-26.49
1151,-26.57
1152,-26.65
1153,-26.73
1154,-26.80
1155,-26.87
1156,-26.94
1157,-26.99
1158,-27.04
1159,-27.07
1160,-27.08
1161,-27.07
1162,-27.05
1163,-27.02
1164,-26.98
1165,-26.94
1166,-26.90
1167,-26.85
1168,-26.81
1169,-26.76
1170,-26.73
1171,-26.71
1172,-26.69
1173,-26.69
1174,-26.68
1175,-26.68
1176,-26.67
1177,-26.66
1178,-26.66
1179,-26.65
1180,-26.64
1181,-26.63
1182,-26.60
1183,-26.58
1184,-26.56
1185,-26.55
1186,-26.54
1187,-26.54
1188,-26.56
1189,-26.58
1190,-26.61
1191,-26.64
1192,-26.67
1193,-26.70
1194,-26.74
1195,-26.77
1196,-26.80
1197,-26.82
1198,-26.84
1199,-26.85
1200,-26.86
1201,-26.85
1202,-26.84
1203,-26.83
1204,-26.81
1205,-26.79
1206,-26.76
1207,-26.73
1208,-26.69
1209,-26.66
1210,-26.64
1211,-26.61
1212,-26.59
1213,-26.57
1214,-26.55
1215,-26.54
1216,-26.53
1217,-26.54
1218,-26.54
1219,-26.55
1220,-26.57
1221,-26.60
1222,-26.64
1223,-26.68
1224,-26.72
1225,-26.76
1226,-26.80
1227,-26.83
1228,-26.85
1229,-26.85
1230,-26.84
1231,-26.82
1232,-26.79
1233,-26.73
1234,-26.67
1235,-26.61
1236,-26.54
1237,-26.48
1238,-26.42
1239,-26.35
1240,-26.31
1241,-26.27
1242,-26.24
1243,-26.23
1244,-26.23
1245,-26.24
1246,-26.26
1247,-26.28
1248,-26.30
1249,-26.32
1250,-26.34
1251,-26.36
1252,-26.37
1253,-26.38
1254,-26.38
1255,-26.37
1256,-26.36
1257,-26.35
1258,-26.34
1259,-26.32
1260,-26.32
1261,-26.31
1262,-26.31
1263,-26.32
1264,-26.33
1265,-26.35
1266,-26.35
1267,-26.37
1268,-26.39
1269,-26.43
1270,-26.46
1271,-26.48
1272,-26.50
1273,-26.52
1274,-26.54
1275,-26.56
1276,-26.56
1277,-26.55
1278,-26.53
1279,-26.49
1280,-26.45
1281,-26.41
1282,-26.36
1283,-26.31
1284,-26.25
1285,-26.19
1286,-26.14
1287,-26.09
1288,-26.04
1289,-26.01
1290,-25.98
1291,-25.96
1292,-25.95
1293,-25.96
1294,-25.97
1295,-25.98
1296,-25.99
1297,-26.02
1298,-26.04
1299,-26.07
1300,-26.09
1301,-26.10
1302,-26.11
1303,-26.10
1304,-26.09
1305,-26.07
1306,-26.04
1307,-26.00
1308,-25.95
1309,-25.89
1310,-25.84
1311,-25.79
1312,-25.75
1313,-25.72
1314,-25.69
1315,-25.67
1316,-25.66
1317,-25.66
1318,-25.67
1319,-25.68
1320,-25.70
1321,-25.73
1322,-25.77
1323,-25.80
1324,-25.82
1325,-25.83
1326,-25.84
1327,-25.85
1328,-25.85
1329,-25.85
1330,-25.85
1331,-25.85
1332,-25.84
1333,-25.82
1334,-25.80
1335,-25.80
1336,-25.81
1337,-25.82
1338,-25.83
1339,-25.85
1340,-25.88
1341,-25.91
1342,-25.95
1343,-25.99
1344,-26.03
1345,-26.08
1346,-26.12
1347,-26.16
1348,-26.19
1349,-26.22
1350,-26.24
1351,-26.24
1352,-26.24
1353,-26.23
1354,-26.22
1355,-26.20
1356,-26.17
1357,-26.14
1358,-26.11
1359,-26.09
1360,-26.08
1361,-26.07
1362,-26.07
1363,-26.09
1364,-26.11
1365,-26.15
1366,-26.19
1367,-26.23
1368,-26.28
1369,-26.33
1370,-26.38
1371,-26.43
1372,-26.47
1373,-26.50
1374,-26.53
1375,-26.54
1376,-26.55
1377,-26.56
1378,-26.56
1379,-26.55
1380,-26.53
1381,-26.51
1382,-26.49
1383,-26.48
1384,-26.48
1385,-26.49
1386,-26.50
1387,-26.52
1388,-26.55
1389,-26.59
1390,-26.64
1391,-26.69
1392,-26.74
1393,-26.79
1394,-26.84
1395,-26.86
1396,-26.89
1397,-26.91
1398,-26.93
1399,-26.93
1400,-26.92
1401,-26.90
1402,-26.89
1403,-26.87
1404,-26.85
1405,-26.83
1406,-26.81
1407,-26.79
1408,-26.77
1409,-26.75
1410,-26.73
1411,-26.71
1412,-26.69
1413,-26.68
1414,-26.68
1415,-26.67
1416,-26.66
1417,-26.66
1418,-26.66
1419,-26.67
1420,-26.68
1421,-26.68
1422,-26.69
1423,-26.70
1424,-26.70
1425,-26.70
1426,-26.70
1427,-26.71
1428,-26.72
1429,-26.73
1430,-26.74
1431,-26.75
1432,-26.79
1433,-26.82
1434,-26.87
1435,-26.94
1436,-27.01
1437,-27.10
1438,-27.19
1439,-27.28
1440,-27.37
1441,-27.45
1442,-27.52
1443,-27.58
1444,-27.62
1445,-27.64
1446,-27.64
1447,-27.62
1448,-27.59
1449,-27.54
1450,-27.48
1451,-27.41
1452,-27.34
1453,-27.28
1454,-27.23
1455,-27.19
1456,-27.16
1457,-27.15
1458,-27.15
1459,-27.17
1460,-27.20
1461,-27.23
1462,-27.27
1463,-27.32
1464,-27.37
1465,-27.43
1466,-27.48
1467,-27.53
1468,-27.58
1469,-27.61
1470,-27.65
1471,-27.67
1472,-27.69
1473,-27.70
1474,-27.71
1475,-27.70
1476,-27.69
1477,-27.68
1478,-27.67
1479,-27.66
1480,-27.64
1481,-27.61
1482,-27.58
1483,-27.55
1484,-27.54
1485,-27.53
1486,-27.51
1487,-27.51
1488,-27.51
1489,-27.51
1490,-27.50
1491,-27.50
1492,-27.50
1493,-27.51
1494,-27.52
1495,-27.52
1496,-27.52
1497,-27.53
1498,-27.54
1499,-27.54
1500,-27.55
1501,-27.55
1502,-27.55
1503,-27.56
1504,-27.58
1505,-27.59
1506,-27.62
1507,-27.65
1508,-27.67
1509,-27.70
1510,-27.72
1511,-27.73
1512,-27.74
1513,-27.74
1514,-27.74
1515,-27.73
1516,-27.69
1517,-27.64
1518,-27.57
1519,-27.49
1520,-27.40
1521,-27.31
1522,-27.20
1523,-27.11
1524,-27.01
1525,-26.92
1526,-26.83
1527,-26.75
1528,-26.70
1529,-26.66
1530,-26.64
1531,-26.63
1532,-26.64
1533,-26.66
1534,-26.69
1535,-26.74
1536,-26.79
1537,-26.83
1538,-26.86
1539,-26.90
1540,-26.92
1541,-26.92
1542,-26.91
1543,-26.88
1544,-26.85
1545,-26.80
1546,-26.74
1547,-26.67
1548,-26.60
1549,-26.53
1550,-26.45
1551,-26.38
1552,-26.31
1553,-26.25
1554,-26.20
1555,-26.15
1556,-26.11
1557,-26.08
1558,-26.06
1559,-26.04
1560,-26.02
1561,-26.01
1562,-26.00
1563,-26.01
1564,-26.02
1565,-26.02
1566,-26.01
1567,-25.99
1568,-25.99
1569,-25.98
1570,-25.96
1571,-25.95
1572,-25.93
1573,-25.92
1574,-25.89
1575,-25.87
1576,-25.86
1577,-25.85
1578,-25.85
1579,-25.85
1580,-25.85
1581,-25.86
1582,-25.88
1583,-25.90
1584,-25.93
1585,-25.96
1586,-25.98
1587,-26.01
1588,-26.05
1589,-26.09
1590,-26.13
1591,-26.16
1592,-26.19
1593,-26.22
1594,-26.24
1595,-26.25
1596,-26.27
1597,-26.28
1598,-26.30
1599,-26.31
1600,-26.32
1601,-26.34
1602,-26.37
1603,-26.39
1604,-26.43
1605,-26.46
1606,-26.51
1607,-26.57
1608,-26.64
1609,-26.70
1610,-26.77
1611,-26.84
1612,-26.91
1613,-26.97
1614,-27.03
1615,-27.07
1616,-27.10
1617,-27.12
1618,-27.15
1619,-27.16
1620,-27.17
1621,-27.17
1622,-27.17
1623,-27.18
1624,-27.18
1625,-27.19
1626,-27.21
1627,-27.23
1628,-27.25
1629,-27.28
1630,-27.31
1631,-27.35
1632,-27.39
1633,-27.43
1634,-27.47
1635,-27.50
1636,-27.53
1637,-27.55
1638,-27.57
1639,-27.58
1640,-27.59
1641,-27.60
1642,-27.60
1643,-27.59
1644,-27.58
1645,-27.57
1646,-27.56
1647,-27.54
1648,-27.53
1649,-27.51
1650,-27.51
1651,-27.51
1652,-27.51
1653,-27.51
1654,-27.52
1655,-27.54
1656,-27.56
1657,-27.57
1658,-27.59
1659,-27.60
1660,-27.62
1661,-27.62
1662,-27.62
1663,-27.60
1664,-27.57
1665,-27.52
1666,-27.49
1667,-27.45
1668,-27.41
1669,-27.36
1670,-27.31
1671,-27.27
1672,-27.24
1673,-27.22
1674,-27.19
1675,-27.18
1676,-27.18
1677,-27.18
1678,-27.19
1679,-27.21
1680,-27.22
1681,-27.24
1682,-27.26
1683,-27.27
1684,-27.29
1685,-27.29
1686,-27.29
1687,-27.28
1688,-27.28
1689,-27.27
1690,-27.26
1691,-27.24
1692,-27.21
1693,-27.19
1694,-27.18
1695,-27.18
1696,-27.19
1697,-27.19
1698,-27.20
1699,-27.22
1700,-27.25
1701,-27.29
1702,-27.33
1703,-27.37
1704,-27.43
1705,-27.48
1706,-27.53
1707,-27.57
1708,-27.62
1709,-27.66
1710,-27.69
1711,-27.70
1712,-27.69
1713,-27.67
1714,-27.62
1715,-27.57
1716,-27.50
1717,-27.41
1718,-27.31
1719,-27.21
1720,-27.10
1721,-26.99
1722,-26.89
1723,-26.80
1724,-26.72
1725,-26.67
1726,-26.63
1727,-26.61
1728,-26.59
1729,-26.58
1730,-26.59
1731,-26.60
1732,-26.61
1733,-26.61
1734,-26.60
1735,-26.58
1736,-26.56
1737,-26.52
1738,-26.47
1739,-26.42
1740,-26.37
1741,-26.33
1742,-26.29
1743,-26.26
1744,-26.24
1745,-26.23
1746,-26.23
1747,-26.24
1748,-26.26
1749,-26.28
1750,-26.29
1751,-26.30
1752,-26.30
1753,-26.30
1754,-26.29
1755,-26.26
1756,-26.21
1757,-26.15
1758,-26.09
1759,-26.04
1760,-25.99
1761,-25.93
1762,-25.90
1763,-25.89
1764,-25.88
1765,-25.88
1766,-25.90
1767,-25.93
1768,-25.99
1769,-26.04
1770,-26.10
1771,-26.17
1772,-26.25
1773,-26.33
1774,-26.42
1775,-26.49
1776,-26.57
1777,-26.65
1778,-26.73
1779,-26.80
1780,-26.87
1781,-26.93
1782,-26.98
1783,-27.02
1784,-27.05
1785,-27.06
1786,-27.07
1787,-27.07
1788,-27.05
1789,-27.01
1790,-26.97
1791,-26.92
1792,-26.87
1793,-26.82
1794,-26.79
1795,-26.77
1796,-26.76
1797,-26.76
1798,-26.79
1799,-26.82
1800,-26.88
1801,-26.93
1802,-27.00
1803,-27.07
1804,-27.15
1805,-27.21
1806,-27.26
1807,-27.29
1808,-27.31
1809,-27.31
1810,-27.29
1811,-27.26
1812,-27.23
1813,-27.19
1814,-27.15
1815,-27.10
1816,-27.06
1817,-27.03
1818,-27.02
1819,-27.02
1820,-27.05
1821,-27.11
1822,-27.18
1823,-27.26
1824,-27.35
1825,-27.44
1826,-27.53
1827,-27.62
1828,-27.70
1829,-27.75
1830,-27.77
1831,-27.76
1832,-27.74
1833,-27.70
1834,-27.64
1835,-27.56
1836,-27.47
1837,-27.37
1838,-27.29
1839,-27.22
1840,-27.18
1841,-27.15
1842,-27.14
1843,-27.16
1844,-27.20
1845,-27.26
1846,-27.33
1847,-27.42
1848,-27.52
1849,-27.62
1850,-27.73
1851,-27.83
1852,-27.93
1853,-28.02
1854,-28.10
1855,-28.18
1856,-28.24
1857,-28.28
1858,-28.31
1859,-28.32
1860,-28.32
1861,-28.31
1862,-28.30
1863,-28.27
1864,-28.23
1865,-28.19
1866,-28.15
1867,-28.11
1868,-28.09
1869,-28.07
1870,-28.05
1871,-28.04
1872,-28.04
1873,-28.04
1874,-28.05
1875,-28.07
1876,-28.09
1877,-28.12
1878,-28.14
1879,-28.16
1880,-28.17
1881,-28.19
1882,-28.21
1883,-28.23
1884,-28.23
1885,-28.23
1886,-28.23
1887,-28.21
1888,-28.18
1889,-28.13
1890,-28.08
1891,-28.02
1892,-27.97
1893,-27.92
1894,-27.87
1895,-27.82
1896,-27.78
1897,-27.76
1898,-27.76
1899,-27.76
1900,-27.77
1901,-27.80
1902,-27.84
1903,-27.90
1904,-27.95
1905,-28.00
1906,-28.06
1907,-28.11
1908,-28.16
1909,-28.20
1910,-28.23
1911,-28.24
1912,-28.26
1913,-28.28
1914,-28.30
1915,-28.32
1916,-28.33
1917,-28.34
1918,-28.34
1919,-28.35
1920,-28.36
1921,-28.36
1922,-28.35
1923,-28.34
1924,-28.33
1925,-28.33
1926,-28.32
1927,-28.31
1928,-28.29
1929,-28.26
1930,-28.25
1931,-28.24
1932,-28.25
1933,-28.25
1934,-28.27
1935,-28.30
1936,-28.33
1937,-28.36
1938,-28.40
1939,-28.45
1940,-28.51
1941,-28.56
1942,-28.60
1943,-28.65
1944,-28.70
1945,-28.74
1946,-28.78
1947,-28.81
1948,-28.84
1949,-28.87
1950,-28.91
1951,-28.95
1952,-28.98
1953,-29.01
1954,-29.04
1955,-29.06
1956,-29.08
1957,-29.09
1958,-29.09
1959,-29.06
1960,-29.03
1961,-28.99
1962,-28.95
1963,-28.90
1964,-28.85
1965,-28.81
1966,-28.77
1967,-28.73
1968,-28.70
1969,-28.69
1970,-28.70
1971,-28.71
1972,-28.74
1973,-28.76
1974,-28.78
1975,-28.81
1976,-28.83
1977,-28.84
1978,-28.85
1979,-28.84
1980,-28.81
1981,-28.78
1982,-28.76
1983,-28.73
1984,-28.69
1985,-28.65
1986,-28.62
1987,-28.61
1988,-28.60
1989,-28.58
1990,-28.57
1991,-28.56
1992,-28.56
1993,-28.57
1994,-28.57
1995,-28.58
1996,-28.57
1997,-28.56
1998,-28.54
1999,-28.52
2000,-28.47
2001,-28.42
2002,-28.36
2003,-28.30
2004,-28.23
2005,-28.16
2006,-28.08
2007,-28.00
2008,-27.92
2009,-27.86
2010,-27.82
2011,-27.79
2012,-27.77
2013,-27.76
2014,-27.77
2015,-27.80
2016,-27.83
2017,-27.87
2018,-27.89
2019,-27.91
2020,-27.91
2021,-27.92
2022,-27.91
2023,-27.88
2024,-27.83
2025,-27.77
2026,-27.70
2027,-27.62
2028,-27.55
2029,-27.46
2030,-27.38
2031,-27.31
2032,-27.25
2033,-27.21
2034,-27.17
2035,-27.13
2036,-27.11
2037,-27.08
2038,-27.05
2039,-27.03
2040,-27.00
2041,-26.97
2042,-26.93
2043,-26.89
2044,-26.84
2045,-26.80
2046,-26.77
2047,-26.75
2048,-26.73
2049,-26.72
2050,-26.72
2051,-26.72
2052,-26.75
2053,-26.80
2054,-26.83
2055,-26.87
2056,-26.90
2057,-26.95
2058,-27.00
2059,-27.05
2060,-27.09
2061,-27.13
2062,-27.16
2063,-27.19
2064,-27.22
2065,-27.26
2066,-27.31
2067,-27.34
2068,-27.37
2069,-27.40
2070,-27.45
2071,-27.51
2072,-27.58
2073,-27.63
2074,-27.68
2075,-27.73
2076,-27.78
2077,-27.82
2078,-27.87
2079,-27.91
2080,-27.94
2081,-27.98
2082,-28.01
2083,-28.03
2084,-28.06
2085,-28.09
2086,-28.12
2087,-28.16
2088,-28.20
2089,-28.25
2090,-28.30
2091,-28.35
2092,-28.39
2093,-28.42
2094,-28.44
2095,-28.45
2096,-28.45
2097,-28.43
2098,-28.40
2099,-28.35
2100,-28.31
2101,-28.26
2102,-28.22
2103,-28.18
2104,-28.17
2105,-28.18
2106,-28.20
2107,-28.24
2108,-28.30
2109,-28.38
2110,-28.46
2111,-28.56
2112,-28.64
2113,-28.71
2114,-28.78
2115,-28.84
2116,-28.89
2117,-28.93
2118,-28.96
2119,-28.97
2120,-28.97
2121,-28.97
2122,-28.96
2123,-28.96
2124,-28.95
2125,-28.94
2126,-28.92
2127,-28.92
2128,-28.91
2129,-28.90
2130,-28.90
2131,-28.90
2132,-28.91
2133,-28.92
2134,-28.94
2135,-28.96
2136,-29.00
2137,-29.03
2138,-29.08
2139,-29.14
2140,-29.20
2141,-29.26
2142,-29.31
2143,-29.36
2144,-29.41
2145,-29.44
2146,-29.46
2147,-29.46
2148,-29.45
2149,-29.43
2150,-29.40
2151,-29.38
2152,-29.35
2153,-29.31
2154,-29.28
2155,-29.25
2156,-29.24
2157,-29.22
2158,-29.21
2159,-29.21
2160,-29.20
2161,-29.19
2162,-29.18
2163,-29.19
2164,-29.18
2165,-29.18
2166,-29.16
2167,-29.13
2168,-29.09
2169,-29.05
2170,-29.01
2171,-28.96
2172,-28.91
2173,-28.85
2174,-28.79
2175,-28.73
2176,-28.67
2177,-28.63
2178,-28.59
2179,-28.56
2180,-28.55
2181,-28.55
2182,-28.56
2183,-28.58
2184,-28.62
2185,-28.67
2186,-28.73
2187,-28.79
2188,-28.85
2189,-28.89
2190,-28.92
2191,-28.95
2192,-28.97
2193,-28.98
2194,-28.96
2195,-28.93
2196,-28.88
2197,-28.82
2198,-28.76
2199,-28.69
2200,-28.61
2201,-28.53
2202,-28.46
2203,-28.39
2204,-28.32
2205,-28.26
2206,-28.19
2207,-28.13
2208,-28.08
2209,-28.03
2210,-27.99
2211,-27.96
2212,-27.94
2213,-27.92
2214,-27.91
2215,-27.90
2216,-27.89
2217,-27.88
2218,-27.88
2219,-27.88
2220,-27.88
2221,-27.88
2222,-27.90
2223,-27.92
2224,-27.95
2225,-27.98
2226,-28.01
2227,-28.03
2228,-28.07
2229,-28.11
2230,-28.14
2231,-28.16
2232,-28.17
2233,-28.17
2234,-28.16
2235,-28.13
2236,-28.09
2237,-28.06
2238,-28.02
2239,-27.97
2240,-27.92
2241,-27.87
2242,-27.83
2243,-27.80
2244,-27.78
2245,-27.76
2246,-27.75
2247,-27.75
2248,-27.75
2249,-27.77
2250,-27.81
2251,-27.84
2252,-27.87
2253,-27.91
2254,-27.95
2255,-28.00
2256,-28.04
2257,-28.08
2258,-28.12
2259,-28.15
2260,-28.18
2261,-28.19
2262,-28.18
2263,-28.16
2264,-28.14
2265,-28.11
2266,-28.08
2267,-28.03
2268,-27.99
2269,-27.96
2270,-27.92
2271,-27.90
2272,-27.88
2273,-27.87
2274,-27.87
2275,-27.88
2276,-27.89
2277,-27.91
2278,-27.92
2279,-27.94
2280,-27.95
2281,-27.97
2282,-27.98
2283,-28.00
2284,-28.01
2285,-28.02
2286,-28.04
2287,-28.05
2288,-28.08
2289,-28.10
2290,-28.11
2291,-28.11
2292,-28.11
2293,-28.12
2294,-28.12
2295,-28.12
2296,-28.12
2297,-28.12
2298,-28.12
2299,-28.13
2300,-28.14
2301,-28.15
2302,-28.18
2303,-28.21
2304,-28.27
2305,-28.34
2306,-28.42
2307,-28.50
2308,-28.60
2309,-28.70
2310,-28.79
2311,-28.87
2312,-28.94
2313,-29.00
2314,-29.06
2315,-29.11
2316,-29.14
2317,-29.15
2318,-29.15
2319,-29.14
2320,-29.12
2321,-29.09
2322,-29.07
2323,-29.06
2324,-29.05
2325,-29.04
2326,-29.04
2327,-29.05
2328,-29.06
2329,-29.07
2330,-29.10
2331,-29.12
2332,-29.14
2333,-29.17
2334,-29.19
2335,-29.21
2336,-29.23
2337,-29.24
2338,-29.24
2339,-29.24
2340,-29.23
2341,-29.22
2342,-29.23
2343,-29.24
2344,-29.24
2345,-29.24
2346,-29.25
2347,-29.25
2348,-29.27
2349,-29.28
2350,-29.30
2351,-29.32
2352,-29.34
2353,-29.36
2354,-29.38
2355,-29.41
2356,-29.44
2357,-29.47
2358,-29.50
2359,-29.53
2360,-29.57
2361,-29.60
2362,-29.62
2363,-29.63
2364,-29.63
2365,-29.64
2366,-29.64
2367,-29.64
2368,-29.63
2369,-29.61
2370,-29.58
2371,-29.56
2372,-29.54
2373,-29.52
2374,-29.51
2375,-29.50
2376,-29.48
2377,-29.46
2378,-29.46
2379,-29.46
2380,-29.46
2381,-29.45
2382,-29.45
2383,-29.45
2384,-29.44
2385,-29.44
2386,-29.44
2387,-29.46
2388,-29.46
2389,-29.47
2390,-29.48
2391,-29.50
2392,-29.53
2393,-29.57
2394,-29.61
2395,-29.64
2396,-29.69
2397,-29.74
2398,-29.79
2399,-29.82
2400,-29.84
2401,-29.86
2402,-29.86
2403,-29.86
2404,-29.85
2405,-29.81
2406,-29.76
2407,-29.71
2408,-29.66
2409,-29.59
2410,-29.52
2411,-29.45
2412,-29.39
2413,-29.34
2414,-29.31
2415,-29.28
2416,-29.26
2417,-29.24
2418,-29.24
2419,-29.26
2420,-29.29
2421,-29.32
2422,-29.34
2423,-29.38
2424,-29.42
2425,-29.46
2426,-29.50
2427,-29.54
2428,-29.58
2429,-29.62
2430,-29.66
2431,-29.68
2432,-29.71
2433,-29.73
2434,-29.75
2435,-29.76
2436,-29.75
2437,-29.74
2438,-29.72
2439,-29.70
2440,-29.67
2441,-29.62
2442,-29.57
2443,-29.50
2444,-29.44
2445,-29.37
2446,-29.31
2447,-29.25
2448,-29.19
2449,-29.14
2450,-29.10
2451,-29.06
2452,-29.03
2453,-29.02
2454,-29.03
2455,-29.06
2456,-29.09
2457,-29.13
2458,-29.18
2459,-29.23
2460,-29.29
2461,-29.33
2462,-29.38
2463,-29.43
2464,-29.48
2465,-29.53
2466,-29.56
2467,-29.57
2468,-29.57
2469,-29.57
2470,-29.57
2471,-29.55
2472,-29.51
2473,-29.46
2474,-29.40
2475,-29.35
2476,-29.29
2477,-29.23
2478,-29.16
2479,-29.10
2480,-29.04
2481,-28.98
2482,-28.92
2483,-28.86
2484,-28.81
2485,-28.77
2486,-28.73
2487,-28.68
2488,-28.63
2489,-28.58
2490,-28.54
2491,-28.51
2492,-28.48
2493,-28.44
2494,-28.41
2495,-28.40
2496,-28.40
2497,-28.42
2498,-28.45
2499,-28.49
2500,-28.55
2501,-28.61
2502,-28.67
2503,-28.74
2504,-28.80
2505,-28.85
2506,-28.89
2507,-28.91
2508,-28.92
2509,-28.92
2510,-28.91
2511,-28.88
2512,-28.85
2513,-28.80
2514,-28.75
2515,-28.70
2516,-28.66
2517,-28.63
2518,-28.60
2519,-28.57
2520,-28.53
2521,-28.49
2522,-28.45
2523,-28.42
2524,-28.38
2525,-28.32
2526,-28.27
2527,-28.21
2528,-28.15
2529,-28.07
2530,-28.00
2531,-27.94
2532,-27.89
2533,-27.85
2534,-27.82
2535,-27.82
2536,-27.84
2537,-27.87
2538,-27.91
2539,-27.98
2540,-28.05
2541,-28.13
2542,-28.23
2543,-28.31
2544,-28.41
2545,-28.49
2546,-28.58
2547,-28.67
2548,-28.74
2549,-28.79
2550,-28.83
2551,-28.87
2552,-28.91
2553,-28.94
2554,-28.96
2555,-28.97
2556,-28.98
2557,-28.98
2558,-28.99
2559,-28.98
2560,-28.98
2561,-28.99
2562,-29.00
2563,-29.03
2564,-29.06
2565,-29.10
2566,-29.15
2567,-29.20
2568,-29.26
2569,-29.33
2570,-29.41
2571,-29.49
2572,-29.57
2573,-29.64
2574,-29.70
2575,-29.75
2576,-29.79
2577,-29.82
2578,-29.84
2579,-29.84
2580,-29.84
2581,-29.84
2582,-29.82
2583,-29.79
2584,-29.76
2585,-29.73
2586,-29.69
2587,-29.64
2588,-29.61
2589,-29.59
2590,-29.56
2591,-29.53
2592,-29.50
2593,-29.50
2594,-29.51
2595,-29.55
2596,-29.59
2597,-29.64
2598,-29.69
2599,-29.74
2600,-29.80
2601,-29.86
2602,-29.91
2603,-29.95
2604,-29.97
2605,-29.98
2606,-29.97
2607,-29.94
2608,-29.91
2609,-29.87
2610,-29.82
2611,-29.78
2612,-29.74
2613,-29.71
2614,-29.69
2615,-29.68
2616,-29.68
2617,-29.70
2618,-29.74
2619,-29.78
2620,-29.82
2621,-29.87
2622,-29.93
2623,-29.99
2624,-30.04
2625,-30.09
2626,-30.13
2627,-30.16
2628,-30.19
2629,-30.22
2630,-30.22
2631,-30.22
2632,-30.21
2633,-30.21
2634,-30.20
2635,-30.19
2636,-30.18
2637,-30.17
2638,-30.17
2639,-30.17
2640,-30.18
2641,-30.19
2642,-30.21
2643,-30.23
2644,-30.25
2645,-30.27
2646,-30.28
2647,-30.29
2648,-30.29
2649,-30.26
2650,-30.23
2651,-30.19
2652,-30.14
2653,-30.08
2654,-30.01
2655,-29.94
2656,-29.87
2657,-29.82
2658,-29.78
2659,-29.74
2660,-29.72
2661,-29.70
2662,-29.69
2663,-29.69
2664,-29.70
2665,-29.71
2666,-29.72
2667,-29.73
2668,-29.74
2669,-29.75
2670,-29.76
2671,-29.76
2672,-29.75
2673,-29.73
2674,-29.72
2675,-29.70
2676,-29.68
2677,-29.65
2678,-29.62
2679,-29.60
2680,-29.58
2681,-29.54
2682,-29.51
2683,-29.48
2684,-29.46
2685,-29.43
2686,-29.39
2687,-29.35
2688,-29.32
2689,-29.29
2690,-29.26
2691,-29.22
2692,-29.18
2693,-29.16
2694,-29.13
2695,-29.10
2696,-29.07
2697,-29.05
2698,-29.03
2699,-29.02
2700,-29.01
2701,-29.01
2702,-29.00
2703,-29.00
2704,-29.00
2705,-29.01
2706,-29.02
2707,-29.03
2708,-29.03
2709,-29.02
2710,-29.01
2711,-28.99
2712,-28.98
2713,-28.96
2714,-28.93
2715,-28.89
2716,-28.85
2717,-28.83
2718,-28.80
2719,-28.78
2720,-28.77
2721,-28.77
2722,-28.78
2723,-28.79
2724,-28.81
2725,-28.85
2726,-28.88
2727,-28.91
2728,-28.94
2729,-28.97
2730,-28.99
2731,-29.02
2732,-29.03
2733,-29.03
2734,-29.03
2735,-29.03
2736,-29.02
2737,-29.02
2738,-29.01
2739,-29.01
2740,-29.01
2741,-29.01
2742,-29.00
2743,-28.99
2744,-28.97
2745,-28.94
2746,-28.90
2747,-28.85
2748,-28.80
2749,-28.74
2750,-28.69
2751,-28.63
2752,-28.58
2753,-28.54
2754,-28.50
2755,-28.48
2756,-28.46
2757,-28.46
2758,-28.47
2759,-28.49
2760,-28.52
2761,-28.54
2762,-28.56
2763,-28.59
2764,-28.62
2765,-28.65
2766,-28.66
2767,-28.66
2768,-28.66
2769,-28.64
2770,-28.63
2771,-28.62
2772,-28.60
2773,-28.58
2774,-28.56
2775,-28.53
2776,-28.51
2777,-28.49
2778,-28.47
2779,-28.47
2780,-28.47
2781,-28.48
2782,-28.49
2783,-28.51
2784,-28.53
2785,-28.56
2786,-28.60
2787,-28.64
2788,-28.68
2789,-28.71
2790,-28.75
2791,-28.79
2792,-28.83
2793,-28.86
2794,-28.88
2795,-28.90
2796,-28.91
2797,-28.92
2798,-28.91
2799,-28.90
2800,-28.89
2801,-28.87
2802,-28.85
2803,-28.85
2804,-28.84
2805,-28.84
2806,-28.85
2807,-28.85
2808,-28.87
2809,-28.90
2810,-28.94
2811,-28.99
2812,-29.03
2813,-29.06
2814,-29.10
2815,-29.15
2816,-29.18
2817,-29.21
2818,-29.23
2819,-29.24
2820,-29.25
2821,-29.26
2822,-29.27
2823,-29.26
2824,-29.26
2825,-29.25
2826,-29.25
2827,-29.26
2828,-29.26
2829,-29.26
2830,-29.26
2831,-29.27
2832,-29.27
2833,-29.27
2834,-29.28
2835,-29.30
2836,-29.31
2837,-29.32
2838,-29.34
2839,-29.36
2840,-29.40
2841,-29.44
2842,-29.49
2843,-29.54
2844,-29.58
2845,-29.61
2846,-29.62
2847,-29.62
2848,-29.61
2849,-29.57
2850,-29.50
2851,-29.42
2852,-29.34
2853,-29.25
2854,-29.15
2855,-29.04
2856,-28.94
2857,-28.87
2858,-28.82
2859,-28.79
2860,-28.79
2861,-28.81
2862,-28.85
2863,-28.91
2864,-28.97
2865,-29.05
2866,-29.13
2867,-29.20
2868,-29.27
2869,-29.33
2870,-29.39
2871,-29.43
2872,-29.45
2873,-29.47
2874,-29.49
2875,-29.50
2876,-29.52
2877,-29.53
2878,-29.55
2879,-29.57
2880,-29.59
2881,-29.63
2882,-29.68
2883,-29.72
2884,-29.76
2885,-29.79
2886,-29.82
2887,-29.83
2888,-29.83
2889,-29.83
2890,-29.81
2891,-29.79
2892,-29.76
2893,-29.73
2894,-29.69
2895,-29.64
2896,-29.62
2897,-29.61
2898,-29.61
2899,-29.61
2900,-29.63
2901,-29.65
2902,-29.68
2903,-29.71
2904,-29.75
2905,-29.79
2906,-29.83
2907,-29.87
2908,-29.90
2909,-29.93
2910,-29.97
2911,-29.99
2912,-30.01
2913,-30.03
2914,-30.04
2915,-30.04
2916,-30.05
2917,-30.04
2918,-30.04
2919,-30.03
2920,-30.03
2921,-30.03
2922,-30.02
2923,-30.01
2924,-30.00
2925,-30.00
2926,-30.00
2927,-30.02
2928,-30.03
2929,-30.05
2930,-30.07
2931,-30.09
2932,-30.11
2933,-30.12
2934,-30.14
2935,-30.15
2936,-30.15
2937,-30.15
2938,-30.14
2939,-30.13
2940,-30.12
2941,-30.11
2942,-30.11
2943,-30.11
2944,-30.13
2945,-30.15
2946,-30.18
2947,-30.21
2948,-30.25
2949,-30.29
2950,-30.33
2951,-30.37
2952,-30.41
2953,-30.44
2954,-30.45
2955,-30.45
2956,-30.44
2957,-30.41
2958,-30.37
2959,-30.30
2960,-30.22
2961,-30.13
2962,-30.04
2963,-29.94
2964,-29.84
2965,-29.75
2966,-29.66
2967,-29.58
2968,-29.51
2969,-29.46
2970,-29.43
2971,-29.43
2972,-29.42
2973,-29.43
2974,-29.45
2975,-29.48
2976,-29.53
2977,-29.58
2978,-29.64
2979,-29.68
2980,-29.71
2981,-29.74
2982,-29.77
2983,-29.79
2984,-29.80
2985,-29.79
2986,-29.77
2987,-29.75
2988,-29.73
2989,-29.71
2990,-29.68
2991,-29.64
2992,-29.59
2993,-29.54
2994,-29.49
2995,-29.44
2996,-29.39
2997,-29.33
2998,-29.27
2999,-29.21
3000,-29.14
3001,-29.09
3002,-29.03
3003,-28.98
3004,-28.93
3005,-28.89
3006,-28.87
3007,-28.85
3008,-28.84
3009,-28.83
3010,-28.81
3011,-28.81
3012,-28.80
3013,-28.79
3014,-28.79
3015,-28.78
3016,-28.76
3017,-28.75
3018,-28.74
3019,-28.74
3020,-28.73
3021,-28.74
3022,-28.76
3023,-28.79
3024,-28.83
3025,-28.87
3026,-28.91
3027,-28.96
3028,-29.00
3029,-29.05
3030,-29.10
3031,-29.14
3032,-29.19
3033,-29.24
3034,-29.27
3035,-29.29
3036,-29.31
3037,-29.33
3038,-29.35
3039,-29.36
3040,-29.37
3041,-29.38
3042,-29.39
3043,-29.40
3044,-29.41
3045,-29.42
3046,-29.44
3047,-29.46
3048,-29.49
3049,-29.50
3050,-29.53
3051,-29.55
3052,-29.59
3053,-29.62
3054,-29.66
3055,-29.69
3056,-29.72
3057,-29.75
3058,-29.77
3059,-29.79
3060,-29.81
3061,-29.83
3062,-29.85
3063,-29.86
3064,-29.86
3065,-29.86
3066,-29.86
3067,-29.86
3068,-29.87
3069,-29.87
3070,-29.87
3071,-29.88
3072,-29.89
3073,-29.91
3074,-29.94
3075,-29.97
3076,-30.01
3077,-30.07
3078,-30.13
3079,-30.19
3080,-30.27
3081,-30.33
3082,-30.40
3083,-30.45
3084,-30.50
3085,-30.54
3086,-30.56
3087,-30.57
3088,-30.57
3089,-30.56
3090,-30.55
3091,-30.52
3092,-30.49
3093,-30.47
3094,-30.45
3095,-30.44
3096,-30.43
3097,-30.44
3098,-30.46
3099,-30.50
3100,-30.55
3101,-30.60
3102,-30.65
3103,-30.72
3104,-30.79
3105,-30.86
3106,-30.93
3107,-31.01
3108,-31.08
3109,-31.13
3110,-31.17
3111,-31.20
3112,-31.24
3113,-31.27
3114,-31.30
3115,-31.30
3116,-31.30
3117,-31.29
3118,-31.29
3119,-31.29
3120,-31.28
3121,-31.25
3122,-31.22
3123,-31.20
3124,-31.20
3125,-31.19
3126,-31.17
3127,-31.15
3128,-31.12
3129,-31.10
3130,-31.08
3131,-31.05
3132,-31.01
3133,-30.96
3134,-30.91
3135,-30.87
3136,-30.82
3137,-30.77
3138,-30.72
3139,-30.67
3140,-30.63
3141,-30.59
3142,-30.57
3143,-30.55
3144,-30.55
3145,-30.57
3146,-30.60
3147,-30.65
3148,-30.70
3149,-30.75
3150,-30.80
3151,-30.85
3152,-30.90
3153,-30.94
3154,-30.95
3155,-30.94
3156,-30.91
3157,-30.87
3158,-30.80
3159,-30.70
3160,-30.60
3161,-30.49
3162,-30.37
3163,-30.25
3164,-30.14
3165,-30.04
3166,-29.96
3167,-29.90
3168,-29.87
3169,-29.86
3170,-29.86
3171,-29.87
3172,-29.89
3173,-29.92
3174,-29.95
3175,-29.98
3176,-29.99
3177,-29.99
3178,-29.98
3179,-29.97
3180,-29.95
3181,-29.93
3182,-29.90
3183,-29.88
3184,-29.87
3185,-29.87
3186,-29.86
3187,-29.86
3188,-29.87
3189,-29.90
3190,-29.92
3191,-29.94
3192,-29.96
3193,-29.96
3194,-29.96
3195,-29.94
3196,-29.92
3197,-29.88
3198,-29.83
3199,-29.77
3200,-29.71
3201,-29.64
3202,-29.57
3203,-29.52
3204,-29.47
3205,-29.44
3206,-29.42
3207,-29.41
3208,-29.41
3209,-29.43
3210,-29.46
3211,-29.50
3212,-29.56
3213,-29.64
3214,-29.74
3215,-29.82
3216,-29.92
3217,-30.01
3218,-30.11
3219,-30.20
3220,-30.29
3221,-30.36
3222,-30.44
3223,-30.49
3224,-30.53
3225,-30.55
3226,-30.55
3227,-30.54
3228,-30.51
3229,-30.46
3230,-30.40
3231,-30.33
3232,-30.25
3233,-30.18
3234,-30.11
3235,-30.05
3236,-29.99
3237,-29.94
3238,-29.90
3239,-29.87
3240,-29.86
3241,-29.85
3242,-29.85
3243,-29.85
3244,-29.86
3245,-29.88
3246,-29.91
3247,-29.95
3248,-29.98
3249,-30.02
3250,-30.05
3251,-30.09
3252,-30.13
3253,-30.17
3254,-30.21
3255,-30.24
3256,-30.27
3257,-30.29
3258,-30.32
3259,-30.35
3260,-30.38
3261,-30.41
3262,-30.46
3263,-30.51
3264,-30.56
3265,-30.62
3266,-30.68
3267,-30.75
3268,-30.81
3269,-30.87
3270,-30.92
3271,-30.96
3272,-30.99
3273,-31.02
3274,-31.02
3275,-31.02
3276,-31.01
3277,-31.00
3278,-30.99
3279,-30.97
3280,-30.95
3281,-30.94
3282,-30.95
3283,-30.96
3284,-30.98
3285,-31.02
3286,-31.07
3287,-31.12
3288,-31.19
3289,-31.24
3290,-31.30
3291,-31.37
3292,-31.44
3293,-31.50
3294,-31.55
3295,-31.58
3296,-31.62
3297,-31.65
3298,-31.67
3299,-31.68
3300,-31.69
3301,-31.69
3302,-31.69
3303,-31.68
3304,-31.69
3305,-31.69
3306,-31.69
3307,-31.69
3308,-31.69
3309,-31.69
3310,-31.70
3311,-31.70
3312,-31.70
3313,-31.71
3314,-31.71
3315,-31.73
3316,-31.74
3317,-31.76
3318,-31.77
3319,-31.78
3320,-31.79
3321,-31.80
3322,-31.82
3323,-31.84
3324,-31.84
3325,-31.84
3326,-31.83
3327,-31.82
3328,-31.80
3329,-31.78
3330,-31.74
3331,-31.71
3332,-31.67
3333,-31.63
3334,-31.59
3335,-31.56
3336,-31.53
3337,-31.52
3338,-31.51
3339,-31.50
3340,-31.49
3341,-31.49
3342,-31.50
3343,-31.51
3344,-31.52
3345,-31.52
3346,-31.51
3347,-31.51
3348,-31.50
3349,-31.49
3350,-31.48
3351,-31.45
3352,-31.43
3353,-31.42
3354,-31.42
3355,-31.42
3356,-31.43
3357,-31.45
3358,-31.48
3359,-31.51
3360,-31.54
3361,-31.57
3362,-31.61
3363,-31.65
3364,-31.66
3365,-31.66
3366,-31.65
3367,-31.64
3368,-31.61
3369,-31.57
3370,-31.52
3371,-31.48
3372,-31.44
3373,-31.40
3374,-31.38
3375,-31.37
3376,-31.38
3377,-31.41
3378,-31.45
3379,-31.51
3380,-31.57
3381,-31.66
3382,-31.75
3383,-31.85
3384,-31.94
3385,-32.03
3386,-32.10
3387,-32.17
3388,-32.23
3389,-32.27
3390,-32.30
3391,-32.32
3392,-32.32
3393,-32.31
3394,-32.30
3395,-32.27
3396,-32.24
3397,-32.19
3398,-32.14
3399,-32.09
3400,-32.03
3401,-31.97
3402,-31.90
3403,-31.83
3404,-31.75
3405,-31.67
3406,-31.59
3407,-31.52
3408,-31.45
3409,-31.40
3410,-31.36
3411,-31.33
3412,-31.31
3413,-31.31
3414,-31.34
3415,-31.38
3416,-31.44
3417,-31.51
3418,-31.59
3419,-31.67
3420,-31.77
3421,-31.85
3422,-31.93
3423,-32.00
3424,-32.05
3425,-32.09
3426,-32.11
3427,-32.11
3428,-32.11
3429,-32.09
3430,-32.06
3431,-32.03
3432,-31.99
3433,-31.95
3434,-31.89
3435,-31.84
3436,-31.77
3437,-31.72
3438,-31.66
3439,-31.59
3440,-31.52
3441,-31.46
3442,-31.39
3443,-31.33
3444,-31.25
3445,-31.17
3446,-31.10
3447,-31.03
3448,-30.98
3449,-30.93
3450,-30.87
3451,-30.83
3452,-30.78
3453,-30.74
3454,-30.71
3455,-30.69
3456,-30.67
3457,-30.67
3458,-30.68
3459,-30.69
3460,-30.69
3461,-30.71
3462,-30.74
3463,-30.77
3464,-30.79
3465,-30.81
3466,-30.81
3467,-30.81
3468,-30.79
3469,-30.77
3470,-30.73
3471,-30.69
3472,-30.64
3473,-30.57
3474,-30.50
3475,-30.43
3476,-30.37
3477,-30.32
3478,-30.26
3479,-30.21
3480,-30.16
3481,-30.13
3482,-30.11
3483,-30.09
3484,-30.07
3485,-30.06
3486,-30.06
3487,-30.07
3488,-30.08
3489,-30.08
3490,-30.09
3491,-30.10
3492,-30.11
3493,-30.12
3494,-30.11
3495,-30.11
3496,-30.10
3497,-30.10
3498,-30.09
3499,-30.09
3500,-30.09
3501,-30.11
3502,-30.13
3503,-30.16
3504,-30.19
3505,-30.23
3506,-30.28
3507,-30.32
3508,-30.36
3509,-30.40
3510,-30.42
3511,-30.43
3512,-30.43
3513,-30.42
3514,-30.39
3515,-30.36
3516,-30.32
3517,-30.28
3518,-30.26
3519,-30.24
3520,-30.23
3521,-30.24
3522,-30.26
3523,-30.29
3524,-30.34
3525,-30.40
3526,-30.47
3527,-30.55
3528,-30.64
3529,-30.73
3530,-30.81
3531,-30.89
3532,-30.96
3533,-31.02
3534,-31.07
3535,-31.09
3536,-31.10
3537,-31.11
3538,-31.10
3539,-31.09
3540,-31.07
3541,-31.05
3542,-31.04
3543,-31.03
3544,-31.02
3545,-31.01
3546,-31.00
3547,-31.00
3548,-31.01
3549,-31.03
3550,-31.06
3551,-31.10
3552,-31.13
3553,-31.16
3554,-31.20
3555,-31.25
3556,-31.30
3557,-31.35
3558,-31.39
3559,-31.41
3560,-31.45
3561,-31.48
3562,-31.52
3563,-31.55
3564,-31.58
3565,-31.61
3566,-31.64
3567,-31.68
3568,-31.70
3569,-31.72
3570,-31.74
3571,-31.75
3572,-31.76
3573,-31.76
3574,-31.76
3575,-31.76
3576,-31.77
3577,-31.77
3578,-31.78
3579,-31.78
3580,-31.80
3581,-31.83
3582,-31.86
3583,-31.90
3584,-31.94
3585,-31.98
3586,-32.03
3587,-32.08
3588,-32.13
3589,-32.17
3590,-32.21
3591,-32.24
3592,-32.25
3593,-32.26
3594,-32.28
3595,-32.29
3596,-32.30
3597,-32.30
3598,-32.31
3599,-32.32
3600,-32.34
3601,-32.36
3602,-32.37
3603,-32.38
3604,-32.38
3605,-32.38
3606,-32.37
3607,-32.35
3608,-32.32
3609,-32.28
3610,-32.22
3611,-32.16
3612,-32.09
3613,-32.00
3614,-31.92
3615,-31.84
3616,-31.77
3617,-31.70
3618,-31.63
3619,-31.57
3620,-31.53
3621,-31.52
3622,-31.52
3623,-31.52
3624,-31.54
3625,-31.56
3626,-31.60
3627,-31.64
3628,-31.69
3629,-31.73
3630,-31.77
3631,-31.81
3632,-31.83
3633,-31.84
3634,-31.84
3635,-31.82
3636,-31.80
3637,-31.77
3638,-31.72
3639,-31.66
3640,-31.61
3641,-31.55
3642,-31.49
3643,-31.43
3644,-31.37
3645,-31.32
3646,-31.28
3647,-31.24
3648,-31.20
3649,-31.15
3650,-31.12
3651,-31.09
3652,-31.05
3653,-31.03
3654,-31.00
3655,-30.98
3656,-30.94
3657,-30.92
3658,-30.91
3659,-30.90
3660,-30.90
3661,-30.90
3662,-30.91
3663,-30.93
3664,-30.96
3665,-31.00
3666,-31.05
3667,-31.10
3668,-31.16
3669,-31.21
3670,-31.27
3671,-31.32
3672,-31.36
3673,-31.38
3674,-31.40
3675,-31.41
3676,-31.40
3677,-31.37
3678,-31.32
3679,-31.27
3680,-31.23
3681,-31.18
3682,-31.13
3683,-31.07
3684,-31.03
3685,-30.99
3686,-30.95
3687,-30.92
3688,-30.89
3689,-30.87
3690,-30.86
3691,-30.85
3692,-30.83
3693,-30.82
3694,-30.81
3695,-30.81
3696,-30.81
3697,-30.81
3698,-30.81
3699,-30.82
3700,-30.84
3701,-30.87
3702,-30.90
3703,-30.94
3704,-30.97
3705,-31.00
3706,-31.04
3707,-31.07
3708,-31.09
3709,-31.11
3710,-31.12
3711,-31.11
3712,-31.09
3713,-31.06
3714,-31.04
3715,-31.02
3716,-31.00
3717,-30.98
3718,-30.97
3719,-30.96
3720,-30.95
3721,-30.96
3722,-30.96
3723,-30.97
3724,-30.99
3725,-31.02
3726,-31.04
3727,-31.07
3728,-31.09
3729,-31.11
3730,-31.13
3731,-31.15
3732,-31.15
3733,-31.14
3734,-31.14
3735,-31.14
3736,-31.14
3737,-31.13
3738,-31.12
3739,-31.12
3740,-31.13
3741,-31.14
3742,-31.15
3743,-31.16
3744,-31.17
3745,-31.20
3746,-31.22
3747,-31.24
3748,-31.25
3749,-31.26
3750,-31.28
3751,-31.29
3752,-31.30
3753,-31.30
3754,-31.30
3755,-31.31
3756,-31.31
3757,-31.30
3758,-31.29
3759,-31.28
3760,-31.27
3761,-31.26
3762,-31.26
3763,-31.26
3764,-31.27
3765,-31.28
3766,-31.29
3767,-31.31
3768,-31.33
3769,-31.36
3770,-31.40
3771,-31.43
3772,-31.47
3773,-31.51
3774,-31.55
3775,-31.59
3776,-31.62
3777,-31.63
3778,-31.65
3779,-31.66
3780,-31.66
3781,-31.66
3782,-31.65
3783,-31.64
3784,-31.63
3785,-31.61
3786,-31.59
3787,-31.57
3788,-31.55
3789,-31.54
3790,-31.53
3791,-31.52
3792,-31.51
3793,-31.52
3794,-31.53
3795,-31.56
3796,-31.58
3797,-31.61
3798,-31.64
3799,-31.68
3800,-31.72
3801,-31.76
3802,-31.79
3803,-31.81
3804,-31.83
3805,-31.84
3806,-31.84
3807,-31.82
3808,-31.80
3809,-31.75
3810,-31.70
3811,-31.65
3812,-31.61
3813,-31.57
3814,-31.53
3815,-31.48
3816,-31.45
3817,-31.42
3818,-31.42
3819,-31.41
3820,-31.41
3821,-31.41
3822,-31.41
3823,-31.42
3824,-31.44
3825,-31.46
3826,-31.48
3827,-31.50
3828,-31.51
3829,-31.53
3830,-31.56
3831,-31.59
3832,-31.63
3833,-31.68
3834,-31.73
3835,-31.79
3836,-31.85
3837,-31.90
3838,-31.96
3839,-32.02
3840,-32.07
3841,-32.12
3842,-32.15
3843,-32.18
3844,-32.19
3845,-32.19
3846,-32.18
3847,-32.17
3848,-32.15
3849,-32.12
3850,-32.10
3851,-32.08
3852,-32.06
3853,-32.05
3854,-32.04
3855,-32.03
3856,-32.04
3857,-32.04
3858,-32.04
3859,-32.04
3860,-32.06
3861,-32.08
3862,-32.11
3863,-32.14
3864,-32.17
3865,-32.20
3866,-32.24
3867,-32.28
3868,-32.32
3869,-32.36
3870,-32.39
3871,-32.42
3872,-32.43
3873,-32.45
3874,-32.45
3875,-32.44
3876,-32.42
3877,-32.38
3878,-32.32
3879,-32.25
3880,-32.19
3881,-32.12
3882,-32.05
3883,-31.99
3884,-31.94
3885,-31.90
3886,-31.88
3887,-31.86
3888,-31.86
3889,-31.87
3890,-31.89
3891,-31.92
3892,-31.95
3893,-31.98
3894,-32.02
3895,-32.04
3896,-32.06
3897,-32.08
3898,-32.09
3899,-32.10
3900,-32.12
3901,-32.14
3902,-32.16
3903,-32.16
3904,-32.17
3905,-32.17
3906,-32.20
3907,-32.23
3908,-32.26
3909,-32.30
3910,-32.33
3911,-32.36
3912,-32.39
3913,-32.42
3914,-32.42
3915,-32.42
3916,-32.40
3917,-32.37
3918,-32.32
3919,-32.27
3920,-32.21
3921,-32.13
3922,-32.04
3923,-31.95
3924,-31.86
3925,-31.78
3926,-31.68
3927,-31.59
3928,-31.51
3929,-31.45
3930,-31.41
3931,-31.37
3932,-31.34
3933,-31.32
3934,-31.32
3935,-31.34
3936,-31.37
3937,-31.40
3938,-31.43
3939,-31.48
3940,-31.53
3941,-31.59
3942,-31.63
3943,-31.66
3944,-31.67
3945,-31.68
3946,-31.68
3947,-31.67
3948,-31.64
3949,-31.60
3950,-31.55
3951,-31.50
3952,-31.45
3953,-31.40
3954,-31.36
3955,-31.32
3956,-31.27
3957,-31.23
3958,-31.19
3959,-31.14
3960,-31.09
3961,-31.02
3962,-30.95
3963,-30.88
3964,-30.80
3965,-30.73
3966,-30.66
3967,-30.60
3968,-30.54
3969,-30.49
3970,-30.45
3971,-30.43
3972,-30.41
3973,-30.41
3974,-30.42
3975,-30.44
3976,-30.46
3977,-30.48
3978,-30.51
3979,-30.53
3980,-30.54
3981,-30.55
3982,-30.54
3983,-30.53
3984,-30.52
3985,-30.51
3986,-30.51
3987,-30.51
3988,-30.52
3989,-30.53
3990,-30.54
3991,-30.56
3992,-30.60
3993,-30.65
3994,-30.72
3995,-30.78
3996,-30.85
3997,-30.92
3998,-30.99
3999,-31.05
4000,-31.10
4001,-31.14
4002,-31.19
4003,-31.23
4004,-31.27
4005,-31.29
4006,-31.31
4007,-31.32
4008,-31.34
4009,-31.36
4010,-31.38
4011,-31.39
4012,-31.41
4013,-31.43
4014,-31.44
4015,-31.45
4016,-31.46
4017,-31.47
4018,-31.48
4019,-31.49
4020,-31.49
4021,-31.50
4022,-31.51
4023,-31.52
4024,-31.53
4025,-31.55
4026,-31.58
4027,-31.62
4028,-31.69
4029,-31.76
4030,-31.83
4031,-31.91
4032,-31.99
4033,-32.08
4034,-32.19
4035,-32.28
4036,-32.37
4037,-32.44
4038,-32.49
4039,-32.53
4040,-32.56
4041,-32.57
4042,-32.57
4043,-32.54
4044,-32.51
4045,-32.46
4046,-32.40
4047,-32.34
4048,-32.29
4049,-32.25
4050,-32.22
4051,-32.20
4052,-32.19
4053,-32.20
4054,-32.23
4055,-32.27
4056,-32.31
4057,-32.35
4058,-32.40
4059,-32.46
4060,-32.53
4061,-32.59
4062,-32.63
4063,-32.67
4064,-32.69
4065,-32.71
4066,-32.72
4067,-32.71
4068,-32.68
4069,-32.65
4070,-32.61
4071,-32.57
4072,-32.53
4073,-32.50
4074,-32.46
4075,-32.43
4076,-32.40
4077,-32.38
4078,-32.37
4079,-32.36
4080,-32.37
4081,-32.37
4082,-32.38
4083,-32.38
4084,-32.38
4085,-32.38
4086,-32.37
4087,-32.36
4088,-32.35
4089,-32.32
4090,-32.28
4091,-32.23
4092,-32.16
4093,-32.08
4094,-32.00
4095,-31.93
4096,-31.87
4097,-31.80
4098,-31.74
4099,-31.70
4100,-31.68
4101,-31.66
4102,-31.65
4103,-31.65
4104,-31.66
4105,-31.68
4106,-31.71
4107,-31.74
4108,-31.78
4109,-31.82
4110,-31.86
4111,-31.89
4112,-31.90
4113,-31.90
4114,-31.90
4115,-31.89
4116,-31.87
4117,-31.84
4118,-31.80
4119,-31.75
4120,-31.69
4121,-31.64
4122,-31.59
4123,-31.53
4124,-31.48
4125,-31.43
4126,-31.39
4127,-31.35
4128,-31.32
4129,-31.29
4130,-31.27
4131,-31.26
4132,-31.26
4133,-31.26
4134,-31.26
4135,-31.26
4136,-31.27
4137,-31.29
4138,-31.30
4139,-31.32
4140,-31.34
4141,-31.35
4142,-31.36
4143,-31.37
4144,-31.38
4145,-31.38
4146,-31.37
4147,-31.36
4148,-31.33
4149,-31.30
4150,-31.27
4151,-31.23
4152,-31.20
4153,-31.16
4154,-31.11
4155,-31.07
4156,-31.04
4157,-31.02
4158,-30.99
4159,-30.96
4160,-30.92
4161,-30.90
4162,-30.87
4163,-30.84
4164,-30.80
4165,-30.75
4166,-30.70
4167,-30.65
4168,-30.60
4169,-30.55
4170,-30.51
4171,-30.49
4172,-30.49
4173,-30.50
4174,-30.54
4175,-30.59
4176,-30.66
4177,-30.75
4178,-30.85
4179,-30.96
4180,-31.07
4181,-31.17
4182,-31.27
4183,-31.36
4184,-31.43
4185,-31.47
4186,-31.50
4187,-31.50
4188,-31.49
4189,-31.46
4190,-31.41
4191,-31.34
4192,-31.26
4193,-31.17
4194,-31.08
4195,-30.99
4196,-30.92
4197,-30.86
4198,-30.81
4199,-30.78
4200,-30.76
4201,-30.76
4202,-30.79
4203,-30.83
4204,-30.88
4205,-30.92
4206,-30.97
4207,-31.02
4208,-31.05
4209,-31.08
4210,-31.09
4211,-31.09
4212,-31.08
4213,-31.05
4214,-31.02
4215,-30.98
4216,-30.96
4217,-30.94
4218,-30.92
4219,-30.91
4220,-30.92
4221,-30.94
4222,-30.98
4223,-31.01
4224,-31.05
4225,-31.10
4226,-31.16
4227,-31.21
4228,-31.27
4229,-31.34
4230,-31.40
4231,-31.44
4232,-31.48
4233,-31.52
4234,-31.56
4235,-31.59
4236,-31.62
4237,-31.64
4238,-31.65
4239,-31.66
4240,-31.66
4241,-31.66
4242,-31.66
4243,-31.67
4244,-31.67
4245,-31.67
4246,-31.68
4247,-31.69
4248,-31.70
4249,-31.72
4250,-31.74
4251,-31.77
4252,-31.80
4253,-31.83
4254,-31.85
4255,-31.87
4256,-31.89
4257,-31.90
4258,-31.90
4259,-31.89
4260,-31.88
4261,-31.87
4262,-31.85
4263,-31.84
4264,-31.82
4265,-31.80
4266,-31.79
4267,-31.78
4268,-31.79
4269,-31.81
4270,-31.83
4271,-31.86
4272,-31.89
4273,-31.92
4274,-31.96
4275,-32.00
4276,-32.05
4277,-32.09
4278,-32.13
4279,-32.16
4280,-32.18
4281,-32.20
4282,-32.21
4283,-32.22
4284,-32.22
4285,-32.21
4286,-32.21
4287,-32.20
4288,-32.19
4289,-32.19
4290,-32.18
4291,-32.17
4292,-32.17
4293,-32.17
4294,-32.19
4295,-32.21
4296,-32.24
4297,-32.26
4298,-32.29
4299,-32.33
4300,-32.36
4301,-32.39
4302,-32.42
4303,-32.44
4304,-32.46
4305,-32.46
4306,-32.45
4307,-32.43
4308,-32.41
4309,-32.38
4310,-32.34
4311,-32.29
4312,-32.24
4313,-32.20
4314,-32.16
4315,-32.12
4316,-32.09
4317,-32.07
4318,-32.06
4319,-32.05
4320,-32.06
4321,-32.08
4322,-32.10
4323,-32.13
4324,-32.16
4325,-32.20
4326,-32.24
4327,-32.27
4328,-32.29
4329,-32.31
4330,-32.33
4331,-32.34
4332,-32.34
4333,-32.35
4334,-32.35
4335,-32.35
4336,-32.36
4337,-32.36
4338,-32.37
4339,-32.39
4340,-32.41
4341,-32.45
4342,-32.49
4343,-32.54
4344,-32.60
4345,-32.66
4346,-32.72
4347,-32.78
4348,-32.85
4349,-32.93
4350,-32.99
4351,-33.04
4352,-33.09
4353,-33.13
4354,-33.17
4355,-33.20
4356,-33.21
4357,-33.22
4358,-33.21
4359,-33.20
4360,-33.19
4361,-33.16
4362,-33.13
4363,-33.09
4364,-33.04
4365,-33.00
4366,-32.96
4367,-32.93
4368,-32.90
4369,-32.89
4370,-32.87
4371,-32.86
4372,-32.86
4373,-32.88
4374,-32.89
4375,-32.92
4376,-32.94
4377,-32.98
4378,-33.02
4379,-33.05
4380,-33.07
4381,-33.09
4382,-33.09
4383,-33.09
4384,-33.07
4385,-33.06
4386,-33.03
4387,-33.00
4388,-32.97
4389,-32.94
4390,-32.90
4391,-32.86
4392,-32.85
4393,-32.84
4394,-32.84
4395,-32.85
4396,-32.86
4397,-32.89
4398,-32.93
4399,-32.95
4400,-32.97
4401,-33.00
4402,-33.02
4403,-33.03
4404,-33.02
4405,-33.00
4406,-32.98
4407,-32.96
4408,-32.93
4409,-32.90
4410,-32.89
4411,-32.88
4412,-32.88
4413,-32.89
4414,-32.91
4415,-32.95
4416,-33.00
4417,-33.05
4418,-33.10
4419,-33.15
4420,-33.18
4421,-33.22
4422,-33.25
4423,-33.27
4424,-33.26
4425,-33.23
4426,-33.18
4427,-33.13
4428,-33.06
4429,-32.99
4430,-32.92
4431,-32.86
4432,-32.81
4433,-32.76
4434,-32.72
4435,-32.69
4436,-32.66
4437,-32.65
4438,-32.63
4439,-32.61
4440,-32.58
4441,-32.54
4442,-32.50
4443,-32.46
4444,-32.40
4445,-32.34
4446,-32.27
4447,-32.20
4448,-32.12
4449,-32.04
4450,-31.98
4451,-31.93
4452,-31.89
4453,-31.86
4454,-31.84
4455,-31.83
4456,-31.84
4457,-31.87
4458,-31.91
4459,-31.96
4460,-32.02
4461,-32.09
4462,-32.16
4463,-32.24
4464,-32.31
4465,-32.37
4466,-32.43
4467,-32.50
4468,-32.55
4469,-32.59
4470,-32.63
4471,-32.65
4472,-32.68
4473,-32.69
4474,-32.70
4475,-32.70
4476,-32.69
4477,-32.68
4478,-32.67
4479,-32.66
4480,-32.65
4481,-32.64
4482,-32.62
4483,-32.61
4484,-32.61
4485,-32.61
4486,-32.63
4487,-32.65
4488,-32.69
4489,-32.72
4490,-32.76
4491,-32.80
4492,-32.85
4493,-32.91
4494,-32.96
4495,-33.00
4496,-33.04
4497,-33.05
4498,-33.07
4499,-33.08
4500,-33.08
4501,-33.08
4502,-33.07
4503,-33.06
4504,-33.05
4505,-33.05
4506,-33.06
4507,-33.07
4508,-33.09
4509,-33.11
4510,-33.14
4511,-33.17
4512,-33.22
4513,-33.27
4514,-33.33
4515,-33.39
4516,-33.45
4517,-33.51
4518,-33.57
4519,-33.62
4520,-33.67
4521,-33.72
4522,-33.75
4523,-33.79
4524,-33.82
4525,-33.85
4526,-33.87
4527,-33.88
4528,-33.88
4529,-33.89
4530,-33.90
4531,-33.90
4532,-33.90
4533,-33.89
4534,-33.88
4535,-33.87
4536,-33.84
4537,-33.82
4538,-33.80
4539,-33.79
4540,-33.76
4541,-33.74
4542,-33.71
4543,-33.69
4544,-33.67
4545,-33.67
4546,-33.66
4547,-33.66
4548,-33.67
4549,-33.68
4550,-33.70
4551,-33.71
4552,-33.71
4553,-33.72
4554,-33.73
4555,-33.75
4556,-33.76
4557,-33.76
4558,-33.77
4559,-33.79
4560,-33.81
4561,-33.82
4562,-33.83
4563,-33.84
4564,-33.86
4565,-33.89
4566,-33.90
4567,-33.91
4568,-33.91
4569,-33.91
4570,-33.91
4571,-33.90
4572,-33.89
4573,-33.88
4574,-33.86
4575,-33.83
4576,-33.79
4577,-33.74
4578,-33.69
4579,-33.64
4580,-33.59
4581,-33.54
4582,-33.50
4583,-33.46
4584,-33.43
4585,-33.41
4586,-33.41
4587,-33.40
4588,-33.40
4589,-33.40
4590,-33.41
4591,-33.42
4592,-33.43
4593,-33.43
4594,-33.43
4595,-33.43
4596,-33.42
4597,-33.40
4598,-33.37
4599,-33.34
4600,-33.31
4601,-33.28
4602,-33.26
4603,-33.23
4604,-33.21
4605,-33.18
4606,-33.16
4607,-33.15
4608,-33.12
4609,-33.10
4610,-33.06
4611,-33.01
4612,-32.95
4613,-32.89
4614,-32.83
4615,-32.76
4616,-32.68
4617,-32.61
4618,-32.54
4619,-32.48
4620,-32.42
4621,-32.38
4622,-32.35
4623,-32.34
4624,-32.34
4625,-32.34
4626,-32.35
4627,-32.38
4628,-32.41
4629,-32.45
4630,-32.47
4631,-32.50
4632,-32.52
4633,-32.54
4634,-32.55
4635,-32.56
4636,-32.55
4637,-32.54
4638,-32.52
4639,-32.49
4640,-32.46
4641,-32.43
4642,-32.41
4643,-32.38
4644,-32.35
4645,-32.33
4646,-32.32
4647,-32.32
4648,-32.32
4649,-32.32
4650,-32.32
4651,-32.35
4652,-32.38
4653,-32.42
4654,-32.46
4655,-32.50
4656,-32.56
4657,-32.61
4658,-32.67
4659,-32.72
4660,-32.77
4661,-32.81
4662,-32.83
4663,-32.85
4664,-32.86
4665,-32.86
4666,-32.85
4667,-32.81
4668,-32.76
4669,-32.71
4670,-32.67
4671,-32.61
4672,-32.55
4673,-32.49
4674,-32.43
4675,-32.40
4676,-32.38
4677,-32.37
4678,-32.38
4679,-32.40
4680,-32.43
4681,-32.46
4682,-32.51
4683,-32.57
4684,-32.62
4685,-32.68
4686,-32.72
4687,-32.75
4688,-32.79
4689,-32.82
4690,-32.83
4691,-32.83
4692,-32.82
4693,-32.79
4694,-32.77
4695,-32.74
4696,-32.72
4697,-32.70
4698,-32.69
4699,-32.68
4700,-32.68
4701,-32.68
4702,-32.69
4703,-32.72
4704,-32.76
4705,-32.80
4706,-32.87
4707,-32.94
4708,-33.03
4709,-33.11
4710,-33.19
4711,-33.27
4712,-33.35
4713,-33.40
4714,-33.45
4715,-33.48
4716,-33.50
4717,-33.51
4718,-33.50
4719,-33.49
4720,-33.47
4721,-33.45
4722,-33.43
4723,-33.40
4724,-33.39
4725,-33.39
4726,-33.40
4727,-33.42
4728,-33.45
4729,-33.48
4730,-33.53
4731,-33.58
4732,-33.63
4733,-33.68
4734,-33.72
4735,-33.76
4736,-33.79
4737,-33.82
4738,-33.84
4739,-33.85
4740,-33.87
4741,-33.88
4742,-33.89
4743,-33.89
4744,-33.91
4745,-33.93
4746,-33.94
4747,-33.96
4748,-33.98
4749,-34.01
4750,-34.04
4751,-34.07
4752,-34.10
4753,-34.15
4754,-34.20
4755,-34.24
4756,-34.29
4757,-34.33
4758,-34.36
4759,-34.38
4760,-34.40
4761,-34.41
4762,-34.42
4763,-34.42
4764,-34.41
4765,-34.40
4766,-34.38
4767,-34.38
4768,-34.37
4769,-34.36
4770,-34.34
4771,-34.33
4772,-34.33
4773,-34.33
4774,-34.33
4775,-34.32
4776,-34.32
4777,-34.33
4778,-34.34
4779,-34.35
4780,-34.36
4781,-34.37
4782,-34.37
4783,-34.36
4784,-34.34
4785,-34.31
4786,-34.28
4787,-34.25
4788,-34.22
4789,-34.19
4790,-34.16
4791,-34.13
4792,-34.10
4793,-34.08
4794,-34.07
4795,-34.07
4796,-34.07
4797,-34.06
4798,-34.06
4799,-34.07
4800,-34.07
4801,-34.07
4802,-34.07
4803,-34.06
4804,-34.06
4805,-34.05
4806,-34.03
4807,-34.00
4808,-33.97
4809,-33.93
4810,-33.89
4811,-33.85
4812,-33.81
4813,-33.76
4814,-33.71
4815,-33.65
4816,-33.60
4817,-33.55
4818,-33.51
4819,-33.47
4820,-33.43
4821,-33.40
4822,-33.38
4823,-33.36
4824,-33.36
4825,-33.37
4826,-33.38
4827,-33.40
4828,-33.43
4829,-33.46
4830,-33.49
4831,-33.51
4832,-33.53
4833,-33.56
4834,-33.58
4835,-33.58
4836,-33.57
4837,-33.54
4838,-33.50
4839,-33.46
4840,-33.40
4841,-33.35
4842,-33.28
4843,-33.21
4844,-33.14
4845,-33.07
4846,-33.02
4847,-32.98
4848,-32.94
4849,-32.92
4850,-32.89
4851,-32.86
4852,-32.84
4853,-32.82
4854,-32.81
4855,-32.79
4856,-32.78
4857,-32.76
4858,-32.74
4859,-32.73
4860,-32.72
4861,-32.71
4862,-32.69
4863,-32.68
4864,-32.68
4865,-32.68
4866,-32.68
4867,-32.67
4868,-32.65
4869,-32.64
4870,-32.64
4871,-32.64
4872,-32.64
4873,-32.63
4874,-32.63
4875,-32.64
4876,-32.64
4877,-32.65
4878,-32.65
4879,-32.65
4880,-32.66
4881,-32.67
4882,-32.66
4883,-32.64
4884,-32.61
4885,-32.58
4886,-32.54
4887,-32.50
4888,-32.45
4889,-32.39
4890,-32.35
4891,-32.32
4892,-32.30
4893,-32.28
4894,-32.28
4895,-32.29
4896,-32.32
4897,-32.36
4898,-32.42
4899,-32.47
4900,-32.53
4901,-32.60
4902,-32.68
4903,-32.74
4904,-32.79
4905,-32.82
4906,-32.85
4907,-32.87
4908,-32.88
4909,-32.88
4910,-32.88
4911,-32.86
4912,-32.84
4913,-32.82
4914,-32.79
4915,-32.76
4916,-32.74
4917,-32.72
4918,-32.71
4919,-32.70
4920,-32.69
4921,-32.68
4922,-32.67
4923,-32.65
4924,-32.64
4925,-32.64
4926,-32.62
4927,-32.60
4928,-32.58
4929,-32.55
4930,-32.52
4931,-32.50
4932,-32.48
4933,-32.46
4934,-32.46
4935,-32.45
4936,-32.45
4937,-32.46
4938,-32.48
4939,-32.50
4940,-32.53
4941,-32.55
4942,-32.57
4943,-32.60
4944,-32.64
4945,-32.68
4946,-32.72
4947,-32.76
4948,-32.79
4949,-32.82
4950,-32.86
4951,-32.90
4952,-32.94
4953,-32.98
4954,-33.02
4955,-33.06
4956,-33.11
4957,-33.15
4958,-33.18
4959,-33.21
4960,-33.23
4961,-33.25
4962,-33.26
4963,-33.26
4964,-33.26
4965,-33.27
4966,-33.27
4967,-33.27
4968,-33.28
4969,-33.28
4970,-33.29
4971,-33.32
4972,-33.33
4973,-33.35
4974,-33.37
4975,-33.40
4976,-33.42
4977,-33.44
4978,-33.46
4979,-33.47
4980,-33.49
4981,-33.50
4982,-33.50
4983,-33.51
4984,-33.53
4985,-33.54
4986,-33.55
4987,-33.56
4988,-33.58
4989,-33.60
4990,-33.61
4991,-33.62
4992,-33.64
4993,-33.65
4994,-33.66
4995,-33.66
4996,-33.66
4997,-33.66
4998,-33.65
4999,-33.64
5000,-33.62
5001,-33.61
5002,-33.59
5003,-33.57
5004,-33.54
5005,-33.50
5006,-33.44
5007,-33.39
5008,-33.35
5009,-33.31
5010,-33.27
5011,-33.22
5012,-33.18
5013,-33.15
5014,-33.13
5015,-33.13
5016,-33.14
5017,-33.16
5018,-33.19
5019,-33.23
5020,-33.29
5021,-33.36
5022,-33.43
5023,-33.50
5024,-33.57
5025,-33.63
5026,-33.69
5027,-33.73
5028,-33.77
5029,-33.78
5030,-33.78
5031,-33.76
5032,-33.73
5033,-33.70
5034,-33.67
5035,-33.64
5036,-33.60
5037,-33.57
5038,-33.53
5039,-33.51
5040,-33.51
5041,-33.52
5042,-33.54
5043,-33.57
5044,-33.61
5045,-33.65
5046,-33.69
5047,-33.71
5048,-33.72
5049,-33.72
5050,-33.73
5051,-33.72
5052,-33.69
5053,-33.64
5054,-33.59
5055,-33.54
5056,-33.49
5057,-33.44
5058,-33.40
5059,-33.36
5060,-33.33
5061,-33.32
5062,-33.32
5063,-33.32
5064,-33.32
5065,-33.33
5066,-33.35
5067,-33.37
5068,-33.39
5069,-33.40
5070,-33.41
5071,-33.41
5072,-33.42
5073,-33.42
5074,-33.42
5075,-33.42
5076,-33.43
5077,-33.42
5078,-33.42
5079,-33.40
5080,-33.40
5081,-33.39
5082,-33.38
5083,-33.37
5084,-33.35
5085,-33.34
5086,-33.33
5087,-33.33
5088,-33.31
5089,-33.28
5090,-33.25
5091,-33.21
5092,-33.15
5093,-33.09
5094,-33.02
5095,-32.95
5096,-32.89
5097,-32.82
5098,-32.76
5099,-32.71
5100,-32.67
5101,-32.64
5102,-32.63
5103,-32.63
5104,-32.64
5105,-32.66
5106,-32.69
5107,-32.73
5108,-32.77
5109,-32.81
5110,-32.85
5111,-32.89
5112,-32.92
5113,-32.95
5114,-32.96
5115,-32.97
5116,-32.97
5117,-32.97
5118,-32.96
5119,-32.93
5120,-32.91
5121,-32.89
5122,-32.86
5123,-32.83
5124,-32.79
5125,-32.76
5126,-32.72
5127,-32.68
5128,-32.65
5129,-32.63
5130,-32.61
5131,-32.61
5132,-32.61
5133,-32.63
5134,-32.66
5135,-32.70
5136,-32.75
5137,-32.82
5138,-32.91
5139,-33.00
5140,-33.08
5141,-33.17
5142,-33.26
5143,-33.34
5144,-33.41
5145,-33.46
5146,-33.49
5147,-33.51
5148,-33.51
5149,-33.50
5150,-33.48
5151,-33.46
5152,-33.43
5153,-33.41
5154,-33.40
5155,-33.41
5156,-33.42
5157,-33.44
5158,-33.47
5159,-33.51
5160,-33.57
5161,-33.62
5162,-33.66
5163,-33.70
5164,-33.74
5165,-33.77
5166,-33.79
5167,-33.79
5168,-33.77
5169,-33.76
5170,-33.74
5171,-33.72
5172,-33.70
5173,-33.67
5174,-33.63
5175,-33.60
5176,-33.58
5177,-33.58
5178,-33.57
5179,-33.58
5180,-33.60
5181,-33.63
5182,-33.69
5183,-33.75
5184,-33.81
5185,-33.89
5186,-33.98
5187,-34.06
5188,-34.15
5189,-34.23
5190,-34.30
5191,-34.37
5192,-34.41
5193,-34.45
5194,-34.48
5195,-34.49
5196,-34.49
5197,-34.49
5198,-34.49
5199,-34.49
5200,-34.49
5201,-34.49
5202,-34.48
5203,-34.48
5204,-34.48
5205,-34.49
5206,-34.50
5207,-34.51
5208,-34.51
5209,-34.51
5210,-34.53
5211,-34.56
5212,-34.58
5213,-34.61
5214,-34.65
5215,-34.69
5216,-34.74
5217,-34.77
5218,-34.79
5219,-34.81
5220,-34.81
5221,-34.81
5222,-34.80
5223,-34.77
5224,-34.74
5225,-34.70
5226,-34.66
5227,-34.62
5228,-34.58
5229,-34.56
5230,-34.53
5231,-34.50
5232,-34.48
5233,-34.47
5234,-34.48
5235,-34.50
5236,-34.52
5237,-34.52
5238,-34.53
5239,-34.55
5240,-34.55
5241,-34.56
5242,-34.57
5243,-34.58
5244,-34.57
5245,-34.56
5246,-34.55
5247,-34.54
5248,-34.53
5249,-34.52
5250,-34.49
5251,-34.47
5252,-34.45
5253,-34.45
5254,-34.44
5255,-34.44
5256,-34.43
5257,-34.42
5258,-34.42
5259,-34.42
5260,-34.42
5261,-34.42
5262,-34.41
5263,-34.41
5264,-34.39
5265,-34.36
5266,-34.33
5267,-34.30
5268,-34.26
5269,-34.22
5270,-34.19
5271,-34.16
5272,-34.11
5273,-34.07
5274,-34.04
5275,-34.01
5276,-33.98
5277,-33.96
5278,-33.95
5279,-33.94
5280,-33.93
5281,-33.92
5282,-33.91
5283,-33.91
5284,-33.91
5285,-33.91
5286,-33.91
5287,-33.90
5288,-33.88
5289,-33.87
5290,-33.86
5291,-33.83
5292,-33.80
5293,-33.76
5294,-33.72
5295,-33.67
5296,-33.62
5297,-33.56
5298,-33.51
5299,-33.47
5300,-33.44
5301,-33.44
5302,-33.44
5303,-33.46
5304,-33.49
5305,-33.53
5306,-33.57
5307,-33.63
5308,-33.69
5309,-33.76
5310,-33.83
5311,-33.87
5312,-33.91
5313,-33.93
5314,-33.94
5315,-33.94
5316,-33.93
5317,-33.90
5318,-33.86
5319,-33.81
5320,-33.76
5321,-33.70
5322,-33.64
5323,-33.58
5324,-33.53
5325,-33.48
5326,-33.45
5327,-33.42
5328,-33.40
5329,-33.39
5330,-33.39
5331,-33.39
5332,-33.39
5333,-33.40
5334,-33.42
5335,-33.44
5336,-33.45
5337,-33.47
5338,-33.49
5339,-33.51
5340,-33.52
5341,-33.53
5342,-33.54
5343,-33.56
5344,-33.58
5345,-33.60
5346,-33.60
5347,-33.60
5348,-33.60
5349,-33.61
5350,-33.62
5351,-33.62
5352,-33.62
5353,-33.63
5354,-33.64
5355,-33.65
5356,-33.65
5357,-33.66
5358,-33.66
5359,-33.67
5360,-33.68
5361,-33.68
5362,-33.67
5363,-33.64
5364,-33.61
5365,-33.58
5366,-33.55
5367,-33.52
5368,-33.48
5369,-33.45
5370,-33.41
5371,-33.39
5372,-33.37
5373,-33.36
5374,-33.36
5375,-33.36
5376,-33.36
5377,-33.37
5378,-33.39
5379,-33.40
5380,-33.40
5381,-33.40
5382,-33.41
5383,-33.42
5384,-33.44
5385,-33.46
5386,-33.47
5387,-33.49
5388,-33.51
5389,-33.54
5390,-33.56
5391,-33.58
5392,-33.58
5393,-33.57
5394,-33.55
5395,-33.52
5396,-33.48
5397,-33.43
5398,-33.36
5399,-33.30
5400,-33.22
5401,-33.16
5402,-33.09
5403,-33.03
5404,-32.97
5405,-32.92
5406,-32.87
5407,-32.82
5408,-32.79
5409,-32.75
5410,-32.71
5411,-32.68
5412,-32.65
5413,-32.64
5414,-32.64
5415,-32.63
5416,-32.63
5417,-32.64
5418,-32.65
5419,-32.68
5420,-32.71
5421,-32.74
5422,-32.78
5423,-32.83
5424,-32.87
5425,-32.92
5426,-32.96
5427,-33.00
5428,-33.04
5429,-33.07
5430,-33.10
5431,-33.12
5432,-33.13
5433,-33.13
5434,-33.12
5435,-33.10
5436,-33.08
5437,-33.05
5438,-33.03
5439,-33.00
5440,-32.97
5441,-32.94
5442,-32.92
5443,-32.90
5444,-32.89
5445,-32.91
5446,-32.95
5447,-32.99
5448,-33.04
5449,-33.10
5450,-33.17
5451,-33.25
5452,-33.32
5453,-33.38
5454,-33.45
5455,-33.50
5456,-33.54
5457,-33.57
5458,-33.59
5459,-33.59
5460,-33.59
5461,-33.55
5462,-33.51
5463,-33.46
5464,-33.42
5465,-33.38
5466,-33.35
5467,-33.32
5468,-33.31
5469,-33.31
5470,-33.32
5471,-33.35
5472,-33.39
5473,-33.44
5474,-33.50
5475,-33.57
5476,-33.63
5477,-33.70
5478,-33.77
5479,-33.82
5480,-33.87
5481,-33.90
5482,-33.92
5483,-33.93
5484,-33.93
5485,-33.93
5486,-33.92
5487,-33.91
5488,-33.89
5489,-33.86
5490,-33.83
5491,-33.81
5492,-33.79
5493,-33.76
5494,-33.75
5495,-33.73
5496,-33.74
5497,-33.76
5498,-33.78
5499,-33.82
5500,-33.86
5501,-33.91
5502,-33.98
5503,-34.05
5504,-34.12
5505,-34.19
5506,-34.26
5507,-34.32
5508,-34.38
5509,-34.43
5510,-34.47
5511,-34.50
5512,-34.52
5513,-34.53
5514,-34.52
5515,-34.52
5516,-34.51
5517,-34.50
5518,-34.48
5519,-34.46
5520,-34.44
5521,-34.42
5522,-34.41
5523,-34.39
5524,-34.37
5525,-34.35
5526,-34.33
5527,-34.31
5528,-34.29
5529,-34.27
5530,-34.26
5531,-34.23
5532,-34.21
5533,-34.19
5534,-34.17
5535,-34.14
5536,-34.11
5537,-34.07
5538,-34.04
5539,-34.01
5540,-33.98
5541,-33.97
5542,-33.95
5543,-33.94
5544,-33.94
5545,-33.93
5546,-33.94
5547,-33.94
5548,-33.96
5549,-33.97
5550,-33.96
5551,-33.95
5552,-33.93
5553,-33.90
5554,-33.86
5555,-33.82
5556,-33.76
5557,-33.70
5558,-33.62
5559,-33.54
5560,-33.45
5561,-33.37
5562,-33.30
5563,-33.25
5564,-33.20
5565,-33.16
5566,-33.13
5567,-33.11
5568,-33.09
5569,-33.09
5570,-33.09
5571,-33.09
5572,-33.09
5573,-33.07
5574,-33.04
5575,-32.99
5576,-32.93
5577,-32.87
5578,-32.80
5579,-32.71
5580,-32.62
5581,-32.53
5582,-32.44
5583,-32.36
5584,-32.31
5585,-32.27
5586,-32.26
5587,-32.26
5588,-32.28
5589,-32.32
5590,-32.36
5591,-32.41
5592,-32.47
5593,-32.53
5594,-32.58
5595,-32.61
5596,-32.63
5597,-32.64
5598,-32.64
5599,-32.62
5600,-32.58
5601,-32.53
5602,-32.48
5603,-32.43
5604,-32.38
5605,-32.33
5606,-32.29
5607,-32.26
5608,-32.24
5609,-32.24
5610,-32.24
5611,-32.25
5612,-32.27
5613,-32.31
5614,-32.36
5615,-32.43
5616,-32.50
5617,-32.57
5618,-32.63
5619,-32.70
5620,-32.78
5621,-32.84
5622,-32.90
5623,-32.95
5624,-32.99
5625,-33.03
5626,-33.05
5627,-33.07
5628,-33.07
5629,-33.05
5630,-33.02
5631,-32.98
5632,-32.94
5633,-32.89
5634,-32.84
5635,-32.78
5636,-32.72
5637,-32.67
5638,-32.62
5639,-32.58
5640,-32.54
5641,-32.53
5642,-32.52
5643,-32.53
5644,-32.55
5645,-32.57
5646,-32.61
5647,-32.66
5648,-32.71
5649,-32.77
5650,-32.82
5651,-32.87
5652,-32.93
5653,-32.99
5654,-33.04
5655,-33.08
5656,-33.13
5657,-33.17
5658,-33.22
5659,-33.27
5660,-33.33
5661,-33.40
5662,-33.47
5663,-33.54
5664,-33.62
5665,-33.69
5666,-33.78
5667,-33.86
5668,-33.93
5669,-33.99
5670,-34.05
5671,-34.10
5672,-34.14
5673,-34.16
5674,-34.18
5675,-34.18
5676,-34.18
5677,-34.17
5678,-34.16
5679,-34.14
5680,-34.12
5681,-34.11
5682,-34.10
5683,-34.11
5684,-34.13
5685,-34.16
5686,-34.19
5687,-34.23
5688,-34.27
5689,-34.32
5690,-34.38
5691,-34.43
5692,-34.49
5693,-34.53
5694,-34.57
5695,-34.59
5696,-34.61
5697,-34.62
5698,-34.63
5699,-34.63
5700,-34.63
5701,-34.63
5702,-34.62
5703,-34.62
5704,-34.62
5705,-34.63
5706,-34.65
5707,-34.67
5708,-34.69
5709,-34.69
5710,-34.69
5711,-34.70
5712,-34.70
5713,-34.70
5714,-34.70
5715,-34.69
5716,-34.67
5717,-34.66
5718,-34.65
5719,-34.65
5720,-34.64
5721,-34.64
5722,-34.66
5723,-34.67
5724,-34.68
5725,-34.69
5726,-34.70
5727,-34.72
5728,-34.74
5729,-34.74
5730,-34.73
5731,-34.72
5732,-34.71
5733,-34.70
5734,-34.68
5735,-34.67
5736,-34.66
5737,-34.65
5738,-34.65
5739,-34.67
5740,-34.69
5741,-34.71
5742,-34.74
5743,-34.77
5744,-34.81
5745,-34.83
5746,-34.85
5747,-34.87
5748,-34.88
5749,-34.87
5750,-34.85
5751,-34.83
5752,-34.81
5753,-34.78
5754,-34.75
5755,-34.73
5756,-34.70
5757,-34.69
5758,-34.69
5759,-34.69
5760,-34.69
5761,-34.68
5762,-34.68
5763,-34.67
5764,-34.65
5765,-34.63
5766,-34.60
5767,-34.56
5768,-34.52
5769,-34.48
5770,-34.44
5771,-34.40
5772,-34.35
5773,-34.32
5774,-34.28
5775,-34.26
5776,-34.24
5777,-34.23
5778,-34.22
5779,-34.21
5780,-34.20
5781,-34.22
5782,-34.24
5783,-34.26
5784,-34.28
5785,-34.31
5786,-34.35
5787,-34.40
5788,-34.47
5789,-34.53
5790,-34.59
5791,-34.64
5792,-34.69
5793,-34.74
5794,-34.78
5795,-34.80
5796,-34.80
5797,-34.80
5798,-34.78
5799,-34.74
5800,-34.69
5801,-34.63
5802,-34.56
5803,-34.51
5804,-34.45
5805,-34.39
5806,-34.34
5807,-34.30
5808,-34.26
5809,-34.23
5810,-34.19
5811,-34.16
5812,-34.13
5813,-34.09
5814,-34.05
5815,-34.01
5816,-33.97
5817,-33.93
5818,-33.89
5819,-33.86
5820,-33.82
5821,-33.79
5822,-33.75
5823,-33.72
5824,-33.69
5825,-33.66
5826,-33.64
5827,-33.63
5828,-33.62
5829,-33.61
5830,-33.61
5831,-33.62
5832,-33.64
5833,-33.65
5834,-33.67
5835,-33.68
5836,-33.69
5837,-33.69
5838,-33.68
5839,-33.66
5840,-33.63
5841,-33.59
5842,-33.54
5843,-33.49
5844,-33.42
5845,-33.36
5846,-33.30
5847,-33.24
5848,-33.19
5849,-33.15
5850,-33.11
5851,-33.09
5852,-33.08
5853,-33.09
5854,-33.11
5855,-33.12
5856,-33.15
5857,-33.17
5858,-33.20
5859,-33.23
5860,-33.27
5861,-33.31
5862,-33.34
5863,-33.36
5864,-33.38
5865,-33.40
5866,-33.41
5867,-33.42
5868,-33.41
5869,-33.40
5870,-33.39
5871,-33.38
5872,-33.35
5873,-33.32
5874,-33.27
5875,-33.24
5876,-33.20
5877,-33.17
5878,-33.15
5879,-33.12
5880,-33.09
5881,-33.07
5882,-33.05
5883,-33.04
5884,-33.03
5885,-33.02
5886,-33.00
5887,-32.99
5888,-32.97
5889,-32.96
5890,-32.95
5891,-32.93
5892,-32.90
5893,-32.87
5894,-32.84
5895,-32.82
5896,-32.81
5897,-32.80
5898,-32.81
5899,-32.82
5900,-32.85
5901,-32.89
5902,-32.94
5903,-33.00
5904,-33.08
5905,-33.15
5906,-33.23
5907,-33.31
5908,-33.40
5909,-33.47
5910,-33.54
5911,-33.60
5912,-33.65
5913,-33.70
5914,-33.74
5915,-33.78
5916,-33.80
5917,-33.81
5918,-33.82
5919,-33.84
5920,-33.85
5921,-33.86
5922,-33.86
5923,-33.86
5924,-33.87
5925,-33.87
5926,-33.87
5927,-33.88
5928,-33.90
5929,-33.91
5930,-33.92
5931,-33.93
5932,-33.95
5933,-33.97
5934,-34.00
5935,-34.02
5936,-34.04
5937,-34.05
5938,-34.07
5939,-34.08
5940,-34.07
5941,-34.06
5942,-34.05
5943,-34.04
5944,-34.01
5945,-33.97
5946,-33.93
5947,-33.90
5948,-33.87
5949,-33.86
5950,-33.84
5951,-33.83
5952,-33.83
5953,-33.84
5954,-33.86
5955,-33.88
5956,-33.91
5957,-33.95
5958,-34.00
5959,-34.04
5960,-34.08
5961,-34.11
5962,-34.13
5963,-34.15
5964,-34.15
5965,-34.14
5966,-34.11
5967,-34.08
5968,-34.05
5969,-34.02
5970,-33.99
5971,-33.94
5972,-33.91
5973,-33.87
5974,-33.84
5975,-33.81
5976,-33.80
5977,-33.79
5978,-33.79
5979,-33.79
5980,-33.80
5981,-33.83
5982,-33.86
5983,-33.89
5984,-33.91
5985,-33.94
5986,-33.96
5987,-33.98
5988,-34.01
5989,-34.05
5990,-34.08
5991,-34.10
5992,-34.12
5993,-34.14
5994,-34.17
5995,-34.19
5996,-34.20
5997,-34.22
5998,-34.23
5999,-34.23
6000,-34.23
6001,-34.23
6002,-34.22
6003,-34.22
6004,-34.20
6005,-34.18
6006,-34.15
6007,-34.12
6008,-34.09
6009,-34.04
6010,-33.98
6011,-33.94
6012,-33.89
6013,-33.84
6014,-33.79
6015,-33.73
6016,-33.67
6017,-33.62
6018,-33.55
6019,-33.50
6020,-33.45
6021,-33.41
6022,-33.37
6023,-33.33
6024,-33.29
6025,-33.27
6026,-33.25
6027,-33.25
6028,-33.26
6029,-33.28
6030,-33.31
6031,-33.33
6032,-33.34
6033,-33.36
6034,-33.37
6035,-33.38
6036,-33.38
6037,-33.37
6038,-33.34
6039,-33.29
6040,-33.25
6041,-33.19
6042,-33.12
6043,-33.05
6044,-32.98
6045,-32.90
6046,-32.83
6047,-32.76
6048,-32.71
6049,-32.66
6050,-32.62
6051,-32.58
6052,-32.55
6053,-32.53
6054,-32.52
6055,-32.52
6056,-32.52
6057,-32.52
6058,-32.53
6059,-32.54
6060,-32.55
6061,-32.56
6062,-32.57
6063,-32.58
6064,-32.59
6065,-32.58
6066,-32.58
6067,-32.60
6068,-32.61
6069,-32.62
6070,-32.63
6071,-32.65
6072,-32.68
6073,-32.73
6074,-32.77
6075,-32.82
6076,-32.86
6077,-32.90
6078,-32.95
6079,-32.99
6080,-33.02
6081,-33.04
6082,-33.05
6083,-33.06
6084,-33.06
6085,-33.04
6086,-33.03
6087,-33.01
6088,-33.00
6089,-33.00
6090,-32.99
6091,-32.98
6092,-32.98
6093,-32.99
6094,-33.00
6095,-33.02
6096,-33.04
6097,-33.07
6098,-33.11
6099,-33.15
6100,-33.18
6101,-33.22
6102,-33.25
6103,-33.28
6104,-33.31
6105,-33.34
6106,-33.36
6107,-33.38
6108,-33.40
6109,-33.41
6110,-33.43
6111,-33.45
6112,-33.47
6113,-33.48
6114,-33.51
6115,-33.55
6116,-33.58
6117,-33.62
6118,-33.66
6119,-33.71
6120,-33.76
6121,-33.81
6122,-33.85
6123,-33.88
6124,-33.92
6125,-33.95
6126,-33.98
6127,-33.99
6128,-34.01
6129,-34.02
6130,-34.05
6131,-34.06
6132,-34.09
6133,-34.11
6134,-34.14
6135,-34.18
6136,-34.21
6137,-34.25
6138,-34.28
6139,-34.32
6140,-34.36
6141,-34.40
6142,-34.43
6143,-34.44
6144,-34.46
6145,-34.49
6146,-34.52
6147,-34.53
6148,-34.56
6149,-34.57
6150,-34.59
6151,-34.62
6152,-34.64
6153,-34.66
6154,-34.69
6155,-34.72
6156,-34.74
6157,-34.76
6158,-34.77
6159,-34.78
6160,-34.78
6161,-34.79
6162,-34.81
6163,-34.82
6164,-34.83
6165,-34.84
6166,-34.86
6167,-34.88
6168,-34.89
6169,-34.91
6170,-34.93
6171,-34.94
6172,-34.96
6173,-34.97
6174,-34.98
6175,-34.98
6176,-34.96
6177,-34.95
6178,-34.92
6179,-34.88
6180,-34.85
6181,-34.81
6182,-34.77
6183,-34.73
6184,-34.70
6185,-34.67
6186,-34.65
6187,-34.64
6188,-34.65
6189,-34.68
6190,-34.72
6191,-34.75
6192,-34.80
6193,-34.85
6194,-34.91
6195,-34.97
6196,-35.02
6197,-35.05
6198,-35.08
6199,-35.10
6200,-35.10
6201,-35.08
6202,-35.04
6203,-35.00
6204,-34.95
6205,-34.90
6206,-34.84
6207,-34.77
6208,-34.71
6209,-34.66
6210,-34.61
6211,-34.58
6212,-34.55
6213,-34.53
6214,-34.52
6215,-34.51
6216,-34.50
6217,-34.49
6218,-34.48
6219,-34.48
6220,-34.47
6221,-34.47
6222,-34.45
6223,-34.43
6224,-34.41
6225,-34.40
6226,-34.40
6227,-34.39
6228,-34.38
6229,-34.36
6230,-34.35
6231,-34.34
6232,-34.32
6233,-34.30
6234,-34.28
6235,-34.26
6236,-34.23
6237,-34.20
6238,-34.17
6239,-34.15
6240,-34.12
6241,-34.10
6242,-34.08
6243,-34.07
6244,-34.06
6245,-34.06
6246,-34.06
6247,-34.08
6248,-34.09
6249,-34.11
6250,-34.13
6251,-34.15
6252,-34.17
6253,-34.19
6254,-34.20
6255,-34.19
6256,-34.17
6257,-34.15
6258,-34.13
6259,-34.11
6260,-34.07
6261,-34.03
6262,-34.00
6263,-33.97
6264,-33.95
6265,-33.93
6266,-33.92
6267,-33.93
6268,-33.94
6269,-33.96
6270,-33.98
6271,-34.00
6272,-34.01
6273,-34.03
6274,-34.05
6275,-34.07
6276,-34.08
6277,-34.07
6278,-34.05
6279,-34.03
6280,-34.01
6281,-33.99
6282,-33.97
6283,-33.94
6284,-33.92
6285,-33.90
6286,-33.90
6287,-33.90
6288,-33.90
6289,-33.90
6290,-33.90
6291,-33.89
6292,-33.89
6293,-33.88
6294,-33.87
6295,-33.85
6296,-33.84
6297,-33.83
6298,-33.81
6299,-33.79
6300,-33.76
6301,-33.74
6302,-33.72
6303,-33.70
6304,-33.69
6305,-33.67
6306,-33.65
6307,-33.63
6308,-33.62
6309,-33.61
6310,-33.59
6311,-33.58
6312,-33.57
6313,-33.57
6314,-33.57
6315,-33.58
6316,-33.58
6317,-33.59
6318,-33.61
6319,-33.62
6320,-33.62
6321,-33.62
6322,-33.63
6323,-33.63
6324,-33.63
6325,-33.63
6326,-33.63
6327,-33.62
6328,-33.63
6329,-33.63
6330,-33.65
6331,-33.67
6332,-33.70
6333,-33.74
6334,-33.79
6335,-33.84
6336,-33.90
6337,-33.96
6338,-34.01
6339,-34.08
6340,-34.14
6341,-34.20
6342,-34.24
6343,-34.27
6344,-34.28
6345,-34.28
6346,-34.28
6347,-34.26
6348,-34.23
6349,-34.19
6350,-34.13
6351,-34.07
6352,-34.01
6353,-33.95
6354,-33.89
6355,-33.84
6356,-33.80
6357,-33.77
6358,-33.75
6359,-33.74
6360,-33.74
6361,-33.75
6362,-33.75
6363,-33.75
6364,-33.75
6365,-33.75
6366,-33.74
6367,-33.73
6368,-33.71
6369,-33.69
6370,-33.68
6371,-33.66
6372,-33.65
6373,-33.63
6374,-33.63
6375,-33.64
6376,-33.65
6377,-33.67
6378,-33.68
6379,-33.69
6380,-33.72
6381,-33.76
6382,-33.79
6383,-33.81
6384,-33.83
6385,-33.86
6386,-33.88
6387,-33.91
6388,-33.93
6389,-33.94
6390,-33.96
6391,-33.98
6392,-33.99
6393,-34.01
6394,-34.02
6395,-34.03
6396,-34.04
6397,-34.05
6398,-34.06
6399,-34.07
6400,-34.10
6401,-34.13
6402,-34.16
6403,-34.19
6404,-34.23
6405,-34.26
6406,-34.30
6407,-34.35
6408,-34.40
6409,-34.43
6410,-34.47
6411,-34.50
6412,-34.53
6413,-34.55
6414,-34.57
6415,-34.58
6416,-34.59
6417,-34.60
6418,-34.61
6419,-34.61
6420,-34.61
6421,-34.62
6422,-34.63
6423,-34.64
6424,-34.67
6425,-34.69
6426,-34.70
6427,-34.72
6428,-34.75
6429,-34.79
6430,-34.83
6431,-34.86
6432,-34.89
6433,-34.91
6434,-34.94
6435,-34.97
6436,-35.00
6437,-35.03
6438,-35.05
6439,-35.07
6440,-35.10
6441,-35.13
6442,-35.17
6443,-35.19
6444,-35.20
6445,-35.21
6446,-35.23
6447,-35.24
6448,-35.25
6449,-35.24
6450,-35.21
6451,-35.19
6452,-35.17
6453,-35.16
6454,-35.14
6455,-35.12
6456,-35.10
6457,-35.08
6458,-35.07
6459,-35.07
6460,-35.07
6461,-35.07
6462,-35.08
6463,-35.09
6464,-35.11
6465,-35.13
6466,-35.15
6467,-35.17
6468,-35.21
6469,-35.24
6470,-35.27
6471,-35.29
6472,-35.32
6473,-35.35
6474,-35.39
6475,-35.41
6476,-35.43
6477,-35.44
6478,-35.45
6479,-35.45
6480,-35.45
6481,-35.44
6482,-35.43
6483,-35.42
6484,-35.39
6485,-35.37
6486,-35.34
6487,-35.30
6488,-35.25
6489,-35.19
6490,-35.13
6491,-35.06
6492,-34.99
6493,-34.91
6494,-34.82
6495,-34.73
6496,-34.64
6497,-34.57
6498,-34.51
6499,-34.46
6500,-34.41
6501,-34.38
6502,-34.36
6503,-34.36
6504,-34.37
6505,-34.38
6506,-34.39
6507,-34.41
6508,-34.44
6509,-34.48
6510,-34.51
6511,-34.53
6512,-34.56
6513,-34.57
6514,-34.59
6515,-34.60
6516,-34.61
6517,-34.63
6518,-34.63
6519,-34.63
6520,-34.63
6521,-34.62
6522,-34.59
6523,-34.56
6524,-34.53
6525,-34.48
6526,-34.42
6527,-34.35
6528,-34.26
6529,-34.18
6530,-34.09
6531,-34.01
6532,-33.92
6533,-33.84
6534,-33.76
6535,-33.70
6536,-33.64
6537,-33.61
6538,-33.58
6539,-33.58
6540,-33.59
6541,-33.61
6542,-33.63
6543,-33.66
6544,-33.69
6545,-33.72
6546,-33.75
6547,-33.78
6548,-33.80
6549,-33.80
6550,-33.80
6551,-33.79
6552,-33.77
6553,-33.73
6554,-33.69
6555,-33.65
6556,-33.62
6557,-33.57
6558,-33.52
6559,-33.48
6560,-33.44
6561,-33.42
6562,-33.40
6563,-33.39
6564,-33.39
6565,-33.39
6566,-33.42
6567,-33.46
6568,-33.50
6569,-33.55
6570,-33.59
6571,-33.63
6572,-33.68
6573,-33.73
6574,-33.78
6575,-33.81
6576,-33.85
6577,-33.89
6578,-33.93
6579,-33.97
6580,-34.00
6581,-34.04
6582,-34.09
6583,-34.13
6584,-34.16
6585,-34.19
6586,-34.20
6587,-34.22
6588,-34.24
6589,-34.25
6590,-34.24
6591,-34.23
6592,-34.22
6593,-34.20
6594,-34.19
6595,-34.17
6596,-34.16
6597,-34.16
6598,-34.17
6599,-34.19
6600,-34.23
6601,-34.27
6602,-34.33
6603,-34.39
6604,-34.45
6605,-34.53
6606,-34.60
6607,-34.66
6608,-34.72
6609,-34.77
6610,-34.81
6611,-34.84
6612,-34.85
6613,-34.85
6614,-34.85
6615,-34.85
6616,-34.84
6617,-34.83
6618,-34.82
6619,-34.82
6620,-34.84
6621,-34.87
6622,-34.90
6623,-34.93
6624,-34.97
6625,-35.03
6626,-35.08
6627,-35.14
6628,-35.19
6629,-35.24
6630,-35.29
6631,-35.34
6632,-35.39
6633,-35.44
6634,-35.49
6635,-35.53
6636,-35.58
6637,-35.63
6638,-35.69
6639,-35.75
6640,-35.81
6641,-35.86
6642,-35.92
6643,-35.96
6644,-36.01
6645,-36.05
6646,-36.08
6647,-36.10
6648,-36.12
6649,-36.14
6650,-36.15
6651,-36.15
6652,-36.14
6653,-36.14
6654,-36.14
6655,-36.14
6656,-36.13
6657,-36.12
6658,-36.11
6659,-36.10
6660,-36.07
6661,-36.04
6662,-36.02
6663,-36.00
6664,-35.97
6665,-35.93
6666,-35.90
6667,-35.88
6668,-35.87
6669,-35.87
6670,-35.86
6671,-35.85
6672,-35.86
6673,-35.87
6674,-35.89
6675,-35.91
6676,-35.92
6677,-35.93
6678,-35.93
6679,-35.94
6680,-35.95
6681,-35.95
6682,-35.94
6683,-35.93
6684,-35.91
6685,-35.89
6686,-35.86
6687,-35.83
6688,-35.81
6689,-35.78
6690,-35.74
6691,-35.69
6692,-35.64
6693,-35.61
6694,-35.57
6695,-35.52
6696,-35.47
6697,-35.43
6698,-35.39
6699,-35.37
6700,-35.34
6701,-35.31
6702,-35.29
6703,-35.27
6704,-35.24
6705,-35.22
6706,-35.21
6707,-35.19
6708,-35.17
6709,-35.14
6710,-35.12
6711,-35.09
6712,-35.06
6713,-35.03
6714,-35.01
6715,-34.99
6716,-34.99
6717,-35.00
6718,-35.03
6719,-35.06
6720,-35.09
6721,-35.13
6722,-35.18
6723,-35.24
6724,-35.29
6725,-35.33
6726,-35.35
6727,-35.37
6728,-35.37
6729,-35.35
6730,-35.31
6731,-35.26
6732,-35.19
6733,-35.11
6734,-35.03
6735,-34.94
6736,-34.85
6737,-34.77
6738,-34.68
6739,-34.61
6740,-34.56
6741,-34.52
6742,-34.50
6743,-34.51
6744,-34.52
6745,-34.56
6746,-34.60
6747,-34.66
6748,-34.72
6749,-34.78
6750,-34.84
6751,-34.90
6752,-34.95
6753,-34.98
6754,-35.00
6755,-35.01
6756,-35.01
6757,-34.98
6758,-34.94
6759,-34.90
6760,-34.85
6761,-34.81
6762,-34.77
6763,-34.72
6764,-34.68
6765,-34.66
6766,-34.63
6767,-34.61
6768,-34.60
6769,-34.59
6770,-34.58
6771,-34.57
6772,-34.54
6773,-34.51
6774,-34.46
6775,-34.41
6776,-34.34
6777,-34.27
6778,-34.19
6779,-34.11
6780,-34.02
6781,-33.93
6782,-33.85
6783,-33.79
6784,-33.72
6785,-33.67
6786,-33.62
6787,-33.59
6788,-33.58
6789,-33.58
6790,-33.59
6791,-33.61
6792,-33.63
6793,-33.66
6794,-33.70
6795,-33.74
6796,-33.78
6797,-33.82
6798,-33.86
6799,-33.90
6800,-33.93
6801,-33.94
6802,-33.94
6803,-33.93
6804,-33.92
6805,-33.91
6806,-33.87
6807,-33.83
6808,-33.77
6809,-33.74
6810,-33.71
6811,-33.69
6812,-33.66
6813,-33.64
6814,-33.64
6815,-33.64
6816,-33.66
6817,-33.70
6818,-33.74
6819,-33.78
6820,-33.82
6821,-33.86
6822,-33.90
6823,-33.93
6824,-33.95
6825,-33.98
6826,-33.99
6827,-34.00
6828,-34.00
6829,-33.99
6830,-33.98
6831,-33.95
6832,-33.91
6833,-33.87
6834,-33.84
6835,-33.80
6836,-33.77
6837,-33.74
6838,-33.71
6839,-33.68
6840,-33.64
6841,-33.60
6842,-33.57
6843,-33.54
6844,-33.52
6845,-33.48
6846,-33.44
6847,-33.41
6848,-33.38
6849,-33.36
6850,-33.33
6851,-33.29
6852,-33.26
6853,-33.25
6854,-33.24
6855,-33.24
6856,-33.24
6857,-33.24
6858,-33.25
6859,-33.28
6860,-33.31
6861,-33.33
6862,-33.36
6863,-33.39
6864,-33.44
6865,-33.48
6866,-33.53
6867,-33.57
6868,-33.62
6869,-33.66
6870,-33.70
6871,-33.74
6872,-33.78
6873,-33.82
6874,-33.86
6875,-33.89
6876,-33.91
6877,-33.94
6878,-33.96
6879,-33.97
6880,-33.98
6881,-34.00
6882,-34.01
6883,-34.02
6884,-34.03
6885,-34.05
6886,-34.08
6887,-34.12
6888,-34.16
6889,-34.20
6890,-34.25
6891,-34.30
6892,-34.38
6893,-34.46
6894,-34.52
6895,-34.59
6896,-34.65
6897,-34.71
6898,-34.76
6899,-34.78
6900,-34.80
6901,-34.81
6902,-34.80
6903,-34.77
6904,-34.73
6905,-34.69
6906,-34.65
6907,-34.61
6908,-34.58
6909,-34.54
6910,-34.51
6911,-34.50
6912,-34.49
6913,-34.50
6914,-34.52
6915,-34.54
6916,-34.56
6917,-34.60
6918,-34.65
6919,-34.70
6920,-34.75
6921,-34.80
6922,-34.85
6923,-34.90
6924,-34.95
6925,-34.97
6926,-34.99
6927,-35.00
6928,-35.00
6929,-34.99
6930,-34.98
6931,-34.95
6932,-34.93
6933,-34.89
6934,-34.85
6935,-34.81
6936,-34.77
6937,-34.75
6938,-34.73
6939,-34.71
6940,-34.70
6941,-34.70
6942,-34.70
6943,-34.69
6944,-34.69
6945,-34.69
6946,-34.69
6947,-34.69
6948,-34.69
6949,-34.69
6950,-34.69
6951,-34.70
6952,-34.70
6953,-34.69
6954,-34.69
6955,-34.70
6956,-34.70
6957,-34.70
6958,-34.69
6959,-34.67
6960,-34.66
6961,-34.64
6962,-34.62
6963,-34.59
6964,-34.57
6965,-34.55
6966,-34.53
6967,-34.52
6968,-34.50
6969,-34.48
6970,-34.48
6971,-34.48
6972,-34.47
6973,-34.45
6974,-34.43
6975,-34.40
6976,-34.37
6977,-34.34
6978,-34.31
6979,-34.27
6980,-34.22
6981,-34.17
6982,-34.12
6983,-34.09
6984,-34.05
6985,-34.01
6986,-33.99
6987,-33.98
6988,-33.97
6989,-33.96
6990,-33.95
6991,-33.95
6992,-33.95
6993,-33.95
6994,-33.96
6995,-33.97
6996,-33.96
6997,-33.96
6998,-33.96
6999,-33.95
7000,-33.94
7001,-33.93
7002,-33.90
7003,-33.87
7004,-33.83
7005,-33.78
7006,-33.74
7007,-33.69
7008,-33.63
7009,-33.56
7010,-33.49
7011,-33.42
7012,-33.36
7013,-33.30
7014,-33.25
7015,-33.20
7016,-33.15
7017,-33.11
7018,-33.07
7019,-33.03
7020,-33.00
7021,-32.99
7022,-32.98
7023,-32.96
7024,-32.95
7025,-32.96
7026,-32.98
7027,-33.00
7028,-33.02
7029,-33.05
7030,-33.09
7031,-33.13
7032,-33.17
7033,-33.21
7034,-33.26
7035,-33.31
7036,-33.36
7037,-33.38
7038,-33.41
7039,-33.43
7040,-33.45
7041,-33.46
7042,-33.47
7043,-33.47
7044,-33.46
7045,-33.45
7046,-33.44
7047,-33.44
7048,-33.44
7049,-33.43
7050,-33.43
7051,-33.44
7052,-33.45
7053,-33.47
7054,-33.50
7055,-33.52
7056,-33.56
7057,-33.59
7058,-33.65
7059,-33.71
7060,-33.76
7061,-33.82
7062,-33.86
7063,-33.91
7064,-33.94
7065,-33.96
7066,-33.97
7067,-33.97
7068,-33.94
7069,-33.91
7070,-33.87
7071,-33.83
7072,-33.78
7073,-33.72
7074,-33.67
7075,-33.62
7076,-33.58
7077,-33.54
7078,-33.51
7079,-33.51
7080,-33.53
7081,-33.55
7082,-33.58
7083,-33.61
7084,-33.65
7085,-33.69
7086,-33.73
7087,-33.76
7088,-33.80
7089,-33.83
7090,-33.86
7091,-33.87
7092,-33.87
7093,-33.87
7094,-33.87
7095,-33.87
7096,-33.86
7097,-33.83
7098,-33.81
7099,-33.79
7100,-33.78
7101,-33.77
7102,-33.77
7103,-33.76
7104,-33.78
7105,-33.80
7106,-33.83
7107,-33.86
7108,-33.90
7109,-33.95
7110,-34.01
7111,-34.07
7112,-34.13
7113,-34.19
7114,-34.25
7115,-34.31
7116,-34.38
7117,-34.44
7118,-34.49
7119,-34.53
7120,-34.56
7121,-34.57
7122,-34.57
7123,-34.56
7124,-34.53
7125,-34.49
7126,-34.46
7127,-34.42
7128,-34.39
7129,-34.37
7130,-34.36
7131,-34.37
7132,-34.39
7133,-34.42
7134,-34.47
7135,-34.52
7136,-34.58
7137,-34.65
7138,-34.71
7139,-34.77
7140,-34.81
7141,-34.84
7142,-34.84
7143,-34.84
7144,-34.82
7145,-34.79
7146,-34.74
7147,-34.68
7148,-34.63
7149,-34.58
7150,-34.53
7151,-34.49
7152,-34.46
7153,-34.45
7154,-34.44
7155,-34.45
7156,-34.48
7157,-34.51
7158,-34.54
7159,-34.57
7160,-34.60
7161,-34.64
7162,-34.67
7163,-34.70
7164,-34.72
7165,-34.73
7166,-34.74
7167,-34.74
7168,-34.73
7169,-34.70
7170,-34.67
7171,-34.63
7172,-34.59
7173,-34.53
7174,-34.47
7175,-34.42
7176,-34.37
7177,-34.32
7178,-34.27
7179,-34.24
7180,-34.22
7181,-34.21
7182,-34.21
7183,-34.23
7184,-34.25
7185,-34.30
7186,-34.34
7187,-34.39
7188,-34.43
7189,-34.60
7190,-34.60
7191,-34.45
7192,-34.27
7193,-35.21
7194,-35.60
7195,-34.02
7196,-31.96
7197,-34.75
7198,-40.23
7199,-36.82
7200,-20.69
