1,36.29
2,50.00
3,50.00
4,24.22
5,-27.22
6,-50.00
7,-50.00
8,-48.46
9,-45.50
10,-49.85
11,-50.00
12,-50.00
13,-49.22
14,-49.75
15,-50.00
16,-50.00
17,-50.00
18,-50.00
19,-50.00
20,-50.00
21,-50.00
22,-50.00
23,-50.00
24,-50.00
25,-50.00
26,-50.00
27,-50.00
28,-50.00
29,-50.00
30,-50.00
31,-50.00
32,-50.00
33,-50.00
34,-50.00
35,-50.00
36,-50.00
37,-50.00
38,-50.00
39,-50.00
40,-50.00
41,-50.00
42,-50.00
43,-50.00
44,-50.00
45,-50.00
46,-50.00
47,-50.00
48,-50.00
49,-50.00
50,-50.00
51,-50.00
52,-50.00
53,-50.00
54,-50.00
55,-50.00
56,-50.00
57,-50.00
58,-50.00
59,-50.00
60,-50.00
61,-50.00
62,-49.99
63,-50.00
64,-50.00
65,-50.00
66,-49.98
67,-49.96
68,-50.00
69,-50.00
70,-49.83
71,-48.47
72,-46.45
73,-45.14
74,-45.36
75,-46.31
76,-46.11
77,-44.17
78,-41.62
79,-40.18
80,-40.04
81,-40.27
82,-39.88
83,-39.07
84,-38.36
85,-38.04
86,-37.58
87,-36.71
88,-35.67
89,-35.16
90,-35.17
91,-35.13
92,-34.41
93,-33.27
94,-32.32
95,-31.92
96,-31.63
97,-31.03
98,-30.02
99,-29.01
100,-28.21
101,-27.79
102,-27.61
103,-27.57
104,-27.25
105,-26.51
106,-25.40
107,-24.51
108,-24.17
109,-24.34
110,-24.38
111,-23.91
112,-22.99
113,-22.18
114,-21.70
115,-21.42
116,-21.01
117,-20.58
118,-20.34
119,-20.39
120,-20.25
121,-19.54
122,-18.35
123,-17.42
124,-17.25
125,-17.66
126,-17.84
127,-17.30
128,-16.24
129,-15.39
130,-15.12
131,-15.22
132,-15.12
133,-14.61
134,-13.96
135,-13.77
136,-14.21
137,-15.00
138,-15.45
139,-15.15
140,-14.14
141,-12.99
142,-12.29
143,-12.29
144,-12.71
145,-13.16
146,-13.29
147,-13.14
148,-12.76
149,-12.18
150,-11.35
151,-10.52
152,-10.00
153,-9.99
154,-10.17
155,-10.10
156,-9.53
157,-8.70
158,-7.98
159,-7.62
160,-7.45
161,-7.26
162,-6.99
163,-6.90
164,-7.08
165,-7.35
166,-7.32
167,-6.91
168,-6.43
169,-6.34
170,-6.70
171,-7.13
172,-7.13
173,-6.50
174,-5.60
175,-5.06
176,-5.22
177,-5.83
178,-6.36
179,-6.61
180,-6.81
181,-7.27
182,-7.86
183,-8.12
184,-7.78
185,-7.11
186,-6.60
187,-6.41
188,-6.14
189,-5.35
190,-4.19
191,-3.37
192,-3.35
193,-3.76
194,-3.85
195,-3.39
196,-2.75
197,-2.26
198,-1.77
199,-1.20
200,-0.92
201,-1.42
202,-2.46
203,-3.08
204,-2.70
205,-1.94
206,-2.03
207,-3.23
208,-4.46
209,-4.45
210,-3.25
211,-2.16
212,-2.13
213,-2.83
214,-3.27
215,-3.13
216,-3.07
217,-3.66
218,-4.45
219,-4.54
220,-3.66
221,-2.56
222,-1.95
223,-1.77
224,-1.31
225,-0.40
226,0.37
227,0.31
228,-0.39
229,-0.87
230,-0.43
231,0.69
232,1.67
233,1.77
234,1.20
235,0.76
236,1.12
237,1.98
238,2.54
239,2.30
240,1.68
241,1.44
242,1.87
243,2.40
244,2.53
245,2.40
246,2.60
247,3.21
248,3.66
249,3.43
250,2.87
251,2.84
252,3.92
253,5.76
254,7.61
255,8.75
256,9.04
257,8.60
258,7.96
259,7.56
260,7.98
261,9.17
262,10.77
263,12.16
264,13.30
265,14.34
266,15.58
267,16.75
268,17.80
269,18.84
270,20.33
271,21.95
272,23.03
273,22.93
274,22.31
275,22.16
276,23.17
277,24.68
278,25.96
279,26.72
280,27.57
281,28.66
282,29.83
283,30.64
284,31.29
285,31.93
286,32.65
287,33.22
288,33.91
289,34.92
290,36.48
291,37.94
292,38.85
293,39.04
294,39.32
295,40.31
296,42.13
297,43.97
298,45.25
299,45.87
300,46.45
301,47.40
302,48.68
303,49.70
304,50.00
305,50.00
306,49.99
307,49.95
308,50.00
309,50.00
310,50.00
311,49.99
312,50.00
313,50.00
314,50.00
315,50.00
316,50.00
317,50.00
318,50.00
319,50.00
320,50.00
321,50.00
322,50.00
323,50.00
324,50.00
325,50.00
326,50.00
327,50.00
328,50.00
329,50.00
330,50.00
331,50.00
332,50.00
333,50.00
334,50.00
335,50.00
336,50.00
337,50.00
338,50.00
339,50.00
340,50.00
341,50.00
342,50.00
343,50.00
344,50.00
345,50.00
346,50.00
347,50.00
348,50.00
349,50.00
350,50.00
351,50.00
352,50.00
353,50.00
354,50.00
355,50.00
356,50.00
357,50.00
358,50.00
359,50.00
360,50.00
361,50.00
362,50.00
363,50.00
364,50.00
365,50.00
366,50.00
367,50.00
368,50.00
369,50.00
370,50.00
371,50.00
372,50.00
373,50.00
374,50.00
375,50.00
376,50.00
377,50.00
378,50.00
379,50.00
380,50.00
381,50.00
382,50.00
383,50.00
384,50.00
385,50.00
386,50.00
387,50.00
388,50.00
389,50.00
390,50.00
391,50.00
392,50.00
393,50.00
394,50.00
395,50.00
396,50.00
397,50.00
398,50.00
399,50.00
400,50.00
401,50.00
402,50.00
403,50.00
404,50.00
405,50.00
406,50.00
407,50.00
408,50.00
409,50.00
410,50.00
411,50.00
412,50.00
413,50.00
414,50.00
415,50.00
416,50.00
417,50.00
418,50.00
419,50.00
420,50.00
421,50.00
422,50.00
423,50.00
424,50.00
425,50.00
426,50.00
427,50.00
428,50.00
429,50.00
430,50.00
431,50.00
432,50.00
433,50.00
434,50.00
435,50.00
436,50.00
437,50.00
438,50.00
439,50.00
440,50.00
441,50.00
442,50.00
443,50.00
444,50.00
445,50.00
446,50.00
447,50.00
448,50.00
449,50.00
450,50.00
451,50.00
452,50.00
453,50.00
454,50.00
455,50.00
456,50.00
457,50.00
458,50.00
459,50.00
460,50.00
461,50.00
462,50.00
463,50.00
464,50.00
465,50.00
466,50.00
467,50.00
468,50.00
469,50.00
470,50.00
471,50.00
472,50.00
473,50.00
474,50.00
475,50.00
476,50.00
477,50.00
478,50.00
479,50.00
480,50.00
481,50.00
482,50.00
483,50.00
484,50.00
485,50.00
486,50.00
487,50.00
488,50.00
489,50.00
490,50.00
491,50.00
492,50.00
493,50.00
494,50.00
495,50.00
496,50.00
497,50.00
498,50.00
499,50.00
500,50.00
501,50.00
502,50.00
503,50.00
504,50.00
505,50.00
506,50.00
507,50.00
508,50.00
509,50.00
510,50.00
511,50.00
512,50.00
513,50.00
514,50.00
515,50.00
516,50.00
517,50.00
518,50.00
519,50.00
520,50.00
521,50.00
522,50.00
523,50.00
524,50.00
525,50.00
526,50.00
527,50.00
528,50.00
529,50.00
530,50.00
531,50.00
532,50.00
533,50.00
534,50.00
535,50.00
536,50.00
537,50.00
538,50.00
539,50.00
540,50.00
541,50.00
542,50.00
543,50.00
544,50.00
545,50.00
546,50.00
547,50.00
548,50.00
549,50.00
550,50.00
551,50.00
552,50.00
553,50.00
554,50.00
555,50.00
556,50.00
557,50.00
558,50.00
559,50.00
560,50.00
561,50.00
562,50.00
563,50.00
564,50.00
565,50.00
566,50.00
567,50.00
568,50.00
569,50.00
570,50.00
571,50.00
572,50.00
573,50.00
574,50.00
575,50.00
576,50.00
577,50.00
578,50.00
579,50.00
580,50.00
581,50.00
582,50.00
583,50.00
584,50.00
585,50.00
586,50.00
587,50.00
588,50.00
589,50.00
590,50.00
591,50.00
592,50.00
593,50.00
594,50.00
595,50.00
596,50.00
597,50.00
598,50.00
599,50.00
600,50.00
601,50.00
602,50.00
603,50.00
604,50.00
605,50.00
606,50.00
607,50.00
608,50.00
609,50.00
610,50.00
611,50.00
612,50.00
613,50.00
614,50.00
615,50.00
616,50.00
617,50.00
618,50.00
619,50.00
620,50.00
621,50.00
622,50.00
623,50.00
624,50.00
625,50.00
626,50.00
627,50.00
628,50.00
629,50.00
630,50.00
631,50.00
632,50.00
633,50.00
634,50.00
635,50.00
636,50.00
637,50.00
638,50.00
639,50.00
640,50.00
641,50.00
642,50.00
643,50.00
644,50.00
645,50.00
646,50.00
647,50.00
648,50.00
649,50.00
650,50.00
651,50.00
652,50.00
653,50.00
654,50.00
655,50.00
656,50.00
657,50.00
658,50.00
659,50.00
660,50.00
661,50.00
662,50.00
663,50.00
664,50.00
665,50.00
666,50.00
667,50.00
668,50.00
669,50.00
670,50.00
671,50.00
672,50.00
673,50.00
674,50.00
675,50.00
676,50.00
677,50.00
678,50.00
679,50.00
680,50.00
681,50.00
682,50.00
683,50.00
684,50.00
685,50.00
686,50.00
687,50.00
688,50.00
689,50.00
690,50.00
691,50.00
692,50.00
693,50.00
694,50.00
695,50.00
696,50.00
697,50.00
698,50.00
699,50.00
700,50.00
701,50.00
702,50.00
703,50.00
704,50.00
705,50.00
706,50.00
707,50.00
708,50.00
709,50.00
710,50.00
711,50.00
712,50.00
713,50.00
714,50.00
715,50.00
716,50.00
717,50.00
718,50.00
719,50.00
720,50.00
721,50.00
722,50.00
723,50.00
724,50.00
725,50.00
726,50.00
727,50.00
728,50.00
729,50.00
730,50.00
731,50.00
732,50.00
733,50.00
734,50.00
735,50.00
736,50.00
737,50.00
738,50.00
739,50.00
740,50.00
741,50.00
742,50.00
743,50.00
744,50.00
745,50.00
746,50.00
747,50.00
748,50.00
749,50.00
750,50.00
751,50.00
752,50.00
753,50.00
754,50.00
755,50.00
756,50.00
757,50.00
758,50.00
759,50.00
760,50.00
761,50.00
762,50.00
763,50.00
764,50.00
765,50.00
766,50.00
767,50.00
768,50.00
769,50.00
770,50.00
771,50.00
772,50.00
773,50.00
774,50.00
775,50.00
776,50.00
777,50.00
778,50.00
779,50.00
780,50.00
781,50.00
782,50.00
783,50.00
784,50.00
785,50.00
786,50.00
787,50.00
788,50.00
789,50.00
790,50.00
791,50.00
792,50.00
793,50.00
794,50.00
795,50.00
796,50.00
797,50.00
798,50.00
799,50.00
800,50.00
801,50.00
802,50.00
803,50.00
804,50.00
805,50.00
806,50.00
807,50.00
808,50.00
809,50.00
810,50.00
811,50.00
812,50.00
813,50.00
814,50.00
815,50.00
816,50.00
817,50.00
818,50.00
819,50.00
820,50.00
821,50.00
822,50.00
823,50.00
824,50.00
825,50.00
826,50.00
827,50.00
828,50.00
829,50.00
830,50.00
831,50.00
832,50.00
833,50.00
834,50.00
835,50.00
836,50.00
837,50.00
838,50.00
839,50.00
840,50.00
841,50.00
842,50.00
843,50.00
844,50.00
845,50.00
846,50.00
847,50.00
848,50.00
849,50.00
850,50.00
851,50.00
852,50.00
853,50.00
854,50.00
855,50.00
856,50.00
857,50.00
858,50.00
859,50.00
860,50.00
861,50.00
862,50.00
863,50.00
864,50.00
865,50.00
866,50.00
867,50.00
868,50.00
869,50.00
870,50.00
871,50.00
872,50.00
873,50.00
874,50.00
875,50.00
876,50.00
877,50.00
878,50.00
879,50.00
880,50.00
881,50.00
882,50.00
883,50.00
884,50.00
885,50.00
886,50.00
887,50.00
888,50.00
889,50.00
890,50.00
891,50.00
892,50.00
893,50.00
894,50.00
895,50.00
896,50.00
897,50.00
898,50.00
899,50.00
900,50.00
901,50.00
902,50.00
903,50.00
904,50.00
905,50.00
906,50.00
907,50.00
908,50.00
909,50.00
910,50.00
911,50.00
912,50.00
913,50.00
914,50.00
915,50.00
916,50.00
917,50.00
918,50.00
919,50.00
920,50.00
921,50.00
922,50.00
923,50.00
924,50.00
925,50.00
926,50.00
927,50.00
928,50.00
929,50.00
930,50.00
931,50.00
932,50.00
933,50.00
934,50.00
935,50.00
936,50.00
937,50.00
938,50.00
939,50.00
940,50.00
941,50.00
942,50.00
943,50.00
944,50.00
945,50.00
946,50.00
947,50.00
948,50.00
949,50.00
950,50.00
951,50.00
952,50.00
953,50.00
954,50.00
955,50.00
956,50.00
957,50.00
958,50.00
959,50.00
960,49.97
961,50.00
962,50.00
963,49.98
964,49.57
965,49.06
966,48.76
967,48.75
968,48.64
969,48.08
970,47.07
971,46.09
972,45.48
973,45.23
974,44.97
975,44.63
976,44.36
977,44.45
978,44.67
979,44.53
980,43.71
981,42.66
982,41.88
983,41.58
984,41.40
985,41.12
986,40.82
987,40.75
988,40.75
989,40.52
990,39.94
991,39.42
992,39.21
993,39.23
994,39.05
995,38.64
996,38.32
997,38.47
998,38.81
999,38.75
1000,37.97
1001,37.03
1002,36.60
1003,36.77
1004,36.72
1005,35.77
1006,33.98
1007,32.26
1008,31.43
1009,31.68
1010,32.28
1011,32.44
1012,31.70
1013,30.54
1014,29.72
1015,29.75
1016,30.19
1017,30.18
1018,29.23
1019,27.89
1020,26.97
1021,26.77
1022,26.73
1023,26.36
1024,25.70
1025,25.23
1026,25.09
1027,25.10
1028,25.02
1029,25.05
1030,25.28
1031,25.50
1032,25.18
1033,24.23
1034,23.16
1035,22.75
1036,23.00
1037,23.21
1038,22.63
1039,21.46
1040,20.52
1041,20.52
1042,21.37
1043,22.44
1044,22.94
1045,22.47
1046,21.08
1047,19.50
1048,18.52
1049,18.47
1050,18.83
1051,18.94
1052,18.48
1053,17.84
1054,17.41
1055,17.30
1056,17.18
1057,16.85
1058,16.35
1059,15.91
1060,15.43
1061,14.68
1062,13.74
1063,13.30
1064,13.77
1065,14.74
1066,15.14
1067,14.53
1068,13.48
1069,13.04
1070,13.37
1071,13.78
1072,13.52
1073,12.67
1074,11.83
1075,11.42
1076,11.22
1077,10.94
1078,10.60
1079,10.63
1080,11.10
1081,11.73
1082,11.98
1083,11.67
1084,10.92
1085,10.01
1086,9.15
1087,8.62
1088,8.46
1089,8.55
1090,8.39
1091,7.78
1092,6.91
1093,6.27
1094,5.97
1095,5.78
1096,5.27
1097,4.45
1098,3.65
1099,3.31
1100,3.32
1101,3.24
1102,2.75
1103,2.20
1104,2.03
1105,2.30
1106,2.45
1107,2.05
1108,1.21
1109,0.54
1110,0.29
1111,0.19
1112,-0.33
1113,-1.36
1114,-2.47
1115,-3.07
1116,-3.05
1117,-2.73
1118,-2.58
1119,-2.72
1120,-3.13
1121,-3.69
1122,-4.37
1123,-4.91
1124,-5.08
1125,-4.77
1126,-4.46
1127,-4.58
1128,-5.37
1129,-6.44
1130,-7.37
1131,-7.88
1132,-8.28
1133,-8.93
1134,-10.08
1135,-11.44
1136,-12.58
1137,-13.14
1138,-13.38
1139,-13.74
1140,-14.60
1141,-15.56
1142,-16.18
1143,-16.24
1144,-16.33
1145,-16.86
1146,-17.94
1147,-18.95
1148,-19.53
1149,-19.58
1150,-19.65
1151,-20.14
1152,-21.17
1153,-22.31
1154,-23.28
1155,-23.97
1156,-24.70
1157,-25.49
1158,-26.24
1159,-26.69
1160,-26.82
1161,-26.64
1162,-26.39
1163,-26.21
1164,-26.34
1165,-26.69
1166,-27.14
1167,-27.52
1168,-27.91
1169,-28.37
1170,-28.92
1171,-29.43
1172,-29.95
1173,-30.60
1174,-31.51
1175,-32.41
1176,-32.84
1177,-32.50
1178,-31.72
1179,-31.14
1180,-31.24
1181,-31.82
1182,-32.36
1183,-32.53
1184,-32.38
1185,-32.08
1186,-31.71
1187,-31.29
1188,-31.10
1189,-31.53
1190,-32.25
1191,-32.82
1192,-32.98
1193,-33.65
1194,-33.98
1195,-32.95
1196,-31.75
1197,-34.66
1198,-40.02
1199,-38.19
1200,-24.08
