1,-188.92
2,-250.00
3,-250.00
4,-243.24
5,-238.30
6,-248.83
7,-216.25
8,-108.29
9,38.91
10,162.99
11,227.84
12,245.45
13,245.55
14,246.59
15,247.45
16,246.64
17,242.92
18,240.51
19,237.83
20,234.98
21,226.35
22,211.65
23,192.35
24,173.97
25,160.63
26,152.26
27,147.89
28,145.15
29,143.85
30,142.40
31,140.76
32,137.74
33,134.08
34,129.25
35,124.47
36,119.40
37,114.98
38,110.66
39,106.85
40,103.01
41,99.57
42,96.12
43,93.08
44,90.00
45,87.25
46,84.37
47,81.78
48,79.12
49,76.78
50,74.39
51,72.28
52,70.10
53,68.15
54,66.15
55,64.38
56,62.57
57,60.96
58,59.30
59,57.82
60,56.28
61,54.92
62,53.52
63,52.28
64,50.99
65,49.86
66,48.68
67,47.65
68,46.57
69,45.62
70,44.62
71,43.75
72,42.85
73,42.04
74,41.19
75,40.42
76,39.61
77,38.89
78,38.15
79,37.50
80,36.81
81,36.20
82,35.55
83,34.97
84,34.36
85,33.81
86,33.24
87,32.73
88,32.20
89,31.72
90,31.20
91,30.75
92,30.30
93,29.90
94,29.48
95,29.09
96,28.69
97,28.34
98,27.96
99,27.63
100,27.27
101,26.93
102,26.57
103,26.24
104,25.89
105,25.57
106,25.25
107,24.93
108,24.60
109,24.29
110,23.97
111,23.68
112,23.39
113,23.13
114,22.86
115,22.61
116,22.35
117,22.11
118,21.87
119,21.67
120,21.44
121,21.22
122,20.99
123,20.77
124,20.56
125,20.36
126,20.16
127,19.97
128,19.79
129,19.62
130,19.44
131,19.29
132,19.13
133,19.01
134,18.88
135,18.76
136,18.63
137,18.52
138,18.42
139,18.33
140,18.23
141,18.14
142,18.03
143,17.93
144,17.83
145,17.74
146,17.63
147,17.52
148,17.41
149,17.30
150,17.18
151,17.08
152,16.98
153,16.88
154,16.77
155,16.68
156,16.59
157,16.49
158,16.40
159,16.32
160,16.24
161,16.17
162,16.09
163,16.01
164,15.92
165,15.85
166,15.77
167,15.69
168,15.63
169,15.58
170,15.51
171,15.44
172,15.38
173,15.34
174,15.29
175,15.23
176,15.15
177,15.10
178,15.05
179,15.01
180,14.97
181,14.92
182,14.86
183,14.81
184,14.75
185,14.69
186,14.63
187,14.59
188,14.55
189,14.50
190,14.47
191,14.43
192,14.40
193,14.38
194,14.38
195,14.37
196,14.37
197,14.36
198,14.37
199,14.40
200,14.42
201,14.43
202,14.43
203,14.43
204,14.43
205,14.45
206,14.46
207,14.45
208,14.44
209,14.43
210,14.43
211,14.43
212,14.43
213,14.41
214,14.40
215,14.40
216,14.40
217,14.39
218,14.37
219,14.36
220,14.35
221,14.34
222,14.33
223,14.31
224,14.28
225,14.26
226,14.23
227,14.19
228,14.15
229,14.12
230,14.07
231,14.02
232,13.96
233,13.90
234,13.85
235,13.80
236,13.76
237,13.73
238,13.69
239,13.66
240,13.65
241,13.64
242,13.65
243,13.66
244,13.67
245,13.71
246,13.75
247,13.79
248,13.82
249,13.85
250,13.89
251,13.92
252,13.96
253,13.98
254,14.02
255,14.03
256,14.05
257,14.06
258,14.08
259,14.09
260,14.11
261,14.12
262,14.14
263,14.14
264,14.16
265,14.18
266,14.19
267,14.21
268,14.22
269,14.24
270,14.24
271,14.24
272,14.24
273,14.23
274,14.23
275,14.22
276,14.20
277,14.17
278,14.14
279,14.12
280,14.09
281,14.06
282,14.04
283,14.02
284,14.02
285,13.99
286,13.97
287,13.95
288,13.94
289,13.92
290,13.89
291,13.87
292,13.85
293,13.84
294,13.82
295,13.80
296,13.78
297,13.75
298,13.72
299,13.69
300,13.67
301,13.65
302,13.63
303,13.63
304,13.63
305,13.62
306,13.63
307,13.63
308,13.65
309,13.65
310,13.66
311,13.70
312,13.76
313,13.79
314,13.83
315,13.86
316,13.91
317,13.95
318,14.01
319,14.05
320,14.09
321,14.12
322,14.15
323,14.17
324,14.18
325,14.21
326,14.23
327,14.25
328,14.27
329,14.30
330,14.32
331,14.34
332,14.37
333,14.40
334,14.43
335,14.45
336,14.47
337,14.48
338,14.50
339,14.51
340,14.52
341,14.53
342,14.52
343,14.51
344,14.50
345,14.50
346,14.50
347,14.50
348,14.47
349,14.46
350,14.44
351,14.43
352,14.40
353,14.37
354,14.34
355,14.31
356,14.28
357,14.25
358,14.22
359,14.18
360,14.16
361,14.13
362,14.11
363,14.10
364,14.09
365,14.09
366,14.11
367,14.12
368,14.14
369,14.15
370,14.17
371,14.18
372,14.20
373,14.21
374,14.21
375,14.21
376,14.21
377,14.21
378,14.20
379,14.19
380,14.18
381,14.16
382,14.14
383,14.13
384,14.12
385,14.11
386,14.11
387,14.10
388,14.08
389,14.07
390,14.05
391,14.05
392,14.03
393,14.02
394,14.00
395,13.98
396,13.98
397,13.96
398,13.95
399,13.93
400,13.91
401,13.89
402,13.89
403,13.89
404,13.88
405,13.87
406,13.85
407,13.85
408,13.84
409,13.83
410,13.82
411,13.81
412,13.80
413,13.80
414,13.79
415,13.79
416,13.78
417,13.77
418,13.76
419,13.76
420,13.74
421,13.72
422,13.68
423,13.64
424,13.60
425,13.55
426,13.51
427,13.47
428,13.44
429,13.40
430,13.37
431,13.36
432,13.35
433,13.35
434,13.37
435,13.40
436,13.44
437,13.47
438,13.51
439,13.55
440,13.59
441,13.62
442,13.66
443,13.70
444,13.73
445,13.75
446,13.76
447,13.76
448,13.78
449,13.79
450,13.79
451,13.78
452,13.76
453,13.76
454,13.73
455,13.72
456,13.70
457,13.70
458,13.70
459,13.69
460,13.67
461,13.66
462,13.66
463,13.66
464,13.66
465,13.65
466,13.63
467,13.62
468,13.62
469,13.62
470,13.61
471,13.59
472,13.56
473,13.54
474,13.52
475,13.49
476,13.44
477,13.40
478,13.35
479,13.31
480,13.28
481,13.24
482,13.21
483,13.18
484,13.15
485,13.12
486,13.11
487,13.10
488,13.10
489,13.10
490,13.11
491,13.11
492,13.13
493,13.15
494,13.15
495,13.16
496,13.16
497,13.18
498,13.20
499,13.22
500,13.24
501,13.24
502,13.25
503,13.27
504,13.28
505,13.31
506,13.33
507,13.34
508,13.35
509,13.36
510,13.38
511,13.40
512,13.42
513,13.43
514,13.44
515,13.45
516,13.47
517,13.47
518,13.47
519,13.47
520,13.47
521,13.49
522,13.50
523,13.50
524,13.49
525,13.47
526,13.45
527,13.43
528,13.39
529,13.34
530,13.29
531,13.24
532,13.19
533,13.15
534,13.09
535,13.05
536,13.01
537,12.99
538,12.95
539,12.92
540,12.89
541,12.88
542,12.86
543,12.83
544,12.79
545,12.76
546,12.73
547,12.70
548,12.67
549,12.64
550,12.61
551,12.59
552,12.57
553,12.57
554,12.57
555,12.57
556,12.59
557,12.61
558,12.63
559,12.66
560,12.70
561,12.75
562,12.79
563,12.83
564,12.86
565,12.90
566,12.94
567,12.97
568,13.00
569,13.03
570,13.05
571,13.08
572,13.09
573,13.11
574,13.11
575,13.12
576,13.13
577,13.13
578,13.12
579,13.10
580,13.08
581,13.07
582,13.05
583,13.04
584,13.02
585,13.01
586,13.00
587,13.00
588,13.02
589,13.03
590,13.05
591,13.07
592,13.08
593,13.11
594,13.12
595,13.13
596,13.15
597,13.16
598,13.17
599,13.18
600,13.18
601,13.17
602,13.18
603,13.18
604,13.19
605,13.20
606,13.21
607,13.22
608,13.24
609,13.28
610,13.32
611,13.37
612,13.40
613,13.46
614,13.52
615,13.59
616,13.66
617,13.71
618,13.76
619,13.80
620,13.85
621,13.88
622,13.92
623,13.94
624,13.97
625,13.99
626,14.02
627,14.05
628,14.08
629,14.12
630,14.16
631,14.20
632,14.24
633,14.29
634,14.33
635,14.35
636,14.38
637,14.42
638,14.44
639,14.45
640,14.43
641,14.42
642,14.40
643,14.40
644,14.39
645,14.37
646,14.34
647,14.32
648,14.31
649,14.29
650,14.28
651,14.28
652,14.28
653,14.29
654,14.28
655,14.28
656,14.28
657,14.29
658,14.30
659,14.29
660,14.28
661,14.27
662,14.26
663,14.25
664,14.24
665,14.21
666,14.20
667,14.18
668,14.18
669,14.16
670,14.16
671,14.15
672,14.16
673,14.17
674,14.18
675,14.21
676,14.24
677,14.27
678,14.31
679,14.36
680,14.40
681,14.43
682,14.47
683,14.53
684,14.58
685,14.62
686,14.66
687,14.70
688,14.74
689,14.78
690,14.81
691,14.84
692,14.86
693,14.88
694,14.92
695,14.93
696,14.95
697,14.96
698,14.96
699,14.95
700,14.95
701,14.93
702,14.92
703,14.90
704,14.88
705,14.84
706,14.81
707,14.79
708,14.76
709,14.74
710,14.72
711,14.72
712,14.72
713,14.72
714,14.72
715,14.75
716,14.76
717,14.78
718,14.80
719,14.82
720,14.85
721,14.88
722,14.89
723,14.91
724,14.92
725,14.93
726,14.94
727,14.95
728,14.95
729,14.96
730,14.96
731,14.96
732,14.97
733,14.98
734,14.99
735,15.01
736,15.02
737,15.04
738,15.06
739,15.08
740,15.10
741,15.12
742,15.15
743,15.17
744,15.20
745,15.21
746,15.22
747,15.23
748,15.24
749,15.27
750,15.27
751,15.28
752,15.29
753,15.30
754,15.30
755,15.31
756,15.31
757,15.32
758,15.33
759,15.34
760,15.34
761,15.34
762,15.33
763,15.32
764,15.30
765,15.28
766,15.27
767,15.25
768,15.23
769,15.19
770,15.16
771,15.14
772,15.11
773,15.09
774,15.06
775,15.03
776,15.01
777,14.98
778,14.96
779,14.93
780,14.92
781,14.90
782,14.89
783,14.89
784,14.89
785,14.90
786,14.91
787,14.92
788,14.95
789,14.98
790,15.01
791,15.05
792,15.09
793,15.14
794,15.18
795,15.23
796,15.27
797,15.30
798,15.34
799,15.36
800,15.38
801,15.40
802,15.41
803,15.43
804,15.44
805,15.44
806,15.45
807,15.46
808,15.49
809,15.52
810,15.55
811,15.57
812,15.59
813,15.61
814,15.63
815,15.63
816,15.64
817,15.64
818,15.63
819,15.62
820,15.60
821,15.58
822,15.55
823,15.52
824,15.49
825,15.46
826,15.44
827,15.42
828,15.40
829,15.37
830,15.37
831,15.36
832,15.36
833,15.37
834,15.37
835,15.38
836,15.38
837,15.39
838,15.40
839,15.40
840,15.41
841,15.42
842,15.43
843,15.42
844,15.42
845,15.40
846,15.40
847,15.37
848,15.36
849,15.34
850,15.33
851,15.31
852,15.30
853,15.28
854,15.27
855,15.25
856,15.24
857,15.24
858,15.23
859,15.24
860,15.24
861,15.24
862,15.24
863,15.24
864,15.24
865,15.25
866,15.26
867,15.27
868,15.27
869,15.28
870,15.29
871,15.30
872,15.32
873,15.33
874,15.34
875,15.34
876,15.35
877,15.36
878,15.36
879,15.35
880,15.34
881,15.33
882,15.30
883,15.28
884,15.26
885,15.24
886,15.20
887,15.16
888,15.12
889,15.09
890,15.05
891,15.02
892,14.99
893,14.97
894,14.96
895,14.95
896,14.95
897,14.95
898,14.95
899,14.95
900,14.94
901,14.92
902,14.91
903,14.89
904,14.88
905,14.87
906,14.85
907,14.82
908,14.79
909,14.77
910,14.73
911,14.70
912,14.67
913,14.65
914,14.64
915,14.63
916,14.63
917,14.64
918,14.66
919,14.67
920,14.68
921,14.69
922,14.70
923,14.72
924,14.75
925,14.76
926,14.76
927,14.76
928,14.77
929,14.78
930,14.78
931,14.78
932,14.78
933,14.79
934,14.81
935,14.82
936,14.82
937,14.83
938,14.83
939,14.83
940,14.82
941,14.82
942,14.82
943,14.82
944,14.80
945,14.78
946,14.75
947,14.72
948,14.72
949,14.71
950,14.71
951,14.71
952,14.70
953,14.70
954,14.70
955,14.72
956,14.72
957,14.73
958,14.75
959,14.76
960,14.76
961,14.76
962,14.75
963,14.73
964,14.72
965,14.70
966,14.69
967,14.67
968,14.65
969,14.63
970,14.60
971,14.59
972,14.57
973,14.56
974,14.56
975,14.56
976,14.56
977,14.57
978,14.58
979,14.59
980,14.58
981,14.59
982,14.60
983,14.63
984,14.63
985,14.63
986,14.63
987,14.64
988,14.65
989,14.65
990,14.63
991,14.62
992,14.60
993,14.60
994,14.60
995,14.57
996,14.56
997,14.54
998,14.53
999,14.53
1000,14.51
1001,14.51
1002,14.51
1003,14.51
1004,14.51
1005,14.51
1006,14.51
1007,14.53
1008,14.54
1009,14.55
1010,14.56
1011,14.56
1012,14.55
1013,14.54
1014,14.53
1015,14.51
1016,14.49
1017,14.45
1018,14.41
1019,14.37
1020,14.32
1021,14.28
1022,14.24
1023,14.20
1024,14.18
1025,14.15
1026,14.14
1027,14.12
1028,14.11
1029,14.14
1030,14.16
1031,14.18
1032,14.20
1033,14.21
1034,14.21
1035,14.23
1036,14.22
1037,14.21
1038,14.21
1039,14.20
1040,14.19
1041,14.18
1042,14.15
1043,14.14
1044,14.16
1045,14.18
1046,14.21
1047,14.23
1048,14.26
1049,14.30
1050,14.35
1051,14.40
1052,14.44
1053,14.49
1054,14.53
1055,14.56
1056,14.60
1057,14.62
1058,14.64
1059,14.66
1060,14.68
1061,14.69
1062,14.70
1063,14.72
1064,14.73
1065,14.75
1066,14.76
1067,14.76
1068,14.76
1069,14.76
1070,14.75
1071,14.72
1072,14.69
1073,14.65
1074,14.61
1075,14.57
1076,14.53
1077,14.48
1078,14.45
1079,14.41
1080,14.37
1081,14.34
1082,14.31
1083,14.28
1084,14.27
1085,14.26
1086,14.26
1087,14.27
1088,14.29
1089,14.31
1090,14.34
1091,14.37
1092,14.40
1093,14.45
1094,14.50
1095,14.55
1096,14.60
1097,14.65
1098,14.70
1099,14.76
1100,14.80
1101,14.84
1102,14.88
1103,14.92
1104,14.95
1105,14.98
1106,15.00
1107,15.00
1108,15.01
1109,15.01
1110,15.03
1111,15.04
1112,15.05
1113,15.05
1114,15.07
1115,15.08
1116,15.09
1117,15.10
1118,15.11
1119,15.13
1120,15.14
1121,15.16
1122,15.16
1123,15.17
1124,15.16
1125,15.16
1126,15.14
1127,15.14
1128,15.13
1129,15.11
1130,15.09
1131,15.07
1132,15.05
1133,15.02
1134,15.01
1135,14.99
1136,14.97
1137,14.95
1138,14.92
1139,14.88
1140,14.87
1141,14.86
1142,14.85
1143,14.85
1144,14.83
1145,14.83
1146,14.83
1147,14.83
1148,14.84
1149,14.85
1150,14.86
1151,14.88
1152,14.90
1153,14.92
1154,14.95
1155,14.97
1156,15.00
1157,15.02
1158,15.05
1159,15.07
1160,15.09
1161,15.12
1162,15.16
1163,15.20
1164,15.24
1165,15.27
1166,15.32
1167,15.37
1168,15.41
1169,15.46
1170,15.51
1171,15.56
1172,15.61
1173,15.65
1174,15.68
1175,15.72
1176,15.74
1177,15.75
1178,15.76
1179,15.76
1180,15.76
1181,15.76
1182,15.76
1183,15.75
1184,15.75
1185,15.75
1186,15.76
1187,15.77
1188,15.79
1189,15.84
1190,15.83
1191,15.75
1192,15.69
1193,15.03
1194,15.50
1195,17.65
1196,17.86
1197,12.63
1198,8.96
1199,20.18
1200,31.52
