1,-186.95
2,-250.00
3,-250.00
4,-248.34
5,-220.50
6,-181.34
7,-112.34
8,-30.64
9,35.28
10,77.38
11,103.36
12,113.84
13,103.16
14,71.07
15,23.16
16,-29.93
17,-80.68
18,-118.42
19,-138.47
20,-137.10
21,-117.61
22,-84.64
23,-45.11
24,-5.39
25,30.31
26,58.89
27,79.93
28,92.88
29,98.15
30,96.08
31,87.04
32,72.86
33,54.99
34,37.00
35,21.13
36,10.31
37,5.02
38,4.87
39,7.96
40,11.96
41,15.20
42,16.26
43,15.53
44,13.41
45,11.42
46,10.11
47,10.15
48,11.19
49,12.81
50,14.34
51,15.29
52,15.60
53,15.40
54,15.04
55,14.71
56,14.59
57,14.68
58,14.98
59,15.37
60,15.79
61,16.16
62,16.57
63,17.04
64,17.59
65,18.12
66,18.61
67,19.03
68,19.40
69,19.70
70,19.88
71,19.94
72,19.94
73,19.91
74,19.83
75,19.71
76,19.56
77,19.39
78,19.17
79,18.88
80,18.46
81,17.97
82,17.38
83,16.75
84,16.05
85,15.36
86,14.64
87,13.99
88,13.34
89,12.80
90,12.32
91,11.99
92,11.67
93,11.36
94,10.97
95,10.54
96,9.99
97,9.37
98,8.67
99,7.99
100,7.35
101,6.81
102,6.37
103,6.09
104,5.93
105,5.91
106,5.95
107,6.06
108,6.17
109,6.32
110,6.49
111,6.68
112,6.86
113,7.00
114,7.12
115,7.17
116,7.18
117,7.15
118,7.10
119,7.06
120,7.08
121,7.17
122,7.35
123,7.55
124,7.74
125,7.83
126,7.84
127,7.76
128,7.66
129,7.57
130,7.54
131,7.58
132,7.74
133,7.96
134,8.21
135,8.43
136,8.67
137,8.90
138,9.17
139,9.49
140,9.89
141,10.36
142,10.94
143,11.57
144,12.19
145,12.73
146,13.18
147,13.50
148,13.73
149,13.83
150,13.85
151,13.82
152,13.79
153,13.76
154,13.69
155,13.60
156,13.54
157,13.51
158,13.47
159,13.38
160,13.27
161,13.14
162,12.99
163,12.84
164,12.75
165,12.78
166,12.93
167,13.17
168,13.47
169,13.80
170,14.17
171,14.50
172,14.72
173,14.80
174,14.82
175,14.81
176,14.79
177,14.72
178,14.66
179,14.66
180,14.75
181,14.92
182,15.17
183,15.47
184,15.82
185,16.21
186,16.62
187,17.01
188,17.35
189,17.59
190,17.74
191,17.79
192,17.77
193,17.68
194,17.53
195,17.32
196,17.06
197,16.78
198,16.53
199,16.32
200,16.16
201,16.04
202,15.96
203,15.91
204,15.85
205,15.81
206,15.71
207,15.60
208,15.44
209,15.27
210,15.06
211,14.83
212,14.55
213,14.26
214,13.95
215,13.66
216,13.34
217,12.99
218,12.60
219,12.18
220,11.70
221,11.18
222,10.57
223,9.96
224,9.33
225,8.77
226,8.26
227,7.89
228,7.61
229,7.48
230,7.40
231,7.36
232,7.24
233,7.04
234,6.72
235,6.32
236,5.78
237,5.19
238,4.57
239,4.04
240,3.57
241,3.23
242,2.97
243,2.84
244,2.76
245,2.71
246,2.59
247,2.46
248,2.29
249,2.12
250,1.88
251,1.56
252,1.17
253,0.79
254,0.39
255,0.02
256,-0.38
257,-0.76
258,-1.17
259,-1.54
260,-1.91
261,-2.22
262,-2.55
263,-2.86
264,-3.23
265,-3.61
266,-4.04
267,-4.47
268,-4.93
269,-5.33
270,-5.75
271,-6.09
272,-6.40
273,-6.65
274,-6.95
275,-7.26
276,-7.64
277,-8.05
278,-8.54
279,-9.09
280,-9.76
281,-10.47
282,-11.22
283,-11.89
284,-12.50
285,-12.96
286,-13.33
287,-13.53
288,-13.63
289,-13.59
290,-13.57
291,-13.64
292,-13.94
293,-14.43
294,-15.12
295,-15.91
296,-16.75
297,-17.52
298,-18.13
299,-18.46
300,-18.55
301,-18.43
302,-18.21
303,-18.00
304,-17.92
305,-18.04
306,-18.33
307,-18.70
308,-19.08
309,-19.39
310,-19.51
311,-19.40
312,-19.04
313,-18.53
314,-17.95
315,-17.43
316,-16.92
317,-16.49
318,-16.04
319,-15.57
320,-14.89
321,-14.02
322,-12.87
323,-11.60
324,-10.19
325,-8.85
326,-7.52
327,-6.39
328,-5.33
329,-4.47
330,-3.66
331,-2.93
332,-2.04
333,-1.06
334,0.14
335,1.37
336,2.66
337,3.83
338,4.94
339,5.84
340,6.62
341,7.19
342,7.66
343,8.00
344,8.32
345,8.60
346,8.90
347,9.19
348,9.51
349,9.74
350,9.83
351,9.74
352,9.56
353,9.30
354,8.98
355,8.66
356,8.42
357,8.32
358,8.34
359,8.42
360,8.47
361,8.49
362,8.35
363,8.04
364,7.48
365,6.74
366,5.84
367,4.92
368,4.01
369,3.26
370,2.61
371,2.09
372,1.58
373,1.09
374,0.54
375,-0.05
376,-0.72
377,-1.39
378,-2.05
379,-2.58
380,-3.01
381,-3.29
382,-3.49
383,-3.56
384,-3.58
385,-3.57
386,-3.62
387,-3.70
388,-3.80
389,-3.86
390,-3.88
391,-3.82
392,-3.64
393,-3.31
394,-2.88
395,-2.42
396,-2.01
397,-1.75
398,-1.65
399,-1.74
400,-1.98
401,-2.29
402,-2.58
403,-2.76
404,-2.80
405,-2.67
406,-2.41
407,-2.10
408,-1.85
409,-1.76
410,-1.86
411,-2.13
412,-2.54
413,-3.02
414,-3.51
415,-3.90
416,-4.16
417,-4.30
418,-4.39
419,-4.47
420,-4.57
421,-4.69
422,-4.87
423,-5.10
424,-5.38
425,-5.59
426,-5.68
427,-5.65
428,-5.52
429,-5.35
430,-5.16
431,-4.98
432,-4.81
433,-4.67
434,-4.53
435,-4.36
436,-4.07
437,-3.65
438,-3.13
439,-2.56
440,-1.95
441,-1.37
442,-0.80
443,-0.31
444,0.17
445,0.57
446,0.95
447,1.30
448,1.68
449,2.09
450,2.56
451,2.99
452,3.40
453,3.72
454,3.97
455,4.11
456,4.18
457,4.17
458,4.13
459,4.10
460,4.13
461,4.23
462,4.44
463,4.68
464,4.94
465,5.14
466,5.28
467,5.36
468,5.45
469,5.53
470,5.62
471,5.74
472,5.94
473,6.24
474,6.58
475,6.90
476,7.12
477,7.24
478,7.24
479,7.16
480,6.97
481,6.74
482,6.45
483,6.13
484,5.74
485,5.31
486,4.78
487,4.20
488,3.52
489,2.85
490,2.14
491,1.47
492,0.78
493,0.14
494,-0.51
495,-1.14
496,-1.85
497,-2.52
498,-3.18
499,-3.76
500,-4.36
501,-4.90
502,-5.45
503,-5.91
504,-6.36
505,-6.73
506,-7.07
507,-7.29
508,-7.43
509,-7.48
510,-7.54
511,-7.61
512,-7.77
513,-8.00
514,-8.34
515,-8.77
516,-9.22
517,-9.57
518,-9.79
519,-9.82
520,-9.70
521,-9.41
522,-9.00
523,-8.55
524,-8.19
525,-7.94
526,-7.79
527,-7.71
528,-7.69
529,-7.73
530,-7.73
531,-7.63
532,-7.34
533,-6.90
534,-6.29
535,-5.61
536,-4.88
537,-4.21
538,-3.55
539,-2.97
540,-2.43
541,-1.99
542,-1.57
543,-1.17
544,-0.73
545,-0.32
546,0.08
547,0.40
548,0.65
549,0.76
550,0.75
551,0.63
552,0.43
553,0.19
554,-0.08
555,-0.32
556,-0.50
557,-0.61
558,-0.72
559,-0.86
560,-1.05
561,-1.24
562,-1.38
563,-1.50
564,-1.62
565,-1.73
566,-1.82
567,-1.85
568,-1.86
569,-1.85
570,-1.82
571,-1.76
572,-1.72
573,-1.74
574,-1.86
575,-2.08
576,-2.36
577,-2.66
578,-2.95
579,-3.20
580,-3.34
581,-3.34
582,-3.17
583,-2.87
584,-2.49
585,-2.11
586,-1.73
587,-1.41
588,-1.13
589,-0.86
590,-0.55
591,-0.21
592,0.19
593,0.61
594,1.05
595,1.44
596,1.71
597,1.83
598,1.85
599,1.82
600,1.73
601,1.61
602,1.50
603,1.40
604,1.32
605,1.24
606,1.14
607,0.98
608,0.76
609,0.45
610,0.11
611,-0.18
612,-0.42
613,-0.56
614,-0.63
615,-0.60
616,-0.47
617,-0.26
618,0.02
619,0.31
620,0.61
621,0.89
622,1.11
623,1.29
624,1.43
625,1.54
626,1.66
627,1.82
628,2.01
629,2.20
630,2.40
631,2.55
632,2.66
633,2.65
634,2.53
635,2.32
636,2.08
637,1.85
638,1.69
639,1.64
640,1.71
641,1.89
642,2.12
643,2.34
644,2.49
645,2.56
646,2.49
647,2.29
648,1.96
649,1.63
650,1.36
651,1.22
652,1.17
653,1.18
654,1.18
655,1.19
656,1.19
657,1.16
658,1.06
659,0.89
660,0.66
661,0.48
662,0.35
663,0.31
664,0.28
665,0.26
666,0.18
667,0.08
668,-0.07
669,-0.21
670,-0.42
671,-0.65
672,-0.90
673,-1.10
674,-1.28
675,-1.45
676,-1.66
677,-1.89
678,-2.17
679,-2.46
680,-2.82
681,-3.20
682,-3.59
683,-3.91
684,-4.18
685,-4.41
686,-4.68
687,-4.93
688,-5.20
689,-5.46
690,-5.76
691,-6.11
692,-6.51
693,-6.87
694,-7.16
695,-7.36
696,-7.50
697,-7.59
698,-7.66
699,-7.72
700,-7.77
701,-7.84
702,-7.91
703,-7.97
704,-7.97
705,-7.86
706,-7.61
707,-7.25
708,-6.78
709,-6.25
710,-5.67
711,-5.13
712,-4.67
713,-4.35
714,-4.14
715,-4.07
716,-4.04
717,-4.03
718,-3.93
719,-3.78
720,-3.49
721,-3.11
722,-2.58
723,-1.97
724,-1.25
725,-0.53
726,0.27
727,1.06
728,1.88
729,2.66
730,3.50
731,4.32
732,5.16
733,5.93
734,6.68
735,7.30
736,7.89
737,8.35
738,8.77
739,9.11
740,9.44
741,9.73
742,10.05
743,10.35
744,10.68
745,10.99
746,11.26
747,11.47
748,11.57
749,11.60
750,11.61
751,11.61
752,11.56
753,11.44
754,11.27
755,11.06
756,10.80
757,10.48
758,10.08
759,9.67
760,9.25
761,8.87
762,8.50
763,8.14
764,7.79
765,7.51
766,7.26
767,7.07
768,6.82
769,6.58
770,6.27
771,5.97
772,5.53
773,4.98
774,4.26
775,3.49
776,2.68
777,1.91
778,1.17
779,0.52
780,-0.04
781,-0.46
782,-0.87
783,-1.30
784,-1.82
785,-2.35
786,-2.88
787,-3.33
788,-3.70
789,-3.92
790,-4.02
791,-3.98
792,-3.88
793,-3.78
794,-3.75
795,-3.78
796,-3.86
797,-3.96
798,-4.02
799,-3.99
800,-3.83
801,-3.56
802,-3.23
803,-2.87
804,-2.51
805,-2.22
806,-2.02
807,-1.97
808,-1.99
809,-2.04
810,-2.01
811,-1.91
812,-1.65
813,-1.27
814,-0.75
815,-0.19
816,0.41
817,0.97
818,1.52
819,1.98
820,2.38
821,2.70
822,3.01
823,3.36
824,3.77
825,4.16
826,4.49
827,4.72
828,4.91
829,4.98
830,4.95
831,4.81
832,4.60
833,4.35
834,4.04
835,3.69
836,3.35
837,3.04
838,2.73
839,2.42
840,2.11
841,1.84
842,1.57
843,1.32
844,1.02
845,0.68
846,0.22
847,-0.31
848,-0.89
849,-1.39
850,-1.82
851,-2.10
852,-2.30
853,-2.43
854,-2.61
855,-2.83
856,-3.14
857,-3.53
858,-4.01
859,-4.49
860,-4.88
861,-5.09
862,-5.14
863,-5.04
864,-4.81
865,-4.52
866,-4.24
867,-4.06
868,-3.96
869,-3.94
870,-3.96
871,-4.01
872,-3.96
873,-3.78
874,-3.46
875,-3.05
876,-2.56
877,-2.01
878,-1.43
879,-0.90
880,-0.47
881,-0.14
882,0.17
883,0.46
884,0.70
885,0.85
886,0.94
887,0.99
888,1.01
889,0.95
890,0.81
891,0.60
892,0.35
893,0.11
894,-0.10
895,-0.27
896,-0.44
897,-0.59
898,-0.72
899,-0.84
900,-0.98
901,-1.15
902,-1.37
903,-1.62
904,-1.85
905,-2.06
906,-2.25
907,-2.42
908,-2.57
909,-2.69
910,-2.78
911,-2.77
912,-2.68
913,-2.56
914,-2.48
915,-2.44
916,-2.43
917,-2.43
918,-2.49
919,-2.59
920,-2.62
921,-2.53
922,-2.33
923,-2.07
924,-1.75
925,-1.43
926,-1.11
927,-0.87
928,-0.74
929,-0.76
930,-0.83
931,-0.91
932,-0.87
933,-0.70
934,-0.36
935,0.11
936,0.73
937,1.39
938,2.04
939,2.57
940,2.99
941,3.28
942,3.47
943,3.56
944,3.57
945,3.50
946,3.38
947,3.23
948,3.08
949,2.92
950,2.77
951,2.61
952,2.49
953,2.46
954,2.53
955,2.69
956,2.91
957,3.21
958,3.59
959,4.01
960,4.42
961,4.76
962,4.99
963,5.05
964,4.89
965,4.54
966,4.03
967,3.45
968,2.84
969,2.28
970,1.79
971,1.38
972,0.99
973,0.63
974,0.20
975,-0.26
976,-0.86
977,-1.56
978,-2.40
979,-3.23
980,-4.02
981,-4.66
982,-5.23
983,-5.65
984,-6.01
985,-6.30
986,-6.60
987,-6.87
988,-7.19
989,-7.51
990,-7.87
991,-8.19
992,-8.45
993,-8.63
994,-8.77
995,-8.93
996,-9.06
997,-9.16
998,-9.19
999,-9.16
1000,-9.06
1001,-8.89
1002,-8.59
1003,-8.22
1004,-7.76
1005,-7.29
1006,-6.76
1007,-6.24
1008,-5.69
1009,-5.17
1010,-4.59
1011,-4.02
1012,-3.37
1013,-2.74
1014,-2.02
1015,-1.34
1016,-0.60
1017,0.13
1018,0.95
1019,1.79
1020,2.70
1021,3.58
1022,4.49
1023,5.35
1024,6.16
1025,6.83
1026,7.41
1027,7.87
1028,8.32
1029,8.71
1030,9.12
1031,9.49
1032,9.91
1033,10.32
1034,10.73
1035,11.02
1036,11.20
1037,11.22
1038,11.12
1039,10.93
1040,10.72
1041,10.51
1042,10.32
1043,10.20
1044,10.15
1045,10.16
1046,10.15
1047,10.11
1048,9.97
1049,9.77
1050,9.46
1051,9.06
1052,8.54
1053,7.97
1054,7.35
1055,6.74
1056,6.09
1057,5.47
1058,4.86
1059,4.33
1060,3.88
1061,3.53
1062,3.22
1063,3.00
1064,2.84
1065,2.78
1066,2.78
1067,2.84
1068,2.97
1069,3.14
1070,3.36
1071,3.63
1072,3.99
1073,4.40
1074,4.82
1075,5.19
1076,5.52
1077,5.80
1078,6.05
1079,6.27
1080,6.47
1081,6.64
1082,6.77
1083,6.87
1084,6.94
1085,6.96
1086,6.94
1087,6.84
1088,6.68
1089,6.47
1090,6.23
1091,5.98
1092,5.78
1093,5.66
1094,5.67
1095,5.78
1096,5.97
1097,6.22
1098,6.52
1099,6.81
1100,7.03
1101,7.12
1102,7.13
1103,7.09
1104,7.02
1105,6.93
1106,6.88
1107,6.93
1108,7.13
1109,7.46
1110,7.89
1111,8.32
1112,8.65
1113,8.87
1114,8.95
1115,8.91
1116,8.77
1117,8.56
1118,8.32
1119,8.09
1120,7.83
1121,7.53
1122,7.20
1123,6.87
1124,6.56
1125,6.26
1126,5.97
1127,5.73
1128,5.58
1129,5.53
1130,5.49
1131,5.41
1132,5.26
1133,5.07
1134,4.89
1135,4.76
1136,4.63
1137,4.52
1138,4.38
1139,4.26
1140,4.17
1141,4.10
1142,3.94
1143,3.71
1144,3.43
1145,3.19
1146,2.96
1147,2.77
1148,2.59
1149,2.45
1150,2.30
1151,2.16
1152,1.99
1153,1.82
1154,1.59
1155,1.30
1156,0.93
1157,0.54
1158,0.16
1159,-0.19
1160,-0.53
1161,-0.79
1162,-0.98
1163,-1.03
1164,-1.01
1165,-1.00
1166,-1.07
1167,-1.17
1168,-1.33
1169,-1.51
1170,-1.75
1171,-2.03
1172,-2.25
1173,-2.37
1174,-2.41
1175,-2.43
1176,-2.46
1177,-2.54
1178,-2.62
1179,-2.72
1180,-2.78
1181,-2.82
1182,-2.78
1183,-2.64
1184,-2.33
1185,-1.88
1186,-1.35
1187,-0.81
1188,-0.26
1189,0.27
1190,0.77
1191,1.15
1192,1.43
1193,1.59
1194,1.72
1195,1.77
1196,1.78
1197,1.73
1198,1.72
1199,1.77
1200,1.95
1201,2.20
1202,2.56
1203,2.94
1204,3.33
1205,3.69
1206,4.00
1207,4.23
1208,4.43
1209,4.62
1210,4.88
1211,5.23
1212,5.72
1213,6.26
1214,6.78
1215,7.21
1216,7.53
1217,7.73
1218,7.80
1219,7.78
1220,7.68
1221,7.53
1222,7.32
1223,7.09
1224,6.84
1225,6.58
1226,6.23
1227,5.83
1228,5.36
1229,4.91
1230,4.46
1231,4.04
1232,3.56
1233,3.03
1234,2.40
1235,1.72
1236,0.98
1237,0.24
1238,-0.52
1239,-1.16
1240,-1.66
1241,-1.94
1242,-2.15
1243,-2.30
1244,-2.45
1245,-2.53
1246,-2.63
1247,-2.73
1248,-2.88
1249,-2.99
1250,-3.08
1251,-3.11
1252,-3.09
1253,-3.01
1254,-2.93
1255,-2.86
1256,-2.88
1257,-3.00
1258,-3.21
1259,-3.48
1260,-3.81
1261,-4.19
1262,-4.60
1263,-5.03
1264,-5.46
1265,-5.84
1266,-6.16
1267,-6.36
1268,-6.49
1269,-6.55
1270,-6.54
1271,-6.45
1272,-6.29
1273,-6.11
1274,-5.91
1275,-5.73
1276,-5.58
1277,-5.47
1278,-5.37
1279,-5.28
1280,-5.20
1281,-5.18
1282,-5.19
1283,-5.20
1284,-5.13
1285,-5.03
1286,-4.87
1287,-4.69
1288,-4.46
1289,-4.20
1290,-3.92
1291,-3.65
1292,-3.38
1293,-3.13
1294,-2.85
1295,-2.53
1296,-2.08
1297,-1.53
1298,-0.85
1299,-0.18
1300,0.52
1301,1.14
1302,1.68
1303,2.06
1304,2.31
1305,2.42
1306,2.45
1307,2.43
1308,2.44
1309,2.46
1310,2.50
1311,2.57
1312,2.68
1313,2.76
1314,2.78
1315,2.72
1316,2.65
1317,2.64
1318,2.69
1319,2.79
1320,2.91
1321,3.07
1322,3.20
1323,3.27
1324,3.23
1325,3.08
1326,2.82
1327,2.52
1328,2.24
1329,2.04
1330,1.87
1331,1.73
1332,1.58
1333,1.44
1334,1.27
1335,1.04
1336,0.69
1337,0.25
1338,-0.25
1339,-0.72
1340,-1.17
1341,-1.53
1342,-1.79
1343,-1.93
1344,-2.01
1345,-2.05
1346,-2.13
1347,-2.21
1348,-2.33
1349,-2.45
1350,-2.58
1351,-2.67
1352,-2.65
1353,-2.47
1354,-2.15
1355,-1.72
1356,-1.24
1357,-0.79
1358,-0.46
1359,-0.31
1360,-0.34
1361,-0.47
1362,-0.60
1363,-0.69
1364,-0.71
1365,-0.66
1366,-0.53
1367,-0.37
1368,-0.26
1369,-0.23
1370,-0.28
1371,-0.41
1372,-0.56
1373,-0.71
1374,-0.85
1375,-0.93
1376,-0.97
1377,-0.93
1378,-0.87
1379,-0.84
1380,-0.88
1381,-0.97
1382,-1.06
1383,-1.15
1384,-1.27
1385,-1.42
1386,-1.57
1387,-1.70
1388,-1.77
1389,-1.76
1390,-1.67
1391,-1.46
1392,-1.14
1393,-0.76
1394,-0.34
1395,0.02
1396,0.30
1397,0.47
1398,0.58
1399,0.60
1400,0.56
1401,0.53
1402,0.59
1403,0.71
1404,0.90
1405,1.11
1406,1.40
1407,1.72
1408,2.03
1409,2.29
1410,2.58
1411,2.93
1412,3.36
1413,3.78
1414,4.17
1415,4.49
1416,4.75
1417,4.93
1418,5.04
1419,5.06
1420,5.04
1421,5.00
1422,4.99
1423,4.95
1424,4.88
1425,4.72
1426,4.54
1427,4.36
1428,4.17
1429,4.02
1430,3.94
1431,4.00
1432,4.20
1433,4.51
1434,4.84
1435,5.15
1436,5.40
1437,5.55
1438,5.57
1439,5.52
1440,5.44
1441,5.38
1442,5.31
1443,5.23
1444,5.14
1445,5.07
1446,4.91
1447,4.62
1448,4.14
1449,3.49
1450,2.66
1451,1.75
1452,0.71
1453,-0.35
1454,-1.46
1455,-2.49
1456,-3.45
1457,-4.23
1458,-4.91
1459,-5.42
1460,-5.87
1461,-6.22
1462,-6.52
1463,-6.74
1464,-6.97
1465,-7.16
1466,-7.37
1467,-7.55
1468,-7.71
1469,-7.81
1470,-7.89
1471,-7.92
1472,-7.93
1473,-7.92
1474,-7.92
1475,-7.92
1476,-7.93
1477,-7.93
1478,-7.89
1479,-7.80
1480,-7.68
1481,-7.50
1482,-7.24
1483,-6.88
1484,-6.44
1485,-5.99
1486,-5.58
1487,-5.26
1488,-5.00
1489,-4.84
1490,-4.72
1491,-4.71
1492,-4.71
1493,-4.67
1494,-4.46
1495,-4.08
1496,-3.49
1497,-2.78
1498,-1.97
1499,-1.14
1500,-0.31
1501,0.42
1502,1.08
1503,1.64
1504,2.13
1505,2.51
1506,2.81
1507,3.01
1508,3.17
1509,3.27
1510,3.36
1511,3.42
1512,3.47
1513,3.49
1514,3.50
1515,3.50
1516,3.53
1517,3.59
1518,3.66
1519,3.72
1520,3.78
1521,3.83
1522,3.88
1523,3.91
1524,3.94
1525,4.00
1526,4.10
1527,4.28
1528,4.52
1529,4.81
1530,5.05
1531,5.21
1532,5.22
1533,5.04
1534,4.66
1535,4.12
1536,3.46
1537,2.77
1538,2.13
1539,1.65
1540,1.36
1541,1.28
1542,1.34
1543,1.43
1544,1.49
1545,1.46
1546,1.34
1547,1.09
1548,0.75
1549,0.41
1550,0.21
1551,0.23
1552,0.50
1553,0.99
1554,1.64
1555,2.37
1556,3.07
1557,3.60
1558,3.94
1559,4.07
1560,4.10
1561,4.06
1562,4.01
1563,3.97
1564,4.01
1565,4.13
1566,4.30
1567,4.39
1568,4.36
1569,4.23
1570,4.07
1571,3.88
1572,3.70
1573,3.55
1574,3.47
1575,3.50
1576,3.62
1577,3.78
1578,3.93
1579,4.08
1580,4.23
1581,4.38
1582,4.52
1583,4.65
1584,4.73
1585,4.76
1586,4.71
1587,4.61
1588,4.43
1589,4.19
1590,3.86
1591,3.52
1592,3.16
1593,2.84
1594,2.48
1595,2.08
1596,1.60
1597,1.13
1598,0.63
1599,0.18
1600,-0.30
1601,-0.71
1602,-1.08
1603,-1.40
1604,-1.72
1605,-2.08
1606,-2.49
1607,-2.94
1608,-3.40
1609,-3.82
1610,-4.16
1611,-4.33
1612,-4.33
1613,-4.14
1614,-3.85
1615,-3.48
1616,-3.10
1617,-2.77
1618,-2.53
1619,-2.40
1620,-2.38
1621,-2.39
1622,-2.37
1623,-2.27
1624,-2.11
1625,-1.90
1626,-1.66
1627,-1.45
1628,-1.32
1629,-1.31
1630,-1.47
1631,-1.78
1632,-2.17
1633,-2.59
1634,-2.99
1635,-3.32
1636,-3.59
1637,-3.76
1638,-3.85
1639,-3.87
1640,-3.90
1641,-3.97
1642,-4.17
1643,-4.42
1644,-4.76
1645,-5.15
1646,-5.59
1647,-6.00
1648,-6.35
1649,-6.58
1650,-6.77
1651,-6.94
1652,-7.12
1653,-7.29
1654,-7.51
1655,-7.77
1656,-8.09
1657,-8.43
1658,-8.83
1659,-9.25
1660,-9.67
1661,-10.06
1662,-10.41
1663,-10.67
1664,-10.87
1665,-11.01
1666,-11.14
1667,-11.25
1668,-11.38
1669,-11.50
1670,-11.60
1671,-11.66
1672,-11.65
1673,-11.57
1674,-11.41
1675,-11.16
1676,-10.85
1677,-10.56
1678,-10.33
1679,-10.22
1680,-10.16
1681,-10.15
1682,-10.11
1683,-10.04
1684,-9.81
1685,-9.42
1686,-8.77
1687,-7.98
1688,-7.05
1689,-6.14
1690,-5.21
1691,-4.40
1692,-3.63
1693,-2.98
1694,-2.28
1695,-1.56
1696,-0.68
1697,0.25
1698,1.28
1699,2.27
1700,3.31
1701,4.27
1702,5.23
1703,6.07
1704,6.90
1705,7.61
1706,8.30
1707,8.88
1708,9.45
1709,9.95
1710,10.40
1711,10.71
1712,10.94
1713,11.07
1714,11.17
1715,11.22
1716,11.25
1717,11.22
1718,11.14
1719,11.02
1720,10.86
1721,10.65
1722,10.39
1723,10.13
1724,9.86
1725,9.64
1726,9.39
1727,9.14
1728,8.80
1729,8.39
1730,7.89
1731,7.40
1732,6.88
1733,6.42
1734,5.94
1735,5.50
1736,5.07
1737,4.68
1738,4.20
1739,3.65
1740,2.99
1741,2.30
1742,1.58
1743,0.92
1744,0.27
1745,-0.28
1746,-0.79
1747,-1.19
1748,-1.53
1749,-1.79
1750,-2.04
1751,-2.24
1752,-2.40
1753,-2.48
1754,-2.53
1755,-2.55
1756,-2.59
1757,-2.65
1758,-2.70
1759,-2.73
1760,-2.75
1761,-2.75
1762,-2.71
1763,-2.59
1764,-2.40
1765,-2.17
1766,-1.91
1767,-1.66
1768,-1.46
1769,-1.31
1770,-1.22
1771,-1.20
1772,-1.20
1773,-1.21
1774,-1.17
1775,-1.07
1776,-0.85
1777,-0.52
1778,-0.08
1779,0.37
1780,0.79
1781,1.14
1782,1.45
1783,1.71
1784,1.93
1785,2.08
1786,2.20
1787,2.33
1788,2.53
1789,2.73
1790,2.94
1791,3.12
1792,3.30
1793,3.40
1794,3.42
1795,3.33
1796,3.22
1797,3.12
1798,3.06
1799,3.09
1800,3.26
1801,3.53
1802,3.82
1803,4.08
1804,4.26
1805,4.34
1806,4.26
1807,4.01
1808,3.58
1809,3.10
1810,2.62
1811,2.24
1812,1.93
1813,1.73
1814,1.62
1815,1.53
1816,1.39
1817,1.16
1818,0.83
1819,0.47
1820,0.09
1821,-0.23
1822,-0.47
1823,-0.58
1824,-0.61
1825,-0.53
1826,-0.42
1827,-0.29
1828,-0.24
1829,-0.30
1830,-0.43
1831,-0.63
1832,-0.83
1833,-1.01
1834,-1.12
1835,-1.13
1836,-1.02
1837,-0.84
1838,-0.60
1839,-0.36
1840,-0.15
1841,0.01
1842,0.10
1843,0.15
1844,0.20
1845,0.29
1846,0.43
1847,0.61
1848,0.81
1849,0.97
1850,1.03
1851,0.94
1852,0.67
1853,0.26
1854,-0.27
1855,-0.81
1856,-1.34
1857,-1.75
1858,-2.03
1859,-2.17
1860,-2.25
1861,-2.29
1862,-2.36
1863,-2.47
1864,-2.71
1865,-3.02
1866,-3.43
1867,-3.85
1868,-4.26
1869,-4.58
1870,-4.79
1871,-4.88
1872,-4.90
1873,-4.93
1874,-4.97
1875,-5.02
1876,-5.11
1877,-5.24
1878,-5.37
1879,-5.43
1880,-5.36
1881,-5.15
1882,-4.83
1883,-4.41
1884,-3.91
1885,-3.36
1886,-2.85
1887,-2.50
1888,-2.31
1889,-2.29
1890,-2.37
1891,-2.54
1892,-2.72
1893,-2.85
1894,-2.83
1895,-2.69
1896,-2.43
1897,-2.14
1898,-1.79
1899,-1.43
1900,-1.10
1901,-0.86
1902,-0.73
1903,-0.71
1904,-0.74
1905,-0.81
1906,-0.89
1907,-0.98
1908,-1.04
1909,-1.08
1910,-1.06
1911,-0.98
1912,-0.79
1913,-0.53
1914,-0.21
1915,0.12
1916,0.47
1917,0.80
1918,1.07
1919,1.23
1920,1.26
1921,1.23
1922,1.17
1923,1.11
1924,1.03
1925,0.92
1926,0.72
1927,0.43
1928,-0.01
1929,-0.60
1930,-1.35
1931,-2.15
1932,-2.98
1933,-3.74
1934,-4.47
1935,-5.09
1936,-5.60
1937,-5.94
1938,-6.22
1939,-6.44
1940,-6.68
1941,-6.87
1942,-7.04
1943,-7.13
1944,-7.17
1945,-7.16
1946,-7.13
1947,-7.06
1948,-7.00
1949,-6.93
1950,-6.87
1951,-6.88
1952,-6.97
1953,-7.13
1954,-7.28
1955,-7.38
1956,-7.38
1957,-7.29
1958,-7.11
1959,-6.84
1960,-6.48
1961,-6.10
1962,-5.71
1963,-5.33
1964,-4.93
1965,-4.55
1966,-4.18
1967,-3.89
1968,-3.63
1969,-3.41
1970,-3.16
1971,-2.92
1972,-2.69
1973,-2.49
1974,-2.27
1975,-2.04
1976,-1.77
1977,-1.52
1978,-1.25
1979,-1.03
1980,-0.77
1981,-0.49
1982,-0.12
1983,0.28
1984,0.80
1985,1.36
1986,1.96
1987,2.53
1988,3.04
1989,3.49
1990,3.88
1991,4.17
1992,4.37
1993,4.44
1994,4.46
1995,4.49
1996,4.59
1997,4.73
1998,4.90
1999,5.05
2000,5.20
2001,5.35
2002,5.45
2003,5.46
2004,5.36
2005,5.17
2006,4.91
2007,4.63
2008,4.29
2009,3.91
2010,3.46
2011,2.98
2012,2.49
2013,2.03
2014,1.51
2015,0.96
2016,0.34
2017,-0.26
2018,-0.81
2019,-1.26
2020,-1.61
2021,-1.80
2022,-1.88
2023,-1.84
2024,-1.76
2025,-1.67
2026,-1.57
2027,-1.48
2028,-1.43
2029,-1.43
2030,-1.44
2031,-1.40
2032,-1.21
2033,-0.92
2034,-0.51
2035,-0.04
2036,0.50
2037,1.04
2038,1.54
2039,1.92
2040,2.20
2041,2.40
2042,2.59
2043,2.80
2044,3.04
2045,3.27
2046,3.51
2047,3.75
2048,3.97
2049,4.11
2050,4.19
2051,4.18
2052,4.14
2053,4.10
2054,4.10
2055,4.15
2056,4.28
2057,4.48
2058,4.78
2059,5.17
2060,5.65
2061,6.09
2062,6.47
2063,6.76
2064,7.03
2065,7.30
2066,7.55
2067,7.76
2068,7.95
2069,8.13
2070,8.26
2071,8.29
2072,8.21
2073,8.00
2074,7.67
2075,7.21
2076,6.67
2077,6.13
2078,5.68
2079,5.37
2080,5.20
2081,5.12
2082,5.09
2083,5.10
2084,5.11
2085,5.15
2086,5.17
2087,5.14
2088,5.04
2089,4.92
2090,4.83
2091,4.77
2092,4.70
2093,4.62
2094,4.55
2095,4.55
2096,4.59
2097,4.69
2098,4.81
2099,4.93
2100,5.02
2101,5.09
2102,5.14
2103,5.17
2104,5.13
2105,5.05
2106,4.94
2107,4.85
2108,4.73
2109,4.53
2110,4.26
2111,3.95
2112,3.65
2113,3.38
2114,3.17
2115,3.05
2116,3.04
2117,3.14
2118,3.28
2119,3.38
2120,3.35
2121,3.15
2122,2.76
2123,2.25
2124,1.66
2125,1.08
2126,0.60
2127,0.27
2128,0.11
2129,0.06
2130,0.02
2131,-0.05
2132,-0.23
2133,-0.49
2134,-0.85
2135,-1.24
2136,-1.61
2137,-1.88
2138,-2.02
2139,-2.04
2140,-2.00
2141,-1.94
2142,-1.90
2143,-1.89
2144,-1.94
2145,-2.05
2146,-2.26
2147,-2.50
2148,-2.71
2149,-2.81
2150,-2.76
2151,-2.59
2152,-2.27
2153,-1.88
2154,-1.46
2155,-1.07
2156,-0.74
2157,-0.53
2158,-0.47
2159,-0.58
2160,-0.76
2161,-0.95
2162,-1.04
2163,-1.00
2164,-0.79
2165,-0.43
2166,0.08
2167,0.64
2168,1.21
2169,1.67
2170,2.10
2171,2.46
2172,2.86
2173,3.30
2174,3.84
2175,4.46
2176,5.16
2177,5.84
2178,6.50
2179,7.03
2180,7.42
2181,7.64
2182,7.78
2183,7.85
2184,7.97
2185,8.13
2186,8.40
2187,8.72
2188,9.11
2189,9.49
2190,9.86
2191,10.19
2192,10.51
2193,10.79
2194,11.09
2195,11.38
2196,11.70
2197,12.00
2198,12.24
2199,12.36
2200,12.38
2201,12.31
2202,12.17
2203,11.96
2204,11.72
2205,11.51
2206,11.34
2207,11.23
2208,11.14
2209,11.06
2210,10.93
2211,10.80
2212,10.60
2213,10.34
2214,9.95
2215,9.49
2216,8.95
2217,8.39
2218,7.74
2219,7.07
2220,6.37
2221,5.74
2222,5.17
2223,4.71
2224,4.33
2225,4.01
2226,3.67
2227,3.33
2228,2.95
2229,2.62
2230,2.36
2231,2.22
2232,2.20
2233,2.33
2234,2.53
2235,2.75
2236,2.94
2237,3.04
2238,2.96
2239,2.75
2240,2.48
2241,2.22
2242,2.04
2243,1.95
2244,2.01
2245,2.21
2246,2.53
2247,2.86
2248,3.20
2249,3.49
2250,3.72
2251,3.89
2252,4.08
2253,4.30
2254,4.61
2255,4.99
2256,5.51
2257,6.13
2258,6.84
2259,7.48
2260,8.08
2261,8.54
2262,8.93
2263,9.25
2264,9.55
2265,9.83
2266,10.17
2267,10.54
2268,11.00
2269,11.51
2270,12.05
2271,12.49
2272,12.79
2273,12.87
2274,12.79
2275,12.60
2276,12.40
2277,12.24
2278,12.16
2279,12.22
2280,12.47
2281,12.83
2282,13.19
2283,13.47
2284,13.63
2285,13.66
2286,13.53
2287,13.29
2288,13.01
2289,12.80
2290,12.67
2291,12.62
2292,12.60
2293,12.58
2294,12.49
2295,12.26
2296,11.83
2297,11.23
2298,10.52
2299,9.83
2300,9.19
2301,8.74
2302,8.43
2303,8.26
2304,8.11
2305,7.95
2306,7.73
2307,7.42
2308,7.00
2309,6.56
2310,6.20
2311,6.01
2312,5.97
2313,6.07
2314,6.34
2315,6.72
2316,7.14
2317,7.47
2318,7.72
2319,7.88
2320,8.01
2321,8.13
2322,8.29
2323,8.51
2324,8.84
2325,9.26
2326,9.79
2327,10.35
2328,10.89
2329,11.38
2330,11.83
2331,12.21
2332,12.47
2333,12.58
2334,12.65
2335,12.70
2336,12.74
2337,12.76
2338,12.85
2339,13.02
2340,13.28
2341,13.55
2342,13.79
2343,13.91
2344,13.89
2345,13.70
2346,13.37
2347,12.95
2348,12.50
2349,12.03
2350,11.63
2351,11.36
2352,11.27
2353,11.33
2354,11.48
2355,11.68
2356,11.87
2357,12.05
2358,12.18
2359,12.27
2360,12.35
2361,12.44
2362,12.50
2363,12.50
2364,12.47
2365,12.40
2366,12.32
2367,12.27
2368,12.25
2369,12.28
2370,12.34
2371,12.43
2372,12.56
2373,12.71
2374,12.85
2375,12.95
2376,12.98
2377,12.95
2378,12.83
2379,12.63
2380,12.34
2381,12.05
2382,11.73
2383,11.39
2384,10.98
2385,10.54
2386,10.03
2387,9.54
2388,9.02
2389,8.50
2390,7.90
2391,7.32
2392,6.74
2393,6.21
2394,5.68
2395,5.16
2396,4.61
2397,4.12
2398,3.60
2399,3.12
2400,2.58
2401,2.11
2402,1.59
2403,1.14
2404,0.60
2405,0.08
2406,-0.56
2407,-1.24
2408,-2.16
2409,-3.23
2410,-4.53
2411,-5.85
2412,-7.25
2413,-8.54
2414,-9.77
2415,-10.82
2416,-11.81
2417,-12.66
2418,-13.53
2419,-14.37
2420,-15.34
2421,-16.31
2422,-17.38
2423,-18.38
2424,-19.36
2425,-20.20
2426,-20.96
2427,-21.57
2428,-22.14
2429,-22.58
2430,-22.98
2431,-23.32
2432,-23.75
2433,-24.22
2434,-24.70
2435,-25.12
2436,-25.52
2437,-25.86
2438,-26.13
2439,-26.26
2440,-26.25
2441,-26.16
2442,-25.99
2443,-25.76
2444,-25.44
2445,-25.10
2446,-24.67
2447,-24.19
2448,-23.55
2449,-22.81
2450,-21.93
2451,-21.06
2452,-20.16
2453,-19.34
2454,-18.52
2455,-17.80
2456,-17.13
2457,-16.56
2458,-15.90
2459,-15.20
2460,-14.33
2461,-13.42
2462,-12.37
2463,-11.30
2464,-10.15
2465,-9.09
2466,-8.06
2467,-7.16
2468,-6.32
2469,-5.59
2470,-4.87
2471,-4.24
2472,-3.63
2473,-3.14
2474,-2.69
2475,-2.33
2476,-1.96
2477,-1.65
2478,-1.30
2479,-0.94
2480,-0.46
2481,0.09
2482,0.75
2483,1.40
2484,2.02
2485,2.55
2486,3.04
2487,3.44
2488,3.78
2489,4.01
2490,4.16
2491,4.22
2492,4.20
2493,4.09
2494,3.85
2495,3.52
2496,3.14
2497,2.79
2498,2.44
2499,2.06
2500,1.60
2501,1.13
2502,0.64
2503,0.18
2504,-0.31
2505,-0.79
2506,-1.26
2507,-1.67
2508,-2.02
2509,-2.28
2510,-2.48
2511,-2.62
2512,-2.74
2513,-2.86
2514,-3.00
2515,-3.14
2516,-3.30
2517,-3.49
2518,-3.68
2519,-3.83
2520,-3.89
2521,-3.83
2522,-3.65
2523,-3.38
2524,-3.04
2525,-2.65
2526,-2.26
2527,-1.93
2528,-1.67
2529,-1.53
2530,-1.50
2531,-1.57
2532,-1.65
2533,-1.69
2534,-1.64
2535,-1.56
2536,-1.46
2537,-1.37
2538,-1.25
2539,-1.11
2540,-0.94
2541,-0.76
2542,-0.55
2543,-0.29
2544,0.05
2545,0.43
2546,0.87
2547,1.31
2548,1.77
2549,2.21
2550,2.66
2551,3.04
2552,3.36
2553,3.55
2554,3.65
2555,3.65
2556,3.58
2557,3.46
2558,3.32
2559,3.21
2560,3.23
2561,3.39
2562,3.63
2563,3.88
2564,4.07
2565,4.16
2566,4.15
2567,4.06
2568,3.89
2569,3.69
2570,3.44
2571,3.17
2572,2.89
2573,2.62
2574,2.37
2575,2.10
2576,1.78
2577,1.42
2578,1.09
2579,0.85
2580,0.68
2581,0.61
2582,0.60
2583,0.66
2584,0.76
2585,0.92
2586,1.10
2587,1.26
2588,1.34
2589,1.31
2590,1.16
2591,0.90
2592,0.49
2593,-0.05
2594,-0.70
2595,-1.36
2596,-1.96
2597,-2.45
2598,-2.80
2599,-3.00
2600,-3.05
2601,-3.01
2602,-2.99
2603,-2.98
2604,-2.97
2605,-2.92
2606,-2.83
2607,-2.68
2608,-2.42
2609,-2.06
2610,-1.66
2611,-1.26
2612,-0.90
2613,-0.63
2614,-0.47
2615,-0.45
2616,-0.50
2617,-0.60
2618,-0.70
2619,-0.79
2620,-0.88
2621,-0.97
2622,-1.07
2623,-1.18
2624,-1.33
2625,-1.48
2626,-1.63
2627,-1.77
2628,-1.94
2629,-2.11
2630,-2.29
2631,-2.47
2632,-2.66
2633,-2.87
2634,-3.10
2635,-3.33
2636,-3.59
2637,-3.83
2638,-4.02
2639,-4.11
2640,-4.09
2641,-3.94
2642,-3.66
2643,-3.21
2644,-2.59
2645,-1.85
2646,-1.05
2647,-0.34
2648,0.31
2649,0.76
2650,1.06
2651,1.17
2652,1.21
2653,1.24
2654,1.39
2655,1.65
2656,2.08
2657,2.61
2658,3.20
2659,3.73
2660,4.19
2661,4.54
2662,4.83
2663,5.05
2664,5.27
2665,5.50
2666,5.81
2667,6.13
2668,6.46
2669,6.76
2670,7.04
2671,7.30
2672,7.55
2673,7.78
2674,8.04
2675,8.31
2676,8.56
2677,8.71
2678,8.72
2679,8.61
2680,8.41
2681,8.16
2682,7.87
2683,7.58
2684,7.34
2685,7.23
2686,7.13
2687,7.01
2688,6.75
2689,6.37
2690,5.83
2691,5.18
2692,4.43
2693,3.68
2694,2.99
2695,2.46
2696,2.08
2697,1.85
2698,1.68
2699,1.53
2700,1.30
2701,1.04
2702,0.72
2703,0.40
2704,0.05
2705,-0.27
2706,-0.57
2707,-0.83
2708,-1.08
2709,-1.32
2710,-1.55
2711,-1.72
2712,-1.85
2713,-1.91
2714,-1.91
2715,-1.88
2716,-1.83
2717,-1.77
2718,-1.70
2719,-1.62
2720,-1.50
2721,-1.36
2722,-1.14
2723,-0.85
2724,-0.44
2725,-0.01
2726,0.43
2727,0.79
2728,1.09
2729,1.28
2730,1.39
2731,1.40
2732,1.46
2733,1.56
2734,1.75
2735,2.02
2736,2.41
2737,2.90
2738,3.51
2739,4.17
2740,4.87
2741,5.55
2742,6.21
2743,6.77
2744,7.23
2745,7.52
2746,7.67
2747,7.63
2748,7.45
2749,7.13
2750,6.78
2751,6.48
2752,6.28
2753,6.19
2754,6.20
2755,6.31
2756,6.42
2757,6.49
2758,6.42
2759,6.20
2760,5.77
2761,5.24
2762,4.61
2763,4.00
2764,3.40
2765,2.90
2766,2.46
2767,2.10
2768,1.70
2769,1.27
2770,0.71
2771,0.09
2772,-0.59
2773,-1.24
2774,-1.89
2775,-2.50
2776,-3.11
2777,-3.66
2778,-4.23
2779,-4.79
2780,-5.36
2781,-5.87
2782,-6.26
2783,-6.47
2784,-6.50
2785,-6.38
2786,-6.13
2787,-5.82
2788,-5.49
2789,-5.23
2790,-5.06
2791,-4.92
2792,-4.70
2793,-4.39
2794,-3.97
2795,-3.46
2796,-2.79
2797,-2.03
2798,-1.21
2799,-0.47
2800,0.22
2801,0.76
2802,1.17
2803,1.40
2804,1.55
2805,1.65
2806,1.78
2807,1.91
2808,2.12
2809,2.38
2810,2.73
2811,3.09
2812,3.41
2813,3.62
2814,3.72
2815,3.75
2816,3.72
2817,3.68
2818,3.67
2819,3.70
2820,3.78
2821,3.88
2822,3.94
2823,3.91
2824,3.79
2825,3.60
2826,3.37
2827,3.16
2828,3.01
2829,2.98
2830,3.08
2831,3.27
2832,3.49
2833,3.70
2834,3.89
2835,4.02
2836,4.12
2837,4.20
2838,4.36
2839,4.65
2840,5.09
2841,5.60
2842,6.16
2843,6.66
2844,7.10
2845,7.39
2846,7.55
2847,7.62
2848,7.71
2849,7.84
2850,8.12
2851,8.52
2852,9.11
2853,9.79
2854,10.54
2855,11.22
2856,11.82
2857,12.26
2858,12.57
2859,12.74
2860,12.82
2861,12.81
2862,12.76
2863,12.73
2864,12.75
2865,12.81
2866,12.88
2867,12.88
2868,12.80
2869,12.67
2870,12.54
2871,12.42
2872,12.31
2873,12.26
2874,12.30
2875,12.42
2876,12.53
2877,12.61
2878,12.62
2879,12.57
2880,12.35
2881,11.99
2882,11.47
2883,10.93
2884,10.37
2885,9.86
2886,9.32
2887,8.77
2888,8.10
2889,7.35
2890,6.44
2891,5.50
2892,4.46
2893,3.44
2894,2.40
2895,1.46
2896,0.54
2897,-0.30
2898,-1.14
2899,-1.89
2900,-2.66
2901,-3.36
2902,-4.04
2903,-4.59
2904,-5.04
2905,-5.32
2906,-5.54
2907,-5.70
2908,-5.87
2909,-6.05
2910,-6.26
2911,-6.45
2912,-6.63
2913,-6.75
2914,-6.86
2915,-6.97
2916,-7.07
2917,-7.13
2918,-7.16
2919,-7.08
2920,-6.93
2921,-6.68
2922,-6.42
2923,-6.20
2924,-6.08
2925,-6.10
2926,-6.32
2927,-6.70
2928,-7.23
2929,-7.84
2930,-8.48
2931,-9.04
2932,-9.48
2933,-9.74
2934,-9.89
2935,-9.96
2936,-10.03
2937,-10.12
2938,-10.28
2939,-10.48
2940,-10.70
2941,-10.87
2942,-11.03
2943,-11.15
2944,-11.22
2945,-11.18
2946,-11.06
2947,-10.88
2948,-10.67
2949,-10.46
2950,-10.25
2951,-10.08
2952,-9.94
2953,-9.88
2954,-9.89
2955,-9.99
2956,-10.15
2957,-10.34
2958,-10.48
2959,-10.61
2960,-10.73
2961,-10.83
2962,-10.83
2963,-10.71
2964,-10.48
2965,-10.23
2966,-9.90
2967,-9.51
2968,-8.95
2969,-8.31
2970,-7.56
2971,-6.77
2972,-5.84
2973,-4.88
2974,-3.86
2975,-2.92
2976,-1.97
2977,-1.11
2978,-0.25
2979,0.50
2980,1.28
2981,2.05
2982,2.93
2983,3.80
2984,4.76
2985,5.73
2986,6.77
2987,7.74
2988,8.66
2989,9.41
2990,10.08
2991,10.57
2992,10.95
2993,11.18
2994,11.33
2995,11.44
2996,11.55
2997,11.63
2998,11.68
2999,11.66
3000,11.53
3001,11.30
3002,10.93
3003,10.46
3004,9.90
3005,9.33
3006,8.77
3007,8.31
3008,7.87
3009,7.48
3010,7.03
3011,6.53
3012,5.91
3013,5.21
3014,4.39
3015,3.59
3016,2.84
3017,2.27
3018,1.89
3019,1.75
3020,1.85
3021,2.12
3022,2.49
3023,2.85
3024,3.17
3025,3.43
3026,3.65
3027,3.82
3028,4.00
3029,4.20
3030,4.47
3031,4.80
3032,5.18
3033,5.52
3034,5.85
3035,6.13
3036,6.46
3037,6.80
3038,7.20
3039,7.64
3040,8.19
3041,8.77
3042,9.39
3043,9.95
3044,10.51
3045,10.99
3046,11.45
3047,11.83
3048,12.19
3049,12.50
3050,12.82
3051,13.10
3052,13.42
3053,13.73
3054,14.10
3055,14.47
3056,14.90
3057,15.33
3058,15.83
3059,16.35
3060,16.96
3061,17.64
3062,18.43
3063,19.26
3064,20.11
3065,20.92
3066,21.68
3067,22.28
3068,22.66
3069,22.77
3070,22.66
3071,22.38
3072,21.98
3073,21.51
3074,21.00
3075,20.55
3076,20.16
3077,19.81
3078,19.45
3079,19.05
3080,18.54
3081,17.98
3082,17.36
3083,16.78
3084,16.20
3085,15.71
3086,15.21
3087,14.73
3088,14.14
3089,13.51
3090,12.75
3091,11.97
3092,11.09
3093,10.25
3094,9.39
3095,8.64
3096,7.88
3097,7.18
3098,6.36
3099,5.49
3100,4.46
3101,3.42
3102,2.29
3103,1.21
3104,0.08
3105,-0.94
3106,-1.90
3107,-2.74
3108,-3.62
3109,-4.49
3110,-5.41
3111,-6.29
3112,-7.22
3113,-8.09
3114,-8.93
3115,-9.57
3116,-10.08
3117,-10.38
3118,-10.59
3119,-10.69
3120,-10.77
3121,-10.82
3122,-10.87
3123,-10.90
3124,-10.92
3125,-10.89
3126,-10.78
3127,-10.61
3128,-10.38
3129,-10.17
3130,-9.99
3131,-9.86
3132,-9.69
3133,-9.47
3134,-9.10
3135,-8.64
3136,-8.04
3137,-7.39
3138,-6.67
3139,-5.99
3140,-5.38
3141,-4.91
3142,-4.52
3143,-4.24
3144,-4.01
3145,-3.84
3146,-3.65
3147,-3.46
3148,-3.21
3149,-2.94
3150,-2.65
3151,-2.39
3152,-2.16
3153,-1.98
3154,-1.84
3155,-1.75
3156,-1.73
3157,-1.79
3158,-1.92
3159,-2.14
3160,-2.42
3161,-2.75
3162,-3.07
3163,-3.38
3164,-3.65
3165,-3.85
3166,-3.97
3167,-3.98
3168,-3.99
3169,-4.00
3170,-4.10
3171,-4.26
3172,-4.55
3173,-4.93
3174,-5.42
3175,-5.95
3176,-6.55
3177,-7.13
3178,-7.73
3179,-8.32
3180,-8.95
3181,-9.55
3182,-10.19
3183,-10.84
3184,-11.58
3185,-12.31
3186,-13.03
3187,-13.63
3188,-14.13
3189,-14.47
3190,-14.64
3191,-14.61
3192,-14.46
3193,-14.23
3194,-13.98
3195,-13.75
3196,-13.56
3197,-13.44
3198,-13.35
3199,-13.28
3200,-13.17
3201,-13.02
3202,-12.79
3203,-12.54
3204,-12.23
3205,-11.95
3206,-11.63
3207,-11.31
3208,-10.95
3209,-10.60
3210,-10.26
3211,-9.94
3212,-9.55
3213,-9.13
3214,-8.62
3215,-8.07
3216,-7.38
3217,-6.58
3218,-5.66
3219,-4.75
3220,-3.85
3221,-3.09
3222,-2.40
3223,-1.85
3224,-1.39
3225,-1.09
3226,-0.85
3227,-0.66
3228,-0.41
3229,-0.18
3230,0.05
3231,0.21
3232,0.39
3233,0.59
3234,0.84
3235,1.11
3236,1.40
3237,1.69
3238,1.99
3239,2.24
3240,2.37
3241,2.33
3242,2.16
3243,1.88
3244,1.57
3245,1.27
3246,1.00
3247,0.80
3248,0.63
3249,0.49
3250,0.31
3251,0.08
3252,-0.23
3253,-0.59
3254,-0.99
3255,-1.37
3256,-1.72
3257,-1.98
3258,-2.20
3259,-2.34
3260,-2.42
3261,-2.44
3262,-2.47
3263,-2.53
3264,-2.62
3265,-2.68
3266,-2.70
3267,-2.70
3268,-2.69
3269,-2.66
3270,-2.57
3271,-2.43
3272,-2.24
3273,-2.07
3274,-1.88
3275,-1.71
3276,-1.53
3277,-1.40
3278,-1.24
3279,-1.07
3280,-0.82
3281,-0.53
3282,-0.19
3283,0.19
3284,0.66
3285,1.14
3286,1.56
3287,1.85
3288,2.05
3289,2.16
3290,2.21
3291,2.17
3292,2.08
3293,1.96
3294,1.85
3295,1.75
3296,1.68
3297,1.62
3298,1.59
3299,1.62
3300,1.69
3301,1.82
3302,1.98
3303,2.16
3304,2.33
3305,2.47
3306,2.64
3307,2.81
3308,3.00
3309,3.20
3310,3.48
3311,3.83
3312,4.24
3313,4.63
3314,4.99
3315,5.25
3316,5.43
3317,5.51
3318,5.54
3319,5.58
3320,5.74
3321,6.06
3322,6.55
3323,7.12
3324,7.74
3325,8.30
3326,8.80
3327,9.14
3328,9.37
3329,9.48
3330,9.55
3331,9.62
3332,9.77
3333,9.97
3334,10.27
3335,10.65
3336,11.13
3337,11.63
3338,12.15
3339,12.60
3340,12.97
3341,13.24
3342,13.37
3343,13.34
3344,13.15
3345,12.77
3346,12.28
3347,11.74
3348,11.25
3349,10.85
3350,10.59
3351,10.47
3352,10.49
3353,10.64
3354,10.90
3355,11.27
3356,11.71
3357,12.16
3358,12.54
3359,12.82
3360,13.00
3361,13.09
3362,13.05
3363,12.87
3364,12.60
3365,12.33
3366,12.08
3367,11.85
3368,11.60
3369,11.34
3370,11.03
3371,10.66
3372,10.12
3373,9.48
3374,8.73
3375,7.98
3376,7.23
3377,6.56
3378,5.94
3379,5.45
3380,5.02
3381,4.67
3382,4.34
3383,4.09
3384,3.88
3385,3.74
3386,3.59
3387,3.49
3388,3.42
3389,3.42
3390,3.46
3391,3.52
3392,3.62
3393,3.76
3394,3.96
3395,4.20
3396,4.48
3397,4.75
3398,4.98
3399,5.16
3400,5.29
3401,5.37
3402,5.45
3403,5.52
3404,5.65
3405,5.79
3406,5.99
3407,6.22
3408,6.52
3409,6.87
3410,7.29
3411,7.73
3412,8.21
3413,8.69
3414,9.15
3415,9.54
3416,9.85
3417,10.02
3418,10.03
3419,9.88
3420,9.62
3421,9.32
3422,9.01
3423,8.74
3424,8.52
3425,8.42
3426,8.37
3427,8.35
3428,8.26
3429,8.09
3430,7.84
3431,7.55
3432,7.18
3433,6.77
3434,6.28
3435,5.79
3436,5.26
3437,4.74
3438,4.15
3439,3.58
3440,2.98
3441,2.43
3442,1.82
3443,1.26
3444,0.65
3445,0.07
3446,-0.59
3447,-1.25
3448,-1.96
3449,-2.59
3450,-3.24
3451,-3.81
3452,-4.41
3453,-4.95
3454,-5.55
3455,-6.19
3456,-6.94
3457,-7.74
3458,-8.59
3459,-9.42
3460,-10.22
3461,-10.91
3462,-11.46
3463,-11.82
3464,-11.98
3465,-11.94
3466,-11.75
3467,-11.45
3468,-11.07
3469,-10.66
3470,-10.22
3471,-9.78
3472,-9.28
3473,-8.69
3474,-7.96
3475,-7.16
3476,-6.31
3477,-5.49
3478,-4.65
3479,-3.94
3480,-3.38
3481,-3.07
3482,-2.90
3483,-2.82
3484,-2.66
3485,-2.46
3486,-2.17
3487,-1.85
3488,-1.48
3489,-1.14
3490,-0.82
3491,-0.65
3492,-0.58
3493,-0.60
3494,-0.57
3495,-0.48
3496,-0.23
3497,0.18
3498,0.79
3499,1.50
3500,2.24
3501,2.81
3502,3.21
3503,3.43
3504,3.57
3505,3.66
3506,3.83
3507,4.08
3508,4.52
3509,5.10
3510,5.86
3511,6.64
3512,7.37
3513,7.90
3514,8.22
3515,8.30
3516,8.21
3517,8.02
3518,7.83
3519,7.74
3520,7.79
3521,8.00
3522,8.33
3523,8.71
3524,9.01
3525,9.17
3526,9.11
3527,8.85
3528,8.36
3529,7.72
3530,6.91
3531,6.09
3532,5.23
3533,4.46
3534,3.65
3535,2.88
3536,1.99
3537,1.13
3538,0.20
3539,-0.72
3540,-1.81
3541,-2.94
3542,-4.20
3543,-5.40
3544,-6.65
3545,-7.80
3546,-8.98
3547,-10.03
3548,-11.05
3549,-11.92
3550,-12.72
3551,-13.37
3552,-14.02
3553,-14.56
3554,-15.08
3555,-15.54
3556,-16.06
3557,-16.57
3558,-17.14
3559,-17.62
3560,-18.10
3561,-18.53
3562,-18.98
3563,-19.36
3564,-19.67
3565,-19.90
3566,-20.11
3567,-20.28
3568,-20.43
3569,-20.55
3570,-20.69
3571,-20.87
3572,-21.05
3573,-21.16
3574,-21.20
3575,-21.17
3576,-21.09
3577,-20.94
3578,-20.71
3579,-20.42
3580,-20.09
3581,-19.77
3582,-19.39
3583,-18.98
3584,-18.52
3585,-18.09
3586,-17.64
3587,-17.21
3588,-16.69
3589,-16.14
3590,-15.51
3591,-14.83
3592,-14.06
3593,-13.28
3594,-12.44
3595,-11.64
3596,-10.86
3597,-10.22
3598,-9.71
3599,-9.44
3600,-9.28
3601,-9.25
3602,-9.19
3603,-9.14
3604,-8.91
3605,-8.49
3606,-7.75
3607,-6.84
3608,-5.79
3609,-4.81
3610,-3.89
3611,-3.14
3612,-2.50
3613,-2.01
3614,-1.55
3615,-1.11
3616,-0.57
3617,0.01
3618,0.72
3619,1.45
3620,2.19
3621,2.80
3622,3.33
3623,3.73
3624,4.10
3625,4.41
3626,4.74
3627,5.05
3628,5.44
3629,5.84
3630,6.29
3631,6.76
3632,7.31
3633,7.87
3634,8.41
3635,8.85
3636,9.21
3637,9.47
3638,9.64
3639,9.67
3640,9.57
3641,9.35
3642,9.09
3643,8.85
3644,8.67
3645,8.51
3646,8.35
3647,8.22
3648,8.11
3649,8.06
3650,8.00
3651,7.88
3652,7.68
3653,7.45
3654,7.17
3655,6.83
3656,6.36
3657,5.79
3658,5.15
3659,4.55
3660,4.02
3661,3.62
3662,3.29
3663,3.07
3664,2.88
3665,2.70
3666,2.48
3667,2.22
3668,1.91
3669,1.62
3670,1.33
3671,1.16
3672,1.14
3673,1.30
3674,1.54
3675,1.76
3676,1.88
3677,1.86
3678,1.66
3679,1.28
3680,0.82
3681,0.39
3682,0.12
3683,0.05
3684,0.20
3685,0.53
3686,1.05
3687,1.70
3688,2.41
3689,3.04
3690,3.56
3691,3.97
3692,4.34
3693,4.68
3694,5.05
3695,5.42
3696,5.87
3697,6.36
3698,6.96
3699,7.54
3700,8.13
3701,8.67
3702,9.30
3703,9.94
3704,10.60
3705,11.23
3706,11.86
3707,12.48
3708,13.08
3709,13.51
3710,13.79
3711,13.87
3712,13.82
3713,13.63
3714,13.36
3715,13.08
3716,12.92
3717,12.91
3718,13.05
3719,13.30
3720,13.61
3721,13.95
3722,14.22
3723,14.36
3724,14.30
3725,14.09
3726,13.73
3727,13.33
3728,12.83
3729,12.35
3730,11.81
3731,11.27
3732,10.61
3733,9.93
3734,9.09
3735,8.20
3736,7.10
3737,5.87
3738,4.45
3739,2.98
3740,1.40
3741,-0.12
3742,-1.62
3743,-2.90
3744,-4.10
3745,-5.13
3746,-6.16
3747,-7.12
3748,-8.16
3749,-9.16
3750,-10.26
3751,-11.32
3752,-12.39
3753,-13.30
3754,-14.07
3755,-14.62
3756,-15.05
3757,-15.31
3758,-15.53
3759,-15.66
3760,-15.82
3761,-15.99
3762,-16.17
3763,-16.28
3764,-16.35
3765,-16.34
3766,-16.28
3767,-16.18
3768,-16.11
3769,-16.06
3770,-16.10
3771,-16.23
3772,-16.43
3773,-16.67
3774,-16.90
3775,-17.09
3776,-17.19
3777,-17.20
3778,-17.05
3779,-16.79
3780,-16.43
3781,-16.03
3782,-15.62
3783,-15.27
3784,-15.01
3785,-14.84
3786,-14.66
3787,-14.47
3788,-14.24
3789,-14.05
3790,-13.80
3791,-13.54
3792,-13.24
3793,-12.99
3794,-12.73
3795,-12.51
3796,-12.24
3797,-11.89
3798,-11.41
3799,-10.85
3800,-10.22
3801,-9.63
3802,-9.07
3803,-8.64
3804,-8.29
3805,-8.07
3806,-7.89
3807,-7.76
3808,-7.60
3809,-7.43
3810,-7.19
3811,-6.94
3812,-6.64
3813,-6.38
3814,-6.11
3815,-5.85
3816,-5.56
3817,-5.26
3818,-4.97
3819,-4.70
3820,-4.46
3821,-4.29
3822,-4.19
3823,-4.16
3824,-4.18
3825,-4.28
3826,-4.43
3827,-4.61
3828,-4.78
3829,-4.93
3830,-5.07
3831,-5.18
3832,-5.27
3833,-5.33
3834,-5.39
3835,-5.40
3836,-5.42
3837,-5.44
3838,-5.54
3839,-5.74
3840,-6.08
3841,-6.46
3842,-6.87
3843,-7.25
3844,-7.65
3845,-8.03
3846,-8.37
3847,-8.66
3848,-8.98
3849,-9.32
3850,-9.74
3851,-10.25
3852,-10.86
3853,-11.52
3854,-12.16
3855,-12.70
3856,-13.14
3857,-13.46
3858,-13.66
3859,-13.76
3860,-13.76
3861,-13.66
3862,-13.47
3863,-13.18
3864,-12.78
3865,-12.31
3866,-11.73
3867,-11.12
3868,-10.45
3869,-9.83
3870,-9.24
3871,-8.74
3872,-8.31
3873,-8.00
3874,-7.74
3875,-7.51
3876,-7.23
3877,-6.95
3878,-6.61
3879,-6.27
3880,-5.84
3881,-5.42
3882,-4.97
3883,-4.55
3884,-4.10
3885,-3.68
3886,-3.27
3887,-2.90
3888,-2.53
3889,-2.23
3890,-1.98
3891,-1.88
3892,-1.81
3893,-1.81
3894,-1.81
3895,-1.84
3896,-1.82
3897,-1.72
3898,-1.50
3899,-1.17
3900,-0.72
3901,-0.19
3902,0.40
3903,0.99
3904,1.61
3905,2.20
3906,2.74
3907,3.15
3908,3.48
3909,3.74
3910,3.99
3911,4.19
3912,4.33
3913,4.42
3914,4.52
3915,4.66
3916,4.84
3917,5.00
3918,5.09
3919,5.12
3920,5.10
3921,5.04
3922,4.93
3923,4.78
3924,4.61
3925,4.46
3926,4.35
3927,4.30
3928,4.26
3929,4.25
3930,4.20
3931,4.08
3932,3.85
3933,3.52
3934,3.14
3935,2.75
3936,2.36
3937,2.01
3938,1.70
3939,1.50
3940,1.35
3941,1.24
3942,1.11
3943,0.94
3944,0.68
3945,0.35
3946,-0.03
3947,-0.43
3948,-0.77
3949,-1.01
3950,-1.13
3951,-1.14
3952,-1.01
3953,-0.74
3954,-0.31
3955,0.19
3956,0.71
3957,1.18
3958,1.65
3959,2.04
3960,2.41
3961,2.73
3962,3.09
3963,3.49
3964,3.97
3965,4.47
3966,5.03
3967,5.59
3968,6.16
3969,6.63
3970,7.00
3971,7.22
3972,7.39
3973,7.48
3974,7.58
3975,7.68
3976,7.92
3977,8.26
3978,8.73
3979,9.19
3980,9.71
3981,10.20
3982,10.72
3983,11.21
3984,11.75
3985,12.34
3986,13.02
3987,13.74
3988,14.44
3989,15.07
3990,15.62
3991,15.99
3992,16.18
3993,16.14
3994,15.96
3995,15.68
3996,15.36
3997,15.06
3998,14.84
3999,14.69
4000,14.56
4001,14.47
4002,14.34
4003,14.17
4004,13.85
4005,13.44
4006,12.98
4007,12.54
4008,12.07
4009,11.60
4010,11.12
4011,10.68
4012,10.25
4013,9.88
4014,9.50
4015,9.19
4016,8.90
4017,8.67
4018,8.45
4019,8.23
4020,7.93
4021,7.57
4022,7.03
4023,6.40
4024,5.60
4025,4.75
4026,3.82
4027,2.98
4028,2.15
4029,1.43
4030,0.70
4031,0.02
4032,-0.74
4033,-1.46
4034,-2.24
4035,-2.99
4036,-3.84
4037,-4.70
4038,-5.69
4039,-6.68
4040,-7.74
4041,-8.74
4042,-9.75
4043,-10.64
4044,-11.46
4045,-12.10
4046,-12.66
4047,-13.08
4048,-13.47
4049,-13.77
4050,-14.11
4051,-14.44
4052,-14.85
4053,-15.26
4054,-15.70
4055,-16.11
4056,-16.52
4057,-16.90
4058,-17.27
4059,-17.59
4060,-17.89
4061,-18.12
4062,-18.30
4063,-18.39
4064,-18.39
4065,-18.28
4066,-18.00
4067,-17.59
4068,-17.07
4069,-16.53
4070,-15.98
4071,-15.47
4072,-15.03
4073,-14.68
4074,-14.37
4075,-14.15
4076,-13.95
4077,-13.82
4078,-13.68
4079,-13.51
4080,-13.25
4081,-12.96
4082,-12.63
4083,-12.28
4084,-11.87
4085,-11.44
4086,-10.96
4087,-10.49
4088,-9.99
4089,-9.50
4090,-8.96
4091,-8.43
4092,-7.86
4093,-7.32
4094,-6.74
4095,-6.20
4096,-5.58
4097,-5.00
4098,-4.43
4099,-3.94
4100,-3.43
4101,-2.98
4102,-2.54
4103,-2.17
4104,-1.74
4105,-1.28
4106,-0.77
4107,-0.27
4108,0.29
4109,0.88
4110,1.50
4111,2.06
4112,2.57
4113,2.98
4114,3.30
4115,3.50
4116,3.62
4117,3.59
4118,3.52
4119,3.43
4120,3.37
4121,3.39
4122,3.53
4123,3.79
4124,4.20
4125,4.68
4126,5.17
4127,5.55
4128,5.82
4129,5.93
4130,5.91
4131,5.78
4132,5.61
4133,5.45
4134,5.40
4135,5.49
4136,5.70
4137,5.95
4138,6.16
4139,6.26
4140,6.17
4141,5.88
4142,5.37
4143,4.71
4144,3.95
4145,3.17
4146,2.43
4147,1.77
4148,1.20
4149,0.74
4150,0.34
4151,-0.02
4152,-0.37
4153,-0.69
4154,-0.98
4155,-1.15
4156,-1.22
4157,-1.18
4158,-1.11
4159,-1.01
4160,-0.95
4161,-0.92
4162,-0.91
4163,-0.91
4164,-0.89
4165,-0.88
4166,-0.82
4167,-0.69
4168,-0.47
4169,-0.21
4170,0.04
4171,0.21
4172,0.37
4173,0.56
4174,0.83
4175,1.13
4176,1.47
4177,1.82
4178,2.19
4179,2.52
4180,2.82
4181,3.08
4182,3.30
4183,3.48
4184,3.64
4185,3.75
4186,3.82
4187,3.85
4188,3.88
4189,3.87
4190,3.81
4191,3.69
4192,3.55
4193,3.43
4194,3.36
4195,3.35
4196,3.43
4197,3.58
4198,3.78
4199,4.00
4200,4.18
4201,4.30
4202,4.34
4203,4.28
4204,4.11
4205,3.91
4206,3.71
4207,3.56
4208,3.44
4209,3.36
4210,3.31
4211,3.29
4212,3.23
4213,3.11
4214,2.91
4215,2.65
4216,2.30
4217,1.92
4218,1.51
4219,1.12
4220,0.76
4221,0.47
4222,0.23
4223,0.03
4224,-0.18
4225,-0.37
4226,-0.58
4227,-0.76
4228,-0.92
4229,-1.04
4230,-1.11
4231,-1.08
4232,-0.93
4233,-0.69
4234,-0.40
4235,-0.08
4236,0.21
4237,0.45
4238,0.58
4239,0.58
4240,0.47
4241,0.28
4242,0.04
4243,-0.23
4244,-0.50
4245,-0.72
4246,-0.93
4247,-1.08
4248,-1.17
4249,-1.20
4250,-1.20
4251,-1.17
4252,-1.11
4253,-1.01
4254,-0.92
4255,-0.85
4256,-0.84
4257,-0.87
4258,-0.95
4259,-1.05
4260,-1.09
4261,-1.07
4262,-0.98
4263,-0.85
4264,-0.69
4265,-0.56
4266,-0.44
4267,-0.39
4268,-0.34
4269,-0.30
4270,-0.20
4271,-0.05
4272,0.18
4273,0.44
4274,0.73
4275,0.99
4276,1.26
4277,1.52
4278,1.79
4279,2.01
4280,2.24
4281,2.47
4282,2.76
4283,3.05
4284,3.33
4285,3.53
4286,3.70
4287,3.81
4288,3.89
4289,3.91
4290,3.92
4291,3.94
4292,4.01
4293,4.10
4294,4.22
4295,4.39
4296,4.68
4297,5.03
4298,5.42
4299,5.78
4300,6.10
4301,6.36
4302,6.55
4303,6.65
4304,6.66
4305,6.58
4306,6.44
4307,6.23
4308,6.01
4309,5.80
4310,5.60
4311,5.41
4312,5.29
4313,5.24
4314,5.32
4315,5.50
4316,5.80
4317,6.19
4318,6.65
4319,7.13
4320,7.60
4321,8.02
4322,8.35
4323,8.60
4324,8.77
4325,8.87
4326,8.95
4327,9.05
4328,9.17
4329,9.26
4330,9.26
4331,9.15
4332,8.91
4333,8.59
4334,8.13
4335,7.58
4336,6.90
4337,6.22
4338,5.54
4339,4.95
4340,4.44
4341,4.10
4342,3.88
4343,3.78
4344,3.66
4345,3.56
4346,3.46
4347,3.34
4348,3.14
4349,2.88
4350,2.60
4351,2.36
4352,2.11
4353,1.90
4354,1.69
4355,1.51
4356,1.29
4357,1.01
4358,0.64
4359,0.23
4360,-0.24
4361,-0.69
4362,-1.11
4363,-1.40
4364,-1.57
4365,-1.68
4366,-1.81
4367,-1.98
4368,-2.22
4369,-2.51
4370,-2.88
4371,-3.27
4372,-3.62
4373,-3.80
4374,-3.79
4375,-3.61
4376,-3.29
4377,-2.89
4378,-2.47
4379,-2.08
4380,-1.75
4381,-1.49
4382,-1.27
4383,-1.04
4384,-0.75
4385,-0.39
4386,0.03
4387,0.47
4388,0.96
4389,1.44
4390,1.87
4391,2.17
4392,2.31
4393,2.24
4394,1.99
4395,1.60
4396,1.13
4397,0.65
4398,0.19
4399,-0.19
4400,-0.53
4401,-0.79
4402,-1.01
4403,-1.21
4404,-1.43
4405,-1.69
4406,-2.02
4407,-2.34
4408,-2.65
4409,-2.85
4410,-2.98
4411,-3.02
4412,-3.06
4413,-3.11
4414,-3.25
4415,-3.50
4416,-3.92
4417,-4.46
4418,-5.09
4419,-5.71
4420,-6.29
4421,-6.74
4422,-7.03
4423,-7.18
4424,-7.24
4425,-7.26
4426,-7.29
4427,-7.34
4428,-7.45
4429,-7.61
4430,-7.77
4431,-7.90
4432,-7.90
4433,-7.77
4434,-7.45
4435,-7.00
4436,-6.42
4437,-5.79
4438,-5.20
4439,-4.75
4440,-4.46
4441,-4.32
4442,-4.26
4443,-4.22
4444,-4.08
4445,-3.82
4446,-3.42
4447,-2.93
4448,-2.41
4449,-1.99
4450,-1.77
4451,-1.83
4452,-2.14
4453,-2.65
4454,-3.20
4455,-3.65
4456,-3.89
4457,-3.87
4458,-3.59
4459,-3.17
4460,-2.66
4461,-2.17
4462,-1.80
4463,-1.62
4464,-1.66
4465,-1.88
4466,-2.18
4467,-2.46
4468,-2.62
4469,-2.59
4470,-2.36
4471,-1.94
4472,-1.39
4473,-0.84
4474,-0.40
4475,-0.16
4476,-0.13
4477,-0.25
4478,-0.47
4479,-0.72
4480,-0.95
4481,-1.06
4482,-1.02
4483,-0.88
4484,-0.70
4485,-0.61
4486,-0.61
4487,-0.74
4488,-0.98
4489,-1.33
4490,-1.67
4491,-1.95
4492,-2.07
4493,-2.01
4494,-1.77
4495,-1.39
4496,-0.89
4497,-0.31
4498,0.31
4499,0.93
4500,1.53
4501,2.07
4502,2.53
4503,2.88
4504,3.14
4505,3.32
4506,3.44
4507,3.49
4508,3.49
4509,3.43
4510,3.36
4511,3.29
4512,3.24
4513,3.18
4514,3.10
4515,3.04
4516,3.02
4517,3.06
4518,3.10
4519,3.10
4520,3.05
4521,2.97
4522,2.83
4523,2.62
4524,2.32
4525,1.96
4526,1.63
4527,1.38
4528,1.24
4529,1.23
4530,1.28
4531,1.38
4532,1.45
4533,1.46
4534,1.37
4535,1.20
4536,0.91
4537,0.56
4538,0.14
4539,-0.24
4540,-0.60
4541,-0.92
4542,-1.26
4543,-1.57
4544,-1.86
4545,-2.13
4546,-2.43
4547,-2.71
4548,-2.98
4549,-3.18
4550,-3.37
4551,-3.53
4552,-3.72
4553,-3.90
4554,-4.10
4555,-4.30
4556,-4.52
4557,-4.69
4558,-4.84
4559,-4.92
4560,-4.96
4561,-4.96
4562,-4.93
4563,-4.88
4564,-4.78
4565,-4.67
4566,-4.49
4567,-4.26
4568,-3.95
4569,-3.60
4570,-3.19
4571,-2.78
4572,-2.35
4573,-1.95
4574,-1.53
4575,-1.16
4576,-0.77
4577,-0.40
4578,0.03
4579,0.47
4580,0.95
4581,1.42
4582,1.88
4583,2.25
4584,2.59
4585,2.84
4586,3.07
4587,3.27
4588,3.49
4589,3.75
4590,4.12
4591,4.55
4592,5.07
4593,5.58
4594,6.05
4595,6.41
4596,6.61
4597,6.65
4598,6.51
4599,6.23
4600,5.87
4601,5.48
4602,5.10
4603,4.81
4604,4.59
4605,4.42
4606,4.25
4607,4.08
4608,3.88
4609,3.64
4610,3.33
4611,2.98
4612,2.59
4613,2.22
4614,1.82
4615,1.42
4616,0.93
4617,0.43
4618,-0.08
4619,-0.54
4620,-1.04
4621,-1.50
4622,-1.96
4623,-2.33
4624,-2.68
4625,-3.00
4626,-3.35
4627,-3.65
4628,-3.94
4629,-4.17
4630,-4.43
4631,-4.62
4632,-4.74
4633,-4.71
4634,-4.59
4635,-4.43
4636,-4.25
4637,-4.10
4638,-4.05
4639,-4.11
4640,-4.23
4641,-4.33
4642,-4.36
4643,-4.31
4644,-4.12
4645,-3.79
4646,-3.35
4647,-2.89
4648,-2.49
4649,-2.23
4650,-2.08
4651,-2.04
4652,-1.99
4653,-1.86
4654,-1.56
4655,-1.12
4656,-0.52
4657,0.16
4658,0.92
4659,1.65
4660,2.34
4661,2.90
4662,3.37
4663,3.71
4664,3.99
4665,4.25
4666,4.58
4667,4.92
4668,5.28
4669,5.58
4670,5.84
4671,6.01
4672,6.06
4673,5.94
4674,5.71
4675,5.43
4676,5.16
4677,4.91
4678,4.75
4679,4.68
4680,4.74
4681,4.86
4682,5.00
4683,5.12
4684,5.23
4685,5.36
4686,5.46
4687,5.53
4688,5.52
4689,5.48
4690,5.36
4691,5.15
4692,4.81
4693,4.36
4694,3.85
4695,3.35
4696,2.84
4697,2.33
4698,1.80
4699,1.31
4700,0.84
4701,0.40
4702,-0.10
4703,-0.59
4704,-1.08
4705,-1.49
4706,-1.88
4707,-2.25
4708,-2.64
4709,-2.98
4710,-3.33
4711,-3.65
4712,-3.96
4713,-4.20
4714,-4.36
4715,-4.40
4716,-4.40
4717,-4.39
4718,-4.46
4719,-4.60
4720,-4.82
4721,-5.10
4722,-5.41
4723,-5.71
4724,-5.94
4725,-6.06
4726,-6.09
4727,-6.03
4728,-5.85
4729,-5.58
4730,-5.26
4731,-4.98
4732,-4.81
4733,-4.75
4734,-4.81
4735,-4.96
4736,-5.17
4737,-5.42
4738,-5.64
4739,-5.80
4740,-5.84
4741,-5.76
4742,-5.55
4743,-5.24
4744,-4.91
4745,-4.61
4746,-4.36
4747,-4.19
4748,-4.06
4749,-3.94
4750,-3.81
4751,-3.66
4752,-3.48
4753,-3.31
4754,-3.14
4755,-2.96
4756,-2.75
4757,-2.51
4758,-2.27
4759,-2.03
4760,-1.79
4761,-1.55
4762,-1.34
4763,-1.21
4764,-1.19
4765,-1.26
4766,-1.37
4767,-1.53
4768,-1.70
4769,-1.88
4770,-2.04
4771,-2.17
4772,-2.26
4773,-2.34
4774,-2.43
4775,-2.51
4776,-2.61
4777,-2.72
4778,-2.88
4779,-3.05
4780,-3.26
4781,-3.49
4782,-3.80
4783,-4.15
4784,-4.54
4785,-4.93
4786,-5.30
4787,-5.63
4788,-5.91
4789,-6.10
4790,-6.26
4791,-6.37
4792,-6.51
4793,-6.65
4794,-6.79
4795,-6.88
4796,-6.93
4797,-6.89
4798,-6.75
4799,-6.55
4800,-6.33
4801,-6.17
4802,-6.09
4803,-6.09
4804,-6.20
4805,-6.38
4806,-6.58
4807,-6.72
4808,-6.84
4809,-6.90
4810,-7.01
4811,-7.16
4812,-7.39
4813,-7.71
4814,-8.15
4815,-8.69
4816,-9.31
4817,-9.93
4818,-10.54
4819,-11.08
4820,-11.55
4821,-11.89
4822,-12.12
4823,-12.24
4824,-12.30
4825,-12.30
4826,-12.20
4827,-11.99
4828,-11.72
4829,-11.41
4830,-11.09
4831,-10.73
4832,-10.35
4833,-9.93
4834,-9.46
4835,-8.96
4836,-8.42
4837,-7.88
4838,-7.35
4839,-6.92
4840,-6.56
4841,-6.33
4842,-6.17
4843,-6.11
4844,-6.05
4845,-6.04
4846,-5.99
4847,-5.92
4848,-5.74
4849,-5.52
4850,-5.20
4851,-4.80
4852,-4.23
4853,-3.56
4854,-2.77
4855,-1.97
4856,-1.14
4857,-0.37
4858,0.34
4859,0.92
4860,1.45
4861,1.94
4862,2.48
4863,3.07
4864,3.73
4865,4.38
4866,5.01
4867,5.52
4868,5.86
4869,5.94
4870,5.80
4871,5.48
4872,5.12
4873,4.74
4874,4.42
4875,4.17
4876,4.08
4877,4.14
4878,4.32
4879,4.56
4880,4.84
4881,5.14
4882,5.42
4883,5.67
4884,5.85
4885,5.97
4886,6.02
4887,6.03
4888,5.99
4889,5.94
4890,5.84
4891,5.75
4892,5.68
4893,5.63
4894,5.52
4895,5.29
4896,4.91
4897,4.46
4898,3.94
4899,3.39
4900,2.78
4901,2.22
4902,1.72
4903,1.37
4904,1.13
4905,0.98
4906,0.90
4907,0.88
4908,0.88
4909,0.88
4910,0.85
4911,0.82
4912,0.82
4913,0.87
4914,1.01
4915,1.28
4916,1.72
4917,2.27
4918,2.94
4919,3.63
4920,4.32
4921,4.89
4922,5.27
4923,5.42
4924,5.36
4925,5.17
4926,4.93
4927,4.65
4928,4.39
4929,4.15
4930,3.94
4931,3.78
4932,3.59
4933,3.35
4934,3.05
4935,2.78
4936,2.59
4937,2.53
4938,2.56
4939,2.67
4940,2.81
4941,2.93
4942,2.95
4943,2.84
4944,2.62
4945,2.33
4946,2.04
4947,1.80
4948,1.70
4949,1.79
4950,2.03
4951,2.38
4952,2.75
4953,3.08
4954,3.27
4955,3.28
4956,3.10
4957,2.76
4958,2.30
4959,1.79
4960,1.32
4961,0.93
4962,0.60
4963,0.30
4964,0.07
4965,-0.09
4966,-0.18
4967,-0.20
4968,-0.18
4969,-0.11
4970,-0.03
4971,0.08
4972,0.27
4973,0.53
4974,0.89
4975,1.27
4976,1.69
4977,2.11
4978,2.51
4979,2.78
4980,2.88
4981,2.81
4982,2.65
4983,2.43
4984,2.20
4985,2.01
4986,1.95
4987,2.04
4988,2.24
4989,2.49
4990,2.73
4991,2.89
4992,2.89
4993,2.75
4994,2.46
4995,2.11
4996,1.70
4997,1.35
4998,1.07
4999,0.90
5000,0.76
5001,0.60
5002,0.33
5003,-0.05
5004,-0.60
5005,-1.24
5006,-1.98
5007,-2.72
5008,-3.48
5009,-4.15
5010,-4.75
5011,-5.24
5012,-5.72
5013,-6.19
5014,-6.68
5015,-7.12
5016,-7.53
5017,-7.84
5018,-8.09
5019,-8.24
5020,-8.31
5021,-8.27
5022,-8.15
5023,-7.97
5024,-7.77
5025,-7.60
5026,-7.41
5027,-7.22
5028,-6.97
5029,-6.68
5030,-6.29
5031,-5.82
5032,-5.25
5033,-4.62
5034,-3.95
5035,-3.30
5036,-2.68
5037,-2.17
5038,-1.80
5039,-1.63
5040,-1.64
5041,-1.81
5042,-2.00
5043,-2.14
5044,-2.12
5045,-1.95
5046,-1.60
5047,-1.14
5048,-0.62
5049,-0.12
5050,0.31
5051,0.60
5052,0.79
5053,0.86
5054,0.89
5055,0.92
5056,0.99
5057,1.14
5058,1.38
5059,1.64
5060,1.91
5061,2.11
5062,2.27
5063,2.32
5064,2.27
5065,2.13
5066,2.04
5067,2.06
5068,2.22
5069,2.49
5070,2.88
5071,3.35
5072,3.88
5073,4.39
5074,4.86
5075,5.25
5076,5.53
5077,5.68
5078,5.71
5079,5.68
5080,5.62
5081,5.52
5082,5.39
5083,5.21
5084,5.04
5085,4.91
5086,4.83
5087,4.78
5088,4.71
5089,4.63
5090,4.49
5091,4.29
5092,3.99
5093,3.63
5094,3.23
5095,2.85
5096,2.51
5097,2.24
5098,2.02
5099,1.92
5100,1.91
5101,1.95
5102,1.92
5103,1.85
5104,1.75
5105,1.68
5106,1.61
5107,1.53
5108,1.43
5109,1.37
5110,1.35
5111,1.36
5112,1.37
5113,1.34
5114,1.26
5115,1.14
5116,0.99
5117,0.83
5118,0.69
5119,0.57
5120,0.51
5121,0.50
5122,0.55
5123,0.68
5124,0.89
5125,1.12
5126,1.33
5127,1.47
5128,1.61
5129,1.74
5130,1.88
5131,2.00
5132,2.19
5133,2.44
5134,2.75
5135,3.08
5136,3.46
5137,3.88
5138,4.30
5139,4.65
5140,4.95
5141,5.22
5142,5.49
5143,5.72
5144,5.89
5145,6.01
5146,6.13
5147,6.28
5148,6.41
5149,6.48
5150,6.47
5151,6.37
5152,6.19
5153,5.91
5154,5.61
5155,5.33
5156,5.16
5157,5.13
5158,5.25
5159,5.50
5160,5.80
5161,6.02
5162,6.06
5163,5.87
5164,5.52
5165,5.07
5166,4.57
5167,4.16
5168,3.86
5169,3.75
5170,3.75
5171,3.81
5172,3.78
5173,3.61
5174,3.23
5175,2.67
5176,1.94
5177,1.15
5178,0.40
5179,-0.23
5180,-0.70
5181,-0.99
5182,-1.15
5183,-1.20
5184,-1.19
5185,-1.16
5186,-1.14
5187,-1.14
5188,-1.14
5189,-1.12
5190,-1.05
5191,-0.89
5192,-0.65
5193,-0.33
5194,0.08
5195,0.56
5196,1.10
5197,1.60
5198,2.03
5199,2.33
5200,2.55
5201,2.72
5202,2.85
5203,2.94
5204,3.01
5205,3.09
5206,3.23
5207,3.38
5208,3.50
5209,3.56
5210,3.58
5211,3.58
5212,3.56
5213,3.49
5214,3.38
5215,3.23
5216,3.09
5217,2.97
5218,2.84
5219,2.69
5220,2.53
5221,2.41
5222,2.35
5223,2.35
5224,2.41
5225,2.49
5226,2.59
5227,2.72
5228,2.88
5229,3.08
5230,3.33
5231,3.60
5232,3.88
5233,4.14
5234,4.39
5235,4.63
5236,4.88
5237,5.13
5238,5.41
5239,5.65
5240,5.87
5241,6.04
5242,6.17
5243,6.26
5244,6.33
5245,6.41
5246,6.53
5247,6.68
5248,6.89
5249,7.15
5250,7.46
5251,7.80
5252,8.13
5253,8.37
5254,8.46
5255,8.39
5256,8.24
5257,8.12
5258,8.08
5259,8.11
5260,8.19
5261,8.27
5262,8.36
5263,8.43
5264,8.41
5265,8.26
5266,8.00
5267,7.68
5268,7.41
5269,7.26
5270,7.26
5271,7.39
5272,7.58
5273,7.80
5274,8.02
5275,8.22
5276,8.40
5277,8.58
5278,8.79
5279,9.03
5280,9.26
5281,9.48
5282,9.67
5283,9.80
5284,9.79
5285,9.65
5286,9.37
5287,9.01
5288,8.58
5289,8.11
5290,7.59
5291,7.06
5292,6.47
5293,5.82
5294,5.10
5295,4.36
5296,3.59
5297,2.85
5298,2.11
5299,1.48
5300,0.89
5301,0.40
5302,-0.07
5303,-0.50
5304,-0.95
5305,-1.38
5306,-1.86
5307,-2.33
5308,-2.79
5309,-3.14
5310,-3.39
5311,-3.49
5312,-3.53
5313,-3.52
5314,-3.52
5315,-3.54
5316,-3.64
5317,-3.78
5318,-3.96
5319,-4.11
5320,-4.22
5321,-4.25
5322,-4.19
5323,-4.04
5324,-3.81
5325,-3.55
5326,-3.27
5327,-3.01
5328,-2.70
5329,-2.36
5330,-1.95
5331,-1.54
5332,-1.08
5333,-0.59
5334,-0.04
5335,0.50
5336,1.03
5337,1.53
5338,2.04
5339,2.53
5340,3.04
5341,3.49
5342,3.97
5343,4.38
5344,4.76
5345,5.07
5346,5.39
5347,5.73
5348,6.18
5349,6.68
5350,7.23
5351,7.74
5352,8.19
5353,8.51
5354,8.70
5355,8.69
5356,8.52
5357,8.25
5358,7.94
5359,7.65
5360,7.45
5361,7.33
5362,7.32
5363,7.39
5364,7.45
5365,7.52
5366,7.59
5367,7.69
5368,7.76
5369,7.79
5370,7.77
5371,7.75
5372,7.70
5373,7.59
5374,7.35
5375,6.97
5376,6.45
5377,5.81
5378,5.07
5379,4.30
5380,3.56
5381,2.93
5382,2.43
5383,2.11
5384,1.97
5385,2.01
5386,2.14
5387,2.29
5388,2.40
5389,2.46
5390,2.48
5391,2.45
5392,2.37
5393,2.32
5394,2.33
5395,2.47
5396,2.75
5397,3.15
5398,3.63
5399,4.07
5400,4.39
5401,4.55
5402,4.59
5403,4.52
5404,4.35
5405,4.14
5406,3.98
5407,3.94
5408,4.01
5409,4.14
5410,4.30
5411,4.46
5412,4.52
5413,4.47
5414,4.30
5415,4.11
5416,3.97
5417,3.94
5418,4.05
5419,4.26
5420,4.52
5421,4.72
5422,4.85
5423,4.88
5424,4.84
5425,4.75
5426,4.62
5427,4.57
5428,4.65
5429,4.88
5430,5.21
5431,5.53
5432,5.74
5433,5.78
5434,5.58
5435,5.19
5436,4.65
5437,4.07
5438,3.53
5439,3.12
5440,2.84
5441,2.67
5442,2.56
5443,2.47
5444,2.39
5445,2.27
5446,2.08
5447,1.85
5448,1.61
5449,1.46
5450,1.38
5451,1.42
5452,1.56
5453,1.77
5454,1.99
5455,2.17
5456,2.31
5457,2.37
5458,2.33
5459,2.21
5460,2.06
5461,1.93
5462,1.85
5463,1.86
5464,1.95
5465,2.07
5466,2.19
5467,2.28
5468,2.33
5469,2.33
5470,2.25
5471,2.08
5472,1.80
5473,1.50
5474,1.22
5475,0.98
5476,0.77
5477,0.60
5478,0.46
5479,0.40
5480,0.40
5481,0.47
5482,0.60
5483,0.78
5484,0.99
5485,1.21
5486,1.37
5487,1.43
5488,1.37
5489,1.15
5490,0.84
5491,0.51
5492,0.21
5493,-0.03
5494,-0.21
5495,-0.32
5496,-0.38
5497,-0.41
5498,-0.47
5499,-0.61
5500,-0.85
5501,-1.16
5502,-1.47
5503,-1.71
5504,-1.85
5505,-1.84
5506,-1.71
5507,-1.46
5508,-1.17
5509,-0.89
5510,-0.70
5511,-0.64
5512,-0.72
5513,-0.90
5514,-1.14
5515,-1.39
5516,-1.56
5517,-1.63
5518,-1.56
5519,-1.41
5520,-1.24
5521,-1.12
5522,-1.05
5523,-1.02
5524,-1.01
5525,-1.00
5526,-0.89
5527,-0.66
5528,-0.27
5529,0.20
5530,0.73
5531,1.24
5532,1.70
5533,2.05
5534,2.29
5535,2.42
5536,2.56
5537,2.76
5538,3.04
5539,3.38
5540,3.75
5541,4.07
5542,4.33
5543,4.43
5544,4.45
5545,4.40
5546,4.40
5547,4.48
5548,4.68
5549,4.98
5550,5.39
5551,5.83
5552,6.26
5553,6.58
5554,6.82
5555,6.94
5556,6.95
5557,6.88
5558,6.80
5559,6.73
5560,6.71
5561,6.74
5562,6.81
5563,6.91
5564,7.01
5565,7.07
5566,7.05
5567,6.97
5568,6.83
5569,6.68
5570,6.50
5571,6.31
5572,6.05
5573,5.77
5574,5.40
5575,4.97
5576,4.40
5577,3.76
5578,3.01
5579,2.24
5580,1.43
5581,0.69
5582,0.05
5583,-0.45
5584,-0.88
5585,-1.21
5586,-1.53
5587,-1.82
5588,-2.17
5589,-2.54
5590,-2.97
5591,-3.35
5592,-3.67
5593,-3.84
5594,-3.85
5595,-3.69
5596,-3.46
5597,-3.21
5598,-3.01
5599,-2.88
5600,-2.88
5601,-3.00
5602,-3.21
5603,-3.43
5604,-3.56
5605,-3.57
5606,-3.43
5607,-3.20
5608,-2.87
5609,-2.54
5610,-2.26
5611,-2.08
5612,-1.99
5613,-1.98
5614,-1.95
5615,-1.94
5616,-1.86
5617,-1.70
5618,-1.38
5619,-0.92
5620,-0.39
5621,0.08
5622,0.45
5623,0.69
5624,0.82
5625,0.84
5626,0.78
5627,0.67
5628,0.66
5629,0.80
5630,1.11
5631,1.51
5632,1.93
5633,2.30
5634,2.56
5635,2.66
5636,2.63
5637,2.50
5638,2.37
5639,2.27
5640,2.25
5641,2.31
5642,2.47
5643,2.67
5644,2.89
5645,3.11
5646,3.33
5647,3.53
5648,3.71
5649,3.86
5650,3.98
5651,4.08
5652,4.09
5653,3.97
5654,3.73
5655,3.40
5656,3.01
5657,2.59
5658,2.17
5659,1.79
5660,1.43
5661,1.11
5662,0.75
5663,0.34
5664,-0.13
5665,-0.60
5666,-1.10
5667,-1.56
5668,-2.01
5669,-2.40
5670,-2.73
5671,-2.96
5672,-3.12
5673,-3.20
5674,-3.26
5675,-3.26
5676,-3.19
5677,-3.04
5678,-2.82
5679,-2.55
5680,-2.24
5681,-1.88
5682,-1.46
5683,-0.98
5684,-0.47
5685,0.06
5686,0.65
5687,1.26
5688,1.95
5689,2.62
5690,3.32
5691,3.94
5692,4.48
5693,4.85
5694,5.09
5695,5.17
5696,5.17
5697,5.12
5698,5.12
5699,5.20
5700,5.42
5701,5.68
5702,5.94
5703,6.09
5704,6.13
5705,6.02
5706,5.81
5707,5.52
5708,5.29
5709,5.17
5710,5.19
5711,5.33
5712,5.62
5713,5.97
5714,6.36
5715,6.68
5716,6.97
5717,7.23
5718,7.51
5719,7.90
5720,8.43
5721,9.09
5722,9.82
5723,10.48
5724,10.99
5725,11.31
5726,11.48
5727,11.50
5728,11.43
5729,11.28
5730,11.20
5731,11.22
5732,11.41
5733,11.70
5734,12.07
5735,12.44
5736,12.76
5737,13.02
5738,13.22
5739,13.34
5740,13.41
5741,13.44
5742,13.44
5743,13.47
5744,13.54
5745,13.63
5746,13.70
5747,13.76
5748,13.85
5749,13.96
5750,14.11
5751,14.22
5752,14.31
5753,14.33
5754,14.31
5755,14.25
5756,14.18
5757,14.12
5758,14.10
5759,14.13
5760,14.21
5761,14.34
5762,14.46
5763,14.53
5764,14.45
5765,14.23
5766,13.85
5767,13.44
5768,12.98
5769,12.51
5770,11.98
5771,11.44
5772,10.80
5773,10.11
5774,9.22
5775,8.19
5776,7.00
5777,5.85
5778,4.73
5779,3.77
5780,2.90
5781,2.20
5782,1.59
5783,1.11
5784,0.63
5785,0.18
5786,-0.32
5787,-0.82
5788,-1.34
5789,-1.78
5790,-2.13
5791,-2.38
5792,-2.66
5793,-2.94
5794,-3.24
5795,-3.52
5796,-3.78
5797,-4.02
5798,-4.19
5799,-4.23
5800,-4.10
5801,-3.82
5802,-3.43
5803,-2.94
5804,-2.40
5805,-1.87
5806,-1.40
5807,-1.02
5808,-0.66
5809,-0.31
5810,0.04
5811,0.33
5812,0.62
5813,0.89
5814,1.25
5815,1.63
5816,2.07
5817,2.53
5818,3.05
5819,3.58
5820,4.13
5821,4.62
5822,5.10
5823,5.54
5824,6.00
5825,6.43
5826,6.87
5827,7.29
5828,7.71
5829,8.06
5830,8.31
5831,8.40
5832,8.35
5833,8.16
5834,7.86
5835,7.47
5836,7.04
5837,6.65
5838,6.30
5839,5.99
5840,5.65
5841,5.30
5842,4.91
5843,4.50
5844,4.05
5845,3.62
5846,3.15
5847,2.69
5848,2.17
5849,1.65
5850,1.08
5851,0.53
5852,-0.08
5853,-0.69
5854,-1.36
5855,-1.97
5856,-2.55
5857,-3.04
5858,-3.54
5859,-4.00
5860,-4.46
5861,-4.84
5862,-5.19
5863,-5.48
5864,-5.73
5865,-5.90
5866,-6.00
5867,-6.03
5868,-6.00
5869,-5.91
5870,-5.76
5871,-5.62
5872,-5.49
5873,-5.37
5874,-5.21
5875,-5.01
5876,-4.77
5877,-4.53
5878,-4.26
5879,-3.97
5880,-3.64
5881,-3.28
5882,-2.91
5883,-2.56
5884,-2.20
5885,-1.88
5886,-1.58
5887,-1.35
5888,-1.17
5889,-1.06
5890,-0.98
5891,-0.92
5892,-0.89
5893,-0.86
5894,-0.81
5895,-0.72
5896,-0.57
5897,-0.37
5898,-0.11
5899,0.15
5900,0.41
5901,0.60
5902,0.69
5903,0.67
5904,0.61
5905,0.54
5906,0.53
5907,0.63
5908,0.82
5909,1.13
5910,1.48
5911,1.82
5912,2.07
5913,2.16
5914,2.06
5915,1.75
5916,1.30
5917,0.82
5918,0.40
5919,0.13
5920,0.02
5921,0.06
5922,0.20
5923,0.41
5924,0.64
5925,0.82
5926,0.92
5927,0.89
5928,0.73
5929,0.53
5930,0.31
5931,0.09
5932,-0.11
5933,-0.28
5934,-0.42
5935,-0.51
5936,-0.56
5937,-0.59
5938,-0.60
5939,-0.63
5940,-0.71
5941,-0.82
5942,-0.98
5943,-1.16
5944,-1.35
5945,-1.50
5946,-1.59
5947,-1.61
5948,-1.63
5949,-1.67
5950,-1.82
5951,-2.05
5952,-2.40
5953,-2.85
5954,-3.36
5955,-3.84
5956,-4.23
5957,-4.49
5958,-4.68
5959,-4.78
5960,-4.86
5961,-4.94
5962,-5.08
5963,-5.28
5964,-5.57
5965,-5.89
5966,-6.27
5967,-6.65
5968,-7.01
5969,-7.28
5970,-7.47
5971,-7.58
5972,-7.66
5973,-7.71
5974,-7.77
5975,-7.82
5976,-7.90
5977,-8.02
5978,-8.18
5979,-8.36
5980,-8.54
5981,-8.69
5982,-8.81
5983,-8.90
5984,-8.95
5985,-8.98
5986,-9.00
5987,-9.04
5988,-9.05
5989,-9.03
5990,-8.96
5991,-8.87
5992,-8.75
5993,-8.58
5994,-8.32
5995,-8.00
5996,-7.61
5997,-7.23
5998,-6.85
5999,-6.55
6000,-6.25
6001,-6.00
6002,-5.68
6003,-5.29
6004,-4.69
6005,-3.97
6006,-3.07
6007,-2.06
6008,-0.90
6009,0.25
6010,1.34
6011,2.18
6012,2.88
6013,3.40
6014,3.84
6015,4.17
6016,4.53
6017,4.93
6018,5.46
6019,6.05
6020,6.67
6021,7.21
6022,7.67
6023,7.95
6024,8.06
6025,7.99
6026,7.84
6027,7.68
6028,7.55
6029,7.48
6030,7.52
6031,7.64
6032,7.80
6033,7.91
6034,7.87
6035,7.66
6036,7.29
6037,6.84
6038,6.34
6039,5.87
6040,5.44
6041,5.15
6042,4.99
6043,4.94
6044,4.91
6045,4.84
6046,4.65
6047,4.32
6048,3.85
6049,3.34
6050,2.86
6051,2.51
6052,2.26
6053,2.15
6054,2.15
6055,2.22
6056,2.25
6057,2.20
6058,2.06
6059,1.85
6060,1.56
6061,1.24
6062,0.92
6063,0.68
6064,0.50
6065,0.36
6066,0.23
6067,0.08
6068,-0.12
6069,-0.37
6070,-0.59
6071,-0.74
6072,-0.83
6073,-0.85
6074,-0.82
6075,-0.72
6076,-0.60
6077,-0.48
6078,-0.38
6079,-0.29
6080,-0.20
6081,-0.08
6082,0.08
6083,0.30
6084,0.53
6085,0.71
6086,0.79
6087,0.73
6088,0.54
6089,0.26
6090,-0.04
6091,-0.33
6092,-0.52
6093,-0.56
6094,-0.36
6095,0.03
6096,0.54
6097,1.08
6098,1.64
6099,2.14
6100,2.57
6101,2.86
6102,3.07
6103,3.20
6104,3.33
6105,3.44
6106,3.57
6107,3.72
6108,3.92
6109,4.13
6110,4.29
6111,4.38
6112,4.42
6113,4.41
6114,4.35
6115,4.23
6116,4.11
6117,4.04
6118,4.05
6119,4.15
6120,4.33
6121,4.52
6122,4.71
6123,4.84
6124,4.91
6125,4.90
6126,4.82
6127,4.72
6128,4.71
6129,4.81
6130,5.04
6131,5.34
6132,5.72
6133,6.13
6134,6.55
6135,6.90
6136,7.23
6137,7.51
6138,7.81
6139,8.10
6140,8.44
6141,8.79
6142,9.16
6143,9.49
6144,9.75
6145,9.83
6146,9.73
6147,9.45
6148,9.11
6149,8.77
6150,8.48
6151,8.27
6152,8.18
6153,8.24
6154,8.42
6155,8.61
6156,8.72
6157,8.71
6158,8.51
6159,8.23
6160,7.80
6161,7.31
6162,6.71
6163,6.10
6164,5.45
6165,4.80
6166,4.09
6167,3.39
6168,2.69
6169,2.04
6170,1.37
6171,0.75
6172,0.10
6173,-0.48
6174,-1.11
6175,-1.70
6176,-2.36
6177,-3.00
6178,-3.72
6179,-4.40
6180,-5.11
6181,-5.72
6182,-6.32
6183,-6.86
6184,-7.43
6185,-7.99
6186,-8.58
6187,-9.17
6188,-9.77
6189,-10.30
6190,-10.78
6191,-11.16
6192,-11.48
6193,-11.72
6194,-11.87
6195,-11.89
6196,-11.77
6197,-11.51
6198,-11.12
6199,-10.67
6200,-10.19
6201,-9.75
6202,-9.35
6203,-9.03
6204,-8.74
6205,-8.47
6206,-8.09
6207,-7.67
6208,-7.10
6209,-6.50
6210,-5.77
6211,-4.98
6212,-4.07
6213,-3.17
6214,-2.23
6215,-1.35
6216,-0.44
6217,0.40
6218,1.21
6219,1.85
6220,2.42
6221,2.84
6222,3.19
6223,3.42
6224,3.62
6225,3.74
6226,3.87
6227,4.01
6228,4.25
6229,4.54
6230,4.84
6231,5.04
6232,5.17
6233,5.23
6234,5.23
6235,5.19
6236,5.15
6237,5.18
6238,5.33
6239,5.57
6240,5.84
6241,6.09
6242,6.26
6243,6.33
6244,6.23
6245,5.97
6246,5.55
6247,5.10
6248,4.68
6249,4.33
6250,4.00
6251,3.69
6252,3.33
6253,2.96
6254,2.47
6255,1.90
6256,1.17
6257,0.37
6258,-0.53
6259,-1.40
6260,-2.28
6261,-3.11
6262,-3.94
6263,-4.74
6264,-5.50
6265,-6.14
6266,-6.74
6267,-7.23
6268,-7.67
6269,-7.95
6270,-8.11
6271,-8.16
6272,-8.19
6273,-8.20
6274,-8.22
6275,-8.23
6276,-8.22
6277,-8.19
6278,-8.10
6279,-7.93
6280,-7.66
6281,-7.32
6282,-6.98
6283,-6.68
6284,-6.45
6285,-6.29
6286,-6.12
6287,-5.94
6288,-5.71
6289,-5.46
6290,-5.15
6291,-4.79
6292,-4.35
6293,-3.91
6294,-3.52
6295,-3.20
6296,-2.86
6297,-2.52
6298,-2.16
6299,-1.87
6300,-1.59
6301,-1.33
6302,-1.05
6303,-0.83
6304,-0.63
6305,-0.47
6306,-0.25
6307,-0.02
6308,0.22
6309,0.43
6310,0.65
6311,0.84
6312,1.02
6313,1.14
6314,1.24
6315,1.34
6316,1.51
6317,1.72
6318,1.96
6319,2.23
6320,2.56
6321,2.94
6322,3.36
6323,3.78
6324,4.19
6325,4.54
6326,4.84
6327,5.01
6328,5.07
6329,5.00
6330,4.86
6331,4.71
6332,4.60
6333,4.54
6334,4.49
6335,4.44
6336,4.37
6337,4.26
6338,4.02
6339,3.63
6340,3.12
6341,2.58
6342,2.06
6343,1.64
6344,1.34
6345,1.16
6346,1.10
6347,1.14
6348,1.24
6349,1.35
6350,1.45
6351,1.55
6352,1.65
6353,1.76
6354,1.89
6355,2.06
6356,2.34
6357,2.72
6358,3.19
6359,3.67
6360,4.17
6361,4.68
6362,5.17
6363,5.58
6364,5.90
6365,6.07
6366,6.16
6367,6.14
6368,6.07
6369,6.01
6370,6.03
6371,6.11
6372,6.23
6373,6.32
6374,6.42
6375,6.46
6376,6.43
6377,6.32
6378,6.17
6379,6.04
6380,5.94
6381,5.89
6382,5.88
6383,5.92
6384,5.93
6385,5.87
6386,5.75
6387,5.61
6388,5.46
6389,5.30
6390,5.16
6391,5.04
6392,4.97
6393,4.94
6394,4.91
6395,4.90
6396,4.87
6397,4.84
6398,4.76
6399,4.68
6400,4.61
6401,4.55
6402,4.45
6403,4.25
6404,3.94
6405,3.59
6406,3.18
6407,2.76
6408,2.33
6409,1.98
6410,1.73
6411,1.61
6412,1.57
6413,1.62
6414,1.73
6415,1.90
6416,2.08
6417,2.24
6418,2.39
6419,2.53
6420,2.66
6421,2.77
6422,2.94
6423,3.20
6424,3.55
6425,3.91
6426,4.30
6427,4.68
6428,5.06
6429,5.43
6430,5.74
6431,5.95
6432,6.01
6433,5.97
6434,5.81
6435,5.58
6436,5.20
6437,4.71
6438,4.09
6439,3.40
6440,2.61
6441,1.80
6442,0.96
6443,0.18
6444,-0.56
6445,-1.20
6446,-1.76
6447,-2.23
6448,-2.69
6449,-3.11
6450,-3.57
6451,-4.01
6452,-4.49
6453,-4.98
6454,-5.48
6455,-5.92
6456,-6.36
6457,-6.73
6458,-7.04
6459,-7.25
6460,-7.41
6461,-7.55
6462,-7.69
6463,-7.81
6464,-7.93
6465,-8.03
6466,-8.16
6467,-8.28
6468,-8.41
6469,-8.49
6470,-8.50
6471,-8.44
6472,-8.35
6473,-8.26
6474,-8.16
6475,-8.03
6476,-7.93
6477,-7.90
6478,-7.95
6479,-8.02
6480,-8.03
6481,-8.01
6482,-7.97
6483,-7.90
6484,-7.80
6485,-7.66
6486,-7.48
6487,-7.31
6488,-7.09
6489,-6.84
6490,-6.52
6491,-6.16
6492,-5.72
6493,-5.23
6494,-4.68
6495,-4.18
6496,-3.69
6497,-3.23
6498,-2.72
6499,-2.16
6500,-1.53
6501,-0.89
6502,-0.20
6503,0.45
6504,1.05
6505,1.53
6506,1.89
6507,2.11
6508,2.27
6509,2.38
6510,2.51
6511,2.68
6512,2.93
6513,3.23
6514,3.55
6515,3.78
6516,3.91
6517,3.91
6518,3.80
6519,3.59
6520,3.28
6521,2.95
6522,2.67
6523,2.46
6524,2.28
6525,2.14
6526,2.04
6527,1.96
6528,1.82
6529,1.59
6530,1.23
6531,0.79
6532,0.26
6533,-0.27
6534,-0.81
6535,-1.28
6536,-1.70
6537,-2.04
6538,-2.37
6539,-2.69
6540,-3.05
6541,-3.40
6542,-3.75
6543,-4.07
6544,-4.39
6545,-4.65
6546,-4.87
6547,-5.04
6548,-5.23
6549,-5.43
6550,-5.65
6551,-5.87
6552,-6.05
6553,-6.14
6554,-6.07
6555,-5.81
6556,-5.36
6557,-4.81
6558,-4.24
6559,-3.77
6560,-3.43
6561,-3.29
6562,-3.27
6563,-3.36
6564,-3.43
6565,-3.41
6566,-3.20
6567,-2.83
6568,-2.27
6569,-1.66
6570,-0.98
6571,-0.37
6572,0.21
6573,0.66
6574,1.09
6575,1.45
6576,1.86
6577,2.33
6578,2.93
6579,3.60
6580,4.36
6581,5.12
6582,5.96
6583,6.78
6584,7.55
6585,8.14
6586,8.59
6587,8.90
6588,9.15
6589,9.28
6590,9.38
6591,9.45
6592,9.60
6593,9.79
6594,10.06
6595,10.31
6596,10.63
6597,10.97
6598,11.41
6599,11.88
6600,12.37
6601,12.82
6602,13.21
6603,13.53
6604,13.84
6605,14.08
6606,14.30
6607,14.47
6608,14.71
6609,15.00
6610,15.33
6611,15.66
6612,16.01
6613,16.34
6614,16.56
6615,16.63
6616,16.54
6617,16.33
6618,16.00
6619,15.59
6620,15.10
6621,14.62
6622,14.18
6623,13.79
6624,13.44
6625,13.11
6626,12.80
6627,12.56
6628,12.42
6629,12.37
6630,12.34
6631,12.34
6632,12.41
6633,12.55
6634,12.76
6635,13.00
6636,13.27
6637,13.57
6638,13.89
6639,14.22
6640,14.54
6641,14.87
6642,15.24
6643,15.63
6644,16.01
6645,16.34
6646,16.62
6647,16.82
6648,16.94
6649,16.98
6650,16.91
6651,16.75
6652,16.54
6653,16.33
6654,16.17
6655,16.08
6656,16.05
6657,16.08
6658,16.15
6659,16.24
6660,16.33
6661,16.40
6662,16.43
6663,16.43
6664,16.39
6665,16.37
6666,16.37
6667,16.40
6668,16.41
6669,16.42
6670,16.44
6671,16.50
6672,16.54
6673,16.52
6674,16.43
6675,16.33
6676,16.27
6677,16.24
6678,16.22
6679,16.23
6680,16.27
6681,16.33
6682,16.36
6683,16.27
6684,16.03
6685,15.67
6686,15.24
6687,14.79
6688,14.35
6689,14.03
6690,13.85
6691,13.86
6692,13.97
6693,14.14
6694,14.30
6695,14.43
6696,14.43
6697,14.33
6698,14.08
6699,13.76
6700,13.34
6701,12.85
6702,12.23
6703,11.53
6704,10.70
6705,9.84
6706,8.96
6707,8.16
6708,7.41
6709,6.84
6710,6.39
6711,6.13
6712,5.85
6713,5.56
6714,5.13
6715,4.64
6716,4.01
6717,3.35
6718,2.60
6719,1.96
6720,1.42
6721,1.06
6722,0.70
6723,0.36
6724,-0.14
6725,-0.78
6726,-1.66
6727,-2.72
6728,-3.98
6729,-5.22
6730,-6.43
6731,-7.45
6732,-8.36
6733,-9.11
6734,-9.83
6735,-10.49
6736,-11.21
6737,-11.93
6738,-12.76
6739,-13.58
6740,-14.43
6741,-15.18
6742,-15.91
6743,-16.56
6744,-17.15
6745,-17.59
6746,-17.88
6747,-17.95
6748,-17.88
6749,-17.66
6750,-17.34
6751,-16.91
6752,-16.44
6753,-16.02
6754,-15.73
6755,-15.62
6756,-15.61
6757,-15.70
6758,-15.77
6759,-15.79
6760,-15.62
6761,-15.29
6762,-14.71
6763,-13.98
6764,-13.04
6765,-12.05
6766,-10.99
6767,-9.99
6768,-8.96
6769,-7.91
6770,-6.74
6771,-5.58
6772,-4.33
6773,-3.13
6774,-1.88
6775,-0.72
6776,0.47
6777,1.53
6778,2.60
6779,3.56
6780,4.54
6781,5.46
6782,6.45
6783,7.38
6784,8.32
6785,9.17
6786,10.00
6787,10.73
6788,11.39
6789,11.89
6790,12.26
6791,12.45
6792,12.53
6793,12.45
6794,12.29
6795,12.08
6796,11.87
6797,11.68
6798,11.52
6799,11.38
6800,11.24
6801,11.12
6802,11.00
6803,10.86
6804,10.66
6805,10.42
6806,10.16
6807,9.96
6808,9.80
6809,9.73
6810,9.67
6811,9.62
6812,9.54
6813,9.41
6814,9.24
6815,9.01
6816,8.71
6817,8.34
6818,7.95
6819,7.63
6820,7.39
6821,7.26
6822,7.13
6823,7.03
6824,6.90
6825,6.77
6826,6.51
6827,6.14
6828,5.62
6829,5.02
6830,4.36
6831,3.71
6832,3.08
6833,2.53
6834,1.98
6835,1.48
6836,1.02
6837,0.64
6838,0.27
6839,-0.04
6840,-0.31
6841,-0.45
6842,-0.50
6843,-0.45
6844,-0.37
6845,-0.31
6846,-0.35
6847,-0.52
6848,-0.83
6849,-1.23
6850,-1.66
6851,-2.04
6852,-2.37
6853,-2.60
6854,-2.77
6855,-2.85
6856,-2.87
6857,-2.87
6858,-2.89
6859,-2.94
6860,-3.02
6861,-3.09
6862,-3.13
6863,-3.16
6864,-3.17
6865,-3.15
6866,-3.04
6867,-2.85
6868,-2.53
6869,-2.11
6870,-1.56
6871,-0.98
6872,-0.37
6873,0.17
6874,0.63
6875,0.98
6876,1.24
6877,1.44
6878,1.65
6879,1.84
6880,2.05
6881,2.22
6882,2.40
6883,2.57
6884,2.76
6885,2.96
6886,3.21
6887,3.49
6888,3.85
6889,4.24
6890,4.67
6891,5.07
6892,5.46
6893,5.78
6894,6.08
6895,6.34
6896,6.61
6897,6.87
6898,7.16
6899,7.45
6900,7.76
6901,8.00
6902,8.16
6903,8.24
6904,8.27
6905,8.27
6906,8.25
6907,8.22
6908,8.19
6909,8.18
6910,8.11
6911,7.97
6912,7.71
6913,7.42
6914,7.09
6915,6.80
6916,6.52
6917,6.26
6918,5.97
6919,5.62
6920,5.16
6921,4.64
6922,4.01
6923,3.33
6924,2.59
6925,1.88
6926,1.22
6927,0.72
6928,0.36
6929,0.13
6930,-0.02
6931,-0.06
6932,-0.07
6933,-0.07
6934,-0.10
6935,-0.15
6936,-0.23
6937,-0.32
6938,-0.46
6939,-0.64
6940,-0.80
6941,-0.89
6942,-0.78
6943,-0.49
6944,0.02
6945,0.66
6946,1.48
6947,2.33
6948,3.22
6949,4.01
6950,4.74
6951,5.36
6952,5.92
6953,6.38
6954,6.81
6955,7.17
6956,7.60
6957,8.03
6958,8.51
6959,8.94
6960,9.38
6961,9.77
6962,10.23
6963,10.73
6964,11.29
6965,11.84
6966,12.41
6967,12.97
6968,13.57
6969,14.13
6970,14.62
6971,14.94
6972,15.14
6973,15.22
6974,15.24
6975,15.17
6976,15.02
6977,14.82
6978,14.61
6979,14.43
6980,14.25
6981,14.09
6982,13.90
6983,13.67
6984,13.29
6985,12.80
6986,12.19
6987,11.54
6988,10.80
6989,10.03
6990,9.26
6991,8.62
6992,8.06
6993,7.60
6994,7.13
6995,6.71
6996,6.26
6997,5.89
6998,5.52
6999,5.22
7000,4.89
7001,4.61
7002,4.33
7003,4.10
7004,3.85
7005,3.60
7006,3.27
7007,2.87
7008,2.33
7009,1.73
7010,1.13
7011,0.63
7012,0.21
7013,-0.08
7014,-0.27
7015,-0.39
7016,-0.47
7017,-0.51
7018,-0.56
7019,-0.61
7020,-0.75
7021,-0.92
7022,-1.11
7023,-1.25
7024,-1.40
7025,-1.56
7026,-1.78
7027,-1.98
7028,-2.21
7029,-2.43
7030,-2.69
7031,-2.96
7032,-3.25
7033,-3.50
7034,-3.75
7035,-3.98
7036,-4.25
7037,-4.51
7038,-4.78
7039,-5.05
7040,-5.35
7041,-5.66
7042,-6.00
7043,-6.30
7044,-6.55
7045,-6.73
7046,-6.81
7047,-6.82
7048,-6.76
7049,-6.64
7050,-6.46
7051,-6.25
7052,-6.03
7053,-5.83
7054,-5.62
7055,-5.42
7056,-5.19
7057,-4.96
7058,-4.69
7059,-4.41
7060,-4.04
7061,-3.63
7062,-3.17
7063,-2.76
7064,-2.39
7065,-2.07
7066,-1.75
7067,-1.43
7068,-1.07
7069,-0.69
7070,-0.25
7071,0.18
7072,0.64
7073,1.05
7074,1.41
7075,1.67
7076,1.85
7077,1.97
7078,2.07
7079,2.15
7080,2.24
7081,2.33
7082,2.44
7083,2.49
7084,2.45
7085,2.30
7086,2.12
7087,1.97
7088,1.84
7089,1.76
7090,1.72
7091,1.77
7092,1.80
7093,1.76
7094,1.53
7095,1.13
7096,0.48
7097,-0.37
7098,-1.44
7099,-2.57
7100,-3.70
7101,-4.68
7102,-5.53
7103,-6.20
7104,-6.74
7105,-7.17
7106,-7.62
7107,-8.07
7108,-8.62
7109,-9.20
7110,-9.88
7111,-10.56
7112,-11.22
7113,-11.71
7114,-12.08
7115,-12.29
7116,-12.48
7117,-12.64
7118,-12.83
7119,-13.01
7120,-13.21
7121,-13.41
7122,-13.62
7123,-13.74
7124,-13.73
7125,-13.58
7126,-13.31
7127,-13.00
7128,-12.71
7129,-12.47
7130,-12.31
7131,-12.22
7132,-12.18
7133,-12.18
7134,-12.21
7135,-12.24
7136,-12.25
7137,-12.25
7138,-12.30
7139,-12.37
7140,-12.47
7141,-12.60
7142,-12.80
7143,-13.08
7144,-13.44
7145,-13.79
7146,-14.20
7147,-14.64
7148,-15.12
7149,-15.56
7150,-15.96
7151,-16.29
7152,-16.56
7153,-16.78
7154,-16.92
7155,-17.04
7156,-17.15
7157,-17.24
7158,-17.27
7159,-17.19
7160,-16.98
7161,-16.65
7162,-16.17
7163,-15.58
7164,-14.92
7165,-14.30
7166,-13.69
7167,-13.14
7168,-12.60
7169,-12.15
7170,-11.68
7171,-11.20
7172,-10.54
7173,-9.74
7174,-8.68
7175,-7.52
7176,-6.26
7177,-5.09
7178,-4.01
7179,-3.16
7180,-2.50
7181,-2.11
7182,-1.85
7183,-1.69
7184,-1.49
7185,-1.27
7186,-0.98
7187,-0.66
7188,-0.27
7189,0.08
7190,0.33
7191,0.39
7192,0.32
7193,-0.81
7194,-0.82
7195,1.50
7196,2.25
7197,-3.66
7198,-8.96
7199,3.04
7200,20.07
