1,-35.40
2,-50.00
3,-47.80
4,-13.48
5,26.61
6,49.58
7,50.00
8,44.20
9,41.01
10,42.77
11,44.95
12,45.56
13,44.45
14,41.20
15,36.30
16,33.35
17,34.24
18,37.23
19,37.94
20,34.51
21,29.35
22,26.02
23,26.06
24,27.50
25,27.78
26,25.87
27,23.23
28,21.37
29,20.94
30,21.09
31,20.95
32,20.04
33,18.84
34,17.73
35,16.96
36,16.31
37,15.72
38,15.11
39,14.66
40,14.28
41,14.00
42,13.65
43,13.28
44,12.83
45,12.36
46,11.83
47,11.35
48,10.89
49,10.57
50,10.31
51,10.15
52,9.99
53,9.83
54,9.62
55,9.40
56,9.16
57,8.94
58,8.72
59,8.54
60,8.38
61,8.26
62,8.12
63,7.93
64,7.65
65,7.35
66,7.09
67,6.95
68,6.87
69,6.80
70,6.64
71,6.41
72,6.16
73,6.01
74,5.98
75,6.02
76,5.99
77,5.86
78,5.65
79,5.48
80,5.42
81,5.49
82,5.57
83,5.58
84,5.43
85,5.20
86,4.99
87,4.88
88,4.86
89,4.87
90,4.80
91,4.63
92,4.40
93,4.21
94,4.13
95,4.13
96,4.15
97,4.12
98,4.02
99,3.89
100,3.79
101,3.76
102,3.75
103,3.75
104,3.72
105,3.67
106,3.62
107,3.60
108,3.57
109,3.52
110,3.42
111,3.31
112,3.21
113,3.14
114,3.07
115,3.00
116,2.93
117,2.87
118,2.86
119,2.89
120,2.93
121,2.96
122,2.93
123,2.88
124,2.82
125,2.78
126,2.75
127,2.72
128,2.66
129,2.60
130,2.57
131,2.59
132,2.66
133,2.72
134,2.71
135,2.61
136,2.48
137,2.40
138,2.41
139,2.48
140,2.51
141,2.46
142,2.30
143,2.12
144,1.98
145,1.91
146,1.88
147,1.87
148,1.84
149,1.85
150,1.91
151,2.01
152,2.10
153,2.11
154,2.06
155,1.98
156,1.94
157,1.95
158,1.97
159,1.95
160,1.88
161,1.79
162,1.74
163,1.74
164,1.76
165,1.77
166,1.74
167,1.70
168,1.68
169,1.71
170,1.79
171,1.88
172,1.95
173,1.97
174,1.95
175,1.89
176,1.80
177,1.72
178,1.66
179,1.64
180,1.66
181,1.70
182,1.74
183,1.75
184,1.72
185,1.65
186,1.54
187,1.44
188,1.37
189,1.38
190,1.44
191,1.53
192,1.59
193,1.58
194,1.51
195,1.42
196,1.35
197,1.34
198,1.37
199,1.41
200,1.39
201,1.33
202,1.23
203,1.13
204,1.04
205,0.96
206,0.87
207,0.78
208,0.70
209,0.67
210,0.67
211,0.68
212,0.66
213,0.61
214,0.55
215,0.52
216,0.54
217,0.60
218,0.66
219,0.69
220,0.67
221,0.63
222,0.61
223,0.61
224,0.61
225,0.60
226,0.58
227,0.59
228,0.62
229,0.66
230,0.68
231,0.65
232,0.58
233,0.52
234,0.52
235,0.59
236,0.69
237,0.72
238,0.63
239,0.43
240,0.24
241,0.17
242,0.25
243,0.42
244,0.54
245,0.52
246,0.38
247,0.22
248,0.17
249,0.25
250,0.36
251,0.40
252,0.32
253,0.16
254,0.04
255,0.02
256,0.10
257,0.19
258,0.19
259,0.07
260,-0.09
261,-0.22
262,-0.26
263,-0.22
264,-0.17
265,-0.18
266,-0.28
267,-0.43
268,-0.57
269,-0.64
270,-0.63
271,-0.59
272,-0.60
273,-0.68
274,-0.81
275,-0.94
276,-1.00
277,-1.01
278,-1.00
279,-0.99
280,-1.00
281,-0.99
282,-0.94
283,-0.86
284,-0.81
285,-0.84
286,-0.95
287,-1.08
288,-1.16
289,-1.17
290,-1.13
291,-1.10
292,-1.10
293,-1.12
294,-1.11
295,-1.06
296,-1.00
297,-0.96
298,-0.96
299,-1.01
300,-1.08
301,-1.12
302,-1.12
303,-1.11
304,-1.10
305,-1.11
306,-1.12
307,-1.11
308,-1.07
309,-0.98
310,-0.87
311,-0.78
312,-0.75
313,-0.78
314,-0.85
315,-0.93
316,-0.98
317,-1.00
318,-1.00
319,-1.01
320,-1.02
321,-1.00
322,-0.96
323,-0.94
324,-0.97
325,-1.07
326,-1.19
327,-1.22
328,-1.12
329,-0.90
330,-0.71
331,-0.64
332,-0.72
333,-0.89
334,-1.01
335,-1.03
336,-0.95
337,-0.85
338,-0.81
339,-0.86
340,-0.94
341,-0.99
342,-1.00
343,-0.97
344,-0.96
345,-0.98
346,-1.00
347,-1.00
348,-0.94
349,-0.84
350,-0.73
351,-0.64
352,-0.60
353,-0.61
354,-0.66
355,-0.74
356,-0.81
357,-0.82
358,-0.75
359,-0.63
360,-0.50
361,-0.41
362,-0.39
363,-0.43
364,-0.48
365,-0.50
366,-0.48
367,-0.43
368,-0.40
369,-0.40
370,-0.45
371,-0.51
372,-0.56
373,-0.58
374,-0.60
375,-0.63
376,-0.69
377,-0.76
378,-0.82
379,-0.85
380,-0.83
381,-0.80
382,-0.79
383,-0.83
384,-0.93
385,-1.06
386,-1.18
387,-1.27
388,-1.30
389,-1.28
390,-1.25
391,-1.24
392,-1.28
393,-1.37
394,-1.48
395,-1.59
396,-1.69
397,-1.79
398,-1.87
399,-1.90
400,-1.86
401,-1.75
402,-1.58
403,-1.44
404,-1.39
405,-1.44
406,-1.55
407,-1.66
408,-1.71
409,-1.69
410,-1.63
411,-1.57
412,-1.52
413,-1.48
414,-1.45
415,-1.43
416,-1.45
417,-1.48
418,-1.50
419,-1.49
420,-1.45
421,-1.41
422,-1.39
423,-1.41
424,-1.48
425,-1.54
426,-1.57
427,-1.52
428,-1.42
429,-1.28
430,-1.16
431,-1.11
432,-1.13
433,-1.20
434,-1.26
435,-1.26
436,-1.18
437,-1.06
438,-0.94
439,-0.86
440,-0.84
441,-0.86
442,-0.91
443,-1.00
444,-1.11
445,-1.22
446,-1.28
447,-1.24
448,-1.13
449,-1.00
450,-0.92
451,-0.92
452,-1.00
453,-1.09
454,-1.14
455,-1.14
456,-1.11
457,-1.07
458,-1.04
459,-1.00
460,-0.95
461,-0.87
462,-0.80
463,-0.74
464,-0.74
465,-0.78
466,-0.85
467,-0.90
468,-0.92
469,-0.89
470,-0.83
471,-0.77
472,-0.76
473,-0.83
474,-0.96
475,-1.12
476,-1.23
477,-1.25
478,-1.16
479,-1.02
480,-0.88
481,-0.81
482,-0.83
483,-0.94
484,-1.05
485,-1.11
486,-1.09
487,-1.00
488,-0.90
489,-0.85
490,-0.85
491,-0.91
492,-0.96
493,-0.96
494,-0.93
495,-0.88
496,-0.85
497,-0.85
498,-0.89
499,-0.92
500,-0.93
501,-0.91
502,-0.89
503,-0.91
504,-0.97
505,-1.03
506,-1.04
507,-0.98
508,-0.86
509,-0.74
510,-0.70
511,-0.77
512,-0.92
513,-1.06
514,-1.12
515,-1.07
516,-0.96
517,-0.83
518,-0.73
519,-0.65
520,-0.58
521,-0.50
522,-0.45
523,-0.46
524,-0.53
525,-0.60
526,-0.61
527,-0.54
528,-0.45
529,-0.40
530,-0.46
531,-0.59
532,-0.70
533,-0.73
534,-0.66
535,-0.55
536,-0.50
537,-0.53
538,-0.60
539,-0.66
540,-0.63
541,-0.51
542,-0.36
543,-0.25
544,-0.23
545,-0.30
546,-0.41
547,-0.49
548,-0.50
549,-0.45
550,-0.36
551,-0.31
552,-0.31
553,-0.36
554,-0.40
555,-0.42
556,-0.39
557,-0.34
558,-0.30
559,-0.29
560,-0.29
561,-0.30
562,-0.28
563,-0.24
564,-0.19
565,-0.16
566,-0.18
567,-0.22
568,-0.28
569,-0.33
570,-0.36
571,-0.35
572,-0.33
573,-0.28
574,-0.20
575,-0.11
576,-0.01
577,0.05
578,0.06
579,0.04
580,0.05
581,0.11
582,0.24
583,0.37
584,0.43
585,0.39
586,0.28
587,0.19
588,0.20
589,0.30
590,0.39
591,0.39
592,0.26
593,0.07
594,-0.07
595,-0.10
596,-0.02
597,0.08
598,0.14
599,0.14
600,0.13
601,0.15
602,0.23
603,0.33
604,0.38
605,0.34
606,0.25
607,0.20
608,0.22
609,0.29
610,0.36
611,0.34
612,0.24
613,0.13
614,0.07
615,0.10
616,0.18
617,0.24
618,0.25
619,0.23
620,0.24
621,0.31
622,0.44
623,0.56
624,0.63
625,0.62
626,0.56
627,0.48
628,0.42
629,0.37
630,0.35
631,0.33
632,0.33
633,0.35
634,0.36
635,0.35
636,0.33
637,0.33
638,0.36
639,0.43
640,0.54
641,0.65
642,0.71
643,0.72
644,0.70
645,0.70
646,0.75
647,0.83
648,0.91
649,0.91
650,0.83
651,0.69
652,0.58
653,0.56
654,0.64
655,0.76
656,0.83
657,0.81
658,0.72
659,0.62
660,0.56
661,0.56
662,0.57
663,0.56
664,0.50
665,0.43
666,0.38
667,0.37
668,0.38
669,0.39
670,0.40
671,0.43
672,0.50
673,0.60
674,0.69
675,0.72
676,0.67
677,0.60
678,0.53
679,0.48
680,0.44
681,0.39
682,0.32
683,0.28
684,0.29
685,0.33
686,0.40
687,0.45
688,0.49
689,0.51
690,0.56
691,0.61
692,0.66
693,0.66
694,0.62
695,0.55
696,0.49
697,0.46
698,0.47
699,0.49
700,0.49
701,0.46
702,0.42
703,0.37
704,0.33
705,0.31
706,0.33
707,0.41
708,0.52
709,0.61
710,0.66
711,0.65
712,0.61
713,0.58
714,0.59
715,0.63
716,0.66
717,0.67
718,0.64
719,0.60
720,0.54
721,0.50
722,0.46
723,0.44
724,0.46
725,0.53
726,0.63
727,0.73
728,0.77
729,0.72
730,0.59
731,0.42
732,0.29
733,0.26
734,0.31
735,0.40
736,0.46
737,0.46
738,0.40
739,0.31
740,0.24
741,0.19
742,0.14
743,0.08
744,0.00
745,-0.07
746,-0.14
747,-0.20
748,-0.26
749,-0.30
750,-0.31
751,-0.29
752,-0.25
753,-0.22
754,-0.23
755,-0.29
756,-0.38
757,-0.43
758,-0.43
759,-0.41
760,-0.38
761,-0.36
762,-0.37
763,-0.38
764,-0.41
765,-0.46
766,-0.55
767,-0.65
768,-0.72
769,-0.71
770,-0.63
771,-0.55
772,-0.55
773,-0.67
774,-0.86
775,-1.03
776,-1.08
777,-1.00
778,-0.85
779,-0.73
780,-0.72
781,-0.82
782,-0.98
783,-1.12
784,-1.19
785,-1.19
786,-1.16
787,-1.14
788,-1.16
789,-1.17
790,-1.15
791,-1.07
792,-0.94
793,-0.83
794,-0.79
795,-0.83
796,-0.91
797,-0.99
798,-1.06
799,-1.13
800,-1.25
801,-1.39
802,-1.52
803,-1.54
804,-1.44
805,-1.26
806,-1.10
807,-1.05
808,-1.11
809,-1.23
810,-1.35
811,-1.42
812,-1.47
813,-1.50
814,-1.53
815,-1.53
816,-1.47
817,-1.36
818,-1.25
819,-1.19
820,-1.23
821,-1.31
822,-1.39
823,-1.43
824,-1.41
825,-1.36
826,-1.31
827,-1.27
828,-1.25
829,-1.25
830,-1.29
831,-1.37
832,-1.46
833,-1.52
834,-1.48
835,-1.37
836,-1.21
837,-1.08
838,-1.01
839,-1.00
840,-0.99
841,-0.98
842,-0.96
843,-0.95
844,-0.95
845,-0.95
846,-0.92
847,-0.84
848,-0.74
849,-0.67
850,-0.67
851,-0.75
852,-0.88
853,-1.01
854,-1.10
855,-1.13
856,-1.11
857,-1.05
858,-0.99
859,-0.93
860,-0.90
861,-0.89
862,-0.92
863,-0.97
864,-1.02
865,-1.05
866,-1.06
867,-1.02
868,-0.96
869,-0.89
870,-0.83
871,-0.81
872,-0.87
873,-1.00
874,-1.13
875,-1.19
876,-1.16
877,-1.07
878,-0.99
879,-1.04
880,-1.21
881,-1.41
882,-1.50
883,-1.38
884,-1.13
885,-0.88
886,-0.78
887,-0.85
888,-1.02
889,-1.15
890,-1.15
891,-1.05
892,-0.94
893,-0.92
894,-0.98
895,-1.07
896,-1.10
897,-1.05
898,-0.95
899,-0.85
900,-0.83
901,-0.91
902,-1.07
903,-1.22
904,-1.29
905,-1.25
906,-1.14
907,-1.02
908,-0.97
909,-1.02
910,-1.14
911,-1.28
912,-1.39
913,-1.45
914,-1.51
915,-1.59
916,-1.66
917,-1.70
918,-1.64
919,-1.52
920,-1.38
921,-1.28
922,-1.24
923,-1.25
924,-1.26
925,-1.23
926,-1.17
927,-1.11
928,-1.09
929,-1.10
930,-1.13
931,-1.16
932,-1.18
933,-1.21
934,-1.28
935,-1.34
936,-1.37
937,-1.31
938,-1.19
939,-1.06
940,-1.02
941,-1.10
942,-1.26
943,-1.41
944,-1.44
945,-1.33
946,-1.14
947,-0.95
948,-0.86
949,-0.91
950,-1.05
951,-1.22
952,-1.34
953,-1.38
954,-1.37
955,-1.35
956,-1.34
957,-1.37
958,-1.39
959,-1.38
960,-1.35
961,-1.31
962,-1.30
963,-1.32
964,-1.35
965,-1.33
966,-1.27
967,-1.19
968,-1.16
969,-1.19
970,-1.26
971,-1.31
972,-1.28
973,-1.20
974,-1.12
975,-1.12
976,-1.19
977,-1.28
978,-1.32
979,-1.29
980,-1.23
981,-1.19
982,-1.23
983,-1.33
984,-1.42
985,-1.46
986,-1.40
987,-1.28
988,-1.15
989,-1.07
990,-1.05
991,-1.05
992,-1.04
993,-1.00
994,-0.92
995,-0.84
996,-0.78
997,-0.74
998,-0.70
999,-0.65
1000,-0.58
1001,-0.54
1002,-0.53
1003,-0.54
1004,-0.52
1005,-0.44
1006,-0.31
1007,-0.19
1008,-0.12
1009,-0.13
1010,-0.17
1011,-0.19
1012,-0.16
1013,-0.10
1014,-0.05
1015,-0.05
1016,-0.09
1017,-0.13
1018,-0.12
1019,-0.03
1020,0.12
1021,0.27
1022,0.37
1023,0.38
1024,0.32
1025,0.23
1026,0.15
1027,0.10
1028,0.08
1029,0.07
1030,0.05
1031,0.04
1032,0.06
1033,0.11
1034,0.15
1035,0.15
1036,0.07
1037,-0.05
1038,-0.12
1039,-0.08
1040,0.05
1041,0.21
1042,0.29
1043,0.26
1044,0.13
1045,0.00
1046,-0.06
1047,-0.04
1048,0.02
1049,0.07
1050,0.07
1051,0.03
1052,-0.02
1053,-0.04
1054,-0.03
1055,-0.01
1056,-0.01
1057,-0.05
1058,-0.12
1059,-0.18
1060,-0.18
1061,-0.08
1062,0.09
1063,0.26
1064,0.34
1065,0.30
1066,0.16
1067,0.00
1068,-0.08
1069,-0.04
1070,0.08
1071,0.20
1072,0.23
1073,0.19
1074,0.11
1075,0.06
1076,0.05
1077,0.04
1078,-0.04
1079,-0.17
1080,-0.31
1081,-0.37
1082,-0.29
1083,-0.13
1084,0.02
1085,0.10
1086,0.08
1087,0.04
1088,0.02
1089,0.05
1090,0.11
1091,0.13
1092,0.08
1093,-0.01
1094,-0.08
1095,-0.09
1096,-0.03
1097,0.07
1098,0.15
1099,0.21
1100,0.26
1101,0.32
1102,0.40
1103,0.49
1104,0.58
1105,0.67
1106,0.75
1107,0.82
1108,0.90
1109,0.95
1110,0.97
1111,0.94
1112,0.87
1113,0.78
1114,0.69
1115,0.63
1116,0.62
1117,0.64
1118,0.69
1119,0.74
1120,0.77
1121,0.76
1122,0.73
1123,0.72
1124,0.74
1125,0.79
1126,0.87
1127,0.93
1128,0.97
1129,1.00
1130,1.05
1131,1.14
1132,1.25
1133,1.34
1134,1.38
1135,1.36
1136,1.29
1137,1.21
1138,1.15
1139,1.13
1140,1.15
1141,1.18
1142,1.21
1143,1.22
1144,1.21
1145,1.19
1146,1.16
1147,1.13
1148,1.11
1149,1.09
1150,1.05
1151,0.98
1152,0.91
1153,0.87
1154,0.85
1155,0.84
1156,0.82
1157,0.75
1158,0.65
1159,0.56
1160,0.49
1161,0.49
1162,0.55
1163,0.61
1164,0.65
1165,0.65
1166,0.61
1167,0.56
1168,0.50
1169,0.45
1170,0.39
1171,0.35
1172,0.35
1173,0.39
1174,0.44
1175,0.48
1176,0.47
1177,0.41
1178,0.34
1179,0.31
1180,0.34
1181,0.38
1182,0.40
1183,0.37
1184,0.32
1185,0.29
1186,0.33
1187,0.45
1188,0.57
1189,0.63
1190,0.60
1191,0.51
1192,0.44
1193,0.25
1194,0.33
1195,0.66
1196,0.85
1197,0.06
1198,-0.78
1199,0.59
1200,2.88
