1,36.81
2,48.25
3,50.00
4,50.00
5,50.00
6,21.19
7,-26.02
8,-49.24
9,-39.34
10,-25.56
11,-31.36
12,-45.29
13,-44.78
14,-30.61
15,-21.26
16,-25.38
17,-32.12
18,-30.58
19,-23.20
20,-20.62
21,-24.65
22,-27.59
23,-25.05
24,-21.67
25,-22.29
26,-24.54
27,-24.29
28,-22.22
29,-21.95
30,-23.86
31,-25.40
32,-24.87
33,-23.87
34,-24.26
35,-26.02
36,-26.80
37,-25.47
38,-22.79
39,-20.53
40,-18.62
41,-15.82
42,-11.18
43,-5.29
44,0.65
45,5.92
46,10.42
47,14.00
48,15.92
49,15.52
50,12.71
51,7.96
52,1.87
53,-4.93
54,-11.59
55,-17.26
56,-21.66
57,-25.25
58,-28.59
59,-31.34
60,-32.65
61,-31.88
62,-29.97
63,-28.13
64,-26.93
65,-25.36
66,-22.66
67,-19.35
68,-16.97
69,-16.22
70,-16.19
71,-15.66
72,-14.40
73,-13.42
74,-13.31
75,-13.74
76,-13.67
77,-12.75
78,-11.59
79,-11.29
80,-11.93
81,-12.65
82,-12.52
83,-11.80
84,-11.52
85,-12.34
86,-13.68
87,-14.47
88,-14.16
89,-13.17
90,-12.20
91,-11.63
92,-11.32
93,-11.09
94,-11.02
95,-11.31
96,-11.85
97,-12.18
98,-11.93
99,-11.24
100,-10.59
101,-10.33
102,-10.39
103,-10.53
104,-10.52
105,-10.31
106,-10.04
107,-9.95
108,-10.22
109,-10.63
110,-10.66
111,-9.99
112,-8.98
113,-8.53
114,-9.11
115,-10.21
116,-10.85
117,-10.61
118,-9.92
119,-9.48
120,-9.41
121,-9.37
122,-9.11
123,-8.81
124,-8.67
125,-8.63
126,-8.45
127,-8.12
128,-7.82
129,-7.65
130,-7.48
131,-7.30
132,-7.32
133,-7.62
134,-7.82
135,-7.38
136,-6.33
137,-5.53
138,-5.76
139,-6.89
140,-7.93
141,-8.09
142,-7.54
143,-7.00
144,-6.78
145,-6.57
146,-5.99
147,-5.24
148,-4.96
149,-5.54
150,-6.60
151,-7.35
152,-7.37
153,-6.88
154,-6.40
155,-6.20
156,-6.19
157,-6.30
158,-6.61
159,-7.20
160,-7.85
161,-8.22
162,-8.28
163,-8.29
164,-8.49
165,-8.69
166,-8.40
167,-7.55
168,-6.74
169,-6.84
170,-7.88
171,-8.87
172,-8.82
173,-7.81
174,-6.83
175,-6.55
176,-6.72
177,-6.74
178,-6.54
179,-6.56
180,-6.93
181,-7.22
182,-7.00
183,-6.49
184,-6.27
185,-6.56
186,-6.92
187,-6.93
188,-6.59
189,-6.12
190,-5.47
191,-4.51
192,-3.57
193,-3.39
194,-4.32
195,-5.70
196,-6.48
197,-6.35
198,-6.04
199,-6.29
200,-6.86
201,-6.86
202,-5.99
203,-5.04
204,-4.87
205,-5.31
206,-5.38
207,-4.55
208,-3.62
209,-3.83
210,-5.40
211,-7.14
212,-7.61
213,-6.51
214,-4.82
215,-3.82
216,-3.87
217,-4.47
218,-5.01
219,-5.33
220,-5.54
221,-5.59
222,-5.35
223,-4.88
224,-4.55
225,-4.66
226,-5.00
227,-5.17
228,-5.11
229,-5.16
230,-5.50
231,-5.68
232,-5.13
233,-3.97
234,-3.23
235,-3.82
236,-5.37
237,-6.45
238,-6.10
239,-4.96
240,-4.55
241,-5.56
242,-7.01
243,-7.43
244,-6.50
245,-5.30
246,-4.96
247,-5.42
248,-5.73
249,-5.30
250,-4.56
251,-4.40
252,-5.02
253,-5.78
254,-6.01
255,-5.69
256,-5.21
257,-4.91
258,-4.65
259,-4.27
260,-3.87
261,-3.75
262,-3.94
263,-4.09
264,-3.79
265,-3.00
266,-2.22
267,-2.06
268,-2.55
269,-3.13
270,-3.33
271,-3.36
272,-3.76
273,-4.55
274,-5.02
275,-4.58
276,-3.53
277,-2.88
278,-3.22
279,-4.10
280,-4.55
281,-4.14
282,-3.44
283,-3.34
284,-3.92
285,-4.42
286,-4.15
287,-3.33
288,-2.79
289,-2.97
290,-3.55
291,-3.97
292,-4.03
293,-3.83
294,-3.48
295,-3.00
296,-2.56
297,-2.42
298,-2.66
299,-3.10
300,-3.48
301,-3.75
302,-4.06
303,-4.52
304,-4.87
305,-4.67
306,-3.76
307,-2.44
308,-1.22
309,-0.48
310,-0.31
311,-0.64
312,-1.35
313,-2.20
314,-2.78
315,-2.84
316,-2.54
317,-2.52
318,-3.14
319,-4.06
320,-4.45
321,-3.82
322,-2.54
323,-1.42
324,-1.03
325,-1.26
326,-1.60
327,-1.67
328,-1.48
329,-1.31
330,-1.42
331,-1.81
332,-2.20
333,-2.24
334,-1.76
335,-0.97
336,-0.48
337,-0.83
338,-2.00
339,-3.19
340,-3.53
341,-2.91
342,-2.04
343,-1.72
344,-2.16
345,-2.90
346,-3.48
347,-3.79
348,-3.94
349,-3.89
350,-3.51
351,-2.84
352,-2.27
353,-2.21
354,-2.66
355,-3.22
356,-3.55
357,-3.65
358,-3.71
359,-3.78
360,-3.72
361,-3.47
362,-3.20
363,-3.10
364,-3.08
365,-2.93
366,-2.58
367,-2.21
368,-2.21
369,-2.66
370,-3.17
371,-3.05
372,-2.04
373,-0.80
374,-0.35
375,-1.15
376,-2.58
377,-3.59
378,-3.68
379,-3.24
380,-2.97
381,-3.11
382,-3.19
383,-2.70
384,-1.78
385,-1.26
386,-1.67
387,-2.53
388,-2.87
389,-2.26
390,-1.31
391,-0.88
392,-1.08
393,-1.28
394,-1.07
395,-0.78
396,-1.10
397,-2.14
398,-3.24
399,-3.62
400,-3.13
401,-2.29
402,-1.66
403,-1.52
404,-1.68
405,-1.81
406,-1.73
407,-1.54
408,-1.56
409,-1.94
410,-2.46
411,-2.59
412,-1.94
413,-0.70
414,0.45
415,0.78
416,0.12
417,-1.08
418,-2.23
419,-2.96
420,-3.21
421,-3.02
422,-2.55
423,-2.09
424,-1.90
425,-1.97
426,-2.03
427,-1.96
428,-1.94
429,-2.16
430,-2.53
431,-2.67
432,-2.38
433,-1.85
434,-1.48
435,-1.59
436,-2.08
437,-2.62
438,-2.91
439,-2.90
440,-2.76
441,-2.72
442,-2.99
443,-3.50
444,-3.98
445,-4.10
446,-3.75
447,-3.15
448,-2.75
449,-2.85
450,-3.40
451,-4.05
452,-4.39
453,-4.23
454,-3.74
455,-3.32
456,-3.32
457,-3.74
458,-4.30
459,-4.63
460,-4.52
461,-3.98
462,-3.18
463,-2.41
464,-2.07
465,-2.39
466,-3.30
467,-4.37
468,-5.07
469,-5.03
470,-4.37
471,-3.52
472,-3.03
473,-3.06
474,-3.41
475,-3.71
476,-3.83
477,-3.94
478,-4.21
479,-4.54
480,-4.80
481,-5.02
482,-5.45
483,-6.08
484,-6.48
485,-6.20
486,-5.41
487,-4.87
488,-5.24
489,-6.29
490,-7.21
491,-7.38
492,-6.97
493,-6.59
494,-6.60
495,-6.83
496,-6.94
497,-6.80
498,-6.55
499,-6.42
500,-6.55
501,-6.87
502,-7.21
503,-7.24
504,-6.73
505,-5.84
506,-5.00
507,-4.58
508,-4.65
509,-5.07
510,-5.67
511,-6.28
512,-6.59
513,-6.35
514,-5.69
515,-5.20
516,-5.31
517,-5.78
518,-5.93
519,-5.42
520,-4.69
521,-4.40
522,-4.61
523,-4.75
524,-4.50
525,-4.32
526,-5.00
527,-6.58
528,-8.07
529,-8.38
530,-7.45
531,-6.24
532,-5.70
533,-5.84
534,-6.04
535,-5.92
536,-5.72
537,-5.83
538,-6.13
539,-6.16
540,-5.79
541,-5.50
542,-5.78
543,-6.49
544,-6.87
545,-6.39
546,-5.24
547,-4.16
548,-3.63
549,-3.62
550,-3.78
551,-3.92
552,-4.06
553,-4.33
554,-4.61
555,-4.68
556,-4.40
557,-3.88
558,-3.34
559,-2.99
560,-2.78
561,-2.60
562,-2.45
563,-2.54
564,-3.08
565,-3.94
566,-4.57
567,-4.43
568,-3.45
569,-2.19
570,-1.21
571,-0.72
572,-0.56
573,-0.79
574,-1.35
575,-1.93
576,-1.91
577,-1.13
578,-0.14
579,0.27
580,0.06
581,-0.16
582,0.23
583,1.12
584,1.90
585,2.17
586,1.93
587,1.27
588,0.23
589,-0.98
590,-1.76
591,-1.63
592,-0.90
593,-0.49
594,-1.02
595,-2.09
596,-2.74
597,-2.51
598,-1.97
599,-1.89
600,-2.50
601,-3.26
602,-3.65
603,-3.62
604,-3.46
605,-3.33
606,-3.22
607,-3.10
608,-3.11
609,-3.22
610,-3.29
611,-3.21
612,-3.14
613,-3.28
614,-3.62
615,-3.89
616,-3.97
617,-4.06
618,-4.37
619,-4.80
620,-4.98
621,-4.80
622,-4.60
623,-4.70
624,-4.96
625,-4.84
626,-4.21
627,-3.68
628,-3.90
629,-4.66
630,-5.00
631,-4.32
632,-3.22
633,-2.89
634,-3.73
635,-4.84
636,-4.97
637,-3.96
638,-2.94
639,-3.21
640,-4.72
641,-6.06
642,-5.92
643,-4.46
644,-2.90
645,-2.23
646,-2.33
647,-2.48
648,-2.36
649,-2.25
650,-2.39
651,-2.57
652,-2.39
653,-1.83
654,-1.39
655,-1.62
656,-2.65
657,-4.06
658,-5.23
659,-5.66
660,-5.18
661,-4.05
662,-2.92
663,-2.45
664,-2.78
665,-3.34
666,-3.59
667,-3.58
668,-3.80
669,-4.33
670,-4.56
671,-3.85
672,-2.54
673,-1.76
674,-2.25
675,-3.57
676,-4.51
677,-4.37
678,-3.55
679,-3.02
680,-3.24
681,-3.89
682,-4.32
683,-4.18
684,-3.66
685,-3.28
686,-3.43
687,-4.01
688,-4.52
689,-4.48
690,-3.95
691,-3.51
692,-3.67
693,-4.33
694,-4.88
695,-4.90
696,-4.55
697,-4.24
698,-4.18
699,-4.26
700,-4.28
701,-4.13
702,-3.85
703,-3.51
704,-3.20
705,-3.02
706,-3.01
707,-3.10
708,-3.17
709,-3.19
710,-3.25
711,-3.44
712,-3.64
713,-3.57
714,-3.14
715,-2.59
716,-2.31
717,-2.48
718,-2.88
719,-3.25
720,-3.59
721,-4.11
722,-4.92
723,-5.71
724,-6.00
725,-5.64
726,-4.97
727,-4.49
728,-4.37
729,-4.34
730,-4.09
731,-3.61
732,-3.04
733,-2.46
734,-1.84
735,-1.36
736,-1.36
737,-2.06
738,-3.10
739,-3.89
740,-3.94
741,-3.31
742,-2.37
743,-1.61
744,-1.33
745,-1.59
746,-2.15
747,-2.56
748,-2.37
749,-1.50
750,-0.41
751,0.18
752,-0.13
753,-1.13
754,-2.14
755,-2.60
756,-2.47
757,-2.13
758,-1.94
759,-1.97
760,-2.10
761,-2.23
762,-2.42
763,-2.66
764,-2.87
765,-2.91
766,-2.74
767,-2.33
768,-1.79
769,-1.32
770,-1.21
771,-1.58
772,-2.32
773,-3.13
774,-3.71
775,-3.85
776,-3.47
777,-2.71
778,-1.90
779,-1.36
780,-1.18
781,-1.26
782,-1.41
783,-1.56
784,-1.82
785,-2.27
786,-2.77
787,-2.99
788,-2.68
789,-1.89
790,-0.95
791,-0.24
792,-0.04
793,-0.40
794,-1.18
795,-2.00
796,-2.52
797,-2.57
798,-2.32
799,-2.08
800,-1.99
801,-1.98
802,-2.01
803,-2.26
804,-2.84
805,-3.47
806,-3.62
807,-3.01
808,-2.05
809,-1.46
810,-1.56
811,-2.06
812,-2.53
813,-2.86
814,-3.18
815,-3.38
816,-3.17
817,-2.51
818,-1.84
819,-1.70
820,-2.10
821,-2.61
822,-2.89
823,-2.98
824,-3.15
825,-3.33
826,-3.21
827,-2.66
828,-2.06
829,-1.97
830,-2.54
831,-3.33
832,-3.90
833,-4.17
834,-4.49
835,-4.97
836,-5.21
837,-4.61
838,-3.18
839,-1.77
840,-1.39
841,-2.29
842,-3.74
843,-4.71
844,-4.79
845,-4.34
846,-3.89
847,-3.58
848,-3.07
849,-2.10
850,-0.85
851,0.04
852,0.09
853,-0.72
854,-1.89
855,-2.77
856,-2.96
857,-2.51
858,-1.77
859,-1.14
860,-0.69
861,-0.27
862,0.23
863,0.48
864,0.05
865,-1.01
866,-1.96
867,-1.97
868,-0.97
869,0.25
870,0.89
871,0.89
872,0.77
873,0.76
874,0.58
875,-0.06
876,-0.84
877,-1.07
878,-0.54
879,0.19
880,0.50
881,0.42
882,0.58
883,1.36
884,2.28
885,2.49
886,1.65
887,0.36
888,-0.50
889,-0.55
890,-0.10
891,0.34
892,0.53
893,0.57
894,0.72
895,1.17
896,1.89
897,2.51
898,2.53
899,1.83
900,0.82
901,0.17
902,0.10
903,0.21
904,0.06
905,-0.29
906,-0.40
907,-0.14
908,-0.01
909,-0.58
910,-1.68
911,-2.42
912,-2.17
913,-1.16
914,-0.32
915,-0.18
916,-0.31
917,0.07
918,1.09
919,1.93
920,1.71
921,0.49
922,-0.68
923,-0.79
924,0.11
925,1.01
926,1.07
927,0.37
928,-0.17
929,0.12
930,1.06
931,1.79
932,1.79
933,1.34
934,1.10
935,1.34
936,1.65
937,1.43
938,0.68
939,0.01
940,0.06
941,0.85
942,1.79
943,2.27
944,2.16
945,1.86
946,1.81
947,2.09
948,2.45
949,2.60
950,2.48
951,2.26
952,2.11
953,2.00
954,1.75
955,1.23
956,0.52
957,-0.14
958,-0.54
959,-0.64
960,-0.58
961,-0.50
962,-0.48
963,-0.51
964,-0.48
965,-0.25
966,0.22
967,0.74
968,0.97
969,0.82
970,0.57
971,0.59
972,0.92
973,1.21
974,1.13
975,0.80
976,0.66
977,0.95
978,1.45
979,1.72
980,1.52
981,1.00
982,0.47
983,0.13
984,0.05
985,0.21
986,0.64
987,1.30
988,1.78
989,1.44
990,0.09
991,-1.53
992,-2.24
993,-1.52
994,-0.16
995,0.45
996,-0.31
997,-1.68
998,-2.41
999,-1.98
1000,-1.03
1001,-0.48
1002,-0.40
1003,-0.06
1004,0.86
1005,1.61
1006,1.30
1007,0.17
1008,-0.57
1009,-0.18
1010,0.76
1011,1.13
1012,0.81
1013,0.63
1014,1.26
1015,2.24
1016,2.54
1017,1.80
1018,0.69
1019,0.13
1020,0.34
1021,0.90
1022,1.48
1023,2.11
1024,2.67
1025,2.63
1026,1.64
1027,0.28
1028,-0.28
1029,0.55
1030,2.02
1031,2.89
1032,2.74
1033,2.27
1034,2.31
1035,2.79
1036,2.88
1037,2.03
1038,0.63
1039,-0.41
1040,-0.67
1041,-0.50
1042,-0.52
1043,-0.91
1044,-1.19
1045,-0.80
1046,0.27
1047,1.38
1048,1.86
1049,1.66
1050,1.30
1051,1.28
1052,1.60
1053,1.88
1054,1.90
1055,1.84
1056,1.89
1057,1.95
1058,1.65
1059,0.87
1060,0.04
1061,-0.21
1062,0.22
1063,0.76
1064,0.87
1065,0.74
1066,0.84
1067,1.15
1068,1.11
1069,0.46
1070,-0.30
1071,-0.57
1072,-0.40
1073,-0.38
1074,-0.75
1075,-1.04
1076,-0.72
1077,0.03
1078,0.50
1079,0.30
1080,-0.10
1081,0.05
1082,1.00
1083,2.17
1084,2.75
1085,2.26
1086,1.08
1087,0.06
1088,-0.10
1089,0.51
1090,1.15
1091,1.20
1092,0.89
1093,1.02
1094,1.92
1095,2.83
1096,2.72
1097,1.53
1098,0.32
1099,0.13
1100,0.86
1101,1.58
1102,1.68
1103,1.41
1104,1.27
1105,1.26
1106,1.00
1107,0.48
1108,0.20
1109,0.57
1110,1.27
1111,1.58
1112,1.22
1113,0.61
1114,0.36
1115,0.60
1116,0.96
1117,1.04
1118,0.86
1119,0.72
1120,0.85
1121,1.17
1122,1.55
1123,1.91
1124,2.17
1125,2.07
1126,1.41
1127,0.40
1128,-0.34
1129,-0.33
1130,0.29
1131,0.81
1132,0.71
1133,0.13
1134,-0.25
1135,0.03
1136,0.69
1137,0.91
1138,0.42
1139,-0.08
1140,0.39
1141,1.83
1142,3.10
1143,3.01
1144,1.61
1145,0.13
1146,-0.19
1147,0.79
1148,2.20
1149,3.07
1150,3.15
1151,2.98
1152,3.11
1153,3.57
1154,3.76
1155,3.09
1156,1.63
1157,0.26
1158,-0.07
1159,0.75
1160,1.81
1161,2.05
1162,1.17
1163,-0.07
1164,-0.67
1165,-0.21
1166,0.80
1167,1.56
1168,1.61
1169,1.18
1170,0.74
1171,0.57
1172,0.60
1173,0.64
1174,0.61
1175,0.59
1176,0.60
1177,0.49
1178,0.16
1179,-0.31
1180,-0.63
1181,-0.55
1182,-0.16
1183,0.17
1184,0.16
1185,-0.05
1186,0.07
1187,0.82
1188,1.74
1189,1.81
1190,0.58
1191,-1.09
1192,-1.85
1193,-1.43
1194,-0.41
1195,-0.02
1196,-0.70
1197,-2.13
1198,-2.53
1199,-0.05
1200,3.02
