1,44.37
2,67.70
3,76.07
4,78.08
5,83.89
6,93.25
7,98.95
8,98.25
9,91.60
10,80.65
11,65.51
12,49.18
13,34.71
14,26.02
15,24.78
16,31.44
17,44.75
18,61.94
19,80.35
20,96.76
21,109.86
22,117.94
23,121.25
24,119.23
25,112.53
26,100.92
27,85.11
28,65.64
29,44.14
30,22.37
31,2.85
32,-12.76
33,-22.77
34,-27.42
35,-27.02
36,-23.80
37,-19.07
38,-15.12
39,-12.37
40,-11.64
41,-11.96
42,-12.97
43,-13.54
44,-13.47
45,-12.55
46,-11.03
47,-9.34
48,-7.74
49,-6.61
50,-5.88
51,-5.57
52,-5.41
53,-5.32
54,-5.15
55,-4.92
56,-4.58
57,-4.20
58,-3.78
59,-3.41
60,-3.03
61,-2.68
62,-2.33
63,-2.08
64,-1.90
65,-1.82
66,-1.75
67,-1.67
68,-1.56
69,-1.49
70,-1.39
71,-1.27
72,-1.11
73,-0.95
74,-0.75
75,-0.52
76,-0.20
77,0.22
78,0.73
79,1.27
80,1.80
81,2.28
82,2.69
83,2.95
84,3.07
85,3.05
86,3.04
87,3.04
88,3.15
89,3.32
90,3.61
91,3.99
92,4.44
93,4.86
94,5.23
95,5.52
96,5.77
97,5.98
98,6.13
99,6.23
100,6.26
101,6.26
102,6.23
103,6.14
104,5.96
105,5.67
106,5.27
107,4.78
108,4.22
109,3.66
110,3.16
111,2.77
112,2.45
113,2.20
114,1.98
115,1.78
116,1.50
117,1.15
118,0.74
119,0.35
120,-0.04
121,-0.34
122,-0.56
123,-0.69
124,-0.78
125,-0.85
126,-0.95
127,-1.09
128,-1.34
129,-1.69
130,-2.14
131,-2.56
132,-2.93
133,-3.23
134,-3.46
135,-3.60
136,-3.65
137,-3.62
138,-3.53
139,-3.42
140,-3.27
141,-3.09
142,-2.87
143,-2.62
144,-2.40
145,-2.19
146,-2.00
147,-1.82
148,-1.66
149,-1.53
150,-1.46
151,-1.43
152,-1.44
153,-1.47
154,-1.53
155,-1.66
156,-1.83
157,-2.04
158,-2.26
159,-2.47
160,-2.69
161,-2.90
162,-3.03
163,-3.04
164,-2.91
165,-2.63
166,-2.23
167,-1.79
168,-1.37
169,-1.05
170,-0.76
171,-0.54
172,-0.36
173,-0.21
174,-0.01
175,0.27
176,0.68
177,1.15
178,1.70
179,2.23
180,2.73
181,3.14
182,3.51
183,3.83
184,4.13
185,4.38
186,4.66
187,4.99
188,5.38
189,5.74
190,6.01
191,6.16
192,6.19
193,6.07
194,5.79
195,5.36
196,4.86
197,4.38
198,3.98
199,3.72
200,3.57
201,3.59
202,3.69
203,3.83
204,3.84
205,3.68
206,3.28
207,2.69
208,1.88
209,0.97
210,-0.01
211,-0.91
212,-1.72
213,-2.36
214,-2.86
215,-3.18
216,-3.39
217,-3.49
218,-3.55
219,-3.55
220,-3.50
221,-3.41
222,-3.30
223,-3.14
224,-2.94
225,-2.75
226,-2.53
227,-2.32
228,-2.09
229,-1.86
230,-1.60
231,-1.34
232,-1.04
233,-0.69
234,-0.27
235,0.14
236,0.53
237,0.86
238,1.14
239,1.30
240,1.39
241,1.37
242,1.36
243,1.37
244,1.50
245,1.69
246,2.01
247,2.40
248,2.84
249,3.24
250,3.62
251,3.94
252,4.27
253,4.59
254,4.91
255,5.23
256,5.62
257,6.06
258,6.53
259,6.95
260,7.32
261,7.61
262,7.84
263,8.01
264,8.17
265,8.31
266,8.45
267,8.57
268,8.69
269,8.80
270,8.91
271,9.00
272,9.07
273,9.09
274,9.07
275,9.01
276,8.94
277,8.88
278,8.81
279,8.70
280,8.53
281,8.31
282,8.07
283,7.83
284,7.61
285,7.47
286,7.42
287,7.50
288,7.74
289,8.17
290,8.73
291,9.31
292,9.78
293,10.09
294,10.20
295,10.11
296,9.82
297,9.37
298,8.82
299,8.25
300,7.70
301,7.22
302,6.83
303,6.56
304,6.39
305,6.32
306,6.29
307,6.26
308,6.19
309,6.07
310,5.91
311,5.74
312,5.54
313,5.33
314,5.13
315,5.02
316,5.00
317,5.01
318,4.92
319,4.70
320,4.32
321,3.85
322,3.27
323,2.65
324,2.00
325,1.43
326,0.95
327,0.61
328,0.35
329,0.15
330,-0.05
331,-0.23
332,-0.37
333,-0.46
334,-0.53
335,-0.58
336,-0.61
337,-0.61
338,-0.60
339,-0.64
340,-0.70
341,-0.74
342,-0.67
343,-0.47
344,-0.14
345,0.29
346,0.79
347,1.29
348,1.77
349,2.13
350,2.35
351,2.46
352,2.54
353,2.65
354,2.83
355,3.07
356,3.36
357,3.62
358,3.81
359,3.81
360,3.63
361,3.26
362,2.78
363,2.32
364,1.99
365,1.87
366,1.97
367,2.25
368,2.63
369,3.03
370,3.35
371,3.54
372,3.56
373,3.47
374,3.30
375,3.12
376,2.95
377,2.81
378,2.66
379,2.45
380,2.16
381,1.76
382,1.29
383,0.82
384,0.38
385,0.02
386,-0.27
387,-0.42
388,-0.37
389,-0.14
390,0.24
391,0.69
392,1.21
393,1.70
394,2.15
395,2.50
396,2.84
397,3.18
398,3.59
399,4.02
400,4.57
401,5.23
402,5.98
403,6.73
404,7.38
405,7.83
406,8.07
407,8.09
408,7.93
409,7.59
410,7.13
411,6.65
412,6.22
413,5.86
414,5.55
415,5.29
416,5.05
417,4.82
418,4.54
419,4.23
420,3.86
421,3.49
422,3.14
423,2.85
424,2.64
425,2.56
426,2.54
427,2.59
428,2.65
429,2.70
430,2.72
431,2.69
432,2.65
433,2.61
434,2.59
435,2.62
436,2.75
437,2.98
438,3.31
439,3.71
440,4.14
441,4.52
442,4.82
443,5.02
444,5.21
445,5.39
446,5.65
447,5.94
448,6.35
449,6.84
450,7.44
451,8.06
452,8.72
453,9.34
454,9.93
455,10.42
456,10.85
457,11.17
458,11.41
459,11.61
460,11.86
461,12.15
462,12.48
463,12.79
464,13.01
465,13.09
466,13.04
467,12.79
468,12.38
469,11.86
470,11.36
471,10.97
472,10.72
473,10.64
474,10.72
475,10.93
476,11.17
477,11.34
478,11.35
479,11.17
480,10.77
481,10.27
482,9.74
483,9.32
484,9.00
485,8.81
486,8.71
487,8.70
488,8.65
489,8.52
490,8.22
491,7.80
492,7.29
493,6.80
494,6.31
495,5.90
496,5.52
497,5.25
498,4.98
499,4.70
500,4.28
501,3.72
502,3.02
503,2.27
504,1.51
505,0.86
506,0.37
507,0.10
508,0.03
509,0.16
510,0.43
511,0.77
512,1.07
513,1.29
514,1.43
515,1.54
516,1.65
517,1.80
518,2.03
519,2.30
520,2.56
521,2.75
522,2.82
523,2.79
524,2.65
525,2.41
526,2.11
527,1.77
528,1.43
529,1.08
530,0.68
531,0.24
532,-0.25
533,-0.77
534,-1.28
535,-1.70
536,-1.96
537,-2.02
538,-1.91
539,-1.63
540,-1.24
541,-0.77
542,-0.34
543,-0.04
544,0.11
545,0.17
546,0.18
547,0.21
548,0.24
549,0.27
550,0.32
551,0.38
552,0.43
553,0.42
554,0.40
555,0.39
556,0.44
557,0.53
558,0.64
559,0.76
560,0.89
561,1.00
562,1.10
563,1.15
564,1.22
565,1.32
566,1.53
567,1.85
568,2.33
569,2.89
570,3.53
571,4.19
572,4.85
573,5.45
574,5.93
575,6.23
576,6.34
577,6.30
578,6.17
579,6.00
580,5.80
581,5.58
582,5.37
583,5.19
584,5.05
585,4.91
586,4.70
587,4.40
588,4.03
589,3.64
590,3.23
591,2.88
592,2.61
593,2.46
594,2.42
595,2.53
596,2.74
597,2.98
598,3.14
599,3.17
600,3.13
601,3.03
602,2.88
603,2.76
604,2.75
605,2.89
606,3.16
607,3.48
608,3.78
609,4.03
610,4.14
611,4.07
612,3.87
613,3.59
614,3.31
615,3.10
616,3.00
617,3.00
618,3.07
619,3.16
620,3.26
621,3.34
622,3.42
623,3.47
624,3.54
625,3.63
626,3.74
627,3.86
628,3.97
629,4.10
630,4.24
631,4.39
632,4.50
633,4.60
634,4.70
635,4.79
636,4.81
637,4.74
638,4.53
639,4.20
640,3.72
641,3.16
642,2.55
643,1.95
644,1.37
645,0.89
646,0.57
647,0.42
648,0.37
649,0.42
650,0.54
651,0.74
652,0.99
653,1.27
654,1.58
655,1.93
656,2.32
657,2.71
658,3.14
659,3.60
660,4.11
661,4.59
662,5.03
663,5.36
664,5.56
665,5.61
666,5.52
667,5.35
668,5.14
669,4.95
670,4.81
671,4.75
672,4.81
673,4.94
674,5.03
675,5.04
676,4.94
677,4.76
678,4.48
679,4.13
680,3.71
681,3.30
682,2.90
683,2.61
684,2.41
685,2.30
686,2.20
687,2.08
688,1.94
689,1.79
690,1.63
691,1.46
692,1.27
693,1.05
694,0.80
695,0.53
696,0.29
697,0.08
698,-0.11
699,-0.26
700,-0.34
701,-0.31
702,-0.18
703,-0.01
704,0.23
705,0.52
706,0.89
707,1.31
708,1.75
709,2.14
710,2.46
711,2.72
712,2.98
713,3.23
714,3.52
715,3.81
716,4.18
717,4.59
718,5.03
719,5.45
720,5.84
721,6.16
722,6.42
723,6.58
724,6.74
725,6.90
726,7.16
727,7.45
728,7.78
729,8.11
730,8.43
731,8.66
732,8.78
733,8.78
734,8.71
735,8.58
736,8.41
737,8.26
738,8.21
739,8.29
740,8.48
741,8.68
742,8.93
743,9.19
744,9.48
745,9.75
746,9.97
747,10.19
748,10.43
749,10.73
750,11.04
751,11.34
752,11.64
753,11.91
754,12.08
755,12.09
756,11.89
757,11.47
758,10.86
759,10.17
760,9.46
761,8.83
762,8.32
763,7.99
764,7.87
765,7.93
766,8.11
767,8.32
768,8.54
769,8.75
770,8.96
771,9.13
772,9.28
773,9.43
774,9.61
775,9.83
776,10.00
777,10.14
778,10.19
779,10.11
780,9.81
781,9.30
782,8.64
783,7.95
784,7.26
785,6.70
786,6.29
787,6.10
788,6.05
789,6.07
790,6.03
791,5.93
792,5.70
793,5.38
794,4.93
795,4.43
796,3.91
797,3.49
798,3.19
799,2.99
800,2.82
801,2.66
802,2.44
803,2.17
804,1.84
805,1.49
806,1.13
807,0.84
808,0.57
809,0.35
810,0.11
811,-0.11
812,-0.40
813,-0.72
814,-1.11
815,-1.52
816,-1.94
817,-2.33
818,-2.71
819,-3.07
820,-3.37
821,-3.59
822,-3.68
823,-3.65
824,-3.49
825,-3.16
826,-2.66
827,-2.03
828,-1.31
829,-0.61
830,0.10
831,0.75
832,1.37
833,1.89
834,2.36
835,2.76
836,3.21
837,3.64
838,4.06
839,4.35
840,4.55
841,4.62
842,4.64
843,4.59
844,4.57
845,4.59
846,4.71
847,4.96
848,5.28
849,5.62
850,5.90
851,6.11
852,6.25
853,6.31
854,6.27
855,6.20
856,6.08
857,5.97
858,5.79
859,5.53
860,5.16
861,4.71
862,4.18
863,3.59
864,2.92
865,2.29
866,1.77
867,1.42
868,1.18
869,1.08
870,1.08
871,1.17
872,1.30
873,1.46
874,1.60
875,1.72
876,1.82
877,1.91
878,2.01
879,2.17
880,2.35
881,2.56
882,2.78
883,3.00
884,3.17
885,3.26
886,3.25
887,3.17
888,3.02
889,2.84
890,2.62
891,2.39
892,2.13
893,1.86
894,1.59
895,1.32
896,1.05
897,0.79
898,0.52
899,0.27
900,0.05
901,-0.15
902,-0.35
903,-0.56
904,-0.77
905,-0.92
906,-0.99
907,-0.95
908,-0.85
909,-0.69
910,-0.50
911,-0.30
912,-0.08
913,0.08
914,0.21
915,0.27
916,0.29
917,0.25
918,0.18
919,0.10
920,0.16
921,0.35
922,0.72
923,1.16
924,1.68
925,2.24
926,2.86
927,3.46
928,4.01
929,4.44
930,4.82
931,5.17
932,5.56
933,6.00
934,6.50
935,7.00
936,7.52
937,7.97
938,8.31
939,8.51
940,8.61
941,8.63
942,8.62
943,8.59
944,8.55
945,8.49
946,8.42
947,8.29
948,8.11
949,7.84
950,7.49
951,7.13
952,6.81
953,6.61
954,6.50
955,6.52
956,6.60
957,6.70
958,6.70
959,6.56
960,6.25
961,5.83
962,5.33
963,4.85
964,4.46
965,4.25
966,4.23
967,4.34
968,4.43
969,4.42
970,4.20
971,3.80
972,3.14
973,2.34
974,1.44
975,0.60
976,-0.11
977,-0.63
978,-0.99
979,-1.22
980,-1.43
981,-1.62
982,-1.85
983,-2.08
984,-2.37
985,-2.63
986,-2.84
987,-2.96
988,-3.01
989,-3.01
990,-2.94
991,-2.78
992,-2.56
993,-2.29
994,-2.00
995,-1.73
996,-1.49
997,-1.29
998,-1.11
999,-0.98
1000,-0.82
1001,-0.65
1002,-0.44
1003,-0.20
1004,0.09
1005,0.36
1006,0.56
1007,0.64
1008,0.65
1009,0.58
1010,0.47
1011,0.27
1012,0.05
1013,-0.20
1014,-0.40
1015,-0.58
1016,-0.76
1017,-0.90
1018,-0.98
1019,-0.99
1020,-0.92
1021,-0.73
1022,-0.42
1023,0.00
1024,0.43
1025,0.75
1026,0.86
1027,0.74
1028,0.40
1029,-0.10
1030,-0.63
1031,-1.12
1032,-1.48
1033,-1.67
1034,-1.65
1035,-1.43
1036,-1.06
1037,-0.65
1038,-0.24
1039,0.08
1040,0.37
1041,0.65
1042,0.98
1043,1.40
1044,1.96
1045,2.61
1046,3.33
1047,4.05
1048,4.75
1049,5.37
1050,5.89
1051,6.23
1052,6.47
1053,6.61
1054,6.73
1055,6.81
1056,6.87
1057,6.93
1058,7.02
1059,7.10
1060,7.15
1061,7.13
1062,7.05
1063,6.95
1064,6.83
1065,6.69
1066,6.54
1067,6.39
1068,6.20
1069,5.93
1070,5.58
1071,5.20
1072,4.78
1073,4.37
1074,3.95
1075,3.59
1076,3.33
1077,3.26
1078,3.29
1079,3.40
1080,3.49
1081,3.56
1082,3.57
1083,3.55
1084,3.45
1085,3.28
1086,3.01
1087,2.66
1088,2.20
1089,1.69
1090,1.14
1091,0.61
1092,0.08
1093,-0.40
1094,-0.79
1095,-1.01
1096,-1.11
1097,-1.11
1098,-1.08
1099,-1.01
1100,-0.89
1101,-0.71
1102,-0.51
1103,-0.30
1104,-0.05
1105,0.29
1106,0.66
1107,1.00
1108,1.24
1109,1.39
1110,1.44
1111,1.39
1112,1.19
1113,0.87
1114,0.43
1115,-0.05
1116,-0.57
1117,-1.10
1118,-1.66
1119,-2.22
1120,-2.80
1121,-3.30
1122,-3.69
1123,-3.96
1124,-4.16
1125,-4.30
1126,-4.41
1127,-4.49
1128,-4.62
1129,-4.79
1130,-5.00
1131,-5.19
1132,-5.29
1133,-5.29
1134,-5.18
1135,-4.94
1136,-4.55
1137,-4.08
1138,-3.58
1139,-3.12
1140,-2.75
1141,-2.51
1142,-2.43
1143,-2.50
1144,-2.62
1145,-2.73
1146,-2.75
1147,-2.66
1148,-2.44
1149,-2.14
1150,-1.80
1151,-1.53
1152,-1.40
1153,-1.43
1154,-1.59
1155,-1.79
1156,-2.01
1157,-2.20
1158,-2.32
1159,-2.31
1160,-2.18
1161,-1.99
1162,-1.87
1163,-1.88
1164,-2.08
1165,-2.45
1166,-2.98
1167,-3.57
1168,-4.17
1169,-4.67
1170,-5.08
1171,-5.41
1172,-5.66
1173,-5.80
1174,-5.84
1175,-5.84
1176,-5.87
1177,-5.93
1178,-5.96
1179,-5.94
1180,-5.88
1181,-5.85
1182,-5.81
1183,-5.76
1184,-5.68
1185,-5.62
1186,-5.57
1187,-5.52
1188,-5.42
1189,-5.29
1190,-5.07
1191,-4.80
1192,-4.49
1193,-4.13
1194,-3.71
1195,-3.27
1196,-2.82
1197,-2.40
1198,-2.01
1199,-1.67
1200,-1.34
1201,-1.04
1202,-0.77
1203,-0.57
1204,-0.40
1205,-0.24
1206,0.02
1207,0.34
1208,0.72
1209,1.04
1210,1.32
1211,1.55
1212,1.78
1213,1.95
1214,2.07
1215,2.15
1216,2.27
1217,2.41
1218,2.59
1219,2.72
1220,2.85
1221,2.97
1222,3.11
1223,3.22
1224,3.31
1225,3.40
1226,3.52
1227,3.66
1228,3.81
1229,3.94
1230,4.02
1231,4.02
1232,3.90
1233,3.69
1234,3.46
1235,3.24
1236,3.04
1237,2.89
1238,2.85
1239,2.91
1240,3.03
1241,3.12
1242,3.15
1243,3.14
1244,3.16
1245,3.17
1246,3.23
1247,3.33
1248,3.59
1249,3.97
1250,4.45
1251,4.90
1252,5.30
1253,5.65
1254,6.00
1255,6.29
1256,6.51
1257,6.67
1258,6.79
1259,6.87
1260,6.87
1261,6.72
1262,6.45
1263,6.09
1264,5.63
1265,5.13
1266,4.62
1267,4.17
1268,3.81
1269,3.59
1270,3.46
1271,3.44
1272,3.45
1273,3.46
1274,3.43
1275,3.37
1276,3.27
1277,3.14
1278,2.91
1279,2.62
1280,2.24
1281,1.84
1282,1.36
1283,0.84
1284,0.21
1285,-0.43
1286,-1.11
1287,-1.73
1288,-2.33
1289,-2.85
1290,-3.34
1291,-3.78
1292,-4.23
1293,-4.68
1294,-5.24
1295,-5.86
1296,-6.55
1297,-7.20
1298,-7.80
1299,-8.26
1300,-8.64
1301,-8.90
1302,-9.08
1303,-9.16
1304,-9.20
1305,-9.22
1306,-9.28
1307,-9.35
1308,-9.47
1309,-9.58
1310,-9.72
1311,-9.83
1312,-9.94
1313,-10.02
1314,-10.10
1315,-10.22
1316,-10.41
1317,-10.67
1318,-11.02
1319,-11.43
1320,-11.92
1321,-12.45
1322,-13.02
1323,-13.53
1324,-13.95
1325,-14.22
1326,-14.34
1327,-14.34
1328,-14.23
1329,-14.08
1330,-13.91
1331,-13.73
1332,-13.53
1333,-13.28
1334,-13.04
1335,-12.83
1336,-12.66
1337,-12.50
1338,-12.37
1339,-12.28
1340,-12.27
1341,-12.37
1342,-12.52
1343,-12.73
1344,-13.00
1345,-13.31
1346,-13.58
1347,-13.77
1348,-13.84
1349,-13.79
1350,-13.58
1351,-13.22
1352,-12.70
1353,-12.11
1354,-11.48
1355,-10.92
1356,-10.41
1357,-9.97
1358,-9.57
1359,-9.22
1360,-8.86
1361,-8.48
1362,-8.06
1363,-7.64
1364,-7.23
1365,-6.90
1366,-6.68
1367,-6.62
1368,-6.73
1369,-6.98
1370,-7.31
1371,-7.61
1372,-7.82
1373,-7.90
1374,-7.90
1375,-7.84
1376,-7.74
1377,-7.64
1378,-7.63
1379,-7.77
1380,-8.11
1381,-8.59
1382,-9.16
1383,-9.72
1384,-10.28
1385,-10.79
1386,-11.19
1387,-11.47
1388,-11.63
1389,-11.68
1390,-11.64
1391,-11.50
1392,-11.25
1393,-10.92
1394,-10.53
1395,-10.10
1396,-9.66
1397,-9.25
1398,-8.89
1399,-8.61
1400,-8.31
1401,-8.03
1402,-7.69
1403,-7.32
1404,-6.83
1405,-6.31
1406,-5.73
1407,-5.15
1408,-4.47
1409,-3.78
1410,-3.02
1411,-2.29
1412,-1.50
1413,-0.68
1414,0.18
1415,0.96
1416,1.63
1417,2.09
1418,2.40
1419,2.54
1420,2.55
1421,2.45
1422,2.32
1423,2.20
1424,2.10
1425,1.98
1426,1.79
1427,1.50
1428,1.11
1429,0.63
1430,0.04
1431,-0.61
1432,-1.30
1433,-1.88
1434,-2.39
1435,-2.78
1436,-3.17
1437,-3.50
1438,-3.89
1439,-4.33
1440,-4.90
1441,-5.54
1442,-6.25
1443,-6.94
1444,-7.61
1445,-8.13
1446,-8.47
1447,-8.55
1448,-8.49
1449,-8.31
1450,-8.11
1451,-7.92
1452,-7.87
1453,-7.93
1454,-8.16
1455,-8.45
1456,-8.86
1457,-9.32
1458,-9.84
1459,-10.35
1460,-10.86
1461,-11.39
1462,-11.99
1463,-12.55
1464,-13.03
1465,-13.39
1466,-13.66
1467,-13.82
1468,-13.92
1469,-13.91
1470,-13.86
1471,-13.83
1472,-13.81
1473,-13.76
1474,-13.61
1475,-13.36
1476,-12.95
1477,-12.39
1478,-11.63
1479,-10.77
1480,-9.86
1481,-9.00
1482,-8.16
1483,-7.46
1484,-6.90
1485,-6.53
1486,-6.19
1487,-5.86
1488,-5.44
1489,-5.03
1490,-4.48
1491,-3.85
1492,-3.04
1493,-2.26
1494,-1.48
1495,-0.82
1496,-0.14
1497,0.46
1498,1.05
1499,1.53
1500,2.04
1501,2.55
1502,3.14
1503,3.75
1504,4.46
1505,5.18
1506,5.98
1507,6.74
1508,7.51
1509,8.20
1510,8.91
1511,9.55
1512,10.19
1513,10.77
1514,11.35
1515,11.87
1516,12.39
1517,12.83
1518,13.21
1519,13.50
1520,13.74
1521,13.91
1522,14.04
1523,14.09
1524,14.10
1525,14.07
1526,14.02
1527,13.92
1528,13.78
1529,13.63
1530,13.52
1531,13.46
1532,13.42
1533,13.40
1534,13.40
1535,13.43
1536,13.44
1537,13.44
1538,13.34
1539,13.12
1540,12.75
1541,12.28
1542,11.76
1543,11.22
1544,10.62
1545,10.01
1546,9.40
1547,8.87
1548,8.35
1549,7.86
1550,7.35
1551,6.87
1552,6.41
1553,6.03
1554,5.75
1555,5.65
1556,5.65
1557,5.75
1558,5.88
1559,6.05
1560,6.16
1561,6.20
1562,6.12
1563,6.00
1564,5.90
1565,5.91
1566,5.98
1567,6.12
1568,6.23
1569,6.31
1570,6.26
1571,6.03
1572,5.55
1573,4.89
1574,4.14
1575,3.46
1576,2.98
1577,2.75
1578,2.75
1579,2.97
1580,3.32
1581,3.75
1582,4.19
1583,4.55
1584,4.80
1585,4.97
1586,5.15
1587,5.35
1588,5.57
1589,5.79
1590,6.01
1591,6.22
1592,6.36
1593,6.39
1594,6.33
1595,6.18
1596,5.94
1597,5.65
1598,5.31
1599,4.99
1600,4.64
1601,4.26
1602,3.81
1603,3.34
1604,2.82
1605,2.29
1606,1.71
1607,1.14
1608,0.62
1609,0.18
1610,-0.19
1611,-0.47
1612,-0.62
1613,-0.62
1614,-0.43
1615,-0.09
1616,0.44
1617,1.16
1618,2.08
1619,3.09
1620,4.14
1621,5.09
1622,5.95
1623,6.66
1624,7.22
1625,7.57
1626,7.77
1627,7.88
1628,7.97
1629,8.02
1630,8.03
1631,7.98
1632,7.86
1633,7.64
1634,7.31
1635,6.90
1636,6.45
1637,6.03
1638,5.62
1639,5.25
1640,4.89
1641,4.57
1642,4.19
1643,3.76
1644,3.24
1645,2.71
1646,2.14
1647,1.63
1648,1.11
1649,0.68
1650,0.26
1651,-0.11
1652,-0.52
1653,-0.93
1654,-1.37
1655,-1.79
1656,-2.16
1657,-2.46
1658,-2.67
1659,-2.75
1660,-2.72
1661,-2.53
1662,-2.24
1663,-1.94
1664,-1.69
1665,-1.56
1666,-1.46
1667,-1.42
1668,-1.35
1669,-1.27
1670,-1.10
1671,-0.82
1672,-0.34
1673,0.34
1674,1.23
1675,2.21
1676,3.24
1677,4.20
1678,5.05
1679,5.71
1680,6.13
1681,6.26
1682,6.18
1683,5.95
1684,5.73
1685,5.56
1686,5.54
1687,5.65
1688,5.92
1689,6.28
1690,6.68
1691,7.01
1692,7.24
1693,7.32
1694,7.27
1695,7.14
1696,7.04
1697,7.03
1698,7.14
1699,7.35
1700,7.64
1701,7.94
1702,8.21
1703,8.38
1704,8.49
1705,8.54
1706,8.58
1707,8.61
1708,8.64
1709,8.70
1710,8.80
1711,8.96
1712,9.16
1713,9.34
1714,9.41
1715,9.37
1716,9.19
1717,8.91
1718,8.54
1719,8.17
1720,7.81
1721,7.50
1722,7.23
1723,7.00
1724,6.82
1725,6.65
1726,6.38
1727,6.03
1728,5.65
1729,5.37
1730,5.23
1731,5.30
1732,5.60
1733,6.14
1734,6.83
1735,7.51
1736,8.03
1737,8.24
1738,8.08
1739,7.60
1740,6.91
1741,6.21
1742,5.62
1743,5.23
1744,5.06
1745,5.10
1746,5.26
1747,5.43
1748,5.46
1749,5.29
1750,4.88
1751,4.32
1752,3.64
1753,2.98
1754,2.37
1755,1.88
1756,1.46
1757,1.11
1758,0.77
1759,0.40
1760,-0.08
1761,-0.61
1762,-1.19
1763,-1.72
1764,-2.22
1765,-2.59
1766,-2.87
1767,-3.04
1768,-3.18
1769,-3.33
1770,-3.49
1771,-3.66
1772,-3.88
1773,-4.11
1774,-4.36
1775,-4.59
1776,-4.71
1777,-4.74
1778,-4.70
1779,-4.64
1780,-4.55
1781,-4.45
1782,-4.26
1783,-4.01
1784,-3.60
1785,-3.02
1786,-2.20
1787,-1.22
1788,-0.08
1789,1.05
1790,2.10
1791,2.93
1792,3.56
1793,3.93
1794,4.10
1795,4.10
1796,4.14
1797,4.23
1798,4.46
1799,4.75
1800,5.13
1801,5.51
1802,5.89
1803,6.18
1804,6.39
1805,6.54
1806,6.69
1807,6.86
1808,7.03
1809,7.22
1810,7.43
1811,7.63
1812,7.78
1813,7.82
1814,7.74
1815,7.59
1816,7.38
1817,7.18
1818,7.00
1819,6.85
1820,6.68
1821,6.48
1822,6.22
1823,5.93
1824,5.57
1825,5.17
1826,4.67
1827,4.17
1828,3.68
1829,3.30
1830,3.01
1831,2.83
1832,2.75
1833,2.75
1834,2.84
1835,2.94
1836,3.05
1837,3.14
1838,3.27
1839,3.47
1840,3.75
1841,4.11
1842,4.58
1843,5.11
1844,5.68
1845,6.23
1846,6.69
1847,7.02
1848,7.20
1849,7.22
1850,7.14
1851,7.02
1852,6.92
1853,6.86
1854,6.81
1855,6.75
1856,6.68
1857,6.59
1858,6.45
1859,6.25
1860,5.96
1861,5.64
1862,5.29
1863,4.97
1864,4.62
1865,4.30
1866,4.01
1867,3.77
1868,3.56
1869,3.39
1870,3.27
1871,3.27
1872,3.38
1873,3.56
1874,3.78
1875,4.01
1876,4.30
1877,4.63
1878,4.96
1879,5.25
1880,5.55
1881,5.87
1882,6.26
1883,6.71
1884,7.19
1885,7.63
1886,8.04
1887,8.36
1888,8.61
1889,8.75
1890,8.83
1891,8.84
1892,8.85
1893,8.88
1894,8.96
1895,9.09
1896,9.22
1897,9.31
1898,9.37
1899,9.40
1900,9.38
1901,9.28
1902,9.13
1903,8.95
1904,8.77
1905,8.60
1906,8.38
1907,8.11
1908,7.81
1909,7.52
1910,7.20
1911,6.87
1912,6.55
1913,6.35
1914,6.31
1915,6.43
1916,6.64
1917,6.90
1918,7.14
1919,7.29
1920,7.23
1921,6.94
1922,6.48
1923,6.02
1924,5.64
1925,5.43
1926,5.44
1927,5.68
1928,6.09
1929,6.50
1930,6.74
1931,6.72
1932,6.39
1933,5.81
1934,5.09
1935,4.36
1936,3.74
1937,3.39
1938,3.33
1939,3.52
1940,3.80
1941,4.03
1942,4.14
1943,4.07
1944,3.81
1945,3.38
1946,2.90
1947,2.53
1948,2.37
1949,2.40
1950,2.59
1951,2.89
1952,3.29
1953,3.71
1954,4.09
1955,4.39
1956,4.63
1957,4.81
1958,4.91
1959,4.93
1960,4.94
1961,4.93
1962,4.93
1963,4.96
1964,5.07
1965,5.24
1966,5.46
1967,5.67
1968,5.87
1969,6.06
1970,6.16
1971,6.16
1972,6.09
1973,6.00
1974,5.92
1975,5.87
1976,5.78
1977,5.67
1978,5.49
1979,5.26
1980,4.95
1981,4.59
1982,4.18
1983,3.74
1984,3.27
1985,2.82
1986,2.43
1987,2.16
1988,2.01
1989,1.99
1990,2.04
1991,2.14
1992,2.25
1993,2.35
1994,2.37
1995,2.31
1996,2.20
1997,2.04
1998,1.85
1999,1.65
2000,1.44
2001,1.25
2002,1.08
2003,0.95
2004,0.82
2005,0.73
2006,0.66
2007,0.63
2008,0.66
2009,0.76
2010,0.87
2011,1.03
2012,1.24
2013,1.48
2014,1.69
2015,1.82
2016,1.84
2017,1.82
2018,1.73
2019,1.59
2020,1.35
2021,1.05
2022,0.72
2023,0.40
2024,0.05
2025,-0.27
2026,-0.57
2027,-0.82
2028,-1.08
2029,-1.34
2030,-1.63
2031,-1.88
2032,-2.17
2033,-2.46
2034,-2.79
2035,-3.07
2036,-3.33
2037,-3.56
2038,-3.85
2039,-4.16
2040,-4.52
2041,-4.88
2042,-5.26
2043,-5.64
2044,-6.00
2045,-6.23
2046,-6.36
2047,-6.40
2048,-6.48
2049,-6.64
2050,-6.97
2051,-7.45
2052,-8.06
2053,-8.71
2054,-9.36
2055,-9.91
2056,-10.31
2057,-10.51
2058,-10.52
2059,-10.38
2060,-10.24
2061,-10.14
2062,-10.12
2063,-10.16
2064,-10.22
2065,-10.22
2066,-10.12
2067,-9.90
2068,-9.60
2069,-9.26
2070,-8.97
2071,-8.79
2072,-8.74
2073,-8.80
2074,-8.94
2075,-9.08
2076,-9.12
2077,-9.07
2078,-8.90
2079,-8.66
2080,-8.38
2081,-8.15
2082,-7.97
2083,-7.89
2084,-7.87
2085,-7.87
2086,-7.84
2087,-7.74
2088,-7.50
2089,-7.15
2090,-6.65
2091,-6.09
2092,-5.48
2093,-4.92
2094,-4.39
2095,-3.92
2096,-3.49
2097,-3.14
2098,-2.84
2099,-2.68
2100,-2.61
2101,-2.62
2102,-2.60
2103,-2.53
2104,-2.35
2105,-2.12
2106,-1.80
2107,-1.41
2108,-0.95
2109,-0.51
2110,-0.13
2111,0.14
2112,0.31
2113,0.40
2114,0.40
2115,0.31
2116,0.15
2117,0.01
2118,-0.11
2119,-0.23
2120,-0.40
2121,-0.60
2122,-0.82
2123,-1.05
2124,-1.37
2125,-1.75
2126,-2.18
2127,-2.56
2128,-2.91
2129,-3.29
2130,-3.78
2131,-4.34
2132,-4.95
2133,-5.55
2134,-6.14
2135,-6.67
2136,-7.10
2137,-7.38
2138,-7.49
2139,-7.45
2140,-7.29
2141,-7.06
2142,-6.77
2143,-6.47
2144,-6.14
2145,-5.76
2146,-5.32
2147,-4.85
2148,-4.36
2149,-3.88
2150,-3.40
2151,-3.02
2152,-2.75
2153,-2.61
2154,-2.51
2155,-2.42
2156,-2.23
2157,-1.97
2158,-1.58
2159,-1.14
2160,-0.66
2161,-0.25
2162,0.10
2163,0.33
2164,0.47
2165,0.55
2166,0.63
2167,0.77
2168,1.03
2169,1.35
2170,1.71
2171,2.04
2172,2.35
2173,2.61
2174,2.82
2175,2.96
2176,3.12
2177,3.30
2178,3.59
2179,3.94
2180,4.39
2181,4.87
2182,5.35
2183,5.76
2184,6.13
2185,6.45
2186,6.77
2187,7.06
2188,7.34
2189,7.60
2190,7.86
2191,8.07
2192,8.20
2193,8.21
2194,8.06
2195,7.76
2196,7.32
2197,6.77
2198,6.20
2199,5.68
2200,5.27
2201,5.00
2202,4.87
2203,4.84
2204,4.90
2205,5.00
2206,5.07
2207,5.07
2208,5.00
2209,4.88
2210,4.73
2211,4.59
2212,4.44
2213,4.36
2214,4.34
2215,4.37
2216,4.39
2217,4.37
2218,4.29
2219,4.14
2220,3.89
2221,3.56
2222,3.20
2223,2.87
2224,2.59
2225,2.39
2226,2.24
2227,2.17
2228,2.11
2229,2.08
2230,2.07
2231,2.08
2232,2.06
2233,2.01
2234,1.89
2235,1.72
2236,1.46
2237,1.14
2238,0.75
2239,0.34
2240,-0.12
2241,-0.56
2242,-0.98
2243,-1.34
2244,-1.66
2245,-1.91
2246,-2.15
2247,-2.39
2248,-2.64
2249,-2.90
2250,-3.19
2251,-3.52
2252,-3.91
2253,-4.33
2254,-4.73
2255,-5.03
2256,-5.23
2257,-5.31
2258,-5.29
2259,-5.13
2260,-4.87
2261,-4.53
2262,-4.20
2263,-3.93
2264,-3.73
2265,-3.59
2266,-3.44
2267,-3.27
2268,-3.05
2269,-2.83
2270,-2.56
2271,-2.27
2272,-1.91
2273,-1.56
2274,-1.21
2275,-0.86
2276,-0.43
2277,0.05
2278,0.66
2279,1.27
2280,1.92
2281,2.52
2282,3.05
2283,3.43
2284,3.67
2285,3.74
2286,3.76
2287,3.81
2288,3.95
2289,4.20
2290,4.49
2291,4.78
2292,4.97
2293,5.00
2294,4.81
2295,4.43
2296,3.90
2297,3.33
2298,2.75
2299,2.21
2300,1.73
2301,1.33
2302,0.92
2303,0.46
2304,-0.14
2305,-0.86
2306,-1.68
2307,-2.46
2308,-3.11
2309,-3.56
2310,-3.81
2311,-3.86
2312,-3.75
2313,-3.50
2314,-3.23
2315,-2.97
2316,-2.76
2317,-2.59
2318,-2.46
2319,-2.33
2320,-2.19
2321,-2.02
2322,-1.81
2323,-1.56
2324,-1.29
2325,-1.03
2326,-0.79
2327,-0.61
2328,-0.44
2329,-0.27
2330,-0.10
2331,0.06
2332,0.17
2333,0.20
2334,0.12
2335,-0.08
2336,-0.43
2337,-0.88
2338,-1.40
2339,-1.90
2340,-2.37
2341,-2.76
2342,-3.09
2343,-3.32
2344,-3.46
2345,-3.52
2346,-3.56
2347,-3.61
2348,-3.67
2349,-3.70
2350,-3.70
2351,-3.64
2352,-3.49
2353,-3.25
2354,-2.94
2355,-2.58
2356,-2.19
2357,-1.81
2358,-1.43
2359,-1.15
2360,-0.92
2361,-0.72
2362,-0.46
2363,-0.18
2364,0.15
2365,0.47
2366,0.83
2367,1.17
2368,1.52
2369,1.80
2370,2.09
2371,2.37
2372,2.74
2373,3.17
2374,3.72
2375,4.30
2376,4.97
2377,5.65
2378,6.34
2379,6.96
2380,7.53
2381,8.00
2382,8.39
2383,8.63
2384,8.71
2385,8.61
2386,8.39
2387,8.07
2388,7.72
2389,7.36
2390,7.05
2391,6.81
2392,6.62
2393,6.55
2394,6.57
2395,6.66
2396,6.73
2397,6.74
2398,6.69
2399,6.57
2400,6.32
2401,5.94
2402,5.46
2403,4.98
2404,4.52
2405,4.15
2406,3.81
2407,3.56
2408,3.33
2409,3.14
2410,2.87
2411,2.49
2412,1.98
2413,1.43
2414,0.83
2415,0.27
2416,-0.27
2417,-0.73
2418,-1.16
2419,-1.53
2420,-1.94
2421,-2.37
2422,-2.91
2423,-3.52
2424,-4.26
2425,-5.00
2426,-5.69
2427,-6.26
2428,-6.73
2429,-7.10
2430,-7.41
2431,-7.64
2432,-7.87
2433,-8.03
2434,-8.13
2435,-8.09
2436,-7.97
2437,-7.71
2438,-7.37
2439,-6.98
2440,-6.63
2441,-6.38
2442,-6.25
2443,-6.22
2444,-6.31
2445,-6.49
2446,-6.72
2447,-6.93
2448,-7.10
2449,-7.25
2450,-7.39
2451,-7.54
2452,-7.71
2453,-7.89
2454,-8.06
2455,-8.21
2456,-8.35
2457,-8.43
2458,-8.46
2459,-8.43
2460,-8.37
2461,-8.34
2462,-8.35
2463,-8.41
2464,-8.50
2465,-8.59
2466,-8.66
2467,-8.70
2468,-8.67
2469,-8.58
2470,-8.44
2471,-8.29
2472,-8.15
2473,-8.03
2474,-7.93
2475,-7.85
2476,-7.77
2477,-7.69
2478,-7.53
2479,-7.30
2480,-6.99
2481,-6.63
2482,-6.22
2483,-5.81
2484,-5.38
2485,-5.00
2486,-4.66
2487,-4.37
2488,-4.08
2489,-3.80
2490,-3.47
2491,-3.09
2492,-2.58
2493,-2.02
2494,-1.47
2495,-1.02
2496,-0.66
2497,-0.40
2498,-0.23
2499,-0.17
2500,-0.21
2501,-0.34
2502,-0.50
2503,-0.71
2504,-1.00
2505,-1.32
2506,-1.65
2507,-1.99
2508,-2.36
2509,-2.74
2510,-3.07
2511,-3.36
2512,-3.60
2513,-3.80
2514,-3.92
2515,-3.93
2516,-3.85
2517,-3.69
2518,-3.44
2519,-3.14
2520,-2.86
2521,-2.68
2522,-2.58
2523,-2.53
2524,-2.49
2525,-2.40
2526,-2.23
2527,-1.96
2528,-1.61
2529,-1.25
2530,-0.92
2531,-0.71
2532,-0.66
2533,-0.79
2534,-1.02
2535,-1.28
2536,-1.46
2537,-1.49
2538,-1.34
2539,-1.04
2540,-0.65
2541,-0.28
2542,0.01
2543,0.15
2544,0.16
2545,0.07
2546,-0.07
2547,-0.20
2548,-0.27
2549,-0.27
2550,-0.19
2551,-0.06
2552,0.05
2553,0.11
2554,0.11
2555,0.06
2556,-0.07
2557,-0.27
2558,-0.61
2559,-1.05
2560,-1.59
2561,-2.17
2562,-2.85
2563,-3.57
2564,-4.31
2565,-4.94
2566,-5.38
2567,-5.62
2568,-5.72
2569,-5.74
2570,-5.71
2571,-5.65
2572,-5.59
2573,-5.56
2574,-5.53
2575,-5.46
2576,-5.26
2577,-4.94
2578,-4.46
2579,-3.89
2580,-3.27
2581,-2.68
2582,-2.10
2583,-1.57
2584,-1.07
2585,-0.60
2586,-0.12
2587,0.38
2588,0.96
2589,1.55
2590,2.11
2591,2.53
2592,2.77
2593,2.79
2594,2.63
2595,2.29
2596,1.85
2597,1.39
2598,1.03
2599,0.81
2600,0.74
2601,0.80
2602,0.99
2603,1.27
2604,1.56
2605,1.84
2606,2.05
2607,2.21
2608,2.29
2609,2.29
2610,2.20
2611,2.06
2612,1.85
2613,1.55
2614,1.14
2615,0.63
2616,0.08
2617,-0.47
2618,-1.00
2619,-1.48
2620,-1.83
2621,-2.01
2622,-2.05
2623,-1.95
2624,-1.72
2625,-1.40
2626,-1.01
2627,-0.62
2628,-0.24
2629,0.08
2630,0.34
2631,0.55
2632,0.75
2633,0.95
2634,1.19
2635,1.47
2636,1.86
2637,2.36
2638,3.01
2639,3.69
2640,4.36
2641,4.85
2642,5.21
2643,5.41
2644,5.51
2645,5.52
2646,5.55
2647,5.62
2648,5.84
2649,6.16
2650,6.56
2651,6.95
2652,7.29
2653,7.49
2654,7.55
2655,7.49
2656,7.39
2657,7.27
2658,7.21
2659,7.21
2660,7.33
2661,7.53
2662,7.77
2663,7.98
2664,8.21
2665,8.47
2666,8.77
2667,9.11
2668,9.47
2669,9.79
2670,10.03
2671,10.12
2672,10.07
2673,9.89
2674,9.58
2675,9.19
2676,8.77
2677,8.38
2678,8.03
2679,7.73
2680,7.50
2681,7.35
2682,7.26
2683,7.20
2684,7.16
2685,7.12
2686,7.13
2687,7.19
2688,7.31
2689,7.45
2690,7.62
2691,7.80
2692,8.01
2693,8.25
2694,8.50
2695,8.74
2696,8.96
2697,9.11
2698,9.17
2699,9.14
2700,9.06
2701,8.96
2702,8.86
2703,8.78
2704,8.72
2705,8.66
2706,8.56
2707,8.42
2708,8.22
2709,7.97
2710,7.69
2711,7.39
2712,7.11
2713,6.87
2714,6.66
2715,6.49
2716,6.35
2717,6.23
2718,6.11
2719,6.00
2720,5.87
2721,5.78
2722,5.74
2723,5.74
2724,5.79
2725,5.91
2726,6.10
2727,6.32
2728,6.50
2729,6.60
2730,6.56
2731,6.42
2732,6.17
2733,5.87
2734,5.53
2735,5.23
2736,5.02
2737,4.89
2738,4.84
2739,4.81
2740,4.84
2741,4.88
2742,4.97
2743,5.11
2744,5.39
2745,5.76
2746,6.20
2747,6.68
2748,7.24
2749,7.80
2750,8.32
2751,8.71
2752,8.98
2753,9.14
2754,9.28
2755,9.41
2756,9.64
2757,9.99
2758,10.48
2759,11.02
2760,11.57
2761,12.02
2762,12.32
2763,12.41
2764,12.28
2765,11.97
2766,11.57
2767,11.18
2768,10.87
2769,10.70
2770,10.61
2771,10.60
2772,10.57
2773,10.49
2774,10.29
2775,10.00
2776,9.62
2777,9.23
2778,8.83
2779,8.49
2780,8.16
2781,7.80
2782,7.35
2783,6.83
2784,6.23
2785,5.60
2786,4.94
2787,4.31
2788,3.80
2789,3.50
2790,3.40
2791,3.47
2792,3.65
2793,3.91
2794,4.13
2795,4.29
2796,4.35
2797,4.35
2798,4.30
2799,4.23
2800,4.20
2801,4.23
2802,4.33
2803,4.47
2804,4.66
2805,4.88
2806,5.10
2807,5.31
2808,5.48
2809,5.60
2810,5.69
2811,5.78
2812,5.87
2813,5.93
2814,5.92
2815,5.83
2816,5.69
2817,5.51
2818,5.27
2819,4.97
2820,4.64
2821,4.31
2822,4.01
2823,3.74
2824,3.49
2825,3.28
2826,3.14
2827,3.04
2828,2.98
2829,2.93
2830,2.87
2831,2.82
2832,2.75
2833,2.69
2834,2.65
2835,2.64
2836,2.70
2837,2.85
2838,3.11
2839,3.41
2840,3.71
2841,3.97
2842,4.23
2843,4.49
2844,4.78
2845,5.04
2846,5.29
2847,5.53
2848,5.76
2849,5.97
2850,6.16
2851,6.27
2852,6.30
2853,6.27
2854,6.23
2855,6.20
2856,6.15
2857,6.10
2858,6.06
2859,6.03
2860,5.98
2861,5.90
2862,5.76
2863,5.61
2864,5.45
2865,5.31
2866,5.17
2867,5.02
2868,4.82
2869,4.59
2870,4.31
2871,3.98
2872,3.57
2873,3.14
2874,2.72
2875,2.37
2876,2.14
2877,2.06
2878,2.14
2879,2.33
2880,2.51
2881,2.64
2882,2.69
2883,2.69
2884,2.60
2885,2.46
2886,2.32
2887,2.29
2888,2.38
2889,2.56
2890,2.76
2891,2.93
2892,3.01
2893,2.95
2894,2.68
2895,2.24
2896,1.71
2897,1.22
2898,0.80
2899,0.52
2900,0.35
2901,0.31
2902,0.25
2903,0.12
2904,-0.18
2905,-0.63
2906,-1.22
2907,-1.85
2908,-2.45
2909,-2.89
2910,-3.16
2911,-3.24
2912,-3.20
2913,-3.07
2914,-2.90
2915,-2.72
2916,-2.56
2917,-2.41
2918,-2.24
2919,-2.03
2920,-1.80
2921,-1.56
2922,-1.30
2923,-1.04
2924,-0.78
2925,-0.57
2926,-0.40
2927,-0.29
2928,-0.22
2929,-0.23
2930,-0.27
2931,-0.34
2932,-0.40
2933,-0.43
2934,-0.41
2935,-0.35
2936,-0.27
2937,-0.21
2938,-0.16
2939,-0.11
2940,-0.02
2941,0.08
2942,0.25
2943,0.46
2944,0.73
2945,1.03
2946,1.34
2947,1.59
2948,1.83
2949,2.00
2950,2.12
2951,2.17
2952,2.21
2953,2.29
2954,2.49
2955,2.81
2956,3.26
2957,3.76
2958,4.33
2959,4.89
2960,5.44
2961,5.88
2962,6.20
2963,6.37
2964,6.47
2965,6.54
2966,6.67
2967,6.84
2968,7.07
2969,7.34
2970,7.65
2971,7.97
2972,8.30
2973,8.57
2974,8.78
2975,8.93
2976,9.01
2977,9.04
2978,9.03
2979,9.00
2980,8.96
2981,8.94
2982,8.88
2983,8.80
2984,8.67
2985,8.50
2986,8.23
2987,7.86
2988,7.32
2989,6.67
2990,5.92
2991,5.15
2992,4.36
2993,3.65
2994,3.03
2995,2.62
2996,2.40
2997,2.37
2998,2.39
2999,2.46
3000,2.51
3001,2.52
3002,2.41
3003,2.21
3004,1.92
3005,1.63
3006,1.33
3007,1.03
3008,0.73
3009,0.47
3010,0.24
3011,0.04
3012,-0.18
3013,-0.45
3014,-0.76
3015,-1.05
3016,-1.34
3017,-1.57
3018,-1.78
3019,-1.92
3020,-2.01
3021,-2.03
3022,-2.05
3023,-2.04
3024,-2.01
3025,-1.98
3026,-1.99
3027,-2.04
3028,-2.12
3029,-2.17
3030,-2.23
3031,-2.31
3032,-2.46
3033,-2.64
3034,-2.81
3035,-2.93
3036,-3.03
3037,-3.14
3038,-3.30
3039,-3.50
3040,-3.78
3041,-4.10
3042,-4.47
3043,-4.83
3044,-5.15
3045,-5.39
3046,-5.55
3047,-5.68
3048,-5.75
3049,-5.78
3050,-5.77
3051,-5.77
3052,-5.81
3053,-5.87
3054,-5.89
3055,-5.81
3056,-5.62
3057,-5.32
3058,-4.87
3059,-4.35
3060,-3.78
3061,-3.23
3062,-2.70
3063,-2.27
3064,-1.96
3065,-1.78
3066,-1.63
3067,-1.53
3068,-1.47
3069,-1.47
3070,-1.43
3071,-1.37
3072,-1.27
3073,-1.24
3074,-1.25
3075,-1.31
3076,-1.45
3077,-1.65
3078,-1.91
3079,-2.18
3080,-2.45
3081,-2.68
3082,-2.91
3083,-3.13
3084,-3.42
3085,-3.77
3086,-4.23
3087,-4.72
3088,-5.26
3089,-5.80
3090,-6.37
3091,-6.89
3092,-7.37
3093,-7.74
3094,-8.09
3095,-8.44
3096,-8.83
3097,-9.21
3098,-9.60
3099,-9.96
3100,-10.30
3101,-10.55
3102,-10.73
3103,-10.85
3104,-10.97
3105,-11.11
3106,-11.27
3107,-11.43
3108,-11.57
3109,-11.63
3110,-11.55
3111,-11.32
3112,-10.93
3113,-10.41
3114,-9.81
3115,-9.22
3116,-8.70
3117,-8.32
3118,-8.00
3119,-7.74
3120,-7.52
3121,-7.32
3122,-7.05
3123,-6.71
3124,-6.26
3125,-5.80
3126,-5.27
3127,-4.75
3128,-4.20
3129,-3.69
3130,-3.21
3131,-2.85
3132,-2.56
3133,-2.39
3134,-2.25
3135,-2.17
3136,-2.12
3137,-2.11
3138,-2.04
3139,-1.91
3140,-1.66
3141,-1.37
3142,-1.01
3143,-0.66
3144,-0.30
3145,0.02
3146,0.31
3147,0.51
3148,0.68
3149,0.82
3150,0.95
3151,1.11
3152,1.29
3153,1.44
3154,1.48
3155,1.38
3156,1.11
3157,0.68
3158,0.11
3159,-0.55
3160,-1.23
3161,-1.83
3162,-2.33
3163,-2.71
3164,-2.98
3165,-3.15
3166,-3.30
3167,-3.44
3168,-3.62
3169,-3.78
3170,-3.99
3171,-4.20
3172,-4.39
3173,-4.51
3174,-4.51
3175,-4.42
3176,-4.31
3177,-4.20
3178,-4.13
3179,-4.10
3180,-4.17
3181,-4.31
3182,-4.49
3183,-4.68
3184,-4.88
3185,-5.07
3186,-5.28
3187,-5.49
3188,-5.74
3189,-6.04
3190,-6.34
3191,-6.61
3192,-6.86
3193,-7.06
3194,-7.20
3195,-7.23
3196,-7.16
3197,-7.03
3198,-6.90
3199,-6.77
3200,-6.68
3201,-6.63
3202,-6.61
3203,-6.65
3204,-6.68
3205,-6.69
3206,-6.61
3207,-6.46
3208,-6.26
3209,-6.05
3210,-5.86
3211,-5.74
3212,-5.71
3213,-5.81
3214,-6.00
3215,-6.26
3216,-6.48
3217,-6.68
3218,-6.78
3219,-6.79
3220,-6.63
3221,-6.35
3222,-5.94
3223,-5.44
3224,-4.79
3225,-4.06
3226,-3.24
3227,-2.44
3228,-1.63
3229,-0.87
3230,-0.14
3231,0.50
3232,1.15
3233,1.74
3234,2.39
3235,3.03
3236,3.78
3237,4.56
3238,5.42
3239,6.24
3240,7.09
3241,7.84
3242,8.54
3243,9.13
3244,9.67
3245,10.12
3246,10.55
3247,10.89
3248,11.23
3249,11.55
3250,11.90
3251,12.22
3252,12.51
3253,12.71
3254,12.86
3255,12.99
3256,13.08
3257,13.14
3258,13.16
3259,13.16
3260,13.17
3261,13.16
3262,13.11
3263,13.03
3264,12.92
3265,12.77
3266,12.55
3267,12.25
3268,11.91
3269,11.57
3270,11.25
3271,10.92
3272,10.63
3273,10.47
3274,10.51
3275,10.72
3276,11.05
3277,11.44
3278,11.89
3279,12.37
3280,12.83
3281,13.19
3282,13.45
3283,13.63
3284,13.75
3285,13.81
3286,13.79
3287,13.70
3288,13.55
3289,13.37
3290,13.18
3291,12.97
3292,12.74
3293,12.54
3294,12.35
3295,12.13
3296,11.76
3297,11.23
3298,10.52
3299,9.72
3300,8.80
3301,7.89
3302,6.99
3303,6.23
3304,5.58
3305,5.08
3306,4.67
3307,4.36
3308,4.08
3309,3.82
3310,3.51
3311,3.23
3312,2.96
3313,2.78
3314,2.67
3315,2.66
3316,2.72
3317,2.84
3318,2.96
3319,3.03
3320,3.02
3321,2.92
3322,2.75
3323,2.57
3324,2.43
3325,2.37
3326,2.37
3327,2.40
3328,2.46
3329,2.52
3330,2.57
3331,2.62
3332,2.73
3333,2.91
3334,3.14
3335,3.42
3336,3.73
3337,4.02
3338,4.27
3339,4.45
3340,4.58
3341,4.70
3342,4.83
3343,4.97
3344,5.14
3345,5.33
3346,5.51
3347,5.62
3348,5.63
3349,5.52
3350,5.31
3351,5.03
3352,4.70
3353,4.41
3354,4.20
3355,4.10
3356,4.10
3357,4.21
3358,4.38
3359,4.57
3360,4.65
3361,4.60
3362,4.41
3363,4.14
3364,3.80
3365,3.41
3366,2.99
3367,2.64
3368,2.40
3369,2.31
3370,2.33
3371,2.41
3372,2.45
3373,2.41
3374,2.17
3375,1.79
3376,1.28
3377,0.75
3378,0.20
3379,-0.27
3380,-0.67
3381,-1.01
3382,-1.39
3383,-1.83
3384,-2.39
3385,-2.98
3386,-3.59
3387,-4.16
3388,-4.68
3389,-5.03
3390,-5.19
3391,-5.15
3392,-5.01
3393,-4.81
3394,-4.59
3395,-4.35
3396,-4.15
3397,-4.00
3398,-3.87
3399,-3.70
3400,-3.45
3401,-3.15
3402,-2.82
3403,-2.49
3404,-2.15
3405,-1.83
3406,-1.53
3407,-1.29
3408,-1.12
3409,-1.01
3410,-0.90
3411,-0.79
3412,-0.66
3413,-0.51
3414,-0.31
3415,-0.08
3416,0.20
3417,0.50
3418,0.82
3419,1.10
3420,1.36
3421,1.56
3422,1.76
3423,1.95
3424,2.20
3425,2.49
3426,2.88
3427,3.33
3428,3.80
3429,4.24
3430,4.68
3431,5.06
3432,5.38
3433,5.58
3434,5.69
3435,5.71
3436,5.70
3437,5.66
3438,5.62
3439,5.52
3440,5.42
3441,5.31
3442,5.29
3443,5.34
3444,5.50
3445,5.74
3446,6.03
3447,6.36
3448,6.73
3449,7.10
3450,7.51
3451,7.93
3452,8.37
3453,8.81
3454,9.26
3455,9.71
3456,10.17
3457,10.58
3458,10.90
3459,11.12
3460,11.26
3461,11.34
3462,11.34
3463,11.26
3464,11.12
3465,10.94
3466,10.70
3467,10.38
3468,9.97
3469,9.52
3470,9.03
3471,8.53
3472,8.00
3473,7.50
3474,7.03
3475,6.65
3476,6.32
3477,6.10
3478,5.93
3479,5.82
3480,5.70
3481,5.59
3482,5.46
3483,5.39
3484,5.33
3485,5.31
3486,5.27
3487,5.22
3488,5.12
3489,4.97
3490,4.75
3491,4.39
3492,3.89
3493,3.30
3494,2.65
3495,2.04
3496,1.54
3497,1.21
3498,1.08
3499,1.17
3500,1.46
3501,1.88
3502,2.37
3503,2.86
3504,3.30
3505,3.68
3506,4.03
3507,4.35
3508,4.67
3509,4.99
3510,5.38
3511,5.79
3512,6.22
3513,6.58
3514,6.86
3515,7.02
3516,7.10
3517,7.10
3518,7.05
3519,6.98
3520,6.92
3521,6.86
3522,6.82
3523,6.82
3524,6.87
3525,6.93
3526,6.95
3527,6.90
3528,6.75
3529,6.54
3530,6.28
3531,6.00
3532,5.74
3533,5.56
3534,5.52
3535,5.63
3536,5.90
3537,6.30
3538,6.78
3539,7.27
3540,7.67
3541,7.94
3542,8.10
3543,8.15
3544,8.10
3545,7.99
3546,7.85
3547,7.73
3548,7.61
3549,7.46
3550,7.28
3551,7.04
3552,6.73
3553,6.35
3554,5.88
3555,5.44
3556,5.03
3557,4.71
3558,4.45
3559,4.26
3560,4.05
3561,3.83
3562,3.49
3563,3.10
3564,2.59
3565,2.00
3566,1.27
3567,0.52
3568,-0.24
3569,-0.92
3570,-1.60
3571,-2.24
3572,-2.86
3573,-3.42
3574,-3.99
3575,-4.51
3576,-5.00
3577,-5.42
3578,-5.80
3579,-6.10
3580,-6.37
3581,-6.55
3582,-6.68
3583,-6.76
3584,-6.80
3585,-6.80
3586,-6.77
3587,-6.75
3588,-6.71
3589,-6.68
3590,-6.67
3591,-6.68
3592,-6.68
3593,-6.62
3594,-6.45
3595,-6.16
3596,-5.73
3597,-5.19
3598,-4.55
3599,-3.90
3600,-3.27
3601,-2.70
3602,-2.20
3603,-1.79
3604,-1.43
3605,-1.21
3606,-1.08
3607,-1.03
3608,-1.01
3609,-1.08
3610,-1.23
3611,-1.45
3612,-1.65
3613,-1.78
3614,-1.79
3615,-1.70
3616,-1.51
3617,-1.27
3618,-1.01
3619,-0.80
3620,-0.66
3621,-0.58
3622,-0.49
3623,-0.38
3624,-0.24
3625,-0.05
3626,0.18
3627,0.42
3628,0.62
3629,0.74
3630,0.78
3631,0.77
3632,0.75
3633,0.72
3634,0.69
3635,0.67
3636,0.63
3637,0.57
3638,0.48
3639,0.36
3640,0.21
3641,0.02
3642,-0.16
3643,-0.29
3644,-0.29
3645,-0.18
3646,0.03
3647,0.27
3648,0.55
3649,0.85
3650,1.14
3651,1.37
3652,1.57
3653,1.74
3654,1.95
3655,2.21
3656,2.56
3657,2.97
3658,3.46
3659,3.99
3660,4.55
3661,5.05
3662,5.49
3663,5.82
3664,6.02
3665,6.07
3666,6.03
3667,5.93
3668,5.81
3669,5.69
3670,5.61
3671,5.54
3672,5.50
3673,5.50
3674,5.58
3675,5.73
3676,5.92
3677,6.13
3678,6.36
3679,6.58
3680,6.72
3681,6.75
3682,6.67
3683,6.55
3684,6.43
3685,6.34
3686,6.26
3687,6.24
3688,6.27
3689,6.34
3690,6.36
3691,6.27
3692,6.07
3693,5.80
3694,5.48
3695,5.14
3696,4.85
3697,4.65
3698,4.52
3699,4.46
3700,4.43
3701,4.43
3702,4.49
3703,4.57
3704,4.68
3705,4.79
3706,4.97
3707,5.26
3708,5.68
3709,6.13
3710,6.58
3711,6.96
3712,7.30
3713,7.56
3714,7.76
3715,7.90
3716,8.05
3717,8.28
3718,8.67
3719,9.17
3720,9.75
3721,10.28
3722,10.75
3723,11.04
3724,11.15
3725,11.05
3726,10.82
3727,10.54
3728,10.30
3729,10.18
3730,10.23
3731,10.43
3732,10.76
3733,11.15
3734,11.59
3735,12.00
3736,12.34
3737,12.59
3738,12.76
3739,12.87
3740,12.92
3741,12.93
3742,12.91
3743,12.81
3744,12.60
3745,12.28
3746,11.89
3747,11.45
3748,11.00
3749,10.58
3750,10.27
3751,10.12
3752,10.11
3753,10.21
3754,10.37
3755,10.57
3756,10.80
3757,11.02
3758,11.24
3759,11.47
3760,11.71
3761,11.96
3762,12.20
3763,12.41
3764,12.54
3765,12.57
3766,12.50
3767,12.33
3768,12.02
3769,11.63
3770,11.22
3771,10.93
3772,10.75
3773,10.68
3774,10.60
3775,10.48
3776,10.19
3777,9.73
3778,9.00
3779,8.13
3780,7.12
3781,6.13
3782,5.16
3783,4.34
3784,3.68
3785,3.23
3786,2.81
3787,2.38
3788,1.88
3789,1.38
3790,0.85
3791,0.39
3792,-0.02
3793,-0.31
3794,-0.54
3795,-0.66
3796,-0.76
3797,-0.85
3798,-1.01
3799,-1.24
3800,-1.53
3801,-1.79
3802,-2.03
3803,-2.18
3804,-2.24
3805,-2.20
3806,-2.11
3807,-2.01
3808,-1.96
3809,-1.98
3810,-1.98
3811,-1.96
3812,-1.85
3813,-1.63
3814,-1.22
3815,-0.63
3816,0.18
3817,1.04
3818,1.88
3819,2.60
3820,3.21
3821,3.68
3822,4.00
3823,4.15
3824,4.17
3825,4.10
3826,3.98
3827,3.82
3828,3.68
3829,3.56
3830,3.47
3831,3.40
3832,3.37
3833,3.41
3834,3.52
3835,3.67
3836,3.80
3837,3.90
3838,3.95
3839,3.99
3840,3.95
3841,3.81
3842,3.52
3843,3.14
3844,2.69
3845,2.24
3846,1.80
3847,1.39
3848,1.00
3849,0.68
3850,0.38
3851,0.10
3852,-0.24
3853,-0.60
3854,-0.96
3855,-1.24
3856,-1.49
3857,-1.65
3858,-1.80
3859,-1.91
3860,-2.03
3861,-2.19
3862,-2.50
3863,-2.94
3864,-3.50
3865,-4.13
3866,-4.81
3867,-5.47
3868,-6.04
3869,-6.46
3870,-6.76
3871,-6.96
3872,-7.08
3873,-7.15
3874,-7.16
3875,-7.13
3876,-7.04
3877,-6.92
3878,-6.78
3879,-6.60
3880,-6.36
3881,-6.07
3882,-5.74
3883,-5.41
3884,-5.06
3885,-4.71
3886,-4.35
3887,-3.99
3888,-3.60
3889,-3.23
3890,-2.88
3891,-2.61
3892,-2.40
3893,-2.24
3894,-2.07
3895,-1.90
3896,-1.68
3897,-1.43
3898,-1.07
3899,-0.66
3900,-0.19
3901,0.28
3902,0.79
3903,1.28
3904,1.79
3905,2.26
3906,2.72
3907,3.16
3908,3.63
3909,4.07
3910,4.47
3911,4.79
3912,5.07
3913,5.29
3914,5.48
3915,5.60
3916,5.71
3917,5.78
3918,5.84
3919,5.87
3920,5.90
3921,5.92
3922,5.94
3923,5.91
3924,5.85
3925,5.78
3926,5.74
3927,5.74
3928,5.80
3929,5.84
3930,5.87
3931,5.91
3932,5.98
3933,6.07
3934,6.13
3935,6.16
3936,6.20
3937,6.29
3938,6.42
3939,6.57
3940,6.73
3941,6.94
3942,7.23
3943,7.52
3944,7.75
3945,7.84
3946,7.83
3947,7.69
3948,7.48
3949,7.24
3950,7.07
3951,7.03
3952,7.14
3953,7.39
3954,7.74
3955,8.17
3956,8.58
3957,8.85
3958,8.93
3959,8.82
3960,8.64
3961,8.48
3962,8.42
3963,8.47
3964,8.66
3965,8.96
3966,9.38
3967,9.82
3968,10.25
3969,10.60
3970,10.93
3971,11.25
3972,11.58
3973,11.91
3974,12.24
3975,12.54
3976,12.78
3977,12.90
3978,12.89
3979,12.73
3980,12.47
3981,12.15
3982,11.79
3983,11.39
3984,10.96
3985,10.57
3986,10.28
3987,10.10
3988,10.01
3989,9.99
3990,10.02
3991,10.12
3992,10.22
3993,10.30
3994,10.25
3995,10.09
3996,9.77
3997,9.32
3998,8.71
3999,8.00
4000,7.23
4001,6.48
4002,5.78
4003,5.18
4004,4.71
4005,4.39
4006,4.17
4007,4.02
4008,3.94
4009,3.94
4010,4.01
4011,4.14
4012,4.30
4013,4.46
4014,4.68
4015,4.94
4016,5.28
4017,5.63
4018,6.00
4019,6.36
4020,6.72
4021,7.07
4022,7.45
4023,7.79
4024,8.14
4025,8.46
4026,8.80
4027,9.12
4028,9.45
4029,9.80
4030,10.19
4031,10.57
4032,10.93
4033,11.18
4034,11.25
4035,11.10
4036,10.74
4037,10.22
4038,9.64
4039,9.10
4040,8.66
4041,8.39
4042,8.31
4043,8.42
4044,8.62
4045,8.87
4046,9.06
4047,9.16
4048,9.11
4049,8.94
4050,8.64
4051,8.26
4052,7.77
4053,7.24
4054,6.66
4055,6.10
4056,5.57
4057,5.13
4058,4.75
4059,4.52
4060,4.42
4061,4.46
4062,4.55
4063,4.63
4064,4.62
4065,4.52
4066,4.37
4067,4.23
4068,4.11
4069,4.06
4070,4.03
4071,4.01
4072,3.94
4073,3.80
4074,3.55
4075,3.21
4076,2.86
4077,2.55
4078,2.34
4079,2.27
4080,2.39
4081,2.66
4082,3.04
4083,3.44
4084,3.80
4085,4.09
4086,4.33
4087,4.53
4088,4.74
4089,4.94
4090,5.17
4091,5.41
4092,5.64
4093,5.78
4094,5.84
4095,5.76
4096,5.64
4097,5.50
4098,5.45
4099,5.49
4100,5.71
4101,6.10
4102,6.65
4103,7.24
4104,7.84
4105,8.30
4106,8.67
4107,8.90
4108,9.06
4109,9.15
4110,9.29
4111,9.48
4112,9.83
4113,10.26
4114,10.80
4115,11.37
4116,11.93
4117,12.41
4118,12.80
4119,13.11
4120,13.43
4121,13.71
4122,14.01
4123,14.31
4124,14.65
4125,14.99
4126,15.33
4127,15.59
4128,15.81
4129,15.98
4130,16.12
4131,16.24
4132,16.36
4133,16.50
4134,16.71
4135,16.95
4136,17.19
4137,17.40
4138,17.59
4139,17.77
4140,17.91
4141,18.01
4142,18.03
4143,18.00
4144,17.93
4145,17.81
4146,17.61
4147,17.36
4148,17.04
4149,16.73
4150,16.33
4151,15.91
4152,15.39
4153,14.87
4154,14.26
4155,13.63
4156,12.89
4157,12.18
4158,11.38
4159,10.59
4160,9.74
4161,8.96
4162,8.19
4163,7.50
4164,6.76
4165,6.03
4166,5.25
4167,4.49
4168,3.69
4169,2.90
4170,2.07
4171,1.31
4172,0.59
4173,-0.03
4174,-0.60
4175,-1.05
4176,-1.44
4177,-1.69
4178,-1.88
4179,-2.00
4180,-2.07
4181,-2.05
4182,-2.01
4183,-1.94
4184,-1.92
4185,-1.94
4186,-2.00
4187,-2.09
4188,-2.27
4189,-2.46
4190,-2.63
4191,-2.74
4192,-2.78
4193,-2.81
4194,-2.78
4195,-2.70
4196,-2.56
4197,-2.38
4198,-2.15
4199,-1.83
4200,-1.36
4201,-0.82
4202,-0.29
4203,0.10
4204,0.34
4205,0.41
4206,0.37
4207,0.21
4208,0.03
4209,-0.11
4210,-0.11
4211,0.02
4212,0.36
4213,0.84
4214,1.41
4215,1.92
4216,2.30
4217,2.50
4218,2.59
4219,2.57
4220,2.53
4221,2.48
4222,2.53
4223,2.68
4224,2.91
4225,3.11
4226,3.29
4227,3.36
4228,3.38
4229,3.33
4230,3.30
4231,3.32
4232,3.47
4233,3.75
4234,4.23
4235,4.84
4236,5.63
4237,6.52
4238,7.50
4239,8.42
4240,9.25
4241,9.86
4242,10.31
4243,10.59
4244,10.79
4245,10.89
4246,10.99
4247,11.12
4248,11.41
4249,11.78
4250,12.23
4251,12.66
4252,13.05
4253,13.34
4254,13.50
4255,13.50
4256,13.37
4257,13.15
4258,12.89
4259,12.61
4260,12.38
4261,12.23
4262,12.17
4263,12.21
4264,12.32
4265,12.50
4266,12.70
4267,12.92
4268,13.13
4269,13.28
4270,13.31
4271,13.22
4272,13.05
4273,12.83
4274,12.61
4275,12.42
4276,12.33
4277,12.35
4278,12.53
4279,12.82
4280,13.21
4281,13.63
4282,14.07
4283,14.48
4284,14.87
4285,15.22
4286,15.59
4287,15.98
4288,16.37
4289,16.72
4290,17.06
4291,17.32
4292,17.52
4293,17.64
4294,17.72
4295,17.77
4296,17.80
4297,17.84
4298,17.88
4299,17.88
4300,17.76
4301,17.54
4302,17.20
4303,16.78
4304,16.26
4305,15.70
4306,15.14
4307,14.63
4308,14.14
4309,13.64
4310,13.11
4311,12.60
4312,12.02
4313,11.41
4314,10.67
4315,9.96
4316,9.34
4317,8.90
4318,8.58
4319,8.42
4320,8.39
4321,8.53
4322,8.66
4323,8.69
4324,8.51
4325,8.18
4326,7.71
4327,7.24
4328,6.81
4329,6.52
4330,6.34
4331,6.33
4332,6.42
4333,6.56
4334,6.61
4335,6.54
4336,6.27
4337,5.88
4338,5.39
4339,4.88
4340,4.41
4341,4.03
4342,3.69
4343,3.41
4344,3.12
4345,2.82
4346,2.49
4347,2.14
4348,1.77
4349,1.41
4350,1.07
4351,0.80
4352,0.63
4353,0.55
4354,0.49
4355,0.43
4356,0.39
4357,0.41
4358,0.54
4359,0.79
4360,1.11
4361,1.51
4362,1.94
4363,2.36
4364,2.73
4365,3.03
4366,3.23
4367,3.33
4368,3.30
4369,3.15
4370,2.88
4371,2.55
4372,2.23
4373,1.95
4374,1.74
4375,1.63
4376,1.60
4377,1.67
4378,1.76
4379,1.83
4380,1.83
4381,1.77
4382,1.66
4383,1.56
4384,1.52
4385,1.55
4386,1.67
4387,1.88
4388,2.14
4389,2.41
4390,2.68
4391,2.88
4392,3.04
4393,3.12
4394,3.18
4395,3.23
4396,3.29
4397,3.34
4398,3.43
4399,3.56
4400,3.71
4401,3.85
4402,3.98
4403,4.10
4404,4.23
4405,4.36
4406,4.53
4407,4.71
4408,4.94
4409,5.20
4410,5.49
4411,5.79
4412,6.13
4413,6.48
4414,6.84
4415,7.21
4416,7.58
4417,7.89
4418,8.12
4419,8.24
4420,8.28
4421,8.22
4422,8.01
4423,7.66
4424,7.22
4425,6.80
4426,6.41
4427,6.06
4428,5.72
4429,5.42
4430,5.17
4431,4.94
4432,4.66
4433,4.33
4434,3.98
4435,3.65
4436,3.36
4437,3.18
4438,3.13
4439,3.22
4440,3.44
4441,3.74
4442,4.08
4443,4.44
4444,4.84
4445,5.25
4446,5.66
4447,6.05
4448,6.44
4449,6.82
4450,7.19
4451,7.42
4452,7.51
4453,7.40
4454,7.20
4455,6.95
4456,6.71
4457,6.48
4458,6.38
4459,6.43
4460,6.69
4461,7.08
4462,7.53
4463,7.94
4464,8.33
4465,8.68
4466,9.03
4467,9.35
4468,9.69
4469,10.06
4470,10.56
4471,11.15
4472,11.82
4473,12.48
4474,13.08
4475,13.53
4476,13.79
4477,13.85
4478,13.74
4479,13.49
4480,13.14
4481,12.74
4482,12.42
4483,12.22
4484,12.18
4485,12.28
4486,12.49
4487,12.73
4488,12.93
4489,13.06
4490,13.11
4491,13.08
4492,12.94
4493,12.76
4494,12.62
4495,12.58
4496,12.66
4497,12.85
4498,13.11
4499,13.44
4500,13.78
4501,14.08
4502,14.34
4503,14.47
4504,14.51
4505,14.50
4506,14.56
4507,14.74
4508,15.02
4509,15.35
4510,15.69
4511,16.04
4512,16.30
4513,16.40
4514,16.24
4515,15.89
4516,15.41
4517,14.86
4518,14.25
4519,13.66
4520,13.17
4521,12.85
4522,12.60
4523,12.34
4524,12.03
4525,11.71
4526,11.35
4527,11.01
4528,10.61
4529,10.24
4530,9.86
4531,9.54
4532,9.22
4533,8.92
4534,8.55
4535,8.15
4536,7.64
4537,7.11
4538,6.55
4539,6.09
4540,5.71
4541,5.46
4542,5.25
4543,5.11
4544,4.99
4545,4.91
4546,4.82
4547,4.75
4548,4.64
4549,4.52
4550,4.38
4551,4.26
4552,4.17
4553,4.11
4554,4.09
4555,4.08
4556,4.11
4557,4.20
4558,4.37
4559,4.64
4560,5.01
4561,5.45
4562,5.97
4563,6.54
4564,7.13
4565,7.62
4566,8.00
4567,8.26
4568,8.51
4569,8.77
4570,9.05
4571,9.34
4572,9.70
4573,10.09
4574,10.47
4575,10.73
4576,10.91
4577,11.01
4578,11.11
4579,11.18
4580,11.31
4581,11.51
4582,11.83
4583,12.21
4584,12.64
4585,13.04
4586,13.37
4587,13.60
4588,13.74
4589,13.82
4590,13.93
4591,14.11
4592,14.34
4593,14.62
4594,14.92
4595,15.18
4596,15.37
4597,15.40
4598,15.27
4599,14.96
4600,14.53
4601,14.05
4602,13.56
4603,13.11
4604,12.72
4605,12.42
4606,12.22
4607,12.12
4608,12.03
4609,11.95
4610,11.84
4611,11.75
4612,11.69
4613,11.70
4614,11.74
4615,11.81
4616,11.86
4617,11.86
4618,11.80
4619,11.68
4620,11.51
4621,11.30
4622,11.05
4623,10.83
4624,10.62
4625,10.44
4626,10.24
4627,10.02
4628,9.74
4629,9.44
4630,9.09
4631,8.78
4632,8.51
4633,8.31
4634,8.08
4635,7.83
4636,7.53
4637,7.21
4638,6.77
4639,6.26
4640,5.65
4641,5.05
4642,4.46
4643,3.96
4644,3.56
4645,3.30
4646,3.11
4647,2.98
4648,2.85
4649,2.76
4650,2.69
4651,2.64
4652,2.56
4653,2.49
4654,2.37
4655,2.22
4656,2.03
4657,1.82
4658,1.61
4659,1.43
4660,1.30
4661,1.27
4662,1.34
4663,1.50
4664,1.69
4665,1.90
4666,2.11
4667,2.28
4668,2.46
4669,2.66
4670,2.93
4671,3.28
4672,3.75
4673,4.25
4674,4.77
4675,5.23
4676,5.70
4677,6.10
4678,6.48
4679,6.80
4680,7.12
4681,7.44
4682,7.80
4683,8.11
4684,8.41
4685,8.64
4686,8.86
4687,9.05
4688,9.26
4689,9.47
4690,9.71
4691,9.96
4692,10.27
4693,10.57
4694,10.86
4695,11.09
4696,11.26
4697,11.34
4698,11.40
4699,11.45
4700,11.53
4701,11.62
4702,11.69
4703,11.70
4704,11.60
4705,11.36
4706,10.95
4707,10.41
4708,9.82
4709,9.30
4710,8.90
4711,8.67
4712,8.62
4713,8.77
4714,9.06
4715,9.43
4716,9.80
4717,10.14
4718,10.40
4719,10.58
4720,10.68
4721,10.73
4722,10.78
4723,10.84
4724,10.93
4725,11.02
4726,11.10
4727,11.15
4728,11.21
4729,11.26
4730,11.31
4731,11.34
4732,11.36
4733,11.36
4734,11.33
4735,11.28
4736,11.20
4737,11.08
4738,10.91
4739,10.73
4740,10.58
4741,10.53
4742,10.54
4743,10.57
4744,10.57
4745,10.51
4746,10.39
4747,10.22
4748,9.98
4749,9.70
4750,9.42
4751,9.21
4752,9.12
4753,9.19
4754,9.38
4755,9.64
4756,9.98
4757,10.36
4758,10.79
4759,11.19
4760,11.60
4761,11.98
4762,12.41
4763,12.86
4764,13.40
4765,13.96
4766,14.59
4767,15.19
4768,15.82
4769,16.40
4770,17.03
4771,17.60
4772,18.17
4773,18.70
4774,19.29
4775,19.89
4776,20.53
4777,21.12
4778,21.73
4779,22.30
4780,22.90
4781,23.42
4782,23.94
4783,24.38
4784,24.73
4785,24.97
4786,25.13
4787,25.25
4788,25.33
4789,25.36
4790,25.33
4791,25.26
4792,25.21
4793,25.15
4794,25.04
4795,24.84
4796,24.54
4797,24.20
4798,23.90
4799,23.70
4800,23.58
4801,23.57
4802,23.56
4803,23.53
4804,23.32
4805,22.93
4806,22.24
4807,21.35
4808,20.28
4809,19.22
4810,18.17
4811,17.33
4812,16.62
4813,16.09
4814,15.55
4815,14.99
4816,14.24
4817,13.33
4818,12.18
4819,10.99
4820,9.71
4821,8.53
4822,7.39
4823,6.44
4824,5.64
4825,5.03
4826,4.46
4827,3.98
4828,3.52
4829,3.15
4830,2.74
4831,2.33
4832,1.95
4833,1.66
4834,1.40
4835,1.17
4836,0.95
4837,0.76
4838,0.66
4839,0.67
4840,0.76
4841,0.91
4842,1.11
4843,1.34
4844,1.61
4845,1.91
4846,2.24
4847,2.53
4848,2.75
4849,2.88
4850,2.95
4851,2.97
4852,2.94
4853,2.91
4854,2.98
4855,3.17
4856,3.49
4857,3.85
4858,4.25
4859,4.60
4860,4.88
4861,5.03
4862,5.07
4863,5.04
4864,4.94
4865,4.81
4866,4.73
4867,4.73
4868,4.80
4869,4.88
4870,4.97
4871,5.06
4872,5.16
4873,5.24
4874,5.33
4875,5.42
4876,5.54
4877,5.71
4878,5.94
4879,6.17
4880,6.42
4881,6.71
4882,7.10
4883,7.51
4884,7.93
4885,8.25
4886,8.52
4887,8.75
4888,8.97
4889,9.11
4890,9.19
4891,9.21
4892,9.27
4893,9.38
4894,9.53
4895,9.68
4896,9.85
4897,9.99
4898,10.08
4899,10.09
4900,10.03
4901,9.94
4902,9.79
4903,9.62
4904,9.45
4905,9.32
4906,9.12
4907,8.86
4908,8.50
4909,8.09
4910,7.61
4911,7.05
4912,6.36
4913,5.62
4914,4.84
4915,4.14
4916,3.48
4917,2.93
4918,2.42
4919,1.98
4920,1.58
4921,1.27
4922,1.00
4923,0.78
4924,0.50
4925,0.19
4926,-0.21
4927,-0.65
4928,-1.21
4929,-1.79
4930,-2.37
4931,-2.88
4932,-3.33
4933,-3.67
4934,-3.93
4935,-4.10
4936,-4.27
4937,-4.43
4938,-4.62
4939,-4.77
4940,-4.90
4941,-4.95
4942,-4.91
4943,-4.79
4944,-4.64
4945,-4.49
4946,-4.33
4947,-4.19
4948,-4.06
4949,-3.94
4950,-3.80
4951,-3.62
4952,-3.42
4953,-3.21
4954,-2.98
4955,-2.79
4956,-2.62
4957,-2.47
4958,-2.28
4959,-2.06
4960,-1.79
4961,-1.52
4962,-1.23
4963,-0.95
4964,-0.63
4965,-0.28
4966,0.17
4967,0.65
4968,1.22
4969,1.77
4970,2.37
4971,2.95
4972,3.57
4973,4.17
4974,4.87
4975,5.59
4976,6.42
4977,7.27
4978,8.21
4979,9.16
4980,10.13
4981,11.01
4982,11.81
4983,12.44
4984,13.00
4985,13.45
4986,13.89
4987,14.31
4988,14.75
4989,15.11
4990,15.41
4991,15.59
4992,15.71
4993,15.75
4994,15.75
4995,15.68
4996,15.63
4997,15.69
4998,15.87
4999,16.14
5000,16.46
5001,16.77
5002,17.01
5003,17.14
5004,17.06
5005,16.83
5006,16.49
5007,16.09
5008,15.63
5009,15.16
5010,14.72
5011,14.40
5012,14.14
5013,13.95
5014,13.76
5015,13.59
5016,13.40
5017,13.23
5018,13.04
5019,12.83
5020,12.60
5021,12.39
5022,12.25
5023,12.18
5024,12.18
5025,12.24
5026,12.41
5027,12.64
5028,12.89
5029,13.11
5030,13.29
5031,13.46
5032,13.65
5033,13.85
5034,14.11
5035,14.40
5036,14.74
5037,15.07
5038,15.38
5039,15.67
5040,15.98
5041,16.31
5042,16.65
5043,16.94
5044,17.19
5045,17.33
5046,17.36
5047,17.27
5048,17.09
5049,16.84
5050,16.59
5051,16.37
5052,16.25
5053,16.25
5054,16.36
5055,16.52
5056,16.65
5057,16.71
5058,16.67
5059,16.56
5060,16.40
5061,16.24
5062,16.12
5063,16.13
5064,16.27
5065,16.51
5066,16.79
5067,17.07
5068,17.31
5069,17.46
5070,17.46
5071,17.32
5072,17.07
5073,16.79
5074,16.52
5075,16.29
5076,16.08
5077,15.91
5078,15.72
5079,15.48
5080,15.19
5081,14.87
5082,14.48
5083,14.04
5084,13.54
5085,13.09
5086,12.75
5087,12.57
5088,12.54
5089,12.60
5090,12.71
5091,12.85
5092,12.98
5093,13.07
5094,13.05
5095,12.94
5096,12.76
5097,12.61
5098,12.47
5099,12.34
5100,12.15
5101,11.95
5102,11.72
5103,11.48
5104,11.21
5105,10.92
5106,10.60
5107,10.30
5108,10.02
5109,9.79
5110,9.60
5111,9.48
5112,9.41
5113,9.36
5114,9.28
5115,9.17
5116,9.02
5117,8.84
5118,8.62
5119,8.40
5120,8.13
5121,7.84
5122,7.48
5123,7.13
5124,6.81
5125,6.55
5126,6.28
5127,6.00
5128,5.66
5129,5.34
5130,4.98
5131,4.61
5132,4.17
5133,3.72
5134,3.29
5135,2.94
5136,2.66
5137,2.49
5138,2.38
5139,2.36
5140,2.41
5141,2.53
5142,2.65
5143,2.68
5144,2.62
5145,2.53
5146,2.45
5147,2.41
5148,2.46
5149,2.64
5150,2.98
5151,3.46
5152,4.02
5153,4.59
5154,5.17
5155,5.67
5156,6.07
5157,6.29
5158,6.42
5159,6.50
5160,6.61
5161,6.75
5162,6.95
5163,7.15
5164,7.35
5165,7.47
5166,7.48
5167,7.32
5168,7.04
5169,6.75
5170,6.63
5171,6.74
5172,7.08
5173,7.63
5174,8.35
5175,9.18
5176,9.93
5177,10.49
5178,10.76
5179,10.79
5180,10.62
5181,10.31
5182,9.90
5183,9.42
5184,8.91
5185,8.40
5186,7.90
5187,7.39
5188,6.88
5189,6.43
5190,6.07
5191,5.82
5192,5.71
5193,5.74
5194,5.93
5195,6.23
5196,6.58
5197,6.95
5198,7.33
5199,7.74
5200,8.19
5201,8.66
5202,9.17
5203,9.67
5204,10.19
5205,10.66
5206,11.09
5207,11.45
5208,11.73
5209,11.89
5210,12.00
5211,12.05
5212,12.09
5213,12.12
5214,12.16
5215,12.22
5216,12.28
5217,12.30
5218,12.18
5219,11.92
5220,11.49
5221,10.95
5222,10.33
5223,9.70
5224,9.09
5225,8.58
5226,8.22
5227,8.04
5228,8.01
5229,8.11
5230,8.30
5231,8.54
5232,8.79
5233,9.03
5234,9.27
5235,9.51
5236,9.74
5237,9.94
5238,10.15
5239,10.35
5240,10.57
5241,10.77
5242,10.98
5243,11.18
5244,11.42
5245,11.61
5246,11.77
5247,11.88
5248,12.04
5249,12.23
5250,12.49
5251,12.78
5252,13.20
5253,13.72
5254,14.36
5255,15.01
5256,15.66
5257,16.22
5258,16.69
5259,17.04
5260,17.34
5261,17.60
5262,17.85
5263,18.08
5264,18.36
5265,18.68
5266,19.04
5267,19.34
5268,19.55
5269,19.61
5270,19.50
5271,19.26
5272,18.92
5273,18.52
5274,18.11
5275,17.76
5276,17.51
5277,17.39
5278,17.34
5279,17.36
5280,17.38
5281,17.36
5282,17.20
5283,16.88
5284,16.40
5285,15.86
5286,15.31
5287,14.81
5288,14.34
5289,14.02
5290,13.87
5291,13.92
5292,14.03
5293,14.14
5294,14.14
5295,13.97
5296,13.56
5297,12.97
5298,12.22
5299,11.48
5300,10.79
5301,10.23
5302,9.77
5303,9.46
5304,9.22
5305,9.03
5306,8.77
5307,8.45
5308,8.07
5309,7.71
5310,7.39
5311,7.19
5312,7.12
5313,7.18
5314,7.34
5315,7.55
5316,7.79
5317,8.03
5318,8.24
5319,8.42
5320,8.59
5321,8.76
5322,8.97
5323,9.23
5324,9.59
5325,10.00
5326,10.46
5327,10.90
5328,11.34
5329,11.73
5330,12.05
5331,12.29
5332,12.44
5333,12.46
5334,12.38
5335,12.22
5336,12.07
5337,11.94
5338,11.87
5339,11.83
5340,11.86
5341,11.95
5342,12.12
5343,12.32
5344,12.54
5345,12.75
5346,12.95
5347,13.12
5348,13.27
5349,13.38
5350,13.51
5351,13.63
5352,13.73
5353,13.78
5354,13.82
5355,13.87
5356,13.97
5357,14.11
5358,14.32
5359,14.56
5360,14.82
5361,15.05
5362,15.27
5363,15.43
5364,15.59
5365,15.69
5366,15.82
5367,15.96
5368,16.14
5369,16.35
5370,16.62
5371,16.94
5372,17.33
5373,17.71
5374,18.07
5375,18.36
5376,18.64
5377,18.87
5378,19.06
5379,19.17
5380,19.26
5381,19.35
5382,19.45
5383,19.54
5384,19.61
5385,19.61
5386,19.51
5387,19.33
5388,19.10
5389,18.79
5390,18.41
5391,18.00
5392,17.60
5393,17.27
5394,16.98
5395,16.69
5396,16.37
5397,16.05
5398,15.70
5399,15.37
5400,15.09
5401,14.95
5402,14.92
5403,15.02
5404,15.19
5405,15.40
5406,15.63
5407,15.85
5408,16.01
5409,16.14
5410,16.21
5411,16.24
5412,16.20
5413,16.11
5414,16.02
5415,15.95
5416,15.91
5417,15.88
5418,15.90
5419,15.98
5420,16.15
5421,16.40
5422,16.69
5423,16.99
5424,17.26
5425,17.47
5426,17.65
5427,17.79
5428,17.90
5429,17.96
5430,18.01
5431,18.03
5432,18.02
5433,17.97
5434,17.87
5435,17.75
5436,17.59
5437,17.42
5438,17.22
5439,17.04
5440,16.87
5441,16.67
5442,16.37
5443,16.02
5444,15.63
5445,15.27
5446,14.95
5447,14.68
5448,14.51
5449,14.49
5450,14.56
5451,14.66
5452,14.69
5453,14.64
5454,14.47
5455,14.23
5456,13.95
5457,13.73
5458,13.69
5459,13.83
5460,14.14
5461,14.57
5462,15.07
5463,15.55
5464,15.95
5465,16.22
5466,16.36
5467,16.41
5468,16.43
5469,16.46
5470,16.53
5471,16.61
5472,16.67
5473,16.68
5474,16.62
5475,16.51
5476,16.30
5477,16.01
5478,15.64
5479,15.28
5480,14.95
5481,14.69
5482,14.46
5483,14.24
5484,13.95
5485,13.63
5486,13.25
5487,12.87
5488,12.45
5489,12.05
5490,11.62
5491,11.22
5492,10.77
5493,10.28
5494,9.69
5495,9.07
5496,8.42
5497,7.77
5498,7.09
5499,6.44
5500,5.82
5501,5.32
5502,4.90
5503,4.62
5504,4.43
5505,4.39
5506,4.41
5507,4.47
5508,4.54
5509,4.61
5510,4.65
5511,4.65
5512,4.59
5513,4.49
5514,4.43
5515,4.43
5516,4.47
5517,4.52
5518,4.63
5519,4.81
5520,5.07
5521,5.39
5522,5.77
5523,6.16
5524,6.56
5525,6.92
5526,7.19
5527,7.34
5528,7.38
5529,7.34
5530,7.29
5531,7.21
5532,7.19
5533,7.24
5534,7.42
5535,7.68
5536,8.03
5537,8.42
5538,8.84
5539,9.25
5540,9.64
5541,9.96
5542,10.28
5543,10.54
5544,10.73
5545,10.82
5546,10.85
5547,10.84
5548,10.82
5549,10.76
5550,10.67
5551,10.57
5552,10.48
5553,10.40
5554,10.31
5555,10.19
5556,10.03
5557,9.81
5558,9.58
5559,9.37
5560,9.18
5561,9.01
5562,8.84
5563,8.69
5564,8.55
5565,8.46
5566,8.43
5567,8.47
5568,8.55
5569,8.64
5570,8.70
5571,8.74
5572,8.76
5573,8.79
5574,8.80
5575,8.80
5576,8.82
5577,8.84
5578,8.87
5579,8.87
5580,8.86
5581,8.83
5582,8.77
5583,8.67
5584,8.56
5585,8.45
5586,8.35
5587,8.26
5588,8.16
5589,8.10
5590,8.09
5591,8.13
5592,8.16
5593,8.16
5594,8.13
5595,8.05
5596,7.87
5597,7.58
5598,7.13
5599,6.62
5600,6.11
5601,5.67
5602,5.29
5603,5.00
5604,4.77
5605,4.62
5606,4.52
5607,4.47
5608,4.43
5609,4.37
5610,4.28
5611,4.19
5612,4.15
5613,4.17
5614,4.26
5615,4.41
5616,4.63
5617,4.93
5618,5.29
5619,5.68
5620,6.10
5621,6.51
5622,6.92
5623,7.26
5624,7.57
5625,7.77
5626,7.90
5627,7.89
5628,7.80
5629,7.68
5630,7.71
5631,7.87
5632,8.20
5633,8.61
5634,9.12
5635,9.68
5636,10.30
5637,10.86
5638,11.36
5639,11.76
5640,12.17
5641,12.57
5642,13.01
5643,13.39
5644,13.72
5645,13.95
5646,14.12
5647,14.17
5648,14.11
5649,13.99
5650,13.90
5651,13.89
5652,13.96
5653,14.12
5654,14.36
5655,14.60
5656,14.74
5657,14.72
5658,14.53
5659,14.25
5660,13.92
5661,13.60
5662,13.31
5663,13.12
5664,13.06
5665,13.10
5666,13.15
5667,13.15
5668,13.09
5669,12.96
5670,12.81
5671,12.65
5672,12.56
5673,12.58
5674,12.78
5675,13.13
5676,13.63
5677,14.24
5678,14.92
5679,15.59
5680,16.24
5681,16.77
5682,17.26
5683,17.68
5684,18.10
5685,18.49
5686,18.88
5687,19.26
5688,19.65
5689,19.97
5690,20.24
5691,20.48
5692,20.71
5693,20.88
5694,20.97
5695,20.95
5696,20.80
5697,20.52
5698,20.14
5699,19.67
5700,19.11
5701,18.57
5702,18.10
5703,17.78
5704,17.58
5705,17.50
5706,17.47
5707,17.46
5708,17.36
5709,17.17
5710,16.81
5711,16.37
5712,15.86
5713,15.42
5714,15.05
5715,14.81
5716,14.72
5717,14.75
5718,14.85
5719,14.95
5720,15.00
5721,15.00
5722,14.95
5723,14.86
5724,14.73
5725,14.61
5726,14.55
5727,14.58
5728,14.69
5729,14.87
5730,15.10
5731,15.37
5732,15.66
5733,15.91
5734,16.05
5735,16.11
5736,16.13
5737,16.15
5738,16.19
5739,16.26
5740,16.37
5741,16.52
5742,16.68
5743,16.81
5744,16.84
5745,16.76
5746,16.51
5747,16.09
5748,15.53
5749,14.90
5750,14.27
5751,13.70
5752,13.18
5753,12.78
5754,12.49
5755,12.35
5756,12.26
5757,12.20
5758,12.08
5759,11.94
5760,11.71
5761,11.47
5762,11.15
5763,10.80
5764,10.34
5765,9.80
5766,9.12
5767,8.41
5768,7.64
5769,6.91
5770,6.20
5771,5.62
5772,5.10
5773,4.75
5774,4.43
5775,4.15
5776,3.77
5777,3.32
5778,2.73
5779,2.09
5780,1.32
5781,0.56
5782,-0.18
5783,-0.79
5784,-1.37
5785,-1.92
5786,-2.51
5787,-3.10
5788,-3.73
5789,-4.36
5790,-4.95
5791,-5.39
5792,-5.66
5793,-5.71
5794,-5.61
5795,-5.36
5796,-5.00
5797,-4.59
5798,-4.14
5799,-3.75
5800,-3.43
5801,-3.17
5802,-2.91
5803,-2.66
5804,-2.36
5805,-2.04
5806,-1.63
5807,-1.19
5808,-0.72
5809,-0.34
5810,-0.06
5811,0.05
5812,0.04
5813,-0.07
5814,-0.18
5815,-0.29
5816,-0.31
5817,-0.26
5818,-0.10
5819,0.17
5820,0.55
5821,0.97
5822,1.37
5823,1.73
5824,2.07
5825,2.39
5826,2.70
5827,3.00
5828,3.31
5829,3.63
5830,3.97
5831,4.30
5832,4.62
5833,4.91
5834,5.18
5835,5.39
5836,5.55
5837,5.66
5838,5.75
5839,5.81
5840,5.83
5841,5.82
5842,5.82
5843,5.85
5844,5.93
5845,6.01
5846,6.09
5847,6.15
5848,6.22
5849,6.28
5850,6.30
5851,6.27
5852,6.21
5853,6.15
5854,6.09
5855,6.00
5856,5.87
5857,5.69
5858,5.48
5859,5.24
5860,4.97
5861,4.71
5862,4.44
5863,4.24
5864,4.06
5865,3.90
5866,3.68
5867,3.42
5868,3.11
5869,2.82
5870,2.53
5871,2.30
5872,2.09
5873,1.91
5874,1.76
5875,1.63
5876,1.43
5877,1.14
5878,0.72
5879,0.24
5880,-0.25
5881,-0.66
5882,-0.98
5883,-1.12
5884,-1.11
5885,-0.95
5886,-0.74
5887,-0.54
5888,-0.44
5889,-0.44
5890,-0.55
5891,-0.73
5892,-0.97
5893,-1.25
5894,-1.51
5895,-1.73
5896,-1.82
5897,-1.80
5898,-1.64
5899,-1.38
5900,-0.99
5901,-0.49
5902,0.13
5903,0.78
5904,1.45
5905,2.08
5906,2.66
5907,3.09
5908,3.38
5909,3.52
5910,3.63
5911,3.76
5912,3.97
5913,4.23
5914,4.59
5915,5.00
5916,5.46
5917,5.85
5918,6.14
5919,6.29
5920,6.29
5921,6.17
5922,5.94
5923,5.64
5924,5.33
5925,5.05
5926,4.83
5927,4.65
5928,4.50
5929,4.41
5930,4.39
5931,4.41
5932,4.49
5933,4.61
5934,4.80
5935,5.03
5936,5.29
5937,5.55
5938,5.86
5939,6.18
5940,6.52
5941,6.81
5942,7.10
5943,7.35
5944,7.64
5945,7.96
5946,8.36
5947,8.77
5948,9.19
5949,9.57
5950,9.95
5951,10.24
5952,10.41
5953,10.41
5954,10.31
5955,10.14
5956,9.96
5957,9.80
5958,9.77
5959,9.84
5960,10.02
5961,10.25
5962,10.48
5963,10.66
5964,10.70
5965,10.63
5966,10.44
5967,10.16
5968,9.79
5969,9.37
5970,8.97
5971,8.71
5972,8.56
5973,8.48
5974,8.40
5975,8.31
5976,8.22
5977,8.09
5978,7.93
5979,7.71
5980,7.51
5981,7.42
5982,7.49
5983,7.74
5984,8.09
5985,8.52
5986,8.99
5987,9.41
5988,9.68
5989,9.78
5990,9.72
5991,9.54
5992,9.21
5993,8.77
5994,8.26
5995,7.74
5996,7.23
5997,6.72
5998,6.26
5999,5.91
6000,5.65
6001,5.54
6002,5.52
6003,5.63
6004,5.79
6005,5.95
6006,6.00
6007,5.93
6008,5.71
6009,5.39
6010,5.04
6011,4.73
6012,4.59
6013,4.65
6014,4.88
6015,5.18
6016,5.52
6017,5.84
6018,6.14
6019,6.38
6020,6.57
6021,6.73
6022,6.95
6023,7.28
6024,7.73
6025,8.23
6026,8.77
6027,9.24
6028,9.67
6029,10.02
6030,10.30
6031,10.50
6032,10.68
6033,10.85
6034,11.02
6035,11.17
6036,11.32
6037,11.46
6038,11.63
6039,11.83
6040,12.12
6041,12.47
6042,12.87
6043,13.25
6044,13.63
6045,13.92
6046,14.12
6047,14.18
6048,14.11
6049,13.95
6050,13.79
6051,13.69
6052,13.72
6053,13.82
6054,14.02
6055,14.28
6056,14.65
6057,15.06
6058,15.48
6059,15.85
6060,16.14
6061,16.35
6062,16.45
6063,16.48
6064,16.50
6065,16.52
6066,16.53
6067,16.50
6068,16.46
6069,16.43
6070,16.41
6071,16.37
6072,16.33
6073,16.29
6074,16.33
6075,16.44
6076,16.62
6077,16.88
6078,17.18
6079,17.51
6080,17.80
6081,18.01
6082,18.15
6083,18.17
6084,18.07
6085,17.86
6086,17.62
6087,17.36
6088,17.14
6089,16.93
6090,16.77
6091,16.68
6092,16.64
6093,16.65
6094,16.68
6095,16.72
6096,16.71
6097,16.68
6098,16.64
6099,16.64
6100,16.69
6101,16.71
6102,16.70
6103,16.67
6104,16.66
6105,16.68
6106,16.72
6107,16.81
6108,17.01
6109,17.40
6110,17.96
6111,18.60
6112,19.23
6113,19.72
6114,20.09
6115,20.29
6116,20.36
6117,20.32
6118,20.23
6119,20.16
6120,20.21
6121,20.42
6122,20.79
6123,21.24
6124,21.70
6125,22.06
6126,22.28
6127,22.31
6128,22.16
6129,21.86
6130,21.44
6131,21.01
6132,20.65
6133,20.42
6134,20.29
6135,20.18
6136,20.00
6137,19.78
6138,19.47
6139,19.10
6140,18.59
6141,18.04
6142,17.44
6143,16.91
6144,16.39
6145,15.87
6146,15.28
6147,14.64
6148,13.86
6149,13.00
6150,12.06
6151,11.16
6152,10.36
6153,9.74
6154,9.28
6155,9.06
6156,9.03
6157,9.19
6158,9.47
6159,9.81
6160,10.14
6161,10.48
6162,10.80
6163,11.13
6164,11.44
6165,11.72
6166,11.92
6167,12.05
6168,12.08
6169,12.05
6170,11.96
6171,11.81
6172,11.63
6173,11.45
6174,11.25
6175,11.05
6176,10.85
6177,10.70
6178,10.57
6179,10.43
6180,10.25
6181,10.05
6182,9.79
6183,9.50
6184,9.14
6185,8.76
6186,8.35
6187,7.97
6188,7.61
6189,7.32
6190,7.10
6191,6.98
6192,6.93
6193,6.96
6194,7.09
6195,7.33
6196,7.64
6197,7.98
6198,8.29
6199,8.59
6200,8.89
6201,9.16
6202,9.38
6203,9.52
6204,9.64
6205,9.74
6206,9.89
6207,10.06
6208,10.28
6209,10.48
6210,10.68
6211,10.84
6212,11.03
6213,11.20
6214,11.41
6215,11.63
6216,11.96
6217,12.40
6218,12.98
6219,13.63
6220,14.33
6221,15.02
6222,15.66
6223,16.11
6224,16.29
6225,16.17
6226,15.80
6227,15.25
6228,14.60
6229,13.94
6230,13.37
6231,12.97
6232,12.77
6233,12.76
6234,12.84
6235,12.95
6236,12.95
6237,12.84
6238,12.57
6239,12.25
6240,11.91
6241,11.67
6242,11.56
6243,11.57
6244,11.63
6245,11.70
6246,11.73
6247,11.63
6248,11.38
6249,11.00
6250,10.57
6251,10.17
6252,9.81
6253,9.56
6254,9.41
6255,9.40
6256,9.38
6257,9.32
6258,9.11
6259,8.79
6260,8.29
6261,7.68
6262,6.96
6263,6.25
6264,5.52
6265,4.81
6266,4.11
6267,3.49
6268,2.93
6269,2.49
6270,2.16
6271,1.95
6272,1.83
6273,1.79
6274,1.76
6275,1.77
6276,1.78
6277,1.81
6278,1.85
6279,1.95
6280,2.08
6281,2.27
6282,2.49
6283,2.72
6284,2.98
6285,3.21
6286,3.42
6287,3.59
6288,3.78
6289,3.99
6290,4.21
6291,4.42
6292,4.61
6293,4.75
6294,4.87
6295,4.92
6296,4.94
6297,4.93
6298,4.95
6299,5.00
6300,5.10
6301,5.22
6302,5.38
6303,5.59
6304,5.83
6305,6.03
6306,6.20
6307,6.32
6308,6.42
6309,6.52
6310,6.55
6311,6.52
6312,6.45
6313,6.33
6314,6.13
6315,5.86
6316,5.55
6317,5.28
6318,5.07
6319,4.93
6320,4.82
6321,4.79
6322,4.87
6323,5.01
6324,5.17
6325,5.29
6326,5.42
6327,5.58
6328,5.83
6329,6.13
6330,6.48
6331,6.86
6332,7.31
6333,7.74
6334,8.16
6335,8.51
6336,8.86
6337,9.18
6338,9.50
6339,9.77
6340,9.98
6341,10.12
6342,10.20
6343,10.24
6344,10.21
6345,10.09
6346,9.87
6347,9.61
6348,9.32
6349,9.04
6350,8.77
6351,8.50
6352,8.28
6353,8.09
6354,7.93
6355,7.76
6356,7.57
6357,7.35
6358,7.10
6359,6.84
6360,6.60
6361,6.48
6362,6.51
6363,6.72
6364,7.10
6365,7.58
6366,8.11
6367,8.57
6368,8.84
6369,8.88
6370,8.67
6371,8.27
6372,7.75
6373,7.23
6374,6.84
6375,6.61
6376,6.59
6377,6.69
6378,6.86
6379,7.04
6380,7.19
6381,7.27
6382,7.33
6383,7.42
6384,7.58
6385,7.85
6386,8.20
6387,8.60
6388,9.01
6389,9.36
6390,9.61
6391,9.77
6392,9.87
6393,9.95
6394,10.02
6395,10.08
6396,10.15
6397,10.25
6398,10.30
6399,10.23
6400,9.95
6401,9.47
6402,8.81
6403,8.09
6404,7.39
6405,6.75
6406,6.22
6407,5.84
6408,5.62
6409,5.56
6410,5.58
6411,5.59
6412,5.56
6413,5.49
6414,5.42
6415,5.39
6416,5.44
6417,5.58
6418,5.84
6419,6.16
6420,6.55
6421,6.96
6422,7.43
6423,7.90
6424,8.35
6425,8.80
6426,9.30
6427,9.80
6428,10.26
6429,10.62
6430,10.91
6431,11.14
6432,11.29
6433,11.32
6434,11.25
6435,11.14
6436,11.00
6437,10.85
6438,10.66
6439,10.46
6440,10.25
6441,10.06
6442,9.79
6443,9.48
6444,9.06
6445,8.62
6446,8.11
6447,7.62
6448,7.14
6449,6.73
6450,6.32
6451,5.96
6452,5.59
6453,5.28
6454,4.93
6455,4.56
6456,4.10
6457,3.57
6458,2.92
6459,2.25
6460,1.55
6461,0.89
6462,0.27
6463,-0.24
6464,-0.60
6465,-0.76
6466,-0.79
6467,-0.72
6468,-0.60
6469,-0.40
6470,-0.09
6471,0.27
6472,0.64
6473,1.00
6474,1.37
6475,1.75
6476,2.15
6477,2.53
6478,2.92
6479,3.33
6480,3.82
6481,4.36
6482,5.04
6483,5.84
6484,6.81
6485,7.77
6486,8.71
6487,9.48
6488,10.13
6489,10.63
6490,11.00
6491,11.22
6492,11.41
6493,11.66
6494,12.07
6495,12.57
6496,13.11
6497,13.56
6498,13.92
6499,14.14
6500,14.27
6501,14.28
6502,14.28
6503,14.32
6504,14.51
6505,14.87
6506,15.39
6507,15.98
6508,16.61
6509,17.19
6510,17.68
6511,18.03
6512,18.23
6513,18.32
6514,18.35
6515,18.31
6516,18.19
6517,17.95
6518,17.64
6519,17.27
6520,16.86
6521,16.44
6522,16.08
6523,15.81
6524,15.62
6525,15.51
6526,15.44
6527,15.42
6528,15.39
6529,15.34
6530,15.21
6531,15.07
6532,14.89
6533,14.72
6534,14.54
6535,14.40
6536,14.27
6537,14.20
6538,14.13
6539,14.05
6540,13.87
6541,13.59
6542,13.16
6543,12.66
6544,12.06
6545,11.44
6546,10.80
6547,10.21
6548,9.67
6549,9.23
6550,8.87
6551,8.62
6552,8.39
6553,8.19
6554,7.96
6555,7.73
6556,7.50
6557,7.30
6558,7.08
6559,6.85
6560,6.58
6561,6.32
6562,6.03
6563,5.74
6564,5.40
6565,5.05
6566,4.71
6567,4.45
6568,4.24
6569,4.07
6570,3.88
6571,3.72
6572,3.55
6573,3.37
6574,3.11
6575,2.79
6576,2.45
6577,2.14
6578,1.86
6579,1.63
6580,1.46
6581,1.40
6582,1.43
6583,1.49
6584,1.58
6585,1.67
6586,1.76
6587,1.85
6588,1.95
6589,2.08
6590,2.33
6591,2.65
6592,3.06
6593,3.50
6594,3.98
6595,4.43
6596,4.82
6597,5.08
6598,5.23
6599,5.28
6600,5.33
6601,5.40
6602,5.54
6603,5.75
6604,6.07
6605,6.42
6606,6.72
6607,6.88
6608,6.90
6609,6.77
6610,6.50
6611,6.17
6612,5.91
6613,5.81
6614,5.87
6615,6.07
6616,6.31
6617,6.56
6618,6.72
6619,6.74
6620,6.55
6621,6.23
6622,5.78
6623,5.36
6624,5.01
6625,4.78
6626,4.63
6627,4.55
6628,4.47
6629,4.36
6630,4.19
6631,3.94
6632,3.63
6633,3.36
6634,3.20
6635,3.14
6636,3.14
6637,3.17
6638,3.24
6639,3.36
6640,3.52
6641,3.66
6642,3.81
6643,3.99
6644,4.22
6645,4.48
6646,4.78
6647,5.08
6648,5.39
6649,5.64
6650,5.87
6651,6.10
6652,6.40
6653,6.76
6654,7.15
6655,7.51
6656,7.84
6657,8.10
6658,8.30
6659,8.36
6660,8.27
6661,8.03
6662,7.68
6663,7.29
6664,6.87
6665,6.45
6666,6.03
6667,5.70
6668,5.49
6669,5.41
6670,5.40
6671,5.44
6672,5.50
6673,5.58
6674,5.68
6675,5.80
6676,5.98
6677,6.20
6678,6.50
6679,6.82
6680,7.22
6681,7.61
6682,8.06
6683,8.49
6684,9.01
6685,9.59
6686,10.28
6687,11.02
6688,11.86
6689,12.75
6690,13.66
6691,14.46
6692,15.14
6693,15.63
6694,15.99
6695,16.24
6696,16.50
6697,16.78
6698,17.16
6699,17.57
6700,18.03
6701,18.47
6702,18.90
6703,19.23
6704,19.43
6705,19.49
6706,19.42
6707,19.29
6708,19.15
6709,19.00
6710,18.84
6711,18.63
6712,18.38
6713,18.11
6714,17.83
6715,17.54
6716,17.20
6717,16.85
6718,16.47
6719,16.11
6720,15.78
6721,15.49
6722,15.21
6723,14.99
6724,14.76
6725,14.57
6726,14.36
6727,14.15
6728,13.92
6729,13.69
6730,13.44
6731,13.18
6732,12.88
6733,12.57
6734,12.18
6735,11.78
6736,11.29
6737,10.77
6738,10.15
6739,9.47
6740,8.71
6741,8.01
6742,7.38
6743,6.91
6744,6.54
6745,6.32
6746,6.18
6747,6.08
6748,5.89
6749,5.54
6750,4.99
6751,4.33
6752,3.61
6753,2.92
6754,2.31
6755,1.90
6756,1.72
6757,1.79
6758,2.01
6759,2.30
6760,2.57
6761,2.78
6762,2.88
6763,2.88
6764,2.82
6765,2.72
6766,2.61
6767,2.56
6768,2.59
6769,2.69
6770,2.73
6771,2.72
6772,2.64
6773,2.52
6774,2.30
6775,2.01
6776,1.70
6777,1.49
6778,1.37
6779,1.35
6780,1.39
6781,1.48
6782,1.59
6783,1.69
6784,1.72
6785,1.72
6786,1.72
6787,1.72
6788,1.69
6789,1.69
6790,1.79
6791,1.95
6792,2.16
6793,2.33
6794,2.56
6795,2.80
6796,3.12
6797,3.47
6798,3.91
6799,4.40
6800,4.99
6801,5.61
6802,6.27
6803,6.91
6804,7.55
6805,8.12
6806,8.62
6807,9.00
6808,9.28
6809,9.47
6810,9.70
6811,9.95
6812,10.27
6813,10.59
6814,10.95
6815,11.30
6816,11.64
6817,11.91
6818,12.09
6819,12.15
6820,12.08
6821,11.93
6822,11.75
6823,11.60
6824,11.48
6825,11.43
6826,11.42
6827,11.46
6828,11.48
6829,11.46
6830,11.36
6831,11.18
6832,10.92
6833,10.59
6834,10.22
6835,9.83
6836,9.40
6837,8.93
6838,8.42
6839,7.90
6840,7.43
6841,7.07
6842,6.87
6843,6.85
6844,6.95
6845,7.17
6846,7.45
6847,7.76
6848,8.02
6849,8.15
6850,8.09
6851,7.91
6852,7.66
6853,7.42
6854,7.22
6855,7.07
6856,6.98
6857,6.92
6858,6.85
6859,6.74
6860,6.57
6861,6.36
6862,6.11
6863,5.87
6864,5.69
6865,5.66
6866,5.78
6867,6.03
6868,6.36
6869,6.70
6870,6.95
6871,7.08
6872,7.05
6873,6.87
6874,6.55
6875,6.10
6876,5.54
6877,4.94
6878,4.35
6879,3.82
6880,3.32
6881,2.88
6882,2.47
6883,2.12
6884,1.79
6885,1.53
6886,1.34
6887,1.19
6888,1.03
6889,0.86
6890,0.67
6891,0.46
6892,0.19
6893,-0.14
6894,-0.48
6895,-0.76
6896,-0.92
6897,-0.92
6898,-0.74
6899,-0.40
6900,0.05
6901,0.56
6902,1.10
6903,1.61
6904,2.04
6905,2.37
6906,2.60
6907,2.75
6908,2.83
6909,2.87
6910,2.84
6911,2.71
6912,2.49
6913,2.23
6914,1.94
6915,1.63
6916,1.30
6917,0.98
6918,0.71
6919,0.53
6920,0.42
6921,0.40
6922,0.45
6923,0.57
6924,0.71
6925,0.84
6926,0.92
6927,0.96
6928,0.91
6929,0.74
6930,0.42
6931,0.00
6932,-0.50
6933,-1.03
6934,-1.62
6935,-2.21
6936,-2.78
6937,-3.26
6938,-3.66
6939,-3.99
6940,-4.23
6941,-4.38
6942,-4.46
6943,-4.52
6944,-4.59
6945,-4.65
6946,-4.65
6947,-4.57
6948,-4.36
6949,-4.04
6950,-3.59
6951,-3.04
6952,-2.46
6953,-1.95
6954,-1.56
6955,-1.34
6956,-1.18
6957,-1.06
6958,-0.85
6959,-0.56
6960,-0.14
6961,0.36
6962,0.95
6963,1.58
6964,2.22
6965,2.77
6966,3.23
6967,3.59
6968,3.91
6969,4.22
6970,4.55
6971,4.81
6972,5.07
6973,5.28
6974,5.54
6975,5.79
6976,6.12
6977,6.46
6978,6.84
6979,7.25
6980,7.76
6981,8.35
6982,9.02
6983,9.70
6984,10.42
6985,11.09
6986,11.72
6987,12.19
6988,12.53
6989,12.66
6990,12.63
6991,12.43
6992,12.18
6993,11.99
6994,11.97
6995,12.15
6996,12.51
6997,12.99
6998,13.54
6999,14.09
7000,14.53
7001,14.77
7002,14.79
7003,14.63
7004,14.40
7005,14.15
7006,13.92
7007,13.71
7008,13.52
7009,13.37
7010,13.28
7011,13.22
7012,13.16
7013,13.14
7014,13.17
7015,13.27
7016,13.35
7017,13.40
7018,13.36
7019,13.24
7020,12.99
7021,12.61
7022,12.13
7023,11.65
7024,11.18
7025,10.80
7026,10.50
7027,10.30
7028,10.15
7029,10.05
7030,9.90
7031,9.70
7032,9.42
7033,9.09
7034,8.71
7035,8.32
7036,7.97
7037,7.74
7038,7.60
7039,7.56
7040,7.55
7041,7.57
7042,7.53
7043,7.42
7044,7.14
7045,6.71
7046,6.11
7047,5.43
7048,4.66
7049,3.93
7050,3.24
7051,2.68
7052,2.21
7053,1.86
7054,1.59
7055,1.43
7056,1.28
7057,1.14
7058,0.96
7059,0.79
7060,0.63
7061,0.50
7062,0.43
7063,0.40
7064,0.41
7065,0.41
7066,0.37
7067,0.27
7068,0.17
7069,0.14
7070,0.24
7071,0.44
7072,0.74
7073,1.11
7074,1.54
7075,1.98
7076,2.37
7077,2.60
7078,2.72
7079,2.75
7080,2.70
7081,2.61
7082,2.51
7083,2.46
7084,2.44
7085,2.41
7086,2.30
7087,2.10
7088,1.82
7089,1.48
7090,1.13
7091,0.82
7092,0.65
7093,0.68
7094,0.89
7095,1.27
7096,1.71
7097,2.15
7098,2.45
7099,2.59
7100,2.49
7101,2.17
7102,1.59
7103,0.89
7104,0.08
7105,-0.72
7106,-1.56
7107,-2.39
7108,-3.21
7109,-3.98
7110,-4.74
7111,-5.42
7112,-6.00
7113,-6.39
7114,-6.58
7115,-6.58
7116,-6.42
7117,-6.10
7118,-5.70
7119,-5.27
7120,-4.91
7121,-4.62
7122,-4.33
7123,-4.04
7124,-3.75
7125,-3.51
7126,-3.29
7127,-3.09
7128,-2.89
7129,-2.75
7130,-2.63
7131,-2.55
7132,-2.46
7133,-2.33
7134,-2.17
7135,-1.99
7136,-1.83
7137,-1.73
7138,-1.74
7139,-1.86
7140,-2.11
7141,-2.47
7142,-2.92
7143,-3.43
7144,-3.97
7145,-4.45
7146,-4.82
7147,-5.07
7148,-5.20
7149,-5.22
7150,-5.15
7151,-5.00
7152,-4.80
7153,-4.59
7154,-4.36
7155,-4.14
7156,-3.88
7157,-3.61
7158,-3.31
7159,-3.01
7160,-2.72
7161,-2.46
7162,-2.20
7163,-1.97
7164,-1.74
7165,-1.54
7166,-1.34
7167,-1.17
7168,-0.98
7169,-0.79
7170,-0.53
7171,-0.28
7172,0.04
7173,0.38
7174,0.81
7175,1.27
7176,1.81
7177,2.34
7178,2.88
7179,3.39
7180,3.85
7181,4.20
7182,4.46
7183,4.63
7184,4.77
7185,4.85
7186,4.91
7187,4.93
7188,4.95
7189,4.98
7190,5.01
7191,4.97
7192,4.93
7193,4.03
7194,4.24
7195,6.50
7196,7.10
7197,1.68
7198,-2.85
7199,8.45
7200,22.81
