1,74.99
2,100.00
3,100.00
4,98.77
5,95.55
6,100.00
7,100.00
8,99.25
9,99.70
10,100.00
11,90.42
12,59.21
13,21.34
14,2.53
15,14.44
16,45.63
17,75.75
18,92.80
19,98.87
20,99.51
21,100.00
22,100.00
23,100.00
24,97.69
25,98.98
26,100.00
27,100.00
28,79.81
29,30.71
30,-26.89
31,-69.10
32,-86.68
33,-86.59
34,-82.10
35,-77.07
36,-69.27
37,-56.65
38,-44.64
39,-38.76
40,-40.98
41,-46.70
42,-52.03
43,-53.87
44,-51.86
45,-46.84
46,-40.26
47,-34.31
48,-30.13
49,-28.50
50,-28.58
51,-29.51
52,-30.15
53,-30.12
54,-29.19
55,-27.72
56,-25.87
57,-24.21
58,-22.71
59,-21.58
60,-20.50
61,-19.53
62,-18.48
63,-17.49
64,-16.48
65,-15.57
66,-14.64
67,-13.83
68,-13.03
69,-12.37
70,-11.74
71,-11.22
72,-10.71
73,-10.28
74,-9.80
75,-9.34
76,-8.83
77,-8.35
78,-7.84
79,-7.39
80,-6.95
81,-6.59
82,-6.22
83,-5.91
84,-5.58
85,-5.28
86,-4.94
87,-4.63
88,-4.30
89,-4.02
90,-3.77
91,-3.60
92,-3.48
93,-3.42
94,-3.39
95,-3.36
96,-3.32
97,-3.28
98,-3.21
99,-3.14
100,-3.05
101,-2.96
102,-2.87
103,-2.80
104,-2.73
105,-2.67
106,-2.62
107,-2.59
108,-2.57
109,-2.58
110,-2.59
111,-2.62
112,-2.63
113,-2.62
114,-2.58
115,-2.50
116,-2.37
117,-2.21
118,-2.01
119,-1.80
120,-1.61
121,-1.47
122,-1.38
123,-1.35
124,-1.38
125,-1.46
126,-1.57
127,-1.69
128,-1.84
129,-2.01
130,-2.20
131,-2.37
132,-2.53
133,-2.66
134,-2.75
135,-2.74
136,-2.64
137,-2.47
138,-2.35
139,-2.33
140,-2.45
141,-2.64
142,-2.89
143,-3.18
144,-3.50
145,-3.81
146,-4.08
147,-4.28
148,-4.42
149,-4.49
150,-4.56
151,-4.61
152,-4.71
153,-4.82
154,-4.98
155,-5.15
156,-5.31
157,-5.42
158,-5.48
159,-5.46
160,-5.38
161,-5.27
162,-5.12
163,-4.96
164,-4.79
165,-4.63
166,-4.49
167,-4.36
168,-4.27
169,-4.21
170,-4.17
171,-4.18
172,-4.19
173,-4.21
174,-4.19
175,-4.15
176,-4.03
177,-3.85
178,-3.58
179,-3.27
180,-2.89
181,-2.48
182,-2.02
183,-1.53
184,-0.97
185,-0.39
186,0.25
187,0.89
188,1.55
189,2.16
190,2.78
191,3.35
192,3.91
193,4.36
194,4.75
195,5.06
196,5.41
197,5.78
198,6.20
199,6.59
200,6.95
201,7.24
202,7.49
203,7.68
204,7.83
205,7.93
206,8.00
207,8.04
208,8.03
209,7.97
210,7.84
211,7.65
212,7.40
213,7.13
214,6.84
215,6.59
216,6.36
217,6.17
218,5.98
219,5.80
220,5.59
221,5.38
222,5.13
223,4.87
224,4.62
225,4.39
226,4.22
227,4.12
228,4.10
229,4.15
230,4.26
231,4.43
232,4.64
233,4.87
234,5.13
235,5.38
236,5.65
237,5.91
238,6.21
239,6.50
240,6.85
241,7.21
242,7.67
243,8.15
244,8.73
245,9.32
246,9.97
247,10.60
248,11.24
249,11.86
250,12.48
251,13.03
252,13.55
253,14.06
254,14.60
255,15.05
256,15.32
257,15.36
258,15.31
259,15.24
260,15.19
261,15.10
262,14.98
263,14.84
264,14.71
265,14.58
266,14.46
267,14.35
268,14.26
269,14.19
270,14.14
271,14.12
272,14.12
273,14.13
274,14.13
275,14.12
276,14.09
277,14.05
278,13.97
279,13.89
280,13.79
281,13.70
282,13.62
283,13.57
284,13.53
285,13.51
286,13.49
287,13.48
288,13.44
289,13.40
290,13.33
291,13.26
292,13.19
293,13.13
294,13.07
295,13.02
296,12.98
297,12.96
298,12.95
299,12.95
300,12.94
301,12.93
302,12.91
303,12.88
304,12.84
305,12.78
306,12.71
307,12.64
308,12.58
309,12.53
310,12.52
311,12.52
312,12.55
313,12.60
314,12.64
315,12.69
316,12.73
317,12.79
318,12.86
319,12.94
320,13.02
321,13.12
322,13.20
323,13.25
324,13.25
325,13.20
326,13.10
327,12.96
328,12.77
329,12.56
330,12.33
331,12.12
332,11.90
333,11.68
334,11.43
335,11.19
336,10.91
337,10.64
338,10.34
339,10.05
340,9.75
341,9.49
342,9.25
343,9.05
344,8.87
345,8.70
346,8.55
347,8.42
348,8.31
349,8.23
350,8.18
351,8.17
352,8.19
353,8.23
354,8.29
355,8.33
356,8.38
357,8.44
358,8.51
359,8.60
360,8.72
361,8.89
362,9.09
363,9.32
364,9.56
365,9.80
366,9.99
367,10.13
368,10.21
369,10.24
370,10.21
371,10.13
372,10.01
373,9.88
374,9.74
375,9.58
376,9.41
377,9.25
378,9.08
379,8.91
380,8.68
381,8.38
382,8.00
383,7.61
384,7.22
385,6.90
386,6.61
387,6.37
388,6.12
389,5.88
390,5.63
391,5.37
392,5.08
393,4.79
394,4.50
395,4.27
396,4.10
397,4.03
398,4.02
399,4.09
400,4.21
401,4.37
402,4.53
403,4.66
404,4.75
405,4.80
406,4.82
407,4.82
408,4.86
409,4.92
410,5.04
411,5.19
412,5.38
413,5.57
414,5.72
415,5.83
416,5.87
417,5.83
418,5.72
419,5.56
420,5.37
421,5.19
422,5.03
423,4.92
424,4.81
425,4.73
426,4.62
427,4.50
428,4.29
429,4.03
430,3.68
431,3.27
432,2.82
433,2.39
434,1.96
435,1.60
436,1.27
437,1.01
438,0.79
439,0.62
440,0.45
441,0.29
442,0.13
443,0.00
444,-0.10
445,-0.16
446,-0.17
447,-0.13
448,-0.03
449,0.11
450,0.30
451,0.51
452,0.75
453,1.01
454,1.31
455,1.61
456,1.96
457,2.31
458,2.71
459,3.10
460,3.52
461,3.91
462,4.30
463,4.66
464,5.03
465,5.37
466,5.76
467,6.15
468,6.59
469,7.04
470,7.53
471,8.02
472,8.53
473,9.00
474,9.47
475,9.88
476,10.27
477,10.59
478,10.93
479,11.22
480,11.55
481,11.86
482,12.21
483,12.55
484,12.92
485,13.27
486,13.63
487,13.93
488,14.22
489,14.43
490,14.58
491,14.66
492,14.69
493,14.67
494,14.66
495,14.65
496,14.68
497,14.75
498,14.87
499,15.01
500,15.17
501,15.33
502,15.48
503,15.63
504,15.78
505,15.93
506,16.12
507,16.34
508,16.60
509,16.89
510,17.21
511,17.51
512,17.83
513,18.14
514,18.45
515,18.73
516,18.98
517,19.20
518,19.41
519,19.58
520,19.71
521,19.79
522,19.84
523,19.85
524,19.84
525,19.80
526,19.73
527,19.63
528,19.49
529,19.34
530,19.15
531,18.95
532,18.74
533,18.53
534,18.30
535,18.07
536,17.81
537,17.55
538,17.27
539,17.01
540,16.75
541,16.54
542,16.36
543,16.23
544,16.12
545,16.02
546,15.93
547,15.84
548,15.73
549,15.61
550,15.50
551,15.41
552,15.36
553,15.35
554,15.37
555,15.41
556,15.43
557,15.44
558,15.41
559,15.33
560,15.19
561,14.99
562,14.75
563,14.49
564,14.22
565,13.96
566,13.71
567,13.52
568,13.37
569,13.28
570,13.24
571,13.21
572,13.17
573,13.12
574,13.03
575,12.93
576,12.81
577,12.70
578,12.62
579,12.64
580,12.72
581,12.83
582,12.86
583,12.78
584,12.60
585,12.37
586,12.07
587,11.71
588,11.30
589,10.90
590,10.49
591,10.12
592,9.76
593,9.44
594,9.16
595,8.92
596,8.70
597,8.52
598,8.34
599,8.14
600,7.81
601,7.40
602,6.94
603,6.50
604,6.08
605,5.68
606,5.28
607,4.92
608,4.59
609,4.31
610,4.06
611,3.86
612,3.69
613,3.57
614,3.49
615,3.48
616,3.47
617,3.49
618,3.45
619,3.38
620,3.23
621,3.02
622,2.74
623,2.44
624,2.14
625,1.88
626,1.69
627,1.59
628,1.59
629,1.68
630,1.83
631,2.04
632,2.29
633,2.55
634,2.85
635,3.14
636,3.47
637,3.80
638,4.17
639,4.54
640,4.97
641,5.41
642,5.92
643,6.44
644,7.05
645,7.74
646,8.60
647,9.48
648,10.32
649,11.04
650,11.75
651,12.46
652,13.22
653,13.89
654,14.48
655,14.92
656,15.32
657,15.64
658,16.02
659,16.42
660,16.92
661,17.43
662,17.98
663,18.50
664,19.01
665,19.43
666,19.82
667,20.13
668,20.41
669,20.65
670,20.89
671,21.10
672,21.33
673,21.52
674,21.72
675,21.90
676,22.09
677,22.26
678,22.45
679,22.64
680,22.84
681,23.04
682,23.25
683,23.46
684,23.66
685,23.83
686,23.98
687,24.08
688,24.12
689,24.11
690,24.06
691,23.96
692,23.84
693,23.72
694,23.63
695,23.56
696,23.52
697,23.52
698,23.54
699,23.58
700,23.62
701,23.65
702,23.67
703,23.67
704,23.65
705,23.61
706,23.56
707,23.50
708,23.46
709,23.43
710,23.43
711,23.43
712,23.42
713,23.40
714,23.39
715,23.38
716,23.38
717,23.40
718,23.41
719,23.43
720,23.43
721,23.42
722,23.35
723,23.23
724,23.03
725,22.80
726,22.51
727,22.21
728,21.91
729,21.65
730,21.40
731,21.20
732,21.00
733,20.82
734,20.63
735,20.43
736,20.18
737,19.90
738,19.59
739,19.28
740,18.93
741,18.58
742,18.20
743,17.84
744,17.46
745,17.12
746,16.77
747,16.45
748,16.14
749,15.85
750,15.54
751,15.24
752,14.92
753,14.64
754,14.35
755,14.11
756,13.89
757,13.71
758,13.55
759,13.43
760,13.29
761,13.15
762,12.98
763,12.78
764,12.54
765,12.28
766,12.01
767,11.76
768,11.49
769,11.23
770,10.96
771,10.70
772,10.44
773,10.18
774,9.91
775,9.64
776,9.37
777,9.12
778,8.87
779,8.64
780,8.42
781,8.24
782,8.07
783,7.96
784,7.88
785,7.84
786,7.80
787,7.76
788,7.68
789,7.57
790,7.39
791,7.17
792,6.88
793,6.59
794,6.30
795,6.05
796,5.82
797,5.66
798,5.54
799,5.47
800,5.41
801,5.35
802,5.26
803,5.15
804,5.04
805,4.94
806,4.90
807,4.94
808,5.06
809,5.26
810,5.52
811,5.80
812,6.06
813,6.25
814,6.40
815,6.48
816,6.53
817,6.58
818,6.66
819,6.78
820,6.97
821,7.20
822,7.48
823,7.75
824,8.01
825,8.21
826,8.39
827,8.54
828,8.69
829,8.84
830,9.04
831,9.26
832,9.54
833,9.85
834,10.21
835,10.56
836,10.94
837,11.28
838,11.60
839,11.84
840,12.03
841,12.13
842,12.23
843,12.33
844,12.46
845,12.59
846,12.73
847,12.87
848,13.04
849,13.23
850,13.45
851,13.64
852,13.80
853,13.92
854,14.04
855,14.17
856,14.32
857,14.49
858,14.71
859,14.98
860,15.30
861,15.60
862,15.80
863,15.87
864,15.84
865,15.75
866,15.62
867,15.46
868,15.29
869,15.13
870,14.99
871,14.89
872,14.81
873,14.74
874,14.65
875,14.56
876,14.44
877,14.30
878,14.14
879,14.00
880,13.85
881,13.74
882,13.63
883,13.54
884,13.45
885,13.35
886,13.22
887,13.08
888,12.91
889,12.77
890,12.63
891,12.52
892,12.43
893,12.33
894,12.19
895,11.98
896,11.68
897,11.34
898,10.96
899,10.59
900,10.25
901,10.01
902,9.86
903,9.80
904,9.76
905,9.72
906,9.67
907,9.62
908,9.55
909,9.47
910,9.42
911,9.42
912,9.53
913,9.73
914,10.03
915,10.38
916,10.77
917,11.16
918,11.53
919,11.83
920,12.11
921,12.34
922,12.59
923,12.81
924,12.97
925,13.03
926,13.06
927,13.09
928,13.21
929,13.40
930,13.67
931,13.95
932,14.26
933,14.57
934,14.91
935,15.26
936,15.60
937,15.90
938,16.17
939,16.37
940,16.51
941,16.58
942,16.59
943,16.56
944,16.52
945,16.47
946,16.44
947,16.42
948,16.42
949,16.42
950,16.44
951,16.47
952,16.51
953,16.53
954,16.54
955,16.52
956,16.47
957,16.41
958,16.32
959,16.22
960,16.11
961,16.01
962,15.89
963,15.77
964,15.63
965,15.48
966,15.33
967,15.21
968,15.09
969,14.99
970,14.90
971,14.85
972,14.87
973,14.93
974,14.94
975,14.92
976,14.83
977,14.73
978,14.59
979,14.41
980,14.19
981,13.97
982,13.75
983,13.53
984,13.35
985,13.22
986,13.11
987,13.04
988,12.97
989,12.93
990,12.87
991,12.82
992,12.74
993,12.65
994,12.56
995,12.47
996,12.36
997,12.22
998,12.04
999,11.84
1000,11.59
1001,11.33
1002,11.06
1003,10.82
1004,10.63
1005,10.50
1006,10.42
1007,10.39
1008,10.36
1009,10.34
1010,10.30
1011,10.25
1012,10.20
1013,10.17
1014,10.18
1015,10.24
1016,10.37
1017,10.55
1018,10.76
1019,10.97
1020,11.19
1021,11.40
1022,11.63
1023,11.86
1024,12.12
1025,12.43
1026,12.81
1027,13.16
1028,13.41
1029,13.54
1030,13.66
1031,13.80
1032,13.99
1033,14.19
1034,14.42
1035,14.67
1036,14.97
1037,15.28
1038,15.60
1039,15.88
1040,16.15
1041,16.38
1042,16.60
1043,16.81
1044,17.06
1045,17.33
1046,17.69
1047,18.08
1048,18.52
1049,18.93
1050,19.31
1051,19.61
1052,19.84
1053,19.98
1054,20.07
1055,20.10
1056,20.15
1057,20.20
1058,20.29
1059,20.40
1060,20.51
1061,20.61
1062,20.70
1063,20.77
1064,20.82
1065,20.83
1066,20.83
1067,20.90
1068,21.02
1069,21.09
1070,20.94
1071,20.59
1072,20.14
1073,19.73
1074,19.32
1075,18.90
1076,18.41
1077,17.95
1078,17.49
1079,17.03
1080,16.54
1081,16.07
1082,15.59
1083,15.16
1084,14.74
1085,14.36
1086,14.01
1087,13.72
1088,13.46
1089,13.29
1090,13.16
1091,13.09
1092,13.02
1093,12.97
1094,12.89
1095,12.79
1096,12.64
1097,12.48
1098,12.32
1099,12.19
1100,12.08
1101,12.02
1102,11.97
1103,11.95
1104,11.95
1105,11.94
1106,11.86
1107,11.72
1108,11.52
1109,11.34
1110,11.15
1111,10.96
1112,10.74
1113,10.51
1114,10.26
1115,10.01
1116,9.74
1117,9.49
1118,9.27
1119,9.11
1120,8.99
1121,8.92
1122,8.88
1123,8.88
1124,8.88
1125,8.88
1126,8.86
1127,8.82
1128,8.76
1129,8.68
1130,8.58
1131,8.49
1132,8.43
1133,8.41
1134,8.46
1135,8.54
1136,8.68
1137,8.84
1138,9.02
1139,9.18
1140,9.32
1141,9.42
1142,9.50
1143,9.54
1144,9.57
1145,9.59
1146,9.61
1147,9.62
1148,9.65
1149,9.70
1150,9.79
1151,9.92
1152,10.10
1153,10.29
1154,10.49
1155,10.67
1156,10.80
1157,10.87
1158,10.85
1159,10.75
1160,10.59
1161,10.41
1162,10.22
1163,10.07
1164,9.93
1165,9.81
1166,9.67
1167,9.52
1168,9.32
1169,9.08
1170,8.78
1171,8.46
1172,8.12
1173,7.82
1174,7.55
1175,7.34
1176,7.14
1177,6.97
1178,6.76
1179,6.54
1180,6.25
1181,5.94
1182,5.55
1183,5.13
1184,4.65
1185,4.18
1186,3.69
1187,3.23
1188,2.76
1189,2.35
1190,1.96
1191,1.64
1192,1.37
1193,1.14
1194,0.96
1195,0.81
1196,0.69
1197,0.62
1198,0.60
1199,0.65
1200,0.75
1201,0.90
1202,1.08
1203,1.28
1204,1.47
1205,1.63
1206,1.76
1207,1.84
1208,1.91
1209,1.97
1210,2.10
1211,2.26
1212,2.51
1213,2.81
1214,3.15
1215,3.50
1216,3.85
1217,4.15
1218,4.42
1219,4.63
1220,4.82
1221,4.99
1222,5.15
1223,5.30
1224,5.47
1225,5.64
1226,5.81
1227,5.97
1228,6.09
1229,6.15
1230,6.14
1231,6.05
1232,5.88
1233,5.63
1234,5.30
1235,4.92
1236,4.51
1237,4.12
1238,3.76
1239,3.47
1240,3.22
1241,3.03
1242,2.84
1243,2.66
1244,2.43
1245,2.16
1246,1.81
1247,1.43
1248,1.02
1249,0.63
1250,0.27
1251,0.00
1252,-0.21
1253,-0.36
1254,-0.49
1255,-0.60
1256,-0.75
1257,-0.92
1258,-1.16
1259,-1.41
1260,-1.67
1261,-1.91
1262,-2.12
1263,-2.28
1264,-2.41
1265,-2.51
1266,-2.60
1267,-2.68
1268,-2.77
1269,-2.86
1270,-2.95
1271,-3.01
1272,-3.02
1273,-2.97
1274,-2.84
1275,-2.67
1276,-2.44
1277,-2.19
1278,-1.90
1279,-1.60
1280,-1.28
1281,-0.95
1282,-0.58
1283,-0.20
1284,0.25
1285,0.73
1286,1.27
1287,1.82
1288,2.41
1289,2.98
1290,3.58
1291,4.15
1292,4.75
1293,5.32
1294,5.92
1295,6.51
1296,7.12
1297,7.69
1298,8.26
1299,8.77
1300,9.30
1301,9.71
1302,10.02
1303,10.18
1304,10.35
1305,10.52
1306,10.75
1307,10.95
1308,11.15
1309,11.33
1310,11.47
1311,11.55
1312,11.59
1313,11.57
1314,11.50
1315,11.42
1316,11.32
1317,11.24
1318,11.17
1319,11.11
1320,11.04
1321,10.98
1322,10.90
1323,10.79
1324,10.67
1325,10.52
1326,10.36
1327,10.22
1328,10.11
1329,10.05
1330,10.03
1331,10.04
1332,10.07
1333,10.11
1334,10.14
1335,10.16
1336,10.17
1337,10.20
1338,10.25
1339,10.34
1340,10.47
1341,10.59
1342,10.73
1343,10.86
1344,11.00
1345,11.12
1346,11.22
1347,11.28
1348,11.33
1349,11.39
1350,11.47
1351,11.60
1352,11.79
1353,12.00
1354,12.25
1355,12.49
1356,12.69
1357,12.82
1358,12.89
1359,12.90
1360,12.87
1361,12.80
1362,12.71
1363,12.67
1364,12.74
1365,12.90
1366,13.10
1367,13.25
1368,13.35
1369,13.43
1370,13.50
1371,13.55
1372,13.58
1373,13.59
1374,13.59
1375,13.59
1376,13.57
1377,13.56
1378,13.53
1379,13.49
1380,13.43
1381,13.37
1382,13.25
1383,13.10
1384,12.87
1385,12.58
1386,12.19
1387,11.76
1388,11.24
1389,10.72
1390,10.20
1391,9.74
1392,9.33
1393,9.01
1394,8.75
1395,8.58
1396,8.43
1397,8.30
1398,8.14
1399,7.97
1400,7.72
1401,7.45
1402,7.12
1403,6.77
1404,6.38
1405,6.01
1406,5.60
1407,5.21
1408,4.81
1409,4.43
1410,4.05
1411,3.71
1412,3.38
1413,3.11
1414,2.87
1415,2.67
1416,2.47
1417,2.28
1418,2.04
1419,1.80
1420,1.50
1421,1.18
1422,0.84
1423,0.52
1424,0.21
1425,-0.04
1426,-0.27
1427,-0.49
1428,-0.74
1429,-0.99
1430,-1.21
1431,-1.33
1432,-1.36
1433,-1.32
1434,-1.25
1435,-1.15
1436,-1.01
1437,-0.83
1438,-0.60
1439,-0.38
1440,-0.17
1441,-0.02
1442,0.10
1443,0.18
1444,0.23
1445,0.26
1446,0.31
1447,0.38
1448,0.51
1449,0.67
1450,0.85
1451,1.01
1452,1.16
1453,1.26
1454,1.39
1455,1.50
1456,1.69
1457,1.92
1458,2.27
1459,2.71
1460,3.27
1461,3.89
1462,4.60
1463,5.31
1464,6.09
1465,6.82
1466,7.58
1467,8.29
1468,9.01
1469,9.67
1470,10.31
1471,10.84
1472,11.36
1473,11.80
1474,12.23
1475,12.59
1476,12.91
1477,13.13
1478,13.28
1479,13.36
1480,13.39
1481,13.36
1482,13.33
1483,13.31
1484,13.34
1485,13.41
1486,13.47
1487,13.47
1488,13.42
1489,13.34
1490,13.28
1491,13.26
1492,13.26
1493,13.27
1494,13.29
1495,13.32
1496,13.37
1497,13.42
1498,13.49
1499,13.54
1500,13.59
1501,13.61
1502,13.64
1503,13.64
1504,13.66
1505,13.69
1506,13.77
1507,13.88
1508,14.04
1509,14.23
1510,14.46
1511,14.68
1512,14.91
1513,15.11
1514,15.30
1515,15.45
1516,15.63
1517,15.84
1518,16.13
1519,16.44
1520,16.74
1521,17.00
1522,17.27
1523,17.54
1524,17.81
1525,18.03
1526,18.22
1527,18.34
1528,18.44
1529,18.50
1530,18.57
1531,18.65
1532,18.78
1533,18.96
1534,19.21
1535,19.49
1536,19.82
1537,20.17
1538,20.55
1539,20.91
1540,21.23
1541,21.46
1542,21.59
1543,21.64
1544,21.68
1545,21.72
1546,21.78
1547,21.84
1548,21.89
1549,21.96
1550,22.06
1551,22.18
1552,22.31
1553,22.43
1554,22.55
1555,22.65
1556,22.73
1557,22.78
1558,22.82
1559,22.86
1560,22.90
1561,22.95
1562,22.99
1563,23.01
1564,23.01
1565,22.97
1566,22.87
1567,22.73
1568,22.56
1569,22.38
1570,22.21
1571,22.08
1572,21.99
1573,21.96
1574,21.96
1575,22.00
1576,22.06
1577,22.14
1578,22.23
1579,22.33
1580,22.42
1581,22.51
1582,22.57
1583,22.60
1584,22.57
1585,22.50
1586,22.39
1587,22.26
1588,22.11
1589,21.96
1590,21.81
1591,21.69
1592,21.57
1593,21.49
1594,21.41
1595,21.32
1596,21.21
1597,21.11
1598,21.03
1599,21.02
1600,21.02
1601,21.00
1602,20.94
1603,20.86
1604,20.74
1605,20.61
1606,20.45
1607,20.25
1608,20.02
1609,19.76
1610,19.46
1611,19.13
1612,18.77
1613,18.41
1614,18.06
1615,17.76
1616,17.53
1617,17.41
1618,17.40
1619,17.48
1620,17.63
1621,17.83
1622,18.03
1623,18.21
1624,18.37
1625,18.48
1626,18.56
1627,18.62
1628,18.68
1629,18.75
1630,18.85
1631,18.98
1632,19.12
1633,19.27
1634,19.41
1635,19.52
1636,19.60
1637,19.66
1638,19.69
1639,19.68
1640,19.60
1641,19.42
1642,19.19
1643,18.97
1644,18.80
1645,18.70
1646,18.61
1647,18.51
1648,18.37
1649,18.21
1650,17.98
1651,17.70
1652,17.33
1653,16.94
1654,16.50
1655,16.06
1656,15.57
1657,15.09
1658,14.57
1659,14.06
1660,13.50
1661,12.95
1662,12.35
1663,11.77
1664,11.18
1665,10.64
1666,10.09
1667,9.61
1668,9.12
1669,8.69
1670,8.26
1671,7.87
1672,7.45
1673,7.06
1674,6.61
1675,6.15
1676,5.64
1677,5.14
1678,4.64
1679,4.21
1680,3.85
1681,3.59
1682,3.44
1683,3.40
1684,3.45
1685,3.57
1686,3.74
1687,3.93
1688,4.14
1689,4.36
1690,4.62
1691,4.91
1692,5.28
1693,5.67
1694,6.15
1695,6.64
1696,7.20
1697,7.75
1698,8.34
1699,8.91
1700,9.49
1701,10.03
1702,10.58
1703,11.10
1704,11.60
1705,12.01
1706,12.35
1707,12.59
1708,12.81
1709,13.00
1710,13.20
1711,13.35
1712,13.49
1713,13.60
1714,13.74
1715,13.85
1716,13.97
1717,14.08
1718,14.20
1719,14.31
1720,14.47
1721,14.63
1722,14.85
1723,15.11
1724,15.43
1725,15.76
1726,16.12
1727,16.47
1728,16.82
1729,17.15
1730,17.47
1731,17.75
1732,18.04
1733,18.30
1734,18.59
1735,18.84
1736,19.10
1737,19.35
1738,19.61
1739,19.87
1740,20.16
1741,20.47
1742,20.83
1743,21.13
1744,21.36
1745,21.50
1746,21.62
1747,21.73
1748,21.80
1749,21.82
1750,21.78
1751,21.71
1752,21.64
1753,21.57
1754,21.53
1755,21.53
1756,21.57
1757,21.63
1758,21.72
1759,21.81
1760,21.88
1761,21.92
1762,21.95
1763,21.95
1764,21.95
1765,21.97
1766,21.98
1767,22.02
1768,22.06
1769,22.12
1770,22.17
1771,22.23
1772,22.26
1773,22.27
1774,22.24
1775,22.19
1776,22.09
1777,21.98
1778,21.84
1779,21.71
1780,21.58
1781,21.46
1782,21.37
1783,21.29
1784,21.22
1785,21.17
1786,21.13
1787,21.09
1788,21.06
1789,21.04
1790,21.05
1791,21.09
1792,21.16
1793,21.25
1794,21.36
1795,21.46
1796,21.55
1797,21.62
1798,21.68
1799,21.73
1800,21.78
1801,21.83
1802,21.89
1803,21.97
1804,22.08
1805,22.19
1806,22.31
1807,22.43
1808,22.55
1809,22.66
1810,22.76
1811,22.84
1812,22.90
1813,22.95
1814,22.99
1815,23.03
1816,23.07
1817,23.11
1818,23.18
1819,23.25
1820,23.33
1821,23.42
1822,23.50
1823,23.59
1824,23.67
1825,23.76
1826,23.86
1827,23.93
1828,23.90
1829,23.79
1830,23.60
1831,23.39
1832,23.14
1833,22.86
1834,22.53
1835,22.18
1836,21.79
1837,21.42
1838,21.05
1839,20.72
1840,20.40
1841,20.10
1842,19.80
1843,19.53
1844,19.24
1845,18.98
1846,18.68
1847,18.39
1848,18.10
1849,17.83
1850,17.57
1851,17.35
1852,17.12
1853,16.93
1854,16.72
1855,16.51
1856,16.25
1857,15.98
1858,15.67
1859,15.38
1860,15.06
1861,14.76
1862,14.45
1863,14.18
1864,13.93
1865,13.69
1866,13.45
1867,13.22
1868,12.98
1869,12.74
1870,12.50
1871,12.27
1872,12.03
1873,11.80
1874,11.56
1875,11.34
1876,11.11
1877,10.88
1878,10.64
1879,10.42
1880,10.19
1881,10.00
1882,9.83
1883,9.70
1884,9.62
1885,9.59
1886,9.58
1887,9.60
1888,9.61
1889,9.62
1890,9.59
1891,9.54
1892,9.44
1893,9.32
1894,9.18
1895,9.04
1896,8.92
1897,8.83
1898,8.77
1899,8.74
1900,8.73
1901,8.72
1902,8.73
1903,8.73
1904,8.74
1905,8.75
1906,8.78
1907,8.82
1908,8.87
1909,8.91
1910,8.96
1911,9.00
1912,9.03
1913,9.05
1914,9.05
1915,9.04
1916,8.99
1917,8.91
1918,8.78
1919,8.62
1920,8.40
1921,8.15
1922,7.88
1923,7.60
1924,7.30
1925,7.03
1926,6.76
1927,6.51
1928,6.25
1929,6.00
1930,5.74
1931,5.49
1932,5.24
1933,5.03
1934,4.83
1935,4.67
1936,4.52
1937,4.39
1938,4.28
1939,4.19
1940,4.11
1941,4.06
1942,4.04
1943,4.05
1944,4.09
1945,4.16
1946,4.24
1947,4.32
1948,4.39
1949,4.44
1950,4.47
1951,4.47
1952,4.45
1953,4.42
1954,4.39
1955,4.38
1956,4.41
1957,4.46
1958,4.55
1959,4.66
1960,4.80
1961,4.93
1962,5.06
1963,5.17
1964,5.27
1965,5.35
1966,5.44
1967,5.54
1968,5.66
1969,5.79
1970,5.96
1971,6.14
1972,6.35
1973,6.55
1974,6.75
1975,6.93
1976,7.10
1977,7.25
1978,7.40
1979,7.52
1980,7.64
1981,7.76
1982,7.89
1983,8.02
1984,8.15
1985,8.29
1986,8.43
1987,8.57
1988,8.72
1989,8.83
1990,8.94
1991,9.02
1992,9.12
1993,9.22
1994,9.34
1995,9.48
1996,9.65
1997,9.85
1998,10.09
1999,10.32
2000,10.53
2001,10.70
2002,10.83
2003,10.91
2004,10.96
2005,10.99
2006,11.03
2007,11.08
2008,11.17
2009,11.28
2010,11.41
2011,11.53
2012,11.65
2013,11.73
2014,11.80
2015,11.86
2016,11.93
2017,12.01
2018,12.12
2019,12.24
2020,12.38
2021,12.52
2022,12.64
2023,12.72
2024,12.79
2025,12.84
2026,12.91
2027,13.00
2028,13.15
2029,13.35
2030,13.63
2031,13.96
2032,14.32
2033,14.69
2034,15.02
2035,15.28
2036,15.46
2037,15.53
2038,15.50
2039,15.37
2040,15.19
2041,14.99
2042,14.79
2043,14.61
2044,14.46
2045,14.35
2046,14.23
2047,14.09
2048,13.86
2049,13.54
2050,13.17
2051,12.80
2052,12.44
2053,12.12
2054,11.85
2055,11.62
2056,11.44
2057,11.31
2058,11.22
2059,11.17
2060,11.15
2061,11.15
2062,11.14
2063,11.13
2064,11.13
2065,11.12
2066,11.12
2067,11.12
2068,11.15
2069,11.21
2070,11.32
2071,11.47
2072,11.67
2073,11.89
2074,12.12
2075,12.34
2076,12.54
2077,12.71
2078,12.86
2079,12.99
2080,13.14
2081,13.30
2082,13.49
2083,13.68
2084,13.89
2085,14.08
2086,14.29
2087,14.48
2088,14.67
2089,14.86
2090,15.06
2091,15.26
2092,15.49
2093,15.72
2094,15.99
2095,16.25
2096,16.54
2097,16.82
2098,17.14
2099,17.46
2100,17.82
2101,18.17
2102,18.53
2103,18.87
2104,19.20
2105,19.47
2106,19.72
2107,19.91
2108,20.07
2109,20.19
2110,20.30
2111,20.40
2112,20.49
2113,20.57
2114,20.64
2115,20.66
2116,20.67
2117,20.65
2118,20.63
2119,20.62
2120,20.64
2121,20.67
2122,20.72
2123,20.80
2124,20.91
2125,21.02
2126,21.11
2127,21.15
2128,21.17
2129,21.19
2130,21.21
2131,21.24
2132,21.27
2133,21.29
2134,21.31
2135,21.31
2136,21.29
2137,21.23
2138,21.16
2139,21.06
2140,20.96
2141,20.89
2142,20.85
2143,20.87
2144,20.94
2145,21.06
2146,21.20
2147,21.35
2148,21.49
2149,21.62
2150,21.75
2151,21.83
2152,21.83
2153,21.79
2154,21.76
2155,21.76
2156,21.77
2157,21.79
2158,21.79
2159,21.77
2160,21.73
2161,21.66
2162,21.56
2163,21.46
2164,21.36
2165,21.27
2166,21.20
2167,21.15
2168,21.11
2169,21.08
2170,21.04
2171,20.97
2172,20.85
2173,20.71
2174,20.52
2175,20.33
2176,20.16
2177,20.03
2178,19.94
2179,19.89
2180,19.86
2181,19.85
2182,19.82
2183,19.75
2184,19.62
2185,19.44
2186,19.22
2187,18.98
2188,18.73
2189,18.50
2190,18.29
2191,18.11
2192,17.94
2193,17.78
2194,17.59
2195,17.39
2196,17.17
2197,16.95
2198,16.71
2199,16.51
2200,16.32
2201,16.16
2202,16.00
2203,15.86
2204,15.71
2205,15.57
2206,15.38
2207,15.19
2208,14.97
2209,14.74
2210,14.47
2211,14.19
2212,13.87
2213,13.53
2214,13.15
2215,12.76
2216,12.36
2217,12.01
2218,11.68
2219,11.41
2220,11.18
2221,11.03
2222,10.89
2223,10.79
2224,10.67
2225,10.53
2226,10.33
2227,10.10
2228,9.80
2229,9.47
2230,9.10
2231,8.75
2232,8.42
2233,8.16
2234,7.97
2235,7.85
2236,7.80
2237,7.81
2238,7.84
2239,7.88
2240,7.89
2241,7.87
2242,7.82
2243,7.77
2244,7.72
2245,7.71
2246,7.76
2247,7.87
2248,8.03
2249,8.19
2250,8.36
2251,8.51
2252,8.63
2253,8.70
2254,8.73
2255,8.74
2256,8.76
2257,8.80
2258,8.85
2259,8.92
2260,9.01
2261,9.07
2262,9.10
2263,9.14
2264,9.27
2265,9.48
2266,9.72
2267,9.91
2268,10.04
2269,10.13
2270,10.21
2271,10.29
2272,10.39
2273,10.52
2274,10.69
2275,10.88
2276,11.10
2277,11.30
2278,11.49
2279,11.64
2280,11.78
2281,11.87
2282,11.94
2283,12.00
2284,12.07
2285,12.15
2286,12.26
2287,12.37
2288,12.49
2289,12.60
2290,12.70
2291,12.77
2292,12.82
2293,12.86
2294,12.91
2295,12.96
2296,13.03
2297,13.10
2298,13.14
2299,13.18
2300,13.20
2301,13.22
2302,13.24
2303,13.23
2304,13.18
2305,13.10
2306,12.99
2307,12.88
2308,12.74
2309,12.59
2310,12.42
2311,12.22
2312,11.97
2313,11.70
2314,11.40
2315,11.10
2316,10.79
2317,10.51
2318,10.24
2319,9.99
2320,9.74
2321,9.51
2322,9.27
2323,9.07
2324,8.87
2325,8.71
2326,8.57
2327,8.46
2328,8.36
2329,8.28
2330,8.17
2331,8.04
2332,7.86
2333,7.66
2334,7.44
2335,7.22
2336,7.00
2337,6.83
2338,6.69
2339,6.59
2340,6.48
2341,6.37
2342,6.22
2343,6.04
2344,5.79
2345,5.48
2346,5.12
2347,4.75
2348,4.39
2349,4.08
2350,3.81
2351,3.62
2352,3.45
2353,3.34
2354,3.21
2355,3.06
2356,2.85
2357,2.61
2358,2.32
2359,2.01
2360,1.71
2361,1.46
2362,1.28
2363,1.18
2364,1.15
2365,1.18
2366,1.24
2367,1.29
2368,1.32
2369,1.31
2370,1.27
2371,1.21
2372,1.15
2373,1.12
2374,1.13
2375,1.17
2376,1.23
2377,1.30
2378,1.36
2379,1.40
2380,1.42
2381,1.41
2382,1.40
2383,1.38
2384,1.39
2385,1.43
2386,1.50
2387,1.60
2388,1.72
2389,1.84
2390,1.97
2391,2.08
2392,2.19
2393,2.27
2394,2.34
2395,2.39
2396,2.42
2397,2.43
2398,2.41
2399,2.37
2400,2.32
2401,2.27
2402,2.22
2403,2.19
2404,2.16
2405,2.16
2406,2.17
2407,2.19
2408,2.21
2409,2.20
2410,2.19
2411,2.17
2412,2.15
2413,2.13
2414,2.14
2415,2.18
2416,2.28
2417,2.41
2418,2.60
2419,2.81
2420,3.05
2421,3.28
2422,3.49
2423,3.67
2424,3.81
2425,3.92
2426,4.03
2427,4.12
2428,4.25
2429,4.41
2430,4.62
2431,4.85
2432,5.08
2433,5.29
2434,5.50
2435,5.67
2436,5.82
2437,5.92
2438,5.99
2439,6.05
2440,6.10
2441,6.15
2442,6.20
2443,6.25
2444,6.33
2445,6.43
2446,6.59
2447,6.77
2448,7.01
2449,7.28
2450,7.62
2451,7.99
2452,8.40
2453,8.83
2454,9.30
2455,9.77
2456,10.26
2457,10.68
2458,11.06
2459,11.46
2460,11.91
2461,12.27
2462,12.44
2463,12.37
2464,12.28
2465,12.26
2466,12.33
2467,12.38
2468,12.39
2469,12.36
2470,12.29
2471,12.17
2472,11.99
2473,11.79
2474,11.58
2475,11.38
2476,11.19
2477,11.01
2478,10.83
2479,10.66
2480,10.48
2481,10.31
2482,10.13
2483,9.96
2484,9.80
2485,9.65
2486,9.51
2487,9.38
2488,9.25
2489,9.13
2490,9.04
2491,8.97
2492,8.93
2493,8.94
2494,8.98
2495,9.07
2496,9.20
2497,9.36
2498,9.56
2499,9.76
2500,9.99
2501,10.22
2502,10.48
2503,10.72
2504,10.96
2505,11.19
2506,11.40
2507,11.58
2508,11.76
2509,11.92
2510,12.09
2511,12.25
2512,12.40
2513,12.52
2514,12.62
2515,12.70
2516,12.76
2517,12.80
2518,12.85
2519,12.91
2520,12.98
2521,13.07
2522,13.18
2523,13.29
2524,13.38
2525,13.42
2526,13.44
2527,13.41
2528,13.35
2529,13.27
2530,13.18
2531,13.10
2532,13.04
2533,13.01
2534,13.00
2535,13.01
2536,13.05
2537,13.10
2538,13.16
2539,13.20
2540,13.23
2541,13.23
2542,13.21
2543,13.19
2544,13.19
2545,13.20
2546,13.27
2547,13.37
2548,13.53
2549,13.72
2550,13.94
2551,14.15
2552,14.37
2553,14.55
2554,14.69
2555,14.78
2556,14.86
2557,14.94
2558,15.09
2559,15.26
2560,15.48
2561,15.71
2562,15.98
2563,16.24
2564,16.52
2565,16.78
2566,17.07
2567,17.34
2568,17.61
2569,17.84
2570,18.06
2571,18.22
2572,18.36
2573,18.44
2574,18.52
2575,18.59
2576,18.70
2577,18.81
2578,18.97
2579,19.14
2580,19.33
2581,19.51
2582,19.69
2583,19.85
2584,20.01
2585,20.16
2586,20.33
2587,20.50
2588,20.68
2589,20.85
2590,21.01
2591,21.16
2592,21.30
2593,21.42
2594,21.51
2595,21.59
2596,21.64
2597,21.65
2598,21.62
2599,21.54
2600,21.40
2601,21.21
2602,20.96
2603,20.69
2604,20.40
2605,20.11
2606,19.82
2607,19.54
2608,19.24
2609,18.95
2610,18.61
2611,18.26
2612,17.87
2613,17.50
2614,17.11
2615,16.76
2616,16.41
2617,16.10
2618,15.78
2619,15.49
2620,15.15
2621,14.80
2622,14.40
2623,13.97
2624,13.49
2625,12.99
2626,12.45
2627,11.95
2628,11.45
2629,11.02
2630,10.60
2631,10.23
2632,9.85
2633,9.49
2634,9.10
2635,8.71
2636,8.27
2637,7.84
2638,7.37
2639,6.94
2640,6.51
2641,6.13
2642,5.76
2643,5.40
2644,5.02
2645,4.64
2646,4.24
2647,3.87
2648,3.51
2649,3.21
2650,2.96
2651,2.81
2652,2.71
2653,2.67
2654,2.63
2655,2.58
2656,2.47
2657,2.30
2658,2.07
2659,1.82
2660,1.55
2661,1.32
2662,1.14
2663,1.03
2664,0.98
2665,0.99
2666,1.03
2667,1.07
2668,1.06
2669,1.01
2670,0.89
2671,0.74
2672,0.56
2673,0.39
2674,0.25
2675,0.15
2676,0.09
2677,0.06
2678,0.05
2679,0.05
2680,0.05
2681,0.04
2682,0.02
2683,0.00
2684,0.02
2685,0.06
2686,0.16
2687,0.29
2688,0.48
2689,0.68
2690,0.91
2691,1.12
2692,1.32
2693,1.51
2694,1.70
2695,1.88
2696,2.07
2697,2.26
2698,2.50
2699,2.76
2700,3.05
2701,3.34
2702,3.65
2703,3.94
2704,4.25
2705,4.52
2706,4.80
2707,5.08
2708,5.41
2709,5.76
2710,6.18
2711,6.60
2712,7.06
2713,7.52
2714,7.98
2715,8.40
2716,8.81
2717,9.17
2718,9.55
2719,9.89
2720,10.25
2721,10.60
2722,10.94
2723,11.25
2724,11.52
2725,11.72
2726,11.83
2727,11.84
2728,11.76
2729,11.60
2730,11.41
2731,11.22
2732,11.03
2733,10.87
2734,10.72
2735,10.60
2736,10.44
2737,10.26
2738,10.01
2739,9.71
2740,9.34
2741,8.94
2742,8.52
2743,8.12
2744,7.75
2745,7.44
2746,7.18
2747,7.01
2748,6.89
2749,6.82
2750,6.78
2751,6.77
2752,6.76
2753,6.75
2754,6.71
2755,6.66
2756,6.58
2757,6.51
2758,6.45
2759,6.43
2760,6.45
2761,6.50
2762,6.61
2763,6.75
2764,6.94
2765,7.14
2766,7.34
2767,7.52
2768,7.67
2769,7.79
2770,7.90
2771,8.00
2772,8.10
2773,8.22
2774,8.36
2775,8.52
2776,8.70
2777,8.89
2778,9.07
2779,9.23
2780,9.34
2781,9.40
2782,9.42
2783,9.41
2784,9.37
2785,9.31
2786,9.24
2787,9.17
2788,9.09
2789,9.03
2790,8.95
2791,8.86
2792,8.74
2793,8.61
2794,8.43
2795,8.22
2796,7.98
2797,7.71
2798,7.43
2799,7.15
2800,6.89
2801,6.67
2802,6.50
2803,6.40
2804,6.34
2805,6.35
2806,6.39
2807,6.46
2808,6.53
2809,6.60
2810,6.67
2811,6.74
2812,6.81
2813,6.87
2814,6.92
2815,6.98
2816,7.02
2817,7.05
2818,7.08
2819,7.10
2820,7.14
2821,7.17
2822,7.23
2823,7.30
2824,7.39
2825,7.48
2826,7.57
2827,7.66
2828,7.77
2829,7.90
2830,8.09
2831,8.32
2832,8.60
2833,8.91
2834,9.27
2835,9.64
2836,10.02
2837,10.33
2838,10.64
2839,10.98
2840,11.40
2841,11.79
2842,12.07
2843,12.23
2844,12.38
2845,12.60
2846,12.87
2847,13.13
2848,13.37
2849,13.56
2850,13.72
2851,13.81
2852,13.83
2853,13.78
2854,13.67
2855,13.51
2856,13.31
2857,13.09
2858,12.86
2859,12.65
2860,12.46
2861,12.30
2862,12.13
2863,11.94
2864,11.70
2865,11.44
2866,11.13
2867,10.83
2868,10.51
2869,10.20
2870,9.89
2871,9.63
2872,9.38
2873,9.17
2874,8.98
2875,8.82
2876,8.63
2877,8.44
2878,8.22
2879,8.00
2880,7.78
2881,7.58
2882,7.39
2883,7.23
2884,7.08
2885,6.94
2886,6.78
2887,6.61
2888,6.40
2889,6.16
2890,5.91
2891,5.68
2892,5.47
2893,5.31
2894,5.20
2895,5.17
2896,5.18
2897,5.24
2898,5.32
2899,5.41
2900,5.48
2901,5.53
2902,5.54
2903,5.51
2904,5.47
2905,5.44
2906,5.44
2907,5.48
2908,5.58
2909,5.73
2910,5.93
2911,6.12
2912,6.25
2913,6.26
2914,6.18
2915,6.06
2916,5.97
2917,5.94
2918,5.99
2919,6.08
2920,6.22
2921,6.42
2922,6.68
2923,6.93
2924,7.15
2925,7.30
2926,7.44
2927,7.58
2928,7.76
2929,7.94
2930,8.20
2931,8.51
2932,8.95
2933,9.48
2934,10.14
2935,10.86
2936,11.66
2937,12.45
2938,13.23
2939,13.93
2940,14.57
2941,15.09
2942,15.56
2943,15.92
2944,16.26
2945,16.54
2946,16.83
2947,17.07
2948,17.33
2949,17.55
2950,17.76
2951,17.94
2952,18.10
2953,18.22
2954,18.31
2955,18.37
2956,18.43
2957,18.49
2958,18.57
2959,18.66
2960,18.77
2961,18.90
2962,19.03
2963,19.13
2964,19.18
2965,19.17
2966,19.08
2967,18.92
2968,18.69
2969,18.42
2970,18.09
2971,17.77
2972,17.46
2973,17.19
2974,16.94
2975,16.73
2976,16.52
2977,16.34
2978,16.12
2979,15.89
2980,15.60
2981,15.31
2982,15.00
2983,14.71
2984,14.42
2985,14.17
2986,13.94
2987,13.77
2988,13.63
2989,13.55
2990,13.51
2991,13.51
2992,13.53
2993,13.58
2994,13.65
2995,13.75
2996,13.87
2997,14.00
2998,14.16
2999,14.33
3000,14.53
3001,14.74
3002,14.97
3003,15.19
3004,15.43
3005,15.66
3006,15.91
3007,16.15
3008,16.40
3009,16.62
3010,16.85
3011,17.06
3012,17.26
3013,17.43
3014,17.62
3015,17.81
3016,18.04
3017,18.26
3018,18.51
3019,18.80
3020,19.20
3021,19.65
3022,20.13
3023,20.55
3024,20.97
3025,21.37
3026,21.81
3027,22.22
3028,22.64
3029,23.01
3030,23.40
3031,23.76
3032,24.13
3033,24.48
3034,24.84
3035,25.16
3036,25.51
3037,25.82
3038,26.13
3039,26.39
3040,26.63
3041,26.81
3042,26.97
3043,27.11
3044,27.26
3045,27.40
3046,27.56
3047,27.69
3048,27.80
3049,27.85
3050,27.86
3051,27.82
3052,27.74
3053,27.65
3054,27.58
3055,27.53
3056,27.50
3057,27.47
3058,27.42
3059,27.33
3060,27.14
3061,26.86
3062,26.44
3063,25.93
3064,25.30
3065,24.61
3066,23.86
3067,23.13
3068,22.41
3069,21.78
3070,21.19
3071,20.70
3072,20.24
3073,19.86
3074,19.45
3075,19.08
3076,18.65
3077,18.21
3078,17.68
3079,17.15
3080,16.57
3081,16.01
3082,15.42
3083,14.86
3084,14.29
3085,13.78
3086,13.26
3087,12.79
3088,12.31
3089,11.89
3090,11.46
3091,11.08
3092,10.72
3093,10.42
3094,10.16
3095,9.99
3096,9.88
3097,9.85
3098,9.86
3099,9.92
3100,9.96
3101,9.97
3102,9.92
3103,9.82
3104,9.65
3105,9.43
3106,9.20
3107,8.99
3108,8.82
3109,8.73
3110,8.73
3111,8.82
3112,8.99
3113,9.22
3114,9.47
3115,9.72
3116,9.94
3117,10.10
3118,10.21
3119,10.28
3120,10.35
3121,10.41
3122,10.50
3123,10.61
3124,10.78
3125,10.98
3126,11.22
3127,11.49
3128,11.81
3129,12.16
3130,12.54
3131,12.91
3132,13.28
3133,13.63
3134,13.97
3135,14.25
3136,14.45
3137,14.57
3138,14.64
3139,14.64
3140,14.63
3141,14.58
3142,14.55
3143,14.53
3144,14.55
3145,14.59
3146,14.68
3147,14.77
3148,14.87
3149,14.95
3150,15.03
3151,15.10
3152,15.19
3153,15.30
3154,15.48
3155,15.74
3156,16.09
3157,16.49
3158,16.94
3159,17.38
3160,17.79
3161,18.12
3162,18.36
3163,18.49
3164,18.55
3165,18.56
3166,18.56
3167,18.56
3168,18.60
3169,18.66
3170,18.75
3171,18.84
3172,18.91
3173,18.95
3174,18.96
3175,18.94
3176,18.88
3177,18.79
3178,18.66
3179,18.51
3180,18.31
3181,18.07
3182,17.78
3183,17.45
3184,17.09
3185,16.73
3186,16.35
3187,16.01
3188,15.68
3189,15.40
3190,15.10
3191,14.84
3192,14.55
3193,14.27
3194,13.91
3195,13.54
3196,13.11
3197,12.66
3198,12.17
3199,11.68
3200,11.17
3201,10.69
3202,10.18
3203,9.70
3204,9.14
3205,8.60
3206,8.02
3207,7.51
3208,7.00
3209,6.53
3210,6.03
3211,5.55
3212,5.05
3213,4.62
3214,4.20
3215,3.85
3216,3.50
3217,3.20
3218,2.88
3219,2.60
3220,2.33
3221,2.11
3222,1.93
3223,1.81
3224,1.72
3225,1.66
3226,1.60
3227,1.53
3228,1.41
3229,1.28
3230,1.15
3231,1.05
3232,0.98
3233,0.96
3234,0.98
3235,1.01
3236,1.03
3237,1.01
3238,0.92
3239,0.80
3240,0.66
3241,0.53
3242,0.45
3243,0.45
3244,0.53
3245,0.69
3246,0.90
3247,1.09
3248,1.26
3249,1.38
3250,1.46
3251,1.51
3252,1.57
3253,1.64
3254,1.78
3255,1.94
3256,2.14
3257,2.32
3258,2.47
3259,2.55
3260,2.58
3261,2.55
3262,2.49
3263,2.43
3264,2.40
3265,2.43
3266,2.55
3267,2.75
3268,3.03
3269,3.35
3270,3.72
3271,4.07
3272,4.41
3273,4.69
3274,4.92
3275,5.09
3276,5.22
3277,5.33
3278,5.42
3279,5.51
3280,5.60
3281,5.69
3282,5.78
3283,5.85
3284,5.90
3285,5.92
3286,5.94
3287,5.97
3288,6.05
3289,6.16
3290,6.34
3291,6.57
3292,6.87
3293,7.19
3294,7.57
3295,7.98
3296,8.44
3297,8.91
3298,9.45
3299,9.99
3300,10.59
3301,11.19
3302,11.84
3303,12.48
3304,13.17
3305,13.84
3306,14.54
3307,15.18
3308,15.81
3309,16.40
3310,16.96
3311,17.35
3312,17.53
3313,17.52
3314,17.47
3315,17.44
3316,17.46
3317,17.44
3318,17.42
3319,17.37
3320,17.32
3321,17.23
3322,17.12
3323,16.98
3324,16.81
3325,16.63
3326,16.43
3327,16.24
3328,16.05
3329,15.89
3330,15.75
3331,15.65
3332,15.59
3333,15.59
3334,15.59
3335,15.58
3336,15.50
3337,15.36
3338,15.17
3339,15.01
3340,14.84
3341,14.68
3342,14.47
3343,14.26
3344,14.05
3345,13.87
3346,13.70
3347,13.53
3348,13.32
3349,13.09
3350,12.84
3351,12.61
3352,12.38
3353,12.19
3354,12.05
3355,11.97
3356,11.93
3357,11.91
3358,11.91
3359,11.91
3360,11.91
3361,11.92
3362,11.92
3363,11.92
3364,11.91
3365,11.90
3366,11.90
3367,11.88
3368,11.87
3369,11.87
3370,11.87
3371,11.88
3372,11.90
3373,11.91
3374,11.91
3375,11.90
3376,11.84
3377,11.74
3378,11.58
3379,11.40
3380,11.21
3381,11.03
3382,10.86
3383,10.71
3384,10.58
3385,10.45
3386,10.27
3387,10.06
3388,9.78
3389,9.47
3390,9.10
3391,8.72
3392,8.35
3393,8.04
3394,7.79
3395,7.60
3396,7.46
3397,7.39
3398,7.34
3399,7.25
3400,7.01
3401,6.65
3402,6.22
3403,5.83
3404,5.48
3405,5.20
3406,5.00
3407,4.91
3408,4.94
3409,5.07
3410,5.28
3411,5.53
3412,5.80
3413,6.05
3414,6.29
3415,6.53
3416,6.80
3417,7.09
3418,7.43
3419,7.80
3420,8.23
3421,8.68
3422,9.14
3423,9.56
3424,9.92
3425,10.19
3426,10.39
3427,10.52
3428,10.62
3429,10.70
3430,10.80
3431,10.92
3432,11.08
3433,11.23
3434,11.36
3435,11.40
3436,11.39
3437,11.33
3438,11.24
3439,11.13
3440,11.04
3441,11.00
3442,11.05
3443,11.19
3444,11.41
3445,11.68
3446,11.94
3447,12.14
3448,12.24
3449,12.22
3450,12.09
3451,11.90
3452,11.69
3453,11.50
3454,11.39
3455,11.38
3456,11.48
3457,11.64
3458,11.82
3459,11.95
3460,12.01
3461,11.99
3462,11.90
3463,11.73
3464,11.54
3465,11.37
3466,11.27
3467,11.26
3468,11.37
3469,11.57
3470,11.84
3471,12.14
3472,12.45
3473,12.70
3474,12.90
3475,13.02
3476,13.10
3477,13.12
3478,13.12
3479,13.10
3480,13.10
3481,13.14
3482,13.21
3483,13.29
3484,13.40
3485,13.51
3486,13.63
3487,13.73
3488,13.81
3489,13.85
3490,13.85
3491,13.83
3492,13.79
3493,13.73
3494,13.66
3495,13.60
3496,13.51
3497,13.44
3498,13.35
3499,13.23
3500,13.06
3501,12.85
3502,12.58
3503,12.27
3504,11.92
3505,11.55
3506,11.15
3507,10.75
3508,10.31
3509,9.88
3510,9.43
3511,9.00
3512,8.55
3513,8.15
3514,7.78
3515,7.46
3516,7.18
3517,6.96
3518,6.75
3519,6.58
3520,6.41
3521,6.27
3522,6.14
3523,6.03
3524,5.97
3525,5.95
3526,5.98
3527,6.05
3528,6.17
3529,6.31
3530,6.45
3531,6.59
3532,6.74
3533,6.88
3534,7.02
3535,7.14
3536,7.25
3537,7.34
3538,7.40
3539,7.45
3540,7.48
3541,7.50
3542,7.54
3543,7.60
3544,7.68
3545,7.79
3546,7.91
3547,8.01
3548,8.07
3549,8.07
3550,8.00
3551,7.87
3552,7.69
3553,7.47
3554,7.24
3555,7.00
3556,6.80
3557,6.66
3558,6.56
3559,6.53
3560,6.56
3561,6.65
3562,6.77
3563,6.92
3564,7.05
3565,7.16
3566,7.23
3567,7.24
3568,7.22
3569,7.17
3570,7.10
3571,7.05
3572,7.02
3573,7.03
3574,7.07
3575,7.14
3576,7.24
3577,7.35
3578,7.45
3579,7.54
3580,7.62
3581,7.70
3582,7.79
3583,7.91
3584,8.08
3585,8.29
3586,8.55
3587,8.83
3588,9.14
3589,9.49
3590,9.90
3591,10.28
3592,10.58
3593,10.77
3594,10.90
3595,10.96
3596,10.93
3597,10.78
3598,10.55
3599,10.32
3600,10.12
3601,9.92
3602,9.71
3603,9.52
3604,9.36
3605,9.22
3606,9.12
3607,9.05
3608,9.02
3609,9.05
3610,9.13
3611,9.27
3612,9.43
3613,9.62
3614,9.81
3615,9.98
3616,10.13
3617,10.24
3618,10.33
3619,10.40
3620,10.47
3621,10.56
3622,10.68
3623,10.84
3624,11.04
3625,11.25
3626,11.50
3627,11.75
3628,12.01
3629,12.26
3630,12.52
3631,12.77
3632,13.05
3633,13.32
3634,13.64
3635,13.94
3636,14.28
3637,14.61
3638,14.98
3639,15.33
3640,15.70
3641,16.06
3642,16.45
3643,16.84
3644,17.27
3645,17.68
3646,18.12
3647,18.53
3648,18.94
3649,19.28
3650,19.59
3651,19.81
3652,19.98
3653,20.07
3654,20.15
3655,20.20
3656,20.27
3657,20.33
3658,20.43
3659,20.54
3660,20.67
3661,20.81
3662,20.97
3663,21.12
3664,21.31
3665,21.50
3666,21.66
3667,21.78
3668,21.89
3669,22.00
3670,22.16
3671,22.36
3672,22.59
3673,22.81
3674,23.03
3675,23.24
3676,23.43
3677,23.58
3678,23.65
3679,23.65
3680,23.65
3681,23.65
3682,23.69
3683,23.74
3684,23.81
3685,23.88
3686,23.97
3687,24.04
3688,24.08
3689,24.10
3690,24.08
3691,24.04
3692,23.97
3693,23.87
3694,23.75
3695,23.61
3696,23.45
3697,23.28
3698,23.10
3699,22.94
3700,22.81
3701,22.72
3702,22.70
3703,22.74
3704,22.86
3705,23.03
3706,23.25
3707,23.46
3708,23.67
3709,23.84
3710,24.00
3711,24.11
3712,24.23
3713,24.34
3714,24.50
3715,24.69
3716,24.95
3717,25.24
3718,25.58
3719,25.92
3720,26.23
3721,26.45
3722,26.62
3723,26.74
3724,26.83
3725,26.89
3726,26.94
3727,26.98
3728,27.01
3729,27.00
3730,26.95
3731,26.86
3732,26.73
3733,26.58
3734,26.41
3735,26.25
3736,26.11
3737,26.01
3738,25.94
3739,25.90
3740,25.82
3741,25.70
3742,25.49
3743,25.22
3744,24.91
3745,24.61
3746,24.29
3747,23.99
3748,23.66
3749,23.35
3750,23.02
3751,22.71
3752,22.39
3753,22.09
3754,21.76
3755,21.43
3756,21.06
3757,20.70
3758,20.30
3759,19.93
3760,19.52
3761,19.12
3762,18.69
3763,18.26
3764,17.80
3765,17.35
3766,16.87
3767,16.41
3768,15.96
3769,15.58
3770,15.22
3771,14.93
3772,14.67
3773,14.46
3774,14.22
3775,14.00
3776,13.73
3777,13.44
3778,13.08
3779,12.72
3780,12.30
3781,11.89
3782,11.45
3783,11.05
3784,10.64
3785,10.27
3786,9.88
3787,9.52
3788,9.13
3789,8.75
3790,8.31
3791,7.87
3792,7.36
3793,6.85
3794,6.30
3795,5.79
3796,5.27
3797,4.80
3798,4.37
3799,4.02
3800,3.72
3801,3.51
3802,3.36
3803,3.27
3804,3.23
3805,3.23
3806,3.24
3807,3.27
3808,3.31
3809,3.37
3810,3.44
3811,3.55
3812,3.67
3813,3.82
3814,3.98
3815,4.12
3816,4.23
3817,4.26
3818,4.24
3819,4.15
3820,4.05
3821,3.96
3822,3.92
3823,3.95
3824,4.10
3825,4.35
3826,4.69
3827,5.05
3828,5.42
3829,5.74
3830,6.01
3831,6.20
3832,6.36
3833,6.48
3834,6.63
3835,6.82
3836,7.11
3837,7.45
3838,7.89
3839,8.37
3840,8.89
3841,9.38
3842,9.84
3843,10.21
3844,10.53
3845,10.75
3846,10.95
3847,11.09
3848,11.26
3849,11.43
3850,11.65
3851,11.89
3852,12.19
3853,12.51
3854,12.85
3855,13.17
3856,13.49
3857,13.76
3858,14.00
3859,14.19
3860,14.36
3861,14.47
3862,14.55
3863,14.60
3864,14.64
3865,14.65
3866,14.67
3867,14.67
3868,14.69
3869,14.71
3870,14.75
3871,14.79
3872,14.85
3873,14.93
3874,15.05
3875,15.18
3876,15.33
3877,15.48
3878,15.64
3879,15.81
3880,16.01
3881,16.22
3882,16.46
3883,16.72
3884,17.03
3885,17.32
3886,17.60
3887,17.82
3888,18.04
3889,18.24
3890,18.45
3891,18.62
3892,18.77
3893,18.88
3894,18.97
3895,19.06
3896,19.20
3897,19.36
3898,19.54
3899,19.69
3900,19.82
3901,19.91
3902,19.99
3903,20.06
3904,20.14
3905,20.25
3906,20.38
3907,20.52
3908,20.65
3909,20.75
3910,20.78
3911,20.73
3912,20.62
3913,20.46
3914,20.28
3915,20.10
3916,19.96
3917,19.87
3918,19.82
3919,19.79
3920,19.73
3921,19.64
3922,19.48
3923,19.25
3924,18.94
3925,18.60
3926,18.28
3927,18.06
3928,17.92
3929,17.86
3930,17.81
3931,17.78
3932,17.74
3933,17.70
3934,17.64
3935,17.57
3936,17.48
3937,17.39
3938,17.30
3939,17.24
3940,17.18
3941,17.13
3942,17.09
3943,17.04
3944,16.99
3945,16.93
3946,16.86
3947,16.79
3948,16.70
3949,16.62
3950,16.52
3951,16.41
3952,16.26
3953,16.10
3954,15.90
3955,15.69
3956,15.43
3957,15.17
3958,14.86
3959,14.55
3960,14.19
3961,13.84
3962,13.45
3963,13.01
3964,12.43
3965,11.77
3966,11.07
3967,10.41
3968,9.79
3969,9.25
3970,8.76
3971,8.38
3972,8.07
3973,7.87
3974,7.72
3975,7.63
3976,7.54
3977,7.47
3978,7.39
3979,7.30
3980,7.20
3981,7.10
3982,7.01
3983,6.96
3984,6.95
3985,6.96
3986,6.99
3987,7.03
3988,7.06
3989,7.07
3990,7.05
3991,7.00
3992,6.95
3993,6.90
3994,6.89
3995,6.92
3996,7.01
3997,7.14
3998,7.34
3999,7.55
4000,7.80
4001,8.02
4002,8.25
4003,8.44
4004,8.62
4005,8.79
4006,8.99
4007,9.19
4008,9.45
4009,9.72
4010,10.08
4011,10.46
4012,10.90
4013,11.34
4014,11.83
4015,12.30
4016,12.81
4017,13.30
4018,13.79
4019,14.25
4020,14.71
4021,15.12
4022,15.52
4023,15.86
4024,16.20
4025,16.50
4026,16.83
4027,17.13
4028,17.48
4029,17.82
4030,18.18
4031,18.52
4032,18.88
4033,19.24
4034,19.59
4035,19.90
4036,20.17
4037,20.37
4038,20.50
4039,20.54
4040,20.50
4041,20.38
4042,20.21
4043,20.01
4044,19.80
4045,19.59
4046,19.39
4047,19.21
4048,19.03
4049,18.86
4050,18.68
4051,18.48
4052,18.29
4053,18.12
4054,17.99
4055,17.91
4056,17.90
4057,17.95
4058,18.06
4059,18.21
4060,18.38
4061,18.54
4062,18.66
4063,18.74
4064,18.79
4065,18.80
4066,18.80
4067,18.81
4068,18.83
4069,18.88
4070,18.93
4071,18.98
4072,19.03
4073,19.04
4074,19.01
4075,18.95
4076,18.86
4077,18.76
4078,18.66
4079,18.58
4080,18.52
4081,18.51
4082,18.54
4083,18.61
4084,18.73
4085,18.87
4086,19.06
4087,19.27
4088,19.51
4089,19.74
4090,19.99
4091,20.21
4092,20.44
4093,20.68
4094,20.96
4095,21.25
4096,21.59
4097,21.96
4098,22.36
4099,22.76
4100,23.17
4101,23.54
4102,23.90
4103,24.21
4104,24.47
4105,24.69
4106,24.87
4107,25.00
4108,25.10
4109,25.15
4110,25.18
4111,25.21
4112,25.24
4113,25.26
4114,25.27
4115,25.25
4116,25.19
4117,25.09
4118,24.93
4119,24.73
4120,24.49
4121,24.24
4122,23.99
4123,23.78
4124,23.58
4125,23.40
4126,23.21
4127,23.00
4128,22.76
4129,22.48
4130,22.14
4131,21.80
4132,21.45
4133,21.19
4134,20.99
4135,20.89
4136,20.82
4137,20.76
4138,20.65
4139,20.50
4140,20.33
4141,20.17
4142,20.02
4143,19.91
4144,19.84
4145,19.83
4146,19.86
4147,19.92
4148,20.00
4149,20.08
4150,20.14
4151,20.17
4152,20.18
4153,20.18
4154,20.22
4155,20.29
4156,20.39
4157,20.52
4158,20.67
4159,20.81
4160,20.94
4161,21.04
4162,21.13
4163,21.22
4164,21.29
4165,21.36
4166,21.40
4167,21.43
4168,21.45
4169,21.48
4170,21.49
4171,21.49
4172,21.49
4173,21.48
4174,21.45
4175,21.41
4176,21.34
4177,21.24
4178,21.08
4179,20.89
4180,20.66
4181,20.44
4182,20.22
4183,20.01
4184,19.80
4185,19.61
4186,19.42
4187,19.22
4188,19.01
4189,18.80
4190,18.60
4191,18.43
4192,18.28
4193,18.16
4194,18.08
4195,18.03
4196,17.98
4197,17.96
4198,17.93
4199,17.90
4200,17.87
4201,17.85
4202,17.82
4203,17.79
4204,17.76
4205,17.72
4206,17.70
4207,17.71
4208,17.74
4209,17.80
4210,17.90
4211,18.03
4212,18.19
4213,18.37
4214,18.57
4215,18.77
4216,18.99
4217,19.23
4218,19.50
4219,19.77
4220,20.04
4221,20.30
4222,20.50
4223,20.64
4224,20.69
4225,20.65
4226,20.49
4227,20.27
4228,19.98
4229,19.66
4230,19.31
4231,18.95
4232,18.58
4233,18.21
4234,17.81
4235,17.42
4236,16.99
4237,16.57
4238,16.09
4239,15.59
4240,15.00
4241,14.38
4242,13.73
4243,13.20
4244,12.78
4245,12.48
4246,12.17
4247,11.83
4248,11.45
4249,11.11
4250,10.78
4251,10.49
4252,10.18
4253,9.91
4254,9.62
4255,9.35
4256,9.05
4257,8.78
4258,8.50
4259,8.22
4260,7.92
4261,7.63
4262,7.32
4263,7.02
4264,6.71
4265,6.43
4266,6.16
4267,5.94
4268,5.73
4269,5.57
4270,5.42
4271,5.30
4272,5.19
4273,5.09
4274,4.99
4275,4.90
4276,4.82
4277,4.74
4278,4.66
4279,4.58
4280,4.49
4281,4.39
4282,4.29
4283,4.19
4284,4.09
4285,4.00
4286,3.90
4287,3.80
4288,3.69
4289,3.59
4290,3.47
4291,3.36
4292,3.25
4293,3.19
4294,3.15
4295,3.16
4296,3.17
4297,3.17
4298,3.13
4299,3.05
4300,2.93
4301,2.77
4302,2.60
4303,2.45
4304,2.34
4305,2.30
4306,2.29
4307,2.31
4308,2.30
4309,2.26
4310,2.15
4311,2.00
4312,1.81
4313,1.61
4314,1.45
4315,1.34
4316,1.30
4317,1.32
4318,1.39
4319,1.46
4320,1.50
4321,1.48
4322,1.40
4323,1.27
4324,1.09
4325,0.92
4326,0.77
4327,0.67
4328,0.60
4329,0.57
4330,0.57
4331,0.58
4332,0.57
4333,0.54
4334,0.45
4335,0.33
4336,0.16
4337,-0.04
4338,-0.26
4339,-0.47
4340,-0.69
4341,-0.89
4342,-1.11
4343,-1.30
4344,-1.51
4345,-1.70
4346,-1.90
4347,-2.10
4348,-2.32
4349,-2.54
4350,-2.78
4351,-3.01
4352,-3.25
4353,-3.48
4354,-3.70
4355,-3.86
4356,-3.98
4357,-4.04
4358,-4.06
4359,-4.06
4360,-4.03
4361,-3.99
4362,-3.94
4363,-3.90
4364,-3.86
4365,-3.82
4366,-3.77
4367,-3.71
4368,-3.60
4369,-3.46
4370,-3.26
4371,-3.05
4372,-2.80
4373,-2.53
4374,-2.22
4375,-1.92
4376,-1.58
4377,-1.26
4378,-0.94
4379,-0.66
4380,-0.39
4381,-0.17
4382,0.05
4383,0.26
4384,0.47
4385,0.64
4386,0.80
4387,0.95
4388,1.14
4389,1.35
4390,1.57
4391,1.73
4392,1.89
4393,2.04
4394,2.22
4395,2.39
4396,2.59
4397,2.77
4398,2.97
4399,3.14
4400,3.31
4401,3.46
4402,3.61
4403,3.77
4404,3.94
4405,4.11
4406,4.31
4407,4.48
4408,4.63
4409,4.73
4410,4.79
4411,4.81
4412,4.82
4413,4.83
4414,4.88
4415,4.98
4416,5.15
4417,5.37
4418,5.65
4419,5.94
4420,6.27
4421,6.59
4422,6.93
4423,7.24
4424,7.57
4425,7.88
4426,8.21
4427,8.54
4428,8.89
4429,9.24
4430,9.63
4431,10.00
4432,10.40
4433,10.76
4434,11.13
4435,11.44
4436,11.75
4437,12.00
4438,12.25
4439,12.48
4440,12.73
4441,13.01
4442,13.35
4443,13.72
4444,14.14
4445,14.54
4446,14.92
4447,15.23
4448,15.49
4449,15.68
4450,15.85
4451,16.02
4452,16.26
4453,16.50
4454,16.78
4455,17.08
4456,17.47
4457,17.90
4458,18.25
4459,18.44
4460,18.49
4461,18.43
4462,18.32
4463,18.18
4464,18.05
4465,17.94
4466,17.85
4467,17.78
4468,17.72
4469,17.65
4470,17.58
4471,17.49
4472,17.39
4473,17.30
4474,17.21
4475,17.13
4476,17.04
4477,16.95
4478,16.82
4479,16.66
4480,16.45
4481,16.23
4482,15.99
4483,15.77
4484,15.60
4485,15.51
4486,15.49
4487,15.56
4488,15.67
4489,15.81
4490,15.91
4491,15.99
4492,15.99
4493,15.93
4494,15.76
4495,15.55
4496,15.31
4497,15.08
4498,14.82
4499,14.57
4500,14.38
4501,14.26
4502,14.14
4503,13.97
4504,13.68
4505,13.34
4506,12.96
4507,12.59
4508,12.25
4509,11.99
4510,11.80
4511,11.71
4512,11.69
4513,11.74
4514,11.83
4515,11.94
4516,12.05
4517,12.15
4518,12.22
4519,12.26
4520,12.27
4521,12.26
4522,12.27
4523,12.29
4524,12.37
4525,12.54
4526,12.82
4527,13.16
4528,13.53
4529,13.86
4530,14.18
4531,14.45
4532,14.68
4533,14.83
4534,14.93
4535,14.99
4536,15.06
4537,15.13
4538,15.23
4539,15.34
4540,15.44
4541,15.52
4542,15.56
4543,15.55
4544,15.50
4545,15.44
4546,15.39
4547,15.34
4548,15.31
4549,15.28
4550,15.23
4551,15.15
4552,15.02
4553,14.83
4554,14.58
4555,14.31
4556,14.04
4557,13.82
4558,13.66
4559,13.58
4560,13.59
4561,13.67
4562,13.80
4563,13.97
4564,14.18
4565,14.40
4566,14.68
4567,14.99
4568,15.37
4569,15.79
4570,16.26
4571,16.77
4572,17.32
4573,17.78
4574,18.09
4575,18.23
4576,18.31
4577,18.36
4578,18.38
4579,18.33
4580,18.26
4581,18.18
4582,18.12
4583,18.08
4584,18.07
4585,18.08
4586,18.11
4587,18.14
4588,18.15
4589,18.15
4590,18.12
4591,18.05
4592,17.95
4593,17.83
4594,17.71
4595,17.58
4596,17.44
4597,17.31
4598,17.16
4599,16.99
4600,16.79
4601,16.64
4602,16.60
4603,16.68
4604,16.82
4605,16.95
4606,17.11
4607,17.28
4608,17.48
4609,17.68
4610,17.90
4611,18.11
4612,18.36
4613,18.59
4614,18.86
4615,19.15
4616,19.51
4617,19.91
4618,20.39
4619,20.88
4620,21.43
4621,21.97
4622,22.50
4623,22.95
4624,23.35
4625,23.67
4626,23.93
4627,24.13
4628,24.30
4629,24.45
4630,24.59
4631,24.72
4632,24.84
4633,24.91
4634,24.96
4635,24.94
4636,24.87
4637,24.76
4638,24.61
4639,24.46
4640,24.32
4641,24.20
4642,24.09
4643,23.99
4644,23.86
4645,23.72
4646,23.53
4647,23.32
4648,23.07
4649,22.80
4650,22.50
4651,22.25
4652,22.02
4653,21.82
4654,21.58
4655,21.32
4656,21.01
4657,20.70
4658,20.37
4659,20.05
4660,19.68
4661,19.31
4662,18.85
4663,18.33
4664,17.76
4665,17.21
4666,16.68
4667,16.20
4668,15.74
4669,15.35
4670,14.99
4671,14.69
4672,14.42
4673,14.18
4674,13.93
4675,13.71
4676,13.48
4677,13.28
4678,13.09
4679,12.94
4680,12.81
4681,12.74
4682,12.68
4683,12.66
4684,12.64
4685,12.66
4686,12.67
4687,12.72
4688,12.72
4689,12.68
4690,12.54
4691,12.33
4692,12.01
4693,11.61
4694,11.15
4695,10.66
4696,10.14
4697,9.65
4698,9.17
4699,8.75
4700,8.39
4701,8.12
4702,7.91
4703,7.78
4704,7.71
4705,7.69
4706,7.68
4707,7.70
4708,7.73
4709,7.80
4710,7.90
4711,8.05
4712,8.23
4713,8.44
4714,8.68
4715,8.92
4716,9.16
4717,9.34
4718,9.48
4719,9.57
4720,9.62
4721,9.65
4722,9.67
4723,9.70
4724,9.76
4725,9.84
4726,9.93
4727,10.02
4728,10.09
4729,10.13
4730,10.12
4731,10.06
4732,9.97
4733,9.85
4734,9.71
4735,9.56
4736,9.42
4737,9.27
4738,9.10
4739,8.90
4740,8.66
4741,8.42
4742,8.18
4743,7.97
4744,7.80
4745,7.69
4746,7.65
4747,7.69
4748,7.77
4749,7.87
4750,7.94
4751,7.98
4752,7.95
4753,7.85
4754,7.65
4755,7.39
4756,7.08
4757,6.75
4758,6.43
4759,6.15
4760,5.92
4761,5.76
4762,5.64
4763,5.57
4764,5.51
4765,5.46
4766,5.39
4767,5.30
4768,5.20
4769,5.09
4770,4.96
4771,4.83
4772,4.70
4773,4.58
4774,4.47
4775,4.37
4776,4.28
4777,4.20
4778,4.14
4779,4.10
4780,4.09
4781,4.10
4782,4.15
4783,4.22
4784,4.33
4785,4.45
4786,4.61
4787,4.80
4788,5.04
4789,5.33
4790,5.70
4791,6.13
4792,6.63
4793,7.14
4794,7.68
4795,8.22
4796,8.75
4797,9.17
4798,9.46
4799,9.59
4800,9.70
4801,9.81
4802,9.95
4803,10.07
4804,10.21
4805,10.35
4806,10.54
4807,10.71
4808,10.92
4809,11.12
4810,11.35
4811,11.58
4812,11.85
4813,12.14
4814,12.49
4815,12.85
4816,13.26
4817,13.69
4818,14.15
4819,14.56
4820,14.91
4821,15.18
4822,15.44
4823,15.67
4824,15.93
4825,16.16
4826,16.40
4827,16.64
4828,16.88
4829,17.10
4830,17.32
4831,17.55
4832,17.80
4833,17.97
4834,17.97
4835,17.82
4836,17.63
4837,17.49
4838,17.38
4839,17.29
4840,17.22
4841,17.18
4842,17.14
4843,17.08
4844,16.97
4845,16.82
4846,16.61
4847,16.36
4848,16.06
4849,15.75
4850,15.45
4851,15.17
4852,14.94
4853,14.77
4854,14.65
4855,14.59
4856,14.56
4857,14.56
4858,14.56
4859,14.59
4860,14.62
4861,14.67
4862,14.75
4863,14.84
4864,14.92
4865,14.94
4866,14.89
4867,14.78
4868,14.66
4869,14.56
4870,14.47
4871,14.40
4872,14.36
4873,14.34
4874,14.36
4875,14.42
4876,14.52
4877,14.65
4878,14.79
4879,14.92
4880,15.05
4881,15.16
4882,15.25
4883,15.31
4884,15.35
4885,15.37
4886,15.39
4887,15.41
4888,15.43
4889,15.47
4890,15.53
4891,15.62
4892,15.77
4893,15.92
4894,16.06
4895,16.17
4896,16.23
4897,16.23
4898,16.18
4899,16.08
4900,15.95
4901,15.79
4902,15.62
4903,15.54
4904,15.63
4905,15.91
4906,16.27
4907,16.59
4908,16.79
4909,16.91
4910,16.92
4911,16.81
4912,16.55
4913,16.18
4914,15.78
4915,15.43
4916,15.16
4917,14.97
4918,14.86
4919,14.82
4920,14.80
4921,14.80
4922,14.79
4923,14.79
4924,14.76
4925,14.69
4926,14.60
4927,14.51
4928,14.41
4929,14.32
4930,14.26
4931,14.25
4932,14.28
4933,14.36
4934,14.49
4935,14.63
4936,14.78
4937,14.91
4938,15.02
4939,15.07
4940,15.09
4941,15.07
4942,15.04
4943,15.01
4944,15.01
4945,15.03
4946,15.08
4947,15.16
4948,15.26
4949,15.39
4950,15.55
4951,15.72
4952,15.91
4953,16.11
4954,16.32
4955,16.51
4956,16.70
4957,16.84
4958,16.96
4959,17.05
4960,17.14
4961,17.21
4962,17.30
4963,17.40
4964,17.50
4965,17.61
4966,17.72
4967,17.80
4968,17.88
4969,17.93
4970,18.00
4971,18.08
4972,18.22
4973,18.40
4974,18.67
4975,18.99
4976,19.41
4977,19.88
4978,20.39
4979,20.89
4980,21.40
4981,21.86
4982,22.27
4983,22.55
4984,22.69
4985,22.68
4986,22.59
4987,22.47
4988,22.34
4989,22.20
4990,22.05
4991,21.88
4992,21.70
4993,21.50
4994,21.29
4995,21.07
4996,20.83
4997,20.62
4998,20.42
4999,20.29
5000,20.21
5001,20.22
5002,20.30
5003,20.45
5004,20.61
5005,20.77
5006,20.87
5007,20.87
5008,20.73
5009,20.50
5010,20.20
5011,19.91
5012,19.64
5013,19.42
5014,19.19
5015,18.98
5016,18.75
5017,18.54
5018,18.30
5019,18.06
5020,17.77
5021,17.50
5022,17.22
5023,16.99
5024,16.76
5025,16.57
5026,16.40
5027,16.28
5028,16.15
5029,16.03
5030,15.89
5031,15.74
5032,15.59
5033,15.45
5034,15.33
5035,15.23
5036,15.15
5037,15.08
5038,14.98
5039,14.87
5040,14.69
5041,14.48
5042,14.21
5043,13.92
5044,13.60
5045,13.29
5046,12.98
5047,12.69
5048,12.43
5049,12.22
5050,12.04
5051,11.91
5052,11.81
5053,11.75
5054,11.70
5055,11.66
5056,11.61
5057,11.54
5058,11.46
5059,11.36
5060,11.25
5061,11.16
5062,11.08
5063,11.04
5064,11.03
5065,11.03
5066,11.05
5067,11.10
5068,11.19
5069,11.32
5070,11.47
5071,11.61
5072,11.76
5073,11.87
5074,11.98
5075,12.07
5076,12.17
5077,12.27
5078,12.40
5079,12.53
5080,12.69
5081,12.83
5082,12.96
5083,13.07
5084,13.17
5085,13.26
5086,13.35
5087,13.45
5088,13.58
5089,13.72
5090,13.86
5091,13.98
5092,14.08
5093,14.14
5094,14.18
5095,14.20
5096,14.24
5097,14.31
5098,14.44
5099,14.62
5100,14.87
5101,15.17
5102,15.51
5103,15.82
5104,16.06
5105,16.19
5106,16.29
5107,16.37
5108,16.45
5109,16.49
5110,16.49
5111,16.47
5112,16.46
5113,16.43
5114,16.43
5115,16.46
5116,16.55
5117,16.66
5118,16.81
5119,16.94
5120,17.05
5121,17.14
5122,17.22
5123,17.29
5124,17.35
5125,17.40
5126,17.47
5127,17.57
5128,17.70
5129,17.85
5130,18.00
5131,18.12
5132,18.18
5133,18.16
5134,18.04
5135,17.83
5136,17.52
5137,17.16
5138,16.75
5139,16.34
5140,15.90
5141,15.46
5142,14.99
5143,14.51
5144,13.98
5145,13.44
5146,12.84
5147,12.27
5148,11.69
5149,11.15
5150,10.62
5151,10.15
5152,9.68
5153,9.28
5154,8.88
5155,8.51
5156,8.15
5157,7.86
5158,7.66
5159,7.56
5160,7.46
5161,7.37
5162,7.27
5163,7.19
5164,7.11
5165,7.03
5166,6.94
5167,6.85
5168,6.74
5169,6.61
5170,6.47
5171,6.31
5172,6.15
5173,6.00
5174,5.87
5175,5.79
5176,5.75
5177,5.73
5178,5.74
5179,5.77
5180,5.82
5181,5.89
5182,6.01
5183,6.16
5184,6.37
5185,6.60
5186,6.89
5187,7.18
5188,7.48
5189,7.72
5190,7.92
5191,8.04
5192,8.13
5193,8.19
5194,8.29
5195,8.42
5196,8.64
5197,8.90
5198,9.24
5199,9.59
5200,9.95
5201,10.26
5202,10.55
5203,10.80
5204,11.04
5205,11.26
5206,11.54
5207,11.84
5208,12.20
5209,12.56
5210,12.94
5211,13.28
5212,13.62
5213,13.90
5214,14.17
5215,14.40
5216,14.65
5217,14.91
5218,15.22
5219,15.55
5220,15.89
5221,16.19
5222,16.43
5223,16.59
5224,16.65
5225,16.57
5226,16.38
5227,16.15
5228,16.02
5229,16.00
5230,16.07
5231,16.17
5232,16.26
5233,16.33
5234,16.37
5235,16.38
5236,16.36
5237,16.32
5238,16.27
5239,16.28
5240,16.33
5241,16.40
5242,16.38
5243,16.26
5244,16.07
5245,15.88
5246,15.73
5247,15.60
5248,15.48
5249,15.39
5250,15.31
5251,15.26
5252,15.19
5253,15.13
5254,15.05
5255,14.98
5256,14.90
5257,14.85
5258,14.82
5259,14.81
5260,14.83
5261,14.88
5262,14.95
5263,15.02
5264,15.08
5265,15.11
5266,15.10
5267,15.04
5268,14.94
5269,14.81
5270,14.67
5271,14.55
5272,14.45
5273,14.40
5274,14.39
5275,14.43
5276,14.50
5277,14.58
5278,14.67
5279,14.76
5280,14.83
5281,14.90
5282,14.97
5283,15.02
5284,15.06
5285,15.08
5286,15.07
5287,15.05
5288,15.01
5289,14.96
5290,14.90
5291,14.86
5292,14.83
5293,14.83
5294,14.86
5295,14.90
5296,14.94
5297,14.98
5298,15.02
5299,15.05
5300,15.10
5301,15.16
5302,15.23
5303,15.30
5304,15.40
5305,15.49
5306,15.57
5307,15.63
5308,15.67
5309,15.70
5310,15.74
5311,15.78
5312,15.85
5313,15.94
5314,16.09
5315,16.25
5316,16.40
5317,16.43
5318,16.38
5319,16.33
5320,16.46
5321,16.78
5322,17.21
5323,17.62
5324,18.01
5325,18.36
5326,18.73
5327,19.07
5328,19.42
5329,19.78
5330,20.18
5331,20.58
5332,21.02
5333,21.44
5334,21.85
5335,22.19
5336,22.46
5337,22.64
5338,22.74
5339,22.78
5340,22.76
5341,22.71
5342,22.62
5343,22.50
5344,22.36
5345,22.20
5346,22.02
5347,21.82
5348,21.60
5349,21.36
5350,21.11
5351,20.87
5352,20.63
5353,20.42
5354,20.21
5355,20.05
5356,19.89
5357,19.77
5358,19.63
5359,19.50
5360,19.35
5361,19.20
5362,19.01
5363,18.83
5364,18.64
5365,18.48
5366,18.30
5367,18.12
5368,17.89
5369,17.63
5370,17.30
5371,16.94
5372,16.50
5373,16.06
5374,15.63
5375,15.26
5376,14.96
5377,14.75
5378,14.61
5379,14.54
5380,14.48
5381,14.43
5382,14.35
5383,14.26
5384,14.13
5385,14.00
5386,13.85
5387,13.71
5388,13.58
5389,13.46
5390,13.35
5391,13.25
5392,13.15
5393,13.07
5394,13.00
5395,12.96
5396,12.92
5397,12.89
5398,12.82
5399,12.71
5400,12.53
5401,12.29
5402,11.99
5403,11.67
5404,11.31
5405,10.97
5406,10.62
5407,10.33
5408,10.05
5409,9.78
5410,9.47
5411,9.12
5412,8.69
5413,8.24
5414,7.69
5415,7.14
5416,6.53
5417,5.96
5418,5.38
5419,4.86
5420,4.33
5421,3.84
5422,3.33
5423,2.84
5424,2.31
5425,1.77
5426,1.16
5427,0.57
5428,0.05
5429,-0.33
5430,-0.63
5431,-0.86
5432,-1.08
5433,-1.26
5434,-1.43
5435,-1.58
5436,-1.74
5437,-1.90
5438,-2.09
5439,-2.28
5440,-2.50
5441,-2.71
5442,-2.96
5443,-3.19
5444,-3.43
5445,-3.65
5446,-3.88
5447,-4.10
5448,-4.34
5449,-4.55
5450,-4.77
5451,-4.97
5452,-5.16
5453,-5.34
5454,-5.53
5455,-5.72
5456,-5.93
5457,-6.14
5458,-6.35
5459,-6.53
5460,-6.70
5461,-6.81
5462,-6.86
5463,-6.85
5464,-6.79
5465,-6.70
5466,-6.61
5467,-6.52
5468,-6.47
5469,-6.45
5470,-6.46
5471,-6.48
5472,-6.50
5473,-6.52
5474,-6.52
5475,-6.52
5476,-6.53
5477,-6.56
5478,-6.63
5479,-6.73
5480,-6.87
5481,-7.03
5482,-7.19
5483,-7.32
5484,-7.38
5485,-7.39
5486,-7.30
5487,-7.14
5488,-6.89
5489,-6.61
5490,-6.27
5491,-5.91
5492,-5.48
5493,-5.01
5494,-4.43
5495,-3.83
5496,-3.14
5497,-2.45
5498,-1.68
5499,-0.90
5500,-0.02
5501,0.86
5502,1.82
5503,2.75
5504,3.70
5505,4.57
5506,5.44
5507,6.21
5508,6.98
5509,7.64
5510,8.30
5511,8.87
5512,9.49
5513,10.10
5514,10.78
5515,11.42
5516,12.05
5517,12.53
5518,12.97
5519,13.34
5520,13.76
5521,14.21
5522,14.73
5523,15.24
5524,15.75
5525,16.18
5526,16.60
5527,16.94
5528,17.25
5529,17.50
5530,17.77
5531,18.04
5532,18.36
5533,18.70
5534,19.08
5535,19.46
5536,19.84
5537,20.17
5538,20.48
5539,20.72
5540,20.96
5541,21.14
5542,21.33
5543,21.49
5544,21.70
5545,21.91
5546,22.18
5547,22.46
5548,22.80
5549,23.17
5550,23.61
5551,24.05
5552,24.55
5553,25.03
5554,25.54
5555,26.02
5556,26.50
5557,26.93
5558,27.36
5559,27.74
5560,28.12
5561,28.45
5562,28.81
5563,29.13
5564,29.48
5565,29.84
5566,30.26
5567,30.70
5568,31.18
5569,31.64
5570,32.09
5571,32.47
5572,32.79
5573,33.00
5574,33.14
5575,33.20
5576,33.23
5577,33.25
5578,33.27
5579,33.32
5580,33.42
5581,33.54
5582,33.65
5583,33.71
5584,33.69
5585,33.62
5586,33.54
5587,33.47
5588,33.39
5589,33.29
5590,33.17
5591,33.02
5592,32.87
5593,32.74
5594,32.64
5595,32.58
5596,32.56
5597,32.57
5598,32.59
5599,32.61
5600,32.62
5601,32.61
5602,32.57
5603,32.53
5604,32.50
5605,32.48
5606,32.48
5607,32.48
5608,32.48
5609,32.48
5610,32.44
5611,32.32
5612,32.02
5613,31.60
5614,31.12
5615,30.69
5616,30.28
5617,29.87
5618,29.37
5619,28.85
5620,28.33
5621,27.87
5622,27.43
5623,27.03
5624,26.63
5625,26.28
5626,25.94
5627,25.65
5628,25.34
5629,25.04
5630,24.68
5631,24.30
5632,23.86
5633,23.40
5634,22.90
5635,22.42
5636,21.94
5637,21.53
5638,21.14
5639,20.82
5640,20.52
5641,20.28
5642,20.02
5643,19.78
5644,19.50
5645,19.24
5646,18.93
5647,18.60
5648,18.22
5649,17.87
5650,17.57
5651,17.36
5652,17.22
5653,17.11
5654,17.02
5655,16.95
5656,16.89
5657,16.85
5658,16.77
5659,16.67
5660,16.54
5661,16.40
5662,16.25
5663,16.14
5664,16.05
5665,16.01
5666,15.99
5667,15.99
5668,15.99
5669,15.96
5670,15.86
5671,15.69
5672,15.43
5673,15.10
5674,14.70
5675,14.28
5676,13.82
5677,13.40
5678,13.02
5679,12.72
5680,12.49
5681,12.36
5682,12.30
5683,12.30
5684,12.33
5685,12.36
5686,12.37
5687,12.34
5688,12.28
5689,12.20
5690,12.11
5691,12.05
5692,12.05
5693,12.11
5694,12.25
5695,12.44
5696,12.67
5697,12.91
5698,13.12
5699,13.27
5700,13.35
5701,13.35
5702,13.31
5703,13.25
5704,13.21
5705,13.21
5706,13.26
5707,13.35
5708,13.44
5709,13.52
5710,13.55
5711,13.52
5712,13.44
5713,13.32
5714,13.18
5715,13.06
5716,12.98
5717,12.95
5718,12.94
5719,12.95
5720,12.92
5721,12.85
5722,12.73
5723,12.57
5724,12.37
5725,12.18
5726,12.00
5727,11.87
5728,11.76
5729,11.69
5730,11.60
5731,11.47
5732,11.28
5733,11.07
5734,10.91
5735,10.86
5736,10.86
5737,10.90
5738,10.94
5739,10.98
5740,11.01
5741,11.04
5742,11.05
5743,11.04
5744,10.99
5745,10.92
5746,10.82
5747,10.72
5748,10.62
5749,10.52
5750,10.44
5751,10.39
5752,10.35
5753,10.33
5754,10.34
5755,10.38
5756,10.45
5757,10.54
5758,10.65
5759,10.77
5760,10.88
5761,10.98
5762,11.04
5763,11.07
5764,11.05
5765,11.00
5766,10.94
5767,10.88
5768,10.82
5769,10.77
5770,10.71
5771,10.63
5772,10.53
5773,10.40
5774,10.24
5775,10.06
5776,9.86
5777,9.68
5778,9.54
5779,9.46
5780,9.45
5781,9.50
5782,9.61
5783,9.75
5784,9.90
5785,10.03
5786,10.17
5787,10.29
5788,10.43
5789,10.60
5790,10.81
5791,11.02
5792,11.28
5793,11.56
5794,11.95
5795,12.38
5796,12.82
5797,13.21
5798,13.57
5799,13.91
5800,14.27
5801,14.61
5802,14.95
5803,15.26
5804,15.56
5805,15.83
5806,16.08
5807,16.31
5808,16.53
5809,16.71
5810,16.90
5811,17.06
5812,17.24
5813,17.41
5814,17.61
5815,17.80
5816,18.01
5817,18.21
5818,18.44
5819,18.67
5820,18.94
5821,19.20
5822,19.49
5823,19.74
5824,19.98
5825,20.15
5826,20.30
5827,20.39
5828,20.46
5829,20.51
5830,20.61
5831,20.76
5832,20.97
5833,21.23
5834,21.51
5835,21.75
5836,21.95
5837,22.08
5838,22.19
5839,22.27
5840,22.36
5841,22.43
5842,22.51
5843,22.60
5844,22.72
5845,22.85
5846,22.98
5847,23.09
5848,23.17
5849,23.21
5850,23.20
5851,23.14
5852,23.03
5853,22.88
5854,22.70
5855,22.49
5856,22.28
5857,22.07
5858,21.88
5859,21.71
5860,21.56
5861,21.44
5862,21.33
5863,21.23
5864,21.12
5865,21.01
5866,20.85
5867,20.69
5868,20.49
5869,20.29
5870,20.06
5871,19.84
5872,19.59
5873,19.35
5874,19.09
5875,18.85
5876,18.59
5877,18.34
5878,18.06
5879,17.79
5880,17.52
5881,17.29
5882,17.08
5883,16.92
5884,16.78
5885,16.69
5886,16.59
5887,16.50
5888,16.37
5889,16.23
5890,16.04
5891,15.84
5892,15.60
5893,15.37
5894,15.12
5895,14.90
5896,14.67
5897,14.46
5898,14.25
5899,14.07
5900,13.91
5901,13.80
5902,13.69
5903,13.59
5904,13.49
5905,13.39
5906,13.29
5907,13.18
5908,13.04
5909,12.93
5910,12.93
5911,13.05
5912,13.27
5913,13.51
5914,13.74
5915,13.94
5916,14.12
5917,14.27
5918,14.40
5919,14.54
5920,14.69
5921,14.85
5922,15.02
5923,15.17
5924,15.30
5925,15.37
5926,15.39
5927,15.33
5928,15.23
5929,15.11
5930,14.97
5931,14.87
5932,14.78
5933,14.72
5934,14.67
5935,14.61
5936,14.51
5937,14.35
5938,14.11
5939,13.80
5940,13.41
5941,12.97
5942,12.47
5943,11.97
5944,11.44
5945,10.95
5946,10.44
5947,9.98
5948,9.52
5949,9.12
5950,8.73
5951,8.39
5952,8.04
5953,7.74
5954,7.41
5955,7.11
5956,6.77
5957,6.45
5958,6.08
5959,5.74
5960,5.38
5961,5.06
5962,4.75
5963,4.48
5964,4.22
5965,3.99
5966,3.77
5967,3.56
5968,3.34
5969,3.15
5970,2.97
5971,2.82
5972,2.68
5973,2.56
5974,2.45
5975,2.34
5976,2.20
5977,2.04
5978,1.83
5979,1.61
5980,1.40
5981,1.21
5982,1.04
5983,0.92
5984,0.84
5985,0.80
5986,0.76
5987,0.70
5988,0.62
5989,0.49
5990,0.33
5991,0.16
5992,-0.01
5993,-0.15
5994,-0.25
5995,-0.30
5996,-0.32
5997,-0.31
5998,-0.29
5999,-0.28
6000,-0.31
6001,-0.37
6002,-0.44
6003,-0.50
6004,-0.56
6005,-0.59
6006,-0.59
6007,-0.56
6008,-0.51
6009,-0.47
6010,-0.44
6011,-0.42
6012,-0.43
6013,-0.47
6014,-0.54
6015,-0.63
6016,-0.74
6017,-0.84
6018,-0.97
6019,-1.12
6020,-1.29
6021,-1.48
6022,-1.71
6023,-1.93
6024,-2.16
6025,-2.36
6026,-2.55
6027,-2.72
6028,-2.88
6029,-3.04
6030,-3.20
6031,-3.36
6032,-3.50
6033,-3.61
6034,-3.67
6035,-3.69
6036,-3.64
6037,-3.54
6038,-3.37
6039,-3.17
6040,-2.91
6041,-2.63
6042,-2.31
6043,-1.98
6044,-1.60
6045,-1.19
6046,-0.72
6047,-0.25
6048,0.26
6049,0.74
6050,1.21
6051,1.61
6052,1.95
6053,2.18
6054,2.34
6055,2.40
6056,2.42
6057,2.38
6058,2.35
6059,2.34
6060,2.38
6061,2.44
6062,2.56
6063,2.69
6064,2.84
6065,2.98
6066,3.13
6067,3.27
6068,3.44
6069,3.63
6070,3.87
6071,4.14
6072,4.46
6073,4.79
6074,5.15
6075,5.48
6076,5.83
6077,6.15
6078,6.51
6079,6.85
6080,7.24
6081,7.63
6082,8.06
6083,8.47
6084,8.91
6085,9.32
6086,9.75
6087,10.17
6088,10.62
6089,11.05
6090,11.51
6091,11.98
6092,12.54
6093,13.13
6094,13.75
6095,14.30
6096,14.83
6097,15.30
6098,15.76
6099,16.17
6100,16.58
6101,16.96
6102,17.33
6103,17.65
6104,17.93
6105,18.14
6106,18.32
6107,18.42
6108,18.49
6109,18.51
6110,18.55
6111,18.61
6112,18.71
6113,18.83
6114,18.99
6115,19.16
6116,19.35
6117,19.51
6118,19.63
6119,19.71
6120,19.75
6121,19.77
6122,19.76
6123,19.71
6124,19.64
6125,19.53
6126,19.40
6127,19.25
6128,19.07
6129,18.89
6130,18.72
6131,18.59
6132,18.50
6133,18.45
6134,18.46
6135,18.49
6136,18.55
6137,18.62
6138,18.72
6139,18.83
6140,18.99
6141,19.18
6142,19.46
6143,19.81
6144,20.25
6145,20.76
6146,21.34
6147,21.92
6148,22.50
6149,23.01
6150,23.49
6151,23.88
6152,24.25
6153,24.55
6154,24.85
6155,25.13
6156,25.42
6157,25.71
6158,26.02
6159,26.30
6160,26.58
6161,26.82
6162,27.03
6163,27.20
6164,27.36
6165,27.50
6166,27.62
6167,27.72
6168,27.79
6169,27.84
6170,27.87
6171,27.90
6172,27.93
6173,27.96
6174,28.01
6175,28.06
6176,28.09
6177,28.08
6178,27.98
6179,27.80
6180,27.50
6181,27.13
6182,26.69
6183,26.25
6184,25.82
6185,25.49
6186,25.21
6187,25.02
6188,24.84
6189,24.69
6190,24.46
6191,24.16
6192,23.71
6193,23.19
6194,22.55
6195,21.90
6196,21.21
6197,20.57
6198,19.94
6199,19.37
6200,18.80
6201,18.27
6202,17.72
6203,17.20
6204,16.66
6205,16.18
6206,15.73
6207,15.37
6208,15.04
6209,14.79
6210,14.57
6211,14.39
6212,14.21
6213,14.05
6214,13.87
6215,13.71
6216,13.56
6217,13.46
6218,13.37
6219,13.31
6220,13.23
6221,13.16
6222,13.07
6223,12.96
6224,12.82
6225,12.67
6226,12.50
6227,12.33
6228,12.17
6229,12.02
6230,11.90
6231,11.81
6232,11.73
6233,11.68
6234,11.65
6235,11.65
6236,11.68
6237,11.72
6238,11.78
6239,11.83
6240,11.87
6241,11.90
6242,11.90
6243,11.89
6244,11.87
6245,11.86
6246,11.88
6247,11.95
6248,12.08
6249,12.27
6250,12.52
6251,12.79
6252,13.08
6253,13.35
6254,13.60
6255,13.81
6256,14.00
6257,14.16
6258,14.32
6259,14.47
6260,14.66
6261,14.86
6262,15.10
6263,15.36
6264,15.62
6265,15.80
6266,15.90
6267,15.96
6268,16.08
6269,16.26
6270,16.46
6271,16.62
6272,16.75
6273,16.86
6274,16.96
6275,17.06
6276,17.12
6277,17.17
6278,17.18
6279,17.14
6280,17.05
6281,16.90
6282,16.68
6283,16.41
6284,16.11
6285,15.79
6286,15.47
6287,15.19
6288,14.97
6289,14.83
6290,14.76
6291,14.76
6292,14.82
6293,14.94
6294,15.09
6295,15.27
6296,15.47
6297,15.69
6298,15.92
6299,16.17
6300,16.42
6301,16.66
6302,16.89
6303,17.09
6304,17.28
6305,17.42
6306,17.49
6307,17.45
6308,17.33
6309,17.14
6310,16.92
6311,16.69
6312,16.49
6313,16.33
6314,16.24
6315,16.22
6316,16.31
6317,16.49
6318,16.75
6319,17.07
6320,17.43
6321,17.82
6322,18.25
6323,18.67
6324,19.12
6325,19.55
6326,19.99
6327,20.38
6328,20.74
6329,21.01
6330,21.23
6331,21.36
6332,21.44
6333,21.48
6334,21.53
6335,21.58
6336,21.67
6337,21.77
6338,21.90
6339,22.03
6340,22.17
6341,22.30
6342,22.42
6343,22.52
6344,22.64
6345,22.78
6346,22.90
6347,23.00
6348,23.03
6349,22.99
6350,22.82
6351,22.55
6352,22.15
6353,21.69
6354,21.17
6355,20.65
6356,20.12
6357,19.64
6358,19.17
6359,18.75
6360,18.31
6361,17.86
6362,17.31
6363,16.74
6364,16.15
6365,15.63
6366,15.11
6367,14.63
6368,14.12
6369,13.66
6370,13.20
6371,12.80
6372,12.37
6373,11.98
6374,11.55
6375,11.15
6376,10.70
6377,10.28
6378,9.83
6379,9.42
6380,9.00
6381,8.63
6382,8.26
6383,7.92
6384,7.59
6385,7.29
6386,6.99
6387,6.71
6388,6.43
6389,6.16
6390,5.91
6391,5.68
6392,5.49
6393,5.37
6394,5.32
6395,5.34
6396,5.45
6397,5.63
6398,5.87
6399,6.14
6400,6.44
6401,6.73
6402,7.03
6403,7.33
6404,7.65
6405,7.97
6406,8.30
6407,8.60
6408,8.93
6409,9.22
6410,9.53
6411,9.81
6412,10.13
6413,10.46
6414,10.89
6415,11.36
6416,11.93
6417,12.51
6418,13.14
6419,13.74
6420,14.32
6421,14.80
6422,15.25
6423,15.63
6424,16.02
6425,16.40
6426,16.87
6427,17.36
6428,17.94
6429,18.52
6430,19.13
6431,19.70
6432,20.24
6433,20.69
6434,21.08
6435,21.38
6436,21.67
6437,21.91
6438,22.12
6439,22.26
6440,22.36
6441,22.44
6442,22.53
6443,22.63
6444,22.74
6445,22.84
6446,22.92
6447,22.97
6448,22.99
6449,22.98
6450,22.92
6451,22.84
6452,22.74
6453,22.65
6454,22.55
6455,22.46
6456,22.34
6457,22.19
6458,21.97
6459,21.68
6460,21.31
6461,20.92
6462,20.47
6463,20.04
6464,19.62
6465,19.26
6466,18.91
6467,18.63
6468,18.33
6469,18.04
6470,17.65
6471,17.22
6472,16.71
6473,16.24
6474,15.78
6475,15.39
6476,14.95
6477,14.51
6478,14.01
6479,13.55
6480,13.07
6481,12.64
6482,12.21
6483,11.83
6484,11.45
6485,11.12
6486,10.78
6487,10.46
6488,10.13
6489,9.81
6490,9.46
6491,9.16
6492,8.86
6493,8.62
6494,8.41
6495,8.24
6496,8.08
6497,7.94
6498,7.77
6499,7.59
6500,7.36
6501,7.13
6502,6.89
6503,6.67
6504,6.48
6505,6.37
6506,6.30
6507,6.31
6508,6.35
6509,6.43
6510,6.51
6511,6.58
6512,6.61
6513,6.61
6514,6.57
6515,6.51
6516,6.44
6517,6.36
6518,6.30
6519,6.25
6520,6.20
6521,6.14
6522,6.08
6523,6.00
6524,5.94
6525,5.90
6526,5.89
6527,5.91
6528,5.97
6529,6.07
6530,6.20
6531,6.32
6532,6.43
6533,6.55
6534,6.71
6535,6.84
6536,6.85
6537,6.76
6538,6.64
6539,6.59
6540,6.63
6541,6.69
6542,6.74
6543,6.77
6544,6.77
6545,6.75
6546,6.70
6547,6.65
6548,6.61
6549,6.60
6550,6.62
6551,6.64
6552,6.67
6553,6.69
6554,6.69
6555,6.66
6556,6.62
6557,6.58
6558,6.55
6559,6.55
6560,6.59
6561,6.66
6562,6.78
6563,6.93
6564,7.12
6565,7.31
6566,7.54
6567,7.79
6568,8.08
6569,8.38
6570,8.71
6571,9.03
6572,9.36
6573,9.66
6574,9.94
6575,10.17
6576,10.38
6577,10.56
6578,10.74
6579,10.91
6580,11.10
6581,11.26
6582,11.45
6583,11.63
6584,11.81
6585,11.92
6586,12.02
6587,12.14
6588,12.41
6589,12.77
6590,13.21
6591,13.61
6592,14.02
6593,14.41
6594,14.82
6595,15.19
6596,15.54
6597,15.86
6598,16.20
6599,16.52
6600,16.85
6601,17.18
6602,17.54
6603,17.88
6604,18.21
6605,18.48
6606,18.69
6607,18.83
6608,18.92
6609,18.94
6610,18.92
6611,18.88
6612,18.85
6613,18.85
6614,18.90
6615,18.98
6616,19.10
6617,19.25
6618,19.44
6619,19.63
6620,19.82
6621,20.01
6622,20.20
6623,20.40
6624,20.60
6625,20.79
6626,20.94
6627,21.05
6628,21.07
6629,21.01
6630,20.85
6631,20.63
6632,20.33
6633,20.00
6634,19.63
6635,19.27
6636,18.88
6637,18.51
6638,18.11
6639,17.72
6640,17.26
6641,16.78
6642,16.19
6643,15.56
6644,14.79
6645,13.96
6646,12.98
6647,11.96
6648,10.86
6649,9.81
6650,8.72
6651,7.72
6652,6.74
6653,5.86
6654,4.97
6655,4.11
6656,3.18
6657,2.27
6658,1.31
6659,0.40
6660,-0.49
6661,-1.25
6662,-1.90
6663,-2.35
6664,-2.66
6665,-2.80
6666,-2.85
6667,-2.81
6668,-2.76
6669,-2.72
6670,-2.73
6671,-2.79
6672,-2.89
6673,-3.01
6674,-3.14
6675,-3.26
6676,-3.36
6677,-3.40
6678,-3.37
6679,-3.30
6680,-3.19
6681,-3.10
6682,-3.04
6683,-3.03
6684,-3.04
6685,-3.05
6686,-3.01
6687,-2.88
6688,-2.63
6689,-2.27
6690,-1.82
6691,-1.35
6692,-0.89
6693,-0.52
6694,-0.26
6695,-0.12
6696,-0.04
6697,-0.01
6698,0.06
6699,0.16
6700,0.37
6701,0.64
6702,0.99
6703,1.33
6704,1.68
6705,1.98
6706,2.24
6707,2.45
6708,2.65
6709,2.84
6710,3.08
6711,3.33
6712,3.63
6713,3.93
6714,4.27
6715,4.58
6716,4.91
6717,5.22
6718,5.56
6719,5.90
6720,6.27
6721,6.62
6722,6.99
6723,7.30
6724,7.60
6725,7.83
6726,8.08
6727,8.29
6728,8.56
6729,8.85
6730,9.23
6731,9.66
6732,10.20
6733,10.78
6734,11.41
6735,12.02
6736,12.63
6737,13.17
6738,13.71
6739,14.17
6740,14.62
6741,15.00
6742,15.35
6743,15.65
6744,15.95
6745,16.19
6746,16.43
6747,16.61
6748,16.78
6749,16.91
6750,17.04
6751,17.18
6752,17.34
6753,17.54
6754,17.78
6755,18.04
6756,18.32
6757,18.58
6758,18.83
6759,19.04
6760,19.22
6761,19.36
6762,19.49
6763,19.60
6764,19.73
6765,19.85
6766,19.94
6767,19.97
6768,19.91
6769,19.80
6770,19.65
6771,19.49
6772,19.30
6773,19.07
6774,18.81
6775,18.57
6776,18.31
6777,18.06
6778,17.76
6779,17.45
6780,17.07
6781,16.66
6782,16.18
6783,15.70
6784,15.21
6785,14.75
6786,14.29
6787,13.88
6788,13.48
6789,13.14
6790,12.80
6791,12.49
6792,12.17
6793,11.90
6794,11.65
6795,11.46
6796,11.28
6797,11.12
6798,10.92
6799,10.71
6800,10.41
6801,10.08
6802,9.68
6803,9.28
6804,8.85
6805,8.46
6806,8.09
6807,7.78
6808,7.50
6809,7.27
6810,7.08
6811,6.92
6812,6.79
6813,6.72
6814,6.70
6815,6.73
6816,6.81
6817,6.95
6818,7.19
6819,7.50
6820,7.88
6821,8.26
6822,8.64
6823,8.99
6824,9.34
6825,9.63
6826,9.89
6827,10.10
6828,10.30
6829,10.48
6830,10.73
6831,11.02
6832,11.38
6833,11.80
6834,12.29
6835,12.79
6836,13.27
6837,13.67
6838,14.02
6839,14.32
6840,14.61
6841,14.88
6842,15.16
6843,15.42
6844,15.71
6845,15.95
6846,16.18
6847,16.35
6848,16.52
6849,16.67
6850,16.82
6851,16.94
6852,17.07
6853,17.18
6854,17.31
6855,17.45
6856,17.65
6857,17.88
6858,18.18
6859,18.52
6860,18.92
6861,19.32
6862,19.75
6863,20.13
6864,20.49
6865,20.78
6866,21.08
6867,21.35
6868,21.66
6869,21.96
6870,22.31
6871,22.67
6872,23.08
6873,23.48
6874,23.91
6875,24.34
6876,24.80
6877,25.22
6878,25.63
6879,26.00
6880,26.33
6881,26.59
6882,26.79
6883,26.88
6884,26.89
6885,26.83
6886,26.71
6887,26.54
6888,26.34
6889,26.13
6890,25.92
6891,25.73
6892,25.52
6893,25.32
6894,25.07
6895,24.80
6896,24.48
6897,24.15
6898,23.78
6899,23.41
6900,23.01
6901,22.61
6902,22.19
6903,21.81
6904,21.49
6905,21.25
6906,21.05
6907,20.87
6908,20.72
6909,20.64
6910,20.63
6911,20.70
6912,20.87
6913,21.12
6914,21.43
6915,21.77
6916,22.11
6917,22.42
6918,22.67
6919,22.84
6920,22.95
6921,23.01
6922,23.06
6923,23.10
6924,23.19
6925,23.32
6926,23.49
6927,23.66
6928,23.82
6929,23.93
6930,23.94
6931,23.86
6932,23.66
6933,23.42
6934,23.15
6935,22.89
6936,22.65
6937,22.47
6938,22.32
6939,22.19
6940,21.98
6941,21.69
6942,21.31
6943,20.90
6944,20.41
6945,19.90
6946,19.35
6947,18.81
6948,18.26
6949,17.73
6950,17.19
6951,16.70
6952,16.20
6953,15.77
6954,15.33
6955,14.95
6956,14.58
6957,14.25
6958,13.92
6959,13.60
6960,13.23
6961,12.83
6962,12.34
6963,11.81
6964,11.22
6965,10.64
6966,10.04
6967,9.51
6968,9.00
6969,8.58
6970,8.18
6971,7.82
6972,7.44
6973,7.09
6974,6.70
6975,6.30
6976,5.84
6977,5.40
6978,4.95
6979,4.54
6980,4.15
6981,3.83
6982,3.57
6983,3.39
6984,3.24
6985,3.10
6986,2.97
6987,2.86
6988,2.76
6989,2.70
6990,2.69
6991,2.74
6992,2.87
6993,3.08
6994,3.36
6995,3.69
6996,4.04
6997,4.39
6998,4.71
6999,4.99
7000,5.25
7001,5.47
7002,5.70
7003,5.93
7004,6.20
7005,6.48
7006,6.77
7007,7.05
7008,7.30
7009,7.51
7010,7.69
7011,7.84
7012,7.97
7013,8.08
7014,8.20
7015,8.30
7016,8.40
7017,8.49
7018,8.59
7019,8.68
7020,8.81
7021,8.97
7022,9.22
7023,9.53
7024,9.91
7025,10.31
7026,10.71
7027,11.07
7028,11.40
7029,11.67
7030,11.90
7031,12.08
7032,12.27
7033,12.45
7034,12.66
7035,12.88
7036,13.13
7037,13.39
7038,13.70
7039,14.04
7040,14.45
7041,14.89
7042,15.38
7043,15.88
7044,16.41
7045,16.90
7046,17.38
7047,17.78
7048,18.15
7049,18.46
7050,18.77
7051,19.06
7052,19.37
7053,19.68
7054,20.06
7055,20.46
7056,20.90
7057,21.31
7058,21.69
7059,21.99
7060,22.24
7061,22.40
7062,22.49
7063,22.48
7064,22.44
7065,22.37
7066,22.34
7067,22.33
7068,22.37
7069,22.44
7070,22.53
7071,22.59
7072,22.62
7073,22.60
7074,22.60
7075,22.62
7076,22.71
7077,22.83
7078,22.99
7079,23.14
7080,23.32
7081,23.49
7082,23.67
7083,23.83
7084,23.98
7085,24.13
7086,24.31
7087,24.51
7088,24.73
7089,24.96
7090,25.21
7091,25.44
7092,25.63
7093,25.75
7094,25.81
7095,25.82
7096,25.85
7097,25.93
7098,26.09
7099,26.30
7100,26.55
7101,26.79
7102,27.03
7103,27.22
7104,27.37
7105,27.48
7106,27.55
7107,27.59
7108,27.62
7109,27.63
7110,27.63
7111,27.60
7112,27.53
7113,27.42
7114,27.29
7115,27.18
7116,27.06
7117,26.92
7118,26.76
7119,26.58
7120,26.37
7121,26.14
7122,25.88
7123,25.62
7124,25.39
7125,25.22
7126,25.10
7127,25.05
7128,25.06
7129,25.13
7130,25.22
7131,25.31
7132,25.38
7133,25.42
7134,25.42
7135,25.39
7136,25.33
7137,25.25
7138,25.16
7139,25.07
7140,25.00
7141,24.94
7142,24.88
7143,24.82
7144,24.75
7145,24.71
7146,24.65
7147,24.59
7148,24.45
7149,24.25
7150,23.96
7151,23.62
7152,23.24
7153,22.84
7154,22.40
7155,21.97
7156,21.54
7157,21.16
7158,20.81
7159,20.53
7160,20.28
7161,20.10
7162,19.95
7163,19.84
7164,19.74
7165,19.68
7166,19.61
7167,19.55
7168,19.48
7169,19.42
7170,19.35
7171,19.27
7172,19.20
7173,19.13
7174,19.09
7175,19.08
7176,19.08
7177,19.09
7178,19.11
7179,19.12
7180,19.10
7181,19.05
7182,18.97
7183,18.88
7184,18.78
7185,18.68
7186,18.59
7187,18.52
7188,18.48
7189,18.51
7190,18.46
7191,18.34
7192,18.21
7193,18.12
7194,18.46
7195,18.67
7196,18.30
7197,17.46
7198,17.67
7199,19.99
7200,18.80
