1,74.81
2,100.00
3,100.00
4,99.11
5,95.36
6,99.55
7,100.00
8,100.00
9,100.00
10,98.61
11,86.16
12,66.20
13,53.56
14,61.10
15,82.51
16,99.91
17,100.00
18,99.95
19,98.17
20,99.44
21,100.00
22,100.00
23,100.00
24,98.68
25,99.46
26,100.00
27,100.00
28,92.04
29,63.69
30,22.38
31,-19.20
32,-50.57
33,-66.36
34,-68.71
35,-61.36
36,-49.60
37,-37.06
38,-27.83
39,-23.25
40,-23.70
41,-26.53
42,-30.01
43,-31.86
44,-31.65
45,-29.49
46,-26.21
47,-23.11
48,-20.72
49,-19.59
50,-19.24
51,-19.38
52,-19.38
53,-19.01
54,-18.14
55,-16.96
56,-15.58
57,-14.30
58,-13.10
59,-12.14
60,-11.27
61,-10.55
62,-9.87
63,-9.30
64,-8.73
65,-8.25
66,-7.75
67,-7.31
68,-6.84
69,-6.43
70,-6.02
71,-5.67
72,-5.34
73,-5.10
74,-4.92
75,-4.83
76,-4.81
77,-4.85
78,-4.91
79,-4.98
80,-5.00
81,-4.98
82,-4.89
83,-4.75
84,-4.59
85,-4.45
86,-4.38
87,-4.37
88,-4.45
89,-4.60
90,-4.82
91,-5.09
92,-5.37
93,-5.62
94,-5.80
95,-5.92
96,-5.97
97,-5.95
98,-5.90
99,-5.85
100,-5.82
101,-5.83
102,-5.91
103,-6.03
104,-6.17
105,-6.33
106,-6.48
107,-6.60
108,-6.66
109,-6.64
110,-6.56
111,-6.44
112,-6.29
113,-6.12
114,-5.97
115,-5.85
116,-5.77
117,-5.71
118,-5.66
119,-5.60
120,-5.52
121,-5.41
122,-5.22
123,-4.99
124,-4.71
125,-4.46
126,-4.24
127,-4.08
128,-3.97
129,-3.93
130,-3.93
131,-3.97
132,-4.00
133,-4.04
134,-4.06
135,-4.06
136,-4.03
137,-3.97
138,-3.88
139,-3.77
140,-3.67
141,-3.58
142,-3.51
143,-3.46
144,-3.45
145,-3.47
146,-3.56
147,-3.69
148,-3.88
149,-4.12
150,-4.40
151,-4.68
152,-4.96
153,-5.19
154,-5.40
155,-5.56
156,-5.69
157,-5.77
158,-5.84
159,-5.91
160,-6.01
161,-6.11
162,-6.21
163,-6.27
164,-6.29
165,-6.28
166,-6.22
167,-6.13
168,-6.02
169,-5.90
170,-5.76
171,-5.62
172,-5.47
173,-5.30
174,-5.10
175,-4.87
176,-4.67
177,-4.53
178,-4.46
179,-4.45
180,-4.49
181,-4.57
182,-4.65
183,-4.74
184,-4.78
185,-4.75
186,-4.63
187,-4.49
188,-4.34
189,-4.22
190,-4.11
191,-3.98
192,-3.83
193,-3.70
194,-3.57
195,-3.45
196,-3.34
197,-3.25
198,-3.19
199,-3.16
200,-3.15
201,-3.16
202,-3.22
203,-3.30
204,-3.41
205,-3.56
206,-3.78
207,-4.08
208,-4.43
209,-4.79
210,-5.15
211,-5.47
212,-5.77
213,-6.03
214,-6.29
215,-6.55
216,-6.86
217,-7.18
218,-7.52
219,-7.82
220,-8.06
221,-8.20
222,-8.27
223,-8.25
224,-8.18
225,-8.12
226,-8.10
227,-8.15
228,-8.29
229,-8.48
230,-8.66
231,-8.78
232,-8.82
233,-8.78
234,-8.65
235,-8.45
236,-8.21
237,-7.96
238,-7.71
239,-7.50
240,-7.33
241,-7.21
242,-7.09
243,-6.99
244,-6.87
245,-6.73
246,-6.53
247,-6.28
248,-5.97
249,-5.63
250,-5.27
251,-4.93
252,-4.60
253,-4.30
254,-4.03
255,-3.84
256,-3.67
257,-3.53
258,-3.36
259,-3.17
260,-2.96
261,-2.74
262,-2.49
263,-2.26
264,-2.06
265,-1.94
266,-1.87
267,-1.84
268,-1.79
269,-1.72
270,-1.60
271,-1.43
272,-1.17
273,-0.88
274,-0.56
275,-0.27
276,0.02
277,0.26
278,0.50
279,0.72
280,0.94
281,1.16
282,1.40
283,1.65
284,1.92
285,2.17
286,2.40
287,2.57
288,2.71
289,2.81
290,2.89
291,2.93
292,2.95
293,2.95
294,2.94
295,2.89
296,2.80
297,2.65
298,2.47
299,2.29
300,2.11
301,1.96
302,1.79
303,1.59
304,1.37
305,1.13
306,0.89
307,0.64
308,0.42
309,0.23
310,0.13
311,0.15
312,0.27
313,0.47
314,0.70
315,0.95
316,1.18
317,1.37
318,1.53
319,1.65
320,1.80
321,1.97
322,2.20
323,2.45
324,2.72
325,2.94
326,3.12
327,3.24
328,3.36
329,3.47
330,3.61
331,3.79
332,4.01
333,4.26
334,4.54
335,4.80
336,5.07
337,5.31
338,5.51
339,5.67
340,5.81
341,5.95
342,6.07
343,6.16
344,6.21
345,6.21
346,6.17
347,6.08
348,5.92
349,5.69
350,5.44
351,5.20
352,4.97
353,4.75
354,4.53
355,4.29
356,4.02
357,3.73
358,3.41
359,3.12
360,2.83
361,2.58
362,2.37
363,2.22
364,2.12
365,2.07
366,2.03
367,2.00
368,1.90
369,1.73
370,1.45
371,1.11
372,0.73
373,0.37
374,0.06
375,-0.13
376,-0.20
377,-0.13
378,0.02
379,0.22
380,0.42
381,0.56
382,0.60
383,0.54
384,0.39
385,0.22
386,0.09
387,0.05
388,0.09
389,0.20
390,0.34
391,0.50
392,0.61
393,0.64
394,0.57
395,0.40
396,0.19
397,0.02
398,-0.06
399,-0.03
400,0.10
401,0.30
402,0.53
403,0.75
404,0.89
405,0.90
406,0.79
407,0.58
408,0.31
409,0.05
410,-0.16
411,-0.30
412,-0.34
413,-0.31
414,-0.23
415,-0.15
416,-0.11
417,-0.14
418,-0.23
419,-0.35
420,-0.48
421,-0.58
422,-0.67
423,-0.73
424,-0.75
425,-0.74
426,-0.69
427,-0.64
428,-0.62
429,-0.63
430,-0.70
431,-0.80
432,-0.94
433,-1.11
434,-1.28
435,-1.43
436,-1.54
437,-1.57
438,-1.52
439,-1.38
440,-1.17
441,-0.95
442,-0.75
443,-0.62
444,-0.54
445,-0.49
446,-0.47
447,-0.47
448,-0.50
449,-0.53
450,-0.53
451,-0.49
452,-0.41
453,-0.31
454,-0.16
455,0.05
456,0.31
457,0.56
458,0.79
459,0.95
460,1.05
461,1.06
462,1.00
463,0.89
464,0.78
465,0.72
466,0.73
467,0.84
468,1.03
469,1.27
470,1.53
471,1.75
472,1.92
473,2.00
474,1.96
475,1.80
476,1.52
477,1.18
478,0.78
479,0.38
480,-0.01
481,-0.33
482,-0.60
483,-0.79
484,-1.01
485,-1.25
486,-1.56
487,-1.93
488,-2.38
489,-2.87
490,-3.38
491,-3.85
492,-4.30
493,-4.66
494,-4.97
495,-5.19
496,-5.41
497,-5.63
498,-5.87
499,-6.10
500,-6.36
501,-6.62
502,-6.90
503,-7.15
504,-7.38
505,-7.57
506,-7.74
507,-7.87
508,-7.95
509,-7.95
510,-7.89
511,-7.77
512,-7.64
513,-7.50
514,-7.39
515,-7.36
516,-7.43
517,-7.58
518,-7.79
519,-8.02
520,-8.23
521,-8.40
522,-8.47
523,-8.45
524,-8.33
525,-8.20
526,-8.07
527,-7.99
528,-7.92
529,-7.89
530,-7.84
531,-7.73
532,-7.48
533,-7.08
534,-6.54
535,-5.94
536,-5.32
537,-4.75
538,-4.27
539,-3.92
540,-3.67
541,-3.49
542,-3.30
543,-3.09
544,-2.80
545,-2.48
546,-2.10
547,-1.73
548,-1.38
549,-1.09
550,-0.83
551,-0.61
552,-0.39
553,-0.18
554,0.06
555,0.28
556,0.49
557,0.64
558,0.71
559,0.69
560,0.62
561,0.53
562,0.43
563,0.36
564,0.31
565,0.29
566,0.23
567,0.11
568,-0.12
569,-0.45
570,-0.89
571,-1.37
572,-1.90
573,-2.39
574,-2.84
575,-3.22
576,-3.55
577,-3.80
578,-4.00
579,-4.17
580,-4.37
581,-4.58
582,-4.83
583,-5.10
584,-5.41
585,-5.70
586,-5.95
587,-6.11
588,-6.22
589,-6.25
590,-6.23
591,-6.14
592,-6.02
593,-5.89
594,-5.79
595,-5.73
596,-5.73
597,-5.76
598,-5.79
599,-5.81
600,-5.80
601,-5.76
602,-5.65
603,-5.51
604,-5.34
605,-5.18
606,-5.01
607,-4.87
608,-4.72
609,-4.57
610,-4.36
611,-4.10
612,-3.75
613,-3.33
614,-2.85
615,-2.40
616,-1.98
617,-1.68
618,-1.45
619,-1.33
620,-1.26
621,-1.21
622,-1.08
623,-0.84
624,-0.46
625,0.00
626,0.55
627,1.11
628,1.68
629,2.15
630,2.52
631,2.76
632,2.94
633,3.06
634,3.20
635,3.37
636,3.61
637,3.90
638,4.25
639,4.57
640,4.87
641,5.10
642,5.29
643,5.43
644,5.56
645,5.69
646,5.86
647,6.08
648,6.36
649,6.64
650,6.92
651,7.17
652,7.40
653,7.59
654,7.74
655,7.82
656,7.87
657,7.88
658,7.87
659,7.84
660,7.81
661,7.79
662,7.80
663,7.86
664,7.97
665,8.12
666,8.29
667,8.45
668,8.56
669,8.60
670,8.57
671,8.48
672,8.35
673,8.22
674,8.09
675,7.99
676,7.90
677,7.82
678,7.71
679,7.56
680,7.36
681,7.13
682,6.85
683,6.58
684,6.27
685,5.96
686,5.65
687,5.37
688,5.10
689,4.84
690,4.55
691,4.26
692,3.94
693,3.65
694,3.37
695,3.14
696,2.93
697,2.80
698,2.74
699,2.76
700,2.76
701,2.73
702,2.60
703,2.40
704,2.10
705,1.74
706,1.34
707,0.96
708,0.66
709,0.46
710,0.37
711,0.40
712,0.52
713,0.70
714,0.88
715,1.03
716,1.16
717,1.26
718,1.34
719,1.42
720,1.51
721,1.62
722,1.76
723,1.90
724,2.02
725,2.09
726,2.12
727,2.11
728,2.10
729,2.10
730,2.14
731,2.25
732,2.47
733,2.78
734,3.17
735,3.55
736,3.85
737,4.02
738,4.11
739,4.11
740,4.07
741,4.02
742,4.03
743,4.17
744,4.43
745,4.76
746,5.11
747,5.39
748,5.58
749,5.64
750,5.56
751,5.37
752,5.15
753,4.97
754,4.87
755,4.86
756,4.91
757,5.00
758,5.10
759,5.18
760,5.21
761,5.20
762,5.15
763,5.07
764,4.98
765,4.88
766,4.75
767,4.59
768,4.39
769,4.14
770,3.82
771,3.48
772,3.13
773,2.80
774,2.48
775,2.20
776,1.90
777,1.61
778,1.28
779,0.95
780,0.59
781,0.23
782,-0.13
783,-0.45
784,-0.74
785,-0.97
786,-1.18
787,-1.35
788,-1.50
789,-1.62
790,-1.73
791,-1.81
792,-1.88
793,-1.92
794,-1.96
795,-1.98
796,-2.01
797,-2.01
798,-1.97
799,-1.90
800,-1.79
801,-1.64
802,-1.46
803,-1.26
804,-1.08
805,-0.98
806,-0.96
807,-1.02
808,-1.14
809,-1.29
810,-1.39
811,-1.41
812,-1.30
813,-1.08
814,-0.76
815,-0.40
816,-0.01
817,0.36
818,0.69
819,0.95
820,1.18
821,1.38
822,1.59
823,1.80
824,2.00
825,2.16
826,2.29
827,2.37
828,2.44
829,2.48
830,2.51
831,2.54
832,2.59
833,2.67
834,2.73
835,2.75
836,2.71
837,2.62
838,2.48
839,2.30
840,2.09
841,1.88
842,1.69
843,1.55
844,1.43
845,1.33
846,1.23
847,1.15
848,1.04
849,0.91
850,0.75
851,0.59
852,0.42
853,0.24
854,0.04
855,-0.16
856,-0.37
857,-0.55
858,-0.70
859,-0.85
860,-1.01
861,-1.16
862,-1.28
863,-1.37
864,-1.43
865,-1.44
866,-1.42
867,-1.36
868,-1.26
869,-1.14
870,-1.02
871,-0.93
872,-0.86
873,-0.80
874,-0.76
875,-0.74
876,-0.75
877,-0.77
878,-0.77
879,-0.76
880,-0.73
881,-0.70
882,-0.67
883,-0.63
884,-0.63
885,-0.64
886,-0.67
887,-0.72
888,-0.78
889,-0.87
890,-0.98
891,-1.10
892,-1.22
893,-1.32
894,-1.42
895,-1.49
896,-1.54
897,-1.55
898,-1.54
899,-1.53
900,-1.52
901,-1.54
902,-1.57
903,-1.60
904,-1.61
905,-1.58
906,-1.52
907,-1.44
908,-1.36
909,-1.28
910,-1.23
911,-1.22
912,-1.23
913,-1.27
914,-1.29
915,-1.30
916,-1.26
917,-1.15
918,-0.98
919,-0.77
920,-0.55
921,-0.36
922,-0.20
923,-0.09
924,-0.05
925,-0.08
926,-0.11
927,-0.14
928,-0.09
929,0.02
930,0.23
931,0.51
932,0.86
933,1.23
934,1.61
935,1.97
936,2.30
937,2.57
938,2.75
939,2.83
940,2.87
941,2.88
942,2.87
943,2.86
944,2.87
945,2.92
946,3.03
947,3.16
948,3.26
949,3.32
950,3.31
951,3.23
952,3.05
953,2.81
954,2.54
955,2.29
956,2.12
957,2.04
958,2.02
959,2.06
960,2.11
961,2.16
962,2.15
963,2.09
964,1.94
965,1.74
966,1.47
967,1.17
968,0.84
969,0.50
970,0.16
971,-0.18
972,-0.56
973,-0.94
974,-1.32
975,-1.65
976,-1.93
977,-2.12
978,-2.27
979,-2.37
980,-2.47
981,-2.57
982,-2.68
983,-2.80
984,-2.94
985,-3.07
986,-3.18
987,-3.23
988,-3.25
989,-3.21
990,-3.14
991,-3.04
992,-2.92
993,-2.83
994,-2.77
995,-2.78
996,-2.84
997,-2.93
998,-3.02
999,-3.12
1000,-3.20
1001,-3.28
1002,-3.33
1003,-3.33
1004,-3.27
1005,-3.16
1006,-2.98
1007,-2.76
1008,-2.47
1009,-2.15
1010,-1.79
1011,-1.42
1012,-1.03
1013,-0.67
1014,-0.31
1015,0.01
1016,0.34
1017,0.64
1018,0.95
1019,1.22
1020,1.51
1021,1.77
1022,2.03
1023,2.29
1024,2.60
1025,2.95
1026,3.34
1027,3.73
1028,4.13
1029,4.49
1030,4.83
1031,5.10
1032,5.30
1033,5.40
1034,5.41
1035,5.33
1036,5.20
1037,5.06
1038,4.95
1039,4.89
1040,4.88
1041,4.92
1042,4.96
1043,4.96
1044,4.90
1045,4.76
1046,4.57
1047,4.33
1048,4.05
1049,3.76
1050,3.43
1051,3.15
1052,2.88
1053,2.65
1054,2.40
1055,2.12
1056,1.79
1057,1.45
1058,1.09
1059,0.72
1060,0.34
1061,0.00
1062,-0.30
1063,-0.52
1064,-0.67
1065,-0.76
1066,-0.80
1067,-0.80
1068,-0.76
1069,-0.68
1070,-0.59
1071,-0.48
1072,-0.36
1073,-0.24
1074,-0.13
1075,-0.03
1076,0.09
1077,0.23
1078,0.42
1079,0.61
1080,0.80
1081,0.98
1082,1.16
1083,1.30
1084,1.41
1085,1.48
1086,1.55
1087,1.63
1088,1.75
1089,1.92
1090,2.14
1091,2.39
1092,2.66
1093,2.90
1094,3.10
1095,3.23
1096,3.29
1097,3.27
1098,3.21
1099,3.13
1100,3.05
1101,3.01
1102,3.02
1103,3.06
1104,3.12
1105,3.15
1106,3.14
1107,3.10
1108,3.02
1109,2.90
1110,2.73
1111,2.55
1112,2.40
1113,2.30
1114,2.21
1115,2.12
1116,2.04
1117,1.95
1118,1.84
1119,1.69
1120,1.50
1121,1.31
1122,1.13
1123,0.99
1124,0.91
1125,0.89
1126,0.96
1127,1.10
1128,1.27
1129,1.46
1130,1.62
1131,1.76
1132,1.85
1133,1.91
1134,1.95
1135,1.98
1136,1.99
1137,1.98
1138,1.93
1139,1.86
1140,1.76
1141,1.62
1142,1.46
1143,1.30
1144,1.20
1145,1.19
1146,1.25
1147,1.39
1148,1.58
1149,1.78
1150,1.95
1151,2.08
1152,2.12
1153,2.08
1154,1.94
1155,1.76
1156,1.57
1157,1.41
1158,1.27
1159,1.13
1160,1.01
1161,0.91
1162,0.82
1163,0.75
1164,0.67
1165,0.60
1166,0.54
1167,0.52
1168,0.49
1169,0.44
1170,0.31
1171,0.15
1172,-0.09
1173,-0.38
1174,-0.72
1175,-1.06
1176,-1.36
1177,-1.60
1178,-1.80
1179,-1.97
1180,-2.13
1181,-2.28
1182,-2.44
1183,-2.61
1184,-2.82
1185,-3.03
1186,-3.23
1187,-3.38
1188,-3.46
1189,-3.46
1190,-3.37
1191,-3.20
1192,-2.92
1193,-2.58
1194,-2.18
1195,-1.76
1196,-1.35
1197,-1.01
1198,-0.77
1199,-0.65
1200,-0.61
1201,-0.63
1202,-0.63
1203,-0.60
1204,-0.44
1205,-0.15
1206,0.27
1207,0.74
1208,1.21
1209,1.61
1210,1.92
1211,2.09
1212,2.17
1213,2.19
1214,2.23
1215,2.34
1216,2.56
1217,2.89
1218,3.32
1219,3.77
1220,4.17
1221,4.46
1222,4.61
1223,4.64
1224,4.56
1225,4.43
1226,4.32
1227,4.27
1228,4.32
1229,4.42
1230,4.55
1231,4.66
1232,4.73
1233,4.74
1234,4.69
1235,4.60
1236,4.50
1237,4.45
1238,4.42
1239,4.44
1240,4.49
1241,4.56
1242,4.59
1243,4.58
1244,4.51
1245,4.39
1246,4.22
1247,4.02
1248,3.76
1249,3.50
1250,3.22
1251,2.95
1252,2.62
1253,2.26
1254,1.84
1255,1.39
1256,0.91
1257,0.42
1258,-0.06
1259,-0.49
1260,-0.87
1261,-1.18
1262,-1.44
1263,-1.62
1264,-1.77
1265,-1.90
1266,-2.05
1267,-2.19
1268,-2.33
1269,-2.45
1270,-2.57
1271,-2.68
1272,-2.79
1273,-2.90
1274,-3.01
1275,-3.11
1276,-3.19
1277,-3.24
1278,-3.24
1279,-3.20
1280,-3.10
1281,-2.95
1282,-2.77
1283,-2.61
1284,-2.47
1285,-2.37
1286,-2.28
1287,-2.18
1288,-2.04
1289,-1.87
1290,-1.63
1291,-1.32
1292,-0.94
1293,-0.52
1294,-0.08
1295,0.35
1296,0.77
1297,1.16
1298,1.51
1299,1.79
1300,2.00
1301,2.13
1302,2.20
1303,2.21
1304,2.19
1305,2.15
1306,2.15
1307,2.17
1308,2.22
1309,2.29
1310,2.36
1311,2.42
1312,2.44
1313,2.39
1314,2.30
1315,2.19
1316,2.08
1317,1.97
1318,1.82
1319,1.67
1320,1.48
1321,1.28
1322,1.02
1323,0.71
1324,0.35
1325,0.01
1326,-0.31
1327,-0.52
1328,-0.65
1329,-0.69
1330,-0.69
1331,-0.64
1332,-0.60
1333,-0.58
1334,-0.63
1335,-0.74
1336,-0.86
1337,-0.97
1338,-1.07
1339,-1.16
1340,-1.21
1341,-1.25
1342,-1.26
1343,-1.28
1344,-1.28
1345,-1.25
1346,-1.18
1347,-1.08
1348,-0.94
1349,-0.81
1350,-0.69
1351,-0.61
1352,-0.59
1353,-0.64
1354,-0.75
1355,-0.87
1356,-0.95
1357,-0.94
1358,-0.83
1359,-0.64
1360,-0.42
1361,-0.22
1362,-0.11
1363,-0.12
1364,-0.27
1365,-0.53
1366,-0.85
1367,-1.16
1368,-1.36
1369,-1.43
1370,-1.35
1371,-1.19
1372,-1.01
1373,-0.84
1374,-0.73
1375,-0.72
1376,-0.80
1377,-0.94
1378,-1.08
1379,-1.17
1380,-1.20
1381,-1.15
1382,-1.04
1383,-0.89
1384,-0.72
1385,-0.56
1386,-0.47
1387,-0.45
1388,-0.52
1389,-0.66
1390,-0.84
1391,-1.04
1392,-1.21
1393,-1.32
1394,-1.35
1395,-1.32
1396,-1.25
1397,-1.17
1398,-1.10
1399,-1.06
1400,-1.05
1401,-1.07
1402,-1.08
1403,-1.06
1404,-0.96
1405,-0.79
1406,-0.50
1407,-0.15
1408,0.25
1409,0.64
1410,1.02
1411,1.34
1412,1.59
1413,1.73
1414,1.83
1415,1.89
1416,1.96
1417,2.04
1418,2.19
1419,2.40
1420,2.67
1421,2.97
1422,3.27
1423,3.54
1424,3.77
1425,3.93
1426,4.02
1427,4.05
1428,4.03
1429,3.97
1430,3.87
1431,3.74
1432,3.58
1433,3.40
1434,3.20
1435,2.99
1436,2.78
1437,2.59
1438,2.40
1439,2.26
1440,2.14
1441,2.04
1442,1.92
1443,1.78
1444,1.60
1445,1.41
1446,1.20
1447,1.01
1448,0.84
1449,0.70
1450,0.54
1451,0.37
1452,0.16
1453,-0.08
1454,-0.35
1455,-0.61
1456,-0.86
1457,-1.03
1458,-1.17
1459,-1.25
1460,-1.32
1461,-1.41
1462,-1.60
1463,-1.88
1464,-2.24
1465,-2.62
1466,-2.98
1467,-3.27
1468,-3.43
1469,-3.42
1470,-3.29
1471,-3.08
1472,-2.88
1473,-2.73
1474,-2.66
1475,-2.69
1476,-2.81
1477,-2.99
1478,-3.21
1479,-3.44
1480,-3.63
1481,-3.76
1482,-3.79
1483,-3.75
1484,-3.62
1485,-3.43
1486,-3.17
1487,-2.87
1488,-2.55
1489,-2.26
1490,-1.98
1491,-1.74
1492,-1.48
1493,-1.24
1494,-0.98
1495,-0.74
1496,-0.46
1497,-0.17
1498,0.17
1499,0.51
1500,0.85
1501,1.17
1502,1.51
1503,1.84
1504,2.20
1505,2.52
1506,2.83
1507,3.10
1508,3.38
1509,3.63
1510,3.85
1511,4.03
1512,4.17
1513,4.26
1514,4.29
1515,4.28
1516,4.23
1517,4.15
1518,4.05
1519,3.93
1520,3.81
1521,3.73
1522,3.65
1523,3.60
1524,3.54
1525,3.50
1526,3.46
1527,3.43
1528,3.34
1529,3.22
1530,3.01
1531,2.72
1532,2.32
1533,1.84
1534,1.30
1535,0.77
1536,0.25
1537,-0.19
1538,-0.57
1539,-0.88
1540,-1.14
1541,-1.35
1542,-1.52
1543,-1.65
1544,-1.76
1545,-1.83
1546,-1.86
1547,-1.83
1548,-1.74
1549,-1.58
1550,-1.39
1551,-1.21
1552,-1.07
1553,-0.97
1554,-0.88
1555,-0.81
1556,-0.76
1557,-0.73
1558,-0.69
1559,-0.61
1560,-0.46
1561,-0.30
1562,-0.13
1563,0.00
1564,0.12
1565,0.21
1566,0.30
1567,0.37
1568,0.48
1569,0.62
1570,0.81
1571,1.02
1572,1.25
1573,1.47
1574,1.65
1575,1.75
1576,1.82
1577,1.86
1578,1.88
1579,1.90
1580,1.93
1581,1.99
1582,2.04
1583,2.04
1584,1.99
1585,1.87
1586,1.68
1587,1.42
1588,1.14
1589,0.89
1590,0.73
1591,0.68
1592,0.70
1593,0.78
1594,0.88
1595,0.99
1596,1.08
1597,1.12
1598,1.11
1599,1.05
1600,0.96
1601,0.89
1602,0.84
1603,0.82
1604,0.85
1605,0.94
1606,1.09
1607,1.27
1608,1.45
1609,1.58
1610,1.67
1611,1.73
1612,1.77
1613,1.80
1614,1.82
1615,1.87
1616,1.94
1617,2.05
1618,2.17
1619,2.27
1620,2.36
1621,2.41
1622,2.45
1623,2.48
1624,2.51
1625,2.54
1626,2.56
1627,2.59
1628,2.64
1629,2.68
1630,2.72
1631,2.75
1632,2.79
1633,2.85
1634,2.91
1635,2.98
1636,3.03
1637,3.06
1638,3.05
1639,2.98
1640,2.84
1641,2.64
1642,2.41
1643,2.19
1644,1.98
1645,1.84
1646,1.75
1647,1.72
1648,1.68
1649,1.61
1650,1.46
1651,1.23
1652,0.89
1653,0.51
1654,0.08
1655,-0.34
1656,-0.73
1657,-1.03
1658,-1.28
1659,-1.48
1660,-1.70
1661,-1.93
1662,-2.18
1663,-2.44
1664,-2.72
1665,-3.00
1666,-3.24
1667,-3.37
1668,-3.41
1669,-3.34
1670,-3.20
1671,-2.98
1672,-2.74
1673,-2.50
1674,-2.28
1675,-2.11
1676,-1.96
1677,-1.86
1678,-1.80
1679,-1.79
1680,-1.79
1681,-1.80
1682,-1.78
1683,-1.74
1684,-1.66
1685,-1.55
1686,-1.36
1687,-1.11
1688,-0.80
1689,-0.45
1690,-0.08
1691,0.27
1692,0.60
1693,0.88
1694,1.14
1695,1.34
1696,1.50
1697,1.63
1698,1.78
1699,1.96
1700,2.20
1701,2.46
1702,2.72
1703,2.97
1704,3.21
1705,3.40
1706,3.54
1707,3.63
1708,3.68
1709,3.72
1710,3.77
1711,3.85
1712,3.96
1713,4.07
1714,4.18
1715,4.24
1716,4.27
1717,4.26
1718,4.23
1719,4.19
1720,4.15
1721,4.16
1722,4.17
1723,4.18
1724,4.14
1725,4.04
1726,3.86
1727,3.62
1728,3.34
1729,3.05
1730,2.77
1731,2.55
1732,2.34
1733,2.16
1734,1.92
1735,1.63
1736,1.26
1737,0.85
1738,0.38
1739,-0.06
1740,-0.45
1741,-0.71
1742,-0.88
1743,-0.95
1744,-1.02
1745,-1.10
1746,-1.24
1747,-1.43
1748,-1.69
1749,-2.00
1750,-2.36
1751,-2.72
1752,-3.05
1753,-3.31
1754,-3.47
1755,-3.54
1756,-3.55
1757,-3.50
1758,-3.40
1759,-3.27
1760,-3.13
1761,-3.00
1762,-2.90
1763,-2.84
1764,-2.78
1765,-2.70
1766,-2.51
1767,-2.24
1768,-1.87
1769,-1.45
1770,-0.98
1771,-0.48
1772,0.05
1773,0.54
1774,1.00
1775,1.38
1776,1.69
1777,1.90
1778,2.08
1779,2.19
1780,2.26
1781,2.25
1782,2.21
1783,2.16
1784,2.12
1785,2.10
1786,2.07
1787,2.01
1788,1.90
1789,1.76
1790,1.56
1791,1.30
1792,0.93
1793,0.50
1794,0.05
1795,-0.38
1796,-0.77
1797,-1.11
1798,-1.37
1799,-1.52
1800,-1.58
1801,-1.58
1802,-1.58
1803,-1.59
1804,-1.64
1805,-1.71
1806,-1.80
1807,-1.89
1808,-1.99
1809,-2.07
1810,-2.15
1811,-2.20
1812,-2.27
1813,-2.37
1814,-2.52
1815,-2.73
1816,-3.00
1817,-3.27
1818,-3.49
1819,-3.63
1820,-3.69
1821,-3.67
1822,-3.58
1823,-3.46
1824,-3.35
1825,-3.29
1826,-3.27
1827,-3.29
1828,-3.32
1829,-3.34
1830,-3.32
1831,-3.27
1832,-3.16
1833,-3.02
1834,-2.88
1835,-2.75
1836,-2.61
1837,-2.48
1838,-2.35
1839,-2.22
1840,-2.07
1841,-1.93
1842,-1.77
1843,-1.64
1844,-1.53
1845,-1.48
1846,-1.44
1847,-1.42
1848,-1.38
1849,-1.33
1850,-1.22
1851,-1.06
1852,-0.84
1853,-0.58
1854,-0.32
1855,-0.10
1856,0.08
1857,0.21
1858,0.31
1859,0.40
1860,0.49
1861,0.61
1862,0.77
1863,0.96
1864,1.18
1865,1.39
1866,1.57
1867,1.72
1868,1.84
1869,1.91
1870,1.94
1871,1.92
1872,1.89
1873,1.87
1874,1.89
1875,1.95
1876,2.04
1877,2.16
1878,2.29
1879,2.41
1880,2.51
1881,2.59
1882,2.64
1883,2.65
1884,2.63
1885,2.62
1886,2.63
1887,2.69
1888,2.78
1889,2.87
1890,2.95
1891,3.01
1892,3.03
1893,3.03
1894,3.04
1895,3.09
1896,3.22
1897,3.41
1898,3.68
1899,3.98
1900,4.28
1901,4.56
1902,4.77
1903,4.90
1904,4.94
1905,4.91
1906,4.85
1907,4.77
1908,4.69
1909,4.61
1910,4.56
1911,4.51
1912,4.46
1913,4.41
1914,4.33
1915,4.23
1916,4.09
1917,3.91
1918,3.69
1919,3.44
1920,3.14
1921,2.82
1922,2.47
1923,2.13
1924,1.80
1925,1.55
1926,1.39
1927,1.32
1928,1.29
1929,1.27
1930,1.21
1931,1.12
1932,0.93
1933,0.66
1934,0.27
1935,-0.14
1936,-0.56
1937,-0.90
1938,-1.17
1939,-1.37
1940,-1.54
1941,-1.70
1942,-1.90
1943,-2.14
1944,-2.46
1945,-2.81
1946,-3.21
1947,-3.56
1948,-3.85
1949,-3.99
1950,-4.03
1951,-3.97
1952,-3.88
1953,-3.78
1954,-3.74
1955,-3.75
1956,-3.83
1957,-3.95
1958,-4.09
1959,-4.23
1960,-4.34
1961,-4.41
1962,-4.45
1963,-4.47
1964,-4.46
1965,-4.45
1966,-4.42
1967,-4.38
1968,-4.32
1969,-4.24
1970,-4.16
1971,-4.06
1972,-3.91
1973,-3.71
1974,-3.43
1975,-3.09
1976,-2.66
1977,-2.16
1978,-1.58
1979,-1.02
1980,-0.49
1981,-0.06
1982,0.27
1983,0.49
1984,0.63
1985,0.69
1986,0.73
1987,0.76
1988,0.86
1989,1.00
1990,1.21
1991,1.41
1992,1.62
1993,1.79
1994,1.93
1995,2.03
1996,2.07
1997,2.07
1998,2.03
1999,1.98
2000,1.95
2001,1.95
2002,1.98
2003,2.02
2004,2.02
2005,1.98
2006,1.87
2007,1.69
2008,1.44
2009,1.15
2010,0.80
2011,0.45
2012,0.09
2013,-0.25
2014,-0.58
2015,-0.87
2016,-1.15
2017,-1.42
2018,-1.68
2019,-1.92
2020,-2.12
2021,-2.28
2022,-2.43
2023,-2.58
2024,-2.73
2025,-2.88
2026,-3.02
2027,-3.10
2028,-3.13
2029,-3.09
2030,-2.98
2031,-2.79
2032,-2.56
2033,-2.33
2034,-2.16
2035,-2.09
2036,-2.09
2037,-2.15
2038,-2.21
2039,-2.26
2040,-2.26
2041,-2.19
2042,-2.02
2043,-1.82
2044,-1.59
2045,-1.38
2046,-1.19
2047,-1.05
2048,-0.93
2049,-0.83
2050,-0.71
2051,-0.57
2052,-0.37
2053,-0.16
2054,0.03
2055,0.17
2056,0.23
2057,0.20
2058,0.06
2059,-0.13
2060,-0.33
2061,-0.51
2062,-0.68
2063,-0.81
2064,-0.89
2065,-0.92
2066,-0.94
2067,-0.98
2068,-1.06
2069,-1.13
2070,-1.18
2071,-1.21
2072,-1.25
2073,-1.28
2074,-1.33
2075,-1.39
2076,-1.49
2077,-1.61
2078,-1.72
2079,-1.80
2080,-1.83
2081,-1.83
2082,-1.80
2083,-1.76
2084,-1.70
2085,-1.64
2086,-1.59
2087,-1.56
2088,-1.54
2089,-1.53
2090,-1.51
2091,-1.51
2092,-1.54
2093,-1.61
2094,-1.73
2095,-1.85
2096,-1.96
2097,-2.03
2098,-2.07
2099,-2.04
2100,-1.94
2101,-1.80
2102,-1.68
2103,-1.62
2104,-1.68
2105,-1.81
2106,-2.01
2107,-2.21
2108,-2.37
2109,-2.46
2110,-2.46
2111,-2.36
2112,-2.22
2113,-2.10
2114,-2.04
2115,-2.08
2116,-2.24
2117,-2.47
2118,-2.76
2119,-3.03
2120,-3.26
2121,-3.41
2122,-3.49
2123,-3.49
2124,-3.47
2125,-3.43
2126,-3.45
2127,-3.54
2128,-3.74
2129,-4.03
2130,-4.38
2131,-4.75
2132,-5.12
2133,-5.43
2134,-5.69
2135,-5.88
2136,-6.02
2137,-6.09
2138,-6.17
2139,-6.27
2140,-6.42
2141,-6.62
2142,-6.85
2143,-7.09
2144,-7.32
2145,-7.52
2146,-7.64
2147,-7.68
2148,-7.61
2149,-7.49
2150,-7.34
2151,-7.18
2152,-7.05
2153,-6.93
2154,-6.83
2155,-6.74
2156,-6.65
2157,-6.56
2158,-6.49
2159,-6.45
2160,-6.40
2161,-6.36
2162,-6.32
2163,-6.31
2164,-6.31
2165,-6.30
2166,-6.24
2167,-6.14
2168,-5.99
2169,-5.81
2170,-5.61
2171,-5.41
2172,-5.26
2173,-5.19
2174,-5.18
2175,-5.25
2176,-5.36
2177,-5.49
2178,-5.57
2179,-5.58
2180,-5.47
2181,-5.28
2182,-5.01
2183,-4.71
2184,-4.40
2185,-4.12
2186,-3.88
2187,-3.68
2188,-3.46
2189,-3.24
2190,-2.96
2191,-2.63
2192,-2.22
2193,-1.78
2194,-1.33
2195,-0.92
2196,-0.57
2197,-0.30
2198,-0.09
2199,0.04
2200,0.14
2201,0.23
2202,0.36
2203,0.49
2204,0.63
2205,0.74
2206,0.79
2207,0.79
2208,0.75
2209,0.69
2210,0.62
2211,0.56
2212,0.52
2213,0.50
2214,0.51
2215,0.51
2216,0.48
2217,0.40
2218,0.30
2219,0.21
2220,0.14
2221,0.13
2222,0.18
2223,0.30
2224,0.46
2225,0.63
2226,0.78
2227,0.91
2228,1.04
2229,1.17
2230,1.32
2231,1.51
2232,1.78
2233,2.11
2234,2.54
2235,2.99
2236,3.48
2237,3.92
2238,4.32
2239,4.61
2240,4.82
2241,4.94
2242,5.06
2243,5.16
2244,5.32
2245,5.51
2246,5.81
2247,6.16
2248,6.57
2249,6.99
2250,7.40
2251,7.76
2252,8.11
2253,8.40
2254,8.67
2255,8.91
2256,9.18
2257,9.46
2258,9.76
2259,10.01
2260,10.21
2261,10.31
2262,10.33
2263,10.30
2264,10.22
2265,10.08
2266,9.90
2267,9.66
2268,9.38
2269,9.08
2270,8.78
2271,8.51
2272,8.28
2273,8.11
2274,7.97
2275,7.89
2276,7.81
2277,7.72
2278,7.54
2279,7.28
2280,6.92
2281,6.51
2282,6.03
2283,5.56
2284,5.09
2285,4.68
2286,4.30
2287,4.00
2288,3.73
2289,3.52
2290,3.31
2291,3.12
2292,2.93
2293,2.78
2294,2.63
2295,2.51
2296,2.40
2297,2.35
2298,2.37
2299,2.46
2300,2.58
2301,2.70
2302,2.76
2303,2.77
2304,2.67
2305,2.48
2306,2.21
2307,1.92
2308,1.65
2309,1.44
2310,1.31
2311,1.27
2312,1.28
2313,1.31
2314,1.28
2315,1.20
2316,1.05
2317,0.88
2318,0.72
2319,0.60
2320,0.53
2321,0.52
2322,0.54
2323,0.58
2324,0.60
2325,0.60
2326,0.56
2327,0.49
2328,0.41
2329,0.33
2330,0.26
2331,0.22
2332,0.21
2333,0.20
2334,0.13
2335,-0.01
2336,-0.23
2337,-0.50
2338,-0.83
2339,-1.15
2340,-1.46
2341,-1.72
2342,-1.98
2343,-2.21
2344,-2.43
2345,-2.64
2346,-2.86
2347,-3.09
2348,-3.35
2349,-3.60
2350,-3.85
2351,-4.07
2352,-4.27
2353,-4.42
2354,-4.50
2355,-4.52
2356,-4.48
2357,-4.40
2358,-4.30
2359,-4.19
2360,-4.10
2361,-4.02
2362,-3.97
2363,-3.93
2364,-3.87
2365,-3.80
2366,-3.70
2367,-3.60
2368,-3.48
2369,-3.35
2370,-3.21
2371,-3.08
2372,-2.95
2373,-2.84
2374,-2.71
2375,-2.59
2376,-2.41
2377,-2.18
2378,-1.85
2379,-1.45
2380,-0.99
2381,-0.52
2382,-0.07
2383,0.33
2384,0.66
2385,0.87
2386,0.95
2387,0.90
2388,0.75
2389,0.54
2390,0.30
2391,0.05
2392,-0.23
2393,-0.54
2394,-0.89
2395,-1.26
2396,-1.66
2397,-2.04
2398,-2.41
2399,-2.68
2400,-2.90
2401,-3.03
2402,-3.16
2403,-3.27
2404,-3.46
2405,-3.72
2406,-4.11
2407,-4.58
2408,-5.12
2409,-5.65
2410,-6.19
2411,-6.67
2412,-7.13
2413,-7.51
2414,-7.90
2415,-8.26
2416,-8.65
2417,-9.05
2418,-9.47
2419,-9.87
2420,-10.32
2421,-10.78
2422,-11.25
2423,-11.71
2424,-12.17
2425,-12.60
2426,-12.98
2427,-13.23
2428,-13.35
2429,-13.30
2430,-13.18
2431,-13.01
2432,-12.89
2433,-12.86
2434,-12.96
2435,-13.18
2436,-13.50
2437,-13.85
2438,-14.18
2439,-14.42
2440,-14.52
2441,-14.49
2442,-14.38
2443,-14.25
2444,-14.14
2445,-14.08
2446,-14.04
2447,-14.03
2448,-14.00
2449,-13.95
2450,-13.84
2451,-13.68
2452,-13.45
2453,-13.18
2454,-12.90
2455,-12.64
2456,-12.35
2457,-12.08
2458,-11.80
2459,-11.56
2460,-11.30
2461,-11.06
2462,-10.78
2463,-10.49
2464,-10.14
2465,-9.75
2466,-9.28
2467,-8.82
2468,-8.40
2469,-8.06
2470,-7.78
2471,-7.57
2472,-7.44
2473,-7.39
2474,-7.38
2475,-7.40
2476,-7.41
2477,-7.43
2478,-7.45
2479,-7.51
2480,-7.60
2481,-7.71
2482,-7.81
2483,-7.86
2484,-7.84
2485,-7.74
2486,-7.60
2487,-7.46
2488,-7.37
2489,-7.37
2490,-7.48
2491,-7.68
2492,-7.92
2493,-8.15
2494,-8.31
2495,-8.38
2496,-8.33
2497,-8.19
2498,-8.00
2499,-7.82
2500,-7.68
2501,-7.63
2502,-7.63
2503,-7.67
2504,-7.70
2505,-7.71
2506,-7.64
2507,-7.46
2508,-7.16
2509,-6.79
2510,-6.36
2511,-5.94
2512,-5.49
2513,-5.07
2514,-4.64
2515,-4.27
2516,-3.89
2517,-3.55
2518,-3.17
2519,-2.80
2520,-2.38
2521,-1.99
2522,-1.60
2523,-1.25
2524,-0.90
2525,-0.58
2526,-0.26
2527,0.02
2528,0.34
2529,0.67
2530,1.06
2531,1.47
2532,1.93
2533,2.39
2534,2.84
2535,3.19
2536,3.45
2537,3.57
2538,3.61
2539,3.59
2540,3.55
2541,3.51
2542,3.51
2543,3.53
2544,3.61
2545,3.73
2546,3.88
2547,4.01
2548,4.12
2549,4.21
2550,4.29
2551,4.39
2552,4.53
2553,4.66
2554,4.78
2555,4.85
2556,4.90
2557,4.90
2558,4.90
2559,4.89
2560,4.94
2561,5.05
2562,5.25
2563,5.50
2564,5.80
2565,6.11
2566,6.43
2567,6.70
2568,6.90
2569,7.03
2570,7.14
2571,7.23
2572,7.34
2573,7.46
2574,7.62
2575,7.82
2576,8.06
2577,8.29
2578,8.49
2579,8.63
2580,8.72
2581,8.74
2582,8.68
2583,8.56
2584,8.40
2585,8.21
2586,8.03
2587,7.88
2588,7.78
2589,7.72
2590,7.68
2591,7.67
2592,7.69
2593,7.74
2594,7.78
2595,7.81
2596,7.77
2597,7.69
2598,7.53
2599,7.29
2600,6.97
2601,6.60
2602,6.20
2603,5.80
2604,5.37
2605,4.96
2606,4.56
2607,4.21
2608,3.88
2609,3.57
2610,3.27
2611,3.04
2612,2.87
2613,2.79
2614,2.73
2615,2.72
2616,2.69
2617,2.66
2618,2.55
2619,2.37
2620,2.13
2621,1.89
2622,1.67
2623,1.49
2624,1.36
2625,1.28
2626,1.28
2627,1.31
2628,1.41
2629,1.56
2630,1.79
2631,2.10
2632,2.47
2633,2.91
2634,3.41
2635,3.91
2636,4.39
2637,4.76
2638,5.04
2639,5.24
2640,5.39
2641,5.49
2642,5.58
2643,5.66
2644,5.76
2645,5.85
2646,5.93
2647,5.95
2648,5.91
2649,5.80
2650,5.67
2651,5.56
2652,5.51
2653,5.56
2654,5.71
2655,5.93
2656,6.20
2657,6.46
2658,6.68
2659,6.83
2660,6.89
2661,6.87
2662,6.81
2663,6.78
2664,6.80
2665,6.88
2666,6.98
2667,7.07
2668,7.14
2669,7.18
2670,7.20
2671,7.18
2672,7.15
2673,7.13
2674,7.16
2675,7.22
2676,7.29
2677,7.35
2678,7.38
2679,7.37
2680,7.32
2681,7.22
2682,7.10
2683,7.00
2684,6.94
2685,6.92
2686,6.92
2687,6.93
2688,6.94
2689,6.92
2690,6.85
2691,6.71
2692,6.50
2693,6.24
2694,5.93
2695,5.59
2696,5.26
2697,4.95
2698,4.67
2699,4.44
2700,4.26
2701,4.15
2702,4.04
2703,3.93
2704,3.79
2705,3.63
2706,3.42
2707,3.19
2708,2.92
2709,2.64
2710,2.35
2711,2.08
2712,1.85
2713,1.70
2714,1.64
2715,1.69
2716,1.82
2717,2.02
2718,2.25
2719,2.48
2720,2.67
2721,2.80
2722,2.87
2723,2.88
2724,2.88
2725,2.88
2726,2.95
2727,3.06
2728,3.25
2729,3.47
2730,3.72
2731,3.97
2732,4.22
2733,4.44
2734,4.64
2735,4.82
2736,5.00
2737,5.18
2738,5.40
2739,5.62
2740,5.85
2741,6.07
2742,6.30
2743,6.51
2744,6.76
2745,7.01
2746,7.27
2747,7.50
2748,7.72
2749,7.89
2750,7.99
2751,8.02
2752,7.98
2753,7.90
2754,7.80
2755,7.70
2756,7.58
2757,7.47
2758,7.35
2759,7.20
2760,7.00
2761,6.79
2762,6.60
2763,6.47
2764,6.38
2765,6.34
2766,6.33
2767,6.35
2768,6.38
2769,6.38
2770,6.32
2771,6.19
2772,6.00
2773,5.79
2774,5.55
2775,5.32
2776,5.11
2777,4.96
2778,4.87
2779,4.84
2780,4.86
2781,4.93
2782,5.00
2783,5.07
2784,5.08
2785,5.03
2786,4.96
2787,4.88
2788,4.81
2789,4.75
2790,4.71
2791,4.68
2792,4.64
2793,4.55
2794,4.41
2795,4.23
2796,4.03
2797,3.81
2798,3.62
2799,3.50
2800,3.49
2801,3.59
2802,3.78
2803,4.02
2804,4.24
2805,4.39
2806,4.43
2807,4.36
2808,4.20
2809,4.00
2810,3.77
2811,3.55
2812,3.37
2813,3.25
2814,3.17
2815,3.10
2816,3.02
2817,2.97
2818,2.91
2819,2.87
2820,2.83
2821,2.80
2822,2.79
2823,2.81
2824,2.84
2825,2.87
2826,2.88
2827,2.88
2828,2.88
2829,2.90
2830,2.91
2831,2.88
2832,2.81
2833,2.73
2834,2.69
2835,2.68
2836,2.72
2837,2.80
2838,2.91
2839,3.03
2840,3.12
2841,3.15
2842,3.13
2843,3.08
2844,3.03
2845,3.01
2846,3.07
2847,3.23
2848,3.50
2849,3.85
2850,4.23
2851,4.59
2852,4.91
2853,5.15
2854,5.35
2855,5.50
2856,5.69
2857,5.92
2858,6.22
2859,6.53
2860,6.85
2861,7.13
2862,7.38
2863,7.57
2864,7.71
2865,7.78
2866,7.82
2867,7.81
2868,7.77
2869,7.68
2870,7.55
2871,7.37
2872,7.14
2873,6.87
2874,6.58
2875,6.30
2876,6.02
2877,5.78
2878,5.53
2879,5.30
2880,5.04
2881,4.79
2882,4.48
2883,4.17
2884,3.79
2885,3.41
2886,3.01
2887,2.64
2888,2.29
2889,2.01
2890,1.74
2891,1.53
2892,1.33
2893,1.19
2894,1.07
2895,1.01
2896,0.94
2897,0.89
2898,0.82
2899,0.75
2900,0.66
2901,0.54
2902,0.40
2903,0.26
2904,0.16
2905,0.12
2906,0.11
2907,0.15
2908,0.22
2909,0.31
2910,0.39
2911,0.44
2912,0.45
2913,0.42
2914,0.34
2915,0.20
2916,0.02
2917,-0.20
2918,-0.40
2919,-0.58
2920,-0.72
2921,-0.81
2922,-0.85
2923,-0.83
2924,-0.77
2925,-0.69
2926,-0.59
2927,-0.48
2928,-0.36
2929,-0.27
2930,-0.18
2931,-0.11
2932,-0.01
2933,0.13
2934,0.34
2935,0.59
2936,0.91
2937,1.29
2938,1.74
2939,2.21
2940,2.71
2941,3.18
2942,3.64
2943,4.03
2944,4.39
2945,4.68
2946,4.94
2947,5.16
2948,5.37
2949,5.57
2950,5.80
2951,6.02
2952,6.23
2953,6.41
2954,6.56
2955,6.68
2956,6.74
2957,6.73
2958,6.65
2959,6.54
2960,6.43
2961,6.34
2962,6.27
2963,6.23
2964,6.20
2965,6.17
2966,6.07
2967,5.90
2968,5.62
2969,5.28
2970,4.89
2971,4.52
2972,4.17
2973,3.89
2974,3.69
2975,3.58
2976,3.49
2977,3.42
2978,3.28
2979,3.09
2980,2.83
2981,2.51
2982,2.18
2983,1.88
2984,1.63
2985,1.47
2986,1.39
2987,1.36
2988,1.36
2989,1.35
2990,1.31
2991,1.25
2992,1.17
2993,1.07
2994,1.00
2995,0.98
2996,1.06
2997,1.22
2998,1.46
2999,1.73
3000,2.01
3001,2.28
3002,2.52
3003,2.72
3004,2.92
3005,3.09
3006,3.26
3007,3.41
3008,3.55
3009,3.66
3010,3.78
3011,3.87
3012,3.98
3013,4.09
3014,4.25
3015,4.46
3016,4.71
3017,4.96
3018,5.21
3019,5.40
3020,5.53
3021,5.56
3022,5.55
3023,5.51
3024,5.50
3025,5.51
3026,5.56
3027,5.63
3028,5.74
3029,5.86
3030,5.97
3031,6.04
3032,6.09
3033,6.12
3034,6.13
3035,6.12
3036,6.08
3037,6.05
3038,6.02
3039,5.98
3040,5.91
3041,5.79
3042,5.63
3043,5.45
3044,5.26
3045,5.05
3046,4.81
3047,4.56
3048,4.31
3049,4.09
3050,3.87
3051,3.67
3052,3.47
3053,3.31
3054,3.16
3055,3.03
3056,2.92
3057,2.84
3058,2.80
3059,2.80
3060,2.84
3061,2.91
3062,2.97
3063,3.02
3064,3.03
3065,3.03
3066,3.04
3067,3.05
3068,3.06
3069,3.09
3070,3.16
3071,3.28
3072,3.42
3073,3.58
3074,3.74
3075,3.90
3076,4.05
3077,4.19
3078,4.32
3079,4.46
3080,4.57
3081,4.66
3082,4.68
3083,4.64
3084,4.49
3085,4.28
3086,4.00
3087,3.72
3088,3.41
3089,3.13
3090,2.84
3091,2.59
3092,2.34
3093,2.10
3094,1.82
3095,1.51
3096,1.15
3097,0.78
3098,0.40
3099,0.08
3100,-0.20
3101,-0.39
3102,-0.56
3103,-0.69
3104,-0.81
3105,-0.94
3106,-1.10
3107,-1.28
3108,-1.47
3109,-1.62
3110,-1.71
3111,-1.71
3112,-1.61
3113,-1.43
3114,-1.19
3115,-0.94
3116,-0.69
3117,-0.50
3118,-0.37
3119,-0.30
3120,-0.24
3121,-0.18
3122,-0.05
3123,0.14
3124,0.41
3125,0.72
3126,1.06
3127,1.38
3128,1.71
3129,1.98
3130,2.21
3131,2.35
3132,2.46
3133,2.54
3134,2.65
3135,2.77
3136,2.95
3137,3.19
3138,3.50
3139,3.85
3140,4.23
3141,4.57
3142,4.89
3143,5.13
3144,5.29
3145,5.35
3146,5.36
3147,5.35
3148,5.36
3149,5.38
3150,5.46
3151,5.56
3152,5.68
3153,5.79
3154,5.87
3155,5.91
3156,5.91
3157,5.90
3158,5.89
3159,5.92
3160,5.98
3161,6.05
3162,6.09
3163,6.10
3164,6.02
3165,5.83
3166,5.52
3167,5.15
3168,4.73
3169,4.33
3170,3.94
3171,3.60
3172,3.31
3173,3.07
3174,2.80
3175,2.51
3176,2.17
3177,1.80
3178,1.40
3179,1.03
3180,0.70
3181,0.49
3182,0.35
3183,0.27
3184,0.18
3185,0.07
3186,-0.08
3187,-0.24
3188,-0.44
3189,-0.62
3190,-0.79
3191,-0.91
3192,-1.00
3193,-1.05
3194,-1.08
3195,-1.11
3196,-1.17
3197,-1.24
3198,-1.32
3199,-1.40
3200,-1.46
3201,-1.51
3202,-1.53
3203,-1.54
3204,-1.50
3205,-1.45
3206,-1.35
3207,-1.21
3208,-0.98
3209,-0.69
3210,-0.33
3211,0.06
3212,0.48
3213,0.87
3214,1.25
3215,1.55
3216,1.82
3217,2.04
3218,2.22
3219,2.37
3220,2.51
3221,2.66
3222,2.82
3223,2.98
3224,3.15
3225,3.31
3226,3.47
3227,3.59
3228,3.66
3229,3.66
3230,3.59
3231,3.46
3232,3.31
3233,3.16
3234,3.03
3235,2.93
3236,2.84
3237,2.75
3238,2.66
3239,2.56
3240,2.43
3241,2.28
3242,2.11
3243,1.96
3244,1.85
3245,1.78
3246,1.72
3247,1.66
3248,1.54
3249,1.38
3250,1.15
3251,0.90
3252,0.63
3253,0.38
3254,0.14
3255,-0.05
3256,-0.19
3257,-0.28
3258,-0.32
3259,-0.33
3260,-0.33
3261,-0.32
3262,-0.28
3263,-0.22
3264,-0.14
3265,-0.05
3266,0.05
3267,0.13
3268,0.21
3269,0.29
3270,0.36
3271,0.43
3272,0.52
3273,0.61
3274,0.70
3275,0.81
3276,0.92
3277,1.03
3278,1.10
3279,1.13
3280,1.12
3281,1.06
3282,0.95
3283,0.78
3284,0.58
3285,0.39
3286,0.21
3287,0.08
3288,-0.02
3289,-0.04
3290,0.00
3291,0.08
3292,0.13
3293,0.12
3294,0.06
3295,-0.04
3296,-0.17
3297,-0.30
3298,-0.40
3299,-0.42
3300,-0.36
3301,-0.25
3302,-0.11
3303,0.01
3304,0.08
3305,0.05
3306,-0.07
3307,-0.24
3308,-0.42
3309,-0.54
3310,-0.57
3311,-0.49
3312,-0.34
3313,-0.16
3314,0.02
3315,0.16
3316,0.23
3317,0.23
3318,0.17
3319,0.09
3320,0.04
3321,0.06
3322,0.19
3323,0.38
3324,0.62
3325,0.84
3326,1.04
3327,1.22
3328,1.39
3329,1.53
3330,1.68
3331,1.84
3332,2.10
3333,2.42
3334,2.80
3335,3.18
3336,3.53
3337,3.81
3338,4.03
3339,4.15
3340,4.22
3341,4.26
3342,4.31
3343,4.38
3344,4.49
3345,4.61
3346,4.73
3347,4.82
3348,4.86
3349,4.84
3350,4.79
3351,4.69
3352,4.57
3353,4.46
3354,4.36
3355,4.30
3356,4.25
3357,4.22
3358,4.18
3359,4.14
3360,4.06
3361,3.95
3362,3.78
3363,3.59
3364,3.35
3365,3.11
3366,2.85
3367,2.62
3368,2.37
3369,2.12
3370,1.86
3371,1.62
3372,1.34
3373,1.04
3374,0.67
3375,0.29
3376,-0.12
3377,-0.50
3378,-0.87
3379,-1.17
3380,-1.44
3381,-1.64
3382,-1.82
3383,-1.96
3384,-2.10
3385,-2.23
3386,-2.36
3387,-2.48
3388,-2.58
3389,-2.62
3390,-2.61
3391,-2.55
3392,-2.45
3393,-2.34
3394,-2.24
3395,-2.15
3396,-2.08
3397,-2.02
3398,-1.97
3399,-1.93
3400,-1.90
3401,-1.86
3402,-1.82
3403,-1.76
3404,-1.70
3405,-1.64
3406,-1.57
3407,-1.49
3408,-1.37
3409,-1.25
3410,-1.07
3411,-0.88
3412,-0.61
3413,-0.29
3414,0.11
3415,0.54
3416,0.99
3417,1.40
3418,1.80
3419,2.15
3420,2.48
3421,2.80
3422,3.16
3423,3.52
3424,3.90
3425,4.22
3426,4.52
3427,4.75
3428,4.92
3429,5.00
3430,5.06
3431,5.11
3432,5.18
3433,5.26
3434,5.34
3435,5.43
3436,5.51
3437,5.54
3438,5.51
3439,5.42
3440,5.29
3441,5.16
3442,5.02
3443,4.90
3444,4.81
3445,4.74
3446,4.65
3447,4.53
3448,4.32
3449,4.06
3450,3.71
3451,3.31
3452,2.87
3453,2.44
3454,2.03
3455,1.66
3456,1.31
3457,0.99
3458,0.67
3459,0.38
3460,0.09
3461,-0.19
3462,-0.49
3463,-0.75
3464,-0.98
3465,-1.12
3466,-1.20
3467,-1.21
3468,-1.17
3469,-1.06
3470,-0.91
3471,-0.74
3472,-0.58
3473,-0.43
3474,-0.31
3475,-0.24
3476,-0.19
3477,-0.17
3478,-0.14
3479,-0.09
3480,0.05
3481,0.27
3482,0.56
3483,0.86
3484,1.15
3485,1.40
3486,1.61
3487,1.76
3488,1.85
3489,1.92
3490,2.02
3491,2.19
3492,2.40
3493,2.62
3494,2.84
3495,3.04
3496,3.19
3497,3.27
3498,3.25
3499,3.17
3500,3.07
3501,2.96
3502,2.87
3503,2.81
3504,2.81
3505,2.87
3506,2.96
3507,3.03
3508,3.09
3509,3.12
3510,3.11
3511,3.07
3512,2.99
3513,2.90
3514,2.81
3515,2.77
3516,2.77
3517,2.81
3518,2.89
3519,2.97
3520,3.02
3521,3.02
3522,2.98
3523,2.92
3524,2.84
3525,2.76
3526,2.71
3527,2.70
3528,2.71
3529,2.73
3530,2.74
3531,2.75
3532,2.78
3533,2.82
3534,2.89
3535,2.98
3536,3.07
3537,3.15
3538,3.20
3539,3.20
3540,3.15
3541,3.05
3542,2.95
3543,2.85
3544,2.80
3545,2.80
3546,2.86
3547,2.95
3548,3.05
3549,3.16
3550,3.25
3551,3.33
3552,3.38
3553,3.43
3554,3.47
3555,3.50
3556,3.50
3557,3.47
3558,3.44
3559,3.42
3560,3.41
3561,3.40
3562,3.38
3563,3.34
3564,3.25
3565,3.14
3566,2.99
3567,2.81
3568,2.58
3569,2.31
3570,2.03
3571,1.78
3572,1.55
3573,1.35
3574,1.15
3575,1.00
3576,0.85
3577,0.70
3578,0.53
3579,0.33
3580,0.07
3581,-0.21
3582,-0.52
3583,-0.82
3584,-1.09
3585,-1.28
3586,-1.39
3587,-1.45
3588,-1.48
3589,-1.51
3590,-1.54
3591,-1.55
3592,-1.57
3593,-1.57
3594,-1.53
3595,-1.44
3596,-1.30
3597,-1.12
3598,-0.91
3599,-0.71
3600,-0.50
3601,-0.31
3602,-0.11
3603,0.08
3604,0.33
3605,0.62
3606,0.99
3607,1.35
3608,1.72
3609,2.02
3610,2.31
3611,2.55
3612,2.78
3613,2.98
3614,3.22
3615,3.49
3616,3.83
3617,4.17
3618,4.52
3619,4.82
3620,5.09
3621,5.31
3622,5.53
3623,5.73
3624,5.92
3625,6.10
3626,6.28
3627,6.46
3628,6.62
3629,6.70
3630,6.73
3631,6.69
3632,6.63
3633,6.57
3634,6.52
3635,6.51
3636,6.53
3637,6.58
3638,6.63
3639,6.65
3640,6.61
3641,6.50
3642,6.33
3643,6.15
3644,5.94
3645,5.76
3646,5.55
3647,5.36
3648,5.19
3649,5.04
3650,4.81
3651,4.51
3652,4.09
3653,3.59
3654,2.98
3655,2.29
3656,1.56
3657,0.88
3658,0.27
3659,-0.19
3660,-0.52
3661,-0.68
3662,-0.74
3663,-0.71
3664,-0.69
3665,-0.69
3666,-0.76
3667,-0.88
3668,-1.06
3669,-1.25
3670,-1.42
3671,-1.52
3672,-1.57
3673,-1.55
3674,-1.47
3675,-1.36
3676,-1.28
3677,-1.26
3678,-1.31
3679,-1.41
3680,-1.52
3681,-1.65
3682,-1.75
3683,-1.80
3684,-1.76
3685,-1.64
3686,-1.45
3687,-1.21
3688,-0.93
3689,-0.66
3690,-0.38
3691,-0.13
3692,0.13
3693,0.39
3694,0.68
3695,0.99
3696,1.34
3697,1.69
3698,2.04
3699,2.34
3700,2.58
3701,2.76
3702,2.88
3703,2.93
3704,2.95
3705,2.94
3706,2.95
3707,2.94
3708,2.94
3709,2.92
3710,2.92
3711,2.92
3712,2.89
3713,2.84
3714,2.76
3715,2.67
3716,2.56
3717,2.41
3718,2.22
3719,2.00
3720,1.75
3721,1.52
3722,1.27
3723,1.04
3724,0.81
3725,0.61
3726,0.40
3727,0.21
3728,0.02
3729,-0.15
3730,-0.34
3731,-0.52
3732,-0.74
3733,-0.95
3734,-1.14
3735,-1.28
3736,-1.39
3737,-1.45
3738,-1.46
3739,-1.41
3740,-1.32
3741,-1.21
3742,-1.13
3743,-1.10
3744,-1.11
3745,-1.17
3746,-1.22
3747,-1.24
3748,-1.18
3749,-1.05
3750,-0.85
3751,-0.63
3752,-0.39
3753,-0.16
3754,0.03
3755,0.16
3756,0.24
3757,0.29
3758,0.30
3759,0.30
3760,0.29
3761,0.28
3762,0.26
3763,0.21
3764,0.13
3765,0.02
3766,-0.08
3767,-0.17
3768,-0.25
3769,-0.33
3770,-0.38
3771,-0.41
3772,-0.43
3773,-0.44
3774,-0.45
3775,-0.49
3776,-0.55
3777,-0.63
3778,-0.74
3779,-0.86
3780,-1.00
3781,-1.13
3782,-1.25
3783,-1.32
3784,-1.35
3785,-1.33
3786,-1.28
3787,-1.22
3788,-1.17
3789,-1.19
3790,-1.28
3791,-1.46
3792,-1.71
3793,-1.97
3794,-2.19
3795,-2.31
3796,-2.32
3797,-2.22
3798,-2.00
3799,-1.70
3800,-1.35
3801,-1.02
3802,-0.73
3803,-0.49
3804,-0.30
3805,-0.16
3806,-0.05
3807,0.01
3808,0.05
3809,0.06
3810,0.11
3811,0.18
3812,0.32
3813,0.52
3814,0.80
3815,1.14
3816,1.54
3817,1.92
3818,2.20
3819,2.36
3820,2.38
3821,2.30
3822,2.14
3823,1.92
3824,1.72
3825,1.58
3826,1.53
3827,1.55
3828,1.60
3829,1.64
3830,1.62
3831,1.55
3832,1.40
3833,1.21
3834,0.99
3835,0.78
3836,0.59
3837,0.43
3838,0.28
3839,0.13
3840,-0.07
3841,-0.29
3842,-0.55
3843,-0.79
3844,-1.06
3845,-1.32
3846,-1.61
3847,-1.88
3848,-2.18
3849,-2.46
3850,-2.78
3851,-3.09
3852,-3.40
3853,-3.66
3854,-3.91
3855,-4.13
3856,-4.39
3857,-4.63
3858,-4.89
3859,-5.14
3860,-5.42
3861,-5.71
3862,-6.01
3863,-6.28
3864,-6.52
3865,-6.73
3866,-6.89
3867,-6.99
3868,-7.04
3869,-7.03
3870,-7.02
3871,-7.00
3872,-6.99
3873,-7.01
3874,-7.06
3875,-7.15
3876,-7.27
3877,-7.41
3878,-7.53
3879,-7.62
3880,-7.68
3881,-7.71
3882,-7.70
3883,-7.66
3884,-7.57
3885,-7.44
3886,-7.25
3887,-7.03
3888,-6.78
3889,-6.55
3890,-6.32
3891,-6.16
3892,-6.07
3893,-6.05
3894,-6.04
3895,-6.02
3896,-5.94
3897,-5.76
3898,-5.45
3899,-5.03
3900,-4.50
3901,-3.96
3902,-3.44
3903,-3.02
3904,-2.66
3905,-2.41
3906,-2.18
3907,-1.95
3908,-1.66
3909,-1.31
3910,-0.87
3911,-0.41
3912,0.05
3913,0.43
3914,0.68
3915,0.79
3916,0.74
3917,0.56
3918,0.27
3919,-0.07
3920,-0.46
3921,-0.84
3922,-1.22
3923,-1.56
3924,-1.89
3925,-2.17
3926,-2.46
3927,-2.73
3928,-3.05
3929,-3.40
3930,-3.82
3931,-4.27
3932,-4.78
3933,-5.28
3934,-5.79
3935,-6.23
3936,-6.62
3937,-6.92
3938,-7.19
3939,-7.43
3940,-7.69
3941,-7.94
3942,-8.21
3943,-8.47
3944,-8.74
3945,-8.98
3946,-9.17
3947,-9.27
3948,-9.29
3949,-9.21
3950,-9.05
3951,-8.84
3952,-8.61
3953,-8.38
3954,-8.18
3955,-8.03
3956,-7.94
3957,-7.92
3958,-7.92
3959,-7.92
3960,-7.84
3961,-7.71
3962,-7.53
3963,-7.31
3964,-7.03
3965,-6.72
3966,-6.38
3967,-6.04
3968,-5.68
3969,-5.33
3970,-4.97
3971,-4.62
3972,-4.30
3973,-4.06
3974,-3.88
3975,-3.79
3976,-3.77
3977,-3.81
3978,-3.87
3979,-3.96
3980,-4.01
3981,-4.03
3982,-4.00
3983,-3.96
3984,-3.90
3985,-3.85
3986,-3.77
3987,-3.69
3988,-3.59
3989,-3.49
3990,-3.35
3991,-3.18
3992,-2.95
3993,-2.69
3994,-2.37
3995,-1.99
3996,-1.51
3997,-0.99
3998,-0.45
3999,0.04
4000,0.48
4001,0.84
4002,1.16
4003,1.42
4004,1.67
4005,1.89
4006,2.16
4007,2.46
4008,2.83
4009,3.20
4010,3.57
4011,3.89
4012,4.19
4013,4.48
4014,4.82
4015,5.18
4016,5.58
4017,5.96
4018,6.35
4019,6.69
4020,6.98
4021,7.14
4022,7.22
4023,7.23
4024,7.24
4025,7.29
4026,7.41
4027,7.59
4028,7.84
4029,8.14
4030,8.45
4031,8.70
4032,8.89
4033,9.01
4034,9.07
4035,9.06
4036,9.01
4037,8.94
4038,8.87
4039,8.79
4040,8.68
4041,8.52
4042,8.32
4043,8.07
4044,7.79
4045,7.50
4046,7.20
4047,6.93
4048,6.69
4049,6.51
4050,6.36
4051,6.28
4052,6.21
4053,6.15
4054,6.05
4055,5.94
4056,5.77
4057,5.57
4058,5.30
4059,5.00
4060,4.64
4061,4.25
4062,3.82
4063,3.38
4064,2.94
4065,2.55
4066,2.21
4067,1.94
4068,1.76
4069,1.69
4070,1.70
4071,1.80
4072,1.95
4073,2.16
4074,2.41
4075,2.67
4076,2.91
4077,3.12
4078,3.29
4079,3.41
4080,3.47
4081,3.50
4082,3.53
4083,3.57
4084,3.62
4085,3.66
4086,3.72
4087,3.79
4088,3.86
4089,3.92
4090,3.99
4091,4.07
4092,4.18
4093,4.32
4094,4.50
4095,4.73
4096,4.97
4097,5.18
4098,5.35
4099,5.48
4100,5.57
4101,5.62
4102,5.62
4103,5.61
4104,5.58
4105,5.53
4106,5.47
4107,5.38
4108,5.26
4109,5.13
4110,4.98
4111,4.86
4112,4.79
4113,4.77
4114,4.81
4115,4.89
4116,5.00
4117,5.13
4118,5.28
4119,5.40
4120,5.47
4121,5.47
4122,5.40
4123,5.27
4124,5.06
4125,4.82
4126,4.53
4127,4.25
4128,3.96
4129,3.70
4130,3.46
4131,3.26
4132,3.03
4133,2.76
4134,2.40
4135,1.97
4136,1.46
4137,0.92
4138,0.38
4139,-0.09
4140,-0.50
4141,-0.82
4142,-1.07
4143,-1.24
4144,-1.38
4145,-1.49
4146,-1.63
4147,-1.75
4148,-1.90
4149,-2.03
4150,-2.16
4151,-2.28
4152,-2.36
4153,-2.40
4154,-2.36
4155,-2.22
4156,-1.98
4157,-1.65
4158,-1.26
4159,-0.89
4160,-0.56
4161,-0.34
4162,-0.22
4163,-0.21
4164,-0.29
4165,-0.45
4166,-0.62
4167,-0.75
4168,-0.76
4169,-0.65
4170,-0.41
4171,-0.09
4172,0.27
4173,0.63
4174,0.96
4175,1.20
4176,1.33
4177,1.34
4178,1.25
4179,1.09
4180,0.95
4181,0.85
4182,0.82
4183,0.87
4184,1.00
4185,1.18
4186,1.35
4187,1.46
4188,1.51
4189,1.50
4190,1.44
4191,1.32
4192,1.17
4193,1.05
4194,0.98
4195,0.97
4196,1.00
4197,1.05
4198,1.08
4199,1.09
4200,1.04
4201,0.96
4202,0.80
4203,0.58
4204,0.30
4205,0.01
4206,-0.32
4207,-0.64
4208,-0.96
4209,-1.23
4210,-1.42
4211,-1.50
4212,-1.53
4213,-1.51
4214,-1.47
4215,-1.43
4216,-1.39
4217,-1.37
4218,-1.38
4219,-1.41
4220,-1.46
4221,-1.52
4222,-1.59
4223,-1.65
4224,-1.67
4225,-1.63
4226,-1.52
4227,-1.38
4228,-1.18
4229,-0.95
4230,-0.65
4231,-0.36
4232,-0.09
4233,0.12
4234,0.28
4235,0.39
4236,0.48
4237,0.55
4238,0.65
4239,0.81
4240,1.04
4241,1.32
4242,1.66
4243,2.02
4244,2.37
4245,2.67
4246,2.90
4247,3.03
4248,3.09
4249,3.10
4250,3.09
4251,3.08
4252,3.13
4253,3.21
4254,3.33
4255,3.47
4256,3.62
4257,3.75
4258,3.85
4259,3.90
4260,3.96
4261,4.05
4262,4.16
4263,4.28
4264,4.42
4265,4.55
4266,4.66
4267,4.71
4268,4.68
4269,4.57
4270,4.40
4271,4.21
4272,4.01
4273,3.83
4274,3.67
4275,3.54
4276,3.41
4277,3.25
4278,3.05
4279,2.82
4280,2.59
4281,2.39
4282,2.26
4283,2.21
4284,2.26
4285,2.38
4286,2.55
4287,2.72
4288,2.84
4289,2.87
4290,2.81
4291,2.68
4292,2.53
4293,2.41
4294,2.36
4295,2.40
4296,2.55
4297,2.81
4298,3.15
4299,3.52
4300,3.91
4301,4.27
4302,4.58
4303,4.83
4304,5.03
4305,5.16
4306,5.24
4307,5.26
4308,5.27
4309,5.25
4310,5.21
4311,5.14
4312,5.03
4313,4.89
4314,4.74
4315,4.59
4316,4.46
4317,4.37
4318,4.32
4319,4.31
4320,4.32
4321,4.34
4322,4.33
4323,4.30
4324,4.20
4325,4.04
4326,3.79
4327,3.50
4328,3.17
4329,2.87
4330,2.61
4331,2.41
4332,2.24
4333,2.08
4334,1.89
4335,1.68
4336,1.40
4337,1.09
4338,0.74
4339,0.38
4340,0.04
4341,-0.24
4342,-0.47
4343,-0.64
4344,-0.79
4345,-0.93
4346,-1.10
4347,-1.25
4348,-1.43
4349,-1.61
4350,-1.79
4351,-1.97
4352,-2.14
4353,-2.28
4354,-2.42
4355,-2.56
4356,-2.70
4357,-2.82
4358,-2.89
4359,-2.92
4360,-2.93
4361,-2.91
4362,-2.85
4363,-2.74
4364,-2.58
4365,-2.40
4366,-2.18
4367,-1.94
4368,-1.64
4369,-1.32
4370,-0.95
4371,-0.59
4372,-0.20
4373,0.18
4374,0.59
4375,0.97
4376,1.33
4377,1.65
4378,1.97
4379,2.25
4380,2.49
4381,2.66
4382,2.82
4383,2.95
4384,3.11
4385,3.27
4386,3.46
4387,3.69
4388,3.98
4389,4.30
4390,4.63
4391,4.91
4392,5.11
4393,5.24
4394,5.29
4395,5.26
4396,5.18
4397,5.04
4398,4.90
4399,4.78
4400,4.68
4401,4.57
4402,4.46
4403,4.36
4404,4.27
4405,4.20
4406,4.12
4407,4.04
4408,3.93
4409,3.81
4410,3.60
4411,3.31
4412,2.92
4413,2.48
4414,1.97
4415,1.45
4416,0.94
4417,0.51
4418,0.14
4419,-0.15
4420,-0.39
4421,-0.58
4422,-0.74
4423,-0.87
4424,-0.98
4425,-1.06
4426,-1.10
4427,-1.10
4428,-1.07
4429,-1.00
4430,-0.90
4431,-0.77
4432,-0.62
4433,-0.45
4434,-0.26
4435,-0.03
4436,0.20
4437,0.39
4438,0.56
4439,0.67
4440,0.74
4441,0.78
4442,0.82
4443,0.86
4444,0.92
4445,0.99
4446,1.09
4447,1.20
4448,1.35
4449,1.51
4450,1.70
4451,1.89
4452,2.10
4453,2.34
4454,2.59
4455,2.83
4456,3.04
4457,3.19
4458,3.28
4459,3.31
4460,3.30
4461,3.27
4462,3.28
4463,3.32
4464,3.41
4465,3.52
4466,3.63
4467,3.71
4468,3.77
4469,3.77
4470,3.71
4471,3.60
4472,3.47
4473,3.35
4474,3.26
4475,3.20
4476,3.16
4477,3.13
4478,3.10
4479,3.06
4480,2.99
4481,2.88
4482,2.76
4483,2.64
4484,2.55
4485,2.50
4486,2.50
4487,2.56
4488,2.67
4489,2.77
4490,2.85
4491,2.88
4492,2.88
4493,2.85
4494,2.78
4495,2.71
4496,2.66
4497,2.65
4498,2.70
4499,2.76
4500,2.81
4501,2.84
4502,2.85
4503,2.81
4504,2.76
4505,2.71
4506,2.72
4507,2.79
4508,2.91
4509,3.05
4510,3.19
4511,3.31
4512,3.39
4513,3.40
4514,3.37
4515,3.31
4516,3.24
4517,3.20
4518,3.16
4519,3.13
4520,3.04
4521,2.91
4522,2.73
4523,2.52
4524,2.29
4525,2.09
4526,1.90
4527,1.74
4528,1.60
4529,1.46
4530,1.26
4531,1.03
4532,0.74
4533,0.42
4534,0.04
4535,-0.33
4536,-0.67
4537,-0.95
4538,-1.21
4539,-1.44
4540,-1.66
4541,-1.86
4542,-2.09
4543,-2.34
4544,-2.61
4545,-2.84
4546,-3.00
4547,-3.08
4548,-3.11
4549,-3.09
4550,-3.04
4551,-2.93
4552,-2.78
4553,-2.60
4554,-2.41
4555,-2.22
4556,-2.02
4557,-1.84
4558,-1.70
4559,-1.59
4560,-1.51
4561,-1.47
4562,-1.47
4563,-1.50
4564,-1.53
4565,-1.52
4566,-1.46
4567,-1.37
4568,-1.24
4569,-1.08
4570,-0.89
4571,-0.68
4572,-0.45
4573,-0.23
4574,-0.02
4575,0.17
4576,0.36
4577,0.51
4578,0.66
4579,0.80
4580,0.93
4581,1.04
4582,1.15
4583,1.25
4584,1.38
4585,1.52
4586,1.68
4587,1.82
4588,1.93
4589,1.99
4590,1.97
4591,1.88
4592,1.74
4593,1.57
4594,1.39
4595,1.23
4596,1.11
4597,1.07
4598,1.09
4599,1.16
4600,1.22
4601,1.26
4602,1.22
4603,1.12
4604,0.94
4605,0.71
4606,0.42
4607,0.13
4608,-0.19
4609,-0.46
4610,-0.72
4611,-0.93
4612,-1.17
4613,-1.42
4614,-1.74
4615,-2.08
4616,-2.47
4617,-2.86
4618,-3.28
4619,-3.65
4620,-4.02
4621,-4.35
4622,-4.70
4623,-5.02
4624,-5.33
4625,-5.61
4626,-5.89
4627,-6.13
4628,-6.36
4629,-6.54
4630,-6.69
4631,-6.80
4632,-6.90
4633,-6.97
4634,-7.02
4635,-7.05
4636,-7.06
4637,-7.08
4638,-7.11
4639,-7.16
4640,-7.20
4641,-7.22
4642,-7.19
4643,-7.10
4644,-6.93
4645,-6.69
4646,-6.34
4647,-5.96
4648,-5.54
4649,-5.16
4650,-4.79
4651,-4.47
4652,-4.17
4653,-3.91
4654,-3.65
4655,-3.41
4656,-3.14
4657,-2.90
4658,-2.65
4659,-2.43
4660,-2.20
4661,-1.98
4662,-1.77
4663,-1.58
4664,-1.39
4665,-1.21
4666,-1.06
4667,-0.97
4668,-0.95
4669,-1.01
4670,-1.14
4671,-1.34
4672,-1.58
4673,-1.82
4674,-2.03
4675,-2.18
4676,-2.28
4677,-2.35
4678,-2.41
4679,-2.44
4680,-2.51
4681,-2.60
4682,-2.78
4683,-3.00
4684,-3.25
4685,-3.48
4686,-3.73
4687,-3.96
4688,-4.19
4689,-4.39
4690,-4.60
4691,-4.82
4692,-5.08
4693,-5.33
4694,-5.56
4695,-5.73
4696,-5.82
4697,-5.81
4698,-5.72
4699,-5.55
4700,-5.35
4701,-5.17
4702,-5.03
4703,-4.92
4704,-4.84
4705,-4.80
4706,-4.80
4707,-4.81
4708,-4.82
4709,-4.81
4710,-4.78
4711,-4.71
4712,-4.63
4713,-4.54
4714,-4.47
4715,-4.44
4716,-4.43
4717,-4.47
4718,-4.55
4719,-4.67
4720,-4.78
4721,-4.85
4722,-4.85
4723,-4.79
4724,-4.66
4725,-4.47
4726,-4.22
4727,-3.97
4728,-3.73
4729,-3.55
4730,-3.37
4731,-3.20
4732,-3.00
4733,-2.79
4734,-2.56
4735,-2.37
4736,-2.19
4737,-2.04
4738,-1.89
4739,-1.75
4740,-1.60
4741,-1.48
4742,-1.31
4743,-1.11
4744,-0.86
4745,-0.61
4746,-0.35
4747,-0.12
4748,0.12
4749,0.34
4750,0.60
4751,0.86
4752,1.15
4753,1.41
4754,1.66
4755,1.86
4756,2.05
4757,2.22
4758,2.40
4759,2.58
4760,2.84
4761,3.16
4762,3.63
4763,4.18
4764,4.80
4765,5.40
4766,6.00
4767,6.51
4768,6.97
4769,7.33
4770,7.65
4771,7.90
4772,8.17
4773,8.46
4774,8.81
4775,9.16
4776,9.51
4777,9.81
4778,10.06
4779,10.24
4780,10.33
4781,10.34
4782,10.31
4783,10.26
4784,10.20
4785,10.13
4786,10.06
4787,9.99
4788,9.94
4789,9.88
4790,9.81
4791,9.72
4792,9.61
4793,9.48
4794,9.32
4795,9.16
4796,8.99
4797,8.83
4798,8.65
4799,8.48
4800,8.31
4801,8.15
4802,7.96
4803,7.73
4804,7.43
4805,7.11
4806,6.74
4807,6.34
4808,5.91
4809,5.49
4810,5.10
4811,4.78
4812,4.51
4813,4.31
4814,4.15
4815,4.04
4816,3.93
4817,3.80
4818,3.61
4819,3.36
4820,3.04
4821,2.69
4822,2.29
4823,1.89
4824,1.50
4825,1.19
4826,0.96
4827,0.83
4828,0.79
4829,0.84
4830,0.93
4831,1.05
4832,1.14
4833,1.19
4834,1.17
4835,1.09
4836,0.99
4837,0.92
4838,0.92
4839,0.99
4840,1.09
4841,1.17
4842,1.24
4843,1.23
4844,1.17
4845,1.05
4846,0.91
4847,0.81
4848,0.82
4849,0.98
4850,1.29
4851,1.70
4852,2.17
4853,2.65
4854,3.09
4855,3.46
4856,3.77
4857,4.01
4858,4.25
4859,4.48
4860,4.74
4861,5.02
4862,5.34
4863,5.63
4864,5.89
4865,6.06
4866,6.19
4867,6.25
4868,6.29
4869,6.31
4870,6.38
4871,6.49
4872,6.67
4873,6.88
4874,7.11
4875,7.32
4876,7.47
4877,7.54
4878,7.51
4879,7.39
4880,7.16
4881,6.87
4882,6.53
4883,6.22
4884,5.92
4885,5.65
4886,5.35
4887,5.05
4888,4.70
4889,4.34
4890,3.91
4891,3.47
4892,3.01
4893,2.60
4894,2.21
4895,1.91
4896,1.67
4897,1.53
4898,1.43
4899,1.35
4900,1.24
4901,1.11
4902,0.95
4903,0.76
4904,0.53
4905,0.29
4906,0.07
4907,-0.09
4908,-0.15
4909,-0.12
4910,0.00
4911,0.20
4912,0.45
4913,0.72
4914,0.99
4915,1.22
4916,1.44
4917,1.61
4918,1.76
4919,1.87
4920,1.99
4921,2.10
4922,2.23
4923,2.40
4924,2.61
4925,2.84
4926,3.09
4927,3.30
4928,3.48
4929,3.62
4930,3.73
4931,3.82
4932,3.93
4933,4.06
4934,4.21
4935,4.36
4936,4.52
4937,4.65
4938,4.72
4939,4.71
4940,4.62
4941,4.46
4942,4.26
4943,4.07
4944,3.92
4945,3.88
4946,3.92
4947,4.02
4948,4.12
4949,4.19
4950,4.17
4951,4.08
4952,3.95
4953,3.79
4954,3.63
4955,3.50
4956,3.42
4957,3.42
4958,3.47
4959,3.55
4960,3.65
4961,3.75
4962,3.84
4963,3.88
4964,3.90
4965,3.90
4966,3.89
4967,3.87
4968,3.85
4969,3.85
4970,3.90
4971,3.99
4972,4.09
4973,4.18
4974,4.27
4975,4.34
4976,4.38
4977,4.37
4978,4.30
4979,4.23
4980,4.17
4981,4.15
4982,4.17
4983,4.22
4984,4.29
4985,4.39
4986,4.46
4987,4.51
4988,4.52
4989,4.49
4990,4.42
4991,4.33
4992,4.24
4993,4.17
4994,4.10
4995,4.05
4996,3.98
4997,3.91
4998,3.81
4999,3.69
5000,3.56
5001,3.43
5002,3.28
5003,3.14
5004,2.99
5005,2.88
5006,2.76
5007,2.64
5008,2.46
5009,2.26
5010,2.01
5011,1.76
5012,1.49
5013,1.23
5014,0.98
5015,0.76
5016,0.54
5017,0.36
5018,0.18
5019,0.02
5020,-0.16
5021,-0.35
5022,-0.54
5023,-0.70
5024,-0.87
5025,-1.02
5026,-1.12
5027,-1.17
5028,-1.17
5029,-1.15
5030,-1.12
5031,-1.07
5032,-0.96
5033,-0.80
5034,-0.57
5035,-0.32
5036,-0.04
5037,0.24
5038,0.52
5039,0.76
5040,0.93
5041,1.01
5042,1.07
5043,1.10
5044,1.16
5045,1.26
5046,1.43
5047,1.67
5048,1.96
5049,2.24
5050,2.52
5051,2.76
5052,3.00
5053,3.22
5054,3.45
5055,3.70
5056,3.99
5057,4.31
5058,4.68
5059,5.04
5060,5.36
5061,5.60
5062,5.80
5063,5.94
5064,6.05
5065,6.11
5066,6.14
5067,6.13
5068,6.13
5069,6.16
5070,6.23
5071,6.33
5072,6.46
5073,6.59
5074,6.74
5075,6.89
5076,7.01
5077,7.08
5078,7.07
5079,7.03
5080,6.95
5081,6.87
5082,6.76
5083,6.66
5084,6.58
5085,6.54
5086,6.48
5087,6.41
5088,6.26
5089,6.04
5090,5.71
5091,5.30
5092,4.80
5093,4.29
5094,3.74
5095,3.22
5096,2.74
5097,2.34
5098,2.01
5099,1.74
5100,1.46
5101,1.21
5102,0.92
5103,0.63
5104,0.31
5105,0.02
5106,-0.25
5107,-0.46
5108,-0.62
5109,-0.71
5110,-0.77
5111,-0.81
5112,-0.89
5113,-1.02
5114,-1.19
5115,-1.38
5116,-1.55
5117,-1.67
5118,-1.71
5119,-1.63
5120,-1.45
5121,-1.22
5122,-1.00
5123,-0.84
5124,-0.74
5125,-0.71
5126,-0.74
5127,-0.82
5128,-0.85
5129,-0.79
5130,-0.62
5131,-0.37
5132,-0.04
5133,0.33
5134,0.75
5135,1.17
5136,1.60
5137,1.96
5138,2.30
5139,2.59
5140,2.86
5141,3.08
5142,3.28
5143,3.45
5144,3.63
5145,3.81
5146,3.99
5147,4.14
5148,4.24
5149,4.28
5150,4.28
5151,4.23
5152,4.14
5153,4.02
5154,3.90
5155,3.81
5156,3.75
5157,3.73
5158,3.70
5159,3.66
5160,3.58
5161,3.46
5162,3.31
5163,3.13
5164,2.93
5165,2.75
5166,2.60
5167,2.49
5168,2.38
5169,2.28
5170,2.18
5171,2.09
5172,2.01
5173,1.95
5174,1.91
5175,1.89
5176,1.83
5177,1.75
5178,1.62
5179,1.48
5180,1.30
5181,1.12
5182,0.96
5183,0.87
5184,0.87
5185,0.96
5186,1.12
5187,1.30
5188,1.48
5189,1.63
5190,1.73
5191,1.76
5192,1.73
5193,1.63
5194,1.51
5195,1.39
5196,1.31
5197,1.28
5198,1.28
5199,1.31
5200,1.37
5201,1.45
5202,1.51
5203,1.53
5204,1.48
5205,1.38
5206,1.21
5207,1.01
5208,0.77
5209,0.54
5210,0.36
5211,0.26
5212,0.24
5213,0.28
5214,0.36
5215,0.46
5216,0.55
5217,0.63
5218,0.66
5219,0.66
5220,0.65
5221,0.64
5222,0.66
5223,0.67
5224,0.69
5225,0.70
5226,0.72
5227,0.74
5228,0.74
5229,0.74
5230,0.76
5231,0.80
5232,0.85
5233,0.90
5234,0.94
5235,0.97
5236,0.99
5237,1.00
5238,1.02
5239,1.06
5240,1.15
5241,1.26
5242,1.40
5243,1.55
5244,1.72
5245,1.89
5246,2.07
5247,2.25
5248,2.45
5249,2.67
5250,2.91
5251,3.15
5252,3.40
5253,3.63
5254,3.84
5255,4.00
5256,4.14
5257,4.27
5258,4.41
5259,4.55
5260,4.74
5261,4.93
5262,5.11
5263,5.26
5264,5.38
5265,5.48
5266,5.58
5267,5.67
5268,5.75
5269,5.83
5270,5.90
5271,5.93
5272,5.89
5273,5.79
5274,5.62
5275,5.43
5276,5.21
5277,4.99
5278,4.78
5279,4.60
5280,4.44
5281,4.33
5282,4.24
5283,4.17
5284,4.08
5285,3.99
5286,3.86
5287,3.70
5288,3.47
5289,3.18
5290,2.82
5291,2.43
5292,2.02
5293,1.65
5294,1.34
5295,1.15
5296,1.06
5297,1.06
5298,1.08
5299,1.11
5300,1.06
5301,0.93
5302,0.70
5303,0.39
5304,0.01
5305,-0.35
5306,-0.64
5307,-0.82
5308,-0.89
5309,-0.85
5310,-0.75
5311,-0.63
5312,-0.52
5313,-0.47
5314,-0.51
5315,-0.60
5316,-0.72
5317,-0.84
5318,-0.95
5319,-1.03
5320,-1.05
5321,-1.04
5322,-1.00
5323,-0.94
5324,-0.84
5325,-0.70
5326,-0.50
5327,-0.30
5328,-0.08
5329,0.14
5330,0.40
5331,0.64
5332,0.88
5333,1.08
5334,1.31
5335,1.53
5336,1.78
5337,2.02
5338,2.33
5339,2.68
5340,3.07
5341,3.44
5342,3.82
5343,4.19
5344,4.54
5345,4.85
5346,5.14
5347,5.40
5348,5.65
5349,5.84
5350,5.98
5351,6.05
5352,6.08
5353,6.09
5354,6.11
5355,6.12
5356,6.13
5357,6.14
5358,6.19
5359,6.25
5360,6.29
5361,6.31
5362,6.31
5363,6.31
5364,6.29
5365,6.23
5366,6.14
5367,6.01
5368,5.81
5369,5.55
5370,5.22
5371,4.86
5372,4.47
5373,4.09
5374,3.70
5375,3.36
5376,3.07
5377,2.84
5378,2.62
5379,2.42
5380,2.22
5381,2.04
5382,1.87
5383,1.75
5384,1.63
5385,1.55
5386,1.47
5387,1.40
5388,1.32
5389,1.25
5390,1.18
5391,1.14
5392,1.12
5393,1.15
5394,1.24
5395,1.39
5396,1.58
5397,1.79
5398,2.02
5399,2.25
5400,2.49
5401,2.73
5402,2.98
5403,3.23
5404,3.49
5405,3.72
5406,3.94
5407,4.12
5408,4.27
5409,4.38
5410,4.48
5411,4.55
5412,4.61
5413,4.64
5414,4.64
5415,4.61
5416,4.53
5417,4.43
5418,4.32
5419,4.23
5420,4.17
5421,4.14
5422,4.13
5423,4.12
5424,4.07
5425,3.99
5426,3.85
5427,3.69
5428,3.49
5429,3.26
5430,3.04
5431,2.86
5432,2.74
5433,2.68
5434,2.66
5435,2.69
5436,2.73
5437,2.76
5438,2.73
5439,2.63
5440,2.47
5441,2.29
5442,2.09
5443,1.91
5444,1.79
5445,1.76
5446,1.80
5447,1.88
5448,1.98
5449,2.07
5450,2.14
5451,2.17
5452,2.16
5453,2.15
5454,2.14
5455,2.16
5456,2.17
5457,2.14
5458,2.07
5459,1.93
5460,1.74
5461,1.51
5462,1.28
5463,1.10
5464,0.99
5465,0.98
5466,1.06
5467,1.20
5468,1.34
5469,1.45
5470,1.51
5471,1.54
5472,1.53
5473,1.50
5474,1.42
5475,1.35
5476,1.27
5477,1.17
5478,1.02
5479,0.82
5480,0.54
5481,0.23
5482,-0.12
5483,-0.45
5484,-0.80
5485,-1.10
5486,-1.39
5487,-1.64
5488,-1.88
5489,-2.09
5490,-2.32
5491,-2.51
5492,-2.73
5493,-2.93
5494,-3.15
5495,-3.36
5496,-3.61
5497,-3.88
5498,-4.17
5499,-4.44
5500,-4.66
5501,-4.82
5502,-4.95
5503,-5.07
5504,-5.17
5505,-5.22
5506,-5.26
5507,-5.32
5508,-5.41
5509,-5.49
5510,-5.51
5511,-5.47
5512,-5.37
5513,-5.25
5514,-5.11
5515,-4.96
5516,-4.80
5517,-4.64
5518,-4.47
5519,-4.29
5520,-4.10
5521,-3.91
5522,-3.71
5523,-3.54
5524,-3.37
5525,-3.23
5526,-3.08
5527,-2.96
5528,-2.83
5529,-2.70
5530,-2.53
5531,-2.36
5532,-2.17
5533,-2.00
5534,-1.81
5535,-1.63
5536,-1.42
5537,-1.20
5538,-0.92
5539,-0.62
5540,-0.27
5541,0.08
5542,0.45
5543,0.78
5544,1.04
5545,1.22
5546,1.33
5547,1.38
5548,1.41
5549,1.43
5550,1.44
5551,1.45
5552,1.47
5553,1.48
5554,1.48
5555,1.45
5556,1.40
5557,1.35
5558,1.34
5559,1.37
5560,1.43
5561,1.51
5562,1.57
5563,1.59
5564,1.54
5565,1.41
5566,1.18
5567,0.89
5568,0.54
5569,0.20
5570,-0.14
5571,-0.45
5572,-0.74
5573,-0.98
5574,-1.24
5575,-1.51
5576,-1.84
5577,-2.21
5578,-2.63
5579,-3.04
5580,-3.45
5581,-3.79
5582,-4.06
5583,-4.25
5584,-4.38
5585,-4.46
5586,-4.53
5587,-4.57
5588,-4.61
5589,-4.65
5590,-4.69
5591,-4.71
5592,-4.70
5593,-4.69
5594,-4.66
5595,-4.62
5596,-4.55
5597,-4.46
5598,-4.34
5599,-4.21
5600,-4.07
5601,-3.92
5602,-3.76
5603,-3.60
5604,-3.44
5605,-3.30
5606,-3.13
5607,-2.95
5608,-2.71
5609,-2.44
5610,-2.08
5611,-1.67
5612,-1.19
5613,-0.70
5614,-0.20
5615,0.27
5616,0.74
5617,1.17
5618,1.61
5619,2.02
5620,2.44
5621,2.85
5622,3.27
5623,3.62
5624,3.92
5625,4.15
5626,4.35
5627,4.49
5628,4.61
5629,4.67
5630,4.72
5631,4.73
5632,4.72
5633,4.71
5634,4.70
5635,4.71
5636,4.76
5637,4.87
5638,5.02
5639,5.18
5640,5.33
5641,5.41
5642,5.40
5643,5.29
5644,5.11
5645,4.89
5646,4.71
5647,4.60
5648,4.58
5649,4.68
5650,4.86
5651,5.09
5652,5.30
5653,5.44
5654,5.48
5655,5.42
5656,5.27
5657,5.09
5658,4.92
5659,4.80
5660,4.73
5661,4.69
5662,4.64
5663,4.61
5664,4.56
5665,4.52
5666,4.45
5667,4.36
5668,4.27
5669,4.21
5670,4.17
5671,4.15
5672,4.11
5673,4.06
5674,3.97
5675,3.85
5676,3.69
5677,3.49
5678,3.23
5679,2.98
5680,2.74
5681,2.53
5682,2.34
5683,2.18
5684,2.05
5685,1.97
5686,1.90
5687,1.85
5688,1.77
5689,1.68
5690,1.59
5691,1.52
5692,1.46
5693,1.42
5694,1.38
5695,1.34
5696,1.26
5697,1.16
5698,1.03
5699,0.89
5700,0.70
5701,0.51
5702,0.34
5703,0.20
5704,0.09
5705,-0.01
5706,-0.11
5707,-0.21
5708,-0.34
5709,-0.50
5710,-0.70
5711,-0.94
5712,-1.24
5713,-1.56
5714,-1.89
5715,-2.19
5716,-2.46
5717,-2.66
5718,-2.80
5719,-2.86
5720,-2.86
5721,-2.79
5722,-2.69
5723,-2.55
5724,-2.41
5725,-2.28
5726,-2.13
5727,-1.98
5728,-1.84
5729,-1.72
5730,-1.61
5731,-1.50
5732,-1.35
5733,-1.18
5734,-0.97
5735,-0.73
5736,-0.45
5737,-0.16
5738,0.07
5739,0.24
5740,0.36
5741,0.44
5742,0.49
5743,0.52
5744,0.58
5745,0.68
5746,0.81
5747,0.92
5748,0.98
5749,0.96
5750,0.86
5751,0.67
5752,0.38
5753,0.06
5754,-0.30
5755,-0.64
5756,-0.97
5757,-1.25
5758,-1.48
5759,-1.65
5760,-1.80
5761,-1.91
5762,-2.03
5763,-2.14
5764,-2.28
5765,-2.45
5766,-2.68
5767,-2.93
5768,-3.20
5769,-3.49
5770,-3.78
5771,-4.05
5772,-4.28
5773,-4.45
5774,-4.61
5775,-4.75
5776,-4.89
5777,-5.04
5778,-5.23
5779,-5.45
5780,-5.69
5781,-5.91
5782,-6.13
5783,-6.30
5784,-6.41
5785,-6.44
5786,-6.42
5787,-6.35
5788,-6.27
5789,-6.16
5790,-6.07
5791,-6.01
5792,-5.97
5793,-5.92
5794,-5.87
5795,-5.81
5796,-5.76
5797,-5.71
5798,-5.65
5799,-5.58
5800,-5.50
5801,-5.43
5802,-5.36
5803,-5.31
5804,-5.23
5805,-5.15
5806,-5.04
5807,-4.93
5808,-4.79
5809,-4.64
5810,-4.47
5811,-4.30
5812,-4.09
5813,-3.86
5814,-3.58
5815,-3.27
5816,-2.92
5817,-2.60
5818,-2.31
5819,-2.08
5820,-1.85
5821,-1.63
5822,-1.42
5823,-1.23
5824,-1.02
5825,-0.82
5826,-0.63
5827,-0.50
5828,-0.40
5829,-0.35
5830,-0.32
5831,-0.32
5832,-0.26
5833,-0.15
5834,0.04
5835,0.27
5836,0.51
5837,0.73
5838,0.92
5839,1.06
5840,1.12
5841,1.13
5842,1.07
5843,0.99
5844,0.85
5845,0.66
5846,0.40
5847,0.11
5848,-0.23
5849,-0.60
5850,-1.03
5851,-1.45
5852,-1.86
5853,-2.20
5854,-2.51
5855,-2.79
5856,-3.04
5857,-3.24
5858,-3.44
5859,-3.62
5860,-3.81
5861,-3.98
5862,-4.12
5863,-4.24
5864,-4.35
5865,-4.45
5866,-4.55
5867,-4.66
5868,-4.75
5869,-4.83
5870,-4.87
5871,-4.86
5872,-4.78
5873,-4.65
5874,-4.46
5875,-4.24
5876,-3.99
5877,-3.75
5878,-3.54
5879,-3.36
5880,-3.19
5881,-3.04
5882,-2.88
5883,-2.74
5884,-2.55
5885,-2.31
5886,-1.98
5887,-1.58
5888,-1.06
5889,-0.45
5890,0.28
5891,1.03
5892,1.81
5893,2.49
5894,3.07
5895,3.44
5896,3.65
5897,3.70
5898,3.68
5899,3.62
5900,3.59
5901,3.59
5902,3.69
5903,3.87
5904,4.11
5905,4.35
5906,4.55
5907,4.70
5908,4.80
5909,4.86
5910,4.88
5911,4.88
5912,4.89
5913,4.93
5914,5.01
5915,5.13
5916,5.29
5917,5.45
5918,5.60
5919,5.70
5920,5.77
5921,5.81
5922,5.84
5923,5.87
5924,5.92
5925,5.99
5926,6.09
5927,6.20
5928,6.30
5929,6.38
5930,6.47
5931,6.54
5932,6.60
5933,6.63
5934,6.64
5935,6.62
5936,6.58
5937,6.51
5938,6.40
5939,6.27
5940,6.17
5941,6.11
5942,6.10
5943,6.15
5944,6.23
5945,6.31
5946,6.35
5947,6.34
5948,6.25
5949,6.08
5950,5.87
5951,5.68
5952,5.52
5953,5.44
5954,5.40
5955,5.40
5956,5.36
5957,5.26
5958,5.08
5959,4.82
5960,4.50
5961,4.17
5962,3.81
5963,3.50
5964,3.23
5965,3.03
5966,2.85
5967,2.70
5968,2.54
5969,2.38
5970,2.19
5971,1.97
5972,1.71
5973,1.42
5974,1.06
5975,0.68
5976,0.27
5977,-0.11
5978,-0.48
5979,-0.80
5980,-1.10
5981,-1.37
5982,-1.61
5983,-1.83
5984,-2.06
5985,-2.28
5986,-2.49
5987,-2.66
5988,-2.76
5989,-2.78
5990,-2.70
5991,-2.55
5992,-2.33
5993,-2.10
5994,-1.86
5995,-1.64
5996,-1.41
5997,-1.17
5998,-0.85
5999,-0.48
6000,0.01
6001,0.52
6002,1.07
6003,1.58
6004,2.09
6005,2.54
6006,2.99
6007,3.41
6008,3.90
6009,4.43
6010,5.04
6011,5.66
6012,6.28
6013,6.81
6014,7.28
6015,7.66
6016,7.97
6017,8.18
6018,8.36
6019,8.52
6020,8.75
6021,9.03
6022,9.37
6023,9.70
6024,10.05
6025,10.35
6026,10.64
6027,10.85
6028,11.03
6029,11.17
6030,11.33
6031,11.52
6032,11.76
6033,12.01
6034,12.27
6035,12.48
6036,12.63
6037,12.70
6038,12.70
6039,12.63
6040,12.49
6041,12.31
6042,12.08
6043,11.85
6044,11.61
6045,11.38
6046,11.11
6047,10.84
6048,10.53
6049,10.19
6050,9.77
6051,9.31
6052,8.76
6053,8.18
6054,7.52
6055,6.86
6056,6.18
6057,5.56
6058,4.97
6059,4.50
6060,4.08
6061,3.77
6062,3.47
6063,3.21
6064,2.91
6065,2.62
6066,2.30
6067,1.98
6068,1.63
6069,1.30
6070,0.96
6071,0.66
6072,0.35
6073,0.07
6074,-0.19
6075,-0.41
6076,-0.61
6077,-0.76
6078,-0.90
6079,-1.02
6080,-1.14
6081,-1.21
6082,-1.22
6083,-1.18
6084,-1.09
6085,-0.96
6086,-0.77
6087,-0.56
6088,-0.36
6089,-0.20
6090,-0.06
6091,0.07
6092,0.23
6093,0.43
6094,0.72
6095,1.08
6096,1.54
6097,2.02
6098,2.48
6099,2.87
6100,3.18
6101,3.40
6102,3.54
6103,3.61
6104,3.65
6105,3.67
6106,3.71
6107,3.76
6108,3.80
6109,3.83
6110,3.84
6111,3.83
6112,3.79
6113,3.71
6114,3.60
6115,3.45
6116,3.27
6117,3.08
6118,2.86
6119,2.63
6120,2.36
6121,2.08
6122,1.79
6123,1.56
6124,1.37
6125,1.24
6126,1.14
6127,1.09
6128,1.06
6129,1.07
6130,1.05
6131,0.98
6132,0.84
6133,0.64
6134,0.41
6135,0.17
6136,-0.05
6137,-0.24
6138,-0.35
6139,-0.38
6140,-0.34
6141,-0.24
6142,-0.13
6143,-0.02
6144,0.07
6145,0.14
6146,0.20
6147,0.29
6148,0.43
6149,0.64
6150,0.91
6151,1.22
6152,1.58
6153,1.93
6154,2.27
6155,2.54
6156,2.74
6157,2.87
6158,2.94
6159,2.97
6160,2.98
6161,3.01
6162,3.07
6163,3.16
6164,3.27
6165,3.40
6166,3.49
6167,3.54
6168,3.52
6169,3.43
6170,3.27
6171,3.08
6172,2.86
6173,2.66
6174,2.52
6175,2.46
6176,2.48
6177,2.58
6178,2.72
6179,2.91
6180,3.09
6181,3.25
6182,3.33
6183,3.30
6184,3.15
6185,2.87
6186,2.51
6187,2.12
6188,1.75
6189,1.46
6190,1.28
6191,1.22
6192,1.30
6193,1.50
6194,1.76
6195,2.02
6196,2.23
6197,2.38
6198,2.47
6199,2.52
6200,2.59
6201,2.68
6202,2.86
6203,3.12
6204,3.49
6205,3.90
6206,4.35
6207,4.76
6208,5.17
6209,5.53
6210,5.88
6211,6.18
6212,6.49
6213,6.82
6214,7.23
6215,7.67
6216,8.15
6217,8.58
6218,8.96
6219,9.25
6220,9.47
6221,9.59
6222,9.68
6223,9.75
6224,9.84
6225,9.95
6226,10.11
6227,10.28
6228,10.42
6229,10.49
6230,10.43
6231,10.25
6232,9.97
6233,9.63
6234,9.23
6235,8.85
6236,8.49
6237,8.22
6238,7.97
6239,7.74
6240,7.48
6241,7.19
6242,6.83
6243,6.45
6244,6.03
6245,5.60
6246,5.16
6247,4.74
6248,4.35
6249,4.05
6250,3.81
6251,3.63
6252,3.48
6253,3.38
6254,3.29
6255,3.23
6256,3.17
6257,3.10
6258,3.02
6259,2.95
6260,2.86
6261,2.80
6262,2.75
6263,2.73
6264,2.73
6265,2.67
6266,2.54
6267,2.31
6268,2.02
6269,1.68
6270,1.34
6271,1.07
6272,0.92
6273,0.94
6274,1.10
6275,1.36
6276,1.67
6277,1.94
6278,2.12
6279,2.18
6280,2.13
6281,2.00
6282,1.87
6283,1.78
6284,1.80
6285,1.93
6286,2.19
6287,2.50
6288,2.84
6289,3.13
6290,3.41
6291,3.66
6292,3.96
6293,4.29
6294,4.71
6295,5.20
6296,5.75
6297,6.30
6298,6.84
6299,7.27
6300,7.62
6301,7.85
6302,8.03
6303,8.19
6304,8.42
6305,8.71
6306,9.10
6307,9.52
6308,9.99
6309,10.44
6310,10.85
6311,11.17
6312,11.43
6313,11.60
6314,11.71
6315,11.75
6316,11.75
6317,11.72
6318,11.74
6319,11.78
6320,11.84
6321,11.92
6322,12.01
6323,12.11
6324,12.16
6325,12.19
6326,12.16
6327,12.12
6328,11.97
6329,11.73
6330,11.35
6331,10.89
6332,10.28
6333,9.57
6334,8.75
6335,7.91
6336,7.03
6337,6.22
6338,5.45
6339,4.78
6340,4.13
6341,3.54
6342,2.93
6343,2.38
6344,1.83
6345,1.35
6346,0.90
6347,0.53
6348,0.24
6349,0.07
6350,-0.02
6351,-0.02
6352,0.01
6353,0.09
6354,0.19
6355,0.33
6356,0.51
6357,0.74
6358,1.04
6359,1.42
6360,1.86
6361,2.33
6362,2.76
6363,3.11
6364,3.35
6365,3.48
6366,3.52
6367,3.44
6368,3.32
6369,3.19
6370,3.13
6371,3.14
6372,3.23
6373,3.38
6374,3.59
6375,3.83
6376,4.07
6377,4.28
6378,4.46
6379,4.63
6380,4.76
6381,4.87
6382,4.94
6383,4.97
6384,4.94
6385,4.84
6386,4.66
6387,4.42
6388,4.14
6389,3.86
6390,3.64
6391,3.50
6392,3.47
6393,3.53
6394,3.67
6395,3.87
6396,4.08
6397,4.26
6398,4.40
6399,4.47
6400,4.49
6401,4.48
6402,4.51
6403,4.62
6404,4.86
6405,5.18
6406,5.60
6407,6.03
6408,6.45
6409,6.78
6410,6.98
6411,7.00
6412,6.88
6413,6.65
6414,6.37
6415,6.09
6416,5.88
6417,5.76
6418,5.73
6419,5.80
6420,5.93
6421,6.09
6422,6.26
6423,6.41
6424,6.55
6425,6.68
6426,6.81
6427,6.95
6428,7.11
6429,7.29
6430,7.45
6431,7.56
6432,7.60
6433,7.55
6434,7.42
6435,7.22
6436,6.94
6437,6.64
6438,6.35
6439,6.12
6440,5.91
6441,5.74
6442,5.56
6443,5.38
6444,5.12
6445,4.79
6446,4.35
6447,3.87
6448,3.34
6449,2.86
6450,2.38
6451,1.94
6452,1.51
6453,1.12
6454,0.70
6455,0.28
6456,-0.18
6457,-0.62
6458,-1.05
6459,-1.40
6460,-1.69
6461,-1.89
6462,-2.05
6463,-2.16
6464,-2.24
6465,-2.30
6466,-2.37
6467,-2.42
6468,-2.45
6469,-2.44
6470,-2.40
6471,-2.33
6472,-2.25
6473,-2.15
6474,-2.04
6475,-1.95
6476,-1.87
6477,-1.81
6478,-1.71
6479,-1.58
6480,-1.40
6481,-1.20
6482,-0.96
6483,-0.70
6484,-0.44
6485,-0.20
6486,0.01
6487,0.18
6488,0.36
6489,0.55
6490,0.75
6491,0.96
6492,1.18
6493,1.38
6494,1.58
6495,1.77
6496,1.98
6497,2.20
6498,2.44
6499,2.67
6500,2.92
6501,3.18
6502,3.43
6503,3.65
6504,3.84
6505,3.97
6506,4.06
6507,4.09
6508,4.05
6509,3.95
6510,3.79
6511,3.59
6512,3.37
6513,3.13
6514,2.89
6515,2.68
6516,2.50
6517,2.36
6518,2.21
6519,2.06
6520,1.86
6521,1.62
6522,1.34
6523,1.07
6524,0.78
6525,0.53
6526,0.30
6527,0.12
6528,-0.05
6529,-0.17
6530,-0.32
6531,-0.47
6532,-0.67
6533,-0.88
6534,-1.16
6535,-1.46
6536,-1.81
6537,-2.15
6538,-2.50
6539,-2.83
6540,-3.17
6541,-3.48
6542,-3.78
6543,-4.04
6544,-4.30
6545,-4.53
6546,-4.75
6547,-4.94
6548,-5.12
6549,-5.28
6550,-5.43
6551,-5.54
6552,-5.59
6553,-5.57
6554,-5.50
6555,-5.42
6556,-5.37
6557,-5.36
6558,-5.36
6559,-5.38
6560,-5.40
6561,-5.42
6562,-5.40
6563,-5.30
6564,-5.10
6565,-4.85
6566,-4.56
6567,-4.28
6568,-4.01
6569,-3.79
6570,-3.60
6571,-3.45
6572,-3.29
6573,-3.12
6574,-2.89
6575,-2.66
6576,-2.41
6577,-2.21
6578,-2.03
6579,-1.90
6580,-1.81
6581,-1.74
6582,-1.64
6583,-1.52
6584,-1.33
6585,-1.11
6586,-0.85
6587,-0.63
6588,-0.48
6589,-0.42
6590,-0.42
6591,-0.48
6592,-0.54
6593,-0.56
6594,-0.48
6595,-0.28
6596,0.05
6597,0.43
6598,0.82
6599,1.14
6600,1.38
6601,1.49
6602,1.53
6603,1.48
6604,1.41
6605,1.35
6606,1.35
6607,1.40
6608,1.48
6609,1.54
6610,1.61
6611,1.66
6612,1.71
6613,1.75
6614,1.84
6615,1.99
6616,2.23
6617,2.51
6618,2.84
6619,3.16
6620,3.48
6621,3.74
6622,3.99
6623,4.21
6624,4.47
6625,4.75
6626,5.07
6627,5.39
6628,5.73
6629,6.02
6630,6.29
6631,6.50
6632,6.70
6633,6.88
6634,7.11
6635,7.38
6636,7.69
6637,8.00
6638,8.29
6639,8.51
6640,8.66
6641,8.70
6642,8.66
6643,8.53
6644,8.36
6645,8.16
6646,7.98
6647,7.84
6648,7.75
6649,7.72
6650,7.76
6651,7.86
6652,7.97
6653,8.06
6654,8.10
6655,8.09
6656,8.03
6657,7.92
6658,7.77
6659,7.59
6660,7.41
6661,7.26
6662,7.13
6663,7.03
6664,6.95
6665,6.88
6666,6.80
6667,6.69
6668,6.56
6669,6.45
6670,6.34
6671,6.25
6672,6.16
6673,6.08
6674,5.99
6675,5.92
6676,5.85
6677,5.79
6678,5.75
6679,5.76
6680,5.85
6681,6.02
6682,6.23
6683,6.49
6684,6.78
6685,7.07
6686,7.36
6687,7.61
6688,7.85
6689,8.05
6690,8.23
6691,8.38
6692,8.52
6693,8.68
6694,8.88
6695,9.10
6696,9.34
6697,9.58
6698,9.83
6699,10.07
6700,10.27
6701,10.39
6702,10.43
6703,10.38
6704,10.25
6705,10.06
6706,9.81
6707,9.58
6708,9.36
6709,9.17
6710,8.97
6711,8.79
6712,8.59
6713,8.38
6714,8.08
6715,7.71
6716,7.28
6717,6.89
6718,6.57
6719,6.34
6720,6.15
6721,6.03
6722,5.93
6723,5.87
6724,5.77
6725,5.62
6726,5.37
6727,5.10
6728,4.77
6729,4.42
6730,4.01
6731,3.59
6732,3.14
6733,2.72
6734,2.33
6735,2.01
6736,1.74
6737,1.57
6738,1.47
6739,1.44
6740,1.39
6741,1.33
6742,1.21
6743,1.05
6744,0.82
6745,0.59
6746,0.39
6747,0.27
6748,0.20
6749,0.18
6750,0.18
6751,0.23
6752,0.30
6753,0.36
6754,0.39
6755,0.38
6756,0.38
6757,0.39
6758,0.43
6759,0.47
6760,0.53
6761,0.58
6762,0.66
6763,0.75
6764,0.92
6765,1.12
6766,1.36
6767,1.60
6768,1.84
6769,2.05
6770,2.26
6771,2.43
6772,2.63
6773,2.84
6774,3.11
6775,3.43
6776,3.84
6777,4.28
6778,4.75
6779,5.19
6780,5.63
6781,6.01
6782,6.34
6783,6.57
6784,6.74
6785,6.85
6786,6.95
6787,7.04
6788,7.20
6789,7.42
6790,7.71
6791,8.04
6792,8.37
6793,8.65
6794,8.83
6795,8.87
6796,8.77
6797,8.54
6798,8.23
6799,7.93
6800,7.70
6801,7.57
6802,7.50
6803,7.50
6804,7.50
6805,7.50
6806,7.41
6807,7.23
6808,6.90
6809,6.51
6810,6.04
6811,5.58
6812,5.12
6813,4.70
6814,4.29
6815,3.93
6816,3.55
6817,3.20
6818,2.87
6819,2.61
6820,2.37
6821,2.19
6822,2.04
6823,1.95
6824,1.89
6825,1.87
6826,1.88
6827,1.94
6828,2.04
6829,2.18
6830,2.33
6831,2.50
6832,2.67
6833,2.85
6834,3.03
6835,3.16
6836,3.23
6837,3.23
6838,3.18
6839,3.10
6840,3.02
6841,2.95
6842,2.95
6843,3.03
6844,3.23
6845,3.51
6846,3.87
6847,4.23
6848,4.55
6849,4.79
6850,4.94
6851,5.01
6852,5.04
6853,5.06
6854,5.12
6855,5.22
6856,5.38
6857,5.56
6858,5.73
6859,5.84
6860,5.86
6861,5.76
6862,5.57
6863,5.31
6864,5.04
6865,4.80
6866,4.61
6867,4.49
6868,4.44
6869,4.45
6870,4.47
6871,4.47
6872,4.44
6873,4.38
6874,4.30
6875,4.24
6876,4.20
6877,4.17
6878,4.16
6879,4.16
6880,4.15
6881,4.13
6882,4.07
6883,3.99
6884,3.92
6885,3.87
6886,3.87
6887,3.95
6888,4.09
6889,4.27
6890,4.47
6891,4.65
6892,4.80
6893,4.90
6894,4.96
6895,4.96
6896,4.91
6897,4.83
6898,4.74
6899,4.65
6900,4.56
6901,4.47
6902,4.39
6903,4.35
6904,4.34
6905,4.37
6906,4.43
6907,4.50
6908,4.61
6909,4.74
6910,4.88
6911,4.97
6912,5.01
6913,4.97
6914,4.89
6915,4.77
6916,4.64
6917,4.53
6918,4.45
6919,4.39
6920,4.37
6921,4.37
6922,4.36
6923,4.32
6924,4.23
6925,4.10
6926,3.92
6927,3.71
6928,3.47
6929,3.24
6930,3.00
6931,2.79
6932,2.55
6933,2.30
6934,2.02
6935,1.75
6936,1.46
6937,1.20
6938,0.93
6939,0.70
6940,0.49
6941,0.33
6942,0.19
6943,0.05
6944,-0.13
6945,-0.32
6946,-0.52
6947,-0.69
6948,-0.81
6949,-0.88
6950,-0.90
6951,-0.85
6952,-0.70
6953,-0.46
6954,-0.14
6955,0.22
6956,0.60
6957,0.97
6958,1.33
6959,1.62
6960,1.85
6961,1.98
6962,2.04
6963,2.06
6964,2.11
6965,2.19
6966,2.34
6967,2.54
6968,2.81
6969,3.10
6970,3.44
6971,3.75
6972,4.02
6973,4.22
6974,4.40
6975,4.57
6976,4.77
6977,4.97
6978,5.21
6979,5.46
6980,5.72
6981,5.96
6982,6.17
6983,6.34
6984,6.50
6985,6.65
6986,6.79
6987,6.92
6988,7.05
6989,7.15
6990,7.23
6991,7.26
6992,7.24
6993,7.18
6994,7.10
6995,7.06
6996,7.06
6997,7.14
6998,7.26
6999,7.40
7000,7.53
7001,7.61
7002,7.60
7003,7.50
7004,7.30
7005,7.07
7006,6.80
7007,6.54
7008,6.26
7009,5.99
7010,5.67
7011,5.33
7012,4.89
7013,4.40
7014,3.87
7015,3.37
7016,2.88
7017,2.46
7018,2.07
7019,1.74
7020,1.41
7021,1.09
7022,0.74
7023,0.39
7024,0.02
7025,-0.30
7026,-0.59
7027,-0.78
7028,-0.89
7029,-0.91
7030,-0.88
7031,-0.81
7032,-0.74
7033,-0.68
7034,-0.65
7035,-0.67
7036,-0.72
7037,-0.78
7038,-0.83
7039,-0.85
7040,-0.83
7041,-0.75
7042,-0.60
7043,-0.40
7044,-0.15
7045,0.11
7046,0.43
7047,0.76
7048,1.12
7049,1.46
7050,1.82
7051,2.18
7052,2.57
7053,2.92
7054,3.25
7055,3.49
7056,3.68
7057,3.81
7058,3.92
7059,4.00
7060,4.09
7061,4.19
7062,4.33
7063,4.50
7064,4.72
7065,4.93
7066,5.11
7067,5.23
7068,5.28
7069,5.25
7070,5.16
7071,5.04
7072,4.90
7073,4.76
7074,4.64
7075,4.54
7076,4.44
7077,4.34
7078,4.22
7079,4.08
7080,3.94
7081,3.83
7082,3.73
7083,3.67
7084,3.65
7085,3.65
7086,3.65
7087,3.63
7088,3.54
7089,3.38
7090,3.14
7091,2.85
7092,2.56
7093,2.32
7094,2.14
7095,2.06
7096,2.07
7097,2.17
7098,2.35
7099,2.55
7100,2.72
7101,2.86
7102,2.95
7103,2.98
7104,2.95
7105,2.90
7106,2.87
7107,2.89
7108,2.94
7109,2.98
7110,3.02
7111,3.02
7112,2.98
7113,2.88
7114,2.75
7115,2.63
7116,2.56
7117,2.57
7118,2.66
7119,2.82
7120,3.02
7121,3.25
7122,3.45
7123,3.57
7124,3.60
7125,3.54
7126,3.39
7127,3.20
7128,2.99
7129,2.83
7130,2.72
7131,2.67
7132,2.69
7133,2.79
7134,2.93
7135,3.08
7136,3.21
7137,3.29
7138,3.30
7139,3.24
7140,3.11
7141,2.94
7142,2.76
7143,2.60
7144,2.46
7145,2.34
7146,2.25
7147,2.17
7148,2.10
7149,2.01
7150,1.89
7151,1.76
7152,1.62
7153,1.48
7154,1.35
7155,1.25
7156,1.18
7157,1.16
7158,1.15
7159,1.15
7160,1.17
7161,1.21
7162,1.29
7163,1.42
7164,1.62
7165,1.87
7166,2.17
7167,2.47
7168,2.76
7169,3.02
7170,3.21
7171,3.31
7172,3.34
7173,3.31
7174,3.30
7175,3.31
7176,3.35
7177,3.41
7178,3.49
7179,3.59
7180,3.67
7181,3.73
7182,3.77
7183,3.80
7184,3.82
7185,3.84
7186,3.83
7187,3.77
7188,3.66
7189,3.50
7190,3.27
7191,3.00
7192,2.70
7193,2.07
7194,1.94
7195,2.43
7196,2.74
7197,1.19
7198,-0.53
7199,2.03
7200,6.30
