1,557.28
2,791.93
3,782.53
4,658.08
5,569.82
6,524.93
7,444.76
8,315.28
9,175.35
10,60.55
11,-21.24
12,-54.14
13,-25.27
14,66.59
15,205.41
16,360.87
17,507.87
18,617.83
19,681.18
20,691.93
21,660.61
22,596.31
23,511.57
24,413.42
25,305.94
26,193.15
27,79.71
28,-25.36
29,-110.66
30,-166.44
31,-184.05
32,-166.11
33,-117.74
34,-56.15
35,5.68
36,51.88
37,78.25
38,83.16
39,74.55
40,60.24
41,48.98
42,45.87
43,50.78
44,61.83
45,73.15
46,82.34
47,86.24
48,86.21
49,83.44
50,80.47
51,78.64
52,78.74
53,80.51
54,83.50
55,86.58
56,89.20
57,90.82
58,91.92
59,92.74
60,93.69
61,94.67
62,95.83
63,96.95
64,98.08
65,99.00
66,100.01
67,100.89
68,101.75
69,102.45
70,103.21
71,104.13
72,105.29
73,106.48
74,107.76
75,108.89
76,109.95
77,110.90
78,111.88
79,112.79
80,113.71
81,114.38
82,115.05
83,115.69
84,116.52
85,117.49
86,118.68
87,119.81
88,120.97
89,122.13
90,123.63
91,125.24
92,126.89
93,128.33
94,129.73
95,130.86
96,131.68
97,132.14
98,132.63
99,133.30
100,134.22
101,135.16
102,136.23
103,137.36
104,138.73
105,140.17
106,141.63
107,142.82
108,143.65
109,144.07
110,144.41
111,144.87
112,145.54
113,146.24
114,146.94
115,147.64
116,148.56
117,149.48
118,150.30
119,150.76
120,151.03
121,151.25
122,151.52
123,151.73
124,151.92
125,152.13
126,152.62
127,153.32
128,154.17
129,154.88
130,155.46
131,155.91
132,156.34
133,156.56
134,156.56
135,156.28
136,156.01
137,155.70
138,155.55
139,155.55
140,155.79
141,156.25
142,156.89
143,157.59
144,158.45
145,159.36
146,160.49
147,161.65
148,162.99
149,164.37
150,165.95
151,167.60
152,169.46
153,171.30
154,173.31
155,175.17
156,177.06
157,178.68
158,180.21
159,181.61
160,183.11
161,184.51
162,185.85
163,187.04
164,188.17
165,189.09
166,189.73
167,189.97
168,189.94
169,189.70
170,189.21
171,188.48
172,187.62
173,186.92
174,186.37
175,185.91
176,185.30
177,184.63
178,183.87
179,183.20
180,182.34
181,181.43
182,180.39
183,179.47
184,178.53
185,177.58
186,176.51
187,175.63
188,174.84
189,174.13
190,173.25
191,172.33
192,171.48
193,171.05
194,170.78
195,170.59
196,170.20
197,169.77
198,169.19
199,168.46
200,167.51
201,166.60
202,165.77
203,165.07
204,164.22
205,163.30
206,162.38
207,161.65
208,161.07
209,160.58
210,160.28
211,160.28
212,160.58
213,161.07
214,161.62
215,162.11
216,162.51
217,162.72
218,162.75
219,162.72
220,162.90
221,163.36
222,164.15
223,165.10
224,166.26
225,167.66
226,169.43
227,171.33
228,173.19
229,174.62
230,175.66
231,176.30
232,176.91
233,177.58
234,178.62
235,179.78
236,181.06
237,182.22
238,183.44
239,184.63
240,185.70
241,186.37
242,186.74
243,186.92
244,187.38
245,188.08
246,188.93
247,189.64
248,190.28
249,190.70
250,191.01
251,191.01
252,190.73
253,190.22
254,189.70
255,189.45
256,189.61
257,190.09
258,190.73
259,191.44
260,192.29
261,193.27
262,194.15
263,194.64
264,194.64
265,194.40
266,194.12
267,193.88
268,193.51
269,193.02
270,192.69
271,192.66
272,192.93
273,193.21
274,193.30
275,193.30
276,193.30
277,193.30
278,193.18
279,192.93
280,192.69
281,192.44
282,192.17
283,191.93
284,191.86
285,192.11
286,192.57
287,193.02
288,193.48
289,193.97
290,194.52
291,194.98
292,195.22
293,195.25
294,195.19
295,195.16
296,195.13
297,195.16
298,195.31
299,195.56
300,195.65
301,195.43
302,194.92
303,194.15
304,193.24
305,192.32
306,191.47
307,190.73
308,190.06
309,189.61
310,189.48
311,189.76
312,190.09
313,190.37
314,190.43
315,190.46
316,190.40
317,190.12
318,189.64
319,189.21
320,188.93
321,188.69
322,188.11
323,187.19
324,186.16
325,185.18
326,184.08
327,182.92
328,181.82
329,181.09
330,180.69
331,180.51
332,180.33
333,180.11
334,179.75
335,179.29
336,178.62
337,177.92
338,177.25
339,176.79
340,176.42
341,176.21
342,176.09
343,176.12
344,176.15
345,176.18
346,176.03
347,175.84
348,175.54
349,175.02
350,174.19
351,173.31
352,172.49
353,171.72
354,170.81
355,169.95
356,169.25
357,168.76
358,168.06
359,167.18
360,166.20
361,165.44
362,164.79
363,164.12
364,163.45
365,162.96
366,162.63
367,162.45
368,162.17
369,161.96
370,161.80
371,161.80
372,161.83
373,161.87
374,161.83
375,161.83
376,161.87
377,161.90
378,161.74
379,161.25
380,160.43
381,159.48
382,158.54
383,157.56
384,156.52
385,155.58
386,154.97
387,154.72
388,154.60
389,154.39
390,154.05
391,153.84
392,153.66
393,153.44
394,153.02
395,152.56
396,152.13
397,151.89
398,151.76
399,151.82
400,151.89
401,151.86
402,151.67
403,151.49
404,151.37
405,151.37
406,151.25
407,151.06
408,150.79
409,150.51
410,150.21
411,149.99
412,150.02
413,150.27
414,150.48
415,150.48
416,150.39
417,150.39
418,150.48
419,150.48
420,150.27
421,150.02
422,149.96
423,150.18
424,150.60
425,151.09
426,151.73
427,152.40
428,153.11
429,153.84
430,154.66
431,155.33
432,155.79
433,156.04
434,156.34
435,156.77
436,157.29
437,157.78
438,158.39
439,159.06
440,159.76
441,160.46
442,161.44
443,162.60
444,163.88
445,165.07
446,166.26
447,167.39
448,168.64
449,169.80
450,171.05
451,172.18
452,173.37
453,174.56
454,175.84
455,176.97
456,178.04
457,178.96
458,180.05
459,181.21
460,182.34
461,183.32
462,184.30
463,185.15
464,186.04
465,186.74
466,187.50
467,188.17
468,188.78
469,189.24
470,189.79
471,190.43
472,191.35
473,192.29
474,193.33
475,194.24
476,195.07
477,195.77
478,196.50
479,197.20
480,197.81
481,198.27
482,198.79
483,199.49
484,200.41
485,201.39
486,202.33
487,203.28
488,204.32
489,205.26
490,205.93
491,206.18
492,206.09
493,205.84
494,205.41
495,204.71
496,203.70
497,202.48
498,201.23
499,200.07
500,198.91
501,197.69
502,196.47
503,195.53
504,194.98
505,194.76
506,194.55
507,194.37
508,194.21
509,194.27
510,194.03
511,193.39
512,192.14
513,190.70
514,189.21
515,187.81
516,186.37
517,184.97
518,183.47
519,182.07
520,180.69
521,179.57
522,178.47
523,177.55
524,176.57
525,175.66
526,174.71
527,173.80
528,172.73
529,171.60
530,170.20
531,168.79
532,167.30
533,165.89
534,164.43
535,163.06
536,161.62
537,160.19
538,158.66
539,157.29
540,155.98
541,154.79
542,153.50
543,152.37
544,151.43
545,150.76
546,149.96
547,149.05
548,148.01
549,147.06
550,146.12
551,145.17
552,144.20
553,143.52
554,143.16
555,142.94
556,142.46
557,141.78
558,141.05
559,140.32
560,139.31
561,138.18
562,137.12
563,136.38
564,135.80
565,135.38
566,135.07
567,135.07
568,135.19
569,135.25
570,135.04
571,134.55
572,133.82
573,133.12
574,132.51
575,132.05
576,131.59
577,131.16
578,130.65
579,130.19
580,129.70
581,129.24
582,128.75
583,128.27
584,127.78
585,127.32
586,126.80
587,126.34
588,125.98
589,125.76
590,125.52
591,125.34
592,125.09
593,124.88
594,124.45
595,123.75
596,122.74
597,121.55
598,120.18
599,118.77
600,117.28
601,115.88
602,114.50
603,113.34
604,112.24
605,111.33
606,110.50
607,109.80
608,109.07
609,108.37
610,107.70
611,107.21
612,106.99
613,107.03
614,107.12
615,107.15
616,106.96
617,106.72
618,106.51
619,106.29
620,105.90
621,105.41
622,105.01
623,105.01
624,105.38
625,105.90
626,106.32
627,106.54
628,106.63
629,106.63
630,106.54
631,106.29
632,105.96
633,105.68
634,105.71
635,105.96
636,106.26
637,106.51
638,106.72
639,106.96
640,107.18
641,107.15
642,106.96
643,106.69
644,106.57
645,106.57
646,106.57
647,106.57
648,106.69
649,106.93
650,107.21
651,107.48
652,107.67
653,107.91
654,108.18
655,108.43
656,108.55
657,108.55
658,108.52
659,108.49
660,108.49
661,108.49
662,108.58
663,108.76
664,109.16
665,109.65
666,110.26
667,110.90
668,111.82
669,112.98
670,114.53
671,116.18
672,117.95
673,119.54
674,121.31
675,123.14
676,125.34
677,127.41
678,129.52
679,131.35
680,133.33
681,135.38
682,137.88
683,140.44
684,143.25
685,146.03
686,149.17
687,152.19
688,155.21
689,157.78
690,160.16
691,162.23
692,164.31
693,166.14
694,168.03
695,169.62
696,171.17
697,172.55
698,174.10
699,175.69
700,177.58
701,179.44
702,181.43
703,183.26
704,185.18
705,187.04
706,189.03
707,190.92
708,192.81
709,194.43
710,195.86
711,197.05
712,198.09
713,198.79
714,199.07
715,198.82
716,198.21
717,197.20
718,195.89
719,194.49
720,193.15
721,191.93
722,190.67
723,189.54
724,188.60
725,187.87
726,187.13
727,186.46
728,185.94
729,185.67
730,185.46
731,185.30
732,185.18
733,185.15
734,185.12
735,185.12
736,185.33
737,185.82
738,186.40
739,186.86
740,187.26
741,187.71
742,188.45
743,189.12
744,189.61
745,189.85
746,190.19
747,190.58
748,191.04
749,191.53
750,192.35
751,193.51
752,194.82
753,196.01
754,197.27
755,198.64
756,200.32
757,201.97
758,203.58
759,204.96
760,206.27
761,207.43
762,208.65
763,209.75
764,211.03
765,212.43
766,214.23
767,216.09
768,217.99
769,219.64
770,221.22
771,222.63
772,223.82
773,224.55
774,224.85
775,224.79
776,224.61
777,224.37
778,224.15
779,223.88
780,223.57
781,223.33
782,223.36
783,223.60
784,223.79
785,223.82
786,223.69
787,223.69
788,223.79
789,223.82
790,223.57
791,223.11
792,222.47
793,221.74
794,220.95
795,220.25
796,219.76
797,219.51
798,219.42
799,219.45
800,219.54
801,219.79
802,220.09
803,220.37
804,220.43
805,220.18
806,219.64
807,218.93
808,218.17
809,217.44
810,216.71
811,216.00
812,215.36
813,214.90
814,214.48
815,214.05
816,213.41
817,212.68
818,211.94
819,211.52
820,211.33
821,211.33
822,211.30
823,211.33
824,211.58
825,212.04
826,212.49
827,212.77
828,212.83
829,212.80
830,212.71
831,212.52
832,212.13
833,211.64
834,211.15
835,210.66
836,210.11
837,209.41
838,208.56
839,207.58
840,206.54
841,205.60
842,204.86
843,204.41
844,204.07
845,203.89
846,203.67
847,203.46
848,202.94
849,202.30
850,201.48
851,200.53
852,199.19
853,197.54
854,195.71
855,194.09
856,192.50
857,190.86
858,188.96
859,187.10
860,185.30
861,183.65
862,181.82
863,179.96
864,178.13
865,176.73
866,175.48
867,174.41
868,173.10
869,171.69
870,170.04
871,168.43
872,166.72
873,165.07
874,163.33
875,161.74
876,160.16
877,158.75
878,157.20
879,155.64
880,153.81
881,151.95
882,149.69
883,147.37
884,144.99
885,142.85
886,140.78
887,138.95
888,137.24
889,135.83
890,134.40
891,133.06
892,131.59
893,130.19
894,128.63
895,126.98
896,125.24
897,123.84
898,122.77
899,122.10
900,121.55
901,121.09
902,120.67
903,120.45
904,120.39
905,120.39
906,120.39
907,120.39
908,120.48
909,120.73
910,121.00
911,121.25
912,121.49
913,121.70
914,121.95
915,122.19
916,122.47
917,122.71
918,122.80
919,122.77
920,122.89
921,123.35
922,124.21
923,125.12
924,126.07
925,127.04
926,128.20
927,129.36
928,130.37
929,131.07
930,131.77
931,132.42
932,133.06
933,133.51
934,134.03
935,134.70
936,135.71
937,136.63
938,137.42
939,138.12
940,139.10
941,140.23
942,141.39
943,142.36
944,143.37
945,144.50
946,145.75
947,146.97
948,148.22
949,149.38
950,150.36
951,151.09
952,151.73
953,152.44
954,153.20
955,153.90
956,154.54
957,155.03
958,155.30
959,155.30
960,155.06
961,154.57
962,153.81
963,152.83
964,151.86
965,151.12
966,150.76
967,150.79
968,151.00
969,151.28
970,151.46
971,151.46
972,151.18
973,150.76
974,150.09
975,149.38
976,148.59
977,147.86
978,147.34
979,147.09
980,147.03
981,147.09
982,147.03
983,146.79
984,146.33
985,145.87
986,145.54
987,145.26
988,144.96
989,144.74
990,144.81
991,145.26
992,146.00
993,146.76
994,147.40
995,147.86
996,148.10
997,148.10
998,148.01
999,147.98
1000,148.13
1001,148.35
1002,148.68
1003,149.14
1004,149.81
1005,150.54
1006,151.12
1007,151.34
1008,151.37
1009,151.34
1010,151.43
1011,151.64
1012,152.01
1013,152.47
1014,153.20
1015,154.11
1016,155.27
1017,156.46
1018,157.71
1019,158.84
1020,160.00
1021,161.16
1022,162.60
1023,163.97
1024,165.28
1025,166.47
1026,167.88
1027,169.46
1028,171.30
1029,172.97
1030,174.59
1031,175.96
1032,177.15
1033,178.10
1034,178.96
1035,179.63
1036,180.15
1037,180.33
1038,180.54
1039,180.97
1040,181.88
1041,183.07
1042,184.39
1043,185.58
1044,186.71
1045,187.87
1046,189.18
1047,190.61
1048,192.17
1049,193.54
1050,194.82
1051,196.01
1052,197.33
1053,198.49
1054,199.28
1055,199.49
1056,199.55
1057,199.49
1058,199.37
1059,199.13
1060,198.94
1061,198.91
1062,199.10
1063,199.37
1064,199.62
1065,199.86
1066,200.04
1067,200.32
1068,200.56
1069,200.84
1070,200.93
1071,200.74
1072,200.01
1073,198.85
1074,197.24
1075,195.31
1076,193.05
1077,190.67
1078,188.32
1079,186.19
1080,184.14
1081,182.28
1082,180.51
1083,179.11
1084,177.95
1085,177.31
1086,176.91
1087,176.73
1088,176.39
1089,175.96
1090,175.32
1091,174.65
1092,173.74
1093,172.55
1094,171.08
1095,169.62
1096,168.46
1097,167.76
1098,167.36
1099,167.18
1100,167.02
1101,167.05
1102,167.18
1103,167.45
1104,167.66
1105,167.66
1106,167.33
1107,166.90
1108,166.38
1109,165.65
1110,164.46
1111,162.84
1112,160.92
1113,158.97
1114,157.01
1115,155.36
1116,154.24
1117,153.78
1118,153.69
1119,153.75
1120,153.75
1121,153.75
1122,153.69
1123,153.47
1124,152.98
1125,152.25
1126,151.40
1127,150.67
1128,150.27
1129,150.27
1130,150.60
1131,151.09
1132,151.61
1133,152.07
1134,152.50
1135,152.95
1136,153.59
1137,154.27
1138,155.06
1139,156.01
1140,157.32
1141,158.94
1142,160.92
1143,163.09
1144,165.50
1145,167.82
1146,169.95
1147,171.63
1148,173.00
1149,173.89
1150,174.35
1151,174.32
1152,174.29
1153,174.41
1154,175.02
1155,175.93
1156,177.46
1157,179.35
1158,181.49
1159,183.38
1160,184.88
1161,185.82
1162,186.40
1163,186.55
1164,186.55
1165,186.49
1166,186.83
1167,187.50
1168,188.54
1169,189.70
1170,191.16
1171,192.81
1172,194.64
1173,196.29
1174,197.81
1175,199.16
1176,200.74
1177,202.33
1178,204.10
1179,205.72
1180,207.52
1181,209.35
1182,211.46
1183,213.56
1184,215.85
1185,218.20
1186,220.83
1187,223.39
1188,225.95
1189,228.33
1190,230.71
1191,232.82
1192,234.56
1193,235.72
1194,236.57
1195,237.27
1196,237.88
1197,238.10
1198,237.85
1199,237.37
1200,236.97
1201,236.72
1202,236.42
1203,235.96
1204,235.44
1205,234.92
1206,234.34
1207,233.67
1208,232.91
1209,232.18
1210,231.51
1211,231.02
1212,230.87
1213,231.11
1214,231.66
1215,232.45
1216,233.15
1217,233.67
1218,233.70
1219,233.25
1220,232.30
1221,231.11
1222,229.77
1223,228.58
1224,227.60
1225,226.93
1226,226.29
1227,225.62
1228,224.67
1229,223.48
1230,222.05
1231,220.37
1232,218.48
1233,216.55
1234,214.81
1235,213.62
1236,213.01
1237,213.10
1238,213.50
1239,213.99
1240,214.29
1241,214.60
1242,214.90
1243,215.12
1244,215.06
1245,214.84
1246,214.75
1247,214.97
1248,215.30
1249,215.58
1250,215.82
1251,216.03
1252,216.09
1253,215.85
1254,215.48
1255,215.21
1256,215.21
1257,215.42
1258,215.91
1259,216.64
1260,217.56
1261,218.51
1262,219.42
1263,220.12
1264,220.64
1265,221.13
1266,221.65
1267,222.11
1268,222.44
1269,222.69
1270,222.99
1271,223.24
1272,223.18
1273,222.69
1274,222.05
1275,221.53
1276,221.19
1277,220.98
1278,220.86
1279,220.86
1280,221.01
1281,221.25
1282,221.44
1283,221.47
1284,221.22
1285,220.73
1286,220.03
1287,219.33
1288,218.72
1289,218.26
1290,217.77
1291,217.35
1292,216.89
1293,216.43
1294,215.79
1295,214.84
1296,213.53
1297,212.10
1298,210.69
1299,209.53
1300,208.50
1301,207.55
1302,206.57
1303,205.66
1304,204.74
1305,203.80
1306,202.64
1307,201.48
1308,200.35
1309,199.43
1310,198.49
1311,197.57
1312,196.62
1313,195.92
1314,195.43
1315,195.25
1316,195.10
1317,194.89
1318,194.49
1319,194.03
1320,193.45
1321,192.78
1322,191.77
1323,190.61
1324,189.36
1325,188.17
1326,186.89
1327,185.76
1328,184.78
1329,184.05
1330,183.35
1331,182.68
1332,182.04
1333,181.55
1334,181.09
1335,180.66
1336,180.21
1337,179.72
1338,179.08
1339,178.38
1340,177.80
1341,177.58
1342,177.55
1343,177.55
1344,177.49
1345,177.52
1346,177.70
1347,177.95
1348,177.95
1349,177.76
1350,177.49
1351,177.19
1352,176.79
1353,176.36
1354,176.06
1355,176.03
1356,176.12
1357,176.15
1358,176.15
1359,176.12
1360,176.03
1361,175.81
1362,175.57
1363,175.29
1364,174.99
1365,174.74
1366,174.71
1367,174.99
1368,175.35
1369,175.60
1370,175.69
1371,175.66
1372,175.69
1373,175.69
1374,175.57
1375,175.29
1376,175.08
1377,175.05
1378,175.38
1379,175.84
1380,176.33
1381,176.82
1382,177.43
1383,178.13
1384,178.77
1385,179.29
1386,179.69
1387,179.87
1388,179.84
1389,179.63
1390,179.38
1391,179.11
1392,178.74
1393,178.28
1394,177.98
1395,177.95
1396,178.10
1397,178.38
1398,178.74
1399,179.20
1400,179.63
1401,179.93
1402,179.93
1403,179.69
1404,179.14
1405,178.44
1406,177.70
1407,176.97
1408,176.24
1409,175.54
1410,174.87
1411,174.41
1412,174.10
1413,173.89
1414,173.58
1415,173.13
1416,172.42
1417,171.45
1418,170.29
1419,169.10
1420,168.00
1421,167.02
1422,166.17
1423,165.47
1424,164.95
1425,164.73
1426,164.67
1427,164.70
1428,164.70
1429,164.73
1430,164.67
1431,164.43
1432,163.91
1433,163.48
1434,163.24
1435,163.27
1436,163.18
1437,162.99
1438,162.69
1439,162.48
1440,162.11
1441,161.44
1442,160.28
1443,158.84
1444,157.20
1445,155.79
1446,154.69
1447,154.02
1448,153.50
1449,153.05
1450,152.53
1451,152.07
1452,151.64
1453,151.18
1454,150.45
1455,149.51
1456,148.53
1457,147.83
1458,147.28
1459,146.85
1460,146.36
1461,145.90
1462,145.45
1463,144.96
1464,144.32
1465,143.65
1466,142.97
1467,142.49
1468,142.12
1469,141.91
1470,141.78
1471,141.82
1472,141.88
1473,141.91
1474,141.72
1475,141.51
1476,141.27
1477,141.05
1478,140.69
1479,140.20
1480,139.74
1481,139.50
1482,139.47
1483,139.50
1484,139.40
1485,139.16
1486,138.76
1487,138.31
1488,137.76
1489,137.30
1490,136.93
1491,136.69
1492,136.47
1493,136.26
1494,136.02
1495,135.80
1496,135.47
1497,135.01
1498,134.34
1499,133.61
1500,132.97
1501,132.48
1502,132.17
1503,132.17
1504,132.60
1505,133.33
1506,134.12
1507,134.86
1508,135.53
1509,136.23
1510,136.93
1511,137.66
1512,138.46
1513,139.16
1514,139.71
1515,139.92
1516,139.89
1517,139.65
1518,139.28
1519,138.79
1520,138.24
1521,137.76
1522,137.39
1523,137.15
1524,137.02
1525,137.02
1526,137.21
1527,137.45
1528,137.57
1529,137.33
1530,136.75
1531,136.05
1532,135.31
1533,134.58
1534,133.82
1535,133.09
1536,132.57
1537,132.35
1538,132.29
1539,132.32
1540,132.35
1541,132.35
1542,132.23
1543,131.99
1544,131.68
1545,131.44
1546,131.35
1547,131.38
1548,131.38
1549,131.38
1550,131.38
1551,131.41
1552,131.32
1553,131.07
1554,130.65
1555,130.16
1556,129.76
1557,129.52
1558,129.36
1559,129.12
1560,128.78
1561,128.54
1562,128.57
1563,128.78
1564,129.12
1565,129.61
1566,130.43
1567,131.62
1568,132.97
1569,134.16
1570,135.22
1571,136.14
1572,137.02
1573,137.73
1574,138.31
1575,138.73
1576,139.28
1577,139.95
1578,140.87
1579,141.82
1580,142.79
1581,143.71
1582,144.71
1583,145.66
1584,146.55
1585,147.22
1586,147.86
1587,148.53
1588,149.57
1589,150.73
1590,151.98
1591,153.14
1592,154.45
1593,155.82
1594,157.29
1595,158.45
1596,159.42
1597,160.10
1598,160.68
1599,161.10
1600,161.65
1601,162.29
1602,163.36
1603,164.76
1604,166.63
1605,168.76
1606,171.17
1607,173.52
1608,175.75
1609,177.67
1610,179.35
1611,180.45
1612,181.12
1613,181.30
1614,181.58
1615,181.98
1616,182.62
1617,183.32
1618,184.30
1619,185.42
1620,186.83
1621,188.23
1622,189.73
1623,191.13
1624,192.50
1625,193.63
1626,194.79
1627,195.95
1628,197.36
1629,198.76
1630,200.13
1631,201.29
1632,202.48
1633,203.64
1634,204.80
1635,205.72
1636,206.51
1637,207.18
1638,207.95
1639,208.65
1640,209.32
1641,209.75
1642,210.08
1643,210.30
1644,210.54
1645,210.72
1646,211.03
1647,211.49
1648,212.25
1649,213.23
1650,214.26
1651,215.18
1652,216.09
1653,217.07
1654,218.14
1655,219.06
1656,219.76
1657,220.21
1658,220.67
1659,221.13
1660,221.53
1661,221.80
1662,221.98
1663,222.23
1664,222.47
1665,222.72
1666,222.90
1667,222.93
1668,222.63
1669,221.92
1670,220.73
1671,219.33
1672,217.74
1673,216.09
1674,214.26
1675,212.40
1676,210.39
1677,208.53
1678,206.60
1679,204.74
1680,202.73
1681,200.87
1682,199.04
1683,197.39
1684,195.77
1685,194.43
1686,193.12
1687,191.96
1688,190.64
1689,189.27
1690,187.74
1691,186.34
1692,184.94
1693,183.78
1694,182.83
1695,182.10
1696,181.49
1697,181.06
1698,180.76
1699,180.54
1700,180.18
1701,179.72
1702,179.29
1703,179.02
1704,178.89
1705,178.96
1706,179.14
1707,179.32
1708,179.38
1709,179.41
1710,179.69
1711,180.11
1712,180.51
1713,180.76
1714,181.18
1715,181.85
1716,182.68
1717,183.44
1718,184.11
1719,184.81
1720,185.55
1721,186.25
1722,186.95
1723,187.65
1724,188.42
1725,189.12
1726,189.76
1727,190.19
1728,190.64
1729,191.10
1730,191.65
1731,192.08
1732,192.50
1733,192.99
1734,193.73
1735,194.40
1736,194.85
1737,195.10
1738,195.43
1739,195.86
1740,196.20
1741,196.23
1742,196.14
1743,196.11
1744,196.08
1745,195.86
1746,195.47
1747,194.95
1748,194.49
1749,194.27
1750,194.27
1751,194.24
1752,194.09
1753,193.82
1754,193.76
1755,194.00
1756,194.40
1757,194.67
1758,194.70
1759,194.73
1760,194.76
1761,194.73
1762,194.58
1763,194.37
1764,194.21
1765,194.18
1766,194.18
1767,194.21
1768,194.37
1769,194.58
1770,194.73
1771,194.76
1772,194.73
1773,194.73
1774,194.61
1775,194.40
1776,194.12
1777,193.85
1778,193.57
1779,193.36
1780,193.27
1781,193.27
1782,193.21
1783,192.96
1784,192.60
1785,192.38
1786,192.38
1787,192.63
1788,192.93
1789,193.21
1790,193.36
1791,193.36
1792,193.12
1793,192.66
1794,191.99
1795,191.28
1796,190.55
1797,189.85
1798,189.09
1799,188.39
1800,187.74
1801,187.01
1802,186.04
1803,184.88
1804,183.59
1805,182.43
1806,181.18
1807,180.02
1808,178.96
1809,178.28
1810,177.92
1811,177.70
1812,177.31
1813,176.88
1814,176.42
1815,175.96
1816,175.23
1817,174.32
1818,173.25
1819,172.27
1820,171.42
1821,170.75
1822,170.17
1823,169.74
1824,169.19
1825,168.52
1826,167.51
1827,166.35
1828,164.95
1829,163.54
1830,162.02
1831,160.64
1832,159.30
1833,158.17
1834,156.95
1835,155.79
1836,154.60
1837,153.69
1838,152.89
1839,152.22
1840,151.37
1841,150.45
1842,149.44
1843,148.53
1844,147.52
1845,146.33
1846,144.90
1847,143.49
1848,142.18
1849,140.99
1850,139.71
1851,138.58
1852,137.70
1853,137.21
1854,136.81
1855,136.41
1856,135.96
1857,135.44
1858,134.70
1859,133.79
1860,132.84
1861,132.11
1862,131.53
1863,131.07
1864,130.77
1865,130.77
1866,131.07
1867,131.56
1868,132.05
1869,132.54
1870,133.06
1871,133.51
1872,133.88
1873,134.12
1874,134.34
1875,134.55
1876,134.83
1877,135.01
1878,135.35
1879,135.77
1880,136.54
1881,137.48
1882,138.61
1883,139.80
1884,141.02
1885,142.21
1886,143.37
1887,144.29
1888,144.99
1889,145.45
1890,145.90
1891,146.33
1892,146.85
1893,147.28
1894,147.86
1895,148.53
1896,149.51
1897,150.67
1898,152.07
1899,153.50
1900,154.91
1901,156.04
1902,157.07
1903,158.02
1904,159.12
1905,160.25
1906,161.47
1907,162.66
1908,164.03
1909,165.44
1910,166.72
1911,167.69
1912,168.43
1913,168.85
1914,168.98
1915,168.73
1916,168.40
1917,168.12
1918,167.94
1919,167.69
1920,167.39
1921,167.14
1922,167.11
1923,167.08
1924,166.99
1925,166.72
1926,166.53
1927,166.50
1928,166.69
1929,166.93
1930,167.24
1931,167.72
1932,168.40
1933,169.13
1934,169.74
1935,170.23
1936,170.68
1937,171.14
1938,171.51
1939,171.75
1940,171.97
1941,172.21
1942,172.39
1943,172.39
1944,172.18
1945,171.94
1946,171.88
1947,171.84
1948,171.75
1949,171.51
1950,171.33
1951,171.30
1952,171.39
1953,171.39
1954,171.36
1955,171.36
1956,171.39
1957,171.42
1958,171.30
1959,171.05
1960,170.78
1961,170.53
1962,170.32
1963,170.07
1964,169.80
1965,169.59
1966,169.40
1967,169.16
1968,168.70
1969,168.03
1970,167.08
1971,166.11
1972,165.16
1973,164.49
1974,164.09
1975,163.85
1976,163.51
1977,163.09
1978,162.54
1979,161.80
1980,160.74
1981,159.55
1982,158.60
1983,158.08
1984,157.87
1985,157.90
1986,158.36
1987,159.27
1988,160.55
1989,161.77
1990,162.81
1991,163.51
1992,163.88
1993,164.09
1994,164.40
1995,164.86
1996,165.47
1997,166.17
1998,167.11
1999,168.27
2000,169.74
2001,171.17
2002,172.45
2003,173.34
2004,174.10
2005,174.77
2006,175.63
2007,176.54
2008,177.61
2009,178.77
2010,180.18
2011,181.61
2012,182.95
2013,183.90
2014,184.45
2015,184.66
2016,184.75
2017,184.72
2018,184.66
2019,184.63
2020,184.91
2021,185.64
2022,186.71
2023,187.65
2024,188.26
2025,188.54
2026,188.57
2027,188.26
2028,187.59
2029,186.65
2030,185.82
2031,185.30
2032,185.06
2033,185.09
2034,185.49
2035,186.19
2036,186.92
2037,187.47
2038,187.65
2039,187.41
2040,186.61
2041,185.42
2042,183.99
2043,182.56
2044,181.12
2045,179.72
2046,178.31
2047,177.12
2048,176.18
2049,175.51
2050,174.80
2051,174.13
2052,173.34
2053,172.70
2054,171.94
2055,170.99
2056,169.74
2057,168.58
2058,167.66
2059,166.99
2060,166.02
2061,164.89
2062,163.70
2063,162.78
2064,161.77
2065,160.64
2066,159.27
2067,158.11
2068,157.07
2069,156.16
2070,155.03
2071,153.87
2072,152.77
2073,151.86
2074,150.82
2075,149.63
2076,148.38
2077,147.43
2078,146.79
2079,146.36
2080,145.78
2081,145.08
2082,144.38
2083,143.92
2084,143.55
2085,143.10
2086,142.43
2087,141.69
2088,141.08
2089,140.63
2090,140.17
2091,139.71
2092,139.25
2093,139.04
2094,138.98
2095,139.01
2096,138.89
2097,138.70
2098,138.37
2099,137.88
2100,137.12
2101,136.20
2102,135.19
2103,134.25
2104,133.21
2105,132.29
2106,131.53
2107,131.04
2108,130.71
2109,130.52
2110,130.34
2111,130.13
2112,129.64
2113,128.97
2114,128.05
2115,127.11
2116,126.07
2117,125.12
2118,124.36
2119,123.87
2120,123.60
2121,123.63
2122,123.96
2123,124.42
2124,124.85
2125,125.09
2126,125.27
2127,125.52
2128,125.76
2129,126.01
2130,126.28
2131,126.77
2132,127.50
2133,128.20
2134,128.63
2135,128.63
2136,128.42
2137,128.14
2138,127.81
2139,127.35
2140,126.89
2141,126.59
2142,126.68
2143,127.20
2144,128.05
2145,129.00
2146,129.79
2147,130.55
2148,131.35
2149,132.05
2150,132.35
2151,132.14
2152,131.62
2153,131.10
2154,130.62
2155,130.16
2156,129.82
2157,129.55
2158,129.30
2159,129.09
2160,128.97
2161,128.94
2162,129.00
2163,129.00
2164,128.97
2165,128.91
2166,129.09
2167,129.58
2168,130.37
2169,131.29
2170,132.32
2171,133.27
2172,134.25
2173,135.13
2174,136.08
2175,136.99
2176,138.18
2177,139.56
2178,141.24
2179,143.16
2180,145.48
2181,147.77
2182,150.02
2183,151.92
2184,153.78
2185,155.36
2186,156.68
2187,157.59
2188,158.60
2189,159.70
2190,161.04
2191,162.20
2192,163.42
2193,164.55
2194,165.77
2195,166.93
2196,168.15
2197,169.31
2198,170.56
2199,171.72
2200,172.91
2201,174.07
2202,175.35
2203,176.54
2204,177.55
2205,177.98
2206,177.98
2207,177.73
2208,177.52
2209,177.22
2210,176.79
2211,176.30
2212,176.18
2213,176.36
2214,176.73
2215,177.00
2216,177.22
2217,177.40
2218,177.64
2219,177.89
2220,178.28
2221,178.71
2222,179.20
2223,179.69
2224,180.30
2225,180.97
2226,181.67
2227,182.43
2228,183.32
2229,184.20
2230,185.06
2231,185.79
2232,186.65
2233,187.50
2234,188.39
2235,189.15
2236,189.94
2237,190.58
2238,191.01
2239,191.25
2240,191.62
2241,192.05
2242,192.44
2243,192.69
2244,193.08
2245,193.76
2246,194.61
2247,195.37
2248,195.95
2249,196.41
2250,196.78
2251,197.02
2252,197.14
2253,197.14
2254,197.05
2255,196.78
2256,196.38
2257,195.92
2258,195.47
2259,194.95
2260,194.37
2261,193.94
2262,193.76
2263,193.73
2264,193.57
2265,193.39
2266,193.39
2267,193.60
2268,193.70
2269,193.51
2270,193.08
2271,192.63
2272,191.96
2273,191.01
2274,189.79
2275,188.57
2276,187.56
2277,186.86
2278,186.34
2279,185.88
2280,185.42
2281,184.94
2282,184.42
2283,183.99
2284,183.53
2285,183.07
2286,182.50
2287,182.01
2288,181.76
2289,181.79
2290,181.79
2291,181.58
2292,181.15
2293,180.69
2294,180.21
2295,179.72
2296,179.14
2297,178.71
2298,178.44
2299,178.19
2300,177.70
2301,177.06
2302,176.30
2303,175.54
2304,174.62
2305,173.74
2306,173.10
2307,172.82
2308,172.61
2309,172.45
2310,172.33
2311,172.33
2312,172.15
2313,171.69
2314,171.08
2315,170.59
2316,170.23
2317,169.77
2318,169.07
2319,168.37
2320,167.85
2321,167.60
2322,167.42
2323,167.21
2324,167.05
2325,167.02
2326,167.11
2327,167.39
2328,167.79
2329,168.27
2330,168.67
2331,168.91
2332,169.13
2333,169.34
2334,169.56
2335,169.77
2336,170.14
2337,170.62
2338,171.14
2339,171.36
2340,171.23
2341,170.99
2342,170.90
2343,170.87
2344,170.84
2345,170.81
2346,171.17
2347,172.12
2348,173.52
2349,174.96
2350,176.30
2351,177.49
2352,178.62
2353,179.57
2354,180.18
2355,180.42
2356,180.45
2357,180.39
2358,180.45
2359,180.69
2360,181.21
2361,181.95
2362,182.65
2363,183.14
2364,183.38
2365,183.35
2366,183.07
2367,182.62
2368,182.07
2369,181.55
2370,181.18
2371,180.97
2372,180.91
2373,180.88
2374,180.82
2375,180.85
2376,181.09
2377,181.55
2378,181.95
2379,182.25
2380,182.50
2381,182.74
2382,182.74
2383,182.53
2384,182.22
2385,181.95
2386,181.64
2387,181.18
2388,180.63
2389,180.15
2390,179.72
2391,179.29
2392,178.71
2393,177.98
2394,177.06
2395,176.15
2396,175.26
2397,174.53
2398,173.92
2399,173.46
2400,173.19
2401,172.94
2402,172.52
2403,171.81
2404,170.87
2405,169.92
2406,169.01
2407,168.27
2408,167.82
2409,167.85
2410,168.37
2411,169.07
2412,169.71
2413,170.23
2414,170.68
2415,171.14
2416,171.45
2417,171.45
2418,171.30
2419,171.02
2420,170.72
2421,170.47
2422,170.47
2423,170.68
2424,171.11
2425,171.60
2426,172.12
2427,172.58
2428,172.94
2429,173.19
2430,173.43
2431,173.65
2432,173.77
2433,173.77
2434,173.77
2435,173.74
2436,173.65
2437,173.40
2438,173.19
2439,173.19
2440,173.46
2441,173.92
2442,174.53
2443,175.26
2444,176.12
2445,177.09
2446,178.01
2447,178.74
2448,179.17
2449,179.41
2450,179.53
2451,179.53
2452,179.26
2453,178.80
2454,178.28
2455,177.80
2456,177.28
2457,176.82
2458,176.54
2459,176.54
2460,176.67
2461,176.70
2462,176.48
2463,176.24
2464,176.06
2465,176.09
2466,176.18
2467,176.18
2468,175.99
2469,175.75
2470,175.66
2471,175.66
2472,175.54
2473,175.32
2474,175.14
2475,175.11
2476,175.17
2477,175.20
2478,175.17
2479,175.14
2480,175.17
2481,175.20
2482,175.14
2483,174.87
2484,174.44
2485,173.95
2486,173.65
2487,173.61
2488,173.89
2489,174.38
2490,175.08
2491,175.78
2492,176.36
2493,176.85
2494,177.34
2495,177.80
2496,178.19
2497,178.44
2498,178.62
2499,178.83
2500,179.14
2501,179.35
2502,179.53
2503,179.78
2504,180.18
2505,180.63
2506,181.06
2507,181.58
2508,182.25
2509,182.98
2510,183.44
2511,183.44
2512,183.07
2513,182.65
2514,182.01
2515,181.09
2516,179.63
2517,177.95
2518,176.33
2519,174.93
2520,173.46
2521,171.84
2522,169.98
2523,168.27
2524,166.90
2525,166.02
2526,165.28
2527,164.61
2528,163.79
2529,163.09
2530,162.51
2531,162.08
2532,161.53
2533,160.86
2534,159.91
2535,158.97
2536,158.11
2537,157.68
2538,157.53
2539,157.56
2540,157.53
2541,157.32
2542,156.80
2543,156.10
2544,155.18
2545,154.24
2546,153.29
2547,152.62
2548,152.10
2549,151.89
2550,151.79
2551,151.82
2552,151.82
2553,151.61
2554,150.97
2555,149.81
2556,148.10
2557,146.15
2558,144.23
2559,142.82
2560,142.03
2561,141.78
2562,141.85
2563,142.15
2564,142.61
2565,143.10
2566,143.25
2567,143.07
2568,142.64
2569,142.12
2570,141.39
2571,140.50
2572,139.47
2573,138.49
2574,137.51
2575,136.57
2576,135.80
2577,135.35
2578,134.95
2579,134.52
2580,133.88
2581,133.15
2582,132.45
2583,131.96
2584,131.74
2585,131.77
2586,131.93
2587,132.17
2588,132.45
2589,132.69
2590,132.87
2591,132.87
2592,132.57
2593,132.11
2594,131.65
2595,131.38
2596,131.38
2597,131.62
2598,132.17
2599,132.87
2600,133.58
2601,134.09
2602,134.34
2603,134.28
2604,134.06
2605,133.82
2606,133.82
2607,134.03
2608,134.31
2609,134.58
2610,134.92
2611,135.38
2612,135.83
2613,136.08
2614,136.17
2615,136.14
2616,136.14
2617,136.11
2618,136.17
2619,136.38
2620,136.87
2621,137.60
2622,138.49
2623,139.43
2624,140.41
2625,141.39
2626,142.33
2627,143.01
2628,143.43
2629,143.65
2630,143.92
2631,144.13
2632,144.20
2633,143.92
2634,143.62
2635,143.59
2636,144.01
2637,144.71
2638,145.60
2639,146.55
2640,147.67
2641,148.86
2642,149.93
2643,150.63
2644,151.09
2645,151.34
2646,151.37
2647,151.09
2648,150.63
2649,150.12
2650,149.87
2651,149.84
2652,150.02
2653,150.27
2654,150.63
2655,151.09
2656,151.61
2657,152.07
2658,152.56
2659,153.02
2660,153.44
2661,153.69
2662,153.78
2663,153.75
2664,153.78
2665,153.99
2666,154.51
2667,155.18
2668,156.10
2669,157.04
2670,158.08
2671,159.03
2672,159.82
2673,160.25
2674,160.52
2675,160.71
2676,161.16
2677,161.83
2678,162.84
2679,164.06
2680,165.44
2681,166.60
2682,167.42
2683,167.91
2684,168.24
2685,168.43
2686,168.52
2687,168.52
2688,168.67
2689,169.10
2690,169.80
2691,170.56
2692,171.26
2693,171.72
2694,171.88
2695,171.88
2696,171.94
2697,172.15
2698,172.42
2699,172.67
2700,172.97
2701,173.46
2702,174.07
2703,174.56
2704,174.71
2705,174.47
2706,174.01
2707,173.52
2708,173.07
2709,172.61
2710,172.00
2711,171.30
2712,170.56
2713,169.86
2714,169.04
2715,168.12
2716,166.99
2717,165.80
2718,164.49
2719,163.09
2720,161.56
2721,160.13
2722,158.84
2723,157.93
2724,157.26
2725,156.80
2726,156.34
2727,155.88
2728,155.40
2729,154.94
2730,154.42
2731,153.99
2732,153.59
2733,153.38
2734,153.14
2735,152.95
2736,152.74
2737,152.50
2738,152.04
2739,151.37
2740,150.39
2741,149.20
2742,147.67
2743,146.06
2744,144.38
2745,142.91
2746,141.69
2747,141.02
2748,140.99
2749,141.48
2750,142.12
2751,142.67
2752,142.88
2753,142.91
2754,142.61
2755,141.88
2756,140.75
2757,139.56
2758,138.61
2759,138.12
2760,137.97
2761,138.00
2762,138.12
2763,138.15
2764,137.79
2765,136.84
2766,135.31
2767,133.64
2768,131.99
2769,130.58
2770,129.30
2771,128.36
2772,127.87
2773,127.87
2774,128.11
2775,128.42
2776,128.60
2777,128.63
2778,128.27
2779,127.56
2780,126.56
2781,125.61
2782,124.85
2783,124.36
2784,124.08
2785,124.15
2786,124.51
2787,124.97
2788,125.21
2789,125.27
2790,125.24
2791,125.21
2792,125.00
2793,124.54
2794,124.05
2795,123.81
2796,123.69
2797,123.47
2798,122.99
2799,122.28
2800,121.43
2801,120.45
2802,119.29
2803,118.13
2804,117.10
2805,116.36
2806,115.88
2807,115.69
2808,115.72
2809,115.97
2810,116.18
2811,116.18
2812,116.00
2813,115.78
2814,115.54
2815,115.30
2816,115.05
2817,115.05
2818,115.42
2819,116.15
2820,117.07
2821,117.80
2822,118.16
2823,118.13
2824,117.95
2825,117.71
2826,117.34
2827,116.88
2828,116.36
2829,115.91
2830,115.42
2831,114.93
2832,114.50
2833,114.29
2834,114.26
2835,114.26
2836,114.07
2837,113.86
2838,113.77
2839,113.74
2840,113.56
2841,113.13
2842,112.55
2843,112.06
2844,111.57
2845,111.15
2846,110.75
2847,110.50
2848,110.32
2849,110.11
2850,109.77
2851,109.28
2852,108.64
2853,107.94
2854,107.24
2855,106.78
2856,106.45
2857,106.26
2858,105.99
2859,105.50
2860,104.74
2861,103.79
2862,102.75
2863,101.81
2864,100.92
2865,100.25
2866,99.70
2867,99.46
2868,99.46
2869,99.73
2870,100.19
2871,100.68
2872,101.01
2873,101.01
2874,100.68
2875,100.19
2876,99.70
2877,99.21
2878,98.69
2879,98.21
2880,97.93
2881,97.90
2882,98.11
2883,98.36
2884,98.66
2885,99.12
2886,99.79
2887,100.49
2888,101.23
2889,101.93
2890,102.75
2891,103.67
2892,104.68
2893,105.65
2894,106.66
2895,107.54
2896,108.43
2897,109.38
2898,110.69
2899,112.30
2900,114.23
2901,116.12
2902,118.07
2903,119.96
2904,121.77
2905,123.17
2906,124.18
2907,124.88
2908,125.58
2909,126.22
2910,126.92
2911,127.56
2912,128.66
2913,130.04
2914,131.71
2915,133.36
2916,135.13
2917,136.99
2918,139.07
2919,140.96
2920,142.67
2921,144.01
2922,145.39
2923,146.79
2924,148.38
2925,149.78
2926,151.00
2927,151.92
2928,152.74
2929,153.44
2930,154.08
2931,154.51
2932,154.91
2933,155.36
2934,156.04
2935,156.74
2936,157.32
2937,157.81
2938,158.33
2939,158.78
2940,159.00
2941,158.72
2942,158.29
2943,157.99
2944,158.14
2945,158.60
2946,159.36
2947,160.31
2948,161.53
2949,162.99
2950,164.58
2951,166.02
2952,167.11
2953,167.82
2954,168.24
2955,168.49
2956,168.55
2957,168.27
2958,167.76
2959,167.02
2960,166.23
2961,165.25
2962,164.06
2963,162.87
2964,161.96
2965,161.47
2966,161.25
2967,161.32
2968,161.59
2969,162.08
2970,162.45
2971,162.48
2972,162.17
2973,161.68
2974,161.04
2975,160.34
2976,159.58
2977,158.84
2978,158.20
2979,157.78
2980,157.41
2981,156.92
2982,156.16
2983,155.21
2984,154.27
2985,153.53
2986,152.98
2987,152.53
2988,152.10
2989,151.89
2990,151.82
2991,151.86
2992,151.70
2993,151.52
2994,151.31
2995,151.06
2996,150.54
2997,149.87
2998,149.14
2999,148.41
3000,147.55
3001,146.61
3002,145.69
3003,144.96
3004,144.38
3005,143.89
3006,143.62
3007,143.62
3008,143.89
3009,144.35
3010,144.96
3011,145.69
3012,146.61
3013,147.52
3014,148.44
3015,149.38
3016,150.63
3017,152.04
3018,153.41
3019,154.60
3020,155.88
3021,157.23
3022,158.72
3023,160.19
3024,161.71
3025,163.09
3026,164.31
3027,165.25
3028,166.14
3029,166.84
3030,167.27
3031,167.24
3032,166.96
3033,166.69
3034,166.60
3035,166.60
3036,166.56
3037,166.35
3038,165.99
3039,165.47
3040,164.79
3041,164.12
3042,163.51
3043,163.02
3044,162.45
3045,161.77
3046,161.04
3047,160.31
3048,159.45
3049,158.54
3050,157.56
3051,156.59
3052,155.58
3053,154.88
3054,154.79
3055,155.24
3056,155.91
3057,156.71
3058,157.62
3059,158.57
3060,159.12
3061,159.15
3062,158.91
3063,158.63
3064,158.33
3065,157.90
3066,157.29
3067,156.56
3068,155.64
3069,154.72
3070,153.78
3071,152.83
3072,151.70
3073,150.54
3074,149.48
3075,148.77
3076,148.22
3077,147.80
3078,147.31
3079,146.88
3080,146.33
3081,145.66
3082,144.59
3083,143.43
3084,142.24
3085,141.30
3086,140.50
3087,139.83
3088,139.13
3089,138.43
3090,137.60
3091,136.69
3092,135.53
3093,134.40
3094,133.18
3095,131.99
3096,130.71
3097,129.55
3098,128.54
3099,127.87
3100,127.23
3101,126.53
3102,125.70
3103,124.97
3104,124.48
3105,124.27
3106,124.18
3107,124.21
3108,124.33
3109,124.57
3110,124.73
3111,124.73
3112,124.66
3113,124.66
3114,124.73
3115,124.73
3116,124.60
3117,124.36
3118,124.18
3119,124.15
3120,124.30
3121,124.57
3122,124.88
3123,125.09
3124,125.18
3125,125.18
3126,125.27
3127,125.49
3128,125.73
3129,126.01
3130,126.37
3131,126.83
3132,127.20
3133,127.50
3134,127.75
3135,127.90
3136,127.99
3137,128.02
3138,128.17
3139,128.39
3140,128.48
3141,128.48
3142,128.72
3143,129.15
3144,129.64
3145,129.88
3146,130.04
3147,130.25
3148,130.52
3149,130.77
3150,130.98
3151,131.20
3152,131.62
3153,132.32
3154,133.27
3155,134.25
3156,135.13
3157,135.83
3158,136.44
3159,136.87
3160,137.24
3161,137.45
3162,137.66
3163,137.85
3164,138.21
3165,138.67
3166,139.34
3167,140.29
3168,141.57
3169,143.01
3170,144.47
3171,145.63
3172,146.51
3173,147.22
3174,147.95
3175,148.65
3176,149.26
3177,149.69
3178,150.27
3179,150.94
3180,151.76
3181,152.47
3182,153.14
3183,153.81
3184,154.63
3185,155.33
3186,155.82
3187,156.04
3188,156.28
3189,156.74
3190,157.44
3191,158.14
3192,158.84
3193,159.55
3194,160.43
3195,161.35
3196,162.23
3197,162.93
3198,163.67
3199,164.34
3200,164.98
3201,165.44
3202,165.92
3203,166.35
3204,166.78
3205,167.24
3206,167.97
3207,168.88
3208,170.01
3209,171.20
3210,172.55
3211,173.95
3212,175.38
3213,176.54
3214,177.55
3215,178.19
3216,178.77
3217,179.17
3218,179.75
3219,180.45
3220,181.37
3221,182.31
3222,183.29
3223,184.20
3224,185.24
3225,186.40
3226,187.77
3227,189.21
3228,190.70
3229,192.11
3230,193.45
3231,194.61
3232,195.68
3233,196.66
3234,197.57
3235,198.24
3236,198.64
3237,198.85
3238,199.28
3239,199.98
3240,200.84
3241,201.57
3242,202.18
3243,202.61
3244,202.94
3245,203.19
3246,203.34
3247,203.34
3248,203.16
3249,202.91
3250,202.76
3251,202.76
3252,202.85
3253,202.88
3254,202.70
3255,202.21
3256,201.42
3257,200.47
3258,199.43
3259,198.49
3260,197.63
3261,196.93
3262,196.32
3263,195.89
3264,195.43
3265,195.01
3266,194.43
3267,193.70
3268,192.78
3269,191.86
3270,190.92
3271,189.97
3272,188.84
3273,187.71
3274,186.55
3275,185.64
3276,184.72
3277,183.78
3278,182.74
3279,181.85
3280,180.94
3281,179.99
3282,178.80
3283,177.67
3284,176.57
3285,175.66
3286,174.59
3287,173.43
3288,172.21
3289,171.30
3290,170.56
3291,169.86
3292,168.95
3293,168.03
3294,167.18
3295,166.47
3296,165.68
3297,164.73
3298,163.73
3299,163.02
3300,162.63
3301,162.41
3302,162.14
3303,161.93
3304,161.87
3305,162.14
3306,162.48
3307,162.72
3308,162.78
3309,162.78
3310,162.84
3311,162.81
3312,162.63
3313,162.45
3314,162.38
3315,162.32
3316,162.14
3317,161.96
3318,161.96
3319,162.17
3320,162.32
3321,162.35
3322,162.45
3323,162.66
3324,162.75
3325,162.57
3326,162.11
3327,161.62
3328,161.13
3329,160.64
3330,160.16
3331,159.67
3332,159.30
3333,159.03
3334,158.91
3335,158.91
3336,159.06
3337,159.33
3338,159.55
3339,159.55
3340,159.33
3341,159.09
3342,158.91
3343,158.94
3344,159.06
3345,159.06
3346,158.78
3347,158.33
3348,157.81
3349,157.32
3350,156.77
3351,156.34
3352,156.07
3353,156.07
3354,156.13
3355,156.16
3356,156.16
3357,156.16
3358,156.07
3359,155.82
3360,155.43
3361,154.97
3362,154.42
3363,153.69
3364,152.77
3365,151.82
3366,151.00
3367,150.54
3368,150.33
3369,150.36
3370,150.51
3371,150.76
3372,151.00
3373,151.25
3374,151.49
3375,151.73
3376,151.89
3377,151.86
3378,151.76
3379,151.76
3380,152.01
3381,152.50
3382,153.05
3383,153.56
3384,153.99
3385,154.17
3386,154.11
3387,153.90
3388,153.72
3389,153.69
3390,153.72
3391,153.75
3392,153.84
3393,154.05
3394,154.33
3395,154.60
3396,154.88
3397,155.09
3398,155.21
3399,155.21
3400,155.21
3401,155.18
3402,155.09
3403,154.91
3404,154.54
3405,154.02
3406,153.41
3407,152.95
3408,152.83
3409,153.05
3410,153.41
3411,153.69
3412,153.84
3413,153.81
3414,153.56
3415,153.11
3416,152.53
3417,152.01
3418,151.67
3419,151.43
3420,151.34
3421,151.31
3422,151.43
3423,151.67
3424,152.01
3425,152.22
3426,152.31
3427,152.34
3428,152.34
3429,152.34
3430,152.19
3431,151.95
3432,151.79
3433,151.76
3434,151.82
3435,151.82
3436,151.92
3437,152.13
3438,152.50
3439,153.02
3440,153.56
3441,154.02
3442,154.27
3443,154.30
3444,154.17
3445,153.93
3446,153.44
3447,152.71
3448,152.01
3449,151.49
3450,151.28
3451,151.28
3452,151.49
3453,152.01
3454,152.71
3455,153.44
3456,153.93
3457,154.17
3458,154.27
3459,154.27
3460,154.08
3461,153.59
3462,152.92
3463,152.16
3464,151.52
3465,151.06
3466,150.76
3467,150.51
3468,150.30
3469,150.09
3470,149.78
3471,149.54
3472,149.35
3473,149.38
3474,149.57
3475,149.84
3476,149.99
3477,150.02
3478,149.87
3479,149.63
3480,149.20
3481,148.77
3482,148.28
3483,147.83
3484,147.22
3485,146.48
3486,145.81
3487,145.32
3488,145.05
3489,144.81
3490,144.53
3491,144.32
3492,144.20
3493,144.20
3494,144.20
3495,144.23
3496,144.29
3497,144.53
3498,144.84
3499,145.08
3500,145.23
3501,145.23
3502,145.08
3503,144.84
3504,144.53
3505,144.32
3506,144.20
3507,144.20
3508,144.29
3509,144.53
3510,144.90
3511,145.42
3512,145.90
3513,146.42
3514,146.82
3515,147.06
3516,147.00
3517,146.55
3518,145.63
3519,144.41
3520,143.10
3521,141.88
3522,140.87
3523,140.14
3524,139.80
3525,139.80
3526,140.05
3527,140.32
3528,140.41
3529,140.44
3530,140.41
3531,140.41
3532,140.35
3533,140.35
3534,140.59
3535,141.08
3536,141.60
3537,141.85
3538,141.78
3539,141.51
3540,141.24
3541,140.99
3542,140.78
3543,140.56
3544,140.29
3545,140.05
3546,139.80
3547,139.59
3548,139.37
3549,139.13
3550,138.76
3551,138.31
3552,137.76
3553,137.30
3554,136.90
3555,136.66
3556,136.57
3557,136.57
3558,136.63
3559,136.63
3560,136.54
3561,136.32
3562,135.93
3563,135.44
3564,134.92
3565,134.43
3566,134.03
3567,133.79
3568,133.79
3569,134.06
3570,134.40
3571,134.64
3572,134.70
3573,134.74
3574,134.77
3575,134.77
3576,134.52
3577,134.06
3578,133.54
3579,133.00
3580,132.48
3581,132.05
3582,131.74
3583,131.50
3584,131.13
3585,130.65
3586,130.28
3587,130.25
3588,130.58
3589,131.10
3590,131.65
3591,132.11
3592,132.51
3593,132.75
3594,132.75
3595,132.54
3596,132.11
3597,131.62
3598,131.20
3599,130.95
3600,130.89
3601,130.89
3602,130.89
3603,130.92
3604,130.89
3605,130.65
3606,130.04
3607,129.06
3608,127.96
3609,127.01
3610,126.28
3611,125.79
3612,125.52
3613,125.52
3614,125.85
3615,126.37
3616,126.74
3617,126.77
3618,126.46
3619,125.95
3620,125.24
3621,124.57
3622,123.99
3623,123.47
3624,122.99
3625,122.53
3626,122.22
3627,122.22
3628,122.38
3629,122.68
3630,122.99
3631,123.20
3632,123.17
3633,122.99
3634,122.71
3635,122.44
3636,122.10
3637,121.67
3638,121.12
3639,120.64
3640,120.18
3641,119.72
3642,119.26
3643,118.77
3644,118.13
3645,117.46
3646,116.82
3647,116.33
3648,115.88
3649,115.45
3650,114.96
3651,114.47
3652,113.92
3653,113.49
3654,113.13
3655,112.92
3656,112.61
3657,112.12
3658,111.57
3659,111.08
3660,110.75
3661,110.53
3662,110.26
3663,110.05
3664,109.89
3665,109.92
3666,109.99
3667,109.99
3668,109.89
3669,109.65
3670,109.25
3671,108.76
3672,108.25
3673,107.76
3674,107.42
3675,107.18
3676,106.93
3677,106.69
3678,106.57
3679,106.57
3680,106.57
3681,106.57
3682,106.66
3683,106.90
3684,107.21
3685,107.48
3686,107.67
3687,107.88
3688,108.22
3689,108.70
3690,109.25
3691,109.74
3692,110.11
3693,110.35
3694,110.47
3695,110.44
3696,110.29
3697,110.08
3698,109.92
3699,109.89
3700,110.02
3701,110.23
3702,110.63
3703,111.11
3704,111.54
3705,111.79
3706,111.88
3707,111.85
3708,111.85
3709,111.82
3710,111.88
3711,112.12
3712,112.67
3713,113.34
3714,114.04
3715,114.84
3716,115.66
3717,116.33
3718,116.64
3719,116.70
3720,116.73
3721,116.67
3722,116.27
3723,115.63
3724,114.96
3725,114.41
3726,113.80
3727,113.13
3728,112.70
3729,112.64
3730,112.82
3731,113.13
3732,113.59
3733,114.01
3734,114.23
3735,114.26
3736,114.35
3737,114.56
3738,114.75
3739,114.75
3740,114.75
3741,114.96
3742,115.42
3743,115.91
3744,116.27
3745,116.52
3746,116.76
3747,116.97
3748,117.10
3749,117.10
3750,117.19
3751,117.40
3752,117.65
3753,117.89
3754,118.32
3755,119.02
3756,119.93
3757,120.64
3758,121.00
3759,120.97
3760,120.76
3761,120.51
3762,120.33
3763,120.06
3764,119.78
3765,119.54
3766,119.51
3767,119.72
3768,120.12
3769,120.64
3770,121.19
3771,121.67
3772,121.95
3773,121.95
3774,121.73
3775,121.49
3776,121.25
3777,121.00
3778,120.73
3779,120.51
3780,120.42
3781,120.36
3782,120.42
3783,120.67
3784,121.22
3785,121.95
3786,122.53
3787,122.80
3788,122.83
3789,122.77
3790,122.77
3791,122.80
3792,122.83
3793,122.80
3794,122.74
3795,122.77
3796,122.92
3797,123.11
3798,123.32
3799,123.57
3800,124.05
3801,124.73
3802,125.52
3803,126.22
3804,127.08
3805,127.96
3806,128.97
3807,129.88
3808,130.95
3809,132.08
3810,133.48
3811,134.89
3812,136.38
3813,137.79
3814,139.28
3815,140.66
3816,142.03
3817,143.16
3818,144.32
3819,145.48
3820,146.79
3821,147.92
3822,148.99
3823,149.90
3824,151.03
3825,152.19
3826,153.35
3827,154.27
3828,155.21
3829,156.37
3830,157.87
3831,159.30
3832,160.46
3833,161.19
3834,161.65
3835,161.83
3836,161.71
3837,161.29
3838,160.61
3839,159.82
3840,159.03
3841,158.36
3842,157.84
3843,157.35
3844,156.65
3845,155.73
3846,154.75
3847,153.75
3848,152.65
3849,151.49
3850,150.42
3851,149.69
3852,149.17
3853,148.74
3854,148.22
3855,147.80
3856,147.34
3857,146.88
3858,146.24
3859,145.54
3860,144.87
3861,144.38
3862,144.04
3863,143.86
3864,143.68
3865,143.43
3866,143.04
3867,142.58
3868,142.09
3869,141.63
3870,140.99
3871,140.32
3872,139.65
3873,139.13
3874,138.79
3875,138.61
3876,138.55
3877,138.52
3878,138.40
3879,138.18
3880,137.94
3881,137.70
3882,137.30
3883,136.84
3884,136.44
3885,136.20
3886,136.02
3887,135.80
3888,135.53
3889,135.28
3890,135.04
3891,134.80
3892,134.64
3893,134.64
3894,134.83
3895,135.07
3896,135.19
3897,135.19
3898,135.13
3899,135.13
3900,135.22
3901,135.19
3902,135.04
3903,134.83
3904,134.67
3905,134.67
3906,134.70
3907,134.70
3908,134.74
3909,134.74
3910,134.61
3911,134.34
3912,134.12
3913,134.12
3914,134.37
3915,134.61
3916,134.74
3917,134.74
3918,134.74
3919,134.74
3920,134.55
3921,134.09
3922,133.45
3923,132.93
3924,132.69
3925,132.72
3926,132.87
3927,133.12
3928,133.45
3929,133.94
3930,134.52
3931,135.01
3932,135.19
3933,135.22
3934,135.19
3935,135.16
3936,135.04
3937,134.83
3938,134.70
3939,134.67
3940,134.61
3941,134.37
3942,134.12
3943,133.85
3944,133.58
3945,133.33
3946,133.30
3947,133.51
3948,134.00
3949,134.70
3950,135.68
3951,136.87
3952,138.21
3953,139.43
3954,140.32
3955,140.81
3956,140.96
3957,140.93
3958,140.90
3959,140.87
3960,140.99
3961,141.17
3962,141.57
3963,142.03
3964,142.58
3965,143.07
3966,143.46
3967,143.68
3968,143.80
3969,143.77
3970,143.68
3971,143.68
3972,143.92
3973,144.38
3974,144.96
3975,145.45
3976,145.90
3977,146.39
3978,146.79
3979,147.06
3980,147.03
3981,146.82
3982,146.39
3983,145.94
3984,145.42
3985,144.93
3986,144.44
3987,143.98
3988,143.52
3989,143.04
3990,142.55
3991,142.09
3992,141.63
3993,141.17
3994,140.59
3995,139.89
3996,139.04
3997,138.09
3998,136.93
3999,135.77
4000,134.61
4001,133.67
4002,132.87
4003,132.20
4004,131.47
4005,130.52
4006,129.21
4007,127.81
4008,126.43
4009,125.21
4010,124.08
4011,123.20
4012,122.56
4013,122.31
4014,122.22
4015,122.28
4016,122.44
4017,122.68
4018,122.80
4019,122.83
4020,122.80
4021,122.80
4022,122.71
4023,122.50
4024,122.16
4025,121.92
4026,121.80
4027,121.83
4028,121.95
4029,122.16
4030,122.44
4031,122.71
4032,122.89
4033,122.89
4034,122.62
4035,122.16
4036,121.58
4037,121.09
4038,120.73
4039,120.48
4040,120.36
4041,120.39
4042,120.48
4043,120.48
4044,120.21
4045,119.75
4046,119.29
4047,119.02
4048,118.90
4049,118.93
4050,119.17
4051,119.63
4052,120.18
4053,120.70
4054,121.09
4055,121.34
4056,121.34
4057,121.12
4058,120.61
4059,119.90
4060,119.02
4061,118.04
4062,117.10
4063,116.12
4064,115.14
4065,114.20
4066,113.31
4067,112.61
4068,112.06
4069,111.88
4070,111.91
4071,112.15
4072,112.43
4073,112.70
4074,112.98
4075,113.22
4076,113.19
4077,112.98
4078,112.70
4079,112.43
4080,112.15
4081,111.94
4082,111.88
4083,111.88
4084,111.69
4085,111.21
4086,110.63
4087,110.11
4088,109.77
4089,109.56
4090,109.44
4091,109.41
4092,109.53
4093,109.77
4094,110.20
4095,110.66
4096,111.08
4097,111.30
4098,111.39
4099,111.39
4100,111.30
4101,111.08
4102,110.69
4103,110.20
4104,109.71
4105,109.50
4106,109.56
4107,109.80
4108,110.05
4109,110.29
4110,110.63
4111,111.11
4112,111.54
4113,111.79
4114,111.91
4115,111.91
4116,111.79
4117,111.51
4118,111.18
4119,110.96
4120,110.93
4121,110.93
4122,110.75
4123,110.53
4124,110.44
4125,110.44
4126,110.26
4127,109.80
4128,109.19
4129,108.73
4130,108.31
4131,107.85
4132,107.21
4133,106.51
4134,105.80
4135,105.10
4136,104.22
4137,103.24
4138,102.42
4139,101.93
4140,101.75
4141,101.78
4142,101.93
4143,102.42
4144,103.27
4145,104.28
4146,104.98
4147,105.19
4148,105.10
4149,104.86
4150,104.52
4151,104.03
4152,103.42
4153,102.91
4154,102.81
4155,103.03
4156,103.42
4157,103.91
4158,104.64
4159,105.56
4160,106.60
4161,107.57
4162,108.58
4163,109.50
4164,110.26
4165,110.72
4166,111.11
4167,111.54
4168,112.12
4169,112.58
4170,112.95
4171,113.13
4172,113.46
4173,113.92
4174,114.56
4175,115.23
4176,116.12
4177,117.34
4178,118.84
4179,120.27
4180,121.31
4181,121.80
4182,121.95
4183,121.89
4184,121.70
4185,121.49
4186,121.43
4187,121.61
4188,122.10
4189,122.86
4190,123.84
4191,124.82
4192,125.40
4193,125.43
4194,124.97
4195,124.24
4196,123.20
4197,122.04
4198,120.79
4199,119.63
4200,118.35
4201,116.94
4202,115.30
4203,113.40
4204,111.18
4205,108.83
4206,106.35
4207,104.25
4208,102.39
4209,101.01
4210,99.82
4211,98.94
4212,98.05
4213,97.17
4214,95.95
4215,94.54
4216,92.96
4217,91.49
4218,90.27
4219,89.63
4220,89.48
4221,89.72
4222,90.03
4223,90.33
4224,90.52
4225,90.52
4226,90.12
4227,89.42
4228,88.59
4229,87.83
4230,87.19
4231,86.70
4232,86.64
4233,87.10
4234,88.04
4235,89.23
4236,90.58
4237,92.01
4238,93.63
4239,95.28
4240,96.86
4241,98.30
4242,99.76
4243,101.14
4244,102.45
4245,103.64
4246,104.89
4247,106.05
4248,107.09
4249,107.79
4250,108.31
4251,108.49
4252,108.46
4253,108.22
4254,107.91
4255,107.64
4256,107.51
4257,107.51
4258,107.70
4259,107.91
4260,108.09
4261,108.06
4262,107.94
4263,107.91
4264,108.25
4265,108.95
4266,109.99
4267,111.21
4268,112.52
4269,113.71
4270,114.62
4271,115.11
4272,115.17
4273,114.93
4274,114.47
4275,113.95
4276,113.59
4277,113.59
4278,114.01
4279,114.75
4280,115.60
4281,116.30
4282,116.88
4283,117.34
4284,117.74
4285,117.98
4286,118.01
4287,117.77
4288,117.34
4289,116.82
4290,116.39
4291,116.15
4292,116.12
4293,116.09
4294,116.06
4295,116.03
4296,116.33
4297,117.00
4298,118.10
4299,119.26
4300,120.57
4301,121.98
4302,123.63
4303,125.31
4304,126.86
4305,128.02
4306,128.91
4307,129.58
4308,130.37
4309,131.26
4310,132.45
4311,133.88
4312,135.65
4313,137.54
4314,139.47
4315,141.11
4316,142.58
4317,143.74
4318,144.71
4319,145.39
4320,145.94
4321,146.39
4322,146.88
4323,147.37
4324,147.74
4325,147.74
4326,147.31
4327,146.55
4328,145.75
4329,144.99
4330,144.35
4331,143.89
4332,143.71
4333,143.71
4334,143.68
4335,143.46
4336,143.07
4337,142.55
4338,142.03
4339,141.54
4340,141.20
4341,141.20
4342,141.60
4343,142.36
4344,143.22
4345,143.95
4346,144.44
4347,144.62
4348,144.71
4349,144.71
4350,144.62
4351,144.38
4352,144.04
4353,143.74
4354,143.83
4355,144.32
4356,145.05
4357,145.75
4358,146.42
4359,147.13
4360,148.04
4361,148.96
4362,149.84
4363,150.54
4364,151.28
4365,152.22
4366,153.41
4367,154.60
4368,155.70
4369,156.65
4370,157.53
4371,158.23
4372,158.66
4373,158.66
4374,158.36
4375,157.84
4376,157.29
4377,156.77
4378,156.49
4379,156.49
4380,156.71
4381,156.98
4382,157.14
4383,157.14
4384,156.98
4385,156.77
4386,156.40
4387,155.94
4388,155.30
4389,154.60
4390,153.81
4391,153.14
4392,152.53
4393,152.04
4394,151.61
4395,151.40
4396,151.43
4397,151.64
4398,151.98
4399,152.25
4400,152.37
4401,152.37
4402,152.22
4403,151.98
4404,151.70
4405,151.49
4406,151.25
4407,151.00
4408,150.76
4409,150.57
4410,150.27
4411,149.75
4412,149.05
4413,148.35
4414,147.86
4415,147.58
4416,147.43
4417,147.46
4418,147.83
4419,148.53
4420,149.35
4421,150.12
4422,150.76
4423,151.18
4424,151.43
4425,151.46
4426,151.31
4427,151.03
4428,150.73
4429,150.48
4430,150.48
4431,150.73
4432,151.06
4433,151.31
4434,151.40
4435,151.43
4436,151.34
4437,151.09
4438,150.57
4439,149.87
4440,149.08
4441,148.38
4442,147.67
4443,147.00
4444,146.27
4445,145.54
4446,144.78
4447,144.07
4448,143.43
4449,143.01
4450,142.58
4451,142.12
4452,141.48
4453,140.81
4454,140.08
4455,139.34
4456,138.55
4457,137.85
4458,137.39
4459,137.15
4460,136.93
4461,136.75
4462,136.54
4463,136.29
4464,135.83
4465,135.16
4466,134.31
4467,133.58
4468,132.97
4469,132.54
4470,132.20
4471,131.96
4472,131.65
4473,131.23
4474,130.49
4475,129.55
4476,128.39
4477,127.23
4478,126.10
4479,125.12
4480,124.24
4481,123.57
4482,123.05
4483,122.56
4484,121.89
4485,121.22
4486,120.73
4487,120.48
4488,120.18
4489,119.78
4490,119.29
4491,119.02
4492,118.93
4493,118.99
4494,119.05
4495,119.02
4496,118.84
4497,118.62
4498,118.50
4499,118.47
4500,118.38
4501,118.23
4502,117.98
4503,117.68
4504,117.25
4505,116.82
4506,116.64
4507,116.58
4508,116.42
4509,116.24
4510,116.24
4511,116.46
4512,116.52
4513,116.33
4514,116.09
4515,116.03
4516,116.12
4517,116.18
4518,116.12
4519,116.09
4520,116.12
4521,116.15
4522,116.12
4523,115.88
4524,115.33
4525,114.62
4526,113.92
4527,113.43
4528,113.10
4529,112.88
4530,112.76
4531,112.76
4532,112.79
4533,112.82
4534,112.76
4535,112.55
4536,112.00
4537,111.30
4538,110.57
4539,110.08
4540,109.86
4541,109.89
4542,110.05
4543,110.29
4544,110.53
4545,110.78
4546,110.99
4547,111.24
4548,111.48
4549,111.72
4550,111.97
4551,112.21
4552,112.49
4553,112.70
4554,112.82
4555,112.85
4556,112.76
4557,112.52
4558,112.09
4559,111.60
4560,111.18
4561,110.96
4562,110.81
4563,110.60
4564,110.20
4565,109.68
4566,109.25
4567,109.04
4568,108.95
4569,108.95
4570,109.01
4571,109.25
4572,109.77
4573,110.50
4574,111.21
4575,111.69
4576,111.97
4577,112.21
4578,112.52
4579,112.70
4580,112.76
4581,112.76
4582,113.01
4583,113.43
4584,113.95
4585,114.44
4586,115.14
4587,116.09
4588,117.07
4589,117.83
4590,118.23
4591,118.44
4592,118.56
4593,118.59
4594,118.38
4595,117.92
4596,117.22
4597,116.52
4598,115.75
4599,115.08
4600,114.38
4601,113.68
4602,112.82
4603,111.91
4604,110.84
4605,109.65
4606,108.22
4607,106.84
4608,105.53
4609,104.37
4610,103.03
4611,101.65
4612,100.22
4613,99.06
4614,97.90
4615,96.77
4616,95.52
4617,94.33
4618,93.14
4619,92.29
4620,91.55
4621,90.85
4622,89.81
4623,88.68
4624,87.55
4625,86.58
4626,85.51
4627,84.38
4628,83.19
4629,82.28
4630,81.36
4631,80.47
4632,79.41
4633,78.46
4634,77.64
4635,76.93
4636,76.17
4637,75.50
4638,74.95
4639,74.71
4640,74.68
4641,74.71
4642,74.71
4643,74.71
4644,74.68
4645,74.68
4646,74.68
4647,74.71
4648,74.74
4649,74.71
4650,74.65
4651,74.62
4652,74.86
4653,75.35
4654,75.90
4655,76.35
4656,76.81
4657,77.30
4658,77.82
4659,78.28
4660,78.70
4661,79.13
4662,79.86
4663,80.78
4664,81.94
4665,83.10
4666,84.41
4667,85.82
4668,87.46
4669,89.11
4670,90.73
4671,92.13
4672,93.48
4673,94.64
4674,95.67
4675,96.37
4676,96.86
4677,97.05
4678,97.08
4679,97.11
4680,97.14
4681,97.11
4682,96.95
4683,96.74
4684,96.65
4685,96.62
4686,96.50
4687,96.31
4688,96.07
4689,95.76
4690,95.37
4691,94.94
4692,94.57
4693,94.33
4694,93.99
4695,93.54
4696,93.08
4697,92.83
4698,92.74
4699,92.77
4700,92.86
4701,93.08
4702,93.44
4703,93.96
4704,94.51
4705,94.97
4706,95.34
4707,95.55
4708,95.73
4709,95.98
4710,96.28
4711,96.53
4712,96.68
4713,96.65
4714,96.56
4715,96.53
4716,96.77
4717,97.23
4718,97.90
4719,98.60
4720,99.40
4721,100.34
4722,101.50
4723,102.66
4724,103.79
4725,104.71
4726,105.65
4727,106.57
4728,107.57
4729,108.49
4730,109.47
4731,110.35
4732,111.42
4733,112.58
4734,114.04
4735,115.42
4736,116.70
4737,117.86
4738,119.29
4739,120.91
4740,122.74
4741,124.36
4742,126.01
4743,127.62
4744,129.39
4745,131.04
4746,132.54
4747,133.73
4748,134.77
4749,135.65
4750,136.66
4751,137.85
4752,139.37
4753,141.02
4754,142.61
4755,143.83
4756,144.62
4757,144.81
4758,144.38
4759,143.46
4760,142.21
4761,140.75
4762,139.04
4763,137.39
4764,136.02
4765,135.07
4766,134.34
4767,133.70
4768,132.87
4769,131.96
4770,130.74
4771,129.36
4772,127.59
4773,125.70
4774,123.69
4775,121.80
4776,120.00
4777,118.35
4778,116.76
4779,115.36
4780,114.11
4781,113.19
4782,112.40
4783,111.69
4784,110.96
4785,110.32
4786,109.59
4787,108.89
4788,108.09
4789,107.39
4790,106.87
4791,106.66
4792,106.51
4793,106.32
4794,105.96
4795,105.47
4796,104.80
4797,104.16
4798,103.42
4799,102.69
4800,101.90
4801,101.23
4802,100.68
4803,100.22
4804,99.55
4805,98.63
4806,97.41
4807,96.01
4808,94.21
4809,92.32
4810,90.55
4811,89.36
4812,88.71
4813,88.56
4814,88.44
4815,88.26
4816,87.74
4817,87.07
4818,86.09
4819,84.93
4820,83.40
4821,81.73
4822,80.11
4823,78.95
4824,78.19
4825,77.73
4826,77.36
4827,77.15
4828,77.09
4829,77.36
4830,77.79
4831,78.31
4832,78.70
4833,78.95
4834,78.95
4835,78.74
4836,78.28
4837,77.55
4838,76.51
4839,75.35
4840,74.13
4841,72.91
4842,71.62
4843,70.47
4844,69.61
4845,69.12
4846,68.79
4847,68.60
4848,68.51
4849,68.48
4850,68.39
4851,68.21
4852,67.93
4853,67.69
4854,67.35
4855,66.89
4856,66.31
4857,65.80
4858,65.55
4859,65.55
4860,65.77
4861,65.95
4862,66.25
4863,66.71
4864,67.47
4865,68.42
4866,69.52
4867,70.68
4868,72.11
4869,73.76
4870,75.59
4871,77.24
4872,78.77
4873,80.14
4874,81.73
4875,83.34
4876,85.08
4877,86.70
4878,88.44
4879,90.30
4880,92.50
4881,94.57
4882,96.59
4883,98.21
4884,99.76
4885,101.14
4886,102.51
4887,103.61
4888,104.83
4889,106.20
4890,108.15
4891,110.50
4892,113.19
4893,115.81
4894,118.44
4895,120.79
4896,122.80
4897,124.24
4898,125.12
4899,125.55
4900,125.70
4901,125.70
4902,125.67
4903,125.40
4904,124.91
4905,124.18
4906,123.41
4907,122.68
4908,121.92
4909,121.19
4910,120.70
4911,120.70
4912,121.15
4913,121.64
4914,121.92
4915,121.95
4916,121.83
4917,121.55
4918,121.00
4919,120.30
4920,119.78
4921,119.75
4922,120.15
4923,120.91
4924,121.95
4925,123.17
4926,124.21
4927,124.73
4928,124.48
4929,123.47
4930,122.04
4931,120.54
4932,119.42
4933,118.93
4934,119.20
4935,120.21
4936,121.64
4937,123.05
4938,124.27
4939,125.24
4940,126.10
4941,126.77
4942,127.17
4943,127.44
4944,127.90
4945,128.54
4946,129.30
4947,130.04
4948,130.92
4949,131.81
4950,132.66
4951,133.36
4952,134.34
4953,135.68
4954,137.48
4955,139.40
4956,141.54
4957,143.62
4958,145.66
4959,147.31
4960,148.77
4961,149.93
4962,150.88
4963,151.55
4964,152.13
4965,152.56
4966,153.08
4967,153.56
4968,153.96
4969,154.14
4970,154.27
4971,154.27
4972,154.17
4973,153.93
4974,153.50
4975,153.05
4976,152.65
4977,152.40
4978,152.19
4979,151.98
4980,151.73
4981,151.52
4982,151.18
4983,150.73
4984,150.12
4985,149.41
4986,148.53
4987,147.55
4988,146.58
4989,145.90
4990,145.51
4991,145.26
4992,144.99
4993,144.74
4994,144.74
4995,144.99
4996,145.23
4997,145.26
4998,145.08
4999,144.84
5000,144.47
5001,144.01
5002,143.43
5003,142.97
5004,142.70
5005,142.67
5006,142.88
5007,143.40
5008,144.23
5009,145.17
5010,146.03
5011,146.79
5012,147.43
5013,147.89
5014,147.98
5015,147.80
5016,147.46
5017,146.94
5018,146.09
5019,145.17
5020,144.47
5021,144.23
5022,144.13
5023,143.95
5024,143.55
5025,143.04
5026,142.46
5027,141.78
5028,140.93
5029,139.95
5030,138.92
5031,138.21
5032,138.09
5033,138.58
5034,139.34
5035,140.14
5036,140.75
5037,141.27
5038,141.33
5039,140.90
5040,139.83
5041,138.43
5042,136.66
5043,134.77
5044,132.72
5045,130.86
5046,129.18
5047,127.75
5048,126.34
5049,124.94
5050,123.57
5051,122.38
5052,121.34
5053,120.39
5054,119.45
5055,118.77
5056,118.35
5057,118.13
5058,117.86
5059,117.65
5060,117.58
5061,117.86
5062,118.13
5063,118.16
5064,117.83
5065,117.34
5066,116.85
5067,116.33
5068,115.84
5069,115.36
5070,115.05
5071,115.05
5072,115.30
5073,115.78
5074,116.52
5075,117.46
5076,118.62
5077,119.81
5078,120.97
5079,121.89
5080,122.68
5081,123.38
5082,124.11
5083,124.82
5084,125.55
5085,126.22
5086,127.04
5087,127.96
5088,129.09
5089,130.25
5090,131.50
5091,132.66
5092,133.91
5093,135.07
5094,136.20
5095,137.08
5096,138.00
5097,138.95
5098,140.05
5099,140.96
5100,141.66
5101,142.12
5102,142.55
5103,143.04
5104,143.49
5105,143.71
5106,143.74
5107,143.71
5108,143.89
5109,144.10
5110,144.26
5111,144.26
5112,144.32
5113,144.53
5114,144.78
5115,144.81
5116,144.56
5117,144.32
5118,144.20
5119,144.23
5120,144.23
5121,143.95
5122,143.46
5123,143.01
5124,142.70
5125,142.46
5126,142.00
5127,141.33
5128,140.56
5129,139.83
5130,138.98
5131,138.06
5132,137.15
5133,136.41
5134,135.83
5135,135.41
5136,135.04
5137,134.80
5138,134.55
5139,134.37
5140,134.09
5141,133.64
5142,132.75
5143,131.59
5144,130.25
5145,129.06
5146,127.96
5147,127.04
5148,126.25
5149,125.79
5150,125.55
5151,125.58
5152,125.70
5153,125.98
5154,126.34
5155,126.59
5156,126.50
5157,126.01
5158,125.31
5159,124.60
5160,123.87
5161,123.17
5162,122.50
5163,122.04
5164,121.73
5165,121.49
5166,121.19
5167,120.73
5168,120.12
5169,119.38
5170,118.50
5171,117.55
5172,116.70
5173,116.21
5174,116.12
5175,116.39
5176,116.82
5177,117.31
5178,117.80
5179,118.29
5180,118.68
5181,118.93
5182,118.99
5183,119.02
5184,119.02
5185,118.99
5186,118.96
5187,118.96
5188,119.11
5189,119.35
5190,119.51
5191,119.54
5192,119.48
5193,119.45
5194,119.51
5195,119.51
5196,119.45
5197,119.45
5198,119.57
5199,119.81
5200,120.06
5201,120.06
5202,119.72
5203,119.26
5204,118.80
5205,118.32
5206,117.68
5207,116.97
5208,116.33
5209,115.91
5210,115.39
5211,114.69
5212,113.71
5213,112.79
5214,112.00
5215,111.30
5216,110.38
5217,109.50
5218,108.64
5219,107.94
5220,107.06
5221,105.90
5222,104.46
5223,103.06
5224,101.56
5225,100.16
5226,98.79
5227,97.63
5228,96.59
5229,95.64
5230,94.67
5231,93.75
5232,92.83
5233,91.92
5234,90.67
5235,89.26
5236,87.77
5237,86.61
5238,85.66
5239,85.02
5240,84.41
5241,83.95
5242,83.53
5243,83.07
5244,82.43
5245,81.73
5246,81.02
5247,80.57
5248,80.26
5249,80.08
5250,79.83
5251,79.62
5252,79.28
5253,78.86
5254,78.13
5255,77.18
5256,75.99
5257,74.80
5258,73.67
5259,72.75
5260,71.90
5261,71.23
5262,70.56
5263,69.89
5264,68.94
5265,67.78
5266,66.31
5267,64.91
5268,63.60
5269,62.68
5270,62.01
5271,61.55
5272,61.13
5273,60.97
5274,60.97
5275,60.97
5276,60.61
5277,59.94
5278,59.14
5279,58.38
5280,57.53
5281,56.64
5282,55.79
5283,55.05
5284,54.23
5285,53.31
5286,52.34
5287,51.36
5288,50.29
5289,49.13
5290,47.94
5291,46.94
5292,46.23
5293,46.05
5294,46.42
5295,47.15
5296,47.82
5297,48.37
5298,48.74
5299,48.95
5300,48.80
5301,48.37
5302,47.82
5303,47.30
5304,46.75
5305,46.36
5306,46.14
5307,46.08
5308,46.02
5309,45.84
5310,45.56
5311,45.04
5312,44.13
5313,42.97
5314,41.84
5315,41.11
5316,40.62
5317,40.19
5318,39.73
5319,39.49
5320,39.43
5321,39.49
5322,39.31
5323,38.85
5324,38.12
5325,37.38
5326,36.77
5327,36.29
5328,35.95
5329,35.68
5330,35.68
5331,36.13
5332,37.20
5333,38.60
5334,40.19
5335,41.90
5336,43.82
5337,45.68
5338,47.27
5339,48.46
5340,49.59
5341,50.69
5342,51.94
5343,53.13
5344,54.47
5345,55.82
5346,57.34
5347,58.72
5348,60.24
5349,61.58
5350,62.96
5351,64.06
5352,65.31
5353,66.68
5354,68.54
5355,70.62
5356,73.00
5357,75.32
5358,77.91
5359,80.47
5360,83.13
5361,85.45
5362,87.71
5363,89.72
5364,92.04
5365,94.33
5366,96.92
5367,99.46
5368,102.39
5369,105.38
5370,108.83
5371,112.30
5372,116.18
5373,119.93
5374,123.72
5375,126.95
5376,129.97
5377,132.48
5378,135.07
5379,137.33
5380,139.65
5381,141.66
5382,144.01
5383,146.51
5384,149.66
5385,152.92
5386,156.49
5387,159.73
5388,162.96
5389,165.71
5390,168.43
5391,170.72
5392,172.97
5393,175.02
5394,177.31
5395,179.60
5396,182.25
5397,184.81
5398,187.47
5399,189.79
5400,191.99
5401,193.85
5402,195.56
5403,196.93
5404,198.15
5405,199.07
5406,199.86
5407,200.29
5408,200.53
5409,200.47
5410,200.38
5411,200.35
5412,200.62
5413,201.08
5414,201.69
5415,202.42
5416,203.25
5417,204.01
5418,204.35
5419,204.13
5420,203.28
5421,202.06
5422,200.65
5423,199.25
5424,197.78
5425,196.35
5426,195.01
5427,194.09
5428,193.57
5429,193.39
5430,193.08
5431,192.69
5432,192.05
5433,191.35
5434,190.31
5435,188.96
5436,187.07
5437,184.94
5438,182.53
5439,180.18
5440,177.92
5441,176.06
5442,174.38
5443,173.00
5444,171.63
5445,170.50
5446,169.34
5447,168.21
5448,166.78
5449,165.16
5450,163.24
5451,161.38
5452,159.45
5453,157.84
5454,156.37
5455,155.24
5456,154.21
5457,153.29
5458,152.22
5459,151.09
5460,149.75
5461,148.32
5462,146.67
5463,145.02
5464,143.52
5465,142.30
5466,141.30
5467,140.66
5468,140.32
5469,140.35
5470,140.38
5471,140.38
5472,140.50
5473,140.99
5474,141.72
5475,142.49
5476,143.01
5477,143.25
5478,143.31
5479,143.31
5480,143.22
5481,142.97
5482,142.58
5483,142.09
5484,141.60
5485,141.14
5486,140.66
5487,140.14
5488,139.74
5489,139.50
5490,139.50
5491,139.71
5492,140.17
5493,140.87
5494,141.91
5495,143.13
5496,144.32
5497,145.26
5498,146.00
5499,146.45
5500,146.70
5501,146.67
5502,146.51
5503,146.24
5504,146.06
5505,146.03
5506,146.27
5507,146.73
5508,147.43
5509,148.13
5510,148.83
5511,149.54
5512,150.36
5513,151.31
5514,152.34
5515,153.32
5516,154.17
5517,154.91
5518,155.49
5519,155.73
5520,155.43
5521,154.69
5522,153.78
5523,153.05
5524,152.65
5525,152.40
5526,152.19
5527,151.95
5528,151.76
5529,151.55
5530,151.06
5531,150.33
5532,149.60
5533,149.11
5534,148.93
5535,148.93
5536,149.02
5537,149.29
5538,149.72
5539,150.21
5540,150.51
5541,150.54
5542,150.36
5543,150.09
5544,149.72
5545,149.26
5546,148.77
5547,148.25
5548,147.83
5549,147.58
5550,147.64
5551,147.89
5552,148.10
5553,148.13
5554,147.98
5555,147.74
5556,147.31
5557,146.85
5558,146.45
5559,146.21
5560,146.03
5561,145.81
5562,145.51
5563,145.29
5564,145.08
5565,144.87
5566,144.44
5567,143.98
5568,143.59
5569,143.37
5570,143.19
5571,142.94
5572,142.61
5573,142.40
5574,142.30
5575,142.33
5576,142.24
5577,142.03
5578,141.72
5579,141.48
5580,141.27
5581,141.08
5582,140.72
5583,140.26
5584,139.56
5585,138.64
5586,137.42
5587,135.96
5588,134.34
5589,132.93
5590,131.87
5591,131.16
5592,130.55
5593,129.85
5594,129.06
5595,128.36
5596,127.66
5597,126.98
5598,126.22
5599,125.52
5600,124.85
5601,124.42
5602,124.08
5603,123.90
5604,123.57
5605,123.11
5606,122.47
5607,121.73
5608,120.97
5609,120.30
5610,119.60
5611,118.90
5612,118.07
5613,117.40
5614,116.85
5615,116.42
5616,115.72
5617,114.81
5618,113.68
5619,112.76
5620,111.97
5621,111.30
5622,110.41
5623,109.50
5624,108.52
5625,107.57
5626,106.48
5627,105.32
5628,104.16
5629,103.21
5630,102.36
5631,101.68
5632,101.14
5633,100.92
5634,100.89
5635,100.95
5636,100.74
5637,100.31
5638,99.58
5639,98.60
5640,97.29
5641,95.92
5642,94.60
5643,93.38
5644,92.04
5645,90.67
5646,89.32
5647,88.10
5648,86.85
5649,85.69
5650,84.78
5651,84.29
5652,84.11
5653,84.17
5654,84.32
5655,84.56
5656,84.84
5657,85.05
5658,85.27
5659,85.51
5660,85.85
5661,86.06
5662,86.06
5663,85.85
5664,85.57
5665,85.30
5666,84.96
5667,84.50
5668,83.98
5669,83.50
5670,83.04
5671,82.58
5672,82.06
5673,81.57
5674,81.15
5675,80.93
5676,80.90
5677,80.87
5678,80.84
5679,80.87
5680,80.99
5681,81.24
5682,81.39
5683,81.39
5684,81.33
5685,81.33
5686,81.36
5687,81.33
5688,81.39
5689,81.57
5690,82.18
5691,83.16
5692,84.35
5693,85.54
5694,86.61
5695,87.59
5696,88.53
5697,89.20
5698,89.54
5699,89.57
5700,89.51
5701,89.45
5702,89.39
5703,89.39
5704,89.78
5705,90.45
5706,91.19
5707,91.67
5708,92.07
5709,92.53
5710,93.05
5711,93.51
5712,93.93
5713,94.39
5714,95.06
5715,95.76
5716,96.41
5717,96.86
5718,97.32
5719,97.75
5720,98.27
5721,98.72
5722,99.27
5723,99.98
5724,100.89
5725,101.84
5726,102.75
5727,103.45
5728,104.03
5729,104.49
5730,104.89
5731,105.07
5732,105.22
5733,105.44
5734,105.96
5735,106.66
5736,107.48
5737,108.18
5738,108.89
5739,109.56
5740,110.32
5741,111.02
5742,111.66
5743,112.15
5744,112.49
5745,112.70
5746,112.88
5747,113.13
5748,113.49
5749,113.95
5750,114.50
5751,114.96
5752,115.39
5753,115.63
5754,115.66
5755,115.39
5756,114.90
5757,114.44
5758,114.11
5759,113.83
5760,113.56
5761,113.34
5762,113.40
5763,113.62
5764,113.71
5765,113.53
5766,113.10
5767,112.58
5768,111.97
5769,111.27
5770,110.57
5771,110.08
5772,109.86
5773,109.89
5774,110.05
5775,110.26
5776,110.53
5777,110.81
5778,110.93
5779,110.93
5780,110.84
5781,110.81
5782,111.02
5783,111.51
5784,112.24
5785,112.95
5786,113.53
5787,114.01
5788,114.50
5789,114.93
5790,115.30
5791,115.54
5792,115.84
5793,116.27
5794,116.91
5795,117.65
5796,118.50
5797,119.42
5798,120.42
5799,121.37
5800,122.38
5801,123.26
5802,124.21
5803,125.15
5804,126.22
5805,127.14
5806,127.87
5807,128.33
5808,128.78
5809,129.24
5810,129.58
5811,129.58
5812,129.36
5813,129.09
5814,128.97
5815,128.94
5816,129.06
5817,129.30
5818,129.73
5819,130.16
5820,130.52
5821,130.80
5822,131.07
5823,131.32
5824,131.35
5825,131.10
5826,130.71
5827,130.46
5828,130.43
5829,130.43
5830,130.28
5831,130.04
5832,130.00
5833,130.22
5834,130.52
5835,130.80
5836,131.04
5837,131.29
5838,131.44
5839,131.44
5840,131.29
5841,131.07
5842,130.74
5843,130.25
5844,129.58
5845,128.88
5846,128.27
5847,127.78
5848,127.26
5849,126.83
5850,126.59
5851,126.59
5852,126.53
5853,126.31
5854,126.01
5855,125.76
5856,125.46
5857,125.03
5858,124.36
5859,123.63
5860,122.89
5861,122.22
5862,121.49
5863,120.79
5864,120.06
5865,119.35
5866,118.59
5867,117.89
5868,117.25
5869,116.79
5870,116.42
5871,116.24
5872,116.03
5873,115.81
5874,115.42
5875,114.99
5876,114.47
5877,114.01
5878,113.40
5879,112.73
5880,111.97
5881,111.27
5882,110.50
5883,109.83
5884,109.16
5885,108.70
5886,108.37
5887,108.15
5888,107.88
5889,107.42
5890,106.66
5891,105.68
5892,104.64
5893,103.70
5894,102.84
5895,102.14
5896,101.53
5897,101.07
5898,100.71
5899,100.46
5900,100.34
5901,100.37
5902,100.43
5903,100.43
5904,100.31
5905,100.07
5906,99.82
5907,99.58
5908,99.27
5909,98.79
5910,98.21
5911,97.72
5912,97.47
5913,97.47
5914,97.66
5915,97.90
5916,98.14
5917,98.39
5918,98.63
5919,98.91
5920,99.06
5921,99.06
5922,98.88
5923,98.60
5924,98.48
5925,98.48
5926,98.51
5927,98.54
5928,98.51
5929,98.51
5930,98.51
5931,98.51
5932,98.48
5933,98.51
5934,98.54
5935,98.54
5936,98.42
5937,98.18
5938,97.90
5939,97.66
5940,97.44
5941,97.20
5942,96.95
5943,96.74
5944,96.50
5945,96.22
5946,96.04
5947,96.07
5948,96.25
5949,96.50
5950,96.62
5951,96.65
5952,96.65
5953,96.65
5954,96.50
5955,96.25
5956,96.07
5957,96.07
5958,96.16
5959,96.16
5960,96.07
5961,96.07
5962,96.31
5963,96.53
5964,96.50
5965,96.28
5966,96.13
5967,96.10
5968,96.01
5969,95.79
5970,95.61
5971,95.58
5972,95.64
5973,95.67
5974,95.64
5975,95.64
5976,95.58
5977,95.40
5978,94.91
5979,94.21
5980,93.29
5981,92.32
5982,91.40
5983,90.70
5984,90.24
5985,89.97
5986,89.84
5987,89.87
5988,90.09
5989,90.30
5990,90.36
5991,90.42
5992,90.58
5993,90.79
5994,90.76
5995,90.61
5996,90.42
5997,90.42
5998,90.27
5999,89.87
6000,89.14
6001,88.41
6002,87.68
6003,87.01
6004,86.21
6005,85.27
6006,84.11
6007,82.92
6008,81.79
6009,80.87
6010,79.96
6011,79.01
6012,77.97
6013,77.30
6014,77.06
6015,77.06
6016,76.90
6017,76.48
6018,75.90
6019,75.41
6020,74.83
6021,74.16
6022,73.43
6023,72.94
6024,72.69
6025,72.48
6026,72.08
6027,71.62
6028,71.17
6029,70.92
6030,70.83
6031,70.83
6032,70.92
6033,71.17
6034,71.62
6035,72.08
6036,72.42
6037,72.69
6038,73.03
6039,73.46
6040,73.94
6041,74.43
6042,75.10
6043,76.05
6044,77.12
6045,78.09
6046,78.95
6047,79.68
6048,80.20
6049,80.38
6050,80.38
6051,80.38
6052,80.60
6053,80.81
6054,80.81
6055,80.60
6056,80.35
6057,80.11
6058,79.65
6059,78.95
6060,78.19
6061,77.70
6062,77.48
6063,77.51
6064,77.67
6065,77.91
6066,78.13
6067,78.16
6068,77.76
6069,77.06
6070,76.14
6071,75.20
6072,74.19
6073,73.24
6074,72.42
6075,71.93
6076,71.87
6077,72.11
6078,72.45
6079,72.78
6080,72.85
6081,72.57
6082,71.87
6083,70.95
6084,70.07
6085,69.31
6086,68.54
6087,67.87
6088,67.44
6089,67.44
6090,67.60
6091,67.66
6092,67.44
6093,67.20
6094,66.96
6095,66.74
6096,66.41
6097,65.95
6098,65.43
6099,64.91
6100,64.42
6101,63.96
6102,63.57
6103,63.32
6104,63.26
6105,63.26
6106,63.23
6107,63.26
6108,63.39
6109,63.60
6110,63.78
6111,63.78
6112,63.75
6113,63.69
6114,63.75
6115,64.00
6116,64.54
6117,65.28
6118,65.98
6119,66.41
6120,66.74
6121,67.20
6122,68.02
6123,68.91
6124,69.85
6125,70.77
6126,72.11
6127,73.73
6128,75.56
6129,77.21
6130,78.86
6131,80.44
6132,82.24
6133,84.11
6134,86.27
6135,88.59
6136,91.37
6137,94.15
6138,97.08
6139,99.91
6140,102.97
6141,105.74
6142,108.25
6143,110.11
6144,111.76
6145,113.07
6146,114.32
6147,115.23
6148,116.18
6149,117.03
6150,118.04
6151,118.96
6152,120.06
6153,121.19
6154,122.56
6155,123.96
6156,125.46
6157,126.86
6158,128.27
6159,129.67
6160,131.16
6161,132.60
6162,133.91
6163,134.83
6164,135.44
6165,135.93
6166,136.47
6167,136.90
6168,137.15
6169,137.15
6170,137.12
6171,137.08
6172,137.02
6173,136.78
6174,136.47
6175,136.20
6176,136.05
6177,136.08
6178,136.29
6179,136.47
6180,136.60
6181,136.63
6182,136.69
6183,136.66
6184,136.35
6185,135.93
6186,135.59
6187,135.56
6188,135.65
6189,135.96
6190,136.51
6191,137.21
6192,137.70
6193,137.73
6194,137.36
6195,136.87
6196,136.29
6197,135.59
6198,134.67
6199,133.70
6200,132.97
6201,132.72
6202,132.97
6203,133.48
6204,134.00
6205,134.52
6206,134.92
6207,135.19
6208,135.01
6209,134.34
6210,133.15
6211,131.71
6212,130.04
6213,128.42
6214,126.83
6215,125.43
6216,123.99
6217,122.62
6218,121.12
6219,119.75
6220,118.23
6221,116.61
6222,114.59
6223,112.52
6224,110.26
6225,108.15
6226,105.96
6227,103.88
6228,101.78
6229,99.95
6230,98.02
6231,96.19
6232,94.18
6233,92.32
6234,90.45
6235,88.87
6236,87.19
6237,85.60
6238,83.77
6239,81.94
6240,79.80
6241,77.70
6242,75.50
6243,73.64
6244,72.05
6245,70.95
6246,69.92
6247,69.00
6248,67.99
6249,67.11
6250,66.10
6251,64.94
6252,63.35
6253,61.71
6254,60.21
6255,59.27
6256,58.72
6257,58.53
6258,58.56
6259,58.81
6260,59.11
6261,59.39
6262,59.51
6263,59.54
6264,59.36
6265,59.11
6266,58.87
6267,58.62
6268,58.41
6269,58.17
6270,57.92
6271,57.68
6272,57.40
6273,57.16
6274,57.07
6275,57.07
6276,57.10
6277,57.10
6278,57.07
6279,57.07
6280,57.10
6281,57.10
6282,57.07
6283,57.07
6284,57.13
6285,57.34
6286,57.80
6287,58.53
6288,59.45
6289,60.39
6290,61.37
6291,62.32
6292,63.26
6293,64.00
6294,64.33
6295,64.30
6296,64.18
6297,64.15
6298,64.33
6299,64.51
6300,64.82
6301,65.31
6302,66.16
6303,67.05
6304,67.90
6305,68.60
6306,69.55
6307,70.68
6308,71.96
6309,73.12
6310,74.46
6311,76.08
6312,78.13
6313,80.26
6314,82.40
6315,84.29
6316,86.09
6317,87.71
6318,89.23
6319,90.42
6320,91.31
6321,91.74
6322,91.92
6323,91.89
6324,91.86
6325,91.83
6326,91.92
6327,92.13
6328,92.56
6329,93.02
6330,93.44
6331,93.66
6332,93.84
6333,94.09
6334,94.39
6335,94.64
6336,94.70
6337,94.70
6338,94.76
6339,95.00
6340,95.37
6341,95.61
6342,95.64
6343,95.64
6344,95.73
6345,96.01
6346,96.25
6347,96.25
6348,95.92
6349,95.46
6350,95.00
6351,94.54
6352,93.84
6353,92.90
6354,91.80
6355,90.85
6356,90.00
6357,89.32
6358,88.65
6359,87.95
6360,87.10
6361,86.15
6362,85.17
6363,84.23
6364,83.22
6365,82.28
6366,81.45
6367,80.99
6368,80.81
6369,80.84
6370,80.90
6371,80.90
6372,80.87
6373,80.84
6374,80.93
6375,81.15
6376,81.57
6377,82.28
6378,83.37
6379,84.81
6380,86.52
6381,88.20
6382,89.72
6383,90.88
6384,91.80
6385,92.47
6386,93.11
6387,93.81
6388,94.73
6389,95.64
6390,96.53
6391,97.26
6392,97.90
6393,98.36
6394,98.54
6395,98.54
6396,98.57
6397,98.79
6398,99.21
6399,99.67
6400,100.22
6401,100.95
6402,101.90
6403,102.84
6404,103.58
6405,104.10
6406,104.43
6407,104.68
6408,104.61
6409,104.19
6410,103.33
6411,102.11
6412,100.52
6413,98.88
6414,97.35
6415,96.16
6416,95.09
6417,94.21
6418,93.38
6419,92.68
6420,91.83
6421,90.70
6422,89.14
6423,87.46
6424,85.72
6425,84.35
6426,83.25
6427,82.61
6428,82.03
6429,81.60
6430,81.15
6431,80.72
6432,80.05
6433,79.13
6434,77.85
6435,76.45
6436,74.86
6437,73.24
6438,71.38
6439,69.52
6440,67.54
6441,65.64
6442,63.69
6443,61.86
6444,60.03
6445,58.38
6446,56.67
6447,55.05
6448,53.41
6449,51.97
6450,50.72
6451,49.84
6452,49.13
6453,48.71
6454,48.25
6455,47.82
6456,47.30
6457,46.84
6458,46.33
6459,45.87
6460,45.44
6461,45.23
6462,45.17
6463,45.23
6464,45.07
6465,44.59
6466,43.70
6467,42.51
6468,41.11
6469,39.64
6470,38.30
6471,37.32
6472,36.96
6473,37.20
6474,37.90
6475,38.85
6476,40.04
6477,41.47
6478,43.18
6479,44.83
6480,46.36
6481,47.76
6482,49.35
6483,50.99
6484,52.61
6485,53.77
6486,54.57
6487,54.99
6488,55.33
6489,55.54
6490,55.76
6491,55.94
6492,56.46
6493,57.34
6494,58.81
6495,60.46
6496,62.23
6497,63.84
6498,65.52
6499,67.17
6500,68.94
6501,70.56
6502,72.14
6503,73.52
6504,74.95
6505,76.32
6506,77.85
6507,79.22
6508,80.69
6509,82.06
6510,83.56
6511,84.96
6512,86.33
6513,87.46
6514,88.62
6515,89.78
6516,91.13
6517,92.53
6518,94.02
6519,95.46
6520,96.83
6521,97.99
6522,99.00
6523,99.70
6524,100.19
6525,100.40
6526,100.37
6527,100.16
6528,99.76
6529,99.27
6530,98.72
6531,98.27
6532,97.84
6533,97.35
6534,96.74
6535,96.01
6536,95.31
6537,94.85
6538,94.54
6539,94.33
6540,94.12
6541,94.15
6542,94.42
6543,94.91
6544,95.34
6545,95.55
6546,95.73
6547,95.95
6548,96.25
6549,96.50
6550,96.74
6551,96.89
6552,97.23
6553,97.66
6554,98.42
6555,99.37
6556,100.49
6557,101.65
6558,103.03
6559,104.37
6560,105.90
6561,107.57
6562,109.59
6563,111.66
6564,113.80
6565,115.69
6566,117.55
6567,119.14
6568,120.64
6569,121.77
6570,122.89
6571,124.02
6572,125.43
6573,126.80
6574,128.27
6575,129.64
6576,131.26
6577,132.84
6578,134.58
6579,136.20
6580,138.03
6581,139.83
6582,141.91
6583,143.98
6584,146.45
6585,148.99
6586,151.86
6587,154.63
6588,157.68
6589,160.71
6590,163.97
6591,167.02
6592,169.98
6593,172.58
6594,174.96
6595,176.79
6596,178.22
6597,179.14
6598,179.87
6599,180.30
6600,180.51
6601,180.51
6602,180.51
6603,180.48
6604,180.30
6605,179.84
6606,179.14
6607,178.19
6608,176.82
6609,175.17
6610,173.37
6611,171.72
6612,170.10
6613,168.46
6614,166.60
6615,164.73
6616,162.87
6617,161.22
6618,159.55
6619,157.93
6620,156.28
6621,154.88
6622,153.53
6623,152.40
6624,151.28
6625,150.15
6626,148.65
6627,147.03
6628,145.23
6629,143.62
6630,141.94
6631,140.32
6632,138.64
6633,137.24
6634,136.05
6635,135.13
6636,134.25
6637,133.61
6638,133.06
6639,132.60
6640,131.90
6641,130.98
6642,129.91
6643,128.94
6644,127.99
6645,127.14
6646,126.16
6647,125.18
6648,124.15
6649,123.23
6650,122.50
6651,122.04
6652,121.61
6653,121.15
6654,120.61
6655,120.12
6656,119.75
6657,119.54
6658,119.45
6659,119.45
6660,119.45
6661,119.48
6662,119.51
6663,119.51
6664,119.35
6665,119.14
6666,118.90
6667,118.65
6668,118.26
6669,117.77
6670,117.46
6671,117.43
6672,117.68
6673,117.92
6674,118.13
6675,118.38
6676,118.68
6677,118.93
6678,118.93
6679,118.71
6680,118.32
6681,117.80
6682,117.22
6683,116.76
6684,116.64
6685,116.88
6686,117.25
6687,117.52
6688,117.58
6689,117.58
6690,117.49
6691,117.28
6692,116.85
6693,116.36
6694,115.97
6695,115.75
6696,115.57
6697,115.33
6698,115.02
6699,114.78
6700,114.72
6701,114.72
6702,114.59
6703,114.38
6704,114.14
6705,113.89
6706,113.46
6707,112.79
6708,111.88
6709,110.87
6710,109.92
6711,109.19
6712,108.89
6713,109.13
6714,109.86
6715,110.84
6716,111.88
6717,112.85
6718,113.65
6719,114.14
6720,114.26
6721,114.01
6722,113.43
6723,112.73
6724,112.00
6725,111.30
6726,110.47
6727,109.53
6728,108.43
6729,107.21
6730,105.96
6731,104.74
6732,103.73
6733,103.03
6734,102.57
6735,102.36
6736,102.29
6737,102.54
6738,103.09
6739,103.82
6740,104.49
6741,105.01
6742,105.32
6743,105.56
6744,105.68
6745,105.71
6746,105.62
6747,105.35
6748,104.89
6749,104.43
6750,104.13
6751,103.88
6752,103.52
6753,103.03
6754,102.69
6755,102.66
6756,102.87
6757,103.15
6758,103.39
6759,103.67
6760,103.85
6761,103.85
6762,103.58
6763,103.09
6764,102.54
6765,102.05
6766,101.59
6767,101.17
6768,100.65
6769,100.16
6770,99.73
6771,99.52
6772,99.46
6773,99.46
6774,99.37
6775,99.15
6776,98.88
6777,98.60
6778,98.36
6779,98.14
6780,97.93
6781,97.69
6782,97.38
6783,97.17
6784,97.05
6785,97.05
6786,97.05
6787,97.05
6788,97.14
6789,97.38
6790,97.75
6791,97.99
6792,97.93
6793,97.69
6794,97.50
6795,97.50
6796,97.60
6797,97.63
6798,97.47
6799,97.20
6800,96.95
6801,96.71
6802,96.50
6803,96.25
6804,96.01
6805,95.73
6806,95.55
6807,95.58
6808,95.76
6809,96.01
6810,96.16
6811,96.16
6812,96.13
6813,96.10
6814,96.10
6815,96.13
6816,96.22
6817,96.16
6818,95.92
6819,95.73
6820,95.76
6821,96.01
6822,96.04
6823,95.83
6824,95.58
6825,95.58
6826,95.61
6827,95.40
6828,94.91
6829,94.42
6830,94.18
6831,94.18
6832,94.21
6833,94.24
6834,94.33
6835,94.54
6836,94.82
6837,95.06
6838,95.31
6839,95.55
6840,95.70
6841,95.70
6842,95.52
6843,95.31
6844,95.12
6845,94.85
6846,94.45
6847,93.99
6848,93.63
6849,93.38
6850,93.05
6851,92.62
6852,92.07
6853,91.58
6854,91.13
6855,90.67
6856,90.18
6857,89.69
6858,89.26
6859,89.05
6860,88.96
6861,88.96
6862,88.96
6863,88.99
6864,89.02
6865,89.02
6866,88.90
6867,88.65
6868,88.38
6869,88.13
6870,87.89
6871,87.68
6872,87.46
6873,87.22
6874,86.94
6875,86.70
6876,86.58
6877,86.58
6878,86.58
6879,86.61
6880,86.64
6881,86.64
6882,86.49
6883,86.24
6884,86.09
6885,86.09
6886,86.12
6887,86.15
6888,86.15
6889,86.15
6890,86.06
6891,85.85
6892,85.48
6893,84.99
6894,84.38
6895,83.68
6896,82.89
6897,82.18
6898,81.57
6899,81.09
6900,80.69
6901,80.47
6902,80.41
6903,80.41
6904,80.32
6905,80.11
6906,79.83
6907,79.56
6908,79.32
6909,79.10
6910,78.89
6911,78.67
6912,78.31
6913,77.85
6914,77.33
6915,76.84
6916,76.32
6917,75.87
6918,75.50
6919,75.29
6920,75.07
6921,74.83
6922,74.58
6923,74.37
6924,74.04
6925,73.58
6926,72.88
6927,72.17
6928,71.56
6929,71.11
6930,70.62
6931,70.16
6932,69.76
6933,69.52
6934,69.34
6935,69.15
6936,68.82
6937,68.33
6938,67.72
6939,67.26
6940,67.05
6941,67.02
6942,67.02
6943,67.05
6944,67.23
6945,67.44
6946,67.47
6947,67.29
6948,67.02
6949,66.74
6950,66.35
6951,65.92
6952,65.61
6953,65.58
6954,65.64
6955,65.70
6956,65.73
6957,65.70
6958,65.46
6959,65.00
6960,64.48
6961,64.00
6962,63.35
6963,62.68
6964,62.10
6965,61.86
6966,61.83
6967,61.89
6968,61.83
6969,61.58
6970,61.00
6971,60.30
6972,59.63
6973,59.14
6974,58.78
6975,58.56
6976,58.59
6977,58.84
6978,59.02
6979,59.05
6980,58.90
6981,58.69
6982,58.32
6983,57.80
6984,57.28
6985,57.07
6986,57.25
6987,57.74
6988,58.29
6989,58.78
6990,59.27
6991,59.72
6992,60.06
6993,60.06
6994,59.75
6995,59.27
6996,58.72
6997,58.23
6998,57.86
6999,57.62
7000,57.53
7001,57.50
7002,57.62
7003,57.86
7004,58.26
7005,58.75
7006,59.14
7007,59.42
7008,59.54
7009,59.51
7010,59.36
7011,59.11
7012,58.87
7013,58.62
7014,58.41
7015,58.14
7016,57.95
7017,57.95
7018,58.17
7019,58.41
7020,58.56
7021,58.56
7022,58.53
7023,58.50
7024,58.50
7025,58.53
7026,58.59
7027,58.56
7028,58.35
7029,58.14
7030,58.07
7031,58.04
7032,57.83
7033,57.37
7034,56.92
7035,56.61
7036,56.52
7037,56.52
7038,56.79
7039,57.22
7040,57.80
7041,58.29
7042,58.78
7043,59.20
7044,59.69
7045,60.18
7046,60.70
7047,61.13
7048,61.49
7049,61.98
7050,62.81
7051,63.72
7052,64.51
7053,65.03
7054,65.49
7055,65.89
7056,66.19
7057,66.44
7058,66.99
7059,67.90
7060,69.00
7061,69.98
7062,70.89
7063,71.78
7064,72.81
7065,73.73
7066,74.58
7067,75.29
7068,76.05
7069,76.93
7070,78.22
7071,79.90
7072,82.09
7073,84.41
7074,86.76
7075,88.90
7076,91.06
7077,92.93
7078,94.30
7079,95.00
7080,95.46
7081,95.86
7082,96.41
7083,96.86
7084,97.35
7085,97.78
7086,98.27
7087,98.79
7088,99.24
7089,99.43
7090,99.40
7091,99.12
7092,98.94
7093,98.94
7094,99.09
7095,99.33
7096,99.61
7097,99.85
7098,100.01
7099,100.01
7100,99.85
7101,99.61
7102,99.30
7103,98.82
7104,98.11
7105,97.41
7106,96.89
7107,96.62
7108,96.53
7109,96.59
7110,96.74
7111,96.95
7112,97.08
7113,97.08
7114,97.17
7115,97.38
7116,97.69
7117,97.93
7118,98.14
7119,98.39
7120,98.60
7121,98.60
7122,98.36
7123,97.90
7124,97.23
7125,96.53
7126,95.73
7127,95.03
7128,94.42
7129,93.96
7130,93.51
7131,93.05
7132,92.53
7133,92.07
7134,91.61
7135,91.13
7136,90.58
7137,90.09
7138,89.87
7139,89.87
7140,89.90
7141,89.97
7142,89.97
7143,89.94
7144,89.84
7145,89.87
7146,90.15
7147,90.61
7148,91.03
7149,91.31
7150,91.49
7151,91.74
7152,91.92
7153,91.95
7154,91.77
7155,91.52
7156,91.25
7157,91.00
7158,90.79
7159,90.55
7160,90.27
7161,90.06
7162,89.84
7163,89.63
7164,89.26
7165,88.81
7166,88.23
7167,87.49
7168,86.55
7169,85.63
7170,84.90
7171,84.41
7172,83.92
7173,83.53
7174,83.19
7175,82.95
7176,82.49
7177,81.85
7178,80.93
7179,79.96
7180,78.89
7181,77.76
7182,76.45
7183,74.98
7184,73.33
7185,71.69
7186,70.19
7187,69.00
7188,67.93
7189,67.26
7190,66.47
7191,65.80
7192,65.64
7193,63.75
7194,66.53
7195,75.47
7196,76.29
7197,56.58
7198,43.88
7199,88.81
7200,130.49
