1,-74.95
2,-100.00
3,-100.00
4,-100.00
5,-100.00
6,-71.31
7,-4.66
8,62.88
9,98.49
10,100.00
11,99.22
12,98.55
13,100.00
14,100.00
15,100.00
16,100.00
17,99.88
18,100.00
19,100.00
20,100.00
21,100.00
22,100.00
23,100.00
24,100.00
25,100.00
26,100.00
27,100.00
28,100.00
29,100.00
30,100.00
31,100.00
32,100.00
33,100.00
34,99.97
35,100.00
36,100.00
37,99.25
38,97.19
39,94.50
40,91.78
41,89.41
42,86.62
43,83.30
44,79.45
45,75.88
46,72.46
47,69.40
48,66.29
49,63.47
50,60.64
51,58.12
52,55.56
53,53.27
54,50.92
55,48.84
56,46.69
57,44.79
58,42.81
59,41.05
60,39.23
61,37.62
62,35.94
63,34.46
64,32.90
65,31.49
66,30.00
67,28.72
68,27.39
69,26.10
70,24.46
71,22.71
72,20.82
73,19.11
74,17.40
75,15.83
76,14.18
77,12.68
78,11.15
79,9.75
80,8.30
81,6.99
82,5.65
83,4.46
84,3.23
85,2.15
86,1.02
87,0.01
88,-1.06
89,-2.02
90,-3.03
91,-3.93
92,-4.89
93,-5.74
94,-6.64
95,-7.44
96,-8.28
97,-9.04
98,-9.85
99,-10.57
100,-11.33
101,-12.01
102,-12.72
103,-13.38
104,-14.08
105,-14.73
106,-15.43
107,-16.08
108,-16.78
109,-17.42
110,-18.10
111,-18.71
112,-19.35
113,-19.93
114,-20.55
115,-21.09
116,-21.64
117,-22.11
118,-22.62
119,-23.09
120,-23.57
121,-23.99
122,-24.42
123,-24.82
124,-25.27
125,-25.69
126,-26.13
127,-26.52
128,-26.94
129,-27.32
130,-27.72
131,-28.06
132,-28.41
133,-28.71
134,-29.03
135,-29.30
136,-29.59
137,-29.82
138,-30.05
139,-30.24
140,-30.44
141,-30.63
142,-30.83
143,-31.02
144,-31.22
145,-31.41
146,-31.59
147,-31.76
148,-31.94
149,-32.11
150,-32.28
151,-32.42
152,-32.54
153,-32.63
154,-32.73
155,-32.82
156,-32.93
157,-33.04
158,-33.18
159,-33.34
160,-33.53
161,-33.73
162,-33.97
163,-34.22
164,-34.52
165,-34.82
166,-35.17
167,-35.50
168,-35.84
169,-36.16
170,-36.49
171,-36.79
172,-37.09
173,-37.36
174,-37.63
175,-37.84
176,-38.07
177,-38.26
178,-38.48
179,-38.67
180,-38.87
181,-39.05
182,-39.24
183,-39.42
184,-39.63
185,-39.83
186,-40.04
187,-40.23
188,-40.44
189,-40.64
190,-40.85
191,-41.04
192,-41.22
193,-41.39
194,-41.59
195,-41.76
196,-41.92
197,-42.04
198,-42.16
199,-42.27
200,-42.37
201,-42.44
202,-42.52
203,-42.58
204,-42.65
205,-42.71
206,-42.77
207,-42.83
208,-42.88
209,-42.93
210,-42.99
211,-43.04
212,-43.10
213,-43.15
214,-43.20
215,-43.25
216,-43.29
217,-43.30
218,-43.32
219,-43.34
220,-43.36
221,-43.37
222,-43.37
223,-43.39
224,-43.43
225,-43.48
226,-43.54
227,-43.61
228,-43.69
229,-43.78
230,-43.88
231,-43.96
232,-44.00
233,-44.00
234,-43.99
235,-44.00
236,-44.02
237,-44.02
238,-44.01
239,-44.00
240,-43.99
241,-43.98
242,-43.97
243,-43.96
244,-43.95
245,-43.92
246,-43.90
247,-43.87
248,-43.84
249,-43.83
250,-43.80
251,-43.77
252,-43.74
253,-43.72
254,-43.70
255,-43.68
256,-43.66
257,-43.66
258,-43.66
259,-43.67
260,-43.68
261,-43.69
262,-43.71
263,-43.73
264,-43.74
265,-43.74
266,-43.73
267,-43.72
268,-43.70
269,-43.68
270,-43.64
271,-43.59
272,-43.52
273,-43.45
274,-43.39
275,-43.33
276,-43.27
277,-43.21
278,-43.15
279,-43.11
280,-43.09
281,-43.09
282,-43.12
283,-43.15
284,-43.20
285,-43.25
286,-43.32
287,-43.41
288,-43.50
289,-43.58
290,-43.66
291,-43.74
292,-43.84
293,-43.93
294,-44.02
295,-44.09
296,-44.16
297,-44.22
298,-44.29
299,-44.36
300,-44.45
301,-44.54
302,-44.64
303,-44.71
304,-44.78
305,-44.84
306,-44.90
307,-44.96
308,-45.00
309,-45.02
310,-45.03
311,-45.02
312,-45.02
313,-45.02
314,-45.03
315,-45.06
316,-45.10
317,-45.15
318,-45.22
319,-45.32
320,-45.44
321,-45.57
322,-45.71
323,-45.84
324,-45.95
325,-46.05
326,-46.13
327,-46.19
328,-46.20
329,-46.19
330,-46.16
331,-46.11
332,-46.04
333,-45.97
334,-45.87
335,-45.78
336,-45.69
337,-45.61
338,-45.51
339,-45.41
340,-45.31
341,-45.21
342,-45.11
343,-45.03
344,-44.94
345,-44.87
346,-44.82
347,-44.80
348,-44.81
349,-44.82
350,-44.87
351,-44.93
352,-45.04
353,-45.17
354,-45.32
355,-45.49
356,-45.67
357,-45.87
358,-46.08
359,-46.30
360,-46.52
361,-46.72
362,-46.88
363,-47.00
364,-47.13
365,-47.26
366,-47.41
367,-47.54
368,-47.69
369,-47.83
370,-47.99
371,-48.14
372,-48.28
373,-48.42
374,-48.56
375,-48.71
376,-48.86
377,-49.00
378,-49.12
379,-49.21
380,-49.29
381,-49.35
382,-49.42
383,-49.49
384,-49.57
385,-49.63
386,-49.69
387,-49.74
388,-49.80
389,-49.86
390,-49.91
391,-49.95
392,-49.98
393,-50.00
394,-50.01
395,-50.02
396,-50.02
397,-50.02
398,-50.02
399,-50.01
400,-49.99
401,-49.98
402,-49.96
403,-49.95
404,-49.94
405,-49.93
406,-49.92
407,-49.93
408,-49.95
409,-49.98
410,-50.02
411,-50.06
412,-50.10
413,-50.14
414,-50.18
415,-50.22
416,-50.26
417,-50.30
418,-50.34
419,-50.38
420,-50.42
421,-50.46
422,-50.50
423,-50.55
424,-50.60
425,-50.66
426,-50.74
427,-50.81
428,-50.90
429,-50.99
430,-51.09
431,-51.19
432,-51.31
433,-51.43
434,-51.55
435,-51.68
436,-51.82
437,-51.96
438,-52.09
439,-52.22
440,-52.36
441,-52.49
442,-52.62
443,-52.73
444,-52.84
445,-52.94
446,-53.05
447,-53.15
448,-53.24
449,-53.32
450,-53.40
451,-53.49
452,-53.57
453,-53.63
454,-53.68
455,-53.72
456,-53.75
457,-53.78
458,-53.77
459,-53.74
460,-53.69
461,-53.63
462,-53.56
463,-53.49
464,-53.41
465,-53.32
466,-53.23
467,-53.16
468,-53.12
469,-53.09
470,-53.07
471,-53.07
472,-53.09
473,-53.11
474,-53.13
475,-53.14
476,-53.14
477,-53.13
478,-53.11
479,-53.07
480,-53.00
481,-52.91
482,-52.81
483,-52.72
484,-52.61
485,-52.50
486,-52.39
487,-52.29
488,-52.20
489,-52.14
490,-52.08
491,-52.03
492,-51.99
493,-51.95
494,-51.90
495,-51.84
496,-51.78
497,-51.71
498,-51.62
499,-51.54
500,-51.45
501,-51.38
502,-51.32
503,-51.26
504,-51.21
505,-51.17
506,-51.14
507,-51.12
508,-51.11
509,-51.13
510,-51.14
511,-51.15
512,-51.16
513,-51.17
514,-51.18
515,-51.20
516,-51.22
517,-51.23
518,-51.24
519,-51.24
520,-51.24
521,-51.24
522,-51.23
523,-51.22
524,-51.21
525,-51.18
526,-51.16
527,-51.13
528,-51.10
529,-51.07
530,-51.04
531,-51.01
532,-50.98
533,-50.95
534,-50.93
535,-50.93
536,-50.94
537,-50.95
538,-50.96
539,-50.98
540,-51.01
541,-51.05
542,-51.10
543,-51.14
544,-51.17
545,-51.21
546,-51.26
547,-51.30
548,-51.33
549,-51.35
550,-51.35
551,-51.35
552,-51.35
553,-51.35
554,-51.35
555,-51.35
556,-51.35
557,-51.36
558,-51.38
559,-51.40
560,-51.43
561,-51.46
562,-51.52
563,-51.60
564,-51.70
565,-51.79
566,-51.87
567,-51.94
568,-52.04
569,-52.14
570,-52.23
571,-52.31
572,-52.38
573,-52.45
574,-52.52
575,-52.59
576,-52.65
577,-52.70
578,-52.75
579,-52.81
580,-52.87
581,-52.92
582,-52.97
583,-53.02
584,-53.05
585,-53.09
586,-53.12
587,-53.15
588,-53.16
589,-53.15
590,-53.13
591,-53.10
592,-53.05
593,-52.98
594,-52.90
595,-52.80
596,-52.68
597,-52.55
598,-52.42
599,-52.30
600,-52.18
601,-52.06
602,-51.96
603,-51.89
604,-51.84
605,-51.80
606,-51.79
607,-51.79
608,-51.82
609,-51.85
610,-51.89
611,-51.93
612,-51.96
613,-51.97
614,-51.96
615,-51.93
616,-51.89
617,-51.84
618,-51.78
619,-51.71
620,-51.63
621,-51.53
622,-51.42
623,-51.32
624,-51.23
625,-51.15
626,-51.08
627,-51.02
628,-50.97
629,-50.94
630,-50.93
631,-50.93
632,-50.94
633,-50.97
634,-51.02
635,-51.08
636,-51.15
637,-51.23
638,-51.32
639,-51.42
640,-51.53
641,-51.64
642,-51.74
643,-51.82
644,-51.92
645,-52.00
646,-52.09
647,-52.16
648,-52.22
649,-52.26
650,-52.31
651,-52.33
652,-52.35
653,-52.36
654,-52.37
655,-52.40
656,-52.45
657,-52.50
658,-52.55
659,-52.61
660,-52.68
661,-52.77
662,-52.88
663,-52.98
664,-53.09
665,-53.18
666,-53.27
667,-53.33
668,-53.37
669,-53.37
670,-53.35
671,-53.32
672,-53.27
673,-53.20
674,-53.13
675,-53.05
676,-52.98
677,-52.91
678,-52.85
679,-52.80
680,-52.77
681,-52.76
682,-52.76
683,-52.76
684,-52.76
685,-52.76
686,-52.73
687,-52.68
688,-52.60
689,-52.51
690,-52.38
691,-52.24
692,-52.08
693,-51.92
694,-51.74
695,-51.57
696,-51.38
697,-51.20
698,-51.03
699,-50.88
700,-50.75
701,-50.64
702,-50.56
703,-50.50
704,-50.45
705,-50.43
706,-50.42
707,-50.43
708,-50.45
709,-50.50
710,-50.54
711,-50.59
712,-50.64
713,-50.69
714,-50.74
715,-50.79
716,-50.84
717,-50.89
718,-50.95
719,-51.00
720,-51.07
721,-51.13
722,-51.18
723,-51.23
724,-51.28
725,-51.34
726,-51.40
727,-51.45
728,-51.50
729,-51.54
730,-51.57
731,-51.60
732,-51.62
733,-51.63
734,-51.63
735,-51.62
736,-51.60
737,-51.59
738,-51.60
739,-51.60
740,-51.58
741,-51.55
742,-51.52
743,-51.50
744,-51.47
745,-51.44
746,-51.39
747,-51.34
748,-51.28
749,-51.21
750,-51.14
751,-51.08
752,-51.02
753,-50.95
754,-50.89
755,-50.85
756,-50.81
757,-50.78
758,-50.75
759,-50.75
760,-50.77
761,-50.79
762,-50.80
763,-50.81
764,-50.83
765,-50.86
766,-50.89
767,-50.90
768,-50.90
769,-50.89
770,-50.89
771,-50.88
772,-50.87
773,-50.86
774,-50.85
775,-50.85
776,-50.86
777,-50.87
778,-50.89
779,-50.93
780,-50.98
781,-51.03
782,-51.09
783,-51.17
784,-51.26
785,-51.34
786,-51.41
787,-51.48
788,-51.55
789,-51.62
790,-51.68
791,-51.72
792,-51.74
793,-51.75
794,-51.75
795,-51.72
796,-51.66
797,-51.59
798,-51.52
799,-51.44
800,-51.35
801,-51.25
802,-51.15
803,-51.07
804,-51.00
805,-50.93
806,-50.86
807,-50.79
808,-50.73
809,-50.68
810,-50.63
811,-50.60
812,-50.56
813,-50.52
814,-50.47
815,-50.42
816,-50.35
817,-50.29
818,-50.22
819,-50.15
820,-50.07
821,-50.00
822,-49.92
823,-49.82
824,-49.72
825,-49.62
826,-49.51
827,-49.41
828,-49.29
829,-49.17
830,-49.04
831,-48.92
832,-48.79
833,-48.67
834,-48.56
835,-48.45
836,-48.33
837,-48.21
838,-48.11
839,-48.03
840,-47.96
841,-47.90
842,-47.83
843,-47.77
844,-47.71
845,-47.65
846,-47.60
847,-47.55
848,-47.49
849,-47.42
850,-47.36
851,-47.31
852,-47.26
853,-47.21
854,-47.17
855,-47.16
856,-47.17
857,-47.19
858,-47.23
859,-47.29
860,-47.36
861,-47.43
862,-47.50
863,-47.58
864,-47.66
865,-47.73
866,-47.79
867,-47.85
868,-47.91
869,-47.97
870,-48.03
871,-48.08
872,-48.16
873,-48.23
874,-48.32
875,-48.41
876,-48.51
877,-48.60
878,-48.71
879,-48.80
880,-48.90
881,-48.99
882,-49.06
883,-49.12
884,-49.18
885,-49.23
886,-49.26
887,-49.28
888,-49.31
889,-49.33
890,-49.36
891,-49.37
892,-49.38
893,-49.41
894,-49.44
895,-49.48
896,-49.50
897,-49.52
898,-49.54
899,-49.56
900,-49.58
901,-49.60
902,-49.61
903,-49.60
904,-49.58
905,-49.56
906,-49.53
907,-49.49
908,-49.44
909,-49.38
910,-49.32
911,-49.26
912,-49.20
913,-49.15
914,-49.12
915,-49.10
916,-49.08
917,-49.07
918,-49.08
919,-49.09
920,-49.12
921,-49.16
922,-49.22
923,-49.27
924,-49.33
925,-49.40
926,-49.47
927,-49.53
928,-49.60
929,-49.67
930,-49.76
931,-49.85
932,-49.95
933,-50.03
934,-50.10
935,-50.17
936,-50.23
937,-50.27
938,-50.30
939,-50.30
940,-50.29
941,-50.26
942,-50.23
943,-50.19
944,-50.17
945,-50.15
946,-50.14
947,-50.15
948,-50.18
949,-50.24
950,-50.32
951,-50.42
952,-50.54
953,-50.67
954,-50.81
955,-50.94
956,-51.08
957,-51.21
958,-51.34
959,-51.44
960,-51.54
961,-51.61
962,-51.69
963,-51.74
964,-51.79
965,-51.82
966,-51.85
967,-51.89
968,-51.92
969,-51.94
970,-51.97
971,-52.00
972,-52.05
973,-52.09
974,-52.12
975,-52.15
976,-52.18
977,-52.21
978,-52.24
979,-52.26
980,-52.27
981,-52.28
982,-52.29
983,-52.29
984,-52.27
985,-52.25
986,-52.21
987,-52.16
988,-52.08
989,-51.99
990,-51.87
991,-51.75
992,-51.59
993,-51.43
994,-51.24
995,-51.04
996,-50.83
997,-50.61
998,-50.38
999,-50.16
1000,-49.93
1001,-49.74
1002,-49.56
1003,-49.40
1004,-49.26
1005,-49.14
1006,-49.04
1007,-48.99
1008,-48.96
1009,-48.96
1010,-48.98
1011,-49.04
1012,-49.11
1013,-49.20
1014,-49.29
1015,-49.38
1016,-49.48
1017,-49.57
1018,-49.67
1019,-49.76
1020,-49.85
1021,-49.95
1022,-50.06
1023,-50.16
1024,-50.28
1025,-50.39
1026,-50.53
1027,-50.67
1028,-50.81
1029,-50.94
1030,-51.06
1031,-51.17
1032,-51.26
1033,-51.33
1034,-51.38
1035,-51.41
1036,-51.41
1037,-51.38
1038,-51.33
1039,-51.27
1040,-51.20
1041,-51.12
1042,-51.03
1043,-50.94
1044,-50.85
1045,-50.76
1046,-50.68
1047,-50.61
1048,-50.55
1049,-50.50
1050,-50.45
1051,-50.41
1052,-50.35
1053,-50.32
1054,-50.29
1055,-50.26
1056,-50.22
1057,-50.17
1058,-50.12
1059,-50.09
1060,-50.08
1061,-50.08
1062,-50.09
1063,-50.11
1064,-50.15
1065,-50.20
1066,-50.24
1067,-50.30
1068,-50.35
1069,-50.42
1070,-50.46
1071,-50.48
1072,-50.48
1073,-50.47
1074,-50.44
1075,-50.39
1076,-50.33
1077,-50.25
1078,-50.19
1079,-50.14
1080,-50.10
1081,-50.07
1082,-50.06
1083,-50.07
1084,-50.09
1085,-50.14
1086,-50.20
1087,-50.26
1088,-50.33
1089,-50.39
1090,-50.45
1091,-50.50
1092,-50.54
1093,-50.57
1094,-50.59
1095,-50.61
1096,-50.63
1097,-50.63
1098,-50.64
1099,-50.65
1100,-50.67
1101,-50.68
1102,-50.71
1103,-50.74
1104,-50.78
1105,-50.82
1106,-50.89
1107,-50.96
1108,-51.04
1109,-51.12
1110,-51.23
1111,-51.34
1112,-51.48
1113,-51.63
1114,-51.80
1115,-51.96
1116,-52.13
1117,-52.29
1118,-52.45
1119,-52.60
1120,-52.75
1121,-52.88
1122,-53.00
1123,-53.10
1124,-53.17
1125,-53.23
1126,-53.30
1127,-53.35
1128,-53.40
1129,-53.42
1130,-53.42
1131,-53.42
1132,-53.41
1133,-53.39
1134,-53.37
1135,-53.34
1136,-53.30
1137,-53.25
1138,-53.19
1139,-53.14
1140,-53.09
1141,-53.06
1142,-53.02
1143,-53.00
1144,-52.97
1145,-52.94
1146,-52.90
1147,-52.85
1148,-52.79
1149,-52.71
1150,-52.62
1151,-52.52
1152,-52.40
1153,-52.29
1154,-52.17
1155,-52.06
1156,-51.96
1157,-51.87
1158,-51.79
1159,-51.72
1160,-51.65
1161,-51.60
1162,-51.54
1163,-51.49
1164,-51.41
1165,-51.33
1166,-51.23
1167,-51.12
1168,-50.98
1169,-50.83
1170,-50.65
1171,-50.46
1172,-50.25
1173,-50.05
1174,-49.84
1175,-49.65
1176,-49.44
1177,-49.24
1178,-49.07
1179,-48.92
1180,-48.78
1181,-48.65
1182,-48.54
1183,-48.48
1184,-48.43
1185,-48.42
1186,-48.42
1187,-48.45
1188,-48.50
1189,-48.75
1190,-48.77
1191,-48.60
1192,-48.43
1193,-49.70
1194,-50.39
1195,-48.48
1196,-45.80
1197,-49.25
1198,-56.44
1199,-52.72
1200,-31.61
