1,36.40
2,50.00
3,50.00
4,32.08
5,-5.93
6,-27.15
7,-22.19
8,-4.35
9,6.76
10,4.44
11,-2.92
12,-5.39
13,-2.40
14,0.10
15,-1.00
16,-3.40
17,-3.42
18,-1.84
19,-1.22
20,-2.07
21,-2.70
22,-1.95
23,-0.77
24,-0.56
25,-1.31
26,-1.87
27,-1.57
28,-0.97
29,-0.90
30,-1.31
31,-1.64
32,-1.53
33,-1.12
34,-0.71
35,-0.55
36,-0.73
37,-1.08
38,-1.29
39,-1.15
40,-0.78
41,-0.51
42,-0.54
43,-0.78
44,-0.93
45,-0.85
46,-0.66
47,-0.56
48,-0.66
49,-0.83
50,-0.91
51,-0.83
52,-0.67
53,-0.58
54,-0.66
55,-0.90
56,-1.15
57,-1.35
58,-1.45
59,-1.60
60,-1.80
61,-1.95
62,-1.71
63,-0.97
64,0.18
65,1.32
66,2.29
67,3.27
68,4.69
69,6.65
70,8.76
71,10.36
72,11.17
73,11.42
74,11.48
75,11.33
76,10.61
77,9.12
78,7.21
79,5.53
80,4.34
81,3.41
82,2.34
83,1.10
84,-0.02
85,-0.68
86,-0.99
87,-1.13
88,-1.22
89,-1.12
90,-0.90
91,-0.74
92,-0.80
93,-0.81
94,-0.42
95,0.34
96,0.98
97,1.02
98,0.63
99,0.39
100,0.69
101,1.27
102,1.65
103,1.67
104,1.70
105,2.11
106,2.80
107,3.24
108,3.18
109,2.90
110,2.89
111,3.21
112,3.49
113,3.35
114,2.90
115,2.57
116,2.67
117,3.06
118,3.47
119,3.72
120,3.86
121,3.92
122,3.86
123,3.59
124,3.25
125,3.06
126,3.15
127,3.43
128,3.65
129,3.70
130,3.63
131,3.61
132,3.72
133,3.90
134,3.98
135,3.83
136,3.48
137,3.12
138,2.92
139,2.87
140,2.85
141,2.85
142,2.92
143,3.09
144,3.23
145,3.22
146,3.12
147,3.14
148,3.36
149,3.55
150,3.45
151,3.08
152,2.79
153,2.85
154,3.17
155,3.42
156,3.40
157,3.26
158,3.27
159,3.52
160,3.87
161,4.08
162,4.04
163,3.77
164,3.34
165,2.89
166,2.49
167,2.22
168,2.02
169,1.85
170,1.63
171,1.39
172,1.12
173,0.83
174,0.49
175,0.12
176,-0.28
177,-0.68
178,-1.06
179,-1.28
180,-1.27
181,-1.05
182,-0.83
183,-0.83
184,-1.08
185,-1.36
186,-1.46
187,-1.36
188,-1.20
189,-1.06
190,-0.93
191,-0.83
192,-0.92
193,-1.30
194,-1.87
195,-2.29
196,-2.35
197,-2.06
198,-1.68
199,-1.47
200,-1.54
201,-1.83
202,-2.18
203,-2.37
204,-2.24
205,-1.81
206,-1.32
207,-1.05
208,-1.12
209,-1.44
210,-1.72
211,-1.72
212,-1.36
213,-0.76
214,-0.15
215,0.20
216,0.17
217,-0.14
218,-0.47
219,-0.64
220,-0.58
221,-0.36
222,-0.17
223,-0.18
224,-0.44
225,-0.85
226,-1.17
227,-1.25
228,-1.10
229,-0.81
230,-0.50
231,-0.26
232,-0.20
233,-0.37
234,-0.67
235,-0.85
236,-0.71
237,-0.28
238,0.18
239,0.39
240,0.33
241,0.18
242,0.18
243,0.37
244,0.68
245,1.00
246,1.27
247,1.38
248,1.28
249,1.05
250,0.90
251,0.98
252,1.20
253,1.27
254,1.07
255,0.83
256,0.94
257,1.48
258,2.08
259,2.22
260,1.74
261,0.98
262,0.40
263,0.20
264,0.25
265,0.34
266,0.41
267,0.47
268,0.57
269,0.73
270,0.95
271,1.12
272,1.07
273,0.77
274,0.43
275,0.33
276,0.60
277,1.06
278,1.35
279,1.28
280,0.96
281,0.72
282,0.78
283,1.11
284,1.39
285,1.29
286,0.76
287,0.06
288,-0.37
289,-0.27
290,0.23
291,0.70
292,0.82
293,0.68
294,0.55
295,0.60
296,0.70
297,0.76
298,0.75
299,0.76
300,0.71
301,0.48
302,0.12
303,-0.12
304,-0.03
305,0.26
306,0.44
307,0.34
308,0.10
309,-0.05
310,-0.06
311,-0.03
312,-0.01
313,0.08
314,0.23
315,0.29
316,0.11
317,-0.20
318,-0.32
319,-0.14
320,0.07
321,-0.02
322,-0.46
323,-0.94
324,-1.08
325,-0.77
326,-0.24
327,0.16
328,0.29
329,0.23
330,0.10
331,-0.04
332,-0.18
333,-0.26
334,-0.20
335,-0.08
336,-0.12
337,-0.42
338,-0.82
339,-0.99
340,-0.80
341,-0.48
342,-0.36
343,-0.53
344,-0.73
345,-0.67
346,-0.36
347,-0.11
348,-0.20
349,-0.53
350,-0.80
351,-0.84
352,-0.74
353,-0.67
354,-0.68
355,-0.64
356,-0.47
357,-0.24
358,-0.18
359,-0.48
360,-1.05
361,-1.56
362,-1.63
363,-1.17
364,-0.43
365,0.16
366,0.38
367,0.26
368,0.05
369,-0.05
370,0.00
371,0.14
372,0.22
373,0.17
374,0.02
375,-0.11
376,-0.04
377,0.19
378,0.46
379,0.60
380,0.52
381,0.20
382,-0.26
383,-0.61
384,-0.55
385,-0.08
386,0.51
387,0.85
388,0.79
389,0.50
390,0.26
391,0.23
392,0.38
393,0.56
394,0.73
395,0.91
396,1.14
397,1.32
398,1.39
399,1.34
400,1.21
401,1.05
402,0.94
403,1.02
404,1.35
405,1.73
406,1.81
407,1.43
408,0.90
409,0.70
410,0.97
411,1.41
412,1.52
413,1.20
414,0.77
415,0.70
416,1.09
417,1.64
418,1.89
419,1.67
420,1.15
421,0.74
422,0.69
423,0.90
424,1.05
425,0.96
426,0.71
427,0.51
428,0.41
429,0.33
430,0.23
431,0.25
432,0.49
433,0.81
434,0.92
435,0.66
436,0.23
437,0.02
438,0.21
439,0.57
440,0.73
441,0.60
442,0.42
443,0.43
444,0.57
445,0.59
446,0.34
447,0.02
448,-0.09
449,0.15
450,0.55
451,0.82
452,0.84
453,0.71
454,0.56
455,0.45
456,0.28
457,0.04
458,-0.19
459,-0.28
460,-0.22
461,-0.14
462,-0.15
463,-0.24
464,-0.34
465,-0.42
466,-0.57
467,-0.83
468,-1.14
469,-1.28
470,-1.19
471,-1.03
472,-0.99
473,-1.09
474,-1.16
475,-1.13
476,-1.06
477,-1.08
478,-1.12
479,-1.02
480,-0.75
481,-0.51
482,-0.44
483,-0.47
484,-0.35
485,-0.05
486,0.19
487,0.12
488,-0.20
489,-0.53
490,-0.72
491,-0.86
492,-1.05
493,-1.20
494,-1.12
495,-0.79
496,-0.48
497,-0.43
498,-0.61
499,-0.73
500,-0.62
501,-0.37
502,-0.28
503,-0.53
504,-1.07
505,-1.67
506,-2.05
507,-1.96
508,-1.41
509,-0.74
510,-0.43
511,-0.66
512,-1.13
513,-1.34
514,-1.17
515,-0.93
516,-1.01
517,-1.38
518,-1.64
519,-1.44
520,-0.93
521,-0.55
522,-0.59
523,-0.93
524,-1.26
525,-1.36
526,-1.33
527,-1.37
528,-1.52
529,-1.63
530,-1.64
531,-1.63
532,-1.73
533,-1.86
534,-1.78
535,-1.38
536,-0.91
537,-0.71
538,-0.87
539,-1.11
540,-1.08
541,-0.72
542,-0.31
543,-0.18
544,-0.41
545,-0.86
546,-1.32
547,-1.66
548,-1.77
549,-1.57
550,-1.14
551,-0.74
552,-0.65
553,-0.86
554,-1.11
555,-1.14
556,-0.98
557,-0.87
558,-0.94
559,-1.04
560,-0.99
561,-0.82
562,-0.71
563,-0.76
564,-0.85
565,-0.84
566,-0.74
567,-0.67
568,-0.70
569,-0.85
570,-1.02
571,-1.03
572,-0.79
573,-0.43
574,-0.23
575,-0.33
576,-0.51
577,-0.46
578,-0.10
579,0.21
580,0.07
581,-0.55
582,-1.21
583,-1.48
584,-1.37
585,-1.21
586,-1.27
587,-1.38
588,-1.27
589,-0.88
590,-0.47
591,-0.31
592,-0.41
593,-0.57
594,-0.65
595,-0.65
596,-0.62
597,-0.58
598,-0.53
599,-0.51
600,-0.61
601,-0.85
602,-1.10
603,-1.18
604,-1.08
605,-0.91
606,-0.81
607,-0.73
608,-0.52
609,-0.19
610,0.00
611,-0.20
612,-0.70
613,-1.11
614,-1.10
615,-0.71
616,-0.27
617,-0.07
618,-0.11
619,-0.20
620,-0.27
621,-0.36
622,-0.52
623,-0.70
624,-0.84
625,-0.90
626,-0.93
627,-0.89
628,-0.83
629,-0.88
630,-1.14
631,-1.51
632,-1.72
633,-1.58
634,-1.28
635,-1.19
636,-1.48
637,-1.95
638,-2.22
639,-2.09
640,-1.73
641,-1.47
642,-1.43
643,-1.44
644,-1.29
645,-0.98
646,-0.74
647,-0.82
648,-1.19
649,-1.51
650,-1.46
651,-1.03
652,-0.56
653,-0.44
654,-0.73
655,-1.20
656,-1.55
657,-1.70
658,-1.68
659,-1.53
660,-1.30
661,-1.15
662,-1.32
663,-1.75
664,-2.13
665,-2.14
666,-1.82
667,-1.53
668,-1.61
669,-2.02
670,-2.46
671,-2.60
672,-2.40
673,-2.13
674,-2.14
675,-2.50
676,-2.90
677,-2.96
678,-2.57
679,-2.09
680,-1.88
681,-1.92
682,-1.89
683,-1.57
684,-1.16
685,-1.06
686,-1.35
687,-1.76
688,-1.91
689,-1.70
690,-1.32
691,-0.99
692,-0.84
693,-0.89
694,-1.08
695,-1.26
696,-1.28
697,-1.11
698,-0.96
699,-1.07
700,-1.49
701,-1.98
702,-2.26
703,-2.21
704,-1.90
705,-1.55
706,-1.38
707,-1.49
708,-1.82
709,-2.11
710,-2.17
711,-2.03
712,-1.92
713,-1.91
714,-1.82
715,-1.47
716,-0.96
717,-0.64
718,-0.74
719,-1.19
720,-1.73
721,-2.14
722,-2.39
723,-2.52
724,-2.48
725,-2.28
726,-2.02
727,-1.91
728,-2.03
729,-2.30
730,-2.55
731,-2.69
732,-2.73
733,-2.71
734,-2.63
735,-2.42
736,-2.08
737,-1.74
738,-1.59
739,-1.74
740,-2.10
741,-2.37
742,-2.33
743,-1.99
744,-1.59
745,-1.41
746,-1.61
747,-2.15
748,-2.82
749,-3.26
750,-3.21
751,-2.75
752,-2.30
753,-2.27
754,-2.60
755,-2.82
756,-2.51
757,-1.84
758,-1.37
759,-1.42
760,-1.71
761,-1.74
762,-1.36
763,-0.94
764,-0.85
765,-1.06
766,-1.17
767,-1.01
768,-0.81
769,-0.88
770,-1.22
771,-1.58
772,-1.75
773,-1.76
774,-1.74
775,-1.70
776,-1.57
777,-1.34
778,-1.15
779,-1.09
780,-1.11
781,-1.02
782,-0.77
783,-0.48
784,-0.31
785,-0.26
786,-0.22
787,-0.16
788,-0.21
789,-0.43
790,-0.74
791,-0.95
792,-0.96
793,-0.83
794,-0.69
795,-0.61
796,-0.62
797,-0.72
798,-0.88
799,-0.99
800,-0.95
801,-0.74
802,-0.49
803,-0.35
804,-0.31
805,-0.32
806,-0.33
807,-0.38
808,-0.48
809,-0.59
810,-0.62
811,-0.57
812,-0.52
813,-0.51
814,-0.48
815,-0.35
816,-0.16
817,-0.07
818,-0.14
819,-0.28
820,-0.34
821,-0.31
822,-0.30
823,-0.37
824,-0.47
825,-0.56
826,-0.66
827,-0.78
828,-0.72
829,-0.35
830,0.23
831,0.65
832,0.60
833,0.20
834,-0.15
835,-0.21
836,-0.18
837,-0.38
838,-0.81
839,-1.10
840,-0.91
841,-0.38
842,0.13
843,0.38
844,0.49
845,0.62
846,0.70
847,0.52
848,0.19
849,0.07
850,0.41
851,0.97
852,1.27
853,1.07
854,0.71
855,0.61
856,0.88
857,1.21
858,1.36
859,1.42
860,1.62
861,1.97
862,2.32
863,2.55
864,2.75
865,3.00
866,3.13
867,2.93
868,2.48
869,2.16
870,2.29
871,2.76
872,3.12
873,3.07
874,2.76
875,2.56
876,2.70
877,3.02
878,3.20
879,3.11
880,2.92
881,2.84
882,2.89
883,2.94
884,2.85
885,2.63
886,2.39
887,2.24
888,2.17
889,2.14
890,2.14
891,2.21
892,2.33
893,2.42
894,2.34
895,2.17
896,2.09
897,2.27
898,2.58
899,2.78
900,2.70
901,2.49
902,2.42
903,2.53
904,2.56
905,2.26
906,1.75
907,1.42
908,1.47
909,1.76
910,1.97
911,2.04
912,2.11
913,2.27
914,2.38
915,2.31
916,2.10
917,1.87
918,1.63
919,1.35
920,1.12
921,1.16
922,1.47
923,1.71
924,1.59
925,1.26
926,1.19
927,1.56
928,2.00
929,2.06
930,1.78
931,1.76
932,2.31
933,3.03
934,3.24
935,2.79
936,2.19
937,1.92
938,1.84
939,1.46
940,0.69
941,0.05
942,-0.02
943,0.29
944,0.35
945,-0.12
946,-0.77
947,-1.01
948,-0.72
949,-0.22
950,0.07
951,0.02
952,-0.27
953,-0.54
954,-0.70
955,-0.76
956,-0.84
957,-1.03
958,-1.25
959,-1.33
960,-1.16
961,-0.93
962,-0.94
963,-1.33
964,-1.77
965,-1.75
966,-1.09
967,-0.26
968,0.11
969,-0.17
970,-0.70
971,-0.96
972,-0.79
973,-0.44
974,-0.12
975,0.10
976,0.32
977,0.53
978,0.61
979,0.45
980,0.17
981,0.07
982,0.37
983,0.96
984,1.50
985,1.71
986,1.62
987,1.42
988,1.34
989,1.53
990,1.98
991,2.52
992,2.80
993,2.57
994,1.85
995,1.00
996,0.49
997,0.55
998,1.00
999,1.44
1000,1.59
1001,1.51
1002,1.40
1003,1.32
1004,1.16
1005,0.86
1006,0.60
1007,0.65
1008,1.04
1009,1.40
1010,1.40
1011,1.08
1012,0.83
1013,0.97
1014,1.47
1015,2.05
1016,2.42
1017,2.51
1018,2.33
1019,2.01
1020,1.73
1021,1.70
1022,1.90
1023,2.06
1024,1.89
1025,1.47
1026,1.15
1027,1.17
1028,1.37
1029,1.40
1030,1.13
1031,0.81
1032,0.75
1033,0.95
1034,1.16
1035,1.15
1036,1.00
1037,0.91
1038,0.96
1039,1.05
1040,1.10
1041,1.11
1042,1.11
1043,1.10
1044,0.99
1045,0.74
1046,0.54
1047,0.59
1048,0.96
1049,1.44
1050,1.67
1051,1.49
1052,1.04
1053,0.72
1054,0.78
1055,1.14
1056,1.52
1057,1.71
1058,1.67
1059,1.48
1060,1.15
1061,0.71
1062,0.27
1063,0.06
1064,0.27
1065,0.85
1066,1.44
1067,1.52
1068,0.96
1069,0.13
1070,-0.33
1071,-0.11
1072,0.52
1073,1.05
1074,1.18
1075,0.98
1076,0.70
1077,0.55
1078,0.52
1079,0.50
1080,0.36
1081,0.16
1082,-0.02
1083,-0.06
1084,0.02
1085,0.11
1086,0.08
1087,-0.11
1088,-0.43
1089,-0.76
1090,-0.94
1091,-0.86
1092,-0.57
1093,-0.27
1094,-0.24
1095,-0.55
1096,-1.00
1097,-1.25
1098,-1.09
1099,-0.67
1100,-0.37
1101,-0.44
1102,-0.86
1103,-1.36
1104,-1.65
1105,-1.59
1106,-1.25
1107,-0.83
1108,-0.56
1109,-0.66
1110,-1.06
1111,-1.42
1112,-1.38
1113,-1.00
1114,-0.68
1115,-0.72
1116,-0.99
1117,-1.12
1118,-0.88
1119,-0.40
1120,0.05
1121,0.23
1122,0.14
1123,-0.07
1124,-0.25
1125,-0.38
1126,-0.47
1127,-0.49
1128,-0.40
1129,-0.24
1130,-0.11
1131,-0.04
1132,0.00
1133,0.03
1134,-0.07
1135,-0.38
1136,-0.84
1137,-1.18
1138,-1.22
1139,-1.04
1140,-0.94
1141,-1.16
1142,-1.61
1143,-1.94
1144,-1.94
1145,-1.70
1146,-1.52
1147,-1.56
1148,-1.71
1149,-1.77
1150,-1.72
1151,-1.76
1152,-2.03
1153,-2.38
1154,-2.50
1155,-2.28
1156,-1.99
1157,-1.99
1158,-2.39
1159,-2.88
1160,-3.06
1161,-2.78
1162,-2.29
1163,-1.97
1164,-1.98
1165,-2.13
1166,-2.14
1167,-2.01
1168,-1.94
1169,-2.10
1170,-2.40
1171,-2.53
1172,-2.27
1173,-1.73
1174,-1.23
1175,-1.12
1176,-1.42
1177,-1.84
1178,-2.05
1179,-1.99
1180,-1.93
1181,-2.07
1182,-2.34
1183,-2.42
1184,-2.10
1185,-1.49
1186,-0.91
1187,-0.66
1188,-0.76
1189,-1.06
1190,-1.39
1191,-1.67
1192,-1.86
1193,-2.18
1194,-2.15
1195,-1.66
1196,-1.22
1197,-1.99
1198,-3.07
1199,-1.70
1200,1.32
