1,187.66
2,249.99
3,249.99
4,245.17
5,235.82
6,249.99
7,249.99
8,235.97
9,165.93
10,62.58
11,-48.83
12,-128.24
13,-145.68
14,-92.92
15,12.29
16,130.78
17,222.22
18,249.99
19,249.99
20,247.46
21,245.63
22,249.99
23,249.99
24,245.04
25,208.21
26,130.05
27,10.48
28,-119.81
29,-215.59
30,-250.00
31,-250.00
32,-250.00
33,-245.32
34,-217.32
35,-161.69
36,-101.39
37,-61.15
38,-48.93
39,-53.10
40,-64.25
41,-75.42
42,-81.73
43,-80.42
44,-71.38
45,-59.65
46,-48.32
47,-41.42
48,-38.59
49,-39.59
50,-41.76
51,-43.54
52,-43.69
53,-42.21
54,-39.41
55,-36.29
56,-33.29
57,-31.14
58,-29.57
59,-28.56
60,-27.60
61,-26.73
62,-25.82
63,-25.06
64,-24.30
65,-23.61
66,-22.80
67,-22.03
68,-21.13
69,-20.25
70,-19.29
71,-18.42
72,-17.56
73,-16.81
74,-16.05
75,-15.37
76,-14.63
77,-13.94
78,-13.19
79,-12.47
80,-11.68
81,-10.89
82,-10.05
83,-9.29
84,-8.59
85,-8.02
86,-7.45
87,-6.97
88,-6.50
89,-6.13
90,-5.77
91,-5.43
92,-5.02
93,-4.59
94,-4.08
95,-3.56
96,-2.96
97,-2.40
98,-1.91
99,-1.58
100,-1.42
101,-1.43
102,-1.55
103,-1.71
104,-1.84
105,-1.91
106,-1.89
107,-1.80
108,-1.64
109,-1.49
110,-1.40
111,-1.40
112,-1.45
113,-1.52
114,-1.58
115,-1.61
116,-1.58
117,-1.46
118,-1.27
119,-1.08
120,-0.96
121,-0.94
122,-1.00
123,-1.12
124,-1.28
125,-1.44
126,-1.53
127,-1.54
128,-1.45
129,-1.30
130,-1.08
131,-0.84
132,-0.62
133,-0.47
134,-0.40
135,-0.38
136,-0.36
137,-0.31
138,-0.17
139,0.03
140,0.33
141,0.68
142,1.09
143,1.48
144,1.79
145,1.98
146,2.04
147,2.00
148,1.90
149,1.80
150,1.79
151,1.90
152,2.14
153,2.45
154,2.78
155,3.07
156,3.30
157,3.45
158,3.53
159,3.55
160,3.56
161,3.59
162,3.67
163,3.75
164,3.80
165,3.77
166,3.72
167,3.68
168,3.65
169,3.66
170,3.72
171,3.88
172,4.08
173,4.30
174,4.48
175,4.57
176,4.52
177,4.37
178,4.17
179,3.99
180,3.86
181,3.77
182,3.71
183,3.68
184,3.68
185,3.72
186,3.76
187,3.78
188,3.79
189,3.82
190,3.91
191,4.03
192,4.12
193,4.15
194,4.15
195,4.14
196,4.14
197,4.14
198,4.17
199,4.29
200,4.53
201,4.86
202,5.22
203,5.55
204,5.84
205,6.08
206,6.25
207,6.30
208,6.28
209,6.24
210,6.26
211,6.34
212,6.48
213,6.70
214,7.00
215,7.36
216,7.70
217,7.94
218,8.09
219,8.18
220,8.20
221,8.17
222,8.10
223,8.03
224,8.03
225,8.12
226,8.30
227,8.54
228,8.82
229,9.06
230,9.23
231,9.32
232,9.34
233,9.30
234,9.23
235,9.14
236,9.06
237,8.96
238,8.85
239,8.71
240,8.54
241,8.35
242,8.16
243,7.98
244,7.84
245,7.76
246,7.68
247,7.61
248,7.49
249,7.38
250,7.23
251,7.06
252,6.84
253,6.62
254,6.46
255,6.37
256,6.32
257,6.28
258,6.20
259,6.10
260,6.00
261,5.91
262,5.87
263,5.90
264,5.97
265,6.07
266,6.16
267,6.20
268,6.13
269,5.99
270,5.76
271,5.49
272,5.20
273,4.93
274,4.68
275,4.48
276,4.30
277,4.13
278,3.91
279,3.67
280,3.43
281,3.26
282,3.17
283,3.17
284,3.23
285,3.36
286,3.53
287,3.75
288,3.94
289,4.10
290,4.20
291,4.25
292,4.27
293,4.28
294,4.26
295,4.20
296,4.06
297,3.85
298,3.63
299,3.46
300,3.32
301,3.20
302,3.08
303,2.99
304,2.93
305,2.91
306,2.90
307,2.90
308,2.91
309,2.90
310,2.90
311,2.93
312,3.00
313,3.09
314,3.17
315,3.23
316,3.31
317,3.39
318,3.46
319,3.52
320,3.60
321,3.65
322,3.66
323,3.60
324,3.52
325,3.46
326,3.43
327,3.40
328,3.36
329,3.30
330,3.22
331,3.13
332,3.04
333,2.94
334,2.89
335,2.91
336,3.01
337,3.17
338,3.35
339,3.52
340,3.69
341,3.85
342,4.00
343,4.17
344,4.38
345,4.62
346,4.90
347,5.16
348,5.38
349,5.50
350,5.52
351,5.39
352,5.14
353,4.77
354,4.37
355,4.01
356,3.74
357,3.59
358,3.56
359,3.65
360,3.83
361,4.04
362,4.22
363,4.31
364,4.33
365,4.29
366,4.24
367,4.21
368,4.21
369,4.27
370,4.41
371,4.62
372,4.88
373,5.15
374,5.42
375,5.63
376,5.75
377,5.78
378,5.74
379,5.65
380,5.51
381,5.33
382,5.11
383,4.88
384,4.61
385,4.32
386,3.97
387,3.58
388,3.17
389,2.82
390,2.53
391,2.35
392,2.26
393,2.27
394,2.35
395,2.48
396,2.59
397,2.69
398,2.76
399,2.82
400,2.85
401,2.85
402,2.83
403,2.78
404,2.67
405,2.52
406,2.32
407,2.11
408,1.92
409,1.78
410,1.66
411,1.61
412,1.60
413,1.60
414,1.57
415,1.51
416,1.46
417,1.42
418,1.40
419,1.40
420,1.46
421,1.63
422,1.91
423,2.25
424,2.59
425,2.85
426,3.04
427,3.16
428,3.23
429,3.26
430,3.27
431,3.30
432,3.36
433,3.48
434,3.64
435,3.79
436,3.90
437,3.96
438,4.01
439,4.06
440,4.10
441,4.14
442,4.20
443,4.32
444,4.46
445,4.59
446,4.67
447,4.73
448,4.75
449,4.72
450,4.63
451,4.52
452,4.39
453,4.30
454,4.24
455,4.22
456,4.20
457,4.19
458,4.10
459,3.96
460,3.74
461,3.50
462,3.26
463,3.04
464,2.87
465,2.76
466,2.72
467,2.72
468,2.71
469,2.66
470,2.56
471,2.45
472,2.29
473,2.11
474,1.93
475,1.84
476,1.85
477,1.95
478,2.07
479,2.17
480,2.21
481,2.17
482,2.07
483,1.91
484,1.75
485,1.63
486,1.55
487,1.46
488,1.37
489,1.24
490,1.10
491,0.98
492,0.92
493,0.89
494,0.88
495,0.91
496,1.00
497,1.17
498,1.42
499,1.66
500,1.85
501,1.98
502,2.04
503,2.02
504,1.98
505,1.91
506,1.89
507,1.95
508,2.09
509,2.29
510,2.57
511,2.89
512,3.27
513,3.66
514,4.05
515,4.41
516,4.73
517,4.97
518,5.10
519,5.10
520,4.99
521,4.80
522,4.59
523,4.37
524,4.19
525,4.07
526,4.02
527,4.03
528,4.04
529,3.98
530,3.79
531,3.47
532,3.04
533,2.56
534,2.06
535,1.64
536,1.36
537,1.27
538,1.34
539,1.54
540,1.79
541,2.03
542,2.20
543,2.29
544,2.30
545,2.24
546,2.11
547,1.95
548,1.85
549,1.81
550,1.85
551,1.97
552,2.22
553,2.58
554,2.99
555,3.36
556,3.62
557,3.73
558,3.72
559,3.59
560,3.40
561,3.21
562,3.09
563,3.05
564,3.12
565,3.27
566,3.49
567,3.73
568,3.96
569,4.14
570,4.28
571,4.43
572,4.62
573,4.88
574,5.24
575,5.67
576,6.09
577,6.42
578,6.61
579,6.68
580,6.61
581,6.44
582,6.14
583,5.78
584,5.42
585,5.16
586,4.96
587,4.82
588,4.68
589,4.55
590,4.35
591,4.09
592,3.72
593,3.28
594,2.76
595,2.25
596,1.77
597,1.39
598,1.11
599,0.94
600,0.81
601,0.72
602,0.69
603,0.72
604,0.77
605,0.82
606,0.85
607,0.90
608,0.98
609,1.08
610,1.19
611,1.34
612,1.50
613,1.65
614,1.75
615,1.79
616,1.72
617,1.57
618,1.38
619,1.20
620,1.06
621,0.96
622,0.93
623,0.96
624,1.05
625,1.18
626,1.30
627,1.39
628,1.43
629,1.50
630,1.60
631,1.75
632,1.91
633,2.08
634,2.20
635,2.25
636,2.20
637,2.08
638,1.98
639,1.97
640,2.05
641,2.21
642,2.45
643,2.75
644,3.06
645,3.30
646,3.43
647,3.46
648,3.41
649,3.31
650,3.21
651,3.15
652,3.17
653,3.23
654,3.28
655,3.28
656,3.25
657,3.18
658,3.07
659,2.93
660,2.78
661,2.66
662,2.55
663,2.51
664,2.52
665,2.54
666,2.50
667,2.40
668,2.22
669,2.01
670,1.74
671,1.42
672,1.08
673,0.82
674,0.60
675,0.43
676,0.28
677,0.16
678,0.05
679,-0.03
680,-0.08
681,-0.12
682,-0.15
683,-0.14
684,-0.08
685,0.04
686,0.15
687,0.22
688,0.23
689,0.17
690,0.03
691,-0.15
692,-0.32
693,-0.44
694,-0.53
695,-0.55
696,-0.48
697,-0.31
698,-0.07
699,0.18
700,0.40
701,0.57
702,0.70
703,0.79
704,0.85
705,0.88
706,0.89
707,0.92
708,1.00
709,1.09
710,1.13
711,1.08
712,0.93
713,0.72
714,0.44
715,0.11
716,-0.24
717,-0.54
718,-0.76
719,-0.85
720,-0.80
721,-0.65
722,-0.46
723,-0.27
724,-0.11
725,-0.01
726,-0.05
727,-0.19
728,-0.41
729,-0.66
730,-0.92
731,-1.16
732,-1.32
733,-1.37
734,-1.38
735,-1.40
736,-1.50
737,-1.61
738,-1.73
739,-1.85
740,-1.99
741,-2.11
742,-2.15
743,-2.06
744,-1.88
745,-1.69
746,-1.56
747,-1.50
748,-1.51
749,-1.60
750,-1.77
751,-1.95
752,-2.08
753,-2.08
754,-1.98
755,-1.79
756,-1.55
757,-1.30
758,-1.11
759,-0.98
760,-0.94
761,-0.98
762,-1.08
763,-1.20
764,-1.28
765,-1.35
766,-1.43
767,-1.52
768,-1.58
769,-1.62
770,-1.65
771,-1.67
772,-1.66
773,-1.54
774,-1.32
775,-1.01
776,-0.66
777,-0.30
778,0.04
779,0.31
780,0.50
781,0.62
782,0.67
783,0.67
784,0.63
785,0.58
786,0.49
787,0.37
788,0.20
789,-0.01
790,-0.24
791,-0.48
792,-0.73
793,-0.93
794,-1.07
795,-1.15
796,-1.27
797,-1.40
798,-1.58
799,-1.76
800,-1.96
801,-2.17
802,-2.36
803,-2.47
804,-2.53
805,-2.53
806,-2.49
807,-2.46
808,-2.45
809,-2.51
810,-2.66
811,-2.87
812,-3.09
813,-3.28
814,-3.39
815,-3.40
816,-3.27
817,-2.99
818,-2.58
819,-2.12
820,-1.72
821,-1.42
822,-1.23
823,-1.14
824,-1.15
825,-1.21
826,-1.27
827,-1.28
828,-1.23
829,-1.14
830,-1.01
831,-0.89
832,-0.83
833,-0.89
834,-1.04
835,-1.23
836,-1.40
837,-1.50
838,-1.46
839,-1.28
840,-0.98
841,-0.66
842,-0.34
843,-0.07
844,0.17
845,0.37
846,0.56
847,0.76
848,1.02
849,1.35
850,1.74
851,2.09
852,2.38
853,2.59
854,2.75
855,2.89
856,3.01
857,3.10
858,3.20
859,3.34
860,3.56
861,3.76
862,3.94
863,4.05
864,4.13
865,4.12
866,4.02
867,3.84
868,3.66
869,3.53
870,3.46
871,3.47
872,3.59
873,3.82
874,4.11
875,4.42
876,4.75
877,5.07
878,5.36
879,5.53
880,5.65
881,5.72
882,5.81
883,5.89
884,5.97
885,6.03
886,6.09
887,6.14
888,6.20
889,6.23
890,6.24
891,6.23
892,6.25
893,6.30
894,6.42
895,6.57
896,6.72
897,6.87
898,7.04
899,7.19
900,7.27
901,7.24
902,7.13
903,6.97
904,6.81
905,6.69
906,6.62
907,6.59
908,6.58
909,6.61
910,6.72
911,6.90
912,7.12
913,7.36
914,7.61
915,7.86
916,8.04
917,8.11
918,8.03
919,7.81
920,7.48
921,7.09
922,6.72
923,6.45
924,6.29
925,6.26
926,6.35
927,6.50
928,6.67
929,6.77
930,6.74
931,6.59
932,6.33
933,6.03
934,5.74
935,5.52
936,5.42
937,5.43
938,5.50
939,5.57
940,5.57
941,5.48
942,5.31
943,5.10
944,4.87
945,4.69
946,4.59
947,4.60
948,4.66
949,4.76
950,4.85
951,4.92
952,4.90
953,4.78
954,4.59
955,4.34
956,4.07
957,3.81
958,3.54
959,3.31
960,3.11
961,2.92
962,2.75
963,2.60
964,2.51
965,2.49
966,2.51
967,2.60
968,2.75
969,2.94
970,3.10
971,3.16
972,3.12
973,2.99
974,2.82
975,2.59
976,2.38
977,2.20
978,2.08
979,2.01
980,2.00
981,2.06
982,2.24
983,2.54
984,2.91
985,3.30
986,3.69
987,4.05
988,4.34
989,4.49
990,4.50
991,4.37
992,4.16
993,3.91
994,3.71
995,3.64
996,3.76
997,4.03
998,4.39
999,4.72
1000,4.98
1001,5.10
1002,5.08
1003,4.95
1004,4.78
1005,4.62
1006,4.53
1007,4.54
1008,4.64
1009,4.78
1010,4.94
1011,5.07
1012,5.14
1013,5.13
1014,5.06
1015,4.90
1016,4.71
1017,4.52
1018,4.39
1019,4.33
1020,4.35
1021,4.43
1022,4.59
1023,4.84
1024,5.15
1025,5.49
1026,5.78
1027,5.96
1028,6.00
1029,5.94
1030,5.82
1031,5.69
1032,5.61
1033,5.58
1034,5.61
1035,5.67
1036,5.74
1037,5.80
1038,5.84
1039,5.84
1040,5.78
1041,5.72
1042,5.71
1043,5.77
1044,5.87
1045,5.97
1046,6.02
1047,6.02
1048,5.94
1049,5.73
1050,5.40
1051,5.00
1052,4.62
1053,4.34
1054,4.23
1055,4.33
1056,4.61
1057,5.00
1058,5.42
1059,5.79
1060,6.04
1061,6.16
1062,6.16
1063,6.07
1064,5.94
1065,5.81
1066,5.72
1067,5.70
1068,5.74
1069,5.77
1070,5.71
1071,5.51
1072,5.17
1073,4.74
1074,4.26
1075,3.78
1076,3.33
1077,3.01
1078,2.84
1079,2.85
1080,2.95
1081,3.11
1082,3.29
1083,3.45
1084,3.52
1085,3.46
1086,3.27
1087,3.01
1088,2.82
1089,2.72
1090,2.75
1091,2.88
1092,3.04
1093,3.27
1094,3.49
1095,3.68
1096,3.75
1097,3.68
1098,3.54
1099,3.38
1100,3.27
1101,3.20
1102,3.22
1103,3.30
1104,3.47
1105,3.68
1106,3.91
1107,4.10
1108,4.30
1109,4.48
1110,4.66
1111,4.86
1112,5.13
1113,5.42
1114,5.74
1115,6.03
1116,6.32
1117,6.58
1118,6.83
1119,7.06
1120,7.34
1121,7.62
1122,7.92
1123,8.19
1124,8.46
1125,8.70
1126,8.86
1127,8.88
1128,8.81
1129,8.69
1130,8.55
1131,8.42
1132,8.35
1133,8.35
1134,8.42
1135,8.45
1136,8.38
1137,8.21
1138,7.93
1139,7.64
1140,7.33
1141,7.00
1142,6.66
1143,6.39
1144,6.23
1145,6.21
1146,6.26
1147,6.36
1148,6.49
1149,6.68
1150,6.84
1151,6.94
1152,6.94
1153,6.85
1154,6.68
1155,6.45
1156,6.13
1157,5.74
1158,5.31
1159,4.95
1160,4.68
1161,4.52
1162,4.39
1163,4.30
1164,4.25
1165,4.22
1166,4.17
1167,4.06
1168,3.89
1169,3.68
1170,3.43
1171,3.20
1172,2.99
1173,2.87
1174,2.85
1175,2.94
1176,3.16
1177,3.49
1178,3.88
1179,4.26
1180,4.62
1181,4.89
1182,5.07
1183,5.12
1184,5.07
1185,5.00
1186,5.03
1187,5.17
1188,5.41
1189,5.68
1190,5.97
1191,6.24
1192,6.46
1193,6.58
1194,6.58
1195,6.48
1196,6.35
1197,6.20
1198,6.04
1199,5.90
1200,5.74
1201,5.56
1202,5.34
1203,5.10
1204,4.88
1205,4.70
1206,4.55
1207,4.47
1208,4.46
1209,4.53
1210,4.60
1211,4.63
1212,4.62
1213,4.59
1214,4.55
1215,4.49
1216,4.38
1217,4.24
1218,4.12
1219,4.02
1220,3.91
1221,3.80
1222,3.72
1223,3.68
1224,3.65
1225,3.63
1226,3.64
1227,3.66
1228,3.67
1229,3.65
1230,3.62
1231,3.62
1232,3.62
1233,3.62
1234,3.64
1235,3.73
1236,3.89
1237,4.10
1238,4.34
1239,4.62
1240,4.92
1241,5.22
1242,5.46
1243,5.57
1244,5.58
1245,5.51
1246,5.40
1247,5.25
1248,5.10
1249,4.96
1250,4.91
1251,4.94
1252,5.06
1253,5.21
1254,5.37
1255,5.55
1256,5.74
1257,5.92
1258,6.05
1259,6.11
1260,6.12
1261,6.12
1262,6.11
1263,6.09
1264,6.01
1265,5.86
1266,5.64
1267,5.40
1268,5.17
1269,4.97
1270,4.78
1271,4.63
1272,4.54
1273,4.52
1274,4.51
1275,4.48
1276,4.41
1277,4.33
1278,4.23
1279,4.10
1280,3.95
1281,3.77
1282,3.60
1283,3.48
1284,3.41
1285,3.37
1286,3.40
1287,3.52
1288,3.75
1289,4.04
1290,4.36
1291,4.63
1292,4.87
1293,5.10
1294,5.36
1295,5.64
1296,6.00
1297,6.44
1298,7.01
1299,7.63
1300,8.27
1301,8.80
1302,9.24
1303,9.51
1304,9.71
1305,9.85
1306,10.03
1307,10.25
1308,10.58
1309,10.96
1310,11.41
1311,11.82
1312,12.18
1313,12.38
1314,12.44
1315,12.33
1316,12.16
1317,11.99
1318,11.93
1319,11.98
1320,12.17
1321,12.43
1322,12.79
1323,13.20
1324,13.69
1325,14.22
1326,14.82
1327,15.45
1328,16.07
1329,16.61
1330,17.04
1331,17.27
1332,17.28
1333,17.07
1334,16.71
1335,16.30
1336,15.95
1337,15.71
1338,15.62
1339,15.69
1340,15.86
1341,16.04
1342,16.14
1343,16.09
1344,15.87
1345,15.50
1346,15.05
1347,14.63
1348,14.32
1349,14.21
1350,14.23
1351,14.37
1352,14.54
1353,14.67
1354,14.66
1355,14.49
1356,14.14
1357,13.69
1358,13.17
1359,12.63
1360,12.12
1361,11.67
1362,11.29
1363,11.03
1364,10.88
1365,10.82
1366,10.80
1367,10.84
1368,10.93
1369,11.05
1370,11.15
1371,11.18
1372,11.15
1373,11.09
1374,11.01
1375,10.95
1376,10.96
1377,11.04
1378,11.21
1379,11.45
1380,11.76
1381,12.09
1382,12.38
1383,12.60
1384,12.73
1385,12.78
1386,12.77
1387,12.71
1388,12.61
1389,12.49
1390,12.36
1391,12.25
1392,12.15
1393,12.12
1394,12.15
1395,12.21
1396,12.28
1397,12.28
1398,12.19
1399,12.04
1400,11.86
1401,11.71
1402,11.60
1403,11.57
1404,11.66
1405,11.90
1406,12.25
1407,12.60
1408,12.82
1409,12.86
1410,12.68
1411,12.34
1412,11.89
1413,11.44
1414,11.06
1415,10.80
1416,10.63
1417,10.54
1418,10.51
1419,10.48
1420,10.41
1421,10.30
1422,10.14
1423,9.99
1424,9.86
1425,9.77
1426,9.74
1427,9.81
1428,9.95
1429,10.13
1430,10.29
1431,10.39
1432,10.40
1433,10.31
1434,10.10
1435,9.80
1436,9.45
1437,9.12
1438,8.83
1439,8.62
1440,8.52
1441,8.52
1442,8.59
1443,8.71
1444,8.89
1445,9.09
1446,9.32
1447,9.56
1448,9.82
1449,10.09
1450,10.35
1451,10.59
1452,10.80
1453,10.99
1454,11.14
1455,11.22
1456,11.21
1457,11.12
1458,11.00
1459,10.90
1460,10.86
1461,10.86
1462,10.93
1463,11.07
1464,11.29
1465,11.57
1466,11.86
1467,12.11
1468,12.25
1469,12.21
1470,12.01
1471,11.70
1472,11.38
1473,11.10
1474,10.93
1475,10.86
1476,10.92
1477,11.04
1478,11.18
1479,11.25
1480,11.18
1481,11.01
1482,10.73
1483,10.43
1484,10.14
1485,9.93
1486,9.84
1487,9.87
1488,9.99
1489,10.14
1490,10.30
1491,10.42
1492,10.49
1493,10.52
1494,10.53
1495,10.53
1496,10.52
1497,10.49
1498,10.41
1499,10.28
1500,10.16
1501,10.07
1502,10.02
1503,10.02
1504,10.09
1505,10.28
1506,10.55
1507,10.88
1508,11.22
1509,11.49
1510,11.67
1511,11.73
1512,11.67
1513,11.54
1514,11.40
1515,11.31
1516,11.32
1517,11.44
1518,11.63
1519,11.88
1520,12.15
1521,12.38
1522,12.55
1523,12.63
1524,12.70
1525,12.79
1526,12.91
1527,13.06
1528,13.22
1529,13.38
1530,13.49
1531,13.50
1532,13.36
1533,13.08
1534,12.73
1535,12.42
1536,12.24
1537,12.18
1538,12.21
1539,12.31
1540,12.45
1541,12.57
1542,12.58
1543,12.47
1544,12.27
1545,12.05
1546,11.84
1547,11.70
1548,11.64
1549,11.67
1550,11.75
1551,11.80
1552,11.72
1553,11.54
1554,11.28
1555,10.98
1556,10.64
1557,10.31
1558,10.03
1559,9.83
1560,9.68
1561,9.54
1562,9.33
1563,9.03
1564,8.67
1565,8.34
1566,8.06
1567,7.89
1568,7.80
1569,7.80
1570,7.89
1571,8.04
1572,8.22
1573,8.45
1574,8.68
1575,8.91
1576,9.12
1577,9.32
1578,9.48
1579,9.58
1580,9.64
1581,9.64
1582,9.64
1583,9.63
1584,9.61
1585,9.57
1586,9.58
1587,9.67
1588,9.83
1589,9.97
1590,10.09
1591,10.17
1592,10.28
1593,10.40
1594,10.50
1595,10.55
1596,10.60
1597,10.69
1598,10.83
1599,10.98
1600,11.12
1601,11.27
1602,11.48
1603,11.74
1604,12.02
1605,12.27
1606,12.51
1607,12.74
1608,12.91
1609,12.97
1610,12.96
1611,12.86
1612,12.66
1613,12.36
1614,12.04
1615,11.76
1616,11.57
1617,11.44
1618,11.40
1619,11.42
1620,11.54
1621,11.72
1622,11.93
1623,12.12
1624,12.23
1625,12.26
1626,12.24
1627,12.18
1628,12.06
1629,11.92
1630,11.76
1631,11.64
1632,11.56
1633,11.51
1634,11.44
1635,11.35
1636,11.22
1637,11.08
1638,10.92
1639,10.80
1640,10.73
1641,10.74
1642,10.76
1643,10.76
1644,10.74
1645,10.71
1646,10.66
1647,10.57
1648,10.48
1649,10.41
1650,10.43
1651,10.57
1652,10.83
1653,11.13
1654,11.44
1655,11.71
1656,11.93
1657,12.08
1658,12.15
1659,12.15
1660,12.10
1661,12.00
1662,11.88
1663,11.76
1664,11.68
1665,11.68
1666,11.78
1667,11.99
1668,12.30
1669,12.70
1670,13.11
1671,13.44
1672,13.64
1673,13.67
1674,13.54
1675,13.29
1676,12.97
1677,12.64
1678,12.37
1679,12.15
1680,11.98
1681,11.81
1682,11.64
1683,11.48
1684,11.34
1685,11.25
1686,11.24
1687,11.31
1688,11.38
1689,11.41
1690,11.41
1691,11.31
1692,11.12
1693,10.81
1694,10.46
1695,10.19
1696,10.05
1697,10.09
1698,10.25
1699,10.51
1700,10.77
1701,10.96
1702,11.00
1703,10.88
1704,10.60
1705,10.24
1706,9.86
1707,9.53
1708,9.26
1709,9.09
1710,9.00
1711,9.00
1712,9.06
1713,9.09
1714,9.06
1715,8.97
1716,8.87
1717,8.80
1718,8.79
1719,8.79
1720,8.79
1721,8.83
1722,8.91
1723,9.03
1724,9.12
1725,9.16
1726,9.16
1727,9.16
1728,9.13
1729,9.07
1730,8.99
1731,8.93
1732,8.90
1733,8.91
1734,8.92
1735,8.92
1736,8.91
1737,8.89
1738,8.80
1739,8.62
1740,8.36
1741,8.06
1742,7.74
1743,7.44
1744,7.19
1745,7.01
1746,6.89
1747,6.81
1748,6.74
1749,6.68
1750,6.61
1751,6.52
1752,6.43
1753,6.37
1754,6.35
1755,6.39
1756,6.46
1757,6.55
1758,6.61
1759,6.61
1760,6.56
1761,6.43
1762,6.24
1763,6.03
1764,5.87
1765,5.81
1766,5.83
1767,5.92
1768,6.09
1769,6.29
1770,6.52
1771,6.70
1772,6.84
1773,6.91
1774,6.99
1775,7.10
1776,7.30
1777,7.59
1778,7.97
1779,8.36
1780,8.74
1781,9.03
1782,9.24
1783,9.32
1784,9.34
1785,9.32
1786,9.35
1787,9.44
1788,9.61
1789,9.85
1790,10.12
1791,10.40
1792,10.65
1793,10.83
1794,10.91
1795,10.90
1796,10.85
1797,10.79
1798,10.73
1799,10.64
1800,10.50
1801,10.32
1802,10.13
1803,9.96
1804,9.77
1805,9.59
1806,9.44
1807,9.35
1808,9.33
1809,9.37
1810,9.43
1811,9.52
1812,9.62
1813,9.68
1814,9.66
1815,9.57
1816,9.46
1817,9.37
1818,9.29
1819,9.18
1820,9.00
1821,8.76
1822,8.46
1823,8.13
1824,7.80
1825,7.53
1826,7.35
1827,7.29
1828,7.33
1829,7.46
1830,7.64
1831,7.83
1832,7.94
1833,7.98
1834,7.93
1835,7.80
1836,7.60
1837,7.36
1838,7.15
1839,7.00
1840,6.90
1841,6.85
1842,6.82
1843,6.82
1844,6.84
1845,6.88
1846,6.90
1847,6.90
1848,6.87
1849,6.81
1850,6.71
1851,6.63
1852,6.57
1853,6.53
1854,6.51
1855,6.52
1856,6.58
1857,6.69
1858,6.83
1859,6.96
1860,7.07
1861,7.16
1862,7.18
1863,7.16
1864,7.13
1865,7.11
1866,7.13
1867,7.16
1868,7.23
1869,7.32
1870,7.40
1871,7.47
1872,7.51
1873,7.54
1874,7.53
1875,7.51
1876,7.48
1877,7.45
1878,7.39
1879,7.30
1880,7.20
1881,7.11
1882,7.00
1883,6.90
1884,6.78
1885,6.68
1886,6.61
1887,6.58
1888,6.61
1889,6.67
1890,6.75
1891,6.81
1892,6.83
1893,6.81
1894,6.74
1895,6.65
1896,6.52
1897,6.41
1898,6.33
1899,6.33
1900,6.38
1901,6.44
1902,6.49
1903,6.49
1904,6.43
1905,6.31
1906,6.17
1907,6.11
1908,6.16
1909,6.32
1910,6.50
1911,6.69
1912,6.86
1913,6.98
1914,7.00
1915,6.88
1916,6.65
1917,6.37
1918,6.12
1919,5.91
1920,5.73
1921,5.58
1922,5.48
1923,5.42
1924,5.37
1925,5.31
1926,5.26
1927,5.22
1928,5.23
1929,5.29
1930,5.39
1931,5.51
1932,5.66
1933,5.81
1934,5.92
1935,6.01
1936,6.10
1937,6.19
1938,6.28
1939,6.37
1940,6.47
1941,6.58
1942,6.72
1943,6.85
1944,6.93
1945,6.93
1946,6.83
1947,6.65
1948,6.41
1949,6.17
1950,5.96
1951,5.81
1952,5.72
1953,5.74
1954,5.82
1955,5.94
1956,6.03
1957,6.03
1958,5.94
1959,5.77
1960,5.49
1961,5.13
1962,4.71
1963,4.29
1964,3.90
1965,3.58
1966,3.31
1967,3.10
1968,2.94
1969,2.88
1970,2.94
1971,3.09
1972,3.30
1973,3.51
1974,3.71
1975,3.89
1976,4.04
1977,4.12
1978,4.17
1979,4.19
1980,4.23
1981,4.33
1982,4.47
1983,4.64
1984,4.84
1985,5.05
1986,5.28
1987,5.49
1988,5.65
1989,5.74
1990,5.78
1991,5.84
1992,5.93
1993,6.05
1994,6.19
1995,6.30
1996,6.40
1997,6.45
1998,6.47
1999,6.41
2000,6.29
2001,6.16
2002,6.12
2003,6.24
2004,6.48
2005,6.79
2006,7.10
2007,7.41
2008,7.67
2009,7.82
2010,7.81
2011,7.63
2012,7.34
2013,7.00
2014,6.66
2015,6.36
2016,6.15
2017,6.09
2018,6.18
2019,6.36
2020,6.58
2021,6.76
2022,6.90
2023,6.99
2024,7.01
2025,6.99
2026,6.93
2027,6.89
2028,6.90
2029,6.97
2030,7.06
2031,7.13
2032,7.12
2033,7.00
2034,6.75
2035,6.39
2036,5.94
2037,5.49
2038,5.12
2039,4.88
2040,4.75
2041,4.70
2042,4.68
2043,4.69
2044,4.65
2045,4.51
2046,4.23
2047,3.88
2048,3.47
2049,3.14
2050,2.92
2051,2.84
2052,2.85
2053,2.91
2054,3.00
2055,3.12
2056,3.29
2057,3.49
2058,3.72
2059,3.93
2060,4.14
2061,4.32
2062,4.45
2063,4.50
2064,4.52
2065,4.51
2066,4.53
2067,4.55
2068,4.60
2069,4.71
2070,4.94
2071,5.23
2072,5.53
2073,5.74
2074,5.89
2075,5.97
2076,6.00
2077,5.97
2078,5.90
2079,5.83
2080,5.83
2081,5.92
2082,6.08
2083,6.26
2084,6.45
2085,6.63
2086,6.79
2087,6.91
2088,6.97
2089,6.94
2090,6.82
2091,6.68
2092,6.52
2093,6.34
2094,6.12
2095,5.89
2096,5.67
2097,5.49
2098,5.29
2099,5.10
2100,4.90
2101,4.75
2102,4.62
2103,4.48
2104,4.30
2105,4.09
2106,3.87
2107,3.66
2108,3.46
2109,3.28
2110,3.14
2111,3.04
2112,2.99
2113,3.01
2114,3.04
2115,3.07
2116,3.04
2117,2.96
2118,2.85
2119,2.72
2120,2.59
2121,2.54
2122,2.61
2123,2.82
2124,3.09
2125,3.34
2126,3.52
2127,3.61
2128,3.57
2129,3.40
2130,3.11
2131,2.77
2132,2.45
2133,2.20
2134,2.10
2135,2.15
2136,2.37
2137,2.72
2138,3.20
2139,3.75
2140,4.30
2141,4.81
2142,5.26
2143,5.62
2144,5.90
2145,6.10
2146,6.26
2147,6.36
2148,6.46
2149,6.55
2150,6.65
2151,6.71
2152,6.69
2153,6.60
2154,6.47
2155,6.32
2156,6.15
2157,6.00
2158,5.89
2159,5.86
2160,5.89
2161,5.93
2162,5.93
2163,5.87
2164,5.75
2165,5.61
2166,5.43
2167,5.25
2168,5.09
2169,5.00
2170,5.02
2171,5.13
2172,5.29
2173,5.46
2174,5.60
2175,5.71
2176,5.78
2177,5.78
2178,5.74
2179,5.68
2180,5.60
2181,5.51
2182,5.41
2183,5.33
2184,5.26
2185,5.20
2186,5.12
2187,5.07
2188,5.07
2189,5.12
2190,5.19
2191,5.22
2192,5.23
2193,5.26
2194,5.29
2195,5.30
2196,5.25
2197,5.19
2198,5.17
2199,5.23
2200,5.34
2201,5.47
2202,5.58
2203,5.65
2204,5.59
2205,5.39
2206,5.04
2207,4.57
2208,4.08
2209,3.69
2210,3.48
2211,3.48
2212,3.64
2213,3.96
2214,4.37
2215,4.80
2216,5.10
2217,5.20
2218,5.10
2219,4.84
2220,4.48
2221,4.07
2222,3.68
2223,3.40
2224,3.28
2225,3.31
2226,3.46
2227,3.75
2228,4.10
2229,4.44
2230,4.63
2231,4.67
2232,4.59
2233,4.42
2234,4.20
2235,3.97
2236,3.77
2237,3.60
2238,3.48
2239,3.40
2240,3.40
2241,3.45
2242,3.52
2243,3.61
2244,3.78
2245,4.04
2246,4.35
2247,4.66
2248,4.97
2249,5.23
2250,5.42
2251,5.48
2252,5.45
2253,5.34
2254,5.22
2255,5.13
2256,5.13
2257,5.25
2258,5.42
2259,5.59
2260,5.70
2261,5.70
2262,5.54
2263,5.24
2264,4.86
2265,4.49
2266,4.19
2267,4.02
2268,3.97
2269,4.04
2270,4.15
2271,4.26
2272,4.26
2273,4.12
2274,3.80
2275,3.34
2276,2.79
2277,2.26
2278,1.79
2279,1.43
2280,1.19
2281,1.08
2282,1.09
2283,1.18
2284,1.27
2285,1.34
2286,1.40
2287,1.42
2288,1.37
2289,1.27
2290,1.12
2291,0.99
2292,0.88
2293,0.79
2294,0.76
2295,0.82
2296,0.95
2297,1.11
2298,1.26
2299,1.35
2300,1.34
2301,1.22
2302,1.03
2303,0.84
2304,0.69
2305,0.61
2306,0.60
2307,0.66
2308,0.75
2309,0.85
2310,0.92
2311,0.95
2312,0.91
2313,0.79
2314,0.63
2315,0.48
2316,0.34
2317,0.19
2318,0.02
2319,-0.15
2320,-0.34
2321,-0.54
2322,-0.79
2323,-1.06
2324,-1.30
2325,-1.45
2326,-1.54
2327,-1.59
2328,-1.66
2329,-1.74
2330,-1.84
2331,-1.96
2332,-2.14
2333,-2.34
2334,-2.53
2335,-2.69
2336,-2.82
2337,-2.92
2338,-3.03
2339,-3.12
2340,-3.22
2341,-3.31
2342,-3.36
2343,-3.33
2344,-3.23
2345,-3.04
2346,-2.78
2347,-2.49
2348,-2.17
2349,-1.91
2350,-1.69
2351,-1.52
2352,-1.34
2353,-1.17
2354,-0.98
2355,-0.82
2356,-0.61
2357,-0.37
2358,-0.11
2359,0.09
2360,0.21
2361,0.27
2362,0.33
2363,0.38
2364,0.40
2365,0.41
2366,0.46
2367,0.57
2368,0.72
2369,0.82
2370,0.82
2371,0.73
2372,0.55
2373,0.24
2374,-0.16
2375,-0.62
2376,-1.05
2377,-1.38
2378,-1.59
2379,-1.67
2380,-1.67
2381,-1.63
2382,-1.60
2383,-1.63
2384,-1.75
2385,-1.97
2386,-2.24
2387,-2.47
2388,-2.64
2389,-2.70
2390,-2.66
2391,-2.53
2392,-2.36
2393,-2.21
2394,-2.14
2395,-2.13
2396,-2.18
2397,-2.28
2398,-2.40
2399,-2.49
2400,-2.49
2401,-2.37
2402,-2.16
2403,-1.91
2404,-1.67
2405,-1.49
2406,-1.40
2407,-1.37
2408,-1.36
2409,-1.34
2410,-1.28
2411,-1.17
2412,-0.94
2413,-0.62
2414,-0.25
2415,0.05
2416,0.25
2417,0.37
2418,0.46
2419,0.47
2420,0.42
2421,0.33
2422,0.30
2423,0.34
2424,0.45
2425,0.60
2426,0.84
2427,1.12
2428,1.43
2429,1.74
2430,2.07
2431,2.39
2432,2.66
2433,2.84
2434,2.97
2435,3.08
2436,3.20
2437,3.28
2438,3.37
2439,3.49
2440,3.65
2441,3.84
2442,3.99
2443,4.07
2444,4.10
2445,4.04
2446,3.88
2447,3.64
2448,3.36
2449,3.12
2450,2.94
2451,2.82
2452,2.76
2453,2.77
2454,2.82
2455,2.92
2456,3.00
2457,3.03
2458,2.99
2459,2.91
2460,2.78
2461,2.62
2462,2.46
2463,2.31
2464,2.20
2465,2.14
2466,2.13
2467,2.14
2468,2.12
2469,2.09
2470,2.05
2471,1.99
2472,1.89
2473,1.74
2474,1.56
2475,1.41
2476,1.32
2477,1.29
2478,1.30
2479,1.37
2480,1.49
2481,1.66
2482,1.87
2483,2.05
2484,2.20
2485,2.29
2486,2.32
2487,2.28
2488,2.22
2489,2.17
2490,2.13
2491,2.07
2492,1.94
2493,1.76
2494,1.59
2495,1.43
2496,1.26
2497,1.05
2498,0.86
2499,0.73
2500,0.67
2501,0.65
2502,0.65
2503,0.71
2504,0.82
2505,0.94
2506,1.05
2507,1.14
2508,1.24
2509,1.32
2510,1.40
2511,1.46
2512,1.50
2513,1.53
2514,1.53
2515,1.50
2516,1.46
2517,1.40
2518,1.30
2519,1.20
2520,1.06
2521,0.94
2522,0.82
2523,0.71
2524,0.56
2525,0.35
2526,0.09
2527,-0.21
2528,-0.53
2529,-0.84
2530,-1.08
2531,-1.20
2532,-1.16
2533,-1.01
2534,-0.79
2535,-0.55
2536,-0.30
2537,-0.03
2538,0.24
2539,0.48
2540,0.69
2541,0.85
2542,1.03
2543,1.20
2544,1.38
2545,1.52
2546,1.66
2547,1.79
2548,2.00
2549,2.25
2550,2.59
2551,2.98
2552,3.43
2553,3.90
2554,4.39
2555,4.84
2556,5.26
2557,5.66
2558,6.10
2559,6.55
2560,6.98
2561,7.31
2562,7.54
2563,7.66
2564,7.65
2565,7.50
2566,7.21
2567,6.81
2568,6.39
2569,5.99
2570,5.67
2571,5.46
2572,5.37
2573,5.37
2574,5.42
2575,5.50
2576,5.53
2577,5.52
2578,5.38
2579,5.14
2580,4.81
2581,4.45
2582,4.10
2583,3.81
2584,3.54
2585,3.31
2586,3.10
2587,2.91
2588,2.75
2589,2.64
2590,2.59
2591,2.59
2592,2.61
2593,2.67
2594,2.82
2595,3.01
2596,3.24
2597,3.49
2598,3.76
2599,4.05
2600,4.34
2601,4.59
2602,4.78
2603,4.94
2604,5.01
2605,4.97
2606,4.87
2607,4.71
2608,4.55
2609,4.43
2610,4.37
2611,4.39
2612,4.52
2613,4.70
2614,4.89
2615,5.04
2616,5.17
2617,5.31
2618,5.49
2619,5.72
2620,6.04
2621,6.43
2622,6.87
2623,7.29
2624,7.65
2625,7.89
2626,8.03
2627,8.11
2628,8.19
2629,8.27
2630,8.37
2631,8.51
2632,8.64
2633,8.71
2634,8.61
2635,8.32
2636,7.82
2637,7.16
2638,6.37
2639,5.59
2640,4.90
2641,4.43
2642,4.16
2643,4.09
2644,4.11
2645,4.19
2646,4.21
2647,4.16
2648,3.97
2649,3.68
2650,3.31
2651,2.95
2652,2.63
2653,2.40
2654,2.22
2655,2.14
2656,2.14
2657,2.17
2658,2.17
2659,2.12
2660,2.01
2661,1.85
2662,1.69
2663,1.57
2664,1.53
2665,1.55
2666,1.63
2667,1.76
2668,1.95
2669,2.14
2670,2.34
2671,2.52
2672,2.71
2673,2.94
2674,3.21
2675,3.48
2676,3.74
2677,3.97
2678,4.20
2679,4.35
2680,4.40
2681,4.36
2682,4.31
2683,4.27
2684,4.28
2685,4.30
2686,4.36
2687,4.46
2688,4.58
2689,4.67
2690,4.68
2691,4.62
2692,4.52
2693,4.43
2694,4.34
2695,4.28
2696,4.29
2697,4.39
2698,4.52
2699,4.59
2700,4.52
2701,4.30
2702,3.96
2703,3.57
2704,3.20
2705,2.89
2706,2.70
2707,2.68
2708,2.82
2709,3.11
2710,3.40
2711,3.62
2712,3.72
2713,3.68
2714,3.54
2715,3.35
2716,3.19
2717,3.10
2718,3.11
2719,3.16
2720,3.23
2721,3.30
2722,3.34
2723,3.36
2724,3.40
2725,3.49
2726,3.66
2727,3.90
2728,4.17
2729,4.41
2730,4.61
2731,4.72
2732,4.77
2733,4.75
2734,4.78
2735,4.88
2736,5.13
2737,5.55
2738,6.12
2739,6.74
2740,7.38
2741,7.89
2742,8.24
2743,8.38
2744,8.34
2745,8.22
2746,8.09
2747,8.03
2748,8.03
2749,8.09
2750,8.22
2751,8.37
2752,8.48
2753,8.48
2754,8.38
2755,8.17
2756,7.83
2757,7.38
2758,6.87
2759,6.39
2760,5.97
2761,5.65
2762,5.43
2763,5.35
2764,5.33
2765,5.37
2766,5.44
2767,5.53
2768,5.62
2769,5.68
2770,5.71
2771,5.72
2772,5.68
2773,5.58
2774,5.45
2775,5.27
2776,5.06
2777,4.84
2778,4.66
2779,4.55
2780,4.48
2781,4.43
2782,4.34
2783,4.23
2784,4.07
2785,3.93
2786,3.79
2787,3.68
2788,3.55
2789,3.40
2790,3.24
2791,3.10
2792,2.94
2793,2.81
2794,2.66
2795,2.51
2796,2.33
2797,2.13
2798,1.88
2799,1.59
2800,1.23
2801,0.87
2802,0.54
2803,0.31
2804,0.16
2805,0.14
2806,0.23
2807,0.38
2808,0.53
2809,0.63
2810,0.66
2811,0.63
2812,0.53
2813,0.40
2814,0.32
2815,0.35
2816,0.47
2817,0.65
2818,0.87
2819,1.11
2820,1.37
2821,1.60
2822,1.80
2823,1.98
2824,2.20
2825,2.49
2826,2.83
2827,3.17
2828,3.49
2829,3.75
2830,3.94
2831,4.02
2832,4.03
2833,3.99
2834,3.97
2835,3.99
2836,4.09
2837,4.26
2838,4.54
2839,4.88
2840,5.21
2841,5.49
2842,5.66
2843,5.74
2844,5.77
2845,5.78
2846,5.77
2847,5.76
2848,5.77
2849,5.80
2850,5.85
2851,5.85
2852,5.75
2853,5.54
2854,5.26
2855,4.95
2856,4.65
2857,4.42
2858,4.29
2859,4.32
2860,4.49
2861,4.74
2862,4.98
2863,5.17
2864,5.25
2865,5.23
2866,5.10
2867,4.88
2868,4.59
2869,4.33
2870,4.12
2871,3.97
2872,3.83
2873,3.68
2874,3.56
2875,3.46
2876,3.41
2877,3.41
2878,3.49
2879,3.68
2880,3.93
2881,4.17
2882,4.33
2883,4.36
2884,4.28
2885,4.09
2886,3.83
2887,3.56
2888,3.35
2889,3.26
2890,3.29
2891,3.44
2892,3.68
2893,3.96
2894,4.19
2895,4.28
2896,4.22
2897,4.03
2898,3.80
2899,3.59
2900,3.40
2901,3.28
2902,3.27
2903,3.39
2904,3.65
2905,3.94
2906,4.20
2907,4.39
2908,4.52
2909,4.64
2910,4.71
2911,4.75
2912,4.76
2913,4.81
2914,4.93
2915,5.06
2916,5.16
2917,5.19
2918,5.11
2919,4.93
2920,4.66
2921,4.36
2922,4.07
2923,3.83
2924,3.65
2925,3.54
2926,3.47
2927,3.44
2928,3.43
2929,3.44
2930,3.43
2931,3.40
2932,3.36
2933,3.33
2934,3.33
2935,3.40
2936,3.47
2937,3.54
2938,3.56
2939,3.53
2940,3.45
2941,3.30
2942,3.10
2943,2.89
2944,2.69
2945,2.50
2946,2.33
2947,2.22
2948,2.18
2949,2.24
2950,2.38
2951,2.56
2952,2.78
2953,2.99
2954,3.15
2955,3.24
2956,3.27
2957,3.24
2958,3.14
2959,3.00
2960,2.85
2961,2.72
2962,2.62
2963,2.58
2964,2.54
2965,2.49
2966,2.37
2967,2.18
2968,1.96
2969,1.75
2970,1.56
2971,1.38
2972,1.23
2973,1.14
2974,1.13
2975,1.23
2976,1.39
2977,1.58
2978,1.72
2979,1.82
2980,1.85
2981,1.79
2982,1.61
2983,1.31
2984,0.94
2985,0.61
2986,0.37
2987,0.24
2988,0.24
2989,0.37
2990,0.60
2991,0.84
2992,1.01
2993,1.05
2994,0.94
2995,0.66
2996,0.22
2997,-0.28
2998,-0.76
2999,-1.12
3000,-1.38
3001,-1.53
3002,-1.55
3003,-1.46
3004,-1.32
3005,-1.21
3006,-1.20
3007,-1.27
3008,-1.40
3009,-1.56
3010,-1.66
3011,-1.67
3012,-1.54
3013,-1.27
3014,-0.86
3015,-0.38
3016,0.11
3017,0.50
3018,0.76
3019,0.90
3020,0.98
3021,1.02
3022,1.10
3023,1.24
3024,1.52
3025,1.87
3026,2.26
3027,2.62
3028,2.98
3029,3.29
3030,3.56
3031,3.77
3032,3.95
3033,4.12
3034,4.30
3035,4.45
3036,4.55
3037,4.62
3038,4.65
3039,4.64
3040,4.59
3041,4.54
3042,4.52
3043,4.57
3044,4.68
3045,4.81
3046,4.94
3047,5.05
3048,5.13
3049,5.17
3050,5.18
3051,5.17
3052,5.13
3053,5.08
3054,5.03
3055,4.97
3056,4.85
3057,4.65
3058,4.38
3059,4.17
3060,4.04
3061,4.02
3062,4.05
3063,4.15
3064,4.30
3065,4.46
3066,4.52
3067,4.44
3068,4.21
3069,3.90
3070,3.55
3071,3.19
3072,2.85
3073,2.56
3074,2.33
3075,2.17
3076,2.11
3077,2.14
3078,2.25
3079,2.47
3080,2.76
3081,3.09
3082,3.40
3083,3.67
3084,3.92
3085,4.09
3086,4.14
3087,4.08
3088,4.01
3089,3.99
3090,4.08
3091,4.29
3092,4.67
3093,5.20
3094,5.86
3095,6.55
3096,7.23
3097,7.79
3098,8.21
3099,8.43
3100,8.54
3101,8.55
3102,8.57
3103,8.58
3104,8.68
3105,8.88
3106,9.22
3107,9.64
3108,10.10
3109,10.57
3110,11.09
3111,11.59
3112,12.05
3113,12.37
3114,12.58
3115,12.69
3116,12.76
3117,12.78
3118,12.78
3119,12.80
3120,12.95
3121,13.20
3122,13.56
3123,13.92
3124,14.29
3125,14.61
3126,14.85
3127,14.97
3128,14.99
3129,14.95
3130,14.89
3131,14.85
3132,14.90
3133,15.02
3134,15.20
3135,15.38
3136,15.53
3137,15.63
3138,15.62
3139,15.47
3140,15.18
3141,14.79
3142,14.35
3143,13.93
3144,13.55
3145,13.26
3146,13.04
3147,12.91
3148,12.79
3149,12.67
3150,12.53
3151,12.36
3152,12.12
3153,11.83
3154,11.46
3155,11.07
3156,10.70
3157,10.37
3158,10.06
3159,9.77
3160,9.48
3161,9.25
3162,9.06
3163,8.90
3164,8.81
3165,8.84
3166,9.02
3167,9.30
3168,9.57
3169,9.77
3170,9.83
3171,9.80
3172,9.68
3173,9.50
3174,9.28
3175,9.09
3176,9.00
3177,9.00
3178,9.06
3179,9.09
3180,9.08
3181,8.95
3182,8.72
3183,8.45
3184,8.22
3185,8.09
3186,8.09
3187,8.22
3188,8.45
3189,8.72
3190,8.95
3191,9.04
3192,8.99
3193,8.83
3194,8.62
3195,8.44
3196,8.34
3197,8.36
3198,8.53
3199,8.81
3200,9.14
3201,9.44
3202,9.66
3203,9.78
3204,9.83
3205,9.82
3206,9.77
3207,9.75
3208,9.79
3209,9.88
3210,9.95
3211,9.96
3212,9.92
3213,9.85
3214,9.74
3215,9.59
3216,9.44
3217,9.34
3218,9.34
3219,9.45
3220,9.71
3221,10.07
3222,10.49
3223,10.89
3224,11.21
3225,11.38
3226,11.41
3227,11.28
3228,11.07
3229,10.82
3230,10.60
3231,10.48
3232,10.51
3233,10.65
3234,10.85
3235,11.02
3236,11.10
3237,11.06
3238,10.89
3239,10.62
3240,10.33
3241,10.08
3242,9.89
3243,9.80
3244,9.87
3245,10.08
3246,10.35
3247,10.60
3248,10.79
3249,10.88
3250,10.82
3251,10.61
3252,10.32
3253,10.00
3254,9.74
3255,9.58
3256,9.61
3257,9.79
3258,10.07
3259,10.38
3260,10.65
3261,10.84
3262,10.86
3263,10.72
3264,10.42
3265,10.09
3266,9.78
3267,9.57
3268,9.45
3269,9.40
3270,9.39
3271,9.43
3272,9.46
3273,9.44
3274,9.30
3275,9.09
3276,8.86
3277,8.65
3278,8.46
3279,8.29
3280,8.13
3281,7.98
3282,7.81
3283,7.58
3284,7.25
3285,6.89
3286,6.55
3287,6.31
3288,6.18
3289,6.15
3290,6.21
3291,6.33
3292,6.48
3293,6.64
3294,6.76
3295,6.85
3296,6.94
3297,7.04
3298,7.21
3299,7.45
3300,7.77
3301,8.13
3302,8.50
3303,8.80
3304,9.00
3305,9.05
3306,8.98
3307,8.80
3308,8.55
3309,8.31
3310,8.12
3311,8.03
3312,8.06
3313,8.20
3314,8.44
3315,8.72
3316,8.98
3317,9.13
3318,9.12
3319,8.97
3320,8.74
3321,8.48
3322,8.26
3323,8.12
3324,8.10
3325,8.21
3326,8.42
3327,8.67
3328,8.93
3329,9.14
3330,9.24
3331,9.22
3332,9.09
3333,8.90
3334,8.67
3335,8.43
3336,8.24
3337,8.12
3338,8.04
3339,8.00
3340,7.93
3341,7.87
3342,7.81
3343,7.76
3344,7.68
3345,7.56
3346,7.41
3347,7.26
3348,7.12
3349,7.01
3350,6.87
3351,6.74
3352,6.57
3353,6.42
3354,6.28
3355,6.13
3356,5.97
3357,5.80
3358,5.60
3359,5.42
3360,5.28
3361,5.17
3362,5.03
3363,4.88
3364,4.74
3365,4.62
3366,4.52
3367,4.46
3368,4.47
3369,4.56
3370,4.71
3371,4.90
3372,5.08
3373,5.20
3374,5.22
3375,5.13
3376,4.97
3377,4.75
3378,4.50
3379,4.23
3380,3.98
3381,3.81
3382,3.70
3383,3.65
3384,3.60
3385,3.54
3386,3.47
3387,3.41
3388,3.36
3389,3.33
3390,3.32
3391,3.33
3392,3.31
3393,3.29
3394,3.24
3395,3.19
3396,3.10
3397,2.98
3398,2.85
3399,2.72
3400,2.61
3401,2.50
3402,2.37
3403,2.22
3404,2.04
3405,1.86
3406,1.70
3407,1.58
3408,1.50
3409,1.47
3410,1.50
3411,1.59
3412,1.73
3413,1.88
3414,2.02
3415,2.11
3416,2.13
3417,2.10
3418,2.04
3419,1.98
3420,1.93
3421,1.90
3422,1.91
3423,2.01
3424,2.15
3425,2.31
3426,2.42
3427,2.45
3428,2.42
3429,2.32
3430,2.17
3431,2.02
3432,1.93
3433,1.92
3434,1.99
3435,2.11
3436,2.30
3437,2.50
3438,2.71
3439,2.86
3440,2.95
3441,2.98
3442,2.94
3443,2.91
3444,2.94
3445,3.02
3446,3.15
3447,3.30
3448,3.49
3449,3.67
3450,3.79
3451,3.82
3452,3.78
3453,3.68
3454,3.53
3455,3.36
3456,3.18
3457,3.04
3458,2.91
3459,2.82
3460,2.78
3461,2.81
3462,2.91
3463,3.06
3464,3.20
3465,3.33
3466,3.43
3467,3.50
3468,3.49
3469,3.40
3470,3.25
3471,3.07
3472,2.87
3473,2.66
3474,2.44
3475,2.24
3476,2.04
3477,1.90
3478,1.80
3479,1.78
3480,1.79
3481,1.83
3482,1.84
3483,1.79
3484,1.63
3485,1.36
3486,0.98
3487,0.53
3488,0.05
3489,-0.35
3490,-0.59
3491,-0.58
3492,-0.34
3493,0.09
3494,0.59
3495,1.05
3496,1.42
3497,1.66
3498,1.75
3499,1.71
3500,1.59
3501,1.47
3502,1.40
3503,1.39
3504,1.46
3505,1.61
3506,1.85
3507,2.11
3508,2.39
3509,2.59
3510,2.72
3511,2.77
3512,2.80
3513,2.82
3514,2.88
3515,2.97
3516,3.10
3517,3.27
3518,3.52
3519,3.85
3520,4.23
3521,4.64
3522,5.12
3523,5.62
3524,6.15
3525,6.62
3526,7.05
3527,7.39
3528,7.71
3529,7.97
3530,8.21
3531,8.41
3532,8.58
3533,8.70
3534,8.79
3535,8.84
3536,8.86
3537,8.85
3538,8.87
3539,8.92
3540,9.03
3541,9.15
3542,9.28
3543,9.36
3544,9.39
3545,9.36
3546,9.32
3547,9.28
3548,9.26
3549,9.32
3550,9.51
3551,9.80
3552,10.16
3553,10.52
3554,10.86
3555,11.12
3556,11.31
3557,11.39
3558,11.42
3559,11.44
3560,11.52
3561,11.67
3562,11.89
3563,12.15
3564,12.46
3565,12.76
3566,13.03
3567,13.21
3568,13.28
3569,13.24
3570,13.15
3571,13.02
3572,12.90
3573,12.79
3574,12.66
3575,12.50
3576,12.33
3577,12.15
3578,11.99
3579,11.87
3580,11.79
3581,11.79
3582,11.90
3583,12.15
3584,12.47
3585,12.81
3586,13.11
3587,13.32
3588,13.40
3589,13.34
3590,13.15
3591,12.88
3592,12.59
3593,12.31
3594,12.07
3595,11.89
3596,11.81
3597,11.79
3598,11.73
3599,11.62
3600,11.47
3601,11.28
3602,11.03
3603,10.71
3604,10.35
3605,10.03
3606,9.73
3607,9.47
3608,9.20
3609,9.00
3610,8.86
3611,8.78
3612,8.67
3613,8.54
3614,8.35
3615,8.15
3616,7.84
3617,7.47
3618,7.04
3619,6.65
3620,6.29
3621,6.00
3622,5.78
3623,5.67
3624,5.62
3625,5.61
3626,5.54
3627,5.42
3628,5.25
3629,5.04
3630,4.80
3631,4.56
3632,4.36
3633,4.24
3634,4.18
3635,4.16
3636,4.13
3637,4.07
3638,3.98
3639,3.86
3640,3.72
3641,3.60
3642,3.52
3643,3.46
3644,3.40
3645,3.35
3646,3.32
3647,3.28
3648,3.20
3649,3.09
3650,2.96
3651,2.87
3652,2.81
3653,2.78
3654,2.79
3655,2.86
3656,2.95
3657,3.01
3658,2.99
3659,2.91
3660,2.79
3661,2.70
3662,2.62
3663,2.53
3664,2.45
3665,2.38
3666,2.34
3667,2.32
3668,2.30
3669,2.30
3670,2.31
3671,2.31
3672,2.29
3673,2.26
3674,2.24
3675,2.24
3676,2.25
3677,2.26
3678,2.22
3679,2.14
3680,2.00
3681,1.85
3682,1.71
3683,1.65
3684,1.68
3685,1.80
3686,1.98
3687,2.20
3688,2.42
3689,2.60
3690,2.71
3691,2.71
3692,2.59
3693,2.37
3694,2.11
3695,1.87
3696,1.72
3697,1.65
3698,1.68
3699,1.79
3700,2.02
3701,2.31
3702,2.66
3703,3.01
3704,3.39
3705,3.74
3706,4.08
3707,4.38
3708,4.65
3709,4.91
3710,5.20
3711,5.49
3712,5.80
3713,6.07
3714,6.29
3715,6.43
3716,6.48
3717,6.43
3718,6.28
3719,6.06
3720,5.81
3721,5.59
3722,5.49
3723,5.52
3724,5.67
3725,5.85
3726,5.99
3727,6.02
3728,5.94
3729,5.77
3730,5.49
3731,5.16
3732,4.83
3733,4.61
3734,4.56
3735,4.68
3736,4.94
3737,5.24
3738,5.55
3739,5.81
3740,6.03
3741,6.15
3742,6.18
3743,6.14
3744,6.10
3745,6.09
3746,6.16
3747,6.30
3748,6.54
3749,6.84
3750,7.20
3751,7.59
3752,7.95
3753,8.25
3754,8.50
3755,8.67
3756,8.78
3757,8.80
3758,8.78
3759,8.72
3760,8.64
3761,8.54
3762,8.48
3763,8.47
3764,8.53
3765,8.62
3766,8.74
3767,8.85
3768,8.97
3769,9.06
3770,9.10
3771,9.12
3772,9.21
3773,9.37
3774,9.64
3775,10.00
3776,10.47
3777,10.97
3778,11.47
3779,11.89
3780,12.23
3781,12.46
3782,12.60
3783,12.66
3784,12.68
3785,12.67
3786,12.65
3787,12.62
3788,12.62
3789,12.64
3790,12.67
3791,12.68
3792,12.65
3793,12.58
3794,12.49
3795,12.37
3796,12.25
3797,12.12
3798,12.00
3799,11.89
3800,11.78
3801,11.66
3802,11.51
3803,11.37
3804,11.24
3805,11.15
3806,11.09
3807,11.03
3808,10.99
3809,10.96
3810,10.91
3811,10.86
3812,10.78
3813,10.67
3814,10.48
3815,10.24
3816,9.97
3817,9.73
3818,9.52
3819,9.38
3820,9.33
3821,9.38
3822,9.51
3823,9.61
3824,9.62
3825,9.53
3826,9.35
3827,9.13
3828,8.94
3829,8.85
3830,8.90
3831,9.14
3832,9.58
3833,10.13
3834,10.64
3835,10.99
3836,11.08
3837,10.89
3838,10.47
3839,9.95
3840,9.46
3841,9.09
3842,8.88
3843,8.86
3844,9.00
3845,9.22
3846,9.41
3847,9.51
3848,9.48
3849,9.39
3850,9.27
3851,9.18
3852,9.15
3853,9.21
3854,9.36
3855,9.54
3856,9.69
3857,9.75
3858,9.73
3859,9.66
3860,9.60
3861,9.60
3862,9.67
3863,9.86
3864,10.14
3865,10.51
3866,10.88
3867,11.18
3868,11.38
3869,11.44
3870,11.37
3871,11.22
3872,11.03
3873,10.88
3874,10.78
3875,10.75
3876,10.78
3877,10.85
3878,10.91
3879,10.91
3880,10.82
3881,10.64
3882,10.39
3883,10.09
3884,9.76
3885,9.43
3886,9.14
3887,8.96
3888,8.88
3889,8.92
3890,9.03
3891,9.16
3892,9.26
3893,9.32
3894,9.31
3895,9.25
3896,9.17
3897,9.07
3898,8.97
3899,8.92
3900,8.93
3901,9.03
3902,9.14
3903,9.27
3904,9.41
3905,9.55
3906,9.68
3907,9.77
3908,9.85
3909,9.94
3910,10.03
3911,10.09
3912,10.09
3913,9.99
3914,9.85
3915,9.67
3916,9.46
3917,9.22
3918,8.97
3919,8.80
3920,8.73
3921,8.76
3922,8.82
3923,8.88
3924,8.95
3925,9.01
3926,9.03
3927,8.97
3928,8.86
3929,8.74
3930,8.64
3931,8.58
3932,8.54
3933,8.48
3934,8.39
3935,8.27
3936,8.12
3937,7.94
3938,7.74
3939,7.57
3940,7.42
3941,7.30
3942,7.19
3943,7.08
3944,6.92
3945,6.75
3946,6.58
3947,6.39
3948,6.18
3949,6.00
3950,5.92
3951,5.96
3952,6.00
3953,5.96
3954,5.78
3955,5.49
3956,5.05
3957,4.51
3958,3.90
3959,3.36
3960,2.98
3961,2.83
3962,2.88
3963,3.08
3964,3.34
3965,3.56
3966,3.61
3967,3.50
3968,3.25
3969,2.91
3970,2.50
3971,2.09
3972,1.73
3973,1.50
3974,1.34
3975,1.23
3976,1.11
3977,1.00
3978,0.88
3979,0.75
3980,0.63
3981,0.55
3982,0.53
3983,0.57
3984,0.69
3985,0.87
3986,1.14
3987,1.46
3988,1.82
3989,2.14
3990,2.46
3991,2.78
3992,3.13
3993,3.45
3994,3.77
3995,4.08
3996,4.48
3997,4.94
3998,5.52
3999,6.11
4000,6.70
4001,7.20
4002,7.65
4003,8.00
4004,8.27
4005,8.47
4006,8.67
4007,8.90
4008,9.18
4009,9.48
4010,9.80
4011,10.10
4012,10.32
4013,10.38
4014,10.28
4015,10.03
4016,9.70
4017,9.38
4018,9.07
4019,8.80
4020,8.56
4021,8.35
4022,8.17
4023,8.00
4024,7.78
4025,7.52
4026,7.21
4027,6.88
4028,6.53
4029,6.20
4030,5.93
4031,5.75
4032,5.66
4033,5.64
4034,5.64
4035,5.65
4036,5.64
4037,5.60
4038,5.53
4039,5.48
4040,5.47
4041,5.52
4042,5.62
4043,5.75
4044,5.91
4045,6.08
4046,6.26
4047,6.41
4048,6.55
4049,6.65
4050,6.75
4051,6.84
4052,6.96
4053,7.10
4054,7.27
4055,7.42
4056,7.53
4057,7.59
4058,7.62
4059,7.64
4060,7.70
4061,7.78
4062,7.90
4063,8.03
4064,8.13
4065,8.19
4066,8.22
4067,8.25
4068,8.26
4069,8.26
4070,8.28
4071,8.33
4072,8.43
4073,8.53
4074,8.57
4075,8.51
4076,8.34
4077,8.11
4078,7.83
4079,7.52
4080,7.21
4081,6.94
4082,6.76
4083,6.68
4084,6.61
4085,6.50
4086,6.30
4087,6.03
4088,5.71
4089,5.38
4090,5.06
4091,4.83
4092,4.71
4093,4.75
4094,4.86
4095,5.04
4096,5.19
4097,5.28
4098,5.25
4099,5.13
4100,4.97
4101,4.84
4102,4.78
4103,4.75
4104,4.74
4105,4.71
4106,4.66
4107,4.54
4108,4.33
4109,4.07
4110,3.78
4111,3.52
4112,3.36
4113,3.27
4114,3.27
4115,3.36
4116,3.53
4117,3.78
4118,4.08
4119,4.41
4120,4.71
4121,4.99
4122,5.23
4123,5.40
4124,5.47
4125,5.41
4126,5.26
4127,5.07
4128,4.91
4129,4.78
4130,4.75
4131,4.84
4132,5.04
4133,5.31
4134,5.60
4135,5.84
4136,6.00
4137,6.07
4138,6.02
4139,5.90
4140,5.74
4141,5.62
4142,5.57
4143,5.60
4144,5.69
4145,5.84
4146,6.04
4147,6.23
4148,6.34
4149,6.34
4150,6.24
4151,6.09
4152,5.91
4153,5.72
4154,5.58
4155,5.49
4156,5.45
4157,5.39
4158,5.26
4159,5.06
4160,4.79
4161,4.49
4162,4.17
4163,3.90
4164,3.73
4165,3.70
4166,3.78
4167,3.91
4168,4.05
4169,4.20
4170,4.36
4171,4.50
4172,4.64
4173,4.78
4174,4.97
4175,5.21
4176,5.50
4177,5.80
4178,6.09
4179,6.35
4180,6.62
4181,6.92
4182,7.25
4183,7.58
4184,7.89
4185,8.15
4186,8.38
4187,8.52
4188,8.58
4189,8.54
4190,8.47
4191,8.41
4192,8.36
4193,8.28
4194,8.09
4195,7.84
4196,7.50
4197,7.11
4198,6.64
4199,6.13
4200,5.66
4201,5.29
4202,5.05
4203,4.94
4204,4.94
4205,5.00
4206,5.07
4207,5.11
4208,5.10
4209,5.04
4210,4.91
4211,4.77
4212,4.60
4213,4.49
4214,4.43
4215,4.43
4216,4.47
4217,4.54
4218,4.60
4219,4.64
4220,4.59
4221,4.44
4222,4.22
4223,3.98
4224,3.74
4225,3.53
4226,3.36
4227,3.28
4228,3.27
4229,3.31
4230,3.33
4231,3.30
4232,3.20
4233,3.05
4234,2.86
4235,2.62
4236,2.31
4237,1.99
4238,1.69
4239,1.49
4240,1.34
4241,1.22
4242,1.13
4243,1.07
4244,1.04
4245,1.01
4246,0.96
4247,0.91
4248,0.86
4249,0.86
4250,0.91
4251,0.97
4252,1.04
4253,1.12
4254,1.24
4255,1.36
4256,1.46
4257,1.52
4258,1.55
4259,1.58
4260,1.63
4261,1.68
4262,1.72
4263,1.76
4264,1.79
4265,1.81
4266,1.84
4267,1.90
4268,2.02
4269,2.17
4270,2.31
4271,2.46
4272,2.66
4273,2.87
4274,3.02
4275,3.08
4276,3.09
4277,3.07
4278,3.06
4279,3.04
4280,3.02
4281,3.01
4282,3.01
4283,3.01
4284,3.04
4285,3.10
4286,3.19
4287,3.31
4288,3.46
4289,3.64
4290,3.85
4291,4.00
4292,4.02
4293,3.91
4294,3.68
4295,3.37
4296,3.01
4297,2.62
4298,2.26
4299,2.01
4300,1.92
4301,2.02
4302,2.27
4303,2.57
4304,2.85
4305,3.07
4306,3.20
4307,3.27
4308,3.23
4309,3.14
4310,3.05
4311,3.05
4312,3.13
4313,3.23
4314,3.28
4315,3.26
4316,3.14
4317,2.92
4318,2.62
4319,2.30
4320,1.99
4321,1.79
4322,1.68
4323,1.69
4324,1.77
4325,1.86
4326,1.91
4327,1.88
4328,1.79
4329,1.63
4330,1.42
4331,1.24
4332,1.17
4333,1.20
4334,1.28
4335,1.37
4336,1.49
4337,1.59
4338,1.69
4339,1.79
4340,1.91
4341,2.08
4342,2.30
4343,2.54
4344,2.82
4345,3.11
4346,3.39
4347,3.60
4348,3.77
4349,3.88
4350,3.92
4351,3.86
4352,3.73
4353,3.58
4354,3.43
4355,3.31
4356,3.23
4357,3.20
4358,3.23
4359,3.32
4360,3.46
4361,3.64
4362,3.85
4363,4.06
4364,4.23
4365,4.29
4366,4.21
4367,4.01
4368,3.71
4369,3.38
4370,3.04
4371,2.73
4372,2.51
4373,2.43
4374,2.47
4375,2.59
4376,2.72
4377,2.82
4378,2.87
4379,2.83
4380,2.71
4381,2.53
4382,2.36
4383,2.23
4384,2.15
4385,2.13
4386,2.16
4387,2.25
4388,2.37
4389,2.46
4390,2.53
4391,2.57
4392,2.64
4393,2.76
4394,2.95
4395,3.20
4396,3.45
4397,3.68
4398,3.91
4399,4.08
4400,4.19
4401,4.23
4402,4.20
4403,4.10
4404,3.95
4405,3.81
4406,3.70
4407,3.67
4408,3.68
4409,3.75
4410,3.86
4411,3.98
4412,4.07
4413,4.04
4414,3.88
4415,3.61
4416,3.27
4417,2.91
4418,2.55
4419,2.25
4420,2.05
4421,1.99
4422,2.04
4423,2.14
4424,2.23
4425,2.26
4426,2.20
4427,2.05
4428,1.85
4429,1.66
4430,1.56
4431,1.59
4432,1.76
4433,2.01
4434,2.25
4435,2.43
4436,2.54
4437,2.56
4438,2.52
4439,2.43
4440,2.33
4441,2.23
4442,2.16
4443,2.10
4444,2.04
4445,1.96
4446,1.82
4447,1.63
4448,1.46
4449,1.40
4450,1.49
4451,1.70
4452,1.98
4453,2.31
4454,2.69
4455,3.05
4456,3.31
4457,3.40
4458,3.34
4459,3.21
4460,3.09
4461,3.02
4462,3.04
4463,3.14
4464,3.30
4465,3.47
4466,3.65
4467,3.79
4468,3.93
4469,4.04
4470,4.14
4471,4.26
4472,4.46
4473,4.75
4474,5.12
4475,5.48
4476,5.81
4477,6.03
4478,6.16
4479,6.20
4480,6.16
4481,6.07
4482,5.95
4483,5.85
4484,5.83
4485,5.89
4486,6.01
4487,6.13
4488,6.22
4489,6.25
4490,6.22
4491,6.12
4492,5.98
4493,5.87
4494,5.80
4495,5.77
4496,5.75
4497,5.76
4498,5.78
4499,5.78
4500,5.68
4501,5.48
4502,5.22
4503,4.97
4504,4.75
4505,4.59
4506,4.48
4507,4.49
4508,4.55
4509,4.65
4510,4.71
4511,4.69
4512,4.54
4513,4.24
4514,3.79
4515,3.29
4516,2.82
4517,2.45
4518,2.19
4519,2.08
4520,2.13
4521,2.30
4522,2.53
4523,2.72
4524,2.85
4525,2.88
4526,2.75
4527,2.52
4528,2.26
4529,2.06
4530,1.96
4531,1.94
4532,1.98
4533,2.07
4534,2.20
4535,2.32
4536,2.42
4537,2.47
4538,2.50
4539,2.56
4540,2.68
4541,2.85
4542,3.09
4543,3.36
4544,3.67
4545,3.96
4546,4.22
4547,4.43
4548,4.62
4549,4.79
4550,4.96
4551,5.07
4552,5.14
4553,5.20
4554,5.26
4555,5.29
4556,5.26
4557,5.17
4558,5.05
4559,4.92
4560,4.81
4561,4.76
4562,4.75
4563,4.78
4564,4.82
4565,4.83
4566,4.77
4567,4.62
4568,4.37
4569,4.05
4570,3.67
4571,3.27
4572,2.88
4573,2.52
4574,2.23
4575,2.02
4576,1.87
4577,1.79
4578,1.76
4579,1.79
4580,1.84
4581,1.91
4582,2.00
4583,2.09
4584,2.14
4585,2.14
4586,2.11
4587,2.11
4588,2.16
4589,2.27
4590,2.48
4591,2.74
4592,3.05
4593,3.36
4594,3.64
4595,3.85
4596,3.94
4597,3.91
4598,3.78
4599,3.63
4600,3.51
4601,3.42
4602,3.35
4603,3.31
4604,3.35
4605,3.47
4606,3.63
4607,3.78
4608,3.93
4609,4.10
4610,4.32
4611,4.50
4612,4.62
4613,4.64
4614,4.62
4615,4.62
4616,4.65
4617,4.68
4618,4.72
4619,4.80
4620,4.94
4621,5.17
4622,5.41
4623,5.59
4624,5.65
4625,5.59
4626,5.46
4627,5.27
4628,5.02
4629,4.73
4630,4.46
4631,4.24
4632,4.07
4633,3.96
4634,3.91
4635,3.91
4636,3.91
4637,3.88
4638,3.83
4639,3.78
4640,3.70
4641,3.65
4642,3.62
4643,3.68
4644,3.81
4645,3.94
4646,3.98
4647,3.93
4648,3.78
4649,3.60
4650,3.40
4651,3.22
4652,3.10
4653,3.04
4654,3.01
4655,2.98
4656,2.96
4657,2.89
4658,2.78
4659,2.62
4660,2.48
4661,2.42
4662,2.49
4663,2.66
4664,2.91
4665,3.23
4666,3.56
4667,3.82
4668,3.96
4669,3.96
4670,3.90
4671,3.85
4672,3.87
4673,3.97
4674,4.14
4675,4.33
4676,4.43
4677,4.37
4678,4.15
4679,3.82
4680,3.43
4681,3.02
4682,2.68
4683,2.46
4684,2.44
4685,2.57
4686,2.75
4687,2.88
4688,2.90
4689,2.78
4690,2.51
4691,2.15
4692,1.78
4693,1.51
4694,1.37
4695,1.34
4696,1.38
4697,1.45
4698,1.50
4699,1.54
4700,1.52
4701,1.46
4702,1.38
4703,1.36
4704,1.37
4705,1.41
4706,1.40
4707,1.32
4708,1.14
4709,0.83
4710,0.42
4711,-0.02
4712,-0.43
4713,-0.76
4714,-1.02
4715,-1.16
4716,-1.17
4717,-1.08
4718,-0.98
4719,-0.91
4720,-0.89
4721,-0.89
4722,-0.94
4723,-1.01
4724,-1.14
4725,-1.30
4726,-1.46
4727,-1.61
4728,-1.73
4729,-1.85
4730,-1.97
4731,-2.06
4732,-2.08
4733,-2.04
4734,-1.91
4735,-1.76
4736,-1.58
4737,-1.40
4738,-1.25
4739,-1.10
4740,-0.92
4741,-0.68
4742,-0.41
4743,-0.14
4744,0.15
4745,0.48
4746,0.82
4747,1.09
4748,1.25
4749,1.28
4750,1.21
4751,1.05
4752,0.82
4753,0.54
4754,0.30
4755,0.14
4756,0.12
4757,0.21
4758,0.37
4759,0.56
4760,0.73
4761,0.82
4762,0.77
4763,0.60
4764,0.34
4765,0.03
4766,-0.30
4767,-0.59
4768,-0.82
4769,-0.96
4770,-1.08
4771,-1.18
4772,-1.32
4773,-1.47
4774,-1.67
4775,-1.90
4776,-2.17
4777,-2.43
4778,-2.69
4779,-2.93
4780,-3.15
4781,-3.33
4782,-3.46
4783,-3.58
4784,-3.72
4785,-3.87
4786,-4.00
4787,-4.09
4788,-4.16
4789,-4.21
4790,-4.24
4791,-4.21
4792,-4.11
4793,-3.99
4794,-3.92
4795,-3.91
4796,-3.97
4797,-4.09
4798,-4.27
4799,-4.48
4800,-4.68
4801,-4.80
4802,-4.84
4803,-4.84
4804,-4.80
4805,-4.77
4806,-4.78
4807,-4.88
4808,-5.04
4809,-5.22
4810,-5.38
4811,-5.47
4812,-5.48
4813,-5.38
4814,-5.21
4815,-5.00
4816,-4.78
4817,-4.61
4818,-4.46
4819,-4.35
4820,-4.23
4821,-4.12
4822,-3.97
4823,-3.79
4824,-3.59
4825,-3.42
4826,-3.27
4827,-3.19
4828,-3.14
4829,-3.11
4830,-3.11
4831,-3.11
4832,-3.07
4833,-3.00
4834,-2.84
4835,-2.63
4836,-2.37
4837,-2.11
4838,-1.85
4839,-1.62
4840,-1.38
4841,-1.18
4842,-0.99
4843,-0.82
4844,-0.60
4845,-0.37
4846,-0.14
4847,0.07
4848,0.29
4849,0.52
4850,0.79
4851,1.09
4852,1.41
4853,1.70
4854,1.95
4855,2.10
4856,2.16
4857,2.09
4858,1.89
4859,1.59
4860,1.26
4861,0.95
4862,0.71
4863,0.56
4864,0.53
4865,0.60
4866,0.70
4867,0.79
4868,0.83
4869,0.82
4870,0.81
4871,0.80
4872,0.85
4873,0.97
4874,1.17
4875,1.43
4876,1.73
4877,2.04
4878,2.37
4879,2.68
4880,2.99
4881,3.29
4882,3.61
4883,3.93
4884,4.23
4885,4.47
4886,4.67
4887,4.81
4888,4.89
4889,4.88
4890,4.86
4891,4.88
4892,5.00
4893,5.24
4894,5.58
4895,5.97
4896,6.38
4897,6.71
4898,6.91
4899,6.97
4900,6.90
4901,6.74
4902,6.54
4903,6.36
4904,6.29
4905,6.37
4906,6.61
4907,6.94
4908,7.32
4909,7.71
4910,8.10
4911,8.47
4912,8.75
4913,8.93
4914,9.00
4915,9.03
4916,9.04
4917,8.98
4918,8.80
4919,8.54
4920,8.24
4921,7.97
4922,7.71
4923,7.51
4924,7.38
4925,7.35
4926,7.39
4927,7.47
4928,7.50
4929,7.48
4930,7.36
4931,7.15
4932,6.84
4933,6.48
4934,6.13
4935,5.83
4936,5.57
4937,5.40
4938,5.33
4939,5.36
4940,5.42
4941,5.49
4942,5.55
4943,5.61
4944,5.66
4945,5.73
4946,5.81
4947,5.92
4948,6.07
4949,6.28
4950,6.58
4951,6.91
4952,7.19
4953,7.34
4954,7.37
4955,7.29
4956,7.19
4957,7.06
4958,6.97
4959,6.97
4960,7.10
4961,7.33
4962,7.65
4963,7.98
4964,8.29
4965,8.57
4966,8.78
4967,8.90
4968,8.90
4969,8.81
4970,8.68
4971,8.52
4972,8.32
4973,8.09
4974,7.86
4975,7.64
4976,7.43
4977,7.26
4978,7.16
4979,7.12
4980,7.10
4981,7.05
4982,6.98
4983,6.89
4984,6.74
4985,6.53
4986,6.31
4987,6.16
4988,6.10
4989,6.13
4990,6.23
4991,6.39
4992,6.55
4993,6.65
4994,6.61
4995,6.42
4996,6.17
4997,5.95
4998,5.83
4999,5.86
5000,6.04
5001,6.35
5002,6.71
5003,7.05
5004,7.29
5005,7.38
5006,7.32
5007,7.13
5008,6.89
5009,6.70
5010,6.65
5011,6.77
5012,7.04
5013,7.37
5014,7.71
5015,7.98
5016,8.15
5017,8.17
5018,8.09
5019,7.96
5020,7.88
5021,7.90
5022,8.03
5023,8.25
5024,8.54
5025,8.83
5026,9.07
5027,9.20
5028,9.22
5029,9.16
5030,9.02
5031,8.83
5032,8.66
5033,8.54
5034,8.48
5035,8.48
5036,8.51
5037,8.51
5038,8.47
5039,8.35
5040,8.14
5041,7.90
5042,7.68
5043,7.50
5044,7.34
5045,7.23
5046,7.18
5047,7.21
5048,7.26
5049,7.27
5050,7.22
5051,7.13
5052,7.00
5053,6.86
5054,6.68
5055,6.49
5056,6.34
5057,6.26
5058,6.23
5059,6.23
5060,6.23
5061,6.23
5062,6.26
5063,6.32
5064,6.36
5065,6.34
5066,6.25
5067,6.13
5068,5.98
5069,5.83
5070,5.68
5071,5.56
5072,5.49
5073,5.49
5074,5.56
5075,5.68
5076,5.83
5077,5.97
5078,6.13
5079,6.32
5080,6.51
5081,6.68
5082,6.86
5083,7.06
5084,7.33
5085,7.63
5086,7.90
5087,8.09
5088,8.19
5089,8.18
5090,8.06
5091,7.85
5092,7.61
5093,7.35
5094,7.13
5095,6.99
5096,6.97
5097,7.09
5098,7.28
5099,7.48
5100,7.61
5101,7.64
5102,7.52
5103,7.26
5104,6.87
5105,6.45
5106,6.04
5107,5.71
5108,5.46
5109,5.33
5110,5.27
5111,5.24
5112,5.17
5113,5.03
5114,4.81
5115,4.55
5116,4.20
5117,3.85
5118,3.53
5119,3.32
5120,3.21
5121,3.23
5122,3.33
5123,3.48
5124,3.63
5125,3.75
5126,3.86
5127,3.97
5128,4.08
5129,4.21
5130,4.34
5131,4.46
5132,4.55
5133,4.58
5134,4.55
5135,4.49
5136,4.42
5137,4.36
5138,4.31
5139,4.31
5140,4.38
5141,4.49
5142,4.65
5143,4.79
5144,4.94
5145,5.07
5146,5.13
5147,5.10
5148,4.97
5149,4.81
5150,4.70
5151,4.70
5152,4.81
5153,5.04
5154,5.32
5155,5.59
5156,5.77
5157,5.81
5158,5.69
5159,5.41
5160,5.00
5161,4.55
5162,4.14
5163,3.82
5164,3.68
5165,3.71
5166,3.93
5167,4.26
5168,4.63
5169,4.99
5170,5.33
5171,5.63
5172,5.84
5173,5.93
5174,5.93
5175,5.86
5176,5.77
5177,5.71
5178,5.72
5179,5.84
5180,6.04
5181,6.32
5182,6.64
5183,6.94
5184,7.18
5185,7.29
5186,7.30
5187,7.24
5188,7.14
5189,7.02
5190,6.89
5191,6.77
5192,6.68
5193,6.55
5194,6.36
5195,6.10
5196,5.79
5197,5.49
5198,5.19
5199,4.92
5200,4.71
5201,4.57
5202,4.45
5203,4.30
5204,4.09
5205,3.85
5206,3.63
5207,3.45
5208,3.30
5209,3.19
5210,3.11
5211,3.05
5212,2.96
5213,2.82
5214,2.64
5215,2.49
5216,2.37
5217,2.32
5218,2.29
5219,2.30
5220,2.32
5221,2.36
5222,2.36
5223,2.27
5224,2.08
5225,1.81
5226,1.50
5227,1.23
5228,0.98
5229,0.80
5230,0.65
5231,0.53
5232,0.39
5233,0.27
5234,0.21
5235,0.24
5236,0.32
5237,0.45
5238,0.62
5239,0.80
5240,0.92
5241,0.97
5242,0.92
5243,0.83
5244,0.69
5245,0.55
5246,0.43
5247,0.34
5248,0.20
5249,-0.02
5250,-0.34
5251,-0.74
5252,-1.23
5253,-1.72
5254,-2.17
5255,-2.47
5256,-2.64
5257,-2.66
5258,-2.56
5259,-2.37
5260,-2.19
5261,-2.09
5262,-2.14
5263,-2.31
5264,-2.61
5265,-2.94
5266,-3.24
5267,-3.46
5268,-3.56
5269,-3.56
5270,-3.46
5271,-3.24
5272,-2.95
5273,-2.68
5274,-2.50
5275,-2.43
5276,-2.46
5277,-2.53
5278,-2.62
5279,-2.67
5280,-2.62
5281,-2.45
5282,-2.20
5283,-1.95
5284,-1.75
5285,-1.63
5286,-1.63
5287,-1.82
5288,-2.13
5289,-2.50
5290,-2.83
5291,-3.01
5292,-3.01
5293,-2.86
5294,-2.62
5295,-2.37
5296,-2.17
5297,-2.05
5298,-2.04
5299,-2.10
5300,-2.18
5301,-2.22
5302,-2.17
5303,-2.01
5304,-1.79
5305,-1.55
5306,-1.33
5307,-1.18
5308,-1.09
5309,-1.04
5310,-0.97
5311,-0.85
5312,-0.66
5313,-0.39
5314,-0.06
5315,0.24
5316,0.43
5317,0.46
5318,0.31
5319,0.01
5320,-0.40
5321,-0.85
5322,-1.30
5323,-1.69
5324,-1.99
5325,-2.20
5326,-2.32
5327,-2.37
5328,-2.41
5329,-2.46
5330,-2.56
5331,-2.67
5332,-2.81
5333,-2.93
5334,-3.03
5335,-3.08
5336,-3.11
5337,-3.11
5338,-3.08
5339,-3.02
5340,-2.93
5341,-2.81
5342,-2.66
5343,-2.49
5344,-2.28
5345,-2.04
5346,-1.77
5347,-1.53
5348,-1.38
5349,-1.35
5350,-1.40
5351,-1.50
5352,-1.59
5353,-1.69
5354,-1.75
5355,-1.72
5356,-1.58
5357,-1.40
5358,-1.27
5359,-1.20
5360,-1.17
5361,-1.19
5362,-1.24
5363,-1.30
5364,-1.28
5365,-1.14
5366,-0.91
5367,-0.62
5368,-0.31
5369,-0.06
5370,0.11
5371,0.18
5372,0.18
5373,0.13
5374,0.08
5375,0.02
5376,-0.01
5377,0.01
5378,0.11
5379,0.25
5380,0.47
5381,0.72
5382,1.05
5383,1.43
5384,1.90
5385,2.40
5386,2.91
5387,3.33
5388,3.64
5389,3.81
5390,3.88
5391,3.84
5392,3.74
5393,3.64
5394,3.63
5395,3.72
5396,3.88
5397,4.09
5398,4.34
5399,4.58
5400,4.77
5401,4.85
5402,4.85
5403,4.81
5404,4.80
5405,4.79
5406,4.81
5407,4.83
5408,4.93
5409,5.10
5410,5.36
5411,5.66
5412,6.00
5413,6.36
5414,6.74
5415,7.06
5416,7.29
5417,7.41
5418,7.46
5419,7.48
5420,7.48
5421,7.45
5422,7.45
5423,7.46
5424,7.52
5425,7.61
5426,7.75
5427,7.90
5428,8.02
5429,8.05
5430,7.99
5431,7.87
5432,7.72
5433,7.54
5434,7.30
5435,7.03
5436,6.77
5437,6.63
5438,6.60
5439,6.66
5440,6.77
5441,6.90
5442,7.02
5443,7.12
5444,7.13
5445,7.03
5446,6.87
5447,6.69
5448,6.52
5449,6.41
5450,6.33
5451,6.33
5452,6.41
5453,6.54
5454,6.68
5455,6.77
5456,6.77
5457,6.68
5458,6.52
5459,6.28
5460,5.94
5461,5.56
5462,5.16
5463,4.80
5464,4.47
5465,4.21
5466,4.01
5467,3.90
5468,3.81
5469,3.80
5470,3.81
5471,3.88
5472,3.95
5473,4.03
5474,4.05
5475,3.99
5476,3.80
5477,3.50
5478,3.16
5479,2.82
5480,2.50
5481,2.27
5482,2.17
5483,2.24
5484,2.40
5485,2.59
5486,2.75
5487,2.84
5488,2.83
5489,2.71
5490,2.48
5491,2.18
5492,1.85
5493,1.54
5494,1.32
5495,1.24
5496,1.27
5497,1.40
5498,1.54
5499,1.67
5500,1.77
5501,1.79
5502,1.73
5503,1.61
5504,1.50
5505,1.46
5506,1.50
5507,1.59
5508,1.74
5509,1.89
5510,2.00
5511,2.00
5512,1.88
5513,1.70
5514,1.50
5515,1.32
5516,1.16
5517,1.05
5518,1.00
5519,1.03
5520,1.10
5521,1.17
5522,1.21
5523,1.21
5524,1.14
5525,1.03
5526,0.86
5527,0.66
5528,0.38
5529,0.05
5530,-0.29
5531,-0.60
5532,-0.84
5533,-0.98
5534,-1.05
5535,-1.04
5536,-1.03
5537,-1.04
5538,-1.11
5539,-1.24
5540,-1.42
5541,-1.63
5542,-1.82
5543,-1.95
5544,-1.98
5545,-1.95
5546,-1.87
5547,-1.80
5548,-1.80
5549,-1.86
5550,-1.95
5551,-2.05
5552,-2.14
5553,-2.20
5554,-2.19
5555,-2.14
5556,-2.08
5557,-2.04
5558,-2.01
5559,-2.02
5560,-2.08
5561,-2.16
5562,-2.24
5563,-2.30
5564,-2.34
5565,-2.34
5566,-2.30
5567,-2.17
5568,-2.01
5569,-1.85
5570,-1.75
5571,-1.72
5572,-1.75
5573,-1.85
5574,-2.00
5575,-2.20
5576,-2.43
5577,-2.62
5578,-2.74
5579,-2.74
5580,-2.61
5581,-2.40
5582,-2.14
5583,-1.89
5584,-1.69
5585,-1.57
5586,-1.56
5587,-1.66
5588,-1.80
5589,-1.96
5590,-2.10
5591,-2.22
5592,-2.31
5593,-2.37
5594,-2.38
5595,-2.32
5596,-2.19
5597,-1.98
5598,-1.70
5599,-1.40
5600,-1.14
5601,-0.95
5602,-0.87
5603,-0.88
5604,-0.95
5605,-1.10
5606,-1.29
5607,-1.49
5608,-1.62
5609,-1.62
5610,-1.46
5611,-1.23
5612,-0.95
5613,-0.71
5614,-0.50
5615,-0.33
5616,-0.20
5617,-0.12
5618,0.00
5619,0.20
5620,0.52
5621,0.93
5622,1.46
5623,2.05
5624,2.70
5625,3.29
5626,3.81
5627,4.23
5628,4.55
5629,4.78
5630,4.97
5631,5.13
5632,5.36
5633,5.61
5634,5.91
5635,6.18
5636,6.42
5637,6.58
5638,6.70
5639,6.75
5640,6.79
5641,6.81
5642,6.86
5643,6.90
5644,6.99
5645,7.10
5646,7.29
5647,7.49
5648,7.70
5649,7.84
5650,7.97
5651,8.11
5652,8.31
5653,8.51
5654,8.71
5655,8.88
5656,9.09
5657,9.32
5658,9.55
5659,9.70
5660,9.78
5661,9.77
5662,9.71
5663,9.62
5664,9.52
5665,9.43
5666,9.35
5667,9.30
5668,9.25
5669,9.19
5670,9.09
5671,8.97
5672,8.85
5673,8.74
5674,8.62
5675,8.53
5676,8.48
5677,8.51
5678,8.61
5679,8.71
5680,8.74
5681,8.71
5682,8.65
5683,8.59
5684,8.51
5685,8.42
5686,8.33
5687,8.24
5688,8.16
5689,8.07
5690,7.97
5691,7.84
5692,7.71
5693,7.58
5694,7.51
5695,7.55
5696,7.69
5697,7.93
5698,8.23
5699,8.51
5700,8.71
5701,8.79
5702,8.79
5703,8.72
5704,8.62
5705,8.54
5706,8.48
5707,8.45
5708,8.42
5709,8.39
5710,8.37
5711,8.31
5712,8.16
5713,7.97
5714,7.73
5715,7.52
5716,7.33
5717,7.16
5718,6.99
5719,6.87
5720,6.81
5721,6.77
5722,6.76
5723,6.76
5724,6.80
5725,6.86
5726,6.90
5727,6.90
5728,6.87
5729,6.81
5730,6.71
5731,6.59
5732,6.48
5733,6.45
5734,6.51
5735,6.60
5736,6.69
5737,6.76
5738,6.78
5739,6.74
5740,6.65
5741,6.53
5742,6.41
5743,6.32
5744,6.28
5745,6.28
5746,6.33
5747,6.39
5748,6.42
5749,6.45
5750,6.52
5751,6.63
5752,6.79
5753,7.00
5754,7.29
5755,7.61
5756,7.93
5757,8.15
5758,8.22
5759,8.16
5760,8.00
5761,7.75
5762,7.44
5763,7.14
5764,6.92
5765,6.80
5766,6.75
5767,6.76
5768,6.81
5769,6.94
5770,7.08
5771,7.24
5772,7.37
5773,7.43
5774,7.39
5775,7.24
5776,7.00
5777,6.70
5778,6.35
5779,5.99
5780,5.66
5781,5.42
5782,5.29
5783,5.29
5784,5.40
5785,5.59
5786,5.79
5787,5.95
5788,6.01
5789,5.99
5790,5.87
5791,5.69
5792,5.46
5793,5.23
5794,5.00
5795,4.81
5796,4.69
5797,4.68
5798,4.73
5799,4.83
5800,4.88
5801,4.86
5802,4.72
5803,4.49
5804,4.14
5805,3.72
5806,3.27
5807,2.85
5808,2.52
5809,2.34
5810,2.30
5811,2.40
5812,2.59
5813,2.83
5814,3.05
5815,3.21
5816,3.30
5817,3.29
5818,3.20
5819,3.04
5820,2.89
5821,2.82
5822,2.90
5823,3.07
5824,3.33
5825,3.63
5826,3.97
5827,4.34
5828,4.67
5829,4.87
5830,4.94
5831,4.91
5832,4.83
5833,4.69
5834,4.54
5835,4.39
5836,4.33
5837,4.37
5838,4.53
5839,4.81
5840,5.22
5841,5.69
5842,6.14
5843,6.48
5844,6.69
5845,6.74
5846,6.62
5847,6.32
5848,5.91
5849,5.48
5850,5.09
5851,4.76
5852,4.51
5853,4.33
5854,4.23
5855,4.20
5856,4.20
5857,4.21
5858,4.22
5859,4.25
5860,4.28
5861,4.35
5862,4.46
5863,4.58
5864,4.65
5865,4.62
5866,4.50
5867,4.32
5868,4.09
5869,3.81
5870,3.53
5871,3.30
5872,3.14
5873,3.08
5874,3.09
5875,3.13
5876,3.14
5877,3.11
5878,3.04
5879,2.92
5880,2.74
5881,2.53
5882,2.33
5883,2.21
5884,2.16
5885,2.20
5886,2.32
5887,2.47
5888,2.59
5889,2.62
5890,2.58
5891,2.48
5892,2.35
5893,2.23
5894,2.18
5895,2.23
5896,2.40
5897,2.68
5898,3.02
5899,3.38
5900,3.71
5901,3.94
5902,4.10
5903,4.18
5904,4.24
5905,4.26
5906,4.25
5907,4.18
5908,4.13
5909,4.09
5910,4.08
5911,4.07
5912,4.10
5913,4.16
5914,4.26
5915,4.39
5916,4.51
5917,4.62
5918,4.75
5919,4.94
5920,5.17
5921,5.43
5922,5.73
5923,6.07
5924,6.42
5925,6.72
5926,6.90
5927,6.96
5928,6.96
5929,6.91
5930,6.84
5931,6.74
5932,6.72
5933,6.77
5934,6.87
5935,6.97
5936,7.06
5937,7.11
5938,7.11
5939,7.06
5940,6.97
5941,6.91
5942,6.87
5943,6.85
5944,6.81
5945,6.72
5946,6.55
5947,6.30
5948,6.07
5949,5.87
5950,5.77
5951,5.80
5952,6.01
5953,6.41
5954,6.88
5955,7.32
5956,7.62
5957,7.70
5958,7.58
5959,7.32
5960,7.06
5961,6.87
5962,6.81
5963,6.90
5964,7.16
5965,7.49
5966,7.80
5967,8.00
5968,8.01
5969,7.84
5970,7.55
5971,7.22
5972,6.95
5973,6.82
5974,6.87
5975,7.07
5976,7.45
5977,7.93
5978,8.45
5979,8.90
5980,9.25
5981,9.55
5982,9.83
5983,10.13
5984,10.43
5985,10.70
5986,10.94
5987,11.12
5988,11.22
5989,11.22
5990,11.13
5991,10.97
5992,10.79
5993,10.60
5994,10.46
5995,10.41
5996,10.43
5997,10.50
5998,10.52
5999,10.47
6000,10.33
6001,10.12
6002,9.83
6003,9.51
6004,9.16
6005,8.86
6006,8.64
6007,8.54
6008,8.46
6009,8.38
6010,8.24
6011,8.06
6012,7.87
6013,7.66
6014,7.40
6015,7.15
6016,6.90
6017,6.68
6018,6.48
6019,6.25
6020,5.98
6021,5.71
6022,5.44
6023,5.20
6024,5.03
6025,4.94
6026,4.91
6027,4.95
6028,5.04
6029,5.15
6030,5.27
6031,5.40
6032,5.53
6033,5.64
6034,5.72
6035,5.81
6036,5.98
6037,6.21
6038,6.48
6039,6.72
6040,6.97
6041,7.20
6042,7.36
6043,7.42
6044,7.45
6045,7.46
6046,7.51
6047,7.60
6048,7.75
6049,8.00
6050,8.31
6051,8.64
6052,8.93
6053,9.12
6054,9.16
6055,9.06
6056,8.87
6057,8.62
6058,8.36
6059,8.16
6060,8.05
6061,8.05
6062,8.13
6063,8.25
6064,8.40
6065,8.55
6066,8.66
6067,8.70
6068,8.65
6069,8.56
6070,8.43
6071,8.28
6072,8.13
6073,7.97
6074,7.84
6075,7.71
6076,7.60
6077,7.48
6078,7.37
6079,7.24
6080,7.12
6081,7.03
6082,7.00
6083,7.00
6084,7.00
6085,7.00
6086,7.02
6087,7.08
6088,7.19
6089,7.34
6090,7.51
6091,7.70
6092,7.86
6093,7.98
6094,8.05
6095,8.08
6096,8.08
6097,8.08
6098,8.09
6099,8.13
6100,8.17
6101,8.22
6102,8.28
6103,8.34
6104,8.42
6105,8.48
6106,8.49
6107,8.43
6108,8.31
6109,8.13
6110,7.90
6111,7.66
6112,7.43
6113,7.28
6114,7.24
6115,7.34
6116,7.54
6117,7.78
6118,8.00
6119,8.17
6120,8.21
6121,8.13
6122,7.89
6123,7.56
6124,7.18
6125,6.82
6126,6.49
6127,6.23
6128,6.03
6129,5.89
6130,5.74
6131,5.53
6132,5.24
6133,4.94
6134,4.69
6135,4.52
6136,4.38
6137,4.30
6138,4.26
6139,4.27
6140,4.23
6141,4.13
6142,3.94
6143,3.73
6144,3.49
6145,3.29
6146,3.14
6147,3.09
6148,3.09
6149,3.13
6150,3.17
6151,3.20
6152,3.20
6153,3.15
6154,3.00
6155,2.79
6156,2.55
6157,2.30
6158,2.08
6159,1.88
6160,1.69
6161,1.48
6162,1.22
6163,0.95
6164,0.71
6165,0.50
6166,0.29
6167,0.08
6168,-0.08
6169,-0.14
6170,-0.11
6171,0.02
6172,0.22
6173,0.50
6174,0.81
6175,1.13
6176,1.46
6177,1.79
6178,2.11
6179,2.34
6180,2.47
6181,2.49
6182,2.48
6183,2.46
6184,2.50
6185,2.56
6186,2.67
6187,2.84
6188,3.09
6189,3.39
6190,3.72
6191,4.08
6192,4.46
6193,4.86
6194,5.24
6195,5.53
6196,5.71
6197,5.77
6198,5.74
6199,5.62
6200,5.40
6201,5.13
6202,4.88
6203,4.74
6204,4.79
6205,5.01
6206,5.33
6207,5.63
6208,5.86
6209,5.98
6210,5.98
6211,5.84
6212,5.53
6213,5.13
6214,4.73
6215,4.39
6216,4.16
6217,4.01
6218,3.94
6219,3.94
6220,4.02
6221,4.17
6222,4.36
6223,4.61
6224,4.90
6225,5.20
6226,5.45
6227,5.61
6228,5.68
6229,5.65
6230,5.49
6231,5.18
6232,4.79
6233,4.42
6234,4.16
6235,4.04
6236,4.05
6237,4.14
6238,4.29
6239,4.51
6240,4.77
6241,5.02
6242,5.17
6243,5.17
6244,5.03
6245,4.78
6246,4.45
6247,4.03
6248,3.57
6249,3.14
6250,2.80
6251,2.59
6252,2.52
6253,2.52
6254,2.56
6255,2.62
6256,2.72
6257,2.83
6258,2.95
6259,3.07
6260,3.22
6261,3.42
6262,3.70
6263,4.04
6264,4.39
6265,4.68
6266,4.89
6267,4.98
6268,4.99
6269,4.92
6270,4.78
6271,4.61
6272,4.44
6273,4.35
6274,4.33
6275,4.33
6276,4.32
6277,4.30
6278,4.25
6279,4.18
6280,4.10
6281,4.04
6282,4.07
6283,4.18
6284,4.35
6285,4.52
6286,4.64
6287,4.68
6288,4.64
6289,4.50
6290,4.29
6291,4.04
6292,3.79
6293,3.61
6294,3.53
6295,3.57
6296,3.65
6297,3.72
6298,3.73
6299,3.73
6300,3.75
6301,3.78
6302,3.79
6303,3.79
6304,3.82
6305,3.88
6306,3.93
6307,3.93
6308,3.91
6309,3.87
6310,3.84
6311,3.80
6312,3.81
6313,3.88
6314,4.09
6315,4.39
6316,4.76
6317,5.13
6318,5.42
6319,5.60
6320,5.66
6321,5.62
6322,5.53
6323,5.41
6324,5.28
6325,5.17
6326,5.07
6327,5.00
6328,4.97
6329,4.94
6330,4.91
6331,4.88
6332,4.84
6333,4.81
6334,4.81
6335,4.84
6336,4.89
6337,4.93
6338,4.90
6339,4.78
6340,4.58
6341,4.33
6342,4.10
6343,3.98
6344,4.00
6345,4.12
6346,4.30
6347,4.49
6348,4.64
6349,4.73
6350,4.72
6351,4.64
6352,4.51
6353,4.39
6354,4.29
6355,4.26
6356,4.30
6357,4.40
6358,4.50
6359,4.54
6360,4.46
6361,4.24
6362,3.93
6363,3.59
6364,3.29
6365,3.04
6366,2.88
6367,2.82
6368,2.89
6369,3.04
6370,3.23
6371,3.44
6372,3.69
6373,3.96
6374,4.20
6375,4.35
6376,4.43
6377,4.45
6378,4.45
6379,4.41
6380,4.37
6381,4.33
6382,4.34
6383,4.37
6384,4.43
6385,4.48
6386,4.55
6387,4.65
6388,4.74
6389,4.79
6390,4.81
6391,4.81
6392,4.83
6393,4.85
6394,4.88
6395,4.91
6396,4.97
6397,5.05
6398,5.13
6399,5.19
6400,5.27
6401,5.42
6402,5.65
6403,5.92
6404,6.17
6405,6.39
6406,6.57
6407,6.65
6408,6.59
6409,6.41
6410,6.21
6411,6.05
6412,5.92
6413,5.81
6414,5.74
6415,5.74
6416,5.78
6417,5.82
6418,5.81
6419,5.75
6420,5.65
6421,5.52
6422,5.40
6423,5.32
6424,5.27
6425,5.27
6426,5.29
6427,5.32
6428,5.35
6429,5.36
6430,5.29
6431,5.12
6432,4.82
6433,4.49
6434,4.20
6435,4.02
6436,3.92
6437,3.93
6438,4.06
6439,4.33
6440,4.69
6441,5.03
6442,5.27
6443,5.42
6444,5.49
6445,5.48
6446,5.42
6447,5.33
6448,5.25
6449,5.22
6450,5.23
6451,5.26
6452,5.31
6453,5.36
6454,5.43
6455,5.52
6456,5.65
6457,5.83
6458,6.03
6459,6.25
6460,6.46
6461,6.64
6462,6.75
6463,6.81
6464,6.87
6465,6.92
6466,6.96
6467,6.97
6468,6.95
6469,6.95
6470,6.97
6471,7.00
6472,7.02
6473,7.07
6474,7.20
6475,7.39
6476,7.57
6477,7.69
6478,7.74
6479,7.71
6480,7.60
6481,7.45
6482,7.30
6483,7.20
6484,7.18
6485,7.25
6486,7.38
6487,7.51
6488,7.56
6489,7.50
6490,7.33
6491,7.12
6492,6.91
6493,6.76
6494,6.68
6495,6.72
6496,6.85
6497,7.04
6498,7.18
6499,7.22
6500,7.12
6501,6.91
6502,6.61
6503,6.28
6504,5.96
6505,5.72
6506,5.60
6507,5.63
6508,5.78
6509,6.00
6510,6.22
6511,6.38
6512,6.42
6513,6.32
6514,6.12
6515,5.87
6516,5.66
6517,5.51
6518,5.41
6519,5.38
6520,5.46
6521,5.65
6522,5.87
6523,6.09
6524,6.26
6525,6.41
6526,6.54
6527,6.66
6528,6.76
6529,6.85
6530,6.94
6531,7.00
6532,7.01
6533,6.95
6534,6.82
6535,6.66
6536,6.55
6537,6.51
6538,6.56
6539,6.69
6540,6.87
6541,7.08
6542,7.28
6543,7.43
6544,7.51
6545,7.51
6546,7.45
6547,7.35
6548,7.28
6549,7.25
6550,7.24
6551,7.25
6552,7.26
6553,7.26
6554,7.20
6555,7.09
6556,6.94
6557,6.78
6558,6.62
6559,6.48
6560,6.39
6561,6.35
6562,6.36
6563,6.39
6564,6.45
6565,6.52
6566,6.50
6567,6.42
6568,6.32
6569,6.22
6570,6.12
6571,6.00
6572,5.87
6573,5.78
6574,5.74
6575,5.74
6576,5.77
6577,5.79
6578,5.84
6579,5.93
6580,6.08
6581,6.26
6582,6.45
6583,6.66
6584,6.91
6585,7.17
6586,7.41
6587,7.55
6588,7.65
6589,7.71
6590,7.72
6591,7.69
6592,7.64
6593,7.64
6594,7.71
6595,7.87
6596,8.06
6597,8.24
6598,8.37
6599,8.43
6600,8.43
6601,8.37
6602,8.25
6603,8.13
6604,8.07
6605,8.10
6606,8.19
6607,8.29
6608,8.34
6609,8.35
6610,8.26
6611,8.09
6612,7.81
6613,7.48
6614,7.14
6615,6.84
6616,6.58
6617,6.39
6618,6.23
6619,6.15
6620,6.08
6621,6.03
6622,5.95
6623,5.84
6624,5.66
6625,5.42
6626,5.12
6627,4.78
6628,4.46
6629,4.20
6630,3.99
6631,3.88
6632,3.85
6633,3.94
6634,4.15
6635,4.46
6636,4.80
6637,5.17
6638,5.50
6639,5.78
6640,5.94
6641,5.94
6642,5.78
6643,5.50
6644,5.17
6645,4.88
6646,4.64
6647,4.46
6648,4.33
6649,4.23
6650,4.20
6651,4.20
6652,4.19
6653,4.16
6654,4.14
6655,4.20
6656,4.36
6657,4.59
6658,4.91
6659,5.26
6660,5.66
6661,6.02
6662,6.30
6663,6.45
6664,6.47
6665,6.40
6666,6.29
6667,6.20
6668,6.19
6669,6.24
6670,6.36
6671,6.48
6672,6.58
6673,6.65
6674,6.64
6675,6.57
6676,6.49
6677,6.44
6678,6.39
6679,6.30
6680,6.17
6681,6.01
6682,5.86
6683,5.71
6684,5.57
6685,5.45
6686,5.36
6687,5.30
6688,5.26
6689,5.21
6690,5.11
6691,5.00
6692,4.87
6693,4.78
6694,4.73
6695,4.73
6696,4.77
6697,4.84
6698,4.87
6699,4.79
6700,4.55
6701,4.19
6702,3.76
6703,3.36
6704,3.06
6705,2.85
6706,2.74
6707,2.71
6708,2.77
6709,2.92
6710,3.11
6711,3.30
6712,3.44
6713,3.52
6714,3.56
6715,3.56
6716,3.52
6717,3.43
6718,3.31
6719,3.19
6720,3.12
6721,3.11
6722,3.17
6723,3.30
6724,3.48
6725,3.65
6726,3.78
6727,3.81
6728,3.78
6729,3.68
6730,3.53
6731,3.39
6732,3.28
6733,3.25
6734,3.28
6735,3.34
6736,3.41
6737,3.46
6738,3.52
6739,3.54
6740,3.55
6741,3.51
6742,3.48
6743,3.47
6744,3.53
6745,3.65
6746,3.84
6747,4.07
6748,4.36
6749,4.68
6750,5.06
6751,5.42
6752,5.73
6753,5.94
6754,6.04
6755,6.03
6756,5.94
6757,5.79
6758,5.62
6759,5.43
6760,5.23
6761,5.04
6762,4.84
6763,4.65
6764,4.47
6765,4.26
6766,4.04
6767,3.80
6768,3.55
6769,3.30
6770,3.10
6771,2.98
6772,2.96
6773,3.02
6774,3.13
6775,3.26
6776,3.40
6777,3.55
6778,3.65
6779,3.72
6780,3.77
6781,3.81
6782,3.88
6783,3.94
6784,4.03
6785,4.10
6786,4.17
6787,4.23
6788,4.36
6789,4.52
6790,4.70
6791,4.85
6792,5.03
6793,5.23
6794,5.42
6795,5.55
6796,5.61
6797,5.59
6798,5.55
6799,5.52
6800,5.55
6801,5.60
6802,5.67
6803,5.76
6804,5.91
6805,6.13
6806,6.32
6807,6.45
6808,6.48
6809,6.42
6810,6.27
6811,6.07
6812,5.79
6813,5.49
6814,5.19
6815,4.92
6816,4.69
6817,4.52
6818,4.39
6819,4.26
6820,4.14
6821,4.01
6822,3.94
6823,3.94
6824,4.00
6825,4.12
6826,4.32
6827,4.56
6828,4.79
6829,4.94
6830,5.01
6831,5.00
6832,4.95
6833,4.92
6834,4.96
6835,5.05
6836,5.15
6837,5.27
6838,5.44
6839,5.65
6840,5.85
6841,5.97
6842,6.01
6843,6.00
6844,5.99
6845,6.00
6846,6.00
6847,5.97
6848,5.90
6849,5.81
6850,5.73
6851,5.63
6852,5.52
6853,5.42
6854,5.40
6855,5.46
6856,5.58
6857,5.70
6858,5.81
6859,5.93
6860,6.08
6861,6.23
6862,6.34
6863,6.41
6864,6.44
6865,6.43
6866,6.36
6867,6.23
6868,6.01
6869,5.74
6870,5.40
6871,5.04
6872,4.71
6873,4.50
6874,4.43
6875,4.49
6876,4.65
6877,4.83
6878,5.00
6879,5.16
6880,5.27
6881,5.33
6882,5.33
6883,5.29
6884,5.30
6885,5.39
6886,5.55
6887,5.77
6888,6.00
6889,6.22
6890,6.36
6891,6.36
6892,6.21
6893,5.97
6894,5.67
6895,5.37
6896,5.08
6897,4.85
6898,4.68
6899,4.59
6900,4.55
6901,4.57
6902,4.59
6903,4.59
6904,4.53
6905,4.42
6906,4.23
6907,3.96
6908,3.60
6909,3.20
6910,2.86
6911,2.64
6912,2.59
6913,2.72
6914,3.01
6915,3.43
6916,3.90
6917,4.30
6918,4.57
6919,4.71
6920,4.75
6921,4.75
6922,4.77
6923,4.85
6924,5.03
6925,5.26
6926,5.55
6927,5.81
6928,6.04
6929,6.16
6930,6.16
6931,6.07
6932,5.93
6933,5.80
6934,5.74
6935,5.74
6936,5.78
6937,5.87
6938,6.00
6939,6.16
6940,6.31
6941,6.45
6942,6.61
6943,6.79
6944,6.99
6945,7.16
6946,7.32
6947,7.41
6948,7.43
6949,7.39
6950,7.34
6951,7.30
6952,7.33
6953,7.42
6954,7.57
6955,7.75
6956,7.95
6957,8.13
6958,8.25
6959,8.29
6960,8.24
6961,8.13
6962,7.90
6963,7.57
6964,7.17
6965,6.78
6966,6.40
6967,6.08
6968,5.81
6969,5.60
6970,5.46
6971,5.37
6972,5.31
6973,5.29
6974,5.26
6975,5.25
6976,5.18
6977,5.07
6978,4.90
6979,4.71
6980,4.54
6981,4.39
6982,4.28
6983,4.22
6984,4.20
6985,4.20
6986,4.20
6987,4.17
6988,4.10
6989,4.01
6990,3.94
6991,3.91
6992,3.91
6993,3.92
6994,3.92
6995,3.91
6996,3.91
6997,3.88
6998,3.83
6999,3.76
7000,3.70
7001,3.66
7002,3.70
7003,3.81
7004,4.01
7005,4.26
7006,4.54
7007,4.84
7008,5.12
7009,5.36
7010,5.55
7011,5.68
7012,5.71
7013,5.64
7014,5.53
7015,5.39
7016,5.29
7017,5.23
7018,5.26
7019,5.34
7020,5.45
7021,5.55
7022,5.62
7023,5.65
7024,5.60
7025,5.48
7026,5.33
7027,5.24
7028,5.21
7029,5.25
7030,5.33
7031,5.42
7032,5.49
7033,5.53
7034,5.49
7035,5.38
7036,5.16
7037,4.89
7038,4.61
7039,4.37
7040,4.19
7041,4.07
7042,4.01
7043,3.98
7044,3.95
7045,3.87
7046,3.68
7047,3.42
7048,3.10
7049,2.80
7050,2.54
7051,2.37
7052,2.27
7053,2.30
7054,2.44
7055,2.69
7056,3.01
7057,3.33
7058,3.61
7059,3.80
7060,3.90
7061,3.91
7062,3.90
7063,3.89
7064,3.98
7065,4.21
7066,4.59
7067,5.07
7068,5.62
7069,6.16
7070,6.65
7071,7.03
7072,7.32
7073,7.49
7074,7.58
7075,7.64
7076,7.72
7077,7.86
7078,8.07
7079,8.31
7080,8.58
7081,8.81
7082,8.97
7083,9.03
7084,9.03
7085,9.03
7086,9.04
7087,9.09
7088,9.23
7089,9.41
7090,9.61
7091,9.76
7092,9.85
7093,9.90
7094,9.97
7095,10.06
7096,10.15
7097,10.24
7098,10.35
7099,10.47
7100,10.58
7101,10.62
7102,10.53
7103,10.28
7104,9.90
7105,9.45
7106,8.99
7107,8.57
7108,8.20
7109,7.93
7110,7.77
7111,7.71
7112,7.74
7113,7.77
7114,7.76
7115,7.71
7116,7.61
7117,7.49
7118,7.34
7119,7.20
7120,7.09
7121,7.03
7122,6.97
7123,6.90
7124,6.77
7125,6.59
7126,6.32
7127,6.00
7128,5.64
7129,5.28
7130,4.93
7131,4.64
7132,4.41
7133,4.26
7134,4.16
7135,4.07
7136,4.01
7137,3.97
7138,3.96
7139,3.96
7140,3.97
7141,4.00
7142,4.07
7143,4.15
7144,4.26
7145,4.38
7146,4.53
7147,4.70
7148,4.91
7149,5.18
7150,5.52
7151,5.91
7152,6.32
7153,6.68
7154,6.98
7155,7.18
7156,7.28
7157,7.27
7158,7.22
7159,7.11
7160,7.01
7161,6.94
7162,6.99
7163,7.20
7164,7.59
7165,8.10
7166,8.64
7167,9.11
7168,9.42
7169,9.51
7170,9.30
7171,8.82
7172,8.17
7173,7.47
7174,6.78
7175,6.20
7176,5.76
7177,5.52
7178,5.43
7179,5.45
7180,5.48
7181,5.48
7182,5.41
7183,5.29
7184,5.15
7185,5.04
7186,4.93
7187,4.88
7188,4.87
7189,4.91
7190,4.94
7191,4.94
7192,4.97
7193,4.23
7194,4.62
7195,7.04
7196,7.77
7197,2.41
7198,-2.04
7199,9.43
7200,23.82
