1,186.84
2,249.99
3,249.99
4,249.99
5,237.75
6,239.01
7,249.99
8,249.99
9,249.99
10,190.67
11,38.32
12,-126.21
13,-231.54
14,-236.68
15,-137.80
16,28.62
17,188.76
18,249.99
19,249.99
20,247.21
21,241.23
22,247.99
23,249.99
24,249.99
25,249.99
26,232.71
27,134.19
28,-30.14
29,-190.77
30,-250.00
31,-250.00
32,-242.45
33,-237.95
34,-250.00
35,-250.00
36,-232.88
37,-180.46
38,-136.81
39,-117.98
40,-124.09
41,-140.15
42,-154.04
43,-158.94
44,-152.83
45,-138.80
46,-120.96
47,-105.73
48,-95.66
49,-92.27
50,-92.80
51,-95.06
52,-96.15
53,-95.25
54,-92.14
55,-87.97
56,-83.38
57,-79.73
58,-76.91
59,-75.23
60,-73.78
61,-72.39
62,-70.66
63,-68.89
64,-67.03
65,-65.37
66,-63.67
67,-62.19
68,-60.65
69,-59.35
70,-58.05
71,-56.91
72,-55.66
73,-54.53
74,-53.36
75,-52.33
76,-51.18
77,-50.04
78,-48.77
79,-47.55
80,-46.23
81,-45.02
82,-43.83
83,-42.85
84,-41.92
85,-41.12
86,-40.31
87,-39.57
88,-38.73
89,-37.87
90,-36.85
91,-35.80
92,-34.67
93,-33.62
94,-32.59
95,-31.72
96,-30.91
97,-30.22
98,-29.55
99,-28.98
100,-28.40
101,-27.89
102,-27.34
103,-26.82
104,-26.27
105,-25.76
106,-25.18
107,-24.60
108,-23.95
109,-23.25
110,-22.44
111,-21.61
112,-20.78
113,-20.08
114,-19.45
115,-19.00
116,-18.65
117,-18.42
118,-18.24
119,-18.08
120,-17.85
121,-17.56
122,-17.18
123,-16.78
124,-16.30
125,-15.85
126,-15.35
127,-14.88
128,-14.40
129,-13.95
130,-13.43
131,-12.90
132,-12.32
133,-11.80
134,-11.32
135,-10.97
136,-10.70
137,-10.54
138,-10.41
139,-10.31
140,-10.15
141,-9.93
142,-9.57
143,-9.17
144,-8.69
145,-8.22
146,-7.74
147,-7.34
148,-6.97
149,-6.61
150,-6.22
151,-5.81
152,-5.39
153,-4.96
154,-4.54
155,-4.18
156,-3.95
157,-3.89
158,-3.96
159,-4.15
160,-4.44
161,-4.80
162,-5.18
163,-5.54
164,-5.88
165,-6.17
166,-6.40
167,-6.52
168,-6.57
169,-6.54
170,-6.54
171,-6.58
172,-6.79
173,-7.13
174,-7.64
175,-8.29
176,-9.15
177,-10.09
178,-11.05
179,-11.95
180,-12.84
181,-13.66
182,-14.39
183,-14.98
184,-15.55
185,-16.06
186,-16.53
187,-16.88
188,-17.20
189,-17.48
190,-17.77
191,-18.00
192,-18.20
193,-18.37
194,-18.57
195,-18.75
196,-18.84
197,-18.85
198,-18.79
199,-18.66
200,-18.44
201,-18.15
202,-17.82
203,-17.52
204,-17.23
205,-16.94
206,-16.65
207,-16.41
208,-16.22
209,-16.11
210,-16.06
211,-16.07
212,-16.07
213,-16.08
214,-16.06
215,-16.01
216,-15.86
217,-15.63
218,-15.32
219,-15.01
220,-14.76
221,-14.58
222,-14.49
223,-14.49
224,-14.58
225,-14.77
226,-15.01
227,-15.25
228,-15.44
229,-15.57
230,-15.60
231,-15.54
232,-15.39
233,-15.21
234,-15.06
235,-14.94
236,-14.81
237,-14.63
238,-14.43
239,-14.24
240,-14.09
241,-13.97
242,-13.88
243,-13.82
244,-13.82
245,-13.87
246,-13.98
247,-14.16
248,-14.44
249,-14.80
250,-15.19
251,-15.55
252,-15.87
253,-16.17
254,-16.45
255,-16.62
256,-16.66
257,-16.59
258,-16.53
259,-16.52
260,-16.56
261,-16.62
262,-16.74
263,-16.91
264,-17.15
265,-17.45
266,-17.82
267,-18.23
268,-18.67
269,-19.09
270,-19.48
271,-19.77
272,-19.96
273,-20.01
274,-19.98
275,-19.91
276,-19.87
277,-19.86
278,-19.91
279,-20.03
280,-20.23
281,-20.47
282,-20.71
283,-20.90
284,-20.99
285,-20.97
286,-20.91
287,-20.85
288,-20.85
289,-20.90
290,-21.00
291,-21.13
292,-21.29
293,-21.47
294,-21.59
295,-21.60
296,-21.47
297,-21.23
298,-20.90
299,-20.47
300,-20.00
301,-19.58
302,-19.29
303,-19.17
304,-19.17
305,-19.24
306,-19.34
307,-19.47
308,-19.55
309,-19.57
310,-19.45
311,-19.21
312,-18.87
313,-18.51
314,-18.18
315,-17.94
316,-17.78
317,-17.74
318,-17.78
319,-17.85
320,-17.84
321,-17.74
322,-17.51
323,-17.22
324,-16.82
325,-16.35
326,-15.80
327,-15.27
328,-14.73
329,-14.21
330,-13.63
331,-13.05
332,-12.44
333,-11.90
334,-11.45
335,-11.16
336,-10.99
337,-10.96
338,-10.96
339,-10.97
340,-10.92
341,-10.81
342,-10.60
343,-10.31
344,-9.90
345,-9.42
346,-8.93
347,-8.52
348,-8.17
349,-7.89
350,-7.59
351,-7.30
352,-6.99
353,-6.71
354,-6.39
355,-6.04
356,-5.60
357,-5.13
358,-4.63
359,-4.22
360,-3.89
361,-3.67
362,-3.47
363,-3.30
364,-3.13
365,-3.01
366,-2.96
367,-2.95
368,-2.99
369,-3.11
370,-3.36
371,-3.72
372,-4.10
373,-4.48
374,-4.82
375,-5.11
376,-5.32
377,-5.44
378,-5.54
379,-5.64
380,-5.76
381,-5.88
382,-6.05
383,-6.22
384,-6.36
385,-6.42
386,-6.44
387,-6.48
388,-6.65
389,-6.87
390,-7.17
391,-7.53
392,-8.00
393,-8.53
394,-9.06
395,-9.55
396,-9.99
397,-10.34
398,-10.57
399,-10.63
400,-10.56
401,-10.37
402,-10.08
403,-9.72
404,-9.36
405,-9.05
406,-8.82
407,-8.70
408,-8.71
409,-8.84
410,-9.01
411,-9.13
412,-9.17
413,-9.17
414,-9.18
415,-9.24
416,-9.32
417,-9.45
418,-9.63
419,-9.87
420,-10.12
421,-10.31
422,-10.39
423,-10.39
424,-10.33
425,-10.21
426,-10.01
427,-9.77
428,-9.54
429,-9.35
430,-9.22
431,-9.10
432,-8.99
433,-8.87
434,-8.74
435,-8.62
436,-8.51
437,-8.46
438,-8.47
439,-8.52
440,-8.61
441,-8.74
442,-8.91
443,-9.09
444,-9.20
445,-9.20
446,-9.14
447,-9.06
448,-9.03
449,-9.03
450,-9.08
451,-9.19
452,-9.38
453,-9.62
454,-9.90
455,-10.21
456,-10.52
457,-10.82
458,-11.06
459,-11.25
460,-11.38
461,-11.43
462,-11.38
463,-11.19
464,-10.95
465,-10.69
466,-10.51
467,-10.44
468,-10.55
469,-10.85
470,-11.31
471,-11.86
472,-12.42
473,-12.90
474,-13.25
475,-13.43
476,-13.47
477,-13.40
478,-13.27
479,-13.15
480,-13.08
481,-13.08
482,-13.12
483,-13.18
484,-13.26
485,-13.32
486,-13.32
487,-13.21
488,-12.96
489,-12.60
490,-12.15
491,-11.66
492,-11.21
493,-10.92
494,-10.81
495,-10.88
496,-11.02
497,-11.22
498,-11.43
499,-11.60
500,-11.65
501,-11.54
502,-11.31
503,-10.99
504,-10.64
505,-10.28
506,-10.00
507,-9.81
508,-9.70
509,-9.65
510,-9.66
511,-9.72
512,-9.78
513,-9.84
514,-9.93
515,-10.05
516,-10.18
517,-10.30
518,-10.42
519,-10.54
520,-10.64
521,-10.70
522,-10.73
523,-10.78
524,-10.89
525,-11.07
526,-11.33
527,-11.63
528,-11.94
529,-12.24
530,-12.54
531,-12.76
532,-12.90
533,-12.97
534,-13.01
535,-12.99
536,-12.92
537,-12.80
538,-12.73
539,-12.72
540,-12.73
541,-12.75
542,-12.77
543,-12.83
544,-12.85
545,-12.81
546,-12.68
547,-12.50
548,-12.25
549,-11.96
550,-11.64
551,-11.34
552,-11.03
553,-10.76
554,-10.46
555,-10.10
556,-9.59
557,-8.94
558,-8.21
559,-7.49
560,-6.77
561,-6.13
562,-5.58
563,-5.21
564,-5.04
565,-5.05
566,-5.20
567,-5.45
568,-5.72
569,-6.03
570,-6.35
571,-6.65
572,-6.89
573,-7.06
574,-7.23
575,-7.40
576,-7.58
577,-7.76
578,-7.97
579,-8.19
580,-8.50
581,-8.85
582,-9.25
583,-9.60
584,-9.90
585,-10.13
586,-10.35
587,-10.51
588,-10.66
589,-10.77
590,-10.92
591,-11.09
592,-11.28
593,-11.47
594,-11.66
595,-11.83
596,-11.97
597,-12.09
598,-12.22
599,-12.34
600,-12.38
601,-12.33
602,-12.20
603,-12.02
604,-11.78
605,-11.48
606,-11.15
607,-10.84
608,-10.62
609,-10.50
610,-10.47
611,-10.54
612,-10.67
613,-10.87
614,-11.02
615,-11.09
616,-11.02
617,-10.85
618,-10.57
619,-10.21
620,-9.78
621,-9.36
622,-9.00
623,-8.77
624,-8.63
625,-8.58
626,-8.56
627,-8.57
628,-8.58
629,-8.58
630,-8.55
631,-8.49
632,-8.40
633,-8.29
634,-8.13
635,-7.95
636,-7.76
637,-7.64
638,-7.63
639,-7.69
640,-7.78
641,-7.90
642,-8.07
643,-8.26
644,-8.37
645,-8.38
646,-8.29
647,-8.16
648,-8.02
649,-7.90
650,-7.83
651,-7.82
652,-7.89
653,-8.01
654,-8.18
655,-8.35
656,-8.54
657,-8.71
658,-8.93
659,-9.22
660,-9.61
661,-10.03
662,-10.42
663,-10.72
664,-10.93
665,-11.03
666,-11.08
667,-11.07
668,-11.09
669,-11.13
670,-11.26
671,-11.50
672,-11.88
673,-12.35
674,-12.87
675,-13.36
676,-13.78
677,-14.08
678,-14.22
679,-14.21
680,-14.12
681,-13.99
682,-13.87
683,-13.76
684,-13.65
685,-13.53
686,-13.38
687,-13.21
688,-12.99
689,-12.76
690,-12.47
691,-12.18
692,-11.88
693,-11.58
694,-11.25
695,-10.89
696,-10.54
697,-10.24
698,-10.00
699,-9.83
700,-9.70
701,-9.64
702,-9.64
703,-9.77
704,-10.02
705,-10.39
706,-10.80
707,-11.16
708,-11.44
709,-11.63
710,-11.70
711,-11.63
712,-11.42
713,-11.13
714,-10.82
715,-10.51
716,-10.17
717,-9.83
718,-9.50
719,-9.19
720,-8.84
721,-8.44
722,-8.01
723,-7.64
724,-7.33
725,-7.10
726,-6.98
727,-7.04
728,-7.29
729,-7.65
730,-8.04
731,-8.42
732,-8.72
733,-8.90
734,-8.89
735,-8.65
736,-8.23
737,-7.74
738,-7.27
739,-6.90
740,-6.71
741,-6.71
742,-6.90
743,-7.20
744,-7.54
745,-7.84
746,-8.10
747,-8.28
748,-8.35
749,-8.35
750,-8.34
751,-8.32
752,-8.34
753,-8.39
754,-8.54
755,-8.79
756,-9.07
757,-9.31
758,-9.48
759,-9.60
760,-9.70
761,-9.75
762,-9.74
763,-9.68
764,-9.62
765,-9.55
766,-9.47
767,-9.34
768,-9.25
769,-9.23
770,-9.34
771,-9.51
772,-9.77
773,-10.13
774,-10.61
775,-11.14
776,-11.67
777,-12.15
778,-12.62
779,-13.02
780,-13.37
781,-13.66
782,-14.00
783,-14.41
784,-14.88
785,-15.29
786,-15.66
787,-15.95
788,-16.20
789,-16.37
790,-16.46
791,-16.45
792,-16.44
793,-16.49
794,-16.62
795,-16.80
796,-17.03
797,-17.26
798,-17.49
799,-17.67
800,-17.81
801,-17.86
802,-17.83
803,-17.77
804,-17.74
805,-17.74
806,-17.72
807,-17.66
808,-17.62
809,-17.62
810,-17.62
811,-17.56
812,-17.43
813,-17.25
814,-17.04
815,-16.82
816,-16.50
817,-16.15
818,-15.78
819,-15.43
820,-15.04
821,-14.63
822,-14.19
823,-13.78
824,-13.35
825,-12.95
826,-12.54
827,-12.19
828,-11.86
829,-11.57
830,-11.26
831,-10.98
832,-10.70
833,-10.48
834,-10.21
835,-9.93
836,-9.61
837,-9.25
838,-8.80
839,-8.32
840,-7.89
841,-7.58
842,-7.41
843,-7.36
844,-7.42
845,-7.61
846,-7.87
847,-8.18
848,-8.48
849,-8.71
850,-8.88
851,-9.00
852,-9.09
853,-9.21
854,-9.36
855,-9.54
856,-9.75
857,-9.99
858,-10.26
859,-10.56
860,-10.88
861,-11.17
862,-11.44
863,-11.68
864,-11.91
865,-12.08
866,-12.18
867,-12.24
868,-12.33
869,-12.44
870,-12.54
871,-12.60
872,-12.66
873,-12.72
874,-12.73
875,-12.67
876,-12.57
877,-12.45
878,-12.29
879,-12.06
880,-11.74
881,-11.37
882,-11.02
883,-10.78
884,-10.69
885,-10.76
886,-10.93
887,-11.17
888,-11.46
889,-11.77
890,-12.03
891,-12.15
892,-12.07
893,-11.83
894,-11.51
895,-11.20
896,-10.93
897,-10.77
898,-10.72
899,-10.79
900,-10.86
901,-10.87
902,-10.79
903,-10.67
904,-10.53
905,-10.41
906,-10.31
907,-10.26
908,-10.23
909,-10.17
910,-10.03
911,-9.80
912,-9.49
913,-9.12
914,-8.69
915,-8.27
916,-7.97
917,-7.84
918,-7.86
919,-7.99
920,-8.23
921,-8.59
922,-9.02
923,-9.44
924,-9.83
925,-10.19
926,-10.51
927,-10.75
928,-10.87
929,-10.86
930,-10.80
931,-10.73
932,-10.71
933,-10.70
934,-10.75
935,-10.92
936,-11.27
937,-11.75
938,-12.28
939,-12.76
940,-13.19
941,-13.55
942,-13.81
943,-13.92
944,-13.92
945,-13.85
946,-13.78
947,-13.72
948,-13.66
949,-13.60
950,-13.55
951,-13.49
952,-13.42
953,-13.29
954,-13.11
955,-12.94
956,-12.79
957,-12.67
958,-12.54
959,-12.43
960,-12.37
961,-12.44
962,-12.57
963,-12.71
964,-12.75
965,-12.70
966,-12.53
967,-12.23
968,-11.76
969,-11.15
970,-10.52
971,-9.98
972,-9.57
973,-9.34
974,-9.25
975,-9.32
976,-9.51
977,-9.75
978,-9.98
979,-10.17
980,-10.30
981,-10.36
982,-10.32
983,-10.20
984,-10.05
985,-9.93
986,-9.85
987,-9.79
988,-9.73
989,-9.67
990,-9.63
991,-9.56
992,-9.46
993,-9.35
994,-9.25
995,-9.19
996,-9.12
997,-9.06
998,-9.06
999,-9.11
1000,-9.22
1001,-9.34
1002,-9.48
1003,-9.66
1004,-9.86
1005,-10.04
1006,-10.18
1007,-10.29
1008,-10.44
1009,-10.62
1010,-10.81
1011,-10.99
1012,-11.16
1013,-11.34
1014,-11.51
1015,-11.63
1016,-11.68
1017,-11.68
1018,-11.65
1019,-11.58
1020,-11.51
1021,-11.44
1022,-11.44
1023,-11.50
1024,-11.59
1025,-11.72
1026,-11.89
1027,-12.06
1028,-12.18
1029,-12.25
1030,-12.30
1031,-12.28
1032,-12.18
1033,-12.01
1034,-11.86
1035,-11.80
1036,-11.75
1037,-11.71
1038,-11.65
1039,-11.59
1040,-11.47
1041,-11.31
1042,-11.09
1043,-10.85
1044,-10.56
1045,-10.27
1046,-10.00
1047,-9.83
1048,-9.70
1049,-9.59
1050,-9.45
1051,-9.34
1052,-9.24
1053,-9.18
1054,-9.14
1055,-9.16
1056,-9.21
1057,-9.26
1058,-9.26
1059,-9.21
1060,-9.16
1061,-9.15
1062,-9.17
1063,-9.24
1064,-9.36
1065,-9.54
1066,-9.74
1067,-9.93
1068,-10.08
1069,-10.20
1070,-10.26
1071,-10.27
1072,-10.19
1073,-10.08
1074,-9.93
1075,-9.75
1076,-9.52
1077,-9.28
1078,-9.07
1079,-8.90
1080,-8.71
1081,-8.54
1082,-8.38
1083,-8.26
1084,-8.16
1085,-8.05
1086,-7.90
1087,-7.72
1088,-7.51
1089,-7.34
1090,-7.20
1091,-7.15
1092,-7.16
1093,-7.23
1094,-7.29
1095,-7.30
1096,-7.19
1097,-6.96
1098,-6.61
1099,-6.18
1100,-5.71
1101,-5.30
1102,-4.99
1103,-4.81
1104,-4.70
1105,-4.66
1106,-4.66
1107,-4.66
1108,-4.55
1109,-4.33
1110,-4.04
1111,-3.72
1112,-3.38
1113,-3.08
1114,-2.94
1115,-3.00
1116,-3.17
1117,-3.36
1118,-3.54
1119,-3.72
1120,-3.88
1121,-4.00
1122,-4.08
1123,-4.19
1124,-4.42
1125,-4.78
1126,-5.23
1127,-5.70
1128,-6.22
1129,-6.75
1130,-7.29
1131,-7.71
1132,-7.96
1133,-8.06
1134,-8.15
1135,-8.26
1136,-8.41
1137,-8.52
1138,-8.63
1139,-8.74
1140,-8.89
1141,-9.00
1142,-9.06
1143,-9.06
1144,-9.04
1145,-9.03
1146,-9.06
1147,-9.18
1148,-9.44
1149,-9.79
1150,-10.20
1151,-10.62
1152,-11.06
1153,-11.47
1154,-11.80
1155,-11.99
1156,-12.06
1157,-12.04
1158,-11.98
1159,-11.92
1160,-11.95
1161,-12.05
1162,-12.23
1163,-12.47
1164,-12.81
1165,-13.17
1166,-13.45
1167,-13.58
1168,-13.56
1169,-13.43
1170,-13.21
1171,-12.92
1172,-12.57
1173,-12.26
1174,-12.07
1175,-12.02
1176,-12.02
1177,-12.03
1178,-12.00
1179,-11.95
1180,-11.86
1181,-11.80
1182,-11.78
1183,-11.85
1184,-11.99
1185,-12.17
1186,-12.34
1187,-12.47
1188,-12.53
1189,-12.47
1190,-12.25
1191,-11.89
1192,-11.44
1193,-10.96
1194,-10.48
1195,-10.00
1196,-9.54
1197,-9.12
1198,-8.75
1199,-8.46
1200,-8.22
1201,-7.99
1202,-7.69
1203,-7.34
1204,-6.94
1205,-6.58
1206,-6.29
1207,-6.10
1208,-6.07
1209,-6.25
1210,-6.65
1211,-7.20
1212,-7.76
1213,-8.19
1214,-8.42
1215,-8.42
1216,-8.22
1217,-7.90
1218,-7.60
1219,-7.41
1220,-7.41
1221,-7.59
1222,-7.91
1223,-8.28
1224,-8.61
1225,-8.85
1226,-8.99
1227,-9.04
1228,-9.06
1229,-9.05
1230,-9.04
1231,-9.04
1232,-9.06
1233,-9.06
1234,-9.00
1235,-8.88
1236,-8.76
1237,-8.69
1238,-8.70
1239,-8.83
1240,-9.08
1241,-9.45
1242,-9.83
1243,-10.14
1244,-10.31
1245,-10.30
1246,-10.12
1247,-9.83
1248,-9.48
1249,-9.10
1250,-8.74
1251,-8.45
1252,-8.30
1253,-8.29
1254,-8.35
1255,-8.48
1256,-8.71
1257,-9.01
1258,-9.28
1259,-9.47
1260,-9.59
1261,-9.70
1262,-9.81
1263,-9.87
1264,-9.86
1265,-9.80
1266,-9.74
1267,-9.67
1268,-9.61
1269,-9.55
1270,-9.50
1271,-9.44
1272,-9.36
1273,-9.29
1274,-9.29
1275,-9.41
1276,-9.67
1277,-10.03
1278,-10.43
1279,-10.80
1280,-11.10
1281,-11.27
1282,-11.31
1283,-11.24
1284,-11.16
1285,-11.09
1286,-11.02
1287,-10.96
1288,-10.98
1289,-11.09
1290,-11.28
1291,-11.47
1292,-11.62
1293,-11.73
1294,-11.84
1295,-11.96
1296,-12.08
1297,-12.20
1298,-12.33
1299,-12.44
1300,-12.54
1301,-12.60
1302,-12.64
1303,-12.63
1304,-12.58
1305,-12.52
1306,-12.52
1307,-12.57
1308,-12.65
1309,-12.71
1310,-12.77
1311,-12.83
1312,-12.87
1313,-12.87
1314,-12.82
1315,-12.76
1316,-12.75
1317,-12.80
1318,-12.90
1319,-13.02
1320,-13.18
1321,-13.36
1322,-13.54
1323,-13.66
1324,-13.71
1325,-13.70
1326,-13.69
1327,-13.68
1328,-13.70
1329,-13.76
1330,-13.87
1331,-14.05
1332,-14.29
1333,-14.53
1334,-14.76
1335,-14.99
1336,-15.27
1337,-15.56
1338,-15.83
1339,-16.08
1340,-16.34
1341,-16.57
1342,-16.71
1343,-16.71
1344,-16.65
1345,-16.57
1346,-16.51
1347,-16.44
1348,-16.45
1349,-16.62
1350,-17.00
1351,-17.48
1352,-17.96
1353,-18.39
1354,-18.77
1355,-19.06
1356,-19.20
1357,-19.14
1358,-18.97
1359,-18.77
1360,-18.62
1361,-18.56
1362,-18.65
1363,-18.82
1364,-19.00
1365,-19.14
1366,-19.20
1367,-19.13
1368,-18.90
1369,-18.55
1370,-18.15
1371,-17.78
1372,-17.46
1373,-17.23
1374,-17.12
1375,-17.13
1376,-17.13
1377,-17.09
1378,-16.98
1379,-16.80
1380,-16.49
1381,-16.09
1382,-15.59
1383,-15.11
1384,-14.66
1385,-14.26
1386,-13.85
1387,-13.50
1388,-13.20
1389,-12.97
1390,-12.71
1391,-12.43
1392,-12.09
1393,-11.73
1394,-11.32
1395,-10.92
1396,-10.54
1397,-10.24
1398,-9.99
1399,-9.80
1400,-9.75
1401,-9.86
1402,-10.15
1403,-10.51
1404,-10.89
1405,-11.25
1406,-11.60
1407,-11.89
1408,-12.09
1409,-12.20
1410,-12.34
1411,-12.57
1412,-12.92
1413,-13.33
1414,-13.84
1415,-14.43
1416,-15.11
1417,-15.76
1418,-16.36
1419,-16.84
1420,-17.22
1421,-17.45
1422,-17.50
1423,-17.38
1424,-17.16
1425,-16.91
1426,-16.66
1427,-16.43
1428,-16.21
1429,-16.02
1430,-15.90
1431,-15.85
1432,-15.85
1433,-15.85
1434,-15.81
1435,-15.76
1436,-15.70
1437,-15.64
1438,-15.50
1439,-15.29
1440,-14.95
1441,-14.53
1442,-14.00
1443,-13.41
1444,-12.82
1445,-12.28
1446,-11.75
1447,-11.28
1448,-10.89
1449,-10.59
1450,-10.33
1451,-10.10
1452,-9.90
1453,-9.78
1454,-9.74
1455,-9.80
1456,-9.96
1457,-10.21
1458,-10.51
1459,-10.80
1460,-11.09
1461,-11.32
1462,-11.51
1463,-11.62
1464,-11.69
1465,-11.73
1466,-11.86
1467,-12.03
1468,-12.26
1469,-12.49
1470,-12.75
1471,-13.04
1472,-13.40
1473,-13.76
1474,-14.06
1475,-14.30
1476,-14.53
1477,-14.76
1478,-14.98
1479,-15.16
1480,-15.36
1481,-15.59
1482,-15.83
1483,-16.08
1484,-16.33
1485,-16.56
1486,-16.76
1487,-16.88
1488,-16.94
1489,-17.00
1490,-17.08
1491,-17.14
1492,-17.11
1493,-17.00
1494,-16.84
1495,-16.59
1496,-16.20
1497,-15.66
1498,-15.10
1499,-14.66
1500,-14.40
1501,-14.29
1502,-14.32
1503,-14.50
1504,-14.81
1505,-15.18
1506,-15.50
1507,-15.69
1508,-15.70
1509,-15.64
1510,-15.57
1511,-15.51
1512,-15.42
1513,-15.30
1514,-15.21
1515,-15.15
1516,-15.05
1517,-14.88
1518,-14.66
1519,-14.46
1520,-14.36
1521,-14.36
1522,-14.46
1523,-14.64
1524,-14.89
1525,-15.13
1526,-15.31
1527,-15.43
1528,-15.53
1529,-15.63
1530,-15.78
1531,-15.95
1532,-16.24
1533,-16.64
1534,-17.19
1535,-17.78
1536,-18.42
1537,-19.07
1538,-19.77
1539,-20.42
1540,-20.97
1541,-21.39
1542,-21.72
1543,-21.95
1544,-22.08
1545,-22.08
1546,-21.99
1547,-21.80
1548,-21.52
1549,-21.16
1550,-20.75
1551,-20.33
1552,-19.91
1553,-19.50
1554,-19.07
1555,-18.66
1556,-18.26
1557,-17.91
1558,-17.56
1559,-17.28
1560,-17.04
1561,-16.88
1562,-16.65
1563,-16.38
1564,-16.00
1565,-15.59
1566,-15.09
1567,-14.50
1568,-13.81
1569,-13.10
1570,-12.38
1571,-11.73
1572,-11.12
1573,-10.66
1574,-10.33
1575,-10.15
1576,-10.07
1577,-10.09
1578,-10.17
1579,-10.29
1580,-10.38
1581,-10.44
1582,-10.51
1583,-10.63
1584,-10.80
1585,-10.98
1586,-11.15
1587,-11.33
1588,-11.52
1589,-11.70
1590,-11.86
1591,-11.97
1592,-12.08
1593,-12.19
1594,-12.34
1595,-12.51
1596,-12.73
1597,-12.96
1598,-13.24
1599,-13.48
1600,-13.62
1601,-13.61
1602,-13.52
1603,-13.39
1604,-13.28
1605,-13.21
1606,-13.24
1607,-13.42
1608,-13.76
1609,-14.17
1610,-14.62
1611,-15.04
1612,-15.45
1613,-15.80
1614,-16.07
1615,-16.24
1616,-16.38
1617,-16.49
1618,-16.59
1619,-16.65
1620,-16.69
1621,-16.74
1622,-16.85
1623,-16.97
1624,-17.07
1625,-17.12
1626,-17.17
1627,-17.23
1628,-17.28
1629,-17.29
1630,-17.24
1631,-17.18
1632,-17.12
1633,-17.07
1634,-16.99
1635,-16.94
1636,-16.91
1637,-16.91
1638,-16.88
1639,-16.78
1640,-16.55
1641,-16.19
1642,-15.67
1643,-15.02
1644,-14.26
1645,-13.48
1646,-12.73
1647,-12.14
1648,-11.72
1649,-11.56
1650,-11.58
1651,-11.71
1652,-11.82
1653,-11.83
1654,-11.70
1655,-11.40
1656,-10.91
1657,-10.38
1658,-9.92
1659,-9.67
1660,-9.64
1661,-9.82
1662,-10.23
1663,-10.83
1664,-11.54
1665,-12.14
1666,-12.55
1667,-12.72
1668,-12.73
1669,-12.65
1670,-12.58
1671,-12.57
1672,-12.70
1673,-12.92
1674,-13.28
1675,-13.70
1676,-14.16
1677,-14.57
1678,-14.92
1679,-15.14
1680,-15.32
1681,-15.43
1682,-15.52
1683,-15.56
1684,-15.63
1685,-15.80
1686,-16.16
1687,-16.62
1688,-17.17
1689,-17.71
1690,-18.26
1691,-18.80
1692,-19.26
1693,-19.56
1694,-19.71
1695,-19.75
1696,-19.78
1697,-19.78
1698,-19.72
1699,-19.60
1700,-19.47
1701,-19.34
1702,-19.22
1703,-19.10
1704,-19.03
1705,-19.02
1706,-19.09
1707,-19.21
1708,-19.36
1709,-19.49
1710,-19.53
1711,-19.47
1712,-19.33
1713,-19.14
1714,-18.95
1715,-18.84
1716,-18.83
1717,-18.96
1718,-19.15
1719,-19.34
1720,-19.47
1721,-19.52
1722,-19.50
1723,-19.39
1724,-19.17
1725,-18.86
1726,-18.52
1727,-18.23
1728,-17.99
1729,-17.81
1730,-17.65
1731,-17.54
1732,-17.49
1733,-17.48
1734,-17.51
1735,-17.57
1736,-17.70
1737,-17.88
1738,-18.04
1739,-18.11
1740,-18.05
1741,-17.93
1742,-17.81
1743,-17.68
1744,-17.53
1745,-17.36
1746,-17.19
1747,-17.07
1748,-16.98
1749,-16.92
1750,-16.89
1751,-16.89
1752,-16.91
1753,-16.90
1754,-16.90
1755,-16.96
1756,-17.14
1757,-17.43
1758,-17.81
1759,-18.23
1760,-18.71
1761,-19.19
1762,-19.58
1763,-19.82
1764,-19.94
1765,-19.92
1766,-19.81
1767,-19.62
1768,-19.46
1769,-19.33
1770,-19.23
1771,-19.18
1772,-19.19
1773,-19.25
1774,-19.30
1775,-19.31
1776,-19.26
1777,-19.20
1778,-19.13
1779,-19.08
1780,-19.00
1781,-18.89
1782,-18.73
1783,-18.55
1784,-18.36
1785,-18.17
1786,-18.04
1787,-17.96
1788,-18.00
1789,-18.19
1790,-18.52
1791,-18.88
1792,-19.15
1793,-19.28
1794,-19.29
1795,-19.15
1796,-18.88
1797,-18.51
1798,-18.20
1799,-18.07
1800,-18.14
1801,-18.39
1802,-18.79
1803,-19.26
1804,-19.75
1805,-20.18
1806,-20.51
1807,-20.68
1808,-20.69
1809,-20.63
1810,-20.61
1811,-20.65
1812,-20.75
1813,-20.87
1814,-21.06
1815,-21.29
1816,-21.54
1817,-21.72
1818,-21.87
1819,-21.97
1820,-22.07
1821,-22.19
1822,-22.35
1823,-22.53
1824,-22.68
1825,-22.81
1826,-22.93
1827,-23.04
1828,-23.12
1829,-23.19
1830,-23.28
1831,-23.38
1832,-23.49
1833,-23.56
1834,-23.60
1835,-23.59
1836,-23.53
1837,-23.41
1838,-23.27
1839,-23.14
1840,-23.05
1841,-22.99
1842,-22.99
1843,-23.06
1844,-23.14
1845,-23.20
1846,-23.22
1847,-23.22
1848,-23.23
1849,-23.23
1850,-23.16
1851,-23.06
1852,-22.93
1853,-22.74
1854,-22.44
1855,-22.03
1856,-21.58
1857,-21.15
1858,-20.71
1859,-20.31
1860,-19.98
1861,-19.80
1862,-19.72
1863,-19.74
1864,-19.79
1865,-19.86
1866,-19.87
1867,-19.81
1868,-19.70
1869,-19.58
1870,-19.46
1871,-19.36
1872,-19.21
1873,-19.04
1874,-18.81
1875,-18.58
1876,-18.33
1877,-18.09
1878,-17.86
1879,-17.68
1880,-17.58
1881,-17.52
1882,-17.46
1883,-17.41
1884,-17.35
1885,-17.30
1886,-17.21
1887,-17.09
1888,-16.97
1889,-16.90
1890,-16.93
1891,-17.04
1892,-17.24
1893,-17.48
1894,-17.78
1895,-18.13
1896,-18.55
1897,-18.96
1898,-19.35
1899,-19.64
1900,-19.87
1901,-20.04
1902,-20.20
1903,-20.31
1904,-20.39
1905,-20.45
1906,-20.52
1907,-20.64
1908,-20.81
1909,-20.98
1910,-21.15
1911,-21.27
1912,-21.34
1913,-21.34
1914,-21.25
1915,-21.06
1916,-20.84
1917,-20.65
1918,-20.58
1919,-20.64
1920,-20.82
1921,-21.07
1922,-21.31
1923,-21.49
1924,-21.58
1925,-21.59
1926,-21.48
1927,-21.23
1928,-20.89
1929,-20.53
1930,-20.20
1931,-19.91
1932,-19.61
1933,-19.30
1934,-19.04
1935,-18.93
1936,-18.97
1937,-19.16
1938,-19.41
1939,-19.66
1940,-19.84
1941,-19.90
1942,-19.81
1943,-19.58
1944,-19.21
1945,-18.78
1946,-18.37
1947,-18.13
1948,-18.13
1949,-18.37
1950,-18.78
1951,-19.28
1952,-19.76
1953,-20.18
1954,-20.49
1955,-20.68
1956,-20.72
1957,-20.66
1958,-20.52
1959,-20.34
1960,-20.13
1961,-19.95
1962,-19.84
1963,-19.76
1964,-19.75
1965,-19.81
1966,-19.98
1967,-20.21
1968,-20.46
1969,-20.71
1970,-20.97
1971,-21.19
1972,-21.37
1973,-21.49
1974,-21.64
1975,-21.80
1976,-21.97
1977,-22.09
1978,-22.22
1979,-22.39
1980,-22.59
1981,-22.77
1982,-22.94
1983,-23.12
1984,-23.32
1985,-23.56
1986,-23.83
1987,-24.12
1988,-24.46
1989,-24.76
1990,-24.96
1991,-25.02
1992,-24.97
1993,-24.84
1994,-24.68
1995,-24.50
1996,-24.31
1997,-24.12
1998,-23.98
1999,-23.91
2000,-23.97
2001,-24.15
2002,-24.42
2003,-24.72
2004,-25.03
2005,-25.34
2006,-25.60
2007,-25.77
2008,-25.86
2009,-25.86
2010,-25.80
2011,-25.73
2012,-25.69
2013,-25.69
2014,-25.76
2015,-25.87
2016,-26.02
2017,-26.21
2018,-26.43
2019,-26.66
2020,-26.89
2021,-27.12
2022,-27.44
2023,-27.79
2024,-28.13
2025,-28.37
2026,-28.53
2027,-28.64
2028,-28.73
2029,-28.79
2030,-28.83
2031,-28.82
2032,-28.79
2033,-28.72
2034,-28.68
2035,-28.62
2036,-28.50
2037,-28.32
2038,-28.13
2039,-28.01
2040,-27.97
2041,-27.98
2042,-27.97
2043,-27.92
2044,-27.79
2045,-27.62
2046,-27.38
2047,-27.09
2048,-26.70
2049,-26.28
2050,-25.89
2051,-25.58
2052,-25.38
2053,-25.27
2054,-25.23
2055,-25.24
2056,-25.22
2057,-25.16
2058,-25.08
2059,-25.02
2060,-24.99
2061,-25.00
2062,-25.01
2063,-25.01
2064,-24.97
2065,-24.93
2066,-24.84
2067,-24.72
2068,-24.53
2069,-24.29
2070,-24.07
2071,-23.89
2072,-23.71
2073,-23.54
2074,-23.38
2075,-23.25
2076,-23.16
2077,-23.09
2078,-23.12
2079,-23.30
2080,-23.63
2081,-24.06
2082,-24.50
2083,-24.86
2084,-25.11
2085,-25.22
2086,-25.22
2087,-25.15
2088,-25.08
2089,-25.01
2090,-25.00
2091,-25.05
2092,-25.21
2093,-25.44
2094,-25.76
2095,-26.11
2096,-26.51
2097,-26.92
2098,-27.36
2099,-27.78
2100,-28.17
2101,-28.46
2102,-28.66
2103,-28.76
2104,-28.87
2105,-28.97
2106,-29.12
2107,-29.30
2108,-29.53
2109,-29.77
2110,-29.98
2111,-30.16
2112,-30.34
2113,-30.52
2114,-30.65
2115,-30.72
2116,-30.72
2117,-30.72
2118,-30.72
2119,-30.66
2120,-30.50
2121,-30.20
2122,-29.79
2123,-29.37
2124,-29.00
2125,-28.70
2126,-28.45
2127,-28.28
2128,-28.19
2129,-28.21
2130,-28.21
2131,-28.11
2132,-27.80
2133,-27.33
2134,-26.71
2135,-26.06
2136,-25.37
2137,-24.72
2138,-24.12
2139,-23.65
2140,-23.28
2141,-23.00
2142,-22.69
2143,-22.35
2144,-21.92
2145,-21.46
2146,-20.90
2147,-20.32
2148,-19.70
2149,-19.18
2150,-18.69
2151,-18.30
2152,-17.90
2153,-17.56
2154,-17.20
2155,-16.87
2156,-16.43
2157,-15.91
2158,-15.25
2159,-14.54
2160,-13.79
2161,-13.08
2162,-12.41
2163,-11.88
2164,-11.49
2165,-11.26
2166,-11.12
2167,-11.08
2168,-11.08
2169,-11.09
2170,-10.99
2171,-10.83
2172,-10.63
2173,-10.45
2174,-10.23
2175,-9.94
2176,-9.57
2177,-9.21
2178,-8.89
2179,-8.65
2180,-8.51
2181,-8.45
2182,-8.47
2183,-8.58
2184,-8.80
2185,-9.10
2186,-9.48
2187,-9.83
2188,-10.12
2189,-10.30
2190,-10.42
2191,-10.52
2192,-10.67
2193,-10.84
2194,-11.09
2195,-11.38
2196,-11.70
2197,-12.00
2198,-12.29
2199,-12.53
2200,-12.69
2201,-12.74
2202,-12.74
2203,-12.73
2204,-12.76
2205,-12.82
2206,-12.89
2207,-12.94
2208,-13.02
2209,-13.07
2210,-13.11
2211,-13.10
2212,-13.10
2213,-13.15
2214,-13.31
2215,-13.54
2216,-13.84
2217,-14.14
2218,-14.43
2219,-14.67
2220,-14.81
2221,-14.81
2222,-14.70
2223,-14.57
2224,-14.50
2225,-14.50
2226,-14.56
2227,-14.69
2228,-14.85
2229,-15.03
2230,-15.19
2231,-15.31
2232,-15.39
2233,-15.38
2234,-15.30
2235,-15.17
2236,-15.11
2237,-15.15
2238,-15.35
2239,-15.65
2240,-16.04
2241,-16.46
2242,-16.85
2243,-17.15
2244,-17.35
2245,-17.46
2246,-17.55
2247,-17.65
2248,-17.83
2249,-18.07
2250,-18.39
2251,-18.75
2252,-19.10
2253,-19.39
2254,-19.65
2255,-19.82
2256,-19.91
2257,-19.90
2258,-19.87
2259,-19.87
2260,-19.91
2261,-19.97
2262,-20.03
2263,-20.09
2264,-20.15
2265,-20.21
2266,-20.27
2267,-20.32
2268,-20.39
2269,-20.45
2270,-20.51
2271,-20.57
2272,-20.62
2273,-20.63
2274,-20.54
2275,-20.36
2276,-20.13
2277,-19.94
2278,-19.86
2279,-19.92
2280,-20.10
2281,-20.34
2282,-20.60
2283,-20.84
2284,-21.06
2285,-21.17
2286,-21.16
2287,-21.03
2288,-20.89
2289,-20.81
2290,-20.87
2291,-21.06
2292,-21.36
2293,-21.72
2294,-22.06
2295,-22.31
2296,-22.42
2297,-22.42
2298,-22.35
2299,-22.28
2300,-22.27
2301,-22.32
2302,-22.45
2303,-22.63
2304,-22.85
2305,-23.03
2306,-23.12
2307,-23.12
2308,-23.07
2309,-23.00
2310,-22.96
2311,-22.95
2312,-23.04
2313,-23.28
2314,-23.65
2315,-24.08
2316,-24.47
2317,-24.77
2318,-24.98
2319,-25.09
2320,-25.12
2321,-25.05
2322,-24.96
2323,-24.83
2324,-24.70
2325,-24.57
2326,-24.49
2327,-24.44
2328,-24.37
2329,-24.25
2330,-24.09
2331,-23.91
2332,-23.72
2333,-23.54
2334,-23.36
2335,-23.19
2336,-22.99
2337,-22.77
2338,-22.45
2339,-22.10
2340,-21.72
2341,-21.37
2342,-21.02
2343,-20.74
2344,-20.49
2345,-20.33
2346,-20.13
2347,-19.84
2348,-19.41
2349,-18.88
2350,-18.25
2351,-17.60
2352,-16.91
2353,-16.24
2354,-15.69
2355,-15.33
2356,-15.19
2357,-15.25
2358,-15.46
2359,-15.77
2360,-16.13
2361,-16.49
2362,-16.82
2363,-17.11
2364,-17.42
2365,-17.70
2366,-17.99
2367,-18.29
2368,-18.65
2369,-18.98
2370,-19.30
2371,-19.60
2372,-19.97
2373,-20.37
2374,-20.79
2375,-21.21
2376,-21.72
2377,-22.31
2378,-22.90
2379,-23.38
2380,-23.77
2381,-24.06
2382,-24.24
2383,-24.23
2384,-24.09
2385,-23.90
2386,-23.77
2387,-23.70
2388,-23.67
2389,-23.68
2390,-23.74
2391,-23.79
2392,-23.79
2393,-23.68
2394,-23.47
2395,-23.16
2396,-22.77
2397,-22.42
2398,-22.18
2399,-22.12
2400,-22.17
2401,-22.31
2402,-22.49
2403,-22.67
2404,-22.74
2405,-22.64
2406,-22.32
2407,-21.84
2408,-21.23
2409,-20.63
2410,-20.12
2411,-19.77
2412,-19.55
2413,-19.44
2414,-19.39
2415,-19.40
2416,-19.41
2417,-19.42
2418,-19.39
2419,-19.33
2420,-19.22
2421,-19.10
2422,-19.00
2423,-18.89
2424,-18.71
2425,-18.47
2426,-18.20
2427,-18.02
2428,-17.96
2429,-18.03
2430,-18.17
2431,-18.36
2432,-18.55
2433,-18.68
2434,-18.65
2435,-18.41
2436,-17.99
2437,-17.51
2438,-17.04
2439,-16.62
2440,-16.24
2441,-15.95
2442,-15.75
2443,-15.63
2444,-15.53
2445,-15.41
2446,-15.31
2447,-15.31
2448,-15.41
2449,-15.60
2450,-15.82
2451,-16.07
2452,-16.30
2453,-16.48
2454,-16.58
2455,-16.58
2456,-16.50
2457,-16.37
2458,-16.24
2459,-16.18
2460,-16.24
2461,-16.43
2462,-16.67
2463,-16.91
2464,-17.14
2465,-17.31
2466,-17.43
2467,-17.43
2468,-17.30
2469,-17.11
2470,-16.98
2471,-16.91
2472,-16.90
2473,-16.90
2474,-16.93
2475,-16.98
2476,-17.06
2477,-17.13
2478,-17.15
2479,-17.08
2480,-16.94
2481,-16.75
2482,-16.61
2483,-16.54
2484,-16.56
2485,-16.62
2486,-16.73
2487,-16.91
2488,-17.16
2489,-17.39
2490,-17.57
2491,-17.69
2492,-17.81
2493,-17.91
2494,-18.01
2495,-18.14
2496,-18.36
2497,-18.65
2498,-18.93
2499,-19.17
2500,-19.44
2501,-19.73
2502,-20.00
2503,-20.18
2504,-20.31
2505,-20.48
2506,-20.74
2507,-21.05
2508,-21.32
2509,-21.50
2510,-21.58
2511,-21.58
2512,-21.51
2513,-21.39
2514,-21.22
2515,-21.10
2516,-21.10
2517,-21.22
2518,-21.39
2519,-21.59
2520,-21.77
2521,-21.90
2522,-21.85
2523,-21.62
2524,-21.22
2525,-20.74
2526,-20.20
2527,-19.67
2528,-19.18
2529,-18.82
2530,-18.59
2531,-18.48
2532,-18.45
2533,-18.46
2534,-18.43
2535,-18.38
2536,-18.29
2537,-18.17
2538,-17.99
2539,-17.77
2540,-17.48
2541,-17.19
2542,-16.85
2543,-16.50
2544,-16.12
2545,-15.76
2546,-15.43
2547,-15.14
2548,-14.85
2549,-14.63
2550,-14.46
2551,-14.34
2552,-14.21
2553,-14.10
2554,-14.04
2555,-14.04
2556,-14.03
2557,-13.98
2558,-13.89
2559,-13.82
2560,-13.79
2561,-13.79
2562,-13.84
2563,-13.95
2564,-14.16
2565,-14.40
2566,-14.63
2567,-14.81
2568,-14.95
2569,-15.05
2570,-15.18
2571,-15.35
2572,-15.63
2573,-15.97
2574,-16.42
2575,-16.89
2576,-17.39
2577,-17.86
2578,-18.33
2579,-18.74
2580,-19.09
2581,-19.32
2582,-19.49
2583,-19.59
2584,-19.71
2585,-19.81
2586,-19.97
2587,-20.20
2588,-20.55
2589,-20.97
2590,-21.41
2591,-21.76
2592,-22.03
2593,-22.22
2594,-22.29
2595,-22.16
2596,-21.84
2597,-21.42
2598,-21.01
2599,-20.71
2600,-20.50
2601,-20.33
2602,-20.16
2603,-19.98
2604,-19.77
2605,-19.54
2606,-19.27
2607,-18.97
2608,-18.63
2609,-18.34
2610,-18.15
2611,-18.09
2612,-18.08
2613,-18.10
2614,-18.10
2615,-18.10
2616,-18.05
2617,-17.94
2618,-17.78
2619,-17.60
2620,-17.38
2621,-17.14
2622,-16.92
2623,-16.75
2624,-16.58
2625,-16.41
2626,-16.21
2627,-16.02
2628,-15.88
2629,-15.83
2630,-15.86
2631,-15.92
2632,-15.95
2633,-15.95
2634,-15.98
2635,-16.04
2636,-16.09
2637,-16.08
2638,-16.05
2639,-16.04
2640,-16.12
2641,-16.24
2642,-16.36
2643,-16.48
2644,-16.65
2645,-16.88
2646,-17.15
2647,-17.46
2648,-17.83
2649,-18.23
2650,-18.64
2651,-19.00
2652,-19.34
2653,-19.57
2654,-19.65
2655,-19.53
2656,-19.29
2657,-18.97
2658,-18.65
2659,-18.40
2660,-18.31
2661,-18.42
2662,-18.75
2663,-19.18
2664,-19.63
2665,-19.98
2666,-20.21
2667,-20.32
2668,-20.39
2669,-20.44
2670,-20.52
2671,-20.64
2672,-20.83
2673,-21.06
2674,-21.32
2675,-21.50
2676,-21.58
2677,-21.52
2678,-21.32
2679,-21.00
2680,-20.68
2681,-20.44
2682,-20.31
2683,-20.26
2684,-20.20
2685,-20.09
2686,-19.92
2687,-19.68
2688,-19.32
2689,-18.84
2690,-18.30
2691,-17.88
2692,-17.65
2693,-17.65
2694,-17.85
2695,-18.16
2696,-18.50
2697,-18.81
2698,-19.02
2699,-19.08
2700,-18.97
2701,-18.72
2702,-18.42
2703,-18.11
2704,-17.84
2705,-17.60
2706,-17.42
2707,-17.30
2708,-17.24
2709,-17.23
2710,-17.30
2711,-17.41
2712,-17.60
2713,-17.84
2714,-18.10
2715,-18.33
2716,-18.55
2717,-18.79
2718,-19.08
2719,-19.38
2720,-19.65
2721,-19.89
2722,-20.14
2723,-20.44
2724,-20.76
2725,-21.00
2726,-21.12
2727,-21.11
2728,-21.03
2729,-20.90
2730,-20.76
2731,-20.58
2732,-20.38
2733,-20.20
2734,-20.07
2735,-20.00
2736,-20.01
2737,-20.08
2738,-20.16
2739,-20.23
2740,-20.22
2741,-20.16
2742,-20.08
2743,-19.96
2744,-19.77
2745,-19.53
2746,-19.31
2747,-19.18
2748,-19.16
2749,-19.23
2750,-19.36
2751,-19.54
2752,-19.74
2753,-19.93
2754,-20.07
2755,-20.12
2756,-20.07
2757,-19.95
2758,-19.84
2759,-19.76
2760,-19.74
2761,-19.81
2762,-20.00
2763,-20.29
2764,-20.65
2765,-21.02
2766,-21.39
2767,-21.74
2768,-22.05
2769,-22.29
2770,-22.48
2771,-22.59
2772,-22.62
2773,-22.55
2774,-22.44
2775,-22.31
2776,-22.24
2777,-22.22
2778,-22.31
2779,-22.49
2780,-22.79
2781,-23.14
2782,-23.50
2783,-23.80
2784,-24.04
2785,-24.16
2786,-24.12
2787,-23.93
2788,-23.69
2789,-23.51
2790,-23.43
2791,-23.42
2792,-23.48
2793,-23.60
2794,-23.83
2795,-24.12
2796,-24.39
2797,-24.58
2798,-24.73
2799,-24.83
2800,-24.88
2801,-24.83
2802,-24.71
2803,-24.57
2804,-24.46
2805,-24.41
2806,-24.44
2807,-24.50
2808,-24.51
2809,-24.48
2810,-24.35
2811,-24.18
2812,-23.87
2813,-23.47
2814,-22.98
2815,-22.50
2816,-22.03
2817,-21.62
2818,-21.26
2819,-20.97
2820,-20.68
2821,-20.40
2822,-20.10
2823,-19.80
2824,-19.47
2825,-19.20
2826,-18.93
2827,-18.69
2828,-18.39
2829,-18.05
2830,-17.68
2831,-17.31
2832,-16.94
2833,-16.59
2834,-16.31
2835,-16.18
2836,-16.20
2837,-16.33
2838,-16.54
2839,-16.78
2840,-17.01
2841,-17.20
2842,-17.31
2843,-17.36
2844,-17.37
2845,-17.37
2846,-17.40
2847,-17.46
2848,-17.54
2849,-17.65
2850,-17.85
2851,-18.08
2852,-18.32
2853,-18.50
2854,-18.64
2855,-18.75
2856,-18.86
2857,-18.97
2858,-19.15
2859,-19.38
2860,-19.67
2861,-19.97
2862,-20.27
2863,-20.57
2864,-20.86
2865,-21.10
2866,-21.27
2867,-21.39
2868,-21.48
2869,-21.60
2870,-21.74
2871,-21.86
2872,-21.94
2873,-22.00
2874,-22.06
2875,-22.12
2876,-22.16
2877,-22.16
2878,-22.12
2879,-22.06
2880,-22.00
2881,-21.88
2882,-21.68
2883,-21.44
2884,-21.21
2885,-21.03
2886,-20.87
2887,-20.70
2888,-20.49
2889,-20.26
2890,-19.96
2891,-19.55
2892,-18.98
2893,-18.39
2894,-17.85
2895,-17.49
2896,-17.29
2897,-17.25
2898,-17.30
2899,-17.43
2900,-17.55
2901,-17.62
2902,-17.59
2903,-17.47
2904,-17.27
2905,-17.02
2906,-16.79
2907,-16.60
2908,-16.50
2909,-16.51
2910,-16.61
2911,-16.79
2912,-17.01
2913,-17.27
2914,-17.50
2915,-17.68
2916,-17.75
2917,-17.76
2918,-17.74
2919,-17.67
2920,-17.53
2921,-17.36
2922,-17.21
2923,-17.15
2924,-17.12
2925,-17.07
2926,-16.99
2927,-16.92
2928,-16.89
2929,-16.89
2930,-16.92
2931,-16.99
2932,-17.07
2933,-17.13
2934,-17.13
2935,-17.07
2936,-16.99
2937,-16.93
2938,-16.89
2939,-16.88
2940,-16.93
2941,-17.06
2942,-17.25
2943,-17.43
2944,-17.52
2945,-17.53
2946,-17.48
2947,-17.35
2948,-17.14
2949,-16.90
2950,-16.72
2951,-16.72
2952,-16.88
2953,-17.14
2954,-17.39
2955,-17.58
2956,-17.63
2957,-17.51
2958,-17.20
2959,-16.78
2960,-16.33
2961,-15.97
2962,-15.75
2963,-15.69
2964,-15.75
2965,-15.88
2966,-16.01
2967,-16.08
2968,-16.03
2969,-15.85
2970,-15.56
2971,-15.18
2972,-14.80
2973,-14.50
2974,-14.35
2975,-14.35
2976,-14.45
2977,-14.65
2978,-14.92
2979,-15.21
2980,-15.46
2981,-15.65
2982,-15.80
2983,-15.91
2984,-15.95
2985,-15.90
2986,-15.79
2987,-15.66
2988,-15.50
2989,-15.34
2990,-15.17
2991,-15.04
2992,-14.96
2993,-14.97
2994,-15.07
2995,-15.25
2996,-15.46
2997,-15.65
2998,-15.79
2999,-15.85
3000,-15.79
3001,-15.62
3002,-15.34
3003,-14.97
3004,-14.53
3005,-14.12
3006,-13.79
3007,-13.55
3008,-13.36
3009,-13.19
3010,-13.02
3011,-12.84
3012,-12.61
3013,-12.32
3014,-11.96
3015,-11.60
3016,-11.26
3017,-11.03
3018,-10.90
3019,-10.92
3020,-11.01
3021,-11.14
3022,-11.22
3023,-11.23
3024,-11.14
3025,-10.96
3026,-10.68
3027,-10.38
3028,-10.12
3029,-9.93
3030,-9.82
3031,-9.77
3032,-9.78
3033,-9.83
3034,-9.90
3035,-9.96
3036,-10.06
3037,-10.18
3038,-10.27
3039,-10.27
3040,-10.19
3041,-10.06
3042,-9.95
3043,-9.88
3044,-9.88
3045,-9.93
3046,-10.08
3047,-10.31
3048,-10.64
3049,-11.00
3050,-11.35
3051,-11.64
3052,-11.92
3053,-12.21
3054,-12.56
3055,-12.97
3056,-13.47
3057,-14.02
3058,-14.56
3059,-14.97
3060,-15.22
3061,-15.27
3062,-15.21
3063,-15.06
3064,-14.93
3065,-14.86
3066,-14.97
3067,-15.26
3068,-15.71
3069,-16.20
3070,-16.66
3071,-17.01
3072,-17.22
3073,-17.27
3074,-17.25
3075,-17.24
3076,-17.32
3077,-17.49
3078,-17.76
3079,-18.07
3080,-18.36
3081,-18.55
3082,-18.54
3083,-18.36
3084,-18.08
3085,-17.77
3086,-17.47
3087,-17.23
3088,-17.09
3089,-17.04
3090,-17.01
3091,-16.96
3092,-16.85
3093,-16.66
3094,-16.40
3095,-16.10
3096,-15.82
3097,-15.65
3098,-15.54
3099,-15.50
3100,-15.46
3101,-15.46
3102,-15.50
3103,-15.56
3104,-15.61
3105,-15.68
3106,-15.77
3107,-15.88
3108,-16.01
3109,-16.13
3110,-16.26
3111,-16.37
3112,-16.48
3113,-16.54
3114,-16.56
3115,-16.56
3116,-16.54
3117,-16.55
3118,-16.56
3119,-16.56
3120,-16.52
3121,-16.40
3122,-16.20
3123,-15.97
3124,-15.71
3125,-15.47
3126,-15.25
3127,-15.08
3128,-14.95
3129,-14.88
3130,-14.88
3131,-14.96
3132,-15.05
3133,-15.11
3134,-15.09
3135,-14.98
3136,-14.79
3137,-14.54
3138,-14.24
3139,-13.89
3140,-13.50
3141,-13.14
3142,-12.82
3143,-12.58
3144,-12.44
3145,-12.38
3146,-12.36
3147,-12.37
3148,-12.41
3149,-12.53
3150,-12.71
3151,-12.95
3152,-13.25
3153,-13.62
3154,-14.00
3155,-14.30
3156,-14.45
3157,-14.46
3158,-14.37
3159,-14.18
3160,-13.87
3161,-13.51
3162,-13.21
3163,-13.02
3164,-12.91
3165,-12.86
3166,-12.89
3167,-13.01
3168,-13.15
3169,-13.28
3170,-13.41
3171,-13.58
3172,-13.79
3173,-14.04
3174,-14.31
3175,-14.60
3176,-14.92
3177,-15.21
3178,-15.50
3179,-15.74
3180,-15.91
3181,-15.96
3182,-15.94
3183,-15.86
3184,-15.81
3185,-15.81
3186,-15.91
3187,-16.07
3188,-16.30
3189,-16.54
3190,-16.81
3191,-17.04
3192,-17.20
3193,-17.26
3194,-17.29
3195,-17.33
3196,-17.43
3197,-17.61
3198,-17.91
3199,-18.26
3200,-18.62
3201,-18.92
3202,-19.20
3203,-19.43
3204,-19.58
3205,-19.64
3206,-19.68
3207,-19.74
3208,-19.77
3209,-19.71
3210,-19.58
3211,-19.39
3212,-19.19
3213,-19.01
3214,-18.85
3215,-18.74
3216,-18.65
3217,-18.60
3218,-18.52
3219,-18.41
3220,-18.23
3221,-18.00
3222,-17.71
3223,-17.40
3224,-17.13
3225,-16.94
3226,-16.90
3227,-16.97
3228,-17.08
3229,-17.20
3230,-17.32
3231,-17.44
3232,-17.55
3233,-17.61
3234,-17.61
3235,-17.61
3236,-17.67
3237,-17.78
3238,-17.91
3239,-18.04
3240,-18.17
3241,-18.27
3242,-18.36
3243,-18.42
3244,-18.51
3245,-18.61
3246,-18.76
3247,-19.00
3248,-19.38
3249,-19.85
3250,-20.36
3251,-20.77
3252,-21.11
3253,-21.33
3254,-21.51
3255,-21.62
3256,-21.72
3257,-21.83
3258,-22.00
3259,-22.23
3260,-22.57
3261,-22.92
3262,-23.25
3263,-23.49
3264,-23.66
3265,-23.70
3266,-23.64
3267,-23.51
3268,-23.44
3269,-23.42
3270,-23.46
3271,-23.53
3272,-23.66
3273,-23.83
3274,-23.99
3275,-24.12
3276,-24.23
3277,-24.35
3278,-24.46
3279,-24.52
3280,-24.51
3281,-24.45
3282,-24.37
3283,-24.26
3284,-24.06
3285,-23.77
3286,-23.39
3287,-23.03
3288,-22.70
3289,-22.41
3290,-22.11
3291,-21.82
3292,-21.52
3293,-21.23
3294,-20.88
3295,-20.48
3296,-20.00
3297,-19.52
3298,-19.04
3299,-18.63
3300,-18.31
3301,-18.14
3302,-18.06
3303,-18.01
3304,-17.92
3305,-17.81
3306,-17.66
3307,-17.56
3308,-17.46
3309,-17.34
3310,-17.15
3311,-16.92
3312,-16.65
3313,-16.36
3314,-15.97
3315,-15.50
3316,-15.01
3317,-14.57
3318,-14.22
3319,-13.99
3320,-13.92
3321,-13.97
3322,-14.10
3323,-14.30
3324,-14.54
3325,-14.77
3326,-14.92
3327,-14.98
3328,-15.05
3329,-15.16
3330,-15.29
3331,-15.41
3332,-15.58
3333,-15.81
3334,-16.08
3335,-16.33
3336,-16.54
3337,-16.71
3338,-16.85
3339,-16.91
3340,-16.88
3341,-16.75
3342,-16.59
3343,-16.40
3344,-16.22
3345,-16.10
3346,-16.08
3347,-16.19
3348,-16.44
3349,-16.81
3350,-17.26
3351,-17.67
3352,-17.98
3353,-18.16
3354,-18.28
3355,-18.38
3356,-18.52
3357,-18.75
3358,-19.18
3359,-19.77
3360,-20.45
3361,-21.12
3362,-21.76
3363,-22.29
3364,-22.65
3365,-22.77
3366,-22.69
3367,-22.49
3368,-22.29
3369,-22.10
3370,-21.97
3371,-21.84
3372,-21.75
3373,-21.69
3374,-21.65
3375,-21.66
3376,-21.68
3377,-21.68
3378,-21.62
3379,-21.51
3380,-21.35
3381,-21.17
3382,-20.96
3383,-20.72
3384,-20.48
3385,-20.30
3386,-20.21
3387,-20.23
3388,-20.25
3389,-20.26
3390,-20.21
3391,-20.10
3392,-19.88
3393,-19.59
3394,-19.22
3395,-18.86
3396,-18.54
3397,-18.31
3398,-18.14
3399,-18.03
3400,-17.92
3401,-17.81
3402,-17.65
3403,-17.42
3404,-17.07
3405,-16.67
3406,-16.20
3407,-15.72
3408,-15.22
3409,-14.82
3410,-14.53
3411,-14.37
3412,-14.18
3413,-13.95
3414,-13.68
3415,-13.38
3416,-13.00
3417,-12.54
3418,-11.98
3419,-11.44
3420,-10.94
3421,-10.53
3422,-10.21
3423,-10.03
3424,-9.99
3425,-10.06
3426,-10.15
3427,-10.22
3428,-10.25
3429,-10.23
3430,-10.21
3431,-10.22
3432,-10.28
3433,-10.39
3434,-10.54
3435,-10.71
3436,-10.98
3437,-11.34
3438,-11.76
3439,-12.12
3440,-12.37
3441,-12.55
3442,-12.70
3443,-12.82
3444,-12.86
3445,-12.79
3446,-12.70
3447,-12.63
3448,-12.60
3449,-12.60
3450,-12.64
3451,-12.70
3452,-12.77
3453,-12.83
3454,-12.87
3455,-12.92
3456,-13.04
3457,-13.21
3458,-13.47
3459,-13.76
3460,-14.11
3461,-14.47
3462,-14.82
3463,-15.12
3464,-15.34
3465,-15.46
3466,-15.50
3467,-15.50
3468,-15.47
3469,-15.40
3470,-15.30
3471,-15.17
3472,-15.08
3473,-15.03
3474,-14.96
3475,-14.85
3476,-14.67
3477,-14.49
3478,-14.34
3479,-14.22
3480,-14.10
3481,-13.98
3482,-13.89
3483,-13.82
3484,-13.79
3485,-13.73
3486,-13.64
3487,-13.53
3488,-13.38
3489,-13.20
3490,-12.97
3491,-12.73
3492,-12.52
3493,-12.40
3494,-12.37
3495,-12.44
3496,-12.58
3497,-12.76
3498,-12.94
3499,-13.06
3500,-13.11
3501,-13.12
3502,-13.08
3503,-13.02
3504,-12.92
3505,-12.82
3506,-12.66
3507,-12.43
3508,-12.05
3509,-11.58
3510,-11.06
3511,-10.57
3512,-10.14
3513,-9.79
3514,-9.52
3515,-9.34
3516,-9.22
3517,-9.17
3518,-9.19
3519,-9.24
3520,-9.28
3521,-9.35
3522,-9.48
3523,-9.65
3524,-9.83
3525,-10.02
3526,-10.25
3527,-10.54
3528,-10.86
3529,-11.15
3530,-11.48
3531,-11.83
3532,-12.21
3533,-12.57
3534,-12.89
3535,-13.18
3536,-13.50
3537,-13.85
3538,-14.26
3539,-14.67
3540,-15.10
3541,-15.45
3542,-15.69
3543,-15.75
3544,-15.64
3545,-15.38
3546,-15.09
3547,-14.83
3548,-14.73
3549,-14.84
3550,-15.21
3551,-15.81
3552,-16.61
3553,-17.52
3554,-18.41
3555,-19.13
3556,-19.62
3557,-19.86
3558,-19.87
3559,-19.68
3560,-19.33
3561,-18.84
3562,-18.33
3563,-17.90
3564,-17.62
3565,-17.51
3566,-17.52
3567,-17.65
3568,-17.84
3569,-18.04
3570,-18.13
3571,-18.08
3572,-17.83
3573,-17.41
3574,-16.85
3575,-16.26
3576,-15.66
3577,-15.12
3578,-14.65
3579,-14.30
3580,-14.08
3581,-13.95
3582,-13.87
3583,-13.82
3584,-13.82
3585,-13.88
3586,-13.95
3587,-14.02
3588,-14.10
3589,-14.21
3590,-14.35
3591,-14.48
3592,-14.57
3593,-14.63
3594,-14.65
3595,-14.65
3596,-14.66
3597,-14.66
3598,-14.61
3599,-14.49
3600,-14.32
3601,-14.14
3602,-13.95
3603,-13.77
3604,-13.63
3605,-13.57
3606,-13.58
3607,-13.65
3608,-13.75
3609,-13.87
3610,-13.98
3611,-14.11
3612,-14.24
3613,-14.36
3614,-14.43
3615,-14.43
3616,-14.37
3617,-14.19
3618,-13.88
3619,-13.45
3620,-12.99
3621,-12.56
3622,-12.21
3623,-11.98
3624,-11.86
3625,-11.86
3626,-11.97
3627,-12.09
3628,-12.15
3629,-12.16
3630,-12.14
3631,-12.13
3632,-12.13
3633,-12.15
3634,-12.17
3635,-12.22
3636,-12.28
3637,-12.35
3638,-12.43
3639,-12.49
3640,-12.48
3641,-12.44
3642,-12.36
3643,-12.29
3644,-12.20
3645,-12.10
3646,-11.97
3647,-11.79
3648,-11.47
3649,-11.06
3650,-10.64
3651,-10.27
3652,-9.96
3653,-9.74
3654,-9.59
3655,-9.58
3656,-9.70
3657,-9.90
3658,-10.09
3659,-10.20
3660,-10.23
3661,-10.24
3662,-10.25
3663,-10.25
3664,-10.18
3665,-10.06
3666,-9.98
3667,-9.90
3668,-9.80
3669,-9.69
3670,-9.64
3671,-9.69
3672,-9.82
3673,-10.00
3674,-10.28
3675,-10.70
3676,-11.22
3677,-11.76
3678,-12.27
3679,-12.68
3680,-12.99
3681,-13.17
3682,-13.24
3683,-13.23
3684,-13.19
3685,-13.18
3686,-13.28
3687,-13.45
3688,-13.69
3689,-14.00
3690,-14.37
3691,-14.72
3692,-15.00
3693,-15.12
3694,-15.10
3695,-14.97
3696,-14.78
3697,-14.53
3698,-14.27
3699,-14.03
3700,-13.85
3701,-13.78
3702,-13.89
3703,-14.13
3704,-14.44
3705,-14.76
3706,-15.00
3707,-15.11
3708,-15.08
3709,-14.88
3710,-14.63
3711,-14.38
3712,-14.21
3713,-14.14
3714,-14.22
3715,-14.46
3716,-14.86
3717,-15.34
3718,-15.82
3719,-16.24
3720,-16.61
3721,-16.90
3722,-17.14
3723,-17.30
3724,-17.45
3725,-17.56
3726,-17.68
3727,-17.80
3728,-17.92
3729,-18.04
3730,-18.17
3731,-18.28
3732,-18.36
3733,-18.43
3734,-18.50
3735,-18.55
3736,-18.57
3737,-18.57
3738,-18.60
3739,-18.66
3740,-18.70
3741,-18.65
3742,-18.48
3743,-18.24
3744,-17.94
3745,-17.65
3746,-17.37
3747,-17.20
3748,-17.12
3749,-17.19
3750,-17.36
3751,-17.56
3752,-17.65
3753,-17.60
3754,-17.36
3755,-17.01
3756,-16.56
3757,-16.08
3758,-15.59
3759,-15.17
3760,-14.88
3761,-14.76
3762,-14.76
3763,-14.77
3764,-14.74
3765,-14.68
3766,-14.60
3767,-14.53
3768,-14.53
3769,-14.59
3770,-14.72
3771,-14.89
3772,-15.10
3773,-15.29
3774,-15.40
3775,-15.40
3776,-15.28
3777,-15.10
3778,-14.92
3779,-14.79
3780,-14.76
3781,-14.88
3782,-15.16
3783,-15.53
3784,-15.88
3785,-16.13
3786,-16.22
3787,-16.16
3788,-15.96
3789,-15.66
3790,-15.30
3791,-14.94
3792,-14.60
3793,-14.30
3794,-14.02
3795,-13.79
3796,-13.62
3797,-13.50
3798,-13.40
3799,-13.34
3800,-13.36
3801,-13.47
3802,-13.66
3803,-13.92
3804,-14.20
3805,-14.44
3806,-14.56
3807,-14.50
3808,-14.29
3809,-13.99
3810,-13.60
3811,-13.19
3812,-12.79
3813,-12.48
3814,-12.31
3815,-12.33
3816,-12.47
3817,-12.67
3818,-12.76
3819,-12.72
3820,-12.50
3821,-12.15
3822,-11.61
3823,-10.96
3824,-10.25
3825,-9.57
3826,-9.00
3827,-8.59
3828,-8.38
3829,-8.32
3830,-8.32
3831,-8.34
3832,-8.35
3833,-8.35
3834,-8.26
3835,-8.09
3836,-7.88
3837,-7.69
3838,-7.52
3839,-7.42
3840,-7.40
3841,-7.45
3842,-7.51
3843,-7.51
3844,-7.49
3845,-7.49
3846,-7.48
3847,-7.43
3848,-7.32
3849,-7.20
3850,-7.11
3851,-7.03
3852,-6.99
3853,-7.00
3854,-7.10
3855,-7.26
3856,-7.47
3857,-7.71
3858,-8.04
3859,-8.39
3860,-8.69
3861,-8.88
3862,-9.01
3863,-9.11
3864,-9.20
3865,-9.26
3866,-9.33
3867,-9.45
3868,-9.62
3869,-9.80
3870,-9.95
3871,-10.01
3872,-9.96
3873,-9.78
3874,-9.48
3875,-9.12
3876,-8.75
3877,-8.45
3878,-8.26
3879,-8.19
3880,-8.24
3881,-8.37
3882,-8.54
3883,-8.65
3884,-8.67
3885,-8.61
3886,-8.55
3887,-8.60
3888,-8.79
3889,-9.10
3890,-9.48
3891,-9.84
3892,-10.12
3893,-10.30
3894,-10.42
3895,-10.47
3896,-10.44
3897,-10.38
3898,-10.38
3899,-10.48
3900,-10.73
3901,-11.03
3902,-11.34
3903,-11.57
3904,-11.72
3905,-11.78
3906,-11.80
3907,-11.79
3908,-11.77
3909,-11.77
3910,-11.83
3911,-11.94
3912,-12.09
3913,-12.22
3914,-12.29
3915,-12.28
3916,-12.22
3917,-12.17
3918,-12.15
3919,-12.21
3920,-12.31
3921,-12.45
3922,-12.56
3923,-12.57
3924,-12.39
3925,-12.03
3926,-11.53
3927,-10.99
3928,-10.47
3929,-10.05
3930,-9.74
3931,-9.64
3932,-9.70
3933,-9.83
3934,-9.85
3935,-9.69
3936,-9.35
3937,-8.93
3938,-8.41
3939,-7.87
3940,-7.40
3941,-7.10
3942,-6.99
3943,-7.06
3944,-7.24
3945,-7.42
3946,-7.54
3947,-7.53
3948,-7.43
3949,-7.31
3950,-7.23
3951,-7.22
3952,-7.31
3953,-7.49
3954,-7.77
3955,-8.13
3956,-8.54
3957,-8.96
3958,-9.37
3959,-9.73
3960,-10.01
3961,-10.19
3962,-10.28
3963,-10.27
3964,-10.19
3965,-10.08
3966,-9.93
3967,-9.75
3968,-9.51
3969,-9.28
3970,-9.09
3971,-8.97
3972,-8.88
3973,-8.83
3974,-8.82
3975,-8.88
3976,-8.98
3977,-9.04
3978,-9.03
3979,-8.97
3980,-8.92
3981,-8.85
3982,-8.74
3983,-8.63
3984,-8.58
3985,-8.57
3986,-8.51
3987,-8.42
3988,-8.30
3989,-8.16
3990,-7.95
3991,-7.66
3992,-7.36
3993,-7.11
3994,-6.92
3995,-6.80
3996,-6.82
3997,-7.05
3998,-7.51
3999,-8.12
4000,-8.76
4001,-9.30
4002,-9.70
4003,-9.93
4004,-10.03
4005,-10.01
4006,-9.99
4007,-10.03
4008,-10.24
4009,-10.58
4010,-11.11
4011,-11.70
4012,-12.33
4013,-12.92
4014,-13.51
4015,-14.03
4016,-14.51
4017,-14.92
4018,-15.35
4019,-15.81
4020,-16.34
4021,-16.81
4022,-17.22
4023,-17.50
4024,-17.74
4025,-17.89
4026,-18.05
4027,-18.22
4028,-18.48
4029,-18.83
4030,-19.29
4031,-19.82
4032,-20.43
4033,-21.03
4034,-21.56
4035,-21.91
4036,-22.09
4037,-22.15
4038,-22.16
4039,-22.14
4040,-22.13
4041,-22.13
4042,-22.18
4043,-22.23
4044,-22.27
4045,-22.21
4046,-22.06
4047,-21.87
4048,-21.72
4049,-21.65
4050,-21.70
4051,-21.90
4052,-22.19
4053,-22.51
4054,-22.67
4055,-22.62
4056,-22.35
4057,-21.91
4058,-21.39
4059,-20.91
4060,-20.58
4061,-20.46
4062,-20.50
4063,-20.64
4064,-20.81
4065,-20.93
4066,-20.91
4067,-20.74
4068,-20.45
4069,-20.14
4070,-19.87
4071,-19.69
4072,-19.63
4073,-19.70
4074,-19.83
4075,-19.96
4076,-20.03
4077,-20.03
4078,-19.96
4079,-19.84
4080,-19.66
4081,-19.49
4082,-19.35
4083,-19.29
4084,-19.30
4085,-19.36
4086,-19.45
4087,-19.57
4088,-19.73
4089,-19.91
4090,-20.07
4091,-20.20
4092,-20.28
4093,-20.33
4094,-20.36
4095,-20.36
4096,-20.34
4097,-20.34
4098,-20.39
4099,-20.44
4100,-20.48
4101,-20.55
4102,-20.69
4103,-20.92
4104,-21.20
4105,-21.51
4106,-21.85
4107,-22.20
4108,-22.53
4109,-22.77
4110,-22.93
4111,-22.98
4112,-22.94
4113,-22.81
4114,-22.67
4115,-22.53
4116,-22.48
4117,-22.53
4118,-22.77
4119,-23.19
4120,-23.75
4121,-24.35
4122,-24.92
4123,-25.41
4124,-25.76
4125,-25.89
4126,-25.70
4127,-25.29
4128,-24.73
4129,-24.13
4130,-23.48
4131,-22.83
4132,-22.22
4133,-21.75
4134,-21.35
4135,-21.01
4136,-20.68
4137,-20.39
4138,-20.08
4139,-19.81
4140,-19.49
4141,-19.14
4142,-18.68
4143,-18.15
4144,-17.57
4145,-17.04
4146,-16.53
4147,-16.13
4148,-15.80
4149,-15.64
4150,-15.57
4151,-15.59
4152,-15.57
4153,-15.46
4154,-15.21
4155,-14.87
4156,-14.40
4157,-13.86
4158,-13.27
4159,-12.73
4160,-12.32
4161,-12.08
4162,-11.96
4163,-11.93
4164,-11.90
4165,-11.90
4166,-11.90
4167,-11.92
4168,-11.89
4169,-11.78
4170,-11.49
4171,-11.09
4172,-10.59
4173,-10.05
4174,-9.45
4175,-8.87
4176,-8.32
4177,-7.92
4178,-7.57
4179,-7.29
4180,-7.01
4181,-6.79
4182,-6.54
4183,-6.26
4184,-5.84
4185,-5.38
4186,-4.87
4187,-4.40
4188,-3.91
4189,-3.45
4190,-3.00
4191,-2.64
4192,-2.35
4193,-2.13
4194,-1.93
4195,-1.81
4196,-1.78
4197,-1.91
4198,-2.17
4199,-2.47
4200,-2.72
4201,-2.91
4202,-3.07
4203,-3.17
4204,-3.20
4205,-3.13
4206,-3.08
4207,-3.13
4208,-3.33
4209,-3.62
4210,-4.02
4211,-4.49
4212,-5.06
4213,-5.65
4214,-6.23
4215,-6.70
4216,-7.09
4217,-7.37
4218,-7.61
4219,-7.77
4220,-7.94
4221,-8.11
4222,-8.34
4223,-8.63
4224,-9.01
4225,-9.42
4226,-9.86
4227,-10.22
4228,-10.47
4229,-10.57
4230,-10.60
4231,-10.59
4232,-10.60
4233,-10.66
4234,-10.80
4235,-10.97
4236,-11.16
4237,-11.34
4238,-11.52
4239,-11.70
4240,-11.86
4241,-11.99
4242,-12.05
4243,-12.10
4244,-12.21
4245,-12.40
4246,-12.63
4247,-12.81
4248,-12.86
4249,-12.81
4250,-12.68
4251,-12.50
4252,-12.25
4253,-11.95
4254,-11.63
4255,-11.41
4256,-11.25
4257,-11.07
4258,-10.79
4259,-10.44
4260,-10.06
4261,-9.70
4262,-9.32
4263,-8.97
4264,-8.69
4265,-8.57
4266,-8.59
4267,-8.72
4268,-8.90
4269,-9.09
4270,-9.22
4271,-9.28
4272,-9.25
4273,-9.20
4274,-9.14
4275,-9.08
4276,-9.00
4277,-8.93
4278,-8.96
4279,-9.07
4280,-9.27
4281,-9.45
4282,-9.58
4283,-9.70
4284,-9.86
4285,-10.03
4286,-10.18
4287,-10.30
4288,-10.44
4289,-10.61
4290,-10.80
4291,-10.98
4292,-11.19
4293,-11.41
4294,-11.66
4295,-11.89
4296,-12.18
4297,-12.47
4298,-12.73
4299,-12.92
4300,-13.04
4301,-13.08
4302,-13.08
4303,-13.09
4304,-13.15
4305,-13.25
4306,-13.39
4307,-13.58
4308,-13.88
4309,-14.23
4310,-14.52
4311,-14.71
4312,-14.85
4313,-14.96
4314,-14.98
4315,-14.87
4316,-14.65
4317,-14.40
4318,-14.19
4319,-14.01
4320,-13.85
4321,-13.73
4322,-13.69
4323,-13.75
4324,-13.87
4325,-14.00
4326,-14.09
4327,-14.15
4328,-14.18
4329,-14.18
4330,-14.13
4331,-14.02
4332,-13.84
4333,-13.65
4334,-13.51
4335,-13.45
4336,-13.47
4337,-13.54
4338,-13.59
4339,-13.60
4340,-13.53
4341,-13.41
4342,-13.24
4343,-13.06
4344,-12.89
4345,-12.78
4346,-12.71
4347,-12.72
4348,-12.77
4349,-12.83
4350,-12.86
4351,-12.79
4352,-12.66
4353,-12.54
4354,-12.49
4355,-12.55
4356,-12.69
4357,-12.87
4358,-13.08
4359,-13.33
4360,-13.57
4361,-13.75
4362,-13.83
4363,-13.82
4364,-13.80
4365,-13.79
4366,-13.82
4367,-13.89
4368,-14.01
4369,-14.18
4370,-14.40
4371,-14.64
4372,-14.90
4373,-15.07
4374,-15.11
4375,-15.05
4376,-14.98
4377,-14.91
4378,-14.81
4379,-14.70
4380,-14.65
4381,-14.70
4382,-14.80
4383,-14.87
4384,-14.91
4385,-14.96
4386,-15.04
4387,-15.11
4388,-15.11
4389,-15.05
4390,-14.94
4391,-14.82
4392,-14.69
4393,-14.52
4394,-14.26
4395,-13.95
4396,-13.68
4397,-13.50
4398,-13.43
4399,-13.44
4400,-13.48
4401,-13.60
4402,-13.81
4403,-14.05
4404,-14.24
4405,-14.31
4406,-14.24
4407,-14.05
4408,-13.79
4409,-13.49
4410,-13.18
4411,-12.93
4412,-12.81
4413,-12.81
4414,-12.89
4415,-13.02
4416,-13.18
4417,-13.29
4418,-13.34
4419,-13.34
4420,-13.34
4421,-13.40
4422,-13.52
4423,-13.69
4424,-13.93
4425,-14.24
4426,-14.58
4427,-14.88
4428,-15.07
4429,-15.13
4430,-15.11
4431,-15.05
4432,-14.94
4433,-14.82
4434,-14.74
4435,-14.74
4436,-14.79
4437,-14.86
4438,-14.91
4439,-14.92
4440,-14.83
4441,-14.65
4442,-14.38
4443,-14.08
4444,-13.79
4445,-13.55
4446,-13.37
4447,-13.25
4448,-13.19
4449,-13.20
4450,-13.22
4451,-13.23
4452,-13.19
4453,-13.14
4454,-13.06
4455,-13.01
4456,-12.95
4457,-12.90
4458,-12.79
4459,-12.62
4460,-12.38
4461,-12.08
4462,-11.72
4463,-11.36
4464,-11.05
4465,-10.88
4466,-10.80
4467,-10.81
4468,-10.86
4469,-10.93
4470,-10.96
4471,-10.90
4472,-10.72
4473,-10.42
4474,-10.04
4475,-9.61
4476,-9.19
4477,-8.90
4478,-8.77
4479,-8.84
4480,-9.02
4481,-9.20
4482,-9.35
4483,-9.47
4484,-9.57
4485,-9.62
4486,-9.64
4487,-9.63
4488,-9.67
4489,-9.77
4490,-10.00
4491,-10.30
4492,-10.65
4493,-11.01
4494,-11.37
4495,-11.67
4496,-11.87
4497,-11.99
4498,-12.06
4499,-12.11
4500,-12.17
4501,-12.22
4502,-12.31
4503,-12.35
4504,-12.38
4505,-12.37
4506,-12.41
4507,-12.52
4508,-12.72
4509,-13.02
4510,-13.44
4511,-13.92
4512,-14.39
4513,-14.75
4514,-15.01
4515,-15.18
4516,-15.30
4517,-15.36
4518,-15.34
4519,-15.29
4520,-15.22
4521,-15.15
4522,-15.08
4523,-15.03
4524,-14.99
4525,-14.94
4526,-14.79
4527,-14.55
4528,-14.27
4529,-14.03
4530,-13.82
4531,-13.65
4532,-13.52
4533,-13.47
4534,-13.44
4535,-13.45
4536,-13.47
4537,-13.47
4538,-13.42
4539,-13.24
4540,-12.91
4541,-12.48
4542,-12.05
4543,-11.70
4544,-11.39
4545,-11.16
4546,-11.01
4547,-10.95
4548,-10.95
4549,-11.02
4550,-11.13
4551,-11.25
4552,-11.34
4553,-11.41
4554,-11.47
4555,-11.54
4556,-11.51
4557,-11.41
4558,-11.25
4559,-11.05
4560,-10.82
4561,-10.58
4562,-10.41
4563,-10.34
4564,-10.38
4565,-10.50
4566,-10.72
4567,-11.02
4568,-11.35
4569,-11.66
4570,-11.89
4571,-12.08
4572,-12.21
4573,-12.25
4574,-12.22
4575,-12.17
4576,-12.17
4577,-12.21
4578,-12.27
4579,-12.28
4580,-12.26
4581,-12.25
4582,-12.25
4583,-12.25
4584,-12.29
4585,-12.41
4586,-12.60
4587,-12.84
4588,-13.11
4589,-13.42
4590,-13.72
4591,-13.96
4592,-14.11
4593,-14.17
4594,-14.17
4595,-14.16
4596,-14.18
4597,-14.24
4598,-14.37
4599,-14.48
4600,-14.54
4601,-14.54
4602,-14.53
4603,-14.53
4604,-14.50
4605,-14.45
4606,-14.37
4607,-14.31
4608,-14.27
4609,-14.21
4610,-14.11
4611,-13.92
4612,-13.68
4613,-13.44
4614,-13.25
4615,-13.14
4616,-13.05
4617,-13.00
4618,-12.97
4619,-12.97
4620,-12.97
4621,-12.98
4622,-12.98
4623,-12.98
4624,-12.97
4625,-12.97
4626,-12.98
4627,-12.98
4628,-12.96
4629,-12.90
4630,-12.79
4631,-12.67
4632,-12.58
4633,-12.51
4634,-12.48
4635,-12.48
4636,-12.55
4637,-12.73
4638,-12.99
4639,-13.30
4640,-13.60
4641,-13.84
4642,-13.99
4643,-14.05
4644,-14.04
4645,-13.97
4646,-13.89
4647,-13.89
4648,-14.02
4649,-14.32
4650,-14.76
4651,-15.25
4652,-15.68
4653,-15.98
4654,-16.14
4655,-16.13
4656,-15.97
4657,-15.73
4658,-15.50
4659,-15.31
4660,-15.14
4661,-15.04
4662,-15.03
4663,-15.08
4664,-15.10
4665,-15.05
4666,-14.99
4667,-14.98
4668,-14.98
4669,-14.99
4670,-15.04
4671,-15.15
4672,-15.33
4673,-15.51
4674,-15.68
4675,-15.79
4676,-15.86
4677,-15.91
4678,-16.00
4679,-16.11
4680,-16.26
4681,-16.37
4682,-16.49
4683,-16.60
4684,-16.75
4685,-16.92
4686,-17.14
4687,-17.37
4688,-17.65
4689,-17.95
4690,-18.22
4691,-18.41
4692,-18.49
4693,-18.42
4694,-18.20
4695,-17.90
4696,-17.61
4697,-17.42
4698,-17.36
4699,-17.42
4700,-17.62
4701,-17.91
4702,-18.27
4703,-18.57
4704,-18.76
4705,-18.82
4706,-18.80
4707,-18.72
4708,-18.65
4709,-18.65
4710,-18.78
4711,-19.01
4712,-19.31
4713,-19.61
4714,-19.93
4715,-20.22
4716,-20.45
4717,-20.58
4718,-20.60
4719,-20.53
4720,-20.42
4721,-20.30
4722,-20.21
4723,-20.15
4724,-20.08
4725,-20.03
4726,-20.00
4727,-19.94
4728,-19.79
4729,-19.56
4730,-19.27
4731,-18.97
4732,-18.63
4733,-18.28
4734,-17.94
4735,-17.64
4736,-17.35
4737,-17.06
4738,-16.75
4739,-16.46
4740,-16.17
4741,-15.94
4742,-15.75
4743,-15.70
4744,-15.75
4745,-15.89
4746,-16.00
4747,-16.01
4748,-15.85
4749,-15.55
4750,-15.15
4751,-14.73
4752,-14.31
4753,-13.95
4754,-13.69
4755,-13.52
4756,-13.38
4757,-13.27
4758,-13.16
4759,-13.11
4760,-13.08
4761,-13.08
4762,-13.11
4763,-13.16
4764,-13.27
4765,-13.44
4766,-13.71
4767,-14.01
4768,-14.31
4769,-14.54
4770,-14.75
4771,-14.92
4772,-15.07
4773,-15.19
4774,-15.30
4775,-15.41
4776,-15.56
4777,-15.74
4778,-15.94
4779,-16.11
4780,-16.27
4781,-16.38
4782,-16.48
4783,-16.53
4784,-16.56
4785,-16.55
4786,-16.54
4787,-16.54
4788,-16.56
4789,-16.55
4790,-16.53
4791,-16.53
4792,-16.59
4793,-16.71
4794,-16.84
4795,-16.97
4796,-17.11
4797,-17.22
4798,-17.25
4799,-17.20
4800,-17.12
4801,-17.05
4802,-16.98
4803,-16.92
4804,-16.94
4805,-17.04
4806,-17.23
4807,-17.43
4808,-17.56
4809,-17.57
4810,-17.38
4811,-17.01
4812,-16.56
4813,-16.13
4814,-15.81
4815,-15.63
4816,-15.59
4817,-15.73
4818,-15.97
4819,-16.23
4820,-16.35
4821,-16.29
4822,-16.06
4823,-15.76
4824,-15.43
4825,-15.13
4826,-14.87
4827,-14.71
4828,-14.63
4829,-14.57
4830,-14.43
4831,-14.21
4832,-13.92
4833,-13.61
4834,-13.26
4835,-12.91
4836,-12.60
4837,-12.42
4838,-12.34
4839,-12.35
4840,-12.43
4841,-12.54
4842,-12.66
4843,-12.79
4844,-12.93
4845,-13.05
4846,-13.11
4847,-13.11
4848,-13.11
4849,-13.11
4850,-13.05
4851,-12.94
4852,-12.78
4853,-12.60
4854,-12.39
4855,-12.15
4856,-11.89
4857,-11.65
4858,-11.45
4859,-11.34
4860,-11.31
4861,-11.37
4862,-11.49
4863,-11.61
4864,-11.69
4865,-11.69
4866,-11.63
4867,-11.51
4868,-11.34
4869,-11.15
4870,-11.00
4871,-10.95
4872,-11.00
4873,-11.12
4874,-11.24
4875,-11.31
4876,-11.31
4877,-11.18
4878,-10.90
4879,-10.54
4880,-10.21
4881,-9.96
4882,-9.78
4883,-9.67
4884,-9.65
4885,-9.70
4886,-9.79
4887,-9.85
4888,-9.90
4889,-9.95
4890,-10.04
4891,-10.15
4892,-10.32
4893,-10.55
4894,-10.89
4895,-11.31
4896,-11.78
4897,-12.25
4898,-12.75
4899,-13.22
4900,-13.69
4901,-14.08
4902,-14.48
4903,-14.89
4904,-15.38
4905,-15.91
4906,-16.46
4907,-16.93
4908,-17.36
4909,-17.72
4910,-17.99
4911,-18.10
4912,-18.07
4913,-17.94
4914,-17.81
4915,-17.69
4916,-17.54
4917,-17.36
4918,-17.20
4919,-17.08
4920,-16.97
4921,-16.78
4922,-16.53
4923,-16.30
4924,-16.12
4925,-16.01
4926,-15.85
4927,-15.63
4928,-15.36
4929,-15.11
4930,-14.87
4931,-14.63
4932,-14.43
4933,-14.31
4934,-14.27
4935,-14.28
4936,-14.27
4937,-14.28
4938,-14.32
4939,-14.38
4940,-14.39
4941,-14.34
4942,-14.24
4943,-14.12
4944,-13.97
4945,-13.79
4946,-13.60
4947,-13.42
4948,-13.26
4949,-13.08
4950,-12.85
4951,-12.62
4952,-12.42
4953,-12.24
4954,-12.00
4955,-11.77
4956,-11.61
4957,-11.55
4958,-11.50
4959,-11.46
4960,-11.44
4961,-11.43
4962,-11.37
4963,-11.18
4964,-10.95
4965,-10.77
4966,-10.70
4967,-10.75
4968,-10.93
4969,-11.23
4970,-11.67
4971,-12.15
4972,-12.57
4973,-12.86
4974,-13.09
4975,-13.26
4976,-13.37
4977,-13.44
4978,-13.50
4979,-13.61
4980,-13.79
4981,-13.97
4982,-14.13
4983,-14.18
4984,-14.12
4985,-14.00
4986,-13.88
4987,-13.75
4988,-13.61
4989,-13.49
4990,-13.47
4991,-13.58
4992,-13.82
4993,-14.13
4994,-14.47
4995,-14.83
4996,-15.15
4997,-15.40
4998,-15.54
4999,-15.55
5000,-15.38
5001,-15.09
5002,-14.68
5003,-14.21
5004,-13.65
5005,-13.05
5006,-12.44
5007,-11.91
5008,-11.44
5009,-11.03
5010,-10.62
5011,-10.22
5012,-9.78
5013,-9.37
5014,-8.95
5015,-8.54
5016,-8.12
5017,-7.76
5018,-7.50
5019,-7.39
5020,-7.38
5021,-7.44
5022,-7.55
5023,-7.74
5024,-7.97
5025,-8.22
5026,-8.42
5027,-8.53
5028,-8.60
5029,-8.65
5030,-8.71
5031,-8.77
5032,-8.85
5033,-8.95
5034,-9.16
5035,-9.52
5036,-10.04
5037,-10.64
5038,-11.25
5039,-11.85
5040,-12.45
5041,-12.98
5042,-13.40
5043,-13.63
5044,-13.74
5045,-13.79
5046,-13.85
5047,-13.89
5048,-13.97
5049,-14.08
5050,-14.31
5051,-14.60
5052,-14.91
5053,-15.15
5054,-15.33
5055,-15.43
5056,-15.50
5057,-15.50
5058,-15.44
5059,-15.32
5060,-15.17
5061,-15.03
5062,-14.99
5063,-15.06
5064,-15.20
5065,-15.31
5066,-15.37
5067,-15.37
5068,-15.37
5069,-15.36
5070,-15.33
5071,-15.27
5072,-15.24
5073,-15.30
5074,-15.41
5075,-15.54
5076,-15.65
5077,-15.71
5078,-15.71
5079,-15.66
5080,-15.53
5081,-15.36
5082,-15.11
5083,-14.82
5084,-14.47
5085,-14.11
5086,-13.76
5087,-13.40
5088,-13.00
5089,-12.59
5090,-12.19
5091,-11.89
5092,-11.69
5093,-11.63
5094,-11.73
5095,-11.99
5096,-12.29
5097,-12.60
5098,-12.85
5099,-12.97
5100,-12.92
5101,-12.68
5102,-12.30
5103,-11.92
5104,-11.70
5105,-11.70
5106,-11.91
5107,-12.28
5108,-12.74
5109,-13.22
5110,-13.66
5111,-13.96
5112,-14.09
5113,-14.08
5114,-14.04
5115,-14.02
5116,-14.09
5117,-14.27
5118,-14.59
5119,-15.01
5120,-15.45
5121,-15.75
5122,-15.88
5123,-15.81
5124,-15.61
5125,-15.37
5126,-15.13
5127,-14.95
5128,-14.85
5129,-14.85
5130,-14.94
5131,-15.07
5132,-15.17
5133,-15.17
5134,-15.03
5135,-14.73
5136,-14.29
5137,-13.81
5138,-13.36
5139,-12.99
5140,-12.71
5141,-12.55
5142,-12.49
5143,-12.49
5144,-12.47
5145,-12.41
5146,-12.37
5147,-12.36
5148,-12.38
5149,-12.44
5150,-12.59
5151,-12.83
5152,-13.11
5153,-13.36
5154,-13.53
5155,-13.65
5156,-13.73
5157,-13.78
5158,-13.83
5159,-13.89
5160,-13.99
5161,-14.16
5162,-14.42
5163,-14.72
5164,-15.05
5165,-15.34
5166,-15.58
5167,-15.76
5168,-15.93
5169,-16.09
5170,-16.27
5171,-16.45
5172,-16.67
5173,-16.91
5174,-17.14
5175,-17.31
5176,-17.46
5177,-17.56
5178,-17.67
5179,-17.72
5180,-17.75
5181,-17.74
5182,-17.73
5183,-17.72
5184,-17.75
5185,-17.81
5186,-17.91
5187,-18.09
5188,-18.38
5189,-18.73
5190,-19.11
5191,-19.48
5192,-19.83
5193,-20.13
5194,-20.31
5195,-20.37
5196,-20.35
5197,-20.28
5198,-20.20
5199,-20.08
5200,-19.94
5201,-19.75
5202,-19.52
5203,-19.29
5204,-19.07
5205,-18.89
5206,-18.74
5207,-18.63
5208,-18.52
5209,-18.41
5210,-18.23
5211,-18.01
5212,-17.73
5213,-17.43
5214,-17.05
5215,-16.65
5216,-16.24
5217,-15.88
5218,-15.53
5219,-15.24
5220,-15.05
5221,-15.00
5222,-14.97
5223,-14.93
5224,-14.84
5225,-14.73
5226,-14.53
5227,-14.24
5228,-13.84
5229,-13.43
5230,-13.02
5231,-12.66
5232,-12.34
5233,-12.11
5234,-11.97
5235,-11.91
5236,-11.86
5237,-11.81
5238,-11.78
5239,-11.77
5240,-11.76
5241,-11.76
5242,-11.83
5243,-12.01
5244,-12.28
5245,-12.57
5246,-12.91
5247,-13.26
5248,-13.66
5249,-14.01
5250,-14.29
5251,-14.47
5252,-14.58
5253,-14.62
5254,-14.66
5255,-14.71
5256,-14.85
5257,-15.08
5258,-15.40
5259,-15.75
5260,-16.16
5261,-16.57
5262,-16.99
5263,-17.35
5264,-17.62
5265,-17.80
5266,-17.91
5267,-17.96
5268,-17.97
5269,-17.97
5270,-18.01
5271,-18.06
5272,-18.13
5273,-18.19
5274,-18.26
5275,-18.39
5276,-18.53
5277,-18.65
5278,-18.71
5279,-18.71
5280,-18.68
5281,-18.62
5282,-18.52
5283,-18.40
5284,-18.29
5285,-18.23
5286,-18.21
5287,-18.17
5288,-18.00
5289,-17.70
5290,-17.28
5291,-16.81
5292,-16.27
5293,-15.75
5294,-15.22
5295,-14.80
5296,-14.53
5297,-14.48
5298,-14.61
5299,-14.86
5300,-15.12
5301,-15.32
5302,-15.37
5303,-15.25
5304,-14.94
5305,-14.53
5306,-14.07
5307,-13.65
5308,-13.26
5309,-12.92
5310,-12.57
5311,-12.21
5312,-11.80
5313,-11.40
5314,-11.01
5315,-10.70
5316,-10.48
5317,-10.37
5318,-10.39
5319,-10.51
5320,-10.63
5321,-10.70
5322,-10.73
5323,-10.73
5324,-10.66
5325,-10.54
5326,-10.43
5327,-10.42
5328,-10.55
5329,-10.79
5330,-11.14
5331,-11.55
5332,-12.03
5333,-12.51
5334,-12.95
5335,-13.24
5336,-13.39
5337,-13.38
5338,-13.28
5339,-13.09
5340,-12.85
5341,-12.60
5342,-12.44
5343,-12.44
5344,-12.60
5345,-12.85
5346,-13.09
5347,-13.28
5348,-13.37
5349,-13.31
5350,-13.08
5351,-12.71
5352,-12.29
5353,-11.92
5354,-11.67
5355,-11.55
5356,-11.55
5357,-11.62
5358,-11.71
5359,-11.76
5360,-11.76
5361,-11.76
5362,-11.84
5363,-12.00
5364,-12.26
5365,-12.62
5366,-13.15
5367,-13.73
5368,-14.31
5369,-14.72
5370,-15.04
5371,-15.25
5372,-15.44
5373,-15.61
5374,-15.85
5375,-16.20
5376,-16.69
5377,-17.23
5378,-17.78
5379,-18.19
5380,-18.43
5381,-18.49
5382,-18.41
5383,-18.22
5384,-17.95
5385,-17.65
5386,-17.38
5387,-17.14
5388,-16.91
5389,-16.68
5390,-16.43
5391,-16.18
5392,-15.96
5393,-15.79
5394,-15.66
5395,-15.53
5396,-15.40
5397,-15.29
5398,-15.24
5399,-15.24
5400,-15.21
5401,-15.17
5402,-15.10
5403,-15.04
5404,-14.92
5405,-14.77
5406,-14.53
5407,-14.24
5408,-13.82
5409,-13.35
5410,-12.87
5411,-12.44
5412,-12.06
5413,-11.77
5414,-11.60
5415,-11.55
5416,-11.53
5417,-11.47
5418,-11.36
5419,-11.25
5420,-11.13
5421,-11.02
5422,-10.86
5423,-10.76
5424,-10.73
5425,-10.79
5426,-10.85
5427,-10.86
5428,-10.80
5429,-10.67
5430,-10.50
5431,-10.26
5432,-9.97
5433,-9.67
5434,-9.40
5435,-9.15
5436,-8.93
5437,-8.76
5438,-8.65
5439,-8.59
5440,-8.52
5441,-8.47
5442,-8.46
5443,-8.51
5444,-8.60
5445,-8.66
5446,-8.71
5447,-8.76
5448,-8.84
5449,-8.96
5450,-9.14
5451,-9.37
5452,-9.69
5453,-10.11
5454,-10.65
5455,-11.24
5456,-11.83
5457,-12.37
5458,-12.87
5459,-13.28
5460,-13.59
5461,-13.76
5462,-13.87
5463,-13.92
5464,-13.92
5465,-13.85
5466,-13.80
5467,-13.79
5468,-13.82
5469,-13.89
5470,-13.99
5471,-14.10
5472,-14.21
5473,-14.34
5474,-14.50
5475,-14.68
5476,-14.79
5477,-14.80
5478,-14.74
5479,-14.60
5480,-14.40
5481,-14.18
5482,-13.98
5483,-13.84
5484,-13.76
5485,-13.71
5486,-13.72
5487,-13.78
5488,-13.81
5489,-13.82
5490,-13.81
5491,-13.82
5492,-13.78
5493,-13.67
5494,-13.45
5495,-13.15
5496,-12.79
5497,-12.37
5498,-11.89
5499,-11.41
5500,-11.01
5501,-10.77
5502,-10.68
5503,-10.74
5504,-10.95
5505,-11.26
5506,-11.58
5507,-11.83
5508,-11.96
5509,-12.01
5510,-12.05
5511,-12.11
5512,-12.18
5513,-12.24
5514,-12.28
5515,-12.28
5516,-12.21
5517,-12.09
5518,-11.94
5519,-11.76
5520,-11.56
5521,-11.37
5522,-11.27
5523,-11.32
5524,-11.57
5525,-11.93
5526,-12.34
5527,-12.76
5528,-13.20
5529,-13.68
5530,-14.18
5531,-14.66
5532,-15.09
5533,-15.44
5534,-15.74
5535,-15.92
5536,-15.94
5537,-15.75
5538,-15.42
5539,-15.05
5540,-14.75
5541,-14.56
5542,-14.51
5543,-14.57
5544,-14.75
5545,-14.98
5546,-15.24
5547,-15.48
5548,-15.70
5549,-15.88
5550,-16.00
5551,-16.06
5552,-16.10
5553,-16.14
5554,-16.24
5555,-16.37
5556,-16.50
5557,-16.62
5558,-16.71
5559,-16.77
5560,-16.80
5561,-16.74
5562,-16.56
5563,-16.26
5564,-15.90
5565,-15.53
5566,-15.17
5567,-14.88
5568,-14.69
5569,-14.63
5570,-14.67
5571,-14.81
5572,-14.96
5573,-15.08
5574,-15.12
5575,-15.12
5576,-15.14
5577,-15.21
5578,-15.25
5579,-15.25
5580,-15.24
5581,-15.24
5582,-15.24
5583,-15.17
5584,-15.04
5585,-14.85
5586,-14.69
5587,-14.63
5588,-14.67
5589,-14.79
5590,-14.99
5591,-15.28
5592,-15.69
5593,-16.17
5594,-16.67
5595,-17.09
5596,-17.43
5597,-17.65
5598,-17.81
5599,-17.92
5600,-18.05
5601,-18.16
5602,-18.26
5603,-18.38
5604,-18.58
5605,-18.81
5606,-19.00
5607,-19.13
5608,-19.23
5609,-19.27
5610,-19.26
5611,-19.20
5612,-19.16
5613,-19.15
5614,-19.17
5615,-19.17
5616,-19.17
5617,-19.17
5618,-19.17
5619,-19.12
5620,-18.94
5621,-18.71
5622,-18.46
5623,-18.23
5624,-17.93
5625,-17.59
5626,-17.20
5627,-16.84
5628,-16.49
5629,-16.21
5630,-15.96
5631,-15.79
5632,-15.65
5633,-15.54
5634,-15.41
5635,-15.30
5636,-15.18
5637,-15.07
5638,-14.90
5639,-14.66
5640,-14.37
5641,-14.07
5642,-13.78
5643,-13.54
5644,-13.39
5645,-13.32
5646,-13.35
5647,-13.48
5648,-13.68
5649,-13.92
5650,-14.15
5651,-14.33
5652,-14.47
5653,-14.59
5654,-14.69
5655,-14.74
5656,-14.78
5657,-14.77
5658,-14.74
5659,-14.67
5660,-14.63
5661,-14.62
5662,-14.69
5663,-14.86
5664,-15.14
5665,-15.50
5666,-15.94
5667,-16.36
5668,-16.70
5669,-16.94
5670,-17.12
5671,-17.28
5672,-17.49
5673,-17.73
5674,-18.01
5675,-18.31
5676,-18.60
5677,-18.84
5678,-19.00
5679,-19.00
5680,-18.80
5681,-18.44
5682,-18.03
5683,-17.65
5684,-17.35
5685,-17.13
5686,-16.97
5687,-16.91
5688,-16.91
5689,-16.92
5690,-16.88
5691,-16.77
5692,-16.53
5693,-16.24
5694,-15.91
5695,-15.56
5696,-15.11
5697,-14.65
5698,-14.20
5699,-13.84
5700,-13.53
5701,-13.31
5702,-13.17
5703,-13.17
5704,-13.26
5705,-13.40
5706,-13.50
5707,-13.52
5708,-13.33
5709,-12.91
5710,-12.28
5711,-11.56
5712,-10.84
5713,-10.24
5714,-9.78
5715,-9.55
5716,-9.57
5717,-9.81
5718,-10.18
5719,-10.56
5720,-10.86
5721,-11.02
5722,-11.06
5723,-11.00
5724,-10.90
5725,-10.78
5726,-10.64
5727,-10.51
5728,-10.48
5729,-10.59
5730,-10.86
5731,-11.22
5732,-11.64
5733,-12.05
5734,-12.44
5735,-12.73
5736,-12.96
5737,-13.07
5738,-13.08
5739,-13.02
5740,-12.95
5741,-12.93
5742,-13.03
5743,-13.28
5744,-13.69
5745,-14.16
5746,-14.60
5747,-14.91
5748,-15.08
5749,-15.13
5750,-15.08
5751,-14.95
5752,-14.84
5753,-14.76
5754,-14.76
5755,-14.82
5756,-14.98
5757,-15.16
5758,-15.28
5759,-15.29
5760,-15.20
5761,-15.07
5762,-14.92
5763,-14.81
5764,-14.75
5765,-14.75
5766,-14.76
5767,-14.77
5768,-14.75
5769,-14.69
5770,-14.58
5771,-14.40
5772,-14.17
5773,-13.92
5774,-13.69
5775,-13.52
5776,-13.40
5777,-13.34
5778,-13.33
5779,-13.39
5780,-13.55
5781,-13.79
5782,-14.06
5783,-14.31
5784,-14.47
5785,-14.53
5786,-14.50
5787,-14.37
5788,-14.19
5789,-14.02
5790,-13.86
5791,-13.74
5792,-13.64
5793,-13.58
5794,-13.59
5795,-13.66
5796,-13.71
5797,-13.72
5798,-13.66
5799,-13.60
5800,-13.54
5801,-13.49
5802,-13.40
5803,-13.28
5804,-13.14
5805,-13.02
5806,-12.95
5807,-12.95
5808,-13.02
5809,-13.14
5810,-13.29
5811,-13.47
5812,-13.67
5813,-13.85
5814,-13.98
5815,-14.05
5816,-14.05
5817,-13.98
5818,-13.87
5819,-13.76
5820,-13.65
5821,-13.59
5822,-13.57
5823,-13.57
5824,-13.57
5825,-13.52
5826,-13.37
5827,-13.13
5828,-12.80
5829,-12.50
5830,-12.31
5831,-12.25
5832,-12.27
5833,-12.34
5834,-12.43
5835,-12.49
5836,-12.47
5837,-12.36
5838,-12.14
5839,-11.83
5840,-11.47
5841,-11.11
5842,-10.82
5843,-10.64
5844,-10.56
5845,-10.57
5846,-10.64
5847,-10.75
5848,-10.90
5849,-11.08
5850,-11.31
5851,-11.61
5852,-11.96
5853,-12.32
5854,-12.69
5855,-12.99
5856,-13.18
5857,-13.23
5858,-13.19
5859,-13.13
5860,-13.08
5861,-13.02
5862,-12.92
5863,-12.80
5864,-12.70
5865,-12.63
5866,-12.60
5867,-12.54
5868,-12.46
5869,-12.39
5870,-12.39
5871,-12.45
5872,-12.54
5873,-12.60
5874,-12.63
5875,-12.63
5876,-12.60
5877,-12.61
5878,-12.64
5879,-12.70
5880,-12.77
5881,-12.84
5882,-12.88
5883,-12.83
5884,-12.60
5885,-12.25
5886,-11.83
5887,-11.40
5888,-10.96
5889,-10.55
5890,-10.21
5891,-9.96
5892,-9.78
5893,-9.61
5894,-9.44
5895,-9.26
5896,-9.06
5897,-8.89
5898,-8.74
5899,-8.69
5900,-8.70
5901,-8.77
5902,-8.87
5903,-9.00
5904,-9.10
5905,-9.17
5906,-9.14
5907,-9.03
5908,-8.82
5909,-8.52
5910,-8.12
5911,-7.64
5912,-7.13
5913,-6.64
5914,-6.21
5915,-5.91
5916,-5.81
5917,-5.93
5918,-6.21
5919,-6.65
5920,-7.19
5921,-7.73
5922,-8.15
5923,-8.40
5924,-8.50
5925,-8.48
5926,-8.38
5927,-8.26
5928,-8.23
5929,-8.34
5930,-8.55
5931,-8.80
5932,-9.09
5933,-9.38
5934,-9.66
5935,-9.89
5936,-10.11
5937,-10.34
5938,-10.62
5939,-10.92
5940,-11.21
5941,-11.45
5942,-11.64
5943,-11.75
5944,-11.80
5945,-11.79
5946,-11.80
5947,-11.84
5948,-11.98
5949,-12.21
5950,-12.59
5951,-13.00
5952,-13.39
5953,-13.69
5954,-13.93
5955,-14.11
5956,-14.20
5957,-14.19
5958,-14.15
5959,-14.14
5960,-14.21
5961,-14.27
5962,-14.29
5963,-14.22
5964,-14.10
5965,-13.98
5966,-13.89
5967,-13.76
5968,-13.59
5969,-13.41
5970,-13.31
5971,-13.31
5972,-13.34
5973,-13.42
5974,-13.55
5975,-13.73
5976,-13.83
5977,-13.85
5978,-13.78
5979,-13.60
5980,-13.25
5981,-12.78
5982,-12.25
5983,-11.76
5984,-11.33
5985,-10.97
5986,-10.73
5987,-10.68
5988,-10.78
5989,-10.96
5990,-11.15
5991,-11.34
5992,-11.51
5993,-11.63
5994,-11.66
5995,-11.60
5996,-11.49
5997,-11.37
5998,-11.25
5999,-11.12
6000,-11.01
6001,-10.95
6002,-10.99
6003,-11.10
6004,-11.27
6005,-11.44
6006,-11.66
6007,-11.89
6008,-12.15
6009,-12.38
6010,-12.60
6011,-12.84
6012,-13.14
6013,-13.42
6014,-13.67
6015,-13.85
6016,-14.03
6017,-14.19
6018,-14.36
6019,-14.54
6020,-14.80
6021,-15.14
6022,-15.56
6023,-15.99
6024,-16.40
6025,-16.75
6026,-17.04
6027,-17.22
6028,-17.30
6029,-17.29
6030,-17.24
6031,-17.18
6032,-17.10
6033,-16.99
6034,-16.82
6035,-16.58
6036,-16.27
6037,-15.97
6038,-15.74
6039,-15.62
6040,-15.57
6041,-15.58
6042,-15.62
6043,-15.69
6044,-15.72
6045,-15.66
6046,-15.49
6047,-15.24
6048,-15.01
6049,-14.83
6050,-14.69
6051,-14.58
6052,-14.48
6053,-14.42
6054,-14.39
6055,-14.40
6056,-14.40
6057,-14.40
6058,-14.39
6059,-14.39
6060,-14.43
6061,-14.49
6062,-14.55
6063,-14.61
6064,-14.70
6065,-14.82
6066,-14.94
6067,-15.06
6068,-15.19
6069,-15.37
6070,-15.60
6071,-15.85
6072,-16.04
6073,-16.17
6074,-16.20
6075,-16.14
6076,-16.00
6077,-15.82
6078,-15.62
6079,-15.44
6080,-15.29
6081,-15.17
6082,-15.07
6083,-14.96
6084,-14.79
6085,-14.56
6086,-14.24
6087,-13.88
6088,-13.51
6089,-13.22
6090,-13.00
6091,-12.89
6092,-12.84
6093,-12.85
6094,-12.85
6095,-12.80
6096,-12.66
6097,-12.41
6098,-12.07
6099,-11.72
6100,-11.41
6101,-11.16
6102,-10.97
6103,-10.86
6104,-10.84
6105,-10.90
6106,-10.98
6107,-11.05
6108,-11.09
6109,-11.15
6110,-11.22
6111,-11.22
6112,-11.14
6113,-11.02
6114,-10.91
6115,-10.83
6116,-10.83
6117,-10.89
6118,-11.06
6119,-11.36
6120,-11.73
6121,-12.09
6122,-12.40
6123,-12.58
6124,-12.61
6125,-12.48
6126,-12.27
6127,-12.07
6128,-12.01
6129,-12.12
6130,-12.43
6131,-12.85
6132,-13.36
6133,-13.89
6134,-14.43
6135,-14.84
6136,-15.08
6137,-15.14
6138,-15.11
6139,-15.02
6140,-14.96
6141,-14.95
6142,-15.10
6143,-15.38
6144,-15.80
6145,-16.21
6146,-16.64
6147,-17.04
6148,-17.49
6149,-17.96
6150,-18.48
6151,-19.00
6152,-19.58
6153,-20.17
6154,-20.78
6155,-21.32
6156,-21.75
6157,-21.99
6158,-22.03
6159,-21.90
6160,-21.68
6161,-21.43
6162,-21.21
6163,-21.03
6164,-20.90
6165,-20.85
6166,-20.84
6167,-20.86
6168,-20.81
6169,-20.64
6170,-20.29
6171,-19.82
6172,-19.23
6173,-18.57
6174,-17.85
6175,-17.14
6176,-16.45
6177,-15.80
6178,-15.13
6179,-14.49
6180,-13.87
6181,-13.34
6182,-12.83
6183,-12.42
6184,-12.13
6185,-12.02
6186,-12.02
6187,-12.09
6188,-12.18
6189,-12.23
6190,-12.25
6191,-12.25
6192,-12.25
6193,-12.31
6194,-12.47
6195,-12.76
6196,-13.21
6197,-13.74
6198,-14.37
6199,-15.01
6200,-15.69
6201,-16.28
6202,-16.78
6203,-17.13
6204,-17.39
6205,-17.62
6206,-17.89
6207,-18.18
6208,-18.49
6209,-18.78
6210,-19.11
6211,-19.40
6212,-19.61
6213,-19.68
6214,-19.62
6215,-19.49
6216,-19.31
6217,-19.07
6218,-18.79
6219,-18.49
6220,-18.17
6221,-17.81
6222,-17.43
6223,-17.07
6224,-16.77
6225,-16.53
6226,-16.32
6227,-16.14
6228,-16.01
6229,-15.90
6230,-15.73
6231,-15.49
6232,-15.22
6233,-15.03
6234,-14.99
6235,-15.11
6236,-15.39
6237,-15.81
6238,-16.37
6239,-17.04
6240,-17.70
6241,-18.25
6242,-18.62
6243,-18.79
6244,-18.81
6245,-18.75
6246,-18.64
6247,-18.51
6248,-18.41
6249,-18.34
6250,-18.34
6251,-18.35
6252,-18.30
6253,-18.17
6254,-18.04
6255,-17.97
6256,-18.01
6257,-18.14
6258,-18.30
6259,-18.48
6260,-18.67
6261,-18.80
6262,-18.78
6263,-18.53
6264,-18.10
6265,-17.61
6266,-17.18
6267,-16.88
6268,-16.71
6269,-16.65
6270,-16.71
6271,-16.83
6272,-16.95
6273,-17.01
6274,-17.02
6275,-17.01
6276,-17.05
6277,-17.17
6278,-17.36
6279,-17.59
6280,-17.88
6281,-18.17
6282,-18.47
6283,-18.76
6284,-19.11
6285,-19.52
6286,-20.00
6287,-20.53
6288,-21.16
6289,-21.80
6290,-22.46
6291,-22.99
6292,-23.41
6293,-23.70
6294,-23.93
6295,-24.15
6296,-24.44
6297,-24.73
6298,-25.03
6299,-25.27
6300,-25.44
6301,-25.49
6302,-25.44
6303,-25.25
6304,-24.96
6305,-24.65
6306,-24.45
6307,-24.38
6308,-24.42
6309,-24.56
6310,-24.77
6311,-25.02
6312,-25.16
6313,-25.17
6314,-25.06
6315,-24.88
6316,-24.61
6317,-24.25
6318,-23.84
6319,-23.48
6320,-23.22
6321,-23.10
6322,-23.09
6323,-23.16
6324,-23.27
6325,-23.40
6326,-23.49
6327,-23.49
6328,-23.38
6329,-23.19
6330,-23.00
6331,-22.88
6332,-22.84
6333,-22.90
6334,-23.08
6335,-23.38
6336,-23.78
6337,-24.20
6338,-24.58
6339,-24.89
6340,-25.10
6341,-25.20
6342,-25.23
6343,-25.22
6344,-25.28
6345,-25.38
6346,-25.54
6347,-25.72
6348,-25.98
6349,-26.33
6350,-26.77
6351,-27.25
6352,-27.77
6353,-28.30
6354,-28.85
6355,-29.40
6356,-29.88
6357,-30.24
6358,-30.46
6359,-30.51
6360,-30.43
6361,-30.25
6362,-29.99
6363,-29.69
6364,-29.37
6365,-29.08
6366,-28.81
6367,-28.57
6368,-28.32
6369,-28.04
6370,-27.66
6371,-27.24
6372,-26.80
6373,-26.45
6374,-26.21
6375,-26.11
6376,-26.03
6377,-25.99
6378,-25.92
6379,-25.82
6380,-25.56
6381,-25.10
6382,-24.38
6383,-23.54
6384,-22.66
6385,-21.89
6386,-21.23
6387,-20.77
6388,-20.47
6389,-20.31
6390,-20.14
6391,-19.93
6392,-19.57
6393,-19.10
6394,-18.48
6395,-17.83
6396,-17.20
6397,-16.72
6398,-16.40
6399,-16.31
6400,-16.35
6401,-16.49
6402,-16.58
6403,-16.60
6404,-16.46
6405,-16.17
6406,-15.68
6407,-15.09
6408,-14.45
6409,-13.92
6410,-13.50
6411,-13.28
6412,-13.18
6413,-13.20
6414,-13.21
6415,-13.17
6416,-13.01
6417,-12.77
6418,-12.44
6419,-12.09
6420,-11.74
6421,-11.45
6422,-11.17
6423,-10.94
6424,-10.73
6425,-10.56
6426,-10.36
6427,-10.14
6428,-9.86
6429,-9.55
6430,-9.25
6431,-9.02
6432,-8.88
6433,-8.89
6434,-9.00
6435,-9.19
6436,-9.38
6437,-9.58
6438,-9.69
6439,-9.64
6440,-9.35
6441,-8.81
6442,-8.08
6443,-7.29
6444,-6.53
6445,-5.88
6446,-5.35
6447,-4.94
6448,-4.60
6449,-4.38
6450,-4.21
6451,-4.10
6452,-3.95
6453,-3.79
6454,-3.59
6455,-3.42
6456,-3.22
6457,-3.06
6458,-2.94
6459,-2.87
6460,-2.82
6461,-2.77
6462,-2.72
6463,-2.66
6464,-2.54
6465,-2.36
6466,-2.17
6467,-2.04
6468,-2.01
6469,-2.07
6470,-2.23
6471,-2.53
6472,-2.99
6473,-3.53
6474,-4.05
6475,-4.48
6476,-4.81
6477,-5.03
6478,-5.16
6479,-5.16
6480,-5.07
6481,-4.93
6482,-4.84
6483,-4.83
6484,-4.97
6485,-5.20
6486,-5.51
6487,-5.87
6488,-6.31
6489,-6.78
6490,-7.22
6491,-7.51
6492,-7.71
6493,-7.81
6494,-7.88
6495,-7.93
6496,-8.05
6497,-8.22
6498,-8.46
6499,-8.75
6500,-9.14
6501,-9.61
6502,-10.15
6503,-10.63
6504,-11.00
6505,-11.25
6506,-11.37
6507,-11.37
6508,-11.23
6509,-10.98
6510,-10.71
6511,-10.52
6512,-10.47
6513,-10.54
6514,-10.66
6515,-10.79
6516,-10.87
6517,-10.88
6518,-10.74
6519,-10.45
6520,-10.00
6521,-9.45
6522,-8.87
6523,-8.33
6524,-7.90
6525,-7.59
6526,-7.40
6527,-7.36
6528,-7.45
6529,-7.63
6530,-7.80
6531,-7.94
6532,-8.03
6533,-8.08
6534,-8.06
6535,-8.01
6536,-7.98
6537,-8.03
6538,-8.16
6539,-8.35
6540,-8.57
6541,-8.74
6542,-8.82
6543,-8.77
6544,-8.60
6545,-8.35
6546,-8.06
6547,-7.81
6548,-7.73
6549,-7.84
6550,-8.13
6551,-8.49
6552,-8.88
6553,-9.24
6554,-9.54
6555,-9.72
6556,-9.77
6557,-9.68
6558,-9.60
6559,-9.59
6560,-9.73
6561,-9.96
6562,-10.28
6563,-10.64
6564,-11.05
6565,-11.46
6566,-11.83
6567,-12.13
6568,-12.40
6569,-12.63
6570,-12.83
6571,-12.95
6572,-13.00
6573,-12.99
6574,-12.95
6575,-12.83
6576,-12.63
6577,-12.37
6578,-12.15
6579,-12.02
6580,-12.06
6581,-12.24
6582,-12.53
6583,-12.89
6584,-13.32
6585,-13.79
6586,-14.29
6587,-14.76
6588,-15.23
6589,-15.64
6590,-16.01
6591,-16.30
6592,-16.57
6593,-16.85
6594,-17.22
6595,-17.63
6596,-18.10
6597,-18.57
6598,-19.04
6599,-19.45
6600,-19.82
6601,-20.04
6602,-20.15
6603,-20.13
6604,-20.11
6605,-20.10
6606,-20.14
6607,-20.25
6608,-20.50
6609,-20.85
6610,-21.30
6611,-21.77
6612,-22.28
6613,-22.75
6614,-23.20
6615,-23.55
6616,-23.80
6617,-23.98
6618,-24.13
6619,-24.25
6620,-24.29
6621,-24.23
6622,-24.12
6623,-23.99
6624,-23.87
6625,-23.75
6626,-23.62
6627,-23.51
6628,-23.42
6629,-23.36
6630,-23.28
6631,-23.24
6632,-23.23
6633,-23.23
6634,-23.15
6635,-22.98
6636,-22.76
6637,-22.52
6638,-22.21
6639,-21.80
6640,-21.29
6641,-20.82
6642,-20.39
6643,-20.04
6644,-19.73
6645,-19.50
6646,-19.34
6647,-19.29
6648,-19.29
6649,-19.30
6650,-19.26
6651,-19.15
6652,-18.92
6653,-18.64
6654,-18.26
6655,-17.85
6656,-17.37
6657,-16.90
6658,-16.46
6659,-16.11
6660,-15.79
6661,-15.50
6662,-15.24
6663,-15.06
6664,-14.95
6665,-14.90
6666,-14.87
6667,-14.88
6668,-14.88
6669,-14.83
6670,-14.65
6671,-14.36
6672,-13.97
6673,-13.55
6674,-13.10
6675,-12.68
6676,-12.36
6677,-12.18
6678,-12.12
6679,-12.18
6680,-12.37
6681,-12.60
6682,-12.83
6683,-13.02
6684,-13.21
6685,-13.37
6686,-13.49
6687,-13.54
6688,-13.63
6689,-13.81
6690,-14.04
6691,-14.22
6692,-14.34
6693,-14.39
6694,-14.40
6695,-14.40
6696,-14.40
6697,-14.39
6698,-14.42
6699,-14.53
6700,-14.79
6701,-15.14
6702,-15.56
6703,-15.91
6704,-16.21
6705,-16.44
6706,-16.65
6707,-16.89
6708,-17.18
6709,-17.54
6710,-17.96
6711,-18.37
6712,-18.75
6713,-18.99
6714,-19.09
6715,-18.96
6716,-18.62
6717,-18.13
6718,-17.63
6719,-17.27
6720,-17.06
6721,-17.01
6722,-17.07
6723,-17.20
6724,-17.31
6725,-17.33
6726,-17.15
6727,-16.80
6728,-16.27
6729,-15.67
6730,-15.04
6731,-14.50
6732,-14.13
6733,-13.95
6734,-13.92
6735,-14.00
6736,-14.12
6737,-14.24
6738,-14.28
6739,-14.23
6740,-14.09
6741,-13.92
6742,-13.67
6743,-13.37
6744,-13.05
6745,-12.81
6746,-12.72
6747,-12.78
6748,-12.92
6749,-13.11
6750,-13.33
6751,-13.51
6752,-13.57
6753,-13.45
6754,-13.20
6755,-12.89
6756,-12.60
6757,-12.41
6758,-12.40
6759,-12.58
6760,-12.92
6761,-13.35
6762,-13.79
6763,-14.14
6764,-14.39
6765,-14.51
6766,-14.54
6767,-14.53
6768,-14.53
6769,-14.59
6770,-14.75
6771,-14.92
6772,-15.04
6773,-15.05
6774,-14.95
6775,-14.76
6776,-14.48
6777,-14.18
6778,-13.98
6779,-13.97
6780,-14.14
6781,-14.46
6782,-14.87
6783,-15.29
6784,-15.63
6785,-15.81
6786,-15.85
6787,-15.79
6788,-15.63
6789,-15.38
6790,-15.11
6791,-14.86
6792,-14.69
6793,-14.56
6794,-14.49
6795,-14.43
6796,-14.39
6797,-14.33
6798,-14.21
6799,-14.05
6800,-13.82
6801,-13.57
6802,-13.33
6803,-13.15
6804,-13.08
6805,-13.15
6806,-13.28
6807,-13.41
6808,-13.49
6809,-13.49
6810,-13.40
6811,-13.21
6812,-12.97
6813,-12.72
6814,-12.53
6815,-12.47
6816,-12.58
6817,-12.82
6818,-13.13
6819,-13.50
6820,-13.92
6821,-14.34
6822,-14.67
6823,-14.85
6824,-14.91
6825,-14.90
6826,-14.87
6827,-14.81
6828,-14.72
6829,-14.59
6830,-14.47
6831,-14.42
6832,-14.41
6833,-14.42
6834,-14.37
6835,-14.26
6836,-14.08
6837,-13.84
6838,-13.53
6839,-13.17
6840,-12.79
6841,-12.50
6842,-12.30
6843,-12.18
6844,-12.10
6845,-12.05
6846,-12.00
6847,-11.89
6848,-11.62
6849,-11.20
6850,-10.71
6851,-10.29
6852,-9.96
6853,-9.74
6854,-9.56
6855,-9.44
6856,-9.38
6857,-9.38
6858,-9.43
6859,-9.50
6860,-9.54
6861,-9.60
6862,-9.70
6863,-9.89
6864,-10.11
6865,-10.30
6866,-10.40
6867,-10.40
6868,-10.30
6869,-10.12
6870,-9.86
6871,-9.56
6872,-9.25
6873,-9.02
6874,-8.87
6875,-8.80
6876,-8.82
6877,-8.94
6878,-9.18
6879,-9.48
6880,-9.78
6881,-10.02
6882,-10.22
6883,-10.38
6884,-10.55
6885,-10.67
6886,-10.74
6887,-10.79
6888,-10.90
6889,-11.07
6890,-11.30
6891,-11.54
6892,-11.80
6893,-12.09
6894,-12.43
6895,-12.79
6896,-13.18
6897,-13.53
6898,-13.83
6899,-14.07
6900,-14.26
6901,-14.37
6902,-14.40
6903,-14.34
6904,-14.24
6905,-14.18
6906,-14.18
6907,-14.23
6908,-14.36
6909,-14.60
6910,-14.96
6911,-15.39
6912,-15.77
6913,-16.01
6914,-16.11
6915,-16.11
6916,-16.04
6917,-15.91
6918,-15.75
6919,-15.63
6920,-15.63
6921,-15.75
6922,-15.91
6923,-16.04
6924,-16.10
6925,-16.10
6926,-16.04
6927,-15.91
6928,-15.75
6929,-15.57
6930,-15.41
6931,-15.29
6932,-15.19
6933,-15.14
6934,-15.13
6935,-15.13
6936,-15.08
6937,-14.97
6938,-14.81
6939,-14.63
6940,-14.39
6941,-14.10
6942,-13.76
6943,-13.47
6944,-13.22
6945,-13.04
6946,-12.91
6947,-12.85
6948,-12.89
6949,-13.02
6950,-13.17
6951,-13.29
6952,-13.37
6953,-13.43
6954,-13.50
6955,-13.55
6956,-13.57
6957,-13.57
6958,-13.60
6959,-13.65
6960,-13.72
6961,-13.77
6962,-13.85
6963,-13.96
6964,-14.13
6965,-14.31
6966,-14.51
6967,-14.74
6968,-15.03
6969,-15.38
6970,-15.84
6971,-16.38
6972,-16.96
6973,-17.51
6974,-17.94
6975,-18.19
6976,-18.19
6977,-17.94
6978,-17.52
6979,-17.02
6980,-16.56
6981,-16.20
6982,-16.00
6983,-15.99
6984,-16.19
6985,-16.50
6986,-16.82
6987,-17.07
6988,-17.18
6989,-17.23
6990,-17.30
6991,-17.43
6992,-17.57
6993,-17.69
6994,-17.78
6995,-17.84
6996,-17.88
6997,-17.88
6998,-17.83
6999,-17.70
7000,-17.54
7001,-17.42
7002,-17.38
7003,-17.38
7004,-17.33
7005,-17.23
7006,-17.07
7007,-16.89
7008,-16.63
7009,-16.34
7010,-16.07
7011,-15.82
7012,-15.56
7013,-15.27
7014,-14.98
7015,-14.74
7016,-14.56
7017,-14.43
7018,-14.39
7019,-14.46
7020,-14.62
7021,-14.80
7022,-14.93
7023,-14.99
7024,-15.01
7025,-15.01
7026,-14.95
7027,-14.83
7028,-14.69
7029,-14.56
7030,-14.49
7031,-14.42
7032,-14.37
7033,-14.37
7034,-14.46
7035,-14.63
7036,-14.88
7037,-15.19
7038,-15.54
7039,-15.90
7040,-16.23
7041,-16.46
7042,-16.61
7043,-16.66
7044,-16.68
7045,-16.67
7046,-16.67
7047,-16.67
7048,-16.68
7049,-16.67
7050,-16.67
7051,-16.67
7052,-16.68
7053,-16.68
7054,-16.65
7055,-16.59
7056,-16.50
7057,-16.39
7058,-16.22
7059,-15.98
7060,-15.68
7061,-15.38
7062,-15.12
7063,-14.94
7064,-14.84
7065,-14.84
7066,-14.94
7067,-15.13
7068,-15.36
7069,-15.53
7070,-15.62
7071,-15.68
7072,-15.79
7073,-15.96
7074,-16.15
7075,-16.35
7076,-16.55
7077,-16.72
7078,-16.79
7079,-16.73
7080,-16.62
7081,-16.48
7082,-16.37
7083,-16.30
7084,-16.37
7085,-16.60
7086,-16.97
7087,-17.40
7088,-17.86
7089,-18.26
7090,-18.59
7091,-18.83
7092,-19.05
7093,-19.28
7094,-19.52
7095,-19.75
7096,-20.04
7097,-20.33
7098,-20.58
7099,-20.70
7100,-20.71
7101,-20.64
7102,-20.55
7103,-20.48
7104,-20.49
7105,-20.61
7106,-20.84
7107,-21.14
7108,-21.46
7109,-21.76
7110,-22.06
7111,-22.35
7112,-22.63
7113,-22.87
7114,-23.10
7115,-23.34
7116,-23.57
7117,-23.75
7118,-23.86
7119,-23.86
7120,-23.76
7121,-23.57
7122,-23.34
7123,-23.09
7124,-22.88
7125,-22.71
7126,-22.54
7127,-22.36
7128,-22.16
7129,-21.93
7130,-21.64
7131,-21.29
7132,-20.82
7133,-20.35
7134,-19.93
7135,-19.62
7136,-19.42
7137,-19.31
7138,-19.29
7139,-19.36
7140,-19.42
7141,-19.44
7142,-19.37
7143,-19.24
7144,-19.07
7145,-18.96
7146,-18.94
7147,-19.00
7148,-19.09
7149,-19.15
7150,-19.17
7151,-19.11
7152,-18.94
7153,-18.64
7154,-18.26
7155,-17.88
7156,-17.60
7157,-17.48
7158,-17.58
7159,-17.87
7160,-18.33
7161,-18.87
7162,-19.47
7163,-20.07
7164,-20.61
7165,-21.03
7166,-21.34
7167,-21.56
7168,-21.77
7169,-22.00
7170,-22.29
7171,-22.58
7172,-22.89
7173,-23.18
7174,-23.49
7175,-23.77
7176,-24.06
7177,-24.30
7178,-24.52
7179,-24.68
7180,-24.83
7181,-24.93
7182,-25.09
7183,-25.25
7184,-25.46
7185,-25.69
7186,-26.02
7187,-26.43
7188,-26.90
7189,-27.44
7190,-27.75
7191,-27.82
7192,-27.80
7193,-29.27
7194,-29.46
7195,-26.11
7196,-23.86
7197,-30.96
7198,-39.91
7199,-28.11
7200,-2.13
