1,-135.00
2,-217.24
3,-250.00
4,-250.00
5,-247.17
6,-247.47
7,-250.00
8,-250.00
9,-241.07
10,-207.37
11,-152.15
12,-91.43
13,-39.72
14,-5.94
15,7.93
16,0.37
17,-28.77
18,-73.75
19,-127.75
20,-179.60
21,-221.12
22,-244.54
23,-250.00
24,-247.70
25,-234.03
26,-209.14
27,-173.58
28,-130.52
29,-84.94
30,-39.83
31,2.19
32,38.23
33,64.17
34,79.07
35,82.29
36,77.47
37,66.80
38,55.59
39,45.59
40,39.71
41,36.90
42,36.99
43,37.58
44,37.65
45,36.12
46,33.07
47,29.30
48,25.41
49,22.42
50,20.37
51,19.54
52,19.32
53,19.46
54,19.47
55,19.26
56,18.69
57,17.93
58,16.97
59,16.03
60,15.13
61,14.43
62,13.91
63,13.67
64,13.75
65,14.18
66,14.89
67,15.75
68,16.56
69,17.25
70,17.68
71,17.81
72,17.54
73,16.94
74,16.13
75,15.28
76,14.48
77,13.77
78,13.14
79,12.60
80,12.14
81,11.72
82,11.32
83,10.96
84,10.67
85,10.48
86,10.44
87,10.56
88,10.87
89,11.35
90,11.94
91,12.54
92,13.11
93,13.59
94,13.97
95,14.27
96,14.50
97,14.67
98,14.81
99,14.92
100,15.07
101,15.18
102,15.25
103,15.24
104,15.23
105,15.21
106,15.23
107,15.23
108,15.23
109,15.22
110,15.24
111,15.30
112,15.42
113,15.60
114,15.79
115,15.99
116,16.15
117,16.28
118,16.28
119,16.19
120,15.95
121,15.59
122,15.06
123,14.43
124,13.67
125,12.85
126,11.85
127,10.80
128,9.70
129,8.71
130,7.69
131,6.72
132,5.65
133,4.61
134,3.43
135,2.22
136,0.82
137,-0.65
138,-2.24
139,-3.77
140,-5.26
141,-6.55
142,-7.74
143,-8.73
144,-9.58
145,-10.15
146,-10.54
147,-10.62
148,-10.54
149,-10.27
150,-9.99
151,-9.72
152,-9.61
153,-9.65
154,-9.95
155,-10.48
156,-11.23
157,-12.09
158,-12.92
159,-13.59
160,-13.98
161,-14.12
162,-13.95
163,-13.48
164,-12.66
165,-11.59
166,-10.32
167,-9.00
168,-7.68
169,-6.43
170,-5.26
171,-4.25
172,-3.40
173,-2.74
174,-2.26
175,-1.98
176,-1.83
177,-1.84
178,-1.96
179,-2.27
180,-2.77
181,-3.43
182,-4.16
183,-4.81
184,-5.38
185,-5.79
186,-6.07
187,-6.23
188,-6.39
189,-6.60
190,-7.00
191,-7.51
192,-8.19
193,-8.90
194,-9.65
195,-10.28
196,-10.87
197,-11.44
198,-12.21
199,-13.21
200,-14.44
201,-15.76
202,-17.11
203,-18.25
204,-19.02
205,-19.18
206,-18.80
207,-17.97
208,-17.04
209,-16.15
210,-15.59
211,-15.45
212,-15.88
213,-16.78
214,-17.97
215,-19.20
216,-20.29
217,-21.11
218,-21.65
219,-21.94
220,-22.10
221,-22.20
222,-22.32
223,-22.42
224,-22.62
225,-22.90
226,-23.31
227,-23.79
228,-24.32
229,-24.79
230,-25.18
231,-25.47
232,-25.75
233,-25.96
234,-26.13
235,-26.25
236,-26.41
237,-26.64
238,-26.91
239,-27.09
240,-27.19
241,-27.16
242,-27.09
243,-27.02
244,-27.06
245,-27.23
246,-27.55
247,-28.03
248,-28.70
249,-29.49
250,-30.26
251,-30.86
252,-31.26
253,-31.48
254,-31.63
255,-31.75
256,-31.83
257,-31.84
258,-31.73
259,-31.49
260,-31.11
261,-30.59
262,-29.86
263,-28.97
264,-27.91
265,-26.84
266,-25.83
267,-24.99
268,-24.31
269,-23.87
270,-23.56
271,-23.41
272,-23.22
273,-23.03
274,-22.67
275,-22.23
276,-21.52
277,-20.66
278,-19.57
279,-18.46
280,-17.27
281,-16.17
282,-15.04
283,-14.01
284,-12.92
285,-11.81
286,-10.53
287,-9.25
288,-7.92
289,-6.68
290,-5.42
291,-4.26
292,-3.14
293,-2.21
294,-1.34
295,-0.60
296,0.11
297,0.63
298,0.98
299,1.08
300,1.01
301,0.80
302,0.63
303,0.55
304,0.66
305,0.95
306,1.45
307,2.04
308,2.68
309,3.21
310,3.64
311,3.92
312,4.12
313,4.30
314,4.53
315,4.82
316,5.15
317,5.46
318,5.71
319,5.82
320,5.76
321,5.52
322,5.20
323,4.88
324,4.64
325,4.52
326,4.55
327,4.75
328,4.99
329,5.19
330,5.22
331,5.04
332,4.65
333,4.10
334,3.47
335,2.88
336,2.38
337,2.02
338,1.76
339,1.60
340,1.50
341,1.44
342,1.38
343,1.40
344,1.49
345,1.69
346,1.85
347,1.93
348,1.82
349,1.54
350,0.99
351,0.18
352,-0.94
353,-2.20
354,-3.49
355,-4.57
356,-5.36
357,-5.84
358,-6.08
359,-6.12
360,-6.00
361,-5.82
362,-5.69
363,-5.65
364,-5.55
365,-5.33
366,-4.92
367,-4.33
368,-3.48
369,-2.43
370,-1.15
371,0.20
372,1.67
373,3.07
374,4.48
375,5.76
376,7.08
377,8.35
378,9.73
379,11.14
380,12.71
381,14.31
382,15.92
383,17.35
384,18.55
385,19.38
386,19.82
387,19.81
388,19.40
389,18.60
390,17.53
391,16.33
392,15.14
393,14.11
394,13.31
395,12.79
396,12.50
397,12.41
398,12.31
399,12.23
400,12.02
401,11.76
402,11.25
403,10.57
404,9.62
405,8.62
406,7.54
407,6.50
408,5.37
409,4.20
410,2.90
411,1.66
412,0.48
413,-0.51
414,-1.40
415,-2.11
416,-2.63
417,-2.93
418,-3.06
419,-3.11
420,-3.13
421,-3.14
422,-3.07
423,-2.85
424,-2.35
425,-1.59
426,-0.53
427,0.79
428,2.32
429,3.88
430,5.32
431,6.45
432,7.28
433,7.80
434,8.13
435,8.29
436,8.38
437,8.43
438,8.48
439,8.42
440,8.17
441,7.64
442,6.82
443,5.79
444,4.64
445,3.56
446,2.68
447,2.15
448,1.92
449,1.95
450,2.06
451,2.14
452,2.03
453,1.67
454,1.09
455,0.48
456,0.02
457,-0.17
458,-0.03
459,0.39
460,1.05
461,1.83
462,2.62
463,3.30
464,3.78
465,4.06
466,4.22
467,4.33
468,4.49
469,4.72
470,5.00
471,5.24
472,5.45
473,5.55
474,5.58
475,5.50
476,5.43
477,5.41
478,5.52
479,5.76
480,6.14
481,6.61
482,7.15
483,7.62
484,8.02
485,8.30
486,8.56
487,8.84
488,9.25
489,9.78
490,10.46
491,11.17
492,11.88
493,12.47
494,12.95
495,13.31
496,13.57
497,13.73
498,13.85
499,13.97
500,14.15
501,14.38
502,14.63
503,14.88
504,15.12
505,15.30
506,15.34
507,15.24
508,14.97
509,14.56
510,13.95
511,13.18
512,12.28
513,11.32
514,10.30
515,9.37
516,8.54
517,7.89
518,7.31
519,6.81
520,6.28
521,5.75
522,5.11
523,4.42
524,3.65
525,2.94
526,2.25
527,1.66
528,1.20
529,0.90
530,0.74
531,0.68
532,0.71
533,0.82
534,1.04
535,1.33
536,1.71
537,2.12
538,2.59
539,2.99
540,3.35
541,3.68
542,4.20
543,4.94
544,6.04
545,7.48
546,9.27
547,11.18
548,13.02
549,14.47
550,15.41
551,15.69
552,15.33
553,14.45
554,13.43
555,12.55
556,12.05
557,11.93
558,12.18
559,12.68
560,13.26
561,13.69
562,13.79
563,13.56
564,13.05
565,12.46
566,11.80
567,11.15
568,10.51
569,9.99
570,9.56
571,9.22
572,8.83
573,8.45
574,7.97
575,7.52
576,6.96
577,6.35
578,5.51
579,4.52
580,3.27
581,1.92
582,0.44
583,-1.03
584,-2.58
585,-4.04
586,-5.45
587,-6.62
588,-7.65
589,-8.46
590,-9.13
591,-9.52
592,-9.72
593,-9.68
594,-9.62
595,-9.51
596,-9.55
597,-9.70
598,-10.12
599,-10.76
600,-11.64
601,-12.65
602,-13.79
603,-14.85
604,-15.79
605,-16.49
606,-17.07
607,-17.59
608,-18.16
609,-18.73
610,-19.37
611,-20.02
612,-20.72
613,-21.29
614,-21.72
615,-21.89
616,-21.92
617,-21.83
618,-21.73
619,-21.71
620,-21.97
621,-22.55
622,-23.45
623,-24.48
624,-25.51
625,-26.34
626,-26.92
627,-27.15
628,-27.08
629,-26.82
630,-26.54
631,-26.35
632,-26.32
633,-26.45
634,-26.69
635,-26.94
636,-27.09
637,-27.05
638,-26.73
639,-26.19
640,-25.47
641,-24.70
642,-23.89
643,-23.19
644,-22.58
645,-22.13
646,-21.68
647,-21.23
648,-20.64
649,-19.94
650,-19.08
651,-18.19
652,-17.27
653,-16.46
654,-15.71
655,-15.11
656,-14.66
657,-14.43
658,-14.41
659,-14.55
660,-14.70
661,-14.83
662,-14.94
663,-15.06
664,-15.14
665,-15.14
666,-15.07
667,-14.99
668,-15.02
669,-15.14
670,-15.33
671,-15.50
672,-15.67
673,-15.84
674,-16.05
675,-16.27
676,-16.59
677,-17.04
678,-17.78
679,-18.79
680,-20.06
681,-21.43
682,-22.87
683,-24.18
684,-25.28
685,-26.05
686,-26.50
687,-26.60
688,-26.47
689,-26.20
690,-26.00
691,-25.93
692,-26.02
693,-26.14
694,-26.25
695,-26.29
696,-26.31
697,-26.31
698,-26.29
699,-26.23
700,-26.14
701,-26.08
702,-26.09
703,-26.15
704,-26.20
705,-26.20
706,-26.21
707,-26.25
708,-26.35
709,-26.48
710,-26.64
711,-26.82
712,-26.99
713,-27.10
714,-27.18
715,-27.24
716,-27.28
717,-27.28
718,-27.23
719,-27.18
720,-27.14
721,-27.07
722,-26.94
723,-26.76
724,-26.60
725,-26.54
726,-26.57
727,-26.70
728,-26.89
729,-27.07
730,-27.18
731,-27.11
732,-26.89
733,-26.51
734,-26.08
735,-25.72
736,-25.54
737,-25.66
738,-26.07
739,-26.76
740,-27.57
741,-28.37
742,-28.95
743,-29.21
744,-29.07
745,-28.66
746,-28.01
747,-27.23
748,-26.35
749,-25.53
750,-24.78
751,-24.14
752,-23.45
753,-22.71
754,-21.82
755,-20.88
756,-19.79
757,-18.68
758,-17.54
759,-16.54
760,-15.63
761,-14.96
762,-14.38
763,-13.94
764,-13.40
765,-12.79
766,-11.94
767,-10.95
768,-9.70
769,-8.41
770,-7.12
771,-6.05
772,-5.17
773,-4.54
774,-4.08
775,-3.80
776,-3.55
777,-3.35
778,-3.09
779,-2.86
780,-2.59
781,-2.37
782,-2.17
783,-2.01
784,-1.74
785,-1.34
786,-0.78
787,-0.11
788,0.60
789,1.27
790,1.76
791,1.95
792,1.75
793,1.22
794,0.40
795,-0.56
796,-1.59
797,-2.54
798,-3.35
799,-4.00
800,-4.58
801,-5.10
802,-5.58
803,-5.94
804,-6.20
805,-6.36
806,-6.49
807,-6.54
808,-6.57
809,-6.60
810,-6.78
811,-7.13
812,-7.68
813,-8.34
814,-9.04
815,-9.64
816,-10.06
817,-10.24
818,-10.19
819,-9.93
820,-9.57
821,-9.19
822,-8.93
823,-8.86
824,-9.06
825,-9.48
826,-10.07
827,-10.67
828,-11.20
829,-11.62
830,-11.94
831,-12.17
832,-12.33
833,-12.44
834,-12.60
835,-12.83
836,-13.15
837,-13.53
838,-13.87
839,-14.12
840,-14.18
841,-14.02
842,-13.57
843,-12.92
844,-12.08
845,-11.18
846,-10.29
847,-9.54
848,-8.83
849,-8.21
850,-7.51
851,-6.75
852,-5.84
853,-4.84
854,-3.72
855,-2.60
856,-1.46
857,-0.47
858,0.43
859,1.17
860,1.91
861,2.66
862,3.54
863,4.43
864,5.30
865,6.01
866,6.55
867,6.84
868,6.93
869,6.79
870,6.49
871,6.13
872,5.82
873,5.64
874,5.55
875,5.52
876,5.42
877,5.25
878,4.94
879,4.55
880,4.00
881,3.36
882,2.56
883,1.75
884,0.87
885,0.02
886,-1.00
887,-2.10
888,-3.38
889,-4.68
890,-6.06
891,-7.40
892,-8.79
893,-10.09
894,-11.35
895,-12.41
896,-13.27
897,-13.86
898,-14.26
899,-14.48
900,-14.57
901,-14.57
902,-14.52
903,-14.33
904,-13.95
905,-13.30
906,-12.38
907,-11.23
908,-9.91
909,-8.58
910,-7.45
911,-6.72
912,-6.45
913,-6.58
914,-7.01
915,-7.56
916,-8.09
917,-8.45
918,-8.63
919,-8.72
920,-8.93
921,-9.45
922,-10.42
923,-11.80
924,-13.48
925,-15.18
926,-16.67
927,-17.64
928,-17.94
929,-17.56
930,-16.69
931,-15.59
932,-14.47
933,-13.50
934,-12.79
935,-12.38
936,-12.18
937,-12.04
938,-11.71
939,-11.13
940,-10.25
941,-9.22
942,-8.16
943,-7.26
944,-6.60
945,-6.26
946,-6.17
947,-6.32
948,-6.55
949,-6.74
950,-6.76
951,-6.59
952,-6.24
953,-5.82
954,-5.37
955,-5.02
956,-4.79
957,-4.75
958,-4.81
959,-4.88
960,-4.84
961,-4.62
962,-4.14
963,-3.42
964,-2.48
965,-1.45
966,-0.47
967,0.31
968,0.79
969,0.92
970,0.67
971,0.07
972,-0.82
973,-1.85
974,-2.87
975,-3.70
976,-4.33
977,-4.73
978,-5.00
979,-5.16
980,-5.32
981,-5.53
982,-5.95
983,-6.52
984,-7.29
985,-8.06
986,-8.82
987,-9.38
988,-9.83
989,-10.10
990,-10.36
991,-10.62
992,-11.05
993,-11.68
994,-12.67
995,-13.91
996,-15.39
997,-16.86
998,-18.35
999,-19.69
1000,-21.00
1001,-22.15
1002,-23.30
1003,-24.40
1004,-25.64
1005,-26.86
1006,-28.13
1007,-29.24
1008,-30.29
1009,-31.14
1010,-31.94
1011,-32.62
1012,-33.39
1013,-34.19
1014,-35.14
1015,-36.15
1016,-37.23
1017,-38.25
1018,-39.10
1019,-39.63
1020,-39.84
1021,-39.77
1022,-39.51
1023,-39.08
1024,-38.52
1025,-37.86
1026,-37.16
1027,-36.49
1028,-35.90
1029,-35.41
1030,-35.13
1031,-35.13
1032,-35.41
1033,-35.90
1034,-36.45
1035,-36.95
1036,-37.29
1037,-37.41
1038,-37.28
1039,-37.03
1040,-36.83
1041,-36.83
1042,-37.05
1043,-37.49
1044,-38.02
1045,-38.59
1046,-39.01
1047,-39.15
1048,-38.86
1049,-38.14
1050,-37.06
1051,-35.79
1052,-34.45
1053,-33.21
1054,-32.07
1055,-31.13
1056,-30.34
1057,-29.83
1058,-29.52
1059,-29.42
1060,-29.36
1061,-29.34
1062,-29.25
1063,-29.09
1064,-28.69
1065,-28.12
1066,-27.38
1067,-26.61
1068,-25.74
1069,-24.93
1070,-24.19
1071,-23.61
1072,-23.04
1073,-22.48
1074,-21.80
1075,-21.04
1076,-20.10
1077,-19.04
1078,-17.83
1079,-16.65
1080,-15.52
1081,-14.57
1082,-13.77
1083,-13.18
1084,-12.78
1085,-12.62
1086,-12.63
1087,-12.75
1088,-12.92
1089,-13.17
1090,-13.53
1091,-14.01
1092,-14.53
1093,-15.01
1094,-15.47
1095,-15.87
1096,-16.23
1097,-16.53
1098,-16.84
1099,-17.17
1100,-17.59
1101,-18.14
1102,-18.85
1103,-19.68
1104,-20.54
1105,-21.26
1106,-21.80
1107,-22.10
1108,-22.12
1109,-21.81
1110,-21.23
1111,-20.50
1112,-19.78
1113,-19.17
1114,-18.73
1115,-18.51
1116,-18.46
1117,-18.53
1118,-18.59
1119,-18.62
1120,-18.52
1121,-18.37
1122,-18.04
1123,-17.65
1124,-17.14
1125,-16.63
1126,-15.98
1127,-15.25
1128,-14.26
1129,-13.08
1130,-11.63
1131,-10.04
1132,-8.31
1133,-6.58
1134,-4.82
1135,-3.23
1136,-1.82
1137,-0.72
1138,0.25
1139,1.05
1140,1.79
1141,2.37
1142,2.86
1143,3.20
1144,3.43
1145,3.49
1146,3.38
1147,3.07
1148,2.59
1149,2.00
1150,1.32
1151,0.60
1152,-0.16
1153,-0.87
1154,-1.46
1155,-1.88
1156,-2.17
1157,-2.33
1158,-2.40
1159,-2.40
1160,-2.43
1161,-2.53
1162,-2.72
1163,-2.97
1164,-3.26
1165,-3.49
1166,-3.61
1167,-3.55
1168,-3.36
1169,-3.11
1170,-2.85
1171,-2.61
1172,-2.41
1173,-2.30
1174,-2.24
1175,-2.13
1176,-1.87
1177,-1.45
1178,-0.93
1179,-0.38
1180,0.16
1181,0.63
1182,0.97
1183,1.08
1184,1.00
1185,0.76
1186,0.40
1187,-0.08
1188,-0.66
1189,-1.27
1190,-1.76
1191,-2.07
1192,-2.19
1193,-2.12
1194,-1.85
1195,-1.37
1196,-0.76
1197,-0.14
1198,0.33
1199,0.59
1200,0.52
1201,0.18
1202,-0.43
1203,-1.21
1204,-2.14
1205,-3.15
1206,-4.21
1207,-5.22
1208,-6.17
1209,-7.00
1210,-7.74
1211,-8.32
1212,-8.80
1213,-9.14
1214,-9.45
1215,-9.67
1216,-9.83
1217,-9.87
1218,-9.91
1219,-9.96
1220,-10.06
1221,-10.12
1222,-10.12
1223,-10.12
1224,-10.16
1225,-10.22
1226,-10.22
1227,-10.12
1228,-9.89
1229,-9.59
1230,-9.21
1231,-8.74
1232,-8.16
1233,-7.56
1234,-7.00
1235,-6.53
1236,-6.08
1237,-5.70
1238,-5.28
1239,-4.88
1240,-4.38
1241,-3.88
1242,-3.30
1243,-2.71
1244,-2.02
1245,-1.33
1246,-0.61
1247,0.09
1248,0.89
1249,1.77
1250,2.72
1251,3.62
1252,4.47
1253,5.25
1254,5.91
1255,6.32
1256,6.46
1257,6.33
1258,6.03
1259,5.60
1260,5.08
1261,4.49
1262,3.85
1263,3.18
1264,2.50
1265,1.85
1266,1.24
1267,0.71
1268,0.21
1269,-0.24
1270,-0.70
1271,-1.05
1272,-1.31
1273,-1.41
1274,-1.43
1275,-1.34
1276,-1.27
1277,-1.24
1278,-1.40
1279,-1.74
1280,-2.37
1281,-3.17
1282,-4.20
1283,-5.34
1284,-6.59
1285,-7.77
1286,-8.82
1287,-9.64
1288,-10.37
1289,-10.99
1290,-11.62
1291,-12.26
1292,-13.04
1293,-13.86
1294,-14.69
1295,-15.34
1296,-15.84
1297,-16.17
1298,-16.46
1299,-16.67
1300,-16.91
1301,-17.13
1302,-17.43
1303,-17.71
1304,-18.00
1305,-18.23
1306,-18.44
1307,-18.62
1308,-18.78
1309,-18.94
1310,-19.17
1311,-19.48
1312,-19.82
1313,-20.07
1314,-20.10
1315,-19.85
1316,-19.42
1317,-18.85
1318,-18.26
1319,-17.79
1320,-17.55
1321,-17.60
1322,-17.91
1323,-18.48
1324,-19.21
1325,-20.00
1326,-20.65
1327,-21.03
1328,-21.05
1329,-20.76
1330,-20.16
1331,-19.33
1332,-18.29
1333,-17.22
1334,-16.19
1335,-15.30
1336,-14.47
1337,-13.73
1338,-12.96
1339,-12.21
1340,-11.31
1341,-10.31
1342,-9.20
1343,-8.13
1344,-7.11
1345,-6.29
1346,-5.65
1347,-5.26
1348,-4.98
1349,-4.83
1350,-4.69
1351,-4.59
1352,-4.43
1353,-4.26
1354,-4.06
1355,-3.88
1356,-3.75
1357,-3.68
1358,-3.69
1359,-3.75
1360,-3.87
1361,-3.98
1362,-4.09
1363,-4.14
1364,-4.20
1365,-4.30
1366,-4.55
1367,-4.95
1368,-5.55
1369,-6.27
1370,-7.05
1371,-7.71
1372,-8.19
1373,-8.35
1374,-8.26
1375,-8.00
1376,-7.75
1377,-7.68
1378,-7.90
1379,-8.45
1380,-9.25
1381,-10.24
1382,-11.20
1383,-11.95
1384,-12.25
1385,-12.02
1386,-11.22
1387,-10.01
1388,-8.55
1389,-7.04
1390,-5.60
1391,-4.35
1392,-3.34
1393,-2.56
1394,-1.95
1395,-1.42
1396,-0.95
1397,-0.59
1398,-0.36
1399,-0.35
1400,-0.66
1401,-1.37
1402,-2.51
1403,-3.97
1404,-5.57
1405,-7.08
1406,-8.32
1407,-9.16
1408,-9.56
1409,-9.48
1410,-9.02
1411,-8.35
1412,-7.68
1413,-7.11
1414,-6.73
1415,-6.56
1416,-6.64
1417,-6.88
1418,-7.15
1419,-7.35
1420,-7.42
1421,-7.35
1422,-7.12
1423,-6.79
1424,-6.32
1425,-5.79
1426,-5.12
1427,-4.36
1428,-3.50
1429,-2.60
1430,-1.64
1431,-0.76
1432,-0.02
1433,0.45
1434,0.72
1435,0.75
1436,0.60
1437,0.29
1438,-0.05
1439,-0.36
1440,-0.60
1441,-0.78
1442,-0.85
1443,-0.86
1444,-0.82
1445,-0.76
1446,-0.65
1447,-0.41
1448,-0.05
1449,0.37
1450,0.77
1451,1.14
1452,1.46
1453,1.76
1454,1.98
1455,2.11
1456,2.16
1457,2.15
1458,2.10
1459,2.05
1460,2.01
1461,1.95
1462,1.81
1463,1.53
1464,1.05
1465,0.46
1466,-0.24
1467,-0.94
1468,-1.65
1469,-2.29
1470,-2.93
1471,-3.50
1472,-4.11
1473,-4.74
1474,-5.52
1475,-6.39
1476,-7.43
1477,-8.48
1478,-9.61
1479,-10.66
1480,-11.73
1481,-12.66
1482,-13.50
1483,-14.12
1484,-14.67
1485,-15.05
1486,-15.41
1487,-15.68
1488,-16.02
1489,-16.41
1490,-16.97
1491,-17.60
1492,-18.37
1493,-19.20
1494,-20.12
1495,-21.01
1496,-21.83
1497,-22.49
1498,-22.99
1499,-23.35
1500,-23.56
1501,-23.63
1502,-23.52
1503,-23.22
1504,-22.70
1505,-21.93
1506,-20.90
1507,-19.63
1508,-18.18
1509,-16.68
1510,-15.27
1511,-14.18
1512,-13.50
1513,-13.35
1514,-13.65
1515,-14.27
1516,-14.96
1517,-15.59
1518,-16.05
1519,-16.35
1520,-16.45
1521,-16.46
1522,-16.46
1523,-16.63
1524,-17.00
1525,-17.50
1526,-17.98
1527,-18.30
1528,-18.30
1529,-17.89
1530,-17.04
1531,-15.83
1532,-14.39
1533,-12.95
1534,-11.64
1535,-10.64
1536,-9.90
1537,-9.51
1538,-9.37
1539,-9.39
1540,-9.35
1541,-9.14
1542,-8.67
1543,-8.01
1544,-7.17
1545,-6.34
1546,-5.63
1547,-5.20
1548,-5.08
1549,-5.29
1550,-5.72
1551,-6.29
1552,-6.76
1553,-7.02
1554,-6.95
1555,-6.58
1556,-5.97
1557,-5.24
1558,-4.54
1559,-3.92
1560,-3.47
1561,-3.23
1562,-3.26
1563,-3.49
1564,-3.86
1565,-4.26
1566,-4.77
1567,-5.36
1568,-6.06
1569,-6.76
1570,-7.49
1571,-8.25
1572,-9.17
1573,-10.16
1574,-11.25
1575,-12.30
1576,-13.45
1577,-14.63
1578,-15.84
1579,-16.90
1580,-17.84
1581,-18.59
1582,-19.26
1583,-19.78
1584,-20.23
1585,-20.56
1586,-20.90
1587,-21.18
1588,-21.43
1589,-21.54
1590,-21.53
1591,-21.40
1592,-21.22
1593,-21.04
1594,-20.89
1595,-20.84
1596,-20.90
1597,-21.09
1598,-21.32
1599,-21.51
1600,-21.56
1601,-21.40
1602,-20.93
1603,-20.16
1604,-19.09
1605,-17.83
1606,-16.45
1607,-15.14
1608,-13.95
1609,-12.95
1610,-12.07
1611,-11.31
1612,-10.60
1613,-10.02
1614,-9.51
1615,-9.12
1616,-8.71
1617,-8.36
1618,-8.08
1619,-7.97
1620,-8.00
1621,-8.19
1622,-8.51
1623,-8.93
1624,-9.38
1625,-9.74
1626,-9.96
1627,-10.01
1628,-9.96
1629,-9.82
1630,-9.69
1631,-9.61
1632,-9.70
1633,-9.99
1634,-10.51
1635,-11.17
1636,-11.93
1637,-12.71
1638,-13.49
1639,-14.19
1640,-14.84
1641,-15.43
1642,-16.03
1643,-16.62
1644,-17.17
1645,-17.53
1646,-17.67
1647,-17.54
1648,-17.18
1649,-16.63
1650,-15.98
1651,-15.30
1652,-14.73
1653,-14.37
1654,-14.27
1655,-14.40
1656,-14.68
1657,-15.05
1658,-15.43
1659,-15.80
1660,-16.07
1661,-16.19
1662,-16.14
1663,-15.95
1664,-15.70
1665,-15.39
1666,-15.07
1667,-14.76
1668,-14.56
1669,-14.55
1670,-14.79
1671,-15.20
1672,-15.77
1673,-16.49
1674,-17.38
1675,-18.39
1676,-19.43
1677,-20.34
1678,-21.05
1679,-21.46
1680,-21.55
1681,-21.30
1682,-20.83
1683,-20.20
1684,-19.58
1685,-19.09
1686,-18.87
1687,-18.94
1688,-19.19
1689,-19.51
1690,-19.77
1691,-19.90
1692,-19.81
1693,-19.52
1694,-19.04
1695,-18.49
1696,-17.95
1697,-17.49
1698,-17.07
1699,-16.71
1700,-16.40
1701,-16.17
1702,-16.00
1703,-15.82
1704,-15.56
1705,-15.29
1706,-14.99
1707,-14.69
1708,-14.31
1709,-13.91
1710,-13.54
1711,-13.31
1712,-13.10
1713,-12.89
1714,-12.59
1715,-12.25
1716,-11.76
1717,-11.05
1718,-10.06
1719,-8.86
1720,-7.58
1721,-6.37
1722,-5.30
1723,-4.47
1724,-3.93
1725,-3.68
1726,-3.68
1727,-3.88
1728,-4.23
1729,-4.63
1730,-5.06
1731,-5.53
1732,-6.17
1733,-6.99
1734,-7.99
1735,-9.06
1736,-10.25
1737,-11.49
1738,-12.78
1739,-13.89
1740,-14.85
1741,-15.53
1742,-16.13
1743,-16.62
1744,-17.20
1745,-17.75
1746,-18.46
1747,-19.20
1748,-20.11
1749,-21.03
1750,-22.05
1751,-23.04
1752,-24.12
1753,-25.15
1754,-26.25
1755,-27.30
1756,-28.43
1757,-29.55
1758,-30.69
1759,-31.67
1760,-32.60
1761,-33.42
1762,-34.21
1763,-34.84
1764,-35.36
1765,-35.76
1766,-36.20
1767,-36.64
1768,-37.16
1769,-37.69
1770,-38.32
1771,-38.96
1772,-39.57
1773,-40.05
1774,-40.44
1775,-40.66
1776,-40.71
1777,-40.53
1778,-40.18
1779,-39.75
1780,-39.32
1781,-38.96
1782,-38.68
1783,-38.51
1784,-38.43
1785,-38.38
1786,-38.25
1787,-38.02
1788,-37.70
1789,-37.33
1790,-36.92
1791,-36.51
1792,-36.13
1793,-35.90
1794,-35.81
1795,-35.88
1796,-36.05
1797,-36.30
1798,-36.57
1799,-36.83
1800,-36.96
1801,-36.91
1802,-36.61
1803,-36.16
1804,-35.52
1805,-34.81
1806,-33.98
1807,-33.17
1808,-32.36
1809,-31.67
1810,-30.96
1811,-30.28
1812,-29.50
1813,-28.69
1814,-27.69
1815,-26.60
1816,-25.29
1817,-23.94
1818,-22.47
1819,-21.06
1820,-19.67
1821,-18.50
1822,-17.49
1823,-16.75
1824,-16.14
1825,-15.75
1826,-15.46
1827,-15.31
1828,-15.14
1829,-14.92
1830,-14.54
1831,-14.08
1832,-13.53
1833,-12.99
1834,-12.47
1835,-12.05
1836,-11.80
1837,-11.73
1838,-11.83
1839,-12.01
1840,-12.26
1841,-12.54
1842,-12.91
1843,-13.31
1844,-13.82
1845,-14.39
1846,-15.15
1847,-16.10
1848,-17.29
1849,-18.59
1850,-19.97
1851,-21.35
1852,-22.73
1853,-23.96
1854,-25.02
1855,-25.79
1856,-26.36
1857,-26.70
1858,-26.86
1859,-26.78
1860,-26.57
1861,-26.33
1862,-26.11
1863,-25.87
1864,-25.54
1865,-25.02
1866,-24.24
1867,-23.22
1868,-21.97
1869,-20.66
1870,-19.39
1871,-18.30
1872,-17.44
1873,-16.85
1874,-16.52
1875,-16.42
1876,-16.42
1877,-16.36
1878,-16.18
1879,-15.99
1880,-15.98
1881,-16.32
1882,-17.08
1883,-18.24
1884,-19.68
1885,-21.26
1886,-22.74
1887,-23.90
1888,-24.56
1889,-24.61
1890,-24.10
1891,-23.17
1892,-22.08
1893,-21.05
1894,-20.23
1895,-19.62
1896,-19.23
1897,-19.00
1898,-18.88
1899,-18.83
1900,-18.78
1901,-18.78
1902,-18.88
1903,-19.13
1904,-19.43
1905,-19.76
1906,-19.99
1907,-20.07
1908,-19.88
1909,-19.46
1910,-18.84
1911,-18.19
1912,-17.58
1913,-17.11
1914,-16.74
1915,-16.53
1916,-16.37
1917,-16.21
1918,-15.88
1919,-15.36
1920,-14.61
1921,-13.77
1922,-12.89
1923,-12.13
1924,-11.48
1925,-11.02
1926,-10.65
1927,-10.38
1928,-10.10
1929,-9.81
1930,-9.43
1931,-9.02
1932,-8.61
1933,-8.32
1934,-8.13
1935,-8.08
1936,-8.13
1937,-8.26
1938,-8.40
1939,-8.46
1940,-8.38
1941,-8.13
1942,-7.79
1943,-7.42
1944,-7.11
1945,-6.92
1946,-6.90
1947,-7.07
1948,-7.48
1949,-8.07
1950,-8.82
1951,-9.59
1952,-10.38
1953,-11.14
1954,-11.94
1955,-12.76
1956,-13.66
1957,-14.53
1958,-15.43
1959,-16.30
1960,-17.29
1961,-18.28
1962,-19.33
1963,-20.32
1964,-21.37
1965,-22.42
1966,-23.55
1967,-24.61
1968,-25.62
1969,-26.50
1970,-27.33
1971,-28.03
1972,-28.63
1973,-29.05
1974,-29.27
1975,-29.27
1976,-29.05
1977,-28.56
1978,-27.85
1979,-27.08
1980,-26.32
1981,-25.73
1982,-25.27
1983,-24.93
1984,-24.60
1985,-24.22
1986,-23.56
1987,-22.57
1988,-21.13
1989,-19.45
1990,-17.70
1991,-16.19
1992,-15.08
1993,-14.56
1994,-14.60
1995,-15.11
1996,-15.82
1997,-16.52
1998,-16.98
1999,-17.16
2000,-17.05
2001,-16.82
2002,-16.56
2003,-16.49
2004,-16.68
2005,-17.14
2006,-17.66
2007,-18.05
2008,-18.04
2009,-17.58
2010,-16.65
2011,-15.40
2012,-13.84
2013,-12.23
2014,-10.70
2015,-9.45
2016,-8.45
2017,-7.70
2018,-7.12
2019,-6.71
2020,-6.36
2021,-6.02
2022,-5.62
2023,-5.21
2024,-4.78
2025,-4.43
2026,-4.17
2027,-4.14
2028,-4.25
2029,-4.50
2030,-4.77
2031,-5.03
2032,-5.20
2033,-5.21
2034,-4.94
2035,-4.40
2036,-3.68
2037,-2.96
2038,-2.30
2039,-1.76
2040,-1.36
2041,-1.12
2042,-1.05
2043,-1.05
2044,-1.04
2045,-0.92
2046,-0.71
2047,-0.46
2048,-0.24
2049,-0.10
2050,-0.14
2051,-0.43
2052,-1.06
2053,-1.95
2054,-3.04
2055,-4.17
2056,-5.35
2057,-6.47
2058,-7.55
2059,-8.49
2060,-9.36
2061,-10.17
2062,-11.06
2063,-12.00
2064,-13.03
2065,-13.98
2066,-14.80
2067,-15.33
2068,-15.56
2069,-15.42
2070,-15.03
2071,-14.46
2072,-13.91
2073,-13.54
2074,-13.47
2075,-13.71
2076,-14.20
2077,-14.82
2078,-15.43
2079,-15.93
2080,-16.17
2081,-16.12
2082,-15.75
2083,-15.15
2084,-14.37
2085,-13.54
2086,-12.68
2087,-11.86
2088,-11.00
2089,-10.12
2090,-9.16
2091,-8.21
2092,-7.28
2093,-6.45
2094,-5.69
2095,-5.10
2096,-4.69
2097,-4.52
2098,-4.52
2099,-4.59
2100,-4.65
2101,-4.72
2102,-4.81
2103,-4.91
2104,-5.04
2105,-5.23
2106,-5.53
2107,-5.93
2108,-6.42
2109,-6.95
2110,-7.60
2111,-8.29
2112,-9.05
2113,-9.82
2114,-10.70
2115,-11.63
2116,-12.64
2117,-13.59
2118,-14.51
2119,-15.33
2120,-16.08
2121,-16.66
2122,-17.12
2123,-17.39
2124,-17.60
2125,-17.75
2126,-17.99
2127,-18.26
2128,-18.66
2129,-19.13
2130,-19.73
2131,-20.37
2132,-21.03
2133,-21.62
2134,-22.19
2135,-22.64
2136,-23.01
2137,-23.24
2138,-23.44
2139,-23.58
2140,-23.77
2141,-23.93
2142,-24.19
2143,-24.46
2144,-24.82
2145,-25.22
2146,-25.78
2147,-26.48
2148,-27.35
2149,-28.24
2150,-29.12
2151,-29.88
2152,-30.56
2153,-31.07
2154,-31.51
2155,-31.85
2156,-32.22
2157,-32.61
2158,-33.13
2159,-33.70
2160,-34.42
2161,-35.19
2162,-35.98
2163,-36.62
2164,-37.14
2165,-37.52
2166,-37.98
2167,-38.49
2168,-39.15
2169,-39.85
2170,-40.66
2171,-41.55
2172,-42.53
2173,-43.41
2174,-44.15
2175,-44.69
2176,-45.08
2177,-45.30
2178,-45.36
2179,-45.23
2180,-45.05
2181,-44.85
2182,-44.65
2183,-44.41
2184,-44.19
2185,-44.06
2186,-44.07
2187,-44.20
2188,-44.38
2189,-44.58
2190,-44.71
2191,-44.78
2192,-44.73
2193,-44.57
2194,-44.23
2195,-43.71
2196,-42.93
2197,-41.98
2198,-40.88
2199,-39.76
2200,-38.59
2201,-37.48
2202,-36.34
2203,-35.29
2204,-34.25
2205,-33.32
2206,-32.39
2207,-31.52
2208,-30.60
2209,-29.72
2210,-28.85
2211,-28.15
2212,-27.60
2213,-27.24
2214,-27.03
2215,-26.99
2216,-27.07
2217,-27.20
2218,-27.23
2219,-27.12
2220,-26.92
2221,-26.71
2222,-26.62
2223,-26.75
2224,-27.16
2225,-27.89
2226,-28.82
2227,-29.86
2228,-30.86
2229,-31.65
2230,-32.07
2231,-32.01
2232,-31.47
2233,-30.49
2234,-29.20
2235,-27.73
2236,-26.34
2237,-25.17
2238,-24.44
2239,-24.24
2240,-24.70
2241,-25.77
2242,-27.38
2243,-29.31
2244,-31.39
2245,-33.30
2246,-34.87
2247,-35.94
2248,-36.61
2249,-36.92
2250,-37.09
2251,-37.24
2252,-37.64
2253,-38.26
2254,-39.15
2255,-40.12
2256,-41.11
2257,-41.93
2258,-42.51
2259,-42.74
2260,-42.72
2261,-42.57
2262,-42.46
2263,-42.45
2264,-42.59
2265,-42.85
2266,-43.14
2267,-43.39
2268,-43.50
2269,-43.45
2270,-43.21
2271,-42.86
2272,-42.37
2273,-41.85
2274,-41.28
2275,-40.70
2276,-40.02
2277,-39.26
2278,-38.37
2279,-37.50
2280,-36.60
2281,-35.80
2282,-34.93
2283,-34.14
2284,-33.29
2285,-32.50
2286,-31.50
2287,-30.36
2288,-28.88
2289,-27.24
2290,-25.33
2291,-23.34
2292,-21.16
2293,-19.04
2294,-16.91
2295,-15.04
2296,-13.33
2297,-11.99
2298,-10.90
2299,-10.22
2300,-9.80
2301,-9.65
2302,-9.59
2303,-9.62
2304,-9.63
2305,-9.64
2306,-9.59
2307,-9.54
2308,-9.52
2309,-9.63
2310,-9.91
2311,-10.32
2312,-10.86
2313,-11.45
2314,-12.10
2315,-12.68
2316,-13.22
2317,-13.61
2318,-13.98
2319,-14.37
2320,-14.97
2321,-15.77
2322,-16.89
2323,-18.19
2324,-19.68
2325,-21.10
2326,-22.42
2327,-23.40
2328,-24.16
2329,-24.65
2330,-25.11
2331,-25.60
2332,-26.38
2333,-27.44
2334,-28.85
2335,-30.40
2336,-31.99
2337,-33.36
2338,-34.44
2339,-35.10
2340,-35.33
2341,-35.20
2342,-34.81
2343,-34.32
2344,-33.84
2345,-33.44
2346,-33.00
2347,-32.35
2348,-31.37
2349,-30.06
2350,-28.49
2351,-26.78
2352,-25.09
2353,-23.64
2354,-22.65
2355,-22.22
2356,-22.32
2357,-22.80
2358,-23.64
2359,-24.71
2360,-25.96
2361,-27.25
2362,-28.68
2363,-30.27
2364,-32.17
2365,-34.23
2366,-36.47
2367,-38.61
2368,-40.67
2369,-42.43
2370,-43.94
2371,-45.05
2372,-45.89
2373,-46.46
2374,-46.89
2375,-47.18
2376,-47.39
2377,-47.44
2378,-47.32
2379,-47.03
2380,-46.60
2381,-46.07
2382,-45.35
2383,-44.54
2384,-43.60
2385,-42.67
2386,-41.60
2387,-40.46
2388,-39.06
2389,-37.54
2390,-35.77
2391,-34.02
2392,-32.23
2393,-30.66
2394,-29.11
2395,-27.74
2396,-26.33
2397,-25.00
2398,-23.52
2399,-22.02
2400,-20.36
2401,-18.78
2402,-17.18
2403,-15.79
2404,-14.48
2405,-13.47
2406,-12.51
2407,-11.67
2408,-10.64
2409,-9.48
2410,-8.10
2411,-6.68
2412,-5.20
2413,-3.85
2414,-2.62
2415,-1.69
2416,-0.94
2417,-0.44
2418,-0.06
2419,0.21
2420,0.52
2421,0.79
2422,1.06
2423,1.24
2424,1.39
2425,1.50
2426,1.55
2427,1.56
2428,1.54
2429,1.55
2430,1.51
2431,1.41
2432,1.17
2433,0.83
2434,0.33
2435,-0.30
2436,-1.15
2437,-2.10
2438,-3.12
2439,-4.06
2440,-4.95
2441,-5.77
2442,-6.64
2443,-7.50
2444,-8.46
2445,-9.46
2446,-10.59
2447,-11.71
2448,-12.77
2449,-13.61
2450,-14.24
2451,-14.64
2452,-14.86
2453,-14.92
2454,-14.87
2455,-14.76
2456,-14.56
2457,-14.27
2458,-13.85
2459,-13.38
2460,-12.86
2461,-12.39
2462,-11.93
2463,-11.56
2464,-11.09
2465,-10.46
2466,-9.43
2467,-8.03
2468,-6.21
2469,-4.11
2470,-1.77
2471,0.49
2472,2.46
2473,3.83
2474,4.64
2475,4.83
2476,4.59
2477,4.01
2478,3.40
2479,2.82
2480,2.42
2481,2.11
2482,1.95
2483,1.80
2484,1.69
2485,1.55
2486,1.53
2487,1.67
2488,2.14
2489,2.95
2490,4.24
2491,5.91
2492,7.89
2493,9.86
2494,11.70
2495,13.25
2496,14.56
2497,15.54
2498,16.27
2499,16.74
2500,17.08
2501,17.30
2502,17.43
2503,17.43
2504,17.32
2505,17.07
2506,16.70
2507,16.15
2508,15.49
2509,14.84
2510,14.25
2511,13.79
2512,13.33
2513,12.95
2514,12.56
2515,12.16
2516,11.56
2517,10.82
2518,9.89
2519,8.90
2520,7.69
2521,6.36
2522,4.81
2523,3.36
2524,1.91
2525,0.65
2526,-0.64
2527,-1.78
2528,-2.94
2529,-3.95
2530,-5.12
2531,-6.36
2532,-7.98
2533,-9.78
2534,-11.93
2535,-14.16
2536,-16.56
2537,-18.86
2538,-21.13
2539,-23.12
2540,-24.95
2541,-26.46
2542,-27.82
2543,-28.92
2544,-29.88
2545,-30.55
2546,-31.11
2547,-31.43
2548,-31.68
2549,-31.76
2550,-31.83
2551,-31.92
2552,-32.20
2553,-32.68
2554,-33.33
2555,-34.07
2556,-34.75
2557,-35.32
2558,-35.61
2559,-35.57
2560,-35.06
2561,-34.17
2562,-32.97
2563,-31.59
2564,-30.04
2565,-28.50
2566,-27.05
2567,-25.86
2568,-24.90
2569,-24.22
2570,-23.67
2571,-23.28
2572,-22.89
2573,-22.50
2574,-21.97
2575,-21.40
2576,-20.72
2577,-20.02
2578,-19.23
2579,-18.53
2580,-17.97
2581,-17.68
2582,-17.59
2583,-17.67
2584,-17.79
2585,-17.93
2586,-17.98
2587,-17.87
2588,-17.51
2589,-16.97
2590,-16.37
2591,-15.88
2592,-15.59
2593,-15.59
2594,-15.93
2595,-16.59
2596,-17.49
2597,-18.45
2598,-19.38
2599,-20.16
2600,-20.74
2601,-21.03
2602,-21.05
2603,-20.85
2604,-20.60
2605,-20.40
2606,-20.34
2607,-20.41
2608,-20.59
2609,-20.83
2610,-21.06
2611,-21.25
2612,-21.36
2613,-21.36
2614,-21.22
2615,-20.98
2616,-20.70
2617,-20.45
2618,-20.27
2619,-20.10
2620,-19.89
2621,-19.65
2622,-19.41
2623,-19.17
2624,-18.91
2625,-18.66
2626,-18.51
2627,-18.50
2628,-18.65
2629,-18.90
2630,-19.21
2631,-19.51
2632,-19.74
2633,-19.86
2634,-19.89
2635,-19.88
2636,-19.89
2637,-20.01
2638,-20.29
2639,-20.65
2640,-20.99
2641,-21.24
2642,-21.37
2643,-21.31
2644,-21.00
2645,-20.45
2646,-19.79
2647,-19.17
2648,-18.71
2649,-18.48
2650,-18.49
2651,-18.67
2652,-18.94
2653,-19.25
2654,-19.56
2655,-19.86
2656,-20.13
2657,-20.36
2658,-20.60
2659,-20.90
2660,-21.28
2661,-21.71
2662,-22.10
2663,-22.42
2664,-22.57
2665,-22.52
2666,-22.20
2667,-21.68
2668,-20.95
2669,-20.19
2670,-19.36
2671,-18.61
2672,-17.88
2673,-17.25
2674,-16.57
2675,-15.84
2676,-14.84
2677,-13.61
2678,-12.04
2679,-10.33
2680,-8.49
2681,-6.78
2682,-5.17
2683,-3.83
2684,-2.66
2685,-1.75
2686,-0.86
2687,-0.02
2688,1.01
2689,2.11
2690,3.36
2691,4.54
2692,5.67
2693,6.53
2694,7.19
2695,7.58
2696,7.89
2697,8.10
2698,8.31
2699,8.48
2700,8.67
2701,8.85
2702,8.98
2703,8.98
2704,8.84
2705,8.61
2706,8.28
2707,7.92
2708,7.53
2709,7.19
2710,6.87
2711,6.58
2712,6.20
2713,5.68
2714,4.99
2715,4.20
2716,3.37
2717,2.68
2718,2.14
2719,1.86
2720,1.69
2721,1.67
2722,1.66
2723,1.63
2724,1.34
2725,0.83
2726,0.08
2727,-0.75
2728,-1.66
2729,-2.53
2730,-3.40
2731,-4.17
2732,-4.88
2733,-5.52
2734,-6.16
2735,-6.74
2736,-7.29
2737,-7.71
2738,-7.99
2739,-8.09
2740,-8.09
2741,-8.02
2742,-7.97
2743,-7.90
2744,-7.81
2745,-7.68
2746,-7.58
2747,-7.51
2748,-7.50
2749,-7.50
2750,-7.48
2751,-7.43
2752,-7.34
2753,-7.23
2754,-7.06
2755,-6.88
2756,-6.71
2757,-6.61
2758,-6.50
2759,-6.39
2760,-6.23
2761,-6.07
2762,-5.85
2763,-5.57
2764,-5.12
2765,-4.54
2766,-3.80
2767,-3.04
2768,-2.20
2769,-1.39
2770,-0.51
2771,0.36
2772,1.28
2773,2.16
2774,3.04
2775,3.79
2776,4.50
2777,5.07
2778,5.61
2779,6.04
2780,6.55
2781,7.13
2782,7.89
2783,8.77
2784,9.80
2785,10.81
2786,11.77
2787,12.54
2788,13.10
2789,13.44
2790,13.68
2791,13.84
2792,14.02
2793,14.19
2794,14.38
2795,14.52
2796,14.48
2797,14.19
2798,13.60
2799,12.82
2800,11.93
2801,11.10
2802,10.33
2803,9.69
2804,9.12
2805,8.66
2806,8.21
2807,7.76
2808,7.17
2809,6.47
2810,5.60
2811,4.71
2812,3.84
2813,3.13
2814,2.58
2815,2.24
2816,2.02
2817,1.91
2818,1.83
2819,1.71
2820,1.54
2821,1.35
2822,1.22
2823,1.21
2824,1.40
2825,1.79
2826,2.50
2827,3.51
2828,4.85
2829,6.35
2830,7.87
2831,9.19
2832,10.24
2833,10.93
2834,11.36
2835,11.51
2836,11.57
2837,11.66
2838,11.99
2839,12.57
2840,13.43
2841,14.40
2842,15.34
2843,16.00
2844,16.24
2845,15.93
2846,15.14
2847,13.97
2848,12.66
2849,11.44
2850,10.55
2851,10.13
2852,10.17
2853,10.54
2854,11.11
2855,11.73
2856,12.25
2857,12.63
2858,12.78
2859,12.78
2860,12.66
2861,12.56
2862,12.44
2863,12.34
2864,12.15
2865,11.87
2866,11.44
2867,10.92
2868,10.24
2869,9.49
2870,8.58
2871,7.58
2872,6.41
2873,5.19
2874,3.82
2875,2.42
2876,0.86
2877,-0.67
2878,-2.15
2879,-3.31
2880,-4.24
2881,-4.85
2882,-5.37
2883,-5.74
2884,-6.17
2885,-6.60
2886,-7.26
2887,-8.06
2888,-9.12
2889,-10.22
2890,-11.44
2891,-12.68
2892,-14.02
2893,-15.31
2894,-16.56
2895,-17.62
2896,-18.57
2897,-19.33
2898,-19.93
2899,-20.26
2900,-20.43
2901,-20.47
2902,-20.52
2903,-20.56
2904,-20.64
2905,-20.68
2906,-20.77
2907,-20.87
2908,-21.00
2909,-21.05
2910,-21.07
2911,-21.05
2912,-21.10
2913,-21.19
2914,-21.43
2915,-21.77
2916,-22.30
2917,-23.01
2918,-23.93
2919,-24.94
2920,-25.98
2921,-26.93
2922,-27.83
2923,-28.66
2924,-29.43
2925,-30.08
2926,-30.64
2927,-31.05
2928,-31.32
2929,-31.43
2930,-31.43
2931,-31.30
2932,-31.08
2933,-30.78
2934,-30.41
2935,-29.93
2936,-29.32
2937,-28.61
2938,-27.83
2939,-27.06
2940,-26.27
2941,-25.56
2942,-24.99
2943,-24.70
2944,-24.64
2945,-24.73
2946,-24.75
2947,-24.61
2948,-24.13
2949,-23.31
2950,-22.06
2951,-20.56
2952,-18.98
2953,-17.59
2954,-16.51
2955,-15.88
2956,-15.66
2957,-15.79
2958,-16.09
2959,-16.42
2960,-16.65
2961,-16.77
2962,-16.74
2963,-16.69
2964,-16.69
2965,-16.82
2966,-16.98
2967,-17.13
2968,-17.14
2969,-16.98
2970,-16.53
2971,-15.81
2972,-14.88
2973,-13.92
2974,-13.05
2975,-12.39
2976,-11.94
2977,-11.71
2978,-11.65
2979,-11.67
2980,-11.60
2981,-11.38
2982,-10.94
2983,-10.41
2984,-9.85
2985,-9.44
2986,-9.18
2987,-9.20
2988,-9.44
2989,-9.82
2990,-10.13
2991,-10.22
2992,-9.93
2993,-9.22
2994,-8.05
2995,-6.59
2996,-5.09
2997,-3.81
2998,-2.94
2999,-2.59
3000,-2.74
3001,-3.35
3002,-4.32
3003,-5.41
3004,-6.40
3005,-7.12
3006,-7.57
3007,-7.77
3008,-7.90
3009,-8.05
3010,-8.45
3011,-9.07
3012,-10.01
3013,-11.06
3014,-12.28
3015,-13.44
3016,-14.63
3017,-15.67
3018,-16.69
3019,-17.62
3020,-18.59
3021,-19.58
3022,-20.69
3023,-21.82
3024,-22.97
3025,-23.98
3026,-24.80
3027,-25.32
3028,-25.60
3029,-25.58
3030,-25.32
3031,-24.83
3032,-24.24
3033,-23.61
3034,-23.07
3035,-22.66
3036,-22.41
3037,-22.30
3038,-22.22
3039,-22.19
3040,-22.13
3041,-22.09
3042,-21.93
3043,-21.74
3044,-21.38
3045,-20.92
3046,-20.23
3047,-19.36
3048,-18.26
3049,-17.01
3050,-15.56
3051,-14.03
3052,-12.41
3053,-10.86
3054,-9.39
3055,-8.21
3056,-7.35
3057,-6.89
3058,-6.69
3059,-6.73
3060,-6.86
3061,-7.12
3062,-7.37
3063,-7.64
3064,-7.83
3065,-8.02
3066,-8.16
3067,-8.22
3068,-8.16
3069,-7.93
3070,-7.53
3071,-6.97
3072,-6.32
3073,-5.71
3074,-5.31
3075,-5.17
3076,-5.33
3077,-5.77
3078,-6.44
3079,-7.22
3080,-7.95
3081,-8.50
3082,-8.85
3083,-9.02
3084,-9.03
3085,-8.96
3086,-8.95
3087,-9.06
3088,-9.29
3089,-9.54
3090,-9.73
3091,-9.72
3092,-9.50
3093,-9.08
3094,-8.54
3095,-7.99
3096,-7.51
3097,-7.22
3098,-7.13
3099,-7.26
3100,-7.51
3101,-7.82
3102,-8.12
3103,-8.35
3104,-8.51
3105,-8.57
3106,-8.55
3107,-8.48
3108,-8.41
3109,-8.39
3110,-8.54
3111,-8.82
3112,-9.28
3113,-9.87
3114,-10.62
3115,-11.44
3116,-12.37
3117,-13.31
3118,-14.29
3119,-15.17
3120,-15.98
3121,-16.61
3122,-17.17
3123,-17.68
3124,-18.30
3125,-18.93
3126,-19.63
3127,-20.33
3128,-21.15
3129,-21.96
3130,-22.76
3131,-23.41
3132,-23.98
3133,-24.42
3134,-24.83
3135,-25.18
3136,-25.58
3137,-26.02
3138,-26.60
3139,-27.25
3140,-28.03
3141,-28.79
3142,-29.50
3143,-30.03
3144,-30.44
3145,-30.66
3146,-30.71
3147,-30.57
3148,-30.43
3149,-30.41
3150,-30.60
3151,-30.97
3152,-31.46
3153,-31.94
3154,-32.32
3155,-32.52
3156,-32.46
3157,-32.17
3158,-31.62
3159,-30.90
3160,-30.06
3161,-29.23
3162,-28.41
3163,-27.65
3164,-26.86
3165,-26.10
3166,-25.34
3167,-24.68
3168,-24.15
3169,-23.80
3170,-23.61
3171,-23.56
3172,-23.57
3173,-23.65
3174,-23.72
3175,-23.73
3176,-23.58
3177,-23.28
3178,-22.89
3179,-22.52
3180,-22.27
3181,-22.14
3182,-22.15
3183,-22.33
3184,-22.74
3185,-23.34
3186,-24.02
3187,-24.70
3188,-25.30
3189,-25.72
3190,-25.86
3191,-25.69
3192,-25.23
3193,-24.56
3194,-23.75
3195,-22.90
3196,-22.14
3197,-21.59
3198,-21.33
3199,-21.33
3200,-21.55
3201,-21.90
3202,-22.38
3203,-22.92
3204,-23.48
3205,-24.01
3206,-24.56
3207,-25.09
3208,-25.60
3209,-26.01
3210,-26.38
3211,-26.73
3212,-27.11
3213,-27.53
3214,-27.98
3215,-28.47
3216,-28.95
3217,-29.31
3218,-29.43
3219,-29.21
3220,-28.59
3221,-27.63
3222,-26.36
3223,-24.97
3224,-23.65
3225,-22.56
3226,-21.78
3227,-21.37
3228,-21.33
3229,-21.66
3230,-22.17
3231,-22.74
3232,-23.16
3233,-23.43
3234,-23.46
3235,-23.28
3236,-22.82
3237,-22.19
3238,-21.43
3239,-20.65
3240,-19.80
3241,-18.93
3242,-18.03
3243,-17.20
3244,-16.37
3245,-15.62
3246,-14.92
3247,-14.40
3248,-13.95
3249,-13.58
3250,-13.08
3251,-12.51
3252,-11.75
3253,-10.89
3254,-9.77
3255,-8.48
3256,-6.95
3257,-5.41
3258,-3.91
3259,-2.68
3260,-1.64
3261,-0.89
3262,-0.34
3263,-0.07
3264,0.05
3265,0.07
3266,0.21
3267,0.49
3268,0.95
3269,1.42
3270,1.87
3271,2.17
3272,2.29
3273,2.09
3274,1.61
3275,1.00
3276,0.49
3277,0.30
3278,0.47
3279,0.97
3280,1.69
3281,2.51
3282,3.12
3283,3.33
3284,2.95
3285,2.06
3286,0.72
3287,-0.83
3288,-2.49
3289,-3.97
3290,-5.21
3291,-6.09
3292,-6.72
3293,-7.16
3294,-7.60
3295,-8.06
3296,-8.67
3297,-9.37
3298,-10.19
3299,-11.02
3300,-11.87
3301,-12.58
3302,-13.07
3303,-13.25
3304,-13.17
3305,-12.86
3306,-12.33
3307,-11.62
3308,-10.78
3309,-9.94
3310,-9.14
3311,-8.42
3312,-7.77
3313,-7.19
3314,-6.61
3315,-6.07
3316,-5.60
3317,-5.24
3318,-4.98
3319,-4.81
3320,-4.71
3321,-4.71
3322,-4.85
3323,-5.22
3324,-5.78
3325,-6.50
3326,-7.32
3327,-8.17
3328,-8.96
3329,-9.57
3330,-9.87
3331,-9.81
3332,-9.42
3333,-8.75
3334,-7.87
3335,-6.90
3336,-6.00
3337,-5.26
3338,-4.79
3339,-4.62
3340,-4.75
3341,-5.17
3342,-5.79
3343,-6.52
3344,-7.28
3345,-7.95
3346,-8.40
3347,-8.59
3348,-8.52
3349,-8.27
3350,-7.90
3351,-7.47
3352,-7.06
3353,-6.77
3354,-6.61
3355,-6.55
3356,-6.52
3357,-6.47
3358,-6.41
3359,-6.33
3360,-6.24
3361,-6.19
3362,-6.25
3363,-6.48
3364,-6.84
3365,-7.21
3366,-7.54
3367,-7.77
3368,-7.91
3369,-7.90
3370,-7.77
3371,-7.58
3372,-7.44
3373,-7.43
3374,-7.60
3375,-7.90
3376,-8.29
3377,-8.64
3378,-8.94
3379,-9.12
3380,-9.19
3381,-9.19
3382,-9.15
3383,-9.13
3384,-9.25
3385,-9.54
3386,-10.03
3387,-10.57
3388,-11.05
3389,-11.35
3390,-11.44
3391,-11.25
3392,-10.81
3393,-10.17
3394,-9.60
3395,-9.26
3396,-9.41
3397,-9.99
3398,-11.01
3399,-12.33
3400,-13.90
3401,-15.51
3402,-17.04
3403,-18.29
3404,-19.29
3405,-20.03
3406,-20.67
3407,-21.19
3408,-21.68
3409,-22.09
3410,-22.47
3411,-22.76
3412,-22.96
3413,-23.08
3414,-23.15
3415,-23.21
3416,-23.25
3417,-23.28
3418,-23.18
3419,-22.91
3420,-22.27
3421,-21.35
3422,-20.08
3423,-18.66
3424,-17.04
3425,-15.39
3426,-13.71
3427,-12.18
3428,-10.67
3429,-9.22
3430,-7.66
3431,-6.13
3432,-4.56
3433,-3.14
3434,-1.87
3435,-0.93
3436,-0.31
3437,-0.10
3438,-0.17
3439,-0.44
3440,-0.71
3441,-0.98
3442,-1.16
3443,-1.34
3444,-1.50
3445,-1.69
3446,-1.91
3447,-2.16
3448,-2.34
3449,-2.36
3450,-2.12
3451,-1.63
3452,-0.95
3453,-0.17
3454,0.60
3455,1.21
3456,1.58
3457,1.69
3458,1.57
3459,1.33
3460,1.07
3461,0.89
3462,0.79
3463,0.73
3464,0.66
3465,0.48
3466,0.15
3467,-0.37
3468,-1.11
3469,-1.95
3470,-2.80
3471,-3.47
3472,-3.85
3473,-3.84
3474,-3.47
3475,-2.80
3476,-1.96
3477,-1.10
3478,-0.37
3479,0.11
3480,0.26
3481,0.14
3482,-0.16
3483,-0.53
3484,-0.89
3485,-1.13
3486,-1.18
3487,-1.05
3488,-0.84
3489,-0.64
3490,-0.56
3491,-0.62
3492,-0.85
3493,-1.20
3494,-1.66
3495,-2.20
3496,-2.83
3497,-3.49
3498,-4.11
3499,-4.71
3500,-5.33
3501,-5.92
3502,-6.42
3503,-6.74
3504,-6.81
3505,-6.62
3506,-6.16
3507,-5.44
3508,-4.55
3509,-3.63
3510,-2.84
3511,-2.30
3512,-2.07
3513,-2.20
3514,-2.64
3515,-3.31
3516,-4.07
3517,-4.81
3518,-5.39
3519,-5.71
3520,-5.62
3521,-5.23
3522,-4.54
3523,-3.76
3524,-2.91
3525,-2.10
3526,-1.30
3527,-0.53
3528,0.32
3529,1.25
3530,2.30
3531,3.43
3532,4.69
3533,6.00
3534,7.29
3535,8.36
3536,9.18
3537,9.64
3538,9.83
3539,9.74
3540,9.48
3541,9.12
3542,8.77
3543,8.45
3544,8.19
3545,7.96
3546,7.77
3547,7.58
3548,7.35
3549,7.13
3550,6.93
3551,6.81
3552,6.71
3553,6.61
3554,6.45
3555,6.23
3556,5.83
3557,5.24
3558,4.46
3559,3.62
3560,2.83
3561,2.23
3562,1.84
3563,1.75
3564,1.87
3565,2.14
3566,2.30
3567,2.27
3568,1.93
3569,1.33
3570,0.48
3571,-0.47
3572,-1.40
3573,-2.18
3574,-2.78
3575,-3.18
3576,-3.44
3577,-3.55
3578,-3.60
3579,-3.59
3580,-3.56
3581,-3.56
3582,-3.64
3583,-3.80
3584,-4.05
3585,-4.35
3586,-4.71
3587,-5.07
3588,-5.36
3589,-5.53
3590,-5.64
3591,-5.68
3592,-5.74
3593,-5.78
3594,-5.89
3595,-6.17
3596,-6.77
3597,-7.66
3598,-8.77
3599,-9.84
3600,-10.83
3601,-11.60
3602,-12.15
3603,-12.43
3604,-12.54
3605,-12.57
3606,-12.74
3607,-13.14
3608,-13.85
3609,-14.80
3610,-15.97
3611,-17.12
3612,-18.05
3613,-18.59
3614,-18.73
3615,-18.53
3616,-18.11
3617,-17.56
3618,-16.99
3619,-16.49
3620,-16.17
3621,-16.00
3622,-15.91
3623,-15.80
3624,-15.61
3625,-15.36
3626,-15.14
3627,-15.08
3628,-15.22
3629,-15.59
3630,-16.11
3631,-16.75
3632,-17.33
3633,-17.77
3634,-17.88
3635,-17.60
3636,-16.86
3637,-15.72
3638,-14.21
3639,-12.53
3640,-10.87
3641,-9.51
3642,-8.45
3643,-7.76
3644,-7.29
3645,-7.03
3646,-6.77
3647,-6.44
3648,-5.86
3649,-5.10
3650,-4.15
3651,-3.20
3652,-2.27
3653,-1.50
3654,-0.92
3655,-0.63
3656,-0.61
3657,-0.74
3658,-0.86
3659,-0.93
3660,-0.97
3661,-1.02
3662,-1.09
3663,-1.21
3664,-1.46
3665,-1.88
3666,-2.43
3667,-3.04
3668,-3.62
3669,-4.11
3670,-4.45
3671,-4.57
3672,-4.41
3673,-4.00
3674,-3.36
3675,-2.50
3676,-1.47
3677,-0.34
3678,0.75
3679,1.73
3680,2.54
3681,3.08
3682,3.20
3683,2.79
3684,1.90
3685,0.63
3686,-0.91
3687,-2.54
3688,-4.05
3689,-5.26
3690,-6.08
3691,-6.49
3692,-6.55
3693,-6.29
3694,-5.85
3695,-5.36
3696,-4.93
3697,-4.56
3698,-4.27
3699,-4.03
3700,-3.85
3701,-3.73
3702,-3.63
3703,-3.52
3704,-3.38
3705,-3.26
3706,-3.17
3707,-3.11
3708,-3.06
3709,-3.06
3710,-3.17
3711,-3.40
3712,-3.75
3713,-4.11
3714,-4.44
3715,-4.68
3716,-4.83
3717,-4.88
3718,-4.88
3719,-4.86
3720,-4.92
3721,-5.10
3722,-5.41
3723,-5.78
3724,-6.13
3725,-6.38
3726,-6.48
3727,-6.48
3728,-6.38
3729,-6.21
3730,-5.93
3731,-5.52
3732,-4.91
3733,-4.09
3734,-3.00
3735,-1.68
3736,-0.18
3737,1.32
3738,2.67
3739,3.62
3740,4.07
3741,3.94
3742,3.33
3743,2.34
3744,1.20
3745,0.11
3746,-0.70
3747,-1.13
3748,-1.19
3749,-0.98
3750,-0.66
3751,-0.35
3752,-0.17
3753,-0.10
3754,-0.14
3755,-0.18
3756,-0.29
3757,-0.39
3758,-0.56
3759,-0.77
3760,-1.14
3761,-1.72
3762,-2.62
3763,-3.75
3764,-5.06
3765,-6.36
3766,-7.66
3767,-8.77
3768,-9.73
3769,-10.41
3770,-11.01
3771,-11.57
3772,-12.30
3773,-13.18
3774,-14.27
3775,-15.45
3776,-16.72
3777,-17.92
3778,-18.97
3779,-19.68
3780,-20.03
3781,-20.02
3782,-19.76
3783,-19.39
3784,-18.99
3785,-18.65
3786,-18.32
3787,-17.92
3788,-17.27
3789,-16.28
3790,-14.83
3791,-12.98
3792,-10.75
3793,-8.41
3794,-6.16
3795,-4.36
3796,-3.13
3797,-2.55
3798,-2.53
3799,-2.98
3800,-3.70
3801,-4.57
3802,-5.37
3803,-6.04
3804,-6.52
3805,-6.95
3806,-7.37
3807,-7.85
3808,-8.34
3809,-8.79
3810,-9.07
3811,-9.08
3812,-8.72
3813,-8.06
3814,-7.20
3815,-6.30
3816,-5.39
3817,-4.58
3818,-3.82
3819,-3.18
3820,-2.53
3821,-1.85
3822,-0.98
3823,0.06
3824,1.42
3825,2.89
3826,4.43
3827,5.80
3828,7.02
3829,7.95
3830,8.61
3831,8.89
3832,8.93
3833,8.77
3834,8.58
3835,8.45
3836,8.52
3837,8.74
3838,9.08
3839,9.44
3840,9.86
3841,10.19
3842,10.39
3843,10.39
3844,10.33
3845,10.30
3846,10.40
3847,10.70
3848,11.29
3849,12.19
3850,13.29
3851,14.34
3852,15.09
3853,15.40
3854,15.18
3855,14.46
3856,13.30
3857,11.91
3858,10.50
3859,9.28
3860,8.38
3861,7.87
3862,7.66
3863,7.70
3864,7.74
3865,7.71
3866,7.45
3867,7.05
3868,6.48
3869,5.91
3870,5.29
3871,4.78
3872,4.27
3873,3.84
3874,3.29
3875,2.67
3876,1.80
3877,0.76
3878,-0.60
3879,-2.12
3880,-3.85
3881,-5.55
3882,-7.28
3883,-8.87
3884,-10.41
3885,-11.75
3886,-12.97
3887,-13.96
3888,-14.85
3889,-15.53
3890,-16.11
3891,-16.50
3892,-16.89
3893,-17.27
3894,-17.76
3895,-18.30
3896,-18.91
3897,-19.51
3898,-20.00
3899,-20.32
3900,-20.39
3901,-20.16
3902,-19.55
3903,-18.66
3904,-17.56
3905,-16.43
3906,-15.27
3907,-14.10
3908,-12.79
3909,-11.38
3910,-9.80
3911,-8.19
3912,-6.58
3913,-5.16
3914,-3.95
3915,-3.14
3916,-2.63
3917,-2.50
3918,-2.52
3919,-2.63
3920,-2.54
3921,-2.22
3922,-1.52
3923,-0.63
3924,0.40
3925,1.33
3926,2.15
3927,2.78
3928,3.36
3929,3.87
3930,4.43
3931,5.05
3932,5.94
3933,7.05
3934,8.44
3935,9.86
3936,11.29
3937,12.53
3938,13.60
3939,14.41
3940,15.06
3941,15.52
3942,15.89
3943,16.17
3944,16.44
3945,16.61
3946,16.69
3947,16.62
3948,16.45
3949,16.14
3950,15.72
3951,15.24
3952,14.77
3953,14.35
3954,13.94
3955,13.54
3956,13.11
3957,12.70
3958,12.26
3959,11.86
3960,11.48
3961,11.26
3962,11.14
3963,11.18
3964,11.21
3965,11.26
3966,11.07
3967,10.64
3968,9.73
3969,8.45
3970,6.72
3971,4.77
3972,2.58
3973,0.46
3974,-1.59
3975,-3.33
3976,-4.97
3977,-6.42
3978,-7.87
3979,-9.21
3980,-10.57
3981,-11.85
3982,-13.21
3983,-14.49
3984,-15.75
3985,-16.81
3986,-17.71
3987,-18.28
3988,-18.58
3989,-18.49
3990,-18.14
3991,-17.57
3992,-16.98
3993,-16.41
3994,-16.02
3995,-15.89
3996,-16.13
3997,-16.74
3998,-17.59
3999,-18.52
4000,-19.29
4001,-19.80
4002,-19.90
4003,-19.62
4004,-18.89
4005,-17.88
4006,-16.66
4007,-15.47
4008,-14.37
4009,-13.50
4010,-12.76
4011,-12.14
4012,-11.41
4013,-10.54
4014,-9.40
4015,-8.09
4016,-6.62
4017,-5.13
4018,-3.65
4019,-2.34
4020,-1.26
4021,-0.54
4022,-0.22
4023,-0.34
4024,-0.90
4025,-1.86
4026,-3.17
4027,-4.67
4028,-6.23
4029,-7.68
4030,-8.93
4031,-9.87
4032,-10.53
4033,-10.86
4034,-11.03
4035,-11.11
4036,-11.31
4037,-11.65
4038,-12.22
4039,-12.86
4040,-13.55
4041,-14.13
4042,-14.66
4043,-15.06
4044,-15.41
4045,-15.69
4046,-15.99
4047,-16.40
4048,-17.01
4049,-17.72
4050,-18.45
4051,-19.05
4052,-19.52
4053,-19.80
4054,-19.93
4055,-19.92
4056,-19.86
4057,-19.78
4058,-19.75
4059,-19.75
4060,-19.78
4061,-19.71
4062,-19.53
4063,-19.23
4064,-18.89
4065,-18.57
4066,-18.33
4067,-18.21
4068,-18.28
4069,-18.58
4070,-19.07
4071,-19.62
4072,-20.12
4073,-20.53
4074,-20.87
4075,-21.10
4076,-21.24
4077,-21.22
4078,-21.13
4079,-20.99
4080,-20.94
4081,-20.97
4082,-21.19
4083,-21.54
4084,-22.09
4085,-22.73
4086,-23.44
4087,-24.15
4088,-24.91
4089,-25.61
4090,-26.25
4091,-26.73
4092,-27.08
4093,-27.31
4094,-27.43
4095,-27.42
4096,-27.36
4097,-27.28
4098,-27.26
4099,-27.32
4100,-27.49
4101,-27.73
4102,-27.98
4103,-28.18
4104,-28.25
4105,-28.21
4106,-27.96
4107,-27.62
4108,-27.17
4109,-26.70
4110,-26.15
4111,-25.58
4112,-24.92
4113,-24.22
4114,-23.38
4115,-22.45
4116,-21.35
4117,-20.25
4118,-19.04
4119,-17.88
4120,-16.66
4121,-15.56
4122,-14.45
4123,-13.47
4124,-12.49
4125,-11.62
4126,-10.75
4127,-10.01
4128,-9.29
4129,-8.66
4130,-7.98
4131,-7.35
4132,-6.71
4133,-6.13
4134,-5.49
4135,-4.84
4136,-4.21
4137,-3.67
4138,-3.21
4139,-2.86
4140,-2.63
4141,-2.59
4142,-2.67
4143,-2.91
4144,-3.31
4145,-3.92
4146,-4.69
4147,-5.55
4148,-6.33
4149,-6.89
4150,-7.09
4151,-6.92
4152,-6.36
4153,-5.45
4154,-4.28
4155,-3.01
4156,-1.81
4157,-0.79
4158,0.04
4159,0.67
4160,1.17
4161,1.58
4162,1.98
4163,2.33
4164,2.62
4165,2.72
4166,2.69
4167,2.56
4168,2.45
4169,2.37
4170,2.38
4171,2.50
4172,2.78
4173,3.14
4174,3.46
4175,3.59
4176,3.49
4177,3.18
4178,2.73
4179,2.24
4180,1.82
4181,1.58
4182,1.54
4183,1.69
4184,1.87
4185,2.01
4186,1.98
4187,1.82
4188,1.46
4189,0.98
4190,0.40
4191,-0.18
4192,-0.74
4193,-1.21
4194,-1.65
4195,-2.05
4196,-2.47
4197,-2.88
4198,-3.33
4199,-3.74
4200,-4.11
4201,-4.41
4202,-4.65
4203,-4.82
4204,-4.94
4205,-5.00
4206,-5.00
4207,-4.95
4208,-4.83
4209,-4.59
4210,-4.18
4211,-3.66
4212,-3.04
4213,-2.39
4214,-1.65
4215,-0.89
4216,-0.09
4217,0.66
4218,1.46
4219,2.27
4220,3.18
4221,4.06
4222,4.95
4223,5.78
4224,6.59
4225,7.29
4226,7.89
4227,8.30
4228,8.57
4229,8.67
4230,8.65
4231,8.47
4232,8.17
4233,7.80
4234,7.43
4235,7.13
4236,6.94
4237,6.89
4238,6.92
4239,7.00
4240,7.01
4241,6.97
4242,6.79
4243,6.52
4244,6.03
4245,5.39
4246,4.55
4247,3.67
4248,2.76
4249,1.94
4250,1.12
4251,0.38
4252,-0.37
4253,-1.14
4254,-2.01
4255,-2.96
4256,-3.95
4257,-4.85
4258,-5.62
4259,-6.16
4260,-6.41
4261,-6.35
4262,-6.02
4263,-5.52
4264,-4.98
4265,-4.50
4266,-4.13
4267,-3.84
4268,-3.52
4269,-3.14
4270,-2.56
4271,-1.79
4272,-0.76
4273,0.37
4274,1.46
4275,2.30
4276,2.85
4277,3.07
4278,3.05
4279,2.85
4280,2.62
4281,2.49
4282,2.53
4283,2.66
4284,2.76
4285,2.71
4286,2.46
4287,1.96
4288,1.30
4289,0.56
4290,-0.08
4291,-0.44
4292,-0.44
4293,-0.08
4294,0.57
4295,1.41
4296,2.35
4297,3.24
4298,4.06
4299,4.70
4300,5.23
4301,5.63
4302,6.01
4303,6.35
4304,6.72
4305,7.13
4306,7.68
4307,8.31
4308,9.04
4309,9.76
4310,10.47
4311,11.06
4312,11.48
4313,11.59
4314,11.43
4315,11.05
4316,10.60
4317,10.17
4318,9.84
4319,9.65
4320,9.66
4321,9.85
4322,10.14
4323,10.40
4324,10.47
4325,10.36
4326,10.08
4327,9.73
4328,9.28
4329,8.82
4330,8.33
4331,7.92
4332,7.55
4333,7.22
4334,6.80
4335,6.28
4336,5.58
4337,4.81
4338,3.99
4339,3.23
4340,2.46
4341,1.78
4342,1.09
4343,0.47
4344,-0.30
4345,-1.15
4346,-2.19
4347,-3.24
4348,-4.39
4349,-5.42
4350,-6.44
4351,-7.30
4352,-8.17
4353,-8.96
4354,-9.85
4355,-10.77
4356,-11.91
4357,-13.19
4358,-14.69
4359,-16.16
4360,-17.63
4361,-18.91
4362,-20.11
4363,-21.09
4364,-21.97
4365,-22.65
4366,-23.30
4367,-23.86
4368,-24.51
4369,-25.14
4370,-25.83
4371,-26.47
4372,-27.12
4373,-27.76
4374,-28.47
4375,-29.18
4376,-29.88
4377,-30.47
4378,-30.95
4379,-31.27
4380,-31.34
4381,-31.11
4382,-30.49
4383,-29.66
4384,-28.73
4385,-27.89
4386,-27.14
4387,-26.50
4388,-25.92
4389,-25.34
4390,-24.60
4391,-23.66
4392,-22.48
4393,-21.21
4394,-20.00
4395,-19.10
4396,-18.62
4397,-18.70
4398,-19.23
4399,-20.04
4400,-20.87
4401,-21.56
4402,-21.95
4403,-22.07
4404,-21.94
4405,-21.70
4406,-21.42
4407,-21.26
4408,-21.21
4409,-21.24
4410,-21.11
4411,-20.71
4412,-19.94
4413,-18.87
4414,-17.52
4415,-16.09
4416,-14.66
4417,-13.41
4418,-12.33
4419,-11.52
4420,-10.93
4421,-10.53
4422,-10.15
4423,-9.83
4424,-9.46
4425,-9.12
4426,-8.70
4427,-8.25
4428,-7.72
4429,-7.26
4430,-6.81
4431,-6.42
4432,-5.97
4433,-5.46
4434,-4.75
4435,-3.94
4436,-2.94
4437,-1.89
4438,-0.71
4439,0.46
4440,1.65
4441,2.70
4442,3.68
4443,4.49
4444,5.25
4445,5.94
4446,6.68
4447,7.38
4448,8.09
4449,8.75
4450,9.32
4451,9.67
4452,9.77
4453,9.60
4454,9.18
4455,8.57
4456,7.81
4457,6.97
4458,6.13
4459,5.35
4460,4.64
4461,4.05
4462,3.57
4463,3.22
4464,2.93
4465,2.70
4466,2.51
4467,2.40
4468,2.34
4469,2.41
4470,2.59
4471,2.89
4472,3.26
4473,3.63
4474,3.94
4475,4.13
4476,4.12
4477,3.94
4478,3.65
4479,3.33
4480,3.06
4481,2.87
4482,2.86
4483,3.03
4484,3.37
4485,3.79
4486,4.28
4487,4.74
4488,5.20
4489,5.67
4490,6.24
4491,6.89
4492,7.59
4493,8.25
4494,8.86
4495,9.39
4496,9.86
4497,10.21
4498,10.46
4499,10.63
4500,10.83
4501,11.05
4502,11.30
4503,11.49
4504,11.58
4505,11.53
4506,11.26
4507,10.79
4508,10.12
4509,9.40
4510,8.68
4511,8.10
4512,7.63
4513,7.29
4514,6.96
4515,6.63
4516,6.18
4517,5.60
4518,4.78
4519,3.82
4520,2.83
4521,2.00
4522,1.34
4523,0.95
4524,0.76
4525,0.77
4526,0.85
4527,0.95
4528,0.89
4529,0.65
4530,0.21
4531,-0.33
4532,-0.84
4533,-1.20
4534,-1.39
4535,-1.37
4536,-1.19
4537,-0.88
4538,-0.57
4539,-0.31
4540,-0.18
4541,-0.18
4542,-0.37
4543,-0.72
4544,-1.18
4545,-1.66
4546,-2.14
4547,-2.62
4548,-3.11
4549,-3.52
4550,-3.81
4551,-3.93
4552,-3.91
4553,-3.78
4554,-3.59
4555,-3.35
4556,-3.11
4557,-2.92
4558,-2.82
4559,-2.82
4560,-2.93
4561,-3.06
4562,-3.08
4563,-2.98
4564,-2.75
4565,-2.44
4566,-2.05
4567,-1.65
4568,-1.26
4569,-0.95
4570,-0.71
4571,-0.56
4572,-0.43
4573,-0.32
4574,-0.11
4575,0.16
4576,0.49
4577,0.78
4578,1.11
4579,1.46
4580,1.82
4581,2.11
4582,2.40
4583,2.67
4584,3.02
4585,3.43
4586,3.94
4587,4.46
4588,5.02
4589,5.48
4590,5.87
4591,6.09
4592,6.21
4593,6.24
4594,6.36
4595,6.63
4596,7.19
4597,8.01
4598,9.17
4599,10.53
4600,12.07
4601,13.56
4602,14.95
4603,16.05
4604,16.94
4605,17.58
4606,18.11
4607,18.55
4608,19.06
4609,19.57
4610,20.21
4611,20.85
4612,21.49
4613,22.02
4614,22.48
4615,22.83
4616,23.08
4617,23.19
4618,23.22
4619,23.14
4620,23.01
4621,22.82
4622,22.63
4623,22.45
4624,22.29
4625,22.11
4626,21.88
4627,21.58
4628,21.25
4629,20.94
4630,20.71
4631,20.58
4632,20.63
4633,20.94
4634,21.48
4635,22.14
4636,22.79
4637,23.35
4638,23.77
4639,24.00
4640,24.00
4641,23.84
4642,23.56
4643,23.25
4644,22.89
4645,22.50
4646,22.03
4647,21.44
4648,20.59
4649,19.53
4650,18.31
4651,17.05
4652,15.75
4653,14.57
4654,13.58
4655,12.93
4656,12.55
4657,12.41
4658,12.33
4659,12.36
4660,12.36
4661,12.32
4662,12.10
4663,11.76
4664,11.31
4665,10.83
4666,10.30
4667,9.78
4668,9.28
4669,8.93
4670,8.70
4671,8.59
4672,8.53
4673,8.49
4674,8.37
4675,8.15
4676,7.71
4677,7.13
4678,6.41
4679,5.69
4680,4.99
4681,4.39
4682,3.94
4683,3.64
4684,3.48
4685,3.42
4686,3.46
4687,3.63
4688,3.97
4689,4.45
4690,5.04
4691,5.69
4692,6.40
4693,7.11
4694,7.84
4695,8.48
4696,9.09
4697,9.67
4698,10.33
4699,11.02
4700,11.80
4701,12.57
4702,13.39
4703,14.15
4704,14.83
4705,15.30
4706,15.61
4707,15.77
4708,15.88
4709,15.93
4710,15.95
4711,15.88
4712,15.76
4713,15.58
4714,15.36
4715,15.11
4716,14.85
4717,14.63
4718,14.42
4719,14.25
4720,14.05
4721,13.83
4722,13.53
4723,13.19
4724,12.70
4725,12.12
4726,11.43
4727,10.73
4728,9.95
4729,9.20
4730,8.42
4731,7.65
4732,6.81
4733,5.94
4734,4.98
4735,4.04
4736,3.05
4737,2.11
4738,1.21
4739,0.49
4740,-0.01
4741,-0.24
4742,-0.24
4743,-0.12
4744,0.08
4745,0.31
4746,0.58
4747,0.86
4748,1.24
4749,1.75
4750,2.56
4751,3.69
4752,5.14
4753,6.76
4754,8.46
4755,10.03
4756,11.33
4757,12.22
4758,12.70
4759,12.81
4760,12.65
4761,12.28
4762,11.73
4763,11.08
4764,10.38
4765,9.60
4766,8.64
4767,7.51
4768,6.28
4769,5.06
4770,3.94
4771,3.05
4772,2.47
4773,2.30
4774,2.47
4775,2.91
4776,3.49
4777,4.16
4778,4.81
4779,5.36
4780,5.74
4781,5.97
4782,6.12
4783,6.22
4784,6.36
4785,6.59
4786,7.01
4787,7.59
4788,8.36
4789,9.19
4790,10.06
4791,10.77
4792,11.27
4793,11.43
4794,11.34
4795,11.08
4796,10.83
4797,10.69
4798,10.78
4799,11.07
4800,11.57
4801,12.17
4802,12.81
4803,13.34
4804,13.70
4805,13.82
4806,13.73
4807,13.53
4808,13.36
4809,13.29
4810,13.40
4811,13.63
4812,13.95
4813,14.25
4814,14.51
4815,14.69
4816,14.79
4817,14.79
4818,14.69
4819,14.56
4820,14.50
4821,14.56
4822,14.74
4823,14.98
4824,15.23
4825,15.43
4826,15.50
4827,15.38
4828,15.02
4829,14.50
4830,13.83
4831,13.18
4832,12.51
4833,11.94
4834,11.41
4835,10.97
4836,10.40
4837,9.65
4838,8.60
4839,7.36
4840,5.91
4841,4.43
4842,2.92
4843,1.63
4844,0.55
4845,-0.19
4846,-0.74
4847,-1.07
4848,-1.30
4849,-1.46
4850,-1.69
4851,-1.96
4852,-2.35
4853,-2.77
4854,-3.22
4855,-3.62
4856,-4.00
4857,-4.30
4858,-4.52
4859,-4.59
4860,-4.41
4861,-4.00
4862,-3.38
4863,-2.66
4864,-1.88
4865,-1.17
4866,-0.56
4867,-0.15
4868,0.11
4869,0.32
4870,0.65
4871,1.17
4872,1.96
4873,2.91
4874,3.97
4875,4.95
4876,5.69
4877,5.97
4878,5.79
4879,5.23
4880,4.53
4881,3.85
4882,3.29
4883,2.93
4884,2.86
4885,2.97
4886,3.12
4887,3.14
4888,2.99
4889,2.66
4890,2.24
4891,1.86
4892,1.77
4893,2.11
4894,2.94
4895,4.08
4896,5.43
4897,6.81
4898,8.14
4899,9.27
4900,10.15
4901,10.66
4902,10.93
4903,11.02
4904,11.10
4905,11.14
4906,11.21
4907,11.25
4908,11.38
4909,11.53
4910,11.75
4911,11.97
4912,12.32
4913,12.78
4914,13.38
4915,14.04
4916,14.76
4917,15.46
4918,16.17
4919,16.82
4920,17.44
4921,17.97
4922,18.42
4923,18.78
4924,19.06
4925,19.24
4926,19.29
4927,19.20
4928,18.86
4929,18.33
4930,17.58
4931,16.69
4932,15.66
4933,14.60
4934,13.49
4935,12.43
4936,11.36
4937,10.36
4938,9.37
4939,8.49
4940,7.68
4941,7.05
4942,6.50
4943,6.11
4944,5.78
4945,5.49
4946,5.14
4947,4.75
4948,4.25
4949,3.71
4950,3.14
4951,2.66
4952,2.37
4953,2.37
4954,2.62
4955,3.05
4956,3.57
4957,4.05
4958,4.43
4959,4.60
4960,4.59
4961,4.45
4962,4.34
4963,4.37
4964,4.68
4965,5.27
4966,6.17
4967,7.23
4968,8.43
4969,9.55
4970,10.62
4971,11.50
4972,12.25
4973,12.88
4974,13.54
4975,14.30
4976,15.27
4977,16.33
4978,17.45
4979,18.46
4980,19.38
4981,20.03
4982,20.33
4983,20.21
4984,19.74
4985,18.99
4986,18.10
4987,17.20
4988,16.41
4989,15.87
4990,15.60
4991,15.63
4992,15.82
4993,16.15
4994,16.42
4995,16.56
4996,16.43
4997,16.04
4998,15.30
4999,14.34
5000,13.24
5001,12.16
5002,11.18
5003,10.41
5004,9.85
5005,9.51
5006,9.29
5007,9.20
5008,9.09
5009,8.93
5010,8.61
5011,8.21
5012,7.71
5013,7.23
5014,6.80
5015,6.51
5016,6.36
5017,6.38
5018,6.45
5019,6.52
5020,6.54
5021,6.48
5022,6.31
5023,6.02
5024,5.59
5025,5.12
5026,4.62
5027,4.15
5028,3.66
5029,3.19
5030,2.76
5031,2.47
5032,2.29
5033,2.18
5034,2.05
5035,1.95
5036,1.85
5037,1.82
5038,1.71
5039,1.55
5040,1.28
5041,0.99
5042,0.64
5043,0.24
5044,-0.26
5045,-0.79
5046,-1.34
5047,-1.88
5048,-2.43
5049,-2.96
5050,-3.47
5051,-3.88
5052,-4.20
5053,-4.44
5054,-4.61
5055,-4.67
5056,-4.59
5057,-4.34
5058,-4.00
5059,-3.63
5060,-3.30
5061,-3.00
5062,-2.74
5063,-2.56
5064,-2.48
5065,-2.56
5066,-2.71
5067,-2.84
5068,-2.84
5069,-2.74
5070,-2.53
5071,-2.23
5072,-1.78
5073,-1.27
5074,-0.69
5075,-0.11
5076,0.60
5077,1.34
5078,2.17
5079,2.99
5080,3.92
5081,4.91
5082,6.00
5083,7.00
5084,7.95
5085,8.76
5086,9.54
5087,10.23
5088,10.93
5089,11.57
5090,12.25
5091,12.88
5092,13.53
5093,14.11
5094,14.68
5095,15.14
5096,15.53
5097,15.75
5098,15.89
5099,15.95
5100,15.94
5101,15.88
5102,15.76
5103,15.59
5104,15.34
5105,14.98
5106,14.48
5107,13.89
5108,13.24
5109,12.64
5110,12.10
5111,11.70
5112,11.42
5113,11.31
5114,11.29
5115,11.38
5116,11.46
5117,11.48
5118,11.28
5119,10.87
5120,10.28
5121,9.64
5122,8.90
5123,8.13
5124,7.33
5125,6.63
5126,5.99
5127,5.42
5128,4.75
5129,4.06
5130,3.30
5131,2.59
5132,1.88
5133,1.24
5134,0.64
5135,0.12
5136,-0.40
5137,-0.92
5138,-1.49
5139,-2.03
5140,-2.49
5141,-2.72
5142,-2.69
5143,-2.37
5144,-1.89
5145,-1.27
5146,-0.60
5147,0.00
5148,0.36
5149,0.37
5150,0.02
5151,-0.59
5152,-1.34
5153,-2.06
5154,-2.66
5155,-3.08
5156,-3.33
5157,-3.45
5158,-3.43
5159,-3.37
5160,-3.34
5161,-3.41
5162,-3.51
5163,-3.53
5164,-3.33
5165,-2.92
5166,-2.30
5167,-1.59
5168,-0.80
5169,-0.04
5170,0.69
5171,1.21
5172,1.55
5173,1.69
5174,1.86
5175,2.06
5176,2.44
5177,2.95
5178,3.73
5179,4.73
5180,6.00
5181,7.36
5182,8.78
5183,10.08
5184,11.31
5185,12.37
5186,13.28
5187,13.92
5188,14.34
5189,14.56
5190,14.74
5191,14.83
5192,14.88
5193,14.88
5194,14.92
5195,14.97
5196,14.96
5197,14.85
5198,14.68
5199,14.49
5200,14.27
5201,14.06
5202,13.80
5203,13.52
5204,13.09
5205,12.58
5206,11.92
5207,11.22
5208,10.39
5209,9.51
5210,8.57
5211,7.69
5212,6.80
5213,5.92
5214,4.97
5215,3.97
5216,2.86
5217,1.67
5218,0.38
5219,-0.82
5220,-1.74
5221,-2.16
5222,-2.04
5223,-1.43
5224,-0.46
5225,0.69
5226,1.84
5227,2.78
5228,3.49
5229,3.94
5230,4.36
5231,4.86
5232,5.62
5233,6.68
5234,8.16
5235,9.88
5236,11.75
5237,13.49
5238,15.03
5239,16.20
5240,17.03
5241,17.49
5242,17.73
5243,17.76
5244,17.67
5245,17.42
5246,17.10
5247,16.66
5248,16.16
5249,15.54
5250,14.91
5251,14.36
5252,14.00
5253,13.88
5254,13.96
5255,14.21
5256,14.58
5257,15.00
5258,15.41
5259,15.77
5260,16.10
5261,16.38
5262,16.65
5263,16.88
5264,17.17
5265,17.44
5266,17.75
5267,18.04
5268,18.40
5269,18.80
5270,19.25
5271,19.66
5272,20.07
5273,20.42
5274,20.73
5275,20.95
5276,21.16
5277,21.38
5278,21.71
5279,22.13
5280,22.62
5281,23.09
5282,23.52
5283,23.81
5284,23.96
5285,23.95
5286,23.87
5287,23.80
5288,23.83
5289,24.00
5290,24.35
5291,24.83
5292,25.38
5293,25.86
5294,26.21
5295,26.40
5296,26.41
5297,26.30
5298,26.04
5299,25.69
5300,25.25
5301,24.84
5302,24.45
5303,24.12
5304,23.72
5305,23.28
5306,22.64
5307,21.90
5308,20.93
5309,19.89
5310,18.66
5311,17.44
5312,16.14
5313,14.94
5314,13.63
5315,12.38
5316,10.91
5317,9.36
5318,7.48
5319,5.44
5320,3.06
5321,0.68
5322,-1.85
5323,-4.25
5324,-6.71
5325,-8.91
5326,-11.02
5327,-12.83
5328,-14.60
5329,-16.20
5330,-17.85
5331,-19.37
5332,-20.92
5333,-22.31
5334,-23.64
5335,-24.75
5336,-25.76
5337,-26.57
5338,-27.21
5339,-27.57
5340,-27.67
5341,-27.47
5342,-27.02
5343,-26.42
5344,-25.79
5345,-25.25
5346,-24.78
5347,-24.38
5348,-23.99
5349,-23.52
5350,-22.83
5351,-21.83
5352,-20.48
5353,-18.91
5354,-17.26
5355,-15.81
5356,-14.79
5357,-14.36
5358,-14.53
5359,-15.23
5360,-16.24
5361,-17.34
5362,-18.26
5363,-18.88
5364,-19.16
5365,-19.20
5366,-19.11
5367,-19.11
5368,-19.33
5369,-19.81
5370,-20.45
5371,-21.08
5372,-21.51
5373,-21.58
5374,-21.16
5375,-20.26
5376,-19.00
5377,-17.61
5378,-16.21
5379,-15.01
5380,-14.13
5381,-13.66
5382,-13.53
5383,-13.62
5384,-13.75
5385,-13.89
5386,-13.95
5387,-13.96
5388,-13.85
5389,-13.76
5390,-13.67
5391,-13.63
5392,-13.47
5393,-13.21
5394,-12.77
5395,-12.18
5396,-11.31
5397,-10.25
5398,-9.06
5399,-7.92
5400,-6.83
5401,-5.88
5402,-5.12
5403,-4.58
5404,-4.21
5405,-3.98
5406,-3.88
5407,-3.93
5408,-4.16
5409,-4.58
5410,-5.20
5411,-5.97
5412,-6.86
5413,-7.81
5414,-8.87
5415,-9.93
5416,-10.97
5417,-11.85
5418,-12.66
5419,-13.34
5420,-14.02
5421,-14.60
5422,-15.16
5423,-15.62
5424,-16.06
5425,-16.45
5426,-16.91
5427,-17.43
5428,-18.09
5429,-18.80
5430,-19.52
5431,-20.11
5432,-20.58
5433,-20.87
5434,-21.00
5435,-20.99
5436,-20.94
5437,-20.93
5438,-21.00
5439,-21.19
5440,-21.50
5441,-21.86
5442,-22.17
5443,-22.38
5444,-22.39
5445,-22.16
5446,-21.55
5447,-20.68
5448,-19.60
5449,-18.52
5450,-17.43
5451,-16.44
5452,-15.53
5453,-14.77
5454,-14.02
5455,-13.21
5456,-12.20
5457,-11.01
5458,-9.64
5459,-8.27
5460,-6.97
5461,-5.95
5462,-5.29
5463,-5.12
5464,-5.45
5465,-6.24
5466,-7.34
5467,-8.61
5468,-9.93
5469,-11.12
5470,-12.11
5471,-12.82
5472,-13.34
5473,-13.67
5474,-13.90
5475,-14.00
5476,-14.14
5477,-14.34
5478,-14.76
5479,-15.34
5480,-16.15
5481,-17.04
5482,-17.94
5483,-18.65
5484,-19.16
5485,-19.39
5486,-19.40
5487,-19.20
5488,-18.90
5489,-18.66
5490,-18.58
5491,-18.64
5492,-18.72
5493,-18.75
5494,-18.65
5495,-18.35
5496,-17.74
5497,-16.85
5498,-15.77
5499,-14.69
5500,-13.66
5501,-12.84
5502,-12.25
5503,-11.97
5504,-11.89
5505,-11.99
5506,-12.08
5507,-12.17
5508,-12.09
5509,-11.89
5510,-11.40
5511,-10.73
5512,-9.71
5513,-8.48
5514,-6.97
5515,-5.37
5516,-3.72
5517,-2.18
5518,-0.68
5519,0.72
5520,2.11
5521,3.40
5522,4.70
5523,5.87
5524,6.95
5525,7.84
5526,8.57
5527,8.97
5528,9.02
5529,8.64
5530,7.99
5531,7.19
5532,6.38
5533,5.58
5534,4.88
5535,4.35
5536,4.04
5537,3.92
5538,3.87
5539,3.83
5540,3.77
5541,3.70
5542,3.60
5543,3.49
5544,3.39
5545,3.38
5546,3.51
5547,3.73
5548,4.08
5549,4.49
5550,5.02
5551,5.59
5552,6.26
5553,6.96
5554,7.78
5555,8.65
5556,9.64
5557,10.63
5558,11.73
5559,12.84
5560,14.04
5561,15.20
5562,16.46
5563,17.68
5564,18.95
5565,20.12
5566,21.27
5567,22.25
5568,23.16
5569,23.92
5570,24.64
5571,25.27
5572,25.90
5573,26.49
5574,27.08
5575,27.61
5576,28.06
5577,28.36
5578,28.53
5579,28.58
5580,28.55
5581,28.49
5582,28.43
5583,28.38
5584,28.27
5585,28.05
5586,27.60
5587,26.91
5588,25.84
5589,24.48
5590,22.85
5591,21.23
5592,19.76
5593,18.70
5594,18.05
5595,17.85
5596,17.88
5597,18.04
5598,18.09
5599,18.03
5600,17.61
5601,16.93
5602,15.85
5603,14.70
5604,13.44
5605,12.21
5606,10.81
5607,9.32
5608,7.57
5609,5.69
5610,3.48
5611,1.13
5612,-1.35
5613,-3.61
5614,-5.65
5615,-7.29
5616,-8.64
5617,-9.62
5618,-10.38
5619,-10.88
5620,-11.28
5621,-11.51
5622,-11.60
5623,-11.40
5624,-10.95
5625,-10.27
5626,-9.52
5627,-8.79
5628,-8.14
5629,-7.67
5630,-7.42
5631,-7.44
5632,-7.57
5633,-7.73
5634,-7.74
5635,-7.65
5636,-7.32
5637,-6.81
5638,-6.00
5639,-5.07
5640,-3.99
5641,-2.87
5642,-1.63
5643,-0.35
5644,1.00
5645,2.30
5646,3.63
5647,4.79
5648,5.82
5649,6.55
5650,7.21
5651,7.74
5652,8.41
5653,9.08
5654,9.98
5655,11.00
5656,12.34
5657,13.81
5658,15.47
5659,17.11
5660,18.81
5661,20.39
5662,21.96
5663,23.29
5664,24.49
5665,25.47
5666,26.44
5667,27.30
5668,28.14
5669,28.84
5670,29.49
5671,29.99
5672,30.43
5673,30.72
5674,30.92
5675,31.02
5676,31.10
5677,31.14
5678,31.25
5679,31.42
5680,31.67
5681,31.98
5682,32.31
5683,32.55
5684,32.60
5685,32.44
5686,32.07
5687,31.53
5688,30.78
5689,29.89
5690,28.91
5691,27.96
5692,27.02
5693,26.15
5694,25.25
5695,24.35
5696,23.44
5697,22.54
5698,21.70
5699,20.98
5700,20.42
5701,20.13
5702,20.13
5703,20.43
5704,20.97
5705,21.71
5706,22.54
5707,23.33
5708,23.93
5709,24.28
5710,24.48
5711,24.58
5712,24.66
5713,24.71
5714,24.83
5715,25.06
5716,25.43
5717,25.86
5718,26.25
5719,26.49
5720,26.57
5721,26.51
5722,26.32
5723,26.03
5724,25.59
5725,25.07
5726,24.44
5727,23.67
5728,22.67
5729,21.48
5730,20.16
5731,18.90
5732,17.76
5733,16.88
5734,16.23
5735,15.89
5736,15.78
5737,15.85
5738,15.99
5739,16.19
5740,16.40
5741,16.64
5742,16.86
5743,17.11
5744,17.42
5745,17.78
5746,18.11
5747,18.36
5748,18.52
5749,18.57
5750,18.51
5751,18.33
5752,18.08
5753,17.83
5754,17.62
5755,17.43
5756,17.29
5757,17.17
5758,17.10
5759,17.10
5760,17.17
5761,17.36
5762,17.65
5763,18.07
5764,18.59
5765,19.14
5766,19.62
5767,19.92
5768,20.02
5769,19.90
5770,19.55
5771,19.00
5772,18.34
5773,17.68
5774,17.09
5775,16.68
5776,16.45
5777,16.41
5778,16.46
5779,16.59
5780,16.72
5781,16.88
5782,16.89
5783,16.74
5784,16.26
5785,15.50
5786,14.43
5787,13.19
5788,11.77
5789,10.35
5790,8.95
5791,7.77
5792,6.78
5793,6.10
5794,5.59
5795,5.27
5796,4.91
5797,4.48
5798,3.78
5799,2.85
5800,1.56
5801,0.10
5802,-1.52
5803,-3.07
5804,-4.54
5805,-5.71
5806,-6.57
5807,-7.01
5808,-7.28
5809,-7.41
5810,-7.61
5811,-7.88
5812,-8.38
5813,-9.09
5814,-10.03
5815,-10.99
5816,-11.86
5817,-12.53
5818,-12.93
5819,-13.05
5820,-12.86
5821,-12.39
5822,-11.66
5823,-10.77
5824,-9.70
5825,-8.51
5826,-7.19
5827,-5.83
5828,-4.41
5829,-3.05
5830,-1.72
5831,-0.55
5832,0.52
5833,1.39
5834,2.17
5835,2.74
5836,3.16
5837,3.32
5838,3.30
5839,3.11
5840,2.82
5841,2.51
5842,2.27
5843,2.14
5844,2.14
5845,2.19
5846,2.30
5847,2.43
5848,2.53
5849,2.51
5850,2.40
5851,2.27
5852,2.29
5853,2.51
5854,2.93
5855,3.47
5856,4.17
5857,4.94
5858,5.71
5859,6.31
5860,6.71
5861,6.94
5862,7.08
5863,7.12
5864,7.13
5865,7.12
5866,7.19
5867,7.30
5868,7.41
5869,7.40
5870,7.32
5871,7.19
5872,7.06
5873,6.94
5874,6.84
5875,6.76
5876,6.79
5877,6.90
5878,7.13
5879,7.42
5880,7.81
5881,8.35
5882,9.05
5883,9.89
5884,10.81
5885,11.72
5886,12.54
5887,13.15
5888,13.42
5889,13.31
5890,12.82
5891,12.02
5892,11.03
5893,10.02
5894,9.08
5895,8.32
5896,7.64
5897,7.00
5898,6.29
5899,5.52
5900,4.65
5901,3.77
5902,2.85
5903,2.02
5904,1.30
5905,0.85
5906,0.59
5907,0.56
5908,0.60
5909,0.68
5910,0.69
5911,0.70
5912,0.69
5913,0.71
5914,0.66
5915,0.56
5916,0.35
5917,0.05
5918,-0.33
5919,-0.82
5920,-1.36
5921,-1.91
5922,-2.35
5923,-2.62
5924,-2.60
5925,-2.30
5926,-1.71
5927,-0.94
5928,-0.05
5929,0.82
5930,1.74
5931,2.62
5932,3.52
5933,4.38
5934,5.37
5935,6.49
5936,7.83
5937,9.25
5938,10.73
5939,12.11
5940,13.36
5941,14.37
5942,15.08
5943,15.37
5944,15.27
5945,14.78
5946,13.95
5947,12.82
5948,11.41
5949,9.84
5950,8.25
5951,6.87
5952,5.83
5953,5.24
5954,5.03
5955,5.18
5956,5.55
5957,6.07
5958,6.45
5959,6.60
5960,6.39
5961,5.98
5962,5.40
5963,4.81
5964,4.21
5965,3.75
5966,3.43
5967,3.20
5968,2.91
5969,2.50
5970,1.98
5971,1.44
5972,0.90
5973,0.43
5974,0.05
5975,-0.11
5976,-0.07
5977,0.18
5978,0.50
5979,0.82
5980,1.03
5981,1.16
5982,1.18
5983,1.14
5984,0.96
5985,0.66
5986,0.23
5987,-0.31
5988,-0.90
5989,-1.56
5990,-2.27
5991,-3.00
5992,-3.64
5993,-4.06
5994,-4.21
5995,-4.02
5996,-3.54
5997,-2.73
5998,-1.73
5999,-0.69
6000,0.12
6001,0.56
6002,0.53
6003,0.05
6004,-0.83
6005,-1.98
6006,-3.24
6007,-4.38
6008,-5.29
6009,-5.94
6010,-6.42
6011,-6.69
6012,-6.84
6013,-6.88
6014,-6.97
6015,-7.13
6016,-7.40
6017,-7.70
6018,-8.04
6019,-8.39
6020,-8.75
6021,-9.06
6022,-9.28
6023,-9.39
6024,-9.39
6025,-9.33
6026,-9.27
6027,-9.22
6028,-9.10
6029,-8.94
6030,-8.71
6031,-8.48
6032,-8.19
6033,-7.85
6034,-7.41
6035,-6.95
6036,-6.39
6037,-5.76
6038,-4.94
6039,-4.02
6040,-2.89
6041,-1.66
6042,-0.21
6043,1.17
6044,2.52
6045,3.62
6046,4.68
6047,5.57
6048,6.49
6049,7.42
6050,8.62
6051,10.06
6052,11.86
6053,13.83
6054,15.98
6055,17.98
6056,19.74
6057,21.05
6058,22.02
6059,22.57
6060,22.79
6061,22.72
6062,22.59
6063,22.43
6064,22.29
6065,22.05
6066,21.77
6067,21.39
6068,20.90
6069,20.25
6070,19.50
6071,18.77
6072,18.12
6073,17.71
6074,17.60
6075,17.86
6076,18.33
6077,18.90
6078,19.39
6079,19.78
6080,19.92
6081,19.81
6082,19.39
6083,18.81
6084,18.10
6085,17.40
6086,16.62
6087,15.82
6088,14.88
6089,13.89
6090,12.71
6091,11.42
6092,9.97
6093,8.55
6094,7.14
6095,5.91
6096,4.80
6097,3.94
6098,3.21
6099,2.64
6100,2.06
6101,1.56
6102,1.05
6103,0.64
6104,0.25
6105,-0.02
6106,-0.18
6107,-0.23
6108,-0.30
6109,-0.39
6110,-0.56
6111,-0.73
6112,-0.96
6113,-1.19
6114,-1.40
6115,-1.51
6116,-1.57
6117,-1.63
6118,-1.73
6119,-1.91
6120,-2.16
6121,-2.46
6122,-2.79
6123,-3.11
6124,-3.32
6125,-3.39
6126,-3.24
6127,-2.95
6128,-2.54
6129,-2.13
6130,-1.69
6131,-1.30
6132,-0.87
6133,-0.41
6134,0.21
6135,0.95
6136,1.89
6137,2.96
6138,4.20
6139,5.43
6140,6.63
6141,7.63
6142,8.52
6143,9.28
6144,9.97
6145,10.55
6146,11.11
6147,11.63
6148,12.18
6149,12.66
6150,13.00
6151,13.13
6152,13.02
6153,12.66
6154,12.04
6155,11.26
6156,10.41
6157,9.64
6158,8.93
6159,8.36
6160,7.83
6161,7.38
6162,6.90
6163,6.45
6164,5.91
6165,5.28
6166,4.40
6167,3.42
6168,2.27
6169,1.17
6170,0.00
6171,-1.09
6172,-2.23
6173,-3.27
6174,-4.36
6175,-5.40
6176,-6.53
6177,-7.64
6178,-8.80
6179,-9.92
6180,-11.05
6181,-12.05
6182,-12.93
6183,-13.58
6184,-14.03
6185,-14.24
6186,-14.33
6187,-14.38
6188,-14.51
6189,-14.69
6190,-14.82
6191,-14.85
6192,-14.69
6193,-14.27
6194,-13.48
6195,-12.34
6196,-10.98
6197,-9.57
6198,-8.29
6199,-7.26
6200,-6.65
6201,-6.46
6202,-6.66
6203,-7.10
6204,-7.68
6205,-8.33
6206,-9.01
6207,-9.67
6208,-10.31
6209,-10.96
6210,-11.68
6211,-12.45
6212,-13.25
6213,-13.98
6214,-14.58
6215,-14.92
6216,-15.01
6217,-14.89
6218,-14.66
6219,-14.35
6220,-13.97
6221,-13.55
6222,-13.17
6223,-12.87
6224,-12.61
6225,-12.32
6226,-11.95
6227,-11.54
6228,-11.10
6229,-10.69
6230,-10.24
6231,-9.83
6232,-9.49
6233,-9.26
6234,-9.06
6235,-8.90
6236,-8.74
6237,-8.56
6238,-8.30
6239,-7.96
6240,-7.53
6241,-7.11
6242,-6.70
6243,-6.36
6244,-6.05
6245,-5.82
6246,-5.60
6247,-5.45
6248,-5.28
6249,-5.06
6250,-4.64
6251,-4.05
6252,-3.33
6253,-2.61
6254,-1.91
6255,-1.33
6256,-0.86
6257,-0.56
6258,-0.40
6259,-0.34
6260,-0.37
6261,-0.43
6262,-0.48
6263,-0.49
6264,-0.45
6265,-0.44
6266,-0.52
6267,-0.69
6268,-0.99
6269,-1.34
6270,-1.73
6271,-2.08
6272,-2.43
6273,-2.71
6274,-2.98
6275,-3.27
6276,-3.68
6277,-4.20
6278,-4.84
6279,-5.56
6280,-6.39
6281,-7.29
6282,-8.18
6283,-8.96
6284,-9.60
6285,-10.06
6286,-10.39
6287,-10.57
6288,-10.62
6289,-10.55
6290,-10.41
6291,-10.24
6292,-10.06
6293,-9.88
6294,-9.65
6295,-9.44
6296,-9.17
6297,-8.83
6298,-8.25
6299,-7.44
6300,-6.37
6301,-5.19
6302,-3.81
6303,-2.41
6304,-0.98
6305,0.25
6306,1.34
6307,2.20
6308,3.00
6309,3.67
6310,4.40
6311,5.20
6312,6.29
6313,7.51
6314,8.88
6315,10.19
6316,11.47
6317,12.59
6318,13.50
6319,14.08
6320,14.44
6321,14.59
6322,14.68
6323,14.71
6324,14.81
6325,14.98
6326,15.28
6327,15.56
6328,15.78
6329,15.82
6330,15.82
6331,15.79
6332,15.84
6333,15.93
6334,16.22
6335,16.75
6336,17.56
6337,18.52
6338,19.51
6339,20.40
6340,21.23
6341,21.93
6342,22.51
6343,22.90
6344,23.26
6345,23.59
6346,24.00
6347,24.46
6348,25.07
6349,25.70
6350,26.38
6351,26.95
6352,27.53
6353,28.03
6354,28.60
6355,29.18
6356,29.88
6357,30.63
6358,31.51
6359,32.46
6360,33.50
6361,34.52
6362,35.42
6363,36.16
6364,36.68
6365,36.97
6366,37.00
6367,36.77
6368,36.30
6369,35.64
6370,34.79
6371,33.84
6372,32.84
6373,31.88
6374,30.96
6375,30.16
6376,29.38
6377,28.70
6378,27.93
6379,27.13
6380,26.16
6381,25.18
6382,24.07
6383,22.96
6384,21.76
6385,20.60
6386,19.39
6387,18.22
6388,16.96
6389,15.73
6390,14.49
6391,13.43
6392,12.51
6393,11.88
6394,11.45
6395,11.24
6396,11.08
6397,10.93
6398,10.65
6399,10.30
6400,9.87
6401,9.44
6402,9.09
6403,8.96
6404,9.16
6405,9.63
6406,10.33
6407,11.10
6408,11.94
6409,12.70
6410,13.41
6411,14.03
6412,14.76
6413,15.62
6414,16.79
6415,18.14
6416,19.70
6417,21.31
6418,22.97
6419,24.45
6420,25.67
6421,26.50
6422,27.03
6423,27.31
6424,27.42
6425,27.34
6426,27.15
6427,26.85
6428,26.46
6429,25.92
6430,25.21
6431,24.36
6432,23.50
6433,22.77
6434,22.23
6435,21.95
6436,21.88
6437,22.03
6438,22.22
6439,22.37
6440,22.31
6441,22.09
6442,21.68
6443,21.20
6444,20.65
6445,20.20
6446,19.84
6447,19.62
6448,19.36
6449,19.04
6450,18.55
6451,17.95
6452,17.21
6453,16.45
6454,15.72
6455,15.12
6456,14.61
6457,14.28
6458,14.08
6459,13.98
6460,13.78
6461,13.44
6462,12.95
6463,12.47
6464,12.00
6465,11.60
6466,11.23
6467,10.93
6468,10.70
6469,10.53
6470,10.38
6471,10.20
6472,9.98
6473,9.74
6474,9.52
6475,9.40
6476,9.39
6477,9.52
6478,9.77
6479,10.13
6480,10.55
6481,10.99
6482,11.36
6483,11.60
6484,11.63
6485,11.45
6486,11.15
6487,10.77
6488,10.36
6489,9.95
6490,9.58
6491,9.28
6492,9.02
6493,8.78
6494,8.57
6495,8.39
6496,8.24
6497,8.11
6498,8.04
6499,8.09
6500,8.33
6501,8.69
6502,9.12
6503,9.53
6504,9.97
6505,10.43
6506,10.97
6507,11.54
6508,12.25
6509,13.01
6510,13.87
6511,14.68
6512,15.48
6513,16.18
6514,16.88
6515,17.43
6516,17.94
6517,18.39
6518,19.04
6519,19.82
6520,20.86
6521,21.98
6522,23.28
6523,24.64
6524,26.02
6525,27.20
6526,28.21
6527,28.95
6528,29.56
6529,30.00
6530,30.48
6531,30.98
6532,31.63
6533,32.34
6534,33.16
6535,33.92
6536,34.58
6537,35.06
6538,35.42
6539,35.64
6540,35.74
6541,35.74
6542,35.74
6543,35.86
6544,36.06
6545,36.29
6546,36.27
6547,35.88
6548,34.93
6549,33.45
6550,31.45
6551,29.17
6552,26.76
6553,24.60
6554,22.88
6555,21.82
6556,21.35
6557,21.47
6558,21.90
6559,22.49
6560,22.87
6561,22.97
6562,22.64
6563,22.06
6564,21.22
6565,20.36
6566,19.40
6567,18.55
6568,17.65
6569,16.73
6570,15.56
6571,14.16
6572,12.43
6573,10.59
6574,8.66
6575,6.88
6576,5.26
6577,4.04
6578,3.15
6579,2.65
6580,2.31
6581,2.12
6582,1.87
6583,1.60
6584,1.17
6585,0.71
6586,0.21
6587,-0.12
6588,-0.32
6589,-0.36
6590,-0.37
6591,-0.35
6592,-0.35
6593,-0.41
6594,-0.60
6595,-0.90
6596,-1.22
6597,-1.46
6598,-1.61
6599,-1.66
6600,-1.64
6601,-1.51
6602,-1.34
6603,-1.21
6604,-1.25
6605,-1.48
6606,-1.87
6607,-2.35
6608,-2.94
6609,-3.60
6610,-4.24
6611,-4.75
6612,-4.97
6613,-4.92
6614,-4.58
6615,-4.04
6616,-3.33
6617,-2.56
6618,-1.75
6619,-0.98
6620,-0.24
6621,0.44
6622,1.21
6623,2.02
6624,2.97
6625,3.97
6626,5.05
6627,6.06
6628,7.00
6629,7.75
6630,8.39
6631,8.85
6632,9.19
6633,9.35
6634,9.43
6635,9.41
6636,9.38
6637,9.31
6638,9.26
6639,9.26
6640,9.30
6641,9.38
6642,9.42
6643,9.38
6644,9.12
6645,8.66
6646,7.96
6647,7.13
6648,6.15
6649,5.09
6650,3.91
6651,2.72
6652,1.56
6653,0.62
6654,-0.12
6655,-0.57
6656,-0.82
6657,-0.86
6658,-0.81
6659,-0.73
6660,-0.76
6661,-0.94
6662,-1.26
6663,-1.69
6664,-2.16
6665,-2.59
6666,-2.85
6667,-2.87
6668,-2.56
6669,-2.04
6670,-1.30
6671,-0.43
6672,0.68
6673,1.91
6674,3.28
6675,4.65
6676,6.05
6677,7.35
6678,8.52
6679,9.42
6680,10.05
6681,10.38
6682,10.52
6683,10.51
6684,10.46
6685,10.38
6686,10.31
6687,10.13
6688,9.82
6689,9.27
6690,8.49
6691,7.51
6692,6.52
6693,5.65
6694,5.08
6695,4.90
6696,5.16
6697,5.82
6698,6.78
6699,7.87
6700,8.96
6701,9.92
6702,10.69
6703,11.21
6704,11.57
6705,11.79
6706,11.99
6707,12.19
6708,12.60
6709,13.18
6710,13.99
6711,14.95
6712,16.01
6713,17.09
6714,18.13
6715,18.96
6716,19.51
6717,19.68
6718,19.54
6719,19.16
6720,18.67
6721,18.11
6722,17.59
6723,17.17
6724,16.91
6725,16.85
6726,16.96
6727,17.20
6728,17.54
6729,17.90
6730,18.23
6731,18.55
6732,18.81
6733,18.98
6734,19.04
6735,18.98
6736,18.85
6737,18.68
6738,18.40
6739,18.05
6740,17.66
6741,17.36
6742,17.18
6743,17.14
6744,17.13
6745,17.15
6746,17.11
6747,17.01
6748,16.73
6749,16.33
6750,15.79
6751,15.20
6752,14.55
6753,13.97
6754,13.44
6755,13.05
6756,12.64
6757,12.21
6758,11.54
6759,10.66
6760,9.50
6761,8.20
6762,6.75
6763,5.33
6764,3.94
6765,2.76
6766,1.79
6767,1.16
6768,0.74
6769,0.54
6770,0.38
6771,0.29
6772,0.14
6773,-0.02
6774,-0.25
6775,-0.53
6776,-0.93
6777,-1.40
6778,-1.95
6779,-2.49
6780,-2.98
6781,-3.40
6782,-3.78
6783,-4.08
6784,-4.23
6785,-4.26
6786,-4.10
6787,-3.81
6788,-3.30
6789,-2.59
6790,-1.69
6791,-0.68
6792,0.47
6793,1.70
6794,3.04
6795,4.36
6796,5.59
6797,6.61
6798,7.36
6799,7.77
6800,7.88
6801,7.73
6802,7.49
6803,7.24
6804,7.09
6805,7.01
6806,7.03
6807,7.10
6808,7.19
6809,7.19
6810,6.99
6811,6.56
6812,6.01
6813,5.46
6814,5.00
6815,4.69
6816,4.61
6817,4.79
6818,5.23
6819,5.84
6820,6.50
6821,7.11
6822,7.60
6823,7.95
6824,8.17
6825,8.29
6826,8.35
6827,8.34
6828,8.29
6829,8.22
6830,8.20
6831,8.19
6832,8.19
6833,8.13
6834,8.02
6835,7.90
6836,7.80
6837,7.74
6838,7.71
6839,7.71
6840,7.77
6841,7.89
6842,8.03
6843,8.16
6844,8.26
6845,8.38
6846,8.51
6847,8.64
6848,8.71
6849,8.73
6850,8.61
6851,8.39
6852,8.00
6853,7.48
6854,6.74
6855,5.87
6856,4.82
6857,3.76
6858,2.65
6859,1.59
6860,0.53
6861,-0.39
6862,-1.25
6863,-2.01
6864,-2.78
6865,-3.48
6866,-4.11
6867,-4.65
6868,-5.17
6869,-5.62
6870,-6.02
6871,-6.32
6872,-6.58
6873,-6.74
6874,-6.77
6875,-6.59
6876,-6.29
6877,-5.91
6878,-5.51
6879,-5.17
6880,-4.92
6881,-4.87
6882,-4.91
6883,-5.01
6884,-4.99
6885,-4.78
6886,-4.18
6887,-3.31
6888,-2.16
6889,-0.91
6890,0.44
6891,1.74
6892,2.94
6893,3.94
6894,4.84
6895,5.65
6896,6.49
6897,7.32
6898,8.15
6899,8.86
6900,9.45
6901,9.80
6902,9.89
6903,9.70
6904,9.32
6905,8.83
6906,8.30
6907,7.76
6908,7.22
6909,6.68
6910,6.15
6911,5.62
6912,5.07
6913,4.59
6914,4.23
6915,4.04
6916,4.05
6917,4.25
6918,4.55
6919,4.87
6920,5.06
6921,5.07
6922,4.86
6923,4.50
6924,4.03
6925,3.56
6926,3.11
6927,2.75
6928,2.48
6929,2.26
6930,1.98
6931,1.57
6932,0.96
6933,0.25
6934,-0.46
6935,-1.01
6936,-1.36
6937,-1.46
6938,-1.35
6939,-1.10
6940,-0.83
6941,-0.63
6942,-0.59
6943,-0.72
6944,-1.01
6945,-1.37
6946,-1.67
6947,-1.85
6948,-1.95
6949,-1.93
6950,-1.82
6951,-1.63
6952,-1.50
6953,-1.48
6954,-1.61
6955,-1.85
6956,-2.25
6957,-2.78
6958,-3.41
6959,-4.07
6960,-4.75
6961,-5.40
6962,-6.00
6963,-6.47
6964,-6.84
6965,-7.07
6966,-7.19
6967,-7.18
6968,-7.12
6969,-7.04
6970,-7.04
6971,-7.15
6972,-7.40
6973,-7.77
6974,-8.20
6975,-8.56
6976,-8.76
6977,-8.76
6978,-8.61
6979,-8.37
6980,-8.04
6981,-7.68
6982,-7.35
6983,-7.19
6984,-7.15
6985,-7.17
6986,-7.10
6987,-6.87
6988,-6.44
6989,-5.91
6990,-5.27
6991,-4.63
6992,-3.96
6993,-3.38
6994,-2.84
6995,-2.40
6996,-1.88
6997,-1.31
6998,-0.56
6999,0.31
7000,1.34
7001,2.40
7002,3.52
7003,4.51
7004,5.42
7005,6.10
7006,6.71
7007,7.27
7008,7.98
7009,8.79
7010,9.78
7011,10.84
7012,12.02
7013,13.20
7014,14.40
7015,15.47
7016,16.37
7017,17.02
7018,17.46
7019,17.68
7020,17.75
7021,17.63
7022,17.33
7023,16.90
7024,16.44
7025,16.01
7026,15.65
7027,15.29
7028,14.90
7029,14.43
7030,13.83
7031,13.11
7032,12.31
7033,11.59
7034,11.07
7035,10.95
7036,11.25
7037,12.00
7038,13.02
7039,14.14
7040,15.06
7041,15.62
7042,15.67
7043,15.32
7044,14.63
7045,13.79
7046,12.86
7047,12.03
7048,11.34
7049,10.83
7050,10.33
7051,9.77
7052,8.98
7053,8.02
7054,6.90
7055,5.84
7056,4.89
7057,4.18
7058,3.65
7059,3.32
7060,3.11
7061,3.01
7062,2.87
7063,2.71
7064,2.50
7065,2.32
7066,2.15
7067,2.11
7068,2.20
7069,2.45
7070,2.74
7071,3.00
7072,3.17
7073,3.23
7074,3.11
7075,2.82
7076,2.39
7077,1.90
7078,1.41
7079,1.00
7080,0.67
7081,0.44
7082,0.22
7083,-0.06
7084,-0.47
7085,-0.95
7086,-1.46
7087,-1.94
7088,-2.36
7089,-2.67
7090,-2.77
7091,-2.60
7092,-2.13
7093,-1.47
7094,-0.70
7095,0.06
7096,0.85
7097,1.62
7098,2.37
7099,3.07
7100,3.81
7101,4.57
7102,5.42
7103,6.24
7104,7.06
7105,7.76
7106,8.39
7107,8.91
7108,9.40
7109,9.80
7110,10.15
7111,10.38
7112,10.52
7113,10.57
7114,10.59
7115,10.52
7116,10.38
7117,10.19
7118,10.07
7119,10.07
7120,10.17
7121,10.36
7122,10.59
7123,10.84
7124,11.02
7125,11.04
7126,10.80
7127,10.26
7128,9.41
7129,8.40
7130,7.32
7131,6.31
7132,5.35
7133,4.52
7134,3.85
7135,3.39
7136,3.03
7137,2.69
7138,2.21
7139,1.64
7140,0.93
7141,0.17
7142,-0.71
7143,-1.60
7144,-2.42
7145,-3.03
7146,-3.40
7147,-3.51
7148,-3.36
7149,-3.01
7150,-2.47
7151,-1.82
7152,-1.04
7153,-0.16
7154,0.84
7155,1.91
7156,3.07
7157,4.20
7158,5.27
7159,6.16
7160,6.90
7161,7.42
7162,7.77
7163,7.87
7164,7.80
7165,7.61
7166,7.38
7167,7.08
7168,6.67
7169,6.06
7170,5.30
7171,4.45
7172,3.62
7173,2.88
7174,2.36
7175,2.11
7176,2.21
7177,2.63
7178,3.30
7179,4.09
7180,4.91
7181,5.68
7182,6.38
7183,6.97
7184,7.51
7185,7.97
7186,8.42
7187,8.81
7188,9.26
7189,9.77
7190,10.28
7191,10.68
7192,11.06
7193,10.76
7194,11.63
7195,14.28
7196,14.99
7197,9.92
7198,6.20
7199,17.83
7200,30.29
