1,-188.67
2,-250.00
3,-250.00
4,-250.00
5,-248.18
6,-229.01
7,-146.75
8,-5.02
9,135.81
10,223.45
11,249.99
12,249.99
13,247.64
14,249.82
15,249.99
16,249.99
17,249.99
18,247.04
19,228.89
20,197.23
21,158.14
22,123.23
23,98.63
24,83.01
25,73.71
26,67.53
27,64.97
28,63.80
29,63.58
30,61.99
31,59.94
32,56.24
33,52.24
34,47.23
35,42.62
36,38.04
37,34.21
38,30.53
39,27.28
40,24.08
41,21.29
42,18.55
43,16.14
44,13.70
45,11.61
46,9.55
47,7.82
48,6.05
49,4.51
50,2.96
51,1.65
52,0.32
53,-0.81
54,-1.94
55,-2.91
56,-3.93
57,-4.84
58,-5.77
59,-6.54
60,-7.32
61,-8.02
62,-8.79
63,-9.48
64,-10.18
65,-10.78
66,-11.40
67,-11.98
68,-12.57
69,-13.08
70,-13.60
71,-14.05
72,-14.54
73,-15.01
74,-15.49
75,-15.91
76,-16.37
77,-16.76
78,-17.17
79,-17.55
80,-17.96
81,-18.33
82,-18.68
83,-19.00
84,-19.37
85,-19.74
86,-20.14
87,-20.48
88,-20.84
89,-21.19
90,-21.58
91,-21.96
92,-22.32
93,-22.64
94,-22.98
95,-23.30
96,-23.61
97,-23.83
98,-24.03
99,-24.17
100,-24.31
101,-24.41
102,-24.52
103,-24.60
104,-24.67
105,-24.73
106,-24.80
107,-24.89
108,-24.99
109,-25.11
110,-25.27
111,-25.44
112,-25.62
113,-25.79
114,-26.00
115,-26.24
116,-26.50
117,-26.74
118,-26.93
119,-27.11
120,-27.32
121,-27.52
122,-27.68
123,-27.77
124,-27.85
125,-27.93
126,-28.02
127,-28.05
128,-28.03
129,-27.99
130,-27.97
131,-27.93
132,-27.89
133,-27.82
134,-27.78
135,-27.78
136,-27.80
137,-27.84
138,-27.88
139,-27.94
140,-28.02
141,-28.11
142,-28.21
143,-28.29
144,-28.36
145,-28.41
146,-28.50
147,-28.59
148,-28.67
149,-28.73
150,-28.78
151,-28.80
152,-28.82
153,-28.85
154,-28.88
155,-28.92
156,-28.95
157,-28.97
158,-29.00
159,-29.03
160,-29.06
161,-29.09
162,-29.13
163,-29.16
164,-29.17
165,-29.17
166,-29.16
167,-29.17
168,-29.17
169,-29.17
170,-29.14
171,-29.12
172,-29.11
173,-29.11
174,-29.07
175,-29.01
176,-28.99
177,-28.98
178,-28.95
179,-28.91
180,-28.87
181,-28.86
182,-28.85
183,-28.80
184,-28.72
185,-28.66
186,-28.59
187,-28.51
188,-28.40
189,-28.27
190,-28.14
191,-28.03
192,-27.95
193,-27.89
194,-27.81
195,-27.73
196,-27.66
197,-27.62
198,-27.60
199,-27.61
200,-27.64
201,-27.70
202,-27.77
203,-27.82
204,-27.89
205,-27.94
206,-28.01
207,-28.07
208,-28.13
209,-28.18
210,-28.24
211,-28.31
212,-28.37
213,-28.42
214,-28.49
215,-28.54
216,-28.59
217,-28.63
218,-28.66
219,-28.69
220,-28.68
221,-28.66
222,-28.64
223,-28.63
224,-28.61
225,-28.56
226,-28.48
227,-28.42
228,-28.34
229,-28.27
230,-28.18
231,-28.12
232,-28.07
233,-28.01
234,-27.94
235,-27.88
236,-27.83
237,-27.81
238,-27.77
239,-27.75
240,-27.74
241,-27.74
242,-27.73
243,-27.70
244,-27.66
245,-27.63
246,-27.62
247,-27.62
248,-27.60
249,-27.58
250,-27.57
251,-27.57
252,-27.54
253,-27.53
254,-27.50
255,-27.47
256,-27.37
257,-27.23
258,-27.07
259,-26.92
260,-26.76
261,-26.56
262,-26.32
263,-26.07
264,-25.82
265,-25.58
266,-25.37
267,-25.20
268,-25.05
269,-24.93
270,-24.83
271,-24.77
272,-24.76
273,-24.77
274,-24.75
275,-24.72
276,-24.70
277,-24.70
278,-24.70
279,-24.67
280,-24.62
281,-24.60
282,-24.60
283,-24.60
284,-24.57
285,-24.51
286,-24.44
287,-24.41
288,-24.39
289,-24.37
290,-24.33
291,-24.30
292,-24.26
293,-24.24
294,-24.22
295,-24.19
296,-24.12
297,-24.02
298,-23.96
299,-23.94
300,-23.91
301,-23.85
302,-23.78
303,-23.74
304,-23.76
305,-23.80
306,-23.81
307,-23.81
308,-23.82
309,-23.85
310,-23.89
311,-23.92
312,-23.95
313,-23.97
314,-24.00
315,-24.06
316,-24.15
317,-24.25
318,-24.29
319,-24.29
320,-24.29
321,-24.31
322,-24.37
323,-24.40
324,-24.41
325,-24.41
326,-24.41
327,-24.41
328,-24.40
329,-24.41
330,-24.43
331,-24.46
332,-24.46
333,-24.43
334,-24.40
335,-24.36
336,-24.31
337,-24.23
338,-24.12
339,-23.99
340,-23.85
341,-23.71
342,-23.60
343,-23.50
344,-23.40
345,-23.32
346,-23.27
347,-23.26
348,-23.28
349,-23.32
350,-23.39
351,-23.51
352,-23.63
353,-23.75
354,-23.89
355,-24.04
356,-24.17
357,-24.23
358,-24.24
359,-24.24
360,-24.25
361,-24.25
362,-24.22
363,-24.15
364,-24.08
365,-24.02
366,-23.97
367,-23.94
368,-23.93
369,-23.92
370,-23.95
371,-24.01
372,-24.09
373,-24.19
374,-24.29
375,-24.40
376,-24.53
377,-24.69
378,-24.87
379,-25.04
380,-25.18
381,-25.31
382,-25.45
383,-25.63
384,-25.80
385,-25.92
386,-26.00
387,-26.05
388,-26.12
389,-26.17
390,-26.21
391,-26.24
392,-26.29
393,-26.34
394,-26.38
395,-26.42
396,-26.49
397,-26.57
398,-26.63
399,-26.67
400,-26.72
401,-26.79
402,-26.89
403,-26.95
404,-27.00
405,-27.05
406,-27.13
407,-27.22
408,-27.32
409,-27.40
410,-27.47
411,-27.53
412,-27.62
413,-27.70
414,-27.77
415,-27.80
416,-27.83
417,-27.89
418,-27.95
419,-28.02
420,-28.07
421,-28.12
422,-28.18
423,-28.24
424,-28.31
425,-28.37
426,-28.43
427,-28.47
428,-28.55
429,-28.63
430,-28.76
431,-28.87
432,-28.98
433,-29.10
434,-29.24
435,-29.42
436,-29.63
437,-29.83
438,-30.05
439,-30.28
440,-30.57
441,-30.86
442,-31.14
443,-31.38
444,-31.61
445,-31.84
446,-32.10
447,-32.33
448,-32.55
449,-32.72
450,-32.88
451,-32.99
452,-33.07
453,-33.13
454,-33.20
455,-33.25
456,-33.26
457,-33.23
458,-33.23
459,-33.22
460,-33.16
461,-33.09
462,-33.03
463,-32.99
464,-32.94
465,-32.86
466,-32.77
467,-32.70
468,-32.63
469,-32.55
470,-32.45
471,-32.36
472,-32.27
473,-32.19
474,-32.10
475,-32.01
476,-31.94
477,-31.87
478,-31.81
479,-31.75
480,-31.72
481,-31.68
482,-31.64
483,-31.62
484,-31.62
485,-31.65
486,-31.67
487,-31.67
488,-31.68
489,-31.71
490,-31.73
491,-31.76
492,-31.83
493,-31.91
494,-31.99
495,-32.05
496,-32.14
497,-32.24
498,-32.38
499,-32.51
500,-32.62
501,-32.70
502,-32.77
503,-32.83
504,-32.91
505,-33.00
506,-33.07
507,-33.10
508,-33.10
509,-33.09
510,-33.10
511,-33.13
512,-33.16
513,-33.20
514,-33.24
515,-33.29
516,-33.36
517,-33.42
518,-33.49
519,-33.55
520,-33.60
521,-33.63
522,-33.62
523,-33.60
524,-33.57
525,-33.54
526,-33.49
527,-33.43
528,-33.36
529,-33.31
530,-33.23
531,-33.15
532,-33.04
533,-32.96
534,-32.90
535,-32.84
536,-32.75
537,-32.63
538,-32.50
539,-32.39
540,-32.25
541,-32.11
542,-31.94
543,-31.76
544,-31.56
545,-31.36
546,-31.15
547,-30.98
548,-30.80
549,-30.63
550,-30.46
551,-30.30
552,-30.16
553,-30.04
554,-29.96
555,-29.90
556,-29.85
557,-29.83
558,-29.82
559,-29.82
560,-29.80
561,-29.77
562,-29.77
563,-29.80
564,-29.83
565,-29.83
566,-29.82
567,-29.82
568,-29.84
569,-29.87
570,-29.89
571,-29.89
572,-29.88
573,-29.88
574,-29.90
575,-29.93
576,-29.95
577,-29.95
578,-29.95
579,-29.94
580,-29.95
581,-29.95
582,-29.93
583,-29.90
584,-29.88
585,-29.88
586,-29.90
587,-29.93
588,-29.94
589,-29.95
590,-29.95
591,-29.98
592,-30.03
593,-30.08
594,-30.14
595,-30.20
596,-30.26
597,-30.30
598,-30.30
599,-30.26
600,-30.20
601,-30.14
602,-30.08
603,-30.00
604,-29.87
605,-29.72
606,-29.58
607,-29.50
608,-29.43
609,-29.37
610,-29.34
611,-29.33
612,-29.38
613,-29.46
614,-29.57
615,-29.69
616,-29.84
617,-29.98
618,-30.13
619,-30.25
620,-30.34
621,-30.40
622,-30.43
623,-30.43
624,-30.42
625,-30.38
626,-30.32
627,-30.23
628,-30.13
629,-30.08
630,-30.06
631,-30.05
632,-30.04
633,-30.01
634,-30.01
635,-30.04
636,-30.08
637,-30.11
638,-30.14
639,-30.16
640,-30.17
641,-30.18
642,-30.17
643,-30.14
644,-30.08
645,-30.00
646,-29.91
647,-29.81
648,-29.70
649,-29.59
650,-29.46
651,-29.35
652,-29.22
653,-29.11
654,-29.00
655,-28.92
656,-28.81
657,-28.69
658,-28.58
659,-28.49
660,-28.41
661,-28.33
662,-28.21
663,-28.05
664,-27.91
665,-27.79
666,-27.68
667,-27.57
668,-27.44
669,-27.31
670,-27.21
671,-27.12
672,-27.03
673,-26.95
674,-26.88
675,-26.85
676,-26.84
677,-26.85
678,-26.85
679,-26.85
680,-26.84
681,-26.84
682,-26.86
683,-26.89
684,-26.91
685,-26.92
686,-26.92
687,-26.92
688,-26.88
689,-26.82
690,-26.77
691,-26.70
692,-26.60
693,-26.49
694,-26.41
695,-26.34
696,-26.25
697,-26.13
698,-26.04
699,-26.00
700,-25.99
701,-25.97
702,-25.95
703,-25.95
704,-25.95
705,-25.95
706,-25.96
707,-25.99
708,-26.02
709,-26.02
710,-25.99
711,-25.93
712,-25.86
713,-25.77
714,-25.65
715,-25.50
716,-25.34
717,-25.19
718,-25.05
719,-24.89
720,-24.74
721,-24.60
722,-24.45
723,-24.33
724,-24.25
725,-24.22
726,-24.22
727,-24.22
728,-24.22
729,-24.26
730,-24.31
731,-24.38
732,-24.43
733,-24.46
734,-24.48
735,-24.48
736,-24.46
737,-24.43
738,-24.38
739,-24.32
740,-24.24
741,-24.15
742,-24.05
743,-23.93
744,-23.80
745,-23.69
746,-23.61
747,-23.59
748,-23.57
749,-23.54
750,-23.50
751,-23.50
752,-23.55
753,-23.64
754,-23.72
755,-23.79
756,-23.84
757,-23.90
758,-23.96
759,-23.99
760,-23.98
761,-23.95
762,-23.92
763,-23.89
764,-23.86
765,-23.82
766,-23.80
767,-23.80
768,-23.83
769,-23.85
770,-23.89
771,-23.95
772,-24.04
773,-24.16
774,-24.28
775,-24.37
776,-24.44
777,-24.51
778,-24.54
779,-24.54
780,-24.51
781,-24.48
782,-24.45
783,-24.42
784,-24.39
785,-24.36
786,-24.32
787,-24.29
788,-24.28
789,-24.28
790,-24.28
791,-24.28
792,-24.31
793,-24.37
794,-24.44
795,-24.50
796,-24.55
797,-24.60
798,-24.70
799,-24.78
800,-24.83
801,-24.87
802,-24.92
803,-24.97
804,-25.01
805,-25.02
806,-25.00
807,-24.97
808,-24.89
809,-24.77
810,-24.64
811,-24.49
812,-24.30
813,-24.06
814,-23.81
815,-23.57
816,-23.34
817,-23.11
818,-22.87
819,-22.66
820,-22.49
821,-22.38
822,-22.27
823,-22.19
824,-22.13
825,-22.09
826,-22.06
827,-22.05
828,-22.03
829,-22.03
830,-22.01
831,-21.99
832,-21.97
833,-21.97
834,-21.97
835,-21.97
836,-21.99
837,-22.00
838,-22.03
839,-22.06
840,-22.13
841,-22.22
842,-22.32
843,-22.41
844,-22.51
845,-22.61
846,-22.74
847,-22.87
848,-22.99
849,-23.07
850,-23.13
851,-23.16
852,-23.17
853,-23.17
854,-23.15
855,-23.09
856,-23.01
857,-22.95
858,-22.91
859,-22.88
860,-22.84
861,-22.81
862,-22.80
863,-22.83
864,-22.90
865,-22.99
866,-23.10
867,-23.22
868,-23.35
869,-23.46
870,-23.57
871,-23.66
872,-23.76
873,-23.87
874,-23.99
875,-24.08
876,-24.15
877,-24.20
878,-24.27
879,-24.36
880,-24.48
881,-24.60
882,-24.68
883,-24.74
884,-24.83
885,-24.94
886,-25.05
887,-25.15
888,-25.24
889,-25.32
890,-25.40
891,-25.47
892,-25.53
893,-25.57
894,-25.60
895,-25.60
896,-25.62
897,-25.64
898,-25.65
899,-25.62
900,-25.60
901,-25.63
902,-25.68
903,-25.71
904,-25.72
905,-25.71
906,-25.73
907,-25.79
908,-25.88
909,-25.97
910,-26.08
911,-26.19
912,-26.31
913,-26.42
914,-26.57
915,-26.75
916,-26.94
917,-27.11
918,-27.28
919,-27.43
920,-27.59
921,-27.73
922,-27.85
923,-27.94
924,-28.02
925,-28.10
926,-28.21
927,-28.30
928,-28.36
929,-28.41
930,-28.50
931,-28.63
932,-28.76
933,-28.86
934,-28.99
935,-29.14
936,-29.31
937,-29.46
938,-29.59
939,-29.70
940,-29.82
941,-29.95
942,-30.05
943,-30.11
944,-30.11
945,-30.09
946,-30.05
947,-29.99
948,-29.88
949,-29.72
950,-29.58
951,-29.46
952,-29.33
953,-29.18
954,-29.05
955,-28.95
956,-28.88
957,-28.87
958,-28.88
959,-28.94
960,-29.03
961,-29.15
962,-29.32
963,-29.49
964,-29.64
965,-29.77
966,-29.90
967,-30.04
968,-30.17
969,-30.27
970,-30.34
971,-30.40
972,-30.42
973,-30.43
974,-30.44
975,-30.46
976,-30.48
977,-30.49
978,-30.49
979,-30.53
980,-30.55
981,-30.55
982,-30.54
983,-30.54
984,-30.53
985,-30.50
986,-30.45
987,-30.38
988,-30.34
989,-30.31
990,-30.27
991,-30.21
992,-30.13
993,-30.08
994,-30.07
995,-30.06
996,-30.03
997,-30.01
998,-30.04
999,-30.12
1000,-30.19
1001,-30.23
1002,-30.27
1003,-30.36
1004,-30.46
1005,-30.53
1006,-30.57
1007,-30.59
1008,-30.58
1009,-30.56
1010,-30.54
1011,-30.50
1012,-30.42
1013,-30.31
1014,-30.20
1015,-30.08
1016,-29.90
1017,-29.69
1018,-29.50
1019,-29.36
1020,-29.19
1021,-28.99
1022,-28.76
1023,-28.58
1024,-28.44
1025,-28.33
1026,-28.20
1027,-28.09
1028,-28.01
1029,-27.95
1030,-27.85
1031,-27.77
1032,-27.73
1033,-27.73
1034,-27.73
1035,-27.70
1036,-27.66
1037,-27.66
1038,-27.69
1039,-27.73
1040,-27.75
1041,-27.78
1042,-27.82
1043,-27.89
1044,-27.93
1045,-27.96
1046,-28.01
1047,-28.07
1048,-28.12
1049,-28.15
1050,-28.15
1051,-28.15
1052,-28.18
1053,-28.20
1054,-28.22
1055,-28.22
1056,-28.23
1057,-28.22
1058,-28.19
1059,-28.14
1060,-28.06
1061,-28.00
1062,-27.95
1063,-27.89
1064,-27.81
1065,-27.72
1066,-27.65
1067,-27.62
1068,-27.63
1069,-27.66
1070,-27.70
1071,-27.76
1072,-27.82
1073,-27.88
1074,-27.95
1075,-28.05
1076,-28.16
1077,-28.24
1078,-28.27
1079,-28.27
1080,-28.28
1081,-28.28
1082,-28.24
1083,-28.15
1084,-28.08
1085,-28.04
1086,-28.02
1087,-28.00
1088,-27.95
1089,-27.92
1090,-27.92
1091,-27.92
1092,-27.91
1093,-27.91
1094,-27.94
1095,-28.00
1096,-28.07
1097,-28.10
1098,-28.09
1099,-28.09
1100,-28.13
1101,-28.18
1102,-28.24
1103,-28.27
1104,-28.31
1105,-28.36
1106,-28.40
1107,-28.44
1108,-28.48
1109,-28.50
1110,-28.48
1111,-28.43
1112,-28.38
1113,-28.35
1114,-28.30
1115,-28.21
1116,-28.11
1117,-28.02
1118,-27.93
1119,-27.84
1120,-27.76
1121,-27.66
1122,-27.57
1123,-27.48
1124,-27.42
1125,-27.39
1126,-27.36
1127,-27.34
1128,-27.31
1129,-27.31
1130,-27.33
1131,-27.36
1132,-27.41
1133,-27.47
1134,-27.53
1135,-27.59
1136,-27.65
1137,-27.72
1138,-27.76
1139,-27.79
1140,-27.79
1141,-27.80
1142,-27.79
1143,-27.76
1144,-27.69
1145,-27.57
1146,-27.44
1147,-27.32
1148,-27.20
1149,-27.05
1150,-26.88
1151,-26.66
1152,-26.44
1153,-26.22
1154,-26.05
1155,-25.90
1156,-25.77
1157,-25.65
1158,-25.55
1159,-25.49
1160,-25.46
1161,-25.47
1162,-25.49
1163,-25.52
1164,-25.54
1165,-25.57
1166,-25.63
1167,-25.72
1168,-25.81
1169,-25.87
1170,-25.91
1171,-25.94
1172,-25.96
1173,-25.96
1174,-25.95
1175,-25.92
1176,-25.87
1177,-25.84
1178,-25.83
1179,-25.84
1180,-25.83
1181,-25.79
1182,-25.76
1183,-25.76
1184,-25.79
1185,-25.83
1186,-25.83
1187,-25.79
1188,-25.75
1189,-25.83
1190,-25.78
1191,-25.61
1192,-25.41
1193,-26.68
1194,-26.70
1195,-23.35
1196,-21.14
1197,-27.92
1198,-36.13
1199,-23.86
1200,1.30
