1,-38.28
2,-50.00
3,-50.00
4,-44.56
5,-46.46
6,-50.00
7,-50.00
8,-25.22
9,25.16
10,50.00
11,50.00
12,48.72
13,45.11
14,49.72
15,50.00
16,50.00
17,49.22
18,49.75
19,50.00
20,50.00
21,50.00
22,50.00
23,50.00
24,50.00
25,50.00
26,50.00
27,50.00
28,50.00
29,50.00
30,50.00
31,50.00
32,50.00
33,50.00
34,50.00
35,50.00
36,50.00
37,50.00
38,50.00
39,50.00
40,50.00
41,50.00
42,50.00
43,50.00
44,50.00
45,50.00
46,50.00
47,50.00
48,49.95
49,50.00
50,50.00
51,49.85
52,48.84
53,47.27
54,45.53
55,44.08
56,42.76
57,41.52
58,40.21
59,39.00
60,37.82
61,36.73
62,35.59
63,34.53
64,33.42
65,32.42
66,31.37
67,30.42
68,29.44
69,28.55
70,27.63
71,26.80
72,25.95
73,25.18
74,24.39
75,23.69
76,22.96
77,22.31
78,21.61
79,20.97
80,20.30
81,19.69
82,19.04
83,18.45
84,17.82
85,17.24
86,16.64
87,16.10
88,15.53
89,15.03
90,14.51
91,14.06
92,13.58
93,13.15
94,12.70
95,12.30
96,11.89
97,11.51
98,11.13
99,10.78
100,10.42
101,10.08
102,9.73
103,9.41
104,9.07
105,8.76
106,8.43
107,8.13
108,7.81
109,7.51
110,7.21
111,6.92
112,6.63
113,6.37
114,6.12
115,5.90
116,5.70
117,5.53
118,5.39
119,5.29
120,5.21
121,5.17
122,5.16
123,5.18
124,5.23
125,5.29
126,5.36
127,5.42
128,5.49
129,5.56
130,5.62
131,5.68
132,5.71
133,5.72
134,5.70
135,5.65
136,5.59
137,5.51
138,5.40
139,5.28
140,5.14
141,4.99
142,4.82
143,4.66
144,4.48
145,4.32
146,4.16
147,4.01
148,3.87
149,3.74
150,3.61
151,3.49
152,3.38
153,3.27
154,3.16
155,3.05
156,2.92
157,2.79
158,2.62
159,2.46
160,2.27
161,2.06
162,1.82
163,1.59
164,1.33
165,1.09
166,0.84
167,0.60
168,0.35
169,0.13
170,-0.08
171,-0.25
172,-0.41
173,-0.53
174,-0.63
175,-0.70
176,-0.75
177,-0.76
178,-0.76
179,-0.73
180,-0.70
181,-0.65
182,-0.60
183,-0.54
184,-0.48
185,-0.42
186,-0.39
187,-0.36
188,-0.35
189,-0.34
190,-0.35
191,-0.37
192,-0.40
193,-0.44
194,-0.48
195,-0.52
196,-0.55
197,-0.56
198,-0.54
199,-0.49
200,-0.40
201,-0.29
202,-0.13
203,0.06
204,0.29
205,0.53
206,0.80
207,1.08
208,1.38
209,1.67
210,1.95
211,2.21
212,2.49
213,2.74
214,2.99
215,3.21
216,3.43
217,3.63
218,3.83
219,4.00
220,4.18
221,4.34
222,4.50
223,4.63
224,4.76
225,4.87
226,4.98
227,5.06
228,5.14
229,5.20
230,5.27
231,5.33
232,5.38
233,5.42
234,5.47
235,5.50
236,5.53
237,5.55
238,5.55
239,5.54
240,5.53
241,5.51
242,5.49
243,5.46
244,5.43
245,5.42
246,5.41
247,5.42
248,5.44
249,5.46
250,5.49
251,5.53
252,5.56
253,5.59
254,5.60
255,5.59
256,5.57
257,5.53
258,5.47
259,5.41
260,5.33
261,5.27
262,5.21
263,5.16
264,5.11
265,5.07
266,5.05
267,5.05
268,5.06
269,5.07
270,5.08
271,5.08
272,5.06
273,5.05
274,5.01
275,4.96
276,4.88
277,4.80
278,4.70
279,4.59
280,4.48
281,4.35
282,4.21
283,4.08
284,3.96
285,3.85
286,3.74
287,3.64
288,3.56
289,3.49
290,3.44
291,3.40
292,3.35
293,3.32
294,3.29
295,3.26
296,3.22
297,3.17
298,3.11
299,3.05
300,2.98
301,2.90
302,2.81
303,2.73
304,2.65
305,2.57
306,2.49
307,2.42
308,2.37
309,2.32
310,2.29
311,2.26
312,2.24
313,2.22
314,2.21
315,2.19
316,2.15
317,2.13
318,2.10
319,2.06
320,2.00
321,1.92
322,1.83
323,1.73
324,1.62
325,1.51
326,1.40
327,1.30
328,1.22
329,1.15
330,1.11
331,1.10
332,1.13
333,1.17
334,1.21
335,1.27
336,1.33
337,1.40
338,1.45
339,1.49
340,1.49
341,1.46
342,1.39
343,1.29
344,1.15
345,0.98
346,0.77
347,0.55
348,0.31
349,0.07
350,-0.19
351,-0.44
352,-0.69
353,-0.91
354,-1.11
355,-1.28
356,-1.43
357,-1.54
358,-1.64
359,-1.70
360,-1.75
361,-1.78
362,-1.80
363,-1.81
364,-1.83
365,-1.85
366,-1.87
367,-1.90
368,-1.95
369,-2.00
370,-2.07
371,-2.14
372,-2.21
373,-2.29
374,-2.38
375,-2.47
376,-2.56
377,-2.65
378,-2.75
379,-2.84
380,-2.93
381,-3.00
382,-3.08
383,-3.14
384,-3.19
385,-3.22
386,-3.24
387,-3.25
388,-3.26
389,-3.26
390,-3.26
391,-3.27
392,-3.29
393,-3.31
394,-3.36
395,-3.42
396,-3.49
397,-3.57
398,-3.67
399,-3.75
400,-3.83
401,-3.90
402,-3.96
403,-4.00
404,-4.03
405,-4.03
406,-4.01
407,-3.99
408,-3.96
409,-3.94
410,-3.92
411,-3.91
412,-3.91
413,-3.92
414,-3.94
415,-3.98
416,-4.03
417,-4.09
418,-4.16
419,-4.23
420,-4.32
421,-4.40
422,-4.49
423,-4.57
424,-4.66
425,-4.75
426,-4.86
427,-4.96
428,-5.07
429,-5.18
430,-5.30
431,-5.42
432,-5.54
433,-5.65
434,-5.77
435,-5.88
436,-5.99
437,-6.10
438,-6.19
439,-6.27
440,-6.34
441,-6.40
442,-6.46
443,-6.51
444,-6.55
445,-6.58
446,-6.61
447,-6.64
448,-6.68
449,-6.73
450,-6.79
451,-6.86
452,-6.94
453,-7.03
454,-7.14
455,-7.25
456,-7.36
457,-7.47
458,-7.57
459,-7.66
460,-7.75
461,-7.81
462,-7.85
463,-7.87
464,-7.87
465,-7.85
466,-7.81
467,-7.75
468,-7.69
469,-7.62
470,-7.53
471,-7.44
472,-7.35
473,-7.26
474,-7.17
475,-7.08
476,-7.00
477,-6.93
478,-6.85
479,-6.77
480,-6.69
481,-6.61
482,-6.54
483,-6.47
484,-6.42
485,-6.37
486,-6.33
487,-6.29
488,-6.27
489,-6.26
490,-6.26
491,-6.27
492,-6.29
493,-6.32
494,-6.36
495,-6.42
496,-6.49
497,-6.57
498,-6.67
499,-6.77
500,-6.89
501,-7.01
502,-7.13
503,-7.25
504,-7.36
505,-7.46
506,-7.55
507,-7.62
508,-7.67
509,-7.70
510,-7.69
511,-7.66
512,-7.61
513,-7.53
514,-7.41
515,-7.29
516,-7.15
517,-7.00
518,-6.84
519,-6.67
520,-6.49
521,-6.32
522,-6.12
523,-5.93
524,-5.71
525,-5.47
526,-5.21
527,-4.93
528,-4.62
529,-4.30
530,-3.94
531,-3.60
532,-3.25
533,-2.92
534,-2.58
535,-2.28
536,-1.99
537,-1.75
538,-1.53
539,-1.35
540,-1.19
541,-1.09
542,-0.99
543,-0.93
544,-0.86
545,-0.81
546,-0.76
547,-0.71
548,-0.66
549,-0.63
550,-0.59
551,-0.55
552,-0.52
553,-0.51
554,-0.50
555,-0.52
556,-0.56
557,-0.63
558,-0.71
559,-0.80
560,-0.90
561,-1.02
562,-1.16
563,-1.31
564,-1.45
565,-1.58
566,-1.70
567,-1.81
568,-1.91
569,-2.00
570,-2.08
571,-2.13
572,-2.18
573,-2.22
574,-2.25
575,-2.28
576,-2.31
577,-2.34
578,-2.39
579,-2.44
580,-2.50
581,-2.56
582,-2.63
583,-2.70
584,-2.78
585,-2.85
586,-2.93
587,-2.98
588,-3.02
589,-3.05
590,-3.06
591,-3.06
592,-3.03
593,-2.98
594,-2.92
595,-2.86
596,-2.79
597,-2.71
598,-2.65
599,-2.60
600,-2.58
601,-2.58
602,-2.61
603,-2.67
604,-2.78
605,-2.91
606,-3.08
607,-3.27
608,-3.49
609,-3.71
610,-3.94
611,-4.14
612,-4.34
613,-4.51
614,-4.66
615,-4.77
616,-4.84
617,-4.89
618,-4.91
619,-4.91
620,-4.88
621,-4.84
622,-4.80
623,-4.76
624,-4.73
625,-4.70
626,-4.67
627,-4.65
628,-4.64
629,-4.63
630,-4.62
631,-4.62
632,-4.61
633,-4.61
634,-4.58
635,-4.55
636,-4.51
637,-4.48
638,-4.44
639,-4.39
640,-4.33
641,-4.27
642,-4.21
643,-4.16
644,-4.11
645,-4.06
646,-4.01
647,-3.97
648,-3.92
649,-3.87
650,-3.81
651,-3.76
652,-3.68
653,-3.61
654,-3.54
655,-3.47
656,-3.40
657,-3.33
658,-3.25
659,-3.19
660,-3.12
661,-3.07
662,-3.00
663,-2.95
664,-2.89
665,-2.84
666,-2.78
667,-2.71
668,-2.62
669,-2.53
670,-2.42
671,-2.30
672,-2.17
673,-2.03
674,-1.90
675,-1.77
676,-1.65
677,-1.53
678,-1.43
679,-1.35
680,-1.30
681,-1.27
682,-1.26
683,-1.28
684,-1.34
685,-1.43
686,-1.55
687,-1.67
688,-1.81
689,-1.97
690,-2.14
691,-2.33
692,-2.53
693,-2.73
694,-2.96
695,-3.18
696,-3.42
697,-3.65
698,-3.88
699,-4.10
700,-4.32
701,-4.52
702,-4.71
703,-4.88
704,-5.03
705,-5.16
706,-5.26
707,-5.33
708,-5.39
709,-5.44
710,-5.48
711,-5.50
712,-5.51
713,-5.53
714,-5.55
715,-5.56
716,-5.57
717,-5.56
718,-5.57
719,-5.58
720,-5.60
721,-5.62
722,-5.64
723,-5.67
724,-5.71
725,-5.76
726,-5.80
727,-5.83
728,-5.84
729,-5.85
730,-5.82
731,-5.78
732,-5.68
733,-5.55
734,-5.34
735,-5.11
736,-4.81
737,-4.48
738,-4.09
739,-3.67
740,-3.21
741,-2.76
742,-2.27
743,-1.81
744,-1.33
745,-0.87
746,-0.40
747,0.03
748,0.46
749,0.84
750,1.22
751,1.56
752,1.89
753,2.17
754,2.44
755,2.65
756,2.85
757,2.99
758,3.10
759,3.16
760,3.18
761,3.18
762,3.16
763,3.10
764,3.03
765,2.93
766,2.82
767,2.71
768,2.60
769,2.49
770,2.38
771,2.27
772,2.16
773,2.05
774,1.93
775,1.82
776,1.70
777,1.59
778,1.47
779,1.36
780,1.25
781,1.16
782,1.07
783,1.00
784,0.94
785,0.89
786,0.83
787,0.79
788,0.75
789,0.71
790,0.65
791,0.59
792,0.54
793,0.49
794,0.45
795,0.40
796,0.37
797,0.36
798,0.37
799,0.40
800,0.44
801,0.51
802,0.59
803,0.67
804,0.76
805,0.84
806,0.91
807,0.95
808,0.97
809,0.96
810,0.93
811,0.87
812,0.79
813,0.68
814,0.56
815,0.43
816,0.32
817,0.22
818,0.13
819,0.07
820,0.02
821,0.01
822,0.02
823,0.05
824,0.09
825,0.15
826,0.20
827,0.25
828,0.28
829,0.29
830,0.27
831,0.23
832,0.15
833,0.06
834,-0.06
835,-0.20
836,-0.37
837,-0.53
838,-0.69
839,-0.85
840,-1.00
841,-1.14
842,-1.27
843,-1.37
844,-1.46
845,-1.53
846,-1.59
847,-1.62
848,-1.63
849,-1.63
850,-1.61
851,-1.57
852,-1.53
853,-1.48
854,-1.43
855,-1.37
856,-1.28
857,-1.20
858,-1.12
859,-1.05
860,-0.98
861,-0.90
862,-0.83
863,-0.76
864,-0.70
865,-0.64
866,-0.58
867,-0.53
868,-0.46
869,-0.38
870,-0.30
871,-0.23
872,-0.14
873,-0.04
874,0.08
875,0.19
876,0.31
877,0.41
878,0.52
879,0.63
880,0.73
881,0.81
882,0.88
883,0.94
884,0.96
885,0.95
886,0.92
887,0.87
888,0.82
889,0.76
890,0.69
891,0.60
892,0.53
893,0.48
894,0.44
895,0.42
896,0.41
897,0.41
898,0.42
899,0.45
900,0.47
901,0.48
902,0.47
903,0.46
904,0.42
905,0.37
906,0.29
907,0.20
908,0.09
909,-0.01
910,-0.13
911,-0.25
912,-0.38
913,-0.49
914,-0.61
915,-0.72
916,-0.84
917,-0.96
918,-1.09
919,-1.21
920,-1.33
921,-1.45
922,-1.56
923,-1.66
924,-1.76
925,-1.84
926,-1.91
927,-1.98
928,-2.03
929,-2.07
930,-2.10
931,-2.13
932,-2.16
933,-2.19
934,-2.24
935,-2.30
936,-2.38
937,-2.48
938,-2.61
939,-2.73
940,-2.87
941,-3.00
942,-3.13
943,-3.25
944,-3.36
945,-3.46
946,-3.56
947,-3.63
948,-3.68
949,-3.71
950,-3.74
951,-3.76
952,-3.79
953,-3.80
954,-3.82
955,-3.85
956,-3.89
957,-3.93
958,-3.96
959,-4.01
960,-4.06
961,-4.11
962,-4.16
963,-4.18
964,-4.18
965,-4.17
966,-4.16
967,-4.13
968,-4.08
969,-4.03
970,-3.98
971,-3.94
972,-3.92
973,-3.91
974,-3.92
975,-3.94
976,-3.98
977,-4.04
978,-4.11
979,-4.18
980,-4.25
981,-4.32
982,-4.40
983,-4.48
984,-4.54
985,-4.59
986,-4.64
987,-4.68
988,-4.71
989,-4.73
990,-4.73
991,-4.73
992,-4.70
993,-4.67
994,-4.62
995,-4.56
996,-4.49
997,-4.40
998,-4.32
999,-4.23
1000,-4.14
1001,-4.06
1002,-4.01
1003,-3.97
1004,-3.95
1005,-3.94
1006,-3.95
1007,-3.97
1008,-4.01
1009,-4.05
1010,-4.10
1011,-4.13
1012,-4.17
1013,-4.22
1014,-4.26
1015,-4.30
1016,-4.33
1017,-4.35
1018,-4.37
1019,-4.37
1020,-4.38
1021,-4.38
1022,-4.37
1023,-4.36
1024,-4.33
1025,-4.30
1026,-4.27
1027,-4.24
1028,-4.21
1029,-4.18
1030,-4.16
1031,-4.15
1032,-4.15
1033,-4.16
1034,-4.18
1035,-4.21
1036,-4.24
1037,-4.27
1038,-4.30
1039,-4.32
1040,-4.34
1041,-4.35
1042,-4.34
1043,-4.31
1044,-4.27
1045,-4.23
1046,-4.19
1047,-4.14
1048,-4.08
1049,-4.04
1050,-3.99
1051,-3.95
1052,-3.91
1053,-3.86
1054,-3.81
1055,-3.77
1056,-3.73
1057,-3.68
1058,-3.63
1059,-3.59
1060,-3.55
1061,-3.53
1062,-3.52
1063,-3.52
1064,-3.53
1065,-3.54
1066,-3.57
1067,-3.60
1068,-3.64
1069,-3.68
1070,-3.73
1071,-3.78
1072,-3.84
1073,-3.89
1074,-3.94
1075,-3.98
1076,-4.03
1077,-4.08
1078,-4.14
1079,-4.20
1080,-4.25
1081,-4.29
1082,-4.35
1083,-4.40
1084,-4.44
1085,-4.45
1086,-4.45
1087,-4.44
1088,-4.42
1089,-4.39
1090,-4.33
1091,-4.26
1092,-4.19
1093,-4.11
1094,-4.04
1095,-3.98
1096,-3.91
1097,-3.85
1098,-3.80
1099,-3.75
1100,-3.72
1101,-3.70
1102,-3.68
1103,-3.66
1104,-3.63
1105,-3.62
1106,-3.62
1107,-3.63
1108,-3.63
1109,-3.63
1110,-3.63
1111,-3.65
1112,-3.67
1113,-3.68
1114,-3.70
1115,-3.71
1116,-3.73
1117,-3.74
1118,-3.76
1119,-3.77
1120,-3.78
1121,-3.78
1122,-3.78
1123,-3.77
1124,-3.76
1125,-3.75
1126,-3.75
1127,-3.73
1128,-3.70
1129,-3.67
1130,-3.63
1131,-3.58
1132,-3.52
1133,-3.45
1134,-3.38
1135,-3.31
1136,-3.23
1137,-3.14
1138,-3.05
1139,-2.98
1140,-2.91
1141,-2.86
1142,-2.80
1143,-2.76
1144,-2.72
1145,-2.70
1146,-2.68
1147,-2.66
1148,-2.64
1149,-2.62
1150,-2.61
1151,-2.61
1152,-2.61
1153,-2.61
1154,-2.62
1155,-2.65
1156,-2.69
1157,-2.75
1158,-2.82
1159,-2.91
1160,-2.99
1161,-3.08
1162,-3.17
1163,-3.25
1164,-3.31
1165,-3.33
1166,-3.33
1167,-3.29
1168,-3.23
1169,-3.14
1170,-3.02
1171,-2.87
1172,-2.72
1173,-2.57
1174,-2.42
1175,-2.28
1176,-2.15
1177,-2.06
1178,-1.99
1179,-1.96
1180,-1.94
1181,-1.94
1182,-1.96
1183,-2.01
1184,-2.07
1185,-2.14
1186,-2.20
1187,-2.27
1188,-2.35
1189,-2.43
1190,-2.50
1191,-2.54
1192,-2.60
1193,-2.93
1194,-3.05
1195,-2.72
1196,-2.43
1197,-3.50
1198,-5.00
1199,-3.72
1200,-0.13
