1,-22.35
2,-28.93
3,-22.26
4,-7.84
5,6.97
6,20.33
7,33.17
8,44.05
9,49.24
10,47.40
11,39.10
12,26.85
13,12.89
14,0.62
15,-7.68
16,-9.86
17,-5.80
18,3.93
19,17.71
20,33.33
21,49.05
22,62.64
23,73.17
24,79.05
25,79.93
26,74.96
27,64.45
28,48.84
29,29.69
30,8.94
31,-10.88
32,-27.63
33,-39.41
34,-45.88
35,-47.16
36,-45.08
37,-40.97
38,-37.15
39,-34.24
40,-33.34
41,-33.70
42,-35.17
43,-36.52
44,-37.40
45,-37.35
46,-36.60
47,-35.53
48,-34.48
49,-33.80
50,-33.42
51,-33.35
52,-33.32
53,-33.22
54,-32.94
55,-32.52
56,-31.99
57,-31.45
58,-30.93
59,-30.53
60,-30.20
61,-29.98
62,-29.79
63,-29.61
64,-29.44
65,-29.34
66,-29.26
67,-29.20
68,-29.10
69,-28.99
70,-28.88
71,-28.76
72,-28.57
73,-28.34
74,-28.11
75,-27.92
76,-27.75
77,-27.64
78,-27.66
79,-27.82
80,-28.10
81,-28.48
82,-28.97
83,-29.50
84,-29.95
85,-30.27
86,-30.46
87,-30.56
88,-30.58
89,-30.52
90,-30.46
91,-30.45
92,-30.52
93,-30.63
94,-30.82
95,-31.05
96,-31.34
97,-31.62
98,-31.92
99,-32.23
100,-32.55
101,-32.84
102,-33.07
103,-33.24
104,-33.48
105,-33.76
106,-34.06
107,-34.30
108,-34.53
109,-34.69
110,-34.78
111,-34.78
112,-34.78
113,-34.83
114,-34.95
115,-35.14
116,-35.39
117,-35.62
118,-35.76
119,-35.71
120,-35.42
121,-34.87
122,-34.11
123,-33.26
124,-32.52
125,-32.02
126,-31.84
127,-31.97
128,-32.39
129,-32.99
130,-33.65
131,-34.25
132,-34.79
133,-35.27
134,-35.66
135,-35.96
136,-36.19
137,-36.37
138,-36.50
139,-36.51
140,-36.32
141,-35.96
142,-35.47
143,-34.93
144,-34.37
145,-33.83
146,-33.33
147,-32.93
148,-32.57
149,-32.22
150,-31.78
151,-31.33
152,-30.85
153,-30.43
154,-30.02
155,-29.69
156,-29.39
157,-29.15
158,-28.91
159,-28.69
160,-28.47
161,-28.30
162,-28.11
163,-27.93
164,-27.79
165,-27.74
166,-27.76
167,-27.82
168,-27.87
169,-27.95
170,-28.03
171,-28.09
172,-28.06
173,-27.95
174,-27.78
175,-27.60
176,-27.38
177,-27.14
178,-26.93
179,-26.80
180,-26.78
181,-26.83
182,-26.99
183,-27.22
184,-27.54
185,-27.90
186,-28.28
187,-28.63
188,-28.98
189,-29.32
190,-29.74
191,-30.20
192,-30.77
193,-31.36
194,-31.98
195,-32.58
196,-33.14
197,-33.61
198,-33.99
199,-34.28
200,-34.54
201,-34.71
202,-34.78
203,-34.72
204,-34.58
205,-34.39
206,-34.18
207,-34.01
208,-33.90
209,-33.83
210,-33.76
211,-33.72
212,-33.71
213,-33.72
214,-33.62
215,-33.40
216,-33.04
217,-32.62
218,-32.10
219,-31.52
220,-30.88
221,-30.23
222,-29.53
223,-28.81
224,-28.08
225,-27.44
226,-26.86
227,-26.32
228,-25.79
229,-25.38
230,-25.15
231,-25.16
232,-25.30
233,-25.56
234,-25.90
235,-26.33
236,-26.73
237,-26.98
238,-27.01
239,-26.81
240,-26.48
241,-26.11
242,-25.82
243,-25.68
244,-25.79
245,-26.08
246,-26.55
247,-27.08
248,-27.68
249,-28.27
250,-28.86
251,-29.40
252,-29.87
253,-30.28
254,-30.69
255,-31.04
256,-31.31
257,-31.43
258,-31.42
259,-31.29
260,-31.08
261,-30.83
262,-30.62
263,-30.49
264,-30.49
265,-30.55
266,-30.63
267,-30.69
268,-30.72
269,-30.72
270,-30.71
271,-30.70
272,-30.73
273,-30.85
274,-31.09
275,-31.45
276,-31.89
277,-32.30
278,-32.68
279,-32.96
280,-33.23
281,-33.52
282,-33.90
283,-34.30
284,-34.73
285,-35.14
286,-35.58
287,-36.00
288,-36.35
289,-36.58
290,-36.77
291,-36.93
292,-37.13
293,-37.36
294,-37.64
295,-37.93
296,-38.26
297,-38.55
298,-38.81
299,-39.04
300,-39.31
301,-39.60
302,-39.89
303,-40.14
304,-40.35
305,-40.52
306,-40.66
307,-40.71
308,-40.71
309,-40.64
310,-40.54
311,-40.42
312,-40.31
313,-40.25
314,-40.24
315,-40.30
316,-40.45
317,-40.70
318,-40.98
319,-41.29
320,-41.58
321,-41.82
322,-41.95
323,-41.96
324,-41.83
325,-41.60
326,-41.24
327,-40.84
328,-40.39
329,-39.97
330,-39.56
331,-39.22
332,-38.92
333,-38.64
334,-38.22
335,-37.70
336,-37.05
337,-36.34
338,-35.52
339,-34.64
340,-33.69
341,-32.79
342,-31.97
343,-31.33
344,-30.85
345,-30.56
346,-30.41
347,-30.43
348,-30.56
349,-30.80
350,-31.09
351,-31.40
352,-31.69
353,-31.93
354,-32.07
355,-32.14
356,-32.16
357,-32.08
358,-31.90
359,-31.59
360,-31.28
361,-31.02
362,-30.88
363,-30.89
364,-31.07
365,-31.35
366,-31.72
367,-32.14
368,-32.63
369,-33.10
370,-33.50
371,-33.79
372,-34.09
373,-34.42
374,-34.87
375,-35.40
376,-36.06
377,-36.77
378,-37.51
379,-38.15
380,-38.73
381,-39.19
382,-39.62
383,-39.95
384,-40.28
385,-40.63
386,-41.10
387,-41.62
388,-42.16
389,-42.65
390,-43.10
391,-43.44
392,-43.66
393,-43.71
394,-43.69
395,-43.62
396,-43.52
397,-43.33
398,-43.08
399,-42.78
400,-42.47
401,-42.15
402,-41.88
403,-41.70
404,-41.69
405,-41.80
406,-41.96
407,-42.16
408,-42.40
409,-42.69
410,-42.98
411,-43.22
412,-43.50
413,-43.84
414,-44.25
415,-44.69
416,-45.07
417,-45.32
418,-45.34
419,-45.17
420,-44.84
421,-44.41
422,-43.91
423,-43.45
424,-43.05
425,-42.76
426,-42.47
427,-42.20
428,-41.89
429,-41.53
430,-41.02
431,-40.39
432,-39.63
433,-38.91
434,-38.22
435,-37.66
436,-37.12
437,-36.67
438,-36.18
439,-35.72
440,-35.24
441,-34.77
442,-34.24
443,-33.71
444,-33.23
445,-32.87
446,-32.61
447,-32.45
448,-32.31
449,-32.20
450,-32.06
451,-31.89
452,-31.66
453,-31.43
454,-31.20
455,-31.01
456,-30.91
457,-30.91
458,-31.02
459,-31.20
460,-31.40
461,-31.59
462,-31.75
463,-31.85
464,-31.94
465,-32.05
466,-32.29
467,-32.65
468,-33.07
469,-33.51
470,-33.91
471,-34.26
472,-34.52
473,-34.66
474,-34.62
475,-34.45
476,-34.10
477,-33.58
478,-32.81
479,-31.87
480,-30.75
481,-29.55
482,-28.30
483,-27.17
484,-26.24
485,-25.58
486,-25.12
487,-24.86
488,-24.69
489,-24.57
490,-24.38
491,-24.15
492,-23.96
493,-23.95
494,-24.16
495,-24.65
496,-25.41
497,-26.37
498,-27.43
499,-28.40
500,-29.17
501,-29.63
502,-29.83
503,-29.82
504,-29.72
505,-29.64
506,-29.69
507,-29.86
508,-30.18
509,-30.55
510,-30.87
511,-31.05
512,-31.07
513,-30.94
514,-30.70
515,-30.34
516,-29.87
517,-29.33
518,-28.76
519,-28.22
520,-27.73
521,-27.31
522,-27.01
523,-26.89
524,-26.98
525,-27.29
526,-27.74
527,-28.30
528,-28.84
529,-29.34
530,-29.68
531,-29.81
532,-29.66
533,-29.24
534,-28.61
535,-27.89
536,-27.14
537,-26.48
538,-25.96
539,-25.54
540,-25.17
541,-24.82
542,-24.48
543,-24.19
544,-23.90
545,-23.61
546,-23.26
547,-22.90
548,-22.57
549,-22.33
550,-22.20
551,-22.21
552,-22.33
553,-22.51
554,-22.71
555,-22.88
556,-23.07
557,-23.30
558,-23.60
559,-23.89
560,-24.19
561,-24.47
562,-24.83
563,-25.23
564,-25.71
565,-26.18
566,-26.69
567,-27.21
568,-27.82
569,-28.46
570,-29.17
571,-29.81
572,-30.40
573,-30.80
574,-31.06
575,-31.09
576,-31.01
577,-30.86
578,-30.85
579,-31.07
580,-31.62
581,-32.52
582,-33.76
583,-35.20
584,-36.68
585,-37.95
586,-38.87
587,-39.34
588,-39.40
589,-39.08
590,-38.52
591,-37.84
592,-37.22
593,-36.79
594,-36.64
595,-36.77
596,-37.07
597,-37.39
598,-37.57
599,-37.52
600,-37.17
601,-36.57
602,-35.77
603,-34.93
604,-34.13
605,-33.46
606,-32.98
607,-32.76
608,-32.78
609,-32.97
610,-33.18
611,-33.38
612,-33.55
613,-33.71
614,-33.87
615,-34.06
616,-34.32
617,-34.69
618,-35.06
619,-35.38
620,-35.59
621,-35.65
622,-35.47
623,-35.06
624,-34.46
625,-33.74
626,-32.90
627,-32.01
628,-31.11
629,-30.27
630,-29.51
631,-28.85
632,-28.30
633,-27.88
634,-27.62
635,-27.57
636,-27.69
637,-28.01
638,-28.43
639,-28.92
640,-29.40
641,-29.82
642,-30.15
643,-30.40
644,-30.56
645,-30.62
646,-30.53
647,-30.30
648,-29.95
649,-29.52
650,-29.04
651,-28.56
652,-28.16
653,-27.92
654,-27.81
655,-27.82
656,-27.91
657,-28.03
658,-28.12
659,-28.12
660,-28.05
661,-27.91
662,-27.79
663,-27.72
664,-27.79
665,-28.02
666,-28.44
667,-28.97
668,-29.59
669,-30.25
670,-30.95
671,-31.59
672,-32.16
673,-32.64
674,-33.13
675,-33.65
676,-34.19
677,-34.74
678,-35.31
679,-35.84
680,-36.27
681,-36.51
682,-36.58
683,-36.45
684,-36.13
685,-35.64
686,-35.06
687,-34.45
688,-33.91
689,-33.49
690,-33.20
691,-33.09
692,-33.16
693,-33.42
694,-33.72
695,-34.04
696,-34.29
697,-34.48
698,-34.55
699,-34.51
700,-34.26
701,-33.85
702,-33.27
703,-32.63
704,-31.91
705,-31.13
706,-30.27
707,-29.45
708,-28.69
709,-28.03
710,-27.43
711,-26.96
712,-26.69
713,-26.69
714,-26.89
715,-27.21
716,-27.56
717,-27.85
718,-28.03
719,-28.03
720,-27.89
721,-27.63
722,-27.35
723,-27.10
724,-26.99
725,-27.09
726,-27.47
727,-28.08
728,-28.85
729,-29.62
730,-30.33
731,-30.87
732,-31.25
733,-31.47
734,-31.59
735,-31.65
736,-31.72
737,-31.82
738,-32.01
739,-32.25
740,-32.53
741,-32.77
742,-32.91
743,-32.91
744,-32.81
745,-32.68
746,-32.55
747,-32.42
748,-32.35
749,-32.34
750,-32.44
751,-32.62
752,-32.87
753,-33.17
754,-33.49
755,-33.79
756,-34.04
757,-34.22
758,-34.36
759,-34.46
760,-34.58
761,-34.69
762,-34.84
763,-35.02
764,-35.23
765,-35.46
766,-35.74
767,-36.03
768,-36.35
769,-36.58
770,-36.71
771,-36.70
772,-36.62
773,-36.55
774,-36.56
775,-36.61
776,-36.72
777,-36.90
778,-37.21
779,-37.63
780,-38.06
781,-38.43
782,-38.70
783,-38.87
784,-38.96
785,-38.96
786,-38.89
787,-38.83
788,-38.83
789,-38.89
790,-38.96
791,-38.96
792,-38.87
793,-38.70
794,-38.43
795,-38.07
796,-37.63
797,-37.22
798,-36.89
799,-36.71
800,-36.64
801,-36.65
802,-36.70
803,-36.77
804,-36.77
805,-36.66
806,-36.40
807,-36.05
808,-35.64
809,-35.21
810,-34.77
811,-34.44
812,-34.19
813,-34.03
814,-33.78
815,-33.45
816,-33.00
817,-32.52
818,-31.95
819,-31.38
820,-30.82
821,-30.33
822,-29.88
823,-29.48
824,-29.14
825,-28.84
826,-28.48
827,-28.08
828,-27.66
829,-27.29
830,-26.97
831,-26.74
832,-26.63
833,-26.70
834,-26.87
835,-27.11
836,-27.42
837,-27.78
838,-28.15
839,-28.46
840,-28.64
841,-28.69
842,-28.68
843,-28.67
844,-28.73
845,-28.84
846,-29.01
847,-29.25
848,-29.59
849,-29.94
850,-30.26
851,-30.49
852,-30.70
853,-30.86
854,-31.01
855,-31.12
856,-31.30
857,-31.51
858,-31.81
859,-32.17
860,-32.65
861,-33.17
862,-33.68
863,-34.10
864,-34.50
865,-34.84
866,-35.11
867,-35.29
868,-35.46
869,-35.69
870,-35.99
871,-36.29
872,-36.58
873,-36.81
874,-36.97
875,-37.03
876,-37.02
877,-36.95
878,-36.85
879,-36.73
880,-36.62
881,-36.54
882,-36.56
883,-36.67
884,-36.92
885,-37.22
886,-37.51
887,-37.76
888,-37.95
889,-38.06
890,-38.10
891,-38.10
892,-38.11
893,-38.16
894,-38.28
895,-38.46
896,-38.69
897,-38.93
898,-39.16
899,-39.34
900,-39.46
901,-39.52
902,-39.53
903,-39.47
904,-39.31
905,-39.08
906,-38.80
907,-38.57
908,-38.38
909,-38.20
910,-37.97
911,-37.75
912,-37.53
913,-37.29
914,-36.92
915,-36.41
916,-35.74
917,-35.02
918,-34.24
919,-33.53
920,-32.96
921,-32.61
922,-32.39
923,-32.30
924,-32.25
925,-32.26
926,-32.23
927,-32.05
928,-31.70
929,-31.28
930,-30.89
931,-30.58
932,-30.35
933,-30.24
934,-30.30
935,-30.53
936,-30.88
937,-31.31
938,-31.81
939,-32.33
940,-32.87
941,-33.34
942,-33.79
943,-34.19
944,-34.59
945,-35.01
946,-35.51
947,-36.03
948,-36.58
949,-37.12
950,-37.68
951,-38.22
952,-38.65
953,-38.89
954,-38.96
955,-38.89
956,-38.72
957,-38.43
958,-38.00
959,-37.46
960,-36.81
961,-36.10
962,-35.33
963,-34.55
964,-33.78
965,-33.13
966,-32.65
967,-32.36
968,-32.14
969,-31.99
970,-31.82
971,-31.65
972,-31.39
973,-31.09
974,-30.84
975,-30.77
976,-30.94
977,-31.30
978,-31.80
979,-32.35
980,-32.88
981,-33.30
982,-33.55
983,-33.61
984,-33.53
985,-33.40
986,-33.27
987,-33.15
988,-33.07
989,-33.00
990,-32.95
991,-32.91
992,-32.82
993,-32.71
994,-32.52
995,-32.28
996,-32.00
997,-31.71
998,-31.38
999,-31.03
1000,-30.62
1001,-30.21
1002,-29.80
1003,-29.44
1004,-29.14
1005,-28.98
1006,-28.92
1007,-28.92
1008,-28.91
1009,-28.86
1010,-28.76
1011,-28.57
1012,-28.27
1013,-27.92
1014,-27.62
1015,-27.43
1016,-27.32
1017,-27.28
1018,-27.28
1019,-27.34
1020,-27.38
1021,-27.33
1022,-27.18
1023,-26.92
1024,-26.62
1025,-26.32
1026,-26.09
1027,-25.96
1028,-25.96
1029,-26.08
1030,-26.34
1031,-26.70
1032,-27.08
1033,-27.39
1034,-27.61
1035,-27.71
1036,-27.72
1037,-27.66
1038,-27.60
1039,-27.58
1040,-27.65
1041,-27.82
1042,-28.18
1043,-28.64
1044,-29.20
1045,-29.73
1046,-30.27
1047,-30.79
1048,-31.35
1049,-31.87
1050,-32.42
1051,-32.94
1052,-33.49
1053,-33.95
1054,-34.36
1055,-34.64
1056,-34.88
1057,-35.04
1058,-35.19
1059,-35.35
1060,-35.64
1061,-36.06
1062,-36.58
1063,-37.12
1064,-37.63
1065,-38.06
1066,-38.36
1067,-38.48
1068,-38.38
1069,-38.13
1070,-37.86
1071,-37.61
1072,-37.40
1073,-37.29
1074,-37.31
1075,-37.44
1076,-37.54
1077,-37.56
1078,-37.43
1079,-37.14
1080,-36.61
1081,-35.83
1082,-34.85
1083,-33.83
1084,-32.87
1085,-32.09
1086,-31.50
1087,-31.16
1088,-31.04
1089,-31.10
1090,-31.26
1091,-31.45
1092,-31.63
1093,-31.81
1094,-31.98
1095,-32.23
1096,-32.57
1097,-33.05
1098,-33.63
1099,-34.24
1100,-34.81
1101,-35.23
1102,-35.44
1103,-35.38
1104,-35.07
1105,-34.58
1106,-34.00
1107,-33.39
1108,-32.83
1109,-32.35
1110,-31.97
1111,-31.68
1112,-31.42
1113,-31.13
1114,-30.75
1115,-30.33
1116,-29.91
1117,-29.56
1118,-29.24
1119,-29.01
1120,-28.88
1121,-28.89
1122,-28.97
1123,-29.04
1124,-29.03
1125,-28.98
1126,-28.88
1127,-28.76
1128,-28.59
1129,-28.42
1130,-28.28
1131,-28.21
1132,-28.20
1133,-28.21
1134,-28.22
1135,-28.15
1136,-27.98
1137,-27.75
1138,-27.53
1139,-27.32
1140,-27.15
1141,-27.02
1142,-27.10
1143,-27.38
1144,-27.82
1145,-28.31
1146,-28.85
1147,-29.43
1148,-30.08
1149,-30.66
1150,-31.21
1151,-31.67
1152,-32.15
1153,-32.67
1154,-33.31
1155,-34.01
1156,-34.79
1157,-35.57
1158,-36.35
1159,-37.06
1160,-37.67
1161,-38.14
1162,-38.54
1163,-38.83
1164,-39.00
1165,-39.00
1166,-38.84
1167,-38.53
1168,-38.12
1169,-37.63
1170,-37.15
1171,-36.72
1172,-36.39
1173,-36.22
1174,-36.21
1175,-36.35
1176,-36.51
1177,-36.65
1178,-36.67
1179,-36.56
1180,-36.27
1181,-35.86
1182,-35.31
1183,-34.71
1184,-34.09
1185,-33.50
1186,-32.93
1187,-32.40
1188,-31.88
1189,-31.41
1190,-30.97
1191,-30.62
1192,-30.35
1193,-30.17
1194,-30.06
1195,-30.07
1196,-30.20
1197,-30.45
1198,-30.72
1199,-30.96
1200,-31.18
1201,-31.36
1202,-31.46
1203,-31.45
1204,-31.37
1205,-31.30
1206,-31.36
1207,-31.53
1208,-31.78
1209,-32.09
1210,-32.49
1211,-32.95
1212,-33.45
1213,-33.93
1214,-34.44
1215,-34.97
1216,-35.49
1217,-35.93
1218,-36.22
1219,-36.32
1220,-36.25
1221,-36.02
1222,-35.67
1223,-35.23
1224,-34.74
1225,-34.27
1226,-33.88
1227,-33.58
1228,-33.29
1229,-33.00
1230,-32.74
1231,-32.55
1232,-32.44
1233,-32.38
1234,-32.38
1235,-32.51
1236,-32.76
1237,-33.07
1238,-33.29
1239,-33.42
1240,-33.51
1241,-33.54
1242,-33.55
1243,-33.55
1244,-33.64
1245,-33.81
1246,-34.02
1247,-34.20
1248,-34.39
1249,-34.55
1250,-34.71
1251,-34.89
1252,-35.14
1253,-35.49
1254,-35.95
1255,-36.43
1256,-36.90
1257,-37.32
1258,-37.67
1259,-37.90
1260,-38.03
1261,-38.09
1262,-38.12
1263,-38.18
1264,-38.28
1265,-38.40
1266,-38.51
1267,-38.57
1268,-38.57
1269,-38.51
1270,-38.39
1271,-38.22
1272,-37.97
1273,-37.68
1274,-37.33
1275,-36.97
1276,-36.60
1277,-36.25
1278,-35.90
1279,-35.56
1280,-35.13
1281,-34.61
1282,-33.94
1283,-33.23
1284,-32.49
1285,-31.84
1286,-31.28
1287,-30.94
1288,-30.78
1289,-30.79
1290,-30.86
1291,-30.95
1292,-30.95
1293,-30.85
1294,-30.52
1295,-29.99
1296,-29.27
1297,-28.50
1298,-27.69
1299,-26.99
1300,-26.37
1301,-25.90
1302,-25.52
1303,-25.23
1304,-25.01
1305,-24.89
1306,-24.86
1307,-24.86
1308,-24.86
1309,-24.86
1310,-24.90
1311,-25.02
1312,-25.21
1313,-25.45
1314,-25.75
1315,-26.03
1316,-26.32
1317,-26.62
1318,-26.99
1319,-27.39
1320,-27.83
1321,-28.25
1322,-28.66
1323,-29.01
1324,-29.29
1325,-29.46
1326,-29.60
1327,-29.71
1328,-29.80
1329,-29.86
1330,-29.92
1331,-29.97
1332,-30.01
1333,-30.01
1334,-29.98
1335,-29.91
1336,-29.85
1337,-29.84
1338,-29.96
1339,-30.18
1340,-30.53
1341,-30.94
1342,-31.46
1343,-31.98
1344,-32.52
1345,-32.99
1346,-33.44
1347,-33.84
1348,-34.24
1349,-34.60
1350,-34.94
1351,-35.23
1352,-35.45
1353,-35.57
1354,-35.64
1355,-35.62
1356,-35.52
1357,-35.35
1358,-35.17
1359,-35.03
1360,-34.95
1361,-34.89
1362,-34.90
1363,-34.95
1364,-35.03
1365,-35.09
1366,-35.14
1367,-35.19
1368,-35.29
1369,-35.40
1370,-35.55
1371,-35.73
1372,-35.96
1373,-36.25
1374,-36.60
1375,-36.97
1376,-37.33
1377,-37.62
1378,-37.81
1379,-37.94
1380,-38.04
1381,-38.09
1382,-38.05
1383,-37.95
1384,-37.83
1385,-37.71
1386,-37.49
1387,-37.14
1388,-36.69
1389,-36.21
1390,-35.67
1391,-35.03
1392,-34.24
1393,-33.40
1394,-32.56
1395,-31.85
1396,-31.27
1397,-30.86
1398,-30.60
1399,-30.49
1400,-30.45
1401,-30.46
1402,-30.49
1403,-30.56
1404,-30.61
1405,-30.62
1406,-30.55
1407,-30.49
1408,-30.49
1409,-30.55
1410,-30.60
1411,-30.61
1412,-30.59
1413,-30.52
1414,-30.39
1415,-30.21
1416,-30.06
1417,-29.97
1418,-30.01
1419,-30.20
1420,-30.57
1421,-31.04
1422,-31.54
1423,-32.02
1424,-32.55
1425,-33.13
1426,-33.78
1427,-34.43
1428,-35.11
1429,-35.76
1430,-36.37
1431,-36.86
1432,-37.19
1433,-37.36
1434,-37.39
1435,-37.34
1436,-37.22
1437,-37.04
1438,-36.77
1439,-36.42
1440,-35.96
1441,-35.37
1442,-34.58
1443,-33.64
1444,-32.57
1445,-31.49
1446,-30.40
1447,-29.40
1448,-28.49
1449,-27.71
1450,-27.02
1451,-26.50
1452,-26.15
1453,-26.05
1454,-26.08
1455,-26.28
1456,-26.61
1457,-27.16
1458,-27.86
1459,-28.59
1460,-29.21
1461,-29.63
1462,-29.88
1463,-29.98
1464,-29.99
1465,-29.93
1466,-29.85
1467,-29.79
1468,-29.75
1469,-29.75
1470,-29.79
1471,-29.79
1472,-29.69
1473,-29.51
1474,-29.32
1475,-29.20
1476,-29.14
1477,-29.15
1478,-29.21
1479,-29.27
1480,-29.28
1481,-29.23
1482,-29.10
1483,-28.92
1484,-28.69
1485,-28.46
1486,-28.22
1487,-28.05
1488,-27.93
1489,-27.88
1490,-27.83
1491,-27.79
1492,-27.70
1493,-27.58
1494,-27.41
1495,-27.24
1496,-27.08
1497,-26.97
1498,-26.84
1499,-26.67
1500,-26.41
1501,-26.12
1502,-25.79
1503,-25.44
1504,-25.00
1505,-24.53
1506,-24.05
1507,-23.63
1508,-23.28
1509,-23.03
1510,-22.96
1511,-23.14
1512,-23.57
1513,-24.18
1514,-24.83
1515,-25.45
1516,-25.95
1517,-26.23
1518,-26.29
1519,-26.17
1520,-26.00
1521,-25.86
1522,-25.80
1523,-25.86
1524,-26.12
1525,-26.60
1526,-27.24
1527,-27.83
1528,-28.31
1529,-28.59
1530,-28.79
1531,-28.88
1532,-28.94
1533,-28.98
1534,-29.18
1535,-29.59
1536,-30.20
1537,-30.86
1538,-31.50
1539,-32.04
1540,-32.47
1541,-32.76
1542,-32.93
1543,-32.97
1544,-32.99
1545,-33.04
1546,-33.18
1547,-33.36
1548,-33.55
1549,-33.67
1550,-33.70
1551,-33.65
1552,-33.50
1553,-33.26
1554,-32.91
1555,-32.57
1556,-32.25
1557,-32.02
1558,-31.78
1559,-31.51
1560,-31.11
1561,-30.57
1562,-29.82
1563,-28.88
1564,-27.76
1565,-26.61
1566,-25.53
1567,-24.69
1568,-24.20
1569,-24.14
1570,-24.48
1571,-25.15
1572,-26.05
1573,-27.09
1574,-28.12
1575,-29.03
1576,-29.72
1577,-30.19
1578,-30.52
1579,-30.75
1580,-30.90
1581,-30.89
1582,-30.75
1583,-30.50
1584,-30.24
1585,-29.93
1586,-29.56
1587,-29.14
1588,-28.76
1589,-28.44
1590,-28.22
1591,-28.05
1592,-27.92
1593,-27.85
1594,-27.86
1595,-27.99
1596,-28.23
1597,-28.53
1598,-28.82
1599,-29.07
1600,-29.27
1601,-29.45
1602,-29.59
1603,-29.65
1604,-29.62
1605,-29.56
1606,-29.51
1607,-29.45
1608,-29.34
1609,-29.16
1610,-28.94
1611,-28.69
1612,-28.44
1613,-28.21
1614,-28.02
1615,-27.89
1616,-27.82
1617,-27.84
1618,-27.89
1619,-27.89
1620,-27.76
1621,-27.53
1622,-27.25
1623,-26.99
1624,-26.79
1625,-26.67
1626,-26.70
1627,-26.86
1628,-27.18
1629,-27.60
1630,-28.13
1631,-28.72
1632,-29.35
1633,-29.95
1634,-30.53
1635,-31.05
1636,-31.56
1637,-32.03
1638,-32.52
1639,-32.98
1640,-33.43
1641,-33.78
1642,-34.07
1643,-34.30
1644,-34.50
1645,-34.61
1646,-34.66
1647,-34.65
1648,-34.67
1649,-34.72
1650,-34.81
1651,-34.93
1652,-35.10
1653,-35.28
1654,-35.42
1655,-35.42
1656,-35.27
1657,-35.03
1658,-34.75
1659,-34.45
1660,-34.11
1661,-33.75
1662,-33.42
1663,-33.19
1664,-33.01
1665,-32.85
1666,-32.61
1667,-32.25
1668,-31.74
1669,-31.15
1670,-30.52
1671,-29.92
1672,-29.34
1673,-28.88
1674,-28.57
1675,-28.51
1676,-28.66
1677,-28.98
1678,-29.37
1679,-29.75
1680,-29.95
1681,-29.96
1682,-29.79
1683,-29.47
1684,-29.08
1685,-28.65
1686,-28.28
1687,-28.04
1688,-27.93
1689,-27.94
1690,-28.03
1691,-28.15
1692,-28.25
1693,-28.31
1694,-28.35
1695,-28.41
1696,-28.50
1697,-28.63
1698,-28.77
1699,-28.95
1700,-29.15
1701,-29.34
1702,-29.44
1703,-29.45
1704,-29.34
1705,-29.10
1706,-28.72
1707,-28.24
1708,-27.73
1709,-27.30
1710,-27.03
1711,-26.91
1712,-26.92
1713,-27.03
1714,-27.28
1715,-27.65
1716,-28.04
1717,-28.34
1718,-28.52
1719,-28.63
1720,-28.78
1721,-29.01
1722,-29.34
1723,-29.69
1724,-30.08
1725,-30.50
1726,-30.94
1727,-31.29
1728,-31.51
1729,-31.56
1730,-31.55
1731,-31.52
1732,-31.58
1733,-31.70
1734,-31.91
1735,-32.14
1736,-32.37
1737,-32.55
1738,-32.70
1739,-32.81
1740,-32.88
1741,-32.88
1742,-32.84
1743,-32.84
1744,-32.90
1745,-32.95
1746,-32.97
1747,-32.91
1748,-32.81
1749,-32.75
1750,-32.75
1751,-32.81
1752,-32.92
1753,-33.10
1754,-33.35
1755,-33.65
1756,-33.96
1757,-34.20
1758,-34.36
1759,-34.41
1760,-34.39
1761,-34.33
1762,-34.26
1763,-34.13
1764,-33.96
1765,-33.79
1766,-33.64
1767,-33.53
1768,-33.36
1769,-33.13
1770,-32.82
1771,-32.49
1772,-32.03
1773,-31.44
1774,-30.68
1775,-29.85
1776,-28.99
1777,-28.22
1778,-27.49
1779,-26.86
1780,-26.28
1781,-25.81
1782,-25.38
1783,-24.97
1784,-24.54
1785,-24.12
1786,-23.72
1787,-23.38
1788,-23.03
1789,-22.74
1790,-22.51
1791,-22.39
1792,-22.39
1793,-22.51
1794,-22.74
1795,-23.04
1796,-23.39
1797,-23.75
1798,-24.09
1799,-24.39
1800,-24.64
1801,-24.82
1802,-24.91
1803,-24.90
1804,-24.86
1805,-24.80
1806,-24.73
1807,-24.66
1808,-24.64
1809,-24.70
1810,-24.86
1811,-25.02
1812,-25.17
1813,-25.29
1814,-25.46
1815,-25.67
1816,-25.96
1817,-26.33
1818,-26.84
1819,-27.41
1820,-28.01
1821,-28.56
1822,-29.10
1823,-29.55
1824,-29.88
1825,-30.06
1826,-30.24
1827,-30.44
1828,-30.73
1829,-31.09
1830,-31.62
1831,-32.26
1832,-32.94
1833,-33.49
1834,-33.87
1835,-34.03
1836,-34.03
1837,-33.84
1838,-33.54
1839,-33.16
1840,-32.80
1841,-32.50
1842,-32.30
1843,-32.17
1844,-32.11
1845,-32.12
1846,-32.20
1847,-32.31
1848,-32.42
1849,-32.48
1850,-32.53
1851,-32.58
1852,-32.64
1853,-32.70
1854,-32.79
1855,-32.91
1856,-33.05
1857,-33.23
1858,-33.46
1859,-33.78
1860,-34.10
1861,-34.34
1862,-34.42
1863,-34.31
1864,-34.00
1865,-33.52
1866,-32.88
1867,-32.17
1868,-31.43
1869,-30.78
1870,-30.21
1871,-29.80
1872,-29.51
1873,-29.36
1874,-29.22
1875,-29.05
1876,-28.77
1877,-28.42
1878,-27.99
1879,-27.59
1880,-27.18
1881,-26.82
1882,-26.51
1883,-26.35
1884,-26.30
1885,-26.31
1886,-26.26
1887,-26.15
1888,-26.01
1889,-25.88
1890,-25.75
1891,-25.64
1892,-25.57
1893,-25.56
1894,-25.60
1895,-25.73
1896,-25.98
1897,-26.33
1898,-26.73
1899,-27.08
1900,-27.43
1901,-27.76
1902,-28.18
1903,-28.65
1904,-29.22
1905,-29.87
1906,-30.63
1907,-31.46
1908,-32.36
1909,-33.26
1910,-34.13
1911,-34.84
1912,-35.34
1913,-35.57
1914,-35.61
1915,-35.55
1916,-35.43
1917,-35.32
1918,-35.19
1919,-35.09
1920,-34.92
1921,-34.63
1922,-34.12
1923,-33.41
1924,-32.53
1925,-31.58
1926,-30.55
1927,-29.59
1928,-28.80
1929,-28.27
1930,-27.95
1931,-27.79
1932,-27.68
1933,-27.57
1934,-27.40
1935,-27.23
1936,-27.06
1937,-27.00
1938,-27.07
1939,-27.33
1940,-27.71
1941,-28.14
1942,-28.50
1943,-28.75
1944,-28.87
1945,-28.80
1946,-28.51
1947,-28.10
1948,-27.67
1949,-27.31
1950,-26.96
1951,-26.68
1952,-26.50
1953,-26.44
1954,-26.38
1955,-26.28
1956,-26.12
1957,-25.94
1958,-25.69
1959,-25.34
1960,-24.87
1961,-24.40
1962,-23.97
1963,-23.61
1964,-23.28
1965,-22.99
1966,-22.76
1967,-22.64
1968,-22.58
1969,-22.54
1970,-22.45
1971,-22.33
1972,-22.18
1973,-22.00
1974,-21.79
1975,-21.55
1976,-21.31
1977,-21.13
1978,-21.04
1979,-21.04
1980,-21.10
1981,-21.23
1982,-21.42
1983,-21.67
1984,-21.88
1985,-22.01
1986,-22.03
1987,-21.90
1988,-21.61
1989,-21.13
1990,-20.52
1991,-19.84
1992,-19.20
1993,-18.65
1994,-18.31
1995,-18.24
1996,-18.48
1997,-18.95
1998,-19.62
1999,-20.41
2000,-21.26
2001,-22.03
2002,-22.67
2003,-23.14
2004,-23.51
2005,-23.79
2006,-24.05
2007,-24.28
2008,-24.57
2009,-24.90
2010,-25.34
2011,-25.81
2012,-26.34
2013,-26.80
2014,-27.21
2015,-27.50
2016,-27.75
2017,-27.97
2018,-28.23
2019,-28.52
2020,-28.92
2021,-29.38
2022,-29.90
2023,-30.38
2024,-30.81
2025,-31.16
2026,-31.45
2027,-31.63
2028,-31.69
2029,-31.62
2030,-31.47
2031,-31.29
2032,-31.12
2033,-31.00
2034,-30.93
2035,-30.94
2036,-31.01
2037,-31.14
2038,-31.23
2039,-31.25
2040,-31.11
2041,-30.75
2042,-30.14
2043,-29.24
2044,-28.09
2045,-26.82
2046,-25.57
2047,-24.48
2048,-23.67
2049,-23.25
2050,-23.25
2051,-23.61
2052,-24.26
2053,-25.12
2054,-26.08
2055,-27.05
2056,-27.92
2057,-28.71
2058,-29.37
2059,-29.85
2060,-30.09
2061,-30.03
2062,-29.71
2063,-29.22
2064,-28.66
2065,-28.05
2066,-27.43
2067,-26.82
2068,-26.32
2069,-25.97
2070,-25.70
2071,-25.48
2072,-25.23
2073,-24.99
2074,-24.77
2075,-24.59
2076,-24.44
2077,-24.40
2078,-24.45
2079,-24.59
2080,-24.66
2081,-24.61
2082,-24.41
2083,-24.11
2084,-23.72
2085,-23.31
2086,-22.90
2087,-22.54
2088,-22.24
2089,-22.00
2090,-21.80
2091,-21.64
2092,-21.46
2093,-21.28
2094,-21.09
2095,-20.98
2096,-20.97
2097,-21.03
2098,-21.06
2099,-21.01
2100,-20.87
2101,-20.62
2102,-20.26
2103,-19.76
2104,-19.30
2105,-19.04
2106,-19.13
2107,-19.60
2108,-20.47
2109,-21.61
2110,-22.93
2111,-24.19
2112,-25.26
2113,-26.02
2114,-26.54
2115,-26.82
2116,-26.97
2117,-27.02
2118,-27.05
2119,-27.09
2120,-27.23
2121,-27.40
2122,-27.63
2123,-27.85
2124,-28.11
2125,-28.35
2126,-28.54
2127,-28.66
2128,-28.72
2129,-28.72
2130,-28.66
2131,-28.55
2132,-28.36
2133,-28.12
2134,-27.83
2135,-27.54
2136,-27.24
2137,-26.95
2138,-26.61
2139,-26.21
2140,-25.68
2141,-25.09
2142,-24.44
2143,-23.80
2144,-23.12
2145,-22.47
2146,-21.80
2147,-21.22
2148,-20.70
2149,-20.24
2150,-19.72
2151,-19.20
2152,-18.68
2153,-18.20
2154,-17.72
2155,-17.30
2156,-17.02
2157,-16.90
2158,-16.88
2159,-16.88
2160,-16.91
2161,-16.96
2162,-17.09
2163,-17.26
2164,-17.48
2165,-17.76
2166,-18.23
2167,-18.87
2168,-19.71
2169,-20.67
2170,-21.74
2171,-22.80
2172,-23.84
2173,-24.73
2174,-25.48
2175,-26.06
2176,-26.54
2177,-26.89
2178,-27.15
2179,-27.32
2180,-27.46
2181,-27.51
2182,-27.47
2183,-27.28
2184,-27.00
2185,-26.62
2186,-26.23
2187,-25.86
2188,-25.59
2189,-25.46
2190,-25.51
2191,-25.76
2192,-26.18
2193,-26.66
2194,-27.12
2195,-27.55
2196,-27.95
2197,-28.29
2198,-28.56
2199,-28.75
2200,-28.88
2201,-29.00
2202,-29.08
2203,-29.08
2204,-29.01
2205,-28.95
2206,-28.93
2207,-28.93
2208,-28.92
2209,-28.85
2210,-28.76
2211,-28.63
2212,-28.48
2213,-28.28
2214,-28.14
2215,-28.07
2216,-28.14
2217,-28.30
2218,-28.61
2219,-29.08
2220,-29.79
2221,-30.68
2222,-31.72
2223,-32.80
2224,-33.89
2225,-34.90
2226,-35.77
2227,-36.38
2228,-36.68
2229,-36.61
2230,-36.18
2231,-35.46
2232,-34.58
2233,-33.61
2234,-32.57
2235,-31.57
2236,-30.66
2237,-29.95
2238,-29.34
2239,-28.83
2240,-28.35
2241,-27.95
2242,-27.49
2243,-26.99
2244,-26.32
2245,-25.63
2246,-24.83
2247,-24.07
2248,-23.32
2249,-22.68
2250,-22.11
2251,-21.64
2252,-21.20
2253,-20.87
2254,-20.59
2255,-20.36
2256,-20.07
2257,-19.72
2258,-19.34
2259,-18.99
2260,-18.60
2261,-18.20
2262,-17.76
2263,-17.41
2264,-17.14
2265,-16.97
2266,-16.85
2267,-16.79
2268,-16.76
2269,-16.78
2270,-16.78
2271,-16.72
2272,-16.56
2273,-16.31
2274,-16.08
2275,-15.95
2276,-15.97
2277,-16.14
2278,-16.53
2279,-17.06
2280,-17.69
2281,-18.30
2282,-18.81
2283,-19.16
2284,-19.39
2285,-19.50
2286,-19.53
2287,-19.52
2288,-19.55
2289,-19.60
2290,-19.69
2291,-19.74
2292,-19.76
2293,-19.75
2294,-19.78
2295,-19.83
2296,-19.94
2297,-20.10
2298,-20.42
2299,-20.90
2300,-21.51
2301,-22.11
2302,-22.61
2303,-22.97
2304,-23.21
2305,-23.31
2306,-23.32
2307,-23.25
2308,-23.22
2309,-23.26
2310,-23.40
2311,-23.58
2312,-23.83
2313,-24.06
2314,-24.25
2315,-24.38
2316,-24.45
2317,-24.44
2318,-24.31
2319,-24.14
2320,-24.01
2321,-24.00
2322,-24.09
2323,-24.21
2324,-24.38
2325,-24.63
2326,-24.91
2327,-25.15
2328,-25.28
2329,-25.28
2330,-25.18
2331,-24.99
2332,-24.73
2333,-24.50
2334,-24.38
2335,-24.36
2336,-24.43
2337,-24.56
2338,-24.77
2339,-25.08
2340,-25.38
2341,-25.57
2342,-25.61
2343,-25.61
2344,-25.61
2345,-25.63
2346,-25.54
2347,-25.38
2348,-25.12
2349,-24.83
2350,-24.44
2351,-23.91
2352,-23.20
2353,-22.43
2354,-21.64
2355,-20.93
2356,-20.25
2357,-19.67
2358,-19.19
2359,-18.83
2360,-18.52
2361,-18.23
2362,-17.96
2363,-17.78
2364,-17.70
2365,-17.77
2366,-17.97
2367,-18.27
2368,-18.61
2369,-18.92
2370,-19.15
2371,-19.26
2372,-19.26
2373,-19.19
2374,-19.15
2375,-19.20
2376,-19.40
2377,-19.74
2378,-20.29
2379,-21.00
2380,-21.88
2381,-22.77
2382,-23.62
2383,-24.31
2384,-24.96
2385,-25.54
2386,-26.12
2387,-26.65
2388,-27.17
2389,-27.63
2390,-28.10
2391,-28.51
2392,-28.86
2393,-29.09
2394,-29.26
2395,-29.37
2396,-29.44
2397,-29.51
2398,-29.58
2399,-29.57
2400,-29.43
2401,-29.14
2402,-28.74
2403,-28.25
2404,-27.66
2405,-27.00
2406,-26.36
2407,-25.88
2408,-25.57
2409,-25.41
2410,-25.31
2411,-25.25
2412,-25.21
2413,-25.21
2414,-25.26
2415,-25.38
2416,-25.57
2417,-25.86
2418,-26.31
2419,-26.90
2420,-27.64
2421,-28.43
2422,-29.17
2423,-29.77
2424,-30.20
2425,-30.44
2426,-30.50
2427,-30.37
2428,-30.07
2429,-29.64
2430,-29.21
2431,-28.78
2432,-28.36
2433,-27.95
2434,-27.57
2435,-27.27
2436,-27.02
2437,-26.86
2438,-26.73
2439,-26.62
2440,-26.45
2441,-26.21
2442,-25.92
2443,-25.62
2444,-25.34
2445,-25.11
2446,-24.91
2447,-24.80
2448,-24.76
2449,-24.77
2450,-24.73
2451,-24.63
2452,-24.39
2453,-24.03
2454,-23.54
2455,-23.00
2456,-22.49
2457,-22.14
2458,-21.94
2459,-21.89
2460,-21.93
2461,-22.05
2462,-22.25
2463,-22.49
2464,-22.73
2465,-22.92
2466,-23.02
2467,-23.02
2468,-22.92
2469,-22.74
2470,-22.50
2471,-22.25
2472,-22.04
2473,-21.86
2474,-21.71
2475,-21.58
2476,-21.53
2477,-21.52
2478,-21.54
2479,-21.54
2480,-21.55
2481,-21.59
2482,-21.74
2483,-22.04
2484,-22.53
2485,-23.12
2486,-23.74
2487,-24.35
2488,-24.96
2489,-25.47
2490,-25.86
2491,-26.09
2492,-26.33
2493,-26.59
2494,-26.96
2495,-27.37
2496,-27.92
2497,-28.56
2498,-29.30
2499,-30.01
2500,-30.71
2501,-31.35
2502,-32.01
2503,-32.65
2504,-33.31
2505,-33.91
2506,-34.41
2507,-34.70
2508,-34.78
2509,-34.65
2510,-34.40
2511,-34.09
2512,-33.79
2513,-33.55
2514,-33.40
2515,-33.34
2516,-33.35
2517,-33.42
2518,-33.49
2519,-33.51
2520,-33.35
2521,-33.00
2522,-32.44
2523,-31.72
2524,-30.88
2525,-30.04
2526,-29.28
2527,-28.74
2528,-28.45
2529,-28.47
2530,-28.72
2531,-29.16
2532,-29.62
2533,-30.06
2534,-30.40
2535,-30.64
2536,-30.75
2537,-30.83
2538,-30.88
2539,-30.94
2540,-30.94
2541,-30.85
2542,-30.62
2543,-30.26
2544,-29.69
2545,-28.92
2546,-27.98
2547,-26.97
2548,-25.87
2549,-24.74
2550,-23.61
2551,-22.60
2552,-21.72
2553,-21.02
2554,-20.39
2555,-19.94
2556,-19.63
2557,-19.47
2558,-19.29
2559,-19.15
2560,-18.98
2561,-18.87
2562,-18.72
2563,-18.57
2564,-18.36
2565,-18.12
2566,-17.78
2567,-17.40
2568,-16.91
2569,-16.37
2570,-15.75
2571,-15.10
2572,-14.45
2573,-13.85
2574,-13.26
2575,-12.68
2576,-12.08
2577,-11.54
2578,-11.08
2579,-10.72
2580,-10.47
2581,-10.35
2582,-10.38
2583,-10.56
2584,-10.89
2585,-11.30
2586,-11.78
2587,-12.31
2588,-12.94
2589,-13.58
2590,-14.24
2591,-14.84
2592,-15.40
2593,-15.86
2594,-16.24
2595,-16.53
2596,-16.87
2597,-17.26
2598,-17.73
2599,-18.21
2600,-18.74
2601,-19.26
2602,-19.75
2603,-20.11
2604,-20.36
2605,-20.46
2606,-20.48
2607,-20.41
2608,-20.31
2609,-20.25
2610,-20.26
2611,-20.32
2612,-20.38
2613,-20.39
2614,-20.32
2615,-20.21
2616,-20.01
2617,-19.71
2618,-19.31
2619,-18.90
2620,-18.52
2621,-18.23
2622,-17.95
2623,-17.67
2624,-17.34
2625,-16.99
2626,-16.55
2627,-16.02
2628,-15.38
2629,-14.73
2630,-14.08
2631,-13.48
2632,-12.92
2633,-12.45
2634,-12.09
2635,-11.85
2636,-11.70
2637,-11.70
2638,-11.92
2639,-12.33
2640,-12.87
2641,-13.41
2642,-13.96
2643,-14.48
2644,-15.01
2645,-15.47
2646,-15.95
2647,-16.46
2648,-17.14
2649,-17.97
2650,-18.96
2651,-19.97
2652,-20.97
2653,-21.87
2654,-22.64
2655,-23.22
2656,-23.66
2657,-23.94
2658,-24.17
2659,-24.34
2660,-24.47
2661,-24.52
2662,-24.54
2663,-24.53
2664,-24.52
2665,-24.45
2666,-24.34
2667,-24.15
2668,-23.93
2669,-23.69
2670,-23.45
2671,-23.26
2672,-23.19
2673,-23.24
2674,-23.44
2675,-23.73
2676,-24.12
2677,-24.54
2678,-24.98
2679,-25.38
2680,-25.79
2681,-26.20
2682,-26.69
2683,-27.21
2684,-27.78
2685,-28.31
2686,-28.86
2687,-29.39
2688,-29.87
2689,-30.24
2690,-30.48
2691,-30.58
2692,-30.59
2693,-30.53
2694,-30.45
2695,-30.39
2696,-30.34
2697,-30.28
2698,-30.19
2699,-30.07
2700,-29.95
2701,-29.82
2702,-29.70
2703,-29.58
2704,-29.48
2705,-29.43
2706,-29.38
2707,-29.33
2708,-29.24
2709,-29.11
2710,-28.98
2711,-28.87
2712,-28.75
2713,-28.63
2714,-28.52
2715,-28.46
2716,-28.46
2717,-28.53
2718,-28.62
2719,-28.69
2720,-28.68
2721,-28.56
2722,-28.32
2723,-28.03
2724,-27.69
2725,-27.34
2726,-26.95
2727,-26.60
2728,-26.28
2729,-26.05
2730,-25.89
2731,-25.78
2732,-25.63
2733,-25.41
2734,-25.04
2735,-24.57
2736,-23.97
2737,-23.32
2738,-22.64
2739,-22.04
2740,-21.57
2741,-21.28
2742,-21.13
2743,-21.07
2744,-21.06
2745,-21.07
2746,-21.07
2747,-21.07
2748,-21.04
2749,-21.05
2750,-21.14
2751,-21.32
2752,-21.51
2753,-21.64
2754,-21.69
2755,-21.61
2756,-21.42
2757,-21.11
2758,-20.81
2759,-20.55
2760,-20.41
2761,-20.40
2762,-20.61
2763,-21.03
2764,-21.61
2765,-22.21
2766,-22.75
2767,-23.16
2768,-23.48
2769,-23.64
2770,-23.69
2771,-23.61
2772,-23.54
2773,-23.53
2774,-23.66
2775,-23.88
2776,-24.22
2777,-24.64
2778,-25.15
2779,-25.68
2780,-26.19
2781,-26.60
2782,-26.97
2783,-27.25
2784,-27.48
2785,-27.66
2786,-27.85
2787,-28.07
2788,-28.36
2789,-28.66
2790,-28.97
2791,-29.26
2792,-29.55
2793,-29.78
2794,-29.97
2795,-30.14
2796,-30.36
2797,-30.59
2798,-30.80
2799,-30.92
2800,-30.99
2801,-30.98
2802,-30.89
2803,-30.77
2804,-30.71
2805,-30.75
2806,-30.92
2807,-31.17
2808,-31.48
2809,-31.83
2810,-32.20
2811,-32.52
2812,-32.68
2813,-32.61
2814,-32.33
2815,-31.97
2816,-31.65
2817,-31.46
2818,-31.40
2819,-31.53
2820,-31.91
2821,-32.51
2822,-33.19
2823,-33.81
2824,-34.29
2825,-34.60
2826,-34.63
2827,-34.40
2828,-33.92
2829,-33.33
2830,-32.65
2831,-31.94
2832,-31.16
2833,-30.41
2834,-29.62
2835,-28.80
2836,-27.81
2837,-26.76
2838,-25.67
2839,-24.71
2840,-23.85
2841,-23.16
2842,-22.61
2843,-22.25
2844,-22.01
2845,-21.87
2846,-21.71
2847,-21.55
2848,-21.27
2849,-20.92
2850,-20.50
2851,-20.14
2852,-19.89
2853,-19.78
2854,-19.75
2855,-19.82
2856,-19.94
2857,-20.07
2858,-20.13
2859,-20.07
2860,-19.92
2861,-19.80
2862,-19.76
2863,-19.81
2864,-19.94
2865,-20.13
2866,-20.38
2867,-20.61
2868,-20.76
2869,-20.71
2870,-20.45
2871,-20.09
2872,-19.68
2873,-19.31
2874,-19.05
2875,-18.99
2876,-19.19
2877,-19.62
2878,-20.14
2879,-20.58
2880,-20.80
2881,-20.74
2882,-20.39
2883,-19.81
2884,-18.97
2885,-18.01
2886,-17.00
2887,-16.09
2888,-15.39
2889,-14.92
2890,-14.61
2891,-14.38
2892,-14.18
2893,-14.00
2894,-13.85
2895,-13.78
2896,-13.85
2897,-14.15
2898,-14.70
2899,-15.43
2900,-16.23
2901,-17.01
2902,-17.75
2903,-18.34
2904,-18.73
2905,-18.91
2906,-18.96
2907,-18.88
2908,-18.69
2909,-18.39
2910,-18.07
2911,-17.77
2912,-17.47
2913,-17.17
2914,-16.91
2915,-16.78
2916,-16.83
2917,-17.02
2918,-17.24
2919,-17.45
2920,-17.56
2921,-17.56
2922,-17.40
2923,-17.10
2924,-16.72
2925,-16.30
2926,-15.84
2927,-15.35
2928,-14.89
2929,-14.53
2930,-14.31
2931,-14.18
2932,-14.14
2933,-14.21
2934,-14.40
2935,-14.77
2936,-15.22
2937,-15.66
2938,-15.98
2939,-16.16
2940,-16.19
2941,-16.14
2942,-16.01
2943,-15.82
2944,-15.58
2945,-15.35
2946,-15.18
2947,-15.05
2948,-14.90
2949,-14.73
2950,-14.61
2951,-14.53
2952,-14.47
2953,-14.42
2954,-14.42
2955,-14.47
2956,-14.54
2957,-14.54
2958,-14.50
2959,-14.42
2960,-14.37
2961,-14.37
2962,-14.46
2963,-14.62
2964,-14.91
2965,-15.33
2966,-15.90
2967,-16.49
2968,-17.01
2969,-17.36
2970,-17.65
2971,-17.86
2972,-18.05
2973,-18.22
2974,-18.50
2975,-18.90
2976,-19.42
2977,-19.97
2978,-20.51
2979,-20.92
2980,-21.16
2981,-21.21
2982,-21.18
2983,-21.16
2984,-21.26
2985,-21.49
2986,-21.87
2987,-22.34
2988,-22.93
2989,-23.53
2990,-24.07
2991,-24.43
2992,-24.57
2993,-24.56
2994,-24.51
2995,-24.51
2996,-24.55
2997,-24.62
2998,-24.70
2999,-24.77
3000,-24.75
3001,-24.58
3002,-24.18
3003,-23.51
3004,-22.64
3005,-21.68
3006,-20.74
3007,-19.95
3008,-19.39
3009,-19.09
3010,-19.06
3011,-19.25
3012,-19.57
3013,-19.94
3014,-20.28
3015,-20.58
3016,-20.82
3017,-21.00
3018,-21.12
3019,-21.19
3020,-21.21
3021,-21.21
3022,-21.18
3023,-21.13
3024,-21.03
3025,-20.84
3026,-20.55
3027,-20.20
3028,-19.85
3029,-19.55
3030,-19.23
3031,-18.88
3032,-18.53
3033,-18.23
3034,-17.94
3035,-17.65
3036,-17.36
3037,-17.12
3038,-16.94
3039,-16.90
3040,-16.94
3041,-17.07
3042,-17.21
3043,-17.34
3044,-17.40
3045,-17.34
3046,-17.15
3047,-16.85
3048,-16.48
3049,-16.11
3050,-15.80
3051,-15.56
3052,-15.40
3053,-15.34
3054,-15.39
3055,-15.51
3056,-15.66
3057,-15.78
3058,-15.89
3059,-16.00
3060,-16.13
3061,-16.24
3062,-16.37
3063,-16.47
3064,-16.62
3065,-16.78
3066,-17.03
3067,-17.39
3068,-17.90
3069,-18.48
3070,-19.13
3071,-19.78
3072,-20.49
3073,-21.20
3074,-21.85
3075,-22.32
3076,-22.67
3077,-22.96
3078,-23.25
3079,-23.48
3080,-23.64
3081,-23.76
3082,-23.92
3083,-24.09
3084,-24.21
3085,-24.21
3086,-24.15
3087,-24.07
3088,-24.02
3089,-24.03
3090,-24.10
3091,-24.22
3092,-24.35
3093,-24.48
3094,-24.57
3095,-24.65
3096,-24.64
3097,-24.47
3098,-24.05
3099,-23.47
3100,-22.74
3101,-21.97
3102,-21.10
3103,-20.22
3104,-19.33
3105,-18.57
3106,-17.88
3107,-17.24
3108,-16.53
3109,-15.82
3110,-15.15
3111,-14.56
3112,-13.97
3113,-13.38
3114,-12.82
3115,-12.39
3116,-12.15
3117,-12.16
3118,-12.39
3119,-12.89
3120,-13.58
3121,-14.37
3122,-15.09
3123,-15.58
3124,-15.77
3125,-15.64
3126,-15.25
3127,-14.69
3128,-14.13
3129,-13.75
3130,-13.73
3131,-14.07
3132,-14.79
3133,-15.75
3134,-16.88
3135,-17.97
3136,-18.87
3137,-19.45
3138,-19.78
3139,-19.94
3140,-20.08
3141,-20.23
3142,-20.49
3143,-20.79
3144,-21.13
3145,-21.35
3146,-21.45
3147,-21.37
3148,-21.25
3149,-21.10
3150,-21.03
3151,-21.07
3152,-21.36
3153,-21.89
3154,-22.65
3155,-23.48
3156,-24.34
3157,-25.10
3158,-25.84
3159,-26.54
3160,-27.28
3161,-28.04
3162,-28.90
3163,-29.78
3164,-30.67
3165,-31.45
3166,-32.12
3167,-32.57
3168,-32.85
3169,-32.95
3170,-33.04
3171,-33.13
3172,-33.30
3173,-33.55
3174,-33.89
3175,-34.24
3176,-34.52
3177,-34.65
3178,-34.65
3179,-34.57
3180,-34.48
3181,-34.36
3182,-34.23
3183,-34.11
3184,-34.01
3185,-33.97
3186,-33.91
3187,-33.79
3188,-33.57
3189,-33.28
3190,-32.93
3191,-32.59
3192,-32.17
3193,-31.70
3194,-31.16
3195,-30.63
3196,-30.10
3197,-29.58
3198,-28.98
3199,-28.40
3200,-27.81
3201,-27.29
3202,-26.75
3203,-26.24
3204,-25.67
3205,-25.15
3206,-24.61
3207,-24.16
3208,-23.71
3209,-23.32
3210,-22.86
3211,-22.41
3212,-21.87
3213,-21.29
3214,-20.58
3215,-19.82
3216,-19.00
3217,-18.24
3218,-17.48
3219,-16.78
3220,-16.08
3221,-15.51
3222,-15.01
3223,-14.61
3224,-14.17
3225,-13.71
3226,-13.21
3227,-12.73
3228,-12.25
3229,-11.79
3230,-11.31
3231,-10.90
3232,-10.53
3233,-10.24
3234,-10.00
3235,-9.83
3236,-9.70
3237,-9.64
3238,-9.65
3239,-9.77
3240,-9.99
3241,-10.30
3242,-10.64
3243,-10.94
3244,-11.15
3245,-11.28
3246,-11.34
3247,-11.33
3248,-11.25
3249,-11.12
3250,-11.03
3251,-11.02
3252,-11.12
3253,-11.30
3254,-11.57
3255,-11.85
3256,-12.18
3257,-12.52
3258,-12.98
3259,-13.50
3260,-14.11
3261,-14.76
3262,-15.49
3263,-16.26
3264,-17.09
3265,-17.85
3266,-18.55
3267,-19.13
3268,-19.71
3269,-20.23
3270,-20.68
3271,-20.97
3272,-21.20
3273,-21.36
3274,-21.48
3275,-21.53
3276,-21.60
3277,-21.71
3278,-21.88
3279,-22.06
3280,-22.22
3281,-22.35
3282,-22.41
3283,-22.41
3284,-22.36
3285,-22.30
3286,-22.22
3287,-22.16
3288,-22.13
3289,-22.13
3290,-22.16
3291,-22.15
3292,-22.11
3293,-22.05
3294,-22.02
3295,-22.02
3296,-22.03
3297,-22.03
3298,-22.03
3299,-22.09
3300,-22.20
3301,-22.40
3302,-22.62
3303,-22.80
3304,-22.87
3305,-22.83
3306,-22.64
3307,-22.35
3308,-21.89
3309,-21.30
3310,-20.62
3311,-19.97
3312,-19.33
3313,-18.75
3314,-18.17
3315,-17.64
3316,-17.11
3317,-16.59
3318,-16.00
3319,-15.35
3320,-14.63
3321,-13.98
3322,-13.44
3323,-13.09
3324,-12.86
3325,-12.75
3326,-12.76
3327,-12.88
3328,-13.04
3329,-13.18
3330,-13.23
3331,-13.16
3332,-12.98
3333,-12.73
3334,-12.54
3335,-12.46
3336,-12.55
3337,-12.79
3338,-13.20
3339,-13.73
3340,-14.36
3341,-14.95
3342,-15.50
3343,-15.96
3344,-16.41
3345,-16.81
3346,-17.23
3347,-17.70
3348,-18.30
3349,-19.02
3350,-19.80
3351,-20.52
3352,-21.14
3353,-21.61
3354,-21.93
3355,-22.05
3356,-21.98
3357,-21.79
3358,-21.58
3359,-21.39
3360,-21.25
3361,-21.13
3362,-21.03
3363,-20.92
3364,-20.74
3365,-20.44
3366,-20.00
3367,-19.52
3368,-19.07
3369,-18.71
3370,-18.43
3371,-18.26
3372,-18.19
3373,-18.20
3374,-18.22
3375,-18.22
3376,-18.20
3377,-18.26
3378,-18.46
3379,-18.82
3380,-19.29
3381,-19.78
3382,-20.23
3383,-20.58
3384,-20.81
3385,-20.88
3386,-20.77
3387,-20.52
3388,-20.19
3389,-19.83
3390,-19.47
3391,-19.12
3392,-18.75
3393,-18.33
3394,-17.85
3395,-17.38
3396,-16.95
3397,-16.59
3398,-16.23
3399,-15.89
3400,-15.58
3401,-15.27
3402,-14.88
3403,-14.43
3404,-13.93
3405,-13.50
3406,-13.15
3407,-12.92
3408,-12.86
3409,-13.05
3410,-13.40
3411,-13.84
3412,-14.25
3413,-14.56
3414,-14.67
3415,-14.55
3416,-14.21
3417,-13.73
3418,-13.18
3419,-12.63
3420,-12.15
3421,-11.78
3422,-11.60
3423,-11.60
3424,-11.73
3425,-11.92
3426,-12.10
3427,-12.22
3428,-12.27
3429,-12.27
3430,-12.25
3431,-12.25
3432,-12.27
3433,-12.33
3434,-12.45
3435,-12.63
3436,-12.84
3437,-13.02
3438,-13.15
3439,-13.20
3440,-13.20
3441,-13.18
3442,-13.26
3443,-13.43
3444,-13.73
3445,-14.07
3446,-14.50
3447,-14.97
3448,-15.51
3449,-16.04
3450,-16.57
3451,-17.08
3452,-17.69
3453,-18.40
3454,-19.24
3455,-20.07
3456,-20.84
3457,-21.43
3458,-21.88
3459,-22.16
3460,-22.35
3461,-22.45
3462,-22.58
3463,-22.74
3464,-22.99
3465,-23.29
3466,-23.64
3467,-23.93
3468,-24.14
3469,-24.26
3470,-24.31
3471,-24.31
3472,-24.24
3473,-24.12
3474,-24.01
3475,-23.95
3476,-23.91
3477,-23.86
3478,-23.76
3479,-23.58
3480,-23.29
3481,-22.87
3482,-22.34
3483,-21.74
3484,-21.13
3485,-20.58
3486,-20.14
3487,-19.91
3488,-19.91
3489,-20.16
3490,-20.55
3491,-21.05
3492,-21.58
3493,-22.06
3494,-22.42
3495,-22.66
3496,-22.83
3497,-22.94
3498,-22.99
3499,-23.00
3500,-23.00
3501,-22.99
3502,-22.95
3503,-22.83
3504,-22.65
3505,-22.42
3506,-22.08
3507,-21.61
3508,-20.99
3509,-20.27
3510,-19.48
3511,-18.71
3512,-17.97
3513,-17.32
3514,-16.75
3515,-16.33
3516,-16.08
3517,-16.04
3518,-16.13
3519,-16.33
3520,-16.53
3521,-16.72
3522,-16.85
3523,-16.91
3524,-16.86
3525,-16.69
3526,-16.39
3527,-15.96
3528,-15.44
3529,-14.90
3530,-14.43
3531,-14.14
3532,-13.99
3533,-14.01
3534,-14.12
3535,-14.31
3536,-14.49
3537,-14.62
3538,-14.64
3539,-14.51
3540,-14.24
3541,-13.88
3542,-13.52
3543,-13.20
3544,-12.99
3545,-12.93
3546,-13.07
3547,-13.36
3548,-13.76
3549,-14.18
3550,-14.63
3551,-15.10
3552,-15.60
3553,-16.08
3554,-16.53
3555,-17.01
3556,-17.56
3557,-18.15
3558,-18.75
3559,-19.28
3560,-19.77
3561,-20.18
3562,-20.52
3563,-20.69
3564,-20.70
3565,-20.57
3566,-20.42
3567,-20.29
3568,-20.20
3569,-20.13
3570,-20.14
3571,-20.27
3572,-20.47
3573,-20.66
3574,-20.74
3575,-20.70
3576,-20.51
3577,-20.15
3578,-19.54
3579,-18.78
3580,-17.92
3581,-17.09
3582,-16.22
3583,-15.34
3584,-14.45
3585,-13.67
3586,-12.99
3587,-12.41
3588,-11.87
3589,-11.45
3590,-11.19
3591,-11.21
3592,-11.46
3593,-11.89
3594,-12.37
3595,-12.86
3596,-13.34
3597,-13.75
3598,-14.05
3599,-14.24
3600,-14.35
3601,-14.40
3602,-14.37
3603,-14.25
3604,-14.08
3605,-13.89
3606,-13.72
3607,-13.53
3608,-13.39
3609,-13.37
3610,-13.61
3611,-14.08
3612,-14.72
3613,-15.40
3614,-16.01
3615,-16.48
3616,-16.81
3617,-16.98
3618,-17.07
3619,-17.11
3620,-17.19
3621,-17.36
3622,-17.69
3623,-18.10
3624,-18.53
3625,-18.84
3626,-18.98
3627,-18.85
3628,-18.46
3629,-17.90
3630,-17.40
3631,-17.14
3632,-17.21
3633,-17.58
3634,-18.17
3635,-18.84
3636,-19.45
3637,-19.81
3638,-19.85
3639,-19.59
3640,-19.21
3641,-18.88
3642,-18.80
3643,-19.03
3644,-19.63
3645,-20.53
3646,-21.64
3647,-22.73
3648,-23.64
3649,-24.24
3650,-24.51
3651,-24.49
3652,-24.30
3653,-24.04
3654,-23.84
3655,-23.71
3656,-23.68
3657,-23.68
3658,-23.70
3659,-23.70
3660,-23.67
3661,-23.61
3662,-23.54
3663,-23.54
3664,-23.64
3665,-23.82
3666,-24.02
3667,-24.22
3668,-24.34
3669,-24.34
3670,-24.18
3671,-23.88
3672,-23.50
3673,-23.14
3674,-22.84
3675,-22.67
3676,-22.61
3677,-22.68
3678,-22.80
3679,-22.87
3680,-22.80
3681,-22.63
3682,-22.37
3683,-22.07
3684,-21.72
3685,-21.37
3686,-21.05
3687,-20.87
3688,-20.84
3689,-20.92
3690,-20.97
3691,-20.94
3692,-20.70
3693,-20.30
3694,-19.66
3695,-18.83
3696,-17.79
3697,-16.72
3698,-15.71
3699,-14.94
3700,-14.40
3701,-14.12
3702,-14.00
3703,-14.02
3704,-14.07
3705,-14.08
3706,-13.96
3707,-13.73
3708,-13.40
3709,-13.03
3710,-12.65
3711,-12.36
3712,-12.21
3713,-12.20
3714,-12.30
3715,-12.43
3716,-12.59
3717,-12.76
3718,-12.93
3719,-13.11
3720,-13.34
3721,-13.63
3722,-13.99
3723,-14.43
3724,-14.89
3725,-15.32
3726,-15.59
3727,-15.66
3728,-15.50
3729,-15.19
3730,-14.78
3731,-14.31
3732,-13.80
3733,-13.31
3734,-12.90
3735,-12.65
3736,-12.63
3737,-12.81
3738,-13.14
3739,-13.56
3740,-14.08
3741,-14.68
3742,-15.29
3743,-15.84
3744,-16.30
3745,-16.64
3746,-16.89
3747,-17.07
3748,-17.24
3749,-17.41
3750,-17.57
3751,-17.68
3752,-17.81
3753,-17.91
3754,-18.01
3755,-18.07
3756,-18.14
3757,-18.18
3758,-18.23
3759,-18.28
3760,-18.42
3761,-18.65
3762,-18.98
3763,-19.34
3764,-19.70
3765,-19.98
3766,-20.23
3767,-20.47
3768,-20.76
3769,-21.04
3770,-21.32
3771,-21.55
3772,-21.82
3773,-22.11
3774,-22.38
3775,-22.58
3776,-22.67
3777,-22.66
3778,-22.56
3779,-22.44
3780,-22.38
3781,-22.38
3782,-22.37
3783,-22.32
3784,-22.22
3785,-22.11
3786,-21.92
3787,-21.64
3788,-21.20
3789,-20.72
3790,-20.26
3791,-19.90
3792,-19.65
3793,-19.49
3794,-19.33
3795,-19.16
3796,-18.91
3797,-18.63
3798,-18.26
3799,-17.85
3800,-17.38
3801,-16.96
3802,-16.65
3803,-16.54
3804,-16.58
3805,-16.72
3806,-16.85
3807,-16.98
3808,-17.07
3809,-17.07
3810,-16.91
3811,-16.63
3812,-16.25
3813,-15.82
3814,-15.32
3815,-14.79
3816,-14.30
3817,-13.86
3818,-13.48
3819,-13.19
3820,-13.07
3821,-13.11
3822,-13.28
3823,-13.53
3824,-13.91
3825,-14.37
3826,-14.87
3827,-15.36
3828,-15.87
3829,-16.40
3830,-16.90
3831,-17.33
3832,-17.69
3833,-17.98
3834,-18.17
3835,-18.23
3836,-18.21
3837,-18.14
3838,-18.05
3839,-17.93
3840,-17.80
3841,-17.68
3842,-17.57
3843,-17.46
3844,-17.30
3845,-17.06
3846,-16.73
3847,-16.37
3848,-16.02
3849,-15.79
3850,-15.68
3851,-15.68
3852,-15.74
3853,-15.81
3854,-15.86
3855,-15.85
3856,-15.78
3857,-15.66
3858,-15.57
3859,-15.63
3860,-15.85
3861,-16.27
3862,-16.88
3863,-17.56
3864,-18.12
3865,-18.44
3866,-18.41
3867,-18.05
3868,-17.37
3869,-16.47
3870,-15.43
3871,-14.40
3872,-13.51
3873,-12.86
3874,-12.41
3875,-12.12
3876,-11.92
3877,-11.81
3878,-11.78
3879,-11.79
3880,-11.73
3881,-11.61
3882,-11.49
3883,-11.43
3884,-11.41
3885,-11.41
3886,-11.43
3887,-11.54
3888,-11.83
3889,-12.25
3890,-12.73
3891,-13.21
3892,-13.73
3893,-14.26
3894,-14.76
3895,-15.18
3896,-15.55
3897,-15.91
3898,-16.25
3899,-16.56
3900,-16.78
3901,-16.91
3902,-16.89
3903,-16.72
3904,-16.35
3905,-15.82
3906,-15.12
3907,-14.34
3908,-13.53
3909,-12.82
3910,-12.24
3911,-11.83
3912,-11.50
3913,-11.28
3914,-11.12
3915,-10.94
3916,-10.65
3917,-10.24
3918,-9.76
3919,-9.34
3920,-9.00
3921,-8.75
3922,-8.64
3923,-8.70
3924,-8.95
3925,-9.31
3926,-9.71
3927,-10.14
3928,-10.60
3929,-11.05
3930,-11.53
3931,-12.00
3932,-12.56
3933,-13.13
3934,-13.73
3935,-14.27
3936,-14.79
3937,-15.17
3938,-15.46
3939,-15.63
3940,-15.85
3941,-16.12
3942,-16.48
3943,-16.90
3944,-17.46
3945,-18.10
3946,-18.79
3947,-19.45
3948,-20.10
3949,-20.62
3950,-20.97
3951,-21.10
3952,-21.05
3953,-20.85
3954,-20.55
3955,-20.19
3956,-19.88
3957,-19.76
3958,-19.81
3959,-20.01
3960,-20.23
3961,-20.44
3962,-20.48
3963,-20.26
3964,-19.64
3965,-18.68
3966,-17.49
3967,-16.29
3968,-15.16
3969,-14.26
3970,-13.69
3971,-13.51
3972,-13.68
3973,-14.07
3974,-14.48
3975,-14.79
3976,-14.90
3977,-14.84
3978,-14.68
3979,-14.55
3980,-14.53
3981,-14.72
3982,-15.11
3983,-15.62
3984,-16.01
3985,-16.14
3986,-15.95
3987,-15.46
3988,-14.72
3989,-13.89
3990,-13.08
3991,-12.41
3992,-11.90
3993,-11.62
3994,-11.54
3995,-11.60
3996,-11.69
3997,-11.76
3998,-11.81
3999,-11.86
4000,-11.92
4001,-12.05
4002,-12.27
4003,-12.57
4004,-12.89
4005,-13.20
4006,-13.48
4007,-13.71
4008,-13.89
4009,-14.01
4010,-14.11
4011,-14.23
4012,-14.34
4013,-14.40
4014,-14.38
4015,-14.25
4016,-14.08
4017,-13.89
4018,-13.73
4019,-13.61
4020,-13.53
4021,-13.47
4022,-13.44
4023,-13.50
4024,-13.67
4025,-13.96
4026,-14.37
4027,-14.85
4028,-15.41
4029,-16.00
4030,-16.59
4031,-17.13
4032,-17.62
4033,-18.03
4034,-18.38
4035,-18.67
4036,-18.99
4037,-19.33
4038,-19.71
4039,-20.07
4040,-20.44
4041,-20.78
4042,-21.12
4043,-21.41
4044,-21.69
4045,-21.93
4046,-22.09
4047,-22.09
4048,-21.92
4049,-21.61
4050,-21.26
4051,-20.97
4052,-20.74
4053,-20.63
4054,-20.61
4055,-20.68
4056,-20.75
4057,-20.77
4058,-20.62
4059,-20.27
4060,-19.69
4061,-18.98
4062,-18.16
4063,-17.33
4064,-16.48
4065,-15.72
4066,-15.05
4067,-14.52
4068,-14.05
4069,-13.65
4070,-13.26
4071,-12.91
4072,-12.54
4073,-12.18
4074,-11.86
4075,-11.63
4076,-11.47
4077,-11.41
4078,-11.45
4079,-11.63
4080,-11.96
4081,-12.38
4082,-12.82
4083,-13.18
4084,-13.45
4085,-13.57
4086,-13.53
4087,-13.40
4088,-13.29
4089,-13.34
4090,-13.63
4091,-14.10
4092,-14.71
4093,-15.38
4094,-16.07
4095,-16.60
4096,-16.87
4097,-16.80
4098,-16.53
4099,-16.20
4100,-15.97
4101,-15.91
4102,-16.08
4103,-16.43
4104,-16.91
4105,-17.40
4106,-17.83
4107,-18.06
4108,-18.05
4109,-17.86
4110,-17.65
4111,-17.50
4112,-17.50
4113,-17.62
4114,-17.90
4115,-18.25
4116,-18.63
4117,-18.94
4118,-19.16
4119,-19.26
4120,-19.27
4121,-19.27
4122,-19.35
4123,-19.52
4124,-19.76
4125,-20.00
4126,-20.25
4127,-20.48
4128,-20.69
4129,-20.87
4130,-21.04
4131,-21.21
4132,-21.39
4133,-21.57
4134,-21.77
4135,-22.01
4136,-22.28
4137,-22.51
4138,-22.71
4139,-22.89
4140,-23.09
4141,-23.32
4142,-23.58
4143,-23.82
4144,-24.03
4145,-24.21
4146,-24.36
4147,-24.48
4148,-24.55
4149,-24.55
4150,-24.48
4151,-24.36
4152,-24.20
4153,-24.02
4154,-23.83
4155,-23.65
4156,-23.51
4157,-23.45
4158,-23.48
4159,-23.55
4160,-23.57
4161,-23.53
4162,-23.36
4163,-23.12
4164,-22.83
4165,-22.53
4166,-22.26
4167,-22.09
4168,-21.97
4169,-21.87
4170,-21.68
4171,-21.40
4172,-20.97
4173,-20.43
4174,-19.78
4175,-19.13
4176,-18.54
4177,-18.13
4178,-17.85
4179,-17.69
4180,-17.56
4181,-17.40
4182,-17.08
4183,-16.62
4184,-15.98
4185,-15.31
4186,-14.72
4187,-14.31
4188,-14.06
4189,-14.02
4190,-14.11
4191,-14.24
4192,-14.29
4193,-14.18
4194,-13.88
4195,-13.46
4196,-12.95
4197,-12.48
4198,-12.05
4199,-11.76
4200,-11.60
4201,-11.62
4202,-11.72
4203,-11.86
4204,-11.92
4205,-11.88
4206,-11.65
4207,-11.29
4208,-10.82
4209,-10.35
4210,-9.92
4211,-9.55
4212,-9.25
4213,-9.08
4214,-9.06
4215,-9.18
4216,-9.36
4217,-9.55
4218,-9.72
4219,-9.83
4220,-9.88
4221,-9.87
4222,-9.88
4223,-9.93
4224,-10.07
4225,-10.30
4226,-10.67
4227,-11.21
4228,-11.92
4229,-12.70
4230,-13.47
4231,-14.12
4232,-14.67
4233,-15.08
4234,-15.37
4235,-15.54
4236,-15.66
4237,-15.70
4238,-15.72
4239,-15.65
4240,-15.53
4241,-15.34
4242,-15.13
4243,-14.87
4244,-14.66
4245,-14.53
4246,-14.54
4247,-14.66
4248,-14.86
4249,-15.17
4250,-15.58
4251,-16.04
4252,-16.55
4253,-17.03
4254,-17.52
4255,-17.98
4256,-18.42
4257,-18.78
4258,-19.09
4259,-19.32
4260,-19.48
4261,-19.53
4262,-19.53
4263,-19.52
4264,-19.55
4265,-19.62
4266,-19.68
4267,-19.68
4268,-19.59
4269,-19.36
4270,-18.94
4271,-18.40
4272,-17.78
4273,-17.20
4274,-16.64
4275,-16.17
4276,-15.75
4277,-15.46
4278,-15.28
4279,-15.18
4280,-15.02
4281,-14.80
4282,-14.50
4283,-14.21
4284,-13.89
4285,-13.60
4286,-13.34
4287,-13.16
4288,-13.04
4289,-12.92
4290,-12.75
4291,-12.51
4292,-12.24
4293,-11.92
4294,-11.61
4295,-11.36
4296,-11.32
4297,-11.55
4298,-12.05
4299,-12.71
4300,-13.50
4301,-14.27
4302,-14.98
4303,-15.50
4304,-15.88
4305,-16.10
4306,-16.26
4307,-16.42
4308,-16.72
4309,-17.19
4310,-17.84
4311,-18.55
4312,-19.30
4313,-19.95
4314,-20.49
4315,-20.84
4316,-21.03
4317,-21.08
4318,-21.06
4319,-21.06
4320,-21.13
4321,-21.32
4322,-21.57
4323,-21.81
4324,-21.97
4325,-21.97
4326,-21.80
4327,-21.43
4328,-20.92
4329,-20.31
4330,-19.70
4331,-19.15
4332,-18.71
4333,-18.41
4334,-18.29
4335,-18.35
4336,-18.58
4337,-18.94
4338,-19.39
4339,-19.94
4340,-20.55
4341,-21.15
4342,-21.68
4343,-22.11
4344,-22.41
4345,-22.52
4346,-22.42
4347,-22.11
4348,-21.71
4349,-21.28
4350,-20.85
4351,-20.49
4352,-20.28
4353,-20.22
4354,-20.26
4355,-20.33
4356,-20.38
4357,-20.38
4358,-20.30
4359,-20.18
4360,-20.07
4361,-20.01
4362,-20.00
4363,-20.01
4364,-19.98
4365,-19.93
4366,-19.85
4367,-19.73
4368,-19.52
4369,-19.29
4370,-19.07
4371,-18.90
4372,-18.69
4373,-18.47
4374,-18.22
4375,-17.98
4376,-17.71
4377,-17.42
4378,-17.13
4379,-16.89
4380,-16.67
4381,-16.43
4382,-16.17
4383,-15.94
4384,-15.75
4385,-15.63
4386,-15.53
4387,-15.48
4388,-15.51
4389,-15.63
4390,-15.79
4391,-15.98
4392,-16.19
4393,-16.36
4394,-16.45
4395,-16.46
4396,-16.43
4397,-16.41
4398,-16.43
4399,-16.49
4400,-16.65
4401,-16.88
4402,-17.14
4403,-17.38
4404,-17.65
4405,-17.92
4406,-18.24
4407,-18.53
4408,-18.86
4409,-19.20
4410,-19.61
4411,-20.01
4412,-20.46
4413,-20.93
4414,-21.48
4415,-22.06
4416,-22.71
4417,-23.35
4418,-24.04
4419,-24.68
4420,-25.30
4421,-25.83
4422,-26.31
4423,-26.72
4424,-27.10
4425,-27.44
4426,-27.82
4427,-28.17
4428,-28.50
4429,-28.73
4430,-28.88
4431,-28.93
4432,-28.95
4433,-28.95
4434,-28.93
4435,-28.93
4436,-28.95
4437,-29.02
4438,-29.08
4439,-29.10
4440,-28.96
4441,-28.68
4442,-28.21
4443,-27.62
4444,-26.87
4445,-26.05
4446,-25.15
4447,-24.26
4448,-23.35
4449,-22.54
4450,-21.77
4451,-21.13
4452,-20.54
4453,-20.07
4454,-19.72
4455,-19.56
4456,-19.49
4457,-19.45
4458,-19.32
4459,-19.10
4460,-18.75
4461,-18.33
4462,-17.82
4463,-17.30
4464,-16.78
4465,-16.37
4466,-16.02
4467,-15.80
4468,-15.66
4469,-15.62
4470,-15.55
4471,-15.38
4472,-15.05
4473,-14.63
4474,-14.18
4475,-13.76
4476,-13.37
4477,-13.02
4478,-12.72
4479,-12.54
4480,-12.48
4481,-12.56
4482,-12.70
4483,-12.89
4484,-13.06
4485,-13.19
4486,-13.21
4487,-13.10
4488,-12.82
4489,-12.41
4490,-11.88
4491,-11.34
4492,-10.80
4493,-10.34
4494,-9.93
4495,-9.57
4496,-9.22
4497,-8.86
4498,-8.52
4499,-8.22
4500,-7.94
4501,-7.71
4502,-7.55
4503,-7.55
4504,-7.71
4505,-8.03
4506,-8.42
4507,-8.83
4508,-9.25
4509,-9.61
4510,-9.90
4511,-10.07
4512,-10.14
4513,-10.08
4514,-9.90
4515,-9.59
4516,-9.19
4517,-8.77
4518,-8.42
4519,-8.22
4520,-8.24
4521,-8.48
4522,-8.96
4523,-9.62
4524,-10.36
4525,-11.04
4526,-11.54
4527,-11.77
4528,-11.73
4529,-11.49
4530,-11.15
4531,-10.85
4532,-10.61
4533,-10.50
4534,-10.50
4535,-10.57
4536,-10.61
4537,-10.57
4538,-10.35
4539,-10.00
4540,-9.50
4541,-8.90
4542,-8.23
4543,-7.58
4544,-6.96
4545,-6.43
4546,-5.96
4547,-5.55
4548,-5.17
4549,-4.81
4550,-4.46
4551,-4.18
4552,-3.92
4553,-3.68
4554,-3.43
4555,-3.20
4556,-3.01
4557,-2.88
4558,-2.82
4559,-2.88
4560,-3.12
4561,-3.54
4562,-4.07
4563,-4.62
4564,-5.12
4565,-5.47
4566,-5.67
4567,-5.71
4568,-5.71
4569,-5.68
4570,-5.74
4571,-5.91
4572,-6.29
4573,-6.83
4574,-7.45
4575,-7.98
4576,-8.42
4577,-8.71
4578,-8.88
4579,-8.92
4580,-8.94
4581,-9.05
4582,-9.35
4583,-9.83
4584,-10.43
4585,-11.03
4586,-11.59
4587,-11.99
4588,-12.24
4589,-12.28
4590,-12.22
4591,-12.15
4592,-12.17
4593,-12.28
4594,-12.49
4595,-12.73
4596,-12.99
4597,-13.21
4598,-13.43
4599,-13.60
4600,-13.79
4601,-14.02
4602,-14.33
4603,-14.74
4604,-15.29
4605,-15.88
4606,-16.46
4607,-16.94
4608,-17.33
4609,-17.55
4610,-17.65
4611,-17.63
4612,-17.64
4613,-17.74
4614,-18.02
4615,-18.42
4616,-18.97
4617,-19.57
4618,-20.21
4619,-20.74
4620,-21.10
4621,-21.27
4622,-21.36
4623,-21.40
4624,-21.44
4625,-21.50
4626,-21.65
4627,-21.89
4628,-22.15
4629,-22.34
4630,-22.44
4631,-22.44
4632,-22.31
4633,-22.06
4634,-21.74
4635,-21.45
4636,-21.19
4637,-20.96
4638,-20.68
4639,-20.40
4640,-20.11
4641,-19.81
4642,-19.43
4643,-19.04
4644,-18.64
4645,-18.34
4646,-18.08
4647,-17.86
4648,-17.64
4649,-17.47
4650,-17.27
4651,-16.99
4652,-16.55
4653,-16.02
4654,-15.40
4655,-14.82
4656,-14.25
4657,-13.79
4658,-13.37
4659,-13.03
4660,-12.67
4661,-12.34
4662,-11.96
4663,-11.54
4664,-11.04
4665,-10.51
4666,-9.97
4667,-9.49
4668,-9.06
4669,-8.72
4670,-8.45
4671,-8.27
4672,-8.14
4673,-8.09
4674,-8.12
4675,-8.17
4676,-8.21
4677,-8.29
4678,-8.44
4679,-8.67
4680,-8.90
4681,-9.09
4682,-9.27
4683,-9.44
4684,-9.58
4685,-9.64
4686,-9.64
4687,-9.57
4688,-9.48
4689,-9.35
4690,-9.20
4691,-9.02
4692,-8.85
4693,-8.71
4694,-8.67
4695,-8.72
4696,-8.92
4697,-9.22
4698,-9.58
4699,-9.94
4700,-10.28
4701,-10.57
4702,-10.85
4703,-11.14
4704,-11.51
4705,-11.91
4706,-12.37
4707,-12.85
4708,-13.37
4709,-13.90
4710,-14.40
4711,-14.82
4712,-15.17
4713,-15.40
4714,-15.53
4715,-15.57
4716,-15.65
4717,-15.76
4718,-15.92
4719,-16.04
4720,-16.10
4721,-16.10
4722,-16.05
4723,-15.92
4724,-15.72
4725,-15.46
4726,-15.28
4727,-15.21
4728,-15.28
4729,-15.46
4730,-15.75
4731,-16.11
4732,-16.50
4733,-16.80
4734,-16.97
4735,-17.02
4736,-17.04
4737,-17.10
4738,-17.20
4739,-17.32
4740,-17.46
4741,-17.65
4742,-17.86
4743,-18.05
4744,-18.11
4745,-18.01
4746,-17.71
4747,-17.29
4748,-16.75
4749,-16.17
4750,-15.52
4751,-14.86
4752,-14.19
4753,-13.54
4754,-12.88
4755,-12.24
4756,-11.57
4757,-10.93
4758,-10.25
4759,-9.67
4760,-9.16
4761,-8.81
4762,-8.56
4763,-8.40
4764,-8.27
4765,-8.22
4766,-8.22
4767,-8.29
4768,-8.38
4769,-8.49
4770,-8.64
4771,-8.83
4772,-9.03
4773,-9.20
4774,-9.33
4775,-9.44
4776,-9.64
4777,-9.93
4778,-10.31
4779,-10.73
4780,-11.18
4781,-11.65
4782,-12.16
4783,-12.62
4784,-13.07
4785,-13.47
4786,-13.94
4787,-14.46
4788,-15.08
4789,-15.74
4790,-16.42
4791,-17.07
4792,-17.68
4793,-18.16
4794,-18.47
4795,-18.59
4796,-18.54
4797,-18.36
4798,-18.07
4799,-17.71
4800,-17.32
4801,-16.96
4802,-16.64
4803,-16.35
4804,-16.02
4805,-15.68
4806,-15.28
4807,-14.88
4808,-14.40
4809,-13.87
4810,-13.24
4811,-12.59
4812,-11.92
4813,-11.32
4814,-10.83
4815,-10.48
4816,-10.25
4817,-10.20
4818,-10.29
4819,-10.54
4820,-10.90
4821,-11.32
4822,-11.76
4823,-12.19
4824,-12.55
4825,-12.79
4826,-12.86
4827,-12.73
4828,-12.48
4829,-12.18
4830,-11.89
4831,-11.64
4832,-11.47
4833,-11.41
4834,-11.48
4835,-11.67
4836,-11.90
4837,-12.15
4838,-12.36
4839,-12.49
4840,-12.47
4841,-12.30
4842,-11.97
4843,-11.55
4844,-11.06
4845,-10.58
4846,-10.18
4847,-9.93
4848,-9.86
4849,-9.93
4850,-10.07
4851,-10.20
4852,-10.25
4853,-10.20
4854,-10.03
4855,-9.78
4856,-9.50
4857,-9.27
4858,-9.10
4859,-8.98
4860,-8.86
4861,-8.75
4862,-8.65
4863,-8.54
4864,-8.32
4865,-8.03
4866,-7.71
4867,-7.47
4868,-7.30
4869,-7.20
4870,-7.10
4871,-6.98
4872,-6.81
4873,-6.58
4874,-6.26
4875,-5.90
4876,-5.54
4877,-5.23
4878,-5.00
4879,-4.88
4880,-4.90
4881,-5.01
4882,-5.19
4883,-5.37
4884,-5.58
4885,-5.81
4886,-6.10
4887,-6.44
4888,-6.90
4889,-7.50
4890,-8.24
4891,-9.00
4892,-9.77
4893,-10.48
4894,-11.22
4895,-11.91
4896,-12.56
4897,-13.09
4898,-13.61
4899,-14.07
4900,-14.47
4901,-14.76
4902,-15.05
4903,-15.40
4904,-15.80
4905,-16.16
4906,-16.45
4907,-16.68
4908,-16.91
4909,-17.08
4910,-17.17
4911,-17.11
4912,-16.94
4913,-16.75
4914,-16.60
4915,-16.54
4916,-16.58
4917,-16.71
4918,-16.88
4919,-17.06
4920,-17.22
4921,-17.35
4922,-17.40
4923,-17.33
4924,-17.15
4925,-16.85
4926,-16.48
4927,-16.04
4928,-15.61
4929,-15.24
4930,-15.05
4931,-15.05
4932,-15.20
4933,-15.51
4934,-15.96
4935,-16.51
4936,-17.02
4937,-17.38
4938,-17.59
4939,-17.70
4940,-17.78
4941,-17.85
4942,-17.86
4943,-17.87
4944,-17.90
4945,-17.95
4946,-17.96
4947,-17.85
4948,-17.62
4949,-17.25
4950,-16.75
4951,-16.22
4952,-15.73
4953,-15.37
4954,-15.11
4955,-14.94
4956,-14.85
4957,-14.85
4958,-14.90
4959,-14.96
4960,-15.04
4961,-15.16
4962,-15.33
4963,-15.52
4964,-15.66
4965,-15.72
4966,-15.68
4967,-15.57
4968,-15.39
4969,-15.14
4970,-14.82
4971,-14.53
4972,-14.32
4973,-14.20
4974,-14.10
4975,-13.98
4976,-13.89
4977,-13.89
4978,-13.97
4979,-14.09
4980,-14.22
4981,-14.40
4982,-14.68
4983,-15.02
4984,-15.43
4985,-15.85
4986,-16.32
4987,-16.78
4988,-17.23
4989,-17.56
4990,-17.91
4991,-18.31
4992,-18.84
4993,-19.42
4994,-20.08
4995,-20.73
4996,-21.43
4997,-22.06
4998,-22.66
4999,-23.19
5000,-23.77
5001,-24.41
5002,-25.11
5003,-25.76
5004,-26.40
5005,-26.93
5006,-27.31
5007,-27.42
5008,-27.32
5009,-27.06
5010,-26.78
5011,-26.60
5012,-26.58
5013,-26.77
5014,-27.08
5015,-27.47
5016,-27.78
5017,-27.92
5018,-27.72
5019,-27.19
5020,-26.35
5021,-25.39
5022,-24.39
5023,-23.51
5024,-22.72
5025,-22.09
5026,-21.50
5027,-20.93
5028,-20.23
5029,-19.39
5030,-18.42
5031,-17.47
5032,-16.60
5033,-15.95
5034,-15.50
5035,-15.27
5036,-15.24
5037,-15.37
5038,-15.57
5039,-15.82
5040,-16.08
5041,-16.39
5042,-16.70
5043,-17.00
5044,-17.26
5045,-17.50
5046,-17.76
5047,-18.00
5048,-18.16
5049,-18.23
5050,-18.23
5051,-18.22
5052,-18.21
5053,-18.23
5054,-18.23
5055,-18.17
5056,-17.96
5057,-17.60
5058,-17.16
5059,-16.67
5060,-16.17
5061,-15.75
5062,-15.52
5063,-15.57
5064,-15.89
5065,-16.39
5066,-16.96
5067,-17.50
5068,-17.93
5069,-18.17
5070,-18.22
5071,-18.09
5072,-17.83
5073,-17.46
5074,-17.05
5075,-16.69
5076,-16.46
5077,-16.38
5078,-16.51
5079,-16.86
5080,-17.49
5081,-18.33
5082,-19.28
5083,-20.19
5084,-20.99
5085,-21.58
5086,-21.92
5087,-21.97
5088,-21.82
5089,-21.55
5090,-21.32
5091,-21.13
5092,-21.06
5093,-21.10
5094,-21.32
5095,-21.68
5096,-22.15
5097,-22.64
5098,-23.06
5099,-23.35
5100,-23.53
5101,-23.60
5102,-23.54
5103,-23.36
5104,-23.07
5105,-22.77
5106,-22.52
5107,-22.35
5108,-22.17
5109,-21.97
5110,-21.61
5111,-21.07
5112,-20.29
5113,-19.34
5114,-18.30
5115,-17.34
5116,-16.48
5117,-15.84
5118,-15.43
5119,-15.33
5120,-15.40
5121,-15.62
5122,-15.82
5123,-15.96
5124,-15.89
5125,-15.68
5126,-15.27
5127,-14.81
5128,-14.24
5129,-13.66
5130,-13.01
5131,-12.31
5132,-11.49
5133,-10.55
5134,-9.41
5135,-8.24
5136,-7.03
5137,-5.97
5138,-5.00
5139,-4.26
5140,-3.63
5141,-3.18
5142,-2.75
5143,-2.36
5144,-1.91
5145,-1.44
5146,-0.90
5147,-0.37
5148,0.13
5149,0.54
5150,0.86
5151,1.03
5152,1.05
5153,0.93
5154,0.73
5155,0.49
5156,0.17
5157,-0.24
5158,-0.71
5159,-1.20
5160,-1.66
5161,-2.08
5162,-2.43
5163,-2.72
5164,-3.01
5165,-3.23
5166,-3.40
5167,-3.38
5168,-3.25
5169,-2.99
5170,-2.72
5171,-2.39
5172,-2.12
5173,-1.98
5174,-2.14
5175,-2.60
5176,-3.38
5177,-4.33
5178,-5.44
5179,-6.50
5180,-7.47
5181,-8.23
5182,-8.90
5183,-9.47
5184,-10.04
5185,-10.55
5186,-11.14
5187,-11.77
5188,-12.56
5189,-13.38
5190,-14.24
5191,-15.01
5192,-15.69
5193,-16.22
5194,-16.63
5195,-16.85
5196,-16.92
5197,-16.85
5198,-16.74
5199,-16.59
5200,-16.49
5201,-16.43
5202,-16.48
5203,-16.58
5204,-16.74
5205,-16.92
5206,-17.17
5207,-17.46
5208,-17.77
5209,-18.07
5210,-18.38
5211,-18.67
5212,-18.94
5213,-19.19
5214,-19.41
5215,-19.58
5216,-19.68
5217,-19.75
5218,-19.81
5219,-19.88
5220,-19.85
5221,-19.69
5222,-19.36
5223,-18.88
5224,-18.23
5225,-17.46
5226,-16.60
5227,-15.70
5228,-14.77
5229,-13.95
5230,-13.26
5231,-12.79
5232,-12.44
5233,-12.24
5234,-12.08
5235,-11.99
5236,-11.77
5237,-11.44
5238,-10.92
5239,-10.25
5240,-9.45
5241,-8.62
5242,-7.86
5243,-7.26
5244,-6.79
5245,-6.52
5246,-6.41
5247,-6.48
5248,-6.58
5249,-6.67
5250,-6.65
5251,-6.53
5252,-6.26
5253,-5.85
5254,-5.33
5255,-4.77
5256,-4.27
5257,-3.91
5258,-3.76
5259,-3.87
5260,-4.26
5261,-4.88
5262,-5.60
5263,-6.26
5264,-6.78
5265,-7.13
5266,-7.39
5267,-7.61
5268,-7.88
5269,-8.23
5270,-8.71
5271,-9.32
5272,-9.99
5273,-10.59
5274,-11.05
5275,-11.34
5276,-11.52
5277,-11.58
5278,-11.49
5279,-11.25
5280,-10.90
5281,-10.48
5282,-9.98
5283,-9.39
5284,-8.69
5285,-7.91
5286,-7.06
5287,-6.23
5288,-5.44
5289,-4.72
5290,-4.07
5291,-3.53
5292,-3.14
5293,-2.97
5294,-3.01
5295,-3.25
5296,-3.66
5297,-4.20
5298,-4.84
5299,-5.57
5300,-6.33
5301,-7.11
5302,-7.88
5303,-8.60
5304,-9.25
5305,-9.78
5306,-10.20
5307,-10.49
5308,-10.70
5309,-10.80
5310,-10.86
5311,-10.85
5312,-10.82
5313,-10.76
5314,-10.69
5315,-10.62
5316,-10.58
5317,-10.59
5318,-10.61
5319,-10.61
5320,-10.56
5321,-10.44
5322,-10.27
5323,-10.09
5324,-9.91
5325,-9.73
5326,-9.55
5327,-9.44
5328,-9.41
5329,-9.47
5330,-9.57
5331,-9.71
5332,-9.83
5333,-9.90
5334,-9.80
5335,-9.57
5336,-9.25
5337,-8.95
5338,-8.67
5339,-8.44
5340,-8.26
5341,-8.13
5342,-8.06
5343,-8.01
5344,-7.93
5345,-7.81
5346,-7.64
5347,-7.46
5348,-7.31
5349,-7.19
5350,-7.09
5351,-7.03
5352,-7.04
5353,-7.15
5354,-7.36
5355,-7.67
5356,-8.08
5357,-8.54
5358,-9.05
5359,-9.53
5360,-10.01
5361,-10.41
5362,-10.73
5363,-10.96
5364,-11.21
5365,-11.48
5366,-11.83
5367,-12.18
5368,-12.59
5369,-12.99
5370,-13.43
5371,-13.84
5372,-14.27
5373,-14.66
5374,-15.10
5375,-15.57
5376,-16.14
5377,-16.72
5378,-17.31
5379,-17.85
5380,-18.36
5381,-18.82
5382,-19.24
5383,-19.59
5384,-19.96
5385,-20.30
5386,-20.63
5387,-20.87
5388,-21.04
5389,-21.15
5390,-21.25
5391,-21.36
5392,-21.54
5393,-21.78
5394,-22.03
5395,-22.23
5396,-22.29
5397,-22.17
5398,-21.85
5399,-21.39
5400,-20.76
5401,-20.04
5402,-19.23
5403,-18.46
5404,-17.77
5405,-17.18
5406,-16.61
5407,-16.03
5408,-15.40
5409,-14.79
5410,-14.26
5411,-13.91
5412,-13.75
5413,-13.82
5414,-14.05
5415,-14.43
5416,-14.87
5417,-15.30
5418,-15.61
5419,-15.79
5420,-15.88
5421,-15.93
5422,-15.98
5423,-16.04
5424,-16.13
5425,-16.26
5426,-16.36
5427,-16.37
5428,-16.22
5429,-15.91
5430,-15.51
5431,-15.08
5432,-14.69
5433,-14.40
5434,-14.21
5435,-14.16
5436,-14.19
5437,-14.26
5438,-14.31
5439,-14.31
5440,-14.26
5441,-14.20
5442,-14.13
5443,-14.08
5444,-14.02
5445,-13.96
5446,-13.90
5447,-13.84
5448,-13.76
5449,-13.72
5450,-13.69
5451,-13.69
5452,-13.66
5453,-13.61
5454,-13.56
5455,-13.50
5456,-13.38
5457,-13.21
5458,-13.01
5459,-12.82
5460,-12.64
5461,-12.54
5462,-12.52
5463,-12.57
5464,-12.63
5465,-12.63
5466,-12.61
5467,-12.55
5468,-12.41
5469,-12.17
5470,-11.88
5471,-11.63
5472,-11.49
5473,-11.50
5474,-11.63
5475,-11.87
5476,-12.19
5477,-12.56
5478,-12.91
5479,-13.21
5480,-13.45
5481,-13.57
5482,-13.53
5483,-13.43
5484,-13.28
5485,-13.08
5486,-12.83
5487,-12.55
5488,-12.26
5489,-12.02
5490,-11.79
5491,-11.57
5492,-11.32
5493,-11.10
5494,-10.78
5495,-10.40
5496,-9.85
5497,-9.20
5498,-8.38
5499,-7.51
5500,-6.55
5501,-5.61
5502,-4.62
5503,-3.68
5504,-2.78
5505,-2.02
5506,-1.30
5507,-0.61
5508,0.16
5509,0.92
5510,1.68
5511,2.33
5512,2.88
5513,3.30
5514,3.58
5515,3.62
5516,3.43
5517,3.01
5518,2.45
5519,1.78
5520,1.01
5521,0.24
5522,-0.41
5523,-0.83
5524,-1.03
5525,-1.01
5526,-0.84
5527,-0.53
5528,-0.20
5529,0.05
5530,0.09
5531,-0.06
5532,-0.44
5533,-0.98
5534,-1.67
5535,-2.38
5536,-3.04
5537,-3.51
5538,-3.85
5539,-4.06
5540,-4.27
5541,-4.50
5542,-4.81
5543,-5.16
5544,-5.57
5545,-5.99
5546,-6.41
5547,-6.75
5548,-7.03
5549,-7.20
5550,-7.32
5551,-7.36
5552,-7.39
5553,-7.39
5554,-7.40
5555,-7.39
5556,-7.35
5557,-7.28
5558,-7.27
5559,-7.32
5560,-7.43
5561,-7.55
5562,-7.71
5563,-7.94
5564,-8.25
5565,-8.54
5566,-8.80
5567,-8.97
5568,-9.12
5569,-9.22
5570,-9.32
5571,-9.44
5572,-9.67
5573,-10.01
5574,-10.46
5575,-10.94
5576,-11.46
5577,-11.93
5578,-12.31
5579,-12.55
5580,-12.68
5581,-12.73
5582,-12.74
5583,-12.73
5584,-12.77
5585,-12.89
5586,-13.09
5587,-13.34
5588,-13.57
5589,-13.75
5590,-13.85
5591,-13.92
5592,-13.95
5593,-13.95
5594,-13.88
5595,-13.76
5596,-13.65
5597,-13.59
5598,-13.55
5599,-13.50
5600,-13.41
5601,-13.30
5602,-13.12
5603,-12.89
5604,-12.57
5605,-12.21
5606,-11.86
5607,-11.57
5608,-11.29
5609,-11.07
5610,-10.86
5611,-10.69
5612,-10.49
5613,-10.27
5614,-9.96
5615,-9.61
5616,-9.19
5617,-8.79
5618,-8.37
5619,-7.96
5620,-7.51
5621,-7.10
5622,-6.74
5623,-6.44
5624,-6.15
5625,-5.94
5626,-5.77
5627,-5.65
5628,-5.49
5629,-5.26
5630,-4.99
5631,-4.75
5632,-4.52
5633,-4.28
5634,-4.06
5635,-3.88
5636,-3.75
5637,-3.68
5638,-3.69
5639,-3.81
5640,-4.09
5641,-4.51
5642,-5.01
5643,-5.56
5644,-6.13
5645,-6.67
5646,-7.09
5647,-7.27
5648,-7.19
5649,-6.89
5650,-6.42
5651,-5.87
5652,-5.33
5653,-4.90
5654,-4.68
5655,-4.67
5656,-4.88
5657,-5.18
5658,-5.52
5659,-5.81
5660,-6.09
5661,-6.38
5662,-6.72
5663,-7.13
5664,-7.65
5665,-8.31
5666,-9.10
5667,-9.93
5668,-10.75
5669,-11.47
5670,-12.12
5671,-12.63
5672,-13.03
5673,-13.27
5674,-13.42
5675,-13.47
5676,-13.41
5677,-13.22
5678,-12.99
5679,-12.73
5680,-12.50
5681,-12.32
5682,-12.25
5683,-12.30
5684,-12.47
5685,-12.73
5686,-12.99
5687,-13.24
5688,-13.40
5689,-13.47
5690,-13.44
5691,-13.31
5692,-13.10
5693,-12.86
5694,-12.64
5695,-12.46
5696,-12.30
5697,-12.19
5698,-12.13
5699,-12.14
5700,-12.14
5701,-12.09
5702,-11.95
5703,-11.78
5704,-11.56
5705,-11.33
5706,-11.05
5707,-10.77
5708,-10.44
5709,-10.03
5710,-9.45
5711,-8.74
5712,-7.95
5713,-7.17
5714,-6.37
5715,-5.62
5716,-4.89
5717,-4.30
5718,-3.80
5719,-3.46
5720,-3.23
5721,-3.19
5722,-3.24
5723,-3.37
5724,-3.52
5725,-3.72
5726,-3.91
5727,-4.10
5728,-4.21
5729,-4.28
5730,-4.29
5731,-4.23
5732,-4.07
5733,-3.82
5734,-3.56
5735,-3.36
5736,-3.33
5737,-3.37
5738,-3.52
5739,-3.75
5740,-4.14
5741,-4.68
5742,-5.30
5743,-5.90
5744,-6.47
5745,-6.99
5746,-7.51
5747,-7.98
5748,-8.43
5749,-8.90
5750,-9.50
5751,-10.19
5752,-11.00
5753,-11.84
5754,-12.72
5755,-13.50
5756,-14.06
5757,-14.31
5758,-14.24
5759,-13.93
5760,-13.44
5761,-12.84
5762,-12.19
5763,-11.60
5764,-11.08
5765,-10.67
5766,-10.28
5767,-9.88
5768,-9.38
5769,-8.73
5770,-7.87
5771,-6.84
5772,-5.74
5773,-4.71
5774,-3.88
5775,-3.33
5776,-3.17
5777,-3.40
5778,-4.03
5779,-5.00
5780,-6.23
5781,-7.56
5782,-8.83
5783,-9.93
5784,-10.73
5785,-11.22
5786,-11.34
5787,-11.09
5788,-10.54
5789,-9.80
5790,-9.05
5791,-8.32
5792,-7.65
5793,-7.12
5794,-6.77
5795,-6.58
5796,-6.50
5797,-6.46
5798,-6.42
5799,-6.36
5800,-6.20
5801,-5.97
5802,-5.69
5803,-5.46
5804,-5.27
5805,-5.16
5806,-5.10
5807,-5.10
5808,-5.14
5809,-5.21
5810,-5.26
5811,-5.26
5812,-5.19
5813,-5.01
5814,-4.72
5815,-4.36
5816,-3.98
5817,-3.69
5818,-3.50
5819,-3.45
5820,-3.48
5821,-3.61
5822,-3.79
5823,-3.98
5824,-4.07
5825,-3.95
5826,-3.61
5827,-3.06
5828,-2.38
5829,-1.65
5830,-0.98
5831,-0.50
5832,-0.29
5833,-0.41
5834,-0.83
5835,-1.51
5836,-2.32
5837,-3.11
5838,-3.71
5839,-4.01
5840,-4.02
5841,-3.75
5842,-3.34
5843,-2.90
5844,-2.63
5845,-2.61
5846,-2.91
5847,-3.45
5848,-4.22
5849,-5.04
5850,-5.86
5851,-6.58
5852,-7.22
5853,-7.74
5854,-8.17
5855,-8.51
5856,-8.90
5857,-9.30
5858,-9.75
5859,-10.09
5860,-10.36
5861,-10.52
5862,-10.68
5863,-10.78
5864,-10.86
5865,-10.91
5866,-11.04
5867,-11.27
5868,-11.60
5869,-11.96
5870,-12.34
5871,-12.70
5872,-12.99
5873,-13.18
5874,-13.25
5875,-13.25
5876,-13.18
5877,-13.07
5878,-12.89
5879,-12.66
5880,-12.32
5881,-11.91
5882,-11.41
5883,-10.81
5884,-10.08
5885,-9.24
5886,-8.38
5887,-7.66
5888,-7.15
5889,-6.90
5890,-6.94
5891,-7.24
5892,-7.79
5893,-8.52
5894,-9.32
5895,-10.05
5896,-10.62
5897,-10.97
5898,-11.12
5899,-11.11
5900,-11.04
5901,-11.03
5902,-11.15
5903,-11.40
5904,-11.73
5905,-12.02
5906,-12.24
5907,-12.31
5908,-12.18
5909,-11.82
5910,-11.22
5911,-10.50
5912,-9.79
5913,-9.24
5914,-8.90
5915,-8.73
5916,-8.67
5917,-8.68
5918,-8.68
5919,-8.64
5920,-8.47
5921,-8.24
5922,-7.95
5923,-7.71
5924,-7.54
5925,-7.48
5926,-7.55
5927,-7.68
5928,-7.78
5929,-7.80
5930,-7.66
5931,-7.43
5932,-7.08
5933,-6.66
5934,-6.19
5935,-5.78
5936,-5.46
5937,-5.22
5938,-4.97
5939,-4.68
5940,-4.37
5941,-4.07
5942,-3.75
5943,-3.45
5944,-3.23
5945,-3.23
5946,-3.47
5947,-3.90
5948,-4.43
5949,-5.04
5950,-5.71
5951,-6.36
5952,-6.91
5953,-7.34
5954,-7.68
5955,-7.89
5956,-8.01
5957,-8.06
5958,-8.19
5959,-8.35
5960,-8.51
5961,-8.64
5962,-8.79
5963,-8.96
5964,-9.09
5965,-9.16
5966,-9.20
5967,-9.25
5968,-9.31
5969,-9.38
5970,-9.46
5971,-9.58
5972,-9.70
5973,-9.77
5974,-9.74
5975,-9.63
5976,-9.44
5977,-9.20
5978,-8.88
5979,-8.47
5980,-7.94
5981,-7.35
5982,-6.69
5983,-6.04
5984,-5.39
5985,-4.81
5986,-4.26
5987,-3.78
5988,-3.36
5989,-3.08
5990,-2.92
5991,-2.88
5992,-2.79
5993,-2.62
5994,-2.34
5995,-1.99
5996,-1.55
5997,-1.07
5998,-0.61
5999,-0.31
6000,-0.23
6001,-0.41
6002,-0.81
6003,-1.35
6004,-1.99
6005,-2.66
6006,-3.27
6007,-3.75
6008,-4.04
6009,-4.09
6010,-3.97
6011,-3.77
6012,-3.64
6013,-3.62
6014,-3.78
6015,-4.08
6016,-4.52
6017,-4.99
6018,-5.47
6019,-5.89
6020,-6.25
6021,-6.48
6022,-6.59
6023,-6.64
6024,-6.74
6025,-6.91
6026,-7.13
6027,-7.32
6028,-7.45
6029,-7.49
6030,-7.48
6031,-7.35
6032,-7.13
6033,-6.82
6034,-6.52
6035,-6.26
6036,-6.14
6037,-6.13
6038,-6.26
6039,-6.56
6040,-7.05
6041,-7.64
6042,-8.29
6043,-8.94
6044,-9.65
6045,-10.36
6046,-11.03
6047,-11.57
6048,-11.99
6049,-12.27
6050,-12.47
6051,-12.58
6052,-12.66
6053,-12.71
6054,-12.76
6055,-12.81
6056,-12.93
6057,-13.10
6058,-13.33
6059,-13.56
6060,-13.83
6061,-14.13
6062,-14.45
6063,-14.75
6064,-15.01
6065,-15.24
6066,-15.50
6067,-15.79
6068,-16.13
6069,-16.43
6070,-16.65
6071,-16.77
6072,-16.79
6073,-16.67
6074,-16.38
6075,-15.96
6076,-15.50
6077,-15.07
6078,-14.70
6079,-14.41
6080,-14.20
6081,-14.08
6082,-14.02
6083,-13.98
6084,-13.88
6085,-13.76
6086,-13.62
6087,-13.52
6088,-13.41
6089,-13.31
6090,-13.09
6091,-12.81
6092,-12.42
6093,-11.96
6094,-11.34
6095,-10.63
6096,-9.86
6097,-9.21
6098,-8.71
6099,-8.35
6100,-8.06
6101,-7.85
6102,-7.65
6103,-7.48
6104,-7.23
6105,-6.89
6106,-6.42
6107,-5.95
6108,-5.47
6109,-5.06
6110,-4.71
6111,-4.48
6112,-4.35
6113,-4.30
6114,-4.25
6115,-4.20
6116,-4.14
6117,-4.14
6118,-4.20
6119,-4.33
6120,-4.49
6121,-4.73
6122,-5.06
6123,-5.48
6124,-5.94
6125,-6.37
6126,-6.71
6127,-6.89
6128,-6.86
6129,-6.61
6130,-6.23
6131,-5.80
6132,-5.41
6133,-5.10
6134,-4.93
6135,-4.93
6136,-5.11
6137,-5.40
6138,-5.76
6139,-6.11
6140,-6.51
6141,-6.91
6142,-7.35
6143,-7.83
6144,-8.39
6145,-9.04
6146,-9.77
6147,-10.49
6148,-11.18
6149,-11.77
6150,-12.24
6151,-12.54
6152,-12.70
6153,-12.75
6154,-12.73
6155,-12.60
6156,-12.39
6157,-12.08
6158,-11.74
6159,-11.37
6160,-11.01
6161,-10.71
6162,-10.51
6163,-10.38
6164,-10.31
6165,-10.32
6166,-10.43
6167,-10.60
6168,-10.79
6169,-10.91
6170,-11.00
6171,-11.12
6172,-11.26
6173,-11.44
6174,-11.67
6175,-11.98
6176,-12.34
6177,-12.70
6178,-12.99
6179,-13.18
6180,-13.22
6181,-13.11
6182,-12.82
6183,-12.40
6184,-11.90
6185,-11.42
6186,-10.97
6187,-10.57
6188,-10.17
6189,-9.76
6190,-9.28
6191,-8.81
6192,-8.37
6193,-8.01
6194,-7.68
6195,-7.41
6196,-7.13
6197,-6.84
6198,-6.44
6199,-5.97
6200,-5.46
6201,-4.98
6202,-4.53
6203,-4.18
6204,-3.97
6205,-3.90
6206,-3.94
6207,-4.07
6208,-4.30
6209,-4.52
6210,-4.69
6211,-4.76
6212,-4.78
6213,-4.81
6214,-4.93
6215,-5.10
6216,-5.39
6217,-5.74
6218,-6.15
6219,-6.55
6220,-7.03
6221,-7.48
6222,-7.96
6223,-8.42
6224,-9.00
6225,-9.68
6226,-10.58
6227,-11.66
6228,-12.93
6229,-14.24
6230,-15.47
6231,-16.49
6232,-17.33
6233,-17.91
6234,-18.21
6235,-18.20
6236,-18.00
6237,-17.68
6238,-17.34
6239,-16.98
6240,-16.62
6241,-16.33
6242,-16.10
6243,-15.94
6244,-15.73
6245,-15.46
6246,-15.01
6247,-14.42
6248,-13.65
6249,-12.76
6250,-11.73
6251,-10.67
6252,-9.57
6253,-8.55
6254,-7.65
6255,-6.94
6256,-6.40
6257,-6.06
6258,-5.87
6259,-5.88
6260,-6.04
6261,-6.36
6262,-6.74
6263,-7.18
6264,-7.58
6265,-7.94
6266,-8.22
6267,-8.42
6268,-8.46
6269,-8.34
6270,-8.06
6271,-7.71
6272,-7.30
6273,-6.89
6274,-6.44
6275,-5.96
6276,-5.48
6277,-5.07
6278,-4.71
6279,-4.43
6280,-4.13
6281,-3.84
6282,-3.56
6283,-3.33
6284,-3.09
6285,-2.86
6286,-2.62
6287,-2.45
6288,-2.34
6289,-2.29
6290,-2.20
6291,-2.11
6292,-1.95
6293,-1.71
6294,-1.31
6295,-0.85
6296,-0.40
6297,-0.03
6298,0.26
6299,0.43
6300,0.42
6301,0.24
6302,0.00
6303,-0.19
6304,-0.28
6305,-0.27
6306,-0.16
6307,0.01
6308,0.18
6309,0.24
6310,0.18
6311,0.00
6312,-0.25
6313,-0.56
6314,-0.87
6315,-1.11
6316,-1.23
6317,-1.17
6318,-0.95
6319,-0.63
6320,-0.33
6321,-0.08
6322,0.05
6323,0.06
6324,-0.08
6325,-0.31
6326,-0.65
6327,-0.99
6328,-1.36
6329,-1.70
6330,-2.11
6331,-2.56
6332,-3.15
6333,-3.79
6334,-4.56
6335,-5.38
6336,-6.29
6337,-7.16
6338,-8.06
6339,-8.88
6340,-9.67
6341,-10.37
6342,-11.07
6343,-11.76
6344,-12.57
6345,-13.39
6346,-14.24
6347,-15.01
6348,-15.72
6349,-16.31
6350,-16.77
6351,-17.01
6352,-17.01
6353,-16.82
6354,-16.53
6355,-16.17
6356,-15.75
6357,-15.27
6358,-14.75
6359,-14.28
6360,-13.86
6361,-13.52
6362,-13.15
6363,-12.74
6364,-12.25
6365,-11.73
6366,-11.10
6367,-10.41
6368,-9.56
6369,-8.67
6370,-7.77
6371,-7.06
6372,-6.56
6373,-6.33
6374,-6.30
6375,-6.44
6376,-6.66
6377,-6.91
6378,-7.10
6379,-7.16
6380,-7.10
6381,-7.04
6382,-7.04
6383,-7.16
6384,-7.37
6385,-7.68
6386,-8.07
6387,-8.50
6388,-8.83
6389,-8.96
6390,-8.87
6391,-8.55
6392,-8.09
6393,-7.61
6394,-7.20
6395,-6.97
6396,-6.87
6397,-6.88
6398,-6.94
6399,-7.01
6400,-7.03
6401,-6.98
6402,-6.81
6403,-6.58
6404,-6.28
6405,-6.00
6406,-5.68
6407,-5.34
6408,-4.87
6409,-4.35
6410,-3.77
6411,-3.18
6412,-2.51
6413,-1.80
6414,-1.07
6415,-0.42
6416,0.19
6417,0.77
6418,1.37
6419,1.98
6420,2.52
6421,2.94
6422,3.21
6423,3.27
6424,3.11
6425,2.75
6426,2.23
6427,1.57
6428,0.76
6429,-0.12
6430,-1.02
6431,-1.85
6432,-2.68
6433,-3.43
6434,-4.15
6435,-4.80
6436,-5.47
6437,-6.10
6438,-6.73
6439,-7.26
6440,-7.77
6441,-8.22
6442,-8.67
6443,-9.03
6444,-9.31
6445,-9.48
6446,-9.57
6447,-9.57
6448,-9.47
6449,-9.28
6450,-9.07
6451,-8.90
6452,-8.74
6453,-8.63
6454,-8.53
6455,-8.48
6456,-8.45
6457,-8.39
6458,-8.24
6459,-8.02
6460,-7.71
6461,-7.35
6462,-6.90
6463,-6.37
6464,-5.79
6465,-5.26
6466,-4.74
6467,-4.28
6468,-3.84
6469,-3.43
6470,-2.98
6471,-2.58
6472,-2.20
6473,-1.91
6474,-1.65
6475,-1.41
6476,-1.21
6477,-1.09
6478,-1.05
6479,-1.05
6480,-1.08
6481,-1.14
6482,-1.25
6483,-1.42
6484,-1.68
6485,-2.04
6486,-2.51
6487,-3.04
6488,-3.61
6489,-4.15
6490,-4.66
6491,-5.07
6492,-5.38
6493,-5.61
6494,-5.84
6495,-6.07
6496,-6.29
6497,-6.48
6498,-6.64
6499,-6.74
6500,-6.80
6501,-6.72
6502,-6.60
6503,-6.46
6504,-6.42
6505,-6.47
6506,-6.66
6507,-6.95
6508,-7.35
6509,-7.84
6510,-8.36
6511,-8.83
6512,-9.20
6513,-9.45
6514,-9.63
6515,-9.72
6516,-9.75
6517,-9.76
6518,-9.84
6519,-10.00
6520,-10.21
6521,-10.39
6522,-10.60
6523,-10.83
6524,-11.04
6525,-11.16
6526,-11.23
6527,-11.28
6528,-11.34
6529,-11.41
6530,-11.44
6531,-11.44
6532,-11.41
6533,-11.28
6534,-11.06
6535,-10.76
6536,-10.44
6537,-10.12
6538,-9.86
6539,-9.68
6540,-9.64
6541,-9.76
6542,-10.01
6543,-10.38
6544,-10.83
6545,-11.38
6546,-11.96
6547,-12.50
6548,-12.95
6549,-13.25
6550,-13.40
6551,-13.40
6552,-13.24
6553,-13.00
6554,-12.73
6555,-12.49
6556,-12.28
6557,-12.12
6558,-11.96
6559,-11.78
6560,-11.53
6561,-11.25
6562,-10.91
6563,-10.56
6564,-10.14
6565,-9.74
6566,-9.36
6567,-9.08
6568,-8.77
6569,-8.37
6570,-7.77
6571,-7.07
6572,-6.26
6573,-5.43
6574,-4.58
6575,-3.81
6576,-3.14
6577,-2.68
6578,-2.33
6579,-2.08
6580,-1.69
6581,-1.17
6582,-0.45
6583,0.31
6584,1.06
6585,1.65
6586,2.11
6587,2.37
6588,2.57
6589,2.74
6590,3.01
6591,3.41
6592,3.97
6593,4.64
6594,5.37
6595,6.03
6596,6.49
6597,6.61
6598,6.40
6599,5.91
6600,5.23
6601,4.44
6602,3.63
6603,2.85
6604,2.14
6605,1.55
6606,1.08
6607,0.77
6608,0.67
6609,0.86
6610,1.33
6611,2.01
6612,2.70
6613,3.27
6614,3.55
6615,3.50
6616,3.07
6617,2.35
6618,1.42
6619,0.47
6620,-0.43
6621,-1.19
6622,-1.88
6623,-2.52
6624,-3.20
6625,-3.97
6626,-4.90
6627,-5.91
6628,-6.94
6629,-7.83
6630,-8.58
6631,-9.09
6632,-9.44
6633,-9.54
6634,-9.48
6635,-9.27
6636,-9.10
6637,-9.02
6638,-9.12
6639,-9.35
6640,-9.75
6641,-10.28
6642,-10.93
6643,-11.60
6644,-12.18
6645,-12.60
6646,-12.83
6647,-12.88
6648,-12.80
6649,-12.60
6650,-12.41
6651,-12.26
6652,-12.31
6653,-12.54
6654,-12.97
6655,-13.51
6656,-14.13
6657,-14.72
6658,-15.24
6659,-15.67
6660,-16.01
6661,-16.25
6662,-16.33
6663,-16.28
6664,-16.13
6665,-15.89
6666,-15.51
6667,-14.99
6668,-14.33
6669,-13.60
6670,-12.81
6671,-12.05
6672,-11.31
6673,-10.60
6674,-9.83
6675,-9.08
6676,-8.32
6677,-7.61
6678,-6.87
6679,-6.17
6680,-5.51
6681,-5.04
6682,-4.75
6683,-4.65
6684,-4.63
6685,-4.71
6686,-4.82
6687,-4.95
6688,-5.01
6689,-5.02
6690,-4.98
6691,-4.97
6692,-5.04
6693,-5.16
6694,-5.30
6695,-5.42
6696,-5.52
6697,-5.57
6698,-5.58
6699,-5.58
6700,-5.64
6701,-5.73
6702,-5.91
6703,-6.14
6704,-6.52
6705,-6.98
6706,-7.51
6707,-8.05
6708,-8.67
6709,-9.36
6710,-10.17
6711,-11.00
6712,-11.87
6713,-12.70
6714,-13.48
6715,-14.08
6716,-14.47
6717,-14.57
6718,-14.45
6719,-14.14
6720,-13.73
6721,-13.31
6722,-12.92
6723,-12.64
6724,-12.41
6725,-12.18
6726,-11.84
6727,-11.38
6728,-10.73
6729,-9.90
6730,-8.84
6731,-7.71
6732,-6.62
6733,-5.78
6734,-5.20
6735,-4.92
6736,-4.88
6737,-5.07
6738,-5.39
6739,-5.77
6740,-6.12
6741,-6.42
6742,-6.65
6743,-6.90
6744,-7.18
6745,-7.55
6746,-7.94
6747,-8.31
6748,-8.58
6749,-8.71
6750,-8.62
6751,-8.26
6752,-7.66
6753,-6.94
6754,-6.20
6755,-5.53
6756,-4.96
6757,-4.57
6758,-4.31
6759,-4.14
6760,-3.89
6761,-3.56
6762,-3.12
6763,-2.64
6764,-2.08
6765,-1.48
6766,-0.94
6767,-0.58
6768,-0.40
6769,-0.41
6770,-0.57
6771,-0.89
6772,-1.27
6773,-1.64
6774,-1.89
6775,-2.02
6776,-2.01
6777,-1.89
6778,-1.66
6779,-1.35
6780,-1.07
6781,-0.89
6782,-0.81
6783,-0.82
6784,-0.87
6785,-0.93
6786,-0.95
6787,-0.90
6788,-0.75
6789,-0.50
6790,-0.19
6791,0.11
6792,0.32
6793,0.38
6794,0.27
6795,0.05
6796,-0.28
6797,-0.64
6798,-1.02
6799,-1.37
6800,-1.69
6801,-1.98
6802,-2.31
6803,-2.65
6804,-3.04
6805,-3.45
6806,-3.96
6807,-4.53
6808,-5.23
6809,-6.00
6810,-6.90
6811,-7.77
6812,-8.61
6813,-9.33
6814,-9.96
6815,-10.42
6816,-10.71
6817,-10.75
6818,-10.69
6819,-10.60
6820,-10.62
6821,-10.67
6822,-10.77
6823,-10.88
6824,-11.06
6825,-11.29
6826,-11.54
6827,-11.79
6828,-12.05
6829,-12.34
6830,-12.66
6831,-12.96
6832,-13.24
6833,-13.48
6834,-13.66
6835,-13.72
6836,-13.64
6837,-13.47
6838,-13.21
6839,-12.92
6840,-12.55
6841,-12.15
6842,-11.70
6843,-11.22
6844,-10.66
6845,-10.08
6846,-9.47
6847,-8.87
6848,-8.23
6849,-7.59
6850,-6.95
6851,-6.42
6852,-5.97
6853,-5.68
6854,-5.55
6855,-5.61
6856,-5.83
6857,-6.15
6858,-6.44
6859,-6.63
6860,-6.67
6861,-6.61
6862,-6.49
6863,-6.37
6864,-6.25
6865,-6.20
6866,-6.23
6867,-6.29
6868,-6.29
6869,-6.13
6870,-5.75
6871,-5.21
6872,-4.52
6873,-3.75
6874,-2.92
6875,-2.20
6876,-1.66
6877,-1.44
6878,-1.48
6879,-1.68
6880,-1.86
6881,-2.00
6882,-2.05
6883,-1.99
6884,-1.73
6885,-1.33
6886,-0.84
6887,-0.41
6888,-0.07
6889,0.15
6890,0.26
6891,0.25
6892,0.20
6893,0.13
6894,0.08
6895,0.02
6896,-0.02
6897,-0.03
6898,0.06
6899,0.24
6900,0.44
6901,0.63
6902,0.76
6903,0.82
6904,0.81
6905,0.69
6906,0.45
6907,0.11
6908,-0.34
6909,-0.81
6910,-1.34
6911,-1.86
6912,-2.40
6913,-2.87
6914,-3.30
6915,-3.70
6916,-4.18
6917,-4.71
6918,-5.28
6919,-5.81
6920,-6.35
6921,-6.87
6922,-7.42
6923,-7.97
6924,-8.48
6925,-8.89
6926,-9.18
6927,-9.29
6928,-9.26
6929,-9.08
6930,-8.77
6931,-8.34
6932,-7.86
6933,-7.44
6934,-7.15
6935,-7.03
6936,-7.05
6937,-7.19
6938,-7.35
6939,-7.50
6940,-7.45
6941,-7.16
6942,-6.60
6943,-5.88
6944,-5.06
6945,-4.23
6946,-3.40
6947,-2.69
6948,-2.11
6949,-1.70
6950,-1.40
6951,-1.17
6952,-0.96
6953,-0.79
6954,-0.63
6955,-0.51
6956,-0.43
6957,-0.43
6958,-0.55
6959,-0.79
6960,-1.10
6961,-1.46
6962,-1.89
6963,-2.37
6964,-2.86
6965,-3.27
6966,-3.60
6967,-3.83
6968,-4.01
6969,-4.12
6970,-4.20
6971,-4.24
6972,-4.36
6973,-4.59
6974,-4.97
6975,-5.45
6976,-5.99
6977,-6.52
6978,-7.04
6979,-7.51
6980,-7.97
6981,-8.31
6982,-8.56
6983,-8.73
6984,-8.93
6985,-9.16
6986,-9.39
6987,-9.57
6988,-9.72
6989,-9.83
6990,-9.93
6991,-9.98
6992,-10.02
6993,-10.07
6994,-10.20
6995,-10.37
6996,-10.56
6997,-10.74
6998,-10.96
6999,-11.19
7000,-11.41
7001,-11.60
7002,-11.74
7003,-11.86
7004,-11.96
7005,-12.01
7006,-12.02
7007,-11.97
7008,-11.83
7009,-11.58
7010,-11.25
7011,-10.95
7012,-10.77
7013,-10.70
7014,-10.72
7015,-10.78
7016,-10.91
7017,-11.09
7018,-11.25
7019,-11.32
7020,-11.28
7021,-11.22
7022,-11.18
7023,-11.25
7024,-11.39
7025,-11.57
7026,-11.76
7027,-11.94
7028,-12.11
7029,-12.23
7030,-12.27
7031,-12.21
7032,-12.08
7033,-11.89
7034,-11.67
7035,-11.44
7036,-11.21
7037,-10.96
7038,-10.67
7039,-10.38
7040,-10.13
7041,-9.95
7042,-9.80
7043,-9.69
7044,-9.62
7045,-9.64
7046,-9.64
7047,-9.54
7048,-9.22
7049,-8.75
7050,-8.14
7051,-7.48
7052,-6.81
7053,-6.22
7054,-5.74
7055,-5.45
7056,-5.31
7057,-5.27
7058,-5.19
7059,-5.02
7060,-4.71
7061,-4.30
7062,-3.78
7063,-3.18
7064,-2.51
7065,-1.93
7066,-1.46
7067,-1.11
7068,-0.74
7069,-0.34
7070,0.08
7071,0.44
7072,0.74
7073,0.98
7074,1.12
7075,1.12
7076,0.98
7077,0.72
7078,0.47
7079,0.27
7080,0.20
7081,0.21
7082,0.24
7083,0.18
7084,-0.03
7085,-0.38
7086,-0.81
7087,-1.25
7088,-1.62
7089,-1.80
7090,-1.68
7091,-1.26
7092,-0.64
7093,0.03
7094,0.65
7095,1.14
7096,1.39
7097,1.40
7098,1.17
7099,0.88
7100,0.55
7101,0.27
7102,-0.05
7103,-0.38
7104,-0.82
7105,-1.34
7106,-2.02
7107,-2.85
7108,-3.85
7109,-4.86
7110,-5.82
7111,-6.60
7112,-7.19
7113,-7.52
7114,-7.67
7115,-7.65
7116,-7.62
7117,-7.61
7118,-7.64
7119,-7.63
7120,-7.61
7121,-7.60
7122,-7.68
7123,-7.78
7124,-7.91
7125,-8.03
7126,-8.18
7127,-8.35
7128,-8.52
7129,-8.64
7130,-8.73
7131,-8.77
7132,-8.84
7133,-8.96
7134,-9.16
7135,-9.46
7136,-9.84
7137,-10.26
7138,-10.68
7139,-11.05
7140,-11.31
7141,-11.38
7142,-11.21
7143,-10.84
7144,-10.35
7145,-9.87
7146,-9.45
7147,-9.10
7148,-8.77
7149,-8.48
7150,-8.20
7151,-7.92
7152,-7.52
7153,-7.00
7154,-6.31
7155,-5.60
7156,-4.89
7157,-4.30
7158,-3.81
7159,-3.46
7160,-3.23
7161,-3.12
7162,-3.05
7163,-3.01
7164,-2.93
7165,-2.82
7166,-2.62
7167,-2.39
7168,-2.14
7169,-1.95
7170,-1.86
7171,-1.92
7172,-2.18
7173,-2.59
7174,-3.10
7175,-3.59
7176,-4.02
7177,-4.30
7178,-4.43
7179,-4.42
7180,-4.43
7181,-4.51
7182,-4.79
7183,-5.26
7184,-6.01
7185,-6.95
7186,-8.03
7187,-9.06
7188,-9.97
7189,-10.73
7190,-11.24
7191,-11.51
7192,-11.70
7193,-13.03
7194,-13.23
7195,-10.69
7196,-9.56
7197,-16.00
7198,-22.83
7199,-11.29
7200,9.09
