1,123.21
2,185.68
3,201.58
4,191.31
5,182.72
6,177.11
7,158.91
8,124.44
9,79.85
10,33.12
11,-11.80
12,-46.99
13,-65.14
14,-61.09
15,-35.13
16,7.09
17,58.57
18,108.82
19,151.53
20,179.97
21,194.01
22,192.89
23,179.95
24,156.38
25,124.54
26,85.43
27,40.91
28,-6.52
29,-52.72
30,-93.42
31,-123.63
32,-141.46
33,-145.48
34,-139.34
35,-125.93
36,-111.75
37,-99.60
38,-93.34
39,-91.92
40,-94.96
41,-99.12
42,-102.87
43,-104.42
44,-103.73
45,-101.47
46,-98.65
47,-96.57
48,-95.63
49,-96.01
50,-97.15
51,-98.57
52,-99.88
53,-100.81
54,-101.32
55,-101.43
56,-101.28
57,-101.01
58,-100.62
59,-100.09
60,-99.42
61,-98.66
62,-97.92
63,-97.28
64,-96.81
65,-96.55
66,-96.47
67,-96.55
68,-96.64
69,-96.72
70,-96.72
71,-96.66
72,-96.52
73,-96.33
74,-96.03
75,-95.67
76,-95.26
77,-94.84
78,-94.46
79,-94.15
80,-93.96
81,-93.90
82,-94.00
83,-94.27
84,-94.69
85,-95.18
86,-95.63
87,-95.96
88,-96.13
89,-96.13
90,-95.98
91,-95.70
92,-95.36
93,-95.02
94,-94.77
95,-94.67
96,-94.76
97,-94.99
98,-95.38
99,-95.82
100,-96.31
101,-96.81
102,-97.36
103,-97.89
104,-98.40
105,-98.86
106,-99.37
107,-99.88
108,-100.46
109,-100.99
110,-101.50
111,-101.94
112,-102.36
113,-102.73
114,-103.10
115,-103.41
116,-103.74
117,-104.02
118,-104.30
119,-104.51
120,-104.65
121,-104.73
122,-104.82
123,-104.93
124,-105.08
125,-105.26
126,-105.49
127,-105.79
128,-106.16
129,-106.59
130,-106.97
131,-107.25
132,-107.36
133,-107.32
134,-107.06
135,-106.62
136,-105.96
137,-105.16
138,-104.26
139,-103.42
140,-102.69
141,-102.17
142,-101.81
143,-101.63
144,-101.48
145,-101.36
146,-101.14
147,-100.80
148,-100.21
149,-99.46
150,-98.51
151,-97.51
152,-96.41
153,-95.33
154,-94.22
155,-93.18
156,-92.06
157,-90.96
158,-89.78
159,-88.70
160,-87.61
161,-86.64
162,-85.64
163,-84.75
164,-83.84
165,-83.01
166,-82.08
167,-81.18
168,-80.12
169,-79.08
170,-77.93
171,-76.87
172,-75.77
173,-74.78
174,-73.78
175,-72.84
176,-71.79
177,-70.74
178,-69.58
179,-68.47
180,-67.35
181,-66.36
182,-65.43
183,-64.70
184,-64.14
185,-63.81
186,-63.55
187,-63.34
188,-63.06
189,-62.77
190,-62.44
191,-62.08
192,-61.69
193,-61.37
194,-61.15
195,-61.07
196,-61.09
197,-61.22
198,-61.43
199,-61.74
200,-62.06
201,-62.34
202,-62.51
203,-62.58
204,-62.52
205,-62.39
206,-62.13
207,-61.78
208,-61.32
209,-60.81
210,-60.27
211,-59.75
212,-59.20
213,-58.71
214,-58.22
215,-57.82
216,-57.42
217,-57.05
218,-56.62
219,-56.17
220,-55.64
221,-55.09
222,-54.41
223,-53.69
224,-52.87
225,-52.09
226,-51.26
227,-50.50
228,-49.77
229,-49.19
230,-48.71
231,-48.33
232,-47.97
233,-47.65
234,-47.39
235,-47.20
236,-47.06
237,-46.95
238,-46.89
239,-46.94
240,-47.13
241,-47.45
242,-47.94
243,-48.55
244,-49.22
245,-49.88
246,-50.47
247,-50.95
248,-51.32
249,-51.54
250,-51.65
251,-51.67
252,-51.72
253,-51.80
254,-51.92
255,-52.02
256,-52.17
257,-52.31
258,-52.44
259,-52.50
260,-52.51
261,-52.49
262,-52.55
263,-52.73
264,-53.04
265,-53.46
266,-53.96
267,-54.47
268,-54.94
269,-55.24
270,-55.33
271,-55.23
272,-55.02
273,-54.74
274,-54.43
275,-54.12
276,-53.90
277,-53.80
278,-53.84
279,-53.92
280,-54.03
281,-54.11
282,-54.21
283,-54.31
284,-54.49
285,-54.71
286,-55.05
287,-55.47
288,-56.09
289,-56.85
290,-57.82
291,-58.87
292,-60.04
293,-61.14
294,-62.29
295,-63.36
296,-64.51
297,-65.57
298,-66.67
299,-67.71
300,-68.88
301,-70.05
302,-71.25
303,-72.30
304,-73.28
305,-74.07
306,-74.82
307,-75.42
308,-76.02
309,-76.58
310,-77.24
311,-77.96
312,-78.87
313,-79.80
314,-80.78
315,-81.66
316,-82.50
317,-83.22
318,-83.90
319,-84.43
320,-84.95
321,-85.40
322,-85.91
323,-86.40
324,-86.94
325,-87.48
326,-88.14
327,-88.89
328,-89.81
329,-90.78
330,-91.84
331,-92.86
332,-93.92
333,-94.89
334,-95.79
335,-96.55
336,-97.25
337,-97.85
338,-98.47
339,-99.01
340,-99.55
341,-99.97
342,-100.38
343,-100.68
344,-100.96
345,-101.20
346,-101.56
347,-102.01
348,-102.64
349,-103.34
350,-104.16
351,-105.01
352,-105.93
353,-106.77
354,-107.61
355,-108.40
356,-109.26
357,-110.14
358,-111.05
359,-111.87
360,-112.66
361,-113.29
362,-113.83
363,-114.20
364,-114.49
365,-114.72
366,-114.96
367,-115.22
368,-115.52
369,-115.82
370,-116.09
371,-116.26
372,-116.34
373,-116.27
374,-116.07
375,-115.78
376,-115.43
377,-115.10
378,-114.79
379,-114.53
380,-114.27
381,-114.05
382,-113.81
383,-113.56
384,-113.22
385,-112.88
386,-112.49
387,-112.14
388,-111.79
389,-111.46
390,-111.05
391,-110.58
392,-109.97
393,-109.25
394,-108.35
395,-107.40
396,-106.41
397,-105.56
398,-104.85
399,-104.39
400,-104.10
401,-104.02
402,-103.97
403,-103.94
404,-103.74
405,-103.42
406,-102.86
407,-102.18
408,-101.36
409,-100.54
410,-99.72
411,-98.98
412,-98.28
413,-97.67
414,-97.13
415,-96.69
416,-96.28
417,-95.92
418,-95.55
419,-95.28
420,-94.97
421,-94.67
422,-94.26
423,-93.81
424,-93.20
425,-92.51
426,-91.64
427,-90.71
428,-89.65
429,-88.61
430,-87.46
431,-86.33
432,-85.11
433,-83.94
434,-82.73
435,-81.59
436,-80.41
437,-79.31
438,-78.20
439,-77.19
440,-76.11
441,-75.09
442,-74.09
443,-73.30
444,-72.69
445,-72.32
446,-72.09
447,-72.02
448,-72.01
449,-72.01
450,-71.96
451,-71.82
452,-71.60
453,-71.32
454,-71.04
455,-70.87
456,-70.99
457,-71.46
458,-72.27
459,-73.30
460,-74.45
461,-75.52
462,-76.42
463,-77.06
464,-77.44
465,-77.57
466,-77.50
467,-77.31
468,-77.16
469,-77.13
470,-77.20
471,-77.34
472,-77.45
473,-77.52
474,-77.47
475,-77.29
476,-76.87
477,-76.26
478,-75.39
479,-74.45
480,-73.32
481,-72.13
482,-70.69
483,-69.16
484,-67.40
485,-65.62
486,-63.67
487,-61.78
488,-59.81
489,-58.01
490,-56.15
491,-54.45
492,-52.70
493,-51.11
494,-49.48
495,-47.98
496,-46.41
497,-44.96
498,-43.50
499,-42.22
500,-40.98
501,-39.92
502,-38.89
503,-38.02
504,-37.22
505,-36.58
506,-36.03
507,-35.59
508,-35.21
509,-34.97
510,-34.83
511,-34.83
512,-34.93
513,-35.17
514,-35.59
515,-36.16
516,-36.79
517,-37.42
518,-38.07
519,-38.68
520,-39.26
521,-39.73
522,-40.15
523,-40.52
524,-40.93
525,-41.34
526,-41.79
527,-42.29
528,-42.88
529,-43.51
530,-44.12
531,-44.63
532,-45.02
533,-45.23
534,-45.22
535,-45.01
536,-44.64
537,-44.17
538,-43.59
539,-42.94
540,-42.21
541,-41.47
542,-40.72
543,-40.04
544,-39.41
545,-38.86
546,-38.31
547,-37.81
548,-37.32
549,-36.90
550,-36.44
551,-35.97
552,-35.44
553,-34.91
554,-34.38
555,-33.91
556,-33.48
557,-33.16
558,-32.96
559,-32.94
560,-33.04
561,-33.26
562,-33.55
563,-33.88
564,-34.19
565,-34.42
566,-34.50
567,-34.43
568,-34.25
569,-34.03
570,-33.87
571,-33.80
572,-33.87
573,-34.03
574,-34.33
575,-34.73
576,-35.18
577,-35.60
578,-35.93
579,-36.17
580,-36.33
581,-36.44
582,-36.53
583,-36.62
584,-36.75
585,-36.89
586,-37.03
587,-37.19
588,-37.39
589,-37.59
590,-37.73
591,-37.80
592,-37.84
593,-37.89
594,-37.94
595,-37.93
596,-37.93
597,-37.95
598,-38.04
599,-38.19
600,-38.37
601,-38.58
602,-38.83
603,-39.06
604,-39.28
605,-39.45
606,-39.61
607,-39.76
608,-39.91
609,-40.05
610,-40.20
611,-40.31
612,-40.41
613,-40.47
614,-40.50
615,-40.51
616,-40.57
617,-40.68
618,-40.89
619,-41.19
620,-41.57
621,-41.96
622,-42.31
623,-42.57
624,-42.79
625,-42.95
626,-43.12
627,-43.31
628,-43.64
629,-44.11
630,-44.75
631,-45.46
632,-46.23
633,-46.93
634,-47.58
635,-48.10
636,-48.55
637,-48.88
638,-49.23
639,-49.58
640,-49.95
641,-50.32
642,-50.77
643,-51.24
644,-51.73
645,-52.19
646,-52.57
647,-52.83
648,-52.99
649,-53.04
650,-53.04
651,-53.00
652,-52.95
653,-52.86
654,-52.73
655,-52.55
656,-52.32
657,-52.06
658,-51.77
659,-51.46
660,-51.15
661,-50.86
662,-50.61
663,-50.42
664,-50.30
665,-50.25
666,-50.25
667,-50.32
668,-50.40
669,-50.50
670,-50.59
671,-50.67
672,-50.75
673,-50.81
674,-50.87
675,-50.92
676,-50.99
677,-51.08
678,-51.22
679,-51.39
680,-51.60
681,-51.80
682,-52.02
683,-52.23
684,-52.44
685,-52.62
686,-52.72
687,-52.75
688,-52.75
689,-52.75
690,-52.73
691,-52.67
692,-52.57
693,-52.44
694,-52.35
695,-52.28
696,-52.27
697,-52.27
698,-52.27
699,-52.27
700,-52.25
701,-52.19
702,-52.07
703,-51.90
704,-51.67
705,-51.47
706,-51.28
707,-51.17
708,-51.11
709,-51.12
710,-51.13
711,-51.12
712,-51.02
713,-50.80
714,-50.46
715,-50.05
716,-49.61
717,-49.22
718,-48.87
719,-48.61
720,-48.45
721,-48.42
722,-48.50
723,-48.62
724,-48.74
725,-48.87
726,-48.98
727,-49.05
728,-49.03
729,-48.93
730,-48.81
731,-48.72
732,-48.66
733,-48.64
734,-48.64
735,-48.66
736,-48.71
737,-48.75
738,-48.71
739,-48.57
740,-48.32
741,-48.01
742,-47.70
743,-47.45
744,-47.34
745,-47.37
746,-47.52
747,-47.74
748,-47.99
749,-48.23
750,-48.42
751,-48.52
752,-48.48
753,-48.34
754,-48.07
755,-47.74
756,-47.38
757,-47.03
758,-46.68
759,-46.36
760,-46.04
761,-45.75
762,-45.43
763,-45.10
764,-44.78
765,-44.46
766,-44.10
767,-43.75
768,-43.41
769,-43.14
770,-42.94
771,-42.82
772,-42.78
773,-42.85
774,-43.00
775,-43.19
776,-43.33
777,-43.39
778,-43.38
779,-43.33
780,-43.22
781,-43.10
782,-42.99
783,-42.94
784,-42.92
785,-42.92
786,-42.94
787,-42.99
788,-43.09
789,-43.17
790,-43.24
791,-43.30
792,-43.40
793,-43.53
794,-43.72
795,-43.93
796,-44.19
797,-44.48
798,-44.82
799,-45.17
800,-45.57
801,-45.95
802,-46.30
803,-46.56
804,-46.78
805,-46.94
806,-47.10
807,-47.25
808,-47.42
809,-47.62
810,-47.87
811,-48.17
812,-48.51
813,-48.83
814,-49.16
815,-49.45
816,-49.72
817,-49.96
818,-50.16
819,-50.27
820,-50.29
821,-50.22
822,-50.15
823,-50.07
824,-50.04
825,-50.10
826,-50.31
827,-50.62
828,-51.02
829,-51.41
830,-51.82
831,-52.16
832,-52.42
833,-52.57
834,-52.70
835,-52.83
836,-52.98
837,-53.13
838,-53.33
839,-53.56
840,-53.81
841,-54.05
842,-54.28
843,-54.45
844,-54.57
845,-54.62
846,-54.70
847,-54.79
848,-54.95
849,-55.13
850,-55.35
851,-55.58
852,-55.83
853,-56.07
854,-56.33
855,-56.59
856,-56.86
857,-57.17
858,-57.52
859,-57.89
860,-58.28
861,-58.65
862,-58.98
863,-59.19
864,-59.22
865,-59.07
866,-58.80
867,-58.49
868,-58.16
869,-57.84
870,-57.54
871,-57.30
872,-57.11
873,-56.97
874,-56.85
875,-56.73
876,-56.58
877,-56.40
878,-56.21
879,-56.07
880,-55.95
881,-55.90
882,-55.89
883,-55.92
884,-55.97
885,-56.00
886,-56.01
887,-56.01
888,-56.01
889,-56.02
890,-56.00
891,-55.97
892,-55.92
893,-55.89
894,-55.89
895,-55.89
896,-55.87
897,-55.88
898,-55.95
899,-56.10
900,-56.28
901,-56.47
902,-56.63
903,-56.76
904,-56.79
905,-56.66
906,-56.40
907,-56.05
908,-55.61
909,-55.13
910,-54.64
911,-54.22
912,-53.90
913,-53.70
914,-53.56
915,-53.45
916,-53.32
917,-53.22
918,-53.09
919,-52.92
920,-52.64
921,-52.29
922,-51.87
923,-51.44
924,-50.93
925,-50.40
926,-49.84
927,-49.39
928,-48.99
929,-48.68
930,-48.34
931,-48.00
932,-47.61
933,-47.23
934,-46.78
935,-46.26
936,-45.63
937,-44.98
938,-44.31
939,-43.75
940,-43.30
941,-42.98
942,-42.74
943,-42.57
944,-42.43
945,-42.31
946,-42.20
947,-42.09
948,-41.93
949,-41.75
950,-41.58
951,-41.49
952,-41.49
953,-41.58
954,-41.74
955,-41.92
956,-42.11
957,-42.29
958,-42.44
959,-42.54
960,-42.66
961,-42.82
962,-43.15
963,-43.60
964,-44.27
965,-45.06
966,-46.04
967,-47.10
968,-48.24
969,-49.26
970,-50.21
971,-50.99
972,-51.74
973,-52.39
974,-53.07
975,-53.76
976,-54.65
977,-55.66
978,-56.85
979,-58.00
980,-59.16
981,-60.14
982,-61.00
983,-61.60
984,-62.07
985,-62.36
986,-62.61
987,-62.80
988,-63.07
989,-63.40
990,-63.87
991,-64.41
992,-65.03
993,-65.64
994,-66.25
995,-66.78
996,-67.26
997,-67.66
998,-68.04
999,-68.35
1000,-68.66
1001,-68.98
1002,-69.38
1003,-69.82
1004,-70.31
1005,-70.79
1006,-71.26
1007,-71.70
1008,-72.11
1009,-72.41
1010,-72.57
1011,-72.57
1012,-72.42
1013,-72.14
1014,-71.79
1015,-71.43
1016,-71.09
1017,-70.77
1018,-70.42
1019,-70.07
1020,-69.73
1021,-69.43
1022,-69.13
1023,-68.84
1024,-68.57
1025,-68.35
1026,-68.19
1027,-68.12
1028,-68.10
1029,-68.15
1030,-68.15
1031,-68.06
1032,-67.86
1033,-67.60
1034,-67.28
1035,-66.99
1036,-66.72
1037,-66.54
1038,-66.46
1039,-66.47
1040,-66.51
1041,-66.54
1042,-66.55
1043,-66.53
1044,-66.43
1045,-66.25
1046,-65.99
1047,-65.72
1048,-65.48
1049,-65.27
1050,-65.09
1051,-64.93
1052,-64.83
1053,-64.83
1054,-64.93
1055,-65.09
1056,-65.27
1057,-65.44
1058,-65.61
1059,-65.73
1060,-65.80
1061,-65.83
1062,-65.86
1063,-65.93
1064,-66.10
1065,-66.41
1066,-66.86
1067,-67.37
1068,-67.84
1069,-68.18
1070,-68.34
1071,-68.28
1072,-67.96
1073,-67.44
1074,-66.87
1075,-66.34
1076,-65.93
1077,-65.70
1078,-65.69
1079,-65.90
1080,-66.24
1081,-66.64
1082,-67.05
1083,-67.44
1084,-67.77
1085,-67.98
1086,-68.07
1087,-68.10
1088,-68.11
1089,-68.14
1090,-68.19
1091,-68.22
1092,-68.20
1093,-68.12
1094,-67.96
1095,-67.75
1096,-67.48
1097,-67.18
1098,-66.88
1099,-66.58
1100,-66.28
1101,-65.99
1102,-65.70
1103,-65.46
1104,-65.28
1105,-65.16
1106,-65.09
1107,-65.06
1108,-65.07
1109,-65.15
1110,-65.22
1111,-65.25
1112,-65.19
1113,-65.05
1114,-64.83
1115,-64.57
1116,-64.22
1117,-63.85
1118,-63.41
1119,-62.97
1120,-62.51
1121,-62.03
1122,-61.53
1123,-61.07
1124,-60.62
1125,-60.24
1126,-59.87
1127,-59.56
1128,-59.28
1129,-59.05
1130,-58.75
1131,-58.43
1132,-58.04
1133,-57.65
1134,-57.19
1135,-56.74
1136,-56.28
1137,-55.90
1138,-55.50
1139,-55.08
1140,-54.55
1141,-53.96
1142,-53.28
1143,-52.64
1144,-52.05
1145,-51.63
1146,-51.38
1147,-51.36
1148,-51.54
1149,-51.89
1150,-52.25
1151,-52.57
1152,-52.76
1153,-52.82
1154,-52.74
1155,-52.60
1156,-52.55
1157,-52.63
1158,-52.86
1159,-53.19
1160,-53.62
1161,-54.08
1162,-54.59
1163,-55.02
1164,-55.44
1165,-55.80
1166,-56.25
1167,-56.73
1168,-57.33
1169,-58.01
1170,-58.85
1171,-59.75
1172,-60.72
1173,-61.68
1174,-62.64
1175,-63.55
1176,-64.40
1177,-65.08
1178,-65.66
1179,-66.09
1180,-66.40
1181,-66.51
1182,-66.48
1183,-66.35
1184,-66.18
1185,-65.97
1186,-65.71
1187,-65.43
1188,-65.09
1189,-64.74
1190,-64.29
1191,-63.81
1192,-63.26
1193,-62.68
1194,-61.95
1195,-61.14
1196,-60.20
1197,-59.23
1198,-58.14
1199,-57.03
1200,-55.87
1201,-54.81
1202,-53.79
1203,-52.99
1204,-52.30
1205,-51.77
1206,-51.20
1207,-50.64
1208,-49.95
1209,-49.23
1210,-48.37
1211,-47.48
1212,-46.47
1213,-45.50
1214,-44.50
1215,-43.62
1216,-42.72
1217,-41.88
1218,-40.93
1219,-40.01
1220,-39.08
1221,-38.28
1222,-37.53
1223,-36.93
1224,-36.45
1225,-36.17
1226,-35.94
1227,-35.80
1228,-35.64
1229,-35.48
1230,-35.18
1231,-34.78
1232,-34.26
1233,-33.74
1234,-33.16
1235,-32.62
1236,-32.04
1237,-31.51
1238,-31.00
1239,-30.57
1240,-30.16
1241,-29.79
1242,-29.36
1243,-28.96
1244,-28.56
1245,-28.21
1246,-27.82
1247,-27.49
1248,-27.20
1249,-26.99
1250,-26.78
1251,-26.56
1252,-26.31
1253,-26.10
1254,-25.88
1255,-25.62
1256,-25.31
1257,-25.04
1258,-24.85
1259,-24.78
1260,-24.86
1261,-25.08
1262,-25.41
1263,-25.79
1264,-26.21
1265,-26.63
1266,-27.06
1267,-27.49
1268,-27.96
1269,-28.43
1270,-28.95
1271,-29.47
1272,-30.05
1273,-30.64
1274,-31.28
1275,-31.92
1276,-32.62
1277,-33.29
1278,-33.99
1279,-34.63
1280,-35.24
1281,-35.71
1282,-36.06
1283,-36.22
1284,-36.24
1285,-36.13
1286,-36.04
1287,-36.00
1288,-36.04
1289,-36.13
1290,-36.26
1291,-36.45
1292,-36.67
1293,-36.88
1294,-37.02
1295,-37.11
1296,-37.20
1297,-37.31
1298,-37.42
1299,-37.52
1300,-37.61
1301,-37.70
1302,-37.77
1303,-37.73
1304,-37.62
1305,-37.46
1306,-37.31
1307,-37.19
1308,-37.09
1309,-37.07
1310,-37.14
1311,-37.28
1312,-37.45
1313,-37.61
1314,-37.74
1315,-37.80
1316,-37.77
1317,-37.67
1318,-37.60
1319,-37.61
1320,-37.77
1321,-38.06
1322,-38.54
1323,-39.16
1324,-39.89
1325,-40.60
1326,-41.28
1327,-41.84
1328,-42.28
1329,-42.53
1330,-42.66
1331,-42.70
1332,-42.80
1333,-42.96
1334,-43.25
1335,-43.63
1336,-44.16
1337,-44.77
1338,-45.45
1339,-46.07
1340,-46.65
1341,-47.13
1342,-47.47
1343,-47.65
1344,-47.70
1345,-47.68
1346,-47.68
1347,-47.70
1348,-47.79
1349,-47.93
1350,-48.16
1351,-48.42
1352,-48.71
1353,-48.94
1354,-49.12
1355,-49.19
1356,-49.25
1357,-49.28
1358,-49.40
1359,-49.65
1360,-50.16
1361,-50.86
1362,-51.77
1363,-52.72
1364,-53.70
1365,-54.57
1366,-55.38
1367,-56.01
1368,-56.59
1369,-57.08
1370,-57.69
1371,-58.37
1372,-59.30
1373,-60.34
1374,-61.58
1375,-62.88
1376,-64.28
1377,-65.60
1378,-66.87
1379,-67.95
1380,-68.95
1381,-69.82
1382,-70.66
1383,-71.35
1384,-71.98
1385,-72.46
1386,-72.90
1387,-73.21
1388,-73.44
1389,-73.55
1390,-73.61
1391,-73.59
1392,-73.55
1393,-73.49
1394,-73.45
1395,-73.41
1396,-73.37
1397,-73.34
1398,-73.36
1399,-73.42
1400,-73.49
1401,-73.54
1402,-73.49
1403,-73.38
1404,-73.15
1405,-72.83
1406,-72.40
1407,-71.90
1408,-71.31
1409,-70.69
1410,-70.01
1411,-69.31
1412,-68.55
1413,-67.78
1414,-66.96
1415,-66.19
1416,-65.51
1417,-64.94
1418,-64.44
1419,-64.04
1420,-63.72
1421,-63.52
1422,-63.35
1423,-63.22
1424,-63.09
1425,-63.00
1426,-62.93
1427,-62.88
1428,-62.84
1429,-62.84
1430,-62.90
1431,-62.94
1432,-62.94
1433,-62.84
1434,-62.75
1435,-62.67
1436,-62.68
1437,-62.77
1438,-63.09
1439,-63.64
1440,-64.50
1441,-65.53
1442,-66.71
1443,-67.89
1444,-69.12
1445,-70.26
1446,-71.34
1447,-72.24
1448,-73.09
1449,-73.86
1450,-74.73
1451,-75.62
1452,-76.66
1453,-77.71
1454,-78.87
1455,-79.96
1456,-81.09
1457,-82.08
1458,-83.05
1459,-83.85
1460,-84.58
1461,-85.21
1462,-85.92
1463,-86.66
1464,-87.50
1465,-88.33
1466,-89.19
1467,-89.92
1468,-90.51
1469,-90.86
1470,-91.06
1471,-91.16
1472,-91.22
1473,-91.27
1474,-91.39
1475,-91.59
1476,-91.88
1477,-92.19
1478,-92.44
1479,-92.58
1480,-92.52
1481,-92.29
1482,-91.87
1483,-91.33
1484,-90.71
1485,-90.14
1486,-89.55
1487,-89.00
1488,-88.38
1489,-87.76
1490,-87.02
1491,-86.24
1492,-85.28
1493,-84.27
1494,-83.11
1495,-81.96
1496,-80.66
1497,-79.35
1498,-77.90
1499,-76.52
1500,-75.05
1501,-73.66
1502,-72.17
1503,-70.79
1504,-69.35
1505,-68.02
1506,-66.57
1507,-65.14
1508,-63.54
1509,-61.96
1510,-60.27
1511,-58.70
1512,-57.15
1513,-55.84
1514,-54.64
1515,-53.67
1516,-52.77
1517,-52.06
1518,-51.38
1519,-50.80
1520,-50.13
1521,-49.50
1522,-48.84
1523,-48.29
1524,-47.78
1525,-47.37
1526,-46.91
1527,-46.45
1528,-45.92
1529,-45.43
1530,-44.93
1531,-44.49
1532,-44.07
1533,-43.73
1534,-43.44
1535,-43.21
1536,-42.93
1537,-42.59
1538,-42.16
1539,-41.68
1540,-41.15
1541,-40.64
1542,-40.23
1543,-39.99
1544,-39.91
1545,-40.01
1546,-40.25
1547,-40.59
1548,-40.93
1549,-41.18
1550,-41.28
1551,-41.25
1552,-41.11
1553,-40.89
1554,-40.66
1555,-40.53
1556,-40.59
1557,-40.83
1558,-41.21
1559,-41.57
1560,-41.84
1561,-41.97
1562,-41.95
1563,-41.79
1564,-41.49
1565,-41.13
1566,-40.82
1567,-40.64
1568,-40.55
1569,-40.54
1570,-40.57
1571,-40.61
1572,-40.53
1573,-40.27
1574,-39.83
1575,-39.31
1576,-38.76
1577,-38.23
1578,-37.72
1579,-37.31
1580,-37.02
1581,-36.88
1582,-36.83
1583,-36.83
1584,-36.86
1585,-36.92
1586,-37.03
1587,-37.18
1588,-37.34
1589,-37.51
1590,-37.75
1591,-38.05
1592,-38.38
1593,-38.70
1594,-39.05
1595,-39.43
1596,-39.86
1597,-40.30
1598,-40.77
1599,-41.21
1600,-41.65
1601,-42.05
1602,-42.49
1603,-42.92
1604,-43.41
1605,-43.90
1606,-44.43
1607,-44.95
1608,-45.52
1609,-46.07
1610,-46.65
1611,-47.18
1612,-47.71
1613,-48.20
1614,-48.71
1615,-49.21
1616,-49.73
1617,-50.19
1618,-50.63
1619,-50.97
1620,-51.28
1621,-51.51
1622,-51.68
1623,-51.75
1624,-51.83
1625,-51.93
1626,-52.13
1627,-52.39
1628,-52.75
1629,-53.12
1630,-53.54
1631,-53.95
1632,-54.38
1633,-54.79
1634,-55.20
1635,-55.58
1636,-55.98
1637,-56.36
1638,-56.72
1639,-57.01
1640,-57.28
1641,-57.48
1642,-57.62
1643,-57.67
1644,-57.68
1645,-57.64
1646,-57.59
1647,-57.53
1648,-57.48
1649,-57.44
1650,-57.44
1651,-57.47
1652,-57.55
1653,-57.66
1654,-57.81
1655,-58.00
1656,-58.23
1657,-58.46
1658,-58.67
1659,-58.85
1660,-59.02
1661,-59.14
1662,-59.16
1663,-59.07
1664,-58.91
1665,-58.75
1666,-58.62
1667,-58.49
1668,-58.43
1669,-58.46
1670,-58.59
1671,-58.78
1672,-58.95
1673,-59.10
1674,-59.23
1675,-59.32
1676,-59.34
1677,-59.29
1678,-59.17
1679,-59.04
1680,-58.94
1681,-58.88
1682,-58.88
1683,-58.94
1684,-59.04
1685,-59.14
1686,-59.20
1687,-59.23
1688,-59.23
1689,-59.20
1690,-59.13
1691,-59.05
1692,-58.95
1693,-58.85
1694,-58.63
1695,-58.36
1696,-57.98
1697,-57.55
1698,-56.93
1699,-56.21
1700,-55.37
1701,-54.51
1702,-53.57
1703,-52.64
1704,-51.69
1705,-50.81
1706,-49.88
1707,-48.97
1708,-47.96
1709,-46.99
1710,-45.97
1711,-45.05
1712,-44.14
1713,-43.37
1714,-42.58
1715,-41.88
1716,-41.11
1717,-40.40
1718,-39.58
1719,-38.78
1720,-37.90
1721,-37.09
1722,-36.23
1723,-35.42
1724,-34.57
1725,-33.79
1726,-33.00
1727,-32.26
1728,-31.54
1729,-30.92
1730,-30.40
1731,-30.03
1732,-29.72
1733,-29.50
1734,-29.31
1735,-29.17
1736,-29.05
1737,-28.97
1738,-28.90
1739,-28.89
1740,-29.00
1741,-29.21
1742,-29.49
1743,-29.79
1744,-30.09
1745,-30.39
1746,-30.69
1747,-31.02
1748,-31.38
1749,-31.76
1750,-32.17
1751,-32.56
1752,-32.91
1753,-33.13
1754,-33.26
1755,-33.29
1756,-33.26
1757,-33.22
1758,-33.21
1759,-33.24
1760,-33.33
1761,-33.45
1762,-33.56
1763,-33.63
1764,-33.64
1765,-33.58
1766,-33.44
1767,-33.29
1768,-33.16
1769,-33.12
1770,-33.08
1771,-33.01
1772,-32.80
1773,-32.45
1774,-31.94
1775,-31.30
1776,-30.58
1777,-29.87
1778,-29.21
1779,-28.71
1780,-28.33
1781,-28.11
1782,-27.98
1783,-27.90
1784,-27.76
1785,-27.57
1786,-27.31
1787,-27.06
1788,-26.86
1789,-26.79
1790,-26.83
1791,-27.02
1792,-27.28
1793,-27.53
1794,-27.69
1795,-27.73
1796,-27.59
1797,-27.29
1798,-26.87
1799,-26.42
1800,-25.97
1801,-25.56
1802,-25.17
1803,-24.82
1804,-24.47
1805,-24.12
1806,-23.74
1807,-23.38
1808,-23.07
1809,-22.87
1810,-22.74
1811,-22.70
1812,-22.67
1813,-22.69
1814,-22.66
1815,-22.62
1816,-22.51
1817,-22.34
1818,-22.05
1819,-21.67
1820,-21.19
1821,-20.68
1822,-20.16
1823,-19.65
1824,-19.18
1825,-18.82
1826,-18.62
1827,-18.55
1828,-18.59
1829,-18.69
1830,-18.84
1831,-19.01
1832,-19.17
1833,-19.33
1834,-19.52
1835,-19.71
1836,-19.92
1837,-20.13
1838,-20.39
1839,-20.68
1840,-20.99
1841,-21.26
1842,-21.50
1843,-21.69
1844,-21.88
1845,-22.05
1846,-22.26
1847,-22.48
1848,-22.74
1849,-23.00
1850,-23.35
1851,-23.74
1852,-24.24
1853,-24.77
1854,-25.38
1855,-26.03
1856,-26.71
1857,-27.33
1858,-27.92
1859,-28.41
1860,-28.86
1861,-29.20
1862,-29.49
1863,-29.72
1864,-29.98
1865,-30.24
1866,-30.49
1867,-30.69
1868,-30.89
1869,-31.06
1870,-31.20
1871,-31.29
1872,-31.36
1873,-31.38
1874,-31.36
1875,-31.30
1876,-31.23
1877,-31.16
1878,-31.11
1879,-31.08
1880,-31.07
1881,-31.11
1882,-31.17
1883,-31.20
1884,-31.17
1885,-31.12
1886,-31.06
1887,-30.98
1888,-30.79
1889,-30.56
1890,-30.33
1891,-30.16
1892,-29.95
1893,-29.67
1894,-29.27
1895,-28.82
1896,-28.31
1897,-27.76
1898,-27.12
1899,-26.50
1900,-25.93
1901,-25.49
1902,-25.12
1903,-24.81
1904,-24.49
1905,-24.20
1906,-23.89
1907,-23.57
1908,-23.22
1909,-22.89
1910,-22.60
1911,-22.40
1912,-22.28
1913,-22.25
1914,-22.29
1915,-22.39
1916,-22.51
1917,-22.64
1918,-22.69
1919,-22.67
1920,-22.58
1921,-22.45
1922,-22.32
1923,-22.22
1924,-22.23
1925,-22.38
1926,-22.67
1927,-23.06
1928,-23.49
1929,-23.89
1930,-24.19
1931,-24.34
1932,-24.33
1933,-24.18
1934,-23.93
1935,-23.64
1936,-23.42
1937,-23.30
1938,-23.30
1939,-23.39
1940,-23.53
1941,-23.64
1942,-23.74
1943,-23.77
1944,-23.74
1945,-23.61
1946,-23.41
1947,-23.23
1948,-23.12
1949,-23.09
1950,-23.11
1951,-23.14
1952,-23.19
1953,-23.23
1954,-23.30
1955,-23.38
1956,-23.55
1957,-23.80
1958,-24.20
1959,-24.73
1960,-25.42
1961,-26.17
1962,-26.92
1963,-27.56
1964,-28.14
1965,-28.66
1966,-29.20
1967,-29.68
1968,-30.19
1969,-30.69
1970,-31.23
1971,-31.72
1972,-32.17
1973,-32.55
1974,-32.95
1975,-33.32
1976,-33.70
1977,-34.04
1978,-34.44
1979,-34.84
1980,-35.25
1981,-35.55
1982,-35.75
1983,-35.86
1984,-35.93
1985,-35.95
1986,-35.97
1987,-36.02
1988,-36.16
1989,-36.40
1990,-36.71
1991,-37.01
1992,-37.28
1993,-37.48
1994,-37.63
1995,-37.68
1996,-37.66
1997,-37.56
1998,-37.45
1999,-37.35
2000,-37.28
2001,-37.25
2002,-37.30
2003,-37.45
2004,-37.68
2005,-37.96
2006,-38.23
2007,-38.46
2008,-38.66
2009,-38.77
2010,-38.83
2011,-38.82
2012,-38.80
2013,-38.79
2014,-38.85
2015,-38.99
2016,-39.25
2017,-39.60
2018,-40.05
2019,-40.46
2020,-40.83
2021,-41.12
2022,-41.39
2023,-41.59
2024,-41.72
2025,-41.77
2026,-41.82
2027,-41.91
2028,-42.03
2029,-42.15
2030,-42.24
2031,-42.30
2032,-42.34
2033,-42.30
2034,-42.19
2035,-42.02
2036,-41.82
2037,-41.63
2038,-41.46
2039,-41.31
2040,-41.22
2041,-41.18
2042,-41.19
2043,-41.26
2044,-41.40
2045,-41.61
2046,-41.85
2047,-42.13
2048,-42.43
2049,-42.70
2050,-42.88
2051,-42.88
2052,-42.70
2053,-42.36
2054,-41.92
2055,-41.42
2056,-40.99
2057,-40.67
2058,-40.56
2059,-40.60
2060,-40.84
2061,-41.26
2062,-41.89
2063,-42.66
2064,-43.50
2065,-44.33
2066,-45.19
2067,-46.00
2068,-46.81
2069,-47.57
2070,-48.39
2071,-49.22
2072,-50.18
2073,-51.17
2074,-52.30
2075,-53.41
2076,-54.54
2077,-55.53
2078,-56.50
2079,-57.35
2080,-58.24
2081,-59.04
2082,-59.90
2083,-60.74
2084,-61.65
2085,-62.54
2086,-63.42
2087,-64.19
2088,-64.86
2089,-65.34
2090,-65.71
2091,-65.93
2092,-66.10
2093,-66.20
2094,-66.31
2095,-66.38
2096,-66.47
2097,-66.55
2098,-66.67
2099,-66.79
2100,-66.89
2101,-66.98
2102,-67.11
2103,-67.25
2104,-67.37
2105,-67.43
2106,-67.45
2107,-67.47
2108,-67.53
2109,-67.55
2110,-67.54
2111,-67.50
2112,-67.52
2113,-67.57
2114,-67.67
2115,-67.77
2116,-67.95
2117,-68.21
2118,-68.59
2119,-68.99
2120,-69.44
2121,-69.88
2122,-70.37
2123,-70.86
2124,-71.40
2125,-71.93
2126,-72.48
2127,-73.00
2128,-73.53
2129,-74.04
2130,-74.55
2131,-74.98
2132,-75.34
2133,-75.60
2134,-75.86
2135,-76.11
2136,-76.35
2137,-76.57
2138,-76.81
2139,-77.02
2140,-77.25
2141,-77.45
2142,-77.70
2143,-77.93
2144,-78.09
2145,-78.14
2146,-78.18
2147,-78.22
2148,-78.32
2149,-78.39
2150,-78.51
2151,-78.67
2152,-78.96
2153,-79.38
2154,-79.94
2155,-80.55
2156,-81.22
2157,-81.83
2158,-82.43
2159,-82.98
2160,-83.56
2161,-84.14
2162,-84.78
2163,-85.39
2164,-86.04
2165,-86.65
2166,-87.27
2167,-87.76
2168,-88.14
2169,-88.36
2170,-88.57
2171,-88.80
2172,-89.19
2173,-89.68
2174,-90.36
2175,-91.15
2176,-92.06
2177,-92.98
2178,-93.94
2179,-94.82
2180,-95.63
2181,-96.28
2182,-96.83
2183,-97.29
2184,-97.72
2185,-98.11
2186,-98.46
2187,-98.75
2188,-98.96
2189,-99.05
2190,-99.04
2191,-98.95
2192,-98.78
2193,-98.54
2194,-98.25
2195,-97.97
2196,-97.66
2197,-97.34
2198,-96.92
2199,-96.44
2200,-95.83
2201,-95.14
2202,-94.23
2203,-93.19
2204,-91.95
2205,-90.71
2206,-89.42
2207,-88.23
2208,-87.04
2209,-85.98
2210,-84.87
2211,-83.81
2212,-82.60
2213,-81.38
2214,-80.06
2215,-78.80
2216,-77.50
2217,-76.31
2218,-75.13
2219,-74.13
2220,-73.15
2221,-72.28
2222,-71.39
2223,-70.58
2224,-69.76
2225,-69.04
2226,-68.34
2227,-67.73
2228,-67.15
2229,-66.72
2230,-66.40
2231,-66.24
2232,-66.12
2233,-66.06
2234,-65.95
2235,-65.78
2236,-65.48
2237,-65.13
2238,-64.76
2239,-64.42
2240,-64.13
2241,-63.89
2242,-63.76
2243,-63.76
2244,-63.85
2245,-63.98
2246,-64.10
2247,-64.19
2248,-64.25
2249,-64.27
2250,-64.29
2251,-64.35
2252,-64.47
2253,-64.65
2254,-64.88
2255,-65.11
2256,-65.35
2257,-65.59
2258,-65.85
2259,-66.11
2260,-66.39
2261,-66.65
2262,-66.91
2263,-67.14
2264,-67.38
2265,-67.58
2266,-67.76
2267,-67.90
2268,-68.05
2269,-68.26
2270,-68.57
2271,-68.95
2272,-69.38
2273,-69.82
2274,-70.23
2275,-70.53
2276,-70.60
2277,-70.40
2278,-69.92
2279,-69.24
2280,-68.35
2281,-67.38
2282,-66.36
2283,-65.44
2284,-64.59
2285,-63.90
2286,-63.28
2287,-62.74
2288,-62.13
2289,-61.50
2290,-60.77
2291,-60.05
2292,-59.21
2293,-58.35
2294,-57.35
2295,-56.37
2296,-55.30
2297,-54.28
2298,-53.22
2299,-52.22
2300,-51.23
2301,-50.39
2302,-49.64
2303,-49.06
2304,-48.56
2305,-48.14
2306,-47.68
2307,-47.23
2308,-46.67
2309,-46.06
2310,-45.32
2311,-44.56
2312,-43.79
2313,-43.10
2314,-42.47
2315,-41.93
2316,-41.53
2317,-41.29
2318,-41.19
2319,-41.21
2320,-41.42
2321,-41.78
2322,-42.36
2323,-43.10
2324,-44.06
2325,-45.14
2326,-46.39
2327,-47.64
2328,-49.01
2329,-50.37
2330,-51.87
2331,-53.32
2332,-54.86
2333,-56.30
2334,-57.86
2335,-59.36
2336,-60.99
2337,-62.58
2338,-64.36
2339,-66.14
2340,-68.03
2341,-69.80
2342,-71.53
2343,-72.98
2344,-74.24
2345,-75.16
2346,-75.88
2347,-76.32
2348,-76.66
2349,-76.87
2350,-77.11
2351,-77.39
2352,-77.77
2353,-78.19
2354,-78.63
2355,-79.02
2356,-79.32
2357,-79.48
2358,-79.44
2359,-79.25
2360,-78.84
2361,-78.28
2362,-77.53
2363,-76.68
2364,-75.69
2365,-74.64
2366,-73.46
2367,-72.25
2368,-70.98
2369,-69.78
2370,-68.57
2371,-67.50
2372,-66.47
2373,-65.65
2374,-64.83
2375,-64.11
2376,-63.25
2377,-62.41
2378,-61.39
2379,-60.33
2380,-59.03
2381,-57.70
2382,-56.25
2383,-54.89
2384,-53.42
2385,-52.01
2386,-50.51
2387,-49.08
2388,-47.57
2389,-46.13
2390,-44.59
2391,-43.17
2392,-41.73
2393,-40.46
2394,-39.19
2395,-38.11
2396,-37.03
2397,-36.13
2398,-35.19
2399,-34.35
2400,-33.36
2401,-32.33
2402,-31.11
2403,-29.86
2404,-28.44
2405,-27.01
2406,-25.49
2407,-24.08
2408,-22.73
2409,-21.63
2410,-20.70
2411,-20.04
2412,-19.51
2413,-19.17
2414,-18.83
2415,-18.51
2416,-17.98
2417,-17.30
2418,-16.37
2419,-15.30
2420,-14.08
2421,-12.88
2422,-11.70
2423,-10.69
2424,-9.82
2425,-9.15
2426,-8.62
2427,-8.27
2428,-8.05
2429,-7.94
2430,-7.87
2431,-7.88
2432,-7.97
2433,-8.14
2434,-8.39
2435,-8.75
2436,-9.26
2437,-9.92
2438,-10.69
2439,-11.46
2440,-12.23
2441,-12.90
2442,-13.50
2443,-13.93
2444,-14.27
2445,-14.48
2446,-14.72
2447,-15.02
2448,-15.54
2449,-16.20
2450,-17.03
2451,-17.90
2452,-18.81
2453,-19.58
2454,-20.13
2455,-20.36
2456,-20.35
2457,-20.16
2458,-19.84
2459,-19.45
2460,-19.04
2461,-18.68
2462,-18.40
2463,-18.23
2464,-18.13
2465,-18.07
2466,-18.01
2467,-17.92
2468,-17.81
2469,-17.66
2470,-17.45
2471,-17.19
2472,-16.88
2473,-16.57
2474,-16.32
2475,-16.17
2476,-16.14
2477,-16.22
2478,-16.41
2479,-16.65
2480,-16.92
2481,-17.15
2482,-17.36
2483,-17.52
2484,-17.75
2485,-18.05
2486,-18.52
2487,-19.10
2488,-19.85
2489,-20.65
2490,-21.49
2491,-22.22
2492,-22.88
2493,-23.40
2494,-23.88
2495,-24.29
2496,-24.76
2497,-25.22
2498,-25.77
2499,-26.28
2500,-26.81
2501,-27.27
2502,-27.76
2503,-28.25
2504,-28.80
2505,-29.37
2506,-30.08
2507,-30.88
2508,-31.77
2509,-32.60
2510,-33.35
2511,-33.91
2512,-34.29
2513,-34.45
2514,-34.48
2515,-34.44
2516,-34.43
2517,-34.47
2518,-34.61
2519,-34.78
2520,-35.01
2521,-35.21
2522,-35.36
2523,-35.42
2524,-35.42
2525,-35.36
2526,-35.36
2527,-35.43
2528,-35.68
2529,-36.08
2530,-36.70
2531,-37.43
2532,-38.30
2533,-39.17
2534,-40.12
2535,-40.99
2536,-41.85
2537,-42.63
2538,-43.44
2539,-44.24
2540,-45.19
2541,-46.17
2542,-47.29
2543,-48.42
2544,-49.68
2545,-50.90
2546,-52.19
2547,-53.37
2548,-54.61
2549,-55.79
2550,-57.11
2551,-58.43
2552,-59.91
2553,-61.40
2554,-63.05
2555,-64.65
2556,-66.28
2557,-67.71
2558,-69.05
2559,-70.18
2560,-71.24
2561,-72.14
2562,-72.99
2563,-73.71
2564,-74.41
2565,-75.00
2566,-75.61
2567,-76.16
2568,-76.74
2569,-77.22
2570,-77.64
2571,-77.93
2572,-78.16
2573,-78.31
2574,-78.36
2575,-78.30
2576,-78.15
2577,-77.94
2578,-77.66
2579,-77.32
2580,-76.85
2581,-76.32
2582,-75.71
2583,-75.07
2584,-74.32
2585,-73.50
2586,-72.59
2587,-71.68
2588,-70.69
2589,-69.76
2590,-68.83
2591,-68.05
2592,-67.33
2593,-66.71
2594,-66.02
2595,-65.33
2596,-64.54
2597,-63.77
2598,-62.87
2599,-61.94
2600,-60.92
2601,-59.99
2602,-59.07
2603,-58.24
2604,-57.33
2605,-56.44
2606,-55.45
2607,-54.49
2608,-53.47
2609,-52.55
2610,-51.65
2611,-50.96
2612,-50.38
2613,-50.01
2614,-49.64
2615,-49.33
2616,-48.88
2617,-48.34
2618,-47.57
2619,-46.67
2620,-45.59
2621,-44.51
2622,-43.37
2623,-42.28
2624,-41.18
2625,-40.15
2626,-39.12
2627,-38.20
2628,-37.28
2629,-36.47
2630,-35.68
2631,-35.01
2632,-34.39
2633,-33.94
2634,-33.57
2635,-33.32
2636,-33.07
2637,-32.84
2638,-32.63
2639,-32.51
2640,-32.49
2641,-32.59
2642,-32.78
2643,-33.07
2644,-33.48
2645,-33.96
2646,-34.48
2647,-34.96
2648,-35.37
2649,-35.65
2650,-35.87
2651,-36.03
2652,-36.24
2653,-36.46
2654,-36.75
2655,-37.03
2656,-37.38
2657,-37.75
2658,-38.19
2659,-38.60
2660,-38.99
2661,-39.37
2662,-39.83
2663,-40.37
2664,-41.07
2665,-41.83
2666,-42.72
2667,-43.60
2668,-44.46
2669,-45.14
2670,-45.68
2671,-46.04
2672,-46.32
2673,-46.55
2674,-46.84
2675,-47.21
2676,-47.70
2677,-48.20
2678,-48.72
2679,-49.13
2680,-49.41
2681,-49.45
2682,-49.31
2683,-49.03
2684,-48.72
2685,-48.43
2686,-48.25
2687,-48.18
2688,-48.29
2689,-48.52
2690,-48.84
2691,-49.13
2692,-49.42
2693,-49.71
2694,-50.04
2695,-50.39
2696,-50.79
2697,-51.17
2698,-51.56
2699,-51.90
2700,-52.25
2701,-52.54
2702,-52.82
2703,-53.06
2704,-53.38
2705,-53.75
2706,-54.24
2707,-54.79
2708,-55.46
2709,-56.14
2710,-56.83
2711,-57.43
2712,-58.02
2713,-58.53
2714,-59.07
2715,-59.56
2716,-60.10
2717,-60.68
2718,-61.37
2719,-62.11
2720,-62.88
2721,-63.56
2722,-64.16
2723,-64.65
2724,-65.11
2725,-65.45
2726,-65.70
2727,-65.81
2728,-65.87
2729,-65.94
2730,-66.11
2731,-66.31
2732,-66.56
2733,-66.80
2734,-67.04
2735,-67.25
2736,-67.37
2737,-67.37
2738,-67.28
2739,-67.12
2740,-66.93
2741,-66.69
2742,-66.40
2743,-66.03
2744,-65.61
2745,-65.19
2746,-64.84
2747,-64.61
2748,-64.56
2749,-64.67
2750,-65.01
2751,-65.54
2752,-66.25
2753,-67.03
2754,-67.84
2755,-68.57
2756,-69.22
2757,-69.79
2758,-70.36
2759,-70.90
2760,-71.46
2761,-71.98
2762,-72.57
2763,-73.15
2764,-73.74
2765,-74.23
2766,-74.71
2767,-75.16
2768,-75.68
2769,-76.16
2770,-76.70
2771,-77.22
2772,-77.80
2773,-78.36
2774,-78.88
2775,-79.30
2776,-79.65
2777,-79.95
2778,-80.18
2779,-80.35
2780,-80.39
2781,-80.31
2782,-80.05
2783,-79.61
2784,-78.96
2785,-78.16
2786,-77.20
2787,-76.18
2788,-75.01
2789,-73.82
2790,-72.49
2791,-71.15
2792,-69.67
2793,-68.21
2794,-66.67
2795,-65.24
2796,-63.82
2797,-62.60
2798,-61.49
2799,-60.62
2800,-59.86
2801,-59.28
2802,-58.69
2803,-58.16
2804,-57.53
2805,-56.90
2806,-56.18
2807,-55.45
2808,-54.63
2809,-53.85
2810,-53.09
2811,-52.47
2812,-51.93
2813,-51.48
2814,-51.01
2815,-50.58
2816,-50.14
2817,-49.77
2818,-49.40
2819,-49.06
2820,-48.68
2821,-48.36
2822,-48.09
2823,-47.90
2824,-47.68
2825,-47.43
2826,-47.07
2827,-46.63
2828,-46.07
2829,-45.46
2830,-44.78
2831,-44.17
2832,-43.57
2833,-43.08
2834,-42.66
2835,-42.34
2836,-42.05
2837,-41.77
2838,-41.44
2839,-41.09
2840,-40.68
2841,-40.31
2842,-39.97
2843,-39.72
2844,-39.45
2845,-39.18
2846,-38.79
2847,-38.32
2848,-37.71
2849,-37.03
2850,-36.29
2851,-35.58
2852,-34.92
2853,-34.39
2854,-33.96
2855,-33.65
2856,-33.39
2857,-33.16
2858,-32.88
2859,-32.54
2860,-32.08
2861,-31.58
2862,-31.04
2863,-30.56
2864,-30.17
2865,-29.90
2866,-29.75
2867,-29.72
2868,-29.80
2869,-29.95
2870,-30.17
2871,-30.40
2872,-30.66
2873,-30.99
2874,-31.43
2875,-31.89
2876,-32.37
2877,-32.81
2878,-33.30
2879,-33.79
2880,-34.28
2881,-34.72
2882,-35.21
2883,-35.70
2884,-36.19
2885,-36.61
2886,-36.99
2887,-37.32
2888,-37.67
2889,-37.92
2890,-38.12
2891,-38.25
2892,-38.44
2893,-38.63
2894,-38.88
2895,-39.12
2896,-39.47
2897,-39.90
2898,-40.49
2899,-41.16
2900,-41.97
2901,-42.82
2902,-43.73
2903,-44.62
2904,-45.49
2905,-46.24
2906,-46.97
2907,-47.63
2908,-48.35
2909,-49.00
2910,-49.65
2911,-50.21
2912,-50.76
2913,-51.22
2914,-51.62
2915,-51.90
2916,-52.17
2917,-52.41
2918,-52.71
2919,-53.03
2920,-53.44
2921,-53.87
2922,-54.32
2923,-54.68
2924,-54.94
2925,-55.08
2926,-55.15
2927,-55.18
2928,-55.19
2929,-55.18
2930,-55.18
2931,-55.21
2932,-55.30
2933,-55.42
2934,-55.52
2935,-55.55
2936,-55.53
2937,-55.50
2938,-55.46
2939,-55.43
2940,-55.40
2941,-55.40
2942,-55.45
2943,-55.51
2944,-55.55
2945,-55.56
2946,-55.53
2947,-55.47
2948,-55.34
2949,-55.17
2950,-54.96
2951,-54.72
2952,-54.42
2953,-54.10
2954,-53.77
2955,-53.44
2956,-53.08
2957,-52.69
2958,-52.34
2959,-52.10
2960,-51.96
2961,-51.94
2962,-52.02
2963,-52.20
2964,-52.43
2965,-52.65
2966,-52.79
2967,-52.79
2968,-52.65
2969,-52.40
2970,-52.11
2971,-51.86
2972,-51.73
2973,-51.80
2974,-52.06
2975,-52.51
2976,-53.09
2977,-53.66
2978,-54.18
2979,-54.57
2980,-54.79
2981,-54.85
2982,-54.76
2983,-54.60
2984,-54.47
2985,-54.44
2986,-54.53
2987,-54.72
2988,-54.93
2989,-55.11
2990,-55.23
2991,-55.23
2992,-55.10
2993,-54.86
2994,-54.53
2995,-54.21
2996,-53.92
2997,-53.71
2998,-53.57
2999,-53.49
3000,-53.41
3001,-53.31
3002,-53.09
3003,-52.80
3004,-52.46
3005,-52.13
3006,-51.79
3007,-51.47
3008,-51.17
3009,-50.96
3010,-50.85
3011,-50.80
3012,-50.74
3013,-50.72
3014,-50.73
3015,-50.80
3016,-50.86
3017,-50.89
3018,-50.88
3019,-50.88
3020,-50.92
3021,-50.94
3022,-50.93
3023,-50.86
3024,-50.83
3025,-50.84
3026,-50.93
3027,-51.08
3028,-51.32
3029,-51.67
3030,-52.17
3031,-52.76
3032,-53.43
3033,-54.08
3034,-54.73
3035,-55.29
3036,-55.76
3037,-56.11
3038,-56.38
3039,-56.56
3040,-56.64
3041,-56.64
3042,-56.59
3043,-56.50
3044,-56.37
3045,-56.22
3046,-56.06
3047,-55.91
3048,-55.76
3049,-55.63
3050,-55.44
3051,-55.22
3052,-54.91
3053,-54.56
3054,-54.12
3055,-53.66
3056,-53.13
3057,-52.57
3058,-51.93
3059,-51.25
3060,-50.54
3061,-49.90
3062,-49.28
3063,-48.75
3064,-48.27
3065,-47.90
3066,-47.59
3067,-47.36
3068,-47.15
3069,-46.95
3070,-46.72
3071,-46.49
3072,-46.23
3073,-46.03
3074,-45.88
3075,-45.86
3076,-45.94
3077,-46.13
3078,-46.36
3079,-46.57
3080,-46.75
3081,-46.90
3082,-47.01
3083,-47.07
3084,-47.07
3085,-47.07
3086,-47.13
3087,-47.27
3088,-47.49
3089,-47.74
3090,-48.00
3091,-48.27
3092,-48.51
3093,-48.68
3094,-48.81
3095,-48.86
3096,-48.87
3097,-48.84
3098,-48.79
3099,-48.76
3100,-48.74
3101,-48.71
3102,-48.67
3103,-48.65
3104,-48.61
3105,-48.56
3106,-48.45
3107,-48.26
3108,-48.03
3109,-47.81
3110,-47.56
3111,-47.29
3112,-46.97
3113,-46.65
3114,-46.35
3115,-46.12
3116,-45.90
3117,-45.68
3118,-45.40
3119,-45.14
3120,-44.86
3121,-44.59
3122,-44.31
3123,-44.09
3124,-43.91
3125,-43.79
3126,-43.69
3127,-43.61
3128,-43.56
3129,-43.53
3130,-43.46
3131,-43.35
3132,-43.21
3133,-43.09
3134,-42.98
3135,-42.87
3136,-42.72
3137,-42.58
3138,-42.41
3139,-42.24
3140,-42.03
3141,-41.80
3142,-41.53
3143,-41.27
3144,-41.00
3145,-40.77
3146,-40.56
3147,-40.38
3148,-40.20
3149,-40.03
3150,-39.86
3151,-39.69
3152,-39.47
3153,-39.21
3154,-38.89
3155,-38.53
3156,-38.12
3157,-37.72
3158,-37.31
3159,-36.93
3160,-36.54
3161,-36.19
3162,-35.86
3163,-35.56
3164,-35.28
3165,-35.02
3166,-34.76
3167,-34.52
3168,-34.30
3169,-34.09
3170,-33.88
3171,-33.71
3172,-33.57
3173,-33.48
3174,-33.42
3175,-33.42
3176,-33.50
3177,-33.67
3178,-33.97
3179,-34.36
3180,-34.81
3181,-35.29
3182,-35.79
3183,-36.25
3184,-36.71
3185,-37.08
3186,-37.43
3187,-37.74
3188,-38.12
3189,-38.54
3190,-39.09
3191,-39.70
3192,-40.47
3193,-41.32
3194,-42.24
3195,-43.11
3196,-43.91
3197,-44.62
3198,-45.25
3199,-45.75
3200,-46.14
3201,-46.39
3202,-46.59
3203,-46.68
3204,-46.77
3205,-46.78
3206,-46.79
3207,-46.78
3208,-46.81
3209,-46.82
3210,-46.85
3211,-46.88
3212,-46.94
3213,-47.00
3214,-47.04
3215,-47.00
3216,-46.91
3217,-46.75
3218,-46.57
3219,-46.42
3220,-46.33
3221,-46.34
3222,-46.39
3223,-46.46
3224,-46.49
3225,-46.46
3226,-46.37
3227,-46.22
3228,-46.04
3229,-45.88
3230,-45.80
3231,-45.83
3232,-45.99
3233,-46.23
3234,-46.49
3235,-46.74
3236,-46.97
3237,-47.11
3238,-47.12
3239,-47.00
3240,-46.82
3241,-46.64
3242,-46.45
3243,-46.27
3244,-46.13
3245,-46.04
3246,-45.98
3247,-45.89
3248,-45.75
3249,-45.57
3250,-45.39
3251,-45.23
3252,-45.10
3253,-45.02
3254,-45.01
3255,-45.10
3256,-45.25
3257,-45.44
3258,-45.64
3259,-45.85
3260,-46.05
3261,-46.20
3262,-46.26
3263,-46.24
3264,-46.13
3265,-45.95
3266,-45.68
3267,-45.36
3268,-45.01
3269,-44.68
3270,-44.35
3271,-44.04
3272,-43.83
3273,-43.72
3274,-43.67
3275,-43.64
3276,-43.61
3277,-43.61
3278,-43.67
3279,-43.79
3280,-43.95
3281,-44.16
3282,-44.44
3283,-44.76
3284,-45.10
3285,-45.39
3286,-45.68
3287,-45.97
3288,-46.30
3289,-46.68
3290,-47.15
3291,-47.64
3292,-48.17
3293,-48.67
3294,-49.19
3295,-49.64
3296,-50.08
3297,-50.45
3298,-50.88
3299,-51.36
3300,-51.98
3301,-52.65
3302,-53.44
3303,-54.24
3304,-55.03
3305,-55.67
3306,-56.18
3307,-56.50
3308,-56.72
3309,-56.84
3310,-56.97
3311,-57.14
3312,-57.45
3313,-57.85
3314,-58.33
3315,-58.75
3316,-59.10
3317,-59.36
3318,-59.55
3319,-59.59
3320,-59.54
3321,-59.45
3322,-59.41
3323,-59.43
3324,-59.48
3325,-59.52
3326,-59.55
3327,-59.51
3328,-59.36
3329,-59.14
3330,-58.86
3331,-58.59
3332,-58.30
3333,-58.05
3334,-57.82
3335,-57.61
3336,-57.36
3337,-57.04
3338,-56.65
3339,-56.27
3340,-55.89
3341,-55.56
3342,-55.26
3343,-55.03
3344,-54.88
3345,-54.79
3346,-54.70
3347,-54.57
3348,-54.36
3349,-54.15
3350,-53.93
3351,-53.73
3352,-53.52
3353,-53.35
3354,-53.24
3355,-53.22
3356,-53.22
3357,-53.24
3358,-53.19
3359,-53.08
3360,-52.85
3361,-52.52
3362,-52.10
3363,-51.68
3364,-51.31
3365,-51.05
3366,-50.88
3367,-50.80
3368,-50.75
3369,-50.74
3370,-50.69
3371,-50.61
3372,-50.42
3373,-50.19
3374,-49.94
3375,-49.77
3376,-49.64
3377,-49.57
3378,-49.48
3379,-49.33
3380,-49.10
3381,-48.80
3382,-48.47
3383,-48.16
3384,-47.90
3385,-47.76
3386,-47.77
3387,-47.95
3388,-48.23
3389,-48.51
3390,-48.74
3391,-48.89
3392,-48.93
3393,-48.87
3394,-48.74
3395,-48.58
3396,-48.45
3397,-48.42
3398,-48.52
3399,-48.71
3400,-49.03
3401,-49.42
3402,-49.90
3403,-50.43
3404,-50.98
3405,-51.49
3406,-51.97
3407,-52.39
3408,-52.70
3409,-52.84
3410,-52.86
3411,-52.76
3412,-52.57
3413,-52.28
3414,-51.92
3415,-51.56
3416,-51.20
3417,-50.88
3418,-50.56
3419,-50.28
3420,-49.97
3421,-49.65
3422,-49.26
3423,-48.85
3424,-48.43
3425,-48.09
3426,-47.74
3427,-47.39
3428,-47.01
3429,-46.66
3430,-46.33
3431,-46.01
3432,-45.63
3433,-45.22
3434,-44.78
3435,-44.40
3436,-44.07
3437,-43.80
3438,-43.56
3439,-43.43
3440,-43.39
3441,-43.46
3442,-43.55
3443,-43.65
3444,-43.74
3445,-43.82
3446,-43.88
3447,-43.85
3448,-43.75
3449,-43.59
3450,-43.43
3451,-43.27
3452,-43.15
3453,-43.09
3454,-43.10
3455,-43.15
3456,-43.28
3457,-43.46
3458,-43.69
3459,-43.93
3460,-44.16
3461,-44.36
3462,-44.56
3463,-44.80
3464,-45.12
3465,-45.48
3466,-45.82
3467,-46.10
3468,-46.27
3469,-46.32
3470,-46.26
3471,-46.07
3472,-45.82
3473,-45.54
3474,-45.32
3475,-45.19
3476,-45.18
3477,-45.31
3478,-45.56
3479,-45.85
3480,-46.15
3481,-46.39
3482,-46.59
3483,-46.76
3484,-46.91
3485,-47.03
3486,-47.15
3487,-47.26
3488,-47.39
3489,-47.53
3490,-47.72
3491,-47.93
3492,-48.14
3493,-48.32
3494,-48.48
3495,-48.61
3496,-48.77
3497,-48.92
3498,-49.06
3499,-49.17
3500,-49.28
3501,-49.39
3502,-49.55
3503,-49.76
3504,-50.00
3505,-50.23
3506,-50.48
3507,-50.72
3508,-50.95
3509,-51.12
3510,-51.25
3511,-51.33
3512,-51.43
3513,-51.54
3514,-51.67
3515,-51.80
3516,-51.90
3517,-51.93
3518,-51.86
3519,-51.69
3520,-51.40
3521,-51.04
3522,-50.64
3523,-50.29
3524,-49.98
3525,-49.79
3526,-49.66
3527,-49.58
3528,-49.46
3529,-49.33
3530,-49.12
3531,-48.84
3532,-48.39
3533,-47.87
3534,-47.26
3535,-46.71
3536,-46.15
3537,-45.64
3538,-45.08
3539,-44.49
3540,-43.82
3541,-43.15
3542,-42.45
3543,-41.81
3544,-41.16
3545,-40.61
3546,-40.12
3547,-39.74
3548,-39.41
3549,-39.12
3550,-38.85
3551,-38.62
3552,-38.39
3553,-38.15
3554,-37.90
3555,-37.68
3556,-37.57
3557,-37.61
3558,-37.77
3559,-38.04
3560,-38.40
3561,-38.84
3562,-39.37
3563,-39.88
3564,-40.33
3565,-40.65
3566,-40.89
3567,-41.09
3568,-41.29
3569,-41.49
3570,-41.73
3571,-42.03
3572,-42.40
3573,-42.75
3574,-43.06
3575,-43.27
3576,-43.38
3577,-43.37
3578,-43.27
3579,-43.11
3580,-43.00
3581,-42.96
3582,-43.01
3583,-43.13
3584,-43.33
3585,-43.61
3586,-43.88
3587,-44.10
3588,-44.22
3589,-44.25
3590,-44.20
3591,-44.10
3592,-44.00
3593,-43.91
3594,-43.82
3595,-43.74
3596,-43.64
3597,-43.55
3598,-43.48
3599,-43.41
3600,-43.34
3601,-43.28
3602,-43.28
3603,-43.37
3604,-43.53
3605,-43.80
3606,-44.21
3607,-44.72
3608,-45.26
3609,-45.74
3610,-46.17
3611,-46.49
3612,-46.69
3613,-46.75
3614,-46.71
3615,-46.68
3616,-46.69
3617,-46.74
3618,-46.83
3619,-46.95
3620,-47.13
3621,-47.32
3622,-47.53
3623,-47.71
3624,-47.90
3625,-48.07
3626,-48.21
3627,-48.30
3628,-48.38
3629,-48.45
3630,-48.55
3631,-48.68
3632,-48.84
3633,-49.05
3634,-49.27
3635,-49.48
3636,-49.71
3637,-49.94
3638,-50.18
3639,-50.35
3640,-50.46
3641,-50.49
3642,-50.46
3643,-50.37
3644,-50.20
3645,-50.00
3646,-49.79
3647,-49.61
3648,-49.43
3649,-49.26
3650,-49.10
3651,-48.98
3652,-48.87
3653,-48.75
3654,-48.65
3655,-48.58
3656,-48.56
3657,-48.60
3658,-48.68
3659,-48.81
3660,-48.93
3661,-49.03
3662,-49.05
3663,-49.03
3664,-48.95
3665,-48.82
3666,-48.64
3667,-48.46
3668,-48.37
3669,-48.39
3670,-48.52
3671,-48.69
3672,-48.94
3673,-49.23
3674,-49.55
3675,-49.88
3676,-50.25
3677,-50.67
3678,-51.11
3679,-51.52
3680,-51.92
3681,-52.27
3682,-52.60
3683,-52.86
3684,-53.07
3685,-53.21
3686,-53.37
3687,-53.53
3688,-53.73
3689,-53.96
3690,-54.26
3691,-54.61
3692,-55.03
3693,-55.42
3694,-55.76
3695,-56.02
3696,-56.24
3697,-56.43
3698,-56.66
3699,-56.89
3700,-57.15
3701,-57.42
3702,-57.71
3703,-57.98
3704,-58.22
3705,-58.39
3706,-58.51
3707,-58.56
3708,-58.59
3709,-58.55
3710,-58.47
3711,-58.41
3712,-58.40
3713,-58.43
3714,-58.46
3715,-58.46
3716,-58.45
3717,-58.42
3718,-58.34
3719,-58.23
3720,-58.09
3721,-57.96
3722,-57.88
3723,-57.85
3724,-57.88
3725,-57.98
3726,-58.10
3727,-58.21
3728,-58.32
3729,-58.38
3730,-58.38
3731,-58.31
3732,-58.23
3733,-58.16
3734,-58.17
3735,-58.24
3736,-58.43
3737,-58.70
3738,-59.04
3739,-59.36
3740,-59.65
3741,-59.86
3742,-60.02
3743,-60.13
3744,-60.21
3745,-60.27
3746,-60.35
3747,-60.43
3748,-60.51
3749,-60.51
3750,-60.44
3751,-60.28
3752,-60.06
3753,-59.78
3754,-59.49
3755,-59.25
3756,-59.12
3757,-59.14
3758,-59.34
3759,-59.70
3760,-60.20
3761,-60.75
3762,-61.24
3763,-61.59
3764,-61.84
3765,-61.94
3766,-61.95
3767,-61.91
3768,-61.93
3769,-62.07
3770,-62.39
3771,-62.83
3772,-63.36
3773,-63.88
3774,-64.33
3775,-64.61
3776,-64.74
3777,-64.74
3778,-64.67
3779,-64.61
3780,-64.58
3781,-64.64
3782,-64.81
3783,-65.09
3784,-65.38
3785,-65.59
3786,-65.70
3787,-65.73
3788,-65.71
3789,-65.68
3790,-65.64
3791,-65.61
3792,-65.61
3793,-65.65
3794,-65.67
3795,-65.62
3796,-65.42
3797,-65.10
3798,-64.66
3799,-64.16
3800,-63.58
3801,-63.00
3802,-62.39
3803,-61.87
3804,-61.36
3805,-60.91
3806,-60.40
3807,-59.89
3808,-59.27
3809,-58.60
3810,-57.82
3811,-57.04
3812,-56.16
3813,-55.29
3814,-54.35
3815,-53.44
3816,-52.51
3817,-51.66
3818,-50.86
3819,-50.19
3820,-49.55
3821,-49.04
3822,-48.59
3823,-48.25
3824,-47.90
3825,-47.57
3826,-47.18
3827,-46.81
3828,-46.40
3829,-46.05
3830,-45.76
3831,-45.62
3832,-45.60
3833,-45.68
3834,-45.74
3835,-45.76
3836,-45.64
3837,-45.35
3838,-44.82
3839,-44.11
3840,-43.29
3841,-42.50
3842,-41.79
3843,-41.24
3844,-40.82
3845,-40.54
3846,-40.28
3847,-40.03
3848,-39.72
3849,-39.38
3850,-38.91
3851,-38.39
3852,-37.80
3853,-37.23
3854,-36.71
3855,-36.27
3856,-35.89
3857,-35.60
3858,-35.37
3859,-35.23
3860,-35.13
3861,-35.09
3862,-35.03
3863,-35.00
3864,-34.87
3865,-34.68
3866,-34.34
3867,-33.94
3868,-33.44
3869,-32.90
3870,-32.31
3871,-31.78
3872,-31.36
3873,-31.09
3874,-30.92
3875,-30.85
3876,-30.84
3877,-30.90
3878,-30.98
3879,-31.08
3880,-31.20
3881,-31.36
3882,-31.47
3883,-31.55
3884,-31.55
3885,-31.49
3886,-31.35
3887,-31.14
3888,-30.88
3889,-30.62
3890,-30.35
3891,-30.11
3892,-29.90
3893,-29.72
3894,-29.56
3895,-29.43
3896,-29.28
3897,-29.14
3898,-28.95
3899,-28.72
3900,-28.40
3901,-27.99
3902,-27.45
3903,-26.82
3904,-26.16
3905,-25.53
3906,-24.95
3907,-24.51
3908,-24.22
3909,-24.15
3910,-24.20
3911,-24.33
3912,-24.46
3913,-24.55
3914,-24.57
3915,-24.48
3916,-24.30
3917,-24.07
3918,-23.92
3919,-23.90
3920,-24.12
3921,-24.53
3922,-25.11
3923,-25.76
3924,-26.50
3925,-27.23
3926,-27.97
3927,-28.61
3928,-29.22
3929,-29.79
3930,-30.47
3931,-31.22
3932,-32.14
3933,-33.10
3934,-34.19
3935,-35.27
3936,-36.38
3937,-37.38
3938,-38.32
3939,-39.10
3940,-39.82
3941,-40.41
3942,-41.04
3943,-41.63
3944,-42.30
3945,-42.97
3946,-43.72
3947,-44.46
3948,-45.19
3949,-45.81
3950,-46.33
3951,-46.70
3952,-46.96
3953,-47.07
3954,-47.10
3955,-47.02
3956,-46.90
3957,-46.78
3958,-46.71
3959,-46.68
3960,-46.65
3961,-46.65
3962,-46.71
3963,-46.79
3964,-46.84
3965,-46.82
3966,-46.77
3967,-46.70
3968,-46.62
3969,-46.53
3970,-46.47
3971,-46.46
3972,-46.50
3973,-46.57
3974,-46.67
3975,-46.78
3976,-46.86
3977,-46.88
3978,-46.82
3979,-46.71
3980,-46.60
3981,-46.51
3982,-46.50
3983,-46.59
3984,-46.75
3985,-46.93
3986,-47.11
3987,-47.27
3988,-47.37
3989,-47.37
3990,-47.26
3991,-47.07
3992,-46.88
3993,-46.75
3994,-46.71
3995,-46.75
3996,-46.83
3997,-46.92
3998,-46.97
3999,-46.95
4000,-46.84
4001,-46.68
4002,-46.55
4003,-46.58
4004,-46.82
4005,-47.26
4006,-47.85
4007,-48.46
4008,-49.00
4009,-49.36
4010,-49.49
4011,-49.39
4012,-49.16
4013,-48.89
4014,-48.76
4015,-48.84
4016,-49.22
4017,-49.89
4018,-50.74
4019,-51.62
4020,-52.41
4021,-52.97
4022,-53.28
4023,-53.38
4024,-53.28
4025,-53.05
4026,-52.76
4027,-52.46
4028,-52.22
4029,-52.05
4030,-51.87
4031,-51.67
4032,-51.45
4033,-51.20
4034,-50.92
4035,-50.63
4036,-50.33
4037,-50.07
4038,-49.79
4039,-49.51
4040,-49.18
4041,-48.87
4042,-48.52
4043,-48.18
4044,-47.78
4045,-47.42
4046,-47.02
4047,-46.62
4048,-46.07
4049,-45.42
4050,-44.58
4051,-43.66
4052,-42.63
4053,-41.60
4054,-40.57
4055,-39.70
4056,-38.89
4057,-38.24
4058,-37.61
4059,-37.07
4060,-36.48
4061,-35.89
4062,-35.17
4063,-34.45
4064,-33.63
4065,-32.82
4066,-31.94
4067,-31.13
4068,-30.32
4069,-29.64
4070,-28.95
4071,-28.33
4072,-27.62
4073,-26.89
4074,-26.08
4075,-25.30
4076,-24.47
4077,-23.66
4078,-22.74
4079,-21.85
4080,-20.90
4081,-20.07
4082,-19.22
4083,-18.44
4084,-17.63
4085,-16.88
4086,-16.08
4087,-15.34
4088,-14.55
4089,-13.79
4090,-12.97
4091,-12.21
4092,-11.50
4093,-10.96
4094,-10.50
4095,-10.19
4096,-9.93
4097,-9.75
4098,-9.51
4099,-9.21
4100,-8.74
4101,-8.18
4102,-7.51
4103,-6.87
4104,-6.24
4105,-5.71
4106,-5.26
4107,-4.95
4108,-4.71
4109,-4.55
4110,-4.36
4111,-4.17
4112,-3.93
4113,-3.68
4114,-3.32
4115,-2.92
4116,-2.45
4117,-1.98
4118,-1.46
4119,-0.96
4120,-0.37
4121,0.21
4122,0.95
4123,1.76
4124,2.74
4125,3.72
4126,4.81
4127,5.85
4128,6.97
4129,7.98
4130,8.96
4131,9.80
4132,10.65
4133,11.47
4134,12.43
4135,13.41
4136,14.57
4137,15.76
4138,17.08
4139,18.39
4140,19.81
4141,21.13
4142,22.38
4143,23.41
4144,24.28
4145,24.95
4146,25.47
4147,25.82
4148,26.08
4149,26.26
4150,26.47
4151,26.66
4152,26.89
4153,27.11
4154,27.28
4155,27.34
4156,27.27
4157,27.05
4158,26.72
4159,26.36
4160,26.00
4161,25.72
4162,25.48
4163,25.35
4164,25.25
4165,25.15
4166,24.92
4167,24.56
4168,23.96
4169,23.20
4170,22.21
4171,21.13
4172,19.94
4173,18.78
4174,17.63
4175,16.57
4176,15.54
4177,14.61
4178,13.68
4179,12.81
4180,11.92
4181,11.13
4182,10.38
4183,9.81
4184,9.35
4185,9.12
4186,8.96
4187,8.90
4188,8.80
4189,8.64
4190,8.31
4191,7.86
4192,7.22
4193,6.48
4194,5.61
4195,4.70
4196,3.76
4197,2.91
4198,2.11
4199,1.43
4200,0.84
4201,0.37
4202,-0.04
4203,-0.38
4204,-0.72
4205,-1.01
4206,-1.27
4207,-1.45
4208,-1.54
4209,-1.55
4210,-1.47
4211,-1.32
4212,-1.06
4213,-0.71
4214,-0.27
4215,0.24
4216,0.83
4217,1.45
4218,2.11
4219,2.75
4220,3.43
4221,4.07
4222,4.71
4223,5.21
4224,5.57
4225,5.74
4226,5.78
4227,5.68
4228,5.48
4229,5.20
4230,4.92
4231,4.71
4232,4.59
4233,4.57
4234,4.61
4235,4.68
4236,4.69
4237,4.65
4238,4.48
4239,4.19
4240,3.74
4241,3.18
4242,2.51
4243,1.82
4244,1.14
4245,0.60
4246,0.15
4247,-0.16
4248,-0.47
4249,-0.77
4250,-1.14
4251,-1.53
4252,-2.09
4253,-2.72
4254,-3.46
4255,-4.17
4256,-4.92
4257,-5.64
4258,-6.37
4259,-7.00
4260,-7.65
4261,-8.29
4262,-9.02
4263,-9.74
4264,-10.51
4265,-11.25
4266,-12.00
4267,-12.68
4268,-13.24
4269,-13.60
4270,-13.77
4271,-13.76
4272,-13.61
4273,-13.31
4274,-12.88
4275,-12.34
4276,-11.72
4277,-11.10
4278,-10.48
4279,-9.92
4280,-9.40
4281,-8.97
4282,-8.58
4283,-8.27
4284,-7.94
4285,-7.64
4286,-7.26
4287,-6.85
4288,-6.35
4289,-5.83
4290,-5.26
4291,-4.70
4292,-4.11
4293,-3.52
4294,-2.91
4295,-2.38
4296,-1.93
4297,-1.60
4298,-1.40
4299,-1.34
4300,-1.43
4301,-1.67
4302,-2.03
4303,-2.49
4304,-3.01
4305,-3.51
4306,-3.95
4307,-4.30
4308,-4.64
4309,-4.95
4310,-5.26
4311,-5.55
4312,-5.91
4313,-6.35
4314,-6.89
4315,-7.42
4316,-7.91
4317,-8.29
4318,-8.61
4319,-8.80
4320,-8.91
4321,-8.96
4322,-9.06
4323,-9.29
4324,-9.67
4325,-10.12
4326,-10.58
4327,-10.97
4328,-11.28
4329,-11.46
4330,-11.48
4331,-11.36
4332,-11.15
4333,-10.90
4334,-10.65
4335,-10.41
4336,-10.22
4337,-10.06
4338,-9.94
4339,-9.83
4340,-9.70
4341,-9.58
4342,-9.47
4343,-9.38
4344,-9.32
4345,-9.26
4346,-9.17
4347,-9.03
4348,-8.83
4349,-8.62
4350,-8.39
4351,-8.14
4352,-7.92
4353,-7.77
4354,-7.74
4355,-7.83
4356,-8.02
4357,-8.28
4358,-8.65
4359,-9.09
4360,-9.61
4361,-10.11
4362,-10.60
4363,-11.03
4364,-11.45
4365,-11.83
4366,-12.23
4367,-12.66
4368,-13.24
4369,-13.86
4370,-14.58
4371,-15.29
4372,-16.03
4373,-16.67
4374,-17.20
4375,-17.54
4376,-17.81
4377,-18.01
4378,-18.29
4379,-18.62
4380,-19.17
4381,-19.83
4382,-20.66
4383,-21.51
4384,-22.42
4385,-23.26
4386,-24.07
4387,-24.71
4388,-25.26
4389,-25.67
4390,-26.12
4391,-26.56
4392,-27.16
4393,-27.85
4394,-28.72
4395,-29.66
4396,-30.69
4397,-31.66
4398,-32.61
4399,-33.39
4400,-34.07
4401,-34.62
4402,-35.15
4403,-35.62
4404,-36.17
4405,-36.72
4406,-37.36
4407,-38.00
4408,-38.66
4409,-39.22
4410,-39.70
4411,-40.05
4412,-40.31
4413,-40.50
4414,-40.72
4415,-40.98
4416,-41.31
4417,-41.66
4418,-42.05
4419,-42.40
4420,-42.69
4421,-42.88
4422,-42.95
4423,-42.91
4424,-42.79
4425,-42.65
4426,-42.50
4427,-42.38
4428,-42.27
4429,-42.18
4430,-42.10
4431,-41.99
4432,-41.81
4433,-41.53
4434,-41.19
4435,-40.83
4436,-40.50
4437,-40.20
4438,-39.93
4439,-39.72
4440,-39.60
4441,-39.60
4442,-39.70
4443,-39.86
4444,-40.00
4445,-40.10
4446,-40.12
4447,-40.07
4448,-39.90
4449,-39.64
4450,-39.30
4451,-38.94
4452,-38.56
4453,-38.21
4454,-37.88
4455,-37.62
4456,-37.38
4457,-37.16
4458,-36.88
4459,-36.52
4460,-36.06
4461,-35.55
4462,-35.06
4463,-34.67
4464,-34.39
4465,-34.23
4466,-34.23
4467,-34.37
4468,-34.70
4469,-35.15
4470,-35.66
4471,-36.16
4472,-36.70
4473,-37.26
4474,-37.86
4475,-38.45
4476,-39.05
4477,-39.65
4478,-40.25
4479,-40.75
4480,-41.11
4481,-41.34
4482,-41.42
4483,-41.39
4484,-41.22
4485,-40.97
4486,-40.63
4487,-40.28
4488,-39.84
4489,-39.34
4490,-38.76
4491,-38.12
4492,-37.33
4493,-36.43
4494,-35.36
4495,-34.28
4496,-33.10
4497,-31.96
4498,-30.78
4499,-29.72
4500,-28.77
4501,-28.02
4502,-27.34
4503,-26.74
4504,-26.11
4505,-25.51
4506,-24.82
4507,-24.13
4508,-23.35
4509,-22.61
4510,-21.92
4511,-21.40
4512,-20.99
4513,-20.71
4514,-20.48
4515,-20.28
4516,-20.06
4517,-19.84
4518,-19.55
4519,-19.23
4520,-18.85
4521,-18.53
4522,-18.30
4523,-18.23
4524,-18.20
4525,-18.23
4526,-18.19
4527,-18.06
4528,-17.74
4529,-17.25
4530,-16.53
4531,-15.70
4532,-14.77
4533,-13.89
4534,-13.05
4535,-12.35
4536,-11.74
4537,-11.25
4538,-10.77
4539,-10.32
4540,-9.78
4541,-9.20
4542,-8.51
4543,-7.80
4544,-7.07
4545,-6.42
4546,-5.83
4547,-5.37
4548,-5.01
4549,-4.81
4550,-4.72
4551,-4.77
4552,-4.91
4553,-5.13
4554,-5.32
4555,-5.46
4556,-5.49
4557,-5.44
4558,-5.26
4559,-4.96
4560,-4.55
4561,-4.17
4562,-3.86
4563,-3.65
4564,-3.49
4565,-3.39
4566,-3.33
4567,-3.30
4568,-3.23
4569,-3.08
4570,-2.87
4571,-2.66
4572,-2.49
4573,-2.40
4574,-2.39
4575,-2.49
4576,-2.68
4577,-2.88
4578,-3.03
4579,-3.10
4580,-3.12
4581,-3.11
4582,-3.05
4583,-2.94
4584,-2.82
4585,-2.69
4586,-2.54
4587,-2.37
4588,-2.19
4589,-2.06
4590,-2.01
4591,-2.04
4592,-2.17
4593,-2.39
4594,-2.62
4595,-2.83
4596,-3.02
4597,-3.17
4598,-3.26
4599,-3.29
4600,-3.29
4601,-3.29
4602,-3.28
4603,-3.25
4604,-3.20
4605,-3.11
4606,-2.97
4607,-2.76
4608,-2.48
4609,-2.18
4610,-1.93
4611,-1.77
4612,-1.70
4613,-1.72
4614,-1.76
4615,-1.77
4616,-1.61
4617,-1.29
4618,-0.85
4619,-0.36
4620,0.14
4621,0.56
4622,0.79
4623,0.73
4624,0.41
4625,-0.08
4626,-0.63
4627,-1.15
4628,-1.58
4629,-1.88
4630,-2.02
4631,-2.01
4632,-1.92
4633,-1.79
4634,-1.67
4635,-1.56
4636,-1.45
4637,-1.36
4638,-1.28
4639,-1.21
4640,-1.17
4641,-1.17
4642,-1.24
4643,-1.32
4644,-1.42
4645,-1.52
4646,-1.62
4647,-1.70
4648,-1.72
4649,-1.73
4650,-1.76
4651,-1.82
4652,-1.85
4653,-1.80
4654,-1.66
4655,-1.45
4656,-1.15
4657,-0.79
4658,-0.41
4659,-0.07
4660,0.17
4661,0.29
4662,0.27
4663,0.16
4664,-0.05
4665,-0.31
4666,-0.66
4667,-1.10
4668,-1.66
4669,-2.30
4670,-3.07
4671,-3.89
4672,-4.83
4673,-5.77
4674,-6.72
4675,-7.57
4676,-8.39
4677,-9.10
4678,-9.81
4679,-10.44
4680,-11.14
4681,-11.85
4682,-12.72
4683,-13.62
4684,-14.64
4685,-15.66
4686,-16.73
4687,-17.72
4688,-18.71
4689,-19.58
4690,-20.42
4691,-21.10
4692,-21.77
4693,-22.36
4694,-23.03
4695,-23.69
4696,-24.43
4697,-25.16
4698,-25.96
4699,-26.69
4700,-27.34
4701,-27.85
4702,-28.24
4703,-28.54
4704,-28.73
4705,-28.82
4706,-28.84
4707,-28.81
4708,-28.72
4709,-28.55
4710,-28.26
4711,-27.85
4712,-27.28
4713,-26.60
4714,-25.78
4715,-24.89
4716,-23.90
4717,-22.87
4718,-21.79
4719,-20.78
4720,-19.85
4721,-19.09
4722,-18.45
4723,-18.03
4724,-17.75
4725,-17.68
4726,-17.70
4727,-17.82
4728,-17.88
4729,-17.88
4730,-17.67
4731,-17.27
4732,-16.64
4733,-15.90
4734,-15.05
4735,-14.23
4736,-13.43
4737,-12.76
4738,-12.17
4739,-11.75
4740,-11.40
4741,-11.12
4742,-10.77
4743,-10.38
4744,-9.86
4745,-9.28
4746,-8.54
4747,-7.75
4748,-6.93
4749,-6.20
4750,-5.49
4751,-4.92
4752,-4.42
4753,-4.08
4754,-3.81
4755,-3.62
4756,-3.38
4757,-3.06
4758,-2.62
4759,-2.09
4760,-1.45
4761,-0.76
4762,-0.07
4763,0.51
4764,0.86
4765,0.94
4766,0.69
4767,0.14
4768,-0.68
4769,-1.66
4770,-2.75
4771,-3.85
4772,-4.97
4773,-6.07
4774,-7.13
4775,-8.10
4776,-9.06
4777,-9.94
4778,-10.78
4779,-11.45
4780,-12.02
4781,-12.41
4782,-12.73
4783,-12.95
4784,-13.15
4785,-13.30
4786,-13.43
4787,-13.52
4788,-13.50
4789,-13.37
4790,-13.08
4791,-12.68
4792,-12.07
4793,-11.34
4794,-10.48
4795,-9.57
4796,-8.53
4797,-7.48
4798,-6.37
4799,-5.32
4800,-4.20
4801,-3.11
4802,-1.90
4803,-0.73
4804,0.47
4805,1.51
4806,2.49
4807,3.27
4808,3.94
4809,4.44
4810,4.97
4811,5.49
4812,6.20
4813,7.03
4814,8.10
4815,9.25
4816,10.50
4817,11.67
4818,12.82
4819,13.80
4820,14.73
4821,15.50
4822,16.25
4823,16.94
4824,17.72
4825,18.49
4826,19.35
4827,20.13
4828,20.92
4829,21.63
4830,22.38
4831,23.07
4832,23.80
4833,24.45
4834,25.17
4835,25.86
4836,26.63
4837,27.37
4838,28.21
4839,29.01
4840,29.89
4841,30.75
4842,31.72
4843,32.65
4844,33.63
4845,34.50
4846,35.32
4847,35.96
4848,36.62
4849,37.23
4850,37.96
4851,38.74
4852,39.72
4853,40.79
4854,42.07
4855,43.45
4856,45.00
4857,46.50
4858,47.94
4859,49.15
4860,50.21
4861,51.05
4862,51.73
4863,52.15
4864,52.44
4865,52.54
4866,52.68
4867,52.81
4868,53.03
4869,53.28
4870,53.62
4871,53.96
4872,54.37
4873,54.75
4874,55.10
4875,55.37
4876,55.55
4877,55.66
4878,55.74
4879,55.77
4880,55.73
4881,55.65
4882,55.52
4883,55.37
4884,55.19
4885,54.99
4886,54.77
4887,54.56
4888,54.32
4889,54.10
4890,53.88
4891,53.70
4892,53.52
4893,53.33
4894,53.07
4895,52.78
4896,52.40
4897,51.97
4898,51.46
4899,50.93
4900,50.34
4901,49.79
4902,49.26
4903,48.79
4904,48.31
4905,47.83
4906,47.28
4907,46.70
4908,45.98
4909,45.23
4910,44.40
4911,43.63
4912,42.89
4913,42.26
4914,41.66
4915,41.11
4916,40.50
4917,39.86
4918,39.15
4919,38.44
4920,37.72
4921,37.11
4922,36.58
4923,36.18
4924,35.80
4925,35.50
4926,35.19
4927,34.94
4928,34.66
4929,34.35
4930,33.92
4931,33.49
4932,33.04
4933,32.64
4934,32.20
4935,31.76
4936,31.31
4937,30.94
4938,30.59
4939,30.31
4940,30.03
4941,29.82
4942,29.58
4943,29.33
4944,28.94
4945,28.45
4946,27.81
4947,27.14
4948,26.41
4949,25.74
4950,25.10
4951,24.57
4952,24.09
4953,23.70
4954,23.30
4955,22.87
4956,22.30
4957,21.66
4958,20.95
4959,20.29
4960,19.67
4961,19.17
4962,18.84
4963,18.72
4964,18.75
4965,18.87
4966,18.95
4967,18.99
4968,18.94
4969,18.79
4970,18.53
4971,18.20
4972,17.86
4973,17.61
4974,17.53
4975,17.65
4976,17.96
4977,18.41
4978,18.96
4979,19.52
4980,20.09
4981,20.59
4982,21.05
4983,21.43
4984,21.77
4985,22.06
4986,22.34
4987,22.57
4988,22.78
4989,22.95
4990,23.11
4991,23.23
4992,23.30
4993,23.29
4994,23.25
4995,23.18
4996,23.12
4997,23.09
4998,23.09
4999,23.09
5000,23.08
5001,23.03
5002,22.90
5003,22.73
5004,22.49
5005,22.19
5006,21.83
5007,21.50
5008,21.24
5009,21.06
5010,20.92
5011,20.84
5012,20.84
5013,20.96
5014,21.15
5015,21.37
5016,21.58
5017,21.76
5018,21.88
5019,21.92
5020,21.85
5021,21.67
5022,21.35
5023,20.97
5024,20.58
5025,20.24
5026,19.99
5027,19.81
5028,19.71
5029,19.68
5030,19.71
5031,19.81
5032,19.94
5033,20.10
5034,20.23
5035,20.35
5036,20.44
5037,20.54
5038,20.64
5039,20.73
5040,20.77
5041,20.78
5042,20.76
5043,20.72
5044,20.68
5045,20.61
5046,20.55
5047,20.49
5048,20.45
5049,20.42
5050,20.39
5051,20.39
5052,20.42
5053,20.42
5054,20.36
5055,20.27
5056,20.22
5057,20.23
5058,20.36
5059,20.59
5060,20.98
5061,21.48
5062,22.06
5063,22.64
5064,23.16
5065,23.53
5066,23.78
5067,23.89
5068,23.94
5069,23.95
5070,24.01
5071,24.12
5072,24.35
5073,24.63
5074,24.98
5075,25.33
5076,25.74
5077,26.20
5078,26.77
5079,27.38
5080,28.06
5081,28.71
5082,29.35
5083,29.91
5084,30.40
5085,30.80
5086,31.20
5087,31.63
5088,32.19
5089,32.81
5090,33.49
5091,34.13
5092,34.77
5093,35.31
5094,35.71
5095,35.90
5096,35.96
5097,35.91
5098,35.85
5099,35.80
5100,35.74
5101,35.66
5102,35.50
5103,35.26
5104,34.94
5105,34.59
5106,34.20
5107,33.82
5108,33.45
5109,33.16
5110,32.92
5111,32.76
5112,32.57
5113,32.36
5114,32.02
5115,31.58
5116,30.98
5117,30.34
5118,29.69
5119,29.09
5120,28.53
5121,28.07
5122,27.68
5123,27.40
5124,27.08
5125,26.73
5126,26.22
5127,25.63
5128,24.92
5129,24.12
5130,23.22
5131,22.30
5132,21.36
5133,20.50
5134,19.71
5135,19.07
5136,18.55
5137,18.19
5138,17.97
5139,17.95
5140,18.13
5141,18.49
5142,18.97
5143,19.54
5144,20.21
5145,20.90
5146,21.66
5147,22.39
5148,23.21
5149,24.04
5150,24.99
5151,25.92
5152,26.92
5153,27.88
5154,28.88
5155,29.81
5156,30.76
5157,31.66
5158,32.62
5159,33.55
5160,34.54
5161,35.47
5162,36.44
5163,37.30
5164,38.15
5165,38.86
5166,39.57
5167,40.19
5168,40.86
5169,41.49
5170,42.23
5171,43.00
5172,43.91
5173,44.88
5174,45.97
5175,47.04
5176,48.04
5177,48.84
5178,49.45
5179,49.82
5180,50.02
5181,50.03
5182,49.94
5183,49.77
5184,49.67
5185,49.62
5186,49.67
5187,49.76
5188,49.87
5189,49.91
5190,49.92
5191,49.88
5192,49.86
5193,49.87
5194,50.00
5195,50.23
5196,50.61
5197,51.09
5198,51.64
5199,52.21
5200,52.77
5201,53.25
5202,53.60
5203,53.79
5204,53.93
5205,54.06
5206,54.27
5207,54.52
5208,54.89
5209,55.33
5210,55.88
5211,56.47
5212,57.10
5213,57.66
5214,58.14
5215,58.46
5216,58.65
5217,58.67
5218,58.55
5219,58.30
5220,58.00
5221,57.72
5222,57.53
5223,57.41
5224,57.36
5225,57.37
5226,57.42
5227,57.49
5228,57.48
5229,57.40
5230,57.24
5231,56.97
5232,56.53
5233,55.98
5234,55.32
5235,54.66
5236,54.00
5237,53.38
5238,52.83
5239,52.41
5240,52.11
5241,51.92
5242,51.75
5243,51.62
5244,51.45
5245,51.25
5246,50.96
5247,50.67
5248,50.38
5249,50.18
5250,50.06
5251,50.03
5252,50.08
5253,50.22
5254,50.37
5255,50.50
5256,50.52
5257,50.48
5258,50.35
5259,50.21
5260,50.00
5261,49.74
5262,49.43
5263,49.14
5264,48.83
5265,48.48
5266,48.04
5267,47.57
5268,47.07
5269,46.56
5270,46.02
5271,45.49
5272,44.98
5273,44.54
5274,44.14
5275,43.79
5276,43.47
5277,43.21
5278,42.96
5279,42.76
5280,42.59
5281,42.54
5282,42.57
5283,42.70
5284,42.87
5285,43.09
5286,43.33
5287,43.58
5288,43.77
5289,43.89
5290,43.93
5291,43.90
5292,43.81
5293,43.66
5294,43.47
5295,43.28
5296,43.15
5297,43.10
5298,43.11
5299,43.14
5300,43.15
5301,43.13
5302,43.05
5303,42.93
5304,42.75
5305,42.55
5306,42.34
5307,42.16
5308,42.00
5309,41.86
5310,41.70
5311,41.53
5312,41.31
5313,41.07
5314,40.81
5315,40.58
5316,40.37
5317,40.16
5318,39.94
5319,39.73
5320,39.55
5321,39.41
5322,39.25
5323,39.05
5324,38.80
5325,38.56
5326,38.33
5327,38.12
5328,37.93
5329,37.71
5330,37.49
5331,37.32
5332,37.22
5333,37.21
5334,37.29
5335,37.48
5336,37.78
5337,38.13
5338,38.46
5339,38.70
5340,38.92
5341,39.10
5342,39.29
5343,39.46
5344,39.73
5345,40.08
5346,40.60
5347,41.18
5348,41.92
5349,42.70
5350,43.57
5351,44.42
5352,45.33
5353,46.20
5354,47.10
5355,47.91
5356,48.74
5357,49.52
5358,50.34
5359,51.06
5360,51.77
5361,52.38
5362,52.99
5363,53.54
5364,54.06
5365,54.52
5366,55.01
5367,55.50
5368,56.05
5369,56.53
5370,57.02
5371,57.48
5372,57.99
5373,58.46
5374,58.88
5375,59.17
5376,59.38
5377,59.51
5378,59.65
5379,59.79
5380,59.99
5381,60.24
5382,60.59
5383,60.98
5384,61.39
5385,61.71
5386,61.93
5387,62.01
5388,62.02
5389,61.98
5390,61.94
5391,61.90
5392,61.90
5393,61.97
5394,62.08
5395,62.19
5396,62.18
5397,62.00
5398,61.62
5399,61.08
5400,60.43
5401,59.74
5402,59.06
5403,58.49
5404,58.08
5405,57.88
5406,57.85
5407,57.96
5408,58.12
5409,58.31
5410,58.43
5411,58.51
5412,58.48
5413,58.37
5414,58.13
5415,57.78
5416,57.32
5417,56.85
5418,56.37
5419,55.93
5420,55.47
5421,55.04
5422,54.62
5423,54.27
5424,53.90
5425,53.57
5426,53.23
5427,52.94
5428,52.62
5429,52.31
5430,51.98
5431,51.68
5432,51.38
5433,51.09
5434,50.80
5435,50.54
5436,50.25
5437,49.93
5438,49.57
5439,49.23
5440,48.97
5441,48.85
5442,48.89
5443,49.10
5444,49.47
5445,49.92
5446,50.41
5447,50.83
5448,51.15
5449,51.32
5450,51.37
5451,51.32
5452,51.28
5453,51.32
5454,51.56
5455,51.96
5456,52.56
5457,53.24
5458,54.00
5459,54.73
5460,55.47
5461,56.11
5462,56.70
5463,57.19
5464,57.66
5465,58.10
5466,58.56
5467,58.99
5468,59.46
5469,59.92
5470,60.43
5471,60.93
5472,61.42
5473,61.84
5474,62.19
5475,62.45
5476,62.66
5477,62.84
5478,62.97
5479,63.03
5480,63.00
5481,62.87
5482,62.70
5483,62.46
5484,62.13
5485,61.72
5486,61.23
5487,60.75
5488,60.30
5489,59.92
5490,59.60
5491,59.37
5492,59.17
5493,59.01
5494,58.82
5495,58.62
5496,58.38
5497,58.11
5498,57.80
5499,57.46
5500,57.17
5501,56.95
5502,56.85
5503,56.85
5504,56.97
5505,57.24
5506,57.64
5507,58.13
5508,58.63
5509,59.08
5510,59.45
5511,59.68
5512,59.80
5513,59.76
5514,59.61
5515,59.36
5516,59.08
5517,58.83
5518,58.68
5519,58.61
5520,58.65
5521,58.80
5522,59.07
5523,59.42
5524,59.84
5525,60.26
5526,60.68
5527,61.10
5528,61.49
5529,61.84
5530,62.19
5531,62.55
5532,62.92
5533,63.21
5534,63.42
5535,63.50
5536,63.51
5537,63.44
5538,63.32
5539,63.16
5540,63.02
5541,62.95
5542,63.00
5543,63.16
5544,63.39
5545,63.62
5546,63.85
5547,64.03
5548,64.14
5549,64.16
5550,64.13
5551,64.06
5552,64.03
5553,64.01
5554,64.06
5555,64.17
5556,64.40
5557,64.68
5558,65.05
5559,65.43
5560,65.87
5561,66.31
5562,66.75
5563,67.16
5564,67.60
5565,68.03
5566,68.49
5567,68.96
5568,69.51
5569,70.06
5570,70.62
5571,71.09
5572,71.52
5573,71.84
5574,72.04
5575,72.10
5576,72.04
5577,71.95
5578,71.88
5579,71.85
5580,71.86
5581,71.93
5582,72.01
5583,72.07
5584,72.04
5585,71.88
5586,71.56
5587,71.14
5588,70.62
5589,70.09
5590,69.57
5591,69.13
5592,68.72
5593,68.35
5594,67.95
5595,67.51
5596,66.96
5597,66.38
5598,65.75
5599,65.19
5600,64.69
5601,64.29
5602,63.92
5603,63.61
5604,63.29
5605,62.98
5606,62.58
5607,62.14
5608,61.64
5609,61.13
5610,60.63
5611,60.19
5612,59.79
5613,59.46
5614,59.19
5615,58.99
5616,58.85
5617,58.76
5618,58.69
5619,58.69
5620,58.83
5621,59.12
5622,59.54
5623,60.02
5624,60.57
5625,61.13
5626,61.68
5627,62.16
5628,62.57
5629,62.87
5630,63.16
5631,63.44
5632,63.83
5633,64.29
5634,64.88
5635,65.52
5636,66.28
5637,67.01
5638,67.70
5639,68.18
5640,68.54
5641,68.73
5642,68.86
5643,68.89
5644,68.96
5645,69.08
5646,69.40
5647,69.84
5648,70.40
5649,70.96
5650,71.51
5651,72.01
5652,72.52
5653,72.95
5654,73.31
5655,73.58
5656,73.81
5657,73.98
5658,74.07
5659,74.01
5660,73.84
5661,73.58
5662,73.31
5663,73.07
5664,72.91
5665,72.88
5666,72.95
5667,73.08
5668,73.21
5669,73.33
5670,73.43
5671,73.49
5672,73.52
5673,73.51
5674,73.49
5675,73.48
5676,73.57
5677,73.74
5678,73.97
5679,74.21
5680,74.48
5681,74.78
5682,75.09
5683,75.36
5684,75.56
5685,75.68
5686,75.73
5687,75.69
5688,75.57
5689,75.36
5690,75.12
5691,74.93
5692,74.84
5693,74.84
5694,74.91
5695,75.00
5696,75.09
5697,75.15
5698,75.17
5699,75.14
5700,75.06
5701,74.97
5702,74.92
5703,74.94
5704,75.04
5705,75.16
5706,75.30
5707,75.42
5708,75.49
5709,75.55
5710,75.63
5711,75.74
5712,75.90
5713,76.10
5714,76.41
5715,76.79
5716,77.23
5717,77.64
5718,78.05
5719,78.42
5720,78.81
5721,79.15
5722,79.51
5723,79.83
5724,80.15
5725,80.44
5726,80.72
5727,80.94
5728,81.19
5729,81.47
5730,81.86
5731,82.31
5732,82.81
5733,83.27
5734,83.72
5735,84.08
5736,84.34
5737,84.48
5738,84.53
5739,84.49
5740,84.44
5741,84.43
5742,84.51
5743,84.66
5744,84.85
5745,85.01
5746,85.07
5747,84.98
5748,84.73
5749,84.34
5750,83.84
5751,83.33
5752,82.88
5753,82.58
5754,82.44
5755,82.45
5756,82.55
5757,82.73
5758,82.97
5759,83.18
5760,83.28
5761,83.23
5762,83.06
5763,82.87
5764,82.71
5765,82.59
5766,82.53
5767,82.56
5768,82.69
5769,82.87
5770,83.04
5771,83.14
5772,83.17
5773,83.15
5774,83.12
5775,83.09
5776,83.11
5777,83.20
5778,83.34
5779,83.50
5780,83.61
5781,83.65
5782,83.58
5783,83.40
5784,83.11
5785,82.78
5786,82.47
5787,82.26
5788,82.15
5789,82.10
5790,82.05
5791,81.97
5792,81.82
5793,81.58
5794,81.22
5795,80.80
5796,80.39
5797,80.06
5798,79.81
5799,79.64
5800,79.51
5801,79.43
5802,79.35
5803,79.26
5804,79.15
5805,79.03
5806,78.92
5807,78.85
5808,78.90
5809,79.06
5810,79.37
5811,79.76
5812,80.22
5813,80.69
5814,81.16
5815,81.57
5816,81.97
5817,82.34
5818,82.77
5819,83.23
5820,83.80
5821,84.45
5822,85.20
5823,85.98
5824,86.75
5825,87.40
5826,87.88
5827,88.13
5828,88.26
5829,88.23
5830,88.16
5831,88.02
5832,87.94
5833,87.96
5834,88.13
5835,88.39
5836,88.75
5837,89.13
5838,89.57
5839,90.00
5840,90.45
5841,90.83
5842,91.17
5843,91.44
5844,91.62
5845,91.71
5846,91.72
5847,91.68
5848,91.64
5849,91.58
5850,91.53
5851,91.49
5852,91.48
5853,91.48
5854,91.51
5855,91.57
5856,91.63
5857,91.69
5858,91.74
5859,91.81
5860,91.86
5861,91.84
5862,91.67
5863,91.42
5864,91.08
5865,90.69
5866,90.21
5867,89.68
5868,89.14
5869,88.69
5870,88.34
5871,88.12
5872,87.97
5873,87.90
5874,87.79
5875,87.63
5876,87.32
5877,86.88
5878,86.29
5879,85.63
5880,84.95
5881,84.36
5882,83.86
5883,83.51
5884,83.27
5885,83.17
5886,83.14
5887,83.16
5888,83.11
5889,83.01
5890,82.79
5891,82.53
5892,82.22
5893,81.92
5894,81.63
5895,81.41
5896,81.23
5897,81.15
5898,81.11
5899,81.05
5900,80.92
5901,80.72
5902,80.44
5903,80.12
5904,79.71
5905,79.23
5906,78.72
5907,78.27
5908,77.92
5909,77.69
5910,77.53
5911,77.44
5912,77.42
5913,77.48
5914,77.61
5915,77.75
5916,77.93
5917,78.13
5918,78.39
5919,78.71
5920,79.15
5921,79.63
5922,80.22
5923,80.86
5924,81.63
5925,82.42
5926,83.24
5927,84.00
5928,84.79
5929,85.54
5930,86.33
5931,87.04
5932,87.84
5933,88.67
5934,89.68
5935,90.73
5936,91.86
5937,92.91
5938,93.98
5939,94.92
5940,95.86
5941,96.69
5942,97.58
5943,98.44
5944,99.40
5945,100.33
5946,101.33
5947,102.26
5948,103.17
5949,103.92
5950,104.64
5951,105.29
5952,106.02
5953,106.76
5954,107.65
5955,108.59
5956,109.62
5957,110.60
5958,111.52
5959,112.25
5960,112.82
5961,113.15
5962,113.34
5963,113.40
5964,113.49
5965,113.62
5966,113.88
5967,114.20
5968,114.61
5969,115.02
5970,115.41
5971,115.68
5972,115.82
5973,115.83
5974,115.80
5975,115.72
5976,115.68
5977,115.67
5978,115.76
5979,115.96
5980,116.29
5981,116.71
5982,117.19
5983,117.63
5984,118.03
5985,118.39
5986,118.71
5987,118.97
5988,119.19
5989,119.36
5990,119.54
5991,119.71
5992,119.91
5993,120.11
5994,120.34
5995,120.57
5996,120.83
5997,121.09
5998,121.38
5999,121.64
6000,121.90
6001,122.11
6002,122.25
6003,122.27
6004,122.22
6005,122.11
6006,122.04
6007,122.00
6008,122.01
6009,122.04
6010,122.12
6011,122.24
6012,122.40
6013,122.56
6014,122.76
6015,123.05
6016,123.40
6017,123.66
6018,123.63
6019,123.37
6020,123.01
6021,122.70
6022,122.42
6023,122.11
6024,121.73
6025,121.37
6026,121.03
6027,120.74
6028,120.47
6029,120.24
6030,120.02
6031,119.84
6032,119.70
6033,119.59
6034,119.46
6035,119.35
6036,119.24
6037,119.19
6038,119.16
6039,119.16
6040,119.18
6041,119.20
6042,119.25
6043,119.31
6044,119.38
6045,119.48
6046,119.60
6047,119.74
6048,119.90
6049,120.09
6050,120.32
6051,120.55
6052,120.75
6053,120.90
6054,121.03
6055,121.11
6056,121.12
6057,121.07
6058,120.97
6059,120.85
6060,120.70
6061,120.51
6062,120.35
6063,120.23
6064,120.16
6065,120.13
6066,120.14
6067,120.19
6068,120.19
6069,120.14
6070,119.98
6071,119.75
6072,119.44
6073,119.08
6074,118.66
6075,118.21
6076,117.75
6077,117.35
6078,116.97
6079,116.65
6080,116.36
6081,116.13
6082,115.91
6083,115.74
6084,115.59
6085,115.49
6086,115.36
6087,115.18
6088,114.93
6089,114.64
6090,114.29
6091,113.95
6092,113.57
6093,113.22
6094,112.88
6095,112.55
6096,112.23
6097,111.93
6098,111.66
6099,111.47
6100,111.29
6101,111.15
6102,111.00
6103,110.92
6104,110.89
6105,110.92
6106,110.97
6107,111.04
6108,111.14
6109,111.28
6110,111.45
6111,111.60
6112,111.75
6113,111.89
6114,112.04
6115,112.15
6116,112.27
6117,112.38
6118,112.53
6119,112.69
6120,112.92
6121,113.17
6122,113.51
6123,113.87
6124,114.23
6125,114.55
6126,114.87
6127,115.16
6128,115.46
6129,115.71
6130,115.96
6131,116.18
6132,116.46
6133,116.74
6134,117.07
6135,117.39
6136,117.75
6137,118.10
6138,118.45
6139,118.77
6140,119.11
6141,119.48
6142,119.94
6143,120.41
6144,120.91
6145,121.40
6146,121.96
6147,122.51
6148,123.07
6149,123.54
6150,123.98
6151,124.34
6152,124.72
6153,125.05
6154,125.43
6155,125.83
6156,126.31
6157,126.82
6158,127.37
6159,127.89
6160,128.42
6161,128.88
6162,129.33
6163,129.71
6164,130.04
6165,130.27
6166,130.43
6167,130.52
6168,130.57
6169,130.57
6170,130.51
6171,130.39
6172,130.20
6173,129.97
6174,129.67
6175,129.29
6176,128.78
6177,128.20
6178,127.51
6179,126.81
6180,126.05
6181,125.33
6182,124.59
6183,123.92
6184,123.24
6185,122.63
6186,122.04
6187,121.52
6188,120.98
6189,120.49
6190,120.00
6191,119.60
6192,119.22
6193,118.91
6194,118.60
6195,118.31
6196,118.00
6197,117.71
6198,117.42
6199,117.16
6200,116.88
6201,116.62
6202,116.38
6203,116.20
6204,116.07
6205,115.96
6206,115.84
6207,115.72
6208,115.58
6209,115.44
6210,115.29
6211,115.17
6212,115.08
6213,115.09
6214,115.18
6215,115.33
6216,115.51
6217,115.69
6218,115.87
6219,115.98
6220,116.03
6221,116.00
6222,115.94
6223,115.90
6224,115.91
6225,115.94
6226,116.00
6227,116.08
6228,116.20
6229,116.31
6230,116.43
6231,116.55
6232,116.68
6233,116.82
6234,117.00
6235,117.21
6236,117.45
6237,117.68
6238,117.94
6239,118.17
6240,118.38
6241,118.55
6242,118.73
6243,118.90
6244,119.08
6245,119.22
6246,119.36
6247,119.48
6248,119.58
6249,119.66
6250,119.77
6251,119.91
6252,120.11
6253,120.35
6254,120.62
6255,120.89
6256,121.12
6257,121.31
6258,121.44
6259,121.52
6260,121.57
6261,121.60
6262,121.63
6263,121.68
6264,121.80
6265,121.98
6266,122.22
6267,122.45
6268,122.68
6269,122.86
6270,122.98
6271,123.03
6272,123.04
6273,123.01
6274,122.97
6275,122.94
6276,122.90
6277,122.87
6278,122.88
6279,122.94
6280,123.02
6281,123.09
6282,123.11
6283,123.09
6284,122.99
6285,122.85
6286,122.63
6287,122.39
6288,122.15
6289,121.94
6290,121.78
6291,121.66
6292,121.56
6293,121.51
6294,121.50
6295,121.53
6296,121.56
6297,121.57
6298,121.55
6299,121.55
6300,121.55
6301,121.59
6302,121.65
6303,121.74
6304,121.84
6305,121.94
6306,122.02
6307,122.05
6308,121.99
6309,121.84
6310,121.61
6311,121.35
6312,121.06
6313,120.79
6314,120.55
6315,120.41
6316,120.35
6317,120.36
6318,120.35
6319,120.30
6320,120.19
6321,120.05
6322,119.81
6323,119.52
6324,119.19
6325,118.89
6326,118.64
6327,118.44
6328,118.24
6329,118.06
6330,117.90
6331,117.75
6332,117.61
6333,117.49
6334,117.40
6335,117.37
6336,117.40
6337,117.49
6338,117.64
6339,117.82
6340,118.03
6341,118.24
6342,118.42
6343,118.57
6344,118.71
6345,118.86
6346,119.00
6347,119.12
6348,119.25
6349,119.36
6350,119.45
6351,119.48
6352,119.48
6353,119.47
6354,119.48
6355,119.48
6356,119.47
6357,119.44
6358,119.38
6359,119.29
6360,119.17
6361,119.03
6362,118.84
6363,118.63
6364,118.42
6365,118.24
6366,118.08
6367,117.94
6368,117.79
6369,117.65
6370,117.47
6371,117.27
6372,117.03
6373,116.79
6374,116.55
6375,116.35
6376,116.18
6377,116.07
6378,115.96
6379,115.85
6380,115.72
6381,115.58
6382,115.36
6383,115.10
6384,114.80
6385,114.50
6386,114.20
6387,113.91
6388,113.60
6389,113.34
6390,113.11
6391,112.91
6392,112.68
6393,112.43
6394,112.11
6395,111.76
6396,111.31
6397,110.85
6398,110.37
6399,109.95
6400,109.57
6401,109.28
6402,109.09
6403,109.03
6404,109.06
6405,109.17
6406,109.30
6407,109.42
6408,109.47
6409,109.46
6410,109.37
6411,109.24
6412,109.09
6413,108.93
6414,108.83
6415,108.80
6416,108.85
6417,108.96
6418,109.15
6419,109.35
6420,109.57
6421,109.74
6422,109.92
6423,110.05
6424,110.18
6425,110.30
6426,110.45
6427,110.66
6428,110.90
6429,111.15
6430,111.37
6431,111.55
6432,111.66
6433,111.69
6434,111.64
6435,111.51
6436,111.34
6437,111.17
6438,111.01
6439,110.89
6440,110.79
6441,110.71
6442,110.61
6443,110.50
6444,110.34
6445,110.17
6446,109.95
6447,109.75
6448,109.55
6449,109.38
6450,109.21
6451,109.06
6452,108.93
6453,108.82
6454,108.69
6455,108.57
6456,108.48
6457,108.45
6458,108.45
6459,108.49
6460,108.55
6461,108.61
6462,108.64
6463,108.61
6464,108.53
6465,108.41
6466,108.26
6467,108.08
6468,107.87
6469,107.66
6470,107.49
6471,107.36
6472,107.28
6473,107.25
6474,107.28
6475,107.38
6476,107.51
6477,107.66
6478,107.83
6479,108.00
6480,108.20
6481,108.41
6482,108.62
6483,108.83
6484,109.05
6485,109.22
6486,109.34
6487,109.41
6488,109.44
6489,109.45
6490,109.48
6491,109.54
6492,109.66
6493,109.84
6494,110.05
6495,110.27
6496,110.45
6497,110.57
6498,110.62
6499,110.58
6500,110.51
6501,110.44
6502,110.41
6503,110.41
6504,110.44
6505,110.50
6506,110.59
6507,110.67
6508,110.77
6509,110.86
6510,110.92
6511,110.95
6512,110.95
6513,110.91
6514,110.88
6515,110.85
6516,110.82
6517,110.79
6518,110.79
6519,110.83
6520,110.98
6521,111.18
6522,111.45
6523,111.72
6524,111.98
6525,112.22
6526,112.43
6527,112.60
6528,112.75
6529,112.86
6530,113.00
6531,113.14
6532,113.29
6533,113.43
6534,113.62
6535,113.82
6536,114.04
6537,114.25
6538,114.46
6539,114.66
6540,114.88
6541,115.09
6542,115.26
6543,115.41
6544,115.56
6545,115.74
6546,115.94
6547,116.15
6548,116.36
6549,116.53
6550,116.69
6551,116.81
6552,116.87
6553,116.86
6554,116.82
6555,116.78
6556,116.82
6557,116.96
6558,117.23
6559,117.61
6560,118.14
6561,118.77
6562,119.45
6563,120.11
6564,120.72
6565,121.22
6566,121.62
6567,121.91
6568,122.15
6569,122.31
6570,122.46
6571,122.57
6572,122.69
6573,122.80
6574,122.93
6575,123.05
6576,123.15
6577,123.18
6578,123.15
6579,123.05
6580,122.90
6581,122.70
6582,122.44
6583,122.21
6584,121.99
6585,121.85
6586,121.75
6587,121.73
6588,121.74
6589,121.75
6590,121.69
6591,121.54
6592,121.31
6593,121.02
6594,120.64
6595,120.23
6596,119.78
6597,119.37
6598,118.99
6599,118.70
6600,118.48
6601,118.33
6602,118.23
6603,118.17
6604,118.15
6605,118.19
6606,118.26
6607,118.36
6608,118.42
6609,118.45
6610,118.46
6611,118.45
6612,118.45
6613,118.42
6614,118.40
6615,118.42
6616,118.50
6617,118.65
6618,118.87
6619,119.11
6620,119.32
6621,119.48
6622,119.57
6623,119.59
6624,119.58
6625,119.58
6626,119.64
6627,119.77
6628,120.00
6629,120.30
6630,120.69
6631,121.10
6632,121.51
6633,121.86
6634,122.21
6635,122.52
6636,122.82
6637,123.09
6638,123.39
6639,123.70
6640,124.02
6641,124.29
6642,124.56
6643,124.79
6644,124.95
6645,125.04
6646,125.11
6647,125.15
6648,125.18
6649,125.19
6650,125.20
6651,125.22
6652,125.25
6653,125.26
6654,125.24
6655,125.21
6656,125.15
6657,125.10
6658,125.03
6659,124.98
6660,124.93
6661,124.89
6662,124.76
6663,124.53
6664,124.15
6665,123.70
6666,123.22
6667,122.77
6668,122.38
6669,122.09
6670,121.90
6671,121.82
6672,121.75
6673,121.67
6674,121.54
6675,121.33
6676,121.03
6677,120.67
6678,120.29
6679,119.97
6680,119.69
6681,119.49
6682,119.35
6683,119.26
6684,119.19
6685,119.12
6686,118.97
6687,118.74
6688,118.41
6689,118.03
6690,117.58
6691,117.13
6692,116.70
6693,116.32
6694,115.96
6695,115.67
6696,115.45
6697,115.30
6698,115.17
6699,115.07
6700,114.94
6701,114.81
6702,114.56
6703,114.21
6704,113.77
6705,113.32
6706,112.87
6707,112.50
6708,112.20
6709,112.02
6710,111.92
6711,111.91
6712,111.92
6713,111.97
6714,111.95
6715,111.84
6716,111.61
6717,111.31
6718,110.96
6719,110.63
6720,110.34
6721,110.13
6722,110.01
6723,109.99
6724,110.04
6725,110.13
6726,110.23
6727,110.31
6728,110.40
6729,110.49
6730,110.60
6731,110.71
6732,110.85
6733,111.03
6734,111.27
6735,111.53
6736,111.79
6737,112.01
6738,112.17
6739,112.29
6740,112.37
6741,112.40
6742,112.38
6743,112.35
6744,112.34
6745,112.34
6746,112.32
6747,112.27
6748,112.14
6749,111.94
6750,111.63
6751,111.25
6752,110.78
6753,110.31
6754,109.84
6755,109.47
6756,109.14
6757,108.88
6758,108.64
6759,108.44
6760,108.22
6761,107.96
6762,107.62
6763,107.24
6764,106.84
6765,106.51
6766,106.25
6767,106.11
6768,106.06
6769,106.10
6770,106.16
6771,106.20
6772,106.17
6773,106.06
6774,105.83
6775,105.54
6776,105.18
6777,104.83
6778,104.49
6779,104.19
6780,103.93
6781,103.75
6782,103.66
6783,103.67
6784,103.71
6785,103.78
6786,103.87
6787,103.95
6788,104.00
6789,104.01
6790,103.99
6791,103.95
6792,103.90
6793,103.87
6794,103.91
6795,104.06
6796,104.29
6797,104.56
6798,104.86
6799,105.16
6800,105.43
6801,105.61
6802,105.68
6803,105.67
6804,105.65
6805,105.64
6806,105.69
6807,105.80
6808,106.01
6809,106.27
6810,106.61
6811,106.96
6812,107.33
6813,107.65
6814,107.93
6815,108.17
6816,108.39
6817,108.59
6818,108.80
6819,108.99
6820,109.25
6821,109.54
6822,109.88
6823,110.23
6824,110.62
6825,111.01
6826,111.39
6827,111.68
6828,111.89
6829,111.99
6830,112.07
6831,112.12
6832,112.16
6833,112.19
6834,112.25
6835,112.34
6836,112.45
6837,112.56
6838,112.69
6839,112.81
6840,112.91
6841,112.97
6842,113.01
6843,113.01
6844,112.95
6845,112.86
6846,112.75
6847,112.66
6848,112.58
6849,112.53
6850,112.50
6851,112.47
6852,112.42
6853,112.33
6854,112.21
6855,112.09
6856,111.96
6857,111.82
6858,111.65
6859,111.47
6860,111.28
6861,111.11
6862,110.92
6863,110.76
6864,110.57
6865,110.40
6866,110.20
6867,110.00
6868,109.78
6869,109.57
6870,109.36
6871,109.12
6872,108.85
6873,108.55
6874,108.25
6875,107.98
6876,107.74
6877,107.57
6878,107.45
6879,107.39
6880,107.36
6881,107.37
6882,107.41
6883,107.50
6884,107.63
6885,107.80
6886,108.05
6887,108.31
6888,108.57
6889,108.78
6890,108.96
6891,109.09
6892,109.24
6893,109.41
6894,109.67
6895,110.05
6896,110.58
6897,111.20
6898,111.91
6899,112.59
6900,113.24
6901,113.80
6902,114.30
6903,114.69
6904,115.07
6905,115.41
6906,115.80
6907,116.20
6908,116.67
6909,117.11
6910,117.55
6911,117.89
6912,118.17
6913,118.37
6914,118.55
6915,118.71
6916,118.93
6917,119.16
6918,119.44
6919,119.74
6920,120.03
6921,120.23
6922,120.36
6923,120.41
6924,120.44
6925,120.45
6926,120.51
6927,120.64
6928,120.84
6929,121.08
6930,121.30
6931,121.46
6932,121.53
6933,121.50
6934,121.34
6935,121.07
6936,120.74
6937,120.41
6938,120.09
6939,119.80
6940,119.50
6941,119.21
6942,118.91
6943,118.62
6944,118.27
6945,117.90
6946,117.48
6947,117.06
6948,116.62
6949,116.22
6950,115.84
6951,115.55
6952,115.30
6953,115.14
6954,115.01
6955,114.92
6956,114.82
6957,114.72
6958,114.59
6959,114.46
6960,114.32
6961,114.18
6962,114.07
6963,114.01
6964,113.98
6965,113.98
6966,114.02
6967,114.08
6968,114.14
6969,114.17
6970,114.18
6971,114.18
6972,114.16
6973,114.10
6974,114.01
6975,113.91
6976,113.84
6977,113.78
6978,113.74
6979,113.71
6980,113.69
6981,113.69
6982,113.70
6983,113.70
6984,113.68
6985,113.65
6986,113.64
6987,113.66
6988,113.72
6989,113.82
6990,113.95
6991,114.09
6992,114.25
6993,114.40
6994,114.54
6995,114.65
6996,114.75
6997,114.81
6998,114.86
6999,114.94
7000,115.07
7001,115.29
7002,115.59
7003,115.94
7004,116.34
7005,116.76
7006,117.18
7007,117.54
7008,117.81
7009,117.94
7010,118.00
7011,118.00
7012,117.95
7013,117.87
7014,117.76
7015,117.66
7016,117.60
7017,117.60
7018,117.67
7019,117.77
7020,117.84
7021,117.87
7022,117.86
7023,117.84
7024,117.77
7025,117.65
7026,117.49
7027,117.33
7028,117.21
7029,117.13
7030,117.06
7031,117.00
7032,116.93
7033,116.84
7034,116.72
7035,116.58
7036,116.40
7037,116.22
7038,116.07
7039,115.98
7040,115.95
7041,115.99
7042,116.07
7043,116.16
7044,116.22
7045,116.26
7046,116.24
7047,116.19
7048,116.09
7049,115.97
7050,115.82
7051,115.65
7052,115.43
7053,115.20
7054,114.92
7055,114.62
7056,114.31
7057,114.01
7058,113.73
7059,113.50
7060,113.31
7061,113.20
7062,113.12
7063,113.04
7064,112.92
7065,112.74
7066,112.48
7067,112.19
7068,111.86
7069,111.57
7070,111.30
7071,111.07
7072,110.86
7073,110.69
7074,110.53
7075,110.35
7076,110.10
7077,109.81
7078,109.49
7079,109.19
7080,108.89
7081,108.63
7082,108.41
7083,108.24
7084,108.08
7085,107.93
7086,107.80
7087,107.70
7088,107.67
7089,107.67
7090,107.70
7091,107.80
7092,107.95
7093,108.13
7094,108.29
7095,108.41
7096,108.50
7097,108.51
7098,108.47
7099,108.38
7100,108.31
7101,108.27
7102,108.28
7103,108.35
7104,108.48
7105,108.68
7106,108.96
7107,109.28
7108,109.66
7109,110.04
7110,110.41
7111,110.74
7112,111.05
7113,111.34
7114,111.63
7115,111.89
7116,112.17
7117,112.43
7118,112.72
7119,113.01
7120,113.33
7121,113.65
7122,113.97
7123,114.23
7124,114.46
7125,114.64
7126,114.79
7127,114.90
7128,114.99
7129,115.07
7130,115.20
7131,115.36
7132,115.49
7133,115.55
7134,115.54
7135,115.42
7136,115.16
7137,114.77
7138,114.29
7139,113.81
7140,113.37
7141,113.01
7142,112.75
7143,112.60
7144,112.54
7145,112.52
7146,112.47
7147,112.39
7148,112.25
7149,112.09
7150,111.95
7151,111.90
7152,111.95
7153,112.10
7154,112.32
7155,112.56
7156,112.79
7157,112.98
7158,113.10
7159,113.15
7160,113.16
7161,113.15
7162,113.19
7163,113.27
7164,113.41
7165,113.59
7166,113.81
7167,113.98
7168,114.10
7169,114.12
7170,114.11
7171,114.07
7172,114.04
7173,114.03
7174,114.10
7175,114.27
7176,114.56
7177,114.89
7178,115.21
7179,115.46
7180,115.62
7181,115.66
7182,115.62
7183,115.52
7184,115.46
7185,115.49
7186,115.62
7187,115.88
7188,116.20
7189,116.95
7190,117.11
7191,116.68
7192,116.16
7193,117.14
7194,118.95
7195,118.29
7196,113.66
7197,112.08
7198,119.30
7199,128.41
7200,106.58
