1,280.06
2,406.74
3,416.72
4,366.97
5,330.66
6,312.19
7,272.61
8,200.07
9,106.87
10,8.54
11,-87.22
12,-162.87
13,-199.98
14,-185.94
15,-120.57
16,-17.73
17,104.89
18,221.07
19,314.39
20,369.81
21,388.09
22,371.15
23,329.35
24,268.77
25,195.22
26,111.39
27,19.32
28,-76.11
29,-167.69
30,-245.51
31,-298.68
32,-321.62
33,-311.55
34,-276.70
35,-226.20
36,-175.78
37,-134.49
38,-110.84
39,-103.36
40,-108.86
41,-119.02
42,-127.35
43,-129.67
44,-124.73
45,-115.45
46,-104.13
47,-95.21
48,-89.42
49,-87.92
50,-88.56
51,-90.03
52,-90.70
53,-90.24
54,-88.56
55,-86.15
56,-83.28
57,-80.69
58,-78.46
59,-76.90
60,-75.50
61,-74.13
62,-72.45
63,-70.80
64,-69.27
65,-68.08
66,-67.11
67,-66.47
68,-65.98
69,-65.80
70,-65.61
71,-65.40
72,-65.09
73,-64.85
74,-64.64
75,-64.45
76,-64.12
77,-63.63
78,-63.05
79,-62.56
80,-62.26
81,-62.01
82,-61.71
83,-61.49
84,-61.49
85,-61.71
86,-61.98
87,-62.26
88,-62.59
89,-63.05
90,-63.57
91,-64.03
92,-64.61
93,-65.31
94,-66.13
95,-66.80
96,-67.41
97,-67.87
98,-68.36
99,-68.82
100,-69.27
101,-69.73
102,-70.37
103,-71.08
104,-71.75
105,-72.24
106,-72.57
107,-72.81
108,-72.88
109,-72.63
110,-72.08
111,-71.35
112,-70.53
113,-69.55
114,-68.51
115,-67.54
116,-66.83
117,-66.59
118,-66.80
119,-67.29
120,-67.96
121,-68.66
122,-69.40
123,-70.13
124,-70.80
125,-71.26
126,-71.50
127,-71.72
128,-72.17
129,-72.88
130,-73.73
131,-74.71
132,-75.93
133,-77.33
134,-78.77
135,-79.96
136,-80.93
137,-81.60
138,-82.15
139,-82.58
140,-83.16
141,-83.83
142,-84.75
143,-85.69
144,-86.67
145,-87.59
146,-88.65
147,-89.84
148,-91.19
149,-92.35
150,-93.26
151,-93.99
152,-94.73
153,-95.37
154,-95.86
155,-96.10
156,-96.47
157,-96.86
158,-97.26
159,-97.53
160,-97.87
161,-98.27
162,-98.75
163,-99.27
164,-99.91
165,-100.56
166,-101.20
167,-101.72
168,-102.14
169,-102.36
170,-102.23
171,-101.72
172,-101.29
173,-101.26
174,-101.72
175,-102.45
176,-103.21
177,-103.94
178,-104.61
179,-105.07
180,-105.22
181,-104.98
182,-104.58
183,-104.31
184,-104.28
185,-104.55
186,-105.04
187,-105.77
188,-106.66
189,-107.64
190,-108.55
191,-109.25
192,-109.68
193,-109.92
194,-110.17
195,-110.38
196,-110.50
197,-110.50
198,-110.50
199,-110.47
200,-110.44
201,-110.20
202,-109.80
203,-109.31
204,-108.80
205,-108.34
206,-107.82
207,-107.36
208,-106.99
209,-106.75
210,-106.54
211,-106.35
212,-106.05
213,-105.56
214,-104.80
215,-103.85
216,-102.81
217,-101.90
218,-101.01
219,-100.31
220,-99.76
221,-99.52
222,-99.61
223,-99.91
224,-100.04
225,-99.85
226,-99.09
227,-97.90
228,-96.34
229,-94.67
230,-92.99
231,-91.61
232,-90.42
233,-89.51
234,-88.53
235,-87.71
236,-86.73
237,-85.57
238,-83.71
239,-81.42
240,-78.77
241,-76.11
242,-73.24
243,-70.47
244,-67.87
245,-65.73
246,-63.63
247,-61.58
248,-59.45
249,-57.56
250,-55.69
251,-54.11
252,-52.64
253,-51.48
254,-50.35
255,-49.44
256,-48.68
257,-48.22
258,-47.91
259,-47.73
260,-47.49
261,-47.21
262,-47.00
263,-47.00
264,-47.39
265,-48.10
266,-48.98
267,-49.93
268,-51.12
269,-52.52
270,-54.08
271,-55.54
272,-56.88
273,-58.04
274,-59.05
275,-59.72
276,-60.21
277,-60.39
278,-60.49
279,-60.46
280,-60.58
281,-60.76
282,-61.19
283,-61.86
284,-62.99
285,-64.42
286,-66.04
287,-67.44
288,-68.73
289,-69.92
290,-71.17
291,-72.36
292,-73.27
293,-74.04
294,-74.68
295,-75.16
296,-75.20
297,-74.74
298,-73.91
299,-72.97
300,-71.72
301,-70.07
302,-68.05
303,-66.16
304,-64.45
305,-63.05
306,-61.68
307,-60.30
308,-58.78
309,-57.37
310,-55.94
311,-54.57
312,-53.07
313,-51.67
314,-50.26
315,-49.13
316,-48.03
317,-47.15
318,-46.17
319,-45.29
320,-44.22
321,-43.09
322,-41.60
323,-40.01
324,-38.12
325,-36.25
326,-34.18
327,-32.10
328,-29.82
329,-27.47
330,-24.87
331,-22.55
332,-20.48
333,-18.83
334,-17.27
335,-15.93
336,-14.68
337,-13.73
338,-12.82
339,-11.96
340,-10.89
341,-9.74
342,-8.27
343,-6.87
344,-5.58
345,-4.67
346,-3.91
347,-3.23
348,-2.47
349,-1.80
350,-1.04
351,-0.43
352,0.37
353,1.25
354,2.53
355,3.91
356,5.43
357,7.11
358,9.19
359,11.54
360,13.95
361,16.11
362,18.13
363,19.74
364,20.84
365,21.33
366,21.51
367,21.42
368,21.24
369,21.00
370,20.97
371,21.18
372,21.55
373,21.79
374,21.88
375,21.85
376,21.79
377,21.79
378,21.91
379,22.16
380,22.49
381,22.98
382,23.62
383,24.32
384,25.05
385,25.79
386,26.52
387,27.22
388,27.80
389,28.29
390,28.81
391,29.24
392,29.63
393,29.85
394,30.00
395,29.97
396,29.82
397,29.57
398,29.48
399,29.66
400,30.27
401,31.25
402,32.56
403,34.00
404,35.31
405,36.29
406,36.87
407,37.11
408,37.02
409,36.56
410,35.61
411,34.45
412,33.14
413,31.95
414,30.79
415,29.66
416,28.32
417,26.95
418,25.33
419,23.71
420,21.85
421,19.99
422,18.01
423,16.14
424,14.25
425,12.66
426,11.08
427,9.70
428,8.24
429,6.87
430,5.37
431,4.00
432,2.59
433,1.46
434,0.40
435,-0.46
436,-1.53
437,-2.66
438,-4.03
439,-5.40
440,-7.02
441,-8.64
442,-10.41
443,-12.02
444,-13.73
445,-15.35
446,-17.00
447,-18.40
448,-19.71
449,-20.84
450,-22.06
451,-23.22
452,-24.38
453,-25.30
454,-26.12
455,-26.79
456,-27.50
457,-28.20
458,-29.02
459,-29.94
460,-31.04
461,-32.23
462,-33.54
463,-34.70
464,-35.71
465,-36.41
466,-36.96
467,-37.41
468,-37.81
469,-38.06
470,-38.18
471,-38.15
472,-38.06
473,-37.78
474,-37.38
475,-36.90
476,-36.50
477,-36.19
478,-36.16
479,-36.44
480,-36.99
481,-37.69
482,-38.42
483,-39.12
484,-39.98
485,-40.89
486,-41.90
487,-42.85
488,-43.85
489,-44.77
490,-45.62
491,-46.33
492,-47.03
493,-47.73
494,-48.40
495,-48.86
496,-49.16
497,-49.38
498,-49.74
499,-50.17
500,-50.75
501,-51.48
502,-52.43
503,-53.38
504,-54.17
505,-54.66
506,-54.90
507,-54.87
508,-54.60
509,-54.11
510,-53.59
511,-53.31
512,-53.47
513,-53.96
514,-54.66
515,-55.39
516,-56.03
517,-56.55
518,-56.73
519,-56.52
520,-55.82
521,-54.84
522,-53.80
523,-52.86
524,-51.94
525,-50.99
526,-49.99
527,-49.04
528,-48.13
529,-47.21
530,-46.02
531,-44.62
532,-43.00
533,-41.35
534,-39.61
535,-37.96
536,-36.38
537,-35.25
538,-34.36
539,-33.72
540,-32.93
541,-32.01
542,-30.79
543,-29.42
544,-27.62
545,-25.54
546,-22.98
547,-20.39
548,-17.76
549,-15.66
550,-14.01
551,-12.88
552,-11.84
553,-10.96
554,-10.01
555,-9.09
556,-7.90
557,-6.50
558,-4.88
559,-3.48
560,-2.35
561,-1.65
562,-1.19
563,-1.04
564,-1.01
565,-1.01
566,-0.76
567,-0.34
568,0.24
569,0.95
570,1.95
571,3.14
572,4.21
573,4.97
574,5.46
575,5.65
576,5.52
577,5.10
578,4.43
579,3.69
580,2.81
581,1.89
582,0.92
583,0.03
584,-1.01
585,-2.20
586,-3.51
587,-4.67
588,-5.74
589,-6.65
590,-7.75
591,-8.88
592,-10.13
593,-11.32
594,-12.60
595,-13.73
596,-14.74
597,-15.44
598,-16.02
599,-16.45
600,-16.82
601,-17.06
602,-17.33
603,-17.52
604,-17.61
605,-17.64
606,-17.76
607,-17.94
608,-18.07
609,-18.10
610,-18.19
611,-18.43
612,-18.62
613,-18.62
614,-18.52
615,-18.49
616,-18.68
617,-18.92
618,-19.17
619,-19.38
620,-19.71
621,-20.17
622,-20.69
623,-21.21
624,-21.70
625,-22.13
626,-22.58
627,-23.04
628,-23.68
629,-24.35
630,-25.09
631,-25.79
632,-26.70
633,-27.83
634,-29.30
635,-30.98
636,-32.93
637,-34.79
638,-36.50
639,-37.90
640,-39.25
641,-40.41
642,-41.38
643,-42.05
644,-42.79
645,-43.67
646,-44.95
647,-46.39
648,-47.88
649,-49.29
650,-50.78
651,-52.19
652,-53.47
653,-54.41
654,-55.11
655,-55.54
656,-55.88
657,-56.15
658,-56.34
659,-56.30
660,-56.00
661,-55.54
662,-55.05
663,-54.57
664,-53.86
665,-52.95
666,-51.91
667,-50.96
668,-49.93
669,-48.74
670,-47.42
671,-46.26
672,-45.23
673,-44.28
674,-43.27
675,-42.36
676,-41.50
677,-40.83
678,-40.04
679,-39.09
680,-38.06
681,-37.35
682,-36.99
683,-36.77
684,-36.41
685,-35.98
686,-35.61
687,-35.34
688,-34.97
689,-34.52
690,-34.21
691,-34.21
692,-34.30
693,-34.33
694,-34.24
695,-34.24
696,-34.39
697,-34.64
698,-34.76
699,-34.79
700,-34.79
701,-34.76
702,-34.64
703,-34.45
704,-34.24
705,-33.97
706,-33.45
707,-32.78
708,-32.14
709,-31.62
710,-31.10
711,-30.67
712,-30.49
713,-30.70
714,-31.16
715,-31.74
716,-32.17
717,-32.38
718,-32.23
719,-31.77
720,-31.13
721,-30.43
722,-29.48
723,-28.29
724,-26.95
725,-25.79
726,-24.75
727,-23.80
728,-22.80
729,-21.91
730,-21.09
731,-20.39
732,-19.50
733,-18.62
734,-17.64
735,-16.72
736,-15.50
737,-14.13
738,-12.57
739,-11.14
740,-9.80
741,-8.64
742,-7.63
743,-6.90
744,-6.44
745,-6.20
746,-6.13
747,-6.10
748,-6.16
749,-6.38
750,-7.05
751,-8.21
752,-9.92
753,-12.08
754,-14.68
755,-17.55
756,-20.54
757,-23.16
758,-25.30
759,-26.67
760,-27.50
761,-27.68
762,-27.50
763,-26.95
764,-26.40
765,-25.85
766,-25.67
767,-25.85
768,-26.70
769,-27.86
770,-29.27
771,-30.67
772,-32.20
773,-33.57
774,-34.91
775,-36.04
776,-37.32
777,-38.73
778,-40.28
779,-41.69
780,-43.00
781,-44.13
782,-45.47
783,-46.84
784,-48.34
785,-49.77
786,-51.24
787,-52.64
788,-53.96
789,-55.15
790,-56.37
791,-57.56
792,-58.59
793,-59.30
794,-59.78
795,-59.97
796,-59.97
797,-59.75
798,-59.36
799,-58.84
800,-58.32
801,-57.86
802,-57.43
803,-56.95
804,-56.30
805,-55.60
806,-54.93
807,-54.47
808,-54.05
809,-53.62
810,-53.07
811,-52.58
812,-52.22
813,-52.00
814,-51.79
815,-51.57
816,-51.21
817,-50.72
818,-50.20
819,-49.71
820,-49.35
821,-49.10
822,-48.95
823,-48.98
824,-49.16
825,-49.41
826,-49.53
827,-49.56
828,-49.53
829,-49.50
830,-49.50
831,-49.50
832,-49.59
833,-49.87
834,-50.17
835,-50.38
836,-50.51
837,-50.51
838,-50.42
839,-50.17
840,-49.77
841,-49.26
842,-48.83
843,-48.61
844,-48.58
845,-48.58
846,-48.49
847,-48.52
848,-48.77
849,-49.22
850,-49.68
851,-49.99
852,-50.08
853,-50.05
854,-49.87
855,-49.65
856,-49.53
857,-49.50
858,-49.47
859,-49.50
860,-49.71
861,-50.20
862,-50.69
863,-50.96
864,-50.96
865,-50.69
866,-50.17
867,-49.53
868,-48.58
869,-47.39
870,-45.84
871,-44.19
872,-42.57
873,-41.17
874,-39.76
875,-38.39
876,-36.90
877,-35.46
878,-33.97
879,-32.62
880,-31.25
881,-29.85
882,-28.11
883,-26.21
884,-24.29
885,-22.61
886,-21.15
887,-20.02
888,-19.13
889,-18.68
890,-18.46
891,-18.52
892,-18.62
893,-18.65
894,-18.37
895,-17.91
896,-17.33
897,-16.88
898,-16.45
899,-15.96
900,-15.38
901,-14.89
902,-14.71
903,-14.71
904,-14.68
905,-14.68
906,-14.95
907,-15.63
908,-16.72
909,-17.94
910,-19.23
911,-20.39
912,-21.45
913,-22.37
914,-23.35
915,-24.29
916,-25.21
917,-25.88
918,-26.55
919,-27.25
920,-28.05
921,-28.75
922,-29.24
923,-29.48
924,-29.63
925,-29.63
926,-29.30
927,-28.59
928,-27.62
929,-26.64
930,-25.76
931,-25.05
932,-24.54
933,-24.29
934,-24.32
935,-24.57
936,-24.96
937,-25.45
938,-25.97
939,-26.43
940,-26.82
941,-27.04
942,-27.19
943,-27.40
944,-27.89
945,-28.59
946,-29.48
947,-30.46
948,-31.56
949,-32.44
950,-33.08
951,-33.33
952,-33.42
953,-33.36
954,-33.23
955,-33.23
956,-33.72
957,-34.64
958,-35.77
959,-36.74
960,-37.57
961,-38.24
962,-38.82
963,-39.06
964,-39.00
965,-38.73
966,-38.42
967,-38.18
968,-38.06
969,-38.09
970,-38.24
971,-38.45
972,-38.57
973,-38.64
974,-38.57
975,-38.33
976,-37.69
977,-36.77
978,-35.77
979,-34.79
980,-33.66
981,-32.53
982,-31.49
983,-30.76
984,-30.09
985,-29.45
986,-28.72
987,-28.02
988,-27.07
989,-25.91
990,-24.57
991,-23.38
992,-22.37
993,-21.70
994,-21.24
995,-21.03
996,-20.84
997,-20.63
998,-20.23
999,-19.78
1000,-19.26
1001,-18.77
1002,-18.34
1003,-18.16
1004,-18.13
1005,-18.10
1006,-17.94
1007,-17.73
1008,-17.64
1009,-17.64
1010,-17.46
1011,-16.97
1012,-16.42
1013,-16.17
1014,-16.30
1015,-16.54
1016,-16.72
1017,-16.97
1018,-17.46
1019,-18.16
1020,-18.89
1021,-19.38
1022,-19.68
1023,-19.93
1024,-20.08
1025,-20.08
1026,-19.90
1027,-19.65
1028,-19.44
1029,-19.20
1030,-18.83
1031,-18.34
1032,-17.94
1033,-17.70
1034,-17.49
1035,-17.27
1036,-17.06
1037,-17.06
1038,-17.27
1039,-17.52
1040,-17.67
1041,-17.67
1042,-17.61
1043,-17.61
1044,-17.61
1045,-17.61
1046,-17.67
1047,-17.88
1048,-18.31
1049,-18.83
1050,-19.26
1051,-19.50
1052,-19.47
1053,-19.26
1054,-18.86
1055,-18.34
1056,-17.79
1057,-17.30
1058,-17.06
1059,-17.06
1060,-17.24
1061,-17.52
1062,-17.76
1063,-17.97
1064,-18.19
1065,-18.43
1066,-18.74
1067,-18.98
1068,-19.10
1069,-19.10
1070,-19.07
1071,-19.04
1072,-19.04
1073,-19.07
1074,-19.07
1075,-19.07
1076,-18.98
1077,-18.77
1078,-18.37
1079,-17.88
1080,-17.36
1081,-16.88
1082,-16.51
1083,-16.27
1084,-16.11
1085,-16.14
1086,-16.30
1087,-16.51
1088,-16.78
1089,-17.00
1090,-17.27
1091,-17.49
1092,-17.70
1093,-17.91
1094,-18.31
1095,-19.01
1096,-20.08
1097,-21.27
1098,-22.52
1099,-23.68
1100,-24.87
1101,-26.06
1102,-27.25
1103,-28.20
1104,-28.90
1105,-29.33
1106,-29.75
1107,-30.21
1108,-30.79
1109,-31.22
1110,-31.56
1111,-31.80
1112,-32.17
1113,-32.59
1114,-33.05
1115,-33.54
1116,-34.21
1117,-34.91
1118,-35.37
1119,-35.40
1120,-35.10
1121,-34.61
1122,-33.87
1123,-32.90
1124,-31.86
1125,-31.13
1126,-30.94
1127,-31.16
1128,-31.65
1129,-32.10
1130,-32.65
1131,-33.36
1132,-34.27
1133,-35.22
1134,-36.16
1135,-37.11
1136,-38.18
1137,-39.34
1138,-40.62
1139,-41.81
1140,-42.97
1141,-43.85
1142,-44.59
1143,-45.04
1144,-45.50
1145,-45.93
1146,-46.42
1147,-46.88
1148,-47.49
1149,-48.16
1150,-48.98
1151,-49.93
1152,-51.12
1153,-52.31
1154,-53.25
1155,-53.71
1156,-53.96
1157,-54.14
1158,-54.44
1159,-54.66
1160,-54.84
1161,-55.08
1162,-55.48
1163,-55.94
1164,-56.34
1165,-56.58
1166,-56.82
1167,-57.04
1168,-57.13
1169,-57.13
1170,-57.31
1171,-57.74
1172,-58.44
1173,-59.17
1174,-59.91
1175,-60.64
1176,-61.31
1177,-61.74
1178,-61.98
1179,-62.19
1180,-62.68
1181,-63.39
1182,-64.15
1183,-64.61
1184,-64.88
1185,-65.09
1186,-65.40
1187,-65.64
1188,-65.80
1189,-65.73
1190,-65.70
1191,-65.95
1192,-66.56
1193,-67.26
1194,-67.84
1195,-68.33
1196,-68.97
1197,-69.64
1198,-70.19
1199,-70.47
1200,-70.62
1201,-70.83
1202,-70.98
1203,-71.01
1204,-70.89
1205,-70.65
1206,-70.28
1207,-69.79
1208,-69.24
1209,-68.76
1210,-68.45
1211,-68.21
1212,-67.96
1213,-67.72
1214,-67.60
1215,-67.60
1216,-67.60
1217,-67.38
1218,-66.83
1219,-66.13
1220,-65.34
1221,-64.64
1222,-64.00
1223,-63.57
1224,-63.20
1225,-62.96
1226,-62.71
1227,-62.53
1228,-62.26
1229,-61.77
1230,-60.88
1231,-59.72
1232,-58.47
1233,-57.25
1234,-55.94
1235,-54.78
1236,-54.05
1237,-53.77
1238,-53.74
1239,-53.83
1240,-53.99
1241,-54.20
1242,-54.14
1243,-53.71
1244,-53.01
1245,-52.25
1246,-51.48
1247,-50.78
1248,-50.26
1249,-50.05
1250,-49.93
1251,-49.71
1252,-49.26
1253,-48.80
1254,-48.43
1255,-48.19
1256,-47.94
1257,-47.73
1258,-47.61
1259,-47.61
1260,-47.55
1261,-47.33
1262,-46.94
1263,-46.45
1264,-45.90
1265,-45.47
1266,-45.10
1267,-44.86
1268,-44.62
1269,-44.40
1270,-44.16
1271,-43.91
1272,-43.67
1273,-43.46
1274,-43.24
1275,-43.03
1276,-42.63
1277,-42.14
1278,-41.69
1279,-41.44
1280,-41.41
1281,-41.44
1282,-41.35
1283,-41.08
1284,-40.77
1285,-40.53
1286,-40.47
1287,-40.68
1288,-41.29
1289,-42.24
1290,-43.52
1291,-44.95
1292,-46.45
1293,-47.88
1294,-49.22
1295,-50.42
1296,-51.51
1297,-52.43
1298,-53.22
1299,-53.96
1300,-54.72
1301,-55.39
1302,-56.00
1303,-56.46
1304,-56.98
1305,-57.43
1306,-57.71
1307,-57.74
1308,-57.53
1309,-57.28
1310,-57.07
1311,-56.82
1312,-56.49
1313,-56.03
1314,-55.42
1315,-54.72
1316,-53.83
1317,-52.92
1318,-51.91
1319,-50.96
1320,-49.99
1321,-49.10
1322,-48.03
1323,-46.88
1324,-45.47
1325,-44.07
1326,-42.60
1327,-41.20
1328,-39.73
1329,-38.33
1330,-36.96
1331,-35.80
1332,-34.67
1333,-33.75
1334,-33.02
1335,-32.56
1336,-32.14
1337,-31.68
1338,-31.16
1339,-30.70
1340,-30.24
1341,-29.79
1342,-29.17
1343,-28.47
1344,-27.71
1345,-26.98
1346,-26.31
1347,-25.82
1348,-25.70
1349,-25.97
1350,-26.43
1351,-26.92
1352,-27.37
1353,-27.83
1354,-28.32
1355,-28.81
1356,-29.24
1357,-29.45
1358,-29.57
1359,-29.75
1360,-30.30
1361,-31.25
1362,-32.59
1363,-34.03
1364,-35.46
1365,-36.62
1366,-37.54
1367,-38.24
1368,-38.97
1369,-39.61
1370,-40.28
1371,-41.02
1372,-42.02
1373,-43.21
1374,-44.31
1375,-45.01
1376,-45.50
1377,-45.93
1378,-46.48
1379,-46.94
1380,-47.30
1381,-47.55
1382,-47.76
1383,-47.94
1384,-48.22
1385,-48.46
1386,-48.71
1387,-48.92
1388,-49.13
1389,-49.38
1390,-49.68
1391,-49.93
1392,-50.02
1393,-50.02
1394,-50.08
1395,-50.32
1396,-50.60
1397,-50.84
1398,-51.15
1399,-51.57
1400,-52.25
1401,-53.01
1402,-53.65
1403,-53.86
1404,-53.65
1405,-53.16
1406,-52.61
1407,-52.12
1408,-51.64
1409,-51.15
1410,-50.84
1411,-50.81
1412,-51.09
1413,-51.57
1414,-52.25
1415,-52.98
1416,-53.65
1417,-54.11
1418,-54.38
1419,-54.63
1420,-54.99
1421,-55.45
1422,-55.91
1423,-56.40
1424,-57.01
1425,-57.71
1426,-58.38
1427,-58.84
1428,-59.23
1429,-59.69
1430,-60.33
1431,-61.04
1432,-61.80
1433,-62.50
1434,-63.26
1435,-63.96
1436,-64.58
1437,-65.03
1438,-65.46
1439,-65.92
1440,-66.47
1441,-66.93
1442,-67.32
1443,-67.54
1444,-67.69
1445,-67.66
1446,-67.57
1447,-67.29
1448,-66.96
1449,-66.71
1450,-66.71
1451,-66.93
1452,-67.35
1453,-67.84
1454,-68.39
1455,-68.85
1456,-69.21
1457,-69.46
1458,-69.55
1459,-69.55
1460,-69.43
1461,-69.21
1462,-68.91
1463,-68.66
1464,-68.48
1465,-68.48
1466,-68.70
1467,-68.94
1468,-69.12
1469,-69.12
1470,-68.97
1471,-68.97
1472,-69.24
1473,-69.73
1474,-70.22
1475,-70.50
1476,-70.47
1477,-70.22
1478,-69.82
1479,-69.37
1480,-68.76
1481,-68.05
1482,-67.17
1483,-66.28
1484,-65.19
1485,-63.78
1486,-61.80
1487,-59.42
1488,-56.82
1489,-54.44
1490,-52.25
1491,-50.38
1492,-48.74
1493,-47.58
1494,-46.78
1495,-46.36
1496,-45.93
1497,-45.53
1498,-44.95
1499,-44.25
1500,-43.21
1501,-42.05
1502,-40.86
1503,-39.92
1504,-39.06
1505,-38.42
1506,-37.84
1507,-37.35
1508,-36.83
1509,-36.41
1510,-36.04
1511,-35.83
1512,-35.55
1513,-35.34
1514,-35.22
1515,-35.25
1516,-35.13
1517,-34.91
1518,-34.64
1519,-34.39
1520,-34.12
1521,-33.66
1522,-32.96
1523,-32.23
1524,-31.65
1525,-31.40
1526,-31.46
1527,-31.71
1528,-32.14
1529,-32.59
1530,-33.11
1531,-33.57
1532,-34.03
1533,-34.48
1534,-35.00
1535,-35.52
1536,-35.92
1537,-36.13
1538,-36.19
1539,-36.19
1540,-36.25
1541,-36.25
1542,-35.98
1543,-35.55
1544,-35.06
1545,-34.58
1546,-33.84
1547,-32.96
1548,-31.92
1549,-30.98
1550,-29.88
1551,-28.75
1552,-27.56
1553,-26.37
1554,-24.90
1555,-23.32
1556,-21.58
1557,-19.93
1558,-18.10
1559,-16.20
1560,-14.34
1561,-12.94
1562,-11.93
1563,-11.26
1564,-10.56
1565,-9.92
1566,-9.22
1567,-8.54
1568,-7.51
1569,-6.41
1570,-5.16
1571,-4.00
1572,-2.56
1573,-0.95
1574,0.85
1575,2.50
1576,4.06
1577,5.43
1578,6.77
1579,7.93
1580,9.03
1581,9.95
1582,10.89
1583,11.84
1584,12.88
1585,13.79
1586,14.62
1587,15.32
1588,16.08
1589,16.75
1590,17.30
1591,17.55
1592,17.64
1593,17.61
1594,17.46
1595,17.21
1596,17.03
1597,17.00
1598,17.15
1599,17.46
1600,17.76
1601,17.97
1602,17.97
1603,17.76
1604,17.43
1605,16.97
1606,16.14
1607,15.23
1608,14.31
1609,13.61
1610,12.85
1611,11.96
1612,10.83
1613,9.64
1614,8.30
1615,6.93
1616,5.37
1617,3.72
1618,1.77
1619,-0.27
1620,-2.50
1621,-4.64
1622,-6.87
1623,-8.94
1624,-10.93
1625,-12.57
1626,-14.13
1627,-15.47
1628,-16.82
1629,-17.97
1630,-19.26
1631,-20.36
1632,-21.45
1633,-22.34
1634,-23.41
1635,-24.57
1636,-25.88
1637,-27.04
1638,-28.17
1639,-29.30
1640,-30.79
1641,-32.44
1642,-34.24
1643,-35.89
1644,-37.48
1645,-38.85
1646,-40.13
1647,-41.05
1648,-41.78
1649,-42.18
1650,-42.60
1651,-43.03
1652,-43.70
1653,-44.37
1654,-45.14
1655,-45.84
1656,-46.60
1657,-47.30
1658,-47.91
1659,-48.37
1660,-48.83
1661,-49.29
1662,-49.71
1663,-49.96
1664,-50.05
1665,-50.02
1666,-50.02
1667,-50.02
1668,-49.99
1669,-49.99
1670,-50.08
1671,-50.29
1672,-50.63
1673,-50.87
1674,-50.96
1675,-50.96
1676,-50.99
1677,-51.21
1678,-51.67
1679,-52.12
1680,-52.61
1681,-53.10
1682,-53.65
1683,-54.11
1684,-54.32
1685,-54.35
1686,-54.35
1687,-54.29
1688,-54.14
1689,-53.89
1690,-53.96
1691,-54.41
1692,-55.08
1693,-55.60
1694,-55.79
1695,-55.79
1696,-55.66
1697,-55.42
1698,-54.93
1699,-54.23
1700,-53.50
1701,-52.98
1702,-52.76
1703,-52.80
1704,-52.98
1705,-53.22
1706,-53.44
1707,-53.71
1708,-53.99
1709,-54.26
1710,-54.20
1711,-53.77
1712,-52.86
1713,-51.67
1714,-50.20
1715,-48.77
1716,-47.49
1717,-46.57
1718,-45.90
1719,-45.47
1720,-44.98
1721,-44.56
1722,-44.01
1723,-43.30
1724,-42.30
1725,-41.11
1726,-39.95
1727,-38.97
1728,-38.12
1729,-37.41
1730,-36.90
1731,-36.68
1732,-36.68
1733,-36.68
1734,-36.56
1735,-36.32
1736,-36.04
1737,-35.83
1738,-35.58
1739,-35.34
1740,-35.16
1741,-35.16
1742,-35.40
1743,-35.86
1744,-36.53
1745,-37.51
1746,-38.85
1747,-40.31
1748,-41.41
1749,-41.90
1750,-41.84
1751,-41.35
1752,-40.47
1753,-39.28
1754,-37.87
1755,-36.68
1756,-35.86
1757,-35.43
1758,-35.00
1759,-34.61
1760,-34.03
1761,-33.36
1762,-32.20
1763,-30.58
1764,-28.44
1765,-26.28
1766,-24.26
1767,-22.64
1768,-21.18
1769,-20.05
1770,-19.07
1771,-18.40
1772,-17.73
1773,-17.09
1774,-16.24
1775,-15.29
1776,-14.19
1777,-13.03
1778,-11.69
1779,-10.28
1780,-8.76
1781,-7.35
1782,-6.01
1783,-4.82
1784,-3.69
1785,-2.75
1786,-2.11
1787,-1.86
1788,-1.92
1789,-2.20
1790,-2.59
1791,-3.08
1792,-3.54
1793,-4.03
1794,-4.58
1795,-5.31
1796,-6.13
1797,-6.87
1798,-7.35
1799,-7.57
1800,-7.63
1801,-7.60
1802,-7.60
1803,-7.57
1804,-7.69
1805,-7.87
1806,-8.36
1807,-9.06
1808,-10.07
1809,-11.26
1810,-12.54
1811,-13.73
1812,-14.83
1813,-15.75
1814,-16.60
1815,-17.55
1816,-18.71
1817,-19.90
1818,-20.90
1819,-21.64
1820,-22.22
1821,-22.61
1822,-22.95
1823,-23.19
1824,-23.59
1825,-23.99
1826,-24.44
1827,-24.93
1828,-25.70
1829,-26.58
1830,-27.59
1831,-28.53
1832,-29.69
1833,-30.82
1834,-31.86
1835,-32.59
1836,-33.23
1837,-33.91
1838,-34.67
1839,-35.40
1840,-36.10
1841,-36.80
1842,-37.45
1843,-37.96
1844,-38.24
1845,-38.24
1846,-37.93
1847,-37.45
1848,-36.87
1849,-36.38
1850,-36.04
1851,-35.83
1852,-35.61
1853,-35.40
1854,-35.10
1855,-34.64
1856,-33.87
1857,-32.93
1858,-31.86
1859,-30.91
1860,-30.09
1861,-29.39
1862,-28.69
1863,-28.02
1864,-27.19
1865,-26.28
1866,-25.05
1867,-23.65
1868,-22.00
1869,-20.36
1870,-18.68
1871,-17.27
1872,-16.20
1873,-15.72
1874,-15.78
1875,-16.33
1876,-17.06
1877,-17.79
1878,-18.28
1879,-18.59
1880,-18.52
1881,-18.04
1882,-17.06
1883,-15.90
1884,-14.74
1885,-13.76
1886,-12.82
1887,-11.90
1888,-11.05
1889,-10.31
1890,-9.58
1891,-8.88
1892,-8.30
1893,-8.09
1894,-8.18
1895,-8.42
1896,-8.67
1897,-8.91
1898,-9.22
1899,-9.46
1900,-9.52
1901,-9.25
1902,-8.82
1903,-8.58
1904,-8.64
1905,-8.88
1906,-9.12
1907,-9.37
1908,-9.86
1909,-10.50
1910,-11.26
1911,-11.99
1912,-12.88
1913,-13.82
1914,-14.62
1915,-15.08
1916,-15.44
1917,-15.87
1918,-16.54
1919,-17.24
1920,-17.97
1921,-18.68
1922,-19.53
1923,-20.45
1924,-21.39
1925,-22.09
1926,-22.67
1927,-23.13
1928,-23.50
1929,-23.74
1930,-23.93
1931,-24.14
1932,-24.51
1933,-24.96
1934,-25.48
1935,-26.00
1936,-26.43
1937,-26.64
1938,-26.55
1939,-26.34
1940,-26.18
1941,-26.15
1942,-26.15
1943,-26.15
1944,-26.34
1945,-26.82
1946,-27.47
1947,-27.95
1948,-28.14
1949,-28.11
1950,-28.14
1951,-28.35
1952,-28.81
1953,-29.54
1954,-30.58
1955,-31.74
1956,-32.87
1957,-33.87
1958,-34.79
1959,-35.46
1960,-35.80
1961,-35.80
1962,-35.77
1963,-35.74
1964,-35.58
1965,-35.34
1966,-35.28
1967,-35.49
1968,-35.95
1969,-36.44
1970,-36.90
1971,-37.35
1972,-37.90
1973,-38.36
1974,-38.67
1975,-38.67
1976,-38.45
1977,-38.21
1978,-38.02
1979,-38.02
1980,-38.24
1981,-38.73
1982,-39.43
1983,-40.16
1984,-40.74
1985,-40.95
1986,-40.83
1987,-40.62
1988,-40.47
1989,-40.47
1990,-40.44
1991,-40.47
1992,-40.62
1993,-40.86
1994,-40.92
1995,-40.71
1996,-40.25
1997,-39.76
1998,-39.28
1999,-38.82
2000,-38.33
2001,-37.84
2002,-37.41
2003,-37.20
2004,-37.11
2005,-37.14
2006,-37.05
2007,-36.87
2008,-36.50
2009,-36.01
2010,-35.37
2011,-34.67
2012,-33.94
2013,-33.23
2014,-32.47
2015,-31.74
2016,-31.16
2017,-30.94
2018,-31.07
2019,-31.31
2020,-31.43
2021,-31.49
2022,-31.40
2023,-31.13
2024,-30.61
2025,-29.94
2026,-29.27
2027,-28.75
2028,-28.32
2029,-28.14
2030,-28.32
2031,-28.75
2032,-29.14
2033,-29.45
2034,-29.82
2035,-30.27
2036,-30.49
2037,-30.30
2038,-29.72
2039,-28.99
2040,-28.08
2041,-27.16
2042,-26.28
2043,-25.54
2044,-24.87
2045,-24.17
2046,-23.50
2047,-23.04
2048,-22.71
2049,-22.49
2050,-22.25
2051,-22.03
2052,-21.82
2053,-21.58
2054,-21.18
2055,-20.72
2056,-20.32
2057,-20.08
2058,-19.84
2059,-19.65
2060,-19.50
2061,-19.23
2062,-18.71
2063,-18.01
2064,-17.40
2065,-16.91
2066,-16.30
2067,-15.63
2068,-15.01
2069,-14.74
2070,-14.71
2071,-14.77
2072,-14.77
2073,-14.77
2074,-14.74
2075,-14.74
2076,-14.77
2077,-14.80
2078,-14.71
2079,-14.47
2080,-14.13
2081,-13.89
2082,-13.79
2083,-13.82
2084,-13.73
2085,-13.52
2086,-13.12
2087,-12.66
2088,-11.99
2089,-11.05
2090,-9.86
2091,-8.64
2092,-7.66
2093,-7.17
2094,-7.20
2095,-7.72
2096,-8.54
2097,-9.49
2098,-10.41
2099,-11.11
2100,-11.72
2101,-12.18
2102,-12.51
2103,-12.73
2104,-13.03
2105,-13.49
2106,-14.16
2107,-14.89
2108,-15.59
2109,-16.02
2110,-16.30
2111,-16.54
2112,-16.91
2113,-17.36
2114,-17.85
2115,-18.31
2116,-18.92
2117,-19.62
2118,-20.32
2119,-20.81
2120,-21.09
2121,-21.06
2122,-20.78
2123,-20.29
2124,-19.71
2125,-19.26
2126,-18.95
2127,-18.68
2128,-18.40
2129,-18.16
2130,-18.13
2131,-18.37
2132,-18.71
2133,-18.98
2134,-19.17
2135,-19.35
2136,-19.68
2137,-20.17
2138,-20.75
2139,-21.24
2140,-21.58
2141,-21.76
2142,-22.06
2143,-22.52
2144,-23.16
2145,-23.90
2146,-24.69
2147,-25.36
2148,-25.97
2149,-26.40
2150,-26.95
2151,-27.62
2152,-28.63
2153,-29.79
2154,-31.16
2155,-32.56
2156,-34.15
2157,-35.77
2158,-37.57
2159,-39.18
2160,-40.74
2161,-42.14
2162,-43.61
2163,-44.95
2164,-46.39
2165,-47.79
2166,-49.44
2167,-51.03
2168,-52.67
2169,-54.08
2170,-55.51
2171,-56.85
2172,-58.32
2173,-59.72
2174,-61.34
2175,-62.93
2176,-64.64
2177,-66.28
2178,-68.08
2179,-69.70
2180,-71.17
2181,-72.36
2182,-73.49
2183,-74.37
2184,-75.01
2185,-75.23
2186,-75.35
2187,-75.53
2188,-75.93
2189,-76.39
2190,-76.97
2191,-77.67
2192,-78.58
2193,-79.53
2194,-80.44
2195,-81.15
2196,-81.73
2197,-82.18
2198,-82.55
2199,-82.79
2200,-82.92
2201,-82.95
2202,-82.73
2203,-82.24
2204,-81.54
2205,-80.81
2206,-80.23
2207,-79.74
2208,-79.25
2209,-78.80
2210,-78.46
2211,-78.22
2212,-77.85
2213,-77.18
2214,-76.11
2215,-74.89
2216,-73.64
2217,-72.72
2218,-72.17
2219,-71.93
2220,-71.81
2221,-71.87
2222,-72.02
2223,-72.33
2224,-72.33
2225,-71.90
2226,-70.92
2227,-69.70
2228,-68.42
2229,-67.26
2230,-66.13
2231,-65.19
2232,-64.39
2233,-63.72
2234,-62.93
2235,-61.98
2236,-60.82
2237,-59.66
2238,-58.44
2239,-57.28
2240,-56.00
2241,-54.87
2242,-53.77
2243,-52.86
2244,-51.88
2245,-50.93
2246,-50.02
2247,-49.35
2248,-48.74
2249,-48.10
2250,-47.06
2251,-45.87
2252,-44.68
2253,-43.76
2254,-42.88
2255,-41.93
2256,-40.89
2257,-39.95
2258,-39.12
2259,-38.45
2260,-37.66
2261,-36.99
2262,-36.50
2263,-36.22
2264,-36.01
2265,-35.83
2266,-35.71
2267,-35.71
2268,-35.61
2269,-35.40
2270,-35.13
2271,-34.85
2272,-34.58
2273,-34.39
2274,-34.27
2275,-34.24
2276,-34.27
2277,-34.30
2278,-34.33
2279,-34.30
2280,-34.24
2281,-34.24
2282,-34.42
2283,-34.67
2284,-34.73
2285,-34.48
2286,-34.12
2287,-33.87
2288,-33.75
2289,-33.54
2290,-33.08
2291,-32.59
2292,-32.23
2293,-32.01
2294,-31.74
2295,-31.28
2296,-30.64
2297,-30.18
2298,-29.91
2299,-29.69
2300,-29.24
2301,-28.53
2302,-27.74
2303,-27.04
2304,-26.18
2305,-24.99
2306,-23.53
2307,-22.09
2308,-20.87
2309,-19.90
2310,-19.07
2311,-18.40
2312,-17.82
2313,-17.33
2314,-16.82
2315,-16.39
2316,-16.08
2317,-16.05
2318,-16.30
2319,-16.78
2320,-17.61
2321,-18.80
2322,-20.23
2323,-21.70
2324,-23.01
2325,-23.99
2326,-24.48
2327,-24.44
2328,-24.05
2329,-23.53
2330,-23.25
2331,-23.25
2332,-23.47
2333,-23.71
2334,-23.96
2335,-24.20
2336,-24.35
2337,-24.38
2338,-24.11
2339,-23.65
2340,-23.04
2341,-22.31
2342,-21.45
2343,-20.51
2344,-19.53
2345,-18.59
2346,-17.55
2347,-16.63
2348,-15.87
2349,-15.41
2350,-15.08
2351,-14.89
2352,-14.68
2353,-14.43
2354,-14.07
2355,-13.64
2356,-13.03
2357,-12.33
2358,-11.41
2359,-10.47
2360,-9.61
2361,-8.88
2362,-8.18
2363,-7.51
2364,-6.87
2365,-6.38
2366,-5.92
2367,-5.49
2368,-4.97
2369,-4.49
2370,-4.09
2371,-3.81
2372,-3.78
2373,-4.03
2374,-4.61
2375,-5.34
2376,-6.01
2377,-6.47
2378,-6.87
2379,-7.26
2380,-7.97
2381,-8.91
2382,-10.19
2383,-11.60
2384,-13.12
2385,-14.53
2386,-15.93
2387,-17.09
2388,-18.10
2389,-18.98
2390,-20.14
2391,-21.55
2392,-23.25
2393,-24.87
2394,-26.55
2395,-28.17
2396,-29.97
2397,-31.62
2398,-32.99
2399,-33.91
2400,-34.70
2401,-35.58
2402,-36.87
2403,-38.27
2404,-39.83
2405,-41.17
2406,-42.60
2407,-44.01
2408,-45.56
2409,-46.97
2410,-48.19
2411,-49.10
2412,-50.02
2413,-50.90
2414,-51.85
2415,-52.80
2416,-53.99
2417,-55.42
2418,-57.01
2419,-58.38
2420,-59.66
2421,-60.82
2422,-62.10
2423,-63.26
2424,-64.18
2425,-64.64
2426,-64.88
2427,-65.09
2428,-65.37
2429,-65.58
2430,-65.86
2431,-66.28
2432,-67.20
2433,-68.60
2434,-70.47
2435,-72.39
2436,-74.19
2437,-75.59
2438,-76.72
2439,-77.64
2440,-78.58
2441,-79.50
2442,-80.51
2443,-81.45
2444,-82.40
2445,-83.07
2446,-83.53
2447,-83.71
2448,-83.95
2449,-84.14
2450,-84.38
2451,-84.59
2452,-85.05
2453,-85.72
2454,-86.64
2455,-87.62
2456,-88.59
2457,-89.51
2458,-90.48
2459,-91.43
2460,-92.35
2461,-93.05
2462,-93.57
2463,-94.02
2464,-94.60
2465,-95.31
2466,-96.10
2467,-96.83
2468,-97.44
2469,-97.90
2470,-98.27
2471,-98.51
2472,-98.60
2473,-98.60
2474,-98.57
2475,-98.57
2476,-98.57
2477,-98.60
2478,-98.54
2479,-98.30
2480,-97.78
2481,-97.08
2482,-96.31
2483,-95.61
2484,-94.85
2485,-94.15
2486,-93.57
2487,-93.32
2488,-93.38
2489,-93.69
2490,-93.93
2491,-93.96
2492,-93.51
2493,-92.83
2494,-91.98
2495,-91.03
2496,-89.81
2497,-88.38
2498,-86.91
2499,-85.75
2500,-84.75
2501,-83.83
2502,-82.82
2503,-81.88
2504,-81.02
2505,-80.35
2506,-79.65
2507,-79.01
2508,-78.16
2509,-77.24
2510,-75.99
2511,-74.62
2512,-73.03
2513,-71.41
2514,-69.55
2515,-67.69
2516,-65.73
2517,-64.12
2518,-62.68
2519,-61.61
2520,-60.33
2521,-59.02
2522,-57.19
2523,-55.15
2524,-52.43
2525,-49.44
2526,-45.84
2527,-42.11
2528,-37.81
2529,-33.42
2530,-28.53
2531,-23.83
2532,-19.10
2533,-14.92
2534,-10.89
2535,-7.48
2536,-3.97
2537,-0.79
2538,2.62
2539,5.83
2540,9.31
2541,12.51
2542,15.96
2543,19.20
2544,22.67
2545,25.88
2546,29.14
2547,32.17
2548,35.43
2549,38.70
2550,42.14
2551,45.17
2552,47.97
2553,49.99
2554,51.64
2555,52.73
2556,53.86
2557,54.93
2558,56.40
2559,57.95
2560,60.12
2561,62.68
2562,65.86
2563,69.15
2564,72.57
2565,75.59
2566,78.52
2567,81.05
2568,83.59
2569,85.91
2570,88.29
2571,90.36
2572,92.32
2573,93.93
2574,95.52
2575,96.89
2576,98.24
2577,99.40
2578,100.56
2579,101.75
2580,103.00
2581,104.22
2582,105.19
2583,105.71
2584,105.53
2585,104.58
2586,102.84
2587,100.71
2588,98.33
2589,95.98
2590,93.38
2591,90.85
2592,88.23
2593,85.91
2594,83.53
2595,81.24
2596,78.64
2597,76.14
2598,73.27
2599,70.22
2600,66.65
2601,63.17
2602,59.72
2603,56.70
2604,53.53
2605,50.51
2606,47.55
2607,45.26
2608,43.21
2609,41.44
2610,39.31
2611,37.23
2612,35.06
2613,33.26
2614,31.31
2615,29.27
2616,26.73
2617,24.17
2618,21.45
2619,18.89
2620,16.14
2621,13.61
2622,11.17
2623,9.06
2624,6.90
2625,4.85
2626,2.72
2627,0.89
2628,-0.98
2629,-2.81
2630,-4.82
2631,-6.68
2632,-8.54
2633,-10.16
2634,-11.75
2635,-13.09
2636,-14.53
2637,-15.90
2638,-17.55
2639,-19.17
2640,-20.78
2641,-22.19
2642,-23.53
2643,-24.66
2644,-25.73
2645,-26.64
2646,-27.71
2647,-28.87
2648,-30.18
2649,-31.34
2650,-32.44
2651,-33.36
2652,-34.24
2653,-34.94
2654,-35.46
2655,-35.68
2656,-35.80
2657,-35.98
2658,-36.47
2659,-37.17
2660,-38.12
2661,-39.09
2662,-39.89
2663,-40.37
2664,-40.50
2665,-40.25
2666,-39.70
2667,-38.94
2668,-38.18
2669,-37.69
2670,-37.72
2671,-38.21
2672,-38.85
2673,-39.37
2674,-39.64
2675,-39.61
2676,-39.31
2677,-38.82
2678,-38.36
2679,-38.15
2680,-38.12
2681,-38.12
2682,-38.02
2683,-37.81
2684,-37.45
2685,-36.93
2686,-36.35
2687,-35.86
2688,-35.74
2689,-35.95
2690,-36.38
2691,-36.87
2692,-37.45
2693,-38.21
2694,-38.91
2695,-39.12
2696,-38.76
2697,-38.02
2698,-37.35
2699,-36.87
2700,-36.38
2701,-35.92
2702,-35.71
2703,-35.92
2704,-36.44
2705,-36.93
2706,-37.26
2707,-37.51
2708,-37.75
2709,-37.99
2710,-38.12
2711,-38.12
2712,-38.15
2713,-38.36
2714,-38.79
2715,-39.25
2716,-39.76
2717,-40.25
2718,-40.74
2719,-41.20
2720,-41.63
2721,-42.08
2722,-42.76
2723,-43.46
2724,-44.04
2725,-44.53
2726,-45.10
2727,-45.78
2728,-46.54
2729,-47.24
2730,-48.10
2731,-49.04
2732,-49.96
2733,-50.66
2734,-51.30
2735,-51.97
2736,-52.83
2737,-53.56
2738,-53.99
2739,-53.96
2740,-53.68
2741,-53.41
2742,-53.31
2743,-53.31
2744,-53.31
2745,-53.28
2746,-53.44
2747,-53.92
2748,-54.69
2749,-55.42
2750,-55.88
2751,-56.12
2752,-56.37
2753,-56.58
2754,-56.61
2755,-56.40
2756,-56.06
2757,-55.82
2758,-55.63
2759,-55.39
2760,-55.08
2761,-54.84
2762,-54.78
2763,-54.78
2764,-54.69
2765,-54.44
2766,-54.17
2767,-53.96
2768,-53.65
2769,-53.19
2770,-52.52
2771,-51.79
2772,-51.06
2773,-50.35
2774,-49.65
2775,-48.95
2776,-48.19
2777,-47.45
2778,-46.81
2779,-46.39
2780,-46.08
2781,-45.84
2782,-45.50
2783,-45.29
2784,-45.35
2785,-45.59
2786,-45.65
2787,-45.47
2788,-45.10
2789,-44.83
2790,-44.68
2791,-44.46
2792,-44.07
2793,-43.58
2794,-43.12
2795,-42.66
2796,-42.05
2797,-41.35
2798,-40.59
2799,-39.86
2800,-39.12
2801,-38.45
2802,-37.78
2803,-37.05
2804,-36.22
2805,-35.28
2806,-34.24
2807,-33.26
2808,-32.47
2809,-32.01
2810,-31.92
2811,-32.20
2812,-32.53
2813,-32.84
2814,-32.84
2815,-32.59
2816,-32.07
2817,-31.40
2818,-30.52
2819,-29.54
2820,-28.53
2821,-27.62
2822,-26.73
2823,-26.03
2824,-25.39
2825,-24.99
2826,-24.63
2827,-24.14
2828,-23.35
2829,-22.40
2830,-21.51
2831,-20.78
2832,-19.99
2833,-19.10
2834,-18.19
2835,-17.43
2836,-16.78
2837,-16.36
2838,-16.17
2839,-16.17
2840,-16.08
2841,-15.87
2842,-15.56
2843,-15.32
2844,-15.11
2845,-14.86
2846,-14.68
2847,-14.68
2848,-14.86
2849,-15.11
2850,-15.32
2851,-15.53
2852,-15.93
2853,-16.42
2854,-16.85
2855,-17.06
2856,-17.21
2857,-17.43
2858,-17.82
2859,-18.31
2860,-18.83
2861,-19.29
2862,-19.71
2863,-20.20
2864,-20.81
2865,-21.55
2866,-22.25
2867,-22.74
2868,-22.92
2869,-22.92
2870,-22.83
2871,-22.58
2872,-22.06
2873,-21.39
2874,-20.63
2875,-19.90
2876,-19.04
2877,-18.13
2878,-17.21
2879,-16.51
2880,-15.87
2881,-15.17
2882,-14.28
2883,-13.34
2884,-12.39
2885,-11.69
2886,-11.20
2887,-10.99
2888,-10.89
2889,-10.93
2890,-10.93
2891,-10.96
2892,-10.93
2893,-10.89
2894,-10.96
2895,-11.20
2896,-11.75
2897,-12.45
2898,-13.18
2899,-13.92
2900,-14.77
2901,-15.72
2902,-16.57
2903,-17.03
2904,-17.18
2905,-17.15
2906,-17.12
2907,-17.09
2908,-17.18
2909,-17.40
2910,-17.94
2911,-18.86
2912,-20.26
2913,-21.94
2914,-23.71
2915,-25.39
2916,-27.01
2917,-28.38
2918,-29.57
2919,-30.55
2920,-31.43
2921,-32.10
2922,-32.53
2923,-32.75
2924,-33.11
2925,-33.54
2926,-34.00
2927,-34.24
2928,-34.39
2929,-34.58
2930,-34.97
2931,-35.46
2932,-35.95
2933,-36.16
2934,-36.13
2935,-35.89
2936,-35.58
2937,-35.28
2938,-35.22
2939,-35.46
2940,-36.10
2941,-37.08
2942,-38.18
2943,-39.12
2944,-39.83
2945,-40.31
2946,-40.68
2947,-40.86
2948,-40.92
2949,-40.95
2950,-41.05
2951,-41.26
2952,-41.53
2953,-41.81
2954,-42.08
2955,-42.30
2956,-42.36
2957,-42.39
2958,-42.54
2959,-42.79
2960,-42.82
2961,-42.60
2962,-42.27
2963,-42.02
2964,-41.72
2965,-41.26
2966,-40.65
2967,-39.92
2968,-39.06
2969,-38.12
2970,-37.08
2971,-36.16
2972,-35.34
2973,-34.61
2974,-33.91
2975,-33.48
2976,-33.42
2977,-33.63
2978,-33.75
2979,-33.84
2980,-33.97
2981,-34.15
2982,-34.21
2983,-34.00
2984,-33.72
2985,-33.45
2986,-33.11
2987,-32.65
2988,-32.17
2989,-31.89
2990,-31.95
2991,-32.23
2992,-32.53
2993,-32.75
2994,-32.90
2995,-33.17
2996,-33.63
2997,-34.09
2998,-34.33
2999,-34.33
3000,-34.36
3001,-34.55
3002,-34.88
3003,-35.13
3004,-35.37
3005,-35.58
3006,-35.86
3007,-36.07
3008,-36.29
3009,-36.50
3010,-36.87
3011,-37.35
3012,-37.93
3013,-38.36
3014,-38.67
3015,-38.91
3016,-39.28
3017,-39.76
3018,-40.16
3019,-40.37
3020,-40.65
3021,-41.11
3022,-41.81
3023,-42.54
3024,-43.12
3025,-43.61
3026,-44.10
3027,-44.56
3028,-44.83
3029,-44.83
3030,-44.74
3031,-44.71
3032,-44.80
3033,-45.04
3034,-45.53
3035,-46.23
3036,-47.09
3037,-47.79
3038,-48.31
3039,-48.55
3040,-48.58
3041,-48.31
3042,-47.76
3043,-47.03
3044,-46.36
3045,-45.87
3046,-45.53
3047,-45.32
3048,-45.23
3049,-45.20
3050,-45.23
3051,-45.26
3052,-45.26
3053,-45.26
3054,-45.20
3055,-45.20
3056,-45.41
3057,-45.87
3058,-46.51
3059,-47.24
3060,-48.03
3061,-48.74
3062,-49.29
3063,-49.50
3064,-49.47
3065,-49.19
3066,-48.89
3067,-48.65
3068,-48.49
3069,-48.49
3070,-48.74
3071,-49.19
3072,-49.87
3073,-50.60
3074,-51.33
3075,-52.06
3076,-52.70
3077,-53.19
3078,-53.41
3079,-53.41
3080,-53.25
3081,-53.01
3082,-52.67
3083,-52.19
3084,-51.61
3085,-51.12
3086,-50.87
3087,-50.87
3088,-50.99
3089,-51.24
3090,-51.64
3091,-52.09
3092,-52.58
3093,-53.07
3094,-53.65
3095,-54.35
3096,-55.15
3097,-55.85
3098,-56.55
3099,-57.22
3100,-58.01
3101,-58.72
3102,-59.27
3103,-59.72
3104,-60.36
3105,-61.04
3106,-61.71
3107,-62.16
3108,-62.65
3109,-63.35
3110,-64.30
3111,-65.28
3112,-66.10
3113,-66.80
3114,-67.54
3115,-68.21
3116,-68.85
3117,-69.31
3118,-69.76
3119,-70.22
3120,-70.71
3121,-71.20
3122,-71.72
3123,-72.14
3124,-72.57
3125,-73.03
3126,-73.76
3127,-74.71
3128,-75.78
3129,-76.72
3130,-77.58
3131,-78.28
3132,-78.80
3133,-79.04
3134,-79.01
3135,-78.74
3136,-78.40
3137,-78.13
3138,-78.16
3139,-78.37
3140,-78.77
3141,-79.25
3142,-79.80
3143,-80.29
3144,-80.57
3145,-80.54
3146,-80.41
3147,-80.38
3148,-80.63
3149,-81.09
3150,-81.76
3151,-82.49
3152,-83.22
3153,-83.68
3154,-83.80
3155,-83.53
3156,-83.16
3157,-82.89
3158,-82.92
3159,-83.13
3160,-83.53
3161,-84.05
3162,-84.59
3163,-85.05
3164,-85.27
3165,-85.27
3166,-85.27
3167,-85.24
3168,-85.11
3169,-84.87
3170,-84.81
3171,-84.99
3172,-85.42
3173,-85.94
3174,-86.46
3175,-86.91
3176,-87.31
3177,-87.83
3178,-88.50
3179,-89.20
3180,-89.72
3181,-89.97
3182,-90.12
3183,-90.33
3184,-90.61
3185,-90.85
3186,-91.09
3187,-91.31
3188,-91.55
3189,-91.80
3190,-92.07
3191,-92.35
3192,-92.38
3193,-92.16
3194,-91.64
3195,-90.97
3196,-90.00
3197,-88.81
3198,-87.37
3199,-85.97
3200,-84.56
3201,-83.19
3202,-81.51
3203,-79.65
3204,-77.58
3205,-75.68
3206,-73.88
3207,-72.30
3208,-70.59
3209,-68.97
3210,-67.26
3211,-65.64
3212,-63.84
3213,-62.01
3214,-59.91
3215,-57.77
3216,-55.51
3217,-53.44
3218,-51.36
3219,-49.50
3220,-47.64
3221,-46.05
3222,-44.53
3223,-43.09
3224,-41.53
3225,-40.16
3226,-39.03
3227,-38.33
3228,-37.75
3229,-37.32
3230,-37.05
3231,-37.08
3232,-37.08
3233,-36.87
3234,-36.38
3235,-35.89
3236,-35.64
3237,-35.64
3238,-35.71
3239,-35.71
3240,-35.86
3241,-36.29
3242,-37.05
3243,-38.02
3244,-39.15
3245,-40.31
3246,-41.56
3247,-42.76
3248,-43.91
3249,-44.86
3250,-45.59
3251,-46.05
3252,-46.36
3253,-46.57
3254,-46.72
3255,-46.72
3256,-46.60
3257,-46.33
3258,-46.05
3259,-45.81
3260,-45.65
3261,-45.41
3262,-44.98
3263,-44.49
3264,-44.16
3265,-43.91
3266,-43.61
3267,-43.12
3268,-42.63
3269,-42.39
3270,-42.42
3271,-42.69
3272,-43.06
3273,-43.52
3274,-44.13
3275,-44.89
3276,-45.59
3277,-46.05
3278,-46.26
3279,-46.51
3280,-46.91
3281,-47.39
3282,-47.76
3283,-48.03
3284,-48.28
3285,-48.52
3286,-48.49
3287,-48.07
3288,-47.21
3289,-46.23
3290,-45.23
3291,-44.31
3292,-43.33
3293,-42.42
3294,-41.41
3295,-40.22
3296,-38.60
3297,-36.77
3298,-34.82
3299,-32.87
3300,-30.79
3301,-28.96
3302,-27.53
3303,-26.55
3304,-25.63
3305,-24.78
3306,-23.99
3307,-23.50
3308,-23.01
3309,-22.61
3310,-22.31
3311,-22.31
3312,-22.37
3313,-22.46
3314,-22.37
3315,-22.09
3316,-21.58
3317,-20.87
3318,-20.11
3319,-19.41
3320,-18.65
3321,-17.91
3322,-17.43
3323,-17.43
3324,-17.88
3325,-18.65
3326,-19.44
3327,-20.14
3328,-20.72
3329,-21.24
3330,-21.64
3331,-21.85
3332,-21.88
3333,-21.88
3334,-22.00
3335,-22.22
3336,-22.52
3337,-22.74
3338,-22.95
3339,-23.16
3340,-23.50
3341,-23.96
3342,-24.63
3343,-25.36
3344,-26.00
3345,-26.46
3346,-26.89
3347,-27.31
3348,-27.92
3349,-28.66
3350,-29.48
3351,-30.15
3352,-30.70
3353,-31.16
3354,-31.80
3355,-32.44
3356,-33.17
3357,-33.87
3358,-34.85
3359,-36.01
3360,-37.23
3361,-38.18
3362,-38.97
3363,-39.64
3364,-40.34
3365,-41.08
3366,-41.84
3367,-42.51
3368,-43.18
3369,-43.91
3370,-44.74
3371,-45.44
3372,-45.84
3373,-45.84
3374,-45.62
3375,-45.35
3376,-45.14
3377,-44.89
3378,-44.65
3379,-44.37
3380,-44.16
3381,-44.16
3382,-44.49
3383,-45.20
3384,-46.20
3385,-47.42
3386,-48.83
3387,-50.26
3388,-51.54
3389,-52.49
3390,-53.22
3391,-53.68
3392,-53.89
3393,-53.89
3394,-53.83
3395,-53.80
3396,-53.86
3397,-53.83
3398,-53.83
3399,-53.83
3400,-53.86
3401,-53.86
3402,-53.74
3403,-53.50
3404,-53.19
3405,-52.95
3406,-52.73
3407,-52.52
3408,-52.28
3409,-52.00
3410,-51.79
3411,-51.79
3412,-52.09
3413,-52.58
3414,-53.07
3415,-53.31
3416,-53.31
3417,-53.31
3418,-53.47
3419,-53.71
3420,-53.86
3421,-53.86
3422,-53.86
3423,-53.86
3424,-53.71
3425,-53.22
3426,-52.43
3427,-51.45
3428,-50.48
3429,-49.50
3430,-48.49
3431,-47.58
3432,-46.84
3433,-46.33
3434,-45.99
3435,-45.78
3436,-45.72
3437,-45.72
3438,-45.59
3439,-45.38
3440,-45.20
3441,-45.20
3442,-45.26
3443,-45.29
3444,-45.23
3445,-45.23
3446,-45.26
3447,-45.29
3448,-45.17
3449,-44.92
3450,-44.62
3451,-44.37
3452,-44.19
3453,-43.98
3454,-43.58
3455,-43.09
3456,-42.72
3457,-42.45
3458,-42.21
3459,-41.99
3460,-41.87
3461,-41.84
3462,-41.87
3463,-41.87
3464,-41.93
3465,-42.18
3466,-42.60
3467,-43.06
3468,-43.55
3469,-44.04
3470,-44.53
3471,-45.01
3472,-45.44
3473,-45.68
3474,-45.68
3475,-45.41
3476,-45.01
3477,-44.77
3478,-44.92
3479,-45.38
3480,-45.93
3481,-46.42
3482,-46.97
3483,-47.67
3484,-48.46
3485,-49.22
3486,-49.84
3487,-50.26
3488,-50.63
3489,-50.87
3490,-51.03
3491,-51.03
3492,-50.84
3493,-50.57
3494,-50.38
3495,-50.38
3496,-50.60
3497,-50.84
3498,-51.06
3499,-51.27
3500,-51.64
3501,-52.12
3502,-52.64
3503,-53.13
3504,-53.59
3505,-54.08
3506,-54.50
3507,-54.78
3508,-54.72
3509,-54.26
3510,-53.34
3511,-52.15
3512,-50.66
3513,-49.01
3514,-47.18
3515,-45.53
3516,-44.13
3517,-43.24
3518,-42.54
3519,-41.90
3520,-40.89
3521,-39.76
3522,-38.36
3523,-36.96
3524,-35.37
3525,-33.75
3526,-31.98
3527,-30.36
3528,-28.75
3529,-27.10
3530,-25.18
3531,-23.35
3532,-21.58
3533,-19.90
3534,-18.01
3535,-16.17
3536,-14.53
3537,-13.34
3538,-12.30
3539,-11.41
3540,-10.59
3541,-10.13
3542,-9.80
3543,-9.64
3544,-9.46
3545,-9.22
3546,-8.73
3547,-8.09
3548,-7.14
3549,-5.89
3550,-4.39
3551,-2.96
3552,-2.04
3553,-1.74
3554,-2.04
3555,-2.78
3556,-4.03
3557,-5.71
3558,-7.57
3559,-9.25
3560,-10.65
3561,-11.81
3562,-12.94
3563,-13.85
3564,-14.65
3565,-15.32
3566,-16.17
3567,-17.12
3568,-18.07
3569,-18.74
3570,-19.38
3571,-20.02
3572,-20.94
3573,-21.85
3574,-22.89
3575,-24.05
3576,-25.63
3577,-27.50
3578,-29.66
3579,-31.80
3580,-33.94
3581,-35.80
3582,-37.45
3583,-38.57
3584,-39.49
3585,-40.13
3586,-40.83
3587,-41.53
3588,-42.30
3589,-42.97
3590,-43.64
3591,-44.34
3592,-45.26
3593,-46.17
3594,-47.03
3595,-47.73
3596,-48.55
3597,-49.50
3598,-50.51
3599,-51.18
3600,-51.57
3601,-51.79
3602,-52.12
3603,-52.37
3604,-52.28
3605,-51.79
3606,-51.15
3607,-50.63
3608,-50.32
3609,-50.14
3610,-49.93
3611,-49.68
3612,-49.38
3613,-49.16
3614,-48.95
3615,-48.77
3616,-48.31
3617,-47.61
3618,-46.66
3619,-45.72
3620,-44.80
3621,-43.85
3622,-42.72
3623,-41.56
3624,-40.41
3625,-39.46
3626,-38.60
3627,-37.93
3628,-37.41
3629,-37.17
3630,-37.08
3631,-37.11
3632,-37.17
3633,-37.20
3634,-36.96
3635,-36.53
3636,-35.86
3637,-35.13
3638,-34.30
3639,-33.63
3640,-33.20
3641,-32.96
3642,-32.65
3643,-32.20
3644,-31.65
3645,-31.16
3646,-30.76
3647,-30.27
3648,-29.60
3649,-28.90
3650,-28.38
3651,-28.17
3652,-27.95
3653,-27.74
3654,-27.53
3655,-27.53
3656,-27.74
3657,-27.98
3658,-28.11
3659,-28.14
3660,-28.11
3661,-28.11
3662,-28.02
3663,-27.77
3664,-27.47
3665,-27.25
3666,-27.04
3667,-26.79
3668,-26.49
3669,-26.28
3670,-26.18
3671,-26.21
3672,-26.12
3673,-25.88
3674,-25.57
3675,-25.30
3676,-25.18
3677,-25.15
3678,-25.33
3679,-25.82
3680,-26.67
3681,-27.65
3682,-28.44
3683,-28.90
3684,-29.21
3685,-29.42
3686,-29.57
3687,-29.60
3688,-29.45
3689,-29.17
3690,-28.90
3691,-28.66
3692,-28.56
3693,-28.56
3694,-28.63
3695,-28.59
3696,-28.53
3697,-28.53
3698,-28.69
3699,-28.93
3700,-29.05
3701,-28.84
3702,-28.29
3703,-27.50
3704,-26.76
3705,-26.31
3706,-26.21
3707,-26.43
3708,-26.82
3709,-27.34
3710,-27.98
3711,-28.66
3712,-29.30
3713,-29.79
3714,-30.27
3715,-30.70
3716,-31.07
3717,-31.31
3718,-31.59
3719,-31.77
3720,-31.89
3721,-31.89
3722,-32.04
3723,-32.44
3724,-33.26
3725,-34.42
3726,-36.19
3727,-38.30
3728,-40.65
3729,-42.79
3730,-44.74
3731,-46.36
3732,-47.88
3733,-49.26
3734,-50.78
3735,-52.40
3736,-54.35
3737,-56.43
3738,-58.81
3739,-61.16
3740,-63.57
3741,-65.67
3742,-67.57
3743,-68.94
3744,-70.01
3745,-70.65
3746,-71.23
3747,-71.87
3748,-73.00
3749,-74.40
3750,-76.08
3751,-77.73
3752,-79.44
3753,-81.02
3754,-82.73
3755,-84.35
3756,-86.18
3757,-88.01
3758,-90.06
3759,-92.16
3760,-94.54
3761,-96.86
3762,-99.18
3763,-101.04
3764,-102.69
3765,-104.00
3766,-105.53
3767,-107.12
3768,-109.16
3769,-111.45
3770,-114.35
3771,-117.40
3772,-120.70
3773,-123.75
3774,-126.68
3775,-129.27
3776,-131.65
3777,-133.48
3778,-134.95
3779,-136.08
3780,-137.39
3781,-138.76
3782,-140.26
3783,-141.39
3784,-142.40
3785,-143.31
3786,-144.41
3787,-145.29
3788,-146.00
3789,-146.45
3790,-147.06
3791,-147.74
3792,-148.35
3793,-148.83
3794,-149.44
3795,-150.36
3796,-151.52
3797,-152.53
3798,-153.14
3799,-153.35
3800,-153.32
3801,-153.08
3802,-152.59
3803,-151.86
3804,-151.06
3805,-150.30
3806,-149.69
3807,-149.23
3808,-148.99
3809,-148.99
3810,-149.14
3811,-149.38
3812,-149.66
3813,-149.90
3814,-150.02
3815,-150.05
3816,-149.96
3817,-149.72
3818,-149.23
3819,-148.53
3820,-147.74
3821,-147.00
3822,-146.36
3823,-145.94
3824,-145.63
3825,-145.39
3826,-144.99
3827,-144.56
3828,-144.10
3829,-143.65
3830,-142.91
3831,-142.00
3832,-140.93
3833,-140.01
3834,-139.04
3835,-138.15
3836,-137.18
3837,-136.26
3838,-135.13
3839,-134.03
3840,-132.72
3841,-131.35
3842,-129.49
3843,-127.17
3844,-124.21
3845,-121.15
3846,-117.98
3847,-115.23
3848,-112.49
3849,-109.95
3850,-107.18
3851,-104.68
3852,-102.14
3853,-99.85
3854,-97.11
3855,-94.15
3856,-90.64
3857,-87.13
3858,-83.19
3859,-79.25
3860,-75.07
3861,-71.32
3862,-67.75
3863,-64.76
3864,-61.98
3865,-59.72
3866,-57.43
3867,-55.42
3868,-53.10
3869,-50.81
3870,-48.16
3871,-45.62
3872,-42.94
3873,-40.65
3874,-38.42
3875,-36.65
3876,-34.85
3877,-33.26
3878,-31.43
3879,-29.66
3880,-27.50
3881,-25.18
3882,-22.37
3883,-19.56
3884,-16.72
3885,-14.16
3886,-11.51
3887,-8.94
3888,-6.38
3889,-4.30
3890,-2.44
3891,-0.89
3892,0.89
3893,2.69
3894,4.82
3895,6.93
3896,9.22
3897,11.23
3898,13.31
3899,15.17
3900,17.18
3901,18.98
3902,20.75
3903,22.37
3904,24.41
3905,26.70
3906,29.33
3907,31.95
3908,34.79
3909,37.63
3910,40.25
3911,42.18
3912,43.33
3913,43.76
3914,43.73
3915,43.21
3916,42.33
3917,41.11
3918,39.86
3919,38.85
3920,38.24
3921,38.02
3922,38.15
3923,38.39
3924,38.54
3925,38.57
3926,38.45
3927,38.21
3928,37.78
3929,37.32
3930,36.90
3931,36.65
3932,36.56
3933,36.59
3934,36.68
3935,36.96
3936,37.23
3937,37.51
3938,37.60
3939,37.66
3940,37.48
3941,37.05
3942,36.07
3943,34.67
3944,32.84
3945,30.94
3946,28.93
3947,27.10
3948,25.27
3949,23.65
3950,21.91
3951,20.32
3952,18.65
3953,17.06
3954,15.14
3955,13.06
3956,10.65
3957,8.33
3958,5.86
3959,3.54
3960,1.13
3961,-1.19
3962,-3.63
3963,-5.98
3964,-8.33
3965,-10.44
3966,-12.39
3967,-14.01
3968,-15.50
3969,-16.63
3970,-17.61
3971,-18.28
3972,-18.89
3973,-19.29
3974,-19.74
3975,-20.20
3976,-20.84
3977,-21.55
3978,-22.22
3979,-22.67
3980,-23.04
3981,-23.25
3982,-23.38
3983,-23.38
3984,-23.35
3985,-23.35
3986,-23.32
3987,-23.07
3988,-22.55
3989,-21.88
3990,-21.03
3991,-20.05
3992,-18.92
3993,-17.73
3994,-16.66
3995,-15.93
3996,-15.50
3997,-15.32
3998,-15.23
3999,-15.23
4000,-15.20
4001,-14.98
4002,-14.40
4003,-13.46
4004,-12.21
4005,-11.02
4006,-10.07
4007,-9.61
4008,-9.52
4009,-9.77
4010,-10.31
4011,-11.05
4012,-11.78
4013,-12.30
4014,-12.36
4015,-11.87
4016,-10.86
4017,-9.67
4018,-8.54
4019,-7.57
4020,-6.71
4021,-5.98
4022,-5.58
4023,-5.58
4024,-5.86
4025,-6.10
4026,-6.16
4027,-6.16
4028,-6.26
4029,-6.50
4030,-6.77
4031,-7.02
4032,-7.35
4033,-7.81
4034,-8.39
4035,-8.85
4036,-9.19
4037,-9.43
4038,-9.70
4039,-9.92
4040,-9.95
4041,-9.98
4042,-10.19
4043,-10.62
4044,-11.17
4045,-11.66
4046,-12.27
4047,-12.94
4048,-13.61
4049,-14.13
4050,-14.47
4051,-14.65
4052,-14.83
4053,-15.08
4054,-15.50
4055,-15.93
4056,-16.39
4057,-16.88
4058,-17.52
4059,-18.19
4060,-18.83
4061,-19.29
4062,-19.84
4063,-20.51
4064,-21.33
4065,-22.03
4066,-22.74
4067,-23.41
4068,-24.29
4069,-25.21
4070,-26.18
4071,-27.13
4072,-28.14
4073,-29.05
4074,-29.94
4075,-30.67
4076,-31.28
4077,-31.74
4078,-32.07
4079,-32.26
4080,-32.53
4081,-33.02
4082,-33.75
4083,-34.42
4084,-34.94
4085,-35.16
4086,-35.37
4087,-35.55
4088,-35.80
4089,-36.01
4090,-36.44
4091,-37.11
4092,-38.15
4093,-39.34
4094,-40.71
4095,-42.11
4096,-43.61
4097,-45.01
4098,-46.36
4099,-47.52
4100,-48.65
4101,-49.59
4102,-50.42
4103,-50.87
4104,-50.96
4105,-50.66
4106,-50.29
4107,-50.05
4108,-50.05
4109,-50.23
4110,-50.72
4111,-51.42
4112,-52.49
4113,-53.65
4114,-54.81
4115,-55.79
4116,-56.67
4117,-57.31
4118,-57.74
4119,-57.98
4120,-58.35
4121,-59.02
4122,-60.03
4123,-61.25
4124,-62.68
4125,-64.06
4126,-65.31
4127,-66.25
4128,-67.14
4129,-67.81
4130,-68.30
4131,-68.48
4132,-68.73
4133,-69.15
4134,-69.95
4135,-70.89
4136,-71.96
4137,-73.15
4138,-74.58
4139,-75.96
4140,-77.21
4141,-78.19
4142,-79.04
4143,-79.71
4144,-80.17
4145,-80.38
4146,-80.69
4147,-81.12
4148,-81.67
4149,-82.15
4150,-82.67
4151,-83.13
4152,-83.50
4153,-83.47
4154,-83.13
4155,-82.64
4156,-82.21
4157,-81.97
4158,-81.82
4159,-81.82
4160,-82.06
4161,-82.55
4162,-83.13
4163,-83.62
4164,-83.92
4165,-84.17
4166,-84.44
4167,-84.66
4168,-84.84
4169,-85.05
4170,-85.54
4171,-86.30
4172,-86.98
4173,-87.22
4174,-87.01
4175,-86.49
4176,-85.88
4177,-85.17
4178,-84.29
4179,-83.34
4180,-82.49
4181,-82.00
4182,-81.82
4183,-81.88
4184,-81.97
4185,-81.97
4186,-81.73
4187,-81.27
4188,-80.66
4189,-79.93
4190,-79.04
4191,-78.13
4192,-77.24
4193,-76.51
4194,-75.87
4195,-75.44
4196,-75.20
4197,-75.23
4198,-75.20
4199,-75.01
4200,-74.52
4201,-73.79
4202,-72.75
4203,-71.59
4204,-70.34
4205,-69.18
4206,-67.93
4207,-66.74
4208,-65.70
4209,-65.03
4210,-64.51
4211,-64.09
4212,-63.45
4213,-62.74
4214,-62.04
4215,-61.37
4216,-60.46
4217,-59.27
4218,-57.92
4219,-56.70
4220,-55.76
4221,-55.05
4222,-54.47
4223,-54.02
4224,-53.68
4225,-53.44
4226,-53.16
4227,-52.98
4228,-52.80
4229,-52.52
4230,-52.09
4231,-51.64
4232,-51.36
4233,-51.33
4234,-51.39
4235,-51.42
4236,-51.51
4237,-51.73
4238,-52.00
4239,-52.28
4240,-52.55
4241,-53.04
4242,-53.68
4243,-54.17
4244,-54.26
4245,-54.05
4246,-53.65
4247,-53.16
4248,-52.43
4249,-51.51
4250,-50.48
4251,-49.47
4252,-48.58
4253,-47.91
4254,-47.42
4255,-46.94
4256,-46.20
4257,-45.26
4258,-44.34
4259,-43.85
4260,-43.82
4261,-44.07
4262,-44.46
4263,-44.98
4264,-45.53
4265,-46.02
4266,-46.23
4267,-46.23
4268,-46.20
4269,-46.17
4270,-46.14
4271,-46.14
4272,-46.33
4273,-46.78
4274,-47.55
4275,-48.52
4276,-49.56
4277,-50.54
4278,-51.33
4279,-51.79
4280,-51.94
4281,-51.94
4282,-51.91
4283,-51.91
4284,-51.88
4285,-51.91
4286,-52.03
4287,-52.28
4288,-52.43
4289,-52.49
4290,-52.37
4291,-52.15
4292,-51.57
4293,-50.66
4294,-49.38
4295,-47.91
4296,-46.33
4297,-44.71
4298,-42.91
4299,-41.02
4300,-38.94
4301,-37.05
4302,-35.40
4303,-34.27
4304,-33.36
4305,-32.68
4306,-32.04
4307,-31.59
4308,-31.25
4309,-31.07
4310,-30.79
4311,-30.58
4312,-30.43
4313,-30.43
4314,-30.49
4315,-30.49
4316,-30.43
4317,-30.43
4318,-30.58
4319,-30.85
4320,-31.04
4321,-31.01
4322,-30.88
4323,-30.88
4324,-31.19
4325,-31.65
4326,-32.04
4327,-32.32
4328,-32.53
4329,-32.75
4330,-32.87
4331,-32.87
4332,-32.93
4333,-33.17
4334,-33.51
4335,-33.78
4336,-33.78
4337,-33.54
4338,-33.14
4339,-32.65
4340,-32.01
4341,-31.34
4342,-30.67
4343,-30.15
4344,-29.85
4345,-29.88
4346,-30.21
4347,-30.73
4348,-31.10
4349,-31.10
4350,-30.76
4351,-30.27
4352,-29.72
4353,-29.24
4354,-28.84
4355,-28.63
4356,-28.66
4357,-28.87
4358,-29.14
4359,-29.42
4360,-29.69
4361,-29.91
4362,-29.91
4363,-29.69
4364,-29.42
4365,-29.39
4366,-29.69
4367,-30.21
4368,-30.76
4369,-31.22
4370,-31.56
4371,-31.80
4372,-32.04
4373,-32.26
4374,-32.41
4375,-32.41
4376,-32.35
4377,-32.32
4378,-32.41
4379,-32.62
4380,-33.14
4381,-33.87
4382,-34.67
4383,-35.37
4384,-36.04
4385,-36.71
4386,-37.60
4387,-38.54
4388,-39.55
4389,-40.47
4390,-41.44
4391,-42.39
4392,-43.33
4393,-44.01
4394,-44.46
4395,-44.68
4396,-44.89
4397,-45.10
4398,-45.41
4399,-45.62
4400,-45.78
4401,-45.75
4402,-45.62
4403,-45.38
4404,-45.14
4405,-44.89
4406,-44.62
4407,-44.34
4408,-44.25
4409,-44.49
4410,-45.07
4411,-45.81
4412,-46.51
4413,-47.00
4414,-47.24
4415,-47.21
4416,-47.00
4417,-46.75
4418,-46.63
4419,-46.60
4420,-46.63
4421,-46.91
4422,-47.58
4423,-48.49
4424,-49.44
4425,-50.17
4426,-50.84
4427,-51.54
4428,-52.19
4429,-52.67
4430,-53.07
4431,-53.53
4432,-54.17
4433,-54.90
4434,-55.57
4435,-56.03
4436,-56.37
4437,-56.58
4438,-56.76
4439,-56.76
4440,-56.49
4441,-55.97
4442,-55.51
4443,-55.27
4444,-55.24
4445,-55.24
4446,-55.18
4447,-55.21
4448,-55.36
4449,-55.57
4450,-55.73
4451,-55.76
4452,-55.79
4453,-55.73
4454,-55.54
4455,-55.33
4456,-55.30
4457,-55.51
4458,-55.82
4459,-56.09
4460,-56.43
4461,-56.85
4462,-57.40
4463,-57.89
4464,-58.32
4465,-58.53
4466,-58.53
4467,-58.32
4468,-57.89
4469,-57.40
4470,-56.88
4471,-56.43
4472,-56.06
4473,-55.82
4474,-55.60
4475,-55.63
4476,-55.94
4477,-56.43
4478,-56.79
4479,-56.82
4480,-56.49
4481,-56.00
4482,-55.45
4483,-54.75
4484,-53.74
4485,-52.55
4486,-51.27
4487,-50.11
4488,-48.92
4489,-47.76
4490,-46.51
4491,-45.29
4492,-44.25
4493,-43.55
4494,-43.12
4495,-42.91
4496,-42.79
4497,-42.82
4498,-42.97
4499,-43.21
4500,-43.37
4501,-43.37
4502,-43.27
4503,-43.27
4504,-43.43
4505,-43.67
4506,-43.91
4507,-44.16
4508,-44.40
4509,-44.65
4510,-44.83
4511,-44.83
4512,-44.65
4513,-44.37
4514,-44.19
4515,-44.16
4516,-44.40
4517,-44.92
4518,-45.62
4519,-46.30
4520,-46.91
4521,-47.39
4522,-47.91
4523,-48.34
4524,-48.71
4525,-48.92
4526,-49.22
4527,-49.68
4528,-50.35
4529,-51.06
4530,-51.76
4531,-52.49
4532,-53.28
4533,-53.99
4534,-54.44
4535,-54.72
4536,-54.96
4537,-55.15
4538,-55.11
4539,-54.93
4540,-54.78
4541,-54.75
4542,-54.66
4543,-54.44
4544,-54.26
4545,-54.20
4546,-54.29
4547,-54.32
4548,-54.26
4549,-53.99
4550,-53.53
4551,-53.07
4552,-52.76
4553,-52.73
4554,-52.95
4555,-53.47
4556,-54.35
4557,-55.54
4558,-56.76
4559,-57.74
4560,-58.41
4561,-58.90
4562,-59.17
4563,-59.17
4564,-58.81
4565,-58.35
4566,-58.01
4567,-57.74
4568,-57.37
4569,-56.95
4570,-56.55
4571,-56.30
4572,-56.03
4573,-55.60
4574,-54.90
4575,-54.20
4576,-53.44
4577,-52.76
4578,-52.06
4579,-51.36
4580,-50.51
4581,-49.59
4582,-48.46
4583,-47.06
4584,-45.20
4585,-43.06
4586,-40.74
4587,-38.60
4588,-36.68
4589,-35.22
4590,-34.39
4591,-34.45
4592,-35.16
4593,-36.16
4594,-37.02
4595,-37.78
4596,-38.51
4597,-39.22
4598,-39.58
4599,-39.61
4600,-39.49
4601,-39.46
4602,-39.52
4603,-39.58
4604,-39.49
4605,-39.22
4606,-38.85
4607,-38.36
4608,-37.87
4609,-37.38
4610,-36.87
4611,-36.41
4612,-35.98
4613,-35.77
4614,-35.74
4615,-35.74
4616,-35.64
4617,-35.40
4618,-35.10
4619,-34.85
4620,-34.61
4621,-34.39
4622,-34.24
4623,-34.24
4624,-34.36
4625,-34.36
4626,-34.09
4627,-33.63
4628,-33.14
4629,-32.62
4630,-31.98
4631,-31.31
4632,-30.76
4633,-30.49
4634,-30.43
4635,-30.43
4636,-30.55
4637,-30.76
4638,-31.13
4639,-31.59
4640,-32.23
4641,-32.93
4642,-33.69
4643,-34.33
4644,-35.13
4645,-36.04
4646,-37.32
4647,-38.70
4648,-40.25
4649,-41.90
4650,-43.91
4651,-45.99
4652,-48.19
4653,-50.26
4654,-52.67
4655,-55.24
4656,-58.04
4657,-60.61
4658,-63.17
4659,-65.73
4660,-68.66
4661,-71.47
4662,-74.10
4663,-76.17
4664,-78.25
4665,-80.29
4666,-82.49
4667,-84.35
4668,-86.12
4669,-87.71
4670,-89.45
4671,-91.13
4672,-92.68
4673,-93.84
4674,-94.73
4675,-95.37
4676,-96.13
4677,-96.80
4678,-97.41
4679,-97.90
4680,-98.36
4681,-98.82
4682,-99.24
4683,-99.49
4684,-99.55
4685,-99.27
4686,-98.75
4687,-97.99
4688,-97.29
4689,-96.80
4690,-96.65
4691,-96.65
4692,-96.65
4693,-96.65
4694,-96.80
4695,-97.02
4696,-97.14
4697,-97.20
4698,-97.17
4699,-97.14
4700,-97.02
4701,-96.83
4702,-96.59
4703,-96.34
4704,-95.95
4705,-95.49
4706,-95.09
4707,-94.82
4708,-94.64
4709,-94.45
4710,-94.18
4711,-93.90
4712,-93.72
4713,-93.75
4714,-93.96
4715,-94.21
4716,-94.27
4717,-94.30
4718,-94.45
4719,-94.67
4720,-94.67
4721,-94.48
4722,-94.24
4723,-93.96
4724,-93.51
4725,-92.83
4726,-92.01
4727,-91.25
4728,-90.58
4729,-90.15
4730,-90.00
4731,-90.00
4732,-89.84
4733,-89.42
4734,-88.75
4735,-88.01
4736,-87.13
4737,-86.21
4738,-85.33
4739,-84.63
4740,-83.92
4741,-83.25
4742,-82.49
4743,-81.82
4744,-80.99
4745,-80.11
4746,-78.89
4747,-77.51
4748,-75.74
4749,-73.85
4750,-71.87
4751,-70.22
4752,-68.94
4753,-68.05
4754,-67.14
4755,-66.25
4756,-65.22
4757,-64.30
4758,-63.26
4759,-62.13
4760,-60.64
4761,-59.02
4762,-57.19
4763,-55.57
4764,-54.02
4765,-52.64
4766,-51.18
4767,-49.77
4768,-48.28
4769,-46.91
4770,-45.47
4771,-44.10
4772,-42.48
4773,-40.89
4774,-39.15
4775,-37.51
4776,-35.80
4777,-34.18
4778,-32.53
4779,-31.16
4780,-29.82
4781,-28.69
4782,-27.47
4783,-26.34
4784,-25.05
4785,-23.62
4786,-21.94
4787,-20.29
4788,-18.80
4789,-17.61
4790,-16.60
4791,-15.90
4792,-15.66
4793,-15.90
4794,-16.45
4795,-17.21
4796,-18.10
4797,-19.01
4798,-19.93
4799,-20.66
4800,-21.24
4801,-21.70
4802,-22.06
4803,-22.28
4804,-22.49
4805,-22.67
4806,-23.01
4807,-23.50
4808,-24.20
4809,-24.87
4810,-25.51
4811,-26.21
4812,-27.22
4813,-28.38
4814,-29.60
4815,-30.58
4816,-31.34
4817,-32.01
4818,-32.68
4819,-33.17
4820,-33.45
4821,-33.39
4822,-33.33
4823,-33.54
4824,-34.24
4825,-35.19
4826,-36.19
4827,-37.17
4828,-38.18
4829,-39.09
4830,-39.76
4831,-40.01
4832,-40.01
4833,-39.98
4834,-40.04
4835,-40.01
4836,-39.95
4837,-39.95
4838,-40.16
4839,-40.41
4840,-40.47
4841,-40.22
4842,-39.76
4843,-39.28
4844,-38.79
4845,-38.30
4846,-37.90
4847,-37.63
4848,-37.66
4849,-37.90
4850,-38.27
4851,-38.73
4852,-39.43
4853,-40.34
4854,-41.50
4855,-42.69
4856,-44.01
4857,-45.41
4858,-47.00
4859,-48.65
4860,-50.42
4861,-52.06
4862,-53.59
4863,-54.75
4864,-55.69
4865,-56.40
4866,-56.95
4867,-57.16
4868,-57.10
4869,-56.82
4870,-56.58
4871,-56.34
4872,-56.03
4873,-55.54
4874,-54.96
4875,-54.47
4876,-54.14
4877,-53.92
4878,-53.71
4879,-53.47
4880,-53.22
4881,-52.98
4882,-52.67
4883,-52.19
4884,-51.61
4885,-51.12
4886,-50.87
4887,-50.87
4888,-50.99
4889,-51.27
4890,-51.67
4891,-52.12
4892,-52.55
4893,-52.80
4894,-52.92
4895,-52.89
4896,-52.73
4897,-52.49
4898,-52.37
4899,-52.40
4900,-52.37
4901,-52.12
4902,-51.64
4903,-51.18
4904,-50.84
4905,-50.60
4906,-50.26
4907,-49.80
4908,-49.32
4909,-48.86
4910,-48.22
4911,-47.27
4912,-45.96
4913,-44.56
4914,-43.12
4915,-41.66
4916,-40.10
4917,-38.73
4918,-37.66
4919,-36.96
4920,-36.25
4921,-35.58
4922,-35.03
4923,-34.79
4924,-34.61
4925,-34.42
4926,-34.21
4927,-34.21
4928,-34.33
4929,-34.36
4930,-34.15
4931,-33.63
4932,-33.02
4933,-32.53
4934,-32.29
4935,-32.29
4936,-32.41
4937,-32.65
4938,-33.17
4939,-33.84
4940,-34.64
4941,-35.43
4942,-36.07
4943,-36.50
4944,-36.68
4945,-36.71
4946,-36.77
4947,-36.71
4948,-36.44
4949,-35.98
4950,-35.68
4951,-35.61
4952,-35.71
4953,-35.74
4954,-35.83
4955,-36.01
4956,-36.25
4957,-36.53
4958,-36.93
4959,-37.38
4960,-37.75
4961,-37.99
4962,-38.27
4963,-38.73
4964,-39.40
4965,-40.13
4966,-40.83
4967,-41.29
4968,-41.47
4969,-41.47
4970,-41.44
4971,-41.38
4972,-41.47
4973,-41.66
4974,-42.24
4975,-43.18
4976,-44.49
4977,-45.68
4978,-46.57
4979,-47.03
4980,-47.27
4981,-47.49
4982,-47.76
4983,-48.00
4984,-48.19
4985,-48.43
4986,-48.80
4987,-49.29
4988,-49.74
4989,-50.02
4990,-49.96
4991,-49.68
4992,-49.38
4993,-49.13
4994,-48.92
4995,-48.74
4996,-48.46
4997,-48.22
4998,-47.97
4999,-47.79
5000,-47.49
5001,-47.03
5002,-46.23
5003,-45.32
5004,-44.22
5005,-43.06
5006,-41.63
5007,-40.01
5008,-38.15
5009,-36.22
5010,-34.21
5011,-32.32
5012,-30.61
5013,-29.17
5014,-27.92
5015,-27.01
5016,-26.46
5017,-26.21
5018,-26.03
5019,-25.82
5020,-25.67
5021,-25.63
5022,-25.67
5023,-25.67
5024,-25.82
5025,-26.25
5026,-27.10
5027,-28.05
5028,-29.05
5029,-29.97
5030,-31.04
5031,-32.17
5032,-33.51
5033,-34.94
5034,-36.59
5035,-38.18
5036,-39.83
5037,-41.47
5038,-43.40
5039,-45.23
5040,-46.97
5041,-48.37
5042,-49.80
5043,-51.15
5044,-52.52
5045,-53.71
5046,-54.99
5047,-56.34
5048,-57.92
5049,-59.60
5050,-61.52
5051,-63.35
5052,-65.06
5053,-66.50
5054,-67.93
5055,-69.06
5056,-69.70
5057,-69.70
5058,-69.43
5059,-69.12
5060,-68.94
5061,-68.66
5062,-68.57
5063,-68.76
5064,-69.46
5065,-70.43
5066,-71.44
5067,-72.14
5068,-72.54
5069,-72.78
5070,-73.00
5071,-73.21
5072,-73.33
5073,-73.36
5074,-73.36
5075,-73.30
5076,-73.27
5077,-73.27
5078,-73.55
5079,-73.97
5080,-74.49
5081,-74.98
5082,-75.65
5083,-76.57
5084,-77.67
5085,-78.67
5086,-79.35
5087,-79.56
5088,-79.38
5089,-78.92
5090,-78.28
5091,-77.55
5092,-76.69
5093,-75.96
5094,-75.59
5095,-75.62
5096,-75.74
5097,-75.74
5098,-75.65
5099,-75.65
5100,-75.84
5101,-76.11
5102,-76.17
5103,-76.17
5104,-76.32
5105,-76.81
5106,-77.45
5107,-77.94
5108,-78.16
5109,-78.16
5110,-78.06
5111,-77.82
5112,-77.33
5113,-76.63
5114,-75.87
5115,-75.13
5116,-74.34
5117,-73.67
5118,-73.12
5119,-72.94
5120,-72.81
5121,-72.60
5122,-72.08
5123,-71.38
5124,-70.53
5125,-69.61
5126,-68.39
5127,-66.96
5128,-65.46
5129,-64.27
5130,-63.45
5131,-62.99
5132,-62.74
5133,-62.81
5134,-62.99
5135,-63.26
5136,-63.32
5137,-63.11
5138,-62.56
5139,-61.83
5140,-60.97
5141,-60.03
5142,-59.02
5143,-58.07
5144,-57.16
5145,-56.49
5146,-56.00
5147,-55.79
5148,-55.63
5149,-55.69
5150,-55.79
5151,-55.82
5152,-55.45
5153,-54.75
5154,-53.83
5155,-52.89
5156,-51.82
5157,-50.63
5158,-49.38
5159,-48.43
5160,-47.88
5161,-47.67
5162,-47.49
5163,-47.30
5164,-47.06
5165,-46.81
5166,-46.36
5167,-45.68
5168,-44.86
5169,-44.16
5170,-43.46
5171,-42.76
5172,-41.99
5173,-41.29
5174,-40.65
5175,-40.16
5176,-39.79
5177,-39.61
5178,-39.46
5179,-39.22
5180,-38.76
5181,-38.30
5182,-38.02
5183,-37.99
5184,-38.12
5185,-38.39
5186,-38.91
5187,-39.58
5188,-40.22
5189,-40.74
5190,-41.26
5191,-41.69
5192,-41.87
5193,-41.90
5194,-42.08
5195,-42.54
5196,-43.09
5197,-43.58
5198,-44.16
5199,-44.83
5200,-45.59
5201,-46.11
5202,-46.23
5203,-45.93
5204,-45.44
5205,-44.95
5206,-44.68
5207,-44.68
5208,-44.83
5209,-45.10
5210,-45.44
5211,-45.65
5212,-45.65
5213,-45.41
5214,-45.14
5215,-44.86
5216,-44.62
5217,-44.37
5218,-44.22
5219,-44.19
5220,-44.31
5221,-44.59
5222,-45.01
5223,-45.47
5224,-45.84
5225,-46.08
5226,-46.33
5227,-46.54
5228,-46.72
5229,-46.69
5230,-46.57
5231,-46.57
5232,-46.84
5233,-47.33
5234,-47.85
5235,-48.31
5236,-48.92
5237,-49.62
5238,-50.29
5239,-50.75
5240,-51.18
5241,-51.61
5242,-52.22
5243,-52.92
5244,-53.74
5245,-54.69
5246,-55.82
5247,-56.98
5248,-58.14
5249,-59.08
5250,-59.97
5251,-60.61
5252,-61.22
5253,-61.65
5254,-62.23
5255,-62.87
5256,-63.81
5257,-64.97
5258,-66.59
5259,-68.45
5260,-70.56
5261,-72.69
5262,-75.01
5263,-77.39
5264,-79.74
5265,-81.63
5266,-83.04
5267,-83.95
5268,-84.66
5269,-85.08
5270,-85.33
5271,-85.27
5272,-85.24
5273,-85.48
5274,-86.12
5275,-86.79
5276,-87.37
5277,-87.86
5278,-88.50
5279,-89.17
5280,-89.69
5281,-89.94
5282,-90.18
5283,-90.58
5284,-91.22
5285,-91.98
5286,-92.86
5287,-93.81
5288,-94.70
5289,-95.43
5290,-96.01
5291,-96.50
5292,-96.83
5293,-97.05
5294,-97.26
5295,-97.50
5296,-97.72
5297,-97.72
5298,-97.47
5299,-96.98
5300,-96.37
5301,-95.64
5302,-94.85
5303,-94.12
5304,-93.57
5305,-93.35
5306,-93.35
5307,-93.38
5308,-93.17
5309,-92.71
5310,-92.07
5311,-91.34
5312,-90.45
5313,-89.57
5314,-88.59
5315,-87.68
5316,-86.58
5317,-85.42
5318,-84.20
5319,-83.01
5320,-81.70
5321,-80.29
5322,-78.77
5323,-77.33
5324,-75.93
5325,-74.77
5326,-73.85
5327,-73.43
5328,-73.30
5329,-73.30
5330,-73.24
5331,-73.30
5332,-73.49
5333,-73.73
5334,-73.73
5335,-73.52
5336,-73.24
5337,-73.00
5338,-72.66
5339,-72.20
5340,-71.66
5341,-71.17
5342,-70.71
5343,-70.28
5344,-69.73
5345,-69.27
5346,-68.85
5347,-68.42
5348,-67.72
5349,-66.77
5350,-65.58
5351,-64.39
5352,-63.26
5353,-62.35
5354,-61.52
5355,-60.79
5356,-60.12
5357,-59.69
5358,-59.45
5359,-59.20
5360,-58.72
5361,-58.01
5362,-57.28
5363,-56.79
5364,-56.52
5365,-56.27
5366,-56.09
5367,-56.09
5368,-56.40
5369,-56.88
5370,-57.28
5371,-57.46
5372,-57.80
5373,-58.47
5374,-59.66
5375,-61.10
5376,-62.68
5377,-64.33
5378,-66.22
5379,-68.12
5380,-69.82
5381,-71.23
5382,-72.63
5383,-74.01
5384,-75.47
5385,-76.90
5386,-78.46
5387,-80.05
5388,-81.85
5389,-83.50
5390,-85.02
5391,-86.18
5392,-87.10
5393,-87.77
5394,-88.47
5395,-89.17
5396,-89.94
5397,-90.61
5398,-91.28
5399,-92.01
5400,-92.80
5401,-93.51
5402,-93.99
5403,-94.24
5404,-94.42
5405,-94.64
5406,-94.82
5407,-94.82
5408,-94.67
5409,-94.42
5410,-94.18
5411,-93.93
5412,-93.66
5413,-93.41
5414,-93.26
5415,-93.26
5416,-93.38
5417,-93.63
5418,-94.02
5419,-94.48
5420,-94.97
5421,-95.46
5422,-96.01
5423,-96.44
5424,-96.77
5425,-97.02
5426,-97.35
5427,-97.78
5428,-98.27
5429,-98.75
5430,-99.49
5431,-100.40
5432,-101.44
5433,-102.39
5434,-103.36
5435,-104.28
5436,-105.19
5437,-105.90
5438,-106.51
5439,-106.93
5440,-107.36
5441,-107.82
5442,-108.43
5443,-109.13
5444,-109.92
5445,-110.66
5446,-111.24
5447,-111.48
5448,-111.27
5449,-110.50
5450,-109.47
5451,-108.46
5452,-107.88
5453,-107.85
5454,-108.40
5455,-109.41
5456,-110.72
5457,-112.18
5458,-113.40
5459,-114.17
5460,-114.32
5461,-114.04
5462,-113.53
5463,-113.07
5464,-112.73
5465,-112.52
5466,-112.27
5467,-112.06
5468,-111.85
5469,-111.63
5470,-111.11
5471,-110.17
5472,-108.83
5473,-107.42
5474,-105.96
5475,-104.55
5476,-103.06
5477,-101.65
5478,-100.37
5479,-99.46
5480,-98.66
5481,-98.02
5482,-97.20
5483,-96.28
5484,-95.03
5485,-93.66
5486,-92.04
5487,-90.39
5488,-88.65
5489,-87.25
5490,-86.24
5491,-85.78
5492,-85.66
5493,-85.75
5494,-85.69
5495,-85.48
5496,-84.87
5497,-83.95
5498,-82.70
5499,-81.27
5500,-79.62
5501,-78.00
5502,-76.35
5503,-74.95
5504,-73.67
5505,-72.51
5506,-71.26
5507,-70.13
5508,-68.97
5509,-67.81
5510,-66.31
5511,-64.73
5512,-62.99
5513,-61.34
5514,-59.51
5515,-57.71
5516,-55.66
5517,-53.56
5518,-51.06
5519,-48.46
5520,-45.93
5521,-43.79
5522,-41.93
5523,-40.56
5524,-39.58
5525,-39.12
5526,-38.91
5527,-39.03
5528,-39.12
5529,-39.15
5530,-38.73
5531,-38.06
5532,-37.26
5533,-36.53
5534,-35.74
5535,-35.06
5536,-34.61
5537,-34.64
5538,-34.88
5539,-35.19
5540,-35.28
5541,-35.06
5542,-34.30
5543,-33.17
5544,-31.56
5545,-29.63
5546,-27.47
5547,-25.33
5548,-23.41
5549,-21.97
5550,-20.94
5551,-20.29
5552,-19.81
5553,-19.35
5554,-18.62
5555,-17.70
5556,-16.63
5557,-15.72
5558,-14.71
5559,-13.79
5560,-12.94
5561,-12.24
5562,-11.54
5563,-10.86
5564,-10.13
5565,-9.43
5566,-8.61
5567,-7.69
5568,-6.59
5569,-5.65
5570,-4.91
5571,-4.46
5572,-4.06
5573,-3.60
5574,-3.02
5575,-2.56
5576,-2.26
5577,-1.98
5578,-1.71
5579,-1.43
5580,-1.53
5581,-2.20
5582,-3.54
5583,-5.49
5584,-7.97
5585,-10.56
5586,-13.09
5587,-15.23
5588,-17.12
5589,-18.74
5590,-20.23
5591,-21.36
5592,-22.43
5593,-23.56
5594,-25.15
5595,-27.01
5596,-29.17
5597,-31.31
5598,-33.48
5599,-35.34
5600,-36.90
5601,-37.81
5602,-38.36
5603,-38.48
5604,-38.64
5605,-38.85
5606,-39.37
5607,-40.04
5608,-40.92
5609,-41.90
5610,-42.97
5611,-43.88
5612,-44.49
5613,-44.77
5614,-44.86
5615,-44.83
5616,-44.56
5617,-44.10
5618,-43.67
5619,-43.40
5620,-43.21
5621,-43.00
5622,-42.76
5623,-42.51
5624,-42.24
5625,-41.99
5626,-41.81
5627,-41.81
5628,-42.02
5629,-42.27
5630,-42.39
5631,-42.42
5632,-42.42
5633,-42.39
5634,-42.27
5635,-42.05
5636,-41.78
5637,-41.53
5638,-41.29
5639,-41.08
5640,-40.86
5641,-40.62
5642,-40.28
5643,-39.83
5644,-39.18
5645,-38.48
5646,-37.69
5647,-36.99
5648,-36.44
5649,-36.19
5650,-36.19
5651,-36.47
5652,-36.93
5653,-37.38
5654,-37.69
5655,-37.72
5656,-37.51
5657,-36.96
5658,-36.22
5659,-35.49
5660,-35.19
5661,-35.37
5662,-36.01
5663,-37.02
5664,-38.42
5665,-40.07
5666,-41.63
5667,-42.88
5668,-43.82
5669,-44.49
5670,-44.86
5671,-44.89
5672,-44.68
5673,-44.40
5674,-44.13
5675,-43.88
5676,-43.85
5677,-44.07
5678,-44.53
5679,-45.01
5680,-45.41
5681,-45.65
5682,-45.78
5683,-45.50
5684,-44.77
5685,-43.82
5686,-43.00
5687,-42.48
5688,-42.21
5689,-42.24
5690,-42.76
5691,-43.70
5692,-44.71
5693,-45.44
5694,-45.99
5695,-46.42
5696,-46.81
5697,-47.06
5698,-47.21
5699,-47.45
5700,-47.91
5701,-48.61
5702,-49.44
5703,-50.17
5704,-50.75
5705,-50.96
5706,-50.84
5707,-50.35
5708,-49.68
5709,-48.95
5710,-48.19
5711,-47.45
5712,-46.88
5713,-46.60
5714,-46.81
5715,-47.30
5716,-47.88
5717,-48.37
5718,-48.80
5719,-49.26
5720,-49.77
5721,-50.26
5722,-50.63
5723,-50.84
5724,-51.06
5725,-51.27
5726,-51.54
5727,-51.79
5728,-52.03
5729,-52.25
5730,-52.52
5731,-52.73
5732,-52.98
5733,-53.19
5734,-53.50
5735,-53.99
5736,-54.63
5737,-55.36
5738,-56.03
5739,-56.49
5740,-56.82
5741,-57.04
5742,-57.25
5743,-57.50
5744,-57.74
5745,-57.98
5746,-58.20
5747,-58.47
5748,-58.78
5749,-58.96
5750,-59.02
5751,-59.02
5752,-59.20
5753,-59.45
5754,-59.48
5755,-59.23
5756,-58.96
5757,-58.93
5758,-59.17
5759,-59.45
5760,-59.57
5761,-59.57
5762,-59.54
5763,-59.54
5764,-59.45
5765,-59.20
5766,-58.90
5767,-58.65
5768,-58.56
5769,-58.56
5770,-58.56
5771,-58.56
5772,-58.62
5773,-58.59
5774,-58.44
5775,-58.17
5776,-58.11
5777,-58.32
5778,-58.84
5779,-59.54
5780,-60.52
5781,-61.68
5782,-63.05
5783,-64.48
5784,-66.01
5785,-67.44
5786,-68.73
5787,-69.61
5788,-70.31
5789,-70.98
5790,-72.02
5791,-73.15
5792,-74.40
5793,-75.56
5794,-76.97
5795,-78.61
5796,-80.41
5797,-81.82
5798,-82.82
5799,-83.50
5800,-84.23
5801,-84.87
5802,-85.45
5803,-85.94
5804,-86.61
5805,-87.52
5806,-88.62
5807,-89.57
5808,-90.45
5809,-91.13
5810,-91.61
5811,-91.86
5812,-91.98
5813,-91.95
5814,-91.83
5815,-91.55
5816,-91.34
5817,-91.31
5818,-91.61
5819,-92.10
5820,-92.62
5821,-93.11
5822,-93.57
5823,-94.02
5824,-94.54
5825,-95.03
5826,-95.43
5827,-95.67
5828,-95.67
5829,-95.43
5830,-95.06
5831,-94.54
5832,-94.02
5833,-93.54
5834,-93.17
5835,-92.93
5836,-92.77
5837,-92.77
5838,-93.05
5839,-93.51
5840,-94.06
5841,-94.54
5842,-95.00
5843,-95.43
5844,-95.92
5845,-96.41
5846,-97.02
5847,-97.69
5848,-98.42
5849,-99.15
5850,-99.95
5851,-100.65
5852,-101.17
5853,-101.41
5854,-101.50
5855,-101.44
5856,-101.41
5857,-101.41
5858,-101.56
5859,-101.78
5860,-101.99
5861,-102.26
5862,-102.63
5863,-103.09
5864,-103.49
5865,-103.79
5866,-103.94
5867,-103.94
5868,-103.55
5869,-102.87
5870,-101.96
5871,-100.98
5872,-99.85
5873,-98.69
5874,-97.56
5875,-96.59
5876,-95.76
5877,-95.09
5878,-94.45
5879,-94.02
5880,-93.60
5881,-93.17
5882,-92.50
5883,-91.80
5884,-91.09
5885,-90.67
5886,-90.33
5887,-90.15
5888,-89.81
5889,-89.39
5890,-88.68
5891,-87.77
5892,-86.46
5893,-84.78
5894,-82.79
5895,-80.90
5896,-79.25
5897,-78.06
5898,-77.21
5899,-76.78
5900,-76.63
5901,-76.63
5902,-76.54
5903,-76.35
5904,-76.05
5905,-75.56
5906,-74.77
5907,-73.82
5908,-72.94
5909,-72.42
5910,-72.36
5911,-72.63
5912,-73.18
5913,-73.88
5914,-74.62
5915,-75.35
5916,-76.11
5917,-76.81
5918,-77.33
5919,-77.58
5920,-77.73
5921,-77.91
5922,-78.25
5923,-78.77
5924,-79.44
5925,-80.14
5926,-80.69
5927,-80.96
5928,-80.99
5929,-80.72
5930,-80.05
5931,-79.10
5932,-78.16
5933,-77.39
5934,-76.87
5935,-76.66
5936,-76.81
5937,-77.30
5938,-77.88
5939,-78.43
5940,-78.74
5941,-78.74
5942,-78.28
5943,-77.58
5944,-76.81
5945,-76.08
5946,-75.26
5947,-74.37
5948,-73.33
5949,-72.36
5950,-71.41
5951,-70.50
5952,-69.55
5953,-68.60
5954,-67.60
5955,-66.68
5956,-65.73
5957,-64.82
5958,-63.66
5959,-62.53
5960,-61.40
5961,-60.46
5962,-59.45
5963,-58.29
5964,-56.95
5965,-55.76
5966,-54.78
5967,-54.11
5968,-53.53
5969,-53.10
5970,-52.61
5971,-52.22
5972,-51.54
5973,-50.63
5974,-49.32
5975,-47.91
5976,-46.42
5977,-45.01
5978,-43.46
5979,-42.11
5980,-40.92
5981,-39.98
5982,-38.91
5983,-37.78
5984,-36.53
5985,-35.34
5986,-34.09
5987,-32.93
5988,-31.89
5989,-31.19
5990,-30.73
5991,-30.52
5992,-30.43
5993,-30.46
5994,-30.49
5995,-30.46
5996,-30.40
5997,-30.43
5998,-30.61
5999,-30.79
6000,-31.01
6001,-31.25
6002,-31.77
6003,-32.44
6004,-33.11
6005,-33.57
6006,-34.12
6007,-34.79
6008,-35.58
6009,-36.29
6010,-37.08
6011,-37.99
6012,-39.18
6013,-40.34
6014,-41.47
6015,-42.42
6016,-43.37
6017,-44.28
6018,-45.23
6019,-46.14
6020,-47.21
6021,-48.40
6022,-49.68
6023,-50.63
6024,-51.15
6025,-51.12
6026,-50.78
6027,-50.26
6028,-49.71
6029,-49.19
6030,-49.01
6031,-49.19
6032,-49.93
6033,-51.15
6034,-52.80
6035,-54.44
6036,-55.82
6037,-56.55
6038,-56.73
6039,-56.40
6040,-55.88
6041,-55.39
6042,-55.24
6043,-55.42
6044,-55.94
6045,-56.67
6046,-57.80
6047,-59.17
6048,-60.73
6049,-62.13
6050,-63.57
6051,-64.97
6052,-66.47
6053,-67.84
6054,-69.27
6055,-70.65
6056,-72.27
6057,-73.91
6058,-75.56
6059,-76.97
6060,-78.28
6061,-79.44
6062,-80.60
6063,-81.51
6064,-82.24
6065,-82.64
6066,-83.07
6067,-83.53
6068,-84.14
6069,-84.56
6070,-84.87
6071,-85.08
6072,-85.54
6073,-86.21
6074,-87.04
6075,-87.77
6076,-88.50
6077,-89.17
6078,-89.78
6079,-90.27
6080,-90.73
6081,-91.16
6082,-91.61
6083,-92.10
6084,-92.74
6085,-93.41
6086,-94.15
6087,-94.85
6088,-95.70
6089,-96.62
6090,-97.56
6091,-98.27
6092,-98.82
6093,-99.27
6094,-99.79
6095,-100.22
6096,-100.65
6097,-101.07
6098,-101.90
6099,-103.09
6100,-104.58
6101,-105.96
6102,-107.27
6103,-108.43
6104,-109.71
6105,-110.87
6106,-111.85
6107,-112.52
6108,-113.28
6109,-114.20
6110,-115.36
6111,-116.55
6112,-117.80
6113,-118.96
6114,-120.09
6115,-121.03
6116,-121.80
6117,-122.25
6118,-122.47
6119,-122.44
6120,-122.28
6121,-122.01
6122,-121.89
6123,-121.86
6124,-122.01
6125,-122.25
6126,-122.53
6127,-122.77
6128,-122.92
6129,-123.17
6130,-123.57
6131,-124.08
6132,-124.42
6133,-124.42
6134,-124.18
6135,-123.93
6136,-123.75
6137,-123.47
6138,-123.05
6139,-122.59
6140,-122.31
6141,-122.31
6142,-122.34
6143,-122.38
6144,-122.50
6145,-122.71
6146,-122.92
6147,-122.96
6148,-122.77
6149,-122.50
6150,-122.22
6151,-122.04
6152,-121.86
6153,-121.61
6154,-121.19
6155,-120.76
6156,-120.30
6157,-119.84
6158,-119.14
6159,-118.19
6160,-117.10
6161,-116.18
6162,-115.30
6163,-114.38
6164,-113.16
6165,-112.00
6166,-110.99
6167,-110.32
6168,-109.59
6169,-108.73
6170,-107.48
6171,-106.05
6172,-104.28
6173,-102.45
6174,-100.52
6175,-98.88
6176,-97.29
6177,-95.95
6178,-94.60
6179,-93.51
6180,-92.22
6181,-90.88
6182,-89.02
6183,-86.94
6184,-84.47
6185,-81.88
6186,-78.98
6187,-76.20
6188,-73.49
6189,-71.14
6190,-68.82
6191,-66.77
6192,-64.82
6193,-63.17
6194,-61.49
6195,-59.94
6196,-58.23
6197,-56.61
6198,-54.72
6199,-52.92
6200,-50.96
6201,-49.10
6202,-47.00
6203,-44.92
6204,-42.79
6205,-40.95
6206,-39.03
6207,-37.20
6208,-35.19
6209,-33.33
6210,-31.40
6211,-29.60
6212,-27.47
6213,-25.15
6214,-22.43
6215,-19.84
6216,-17.36
6217,-15.29
6218,-13.31
6219,-11.69
6220,-10.28
6221,-9.40
6222,-8.70
6223,-8.03
6224,-7.08
6225,-5.92
6226,-4.52
6227,-3.08
6228,-1.65
6229,-0.49
6230,0.31
6231,0.79
6232,1.13
6233,1.31
6234,1.25
6235,1.07
6236,0.95
6237,0.92
6238,0.73
6239,0.34
6240,-0.21
6241,-0.73
6242,-1.25
6243,-1.68
6244,-2.01
6245,-2.26
6246,-2.62
6247,-3.05
6248,-3.54
6249,-4.00
6250,-4.67
6251,-5.55
6252,-6.77
6253,-8.21
6254,-9.98
6255,-11.81
6256,-13.82
6257,-15.69
6258,-17.67
6259,-19.47
6260,-21.39
6261,-23.22
6262,-25.42
6263,-27.74
6264,-30.33
6265,-32.90
6266,-35.71
6267,-38.51
6268,-41.47
6269,-44.04
6270,-46.33
6271,-48.13
6272,-50.02
6273,-51.85
6274,-53.80
6275,-55.66
6276,-57.80
6277,-59.88
6278,-61.98
6279,-63.84
6280,-65.77
6281,-67.66
6282,-69.49
6283,-70.89
6284,-71.93
6285,-72.63
6286,-73.18
6287,-73.39
6288,-73.12
6289,-72.39
6290,-71.53
6291,-70.77
6292,-70.16
6293,-69.70
6294,-69.46
6295,-69.46
6296,-69.52
6297,-69.58
6298,-69.46
6299,-69.24
6300,-68.79
6301,-68.08
6302,-67.11
6303,-66.19
6304,-65.37
6305,-64.64
6306,-63.87
6307,-63.20
6308,-62.62
6309,-62.19
6310,-61.52
6311,-60.61
6312,-59.39
6313,-58.20
6314,-57.01
6315,-55.88
6316,-54.60
6317,-53.13
6318,-51.54
6319,-50.14
6320,-49.07
6321,-48.34
6322,-47.70
6323,-47.27
6324,-47.18
6325,-47.39
6326,-47.70
6327,-47.97
6328,-48.28
6329,-48.74
6330,-49.26
6331,-49.74
6332,-50.29
6333,-50.96
6334,-51.91
6335,-52.86
6336,-53.74
6337,-54.44
6338,-55.15
6339,-55.85
6340,-56.55
6341,-57.01
6342,-57.25
6343,-57.19
6344,-57.10
6345,-57.10
6346,-57.28
6347,-57.46
6348,-57.71
6349,-57.92
6350,-58.32
6351,-58.78
6352,-59.23
6353,-59.45
6354,-59.60
6355,-59.78
6356,-60.24
6357,-60.94
6358,-61.89
6359,-62.84
6360,-63.84
6361,-64.76
6362,-65.70
6363,-66.62
6364,-67.69
6365,-68.85
6366,-70.22
6367,-71.62
6368,-73.09
6369,-74.55
6370,-76.02
6371,-77.15
6372,-77.94
6373,-78.43
6374,-78.92
6375,-79.35
6376,-79.50
6377,-79.28
6378,-78.95
6379,-78.67
6380,-78.40
6381,-77.97
6382,-77.36
6383,-76.63
6384,-75.71
6385,-74.80
6386,-73.85
6387,-72.94
6388,-71.72
6389,-70.31
6390,-68.76
6391,-67.32
6392,-66.04
6393,-64.85
6394,-63.69
6395,-62.77
6396,-62.07
6397,-61.61
6398,-61.16
6399,-60.73
6400,-60.27
6401,-59.78
6402,-59.14
6403,-58.44
6404,-57.86
6405,-57.62
6406,-57.56
6407,-57.59
6408,-57.68
6409,-57.92
6410,-58.26
6411,-58.50
6412,-58.56
6413,-58.56
6414,-58.65
6415,-58.84
6416,-59.17
6417,-59.66
6418,-60.46
6419,-61.40
6420,-62.29
6421,-63.02
6422,-63.81
6423,-64.70
6424,-65.70
6425,-66.68
6426,-67.69
6427,-68.60
6428,-69.40
6429,-69.85
6430,-70.16
6431,-70.40
6432,-70.56
6433,-70.53
6434,-70.43
6435,-70.40
6436,-70.68
6437,-71.14
6438,-71.66
6439,-72.17
6440,-72.69
6441,-73.15
6442,-73.36
6443,-73.39
6444,-73.36
6445,-73.33
6446,-73.21
6447,-73.00
6448,-72.85
6449,-72.81
6450,-72.91
6451,-72.94
6452,-72.81
6453,-72.57
6454,-72.17
6455,-71.72
6456,-71.20
6457,-70.74
6458,-70.25
6459,-69.76
6460,-69.31
6461,-68.85
6462,-68.27
6463,-67.57
6464,-66.68
6465,-65.73
6466,-64.73
6467,-63.84
6468,-62.90
6469,-61.95
6470,-60.85
6471,-59.66
6472,-58.41
6473,-57.25
6474,-56.09
6475,-54.90
6476,-53.59
6477,-52.43
6478,-51.48
6479,-50.78
6480,-50.08
6481,-49.41
6482,-48.74
6483,-48.28
6484,-47.82
6485,-47.39
6486,-46.91
6487,-46.42
6488,-45.93
6489,-45.50
6490,-45.01
6491,-44.53
6492,-43.98
6493,-43.27
6494,-42.39
6495,-41.41
6496,-40.50
6497,-39.76
6498,-39.28
6499,-39.06
6500,-39.09
6501,-39.34
6502,-39.64
6503,-39.92
6504,-40.07
6505,-40.04
6506,-39.86
6507,-39.61
6508,-39.46
6509,-39.40
6510,-39.58
6511,-40.07
6512,-41.05
6513,-42.21
6514,-43.40
6515,-44.34
6516,-45.23
6517,-46.11
6518,-47.15
6519,-48.13
6520,-48.98
6521,-49.68
6522,-50.35
6523,-51.03
6524,-51.82
6525,-52.52
6526,-53.13
6527,-53.62
6528,-54.08
6529,-54.50
6530,-54.99
6531,-55.48
6532,-56.00
6533,-56.46
6534,-56.82
6535,-57.01
6536,-57.31
6537,-57.77
6538,-58.47
6539,-59.14
6540,-59.84
6541,-60.58
6542,-61.46
6543,-62.38
6544,-63.23
6545,-63.96
6546,-64.70
6547,-65.40
6548,-65.95
6549,-66.19
6550,-66.22
6551,-66.16
6552,-66.22
6553,-66.47
6554,-66.93
6555,-67.38
6556,-67.78
6557,-68.02
6558,-68.21
6559,-68.42
6560,-68.70
6561,-68.94
6562,-69.15
6563,-69.37
6564,-69.73
6565,-70.22
6566,-70.74
6567,-71.20
6568,-71.69
6569,-72.14
6570,-72.57
6571,-72.81
6572,-72.88
6573,-72.85
6574,-72.91
6575,-73.15
6576,-73.55
6577,-74.01
6578,-74.49
6579,-75.01
6580,-75.56
6581,-75.99
6582,-76.29
6583,-76.51
6584,-76.90
6585,-77.36
6586,-77.76
6587,-77.97
6588,-78.34
6589,-79.04
6590,-80.05
6591,-80.96
6592,-81.79
6593,-82.49
6594,-83.28
6595,-83.98
6596,-84.44
6597,-84.69
6598,-84.99
6599,-85.45
6600,-85.91
6601,-86.12
6602,-86.27
6603,-86.46
6604,-86.91
6605,-87.40
6606,-87.80
6607,-88.01
6608,-88.17
6609,-88.41
6610,-88.75
6611,-88.96
6612,-89.02
6613,-89.02
6614,-89.23
6615,-89.69
6616,-90.24
6617,-90.73
6618,-91.22
6619,-91.67
6620,-92.07
6621,-92.32
6622,-92.44
6623,-92.41
6624,-92.32
6625,-92.07
6626,-91.77
6627,-91.52
6628,-91.43
6629,-91.40
6630,-91.40
6631,-91.40
6632,-91.55
6633,-91.80
6634,-91.98
6635,-91.98
6636,-91.86
6637,-91.86
6638,-92.04
6639,-92.25
6640,-92.41
6641,-92.41
6642,-92.41
6643,-92.35
6644,-92.32
6645,-92.32
6646,-92.56
6647,-93.02
6648,-93.57
6649,-94.06
6650,-94.57
6651,-95.03
6652,-95.37
6653,-95.37
6654,-95.06
6655,-94.54
6656,-94.06
6657,-93.78
6658,-93.90
6659,-94.42
6660,-95.15
6661,-95.86
6662,-96.44
6663,-96.95
6664,-97.38
6665,-97.63
6666,-97.44
6667,-96.98
6668,-96.50
6669,-96.25
6670,-96.10
6671,-95.86
6672,-95.55
6673,-95.31
6674,-95.21
6675,-95.25
6676,-95.18
6677,-94.97
6678,-94.51
6679,-94.02
6680,-93.60
6681,-93.38
6682,-93.32
6683,-93.29
6684,-93.29
6685,-93.29
6686,-93.41
6687,-93.66
6688,-93.90
6689,-94.15
6690,-94.48
6691,-94.97
6692,-95.49
6693,-95.98
6694,-96.41
6695,-96.89
6696,-97.44
6697,-97.93
6698,-98.11
6699,-97.90
6700,-97.38
6701,-96.62
6702,-95.64
6703,-94.76
6704,-94.06
6705,-93.51
6706,-92.99
6707,-92.59
6708,-92.38
6709,-92.35
6710,-92.16
6711,-91.77
6712,-91.22
6713,-90.70
6714,-90.09
6715,-89.42
6716,-88.84
6717,-88.53
6718,-88.56
6719,-88.87
6720,-89.32
6721,-89.81
6722,-90.03
6723,-89.81
6724,-89.20
6725,-88.47
6726,-87.74
6727,-87.04
6728,-86.30
6729,-85.57
6730,-84.93
6731,-84.50
6732,-84.11
6733,-83.62
6734,-82.95
6735,-82.28
6736,-81.60
6737,-80.87
6738,-79.90
6739,-78.70
6740,-77.61
6741,-76.84
6742,-76.45
6743,-76.23
6744,-76.20
6745,-76.42
6746,-76.90
6747,-77.67
6748,-78.52
6749,-79.22
6750,-79.65
6751,-79.90
6752,-80.20
6753,-80.66
6754,-81.18
6755,-81.67
6756,-82.21
6757,-82.92
6758,-83.77
6759,-84.47
6760,-84.99
6761,-85.48
6762,-86.09
6763,-86.79
6764,-87.43
6765,-87.92
6766,-88.38
6767,-88.81
6768,-89.20
6769,-89.48
6770,-89.63
6771,-89.57
6772,-89.39
6773,-89.17
6774,-89.05
6775,-89.02
6776,-89.02
6777,-89.05
6778,-89.17
6779,-89.42
6780,-89.57
6781,-89.60
6782,-89.57
6783,-89.57
6784,-89.42
6785,-88.96
6786,-88.10
6787,-87.16
6788,-86.27
6789,-85.57
6790,-84.87
6791,-84.20
6792,-83.47
6793,-82.73
6794,-81.97
6795,-81.33
6796,-80.66
6797,-79.96
6798,-78.95
6799,-77.79
6800,-76.63
6801,-75.65
6802,-74.74
6803,-73.82
6804,-72.88
6805,-72.14
6806,-71.66
6807,-71.47
6808,-71.47
6809,-71.47
6810,-71.29
6811,-71.08
6812,-70.92
6813,-70.92
6814,-70.86
6815,-70.65
6816,-70.34
6817,-70.10
6818,-69.85
6819,-69.61
6820,-69.43
6821,-69.40
6822,-69.70
6823,-70.19
6824,-70.74
6825,-71.23
6826,-71.69
6827,-72.14
6828,-72.57
6829,-72.85
6830,-72.85
6831,-72.57
6832,-72.20
6833,-71.96
6834,-71.93
6835,-72.17
6836,-72.63
6837,-73.12
6838,-73.52
6839,-73.79
6840,-73.82
6841,-73.61
6842,-73.00
6843,-72.08
6844,-70.74
6845,-69.31
6846,-67.90
6847,-66.71
6848,-65.67
6849,-64.79
6850,-63.87
6851,-62.90
6852,-61.74
6853,-60.58
6854,-59.48
6855,-58.53
6856,-57.59
6857,-56.67
6858,-55.79
6859,-55.08
6860,-54.41
6861,-53.74
6862,-52.89
6863,-51.94
6864,-50.90
6865,-49.96
6866,-49.07
6867,-48.40
6868,-47.85
6869,-47.39
6870,-46.75
6871,-46.08
6872,-45.41
6873,-44.95
6874,-44.53
6875,-44.07
6876,-43.58
6877,-43.33
6878,-43.40
6879,-43.64
6880,-43.91
6881,-44.19
6882,-44.46
6883,-44.68
6884,-44.68
6885,-44.49
6886,-44.13
6887,-43.61
6888,-42.88
6889,-41.93
6890,-41.02
6891,-40.28
6892,-39.67
6893,-39.18
6894,-39.00
6895,-39.25
6896,-39.83
6897,-40.56
6898,-41.29
6899,-42.02
6900,-42.76
6901,-43.46
6902,-44.07
6903,-44.56
6904,-45.01
6905,-45.44
6906,-45.93
6907,-46.42
6908,-46.94
6909,-47.36
6910,-47.82
6911,-48.28
6912,-48.95
6913,-49.62
6914,-50.29
6915,-50.75
6916,-51.21
6917,-51.64
6918,-52.12
6919,-52.58
6920,-53.13
6921,-53.83
6922,-54.78
6923,-55.73
6924,-56.61
6925,-57.31
6926,-57.89
6927,-58.35
6928,-58.78
6929,-59.23
6930,-59.88
6931,-60.58
6932,-61.31
6933,-61.98
6934,-62.81
6935,-63.75
6936,-64.82
6937,-65.80
6938,-66.56
6939,-66.99
6940,-67.23
6941,-67.47
6942,-67.87
6943,-68.30
6944,-68.79
6945,-69.24
6946,-69.89
6947,-70.56
6948,-71.26
6949,-71.75
6950,-72.08
6951,-72.27
6952,-72.45
6953,-72.72
6954,-73.12
6955,-73.55
6956,-74.01
6957,-74.49
6958,-75.16
6959,-75.87
6960,-76.39
6961,-76.63
6962,-76.78
6963,-77.00
6964,-77.27
6965,-77.55
6966,-77.76
6967,-77.97
6968,-78.25
6969,-78.49
6970,-78.64
6971,-78.64
6972,-78.52
6973,-78.28
6974,-77.85
6975,-77.39
6976,-76.97
6977,-76.72
6978,-76.60
6979,-76.63
6980,-76.72
6981,-76.72
6982,-76.51
6983,-76.05
6984,-75.38
6985,-74.65
6986,-73.85
6987,-73.18
6988,-72.66
6989,-72.42
6990,-72.36
6991,-72.39
6992,-72.39
6993,-72.42
6994,-72.30
6995,-72.08
6996,-71.69
6997,-71.23
6998,-70.71
6999,-70.22
7000,-69.79
7001,-69.58
7002,-69.55
7003,-69.55
7004,-69.37
7005,-68.88
7006,-68.27
7007,-67.78
7008,-67.47
7009,-67.26
7010,-66.96
7011,-66.74
7012,-66.71
7013,-66.96
7014,-67.26
7015,-67.54
7016,-67.75
7017,-67.96
7018,-68.24
7019,-68.45
7020,-68.66
7021,-68.94
7022,-69.21
7023,-69.43
7024,-69.55
7025,-69.55
7026,-69.49
7027,-69.52
7028,-69.55
7029,-69.55
7030,-69.43
7031,-69.21
7032,-68.94
7033,-68.45
7034,-67.60
7035,-66.68
7036,-65.92
7037,-65.40
7038,-64.94
7039,-64.51
7040,-64.24
7041,-64.24
7042,-64.24
7043,-64.03
7044,-63.57
7045,-63.08
7046,-62.62
7047,-62.41
7048,-62.41
7049,-62.65
7050,-63.05
7051,-63.51
7052,-64.15
7053,-64.88
7054,-65.58
7055,-66.04
7056,-66.25
7057,-66.25
7058,-66.16
7059,-65.89
7060,-65.43
7061,-64.97
7062,-64.70
7063,-64.67
7064,-64.73
7065,-64.76
7066,-64.88
7067,-65.09
7068,-65.28
7069,-65.31
7070,-65.22
7071,-65.22
7072,-65.28
7073,-65.28
7074,-65.16
7075,-64.91
7076,-64.64
7077,-64.39
7078,-64.15
7079,-63.93
7080,-63.75
7081,-63.51
7082,-63.08
7083,-62.59
7084,-62.23
7085,-62.23
7086,-62.56
7087,-63.05
7088,-63.63
7089,-64.36
7090,-65.19
7091,-65.95
7092,-66.28
7093,-66.04
7094,-65.37
7095,-64.61
7096,-64.03
7097,-63.57
7098,-63.11
7099,-62.59
7100,-62.23
7101,-62.23
7102,-62.59
7103,-63.11
7104,-63.51
7105,-63.72
7106,-63.90
7107,-64.15
7108,-64.42
7109,-64.67
7110,-64.85
7111,-65.06
7112,-65.46
7113,-65.95
7114,-66.38
7115,-66.62
7116,-66.68
7117,-66.68
7118,-66.68
7119,-66.62
7120,-66.65
7121,-66.93
7122,-67.50
7123,-68.18
7124,-68.76
7125,-69.24
7126,-69.98
7127,-70.89
7128,-71.81
7129,-72.54
7130,-73.30
7131,-74.25
7132,-75.23
7133,-75.96
7134,-76.39
7135,-76.57
7136,-76.78
7137,-77.03
7138,-77.24
7139,-77.21
7140,-77.06
7141,-77.06
7142,-77.36
7143,-77.82
7144,-78.25
7145,-78.49
7146,-78.74
7147,-78.95
7148,-79.01
7149,-78.77
7150,-78.43
7151,-78.16
7152,-78.03
7153,-78.06
7154,-78.13
7155,-78.13
7156,-78.00
7157,-77.76
7158,-77.48
7159,-77.27
7160,-77.03
7161,-76.78
7162,-76.51
7163,-76.26
7164,-76.17
7165,-76.20
7166,-76.17
7167,-75.93
7168,-75.44
7169,-74.98
7170,-74.62
7171,-74.37
7172,-74.13
7173,-73.91
7174,-73.79
7175,-73.79
7176,-73.76
7177,-73.55
7178,-73.12
7179,-72.60
7180,-72.11
7181,-71.66
7182,-71.26
7183,-70.74
7184,-70.13
7185,-69.67
7186,-69.55
7187,-69.76
7188,-70.13
7189,-70.95
7190,-71.62
7191,-72.20
7192,-72.63
7193,-78.06
7194,-78.28
7195,-66.04
7196,-58.87
7197,-84.93
7198,-114.69
7199,-66.96
7200,23.35
