1,75.13
2,100.00
3,100.00
4,97.96
5,95.00
6,100.00
7,99.04
8,80.10
9,48.99
10,16.72
11,-9.43
12,-23.65
13,-21.71
14,-1.09
15,33.42
16,69.02
17,93.81
18,100.00
19,100.00
20,99.52
21,99.02
22,99.93
23,100.00
24,99.75
25,87.98
26,60.51
27,20.07
28,-22.68
29,-57.53
30,-80.94
31,-92.16
32,-91.67
33,-79.67
34,-60.67
35,-40.10
36,-23.68
37,-13.61
38,-10.87
39,-13.24
40,-18.39
41,-23.08
42,-25.43
43,-24.95
44,-22.01
45,-18.34
46,-14.83
47,-12.76
48,-11.93
49,-12.17
50,-12.64
51,-12.84
52,-12.46
53,-11.60
54,-10.37
55,-9.13
56,-7.93
57,-7.02
58,-6.23
59,-5.58
60,-4.82
61,-4.04
62,-3.17
63,-2.37
64,-1.57
65,-0.88
66,-0.14
67,0.51
68,1.19
69,1.81
70,2.49
71,3.20
72,4.03
73,4.89
74,5.84
75,6.78
76,7.74
77,8.59
78,9.37
79,9.98
80,10.48
81,10.81
82,11.01
83,11.09
84,11.07
85,10.94
86,10.71
87,10.40
88,10.03
89,9.63
90,9.16
91,8.67
92,8.11
93,7.53
94,6.84
95,6.07
96,5.22
97,4.37
98,3.53
99,2.82
100,2.27
101,1.97
102,1.86
103,1.94
104,2.11
105,2.33
106,2.52
107,2.68
108,2.71
109,2.66
110,2.49
111,2.23
112,1.86
113,1.39
114,0.78
115,0.10
116,-0.63
117,-1.35
118,-2.04
119,-2.64
120,-3.11
121,-3.44
122,-3.65
123,-3.78
124,-3.85
125,-3.88
126,-3.87
127,-3.81
128,-3.70
129,-3.52
130,-3.26
131,-2.90
132,-2.45
133,-1.94
134,-1.38
135,-0.84
136,-0.38
137,-0.07
138,0.03
139,-0.10
140,-0.48
141,-1.04
142,-1.70
143,-2.33
144,-2.82
145,-3.12
146,-3.23
147,-3.21
148,-3.13
149,-3.06
150,-3.05
151,-3.11
152,-3.18
153,-3.21
154,-3.08
155,-2.75
156,-2.17
157,-1.41
158,-0.48
159,0.47
160,1.41
161,2.25
162,3.03
163,3.73
164,4.41
165,5.01
166,5.57
167,6.01
168,6.35
169,6.50
170,6.49
171,6.30
172,6.02
173,5.69
174,5.39
175,5.16
176,5.06
177,5.11
178,5.26
179,5.50
180,5.75
181,5.99
182,6.13
183,6.15
184,5.95
185,5.57
186,4.99
187,4.31
188,3.54
189,2.80
190,2.10
191,1.54
192,1.04
193,0.65
194,0.23
195,-0.21
196,-0.77
197,-1.40
198,-2.13
199,-2.87
200,-3.61
201,-4.24
202,-4.79
203,-5.19
204,-5.53
205,-5.82
206,-6.10
207,-6.35
208,-6.58
209,-6.74
210,-6.83
211,-6.83
212,-6.74
213,-6.59
214,-6.39
215,-6.20
216,-6.02
217,-5.88
218,-5.73
219,-5.58
220,-5.37
221,-5.12
222,-4.81
223,-4.46
224,-4.07
225,-3.73
226,-3.44
227,-3.28
228,-3.19
229,-3.19
230,-3.19
231,-3.17
232,-3.00
233,-2.67
234,-2.10
235,-1.36
236,-0.47
237,0.41
238,1.28
239,1.98
240,2.55
241,2.91
242,3.18
243,3.39
244,3.71
245,4.14
246,4.77
247,5.51
248,6.41
249,7.29
250,8.15
251,8.85
252,9.38
253,9.72
254,9.96
255,10.10
256,10.25
257,10.37
258,10.52
259,10.65
260,10.77
261,10.82
262,10.83
263,10.80
264,10.82
265,10.89
266,11.07
267,11.29
268,11.56
269,11.83
270,12.07
271,12.23
272,12.32
273,12.39
274,12.51
275,12.75
276,13.10
277,13.55
278,14.02
279,14.42
280,14.63
281,14.60
282,14.28
283,13.75
284,13.07
285,12.37
286,11.71
287,11.20
288,10.80
289,10.53
290,10.25
291,9.95
292,9.47
293,8.83
294,7.96
295,6.99
296,5.92
297,4.92
298,3.96
299,3.15
300,2.41
301,1.81
302,1.22
303,0.68
304,0.07
305,-0.53
306,-1.21
307,-1.84
308,-2.52
309,-3.17
310,-3.87
311,-4.53
312,-5.24
313,-5.91
314,-6.60
315,-7.25
316,-7.86
317,-8.38
318,-8.83
319,-9.16
320,-9.41
321,-9.59
322,-9.71
323,-9.77
324,-9.76
325,-9.65
326,-9.40
327,-9.05
328,-8.57
329,-8.03
330,-7.39
331,-6.75
332,-6.05
333,-5.36
334,-4.57
335,-3.74
336,-2.79
337,-1.84
338,-0.85
339,0.02
340,0.79
341,1.34
342,1.71
343,1.85
344,1.89
345,1.84
346,1.87
347,1.97
348,2.22
349,2.59
350,3.09
351,3.61
352,4.10
353,4.47
354,4.71
355,4.82
356,4.86
357,4.85
358,4.86
359,4.92
360,5.11
361,5.41
362,5.79
363,6.16
364,6.49
365,6.72
366,6.82
367,6.78
368,6.64
369,6.44
370,6.24
371,6.09
372,6.00
373,5.95
374,5.95
375,6.00
376,6.09
377,6.18
378,6.29
379,6.38
380,6.47
381,6.57
382,6.70
383,6.85
384,7.09
385,7.44
386,7.95
387,8.56
388,9.23
389,9.89
390,10.45
391,10.85
392,11.01
393,10.96
394,10.69
395,10.29
396,9.75
397,9.12
398,8.37
399,7.53
400,6.57
401,5.56
402,4.49
403,3.45
404,2.45
405,1.60
406,0.87
407,0.35
408,-0.06
409,-0.38
410,-0.73
411,-1.09
412,-1.51
413,-1.91
414,-2.26
415,-2.48
416,-2.57
417,-2.48
418,-2.27
419,-1.97
420,-1.63
421,-1.32
422,-1.02
423,-0.71
424,-0.35
425,0.02
426,0.43
427,0.79
428,1.15
429,1.45
430,1.73
431,1.93
432,2.16
433,2.42
434,2.83
435,3.37
436,4.10
437,4.92
438,5.84
439,6.73
440,7.60
441,8.34
442,9.00
443,9.54
444,10.04
445,10.52
446,11.03
447,11.50
448,11.94
449,12.24
450,12.42
451,12.43
452,12.31
453,12.07
454,11.79
455,11.49
456,11.25
457,11.10
458,11.06
459,11.10
460,11.16
461,11.22
462,11.26
463,11.30
464,11.31
465,11.30
466,11.25
467,11.17
468,11.02
469,10.83
470,10.52
471,10.12
472,9.55
473,8.86
474,8.02
475,7.12
476,6.15
477,5.22
478,4.31
479,3.51
480,2.75
481,2.12
482,1.50
483,0.97
484,0.39
485,-0.16
486,-0.82
487,-1.48
488,-2.22
489,-2.94
490,-3.69
491,-4.39
492,-5.07
493,-5.64
494,-6.15
495,-6.54
496,-6.85
497,-7.03
498,-7.14
499,-7.18
500,-7.18
501,-7.14
502,-7.09
503,-7.01
504,-6.92
505,-6.75
506,-6.49
507,-6.13
508,-5.70
509,-5.26
510,-4.88
511,-4.64
512,-4.57
513,-4.71
514,-5.01
515,-5.38
516,-5.73
517,-5.99
518,-6.13
519,-6.19
520,-6.19
521,-6.21
522,-6.27
523,-6.41
524,-6.58
525,-6.71
526,-6.71
527,-6.55
528,-6.16
529,-5.63
530,-4.97
531,-4.28
532,-3.60
533,-3.00
534,-2.44
535,-1.95
536,-1.45
537,-0.96
538,-0.42
539,0.12
540,0.70
541,1.23
542,1.78
543,2.27
544,2.85
545,3.43
546,4.13
547,4.85
548,5.69
549,6.53
550,7.46
551,8.33
552,9.21
553,10.01
554,10.81
555,11.53
556,12.20
557,12.77
558,13.30
559,13.75
560,14.16
561,14.50
562,14.79
563,15.00
564,15.10
565,15.05
566,14.81
567,14.43
568,13.90
569,13.29
570,12.59
571,11.86
572,11.12
573,10.44
574,9.72
575,8.99
576,8.18
577,7.37
578,6.55
579,5.83
580,5.19
581,4.75
582,4.44
583,4.33
584,4.31
585,4.38
586,4.40
587,4.39
588,4.28
589,4.13
590,3.88
591,3.63
592,3.34
593,3.09
594,2.78
595,2.42
596,1.96
597,1.41
598,0.77
599,0.08
600,-0.63
601,-1.25
602,-1.76
603,-2.10
604,-2.29
605,-2.33
606,-2.24
607,-2.04
608,-1.78
609,-1.46
610,-1.10
611,-0.71
612,-0.31
613,0.09
614,0.50
615,0.91
616,1.28
617,1.54
618,1.64
619,1.57
620,1.32
621,0.96
622,0.52
623,0.07
624,-0.35
625,-0.68
626,-0.91
627,-1.06
628,-1.17
629,-1.32
630,-1.51
631,-1.73
632,-1.93
633,-2.06
634,-2.03
635,-1.79
636,-1.27
637,-0.51
638,0.46
639,1.47
640,2.47
641,3.30
642,3.96
643,4.42
644,4.78
645,5.09
646,5.47
647,5.93
648,6.47
649,6.99
650,7.47
651,7.81
652,7.98
653,7.93
654,7.69
655,7.32
656,6.91
657,6.53
658,6.22
659,5.98
660,5.82
661,5.71
662,5.58
663,5.44
664,5.27
665,5.11
666,4.93
667,4.75
668,4.53
669,4.34
670,4.10
671,3.84
672,3.46
673,3.03
674,2.49
675,1.91
676,1.23
677,0.53
678,-0.25
679,-1.04
680,-1.90
681,-2.74
682,-3.58
683,-4.33
684,-5.01
685,-5.55
686,-5.99
687,-6.28
688,-6.45
689,-6.51
690,-6.48
691,-6.36
692,-6.20
693,-5.97
694,-5.70
695,-5.36
696,-4.99
697,-4.63
698,-4.32
699,-4.10
700,-3.96
701,-3.89
702,-3.87
703,-3.88
704,-3.85
705,-3.76
706,-3.53
707,-3.18
708,-2.71
709,-2.19
710,-1.63
711,-1.15
712,-0.74
713,-0.49
714,-0.32
715,-0.23
716,-0.14
717,-0.02
718,0.22
719,0.56
720,1.06
721,1.62
722,2.30
723,2.98
724,3.72
725,4.42
726,5.15
727,5.84
728,6.58
729,7.28
730,8.01
731,8.70
732,9.39
733,10.02
734,10.63
735,11.17
736,11.68
737,12.10
738,12.46
739,12.67
740,12.77
741,12.72
742,12.55
743,12.28
744,12.00
745,11.76
746,11.64
747,11.62
748,11.70
749,11.84
750,12.01
751,12.18
752,12.32
753,12.43
754,12.57
755,12.77
756,13.06
757,13.43
758,13.83
759,14.22
760,14.51
761,14.67
762,14.65
763,14.49
764,14.20
765,13.88
766,13.51
767,13.19
768,12.84
769,12.45
770,11.90
771,11.18
772,10.21
773,9.09
774,7.78
775,6.46
776,5.19
777,4.17
778,3.38
779,2.88
780,2.56
781,2.44
782,2.31
783,2.15
784,1.78
785,1.28
786,0.59
787,-0.16
788,-0.98
789,-1.73
790,-2.48
791,-3.12
792,-3.72
793,-4.27
794,-4.87
795,-5.51
796,-6.23
797,-6.95
798,-7.64
799,-8.20
800,-8.63
801,-8.90
802,-9.01
803,-8.96
804,-8.77
805,-8.46
806,-8.03
807,-7.55
808,-6.99
809,-6.41
810,-5.75
811,-5.12
812,-4.50
813,-3.95
814,-3.38
815,-2.84
816,-2.22
817,-1.56
818,-0.79
819,0.03
820,0.94
821,1.83
822,2.69
823,3.41
824,3.98
825,4.31
826,4.46
827,4.38
828,4.15
829,3.76
830,3.32
831,2.86
832,2.51
833,2.32
834,2.38
835,2.70
836,3.29
837,4.06
838,4.93
839,5.79
840,6.54
841,7.10
842,7.44
843,7.57
844,7.51
845,7.32
846,7.09
847,6.87
848,6.72
849,6.61
850,6.54
851,6.44
852,6.27
853,6.01
854,5.69
855,5.32
856,4.96
857,4.68
858,4.57
859,4.68
860,4.99
861,5.46
862,6.04
863,6.66
864,7.24
865,7.74
866,8.13
867,8.42
868,8.65
869,8.81
870,8.92
871,8.98
872,8.98
873,8.91
874,8.76
875,8.56
876,8.29
877,8.03
878,7.75
879,7.47
880,7.09
881,6.60
882,5.91
883,5.05
884,4.00
885,2.87
886,1.70
887,0.63
888,-0.31
889,-1.04
890,-1.56
891,-1.82
892,-1.91
893,-1.81
894,-1.65
895,-1.45
896,-1.26
897,-1.09
898,-0.96
899,-0.87
900,-0.83
901,-0.84
902,-0.85
903,-0.88
904,-0.85
905,-0.76
906,-0.55
907,-0.24
908,0.20
909,0.70
910,1.31
911,1.94
912,2.62
913,3.28
914,3.95
915,4.52
916,5.08
917,5.59
918,6.15
919,6.70
920,7.33
921,7.99
922,8.77
923,9.59
924,10.45
925,11.20
926,11.88
927,12.40
928,12.81
929,13.05
930,13.18
931,13.20
932,13.17
933,13.10
934,13.03
935,12.93
936,12.83
937,12.73
938,12.63
939,12.55
940,12.44
941,12.31
942,12.16
943,12.00
944,11.78
945,11.53
946,11.20
947,10.86
948,10.50
949,10.19
950,9.87
951,9.59
952,9.28
953,8.97
954,8.57
955,8.13
956,7.57
957,6.98
958,6.28
959,5.58
960,4.83
961,4.12
962,3.37
963,2.65
964,1.86
965,1.07
966,0.23
967,-0.54
968,-1.31
969,-1.99
970,-2.67
971,-3.27
972,-3.87
973,-4.41
974,-4.95
975,-5.43
976,-5.87
977,-6.19
978,-6.43
979,-6.57
980,-6.64
981,-6.65
982,-6.64
983,-6.62
984,-6.59
985,-6.50
986,-6.34
987,-6.08
988,-5.75
989,-5.38
990,-5.06
991,-4.84
992,-4.77
993,-4.85
994,-5.05
995,-5.30
996,-5.51
997,-5.64
998,-5.65
999,-5.60
1000,-5.53
1001,-5.50
1002,-5.55
1003,-5.66
1004,-5.77
1005,-5.85
1006,-5.81
1007,-5.63
1008,-5.29
1009,-4.85
1010,-4.34
1011,-3.87
1012,-3.41
1013,-3.02
1014,-2.60
1015,-2.20
1016,-1.72
1017,-1.20
1018,-0.59
1019,0.02
1020,0.67
1021,1.25
1022,1.82
1023,2.35
1024,2.95
1025,3.57
1026,4.28
1027,4.99
1028,5.77
1029,6.51
1030,7.29
1031,7.99
1032,8.72
1033,9.41
1034,10.18
1035,10.97
1036,11.83
1037,12.64
1038,13.42
1039,14.09
1040,14.64
1041,15.02
1042,15.26
1043,15.32
1044,15.26
1045,15.09
1046,14.85
1047,14.53
1048,14.15
1049,13.71
1050,13.19
1051,12.61
1052,11.95
1053,11.24
1054,10.48
1055,9.74
1056,9.00
1057,8.36
1058,7.79
1059,7.37
1060,7.05
1061,6.88
1062,6.76
1063,6.74
1064,6.71
1065,6.69
1066,6.56
1067,6.33
1068,5.95
1069,5.49
1070,4.91
1071,4.34
1072,3.77
1073,3.29
1074,2.86
1075,2.51
1076,2.18
1077,1.88
1078,1.56
1079,1.21
1080,0.77
1081,0.33
1082,-0.08
1083,-0.37
1084,-0.52
1085,-0.53
1086,-0.40
1087,-0.16
1088,0.15
1089,0.45
1090,0.71
1091,0.94
1092,1.14
1093,1.36
1094,1.63
1095,1.94
1096,2.29
1097,2.65
1098,2.93
1099,3.04
1100,2.91
1101,2.50
1102,1.87
1103,1.11
1104,0.33
1105,-0.34
1106,-0.80
1107,-1.01
1108,-0.99
1109,-0.83
1110,-0.63
1111,-0.51
1112,-0.51
1113,-0.64
1114,-0.80
1115,-0.88
1116,-0.75
1117,-0.36
1118,0.36
1119,1.33
1120,2.50
1121,3.67
1122,4.73
1123,5.55
1124,6.13
1125,6.44
1126,6.55
1127,6.51
1128,6.41
1129,6.30
1130,6.20
1131,6.08
1132,5.95
1133,5.79
1134,5.62
1135,5.43
1136,5.22
1137,5.01
1138,4.81
1139,4.64
1140,4.46
1141,4.32
1142,4.19
1143,4.08
1144,3.95
1145,3.79
1146,3.57
1147,3.31
1148,2.98
1149,2.64
1150,2.23
1151,1.82
1152,1.40
1153,1.03
1154,0.64
1155,0.26
1156,-0.20
1157,-0.71
1158,-1.34
1159,-2.03
1160,-2.82
1161,-3.63
1162,-4.48
1163,-5.26
1164,-5.97
1165,-6.53
1166,-6.97
1167,-7.25
1168,-7.44
1169,-7.52
1170,-7.56
1171,-7.53
1172,-7.46
1173,-7.34
1174,-7.19
1175,-6.99
1176,-6.74
1177,-6.43
1178,-6.08
1179,-5.76
1180,-5.51
1181,-5.38
1182,-5.35
1183,-5.44
1184,-5.60
1185,-5.86
1186,-6.11
1187,-6.32
1188,-6.39
1189,-6.34
1190,-6.15
1191,-5.87
1192,-5.48
1193,-5.03
1194,-4.52
1195,-4.02
1196,-3.49
1197,-2.99
1198,-2.45
1199,-1.91
1200,-1.30
1201,-0.68
1202,0.01
1203,0.70
1204,1.46
1205,2.18
1206,2.91
1207,3.53
1208,4.15
1209,4.68
1210,5.18
1211,5.60
1212,6.04
1213,6.48
1214,6.97
1215,7.44
1216,7.93
1217,8.33
1218,8.64
1219,8.77
1220,8.77
1221,8.62
1222,8.38
1223,8.10
1224,7.87
1225,7.72
1226,7.71
1227,7.78
1228,7.94
1229,8.12
1230,8.28
1231,8.38
1232,8.44
1233,8.51
1234,8.63
1235,8.86
1236,9.20
1237,9.66
1238,10.17
1239,10.67
1240,11.02
1241,11.17
1242,11.04
1243,10.64
1244,9.98
1245,9.18
1246,8.27
1247,7.39
1248,6.56
1249,5.84
1250,5.18
1251,4.60
1252,3.95
1253,3.26
1254,2.43
1255,1.55
1256,0.58
1257,-0.33
1258,-1.20
1259,-1.88
1260,-2.43
1261,-2.77
1262,-3.06
1263,-3.28
1264,-3.59
1265,-3.97
1266,-4.52
1267,-5.15
1268,-5.87
1269,-6.54
1270,-7.20
1271,-7.75
1272,-8.31
1273,-8.81
1274,-9.36
1275,-9.96
1276,-10.68
1277,-11.46
1278,-12.31
1279,-13.10
1280,-13.79
1281,-14.29
1282,-14.62
1283,-14.75
1284,-14.69
1285,-14.47
1286,-14.12
1287,-13.68
1288,-13.17
1289,-12.66
1290,-12.08
1291,-11.50
1292,-10.82
1293,-10.08
1294,-9.19
1295,-8.20
1296,-6.99
1297,-5.68
1298,-4.27
1299,-2.96
1300,-1.78
1301,-0.90
1302,-0.29
1303,-0.02
1304,0.04
1305,-0.08
1306,-0.20
1307,-0.32
1308,-0.32
1309,-0.26
1310,-0.08
1311,0.11
1312,0.35
1313,0.56
1314,0.80
1315,1.07
1316,1.44
1317,1.92
1318,2.57
1319,3.32
1320,4.18
1321,5.06
1322,5.94
1323,6.71
1324,7.36
1325,7.85
1326,8.21
1327,8.40
1328,8.47
1329,8.39
1330,8.22
1331,7.95
1332,7.61
1333,7.20
1334,6.79
1335,6.43
1336,6.18
1337,6.04
1338,6.06
1339,6.21
1340,6.53
1341,6.95
1342,7.45
1343,7.99
1344,8.54
1345,9.09
1346,9.65
1347,10.24
1348,10.85
1349,11.42
1350,11.89
1351,12.21
1352,12.36
1353,12.33
1354,12.11
1355,11.77
1356,11.34
1357,10.91
1358,10.47
1359,10.03
1360,9.49
1361,8.88
1362,8.10
1363,7.21
1364,6.16
1365,5.06
1366,3.91
1367,2.88
1368,1.96
1369,1.23
1370,0.60
1371,0.10
1372,-0.35
1373,-0.67
1374,-0.89
1375,-0.96
1376,-0.89
1377,-0.64
1378,-0.24
1379,0.29
1380,0.87
1381,1.42
1382,1.88
1383,2.22
1384,2.51
1385,2.75
1386,3.03
1387,3.34
1388,3.74
1389,4.17
1390,4.69
1391,5.18
1392,5.68
1393,6.11
1394,6.56
1395,6.99
1396,7.53
1397,8.14
1398,8.91
1399,9.76
1400,10.72
1401,11.68
1402,12.64
1403,13.47
1404,14.24
1405,14.87
1406,15.41
1407,15.83
1408,16.18
1409,16.42
1410,16.60
1411,16.67
1412,16.70
1413,16.66
1414,16.61
1415,16.57
1416,16.60
1417,16.72
1418,16.93
1419,17.22
1420,17.54
1421,17.85
1422,18.08
1423,18.21
1424,18.18
1425,18.02
1426,17.73
1427,17.36
1428,16.91
1429,16.39
1430,15.80
1431,15.19
1432,14.51
1433,13.84
1434,13.13
1435,12.47
1436,11.83
1437,11.30
1438,10.79
1439,10.37
1440,9.92
1441,9.49
1442,8.94
1443,8.36
1444,7.62
1445,6.82
1446,5.89
1447,4.92
1448,3.87
1449,2.86
1450,1.84
1451,0.93
1452,0.08
1453,-0.65
1454,-1.32
1455,-1.87
1456,-2.35
1457,-2.69
1458,-2.96
1459,-3.11
1460,-3.22
1461,-3.27
1462,-3.30
1463,-3.31
1464,-3.33
1465,-3.34
1466,-3.32
1467,-3.22
1468,-3.02
1469,-2.75
1470,-2.44
1471,-2.16
1472,-2.00
1473,-2.00
1474,-2.15
1475,-2.40
1476,-2.66
1477,-2.81
1478,-2.78
1479,-2.55
1480,-2.13
1481,-1.62
1482,-1.13
1483,-0.83
1484,-0.81
1485,-1.12
1486,-1.67
1487,-2.33
1488,-2.96
1489,-3.44
1490,-3.65
1491,-3.56
1492,-3.19
1493,-2.64
1494,-1.96
1495,-1.27
1496,-0.55
1497,0.12
1498,0.80
1499,1.45
1500,2.18
1501,2.94
1502,3.78
1503,4.58
1504,5.42
1505,6.20
1506,7.00
1507,7.73
1508,8.45
1509,9.09
1510,9.77
1511,10.43
1512,11.17
1513,11.90
1514,12.69
1515,13.43
1516,14.18
1517,14.87
1518,15.54
1519,16.10
1520,16.56
1521,16.86
1522,17.05
1523,17.12
1524,17.09
1525,16.98
1526,16.77
1527,16.47
1528,16.07
1529,15.60
1530,15.06
1531,14.50
1532,13.88
1533,13.23
1534,12.52
1535,11.82
1536,11.08
1537,10.38
1538,9.68
1539,9.06
1540,8.50
1541,8.05
1542,7.66
1543,7.36
1544,7.09
1545,6.88
1546,6.67
1547,6.50
1548,6.29
1549,6.14
1550,6.02
1551,5.98
1552,5.91
1553,5.83
1554,5.65
1555,5.34
1556,4.82
1557,4.14
1558,3.34
1559,2.54
1560,1.81
1561,1.23
1562,0.84
1563,0.67
1564,0.70
1565,0.88
1566,1.13
1567,1.39
1568,1.61
1569,1.79
1570,1.96
1571,2.16
1572,2.42
1573,2.74
1574,3.12
1575,3.54
1576,3.95
1577,4.29
1578,4.50
1579,4.52
1580,4.35
1581,3.99
1582,3.48
1583,2.87
1584,2.24
1585,1.66
1586,1.23
1587,0.96
1588,0.90
1589,1.04
1590,1.38
1591,1.87
1592,2.46
1593,3.05
1594,3.58
1595,4.01
1596,4.35
1597,4.61
1598,4.84
1599,5.04
1600,5.26
1601,5.49
1602,5.76
1603,6.04
1604,6.33
1605,6.60
1606,6.85
1607,7.08
1608,7.33
1609,7.59
1610,7.81
1611,7.95
1612,7.97
1613,7.85
1614,7.60
1615,7.26
1616,6.84
1617,6.40
1618,5.98
1619,5.63
1620,5.33
1621,5.12
1622,4.94
1623,4.82
1624,4.69
1625,4.55
1626,4.36
1627,4.15
1628,3.87
1629,3.57
1630,3.20
1631,2.83
1632,2.41
1633,2.01
1634,1.55
1635,1.11
1636,0.63
1637,0.18
1638,-0.31
1639,-0.81
1640,-1.42
1641,-2.09
1642,-2.88
1643,-3.71
1644,-4.58
1645,-5.38
1646,-6.08
1647,-6.58
1648,-6.90
1649,-6.99
1650,-6.91
1651,-6.66
1652,-6.34
1653,-6.01
1654,-5.75
1655,-5.59
1656,-5.53
1657,-5.55
1658,-5.59
1659,-5.64
1660,-5.60
1661,-5.45
1662,-5.11
1663,-4.61
1664,-3.94
1665,-3.20
1666,-2.40
1667,-1.61
1668,-0.85
1669,-0.23
1670,0.31
1671,0.67
1672,0.96
1673,1.13
1674,1.30
1675,1.45
1676,1.72
1677,2.05
1678,2.54
1679,3.09
1680,3.77
1681,4.52
1682,5.35
1683,6.18
1684,7.02
1685,7.78
1686,8.50
1687,9.11
1688,9.69
1689,10.16
1690,10.60
1691,10.97
1692,11.36
1693,11.75
1694,12.17
1695,12.59
1696,13.02
1697,13.42
1698,13.75
1699,13.94
1700,14.00
1701,13.93
1702,13.77
1703,13.53
1704,13.31
1705,13.14
1706,13.13
1707,13.26
1708,13.53
1709,13.84
1710,14.17
1711,14.44
1712,14.61
1713,14.66
1714,14.60
1715,14.50
1716,14.43
1717,14.45
1718,14.56
1719,14.80
1720,15.11
1721,15.44
1722,15.67
1723,15.74
1724,15.58
1725,15.22
1726,14.63
1727,13.91
1728,13.04
1729,12.15
1730,11.19
1731,10.25
1732,9.26
1733,8.28
1734,7.26
1735,6.29
1736,5.31
1737,4.44
1738,3.61
1739,2.93
1740,2.30
1741,1.80
1742,1.29
1743,0.84
1744,0.33
1745,-0.17
1746,-0.74
1747,-1.27
1748,-1.84
1749,-2.34
1750,-2.83
1751,-3.26
1752,-3.72
1753,-4.21
1754,-4.81
1755,-5.49
1756,-6.27
1757,-7.08
1758,-7.93
1759,-8.70
1760,-9.38
1761,-9.89
1762,-10.22
1763,-10.37
1764,-10.32
1765,-10.10
1766,-9.72
1767,-9.23
1768,-8.65
1769,-8.06
1770,-7.45
1771,-6.88
1772,-6.28
1773,-5.67
1774,-4.98
1775,-4.22
1776,-3.31
1777,-2.33
1778,-1.29
1779,-0.32
1780,0.53
1781,1.18
1782,1.65
1783,1.90
1784,2.01
1785,1.96
1786,1.84
1787,1.65
1788,1.44
1789,1.19
1790,0.94
1791,0.69
1792,0.50
1793,0.42
1794,0.51
1795,0.78
1796,1.27
1797,1.92
1798,2.67
1799,3.43
1800,4.15
1801,4.73
1802,5.17
1803,5.45
1804,5.60
1805,5.65
1806,5.66
1807,5.62
1808,5.56
1809,5.46
1810,5.31
1811,5.10
1812,4.81
1813,4.46
1814,4.11
1815,3.77
1816,3.49
1817,3.30
1818,3.27
1819,3.38
1820,3.63
1821,3.95
1822,4.30
1823,4.65
1824,5.03
1825,5.43
1826,5.88
1827,6.40
1828,7.01
1829,7.70
1830,8.45
1831,9.19
1832,9.85
1833,10.35
1834,10.63
1835,10.70
1836,10.54
1837,10.21
1838,9.72
1839,9.12
1840,8.36
1841,7.48
1842,6.41
1843,5.22
1844,3.93
1845,2.68
1846,1.50
1847,0.54
1848,-0.21
1849,-0.67
1850,-0.93
1851,-1.03
1852,-1.09
1853,-1.13
1854,-1.17
1855,-1.17
1856,-1.09
1857,-0.86
1858,-0.43
1859,0.17
1860,0.90
1861,1.64
1862,2.37
1863,2.95
1864,3.42
1865,3.73
1866,3.99
1867,4.22
1868,4.54
1869,4.92
1870,5.44
1871,6.03
1872,6.72
1873,7.40
1874,8.11
1875,8.76
1876,9.45
1877,10.10
1878,10.76
1879,11.36
1880,11.97
1881,12.55
1882,13.15
1883,13.68
1884,14.24
1885,14.77
1886,15.35
1887,15.89
1888,16.42
1889,16.85
1890,17.19
1891,17.41
1892,17.50
1893,17.49
1894,17.39
1895,17.21
1896,16.94
1897,16.61
1898,16.25
1899,15.88
1900,15.48
1901,15.06
1902,14.64
1903,14.29
1904,13.99
1905,13.77
1906,13.54
1907,13.33
1908,13.08
1909,12.83
1910,12.51
1911,12.16
1912,11.75
1913,11.35
1914,10.92
1915,10.53
1916,10.12
1917,9.74
1918,9.29
1919,8.80
1920,8.20
1921,7.54
1922,6.78
1923,5.99
1924,5.13
1925,4.31
1926,3.49
1927,2.76
1928,2.05
1929,1.45
1930,0.87
1931,0.37
1932,-0.16
1933,-0.69
1934,-1.30
1935,-1.92
1936,-2.57
1937,-3.16
1938,-3.70
1939,-4.12
1940,-4.45
1941,-4.64
1942,-4.69
1943,-4.59
1944,-4.38
1945,-4.06
1946,-3.68
1947,-3.22
1948,-2.73
1949,-2.24
1950,-1.86
1951,-1.65
1952,-1.66
1953,-1.90
1954,-2.37
1955,-2.99
1956,-3.67
1957,-4.31
1958,-4.84
1959,-5.21
1960,-5.40
1961,-5.44
1962,-5.40
1963,-5.32
1964,-5.23
1965,-5.15
1966,-5.06
1967,-4.96
1968,-4.80
1969,-4.61
1970,-4.34
1971,-4.03
1972,-3.65
1973,-3.23
1974,-2.73
1975,-2.16
1976,-1.46
1977,-0.68
1978,0.21
1979,1.07
1980,1.93
1981,2.66
1982,3.32
1983,3.81
1984,4.26
1985,4.64
1986,5.14
1987,5.71
1988,6.45
1989,7.25
1990,8.18
1991,9.11
1992,10.11
1993,11.05
1994,11.97
1995,12.77
1996,13.52
1997,14.14
1998,14.71
1999,15.16
2000,15.54
2001,15.84
2002,16.13
2003,16.40
2004,16.64
2005,16.82
2006,16.93
2007,16.97
2008,16.87
2009,16.63
2010,16.20
2011,15.67
2012,15.04
2013,14.36
2014,13.61
2015,12.86
2016,12.08
2017,11.32
2018,10.50
2019,9.68
2020,8.81
2021,8.00
2022,7.24
2023,6.62
2024,6.13
2025,5.82
2026,5.62
2027,5.55
2028,5.52
2029,5.56
2030,5.56
2031,5.56
2032,5.49
2033,5.40
2034,5.25
2035,5.07
2036,4.78
2037,4.40
2038,3.90
2039,3.30
2040,2.62
2041,1.95
2042,1.33
2043,0.85
2044,0.53
2045,0.40
2046,0.45
2047,0.65
2048,0.94
2049,1.28
2050,1.62
2051,1.95
2052,2.26
2053,2.59
2054,2.97
2055,3.41
2056,3.85
2057,4.24
2058,4.55
2059,4.70
2060,4.65
2061,4.33
2062,3.77
2063,3.02
2064,2.21
2065,1.45
2066,0.85
2067,0.51
2068,0.44
2069,0.61
2070,0.95
2071,1.33
2072,1.66
2073,1.88
2074,2.00
2075,2.05
2076,2.10
2077,2.22
2078,2.51
2079,2.98
2080,3.65
2081,4.38
2082,5.11
2083,5.70
2084,6.16
2085,6.46
2086,6.67
2087,6.85
2088,7.10
2089,7.44
2090,7.86
2091,8.27
2092,8.62
2093,8.82
2094,8.87
2095,8.74
2096,8.50
2097,8.19
2098,7.88
2099,7.64
2100,7.51
2101,7.48
2102,7.52
2103,7.60
2104,7.69
2105,7.75
2106,7.76
2107,7.74
2108,7.67
2109,7.58
2110,7.40
2111,7.14
2112,6.76
2113,6.33
2114,5.81
2115,5.28
2116,4.71
2117,4.17
2118,3.63
2119,3.13
2120,2.56
2121,1.97
2122,1.29
2123,0.60
2124,-0.15
2125,-0.87
2126,-1.56
2127,-2.11
2128,-2.53
2129,-2.77
2130,-2.87
2131,-2.81
2132,-2.67
2133,-2.50
2134,-2.35
2135,-2.22
2136,-2.13
2137,-2.06
2138,-2.02
2139,-2.02
2140,-2.04
2141,-2.06
2142,-2.06
2143,-2.08
2144,-2.10
2145,-2.12
2146,-2.10
2147,-2.04
2148,-1.90
2149,-1.68
2150,-1.33
2151,-0.88
2152,-0.33
2153,0.22
2154,0.78
2155,1.27
2156,1.72
2157,2.09
2158,2.48
2159,2.87
2160,3.36
2161,3.88
2162,4.52
2163,5.20
2164,5.98
2165,6.75
2166,7.58
2167,8.35
2168,9.11
2169,9.78
2170,10.46
2171,11.08
2172,11.70
2173,12.25
2174,12.82
2175,13.36
2176,13.89
2177,14.35
2178,14.74
2179,15.00
2180,15.13
2181,15.08
2182,14.88
2183,14.55
2184,14.19
2185,13.87
2186,13.72
2187,13.79
2188,14.12
2189,14.64
2190,15.29
2191,15.96
2192,16.56
2193,17.02
2194,17.26
2195,17.32
2196,17.26
2197,17.17
2198,17.12
2199,17.11
2200,17.13
2201,17.11
2202,16.97
2203,16.70
2204,16.26
2205,15.71
2206,15.05
2207,14.40
2208,13.77
2209,13.26
2210,12.76
2211,12.26
2212,11.62
2213,10.85
2214,9.89
2215,8.87
2216,7.79
2217,6.83
2218,6.01
2219,5.45
2220,5.07
2221,4.89
2222,4.74
2223,4.60
2224,4.29
2225,3.88
2226,3.28
2227,2.64
2228,1.94
2229,1.31
2230,0.66
2231,0.07
2232,-0.55
2233,-1.16
2234,-1.85
2235,-2.58
2236,-3.40
2237,-4.23
2238,-5.08
2239,-5.83
2240,-6.48
2241,-6.95
2242,-7.27
2243,-7.37
2244,-7.24
2245,-6.87
2246,-6.27
2247,-5.55
2248,-4.76
2249,-4.02
2250,-3.36
2251,-2.84
2252,-2.43
2253,-2.11
2254,-1.75
2255,-1.31
2256,-0.67
2257,0.15
2258,1.13
2259,2.11
2260,3.04
2261,3.73
2262,4.18
2263,4.32
2264,4.26
2265,4.06
2266,3.88
2267,3.77
2268,3.82
2269,3.99
2270,4.30
2271,4.65
2272,5.03
2273,5.36
2274,5.70
2275,6.05
2276,6.46
2277,6.93
2278,7.48
2279,8.04
2280,8.61
2281,9.09
2282,9.46
2283,9.68
2284,9.76
2285,9.72
2286,9.62
2287,9.46
2288,9.29
2289,9.09
2290,8.87
2291,8.62
2292,8.33
2293,8.00
2294,7.64
2295,7.25
2296,6.90
2297,6.60
2298,6.44
2299,6.41
2300,6.57
2301,6.88
2302,7.36
2303,7.94
2304,8.59
2305,9.23
2306,9.85
2307,10.43
2308,10.98
2309,11.51
2310,12.01
2311,12.45
2312,12.77
2313,12.94
2314,12.94
2315,12.74
2316,12.34
2317,11.76
2318,11.04
2319,10.25
2320,9.38
2321,8.50
2322,7.57
2323,6.63
2324,5.60
2325,4.58
2326,3.52
2327,2.56
2328,1.67
2329,0.95
2330,0.38
2331,0.01
2332,-0.26
2333,-0.44
2334,-0.61
2335,-0.75
2336,-0.88
2337,-0.94
2338,-0.91
2339,-0.76
2340,-0.48
2341,-0.07
2342,0.43
2343,0.95
2344,1.46
2345,1.89
2346,2.25
2347,2.52
2348,2.75
2349,2.91
2350,3.09
2351,3.27
2352,3.51
2353,3.79
2354,4.21
2355,4.70
2356,5.36
2357,6.10
2358,7.01
2359,7.98
2360,9.02
2361,10.00
2362,10.93
2363,11.72
2364,12.41
2365,12.92
2366,13.31
2367,13.57
2368,13.75
2369,13.84
2370,13.89
2371,13.85
2372,13.76
2373,13.59
2374,13.36
2375,13.07
2376,12.76
2377,12.49
2378,12.28
2379,12.14
2380,12.03
2381,11.93
2382,11.80
2383,11.61
2384,11.33
2385,10.99
2386,10.60
2387,10.25
2388,9.94
2389,9.71
2390,9.52
2391,9.40
2392,9.29
2393,9.17
2394,8.95
2395,8.65
2396,8.24
2397,7.79
2398,7.25
2399,6.72
2400,6.14
2401,5.61
2402,5.03
2403,4.47
2404,3.86
2405,3.27
2406,2.61
2407,1.97
2408,1.29
2409,0.64
2410,-0.05
2411,-0.74
2412,-1.49
2413,-2.22
2414,-2.96
2415,-3.61
2416,-4.19
2417,-4.61
2418,-4.88
2419,-4.93
2420,-4.83
2421,-4.61
2422,-4.41
2423,-4.28
2424,-4.28
2425,-4.39
2426,-4.55
2427,-4.68
2428,-4.70
2429,-4.55
2430,-4.21
2431,-3.72
2432,-3.18
2433,-2.72
2434,-2.46
2435,-2.44
2436,-2.67
2437,-3.06
2438,-3.56
2439,-4.06
2440,-4.49
2441,-4.82
2442,-5.04
2443,-5.19
2444,-5.29
2445,-5.39
2446,-5.45
2447,-5.44
2448,-5.32
2449,-5.06
2450,-4.64
2451,-4.09
2452,-3.41
2453,-2.72
2454,-2.02
2455,-1.41
2456,-0.82
2457,-0.28
2458,0.34
2459,0.95
2460,1.66
2461,2.37
2462,3.17
2463,3.94
2464,4.73
2465,5.40
2466,6.07
2467,6.65
2468,7.27
2469,7.86
2470,8.51
2471,9.14
2472,9.86
2473,10.62
2474,11.47
2475,12.30
2476,13.16
2477,13.94
2478,14.67
2479,15.26
2480,15.71
2481,15.98
2482,16.16
2483,16.25
2484,16.30
2485,16.34
2486,16.38
2487,16.43
2488,16.43
2489,16.35
2490,16.13
2491,15.81
2492,15.30
2493,14.62
2494,13.73
2495,12.72
2496,11.60
2497,10.46
2498,9.27
2499,8.15
2500,7.12
2501,6.33
2502,5.77
2503,5.50
2504,5.42
2505,5.53
2506,5.70
2507,5.92
2508,6.09
2509,6.22
2510,6.24
2511,6.23
2512,6.16
2513,6.11
2514,6.02
2515,5.88
2516,5.65
2517,5.31
2518,4.82
2519,4.23
2520,3.55
2521,2.87
2522,2.24
2523,1.73
2524,1.39
2525,1.23
2526,1.21
2527,1.30
2528,1.43
2529,1.60
2530,1.78
2531,1.99
2532,2.23
2533,2.50
2534,2.80
2535,3.11
2536,3.43
2537,3.72
2538,3.94
2539,4.07
2540,4.13
2541,4.11
2542,4.04
2543,3.92
2544,3.74
2545,3.52
2546,3.25
2547,2.95
2548,2.63
2549,2.35
2550,2.13
2551,1.99
2552,1.93
2553,1.94
2554,2.04
2555,2.19
2556,2.37
2557,2.58
2558,2.90
2559,3.35
2560,3.98
2561,4.71
2562,5.52
2563,6.31
2564,7.06
2565,7.66
2566,8.11
2567,8.39
2568,8.57
2569,8.69
2570,8.81
2571,8.93
2572,9.08
2573,9.21
2574,9.27
2575,9.20
2576,8.98
2577,8.60
2578,8.09
2579,7.54
2580,7.00
2581,6.57
2582,6.31
2583,6.25
2584,6.33
2585,6.50
2586,6.63
2587,6.69
2588,6.61
2589,6.39
2590,6.00
2591,5.51
2592,4.97
2593,4.46
2594,4.00
2595,3.61
2596,3.24
2597,2.92
2598,2.54
2599,2.10
2600,1.57
2601,1.01
2602,0.42
2603,-0.11
2604,-0.61
2605,-1.03
2606,-1.42
2607,-1.77
2608,-2.11
2609,-2.42
2610,-2.71
2611,-2.93
2612,-3.07
2613,-3.08
2614,-2.98
2615,-2.81
2616,-2.62
2617,-2.45
2618,-2.33
2619,-2.26
2620,-2.22
2621,-2.16
2622,-2.05
2623,-1.88
2624,-1.63
2625,-1.34
2626,-1.05
2627,-0.83
2628,-0.70
2629,-0.70
2630,-0.75
2631,-0.83
2632,-0.83
2633,-0.73
2634,-0.44
2635,0.00
2636,0.61
2637,1.28
2638,2.02
2639,2.73
2640,3.43
2641,4.06
2642,4.66
2643,5.17
2644,5.71
2645,6.23
2646,6.88
2647,7.57
2648,8.39
2649,9.23
2650,10.12
2651,10.94
2652,11.71
2653,12.34
2654,12.88
2655,13.30
2656,13.65
2657,13.89
2658,14.08
2659,14.21
2660,14.29
2661,14.27
2662,14.16
2663,13.93
2664,13.66
2665,13.38
2666,13.17
2667,13.09
2668,13.18
2669,13.43
2670,13.84
2671,14.32
2672,14.82
2673,15.25
2674,15.54
2675,15.69
2676,15.71
2677,15.67
2678,15.64
2679,15.67
2680,15.77
2681,15.91
2682,16.05
2683,16.14
2684,16.09
2685,15.87
2686,15.47
2687,14.95
2688,14.32
2689,13.67
2690,12.98
2691,12.33
2692,11.66
2693,10.99
2694,10.22
2695,9.42
2696,8.54
2697,7.71
2698,6.86
2699,6.14
2700,5.49
2701,5.01
2702,4.56
2703,4.18
2704,3.72
2705,3.27
2706,2.73
2707,2.20
2708,1.62
2709,1.10
2710,0.56
2711,0.05
2712,-0.55
2713,-1.21
2714,-2.05
2715,-2.99
2716,-4.06
2717,-5.15
2718,-6.22
2719,-7.13
2720,-7.83
2721,-8.27
2722,-8.49
2723,-8.51
2724,-8.40
2725,-8.19
2726,-7.90
2727,-7.58
2728,-7.21
2729,-6.78
2730,-6.26
2731,-5.67
2732,-5.00
2733,-4.29
2734,-3.50
2735,-2.68
2736,-1.78
2737,-0.91
2738,-0.05
2739,0.71
2740,1.41
2741,1.97
2742,2.42
2743,2.71
2744,2.94
2745,3.06
2746,3.19
2747,3.28
2748,3.39
2749,3.46
2750,3.54
2751,3.57
2752,3.62
2753,3.67
2754,3.84
2755,4.13
2756,4.60
2757,5.21
2758,5.93
2759,6.69
2760,7.41
2761,7.99
2762,8.39
2763,8.58
2764,8.60
2765,8.51
2766,8.33
2767,8.08
2768,7.81
2769,7.54
2770,7.28
2771,6.98
2772,6.62
2773,6.21
2774,5.74
2775,5.27
2776,4.83
2777,4.47
2778,4.24
2779,4.16
2780,4.22
2781,4.41
2782,4.71
2783,5.07
2784,5.50
2785,5.96
2786,6.50
2787,7.10
2788,7.78
2789,8.50
2790,9.25
2791,9.96
2792,10.60
2793,11.09
2794,11.39
2795,11.47
2796,11.35
2797,11.05
2798,10.62
2799,10.11
2800,9.53
2801,8.90
2802,8.18
2803,7.44
2804,6.60
2805,5.72
2806,4.73
2807,3.74
2808,2.74
2809,1.84
2810,1.01
2811,0.34
2812,-0.21
2813,-0.60
2814,-0.91
2815,-1.12
2816,-1.27
2817,-1.31
2818,-1.26
2819,-1.11
2820,-0.85
2821,-0.49
2822,-0.05
2823,0.45
2824,0.97
2825,1.44
2826,1.86
2827,2.16
2828,2.40
2829,2.57
2830,2.78
2831,3.03
2832,3.41
2833,3.87
2834,4.46
2835,5.08
2836,5.75
2837,6.36
2838,6.94
2839,7.39
2840,7.82
2841,8.20
2842,8.65
2843,9.15
2844,9.74
2845,10.37
2846,11.06
2847,11.70
2848,12.25
2849,12.62
2850,12.81
2851,12.80
2852,12.64
2853,12.37
2854,12.10
2855,11.86
2856,11.72
2857,11.69
2858,11.79
2859,11.95
2860,12.13
2861,12.28
2862,12.34
2863,12.35
2864,12.27
2865,12.14
2866,11.97
2867,11.80
2868,11.65
2869,11.52
2870,11.39
2871,11.24
2872,11.00
2873,10.70
2874,10.28
2875,9.80
2876,9.23
2877,8.66
2878,8.06
2879,7.53
2880,7.00
2881,6.54
2882,6.07
2883,5.68
2884,5.28
2885,4.92
2886,4.46
2887,3.93
2888,3.24
2889,2.48
2890,1.59
2891,0.68
2892,-0.26
2893,-1.10
2894,-1.86
2895,-2.46
2896,-2.94
2897,-3.23
2898,-3.43
2899,-3.53
2900,-3.63
2901,-3.70
2902,-3.83
2903,-3.98
2904,-4.20
2905,-4.42
2906,-4.62
2907,-4.72
2908,-4.71
2909,-4.56
2910,-4.28
2911,-3.93
2912,-3.58
2913,-3.35
2914,-3.32
2915,-3.53
2916,-3.94
2917,-4.47
2918,-4.99
2919,-5.37
2920,-5.51
2921,-5.40
2922,-5.05
2923,-4.59
2924,-4.11
2925,-3.74
2926,-3.53
2927,-3.51
2928,-3.60
2929,-3.73
2930,-3.77
2931,-3.66
2932,-3.32
2933,-2.81
2934,-2.12
2935,-1.37
2936,-0.54
2937,0.24
2938,1.04
2939,1.75
2940,2.45
2941,3.04
2942,3.60
2943,4.05
2944,4.50
2945,4.86
2946,5.32
2947,5.81
2948,6.47
2949,7.22
2950,8.15
2951,9.14
2952,10.26
2953,11.38
2954,12.53
2955,13.61
2956,14.65
2957,15.58
2958,16.42
2959,17.10
2960,17.64
2961,17.97
2962,18.14
2963,18.14
2964,18.04
2965,17.84
2966,17.58
2967,17.27
2968,16.90
2969,16.50
2970,16.07
2971,15.63
2972,15.12
2973,14.55
2974,13.88
2975,13.19
2976,12.45
2977,11.73
2978,11.00
2979,10.34
2980,9.71
2981,9.18
2982,8.67
2983,8.26
2984,7.87
2985,7.56
2986,7.26
2987,7.02
2988,6.79
2989,6.62
2990,6.47
2991,6.37
2992,6.23
2993,6.05
2994,5.76
2995,5.40
2996,4.94
2997,4.45
2998,3.92
2999,3.40
3000,2.90
3001,2.45
3002,2.06
3003,1.75
3004,1.52
3005,1.40
3006,1.41
3007,1.57
3008,1.90
3009,2.38
3010,2.99
3011,3.70
3012,4.39
3013,5.00
3014,5.44
3015,5.72
3016,5.80
3017,5.73
3018,5.50
3019,5.17
3020,4.77
3021,4.34
3022,3.88
3023,3.39
3024,2.84
3025,2.26
3026,1.67
3027,1.12
3028,0.67
3029,0.35
3030,0.20
3031,0.24
3032,0.42
3033,0.66
3034,0.90
3035,1.11
3036,1.31
3037,1.50
3038,1.75
3039,2.08
3040,2.59
3041,3.27
3042,4.11
3043,4.98
3044,5.82
3045,6.50
3046,7.02
3047,7.36
3048,7.63
3049,7.85
3050,8.11
3051,8.42
3052,8.80
3053,9.16
3054,9.43
3055,9.52
3056,9.43
3057,9.15
3058,8.74
3059,8.30
3060,7.92
3061,7.71
3062,7.69
3063,7.89
3064,8.21
3065,8.59
3066,8.87
3067,9.00
3068,8.87
3069,8.52
3070,7.92
3071,7.17
3072,6.34
3073,5.56
3074,4.82
3075,4.21
3076,3.67
3077,3.21
3078,2.73
3079,2.25
3080,1.64
3081,0.97
3082,0.18
3083,-0.60
3084,-1.37
3085,-2.03
3086,-2.61
3087,-3.05
3088,-3.37
3089,-3.54
3090,-3.61
3091,-3.56
3092,-3.45
3093,-3.27
3094,-3.06
3095,-2.82
3096,-2.60
3097,-2.40
3098,-2.26
3099,-2.15
3100,-2.08
3101,-2.03
3102,-1.97
3103,-1.90
3104,-1.79
3105,-1.69
3106,-1.59
3107,-1.54
3108,-1.52
3109,-1.54
3110,-1.50
3111,-1.43
3112,-1.25
3113,-0.99
3114,-0.61
3115,-0.18
3116,0.34
3117,0.88
3118,1.50
3119,2.14
3120,2.85
3121,3.57
3122,4.34
3123,5.07
3124,5.80
3125,6.42
3126,7.00
3127,7.45
3128,7.88
3129,8.24
3130,8.66
3131,9.12
3132,9.71
3133,10.35
3134,11.08
3135,11.79
3136,12.49
3137,13.11
3138,13.65
3139,14.06
3140,14.36
3141,14.53
3142,14.62
3143,14.61
3144,14.54
3145,14.39
3146,14.22
3147,14.05
3148,13.94
3149,13.90
3150,13.96
3151,14.11
3152,14.34
3153,14.61
3154,14.90
3155,15.17
3156,15.41
3157,15.63
3158,15.80
3159,15.93
3160,16.02
3161,16.06
3162,16.02
3163,15.88
3164,15.57
3165,15.12
3166,14.52
3167,13.90
3168,13.24
3169,12.62
3170,11.97
3171,11.35
3172,10.66
3173,9.94
3174,9.06
3175,8.11
3176,7.05
3177,6.04
3178,5.04
3179,4.23
3180,3.55
3181,3.07
3182,2.63
3183,2.27
3184,1.83
3185,1.36
3186,0.73
3187,0.06
3188,-0.71
3189,-1.43
3190,-2.15
3191,-2.77
3192,-3.41
3193,-3.98
3194,-4.60
3195,-5.23
3196,-5.92
3197,-6.63
3198,-7.38
3199,-8.10
3200,-8.82
3201,-9.44
3202,-9.95
3203,-10.31
3204,-10.52
3205,-10.56
3206,-10.43
3207,-10.15
3208,-9.74
3209,-9.28
3210,-8.79
3211,-8.33
3212,-7.89
3213,-7.47
3214,-6.99
3215,-6.46
3216,-5.79
3217,-5.02
3218,-4.13
3219,-3.24
3220,-2.39
3221,-1.72
3222,-1.24
3223,-0.99
3224,-0.88
3225,-0.88
3226,-0.84
3227,-0.75
3228,-0.53
3229,-0.24
3230,0.12
3231,0.42
3232,0.67
3233,0.82
3234,0.95
3235,1.07
3236,1.27
3237,1.60
3238,2.14
3239,2.84
3240,3.66
3241,4.48
3242,5.19
3243,5.70
3244,5.98
3245,6.05
3246,5.96
3247,5.80
3248,5.64
3249,5.50
3250,5.40
3251,5.27
3252,5.06
3253,4.71
3254,4.23
3255,3.64
3256,3.01
3257,2.43
3258,2.00
3259,1.82
3260,1.92
3261,2.28
3262,2.85
3263,3.52
3264,4.18
3265,4.77
3266,5.26
3267,5.67
3268,6.05
3269,6.43
3270,6.86
3271,7.32
3272,7.81
3273,8.27
3274,8.62
3275,8.79
3276,8.73
3277,8.44
3278,7.97
3279,7.40
3280,6.78
3281,6.18
3282,5.56
3283,4.97
3284,4.30
3285,3.56
3286,2.66
3287,1.68
3288,0.62
3289,-0.39
3290,-1.33
3291,-2.09
3292,-2.71
3293,-3.14
3294,-3.47
3295,-3.68
3296,-3.83
3297,-3.90
3298,-3.92
3299,-3.87
3300,-3.74
3301,-3.52
3302,-3.23
3303,-2.93
3304,-2.63
3305,-2.38
3306,-2.18
3307,-2.04
3308,-1.89
3309,-1.72
3310,-1.43
3311,-1.08
3312,-0.59
3313,-0.03
3314,0.62
3315,1.26
3316,1.93
3317,2.56
3318,3.21
3319,3.83
3320,4.50
3321,5.17
3322,5.90
3323,6.60
3324,7.31
3325,7.92
3326,8.50
3327,8.98
3328,9.40
3329,9.71
3330,9.98
3331,10.18
3332,10.35
3333,10.44
3334,10.50
3335,10.49
3336,10.46
3337,10.40
3338,10.38
3339,10.37
3340,10.40
3341,10.46
3342,10.54
3343,10.62
3344,10.66
3345,10.63
3346,10.54
3347,10.42
3348,10.28
3349,10.16
3350,10.03
3351,9.90
3352,9.73
3353,9.53
3354,9.26
3355,8.96
3356,8.58
3357,8.21
3358,7.81
3359,7.48
3360,7.18
3361,6.97
3362,6.79
3363,6.64
3364,6.43
3365,6.15
3366,5.72
3367,5.18
3368,4.49
3369,3.74
3370,2.91
3371,2.10
3372,1.29
3373,0.57
3374,-0.08
3375,-0.61
3376,-1.06
3377,-1.37
3378,-1.60
3379,-1.73
3380,-1.80
3381,-1.81
3382,-1.77
3383,-1.71
3384,-1.65
3385,-1.60
3386,-1.55
3387,-1.46
3388,-1.33
3389,-1.17
3390,-0.98
3391,-0.78
3392,-0.59
3393,-0.49
3394,-0.51
3395,-0.69
3396,-0.99
3397,-1.36
3398,-1.73
3399,-2.02
3400,-2.15
3401,-2.10
3402,-1.87
3403,-1.58
3404,-1.31
3405,-1.17
3406,-1.21
3407,-1.42
3408,-1.71
3409,-2.01
3410,-2.20
3411,-2.21
3412,-1.97
3413,-1.52
3414,-0.92
3415,-0.30
3416,0.34
3417,0.89
3418,1.39
3419,1.82
3420,2.28
3421,2.75
3422,3.32
3423,3.90
3424,4.54
3425,5.15
3426,5.80
3427,6.38
3428,6.99
3429,7.55
3430,8.17
3431,8.78
3432,9.49
3433,10.19
3434,10.93
3435,11.59
3436,12.26
3437,12.87
3438,13.50
3439,14.11
3440,14.69
3441,15.21
3442,15.68
3443,16.05
3444,16.31
3445,16.42
3446,16.36
3447,16.15
3448,15.80
3449,15.34
3450,14.77
3451,14.14
3452,13.41
3453,12.61
3454,11.70
3455,10.76
3456,9.77
3457,8.82
3458,7.90
3459,7.13
3460,6.46
3461,5.96
3462,5.52
3463,5.19
3464,4.86
3465,4.58
3466,4.25
3467,3.94
3468,3.62
3469,3.36
3470,3.12
3471,2.96
3472,2.82
3473,2.72
3474,2.56
3475,2.38
3476,2.13
3477,1.83
3478,1.48
3479,1.11
3480,0.74
3481,0.40
3482,0.07
3483,-0.20
3484,-0.45
3485,-0.66
3486,-0.85
3487,-1.01
3488,-1.15
3489,-1.24
3490,-1.26
3491,-1.22
3492,-1.10
3493,-0.88
3494,-0.59
3495,-0.22
3496,0.16
3497,0.51
3498,0.80
3499,1.01
3500,1.10
3501,1.08
3502,0.92
3503,0.60
3504,0.13
3505,-0.49
3506,-1.19
3507,-1.93
3508,-2.65
3509,-3.23
3510,-3.63
3511,-3.79
3512,-3.75
3513,-3.57
3514,-3.29
3515,-3.02
3516,-2.81
3517,-2.68
3518,-2.58
3519,-2.42
3520,-2.08
3521,-1.54
3522,-0.74
3523,0.20
3524,1.23
3525,2.18
3526,3.01
3527,3.61
3528,4.02
3529,4.22
3530,4.32
3531,4.35
3532,4.42
3533,4.50
3534,4.61
3535,4.70
3536,4.77
3537,4.77
3538,4.74
3539,4.71
3540,4.71
3541,4.75
3542,4.77
3543,4.76
3544,4.71
3545,4.61
3546,4.43
3547,4.19
3548,3.91
3549,3.65
3550,3.39
3551,3.16
3552,2.91
3553,2.64
3554,2.29
3555,1.86
3556,1.33
3557,0.76
3558,0.14
3559,-0.45
3560,-1.04
3561,-1.61
3562,-2.21
3563,-2.78
3564,-3.36
3565,-3.91
3566,-4.44
3567,-4.90
3568,-5.28
3569,-5.51
3570,-5.60
3571,-5.54
3572,-5.35
3573,-5.04
3574,-4.65
3575,-4.20
3576,-3.75
3577,-3.34
3578,-2.99
3579,-2.71
3580,-2.50
3581,-2.37
3582,-2.28
3583,-2.21
3584,-2.14
3585,-2.07
3586,-1.98
3587,-1.91
3588,-1.85
3589,-1.82
3590,-1.76
3591,-1.69
3592,-1.52
3593,-1.28
3594,-0.93
3595,-0.53
3596,-0.07
3597,0.38
3598,0.84
3599,1.26
3600,1.71
3601,2.13
3602,2.61
3603,3.07
3604,3.59
3605,4.12
3606,4.75
3607,5.40
3608,6.16
3609,6.94
3610,7.82
3611,8.69
3612,9.58
3613,10.37
3614,11.08
3615,11.62
3616,12.05
3617,12.33
3618,12.53
3619,12.67
3620,12.82
3621,12.98
3622,13.15
3623,13.28
3624,13.36
3625,13.34
3626,13.22
3627,12.97
3628,12.66
3629,12.36
3630,12.17
3631,12.13
3632,12.29
3633,12.60
3634,13.05
3635,13.57
3636,14.09
3637,14.59
3638,15.03
3639,15.38
3640,15.67
3641,15.91
3642,16.11
3643,16.27
3644,16.33
3645,16.25
3646,15.99
3647,15.56
3648,14.94
3649,14.25
3650,13.50
3651,12.81
3652,12.13
3653,11.51
3654,10.86
3655,10.21
3656,9.45
3657,8.63
3658,7.71
3659,6.85
3660,6.02
3661,5.40
3662,4.94
3663,4.74
3664,4.69
3665,4.76
3666,4.80
3667,4.78
3668,4.58
3669,4.24
3670,3.70
3671,3.07
3672,2.33
3673,1.61
3674,0.89
3675,0.23
3676,-0.41
3677,-0.99
3678,-1.57
3679,-2.12
3680,-2.65
3681,-3.13
3682,-3.55
3683,-3.86
3684,-4.05
3685,-4.08
3686,-3.96
3687,-3.72
3688,-3.38
3689,-3.00
3690,-2.56
3691,-2.10
3692,-1.61
3693,-1.10
3694,-0.52
3695,0.11
3696,0.85
3697,1.65
3698,2.52
3699,3.37
3700,4.18
3701,4.85
3702,5.41
3703,5.77
3704,5.98
3705,6.02
3706,6.00
3707,5.95
3708,5.97
3709,6.02
3710,6.19
3711,6.38
3712,6.63
3713,6.85
3714,7.06
3715,7.24
3716,7.46
3717,7.71
3718,8.09
3719,8.59
3720,9.24
3721,9.99
3722,10.78
3723,11.49
3724,12.05
3725,12.40
3726,12.49
3727,12.32
3728,11.92
3729,11.34
3730,10.67
3731,9.96
3732,9.27
3733,8.61
3734,8.00
3735,7.44
3736,6.95
3737,6.56
3738,6.29
3739,6.19
3740,6.27
3741,6.54
3742,6.97
3743,7.51
3744,8.13
3745,8.76
3746,9.35
3747,9.86
3748,10.29
3749,10.64
3750,10.97
3751,11.31
3752,11.68
3753,12.06
3754,12.41
3755,12.67
3756,12.78
3757,12.72
3758,12.43
3759,11.95
3760,11.29
3761,10.54
3762,9.70
3763,8.86
3764,7.99
3765,7.17
3766,6.34
3767,5.57
3768,4.79
3769,4.08
3770,3.41
3771,2.83
3772,2.27
3773,1.74
3774,1.20
3775,0.68
3776,0.21
3777,-0.13
3778,-0.33
3779,-0.29
3780,-0.02
3781,0.49
3782,1.17
3783,1.91
3784,2.57
3785,3.05
3786,3.30
3787,3.30
3788,3.14
3789,2.88
3790,2.66
3791,2.53
3792,2.62
3793,2.91
3794,3.42
3795,4.05
3796,4.82
3797,5.59
3798,6.40
3799,7.17
3800,7.93
3801,8.62
3802,9.28
3803,9.89
3804,10.54
3805,11.18
3806,11.84
3807,12.41
3808,12.94
3809,13.35
3810,13.65
3811,13.80
3812,13.85
3813,13.82
3814,13.74
3815,13.64
3816,13.56
3817,13.48
3818,13.42
3819,13.37
3820,13.28
3821,13.15
3822,12.96
3823,12.72
3824,12.44
3825,12.18
3826,11.93
3827,11.71
3828,11.50
3829,11.31
3830,11.13
3831,10.98
3832,10.86
3833,10.83
3834,10.86
3835,10.99
3836,11.08
3837,11.12
3838,10.99
3839,10.70
3840,10.15
3841,9.38
3842,8.37
3843,7.27
3844,6.14
3845,5.12
3846,4.17
3847,3.39
3848,2.72
3849,2.20
3850,1.69
3851,1.22
3852,0.66
3853,0.09
3854,-0.61
3855,-1.34
3856,-2.12
3857,-2.85
3858,-3.53
3859,-4.08
3860,-4.53
3861,-4.82
3862,-5.00
3863,-5.06
3864,-5.07
3865,-5.04
3866,-4.98
3867,-4.87
3868,-4.71
3869,-4.45
3870,-4.10
3871,-3.67
3872,-3.18
3873,-2.70
3874,-2.32
3875,-2.11
3876,-2.10
3877,-2.31
3878,-2.65
3879,-3.02
3880,-3.32
3881,-3.49
3882,-3.51
3883,-3.45
3884,-3.35
3885,-3.28
3886,-3.23
3887,-3.25
3888,-3.26
3889,-3.22
3890,-3.00
3891,-2.58
3892,-1.92
3893,-1.12
3894,-0.19
3895,0.72
3896,1.56
3897,2.22
3898,2.73
3899,3.05
3900,3.35
3901,3.61
3902,3.95
3903,4.30
3904,4.75
3905,5.22
3906,5.80
3907,6.40
3908,7.10
3909,7.81
3910,8.62
3911,9.44
3912,10.38
3913,11.31
3914,12.30
3915,13.24
3916,14.19
3917,15.05
3918,15.89
3919,16.65
3920,17.41
3921,18.12
3922,18.79
3923,19.35
3924,19.81
3925,20.09
3926,20.19
3927,20.08
3928,19.78
3929,19.28
3930,18.61
3931,17.84
3932,16.98
3933,16.14
3934,15.29
3935,14.48
3936,13.66
3937,12.86
3938,12.06
3939,11.32
3940,10.57
3941,9.88
3942,9.21
3943,8.69
3944,8.29
3945,8.05
3946,7.89
3947,7.86
3948,7.87
3949,7.98
3950,8.08
3951,8.17
3952,8.17
3953,8.11
3954,7.93
3955,7.64
3956,7.20
3957,6.66
3958,6.00
3959,5.29
3960,4.58
3961,3.94
3962,3.39
3963,2.99
3964,2.73
3965,2.60
3966,2.58
3967,2.64
3968,2.77
3969,2.94
3970,3.11
3971,3.31
3972,3.53
3973,3.80
3974,4.11
3975,4.46
3976,4.83
3977,5.19
3978,5.50
3979,5.72
3980,5.81
3981,5.77
3982,5.56
3983,5.21
3984,4.71
3985,4.13
3986,3.48
3987,2.85
3988,2.29
3989,1.87
3990,1.60
3991,1.50
3992,1.55
3993,1.72
3994,1.94
3995,2.15
3996,2.34
3997,2.51
3998,2.71
3999,2.96
4000,3.37
4001,3.96
4002,4.76
4003,5.65
4004,6.59
4005,7.41
4006,8.09
4007,8.55
4008,8.85
4009,9.01
4010,9.15
4011,9.30
4012,9.52
4013,9.77
4014,9.99
4015,10.11
4016,10.09
4017,9.88
4018,9.49
4019,8.99
4020,8.44
4021,7.93
4022,7.50
4023,7.21
4024,7.03
4025,6.94
4026,6.86
4027,6.82
4028,6.75
4029,6.71
4030,6.61
4031,6.48
4032,6.25
4033,5.96
4034,5.56
4035,5.10
4036,4.53
4037,3.92
4038,3.27
4039,2.66
4040,2.03
4041,1.44
4042,0.81
4043,0.18
4044,-0.51
4045,-1.20
4046,-1.91
4047,-2.55
4048,-3.10
4049,-3.46
4050,-3.65
4051,-3.64
4052,-3.49
4053,-3.24
4054,-2.95
4055,-2.65
4056,-2.37
4057,-2.13
4058,-1.94
4059,-1.81
4060,-1.72
4061,-1.66
4062,-1.63
4063,-1.64
4064,-1.64
4065,-1.67
4066,-1.67
4067,-1.65
4068,-1.56
4069,-1.41
4070,-1.14
4071,-0.76
4072,-0.24
4073,0.37
4074,1.07
4075,1.78
4076,2.47
4077,3.09
4078,3.67
4079,4.12
4080,4.45
4081,4.63
4082,4.77
4083,4.86
4084,5.01
4085,5.20
4086,5.54
4087,5.98
4088,6.59
4089,7.26
4090,8.04
4091,8.82
4092,9.61
4093,10.34
4094,11.01
4095,11.56
4096,12.04
4097,12.40
4098,12.71
4099,12.94
4100,13.12
4101,13.21
4102,13.28
4103,13.29
4104,13.30
4105,13.29
4106,13.31
4107,13.33
4108,13.39
4109,13.47
4110,13.62
4111,13.82
4112,14.09
4113,14.37
4114,14.66
4115,14.91
4116,15.11
4117,15.24
4118,15.34
4119,15.44
4120,15.58
4121,15.79
4122,16.08
4123,16.40
4124,16.67
4125,16.81
4126,16.73
4127,16.44
4128,15.89
4129,15.18
4130,14.34
4131,13.54
4132,12.79
4133,12.17
4134,11.59
4135,11.07
4136,10.45
4137,9.74
4138,8.84
4139,7.84
4140,6.71
4141,5.62
4142,4.57
4143,3.68
4144,2.88
4145,2.26
4146,1.68
4147,1.20
4148,0.70
4149,0.25
4150,-0.26
4151,-0.74
4152,-1.29
4153,-1.82
4154,-2.43
4155,-3.03
4156,-3.70
4157,-4.35
4158,-5.07
4159,-5.81
4160,-6.59
4161,-7.37
4162,-8.12
4163,-8.81
4164,-9.42
4165,-9.88
4166,-10.15
4167,-10.17
4168,-9.92
4169,-9.41
4170,-8.66
4171,-7.77
4172,-6.78
4173,-5.83
4174,-4.93
4175,-4.15
4176,-3.43
4177,-2.78
4178,-2.10
4179,-1.42
4180,-0.64
4181,0.15
4182,0.97
4183,1.69
4184,2.34
4185,2.83
4186,3.21
4187,3.41
4188,3.54
4189,3.59
4190,3.67
4191,3.73
4192,3.84
4193,3.96
4194,4.15
4195,4.36
4196,4.62
4197,4.90
4198,5.23
4199,5.60
4200,6.02
4201,6.45
4202,6.88
4203,7.29
4204,7.64
4205,7.89
4206,8.04
4207,8.05
4208,7.94
4209,7.74
4210,7.48
4211,7.18
4212,6.86
4213,6.50
4214,6.10
4215,5.66
4216,5.22
4217,4.78
4218,4.38
4219,4.07
4220,3.93
4221,4.00
4222,4.29
4223,4.78
4224,5.40
4225,6.07
4226,6.69
4227,7.19
4228,7.59
4229,7.87
4230,8.13
4231,8.39
4232,8.72
4233,9.11
4234,9.53
4235,9.93
4236,10.23
4237,10.38
4238,10.30
4239,10.02
4240,9.53
4241,8.92
4242,8.22
4243,7.52
4244,6.77
4245,6.03
4246,5.21
4247,4.35
4248,3.42
4249,2.49
4250,1.55
4251,0.71
4252,-0.05
4253,-0.65
4254,-1.13
4255,-1.44
4256,-1.67
4257,-1.80
4258,-1.90
4259,-1.96
4260,-2.00
4261,-1.98
4262,-1.89
4263,-1.71
4264,-1.45
4265,-1.15
4266,-0.82
4267,-0.51
4268,-0.17
4269,0.15
4270,0.49
4271,0.82
4272,1.20
4273,1.58
4274,2.03
4275,2.50
4276,3.04
4277,3.59
4278,4.19
4279,4.79
4280,5.45
4281,6.12
4282,6.84
4283,7.51
4284,8.19
4285,8.82
4286,9.44
4287,10.00
4288,10.52
4289,10.94
4290,11.29
4291,11.54
4292,11.72
4293,11.80
4294,11.80
4295,11.67
4296,11.47
4297,11.22
4298,11.00
4299,10.82
4300,10.73
4301,10.71
4302,10.78
4303,10.90
4304,11.04
4305,11.17
4306,11.25
4307,11.28
4308,11.26
4309,11.22
4310,11.15
4311,11.08
4312,11.00
4313,10.90
4314,10.75
4315,10.56
4316,10.26
4317,9.92
4318,9.48
4319,9.02
4320,8.46
4321,7.89
4322,7.23
4323,6.55
4324,5.74
4325,4.85
4326,3.82
4327,2.74
4328,1.57
4329,0.44
4330,-0.67
4331,-1.62
4332,-2.47
4333,-3.13
4334,-3.70
4335,-4.11
4336,-4.47
4337,-4.76
4338,-5.09
4339,-5.41
4340,-5.73
4341,-5.99
4342,-6.22
4343,-6.36
4344,-6.43
4345,-6.41
4346,-6.33
4347,-6.20
4348,-6.06
4349,-5.90
4350,-5.69
4351,-5.41
4352,-5.06
4353,-4.68
4354,-4.32
4355,-4.04
4356,-3.92
4357,-3.98
4358,-4.21
4359,-4.53
4360,-4.86
4361,-5.11
4362,-5.20
4363,-5.11
4364,-4.86
4365,-4.55
4366,-4.23
4367,-4.01
4368,-3.90
4369,-3.90
4370,-3.92
4371,-3.89
4372,-3.71
4373,-3.38
4374,-2.85
4375,-2.23
4376,-1.53
4377,-0.86
4378,-0.24
4379,0.28
4380,0.78
4381,1.23
4382,1.74
4383,2.24
4384,2.80
4385,3.32
4386,3.88
4387,4.41
4388,4.99
4389,5.54
4390,6.19
4391,6.86
4392,7.67
4393,8.52
4394,9.45
4395,10.35
4396,11.25
4397,12.05
4398,12.81
4399,13.46
4400,14.04
4401,14.52
4402,14.94
4403,15.30
4404,15.60
4405,15.84
4406,16.00
4407,16.06
4408,16.00
4409,15.81
4410,15.48
4411,15.00
4412,14.37
4413,13.65
4414,12.84
4415,12.01
4416,11.13
4417,10.28
4418,9.43
4419,8.68
4420,7.97
4421,7.36
4422,6.81
4423,6.35
4424,5.95
4425,5.66
4426,5.41
4427,5.26
4428,5.15
4429,5.13
4430,5.18
4431,5.33
4432,5.51
4433,5.72
4434,5.88
4435,6.00
4436,6.00
4437,5.84
4438,5.47
4439,4.90
4440,4.11
4441,3.19
4442,2.20
4443,1.26
4444,0.42
4445,-0.22
4446,-0.65
4447,-0.82
4448,-0.76
4449,-0.50
4450,-0.11
4451,0.37
4452,0.87
4453,1.40
4454,1.92
4455,2.43
4456,2.93
4457,3.41
4458,3.83
4459,4.15
4460,4.35
4461,4.41
4462,4.30
4463,4.02
4464,3.58
4465,3.02
4466,2.37
4467,1.67
4468,0.95
4469,0.27
4470,-0.32
4471,-0.76
4472,-1.00
4473,-1.03
4474,-0.87
4475,-0.59
4476,-0.20
4477,0.21
4478,0.64
4479,1.05
4480,1.50
4481,2.00
4482,2.66
4483,3.41
4484,4.27
4485,5.14
4486,6.04
4487,6.88
4488,7.63
4489,8.23
4490,8.73
4491,9.15
4492,9.55
4493,9.89
4494,10.14
4495,10.21
4496,10.06
4497,9.64
4498,8.99
4499,8.16
4500,7.26
4501,6.42
4502,5.76
4503,5.36
4504,5.22
4505,5.29
4506,5.40
4507,5.49
4508,5.42
4509,5.22
4510,4.85
4511,4.41
4512,3.93
4513,3.53
4514,3.20
4515,2.98
4516,2.80
4517,2.64
4518,2.39
4519,2.03
4520,1.50
4521,0.90
4522,0.22
4523,-0.42
4524,-1.07
4525,-1.64
4526,-2.15
4527,-2.56
4528,-2.93
4529,-3.23
4530,-3.50
4531,-3.70
4532,-3.86
4533,-3.92
4534,-3.92
4535,-3.81
4536,-3.62
4537,-3.41
4538,-3.23
4539,-3.14
4540,-3.15
4541,-3.26
4542,-3.43
4543,-3.63
4544,-3.74
4545,-3.70
4546,-3.46
4547,-3.04
4548,-2.48
4549,-1.88
4550,-1.32
4551,-0.91
4552,-0.70
4553,-0.71
4554,-0.89
4555,-1.16
4556,-1.39
4557,-1.54
4558,-1.47
4559,-1.23
4560,-0.76
4561,-0.16
4562,0.57
4563,1.32
4564,2.12
4565,2.90
4566,3.68
4567,4.43
4568,5.20
4569,5.93
4570,6.66
4571,7.28
4572,7.88
4573,8.41
4574,8.98
4575,9.54
4576,10.18
4577,10.81
4578,11.45
4579,12.01
4580,12.49
4581,12.80
4582,12.92
4583,12.85
4584,12.67
4585,12.41
4586,12.16
4587,11.93
4588,11.76
4589,11.63
4590,11.58
4591,11.55
4592,11.59
4593,11.66
4594,11.77
4595,11.91
4596,12.14
4597,12.45
4598,12.85
4599,13.30
4600,13.78
4601,14.28
4602,14.78
4603,15.27
4604,15.66
4605,15.87
4606,15.82
4607,15.51
4608,14.92
4609,14.12
4610,13.13
4611,12.11
4612,11.07
4613,10.13
4614,9.24
4615,8.44
4616,7.62
4617,6.82
4618,5.95
4619,5.11
4620,4.23
4621,3.43
4622,2.64
4623,1.98
4624,1.36
4625,0.87
4626,0.37
4627,-0.08
4628,-0.60
4629,-1.09
4630,-1.66
4631,-2.20
4632,-2.82
4633,-3.42
4634,-4.09
4635,-4.74
4636,-5.45
4637,-6.16
4638,-6.89
4639,-7.57
4640,-8.21
4641,-8.77
4642,-9.29
4643,-9.73
4644,-10.08
4645,-10.28
4646,-10.30
4647,-10.14
4648,-9.80
4649,-9.30
4650,-8.67
4651,-8.01
4652,-7.33
4653,-6.70
4654,-6.03
4655,-5.29
4656,-4.40
4657,-3.39
4658,-2.22
4659,-1.01
4660,0.22
4661,1.25
4662,2.03
4663,2.44
4664,2.56
4665,2.38
4666,2.06
4667,1.68
4668,1.40
4669,1.25
4670,1.28
4671,1.41
4672,1.64
4673,1.90
4674,2.19
4675,2.47
4676,2.76
4677,3.09
4678,3.46
4679,3.88
4680,4.33
4681,4.80
4682,5.27
4683,5.68
4684,6.01
4685,6.22
4686,6.34
4687,6.36
4688,6.29
4689,6.16
4690,6.00
4691,5.83
4692,5.64
4693,5.40
4694,5.12
4695,4.81
4696,4.45
4697,4.06
4698,3.66
4699,3.28
4700,2.97
4701,2.76
4702,2.73
4703,2.86
4704,3.15
4705,3.52
4706,3.96
4707,4.41
4708,4.84
4709,5.21
4710,5.54
4711,5.85
4712,6.19
4713,6.59
4714,7.06
4715,7.56
4716,8.04
4717,8.44
4718,8.66
4719,8.68
4720,8.50
4721,8.16
4722,7.64
4723,6.98
4724,6.17
4725,5.31
4726,4.37
4727,3.41
4728,2.41
4729,1.45
4730,0.52
4731,-0.28
4732,-0.97
4733,-1.49
4734,-1.90
4735,-2.19
4736,-2.42
4737,-2.57
4738,-2.67
4739,-2.69
4740,-2.62
4741,-2.45
4742,-2.19
4743,-1.85
4744,-1.43
4745,-1.00
4746,-0.56
4747,-0.16
4748,0.20
4749,0.50
4750,0.80
4751,1.07
4752,1.35
4753,1.61
4754,1.90
4755,2.20
4756,2.56
4757,2.93
4758,3.38
4759,3.89
4760,4.51
4761,5.18
4762,5.94
4763,6.71
4764,7.51
4765,8.26
4766,8.98
4767,9.59
4768,10.15
4769,10.60
4770,10.99
4771,11.29
4772,11.55
4773,11.70
4774,11.79
4775,11.76
4776,11.68
4777,11.54
4778,11.37
4779,11.18
4780,11.02
4781,10.92
4782,10.88
4783,10.89
4784,10.88
4785,10.83
4786,10.70
4787,10.51
4788,10.24
4789,9.91
4790,9.55
4791,9.22
4792,8.94
4793,8.73
4794,8.53
4795,8.36
4796,8.12
4797,7.85
4798,7.49
4799,7.09
4800,6.59
4801,6.10
4802,5.56
4803,5.08
4804,4.57
4805,4.09
4806,3.51
4807,2.89
4808,2.15
4809,1.37
4810,0.51
4811,-0.32
4812,-1.15
4813,-1.89
4814,-2.59
4815,-3.21
4816,-3.81
4817,-4.35
4818,-4.88
4819,-5.35
4820,-5.79
4821,-6.12
4822,-6.37
4823,-6.49
4824,-6.55
4825,-6.54
4826,-6.51
4827,-6.46
4828,-6.42
4829,-6.38
4830,-6.30
4831,-6.13
4832,-5.87
4833,-5.52
4834,-5.14
4835,-4.79
4836,-4.51
4837,-4.35
4838,-4.30
4839,-4.35
4840,-4.46
4841,-4.59
4842,-4.69
4843,-4.75
4844,-4.76
4845,-4.75
4846,-4.72
4847,-4.70
4848,-4.67
4849,-4.65
4850,-4.59
4851,-4.48
4852,-4.26
4853,-3.96
4854,-3.54
4855,-3.04
4856,-2.44
4857,-1.79
4858,-1.07
4859,-0.36
4860,0.41
4861,1.13
4862,1.88
4863,2.56
4864,3.26
4865,3.87
4866,4.50
4867,5.06
4868,5.64
4869,6.17
4870,6.75
4871,7.29
4872,7.88
4873,8.47
4874,9.16
4875,9.89
4876,10.71
4877,11.51
4878,12.35
4879,13.13
4880,13.87
4881,14.48
4882,14.96
4883,15.28
4884,15.49
4885,15.61
4886,15.63
4887,15.55
4888,15.34
4889,15.04
4890,14.66
4891,14.24
4892,13.73
4893,13.19
4894,12.57
4895,11.93
4896,11.21
4897,10.45
4898,9.58
4899,8.67
4900,7.67
4901,6.71
4902,5.80
4903,5.03
4904,4.38
4905,3.94
4906,3.64
4907,3.49
4908,3.38
4909,3.34
4910,3.28
4911,3.28
4912,3.24
4913,3.25
4914,3.25
4915,3.25
4916,3.12
4917,2.86
4918,2.42
4919,1.82
4920,1.05
4921,0.21
4922,-0.60
4923,-1.25
4924,-1.69
4925,-1.88
4926,-1.84
4927,-1.64
4928,-1.36
4929,-1.12
4930,-0.96
4931,-0.86
4932,-0.81
4933,-0.76
4934,-0.67
4935,-0.47
4936,-0.13
4937,0.32
4938,0.80
4939,1.20
4940,1.45
4941,1.50
4942,1.30
4943,0.89
4944,0.28
4945,-0.41
4946,-1.14
4947,-1.86
4948,-2.52
4949,-3.08
4950,-3.52
4951,-3.83
4952,-4.03
4953,-4.14
4954,-4.15
4955,-4.10
4956,-4.02
4957,-3.94
4958,-3.82
4959,-3.68
4960,-3.47
4961,-3.15
4962,-2.66
4963,-1.99
4964,-1.14
4965,-0.19
4966,0.84
4967,1.81
4968,2.68
4969,3.31
4970,3.71
4971,3.85
4972,3.80
4973,3.60
4974,3.36
4975,3.13
4976,2.98
4977,2.89
4978,2.83
4979,2.73
4980,2.56
4981,2.32
4982,2.01
4983,1.67
4984,1.30
4985,0.99
4986,0.76
4987,0.66
4988,0.60
4989,0.57
4990,0.50
4991,0.41
4992,0.23
4993,-0.03
4994,-0.42
4995,-0.86
4996,-1.40
4997,-1.95
4998,-2.57
4999,-3.20
5000,-3.88
5001,-4.52
5002,-5.18
5003,-5.79
5004,-6.41
5005,-6.98
5006,-7.55
5007,-8.06
5008,-8.56
5009,-8.98
5010,-9.34
5011,-9.56
5012,-9.65
5013,-9.60
5014,-9.44
5015,-9.20
5016,-8.97
5017,-8.77
5018,-8.63
5019,-8.54
5020,-8.50
5021,-8.50
5022,-8.53
5023,-8.54
5024,-8.53
5025,-8.50
5026,-8.47
5027,-8.46
5028,-8.45
5029,-8.43
5030,-8.36
5031,-8.27
5032,-8.10
5033,-7.88
5034,-7.60
5035,-7.29
5036,-6.94
5037,-6.60
5038,-6.21
5039,-5.82
5040,-5.36
5041,-4.86
5042,-4.25
5043,-3.61
5044,-2.88
5045,-2.17
5046,-1.43
5047,-0.74
5048,-0.04
5049,0.59
5050,1.24
5051,1.84
5052,2.51
5053,3.19
5054,3.97
5055,4.78
5056,5.65
5057,6.48
5058,7.25
5059,7.86
5060,8.37
5061,8.72
5062,9.00
5063,9.19
5064,9.39
5065,9.56
5066,9.78
5067,9.96
5068,10.15
5069,10.27
5070,10.37
5071,10.42
5072,10.54
5073,10.75
5074,11.12
5075,11.63
5076,12.23
5077,12.83
5078,13.38
5079,13.82
5080,14.14
5081,14.37
5082,14.55
5083,14.75
5084,14.98
5085,15.25
5086,15.45
5087,15.53
5088,15.39
5089,15.05
5090,14.49
5091,13.79
5092,13.00
5093,12.25
5094,11.52
5095,10.87
5096,10.18
5097,9.48
5098,8.65
5099,7.77
5100,6.79
5101,5.85
5102,4.95
5103,4.25
5104,3.69
5105,3.34
5106,3.04
5107,2.80
5108,2.44
5109,1.97
5110,1.34
5111,0.65
5112,-0.13
5113,-0.88
5114,-1.60
5115,-2.21
5116,-2.80
5117,-3.33
5118,-3.88
5119,-4.40
5120,-4.97
5121,-5.56
5122,-6.20
5123,-6.81
5124,-7.37
5125,-7.82
5126,-8.14
5127,-8.27
5128,-8.19
5129,-7.90
5130,-7.39
5131,-6.74
5132,-5.95
5133,-5.14
5134,-4.30
5135,-3.54
5136,-2.80
5137,-2.10
5138,-1.35
5139,-0.58
5140,0.23
5141,0.99
5142,1.74
5143,2.37
5144,2.89
5145,3.20
5146,3.37
5147,3.35
5148,3.30
5149,3.23
5150,3.28
5151,3.45
5152,3.78
5153,4.22
5154,4.78
5155,5.38
5156,6.04
5157,6.69
5158,7.34
5159,7.94
5160,8.53
5161,9.05
5162,9.56
5163,10.02
5164,10.46
5165,10.83
5166,11.18
5167,11.44
5168,11.64
5169,11.73
5170,11.76
5171,11.70
5172,11.62
5173,11.50
5174,11.33
5175,11.11
5176,10.90
5177,10.72
5178,10.64
5179,10.65
5180,10.78
5181,11.00
5182,11.32
5183,11.69
5184,12.10
5185,12.48
5186,12.84
5187,13.14
5188,13.46
5189,13.81
5190,14.25
5191,14.79
5192,15.41
5193,16.08
5194,16.71
5195,17.21
5196,17.43
5197,17.34
5198,16.88
5199,16.15
5200,15.20
5201,14.15
5202,13.06
5203,12.07
5204,11.19
5205,10.48
5206,9.81
5207,9.18
5208,8.47
5209,7.75
5210,6.91
5211,6.06
5212,5.18
5213,4.41
5214,3.75
5215,3.26
5216,2.87
5217,2.61
5218,2.44
5219,2.38
5220,2.44
5221,2.60
5222,2.86
5223,3.20
5224,3.57
5225,3.96
5226,4.34
5227,4.61
5228,4.80
5229,4.87
5230,4.93
5231,5.00
5232,5.18
5233,5.47
5234,5.92
5235,6.45
5236,7.11
5237,7.76
5238,8.46
5239,9.12
5240,9.79
5241,10.43
5242,11.11
5243,11.80
5244,12.55
5245,13.27
5246,13.98
5247,14.61
5248,15.21
5249,15.72
5250,16.18
5251,16.55
5252,16.83
5253,16.97
5254,16.99
5255,16.83
5256,16.53
5257,16.09
5258,15.57
5259,15.04
5260,14.55
5261,14.18
5262,13.93
5263,13.81
5264,13.75
5265,13.74
5266,13.67
5267,13.60
5268,13.48
5269,13.38
5270,13.27
5271,13.19
5272,13.12
5273,13.06
5274,12.93
5275,12.72
5276,12.37
5277,11.94
5278,11.45
5279,11.01
5280,10.61
5281,10.33
5282,10.11
5283,9.97
5284,9.77
5285,9.49
5286,9.04
5287,8.47
5288,7.74
5289,6.95
5290,6.08
5291,5.26
5292,4.45
5293,3.75
5294,3.09
5295,2.47
5296,1.80
5297,1.12
5298,0.40
5299,-0.26
5300,-0.86
5301,-1.30
5302,-1.60
5303,-1.72
5304,-1.72
5305,-1.60
5306,-1.46
5307,-1.36
5308,-1.35
5309,-1.41
5310,-1.52
5311,-1.60
5312,-1.66
5313,-1.67
5314,-1.66
5315,-1.65
5316,-1.70
5317,-1.83
5318,-2.08
5319,-2.41
5320,-2.77
5321,-3.07
5322,-3.27
5323,-3.33
5324,-3.27
5325,-3.11
5326,-2.90
5327,-2.70
5328,-2.58
5329,-2.56
5330,-2.57
5331,-2.56
5332,-2.45
5333,-2.25
5334,-1.90
5335,-1.48
5336,-0.97
5337,-0.45
5338,0.08
5339,0.57
5340,1.08
5341,1.57
5342,2.11
5343,2.65
5344,3.24
5345,3.81
5346,4.39
5347,4.87
5348,5.34
5349,5.71
5350,6.12
5351,6.54
5352,7.12
5353,7.78
5354,8.58
5355,9.41
5356,10.29
5357,11.16
5358,12.05
5359,12.88
5360,13.72
5361,14.52
5362,15.32
5363,16.06
5364,16.71
5365,17.18
5366,17.44
5367,17.45
5368,17.20
5369,16.70
5370,16.04
5371,15.32
5372,14.58
5373,13.89
5374,13.27
5375,12.73
5376,12.19
5377,11.64
5378,11.02
5379,10.37
5380,9.66
5381,8.97
5382,8.29
5383,7.70
5384,7.19
5385,6.83
5386,6.58
5387,6.46
5388,6.40
5389,6.41
5390,6.38
5391,6.35
5392,6.25
5393,6.13
5394,5.93
5395,5.66
5396,5.26
5397,4.81
5398,4.29
5399,3.76
5400,3.18
5401,2.62
5402,2.10
5403,1.68
5404,1.35
5405,1.12
5406,0.96
5407,0.90
5408,0.94
5409,1.07
5410,1.25
5411,1.49
5412,1.79
5413,2.15
5414,2.55
5415,2.98
5416,3.38
5417,3.74
5418,4.04
5419,4.27
5420,4.41
5421,4.44
5422,4.35
5423,4.14
5424,3.81
5425,3.35
5426,2.75
5427,2.06
5428,1.34
5429,0.67
5430,0.12
5431,-0.24
5432,-0.39
5433,-0.34
5434,-0.14
5435,0.12
5436,0.38
5437,0.57
5438,0.70
5439,0.79
5440,0.93
5441,1.20
5442,1.71
5443,2.43
5444,3.35
5445,4.34
5446,5.35
5447,6.23
5448,6.92
5449,7.34
5450,7.57
5451,7.64
5452,7.65
5453,7.62
5454,7.62
5455,7.63
5456,7.67
5457,7.66
5458,7.61
5459,7.47
5460,7.27
5461,7.01
5462,6.73
5463,6.51
5464,6.38
5465,6.38
5466,6.48
5467,6.67
5468,6.91
5469,7.17
5470,7.32
5471,7.33
5472,7.15
5473,6.79
5474,6.27
5475,5.64
5476,4.95
5477,4.29
5478,3.70
5479,3.25
5480,2.89
5481,2.64
5482,2.41
5483,2.21
5484,1.93
5485,1.60
5486,1.16
5487,0.66
5488,0.09
5489,-0.48
5490,-1.01
5491,-1.42
5492,-1.65
5493,-1.67
5494,-1.47
5495,-1.11
5496,-0.62
5497,-0.07
5498,0.46
5499,0.89
5500,1.20
5501,1.38
5502,1.52
5503,1.64
5504,1.81
5505,2.02
5506,2.34
5507,2.69
5508,3.05
5509,3.35
5510,3.59
5511,3.70
5512,3.74
5513,3.72
5514,3.74
5515,3.82
5516,4.03
5517,4.34
5518,4.78
5519,5.27
5520,5.83
5521,6.36
5522,6.90
5523,7.42
5524,7.98
5525,8.54
5526,9.19
5527,9.87
5528,10.60
5529,11.29
5530,11.97
5531,12.57
5532,13.11
5533,13.51
5534,13.85
5535,14.08
5536,14.31
5537,14.52
5538,14.77
5539,15.01
5540,15.29
5541,15.56
5542,15.86
5543,16.12
5544,16.35
5545,16.52
5546,16.61
5547,16.61
5548,16.51
5549,16.32
5550,16.10
5551,15.88
5552,15.74
5553,15.71
5554,15.85
5555,16.16
5556,16.59
5557,17.08
5558,17.53
5559,17.85
5560,17.99
5561,17.99
5562,17.89
5563,17.77
5564,17.67
5565,17.65
5566,17.67
5567,17.74
5568,17.73
5569,17.60
5570,17.24
5571,16.67
5572,15.85
5573,14.90
5574,13.84
5575,12.78
5576,11.68
5577,10.63
5578,9.54
5579,8.51
5580,7.43
5581,6.44
5582,5.47
5583,4.69
5584,4.03
5585,3.59
5586,3.20
5587,2.91
5588,2.55
5589,2.16
5590,1.62
5591,1.01
5592,0.27
5593,-0.49
5594,-1.31
5595,-2.11
5596,-2.90
5597,-3.61
5598,-4.30
5599,-4.92
5600,-5.51
5601,-6.02
5602,-6.48
5603,-6.85
5604,-7.17
5605,-7.40
5606,-7.53
5607,-7.52
5608,-7.36
5609,-7.06
5610,-6.62
5611,-6.09
5612,-5.47
5613,-4.84
5614,-4.16
5615,-3.50
5616,-2.82
5617,-2.17
5618,-1.46
5619,-0.73
5620,0.08
5621,0.87
5622,1.61
5623,2.21
5624,2.70
5625,3.01
5626,3.21
5627,3.25
5628,3.23
5629,3.18
5630,3.20
5631,3.24
5632,3.37
5633,3.51
5634,3.70
5635,3.89
5636,4.14
5637,4.42
5638,4.75
5639,5.13
5640,5.58
5641,6.09
5642,6.65
5643,7.17
5644,7.60
5645,7.87
5646,8.00
5647,8.03
5648,7.98
5649,7.88
5650,7.78
5651,7.69
5652,7.60
5653,7.49
5654,7.30
5655,6.99
5656,6.54
5657,5.99
5658,5.43
5659,4.94
5660,4.61
5661,4.48
5662,4.61
5663,4.93
5664,5.42
5665,5.95
5666,6.46
5667,6.87
5668,7.19
5669,7.42
5670,7.64
5671,7.88
5672,8.20
5673,8.59
5674,9.05
5675,9.50
5676,9.88
5677,10.10
5678,10.12
5679,9.94
5680,9.55
5681,9.05
5682,8.47
5683,7.92
5684,7.37
5685,6.88
5686,6.36
5687,5.83
5688,5.19
5689,4.43
5690,3.52
5691,2.53
5692,1.48
5693,0.49
5694,-0.41
5695,-1.07
5696,-1.53
5697,-1.76
5698,-1.81
5699,-1.70
5700,-1.53
5701,-1.33
5702,-1.14
5703,-0.93
5704,-0.69
5705,-0.41
5706,-0.08
5707,0.29
5708,0.72
5709,1.16
5710,1.61
5711,1.99
5712,2.33
5713,2.59
5714,2.86
5715,3.09
5716,3.39
5717,3.74
5718,4.25
5719,4.86
5720,5.61
5721,6.40
5722,7.24
5723,8.01
5724,8.73
5725,9.34
5726,9.88
5727,10.34
5728,10.77
5729,11.12
5730,11.43
5731,11.68
5732,11.88
5733,11.98
5734,11.98
5735,11.89
5736,11.75
5737,11.59
5738,11.44
5739,11.32
5740,11.26
5741,11.26
5742,11.28
5743,11.27
5744,11.21
5745,11.09
5746,10.91
5747,10.69
5748,10.42
5749,10.16
5750,9.91
5751,9.74
5752,9.62
5753,9.52
5754,9.38
5755,9.21
5756,8.93
5757,8.58
5758,8.10
5759,7.57
5760,6.97
5761,6.40
5762,5.80
5763,5.23
5764,4.66
5765,4.12
5766,3.53
5767,2.94
5768,2.30
5769,1.69
5770,1.02
5771,0.36
5772,-0.36
5773,-1.05
5774,-1.76
5775,-2.45
5776,-3.15
5777,-3.80
5778,-4.41
5779,-4.90
5780,-5.26
5781,-5.46
5782,-5.55
5783,-5.52
5784,-5.43
5785,-5.28
5786,-5.17
5787,-5.10
5788,-5.09
5789,-5.10
5790,-5.14
5791,-5.17
5792,-5.18
5793,-5.12
5794,-4.98
5795,-4.78
5796,-4.58
5797,-4.46
5798,-4.43
5799,-4.51
5800,-4.68
5801,-4.90
5802,-5.08
5803,-5.18
5804,-5.15
5805,-4.97
5806,-4.66
5807,-4.31
5808,-3.99
5809,-3.80
5810,-3.74
5811,-3.82
5812,-3.94
5813,-4.03
5814,-3.98
5815,-3.76
5816,-3.29
5817,-2.67
5818,-1.92
5819,-1.18
5820,-0.46
5821,0.17
5822,0.76
5823,1.27
5824,1.81
5825,2.33
5826,2.91
5827,3.47
5828,4.09
5829,4.64
5830,5.21
5831,5.71
5832,6.27
5833,6.85
5834,7.55
5835,8.30
5836,9.16
5837,10.03
5838,10.89
5839,11.65
5840,12.32
5841,12.83
5842,13.22
5843,13.49
5844,13.72
5845,13.93
5846,14.11
5847,14.25
5848,14.32
5849,14.28
5850,14.10
5851,13.76
5852,13.23
5853,12.58
5854,11.83
5855,11.07
5856,10.28
5857,9.52
5858,8.75
5859,8.03
5860,7.31
5861,6.62
5862,5.92
5863,5.29
5864,4.71
5865,4.27
5866,3.88
5867,3.60
5868,3.35
5869,3.18
5870,3.01
5871,2.91
5872,2.81
5873,2.74
5874,2.66
5875,2.58
5876,2.46
5877,2.28
5878,1.96
5879,1.52
5880,0.96
5881,0.38
5882,-0.20
5883,-0.72
5884,-1.17
5885,-1.48
5886,-1.67
5887,-1.73
5888,-1.73
5889,-1.68
5890,-1.61
5891,-1.52
5892,-1.41
5893,-1.27
5894,-1.11
5895,-0.91
5896,-0.69
5897,-0.44
5898,-0.23
5899,-0.09
5900,-0.05
5901,-0.12
5902,-0.31
5903,-0.60
5904,-0.97
5905,-1.39
5906,-1.83
5907,-2.28
5908,-2.74
5909,-3.20
5910,-3.64
5911,-4.05
5912,-4.43
5913,-4.73
5914,-4.89
5915,-4.89
5916,-4.71
5917,-4.38
5918,-3.88
5919,-3.28
5920,-2.58
5921,-1.87
5922,-1.10
5923,-0.28
5924,0.63
5925,1.55
5926,2.50
5927,3.37
5928,4.17
5929,4.78
5930,5.24
5931,5.49
5932,5.62
5933,5.63
5934,5.64
5935,5.67
5936,5.76
5937,5.86
5938,5.91
5939,5.89
5940,5.76
5941,5.55
5942,5.28
5943,5.03
5944,4.82
5945,4.72
5946,4.71
5947,4.79
5948,4.83
5949,4.78
5950,4.53
5951,4.09
5952,3.42
5953,2.64
5954,1.76
5955,0.95
5956,0.21
5957,-0.35
5958,-0.82
5959,-1.17
5960,-1.52
5961,-1.89
5962,-2.38
5963,-2.97
5964,-3.67
5965,-4.38
5966,-5.10
5967,-5.73
5968,-6.29
5969,-6.71
5970,-7.03
5971,-7.20
5972,-7.26
5973,-7.19
5974,-7.02
5975,-6.74
5976,-6.41
5977,-6.03
5978,-5.65
5979,-5.30
5980,-5.03
5981,-4.88
5982,-4.86
5983,-4.96
5984,-5.12
5985,-5.31
5986,-5.45
5987,-5.54
5988,-5.52
5989,-5.40
5990,-5.13
5991,-4.75
5992,-4.23
5993,-3.67
5994,-3.08
5995,-2.53
5996,-1.96
5997,-1.43
5998,-0.86
5999,-0.29
6000,0.37
6001,1.09
6002,1.94
6003,2.81
6004,3.73
6005,4.54
6006,5.29
6007,5.88
6008,6.41
6009,6.85
6010,7.30
6011,7.74
6012,8.29
6013,8.87
6014,9.58
6015,10.32
6016,11.11
6017,11.84
6018,12.53
6019,13.13
6020,13.71
6021,14.23
6022,14.74
6023,15.17
6024,15.60
6025,15.96
6026,16.27
6027,16.44
6028,16.50
6029,16.43
6030,16.29
6031,16.11
6032,15.99
6033,15.95
6034,16.09
6035,16.37
6036,16.80
6037,17.32
6038,17.84
6039,18.27
6040,18.59
6041,18.80
6042,18.94
6043,19.07
6044,19.21
6045,19.39
6046,19.56
6047,19.70
6048,19.67
6049,19.44
6050,18.90
6051,18.12
6052,17.08
6053,15.97
6054,14.83
6055,13.81
6056,12.89
6057,12.16
6058,11.48
6059,10.87
6060,10.17
6061,9.41
6062,8.47
6063,7.46
6064,6.33
6065,5.26
6066,4.21
6067,3.33
6068,2.51
6069,1.86
6070,1.24
6071,0.74
6072,0.20
6073,-0.31
6074,-0.92
6075,-1.55
6076,-2.29
6077,-3.02
6078,-3.79
6079,-4.53
6080,-5.31
6081,-6.05
6082,-6.76
6083,-7.37
6084,-7.86
6085,-8.19
6086,-8.34
6087,-8.28
6088,-8.01
6089,-7.58
6090,-7.02
6091,-6.43
6092,-5.87
6093,-5.40
6094,-4.99
6095,-4.62
6096,-4.19
6097,-3.66
6098,-2.91
6099,-1.97
6100,-0.85
6101,0.29
6102,1.40
6103,2.28
6104,2.89
6105,3.13
6106,3.13
6107,2.95
6108,2.79
6109,2.72
6110,2.87
6111,3.20
6112,3.74
6113,4.35
6114,4.98
6115,5.52
6116,5.93
6117,6.19
6118,6.34
6119,6.42
6120,6.49
6121,6.54
6122,6.62
6123,6.72
6124,6.86
6125,7.03
6126,7.19
6127,7.34
6128,7.47
6129,7.54
6130,7.53
6131,7.42
6132,7.20
6133,6.88
6134,6.48
6135,6.05
6136,5.67
6137,5.40
6138,5.28
6139,5.31
6140,5.46
6141,5.72
6142,6.07
6143,6.47
6144,6.89
6145,7.29
6146,7.71
6147,8.15
6148,8.63
6149,9.10
6150,9.58
6151,10.03
6152,10.44
6153,10.80
6154,11.11
6155,11.36
6156,11.54
6157,11.65
6158,11.61
6159,11.43
6160,11.04
6161,10.48
6162,9.75
6163,8.95
6164,8.07
6165,7.21
6166,6.38
6167,5.63
6168,4.90
6169,4.22
6170,3.50
6171,2.82
6172,2.10
6173,1.46
6174,0.88
6175,0.44
6176,0.09
6177,-0.14
6178,-0.34
6179,-0.48
6180,-0.62
6181,-0.75
6182,-0.88
6183,-0.99
6184,-1.05
6185,-1.07
6186,-1.03
6187,-0.94
6188,-0.80
6189,-0.65
6190,-0.43
6191,-0.16
6192,0.23
6193,0.74
6194,1.40
6195,2.12
6196,2.92
6197,3.70
6198,4.48
6199,5.15
6200,5.75
6201,6.24
6202,6.73
6203,7.22
6204,7.79
6205,8.39
6206,9.07
6207,9.74
6208,10.43
6209,11.02
6210,11.51
6211,11.86
6212,12.11
6213,12.23
6214,12.28
6215,12.26
6216,12.21
6217,12.14
6218,12.08
6219,11.99
6220,11.86
6221,11.68
6222,11.46
6223,11.20
6224,10.93
6225,10.70
6226,10.50
6227,10.39
6228,10.34
6229,10.41
6230,10.55
6231,10.73
6232,10.85
6233,10.89
6234,10.75
6235,10.47
6236,10.03
6237,9.49
6238,8.83
6239,8.14
6240,7.41
6241,6.72
6242,6.01
6243,5.33
6244,4.62
6245,3.97
6246,3.28
6247,2.62
6248,1.90
6249,1.21
6250,0.50
6251,-0.15
6252,-0.81
6253,-1.42
6254,-2.04
6255,-2.59
6256,-3.13
6257,-3.58
6258,-3.98
6259,-4.30
6260,-4.58
6261,-4.77
6262,-4.93
6263,-5.01
6264,-5.06
6265,-5.05
6266,-5.01
6267,-4.94
6268,-4.89
6269,-4.86
6270,-4.86
6271,-4.86
6272,-4.84
6273,-4.80
6274,-4.73
6275,-4.64
6276,-4.59
6277,-4.61
6278,-4.71
6279,-4.91
6280,-5.15
6281,-5.39
6282,-5.57
6283,-5.63
6284,-5.51
6285,-5.19
6286,-4.75
6287,-4.30
6288,-3.88
6289,-3.59
6290,-3.43
6291,-3.40
6292,-3.39
6293,-3.36
6294,-3.17
6295,-2.84
6296,-2.30
6297,-1.66
6298,-0.91
6299,-0.20
6300,0.47
6301,1.02
6302,1.50
6303,1.88
6304,2.27
6305,2.64
6306,3.07
6307,3.48
6308,3.96
6309,4.44
6310,5.02
6311,5.61
6312,6.29
6313,6.97
6314,7.74
6315,8.54
6316,9.44
6317,10.34
6318,11.26
6319,12.12
6320,12.93
6321,13.62
6322,14.22
6323,14.69
6324,15.07
6325,15.31
6326,15.44
6327,15.46
6328,15.39
6329,15.23
6330,14.99
6331,14.69
6332,14.31
6333,13.88
6334,13.36
6335,12.77
6336,12.09
6337,11.39
6338,10.61
6339,9.81
6340,8.98
6341,8.22
6342,7.51
6343,6.95
6344,6.50
6345,6.19
6346,5.96
6347,5.81
6348,5.65
6349,5.50
6350,5.33
6351,5.20
6352,5.10
6353,5.08
6354,5.11
6355,5.20
6356,5.26
6357,5.28
6358,5.18
6359,4.91
6360,4.43
6361,3.76
6362,2.96
6363,2.14
6364,1.37
6365,0.73
6366,0.26
6367,-0.01
6368,-0.11
6369,-0.09
6370,0.02
6371,0.20
6372,0.44
6373,0.72
6374,1.06
6375,1.47
6376,1.94
6377,2.46
6378,2.95
6379,3.38
6380,3.69
6381,3.86
6382,3.84
6383,3.60
6384,3.15
6385,2.55
6386,1.85
6387,1.14
6388,0.47
6389,-0.13
6390,-0.63
6391,-0.99
6392,-1.21
6393,-1.30
6394,-1.28
6395,-1.19
6396,-1.04
6397,-0.89
6398,-0.70
6399,-0.49
6400,-0.16
6401,0.25
6402,0.82
6403,1.50
6404,2.35
6405,3.29
6406,4.31
6407,5.28
6408,6.18
6409,6.94
6410,7.55
6411,7.99
6412,8.30
6413,8.48
6414,8.60
6415,8.63
6416,8.63
6417,8.53
6418,8.35
6419,8.07
6420,7.69
6421,7.27
6422,6.83
6423,6.43
6424,6.09
6425,5.86
6426,5.69
6427,5.61
6428,5.52
6429,5.45
6430,5.30
6431,5.07
6432,4.65
6433,4.14
6434,3.53
6435,2.93
6436,2.29
6437,1.69
6438,1.12
6439,0.63
6440,0.13
6441,-0.37
6442,-0.96
6443,-1.58
6444,-2.25
6445,-2.88
6446,-3.49
6447,-3.99
6448,-4.39
6449,-4.65
6450,-4.81
6451,-4.84
6452,-4.80
6453,-4.69
6454,-4.55
6455,-4.38
6456,-4.21
6457,-4.03
6458,-3.90
6459,-3.81
6460,-3.77
6461,-3.76
6462,-3.74
6463,-3.72
6464,-3.66
6465,-3.55
6466,-3.34
6467,-3.09
6468,-2.83
6469,-2.66
6470,-2.55
6471,-2.53
6472,-2.55
6473,-2.59
6474,-2.59
6475,-2.50
6476,-2.23
6477,-1.82
6478,-1.29
6479,-0.74
6480,-0.17
6481,0.34
6482,0.81
6483,1.20
6484,1.58
6485,1.94
6486,2.40
6487,2.92
6488,3.58
6489,4.30
6490,5.11
6491,5.92
6492,6.75
6493,7.51
6494,8.23
6495,8.84
6496,9.42
6497,9.91
6498,10.38
6499,10.78
6500,11.19
6501,11.55
6502,11.88
6503,12.13
6504,12.32
6505,12.43
6506,12.49
6507,12.48
6508,12.45
6509,12.39
6510,12.36
6511,12.33
6512,12.37
6513,12.47
6514,12.67
6515,12.96
6516,13.35
6517,13.78
6518,14.24
6519,14.65
6520,14.95
6521,15.12
6522,15.16
6523,15.11
6524,15.00
6525,14.88
6526,14.78
6527,14.74
6528,14.68
6529,14.56
6530,14.27
6531,13.80
6532,13.08
6533,12.17
6534,11.05
6535,9.87
6536,8.66
6537,7.59
6538,6.60
6539,5.78
6540,5.01
6541,4.38
6542,3.76
6543,3.21
6544,2.60
6545,1.98
6546,1.26
6547,0.54
6548,-0.25
6549,-0.98
6550,-1.71
6551,-2.31
6552,-2.84
6553,-3.24
6554,-3.62
6555,-3.96
6556,-4.39
6557,-4.88
6558,-5.51
6559,-6.22
6560,-7.01
6561,-7.79
6562,-8.52
6563,-9.12
6564,-9.55
6565,-9.77
6566,-9.81
6567,-9.74
6568,-9.56
6569,-9.32
6570,-9.03
6571,-8.69
6572,-8.28
6573,-7.80
6574,-7.19
6575,-6.49
6576,-5.64
6577,-4.73
6578,-3.72
6579,-2.76
6580,-1.85
6581,-1.08
6582,-0.43
6583,0.04
6584,0.42
6585,0.66
6586,0.89
6587,1.06
6588,1.27
6589,1.45
6590,1.63
6591,1.77
6592,1.92
6593,2.05
6594,2.23
6595,2.41
6596,2.66
6597,2.94
6598,3.31
6599,3.69
6600,4.10
6601,4.48
6602,4.86
6603,5.21
6604,5.57
6605,5.96
6606,6.37
6607,6.77
6608,7.14
6609,7.41
6610,7.57
6611,7.55
6612,7.33
6613,6.93
6614,6.39
6615,5.78
6616,5.16
6617,4.59
6618,4.12
6619,3.81
6620,3.64
6621,3.61
6622,3.71
6623,3.92
6624,4.24
6625,4.66
6626,5.15
6627,5.65
6628,6.18
6629,6.70
6630,7.21
6631,7.66
6632,8.04
6633,8.33
6634,8.57
6635,8.76
6636,8.92
6637,9.06
6638,9.15
6639,9.16
6640,9.04
6641,8.80
6642,8.37
6643,7.82
6644,7.11
6645,6.36
6646,5.54
6647,4.77
6648,3.99
6649,3.25
6650,2.44
6651,1.58
6652,0.65
6653,-0.27
6654,-1.17
6655,-1.92
6656,-2.52
6657,-2.84
6658,-2.90
6659,-2.67
6660,-2.26
6661,-1.73
6662,-1.22
6663,-0.81
6664,-0.57
6665,-0.52
6666,-0.66
6667,-0.93
6668,-1.22
6669,-1.48
6670,-1.60
6671,-1.55
6672,-1.27
6673,-0.85
6674,-0.29
6675,0.31
6676,0.92
6677,1.47
6678,2.00
6679,2.47
6680,3.01
6681,3.58
6682,4.28
6683,5.03
6684,5.88
6685,6.72
6686,7.53
6687,8.19
6688,8.76
6689,9.18
6690,9.55
6691,9.85
6692,10.16
6693,10.45
6694,10.74
6695,10.96
6696,11.10
6697,11.09
6698,10.96
6699,10.68
6700,10.30
6701,9.88
6702,9.48
6703,9.14
6704,8.90
6705,8.77
6706,8.74
6707,8.79
6708,8.87
6709,8.99
6710,9.10
6711,9.23
6712,9.32
6713,9.38
6714,9.36
6715,9.30
6716,9.15
6717,8.92
6718,8.55
6719,8.05
6720,7.40
6721,6.68
6722,5.87
6723,5.10
6724,4.32
6725,3.65
6726,3.03
6727,2.55
6728,2.10
6729,1.71
6730,1.23
6731,0.67
6732,-0.05
6733,-0.85
6734,-1.75
6735,-2.63
6736,-3.50
6737,-4.25
6738,-4.90
6739,-5.37
6740,-5.74
6741,-5.98
6742,-6.16
6743,-6.26
6744,-6.30
6745,-6.28
6746,-6.23
6747,-6.15
6748,-6.06
6749,-5.97
6750,-5.88
6751,-5.77
6752,-5.66
6753,-5.51
6754,-5.30
6755,-5.05
6756,-4.77
6757,-4.53
6758,-4.35
6759,-4.28
6760,-4.33
6761,-4.53
6762,-4.83
6763,-5.19
6764,-5.51
6765,-5.73
6766,-5.78
6767,-5.64
6768,-5.28
6769,-4.77
6770,-4.16
6771,-3.55
6772,-2.97
6773,-2.47
6774,-2.03
6775,-1.66
6776,-1.33
6777,-1.05
6778,-0.76
6779,-0.51
6780,-0.22
6781,0.03
6782,0.30
6783,0.53
6784,0.84
6785,1.19
6786,1.68
6787,2.25
6788,3.01
6789,3.87
6790,4.87
6791,5.89
6792,6.96
6793,7.94
6794,8.86
6795,9.63
6796,10.35
6797,10.95
6798,11.54
6799,12.05
6800,12.60
6801,13.14
6802,13.72
6803,14.28
6804,14.82
6805,15.27
6806,15.61
6807,15.79
6808,15.78
6809,15.61
6810,15.28
6811,14.85
6812,14.30
6813,13.68
6814,12.99
6815,12.29
6816,11.57
6817,10.85
6818,10.08
6819,9.32
6820,8.51
6821,7.73
6822,6.95
6823,6.27
6824,5.70
6825,5.34
6826,5.17
6827,5.23
6828,5.44
6829,5.78
6830,6.10
6831,6.37
6832,6.45
6833,6.35
6834,6.05
6835,5.63
6836,5.14
6837,4.67
6838,4.21
6839,3.81
6840,3.40
6841,2.99
6842,2.53
6843,2.04
6844,1.51
6845,1.00
6846,0.54
6847,0.20
6848,-0.01
6849,-0.08
6850,-0.04
6851,0.08
6852,0.27
6853,0.53
6854,0.84
6855,1.20
6856,1.61
6857,2.03
6858,2.41
6859,2.73
6860,2.91
6861,2.96
6862,2.85
6863,2.59
6864,2.22
6865,1.82
6866,1.41
6867,1.00
6868,0.58
6869,0.14
6870,-0.32
6871,-0.80
6872,-1.26
6873,-1.67
6874,-1.95
6875,-2.07
6876,-1.99
6877,-1.74
6878,-1.29
6879,-0.73
6880,-0.07
6881,0.63
6882,1.40
6883,2.25
6884,3.25
6885,4.34
6886,5.54
6887,6.71
6888,7.79
6889,8.62
6890,9.16
6891,9.32
6892,9.22
6893,8.89
6894,8.49
6895,8.12
6896,7.89
6897,7.82
6898,7.84
6899,7.87
6900,7.82
6901,7.63
6902,7.26
6903,6.80
6904,6.31
6905,5.92
6906,5.65
6907,5.54
6908,5.48
6909,5.45
6910,5.29
6911,4.99
6912,4.49
6913,3.87
6914,3.14
6915,2.43
6916,1.75
6917,1.22
6918,0.77
6919,0.42
6920,0.05
6921,-0.31
6922,-0.77
6923,-1.28
6924,-1.90
6925,-2.53
6926,-3.18
6927,-3.76
6928,-4.28
6929,-4.66
6930,-4.89
6931,-4.96
6932,-4.93
6933,-4.85
6934,-4.75
6935,-4.64
6936,-4.56
6937,-4.51
6938,-4.48
6939,-4.40
6940,-4.20
6941,-3.81
6942,-3.23
6943,-2.47
6944,-1.63
6945,-0.84
6946,-0.22
6947,0.10
6948,0.12
6949,-0.16
6950,-0.65
6951,-1.24
6952,-1.79
6953,-2.24
6954,-2.48
6955,-2.51
6956,-2.28
6957,-1.88
6958,-1.35
6959,-0.80
6960,-0.24
6961,0.25
6962,0.72
6963,1.12
6964,1.54
6965,1.97
6966,2.50
6967,3.11
6968,3.88
6969,4.71
6970,5.64
6971,6.54
6972,7.44
6973,8.23
6974,8.93
6975,9.48
6976,9.97
6977,10.35
6978,10.71
6979,11.03
6980,11.36
6981,11.65
6982,11.90
6983,12.06
6984,12.15
6985,12.17
6986,12.16
6987,12.08
6988,12.01
6989,11.90
6990,11.83
6991,11.73
6992,11.64
6993,11.55
6994,11.55
6995,11.67
6996,12.00
6997,12.52
6998,13.22
6999,14.05
7000,14.94
7001,15.75
7002,16.33
7003,16.61
7004,16.55
7005,16.22
7006,15.65
7007,14.97
7008,14.22
7009,13.52
7010,12.88
7011,12.32
7012,11.72
7013,11.11
7014,10.35
7015,9.55
7016,8.64
7017,7.73
7018,6.79
7019,5.95
7020,5.13
7021,4.44
7022,3.78
7023,3.21
7024,2.62
7025,2.09
7026,1.53
7027,1.02
7028,0.45
7029,-0.09
7030,-0.70
7031,-1.28
7032,-1.94
7033,-2.59
7034,-3.33
7035,-4.04
7036,-4.77
7037,-5.46
7038,-6.17
7039,-6.86
7040,-7.54
7041,-8.17
7042,-8.76
7043,-9.26
7044,-9.66
7045,-9.90
7046,-9.99
7047,-9.94
7048,-9.76
7049,-9.46
7050,-9.06
7051,-8.57
7052,-7.97
7053,-7.30
7054,-6.51
7055,-5.68
7056,-4.79
7057,-3.92
7058,-3.06
7059,-2.28
7060,-1.54
7061,-0.93
7062,-0.40
7063,0.01
7064,0.34
7065,0.58
7066,0.78
7067,0.92
7068,1.06
7069,1.15
7070,1.22
7071,1.22
7072,1.21
7073,1.15
7074,1.10
7075,1.04
7076,1.03
7077,1.08
7078,1.27
7079,1.62
7080,2.16
7081,2.85
7082,3.65
7083,4.44
7084,5.17
7085,5.77
7086,6.22
7087,6.48
7088,6.58
7089,6.56
7090,6.49
7091,6.39
7092,6.27
7093,6.11
7094,5.91
7095,5.62
7096,5.24
7097,4.77
7098,4.28
7099,3.80
7100,3.38
7101,3.06
7102,2.90
7103,2.91
7104,3.11
7105,3.46
7106,3.99
7107,4.68
7108,5.52
7109,6.48
7110,7.50
7111,8.48
7112,9.34
7113,9.96
7114,10.33
7115,10.42
7116,10.26
7117,9.92
7118,9.48
7119,9.03
7120,8.62
7121,8.33
7122,8.13
7123,7.98
7124,7.77
7125,7.48
7126,7.02
7127,6.45
7128,5.70
7129,4.85
7130,3.88
7131,2.92
7132,1.97
7133,1.11
7134,0.32
7135,-0.32
7136,-0.86
7137,-1.25
7138,-1.56
7139,-1.75
7140,-1.88
7141,-1.90
7142,-1.86
7143,-1.74
7144,-1.60
7145,-1.43
7146,-1.27
7147,-1.10
7148,-0.93
7149,-0.79
7150,-0.66
7151,-0.56
7152,-0.39
7153,-0.19
7154,0.13
7155,0.49
7156,0.95
7157,1.43
7158,2.01
7159,2.58
7160,3.24
7161,3.89
7162,4.60
7163,5.31
7164,6.06
7165,6.79
7166,7.53
7167,8.21
7168,8.87
7169,9.46
7170,9.98
7171,10.39
7172,10.74
7173,10.95
7174,11.03
7175,10.95
7176,10.77
7177,10.50
7178,10.21
7179,9.92
7180,9.68
7181,9.53
7182,9.47
7183,9.47
7184,9.51
7185,9.56
7186,9.58
7187,9.54
7188,9.41
7189,9.24
7190,8.99
7191,8.71
7192,8.42
7193,7.90
7194,7.85
7195,8.19
7196,8.17
7197,6.56
7198,5.09
7199,7.41
7200,10.09
