1,2.75
2,3.24
3,1.50
4,-0.92
5,-1.36
6,1.10
7,4.51
8,6.32
9,6.09
10,5.54
11,5.87
12,6.45
13,5.85
14,4.09
15,2.60
16,2.52
17,3.51
18,4.53
19,5.09
20,5.68
21,6.63
22,7.41
23,7.13
24,5.73
25,4.21
26,3.55
27,3.88
28,4.64
29,5.24
30,5.43
31,4.98
32,3.92
33,2.76
34,2.19
35,2.26
36,2.14
37,1.39
38,0.81
39,2.06
40,5.41
41,9.00
42,10.10
43,7.91
44,4.23
45,1.79
46,1.28
47,1.06
48,-0.67
49,-3.50
50,-5.38
51,-4.98
52,-3.22
53,-2.20
54,-2.89
55,-4.34
56,-5.10
57,-4.65
58,-3.68
59,-2.87
60,-2.33
61,-1.78
62,-1.20
63,-0.71
64,-0.28
65,0.21
66,0.51
67,0.11
68,-1.01
69,-1.97
70,-2.26
71,-2.65
72,-4.45
73,-7.42
74,-9.63
75,-9.39
76,-7.34
77,-5.76
78,-6.23
79,-8.15
80,-9.99
81,-10.94
82,-11.51
83,-12.08
84,-12.29
85,-11.50
86,-10.05
87,-9.01
88,-8.97
89,-9.42
90,-9.54
91,-9.26
92,-9.19
93,-9.61
94,-9.90
95,-9.38
96,-8.23
97,-7.38
98,-7.41
99,-7.98
100,-8.33
101,-8.27
102,-8.07
103,-7.89
104,-7.23
105,-5.78
106,-4.24
107,-4.07
108,-5.80
109,-8.14
110,-9.19
111,-8.47
112,-7.01
113,-5.94
114,-5.04
115,-3.72
116,-2.48
117,-2.86
118,-5.26
119,-7.79
120,-7.63
121,-3.99
122,0.85
123,3.52
124,2.89
125,0.59
126,-0.77
127,-0.31
128,0.70
129,0.45
130,-1.48
131,-3.72
132,-4.32
133,-2.44
134,1.02
135,3.94
136,4.65
137,3.08
138,0.69
139,-0.85
140,-0.83
141,0.15
142,1.00
143,0.99
144,0.47
145,0.41
146,1.52
147,3.37
148,4.73
149,4.69
150,3.79
151,3.49
152,4.51
153,5.70
154,5.28
155,2.87
156,0.37
157,0.13
158,2.51
159,5.49
160,6.66
161,5.56
162,3.85
163,3.45
164,4.58
165,5.79
166,5.19
167,2.33
168,-1.55
169,-4.01
170,-3.71
171,-1.30
172,0.96
173,1.41
174,-0.05
175,-2.15
176,-4.22
177,-6.32
178,-8.89
179,-11.26
180,-12.58
181,-12.53
182,-11.91
183,-11.47
184,-11.41
185,-11.56
186,-12.50
187,-14.83
188,-18.08
189,-20.21
190,-19.60
191,-16.85
192,-14.25
193,-13.41
194,-14.12
195,-15.45
196,-17.20
197,-19.44
198,-21.26
199,-20.83
200,-17.27
201,-12.04
202,-7.97
203,-7.01
204,-8.60
205,-10.81
206,-12.16
207,-12.66
208,-12.88
209,-13.04
210,-12.81
211,-12.06
212,-11.13
213,-10.53
214,-10.50
215,-11.09
216,-12.37
217,-14.01
218,-15.05
219,-14.28
220,-11.85
221,-9.65
222,-9.94
223,-12.99
224,-16.49
225,-17.66
226,-16.13
227,-14.27
228,-14.80
229,-17.92
230,-21.19
231,-21.84
232,-19.64
233,-16.89
234,-15.89
235,-16.63
236,-17.50
237,-17.34
238,-16.57
239,-15.98
240,-15.71
241,-15.42
242,-15.39
243,-16.27
244,-17.87
245,-18.86
246,-17.95
247,-15.71
248,-14.58
249,-16.43
250,-20.34
251,-22.98
252,-21.96
253,-18.20
254,-15.02
255,-14.69
256,-16.63
257,-18.69
258,-19.72
259,-20.21
260,-20.89
261,-21.51
262,-21.52
263,-21.16
264,-21.40
265,-22.56
266,-23.39
267,-22.40
268,-19.94
269,-18.23
270,-18.85
271,-20.72
272,-21.20
273,-19.14
274,-16.18
275,-14.81
276,-15.28
277,-15.68
278,-14.55
279,-13.15
280,-13.72
281,-16.72
282,-19.79
283,-20.38
284,-18.32
285,-15.61
286,-13.76
287,-12.62
288,-11.38
289,-10.38
290,-10.62
291,-12.22
292,-13.62
293,-13.30
294,-11.63
295,-10.48
296,-10.85
297,-11.78
298,-11.74
299,-10.89
300,-10.64
301,-11.76
302,-13.19
303,-13.66
304,-13.18
305,-12.79
306,-12.74
307,-12.23
308,-10.41
309,-7.90
310,-6.20
311,-6.22
312,-7.10
313,-7.22
314,-5.76
315,-3.50
316,-1.59
317,-0.59
318,-0.10
319,0.23
320,0.43
321,0.26
322,-0.17
323,-0.58
324,-0.74
325,-0.79
326,-1.11
327,-2.08
328,-3.41
329,-4.27
330,-3.98
331,-3.05
332,-2.59
333,-3.08
334,-3.68
335,-3.10
336,-1.20
337,0.84
338,1.90
339,2.23
340,3.10
341,5.11
342,7.25
343,7.77
344,6.20
345,3.65
346,1.44
347,-0.32
348,-2.18
349,-3.90
350,-4.25
351,-2.41
352,0.77
353,3.58
354,5.22
355,6.01
356,6.36
357,5.68
358,3.27
359,-0.49
360,-3.93
361,-5.62
362,-5.17
363,-3.14
364,0.03
365,3.77
366,7.57
367,10.69
368,12.51
369,12.64
370,11.25
371,9.22
372,7.92
373,8.17
374,9.71
375,11.22
376,11.92
377,11.99
378,12.17
379,12.39
380,11.96
381,10.68
382,9.46
383,9.48
384,10.95
385,12.93
386,14.25
387,14.25
388,12.87
389,10.52
390,8.14
391,7.21
392,8.68
393,11.86
394,14.53
395,14.74
396,12.46
397,9.46
398,7.55
399,7.15
400,7.49
401,7.96
402,8.56
403,9.55
404,10.53
405,10.86
406,10.28
407,9.45
408,8.96
409,8.92
410,8.62
411,7.66
412,6.38
413,5.64
414,5.73
415,5.98
416,5.18
417,2.86
418,-0.13
419,-2.02
420,-1.88
421,-0.28
422,1.17
423,1.54
424,1.08
425,0.79
426,1.39
427,2.96
428,5.11
429,7.00
430,7.38
431,5.26
432,1.14
433,-2.64
434,-3.50
435,-0.87
436,3.19
437,5.86
438,5.99
439,4.61
440,3.34
441,2.71
442,1.86
443,0.11
444,-2.01
445,-2.87
446,-1.62
447,0.86
448,2.59
449,2.36
450,0.63
451,-1.21
452,-2.45
453,-3.30
454,-4.05
455,-4.18
456,-3.36
457,-2.20
458,-1.90
459,-2.53
460,-2.87
461,-1.97
462,-0.73
463,-0.99
464,-3.22
465,-5.66
466,-6.30
467,-5.08
468,-3.91
469,-4.29
470,-5.58
471,-5.94
472,-4.68
473,-3.00
474,-2.54
475,-3.66
476,-5.42
477,-6.65
478,-6.85
479,-6.04
480,-4.62
481,-3.41
482,-3.23
483,-4.12
484,-5.27
485,-5.96
486,-6.23
487,-6.57
488,-7.02
489,-7.03
490,-6.35
491,-5.65
492,-5.88
493,-7.12
494,-8.47
495,-8.97
496,-8.52
497,-7.55
498,-6.47
499,-5.38
500,-4.46
501,-4.06
502,-4.48
503,-5.56
504,-6.78
505,-7.73
506,-8.33
507,-8.75
508,-8.93
509,-8.72
510,-7.91
511,-6.80
512,-5.93
513,-5.95
514,-7.01
515,-8.50
516,-8.88
517,-6.75
518,-2.22
519,2.40
520,4.75
521,4.42
522,3.36
523,3.23
524,3.89
525,3.83
526,2.74
527,1.80
528,2.54
529,4.79
530,7.05
531,7.88
532,7.52
533,7.11
534,7.50
535,8.37
536,9.18
537,9.68
538,10.00
539,9.92
540,9.37
541,8.78
542,8.90
543,9.64
544,10.39
545,10.95
546,11.98
547,13.80
548,15.43
549,15.37
550,13.26
551,10.57
552,9.32
553,10.32
554,12.30
555,13.33
556,12.59
557,10.96
558,9.56
559,8.60
560,7.62
561,6.80
562,6.54
563,6.67
564,5.98
565,3.88
566,1.35
567,0.28
568,1.29
569,3.28
570,4.22
571,3.22
572,0.89
573,-1.35
574,-2.63
575,-3.01
576,-2.89
577,-2.44
578,-1.70
579,-0.79
580,0.02
581,0.58
582,1.05
583,1.64
584,2.49
585,3.58
586,4.64
587,5.15
588,4.70
589,3.43
590,2.45
591,2.84
592,4.56
593,5.96
594,5.36
595,2.76
596,0.17
597,-0.37
598,1.15
599,2.76
600,3.02
601,2.68
602,3.60
603,6.18
604,8.59
605,8.75
606,6.85
607,5.13
608,5.13
609,6.04
610,5.84
611,4.01
612,2.39
613,3.23
614,6.42
615,9.43
616,9.60
617,6.64
618,2.61
619,0.06
620,-0.42
621,-0.09
622,-0.55
623,-1.98
624,-3.32
625,-3.55
626,-2.75
627,-1.85
628,-1.56
629,-1.83
630,-2.45
631,-3.29
632,-3.92
633,-3.38
634,-1.12
635,1.66
636,2.85
637,1.52
638,-0.40
639,-0.17
640,2.56
641,4.87
642,4.04
643,0.91
644,-0.35
645,3.12
646,9.70
647,14.62
648,14.96
649,11.99
650,9.06
651,7.89
652,7.54
653,6.59
654,5.42
655,5.49
656,7.06
657,8.44
658,7.83
659,5.31
660,2.79
661,2.09
662,2.89
663,3.56
664,3.17
665,2.74
666,3.56
667,5.34
668,6.09
669,4.48
670,1.35
671,-1.02
672,-1.30
673,-0.10
674,0.87
675,0.72
676,0.09
677,0.27
678,1.45
679,2.40
680,1.87
681,0.10
682,-1.54
683,-2.06
684,-1.88
685,-2.00
686,-2.81
687,-3.77
688,-4.33
689,-4.43
690,-4.22
691,-3.58
692,-2.46
693,-1.33
694,-1.12
695,-2.15
696,-3.59
697,-4.07
698,-3.23
699,-2.01
700,-1.49
701,-1.64
702,-1.68
703,-1.37
704,-1.34
705,-2.15
706,-3.27
707,-3.70
708,-3.20
709,-2.61
710,-2.70
711,-3.31
712,-3.66
713,-3.46
714,-3.02
715,-2.60
716,-2.10
717,-1.52
718,-1.14
719,-1.02
720,-0.94
721,-0.61
722,-0.16
723,0.20
724,0.14
725,-0.58
726,-1.97
727,-3.54
728,-4.65
729,-5.12
730,-5.67
731,-7.06
732,-9.34
733,-11.53
734,-12.60
735,-12.25
736,-11.06
737,-9.70
738,-8.56
739,-7.77
740,-7.70
741,-8.60
742,-10.01
743,-10.78
744,-10.16
745,-8.68
746,-7.40
747,-6.75
748,-6.18
749,-5.39
750,-4.73
751,-4.73
752,-5.04
753,-4.95
754,-4.24
755,-3.48
756,-3.27
757,-3.46
758,-3.48
759,-3.09
760,-2.44
761,-1.64
762,-0.61
763,0.34
764,0.35
765,-1.33
766,-4.43
767,-7.70
768,-9.73
769,-9.91
770,-8.81
771,-7.72
772,-7.47
773,-7.85
774,-7.95
775,-7.28
776,-6.16
777,-5.23
778,-4.77
779,-4.55
780,-4.16
781,-3.37
782,-2.05
783,-0.45
784,0.87
785,0.96
786,-0.68
787,-3.49
788,-5.65
789,-5.49
790,-3.19
791,-1.07
792,-0.97
793,-2.34
794,-2.67
795,-0.72
796,2.00
797,2.82
798,1.14
799,-0.96
800,-0.97
801,1.48
802,4.81
803,7.19
804,8.00
805,7.40
806,5.68
807,3.42
808,1.76
809,1.83
810,3.68
811,6.12
812,7.41
813,6.68
814,4.52
815,2.44
816,1.45
817,1.44
818,1.32
819,0.32
820,-1.67
821,-3.90
822,-5.30
823,-4.97
824,-3.19
825,-1.52
826,-1.62
827,-3.52
828,-5.84
829,-7.23
830,-7.62
831,-7.62
832,-7.44
833,-6.69
834,-5.07
835,-2.89
836,-0.89
837,0.31
838,0.79
839,1.08
840,1.48
841,1.65
842,0.92
843,-0.85
844,-2.81
845,-3.66
846,-2.64
847,-0.37
848,1.51
849,1.49
850,-0.43
851,-2.66
852,-3.56
853,-2.93
854,-2.10
855,-2.22
856,-3.27
857,-4.22
858,-4.36
859,-3.73
860,-2.82
861,-1.94
862,-1.30
863,-1.10
864,-1.71
865,-3.23
866,-5.22
867,-6.84
868,-7.32
869,-6.45
870,-4.92
871,-4.05
872,-4.90
873,-7.19
874,-9.10
875,-8.59
876,-5.55
877,-2.12
878,-0.80
879,-1.96
880,-3.96
881,-5.23
882,-5.65
883,-5.88
884,-6.03
885,-5.75
886,-5.31
887,-5.71
888,-7.15
889,-8.33
890,-7.79
891,-5.91
892,-4.82
893,-5.81
894,-7.60
895,-7.70
896,-5.44
897,-2.87
898,-2.28
899,-3.61
900,-4.90
901,-4.92
902,-4.41
903,-4.68
904,-5.63
905,-6.07
906,-5.53
907,-4.86
908,-5.00
909,-5.70
910,-6.01
911,-5.71
912,-5.58
913,-6.21
914,-6.95
915,-6.87
916,-6.01
917,-5.53
918,-6.17
919,-7.28
920,-7.53
921,-6.49
922,-4.85
923,-3.36
924,-1.89
925,-0.03
926,1.91
927,2.73
928,1.60
929,-0.99
930,-3.34
931,-3.93
932,-2.67
933,-0.94
934,-0.35
935,-1.45
936,-3.07
937,-3.40
938,-1.63
939,1.07
940,2.46
941,1.31
942,-1.62
943,-4.17
944,-4.87
945,-3.90
946,-2.69
947,-2.32
948,-2.56
949,-2.46
950,-1.99
951,-2.49
952,-4.97
953,-8.36
954,-10.24
955,-9.20
956,-6.55
957,-4.69
958,-4.60
959,-4.94
960,-3.89
961,-1.30
962,0.94
963,0.77
964,-2.23
965,-6.35
966,-9.33
967,-9.77
968,-7.82
969,-4.78
970,-2.48
971,-2.21
972,-3.95
973,-6.18
974,-7.39
975,-7.49
976,-7.69
977,-8.79
978,-10.40
979,-11.62
980,-12.29
981,-12.90
982,-13.48
983,-13.24
984,-11.56
985,-9.02
986,-7.01
987,-6.33
988,-6.95
989,-8.39
990,-9.97
991,-10.48
992,-8.91
993,-5.75
994,-3.26
995,-3.54
996,-6.28
997,-9.01
998,-9.89
999,-9.65
1000,-10.29
1001,-12.22
1002,-13.86
1003,-13.78
1004,-12.65
1005,-12.16
1006,-12.64
1007,-12.80
1008,-11.79
1009,-10.56
1010,-10.50
1011,-11.44
1012,-11.99
1013,-11.71
1014,-11.77
1015,-13.04
1016,-14.03
1017,-12.45
1018,-8.24
1019,-4.59
1020,-4.49
1021,-7.58
1022,-10.37
1023,-10.36
1024,-8.29
1025,-6.72
1026,-6.44
1027,-6.00
1028,-3.86
1029,-0.83
1030,1.04
1031,0.63
1032,-1.02
1033,-2.21
1034,-2.35
1035,-1.96
1036,-1.43
1037,-0.60
1038,0.42
1039,0.65
1040,-0.87
1041,-3.81
1042,-6.30
1043,-6.68
1044,-5.17
1045,-3.54
1046,-3.39
1047,-4.61
1048,-5.75
1049,-5.64
1050,-4.46
1051,-3.34
1052,-3.25
1053,-4.20
1054,-5.56
1055,-6.52
1056,-6.51
1057,-5.45
1058,-3.83
1059,-2.61
1060,-2.80
1061,-4.58
1062,-6.79
1063,-7.65
1064,-6.41
1065,-4.15
1066,-2.73
1067,-2.86
1068,-3.67
1069,-3.99
1070,-3.86
1071,-4.11
1072,-5.09
1073,-5.93
1074,-5.68
1075,-4.49
1076,-3.78
1077,-4.77
1078,-7.10
1079,-9.13
1080,-9.86
1081,-9.91
1082,-10.49
1083,-11.61
1084,-11.89
1085,-10.27
1086,-7.68
1087,-6.20
1088,-6.92
1089,-8.63
1090,-9.02
1091,-6.91
1092,-3.38
1093,-0.67
1094,-0.35
1095,-2.31
1096,-5.12
1097,-7.26
1098,-7.85
1099,-7.19
1100,-6.22
1101,-5.92
1102,-6.71
1103,-8.30
1104,-9.71
1105,-9.83
1106,-8.26
1107,-5.73
1108,-3.78
1109,-3.43
1110,-4.22
1111,-4.62
1112,-3.89
1113,-3.06
1114,-3.86
1115,-6.52
1116,-9.19
1117,-9.61
1118,-7.62
1119,-5.18
1120,-4.33
1121,-5.16
1122,-6.36
1123,-6.93
1124,-7.32
1125,-8.26
1126,-9.87
1127,-11.55
1128,-13.13
1129,-14.73
1130,-16.31
1131,-17.16
1132,-16.80
1133,-15.68
1134,-14.84
1135,-14.67
1136,-14.88
1137,-15.14
1138,-15.67
1139,-16.47
1140,-16.82
1141,-15.77
1142,-13.49
1143,-11.34
1144,-10.65
1145,-11.41
1146,-12.48
1147,-12.82
1148,-12.37
1149,-11.63
1150,-11.00
1151,-10.55
1152,-10.44
1153,-10.91
1154,-12.25
1155,-14.45
1156,-16.89
1157,-18.50
1158,-18.66
1159,-17.92
1160,-18.08
1161,-20.43
1162,-23.94
1163,-25.59
1164,-23.44
1165,-18.96
1166,-15.82
1167,-16.06
1168,-18.21
1169,-19.29
1170,-18.14
1171,-16.15
1172,-14.90
1173,-14.43
1174,-13.87
1175,-13.37
1176,-13.96
1177,-15.96
1178,-17.69
1179,-17.31
1180,-15.07
1181,-13.36
1182,-13.71
1183,-14.89
1184,-14.45
1185,-11.89
1186,-9.62
1187,-10.08
1188,-12.56
1189,-13.87
1190,-12.15
1191,-9.46
1192,-9.41
1193,-13.37
1194,-17.72
1195,-18.51
1196,-16.08
1197,-15.25
1198,-17.03
1199,-15.93
1200,-9.06
