1,-156.77
2,-213.94
3,-191.36
4,-126.47
5,-68.60
6,-26.70
7,13.98
8,54.70
9,83.56
10,95.49
11,93.65
12,81.93
13,61.81
14,37.11
15,11.61
16,-8.56
17,-21.10
18,-22.61
19,-13.85
20,3.87
21,26.99
22,51.55
23,74.16
24,91.60
25,102.68
26,106.42
27,103.49
28,94.60
29,81.28
30,65.29
31,48.42
32,32.71
33,19.65
34,10.57
35,5.86
36,5.04
37,7.11
38,10.25
39,13.40
40,15.16
41,15.72
42,14.95
43,13.95
44,13.11
45,13.13
46,13.91
47,15.26
48,16.75
49,17.93
50,18.59
51,18.62
52,18.20
53,17.53
54,16.89
55,16.37
56,16.04
57,15.88
58,15.94
59,16.14
60,16.46
61,16.80
62,17.11
63,17.33
64,17.50
65,17.59
66,17.62
67,17.64
68,17.72
69,17.86
70,18.11
71,18.41
72,18.72
73,19.00
74,19.20
75,19.25
76,19.15
77,18.89
78,18.58
79,18.30
80,18.13
81,18.07
82,18.13
83,18.27
84,18.52
85,18.84
86,19.24
87,19.63
88,19.97
89,20.23
90,20.48
91,20.68
92,20.83
93,20.85
94,20.79
95,20.68
96,20.63
97,20.69
98,20.89
99,21.19
100,21.55
101,21.92
102,22.25
103,22.49
104,22.58
105,22.49
106,22.25
107,21.92
108,21.51
109,21.08
110,20.59
111,20.09
112,19.53
113,18.94
114,18.30
115,17.65
116,16.99
117,16.40
118,15.86
119,15.48
120,15.24
121,15.13
122,15.07
123,15.05
124,15.05
125,15.11
126,15.21
127,15.37
128,15.58
129,15.85
130,16.15
131,16.45
132,16.74
133,17.01
134,17.27
135,17.49
136,17.72
137,17.95
138,18.26
139,18.60
140,18.98
141,19.35
142,19.68
143,19.92
144,20.02
145,19.98
146,19.91
147,19.83
148,19.81
149,19.81
150,19.84
151,19.90
152,19.98
153,20.01
154,19.94
155,19.76
156,19.52
157,19.24
158,18.94
159,18.68
160,18.52
161,18.51
162,18.63
163,18.88
164,19.26
165,19.68
166,20.01
167,20.17
168,20.16
169,20.00
170,19.71
171,19.29
172,18.80
173,18.35
174,17.97
175,17.73
176,17.52
177,17.36
178,17.17
179,16.98
180,16.69
181,16.33
182,15.79
183,15.14
184,14.35
185,13.50
186,12.56
187,11.62
188,10.64
189,9.77
190,8.93
191,8.19
192,7.39
193,6.62
194,5.75
195,4.91
196,3.97
197,3.06
198,2.04
199,1.02
200,-0.12
201,-1.25
202,-2.44
203,-3.56
204,-4.68
205,-5.68
206,-6.55
207,-7.20
208,-7.71
209,-8.01
210,-8.19
211,-8.23
212,-8.26
213,-8.30
214,-8.38
215,-8.45
216,-8.48
217,-8.38
218,-8.13
219,-7.74
220,-7.25
221,-6.70
222,-6.15
223,-5.70
224,-5.44
225,-5.42
226,-5.55
227,-5.78
228,-6.03
229,-6.28
230,-6.42
231,-6.44
232,-6.28
233,-6.02
234,-5.64
235,-5.20
236,-4.68
237,-4.17
238,-3.61
239,-3.03
240,-2.33
241,-1.59
242,-0.81
243,-0.11
244,0.56
245,1.13
246,1.69
247,2.21
248,2.79
249,3.37
250,4.01
251,4.66
252,5.35
253,5.92
254,6.39
255,6.71
256,6.97
257,7.13
258,7.23
259,7.24
260,7.32
261,7.47
262,7.75
263,8.09
264,8.48
265,8.82
266,9.11
267,9.28
268,9.38
269,9.44
270,9.47
271,9.49
272,9.57
273,9.74
274,10.03
275,10.36
276,10.67
277,10.91
278,11.09
279,11.15
280,11.02
281,10.68
282,10.26
283,9.86
284,9.54
285,9.36
286,9.36
287,9.54
288,9.87
289,10.26
290,10.64
291,10.94
292,11.14
293,11.22
294,11.25
295,11.22
296,11.27
297,11.37
298,11.60
299,11.92
300,12.35
301,12.82
302,13.36
303,13.91
304,14.52
305,15.12
306,15.82
307,16.54
308,17.36
309,18.17
310,19.07
311,19.95
312,20.87
313,21.71
314,22.58
315,23.41
316,24.32
317,25.19
318,26.12
319,26.96
320,27.77
321,28.41
322,28.94
323,29.30
324,29.60
325,29.82
326,30.04
327,30.30
328,30.65
329,31.07
330,31.54
331,31.95
332,32.29
333,32.50
334,32.59
335,32.55
336,32.40
337,32.20
338,31.98
339,31.81
340,31.61
341,31.39
342,31.08
343,30.73
344,30.29
345,29.79
346,29.22
347,28.66
348,28.13
349,27.72
350,27.39
351,27.17
352,26.97
353,26.81
354,26.60
355,26.37
356,26.06
357,25.75
358,25.42
359,25.16
360,24.93
361,24.77
362,24.63
363,24.53
364,24.36
365,24.14
366,23.79
367,23.35
368,22.79
369,22.18
370,21.50
371,20.82
372,20.08
373,19.35
374,18.61
375,17.97
376,17.38
377,16.91
378,16.52
379,16.30
380,16.20
381,16.24
382,16.33
383,16.43
384,16.52
385,16.56
386,16.47
387,16.29
388,16.06
389,15.85
390,15.67
391,15.56
392,15.53
393,15.62
394,15.82
395,16.10
396,16.37
397,16.58
398,16.70
399,16.72
400,16.65
401,16.54
402,16.44
403,16.40
404,16.44
405,16.56
406,16.79
407,17.09
408,17.40
409,17.60
410,17.71
411,17.69
412,17.62
413,17.52
414,17.49
415,17.56
416,17.80
417,18.18
418,18.75
419,19.36
420,20.00
421,20.53
422,21.00
423,21.35
424,21.68
425,21.99
426,22.43
427,22.95
428,23.56
429,24.19
430,24.86
431,25.46
432,26.01
433,26.42
434,26.79
435,27.13
436,27.47
437,27.79
438,28.14
439,28.47
440,28.76
441,28.94
442,29.00
443,28.93
444,28.79
445,28.60
446,28.43
447,28.34
448,28.34
449,28.45
450,28.55
451,28.57
452,28.40
453,28.05
454,27.50
455,26.86
456,26.10
457,25.31
458,24.42
459,23.54
460,22.65
461,21.84
462,21.00
463,20.18
464,19.30
465,18.49
466,17.68
467,16.97
468,16.20
469,15.49
470,14.75
471,14.05
472,13.28
473,12.53
474,11.75
475,11.08
476,10.44
477,9.87
478,9.29
479,8.80
480,8.34
481,7.97
482,7.61
483,7.30
484,6.98
485,6.74
486,6.48
487,6.23
488,5.87
489,5.47
490,4.98
491,4.46
492,3.84
493,3.23
494,2.62
495,2.11
496,1.67
497,1.33
498,1.07
499,0.92
500,0.82
501,0.73
502,0.64
503,0.56
504,0.48
505,0.42
506,0.39
507,0.44
508,0.64
509,0.99
510,1.51
511,2.12
512,2.85
513,3.59
514,4.34
515,4.95
516,5.43
517,5.76
518,6.13
519,6.52
520,7.02
521,7.60
522,8.39
523,9.29
524,10.31
525,11.26
526,12.17
527,12.91
528,13.57
529,14.08
530,14.60
531,15.08
532,15.62
533,16.14
534,16.72
535,17.28
536,17.79
537,18.18
538,18.47
539,18.67
540,18.81
541,18.90
542,18.96
543,18.97
544,18.98
545,18.94
546,18.90
547,18.84
548,18.76
549,18.67
550,18.59
551,18.55
552,18.59
553,18.65
554,18.69
555,18.67
556,18.55
557,18.33
558,18.05
559,17.72
560,17.36
561,17.03
562,16.78
563,16.66
564,16.69
565,16.88
566,17.17
567,17.54
568,17.92
569,18.26
570,18.46
571,18.49
572,18.34
573,18.04
574,17.62
575,17.17
576,16.76
577,16.47
578,16.27
579,16.13
580,16.01
581,15.90
582,15.74
583,15.51
584,15.16
585,14.74
586,14.31
587,13.98
588,13.78
589,13.71
590,13.66
591,13.62
592,13.51
593,13.31
594,12.93
595,12.40
596,11.75
597,11.12
598,10.55
599,10.07
600,9.68
601,9.41
602,9.27
603,9.25
604,9.30
605,9.39
606,9.51
607,9.66
608,9.84
609,10.02
610,10.18
611,10.31
612,10.50
613,10.72
614,11.05
615,11.46
616,12.01
617,12.66
618,13.40
619,14.14
620,14.88
621,15.53
622,16.08
623,16.48
624,16.82
625,17.10
626,17.39
627,17.65
628,17.93
629,18.19
630,18.47
631,18.74
632,18.98
633,19.14
634,19.26
635,19.35
636,19.45
637,19.56
638,19.66
639,19.71
640,19.78
641,19.83
642,19.90
643,19.98
644,20.14
645,20.40
646,20.79
647,21.24
648,21.71
649,22.17
650,22.57
651,22.87
652,23.04
653,23.07
654,22.97
655,22.78
656,22.54
657,22.27
658,22.00
659,21.74
660,21.45
661,21.17
662,20.84
663,20.48
664,20.10
665,19.76
666,19.40
667,19.05
668,18.65
669,18.29
670,17.91
671,17.52
672,17.07
673,16.61
674,16.13
675,15.69
676,15.23
677,14.82
678,14.48
679,14.25
680,14.05
681,13.89
682,13.73
683,13.63
684,13.48
685,13.32
686,13.11
687,12.90
688,12.66
689,12.40
690,12.08
691,11.73
692,11.31
693,10.87
694,10.41
695,9.99
696,9.65
697,9.47
698,9.49
699,9.80
700,10.36
701,11.10
702,11.84
703,12.49
704,12.94
705,13.18
706,13.18
707,12.97
708,12.58
709,12.09
710,11.59
711,11.11
712,10.65
713,10.24
714,9.87
715,9.57
716,9.33
717,9.18
718,9.14
719,9.20
720,9.34
721,9.48
722,9.61
723,9.70
724,9.80
725,9.93
726,10.15
727,10.47
728,10.98
729,11.66
730,12.49
731,13.35
732,14.21
733,14.95
734,15.58
735,16.01
736,16.30
737,16.43
738,16.53
739,16.62
740,16.82
741,17.10
742,17.54
743,18.07
744,18.71
745,19.32
746,19.91
747,20.41
748,20.87
749,21.21
750,21.47
751,21.60
752,21.71
753,21.84
754,22.11
755,22.48
756,22.99
757,23.54
758,24.17
759,24.80
760,25.40
761,25.88
762,26.20
763,26.35
764,26.35
765,26.19
766,25.89
767,25.47
768,24.99
769,24.48
770,23.93
771,23.40
772,22.93
773,22.61
774,22.38
775,22.25
776,22.13
777,22.03
778,21.84
779,21.58
780,21.24
781,20.91
782,20.61
783,20.37
784,20.20
785,20.12
786,20.12
787,20.18
788,20.26
789,20.36
790,20.44
791,20.53
792,20.63
793,20.74
794,20.88
795,21.03
796,21.19
797,21.30
798,21.39
799,21.45
800,21.48
801,21.51
802,21.56
803,21.64
804,21.78
805,21.99
806,22.29
807,22.65
808,23.03
809,23.39
810,23.74
811,24.04
812,24.25
813,24.31
814,24.22
815,24.01
816,23.67
817,23.26
818,22.80
819,22.38
820,22.02
821,21.73
822,21.46
823,21.20
824,20.90
825,20.58
826,20.20
827,19.77
828,19.23
829,18.66
830,18.12
831,17.67
832,17.30
833,17.07
834,16.99
835,17.06
836,17.20
837,17.36
838,17.49
839,17.62
840,17.72
841,17.75
842,17.66
843,17.52
844,17.35
845,17.17
846,16.95
847,16.66
848,16.30
849,15.91
850,15.50
851,15.09
852,14.66
853,14.28
854,13.92
855,13.63
856,13.38
857,13.21
858,13.09
859,13.02
860,12.91
861,12.79
862,12.68
863,12.63
864,12.60
865,12.62
866,12.59
867,12.54
868,12.45
869,12.34
870,12.14
871,11.85
872,11.45
873,11.00
874,10.54
875,10.12
876,9.76
877,9.46
878,9.22
879,9.06
880,8.92
881,8.81
882,8.65
883,8.45
884,8.19
885,7.93
886,7.65
887,7.39
888,7.13
889,6.91
890,6.77
891,6.71
892,6.71
893,6.77
894,6.91
895,7.12
896,7.36
897,7.56
898,7.76
899,7.98
900,8.33
901,8.77
902,9.32
903,9.90
904,10.57
905,11.27
906,12.03
907,12.74
908,13.41
909,13.95
910,14.47
911,14.92
912,15.43
913,15.94
914,16.55
915,17.16
916,17.82
917,18.43
918,19.04
919,19.55
920,20.06
921,20.49
922,20.92
923,21.29
924,21.66
925,22.02
926,22.37
927,22.66
928,22.90
929,23.05
930,23.12
931,23.08
932,22.93
933,22.72
934,22.49
935,22.29
936,22.08
937,21.85
938,21.57
939,21.27
940,20.97
941,20.70
942,20.47
943,20.32
944,20.26
945,20.29
946,20.40
947,20.55
948,20.72
949,20.90
950,21.09
951,21.20
952,21.23
953,21.20
954,21.19
955,21.21
956,21.26
957,21.32
958,21.42
959,21.57
960,21.75
961,21.94
962,22.07
963,22.14
964,22.09
965,21.93
966,21.58
967,21.04
968,20.35
969,19.59
970,18.83
971,18.17
972,17.65
973,17.33
974,17.17
975,17.19
976,17.32
977,17.53
978,17.77
979,18.03
980,18.26
981,18.47
982,18.61
983,18.71
984,18.78
985,18.78
986,18.65
987,18.36
988,17.92
989,17.43
990,16.94
991,16.46
992,16.01
993,15.61
994,15.32
995,15.14
996,15.07
997,15.10
998,15.24
999,15.46
1000,15.82
1001,16.29
1002,16.91
1003,17.65
1004,18.50
1005,19.33
1006,20.13
1007,20.77
1008,21.31
1009,21.68
1010,21.97
1011,22.19
1012,22.45
1013,22.77
1014,23.19
1015,23.69
1016,24.28
1017,24.88
1018,25.42
1019,25.78
1020,25.93
1021,25.86
1022,25.64
1023,25.30
1024,24.90
1025,24.51
1026,24.20
1027,24.06
1028,24.04
1029,24.12
1030,24.19
1031,24.16
1032,23.98
1033,23.67
1034,23.19
1035,22.63
1036,21.97
1037,21.35
1038,20.82
1039,20.44
1040,20.13
1041,19.87
1042,19.62
1043,19.39
1044,19.12
1045,18.84
1046,18.52
1047,18.22
1048,17.93
1049,17.70
1050,17.53
1051,17.44
1052,17.40
1053,17.40
1054,17.46
1055,17.58
1056,17.72
1057,17.91
1058,18.16
1059,18.46
1060,18.75
1061,19.00
1062,19.17
1063,19.26
1064,19.27
1065,19.21
1066,19.08
1067,18.91
1068,18.69
1069,18.45
1070,18.19
1071,17.96
1072,17.74
1073,17.53
1074,17.30
1075,17.07
1076,16.85
1077,16.67
1078,16.50
1079,16.36
1080,16.24
1081,16.17
1082,16.20
1083,16.29
1084,16.42
1085,16.59
1086,16.84
1087,17.17
1088,17.55
1089,17.91
1090,18.23
1091,18.49
1092,18.74
1093,18.93
1094,19.11
1095,19.28
1096,19.54
1097,19.92
1098,20.43
1099,20.97
1100,21.49
1101,21.93
1102,22.32
1103,22.62
1104,22.79
1105,22.79
1106,22.64
1107,22.44
1108,22.21
1109,22.01
1110,21.77
1111,21.49
1112,21.09
1113,20.58
1114,19.96
1115,19.26
1116,18.45
1117,17.59
1118,16.67
1119,15.82
1120,15.05
1121,14.46
1122,13.99
1123,13.69
1124,13.46
1125,13.30
1126,13.08
1127,12.84
1128,12.49
1129,12.12
1130,11.66
1131,11.22
1132,10.80
1133,10.44
1134,10.12
1135,9.84
1136,9.55
1137,9.25
1138,8.92
1139,8.60
1140,8.30
1141,8.06
1142,7.86
1143,7.72
1144,7.63
1145,7.61
1146,7.61
1147,7.58
1148,7.49
1149,7.38
1150,7.26
1151,7.17
1152,7.10
1153,7.04
1154,7.01
1155,7.04
1156,7.12
1157,7.22
1158,7.28
1159,7.28
1160,7.21
1161,7.08
1162,6.95
1163,6.82
1164,6.72
1165,6.67
1166,6.68
1167,6.75
1168,6.93
1169,7.16
1170,7.47
1171,7.79
1172,8.12
1173,8.38
1174,8.59
1175,8.73
1176,8.87
1177,9.07
1178,9.40
1179,9.83
1180,10.41
1181,11.03
1182,11.70
1183,12.28
1184,12.78
1185,13.13
1186,13.37
1187,13.50
1188,13.60
1189,13.70
1190,13.92
1191,14.21
1192,14.56
1193,14.89
1194,15.19
1195,15.45
1196,15.71
1197,15.94
1198,16.17
1199,16.40
1200,16.67
1201,16.97
1202,17.28
1203,17.51
1204,17.66
1205,17.71
1206,17.74
1207,17.78
1208,17.92
1209,18.18
1210,18.63
1211,19.26
1212,20.02
1213,20.77
1214,21.44
1215,21.91
1216,22.19
1217,22.23
1218,22.12
1219,21.90
1220,21.67
1221,21.51
1222,21.47
1223,21.53
1224,21.65
1225,21.74
1226,21.79
1227,21.75
1228,21.65
1229,21.50
1230,21.33
1231,21.23
1232,21.29
1233,21.53
1234,21.92
1235,22.38
1236,22.83
1237,23.22
1238,23.51
1239,23.64
1240,23.54
1241,23.28
1242,22.89
1243,22.45
1244,22.03
1245,21.68
1246,21.44
1247,21.35
1248,21.36
1249,21.42
1250,21.52
1251,21.65
1252,21.75
1253,21.76
1254,21.64
1255,21.42
1256,21.17
1257,20.93
1258,20.69
1259,20.48
1260,20.33
1261,20.24
1262,20.21
1263,20.26
1264,20.45
1265,20.71
1266,21.01
1267,21.29
1268,21.54
1269,21.74
1270,21.90
1271,22.01
1272,22.12
1273,22.22
1274,22.40
1275,22.60
1276,22.85
1277,23.11
1278,23.41
1279,23.70
1280,23.99
1281,24.22
1282,24.44
1283,24.64
1284,24.87
1285,25.09
1286,25.34
1287,25.57
1288,25.83
1289,26.08
1290,26.37
1291,26.63
1292,26.91
1293,27.16
1294,27.44
1295,27.74
1296,28.10
1297,28.50
1298,28.98
1299,29.51
1300,30.11
1301,30.67
1302,31.17
1303,31.56
1304,31.86
1305,32.08
1306,32.26
1307,32.38
1308,32.48
1309,32.59
1310,32.75
1311,32.93
1312,33.10
1313,33.21
1314,33.33
1315,33.46
1316,33.67
1317,33.90
1318,34.16
1319,34.43
1320,34.74
1321,35.01
1322,35.18
1323,35.25
1324,35.21
1325,35.13
1326,34.97
1327,34.74
1328,34.42
1329,34.05
1330,33.55
1331,32.91
1332,32.04
1333,31.04
1334,29.89
1335,28.75
1336,27.53
1337,26.39
1338,25.31
1339,24.41
1340,23.53
1341,22.71
1342,21.77
1343,20.78
1344,19.62
1345,18.42
1346,17.12
1347,15.89
1348,14.70
1349,13.69
1350,12.83
1351,12.24
1352,11.82
1353,11.60
1354,11.44
1355,11.38
1356,11.34
1357,11.34
1358,11.30
1359,11.23
1360,11.14
1361,11.09
1362,11.01
1363,10.93
1364,10.84
1365,10.81
1366,10.83
1367,10.86
1368,10.87
1369,10.88
1370,10.89
1371,10.89
1372,10.84
1373,10.75
1374,10.67
1375,10.64
1376,10.65
1377,10.71
1378,10.82
1379,10.99
1380,11.27
1381,11.57
1382,11.84
1383,12.02
1384,12.10
1385,12.09
1386,12.04
1387,11.94
1388,11.83
1389,11.74
1390,11.70
1391,11.70
1392,11.73
1393,11.76
1394,11.78
1395,11.79
1396,11.75
1397,11.63
1398,11.41
1399,11.12
1400,10.77
1401,10.42
1402,10.05
1403,9.67
1404,9.25
1405,8.90
1406,8.61
1407,8.41
1408,8.26
1409,8.15
1410,8.03
1411,7.97
1412,7.86
1413,7.73
1414,7.48
1415,7.17
1416,6.74
1417,6.28
1418,5.73
1419,5.18
1420,4.57
1421,3.94
1422,3.17
1423,2.35
1424,1.46
1425,0.63
1426,-0.17
1427,-0.86
1428,-1.51
1429,-2.00
1430,-2.40
1431,-2.69
1432,-3.08
1433,-3.54
1434,-4.12
1435,-4.71
1436,-5.32
1437,-5.88
1438,-6.39
1439,-6.70
1440,-6.84
1441,-6.79
1442,-6.70
1443,-6.62
1444,-6.61
1445,-6.67
1446,-6.84
1447,-7.10
1448,-7.46
1449,-7.82
1450,-8.12
1451,-8.29
1452,-8.37
1453,-8.36
1454,-8.30
1455,-8.21
1456,-8.13
1457,-8.10
1458,-8.13
1459,-8.16
1460,-8.16
1461,-8.10
1462,-7.97
1463,-7.78
1464,-7.59
1465,-7.44
1466,-7.35
1467,-7.32
1468,-7.34
1469,-7.40
1470,-7.51
1471,-7.63
1472,-7.74
1473,-7.83
1474,-7.91
1475,-8.03
1476,-8.20
1477,-8.45
1478,-8.73
1479,-8.98
1480,-9.11
1481,-9.12
1482,-8.98
1483,-8.72
1484,-8.31
1485,-7.78
1486,-7.12
1487,-6.41
1488,-5.64
1489,-4.88
1490,-4.07
1491,-3.29
1492,-2.45
1493,-1.63
1494,-0.75
1495,0.09
1496,0.95
1497,1.69
1498,2.46
1499,3.17
1500,3.97
1501,4.71
1502,5.50
1503,6.22
1504,7.00
1505,7.75
1506,8.55
1507,9.31
1508,10.08
1509,10.81
1510,11.58
1511,12.28
1512,12.93
1513,13.46
1514,13.92
1515,14.23
1516,14.40
1517,14.39
1518,14.31
1519,14.19
1520,14.14
1521,14.18
1522,14.31
1523,14.54
1524,14.86
1525,15.21
1526,15.47
1527,15.59
1528,15.55
1529,15.33
1530,14.99
1531,14.60
1532,14.21
1533,13.87
1534,13.64
1535,13.55
1536,13.60
1537,13.79
1538,14.07
1539,14.43
1540,14.83
1541,15.23
1542,15.57
1543,15.81
1544,15.92
1545,15.95
1546,15.95
1547,15.96
1548,16.06
1549,16.23
1550,16.51
1551,16.84
1552,17.18
1553,17.44
1554,17.63
1555,17.74
1556,17.83
1557,17.91
1558,18.06
1559,18.29
1560,18.62
1561,19.00
1562,19.42
1563,19.84
1564,20.27
1565,20.64
1566,20.97
1567,21.25
1568,21.60
1569,22.00
1570,22.48
1571,22.94
1572,23.48
1573,24.06
1574,24.72
1575,25.37
1576,26.02
1577,26.60
1578,27.17
1579,27.69
1580,28.24
1581,28.74
1582,29.21
1583,29.58
1584,29.91
1585,30.17
1586,30.43
1587,30.62
1588,30.77
1589,30.85
1590,30.94
1591,31.08
1592,31.28
1593,31.49
1594,31.70
1595,31.88
1596,32.03
1597,32.11
1598,32.12
1599,32.03
1600,31.87
1601,31.68
1602,31.50
1603,31.36
1604,31.24
1605,31.19
1606,31.19
1607,31.23
1608,31.23
1609,31.18
1610,31.04
1611,30.77
1612,30.34
1613,29.81
1614,29.24
1615,28.72
1616,28.28
1617,27.97
1618,27.76
1619,27.68
1620,27.64
1621,27.63
1622,27.57
1623,27.44
1624,27.11
1625,26.61
1626,25.96
1627,25.31
1628,24.66
1629,24.07
1630,23.53
1631,23.12
1632,22.85
1633,22.74
1634,22.69
1635,22.67
1636,22.63
1637,22.58
1638,22.48
1639,22.34
1640,22.13
1641,21.93
1642,21.75
1643,21.63
1644,21.55
1645,21.51
1646,21.56
1647,21.68
1648,21.86
1649,22.03
1650,22.21
1651,22.35
1652,22.49
1653,22.64
1654,22.81
1655,22.98
1656,23.16
1657,23.36
1658,23.67
1659,24.12
1660,24.67
1661,25.28
1662,25.89
1663,26.43
1664,26.84
1665,27.11
1666,27.28
1667,27.31
1668,27.26
1669,27.14
1670,27.04
1671,26.99
1672,27.03
1673,27.12
1674,27.30
1675,27.53
1676,27.80
1677,28.11
1678,28.43
1679,28.74
1680,28.93
1681,28.98
1682,28.85
1683,28.55
1684,28.05
1685,27.43
1686,26.76
1687,26.20
1688,25.70
1689,25.31
1690,24.95
1691,24.64
1692,24.22
1693,23.69
1694,22.94
1695,22.06
1696,20.95
1697,19.78
1698,18.55
1699,17.41
1700,16.27
1701,15.16
1702,13.98
1703,12.87
1704,11.76
1705,10.75
1706,9.68
1707,8.70
1708,7.74
1709,6.92
1710,6.15
1711,5.49
1712,4.86
1713,4.38
1714,3.95
1715,3.65
1716,3.36
1717,3.14
1718,2.90
1719,2.68
1720,2.40
1721,2.12
1722,1.79
1723,1.43
1724,1.05
1725,0.66
1726,0.28
1727,-0.05
1728,-0.33
1729,-0.56
1730,-0.76
1731,-0.88
1732,-0.92
1733,-0.89
1734,-0.80
1735,-0.65
1736,-0.44
1737,-0.24
1738,-0.05
1739,0.06
1740,0.15
1741,0.23
1742,0.34
1743,0.47
1744,0.72
1745,1.07
1746,1.56
1747,2.12
1748,2.75
1749,3.36
1750,3.99
1751,4.54
1752,5.05
1753,5.49
1754,5.93
1755,6.36
1756,6.85
1757,7.33
1758,7.90
1759,8.48
1760,9.12
1761,9.74
1762,10.36
1763,10.91
1764,11.46
1765,11.98
1766,12.54
1767,13.09
1768,13.70
1769,14.32
1770,14.95
1771,15.53
1772,16.01
1773,16.27
1774,16.26
1775,15.95
1776,15.46
1777,14.94
1778,14.47
1779,14.10
1780,13.91
1781,13.89
1782,13.97
1783,14.10
1784,14.21
1785,14.24
1786,14.14
1787,13.94
1788,13.64
1789,13.37
1790,13.18
1791,13.13
1792,13.16
1793,13.23
1794,13.28
1795,13.29
1796,13.22
1797,13.08
1798,12.81
1799,12.49
1800,12.16
1801,11.86
1802,11.56
1803,11.31
1804,11.10
1805,10.96
1806,10.79
1807,10.59
1808,10.36
1809,10.16
1810,9.93
1811,9.68
1812,9.34
1813,8.96
1814,8.52
1815,8.09
1816,7.61
1817,7.14
1818,6.66
1819,6.26
1820,5.90
1821,5.62
1822,5.32
1823,5.04
1824,4.70
1825,4.33
1826,3.83
1827,3.22
1828,2.46
1829,1.66
1830,0.84
1831,0.13
1832,-0.48
1833,-0.93
1834,-1.21
1835,-1.29
1836,-1.21
1837,-1.03
1838,-0.81
1839,-0.56
1840,-0.28
1841,0.01
1842,0.30
1843,0.56
1844,0.87
1845,1.24
1846,1.72
1847,2.24
1848,2.87
1849,3.54
1850,4.31
1851,5.08
1852,5.84
1853,6.51
1854,7.16
1855,7.70
1856,8.22
1857,8.68
1858,9.19
1859,9.74
1860,10.36
1861,10.95
1862,11.52
1863,12.02
1864,12.49
1865,12.89
1866,13.24
1867,13.50
1868,13.73
1869,13.89
1870,14.07
1871,14.17
1872,14.24
1873,14.29
1874,14.41
1875,14.57
1876,14.77
1877,14.98
1878,15.27
1879,15.59
1880,15.90
1881,16.14
1882,16.33
1883,16.44
1884,16.48
1885,16.42
1886,16.31
1887,16.20
1888,16.14
1889,16.15
1890,16.23
1891,16.36
1892,16.46
1893,16.50
1894,16.45
1895,16.30
1896,16.03
1897,15.72
1898,15.37
1899,15.08
1900,14.81
1901,14.58
1902,14.34
1903,14.08
1904,13.75
1905,13.34
1906,12.82
1907,12.25
1908,11.67
1909,11.17
1910,10.73
1911,10.42
1912,10.20
1913,10.09
1914,10.00
1915,9.96
1916,9.91
1917,9.85
1918,9.74
1919,9.63
1920,9.57
1921,9.58
1922,9.66
1923,9.75
1924,9.88
1925,10.06
1926,10.28
1927,10.52
1928,10.78
1929,11.03
1930,11.32
1931,11.58
1932,11.83
1933,12.03
1934,12.23
1935,12.42
1936,12.71
1937,13.08
1938,13.59
1939,14.18
1940,14.88
1941,15.58
1942,16.28
1943,16.90
1944,17.49
1945,17.97
1946,18.40
1947,18.71
1948,19.00
1949,19.26
1950,19.55
1951,19.80
1952,20.03
1953,20.20
1954,20.36
1955,20.49
1956,20.66
1957,20.83
1958,21.06
1959,21.30
1960,21.62
1961,22.01
1962,22.52
1963,23.08
1964,23.64
1965,24.15
1966,24.66
1967,25.15
1968,25.63
1969,26.02
1970,26.33
1971,26.56
1972,26.75
1973,26.89
1974,27.01
1975,27.06
1976,27.07
1977,27.00
1978,26.89
1979,26.75
1980,26.57
1981,26.39
1982,26.21
1983,26.07
1984,25.94
1985,25.83
1986,25.68
1987,25.51
1988,25.29
1989,25.06
1990,24.78
1991,24.47
1992,24.08
1993,23.70
1994,23.32
1995,23.03
1996,22.79
1997,22.60
1998,22.38
1999,22.19
2000,21.93
2001,21.65
2002,21.27
2003,20.81
2004,20.22
2005,19.59
2006,18.96
2007,18.39
2008,17.90
2009,17.49
2010,17.16
2011,16.96
2012,16.86
2013,16.84
2014,16.81
2015,16.76
2016,16.69
2017,16.62
2018,16.56
2019,16.54
2020,16.56
2021,16.66
2022,16.78
2023,16.90
2024,17.01
2025,17.11
2026,17.14
2027,17.08
2028,16.92
2029,16.69
2030,16.39
2031,16.08
2032,15.81
2033,15.58
2034,15.37
2035,15.15
2036,14.93
2037,14.75
2038,14.66
2039,14.66
2040,14.70
2041,14.77
2042,14.87
2043,15.01
2044,15.18
2045,15.37
2046,15.57
2047,15.80
2048,16.08
2049,16.41
2050,16.80
2051,17.24
2052,17.74
2053,18.23
2054,18.75
2055,19.23
2056,19.67
2057,20.05
2058,20.38
2059,20.61
2060,20.77
2061,20.85
2062,20.90
2063,20.95
2064,21.05
2065,21.17
2066,21.32
2067,21.45
2068,21.60
2069,21.72
2070,21.81
2071,21.80
2072,21.71
2073,21.55
2074,21.42
2075,21.38
2076,21.44
2077,21.58
2078,21.87
2079,22.28
2080,22.83
2081,23.43
2082,24.02
2083,24.56
2084,25.05
2085,25.46
2086,25.78
2087,25.96
2088,26.03
2089,26.02
2090,25.99
2091,25.96
2092,25.95
2093,25.97
2094,26.05
2095,26.18
2096,26.31
2097,26.41
2098,26.41
2099,26.33
2100,26.15
2101,25.92
2102,25.58
2103,25.17
2104,24.69
2105,24.19
2106,23.63
2107,23.05
2108,22.38
2109,21.71
2110,21.00
2111,20.32
2112,19.65
2113,19.04
2114,18.46
2115,18.00
2116,17.60
2117,17.33
2118,17.07
2119,16.85
2120,16.58
2121,16.27
2122,15.84
2123,15.37
2124,14.82
2125,14.27
2126,13.69
2127,13.19
2128,12.76
2129,12.47
2130,12.29
2131,12.21
2132,12.16
2133,12.12
2134,12.02
2135,11.87
2136,11.65
2137,11.44
2138,11.31
2139,11.31
2140,11.42
2141,11.67
2142,12.05
2143,12.54
2144,13.02
2145,13.38
2146,13.58
2147,13.63
2148,13.60
2149,13.53
2150,13.47
2151,13.46
2152,13.58
2153,13.83
2154,14.25
2155,14.73
2156,15.26
2157,15.75
2158,16.25
2159,16.75
2160,17.28
2161,17.77
2162,18.23
2163,18.64
2164,19.09
2165,19.55
2166,20.05
2167,20.58
2168,21.22
2169,21.89
2170,22.59
2171,23.22
2172,23.79
2173,24.22
2174,24.51
2175,24.64
2176,24.64
2177,24.53
2178,24.35
2179,24.11
2180,23.87
2181,23.67
2182,23.46
2183,23.26
2184,23.06
2185,22.88
2186,22.68
2187,22.46
2188,22.14
2189,21.74
2190,21.21
2191,20.61
2192,19.96
2193,19.33
2194,18.78
2195,18.39
2196,18.17
2197,18.13
2198,18.15
2199,18.20
2200,18.19
2201,18.10
2202,17.91
2203,17.65
2204,17.32
2205,17.02
2206,16.77
2207,16.62
2208,16.58
2209,16.61
2210,16.68
2211,16.74
2212,16.78
2213,16.81
2214,16.85
2215,16.91
2216,16.99
2217,17.07
2218,17.18
2219,17.30
2220,17.43
2221,17.51
2222,17.57
2223,17.62
2224,17.74
2225,17.91
2226,18.13
2227,18.33
2228,18.52
2229,18.64
2230,18.68
2231,18.61
2232,18.49
2233,18.39
2234,18.38
2235,18.46
2236,18.67
2237,19.00
2238,19.45
2239,19.97
2240,20.45
2241,20.81
2242,21.03
2243,21.12
2244,21.09
2245,20.96
2246,20.79
2247,20.63
2248,20.57
2249,20.62
2250,20.80
2251,21.04
2252,21.32
2253,21.55
2254,21.73
2255,21.79
2256,21.72
2257,21.53
2258,21.30
2259,21.12
2260,21.03
2261,21.07
2262,21.17
2263,21.33
2264,21.51
2265,21.67
2266,21.71
2267,21.60
2268,21.32
2269,20.93
2270,20.45
2271,20.00
2272,19.67
2273,19.48
2274,19.41
2275,19.42
2276,19.52
2277,19.63
2278,19.70
2279,19.71
2280,19.68
2281,19.68
2282,19.68
2283,19.72
2284,19.80
2285,19.90
2286,19.92
2287,19.84
2288,19.64
2289,19.30
2290,18.82
2291,18.26
2292,17.68
2293,17.20
2294,16.85
2295,16.68
2296,16.67
2297,16.81
2298,16.95
2299,17.04
2300,16.97
2301,16.76
2302,16.38
2303,15.88
2304,15.30
2305,14.69
2306,14.10
2307,13.63
2308,13.31
2309,13.17
2310,13.14
2311,13.18
2312,13.23
2313,13.29
2314,13.34
2315,13.37
2316,13.37
2317,13.34
2318,13.31
2319,13.31
2320,13.36
2321,13.45
2322,13.56
2323,13.65
2324,13.72
2325,13.74
2326,13.74
2327,13.71
2328,13.66
2329,13.60
2330,13.52
2331,13.43
2332,13.36
2333,13.31
2334,13.33
2335,13.39
2336,13.51
2337,13.66
2338,13.82
2339,13.92
2340,14.01
2341,14.02
2342,14.02
2343,13.98
2344,13.97
2345,14.05
2346,14.31
2347,14.74
2348,15.37
2349,16.11
2350,16.96
2351,17.82
2352,18.67
2353,19.38
2354,19.97
2355,20.36
2356,20.66
2357,20.84
2358,21.03
2359,21.19
2360,21.40
2361,21.60
2362,21.84
2363,22.07
2364,22.29
2365,22.46
2366,22.64
2367,22.80
2368,23.00
2369,23.24
2370,23.54
2371,23.86
2372,24.19
2373,24.47
2374,24.67
2375,24.76
2376,24.72
2377,24.54
2378,24.24
2379,23.91
2380,23.58
2381,23.28
2382,22.99
2383,22.77
2384,22.58
2385,22.45
2386,22.26
2387,22.05
2388,21.75
2389,21.39
2390,20.91
2391,20.36
2392,19.75
2393,19.19
2394,18.64
2395,18.17
2396,17.78
2397,17.53
2398,17.35
2399,17.20
2400,17.06
2401,16.98
2402,16.94
2403,16.95
2404,16.93
2405,16.88
2406,16.82
2407,16.78
2408,16.75
2409,16.70
2410,16.64
2411,16.57
2412,16.48
2413,16.37
2414,16.25
2415,16.16
2416,16.09
2417,16.06
2418,16.09
2419,16.14
2420,16.17
2421,16.18
2422,16.17
2423,16.17
2424,16.17
2425,16.20
2426,16.30
2427,16.51
2428,16.80
2429,17.13
2430,17.49
2431,17.81
2432,18.07
2433,18.16
2434,18.09
2435,17.90
2436,17.68
2437,17.48
2438,17.39
2439,17.45
2440,17.71
2441,18.09
2442,18.55
2443,19.00
2444,19.43
2445,19.76
2446,19.91
2447,19.84
2448,19.64
2449,19.36
2450,19.06
2451,18.78
2452,18.59
2453,18.50
2454,18.55
2455,18.66
2456,18.81
2457,18.97
2458,19.13
2459,19.30
2460,19.48
2461,19.63
2462,19.77
2463,19.91
2464,20.07
2465,20.18
2466,20.23
2467,20.20
2468,20.14
2469,20.05
2470,19.91
2471,19.77
2472,19.63
2473,19.55
2474,19.47
2475,19.36
2476,19.17
2477,18.91
2478,18.56
2479,18.18
2480,17.76
2481,17.37
2482,17.04
2483,16.80
2484,16.65
2485,16.57
2486,16.49
2487,16.41
2488,16.28
2489,16.14
2490,15.98
2491,15.86
2492,15.79
2493,15.82
2494,15.97
2495,16.21
2496,16.51
2497,16.82
2498,17.07
2499,17.30
2500,17.46
2501,17.54
2502,17.52
2503,17.42
2504,17.21
2505,16.94
2506,16.60
2507,16.24
2508,15.91
2509,15.64
2510,15.43
2511,15.32
2512,15.28
2513,15.32
2514,15.37
2515,15.41
2516,15.38
2517,15.30
2518,15.14
2519,14.93
2520,14.68
2521,14.40
2522,14.16
2523,13.98
2524,13.87
2525,13.80
2526,13.81
2527,13.92
2528,14.19
2529,14.61
2530,15.13
2531,15.66
2532,16.22
2533,16.75
2534,17.25
2535,17.63
2536,17.92
2537,18.11
2538,18.31
2539,18.50
2540,18.75
2541,19.00
2542,19.33
2543,19.64
2544,19.94
2545,20.18
2546,20.38
2547,20.52
2548,20.62
2549,20.68
2550,20.74
2551,20.85
2552,21.03
2553,21.24
2554,21.48
2555,21.71
2556,21.93
2557,22.12
2558,22.25
2559,22.32
2560,22.26
2561,22.08
2562,21.81
2563,21.54
2564,21.29
2565,21.08
2566,20.90
2567,20.79
2568,20.76
2569,20.79
2570,20.84
2571,20.87
2572,20.89
2573,20.92
2574,20.94
2575,20.94
2576,20.92
2577,20.90
2578,20.87
2579,20.81
2580,20.68
2581,20.52
2582,20.30
2583,20.07
2584,19.78
2585,19.45
2586,19.13
2587,18.88
2588,18.59
2589,18.28
2590,17.89
2591,17.46
2592,16.91
2593,16.33
2594,15.68
2595,15.06
2596,14.46
2597,13.96
2598,13.55
2599,13.27
2600,13.04
2601,12.83
2602,12.57
2603,12.28
2604,11.96
2605,11.67
2606,11.39
2607,11.18
2608,11.09
2609,11.14
2610,11.36
2611,11.70
2612,12.11
2613,12.55
2614,13.02
2615,13.47
2616,13.89
2617,14.24
2618,14.55
2619,14.81
2620,15.08
2621,15.36
2622,15.71
2623,16.09
2624,16.50
2625,16.85
2626,17.14
2627,17.35
2628,17.51
2629,17.59
2630,17.61
2631,17.56
2632,17.55
2633,17.58
2634,17.64
2635,17.67
2636,17.66
2637,17.62
2638,17.61
2639,17.63
2640,17.71
2641,17.82
2642,17.97
2643,18.13
2644,18.27
2645,18.38
2646,18.47
2647,18.56
2648,18.68
2649,18.83
2650,19.02
2651,19.23
2652,19.45
2653,19.69
2654,19.92
2655,20.07
2656,20.10
2657,20.02
2658,19.83
2659,19.59
2660,19.32
2661,19.05
2662,18.80
2663,18.59
2664,18.44
2665,18.32
2666,18.20
2667,18.06
2668,17.88
2669,17.66
2670,17.42
2671,17.17
2672,16.98
2673,16.90
2674,16.92
2675,17.05
2676,17.22
2677,17.41
2678,17.56
2679,17.65
2680,17.65
2681,17.54
2682,17.32
2683,17.04
2684,16.77
2685,16.59
2686,16.52
2687,16.56
2688,16.63
2689,16.69
2690,16.69
2691,16.61
2692,16.46
2693,16.23
2694,15.97
2695,15.72
2696,15.59
2697,15.58
2698,15.70
2699,15.91
2700,16.23
2701,16.58
2702,16.94
2703,17.27
2704,17.59
2705,17.88
2706,18.14
2707,18.35
2708,18.51
2709,18.62
2710,18.72
2711,18.81
2712,18.90
2713,18.98
2714,19.09
2715,19.23
2716,19.46
2717,19.74
2718,20.10
2719,20.49
2720,20.92
2721,21.33
2722,21.70
2723,21.97
2724,22.16
2725,22.26
2726,22.33
2727,22.38
2728,22.51
2729,22.71
2730,22.98
2731,23.28
2732,23.62
2733,23.95
2734,24.22
2735,24.37
2736,24.38
2737,24.23
2738,23.92
2739,23.49
2740,23.04
2741,22.65
2742,22.33
2743,22.06
2744,21.84
2745,21.67
2746,21.51
2747,21.38
2748,21.20
2749,21.03
2750,20.85
2751,20.74
2752,20.66
2753,20.61
2754,20.54
2755,20.45
2756,20.34
2757,20.22
2758,20.10
2759,20.01
2760,19.99
2761,20.04
2762,20.16
2763,20.29
2764,20.39
2765,20.45
2766,20.48
2767,20.51
2768,20.55
2769,20.61
2770,20.69
2771,20.79
2772,20.85
2773,20.87
2774,20.75
2775,20.48
2776,20.03
2777,19.43
2778,18.75
2779,18.06
2780,17.40
2781,16.85
2782,16.39
2783,16.10
2784,15.93
2785,15.88
2786,15.88
2787,15.92
2788,15.96
2789,16.01
2790,15.98
2791,15.87
2792,15.63
2793,15.31
2794,14.92
2795,14.50
2796,14.04
2797,13.63
2798,13.31
2799,13.13
2800,13.05
2801,13.03
2802,13.05
2803,13.05
2804,12.96
2805,12.79
2806,12.54
2807,12.27
2808,11.97
2809,11.70
2810,11.51
2811,11.43
2812,11.41
2813,11.41
2814,11.41
2815,11.41
2816,11.44
2817,11.49
2818,11.58
2819,11.73
2820,11.97
2821,12.26
2822,12.58
2823,12.87
2824,13.17
2825,13.45
2826,13.77
2827,14.11
2828,14.56
2829,15.09
2830,15.72
2831,16.37
2832,17.05
2833,17.70
2834,18.33
2835,18.84
2836,19.29
2837,19.64
2838,19.98
2839,20.29
2840,20.62
2841,20.94
2842,21.32
2843,21.72
2844,22.16
2845,22.58
2846,23.00
2847,23.41
2848,23.81
2849,24.19
2850,24.60
2851,24.98
2852,25.33
2853,25.63
2854,25.89
2855,26.07
2856,26.12
2857,26.04
2858,25.86
2859,25.61
2860,25.31
2861,24.99
2862,24.65
2863,24.32
2864,23.99
2865,23.64
2866,23.24
2867,22.83
2868,22.38
2869,21.90
2870,21.39
2871,20.93
2872,20.51
2873,20.19
2874,19.90
2875,19.68
2876,19.46
2877,19.30
2878,19.13
2879,18.93
2880,18.64
2881,18.32
2882,17.97
2883,17.64
2884,17.33
2885,17.10
2886,16.94
2887,16.89
2888,16.90
2889,16.94
2890,16.95
2891,16.92
2892,16.84
2893,16.72
2894,16.59
2895,16.49
2896,16.46
2897,16.52
2898,16.69
2899,16.93
2900,17.22
2901,17.49
2902,17.69
2903,17.81
2904,17.85
2905,17.81
2906,17.75
2907,17.71
2908,17.78
2909,18.00
2910,18.30
2911,18.61
2912,18.86
2913,18.97
2914,18.91
2915,18.64
2916,18.20
2917,17.67
2918,17.19
2919,16.86
2920,16.74
2921,16.82
2922,17.10
2923,17.50
2924,17.98
2925,18.42
2926,18.74
2927,18.86
2928,18.84
2929,18.74
2930,18.59
2931,18.44
2932,18.34
2933,18.33
2934,18.44
2935,18.66
2936,18.96
2937,19.29
2938,19.60
2939,19.87
2940,20.10
2941,20.28
2942,20.37
2943,20.36
2944,20.32
2945,20.25
2946,20.19
2947,20.13
2948,20.11
2949,20.16
2950,20.30
2951,20.52
2952,20.77
2953,21.02
2954,21.19
2955,21.26
2956,21.20
2957,21.01
2958,20.71
2959,20.32
2960,19.91
2961,19.51
2962,19.17
2963,18.94
2964,18.83
2965,18.83
2966,18.85
2967,18.90
2968,18.94
2969,19.00
2970,19.03
2971,19.04
2972,19.04
2973,19.04
2974,19.00
2975,18.89
2976,18.70
2977,18.46
2978,18.17
2979,17.87
2980,17.59
2981,17.38
2982,17.25
2983,17.20
2984,17.16
2985,17.08
2986,16.92
2987,16.69
2988,16.37
2989,16.01
2990,15.64
2991,15.34
2992,15.13
2993,14.99
2994,14.88
2995,14.76
2996,14.60
2997,14.40
2998,14.14
2999,13.86
3000,13.63
3001,13.50
3002,13.52
3003,13.66
3004,13.95
3005,14.34
3006,14.82
3007,15.31
3008,15.85
3009,16.38
3010,16.94
3011,17.50
3012,18.07
3013,18.59
3014,19.13
3015,19.59
3016,20.00
3017,20.26
3018,20.41
3019,20.45
3020,20.48
3021,20.52
3022,20.68
3023,20.94
3024,21.33
3025,21.80
3026,22.32
3027,22.83
3028,23.32
3029,23.70
3030,23.96
3031,24.08
3032,24.09
3033,24.06
3034,24.02
3035,23.98
3036,23.97
3037,23.99
3038,24.10
3039,24.28
3040,24.50
3041,24.68
3042,24.80
3043,24.86
3044,24.86
3045,24.79
3046,24.70
3047,24.60
3048,24.54
3049,24.57
3050,24.71
3051,24.92
3052,25.16
3053,25.41
3054,25.64
3055,25.85
3056,26.01
3057,26.13
3058,26.22
3059,26.28
3060,26.29
3061,26.31
3062,26.31
3063,26.32
3064,26.25
3065,26.08
3066,25.80
3067,25.45
3068,24.98
3069,24.40
3070,23.66
3071,22.87
3072,22.00
3073,21.16
3074,20.25
3075,19.38
3076,18.48
3077,17.70
3078,16.95
3079,16.30
3080,15.57
3081,14.86
3082,14.05
3083,13.27
3084,12.40
3085,11.48
3086,10.48
3087,9.54
3088,8.68
3089,8.04
3090,7.55
3091,7.23
3092,7.04
3093,6.99
3094,7.03
3095,7.15
3096,7.33
3097,7.57
3098,7.90
3099,8.29
3100,8.81
3101,9.43
3102,10.21
3103,11.06
3104,12.00
3105,12.89
3106,13.75
3107,14.47
3108,15.14
3109,15.71
3110,16.31
3111,16.88
3112,17.49
3113,18.03
3114,18.62
3115,19.20
3116,19.81
3117,20.37
3118,20.92
3119,21.40
3120,21.91
3121,22.40
3122,22.93
3123,23.40
3124,23.83
3125,24.15
3126,24.38
3127,24.49
3128,24.52
3129,24.48
3130,24.42
3131,24.39
3132,24.42
3133,24.51
3134,24.64
3135,24.77
3136,24.85
3137,24.88
3138,24.84
3139,24.76
3140,24.62
3141,24.47
3142,24.33
3143,24.28
3144,24.31
3145,24.37
3146,24.38
3147,24.30
3148,24.12
3149,23.85
3150,23.48
3151,23.06
3152,22.65
3153,22.35
3154,22.19
3155,22.19
3156,22.22
3157,22.30
3158,22.32
3159,22.29
3160,22.08
3161,21.74
3162,21.22
3163,20.62
3164,19.96
3165,19.33
3166,18.74
3167,18.25
3168,17.80
3169,17.40
3170,16.97
3171,16.56
3172,16.16
3173,15.84
3174,15.56
3175,15.37
3176,15.21
3177,15.06
3178,14.88
3179,14.68
3180,14.46
3181,14.24
3182,14.05
3183,13.89
3184,13.83
3185,13.90
3186,14.06
3187,14.27
3188,14.48
3189,14.63
3190,14.72
3191,14.72
3192,14.65
3193,14.55
3194,14.48
3195,14.47
3196,14.57
3197,14.78
3198,15.09
3199,15.45
3200,15.82
3201,16.12
3202,16.32
3203,16.37
3204,16.30
3205,16.14
3206,15.97
3207,15.81
3208,15.72
3209,15.75
3210,15.94
3211,16.27
3212,16.69
3213,17.14
3214,17.59
3215,18.01
3216,18.38
3217,18.65
3218,18.80
3219,18.86
3220,18.87
3221,18.80
3222,18.65
3223,18.41
3224,18.11
3225,17.78
3226,17.42
3227,17.02
3228,16.65
3229,16.33
3230,16.14
3231,16.08
3232,16.15
3233,16.33
3234,16.62
3235,16.98
3236,17.39
3237,17.80
3238,18.23
3239,18.65
3240,19.07
3241,19.50
3242,20.00
3243,20.53
3244,21.10
3245,21.61
3246,22.03
3247,22.32
3248,22.54
3249,22.65
3250,22.65
3251,22.53
3252,22.35
3253,22.17
3254,21.99
3255,21.82
3256,21.64
3257,21.50
3258,21.35
3259,21.21
3260,21.03
3261,20.80
3262,20.47
3263,20.09
3264,19.66
3265,19.25
3266,18.83
3267,18.45
3268,18.10
3269,17.80
3270,17.53
3271,17.31
3272,17.08
3273,16.85
3274,16.57
3275,16.28
3276,15.98
3277,15.71
3278,15.47
3279,15.33
3280,15.27
3281,15.30
3282,15.38
3283,15.48
3284,15.59
3285,15.71
3286,15.80
3287,15.85
3288,15.91
3289,15.99
3290,16.14
3291,16.29
3292,16.40
3293,16.48
3294,16.62
3295,16.81
3296,17.10
3297,17.42
3298,17.82
3299,18.29
3300,18.85
3301,19.40
3302,19.97
3303,20.48
3304,21.06
3305,21.63
3306,22.26
3307,22.90
3308,23.68
3309,24.58
3310,25.63
3311,26.67
3312,27.69
3313,28.57
3314,29.37
3315,29.96
3316,30.43
3317,30.74
3318,31.05
3319,31.34
3320,31.73
3321,32.16
3322,32.73
3323,33.37
3324,34.12
3325,34.86
3326,35.58
3327,36.19
3328,36.74
3329,37.18
3330,37.57
3331,37.89
3332,38.17
3333,38.41
3334,38.61
3335,38.80
3336,38.92
3337,38.96
3338,38.86
3339,38.60
3340,38.15
3341,37.56
3342,36.83
3343,36.03
3344,35.14
3345,34.23
3346,33.26
3347,32.36
3348,31.46
3349,30.61
3350,29.71
3351,28.85
3352,27.92
3353,27.05
3354,26.13
3355,25.29
3356,24.46
3357,23.75
3358,23.03
3359,22.37
3360,21.66
3361,21.03
3362,20.39
3363,19.82
3364,19.18
3365,18.55
3366,17.86
3367,17.22
3368,16.56
3369,15.94
3370,15.24
3371,14.53
3372,13.78
3373,13.11
3374,12.50
3375,12.04
3376,11.64
3377,11.33
3378,11.03
3379,10.78
3380,10.49
3381,10.18
3382,9.77
3383,9.36
3384,8.96
3385,8.66
3386,8.48
3387,8.45
3388,8.58
3389,8.88
3390,9.32
3391,9.80
3392,10.24
3393,10.53
3394,10.72
3395,10.78
3396,10.82
3397,10.83
3398,10.94
3399,11.15
3400,11.57
3401,12.12
3402,12.87
3403,13.73
3404,14.69
3405,15.59
3406,16.48
3407,17.24
3408,17.95
3409,18.55
3410,19.16
3411,19.70
3412,20.28
3413,20.82
3414,21.43
3415,22.01
3416,22.60
3417,23.12
3418,23.64
3419,24.11
3420,24.54
3421,24.89
3422,25.20
3423,25.47
3424,25.70
3425,25.85
3426,25.89
3427,25.83
3428,25.70
3429,25.52
3430,25.28
3431,24.98
3432,24.67
3433,24.38
3434,24.05
3435,23.70
3436,23.30
3437,22.89
3438,22.42
3439,21.92
3440,21.38
3441,20.85
3442,20.32
3443,19.85
3444,19.41
3445,19.04
3446,18.68
3447,18.42
3448,18.21
3449,18.08
3450,17.95
3451,17.84
3452,17.71
3453,17.60
3454,17.50
3455,17.40
3456,17.29
3457,17.21
3458,17.21
3459,17.29
3460,17.41
3461,17.58
3462,17.80
3463,18.07
3464,18.29
3465,18.42
3466,18.46
3467,18.40
3468,18.20
3469,17.84
3470,17.39
3471,16.96
3472,16.60
3473,16.33
3474,16.15
3475,16.04
3476,15.96
3477,15.85
3478,15.64
3479,15.35
3480,14.98
3481,14.56
3482,14.10
3483,13.69
3484,13.36
3485,13.19
3486,13.13
3487,13.15
3488,13.16
3489,13.17
3490,13.08
3491,12.89
3492,12.53
3493,12.08
3494,11.60
3495,11.18
3496,10.83
3497,10.57
3498,10.36
3499,10.18
3500,10.02
3501,9.87
3502,9.72
3503,9.54
3504,9.34
3505,9.15
3506,9.05
3507,9.06
3508,9.25
3509,9.58
3510,10.04
3511,10.54
3512,11.07
3513,11.57
3514,12.08
3515,12.61
3516,13.19
3517,13.78
3518,14.40
3519,14.97
3520,15.46
3521,15.80
3522,16.06
3523,16.19
3524,16.27
3525,16.28
3526,16.33
3527,16.44
3528,16.66
3529,16.95
3530,17.32
3531,17.71
3532,18.10
3533,18.46
3534,18.76
3535,18.97
3536,19.08
3537,19.14
3538,19.17
3539,19.17
3540,19.11
3541,19.00
3542,18.86
3543,18.70
3544,18.52
3545,18.36
3546,18.18
3547,17.98
3548,17.69
3549,17.34
3550,16.94
3551,16.56
3552,16.16
3553,15.79
3554,15.41
3555,15.09
3556,14.79
3557,14.53
3558,14.24
3559,13.92
3560,13.57
3561,13.21
3562,12.83
3563,12.51
3564,12.25
3565,12.08
3566,11.95
3567,11.89
3568,11.93
3569,12.08
3570,12.29
3571,12.57
3572,12.90
3573,13.28
3574,13.70
3575,14.09
3576,14.45
3577,14.71
3578,14.88
3579,14.95
3580,15.01
3581,15.12
3582,15.37
3583,15.75
3584,16.27
3585,16.87
3586,17.52
3587,18.14
3588,18.71
3589,19.13
3590,19.37
3591,19.45
3592,19.46
3593,19.42
3594,19.36
3595,19.29
3596,19.27
3597,19.29
3598,19.37
3599,19.42
3600,19.48
3601,19.55
3602,19.72
3603,19.96
3604,20.26
3605,20.58
3606,20.96
3607,21.35
3608,21.68
3609,21.93
3610,22.08
3611,22.16
3612,22.19
3613,22.20
3614,22.19
3615,22.13
3616,21.97
3617,21.73
3618,21.49
3619,21.27
3620,21.06
3621,20.90
3622,20.80
3623,20.79
3624,20.81
3625,20.84
3626,20.83
3627,20.77
3628,20.58
3629,20.29
3630,19.94
3631,19.60
3632,19.30
3633,19.07
3634,18.92
3635,18.87
3636,18.85
3637,18.86
3638,18.86
3639,18.84
3640,18.74
3641,18.56
3642,18.30
3643,18.04
3644,17.78
3645,17.55
3646,17.30
3647,17.07
3648,16.85
3649,16.64
3650,16.43
3651,16.23
3652,16.00
3653,15.76
3654,15.50
3655,15.21
3656,14.86
3657,14.47
3658,14.03
3659,13.59
3660,13.19
3661,12.92
3662,12.81
3663,12.91
3664,13.18
3665,13.58
3666,13.98
3667,14.34
3668,14.54
3669,14.51
3670,14.17
3671,13.53
3672,12.73
3673,11.87
3674,11.07
3675,10.40
3676,9.99
3677,9.90
3678,10.12
3679,10.54
3680,11.08
3681,11.64
3682,12.23
3683,12.79
3684,13.32
3685,13.76
3686,14.18
3687,14.55
3688,14.94
3689,15.28
3690,15.63
3691,15.94
3692,16.30
3693,16.67
3694,17.10
3695,17.52
3696,18.06
3697,18.64
3698,19.31
3699,19.98
3700,20.71
3701,21.44
3702,22.25
3703,23.03
3704,23.83
3705,24.54
3706,25.19
3707,25.68
3708,26.03
3709,26.22
3710,26.37
3711,26.50
3712,26.70
3713,26.95
3714,27.36
3715,27.82
3716,28.31
3717,28.67
3718,28.91
3719,28.98
3720,28.95
3721,28.85
3722,28.76
3723,28.70
3724,28.65
3725,28.59
3726,28.52
3727,28.38
3728,28.10
3729,27.63
3730,26.95
3731,26.20
3732,25.45
3733,24.83
3734,24.34
3735,24.01
3736,23.83
3737,23.78
3738,23.79
3739,23.80
3740,23.75
3741,23.67
3742,23.57
3743,23.47
3744,23.38
3745,23.35
3746,23.42
3747,23.60
3748,23.87
3749,24.20
3750,24.59
3751,24.99
3752,25.43
3753,25.80
3754,26.18
3755,26.52
3756,26.89
3757,27.27
3758,27.70
3759,28.20
3760,28.82
3761,29.50
3762,30.22
3763,30.87
3764,31.46
3765,31.93
3766,32.30
3767,32.52
3768,32.67
3769,32.75
3770,32.84
3771,32.94
3772,33.11
3773,33.32
3774,33.56
3775,33.78
3776,33.91
3777,33.91
3778,33.79
3779,33.64
3780,33.50
3781,33.41
3782,33.36
3783,33.34
3784,33.31
3785,33.23
3786,33.03
3787,32.71
3788,32.26
3789,31.78
3790,31.28
3791,30.85
3792,30.46
3793,30.19
3794,29.91
3795,29.62
3796,29.27
3797,28.93
3798,28.55
3799,28.19
3800,27.73
3801,27.24
3802,26.67
3803,26.13
3804,25.50
3805,24.81
3806,23.95
3807,23.05
3808,22.05
3809,21.06
3810,19.96
3811,18.85
3812,17.68
3813,16.63
3814,15.61
3815,14.75
3816,13.94
3817,13.28
3818,12.63
3819,12.02
3820,11.26
3821,10.42
3822,9.38
3823,8.31
3824,7.17
3825,6.16
3826,5.26
3827,4.60
3828,4.11
3829,3.81
3830,3.54
3831,3.29
3832,2.98
3833,2.66
3834,2.29
3835,1.97
3836,1.74
3837,1.67
3838,1.76
3839,2.01
3840,2.42
3841,2.98
3842,3.67
3843,4.45
3844,5.31
3845,6.13
3846,6.90
3847,7.49
3848,7.95
3849,8.23
3850,8.38
3851,8.38
3852,8.41
3853,8.50
3854,8.78
3855,9.22
3856,9.86
3857,10.59
3858,11.42
3859,12.22
3860,12.98
3861,13.57
3862,14.01
3863,14.28
3864,14.50
3865,14.66
3866,14.86
3867,15.11
3868,15.51
3869,15.97
3870,16.50
3871,17.04
3872,17.59
3873,18.07
3874,18.42
3875,18.56
3876,18.52
3877,18.33
3878,18.07
3879,17.78
3880,17.57
3881,17.45
3882,17.42
3883,17.45
3884,17.54
3885,17.66
3886,17.77
3887,17.83
3888,17.84
3889,17.81
3890,17.75
3891,17.69
3892,17.65
3893,17.63
3894,17.58
3895,17.49
3896,17.36
3897,17.29
3898,17.25
3899,17.26
3900,17.23
3901,17.18
3902,17.09
3903,16.92
3904,16.54
3905,15.96
3906,15.20
3907,14.38
3908,13.57
3909,12.86
3910,12.28
3911,11.94
3912,11.76
3913,11.76
3914,11.80
3915,11.83
3916,11.65
3917,11.28
3918,10.68
3919,9.96
3920,9.15
3921,8.35
3922,7.61
3923,7.01
3924,6.55
3925,6.20
3926,5.91
3927,5.65
3928,5.36
3929,5.10
3930,4.88
3931,4.71
3932,4.64
3933,4.70
3934,4.95
3935,5.33
3936,5.79
3937,6.21
3938,6.61
3939,6.98
3940,7.37
3941,7.75
3942,8.21
3943,8.70
3944,9.27
3945,9.86
3946,10.47
3947,10.99
3948,11.43
3949,11.72
3950,11.95
3951,12.11
3952,12.28
3953,12.45
3954,12.69
3955,12.97
3956,13.35
3957,13.76
3958,14.21
3959,14.62
3960,15.01
3961,15.33
3962,15.59
3963,15.75
3964,15.88
3965,15.91
3966,15.96
3967,16.01
3968,16.14
3969,16.37
3970,16.73
3971,17.17
3972,17.69
3973,18.19
3974,18.66
3975,19.07
3976,19.47
3977,19.81
3978,20.15
3979,20.47
3980,20.83
3981,21.18
3982,21.51
3983,21.77
3984,22.02
3985,22.25
3986,22.49
3987,22.69
3988,22.87
3989,23.02
3990,23.15
3991,23.23
3992,23.26
3993,23.24
3994,23.18
3995,23.08
3996,22.96
3997,22.84
3998,22.75
3999,22.66
4000,22.52
4001,22.32
4002,22.06
4003,21.79
4004,21.49
4005,21.19
4006,20.94
4007,20.77
4008,20.65
4009,20.56
4010,20.49
4011,20.46
4012,20.46
4013,20.50
4014,20.55
4015,20.62
4016,20.65
4017,20.63
4018,20.52
4019,20.35
4020,20.07
4021,19.75
4022,19.40
4023,19.07
4024,18.76
4025,18.51
4026,18.27
4027,18.05
4028,17.72
4029,17.30
4030,16.70
4031,16.00
4032,15.17
4033,14.35
4034,13.51
4035,12.79
4036,12.10
4037,11.52
4038,10.97
4039,10.48
4040,9.96
4041,9.45
4042,8.85
4043,8.26
4044,7.67
4045,7.14
4046,6.63
4047,6.19
4048,5.82
4049,5.58
4050,5.48
4051,5.48
4052,5.56
4053,5.71
4054,5.94
4055,6.20
4056,6.49
4057,6.82
4058,7.23
4059,7.70
4060,8.22
4061,8.76
4062,9.34
4063,9.92
4064,10.52
4065,11.05
4066,11.54
4067,11.91
4068,12.22
4069,12.47
4070,12.77
4071,13.11
4072,13.55
4073,14.02
4074,14.53
4075,15.04
4076,15.53
4077,15.90
4078,16.17
4079,16.30
4080,16.42
4081,16.52
4082,16.67
4083,16.83
4084,17.09
4085,17.43
4086,17.91
4087,18.44
4088,19.04
4089,19.62
4090,20.24
4091,20.84
4092,21.39
4093,21.84
4094,22.15
4095,22.30
4096,22.29
4097,22.13
4098,21.88
4099,21.57
4100,21.27
4101,21.03
4102,20.87
4103,20.78
4104,20.76
4105,20.80
4106,20.84
4107,20.82
4108,20.66
4109,20.36
4110,19.95
4111,19.50
4112,19.06
4113,18.68
4114,18.36
4115,18.11
4116,17.96
4117,17.91
4118,17.93
4119,17.97
4120,17.95
4121,17.89
4122,17.78
4123,17.68
4124,17.52
4125,17.35
4126,17.16
4127,16.98
4128,16.79
4129,16.59
4130,16.37
4131,16.10
4132,15.77
4133,15.44
4134,15.15
4135,14.95
4136,14.78
4137,14.64
4138,14.50
4139,14.34
4140,14.18
4141,14.01
4142,13.84
4143,13.72
4144,13.66
4145,13.73
4146,13.92
4147,14.24
4148,14.64
4149,15.01
4150,15.29
4151,15.40
4152,15.34
4153,15.15
4154,14.95
4155,14.81
4156,14.82
4157,14.99
4158,15.40
4159,15.96
4160,16.62
4161,17.25
4162,17.83
4163,18.26
4164,18.56
4165,18.69
4166,18.78
4167,18.88
4168,19.09
4169,19.38
4170,19.78
4171,20.25
4172,20.81
4173,21.41
4174,22.02
4175,22.51
4176,22.87
4177,23.05
4178,23.10
4179,23.06
4180,22.99
4181,22.92
4182,22.92
4183,23.03
4184,23.28
4185,23.62
4186,23.96
4187,24.21
4188,24.32
4189,24.28
4190,24.11
4191,23.86
4192,23.64
4193,23.51
4194,23.50
4195,23.54
4196,23.58
4197,23.62
4198,23.61
4199,23.55
4200,23.43
4201,23.31
4202,23.23
4203,23.27
4204,23.38
4205,23.55
4206,23.69
4207,23.76
4208,23.68
4209,23.45
4210,23.04
4211,22.53
4212,21.97
4213,21.47
4214,21.03
4215,20.71
4216,20.48
4217,20.30
4218,20.13
4219,19.97
4220,19.77
4221,19.53
4222,19.21
4223,18.87
4224,18.50
4225,18.17
4226,17.85
4227,17.62
4228,17.51
4229,17.51
4230,17.56
4231,17.63
4232,17.72
4233,17.81
4234,17.84
4235,17.81
4236,17.78
4237,17.79
4238,17.88
4239,18.03
4240,18.28
4241,18.60
4242,18.99
4243,19.38
4244,19.76
4245,20.05
4246,20.23
4247,20.32
4248,20.37
4249,20.45
4250,20.60
4251,20.80
4252,21.10
4253,21.44
4254,21.87
4255,22.28
4256,22.69
4257,23.01
4258,23.26
4259,23.42
4260,23.57
4261,23.70
4262,23.89
4263,24.12
4264,24.43
4265,24.81
4266,25.28
4267,25.79
4268,26.31
4269,26.78
4270,27.24
4271,27.67
4272,28.13
4273,28.58
4274,29.01
4275,29.36
4276,29.65
4277,29.85
4278,30.01
4279,30.12
4280,30.21
4281,30.27
4282,30.32
4283,30.37
4284,30.44
4285,30.50
4286,30.53
4287,30.50
4288,30.40
4289,30.22
4290,30.00
4291,29.76
4292,29.50
4293,29.27
4294,29.06
4295,28.92
4296,28.80
4297,28.72
4298,28.63
4299,28.53
4300,28.34
4301,28.08
4302,27.73
4303,27.36
4304,26.89
4305,26.38
4306,25.75
4307,25.09
4308,24.29
4309,23.48
4310,22.59
4311,21.71
4312,20.76
4313,19.84
4314,18.84
4315,17.85
4316,16.73
4317,15.58
4318,14.29
4319,13.03
4320,11.72
4321,10.53
4322,9.36
4323,8.35
4324,7.35
4325,6.50
4326,5.63
4327,4.82
4328,3.93
4329,3.02
4330,2.07
4331,1.21
4332,0.43
4333,-0.18
4334,-0.68
4335,-0.99
4336,-1.15
4337,-1.14
4338,-1.02
4339,-0.81
4340,-0.52
4341,-0.16
4342,0.27
4343,0.70
4344,1.15
4345,1.59
4346,2.09
4347,2.58
4348,3.08
4349,3.58
4350,4.18
4351,4.84
4352,5.58
4353,6.27
4354,6.95
4355,7.55
4356,8.13
4357,8.62
4358,9.11
4359,9.56
4360,10.06
4361,10.58
4362,11.23
4363,11.92
4364,12.70
4365,13.40
4366,14.09
4367,14.70
4368,15.29
4369,15.78
4370,16.23
4371,16.60
4372,16.96
4373,17.24
4374,17.50
4375,17.70
4376,17.90
4377,18.09
4378,18.32
4379,18.56
4380,18.83
4381,19.09
4382,19.32
4383,19.47
4384,19.54
4385,19.51
4386,19.36
4387,19.15
4388,18.93
4389,18.75
4390,18.62
4391,18.51
4392,18.39
4393,18.28
4394,18.12
4395,17.95
4396,17.75
4397,17.56
4398,17.32
4399,17.05
4400,16.74
4401,16.46
4402,16.16
4403,15.87
4404,15.53
4405,15.17
4406,14.83
4407,14.54
4408,14.25
4409,13.99
4410,13.74
4411,13.57
4412,13.45
4413,13.40
4414,13.36
4415,13.34
4416,13.32
4417,13.32
4418,13.33
4419,13.36
4420,13.40
4421,13.47
4422,13.53
4423,13.60
4424,13.66
4425,13.73
4426,13.76
4427,13.73
4428,13.63
4429,13.48
4430,13.28
4431,13.03
4432,12.78
4433,12.54
4434,12.34
4435,12.21
4436,12.21
4437,12.31
4438,12.56
4439,12.89
4440,13.31
4441,13.74
4442,14.18
4443,14.56
4444,14.94
4445,15.24
4446,15.55
4447,15.83
4448,16.21
4449,16.67
4450,17.23
4451,17.83
4452,18.48
4453,19.09
4454,19.68
4455,20.14
4456,20.52
4457,20.74
4458,20.87
4459,20.98
4460,21.18
4461,21.45
4462,21.85
4463,22.29
4464,22.83
4465,23.42
4466,24.02
4467,24.53
4468,24.96
4469,25.27
4470,25.52
4471,25.72
4472,25.94
4473,26.16
4474,26.41
4475,26.68
4476,27.01
4477,27.35
4478,27.72
4479,28.05
4480,28.37
4481,28.66
4482,28.90
4483,29.08
4484,29.24
4485,29.37
4486,29.51
4487,29.59
4488,29.67
4489,29.74
4490,29.88
4491,30.09
4492,30.37
4493,30.70
4494,31.07
4495,31.43
4496,31.73
4497,31.97
4498,32.17
4499,32.28
4500,32.30
4501,32.22
4502,32.05
4503,31.84
4504,31.58
4505,31.32
4506,31.05
4507,30.78
4508,30.49
4509,30.17
4510,29.80
4511,29.42
4512,28.98
4513,28.56
4514,28.09
4515,27.66
4516,27.21
4517,26.80
4518,26.41
4519,26.06
4520,25.68
4521,25.25
4522,24.69
4523,24.00
4524,23.20
4525,22.37
4526,21.54
4527,20.78
4528,20.13
4529,19.66
4530,19.41
4531,19.38
4532,19.52
4533,19.80
4534,20.22
4535,20.75
4536,21.32
4537,21.84
4538,22.28
4539,22.63
4540,22.90
4541,23.07
4542,23.19
4543,23.26
4544,23.38
4545,23.51
4546,23.74
4547,24.00
4548,24.32
4549,24.60
4550,24.86
4551,25.09
4552,25.38
4553,25.73
4554,26.15
4555,26.59
4556,27.08
4557,27.59
4558,28.08
4559,28.49
4560,28.85
4561,29.14
4562,29.38
4563,29.57
4564,29.82
4565,30.10
4566,30.49
4567,30.86
4568,31.23
4569,31.55
4570,31.90
4571,32.24
4572,32.59
4573,32.89
4574,33.17
4575,33.40
4576,33.56
4577,33.62
4578,33.61
4579,33.51
4580,33.36
4581,33.17
4582,33.00
4583,32.88
4584,32.81
4585,32.78
4586,32.78
4587,32.78
4588,32.78
4589,32.80
4590,32.91
4591,33.15
4592,33.51
4593,33.97
4594,34.48
4595,35.00
4596,35.42
4597,35.64
4598,35.58
4599,35.26
4600,34.69
4601,33.96
4602,33.15
4603,32.38
4604,31.68
4605,31.12
4606,30.66
4607,30.35
4608,30.11
4609,29.95
4610,29.75
4611,29.54
4612,29.22
4613,28.88
4614,28.45
4615,27.99
4616,27.45
4617,26.90
4618,26.31
4619,25.76
4620,25.19
4621,24.70
4622,24.21
4623,23.77
4624,23.22
4625,22.64
4626,21.84
4627,20.98
4628,19.94
4629,18.87
4630,17.66
4631,16.43
4632,15.07
4633,13.73
4634,12.34
4635,11.03
4636,9.63
4637,8.29
4638,6.95
4639,5.78
4640,4.68
4641,3.76
4642,2.90
4643,2.22
4644,1.56
4645,1.01
4646,0.38
4647,-0.21
4648,-0.89
4649,-1.49
4650,-2.08
4651,-2.59
4652,-3.15
4653,-3.70
4654,-4.32
4655,-4.92
4656,-5.58
4657,-6.29
4658,-7.10
4659,-7.90
4660,-8.64
4661,-9.27
4662,-9.81
4663,-10.19
4664,-10.36
4665,-10.27
4666,-9.99
4667,-9.60
4668,-9.12
4669,-8.58
4670,-8.00
4671,-7.48
4672,-6.97
4673,-6.48
4674,-5.92
4675,-5.28
4676,-4.47
4677,-3.60
4678,-2.60
4679,-1.61
4680,-0.53
4681,0.52
4682,1.59
4683,2.56
4684,3.51
4685,4.34
4686,5.16
4687,5.88
4688,6.61
4689,7.23
4690,7.86
4691,8.40
4692,8.98
4693,9.52
4694,10.09
4695,10.58
4696,11.08
4697,11.51
4698,11.92
4699,12.27
4700,12.60
4701,12.85
4702,13.08
4703,13.28
4704,13.49
4705,13.69
4706,13.94
4707,14.20
4708,14.50
4709,14.79
4710,15.08
4711,15.31
4712,15.50
4713,15.58
4714,15.54
4715,15.41
4716,15.29
4717,15.22
4718,15.24
4719,15.33
4720,15.50
4721,15.75
4722,16.01
4723,16.25
4724,16.45
4725,16.59
4726,16.70
4727,16.78
4728,16.88
4729,17.00
4730,17.13
4731,17.21
4732,17.28
4733,17.33
4734,17.40
4735,17.49
4736,17.59
4737,17.68
4738,17.77
4739,17.85
4740,17.94
4741,18.03
4742,18.12
4743,18.20
4744,18.33
4745,18.49
4746,18.75
4747,19.07
4748,19.47
4749,19.88
4750,20.32
4751,20.70
4752,21.01
4753,21.21
4754,21.38
4755,21.48
4756,21.56
4757,21.61
4758,21.71
4759,21.88
4760,22.15
4761,22.47
4762,22.87
4763,23.31
4764,23.82
4765,24.35
4766,24.91
4767,25.41
4768,25.83
4769,26.13
4770,26.32
4771,26.37
4772,26.31
4773,26.12
4774,25.90
4775,25.71
4776,25.58
4777,25.47
4778,25.32
4779,25.09
4780,24.75
4781,24.33
4782,23.85
4783,23.38
4784,22.92
4785,22.58
4786,22.30
4787,22.11
4788,21.90
4789,21.68
4790,21.38
4791,21.03
4792,20.58
4793,20.12
4794,19.62
4795,19.18
4796,18.78
4797,18.46
4798,18.20
4799,18.01
4800,17.79
4801,17.56
4802,17.28
4803,17.01
4804,16.80
4805,16.69
4806,16.64
4807,16.65
4808,16.67
4809,16.70
4810,16.71
4811,16.65
4812,16.49
4813,16.26
4814,15.98
4815,15.70
4816,15.45
4817,15.25
4818,15.10
4819,15.01
4820,14.95
4821,14.94
4822,14.93
4823,14.94
4824,14.88
4825,14.78
4826,14.60
4827,14.42
4828,14.24
4829,14.07
4830,13.88
4831,13.70
4832,13.57
4833,13.51
4834,13.49
4835,13.46
4836,13.41
4837,13.35
4838,13.30
4839,13.24
4840,13.17
4841,13.11
4842,13.09
4843,13.15
4844,13.28
4845,13.50
4846,13.76
4847,14.06
4848,14.37
4849,14.66
4850,14.96
4851,15.23
4852,15.45
4853,15.59
4854,15.70
4855,15.81
4856,15.98
4857,16.17
4858,16.43
4859,16.72
4860,17.11
4861,17.52
4862,17.92
4863,18.26
4864,18.51
4865,18.65
4866,18.68
4867,18.63
4868,18.53
4869,18.43
4870,18.33
4871,18.28
4872,18.29
4873,18.32
4874,18.30
4875,18.16
4876,17.90
4877,17.57
4878,17.18
4879,16.75
4880,16.32
4881,15.96
4882,15.73
4883,15.65
4884,15.64
4885,15.69
4886,15.73
4887,15.73
4888,15.63
4889,15.43
4890,15.14
4891,14.82
4892,14.56
4893,14.37
4894,14.34
4895,14.45
4896,14.72
4897,15.08
4898,15.47
4899,15.84
4900,16.16
4901,16.39
4902,16.54
4903,16.65
4904,16.82
4905,17.08
4906,17.44
4907,17.83
4908,18.23
4909,18.59
4910,18.88
4911,19.06
4912,19.07
4913,18.96
4914,18.77
4915,18.55
4916,18.33
4917,18.12
4918,17.96
4919,17.84
4920,17.72
4921,17.61
4922,17.52
4923,17.48
4924,17.49
4925,17.56
4926,17.68
4927,17.86
4928,18.08
4929,18.28
4930,18.47
4931,18.62
4932,18.74
4933,18.78
4934,18.78
4935,18.78
4936,18.85
4937,19.04
4938,19.39
4939,19.87
4940,20.48
4941,21.13
4942,21.79
4943,22.39
4944,22.93
4945,23.34
4946,23.62
4947,23.74
4948,23.74
4949,23.67
4950,23.55
4951,23.43
4952,23.35
4953,23.28
4954,23.23
4955,23.20
4956,23.21
4957,23.27
4958,23.36
4959,23.46
4960,23.53
4961,23.53
4962,23.45
4963,23.29
4964,23.11
4965,22.93
4966,22.77
4967,22.64
4968,22.58
4969,22.62
4970,22.73
4971,22.86
4972,22.93
4973,22.93
4974,22.87
4975,22.77
4976,22.67
4977,22.59
4978,22.49
4979,22.38
4980,22.23
4981,22.06
4982,21.83
4983,21.56
4984,21.26
4985,20.97
4986,20.70
4987,20.43
4988,20.14
4989,19.85
4990,19.55
4991,19.27
4992,18.91
4993,18.50
4994,18.02
4995,17.58
4996,17.18
4997,16.86
4998,16.59
4999,16.39
5000,16.24
5001,16.17
5002,16.06
5003,15.89
5004,15.61
5005,15.25
5006,14.83
5007,14.38
5008,13.92
5009,13.53
5010,13.28
5011,13.18
5012,13.24
5013,13.47
5014,13.80
5015,14.18
5016,14.57
5017,14.90
5018,15.20
5019,15.45
5020,15.71
5021,16.00
5022,16.40
5023,16.89
5024,17.50
5025,18.16
5026,18.84
5027,19.43
5028,19.89
5029,20.16
5030,20.26
5031,20.15
5032,19.91
5033,19.60
5034,19.36
5035,19.25
5036,19.31
5037,19.46
5038,19.69
5039,19.92
5040,20.14
5041,20.29
5042,20.38
5043,20.42
5044,20.50
5045,20.65
5046,20.90
5047,21.22
5048,21.61
5049,22.00
5050,22.37
5051,22.67
5052,22.87
5053,22.93
5054,22.87
5055,22.74
5056,22.58
5057,22.44
5058,22.33
5059,22.27
5060,22.23
5061,22.18
5062,22.06
5063,21.90
5064,21.64
5065,21.35
5066,21.01
5067,20.65
5068,20.25
5069,19.87
5070,19.53
5071,19.27
5072,19.02
5073,18.77
5074,18.48
5075,18.21
5076,17.95
5077,17.72
5078,17.49
5079,17.27
5080,16.99
5081,16.70
5082,16.37
5083,16.01
5084,15.63
5085,15.28
5086,14.95
5087,14.69
5088,14.47
5089,14.33
5090,14.24
5091,14.25
5092,14.30
5093,14.37
5094,14.39
5095,14.37
5096,14.27
5097,14.12
5098,13.95
5099,13.76
5100,13.59
5101,13.44
5102,13.34
5103,13.30
5104,13.34
5105,13.44
5106,13.57
5107,13.70
5108,13.88
5109,14.09
5110,14.34
5111,14.57
5112,14.79
5113,15.00
5114,15.22
5115,15.45
5116,15.70
5117,15.93
5118,16.17
5119,16.41
5120,16.65
5121,16.89
5122,17.14
5123,17.37
5124,17.61
5125,17.78
5126,17.87
5127,17.90
5128,17.94
5129,17.95
5130,17.93
5131,17.90
5132,17.95
5133,18.13
5134,18.39
5135,18.67
5136,18.94
5137,19.17
5138,19.35
5139,19.44
5140,19.44
5141,19.38
5142,19.29
5143,19.23
5144,19.21
5145,19.27
5146,19.42
5147,19.59
5148,19.74
5149,19.84
5150,19.89
5151,19.85
5152,19.71
5153,19.51
5154,19.30
5155,19.17
5156,19.13
5157,19.21
5158,19.37
5159,19.58
5160,19.77
5161,19.94
5162,20.05
5163,20.11
5164,20.07
5165,19.96
5166,19.79
5167,19.64
5168,19.51
5169,19.40
5170,19.26
5171,19.12
5172,18.94
5173,18.74
5174,18.49
5175,18.23
5176,17.92
5177,17.63
5178,17.36
5179,17.13
5180,16.88
5181,16.62
5182,16.31
5183,15.98
5184,15.66
5185,15.36
5186,15.11
5187,14.92
5188,14.81
5189,14.76
5190,14.76
5191,14.79
5192,14.82
5193,14.82
5194,14.76
5195,14.65
5196,14.47
5197,14.26
5198,14.03
5199,13.81
5200,13.66
5201,13.63
5202,13.73
5203,13.95
5204,14.25
5205,14.60
5206,15.00
5207,15.38
5208,15.75
5209,16.07
5210,16.40
5211,16.71
5212,17.07
5213,17.40
5214,17.80
5215,18.23
5216,18.78
5217,19.33
5218,19.91
5219,20.49
5220,21.17
5221,21.87
5222,22.60
5223,23.24
5224,23.88
5225,24.45
5226,25.02
5227,25.51
5228,26.00
5229,26.46
5230,26.99
5231,27.53
5232,28.14
5233,28.73
5234,29.35
5235,29.89
5236,30.41
5237,30.85
5238,31.27
5239,31.64
5240,32.01
5241,32.36
5242,32.77
5243,33.23
5244,33.78
5245,34.34
5246,34.92
5247,35.46
5248,35.93
5249,36.22
5250,36.32
5251,36.23
5252,36.01
5253,35.74
5254,35.43
5255,35.14
5256,34.87
5257,34.64
5258,34.40
5259,34.15
5260,33.78
5261,33.32
5262,32.73
5263,32.12
5264,31.42
5265,30.72
5266,29.98
5267,29.29
5268,28.56
5269,27.84
5270,26.99
5271,26.09
5272,25.07
5273,24.05
5274,22.93
5275,21.90
5276,20.86
5277,19.97
5278,19.06
5279,18.20
5280,17.23
5281,16.28
5282,15.24
5283,14.26
5284,13.23
5285,12.30
5286,11.39
5287,10.64
5288,9.96
5289,9.38
5290,8.79
5291,8.21
5292,7.59
5293,7.02
5294,6.52
5295,6.17
5296,6.00
5297,6.03
5298,6.24
5299,6.64
5300,7.16
5301,7.75
5302,8.28
5303,8.67
5304,8.89
5305,8.95
5306,8.88
5307,8.71
5308,8.52
5309,8.37
5310,8.33
5311,8.42
5312,8.61
5313,8.85
5314,9.12
5315,9.35
5316,9.55
5317,9.69
5318,9.79
5319,9.83
5320,9.90
5321,10.01
5322,10.23
5323,10.54
5324,11.01
5325,11.54
5326,12.13
5327,12.71
5328,13.34
5329,13.95
5330,14.60
5331,15.21
5332,15.85
5333,16.53
5334,17.30
5335,18.09
5336,18.91
5337,19.68
5338,20.42
5339,21.06
5340,21.63
5341,22.03
5342,22.35
5343,22.56
5344,22.77
5345,22.93
5346,23.14
5347,23.33
5348,23.54
5349,23.73
5350,23.88
5351,23.99
5352,24.08
5353,24.17
5354,24.30
5355,24.44
5356,24.55
5357,24.57
5358,24.43
5359,24.14
5360,23.64
5361,22.96
5362,22.11
5363,21.22
5364,20.42
5365,19.80
5366,19.37
5367,19.13
5368,19.06
5369,19.13
5370,19.29
5371,19.51
5372,19.73
5373,19.97
5374,20.25
5375,20.54
5376,20.84
5377,21.14
5378,21.45
5379,21.76
5380,22.01
5381,22.16
5382,22.21
5383,22.20
5384,22.18
5385,22.18
5386,22.22
5387,22.31
5388,22.45
5389,22.60
5390,22.71
5391,22.74
5392,22.67
5393,22.54
5394,22.34
5395,22.09
5396,21.78
5397,21.46
5398,21.15
5399,20.82
5400,20.42
5401,19.94
5402,19.44
5403,18.95
5404,18.50
5405,18.14
5406,17.97
5407,18.04
5408,18.39
5409,18.94
5410,19.62
5411,20.31
5412,20.94
5413,21.45
5414,21.83
5415,22.02
5416,22.06
5417,22.00
5418,21.94
5419,21.93
5420,21.97
5421,22.03
5422,22.13
5423,22.20
5424,22.26
5425,22.25
5426,22.25
5427,22.23
5428,22.25
5429,22.31
5430,22.46
5431,22.69
5432,22.99
5433,23.29
5434,23.58
5435,23.85
5436,24.08
5437,24.23
5438,24.30
5439,24.29
5440,24.26
5441,24.22
5442,24.22
5443,24.25
5444,24.31
5445,24.43
5446,24.60
5447,24.78
5448,24.94
5449,25.05
5450,25.15
5451,25.21
5452,25.22
5453,25.15
5454,25.05
5455,24.92
5456,24.83
5457,24.80
5458,24.83
5459,24.89
5460,24.96
5461,25.02
5462,25.09
5463,25.18
5464,25.25
5465,25.33
5466,25.38
5467,25.45
5468,25.47
5469,25.42
5470,25.26
5471,25.03
5472,24.69
5473,24.25
5474,23.67
5475,23.03
5476,22.30
5477,21.63
5478,21.00
5479,20.44
5480,19.89
5481,19.40
5482,18.91
5483,18.45
5484,17.94
5485,17.42
5486,16.84
5487,16.25
5488,15.62
5489,15.03
5490,14.49
5491,14.08
5492,13.78
5493,13.57
5494,13.42
5495,13.34
5496,13.32
5497,13.35
5498,13.38
5499,13.41
5500,13.48
5501,13.63
5502,13.86
5503,14.17
5504,14.53
5505,14.90
5506,15.31
5507,15.73
5508,16.16
5509,16.51
5510,16.78
5511,16.94
5512,17.09
5513,17.23
5514,17.40
5515,17.57
5516,17.79
5517,18.01
5518,18.26
5519,18.49
5520,18.76
5521,18.98
5522,19.14
5523,19.20
5524,19.23
5525,19.24
5526,19.29
5527,19.34
5528,19.48
5529,19.68
5530,19.94
5531,20.21
5532,20.48
5533,20.72
5534,20.91
5535,21.03
5536,21.08
5537,21.07
5538,21.04
5539,20.98
5540,20.90
5541,20.78
5542,20.63
5543,20.42
5544,20.15
5545,19.85
5546,19.56
5547,19.32
5548,19.11
5549,18.97
5550,18.88
5551,18.83
5552,18.75
5553,18.64
5554,18.50
5555,18.38
5556,18.26
5557,18.18
5558,18.14
5559,18.14
5560,18.15
5561,18.12
5562,18.04
5563,17.92
5564,17.78
5565,17.62
5566,17.46
5567,17.31
5568,17.23
5569,17.22
5570,17.28
5571,17.37
5572,17.49
5573,17.60
5574,17.72
5575,17.85
5576,17.96
5577,18.04
5578,18.10
5579,18.13
5580,18.17
5581,18.20
5582,18.18
5583,18.11
5584,18.07
5585,18.10
5586,18.19
5587,18.31
5588,18.45
5589,18.60
5590,18.75
5591,18.83
5592,18.84
5593,18.78
5594,18.70
5595,18.62
5596,18.60
5597,18.62
5598,18.75
5599,19.01
5600,19.43
5601,19.94
5602,20.50
5603,21.03
5604,21.54
5605,21.94
5606,22.28
5607,22.51
5608,22.70
5609,22.83
5610,22.99
5611,23.16
5612,23.37
5613,23.57
5614,23.76
5615,23.87
5616,23.94
5617,23.97
5618,23.97
5619,23.94
5620,23.87
5621,23.81
5622,23.79
5623,23.83
5624,23.87
5625,23.91
5626,23.91
5627,23.89
5628,23.80
5629,23.64
5630,23.33
5631,22.91
5632,22.41
5633,21.90
5634,21.42
5635,20.97
5636,20.55
5637,20.20
5638,19.91
5639,19.68
5640,19.44
5641,19.21
5642,18.98
5643,18.81
5644,18.65
5645,18.55
5646,18.46
5647,18.41
5648,18.34
5649,18.27
5650,18.13
5651,17.93
5652,17.62
5653,17.21
5654,16.67
5655,16.08
5656,15.44
5657,14.85
5658,14.30
5659,13.79
5660,13.31
5661,12.91
5662,12.56
5663,12.34
5664,12.18
5665,12.10
5666,12.03
5667,11.99
5668,11.89
5669,11.72
5670,11.45
5671,11.12
5672,10.76
5673,10.40
5674,10.06
5675,9.80
5676,9.62
5677,9.53
5678,9.51
5679,9.54
5680,9.64
5681,9.79
5682,9.93
5683,10.03
5684,10.06
5685,10.06
5686,10.06
5687,10.06
5688,10.03
5689,10.00
5690,10.00
5691,10.00
5692,9.95
5693,9.77
5694,9.49
5695,9.18
5696,8.91
5697,8.72
5698,8.64
5699,8.70
5700,8.95
5701,9.37
5702,9.90
5703,10.44
5704,10.93
5705,11.34
5706,11.71
5707,12.02
5708,12.34
5709,12.66
5710,13.05
5711,13.47
5712,14.00
5713,14.53
5714,15.08
5715,15.54
5716,15.96
5717,16.30
5718,16.65
5719,16.96
5720,17.29
5721,17.64
5722,18.07
5723,18.54
5724,19.04
5725,19.49
5726,19.91
5727,20.25
5728,20.53
5729,20.71
5730,20.81
5731,20.80
5732,20.71
5733,20.58
5734,20.50
5735,20.50
5736,20.55
5737,20.61
5738,20.68
5739,20.74
5740,20.77
5741,20.69
5742,20.44
5743,20.08
5744,19.68
5745,19.32
5746,18.99
5747,18.70
5748,18.42
5749,18.20
5750,17.96
5751,17.68
5752,17.26
5753,16.73
5754,16.09
5755,15.46
5756,14.88
5757,14.41
5758,14.03
5759,13.74
5760,13.49
5761,13.29
5762,13.10
5763,12.90
5764,12.63
5765,12.34
5766,12.06
5767,11.88
5768,11.76
5769,11.68
5770,11.63
5771,11.59
5772,11.60
5773,11.62
5774,11.69
5775,11.80
5776,11.99
5777,12.26
5778,12.60
5779,12.95
5780,13.31
5781,13.60
5782,13.84
5783,13.99
5784,14.07
5785,14.05
5786,14.02
5787,14.00
5788,14.11
5789,14.31
5790,14.59
5791,14.92
5792,15.33
5793,15.76
5794,16.18
5795,16.54
5796,16.88
5797,17.17
5798,17.40
5799,17.55
5800,17.67
5801,17.80
5802,18.01
5803,18.23
5804,18.52
5805,18.84
5806,19.23
5807,19.65
5808,20.06
5809,20.35
5810,20.55
5811,20.69
5812,20.83
5813,20.97
5814,21.16
5815,21.39
5816,21.71
5817,22.09
5818,22.53
5819,22.95
5820,23.34
5821,23.64
5822,23.82
5823,23.87
5824,23.81
5825,23.70
5826,23.56
5827,23.41
5828,23.22
5829,23.02
5830,22.81
5831,22.61
5832,22.37
5833,22.10
5834,21.82
5835,21.59
5836,21.39
5837,21.26
5838,21.11
5839,20.98
5840,20.81
5841,20.60
5842,20.32
5843,20.00
5844,19.65
5845,19.29
5846,18.89
5847,18.51
5848,18.17
5849,17.90
5850,17.66
5851,17.49
5852,17.40
5853,17.36
5854,17.36
5855,17.36
5856,17.40
5857,17.51
5858,17.72
5859,17.99
5860,18.30
5861,18.60
5862,18.88
5863,19.08
5864,19.22
5865,19.27
5866,19.29
5867,19.32
5868,19.36
5869,19.42
5870,19.50
5871,19.59
5872,19.69
5873,19.76
5874,19.74
5875,19.66
5876,19.49
5877,19.29
5878,19.02
5879,18.73
5880,18.41
5881,18.05
5882,17.64
5883,17.19
5884,16.72
5885,16.31
5886,15.95
5887,15.65
5888,15.41
5889,15.29
5890,15.32
5891,15.50
5892,15.80
5893,16.16
5894,16.57
5895,17.01
5896,17.49
5897,17.94
5898,18.34
5899,18.69
5900,19.04
5901,19.36
5902,19.67
5903,19.94
5904,20.16
5905,20.33
5906,20.45
5907,20.52
5908,20.54
5909,20.53
5910,20.52
5911,20.52
5912,20.55
5913,20.61
5914,20.69
5915,20.75
5916,20.76
5917,20.71
5918,20.57
5919,20.33
5920,19.97
5921,19.52
5922,19.02
5923,18.54
5924,18.11
5925,17.79
5926,17.56
5927,17.46
5928,17.40
5929,17.39
5930,17.33
5931,17.22
5932,17.01
5933,16.75
5934,16.43
5935,16.11
5936,15.76
5937,15.44
5938,15.16
5939,14.96
5940,14.79
5941,14.65
5942,14.50
5943,14.35
5944,14.21
5945,14.09
5946,13.99
5947,13.88
5948,13.70
5949,13.50
5950,13.30
5951,13.11
5952,12.92
5953,12.73
5954,12.53
5955,12.37
5956,12.24
5957,12.07
5958,11.83
5959,11.50
5960,11.08
5961,10.62
5962,10.20
5963,9.86
5964,9.64
5965,9.56
5966,9.63
5967,9.83
5968,10.14
5969,10.47
5970,10.82
5971,11.16
5972,11.54
5973,11.92
5974,12.35
5975,12.82
5976,13.37
5977,13.92
5978,14.52
5979,15.08
5980,15.62
5981,16.08
5982,16.53
5983,16.92
5984,17.36
5985,17.79
5986,18.28
5987,18.75
5988,19.21
5989,19.59
5990,19.88
5991,20.03
5992,20.06
5993,19.99
5994,19.87
5995,19.71
5996,19.56
5997,19.44
5998,19.37
5999,19.33
6000,19.33
6001,19.33
6002,19.34
6003,19.30
6004,19.20
6005,19.07
6006,18.90
6007,18.75
6008,18.59
6009,18.46
6010,18.34
6011,18.28
6012,18.25
6013,18.23
6014,18.18
6015,18.10
6016,17.95
6017,17.75
6018,17.46
6019,17.14
6020,16.78
6021,16.42
6022,16.05
6023,15.72
6024,15.46
6025,15.28
6026,15.16
6027,15.10
6028,15.14
6029,15.26
6030,15.42
6031,15.58
6032,15.72
6033,15.86
6034,16.01
6035,16.17
6036,16.31
6037,16.46
6038,16.63
6039,16.87
6040,17.17
6041,17.50
6042,17.81
6043,18.05
6044,18.22
6045,18.30
6046,18.31
6047,18.24
6048,18.16
6049,18.10
6050,18.09
6051,18.11
6052,18.17
6053,18.29
6054,18.50
6055,18.77
6056,19.04
6057,19.26
6058,19.40
6059,19.45
6060,19.41
6061,19.24
6062,19.07
6063,18.97
6064,19.02
6065,19.23
6066,19.58
6067,20.03
6068,20.55
6069,21.06
6070,21.48
6071,21.68
6072,21.70
6073,21.53
6074,21.28
6075,21.00
6076,20.77
6077,20.65
6078,20.67
6079,20.84
6080,21.18
6081,21.60
6082,22.05
6083,22.48
6084,22.87
6085,23.18
6086,23.41
6087,23.57
6088,23.69
6089,23.77
6090,23.80
6091,23.81
6092,23.81
6093,23.81
6094,23.76
6095,23.61
6096,23.39
6097,23.15
6098,22.90
6099,22.67
6100,22.42
6101,22.18
6102,21.96
6103,21.79
6104,21.64
6105,21.53
6106,21.42
6107,21.30
6108,21.18
6109,21.06
6110,20.91
6111,20.74
6112,20.54
6113,20.32
6114,20.12
6115,19.98
6116,19.91
6117,19.87
6118,19.83
6119,19.78
6120,19.74
6121,19.71
6122,19.63
6123,19.49
6124,19.31
6125,19.10
6126,18.82
6127,18.51
6128,18.16
6129,17.83
6130,17.49
6131,17.21
6132,16.97
6133,16.82
6134,16.72
6135,16.70
6136,16.74
6137,16.81
6138,16.82
6139,16.73
6140,16.56
6141,16.36
6142,16.09
6143,15.80
6144,15.48
6145,15.21
6146,15.03
6147,14.97
6148,15.01
6149,15.11
6150,15.21
6151,15.31
6152,15.38
6153,15.38
6154,15.27
6155,15.06
6156,14.79
6157,14.51
6158,14.27
6159,14.09
6160,14.01
6161,14.04
6162,14.18
6163,14.38
6164,14.63
6165,14.86
6166,15.10
6167,15.27
6168,15.39
6169,15.44
6170,15.50
6171,15.58
6172,15.69
6173,15.81
6174,15.97
6175,16.13
6176,16.33
6177,16.53
6178,16.77
6179,17.01
6180,17.25
6181,17.48
6182,17.73
6183,18.02
6184,18.40
6185,18.81
6186,19.25
6187,19.68
6188,20.19
6189,20.74
6190,21.39
6191,22.00
6192,22.59
6193,23.12
6194,23.64
6195,24.10
6196,24.52
6197,24.84
6198,25.15
6199,25.43
6200,25.73
6201,25.99
6202,26.28
6203,26.59
6204,26.98
6205,27.40
6206,27.82
6207,28.18
6208,28.43
6209,28.52
6210,28.45
6211,28.21
6212,27.81
6213,27.30
6214,26.74
6215,26.26
6216,25.89
6217,25.70
6218,25.60
6219,25.60
6220,25.54
6221,25.34
6222,24.92
6223,24.33
6224,23.61
6225,22.93
6226,22.30
6227,21.84
6228,21.51
6229,21.35
6230,21.22
6231,21.04
6232,20.68
6233,20.14
6234,19.43
6235,18.65
6236,17.86
6237,17.18
6238,16.64
6239,16.29
6240,16.07
6241,15.97
6242,15.91
6243,15.89
6244,15.85
6245,15.80
6246,15.72
6247,15.63
6248,15.50
6249,15.36
6250,15.19
6251,15.05
6252,14.92
6253,14.86
6254,14.87
6255,14.96
6256,15.14
6257,15.38
6258,15.63
6259,15.85
6260,16.01
6261,16.08
6262,16.11
6263,16.14
6264,16.24
6265,16.45
6266,16.74
6267,17.10
6268,17.54
6269,18.02
6270,18.49
6271,18.84
6272,19.08
6273,19.19
6274,19.20
6275,19.13
6276,19.04
6277,18.94
6278,18.89
6279,18.88
6280,18.97
6281,19.11
6282,19.30
6283,19.52
6284,19.75
6285,20.00
6286,20.21
6287,20.36
6288,20.44
6289,20.46
6290,20.45
6291,20.42
6292,20.39
6293,20.36
6294,20.32
6295,20.27
6296,20.16
6297,20.04
6298,19.95
6299,19.92
6300,19.94
6301,20.01
6302,20.10
6303,20.20
6304,20.24
6305,20.21
6306,20.10
6307,19.92
6308,19.68
6309,19.45
6310,19.23
6311,19.08
6312,18.99
6313,18.97
6314,18.99
6315,19.03
6316,19.00
6317,18.91
6318,18.67
6319,18.34
6320,17.92
6321,17.48
6322,17.02
6323,16.61
6324,16.24
6325,15.94
6326,15.71
6327,15.59
6328,15.59
6329,15.66
6330,15.71
6331,15.75
6332,15.78
6333,15.77
6334,15.70
6335,15.59
6336,15.46
6337,15.37
6338,15.31
6339,15.32
6340,15.41
6341,15.59
6342,15.80
6343,16.01
6344,16.23
6345,16.40
6346,16.51
6347,16.58
6348,16.64
6349,16.72
6350,16.80
6351,16.84
6352,16.82
6353,16.73
6354,16.55
6355,16.26
6356,15.87
6357,15.44
6358,15.01
6359,14.66
6360,14.40
6361,14.25
6362,14.19
6363,14.20
6364,14.24
6365,14.31
6366,14.36
6367,14.35
6368,14.31
6369,14.27
6370,14.31
6371,14.38
6372,14.50
6373,14.65
6374,14.88
6375,15.21
6376,15.61
6377,16.05
6378,16.56
6379,17.08
6380,17.62
6381,18.11
6382,18.53
6383,18.84
6384,19.07
6385,19.18
6386,19.24
6387,19.22
6388,19.18
6389,19.14
6390,19.20
6391,19.34
6392,19.58
6393,19.84
6394,20.14
6395,20.46
6396,20.81
6397,21.14
6398,21.42
6399,21.63
6400,21.80
6401,21.98
6402,22.15
6403,22.31
6404,22.45
6405,22.56
6406,22.64
6407,22.67
6408,22.64
6409,22.53
6410,22.32
6411,22.03
6412,21.64
6413,21.22
6414,20.79
6415,20.41
6416,20.03
6417,19.72
6418,19.44
6419,19.25
6420,19.06
6421,18.87
6422,18.59
6423,18.28
6424,17.88
6425,17.46
6426,16.89
6427,16.29
6428,15.62
6429,14.97
6430,14.27
6431,13.62
6432,12.94
6433,12.30
6434,11.59
6435,10.89
6436,10.18
6437,9.52
6438,8.88
6439,8.31
6440,7.77
6441,7.29
6442,6.84
6443,6.42
6444,6.07
6445,5.87
6446,5.81
6447,5.91
6448,6.12
6449,6.42
6450,6.76
6451,7.03
6452,7.19
6453,7.25
6454,7.26
6455,7.24
6456,7.26
6457,7.36
6458,7.68
6459,8.20
6460,8.93
6461,9.71
6462,10.52
6463,11.22
6464,11.82
6465,12.28
6466,12.68
6467,12.99
6468,13.26
6469,13.44
6470,13.59
6471,13.69
6472,13.76
6473,13.79
6474,13.81
6475,13.83
6476,13.89
6477,13.93
6478,14.02
6479,14.13
6480,14.31
6481,14.52
6482,14.72
6483,14.90
6484,15.07
6485,15.21
6486,15.35
6487,15.49
6488,15.69
6489,15.99
6490,16.37
6491,16.76
6492,17.14
6493,17.43
6494,17.65
6495,17.76
6496,17.80
6497,17.73
6498,17.59
6499,17.40
6500,17.24
6501,17.14
6502,17.12
6503,17.16
6504,17.24
6505,17.33
6506,17.36
6507,17.30
6508,17.17
6509,16.96
6510,16.65
6511,16.27
6512,15.88
6513,15.58
6514,15.37
6515,15.24
6516,15.24
6517,15.39
6518,15.67
6519,16.04
6520,16.42
6521,16.76
6522,16.99
6523,17.09
6524,17.02
6525,16.81
6526,16.49
6527,16.12
6528,15.77
6529,15.50
6530,15.34
6531,15.29
6532,15.30
6533,15.34
6534,15.35
6535,15.32
6536,15.21
6537,15.04
6538,14.80
6539,14.53
6540,14.22
6541,13.92
6542,13.69
6543,13.57
6544,13.53
6545,13.57
6546,13.69
6547,13.87
6548,14.07
6549,14.21
6550,14.29
6551,14.32
6552,14.34
6553,14.36
6554,14.41
6555,14.50
6556,14.65
6557,14.85
6558,15.11
6559,15.38
6560,15.64
6561,15.88
6562,16.12
6563,16.33
6564,16.49
6565,16.57
6566,16.62
6567,16.67
6568,16.75
6569,16.84
6570,16.95
6571,17.07
6572,17.20
6573,17.31
6574,17.43
6575,17.52
6576,17.56
6577,17.52
6578,17.45
6579,17.35
6580,17.25
6581,17.17
6582,17.11
6583,17.05
6584,16.95
6585,16.84
6586,16.72
6587,16.63
6588,16.52
6589,16.38
6590,16.23
6591,16.07
6592,15.90
6593,15.76
6594,15.67
6595,15.64
6596,15.62
6597,15.60
6598,15.57
6599,15.54
6600,15.46
6601,15.36
6602,15.22
6603,15.10
6604,14.98
6605,14.89
6606,14.85
6607,14.88
6608,14.98
6609,15.11
6610,15.21
6611,15.24
6612,15.21
6613,15.11
6614,14.96
6615,14.80
6616,14.60
6617,14.36
6618,14.04
6619,13.66
6620,13.23
6621,12.78
6622,12.29
6623,11.83
6624,11.38
6625,11.03
6626,10.74
6627,10.51
6628,10.28
6629,10.09
6630,9.90
6631,9.69
6632,9.45
6633,9.22
6634,9.01
6635,8.87
6636,8.72
6637,8.56
6638,8.34
6639,8.09
6640,7.82
6641,7.56
6642,7.31
6643,7.10
6644,6.94
6645,6.88
6646,6.94
6647,7.07
6648,7.16
6649,7.18
6650,7.10
6651,6.97
6652,6.78
6653,6.55
6654,6.31
6655,6.10
6656,5.91
6657,5.80
6658,5.77
6659,5.79
6660,5.82
6661,5.82
6662,5.84
6663,5.90
6664,5.97
6665,6.09
6666,6.31
6667,6.66
6668,7.13
6669,7.67
6670,8.27
6671,8.87
6672,9.41
6673,9.80
6674,10.03
6675,10.09
6676,10.10
6677,10.11
6678,10.24
6679,10.47
6680,10.83
6681,11.23
6682,11.72
6683,12.21
6684,12.74
6685,13.21
6686,13.66
6687,14.06
6688,14.49
6689,14.89
6690,15.30
6691,15.69
6692,16.10
6693,16.47
6694,16.80
6695,17.06
6696,17.35
6697,17.67
6698,18.01
6699,18.28
6700,18.46
6701,18.55
6702,18.55
6703,18.42
6704,18.18
6705,17.88
6706,17.60
6707,17.38
6708,17.23
6709,17.11
6710,17.04
6711,16.98
6712,16.90
6713,16.75
6714,16.53
6715,16.30
6716,16.07
6717,15.86
6718,15.64
6719,15.43
6720,15.28
6721,15.19
6722,15.12
6723,15.07
6724,15.05
6725,15.11
6726,15.21
6727,15.29
6728,15.27
6729,15.15
6730,14.91
6731,14.58
6732,14.20
6733,13.80
6734,13.44
6735,13.17
6736,13.05
6737,13.08
6738,13.19
6739,13.36
6740,13.53
6741,13.67
6742,13.76
6743,13.76
6744,13.69
6745,13.60
6746,13.52
6747,13.46
6748,13.43
6749,13.46
6750,13.57
6751,13.76
6752,13.94
6753,14.07
6754,14.11
6755,14.08
6756,13.97
6757,13.81
6758,13.66
6759,13.57
6760,13.55
6761,13.58
6762,13.66
6763,13.75
6764,13.83
6765,13.86
6766,13.82
6767,13.69
6768,13.53
6769,13.40
6770,13.39
6771,13.47
6772,13.63
6773,13.85
6774,14.11
6775,14.41
6776,14.71
6777,14.98
6778,15.24
6779,15.50
6780,15.79
6781,16.08
6782,16.39
6783,16.66
6784,16.86
6785,16.95
6786,16.93
6787,16.80
6788,16.61
6789,16.40
6790,16.20
6791,16.05
6792,15.96
6793,15.94
6794,15.95
6795,15.92
6796,15.82
6797,15.64
6798,15.40
6799,15.13
6800,14.83
6801,14.53
6802,14.24
6803,13.98
6804,13.73
6805,13.50
6806,13.26
6807,13.05
6808,12.88
6809,12.76
6810,12.70
6811,12.66
6812,12.66
6813,12.68
6814,12.79
6815,12.99
6816,13.28
6817,13.57
6818,13.89
6819,14.21
6820,14.56
6821,14.89
6822,15.17
6823,15.35
6824,15.47
6825,15.52
6826,15.53
6827,15.50
6828,15.46
6829,15.43
6830,15.37
6831,15.29
6832,15.18
6833,15.05
6834,14.92
6835,14.81
6836,14.73
6837,14.70
6838,14.66
6839,14.61
6840,14.54
6841,14.42
6842,14.21
6843,13.89
6844,13.48
6845,13.08
6846,12.73
6847,12.53
6848,12.52
6849,12.73
6850,13.10
6851,13.57
6852,14.04
6853,14.42
6854,14.67
6855,14.79
6856,14.82
6857,14.84
6858,14.90
6859,15.01
6860,15.21
6861,15.48
6862,15.81
6863,16.14
6864,16.44
6865,16.60
6866,16.65
6867,16.62
6868,16.59
6869,16.58
6870,16.59
6871,16.62
6872,16.72
6873,16.87
6874,17.01
6875,17.07
6876,17.06
6877,16.97
6878,16.79
6879,16.49
6880,16.08
6881,15.63
6882,15.21
6883,14.88
6884,14.62
6885,14.44
6886,14.36
6887,14.37
6888,14.39
6889,14.37
6890,14.26
6891,14.08
6892,13.87
6893,13.67
6894,13.54
6895,13.52
6896,13.64
6897,13.88
6898,14.18
6899,14.52
6900,14.86
6901,15.15
6902,15.36
6903,15.48
6904,15.57
6905,15.68
6906,15.85
6907,16.10
6908,16.42
6909,16.78
6910,17.12
6911,17.39
6912,17.59
6913,17.74
6914,17.83
6915,17.82
6916,17.74
6917,17.62
6918,17.50
6919,17.41
6920,17.33
6921,17.24
6922,17.16
6923,17.07
6924,16.94
6925,16.76
6926,16.56
6927,16.42
6928,16.32
6929,16.27
6930,16.21
6931,16.13
6932,16.00
6933,15.82
6934,15.56
6935,15.20
6936,14.79
6937,14.39
6938,14.06
6939,13.85
6940,13.77
6941,13.83
6942,14.03
6943,14.34
6944,14.70
6945,15.07
6946,15.36
6947,15.57
6948,15.72
6949,15.81
6950,15.82
6951,15.73
6952,15.56
6953,15.35
6954,15.10
6955,14.83
6956,14.55
6957,14.28
6958,14.03
6959,13.82
6960,13.64
6961,13.50
6962,13.37
6963,13.27
6964,13.12
6965,12.95
6966,12.73
6967,12.53
6968,12.35
6969,12.24
6970,12.14
6971,12.06
6972,11.96
6973,11.85
6974,11.67
6975,11.44
6976,11.15
6977,10.82
6978,10.44
6979,10.06
6980,9.69
6981,9.34
6982,8.95
6983,8.54
6984,8.09
6985,7.64
6986,7.20
6987,6.85
6988,6.60
6989,6.45
6990,6.36
6991,6.25
6992,6.10
6993,5.91
6994,5.71
6995,5.54
6996,5.40
6997,5.34
6998,5.38
6999,5.52
7000,5.78
7001,6.15
7002,6.58
7003,7.00
7004,7.38
7005,7.67
7006,7.90
7007,8.07
7008,8.21
7009,8.31
7010,8.45
7011,8.62
7012,8.87
7013,9.16
7014,9.50
7015,9.86
7016,10.24
7017,10.55
7018,10.80
7019,10.95
7020,11.05
7021,11.16
7022,11.32
7023,11.52
7024,11.82
7025,12.17
7026,12.58
7027,12.96
7028,13.29
7029,13.47
7030,13.50
7031,13.37
7032,13.14
7033,12.89
7034,12.71
7035,12.64
7036,12.70
7037,12.85
7038,13.08
7039,13.32
7040,13.53
7041,13.67
7042,13.79
7043,13.90
7044,14.05
7045,14.28
7046,14.67
7047,15.17
7048,15.72
7049,16.17
7050,16.51
7051,16.72
7052,16.80
7053,16.72
7054,16.53
7055,16.28
7056,16.11
7057,16.06
7058,16.19
7059,16.43
7060,16.75
7061,17.09
7062,17.38
7063,17.59
7064,17.74
7065,17.82
7066,17.84
7067,17.78
7068,17.65
7069,17.50
7070,17.37
7071,17.28
7072,17.20
7073,17.11
7074,17.04
7075,16.98
7076,16.91
7077,16.82
7078,16.72
7079,16.62
7080,16.55
7081,16.49
7082,16.44
7083,16.42
7084,16.43
7085,16.46
7086,16.47
7087,16.45
7088,16.39
7089,16.30
7090,16.14
7091,15.95
7092,15.70
7093,15.46
7094,15.21
7095,14.98
7096,14.75
7097,14.55
7098,14.35
7099,14.15
7100,13.90
7101,13.62
7102,13.26
7103,12.87
7104,12.44
7105,12.03
7106,11.63
7107,11.31
7108,11.05
7109,10.89
7110,10.77
7111,10.73
7112,10.70
7113,10.69
7114,10.58
7115,10.39
7116,10.06
7117,9.67
7118,9.24
7119,8.80
7120,8.32
7121,7.89
7122,7.48
7123,7.15
7124,6.88
7125,6.68
7126,6.53
7127,6.41
7128,6.29
7129,6.16
7130,6.07
7131,6.00
7132,5.96
7133,5.93
7134,5.95
7135,6.03
7136,6.19
7137,6.36
7138,6.58
7139,6.83
7140,7.20
7141,7.63
7142,8.16
7143,8.71
7144,9.36
7145,10.03
7146,10.76
7147,11.46
7148,12.18
7149,12.86
7150,13.52
7151,14.13
7152,14.78
7153,15.42
7154,16.11
7155,16.75
7156,17.40
7157,17.94
7158,18.45
7159,18.84
7160,19.23
7161,19.52
7162,19.84
7163,20.15
7164,20.56
7165,21.03
7166,21.58
7167,22.11
7168,22.63
7169,23.06
7170,23.45
7171,23.74
7172,23.97
7173,24.15
7174,24.29
7175,24.39
7176,24.51
7177,24.62
7178,24.77
7179,24.93
7180,25.03
7181,25.06
7182,25.02
7183,24.93
7184,24.81
7185,24.68
7186,24.58
7187,24.53
7188,24.49
7189,24.54
7190,24.50
7191,24.34
7192,24.19
7193,23.61
7194,24.12
7195,25.93
7196,25.70
7197,20.84
7198,18.09
7199,28.92
7200,37.22
