1,136.86
2,205.96
3,223.85
4,215.29
5,212.36
6,217.02
7,211.52
8,191.05
9,160.73
10,126.69
11,89.77
12,56.34
13,33.00
14,26.37
15,37.75
16,65.14
17,104.62
18,147.91
19,187.41
20,215.52
21,232.35
22,238.70
23,236.88
24,225.09
25,203.80
26,174.45
27,139.85
28,101.55
29,61.70
30,23.48
31,-8.36
32,-31.00
33,-42.01
34,-43.05
35,-35.59
36,-24.80
37,-13.47
38,-5.81
39,-1.99
40,-2.72
41,-5.53
42,-9.19
43,-11.55
44,-12.20
45,-11.12
46,-9.03
47,-6.97
48,-5.48
49,-5.00
50,-5.26
51,-5.93
52,-6.58
53,-6.97
54,-7.00
55,-6.75
56,-6.34
57,-5.94
58,-5.52
59,-5.16
60,-4.74
61,-4.33
62,-3.90
63,-3.46
64,-2.98
65,-2.47
66,-1.95
67,-1.50
68,-1.01
69,-0.53
70,0.05
71,0.60
72,1.15
73,1.62
74,2.08
75,2.50
76,2.95
77,3.36
78,3.78
79,4.11
80,4.43
81,4.73
82,5.04
83,5.30
84,5.49
85,5.61
86,5.71
87,5.78
88,5.84
89,5.84
90,5.84
91,5.85
92,5.92
93,5.98
94,6.04
95,6.13
96,6.26
97,6.44
98,6.65
99,6.86
100,7.04
101,7.19
102,7.31
103,7.37
104,7.36
105,7.28
106,7.13
107,6.94
108,6.72
109,6.52
110,6.35
111,6.20
112,6.03
113,5.87
114,5.68
115,5.52
116,5.29
117,5.00
118,4.59
119,4.13
120,3.59
121,3.06
122,2.50
123,1.98
124,1.46
125,0.99
126,0.54
127,0.18
128,-0.17
129,-0.48
130,-0.87
131,-1.30
132,-1.82
133,-2.35
134,-2.92
135,-3.44
136,-3.93
137,-4.34
138,-4.74
139,-5.07
140,-5.40
141,-5.68
142,-6.02
143,-6.37
144,-6.74
145,-7.03
146,-7.25
147,-7.39
148,-7.52
149,-7.66
150,-7.84
151,-8.10
152,-8.49
153,-8.97
154,-9.49
155,-9.94
156,-10.28
157,-10.49
158,-10.55
159,-10.48
160,-10.33
161,-10.15
162,-9.99
163,-9.87
164,-9.76
165,-9.65
166,-9.54
167,-9.41
168,-9.25
169,-9.07
170,-8.93
171,-8.83
172,-8.77
173,-8.76
174,-8.75
175,-8.72
176,-8.62
177,-8.45
178,-8.24
179,-8.06
180,-7.90
181,-7.79
182,-7.71
183,-7.68
184,-7.68
185,-7.66
186,-7.54
187,-7.30
188,-6.98
189,-6.64
190,-6.35
191,-6.13
192,-6.04
193,-6.10
194,-6.32
195,-6.65
196,-7.03
197,-7.41
198,-7.70
199,-7.88
200,-7.93
201,-7.87
202,-7.73
203,-7.55
204,-7.32
205,-7.06
206,-6.74
207,-6.36
208,-5.90
209,-5.39
210,-4.84
211,-4.27
212,-3.71
213,-3.18
214,-2.66
215,-2.19
216,-1.75
217,-1.37
218,-1.02
219,-0.77
220,-0.56
221,-0.43
222,-0.31
223,-0.23
224,-0.14
225,-0.05
226,0.07
227,0.21
228,0.37
229,0.55
230,0.75
231,0.93
232,1.06
233,1.12
234,1.12
235,1.09
236,1.02
237,0.94
238,0.83
239,0.72
240,0.56
241,0.36
242,0.10
243,-0.20
244,-0.55
245,-0.93
246,-1.34
247,-1.72
248,-2.09
249,-2.41
250,-2.72
251,-2.94
252,-3.11
253,-3.19
254,-3.28
255,-3.42
256,-3.62
257,-3.86
258,-4.14
259,-4.44
260,-4.75
261,-5.03
262,-5.23
263,-5.31
264,-5.28
265,-5.17
266,-4.98
267,-4.77
268,-4.54
269,-4.31
270,-4.04
271,-3.75
272,-3.40
273,-3.06
274,-2.68
275,-2.30
276,-1.88
277,-1.47
278,-1.05
279,-0.63
280,-0.19
281,0.21
282,0.57
283,0.83
284,1.07
285,1.27
286,1.44
287,1.56
288,1.65
289,1.70
290,1.74
291,1.74
292,1.70
293,1.65
294,1.56
295,1.49
296,1.37
297,1.23
298,1.03
299,0.77
300,0.40
301,-0.04
302,-0.58
303,-1.16
304,-1.84
305,-2.54
306,-3.31
307,-4.07
308,-4.87
309,-5.62
310,-6.41
311,-7.14
312,-7.88
313,-8.57
314,-9.32
315,-10.01
316,-10.70
317,-11.28
318,-11.81
319,-12.21
320,-12.54
321,-12.79
322,-13.05
323,-13.34
324,-13.72
325,-14.14
326,-14.56
327,-14.92
328,-15.20
329,-15.34
330,-15.34
331,-15.17
332,-14.95
333,-14.69
334,-14.49
335,-14.34
336,-14.25
337,-14.18
338,-14.14
339,-14.08
340,-14.00
341,-13.91
342,-13.84
343,-13.85
344,-14.02
345,-14.37
346,-14.83
347,-15.31
348,-15.72
349,-16.00
350,-16.13
351,-16.09
352,-15.88
353,-15.58
354,-15.29
355,-15.10
356,-15.03
357,-15.07
358,-15.21
359,-15.42
360,-15.65
361,-15.87
362,-16.04
363,-16.12
364,-16.11
365,-16.02
366,-15.89
367,-15.73
368,-15.55
369,-15.37
370,-15.26
371,-15.21
372,-15.24
373,-15.34
374,-15.53
375,-15.83
376,-16.18
377,-16.52
378,-16.82
379,-17.05
380,-17.20
381,-17.27
382,-17.26
383,-17.19
384,-17.08
385,-16.96
386,-16.88
387,-16.84
388,-16.85
389,-16.91
390,-17.03
391,-17.18
392,-17.33
393,-17.45
394,-17.56
395,-17.64
396,-17.69
397,-17.72
398,-17.78
399,-17.87
400,-17.97
401,-18.10
402,-18.23
403,-18.33
404,-18.32
405,-18.19
406,-17.88
407,-17.46
408,-16.94
409,-16.38
410,-15.78
411,-15.23
412,-14.69
413,-14.22
414,-13.75
415,-13.30
416,-12.76
417,-12.19
418,-11.47
419,-10.73
420,-9.87
421,-9.03
422,-8.13
423,-7.35
424,-6.65
425,-6.10
426,-5.57
427,-5.13
428,-4.68
429,-4.29
430,-3.78
431,-3.18
432,-2.40
433,-1.61
434,-0.79
435,-0.03
436,0.72
437,1.40
438,2.03
439,2.55
440,3.05
441,3.54
442,4.08
443,4.62
444,5.12
445,5.51
446,5.77
447,5.84
448,5.77
449,5.52
450,5.14
451,4.69
452,4.23
453,3.85
454,3.56
455,3.35
456,3.18
457,3.04
458,2.91
459,2.79
460,2.65
461,2.48
462,2.27
463,2.06
464,1.86
465,1.72
466,1.60
467,1.52
468,1.44
469,1.35
470,1.21
471,1.04
472,0.85
473,0.67
474,0.50
475,0.35
476,0.22
477,0.17
478,0.21
479,0.32
480,0.47
481,0.66
482,0.87
483,1.08
484,1.24
485,1.34
486,1.37
487,1.40
488,1.43
489,1.46
490,1.50
491,1.56
492,1.64
493,1.73
494,1.84
495,1.93
496,1.97
497,1.98
498,1.94
499,1.88
500,1.78
501,1.67
502,1.55
503,1.40
504,1.19
505,0.95
506,0.72
507,0.48
508,0.17
509,-0.21
510,-0.62
511,-0.98
512,-1.31
513,-1.59
514,-1.85
515,-2.08
516,-2.24
517,-2.33
518,-2.30
519,-2.20
520,-2.01
521,-1.78
522,-1.43
523,-0.98
524,-0.47
525,0.08
526,0.63
527,1.15
528,1.67
529,2.11
530,2.49
531,2.82
532,3.11
533,3.31
534,3.43
535,3.46
536,3.46
537,3.42
538,3.33
539,3.15
540,2.91
541,2.62
542,2.37
543,2.12
544,1.91
545,1.76
546,1.70
547,1.75
548,1.93
549,2.23
550,2.65
551,3.09
552,3.52
553,3.90
554,4.26
555,4.62
556,4.98
557,5.30
558,5.61
559,5.89
560,6.23
561,6.65
562,7.17
563,7.73
564,8.31
565,8.80
566,9.23
567,9.55
568,9.81
569,9.98
570,10.11
571,10.18
572,10.27
573,10.41
574,10.66
575,10.95
576,11.28
577,11.64
578,12.05
579,12.47
580,12.83
581,13.10
582,13.32
583,13.50
584,13.60
585,13.63
586,13.60
587,13.55
588,13.43
589,13.23
590,12.93
591,12.57
592,12.16
593,11.75
594,11.34
595,10.96
596,10.56
597,10.19
598,9.80
599,9.42
600,8.99
601,8.52
602,7.97
603,7.44
604,6.94
605,6.56
606,6.28
607,6.11
608,6.01
609,5.97
610,5.88
611,5.78
612,5.62
613,5.45
614,5.26
615,5.08
616,4.90
617,4.73
618,4.54
619,4.34
620,4.10
621,3.85
622,3.52
623,3.14
624,2.67
625,2.24
626,1.84
627,1.53
628,1.17
629,0.81
630,0.39
631,-0.03
632,-0.49
633,-0.95
634,-1.43
635,-1.88
636,-2.31
637,-2.66
638,-2.92
639,-3.13
640,-3.36
641,-3.57
642,-3.80
643,-4.00
644,-4.26
645,-4.54
646,-4.84
647,-5.08
648,-5.28
649,-5.45
650,-5.63
651,-5.81
652,-5.99
653,-6.16
654,-6.33
655,-6.48
656,-6.61
657,-6.70
658,-6.76
659,-6.78
660,-6.78
661,-6.74
662,-6.71
663,-6.68
664,-6.65
665,-6.62
666,-6.61
667,-6.61
668,-6.61
669,-6.61
670,-6.64
671,-6.68
672,-6.75
673,-6.84
674,-6.97
675,-7.12
676,-7.26
677,-7.37
678,-7.52
679,-7.73
680,-8.00
681,-8.30
682,-8.62
683,-8.94
684,-9.26
685,-9.53
686,-9.75
687,-9.92
688,-10.09
689,-10.25
690,-10.45
691,-10.63
692,-10.80
693,-10.94
694,-11.08
695,-11.16
696,-11.19
697,-11.12
698,-11.01
699,-10.85
700,-10.71
701,-10.68
702,-10.81
703,-11.12
704,-11.52
705,-11.96
706,-12.34
707,-12.64
708,-12.82
709,-12.83
710,-12.63
711,-12.28
712,-11.79
713,-11.28
714,-10.79
715,-10.35
716,-9.91
717,-9.48
718,-8.98
719,-8.45
720,-7.87
721,-7.29
722,-6.66
723,-6.07
724,-5.52
725,-5.15
726,-4.91
727,-4.80
728,-4.71
729,-4.65
730,-4.54
731,-4.39
732,-4.15
733,-3.86
734,-3.54
735,-3.27
736,-3.07
737,-2.98
738,-3.01
739,-3.14
740,-3.31
741,-3.53
742,-3.75
743,-3.91
744,-3.91
745,-3.76
746,-3.52
747,-3.23
748,-2.94
749,-2.68
750,-2.50
751,-2.46
752,-2.57
753,-2.78
754,-3.07
755,-3.38
756,-3.65
757,-3.85
758,-3.89
759,-3.79
760,-3.58
761,-3.31
762,-3.03
763,-2.76
764,-2.50
765,-2.30
766,-2.16
767,-2.08
768,-1.98
769,-1.83
770,-1.62
771,-1.35
772,-1.01
773,-0.63
774,-0.20
775,0.22
776,0.59
777,0.85
778,1.02
779,1.08
780,1.04
781,0.92
782,0.72
783,0.52
784,0.32
785,0.11
786,-0.13
787,-0.40
788,-0.67
789,-0.94
790,-1.23
791,-1.53
792,-1.79
793,-1.95
794,-1.96
795,-1.83
796,-1.62
797,-1.34
798,-1.05
799,-0.82
800,-0.66
801,-0.60
802,-0.61
803,-0.69
804,-0.76
805,-0.79
806,-0.73
807,-0.59
808,-0.39
809,-0.18
810,0.08
811,0.34
812,0.58
813,0.76
814,0.89
815,0.97
816,1.03
817,1.06
818,1.08
819,1.07
820,1.06
821,1.02
822,0.98
823,0.90
824,0.85
825,0.85
826,0.94
827,1.11
828,1.38
829,1.70
830,2.11
831,2.58
832,3.11
833,3.62
834,4.08
835,4.46
836,4.79
837,5.04
838,5.29
839,5.52
840,5.77
841,6.03
842,6.36
843,6.70
844,7.08
845,7.43
846,7.81
847,8.16
848,8.48
849,8.71
850,8.90
851,9.03
852,9.16
853,9.24
854,9.33
855,9.41
856,9.51
857,9.60
858,9.69
859,9.74
860,9.74
861,9.68
862,9.59
863,9.47
864,9.30
865,9.09
866,8.90
867,8.80
868,8.84
869,9.00
870,9.19
871,9.41
872,9.65
873,9.88
874,10.06
875,10.15
876,10.19
877,10.18
878,10.17
879,10.12
880,10.10
881,10.12
882,10.24
883,10.41
884,10.60
885,10.75
886,10.89
887,11.03
888,11.18
889,11.33
890,11.51
891,11.70
892,11.95
893,12.21
894,12.54
895,12.89
896,13.24
897,13.57
898,13.92
899,14.27
900,14.63
901,14.95
902,15.26
903,15.50
904,15.63
905,15.63
906,15.50
907,15.25
908,14.96
909,14.68
910,14.49
911,14.43
912,14.50
913,14.69
914,14.94
915,15.18
916,15.36
917,15.46
918,15.46
919,15.43
920,15.35
921,15.24
922,15.10
923,14.95
924,14.79
925,14.63
926,14.38
927,14.04
928,13.53
929,12.95
930,12.26
931,11.59
932,10.88
933,10.19
934,9.43
935,8.71
936,7.93
937,7.14
938,6.27
939,5.39
940,4.48
941,3.65
942,2.87
943,2.20
944,1.62
945,1.18
946,0.84
947,0.62
948,0.43
949,0.30
950,0.14
951,-0.02
952,-0.26
953,-0.52
954,-0.82
955,-1.11
956,-1.41
957,-1.68
958,-1.89
959,-2.01
960,-2.02
961,-1.93
962,-1.76
963,-1.55
964,-1.30
965,-1.03
966,-0.76
967,-0.50
968,-0.24
969,-0.01
970,0.22
971,0.43
972,0.63
973,0.80
974,0.95
975,1.07
976,1.20
977,1.34
978,1.50
979,1.69
980,1.89
981,2.06
982,2.18
983,2.25
984,2.27
985,2.24
986,2.13
987,1.95
988,1.75
989,1.53
990,1.30
991,1.06
992,0.85
993,0.68
994,0.48
995,0.27
996,0.08
997,-0.06
998,-0.21
999,-0.35
1000,-0.49
1001,-0.60
1002,-0.74
1003,-0.92
1004,-1.14
1005,-1.30
1006,-1.43
1007,-1.48
1008,-1.53
1009,-1.58
1010,-1.64
1011,-1.73
1012,-1.88
1013,-2.11
1014,-2.42
1015,-2.75
1016,-3.11
1017,-3.41
1018,-3.60
1019,-3.65
1020,-3.62
1021,-3.52
1022,-3.39
1023,-3.21
1024,-3.01
1025,-2.80
1026,-2.58
1027,-2.38
1028,-2.17
1029,-1.94
1030,-1.62
1031,-1.27
1032,-0.91
1033,-0.62
1034,-0.35
1035,-0.12
1036,0.11
1037,0.32
1038,0.50
1039,0.64
1040,0.79
1041,0.94
1042,1.07
1043,1.17
1044,1.22
1045,1.22
1046,1.14
1047,0.99
1048,0.78
1049,0.53
1050,0.25
1051,-0.07
1052,-0.43
1053,-0.82
1054,-1.22
1055,-1.58
1056,-1.85
1057,-1.96
1058,-1.95
1059,-1.82
1060,-1.62
1061,-1.37
1062,-1.15
1063,-0.98
1064,-0.94
1065,-1.00
1066,-1.17
1067,-1.37
1068,-1.59
1069,-1.83
1070,-2.11
1071,-2.40
1072,-2.70
1073,-3.00
1074,-3.33
1075,-3.68
1076,-4.01
1077,-4.29
1078,-4.54
1079,-4.76
1080,-4.99
1081,-5.22
1082,-5.52
1083,-5.87
1084,-6.28
1085,-6.63
1086,-6.92
1087,-7.12
1088,-7.29
1089,-7.43
1090,-7.56
1091,-7.67
1092,-7.84
1093,-8.07
1094,-8.37
1095,-8.64
1096,-8.83
1097,-8.92
1098,-8.93
1099,-8.87
1100,-8.73
1101,-8.53
1102,-8.39
1103,-8.35
1104,-8.45
1105,-8.59
1106,-8.77
1107,-8.96
1108,-9.16
1109,-9.35
1110,-9.56
1111,-9.80
1112,-10.12
1113,-10.50
1114,-10.93
1115,-11.31
1116,-11.66
1117,-11.89
1118,-12.00
1119,-11.96
1120,-11.86
1121,-11.72
1122,-11.60
1123,-11.55
1124,-11.59
1125,-11.71
1126,-11.84
1127,-11.91
1128,-11.89
1129,-11.80
1130,-11.65
1131,-11.47
1132,-11.28
1133,-11.15
1134,-11.18
1135,-11.35
1136,-11.64
1137,-11.98
1138,-12.33
1139,-12.63
1140,-12.83
1141,-12.92
1142,-12.92
1143,-12.89
1144,-12.86
1145,-12.83
1146,-12.79
1147,-12.73
1148,-12.65
1149,-12.56
1150,-12.44
1151,-12.29
1152,-12.15
1153,-12.09
1154,-12.12
1155,-12.22
1156,-12.32
1157,-12.40
1158,-12.39
1159,-12.31
1160,-12.09
1161,-11.78
1162,-11.34
1163,-10.85
1164,-10.24
1165,-9.57
1166,-8.78
1167,-8.00
1168,-7.17
1169,-6.38
1170,-5.55
1171,-4.76
1172,-3.97
1173,-3.24
1174,-2.47
1175,-1.75
1176,-1.01
1177,-0.34
1178,0.35
1179,0.98
1180,1.63
1181,2.14
1182,2.60
1183,2.96
1184,3.33
1185,3.71
1186,4.14
1187,4.59
1188,5.07
1189,5.52
1190,6.01
1191,6.48
1192,6.94
1193,7.32
1194,7.64
1195,7.87
1196,8.06
1197,8.20
1198,8.29
1199,8.32
1200,8.32
1201,8.29
1202,8.24
1203,8.18
1204,8.10
1205,8.02
1206,7.91
1207,7.76
1208,7.55
1209,7.27
1210,6.97
1211,6.71
1212,6.48
1213,6.28
1214,6.06
1215,5.83
1216,5.58
1217,5.35
1218,5.08
1219,4.78
1220,4.47
1221,4.20
1222,4.01
1223,3.88
1224,3.82
1225,3.85
1226,4.02
1227,4.28
1228,4.59
1229,4.89
1230,5.22
1231,5.57
1232,5.94
1233,6.29
1234,6.65
1235,7.00
1236,7.36
1237,7.68
1238,7.99
1239,8.28
1240,8.61
1241,8.93
1242,9.24
1243,9.54
1244,9.86
1245,10.18
1246,10.48
1247,10.71
1248,10.93
1249,11.13
1250,11.34
1251,11.52
1252,11.67
1253,11.81
1254,11.99
1255,12.17
1256,12.32
1257,12.42
1258,12.45
1259,12.38
1260,12.20
1261,11.94
1262,11.63
1263,11.31
1264,10.91
1265,10.47
1266,10.00
1267,9.59
1268,9.18
1269,8.77
1270,8.35
1271,8.00
1272,7.71
1273,7.51
1274,7.35
1275,7.25
1276,7.16
1277,7.11
1278,7.02
1279,6.91
1280,6.75
1281,6.55
1282,6.26
1283,5.94
1284,5.62
1285,5.35
1286,5.10
1287,4.91
1288,4.76
1289,4.67
1290,4.59
1291,4.47
1292,4.30
1293,4.17
1294,4.05
1295,3.97
1296,3.85
1297,3.75
1298,3.65
1299,3.60
1300,3.52
1301,3.42
1302,3.23
1303,2.99
1304,2.70
1305,2.38
1306,2.01
1307,1.63
1308,1.23
1309,0.88
1310,0.54
1311,0.25
1312,-0.04
1313,-0.31
1314,-0.66
1315,-1.04
1316,-1.50
1317,-1.98
1318,-2.43
1319,-2.79
1320,-3.04
1321,-3.14
1322,-3.17
1323,-3.13
1324,-3.07
1325,-2.99
1326,-2.98
1327,-3.03
1328,-3.19
1329,-3.39
1330,-3.65
1331,-3.91
1332,-4.20
1333,-4.48
1334,-4.80
1335,-5.15
1336,-5.59
1337,-6.09
1338,-6.65
1339,-7.20
1340,-7.80
1341,-8.39
1342,-8.96
1343,-9.40
1344,-9.74
1345,-9.96
1346,-10.16
1347,-10.35
1348,-10.62
1349,-10.93
1350,-11.35
1351,-11.88
1352,-12.55
1353,-13.28
1354,-13.97
1355,-14.53
1356,-14.97
1357,-15.29
1358,-15.54
1359,-15.68
1360,-15.73
1361,-15.72
1362,-15.74
1363,-15.76
1364,-15.78
1365,-15.75
1366,-15.69
1367,-15.60
1368,-15.47
1369,-15.33
1370,-15.15
1371,-15.01
1372,-14.88
1373,-14.78
1374,-14.62
1375,-14.42
1376,-14.15
1377,-13.83
1378,-13.41
1379,-12.92
1380,-12.33
1381,-11.70
1382,-11.05
1383,-10.46
1384,-9.94
1385,-9.57
1386,-9.25
1387,-9.00
1388,-8.74
1389,-8.48
1390,-8.18
1391,-7.87
1392,-7.47
1393,-7.03
1394,-6.55
1395,-6.10
1396,-5.70
1397,-5.41
1398,-5.21
1399,-5.09
1400,-5.00
1401,-4.92
1402,-4.85
1403,-4.81
1404,-4.80
1405,-4.80
1406,-4.86
1407,-5.00
1408,-5.25
1409,-5.57
1410,-5.97
1411,-6.39
1412,-6.82
1413,-7.26
1414,-7.73
1415,-8.23
1416,-8.80
1417,-9.36
1418,-9.90
1419,-10.33
1420,-10.73
1421,-11.05
1422,-11.30
1423,-11.44
1424,-11.54
1425,-11.64
1426,-11.83
1427,-12.09
1428,-12.44
1429,-12.83
1430,-13.24
1431,-13.60
1432,-13.89
1433,-14.09
1434,-14.24
1435,-14.39
1436,-14.56
1437,-14.74
1438,-14.90
1439,-14.99
1440,-15.01
1441,-14.92
1442,-14.71
1443,-14.41
1444,-14.05
1445,-13.68
1446,-13.36
1447,-13.13
1448,-12.97
1449,-12.88
1450,-12.83
1451,-12.85
1452,-12.88
1453,-12.92
1454,-12.88
1455,-12.78
1456,-12.59
1457,-12.35
1458,-12.03
1459,-11.69
1460,-11.31
1461,-10.96
1462,-10.59
1463,-10.22
1464,-9.80
1465,-9.39
1466,-8.92
1467,-8.40
1468,-7.77
1469,-7.16
1470,-6.54
1471,-6.03
1472,-5.54
1473,-5.12
1474,-4.65
1475,-4.20
1476,-3.64
1477,-3.03
1478,-2.30
1479,-1.50
1480,-0.63
1481,0.24
1482,1.05
1483,1.73
1484,2.27
1485,2.62
1486,2.82
1487,2.83
1488,2.73
1489,2.51
1490,2.21
1491,1.85
1492,1.46
1493,1.05
1494,0.60
1495,0.15
1496,-0.28
1497,-0.67
1498,-0.98
1499,-1.17
1500,-1.21
1501,-1.08
1502,-0.82
1503,-0.46
1504,-0.05
1505,0.33
1506,0.71
1507,1.08
1508,1.52
1509,2.05
1510,2.73
1511,3.49
1512,4.33
1513,5.13
1514,5.92
1515,6.58
1516,7.16
1517,7.60
1518,8.00
1519,8.32
1520,8.69
1521,9.06
1522,9.53
1523,10.03
1524,10.55
1525,11.00
1526,11.36
1527,11.59
1528,11.71
1529,11.74
1530,11.70
1531,11.60
1532,11.47
1533,11.33
1534,11.17
1535,10.99
1536,10.77
1537,10.54
1538,10.29
1539,10.06
1540,9.79
1541,9.56
1542,9.40
1543,9.35
1544,9.32
1545,9.30
1546,9.26
1547,9.24
1548,9.18
1549,9.04
1550,8.77
1551,8.45
1552,8.10
1553,7.77
1554,7.43
1555,7.11
1556,6.84
1557,6.70
1558,6.65
1559,6.64
1560,6.55
1561,6.37
1562,6.09
1563,5.74
1564,5.29
1565,4.81
1566,4.35
1567,4.02
1568,3.85
1569,3.85
1570,4.00
1571,4.25
1572,4.56
1573,4.85
1574,5.07
1575,5.23
1576,5.35
1577,5.47
1578,5.54
1579,5.58
1580,5.62
1581,5.68
1582,5.71
1583,5.69
1584,5.59
1585,5.44
1586,5.23
1587,4.99
1588,4.75
1589,4.58
1590,4.45
1591,4.34
1592,4.18
1593,3.98
1594,3.73
1595,3.46
1596,3.17
1597,2.87
1598,2.58
1599,2.32
1600,2.05
1601,1.79
1602,1.52
1603,1.24
1604,0.98
1605,0.77
1606,0.66
1607,0.69
1608,0.86
1609,1.16
1610,1.56
1611,2.01
1612,2.49
1613,2.96
1614,3.41
1615,3.79
1616,4.16
1617,4.50
1618,4.89
1619,5.32
1620,5.88
1621,6.52
1622,7.28
1623,8.02
1624,8.75
1625,9.38
1626,9.99
1627,10.54
1628,11.12
1629,11.63
1630,12.15
1631,12.62
1632,13.10
1633,13.53
1634,13.92
1635,14.21
1636,14.47
1637,14.67
1638,14.80
1639,14.83
1640,14.79
1641,14.70
1642,14.54
1643,14.28
1644,13.91
1645,13.45
1646,12.94
1647,12.44
1648,11.96
1649,11.54
1650,11.17
1651,10.88
1652,10.65
1653,10.51
1654,10.42
1655,10.37
1656,10.31
1657,10.25
1658,10.19
1659,10.10
1660,9.99
1661,9.84
1662,9.67
1663,9.52
1664,9.40
1665,9.35
1666,9.35
1667,9.42
1668,9.50
1669,9.57
1670,9.58
1671,9.53
1672,9.37
1673,9.12
1674,8.72
1675,8.25
1676,7.69
1677,7.13
1678,6.54
1679,5.96
1680,5.33
1681,4.71
1682,4.10
1683,3.57
1684,3.10
1685,2.70
1686,2.30
1687,1.95
1688,1.63
1689,1.38
1690,1.10
1691,0.79
1692,0.37
1693,-0.02
1694,-0.45
1695,-0.85
1696,-1.33
1697,-1.79
1698,-2.25
1699,-2.66
1700,-3.11
1701,-3.59
1702,-4.16
1703,-4.76
1704,-5.42
1705,-6.00
1706,-6.46
1707,-6.73
1708,-6.86
1709,-6.84
1710,-6.71
1711,-6.48
1712,-6.30
1713,-6.26
1714,-6.42
1715,-6.71
1716,-7.12
1717,-7.58
1718,-8.16
1719,-8.78
1720,-9.41
1721,-9.95
1722,-10.39
1723,-10.73
1724,-11.05
1725,-11.34
1726,-11.66
1727,-11.97
1728,-12.34
1729,-12.72
1730,-13.13
1731,-13.48
1732,-13.78
1733,-13.95
1734,-14.02
1735,-13.98
1736,-13.89
1737,-13.81
1738,-13.86
1739,-14.09
1740,-14.54
1741,-15.14
1742,-15.85
1743,-16.53
1744,-17.14
1745,-17.58
1746,-17.88
1747,-18.00
1748,-18.06
1749,-18.10
1750,-18.26
1751,-18.58
1752,-19.10
1753,-19.74
1754,-20.53
1755,-21.36
1756,-22.23
1757,-23.04
1758,-23.74
1759,-24.27
1760,-24.67
1761,-24.96
1762,-25.17
1763,-25.25
1764,-25.21
1765,-25.02
1766,-24.77
1767,-24.43
1768,-24.02
1769,-23.57
1770,-23.13
1771,-22.74
1772,-22.41
1773,-22.17
1774,-22.04
1775,-22.04
1776,-22.13
1777,-22.29
1778,-22.51
1779,-22.77
1780,-23.05
1781,-23.21
1782,-23.28
1783,-23.27
1784,-23.28
1785,-23.32
1786,-23.45
1787,-23.70
1788,-24.24
1789,-25.02
1790,-26.08
1791,-27.28
1792,-28.62
1793,-29.95
1794,-31.20
1795,-32.27
1796,-33.20
1797,-33.93
1798,-34.49
1799,-34.80
1800,-34.97
1801,-35.03
1802,-35.13
1803,-35.22
1804,-35.40
1805,-35.59
1806,-35.87
1807,-36.19
1808,-36.58
1809,-36.98
1810,-37.45
1811,-37.94
1812,-38.51
1813,-39.10
1814,-39.72
1815,-40.31
1816,-40.90
1817,-41.40
1818,-41.79
1819,-41.98
1820,-42.08
1821,-42.08
1822,-42.10
1823,-42.14
1824,-42.34
1825,-42.67
1826,-43.21
1827,-43.86
1828,-44.62
1829,-45.34
1830,-45.94
1831,-46.33
1832,-46.52
1833,-46.56
1834,-46.54
1835,-46.48
1836,-46.41
1837,-46.36
1838,-46.30
1839,-46.22
1840,-46.03
1841,-45.70
1842,-45.23
1843,-44.70
1844,-44.13
1845,-43.59
1846,-43.11
1847,-42.79
1848,-42.64
1849,-42.68
1850,-42.82
1851,-43.01
1852,-43.19
1853,-43.32
1854,-43.33
1855,-43.25
1856,-43.07
1857,-42.84
1858,-42.52
1859,-42.14
1860,-41.69
1861,-41.28
1862,-40.89
1863,-40.58
1864,-40.30
1865,-40.08
1866,-39.82
1867,-39.57
1868,-39.25
1869,-38.89
1870,-38.36
1871,-37.70
1872,-36.82
1873,-35.89
1874,-34.84
1875,-33.79
1876,-32.65
1877,-31.56
1878,-30.51
1879,-29.61
1880,-28.74
1881,-27.97
1882,-27.18
1883,-26.46
1884,-25.66
1885,-24.86
1886,-23.95
1887,-23.01
1888,-21.97
1889,-20.94
1890,-19.93
1891,-19.11
1892,-18.44
1893,-17.98
1894,-17.65
1895,-17.50
1896,-17.43
1897,-17.43
1898,-17.30
1899,-17.11
1900,-16.72
1901,-16.27
1902,-15.61
1903,-14.84
1904,-13.88
1905,-12.89
1906,-11.79
1907,-10.69
1908,-9.46
1909,-8.21
1910,-6.79
1911,-5.37
1912,-3.82
1913,-2.31
1914,-0.66
1915,0.91
1916,2.49
1917,3.81
1918,5.07
1919,6.09
1920,7.11
1921,8.01
1922,9.01
1923,10.00
1924,11.20
1925,12.47
1926,13.95
1927,15.42
1928,16.91
1929,18.23
1930,19.47
1931,20.44
1932,21.26
1933,21.86
1934,22.41
1935,22.89
1936,23.41
1937,23.90
1938,24.44
1939,24.89
1940,25.28
1941,25.54
1942,25.73
1943,25.80
1944,25.79
1945,25.72
1946,25.72
1947,25.81
1948,26.08
1949,26.46
1950,27.00
1951,27.62
1952,28.29
1953,28.88
1954,29.39
1955,29.80
1956,30.16
1957,30.45
1958,30.70
1959,30.91
1960,31.11
1961,31.30
1962,31.53
1963,31.74
1964,31.93
1965,32.07
1966,32.19
1967,32.28
1968,32.33
1969,32.30
1970,32.18
1971,31.97
1972,31.68
1973,31.35
1974,30.98
1975,30.63
1976,30.33
1977,30.08
1978,29.88
1979,29.74
1980,29.68
1981,29.68
1982,29.68
1983,29.69
1984,29.72
1985,29.77
1986,29.80
1987,29.80
1988,29.82
1989,29.90
1990,30.08
1991,30.30
1992,30.49
1993,30.68
1994,30.86
1995,31.01
1996,31.10
1997,31.12
1998,31.14
1999,31.20
2000,31.28
2001,31.35
2002,31.36
2003,31.34
2004,31.25
2005,31.07
2006,30.77
2007,30.36
2008,29.85
2009,29.37
2010,28.95
2011,28.67
2012,28.48
2013,28.41
2014,28.37
2015,28.37
2016,28.26
2017,28.02
2018,27.51
2019,26.81
2020,25.86
2021,24.80
2022,23.62
2023,22.48
2024,21.35
2025,20.38
2026,19.51
2027,18.83
2028,18.19
2029,17.62
2030,16.96
2031,16.28
2032,15.47
2033,14.66
2034,13.75
2035,12.89
2036,11.99
2037,11.19
2038,10.33
2039,9.50
2040,8.58
2041,7.68
2042,6.69
2043,5.70
2044,4.63
2045,3.63
2046,2.66
2047,1.85
2048,1.12
2049,0.55
2050,0.02
2051,-0.40
2052,-0.80
2053,-1.14
2054,-1.50
2055,-1.78
2056,-2.03
2057,-2.19
2058,-2.34
2059,-2.46
2060,-2.69
2061,-3.01
2062,-3.49
2063,-4.07
2064,-4.76
2065,-5.45
2066,-6.12
2067,-6.68
2068,-7.11
2069,-7.34
2070,-7.43
2071,-7.42
2072,-7.37
2073,-7.29
2074,-7.26
2075,-7.25
2076,-7.32
2077,-7.40
2078,-7.47
2079,-7.46
2080,-7.39
2081,-7.34
2082,-7.34
2083,-7.39
2084,-7.47
2085,-7.63
2086,-7.91
2087,-8.26
2088,-8.61
2089,-8.86
2090,-9.01
2091,-9.03
2092,-8.89
2093,-8.61
2094,-8.31
2095,-8.06
2096,-7.92
2097,-7.90
2098,-8.00
2099,-8.24
2100,-8.56
2101,-8.93
2102,-9.30
2103,-9.60
2104,-9.78
2105,-9.85
2106,-9.82
2107,-9.69
2108,-9.44
2109,-9.08
2110,-8.69
2111,-8.32
2112,-8.01
2113,-7.77
2114,-7.64
2115,-7.66
2116,-7.85
2117,-8.19
2118,-8.62
2119,-9.06
2120,-9.38
2121,-9.57
2122,-9.59
2123,-9.48
2124,-9.21
2125,-8.83
2126,-8.33
2127,-7.80
2128,-7.23
2129,-6.68
2130,-6.10
2131,-5.58
2132,-5.04
2133,-4.52
2134,-3.94
2135,-3.33
2136,-2.62
2137,-1.86
2138,-1.00
2139,-0.12
2140,0.82
2141,1.73
2142,2.65
2143,3.44
2144,4.13
2145,4.62
2146,4.98
2147,5.23
2148,5.47
2149,5.69
2150,5.95
2151,6.18
2152,6.43
2153,6.65
2154,6.88
2155,7.06
2156,7.21
2157,7.31
2158,7.42
2159,7.60
2160,7.88
2161,8.20
2162,8.52
2163,8.80
2164,9.04
2165,9.25
2166,9.38
2167,9.38
2168,9.26
2169,9.11
2170,8.97
2171,8.83
2172,8.63
2173,8.36
2174,8.06
2175,7.78
2176,7.54
2177,7.32
2178,7.09
2179,6.91
2180,6.77
2181,6.69
2182,6.61
2183,6.50
2184,6.33
2185,6.13
2186,5.88
2187,5.65
2188,5.42
2189,5.27
2190,5.22
2191,5.22
2192,5.22
2193,5.17
2194,5.04
2195,4.82
2196,4.52
2197,4.19
2198,3.92
2199,3.78
2200,3.81
2201,4.00
2202,4.36
2203,4.87
2204,5.46
2205,6.03
2206,6.53
2207,6.91
2208,7.23
2209,7.45
2210,7.64
2211,7.84
2212,8.13
2213,8.51
2214,9.00
2215,9.54
2216,10.11
2217,10.63
2218,11.01
2219,11.18
2220,11.15
2221,10.94
2222,10.59
2223,10.14
2224,9.61
2225,9.08
2226,8.56
2227,8.13
2228,7.71
2229,7.35
2230,6.94
2231,6.55
2232,6.04
2233,5.49
2234,4.84
2235,4.14
2236,3.33
2237,2.51
2238,1.65
2239,0.86
2240,0.08
2241,-0.61
2242,-1.30
2243,-1.91
2244,-2.51
2245,-3.06
2246,-3.64
2247,-4.19
2248,-4.77
2249,-5.29
2250,-5.81
2251,-6.26
2252,-6.73
2253,-7.16
2254,-7.61
2255,-8.03
2256,-8.40
2257,-8.66
2258,-8.82
2259,-8.83
2260,-8.77
2261,-8.64
2262,-8.52
2263,-8.43
2264,-8.38
2265,-8.38
2266,-8.45
2267,-8.57
2268,-8.71
2269,-8.80
2270,-8.83
2271,-8.80
2272,-8.71
2273,-8.59
2274,-8.46
2275,-8.34
2276,-8.22
2277,-8.11
2278,-8.00
2279,-7.87
2280,-7.72
2281,-7.58
2282,-7.45
2283,-7.33
2284,-7.18
2285,-7.04
2286,-6.93
2287,-6.84
2288,-6.72
2289,-6.61
2290,-6.54
2291,-6.54
2292,-6.55
2293,-6.52
2294,-6.48
2295,-6.44
2296,-6.42
2297,-6.43
2298,-6.45
2299,-6.51
2300,-6.61
2301,-6.73
2302,-6.84
2303,-6.91
2304,-6.90
2305,-6.81
2306,-6.64
2307,-6.46
2308,-6.34
2309,-6.31
2310,-6.35
2311,-6.44
2312,-6.56
2313,-6.68
2314,-6.76
2315,-6.74
2316,-6.60
2317,-6.36
2318,-6.03
2319,-5.70
2320,-5.42
2321,-5.25
2322,-5.13
2323,-5.06
2324,-4.97
2325,-4.86
2326,-4.65
2327,-4.36
2328,-3.97
2329,-3.54
2330,-3.01
2331,-2.51
2332,-2.05
2333,-1.71
2334,-1.41
2335,-1.16
2336,-0.88
2337,-0.60
2338,-0.24
2339,0.21
2340,0.78
2341,1.40
2342,2.03
2343,2.56
2344,2.99
2345,3.25
2346,3.36
2347,3.28
2348,3.11
2349,2.89
2350,2.72
2351,2.58
2352,2.54
2353,2.63
2354,2.89
2355,3.24
2356,3.62
2357,3.96
2358,4.27
2359,4.54
2360,4.68
2361,4.66
2362,4.49
2363,4.29
2364,4.05
2365,3.80
2366,3.47
2367,3.12
2368,2.72
2369,2.33
2370,1.82
2371,1.21
2372,0.42
2373,-0.45
2374,-1.46
2375,-2.49
2376,-3.61
2377,-4.70
2378,-5.77
2379,-6.70
2380,-7.60
2381,-8.44
2382,-9.32
2383,-10.11
2384,-10.84
2385,-11.42
2386,-11.94
2387,-12.33
2388,-12.66
2389,-12.88
2390,-13.12
2391,-13.37
2392,-13.69
2393,-14.02
2394,-14.38
2395,-14.69
2396,-14.93
2397,-15.05
2398,-15.11
2399,-15.09
2400,-15.01
2401,-14.89
2402,-14.81
2403,-14.79
2404,-14.85
2405,-14.96
2406,-15.07
2407,-15.16
2408,-15.20
2409,-15.21
2410,-15.19
2411,-15.15
2412,-15.08
2413,-14.95
2414,-14.82
2415,-14.70
2416,-14.59
2417,-14.47
2418,-14.37
2419,-14.27
2420,-14.19
2421,-14.17
2422,-14.21
2423,-14.30
2424,-14.39
2425,-14.47
2426,-14.61
2427,-14.79
2428,-14.97
2429,-15.11
2430,-15.26
2431,-15.46
2432,-15.77
2433,-16.12
2434,-16.49
2435,-16.85
2436,-17.23
2437,-17.62
2438,-17.97
2439,-18.23
2440,-18.46
2441,-18.66
2442,-18.86
2443,-19.04
2444,-19.19
2445,-19.30
2446,-19.40
2447,-19.46
2448,-19.49
2449,-19.45
2450,-19.37
2451,-19.30
2452,-19.33
2453,-19.44
2454,-19.62
2455,-19.88
2456,-20.18
2457,-20.48
2458,-20.70
2459,-20.81
2460,-20.77
2461,-20.62
2462,-20.32
2463,-19.88
2464,-19.30
2465,-18.68
2466,-18.01
2467,-17.33
2468,-16.61
2469,-15.90
2470,-15.20
2471,-14.55
2472,-13.91
2473,-13.36
2474,-12.86
2475,-12.48
2476,-12.18
2477,-11.98
2478,-11.85
2479,-11.80
2480,-11.76
2481,-11.74
2482,-11.72
2483,-11.73
2484,-11.74
2485,-11.76
2486,-11.82
2487,-11.89
2488,-12.05
2489,-12.25
2490,-12.53
2491,-12.83
2492,-13.15
2493,-13.44
2494,-13.73
2495,-14.01
2496,-14.35
2497,-14.73
2498,-15.15
2499,-15.54
2500,-15.90
2501,-16.19
2502,-16.44
2503,-16.62
2504,-16.72
2505,-16.74
2506,-16.73
2507,-16.75
2508,-16.86
2509,-17.01
2510,-17.17
2511,-17.26
2512,-17.27
2513,-17.17
2514,-16.98
2515,-16.72
2516,-16.49
2517,-16.37
2518,-16.42
2519,-16.64
2520,-17.09
2521,-17.75
2522,-18.62
2523,-19.58
2524,-20.52
2525,-21.29
2526,-21.93
2527,-22.41
2528,-22.80
2529,-23.05
2530,-23.25
2531,-23.41
2532,-23.61
2533,-23.77
2534,-23.96
2535,-24.12
2536,-24.35
2537,-24.62
2538,-25.03
2539,-25.56
2540,-26.27
2541,-27.09
2542,-28.04
2543,-28.95
2544,-29.83
2545,-30.53
2546,-31.09
2547,-31.45
2548,-31.75
2549,-31.99
2550,-32.32
2551,-32.71
2552,-33.29
2553,-33.96
2554,-34.76
2555,-35.55
2556,-36.33
2557,-37.00
2558,-37.65
2559,-38.23
2560,-38.79
2561,-39.26
2562,-39.68
2563,-40.02
2564,-40.33
2565,-40.53
2566,-40.66
2567,-40.64
2568,-40.53
2569,-40.37
2570,-40.25
2571,-40.16
2572,-40.07
2573,-39.99
2574,-39.94
2575,-39.95
2576,-39.92
2577,-39.82
2578,-39.59
2579,-39.30
2580,-38.92
2581,-38.45
2582,-37.83
2583,-37.12
2584,-36.34
2585,-35.57
2586,-34.78
2587,-34.04
2588,-33.35
2589,-32.80
2590,-32.33
2591,-31.97
2592,-31.60
2593,-31.30
2594,-31.00
2595,-30.75
2596,-30.43
2597,-30.09
2598,-29.69
2599,-29.35
2600,-29.00
2601,-28.69
2602,-28.34
2603,-28.01
2604,-27.59
2605,-27.08
2606,-26.32
2607,-25.39
2608,-24.25
2609,-23.07
2610,-21.79
2611,-20.53
2612,-19.25
2613,-18.10
2614,-17.01
2615,-16.06
2616,-15.11
2617,-14.24
2618,-13.35
2619,-12.54
2620,-11.74
2621,-11.08
2622,-10.48
2623,-10.08
2624,-9.83
2625,-9.79
2626,-9.84
2627,-9.99
2628,-10.12
2629,-10.25
2630,-10.31
2631,-10.32
2632,-10.25
2633,-10.09
2634,-9.89
2635,-9.70
2636,-9.62
2637,-9.70
2638,-9.98
2639,-10.40
2640,-10.93
2641,-11.50
2642,-12.07
2643,-12.58
2644,-12.99
2645,-13.22
2646,-13.30
2647,-13.23
2648,-13.08
2649,-12.92
2650,-12.81
2651,-12.75
2652,-12.73
2653,-12.73
2654,-12.74
2655,-12.75
2656,-12.72
2657,-12.60
2658,-12.37
2659,-12.03
2660,-11.67
2661,-11.33
2662,-11.05
2663,-10.88
2664,-10.83
2665,-10.89
2666,-11.02
2667,-11.15
2668,-11.22
2669,-11.22
2670,-11.15
2671,-11.03
2672,-10.86
2673,-10.68
2674,-10.54
2675,-10.51
2676,-10.61
2677,-10.85
2678,-11.22
2679,-11.70
2680,-12.24
2681,-12.75
2682,-13.18
2683,-13.48
2684,-13.63
2685,-13.62
2686,-13.50
2687,-13.32
2688,-13.12
2689,-12.92
2690,-12.79
2691,-12.73
2692,-12.78
2693,-12.92
2694,-13.16
2695,-13.46
2696,-13.81
2697,-14.16
2698,-14.53
2699,-14.85
2700,-15.13
2701,-15.33
2702,-15.48
2703,-15.59
2704,-15.74
2705,-15.97
2706,-16.33
2707,-16.85
2708,-17.49
2709,-18.20
2710,-18.94
2711,-19.55
2712,-19.94
2713,-20.03
2714,-19.78
2715,-19.24
2716,-18.52
2717,-17.73
2718,-16.93
2719,-16.22
2720,-15.66
2721,-15.27
2722,-14.98
2723,-14.77
2724,-14.55
2725,-14.28
2726,-13.88
2727,-13.37
2728,-12.83
2729,-12.31
2730,-11.86
2731,-11.54
2732,-11.38
2733,-11.44
2734,-11.68
2735,-12.02
2736,-12.39
2737,-12.75
2738,-13.08
2739,-13.31
2740,-13.46
2741,-13.57
2742,-13.75
2743,-14.01
2744,-14.35
2745,-14.73
2746,-15.19
2747,-15.66
2748,-16.12
2749,-16.44
2750,-16.64
2751,-16.71
2752,-16.74
2753,-16.75
2754,-16.85
2755,-17.05
2756,-17.40
2757,-17.81
2758,-18.26
2759,-18.68
2760,-19.07
2761,-19.36
2762,-19.57
2763,-19.70
2764,-19.84
2765,-20.00
2766,-20.27
2767,-20.58
2768,-20.99
2769,-21.39
2770,-21.81
2771,-22.19
2772,-22.57
2773,-22.90
2774,-23.25
2775,-23.60
2776,-24.06
2777,-24.60
2778,-25.27
2779,-25.98
2780,-26.79
2781,-27.61
2782,-28.43
2783,-29.14
2784,-29.79
2785,-30.33
2786,-30.84
2787,-31.27
2788,-31.73
2789,-32.15
2790,-32.59
2791,-32.97
2792,-33.36
2793,-33.73
2794,-34.13
2795,-34.54
2796,-35.01
2797,-35.51
2798,-36.05
2799,-36.52
2800,-36.90
2801,-37.12
2802,-37.15
2803,-36.99
2804,-36.67
2805,-36.28
2806,-35.89
2807,-35.59
2808,-35.42
2809,-35.39
2810,-35.48
2811,-35.68
2812,-35.87
2813,-35.99
2814,-35.88
2815,-35.58
2816,-35.12
2817,-34.62
2818,-34.07
2819,-33.52
2820,-32.91
2821,-32.35
2822,-31.85
2823,-31.45
2824,-31.04
2825,-30.64
2826,-30.20
2827,-29.82
2828,-29.48
2829,-29.20
2830,-28.86
2831,-28.53
2832,-28.15
2833,-27.75
2834,-27.20
2835,-26.60
2836,-25.95
2837,-25.35
2838,-24.74
2839,-24.16
2840,-23.61
2841,-23.16
2842,-22.77
2843,-22.43
2844,-22.11
2845,-21.84
2846,-21.62
2847,-21.51
2848,-21.50
2849,-21.60
2850,-21.74
2851,-21.90
2852,-22.04
2853,-22.13
2854,-22.13
2855,-22.04
2856,-21.92
2857,-21.83
2858,-21.77
2859,-21.75
2860,-21.75
2861,-21.79
2862,-21.80
2863,-21.78
2864,-21.69
2865,-21.49
2866,-21.11
2867,-20.61
2868,-20.00
2869,-19.39
2870,-18.73
2871,-18.11
2872,-17.53
2873,-17.11
2874,-16.75
2875,-16.51
2876,-16.24
2877,-15.98
2878,-15.58
2879,-15.09
2880,-14.41
2881,-13.63
2882,-12.68
2883,-11.72
2884,-10.70
2885,-9.80
2886,-8.95
2887,-8.26
2888,-7.60
2889,-6.98
2890,-6.22
2891,-5.39
2892,-4.36
2893,-3.25
2894,-1.97
2895,-0.67
2896,0.65
2897,1.79
2898,2.80
2899,3.54
2900,4.15
2901,4.56
2902,4.96
2903,5.32
2904,5.79
2905,6.34
2906,7.01
2907,7.69
2908,8.35
2909,8.89
2910,9.30
2911,9.53
2912,9.61
2913,9.54
2914,9.38
2915,9.16
2916,8.94
2917,8.71
2918,8.43
2919,8.14
2920,7.80
2921,7.46
2922,7.04
2923,6.58
2924,6.02
2925,5.43
2926,4.77
2927,4.10
2928,3.39
2929,2.74
2930,2.15
2931,1.72
2932,1.39
2933,1.20
2934,1.05
2935,0.95
2936,0.79
2937,0.61
2938,0.31
2939,-0.08
2940,-0.56
2941,-1.06
2942,-1.56
2943,-2.01
2944,-2.42
2945,-2.74
2946,-2.98
2947,-3.08
2948,-3.11
2949,-3.03
2950,-2.93
2951,-2.80
2952,-2.70
2953,-2.66
2954,-2.75
2955,-2.95
2956,-3.27
2957,-3.64
2958,-3.98
2959,-4.22
2960,-4.33
2961,-4.29
2962,-4.15
2963,-3.97
2964,-3.81
2965,-3.72
2966,-3.68
2967,-3.75
2968,-3.92
2969,-4.16
2970,-4.40
2971,-4.58
2972,-4.71
2973,-4.82
2974,-4.95
2975,-5.07
2976,-5.19
2977,-5.33
2978,-5.53
2979,-5.73
2980,-5.93
2981,-6.11
2982,-6.32
2983,-6.55
2984,-6.78
2985,-6.99
2986,-7.19
2987,-7.33
2988,-7.42
2989,-7.41
2990,-7.38
2991,-7.36
2992,-7.43
2993,-7.54
2994,-7.71
2995,-7.88
2996,-8.09
2997,-8.29
2998,-8.49
2999,-8.69
3000,-8.96
3001,-9.29
3002,-9.78
3003,-10.37
3004,-11.09
3005,-11.83
3006,-12.59
3007,-13.28
3008,-13.96
3009,-14.57
3010,-15.19
3011,-15.74
3012,-16.30
3013,-16.78
3014,-17.28
3015,-17.71
3016,-18.12
3017,-18.46
3018,-18.82
3019,-19.16
3020,-19.55
3021,-19.98
3022,-20.53
3023,-21.11
3024,-21.75
3025,-22.34
3026,-22.92
3027,-23.41
3028,-23.86
3029,-24.23
3030,-24.61
3031,-24.99
3032,-25.39
3033,-25.78
3034,-26.16
3035,-26.48
3036,-26.75
3037,-26.92
3038,-27.01
3039,-26.97
3040,-26.83
3041,-26.59
3042,-26.28
3043,-25.95
3044,-25.61
3045,-25.31
3046,-25.08
3047,-24.92
3048,-24.86
3049,-24.90
3050,-25.00
3051,-25.12
3052,-25.22
3053,-25.32
3054,-25.42
3055,-25.50
3056,-25.56
3057,-25.62
3058,-25.73
3059,-25.87
3060,-26.04
3061,-26.22
3062,-26.44
3063,-26.67
3064,-26.89
3065,-27.05
3066,-27.13
3067,-27.15
3068,-27.14
3069,-27.11
3070,-27.08
3071,-27.01
3072,-26.92
3073,-26.82
3074,-26.79
3075,-26.82
3076,-26.86
3077,-26.90
3078,-26.93
3079,-26.96
3080,-26.96
3081,-26.95
3082,-26.88
3083,-26.79
3084,-26.65
3085,-26.45
3086,-26.18
3087,-25.89
3088,-25.57
3089,-25.25
3090,-24.88
3091,-24.50
3092,-24.07
3093,-23.64
3094,-23.15
3095,-22.64
3096,-22.13
3097,-21.65
3098,-21.20
3099,-20.83
3100,-20.48
3101,-20.20
3102,-19.93
3103,-19.70
3104,-19.49
3105,-19.32
3106,-19.13
3107,-18.97
3108,-18.79
3109,-18.64
3110,-18.50
3111,-18.39
3112,-18.30
3113,-18.21
3114,-18.09
3115,-17.97
3116,-17.89
3117,-17.88
3118,-17.94
3119,-18.04
3120,-18.17
3121,-18.35
3122,-18.58
3123,-18.84
3124,-19.14
3125,-19.43
3126,-19.71
3127,-19.98
3128,-20.26
3129,-20.49
3130,-20.68
3131,-20.78
3132,-20.90
3133,-21.06
3134,-21.31
3135,-21.58
3136,-21.88
3137,-22.15
3138,-22.35
3139,-22.47
3140,-22.52
3141,-22.54
3142,-22.59
3143,-22.67
3144,-22.83
3145,-23.07
3146,-23.38
3147,-23.75
3148,-24.12
3149,-24.42
3150,-24.62
3151,-24.68
3152,-24.57
3153,-24.37
3154,-24.09
3155,-23.83
3156,-23.56
3157,-23.31
3158,-23.04
3159,-22.75
3160,-22.36
3161,-21.90
3162,-21.34
3163,-20.74
3164,-20.08
3165,-19.47
3166,-18.91
3167,-18.47
3168,-18.08
3169,-17.78
3170,-17.51
3171,-17.30
3172,-17.08
3173,-16.88
3174,-16.72
3175,-16.59
3176,-16.49
3177,-16.40
3178,-16.37
3179,-16.43
3180,-16.55
3181,-16.70
3182,-16.89
3183,-17.11
3184,-17.41
3185,-17.76
3186,-18.21
3187,-18.68
3188,-19.17
3189,-19.65
3190,-20.13
3191,-20.60
3192,-21.08
3193,-21.51
3194,-21.96
3195,-22.42
3196,-22.96
3197,-23.51
3198,-24.09
3199,-24.62
3200,-25.18
3201,-25.74
3202,-26.29
3203,-26.79
3204,-27.29
3205,-27.76
3206,-28.19
3207,-28.49
3208,-28.65
3209,-28.63
3210,-28.52
3211,-28.36
3212,-28.24
3213,-28.17
3214,-28.18
3215,-28.27
3216,-28.42
3217,-28.60
3218,-28.78
3219,-28.88
3220,-28.85
3221,-28.66
3222,-28.34
3223,-27.91
3224,-27.48
3225,-27.14
3226,-26.96
3227,-26.99
3228,-27.24
3229,-27.64
3230,-28.09
3231,-28.46
3232,-28.66
3233,-28.66
3234,-28.45
3235,-28.12
3236,-27.73
3237,-27.37
3238,-27.09
3239,-26.95
3240,-26.90
3241,-26.92
3242,-26.88
3243,-26.74
3244,-26.47
3245,-26.08
3246,-25.58
3247,-25.08
3248,-24.60
3249,-24.25
3250,-24.02
3251,-23.93
3252,-23.94
3253,-24.02
3254,-24.09
3255,-24.12
3256,-24.09
3257,-24.02
3258,-23.96
3259,-23.93
3260,-23.93
3261,-23.93
3262,-23.95
3263,-24.01
3264,-24.11
3265,-24.23
3266,-24.37
3267,-24.52
3268,-24.66
3269,-24.74
3270,-24.77
3271,-24.74
3272,-24.69
3273,-24.61
3274,-24.55
3275,-24.52
3276,-24.57
3277,-24.72
3278,-24.94
3279,-25.22
3280,-25.54
3281,-25.83
3282,-26.04
3283,-26.13
3284,-26.16
3285,-26.21
3286,-26.30
3287,-26.42
3288,-26.58
3289,-26.80
3290,-27.03
3291,-27.22
3292,-27.27
3293,-27.13
3294,-26.78
3295,-26.30
3296,-25.73
3297,-25.16
3298,-24.62
3299,-24.16
3300,-23.72
3301,-23.28
3302,-22.77
3303,-22.22
3304,-21.58
3305,-20.94
3306,-20.23
3307,-19.60
3308,-19.00
3309,-18.55
3310,-18.13
3311,-17.80
3312,-17.46
3313,-17.12
3314,-16.65
3315,-16.07
3316,-15.34
3317,-14.57
3318,-13.74
3319,-12.99
3320,-12.29
3321,-11.76
3322,-11.36
3323,-11.10
3324,-10.96
3325,-10.90
3326,-10.87
3327,-10.84
3328,-10.81
3329,-10.77
3330,-10.75
3331,-10.74
3332,-10.81
3333,-10.98
3334,-11.31
3335,-11.77
3336,-12.41
3337,-13.21
3338,-14.24
3339,-15.37
3340,-16.53
3341,-17.60
3342,-18.58
3343,-19.33
3344,-19.89
3345,-20.20
3346,-20.42
3347,-20.60
3348,-20.85
3349,-21.13
3350,-21.53
3351,-21.98
3352,-22.46
3353,-22.85
3354,-23.08
3355,-23.10
3356,-22.96
3357,-22.69
3358,-22.30
3359,-21.87
3360,-21.39
3361,-20.91
3362,-20.41
3363,-19.89
3364,-19.28
3365,-18.64
3366,-17.92
3367,-17.20
3368,-16.37
3369,-15.56
3370,-14.72
3371,-13.95
3372,-13.19
3373,-12.47
3374,-11.70
3375,-11.00
3376,-10.32
3377,-9.74
3378,-9.21
3379,-8.80
3380,-8.48
3381,-8.31
3382,-8.26
3383,-8.35
3384,-8.55
3385,-8.86
3386,-9.25
3387,-9.74
3388,-10.28
3389,-10.85
3390,-11.44
3391,-12.02
3392,-12.63
3393,-13.22
3394,-13.79
3395,-14.26
3396,-14.66
3397,-14.95
3398,-15.17
3399,-15.34
3400,-15.54
3401,-15.82
3402,-16.24
3403,-16.71
3404,-17.24
3405,-17.75
3406,-18.21
3407,-18.54
3408,-18.68
3409,-18.58
3410,-18.33
3411,-18.01
3412,-17.74
3413,-17.58
3414,-17.62
3415,-17.85
3416,-18.26
3417,-18.75
3418,-19.24
3419,-19.67
3420,-19.95
3421,-20.07
3422,-20.03
3423,-19.85
3424,-19.54
3425,-19.17
3426,-18.75
3427,-18.30
3428,-17.75
3429,-17.11
3430,-16.37
3431,-15.63
3432,-14.88
3433,-14.21
3434,-13.57
3435,-13.05
3436,-12.57
3437,-12.15
3438,-11.65
3439,-11.14
3440,-10.53
3441,-9.91
3442,-9.25
3443,-8.67
3444,-8.16
3445,-7.81
3446,-7.55
3447,-7.36
3448,-7.17
3449,-6.98
3450,-6.70
3451,-6.34
3452,-5.91
3453,-5.49
3454,-5.10
3455,-4.81
3456,-4.62
3457,-4.57
3458,-4.64
3459,-4.79
3460,-4.97
3461,-5.15
3462,-5.36
3463,-5.57
3464,-5.73
3465,-5.80
3466,-5.74
3467,-5.59
3468,-5.35
3469,-5.04
3470,-4.73
3471,-4.45
3472,-4.28
3473,-4.24
3474,-4.36
3475,-4.60
3476,-4.92
3477,-5.25
3478,-5.58
3479,-5.87
3480,-6.15
3481,-6.43
3482,-6.82
3483,-7.32
3484,-7.96
3485,-8.68
3486,-9.44
3487,-10.09
3488,-10.60
3489,-10.93
3490,-11.12
3491,-11.19
3492,-11.19
3493,-11.13
3494,-11.06
3495,-10.99
3496,-10.93
3497,-10.80
3498,-10.62
3499,-10.35
3500,-9.99
3501,-9.57
3502,-9.16
3503,-8.85
3504,-8.71
3505,-8.71
3506,-8.79
3507,-8.87
3508,-8.88
3509,-8.82
3510,-8.64
3511,-8.41
3512,-8.16
3513,-7.97
3514,-7.88
3515,-7.92
3516,-8.09
3517,-8.33
3518,-8.56
3519,-8.71
3520,-8.78
3521,-8.78
3522,-8.71
3523,-8.58
3524,-8.46
3525,-8.39
3526,-8.43
3527,-8.56
3528,-8.72
3529,-8.87
3530,-9.00
3531,-9.09
3532,-9.12
3533,-9.13
3534,-9.11
3535,-9.07
3536,-9.03
3537,-9.00
3538,-9.02
3539,-9.05
3540,-9.03
3541,-8.99
3542,-8.90
3543,-8.77
3544,-8.58
3545,-8.32
3546,-8.01
3547,-7.69
3548,-7.32
3549,-6.90
3550,-6.45
3551,-6.07
3552,-5.78
3553,-5.61
3554,-5.47
3555,-5.39
3556,-5.35
3557,-5.33
3558,-5.25
3559,-5.12
3560,-4.91
3561,-4.67
3562,-4.39
3563,-4.13
3564,-3.89
3565,-3.72
3566,-3.55
3567,-3.39
3568,-3.20
3569,-3.03
3570,-2.82
3571,-2.62
3572,-2.42
3573,-2.23
3574,-1.94
3575,-1.54
3576,-0.95
3577,-0.24
3578,0.62
3579,1.53
3580,2.48
3581,3.33
3582,4.12
3583,4.76
3584,5.33
3585,5.75
3586,6.13
3587,6.45
3588,6.80
3589,7.17
3590,7.59
3591,8.01
3592,8.43
3593,8.78
3594,9.05
3595,9.21
3596,9.24
3597,9.16
3598,8.90
3599,8.52
3600,8.03
3601,7.50
3602,6.90
3603,6.26
3604,5.52
3605,4.78
3606,4.02
3607,3.30
3608,2.51
3609,1.76
3610,0.99
3611,0.30
3612,-0.44
3613,-1.17
3614,-1.95
3615,-2.67
3616,-3.42
3617,-4.08
3618,-4.73
3619,-5.28
3620,-5.81
3621,-6.26
3622,-6.71
3623,-7.11
3624,-7.58
3625,-8.06
3626,-8.62
3627,-9.19
3628,-9.78
3629,-10.31
3630,-10.76
3631,-11.05
3632,-11.23
3633,-11.28
3634,-11.22
3635,-11.05
3636,-10.89
3637,-10.80
3638,-10.79
3639,-10.85
3640,-10.97
3641,-11.12
3642,-11.28
3643,-11.43
3644,-11.54
3645,-11.61
3646,-11.61
3647,-11.55
3648,-11.42
3649,-11.24
3650,-11.05
3651,-10.89
3652,-10.81
3653,-10.80
3654,-10.88
3655,-11.00
3656,-11.17
3657,-11.34
3658,-11.51
3659,-11.65
3660,-11.82
3661,-11.98
3662,-12.18
3663,-12.41
3664,-12.76
3665,-13.19
3666,-13.73
3667,-14.32
3668,-15.04
3669,-15.81
3670,-16.54
3671,-17.11
3672,-17.52
3673,-17.77
3674,-17.92
3675,-17.91
3676,-17.79
3677,-17.62
3678,-17.56
3679,-17.63
3680,-17.90
3681,-18.29
3682,-18.75
3683,-19.23
3684,-19.72
3685,-20.13
3686,-20.44
3687,-20.61
3688,-20.71
3689,-20.73
3690,-20.71
3691,-20.65
3692,-20.58
3693,-20.51
3694,-20.45
3695,-20.43
3696,-20.45
3697,-20.51
3698,-20.58
3699,-20.65
3700,-20.69
3701,-20.69
3702,-20.61
3703,-20.46
3704,-20.28
3705,-20.10
3706,-19.91
3707,-19.77
3708,-19.68
3709,-19.65
3710,-19.62
3711,-19.58
3712,-19.49
3713,-19.34
3714,-19.10
3715,-18.81
3716,-18.49
3717,-18.20
3718,-17.89
3719,-17.58
3720,-17.18
3721,-16.72
3722,-16.15
3723,-15.56
3724,-14.94
3725,-14.38
3726,-13.89
3727,-13.50
3728,-13.18
3729,-12.93
3730,-12.69
3731,-12.46
3732,-12.16
3733,-11.85
3734,-11.52
3735,-11.25
3736,-11.03
3737,-10.89
3738,-10.81
3739,-10.79
3740,-10.74
3741,-10.64
3742,-10.43
3743,-10.16
3744,-9.83
3745,-9.51
3746,-9.20
3747,-8.96
3748,-8.80
3749,-8.71
3750,-8.69
3751,-8.76
3752,-8.90
3753,-9.08
3754,-9.25
3755,-9.40
3756,-9.57
3757,-9.74
3758,-9.90
3759,-10.02
3760,-10.12
3761,-10.19
3762,-10.28
3763,-10.37
3764,-10.51
3765,-10.71
3766,-10.97
3767,-11.24
3768,-11.51
3769,-11.73
3770,-11.83
3771,-11.76
3772,-11.57
3773,-11.32
3774,-11.09
3775,-10.91
3776,-10.78
3777,-10.72
3778,-10.74
3779,-10.87
3780,-11.05
3781,-11.24
3782,-11.36
3783,-11.39
3784,-11.34
3785,-11.25
3786,-11.15
3787,-11.09
3788,-11.08
3789,-11.13
3790,-11.28
3791,-11.50
3792,-11.73
3793,-11.91
3794,-12.00
3795,-12.03
3796,-12.03
3797,-11.99
3798,-11.92
3799,-11.86
3800,-11.86
3801,-11.92
3802,-12.00
3803,-12.06
3804,-12.12
3805,-12.17
3806,-12.25
3807,-12.34
3808,-12.43
3809,-12.57
3810,-12.83
3811,-13.15
3812,-13.50
3813,-13.79
3814,-14.09
3815,-14.34
3816,-14.56
3817,-14.73
3818,-14.95
3819,-15.20
3820,-15.54
3821,-15.95
3822,-16.48
3823,-17.06
3824,-17.70
3825,-18.33
3826,-18.97
3827,-19.55
3828,-20.07
3829,-20.45
3830,-20.77
3831,-21.02
3832,-21.26
3833,-21.46
3834,-21.65
3835,-21.83
3836,-22.03
3837,-22.19
3838,-22.31
3839,-22.31
3840,-22.20
3841,-21.98
3842,-21.68
3843,-21.32
3844,-20.98
3845,-20.74
3846,-20.63
3847,-20.69
3848,-20.90
3849,-21.24
3850,-21.62
3851,-21.97
3852,-22.16
3853,-22.17
3854,-21.97
3855,-21.61
3856,-21.11
3857,-20.57
3858,-20.06
3859,-19.64
3860,-19.34
3861,-19.16
3862,-19.08
3863,-19.09
3864,-19.13
3865,-19.20
3866,-19.26
3867,-19.36
3868,-19.46
3869,-19.58
3870,-19.71
3871,-19.86
3872,-20.04
3873,-20.21
3874,-20.37
3875,-20.48
3876,-20.61
3877,-20.71
3878,-20.84
3879,-21.02
3880,-21.29
3881,-21.66
3882,-22.16
3883,-22.68
3884,-23.25
3885,-23.79
3886,-24.28
3887,-24.66
3888,-24.96
3889,-25.15
3890,-25.32
3891,-25.48
3892,-25.72
3893,-26.03
3894,-26.50
3895,-27.05
3896,-27.71
3897,-28.36
3898,-29.03
3899,-29.63
3900,-30.24
3901,-30.82
3902,-31.49
3903,-32.16
3904,-32.84
3905,-33.43
3906,-33.97
3907,-34.34
3908,-34.54
3909,-34.54
3910,-34.40
3911,-34.18
3912,-33.91
3913,-33.65
3914,-33.43
3915,-33.27
3916,-33.14
3917,-33.01
3918,-32.84
3919,-32.67
3920,-32.45
3921,-32.22
3922,-31.94
3923,-31.68
3924,-31.42
3925,-31.19
3926,-30.96
3927,-30.73
3928,-30.45
3929,-30.14
3930,-29.75
3931,-29.37
3932,-28.99
3933,-28.67
3934,-28.34
3935,-28.03
3936,-27.68
3937,-27.36
3938,-27.04
3939,-26.76
3940,-26.45
3941,-26.17
3942,-25.86
3943,-25.57
3944,-25.25
3945,-24.94
3946,-24.57
3947,-24.16
3948,-23.68
3949,-23.22
3950,-22.74
3951,-22.30
3952,-21.87
3953,-21.50
3954,-21.13
3955,-20.77
3956,-20.38
3957,-19.95
3958,-19.45
3959,-18.94
3960,-18.43
3961,-18.03
3962,-17.75
3963,-17.67
3964,-17.72
3965,-17.86
3966,-17.96
3967,-17.97
3968,-17.83
3969,-17.54
3970,-17.07
3971,-16.51
3972,-15.88
3973,-15.32
3974,-14.85
3975,-14.53
3976,-14.32
3977,-14.18
3978,-14.04
3979,-13.86
3980,-13.64
3981,-13.40
3982,-13.15
3983,-12.95
3984,-12.83
3985,-12.83
3986,-12.91
3987,-13.05
3988,-13.16
3989,-13.18
3990,-13.08
3991,-12.84
3992,-12.53
3993,-12.21
3994,-11.98
3995,-11.89
3996,-11.99
3997,-12.29
3998,-12.74
3999,-13.24
4000,-13.67
4001,-13.98
4002,-14.11
4003,-14.07
4004,-13.91
4005,-13.66
4006,-13.39
4007,-13.15
4008,-12.98
4009,-12.89
4010,-12.86
4011,-12.86
4012,-12.89
4013,-12.89
4014,-12.82
4015,-12.66
4016,-12.46
4017,-12.25
4018,-12.05
4019,-11.86
4020,-11.74
4021,-11.71
4022,-11.79
4023,-11.93
4024,-12.12
4025,-12.34
4026,-12.57
4027,-12.78
4028,-12.93
4029,-12.99
4030,-12.96
4031,-12.90
4032,-12.84
4033,-12.77
4034,-12.72
4035,-12.68
4036,-12.70
4037,-12.79
4038,-12.95
4039,-13.13
4040,-13.30
4041,-13.45
4042,-13.60
4043,-13.75
4044,-13.89
4045,-13.98
4046,-14.01
4047,-13.98
4048,-13.90
4049,-13.82
4050,-13.69
4051,-13.52
4052,-13.28
4053,-12.99
4054,-12.63
4055,-12.28
4056,-11.92
4057,-11.63
4058,-11.37
4059,-11.15
4060,-10.89
4061,-10.64
4062,-10.33
4063,-9.98
4064,-9.54
4065,-9.07
4066,-8.58
4067,-8.13
4068,-7.73
4069,-7.44
4070,-7.24
4071,-7.13
4072,-7.03
4073,-6.89
4074,-6.68
4075,-6.40
4076,-6.10
4077,-5.84
4078,-5.63
4079,-5.53
4080,-5.57
4081,-5.75
4082,-6.05
4083,-6.42
4084,-6.79
4085,-7.12
4086,-7.41
4087,-7.64
4088,-7.83
4089,-7.98
4090,-8.12
4091,-8.26
4092,-8.42
4093,-8.61
4094,-8.80
4095,-8.97
4096,-9.13
4097,-9.28
4098,-9.45
4099,-9.63
4100,-9.78
4101,-9.90
4102,-10.01
4103,-10.12
4104,-10.24
4105,-10.37
4106,-10.51
4107,-10.61
4108,-10.68
4109,-10.69
4110,-10.64
4111,-10.53
4112,-10.28
4113,-9.93
4114,-9.50
4115,-9.07
4116,-8.67
4117,-8.38
4118,-8.23
4119,-8.24
4120,-8.33
4121,-8.46
4122,-8.58
4123,-8.64
4124,-8.61
4125,-8.47
4126,-8.20
4127,-7.87
4128,-7.49
4129,-7.14
4130,-6.84
4131,-6.62
4132,-6.50
4133,-6.42
4134,-6.32
4135,-6.21
4136,-6.07
4137,-5.91
4138,-5.75
4139,-5.60
4140,-5.49
4141,-5.46
4142,-5.52
4143,-5.67
4144,-5.90
4145,-6.16
4146,-6.48
4147,-6.83
4148,-7.26
4149,-7.72
4150,-8.24
4151,-8.78
4152,-9.34
4153,-9.84
4154,-10.25
4155,-10.51
4156,-10.69
4157,-10.79
4158,-10.88
4159,-10.93
4160,-11.01
4161,-11.15
4162,-11.41
4163,-11.76
4164,-12.18
4165,-12.63
4166,-13.11
4167,-13.55
4168,-13.92
4169,-14.16
4170,-14.30
4171,-14.34
4172,-14.34
4173,-14.31
4174,-14.30
4175,-14.31
4176,-14.40
4177,-14.56
4178,-14.77
4179,-14.97
4180,-15.14
4181,-15.22
4182,-15.27
4183,-15.30
4184,-15.32
4185,-15.37
4186,-15.50
4187,-15.75
4188,-16.08
4189,-16.44
4190,-16.77
4191,-17.01
4192,-17.17
4193,-17.24
4194,-17.29
4195,-17.31
4196,-17.35
4197,-17.41
4198,-17.49
4199,-17.59
4200,-17.66
4201,-17.63
4202,-17.47
4203,-17.20
4204,-16.88
4205,-16.54
4206,-16.21
4207,-15.91
4208,-15.66
4209,-15.48
4210,-15.35
4211,-15.24
4212,-15.12
4213,-15.03
4214,-14.99
4215,-15.05
4216,-15.21
4217,-15.46
4218,-15.75
4219,-16.08
4220,-16.43
4221,-16.74
4222,-16.92
4223,-16.98
4224,-16.97
4225,-16.90
4226,-16.78
4227,-16.64
4228,-16.49
4229,-16.37
4230,-16.27
4231,-16.21
4232,-16.19
4233,-16.22
4234,-16.30
4235,-16.40
4236,-16.47
4237,-16.49
4238,-16.47
4239,-16.38
4240,-16.24
4241,-16.05
4242,-15.87
4243,-15.74
4244,-15.73
4245,-15.85
4246,-16.09
4247,-16.43
4248,-16.81
4249,-17.20
4250,-17.57
4251,-17.89
4252,-18.17
4253,-18.37
4254,-18.53
4255,-18.61
4256,-18.65
4257,-18.63
4258,-18.65
4259,-18.70
4260,-18.81
4261,-18.95
4262,-19.17
4263,-19.39
4264,-19.65
4265,-19.87
4266,-20.16
4267,-20.50
4268,-20.97
4269,-21.53
4270,-22.21
4271,-22.99
4272,-23.83
4273,-24.58
4274,-25.14
4275,-25.41
4276,-25.43
4277,-25.23
4278,-24.86
4279,-24.41
4280,-23.98
4281,-23.64
4282,-23.42
4283,-23.28
4284,-23.17
4285,-23.06
4286,-22.90
4287,-22.68
4288,-22.43
4289,-22.22
4290,-22.09
4291,-22.09
4292,-22.20
4293,-22.38
4294,-22.64
4295,-22.97
4296,-23.35
4297,-23.70
4298,-24.04
4299,-24.35
4300,-24.72
4301,-25.13
4302,-25.60
4303,-26.05
4304,-26.44
4305,-26.73
4306,-26.95
4307,-27.02
4308,-27.00
4309,-26.89
4310,-26.82
4311,-26.81
4312,-26.90
4313,-27.08
4314,-27.34
4315,-27.67
4316,-28.05
4317,-28.40
4318,-28.72
4319,-28.95
4320,-29.14
4321,-29.28
4322,-29.42
4323,-29.56
4324,-29.75
4325,-29.93
4326,-30.05
4327,-30.06
4328,-29.92
4329,-29.69
4330,-29.34
4331,-28.86
4332,-28.25
4333,-27.60
4334,-26.98
4335,-26.50
4336,-26.14
4337,-25.89
4338,-25.70
4339,-25.56
4340,-25.37
4341,-25.12
4342,-24.74
4343,-24.27
4344,-23.67
4345,-23.06
4346,-22.45
4347,-21.98
4348,-21.62
4349,-21.42
4350,-21.35
4351,-21.35
4352,-21.35
4353,-21.31
4354,-21.16
4355,-20.96
4356,-20.69
4357,-20.39
4358,-20.09
4359,-19.82
4360,-19.61
4361,-19.49
4362,-19.45
4363,-19.53
4364,-19.65
4365,-19.78
4366,-19.84
4367,-19.82
4368,-19.71
4369,-19.53
4370,-19.27
4371,-18.97
4372,-18.65
4373,-18.36
4374,-18.07
4375,-17.85
4376,-17.65
4377,-17.48
4378,-17.29
4379,-17.09
4380,-16.83
4381,-16.58
4382,-16.27
4383,-15.96
4384,-15.56
4385,-15.10
4386,-14.53
4387,-13.89
4388,-13.14
4389,-12.34
4390,-11.49
4391,-10.73
4392,-10.04
4393,-9.52
4394,-9.09
4395,-8.78
4396,-8.51
4397,-8.29
4398,-8.00
4399,-7.66
4400,-7.23
4401,-6.81
4402,-6.42
4403,-6.09
4404,-5.82
4405,-5.65
4406,-5.58
4407,-5.58
4408,-5.61
4409,-5.68
4410,-5.78
4411,-5.89
4412,-5.98
4413,-6.08
4414,-6.23
4415,-6.43
4416,-6.63
4417,-6.79
4418,-6.95
4419,-7.12
4420,-7.27
4421,-7.39
4422,-7.54
4423,-7.71
4424,-7.88
4425,-8.00
4426,-8.09
4427,-8.11
4428,-8.08
4429,-7.95
4430,-7.77
4431,-7.57
4432,-7.48
4433,-7.52
4434,-7.76
4435,-8.12
4436,-8.57
4437,-9.05
4438,-9.52
4439,-9.93
4440,-10.28
4441,-10.54
4442,-10.80
4443,-11.08
4444,-11.44
4445,-11.83
4446,-12.25
4447,-12.62
4448,-12.96
4449,-13.23
4450,-13.43
4451,-13.50
4452,-13.49
4453,-13.42
4454,-13.41
4455,-13.48
4456,-13.66
4457,-13.90
4458,-14.21
4459,-14.56
4460,-14.94
4461,-15.27
4462,-15.56
4463,-15.82
4464,-16.07
4465,-16.24
4466,-16.37
4467,-16.48
4468,-16.63
4469,-16.79
4470,-17.01
4471,-17.23
4472,-17.56
4473,-17.90
4474,-18.26
4475,-18.62
4476,-19.02
4477,-19.42
4478,-19.84
4479,-20.23
4480,-20.61
4481,-20.94
4482,-21.19
4483,-21.32
4484,-21.42
4485,-21.51
4486,-21.60
4487,-21.68
4488,-21.79
4489,-21.93
4490,-22.13
4491,-22.34
4492,-22.51
4493,-22.63
4494,-22.74
4495,-22.81
4496,-22.87
4497,-22.93
4498,-23.04
4499,-23.21
4500,-23.46
4501,-23.75
4502,-24.13
4503,-24.60
4504,-25.18
4505,-25.79
4506,-26.46
4507,-27.08
4508,-27.66
4509,-28.13
4510,-28.50
4511,-28.73
4512,-28.88
4513,-28.95
4514,-29.03
4515,-29.17
4516,-29.45
4517,-29.82
4518,-30.31
4519,-30.85
4520,-31.43
4521,-31.97
4522,-32.40
4523,-32.63
4524,-32.69
4525,-32.62
4526,-32.50
4527,-32.34
4528,-32.20
4529,-32.10
4530,-32.11
4531,-32.20
4532,-32.30
4533,-32.35
4534,-32.30
4535,-32.18
4536,-31.94
4537,-31.65
4538,-31.34
4539,-31.10
4540,-30.94
4541,-30.88
4542,-30.91
4543,-31.01
4544,-31.13
4545,-31.20
4546,-31.17
4547,-31.07
4548,-30.95
4549,-30.82
4550,-30.69
4551,-30.58
4552,-30.50
4553,-30.46
4554,-30.48
4555,-30.53
4556,-30.67
4557,-30.88
4558,-31.14
4559,-31.43
4560,-31.79
4561,-32.20
4562,-32.69
4563,-33.20
4564,-33.70
4565,-34.16
4566,-34.64
4567,-35.08
4568,-35.51
4569,-35.89
4570,-36.27
4571,-36.61
4572,-36.95
4573,-37.27
4574,-37.63
4575,-37.99
4576,-38.31
4577,-38.55
4578,-38.70
4579,-38.75
4580,-38.74
4581,-38.68
4582,-38.59
4583,-38.47
4584,-38.34
4585,-38.22
4586,-38.12
4587,-38.02
4588,-37.90
4589,-37.80
4590,-37.70
4591,-37.59
4592,-37.37
4593,-37.06
4594,-36.68
4595,-36.29
4596,-35.84
4597,-35.37
4598,-34.93
4599,-34.61
4600,-34.34
4601,-34.12
4602,-33.88
4603,-33.68
4604,-33.48
4605,-33.26
4606,-32.91
4607,-32.52
4608,-32.04
4609,-31.57
4610,-31.04
4611,-30.51
4612,-30.01
4613,-29.59
4614,-29.21
4615,-28.89
4616,-28.66
4617,-28.54
4618,-28.47
4619,-28.43
4620,-28.38
4621,-28.34
4622,-28.32
4623,-28.33
4624,-28.37
4625,-28.46
4626,-28.56
4627,-28.76
4628,-29.05
4629,-29.41
4630,-29.73
4631,-29.95
4632,-30.07
4633,-30.12
4634,-30.11
4635,-30.05
4636,-29.97
4637,-29.91
4638,-29.88
4639,-29.88
4640,-29.88
4641,-29.88
4642,-29.90
4643,-29.93
4644,-29.95
4645,-29.93
4646,-29.82
4647,-29.64
4648,-29.41
4649,-29.17
4650,-28.92
4651,-28.66
4652,-28.37
4653,-28.11
4654,-27.86
4655,-27.66
4656,-27.47
4657,-27.29
4658,-27.10
4659,-26.93
4660,-26.77
4661,-26.65
4662,-26.55
4663,-26.50
4664,-26.49
4665,-26.53
4666,-26.57
4667,-26.57
4668,-26.49
4669,-26.38
4670,-26.26
4671,-26.18
4672,-26.08
4673,-25.97
4674,-25.83
4675,-25.69
4676,-25.51
4677,-25.28
4678,-24.96
4679,-24.57
4680,-24.11
4681,-23.64
4682,-23.16
4683,-22.73
4684,-22.28
4685,-21.84
4686,-21.35
4687,-20.86
4688,-20.33
4689,-19.84
4690,-19.32
4691,-18.85
4692,-18.44
4693,-18.12
4694,-17.81
4695,-17.57
4696,-17.34
4697,-17.17
4698,-16.96
4699,-16.72
4700,-16.37
4701,-16.01
4702,-15.56
4703,-15.06
4704,-14.47
4705,-13.89
4706,-13.29
4707,-12.70
4708,-12.04
4709,-11.34
4710,-10.58
4711,-9.83
4712,-9.07
4713,-8.34
4714,-7.63
4715,-7.03
4716,-6.58
4717,-6.31
4718,-6.23
4719,-6.32
4720,-6.55
4721,-6.88
4722,-7.27
4723,-7.66
4724,-8.04
4725,-8.38
4726,-8.74
4727,-9.09
4728,-9.49
4729,-9.93
4730,-10.45
4731,-11.02
4732,-11.62
4733,-12.15
4734,-12.58
4735,-12.88
4736,-13.08
4737,-13.18
4738,-13.25
4739,-13.28
4740,-13.31
4741,-13.36
4742,-13.44
4743,-13.51
4744,-13.50
4745,-13.39
4746,-13.14
4747,-12.82
4748,-12.46
4749,-12.10
4750,-11.71
4751,-11.38
4752,-11.05
4753,-10.73
4754,-10.28
4755,-9.71
4756,-8.99
4757,-8.22
4758,-7.36
4759,-6.52
4760,-5.66
4761,-4.87
4762,-4.07
4763,-3.31
4764,-2.55
4765,-1.84
4766,-1.14
4767,-0.53
4768,0.02
4769,0.37
4770,0.56
4771,0.54
4772,0.38
4773,0.11
4774,-0.21
4775,-0.52
4776,-0.76
4777,-0.94
4778,-1.07
4779,-1.14
4780,-1.23
4781,-1.33
4782,-1.54
4783,-1.86
4784,-2.31
4785,-2.82
4786,-3.38
4787,-3.94
4788,-4.52
4789,-5.01
4790,-5.44
4791,-5.73
4792,-5.92
4793,-6.03
4794,-6.12
4795,-6.20
4796,-6.32
4797,-6.47
4798,-6.64
4799,-6.78
4800,-6.90
4801,-6.95
4802,-6.97
4803,-6.97
4804,-6.97
4805,-7.00
4806,-7.05
4807,-7.15
4808,-7.29
4809,-7.43
4810,-7.54
4811,-7.57
4812,-7.54
4813,-7.47
4814,-7.39
4815,-7.26
4816,-7.13
4817,-7.00
4818,-6.94
4819,-6.96
4820,-7.11
4821,-7.38
4822,-7.75
4823,-8.16
4824,-8.61
4825,-9.06
4826,-9.50
4827,-9.88
4828,-10.21
4829,-10.43
4830,-10.64
4831,-10.83
4832,-11.09
4833,-11.38
4834,-11.73
4835,-12.11
4836,-12.54
4837,-12.95
4838,-13.37
4839,-13.75
4840,-14.09
4841,-14.34
4842,-14.57
4843,-14.74
4844,-14.89
4845,-15.00
4846,-15.14
4847,-15.30
4848,-15.56
4849,-15.87
4850,-16.29
4851,-16.72
4852,-17.20
4853,-17.68
4854,-18.17
4855,-18.68
4856,-19.18
4857,-19.63
4858,-20.02
4859,-20.31
4860,-20.52
4861,-20.63
4862,-20.67
4863,-20.63
4864,-20.56
4865,-20.46
4866,-20.37
4867,-20.27
4868,-20.22
4869,-20.19
4870,-20.16
4871,-20.13
4872,-20.10
4873,-20.10
4874,-20.15
4875,-20.30
4876,-20.56
4877,-20.89
4878,-21.24
4879,-21.53
4880,-21.76
4881,-21.90
4882,-22.02
4883,-22.08
4884,-22.20
4885,-22.38
4886,-22.78
4887,-23.36
4888,-24.15
4889,-25.01
4890,-25.95
4891,-26.82
4892,-27.65
4893,-28.32
4894,-28.92
4895,-29.43
4896,-29.97
4897,-30.47
4898,-31.08
4899,-31.75
4900,-32.58
4901,-33.48
4902,-34.52
4903,-35.54
4904,-36.58
4905,-37.52
4906,-38.40
4907,-39.09
4908,-39.69
4909,-40.13
4910,-40.57
4911,-41.00
4912,-41.53
4913,-42.10
4914,-42.81
4915,-43.56
4916,-44.44
4917,-45.32
4918,-46.20
4919,-46.94
4920,-47.58
4921,-48.05
4922,-48.48
4923,-48.87
4924,-49.39
4925,-49.96
4926,-50.64
4927,-51.35
4928,-52.12
4929,-52.86
4930,-53.55
4931,-54.08
4932,-54.49
4933,-54.76
4934,-54.99
4935,-55.16
4936,-55.34
4937,-55.51
4938,-55.69
4939,-55.84
4940,-55.97
4941,-56.02
4942,-55.98
4943,-55.89
4944,-55.82
4945,-55.79
4946,-55.73
4947,-55.63
4948,-55.49
4949,-55.33
4950,-55.10
4951,-54.82
4952,-54.49
4953,-54.20
4954,-53.89
4955,-53.61
4956,-53.31
4957,-53.05
4958,-52.78
4959,-52.51
4960,-52.12
4961,-51.64
4962,-50.95
4963,-50.16
4964,-49.26
4965,-48.38
4966,-47.45
4967,-46.62
4968,-45.81
4969,-45.14
4970,-44.51
4971,-44.01
4972,-43.52
4973,-43.09
4974,-42.58
4975,-42.04
4976,-41.42
4977,-40.84
4978,-40.21
4979,-39.68
4980,-39.18
4981,-38.77
4982,-38.34
4983,-37.93
4984,-37.45
4985,-36.99
4986,-36.42
4987,-35.83
4988,-35.14
4989,-34.48
4990,-33.74
4991,-33.02
4992,-32.22
4993,-31.43
4994,-30.59
4995,-29.75
4996,-28.82
4997,-27.92
4998,-26.97
4999,-26.09
5000,-25.22
5001,-24.45
5002,-23.77
5003,-23.25
5004,-22.82
5005,-22.52
5006,-22.25
5007,-22.06
5008,-21.87
5009,-21.73
5010,-21.61
5011,-21.54
5012,-21.44
5013,-21.33
5014,-21.16
5015,-20.94
5016,-20.59
5017,-20.16
5018,-19.58
5019,-19.00
5020,-18.42
5021,-17.95
5022,-17.55
5023,-17.28
5024,-17.04
5025,-16.86
5026,-16.59
5027,-16.30
5028,-15.84
5029,-15.27
5030,-14.46
5031,-13.50
5032,-12.31
5033,-11.05
5034,-9.67
5035,-8.32
5036,-6.93
5037,-5.63
5038,-4.40
5039,-3.38
5040,-2.50
5041,-1.84
5042,-1.27
5043,-0.85
5044,-0.47
5045,-0.20
5046,0.09
5047,0.31
5048,0.50
5049,0.60
5050,0.69
5051,0.72
5052,0.81
5053,0.88
5054,1.01
5055,1.17
5056,1.46
5057,1.83
5058,2.32
5059,2.85
5060,3.46
5061,4.10
5062,4.82
5063,5.58
5064,6.44
5065,7.30
5066,8.16
5067,8.89
5068,9.50
5069,9.94
5070,10.30
5071,10.51
5072,10.64
5073,10.71
5074,10.89
5075,11.18
5076,11.56
5077,11.95
5078,12.33
5079,12.63
5080,12.79
5081,12.73
5082,12.47
5083,12.03
5084,11.51
5085,11.03
5086,10.68
5087,10.57
5088,10.66
5089,10.89
5090,11.12
5091,11.27
5092,11.18
5093,10.84
5094,10.17
5095,9.28
5096,8.19
5097,7.07
5098,5.93
5099,4.87
5100,3.82
5101,2.87
5102,1.91
5103,1.00
5104,0.04
5105,-0.89
5106,-1.86
5107,-2.77
5108,-3.70
5109,-4.51
5110,-5.23
5111,-5.78
5112,-6.27
5113,-6.66
5114,-7.05
5115,-7.39
5116,-7.77
5117,-8.18
5118,-8.64
5119,-9.05
5120,-9.38
5121,-9.56
5122,-9.59
5123,-9.46
5124,-9.21
5125,-8.87
5126,-8.51
5127,-8.15
5128,-7.83
5129,-7.55
5130,-7.32
5131,-7.12
5132,-6.92
5133,-6.74
5134,-6.58
5135,-6.46
5136,-6.39
5137,-6.42
5138,-6.58
5139,-6.86
5140,-7.18
5141,-7.45
5142,-7.64
5143,-7.72
5144,-7.74
5145,-7.70
5146,-7.65
5147,-7.64
5148,-7.74
5149,-7.97
5150,-8.35
5151,-8.80
5152,-9.30
5153,-9.74
5154,-10.11
5155,-10.33
5156,-10.46
5157,-10.50
5158,-10.57
5159,-10.70
5160,-10.97
5161,-11.34
5162,-11.89
5163,-12.54
5164,-13.29
5165,-14.02
5166,-14.77
5167,-15.46
5168,-16.18
5169,-16.87
5170,-17.65
5171,-18.46
5172,-19.45
5173,-20.55
5174,-21.87
5175,-23.22
5176,-24.65
5177,-25.94
5178,-27.14
5179,-28.12
5180,-29.04
5181,-29.78
5182,-30.46
5183,-31.04
5184,-31.65
5185,-32.25
5186,-32.89
5187,-33.45
5188,-33.96
5189,-34.29
5190,-34.51
5191,-34.58
5192,-34.61
5193,-34.62
5194,-34.67
5195,-34.75
5196,-34.95
5197,-35.23
5198,-35.61
5199,-35.96
5200,-36.31
5201,-36.56
5202,-36.75
5203,-36.89
5204,-37.06
5205,-37.28
5206,-37.60
5207,-37.95
5208,-38.38
5209,-38.88
5210,-39.46
5211,-40.02
5212,-40.55
5213,-40.99
5214,-41.39
5215,-41.68
5216,-41.86
5217,-41.92
5218,-41.89
5219,-41.82
5220,-41.77
5221,-41.73
5222,-41.73
5223,-41.79
5224,-41.94
5225,-42.18
5226,-42.49
5227,-42.82
5228,-43.14
5229,-43.40
5230,-43.61
5231,-43.73
5232,-43.75
5233,-43.67
5234,-43.46
5235,-43.16
5236,-42.79
5237,-42.43
5238,-42.13
5239,-41.95
5240,-41.88
5241,-41.89
5242,-41.94
5243,-42.00
5244,-42.04
5245,-42.02
5246,-41.90
5247,-41.72
5248,-41.49
5249,-41.25
5250,-41.01
5251,-40.77
5252,-40.55
5253,-40.37
5254,-40.23
5255,-40.15
5256,-40.11
5257,-40.13
5258,-40.25
5259,-40.47
5260,-40.73
5261,-40.99
5262,-41.13
5263,-41.17
5264,-41.08
5265,-40.90
5266,-40.63
5267,-40.34
5268,-40.04
5269,-39.80
5270,-39.62
5271,-39.49
5272,-39.33
5273,-39.17
5274,-38.92
5275,-38.61
5276,-38.15
5277,-37.61
5278,-36.93
5279,-36.22
5280,-35.45
5281,-34.71
5282,-33.87
5283,-33.00
5284,-31.98
5285,-30.91
5286,-29.69
5287,-28.45
5288,-27.13
5289,-25.91
5290,-24.73
5291,-23.75
5292,-22.81
5293,-22.02
5294,-21.20
5295,-20.47
5296,-19.62
5297,-18.74
5298,-17.65
5299,-16.48
5300,-15.16
5301,-13.88
5302,-12.57
5303,-11.41
5304,-10.30
5305,-9.38
5306,-8.50
5307,-7.76
5308,-6.98
5309,-6.28
5310,-5.51
5311,-4.80
5312,-4.01
5313,-3.27
5314,-2.46
5315,-1.76
5316,-1.00
5317,-0.24
5318,0.74
5319,1.82
5320,3.07
5321,4.36
5322,5.77
5323,7.09
5324,8.33
5325,9.32
5326,10.16
5327,10.79
5328,11.32
5329,11.70
5330,11.99
5331,12.18
5332,12.34
5333,12.42
5334,12.46
5335,12.42
5336,12.33
5337,12.18
5338,11.98
5339,11.74
5340,11.44
5341,11.09
5342,10.67
5343,10.20
5344,9.64
5345,9.08
5346,8.54
5347,8.13
5348,7.82
5349,7.62
5350,7.49
5351,7.44
5352,7.42
5353,7.41
5354,7.32
5355,7.14
5356,6.86
5357,6.57
5358,6.30
5359,6.10
5360,5.90
5361,5.73
5362,5.60
5363,5.55
5364,5.50
5365,5.40
5366,5.17
5367,4.85
5368,4.42
5369,3.90
5370,3.20
5371,2.41
5372,1.51
5373,0.62
5374,-0.27
5375,-1.06
5376,-1.79
5377,-2.40
5378,-2.96
5379,-3.42
5380,-3.85
5381,-4.19
5382,-4.51
5383,-4.76
5384,-5.03
5385,-5.25
5386,-5.46
5387,-5.63
5388,-5.83
5389,-6.06
5390,-6.36
5391,-6.68
5392,-7.04
5393,-7.42
5394,-7.84
5395,-8.22
5396,-8.55
5397,-8.78
5398,-8.96
5399,-9.10
5400,-9.25
5401,-9.40
5402,-9.54
5403,-9.65
5404,-9.75
5405,-9.81
5406,-9.82
5407,-9.76
5408,-9.65
5409,-9.53
5410,-9.42
5411,-9.36
5412,-9.34
5413,-9.35
5414,-9.34
5415,-9.28
5416,-9.15
5417,-8.91
5418,-8.58
5419,-8.22
5420,-7.88
5421,-7.64
5422,-7.52
5423,-7.55
5424,-7.72
5425,-7.99
5426,-8.33
5427,-8.65
5428,-8.94
5429,-9.18
5430,-9.41
5431,-9.64
5432,-9.88
5433,-10.14
5434,-10.51
5435,-10.93
5436,-11.44
5437,-11.94
5438,-12.50
5439,-13.05
5440,-13.60
5441,-14.08
5442,-14.50
5443,-14.80
5444,-15.07
5445,-15.27
5446,-15.46
5447,-15.63
5448,-15.79
5449,-15.90
5450,-16.03
5451,-16.17
5452,-16.33
5453,-16.52
5454,-16.72
5455,-16.92
5456,-17.12
5457,-17.27
5458,-17.36
5459,-17.40
5460,-17.37
5461,-17.27
5462,-17.11
5463,-16.90
5464,-16.68
5465,-16.46
5466,-16.27
5467,-16.13
5468,-16.04
5469,-16.01
5470,-16.01
5471,-16.05
5472,-16.10
5473,-16.17
5474,-16.21
5475,-16.25
5476,-16.24
5477,-16.22
5478,-16.17
5479,-16.14
5480,-16.15
5481,-16.21
5482,-16.29
5483,-16.35
5484,-16.37
5485,-16.35
5486,-16.27
5487,-16.16
5488,-15.98
5489,-15.78
5490,-15.58
5491,-15.43
5492,-15.27
5493,-15.11
5494,-14.91
5495,-14.64
5496,-14.24
5497,-13.75
5498,-13.15
5499,-12.52
5500,-11.88
5501,-11.29
5502,-10.76
5503,-10.35
5504,-10.03
5505,-9.83
5506,-9.71
5507,-9.74
5508,-9.81
5509,-9.91
5510,-9.93
5511,-9.89
5512,-9.74
5513,-9.51
5514,-9.12
5515,-8.63
5516,-8.06
5517,-7.48
5518,-6.92
5519,-6.45
5520,-6.10
5521,-5.90
5522,-5.75
5523,-5.65
5524,-5.57
5525,-5.51
5526,-5.42
5527,-5.31
5528,-5.19
5529,-5.09
5530,-5.01
5531,-4.96
5532,-4.92
5533,-4.93
5534,-4.97
5535,-5.03
5536,-5.07
5537,-5.14
5538,-5.24
5539,-5.36
5540,-5.46
5541,-5.50
5542,-5.46
5543,-5.37
5544,-5.21
5545,-5.00
5546,-4.77
5547,-4.55
5548,-4.37
5549,-4.26
5550,-4.23
5551,-4.26
5552,-4.31
5553,-4.30
5554,-4.24
5555,-4.14
5556,-4.08
5557,-4.07
5558,-4.16
5559,-4.33
5560,-4.62
5561,-5.00
5562,-5.48
5563,-5.96
5564,-6.40
5565,-6.77
5566,-7.03
5567,-7.17
5568,-7.19
5569,-7.13
5570,-7.06
5571,-6.95
5572,-6.82
5573,-6.68
5574,-6.58
5575,-6.55
5576,-6.54
5577,-6.55
5578,-6.58
5579,-6.66
5580,-6.77
5581,-6.87
5582,-6.95
5583,-7.00
5584,-7.02
5585,-7.05
5586,-7.15
5587,-7.32
5588,-7.53
5589,-7.71
5590,-7.90
5591,-8.06
5592,-8.24
5593,-8.38
5594,-8.51
5595,-8.63
5596,-8.77
5597,-8.94
5598,-9.15
5599,-9.37
5600,-9.58
5601,-9.74
5602,-9.75
5603,-9.64
5604,-9.43
5605,-9.19
5606,-8.89
5607,-8.58
5608,-8.26
5609,-7.99
5610,-7.74
5611,-7.55
5612,-7.37
5613,-7.19
5614,-6.97
5615,-6.71
5616,-6.39
5617,-6.03
5618,-5.64
5619,-5.23
5620,-4.78
5621,-4.33
5622,-3.88
5623,-3.50
5624,-3.19
5625,-2.96
5626,-2.77
5627,-2.62
5628,-2.50
5629,-2.45
5630,-2.46
5631,-2.56
5632,-2.70
5633,-2.88
5634,-3.09
5635,-3.30
5636,-3.49
5637,-3.61
5638,-3.65
5639,-3.62
5640,-3.51
5641,-3.33
5642,-3.11
5643,-2.84
5644,-2.53
5645,-2.23
5646,-1.98
5647,-1.83
5648,-1.75
5649,-1.76
5650,-1.84
5651,-1.99
5652,-2.19
5653,-2.40
5654,-2.60
5655,-2.78
5656,-2.93
5657,-3.02
5658,-3.04
5659,-3.01
5660,-2.94
5661,-2.85
5662,-2.75
5663,-2.63
5664,-2.52
5665,-2.43
5666,-2.34
5667,-2.29
5668,-2.27
5669,-2.24
5670,-2.15
5671,-2.01
5672,-1.82
5673,-1.64
5674,-1.45
5675,-1.27
5676,-1.14
5677,-1.07
5678,-1.06
5679,-1.10
5680,-1.20
5681,-1.34
5682,-1.52
5683,-1.72
5684,-1.99
5685,-2.35
5686,-2.79
5687,-3.27
5688,-3.75
5689,-4.17
5690,-4.53
5691,-4.82
5692,-5.07
5693,-5.23
5694,-5.37
5695,-5.52
5696,-5.73
5697,-5.96
5698,-6.18
5699,-6.30
5700,-6.33
5701,-6.26
5702,-6.12
5703,-5.90
5704,-5.68
5705,-5.55
5706,-5.58
5707,-5.72
5708,-5.95
5709,-6.20
5710,-6.45
5711,-6.61
5712,-6.68
5713,-6.69
5714,-6.68
5715,-6.71
5716,-6.75
5717,-6.82
5718,-6.93
5719,-7.07
5720,-7.19
5721,-7.26
5722,-7.28
5723,-7.23
5724,-7.15
5725,-7.03
5726,-6.92
5727,-6.82
5728,-6.75
5729,-6.68
5730,-6.67
5731,-6.72
5732,-6.87
5733,-7.07
5734,-7.32
5735,-7.61
5736,-8.03
5737,-8.58
5738,-9.29
5739,-10.06
5740,-10.92
5741,-11.76
5742,-12.63
5743,-13.40
5744,-14.08
5745,-14.60
5746,-15.04
5747,-15.34
5748,-15.60
5749,-15.79
5750,-16.01
5751,-16.27
5752,-16.61
5753,-16.96
5754,-17.33
5755,-17.68
5756,-18.06
5757,-18.42
5758,-18.71
5759,-18.92
5760,-19.06
5761,-19.14
5762,-19.19
5763,-19.16
5764,-19.06
5765,-18.93
5766,-18.83
5767,-18.78
5768,-18.72
5769,-18.64
5770,-18.52
5771,-18.36
5772,-18.17
5773,-17.93
5774,-17.65
5775,-17.35
5776,-17.07
5777,-16.82
5778,-16.63
5779,-16.54
5780,-16.59
5781,-16.77
5782,-17.01
5783,-17.29
5784,-17.60
5785,-17.92
5786,-18.23
5787,-18.49
5788,-18.77
5789,-19.04
5790,-19.39
5791,-19.77
5792,-20.23
5793,-20.75
5794,-21.40
5795,-22.07
5796,-22.78
5797,-23.45
5798,-24.18
5799,-24.86
5800,-25.58
5801,-26.25
5802,-26.97
5803,-27.69
5804,-28.50
5805,-29.35
5806,-30.32
5807,-31.28
5808,-32.28
5809,-33.17
5810,-34.10
5811,-34.95
5812,-35.87
5813,-36.75
5814,-37.69
5815,-38.57
5816,-39.52
5817,-40.43
5818,-41.37
5819,-42.25
5820,-43.09
5821,-43.83
5822,-44.53
5823,-45.11
5824,-45.58
5825,-45.86
5826,-46.07
5827,-46.17
5828,-46.20
5829,-46.10
5830,-45.93
5831,-45.72
5832,-45.49
5833,-45.25
5834,-44.98
5835,-44.68
5836,-44.37
5837,-44.11
5838,-43.88
5839,-43.66
5840,-43.47
5841,-43.37
5842,-43.34
5843,-43.37
5844,-43.36
5845,-43.31
5846,-43.25
5847,-43.21
5848,-43.18
5849,-43.15
5850,-43.19
5851,-43.33
5852,-43.57
5853,-43.85
5854,-44.13
5855,-44.36
5856,-44.53
5857,-44.59
5858,-44.56
5859,-44.49
5860,-44.43
5861,-44.43
5862,-44.53
5863,-44.71
5864,-44.93
5865,-45.17
5866,-45.44
5867,-45.67
5868,-45.82
5869,-45.85
5870,-45.81
5871,-45.76
5872,-45.78
5873,-45.86
5874,-46.07
5875,-46.38
5876,-46.86
5877,-47.45
5878,-48.16
5879,-48.87
5880,-49.56
5881,-50.15
5882,-50.68
5883,-51.12
5884,-51.50
5885,-51.81
5886,-52.15
5887,-52.50
5888,-52.89
5889,-53.25
5890,-53.53
5891,-53.67
5892,-53.69
5893,-53.57
5894,-53.34
5895,-53.03
5896,-52.69
5897,-52.35
5898,-52.08
5899,-51.90
5900,-51.80
5901,-51.79
5902,-51.79
5903,-51.80
5904,-51.75
5905,-51.64
5906,-51.45
5907,-51.20
5908,-50.92
5909,-50.67
5910,-50.42
5911,-50.22
5912,-50.02
5913,-49.85
5914,-49.71
5915,-49.60
5916,-49.44
5917,-49.26
5918,-48.98
5919,-48.67
5920,-48.23
5921,-47.71
5922,-47.06
5923,-46.33
5924,-45.43
5925,-44.47
5926,-43.41
5927,-42.36
5928,-41.19
5929,-40.03
5930,-38.81
5931,-37.70
5932,-36.58
5933,-35.55
5934,-34.45
5935,-33.45
5936,-32.40
5937,-31.46
5938,-30.44
5939,-29.50
5940,-28.47
5941,-27.52
5942,-26.53
5943,-25.63
5944,-24.73
5945,-23.92
5946,-23.08
5947,-22.30
5948,-21.49
5949,-20.74
5950,-19.97
5951,-19.27
5952,-18.59
5953,-18.04
5954,-17.56
5955,-17.22
5956,-16.97
5957,-16.84
5958,-16.70
5959,-16.57
5960,-16.40
5961,-16.20
5962,-15.91
5963,-15.57
5964,-15.14
5965,-14.73
5966,-14.34
5967,-14.02
5968,-13.74
5969,-13.55
5970,-13.37
5971,-13.21
5972,-12.97
5973,-12.63
5974,-12.09
5975,-11.40
5976,-10.51
5977,-9.57
5978,-8.55
5979,-7.61
5980,-6.71
5981,-5.93
5982,-5.17
5983,-4.52
5984,-3.85
5985,-3.21
5986,-2.50
5987,-1.82
5988,-1.06
5989,-0.37
5990,0.37
5991,1.05
5992,1.78
5993,2.45
5994,3.14
5995,3.75
5996,4.32
5997,4.77
5998,5.21
5999,5.62
6000,6.06
6001,6.45
6002,6.86
6003,7.20
6004,7.56
6005,7.88
6006,8.16
6007,8.30
6008,8.33
6009,8.29
6010,8.29
6011,8.33
6012,8.45
6013,8.64
6014,8.90
6015,9.19
6016,9.46
6017,9.68
6018,9.83
6019,9.93
6020,9.91
6021,9.77
6022,9.52
6023,9.23
6024,8.85
6025,8.38
6026,7.75
6027,7.03
6028,6.20
6029,5.31
6030,4.30
6031,3.30
6032,2.33
6033,1.55
6034,0.85
6035,0.30
6036,-0.29
6037,-0.79
6038,-1.36
6039,-1.95
6040,-2.78
6041,-3.80
6042,-5.05
6043,-6.35
6044,-7.73
6045,-9.05
6046,-10.36
6047,-11.50
6048,-12.51
6049,-13.30
6050,-13.95
6051,-14.40
6052,-14.76
6053,-15.01
6054,-15.24
6055,-15.40
6056,-15.55
6057,-15.65
6058,-15.80
6059,-15.96
6060,-16.18
6061,-16.44
6062,-16.81
6063,-17.20
6064,-17.67
6065,-18.14
6066,-18.68
6067,-19.23
6068,-19.78
6069,-20.29
6070,-20.81
6071,-21.26
6072,-21.68
6073,-22.03
6074,-22.42
6075,-22.81
6076,-23.25
6077,-23.67
6078,-24.09
6079,-24.50
6080,-24.91
6081,-25.27
6082,-25.55
6083,-25.73
6084,-25.81
6085,-25.80
6086,-25.74
6087,-25.63
6088,-25.43
6089,-25.13
6090,-24.73
6091,-24.28
6092,-23.82
6093,-23.38
6094,-22.93
6095,-22.56
6096,-22.24
6097,-22.04
6098,-21.90
6099,-21.83
6100,-21.73
6101,-21.60
6102,-21.36
6103,-21.04
6104,-20.61
6105,-20.18
6106,-19.72
6107,-19.32
6108,-18.91
6109,-18.58
6110,-18.22
6111,-17.85
6112,-17.36
6113,-16.81
6114,-16.17
6115,-15.52
6116,-14.82
6117,-14.12
6118,-13.40
6119,-12.76
6120,-12.16
6121,-11.63
6122,-11.09
6123,-10.58
6124,-10.03
6125,-9.54
6126,-9.04
6127,-8.61
6128,-8.19
6129,-7.85
6130,-7.51
6131,-7.19
6132,-6.85
6133,-6.56
6134,-6.32
6135,-6.15
6136,-5.98
6137,-5.87
6138,-5.85
6139,-5.97
6140,-6.18
6141,-6.46
6142,-6.77
6143,-7.04
6144,-7.20
6145,-7.20
6146,-7.06
6147,-6.84
6148,-6.61
6149,-6.42
6150,-6.35
6151,-6.40
6152,-6.62
6153,-6.97
6154,-7.44
6155,-7.92
6156,-8.38
6157,-8.79
6158,-9.19
6159,-9.57
6160,-9.98
6161,-10.38
6162,-10.82
6163,-11.29
6164,-11.84
6165,-12.40
6166,-12.93
6167,-13.35
6168,-13.67
6169,-13.84
6170,-13.87
6171,-13.77
6172,-13.64
6173,-13.50
6174,-13.40
6175,-13.34
6176,-13.36
6177,-13.41
6178,-13.47
6179,-13.44
6180,-13.32
6181,-13.14
6182,-12.93
6183,-12.76
6184,-12.63
6185,-12.57
6186,-12.57
6187,-12.66
6188,-12.84
6189,-13.05
6190,-13.22
6191,-13.28
6192,-13.25
6193,-13.21
6194,-13.22
6195,-13.31
6196,-13.50
6197,-13.82
6198,-14.29
6199,-14.83
6200,-15.42
6201,-15.95
6202,-16.42
6203,-16.77
6204,-17.03
6205,-17.17
6206,-17.24
6207,-17.27
6208,-17.40
6209,-17.59
6210,-17.91
6211,-18.22
6212,-18.54
6213,-18.79
6214,-19.07
6215,-19.27
6216,-19.48
6217,-19.65
6218,-20.03
6219,-20.61
6220,-21.57
6221,-22.77
6222,-24.28
6223,-25.90
6224,-27.64
6225,-29.26
6226,-30.81
6227,-32.14
6228,-33.43
6229,-34.61
6230,-35.89
6231,-37.16
6232,-38.59
6233,-40.02
6234,-41.55
6235,-42.93
6236,-44.19
6237,-45.15
6238,-45.91
6239,-46.39
6240,-46.70
6241,-46.83
6242,-46.90
6243,-46.91
6244,-46.91
6245,-46.81
6246,-46.66
6247,-46.46
6248,-46.17
6249,-45.78
6250,-45.27
6251,-44.65
6252,-43.95
6253,-43.27
6254,-42.58
6255,-41.94
6256,-41.28
6257,-40.66
6258,-40.05
6259,-39.47
6260,-38.84
6261,-38.21
6262,-37.50
6263,-36.83
6264,-36.16
6265,-35.58
6266,-35.03
6267,-34.54
6268,-34.05
6269,-33.65
6270,-33.26
6271,-32.92
6272,-32.52
6273,-32.12
6274,-31.68
6275,-31.30
6276,-30.94
6277,-30.62
6278,-30.34
6279,-30.14
6280,-29.99
6281,-29.91
6282,-29.85
6283,-29.79
6284,-29.72
6285,-29.62
6286,-29.51
6287,-29.43
6288,-29.40
6289,-29.39
6290,-29.41
6291,-29.50
6292,-29.71
6293,-30.04
6294,-30.41
6295,-30.78
6296,-31.14
6297,-31.46
6298,-31.72
6299,-31.88
6300,-31.93
6301,-31.89
6302,-31.79
6303,-31.64
6304,-31.46
6305,-31.32
6306,-31.22
6307,-31.16
6308,-31.11
6309,-31.07
6310,-30.98
6311,-30.84
6312,-30.55
6313,-30.17
6314,-29.73
6315,-29.29
6316,-28.79
6317,-28.27
6318,-27.71
6319,-27.19
6320,-26.61
6321,-26.01
6322,-25.31
6323,-24.61
6324,-23.86
6325,-23.16
6326,-22.48
6327,-21.92
6328,-21.45
6329,-21.11
6330,-20.81
6331,-20.57
6332,-20.26
6333,-19.92
6334,-19.49
6335,-19.02
6336,-18.43
6337,-17.83
6338,-17.20
6339,-16.64
6340,-16.09
6341,-15.65
6342,-15.23
6343,-14.85
6344,-14.39
6345,-13.84
6346,-13.17
6347,-12.47
6348,-11.69
6349,-10.89
6350,-10.05
6351,-9.28
6352,-8.59
6353,-8.03
6354,-7.55
6355,-7.14
6356,-6.77
6357,-6.48
6358,-6.25
6359,-6.13
6360,-6.14
6361,-6.29
6362,-6.58
6363,-7.03
6364,-7.64
6365,-8.36
6366,-9.11
6367,-9.77
6368,-10.31
6369,-10.70
6370,-10.93
6371,-11.01
6372,-11.00
6373,-10.96
6374,-10.98
6375,-11.08
6376,-11.31
6377,-11.63
6378,-12.08
6379,-12.57
6380,-13.12
6381,-13.63
6382,-14.11
6383,-14.51
6384,-14.85
6385,-15.14
6386,-15.47
6387,-15.82
6388,-16.21
6389,-16.59
6390,-16.99
6391,-17.37
6392,-17.73
6393,-18.00
6394,-18.17
6395,-18.23
6396,-18.21
6397,-18.14
6398,-18.07
6399,-18.07
6400,-18.17
6401,-18.38
6402,-18.65
6403,-18.88
6404,-19.07
6405,-19.18
6406,-19.26
6407,-19.27
6408,-19.28
6409,-19.29
6410,-19.42
6411,-19.62
6412,-19.89
6413,-20.15
6414,-20.47
6415,-20.84
6416,-21.31
6417,-21.81
6418,-22.36
6419,-22.92
6420,-23.52
6421,-24.11
6422,-24.69
6423,-25.18
6424,-25.64
6425,-26.02
6426,-26.37
6427,-26.73
6428,-27.13
6429,-27.58
6430,-28.02
6431,-28.36
6432,-28.51
6433,-28.47
6434,-28.20
6435,-27.75
6436,-27.12
6437,-26.44
6438,-25.74
6439,-25.13
6440,-24.53
6441,-23.96
6442,-23.29
6443,-22.54
6444,-21.59
6445,-20.54
6446,-19.34
6447,-18.17
6448,-16.96
6449,-15.85
6450,-14.76
6451,-13.83
6452,-12.95
6453,-12.18
6454,-11.38
6455,-10.63
6456,-9.85
6457,-9.17
6458,-8.56
6459,-8.13
6460,-7.83
6461,-7.67
6462,-7.55
6463,-7.46
6464,-7.41
6465,-7.40
6466,-7.45
6467,-7.57
6468,-7.81
6469,-8.19
6470,-8.73
6471,-9.32
6472,-9.95
6473,-10.50
6474,-11.02
6475,-11.45
6476,-11.85
6477,-12.15
6478,-12.49
6479,-12.88
6480,-13.49
6481,-14.27
6482,-15.28
6483,-16.38
6484,-17.56
6485,-18.68
6486,-19.75
6487,-20.66
6488,-21.45
6489,-22.03
6490,-22.47
6491,-22.77
6492,-23.08
6493,-23.35
6494,-23.65
6495,-23.91
6496,-24.22
6497,-24.49
6498,-24.78
6499,-25.01
6500,-25.25
6501,-25.54
6502,-25.92
6503,-26.34
6504,-26.76
6505,-27.15
6506,-27.51
6507,-27.80
6508,-28.00
6509,-28.10
6510,-28.12
6511,-28.12
6512,-28.08
6513,-28.00
6514,-27.85
6515,-27.62
6516,-27.25
6517,-26.76
6518,-26.08
6519,-25.35
6520,-24.54
6521,-23.76
6522,-22.92
6523,-22.11
6524,-21.26
6525,-20.48
6526,-19.63
6527,-18.81
6528,-17.89
6529,-16.96
6530,-15.89
6531,-14.85
6532,-13.77
6533,-12.79
6534,-11.73
6535,-10.73
6536,-9.65
6537,-8.64
6538,-7.53
6539,-6.47
6540,-5.35
6541,-4.30
6542,-3.20
6543,-2.23
6544,-1.28
6545,-0.50
6546,0.27
6547,0.95
6548,1.66
6549,2.31
6550,3.07
6551,3.85
6552,4.71
6553,5.56
6554,6.49
6555,7.37
6556,8.19
6557,8.83
6558,9.38
6559,9.80
6560,10.16
6561,10.42
6562,10.65
6563,10.85
6564,11.05
6565,11.19
6566,11.29
6567,11.31
6568,11.28
6569,11.21
6570,11.15
6571,11.11
6572,11.14
6573,11.22
6574,11.41
6575,11.66
6576,12.02
6577,12.46
6578,13.02
6579,13.66
6580,14.42
6581,15.23
6582,16.08
6583,16.87
6584,17.62
6585,18.28
6586,18.85
6587,19.29
6588,19.60
6589,19.77
6590,19.87
6591,19.86
6592,19.77
6593,19.55
6594,19.24
6595,18.91
6596,18.59
6597,18.28
6598,18.01
6599,17.77
6600,17.59
6601,17.51
6602,17.47
6603,17.48
6604,17.49
6605,17.56
6606,17.66
6607,17.79
6608,17.87
6609,17.85
6610,17.68
6611,17.43
6612,17.07
6613,16.65
6614,16.18
6615,15.76
6616,15.43
6617,15.27
6618,15.20
6619,15.18
6620,15.14
6621,15.09
6622,14.98
6623,14.81
6624,14.53
6625,14.21
6626,13.88
6627,13.62
6628,13.40
6629,13.25
6630,13.17
6631,13.18
6632,13.21
6633,13.23
6634,13.14
6635,12.97
6636,12.72
6637,12.43
6638,12.06
6639,11.66
6640,11.16
6641,10.67
6642,10.15
6643,9.65
6644,9.13
6645,8.64
6646,8.15
6647,7.71
6648,7.27
6649,6.87
6650,6.46
6651,6.10
6652,5.79
6653,5.60
6654,5.49
6655,5.47
6656,5.46
6657,5.51
6658,5.57
6659,5.65
6660,5.60
6661,5.42
6662,5.04
6663,4.53
6664,3.90
6665,3.22
6666,2.50
6667,1.82
6668,1.14
6669,0.53
6670,-0.07
6671,-0.61
6672,-1.21
6673,-1.85
6674,-2.60
6675,-3.33
6676,-4.04
6677,-4.62
6678,-5.17
6679,-5.59
6680,-5.95
6681,-6.17
6682,-6.36
6683,-6.52
6684,-6.71
6685,-6.90
6686,-7.17
6687,-7.45
6688,-7.80
6689,-8.12
6690,-8.43
6691,-8.71
6692,-9.04
6693,-9.35
6694,-9.67
6695,-9.96
6696,-10.30
6697,-10.70
6698,-11.22
6699,-11.80
6700,-12.50
6701,-13.26
6702,-14.13
6703,-15.01
6704,-15.95
6705,-16.82
6706,-17.70
6707,-18.45
6708,-19.13
6709,-19.68
6710,-20.20
6711,-20.66
6712,-21.14
6713,-21.60
6714,-22.11
6715,-22.61
6716,-23.12
6717,-23.59
6718,-24.05
6719,-24.46
6720,-24.83
6721,-25.06
6722,-25.17
6723,-25.16
6724,-25.10
6725,-25.01
6726,-24.87
6727,-24.70
6728,-24.49
6729,-24.28
6730,-24.04
6731,-23.76
6732,-23.38
6733,-22.93
6734,-22.43
6735,-21.92
6736,-21.42
6737,-20.98
6738,-20.58
6739,-20.27
6740,-19.97
6741,-19.71
6742,-19.45
6743,-19.20
6744,-18.89
6745,-18.54
6746,-18.11
6747,-17.70
6748,-17.32
6749,-17.03
6750,-16.78
6751,-16.56
6752,-16.29
6753,-16.00
6754,-15.65
6755,-15.30
6756,-14.95
6757,-14.65
6758,-14.37
6759,-14.18
6760,-14.05
6761,-14.06
6762,-14.16
6763,-14.31
6764,-14.49
6765,-14.70
6766,-14.96
6767,-15.26
6768,-15.56
6769,-15.83
6770,-16.08
6771,-16.24
6772,-16.34
6773,-16.34
6774,-16.28
6775,-16.18
6776,-16.08
6777,-15.98
6778,-15.94
6779,-16.00
6780,-16.18
6781,-16.43
6782,-16.65
6783,-16.84
6784,-16.98
6785,-17.06
6786,-17.08
6787,-17.02
6788,-16.89
6789,-16.72
6790,-16.50
6791,-16.24
6792,-15.91
6793,-15.59
6794,-15.27
6795,-15.01
6796,-14.77
6797,-14.58
6798,-14.37
6799,-14.18
6800,-13.92
6801,-13.61
6802,-13.18
6803,-12.64
6804,-11.99
6805,-11.31
6806,-10.62
6807,-10.00
6808,-9.43
6809,-8.97
6810,-8.55
6811,-8.22
6812,-7.87
6813,-7.56
6814,-7.21
6815,-6.90
6816,-6.58
6817,-6.32
6818,-6.09
6819,-5.89
6820,-5.67
6821,-5.45
6822,-5.15
6823,-4.78
6824,-4.24
6825,-3.63
6826,-2.95
6827,-2.27
6828,-1.53
6829,-0.80
6830,-0.07
6831,0.58
6832,1.19
6833,1.72
6834,2.17
6835,2.49
6836,2.72
6837,2.85
6838,2.96
6839,3.04
6840,3.18
6841,3.34
6842,3.56
6843,3.79
6844,4.07
6845,4.33
6846,4.55
6847,4.67
6848,4.72
6849,4.71
6850,4.67
6851,4.61
6852,4.55
6853,4.53
6854,4.50
6855,4.46
6856,4.34
6857,4.16
6858,3.92
6859,3.69
6860,3.46
6861,3.20
6862,2.85
6863,2.46
6864,2.08
6865,1.75
6866,1.42
6867,1.07
6868,0.69
6869,0.36
6870,0.08
6871,-0.12
6872,-0.25
6873,-0.32
6874,-0.30
6875,-0.21
6876,-0.05
6877,0.18
6878,0.51
6879,0.89
6880,1.36
6881,1.85
6882,2.40
6883,2.99
6884,3.66
6885,4.33
6886,5.02
6887,5.69
6888,6.44
6889,7.19
6890,8.00
6891,8.83
6892,9.77
6893,10.76
6894,11.82
6895,12.83
6896,13.83
6897,14.71
6898,15.45
6899,15.97
6900,16.39
6901,16.69
6902,16.97
6903,17.19
6904,17.45
6905,17.70
6906,17.97
6907,18.19
6908,18.35
6909,18.42
6910,18.43
6911,18.38
6912,18.29
6913,18.20
6914,18.10
6915,18.00
6916,17.79
6917,17.47
6918,17.01
6919,16.47
6920,15.88
6921,15.33
6922,14.77
6923,14.28
6924,13.82
6925,13.41
6926,12.97
6927,12.48
6928,11.87
6929,11.18
6930,10.42
6931,9.69
6932,9.00
6933,8.44
6934,7.96
6935,7.64
6936,7.51
6937,7.55
6938,7.64
6939,7.79
6940,7.93
6941,8.07
6942,8.16
6943,8.18
6944,8.10
6945,7.99
6946,7.80
6947,7.57
6948,7.28
6949,6.99
6950,6.71
6951,6.48
6952,6.24
6953,6.04
6954,5.89
6955,5.81
6956,5.71
6957,5.59
6958,5.35
6959,5.03
6960,4.59
6961,4.06
6962,3.42
6963,2.73
6964,2.01
6965,1.37
6966,0.79
6967,0.36
6968,-0.02
6969,-0.27
6970,-0.45
6971,-0.55
6972,-0.68
6973,-0.81
6974,-0.99
6975,-1.17
6976,-1.37
6977,-1.53
6978,-1.68
6979,-1.79
6980,-1.94
6981,-2.08
6982,-2.21
6983,-2.33
6984,-2.46
6985,-2.58
6986,-2.65
6987,-2.66
6988,-2.62
6989,-2.59
6990,-2.53
6991,-2.48
6992,-2.44
6993,-2.43
6994,-2.45
6995,-2.45
6996,-2.45
6997,-2.42
6998,-2.33
6999,-2.15
7000,-1.91
7001,-1.66
7002,-1.47
7003,-1.36
7004,-1.28
7005,-1.27
7006,-1.27
7007,-1.30
7008,-1.32
7009,-1.27
7010,-1.09
7011,-0.79
7012,-0.39
7013,0.05
7014,0.52
7015,0.94
7016,1.30
7017,1.53
7018,1.64
7019,1.63
7020,1.58
7021,1.54
7022,1.56
7023,1.62
7024,1.72
7025,1.82
7026,1.86
7027,1.85
7028,1.71
7029,1.47
7030,1.11
7031,0.73
7032,0.36
7033,0.08
7034,-0.20
7035,-0.48
7036,-0.86
7037,-1.30
7038,-1.82
7039,-2.31
7040,-2.82
7041,-3.29
7042,-3.74
7043,-4.12
7044,-4.46
7045,-4.75
7046,-5.04
7047,-5.34
7048,-5.63
7049,-5.86
7050,-6.05
7051,-6.20
7052,-6.32
7053,-6.37
7054,-6.36
7055,-6.29
7056,-6.25
7057,-6.25
7058,-6.27
7059,-6.31
7060,-6.35
7061,-6.37
7062,-6.37
7063,-6.35
7064,-6.30
7065,-6.24
7066,-6.16
7067,-6.03
7068,-5.89
7069,-5.78
7070,-5.70
7071,-5.65
7072,-5.55
7073,-5.44
7074,-5.33
7075,-5.24
7076,-5.12
7077,-4.96
7078,-4.70
7079,-4.37
7080,-3.94
7081,-3.49
7082,-2.98
7083,-2.43
7084,-1.84
7085,-1.26
7086,-0.69
7087,-0.19
7088,0.32
7089,0.78
7090,1.18
7091,1.47
7092,1.74
7093,1.98
7094,2.27
7095,2.57
7096,2.91
7097,3.29
7098,3.70
7099,4.09
7100,4.46
7101,4.75
7102,4.96
7103,5.04
7104,5.04
7105,4.93
7106,4.78
7107,4.62
7108,4.55
7109,4.57
7110,4.68
7111,4.83
7112,5.03
7113,5.26
7114,5.54
7115,5.83
7116,6.16
7117,6.52
7118,6.91
7119,7.33
7120,7.77
7121,8.19
7122,8.56
7123,8.82
7124,8.96
7125,8.95
7126,8.85
7127,8.69
7128,8.55
7129,8.42
7130,8.34
7131,8.33
7132,8.46
7133,8.72
7134,9.11
7135,9.57
7136,10.06
7137,10.51
7138,10.86
7139,11.07
7140,11.16
7141,11.15
7142,11.09
7143,10.99
7144,10.93
7145,10.86
7146,10.80
7147,10.71
7148,10.60
7149,10.45
7150,10.22
7151,9.90
7152,9.48
7153,9.03
7154,8.58
7155,8.16
7156,7.77
7157,7.46
7158,7.17
7159,6.94
7160,6.73
7161,6.60
7162,6.51
7163,6.45
7164,6.37
7165,6.26
7166,6.10
7167,5.94
7168,5.71
7169,5.46
7170,5.13
7171,4.81
7172,4.46
7173,4.15
7174,3.82
7175,3.47
7176,3.03
7177,2.54
7178,1.98
7179,1.39
7180,0.71
7181,0.04
7182,-0.63
7183,-1.18
7184,-1.69
7185,-2.11
7186,-2.51
7187,-2.86
7188,-3.26
7189,-3.68
7190,-4.10
7191,-4.44
7192,-4.78
7193,-6.17
7194,-6.36
7195,-3.86
7196,-2.84
7197,-9.14
7198,-15.57
7199,-4.10
7200,14.58
