1,-187.49
2,-250.00
3,-250.00
4,-238.83
5,-200.55
6,-155.46
7,-74.74
8,40.90
9,151.48
10,222.65
11,249.19
12,249.99
13,249.08
14,249.99
15,249.99
16,249.99
17,249.99
18,249.92
19,244.67
20,233.28
21,213.67
22,189.00
23,164.05
24,142.87
25,128.16
26,118.36
27,112.71
28,108.67
29,106.19
30,103.44
31,100.73
32,96.69
33,92.39
34,87.08
35,82.10
36,76.90
37,72.44
38,68.15
39,64.48
40,60.86
41,57.68
42,54.52
43,51.80
44,49.10
45,46.77
46,44.40
47,42.37
48,40.34
49,38.60
50,36.84
51,35.32
52,33.75
53,32.40
54,31.03
55,29.83
56,28.59
57,27.49
58,26.37
59,25.40
60,24.41
61,23.54
62,22.66
63,21.88
64,21.10
65,20.41
66,19.72
67,19.13
68,18.55
69,18.04
70,17.50
71,17.04
72,16.55
73,16.11
74,15.60
75,15.14
76,14.65
77,14.21
78,13.75
79,13.31
80,12.84
81,12.44
82,12.02
83,11.65
84,11.27
85,10.94
86,10.61
87,10.33
88,10.05
89,9.80
90,9.53
91,9.29
92,9.06
93,8.86
94,8.64
95,8.45
96,8.24
97,8.06
98,7.88
99,7.71
100,7.55
101,7.39
102,7.24
103,7.08
104,6.92
105,6.78
106,6.67
107,6.59
108,6.51
109,6.44
110,6.37
111,6.33
112,6.29
113,6.27
114,6.23
115,6.20
116,6.19
117,6.17
118,6.14
119,6.12
120,6.10
121,6.07
122,6.01
123,5.95
124,5.91
125,5.90
126,5.89
127,5.87
128,5.86
129,5.85
130,5.87
131,5.91
132,5.94
133,5.99
134,6.04
135,6.10
136,6.16
137,6.21
138,6.23
139,6.23
140,6.23
141,6.23
142,6.22
143,6.20
144,6.19
145,6.17
146,6.14
147,6.10
148,6.07
149,6.03
150,6.00
151,5.97
152,5.94
153,5.92
154,5.87
155,5.83
156,5.80
157,5.78
158,5.77
159,5.74
160,5.71
161,5.68
162,5.69
163,5.71
164,5.73
165,5.76
166,5.81
167,5.84
168,5.89
169,5.94
170,5.98
171,6.03
172,6.06
173,6.09
174,6.13
175,6.15
176,6.15
177,6.13
178,6.10
179,6.12
180,6.14
181,6.16
182,6.16
183,6.18
184,6.21
185,6.26
186,6.31
187,6.36
188,6.39
189,6.42
190,6.45
191,6.46
192,6.46
193,6.45
194,6.42
195,6.38
196,6.30
197,6.23
198,6.16
199,6.12
200,6.08
201,6.05
202,6.04
203,6.04
204,6.04
205,6.04
206,6.06
207,6.10
208,6.16
209,6.23
210,6.28
211,6.32
212,6.37
213,6.42
214,6.45
215,6.48
216,6.50
217,6.52
218,6.53
219,6.55
220,6.55
221,6.55
222,6.55
223,6.55
224,6.55
225,6.55
226,6.55
227,6.53
228,6.50
229,6.47
230,6.45
231,6.46
232,6.47
233,6.46
234,6.45
235,6.45
236,6.46
237,6.46
238,6.46
239,6.46
240,6.47
241,6.47
242,6.45
243,6.42
244,6.40
245,6.39
246,6.40
247,6.42
248,6.45
249,6.51
250,6.58
251,6.68
252,6.79
253,6.90
254,7.03
255,7.13
256,7.23
257,7.35
258,7.47
259,7.57
260,7.62
261,7.65
262,7.67
263,7.68
264,7.69
265,7.68
266,7.63
267,7.57
268,7.51
269,7.45
270,7.37
271,7.29
272,7.20
273,7.14
274,7.09
275,7.03
276,6.97
277,6.90
278,6.87
279,6.85
280,6.84
281,6.83
282,6.81
283,6.81
284,6.82
285,6.84
286,6.87
287,6.90
288,6.91
289,6.94
290,6.96
291,6.99
292,7.00
293,7.00
294,7.01
295,7.02
296,7.02
297,7.01
298,7.00
299,7.00
300,7.00
301,7.03
302,7.04
303,7.06
304,7.06
305,7.06
306,7.07
307,7.09
308,7.09
309,7.09
310,7.09
311,7.09
312,7.07
313,7.06
314,7.06
315,7.06
316,7.06
317,7.04
318,7.03
319,7.01
320,6.98
321,6.95
322,6.94
323,6.94
324,6.94
325,6.94
326,6.94
327,6.92
328,6.90
329,6.90
330,6.92
331,6.94
332,6.94
333,6.92
334,6.90
335,6.89
336,6.87
337,6.84
338,6.81
339,6.77
340,6.74
341,6.71
342,6.69
343,6.67
344,6.65
345,6.64
346,6.65
347,6.67
348,6.71
349,6.76
350,6.81
351,6.88
352,6.94
353,6.98
354,7.01
355,7.04
356,7.07
357,7.09
358,7.08
359,7.06
360,7.06
361,7.06
362,7.04
363,7.01
364,7.00
365,7.01
366,7.03
367,7.05
368,7.06
369,7.07
370,7.10
371,7.15
372,7.20
373,7.26
374,7.32
375,7.39
376,7.43
377,7.48
378,7.55
379,7.65
380,7.75
381,7.84
382,7.90
383,7.97
384,8.05
385,8.13
386,8.20
387,8.26
388,8.30
389,8.32
390,8.35
391,8.40
392,8.45
393,8.50
394,8.54
395,8.60
396,8.67
397,8.73
398,8.79
399,8.85
400,8.89
401,8.92
402,8.95
403,8.98
404,9.00
405,8.98
406,8.93
407,8.88
408,8.82
409,8.76
410,8.68
411,8.61
412,8.55
413,8.50
414,8.45
415,8.39
416,8.35
417,8.33
418,8.33
419,8.34
420,8.34
421,8.35
422,8.38
423,8.41
424,8.45
425,8.49
426,8.53
427,8.56
428,8.58
429,8.60
430,8.61
431,8.61
432,8.60
433,8.60
434,8.61
435,8.63
436,8.64
437,8.64
438,8.62
439,8.61
440,8.61
441,8.62
442,8.64
443,8.66
444,8.67
445,8.68
446,8.70
447,8.72
448,8.74
449,8.75
450,8.75
451,8.76
452,8.77
453,8.76
454,8.74
455,8.70
456,8.64
457,8.60
458,8.54
459,8.46
460,8.39
461,8.33
462,8.27
463,8.24
464,8.22
465,8.22
466,8.21
467,8.18
468,8.16
469,8.16
470,8.16
471,8.16
472,8.16
473,8.16
474,8.16
475,8.15
476,8.11
477,8.06
478,8.03
479,8.00
480,7.96
481,7.91
482,7.87
483,7.84
484,7.80
485,7.77
486,7.72
487,7.69
488,7.67
489,7.65
490,7.65
491,7.65
492,7.64
493,7.64
494,7.67
495,7.71
496,7.76
497,7.80
498,7.81
499,7.81
500,7.78
501,7.74
502,7.68
503,7.61
504,7.51
505,7.39
506,7.26
507,7.14
508,7.03
509,6.93
510,6.83
511,6.76
512,6.70
513,6.66
514,6.62
515,6.58
516,6.52
517,6.48
518,6.44
519,6.40
520,6.35
521,6.27
522,6.16
523,6.07
524,5.97
525,5.90
526,5.82
527,5.73
528,5.65
529,5.59
530,5.54
531,5.50
532,5.46
533,5.45
534,5.46
535,5.47
536,5.49
537,5.52
538,5.56
539,5.62
540,5.70
541,5.78
542,5.88
543,5.99
544,6.10
545,6.20
546,6.30
547,6.39
548,6.46
549,6.52
550,6.58
551,6.62
552,6.66
553,6.68
554,6.67
555,6.65
556,6.64
557,6.64
558,6.65
559,6.64
560,6.64
561,6.65
562,6.70
563,6.77
564,6.86
565,6.95
566,7.06
567,7.19
568,7.35
569,7.51
570,7.68
571,7.86
572,8.03
573,8.18
574,8.31
575,8.41
576,8.51
577,8.58
578,8.63
579,8.65
580,8.67
581,8.68
582,8.71
583,8.74
584,8.79
585,8.85
586,8.94
587,9.04
588,9.19
589,9.33
590,9.48
591,9.62
592,9.80
593,9.99
594,10.17
595,10.31
596,10.48
597,10.67
598,10.88
599,11.09
600,11.31
601,11.54
602,11.81
603,12.07
604,12.33
605,12.60
606,12.90
607,13.21
608,13.50
609,13.74
610,13.97
611,14.18
612,14.38
613,14.53
614,14.66
615,14.77
616,14.87
617,14.93
618,14.96
619,14.98
620,14.98
621,14.98
622,14.97
623,14.94
624,14.89
625,14.84
626,14.76
627,14.67
628,14.56
629,14.44
630,14.31
631,14.18
632,14.04
633,13.89
634,13.73
635,13.57
636,13.40
637,13.24
638,13.08
639,12.94
640,12.78
641,12.63
642,12.50
643,12.38
644,12.27
645,12.16
646,12.06
647,11.98
648,11.90
649,11.85
650,11.79
651,11.75
652,11.73
653,11.73
654,11.73
655,11.73
656,11.75
657,11.80
658,11.84
659,11.89
660,11.93
661,11.99
662,12.07
663,12.14
664,12.21
665,12.27
666,12.34
667,12.39
668,12.42
669,12.43
670,12.42
671,12.41
672,12.35
673,12.26
674,12.15
675,12.05
676,11.95
677,11.85
678,11.73
679,11.63
680,11.54
681,11.47
682,11.39
683,11.33
684,11.31
685,11.32
686,11.34
687,11.38
688,11.44
689,11.51
690,11.57
691,11.64
692,11.71
693,11.76
694,11.80
695,11.80
696,11.80
697,11.81
698,11.82
699,11.81
700,11.78
701,11.75
702,11.71
703,11.68
704,11.67
705,11.67
706,11.67
707,11.65
708,11.63
709,11.63
710,11.65
711,11.67
712,11.67
713,11.67
714,11.67
715,11.67
716,11.67
717,11.67
718,11.67
719,11.67
720,11.67
721,11.67
722,11.67
723,11.65
724,11.63
725,11.60
726,11.56
727,11.53
728,11.51
729,11.50
730,11.47
731,11.46
732,11.47
733,11.48
734,11.48
735,11.47
736,11.47
737,11.48
738,11.49
739,11.47
740,11.45
741,11.44
742,11.44
743,11.46
744,11.44
745,11.42
746,11.41
747,11.42
748,11.43
749,11.43
750,11.45
751,11.51
752,11.57
753,11.63
754,11.67
755,11.70
756,11.76
757,11.80
758,11.85
759,11.89
760,11.92
761,11.93
762,11.93
763,11.94
764,11.95
765,11.94
766,11.92
767,11.88
768,11.85
769,11.83
770,11.80
771,11.78
772,11.76
773,11.75
774,11.76
775,11.78
776,11.81
777,11.86
778,11.96
779,12.05
780,12.16
781,12.27
782,12.40
783,12.54
784,12.70
785,12.83
786,12.95
787,13.04
788,13.11
789,13.15
790,13.17
791,13.13
792,13.05
793,12.93
794,12.79
795,12.64
796,12.47
797,12.30
798,12.12
799,11.96
800,11.80
801,11.66
802,11.51
803,11.39
804,11.28
805,11.20
806,11.15
807,11.12
808,11.08
809,11.04
810,11.01
811,11.01
812,11.00
813,10.98
814,10.94
815,10.91
816,10.87
817,10.81
818,10.74
819,10.68
820,10.64
821,10.60
822,10.54
823,10.48
824,10.44
825,10.41
826,10.36
827,10.30
828,10.25
829,10.20
830,10.15
831,10.10
832,10.02
833,9.93
834,9.84
835,9.75
836,9.64
837,9.54
838,9.45
839,9.38
840,9.32
841,9.27
842,9.25
843,9.27
844,9.32
845,9.38
846,9.45
847,9.54
848,9.65
849,9.77
850,9.86
851,9.94
852,10.03
853,10.11
854,10.18
855,10.21
856,10.22
857,10.25
858,10.28
859,10.31
860,10.35
861,10.38
862,10.46
863,10.55
864,10.65
865,10.75
866,10.86
867,11.00
868,11.15
869,11.31
870,11.43
871,11.53
872,11.63
873,11.73
874,11.85
875,11.93
876,12.01
877,12.08
878,12.15
879,12.23
880,12.29
881,12.34
882,12.39
883,12.45
884,12.55
885,12.65
886,12.76
887,12.87
888,12.97
889,13.07
890,13.19
891,13.32
892,13.47
893,13.62
894,13.77
895,13.91
896,14.07
897,14.23
898,14.41
899,14.60
900,14.82
901,15.01
902,15.22
903,15.42
904,15.61
905,15.79
906,15.95
907,16.08
908,16.18
909,16.23
910,16.22
911,16.17
912,16.11
913,16.00
914,15.85
915,15.66
916,15.44
917,15.23
918,15.01
919,14.79
920,14.57
921,14.40
922,14.24
923,14.11
924,13.99
925,13.89
926,13.79
927,13.73
928,13.66
929,13.61
930,13.53
931,13.45
932,13.34
933,13.24
934,13.14
935,13.04
936,12.92
937,12.83
938,12.72
939,12.62
940,12.50
941,12.38
942,12.29
943,12.23
944,12.17
945,12.09
946,12.02
947,11.94
948,11.87
949,11.78
950,11.67
951,11.57
952,11.48
953,11.42
954,11.38
955,11.34
956,11.29
957,11.27
958,11.25
959,11.24
960,11.22
961,11.21
962,11.18
963,11.15
964,11.11
965,11.07
966,11.03
967,11.00
968,10.95
969,10.88
970,10.81
971,10.77
972,10.73
973,10.69
974,10.64
975,10.59
976,10.56
977,10.54
978,10.54
979,10.52
980,10.50
981,10.47
982,10.43
983,10.38
984,10.33
985,10.28
986,10.25
987,10.22
988,10.19
989,10.16
990,10.15
991,10.14
992,10.15
993,10.19
994,10.25
995,10.31
996,10.40
997,10.48
998,10.54
999,10.60
1000,10.66
1001,10.72
1002,10.78
1003,10.84
1004,10.89
1005,10.92
1006,10.93
1007,10.95
1008,10.96
1009,10.93
1010,10.91
1011,10.89
1012,10.90
1013,10.92
1014,10.91
1015,10.90
1016,10.90
1017,10.91
1018,10.92
1019,10.90
1020,10.89
1021,10.89
1022,10.89
1023,10.89
1024,10.90
1025,10.93
1026,10.97
1027,11.02
1028,11.07
1029,11.13
1030,11.21
1031,11.29
1032,11.39
1033,11.47
1034,11.56
1035,11.63
1036,11.70
1037,11.76
1038,11.83
1039,11.86
1040,11.88
1041,11.88
1042,11.88
1043,11.89
1044,11.92
1045,11.96
1046,11.98
1047,11.99
1048,12.02
1049,12.06
1050,12.10
1051,12.13
1052,12.16
1053,12.19
1054,12.22
1055,12.24
1056,12.22
1057,12.19
1058,12.16
1059,12.13
1060,12.09
1061,12.05
1062,12.01
1063,11.98
1064,11.96
1065,11.96
1066,11.98
1067,11.99
1068,12.01
1069,12.03
1070,12.08
1071,12.12
1072,12.16
1073,12.19
1074,12.22
1075,12.25
1076,12.28
1077,12.29
1078,12.31
1079,12.31
1080,12.34
1081,12.34
1082,12.37
1083,12.40
1084,12.43
1085,12.45
1086,12.49
1087,12.54
1088,12.59
1089,12.63
1090,12.67
1091,12.70
1092,12.73
1093,12.77
1094,12.83
1095,12.86
1096,12.86
1097,12.86
1098,12.86
1099,12.86
1100,12.86
1101,12.86
1102,12.86
1103,12.86
1104,12.86
1105,12.84
1106,12.82
1107,12.78
1108,12.76
1109,12.76
1110,12.77
1111,12.78
1112,12.76
1113,12.73
1114,12.70
1115,12.68
1116,12.67
1117,12.66
1118,12.64
1119,12.61
1120,12.58
1121,12.57
1122,12.55
1123,12.54
1124,12.53
1125,12.51
1126,12.48
1127,12.47
1128,12.49
1129,12.51
1130,12.54
1131,12.54
1132,12.54
1133,12.57
1134,12.60
1135,12.63
1136,12.66
1137,12.70
1138,12.72
1139,12.73
1140,12.75
1141,12.76
1142,12.78
1143,12.81
1144,12.85
1145,12.88
1146,12.90
1147,12.92
1148,12.93
1149,12.96
1150,13.01
1151,13.05
1152,13.08
1153,13.11
1154,13.15
1155,13.18
1156,13.21
1157,13.23
1158,13.25
1159,13.28
1160,13.32
1161,13.35
1162,13.37
1163,13.37
1164,13.37
1165,13.37
1166,13.37
1167,13.37
1168,13.37
1169,13.37
1170,13.37
1171,13.37
1172,13.36
1173,13.35
1174,13.32
1175,13.28
1176,13.22
1177,13.16
1178,13.10
1179,13.02
1180,12.94
1181,12.86
1182,12.81
1183,12.78
1184,12.75
1185,12.72
1186,12.72
1187,12.74
1188,12.78
1189,12.86
1190,12.88
1191,12.86
1192,12.85
1193,12.18
1194,12.64
1195,14.85
1196,15.16
1197,9.93
1198,6.05
1199,17.19
1200,29.13
