1,-188.83
2,-250.00
3,-250.00
4,-245.27
5,-241.02
6,-248.85
7,-213.49
8,-107.18
9,35.34
10,157.36
11,225.28
12,247.25
13,249.38
14,249.99
15,249.99
16,249.99
17,249.99
18,249.99
19,248.11
20,232.49
21,205.92
22,179.10
23,158.33
24,143.33
25,131.45
26,121.62
27,116.09
28,113.40
29,112.43
30,110.49
31,108.05
32,103.86
33,99.02
34,92.84
35,86.83
36,80.64
37,75.27
38,70.08
39,65.54
40,61.04
41,57.03
42,53.03
43,49.52
44,45.97
45,42.84
46,39.65
47,36.88
48,34.07
49,31.61
50,29.06
51,26.81
52,24.49
53,22.45
54,20.34
55,18.47
56,16.53
57,14.82
58,13.04
59,11.45
60,9.83
61,8.38
62,6.90
63,5.57
64,4.17
65,2.91
66,1.63
67,0.47
68,-0.74
69,-1.84
70,-2.98
71,-4.00
72,-5.07
73,-6.04
74,-7.06
75,-7.97
76,-8.91
77,-9.75
78,-10.64
79,-11.44
80,-12.28
81,-13.00
82,-13.73
83,-14.36
84,-15.01
85,-15.59
86,-16.20
87,-16.75
88,-17.29
89,-17.75
90,-18.23
91,-18.65
92,-19.10
93,-19.49
94,-19.93
95,-20.33
96,-20.75
97,-21.12
98,-21.50
99,-21.87
100,-22.25
101,-22.60
102,-22.94
103,-23.25
104,-23.56
105,-23.85
106,-24.16
107,-24.44
108,-24.74
109,-24.99
110,-25.25
111,-25.47
112,-25.74
113,-25.98
114,-26.22
115,-26.43
116,-26.65
117,-26.87
118,-27.11
119,-27.31
120,-27.53
121,-27.73
122,-27.94
123,-28.14
124,-28.37
125,-28.57
126,-28.79
127,-29.00
128,-29.21
129,-29.40
130,-29.60
131,-29.80
132,-30.01
133,-30.21
134,-30.41
135,-30.59
136,-30.78
137,-30.95
138,-31.14
139,-31.30
140,-31.47
141,-31.63
142,-31.79
143,-31.93
144,-32.06
145,-32.18
146,-32.30
147,-32.42
148,-32.52
149,-32.61
150,-32.69
151,-32.77
152,-32.82
153,-32.85
154,-32.87
155,-32.88
156,-32.91
157,-32.94
158,-32.96
159,-32.97
160,-32.97
161,-32.96
162,-32.97
163,-33.00
164,-33.04
165,-33.07
166,-33.10
167,-33.15
168,-33.23
169,-33.30
170,-33.38
171,-33.45
172,-33.53
173,-33.61
174,-33.69
175,-33.77
176,-33.83
177,-33.87
178,-33.90
179,-33.92
180,-33.95
181,-33.97
182,-34.00
183,-34.00
184,-34.00
185,-34.01
186,-34.03
187,-34.07
188,-34.12
189,-34.18
190,-34.23
191,-34.28
192,-34.35
193,-34.43
194,-34.52
195,-34.61
196,-34.68
197,-34.76
198,-34.84
199,-34.92
200,-35.00
201,-35.09
202,-35.16
203,-35.23
204,-35.29
205,-35.34
206,-35.39
207,-35.41
208,-35.42
209,-35.44
210,-35.45
211,-35.45
212,-35.44
213,-35.40
214,-35.35
215,-35.32
216,-35.27
217,-35.23
218,-35.19
219,-35.15
220,-35.11
221,-35.09
222,-35.06
223,-35.03
224,-34.98
225,-34.93
226,-34.88
227,-34.84
228,-34.80
229,-34.74
230,-34.65
231,-34.56
232,-34.47
233,-34.39
234,-34.29
235,-34.21
236,-34.14
237,-34.10
238,-34.04
239,-33.99
240,-33.95
241,-33.95
242,-33.98
243,-34.01
244,-34.02
245,-34.03
246,-34.05
247,-34.09
248,-34.13
249,-34.17
250,-34.21
251,-34.24
252,-34.27
253,-34.29
254,-34.33
255,-34.37
256,-34.41
257,-34.45
258,-34.48
259,-34.52
260,-34.57
261,-34.62
262,-34.68
263,-34.73
264,-34.77
265,-34.81
266,-34.84
267,-34.88
268,-34.92
269,-34.95
270,-34.97
271,-34.97
272,-34.94
273,-34.92
274,-34.90
275,-34.89
276,-34.88
277,-34.87
278,-34.87
279,-34.87
280,-34.87
281,-34.87
282,-34.87
283,-34.90
284,-34.98
285,-35.06
286,-35.12
287,-35.15
288,-35.18
289,-35.23
290,-35.29
291,-35.34
292,-35.35
293,-35.34
294,-35.32
295,-35.30
296,-35.29
297,-35.26
298,-35.22
299,-35.18
300,-35.13
301,-35.10
302,-35.08
303,-35.06
304,-35.06
305,-35.06
306,-35.06
307,-35.08
308,-35.10
309,-35.13
310,-35.16
311,-35.22
312,-35.28
313,-35.34
314,-35.39
315,-35.42
316,-35.45
317,-35.49
318,-35.54
319,-35.56
320,-35.58
321,-35.58
322,-35.59
323,-35.60
324,-35.60
325,-35.59
326,-35.58
327,-35.55
328,-35.51
329,-35.48
330,-35.46
331,-35.48
332,-35.48
333,-35.49
334,-35.51
335,-35.56
336,-35.60
337,-35.64
338,-35.68
339,-35.71
340,-35.76
341,-35.78
342,-35.79
343,-35.78
344,-35.77
345,-35.75
346,-35.71
347,-35.67
348,-35.61
349,-35.58
350,-35.56
351,-35.54
352,-35.52
353,-35.51
354,-35.50
355,-35.51
356,-35.54
357,-35.57
358,-35.61
359,-35.64
360,-35.66
361,-35.67
362,-35.67
363,-35.68
364,-35.70
365,-35.73
366,-35.74
367,-35.74
368,-35.74
369,-35.76
370,-35.78
371,-35.80
372,-35.81
373,-35.84
374,-35.88
375,-35.94
376,-36.00
377,-36.06
378,-36.10
379,-36.16
380,-36.20
381,-36.24
382,-36.28
383,-36.32
384,-36.38
385,-36.43
386,-36.47
387,-36.50
388,-36.54
389,-36.58
390,-36.63
391,-36.66
392,-36.69
393,-36.71
394,-36.72
395,-36.71
396,-36.67
397,-36.65
398,-36.62
399,-36.58
400,-36.49
401,-36.39
402,-36.31
403,-36.25
404,-36.18
405,-36.10
406,-36.02
407,-35.97
408,-35.95
409,-35.93
410,-35.92
411,-35.90
412,-35.91
413,-35.93
414,-35.95
415,-35.96
416,-35.96
417,-35.96
418,-35.96
419,-35.97
420,-35.97
421,-35.96
422,-35.96
423,-35.97
424,-36.00
425,-36.02
426,-36.04
427,-36.06
428,-36.06
429,-36.09
430,-36.12
431,-36.14
432,-36.15
433,-36.15
434,-36.16
435,-36.19
436,-36.22
437,-36.23
438,-36.24
439,-36.25
440,-36.27
441,-36.29
442,-36.29
443,-36.27
444,-36.25
445,-36.25
446,-36.25
447,-36.22
448,-36.19
449,-36.14
450,-36.08
451,-36.02
452,-35.94
453,-35.87
454,-35.82
455,-35.77
456,-35.72
457,-35.68
458,-35.64
459,-35.64
460,-35.67
461,-35.71
462,-35.74
463,-35.78
464,-35.83
465,-35.87
466,-35.94
467,-36.00
468,-36.04
469,-36.08
470,-36.12
471,-36.15
472,-36.17
473,-36.18
474,-36.19
475,-36.22
476,-36.23
477,-36.24
478,-36.24
479,-36.23
480,-36.22
481,-36.20
482,-36.21
483,-36.23
484,-36.25
485,-36.25
486,-36.25
487,-36.28
488,-36.32
489,-36.34
490,-36.35
491,-36.37
492,-36.41
493,-36.45
494,-36.48
495,-36.50
496,-36.51
497,-36.54
498,-36.56
499,-36.57
500,-36.58
501,-36.58
502,-36.58
503,-36.58
504,-36.58
505,-36.58
506,-36.57
507,-36.54
508,-36.51
509,-36.46
510,-36.42
511,-36.35
512,-36.28
513,-36.21
514,-36.15
515,-36.10
516,-36.06
517,-36.03
518,-36.03
519,-36.03
520,-36.05
521,-36.09
522,-36.14
523,-36.20
524,-36.26
525,-36.32
526,-36.37
527,-36.41
528,-36.42
529,-36.42
530,-36.42
531,-36.41
532,-36.39
533,-36.38
534,-36.35
535,-36.34
536,-36.33
537,-36.33
538,-36.33
539,-36.34
540,-36.36
541,-36.38
542,-36.38
543,-36.37
544,-36.38
545,-36.40
546,-36.41
547,-36.41
548,-36.42
549,-36.43
550,-36.45
551,-36.48
552,-36.54
553,-36.61
554,-36.69
555,-36.77
556,-36.86
557,-36.96
558,-37.08
559,-37.18
560,-37.26
561,-37.33
562,-37.41
563,-37.47
564,-37.51
565,-37.54
566,-37.54
567,-37.54
568,-37.50
569,-37.43
570,-37.35
571,-37.27
572,-37.19
573,-37.10
574,-36.99
575,-36.88
576,-36.79
577,-36.72
578,-36.65
579,-36.58
580,-36.54
581,-36.50
582,-36.46
583,-36.42
584,-36.39
585,-36.38
586,-36.38
587,-36.36
588,-36.34
589,-36.32
590,-36.30
591,-36.26
592,-36.24
593,-36.24
594,-36.25
595,-36.26
596,-36.25
597,-36.24
598,-36.24
599,-36.25
600,-36.26
601,-36.27
602,-36.26
603,-36.26
604,-36.25
605,-36.25
606,-36.25
607,-36.25
608,-36.23
609,-36.19
610,-36.18
611,-36.19
612,-36.20
613,-36.20
614,-36.19
615,-36.19
616,-36.21
617,-36.22
618,-36.22
619,-36.21
620,-36.19
621,-36.17
622,-36.15
623,-36.12
624,-36.08
625,-36.04
626,-36.00
627,-35.96
628,-35.93
629,-35.91
630,-35.90
631,-35.89
632,-35.90
633,-35.93
634,-35.95
635,-35.96
636,-35.96
637,-35.98
638,-36.00
639,-36.03
640,-36.03
641,-36.02
642,-36.00
643,-35.96
644,-35.92
645,-35.86
646,-35.78
647,-35.71
648,-35.63
649,-35.55
650,-35.45
651,-35.37
652,-35.29
653,-35.24
654,-35.19
655,-35.14
656,-35.08
657,-35.03
658,-34.98
659,-34.95
660,-34.92
661,-34.87
662,-34.83
663,-34.79
664,-34.78
665,-34.77
666,-34.75
667,-34.72
668,-34.71
669,-34.72
670,-34.75
671,-34.77
672,-34.79
673,-34.83
674,-34.88
675,-34.96
676,-35.04
677,-35.12
678,-35.19
679,-35.29
680,-35.38
681,-35.47
682,-35.53
683,-35.57
684,-35.60
685,-35.62
686,-35.62
687,-35.60
688,-35.57
689,-35.52
690,-35.47
691,-35.41
692,-35.35
693,-35.30
694,-35.26
695,-35.22
696,-35.17
697,-35.12
698,-35.08
699,-35.04
700,-35.00
701,-34.95
702,-34.90
703,-34.84
704,-34.76
705,-34.68
706,-34.61
707,-34.55
708,-34.47
709,-34.39
710,-34.30
711,-34.25
712,-34.20
713,-34.16
714,-34.13
715,-34.10
716,-34.08
717,-34.07
718,-34.07
719,-34.08
720,-34.10
721,-34.10
722,-34.10
723,-34.10
724,-34.11
725,-34.11
726,-34.09
727,-34.06
728,-34.05
729,-34.07
730,-34.10
731,-34.13
732,-34.15
733,-34.16
734,-34.18
735,-34.22
736,-34.27
737,-34.34
738,-34.42
739,-34.47
740,-34.51
741,-34.55
742,-34.58
743,-34.64
744,-34.69
745,-34.73
746,-34.74
747,-34.76
748,-34.78
749,-34.80
750,-34.81
751,-34.80
752,-34.77
753,-34.75
754,-34.73
755,-34.69
756,-34.63
757,-34.57
758,-34.51
759,-34.48
760,-34.44
761,-34.41
762,-34.39
763,-34.38
764,-34.37
765,-34.38
766,-34.39
767,-34.42
768,-34.44
769,-34.46
770,-34.48
771,-34.48
772,-34.46
773,-34.42
774,-34.37
775,-34.30
776,-34.19
777,-34.07
778,-33.95
779,-33.84
780,-33.71
781,-33.60
782,-33.50
783,-33.42
784,-33.38
785,-33.35
786,-33.36
787,-33.40
788,-33.46
789,-33.55
790,-33.65
791,-33.78
792,-33.91
793,-34.01
794,-34.10
795,-34.18
796,-34.26
797,-34.32
798,-34.36
799,-34.37
800,-34.39
801,-34.38
802,-34.38
803,-34.38
804,-34.39
805,-34.41
806,-34.44
807,-34.46
808,-34.50
809,-34.53
810,-34.55
811,-34.59
812,-34.65
813,-34.72
814,-34.77
815,-34.78
816,-34.79
817,-34.81
818,-34.83
819,-34.83
820,-34.81
821,-34.79
822,-34.77
823,-34.75
824,-34.73
825,-34.71
826,-34.68
827,-34.66
828,-34.65
829,-34.64
830,-34.61
831,-34.57
832,-34.53
833,-34.49
834,-34.45
835,-34.42
836,-34.39
837,-34.37
838,-34.35
839,-34.32
840,-34.30
841,-34.30
842,-34.32
843,-34.36
844,-34.39
845,-34.44
846,-34.49
847,-34.56
848,-34.64
849,-34.72
850,-34.81
851,-34.89
852,-34.95
853,-34.99
854,-35.02
855,-35.04
856,-35.07
857,-35.09
858,-35.09
859,-35.08
860,-35.06
861,-35.05
862,-35.03
863,-35.01
864,-35.00
865,-34.99
866,-34.99
867,-35.00
868,-35.01
869,-35.02
870,-35.02
871,-35.01
872,-35.00
873,-34.97
874,-34.93
875,-34.88
876,-34.83
877,-34.75
878,-34.66
879,-34.58
880,-34.50
881,-34.45
882,-34.40
883,-34.34
884,-34.28
885,-34.25
886,-34.24
887,-34.25
888,-34.26
889,-34.26
890,-34.26
891,-34.28
892,-34.30
893,-34.32
894,-34.34
895,-34.36
896,-34.36
897,-34.39
898,-34.41
899,-34.44
900,-34.45
901,-34.45
902,-34.46
903,-34.50
904,-34.56
905,-34.61
906,-34.65
907,-34.68
908,-34.69
909,-34.71
910,-34.71
911,-34.71
912,-34.71
913,-34.71
914,-34.71
915,-34.70
916,-34.71
917,-34.71
918,-34.73
919,-34.75
920,-34.79
921,-34.84
922,-34.90
923,-34.96
924,-35.03
925,-35.08
926,-35.13
927,-35.17
928,-35.19
929,-35.20
930,-35.18
931,-35.15
932,-35.12
933,-35.09
934,-35.05
935,-35.00
936,-34.95
937,-34.91
938,-34.87
939,-34.81
940,-34.76
941,-34.71
942,-34.65
943,-34.61
944,-34.57
945,-34.53
946,-34.49
947,-34.45
948,-34.42
949,-34.41
950,-34.40
951,-34.40
952,-34.42
953,-34.45
954,-34.49
955,-34.53
956,-34.58
957,-34.63
958,-34.70
959,-34.75
960,-34.78
961,-34.80
962,-34.81
963,-34.83
964,-34.85
965,-34.87
966,-34.87
967,-34.87
968,-34.84
969,-34.82
970,-34.80
971,-34.77
972,-34.73
973,-34.68
974,-34.62
975,-34.58
976,-34.55
977,-34.54
978,-34.53
979,-34.53
980,-34.53
981,-34.52
982,-34.51
983,-34.52
984,-34.52
985,-34.54
986,-34.55
987,-34.53
988,-34.51
989,-34.48
990,-34.45
991,-34.40
992,-34.36
993,-34.32
994,-34.27
995,-34.23
996,-34.17
997,-34.13
998,-34.11
999,-34.10
1000,-34.10
1001,-34.08
1002,-34.07
1003,-34.08
1004,-34.10
1005,-34.11
1006,-34.13
1007,-34.14
1008,-34.16
1009,-34.19
1010,-34.23
1011,-34.27
1012,-34.32
1013,-34.35
1014,-34.38
1015,-34.39
1016,-34.42
1017,-34.45
1018,-34.50
1019,-34.55
1020,-34.61
1021,-34.65
1022,-34.68
1023,-34.70
1024,-34.74
1025,-34.79
1026,-34.85
1027,-34.90
1028,-34.93
1029,-34.97
1030,-35.03
1031,-35.11
1032,-35.20
1033,-35.29
1034,-35.39
1035,-35.48
1036,-35.58
1037,-35.68
1038,-35.77
1039,-35.85
1040,-35.93
1041,-36.00
1042,-36.09
1043,-36.16
1044,-36.22
1045,-36.28
1046,-36.33
1047,-36.38
1048,-36.42
1049,-36.44
1050,-36.45
1051,-36.44
1052,-36.42
1053,-36.42
1054,-36.39
1055,-36.36
1056,-36.29
1057,-36.21
1058,-36.13
1059,-36.06
1060,-35.98
1061,-35.89
1062,-35.79
1063,-35.71
1064,-35.63
1065,-35.55
1066,-35.48
1067,-35.41
1068,-35.35
1069,-35.31
1070,-35.28
1071,-35.26
1072,-35.22
1073,-35.22
1074,-35.21
1075,-35.21
1076,-35.21
1077,-35.21
1078,-35.21
1079,-35.22
1080,-35.23
1081,-35.26
1082,-35.29
1083,-35.32
1084,-35.34
1085,-35.35
1086,-35.35
1087,-35.37
1088,-35.38
1089,-35.39
1090,-35.38
1091,-35.38
1092,-35.38
1093,-35.38
1094,-35.39
1095,-35.39
1096,-35.36
1097,-35.34
1098,-35.34
1099,-35.35
1100,-35.36
1101,-35.35
1102,-35.32
1103,-35.31
1104,-35.30
1105,-35.29
1106,-35.27
1107,-35.25
1108,-35.23
1109,-35.21
1110,-35.18
1111,-35.14
1112,-35.11
1113,-35.10
1114,-35.08
1115,-35.06
1116,-35.02
1117,-34.98
1118,-34.94
1119,-34.90
1120,-34.84
1121,-34.80
1122,-34.75
1123,-34.70
1124,-34.62
1125,-34.53
1126,-34.44
1127,-34.36
1128,-34.27
1129,-34.19
1130,-34.10
1131,-34.03
1132,-33.97
1133,-33.89
1134,-33.82
1135,-33.77
1136,-33.72
1137,-33.68
1138,-33.64
1139,-33.60
1140,-33.59
1141,-33.61
1142,-33.62
1143,-33.62
1144,-33.65
1145,-33.69
1146,-33.73
1147,-33.75
1148,-33.79
1149,-33.84
1150,-33.92
1151,-34.00
1152,-34.07
1153,-34.11
1154,-34.16
1155,-34.21
1156,-34.27
1157,-34.31
1158,-34.34
1159,-34.36
1160,-34.39
1161,-34.42
1162,-34.42
1163,-34.42
1164,-34.44
1165,-34.45
1166,-34.45
1167,-34.44
1168,-34.42
1169,-34.41
1170,-34.41
1171,-34.39
1172,-34.34
1173,-34.29
1174,-34.26
1175,-34.24
1176,-34.19
1177,-34.14
1178,-34.08
1179,-34.03
1180,-33.97
1181,-33.90
1182,-33.81
1183,-33.71
1184,-33.61
1185,-33.52
1186,-33.42
1187,-33.31
1188,-33.19
1189,-33.20
1190,-33.06
1191,-32.81
1192,-32.53
1193,-33.91
1194,-34.07
1195,-30.65
1196,-28.21
1197,-35.15
1198,-43.98
1199,-31.87
1200,-4.88
