1,-36.29
2,-50.00
3,-50.00
4,-24.22
5,27.22
6,50.00
7,50.00
8,48.46
9,45.50
10,49.85
11,50.00
12,50.00
13,49.22
14,49.75
15,50.00
16,50.00
17,50.00
18,50.00
19,50.00
20,50.00
21,50.00
22,50.00
23,50.00
24,50.00
25,50.00
26,50.00
27,50.00
28,50.00
29,50.00
30,50.00
31,50.00
32,50.00
33,50.00
34,50.00
35,50.00
36,50.00
37,49.95
38,49.61
39,48.91
40,47.75
41,46.38
42,44.95
43,43.73
44,42.66
45,41.77
46,40.88
47,40.05
48,39.14
49,38.23
50,37.20
51,36.27
52,35.37
53,34.54
54,33.55
55,32.49
56,31.37
57,30.47
58,29.70
59,29.11
60,28.47
61,27.85
62,27.15
63,26.51
64,25.86
65,25.26
66,24.59
67,23.90
68,23.12
69,22.40
70,21.71
71,21.17
72,20.70
73,20.31
74,19.91
75,19.53
76,19.08
77,18.66
78,18.19
79,17.76
80,17.31
81,16.91
82,16.49
83,16.09
84,15.61
85,15.09
86,14.46
87,13.84
88,13.26
89,12.84
90,12.56
91,12.41
92,12.27
93,12.11
94,11.85
95,11.53
96,11.12
97,10.71
98,10.29
99,9.95
100,9.68
101,9.49
102,9.30
103,9.09
104,8.85
105,8.65
106,8.46
107,8.30
108,8.03
109,7.58
110,6.94
111,6.31
112,5.85
113,5.67
114,5.65
115,5.60
116,5.35
117,4.92
118,4.41
119,3.97
120,3.61
121,3.31
122,2.99
123,2.73
124,2.58
125,2.61
126,2.69
127,2.69
128,2.47
129,2.12
130,1.75
131,1.53
132,1.44
133,1.40
134,1.27
135,1.05
136,0.81
137,0.65
138,0.56
139,0.49
140,0.35
141,0.13
142,-0.12
143,-0.30
144,-0.35
145,-0.30
146,-0.22
147,-0.14
148,-0.12
149,-0.20
150,-0.37
151,-0.60
152,-0.82
153,-0.95
154,-0.96
155,-0.86
156,-0.75
157,-0.68
158,-0.63
159,-0.57
160,-0.51
161,-0.52
162,-0.73
163,-1.18
164,-1.77
165,-2.32
166,-2.68
167,-2.84
168,-2.94
169,-3.09
170,-3.34
171,-3.57
172,-3.67
173,-3.55
174,-3.33
175,-3.15
176,-3.13
177,-3.26
178,-3.45
179,-3.59
180,-3.68
181,-3.74
182,-3.84
183,-3.99
184,-4.17
185,-4.31
186,-4.38
187,-4.37
188,-4.30
189,-4.17
190,-4.04
191,-3.92
192,-3.87
193,-3.91
194,-4.04
195,-4.20
196,-4.34
197,-4.44
198,-4.52
199,-4.61
200,-4.72
201,-4.82
202,-4.89
203,-4.91
204,-4.93
205,-5.00
206,-5.16
207,-5.33
208,-5.42
209,-5.37
210,-5.21
211,-5.02
212,-4.91
213,-4.90
214,-4.92
215,-4.90
216,-4.82
217,-4.75
218,-4.76
219,-4.86
220,-4.95
221,-4.93
222,-4.79
223,-4.65
224,-4.62
225,-4.77
226,-5.00
227,-5.17
228,-5.19
229,-5.11
230,-5.05
231,-5.13
232,-5.35
233,-5.62
234,-5.79
235,-5.80
236,-5.67
237,-5.52
238,-5.46
239,-5.52
240,-5.67
241,-5.86
242,-6.03
243,-6.15
244,-6.20
245,-6.19
246,-6.14
247,-6.10
248,-6.08
249,-6.08
250,-6.08
251,-6.04
252,-5.97
253,-5.92
254,-5.92
255,-5.97
256,-6.03
257,-5.99
258,-5.82
259,-5.56
260,-5.35
261,-5.34
262,-5.56
263,-5.90
264,-6.16
265,-6.21
266,-6.03
267,-5.79
268,-5.64
269,-5.67
270,-5.80
271,-5.91
272,-5.92
273,-5.88
274,-5.88
275,-5.99
276,-6.21
277,-6.46
278,-6.65
279,-6.73
280,-6.70
281,-6.59
282,-6.44
283,-6.25
284,-6.09
285,-6.03
286,-6.13
287,-6.34
288,-6.53
289,-6.54
290,-6.35
291,-6.04
292,-5.81
293,-5.82
294,-6.11
295,-6.52
296,-6.84
297,-6.90
298,-6.69
299,-6.39
300,-6.19
301,-6.19
302,-6.36
303,-6.57
304,-6.67
305,-6.59
306,-6.39
307,-6.18
308,-6.07
309,-6.09
310,-6.20
311,-6.37
312,-6.56
313,-6.75
314,-6.93
315,-7.05
316,-7.08
317,-7.01
318,-6.89
319,-6.77
320,-6.74
321,-6.84
322,-7.05
323,-7.30
324,-7.45
325,-7.43
326,-7.22
327,-6.91
328,-6.68
329,-6.70
330,-6.99
331,-7.42
332,-7.74
333,-7.76
334,-7.45
335,-6.98
336,-6.55
337,-6.33
338,-6.29
339,-6.32
340,-6.27
341,-6.12
342,-5.88
343,-5.63
344,-5.40
345,-5.20
346,-5.04
347,-4.97
348,-4.99
349,-5.11
350,-5.22
351,-5.22
352,-5.06
353,-4.79
354,-4.56
355,-4.48
356,-4.56
357,-4.72
358,-4.84
359,-4.83
360,-4.64
361,-4.34
362,-4.03
363,-3.84
364,-3.81
365,-3.92
366,-4.05
367,-4.10
368,-3.98
369,-3.72
370,-3.42
371,-3.25
372,-3.27
373,-3.47
374,-3.75
375,-3.99
376,-4.16
377,-4.24
378,-4.25
379,-4.17
380,-4.00
381,-3.78
382,-3.61
383,-3.63
384,-3.84
385,-4.15
386,-4.36
387,-4.32
388,-4.03
389,-3.67
390,-3.43
391,-3.44
392,-3.62
393,-3.77
394,-3.73
395,-3.47
396,-3.14
397,-2.96
398,-3.02
399,-3.30
400,-3.61
401,-3.80
402,-3.78
403,-3.63
404,-3.47
405,-3.41
406,-3.43
407,-3.47
408,-3.45
409,-3.35
410,-3.19
411,-3.00
412,-2.83
413,-2.71
414,-2.67
415,-2.71
416,-2.80
417,-2.90
418,-2.98
419,-3.04
420,-3.12
421,-3.23
422,-3.33
423,-3.35
424,-3.23
425,-3.00
426,-2.79
427,-2.70
428,-2.76
429,-2.91
430,-3.00
431,-2.99
432,-2.92
433,-2.90
434,-3.00
435,-3.17
436,-3.31
437,-3.29
438,-3.09
439,-2.78
440,-2.48
441,-2.28
442,-2.25
443,-2.38
444,-2.65
445,-2.97
446,-3.24
447,-3.38
448,-3.35
449,-3.25
450,-3.23
451,-3.40
452,-3.76
453,-4.17
454,-4.49
455,-4.62
456,-4.58
457,-4.47
458,-4.43
459,-4.52
460,-4.68
461,-4.82
462,-4.83
463,-4.68
464,-4.45
465,-4.23
466,-4.14
467,-4.23
468,-4.45
469,-4.66
470,-4.74
471,-4.63
472,-4.41
473,-4.21
474,-4.14
475,-4.19
476,-4.25
477,-4.19
478,-4.00
479,-3.78
480,-3.69
481,-3.81
482,-4.05
483,-4.23
484,-4.20
485,-3.96
486,-3.67
487,-3.47
488,-3.45
489,-3.59
490,-3.78
491,-3.94
492,-4.06
493,-4.13
494,-4.18
495,-4.21
496,-4.25
497,-4.32
498,-4.44
499,-4.59
500,-4.75
501,-4.86
502,-4.87
503,-4.76
504,-4.56
505,-4.33
506,-4.16
507,-4.10
508,-4.17
509,-4.34
510,-4.50
511,-4.59
512,-4.59
513,-4.57
514,-4.62
515,-4.73
516,-4.84
517,-4.84
518,-4.74
519,-4.59
520,-4.49
521,-4.49
522,-4.56
523,-4.61
524,-4.57
525,-4.47
526,-4.37
527,-4.34
528,-4.38
529,-4.43
530,-4.46
531,-4.47
532,-4.53
533,-4.69
534,-4.93
535,-5.18
536,-5.33
537,-5.31
538,-5.11
539,-4.80
540,-4.48
541,-4.26
542,-4.23
543,-4.38
544,-4.62
545,-4.84
546,-4.93
547,-4.88
548,-4.77
549,-4.74
550,-4.88
551,-5.14
552,-5.40
553,-5.55
554,-5.53
555,-5.41
556,-5.33
557,-5.40
558,-5.60
559,-5.82
560,-5.93
561,-5.89
562,-5.75
563,-5.62
564,-5.60
565,-5.70
566,-5.87
567,-6.01
568,-6.10
569,-6.13
570,-6.18
571,-6.26
572,-6.36
573,-6.41
574,-6.38
575,-6.30
576,-6.24
577,-6.27
578,-6.40
579,-6.57
580,-6.69
581,-6.73
582,-6.68
583,-6.59
584,-6.49
585,-6.39
586,-6.31
587,-6.26
588,-6.31
589,-6.51
590,-6.83
591,-7.16
592,-7.39
593,-7.43
594,-7.35
595,-7.25
596,-7.27
597,-7.40
598,-7.58
599,-7.68
600,-7.67
601,-7.59
602,-7.57
603,-7.69
604,-7.92
605,-8.14
606,-8.18
607,-8.00
608,-7.68
609,-7.41
610,-7.37
611,-7.61
612,-8.00
613,-8.36
614,-8.50
615,-8.40
616,-8.18
617,-8.02
618,-8.06
619,-8.25
620,-8.46
621,-8.56
622,-8.49
623,-8.34
624,-8.26
625,-8.33
626,-8.54
627,-8.75
628,-8.83
629,-8.73
630,-8.56
631,-8.45
632,-8.51
633,-8.70
634,-8.92
635,-9.04
636,-9.07
637,-9.07
638,-9.17
639,-9.41
640,-9.74
641,-10.05
642,-10.24
643,-10.27
644,-10.24
645,-10.24
646,-10.37
647,-10.59
648,-10.78
649,-10.82
650,-10.69
651,-10.46
652,-10.26
653,-10.19
654,-10.22
655,-10.28
656,-10.28
657,-10.26
658,-10.30
659,-10.47
660,-10.73
661,-10.98
662,-11.08
663,-11.03
664,-10.90
665,-10.84
666,-10.92
667,-11.09
668,-11.21
669,-11.19
670,-11.05
671,-10.82
672,-10.56
673,-10.30
674,-10.04
675,-9.85
676,-9.78
677,-9.85
678,-10.00
679,-10.17
680,-10.29
681,-10.36
682,-10.44
683,-10.58
684,-10.77
685,-10.95
686,-11.00
687,-10.85
688,-10.55
689,-10.19
690,-9.90
691,-9.77
692,-9.78
693,-9.90
694,-10.02
695,-10.08
696,-10.04
697,-9.93
698,-9.82
699,-9.77
700,-9.78
701,-9.82
702,-9.85
703,-9.87
704,-9.87
705,-9.85
706,-9.78
707,-9.63
708,-9.43
709,-9.28
710,-9.27
711,-9.41
712,-9.62
713,-9.74
714,-9.70
715,-9.57
716,-9.50
717,-9.63
718,-9.92
719,-10.18
720,-10.20
721,-9.95
722,-9.59
723,-9.39
724,-9.47
725,-9.77
726,-10.08
727,-10.19
728,-10.07
729,-9.82
730,-9.59
731,-9.45
732,-9.38
733,-9.31
734,-9.28
735,-9.37
736,-9.68
737,-10.17
738,-10.66
739,-10.92
740,-10.81
741,-10.39
742,-9.93
743,-9.71
744,-9.86
745,-10.25
746,-10.61
747,-10.71
748,-10.48
749,-10.09
750,-9.73
751,-9.58
752,-9.61
753,-9.73
754,-9.81
755,-9.82
756,-9.77
757,-9.71
758,-9.63
759,-9.48
760,-9.23
761,-8.94
762,-8.69
763,-8.56
764,-8.56
765,-8.61
766,-8.61
767,-8.53
768,-8.41
769,-8.32
770,-8.33
771,-8.44
772,-8.61
773,-8.76
774,-8.82
775,-8.76
776,-8.63
777,-8.50
778,-8.45
779,-8.49
780,-8.59
781,-8.68
782,-8.72
783,-8.73
784,-8.76
785,-8.87
786,-9.06
787,-9.28
788,-9.45
789,-9.50
790,-9.44
791,-9.28
792,-9.12
793,-9.01
794,-8.97
795,-8.99
796,-9.01
797,-9.00
798,-8.98
799,-9.00
800,-9.11
801,-9.33
802,-9.57
803,-9.72
804,-9.64
805,-9.32
806,-8.86
807,-8.43
808,-8.20
809,-8.25
810,-8.51
811,-8.86
812,-9.13
813,-9.24
814,-9.17
815,-8.97
816,-8.74
817,-8.58
818,-8.50
819,-8.50
820,-8.51
821,-8.48
822,-8.36
823,-8.16
824,-7.90
825,-7.66
826,-7.52
827,-7.54
828,-7.69
829,-7.89
830,-8.00
831,-7.92
832,-7.66
833,-7.36
834,-7.19
835,-7.23
836,-7.41
837,-7.58
838,-7.59
839,-7.42
840,-7.17
841,-6.98
842,-6.95
843,-7.06
844,-7.25
845,-7.43
846,-7.52
847,-7.49
848,-7.32
849,-7.03
850,-6.73
851,-6.58
852,-6.67
853,-6.98
854,-7.33
855,-7.54
856,-7.49
857,-7.24
858,-6.99
859,-6.93
860,-7.09
861,-7.34
862,-7.49
863,-7.43
864,-7.22
865,-7.03
866,-7.01
867,-7.20
868,-7.48
869,-7.66
870,-7.64
871,-7.45
872,-7.22
873,-7.09
874,-7.11
875,-7.23
876,-7.33
877,-7.34
878,-7.24
879,-7.09
880,-6.94
881,-6.80
882,-6.64
883,-6.40
884,-6.09
885,-5.78
886,-5.55
887,-5.47
888,-5.52
889,-5.65
890,-5.78
891,-5.87
892,-5.88
893,-5.82
894,-5.68
895,-5.49
896,-5.26
897,-5.03
898,-4.85
899,-4.76
900,-4.77
901,-4.89
902,-5.07
903,-5.25
904,-5.35
905,-5.36
906,-5.29
907,-5.21
908,-5.14
909,-5.05
910,-4.91
911,-4.72
912,-4.54
913,-4.45
914,-4.52
915,-4.74
916,-5.04
917,-5.29
918,-5.38
919,-5.28
920,-5.08
921,-4.89
922,-4.85
923,-5.00
924,-5.30
925,-5.62
926,-5.85
927,-5.94
928,-5.95
929,-5.94
930,-6.01
931,-6.16
932,-6.38
933,-6.63
934,-6.89
935,-7.16
936,-7.41
937,-7.55
938,-7.51
939,-7.25
940,-6.84
941,-6.43
942,-6.16
943,-6.05
944,-6.06
945,-6.05
946,-5.99
947,-5.91
948,-5.89
949,-5.98
950,-6.17
951,-6.38
952,-6.54
953,-6.66
954,-6.74
955,-6.79
956,-6.80
957,-6.73
958,-6.55
959,-6.30
960,-6.06
961,-5.92
962,-5.90
963,-5.98
964,-6.10
965,-6.19
966,-6.21
967,-6.18
968,-6.10
969,-6.01
970,-5.91
971,-5.86
972,-5.92
973,-6.11
974,-6.40
975,-6.63
976,-6.67
977,-6.50
978,-6.26
979,-6.16
980,-6.36
981,-6.80
982,-7.30
983,-7.60
984,-7.56
985,-7.21
986,-6.74
987,-6.36
988,-6.20
989,-6.27
990,-6.47
991,-6.70
992,-6.85
993,-6.91
994,-6.91
995,-6.88
996,-6.87
997,-6.88
998,-6.86
999,-6.78
1000,-6.62
1001,-6.45
1002,-6.36
1003,-6.38
1004,-6.51
1005,-6.69
1006,-6.81
1007,-6.81
1008,-6.66
1009,-6.38
1010,-6.04
1011,-5.75
1012,-5.59
1013,-5.55
1014,-5.57
1015,-5.57
1016,-5.51
1017,-5.44
1018,-5.45
1019,-5.63
1020,-5.94
1021,-6.24
1022,-6.35
1023,-6.19
1024,-5.78
1025,-5.30
1026,-4.93
1027,-4.79
1028,-4.87
1029,-5.06
1030,-5.21
1031,-5.24
1032,-5.18
1033,-5.11
1034,-5.14
1035,-5.29
1036,-5.51
1037,-5.69
1038,-5.79
1039,-5.79
1040,-5.81
1041,-5.91
1042,-6.15
1043,-6.48
1044,-6.83
1045,-7.15
1046,-7.43
1047,-7.65
1048,-7.79
1049,-7.82
1050,-7.78
1051,-7.70
1052,-7.67
1053,-7.69
1054,-7.73
1055,-7.70
1056,-7.58
1057,-7.37
1058,-7.22
1059,-7.25
1060,-7.53
1061,-7.97
1062,-8.36
1063,-8.52
1064,-8.36
1065,-7.98
1066,-7.62
1067,-7.44
1068,-7.47
1069,-7.59
1070,-7.66
1071,-7.60
1072,-7.53
1073,-7.59
1074,-7.84
1075,-8.17
1076,-8.40
1077,-8.39
1078,-8.20
1079,-8.02
1080,-8.03
1081,-8.21
1082,-8.44
1083,-8.52
1084,-8.42
1085,-8.25
1086,-8.15
1087,-8.18
1088,-8.27
1089,-8.30
1090,-8.27
1091,-8.25
1092,-8.34
1093,-8.56
1094,-8.82
1095,-9.03
1096,-9.17
1097,-9.32
1098,-9.58
1099,-9.92
1100,-10.19
1101,-10.25
1102,-10.06
1103,-9.74
1104,-9.42
1105,-9.21
1106,-9.09
1107,-9.04
1108,-9.06
1109,-9.18
1110,-9.41
1111,-9.64
1112,-9.70
1113,-9.50
1114,-9.08
1115,-8.67
1116,-8.46
1117,-8.53
1118,-8.75
1119,-8.93
1120,-8.95
1121,-8.85
1122,-8.79
1123,-8.86
1124,-9.08
1125,-9.36
1126,-9.62
1127,-9.83
1128,-10.03
1129,-10.22
1130,-10.36
1131,-10.40
1132,-10.38
1133,-10.37
1134,-10.51
1135,-10.83
1136,-11.27
1137,-11.61
1138,-11.73
1139,-11.61
1140,-11.42
1141,-11.32
1142,-11.39
1143,-11.49
1144,-11.44
1145,-11.15
1146,-10.72
1147,-10.35
1148,-10.24
1149,-10.42
1150,-10.75
1151,-11.04
1152,-11.18
1153,-11.19
1154,-11.17
1155,-11.16
1156,-11.17
1157,-11.14
1158,-11.10
1159,-11.10
1160,-11.16
1161,-11.28
1162,-11.38
1163,-11.40
1164,-11.36
1165,-11.34
1166,-11.41
1167,-11.59
1168,-11.82
1169,-12.02
1170,-12.15
1171,-12.20
1172,-12.20
1173,-12.15
1174,-12.01
1175,-11.77
1176,-11.44
1177,-11.10
1178,-10.80
1179,-10.59
1180,-10.47
1181,-10.44
1182,-10.46
1183,-10.52
1184,-10.60
1185,-10.69
1186,-10.74
1187,-10.75
1188,-10.71
1189,-10.69
1190,-10.64
1191,-10.59
1192,-10.57
1193,-10.97
1194,-11.08
1195,-10.43
1196,-9.67
1197,-10.83
1198,-12.87
1199,-11.26
1200,-5.28
