1,74.93
2,100.00
3,100.00
4,99.14
5,95.38
6,99.55
7,100.00
8,100.00
9,100.00
10,96.97
11,80.25
12,48.68
13,13.63
14,-4.32
15,7.39
16,42.42
17,79.73
18,100.00
19,100.00
20,98.99
21,98.76
22,100.00
23,100.00
24,98.59
25,99.56
26,100.00
27,96.46
28,68.99
29,23.12
30,-24.58
31,-57.53
32,-72.64
33,-75.13
34,-71.98
35,-65.17
36,-55.80
37,-43.91
38,-32.49
39,-24.69
40,-23.86
41,-28.15
42,-34.05
43,-37.50
44,-37.64
45,-35.22
46,-31.17
47,-27.00
48,-23.82
49,-22.72
50,-23.23
51,-24.57
52,-25.73
53,-26.27
54,-26.00
55,-25.10
56,-23.82
57,-22.62
58,-21.64
59,-21.06
60,-20.69
61,-20.45
62,-20.18
63,-19.87
64,-19.49
65,-19.06
66,-18.55
67,-18.04
68,-17.55
69,-17.18
70,-16.89
71,-16.70
72,-16.56
73,-16.53
74,-16.52
75,-16.56
76,-16.56
77,-16.51
78,-16.36
79,-16.11
80,-15.75
81,-15.33
82,-14.84
83,-14.37
84,-13.92
85,-13.55
86,-13.24
87,-13.01
88,-12.80
89,-12.60
90,-12.36
91,-12.08
92,-11.72
93,-11.37
94,-11.00
95,-10.71
96,-10.50
97,-10.40
98,-10.36
99,-10.36
100,-10.36
101,-10.34
102,-10.26
103,-10.14
104,-9.96
105,-9.77
106,-9.60
107,-9.47
108,-9.37
109,-9.30
110,-9.24
111,-9.18
112,-9.08
113,-8.94
114,-8.77
115,-8.60
116,-8.44
117,-8.32
118,-8.24
119,-8.23
120,-8.25
121,-8.28
122,-8.29
123,-8.25
124,-8.13
125,-7.93
126,-7.68
127,-7.40
128,-7.12
129,-6.89
130,-6.74
131,-6.68
132,-6.69
133,-6.76
134,-6.83
135,-6.87
136,-6.84
137,-6.75
138,-6.59
139,-6.38
140,-6.13
141,-5.89
142,-5.67
143,-5.46
144,-5.25
145,-5.02
146,-4.77
147,-4.50
148,-4.21
149,-3.94
150,-3.70
151,-3.54
152,-3.45
153,-3.43
154,-3.45
155,-3.49
156,-3.52
157,-3.52
158,-3.46
159,-3.37
160,-3.26
161,-3.15
162,-3.04
163,-2.96
164,-2.90
165,-2.85
166,-2.78
167,-2.72
168,-2.62
169,-2.51
170,-2.37
171,-2.23
172,-2.09
173,-1.96
174,-1.83
175,-1.71
176,-1.57
177,-1.45
178,-1.32
179,-1.17
180,-0.99
181,-0.79
182,-0.55
183,-0.29
184,0.00
185,0.27
186,0.53
187,0.74
188,0.86
189,0.89
190,0.85
191,0.77
192,0.67
193,0.56
194,0.49
195,0.45
196,0.46
197,0.49
198,0.52
199,0.52
200,0.52
201,0.51
202,0.49
203,0.49
204,0.53
205,0.61
206,0.72
207,0.85
208,0.99
209,1.15
210,1.31
211,1.46
212,1.61
213,1.75
214,1.88
215,2.00
216,2.11
217,2.18
218,2.21
219,2.21
220,2.19
221,2.14
222,2.09
223,2.03
224,1.97
225,1.93
226,1.91
227,1.89
228,1.89
229,1.90
230,1.96
231,2.03
232,2.14
233,2.27
234,2.41
235,2.57
236,2.72
237,2.87
238,3.03
239,3.20
240,3.38
241,3.54
242,3.68
243,3.79
244,3.85
245,3.86
246,3.80
247,3.70
248,3.56
249,3.39
250,3.23
251,3.09
252,2.99
253,2.97
254,2.99
255,3.04
256,3.10
257,3.15
258,3.16
259,3.13
260,3.04
261,2.91
262,2.76
263,2.63
264,2.53
265,2.47
266,2.45
267,2.45
268,2.45
269,2.42
270,2.36
271,2.28
272,2.17
273,2.07
274,1.98
275,1.92
276,1.87
277,1.83
278,1.77
279,1.68
280,1.58
281,1.49
282,1.40
283,1.35
284,1.31
285,1.29
286,1.25
287,1.18
288,1.06
289,0.89
290,0.67
291,0.42
292,0.18
293,0.00
294,-0.11
295,-0.15
296,-0.13
297,-0.07
298,-0.01
299,0.03
300,0.04
301,0.05
302,0.05
303,0.06
304,0.10
305,0.17
306,0.27
307,0.40
308,0.52
309,0.63
310,0.73
311,0.79
312,0.82
313,0.81
314,0.74
315,0.63
316,0.42
317,0.15
318,-0.20
319,-0.57
320,-0.94
321,-1.26
322,-1.52
323,-1.68
324,-1.76
325,-1.76
326,-1.74
327,-1.72
328,-1.75
329,-1.82
330,-1.96
331,-2.11
332,-2.29
333,-2.46
334,-2.61
335,-2.74
336,-2.86
337,-2.97
338,-3.07
339,-3.16
340,-3.21
341,-3.20
342,-3.12
343,-2.96
344,-2.73
345,-2.46
346,-2.16
347,-1.88
348,-1.62
349,-1.43
350,-1.25
351,-1.11
352,-0.95
353,-0.78
354,-0.58
355,-0.36
356,-0.10
357,0.16
358,0.44
359,0.70
360,0.96
361,1.20
362,1.44
363,1.68
364,1.93
365,2.18
366,2.43
367,2.63
368,2.82
369,2.94
370,3.05
371,3.12
372,3.19
373,3.25
374,3.35
375,3.47
376,3.65
377,3.85
378,4.09
379,4.31
380,4.51
381,4.68
382,4.82
383,4.93
384,5.04
385,5.14
386,5.27
387,5.41
388,5.55
389,5.68
390,5.76
391,5.77
392,5.71
393,5.59
394,5.45
395,5.33
396,5.27
397,5.27
398,5.34
399,5.46
400,5.59
401,5.69
402,5.76
403,5.76
404,5.75
405,5.73
406,5.73
407,5.77
408,5.85
409,5.96
410,6.09
411,6.21
412,6.31
413,6.38
414,6.44
415,6.50
416,6.58
417,6.67
418,6.78
419,6.89
420,6.98
421,7.04
422,7.06
423,7.05
424,7.03
425,7.01
426,7.01
427,7.03
428,7.03
429,7.01
430,6.95
431,6.86
432,6.74
433,6.63
434,6.50
435,6.40
436,6.31
437,6.24
438,6.16
439,6.06
440,5.92
441,5.74
442,5.52
443,5.28
444,5.03
445,4.79
446,4.53
447,4.29
448,4.02
449,3.74
450,3.41
451,3.06
452,2.68
453,2.31
454,1.93
455,1.57
456,1.21
457,0.89
458,0.58
459,0.33
460,0.10
461,-0.06
462,-0.20
463,-0.30
464,-0.39
465,-0.48
466,-0.59
467,-0.73
468,-0.89
469,-1.06
470,-1.21
471,-1.32
472,-1.37
473,-1.35
474,-1.26
475,-1.11
476,-0.91
477,-0.67
478,-0.39
479,-0.10
480,0.24
481,0.60
482,1.02
483,1.45
484,1.91
485,2.34
486,2.75
487,3.08
488,3.39
489,3.62
490,3.85
491,4.07
492,4.34
493,4.63
494,4.99
495,5.36
496,5.77
497,6.14
498,6.46
499,6.67
500,6.79
501,6.80
502,6.74
503,6.60
504,6.44
505,6.26
506,6.11
507,6.01
508,5.97
509,6.00
510,6.11
511,6.28
512,6.51
513,6.77
514,7.06
515,7.35
516,7.60
517,7.79
518,7.91
519,7.95
520,7.92
521,7.84
522,7.73
523,7.61
524,7.52
525,7.47
526,7.49
527,7.56
528,7.71
529,7.89
530,8.10
531,8.31
532,8.51
533,8.68
534,8.80
535,8.89
536,8.95
537,8.99
538,9.05
539,9.13
540,9.26
541,9.40
542,9.58
543,9.77
544,9.96
545,10.12
546,10.25
547,10.34
548,10.42
549,10.49
550,10.55
551,10.63
552,10.72
553,10.83
554,10.93
555,10.99
556,11.00
557,10.95
558,10.82
559,10.64
560,10.42
561,10.19
562,10.01
563,9.89
564,9.85
565,9.88
566,9.98
567,10.12
568,10.28
569,10.45
570,10.60
571,10.74
572,10.88
573,11.01
574,11.15
575,11.30
576,11.47
577,11.65
578,11.85
579,12.02
580,12.17
581,12.25
582,12.27
583,12.22
584,12.12
585,11.97
586,11.80
587,11.64
588,11.52
589,11.46
590,11.49
591,11.60
592,11.77
593,11.95
594,12.11
595,12.19
596,12.18
597,12.06
598,11.86
599,11.61
600,11.39
601,11.24
602,11.22
603,11.36
604,11.66
605,12.07
606,12.55
607,13.03
608,13.49
609,13.84
610,14.11
611,14.30
612,14.45
613,14.60
614,14.79
615,15.01
616,15.25
617,15.46
618,15.59
619,15.61
620,15.50
621,15.26
622,14.95
623,14.62
624,14.31
625,14.08
626,13.90
627,13.78
628,13.65
629,13.49
630,13.22
631,12.87
632,12.40
633,11.88
634,11.32
635,10.81
636,10.34
637,9.94
638,9.55
639,9.19
640,8.77
641,8.36
642,7.88
643,7.41
644,6.94
645,6.55
646,6.20
647,5.94
648,5.68
649,5.44
650,5.16
651,4.86
652,4.48
653,4.09
654,3.64
655,3.22
656,2.78
657,2.38
658,1.96
659,1.57
660,1.17
661,0.78
662,0.40
663,0.06
664,-0.25
665,-0.50
666,-0.72
667,-0.89
668,-1.00
669,-1.06
670,-1.07
671,-1.03
672,-0.91
673,-0.72
674,-0.45
675,-0.12
676,0.25
677,0.63
678,1.01
679,1.36
680,1.69
681,1.98
682,2.25
683,2.47
684,2.69
685,2.87
686,3.04
687,3.17
688,3.32
689,3.45
690,3.62
691,3.80
692,4.04
693,4.30
694,4.62
695,4.97
696,5.34
697,5.69
698,6.03
699,6.31
700,6.57
701,6.78
702,6.97
703,7.14
704,7.33
705,7.53
706,7.75
707,7.97
708,8.20
709,8.43
710,8.64
711,8.80
712,8.93
713,8.99
714,9.03
715,9.03
716,9.04
717,9.04
718,9.07
719,9.12
720,9.20
721,9.31
722,9.46
723,9.60
724,9.73
725,9.82
726,9.89
727,9.93
728,9.95
729,9.96
730,9.97
731,10.01
732,10.08
733,10.18
734,10.32
735,10.46
736,10.59
737,10.70
738,10.81
739,10.89
740,10.96
741,11.01
742,11.07
743,11.13
744,11.21
745,11.29
746,11.37
747,11.46
748,11.55
749,11.65
750,11.77
751,11.90
752,12.07
753,12.24
754,12.43
755,12.61
756,12.76
757,12.85
758,12.89
759,12.87
760,12.83
761,12.79
762,12.80
763,12.87
764,13.02
765,13.26
766,13.57
767,13.93
768,14.31
769,14.66
770,14.96
771,15.21
772,15.39
773,15.51
774,15.56
775,15.55
776,15.47
777,15.34
778,15.14
779,14.89
780,14.58
781,14.26
782,13.93
783,13.64
784,13.37
785,13.15
786,12.93
787,12.73
788,12.48
789,12.23
790,11.90
791,11.55
792,11.15
793,10.77
794,10.39
795,10.06
796,9.73
797,9.45
798,9.16
799,8.90
800,8.63
801,8.40
802,8.17
803,7.97
804,7.75
805,7.53
806,7.28
807,7.03
808,6.74
809,6.47
810,6.21
811,6.01
812,5.86
813,5.76
814,5.69
815,5.63
816,5.53
817,5.40
818,5.21
819,5.00
820,4.78
821,4.61
822,4.50
823,4.46
824,4.49
825,4.57
826,4.66
827,4.75
828,4.81
829,4.83
830,4.81
831,4.77
832,4.72
833,4.67
834,4.60
835,4.52
836,4.40
837,4.26
838,4.06
839,3.83
840,3.56
841,3.28
842,2.99
843,2.73
844,2.46
845,2.23
846,1.97
847,1.72
848,1.43
849,1.14
850,0.82
851,0.53
852,0.23
853,-0.04
854,-0.31
855,-0.52
856,-0.71
857,-0.86
858,-0.99
859,-1.09
860,-1.17
861,-1.22
862,-1.26
863,-1.28
864,-1.31
865,-1.36
866,-1.45
867,-1.56
868,-1.69
869,-1.81
870,-1.92
871,-2.01
872,-2.08
873,-2.11
874,-2.12
875,-2.12
876,-2.14
877,-2.19
878,-2.29
879,-2.41
880,-2.54
881,-2.66
882,-2.76
883,-2.80
884,-2.76
885,-2.65
886,-2.46
887,-2.23
888,-1.97
889,-1.73
890,-1.54
891,-1.42
892,-1.40
893,-1.46
894,-1.58
895,-1.73
896,-1.89
897,-2.03
898,-2.13
899,-2.21
900,-2.25
901,-2.25
902,-2.24
903,-2.22
904,-2.21
905,-2.19
906,-2.17
907,-2.14
908,-2.14
909,-2.16
910,-2.21
911,-2.29
912,-2.39
913,-2.51
914,-2.66
915,-2.81
916,-2.95
917,-3.08
918,-3.21
919,-3.32
920,-3.41
921,-3.45
922,-3.42
923,-3.34
924,-3.18
925,-2.98
926,-2.72
927,-2.45
928,-2.21
929,-2.03
930,-1.89
931,-1.79
932,-1.67
933,-1.54
934,-1.31
935,-1.01
936,-0.60
937,-0.15
938,0.35
939,0.84
940,1.30
941,1.68
942,2.01
943,2.27
944,2.51
945,2.72
946,2.92
947,3.12
948,3.34
949,3.53
950,3.70
951,3.82
952,3.92
953,3.97
954,4.01
955,4.05
956,4.11
957,4.19
958,4.29
959,4.39
960,4.50
961,4.58
962,4.64
963,4.69
964,4.72
965,4.75
966,4.75
967,4.73
968,4.70
969,4.66
970,4.61
971,4.57
972,4.53
973,4.51
974,4.51
975,4.55
976,4.63
977,4.75
978,4.90
979,5.05
980,5.21
981,5.36
982,5.51
983,5.64
984,5.76
985,5.86
986,5.98
987,6.11
988,6.25
989,6.38
990,6.51
991,6.61
992,6.70
993,6.74
994,6.77
995,6.77
996,6.76
997,6.77
998,6.83
999,6.92
1000,7.05
1001,7.20
1002,7.36
1003,7.53
1004,7.70
1005,7.85
1006,7.99
1007,8.13
1008,8.29
1009,8.47
1010,8.69
1011,8.91
1012,9.15
1013,9.37
1014,9.56
1015,9.70
1016,9.81
1017,9.86
1018,9.88
1019,9.85
1020,9.80
1021,9.73
1022,9.64
1023,9.53
1024,9.42
1025,9.32
1026,9.25
1027,9.24
1028,9.29
1029,9.41
1030,9.58
1031,9.79
1032,10.03
1033,10.24
1034,10.40
1035,10.48
1036,10.49
1037,10.45
1038,10.37
1039,10.28
1040,10.21
1041,10.18
1042,10.20
1043,10.26
1044,10.35
1045,10.45
1046,10.53
1047,10.58
1048,10.59
1049,10.56
1050,10.51
1051,10.47
1052,10.42
1053,10.38
1054,10.34
1055,10.30
1056,10.24
1057,10.16
1058,10.03
1059,9.85
1060,9.62
1061,9.36
1062,9.05
1063,8.71
1064,8.34
1065,7.97
1066,7.61
1067,7.29
1068,7.03
1069,6.85
1070,6.75
1071,6.73
1072,6.79
1073,6.91
1074,7.06
1075,7.25
1076,7.47
1077,7.72
1078,7.99
1079,8.25
1080,8.51
1081,8.73
1082,8.92
1083,9.05
1084,9.14
1085,9.20
1086,9.28
1087,9.36
1088,9.48
1089,9.62
1090,9.79
1091,9.95
1092,10.09
1093,10.19
1094,10.26
1095,10.29
1096,10.32
1097,10.34
1098,10.39
1099,10.45
1100,10.53
1101,10.60
1102,10.69
1103,10.78
1104,10.89
1105,11.02
1106,11.17
1107,11.35
1108,11.52
1109,11.68
1110,11.79
1111,11.84
1112,11.83
1113,11.76
1114,11.65
1115,11.54
1116,11.46
1117,11.43
1118,11.46
1119,11.51
1120,11.57
1121,11.60
1122,11.57
1123,11.47
1124,11.30
1125,11.11
1126,10.92
1127,10.75
1128,10.64
1129,10.60
1130,10.64
1131,10.73
1132,10.85
1133,10.96
1134,11.04
1135,11.07
1136,11.09
1137,11.09
1138,11.08
1139,11.06
1140,11.03
1141,11.00
1142,10.96
1143,10.91
1144,10.82
1145,10.72
1146,10.62
1147,10.54
1148,10.48
1149,10.46
1150,10.49
1151,10.57
1152,10.70
1153,10.86
1154,11.01
1155,11.15
1156,11.24
1157,11.28
1158,11.24
1159,11.15
1160,11.02
1161,10.87
1162,10.75
1163,10.65
1164,10.61
1165,10.63
1166,10.68
1167,10.75
1168,10.80
1169,10.82
1170,10.77
1171,10.69
1172,10.57
1173,10.42
1174,10.23
1175,10.01
1176,9.75
1177,9.46
1178,9.09
1179,8.68
1180,8.20
1181,7.74
1182,7.30
1183,6.93
1184,6.63
1185,6.42
1186,6.26
1187,6.15
1188,6.04
1189,5.92
1190,5.77
1191,5.61
1192,5.46
1193,5.36
1194,5.33
1195,5.40
1196,5.54
1197,5.72
1198,5.90
1199,6.05
1200,6.12
1201,6.10
1202,6.00
1203,5.86
1204,5.71
1205,5.59
1206,5.58
1207,5.65
1208,5.82
1209,6.04
1210,6.32
1211,6.60
1212,6.88
1213,7.12
1214,7.35
1215,7.56
1216,7.80
1217,8.06
1218,8.37
1219,8.70
1220,9.09
1221,9.49
1222,9.90
1223,10.26
1224,10.64
1225,10.97
1226,11.32
1227,11.63
1228,11.96
1229,12.27
1230,12.59
1231,12.88
1232,13.17
1233,13.42
1234,13.68
1235,13.94
1236,14.25
1237,14.58
1238,14.99
1239,15.42
1240,15.91
1241,16.38
1242,16.84
1243,17.25
1244,17.61
1245,17.89
1246,18.10
1247,18.23
1248,18.35
1249,18.45
1250,18.57
1251,18.69
1252,18.85
1253,19.03
1254,19.23
1255,19.42
1256,19.57
1257,19.68
1258,19.74
1259,19.76
1260,19.72
1261,19.64
1262,19.55
1263,19.46
1264,19.39
1265,19.34
1266,19.29
1267,19.23
1268,19.12
1269,18.96
1270,18.71
1271,18.42
1272,18.07
1273,17.70
1274,17.31
1275,16.93
1276,16.53
1277,16.14
1278,15.71
1279,15.27
1280,14.78
1281,14.27
1282,13.74
1283,13.26
1284,12.81
1285,12.47
1286,12.19
1287,12.01
1288,11.83
1289,11.69
1290,11.51
1291,11.30
1292,11.00
1293,10.65
1294,10.25
1295,9.85
1296,9.49
1297,9.19
1298,8.97
1299,8.85
1300,8.80
1301,8.83
1302,8.88
1303,8.93
1304,8.95
1305,8.95
1306,8.95
1307,8.95
1308,8.96
1309,9.01
1310,9.11
1311,9.24
1312,9.39
1313,9.51
1314,9.58
1315,9.60
1316,9.58
1317,9.54
1318,9.50
1319,9.47
1320,9.47
1321,9.49
1322,9.53
1323,9.56
1324,9.58
1325,9.56
1326,9.51
1327,9.45
1328,9.39
1329,9.35
1330,9.35
1331,9.38
1332,9.45
1333,9.55
1334,9.64
1335,9.71
1336,9.73
1337,9.70
1338,9.64
1339,9.57
1340,9.52
1341,9.55
1342,9.66
1343,9.88
1344,10.16
1345,10.46
1346,10.72
1347,10.89
1348,10.90
1349,10.75
1350,10.43
1351,9.98
1352,9.46
1353,8.94
1354,8.45
1355,8.06
1356,7.75
1357,7.52
1358,7.34
1359,7.17
1360,7.00
1361,6.82
1362,6.63
1363,6.45
1364,6.28
1365,6.18
1366,6.13
1367,6.16
1368,6.23
1369,6.32
1370,6.40
1371,6.44
1372,6.45
1373,6.41
1374,6.35
1375,6.30
1376,6.28
1377,6.30
1378,6.38
1379,6.50
1380,6.68
1381,6.90
1382,7.15
1383,7.40
1384,7.68
1385,7.95
1386,8.22
1387,8.47
1388,8.70
1389,8.90
1390,9.06
1391,9.16
1392,9.22
1393,9.25
1394,9.28
1395,9.29
1396,9.30
1397,9.32
1398,9.38
1399,9.48
1400,9.63
1401,9.82
1402,10.04
1403,10.26
1404,10.47
1405,10.63
1406,10.70
1407,10.68
1408,10.55
1409,10.33
1410,10.06
1411,9.79
1412,9.58
1413,9.44
1414,9.36
1415,9.33
1416,9.32
1417,9.29
1418,9.21
1419,9.07
1420,8.88
1421,8.69
1422,8.54
1423,8.46
1424,8.46
1425,8.54
1426,8.69
1427,8.86
1428,9.04
1429,9.20
1430,9.34
1431,9.46
1432,9.59
1433,9.70
1434,9.85
1435,9.99
1436,10.15
1437,10.31
1438,10.49
1439,10.67
1440,10.88
1441,11.10
1442,11.36
1443,11.64
1444,11.95
1445,12.26
1446,12.58
1447,12.87
1448,13.15
1449,13.37
1450,13.57
1451,13.72
1452,13.88
1453,14.03
1454,14.24
1455,14.48
1456,14.80
1457,15.19
1458,15.66
1459,16.14
1460,16.63
1461,17.06
1462,17.42
1463,17.65
1464,17.77
1465,17.79
1466,17.74
1467,17.65
1468,17.58
1469,17.55
1470,17.58
1471,17.65
1472,17.77
1473,17.88
1474,17.97
1475,18.02
1476,18.02
1477,17.98
1478,17.90
1479,17.83
1480,17.76
1481,17.74
1482,17.75
1483,17.79
1484,17.84
1485,17.87
1486,17.85
1487,17.77
1488,17.58
1489,17.31
1490,16.96
1491,16.58
1492,16.17
1493,15.80
1494,15.45
1495,15.16
1496,14.88
1497,14.63
1498,14.36
1499,14.07
1500,13.73
1501,13.37
1502,13.01
1503,12.72
1504,12.49
1505,12.37
1506,12.32
1507,12.34
1508,12.37
1509,12.41
1510,12.40
1511,12.34
1512,12.25
1513,12.16
1514,12.06
1515,12.01
1516,11.99
1517,12.00
1518,12.01
1519,11.98
1520,11.89
1521,11.76
1522,11.58
1523,11.40
1524,11.25
1525,11.14
1526,11.07
1527,11.05
1528,11.04
1529,11.01
1530,10.96
1531,10.87
1532,10.76
1533,10.63
1534,10.49
1535,10.36
1536,10.24
1537,10.15
1538,10.07
1539,10.01
1540,9.94
1541,9.90
1542,9.88
1543,9.87
1544,9.87
1545,9.86
1546,9.83
1547,9.77
1548,9.66
1549,9.49
1550,9.27
1551,9.05
1552,8.82
1553,8.63
1554,8.48
1555,8.37
1556,8.30
1557,8.25
1558,8.20
1559,8.15
1560,8.10
1561,8.04
1562,8.02
1563,8.03
1564,8.11
1565,8.26
1566,8.47
1567,8.72
1568,8.98
1569,9.22
1570,9.43
1571,9.59
1572,9.72
1573,9.82
1574,9.90
1575,9.97
1576,10.06
1577,10.17
1578,10.30
1579,10.44
1580,10.58
1581,10.71
1582,10.80
1583,10.84
1584,10.84
1585,10.79
1586,10.71
1587,10.62
1588,10.54
1589,10.49
1590,10.48
1591,10.52
1592,10.60
1593,10.71
1594,10.85
1595,11.00
1596,11.16
1597,11.30
1598,11.44
1599,11.56
1600,11.69
1601,11.79
1602,11.89
1603,11.97
1604,12.02
1605,12.06
1606,12.07
1607,12.04
1608,11.98
1609,11.88
1610,11.75
1611,11.60
1612,11.44
1613,11.27
1614,11.11
1615,10.97
1616,10.83
1617,10.71
1618,10.56
1619,10.41
1620,10.23
1621,10.06
1622,9.88
1623,9.73
1624,9.59
1625,9.50
1626,9.41
1627,9.33
1628,9.20
1629,9.04
1630,8.82
1631,8.57
1632,8.31
1633,8.09
1634,7.93
1635,7.85
1636,7.84
1637,7.88
1638,7.91
1639,7.90
1640,7.81
1641,7.64
1642,7.40
1643,7.14
1644,6.88
1645,6.67
1646,6.56
1647,6.56
1648,6.63
1649,6.77
1650,6.93
1651,7.09
1652,7.24
1653,7.37
1654,7.48
1655,7.57
1656,7.66
1657,7.75
1658,7.86
1659,7.95
1660,8.04
1661,8.10
1662,8.14
1663,8.15
1664,8.14
1665,8.10
1666,8.06
1667,8.01
1668,7.99
1669,7.99
1670,8.04
1671,8.11
1672,8.22
1673,8.35
1674,8.48
1675,8.60
1676,8.69
1677,8.73
1678,8.74
1679,8.73
1680,8.73
1681,8.74
1682,8.78
1683,8.84
1684,8.95
1685,9.07
1686,9.18
1687,9.25
1688,9.29
1689,9.29
1690,9.27
1691,9.24
1692,9.24
1693,9.29
1694,9.41
1695,9.60
1696,9.85
1697,10.12
1698,10.37
1699,10.55
1700,10.64
1701,10.62
1702,10.52
1703,10.39
1704,10.29
1705,10.24
1706,10.28
1707,10.43
1708,10.67
1709,10.95
1710,11.23
1711,11.47
1712,11.66
1713,11.79
1714,11.88
1715,11.94
1716,12.02
1717,12.12
1718,12.26
1719,12.41
1720,12.57
1721,12.71
1722,12.85
1723,12.96
1724,13.07
1725,13.18
1726,13.31
1727,13.46
1728,13.63
1729,13.80
1730,13.96
1731,14.10
1732,14.23
1733,14.35
1734,14.47
1735,14.58
1736,14.70
1737,14.82
1738,14.92
1739,15.00
1740,15.05
1741,15.06
1742,15.04
1743,14.98
1744,14.90
1745,14.81
1746,14.73
1747,14.68
1748,14.67
1749,14.69
1750,14.73
1751,14.79
1752,14.83
1753,14.86
1754,14.83
1755,14.76
1756,14.61
1757,14.41
1758,14.13
1759,13.80
1760,13.43
1761,13.07
1762,12.71
1763,12.41
1764,12.14
1765,11.95
1766,11.81
1767,11.74
1768,11.69
1769,11.66
1770,11.62
1771,11.57
1772,11.50
1773,11.43
1774,11.34
1775,11.27
1776,11.22
1777,11.17
1778,11.14
1779,11.10
1780,11.06
1781,11.01
1782,10.94
1783,10.85
1784,10.74
1785,10.61
1786,10.48
1787,10.36
1788,10.27
1789,10.20
1790,10.17
1791,10.18
1792,10.21
1793,10.27
1794,10.34
1795,10.42
1796,10.51
1797,10.60
1798,10.70
1799,10.77
1800,10.84
1801,10.88
1802,10.91
1803,10.92
1804,10.96
1805,11.02
1806,11.14
1807,11.33
1808,11.57
1809,11.82
1810,12.05
1811,12.21
1812,12.27
1813,12.21
1814,12.08
1815,11.89
1816,11.71
1817,11.58
1818,11.53
1819,11.55
1820,11.62
1821,11.69
1822,11.74
1823,11.73
1824,11.68
1825,11.59
1826,11.48
1827,11.38
1828,11.31
1829,11.29
1830,11.31
1831,11.36
1832,11.41
1833,11.44
1834,11.46
1835,11.45
1836,11.44
1837,11.44
1838,11.44
1839,11.45
1840,11.44
1841,11.41
1842,11.35
1843,11.27
1844,11.17
1845,11.08
1846,11.00
1847,10.94
1848,10.90
1849,10.87
1850,10.82
1851,10.75
1852,10.64
1853,10.49
1854,10.32
1855,10.13
1856,9.95
1857,9.80
1858,9.67
1859,9.59
1860,9.55
1861,9.55
1862,9.60
1863,9.69
1864,9.81
1865,9.93
1866,10.04
1867,10.11
1868,10.13
1869,10.08
1870,9.97
1871,9.83
1872,9.69
1873,9.58
1874,9.54
1875,9.56
1876,9.63
1877,9.73
1878,9.81
1879,9.84
1880,9.82
1881,9.74
1882,9.62
1883,9.50
1884,9.41
1885,9.37
1886,9.38
1887,9.43
1888,9.48
1889,9.50
1890,9.48
1891,9.41
1892,9.31
1893,9.23
1894,9.19
1895,9.23
1896,9.33
1897,9.48
1898,9.63
1899,9.75
1900,9.78
1901,9.72
1902,9.57
1903,9.35
1904,9.12
1905,8.91
1906,8.75
1907,8.65
1908,8.59
1909,8.58
1910,8.53
1911,8.44
1912,8.27
1913,8.02
1914,7.69
1915,7.34
1916,6.98
1917,6.68
1918,6.42
1919,6.25
1920,6.12
1921,6.05
1922,6.00
1923,5.97
1924,5.91
1925,5.83
1926,5.70
1927,5.57
1928,5.42
1929,5.29
1930,5.17
1931,5.08
1932,5.01
1933,4.98
1934,4.95
1935,4.91
1936,4.85
1937,4.77
1938,4.67
1939,4.55
1940,4.41
1941,4.27
1942,4.15
1943,4.06
1944,4.02
1945,4.02
1946,4.07
1947,4.17
1948,4.30
1949,4.46
1950,4.63
1951,4.80
1952,4.96
1953,5.08
1954,5.18
1955,5.25
1956,5.30
1957,5.32
1958,5.33
1959,5.32
1960,5.32
1961,5.31
1962,5.32
1963,5.34
1964,5.37
1965,5.43
1966,5.53
1967,5.68
1968,5.84
1969,6.01
1970,6.14
1971,6.23
1972,6.23
1973,6.13
1974,5.93
1975,5.65
1976,5.33
1977,4.99
1978,4.62
1979,4.27
1980,3.92
1981,3.60
1982,3.28
1983,2.98
1984,2.70
1985,2.47
1986,2.28
1987,2.17
1988,2.10
1989,2.08
1990,2.07
1991,2.06
1992,2.00
1993,1.88
1994,1.69
1995,1.46
1996,1.21
1997,1.00
1998,0.84
1999,0.76
2000,0.76
2001,0.83
2002,0.96
2003,1.10
2004,1.29
2005,1.49
2006,1.73
2007,1.99
2008,2.29
2009,2.62
2010,3.01
2011,3.41
2012,3.82
2013,4.21
2014,4.61
2015,4.99
2016,5.38
2017,5.76
2018,6.16
2019,6.55
2020,6.97
2021,7.35
2022,7.74
2023,8.07
2024,8.39
2025,8.65
2026,8.91
2027,9.14
2028,9.38
2029,9.60
2030,9.81
2031,10.00
2032,10.16
2033,10.27
2034,10.34
2035,10.38
2036,10.41
2037,10.43
2038,10.44
2039,10.44
2040,10.41
2041,10.35
2042,10.28
2043,10.21
2044,10.15
2045,10.11
2046,10.11
2047,10.13
2048,10.15
2049,10.14
2050,10.07
2051,9.95
2052,9.78
2053,9.58
2054,9.39
2055,9.27
2056,9.24
2057,9.34
2058,9.52
2059,9.77
2060,10.01
2061,10.21
2062,10.33
2063,10.35
2064,10.31
2065,10.24
2066,10.17
2067,10.15
2068,10.20
2069,10.30
2070,10.47
2071,10.66
2072,10.89
2073,11.12
2074,11.38
2075,11.65
2076,11.97
2077,12.32
2078,12.72
2079,13.13
2080,13.53
2081,13.88
2082,14.17
2083,14.38
2084,14.54
2085,14.65
2086,14.78
2087,14.92
2088,15.11
2089,15.31
2090,15.55
2091,15.76
2092,15.95
2093,16.07
2094,16.15
2095,16.18
2096,16.20
2097,16.22
2098,16.28
2099,16.37
2100,16.49
2101,16.62
2102,16.75
2103,16.84
2104,16.90
2105,16.90
2106,16.86
2107,16.80
2108,16.72
2109,16.63
2110,16.53
2111,16.43
2112,16.33
2113,16.25
2114,16.18
2115,16.15
2116,16.12
2117,16.10
2118,16.06
2119,15.97
2120,15.80
2121,15.56
2122,15.24
2123,14.88
2124,14.51
2125,14.19
2126,13.93
2127,13.77
2128,13.68
2129,13.66
2130,13.65
2131,13.64
2132,13.57
2133,13.46
2134,13.30
2135,13.10
2136,12.89
2137,12.69
2138,12.50
2139,12.33
2140,12.18
2141,12.07
2142,12.01
2143,12.01
2144,12.05
2145,12.14
2146,12.24
2147,12.36
2148,12.47
2149,12.56
2150,12.63
2151,12.70
2152,12.76
2153,12.83
2154,12.93
2155,13.06
2156,13.24
2157,13.42
2158,13.61
2159,13.78
2160,13.93
2161,14.02
2162,14.07
2163,14.07
2164,14.03
2165,13.96
2166,13.86
2167,13.73
2168,13.57
2169,13.40
2170,13.20
2171,13.00
2172,12.78
2173,12.55
2174,12.32
2175,12.11
2176,11.90
2177,11.75
2178,11.62
2179,11.53
2180,11.48
2181,11.47
2182,11.48
2183,11.51
2184,11.55
2185,11.60
2186,11.65
2187,11.72
2188,11.80
2189,11.87
2190,11.93
2191,11.95
2192,11.94
2193,11.90
2194,11.83
2195,11.76
2196,11.69
2197,11.64
2198,11.63
2199,11.67
2200,11.73
2201,11.82
2202,11.92
2203,12.03
2204,12.13
2205,12.22
2206,12.29
2207,12.36
2208,12.41
2209,12.44
2210,12.44
2211,12.42
2212,12.39
2213,12.37
2214,12.38
2215,12.42
2216,12.51
2217,12.62
2218,12.74
2219,12.86
2220,12.94
2221,12.96
2222,12.94
2223,12.89
2224,12.81
2225,12.72
2226,12.63
2227,12.56
2228,12.49
2229,12.42
2230,12.33
2231,12.22
2232,12.09
2233,11.96
2234,11.84
2235,11.75
2236,11.70
2237,11.71
2238,11.74
2239,11.78
2240,11.76
2241,11.72
2242,11.61
2243,11.48
2244,11.32
2245,11.15
2246,10.97
2247,10.81
2248,10.65
2249,10.49
2250,10.31
2251,10.10
2252,9.88
2253,9.66
2254,9.47
2255,9.34
2256,9.28
2257,9.29
2258,9.34
2259,9.41
2260,9.48
2261,9.52
2262,9.52
2263,9.48
2264,9.43
2265,9.39
2266,9.39
2267,9.44
2268,9.54
2269,9.68
2270,9.87
2271,10.05
2272,10.25
2273,10.45
2274,10.66
2275,10.87
2276,11.10
2277,11.32
2278,11.56
2279,11.78
2280,11.98
2281,12.15
2282,12.26
2283,12.29
2284,12.27
2285,12.20
2286,12.11
2287,12.00
2288,11.90
2289,11.82
2290,11.76
2291,11.73
2292,11.72
2293,11.73
2294,11.72
2295,11.70
2296,11.64
2297,11.54
2298,11.40
2299,11.22
2300,11.00
2301,10.78
2302,10.54
2303,10.35
2304,10.17
2305,10.03
2306,9.90
2307,9.79
2308,9.66
2309,9.52
2310,9.33
2311,9.11
2312,8.87
2313,8.65
2314,8.45
2315,8.31
2316,8.23
2317,8.23
2318,8.29
2319,8.41
2320,8.53
2321,8.63
2322,8.69
2323,8.70
2324,8.66
2325,8.60
2326,8.53
2327,8.47
2328,8.43
2329,8.42
2330,8.44
2331,8.46
2332,8.49
2333,8.50
2334,8.51
2335,8.53
2336,8.55
2337,8.58
2338,8.64
2339,8.69
2340,8.78
2341,8.86
2342,8.95
2343,9.04
2344,9.14
2345,9.25
2346,9.40
2347,9.57
2348,9.81
2349,10.07
2350,10.40
2351,10.76
2352,11.20
2353,11.68
2354,12.20
2355,12.71
2356,13.22
2357,13.66
2358,14.04
2359,14.32
2360,14.53
2361,14.65
2362,14.73
2363,14.78
2364,14.84
2365,14.90
2366,14.99
2367,15.08
2368,15.17
2369,15.23
2370,15.26
2371,15.27
2372,15.27
2373,15.28
2374,15.32
2375,15.38
2376,15.46
2377,15.52
2378,15.58
2379,15.59
2380,15.59
2381,15.55
2382,15.54
2383,15.57
2384,15.65
2385,15.79
2386,15.98
2387,16.18
2388,16.36
2389,16.49
2390,16.56
2391,16.55
2392,16.49
2393,16.39
2394,16.31
2395,16.25
2396,16.22
2397,16.23
2398,16.26
2399,16.30
2400,16.33
2401,16.32
2402,16.28
2403,16.20
2404,16.09
2405,15.96
2406,15.84
2407,15.76
2408,15.70
2409,15.68
2410,15.69
2411,15.72
2412,15.75
2413,15.78
2414,15.78
2415,15.75
2416,15.67
2417,15.57
2418,15.47
2419,15.38
2420,15.33
2421,15.32
2422,15.34
2423,15.38
2424,15.41
2425,15.39
2426,15.30
2427,15.16
2428,14.98
2429,14.79
2430,14.61
2431,14.45
2432,14.34
2433,14.28
2434,14.24
2435,14.21
2436,14.18
2437,14.16
2438,14.16
2439,14.18
2440,14.23
2441,14.31
2442,14.40
2443,14.51
2444,14.60
2445,14.68
2446,14.74
2447,14.78
2448,14.80
2449,14.82
2450,14.87
2451,14.93
2452,15.00
2453,15.06
2454,15.11
2455,15.15
2456,15.17
2457,15.16
2458,15.13
2459,15.08
2460,15.03
2461,14.98
2462,14.95
2463,14.92
2464,14.92
2465,14.94
2466,14.99
2467,15.05
2468,15.12
2469,15.19
2470,15.24
2471,15.26
2472,15.26
2473,15.25
2474,15.26
2475,15.29
2476,15.36
2477,15.47
2478,15.59
2479,15.70
2480,15.77
2481,15.79
2482,15.75
2483,15.64
2484,15.50
2485,15.35
2486,15.22
2487,15.16
2488,15.15
2489,15.19
2490,15.23
2491,15.27
2492,15.27
2493,15.23
2494,15.15
2495,15.02
2496,14.89
2497,14.77
2498,14.68
2499,14.63
2500,14.61
2501,14.63
2502,14.65
2503,14.67
2504,14.66
2505,14.62
2506,14.55
2507,14.46
2508,14.35
2509,14.25
2510,14.17
2511,14.13
2512,14.09
2513,14.07
2514,14.05
2515,14.00
2516,13.90
2517,13.74
2518,13.52
2519,13.28
2520,13.05
2521,12.86
2522,12.73
2523,12.67
2524,12.69
2525,12.77
2526,12.92
2527,13.10
2528,13.28
2529,13.46
2530,13.61
2531,13.75
2532,13.84
2533,13.88
2534,13.89
2535,13.87
2536,13.83
2537,13.78
2538,13.72
2539,13.64
2540,13.53
2541,13.42
2542,13.28
2543,13.12
2544,12.93
2545,12.75
2546,12.58
2547,12.44
2548,12.30
2549,12.14
2550,11.94
2551,11.74
2552,11.52
2553,11.32
2554,11.11
2555,10.94
2556,10.78
2557,10.68
2558,10.60
2559,10.53
2560,10.45
2561,10.35
2562,10.21
2563,10.05
2564,9.90
2565,9.78
2566,9.69
2567,9.66
2568,9.67
2569,9.74
2570,9.83
2571,9.89
2572,9.90
2573,9.84
2574,9.71
2575,9.52
2576,9.30
2577,9.05
2578,8.83
2579,8.63
2580,8.48
2581,8.36
2582,8.28
2583,8.22
2584,8.20
2585,8.22
2586,8.29
2587,8.42
2588,8.57
2589,8.73
2590,8.91
2591,9.06
2592,9.18
2593,9.24
2594,9.24
2595,9.21
2596,9.15
2597,9.08
2598,9.01
2599,8.94
2600,8.87
2601,8.80
2602,8.73
2603,8.67
2604,8.60
2605,8.55
2606,8.50
2607,8.47
2608,8.44
2609,8.39
2610,8.30
2611,8.18
2612,8.00
2613,7.79
2614,7.54
2615,7.31
2616,7.09
2617,6.91
2618,6.76
2619,6.65
2620,6.53
2621,6.43
2622,6.31
2623,6.21
2624,6.10
2625,6.03
2626,6.00
2627,6.02
2628,6.08
2629,6.14
2630,6.19
2631,6.21
2632,6.17
2633,6.07
2634,5.91
2635,5.72
2636,5.52
2637,5.35
2638,5.21
2639,5.13
2640,5.10
2641,5.13
2642,5.21
2643,5.32
2644,5.45
2645,5.58
2646,5.69
2647,5.76
2648,5.78
2649,5.77
2650,5.74
2651,5.71
2652,5.68
2653,5.63
2654,5.58
2655,5.51
2656,5.42
2657,5.30
2658,5.16
2659,5.04
2660,4.93
2661,4.87
2662,4.87
2663,4.94
2664,5.08
2665,5.27
2666,5.48
2667,5.68
2668,5.86
2669,5.98
2670,6.05
2671,6.06
2672,6.05
2673,6.01
2674,6.01
2675,6.05
2676,6.19
2677,6.42
2678,6.78
2679,7.22
2680,7.74
2681,8.27
2682,8.81
2683,9.29
2684,9.73
2685,10.10
2686,10.43
2687,10.71
2688,10.98
2689,11.22
2690,11.45
2691,11.64
2692,11.79
2693,11.85
2694,11.84
2695,11.76
2696,11.64
2697,11.52
2698,11.45
2699,11.44
2700,11.51
2701,11.65
2702,11.82
2703,11.98
2704,12.12
2705,12.22
2706,12.27
2707,12.28
2708,12.26
2709,12.24
2710,12.22
2711,12.21
2712,12.21
2713,12.22
2714,12.22
2715,12.20
2716,12.17
2717,12.12
2718,12.05
2719,11.96
2720,11.85
2721,11.73
2722,11.60
2723,11.47
2724,11.31
2725,11.16
2726,11.00
2727,10.87
2728,10.75
2729,10.67
2730,10.61
2731,10.59
2732,10.62
2733,10.67
2734,10.74
2735,10.82
2736,10.90
2737,10.98
2738,11.06
2739,11.15
2740,11.27
2741,11.42
2742,11.61
2743,11.84
2744,12.11
2745,12.40
2746,12.68
2747,12.93
2748,13.13
2749,13.25
2750,13.32
2751,13.32
2752,13.29
2753,13.24
2754,13.22
2755,13.24
2756,13.32
2757,13.45
2758,13.63
2759,13.84
2760,14.06
2761,14.26
2762,14.42
2763,14.52
2764,14.55
2765,14.51
2766,14.43
2767,14.30
2768,14.15
2769,14.00
2770,13.87
2771,13.77
2772,13.72
2773,13.71
2774,13.74
2775,13.79
2776,13.86
2777,13.93
2778,14.01
2779,14.08
2780,14.17
2781,14.29
2782,14.44
2783,14.62
2784,14.82
2785,15.02
2786,15.21
2787,15.35
2788,15.46
2789,15.49
2790,15.47
2791,15.38
2792,15.28
2793,15.16
2794,15.09
2795,15.08
2796,15.16
2797,15.35
2798,15.66
2799,16.06
2800,16.55
2801,17.06
2802,17.58
2803,18.05
2804,18.47
2805,18.80
2806,19.07
2807,19.27
2808,19.46
2809,19.63
2810,19.82
2811,20.01
2812,20.23
2813,20.43
2814,20.60
2815,20.71
2816,20.76
2817,20.75
2818,20.72
2819,20.69
2820,20.69
2821,20.72
2822,20.79
2823,20.87
2824,20.97
2825,21.05
2826,21.11
2827,21.14
2828,21.15
2829,21.17
2830,21.19
2831,21.25
2832,21.30
2833,21.33
2834,21.30
2835,21.20
2836,21.01
2837,20.75
2838,20.43
2839,20.10
2840,19.77
2841,19.48
2842,19.21
2843,18.99
2844,18.79
2845,18.60
2846,18.37
2847,18.12
2848,17.83
2849,17.55
2850,17.26
2851,17.02
2852,16.80
2853,16.64
2854,16.52
2855,16.45
2856,16.39
2857,16.33
2858,16.23
2859,16.09
2860,15.89
2861,15.67
2862,15.42
2863,15.21
2864,15.03
2865,14.92
2866,14.83
2867,14.75
2868,14.63
2869,14.47
2870,14.21
2871,13.90
2872,13.52
2873,13.14
2874,12.77
2875,12.48
2876,12.26
2877,12.11
2878,12.00
2879,11.92
2880,11.84
2881,11.75
2882,11.63
2883,11.51
2884,11.40
2885,11.33
2886,11.27
2887,11.25
2888,11.25
2889,11.28
2890,11.31
2891,11.33
2892,11.33
2893,11.33
2894,11.32
2895,11.31
2896,11.31
2897,11.33
2898,11.36
2899,11.42
2900,11.47
2901,11.53
2902,11.55
2903,11.54
2904,11.48
2905,11.38
2906,11.24
2907,11.10
2908,10.95
2909,10.82
2910,10.71
2911,10.62
2912,10.54
2913,10.46
2914,10.35
2915,10.23
2916,10.10
2917,9.97
2918,9.87
2919,9.83
2920,9.83
2921,9.90
2922,9.99
2923,10.11
2924,10.23
2925,10.34
2926,10.40
2927,10.42
2928,10.39
2929,10.32
2930,10.22
2931,10.09
2932,9.94
2933,9.76
2934,9.56
2935,9.38
2936,9.23
2937,9.12
2938,9.07
2939,9.07
2940,9.12
2941,9.20
2942,9.29
2943,9.35
2944,9.38
2945,9.38
2946,9.37
2947,9.36
2948,9.37
2949,9.43
2950,9.53
2951,9.66
2952,9.79
2953,9.90
2954,9.99
2955,10.05
2956,10.08
2957,10.10
2958,10.10
2959,10.12
2960,10.16
2961,10.23
2962,10.30
2963,10.37
2964,10.43
2965,10.47
2966,10.49
2967,10.47
2968,10.43
2969,10.38
2970,10.33
2971,10.28
2972,10.24
2973,10.21
2974,10.23
2975,10.28
2976,10.38
2977,10.53
2978,10.70
2979,10.87
2980,11.02
2981,11.11
2982,11.15
2983,11.11
2984,11.01
2985,10.90
2986,10.79
2987,10.73
2988,10.73
2989,10.80
2990,10.96
2991,11.15
2992,11.37
2993,11.60
2994,11.80
2995,11.96
2996,12.06
2997,12.11
2998,12.17
2999,12.28
3000,12.41
3001,12.51
3002,12.54
3003,12.50
3004,12.37
3005,12.16
3006,11.90
3007,11.63
3008,11.36
3009,11.13
3010,10.91
3011,10.73
3012,10.55
3013,10.39
3014,10.23
3015,10.06
3016,9.88
3017,9.73
3018,9.60
3019,9.48
3020,9.39
3021,9.31
3022,9.29
3023,9.32
3024,9.41
3025,9.55
3026,9.77
3027,10.03
3028,10.36
3029,10.71
3030,11.07
3031,11.42
3032,11.76
3033,12.07
3034,12.35
3035,12.60
3036,12.86
3037,13.11
3038,13.39
3039,13.67
3040,13.98
3041,14.26
3042,14.54
3043,14.76
3044,14.94
3045,15.06
3046,15.15
3047,15.19
3048,15.21
3049,15.23
3050,15.28
3051,15.36
3052,15.48
3053,15.60
3054,15.74
3055,15.88
3056,16.02
3057,16.17
3058,16.36
3059,16.57
3060,16.80
3061,17.02
3062,17.23
3063,17.40
3064,17.56
3065,17.68
3066,17.77
3067,17.82
3068,17.84
3069,17.84
3070,17.84
3071,17.84
3072,17.87
3073,17.93
3074,18.04
3075,18.18
3076,18.37
3077,18.58
3078,18.80
3079,19.00
3080,19.19
3081,19.33
3082,19.43
3083,19.51
3084,19.60
3085,19.73
3086,19.89
3087,20.06
3088,20.24
3089,20.37
3090,20.46
3091,20.46
3092,20.39
3093,20.27
3094,20.13
3095,20.00
3096,19.94
3097,19.94
3098,20.01
3099,20.12
3100,20.24
3101,20.34
3102,20.41
3103,20.45
3104,20.47
3105,20.46
3106,20.46
3107,20.46
3108,20.48
3109,20.53
3110,20.60
3111,20.68
3112,20.79
3113,20.91
3114,21.07
3115,21.26
3116,21.46
3117,21.66
3118,21.84
3119,22.00
3120,22.11
3121,22.16
3122,22.13
3123,22.04
3124,21.89
3125,21.71
3126,21.51
3127,21.32
3128,21.13
3129,20.98
3130,20.86
3131,20.79
3132,20.75
3133,20.73
3134,20.72
3135,20.72
3136,20.71
3137,20.70
3138,20.67
3139,20.65
3140,20.63
3141,20.63
3142,20.63
3143,20.62
3144,20.61
3145,20.58
3146,20.54
3147,20.48
3148,20.42
3149,20.36
3150,20.33
3151,20.32
3152,20.34
3153,20.37
3154,20.40
3155,20.43
3156,20.45
3157,20.47
3158,20.52
3159,20.59
3160,20.69
3161,20.79
3162,20.87
3163,20.91
3164,20.86
3165,20.73
3166,20.51
3167,20.25
3168,19.99
3169,19.79
3170,19.66
3171,19.63
3172,19.64
3173,19.69
3174,19.69
3175,19.65
3176,19.51
3177,19.31
3178,19.03
3179,18.73
3180,18.41
3181,18.11
3182,17.80
3183,17.49
3184,17.15
3185,16.80
3186,16.43
3187,16.09
3188,15.77
3189,15.52
3190,15.33
3191,15.21
3192,15.11
3193,15.02
3194,14.89
3195,14.74
3196,14.52
3197,14.29
3198,14.03
3199,13.80
3200,13.60
3201,13.47
3202,13.35
3203,13.26
3204,13.16
3205,13.04
3206,12.87
3207,12.67
3208,12.44
3209,12.21
3210,11.99
3211,11.84
3212,11.75
3213,11.75
3214,11.81
3215,11.90
3216,11.98
3217,12.05
3218,12.07
3219,12.04
3220,11.97
3221,11.87
3222,11.76
3223,11.68
3224,11.65
3225,11.67
3226,11.73
3227,11.83
3228,11.95
3229,12.05
3230,12.12
3231,12.14
3232,12.11
3233,12.04
3234,11.92
3235,11.79
3236,11.63
3237,11.48
3238,11.33
3239,11.16
3240,10.96
3241,10.75
3242,10.47
3243,10.17
3244,9.80
3245,9.43
3246,9.04
3247,8.69
3248,8.36
3249,8.10
3250,7.88
3251,7.73
3252,7.60
3253,7.49
3254,7.38
3255,7.27
3256,7.15
3257,7.04
3258,6.92
3259,6.80
3260,6.69
3261,6.61
3262,6.55
3263,6.53
3264,6.52
3265,6.54
3266,6.56
3267,6.58
3268,6.59
3269,6.60
3270,6.60
3271,6.61
3272,6.64
3273,6.68
3274,6.75
3275,6.83
3276,6.93
3277,7.05
3278,7.19
3279,7.33
3280,7.46
3281,7.57
3282,7.66
3283,7.71
3284,7.74
3285,7.74
3286,7.73
3287,7.73
3288,7.73
3289,7.74
3290,7.76
3291,7.78
3292,7.79
3293,7.77
3294,7.71
3295,7.64
3296,7.56
3297,7.50
3298,7.48
3299,7.53
3300,7.65
3301,7.86
3302,8.15
3303,8.46
3304,8.78
3305,9.07
3306,9.33
3307,9.56
3308,9.78
3309,9.99
3310,10.22
3311,10.44
3312,10.67
3313,10.88
3314,11.09
3315,11.26
3316,11.41
3317,11.51
3318,11.61
3319,11.67
3320,11.74
3321,11.80
3322,11.90
3323,12.02
3324,12.20
3325,12.43
3326,12.74
3327,13.09
3328,13.49
3329,13.87
3330,14.22
3331,14.50
3332,14.70
3333,14.81
3334,14.87
3335,14.88
3336,14.90
3337,14.92
3338,14.97
3339,15.05
3340,15.15
3341,15.22
3342,15.26
3343,15.26
3344,15.24
3345,15.19
3346,15.14
3347,15.09
3348,15.07
3349,15.09
3350,15.19
3351,15.34
3352,15.57
3353,15.85
3354,16.18
3355,16.53
3356,16.86
3357,17.13
3358,17.31
3359,17.39
3360,17.37
3361,17.27
3362,17.14
3363,16.99
3364,16.88
3365,16.83
3366,16.83
3367,16.88
3368,16.93
3369,16.98
3370,16.99
3371,16.98
3372,16.96
3373,16.93
3374,16.91
3375,16.90
3376,16.89
3377,16.89
3378,16.85
3379,16.76
3380,16.60
3381,16.41
3382,16.18
3383,15.97
3384,15.78
3385,15.65
3386,15.56
3387,15.49
3388,15.41
3389,15.33
3390,15.23
3391,15.10
3392,14.96
3393,14.84
3394,14.77
3395,14.77
3396,14.86
3397,15.02
3398,15.24
3399,15.49
3400,15.77
3401,16.02
3402,16.26
3403,16.47
3404,16.69
3405,16.91
3406,17.14
3407,17.37
3408,17.62
3409,17.86
3410,18.10
3411,18.30
3412,18.46
3413,18.56
3414,18.61
3415,18.59
3416,18.54
3417,18.45
3418,18.35
3419,18.24
3420,18.12
3421,17.97
3422,17.81
3423,17.62
3424,17.43
3425,17.25
3426,17.11
3427,17.04
3428,17.05
3429,17.14
3430,17.29
3431,17.48
3432,17.67
3433,17.83
3434,17.92
3435,17.95
3436,17.92
3437,17.83
3438,17.69
3439,17.53
3440,17.36
3441,17.19
3442,17.03
3443,16.89
3444,16.76
3445,16.67
3446,16.62
3447,16.60
3448,16.60
3449,16.59
3450,16.54
3451,16.46
3452,16.30
3453,16.10
3454,15.85
3455,15.59
3456,15.34
3457,15.14
3458,14.97
3459,14.86
3460,14.76
3461,14.67
3462,14.54
3463,14.40
3464,14.20
3465,13.99
3466,13.75
3467,13.53
3468,13.30
3469,13.10
3470,12.90
3471,12.73
3472,12.55
3473,12.38
3474,12.20
3475,12.05
3476,11.91
3477,11.82
3478,11.74
3479,11.71
3480,11.69
3481,11.69
3482,11.67
3483,11.63
3484,11.57
3485,11.49
3486,11.40
3487,11.30
3488,11.21
3489,11.14
3490,11.07
3491,11.02
3492,10.96
3493,10.89
3494,10.79
3495,10.66
3496,10.50
3497,10.33
3498,10.18
3499,10.06
3500,9.98
3501,9.92
3502,9.89
3503,9.86
3504,9.81
3505,9.74
3506,9.63
3507,9.52
3508,9.40
3509,9.30
3510,9.24
3511,9.22
3512,9.24
3513,9.27
3514,9.30
3515,9.31
3516,9.28
3517,9.22
3518,9.16
3519,9.11
3520,9.14
3521,9.23
3522,9.39
3523,9.59
3524,9.82
3525,10.05
3526,10.25
3527,10.42
3528,10.59
3529,10.74
3530,10.92
3531,11.11
3532,11.33
3533,11.57
3534,11.83
3535,12.06
3536,12.30
3537,12.52
3538,12.77
3539,13.03
3540,13.33
3541,13.64
3542,13.96
3543,14.26
3544,14.54
3545,14.78
3546,15.01
3547,15.20
3548,15.43
3549,15.68
3550,15.99
3551,16.32
3552,16.69
3553,17.05
3554,17.43
3555,17.76
3556,18.11
3557,18.45
3558,18.82
3559,19.18
3560,19.54
3561,19.85
3562,20.10
3563,20.28
3564,20.36
3565,20.34
3566,20.25
3567,20.11
3568,19.97
3569,19.85
3570,19.76
3571,19.71
3572,19.70
3573,19.72
3574,19.77
3575,19.81
3576,19.85
3577,19.89
3578,19.91
3579,19.92
3580,19.90
3581,19.87
3582,19.82
3583,19.75
3584,19.69
3585,19.64
3586,19.62
3587,19.63
3588,19.69
3589,19.81
3590,19.98
3591,20.21
3592,20.47
3593,20.74
3594,21.02
3595,21.28
3596,21.52
3597,21.72
3598,21.86
3599,21.94
3600,21.99
3601,22.02
3602,22.06
3603,22.07
3604,22.06
3605,22.00
3606,21.95
3607,21.95
3608,21.98
3609,22.06
3610,22.15
3611,22.25
3612,22.34
3613,22.42
3614,22.47
3615,22.48
3616,22.45
3617,22.38
3618,22.30
3619,22.20
3620,22.11
3621,22.03
3622,21.97
3623,21.93
3624,21.90
3625,21.87
3626,21.82
3627,21.73
3628,21.59
3629,21.41
3630,21.17
3631,20.90
3632,20.60
3633,20.32
3634,20.05
3635,19.84
3636,19.67
3637,19.56
3638,19.47
3639,19.40
3640,19.31
3641,19.22
3642,19.08
3643,18.92
3644,18.75
3645,18.59
3646,18.44
3647,18.33
3648,18.27
3649,18.26
3650,18.30
3651,18.35
3652,18.39
3653,18.41
3654,18.37
3655,18.29
3656,18.17
3657,18.03
3658,17.86
3659,17.70
3660,17.55
3661,17.43
3662,17.32
3663,17.23
3664,17.15
3665,17.08
3666,17.04
3667,17.03
3668,17.07
3669,17.14
3670,17.27
3671,17.41
3672,17.57
3673,17.72
3674,17.87
3675,18.03
3676,18.24
3677,18.51
3678,18.83
3679,19.17
3680,19.53
3681,19.82
3682,20.02
3683,20.07
3684,20.00
3685,19.81
3686,19.57
3687,19.32
3688,19.10
3689,18.94
3690,18.83
3691,18.77
3692,18.72
3693,18.67
3694,18.59
3695,18.48
3696,18.33
3697,18.19
3698,18.05
3699,17.95
3700,17.86
3701,17.78
3702,17.70
3703,17.64
3704,17.58
3705,17.53
3706,17.46
3707,17.40
3708,17.31
3709,17.21
3710,17.08
3711,16.93
3712,16.74
3713,16.56
3714,16.36
3715,16.16
3716,15.91
3717,15.66
3718,15.41
3719,15.20
3720,15.01
3721,14.83
3722,14.65
3723,14.47
3724,14.30
3725,14.15
3726,14.02
3727,13.92
3728,13.85
3729,13.82
3730,13.87
3731,13.99
3732,14.18
3733,14.46
3734,14.82
3735,15.23
3736,15.64
3737,16.02
3738,16.35
3739,16.62
3740,16.83
3741,16.99
3742,17.13
3743,17.25
3744,17.38
3745,17.46
3746,17.54
3747,17.61
3748,17.70
3749,17.78
3750,17.85
3751,17.90
3752,17.94
3753,17.98
3754,18.03
3755,18.07
3756,18.12
3757,18.16
3758,18.19
3759,18.21
3760,18.20
3761,18.17
3762,18.12
3763,18.07
3764,18.02
3765,18.02
3766,18.08
3767,18.20
3768,18.36
3769,18.53
3770,18.70
3771,18.84
3772,18.89
3773,18.83
3774,18.66
3775,18.41
3776,18.13
3777,17.86
3778,17.61
3779,17.44
3780,17.34
3781,17.30
3782,17.29
3783,17.30
3784,17.32
3785,17.36
3786,17.40
3787,17.45
3788,17.50
3789,17.56
3790,17.59
3791,17.60
3792,17.61
3793,17.64
3794,17.68
3795,17.74
3796,17.79
3797,17.83
3798,17.86
3799,17.87
3800,17.86
3801,17.80
3802,17.71
3803,17.60
3804,17.48
3805,17.38
3806,17.31
3807,17.28
3808,17.29
3809,17.36
3810,17.45
3811,17.56
3812,17.65
3813,17.72
3814,17.73
3815,17.69
3816,17.55
3817,17.35
3818,17.08
3819,16.78
3820,16.44
3821,16.10
3822,15.76
3823,15.45
3824,15.16
3825,14.93
3826,14.71
3827,14.52
3828,14.31
3829,14.11
3830,13.88
3831,13.62
3832,13.28
3833,12.88
3834,12.39
3835,11.88
3836,11.33
3837,10.84
3838,10.39
3839,10.02
3840,9.69
3841,9.42
3842,9.17
3843,8.97
3844,8.76
3845,8.56
3846,8.37
3847,8.21
3848,8.07
3849,7.97
3850,7.91
3851,7.92
3852,7.96
3853,8.04
3854,8.12
3855,8.22
3856,8.27
3857,8.28
3858,8.23
3859,8.15
3860,8.04
3861,7.92
3862,7.79
3863,7.68
3864,7.59
3865,7.51
3866,7.45
3867,7.40
3868,7.36
3869,7.34
3870,7.34
3871,7.37
3872,7.42
3873,7.51
3874,7.62
3875,7.72
3876,7.81
3877,7.86
3878,7.89
3879,7.89
3880,7.87
3881,7.86
3882,7.92
3883,8.06
3884,8.31
3885,8.65
3886,9.10
3887,9.60
3888,10.15
3889,10.67
3890,11.15
3891,11.56
3892,11.92
3893,12.19
3894,12.42
3895,12.59
3896,12.76
3897,12.90
3898,13.07
3899,13.22
3900,13.39
3901,13.53
3902,13.68
3903,13.82
3904,13.99
3905,14.18
3906,14.45
3907,14.79
3908,15.26
3909,15.77
3910,16.31
3911,16.78
3912,17.21
3913,17.54
3914,17.79
3915,17.95
3916,18.08
3917,18.16
3918,18.24
3919,18.33
3920,18.46
3921,18.59
3922,18.72
3923,18.80
3924,18.84
3925,18.83
3926,18.77
3927,18.68
3928,18.59
3929,18.50
3930,18.44
3931,18.41
3932,18.44
3933,18.50
3934,18.62
3935,18.76
3936,18.95
3937,19.16
3938,19.40
3939,19.66
3940,19.92
3941,20.15
3942,20.35
3943,20.50
3944,20.60
3945,20.64
3946,20.65
3947,20.62
3948,20.60
3949,20.57
3950,20.55
3951,20.53
3952,20.52
3953,20.51
3954,20.51
3955,20.50
3956,20.53
3957,20.57
3958,20.65
3959,20.77
3960,20.93
3961,21.11
3962,21.29
3963,21.43
3964,21.53
3965,21.58
3966,21.59
3967,21.57
3968,21.56
3969,21.57
3970,21.62
3971,21.72
3972,21.86
3973,22.04
3974,22.23
3975,22.39
3976,22.49
3977,22.53
3978,22.52
3979,22.46
3980,22.38
3981,22.30
3982,22.23
3983,22.19
3984,22.18
3985,22.18
3986,22.20
3987,22.20
3988,22.19
3989,22.16
3990,22.11
3991,22.06
3992,22.01
3993,21.96
3994,21.92
3995,21.87
3996,21.80
3997,21.70
3998,21.57
3999,21.43
4000,21.30
4001,21.19
4002,21.11
4003,21.09
4004,21.13
4005,21.23
4006,21.36
4007,21.51
4008,21.65
4009,21.75
4010,21.79
4011,21.76
4012,21.65
4013,21.49
4014,21.29
4015,21.09
4016,20.89
4017,20.72
4018,20.60
4019,20.54
4020,20.52
4021,20.54
4022,20.59
4023,20.66
4024,20.76
4025,20.88
4026,21.01
4027,21.17
4028,21.34
4029,21.53
4030,21.71
4031,21.86
4032,21.94
4033,21.94
4034,21.84
4035,21.69
4036,21.50
4037,21.30
4038,21.12
4039,20.97
4040,20.85
4041,20.76
4042,20.65
4043,20.52
4044,20.32
4045,20.05
4046,19.71
4047,19.36
4048,18.98
4049,18.63
4050,18.28
4051,17.96
4052,17.64
4053,17.33
4054,16.99
4055,16.65
4056,16.31
4057,16.01
4058,15.72
4059,15.48
4060,15.28
4061,15.13
4062,15.00
4063,14.90
4064,14.76
4065,14.59
4066,14.39
4067,14.20
4068,14.02
4069,13.88
4070,13.78
4071,13.71
4072,13.68
4073,13.68
4074,13.73
4075,13.82
4076,13.98
4077,14.18
4078,14.44
4079,14.73
4080,15.04
4081,15.32
4082,15.59
4083,15.84
4084,16.06
4085,16.28
4086,16.49
4087,16.68
4088,16.86
4089,16.99
4090,17.07
4091,17.07
4092,16.99
4093,16.83
4094,16.63
4095,16.46
4096,16.35
4097,16.28
4098,16.21
4099,16.13
4100,16.04
4101,15.97
4102,15.89
4103,15.80
4104,15.67
4105,15.54
4106,15.40
4107,15.27
4108,15.13
4109,14.98
4110,14.80
4111,14.61
4112,14.38
4113,14.11
4114,13.81
4115,13.50
4116,13.17
4117,12.87
4118,12.61
4119,12.41
4120,12.27
4121,12.18
4122,12.13
4123,12.11
4124,12.12
4125,12.16
4126,12.22
4127,12.30
4128,12.40
4129,12.53
4130,12.66
4131,12.77
4132,12.85
4133,12.89
4134,12.88
4135,12.81
4136,12.73
4137,12.64
4138,12.61
4139,12.66
4140,12.82
4141,13.08
4142,13.44
4143,13.85
4144,14.31
4145,14.74
4146,15.15
4147,15.49
4148,15.81
4149,16.07
4150,16.33
4151,16.57
4152,16.85
4153,17.17
4154,17.55
4155,17.97
4156,18.45
4157,18.94
4158,19.43
4159,19.87
4160,20.26
4161,20.56
4162,20.79
4163,20.91
4164,20.97
4165,20.92
4166,20.84
4167,20.76
4168,20.72
4169,20.67
4170,20.63
4171,20.60
4172,20.64
4173,20.76
4174,20.96
4175,21.18
4176,21.39
4177,21.56
4178,21.67
4179,21.69
4180,21.64
4181,21.51
4182,21.35
4183,21.16
4184,20.97
4185,20.83
4186,20.77
4187,20.81
4188,20.94
4189,21.14
4190,21.36
4191,21.57
4192,21.78
4193,21.96
4194,22.14
4195,22.31
4196,22.51
4197,22.71
4198,22.95
4199,23.18
4200,23.44
4201,23.69
4202,23.95
4203,24.16
4204,24.37
4205,24.55
4206,24.74
4207,24.93
4208,25.16
4209,25.39
4210,25.66
4211,25.93
4212,26.23
4213,26.52
4214,26.81
4215,27.08
4216,27.35
4217,27.58
4218,27.80
4219,27.99
4220,28.16
4221,28.29
4222,28.41
4223,28.48
4224,28.52
4225,28.52
4226,28.49
4227,28.43
4228,28.36
4229,28.30
4230,28.23
4231,28.16
4232,28.06
4233,27.94
4234,27.75
4235,27.50
4236,27.17
4237,26.79
4238,26.39
4239,26.04
4240,25.76
4241,25.60
4242,25.51
4243,25.52
4244,25.55
4245,25.60
4246,25.60
4247,25.56
4248,25.44
4249,25.28
4250,25.08
4251,24.89
4252,24.69
4253,24.50
4254,24.28
4255,24.07
4256,23.81
4257,23.54
4258,23.23
4259,22.91
4260,22.57
4261,22.25
4262,21.91
4263,21.58
4264,21.24
4265,20.91
4266,20.59
4267,20.31
4268,20.07
4269,19.92
4270,19.85
4271,19.88
4272,19.93
4273,20.02
4274,20.08
4275,20.13
4276,20.14
4277,20.10
4278,20.03
4279,19.93
4280,19.82
4281,19.71
4282,19.60
4283,19.49
4284,19.36
4285,19.24
4286,19.10
4287,18.98
4288,18.88
4289,18.79
4290,18.72
4291,18.67
4292,18.62
4293,18.58
4294,18.50
4295,18.38
4296,18.24
4297,18.11
4298,17.98
4299,17.90
4300,17.87
4301,17.89
4302,17.94
4303,18.03
4304,18.12
4305,18.22
4306,18.28
4307,18.30
4308,18.25
4309,18.17
4310,18.04
4311,17.89
4312,17.72
4313,17.54
4314,17.35
4315,17.18
4316,17.02
4317,16.88
4318,16.74
4319,16.60
4320,16.44
4321,16.28
4322,16.09
4323,15.90
4324,15.70
4325,15.52
4326,15.35
4327,15.19
4328,15.03
4329,14.90
4330,14.78
4331,14.71
4332,14.65
4333,14.61
4334,14.55
4335,14.47
4336,14.36
4337,14.23
4338,14.04
4339,13.82
4340,13.55
4341,13.26
4342,12.96
4343,12.68
4344,12.41
4345,12.21
4346,12.05
4347,11.96
4348,11.88
4349,11.83
4350,11.75
4351,11.65
4352,11.49
4353,11.31
4354,11.10
4355,10.89
4356,10.68
4357,10.52
4358,10.39
4359,10.31
4360,10.26
4361,10.24
4362,10.24
4363,10.23
4364,10.21
4365,10.18
4366,10.11
4367,10.02
4368,9.89
4369,9.73
4370,9.55
4371,9.38
4372,9.22
4373,9.10
4374,9.02
4375,8.98
4376,8.97
4377,9.00
4378,9.04
4379,9.07
4380,9.08
4381,9.08
4382,9.06
4383,9.02
4384,8.97
4385,8.91
4386,8.85
4387,8.80
4388,8.78
4389,8.79
4390,8.81
4391,8.84
4392,8.86
4393,8.84
4394,8.80
4395,8.71
4396,8.60
4397,8.49
4398,8.42
4399,8.42
4400,8.48
4401,8.62
4402,8.79
4403,8.94
4404,9.05
4405,9.08
4406,9.01
4407,8.86
4408,8.65
4409,8.43
4410,8.21
4411,8.03
4412,7.88
4413,7.76
4414,7.66
4415,7.56
4416,7.46
4417,7.35
4418,7.27
4419,7.23
4420,7.24
4421,7.29
4422,7.34
4423,7.35
4424,7.32
4425,7.22
4426,7.05
4427,6.84
4428,6.63
4429,6.45
4430,6.36
4431,6.36
4432,6.50
4433,6.75
4434,7.13
4435,7.58
4436,8.11
4437,8.66
4438,9.25
4439,9.81
4440,10.37
4441,10.87
4442,11.37
4443,11.80
4444,12.25
4445,12.67
4446,13.13
4447,13.58
4448,14.09
4449,14.60
4450,15.17
4451,15.75
4452,16.38
4453,17.01
4454,17.70
4455,18.38
4456,19.10
4457,19.77
4458,20.46
4459,21.07
4460,21.66
4461,22.17
4462,22.67
4463,23.13
4464,23.63
4465,24.13
4466,24.70
4467,25.27
4468,25.87
4469,26.41
4470,26.91
4471,27.27
4472,27.56
4473,27.75
4474,27.92
4475,28.06
4476,28.26
4477,28.52
4478,28.88
4479,29.30
4480,29.78
4481,30.23
4482,30.68
4483,31.05
4484,31.37
4485,31.62
4486,31.84
4487,32.04
4488,32.27
4489,32.54
4490,32.87
4491,33.23
4492,33.61
4493,33.95
4494,34.23
4495,34.41
4496,34.48
4497,34.42
4498,34.27
4499,34.04
4500,33.75
4501,33.43
4502,33.11
4503,32.81
4504,32.53
4505,32.28
4506,32.03
4507,31.81
4508,31.59
4509,31.40
4510,31.21
4511,31.04
4512,30.87
4513,30.74
4514,30.59
4515,30.47
4516,30.32
4517,30.18
4518,30.01
4519,29.84
4520,29.61
4521,29.37
4522,29.05
4523,28.69
4524,28.25
4525,27.80
4526,27.29
4527,26.81
4528,26.31
4529,25.86
4530,25.43
4531,25.06
4532,24.68
4533,24.33
4534,23.91
4535,23.50
4536,22.99
4537,22.48
4538,21.89
4539,21.33
4540,20.73
4541,20.17
4542,19.61
4543,19.09
4544,18.57
4545,18.10
4546,17.65
4547,17.26
4548,16.91
4549,16.65
4550,16.44
4551,16.29
4552,16.15
4553,16.03
4554,15.90
4555,15.76
4556,15.60
4557,15.44
4558,15.26
4559,15.11
4560,14.95
4561,14.82
4562,14.69
4563,14.58
4564,14.46
4565,14.34
4566,14.22
4567,14.13
4568,14.06
4569,14.02
4570,14.00
4571,14.02
4572,14.06
4573,14.12
4574,14.19
4575,14.27
4576,14.36
4577,14.45
4578,14.55
4579,14.65
4580,14.74
4581,14.79
4582,14.80
4583,14.76
4584,14.65
4585,14.52
4586,14.37
4587,14.22
4588,14.07
4589,13.95
4590,13.84
4591,13.75
4592,13.67
4593,13.61
4594,13.53
4595,13.43
4596,13.25
4597,13.02
4598,12.79
4599,12.59
4600,12.44
4601,12.33
4602,12.23
4603,12.12
4604,11.98
4605,11.82
4606,11.65
4607,11.52
4608,11.43
4609,11.43
4610,11.49
4611,11.63
4612,11.80
4613,11.94
4614,12.01
4615,11.98
4616,11.86
4617,11.65
4618,11.40
4619,11.15
4620,10.95
4621,10.82
4622,10.76
4623,10.77
4624,10.82
4625,10.86
4626,10.87
4627,10.85
4628,10.80
4629,10.74
4630,10.68
4631,10.65
4632,10.70
4633,10.82
4634,11.00
4635,11.21
4636,11.42
4637,11.58
4638,11.69
4639,11.71
4640,11.65
4641,11.54
4642,11.41
4643,11.28
4644,11.20
4645,11.18
4646,11.23
4647,11.34
4648,11.51
4649,11.70
4650,11.90
4651,12.04
4652,12.12
4653,12.12
4654,12.06
4655,11.96
4656,11.88
4657,11.82
4658,11.83
4659,11.91
4660,12.08
4661,12.29
4662,12.54
4663,12.78
4664,12.99
4665,13.13
4666,13.20
4667,13.19
4668,13.16
4669,13.12
4670,13.10
4671,13.11
4672,13.17
4673,13.25
4674,13.38
4675,13.51
4676,13.65
4677,13.77
4678,13.87
4679,13.95
4680,14.04
4681,14.15
4682,14.28
4683,14.41
4684,14.57
4685,14.72
4686,14.87
4687,14.96
4688,15.01
4689,15.02
4690,15.04
4691,15.10
4692,15.21
4693,15.36
4694,15.52
4695,15.68
4696,15.81
4697,15.87
4698,15.84
4699,15.73
4700,15.57
4701,15.41
4702,15.26
4703,15.15
4704,15.06
4705,15.00
4706,14.92
4707,14.83
4708,14.68
4709,14.49
4710,14.26
4711,14.04
4712,13.82
4713,13.66
4714,13.54
4715,13.48
4716,13.45
4717,13.43
4718,13.40
4719,13.35
4720,13.32
4721,13.31
4722,13.35
4723,13.45
4724,13.64
4725,13.89
4726,14.20
4727,14.53
4728,14.87
4729,15.19
4730,15.48
4731,15.75
4732,16.01
4733,16.26
4734,16.51
4735,16.74
4736,16.94
4737,17.08
4738,17.18
4739,17.20
4740,17.18
4741,17.11
4742,17.03
4743,16.96
4744,16.92
4745,16.90
4746,16.93
4747,16.98
4748,17.07
4749,17.18
4750,17.32
4751,17.46
4752,17.62
4753,17.77
4754,17.93
4755,18.08
4756,18.22
4757,18.33
4758,18.43
4759,18.51
4760,18.58
4761,18.62
4762,18.66
4763,18.66
4764,18.64
4765,18.60
4766,18.55
4767,18.49
4768,18.45
4769,18.44
4770,18.47
4771,18.54
4772,18.64
4773,18.75
4774,18.84
4775,18.90
4776,18.89
4777,18.84
4778,18.72
4779,18.56
4780,18.34
4781,18.08
4782,17.79
4783,17.49
4784,17.17
4785,16.86
4786,16.56
4787,16.32
4788,16.13
4789,15.97
4790,15.82
4791,15.67
4792,15.48
4793,15.30
4794,15.08
4795,14.87
4796,14.65
4797,14.43
4798,14.21
4799,14.02
4800,13.88
4801,13.81
4802,13.79
4803,13.81
4804,13.83
4805,13.86
4806,13.89
4807,13.93
4808,14.00
4809,14.08
4810,14.19
4811,14.32
4812,14.47
4813,14.64
4814,14.83
4815,15.00
4816,15.16
4817,15.29
4818,15.41
4819,15.51
4820,15.60
4821,15.68
4822,15.77
4823,15.86
4824,15.98
4825,16.13
4826,16.30
4827,16.48
4828,16.67
4829,16.83
4830,16.99
4831,17.14
4832,17.30
4833,17.46
4834,17.61
4835,17.73
4836,17.82
4837,17.86
4838,17.86
4839,17.81
4840,17.77
4841,17.76
4842,17.84
4843,18.01
4844,18.30
4845,18.64
4846,19.03
4847,19.38
4848,19.70
4849,19.90
4850,20.01
4851,20.01
4852,19.98
4853,19.92
4854,19.92
4855,19.96
4856,20.13
4857,20.40
4858,20.76
4859,21.17
4860,21.59
4861,21.98
4862,22.33
4863,22.58
4864,22.77
4865,22.89
4866,23.03
4867,23.19
4868,23.42
4869,23.71
4870,24.09
4871,24.51
4872,24.92
4873,25.24
4874,25.48
4875,25.59
4876,25.60
4877,25.52
4878,25.41
4879,25.27
4880,25.16
4881,25.08
4882,25.03
4883,24.98
4884,24.92
4885,24.84
4886,24.74
4887,24.65
4888,24.56
4889,24.49
4890,24.42
4891,24.36
4892,24.26
4893,24.12
4894,23.91
4895,23.65
4896,23.33
4897,23.01
4898,22.69
4899,22.43
4900,22.19
4901,22.00
4902,21.81
4903,21.61
4904,21.38
4905,21.12
4906,20.81
4907,20.50
4908,20.20
4909,19.95
4910,19.74
4911,19.56
4912,19.37
4913,19.16
4914,18.89
4915,18.58
4916,18.21
4917,17.83
4918,17.45
4919,17.14
4920,16.86
4921,16.67
4922,16.50
4923,16.36
4924,16.21
4925,16.06
4926,15.86
4927,15.65
4928,15.42
4929,15.22
4930,15.01
4931,14.84
4932,14.68
4933,14.53
4934,14.38
4935,14.23
4936,14.07
4937,13.93
4938,13.78
4939,13.66
4940,13.53
4941,13.42
4942,13.31
4943,13.22
4944,13.11
4945,12.99
4946,12.81
4947,12.62
4948,12.40
4949,12.20
4950,12.02
4951,11.88
4952,11.78
4953,11.71
4954,11.68
4955,11.67
4956,11.67
4957,11.65
4958,11.61
4959,11.57
4960,11.52
4961,11.49
4962,11.46
4963,11.44
4964,11.40
4965,11.36
4966,11.28
4967,11.17
4968,11.02
4969,10.85
4970,10.65
4971,10.46
4972,10.28
4973,10.12
4974,9.95
4975,9.77
4976,9.56
4977,9.34
4978,9.12
4979,8.91
4980,8.73
4981,8.65
4982,8.65
4983,8.72
4984,8.80
4985,8.89
4986,9.00
4987,9.15
4988,9.29
4989,9.39
4990,9.45
4991,9.47
4992,9.49
4993,9.50
4994,9.56
4995,9.66
4996,9.83
4997,10.04
4998,10.31
4999,10.58
5000,10.86
5001,11.09
5002,11.28
5003,11.40
5004,11.47
5005,11.51
5006,11.54
5007,11.57
5008,11.64
5009,11.75
5010,11.92
5011,12.12
5012,12.32
5013,12.50
5014,12.64
5015,12.73
5016,12.75
5017,12.73
5018,12.70
5019,12.69
5020,12.72
5021,12.80
5022,12.93
5023,13.09
5024,13.25
5025,13.37
5026,13.45
5027,13.46
5028,13.42
5029,13.35
5030,13.27
5031,13.19
5032,13.16
5033,13.15
5034,13.18
5035,13.21
5036,13.26
5037,13.32
5038,13.39
5039,13.48
5040,13.58
5041,13.70
5042,13.84
5043,13.99
5044,14.13
5045,14.25
5046,14.37
5047,14.44
5048,14.52
5049,14.59
5050,14.71
5051,14.89
5052,15.15
5053,15.48
5054,15.89
5055,16.28
5056,16.68
5057,17.03
5058,17.39
5059,17.70
5060,17.96
5061,18.14
5062,18.29
5063,18.41
5064,18.56
5065,18.72
5066,18.91
5067,19.13
5068,19.38
5069,19.64
5070,19.91
5071,20.15
5072,20.32
5073,20.40
5074,20.37
5075,20.25
5076,20.05
5077,19.80
5078,19.56
5079,19.36
5080,19.24
5081,19.21
5082,19.26
5083,19.37
5084,19.52
5085,19.67
5086,19.79
5087,19.87
5088,19.94
5089,20.02
5090,20.13
5091,20.26
5092,20.43
5093,20.61
5094,20.77
5095,20.87
5096,20.87
5097,20.78
5098,20.60
5099,20.37
5100,20.13
5101,19.93
5102,19.80
5103,19.73
5104,19.72
5105,19.75
5106,19.79
5107,19.84
5108,19.87
5109,19.90
5110,19.95
5111,20.03
5112,20.14
5113,20.26
5114,20.38
5115,20.48
5116,20.52
5117,20.47
5118,20.32
5119,20.13
5120,19.97
5121,19.91
5122,19.93
5123,20.03
5124,20.16
5125,20.29
5126,20.35
5127,20.33
5128,20.22
5129,20.04
5130,19.82
5131,19.61
5132,19.41
5133,19.26
5134,19.12
5135,18.99
5136,18.82
5137,18.61
5138,18.34
5139,18.03
5140,17.70
5141,17.40
5142,17.14
5143,16.97
5144,16.90
5145,16.93
5146,17.04
5147,17.19
5148,17.36
5149,17.50
5150,17.63
5151,17.72
5152,17.82
5153,17.92
5154,18.07
5155,18.25
5156,18.45
5157,18.68
5158,18.97
5159,19.29
5160,19.62
5161,19.89
5162,20.10
5163,20.22
5164,20.29
5165,20.32
5166,20.34
5167,20.38
5168,20.47
5169,20.60
5170,20.79
5171,21.01
5172,21.24
5173,21.44
5174,21.62
5175,21.75
5176,21.84
5177,21.90
5178,21.96
5179,22.05
5180,22.18
5181,22.34
5182,22.56
5183,22.81
5184,23.08
5185,23.35
5186,23.57
5187,23.69
5188,23.66
5189,23.51
5190,23.32
5191,23.14
5192,23.01
5193,22.90
5194,22.81
5195,22.73
5196,22.65
5197,22.58
5198,22.53
5199,22.51
5200,22.53
5201,22.62
5202,22.78
5203,22.99
5204,23.20
5205,23.39
5206,23.55
5207,23.67
5208,23.78
5209,23.86
5210,23.92
5211,23.96
5212,23.95
5213,23.91
5214,23.82
5215,23.68
5216,23.50
5217,23.28
5218,23.03
5219,22.80
5220,22.60
5221,22.46
5222,22.35
5223,22.29
5224,22.21
5225,22.13
5226,22.01
5227,21.84
5228,21.61
5229,21.37
5230,21.15
5231,21.04
5232,21.03
5233,21.14
5234,21.30
5235,21.49
5236,21.64
5237,21.72
5238,21.70
5239,21.62
5240,21.51
5241,21.40
5242,21.30
5243,21.21
5244,21.12
5245,21.02
5246,20.89
5247,20.71
5248,20.47
5249,20.21
5250,19.94
5251,19.71
5252,19.53
5253,19.42
5254,19.37
5255,19.37
5256,19.36
5257,19.35
5258,19.29
5259,19.18
5260,19.02
5261,18.82
5262,18.57
5263,18.30
5264,17.99
5265,17.69
5266,17.40
5267,17.13
5268,16.86
5269,16.62
5270,16.39
5271,16.18
5272,15.97
5273,15.78
5274,15.59
5275,15.41
5276,15.24
5277,15.11
5278,15.00
5279,14.96
5280,14.93
5281,14.93
5282,14.91
5283,14.89
5284,14.84
5285,14.76
5286,14.65
5287,14.53
5288,14.41
5289,14.32
5290,14.25
5291,14.22
5292,14.25
5293,14.34
5294,14.49
5295,14.68
5296,14.89
5297,15.12
5298,15.34
5299,15.55
5300,15.70
5301,15.80
5302,15.85
5303,15.85
5304,15.83
5305,15.77
5306,15.71
5307,15.65
5308,15.60
5309,15.55
5310,15.54
5311,15.56
5312,15.66
5313,15.84
5314,16.10
5315,16.41
5316,16.74
5317,17.03
5318,17.24
5319,17.33
5320,17.29
5321,17.14
5322,16.93
5323,16.70
5324,16.50
5325,16.37
5326,16.32
5327,16.34
5328,16.39
5329,16.44
5330,16.47
5331,16.48
5332,16.44
5333,16.39
5334,16.31
5335,16.23
5336,16.12
5337,15.99
5338,15.80
5339,15.56
5340,15.26
5341,14.94
5342,14.60
5343,14.29
5344,14.00
5345,13.78
5346,13.62
5347,13.52
5348,13.47
5349,13.47
5350,13.52
5351,13.61
5352,13.75
5353,13.91
5354,14.08
5355,14.24
5356,14.36
5357,14.45
5358,14.51
5359,14.54
5360,14.58
5361,14.65
5362,14.77
5363,14.91
5364,15.11
5365,15.32
5366,15.55
5367,15.75
5368,15.97
5369,16.18
5370,16.44
5371,16.71
5372,17.02
5373,17.35
5374,17.69
5375,18.01
5376,18.32
5377,18.58
5378,18.81
5379,18.99
5380,19.16
5381,19.28
5382,19.38
5383,19.45
5384,19.49
5385,19.49
5386,19.49
5387,19.48
5388,19.49
5389,19.52
5390,19.61
5391,19.73
5392,19.88
5393,20.02
5394,20.14
5395,20.23
5396,20.29
5397,20.32
5398,20.30
5399,20.26
5400,20.19
5401,20.10
5402,19.97
5403,19.81
5404,19.62
5405,19.41
5406,19.22
5407,19.05
5408,18.93
5409,18.86
5410,18.82
5411,18.83
5412,18.83
5413,18.82
5414,18.76
5415,18.68
5416,18.63
5417,18.62
5418,18.64
5419,18.68
5420,18.68
5421,18.65
5422,18.54
5423,18.37
5424,18.12
5425,17.83
5426,17.52
5427,17.23
5428,16.97
5429,16.76
5430,16.59
5431,16.48
5432,16.38
5433,16.31
5434,16.22
5435,16.14
5436,16.02
5437,15.90
5438,15.76
5439,15.62
5440,15.48
5441,15.36
5442,15.25
5443,15.17
5444,15.12
5445,15.08
5446,15.07
5447,15.05
5448,15.03
5449,15.00
5450,14.97
5451,14.94
5452,14.93
5453,14.94
5454,14.99
5455,15.06
5456,15.13
5457,15.17
5458,15.16
5459,15.07
5460,14.97
5461,14.86
5462,14.81
5463,14.81
5464,14.91
5465,15.10
5466,15.40
5467,15.77
5468,16.21
5469,16.65
5470,17.10
5471,17.50
5472,17.91
5473,18.30
5474,18.68
5475,19.04
5476,19.40
5477,19.72
5478,20.01
5479,20.22
5480,20.36
5481,20.40
5482,20.37
5483,20.25
5484,20.09
5485,19.88
5486,19.66
5487,19.45
5488,19.25
5489,19.11
5490,19.01
5491,18.97
5492,19.00
5493,19.08
5494,19.17
5495,19.26
5496,19.31
5497,19.32
5498,19.28
5499,19.20
5500,19.09
5501,19.01
5502,18.95
5503,18.94
5504,18.95
5505,19.00
5506,19.05
5507,19.08
5508,19.07
5509,19.03
5510,18.93
5511,18.79
5512,18.59
5513,18.37
5514,18.12
5515,17.86
5516,17.58
5517,17.31
5518,17.07
5519,16.88
5520,16.73
5521,16.66
5522,16.63
5523,16.69
5524,16.79
5525,16.88
5526,16.87
5527,16.79
5528,16.65
5529,16.52
5530,16.38
5531,16.24
5532,16.09
5533,15.97
5534,15.88
5535,15.81
5536,15.76
5537,15.70
5538,15.63
5539,15.54
5540,15.39
5541,15.22
5542,15.00
5543,14.77
5544,14.55
5545,14.38
5546,14.26
5547,14.20
5548,14.19
5549,14.25
5550,14.36
5551,14.50
5552,14.65
5553,14.80
5554,14.94
5555,15.06
5556,15.15
5557,15.21
5558,15.24
5559,15.22
5560,15.17
5561,15.09
5562,15.00
5563,14.89
5564,14.78
5565,14.67
5566,14.56
5567,14.48
5568,14.42
5569,14.39
5570,14.40
5571,14.46
5572,14.55
5573,14.66
5574,14.76
5575,14.82
5576,14.83
5577,14.79
5578,14.73
5579,14.67
5580,14.63
5581,14.63
5582,14.69
5583,14.76
5584,14.83
5585,14.87
5586,14.89
5587,14.89
5588,14.90
5589,14.93
5590,14.97
5591,15.05
5592,15.14
5593,15.22
5594,15.26
5595,15.25
5596,15.15
5597,14.97
5598,14.75
5599,14.51
5600,14.29
5601,14.11
5602,14.01
5603,13.97
5604,13.98
5605,14.01
5606,14.05
5607,14.11
5608,14.17
5609,14.25
5610,14.36
5611,14.51
5612,14.72
5613,14.93
5614,15.15
5615,15.33
5616,15.49
5617,15.62
5618,15.74
5619,15.86
5620,16.00
5621,16.16
5622,16.34
5623,16.52
5624,16.68
5625,16.80
5626,16.89
5627,16.94
5628,16.99
5629,17.04
5630,17.12
5631,17.22
5632,17.36
5633,17.51
5634,17.68
5635,17.84
5636,18.01
5637,18.16
5638,18.33
5639,18.48
5640,18.63
5641,18.76
5642,18.88
5643,18.98
5644,19.10
5645,19.23
5646,19.40
5647,19.62
5648,19.90
5649,20.19
5650,20.50
5651,20.75
5652,20.94
5653,21.01
5654,20.99
5655,20.88
5656,20.74
5657,20.58
5658,20.49
5659,20.46
5660,20.52
5661,20.64
5662,20.86
5663,21.11
5664,21.42
5665,21.73
5666,22.07
5667,22.43
5668,22.83
5669,23.24
5670,23.66
5671,24.05
5672,24.41
5673,24.69
5674,24.93
5675,25.09
5676,25.21
5677,25.27
5678,25.34
5679,25.43
5680,25.59
5681,25.79
5682,26.05
5683,26.32
5684,26.62
5685,26.90
5686,27.16
5687,27.37
5688,27.53
5689,27.64
5690,27.70
5691,27.74
5692,27.75
5693,27.71
5694,27.65
5695,27.55
5696,27.44
5697,27.31
5698,27.17
5699,27.04
5700,26.94
5701,26.88
5702,26.82
5703,26.79
5704,26.73
5705,26.66
5706,26.52
5707,26.34
5708,26.07
5709,25.77
5710,25.43
5711,25.12
5712,24.81
5713,24.55
5714,24.31
5715,24.10
5716,23.88
5717,23.66
5718,23.39
5719,23.10
5720,22.76
5721,22.42
5722,22.06
5723,21.70
5724,21.33
5725,20.97
5726,20.60
5727,20.26
5728,19.92
5729,19.62
5730,19.35
5731,19.13
5732,18.95
5733,18.84
5734,18.77
5735,18.74
5736,18.70
5737,18.65
5738,18.54
5739,18.41
5740,18.24
5741,18.07
5742,17.89
5743,17.75
5744,17.64
5745,17.58
5746,17.54
5747,17.50
5748,17.44
5749,17.35
5750,17.21
5751,17.05
5752,16.87
5753,16.72
5754,16.59
5755,16.51
5756,16.47
5757,16.46
5758,16.48
5759,16.53
5760,16.58
5761,16.64
5762,16.71
5763,16.79
5764,16.88
5765,16.96
5766,16.98
5767,16.94
5768,16.82
5769,16.66
5770,16.46
5771,16.29
5772,16.15
5773,16.09
5774,16.09
5775,16.14
5776,16.22
5777,16.28
5778,16.30
5779,16.27
5780,16.19
5781,16.11
5782,16.02
5783,15.95
5784,15.91
5785,15.90
5786,15.90
5787,15.88
5788,15.82
5789,15.73
5790,15.61
5791,15.49
5792,15.37
5793,15.27
5794,15.19
5795,15.12
5796,15.07
5797,15.02
5798,14.95
5799,14.86
5800,14.75
5801,14.65
5802,14.56
5803,14.51
5804,14.47
5805,14.45
5806,14.43
5807,14.39
5808,14.33
5809,14.26
5810,14.17
5811,14.10
5812,14.05
5813,14.02
5814,14.00
5815,14.00
5816,13.99
5817,13.98
5818,13.92
5819,13.82
5820,13.68
5821,13.54
5822,13.38
5823,13.22
5824,13.05
5825,12.88
5826,12.72
5827,12.57
5828,12.41
5829,12.24
5830,12.05
5831,11.88
5832,11.71
5833,11.56
5834,11.42
5835,11.29
5836,11.17
5837,11.08
5838,11.03
5839,11.05
5840,11.12
5841,11.25
5842,11.44
5843,11.66
5844,11.88
5845,12.06
5846,12.18
5847,12.22
5848,12.19
5849,12.12
5850,12.05
5851,11.97
5852,11.91
5853,11.87
5854,11.84
5855,11.80
5856,11.75
5857,11.68
5858,11.61
5859,11.56
5860,11.53
5861,11.52
5862,11.54
5863,11.56
5864,11.58
5865,11.54
5866,11.48
5867,11.39
5868,11.33
5869,11.30
5870,11.33
5871,11.43
5872,11.62
5873,11.88
5874,12.20
5875,12.54
5876,12.89
5877,13.24
5878,13.61
5879,13.97
5880,14.34
5881,14.69
5882,15.05
5883,15.39
5884,15.71
5885,15.98
5886,16.22
5887,16.42
5888,16.60
5889,16.74
5890,16.88
5891,16.98
5892,17.09
5893,17.18
5894,17.29
5895,17.39
5896,17.49
5897,17.58
5898,17.67
5899,17.73
5900,17.77
5901,17.79
5902,17.78
5903,17.76
5904,17.73
5905,17.69
5906,17.65
5907,17.61
5908,17.60
5909,17.61
5910,17.68
5911,17.77
5912,17.91
5913,18.07
5914,18.25
5915,18.42
5916,18.60
5917,18.75
5918,18.89
5919,19.00
5920,19.13
5921,19.27
5922,19.46
5923,19.68
5924,19.93
5925,20.18
5926,20.43
5927,20.65
5928,20.84
5929,21.00
5930,21.16
5931,21.32
5932,21.53
5933,21.76
5934,22.03
5935,22.29
5936,22.55
5937,22.76
5938,22.92
5939,23.01
5940,23.07
5941,23.10
5942,23.13
5943,23.15
5944,23.18
5945,23.18
5946,23.15
5947,23.07
5948,22.96
5949,22.82
5950,22.67
5951,22.54
5952,22.46
5953,22.43
5954,22.46
5955,22.52
5956,22.61
5957,22.72
5958,22.85
5959,22.98
5960,23.13
5961,23.31
5962,23.51
5963,23.73
5964,23.97
5965,24.19
5966,24.37
5967,24.48
5968,24.51
5969,24.44
5970,24.28
5971,24.08
5972,23.86
5973,23.64
5974,23.41
5975,23.19
5976,22.97
5977,22.79
5978,22.60
5979,22.41
5980,22.18
5981,21.95
5982,21.70
5983,21.49
5984,21.27
5985,21.04
5986,20.80
5987,20.58
5988,20.37
5989,20.20
5990,20.08
5991,20.03
5992,20.02
5993,20.06
5994,20.13
5995,20.23
5996,20.32
5997,20.40
5998,20.48
5999,20.54
6000,20.56
6001,20.52
6002,20.41
6003,20.23
6004,19.98
6005,19.68
6006,19.35
6007,19.02
6008,18.72
6009,18.50
6010,18.33
6011,18.22
6012,18.16
6013,18.16
6014,18.17
6015,18.19
6016,18.20
6017,18.23
6018,18.30
6019,18.41
6020,18.53
6021,18.64
6022,18.74
6023,18.81
6024,18.84
6025,18.82
6026,18.78
6027,18.75
6028,18.76
6029,18.82
6030,18.94
6031,19.10
6032,19.30
6033,19.50
6034,19.67
6035,19.77
6036,19.78
6037,19.73
6038,19.62
6039,19.49
6040,19.38
6041,19.30
6042,19.29
6043,19.34
6044,19.44
6045,19.55
6046,19.67
6047,19.75
6048,19.80
6049,19.82
6050,19.86
6051,19.94
6052,20.10
6053,20.32
6054,20.60
6055,20.89
6056,21.16
6057,21.35
6058,21.43
6059,21.40
6060,21.26
6061,21.06
6062,20.84
6063,20.65
6064,20.51
6065,20.45
6066,20.45
6067,20.48
6068,20.49
6069,20.46
6070,20.39
6071,20.27
6072,20.13
6073,19.97
6074,19.82
6075,19.70
6076,19.62
6077,19.58
6078,19.58
6079,19.61
6080,19.67
6081,19.74
6082,19.82
6083,19.88
6084,19.92
6085,19.93
6086,19.90
6087,19.84
6088,19.76
6089,19.67
6090,19.57
6091,19.47
6092,19.34
6093,19.19
6094,19.00
6095,18.79
6096,18.54
6097,18.28
6098,18.02
6099,17.81
6100,17.64
6101,17.50
6102,17.36
6103,17.22
6104,17.04
6105,16.84
6106,16.60
6107,16.35
6108,16.12
6109,15.92
6110,15.77
6111,15.70
6112,15.68
6113,15.71
6114,15.74
6115,15.77
6116,15.78
6117,15.77
6118,15.70
6119,15.61
6120,15.48
6121,15.36
6122,15.23
6123,15.11
6124,14.96
6125,14.81
6126,14.63
6127,14.43
6128,14.19
6129,13.90
6130,13.58
6131,13.26
6132,12.98
6133,12.78
6134,12.66
6135,12.63
6136,12.68
6137,12.80
6138,12.95
6139,13.10
6140,13.22
6141,13.28
6142,13.30
6143,13.30
6144,13.31
6145,13.38
6146,13.51
6147,13.71
6148,13.96
6149,14.21
6150,14.42
6151,14.55
6152,14.60
6153,14.56
6154,14.46
6155,14.32
6156,14.19
6157,14.08
6158,14.01
6159,13.96
6160,13.92
6161,13.86
6162,13.79
6163,13.71
6164,13.61
6165,13.51
6166,13.44
6167,13.42
6168,13.46
6169,13.57
6170,13.72
6171,13.92
6172,14.15
6173,14.40
6174,14.62
6175,14.82
6176,14.97
6177,15.07
6178,15.09
6179,15.03
6180,14.92
6181,14.79
6182,14.69
6183,14.61
6184,14.54
6185,14.50
6186,14.47
6187,14.44
6188,14.39
6189,14.32
6190,14.25
6191,14.22
6192,14.24
6193,14.32
6194,14.49
6195,14.72
6196,14.98
6197,15.23
6198,15.46
6199,15.65
6200,15.81
6201,15.93
6202,16.04
6203,16.15
6204,16.26
6205,16.38
6206,16.46
6207,16.49
6208,16.45
6209,16.32
6210,16.11
6211,15.85
6212,15.56
6213,15.26
6214,15.01
6215,14.81
6216,14.68
6217,14.62
6218,14.61
6219,14.64
6220,14.69
6221,14.75
6222,14.81
6223,14.87
6224,14.96
6225,15.07
6226,15.23
6227,15.43
6228,15.68
6229,15.95
6230,16.25
6231,16.52
6232,16.74
6233,16.89
6234,16.96
6235,16.95
6236,16.87
6237,16.72
6238,16.55
6239,16.37
6240,16.23
6241,16.14
6242,16.12
6243,16.17
6244,16.28
6245,16.44
6246,16.64
6247,16.85
6248,17.06
6249,17.26
6250,17.47
6251,17.70
6252,17.95
6253,18.23
6254,18.54
6255,18.85
6256,19.15
6257,19.37
6258,19.56
6259,19.67
6260,19.76
6261,19.84
6262,19.96
6263,20.14
6264,20.40
6265,20.72
6266,21.08
6267,21.44
6268,21.78
6269,22.06
6270,22.26
6271,22.40
6272,22.49
6273,22.52
6274,22.52
6275,22.47
6276,22.38
6277,22.26
6278,22.10
6279,21.89
6280,21.64
6281,21.38
6282,21.13
6283,20.91
6284,20.71
6285,20.56
6286,20.44
6287,20.38
6288,20.33
6289,20.32
6290,20.29
6291,20.26
6292,20.21
6293,20.18
6294,20.08
6295,19.95
6296,19.72
6297,19.41
6298,19.00
6299,18.52
6300,17.98
6301,17.44
6302,16.89
6303,16.40
6304,15.94
6305,15.55
6306,15.21
6307,14.92
6308,14.62
6309,14.34
6310,14.04
6311,13.77
6312,13.49
6313,13.24
6314,12.99
6315,12.75
6316,12.50
6317,12.24
6318,11.96
6319,11.72
6320,11.50
6321,11.34
6322,11.24
6323,11.22
6324,11.26
6325,11.35
6326,11.44
6327,11.52
6328,11.59
6329,11.64
6330,11.69
6331,11.75
6332,11.83
6333,11.95
6334,12.12
6335,12.32
6336,12.57
6337,12.81
6338,13.05
6339,13.28
6340,13.52
6341,13.75
6342,14.00
6343,14.23
6344,14.48
6345,14.72
6346,14.99
6347,15.24
6348,15.54
6349,15.84
6350,16.20
6351,16.55
6352,16.93
6353,17.29
6354,17.62
6355,17.90
6356,18.14
6357,18.31
6358,18.46
6359,18.57
6360,18.66
6361,18.75
6362,18.84
6363,18.92
6364,19.02
6365,19.11
6366,19.21
6367,19.32
6368,19.44
6369,19.53
6370,19.62
6371,19.68
6372,19.72
6373,19.73
6374,19.71
6375,19.70
6376,19.70
6377,19.73
6378,19.80
6379,19.91
6380,20.04
6381,20.17
6382,20.26
6383,20.32
6384,20.32
6385,20.28
6386,20.20
6387,20.12
6388,20.06
6389,20.02
6390,20.00
6391,19.97
6392,19.96
6393,19.93
6394,19.90
6395,19.85
6396,19.81
6397,19.78
6398,19.81
6399,19.89
6400,20.05
6401,20.27
6402,20.55
6403,20.88
6404,21.23
6405,21.56
6406,21.86
6407,22.08
6408,22.22
6409,22.27
6410,22.24
6411,22.16
6412,22.04
6413,21.92
6414,21.81
6415,21.71
6416,21.59
6417,21.45
6418,21.28
6419,21.08
6420,20.83
6421,20.57
6422,20.32
6423,20.12
6424,19.96
6425,19.86
6426,19.81
6427,19.81
6428,19.84
6429,19.90
6430,19.97
6431,20.05
6432,20.13
6433,20.22
6434,20.29
6435,20.35
6436,20.39
6437,20.40
6438,20.40
6439,20.39
6440,20.38
6441,20.38
6442,20.39
6443,20.38
6444,20.34
6445,20.25
6446,20.10
6447,19.89
6448,19.65
6449,19.40
6450,19.18
6451,19.02
6452,18.92
6453,18.90
6454,18.91
6455,18.96
6456,19.01
6457,19.04
6458,19.05
6459,19.06
6460,19.08
6461,19.17
6462,19.35
6463,19.60
6464,19.91
6465,20.21
6466,20.49
6467,20.71
6468,20.85
6469,20.90
6470,20.87
6471,20.80
6472,20.73
6473,20.68
6474,20.65
6475,20.65
6476,20.66
6477,20.66
6478,20.65
6479,20.62
6480,20.59
6481,20.55
6482,20.52
6483,20.51
6484,20.53
6485,20.56
6486,20.58
6487,20.60
6488,20.60
6489,20.58
6490,20.53
6491,20.45
6492,20.35
6493,20.25
6494,20.17
6495,20.12
6496,20.12
6497,20.14
6498,20.16
6499,20.16
6500,20.13
6501,20.07
6502,19.96
6503,19.83
6504,19.68
6505,19.58
6506,19.52
6507,19.53
6508,19.61
6509,19.74
6510,19.86
6511,19.94
6512,19.94
6513,19.85
6514,19.70
6515,19.52
6516,19.33
6517,19.17
6518,19.06
6519,19.02
6520,19.06
6521,19.18
6522,19.35
6523,19.53
6524,19.71
6525,19.84
6526,19.92
6527,19.95
6528,19.90
6529,19.81
6530,19.70
6531,19.60
6532,19.53
6533,19.49
6534,19.47
6535,19.45
6536,19.41
6537,19.33
6538,19.20
6539,19.03
6540,18.84
6541,18.65
6542,18.47
6543,18.33
6544,18.25
6545,18.23
6546,18.26
6547,18.33
6548,18.41
6549,18.49
6550,18.52
6551,18.52
6552,18.44
6553,18.32
6554,18.15
6555,17.94
6556,17.72
6557,17.50
6558,17.29
6559,17.11
6560,16.98
6561,16.88
6562,16.79
6563,16.73
6564,16.67
6565,16.62
6566,16.58
6567,16.53
6568,16.49
6569,16.46
6570,16.45
6571,16.47
6572,16.52
6573,16.59
6574,16.70
6575,16.85
6576,17.03
6577,17.20
6578,17.30
6579,17.36
6580,17.42
6581,17.51
6582,17.61
6583,17.66
6584,17.63
6585,17.51
6586,17.29
6587,16.98
6588,16.62
6589,16.26
6590,15.94
6591,15.70
6592,15.55
6593,15.49
6594,15.48
6595,15.50
6596,15.51
6597,15.48
6598,15.41
6599,15.30
6600,15.16
6601,15.01
6602,14.87
6603,14.74
6604,14.63
6605,14.53
6606,14.43
6607,14.31
6608,14.20
6609,14.11
6610,14.06
6611,14.04
6612,14.05
6613,14.11
6614,14.21
6615,14.34
6616,14.52
6617,14.73
6618,14.99
6619,15.27
6620,15.59
6621,15.91
6622,16.23
6623,16.49
6624,16.70
6625,16.82
6626,16.89
6627,16.91
6628,16.94
6629,17.00
6630,17.14
6631,17.34
6632,17.62
6633,17.91
6634,18.21
6635,18.48
6636,18.67
6637,18.78
6638,18.82
6639,18.81
6640,18.78
6641,18.75
6642,18.74
6643,18.75
6644,18.79
6645,18.84
6646,18.89
6647,18.91
6648,18.88
6649,18.81
6650,18.68
6651,18.52
6652,18.35
6653,18.20
6654,18.10
6655,18.05
6656,18.07
6657,18.13
6658,18.21
6659,18.30
6660,18.34
6661,18.34
6662,18.29
6663,18.19
6664,18.06
6665,17.89
6666,17.70
6667,17.51
6668,17.33
6669,17.16
6670,17.00
6671,16.87
6672,16.75
6673,16.69
6674,16.67
6675,16.71
6676,16.79
6677,16.89
6678,16.98
6679,17.05
6680,17.04
6681,16.96
6682,16.78
6683,16.53
6684,16.24
6685,15.93
6686,15.61
6687,15.32
6688,15.06
6689,14.86
6690,14.71
6691,14.62
6692,14.55
6693,14.51
6694,14.47
6695,14.45
6696,14.41
6697,14.40
6698,14.39
6699,14.40
6700,14.40
6701,14.39
6702,14.31
6703,14.16
6704,13.93
6705,13.65
6706,13.31
6707,12.98
6708,12.66
6709,12.43
6710,12.27
6711,12.19
6712,12.15
6713,12.13
6714,12.07
6715,11.96
6716,11.78
6717,11.55
6718,11.30
6719,11.08
6720,10.91
6721,10.81
6722,10.78
6723,10.82
6724,10.89
6725,10.95
6726,10.99
6727,11.01
6728,11.00
6729,10.98
6730,10.96
6731,10.97
6732,11.00
6733,11.08
6734,11.21
6735,11.34
6736,11.44
6737,11.47
6738,11.42
6739,11.34
6740,11.24
6741,11.18
6742,11.13
6743,11.10
6744,11.06
6745,10.99
6746,10.86
6747,10.67
6748,10.37
6749,10.01
6750,9.58
6751,9.14
6752,8.70
6753,8.33
6754,8.01
6755,7.77
6756,7.57
6757,7.42
6758,7.31
6759,7.24
6760,7.17
6761,7.15
6762,7.14
6763,7.17
6764,7.22
6765,7.28
6766,7.35
6767,7.40
6768,7.43
6769,7.47
6770,7.53
6771,7.66
6772,7.86
6773,8.12
6774,8.43
6775,8.74
6776,9.01
6777,9.18
6778,9.24
6779,9.19
6780,9.05
6781,8.87
6782,8.72
6783,8.63
6784,8.61
6785,8.65
6786,8.71
6787,8.74
6788,8.70
6789,8.58
6790,8.40
6791,8.19
6792,8.00
6793,7.91
6794,7.92
6795,8.02
6796,8.18
6797,8.34
6798,8.46
6799,8.48
6800,8.40
6801,8.22
6802,8.02
6803,7.84
6804,7.71
6805,7.62
6806,7.58
6807,7.57
6808,7.60
6809,7.64
6810,7.72
6811,7.86
6812,8.06
6813,8.32
6814,8.64
6815,8.98
6816,9.31
6817,9.59
6818,9.84
6819,10.03
6820,10.22
6821,10.42
6822,10.68
6823,10.97
6824,11.32
6825,11.68
6826,12.08
6827,12.48
6828,12.91
6829,13.33
6830,13.80
6831,14.28
6832,14.78
6833,15.27
6834,15.75
6835,16.19
6836,16.60
6837,16.93
6838,17.24
6839,17.49
6840,17.73
6841,17.93
6842,18.09
6843,18.19
6844,18.26
6845,18.27
6846,18.26
6847,18.22
6848,18.20
6849,18.22
6850,18.28
6851,18.36
6852,18.42
6853,18.45
6854,18.44
6855,18.41
6856,18.33
6857,18.26
6858,18.22
6859,18.21
6860,18.23
6861,18.28
6862,18.34
6863,18.38
6864,18.39
6865,18.36
6866,18.30
6867,18.21
6868,18.13
6869,18.08
6870,18.08
6871,18.12
6872,18.16
6873,18.15
6874,18.14
6875,18.14
6876,18.20
6877,18.31
6878,18.46
6879,18.63
6880,18.81
6881,18.98
6882,19.13
6883,19.27
6884,19.41
6885,19.55
6886,19.71
6887,19.90
6888,20.13
6889,20.36
6890,20.61
6891,20.83
6892,21.02
6893,21.15
6894,21.25
6895,21.30
6896,21.33
6897,21.33
6898,21.34
6899,21.37
6900,21.45
6901,21.57
6902,21.77
6903,22.02
6904,22.33
6905,22.63
6906,22.94
6907,23.19
6908,23.39
6909,23.52
6910,23.59
6911,23.61
6912,23.65
6913,23.72
6914,23.83
6915,23.99
6916,24.18
6917,24.35
6918,24.50
6919,24.59
6920,24.63
6921,24.62
6922,24.58
6923,24.53
6924,24.49
6925,24.47
6926,24.44
6927,24.40
6928,24.33
6929,24.25
6930,24.15
6931,24.08
6932,24.02
6933,24.03
6934,24.10
6935,24.22
6936,24.35
6937,24.43
6938,24.39
6939,24.19
6940,23.80
6941,23.31
6942,22.77
6943,22.27
6944,21.82
6945,21.47
6946,21.18
6947,20.98
6948,20.79
6949,20.62
6950,20.41
6951,20.19
6952,19.92
6953,19.65
6954,19.37
6955,19.15
6956,18.97
6957,18.86
6958,18.77
6959,18.71
6960,18.64
6961,18.56
6962,18.43
6963,18.24
6964,17.99
6965,17.69
6966,17.35
6967,17.02
6968,16.70
6969,16.42
6970,16.16
6971,15.92
6972,15.72
6973,15.55
6974,15.38
6975,15.23
6976,15.06
6977,14.91
6978,14.76
6979,14.62
6980,14.50
6981,14.40
6982,14.31
6983,14.24
6984,14.15
6985,14.06
6986,13.96
6987,13.87
6988,13.78
6989,13.72
6990,13.67
6991,13.64
6992,13.60
6993,13.54
6994,13.42
6995,13.25
6996,13.02
6997,12.73
6998,12.41
6999,12.10
7000,11.83
7001,11.63
7002,11.54
7003,11.55
7004,11.67
7005,11.86
7006,12.11
7007,12.37
7008,12.66
7009,12.93
7010,13.20
7011,13.46
7012,13.74
7013,14.01
7014,14.29
7015,14.55
7016,14.79
7017,14.97
7018,15.09
7019,15.14
7020,15.15
7021,15.13
7022,15.12
7023,15.12
7024,15.19
7025,15.33
7026,15.53
7027,15.76
7028,16.00
7029,16.21
7030,16.41
7031,16.57
7032,16.73
7033,16.89
7034,17.13
7035,17.43
7036,17.81
7037,18.22
7038,18.67
7039,19.09
7040,19.52
7041,19.88
7042,20.25
7043,20.60
7044,21.03
7045,21.51
7046,22.08
7047,22.68
7048,23.33
7049,23.95
7050,24.56
7051,25.09
7052,25.58
7053,25.99
7054,26.38
7055,26.73
7056,27.09
7057,27.44
7058,27.82
7059,28.18
7060,28.56
7061,28.91
7062,29.28
7063,29.61
7064,29.96
7065,30.27
7066,30.56
7067,30.82
7068,31.07
7069,31.30
7070,31.56
7071,31.80
7072,32.03
7073,32.23
7074,32.37
7075,32.41
7076,32.34
7077,32.17
7078,31.94
7079,31.70
7080,31.50
7081,31.37
7082,31.32
7083,31.34
7084,31.41
7085,31.46
7086,31.45
7087,31.38
7088,31.22
7089,31.02
7090,30.76
7091,30.49
7092,30.22
7093,29.97
7094,29.71
7095,29.48
7096,29.24
7097,29.04
7098,28.84
7099,28.65
7100,28.44
7101,28.23
7102,27.98
7103,27.70
7104,27.36
7105,26.98
7106,26.55
7107,26.13
7108,25.70
7109,25.33
7110,24.99
7111,24.72
7112,24.47
7113,24.29
7114,24.10
7115,23.91
7116,23.66
7117,23.38
7118,23.05
7119,22.72
7120,22.32
7121,21.90
7122,21.48
7123,21.13
7124,20.85
7125,20.68
7126,20.58
7127,20.56
7128,20.57
7129,20.60
7130,20.59
7131,20.54
7132,20.44
7133,20.34
7134,20.26
7135,20.26
7136,20.32
7137,20.46
7138,20.66
7139,20.90
7140,21.14
7141,21.36
7142,21.52
7143,21.62
7144,21.66
7145,21.64
7146,21.60
7147,21.54
7148,21.47
7149,21.40
7150,21.34
7151,21.30
7152,21.28
7153,21.28
7154,21.32
7155,21.39
7156,21.48
7157,21.59
7158,21.69
7159,21.78
7160,21.86
7161,21.93
7162,22.01
7163,22.11
7164,22.24
7165,22.38
7166,22.54
7167,22.67
7168,22.75
7169,22.76
7170,22.68
7171,22.55
7172,22.37
7173,22.19
7174,22.02
7175,21.89
7176,21.79
7177,21.72
7178,21.65
7179,21.56
7180,21.44
7181,21.28
7182,21.11
7183,20.96
7184,20.85
7185,20.83
7186,20.86
7187,20.96
7188,21.07
7189,21.25
7190,21.28
7191,21.16
7192,20.97
7193,20.79
7194,20.97
7195,20.90
7196,20.23
7197,19.29
7198,19.54
7199,21.56
7200,19.60
