1,184.97
2,249.99
3,249.99
4,228.87
5,151.00
6,66.45
7,-10.99
8,-54.27
9,-47.22
10,-5.84
11,38.68
12,67.73
13,77.58
14,70.76
15,52.77
16,30.89
17,14.91
18,7.93
19,10.40
20,18.05
21,26.46
22,32.24
23,33.51
24,30.95
25,26.27
26,21.28
27,17.75
28,15.94
29,15.85
30,16.49
31,17.02
32,16.91
33,16.20
34,15.20
35,14.17
36,13.06
37,11.89
38,10.67
39,9.58
40,8.73
41,8.18
42,8.05
43,8.35
44,9.19
45,10.46
46,12.15
47,14.10
48,16.23
49,18.36
50,20.41
51,22.26
52,23.88
53,25.18
54,26.20
55,26.89
56,27.24
57,27.24
58,26.89
59,26.21
60,25.17
61,23.83
62,22.19
63,20.39
64,18.39
65,16.37
66,14.32
67,12.43
68,10.70
69,9.32
70,8.20
71,7.49
72,7.06
73,6.94
74,6.93
75,7.02
76,7.11
77,7.23
78,7.35
79,7.46
80,7.62
81,7.85
82,8.19
83,8.59
84,9.10
85,9.66
86,10.31
87,10.98
88,11.71
89,12.44
90,13.27
91,14.11
92,15.03
93,15.88
94,16.69
95,17.36
96,17.96
97,18.44
98,18.91
99,19.34
100,19.81
101,20.26
102,20.80
103,21.35
104,21.96
105,22.51
106,23.03
107,23.47
108,23.88
109,24.26
110,24.64
111,24.93
112,25.15
113,25.33
114,25.51
115,25.67
116,25.82
117,25.91
118,25.99
119,26.04
120,26.06
121,26.06
122,26.09
123,26.15
124,26.18
125,26.20
126,26.18
127,26.18
128,26.15
129,26.08
130,25.92
131,25.71
132,25.41
133,25.04
134,24.57
135,24.03
136,23.41
137,22.79
138,22.19
139,21.71
140,21.37
141,21.21
142,21.18
143,21.29
144,21.42
145,21.56
146,21.58
147,21.51
148,21.31
149,21.03
150,20.69
151,20.35
152,20.00
153,19.65
154,19.22
155,18.75
156,18.25
157,17.74
158,17.19
159,16.65
160,16.23
161,15.98
162,15.89
163,15.98
164,16.17
165,16.44
166,16.70
167,16.92
168,17.11
169,17.27
170,17.42
171,17.54
172,17.69
173,17.89
174,18.14
175,18.38
176,18.62
177,18.85
178,19.10
179,19.29
180,19.46
181,19.58
182,19.70
183,19.84
184,20.03
185,20.30
186,20.66
187,21.09
188,21.51
189,21.87
190,22.12
191,22.22
192,22.12
193,21.78
194,21.23
195,20.58
196,19.91
197,19.33
198,18.86
199,18.54
200,18.38
201,18.36
202,18.38
203,18.43
204,18.46
205,18.46
206,18.36
207,18.20
208,17.96
209,17.69
210,17.40
211,17.07
212,16.71
213,16.36
214,16.00
215,15.68
216,15.35
217,15.04
218,14.71
219,14.39
220,14.02
221,13.67
222,13.33
223,13.04
224,12.76
225,12.50
226,12.21
227,11.96
228,11.71
229,11.47
230,11.20
231,10.91
232,10.62
233,10.38
234,10.17
235,10.00
236,9.86
237,9.74
238,9.61
239,9.45
240,9.34
241,9.31
242,9.37
243,9.52
244,9.75
245,10.05
246,10.40
247,10.73
248,11.00
249,11.18
250,11.27
251,11.26
252,11.18
253,11.07
254,10.95
255,10.82
256,10.67
257,10.50
258,10.32
259,10.16
260,10.04
261,9.98
262,10.02
263,10.18
264,10.40
265,10.64
266,10.86
267,11.02
268,11.09
269,11.02
270,10.81
271,10.48
272,10.10
273,9.74
274,9.39
275,9.10
276,8.87
277,8.71
278,8.65
279,8.69
280,8.80
281,8.99
282,9.19
283,9.41
284,9.61
285,9.76
286,9.83
287,9.79
288,9.70
289,9.60
290,9.54
291,9.50
292,9.52
293,9.61
294,9.79
295,10.03
296,10.29
297,10.53
298,10.75
299,10.93
300,11.06
301,11.15
302,11.19
303,11.22
304,11.25
305,11.28
306,11.29
307,11.28
308,11.21
309,11.09
310,10.88
311,10.55
312,10.12
313,9.62
314,9.03
315,8.44
316,7.86
317,7.42
318,7.11
319,7.00
320,7.04
321,7.21
322,7.40
323,7.57
324,7.61
325,7.46
326,7.10
327,6.61
328,6.11
329,5.68
330,5.37
331,5.20
332,5.18
333,5.26
334,5.39
335,5.50
336,5.52
337,5.46
338,5.31
339,5.10
340,4.88
341,4.69
342,4.58
343,4.51
344,4.51
345,4.56
346,4.74
347,5.03
348,5.43
349,5.91
350,6.46
351,7.02
352,7.58
353,8.04
354,8.45
355,8.73
356,8.96
357,9.12
358,9.33
359,9.64
360,10.14
361,10.76
362,11.51
363,12.28
364,13.04
365,13.66
366,14.12
367,14.37
368,14.50
369,14.50
370,14.52
371,14.56
372,14.72
373,14.95
374,15.27
375,15.66
376,16.14
377,16.62
378,17.14
379,17.61
380,18.07
381,18.52
382,18.94
383,19.30
384,19.60
385,19.80
386,19.92
387,19.94
388,19.91
389,19.85
390,19.79
391,19.73
392,19.67
393,19.58
394,19.45
395,19.27
396,19.05
397,18.81
398,18.55
399,18.33
400,18.10
401,17.90
402,17.69
403,17.49
404,17.26
405,16.98
406,16.56
407,16.07
408,15.46
409,14.80
410,14.12
411,13.50
412,12.95
413,12.54
414,12.24
415,12.06
416,11.99
417,12.02
418,12.14
419,12.30
420,12.40
421,12.44
422,12.42
423,12.38
424,12.34
425,12.30
426,12.34
427,12.51
428,12.86
429,13.31
430,13.82
431,14.33
432,14.82
433,15.23
434,15.56
435,15.75
436,15.88
437,15.95
438,16.07
439,16.24
440,16.52
441,16.87
442,17.30
443,17.74
444,18.17
445,18.53
446,18.80
447,18.94
448,18.98
449,18.91
450,18.80
451,18.67
452,18.59
453,18.55
454,18.57
455,18.62
456,18.74
457,18.88
458,19.07
459,19.24
460,19.40
461,19.52
462,19.62
463,19.70
464,19.77
465,19.82
466,19.94
467,20.10
468,20.35
469,20.68
470,21.11
471,21.61
472,22.14
473,22.62
474,23.06
475,23.38
476,23.56
477,23.55
478,23.44
479,23.28
480,23.13
481,23.00
482,22.94
483,22.99
484,23.22
485,23.54
486,23.90
487,24.20
488,24.45
489,24.65
490,24.81
491,24.93
492,25.05
493,25.18
494,25.38
495,25.64
496,26.02
497,26.48
498,27.08
499,27.73
500,28.44
501,29.18
502,29.97
503,30.74
504,31.48
505,32.07
506,32.50
507,32.74
508,32.83
509,32.75
510,32.56
511,32.31
512,32.14
513,32.07
514,32.08
515,32.10
516,32.06
517,31.93
518,31.69
519,31.36
520,30.99
521,30.65
522,30.40
523,30.26
524,30.24
525,30.36
526,30.56
527,30.79
528,30.95
529,31.02
530,30.94
531,30.70
532,30.29
533,29.75
534,29.15
535,28.61
536,28.18
537,27.91
538,27.79
539,27.86
540,28.11
541,28.47
542,28.85
543,29.20
544,29.45
545,29.60
546,29.61
547,29.53
548,29.39
549,29.24
550,29.05
551,28.82
552,28.53
553,28.18
554,27.73
555,27.19
556,26.57
557,25.96
558,25.34
559,24.78
560,24.23
561,23.77
562,23.38
563,23.09
564,22.81
565,22.55
566,22.31
567,22.13
568,21.99
569,21.84
570,21.68
571,21.53
572,21.45
573,21.47
574,21.59
575,21.81
576,22.11
577,22.47
578,22.86
579,23.22
580,23.51
581,23.69
582,23.76
583,23.75
584,23.73
585,23.73
586,23.77
587,23.80
588,23.79
589,23.77
590,23.72
591,23.61
592,23.35
593,22.96
594,22.50
595,22.06
596,21.61
597,21.21
598,20.80
599,20.45
600,20.13
601,19.81
602,19.41
603,18.94
604,18.41
605,17.91
606,17.42
607,17.01
608,16.67
609,16.48
610,16.37
611,16.35
612,16.34
613,16.36
614,16.37
615,16.33
616,16.20
617,16.00
618,15.79
619,15.63
620,15.53
621,15.50
622,15.56
623,15.68
624,15.84
625,15.99
626,16.09
627,16.13
628,16.08
629,15.96
630,15.78
631,15.56
632,15.37
633,15.25
634,15.22
635,15.25
636,15.32
637,15.38
638,15.40
639,15.37
640,15.30
641,15.24
642,15.21
643,15.24
644,15.33
645,15.46
646,15.69
647,15.98
648,16.37
649,16.75
650,17.13
651,17.45
652,17.76
653,18.07
654,18.46
655,18.86
656,19.33
657,19.82
658,20.41
659,21.02
660,21.68
661,22.26
662,22.81
663,23.25
664,23.61
665,23.86
666,24.09
667,24.31
668,24.63
669,25.00
670,25.46
671,25.93
672,26.44
673,26.92
674,27.32
675,27.56
676,27.62
677,27.52
678,27.33
679,27.08
680,26.80
681,26.50
682,26.22
683,25.99
684,25.78
685,25.57
686,25.34
687,25.12
688,24.87
689,24.64
690,24.35
691,24.04
692,23.67
693,23.28
694,22.87
695,22.46
696,22.04
697,21.67
698,21.27
699,20.90
700,20.52
701,20.23
702,20.00
703,19.87
704,19.73
705,19.53
706,19.22
707,18.84
708,18.37
709,17.84
710,17.22
711,16.62
712,16.13
713,15.83
714,15.71
715,15.75
716,15.91
717,16.12
718,16.31
719,16.43
720,16.48
721,16.48
722,16.47
723,16.49
724,16.59
725,16.77
726,17.03
727,17.33
728,17.64
729,17.94
730,18.24
731,18.54
732,18.79
733,18.97
734,19.07
735,19.04
736,18.87
737,18.56
738,18.19
739,17.81
740,17.53
741,17.37
742,17.38
743,17.59
744,18.02
745,18.59
746,19.22
747,19.76
748,20.19
749,20.48
750,20.66
751,20.76
752,20.88
753,21.06
754,21.33
755,21.65
756,22.01
757,22.36
758,22.74
759,23.09
760,23.39
761,23.60
762,23.78
763,23.94
764,24.12
765,24.29
766,24.51
767,24.75
768,24.99
769,25.16
770,25.28
771,25.38
772,25.44
773,25.45
774,25.33
775,25.09
776,24.77
777,24.44
778,24.12
779,23.82
780,23.55
781,23.34
782,23.19
783,23.09
784,22.95
785,22.78
786,22.56
787,22.35
788,22.14
789,21.98
790,21.81
791,21.64
792,21.39
793,21.11
794,20.77
795,20.37
796,19.91
797,19.47
798,19.13
799,18.91
800,18.78
801,18.74
802,18.78
803,18.90
804,19.00
805,19.07
806,19.11
807,19.20
808,19.35
809,19.53
810,19.73
811,19.91
812,20.07
813,20.16
814,20.15
815,20.07
816,19.91
817,19.70
818,19.42
819,19.09
820,18.74
821,18.40
822,18.11
823,17.85
824,17.59
825,17.38
826,17.23
827,17.17
828,17.20
829,17.33
830,17.52
831,17.79
832,18.13
833,18.52
834,18.95
835,19.34
836,19.65
837,19.84
838,20.01
839,20.17
840,20.40
841,20.68
842,21.09
843,21.59
844,22.20
845,22.81
846,23.33
847,23.68
848,23.88
849,23.96
850,23.99
851,23.94
852,23.87
853,23.81
854,23.83
855,23.87
856,23.93
857,23.96
858,24.01
859,24.07
860,24.10
861,24.07
862,23.99
863,23.90
864,23.80
865,23.63
866,23.33
867,22.98
868,22.62
869,22.32
870,22.05
871,21.82
872,21.64
873,21.52
874,21.41
875,21.28
876,21.07
877,20.84
878,20.57
879,20.28
880,19.91
881,19.50
882,19.05
883,18.64
884,18.24
885,17.89
886,17.56
887,17.30
888,17.08
889,16.92
890,16.72
891,16.46
892,16.10
893,15.66
894,15.13
895,14.63
896,14.18
897,13.85
898,13.63
899,13.56
900,13.59
901,13.68
902,13.74
903,13.73
904,13.60
905,13.35
906,12.99
907,12.58
908,12.19
909,11.91
910,11.77
911,11.81
912,11.99
913,12.30
914,12.65
915,12.95
916,13.16
917,13.24
918,13.24
919,13.14
920,13.00
921,12.90
922,12.94
923,13.14
924,13.51
925,13.98
926,14.56
927,15.15
928,15.72
929,16.20
930,16.62
931,16.99
932,17.38
933,17.75
934,18.17
935,18.58
936,19.02
937,19.39
938,19.71
939,19.97
940,20.26
941,20.55
942,20.86
943,21.15
944,21.48
945,21.82
946,22.19
947,22.51
948,22.80
949,23.00
950,23.18
951,23.32
952,23.45
953,23.56
954,23.69
955,23.81
956,23.90
957,23.89
958,23.79
959,23.61
960,23.38
961,23.11
962,22.80
963,22.50
964,22.28
965,22.16
966,22.09
967,22.11
968,22.17
969,22.30
970,22.42
971,22.49
972,22.45
973,22.31
974,22.03
975,21.68
976,21.27
977,20.85
978,20.44
979,20.11
980,19.91
981,19.85
982,19.90
983,20.00
984,20.10
985,20.20
986,20.23
987,20.22
988,20.09
989,19.88
990,19.61
991,19.31
992,18.98
993,18.63
994,18.23
995,17.82
996,17.39
997,16.97
998,16.57
999,16.22
1000,15.88
1001,15.62
1002,15.43
1003,15.41
1004,15.53
1005,15.72
1006,15.90
1007,16.02
1008,16.08
1009,16.08
1010,16.01
1011,15.85
1012,15.66
1013,15.53
1014,15.53
1015,15.65
1016,15.88
1017,16.20
1018,16.67
1019,17.23
1020,17.84
1021,18.37
1022,18.85
1023,19.26
1024,19.64
1025,19.97
1026,20.26
1027,20.49
1028,20.68
1029,20.82
1030,20.94
1031,21.03
1032,21.08
1033,21.05
1034,20.92
1035,20.65
1036,20.25
1037,19.74
1038,19.16
1039,18.62
1040,18.18
1041,17.91
1042,17.81
1043,17.88
1044,18.07
1045,18.32
1046,18.53
1047,18.65
1048,18.67
1049,18.68
1050,18.69
1051,18.72
1052,18.72
1053,18.73
1054,18.78
1055,18.84
1056,18.84
1057,18.75
1058,18.63
1059,18.55
1060,18.55
1061,18.62
1062,18.75
1063,18.93
1064,19.13
1065,19.33
1066,19.43
1067,19.41
1068,19.23
1069,18.97
1070,18.64
1071,18.28
1072,17.88
1073,17.46
1074,17.06
1075,16.70
1076,16.36
1077,16.04
1078,15.71
1079,15.42
1080,15.14
1081,14.88
1082,14.61
1083,14.37
1084,14.18
1085,14.08
1086,14.00
1087,13.92
1088,13.76
1089,13.57
1090,13.32
1091,13.02
1092,12.63
1093,12.15
1094,11.62
1095,11.11
1096,10.64
1097,10.25
1098,9.99
1099,9.90
1100,9.96
1101,10.15
1102,10.44
1103,10.80
1104,11.18
1105,11.55
1106,11.86
1107,12.10
1108,12.27
1109,12.32
1110,12.25
1111,12.07
1112,11.83
1113,11.55
1114,11.27
1115,11.00
1116,10.77
1117,10.62
1118,10.57
1119,10.63
1120,10.77
1121,10.95
1122,11.17
1123,11.38
1124,11.54
1125,11.67
1126,11.77
1127,11.87
1128,12.01
1129,12.21
1130,12.55
1131,12.97
1132,13.40
1133,13.77
1134,14.05
1135,14.21
1136,14.32
1137,14.37
1138,14.41
1139,14.46
1140,14.58
1141,14.79
1142,15.09
1143,15.42
1144,15.72
1145,15.93
1146,16.05
1147,16.08
1148,16.02
1149,15.90
1150,15.75
1151,15.59
1152,15.43
1153,15.29
1154,15.17
1155,15.08
1156,15.00
1157,14.93
1158,14.92
1159,14.97
1160,15.11
1161,15.32
1162,15.60
1163,15.92
1164,16.30
1165,16.68
1166,17.10
1167,17.50
1168,17.94
1169,18.38
1170,18.86
1171,19.33
1172,19.79
1173,20.23
1174,20.71
1175,21.20
1176,21.74
1177,22.27
1178,22.85
1179,23.41
1180,23.93
1181,24.35
1182,24.67
1183,24.86
1184,24.95
1185,24.92
1186,24.86
1187,24.78
1188,24.71
1189,24.66
1190,24.64
1191,24.63
1192,24.60
1193,24.54
1194,24.49
1195,24.43
1196,24.32
1197,24.15
1198,23.92
1199,23.70
1200,23.52
1201,23.41
1202,23.36
1203,23.40
1204,23.48
1205,23.58
1206,23.64
1207,23.64
1208,23.57
1209,23.45
1210,23.29
1211,23.15
1212,23.04
1213,22.98
1214,22.94
1215,22.90
1216,22.77
1217,22.57
1218,22.27
1219,21.90
1220,21.51
1221,21.19
1222,20.95
1223,20.86
1224,20.90
1225,21.07
1226,21.29
1227,21.51
1228,21.65
1229,21.71
1230,21.70
1231,21.66
1232,21.65
1233,21.68
1234,21.74
1235,21.80
1236,21.87
1237,21.97
1238,22.04
1239,22.07
1240,22.04
1241,21.99
1242,21.92
1243,21.83
1244,21.71
1245,21.59
1246,21.50
1247,21.47
1248,21.46
1249,21.48
1250,21.48
1251,21.49
1252,21.44
1253,21.33
1254,21.14
1255,20.87
1256,20.51
1257,20.09
1258,19.65
1259,19.26
1260,18.93
1261,18.67
1262,18.45
1263,18.32
1264,18.24
1265,18.23
1266,18.15
1267,18.01
1268,17.78
1269,17.49
1270,17.07
1271,16.58
1272,16.01
1273,15.43
1274,14.90
1275,14.48
1276,14.21
1277,14.12
1278,14.21
1279,14.43
1280,14.71
1281,14.99
1282,15.19
1283,15.31
1284,15.36
1285,15.36
1286,15.32
1287,15.30
1288,15.30
1289,15.33
1290,15.35
1291,15.33
1292,15.22
1293,15.02
1294,14.70
1295,14.31
1296,13.88
1297,13.50
1298,13.18
1299,12.95
1300,12.73
1301,12.50
1302,12.23
1303,11.89
1304,11.48
1305,11.04
1306,10.60
1307,10.27
1308,10.07
1309,10.05
1310,10.20
1311,10.47
1312,10.80
1313,11.12
1314,11.44
1315,11.74
1316,12.02
1317,12.25
1318,12.50
1319,12.79
1320,13.15
1321,13.57
1322,14.02
1323,14.43
1324,14.82
1325,15.11
1326,15.30
1327,15.36
1328,15.33
1329,15.26
1330,15.21
1331,15.17
1332,15.17
1333,15.19
1334,15.27
1335,15.41
1336,15.64
1337,15.88
1338,16.09
1339,16.24
1340,16.37
1341,16.48
1342,16.57
1343,16.63
1344,16.69
1345,16.74
1346,16.80
1347,16.87
1348,16.92
1349,16.96
1350,16.94
1351,16.85
1352,16.69
1353,16.48
1354,16.24
1355,16.01
1356,15.78
1357,15.58
1358,15.34
1359,15.08
1360,14.76
1361,14.38
1362,13.90
1363,13.37
1364,12.81
1365,12.34
1366,11.94
1367,11.66
1368,11.41
1369,11.19
1370,10.90
1371,10.55
1372,10.11
1373,9.64
1374,9.14
1375,8.69
1376,8.32
1377,8.13
1378,8.09
1379,8.19
1380,8.32
1381,8.39
1382,8.32
1383,8.12
1384,7.77
1385,7.35
1386,6.90
1387,6.54
1388,6.32
1389,6.30
1390,6.46
1391,6.74
1392,7.02
1393,7.24
1394,7.35
1395,7.32
1396,7.11
1397,6.77
1398,6.42
1399,6.10
1400,5.89
1401,5.83
1402,5.99
1403,6.35
1404,6.84
1405,7.29
1406,7.65
1407,7.91
1408,8.13
1409,8.30
1410,8.42
1411,8.47
1412,8.54
1413,8.64
1414,8.82
1415,9.03
1416,9.28
1417,9.51
1418,9.73
1419,9.89
1420,10.09
1421,10.31
1422,10.63
1423,10.95
1424,11.28
1425,11.60
1426,11.96
1427,12.31
1428,12.63
1429,12.84
1430,12.95
1431,13.01
1432,13.05
1433,13.10
1434,13.20
1435,13.33
1436,13.44
1437,13.47
1438,13.40
1439,13.22
1440,12.92
1441,12.54
1442,12.08
1443,11.61
1444,11.09
1445,10.59
1446,10.11
1447,9.70
1448,9.31
1449,8.90
1450,8.42
1451,7.92
1452,7.41
1453,7.00
1454,6.68
1455,6.42
1456,6.15
1457,5.90
1458,5.63
1459,5.39
1460,5.13
1461,4.88
1462,4.62
1463,4.38
1464,4.14
1465,3.91
1466,3.69
1467,3.51
1468,3.35
1469,3.24
1470,3.20
1471,3.26
1472,3.38
1473,3.54
1474,3.72
1475,3.86
1476,3.92
1477,3.90
1478,3.82
1479,3.71
1480,3.63
1481,3.62
1482,3.80
1483,4.14
1484,4.63
1485,5.17
1486,5.78
1487,6.36
1488,6.92
1489,7.39
1490,7.83
1491,8.19
1492,8.54
1493,8.83
1494,9.16
1495,9.51
1496,9.99
1497,10.54
1498,11.25
1499,12.01
1500,12.84
1501,13.66
1502,14.56
1503,15.46
1504,16.40
1505,17.28
1506,18.19
1507,19.03
1508,19.86
1509,20.63
1510,21.39
1511,22.06
1512,22.64
1513,23.04
1514,23.38
1515,23.59
1516,23.74
1517,23.76
1518,23.74
1519,23.68
1520,23.67
1521,23.70
1522,23.80
1523,23.94
1524,24.10
1525,24.25
1526,24.43
1527,24.60
1528,24.76
1529,24.88
1530,24.99
1531,25.10
1532,25.22
1533,25.28
1534,25.28
1535,25.22
1536,25.11
1537,24.96
1538,24.78
1539,24.59
1540,24.44
1541,24.38
1542,24.44
1543,24.60
1544,24.79
1545,24.98
1546,25.09
1547,25.13
1548,25.05
1549,24.85
1550,24.51
1551,24.13
1552,23.70
1553,23.30
1554,22.88
1555,22.48
1556,22.03
1557,21.56
1558,21.03
1559,20.51
1560,19.96
1561,19.47
1562,19.00
1563,18.62
1564,18.29
1565,18.04
1566,17.78
1567,17.50
1568,17.11
1569,16.65
1570,16.04
1571,15.37
1572,14.61
1573,13.87
1574,13.15
1575,12.52
1576,11.99
1577,11.60
1578,11.25
1579,10.94
1580,10.58
1581,10.26
1582,9.99
1583,9.84
1584,9.79
1585,9.83
1586,9.91
1587,9.99
1588,9.97
1589,9.86
1590,9.63
1591,9.33
1592,8.99
1593,8.67
1594,8.35
1595,8.09
1596,7.83
1597,7.57
1598,7.28
1599,6.95
1600,6.59
1601,6.23
1602,5.90
1603,5.67
1604,5.54
1605,5.50
1606,5.54
1607,5.67
1608,5.90
1609,6.16
1610,6.39
1611,6.56
1612,6.76
1613,6.95
1614,7.14
1615,7.29
1616,7.47
1617,7.72
1618,8.09
1619,8.54
1620,9.08
1621,9.69
1622,10.41
1623,11.12
1624,11.80
1625,12.28
1626,12.63
1627,12.83
1628,12.99
1629,13.14
1630,13.39
1631,13.70
1632,14.14
1633,14.63
1634,15.21
1635,15.75
1636,16.35
1637,16.93
1638,17.57
1639,18.20
1640,18.91
1641,19.61
1642,20.37
1643,21.06
1644,21.74
1645,22.28
1646,22.81
1647,23.29
1648,23.83
1649,24.38
1650,25.03
1651,25.70
1652,26.41
1653,27.03
1654,27.60
1655,28.02
1656,28.34
1657,28.53
1658,28.72
1659,28.88
1660,29.07
1661,29.24
1662,29.45
1663,29.69
1664,29.93
1665,30.11
1666,30.21
1667,30.27
1668,30.30
1669,30.30
1670,30.26
1671,30.20
1672,30.16
1673,30.15
1674,30.19
1675,30.27
1676,30.44
1677,30.72
1678,31.07
1679,31.43
1680,31.72
1681,31.91
1682,31.98
1683,31.91
1684,31.69
1685,31.33
1686,30.90
1687,30.44
1688,30.00
1689,29.64
1690,29.44
1691,29.43
1692,29.60
1693,29.91
1694,30.33
1695,30.78
1696,31.17
1697,31.43
1698,31.49
1699,31.40
1700,31.17
1701,30.83
1702,30.45
1703,30.08
1704,29.79
1705,29.62
1706,29.56
1707,29.63
1708,29.77
1709,29.93
1710,30.02
1711,30.03
1712,29.92
1713,29.69
1714,29.30
1715,28.85
1716,28.39
1717,27.98
1718,27.60
1719,27.28
1720,27.02
1721,26.84
1722,26.69
1723,26.52
1724,26.29
1725,26.03
1726,25.71
1727,25.38
1728,25.07
1729,24.84
1730,24.68
1731,24.63
1732,24.64
1733,24.72
1734,24.78
1735,24.80
1736,24.66
1737,24.38
1738,23.92
1739,23.38
1740,22.79
1741,22.22
1742,21.70
1743,21.26
1744,20.86
1745,20.52
1746,20.17
1747,19.86
1748,19.49
1749,19.11
1750,18.72
1751,18.40
1752,18.13
1753,17.94
1754,17.75
1755,17.62
1756,17.47
1757,17.33
1758,17.15
1759,16.98
1760,16.80
1761,16.63
1762,16.41
1763,16.14
1764,15.85
1765,15.61
1766,15.45
1767,15.37
1768,15.30
1769,15.30
1770,15.30
1771,15.34
1772,15.32
1773,15.24
1774,15.10
1775,14.92
1776,14.67
1777,14.37
1778,14.06
1779,13.79
1780,13.56
1781,13.39
1782,13.24
1783,13.13
1784,13.02
1785,12.92
1786,12.88
1787,12.92
1788,13.04
1789,13.21
1790,13.40
1791,13.64
1792,13.98
1793,14.36
1794,14.74
1795,15.07
1796,15.40
1797,15.71
1798,16.01
1799,16.24
1800,16.49
1801,16.77
1802,17.14
1803,17.55
1804,18.01
1805,18.46
1806,18.88
1807,19.20
1808,19.44
1809,19.58
1810,19.67
1811,19.71
1812,19.78
1813,19.86
1814,20.01
1815,20.18
1816,20.37
1817,20.55
1818,20.74
1819,20.94
1820,21.16
1821,21.37
1822,21.56
1823,21.71
1824,21.84
1825,21.98
1826,22.16
1827,22.33
1828,22.50
1829,22.64
1830,22.82
1831,22.99
1832,23.15
1833,23.25
1834,23.28
1835,23.25
1836,23.12
1837,22.91
1838,22.67
1839,22.42
1840,22.19
1841,21.98
1842,21.82
1843,21.73
1844,21.71
1845,21.75
1846,21.80
1847,21.87
1848,21.90
1849,21.89
1850,21.76
1851,21.52
1852,21.16
1853,20.71
1854,20.21
1855,19.71
1856,19.20
1857,18.78
1858,18.48
1859,18.34
1860,18.32
1861,18.39
1862,18.47
1863,18.55
1864,18.55
1865,18.50
1866,18.33
1867,18.07
1868,17.74
1869,17.41
1870,17.07
1871,16.72
1872,16.36
1873,16.00
1874,15.64
1875,15.28
1876,14.92
1877,14.56
1878,14.21
1879,13.91
1880,13.68
1881,13.56
1882,13.57
1883,13.73
1884,13.98
1885,14.27
1886,14.60
1887,14.93
1888,15.26
1889,15.54
1890,15.84
1891,16.14
1892,16.58
1893,17.10
1894,17.75
1895,18.42
1896,19.18
1897,19.92
1898,20.74
1899,21.51
1900,22.38
1901,23.25
1902,24.22
1903,25.21
1904,26.34
1905,27.48
1906,28.66
1907,29.69
1908,30.62
1909,31.39
1910,32.16
1911,32.85
1912,33.56
1913,34.24
1914,34.93
1915,35.55
1916,36.06
1917,36.38
1918,36.57
1919,36.58
1920,36.46
1921,36.25
1922,36.04
1923,35.87
1924,35.76
1925,35.68
1926,35.64
1927,35.58
1928,35.43
1929,35.14
1930,34.69
1931,34.19
1932,33.65
1933,33.15
1934,32.65
1935,32.21
1936,31.84
1937,31.59
1938,31.35
1939,31.14
1940,30.87
1941,30.60
1942,30.30
1943,30.02
1944,29.71
1945,29.43
1946,29.10
1947,28.80
1948,28.46
1949,28.11
1950,27.67
1951,27.21
1952,26.70
1953,26.17
1954,25.56
1955,24.93
1956,24.22
1957,23.51
1958,22.74
1959,21.98
1960,21.20
1961,20.52
1962,19.94
1963,19.54
1964,19.28
1965,19.20
1966,19.23
1967,19.34
1968,19.42
1969,19.44
1970,19.29
1971,18.96
1972,18.46
1973,17.89
1974,17.33
1975,16.87
1976,16.57
1977,16.48
1978,16.62
1979,16.98
1980,17.52
1981,18.09
1982,18.63
1983,19.08
1984,19.45
1985,19.71
1986,19.87
1987,19.95
1988,20.05
1989,20.22
1990,20.48
1991,20.75
1992,20.98
1993,21.13
1994,21.22
1995,21.22
1996,21.10
1997,20.88
1998,20.67
1999,20.51
2000,20.42
2001,20.36
2002,20.34
2003,20.36
2004,20.44
2005,20.53
2006,20.62
2007,20.71
2008,20.81
2009,20.93
2010,21.06
2011,21.21
2012,21.39
2013,21.55
2014,21.74
2015,21.89
2016,22.00
2017,22.06
2018,22.05
2019,22.02
2020,22.03
2021,22.16
2022,22.36
2023,22.64
2024,22.93
2025,23.24
2026,23.51
2027,23.67
2028,23.64
2029,23.37
2030,22.87
2031,22.24
2032,21.56
2033,20.93
2034,20.40
2035,20.04
2036,19.86
2037,19.87
2038,20.00
2039,20.13
2040,20.14
2041,19.98
2042,19.59
2043,19.06
2044,18.39
2045,17.73
2046,17.16
2047,16.78
2048,16.54
2049,16.40
2050,16.30
2051,16.22
2052,16.12
2053,16.01
2054,15.84
2055,15.69
2056,15.61
2057,15.64
2058,15.76
2059,15.91
2060,16.06
2061,16.19
2062,16.28
2063,16.30
2064,16.26
2065,16.20
2066,16.19
2067,16.25
2068,16.31
2069,16.35
2070,16.38
2071,16.40
2072,16.41
2073,16.39
2074,16.33
2075,16.26
2076,16.20
2077,16.17
2078,16.18
2079,16.24
2080,16.36
2081,16.50
2082,16.68
2083,16.85
2084,17.04
2085,17.21
2086,17.38
2087,17.52
2088,17.68
2089,17.85
2090,18.08
2091,18.37
2092,18.74
2093,19.16
2094,19.65
2095,20.14
2096,20.64
2097,21.06
2098,21.42
2099,21.67
2100,21.87
2101,22.00
2102,22.15
2103,22.32
2104,22.56
2105,22.79
2106,23.02
2107,23.22
2108,23.43
2109,23.61
2110,23.72
2111,23.73
2112,23.64
2113,23.48
2114,23.27
2115,23.01
2116,22.67
2117,22.29
2118,21.86
2119,21.45
2120,21.03
2121,20.62
2122,20.19
2123,19.78
2124,19.36
2125,18.92
2126,18.41
2127,17.89
2128,17.33
2129,16.77
2130,16.17
2131,15.59
2132,15.01
2133,14.51
2134,14.05
2135,13.67
2136,13.34
2137,13.11
2138,12.93
2139,12.79
2140,12.65
2141,12.50
2142,12.35
2143,12.26
2144,12.25
2145,12.30
2146,12.43
2147,12.64
2148,12.95
2149,13.29
2150,13.66
2151,14.01
2152,14.43
2153,14.88
2154,15.43
2155,16.02
2156,16.73
2157,17.52
2158,18.39
2159,19.20
2160,19.94
2161,20.55
2162,21.06
2163,21.44
2164,21.74
2165,21.93
2166,22.08
2167,22.16
2168,22.23
2169,22.25
2170,22.22
2171,22.13
2172,22.01
2173,21.93
2174,21.88
2175,21.82
2176,21.71
2177,21.55
2178,21.39
2179,21.22
2180,20.98
2181,20.71
2182,20.48
2183,20.35
2184,20.35
2185,20.48
2186,20.71
2187,21.02
2188,21.33
2189,21.61
2190,21.80
2191,21.93
2192,21.95
2193,21.89
2194,21.77
2195,21.65
2196,21.55
2197,21.45
2198,21.35
2199,21.24
2200,21.12
2201,20.99
2202,20.87
2203,20.78
2204,20.76
2205,20.82
2206,20.93
2207,21.06
2208,21.17
2209,21.26
2210,21.32
2211,21.34
2212,21.37
2213,21.40
2214,21.43
2215,21.43
2216,21.39
2217,21.29
2218,21.19
2219,21.09
2220,21.03
2221,21.03
2222,21.10
2223,21.26
2224,21.46
2225,21.68
2226,21.84
2227,21.90
2228,21.84
2229,21.65
2230,21.39
2231,21.12
2232,20.89
2233,20.71
2234,20.58
2235,20.52
2236,20.56
2237,20.71
2238,20.92
2239,21.16
2240,21.42
2241,21.65
2242,21.86
2243,22.03
2244,22.22
2245,22.39
2246,22.54
2247,22.65
2248,22.82
2249,23.05
2250,23.35
2251,23.68
2252,24.02
2253,24.35
2254,24.65
2255,24.86
2256,24.96
2257,24.93
2258,24.80
2259,24.61
2260,24.40
2261,24.19
2262,24.01
2263,23.89
2264,23.83
2265,23.86
2266,23.97
2267,24.12
2268,24.29
2269,24.47
2270,24.66
2271,24.83
2272,24.99
2273,25.14
2274,25.33
2275,25.55
2276,25.83
2277,26.15
2278,26.60
2279,27.12
2280,27.71
2281,28.26
2282,28.74
2283,29.12
2284,29.39
2285,29.47
2286,29.39
2287,29.17
2288,28.90
2289,28.63
2290,28.39
2291,28.24
2292,28.21
2293,28.30
2294,28.47
2295,28.65
2296,28.82
2297,28.94
2298,28.98
2299,28.92
2300,28.78
2301,28.63
2302,28.50
2303,28.41
2304,28.36
2305,28.36
2306,28.43
2307,28.55
2308,28.65
2309,28.72
2310,28.76
2311,28.76
2312,28.68
2313,28.57
2314,28.44
2315,28.33
2316,28.18
2317,28.01
2318,27.82
2319,27.64
2320,27.43
2321,27.18
2322,26.84
2323,26.48
2324,26.10
2325,25.78
2326,25.51
2327,25.31
2328,25.12
2329,24.93
2330,24.67
2331,24.38
2332,24.04
2333,23.69
2334,23.31
2335,22.96
2336,22.61
2337,22.33
2338,22.06
2339,21.81
2340,21.46
2341,21.06
2342,20.58
2343,20.08
2344,19.50
2345,18.92
2346,18.33
2347,17.87
2348,17.46
2349,17.14
2350,16.75
2351,16.38
2352,15.96
2353,15.53
2354,15.02
2355,14.49
2356,13.93
2357,13.43
2358,12.96
2359,12.58
2360,12.28
2361,12.09
2362,12.05
2363,12.15
2364,12.34
2365,12.58
2366,12.85
2367,13.15
2368,13.49
2369,13.84
2370,14.21
2371,14.55
2372,14.95
2373,15.39
2374,15.89
2375,16.39
2376,16.92
2377,17.42
2378,17.91
2379,18.34
2380,18.75
2381,19.10
2382,19.45
2383,19.77
2384,20.07
2385,20.33
2386,20.61
2387,20.90
2388,21.22
2389,21.55
2390,21.91
2391,22.29
2392,22.67
2393,23.01
2394,23.28
2395,23.42
2396,23.42
2397,23.28
2398,23.02
2399,22.65
2400,22.19
2401,21.68
2402,21.18
2403,20.73
2404,20.31
2405,19.96
2406,19.69
2407,19.58
2408,19.56
2409,19.62
2410,19.63
2411,19.61
2412,19.51
2413,19.36
2414,19.17
2415,18.97
2416,18.75
2417,18.53
2418,18.36
2419,18.23
2420,18.17
2421,18.14
2422,18.14
2423,18.17
2424,18.24
2425,18.36
2426,18.53
2427,18.78
2428,19.09
2429,19.42
2430,19.70
2431,19.89
2432,19.95
2433,19.89
2434,19.69
2435,19.36
2436,18.93
2437,18.48
2438,18.07
2439,17.70
2440,17.40
2441,17.17
2442,17.01
2443,16.94
2444,16.96
2445,17.07
2446,17.22
2447,17.40
2448,17.54
2449,17.65
2450,17.68
2451,17.65
2452,17.52
2453,17.30
2454,17.09
2455,16.93
2456,16.85
2457,16.88
2458,17.07
2459,17.39
2460,17.83
2461,18.30
2462,18.79
2463,19.25
2464,19.65
2465,19.91
2466,20.03
2467,20.06
2468,20.07
2469,20.12
2470,20.22
2471,20.33
2472,20.49
2473,20.68
2474,20.84
2475,20.90
2476,20.79
2477,20.52
2478,20.16
2479,19.76
2480,19.37
2481,19.04
2482,18.82
2483,18.76
2484,18.85
2485,19.04
2486,19.27
2487,19.52
2488,19.73
2489,19.91
2490,20.06
2491,20.14
2492,20.16
2493,20.13
2494,20.09
2495,20.03
2496,19.95
2497,19.82
2498,19.65
2499,19.51
2500,19.43
2501,19.39
2502,19.37
2503,19.34
2504,19.36
2505,19.44
2506,19.56
2507,19.66
2508,19.69
2509,19.66
2510,19.59
2511,19.51
2512,19.41
2513,19.31
2514,19.23
2515,19.24
2516,19.33
2517,19.45
2518,19.52
2519,19.53
2520,19.49
2521,19.39
2522,19.22
2523,18.98
2524,18.76
2525,18.63
2526,18.61
2527,18.68
2528,18.81
2529,18.99
2530,19.18
2531,19.34
2532,19.42
2533,19.45
2534,19.45
2535,19.42
2536,19.34
2537,19.23
2538,19.08
2539,18.94
2540,18.77
2541,18.59
2542,18.41
2543,18.26
2544,18.16
2545,18.14
2546,18.17
2547,18.23
2548,18.29
2549,18.30
2550,18.22
2551,18.07
2552,17.83
2553,17.53
2554,17.18
2555,16.82
2556,16.47
2557,16.17
2558,15.93
2559,15.75
2560,15.65
2561,15.59
2562,15.56
2563,15.56
2564,15.60
2565,15.69
2566,15.82
2567,15.99
2568,16.26
2569,16.61
2570,17.04
2571,17.45
2572,17.85
2573,18.20
2574,18.52
2575,18.78
2576,19.03
2577,19.26
2578,19.55
2579,19.89
2580,20.35
2581,20.88
2582,21.50
2583,22.09
2584,22.61
2585,22.97
2586,23.19
2587,23.27
2588,23.24
2589,23.12
2590,22.93
2591,22.69
2592,22.39
2593,22.10
2594,21.84
2595,21.59
2596,21.33
2597,21.07
2598,20.82
2599,20.63
2600,20.42
2601,20.16
2602,19.79
2603,19.35
2604,18.83
2605,18.27
2606,17.62
2607,16.94
2608,16.27
2609,15.69
2610,15.23
2611,14.90
2612,14.62
2613,14.39
2614,14.14
2615,13.92
2616,13.69
2617,13.45
2618,13.17
2619,12.90
2620,12.70
2621,12.61
2622,12.62
2623,12.69
2624,12.77
2625,12.89
2626,13.04
2627,13.17
2628,13.22
2629,13.18
2630,13.11
2631,13.04
2632,13.02
2633,13.05
2634,13.14
2635,13.31
2636,13.60
2637,13.95
2638,14.34
2639,14.69
2640,15.04
2641,15.39
2642,15.77
2643,16.16
2644,16.54
2645,16.87
2646,17.15
2647,17.35
2648,17.49
2649,17.54
2650,17.55
2651,17.51
2652,17.47
2653,17.46
2654,17.52
2655,17.65
2656,17.83
2657,18.00
2658,18.14
2659,18.19
2660,18.21
2661,18.20
2662,18.19
2663,18.18
2664,18.25
2665,18.42
2666,18.71
2667,19.07
2668,19.47
2669,19.83
2670,20.13
2671,20.37
2672,20.55
2673,20.64
2674,20.62
2675,20.53
2676,20.42
2677,20.32
2678,20.24
2679,20.19
2680,20.16
2681,20.19
2682,20.25
2683,20.31
2684,20.36
2685,20.36
2686,20.29
2687,20.14
2688,19.95
2689,19.79
2690,19.73
2691,19.82
2692,20.06
2693,20.39
2694,20.77
2695,21.11
2696,21.32
2697,21.35
2698,21.21
2699,20.96
2700,20.69
2701,20.50
2702,20.45
2703,20.57
2704,20.87
2705,21.29
2706,21.77
2707,22.16
2708,22.40
2709,22.42
2710,22.29
2711,22.06
2712,21.84
2713,21.69
2714,21.65
2715,21.74
2716,21.95
2717,22.25
2718,22.62
2719,22.94
2720,23.17
2721,23.29
2722,23.35
2723,23.38
2724,23.35
2725,23.29
2726,23.24
2727,23.22
2728,23.18
2729,23.10
2730,22.95
2731,22.77
2732,22.55
2733,22.32
2734,22.05
2735,21.79
2736,21.53
2737,21.30
2738,21.05
2739,20.77
2740,20.38
2741,19.94
2742,19.43
2743,18.93
2744,18.41
2745,17.94
2746,17.52
2747,17.19
2748,16.94
2749,16.80
2750,16.75
2751,16.82
2752,16.97
2753,17.18
2754,17.41
2755,17.65
2756,17.91
2757,18.18
2758,18.46
2759,18.76
2760,19.08
2761,19.44
2762,19.83
2763,20.19
2764,20.47
2765,20.62
2766,20.65
2767,20.55
2768,20.38
2769,20.16
2770,19.94
2771,19.72
2772,19.55
2773,19.42
2774,19.37
2775,19.38
2776,19.42
2777,19.48
2778,19.53
2779,19.60
2780,19.66
2781,19.73
2782,19.74
2783,19.68
2784,19.55
2785,19.36
2786,19.18
2787,19.00
2788,18.81
2789,18.66
2790,18.62
2791,18.70
2792,18.90
2793,19.18
2794,19.50
2795,19.87
2796,20.22
2797,20.49
2798,20.64
2799,20.68
2800,20.60
2801,20.42
2802,20.11
2803,19.72
2804,19.32
2805,18.96
2806,18.65
2807,18.42
2808,18.25
2809,18.14
2810,18.02
2811,17.91
2812,17.77
2813,17.64
2814,17.45
2815,17.20
2816,16.78
2817,16.26
2818,15.60
2819,14.92
2820,14.22
2821,13.57
2822,12.97
2823,12.54
2824,12.23
2825,12.07
2826,11.94
2827,11.84
2828,11.70
2829,11.53
2830,11.27
2831,10.95
2832,10.56
2833,10.21
2834,9.92
2835,9.72
2836,9.54
2837,9.37
2838,9.19
2839,8.97
2840,8.72
2841,8.46
2842,8.21
2843,8.03
2844,7.90
2845,7.85
2846,7.87
2847,7.95
2848,8.09
2849,8.25
2850,8.41
2851,8.54
2852,8.70
2853,8.90
2854,9.20
2855,9.55
2856,9.93
2857,10.28
2858,10.66
2859,11.02
2860,11.41
2861,11.79
2862,12.25
2863,12.78
2864,13.38
2865,13.97
2866,14.56
2867,15.09
2868,15.57
2869,15.95
2870,16.27
2871,16.49
2872,16.69
2873,16.86
2874,17.06
2875,17.29
2876,17.59
2877,17.85
2878,18.04
2879,18.09
2880,18.07
2881,17.97
2882,17.83
2883,17.64
2884,17.47
2885,17.38
2886,17.41
2887,17.56
2888,17.79
2889,18.07
2890,18.33
2891,18.52
2892,18.57
2893,18.52
2894,18.39
2895,18.26
2896,18.14
2897,18.02
2898,17.94
2899,17.92
2900,17.91
2901,17.82
2902,17.60
2903,17.28
2904,16.87
2905,16.46
2906,16.04
2907,15.69
2908,15.41
2909,15.21
2910,15.01
2911,14.82
2912,14.58
2913,14.32
2914,13.96
2915,13.53
2916,13.01
2917,12.50
2918,12.00
2919,11.57
2920,11.17
2921,10.82
2922,10.46
2923,10.15
2924,9.86
2925,9.63
2926,9.38
2927,9.16
2928,8.93
2929,8.76
2930,8.58
2931,8.38
2932,8.14
2933,7.84
2934,7.46
2935,7.07
2936,6.75
2937,6.56
2938,6.52
2939,6.65
2940,6.96
2941,7.44
2942,8.03
2943,8.60
2944,9.10
2945,9.49
2946,9.76
2947,9.93
2948,10.05
2949,10.14
2950,10.24
2951,10.33
2952,10.36
2953,10.34
2954,10.25
2955,10.07
2956,9.74
2957,9.27
2958,8.71
2959,8.13
2960,7.58
2961,7.11
2962,6.69
2963,6.40
2964,6.23
2965,6.17
2966,6.19
2967,6.26
2968,6.34
2969,6.42
2970,6.49
2971,6.58
2972,6.72
2973,6.88
2974,7.10
2975,7.35
2976,7.77
2977,8.32
2978,9.05
2979,9.87
2980,10.83
2981,11.83
2982,12.89
2983,13.89
2984,14.86
2985,15.71
2986,16.50
2987,17.14
2988,17.68
2989,18.08
2990,18.46
2991,18.76
2992,19.06
2993,19.29
2994,19.52
2995,19.74
2996,20.00
2997,20.29
2998,20.66
2999,21.05
3000,21.42
3001,21.71
3002,21.94
3003,22.09
3004,22.14
3005,22.08
3006,21.93
3007,21.74
3008,21.56
3009,21.42
3010,21.31
3011,21.22
3012,21.13
3013,21.07
3014,21.06
3015,21.13
3016,21.22
3017,21.31
3018,21.40
3019,21.45
3020,21.45
3021,21.36
3022,21.24
3023,21.13
3024,21.12
3025,21.23
3026,21.52
3027,21.90
3028,22.32
3029,22.69
3030,22.98
3031,23.12
3032,23.09
3033,22.91
3034,22.67
3035,22.48
3036,22.39
3037,22.45
3038,22.69
3039,23.05
3040,23.45
3041,23.78
3042,24.02
3043,24.09
3044,24.04
3045,23.85
3046,23.61
3047,23.38
3048,23.26
3049,23.28
3050,23.51
3051,23.90
3052,24.41
3053,24.95
3054,25.49
3055,25.92
3056,26.25
3057,26.42
3058,26.52
3059,26.56
3060,26.62
3061,26.70
3062,26.88
3063,27.16
3064,27.60
3065,28.14
3066,28.75
3067,29.31
3068,29.80
3069,30.18
3070,30.50
3071,30.74
3072,30.86
3073,30.86
3074,30.80
3075,30.71
3076,30.56
3077,30.37
3078,30.10
3079,29.77
3080,29.36
3081,28.89
3082,28.34
3083,27.77
3084,27.19
3085,26.66
3086,26.18
3087,25.79
3088,25.49
3089,25.33
3090,25.26
3091,25.28
3092,25.27
3093,25.22
3094,25.09
3095,24.93
3096,24.68
3097,24.39
3098,24.04
3099,23.69
3100,23.32
3101,22.96
3102,22.59
3103,22.25
3104,21.90
3105,21.58
3106,21.22
3107,20.88
3108,20.54
3109,20.24
3110,19.97
3111,19.77
3112,19.62
3113,19.55
3114,19.46
3115,19.35
3116,19.19
3117,19.04
3118,18.91
3119,18.83
3120,18.78
3121,18.75
3122,18.70
3123,18.65
3124,18.59
3125,18.53
3126,18.42
3127,18.28
3128,18.14
3129,18.07
3130,18.12
3131,18.30
3132,18.59
3133,18.93
3134,19.25
3135,19.49
3136,19.62
3137,19.62
3138,19.49
3139,19.27
3140,19.04
3141,18.84
3142,18.77
3143,18.89
3144,19.23
3145,19.71
3146,20.23
3147,20.71
3148,21.17
3149,21.59
3150,21.91
3151,22.09
3152,22.16
3153,22.18
3154,22.21
3155,22.24
3156,22.25
3157,22.22
3158,22.17
3159,22.05
3160,21.82
3161,21.50
3162,21.13
3163,20.77
3164,20.39
3165,20.01
3166,19.61
3167,19.26
3168,18.94
3169,18.64
3170,18.33
3171,18.04
3172,17.78
3173,17.57
3174,17.37
3175,17.17
3176,16.97
3177,16.75
3178,16.50
3179,16.27
3180,16.10
3181,16.06
3182,16.17
3183,16.44
3184,16.88
3185,17.42
3186,18.01
3187,18.58
3188,19.13
3189,19.63
3190,20.07
3191,20.43
3192,20.73
3193,20.95
3194,21.14
3195,21.29
3196,21.44
3197,21.56
3198,21.74
3199,21.97
3200,22.32
3201,22.73
3202,23.17
3203,23.58
3204,24.03
3205,24.47
3206,24.87
3207,25.19
3208,25.52
3209,25.90
3210,26.34
3211,26.76
3212,27.11
3213,27.38
3214,27.60
3215,27.71
3216,27.70
3217,27.55
3218,27.31
3219,27.00
3220,26.63
3221,26.22
3222,25.79
3223,25.40
3224,25.05
3225,24.75
3226,24.51
3227,24.33
3228,24.22
3229,24.15
3230,24.15
3231,24.21
3232,24.35
3233,24.52
3234,24.71
3235,24.92
3236,25.18
3237,25.47
3238,25.78
3239,26.04
3240,26.31
3241,26.60
3242,26.94
3243,27.26
3244,27.60
3245,27.92
3246,28.23
3247,28.47
3248,28.62
3249,28.68
3250,28.67
3251,28.60
3252,28.50
3253,28.37
3254,28.30
3255,28.27
3256,28.24
3257,28.22
3258,28.18
3259,28.12
3260,28.02
3261,27.84
3262,27.61
3263,27.40
3264,27.24
3265,27.16
3266,27.10
3267,27.05
3268,26.98
3269,26.92
3270,26.85
3271,26.74
3272,26.54
3273,26.28
3274,25.96
3275,25.63
3276,25.29
3277,24.95
3278,24.54
3279,24.13
3280,23.70
3281,23.32
3282,22.95
3283,22.61
3284,22.23
3285,21.89
3286,21.54
3287,21.22
3288,20.89
3289,20.60
3290,20.32
3291,20.10
3292,19.87
3293,19.67
3294,19.47
3295,19.29
3296,19.11
3297,18.94
3298,18.76
3299,18.61
3300,18.50
3301,18.48
3302,18.53
3303,18.63
3304,18.70
3305,18.75
3306,18.74
3307,18.68
3308,18.50
3309,18.21
3310,17.83
3311,17.47
3312,17.14
3313,16.85
3314,16.55
3315,16.28
3316,16.08
3317,15.94
3318,15.80
3319,15.65
3320,15.51
3321,15.47
3322,15.59
3323,15.89
3324,16.35
3325,16.92
3326,17.59
3327,18.20
3328,18.72
3329,19.08
3330,19.33
3331,19.49
3332,19.62
3333,19.73
3334,19.91
3335,20.16
3336,20.52
3337,20.90
3338,21.33
3339,21.74
3340,22.16
3341,22.53
3342,22.90
3343,23.25
3344,23.63
3345,24.01
3346,24.42
3347,24.80
3348,25.16
3349,25.44
3350,25.70
3351,25.91
3352,26.10
3353,26.24
3354,26.34
3355,26.40
3356,26.44
3357,26.47
3358,26.47
3359,26.45
3360,26.38
3361,26.27
3362,26.05
3363,25.76
3364,25.40
3365,24.98
3366,24.51
3367,24.03
3368,23.57
3369,23.16
3370,22.77
3371,22.42
3372,22.08
3373,21.79
3374,21.51
3375,21.32
3376,21.17
3377,21.13
3378,21.11
3379,21.13
3380,21.09
3381,21.01
3382,20.84
3383,20.61
3384,20.29
3385,19.93
3386,19.58
3387,19.31
3388,19.13
3389,19.06
3390,19.03
3391,19.04
3392,19.03
3393,18.95
3394,18.72
3395,18.37
3396,17.91
3397,17.43
3398,16.94
3399,16.48
3400,15.98
3401,15.52
3402,15.08
3403,14.69
3404,14.32
3405,14.00
3406,13.72
3407,13.52
3408,13.36
3409,13.24
3410,13.14
3411,13.05
3412,12.97
3413,12.89
3414,12.78
3415,12.70
3416,12.65
3417,12.68
3418,12.76
3419,12.89
3420,13.05
3421,13.22
3422,13.40
3423,13.58
3424,13.78
3425,13.99
3426,14.18
3427,14.30
3428,14.35
3429,14.38
3430,14.40
3431,14.40
3432,14.35
3433,14.26
3434,14.19
3435,14.16
3436,14.13
3437,14.08
3438,14.00
3439,13.90
3440,13.79
3441,13.64
3442,13.47
3443,13.32
3444,13.21
3445,13.18
3446,13.23
3447,13.36
3448,13.53
3449,13.69
3450,13.87
3451,14.05
3452,14.26
3453,14.47
3454,14.66
3455,14.83
3456,15.03
3457,15.26
3458,15.54
3459,15.84
3460,16.17
3461,16.49
3462,16.82
3463,17.11
3464,17.36
3465,17.55
3466,17.65
3467,17.65
3468,17.55
3469,17.36
3470,17.13
3471,16.93
3472,16.76
3473,16.65
3474,16.54
3475,16.43
3476,16.29
3477,16.12
3478,15.85
3479,15.48
3480,14.95
3481,14.34
3482,13.61
3483,12.87
3484,12.12
3485,11.44
3486,10.82
3487,10.32
3488,9.89
3489,9.55
3490,9.23
3491,8.95
3492,8.63
3493,8.32
3494,7.95
3495,7.61
3496,7.25
3497,6.93
3498,6.61
3499,6.32
3500,6.00
3501,5.68
3502,5.36
3503,5.09
3504,4.89
3505,4.81
3506,4.82
3507,4.95
3508,5.16
3509,5.37
3510,5.52
3511,5.55
3512,5.47
3513,5.29
3514,5.03
3515,4.78
3516,4.63
3517,4.63
3518,4.76
3519,4.97
3520,5.24
3521,5.51
3522,5.75
3523,5.92
3524,6.04
3525,6.12
3526,6.24
3527,6.43
3528,6.75
3529,7.16
3530,7.71
3531,8.29
3532,8.93
3533,9.57
3534,10.28
3535,10.94
3536,11.62
3537,12.23
3538,12.86
3539,13.47
3540,14.10
3541,14.71
3542,15.41
3543,16.14
3544,16.94
3545,17.66
3546,18.37
3547,19.01
3548,19.66
3549,20.24
3550,20.80
3551,21.26
3552,21.68
3553,22.06
3554,22.45
3555,22.77
3556,23.02
3557,23.12
3558,23.16
3559,23.12
3560,23.03
3561,22.87
3562,22.67
3563,22.49
3564,22.41
3565,22.40
3566,22.45
3567,22.51
3568,22.59
3569,22.71
3570,22.85
3571,22.94
3572,22.96
3573,22.90
3574,22.79
3575,22.67
3576,22.53
3577,22.42
3578,22.36
3579,22.38
3580,22.47
3581,22.57
3582,22.65
3583,22.71
3584,22.71
3585,22.69
3586,22.63
3587,22.54
3588,22.42
3589,22.32
3590,22.34
3591,22.45
3592,22.62
3593,22.74
3594,22.80
3595,22.80
3596,22.74
3597,22.59
3598,22.35
3599,22.11
3600,21.95
3601,21.95
3602,22.09
3603,22.31
3604,22.52
3605,22.68
3606,22.74
3607,22.64
3608,22.40
3609,22.06
3610,21.73
3611,21.45
3612,21.27
3613,21.21
3614,21.29
3615,21.47
3616,21.70
3617,21.88
3618,21.98
3619,22.00
3620,22.00
3621,21.99
3622,22.02
3623,22.13
3624,22.41
3625,22.82
3626,23.35
3627,23.92
3628,24.51
3629,25.07
3630,25.61
3631,26.07
3632,26.49
3633,26.85
3634,27.18
3635,27.43
3636,27.63
3637,27.78
3638,27.94
3639,28.11
3640,28.29
3641,28.43
3642,28.57
3643,28.68
3644,28.79
3645,28.84
3646,28.85
3647,28.82
3648,28.79
3649,28.81
3650,28.92
3651,29.14
3652,29.43
3653,29.76
3654,30.08
3655,30.34
3656,30.44
3657,30.35
3658,30.06
3659,29.61
3660,29.04
3661,28.44
3662,27.85
3663,27.32
3664,26.84
3665,26.44
3666,26.04
3667,25.67
3668,25.26
3669,24.85
3670,24.39
3671,23.93
3672,23.41
3673,22.91
3674,22.42
3675,21.98
3676,21.57
3677,21.25
3678,21.00
3679,20.90
3680,20.86
3681,20.87
3682,20.85
3683,20.81
3684,20.71
3685,20.55
3686,20.33
3687,20.10
3688,19.91
3689,19.84
3690,19.92
3691,20.14
3692,20.45
3693,20.82
3694,21.16
3695,21.44
3696,21.60
3697,21.60
3698,21.42
3699,21.09
3700,20.66
3701,20.21
3702,19.77
3703,19.35
3704,18.96
3705,18.63
3706,18.38
3707,18.23
3708,18.18
3709,18.21
3710,18.31
3711,18.46
3712,18.64
3713,18.84
3714,19.10
3715,19.36
3716,19.65
3717,19.97
3718,20.38
3719,20.81
3720,21.28
3721,21.70
3722,22.09
3723,22.44
3724,22.75
3725,23.01
3726,23.30
3727,23.61
3728,23.99
3729,24.33
3730,24.66
3731,24.95
3732,25.28
3733,25.59
3734,25.90
3735,26.12
3736,26.33
3737,26.54
3738,26.79
3739,27.05
3740,27.32
3741,27.58
3742,27.89
3743,28.21
3744,28.53
3745,28.79
3746,29.04
3747,29.30
3748,29.63
3749,29.98
3750,30.34
3751,30.71
3752,31.10
3753,31.45
3754,31.68
3755,31.76
3756,31.69
3757,31.48
3758,31.05
3759,30.47
3760,29.79
3761,29.07
3762,28.24
3763,27.37
3764,26.45
3765,25.63
3766,24.82
3767,24.07
3768,23.32
3769,22.65
3770,21.97
3771,21.31
3772,20.54
3773,19.77
3774,18.90
3775,18.03
3776,17.03
3777,16.01
3778,14.91
3779,13.85
3780,12.78
3781,11.81
3782,10.91
3783,10.19
3784,9.57
3785,9.19
3786,8.90
3787,8.74
3788,8.58
3789,8.42
3790,8.16
3791,7.88
3792,7.55
3793,7.19
3794,6.79
3795,6.38
3796,5.98
3797,5.65
3798,5.39
3799,5.18
3800,5.04
3801,5.00
3802,5.12
3803,5.38
3804,5.79
3805,6.30
3806,6.87
3807,7.41
3808,7.85
3809,8.14
3810,8.36
3811,8.54
3812,8.81
3813,9.15
3814,9.65
3815,10.25
3816,11.02
3817,11.85
3818,12.76
3819,13.64
3820,14.53
3821,15.34
3822,16.17
3823,16.94
3824,17.79
3825,18.61
3826,19.45
3827,20.24
3828,21.04
3829,21.77
3830,22.48
3831,23.12
3832,23.77
3833,24.39
3834,24.99
3835,25.49
3836,25.89
3837,26.12
3838,26.21
3839,26.15
3840,25.97
3841,25.69
3842,25.36
3843,25.00
3844,24.64
3845,24.31
3846,24.02
3847,23.79
3848,23.59
3849,23.39
3850,23.11
3851,22.77
3852,22.35
3853,21.92
3854,21.49
3855,21.12
3856,20.80
3857,20.57
3858,20.37
3859,20.24
3860,20.13
3861,20.05
3862,19.90
3863,19.68
3864,19.36
3865,19.00
3866,18.57
3867,18.08
3868,17.49
3869,16.91
3870,16.31
3871,15.79
3872,15.29
3873,14.88
3874,14.53
3875,14.27
3876,14.05
3877,13.85
3878,13.62
3879,13.34
3880,12.93
3881,12.43
3882,11.82
3883,11.19
3884,10.59
3885,10.11
3886,9.78
3887,9.64
3888,9.66
3889,9.81
3890,10.05
3891,10.32
3892,10.58
3893,10.73
3894,10.74
3895,10.64
3896,10.54
3897,10.53
3898,10.65
3899,10.89
3900,11.27
3901,11.76
3902,12.40
3903,13.08
3904,13.79
3905,14.44
3906,15.04
3907,15.53
3908,15.98
3909,16.36
3910,16.69
3911,16.96
3912,17.20
3913,17.40
3914,17.59
3915,17.73
3916,17.85
3917,17.91
3918,17.90
3919,17.81
3920,17.62
3921,17.30
3922,16.83
3923,16.26
3924,15.63
3925,15.02
3926,14.50
3927,14.08
3928,13.75
3929,13.52
3930,13.39
3931,13.37
3932,13.38
3933,13.39
3934,13.34
3935,13.29
3936,13.23
3937,13.17
3938,13.08
3939,12.96
3940,12.87
3941,12.81
3942,12.75
3943,12.70
3944,12.65
3945,12.65
3946,12.69
3947,12.76
3948,12.80
3949,12.83
3950,12.76
3951,12.63
3952,12.34
3953,11.92
3954,11.38
3955,10.75
3956,10.03
3957,9.30
3958,8.58
3959,7.94
3960,7.41
3961,7.03
3962,6.79
3963,6.68
3964,6.62
3965,6.60
3966,6.60
3967,6.63
3968,6.66
3969,6.69
3970,6.74
3971,6.82
3972,6.97
3973,7.20
3974,7.57
3975,8.01
3976,8.51
3977,9.01
3978,9.54
3979,10.04
3980,10.51
3981,10.84
3982,11.15
3983,11.42
3984,11.79
3985,12.22
3986,12.78
3987,13.40
3988,14.12
3989,14.82
3990,15.48
3991,16.00
3992,16.46
3993,16.83
3994,17.17
3995,17.45
3996,17.77
3997,18.07
3998,18.44
3999,18.75
4000,19.09
4001,19.44
4002,19.97
4003,20.63
4004,21.51
4005,22.48
4006,23.57
4007,24.63
4008,25.67
4009,26.57
4010,27.42
4011,28.11
4012,28.75
4013,29.29
4014,29.87
4015,30.41
4016,30.98
4017,31.49
4018,32.06
4019,32.60
4020,33.20
4021,33.78
4022,34.42
4023,35.08
4024,35.87
4025,36.70
4026,37.55
4027,38.29
4028,38.93
4029,39.38
4030,39.75
4031,40.00
4032,40.21
4033,40.34
4034,40.47
4035,40.59
4036,40.71
4037,40.77
4038,40.72
4039,40.51
4040,40.18
4041,39.76
4042,39.25
4043,38.69
4044,38.08
4045,37.48
4046,36.90
4047,36.42
4048,35.96
4049,35.60
4050,35.21
4051,34.84
4052,34.42
4053,33.96
4054,33.37
4055,32.74
4056,31.98
4057,31.23
4058,30.42
4059,29.65
4060,28.89
4061,28.27
4062,27.68
4063,27.20
4064,26.69
4065,26.21
4066,25.67
4067,25.15
4068,24.54
4069,23.90
4070,23.21
4071,22.57
4072,21.93
4073,21.35
4074,20.74
4075,20.19
4076,19.69
4077,19.31
4078,18.97
4079,18.68
4080,18.43
4081,18.26
4082,18.12
4083,18.01
4084,17.91
4085,17.82
4086,17.73
4087,17.65
4088,17.56
4089,17.47
4090,17.36
4091,17.27
4092,17.23
4093,17.27
4094,17.33
4095,17.43
4096,17.57
4097,17.72
4098,17.80
4099,17.80
4100,17.78
4101,17.73
4102,17.68
4103,17.65
4104,17.71
4105,17.91
4106,18.28
4107,18.78
4108,19.40
4109,20.03
4110,20.61
4111,21.03
4112,21.28
4113,21.35
4114,21.35
4115,21.33
4116,21.41
4117,21.58
4118,21.87
4119,22.19
4120,22.54
4121,22.85
4122,23.05
4123,23.08
4124,22.93
4125,22.68
4126,22.42
4127,22.24
4128,22.16
4129,22.20
4130,22.32
4131,22.51
4132,22.69
4133,22.82
4134,22.83
4135,22.72
4136,22.46
4137,22.10
4138,21.67
4139,21.24
4140,20.90
4141,20.70
4142,20.61
4143,20.62
4144,20.67
4145,20.73
4146,20.77
4147,20.77
4148,20.71
4149,20.59
4150,20.45
4151,20.35
4152,20.35
4153,20.47
4154,20.73
4155,21.06
4156,21.41
4157,21.74
4158,22.05
4159,22.29
4160,22.41
4161,22.45
4162,22.45
4163,22.45
4164,22.38
4165,22.28
4166,22.13
4167,21.99
4168,21.79
4169,21.53
4170,21.19
4171,20.81
4172,20.34
4173,19.82
4174,19.21
4175,18.59
4176,17.94
4177,17.32
4178,16.72
4179,16.24
4180,15.78
4181,15.38
4182,14.95
4183,14.51
4184,14.04
4185,13.59
4186,13.16
4187,12.83
4188,12.64
4189,12.61
4190,12.74
4191,12.98
4192,13.31
4193,13.66
4194,14.05
4195,14.46
4196,14.91
4197,15.40
4198,16.04
4199,16.78
4200,17.69
4201,18.61
4202,19.55
4203,20.40
4204,21.21
4205,21.90
4206,22.60
4207,23.25
4208,23.99
4209,24.73
4210,25.60
4211,26.51
4212,27.52
4213,28.49
4214,29.45
4215,30.30
4216,31.11
4217,31.81
4218,32.44
4219,32.94
4220,33.34
4221,33.62
4222,33.85
4223,33.98
4224,34.07
4225,34.09
4226,34.10
4227,34.13
4228,34.21
4229,34.32
4230,34.45
4231,34.55
4232,34.60
4233,34.60
4234,34.51
4235,34.34
4236,34.09
4237,33.83
4238,33.54
4239,33.26
4240,32.92
4241,32.55
4242,32.04
4243,31.43
4244,30.65
4245,29.81
4246,28.84
4247,27.87
4248,26.87
4249,25.96
4250,25.12
4251,24.42
4252,23.78
4253,23.23
4254,22.68
4255,22.20
4256,21.70
4257,21.20
4258,20.62
4259,20.05
4260,19.45
4261,18.93
4262,18.40
4263,17.95
4264,17.53
4265,17.22
4266,16.91
4267,16.64
4268,16.31
4269,16.01
4270,15.63
4271,15.21
4272,14.72
4273,14.26
4274,13.83
4275,13.48
4276,13.13
4277,12.78
4278,12.43
4279,12.13
4280,11.88
4281,11.67
4282,11.51
4283,11.44
4284,11.52
4285,11.76
4286,12.14
4287,12.60
4288,13.08
4289,13.48
4290,13.82
4291,14.11
4292,14.43
4293,14.78
4294,15.18
4295,15.66
4296,16.27
4297,16.94
4298,17.64
4299,18.24
4300,18.73
4301,19.05
4302,19.20
4303,19.17
4304,19.02
4305,18.78
4306,18.57
4307,18.41
4308,18.39
4309,18.47
4310,18.65
4311,18.89
4312,19.20
4313,19.55
4314,19.92
4315,20.26
4316,20.54
4317,20.72
4318,20.76
4319,20.64
4320,20.39
4321,20.05
4322,19.68
4323,19.32
4324,18.99
4325,18.75
4326,18.64
4327,18.61
4328,18.60
4329,18.58
4330,18.53
4331,18.48
4332,18.38
4333,18.26
4334,18.17
4335,18.23
4336,18.45
4337,18.80
4338,19.15
4339,19.40
4340,19.46
4341,19.32
4342,18.94
4343,18.37
4344,17.63
4345,16.88
4346,16.24
4347,15.82
4348,15.60
4349,15.59
4350,15.73
4351,15.98
4352,16.21
4353,16.38
4354,16.44
4355,16.41
4356,16.27
4357,16.06
4358,15.82
4359,15.64
4360,15.53
4361,15.51
4362,15.54
4363,15.60
4364,15.67
4365,15.71
4366,15.67
4367,15.56
4368,15.36
4369,15.11
4370,14.85
4371,14.64
4372,14.52
4373,14.49
4374,14.54
4375,14.63
4376,14.75
4377,14.89
4378,15.08
4379,15.28
4380,15.51
4381,15.74
4382,16.01
4383,16.30
4384,16.65
4385,17.00
4386,17.37
4387,17.76
4388,18.17
4389,18.59
4390,19.00
4391,19.39
4392,19.78
4393,20.13
4394,20.40
4395,20.53
4396,20.49
4397,20.31
4398,20.00
4399,19.57
4400,19.09
4401,18.59
4402,18.18
4403,17.91
4404,17.80
4405,17.82
4406,17.97
4407,18.25
4408,18.64
4409,19.09
4410,19.55
4411,19.93
4412,20.26
4413,20.55
4414,20.85
4415,21.11
4416,21.36
4417,21.59
4418,21.84
4419,22.07
4420,22.29
4421,22.50
4422,22.73
4423,22.96
4424,23.19
4425,23.36
4426,23.51
4427,23.63
4428,23.74
4429,23.83
4430,23.86
4431,23.86
4432,23.86
4433,23.86
4434,23.86
4435,23.83
4436,23.77
4437,23.71
4438,23.64
4439,23.52
4440,23.32
4441,23.03
4442,22.64
4443,22.22
4444,21.80
4445,21.48
4446,21.26
4447,21.18
4448,21.21
4449,21.34
4450,21.47
4451,21.58
4452,21.58
4453,21.44
4454,21.10
4455,20.62
4456,20.04
4457,19.48
4458,18.96
4459,18.55
4460,18.22
4461,17.95
4462,17.72
4463,17.55
4464,17.43
4465,17.37
4466,17.35
4467,17.42
4468,17.59
4469,17.86
4470,18.17
4471,18.45
4472,18.65
4473,18.78
4474,18.78
4475,18.62
4476,18.33
4477,17.97
4478,17.59
4479,17.23
4480,16.90
4481,16.59
4482,16.36
4483,16.20
4484,16.15
4485,16.14
4486,16.19
4487,16.27
4488,16.45
4489,16.72
4490,17.06
4491,17.42
4492,17.79
4493,18.14
4494,18.49
4495,18.78
4496,19.03
4497,19.19
4498,19.34
4499,19.47
4500,19.68
4501,20.00
4502,20.48
4503,21.07
4504,21.77
4505,22.52
4506,23.29
4507,23.98
4508,24.54
4509,24.89
4510,25.06
4511,25.05
4512,24.89
4513,24.61
4514,24.30
4515,24.02
4516,23.83
4517,23.71
4518,23.67
4519,23.67
4520,23.67
4521,23.63
4522,23.46
4523,23.17
4524,22.74
4525,22.25
4526,21.75
4527,21.35
4528,21.06
4529,20.92
4530,20.84
4531,20.81
4532,20.71
4533,20.54
4534,20.22
4535,19.79
4536,19.21
4537,18.55
4538,17.82
4539,17.14
4540,16.56
4541,16.15
4542,15.84
4543,15.65
4544,15.54
4545,15.52
4546,15.48
4547,15.40
4548,15.27
4549,15.15
4550,15.05
4551,14.98
4552,14.99
4553,15.05
4554,15.15
4555,15.27
4556,15.40
4557,15.56
4558,15.73
4559,15.93
4560,16.17
4561,16.50
4562,16.95
4563,17.43
4564,17.86
4565,18.16
4566,18.36
4567,18.43
4568,18.41
4569,18.28
4570,18.14
4571,18.06
4572,18.16
4573,18.42
4574,18.83
4575,19.31
4576,19.83
4577,20.27
4578,20.59
4579,20.74
4580,20.76
4581,20.68
4582,20.59
4583,20.52
4584,20.57
4585,20.81
4586,21.23
4587,21.74
4588,22.26
4589,22.71
4590,23.09
4591,23.38
4592,23.60
4593,23.71
4594,23.77
4595,23.79
4596,23.82
4597,23.84
4598,23.85
4599,23.80
4600,23.67
4601,23.45
4602,23.16
4603,22.83
4604,22.51
4605,22.28
4606,22.10
4607,21.97
4608,21.80
4609,21.67
4610,21.53
4611,21.42
4612,21.28
4613,21.13
4614,21.00
4615,20.91
4616,20.84
4617,20.80
4618,20.71
4619,20.58
4620,20.32
4621,20.00
4622,19.61
4623,19.26
4624,18.94
4625,18.68
4626,18.42
4627,18.19
4628,17.97
4629,17.76
4630,17.55
4631,17.33
4632,17.15
4633,17.06
4634,17.11
4635,17.32
4636,17.68
4637,18.09
4638,18.51
4639,18.88
4640,19.17
4641,19.33
4642,19.40
4643,19.39
4644,19.42
4645,19.53
4646,19.74
4647,20.03
4648,20.45
4649,20.99
4650,21.64
4651,22.30
4652,22.88
4653,23.30
4654,23.54
4655,23.61
4656,23.48
4657,23.17
4658,22.74
4659,22.25
4660,21.80
4661,21.36
4662,20.99
4663,20.68
4664,20.53
4665,20.52
4666,20.63
4667,20.78
4668,20.97
4669,21.17
4670,21.40
4671,21.64
4672,21.90
4673,22.17
4674,22.44
4675,22.70
4676,22.99
4677,23.28
4678,23.60
4679,23.86
4680,24.07
4681,24.25
4682,24.44
4683,24.64
4684,24.84
4685,24.99
4686,25.11
4687,25.18
4688,25.25
4689,25.28
4690,25.29
4691,25.28
4692,25.28
4693,25.28
4694,25.29
4695,25.32
4696,25.38
4697,25.44
4698,25.50
4699,25.54
4700,25.61
4701,25.70
4702,25.83
4703,25.95
4704,26.03
4705,26.12
4706,26.27
4707,26.50
4708,26.78
4709,27.03
4710,27.24
4711,27.42
4712,27.54
4713,27.59
4714,27.47
4715,27.24
4716,26.90
4717,26.51
4718,26.06
4719,25.57
4720,25.00
4721,24.44
4722,23.88
4723,23.35
4724,22.83
4725,22.39
4726,22.02
4727,21.77
4728,21.54
4729,21.36
4730,21.11
4731,20.81
4732,20.32
4733,19.71
4734,18.94
4735,18.14
4736,17.29
4737,16.49
4738,15.75
4739,15.10
4740,14.51
4741,14.02
4742,13.57
4743,13.26
4744,13.02
4745,12.92
4746,12.88
4747,12.92
4748,12.99
4749,13.07
4750,13.08
4751,12.99
4752,12.77
4753,12.47
4754,12.14
4755,11.83
4756,11.57
4757,11.37
4758,11.25
4759,11.21
4760,11.26
4761,11.38
4762,11.58
4763,11.83
4764,12.16
4765,12.51
4766,12.94
4767,13.37
4768,13.83
4769,14.24
4770,14.66
4771,15.08
4772,15.62
4773,16.23
4774,16.97
4775,17.72
4776,18.55
4777,19.34
4778,20.13
4779,20.84
4780,21.51
4781,22.10
4782,22.76
4783,23.39
4784,24.08
4785,24.71
4786,25.38
4787,26.02
4788,26.70
4789,27.24
4790,27.68
4791,27.97
4792,28.21
4793,28.37
4794,28.48
4795,28.51
4796,28.50
4797,28.43
4798,28.31
4799,28.12
4800,27.94
4801,27.76
4802,27.56
4803,27.35
4804,27.18
4805,27.08
4806,27.05
4807,27.04
4808,26.97
4809,26.86
4810,26.66
4811,26.43
4812,26.15
4813,25.85
4814,25.54
4815,25.27
4816,25.09
4817,25.05
4818,25.18
4819,25.44
4820,25.73
4821,26.01
4822,26.20
4823,26.27
4824,26.17
4825,25.93
4826,25.57
4827,25.15
4828,24.72
4829,24.37
4830,24.09
4831,23.92
4832,23.80
4833,23.72
4834,23.61
4835,23.45
4836,23.16
4837,22.81
4838,22.38
4839,21.97
4840,21.60
4841,21.30
4842,21.06
4843,20.89
4844,20.77
4845,20.72
4846,20.65
4847,20.54
4848,20.37
4849,20.16
4850,19.91
4851,19.61
4852,19.28
4853,19.00
4854,18.88
4855,18.89
4856,19.05
4857,19.32
4858,19.73
4859,20.24
4860,20.77
4861,21.26
4862,21.67
4863,22.02
4864,22.35
4865,22.64
4866,22.93
4867,23.19
4868,23.45
4869,23.65
4870,23.81
4871,23.90
4872,23.92
4873,23.92
4874,23.93
4875,23.93
4876,23.88
4877,23.77
4878,23.59
4879,23.32
4880,22.93
4881,22.45
4882,21.93
4883,21.48
4884,21.13
4885,20.90
4886,20.76
4887,20.68
4888,20.58
4889,20.41
4890,20.14
4891,19.81
4892,19.43
4893,19.10
4894,18.87
4895,18.81
4896,18.93
4897,19.20
4898,19.58
4899,20.01
4900,20.42
4901,20.77
4902,21.07
4903,21.32
4904,21.51
4905,21.63
4906,21.65
4907,21.57
4908,21.39
4909,21.15
4910,20.84
4911,20.52
4912,20.17
4913,19.85
4914,19.53
4915,19.25
4916,18.93
4917,18.59
4918,18.15
4919,17.65
4920,17.06
4921,16.44
4922,15.79
4923,15.20
4924,14.66
4925,14.26
4926,13.95
4927,13.76
4928,13.57
4929,13.37
4930,13.13
4931,12.83
4932,12.45
4933,12.04
4934,11.63
4935,11.34
4936,11.12
4937,10.98
4938,10.89
4939,10.90
4940,10.99
4941,11.15
4942,11.31
4943,11.46
4944,11.62
4945,11.83
4946,12.05
4947,12.28
4948,12.46
4949,12.57
4950,12.60
4951,12.54
4952,12.41
4953,12.23
4954,12.03
4955,11.84
4956,11.72
4957,11.72
4958,11.86
4959,12.06
4960,12.29
4961,12.47
4962,12.60
4963,12.66
4964,12.63
4965,12.54
4966,12.45
4967,12.44
4968,12.56
4969,12.79
4970,13.15
4971,13.59
4972,14.14
4973,14.69
4974,15.24
4975,15.64
4976,15.97
4977,16.22
4978,16.50
4979,16.78
4980,17.11
4981,17.49
4982,18.01
4983,18.62
4984,19.33
4985,20.04
4986,20.77
4987,21.45
4988,22.07
4989,22.57
4990,22.99
4991,23.27
4992,23.45
4993,23.54
4994,23.62
4995,23.73
4996,23.89
4997,24.07
4998,24.27
4999,24.44
5000,24.55
5001,24.53
5002,24.33
5003,23.98
5004,23.48
5005,22.90
5006,22.29
5007,21.71
5008,21.14
5009,20.61
5010,20.07
5011,19.61
5012,19.21
5013,18.90
5014,18.55
5015,18.21
5016,17.85
5017,17.56
5018,17.27
5019,17.00
5020,16.66
5021,16.32
5022,15.88
5023,15.35
5024,14.72
5025,14.06
5026,13.40
5027,12.81
5028,12.28
5029,11.83
5030,11.48
5031,11.31
5032,11.31
5033,11.47
5034,11.67
5035,11.86
5036,12.04
5037,12.21
5038,12.36
5039,12.48
5040,12.61
5041,12.78
5042,13.03
5043,13.35
5044,13.79
5045,14.29
5046,14.84
5047,15.34
5048,15.80
5049,16.17
5050,16.53
5051,16.88
5052,17.28
5053,17.68
5054,18.13
5055,18.60
5056,19.14
5057,19.67
5058,20.15
5059,20.50
5060,20.77
5061,20.93
5062,21.04
5063,21.06
5064,21.05
5065,21.06
5066,21.22
5067,21.47
5068,21.83
5069,22.25
5070,22.76
5071,23.32
5072,23.90
5073,24.41
5074,24.86
5075,25.24
5076,25.57
5077,25.80
5078,25.95
5079,26.00
5080,25.99
5081,25.93
5082,25.83
5083,25.71
5084,25.57
5085,25.42
5086,25.29
5087,25.21
5088,25.12
5089,25.05
5090,24.91
5091,24.74
5092,24.51
5093,24.22
5094,23.83
5095,23.39
5096,22.89
5097,22.38
5098,21.87
5099,21.37
5100,20.86
5101,20.39
5102,19.95
5103,19.61
5104,19.30
5105,19.05
5106,18.76
5107,18.52
5108,18.26
5109,18.03
5110,17.75
5111,17.50
5112,17.27
5113,17.11
5114,16.90
5115,16.65
5116,16.30
5117,15.85
5118,15.27
5119,14.60
5120,13.82
5121,13.05
5122,12.31
5123,11.66
5124,11.09
5125,10.64
5126,10.31
5127,10.15
5128,10.09
5129,10.13
5130,10.22
5131,10.35
5132,10.42
5133,10.44
5134,10.36
5135,10.22
5136,9.99
5137,9.69
5138,9.35
5139,9.04
5140,8.83
5141,8.71
5142,8.65
5143,8.63
5144,8.61
5145,8.61
5146,8.62
5147,8.68
5148,8.80
5149,8.98
5150,9.21
5151,9.45
5152,9.70
5153,9.93
5154,10.15
5155,10.31
5156,10.48
5157,10.64
5158,10.87
5159,11.16
5160,11.56
5161,12.03
5162,12.60
5163,13.15
5164,13.72
5165,14.18
5166,14.56
5167,14.85
5168,15.13
5169,15.37
5170,15.64
5171,15.90
5172,16.25
5173,16.65
5174,17.13
5175,17.59
5176,18.10
5177,18.62
5178,19.22
5179,19.80
5180,20.41
5181,20.96
5182,21.53
5183,22.04
5184,22.56
5185,23.03
5186,23.51
5187,23.94
5188,24.35
5189,24.70
5190,25.05
5191,25.34
5192,25.56
5193,25.68
5194,25.76
5195,25.77
5196,25.70
5197,25.57
5198,25.41
5199,25.22
5200,24.95
5201,24.60
5202,24.22
5203,23.86
5204,23.48
5205,23.09
5206,22.61
5207,22.15
5208,21.62
5209,21.08
5210,20.42
5211,19.70
5212,18.82
5213,17.91
5214,16.95
5215,16.07
5216,15.22
5217,14.53
5218,13.92
5219,13.47
5220,13.03
5221,12.64
5222,12.20
5223,11.80
5224,11.38
5225,11.01
5226,10.62
5227,10.28
5228,9.94
5229,9.68
5230,9.46
5231,9.26
5232,9.01
5233,8.73
5234,8.40
5235,8.07
5236,7.71
5237,7.35
5238,7.03
5239,6.77
5240,6.52
5241,6.29
5242,6.07
5243,5.91
5244,5.84
5245,5.81
5246,5.81
5247,5.87
5248,6.03
5249,6.26
5250,6.54
5251,6.84
5252,7.21
5253,7.58
5254,7.93
5255,8.20
5256,8.45
5257,8.64
5258,8.81
5259,8.96
5260,9.15
5261,9.37
5262,9.64
5263,9.91
5264,10.21
5265,10.50
5266,10.76
5267,10.94
5268,11.06
5269,11.15
5270,11.19
5271,11.23
5272,11.27
5273,11.31
5274,11.38
5275,11.45
5276,11.51
5277,11.50
5278,11.42
5279,11.28
5280,11.09
5281,10.91
5282,10.71
5283,10.51
5284,10.31
5285,10.16
5286,10.06
5287,10.01
5288,9.95
5289,9.86
5290,9.75
5291,9.66
5292,9.59
5293,9.56
5294,9.57
5295,9.63
5296,9.76
5297,9.93
5298,10.15
5299,10.36
5300,10.56
5301,10.73
5302,10.89
5303,11.03
5304,11.20
5305,11.38
5306,11.57
5307,11.78
5308,12.00
5309,12.21
5310,12.40
5311,12.54
5312,12.66
5313,12.79
5314,12.91
5315,13.00
5316,13.03
5317,13.00
5318,12.92
5319,12.83
5320,12.74
5321,12.65
5322,12.55
5323,12.43
5324,12.31
5325,12.21
5326,12.18
5327,12.18
5328,12.19
5329,12.18
5330,12.19
5331,12.21
5332,12.28
5333,12.40
5334,12.57
5335,12.73
5336,12.94
5337,13.17
5338,13.50
5339,13.84
5340,14.19
5341,14.52
5342,14.88
5343,15.24
5344,15.63
5345,15.98
5346,16.40
5347,16.86
5348,17.40
5349,17.92
5350,18.51
5351,19.09
5352,19.68
5353,20.22
5354,20.71
5355,21.11
5356,21.47
5357,21.73
5358,21.92
5359,22.02
5360,22.09
5361,22.15
5362,22.24
5363,22.32
5364,22.41
5365,22.51
5366,22.72
5367,22.98
5368,23.27
5369,23.54
5370,23.82
5371,24.08
5372,24.31
5373,24.49
5374,24.65
5375,24.82
5376,25.03
5377,25.26
5378,25.57
5379,25.91
5380,26.32
5381,26.73
5382,27.16
5383,27.54
5384,27.90
5385,28.23
5386,28.54
5387,28.80
5388,29.02
5389,29.20
5390,29.36
5391,29.45
5392,29.42
5393,29.27
5394,29.05
5395,28.77
5396,28.43
5397,28.06
5398,27.65
5399,27.26
5400,26.88
5401,26.54
5402,26.18
5403,25.83
5404,25.43
5405,24.99
5406,24.50
5407,24.02
5408,23.56
5409,23.19
5410,22.87
5411,22.58
5412,22.26
5413,21.91
5414,21.50
5415,21.10
5416,20.65
5417,20.17
5418,19.66
5419,19.19
5420,18.78
5421,18.52
5422,18.36
5423,18.31
5424,18.34
5425,18.46
5426,18.64
5427,18.86
5428,19.09
5429,19.30
5430,19.45
5431,19.52
5432,19.47
5433,19.35
5434,19.20
5435,19.07
5436,19.00
5437,19.00
5438,19.07
5439,19.20
5440,19.35
5441,19.50
5442,19.62
5443,19.67
5444,19.68
5445,19.64
5446,19.62
5447,19.64
5448,19.74
5449,19.94
5450,20.29
5451,20.74
5452,21.25
5453,21.75
5454,22.26
5455,22.74
5456,23.17
5457,23.49
5458,23.74
5459,23.90
5460,24.06
5461,24.20
5462,24.36
5463,24.53
5464,24.75
5465,25.02
5466,25.31
5467,25.59
5468,25.79
5469,25.89
5470,25.86
5471,25.73
5472,25.54
5473,25.31
5474,25.02
5475,24.70
5476,24.32
5477,23.94
5478,23.54
5479,23.12
5480,22.67
5481,22.23
5482,21.80
5483,21.39
5484,20.95
5485,20.52
5486,20.07
5487,19.68
5488,19.34
5489,19.12
5490,18.95
5491,18.84
5492,18.73
5493,18.62
5494,18.49
5495,18.42
5496,18.33
5497,18.26
5498,18.14
5499,18.02
5500,17.91
5501,17.82
5502,17.72
5503,17.61
5504,17.49
5505,17.36
5506,17.23
5507,17.11
5508,17.04
5509,17.04
5510,17.12
5511,17.27
5512,17.45
5513,17.62
5514,17.81
5515,17.95
5516,18.05
5517,18.10
5518,18.20
5519,18.36
5520,18.64
5521,19.00
5522,19.43
5523,19.91
5524,20.42
5525,20.87
5526,21.20
5527,21.39
5528,21.44
5529,21.37
5530,21.21
5531,20.99
5532,20.81
5533,20.68
5534,20.61
5535,20.59
5536,20.59
5537,20.58
5538,20.57
5539,20.55
5540,20.50
5541,20.44
5542,20.34
5543,20.20
5544,20.03
5545,19.84
5546,19.64
5547,19.46
5548,19.36
5549,19.36
5550,19.43
5551,19.60
5552,19.81
5553,20.02
5554,20.14
5555,20.16
5556,20.05
5557,19.87
5558,19.60
5559,19.31
5560,19.01
5561,18.78
5562,18.58
5563,18.41
5564,18.23
5565,18.06
5566,17.85
5567,17.62
5568,17.34
5569,17.08
5570,16.84
5571,16.69
5572,16.62
5573,16.64
5574,16.66
5575,16.69
5576,16.61
5577,16.44
5578,16.11
5579,15.67
5580,15.13
5581,14.56
5582,13.96
5583,13.44
5584,12.99
5585,12.63
5586,12.30
5587,12.02
5588,11.78
5589,11.64
5590,11.53
5591,11.45
5592,11.38
5593,11.35
5594,11.34
5595,11.35
5596,11.35
5597,11.32
5598,11.23
5599,11.12
5600,11.02
5601,10.93
5602,10.81
5603,10.67
5604,10.54
5605,10.48
5606,10.45
5607,10.47
5608,10.48
5609,10.48
5610,10.44
5611,10.39
5612,10.30
5613,10.19
5614,10.03
5615,9.85
5616,9.66
5617,9.48
5618,9.30
5619,9.11
5620,8.87
5621,8.57
5622,8.16
5623,7.72
5624,7.29
5625,6.92
5626,6.63
5627,6.42
5628,6.32
5629,6.29
5630,6.27
5631,6.24
5632,6.24
5633,6.29
5634,6.42
5635,6.62
5636,6.96
5637,7.43
5638,8.06
5639,8.74
5640,9.45
5641,10.06
5642,10.61
5643,11.05
5644,11.41
5645,11.67
5646,11.87
5647,12.01
5648,12.15
5649,12.28
5650,12.47
5651,12.66
5652,12.95
5653,13.26
5654,13.61
5655,13.94
5656,14.26
5657,14.52
5658,14.72
5659,14.87
5660,14.98
5661,15.06
5662,15.14
5663,15.17
5664,15.14
5665,15.08
5666,15.02
5667,14.98
5668,14.97
5669,14.96
5670,15.02
5671,15.17
5672,15.43
5673,15.79
5674,16.21
5675,16.63
5676,17.01
5677,17.32
5678,17.51
5679,17.60
5680,17.60
5681,17.51
5682,17.32
5683,17.05
5684,16.74
5685,16.44
5686,16.16
5687,15.94
5688,15.73
5689,15.56
5690,15.36
5691,15.17
5692,14.93
5693,14.67
5694,14.31
5695,13.89
5696,13.34
5697,12.76
5698,12.07
5699,11.40
5700,10.75
5701,10.19
5702,9.67
5703,9.24
5704,8.87
5705,8.64
5706,8.47
5707,8.35
5708,8.17
5709,7.94
5710,7.61
5711,7.23
5712,6.80
5713,6.36
5714,5.87
5715,5.43
5716,5.06
5717,4.79
5718,4.60
5719,4.46
5720,4.34
5721,4.26
5722,4.17
5723,4.05
5724,3.88
5725,3.71
5726,3.56
5727,3.46
5728,3.44
5729,3.53
5730,3.76
5731,4.08
5732,4.46
5733,4.85
5734,5.26
5735,5.64
5736,5.97
5737,6.17
5738,6.28
5739,6.29
5740,6.29
5741,6.25
5742,6.22
5743,6.21
5744,6.29
5745,6.49
5746,6.83
5747,7.25
5748,7.74
5749,8.28
5750,8.84
5751,9.35
5752,9.76
5753,10.03
5754,10.17
5755,10.19
5756,10.11
5757,9.96
5758,9.80
5759,9.63
5760,9.51
5761,9.41
5762,9.40
5763,9.41
5764,9.47
5765,9.53
5766,9.61
5767,9.69
5768,9.80
5769,9.94
5770,10.18
5771,10.47
5772,10.80
5773,11.12
5774,11.47
5775,11.81
5776,12.19
5777,12.55
5778,12.89
5779,13.18
5780,13.44
5781,13.63
5782,13.83
5783,14.00
5784,14.18
5785,14.34
5786,14.59
5787,14.89
5788,15.31
5789,15.82
5790,16.45
5791,17.09
5792,17.71
5793,18.18
5794,18.56
5795,18.81
5796,19.00
5797,19.09
5798,19.23
5799,19.44
5800,19.84
5801,20.37
5802,21.06
5803,21.79
5804,22.58
5805,23.35
5806,24.12
5807,24.79
5808,25.38
5809,25.82
5810,26.18
5811,26.43
5812,26.63
5813,26.76
5814,26.89
5815,27.00
5816,27.15
5817,27.31
5818,27.53
5819,27.80
5820,28.14
5821,28.46
5822,28.76
5823,29.02
5824,29.31
5825,29.62
5826,29.97
5827,30.30
5828,30.63
5829,30.93
5830,31.15
5831,31.25
5832,31.21
5833,31.09
5834,30.91
5835,30.74
5836,30.56
5837,30.36
5838,30.09
5839,29.81
5840,29.47
5841,29.12
5842,28.69
5843,28.22
5844,27.72
5845,27.28
5846,26.87
5847,26.52
5848,26.18
5849,25.86
5850,25.51
5851,25.16
5852,24.80
5853,24.48
5854,24.19
5855,23.99
5856,23.84
5857,23.79
5858,23.83
5859,23.98
5860,24.22
5861,24.54
5862,24.84
5863,25.09
5864,25.21
5865,25.18
5866,24.99
5867,24.68
5868,24.19
5869,23.61
5870,22.92
5871,22.21
5872,21.48
5873,20.77
5874,20.03
5875,19.33
5876,18.62
5877,17.98
5878,17.35
5879,16.77
5880,16.19
5881,15.69
5882,15.23
5883,14.85
5884,14.53
5885,14.27
5886,14.03
5887,13.85
5888,13.73
5889,13.68
5890,13.64
5891,13.62
5892,13.61
5893,13.63
5894,13.71
5895,13.85
5896,14.11
5897,14.47
5898,14.92
5899,15.40
5900,15.86
5901,16.25
5902,16.56
5903,16.76
5904,16.88
5905,16.92
5906,17.00
5907,17.14
5908,17.40
5909,17.72
5910,18.08
5911,18.41
5912,18.68
5913,18.88
5914,18.95
5915,18.91
5916,18.81
5917,18.71
5918,18.68
5919,18.75
5920,18.85
5921,18.93
5922,18.91
5923,18.73
5924,18.32
5925,17.66
5926,16.79
5927,15.82
5928,14.86
5929,14.02
5930,13.38
5931,12.99
5932,12.85
5933,12.95
5934,13.23
5935,13.60
5936,13.93
5937,14.21
5938,14.43
5939,14.60
5940,14.73
5941,14.84
5942,15.02
5943,15.30
5944,15.75
5945,16.30
5946,17.01
5947,17.81
5948,18.73
5949,19.67
5950,20.65
5951,21.57
5952,22.43
5953,23.16
5954,23.83
5955,24.41
5956,24.98
5957,25.44
5958,25.81
5959,26.05
5960,26.20
5961,26.25
5962,26.20
5963,25.99
5964,25.64
5965,25.22
5966,24.77
5967,24.33
5968,23.86
5969,23.43
5970,23.01
5971,22.66
5972,22.30
5973,21.97
5974,21.58
5975,21.16
5976,20.58
5977,19.94
5978,19.23
5979,18.55
5980,17.85
5981,17.18
5982,16.50
5983,15.88
5984,15.28
5985,14.72
5986,14.17
5987,13.67
5988,13.21
5989,12.86
5990,12.60
5991,12.45
5992,12.41
5993,12.47
5994,12.63
5995,12.83
5996,13.08
5997,13.37
5998,13.74
5999,14.18
6000,14.72
6001,15.31
6002,15.95
6003,16.61
6004,17.30
6005,17.95
6006,18.53
6007,18.97
6008,19.33
6009,19.57
6010,19.79
6011,19.96
6012,20.16
6013,20.39
6014,20.67
6015,20.99
6016,21.40
6017,21.84
6018,22.27
6019,22.63
6020,22.93
6021,23.16
6022,23.33
6023,23.38
6024,23.35
6025,23.25
6026,23.16
6027,23.09
6028,23.09
6029,23.12
6030,23.19
6031,23.33
6032,23.57
6033,23.88
6034,24.17
6035,24.36
6036,24.40
6037,24.31
6038,24.10
6039,23.83
6040,23.54
6041,23.24
6042,22.91
6043,22.60
6044,22.29
6045,21.99
6046,21.67
6047,21.35
6048,21.02
6049,20.73
6050,20.43
6051,20.21
6052,20.03
6053,19.93
6054,19.79
6055,19.60
6056,19.26
6057,18.86
6058,18.36
6059,17.84
6060,17.24
6061,16.65
6062,16.08
6063,15.64
6064,15.29
6065,15.03
6066,14.80
6067,14.60
6068,14.41
6069,14.24
6070,14.04
6071,13.90
6072,13.84
6073,13.87
6074,13.94
6075,14.01
6076,14.07
6077,14.15
6078,14.26
6079,14.34
6080,14.42
6081,14.47
6082,14.54
6083,14.63
6084,14.76
6085,14.92
6086,15.18
6087,15.54
6088,16.00
6089,16.49
6090,17.04
6091,17.61
6092,18.20
6093,18.74
6094,19.17
6095,19.47
6096,19.66
6097,19.77
6098,19.84
6099,19.86
6100,19.88
6101,19.90
6102,19.97
6103,20.04
6104,20.16
6105,20.31
6106,20.49
6107,20.67
6108,20.84
6109,20.98
6110,21.13
6111,21.30
6112,21.55
6113,21.80
6114,22.07
6115,22.34
6116,22.65
6117,23.00
6118,23.37
6119,23.73
6120,24.12
6121,24.53
6122,24.97
6123,25.36
6124,25.66
6125,25.83
6126,25.92
6127,25.88
6128,25.73
6129,25.52
6130,25.30
6131,25.11
6132,24.99
6133,24.93
6134,24.95
6135,25.01
6136,25.05
6137,25.00
6138,24.83
6139,24.55
6140,24.19
6141,23.83
6142,23.54
6143,23.33
6144,23.17
6145,23.06
6146,22.98
6147,22.93
6148,22.86
6149,22.77
6150,22.67
6151,22.64
6152,22.71
6153,22.90
6154,23.16
6155,23.44
6156,23.67
6157,23.83
6158,23.84
6159,23.74
6160,23.50
6161,23.13
6162,22.64
6163,22.11
6164,21.60
6165,21.21
6166,20.92
6167,20.69
6168,20.48
6169,20.28
6170,20.04
6171,19.78
6172,19.45
6173,19.13
6174,18.84
6175,18.63
6176,18.47
6177,18.33
6178,18.19
6179,18.04
6180,17.85
6181,17.62
6182,17.33
6183,17.06
6184,16.87
6185,16.80
6186,16.88
6187,17.10
6188,17.43
6189,17.83
6190,18.17
6191,18.39
6192,18.45
6193,18.34
6194,18.13
6195,17.89
6196,17.72
6197,17.65
6198,17.68
6199,17.77
6200,17.96
6201,18.19
6202,18.42
6203,18.60
6204,18.77
6205,18.90
6206,19.01
6207,19.10
6208,19.23
6209,19.40
6210,19.62
6211,19.82
6212,20.05
6213,20.27
6214,20.52
6215,20.75
6216,21.00
6217,21.24
6218,21.45
6219,21.59
6220,21.71
6221,21.80
6222,21.86
6223,21.89
6224,21.91
6225,21.93
6226,21.98
6227,22.06
6228,22.20
6229,22.38
6230,22.59
6231,22.77
6232,22.89
6233,22.95
6234,22.99
6235,23.05
6236,23.13
6237,23.25
6238,23.39
6239,23.55
6240,23.69
6241,23.75
6242,23.69
6243,23.48
6244,23.13
6245,22.71
6246,22.26
6247,21.87
6248,21.58
6249,21.40
6250,21.32
6251,21.36
6252,21.47
6253,21.60
6254,21.67
6255,21.68
6256,21.63
6257,21.56
6258,21.48
6259,21.43
6260,21.42
6261,21.45
6262,21.47
6263,21.45
6264,21.38
6265,21.22
6266,20.97
6267,20.65
6268,20.29
6269,19.99
6270,19.76
6271,19.65
6272,19.64
6273,19.68
6274,19.67
6275,19.57
6276,19.32
6277,18.96
6278,18.49
6279,18.02
6280,17.57
6281,17.25
6282,17.04
6283,16.94
6284,16.83
6285,16.70
6286,16.46
6287,16.14
6288,15.70
6289,15.22
6290,14.75
6291,14.36
6292,14.09
6293,13.97
6294,13.99
6295,14.11
6296,14.29
6297,14.43
6298,14.55
6299,14.63
6300,14.76
6301,14.92
6302,15.15
6303,15.46
6304,15.85
6305,16.30
6306,16.73
6307,17.11
6308,17.40
6309,17.59
6310,17.68
6311,17.68
6312,17.67
6313,17.66
6314,17.65
6315,17.62
6316,17.62
6317,17.65
6318,17.68
6319,17.62
6320,17.45
6321,17.18
6322,16.84
6323,16.44
6324,16.01
6325,15.59
6326,15.24
6327,15.03
6328,14.96
6329,14.99
6330,15.08
6331,15.21
6332,15.34
6333,15.46
6334,15.53
6335,15.56
6336,15.59
6337,15.68
6338,15.85
6339,16.08
6340,16.40
6341,16.75
6342,17.14
6343,17.53
6344,17.92
6345,18.27
6346,18.57
6347,18.78
6348,18.94
6349,19.04
6350,19.13
6351,19.17
6352,19.12
6353,19.00
6354,18.84
6355,18.73
6356,18.65
6357,18.59
6358,18.52
6359,18.47
6360,18.42
6361,18.33
6362,18.14
6363,17.78
6364,17.29
6365,16.72
6366,16.11
6367,15.54
6368,15.06
6369,14.73
6370,14.56
6371,14.58
6372,14.71
6373,14.93
6374,15.14
6375,15.30
6376,15.35
6377,15.27
6378,15.02
6379,14.66
6380,14.23
6381,13.78
6382,13.34
6383,12.95
6384,12.64
6385,12.43
6386,12.32
6387,12.30
6388,12.31
6389,12.35
6390,12.37
6391,12.34
6392,12.26
6393,12.17
6394,12.10
6395,12.07
6396,12.05
6397,12.03
6398,11.98
6399,11.88
6400,11.74
6401,11.57
6402,11.38
6403,11.19
6404,11.05
6405,10.99
6406,11.05
6407,11.22
6408,11.49
6409,11.85
6410,12.31
6411,12.81
6412,13.31
6413,13.73
6414,14.10
6415,14.42
6416,14.70
6417,14.91
6418,15.05
6419,15.12
6420,15.21
6421,15.32
6422,15.48
6423,15.65
6424,15.88
6425,16.14
6426,16.46
6427,16.82
6428,17.21
6429,17.59
6430,17.97
6431,18.33
6432,18.65
6433,18.92
6434,19.14
6435,19.26
6436,19.26
6437,19.17
6438,19.04
6439,18.90
6440,18.68
6441,18.39
6442,18.02
6443,17.60
6444,17.12
6445,16.63
6446,16.09
6447,15.56
6448,15.02
6449,14.56
6450,14.12
6451,13.76
6452,13.36
6453,12.96
6454,12.49
6455,12.00
6456,11.41
6457,10.80
6458,10.12
6459,9.48
6460,8.83
6461,8.25
6462,7.68
6463,7.19
6464,6.75
6465,6.40
6466,6.05
6467,5.71
6468,5.34
6469,4.99
6470,4.61
6471,4.26
6472,3.95
6473,3.75
6474,3.61
6475,3.52
6476,3.49
6477,3.51
6478,3.62
6479,3.80
6480,4.02
6481,4.26
6482,4.55
6483,4.93
6484,5.42
6485,6.02
6486,6.71
6487,7.39
6488,8.06
6489,8.61
6490,9.09
6491,9.44
6492,9.70
6493,9.82
6494,9.91
6495,9.99
6496,10.15
6497,10.38
6498,10.69
6499,11.04
6500,11.47
6501,11.91
6502,12.34
6503,12.69
6504,13.00
6505,13.25
6506,13.49
6507,13.66
6508,13.83
6509,13.96
6510,14.09
6511,14.21
6512,14.37
6513,14.53
6514,14.72
6515,14.92
6516,15.22
6517,15.57
6518,15.94
6519,16.24
6520,16.48
6521,16.66
6522,16.78
6523,16.78
6524,16.62
6525,16.39
6526,16.14
6527,15.88
6528,15.62
6529,15.36
6530,15.14
6531,14.99
6532,14.85
6533,14.71
6534,14.59
6535,14.50
6536,14.38
6537,14.21
6538,13.98
6539,13.75
6540,13.50
6541,13.24
6542,12.94
6543,12.65
6544,12.36
6545,12.13
6546,11.91
6547,11.74
6548,11.58
6549,11.45
6550,11.28
6551,11.05
6552,10.68
6553,10.22
6554,9.64
6555,9.05
6556,8.43
6557,7.87
6558,7.37
6559,7.03
6560,6.79
6561,6.63
6562,6.42
6563,6.17
6564,5.84
6565,5.48
6566,5.09
6567,4.73
6568,4.43
6569,4.26
6570,4.20
6571,4.23
6572,4.34
6573,4.49
6574,4.65
6575,4.83
6576,5.04
6577,5.24
6578,5.44
6579,5.61
6580,5.81
6581,6.03
6582,6.31
6583,6.57
6584,6.87
6585,7.17
6586,7.58
6587,8.04
6588,8.63
6589,9.24
6590,9.91
6591,10.54
6592,11.22
6593,11.86
6594,12.50
6595,13.05
6596,13.57
6597,14.05
6598,14.63
6599,15.26
6600,16.02
6601,16.84
6602,17.81
6603,18.81
6604,19.84
6605,20.75
6606,21.60
6607,22.29
6608,22.90
6609,23.35
6610,23.77
6611,24.10
6612,24.46
6613,24.77
6614,25.11
6615,25.47
6616,25.96
6617,26.48
6618,27.07
6619,27.63
6620,28.18
6621,28.69
6622,29.14
6623,29.46
6624,29.63
6625,29.59
6626,29.40
6627,29.09
6628,28.74
6629,28.43
6630,28.26
6631,28.22
6632,28.31
6633,28.50
6634,28.76
6635,29.04
6636,29.24
6637,29.34
6638,29.30
6639,29.15
6640,28.92
6641,28.66
6642,28.34
6643,28.03
6644,27.66
6645,27.26
6646,26.74
6647,26.16
6648,25.47
6649,24.77
6650,24.01
6651,23.31
6652,22.64
6653,22.09
6654,21.58
6655,21.12
6656,20.62
6657,20.16
6658,19.70
6659,19.26
6660,18.78
6661,18.36
6662,17.95
6663,17.63
6664,17.32
6665,17.04
6666,16.75
6667,16.49
6668,16.19
6669,15.84
6670,15.43
6671,15.05
6672,14.69
6673,14.40
6674,14.14
6675,13.94
6676,13.76
6677,13.65
6678,13.57
6679,13.52
6680,13.44
6681,13.32
6682,13.19
6683,13.10
6684,13.07
6685,13.09
6686,13.18
6687,13.33
6688,13.57
6689,13.90
6690,14.27
6691,14.60
6692,14.89
6693,15.14
6694,15.43
6695,15.72
6696,16.04
6697,16.34
6698,16.61
6699,16.81
6700,16.95
6701,17.01
6702,17.02
6703,16.98
6704,16.92
6705,16.88
6706,16.93
6707,17.04
6708,17.20
6709,17.35
6710,17.51
6711,17.69
6712,17.85
6713,17.94
6714,17.94
6715,17.89
6716,17.82
6717,17.75
6718,17.67
6719,17.59
6720,17.54
6721,17.50
6722,17.43
6723,17.33
6724,17.17
6725,17.00
6726,16.75
6727,16.46
6728,16.16
6729,15.91
6730,15.73
6731,15.62
6732,15.56
6733,15.53
6734,15.49
6735,15.40
6736,15.27
6737,15.12
6738,14.96
6739,14.82
6740,14.69
6741,14.60
6742,14.55
6743,14.56
6744,14.58
6745,14.59
6746,14.53
6747,14.44
6748,14.35
6749,14.31
6750,14.35
6751,14.45
6752,14.59
6753,14.74
6754,14.85
6755,14.90
6756,14.82
6757,14.64
6758,14.37
6759,14.07
6760,13.79
6761,13.55
6762,13.32
6763,13.13
6764,12.94
6765,12.73
6766,12.42
6767,11.99
6768,11.44
6769,10.89
6770,10.36
6771,9.90
6772,9.51
6773,9.24
6774,9.06
6775,8.98
6776,8.97
6777,9.00
6778,9.03
6779,9.03
6780,9.04
6781,9.09
6782,9.20
6783,9.36
6784,9.55
6785,9.75
6786,9.98
6787,10.22
6788,10.48
6789,10.74
6790,10.99
6791,11.19
6792,11.39
6793,11.55
6794,11.75
6795,11.98
6796,12.31
6797,12.69
6798,13.11
6799,13.51
6800,13.98
6801,14.44
6802,14.92
6803,15.29
6804,15.62
6805,15.90
6806,16.21
6807,16.50
6808,16.78
6809,17.01
6810,17.25
6811,17.48
6812,17.72
6813,17.96
6814,18.22
6815,18.47
6816,18.75
6817,19.01
6818,19.30
6819,19.58
6820,19.91
6821,20.23
6822,20.59
6823,20.99
6824,21.38
6825,21.71
6826,21.94
6827,22.06
6828,22.07
6829,21.95
6830,21.67
6831,21.25
6832,20.76
6833,20.32
6834,19.94
6835,19.65
6836,19.38
6837,19.13
6838,18.81
6839,18.43
6840,17.94
6841,17.35
6842,16.67
6843,16.01
6844,15.40
6845,14.96
6846,14.70
6847,14.62
6848,14.63
6849,14.72
6850,14.78
6851,14.78
6852,14.65
6853,14.42
6854,14.12
6855,13.85
6856,13.61
6857,13.47
6858,13.46
6859,13.58
6860,13.75
6861,13.89
6862,13.93
6863,13.89
6864,13.79
6865,13.68
6866,13.57
6867,13.51
6868,13.50
6869,13.53
6870,13.61
6871,13.67
6872,13.66
6873,13.54
6874,13.33
6875,13.09
6876,12.83
6877,12.56
6878,12.28
6879,12.05
6880,11.87
6881,11.76
6882,11.66
6883,11.57
6884,11.52
6885,11.51
6886,11.53
6887,11.57
6888,11.63
6889,11.75
6890,11.90
6891,12.05
6892,12.21
6893,12.41
6894,12.69
6895,13.02
6896,13.37
6897,13.69
6898,14.02
6899,14.34
6900,14.67
6901,14.96
6902,15.23
6903,15.46
6904,15.71
6905,16.00
6906,16.37
6907,16.78
6908,17.27
6909,17.76
6910,18.28
6911,18.75
6912,19.19
6913,19.52
6914,19.73
6915,19.81
6916,19.79
6917,19.70
6918,19.58
6919,19.46
6920,19.36
6921,19.27
6922,19.14
6923,18.95
6924,18.63
6925,18.16
6926,17.49
6927,16.69
6928,15.79
6929,14.92
6930,14.11
6931,13.47
6932,12.99
6933,12.70
6934,12.50
6935,12.31
6936,12.05
6937,11.70
6938,11.21
6939,10.66
6940,10.03
6941,9.45
6942,8.88
6943,8.45
6944,8.13
6945,7.93
6946,7.76
6947,7.60
6948,7.39
6949,7.16
6950,6.84
6951,6.46
6952,6.00
6953,5.53
6954,5.04
6955,4.55
6956,4.13
6957,3.80
6958,3.57
6959,3.43
6960,3.35
6961,3.35
6962,3.43
6963,3.61
6964,3.88
6965,4.21
6966,4.55
6967,4.89
6968,5.20
6969,5.47
6970,5.67
6971,5.78
6972,5.87
6973,5.94
6974,6.05
6975,6.17
6976,6.32
6977,6.46
6978,6.58
6979,6.68
6980,6.76
6981,6.79
6982,6.73
6983,6.55
6984,6.27
6985,5.94
6986,5.58
6987,5.20
6988,4.79
6989,4.36
6990,3.95
6991,3.62
6992,3.42
6993,3.32
6994,3.30
6995,3.34
6996,3.45
6997,3.59
6998,3.74
6999,3.88
7000,4.10
7001,4.43
7002,4.84
7003,5.31
7004,5.89
7005,6.54
7006,7.23
7007,7.86
7008,8.42
7009,8.85
7010,9.19
7011,9.38
7012,9.49
7013,9.51
7014,9.51
7015,9.53
7016,9.62
7017,9.80
7018,10.09
7019,10.44
7020,10.83
7021,11.18
7022,11.50
7023,11.70
7024,11.81
7025,11.83
7026,11.83
7027,11.88
7028,12.05
7029,12.31
7030,12.65
7031,13.05
7032,13.51
7033,13.99
7034,14.40
7035,14.69
7036,14.79
7037,14.76
7038,14.59
7039,14.32
7040,13.98
7041,13.60
7042,13.16
7043,12.69
7044,12.16
7045,11.65
7046,11.20
7047,10.87
7048,10.66
7049,10.62
7050,10.70
7051,10.89
7052,11.08
7053,11.18
7054,11.13
7055,10.93
7056,10.54
7057,10.04
7058,9.45
7059,8.88
7060,8.37
7061,8.01
7062,7.84
7063,7.88
7064,8.05
7065,8.27
7066,8.46
7067,8.58
7068,8.61
7069,8.52
7070,8.30
7071,7.99
7072,7.70
7073,7.51
7074,7.50
7075,7.67
7076,8.04
7077,8.54
7078,9.17
7079,9.82
7080,10.48
7081,11.06
7082,11.63
7083,12.15
7084,12.70
7085,13.24
7086,13.89
7087,14.56
7088,15.27
7089,15.88
7090,16.46
7091,16.95
7092,17.41
7093,17.78
7094,18.14
7095,18.42
7096,18.68
7097,18.91
7098,19.16
7099,19.35
7100,19.55
7101,19.71
7102,19.93
7103,20.15
7104,20.40
7105,20.64
7106,20.90
7107,21.13
7108,21.32
7109,21.46
7110,21.62
7111,21.81
7112,22.09
7113,22.38
7114,22.71
7115,23.04
7116,23.36
7117,23.66
7118,23.94
7119,24.18
7120,24.35
7121,24.44
7122,24.44
7123,24.35
7124,24.19
7125,23.94
7126,23.62
7127,23.27
7128,22.91
7129,22.58
7130,22.29
7131,22.06
7132,21.87
7133,21.70
7134,21.46
7135,21.17
7136,20.81
7137,20.46
7138,20.09
7139,19.74
7140,19.39
7141,19.07
7142,18.75
7143,18.39
7144,17.98
7145,17.57
7146,17.17
7147,16.88
7148,16.67
7149,16.59
7150,16.62
7151,16.72
7152,16.79
7153,16.78
7154,16.62
7155,16.31
7156,15.88
7157,15.40
7158,14.95
7159,14.63
7160,14.40
7161,14.28
7162,14.27
7163,14.36
7164,14.54
7165,14.78
7166,15.05
7167,15.35
7168,15.69
7169,16.08
7170,16.52
7171,16.93
7172,17.30
7173,17.59
7174,17.85
7175,18.06
7176,18.20
7177,18.26
7178,18.28
7179,18.30
7180,18.34
7181,18.39
7182,18.49
7183,18.57
7184,18.65
7185,18.75
7186,18.87
7187,19.01
7188,19.17
7189,19.36
7190,19.42
7191,19.36
7192,19.33
7193,18.78
7194,19.32
7195,21.32
7196,21.34
7197,16.42
7198,13.37
7199,24.42
7200,34.17
