1,-30.99
2,-44.42
3,-43.33
4,-35.04
5,-30.94
6,-32.03
7,-30.02
8,-18.34
9,0.02
10,17.03
11,27.19
12,31.25
13,32.56
14,33.27
15,33.35
16,33.13
17,32.64
18,32.22
19,31.39
20,30.38
21,29.03
22,27.63
23,26.08
24,24.53
25,23.12
26,21.96
27,21.19
28,20.70
29,20.47
30,20.24
31,20.00
32,19.60
33,19.13
34,18.52
35,17.88
36,17.17
37,16.51
38,15.84
39,15.24
40,14.62
41,14.03
42,13.42
43,12.88
44,12.33
45,11.85
46,11.35
47,10.91
48,10.45
49,10.04
50,9.62
51,9.24
52,8.85
53,8.49
54,8.10
55,7.75
56,7.39
57,7.06
58,6.73
59,6.43
60,6.12
61,5.84
62,5.55
63,5.28
64,4.98
65,4.70
66,4.42
67,4.16
68,3.90
69,3.67
70,3.43
71,3.22
72,3.01
73,2.82
74,2.63
75,2.47
76,2.30
77,2.14
78,1.98
79,1.83
80,1.68
81,1.55
82,1.41
83,1.28
84,1.14
85,1.01
86,0.88
87,0.76
88,0.63
89,0.51
90,0.39
91,0.28
92,0.17
93,0.07
94,-0.03
95,-0.12
96,-0.21
97,-0.29
98,-0.37
99,-0.44
100,-0.52
101,-0.59
102,-0.66
103,-0.73
104,-0.80
105,-0.86
106,-0.92
107,-0.98
108,-1.04
109,-1.10
110,-1.16
111,-1.23
112,-1.30
113,-1.37
114,-1.45
115,-1.53
116,-1.61
117,-1.69
118,-1.78
119,-1.86
120,-1.93
121,-2.01
122,-2.08
123,-2.13
124,-2.19
125,-2.24
126,-2.29
127,-2.34
128,-2.38
129,-2.42
130,-2.46
131,-2.49
132,-2.54
133,-2.58
134,-2.63
135,-2.68
136,-2.74
137,-2.79
138,-2.85
139,-2.90
140,-2.96
141,-3.01
142,-3.06
143,-3.10
144,-3.14
145,-3.18
146,-3.21
147,-3.24
148,-3.26
149,-3.28
150,-3.31
151,-3.33
152,-3.35
153,-3.38
154,-3.41
155,-3.43
156,-3.46
157,-3.49
158,-3.52
159,-3.55
160,-3.58
161,-3.60
162,-3.63
163,-3.65
164,-3.67
165,-3.68
166,-3.70
167,-3.71
168,-3.73
169,-3.74
170,-3.75
171,-3.76
172,-3.77
173,-3.78
174,-3.79
175,-3.80
176,-3.80
177,-3.81
178,-3.81
179,-3.80
180,-3.80
181,-3.79
182,-3.77
183,-3.76
184,-3.74
185,-3.71
186,-3.68
187,-3.66
188,-3.63
189,-3.60
190,-3.57
191,-3.55
192,-3.53
193,-3.52
194,-3.50
195,-3.50
196,-3.49
197,-3.49
198,-3.49
199,-3.49
200,-3.49
201,-3.51
202,-3.52
203,-3.55
204,-3.57
205,-3.59
206,-3.61
207,-3.63
208,-3.65
209,-3.67
210,-3.69
211,-3.71
212,-3.73
213,-3.74
214,-3.76
215,-3.77
216,-3.78
217,-3.79
218,-3.80
219,-3.80
220,-3.80
221,-3.80
222,-3.80
223,-3.80
224,-3.80
225,-3.80
226,-3.80
227,-3.81
228,-3.81
229,-3.81
230,-3.82
231,-3.83
232,-3.84
233,-3.85
234,-3.85
235,-3.86
236,-3.88
237,-3.89
238,-3.90
239,-3.91
240,-3.92
241,-3.93
242,-3.95
243,-3.96
244,-3.97
245,-3.99
246,-4.00
247,-4.00
248,-4.01
249,-4.01
250,-4.02
251,-4.02
252,-4.02
253,-4.03
254,-4.03
255,-4.03
256,-4.03
257,-4.03
258,-4.03
259,-4.02
260,-4.02
261,-4.02
262,-4.02
263,-4.02
264,-4.01
265,-4.01
266,-4.01
267,-4.00
268,-4.00
269,-3.99
270,-3.99
271,-3.99
272,-3.99
273,-3.99
274,-3.99
275,-3.99
276,-3.99
277,-3.99
278,-3.99
279,-3.98
280,-3.97
281,-3.96
282,-3.95
283,-3.93
284,-3.90
285,-3.88
286,-3.85
287,-3.82
288,-3.79
289,-3.76
290,-3.74
291,-3.72
292,-3.69
293,-3.67
294,-3.65
295,-3.63
296,-3.62
297,-3.61
298,-3.59
299,-3.58
300,-3.57
301,-3.57
302,-3.57
303,-3.56
304,-3.57
305,-3.57
306,-3.58
307,-3.59
308,-3.61
309,-3.62
310,-3.64
311,-3.65
312,-3.66
313,-3.67
314,-3.68
315,-3.69
316,-3.70
317,-3.71
318,-3.72
319,-3.74
320,-3.76
321,-3.79
322,-3.81
323,-3.84
324,-3.88
325,-3.91
326,-3.95
327,-3.98
328,-4.02
329,-4.05
330,-4.09
331,-4.14
332,-4.18
333,-4.21
334,-4.24
335,-4.27
336,-4.30
337,-4.32
338,-4.34
339,-4.36
340,-4.37
341,-4.38
342,-4.39
343,-4.40
344,-4.40
345,-4.41
346,-4.42
347,-4.43
348,-4.44
349,-4.46
350,-4.47
351,-4.48
352,-4.50
353,-4.51
354,-4.54
355,-4.56
356,-4.59
357,-4.61
358,-4.64
359,-4.66
360,-4.69
361,-4.71
362,-4.73
363,-4.74
364,-4.75
365,-4.76
366,-4.76
367,-4.77
368,-4.76
369,-4.76
370,-4.75
371,-4.75
372,-4.74
373,-4.73
374,-4.72
375,-4.71
376,-4.70
377,-4.69
378,-4.68
379,-4.68
380,-4.67
381,-4.67
382,-4.66
383,-4.66
384,-4.65
385,-4.64
386,-4.63
387,-4.61
388,-4.59
389,-4.58
390,-4.56
391,-4.54
392,-4.51
393,-4.47
394,-4.43
395,-4.40
396,-4.36
397,-4.33
398,-4.31
399,-4.29
400,-4.27
401,-4.26
402,-4.24
403,-4.24
404,-4.23
405,-4.22
406,-4.22
407,-4.21
408,-4.21
409,-4.20
410,-4.20
411,-4.20
412,-4.20
413,-4.20
414,-4.20
415,-4.20
416,-4.21
417,-4.21
418,-4.22
419,-4.22
420,-4.22
421,-4.23
422,-4.23
423,-4.23
424,-4.23
425,-4.23
426,-4.23
427,-4.23
428,-4.22
429,-4.21
430,-4.20
431,-4.19
432,-4.17
433,-4.16
434,-4.14
435,-4.13
436,-4.11
437,-4.10
438,-4.09
439,-4.07
440,-4.06
441,-4.05
442,-4.04
443,-4.03
444,-4.01
445,-4.00
446,-3.98
447,-3.96
448,-3.94
449,-3.91
450,-3.89
451,-3.86
452,-3.83
453,-3.81
454,-3.78
455,-3.76
456,-3.74
457,-3.72
458,-3.70
459,-3.69
460,-3.68
461,-3.67
462,-3.66
463,-3.66
464,-3.65
465,-3.64
466,-3.63
467,-3.62
468,-3.61
469,-3.60
470,-3.59
471,-3.58
472,-3.57
473,-3.56
474,-3.55
475,-3.55
476,-3.55
477,-3.55
478,-3.55
479,-3.56
480,-3.57
481,-3.58
482,-3.60
483,-3.61
484,-3.62
485,-3.63
486,-3.64
487,-3.65
488,-3.65
489,-3.65
490,-3.65
491,-3.65
492,-3.64
493,-3.64
494,-3.64
495,-3.63
496,-3.63
497,-3.63
498,-3.63
499,-3.63
500,-3.62
501,-3.62
502,-3.62
503,-3.61
504,-3.61
505,-3.61
506,-3.61
507,-3.61
508,-3.61
509,-3.61
510,-3.62
511,-3.63
512,-3.64
513,-3.65
514,-3.67
515,-3.68
516,-3.70
517,-3.72
518,-3.74
519,-3.76
520,-3.78
521,-3.80
522,-3.83
523,-3.85
524,-3.88
525,-3.91
526,-3.94
527,-3.98
528,-4.01
529,-4.05
530,-4.09
531,-4.13
532,-4.17
533,-4.21
534,-4.24
535,-4.27
536,-4.30
537,-4.32
538,-4.34
539,-4.35
540,-4.35
541,-4.35
542,-4.35
543,-4.34
544,-4.32
545,-4.31
546,-4.30
547,-4.28
548,-4.27
549,-4.25
550,-4.24
551,-4.24
552,-4.23
553,-4.24
554,-4.24
555,-4.25
556,-4.26
557,-4.26
558,-4.28
559,-4.29
560,-4.30
561,-4.31
562,-4.32
563,-4.33
564,-4.34
565,-4.34
566,-4.35
567,-4.35
568,-4.36
569,-4.36
570,-4.37
571,-4.38
572,-4.39
573,-4.39
574,-4.40
575,-4.42
576,-4.43
577,-4.44
578,-4.45
579,-4.46
580,-4.48
581,-4.49
582,-4.50
583,-4.51
584,-4.51
585,-4.51
586,-4.51
587,-4.50
588,-4.50
589,-4.48
590,-4.47
591,-4.46
592,-4.45
593,-4.44
594,-4.43
595,-4.43
596,-4.43
597,-4.44
598,-4.45
599,-4.47
600,-4.50
601,-4.53
602,-4.56
603,-4.59
604,-4.61
605,-4.64
606,-4.66
607,-4.68
608,-4.69
609,-4.70
610,-4.70
611,-4.69
612,-4.68
613,-4.67
614,-4.66
615,-4.66
616,-4.65
617,-4.65
618,-4.64
619,-4.64
620,-4.64
621,-4.65
622,-4.66
623,-4.66
624,-4.67
625,-4.68
626,-4.69
627,-4.69
628,-4.70
629,-4.70
630,-4.70
631,-4.70
632,-4.70
633,-4.70
634,-4.69
635,-4.68
636,-4.66
637,-4.64
638,-4.61
639,-4.59
640,-4.56
641,-4.54
642,-4.51
643,-4.48
644,-4.44
645,-4.42
646,-4.40
647,-4.38
648,-4.36
649,-4.34
650,-4.32
651,-4.31
652,-4.29
653,-4.28
654,-4.26
655,-4.24
656,-4.23
657,-4.21
658,-4.20
659,-4.18
660,-4.17
661,-4.16
662,-4.15
663,-4.15
664,-4.15
665,-4.16
666,-4.17
667,-4.18
668,-4.20
669,-4.22
670,-4.24
671,-4.26
672,-4.28
673,-4.29
674,-4.31
675,-4.32
676,-4.33
677,-4.33
678,-4.34
679,-4.33
680,-4.33
681,-4.33
682,-4.34
683,-4.34
684,-4.35
685,-4.37
686,-4.39
687,-4.41
688,-4.45
689,-4.48
690,-4.51
691,-4.55
692,-4.58
693,-4.61
694,-4.63
695,-4.65
696,-4.66
697,-4.67
698,-4.68
699,-4.68
700,-4.68
701,-4.68
702,-4.67
703,-4.67
704,-4.66
705,-4.66
706,-4.66
707,-4.66
708,-4.67
709,-4.67
710,-4.68
711,-4.68
712,-4.69
713,-4.69
714,-4.70
715,-4.70
716,-4.70
717,-4.69
718,-4.69
719,-4.68
720,-4.67
721,-4.66
722,-4.65
723,-4.64
724,-4.64
725,-4.63
726,-4.63
727,-4.63
728,-4.64
729,-4.64
730,-4.65
731,-4.66
732,-4.67
733,-4.68
734,-4.70
735,-4.71
736,-4.73
737,-4.74
738,-4.75
739,-4.76
740,-4.78
741,-4.79
742,-4.79
743,-4.79
744,-4.79
745,-4.79
746,-4.78
747,-4.77
748,-4.77
749,-4.76
750,-4.75
751,-4.74
752,-4.73
753,-4.72
754,-4.71
755,-4.71
756,-4.70
757,-4.70
758,-4.70
759,-4.70
760,-4.69
761,-4.69
762,-4.68
763,-4.68
764,-4.67
765,-4.66
766,-4.64
767,-4.63
768,-4.61
769,-4.59
770,-4.56
771,-4.53
772,-4.50
773,-4.47
774,-4.44
775,-4.41
776,-4.37
777,-4.34
778,-4.30
779,-4.27
780,-4.23
781,-4.20
782,-4.17
783,-4.13
784,-4.10
785,-4.07
786,-4.05
787,-4.02
788,-4.00
789,-3.99
790,-3.98
791,-3.98
792,-3.98
793,-3.99
794,-4.00
795,-4.01
796,-4.03
797,-4.04
798,-4.06
799,-4.07
800,-4.08
801,-4.08
802,-4.08
803,-4.08
804,-4.07
805,-4.05
806,-4.03
807,-4.01
808,-3.98
809,-3.96
810,-3.93
811,-3.90
812,-3.88
813,-3.85
814,-3.83
815,-3.80
816,-3.78
817,-3.76
818,-3.74
819,-3.73
820,-3.71
821,-3.70
822,-3.69
823,-3.68
824,-3.68
825,-3.67
826,-3.67
827,-3.66
828,-3.66
829,-3.67
830,-3.67
831,-3.66
832,-3.66
833,-3.66
834,-3.66
835,-3.65
836,-3.65
837,-3.64
838,-3.63
839,-3.63
840,-3.63
841,-3.63
842,-3.63
843,-3.64
844,-3.66
845,-3.67
846,-3.70
847,-3.73
848,-3.76
849,-3.79
850,-3.82
851,-3.85
852,-3.88
853,-3.90
854,-3.92
855,-3.94
856,-3.95
857,-3.96
858,-3.97
859,-3.98
860,-3.98
861,-3.99
862,-3.99
863,-3.99
864,-3.99
865,-3.99
866,-3.99
867,-3.98
868,-3.97
869,-3.97
870,-3.95
871,-3.94
872,-3.92
873,-3.91
874,-3.89
875,-3.87
876,-3.86
877,-3.85
878,-3.85
879,-3.84
880,-3.83
881,-3.83
882,-3.83
883,-3.83
884,-3.83
885,-3.82
886,-3.82
887,-3.82
888,-3.82
889,-3.82
890,-3.82
891,-3.82
892,-3.82
893,-3.82
894,-3.82
895,-3.82
896,-3.83
897,-3.83
898,-3.84
899,-3.84
900,-3.85
901,-3.86
902,-3.87
903,-3.88
904,-3.89
905,-3.91
906,-3.92
907,-3.93
908,-3.95
909,-3.96
910,-3.97
911,-3.99
912,-4.01
913,-4.02
914,-4.03
915,-4.05
916,-4.07
917,-4.09
918,-4.11
919,-4.13
920,-4.15
921,-4.18
922,-4.20
923,-4.23
924,-4.26
925,-4.28
926,-4.32
927,-4.35
928,-4.38
929,-4.41
930,-4.44
931,-4.48
932,-4.51
933,-4.54
934,-4.57
935,-4.60
936,-4.63
937,-4.66
938,-4.69
939,-4.71
940,-4.74
941,-4.76
942,-4.78
943,-4.80
944,-4.83
945,-4.85
946,-4.87
947,-4.89
948,-4.92
949,-4.94
950,-4.97
951,-4.99
952,-5.02
953,-5.06
954,-5.09
955,-5.13
956,-5.17
957,-5.21
958,-5.25
959,-5.30
960,-5.35
961,-5.39
962,-5.44
963,-5.48
964,-5.52
965,-5.56
966,-5.60
967,-5.63
968,-5.66
969,-5.68
970,-5.70
971,-5.72
972,-5.73
973,-5.74
974,-5.75
975,-5.75
976,-5.76
977,-5.76
978,-5.76
979,-5.76
980,-5.76
981,-5.76
982,-5.77
983,-5.77
984,-5.77
985,-5.78
986,-5.78
987,-5.79
988,-5.80
989,-5.80
990,-5.80
991,-5.80
992,-5.80
993,-5.79
994,-5.78
995,-5.76
996,-5.75
997,-5.73
998,-5.71
999,-5.69
1000,-5.67
1001,-5.65
1002,-5.63
1003,-5.62
1004,-5.61
1005,-5.60
1006,-5.59
1007,-5.58
1008,-5.57
1009,-5.56
1010,-5.55
1011,-5.54
1012,-5.53
1013,-5.51
1014,-5.50
1015,-5.48
1016,-5.46
1017,-5.45
1018,-5.44
1019,-5.43
1020,-5.42
1021,-5.41
1022,-5.40
1023,-5.40
1024,-5.39
1025,-5.39
1026,-5.38
1027,-5.38
1028,-5.37
1029,-5.37
1030,-5.36
1031,-5.36
1032,-5.35
1033,-5.34
1034,-5.34
1035,-5.34
1036,-5.34
1037,-5.34
1038,-5.35
1039,-5.35
1040,-5.35
1041,-5.36
1042,-5.36
1043,-5.37
1044,-5.37
1045,-5.38
1046,-5.38
1047,-5.38
1048,-5.38
1049,-5.38
1050,-5.39
1051,-5.39
1052,-5.39
1053,-5.40
1054,-5.41
1055,-5.42
1056,-5.44
1057,-5.46
1058,-5.47
1059,-5.49
1060,-5.52
1061,-5.53
1062,-5.55
1063,-5.57
1064,-5.58
1065,-5.58
1066,-5.58
1067,-5.58
1068,-5.58
1069,-5.58
1070,-5.57
1071,-5.56
1072,-5.55
1073,-5.54
1074,-5.53
1075,-5.52
1076,-5.50
1077,-5.49
1078,-5.48
1079,-5.47
1080,-5.46
1081,-5.45
1082,-5.44
1083,-5.43
1084,-5.43
1085,-5.42
1086,-5.42
1087,-5.41
1088,-5.41
1089,-5.40
1090,-5.39
1091,-5.37
1092,-5.35
1093,-5.33
1094,-5.31
1095,-5.29
1096,-5.26
1097,-5.23
1098,-5.21
1099,-5.18
1100,-5.16
1101,-5.13
1102,-5.11
1103,-5.10
1104,-5.08
1105,-5.07
1106,-5.06
1107,-5.06
1108,-5.05
1109,-5.05
1110,-5.06
1111,-5.07
1112,-5.08
1113,-5.09
1114,-5.11
1115,-5.14
1116,-5.16
1117,-5.19
1118,-5.21
1119,-5.24
1120,-5.26
1121,-5.28
1122,-5.30
1123,-5.31
1124,-5.32
1125,-5.32
1126,-5.32
1127,-5.32
1128,-5.31
1129,-5.29
1130,-5.28
1131,-5.26
1132,-5.24
1133,-5.23
1134,-5.21
1135,-5.19
1136,-5.18
1137,-5.16
1138,-5.15
1139,-5.14
1140,-5.12
1141,-5.11
1142,-5.09
1143,-5.08
1144,-5.06
1145,-5.05
1146,-5.03
1147,-5.01
1148,-4.99
1149,-4.97
1150,-4.95
1151,-4.93
1152,-4.91
1153,-4.89
1154,-4.88
1155,-4.87
1156,-4.87
1157,-4.87
1158,-4.88
1159,-4.90
1160,-4.91
1161,-4.94
1162,-4.96
1163,-4.99
1164,-5.02
1165,-5.05
1166,-5.08
1167,-5.11
1168,-5.13
1169,-5.15
1170,-5.16
1171,-5.17
1172,-5.17
1173,-5.16
1174,-5.16
1175,-5.15
1176,-5.14
1177,-5.13
1178,-5.12
1179,-5.11
1180,-5.09
1181,-5.08
1182,-5.06
1183,-5.05
1184,-5.03
1185,-5.02
1186,-5.00
1187,-4.99
1188,-4.98
1189,-4.99
1190,-4.97
1191,-4.94
1192,-4.91
1193,-5.17
1194,-5.20
1195,-4.73
1196,-4.26
1197,-5.22
1198,-6.64
1199,-5.19
1200,-1.14
