1,632.23
2,907.32
3,912.81
4,791.75
5,713.90
6,689.06
7,629.27
8,515.75
9,385.19
10,271.00
11,176.18
12,117.80
13,112.58
14,170.35
15,281.80
16,422.91
17,570.04
18,693.05
19,777.59
20,812.59
21,804.50
22,759.89
23,691.38
24,606.48
25,510.59
26,407.20
27,299.26
28,193.73
29,100.40
30,29.97
31,-6.87
32,-8.39
33,24.17
34,77.18
35,138.73
36,191.47
37,227.81
38,242.37
39,240.42
40,228.52
41,215.94
42,208.77
43,209.26
44,217.29
45,228.18
46,239.14
47,245.82
48,248.47
49,247.31
50,244.87
51,242.77
52,242.31
53,243.56
54,246.09
55,248.99
56,251.80
57,253.88
58,255.37
59,256.26
60,256.96
61,257.63
62,258.51
63,259.43
64,260.44
65,261.35
66,262.36
67,263.28
68,264.19
69,264.89
70,265.50
71,265.90
72,266.33
73,266.78
74,267.49
75,268.16
76,268.74
77,269.23
78,269.84
79,270.51
80,271.18
81,271.67
82,272.06
83,272.52
84,273.04
85,273.53
86,273.99
87,274.48
88,275.02
89,275.48
90,275.73
91,275.76
92,275.63
93,275.33
94,274.90
95,274.44
96,274.17
97,274.14
98,274.23
99,274.26
100,274.23
101,274.23
102,274.17
103,273.99
104,273.47
105,272.74
106,271.91
107,271.18
108,270.69
109,270.45
110,270.36
111,270.39
112,270.42
113,270.45
114,270.32
115,270.08
116,269.78
117,269.53
118,269.44
119,269.44
120,269.44
121,269.44
122,269.56
123,269.78
124,270.05
125,270.29
126,270.57
127,270.75
128,270.94
129,271.21
130,271.73
131,272.40
132,273.04
133,273.56
134,274.05
135,274.51
136,274.81
137,274.81
138,274.63
139,274.35
140,274.08
141,273.86
142,273.71
143,273.71
144,273.83
145,274.08
146,274.35
147,274.60
148,274.81
149,275.05
150,275.30
151,275.54
152,275.73
153,275.73
154,275.54
155,275.30
156,275.05
157,274.81
158,274.57
159,274.32
160,274.14
161,274.14
162,274.35
163,274.60
164,274.75
165,274.75
166,274.66
167,274.66
168,274.78
169,275.02
170,275.30
171,275.54
172,275.76
173,276.00
174,276.28
175,276.49
176,276.67
177,276.95
178,277.31
179,277.77
180,278.23
181,278.75
182,279.30
183,279.75
184,279.94
185,279.94
186,280.03
187,280.21
188,280.55
189,280.79
190,281.07
191,281.52
192,282.20
193,282.90
194,283.60
195,284.33
196,285.13
197,285.80
198,286.29
199,286.53
200,286.77
201,286.96
202,287.05
203,287.05
204,287.26
205,287.69
206,288.30
207,289.03
208,290.01
209,291.17
210,292.39
211,293.40
212,294.16
213,294.59
214,294.65
215,294.43
216,294.10
217,293.85
218,293.64
219,293.43
220,293.18
221,292.94
222,292.63
223,292.14
224,291.47
225,290.80
226,290.10
227,289.37
228,288.57
229,287.87
230,287.35
231,287.14
232,286.96
233,286.74
234,286.47
235,286.22
236,286.04
237,285.80
238,285.46
239,285.22
240,285.28
241,285.49
242,285.68
243,285.71
244,285.71
245,285.68
246,285.55
247,285.31
248,285.10
249,285.10
250,285.34
251,285.58
252,285.68
253,285.68
254,285.74
255,285.74
256,285.40
257,284.70
258,283.84
259,283.05
260,282.50
261,282.29
262,282.47
263,282.96
264,283.54
265,284.06
266,284.39
267,284.64
268,284.67
269,284.45
270,283.97
271,283.20
272,282.35
273,281.65
274,281.19
275,280.98
276,280.76
277,280.52
278,280.36
279,280.36
280,280.43
281,280.46
282,280.36
283,280.36
284,280.52
285,280.79
286,280.98
287,280.94
288,280.82
289,280.85
290,281.07
291,281.28
292,281.25
293,281.04
294,280.91
295,280.88
296,280.79
297,280.58
298,280.36
299,280.33
300,280.49
301,280.76
302,281.07
303,281.28
304,281.37
305,281.37
306,281.37
307,281.37
308,281.31
309,281.07
310,280.73
311,280.49
312,280.40
313,280.40
314,280.36
315,280.40
316,280.55
317,280.76
318,280.98
319,281.22
320,281.62
321,282.07
322,282.38
323,282.44
324,282.26
325,282.01
326,281.59
327,281.16
328,280.76
329,280.52
330,280.24
331,279.79
332,279.17
333,278.44
334,277.59
335,276.67
336,275.63
337,274.69
338,273.77
339,273.10
340,272.52
341,272.06
342,271.61
343,271.15
344,270.63
345,270.17
346,269.71
347,269.26
348,268.71
349,268.25
350,267.85
351,267.64
352,267.43
353,267.21
354,266.97
355,266.69
356,266.42
357,266.20
358,266.08
359,266.11
360,266.14
361,266.14
362,266.11
363,266.11
364,266.11
365,266.14
366,266.14
367,266.11
368,266.11
369,266.11
370,266.17
371,266.17
372,266.02
373,265.78
374,265.59
375,265.59
376,265.69
377,265.69
378,265.59
379,265.59
380,265.78
381,266.02
382,266.11
383,265.90
384,265.41
385,264.65
386,263.61
387,262.42
388,261.35
389,260.62
390,260.25
391,260.28
392,260.68
393,261.38
394,262.18
395,262.94
396,263.58
397,264.04
398,264.25
399,264.25
400,264.22
401,264.19
402,264.19
403,264.19
404,264.31
405,264.56
406,264.80
407,264.80
408,264.50
409,264.01
410,263.58
411,263.31
412,263.18
413,263.21
414,263.37
415,263.61
416,263.82
417,264.10
418,264.40
419,264.62
420,264.62
421,264.37
422,264.16
423,264.10
424,264.25
425,264.53
426,264.92
427,265.38
428,265.84
429,266.33
430,266.94
431,267.61
432,268.37
433,269.10
434,269.87
435,270.57
436,271.18
437,271.67
438,272.06
439,272.28
440,272.28
441,272.06
442,271.67
443,271.18
444,270.60
445,269.87
446,269.04
447,268.34
448,267.79
449,267.30
450,266.75
451,266.33
452,266.08
453,266.11
454,266.05
455,265.84
456,265.50
457,265.26
458,265.08
459,264.86
460,264.50
461,264.04
462,263.49
463,263.00
464,262.63
465,262.42
466,262.24
467,261.99
468,261.57
469,261.11
470,260.74
471,260.53
472,260.22
473,259.74
474,259.12
475,258.64
476,258.42
477,258.42
478,258.54
479,258.82
480,259.25
481,259.70
482,260.07
483,260.31
484,260.62
485,261.08
486,261.66
487,262.12
488,262.45
489,262.66
490,262.94
491,263.12
492,263.34
493,263.52
494,264.07
495,264.98
496,266.36
497,267.76
498,269.17
499,270.60
500,272.28
501,273.90
502,275.30
503,276.21
504,277.07
505,277.95
506,278.99
507,279.94
508,280.98
509,282.07
510,283.54
511,285.19
512,287.14
513,289.00
514,290.77
515,292.21
516,293.40
517,294.31
518,295.01
519,295.50
520,295.84
521,296.02
522,296.20
523,296.45
524,296.88
525,297.33
526,297.70
527,297.94
528,298.22
529,298.46
530,298.46
531,298.25
532,297.88
533,297.67
534,297.52
535,297.30
536,296.78
537,296.11
538,295.26
539,294.31
540,293.09
541,291.69
542,290.16
543,288.76
544,287.32
545,285.95
546,284.42
547,283.02
548,281.68
549,280.52
550,279.30
551,278.17
552,276.98
553,275.82
554,274.44
555,273.04
556,271.67
557,270.51
558,269.35
559,268.19
560,266.91
561,265.75
562,264.65
563,263.73
564,262.76
565,261.87
566,260.86
567,259.92
568,258.91
569,258.00
570,257.14
571,256.44
572,255.77
573,255.34
574,255.13
575,255.13
576,255.16
577,255.19
578,255.22
579,255.22
580,255.00
581,254.58
582,253.91
583,253.17
584,252.35
585,251.40
586,250.40
587,249.42
588,248.57
589,247.86
590,247.22
591,246.77
592,246.49
593,246.49
594,246.67
595,246.95
596,247.22
597,247.44
598,247.59
599,247.86
600,248.29
601,248.75
602,249.08
603,249.36
604,249.69
605,250.12
606,250.61
607,251.10
608,251.71
609,252.41
610,253.08
611,253.54
612,253.94
613,254.39
614,255.07
615,255.77
616,256.35
617,256.87
618,257.42
619,257.84
620,258.06
621,258.06
622,258.18
623,258.36
624,258.48
625,258.48
626,258.64
627,259.06
628,259.83
629,260.53
630,261.20
631,261.87
632,262.85
633,264.01
634,265.32
635,266.54
636,267.67
637,268.59
638,269.29
639,269.78
640,270.20
641,270.36
642,270.29
643,270.05
644,270.02
645,270.20
646,270.51
647,270.78
648,271.15
649,271.55
650,272.03
651,272.52
652,273.16
653,273.83
654,274.48
655,274.96
656,275.45
657,275.91
658,276.28
659,276.52
660,276.73
661,276.98
662,277.16
663,277.16
664,276.95
665,276.70
666,276.58
667,276.52
668,276.58
669,276.86
670,277.53
671,278.44
672,279.33
673,280.09
674,280.88
675,281.52
676,281.89
677,281.92
678,281.92
679,282.07
680,282.44
681,282.93
682,283.84
683,285.22
684,287.05
685,288.97
686,290.92
687,292.82
688,294.68
689,296.33
690,297.79
691,298.98
692,299.90
693,300.35
694,300.35
695,299.84
696,299.10
697,298.34
698,297.82
699,297.58
700,297.64
701,297.88
702,298.19
703,298.40
704,298.52
705,298.55
706,298.49
707,298.22
708,297.67
709,297.21
710,297.21
711,297.64
712,298.31
713,299.07
714,300.02
715,300.93
716,301.54
717,301.57
718,301.18
719,300.66
720,300.14
721,299.68
722,299.35
723,299.07
724,298.83
725,298.65
726,298.43
727,298.19
728,297.76
729,297.06
730,296.14
731,295.17
732,294.22
733,293.49
734,293.12
735,293.15
736,293.37
737,293.64
738,293.85
739,294.07
740,294.37
741,294.89
742,295.53
743,296.23
744,296.97
745,297.70
746,298.37
747,298.86
748,298.98
749,298.77
750,298.28
751,297.55
752,296.57
753,295.38
754,294.07
755,292.88
756,291.84
757,290.95
758,289.89
759,288.76
760,287.35
761,285.98
762,284.39
763,282.78
764,280.88
765,279.05
766,277.07
767,275.24
768,273.16
769,271.09
770,268.83
771,266.75
772,264.56
773,262.48
774,260.25
775,258.18
776,256.01
777,253.94
778,251.59
779,249.24
780,246.86
781,244.78
782,242.71
783,240.88
784,239.01
785,237.40
786,235.81
787,234.41
788,233.06
789,231.87
790,230.83
791,230.13
792,229.80
793,229.83
794,229.98
795,230.22
796,230.62
797,231.35
798,232.39
799,233.55
800,234.80
801,235.99
802,237.27
803,238.40
804,239.41
805,240.33
806,241.64
807,243.23
808,245.09
809,246.98
810,249.27
811,251.83
812,254.67
813,257.29
814,259.64
815,261.51
816,263.06
817,264.16
818,265.17
819,266.05
820,267.21
821,268.34
822,269.59
823,270.72
824,272.13
825,273.74
826,275.73
827,277.59
828,279.33
829,280.70
830,282.07
831,283.45
832,285.00
833,286.65
834,288.54
835,290.41
836,292.27
837,293.91
838,295.53
839,296.94
840,298.13
841,298.80
842,299.10
843,299.04
844,298.95
845,298.92
846,299.10
847,299.38
848,299.56
849,299.56
850,299.38
851,299.13
852,298.83
853,298.37
854,297.64
855,296.69
856,295.59
857,294.65
858,293.82
859,293.15
860,292.45
861,291.75
862,290.95
863,290.25
864,289.64
865,289.15
866,288.76
867,288.54
868,288.57
869,288.79
870,289.06
871,289.31
872,289.64
873,290.07
874,290.65
875,291.38
876,292.39
877,293.52
878,294.77
879,295.93
880,297.36
881,298.98
882,300.87
883,302.70
884,304.78
885,306.88
886,309.17
887,311.25
888,313.29
889,315.12
890,317.17
891,319.21
892,321.59
893,324.19
894,327.24
895,330.29
896,333.31
897,335.88
898,338.32
899,340.36
900,342.25
901,343.66
902,344.79
903,345.64
904,346.65
905,347.81
906,349.33
907,350.95
908,352.69
909,354.40
910,356.02
911,357.18
912,357.67
913,357.45
914,356.87
915,356.11
916,355.10
917,353.94
918,352.78
919,351.84
920,350.89
921,349.76
922,348.21
923,346.53
924,344.79
925,343.17
926,341.46
927,339.84
928,338.13
929,336.79
930,335.54
931,334.41
932,332.92
933,331.33
934,329.59
935,327.97
936,326.08
937,324.25
938,322.48
939,321.08
940,319.61
941,318.05
942,316.10
943,314.00
944,311.49
945,308.93
946,306.24
947,303.86
948,301.73
949,300.14
950,298.92
951,298.00
952,297.00
953,296.11
954,295.26
955,294.59
956,293.64
957,292.51
958,291.17
959,289.98
960,288.88
961,287.96
962,287.20
963,286.71
964,286.56
965,286.83
966,287.32
967,287.84
968,288.12
969,288.15
970,287.90
971,287.41
972,286.62
973,285.68
974,284.73
975,284.00
976,283.54
977,283.33
978,283.33
979,283.60
980,283.94
981,284.21
982,284.18
983,283.97
984,283.57
985,283.11
986,282.38
987,281.49
988,280.40
989,279.21
990,277.77
991,276.12
992,274.23
993,272.37
994,270.42
995,268.55
996,266.60
997,264.74
998,262.76
999,260.93
1000,258.97
1001,257.14
1002,255.07
1003,252.99
1004,250.70
1005,248.60
1006,246.55
1007,244.69
1008,242.77
1009,240.91
1010,239.01
1011,237.37
1012,235.81
1013,234.44
1014,233.06
1015,231.90
1016,230.83
1017,230.16
1018,229.80
1019,229.83
1020,229.98
1021,230.29
1022,230.59
1023,230.83
1024,230.77
1025,230.32
1026,229.49
1027,228.52
1028,227.54
1029,226.56
1030,225.68
1031,224.95
1032,224.55
1033,224.55
1034,224.95
1035,225.68
1036,226.59
1037,227.54
1038,228.49
1039,229.43
1040,230.47
1041,231.41
1042,232.18
1043,232.67
1044,232.97
1045,233.15
1046,233.37
1047,233.61
1048,233.98
1049,234.44
1050,234.99
1051,235.44
1052,235.81
1053,236.05
1054,236.21
1055,236.18
1056,236.02
1057,235.78
1058,235.57
1059,235.32
1060,234.99
1061,234.53
1062,233.98
1063,233.46
1064,233.00
1065,232.54
1066,232.09
1067,231.57
1068,231.08
1069,230.83
1070,231.08
1071,231.81
1072,232.76
1073,233.70
1074,234.83
1075,236.24
1076,237.95
1077,239.62
1078,241.09
1079,242.25
1080,243.35
1081,244.26
1082,245.06
1083,245.51
1084,245.82
1085,246.00
1086,246.28
1087,246.46
1088,246.73
1089,246.92
1090,247.25
1091,247.71
1092,248.38
1093,249.05
1094,249.82
1095,250.46
1096,251.34
1097,252.50
1098,254.12
1099,255.98
1100,258.12
1101,260.25
1102,262.54
1103,264.59
1104,266.54
1105,268.19
1106,269.90
1107,271.48
1108,273.04
1109,274.44
1110,276.03
1111,277.62
1112,279.33
1113,280.98
1114,282.87
1115,284.67
1116,286.53
1117,288.15
1118,289.95
1119,291.78
1120,293.73
1121,295.38
1122,296.91
1123,298.22
1124,299.74
1125,301.39
1126,303.38
1127,305.45
1128,307.77
1129,310.12
1130,312.65
1131,315.03
1132,317.11
1133,318.51
1134,319.40
1135,319.82
1136,320.07
1137,320.04
1138,319.82
1139,319.52
1140,319.55
1141,320.01
1142,320.80
1143,321.53
1144,322.05
1145,322.30
1146,322.36
1147,322.33
1148,322.30
1149,322.30
1150,322.42
1151,322.66
1152,322.97
1153,323.21
1154,323.27
1155,323.06
1156,322.51
1157,321.81
1158,320.98
1159,320.25
1160,319.67
1161,319.21
1162,318.82
1163,318.33
1164,317.66
1165,316.99
1166,316.31
1167,315.61
1168,314.61
1169,313.45
1170,312.29
1171,311.31
1172,310.36
1173,309.51
1174,308.53
1175,307.59
1176,306.49
1177,305.36
1178,304.11
1179,302.95
1180,301.67
1181,300.54
1182,299.44
1183,298.52
1184,297.49
1185,296.33
1186,294.95
1187,293.55
1188,292.05
1189,290.65
1190,289.22
1191,288.09
1192,287.11
1193,286.41
1194,285.77
1195,285.34
1196,285.13
1197,285.13
1198,285.10
1199,284.88
1200,284.45
1201,283.97
1202,283.48
1203,283.02
1204,282.59
1205,282.35
1206,282.35
1207,282.59
1208,283.02
1209,283.48
1210,283.97
1211,284.48
1212,284.91
1213,285.16
1214,285.10
1215,284.85
1216,284.58
1217,284.33
1218,284.09
1219,283.84
1220,283.72
1221,283.72
1222,283.75
1223,283.75
1224,283.75
1225,283.78
1226,283.69
1227,283.48
1228,283.08
1229,282.59
1230,281.98
1231,281.31
1232,280.49
1233,279.48
1234,278.44
1235,277.47
1236,276.76
1237,276.31
1238,275.97
1239,275.70
1240,275.63
1241,275.88
1242,276.46
1243,277.16
1244,277.86
1245,278.56
1246,279.48
1247,280.43
1248,281.28
1249,281.95
1250,282.71
1251,283.66
1252,284.79
1253,285.74
1254,286.41
1255,286.87
1256,287.35
1257,287.81
1258,288.18
1259,288.39
1260,288.73
1261,289.15
1262,289.67
1263,290.19
1264,290.74
1265,291.17
1266,291.47
1267,291.69
1268,292.08
1269,292.79
1270,293.79
1271,294.77
1272,295.50
1273,295.96
1274,296.30
1275,296.48
1276,296.60
1277,296.57
1278,296.66
1279,296.84
1280,297.33
1281,298.00
1282,299.10
1283,300.51
1284,302.22
1285,303.86
1286,305.45
1287,306.82
1288,308.32
1289,309.69
1290,311.04
1291,312.19
1292,313.48
1293,314.85
1294,316.44
1295,317.87
1296,319.12
1297,320.01
1298,320.80
1299,321.50
1300,322.20
1301,322.66
1302,322.88
1303,322.88
1304,322.88
1305,322.81
1306,322.69
1307,322.48
1308,322.30
1309,322.27
1310,322.30
1311,322.36
1312,322.39
1313,322.39
1314,322.14
1315,321.72
1316,321.08
1317,320.34
1318,319.46
1319,318.54
1320,317.57
1321,316.65
1322,315.58
1323,314.39
1324,313.08
1325,311.92
1326,310.88
1327,309.97
1328,308.87
1329,307.71
1330,306.55
1331,305.63
1332,304.63
1333,303.50
1334,302.06
1335,300.66
1336,299.26
1337,298.13
1338,297.03
1339,296.08
1340,295.20
1341,294.53
1342,293.95
1343,293.49
1344,293.00
1345,292.54
1346,292.14
1347,291.90
1348,291.72
1349,291.50
1350,291.23
1351,291.02
1352,290.77
1353,290.56
1354,290.31
1355,290.07
1356,289.83
1357,289.58
1358,289.31
1359,289.09
1360,288.91
1361,288.67
1362,288.27
1363,287.81
1364,287.35
1365,287.14
1366,287.08
1367,287.11
1368,287.02
1369,286.80
1370,286.44
1371,285.98
1372,285.31
1373,284.36
1374,283.05
1375,281.65
1376,280.27
1377,279.08
1378,277.89
1379,276.79
1380,275.60
1381,274.38
1382,272.98
1383,271.61
1384,270.29
1385,269.10
1386,267.76
1387,266.36
1388,265.08
1389,264.13
1390,263.34
1391,262.66
1392,262.02
1393,261.57
1394,261.14
1395,260.71
1396,260.10
1397,259.40
1398,258.58
1399,257.87
1400,257.29
1401,256.84
1402,256.32
1403,255.92
1404,255.49
1405,255.04
1406,254.18
1407,252.99
1408,251.68
1409,250.46
1410,249.36
1411,248.41
1412,247.74
1413,247.50
1414,247.65
1415,247.96
1416,248.02
1417,247.77
1418,247.25
1419,246.80
1420,246.46
1421,246.25
1422,245.97
1423,245.73
1424,245.67
1425,245.91
1426,246.37
1427,246.92
1428,247.22
1429,247.22
1430,246.86
1431,246.37
1432,246.00
1433,245.76
1434,245.45
1435,245.00
1436,244.45
1437,243.93
1438,243.59
1439,243.38
1440,243.19
1441,242.92
1442,242.58
1443,242.37
1444,242.37
1445,242.61
1446,242.92
1447,243.16
1448,243.41
1449,243.65
1450,243.84
1451,243.84
1452,243.62
1453,243.38
1454,243.23
1455,243.23
1456,243.29
1457,243.29
1458,243.26
1459,243.26
1460,243.32
1461,243.29
1462,243.16
1463,242.92
1464,242.68
1465,242.43
1466,242.13
1467,241.91
1468,241.88
1469,242.10
1470,242.46
1471,242.95
1472,243.68
1473,244.63
1474,245.61
1475,246.34
1476,246.80
1477,246.98
1478,247.13
1479,247.34
1480,247.80
1481,248.50
1482,249.48
1483,250.64
1484,252.14
1485,253.78
1486,255.52
1487,256.96
1488,258.03
1489,258.70
1490,259.25
1491,259.64
1492,260.19
1493,260.89
1494,261.99
1495,263.34
1496,265.08
1497,266.97
1498,269.17
1499,271.30
1500,273.19
1501,274.60
1502,275.73
1503,276.64
1504,277.53
1505,278.20
1506,278.87
1507,279.54
1508,280.40
1509,281.34
1510,282.32
1511,283.02
1512,283.51
1513,283.69
1514,283.75
1515,283.75
1516,283.75
1517,283.72
1518,283.75
1519,283.97
1520,284.61
1521,285.52
1522,286.71
1523,287.87
1524,289.12
1525,290.28
1526,291.44
1527,292.36
1528,293.21
1529,294.10
1530,295.44
1531,297.09
1532,298.95
1533,300.60
1534,302.06
1535,303.22
1536,304.23
1537,304.87
1538,305.36
1539,305.82
1540,306.58
1541,307.50
1542,308.44
1543,309.17
1544,309.88
1545,310.52
1546,311.13
1547,311.61
1548,312.19
1549,312.87
1550,313.60
1551,314.30
1552,315.19
1553,316.13
1554,317.05
1555,317.75
1556,318.27
1557,318.76
1558,319.27
1559,319.73
1560,320.07
1561,320.31
1562,320.59
1563,320.80
1564,320.80
1565,320.56
1566,320.37
1567,320.31
1568,320.43
1569,320.71
1570,321.23
1571,321.93
1572,322.63
1573,323.15
1574,323.36
1575,323.36
1576,323.12
1577,322.66
1578,321.96
1579,321.26
1580,320.56
1581,319.89
1582,318.97
1583,317.78
1584,316.31
1585,314.91
1586,313.66
1587,312.47
1588,311.13
1589,309.69
1590,308.38
1591,307.46
1592,306.73
1593,306.03
1594,305.24
1595,304.53
1596,303.99
1597,303.53
1598,302.92
1599,302.22
1600,301.54
1601,301.09
1602,300.66
1603,300.20
1604,299.71
1605,299.22
1606,298.68
1607,297.97
1608,297.09
1609,296.39
1610,296.05
1611,296.05
1612,296.11
1613,296.14
1614,296.20
1615,296.42
1616,296.72
1617,297.00
1618,297.12
1619,297.09
1620,297.03
1621,297.03
1622,297.18
1623,297.42
1624,297.67
1625,297.88
1626,298.25
1627,298.68
1628,299.19
1629,299.71
1630,300.26
1631,300.72
1632,300.93
1633,300.93
1634,300.99
1635,301.18
1636,301.45
1637,301.73
1638,302.09
1639,302.49
1640,302.98
1641,303.50
1642,304.08
1643,304.50
1644,304.72
1645,304.75
1646,304.84
1647,304.99
1648,305.24
1649,305.51
1650,306.00
1651,306.70
1652,307.37
1653,307.89
1654,308.26
1655,308.47
1656,308.38
1657,307.95
1658,307.16
1659,306.18
1660,305.11
1661,304.17
1662,303.41
1663,302.98
1664,302.61
1665,302.19
1666,301.42
1667,300.51
1668,299.38
1669,298.22
1670,296.84
1671,295.44
1672,294.01
1673,292.82
1674,291.87
1675,291.17
1676,290.59
1677,290.16
1678,289.70
1679,289.25
1680,288.67
1681,288.21
1682,287.96
1683,287.99
1684,288.02
1685,288.06
1686,288.06
1687,288.06
1688,287.99
1689,287.75
1690,287.32
1691,286.83
1692,286.44
1693,286.22
1694,286.01
1695,285.80
1696,285.55
1697,285.34
1698,284.97
1699,284.55
1700,283.94
1701,283.20
1702,282.32
1703,281.40
1704,280.49
1705,279.75
1706,279.17
1707,278.75
1708,278.32
1709,277.83
1710,277.19
1711,276.52
1712,275.76
1713,275.05
1714,274.32
1715,273.62
1716,272.95
1717,272.46
1718,272.22
1719,272.28
1720,272.40
1721,272.43
1722,272.09
1723,271.67
1724,271.21
1725,270.69
1726,269.96
1727,269.04
1728,268.13
1729,267.40
1730,266.66
1731,266.02
1732,265.38
1733,264.89
1734,264.43
1735,263.98
1736,263.58
1737,263.37
1738,263.09
1739,262.66
1740,261.90
1741,260.96
1742,259.89
1743,258.94
1744,258.09
1745,257.39
1746,256.77
1747,256.29
1748,255.98
1749,255.98
1750,256.29
1751,256.77
1752,257.29
1753,257.78
1754,258.33
1755,259.03
1756,259.86
1757,260.56
1758,261.14
1759,261.60
1760,262.12
1761,262.60
1762,262.91
1763,262.91
1764,262.66
1765,262.39
1766,262.27
1767,262.24
1768,262.36
1769,262.60
1770,263.12
1771,263.79
1772,264.56
1773,265.29
1774,266.05
1775,266.75
1776,267.30
1777,267.79
1778,268.37
1779,269.04
1780,269.81
1781,270.57
1782,271.27
1783,271.76
1784,271.76
1785,271.30
1786,270.51
1787,269.53
1788,268.40
1789,267.21
1790,266.02
1791,265.08
1792,264.37
1793,263.89
1794,263.61
1795,263.64
1796,263.92
1797,264.40
1798,264.92
1799,265.41
1800,265.90
1801,266.36
1802,266.72
1803,266.97
1804,267.21
1805,267.43
1806,267.64
1807,267.85
1808,268.28
1809,268.95
1810,269.99
1811,271.18
1812,272.46
1813,273.65
1814,274.75
1815,275.70
1816,276.52
1817,277.22
1818,277.89
1819,278.56
1820,279.39
1821,280.33
1822,281.52
1823,282.68
1824,283.81
1825,284.73
1826,285.64
1827,286.53
1828,287.57
1829,288.54
1830,289.43
1831,290.10
1832,290.71
1833,291.38
1834,292.42
1835,293.55
1836,294.77
1837,295.96
1838,297.33
1839,298.74
1840,300.05
1841,300.96
1842,301.76
1843,302.43
1844,303.13
1845,303.56
1846,303.83
1847,304.05
1848,304.53
1849,305.24
1850,306.03
1851,306.76
1852,307.46
1853,308.17
1854,308.81
1855,309.30
1856,309.66
1857,309.88
1858,309.97
1859,310.00
1860,309.88
1861,309.66
1862,309.27
1863,308.78
1864,308.26
1865,307.77
1866,307.28
1867,306.85
1868,306.43
1869,305.94
1870,305.27
1871,304.60
1872,303.99
1873,303.53
1874,302.92
1875,302.25
1876,301.57
1877,301.09
1878,300.63
1879,299.96
1880,298.92
1881,297.73
1882,296.42
1883,295.26
1884,294.19
1885,293.24
1886,292.33
1887,291.63
1888,291.26
1889,291.26
1890,291.44
1891,291.72
1892,291.99
1893,292.24
1894,292.27
1895,292.08
1896,291.63
1897,290.92
1898,289.76
1899,288.33
1900,286.90
1901,285.71
1902,284.64
1903,283.69
1904,282.96
1905,282.50
1906,282.10
1907,281.65
1908,280.98
1909,280.27
1910,279.66
1911,279.17
1912,278.66
1913,278.23
1914,277.98
1915,277.95
1916,277.98
1917,278.02
1918,278.14
1919,278.38
1920,278.59
1921,278.63
1922,278.38
1923,278.14
1924,278.02
1925,277.98
1926,278.02
1927,278.05
1928,278.08
1929,278.05
1930,277.92
1931,277.71
1932,277.44
1933,277.19
1934,276.92
1935,276.70
1936,276.58
1937,276.55
1938,276.61
1939,276.89
1940,277.40
1941,278.14
1942,278.84
1943,279.33
1944,279.57
1945,279.57
1946,279.30
1947,278.81
1948,278.26
1949,277.74
1950,277.40
1951,277.16
1952,277.04
1953,277.04
1954,277.19
1955,277.44
1956,277.62
1957,277.62
1958,277.47
1959,277.22
1960,276.95
1961,276.73
1962,276.52
1963,276.28
1964,275.94
1965,275.70
1966,275.73
1967,276.00
1968,276.18
1969,276.21
1970,276.12
1971,276.09
1972,276.15
1973,276.18
1974,276.06
1975,275.82
1976,275.48
1977,275.24
1978,275.18
1979,275.15
1980,275.09
1981,275.15
1982,275.36
1983,275.54
1984,275.54
1985,275.33
1986,275.18
1987,275.15
1988,275.02
1989,274.81
1990,274.78
1991,274.99
1992,275.24
1993,275.24
1994,275.12
1995,275.09
1996,275.30
1997,275.54
1998,275.67
1999,275.67
2000,275.73
2001,275.94
2002,276.31
2003,276.52
2004,276.61
2005,276.61
2006,276.61
2007,276.58
2008,276.61
2009,276.86
2010,277.47
2011,278.44
2012,279.54
2013,280.49
2014,281.25
2015,281.98
2016,282.71
2017,283.20
2018,283.14
2019,282.68
2020,282.10
2021,281.59
2022,281.01
2023,280.33
2024,279.69
2025,279.21
2026,278.66
2027,277.98
2028,277.16
2029,276.43
2030,275.85
2031,275.36
2032,274.99
2033,274.78
2034,274.66
2035,274.69
2036,274.72
2037,274.72
2038,274.69
2039,274.69
2040,274.72
2041,274.72
2042,274.66
2043,274.41
2044,273.99
2045,273.50
2046,273.07
2047,272.86
2048,272.77
2049,272.77
2050,272.77
2051,272.80
2052,272.80
2053,272.80
2054,272.71
2055,272.52
2056,272.16
2057,271.64
2058,271.06
2059,270.57
2060,270.32
2061,270.32
2062,270.42
2063,270.45
2064,270.36
2065,270.11
2066,269.68
2067,269.20
2068,268.89
2069,268.86
2070,269.13
2071,269.65
2072,270.29
2073,271.03
2074,271.70
2075,272.19
2076,272.43
2077,272.43
2078,272.19
2079,271.70
2080,271.03
2081,270.32
2082,269.59
2083,268.89
2084,268.13
2085,267.40
2086,266.85
2087,266.57
2088,266.63
2089,266.91
2090,267.27
2091,267.49
2092,267.52
2093,267.55
2094,267.70
2095,267.91
2096,267.97
2097,267.76
2098,267.43
2099,267.18
2100,266.94
2101,266.72
2102,266.51
2103,266.51
2104,266.72
2105,267.00
2106,267.06
2107,266.82
2108,266.39
2109,265.90
2110,265.35
2111,264.62
2112,263.76
2113,263.09
2114,262.66
2115,262.39
2116,262.15
2117,261.93
2118,261.87
2119,261.84
2120,261.63
2121,261.20
2122,260.68
2123,260.16
2124,259.55
2125,258.88
2126,258.27
2127,258.00
2128,258.09
2129,258.64
2130,259.49
2131,260.44
2132,261.17
2133,261.72
2134,262.05
2135,262.02
2136,261.32
2137,260.16
2138,258.97
2139,257.97
2140,256.99
2141,256.10
2142,255.46
2143,255.19
2144,255.04
2145,254.61
2146,253.78
2147,252.78
2148,251.86
2149,251.16
2150,250.67
2151,250.43
2152,250.46
2153,250.73
2154,251.07
2155,251.28
2156,251.34
2157,251.37
2158,251.37
2159,251.37
2160,251.25
2161,251.04
2162,250.85
2163,250.85
2164,250.95
2165,250.98
2166,250.82
2167,250.55
2168,250.27
2169,250.03
2170,249.85
2171,249.60
2172,249.30
2173,249.05
2174,248.99
2175,248.99
2176,248.84
2177,248.38
2178,247.68
2179,246.95
2180,246.22
2181,245.51
2182,244.81
2183,244.32
2184,244.20
2185,244.48
2186,244.93
2187,245.45
2188,245.82
2189,246.06
2190,246.19
2191,246.22
2192,246.00
2193,245.51
2194,244.72
2195,243.74
2196,242.83
2197,242.10
2198,241.64
2199,241.39
2200,241.39
2201,241.64
2202,242.07
2203,242.55
2204,242.92
2205,243.16
2206,243.38
2207,243.65
2208,243.84
2209,243.84
2210,243.62
2211,243.38
2212,243.26
2213,243.23
2214,243.26
2215,243.29
2216,243.29
2217,243.29
2218,243.19
2219,242.95
2220,242.65
2221,242.40
2222,242.28
2223,242.31
2224,242.34
2225,242.34
2226,242.31
2227,242.31
2228,242.34
2229,242.34
2230,242.28
2231,242.00
2232,241.58
2233,241.12
2234,240.75
2235,240.48
2236,240.23
2237,240.02
2238,239.96
2239,240.17
2240,240.63
2241,241.12
2242,241.61
2243,242.10
2244,242.55
2245,243.04
2246,243.53
2247,243.99
2248,244.45
2249,244.90
2250,245.45
2251,245.91
2252,246.31
2253,246.55
2254,246.64
2255,246.64
2256,246.52
2257,246.28
2258,245.97
2259,245.73
2260,245.64
2261,245.64
2262,245.64
2263,245.67
2264,245.70
2265,245.67
2266,245.54
2267,245.33
2268,245.06
2269,244.81
2270,244.54
2271,244.29
2272,244.23
2273,244.20
2274,244.11
2275,243.90
2276,243.71
2277,243.68
2278,243.77
2279,244.02
2280,244.48
2281,245.21
2282,246.09
2283,246.77
2284,247.28
2285,247.74
2286,248.41
2287,249.08
2288,249.66
2289,250.12
2290,250.89
2291,252.01
2292,253.51
2293,254.94
2294,256.38
2295,257.75
2296,259.25
2297,260.62
2298,262.05
2299,263.43
2300,265.11
2301,266.94
2302,269.07
2303,271.21
2304,273.56
2305,275.88
2306,278.26
2307,280.36
2308,282.35
2309,283.97
2310,285.34
2311,286.25
2312,286.96
2313,287.38
2314,287.72
2315,287.90
2316,288.27
2317,288.67
2318,289.34
2319,290.28
2320,291.63
2321,293.03
2322,294.34
2323,295.29
2324,296.05
2325,296.72
2326,297.39
2327,297.85
2328,298.19
2329,298.43
2330,298.65
2331,298.86
2332,299.13
2333,299.38
2334,299.56
2335,299.53
2336,299.35
2337,299.13
2338,298.89
2339,298.68
2340,298.31
2341,297.85
2342,297.36
2343,296.88
2344,296.26
2345,295.59
2346,294.83
2347,294.13
2348,293.30
2349,292.39
2350,291.26
2351,290.07
2352,288.79
2353,287.66
2354,286.59
2355,285.64
2356,284.64
2357,283.72
2358,282.99
2359,282.53
2360,281.98
2361,281.37
2362,280.49
2363,279.54
2364,278.29
2365,276.92
2366,275.42
2367,273.99
2368,272.49
2369,271.09
2370,269.81
2371,268.89
2372,268.16
2373,267.49
2374,266.60
2375,265.69
2376,264.68
2377,263.76
2378,262.70
2379,261.54
2380,260.19
2381,259.00
2382,258.06
2383,257.35
2384,256.68
2385,256.01
2386,255.34
2387,254.85
2388,254.52
2389,254.30
2390,254.15
2391,254.15
2392,254.33
2393,254.82
2394,255.52
2395,256.26
2396,256.90
2397,257.35
2398,257.72
2399,258.18
2400,258.91
2401,259.89
2402,260.96
2403,261.90
2404,262.70
2405,263.40
2406,264.13
2407,264.83
2408,265.53
2409,266.24
2410,267.00
2411,267.73
2412,268.25
2413,268.49
2414,268.52
2415,268.52
2416,268.55
2417,268.52
2418,268.46
2419,268.46
2420,268.65
2421,268.86
2422,269.04
2423,269.04
2424,269.01
2425,268.98
2426,268.95
2427,268.98
2428,269.10
2429,269.32
2430,269.56
2431,269.84
2432,270.08
2433,270.32
2434,270.42
2435,270.20
2436,269.65
2437,268.89
2438,268.13
2439,267.67
2440,267.61
2441,267.82
2442,268.16
2443,268.43
2444,268.65
2445,268.62
2446,268.22
2447,267.52
2448,266.72
2449,265.96
2450,265.29
2451,264.83
2452,264.71
2453,264.98
2454,265.35
2455,265.59
2456,265.66
2457,265.66
2458,265.66
2459,265.66
2460,265.56
2461,265.32
2462,265.05
2463,264.80
2464,264.59
2465,264.34
2466,264.01
2467,263.79
2468,263.82
2469,264.04
2470,264.28
2471,264.56
2472,264.92
2473,265.38
2474,265.81
2475,266.05
2476,266.20
2477,266.42
2478,266.82
2479,267.30
2480,267.79
2481,268.28
2482,268.80
2483,269.26
2484,269.53
2485,269.56
2486,269.41
2487,269.17
2488,268.77
2489,268.28
2490,267.85
2491,267.61
2492,267.55
2493,267.58
2494,267.55
2495,267.58
2496,267.64
2497,267.64
2498,267.36
2499,266.91
2500,266.36
2501,265.84
2502,265.35
2503,264.95
2504,264.53
2505,264.07
2506,263.31
2507,262.36
2508,261.38
2509,260.68
2510,260.13
2511,259.67
2512,259.22
2513,259.00
2514,259.06
2515,259.31
2516,259.49
2517,259.52
2518,259.34
2519,259.12
2520,258.85
2521,258.58
2522,258.42
2523,258.42
2524,258.61
2525,258.85
2526,259.06
2527,259.31
2528,259.67
2529,260.16
2530,260.59
2531,260.83
2532,260.93
2533,260.89
2534,260.83
2535,260.59
2536,260.16
2537,259.67
2538,259.31
2539,259.03
2540,258.85
2541,258.88
2542,259.31
2543,259.98
2544,260.68
2545,261.23
2546,261.60
2547,261.78
2548,261.63
2549,261.20
2550,260.71
2551,260.41
2552,260.38
2553,260.65
2554,261.35
2555,262.27
2556,263.15
2557,263.89
2558,264.62
2559,265.29
2560,265.81
2561,266.05
2562,266.33
2563,266.72
2564,267.40
2565,268.10
2566,268.95
2567,269.90
2568,270.94
2569,271.88
2570,272.74
2571,273.44
2572,274.14
2573,274.81
2574,275.48
2575,276.21
2576,277.10
2577,278.05
2578,278.93
2579,279.42
2580,279.48
2581,279.21
2582,278.75
2583,278.29
2584,277.83
2585,277.34
2586,276.82
2587,276.37
2588,276.03
2589,275.79
2590,275.42
2591,274.99
2592,274.51
2593,274.02
2594,273.38
2595,272.67
2596,272.13
2597,271.85
2598,271.76
2599,271.82
2600,272.00
2601,272.22
2602,272.28
2603,272.06
2604,271.64
2605,271.15
2606,270.57
2607,269.87
2608,269.07
2609,268.31
2610,267.76
2611,267.58
2612,267.64
2613,267.88
2614,268.10
2615,268.40
2616,268.71
2617,268.95
2618,268.89
2619,268.68
2620,268.46
2621,268.43
2622,268.52
2623,268.55
2624,268.52
2625,268.49
2626,268.49
2627,268.49
2628,268.55
2629,268.52
2630,268.37
2631,268.16
2632,268.01
2633,267.94
2634,268.04
2635,268.31
2636,268.86
2637,269.56
2638,270.23
2639,270.72
2640,271.15
2641,271.61
2642,272.03
2643,272.28
2644,272.37
2645,272.34
2646,272.34
2647,272.34
2648,272.31
2649,272.03
2650,271.58
2651,271.12
2652,270.75
2653,270.51
2654,270.23
2655,270.02
2656,270.02
2657,270.23
2658,270.51
2659,270.78
2660,271.06
2661,271.30
2662,271.36
2663,271.12
2664,270.66
2665,270.17
2666,269.74
2667,269.53
2668,269.44
2669,269.44
2670,269.47
2671,269.50
2672,269.41
2673,269.20
2674,268.74
2675,268.25
2676,267.88
2677,267.64
2678,267.43
2679,267.21
2680,267.03
2681,267.03
2682,267.09
2683,267.12
2684,267.03
2685,266.75
2686,266.33
2687,265.87
2688,265.47
2689,265.23
2690,265.11
2691,265.17
2692,265.32
2693,265.50
2694,265.69
2695,265.96
2696,266.45
2697,266.91
2698,267.03
2699,266.82
2700,266.48
2701,266.24
2702,265.93
2703,265.47
2704,264.98
2705,264.71
2706,264.74
2707,264.98
2708,265.38
2709,265.87
2710,266.42
2711,266.88
2712,267.21
2713,267.46
2714,267.73
2715,267.94
2716,268.04
2717,268.04
2718,268.10
2719,268.34
2720,268.71
2721,268.98
2722,268.95
2723,268.68
2724,268.34
2725,268.13
2726,267.94
2727,267.70
2728,267.40
2729,267.12
2730,267.15
2731,267.40
2732,267.67
2733,267.94
2734,268.16
2735,268.40
2736,268.55
2737,268.59
2738,268.46
2739,268.19
2740,267.82
2741,267.36
2742,266.85
2743,266.36
2744,265.90
2745,265.47
2746,264.89
2747,264.19
2748,263.31
2749,262.33
2750,261.29
2751,260.38
2752,259.58
2753,258.85
2754,258.03
2755,257.35
2756,256.96
2757,256.96
2758,257.08
2759,257.11
2760,257.08
2761,257.08
2762,257.02
2763,256.84
2764,256.35
2765,255.62
2766,254.70
2767,253.75
2768,252.87
2769,252.17
2770,251.56
2771,251.10
2772,250.70
2773,250.49
2774,250.37
2775,250.40
2776,250.43
2777,250.46
2778,250.37
2779,250.12
2780,249.63
2781,248.93
2782,248.14
2783,247.41
2784,246.77
2785,246.31
2786,246.03
2787,246.06
2788,246.25
2789,246.46
2790,246.67
2791,246.95
2792,247.25
2793,247.50
2794,247.50
2795,247.22
2796,246.95
2797,246.95
2798,247.31
2799,247.80
2800,248.20
2801,248.44
2802,248.66
2803,248.87
2804,248.99
2805,249.02
2806,248.99
2807,248.96
2808,248.96
2809,248.96
2810,249.02
2811,249.30
2812,249.66
2813,249.91
2814,249.79
2815,249.30
2816,248.69
2817,248.20
2818,247.86
2819,247.62
2820,247.47
2821,247.47
2822,247.65
2823,247.89
2824,248.14
2825,248.38
2826,248.69
2827,249.15
2828,249.79
2829,250.52
2830,251.28
2831,251.95
2832,252.66
2833,253.36
2834,254.12
2835,254.85
2836,255.46
2837,255.92
2838,256.32
2839,256.74
2840,257.45
2841,258.15
2842,258.76
2843,259.19
2844,259.74
2845,260.41
2846,261.35
2847,262.30
2848,263.24
2849,264.13
2850,265.29
2851,266.69
2852,268.46
2853,270.32
2854,272.43
2855,274.54
2856,276.76
2857,278.87
2858,280.94
2859,282.84
2860,284.70
2861,286.32
2862,287.75
2863,288.88
2864,290.10
2865,291.26
2866,292.39
2867,293.06
2868,293.40
2869,293.33
2870,293.24
2871,293.21
2872,293.33
2873,293.61
2874,294.01
2875,294.46
2876,294.95
2877,295.44
2878,295.90
2879,296.17
2880,295.99
2881,295.29
2882,294.04
2883,292.60
2884,291.11
2885,289.70
2886,288.27
2887,286.87
2888,285.46
2889,284.30
2890,283.23
2891,282.32
2892,281.34
2893,280.46
2894,279.45
2895,278.53
2896,277.50
2897,276.64
2898,275.73
2899,274.81
2900,273.50
2901,271.88
2902,269.93
2903,268.04
2904,266.11
2905,264.25
2906,262.27
2907,260.38
2908,258.61
2909,257.20
2910,256.04
2911,255.19
2912,254.18
2913,253.02
2914,251.43
2915,249.85
2916,248.23
2917,246.86
2918,245.30
2919,243.68
2920,241.97
2921,240.30
2922,238.46
2923,236.63
2924,234.74
2925,233.06
2926,231.48
2927,230.38
2928,229.71
2929,229.49
2930,229.28
2931,229.13
2932,228.97
2933,228.94
2934,228.85
2935,228.67
2936,228.42
2937,228.39
2938,228.61
2939,229.16
2940,229.86
2941,230.59
2942,231.05
2943,231.05
2944,230.59
2945,229.86
2946,229.10
2947,228.33
2948,227.75
2949,227.51
2950,227.75
2951,228.45
2952,229.49
2953,230.71
2954,232.12
2955,233.52
2956,234.83
2957,235.78
2958,236.45
2959,236.88
2960,237.24
2961,237.46
2962,237.64
2963,237.88
2964,238.25
2965,238.74
2966,239.23
2967,239.72
2968,240.23
2969,240.72
2970,241.00
2971,241.00
2972,240.78
2973,240.51
2974,240.33
2975,240.11
2976,239.72
2977,239.26
2978,238.83
2979,238.59
2980,238.40
2981,238.19
2982,237.88
2983,237.67
2984,237.49
2985,237.27
2986,236.79
2987,236.08
2988,235.23
2989,234.25
2990,233.15
2991,231.99
2992,230.83
2993,229.86
2994,229.10
2995,228.64
2996,228.42
2997,228.49
2998,228.49
2999,228.27
3000,227.72
3001,227.02
3002,226.17
3003,225.25
3004,224.12
3005,222.90
3006,221.83
3007,221.37
3008,221.50
3009,222.02
3010,222.53
3011,223.05
3012,223.60
3013,224.06
3014,224.15
3015,223.69
3016,222.87
3017,222.11
3018,221.62
3019,221.37
3020,221.37
3021,221.62
3022,222.17
3023,222.84
3024,223.60
3025,224.37
3026,225.13
3027,225.80
3028,226.32
3029,226.84
3030,227.51
3031,228.45
3032,229.49
3033,230.47
3034,231.32
3035,232.06
3036,232.51
3037,232.51
3038,232.06
3039,231.29
3040,230.50
3041,229.77
3042,229.22
3043,228.73
3044,228.30
3045,228.09
3046,228.09
3047,228.33
3048,228.64
3049,228.94
3050,229.03
3051,229.03
3052,228.88
3053,228.70
3054,228.30
3055,227.60
3056,226.44
3057,225.04
3058,223.54
3059,222.08
3060,220.52
3061,219.15
3062,218.14
3063,217.65
3064,217.41
3065,217.22
3066,217.01
3067,216.77
3068,216.28
3069,215.61
3070,214.78
3071,214.08
3072,213.44
3073,212.95
3074,212.65
3075,212.71
3076,212.95
3077,213.20
3078,213.20
3079,212.98
3080,212.65
3081,212.16
3082,211.33
3083,210.42
3084,209.66
3085,209.14
3086,208.71
3087,208.31
3088,207.82
3089,207.31
3090,206.67
3091,205.96
3092,205.44
3093,205.17
3094,205.08
3095,205.14
3096,205.38
3097,205.81
3098,206.30
3099,206.85
3100,207.40
3101,207.86
3102,207.98
3103,207.73
3104,207.49
3105,207.43
3106,207.64
3107,207.86
3108,208.19
3109,208.65
3110,209.41
3111,210.30
3112,211.40
3113,212.59
3114,214.02
3115,215.39
3116,216.74
3117,217.90
3118,219.21
3119,220.58
3120,222.11
3121,223.48
3122,224.95
3123,226.56
3124,228.64
3125,230.77
3126,232.79
3127,234.41
3128,236.02
3129,237.61
3130,239.38
3131,241.00
3132,242.68
3133,244.26
3134,246.12
3135,247.96
3136,249.97
3137,251.83
3138,253.78
3139,255.62
3140,257.57
3141,259.43
3142,261.41
3143,263.24
3144,265.14
3145,267.00
3146,269.13
3147,271.18
3148,273.41
3149,275.51
3150,277.80
3151,279.85
3152,281.80
3153,283.42
3154,285.19
3155,286.74
3156,288.18
3157,289.34
3158,290.74
3159,292.33
3160,294.13
3161,295.78
3162,297.49
3163,299.10
3164,300.75
3165,302.12
3166,303.44
3167,304.57
3168,305.82
3169,306.95
3170,308.11
3171,309.30
3172,310.67
3173,312.04
3174,313.45
3175,314.61
3176,315.83
3177,316.96
3178,318.05
3179,319.00
3180,320.01
3181,321.17
3182,322.54
3183,323.97
3184,325.50
3185,326.90
3186,328.19
3187,329.16
3188,329.71
3189,329.68
3190,329.10
3191,328.13
3192,327.09
3193,326.08
3194,325.20
3195,324.46
3196,324.13
3197,324.10
3198,324.28
3199,324.55
3200,324.95
3201,325.38
3202,325.81
3203,326.32
3204,327.00
3205,327.70
3206,328.22
3207,328.46
3208,328.64
3209,328.86
3210,329.04
3211,329.04
3212,328.92
3213,328.92
3214,329.19
3215,329.71
3216,330.14
3217,330.41
3218,330.41
3219,330.23
3220,329.62
3221,328.67
3222,327.36
3223,325.99
3224,324.43
3225,322.81
3226,320.80
3227,318.73
3228,316.50
3229,314.36
3230,312.07
3231,309.75
3232,307.25
3233,304.90
3234,302.55
3235,300.48
3236,298.46
3237,296.60
3238,294.62
3239,292.76
3240,290.99
3241,289.61
3242,288.39
3243,287.48
3244,286.71
3245,286.32
3246,285.95
3247,285.52
3248,284.67
3249,283.54
3250,282.04
3251,280.36
3252,278.47
3253,276.58
3254,274.81
3255,273.41
3256,272.13
3257,271.00
3258,269.84
3259,268.89
3260,268.13
3261,267.73
3262,267.46
3263,267.18
3264,266.85
3265,266.63
3266,266.69
3267,266.91
3268,267.06
3269,267.09
3270,267.18
3271,267.40
3272,267.58
3273,267.61
3274,267.58
3275,267.55
3276,267.55
3277,267.55
3278,267.61
3279,267.82
3280,268.25
3281,268.77
3282,269.17
3283,269.38
3284,269.53
3285,269.74
3286,270.23
3287,270.94
3288,271.82
3289,272.77
3290,273.83
3291,274.75
3292,275.45
3293,275.94
3294,276.46
3295,276.86
3296,277.19
3297,277.44
3298,277.86
3299,278.53
3300,279.36
3301,280.12
3302,280.76
3303,281.22
3304,281.37
3305,281.16
3306,280.67
3307,279.91
3308,278.96
3309,277.98
3310,277.22
3311,276.73
3312,276.43
3313,276.21
3314,276.12
3315,276.12
3316,276.09
3317,276.09
3318,276.28
3319,276.76
3320,277.44
3321,278.17
3322,278.90
3323,279.60
3324,280.24
3325,280.76
3326,280.98
3327,280.73
3328,279.97
3329,279.02
3330,278.14
3331,277.40
3332,276.73
3333,276.28
3334,276.18
3335,276.43
3336,276.70
3337,276.73
3338,276.43
3339,275.94
3340,275.33
3341,274.60
3342,273.80
3343,273.07
3344,272.58
3345,272.37
3346,272.25
3347,272.00
3348,271.61
3349,271.39
3350,271.48
3351,271.70
3352,271.79
3353,271.82
3354,272.03
3355,272.49
3356,272.92
3357,273.19
3358,273.44
3359,273.90
3360,274.57
3361,275.30
3362,276.03
3363,276.76
3364,277.44
3365,277.92
3366,278.05
3367,277.80
3368,277.34
3369,276.82
3370,276.31
3371,275.88
3372,275.54
3373,275.27
3374,274.96
3375,274.81
3376,274.78
3377,274.75
3378,274.48
3379,274.02
3380,273.68
3381,273.65
3382,273.74
3383,273.80
3384,273.80
3385,273.77
3386,273.62
3387,273.44
3388,273.22
3389,272.92
3390,272.49
3391,272.06
3392,271.82
3393,271.76
3394,271.76
3395,271.85
3396,272.00
3397,272.22
3398,272.22
3399,272.03
3400,271.82
3401,271.51
3402,271.03
3403,270.32
3404,269.74
3405,269.47
3406,269.35
3407,269.13
3408,268.92
3409,268.89
3410,269.13
3411,269.65
3412,270.23
3413,270.72
3414,271.00
3415,271.24
3416,271.58
3417,272.06
3418,272.52
3419,272.77
3420,272.77
3421,272.77
3422,272.89
3423,273.13
3424,273.35
3425,273.35
3426,273.16
3427,272.92
3428,272.71
3429,272.43
3430,272.16
3431,271.94
3432,271.85
3433,271.85
3434,271.70
3435,271.51
3436,271.36
3437,271.36
3438,271.30
3439,271.06
3440,270.75
3441,270.51
3442,270.29
3443,270.08
3444,269.78
3445,269.53
3446,269.44
3447,269.47
3448,269.38
3449,269.13
3450,268.86
3451,268.89
3452,269.23
3453,269.71
3454,270.08
3455,270.32
3456,270.57
3457,270.84
3458,270.81
3459,270.36
3460,269.56
3461,268.80
3462,268.28
3463,268.07
3464,268.01
3465,268.04
3466,268.04
3467,268.04
3468,268.01
3469,267.76
3470,267.24
3471,266.57
3472,265.75
3473,265.01
3474,264.34
3475,263.92
3476,263.73
3477,263.73
3478,263.67
3479,263.46
3480,263.12
3481,262.63
3482,261.87
3483,260.93
3484,259.98
3485,259.25
3486,258.73
3487,258.27
3488,257.78
3489,257.29
3490,256.87
3491,256.65
3492,256.56
3493,256.59
3494,256.62
3495,256.62
3496,256.59
3497,256.59
3498,256.62
3499,256.65
3500,256.53
3501,256.29
3502,255.95
3503,255.74
3504,255.68
3505,255.68
3506,255.55
3507,255.34
3508,255.10
3509,254.82
3510,254.46
3511,254.00
3512,253.57
3513,253.33
3514,253.23
3515,253.27
3516,253.30
3517,253.30
3518,253.23
3519,252.99
3520,252.53
3521,252.04
3522,251.74
3523,251.74
3524,251.95
3525,252.20
3526,252.44
3527,252.69
3528,252.87
3529,252.90
3530,252.62
3531,252.11
3532,251.62
3533,251.37
3534,251.43
3535,251.68
3536,251.98
3537,252.23
3538,252.35
3539,252.35
3540,252.23
3541,251.98
3542,251.71
3543,251.46
3544,251.25
3545,251.04
3546,250.76
3547,250.52
3548,250.31
3549,250.34
3550,250.55
3551,250.79
3552,250.89
3553,250.89
3554,251.01
3555,251.22
3556,251.40
3557,251.43
3558,251.31
3559,251.31
3560,251.46
3561,251.71
3562,251.98
3563,252.20
3564,252.44
3565,252.69
3566,252.90
3567,252.90
3568,252.62
3569,252.14
3570,251.59
3571,251.10
3572,250.70
3573,250.46
3574,250.49
3575,250.73
3576,251.04
3577,251.31
3578,251.40
3579,251.43
3580,251.25
3581,250.82
3582,249.91
3583,248.75
3584,247.34
3585,245.94
3586,244.38
3587,242.71
3588,240.91
3589,239.29
3590,237.85
3591,236.66
3592,235.47
3593,234.59
3594,234.10
3595,234.13
3596,234.19
3597,234.28
3598,234.28
3599,234.31
3600,234.01
3601,233.34
3602,232.21
3603,231.05
3604,229.86
3605,228.64
3606,227.33
3607,226.14
3608,225.40
3609,225.13
3610,225.07
3611,225.13
3612,225.37
3613,225.83
3614,226.23
3615,226.50
3616,226.81
3617,227.23
3618,227.78
3619,228.27
3620,228.73
3621,229.19
3622,229.71
3623,230.16
3624,230.65
3625,231.08
3626,231.66
3627,232.36
3628,233.31
3629,234.47
3630,235.96
3631,237.64
3632,239.35
3633,240.81
3634,241.85
3635,242.28
3636,242.25
3637,241.94
3638,241.85
3639,242.07
3640,242.58
3641,243.32
3642,244.32
3643,245.48
3644,246.77
3645,247.96
3646,249.11
3647,250.03
3648,250.70
3649,251.19
3650,251.62
3651,252.08
3652,252.50
3653,252.78
3654,252.87
3655,252.87
3656,252.72
3657,252.50
3658,252.20
3659,251.74
3660,250.89
3661,249.73
3662,248.29
3663,246.89
3664,245.42
3665,244.02
3666,242.52
3667,241.15
3668,239.72
3669,238.34
3670,236.72
3671,235.11
3672,233.46
3673,232.06
3674,230.65
3675,229.31
3676,227.69
3677,226.04
3678,224.27
3679,222.69
3680,221.04
3681,219.42
3682,217.53
3683,215.64
3684,213.81
3685,212.40
3686,211.30
3687,210.39
3688,209.41
3689,208.44
3690,207.61
3691,207.15
3692,207.00
3693,207.00
3694,207.09
3695,207.34
3696,207.86
3697,208.59
3698,209.29
3699,209.78
3700,210.08
3701,210.27
3702,210.48
3703,210.72
3704,211.12
3705,211.55
3706,212.04
3707,212.49
3708,213.13
3709,213.81
3710,214.51
3711,215.24
3712,216.22
3713,217.35
3714,218.57
3715,219.79
3716,221.16
3717,222.56
3718,223.85
3719,224.76
3720,225.62
3721,226.53
3722,227.72
3723,228.88
3724,230.01
3725,231.17
3726,232.67
3727,234.31
3728,235.93
3729,237.09
3730,238.01
3731,238.68
3732,239.32
3733,239.75
3734,240.05
3735,240.23
3736,240.69
3737,241.36
3738,242.28
3739,243.23
3740,244.32
3741,245.48
3742,246.80
3743,247.96
3744,249.02
3745,249.94
3746,250.95
3747,251.86
3748,252.69
3749,253.39
3750,254.18
3751,255.13
3752,256.23
3753,257.17
3754,257.84
3755,258.30
3756,258.79
3757,259.22
3758,259.55
3759,259.83
3760,260.19
3761,260.62
3762,261.02
3763,261.29
3764,261.54
3765,261.75
3766,261.78
3767,261.57
3768,261.23
3769,260.96
3770,260.80
3771,260.80
3772,261.02
3773,261.47
3774,262.24
3775,263.21
3776,264.31
3777,265.26
3778,265.90
3779,266.14
3780,266.08
3781,265.84
3782,265.44
3783,264.95
3784,264.47
3785,264.01
3786,263.52
3787,263.03
3788,262.60
3789,262.39
3790,262.33
3791,262.33
3792,262.24
3793,262.02
3794,261.66
3795,261.17
3796,260.53
3797,259.80
3798,259.16
3799,258.67
3800,258.33
3801,258.12
3802,258.00
3803,258.03
3804,258.06
3805,258.09
3806,257.97
3807,257.72
3808,257.35
3809,256.87
3810,256.32
3811,255.86
3812,255.52
3813,255.25
3814,255.07
3815,255.10
3816,255.40
3817,255.89
3818,256.26
3819,256.29
3820,255.95
3821,255.46
3822,254.85
3823,254.15
3824,253.33
3825,252.35
3826,251.31
3827,250.34
3828,249.57
3829,249.11
3830,248.84
3831,248.63
3832,248.35
3833,248.08
3834,248.02
3835,248.26
3836,248.81
3837,249.48
3838,250.31
3839,251.25
3840,252.47
3841,253.88
3842,255.43
3843,256.87
3844,258.21
3845,259.34
3846,260.47
3847,261.63
3848,263.09
3849,264.71
3850,266.57
3851,268.43
3852,270.51
3853,272.61
3854,274.90
3855,276.98
3856,279.02
3857,280.88
3858,282.87
3859,284.70
3860,286.56
3861,288.18
3862,289.86
3863,291.44
3864,293.18
3865,294.80
3866,296.54
3867,298.16
3868,299.74
3869,301.15
3870,302.58
3871,304.02
3872,305.42
3873,306.61
3874,307.56
3875,308.26
3876,308.78
3877,309.02
3878,308.87
3879,308.38
3880,307.80
3881,307.31
3882,306.88
3883,306.43
3884,305.79
3885,305.08
3886,304.38
3887,303.68
3888,302.83
3889,301.88
3890,300.84
3891,299.93
3892,299.01
3893,298.10
3894,297.00
3895,295.84
3896,294.56
3897,293.40
3898,292.24
3899,291.08
3900,289.76
3901,288.60
3902,287.60
3903,286.93
3904,286.29
3905,285.61
3906,284.70
3907,283.78
3908,282.84
3909,281.92
3910,280.73
3911,279.33
3912,277.74
3913,276.34
3914,275.05
3915,273.86
3916,272.58
3917,271.45
3918,270.48
3919,269.78
3920,269.01
3921,268.13
3922,267.06
3923,266.08
3924,265.11
3925,264.25
3926,263.31
3927,262.33
3928,261.17
3929,260.01
3930,259.03
3931,258.30
3932,257.63
3933,257.23
3934,257.14
3935,257.39
3936,257.54
3937,257.60
3938,257.69
3939,257.90
3940,258.03
3941,257.81
3942,257.32
3943,256.84
3944,256.41
3945,255.95
3946,255.31
3947,254.58
3948,253.94
3949,253.48
3950,253.02
3951,252.56
3952,252.11
3953,251.86
3954,251.89
3955,252.14
3956,252.44
3957,252.72
3958,252.87
3959,252.84
3960,252.66
3961,252.41
3962,252.26
3963,252.23
3964,252.38
3965,252.62
3966,253.02
3967,253.48
3968,253.97
3969,254.46
3970,254.97
3971,255.43
3972,255.80
3973,256.01
3974,256.23
3975,256.47
3976,256.74
3977,256.96
3978,257.14
3979,257.35
3980,257.84
3981,258.54
3982,259.37
3983,260.10
3984,260.80
3985,261.44
3986,262.18
3987,262.91
3988,263.67
3989,264.37
3990,264.95
3991,265.44
3992,265.93
3993,266.36
3994,266.69
3995,266.94
3996,267.33
3997,267.76
3998,268.19
3999,268.43
4000,268.65
4001,268.86
4002,269.10
4003,269.32
4004,269.65
4005,270.11
4006,270.72
4007,271.42
4008,272.31
4009,273.28
4010,274.26
4011,274.93
4012,275.24
4013,275.27
4014,275.15
4015,274.87
4016,274.41
4017,273.96
4018,273.80
4019,274.02
4020,274.35
4021,274.63
4022,274.87
4023,275.09
4024,275.18
4025,274.96
4026,274.41
4027,273.68
4028,272.89
4029,272.19
4030,271.51
4031,270.78
4032,270.02
4033,269.32
4034,268.74
4035,268.28
4036,267.73
4037,267.03
4038,266.14
4039,265.20
4040,264.19
4041,263.24
4042,262.36
4043,261.69
4044,261.14
4045,260.68
4046,260.07
4047,259.37
4048,258.64
4049,257.93
4050,257.08
4051,256.13
4052,255.25
4053,254.76
4054,254.70
4055,254.97
4056,255.31
4057,255.62
4058,255.74
4059,255.71
4060,255.52
4061,255.34
4062,255.13
4063,254.85
4064,254.36
4065,253.97
4066,253.75
4067,253.72
4068,253.54
4069,253.11
4070,252.62
4071,252.11
4072,251.37
4073,250.43
4074,249.57
4075,249.08
4076,248.87
4077,248.66
4078,248.35
4079,248.11
4080,248.05
4081,248.05
4082,247.86
4083,247.41
4084,246.80
4085,246.31
4086,246.00
4087,245.79
4088,245.48
4089,245.24
4090,245.18
4091,245.42
4092,245.88
4093,246.40
4094,246.80
4095,247.04
4096,247.07
4097,246.83
4098,246.31
4099,245.57
4100,244.75
4101,244.05
4102,243.56
4103,243.32
4104,243.26
4105,243.26
4106,243.29
4107,243.29
4108,243.26
4109,243.26
4110,243.29
4111,243.32
4112,243.19
4113,242.98
4114,242.55
4115,242.10
4116,241.61
4117,241.12
4118,240.66
4119,240.20
4120,239.72
4121,239.26
4122,238.71
4123,238.28
4124,237.82
4125,237.40
4126,236.66
4127,235.72
4128,234.68
4129,233.73
4130,232.79
4131,231.87
4132,230.87
4133,229.95
4134,229.06
4135,228.36
4136,227.72
4137,227.29
4138,226.99
4139,226.78
4140,226.32
4141,225.65
4142,224.73
4143,223.75
4144,222.75
4145,221.83
4146,220.98
4147,220.25
4148,219.60
4149,219.18
4150,218.87
4151,218.66
4152,218.23
4153,217.53
4154,216.64
4155,215.94
4156,215.39
4157,214.94
4158,214.42
4159,213.96
4160,213.62
4161,213.35
4162,213.07
4163,212.86
4164,212.83
4165,213.04
4166,213.38
4167,213.90
4168,214.66
4169,215.61
4170,216.52
4171,217.25
4172,217.96
4173,218.63
4174,219.24
4175,219.73
4176,220.25
4177,220.92
4178,221.83
4179,222.81
4180,223.72
4181,224.43
4182,224.98
4183,225.43
4184,225.92
4185,226.38
4186,226.84
4187,227.26
4188,227.91
4189,228.61
4190,229.34
4191,229.80
4192,229.98
4193,229.95
4194,229.95
4195,230.16
4196,230.71
4197,231.45
4198,232.27
4199,232.94
4200,233.52
4201,234.01
4202,234.47
4203,234.92
4204,235.41
4205,235.87
4206,236.42
4207,237.12
4208,238.04
4209,238.98
4210,239.90
4211,240.60
4212,241.18
4213,241.64
4214,242.00
4215,242.25
4216,242.37
4217,242.34
4218,242.28
4219,242.25
4220,242.46
4221,242.89
4222,243.68
4223,244.63
4224,245.67
4225,246.61
4226,247.56
4227,248.47
4228,249.51
4229,250.43
4230,251.28
4231,251.98
4232,252.66
4233,253.36
4234,254.12
4235,254.82
4236,255.55
4237,256.23
4238,256.96
4239,257.66
4240,258.45
4241,259.12
4242,259.67
4243,260.13
4244,260.83
4245,261.72
4246,262.85
4247,264.01
4248,265.44
4249,267.09
4250,268.95
4251,270.60
4252,272.03
4253,273.19
4254,274.41
4255,275.54
4256,276.64
4257,277.56
4258,278.59
4259,279.75
4260,281.07
4261,282.26
4262,283.33
4263,284.27
4264,285.19
4265,285.89
4266,286.25
4267,286.25
4268,286.07
4269,285.83
4270,285.46
4271,284.97
4272,284.45
4273,283.97
4274,283.54
4275,283.08
4276,282.50
4277,281.77
4278,280.91
4279,280.21
4280,279.72
4281,279.51
4282,279.42
4283,279.42
4284,279.60
4285,280.06
4286,280.79
4287,281.52
4288,282.07
4289,282.32
4290,282.26
4291,281.98
4292,281.68
4293,281.46
4294,281.34
4295,281.31
4296,281.40
4297,281.65
4298,282.10
4299,282.59
4300,282.90
4301,282.90
4302,282.65
4303,282.41
4304,282.26
4305,282.26
4306,282.35
4307,282.62
4308,283.05
4309,283.54
4310,283.84
4311,283.84
4312,283.66
4313,283.42
4314,283.14
4315,282.90
4316,282.75
4317,282.75
4318,282.90
4319,283.14
4320,283.42
4321,283.69
4322,283.81
4323,283.57
4324,282.81
4325,281.86
4326,281.04
4327,280.55
4328,280.24
4329,280.00
4330,279.94
4331,280.21
4332,280.64
4333,280.91
4334,280.76
4335,280.27
4336,279.63
4337,278.87
4338,278.05
4339,277.37
4340,277.01
4341,277.01
4342,277.07
4343,277.13
4344,277.13
4345,277.13
4346,276.92
4347,276.49
4348,275.85
4349,275.09
4350,274.23
4351,273.59
4352,273.16
4353,272.92
4354,272.49
4355,271.85
4356,271.03
4357,270.02
4358,268.68
4359,267.06
4360,265.32
4361,263.61
4362,261.84
4363,260.19
4364,258.91
4365,258.18
4366,257.87
4367,257.93
4368,258.24
4369,258.73
4370,259.12
4371,259.16
4372,258.67
4373,257.97
4374,257.17
4375,256.44
4376,255.74
4377,255.28
4378,255.25
4379,255.74
4380,256.47
4381,257.23
4382,257.90
4383,258.33
4384,258.54
4385,258.54
4386,258.51
4387,258.48
4388,258.48
4389,258.48
4390,258.61
4391,258.82
4392,259.12
4393,259.37
4394,259.52
4395,259.49
4396,259.34
4397,259.12
4398,258.88
4399,258.61
4400,258.33
4401,258.09
4402,258.06
4403,258.27
4404,258.73
4405,259.19
4406,259.64
4407,260.13
4408,260.77
4409,261.44
4410,262.12
4411,262.85
4412,263.82
4413,265.01
4414,266.20
4415,267.18
4416,267.94
4417,268.40
4418,268.55
4419,268.28
4420,267.70
4421,266.97
4422,266.27
4423,265.78
4424,265.56
4425,265.56
4426,265.78
4427,266.02
4428,266.17
4429,266.20
4430,266.05
4431,265.78
4432,265.47
4433,265.26
4434,265.17
4435,265.17
4436,265.20
4437,265.20
4438,265.20
4439,265.17
4440,265.17
4441,265.20
4442,265.20
4443,265.20
4444,265.17
4445,265.20
4446,265.23
4447,265.23
4448,265.08
4449,264.86
4450,264.62
4451,264.34
4452,263.98
4453,263.52
4454,263.12
4455,262.88
4456,262.70
4457,262.45
4458,262.18
4459,261.96
4460,261.69
4461,261.20
4462,260.47
4463,259.77
4464,259.25
4465,259.03
4466,258.91
4467,258.94
4468,259.16
4469,259.64
4470,260.16
4471,260.41
4472,260.35
4473,260.13
4474,259.77
4475,259.28
4476,258.58
4477,257.90
4478,257.39
4479,257.14
4480,256.93
4481,256.74
4482,256.59
4483,256.59
4484,256.56
4485,256.35
4486,255.83
4487,255.10
4488,254.24
4489,253.54
4490,253.11
4491,252.87
4492,252.69
4493,252.41
4494,252.20
4495,252.23
4496,252.44
4497,252.69
4498,252.78
4499,252.78
4500,252.90
4501,253.14
4502,253.30
4503,253.33
4504,253.30
4505,253.27
4506,253.27
4507,253.27
4508,253.36
4509,253.57
4510,253.91
4511,254.15
4512,254.24
4513,254.24
4514,254.21
4515,254.21
4516,254.21
4517,254.21
4518,254.27
4519,254.49
4520,254.91
4521,255.40
4522,255.89
4523,256.38
4524,256.87
4525,257.35
4526,257.72
4527,258.00
4528,258.09
4529,258.09
4530,258.00
4531,257.75
4532,257.35
4533,256.87
4534,256.38
4535,255.92
4536,255.43
4537,254.97
4538,254.43
4539,253.97
4540,253.54
4541,253.11
4542,252.44
4543,251.50
4544,250.27
4545,249.11
4546,247.99
4547,246.83
4548,245.33
4549,243.68
4550,241.97
4551,240.57
4552,239.35
4553,238.19
4554,236.88
4555,235.72
4556,234.77
4557,234.07
4558,233.28
4559,232.42
4560,231.41
4561,230.44
4562,229.28
4563,228.18
4564,227.08
4565,226.14
4566,225.07
4567,223.91
4568,222.72
4569,221.77
4570,220.89
4571,219.97
4572,218.93
4573,217.99
4574,217.22
4575,216.74
4576,216.43
4577,216.22
4578,216.06
4579,216.06
4580,216.19
4581,216.46
4582,216.74
4583,216.98
4584,217.10
4585,217.10
4586,217.07
4587,217.07
4588,217.07
4589,217.07
4590,217.16
4591,217.41
4592,217.74
4593,217.96
4594,218.05
4595,218.05
4596,218.08
4597,218.08
4598,217.86
4599,217.44
4600,216.80
4601,216.03
4602,215.21
4603,214.51
4604,214.08
4605,213.87
4606,213.53
4607,213.07
4608,212.59
4609,212.13
4610,211.43
4611,210.51
4612,209.38
4613,208.44
4614,207.67
4615,207.00
4616,206.15
4617,205.20
4618,204.25
4619,203.55
4620,202.91
4621,202.24
4622,201.42
4623,200.71
4624,200.23
4625,199.98
4626,199.83
4627,199.62
4628,199.34
4629,199.10
4630,198.85
4631,198.61
4632,198.36
4633,198.15
4634,197.91
4635,197.66
4636,197.42
4637,197.17
4638,197.02
4639,197.02
4640,197.20
4641,197.69
4642,198.49
4643,199.43
4644,200.32
4645,201.05
4646,201.69
4647,202.15
4648,202.33
4649,202.09
4650,201.63
4651,201.08
4652,200.71
4653,200.71
4654,201.17
4655,201.87
4656,202.70
4657,203.43
4658,204.04
4659,204.50
4660,204.80
4661,204.77
4662,204.56
4663,204.28
4664,204.28
4665,204.74
4666,205.72
4667,206.94
4668,208.13
4669,209.08
4670,209.81
4671,210.24
4672,210.45
4673,210.42
4674,210.39
4675,210.36
4676,210.48
4677,210.69
4678,211.12
4679,211.82
4680,212.89
4681,214.08
4682,215.24
4683,216.16
4684,217.04
4685,217.99
4686,219.06
4687,219.97
4688,220.73
4689,221.13
4690,221.59
4691,221.98
4692,222.63
4693,223.30
4694,224.24
4695,225.34
4696,226.90
4697,228.79
4698,231.17
4699,233.76
4700,236.54
4701,239.11
4702,241.70
4703,243.99
4704,246.22
4705,248.11
4706,249.85
4707,251.19
4708,252.41
4709,253.57
4710,255.07
4711,256.65
4712,258.33
4713,259.74
4714,261.20
4715,262.51
4716,263.89
4717,265.05
4718,266.33
4719,267.67
4720,269.38
4721,271.27
4722,273.44
4723,275.54
4724,277.56
4725,279.21
4726,280.64
4727,281.77
4728,282.84
4729,283.75
4730,284.73
4731,285.68
4732,286.59
4733,287.29
4734,287.78
4735,287.99
4736,288.15
4737,288.12
4738,287.93
4739,287.69
4740,287.57
4741,287.57
4742,287.51
4743,287.26
4744,286.93
4745,286.71
4746,286.56
4747,286.35
4748,285.80
4749,285.10
4750,284.39
4751,283.69
4752,282.71
4753,281.56
4754,280.36
4755,279.42
4756,278.47
4757,277.56
4758,276.64
4759,275.94
4760,275.42
4761,274.93
4762,274.38
4763,273.96
4764,273.71
4765,273.71
4766,273.65
4767,273.44
4768,273.16
4769,272.92
4770,272.55
4771,272.09
4772,271.67
4773,271.42
4774,271.33
4775,271.33
4776,271.45
4777,271.70
4778,271.97
4779,272.25
4780,272.37
4781,272.40
4782,272.25
4783,272.00
4784,271.70
4785,271.45
4786,271.30
4787,271.33
4788,271.45
4789,271.45
4790,271.15
4791,270.66
4792,270.23
4793,269.96
4794,269.87
4795,269.87
4796,270.08
4797,270.51
4798,271.24
4799,272.19
4800,273.44
4801,274.84
4802,276.46
4803,278.11
4804,279.88
4805,281.52
4806,283.02
4807,284.18
4808,285.16
4809,285.83
4810,286.41
4811,286.83
4812,287.32
4813,287.75
4814,288.36
4815,289.03
4816,289.89
4817,290.83
4818,291.96
4819,293.12
4820,294.37
4821,295.56
4822,296.72
4823,297.67
4824,298.28
4825,298.55
4826,298.52
4827,298.25
4828,297.70
4829,297.03
4830,296.30
4831,295.53
4832,294.77
4833,294.07
4834,293.61
4835,293.37
4836,293.06
4837,292.66
4838,292.02
4839,291.29
4840,290.37
4841,289.46
4842,288.64
4843,287.93
4844,287.11
4845,286.19
4846,285.19
4847,284.52
4848,284.03
4849,283.60
4850,282.87
4851,281.95
4852,280.82
4853,279.63
4854,278.23
4855,276.86
4856,275.57
4857,274.63
4858,273.80
4859,273.13
4860,272.46
4861,271.79
4862,270.87
4863,269.68
4864,268.25
4865,266.82
4866,265.47
4867,264.31
4868,263.15
4869,262.21
4870,261.54
4871,261.35
4872,261.44
4873,261.69
4874,261.90
4875,262.21
4876,262.51
4877,262.79
4878,262.63
4879,262.18
4880,261.54
4881,260.83
4882,259.92
4883,258.73
4884,257.39
4885,256.16
4886,255.22
4887,254.49
4888,253.94
4889,253.72
4890,253.91
4891,254.36
4892,254.91
4893,255.40
4894,255.98
4895,256.68
4896,257.39
4897,257.90
4898,258.12
4899,258.12
4900,258.00
4901,257.72
4902,257.29
4903,256.81
4904,256.56
4905,256.53
4906,256.62
4907,256.65
4908,256.62
4909,256.59
4910,256.59
4911,256.62
4912,256.65
4913,256.62
4914,256.53
4915,256.56
4916,256.81
4917,257.26
4918,257.78
4919,258.27
4920,258.82
4921,259.28
4922,259.46
4923,259.28
4924,258.70
4925,257.93
4926,257.14
4927,256.41
4928,255.92
4929,255.68
4930,255.68
4931,255.92
4932,256.41
4933,257.14
4934,258.00
4935,258.73
4936,259.16
4937,259.16
4938,258.76
4939,258.03
4940,257.02
4941,255.83
4942,254.55
4943,253.33
4944,252.29
4945,251.59
4946,251.28
4947,251.28
4948,251.37
4949,251.37
4950,251.34
4951,251.34
4952,251.34
4953,251.37
4954,251.34
4955,251.34
4956,251.34
4957,251.34
4958,251.37
4959,251.34
4960,251.34
4961,251.31
4962,251.43
4963,251.65
4964,252.04
4965,252.50
4966,253.11
4967,253.81
4968,254.61
4969,255.34
4970,255.98
4971,256.44
4972,256.71
4973,256.93
4974,257.26
4975,257.75
4976,258.30
4977,258.76
4978,259.22
4979,259.64
4980,260.22
4981,260.93
4982,261.84
4983,262.79
4984,263.70
4985,264.40
4986,264.95
4987,265.41
4988,265.93
4989,266.39
4990,266.72
4991,266.97
4992,267.27
4993,267.73
4994,268.34
4995,268.83
4996,269.10
4997,269.10
4998,268.86
4999,268.34
5000,267.67
5001,266.94
5002,266.30
5003,265.84
5004,265.44
5005,265.23
5006,265.23
5007,265.47
5008,265.81
5009,266.05
5010,266.14
5011,266.11
5012,266.20
5013,266.42
5014,266.72
5015,266.97
5016,267.18
5017,267.40
5018,267.73
5019,268.25
5020,268.86
5021,269.32
5022,269.47
5023,269.47
5024,269.56
5025,269.81
5026,270.02
5027,270.05
5028,269.90
5029,269.62
5030,269.23
5031,268.80
5032,268.31
5033,267.79
5034,267.27
5035,266.82
5036,266.45
5037,266.24
5038,265.99
5039,265.78
5040,265.59
5041,265.63
5042,265.66
5043,265.44
5044,264.80
5045,263.85
5046,262.70
5047,261.51
5048,260.25
5049,259.09
5050,257.97
5051,257.02
5052,256.16
5053,255.52
5054,254.88
5055,254.18
5056,253.14
5057,251.98
5058,250.85
5059,249.91
5060,248.93
5061,247.99
5062,247.22
5063,246.77
5064,246.37
5065,245.94
5066,245.30
5067,244.60
5068,243.84
5069,243.10
5070,242.40
5071,241.97
5072,241.82
5073,241.82
5074,241.70
5075,241.52
5076,241.36
5077,241.33
5078,241.33
5079,241.39
5080,241.49
5081,241.67
5082,241.88
5083,242.22
5084,242.58
5085,242.80
5086,242.52
5087,241.85
5088,241.06
5089,240.30
5090,239.44
5091,238.49
5092,237.67
5093,237.18
5094,236.94
5095,236.76
5096,236.48
5097,236.24
5098,236.05
5099,236.05
5100,236.18
5101,236.48
5102,236.79
5103,237.00
5104,237.03
5105,237.06
5106,237.21
5107,237.43
5108,237.52
5109,237.55
5110,237.76
5111,238.19
5112,238.71
5113,239.23
5114,239.84
5115,240.51
5116,241.15
5117,241.67
5118,242.10
5119,242.28
5120,242.16
5121,241.70
5122,241.18
5123,240.60
5124,240.05
5125,239.62
5126,239.53
5127,239.72
5128,239.99
5129,240.26
5130,240.69
5131,241.12
5132,241.39
5133,241.39
5134,241.55
5135,241.94
5136,242.61
5137,243.38
5138,244.26
5139,245.15
5140,246.03
5141,246.80
5142,247.44
5143,247.86
5144,248.05
5145,248.05
5146,248.17
5147,248.38
5148,248.57
5149,248.60
5150,248.54
5151,248.50
5152,248.50
5153,248.54
5154,248.54
5155,248.50
5156,248.50
5157,248.50
5158,248.57
5159,248.57
5160,248.41
5161,248.17
5162,247.96
5163,247.96
5164,248.14
5165,248.41
5166,248.63
5167,248.87
5168,249.11
5169,249.42
5170,249.51
5171,249.27
5172,248.60
5173,247.65
5174,246.55
5175,245.36
5176,243.99
5177,242.58
5178,241.18
5179,239.99
5180,238.92
5181,238.01
5182,237.15
5183,236.45
5184,235.78
5185,235.08
5186,234.28
5187,233.55
5188,233.00
5189,232.79
5190,232.88
5191,233.15
5192,233.31
5193,233.31
5194,233.15
5195,232.94
5196,232.64
5197,232.12
5198,231.54
5199,231.05
5200,230.83
5201,230.83
5202,230.83
5203,230.83
5204,231.02
5205,231.51
5206,232.15
5207,232.64
5208,232.91
5209,233.12
5210,233.46
5211,233.98
5212,234.44
5213,234.68
5214,234.68
5215,234.65
5216,234.77
5217,235.02
5218,235.32
5219,235.53
5220,235.75
5221,235.96
5222,236.33
5223,236.79
5224,237.40
5225,238.10
5226,238.95
5227,239.90
5228,240.91
5229,241.88
5230,242.74
5231,243.44
5232,244.05
5233,244.51
5234,244.87
5235,245.09
5236,245.21
5237,245.18
5238,245.12
5239,245.12
5240,245.30
5241,245.51
5242,245.70
5243,245.97
5244,246.49
5245,247.16
5246,247.80
5247,248.29
5248,248.87
5249,249.51
5250,250.21
5251,250.73
5252,251.07
5253,251.25
5254,251.43
5255,251.68
5256,252.11
5257,252.56
5258,252.96
5259,253.20
5260,253.42
5261,253.66
5262,253.78
5263,253.54
5264,252.93
5265,252.20
5266,251.62
5267,251.10
5268,250.58
5269,250.12
5270,249.91
5271,249.85
5272,249.85
5273,249.88
5274,250.15
5275,250.61
5276,251.01
5277,251.28
5278,251.62
5279,252.04
5280,252.38
5281,252.44
5282,252.23
5283,251.92
5284,251.74
5285,251.77
5286,252.04
5287,252.50
5288,253.05
5289,253.54
5290,254.00
5291,254.46
5292,254.88
5293,255.16
5294,255.16
5295,254.91
5296,254.39
5297,253.69
5298,252.84
5299,251.89
5300,250.79
5301,249.57
5302,248.35
5303,247.44
5304,246.92
5305,246.64
5306,246.40
5307,246.22
5308,246.22
5309,246.43
5310,246.61
5311,246.67
5312,246.58
5313,246.61
5314,246.55
5315,246.37
5316,245.91
5317,245.42
5318,244.96
5319,244.54
5320,243.84
5321,242.92
5322,241.76
5323,240.57
5324,239.29
5325,237.88
5326,236.24
5327,234.56
5328,233.00
5329,231.84
5330,230.96
5331,230.29
5332,229.52
5333,228.88
5334,228.18
5335,227.51
5336,226.56
5337,225.43
5338,224.03
5339,222.60
5340,221.01
5341,219.60
5342,218.51
5343,217.80
5344,217.29
5345,216.86
5346,216.37
5347,215.91
5348,215.27
5349,214.60
5350,213.84
5351,213.10
5352,212.37
5353,211.67
5354,211.15
5355,210.88
5356,210.88
5357,211.15
5358,211.70
5359,212.40
5360,213.04
5361,213.53
5362,213.99
5363,214.45
5364,214.90
5365,215.15
5366,215.18
5367,215.15
5368,215.30
5369,215.52
5370,215.70
5371,215.67
5372,215.67
5373,215.88
5374,216.46
5375,217.19
5376,217.96
5377,218.63
5378,219.30
5379,220.09
5380,220.76
5381,221.01
5382,220.55
5383,219.57
5384,218.54
5385,217.56
5386,216.46
5387,215.30
5388,214.32
5389,213.81
5390,213.71
5391,213.78
5392,213.75
5393,213.50
5394,212.92
5395,212.22
5396,211.46
5397,210.75
5398,210.02
5399,209.29
5400,208.74
5401,208.50
5402,208.59
5403,208.83
5404,209.05
5405,209.32
5406,209.69
5407,210.14
5408,210.51
5409,210.78
5410,211.09
5411,211.55
5412,212.04
5413,212.52
5414,213.10
5415,213.81
5416,214.63
5417,215.33
5418,215.91
5419,216.37
5420,216.86
5421,217.29
5422,217.80
5423,218.23
5424,218.84
5425,219.51
5426,220.37
5427,221.31
5428,222.41
5429,223.57
5430,224.85
5431,226.01
5432,227.17
5433,228.33
5434,229.71
5435,231.11
5436,232.54
5437,233.70
5438,234.71
5439,235.63
5440,236.72
5441,237.82
5442,239.14
5443,240.54
5444,242.34
5445,244.17
5446,246.00
5447,247.41
5448,248.66
5449,249.76
5450,251.07
5451,252.44
5452,254.18
5453,255.98
5454,258.15
5455,260.50
5456,263.24
5457,265.81
5458,268.16
5459,270.02
5460,271.82
5461,273.65
5462,275.79
5463,277.89
5464,280.09
5465,282.20
5466,284.45
5467,286.53
5468,288.51
5469,290.16
5470,291.66
5471,292.79
5472,293.67
5473,294.37
5474,295.20
5475,296.11
5476,297.06
5477,297.79
5478,298.28
5479,298.49
5480,298.52
5481,298.25
5482,297.76
5483,297.30
5484,297.00
5485,296.75
5486,296.33
5487,295.65
5488,294.77
5489,293.79
5490,292.63
5491,291.50
5492,290.37
5493,289.43
5494,288.51
5495,287.81
5496,287.48
5497,287.51
5498,287.54
5499,287.32
5500,286.74
5501,286.04
5502,285.28
5503,284.58
5504,283.91
5505,283.45
5506,283.23
5507,283.26
5508,283.23
5509,283.05
5510,282.50
5511,281.80
5512,280.88
5513,279.97
5514,278.96
5515,278.02
5516,277.10
5517,276.40
5518,275.97
5519,275.73
5520,275.54
5521,275.30
5522,275.02
5523,274.81
5524,274.60
5525,274.35
5526,274.08
5527,273.86
5528,273.68
5529,273.47
5530,272.98
5531,272.31
5532,271.39
5533,270.45
5534,269.44
5535,268.49
5536,267.61
5537,266.91
5538,266.30
5539,265.59
5540,264.68
5541,263.73
5542,262.88
5543,262.18
5544,261.38
5545,260.44
5546,259.43
5547,258.70
5548,258.36
5549,258.39
5550,258.64
5551,259.09
5552,259.86
5553,260.83
5554,261.87
5555,262.57
5556,262.88
5557,262.88
5558,262.82
5559,262.79
5560,262.73
5561,262.76
5562,263.03
5563,263.49
5564,263.85
5565,263.85
5566,263.67
5567,263.40
5568,263.06
5569,262.57
5570,262.08
5571,261.81
5572,261.93
5573,262.42
5574,263.21
5575,264.19
5576,265.23
5577,266.20
5578,266.88
5579,267.12
5580,266.97
5581,266.48
5582,265.75
5583,264.98
5584,264.53
5585,264.53
5586,264.98
5587,265.72
5588,266.54
5589,267.27
5590,267.82
5591,268.04
5592,267.85
5593,267.43
5594,266.82
5595,266.05
5596,265.14
5597,264.19
5598,263.49
5599,262.97
5600,262.51
5601,262.08
5602,261.69
5603,261.44
5604,261.20
5605,260.99
5606,260.86
5607,260.86
5608,260.77
5609,260.59
5610,260.28
5611,260.04
5612,259.80
5613,259.55
5614,259.37
5615,259.37
5616,259.61
5617,260.10
5618,260.71
5619,261.47
5620,262.27
5621,263.00
5622,263.40
5623,263.43
5624,263.12
5625,262.63
5626,261.93
5627,261.02
5628,259.83
5629,258.64
5630,257.54
5631,256.56
5632,255.65
5633,254.73
5634,253.75
5635,252.81
5636,251.77
5637,250.82
5638,250.06
5639,249.63
5640,249.33
5641,249.11
5642,248.81
5643,248.60
5644,248.54
5645,248.57
5646,248.35
5647,247.89
5648,247.19
5649,246.49
5650,245.76
5651,245.09
5652,244.35
5653,243.65
5654,242.86
5655,242.13
5656,241.58
5657,241.39
5658,241.42
5659,241.42
5660,241.21
5661,241.00
5662,240.94
5663,240.91
5664,240.66
5665,240.23
5666,239.84
5667,239.53
5668,239.20
5669,238.77
5670,238.37
5671,238.10
5672,237.85
5673,237.67
5674,237.55
5675,237.52
5676,237.52
5677,237.55
5678,237.67
5679,237.88
5680,238.07
5681,238.10
5682,237.98
5683,237.73
5684,237.30
5685,236.85
5686,236.45
5687,236.21
5688,236.02
5689,236.05
5690,236.33
5691,236.79
5692,237.24
5693,237.55
5694,237.58
5695,237.30
5696,236.72
5697,235.99
5698,235.41
5699,235.17
5700,235.20
5701,235.47
5702,235.90
5703,236.39
5704,236.76
5705,236.79
5706,236.39
5707,235.66
5708,234.68
5709,233.70
5710,232.91
5711,232.42
5712,232.24
5713,232.27
5714,232.36
5715,232.64
5716,233.03
5717,233.52
5718,233.92
5719,234.19
5720,234.28
5721,234.28
5722,234.16
5723,233.92
5724,233.58
5725,233.09
5726,232.45
5727,231.72
5728,231.05
5729,230.56
5730,230.32
5731,230.35
5732,230.53
5733,230.74
5734,230.99
5735,231.23
5736,231.51
5737,231.75
5738,231.90
5739,231.93
5740,231.78
5741,231.51
5742,231.23
5743,230.99
5744,230.80
5745,230.59
5746,230.22
5747,229.77
5748,229.16
5749,228.45
5750,227.57
5751,226.62
5752,225.62
5753,224.67
5754,223.75
5755,223.08
5756,222.60
5757,222.38
5758,222.26
5759,222.29
5760,222.41
5761,222.69
5762,222.90
5763,222.90
5764,222.60
5765,222.11
5766,221.65
5767,221.16
5768,220.55
5769,219.85
5770,219.18
5771,218.69
5772,218.32
5773,218.11
5774,218.05
5775,218.05
5776,217.90
5777,217.71
5778,217.50
5779,217.25
5780,216.77
5781,216.06
5782,215.30
5783,214.81
5784,214.66
5785,214.66
5786,214.66
5787,214.66
5788,214.81
5789,215.06
5790,215.21
5791,215.21
5792,215.21
5793,215.39
5794,215.91
5795,216.64
5796,217.56
5797,218.48
5798,219.42
5799,220.40
5800,221.44
5801,222.35
5802,223.11
5803,223.82
5804,224.76
5805,225.95
5806,227.20
5807,228.12
5808,228.85
5809,229.55
5810,230.38
5811,231.05
5812,231.51
5813,231.75
5814,232.15
5815,232.79
5816,233.64
5817,234.65
5818,235.90
5819,237.27
5820,238.59
5821,239.59
5822,240.33
5823,240.75
5824,240.91
5825,240.88
5826,241.06
5827,241.49
5828,242.19
5829,242.92
5830,243.68
5831,244.38
5832,244.93
5833,245.18
5834,245.12
5835,244.84
5836,244.57
5837,244.29
5838,244.14
5839,244.14
5840,244.38
5841,244.87
5842,245.45
5843,245.97
5844,246.28
5845,246.49
5846,246.70
5847,246.98
5848,247.19
5849,247.19
5850,246.89
5851,246.43
5852,245.91
5853,245.42
5854,244.90
5855,244.42
5856,244.11
5857,244.14
5858,244.35
5859,244.66
5860,244.69
5861,244.51
5862,243.93
5863,242.98
5864,241.55
5865,239.90
5866,238.22
5867,236.79
5868,235.41
5869,234.04
5870,232.51
5871,231.08
5872,229.74
5873,228.58
5874,227.51
5875,226.56
5876,225.62
5877,224.95
5878,224.58
5879,224.61
5880,224.79
5881,225.07
5882,225.28
5883,225.56
5884,225.74
5885,225.77
5886,225.40
5887,224.70
5888,223.75
5889,222.78
5890,221.89
5891,221.19
5892,220.64
5893,220.43
5894,220.49
5895,220.73
5896,221.01
5897,221.28
5898,221.47
5899,221.44
5900,221.13
5901,220.67
5902,220.28
5903,220.03
5904,219.79
5905,219.54
5906,219.51
5907,219.73
5908,220.15
5909,220.67
5910,221.19
5911,221.62
5912,221.98
5913,222.23
5914,222.47
5915,222.69
5916,222.81
5917,222.84
5918,222.81
5919,222.78
5920,222.78
5921,222.78
5922,222.87
5923,223.11
5924,223.45
5925,223.66
5926,223.75
5927,223.75
5928,223.75
5929,223.75
5930,223.63
5931,223.45
5932,223.18
5933,222.93
5934,222.63
5935,222.41
5936,222.35
5937,222.63
5938,222.99
5939,223.24
5940,223.24
5941,223.02
5942,222.60
5943,221.86
5944,220.67
5945,219.27
5946,217.93
5947,216.67
5948,215.45
5949,214.29
5950,213.38
5951,212.89
5952,212.62
5953,212.43
5954,212.28
5955,212.28
5956,212.34
5957,212.37
5958,212.22
5959,212.01
5960,211.64
5961,211.18
5962,210.54
5963,209.81
5964,209.14
5965,208.65
5966,208.40
5967,208.40
5968,208.68
5969,209.17
5970,209.69
5971,209.96
5972,209.78
5973,209.29
5974,208.74
5975,208.22
5976,207.79
5977,207.58
5978,207.67
5979,208.16
5980,208.89
5981,209.63
5982,210.14
5983,210.39
5984,210.39
5985,210.11
5986,209.63
5987,209.14
5988,209.01
5989,209.23
5990,209.56
5991,209.81
5992,210.11
5993,210.54
5994,211.21
5995,211.91
5996,212.74
5997,213.62
5998,214.81
5999,216.28
6000,217.93
6001,219.33
6002,220.37
6003,221.07
6004,221.80
6005,222.44
6006,222.93
6007,223.18
6008,223.57
6009,224.21
6010,225.16
6011,226.14
6012,227.11
6013,228.00
6014,228.94
6015,229.89
6016,231.05
6017,232.18
6018,233.31
6019,234.22
6020,235.20
6021,236.08
6022,237.09
6023,237.98
6024,239.07
6025,240.20
6026,241.58
6027,242.95
6028,244.54
6029,246.15
6030,248.05
6031,249.88
6032,251.83
6033,253.69
6034,255.74
6035,257.81
6036,260.13
6037,262.48
6038,265.11
6039,267.67
6040,270.26
6041,272.58
6042,274.96
6043,277.28
6044,279.79
6045,282.10
6046,284.39
6047,286.50
6048,288.73
6049,290.77
6050,292.82
6051,294.68
6052,296.75
6053,298.83
6054,301.03
6055,302.89
6056,304.60
6057,305.97
6058,307.22
6059,308.17
6060,308.81
6061,308.99
6062,308.93
6063,308.65
6064,308.38
6065,308.14
6066,307.98
6067,307.98
6068,308.23
6069,308.72
6070,309.30
6071,309.78
6072,310.06
6073,310.09
6074,309.75
6075,309.08
6076,307.83
6077,306.18
6078,304.14
6079,302.03
6080,299.84
6081,297.70
6082,295.50
6083,293.67
6084,292.14
6085,291.02
6086,289.73
6087,288.39
6088,286.77
6089,285.16
6090,283.17
6091,280.85
6092,278.02
6093,275.18
6094,272.43
6095,270.08
6096,267.94
6097,266.33
6098,265.11
6099,264.43
6100,263.95
6101,263.55
6102,262.91
6103,262.24
6104,261.41
6105,260.47
6106,259.28
6107,258.12
6108,257.11
6109,256.38
6110,255.80
6111,255.40
6112,255.04
6113,254.82
6114,254.46
6115,254.03
6116,253.48
6117,253.05
6118,252.50
6119,251.80
6120,250.85
6121,249.91
6122,249.15
6123,248.66
6124,248.32
6125,248.14
6126,248.02
6127,248.02
6128,248.02
6129,248.05
6130,248.08
6131,248.11
6132,247.89
6133,247.44
6134,246.70
6135,246.03
6136,245.36
6137,244.66
6138,243.65
6139,242.52
6140,241.27
6141,240.08
6142,238.74
6143,237.37
6144,235.93
6145,234.77
6146,233.73
6147,232.79
6148,231.81
6149,230.87
6150,230.01
6151,229.31
6152,228.64
6153,227.94
6154,227.14
6155,226.44
6156,225.83
6157,225.37
6158,224.95
6159,224.49
6160,223.94
6161,223.48
6162,223.08
6163,222.87
6164,222.75
6165,222.75
6166,222.84
6167,223.11
6168,223.45
6169,223.69
6170,223.69
6171,223.45
6172,223.14
6173,222.90
6174,222.69
6175,222.47
6176,222.20
6177,221.95
6178,221.77
6179,221.80
6180,221.92
6181,221.92
6182,221.62
6183,221.19
6184,220.70
6185,220.21
6186,219.51
6187,218.57
6188,217.59
6189,216.83
6190,216.37
6191,216.16
6192,216.19
6193,216.40
6194,216.77
6195,217.29
6196,217.86
6197,218.57
6198,219.39
6199,220.34
6200,221.50
6201,222.69
6202,223.79
6203,224.76
6204,225.65
6205,226.32
6206,226.78
6207,227.02
6208,227.23
6209,227.45
6210,227.63
6211,227.60
6212,227.51
6213,227.51
6214,227.69
6215,227.94
6216,228.06
6217,228.09
6218,228.12
6219,228.09
6220,227.84
6221,227.42
6222,226.90
6223,226.41
6224,225.74
6225,224.79
6226,223.69
6227,222.75
6228,221.95
6229,221.28
6230,220.46
6231,219.51
6232,218.48
6233,217.53
6234,216.64
6235,215.94
6236,215.42
6237,215.21
6238,215.21
6239,215.48
6240,215.82
6241,216.13
6242,216.06
6243,215.58
6244,214.69
6245,213.75
6246,212.89
6247,212.13
6248,211.46
6249,210.97
6250,210.97
6251,211.46
6252,212.13
6253,212.62
6254,212.86
6255,213.10
6256,213.53
6257,213.96
6258,214.29
6259,214.54
6260,215.06
6261,215.70
6262,216.37
6263,216.86
6264,217.44
6265,218.08
6266,218.84
6267,219.57
6268,220.40
6269,221.31
6270,222.32
6271,223.27
6272,224.21
6273,225.13
6274,226.23
6275,227.36
6276,228.70
6277,230.07
6278,231.72
6279,233.37
6280,235.02
6281,236.39
6282,237.70
6283,238.83
6284,240.05
6285,241.15
6286,242.55
6287,244.11
6288,246.31
6289,248.90
6290,251.98
6291,255.04
6292,258.12
6293,260.96
6294,263.70
6295,266.02
6296,267.97
6297,269.38
6298,270.54
6299,271.39
6300,272.25
6301,272.92
6302,273.74
6303,274.63
6304,275.73
6305,276.89
6306,278.32
6307,279.69
6308,281.07
6309,282.26
6310,283.42
6311,284.33
6312,284.91
6313,285.16
6314,285.31
6315,285.52
6316,285.83
6317,286.07
6318,286.19
6319,286.19
6320,286.04
6321,285.83
6322,285.49
6323,285.03
6324,284.30
6325,283.33
6326,282.26
6327,281.28
6328,280.58
6329,280.09
6330,279.72
6331,279.51
6332,279.48
6333,279.69
6334,280.12
6335,280.61
6336,281.19
6337,281.89
6338,282.75
6339,283.66
6340,284.76
6341,285.98
6342,287.32
6343,288.48
6344,289.37
6345,290.10
6346,290.95
6347,291.87
6348,292.63
6349,293.15
6350,293.55
6351,293.73
6352,293.55
6353,292.88
6354,291.84
6355,290.59
6356,289.18
6357,287.75
6358,286.53
6359,285.83
6360,285.55
6361,285.58
6362,285.77
6363,285.98
6364,286.22
6365,286.47
6366,286.74
6367,286.99
6368,287.08
6369,287.08
6370,287.05
6371,287.05
6372,287.05
6373,287.05
6374,287.11
6375,287.32
6376,287.84
6377,288.54
6378,289.40
6379,290.34
6380,291.50
6381,292.63
6382,293.76
6383,294.74
6384,295.72
6385,296.60
6386,297.45
6387,298.16
6388,298.98
6389,299.90
6390,300.87
6391,301.88
6392,302.92
6393,303.83
6394,304.47
6395,304.75
6396,304.72
6397,304.47
6398,303.92
6399,302.98
6400,301.67
6401,300.23
6402,298.77
6403,297.33
6404,295.81
6405,294.46
6406,293.18
6407,292.02
6408,290.59
6409,288.97
6410,287.20
6411,285.55
6412,283.72
6413,281.89
6414,279.97
6415,278.32
6416,276.79
6417,275.45
6418,273.90
6419,272.28
6420,270.48
6421,268.83
6422,267.21
6423,265.87
6424,264.56
6425,263.37
6426,262.21
6427,261.29
6428,260.59
6429,260.16
6430,259.61
6431,258.94
6432,258.06
6433,257.11
6434,255.98
6435,254.82
6436,253.69
6437,252.72
6438,251.86
6439,251.19
6440,250.67
6441,250.46
6442,250.40
6443,250.43
6444,250.34
6445,250.12
6446,249.73
6447,249.27
6448,248.63
6449,247.92
6450,247.19
6451,246.49
6452,245.76
6453,245.06
6454,244.38
6455,243.90
6456,243.62
6457,243.65
6458,243.96
6459,244.45
6460,244.93
6461,245.42
6462,245.91
6463,246.43
6464,246.70
6465,246.73
6466,246.43
6467,245.97
6468,245.36
6469,244.63
6470,243.71
6471,242.80
6472,241.97
6473,241.24
6474,240.39
6475,239.47
6476,238.68
6477,238.16
6478,237.82
6479,237.61
6480,237.61
6481,237.82
6482,238.16
6483,238.43
6484,238.53
6485,238.53
6486,238.53
6487,238.53
6488,238.43
6489,238.22
6490,237.85
6491,237.34
6492,236.76
6493,236.30
6494,236.08
6495,236.08
6496,236.11
6497,236.15
6498,236.21
6499,236.45
6500,236.76
6501,237.03
6502,237.15
6503,237.12
6504,236.94
6505,236.76
6506,236.54
6507,236.30
6508,235.84
6509,235.14
6510,234.31
6511,233.55
6512,232.91
6513,232.48
6514,232.27
6515,232.24
6516,232.33
6517,232.60
6518,233.15
6519,233.86
6520,234.47
6521,234.99
6522,235.47
6523,235.93
6524,236.18
6525,236.21
6526,236.11
6527,236.08
6528,236.15
6529,236.15
6530,236.15
6531,236.11
6532,236.15
6533,236.11
6534,236.11
6535,236.08
6536,236.18
6537,236.39
6538,236.91
6539,237.58
6540,238.43
6541,239.41
6542,240.51
6543,241.39
6544,242.10
6545,242.52
6546,243.13
6547,243.77
6548,244.54
6549,245.21
6550,246.22
6551,247.62
6552,249.45
6553,251.34
6554,253.23
6555,255.13
6556,257.20
6557,259.09
6558,260.62
6559,261.51
6560,262.15
6561,262.57
6562,263.00
6563,263.18
6564,263.31
6565,263.52
6566,264.16
6567,265.08
6568,266.11
6569,267.09
6570,268.16
6571,269.32
6572,270.48
6573,271.45
6574,272.25
6575,272.92
6576,273.62
6577,274.32
6578,275.12
6579,275.82
6580,276.43
6581,276.86
6582,277.37
6583,278.08
6584,279.05
6585,280.03
6586,280.67
6587,280.94
6588,280.91
6589,280.61
6590,280.09
6591,279.42
6592,278.66
6593,277.89
6594,277.13
6595,276.46
6596,275.97
6597,275.73
6598,275.51
6599,275.33
6600,275.09
6601,274.84
6602,274.48
6603,274.02
6604,273.59
6605,273.38
6606,273.19
6607,272.98
6608,272.55
6609,272.13
6610,271.61
6611,270.90
6612,269.78
6613,268.37
6614,266.85
6615,265.41
6616,263.92
6617,262.51
6618,261.26
6619,260.31
6620,259.55
6621,258.85
6622,258.12
6623,257.42
6624,256.71
6625,256.01
6626,255.22
6627,254.52
6628,254.03
6629,253.78
6630,253.60
6631,253.42
6632,253.17
6633,252.90
6634,252.62
6635,252.41
6636,252.29
6637,252.29
6638,252.29
6639,252.29
6640,252.38
6641,252.62
6642,252.96
6643,253.23
6644,253.30
6645,253.02
6646,252.47
6647,251.77
6648,251.04
6649,250.31
6650,249.48
6651,248.78
6652,248.41
6653,248.41
6654,248.57
6655,248.60
6656,248.38
6657,248.17
6658,247.96
6659,247.71
6660,247.25
6661,246.83
6662,246.55
6663,246.52
6664,246.58
6665,246.61
6666,246.67
6667,246.64
6668,246.40
6669,245.94
6670,245.42
6671,245.15
6672,245.21
6673,245.48
6674,245.82
6675,246.06
6676,246.15
6677,246.15
6678,246.15
6679,246.15
6680,246.06
6681,245.85
6682,245.45
6683,244.96
6684,244.45
6685,243.96
6686,243.59
6687,243.32
6688,243.19
6689,243.19
6690,243.38
6691,243.62
6692,243.87
6693,244.08
6694,244.38
6695,244.84
6696,245.51
6697,246.22
6698,246.95
6699,247.68
6700,248.44
6701,249.15
6702,249.69
6703,249.94
6704,249.88
6705,249.63
6706,249.30
6707,248.78
6708,248.20
6709,247.71
6710,247.50
6711,247.47
6712,247.53
6713,247.53
6714,247.62
6715,247.83
6716,248.17
6717,248.41
6718,248.57
6719,248.78
6720,249.27
6721,249.97
6722,250.82
6723,251.80
6724,252.90
6725,254.06
6726,255.25
6727,256.23
6728,256.96
6729,257.39
6730,257.72
6731,257.93
6732,258.18
6733,258.39
6734,258.61
6735,258.88
6736,259.16
6737,259.37
6738,259.46
6739,259.49
6740,259.52
6741,259.52
6742,259.25
6743,258.79
6744,258.36
6745,258.15
6746,257.87
6747,257.42
6748,256.74
6749,256.01
6750,255.28
6751,254.64
6752,253.85
6753,252.87
6754,251.65
6755,250.49
6756,249.51
6757,248.78
6758,248.17
6759,247.71
6760,247.50
6761,247.53
6762,247.41
6763,246.95
6764,246.22
6765,245.48
6766,244.87
6767,244.42
6768,243.99
6769,243.80
6770,243.87
6771,244.11
6772,244.17
6773,243.99
6774,243.62
6775,243.07
6776,242.31
6777,241.36
6778,240.54
6779,240.05
6780,239.84
6781,239.87
6782,240.11
6783,240.57
6784,241.18
6785,241.67
6786,241.88
6787,241.88
6788,241.82
6789,241.82
6790,241.85
6791,241.85
6792,241.85
6793,241.82
6794,241.85
6795,241.85
6796,241.82
6797,241.82
6798,241.88
6799,241.88
6800,241.73
6801,241.49
6802,241.33
6803,241.33
6804,241.42
6805,241.39
6806,241.30
6807,241.30
6808,241.55
6809,242.03
6810,242.55
6811,243.04
6812,243.53
6813,243.99
6814,244.35
6815,244.63
6816,244.84
6817,245.03
6818,245.27
6819,245.51
6820,245.85
6821,246.31
6822,246.89
6823,247.38
6824,247.68
6825,247.68
6826,247.34
6827,246.89
6828,246.40
6829,245.91
6830,245.30
6831,244.60
6832,243.93
6833,243.44
6834,243.04
6835,242.61
6836,242.00
6837,241.27
6838,240.45
6839,239.75
6840,239.26
6841,239.04
6842,238.95
6843,238.95
6844,239.04
6845,239.29
6846,239.62
6847,239.87
6848,239.93
6849,239.93
6850,240.05
6851,240.26
6852,240.45
6853,240.45
6854,240.39
6855,240.39
6856,240.42
6857,240.42
6858,240.39
6859,240.39
6860,240.42
6861,240.42
6862,240.36
6863,240.36
6864,240.51
6865,240.75
6866,240.94
6867,240.94
6868,240.88
6869,240.88
6870,240.88
6871,240.91
6872,240.91
6873,240.88
6874,240.84
6875,240.88
6876,240.97
6877,240.94
6878,240.72
6879,240.48
6880,240.45
6881,240.69
6882,241.00
6883,241.30
6884,241.52
6885,241.73
6886,241.85
6887,241.88
6888,241.85
6889,241.82
6890,241.79
6891,241.82
6892,241.94
6893,242.16
6894,242.40
6895,242.68
6896,242.98
6897,243.19
6898,243.19
6899,242.98
6900,242.68
6901,242.40
6902,242.19
6903,241.94
6904,241.79
6905,241.79
6906,241.85
6907,241.88
6908,241.76
6909,241.52
6910,241.21
6911,240.97
6912,240.84
6913,240.88
6914,240.91
6915,240.91
6916,240.88
6917,240.88
6918,240.91
6919,240.91
6920,240.88
6921,240.84
6922,240.97
6923,241.24
6924,241.55
6925,241.76
6926,241.85
6927,241.88
6928,241.82
6929,241.58
6930,241.03
6931,240.30
6932,239.75
6933,239.47
6934,239.38
6935,239.41
6936,239.62
6937,240.08
6938,240.66
6939,241.18
6940,241.58
6941,241.76
6942,241.82
6943,241.85
6944,241.91
6945,241.88
6946,241.70
6947,241.49
6948,241.42
6949,241.39
6950,241.21
6951,240.72
6952,240.14
6953,239.65
6954,239.20
6955,238.74
6956,238.34
6957,238.04
6958,238.01
6959,238.28
6960,238.86
6961,239.59
6962,240.20
6963,240.69
6964,241.15
6965,241.64
6966,241.94
6967,241.94
6968,241.70
6969,241.46
6970,241.42
6971,241.39
6972,241.24
6973,241.03
6974,240.91
6975,240.91
6976,240.72
6977,240.26
6978,239.65
6979,239.17
6980,238.86
6981,238.62
6982,238.37
6983,238.13
6984,237.98
6985,237.98
6986,238.04
6987,238.07
6988,237.98
6989,237.70
6990,237.37
6991,237.15
6992,237.09
6993,237.09
6994,236.97
6995,236.76
6996,236.57
6997,236.60
6998,236.57
6999,236.36
7000,235.87
7001,235.38
7002,235.05
7003,234.83
7004,234.47
7005,234.01
7006,233.55
7007,233.31
7008,233.22
7009,233.25
7010,233.28
7011,233.28
7012,233.25
7013,233.25
7014,233.28
7015,233.28
7016,233.18
7017,232.94
7018,232.67
7019,232.39
7020,232.24
7021,232.24
7022,232.42
7023,232.70
7024,232.88
7025,232.88
7026,232.67
7027,232.45
7028,232.24
7029,231.99
7030,231.63
7031,231.14
7032,230.71
7033,230.50
7034,230.32
7035,230.10
7036,229.80
7037,229.55
7038,229.43
7039,229.46
7040,229.46
7041,229.22
7042,228.64
7043,227.94
7044,227.26
7045,226.78
7046,226.41
7047,226.20
7048,226.14
7049,226.38
7050,226.84
7051,227.36
7052,227.66
7053,227.66
7054,227.36
7055,226.90
7056,226.32
7057,225.83
7058,225.52
7059,225.56
7060,225.86
7061,226.35
7062,226.81
7063,227.08
7064,227.05
7065,226.84
7066,226.35
7067,225.59
7068,224.70
7069,224.00
7070,223.63
7071,223.63
7072,223.75
7073,223.79
7074,223.69
7075,223.42
7076,223.05
7077,222.56
7078,222.14
7079,221.86
7080,221.86
7081,222.14
7082,222.60
7083,223.05
7084,223.42
7085,223.66
7086,223.82
7087,223.82
7088,223.57
7089,223.08
7090,222.53
7091,222.05
7092,221.68
7093,221.44
7094,221.31
7095,221.34
7096,221.41
7097,221.41
7098,221.22
7099,221.01
7100,220.89
7101,220.89
7102,220.79
7103,220.55
7104,220.34
7105,220.34
7106,220.49
7107,220.76
7108,221.04
7109,221.28
7110,221.41
7111,221.41
7112,221.25
7113,221.04
7114,220.79
7115,220.52
7116,220.25
7117,220.03
7118,219.97
7119,219.94
7120,219.85
7121,219.64
7122,219.36
7123,219.09
7124,218.81
7125,218.60
7126,218.48
7127,218.48
7128,218.51
7129,218.54
7130,218.54
7131,218.51
7132,218.48
7133,218.51
7134,218.60
7135,218.81
7136,219.09
7137,219.36
7138,219.64
7139,219.85
7140,219.97
7141,219.97
7142,219.97
7143,219.97
7144,219.85
7145,219.60
7146,219.36
7147,219.36
7148,219.60
7149,219.85
7150,219.97
7151,219.94
7152,220.03
7153,220.28
7154,220.49
7155,220.49
7156,220.31
7157,220.06
7158,219.91
7159,219.88
7160,220.00
7161,220.25
7162,220.67
7163,221.13
7164,221.50
7165,221.77
7166,222.02
7167,222.26
7168,222.29
7169,222.08
7170,221.65
7171,221.13
7172,220.64
7173,220.18
7174,219.79
7175,219.54
7176,219.39
7177,219.42
7178,219.57
7179,219.82
7180,220.03
7181,220.31
7182,220.58
7183,220.83
7184,220.89
7185,220.64
7186,220.15
7187,219.70
7188,219.27
7189,219.57
7190,218.69
7191,216.83
7192,215.18
7193,214.60
7194,218.23
7195,222.08
7196,214.94
7197,199.04
7198,200.32
7199,241.18
7200,235.72
