1,-116.83
2,-155.89
3,-132.60
4,-76.93
5,-27.80
6,7.40
7,39.57
8,69.54
9,88.00
10,91.64
11,83.66
12,68.29
13,47.64
14,25.63
15,5.63
16,-7.53
17,-12.46
18,-7.51
19,5.83
20,25.41
21,47.96
22,69.78
23,88.23
24,100.72
25,106.62
26,105.38
27,97.88
28,85.01
29,68.41
30,50.02
31,31.85
32,15.90
33,3.63
34,-4.13
35,-7.22
36,-6.66
37,-3.54
38,0.11
39,3.42
40,5.11
41,5.59
42,4.90
43,4.14
44,3.68
45,4.08
46,5.21
47,6.79
48,8.43
49,9.69
50,10.41
51,10.49
52,10.12
53,9.49
54,8.84
55,8.29
56,7.91
57,7.70
58,7.71
59,7.87
60,8.18
61,8.51
62,8.83
63,9.13
64,9.40
65,9.61
66,9.77
67,9.91
68,10.10
69,10.37
70,10.69
71,10.99
72,11.24
73,11.39
74,11.45
75,11.41
76,11.30
77,11.12
78,10.89
79,10.64
80,10.41
81,10.21
82,10.03
83,9.86
84,9.75
85,9.73
86,9.82
87,9.99
88,10.22
89,10.46
90,10.73
91,10.96
92,11.09
93,11.09
94,11.05
95,11.03
96,11.10
97,11.25
98,11.52
99,11.90
100,12.37
101,12.87
102,13.30
103,13.60
104,13.75
105,13.72
106,13.50
107,13.18
108,12.77
109,12.32
110,11.81
111,11.25
112,10.65
113,10.02
114,9.35
115,8.69
116,8.11
117,7.66
118,7.32
119,7.09
120,6.96
121,6.94
122,6.96
123,7.02
124,7.13
125,7.31
126,7.55
127,7.81
128,8.12
129,8.44
130,8.80
131,9.15
132,9.51
133,9.83
134,10.16
135,10.51
136,10.92
137,11.35
138,11.85
139,12.35
140,12.89
141,13.41
142,13.97
143,14.47
144,14.89
145,15.22
146,15.50
147,15.69
148,15.82
149,15.87
150,15.92
151,15.94
152,15.92
153,15.86
154,15.81
155,15.77
156,15.75
157,15.72
158,15.71
159,15.74
160,15.81
161,15.90
162,15.99
163,16.09
164,16.17
165,16.20
166,16.14
167,15.99
168,15.77
169,15.54
170,15.28
171,15.02
172,14.73
173,14.47
174,14.24
175,14.05
176,13.79
177,13.51
178,13.13
179,12.74
180,12.25
181,11.74
182,11.11
183,10.44
184,9.65
185,8.81
186,7.84
187,6.84
188,5.78
189,4.79
190,3.80
191,2.90
192,1.99
193,1.19
194,0.36
195,-0.41
196,-1.30
197,-2.21
198,-3.29
199,-4.40
200,-5.66
201,-6.94
202,-8.32
203,-9.66
204,-10.96
205,-12.04
206,-12.92
207,-13.47
208,-13.79
209,-13.85
210,-13.78
211,-13.62
212,-13.47
213,-13.37
214,-13.36
215,-13.40
216,-13.41
217,-13.30
218,-12.96
219,-12.43
220,-11.74
221,-11.02
222,-10.31
223,-9.75
224,-9.36
225,-9.23
226,-9.27
227,-9.45
228,-9.61
229,-9.75
230,-9.77
231,-9.73
232,-9.57
233,-9.35
234,-8.99
235,-8.56
236,-8.02
237,-7.43
238,-6.72
239,-5.94
240,-5.03
241,-4.12
242,-3.16
243,-2.28
244,-1.44
245,-0.75
246,-0.11
247,0.43
248,1.01
249,1.61
250,2.33
251,3.07
252,3.83
253,4.48
254,5.00
255,5.35
256,5.58
257,5.68
258,5.71
259,5.66
260,5.65
261,5.70
262,5.85
263,6.06
264,6.32
265,6.56
266,6.74
267,6.79
268,6.74
269,6.61
270,6.47
271,6.38
272,6.39
273,6.51
274,6.68
275,6.87
276,7.06
277,7.21
278,7.25
279,7.13
280,6.90
281,6.61
282,6.35
283,6.13
284,6.03
285,6.03
286,6.13
287,6.28
288,6.44
289,6.53
290,6.51
291,6.35
292,6.11
293,5.83
294,5.57
295,5.36
296,5.25
297,5.26
298,5.46
299,5.78
300,6.25
301,6.77
302,7.37
303,7.95
304,8.56
305,9.14
306,9.77
307,10.37
308,11.04
309,11.70
310,12.45
311,13.17
312,13.94
313,14.69
314,15.56
315,16.43
316,17.35
317,18.26
318,19.26
319,20.22
320,21.15
321,21.88
322,22.51
323,22.95
324,23.32
325,23.60
326,23.94
327,24.34
328,24.83
329,25.34
330,25.86
331,26.31
332,26.63
333,26.75
334,26.66
335,26.41
336,26.08
337,25.74
338,25.47
339,25.31
340,25.18
341,25.09
342,24.90
343,24.61
344,24.15
345,23.56
346,22.86
347,22.17
348,21.51
349,20.99
350,20.59
351,20.30
352,20.01
353,19.70
354,19.33
355,18.95
356,18.51
357,18.10
358,17.76
359,17.59
360,17.54
361,17.62
362,17.72
363,17.80
364,17.75
365,17.59
366,17.27
367,16.85
368,16.33
369,15.78
370,15.17
371,14.59
372,13.98
373,13.36
374,12.69
375,12.02
376,11.30
377,10.59
378,9.86
379,9.22
380,8.66
381,8.29
382,8.01
383,7.86
384,7.73
385,7.65
386,7.55
387,7.47
388,7.38
389,7.33
390,7.32
391,7.35
392,7.38
393,7.41
394,7.47
395,7.52
396,7.55
397,7.51
398,7.48
399,7.45
400,7.41
401,7.35
402,7.30
403,7.32
404,7.45
405,7.66
406,7.95
407,8.25
408,8.51
409,8.68
410,8.77
411,8.74
412,8.58
413,8.32
414,8.09
415,7.96
416,8.00
417,8.20
418,8.59
419,9.09
420,9.70
421,10.32
422,10.95
423,11.56
424,12.25
425,13.01
426,13.88
427,14.77
428,15.69
429,16.49
430,17.24
431,17.83
432,18.33
433,18.69
434,19.01
435,19.32
436,19.78
437,20.36
438,21.06
439,21.74
440,22.42
441,22.99
442,23.39
443,23.56
444,23.54
445,23.41
446,23.29
447,23.22
448,23.21
449,23.25
450,23.35
451,23.45
452,23.41
453,23.19
454,22.74
455,22.19
456,21.48
457,20.71
458,19.74
459,18.71
460,17.60
461,16.52
462,15.36
463,14.22
464,13.05
465,11.96
466,10.86
467,9.85
468,8.84
469,7.97
470,7.13
471,6.42
472,5.73
473,5.19
474,4.68
475,4.33
476,4.01
477,3.74
478,3.36
479,2.91
480,2.27
481,1.54
482,0.69
483,-0.14
484,-0.93
485,-1.58
486,-2.10
487,-2.43
488,-2.69
489,-2.87
490,-3.12
491,-3.43
492,-3.86
493,-4.31
494,-4.78
495,-5.16
496,-5.43
497,-5.58
498,-5.63
499,-5.62
500,-5.59
501,-5.56
502,-5.55
503,-5.58
504,-5.65
505,-5.68
506,-5.64
507,-5.49
508,-5.22
509,-4.84
510,-4.33
511,-3.72
512,-2.97
513,-2.20
514,-1.41
515,-0.75
516,-0.14
517,0.37
518,0.91
519,1.42
520,2.03
521,2.69
522,3.54
523,4.47
524,5.50
525,6.44
526,7.32
527,8.05
528,8.71
529,9.28
530,9.90
531,10.53
532,11.27
533,12.03
534,12.84
535,13.58
536,14.25
537,14.75
538,15.09
539,15.25
540,15.33
541,15.34
542,15.37
543,15.40
544,15.43
545,15.43
546,15.38
547,15.29
548,15.17
549,15.06
550,14.94
551,14.85
552,14.81
553,14.78
554,14.70
555,14.56
556,14.35
557,14.05
558,13.63
559,13.13
560,12.58
561,12.07
562,11.60
563,11.22
564,10.93
565,10.75
566,10.67
567,10.75
568,10.94
569,11.23
570,11.47
571,11.60
572,11.58
573,11.44
574,11.14
575,10.72
576,10.22
577,9.74
578,9.33
579,9.05
580,8.80
581,8.58
582,8.31
583,8.04
584,7.79
585,7.61
586,7.51
587,7.48
588,7.50
589,7.55
590,7.55
591,7.44
592,7.13
593,6.66
594,6.05
595,5.42
596,4.80
597,4.26
598,3.85
599,3.58
600,3.45
601,3.43
602,3.45
603,3.48
604,3.52
605,3.60
606,3.77
607,4.01
608,4.30
609,4.59
610,4.92
611,5.24
612,5.55
613,5.81
614,6.10
615,6.42
616,6.91
617,7.53
618,8.34
619,9.22
620,10.17
621,11.02
622,11.79
623,12.37
624,12.83
625,13.17
626,13.50
627,13.81
628,14.18
629,14.52
630,14.88
631,15.20
632,15.50
633,15.73
634,15.89
635,15.94
636,15.95
637,15.93
638,15.96
639,16.01
640,16.12
641,16.27
642,16.46
643,16.66
644,16.90
645,17.16
646,17.50
647,17.91
648,18.38
649,18.91
650,19.45
651,19.96
652,20.34
653,20.56
654,20.62
655,20.52
656,20.24
657,19.84
658,19.37
659,18.89
660,18.33
661,17.72
662,17.09
663,16.49
664,15.85
665,15.22
666,14.56
667,14.01
668,13.48
669,13.03
670,12.56
671,12.13
672,11.67
673,11.24
674,10.76
675,10.27
676,9.70
677,9.16
678,8.58
679,8.06
680,7.53
681,7.03
682,6.51
683,6.01
684,5.51
685,5.04
686,4.57
687,4.17
688,3.80
689,3.54
690,3.34
691,3.20
692,3.07
693,2.96
694,2.85
695,2.75
696,2.70
697,2.72
698,2.88
699,3.17
700,3.62
701,4.20
702,4.83
703,5.43
704,5.96
705,6.38
706,6.69
707,6.87
708,6.89
709,6.74
710,6.45
711,6.04
712,5.61
713,5.18
714,4.82
715,4.58
716,4.49
717,4.54
718,4.72
719,5.00
720,5.36
721,5.71
722,6.01
723,6.24
724,6.49
725,6.77
726,7.13
727,7.51
728,7.99
729,8.54
730,9.19
731,9.85
732,10.50
733,11.02
734,11.42
735,11.67
736,11.89
737,12.04
738,12.22
739,12.42
740,12.73
741,13.13
742,13.63
743,14.14
744,14.66
745,15.14
746,15.53
747,15.79
748,15.96
749,16.04
750,16.08
751,16.11
752,16.17
753,16.27
754,16.46
755,16.69
756,16.99
757,17.32
758,17.68
759,18.07
760,18.45
761,18.78
762,19.06
763,19.27
764,19.39
765,19.39
766,19.24
767,18.94
768,18.53
769,18.05
770,17.53
771,17.02
772,16.55
773,16.14
774,15.75
775,15.43
776,15.16
777,14.96
778,14.78
779,14.63
780,14.53
781,14.50
782,14.53
783,14.60
784,14.65
785,14.63
786,14.49
787,14.28
788,14.04
789,13.79
790,13.57
791,13.40
792,13.39
793,13.53
794,13.85
795,14.24
796,14.66
797,15.08
798,15.50
799,15.88
800,16.22
801,16.52
802,16.82
803,17.14
804,17.48
805,17.77
806,18.07
807,18.36
808,18.67
809,18.97
810,19.23
811,19.44
812,19.58
813,19.65
814,19.62
815,19.53
816,19.39
817,19.24
818,19.10
819,19.02
820,18.97
821,18.92
822,18.78
823,18.49
824,18.00
825,17.34
826,16.55
827,15.74
828,14.98
829,14.39
830,13.97
831,13.75
832,13.63
833,13.59
834,13.53
835,13.48
836,13.40
837,13.32
838,13.21
839,13.13
840,13.06
841,13.04
842,13.02
843,12.97
844,12.83
845,12.60
846,12.25
847,11.87
848,11.45
849,11.10
850,10.80
851,10.61
852,10.45
853,10.32
854,10.12
855,9.83
856,9.40
857,8.87
858,8.24
859,7.58
860,6.93
861,6.40
862,6.01
863,5.81
864,5.74
865,5.75
866,5.78
867,5.79
868,5.71
869,5.55
870,5.24
871,4.83
872,4.30
873,3.77
874,3.27
875,2.85
876,2.49
877,2.24
878,2.07
879,1.98
880,1.90
881,1.83
882,1.75
883,1.66
884,1.50
885,1.27
886,0.98
887,0.71
888,0.47
889,0.26
890,0.08
891,-0.07
892,-0.20
893,-0.30
894,-0.31
895,-0.24
896,-0.01
897,0.37
898,0.93
899,1.59
900,2.30
901,2.98
902,3.65
903,4.25
904,4.89
905,5.49
906,6.15
907,6.81
908,7.61
909,8.45
910,9.40
911,10.28
912,11.12
913,11.81
914,12.44
915,12.92
916,13.35
917,13.71
918,14.17
919,14.71
920,15.43
921,16.22
922,17.13
923,18.01
924,18.87
925,19.55
926,20.04
927,20.33
928,20.48
929,20.50
930,20.44
931,20.32
932,20.16
933,19.98
934,19.78
935,19.51
936,19.16
937,18.77
938,18.39
939,18.07
940,17.76
941,17.49
942,17.25
943,17.05
944,16.85
945,16.62
946,16.32
947,16.02
948,15.76
949,15.59
950,15.47
951,15.42
952,15.42
953,15.49
954,15.56
955,15.60
956,15.57
957,15.51
958,15.44
959,15.42
960,15.41
961,15.42
962,15.41
963,15.38
964,15.30
965,15.16
966,14.92
967,14.56
968,14.08
969,13.53
970,13.01
971,12.59
972,12.30
973,12.12
974,12.04
975,12.05
976,12.12
977,12.24
978,12.37
979,12.54
980,12.71
981,12.89
982,13.02
983,13.13
984,13.18
985,13.18
986,13.08
987,12.91
988,12.69
989,12.44
990,12.15
991,11.83
992,11.49
993,11.18
994,10.94
995,10.76
996,10.67
997,10.66
998,10.77
999,11.00
1000,11.38
1001,11.89
1002,12.48
1003,13.11
1004,13.76
1005,14.38
1006,14.98
1007,15.50
1008,16.02
1009,16.49
1010,16.95
1011,17.41
1012,17.96
1013,18.59
1014,19.28
1015,19.93
1016,20.53
1017,21.03
1018,21.45
1019,21.69
1020,21.69
1021,21.45
1022,21.04
1023,20.58
1024,20.14
1025,19.74
1026,19.45
1027,19.30
1028,19.29
1029,19.36
1030,19.41
1031,19.37
1032,19.15
1033,18.81
1034,18.32
1035,17.75
1036,17.11
1037,16.48
1038,15.91
1039,15.48
1040,15.11
1041,14.76
1042,14.37
1043,13.96
1044,13.53
1045,13.15
1046,12.77
1047,12.45
1048,12.19
1049,12.02
1050,11.89
1051,11.81
1052,11.74
1053,11.68
1054,11.60
1055,11.55
1056,11.56
1057,11.67
1058,11.89
1059,12.17
1060,12.46
1061,12.70
1062,12.86
1063,12.89
1064,12.79
1065,12.61
1066,12.39
1067,12.18
1068,11.99
1069,11.84
1070,11.73
1071,11.60
1072,11.46
1073,11.25
1074,10.97
1075,10.64
1076,10.28
1077,9.94
1078,9.70
1079,9.61
1080,9.67
1081,9.90
1082,10.23
1083,10.62
1084,11.02
1085,11.38
1086,11.69
1087,11.95
1088,12.18
1089,12.38
1090,12.62
1091,12.87
1092,13.18
1093,13.54
1094,13.98
1095,14.43
1096,14.94
1097,15.44
1098,16.00
1099,16.53
1100,17.01
1101,17.43
1102,17.81
1103,18.13
1104,18.39
1105,18.54
1106,18.61
1107,18.60
1108,18.54
1109,18.42
1110,18.23
1111,18.00
1112,17.72
1113,17.40
1114,16.99
1115,16.53
1116,15.95
1117,15.30
1118,14.56
1119,13.81
1120,13.09
1121,12.50
1122,12.02
1123,11.67
1124,11.41
1125,11.22
1126,11.00
1127,10.78
1128,10.51
1129,10.25
1130,9.96
1131,9.67
1132,9.37
1133,9.14
1134,8.95
1135,8.82
1136,8.65
1137,8.43
1138,8.09
1139,7.67
1140,7.17
1141,6.71
1142,6.28
1143,5.92
1144,5.59
1145,5.34
1146,5.15
1147,5.00
1148,4.82
1149,4.59
1150,4.33
1151,4.09
1152,3.85
1153,3.65
1154,3.50
1155,3.45
1156,3.45
1157,3.49
1158,3.51
1159,3.48
1160,3.40
1161,3.25
1162,3.03
1163,2.75
1164,2.47
1165,2.22
1166,2.05
1167,1.96
1168,1.95
1169,2.01
1170,2.14
1171,2.31
1172,2.53
1173,2.73
1174,2.96
1175,3.21
1176,3.56
1177,4.00
1178,4.58
1179,5.23
1180,5.95
1181,6.66
1182,7.37
1183,7.95
1184,8.42
1185,8.70
1186,8.90
1187,9.06
1188,9.27
1189,9.53
1190,9.89
1191,10.26
1192,10.66
1193,10.98
1194,11.25
1195,11.41
1196,11.52
1197,11.60
1198,11.75
1199,12.00
1200,12.41
1201,12.92
1202,13.51
1203,14.07
1204,14.58
1205,14.96
1206,15.24
1207,15.40
1208,15.52
1209,15.63
1210,15.82
1211,16.11
1212,16.50
1213,16.92
1214,17.36
1215,17.71
1216,17.95
1217,18.07
1218,18.10
1219,18.10
1220,18.08
1221,18.08
1222,18.11
1223,18.17
1224,18.24
1225,18.27
1226,18.23
1227,18.12
1228,17.92
1229,17.65
1230,17.32
1231,17.01
1232,16.82
1233,16.78
1234,16.91
1235,17.17
1236,17.49
1237,17.85
1238,18.18
1239,18.43
1240,18.56
1241,18.57
1242,18.41
1243,18.14
1244,17.79
1245,17.43
1246,17.08
1247,16.75
1248,16.46
1249,16.22
1250,16.05
1251,15.93
1252,15.82
1253,15.72
1254,15.59
1255,15.46
1256,15.34
1257,15.26
1258,15.21
1259,15.21
1260,15.24
1261,15.34
1262,15.49
1263,15.66
1264,15.84
1265,15.99
1266,16.14
1267,16.25
1268,16.33
1269,16.38
1270,16.46
1271,16.58
1272,16.74
1273,16.90
1274,17.13
1275,17.42
1276,17.81
1277,18.22
1278,18.65
1279,19.07
1280,19.50
1281,19.94
1282,20.39
1283,20.81
1284,21.22
1285,21.62
1286,22.05
1287,22.42
1288,22.79
1289,23.07
1290,23.32
1291,23.49
1292,23.61
1293,23.65
1294,23.73
1295,23.85
1296,24.12
1297,24.51
1298,25.02
1299,25.62
1300,26.28
1301,26.90
1302,27.45
1303,27.86
1304,28.14
1305,28.25
1306,28.23
1307,28.10
1308,27.98
1309,27.91
1310,27.92
1311,28.00
1312,28.18
1313,28.42
1314,28.69
1315,28.89
1316,29.05
1317,29.13
1318,29.17
1319,29.21
1320,29.24
1321,29.30
1322,29.38
1323,29.49
1324,29.53
1325,29.55
1326,29.49
1327,29.38
1328,29.14
1329,28.78
1330,28.20
1331,27.47
1332,26.54
1333,25.48
1334,24.25
1335,22.99
1336,21.65
1337,20.43
1338,19.20
1339,18.08
1340,16.90
1341,15.77
1342,14.56
1343,13.40
1344,12.14
1345,10.92
1346,9.66
1347,8.51
1348,7.40
1349,6.48
1350,5.67
1351,5.03
1352,4.46
1353,4.07
1354,3.80
1355,3.70
1356,3.62
1357,3.59
1358,3.56
1359,3.59
1360,3.63
1361,3.67
1362,3.69
1363,3.72
1364,3.75
1365,3.78
1366,3.83
1367,3.88
1368,3.94
1369,3.97
1370,3.97
1371,3.93
1372,3.91
1373,3.91
1374,3.91
1375,3.91
1376,3.94
1377,3.99
1378,4.08
1379,4.17
1380,4.27
1381,4.41
1382,4.64
1383,4.97
1384,5.39
1385,5.84
1386,6.27
1387,6.66
1388,7.03
1389,7.32
1390,7.52
1391,7.61
1392,7.63
1393,7.64
1394,7.72
1395,7.84
1396,7.99
1397,8.14
1398,8.27
1399,8.33
1400,8.31
1401,8.18
1402,7.99
1403,7.77
1404,7.58
1405,7.44
1406,7.32
1407,7.24
1408,7.16
1409,7.12
1410,7.04
1411,6.94
1412,6.72
1413,6.44
1414,6.04
1415,5.61
1416,5.09
1417,4.54
1418,3.91
1419,3.30
1420,2.65
1421,2.01
1422,1.31
1423,0.62
1424,-0.16
1425,-0.92
1426,-1.72
1427,-2.47
1428,-3.25
1429,-3.95
1430,-4.62
1431,-5.17
1432,-5.67
1433,-6.10
1434,-6.55
1435,-6.98
1436,-7.45
1437,-7.86
1438,-8.22
1439,-8.48
1440,-8.68
1441,-8.81
1442,-8.94
1443,-9.05
1444,-9.19
1445,-9.36
1446,-9.61
1447,-9.87
1448,-10.15
1449,-10.35
1450,-10.50
1451,-10.54
1452,-10.52
1453,-10.46
1454,-10.41
1455,-10.41
1456,-10.44
1457,-10.48
1458,-10.49
1459,-10.47
1460,-10.37
1461,-10.19
1462,-9.92
1463,-9.59
1464,-9.22
1465,-8.86
1466,-8.56
1467,-8.38
1468,-8.32
1469,-8.35
1470,-8.45
1471,-8.61
1472,-8.79
1473,-8.97
1474,-9.11
1475,-9.22
1476,-9.27
1477,-9.30
1478,-9.27
1479,-9.19
1480,-9.05
1481,-8.88
1482,-8.64
1483,-8.38
1484,-8.09
1485,-7.81
1486,-7.43
1487,-6.94
1488,-6.26
1489,-5.48
1490,-4.54
1491,-3.57
1492,-2.51
1493,-1.52
1494,-0.56
1495,0.28
1496,1.14
1497,1.91
1498,2.70
1499,3.38
1500,4.10
1501,4.78
1502,5.57
1503,6.35
1504,7.20
1505,8.05
1506,9.00
1507,9.93
1508,10.88
1509,11.73
1510,12.52
1511,13.14
1512,13.60
1513,13.85
1514,13.98
1515,14.00
1516,13.98
1517,13.88
1518,13.73
1519,13.55
1520,13.37
1521,13.19
1522,12.99
1523,12.75
1524,12.49
1525,12.25
1526,12.02
1527,11.78
1528,11.53
1529,11.26
1530,10.97
1531,10.64
1532,10.27
1533,9.91
1534,9.61
1535,9.44
1536,9.36
1537,9.37
1538,9.42
1539,9.54
1540,9.74
1541,9.98
1542,10.23
1543,10.44
1544,10.60
1545,10.67
1546,10.73
1547,10.79
1548,10.88
1549,10.99
1550,11.11
1551,11.20
1552,11.30
1553,11.38
1554,11.44
1555,11.47
1556,11.51
1557,11.54
1558,11.63
1559,11.73
1560,11.96
1561,12.31
1562,12.81
1563,13.34
1564,13.89
1565,14.42
1566,14.97
1567,15.45
1568,15.92
1569,16.36
1570,16.87
1571,17.37
1572,17.93
1573,18.46
1574,19.07
1575,19.73
1576,20.48
1577,21.21
1578,22.01
1579,22.83
1580,23.71
1581,24.51
1582,25.21
1583,25.76
1584,26.25
1585,26.59
1586,26.80
1587,26.87
1588,26.94
1589,27.01
1590,27.13
1591,27.28
1592,27.50
1593,27.79
1594,28.14
1595,28.44
1596,28.63
1597,28.69
1598,28.67
1599,28.60
1600,28.50
1601,28.38
1602,28.30
1603,28.27
1604,28.24
1605,28.18
1606,28.10
1607,28.02
1608,27.90
1609,27.73
1610,27.47
1611,27.15
1612,26.79
1613,26.50
1614,26.25
1615,26.05
1616,25.85
1617,25.65
1618,25.41
1619,25.15
1620,24.83
1621,24.45
1622,23.96
1623,23.41
1624,22.76
1625,22.09
1626,21.33
1627,20.57
1628,19.78
1629,19.07
1630,18.41
1631,17.90
1632,17.47
1633,17.19
1634,16.96
1635,16.80
1636,16.64
1637,16.47
1638,16.20
1639,15.85
1640,15.42
1641,14.98
1642,14.53
1643,14.14
1644,13.83
1645,13.63
1646,13.50
1647,13.44
1648,13.44
1649,13.47
1650,13.51
1651,13.57
1652,13.67
1653,13.82
1654,14.02
1655,14.25
1656,14.56
1657,14.93
1658,15.43
1659,15.99
1660,16.62
1661,17.24
1662,17.86
1663,18.40
1664,18.83
1665,19.05
1666,19.12
1667,19.07
1668,19.04
1669,19.05
1670,19.16
1671,19.33
1672,19.62
1673,19.93
1674,20.26
1675,20.56
1676,20.87
1677,21.16
1678,21.43
1679,21.67
1680,21.90
1681,22.10
1682,22.25
1683,22.29
1684,22.19
1685,21.99
1686,21.68
1687,21.36
1688,21.03
1689,20.75
1690,20.42
1691,20.03
1692,19.49
1693,18.84
1694,18.04
1695,17.17
1696,16.15
1697,15.16
1698,14.13
1699,13.18
1700,12.15
1701,11.14
1702,10.03
1703,8.96
1704,7.80
1705,6.73
1706,5.65
1707,4.72
1708,3.85
1709,3.13
1710,2.46
1711,1.91
1712,1.40
1713,1.01
1714,0.63
1715,0.36
1716,0.08
1717,-0.17
1718,-0.47
1719,-0.78
1720,-1.15
1721,-1.53
1722,-1.92
1723,-2.27
1724,-2.62
1725,-2.91
1726,-3.17
1727,-3.40
1728,-3.65
1729,-3.91
1730,-4.21
1731,-4.52
1732,-4.78
1733,-4.97
1734,-5.03
1735,-4.94
1736,-4.71
1737,-4.40
1738,-4.07
1739,-3.81
1740,-3.63
1741,-3.52
1742,-3.40
1743,-3.23
1744,-2.98
1745,-2.66
1746,-2.20
1747,-1.65
1748,-1.00
1749,-0.34
1750,0.34
1751,0.91
1752,1.42
1753,1.81
1754,2.23
1755,2.69
1756,3.27
1757,3.91
1758,4.68
1759,5.49
1760,6.42
1761,7.32
1762,8.26
1763,9.08
1764,9.83
1765,10.43
1766,10.99
1767,11.47
1768,11.99
1769,12.48
1770,13.00
1771,13.44
1772,13.79
1773,13.93
1774,13.87
1775,13.63
1776,13.28
1777,12.86
1778,12.47
1779,12.21
1780,12.13
1781,12.23
1782,12.37
1783,12.45
1784,12.41
1785,12.23
1786,11.86
1787,11.34
1788,10.80
1789,10.38
1790,10.13
1791,10.12
1792,10.26
1793,10.52
1794,10.76
1795,10.89
1796,10.84
1797,10.64
1798,10.27
1799,9.86
1800,9.45
1801,9.12
1802,8.86
1803,8.69
1804,8.58
1805,8.50
1806,8.37
1807,8.17
1808,7.87
1809,7.56
1810,7.19
1811,6.82
1812,6.39
1813,5.96
1814,5.45
1815,4.90
1816,4.23
1817,3.53
1818,2.77
1819,2.03
1820,1.30
1821,0.69
1822,0.17
1823,-0.20
1824,-0.53
1825,-0.83
1826,-1.22
1827,-1.65
1828,-2.20
1829,-2.82
1830,-3.52
1831,-4.21
1832,-4.85
1833,-5.39
1834,-5.83
1835,-6.11
1836,-6.25
1837,-6.26
1838,-6.17
1839,-6.01
1840,-5.75
1841,-5.43
1842,-5.11
1843,-4.81
1844,-4.46
1845,-4.07
1846,-3.62
1847,-3.17
1848,-2.65
1849,-2.10
1850,-1.50
1851,-0.95
1852,-0.36
1853,0.21
1854,0.84
1855,1.42
1856,2.01
1857,2.59
1858,3.24
1859,3.89
1860,4.55
1861,5.10
1862,5.60
1863,6.05
1864,6.58
1865,7.16
1866,7.83
1867,8.47
1868,9.14
1869,9.76
1870,10.33
1871,10.77
1872,11.09
1873,11.25
1874,11.34
1875,11.38
1876,11.50
1877,11.69
1878,12.02
1879,12.44
1880,12.91
1881,13.35
1882,13.76
1883,14.05
1884,14.22
1885,14.27
1886,14.31
1887,14.36
1888,14.45
1889,14.60
1890,14.83
1891,15.13
1892,15.44
1893,15.67
1894,15.71
1895,15.57
1896,15.24
1897,14.76
1898,14.16
1899,13.57
1900,13.01
1901,12.57
1902,12.18
1903,11.84
1904,11.47
1905,11.07
1906,10.56
1907,9.97
1908,9.29
1909,8.67
1910,8.13
1911,7.76
1912,7.47
1913,7.28
1914,7.11
1915,6.97
1916,6.79
1917,6.55
1918,6.27
1919,6.00
1920,5.78
1921,5.70
1922,5.73
1923,5.85
1924,6.03
1925,6.28
1926,6.58
1927,6.87
1928,7.11
1929,7.26
1930,7.37
1931,7.44
1932,7.51
1933,7.56
1934,7.68
1935,7.87
1936,8.19
1937,8.61
1938,9.12
1939,9.65
1940,10.19
1941,10.73
1942,11.29
1943,11.82
1944,12.31
1945,12.72
1946,13.11
1947,13.50
1948,13.86
1949,14.15
1950,14.41
1951,14.60
1952,14.78
1953,14.88
1954,14.98
1955,15.01
1956,15.09
1957,15.20
1958,15.40
1959,15.65
1960,16.01
1961,16.45
1962,17.02
1963,17.63
1964,18.28
1965,18.91
1966,19.55
1967,20.14
1968,20.65
1969,21.03
1970,21.33
1971,21.55
1972,21.77
1973,21.94
1974,22.11
1975,22.25
1976,22.37
1977,22.43
1978,22.43
1979,22.34
1980,22.17
1981,21.95
1982,21.74
1983,21.56
1984,21.42
1985,21.30
1986,21.19
1987,21.07
1988,20.94
1989,20.76
1990,20.52
1991,20.23
1992,19.88
1993,19.56
1994,19.24
1995,18.96
1996,18.64
1997,18.33
1998,17.96
1999,17.59
2000,17.14
2001,16.69
2002,16.14
2003,15.59
2004,14.97
2005,14.36
2006,13.72
2007,13.13
2008,12.56
2009,12.07
2010,11.62
2011,11.27
2012,10.96
2013,10.74
2014,10.56
2015,10.41
2016,10.25
2017,10.12
2018,10.02
2019,10.02
2020,10.09
2021,10.25
2022,10.46
2023,10.67
2024,10.83
2025,10.93
2026,10.97
2027,10.97
2028,10.89
2029,10.71
2030,10.47
2031,10.16
2032,9.80
2033,9.38
2034,8.95
2035,8.55
2036,8.22
2037,7.98
2038,7.86
2039,7.85
2040,7.97
2041,8.19
2042,8.48
2043,8.80
2044,9.14
2045,9.46
2046,9.81
2047,10.15
2048,10.51
2049,10.86
2050,11.28
2051,11.71
2052,12.18
2053,12.61
2054,13.09
2055,13.59
2056,14.13
2057,14.66
2058,15.23
2059,15.82
2060,16.45
2061,17.04
2062,17.59
2063,18.05
2064,18.48
2065,18.84
2066,19.11
2067,19.25
2068,19.29
2069,19.29
2070,19.29
2071,19.28
2072,19.26
2073,19.19
2074,19.16
2075,19.17
2076,19.26
2077,19.34
2078,19.45
2079,19.63
2080,19.92
2081,20.32
2082,20.85
2083,21.42
2084,22.01
2085,22.55
2086,23.01
2087,23.30
2088,23.45
2089,23.47
2090,23.43
2091,23.37
2092,23.31
2093,23.28
2094,23.30
2095,23.37
2096,23.42
2097,23.44
2098,23.34
2099,23.17
2100,22.88
2101,22.51
2102,21.97
2103,21.36
2104,20.66
2105,19.96
2106,19.18
2107,18.39
2108,17.56
2109,16.77
2110,15.93
2111,15.12
2112,14.27
2113,13.52
2114,12.79
2115,12.19
2116,11.62
2117,11.17
2118,10.73
2119,10.35
2120,9.84
2121,9.27
2122,8.57
2123,7.82
2124,7.00
2125,6.21
2126,5.46
2127,4.87
2128,4.42
2129,4.14
2130,3.95
2131,3.87
2132,3.84
2133,3.84
2134,3.85
2135,3.88
2136,3.97
2137,4.14
2138,4.42
2139,4.78
2140,5.23
2141,5.73
2142,6.27
2143,6.77
2144,7.24
2145,7.59
2146,7.84
2147,7.98
2148,8.06
2149,8.08
2150,8.06
2151,8.02
2152,8.04
2153,8.12
2154,8.30
2155,8.55
2156,8.96
2157,9.51
2158,10.25
2159,11.08
2160,12.01
2161,12.89
2162,13.73
2163,14.43
2164,15.07
2165,15.61
2166,16.15
2167,16.67
2168,17.27
2169,17.95
2170,18.75
2171,19.52
2172,20.20
2173,20.68
2174,20.95
2175,20.97
2176,20.77
2177,20.36
2178,19.85
2179,19.35
2180,18.91
2181,18.55
2182,18.23
2183,17.97
2184,17.78
2185,17.67
2186,17.52
2187,17.33
2188,17.07
2189,16.77
2190,16.40
2191,15.96
2192,15.45
2193,14.94
2194,14.44
2195,14.04
2196,13.74
2197,13.59
2198,13.54
2199,13.60
2200,13.66
2201,13.69
2202,13.63
2203,13.49
2204,13.28
2205,13.03
2206,12.76
2207,12.50
2208,12.28
2209,12.10
2210,11.92
2211,11.71
2212,11.50
2213,11.31
2214,11.16
2215,11.05
2216,10.98
2217,10.97
2218,11.02
2219,11.12
2220,11.25
2221,11.40
2222,11.55
2223,11.70
2224,11.85
2225,11.96
2226,12.05
2227,12.14
2228,12.25
2229,12.32
2230,12.40
2231,12.45
2232,12.57
2233,12.73
2234,12.95
2235,13.23
2236,13.58
2237,13.98
2238,14.44
2239,14.93
2240,15.44
2241,15.91
2242,16.30
2243,16.57
2244,16.75
2245,16.83
2246,16.80
2247,16.67
2248,16.56
2249,16.52
2250,16.58
2251,16.70
2252,16.88
2253,17.08
2254,17.30
2255,17.48
2256,17.59
2257,17.62
2258,17.59
2259,17.56
2260,17.56
2261,17.62
2262,17.72
2263,17.82
2264,17.88
2265,17.85
2266,17.71
2267,17.44
2268,17.05
2269,16.62
2270,16.24
2271,15.93
2272,15.72
2273,15.62
2274,15.59
2275,15.63
2276,15.66
2277,15.66
2278,15.64
2279,15.64
2280,15.64
2281,15.69
2282,15.75
2283,15.85
2284,15.91
2285,15.91
2286,15.85
2287,15.70
2288,15.46
2289,15.17
2290,14.83
2291,14.55
2292,14.27
2293,14.05
2294,13.80
2295,13.58
2296,13.31
2297,13.00
2298,12.56
2299,11.97
2300,11.20
2301,10.37
2302,9.51
2303,8.71
2304,7.96
2305,7.34
2306,6.86
2307,6.60
2308,6.52
2309,6.59
2310,6.73
2311,6.90
2312,6.99
2313,7.00
2314,6.87
2315,6.68
2316,6.40
2317,6.13
2318,5.90
2319,5.74
2320,5.69
2321,5.76
2322,5.91
2323,6.09
2324,6.27
2325,6.42
2326,6.53
2327,6.56
2328,6.50
2329,6.37
2330,6.23
2331,6.15
2332,6.11
2333,6.08
2334,6.04
2335,6.01
2336,6.02
2337,6.03
2338,6.07
2339,6.12
2340,6.27
2341,6.52
2342,6.90
2343,7.35
2344,7.88
2345,8.46
2346,9.14
2347,9.82
2348,10.52
2349,11.18
2350,11.91
2351,12.63
2352,13.43
2353,14.20
2354,14.95
2355,15.56
2356,16.05
2357,16.36
2358,16.61
2359,16.79
2360,17.01
2361,17.23
2362,17.56
2363,17.97
2364,18.45
2365,18.90
2366,19.30
2367,19.62
2368,19.90
2369,20.19
2370,20.56
2371,21.00
2372,21.48
2373,21.94
2374,22.34
2375,22.58
2376,22.60
2377,22.35
2378,21.91
2379,21.39
2380,20.89
2381,20.48
2382,20.15
2383,19.93
2384,19.72
2385,19.50
2386,19.15
2387,18.65
2388,17.97
2389,17.17
2390,16.27
2391,15.41
2392,14.62
2393,14.01
2394,13.52
2395,13.18
2396,12.89
2397,12.66
2398,12.44
2399,12.25
2400,11.99
2401,11.70
2402,11.37
2403,11.04
2404,10.73
2405,10.47
2406,10.25
2407,10.10
2408,10.02
2409,10.03
2410,10.09
2411,10.22
2412,10.35
2413,10.48
2414,10.55
2415,10.59
2416,10.58
2417,10.54
2418,10.50
2419,10.43
2420,10.38
2421,10.31
2422,10.25
2423,10.19
2424,10.16
2425,10.19
2426,10.30
2427,10.51
2428,10.80
2429,11.13
2430,11.47
2431,11.77
2432,12.02
2433,12.15
2434,12.18
2435,12.09
2436,11.94
2437,11.77
2438,11.67
2439,11.70
2440,11.90
2441,12.27
2442,12.74
2443,13.21
2444,13.65
2445,14.01
2446,14.31
2447,14.51
2448,14.61
2449,14.60
2450,14.56
2451,14.50
2452,14.52
2453,14.58
2454,14.71
2455,14.85
2456,15.00
2457,15.11
2458,15.24
2459,15.35
2460,15.44
2461,15.48
2462,15.46
2463,15.43
2464,15.39
2465,15.37
2466,15.35
2467,15.38
2468,15.46
2469,15.59
2470,15.72
2471,15.82
2472,15.82
2473,15.74
2474,15.52
2475,15.17
2476,14.69
2477,14.08
2478,13.39
2479,12.70
2480,12.08
2481,11.61
2482,11.25
2483,10.99
2484,10.82
2485,10.73
2486,10.66
2487,10.58
2488,10.46
2489,10.31
2490,10.12
2491,9.97
2492,9.92
2493,9.98
2494,10.13
2495,10.35
2496,10.60
2497,10.90
2498,11.22
2499,11.53
2500,11.78
2501,11.96
2502,12.07
2503,12.11
2504,12.05
2505,11.87
2506,11.53
2507,11.05
2508,10.49
2509,9.94
2510,9.48
2511,9.12
2512,8.87
2513,8.76
2514,8.75
2515,8.82
2516,8.88
2517,8.89
2518,8.81
2519,8.68
2520,8.54
2521,8.42
2522,8.37
2523,8.38
2524,8.51
2525,8.75
2526,9.12
2527,9.53
2528,9.95
2529,10.33
2530,10.74
2531,11.15
2532,11.55
2533,11.90
2534,12.27
2535,12.63
2536,13.05
2537,13.50
2538,14.02
2539,14.57
2540,15.17
2541,15.77
2542,16.37
2543,16.90
2544,17.34
2545,17.62
2546,17.81
2547,17.92
2548,18.04
2549,18.14
2550,18.27
2551,18.45
2552,18.74
2553,19.08
2554,19.46
2555,19.79
2556,20.09
2557,20.32
2558,20.47
2559,20.50
2560,20.43
2561,20.27
2562,20.06
2563,19.81
2564,19.59
2565,19.41
2566,19.28
2567,19.22
2568,19.26
2569,19.45
2570,19.73
2571,20.08
2572,20.38
2573,20.59
2574,20.68
2575,20.66
2576,20.51
2577,20.21
2578,19.75
2579,19.22
2580,18.66
2581,18.16
2582,17.67
2583,17.23
2584,16.82
2585,16.47
2586,16.11
2587,15.75
2588,15.32
2589,14.86
2590,14.26
2591,13.60
2592,12.83
2593,12.09
2594,11.34
2595,10.71
2596,10.14
2597,9.67
2598,9.23
2599,8.83
2600,8.39
2601,7.93
2602,7.38
2603,6.78
2604,6.17
2605,5.64
2606,5.20
2607,4.90
2608,4.76
2609,4.79
2610,4.97
2611,5.24
2612,5.57
2613,5.90
2614,6.23
2615,6.52
2616,6.79
2617,7.08
2618,7.45
2619,7.93
2620,8.49
2621,9.09
2622,9.72
2623,10.31
2624,10.84
2625,11.22
2626,11.49
2627,11.65
2628,11.79
2629,11.89
2630,12.04
2631,12.20
2632,12.44
2633,12.70
2634,12.98
2635,13.18
2636,13.35
2637,13.45
2638,13.54
2639,13.63
2640,13.76
2641,13.92
2642,14.16
2643,14.43
2644,14.72
2645,15.02
2646,15.34
2647,15.63
2648,15.88
2649,16.10
2650,16.29
2651,16.43
2652,16.52
2653,16.55
2654,16.54
2655,16.47
2656,16.34
2657,16.17
2658,15.99
2659,15.87
2660,15.78
2661,15.73
2662,15.70
2663,15.67
2664,15.60
2665,15.46
2666,15.22
2667,14.88
2668,14.48
2669,14.07
2670,13.69
2671,13.41
2672,13.23
2673,13.18
2674,13.28
2675,13.50
2676,13.73
2677,13.95
2678,14.11
2679,14.21
2680,14.19
2681,14.04
2682,13.79
2683,13.51
2684,13.27
2685,13.10
2686,12.98
2687,12.92
2688,12.91
2689,12.92
2690,12.89
2691,12.77
2692,12.55
2693,12.25
2694,11.89
2695,11.53
2696,11.21
2697,10.96
2698,10.83
2699,10.83
2700,10.96
2701,11.20
2702,11.51
2703,11.85
2704,12.18
2705,12.47
2706,12.74
2707,12.95
2708,13.08
2709,13.14
2710,13.15
2711,13.14
2712,13.18
2713,13.28
2714,13.52
2715,13.86
2716,14.36
2717,14.95
2718,15.63
2719,16.29
2720,16.88
2721,17.36
2722,17.72
2723,17.92
2724,17.99
2725,17.91
2726,17.80
2727,17.72
2728,17.77
2729,17.94
2730,18.26
2731,18.71
2732,19.28
2733,19.88
2734,20.45
2735,20.87
2736,21.12
2737,21.20
2738,21.14
2739,20.96
2740,20.69
2741,20.39
2742,20.10
2743,19.84
2744,19.56
2745,19.27
2746,18.94
2747,18.58
2748,18.19
2749,17.80
2750,17.41
2751,17.09
2752,16.84
2753,16.69
2754,16.63
2755,16.64
2756,16.69
2757,16.75
2758,16.78
2759,16.80
2760,16.77
2761,16.71
2762,16.59
2763,16.44
2764,16.31
2765,16.22
2766,16.15
2767,16.17
2768,16.27
2769,16.48
2770,16.72
2771,16.91
2772,16.98
2773,16.91
2774,16.61
2775,16.14
2776,15.50
2777,14.76
2778,13.91
2779,13.05
2780,12.21
2781,11.44
2782,10.68
2783,10.01
2784,9.42
2785,9.02
2786,8.73
2787,8.56
2788,8.44
2789,8.40
2790,8.38
2791,8.36
2792,8.25
2793,8.05
2794,7.76
2795,7.43
2796,7.07
2797,6.75
2798,6.49
2799,6.34
2800,6.26
2801,6.24
2802,6.25
2803,6.26
2804,6.19
2805,6.08
2806,5.94
2807,5.82
2808,5.68
2809,5.52
2810,5.31
2811,5.09
2812,4.87
2813,4.66
2814,4.49
2815,4.32
2816,4.23
2817,4.25
2818,4.46
2819,4.84
2820,5.36
2821,5.93
2822,6.54
2823,7.12
2824,7.71
2825,8.26
2826,8.89
2827,9.51
2828,10.21
2829,10.92
2830,11.73
2831,12.54
2832,13.37
2833,14.08
2834,14.70
2835,15.18
2836,15.62
2837,15.95
2838,16.32
2839,16.71
2840,17.21
2841,17.78
2842,18.42
2843,19.04
2844,19.62
2845,20.09
2846,20.49
2847,20.77
2848,20.99
2849,21.16
2850,21.37
2851,21.66
2852,22.03
2853,22.44
2854,22.80
2855,23.04
2856,23.09
2857,22.92
2858,22.52
2859,21.98
2860,21.35
2861,20.71
2862,20.14
2863,19.71
2864,19.36
2865,19.08
2866,18.73
2867,18.33
2868,17.85
2869,17.35
2870,16.75
2871,16.18
2872,15.63
2873,15.19
2874,14.78
2875,14.41
2876,14.04
2877,13.72
2878,13.39
2879,13.08
2880,12.73
2881,12.41
2882,12.09
2883,11.80
2884,11.49
2885,11.20
2886,10.93
2887,10.69
2888,10.48
2889,10.34
2890,10.28
2891,10.31
2892,10.38
2893,10.47
2894,10.59
2895,10.74
2896,10.90
2897,11.02
2898,11.09
2899,11.15
2900,11.22
2901,11.31
2902,11.42
2903,11.50
2904,11.58
2905,11.73
2906,12.00
2907,12.39
2908,12.83
2909,13.25
2910,13.65
2911,13.94
2912,14.07
2913,13.99
2914,13.72
2915,13.24
2916,12.63
2917,12.00
2918,11.51
2919,11.25
2920,11.25
2921,11.44
2922,11.80
2923,12.21
2924,12.60
2925,12.91
2926,13.15
2927,13.34
2928,13.51
2929,13.66
2930,13.85
2931,14.11
2932,14.47
2933,14.85
2934,15.23
2935,15.53
2936,15.76
2937,15.90
2938,15.95
2939,15.91
2940,15.87
2941,15.82
2942,15.81
2943,15.85
2944,15.97
2945,16.14
2946,16.32
2947,16.47
2948,16.64
2949,16.85
2950,17.04
2951,17.20
2952,17.32
2953,17.38
2954,17.35
2955,17.20
2956,16.94
2957,16.58
2958,16.14
2959,15.66
2960,15.17
2961,14.72
2962,14.31
2963,13.96
2964,13.66
2965,13.43
2966,13.22
2967,13.05
2968,12.89
2969,12.77
2970,12.70
2971,12.67
2972,12.66
2973,12.68
2974,12.65
2975,12.57
2976,12.40
2977,12.15
2978,11.89
2979,11.68
2980,11.54
2981,11.49
2982,11.48
2983,11.52
2984,11.57
2985,11.60
2986,11.56
2987,11.39
2988,11.06
2989,10.67
2990,10.28
2991,9.95
2992,9.69
2993,9.49
2994,9.32
2995,9.16
2996,9.01
2997,8.87
2998,8.73
2999,8.54
3000,8.32
3001,8.13
3002,8.09
3003,8.23
3004,8.54
3005,8.99
3006,9.61
3007,10.36
3008,11.14
3009,11.83
3010,12.44
3011,12.95
3012,13.44
3013,13.84
3014,14.23
3015,14.56
3016,14.95
3017,15.36
3018,15.83
3019,16.29
3020,16.79
3021,17.28
3022,17.83
3023,18.39
3024,18.97
3025,19.51
3026,19.99
3027,20.36
3028,20.67
3029,20.87
3030,21.03
3031,21.13
3032,21.24
3033,21.35
3034,21.51
3035,21.68
3036,21.86
3037,22.01
3038,22.16
3039,22.23
3040,22.24
3041,22.18
3042,22.11
3043,22.03
3044,21.98
3045,21.95
3046,22.00
3047,22.14
3048,22.38
3049,22.68
3050,23.04
3051,23.42
3052,23.81
3053,24.14
3054,24.39
3055,24.55
3056,24.60
3057,24.54
3058,24.36
3059,24.12
3060,23.86
3061,23.63
3062,23.40
3063,23.25
3064,23.09
3065,22.93
3066,22.63
3067,22.20
3068,21.59
3069,20.86
3070,19.91
3071,18.86
3072,17.68
3073,16.60
3074,15.56
3075,14.69
3076,13.89
3077,13.24
3078,12.58
3079,11.92
3080,11.09
3081,10.18
3082,9.09
3083,7.96
3084,6.77
3085,5.68
3086,4.70
3087,3.94
3088,3.30
3089,2.78
3090,2.30
3091,1.89
3092,1.52
3093,1.22
3094,1.02
3095,0.95
3096,1.05
3097,1.34
3098,1.90
3099,2.67
3100,3.61
3101,4.62
3102,5.73
3103,6.85
3104,7.97
3105,8.95
3106,9.82
3107,10.48
3108,11.03
3109,11.45
3110,11.88
3111,12.26
3112,12.73
3113,13.21
3114,13.84
3115,14.47
3116,15.11
3117,15.67
3118,16.26
3119,16.85
3120,17.53
3121,18.24
3122,19.05
3123,19.87
3124,20.70
3125,21.39
3126,21.93
3127,22.24
3128,22.35
3129,22.25
3130,22.04
3131,21.77
3132,21.55
3133,21.41
3134,21.35
3135,21.35
3136,21.35
3137,21.32
3138,21.29
3139,21.29
3140,21.31
3141,21.35
3142,21.38
3143,21.45
3144,21.53
3145,21.57
3146,21.48
3147,21.24
3148,20.87
3149,20.42
3150,19.91
3151,19.40
3152,18.94
3153,18.62
3154,18.45
3155,18.42
3156,18.46
3157,18.57
3158,18.71
3159,18.84
3160,18.83
3161,18.67
3162,18.34
3163,17.93
3164,17.40
3165,16.77
3166,16.05
3167,15.35
3168,14.67
3169,14.05
3170,13.42
3171,12.80
3172,12.20
3173,11.70
3174,11.28
3175,10.96
3176,10.70
3177,10.53
3178,10.41
3179,10.39
3180,10.41
3181,10.45
3182,10.47
3183,10.47
3184,10.45
3185,10.46
3186,10.47
3187,10.48
3188,10.44
3189,10.34
3190,10.22
3191,10.13
3192,10.12
3193,10.17
3194,10.28
3195,10.46
3196,10.76
3197,11.14
3198,11.57
3199,11.99
3200,12.42
3201,12.83
3202,13.18
3203,13.42
3204,13.58
3205,13.66
3206,13.69
3207,13.61
3208,13.51
3209,13.44
3210,13.48
3211,13.66
3212,13.98
3213,14.40
3214,14.86
3215,15.32
3216,15.73
3217,16.04
3218,16.18
3219,16.17
3220,16.08
3221,15.95
3222,15.82
3223,15.68
3224,15.50
3225,15.25
3226,14.97
3227,14.66
3228,14.37
3229,14.12
3230,13.97
3231,13.94
3232,14.04
3233,14.27
3234,14.66
3235,15.14
3236,15.67
3237,16.17
3238,16.64
3239,17.05
3240,17.47
3241,17.88
3242,18.29
3243,18.65
3244,18.95
3245,19.16
3246,19.26
3247,19.26
3248,19.20
3249,19.10
3250,18.98
3251,18.90
3252,18.88
3253,18.91
3254,18.91
3255,18.84
3256,18.63
3257,18.27
3258,17.73
3259,17.06
3260,16.28
3261,15.50
3262,14.71
3263,14.01
3264,13.42
3265,12.97
3266,12.57
3267,12.24
3268,11.95
3269,11.71
3270,11.44
3271,11.15
3272,10.88
3273,10.67
3274,10.47
3275,10.24
3276,9.99
3277,9.80
3278,9.70
3279,9.69
3280,9.70
3281,9.74
3282,9.76
3283,9.79
3284,9.83
3285,9.83
3286,9.77
3287,9.65
3288,9.51
3289,9.38
3290,9.28
3291,9.22
3292,9.22
3293,9.30
3294,9.49
3295,9.75
3296,10.12
3297,10.55
3298,11.11
3299,11.69
3300,12.33
3301,12.97
3302,13.69
3303,14.41
3304,15.20
3305,15.95
3306,16.78
3307,17.65
3308,18.67
3309,19.73
3310,20.86
3311,21.90
3312,22.94
3313,23.80
3314,24.58
3315,25.18
3316,25.75
3317,26.22
3318,26.74
3319,27.21
3320,27.81
3321,28.46
3322,29.28
3323,30.14
3324,31.04
3325,31.82
3326,32.55
3327,33.16
3328,33.74
3329,34.20
3330,34.55
3331,34.80
3332,35.00
3333,35.17
3334,35.29
3335,35.33
3336,35.29
3337,35.17
3338,34.90
3339,34.53
3340,34.05
3341,33.52
3342,32.85
3343,32.11
3344,31.24
3345,30.36
3346,29.37
3347,28.35
3348,27.24
3349,26.18
3350,25.11
3351,24.16
3352,23.24
3353,22.43
3354,21.58
3355,20.78
3356,19.95
3357,19.16
3358,18.26
3359,17.40
3360,16.53
3361,15.82
3362,15.11
3363,14.52
3364,13.95
3365,13.49
3366,13.03
3367,12.58
3368,12.02
3369,11.41
3370,10.70
3371,10.00
3372,9.26
3373,8.59
3374,7.97
3375,7.47
3376,7.06
3377,6.77
3378,6.55
3379,6.36
3380,6.10
3381,5.78
3382,5.39
3383,4.99
3384,4.62
3385,4.32
3386,4.16
3387,4.19
3388,4.39
3389,4.72
3390,5.15
3391,5.60
3392,6.02
3393,6.34
3394,6.58
3395,6.74
3396,6.91
3397,7.07
3398,7.33
3399,7.67
3400,8.18
3401,8.79
3402,9.54
3403,10.30
3404,11.10
3405,11.86
3406,12.63
3407,13.30
3408,13.92
3409,14.47
3410,15.08
3411,15.74
3412,16.51
3413,17.31
3414,18.19
3415,19.04
3416,19.84
3417,20.49
3418,21.03
3419,21.41
3420,21.65
3421,21.76
3422,21.81
3423,21.83
3424,21.87
3425,21.93
3426,22.03
3427,22.15
3428,22.24
3429,22.25
3430,22.13
3431,21.90
3432,21.52
3433,21.06
3434,20.46
3435,19.81
3436,19.11
3437,18.43
3438,17.74
3439,17.10
3440,16.49
3441,15.96
3442,15.43
3443,14.95
3444,14.44
3445,13.98
3446,13.50
3447,13.05
3448,12.65
3449,12.32
3450,12.05
3451,11.85
3452,11.72
3453,11.70
3454,11.73
3455,11.84
3456,11.96
3457,12.05
3458,12.07
3459,12.05
3460,12.01
3461,12.00
3462,12.03
3463,12.16
3464,12.38
3465,12.66
3466,12.88
3467,12.99
3468,12.93
3469,12.73
3470,12.34
3471,11.83
3472,11.25
3473,10.73
3474,10.36
3475,10.16
3476,10.09
3477,10.08
3478,10.01
3479,9.86
3480,9.63
3481,9.33
3482,8.97
3483,8.61
3484,8.31
3485,8.13
3486,8.07
3487,8.15
3488,8.28
3489,8.40
3490,8.45
3491,8.43
3492,8.34
3493,8.22
3494,8.06
3495,7.89
3496,7.71
3497,7.55
3498,7.44
3499,7.38
3500,7.36
3501,7.36
3502,7.39
3503,7.44
3504,7.52
3505,7.64
3506,7.84
3507,8.09
3508,8.43
3509,8.81
3510,9.28
3511,9.77
3512,10.31
3513,10.85
3514,11.41
3515,11.96
3516,12.54
3517,13.09
3518,13.68
3519,14.21
3520,14.67
3521,15.02
3522,15.31
3523,15.50
3524,15.66
3525,15.80
3526,16.02
3527,16.30
3528,16.65
3529,16.94
3530,17.20
3531,17.38
3532,17.46
3533,17.40
3534,17.23
3535,17.01
3536,16.80
3537,16.65
3538,16.59
3539,16.59
3540,16.61
3541,16.59
3542,16.48
3543,16.31
3544,16.04
3545,15.69
3546,15.23
3547,14.76
3548,14.31
3549,13.93
3550,13.54
3551,13.15
3552,12.68
3553,12.21
3554,11.70
3555,11.20
3556,10.69
3557,10.22
3558,9.75
3559,9.32
3560,8.90
3561,8.52
3562,8.11
3563,7.69
3564,7.28
3565,6.95
3566,6.72
3567,6.58
3568,6.49
3569,6.46
3570,6.52
3571,6.65
3572,6.88
3573,7.19
3574,7.58
3575,8.02
3576,8.50
3577,8.94
3578,9.35
3579,9.70
3580,10.04
3581,10.35
3582,10.69
3583,11.08
3584,11.59
3585,12.17
3586,12.80
3587,13.37
3588,13.89
3589,14.26
3590,14.48
3591,14.53
3592,14.53
3593,14.47
3594,14.42
3595,14.36
3596,14.36
3597,14.43
3598,14.60
3599,14.81
3600,15.08
3601,15.40
3602,15.76
3603,16.15
3604,16.57
3605,16.99
3606,17.40
3607,17.75
3608,18.07
3609,18.37
3610,18.65
3611,18.89
3612,19.07
3613,19.15
3614,19.14
3615,19.06
3616,18.91
3617,18.67
3618,18.31
3619,17.89
3620,17.49
3621,17.18
3622,16.98
3623,16.91
3624,16.92
3625,17.01
3626,17.12
3627,17.20
3628,17.17
3629,17.05
3630,16.83
3631,16.53
3632,16.19
3633,15.89
3634,15.68
3635,15.59
3636,15.60
3637,15.64
3638,15.63
3639,15.59
3640,15.48
3641,15.33
3642,15.09
3643,14.87
3644,14.69
3645,14.57
3646,14.43
3647,14.27
3648,14.08
3649,13.88
3650,13.57
3651,13.17
3652,12.64
3653,12.07
3654,11.46
3655,10.83
3656,10.22
3657,9.68
3658,9.24
3659,8.95
3660,8.81
3661,8.85
3662,9.01
3663,9.36
3664,9.86
3665,10.47
3666,11.04
3667,11.47
3668,11.67
3669,11.58
3670,11.17
3671,10.48
3672,9.62
3673,8.77
3674,8.04
3675,7.55
3676,7.37
3677,7.45
3678,7.78
3679,8.27
3680,8.87
3681,9.49
3682,10.10
3683,10.63
3684,11.12
3685,11.55
3686,12.00
3687,12.43
3688,12.91
3689,13.40
3690,13.98
3691,14.56
3692,15.17
3693,15.75
3694,16.40
3695,17.00
3696,17.60
3697,18.12
3698,18.68
3699,19.25
3700,19.90
3701,20.55
3702,21.25
3703,21.92
3704,22.58
3705,23.09
3706,23.51
3707,23.80
3708,24.02
3709,24.19
3710,24.36
3711,24.56
3712,24.86
3713,25.28
3714,25.78
3715,26.26
3716,26.68
3717,26.95
3718,27.04
3719,26.97
3720,26.80
3721,26.63
3722,26.48
3723,26.40
3724,26.33
3725,26.25
3726,26.08
3727,25.83
3728,25.41
3729,24.89
3730,24.25
3731,23.56
3732,22.86
3733,22.24
3734,21.71
3735,21.26
3736,20.85
3737,20.48
3738,20.11
3739,19.79
3740,19.46
3741,19.17
3742,18.92
3743,18.75
3744,18.60
3745,18.49
3746,18.40
3747,18.37
3748,18.40
3749,18.49
3750,18.64
3751,18.84
3752,19.13
3753,19.45
3754,19.81
3755,20.16
3756,20.55
3757,20.92
3758,21.33
3759,21.77
3760,22.29
3761,22.82
3762,23.35
3763,23.79
3764,24.15
3765,24.38
3766,24.51
3767,24.50
3768,24.41
3769,24.30
3770,24.30
3771,24.38
3772,24.52
3773,24.67
3774,24.85
3775,24.99
3776,25.06
3777,25.06
3778,25.08
3779,25.15
3780,25.30
3781,25.49
3782,25.72
3783,25.99
3784,26.25
3785,26.44
3786,26.48
3787,26.37
3788,26.12
3789,25.78
3790,25.39
3791,25.01
3792,24.64
3793,24.31
3794,24.02
3795,23.76
3796,23.49
3797,23.26
3798,23.05
3799,22.93
3800,22.80
3801,22.71
3802,22.50
3803,22.22
3804,21.80
3805,21.28
3806,20.58
3807,19.79
3808,18.89
3809,18.01
3810,17.10
3811,16.26
3812,15.40
3813,14.66
3814,13.93
3815,13.31
3816,12.61
3817,11.90
3818,11.04
3819,10.14
3820,9.09
3821,8.01
3822,6.84
3823,5.71
3824,4.64
3825,3.76
3826,3.04
3827,2.53
3828,2.09
3829,1.72
3830,1.33
3831,0.92
3832,0.45
3833,-0.02
3834,-0.47
3835,-0.80
3836,-1.00
3837,-1.06
3838,-1.00
3839,-0.84
3840,-0.60
3841,-0.31
3842,0.04
3843,0.46
3844,1.00
3845,1.62
3846,2.27
3847,2.86
3848,3.43
3849,3.93
3850,4.36
3851,4.65
3852,4.84
3853,5.00
3854,5.25
3855,5.55
3856,5.98
3857,6.48
3858,7.11
3859,7.78
3860,8.48
3861,9.06
3862,9.61
3863,10.07
3864,10.51
3865,10.84
3866,11.18
3867,11.52
3868,11.96
3869,12.42
3870,12.91
3871,13.36
3872,13.79
3873,14.11
3874,14.29
3875,14.28
3876,14.15
3877,13.93
3878,13.68
3879,13.40
3880,13.15
3881,12.92
3882,12.79
3883,12.76
3884,12.85
3885,12.99
3886,13.17
3887,13.35
3888,13.54
3889,13.76
3890,13.96
3891,14.14
3892,14.31
3893,14.45
3894,14.57
3895,14.67
3896,14.72
3897,14.76
3898,14.75
3899,14.69
3900,14.56
3901,14.37
3902,14.07
3903,13.72
3904,13.28
3905,12.82
3906,12.29
3907,11.76
3908,11.21
3909,10.71
3910,10.24
3911,9.84
3912,9.44
3913,9.06
3914,8.66
3915,8.26
3916,7.80
3917,7.30
3918,6.70
3919,6.06
3920,5.35
3921,4.67
3922,4.01
3923,3.42
3924,2.89
3925,2.49
3926,2.14
3927,1.88
3928,1.67
3929,1.49
3930,1.34
3931,1.21
3932,1.16
3933,1.18
3934,1.31
3935,1.55
3936,1.91
3937,2.35
3938,2.87
3939,3.43
3940,4.07
3941,4.71
3942,5.37
3943,5.99
3944,6.61
3945,7.16
3946,7.68
3947,8.05
3948,8.34
3949,8.52
3950,8.74
3951,8.96
3952,9.26
3953,9.61
3954,10.06
3955,10.51
3956,11.00
3957,11.48
3958,11.99
3959,12.42
3960,12.76
3961,12.95
3962,13.12
3963,13.25
3964,13.37
3965,13.42
3966,13.47
3967,13.53
3968,13.73
3969,14.02
3970,14.43
3971,14.87
3972,15.34
3973,15.77
3974,16.25
3975,16.75
3976,17.27
3977,17.77
3978,18.30
3979,18.86
3980,19.48
3981,20.07
3982,20.61
3983,20.98
3984,21.23
3985,21.38
3986,21.48
3987,21.50
3988,21.45
3989,21.35
3990,21.29
3991,21.29
3992,21.30
3993,21.31
3994,21.32
3995,21.34
3996,21.37
3997,21.38
3998,21.35
3999,21.28
4000,21.19
4001,21.11
4002,21.03
4003,20.94
4004,20.82
4005,20.67
4006,20.50
4007,20.32
4008,20.13
4009,19.95
4010,19.83
4011,19.81
4012,19.84
4013,19.97
4014,20.16
4015,20.36
4016,20.43
4017,20.36
4018,20.10
4019,19.74
4020,19.27
4021,18.75
4022,18.17
4023,17.61
4024,17.04
4025,16.52
4026,15.98
4027,15.46
4028,14.85
4029,14.22
4030,13.50
4031,12.84
4032,12.17
4033,11.57
4034,10.92
4035,10.31
4036,9.68
4037,9.08
4038,8.37
4039,7.65
4040,6.86
4041,6.10
4042,5.29
4043,4.49
4044,3.71
4045,3.04
4046,2.42
4047,1.89
4048,1.40
4049,1.02
4050,0.76
4051,0.64
4052,0.63
4053,0.72
4054,0.94
4055,1.26
4056,1.68
4057,2.15
4058,2.72
4059,3.34
4060,4.01
4061,4.67
4062,5.31
4063,5.90
4064,6.44
4065,6.87
4066,7.26
4067,7.54
4068,7.81
4069,8.06
4070,8.36
4071,8.71
4072,9.18
4073,9.70
4074,10.28
4075,10.81
4076,11.30
4077,11.67
4078,11.98
4079,12.20
4080,12.42
4081,12.65
4082,12.95
4083,13.29
4084,13.73
4085,14.19
4086,14.73
4087,15.30
4088,15.90
4089,16.49
4090,17.07
4091,17.57
4092,17.98
4093,18.28
4094,18.49
4095,18.61
4096,18.62
4097,18.53
4098,18.38
4099,18.19
4100,17.98
4101,17.78
4102,17.59
4103,17.41
4104,17.21
4105,16.98
4106,16.69
4107,16.40
4108,16.08
4109,15.76
4110,15.41
4111,15.12
4112,14.92
4113,14.82
4114,14.79
4115,14.81
4116,14.84
4117,14.87
4118,14.85
4119,14.77
4120,14.63
4121,14.45
4122,14.22
4123,13.99
4124,13.76
4125,13.55
4126,13.33
4127,13.07
4128,12.73
4129,12.34
4130,11.90
4131,11.47
4132,11.03
4133,10.65
4134,10.28
4135,9.99
4136,9.78
4137,9.64
4138,9.48
4139,9.32
4140,9.12
4141,8.91
4142,8.66
4143,8.39
4144,8.16
4145,8.03
4146,8.05
4147,8.20
4148,8.45
4149,8.75
4150,9.09
4151,9.38
4152,9.61
4153,9.74
4154,9.86
4155,9.99
4156,10.25
4157,10.59
4158,11.07
4159,11.66
4160,12.41
4161,13.21
4162,14.00
4163,14.69
4164,15.31
4165,15.83
4166,16.25
4167,16.51
4168,16.69
4169,16.82
4170,16.98
4171,17.15
4172,17.40
4173,17.68
4174,18.04
4175,18.39
4176,18.75
4177,19.04
4178,19.25
4179,19.33
4180,19.34
4181,19.33
4182,19.38
4183,19.49
4184,19.66
4185,19.87
4186,20.13
4187,20.34
4188,20.45
4189,20.42
4190,20.28
4191,20.08
4192,19.89
4193,19.77
4194,19.75
4195,19.82
4196,19.90
4197,19.91
4198,19.81
4199,19.62
4200,19.40
4201,19.20
4202,19.02
4203,18.94
4204,18.94
4205,19.04
4206,19.16
4207,19.23
4208,19.19
4209,19.04
4210,18.78
4211,18.46
4212,18.07
4213,17.66
4214,17.21
4215,16.78
4216,16.30
4217,15.84
4218,15.34
4219,14.84
4220,14.30
4221,13.77
4222,13.24
4223,12.78
4224,12.33
4225,11.95
4226,11.61
4227,11.35
4228,11.13
4229,10.93
4230,10.70
4231,10.53
4232,10.42
4233,10.40
4234,10.38
4235,10.36
4236,10.35
4237,10.41
4238,10.51
4239,10.64
4240,10.79
4241,10.95
4242,11.17
4243,11.44
4244,11.77
4245,12.09
4246,12.37
4247,12.58
4248,12.76
4249,12.90
4250,13.00
4251,13.05
4252,13.15
4253,13.28
4254,13.50
4255,13.79
4256,14.18
4257,14.58
4258,15.03
4259,15.43
4260,15.85
4261,16.21
4262,16.62
4263,17.01
4264,17.48
4265,17.97
4266,18.55
4267,19.13
4268,19.77
4269,20.39
4270,21.03
4271,21.64
4272,22.25
4273,22.80
4274,23.37
4275,23.86
4276,24.30
4277,24.62
4278,24.88
4279,25.07
4280,25.25
4281,25.39
4282,25.56
4283,25.76
4284,26.02
4285,26.28
4286,26.54
4287,26.79
4288,26.99
4289,27.15
4290,27.21
4291,27.18
4292,27.08
4293,26.93
4294,26.74
4295,26.54
4296,26.31
4297,26.08
4298,25.81
4299,25.53
4300,25.18
4301,24.81
4302,24.34
4303,23.85
4304,23.28
4305,22.75
4306,22.11
4307,21.42
4308,20.57
4309,19.68
4310,18.66
4311,17.64
4312,16.50
4313,15.40
4314,14.25
4315,13.18
4316,12.05
4317,10.95
4318,9.75
4319,8.59
4320,7.33
4321,6.14
4322,4.94
4323,3.89
4324,2.89
4325,2.03
4326,1.16
4327,0.32
4328,-0.61
4329,-1.54
4330,-2.54
4331,-3.49
4332,-4.41
4333,-5.14
4334,-5.65
4335,-5.88
4336,-5.93
4337,-5.82
4338,-5.62
4339,-5.36
4340,-5.07
4341,-4.75
4342,-4.43
4343,-4.08
4344,-3.71
4345,-3.29
4346,-2.75
4347,-2.14
4348,-1.46
4349,-0.85
4350,-0.23
4351,0.32
4352,0.83
4353,1.20
4354,1.51
4355,1.75
4356,2.05
4357,2.35
4358,2.75
4359,3.17
4360,3.75
4361,4.39
4362,5.13
4363,5.87
4364,6.61
4365,7.24
4366,7.84
4367,8.32
4368,8.81
4369,9.23
4370,9.67
4371,10.12
4372,10.63
4373,11.15
4374,11.68
4375,12.16
4376,12.61
4377,12.95
4378,13.18
4379,13.29
4380,13.38
4381,13.46
4382,13.53
4383,13.56
4384,13.60
4385,13.66
4386,13.70
4387,13.71
4388,13.67
4389,13.61
4390,13.51
4391,13.40
4392,13.27
4393,13.09
4394,12.82
4395,12.50
4396,12.15
4397,11.80
4398,11.38
4399,10.91
4400,10.40
4401,9.93
4402,9.46
4403,9.03
4404,8.58
4405,8.20
4406,7.86
4407,7.60
4408,7.37
4409,7.18
4410,6.97
4411,6.76
4412,6.53
4413,6.32
4414,6.16
4415,6.04
4416,5.96
4417,5.94
4418,5.99
4419,6.10
4420,6.25
4421,6.40
4422,6.58
4423,6.82
4424,7.08
4425,7.32
4426,7.53
4427,7.65
4428,7.66
4429,7.54
4430,7.30
4431,6.96
4432,6.57
4433,6.21
4434,5.97
4435,5.87
4436,5.91
4437,6.06
4438,6.33
4439,6.71
4440,7.19
4441,7.66
4442,8.14
4443,8.61
4444,9.11
4445,9.61
4446,10.12
4447,10.59
4448,11.06
4449,11.49
4450,11.94
4451,12.37
4452,12.86
4453,13.31
4454,13.80
4455,14.27
4456,14.77
4457,15.23
4458,15.69
4459,16.11
4460,16.62
4461,17.20
4462,17.90
4463,18.61
4464,19.36
4465,20.03
4466,20.65
4467,21.11
4468,21.46
4469,21.68
4470,21.87
4471,22.00
4472,22.16
4473,22.29
4474,22.48
4475,22.71
4476,23.01
4477,23.33
4478,23.69
4479,24.06
4480,24.51
4481,24.95
4482,25.38
4483,25.71
4484,25.93
4485,26.04
4486,26.08
4487,26.06
4488,26.06
4489,26.12
4490,26.30
4491,26.59
4492,26.96
4493,27.33
4494,27.63
4495,27.84
4496,27.95
4497,27.95
4498,27.85
4499,27.67
4500,27.41
4501,27.12
4502,26.77
4503,26.37
4504,25.86
4505,25.30
4506,24.70
4507,24.15
4508,23.60
4509,23.10
4510,22.61
4511,22.21
4512,21.86
4513,21.58
4514,21.25
4515,20.91
4516,20.51
4517,20.14
4518,19.70
4519,19.23
4520,18.59
4521,17.90
4522,17.07
4523,16.23
4524,15.30
4525,14.35
4526,13.36
4527,12.44
4528,11.60
4529,10.92
4530,10.36
4531,9.98
4532,9.80
4533,9.82
4534,10.03
4535,10.43
4536,11.03
4537,11.77
4538,12.55
4539,13.28
4540,13.97
4541,14.58
4542,15.13
4543,15.53
4544,15.88
4545,16.15
4546,16.46
4547,16.71
4548,16.98
4549,17.19
4550,17.46
4551,17.74
4552,18.10
4553,18.46
4554,18.88
4555,19.32
4556,19.84
4557,20.36
4558,20.90
4559,21.37
4560,21.81
4561,22.19
4562,22.52
4563,22.78
4564,23.03
4565,23.25
4566,23.49
4567,23.73
4568,24.02
4569,24.33
4570,24.67
4571,25.03
4572,25.46
4573,25.90
4574,26.30
4575,26.57
4576,26.72
4577,26.71
4578,26.56
4579,26.25
4580,25.86
4581,25.45
4582,25.14
4583,24.93
4584,24.83
4585,24.80
4586,24.83
4587,24.89
4588,24.96
4589,25.02
4590,25.09
4591,25.27
4592,25.60
4593,26.12
4594,26.74
4595,27.35
4596,27.83
4597,28.11
4598,28.12
4599,27.82
4600,27.20
4601,26.33
4602,25.32
4603,24.36
4604,23.51
4605,22.83
4606,22.30
4607,21.93
4608,21.64
4609,21.42
4610,21.16
4611,20.88
4612,20.51
4613,20.08
4614,19.52
4615,18.91
4616,18.22
4617,17.58
4618,16.94
4619,16.40
4620,15.88
4621,15.52
4622,15.21
4623,15.01
4624,14.74
4625,14.41
4626,13.86
4627,13.18
4628,12.28
4629,11.28
4630,10.12
4631,8.94
4632,7.74
4633,6.67
4634,5.58
4635,4.53
4636,3.42
4637,2.37
4638,1.31
4639,0.35
4640,-0.62
4641,-1.49
4642,-2.32
4643,-2.98
4644,-3.59
4645,-4.07
4646,-4.52
4647,-4.85
4648,-5.16
4649,-5.40
4650,-5.71
4651,-6.01
4652,-6.39
4653,-6.80
4654,-7.29
4655,-7.82
4656,-8.40
4657,-8.96
4658,-9.52
4659,-10.05
4660,-10.57
4661,-11.05
4662,-11.49
4663,-11.85
4664,-12.08
4665,-12.18
4666,-12.14
4667,-11.96
4668,-11.60
4669,-11.10
4670,-10.48
4671,-9.83
4672,-9.12
4673,-8.36
4674,-7.49
4675,-6.58
4676,-5.56
4677,-4.52
4678,-3.36
4679,-2.18
4680,-0.93
4681,0.21
4682,1.28
4683,2.15
4684,2.96
4685,3.64
4686,4.30
4687,4.88
4688,5.50
4689,6.13
4690,6.85
4691,7.55
4692,8.28
4693,8.92
4694,9.49
4695,9.90
4696,10.18
4697,10.28
4698,10.28
4699,10.15
4700,9.96
4701,9.74
4702,9.56
4703,9.46
4704,9.48
4705,9.60
4706,9.82
4707,10.09
4708,10.36
4709,10.61
4710,10.81
4711,10.93
4712,10.89
4713,10.72
4714,10.46
4715,10.18
4716,9.93
4717,9.72
4718,9.59
4719,9.56
4720,9.61
4721,9.74
4722,9.90
4723,10.05
4724,10.16
4725,10.22
4726,10.23
4727,10.19
4728,10.14
4729,10.05
4730,9.92
4731,9.77
4732,9.64
4733,9.57
4734,9.58
4735,9.67
4736,9.84
4737,10.08
4738,10.39
4739,10.68
4740,10.93
4741,11.11
4742,11.25
4743,11.35
4744,11.51
4745,11.73
4746,12.11
4747,12.63
4748,13.32
4749,14.06
4750,14.84
4751,15.55
4752,16.19
4753,16.65
4754,16.97
4755,17.10
4756,17.17
4757,17.20
4758,17.32
4759,17.52
4760,17.86
4761,18.33
4762,18.94
4763,19.66
4764,20.47
4765,21.27
4766,22.02
4767,22.64
4768,23.16
4769,23.51
4770,23.67
4771,23.64
4772,23.49
4773,23.27
4774,23.03
4775,22.76
4776,22.50
4777,22.23
4778,21.91
4779,21.50
4780,20.97
4781,20.41
4782,19.82
4783,19.29
4784,18.81
4785,18.46
4786,18.22
4787,18.10
4788,17.96
4789,17.73
4790,17.31
4791,16.75
4792,16.07
4793,15.39
4794,14.72
4795,14.16
4796,13.69
4797,13.36
4798,13.05
4799,12.77
4800,12.45
4801,12.12
4802,11.79
4803,11.50
4804,11.25
4805,11.13
4806,11.14
4807,11.28
4808,11.44
4809,11.57
4810,11.58
4811,11.47
4812,11.24
4813,10.94
4814,10.60
4815,10.30
4816,10.07
4817,9.96
4818,9.93
4819,9.96
4820,10.02
4821,10.06
4822,10.03
4823,9.94
4824,9.79
4825,9.61
4826,9.43
4827,9.32
4828,9.26
4829,9.27
4830,9.26
4831,9.24
4832,9.19
4833,9.10
4834,8.93
4835,8.67
4836,8.34
4837,8.03
4838,7.81
4839,7.72
4840,7.77
4841,7.91
4842,8.13
4843,8.37
4844,8.62
4845,8.86
4846,9.10
4847,9.37
4848,9.68
4849,10.03
4850,10.44
4851,10.88
4852,11.38
4853,11.85
4854,12.28
4855,12.60
4856,12.85
4857,12.99
4858,13.07
4859,13.08
4860,13.10
4861,13.15
4862,13.29
4863,13.47
4864,13.66
4865,13.84
4866,14.02
4867,14.18
4868,14.23
4869,14.21
4870,14.14
4871,14.07
4872,14.00
4873,13.89
4874,13.73
4875,13.48
4876,13.15
4877,12.74
4878,12.25
4879,11.71
4880,11.12
4881,10.55
4882,10.06
4883,9.74
4884,9.57
4885,9.51
4886,9.53
4887,9.60
4888,9.67
4889,9.67
4890,9.54
4891,9.28
4892,8.90
4893,8.51
4894,8.15
4895,7.91
4896,7.84
4897,7.96
4898,8.23
4899,8.60
4900,9.00
4901,9.38
4902,9.76
4903,10.09
4904,10.37
4905,10.60
4906,10.83
4907,11.09
4908,11.42
4909,11.72
4910,11.92
4911,11.98
4912,11.96
4913,11.85
4914,11.67
4915,11.40
4916,11.10
4917,10.86
4918,10.70
4919,10.64
4920,10.66
4921,10.72
4922,10.83
4923,10.97
4924,11.15
4925,11.36
4926,11.60
4927,11.84
4928,12.07
4929,12.24
4930,12.37
4931,12.44
4932,12.54
4933,12.61
4934,12.73
4935,12.86
4936,13.08
4937,13.40
4938,13.89
4939,14.50
4940,15.24
4941,16.05
4942,16.94
4943,17.76
4944,18.48
4945,18.99
4946,19.34
4947,19.49
4948,19.49
4949,19.33
4950,19.16
4951,19.02
4952,18.95
4953,18.88
4954,18.84
4955,18.84
4956,18.88
4957,18.88
4958,18.79
4959,18.61
4960,18.42
4961,18.30
4962,18.23
4963,18.23
4964,18.33
4965,18.54
4966,18.82
4967,19.17
4968,19.53
4969,19.89
4970,20.17
4971,20.36
4972,20.45
4973,20.45
4974,20.34
4975,20.17
4976,19.96
4977,19.75
4978,19.52
4979,19.26
4980,18.96
4981,18.60
4982,18.14
4983,17.62
4984,17.02
4985,16.43
4986,15.82
4987,15.24
4988,14.64
4989,14.11
4990,13.64
4991,13.24
4992,12.80
4993,12.37
4994,11.91
4995,11.54
4996,11.21
4997,10.96
4998,10.70
4999,10.44
5000,10.12
5001,9.78
5002,9.36
5003,8.90
5004,8.33
5005,7.74
5006,7.14
5007,6.60
5008,6.11
5009,5.72
5010,5.46
5011,5.35
5012,5.35
5013,5.44
5014,5.62
5015,5.88
5016,6.24
5017,6.63
5018,7.02
5019,7.41
5020,7.84
5021,8.30
5022,8.80
5023,9.32
5024,9.86
5025,10.43
5026,10.98
5027,11.42
5028,11.74
5029,11.88
5030,11.89
5031,11.79
5032,11.63
5033,11.47
5034,11.40
5035,11.44
5036,11.67
5037,12.00
5038,12.39
5039,12.74
5040,13.05
5041,13.31
5042,13.57
5043,13.79
5044,14.01
5045,14.21
5046,14.51
5047,14.88
5048,15.34
5049,15.79
5050,16.24
5051,16.65
5052,16.99
5053,17.17
5054,17.20
5055,17.13
5056,17.04
5057,16.91
5058,16.77
5059,16.59
5060,16.40
5061,16.22
5062,16.04
5063,15.83
5064,15.58
5065,15.31
5066,15.02
5067,14.76
5068,14.51
5069,14.28
5070,14.04
5071,13.81
5072,13.57
5073,13.34
5074,13.06
5075,12.74
5076,12.36
5077,12.01
5078,11.69
5079,11.43
5080,11.17
5081,10.95
5082,10.74
5083,10.57
5084,10.33
5085,10.05
5086,9.70
5087,9.34
5088,8.96
5089,8.61
5090,8.31
5091,8.10
5092,7.97
5093,7.89
5094,7.81
5095,7.76
5096,7.71
5097,7.64
5098,7.55
5099,7.43
5100,7.32
5101,7.23
5102,7.16
5103,7.13
5104,7.16
5105,7.21
5106,7.29
5107,7.38
5108,7.48
5109,7.56
5110,7.64
5111,7.73
5112,7.87
5113,8.06
5114,8.36
5115,8.75
5116,9.23
5117,9.74
5118,10.24
5119,10.68
5120,11.08
5121,11.39
5122,11.67
5123,11.90
5124,12.15
5125,12.38
5126,12.59
5127,12.73
5128,12.85
5129,12.96
5130,13.10
5131,13.28
5132,13.53
5133,13.85
5134,14.24
5135,14.66
5136,15.09
5137,15.42
5138,15.59
5139,15.56
5140,15.37
5141,15.11
5142,14.88
5143,14.72
5144,14.70
5145,14.79
5146,14.97
5147,15.15
5148,15.28
5149,15.28
5150,15.13
5151,14.82
5152,14.43
5153,14.07
5154,13.82
5155,13.77
5156,13.87
5157,14.12
5158,14.47
5159,14.80
5160,15.02
5161,15.06
5162,14.88
5163,14.59
5164,14.20
5165,13.78
5166,13.35
5167,13.00
5168,12.74
5169,12.60
5170,12.51
5171,12.44
5172,12.31
5173,12.18
5174,11.96
5175,11.70
5176,11.36
5177,11.02
5178,10.64
5179,10.26
5180,9.83
5181,9.38
5182,8.93
5183,8.52
5184,8.14
5185,7.82
5186,7.53
5187,7.30
5188,7.07
5189,6.87
5190,6.67
5191,6.50
5192,6.34
5193,6.17
5194,5.94
5195,5.70
5196,5.48
5197,5.30
5198,5.13
5199,4.99
5200,4.89
5201,4.86
5202,4.90
5203,4.98
5204,5.11
5205,5.29
5206,5.52
5207,5.75
5208,6.00
5209,6.23
5210,6.49
5211,6.77
5212,7.13
5213,7.47
5214,7.87
5215,8.24
5216,8.64
5217,9.03
5218,9.52
5219,10.07
5220,10.75
5221,11.48
5222,12.34
5223,13.21
5224,14.16
5225,15.06
5226,15.99
5227,16.83
5228,17.64
5229,18.33
5230,19.00
5231,19.61
5232,20.26
5233,20.86
5234,21.48
5235,22.03
5236,22.61
5237,23.15
5238,23.70
5239,24.19
5240,24.75
5241,25.35
5242,26.06
5243,26.80
5244,27.60
5245,28.40
5246,29.19
5247,29.82
5248,30.22
5249,30.33
5250,30.20
5251,29.86
5252,29.40
5253,28.95
5254,28.59
5255,28.42
5256,28.40
5257,28.45
5258,28.42
5259,28.24
5260,27.78
5261,27.10
5262,26.18
5263,25.21
5264,24.22
5265,23.40
5266,22.70
5267,22.16
5268,21.64
5269,21.12
5270,20.38
5271,19.49
5272,18.32
5273,17.08
5274,15.76
5275,14.60
5276,13.51
5277,12.60
5278,11.67
5279,10.78
5280,9.79
5281,8.77
5282,7.61
5283,6.50
5284,5.42
5285,4.55
5286,3.78
5287,3.18
5288,2.63
5289,2.14
5290,1.61
5291,1.05
5292,0.43
5293,-0.10
5294,-0.50
5295,-0.63
5296,-0.53
5297,-0.15
5298,0.40
5299,1.05
5300,1.65
5301,2.14
5302,2.46
5303,2.60
5304,2.57
5305,2.39
5306,2.10
5307,1.76
5308,1.46
5309,1.21
5310,1.06
5311,0.99
5312,1.04
5313,1.19
5314,1.43
5315,1.66
5316,1.85
5317,1.99
5318,2.16
5319,2.37
5320,2.62
5321,2.87
5322,3.19
5323,3.59
5324,4.14
5325,4.72
5326,5.34
5327,5.92
5328,6.57
5329,7.23
5330,7.99
5331,8.77
5332,9.68
5333,10.62
5334,11.61
5335,12.53
5336,13.40
5337,14.17
5338,14.85
5339,15.34
5340,15.69
5341,15.91
5342,16.12
5343,16.31
5344,16.53
5345,16.70
5346,16.87
5347,17.01
5348,17.14
5349,17.23
5350,17.29
5351,17.32
5352,17.33
5353,17.33
5354,17.32
5355,17.33
5356,17.32
5357,17.27
5358,17.11
5359,16.82
5360,16.36
5361,15.73
5362,14.92
5363,14.02
5364,13.11
5365,12.34
5366,11.72
5367,11.28
5368,10.98
5369,10.87
5370,10.93
5371,11.08
5372,11.25
5373,11.41
5374,11.57
5375,11.77
5376,12.01
5377,12.28
5378,12.60
5379,12.92
5380,13.23
5381,13.47
5382,13.66
5383,13.76
5384,13.83
5385,13.89
5386,13.98
5387,14.10
5388,14.21
5389,14.27
5390,14.31
5391,14.27
5392,14.14
5393,13.91
5394,13.59
5395,13.26
5396,12.92
5397,12.56
5398,12.18
5399,11.78
5400,11.40
5401,11.08
5402,10.83
5403,10.64
5404,10.52
5405,10.52
5406,10.69
5407,11.02
5408,11.46
5409,11.97
5410,12.54
5411,13.10
5412,13.62
5413,14.04
5414,14.40
5415,14.72
5416,15.02
5417,15.28
5418,15.55
5419,15.80
5420,16.09
5421,16.35
5422,16.59
5423,16.77
5424,16.90
5425,16.98
5426,17.05
5427,17.14
5428,17.26
5429,17.37
5430,17.50
5431,17.64
5432,17.83
5433,18.04
5434,18.24
5435,18.36
5436,18.39
5437,18.35
5438,18.30
5439,18.23
5440,18.17
5441,18.17
5442,18.26
5443,18.47
5444,18.78
5445,19.14
5446,19.54
5447,19.93
5448,20.28
5449,20.52
5450,20.64
5451,20.62
5452,20.54
5453,20.41
5454,20.29
5455,20.20
5456,20.16
5457,20.16
5458,20.20
5459,20.26
5460,20.32
5461,20.36
5462,20.36
5463,20.33
5464,20.26
5465,20.18
5466,20.05
5467,19.88
5468,19.63
5469,19.31
5470,18.90
5471,18.42
5472,17.85
5473,17.21
5474,16.46
5475,15.70
5476,14.88
5477,14.13
5478,13.38
5479,12.72
5480,12.02
5481,11.33
5482,10.55
5483,9.80
5484,8.99
5485,8.20
5486,7.37
5487,6.60
5488,5.87
5489,5.29
5490,4.82
5491,4.47
5492,4.20
5493,4.02
5494,3.94
5495,3.98
5496,4.08
5497,4.23
5498,4.43
5499,4.67
5500,4.96
5501,5.25
5502,5.55
5503,5.84
5504,6.19
5505,6.60
5506,7.07
5507,7.51
5508,7.93
5509,8.25
5510,8.52
5511,8.72
5512,8.87
5513,8.97
5514,9.12
5515,9.35
5516,9.70
5517,10.12
5518,10.59
5519,11.03
5520,11.44
5521,11.73
5522,11.91
5523,11.99
5524,12.06
5525,12.14
5526,12.25
5527,12.37
5528,12.52
5529,12.72
5530,12.99
5531,13.28
5532,13.61
5533,13.94
5534,14.25
5535,14.53
5536,14.72
5537,14.82
5538,14.79
5539,14.60
5540,14.31
5541,13.97
5542,13.66
5543,13.39
5544,13.16
5545,12.99
5546,12.84
5547,12.70
5548,12.51
5549,12.27
5550,12.00
5551,11.79
5552,11.67
5553,11.64
5554,11.67
5555,11.77
5556,11.92
5557,12.15
5558,12.34
5559,12.44
5560,12.38
5561,12.21
5562,11.96
5563,11.68
5564,11.38
5565,11.09
5566,10.86
5567,10.70
5568,10.58
5569,10.50
5570,10.46
5571,10.46
5572,10.43
5573,10.35
5574,10.23
5575,10.10
5576,9.99
5577,9.90
5578,9.86
5579,9.89
5580,9.97
5581,10.09
5582,10.28
5583,10.48
5584,10.68
5585,10.86
5586,11.02
5587,11.18
5588,11.29
5589,11.35
5590,11.38
5591,11.39
5592,11.46
5593,11.54
5594,11.64
5595,11.72
5596,11.84
5597,12.02
5598,12.27
5599,12.56
5600,12.91
5601,13.31
5602,13.84
5603,14.40
5604,14.95
5605,15.40
5606,15.75
5607,15.98
5608,16.12
5609,16.17
5610,16.24
5611,16.37
5612,16.62
5613,16.99
5614,17.42
5615,17.81
5616,18.10
5617,18.24
5618,18.26
5619,18.20
5620,18.08
5621,17.93
5622,17.78
5623,17.69
5624,17.68
5625,17.75
5626,17.81
5627,17.83
5628,17.75
5629,17.57
5630,17.26
5631,16.85
5632,16.35
5633,15.85
5634,15.35
5635,14.94
5636,14.60
5637,14.34
5638,14.10
5639,13.88
5640,13.61
5641,13.32
5642,12.96
5643,12.61
5644,12.28
5645,12.08
5646,11.99
5647,12.01
5648,12.04
5649,12.06
5650,11.97
5651,11.77
5652,11.38
5653,10.82
5654,10.09
5655,9.32
5656,8.54
5657,7.84
5658,7.15
5659,6.54
5660,5.97
5661,5.47
5662,4.97
5663,4.52
5664,4.04
5665,3.60
5666,3.14
5667,2.74
5668,2.38
5669,2.15
5670,2.00
5671,1.89
5672,1.77
5673,1.66
5674,1.53
5675,1.39
5676,1.20
5677,1.02
5678,0.91
5679,0.91
5680,0.96
5681,1.05
5682,1.10
5683,1.13
5684,1.08
5685,0.97
5686,0.79
5687,0.58
5688,0.34
5689,0.10
5690,-0.08
5691,-0.17
5692,-0.22
5693,-0.28
5694,-0.34
5695,-0.40
5696,-0.47
5697,-0.53
5698,-0.55
5699,-0.51
5700,-0.34
5701,-0.05
5702,0.41
5703,0.98
5704,1.64
5705,2.34
5706,3.11
5707,3.85
5708,4.57
5709,5.18
5710,5.76
5711,6.28
5712,6.81
5713,7.26
5714,7.69
5715,8.06
5716,8.51
5717,9.00
5718,9.54
5719,10.08
5720,10.64
5721,11.19
5722,11.76
5723,12.29
5724,12.83
5725,13.32
5726,13.79
5727,14.21
5728,14.62
5729,14.94
5730,15.15
5731,15.27
5732,15.34
5733,15.43
5734,15.51
5735,15.55
5736,15.52
5737,15.43
5738,15.26
5739,14.97
5740,14.50
5741,13.90
5742,13.24
5743,12.63
5744,12.15
5745,11.86
5746,11.75
5747,11.83
5748,11.97
5749,12.08
5750,12.02
5751,11.70
5752,11.08
5753,10.23
5754,9.26
5755,8.37
5756,7.61
5757,7.12
5758,6.84
5759,6.77
5760,6.77
5761,6.77
5762,6.63
5763,6.37
5764,5.96
5765,5.49
5766,4.97
5767,4.52
5768,4.17
5769,3.93
5770,3.79
5771,3.74
5772,3.75
5773,3.78
5774,3.82
5775,3.91
5776,4.07
5777,4.33
5778,4.71
5779,5.13
5780,5.55
5781,5.88
5782,6.10
5783,6.18
5784,6.16
5785,6.07
5786,5.94
5787,5.84
5788,5.84
5789,5.98
5790,6.29
5791,6.71
5792,7.20
5793,7.64
5794,8.03
5795,8.32
5796,8.56
5797,8.72
5798,8.87
5799,9.00
5800,9.22
5801,9.54
5802,9.98
5803,10.45
5804,10.96
5805,11.39
5806,11.77
5807,12.06
5808,12.31
5809,12.51
5810,12.72
5811,12.92
5812,13.15
5813,13.44
5814,13.82
5815,14.24
5816,14.66
5817,15.02
5818,15.32
5819,15.55
5820,15.75
5821,15.89
5822,16.00
5823,16.06
5824,16.08
5825,16.04
5826,15.95
5827,15.81
5828,15.62
5829,15.40
5830,15.17
5831,14.94
5832,14.71
5833,14.50
5834,14.28
5835,14.05
5836,13.79
5837,13.53
5838,13.23
5839,12.95
5840,12.63
5841,12.28
5842,11.86
5843,11.41
5844,10.96
5845,10.58
5846,10.24
5847,9.95
5848,9.67
5849,9.45
5850,9.21
5851,8.98
5852,8.74
5853,8.50
5854,8.28
5855,8.16
5856,8.18
5857,8.36
5858,8.64
5859,8.95
5860,9.23
5861,9.45
5862,9.57
5863,9.62
5864,9.67
5865,9.75
5866,9.92
5867,10.15
5868,10.44
5869,10.75
5870,11.02
5871,11.21
5872,11.23
5873,11.09
5874,10.80
5875,10.46
5876,10.12
5877,9.83
5878,9.59
5879,9.41
5880,9.26
5881,9.12
5882,8.97
5883,8.82
5884,8.64
5885,8.48
5886,8.30
5887,8.11
5888,7.90
5889,7.69
5890,7.54
5891,7.46
5892,7.52
5893,7.70
5894,8.04
5895,8.54
5896,9.21
5897,9.99
5898,10.82
5899,11.60
5900,12.30
5901,12.89
5902,13.41
5903,13.85
5904,14.21
5905,14.47
5906,14.69
5907,14.83
5908,14.91
5909,14.90
5910,14.87
5911,14.87
5912,14.91
5913,14.94
5914,14.93
5915,14.87
5916,14.76
5917,14.62
5918,14.39
5919,14.09
5920,13.75
5921,13.42
5922,13.12
5923,12.86
5924,12.61
5925,12.43
5926,12.34
5927,12.35
5928,12.38
5929,12.39
5930,12.34
5931,12.28
5932,12.23
5933,12.18
5934,12.06
5935,11.92
5936,11.79
5937,11.70
5938,11.60
5939,11.47
5940,11.27
5941,11.04
5942,10.71
5943,10.31
5944,9.78
5945,9.22
5946,8.64
5947,8.11
5948,7.60
5949,7.16
5950,6.77
5951,6.48
5952,6.26
5953,6.10
5954,5.89
5955,5.68
5956,5.38
5957,5.03
5958,4.56
5959,4.04
5960,3.44
5961,2.85
5962,2.23
5963,1.67
5964,1.21
5965,0.94
5966,0.82
5967,0.83
5968,0.94
5969,1.11
5970,1.35
5971,1.62
5972,1.95
5973,2.32
5974,2.77
5975,3.27
5976,3.88
5977,4.59
5978,5.40
5979,6.20
5980,6.97
5981,7.64
5982,8.31
5983,8.95
5984,9.61
5985,10.22
5986,10.86
5987,11.47
5988,12.09
5989,12.58
5990,12.95
5991,13.16
5992,13.27
5993,13.24
5994,13.15
5995,12.99
5996,12.87
5997,12.86
5998,12.98
5999,13.16
6000,13.39
6001,13.60
6002,13.75
6003,13.82
6004,13.78
6005,13.65
6006,13.46
6007,13.28
6008,13.18
6009,13.21
6010,13.33
6011,13.49
6012,13.64
6013,13.77
6014,13.83
6015,13.81
6016,13.66
6017,13.40
6018,13.02
6019,12.56
6020,12.05
6021,11.54
6022,11.08
6023,10.69
6024,10.38
6025,10.14
6026,9.98
6027,9.92
6028,9.96
6029,10.08
6030,10.26
6031,10.48
6032,10.69
6033,10.90
6034,11.11
6035,11.32
6036,11.54
6037,11.74
6038,11.94
6039,12.11
6040,12.27
6041,12.39
6042,12.47
6043,12.50
6044,12.48
6045,12.42
6046,12.32
6047,12.20
6048,12.05
6049,11.90
6050,11.79
6051,11.72
6052,11.72
6053,11.82
6054,12.02
6055,12.25
6056,12.46
6057,12.62
6058,12.73
6059,12.79
6060,12.76
6061,12.66
6062,12.58
6063,12.57
6064,12.66
6065,12.82
6066,13.01
6067,13.18
6068,13.33
6069,13.41
6070,13.47
6071,13.45
6072,13.40
6073,13.34
6074,13.32
6075,13.37
6076,13.52
6077,13.73
6078,14.02
6079,14.37
6080,14.79
6081,15.24
6082,15.70
6083,16.14
6084,16.57
6085,16.92
6086,17.20
6087,17.40
6088,17.59
6089,17.73
6090,17.82
6091,17.85
6092,17.88
6093,17.94
6094,18.00
6095,18.03
6096,18.04
6097,18.07
6098,18.11
6099,18.11
6100,18.03
6101,17.85
6102,17.60
6103,17.33
6104,17.06
6105,16.79
6106,16.53
6107,16.33
6108,16.17
6109,16.06
6110,15.93
6111,15.75
6112,15.53
6113,15.30
6114,15.04
6115,14.81
6116,14.60
6117,14.49
6118,14.43
6119,14.45
6120,14.47
6121,14.44
6122,14.31
6123,14.05
6124,13.63
6125,13.13
6126,12.56
6127,12.02
6128,11.55
6129,11.19
6130,10.96
6131,10.89
6132,10.93
6133,11.06
6134,11.16
6135,11.21
6136,11.14
6137,10.97
6138,10.66
6139,10.25
6140,9.72
6141,9.16
6142,8.57
6143,8.03
6144,7.56
6145,7.21
6146,6.97
6147,6.90
6148,6.91
6149,6.99
6150,7.02
6151,6.97
6152,6.79
6153,6.56
6154,6.28
6155,6.01
6156,5.77
6157,5.62
6158,5.58
6159,5.65
6160,5.74
6161,5.81
6162,5.85
6163,5.84
6164,5.77
6165,5.65
6166,5.53
6167,5.46
6168,5.46
6169,5.50
6170,5.56
6171,5.61
6172,5.66
6173,5.71
6174,5.82
6175,5.96
6176,6.16
6177,6.42
6178,6.82
6179,7.29
6180,7.78
6181,8.22
6182,8.67
6183,9.06
6184,9.46
6185,9.83
6186,10.30
6187,10.84
6188,11.54
6189,12.28
6190,13.06
6191,13.79
6192,14.50
6193,15.08
6194,15.59
6195,15.92
6196,16.20
6197,16.41
6198,16.69
6199,17.00
6200,17.40
6201,17.84
6202,18.36
6203,18.92
6204,19.52
6205,20.05
6206,20.52
6207,20.90
6208,21.22
6209,21.43
6210,21.51
6211,21.48
6212,21.39
6213,21.22
6214,21.01
6215,20.77
6216,20.55
6217,20.39
6218,20.20
6219,19.94
6220,19.55
6221,19.06
6222,18.42
6223,17.71
6224,16.93
6225,16.25
6226,15.69
6227,15.35
6228,15.12
6229,15.01
6230,14.86
6231,14.65
6232,14.20
6233,13.53
6234,12.60
6235,11.59
6236,10.54
6237,9.63
6238,8.82
6239,8.21
6240,7.76
6241,7.51
6242,7.37
6243,7.32
6244,7.29
6245,7.30
6246,7.32
6247,7.35
6248,7.36
6249,7.31
6250,7.18
6251,7.03
6252,6.90
6253,6.84
6254,6.82
6255,6.84
6256,6.97
6257,7.18
6258,7.44
6259,7.65
6260,7.79
6261,7.87
6262,7.96
6263,8.09
6264,8.33
6265,8.66
6266,9.09
6267,9.57
6268,10.06
6269,10.48
6270,10.80
6271,11.00
6272,11.10
6273,11.12
6274,11.13
6275,11.15
6276,11.22
6277,11.28
6278,11.34
6279,11.36
6280,11.35
6281,11.31
6282,11.31
6283,11.37
6284,11.48
6285,11.67
6286,11.92
6287,12.21
6288,12.51
6289,12.75
6290,12.93
6291,13.05
6292,13.13
6293,13.15
6294,13.14
6295,13.11
6296,13.09
6297,13.08
6298,13.08
6299,13.08
6300,13.12
6301,13.18
6302,13.22
6303,13.20
6304,13.10
6305,12.98
6306,12.84
6307,12.73
6308,12.63
6309,12.57
6310,12.57
6311,12.60
6312,12.63
6313,12.61
6314,12.49
6315,12.28
6316,11.96
6317,11.58
6318,11.13
6319,10.67
6320,10.15
6321,9.61
6322,9.05
6323,8.51
6324,8.03
6325,7.64
6326,7.33
6327,7.13
6328,7.04
6329,7.05
6330,7.09
6331,7.13
6332,7.13
6333,7.10
6334,7.03
6335,6.97
6336,6.98
6337,7.10
6338,7.29
6339,7.55
6340,7.82
6341,8.09
6342,8.30
6343,8.42
6344,8.47
6345,8.46
6346,8.43
6347,8.40
6348,8.38
6349,8.35
6350,8.29
6351,8.18
6352,7.99
6353,7.75
6354,7.46
6355,7.16
6356,6.89
6357,6.65
6358,6.43
6359,6.29
6360,6.22
6361,6.19
6362,6.13
6363,6.05
6364,6.00
6365,6.01
6366,6.10
6367,6.26
6368,6.48
6369,6.74
6370,7.03
6371,7.26
6372,7.47
6373,7.64
6374,7.84
6375,8.05
6376,8.37
6377,8.80
6378,9.45
6379,10.21
6380,11.09
6381,11.96
6382,12.79
6383,13.47
6384,13.95
6385,14.21
6386,14.36
6387,14.42
6388,14.49
6389,14.56
6390,14.74
6391,15.03
6392,15.45
6393,15.89
6394,16.35
6395,16.73
6396,17.06
6397,17.29
6398,17.44
6399,17.52
6400,17.60
6401,17.71
6402,17.88
6403,18.09
6404,18.34
6405,18.61
6406,18.88
6407,19.10
6408,19.20
6409,19.18
6410,19.01
6411,18.75
6412,18.38
6413,17.96
6414,17.51
6415,17.07
6416,16.64
6417,16.27
6418,15.88
6419,15.54
6420,15.17
6421,14.80
6422,14.35
6423,13.86
6424,13.25
6425,12.65
6426,12.00
6427,11.39
6428,10.71
6429,10.02
6430,9.26
6431,8.54
6432,7.74
6433,6.93
6434,6.03
6435,5.19
6436,4.33
6437,3.57
6438,2.85
6439,2.24
6440,1.66
6441,1.14
6442,0.61
6443,0.11
6444,-0.37
6445,-0.76
6446,-1.04
6447,-1.17
6448,-1.23
6449,-1.22
6450,-1.18
6451,-1.15
6452,-1.16
6453,-1.23
6454,-1.30
6455,-1.31
6456,-1.17
6457,-0.83
6458,-0.22
6459,0.59
6460,1.56
6461,2.51
6462,3.39
6463,4.09
6464,4.68
6465,5.14
6466,5.55
6467,5.90
6468,6.24
6469,6.55
6470,6.90
6471,7.16
6472,7.34
6473,7.38
6474,7.37
6475,7.32
6476,7.32
6477,7.37
6478,7.50
6479,7.71
6480,8.01
6481,8.33
6482,8.65
6483,8.92
6484,9.16
6485,9.36
6486,9.52
6487,9.67
6488,9.86
6489,10.12
6490,10.44
6491,10.77
6492,11.15
6493,11.53
6494,11.89
6495,12.15
6496,12.34
6497,12.42
6498,12.44
6499,12.37
6500,12.25
6501,12.06
6502,11.87
6503,11.71
6504,11.63
6505,11.60
6506,11.59
6507,11.57
6508,11.48
6509,11.34
6510,11.12
6511,10.86
6512,10.55
6513,10.28
6514,10.09
6515,10.07
6516,10.20
6517,10.48
6518,10.82
6519,11.19
6520,11.53
6521,11.78
6522,11.85
6523,11.73
6524,11.43
6525,11.02
6526,10.52
6527,10.01
6528,9.52
6529,9.10
6530,8.77
6531,8.57
6532,8.47
6533,8.42
6534,8.32
6535,8.14
6536,7.90
6537,7.63
6538,7.31
6539,6.99
6540,6.72
6541,6.56
6542,6.52
6543,6.58
6544,6.77
6545,7.00
6546,7.23
6547,7.39
6548,7.47
6549,7.48
6550,7.46
6551,7.43
6552,7.45
6553,7.57
6554,7.78
6555,8.06
6556,8.36
6557,8.62
6558,8.83
6559,8.98
6560,9.13
6561,9.29
6562,9.49
6563,9.73
6564,10.06
6565,10.41
6566,10.73
6567,10.94
6568,11.09
6569,11.15
6570,11.18
6571,11.18
6572,11.22
6573,11.34
6574,11.51
6575,11.69
6576,11.88
6577,12.05
6578,12.21
6579,12.29
6580,12.33
6581,12.33
6582,12.30
6583,12.20
6584,12.04
6585,11.83
6586,11.63
6587,11.44
6588,11.28
6589,11.13
6590,11.01
6591,10.93
6592,10.83
6593,10.73
6594,10.57
6595,10.39
6596,10.18
6597,10.00
6598,9.90
6599,9.83
6600,9.77
6601,9.69
6602,9.60
6603,9.51
6604,9.38
6605,9.20
6606,9.01
6607,8.87
6608,8.74
6609,8.67
6610,8.61
6611,8.58
6612,8.55
6613,8.51
6614,8.38
6615,8.18
6616,7.87
6617,7.55
6618,7.19
6619,6.82
6620,6.35
6621,5.79
6622,5.13
6623,4.49
6624,3.85
6625,3.29
6626,2.75
6627,2.33
6628,1.98
6629,1.75
6630,1.54
6631,1.42
6632,1.34
6633,1.32
6634,1.24
6635,1.08
6636,0.82
6637,0.52
6638,0.14
6639,-0.29
6640,-0.79
6641,-1.27
6642,-1.73
6643,-2.08
6644,-2.31
6645,-2.39
6646,-2.37
6647,-2.30
6648,-2.24
6649,-2.20
6650,-2.24
6651,-2.36
6652,-2.56
6653,-2.80
6654,-3.04
6655,-3.23
6656,-3.32
6657,-3.30
6658,-3.14
6659,-2.93
6660,-2.70
6661,-2.53
6662,-2.38
6663,-2.24
6664,-2.05
6665,-1.83
6666,-1.51
6667,-1.11
6668,-0.55
6669,0.14
6670,0.94
6671,1.74
6672,2.50
6673,3.12
6674,3.61
6675,3.92
6676,4.13
6677,4.20
6678,4.25
6679,4.30
6680,4.53
6681,4.90
6682,5.48
6683,6.15
6684,6.95
6685,7.77
6686,8.64
6687,9.43
6688,10.15
6689,10.70
6690,11.18
6691,11.55
6692,11.86
6693,12.12
6694,12.43
6695,12.78
6696,13.17
6697,13.53
6698,13.85
6699,14.09
6700,14.19
6701,14.11
6702,13.82
6703,13.40
6704,12.90
6705,12.41
6706,12.01
6707,11.75
6708,11.60
6709,11.52
6710,11.43
6711,11.30
6712,11.05
6713,10.70
6714,10.18
6715,9.58
6716,8.99
6717,8.49
6718,8.04
6719,7.64
6720,7.24
6721,6.94
6722,6.74
6723,6.67
6724,6.65
6725,6.68
6726,6.77
6727,6.93
6728,7.08
6729,7.16
6730,7.08
6731,6.84
6732,6.44
6733,5.99
6734,5.57
6735,5.26
6736,5.10
6737,5.10
6738,5.27
6739,5.58
6740,5.95
6741,6.29
6742,6.52
6743,6.68
6744,6.75
6745,6.78
6746,6.75
6747,6.66
6748,6.53
6749,6.41
6750,6.32
6751,6.29
6752,6.32
6753,6.38
6754,6.47
6755,6.56
6756,6.65
6757,6.73
6758,6.83
6759,6.95
6760,7.09
6761,7.21
6762,7.30
6763,7.35
6764,7.38
6765,7.38
6766,7.36
6767,7.32
6768,7.29
6769,7.29
6770,7.36
6771,7.54
6772,7.83
6773,8.19
6774,8.59
6775,9.01
6776,9.42
6777,9.77
6778,10.06
6779,10.30
6780,10.52
6781,10.70
6782,10.81
6783,10.85
6784,10.83
6785,10.76
6786,10.63
6787,10.48
6788,10.38
6789,10.35
6790,10.35
6791,10.40
6792,10.47
6793,10.56
6794,10.59
6795,10.54
6796,10.38
6797,10.15
6798,9.81
6799,9.44
6800,9.00
6801,8.56
6802,8.09
6803,7.61
6804,7.16
6805,6.77
6806,6.44
6807,6.18
6808,5.97
6809,5.81
6810,5.71
6811,5.63
6812,5.52
6813,5.41
6814,5.30
6815,5.26
6816,5.34
6817,5.58
6818,5.99
6819,6.50
6820,7.05
6821,7.56
6822,8.00
6823,8.30
6824,8.44
6825,8.40
6826,8.26
6827,8.06
6828,7.89
6829,7.77
6830,7.73
6831,7.70
6832,7.63
6833,7.51
6834,7.35
6835,7.14
6836,6.85
6837,6.52
6838,6.23
6839,6.02
6840,5.85
6841,5.71
6842,5.58
6843,5.46
6844,5.33
6845,5.18
6846,5.04
6847,4.94
6848,4.93
6849,5.01
6850,5.23
6851,5.55
6852,5.97
6853,6.39
6854,6.77
6855,7.06
6856,7.31
6857,7.54
6858,7.83
6859,8.18
6860,8.61
6861,9.07
6862,9.62
6863,10.19
6864,10.73
6865,11.15
6866,11.44
6867,11.60
6868,11.70
6869,11.75
6870,11.83
6871,11.93
6872,12.12
6873,12.40
6874,12.73
6875,13.04
6876,13.23
6877,13.27
6878,13.14
6879,12.89
6880,12.55
6881,12.16
6882,11.77
6883,11.44
6884,11.19
6885,11.04
6886,10.99
6887,10.99
6888,11.01
6889,11.00
6890,10.99
6891,10.99
6892,11.02
6893,11.08
6894,11.17
6895,11.29
6896,11.44
6897,11.63
6898,11.80
6899,11.92
6900,11.97
6901,11.95
6902,11.85
6903,11.70
6904,11.51
6905,11.31
6906,11.20
6907,11.20
6908,11.31
6909,11.47
6910,11.61
6911,11.70
6912,11.72
6913,11.66
6914,11.51
6915,11.31
6916,11.06
6917,10.86
6918,10.70
6919,10.59
6920,10.46
6921,10.29
6922,10.05
6923,9.76
6924,9.40
6925,9.00
6926,8.59
6927,8.27
6928,8.07
6929,8.03
6930,8.02
6931,8.00
6932,7.93
6933,7.78
6934,7.51
6935,7.12
6936,6.67
6937,6.23
6938,5.90
6939,5.71
6940,5.74
6941,5.95
6942,6.30
6943,6.70
6944,7.08
6945,7.44
6946,7.79
6947,8.12
6948,8.40
6949,8.64
6950,8.84
6951,9.00
6952,9.08
6953,9.01
6954,8.80
6955,8.50
6956,8.19
6957,7.93
6958,7.77
6959,7.76
6960,7.88
6961,8.09
6962,8.28
6963,8.35
6964,8.29
6965,8.13
6966,7.89
6967,7.62
6968,7.40
6969,7.31
6970,7.35
6971,7.55
6972,7.82
6973,8.07
6974,8.18
6975,8.10
6976,7.81
6977,7.36
6978,6.76
6979,6.07
6980,5.35
6981,4.66
6982,4.02
6983,3.46
6984,2.97
6985,2.56
6986,2.20
6987,1.97
6988,1.85
6989,1.90
6990,2.01
6991,2.11
6992,2.13
6993,2.07
6994,1.95
6995,1.80
6996,1.64
6997,1.48
6998,1.35
6999,1.29
7000,1.34
7001,1.49
7002,1.69
7003,1.91
7004,2.13
7005,2.37
7006,2.61
7007,2.85
7008,3.09
7009,3.33
7010,3.57
7011,3.80
7012,4.03
7013,4.20
7014,4.34
7015,4.43
7016,4.47
7017,4.49
7018,4.54
7019,4.59
7020,4.68
7021,4.79
7022,4.98
7023,5.21
7024,5.48
7025,5.75
7026,6.03
7027,6.27
7028,6.40
7029,6.40
7030,6.32
7031,6.18
7032,6.06
7033,5.96
7034,5.96
7035,6.07
7036,6.32
7037,6.64
7038,7.02
7039,7.41
7040,7.82
7041,8.23
7042,8.65
7043,9.06
7044,9.50
7045,9.91
7046,10.31
7047,10.64
7048,10.89
7049,11.03
7050,11.06
7051,10.99
7052,10.89
7053,10.77
7054,10.64
7055,10.51
7056,10.47
7057,10.51
7058,10.66
7059,10.88
7060,11.17
7061,11.49
7062,11.80
7063,12.08
7064,12.31
7065,12.49
7066,12.59
7067,12.62
7068,12.63
7069,12.63
7070,12.59
7071,12.50
7072,12.37
7073,12.19
7074,11.93
7075,11.64
7076,11.34
7077,11.10
7078,10.90
7079,10.77
7080,10.67
7081,10.65
7082,10.64
7083,10.66
7084,10.64
7085,10.61
7086,10.56
7087,10.51
7088,10.42
7089,10.38
7090,10.33
7091,10.29
7092,10.16
7093,9.93
7094,9.57
7095,9.16
7096,8.71
7097,8.29
7098,7.89
7099,7.55
7100,7.23
7101,6.94
7102,6.61
7103,6.20
7104,5.66
7105,5.04
7106,4.34
7107,3.65
7108,3.00
7109,2.48
7110,2.06
7111,1.78
7112,1.54
7113,1.34
7114,1.13
7115,0.93
7116,0.70
7117,0.47
7118,0.21
7119,-0.05
7120,-0.32
7121,-0.59
7122,-0.87
7123,-1.12
7124,-1.37
7125,-1.58
7126,-1.79
7127,-1.95
7128,-2.09
7129,-2.21
7130,-2.37
7131,-2.54
7132,-2.69
7133,-2.80
7134,-2.85
7135,-2.85
7136,-2.73
7137,-2.54
7138,-2.26
7139,-1.94
7140,-1.52
7141,-1.03
7142,-0.43
7143,0.21
7144,0.99
7145,1.87
7146,2.90
7147,3.96
7148,5.05
7149,6.02
7150,6.91
7151,7.63
7152,8.28
7153,8.78
7154,9.28
7155,9.74
7156,10.28
7157,10.85
7158,11.54
7159,12.24
7160,13.02
7161,13.76
7162,14.52
7163,15.19
7164,15.85
7165,16.43
7166,16.98
7167,17.45
7168,17.90
7169,18.27
7170,18.60
7171,18.86
7172,19.10
7173,19.27
7174,19.39
7175,19.41
7176,19.38
7177,19.31
7178,19.24
7179,19.14
7180,19.03
7181,18.91
7182,18.81
7183,18.72
7184,18.62
7185,18.48
7186,18.30
7187,18.10
7188,17.85
7189,17.62
7190,17.31
7191,16.98
7192,16.69
7193,15.78
7194,16.00
7195,18.01
7196,18.08
7197,12.47
7198,8.19
7199,19.23
7200,31.01
