1,-0.57
2,0.39
3,3.47
4,7.58
5,10.09
6,9.37
7,6.75
8,5.31
9,6.45
10,8.32
11,7.96
12,4.75
13,1.06
14,-0.39
15,0.76
16,2.70
17,3.76
18,3.72
19,3.33
20,2.75
21,1.88
22,1.03
23,1.06
24,1.90
25,2.16
26,0.59
27,-2.07
28,-3.69
29,-3.14
30,-1.75
31,-1.48
32,-2.42
33,-2.48
34,-0.19
35,3.29
36,5.08
37,3.56
38,-0.10
39,-3.35
40,-4.73
41,-4.64
42,-4.02
43,-3.16
44,-1.79
45,-0.01
46,1.39
47,1.66
48,1.01
49,0.46
50,0.83
51,1.96
52,2.75
53,1.91
54,-0.70
55,-3.89
56,-5.83
57,-5.55
58,-3.49
59,-1.01
60,0.95
61,2.33
62,3.63
63,4.89
64,5.56
65,5.01
66,3.42
67,1.86
68,1.79
69,3.79
70,6.97
71,9.12
72,8.63
73,5.83
74,3.27
75,3.36
76,6.13
77,9.13
78,10.16
79,9.57
80,9.30
81,10.10
82,10.84
83,10.34
84,9.35
85,9.38
86,10.42
87,10.55
88,8.55
89,5.58
90,4.41
91,6.22
92,9.24
93,10.56
94,9.54
95,8.29
96,8.99
97,11.29
98,13.19
99,13.67
100,13.75
101,14.63
102,15.99
103,16.42
104,15.48
105,14.16
106,13.65
107,13.92
108,14.06
109,13.41
110,12.70
111,13.03
112,14.38
113,15.27
114,14.38
115,12.27
116,10.95
117,12.03
118,14.87
119,17.51
120,18.55
121,18.34
122,17.92
123,17.62
124,16.55
125,13.84
126,9.70
127,5.60
128,3.11
129,3.02
130,4.69
131,6.58
132,7.30
133,6.73
134,5.53
135,4.51
136,3.93
137,4.02
138,4.79
139,6.07
140,7.17
141,7.42
142,6.56
143,4.73
144,2.56
145,0.86
146,0.28
147,0.82
148,1.72
149,2.19
150,2.19
151,2.58
152,4.29
153,7.35
154,10.54
155,12.34
156,11.76
157,9.15
158,5.79
159,3.23
160,2.16
161,2.12
162,1.99
163,1.05
164,-0.53
165,-2.09
166,-3.33
167,-4.51
168,-6.06
169,-7.75
170,-8.70
171,-8.11
172,-6.40
173,-5.08
174,-5.17
175,-5.91
176,-5.40
177,-2.70
178,0.95
179,3.24
180,3.31
181,2.43
182,2.59
183,4.14
184,5.64
185,5.37
186,3.39
187,1.38
188,1.05
189,2.48
190,4.18
191,4.42
192,3.08
193,1.68
194,1.76
195,3.06
196,3.65
197,1.86
198,-1.68
199,-4.33
200,-4.09
201,-1.50
202,1.11
203,2.01
204,1.75
205,2.03
206,3.71
207,5.84
208,6.60
209,5.02
210,2.10
211,0.16
212,0.96
213,4.05
214,7.20
215,8.28
216,7.10
217,5.23
218,4.41
219,4.99
220,6.03
221,6.35
222,5.51
223,3.85
224,2.43
225,2.29
226,3.59
227,5.05
228,5.11
229,3.78
230,2.77
231,3.79
232,6.43
233,8.62
234,8.92
235,8.05
236,7.51
237,7.50
238,6.52
239,3.68
240,0.25
241,-1.31
242,-0.18
243,2.00
244,3.06
245,2.57
246,1.36
247,-0.06
248,-1.95
249,-3.72
250,-3.81
251,-1.26
252,2.30
253,4.03
254,2.58
255,-0.41
256,-2.15
257,-1.50
258,0.08
259,0.44
260,-0.93
261,-2.57
262,-2.94
263,-2.17
264,-1.68
265,-2.55
266,-4.24
267,-5.22
268,-4.66
269,-3.21
270,-2.18
271,-2.08
272,-2.19
273,-1.46
274,0.08
275,1.32
276,1.26
277,0.19
278,-0.73
279,-0.78
280,-0.60
281,-1.42
282,-3.54
283,-5.71
284,-6.47
285,-5.57
286,-4.35
287,-4.24
288,-5.35
289,-6.37
290,-6.29
291,-5.33
292,-4.91
293,-6.01
294,-8.14
295,-9.75
296,-9.86
297,-9.04
298,-8.61
299,-9.11
300,-9.92
301,-10.11
302,-9.15
303,-7.07
304,-4.28
305,-1.75
306,-0.65
307,-1.45
308,-3.01
309,-3.45
310,-1.95
311,0.12
312,0.72
313,-0.81
314,-2.80
315,-3.29
316,-2.08
317,-1.03
318,-1.40
319,-2.41
320,-2.13
321,-0.13
322,1.90
323,1.92
324,0.14
325,-1.44
326,-1.36
327,-0.38
328,0.19
329,0.43
330,1.73
331,4.42
332,6.89
333,7.29
334,6.05
335,5.44
336,6.90
337,9.27
338,10.19
339,8.67
340,6.23
341,4.90
342,4.97
343,4.95
344,3.83
345,2.39
346,2.04
347,2.93
348,3.84
349,3.91
350,3.49
351,3.38
352,3.56
353,3.63
354,3.47
355,3.54
356,4.03
357,4.58
358,4.45
359,3.37
360,1.80
361,0.63
362,0.25
363,0.19
364,-0.38
365,-1.72
366,-3.03
367,-3.08
368,-1.70
369,-0.18
370,0.04
371,-0.88
372,-1.28
373,0.21
374,2.98
375,5.14
376,5.47
377,4.47
378,3.32
379,2.39
380,1.44
381,0.57
382,0.59
383,1.72
384,3.05
385,3.33
386,2.50
387,1.68
388,1.79
389,2.58
390,3.06
391,2.91
392,2.87
393,3.65
394,4.87
395,5.20
396,4.12
397,2.36
398,1.22
399,0.94
400,1.04
401,1.24
402,1.94
403,3.32
404,5.03
405,6.67
406,8.24
407,9.75
408,10.89
409,11.42
410,11.56
411,11.71
412,12.03
413,12.17
414,11.40
415,9.20
416,6.10
417,3.80
418,3.84
419,6.18
420,8.89
421,10.07
422,9.40
423,8.26
424,7.60
425,6.97
426,5.23
427,2.44
428,-0.11
429,-1.34
430,-1.87
431,-3.10
432,-5.31
433,-6.92
434,-6.11
435,-2.68
436,1.30
437,3.43
438,2.97
439,1.39
440,0.57
441,1.10
442,2.08
443,2.27
444,1.16
445,-0.75
446,-2.29
447,-2.44
448,-1.19
449,0.09
450,0.17
451,-0.50
452,-0.56
453,0.38
454,0.83
455,-0.61
456,-2.97
457,-3.57
458,-1.11
459,2.31
460,3.04
461,-0.32
462,-5.01
463,-6.81
464,-4.10
465,0.56
466,3.54
467,3.57
468,2.42
469,2.27
470,3.55
471,5.06
472,6.09
473,6.95
474,8.09
475,9.00
476,8.75
477,7.15
478,5.44
479,5.00
480,5.76
481,6.20
482,5.30
483,3.80
484,3.19
485,3.76
486,4.44
487,4.51
488,4.51
489,5.27
490,6.39
491,6.78
492,6.22
493,5.80
494,6.18
495,6.48
496,5.35
497,3.21
498,2.10
499,3.31
500,5.37
501,5.77
502,4.02
503,2.35
504,2.57
505,3.52
506,2.46
507,-1.17
508,-4.74
509,-5.30
510,-3.27
511,-1.51
512,-1.75
513,-2.49
514,-1.42
515,1.55
516,3.93
517,3.93
518,2.17
519,0.67
520,0.03
521,-0.70
522,-2.40
523,-4.33
524,-5.27
525,-5.04
526,-4.94
527,-6.10
528,-7.89
529,-8.53
530,-7.26
531,-5.40
532,-5.20
533,-7.52
534,-10.87
535,-12.80
536,-12.04
537,-9.34
538,-6.23
539,-3.78
540,-2.14
541,-1.18
542,-0.61
543,-0.04
544,0.76
545,1.39
546,1.45
547,1.26
548,1.60
549,2.42
550,2.79
551,2.00
552,0.35
553,-1.42
554,-3.06
555,-4.61
556,-5.65
557,-5.35
558,-3.73
559,-2.25
560,-2.86
561,-5.76
562,-8.90
563,-9.66
564,-7.67
565,-5.03
566,-4.06
567,-4.87
568,-5.84
569,-5.94
570,-5.93
571,-7.02
572,-8.85
573,-9.62
574,-8.14
575,-5.20
576,-2.98
577,-3.07
578,-4.84
579,-6.23
580,-5.96
581,-4.85
582,-4.76
583,-6.42
584,-8.30
585,-8.22
586,-5.73
587,-2.91
588,-2.03
589,-3.36
590,-5.26
591,-6.27
592,-6.29
593,-5.86
594,-4.93
595,-3.21
596,-1.28
597,-0.43
598,-1.20
599,-2.44
600,-2.49
601,-1.05
602,0.41
603,0.38
604,-1.15
605,-2.94
606,-4.10
607,-4.75
608,-5.40
609,-6.05
610,-6.52
611,-6.79
612,-7.05
613,-7.00
614,-6.46
615,-6.00
616,-6.63
617,-8.18
618,-9.08
619,-7.84
620,-5.18
621,-3.58
622,-4.89
623,-8.29
624,-11.09
625,-11.25
626,-9.18
627,-7.02
628,-6.71
629,-8.47
630,-10.76
631,-11.61
632,-10.36
633,-8.39
634,-7.66
635,-8.71
636,-10.50
637,-11.71
638,-11.77
639,-10.78
640,-9.16
641,-7.74
642,-7.27
643,-7.66
644,-7.95
645,-7.40
646,-6.31
647,-5.66
648,-5.90
649,-6.57
650,-6.65
651,-5.86
652,-5.13
653,-5.92
654,-8.41
655,-10.84
656,-10.92
657,-8.12
658,-4.09
659,-1.13
660,-0.28
661,-1.13
662,-2.79
663,-4.68
664,-6.18
665,-6.61
666,-5.71
667,-4.18
668,-3.22
669,-3.38
670,-4.08
671,-4.46
672,-3.97
673,-2.58
674,-0.68
675,0.98
676,1.17
677,-0.70
678,-3.89
679,-6.38
680,-6.75
681,-5.45
682,-4.61
683,-5.75
684,-8.51
685,-11.01
686,-12.26
687,-12.89
688,-14.04
689,-15.51
690,-16.53
691,-16.74
692,-16.91
693,-17.27
694,-17.45
695,-16.94
696,-16.20
697,-15.73
698,-15.74
699,-16.07
700,-16.98
701,-18.68
702,-20.73
703,-22.04
704,-22.09
705,-21.67
706,-21.99
707,-23.09
708,-23.84
709,-23.29
710,-21.82
711,-20.26
712,-18.79
713,-16.88
714,-14.75
715,-13.74
716,-15.11
717,-18.29
718,-21.11
719,-21.98
720,-21.51
721,-21.75
722,-23.46
723,-25.31
724,-25.42
725,-23.81
726,-22.22
727,-22.02
728,-22.64
729,-22.44
730,-20.69
731,-18.33
732,-16.72
733,-16.44
734,-16.57
735,-16.03
736,-14.56
737,-13.39
738,-13.63
739,-15.27
740,-16.62
741,-16.17
742,-13.54
743,-10.03
744,-7.05
745,-5.43
746,-4.86
747,-4.81
748,-4.72
749,-4.25
750,-3.16
751,-1.76
752,-0.96
753,-1.59
754,-2.97
755,-3.25
756,-1.15
757,1.85
758,2.40
759,-1.44
760,-7.53
761,-11.24
762,-9.92
763,-5.57
764,-2.40
765,-2.45
766,-4.04
767,-4.52
768,-3.37
769,-2.31
770,-2.67
771,-3.80
772,-3.81
773,-1.70
774,1.46
775,3.22
776,2.22
777,-0.63
778,-2.77
779,-2.24
780,0.65
781,3.67
782,4.72
783,3.60
784,2.19
785,2.44
786,4.32
787,5.63
788,4.48
789,1.38
790,-1.44
791,-2.47
792,-1.88
793,-0.50
794,1.23
795,2.97
796,3.94
797,3.68
798,2.77
799,2.48
800,3.30
801,4.42
802,4.42
803,2.92
804,0.72
805,-0.82
806,-1.32
807,-1.22
808,-1.11
809,-0.90
810,-0.55
811,-0.51
812,-1.80
813,-4.77
814,-8.63
815,-11.80
816,-13.25
817,-12.96
818,-12.01
819,-11.56
820,-12.13
821,-13.09
822,-13.26
823,-11.93
824,-9.50
825,-7.18
826,-6.17
827,-6.84
828,-8.60
829,-10.27
830,-10.49
831,-8.62
832,-5.09
833,-1.59
834,0.20
835,-0.26
836,-1.69
837,-2.36
838,-1.77
839,-1.21
840,-1.77
841,-2.84
842,-2.72
843,-1.05
844,0.33
845,-0.66
846,-3.74
847,-6.30
848,-6.13
849,-3.71
850,-1.54
851,-1.58
852,-3.64
853,-6.22
854,-8.19
855,-9.35
856,-9.70
857,-9.02
858,-7.19
859,-4.71
860,-2.61
861,-1.60
862,-1.47
863,-1.34
864,-0.71
865,0.13
866,0.33
867,-0.52
868,-1.73
869,-2.17
870,-1.54
871,-1.04
872,-2.08
873,-4.64
874,-7.07
875,-7.68
876,-6.39
877,-4.55
878,-3.57
879,-3.68
880,-4.30
881,-4.86
882,-5.12
883,-4.98
884,-4.29
885,-3.24
886,-2.65
887,-3.34
888,-5.12
889,-6.65
890,-6.70
891,-5.34
892,-3.63
893,-2.31
894,-1.43
895,-0.92
896,-1.19
897,-2.49
898,-4.41
899,-5.99
900,-6.67
901,-6.49
902,-6.03
903,-5.70
904,-5.58
905,-5.47
906,-5.48
907,-6.06
908,-7.69
909,-10.12
910,-12.68
911,-14.69
912,-16.10
913,-16.99
914,-17.17
915,-16.15
916,-13.98
917,-11.65
918,-10.58
919,-11.21
920,-12.49
921,-12.62
922,-10.85
923,-8.21
924,-6.76
925,-7.72
926,-10.46
927,-13.06
928,-14.24
929,-14.23
930,-13.94
931,-13.58
932,-12.63
933,-11.07
934,-10.17
935,-11.45
936,-14.86
937,-18.42
938,-20.17
939,-19.66
940,-18.32
941,-17.43
942,-17.04
943,-16.29
944,-14.91
945,-13.77
946,-13.97
947,-15.66
948,-18.18
949,-20.71
950,-22.81
951,-24.08
952,-24.01
953,-22.54
954,-20.35
955,-18.55
956,-17.79
957,-17.91
958,-18.29
959,-18.35
960,-18.07
961,-17.80
962,-17.61
963,-17.05
964,-15.82
965,-14.58
966,-14.55
967,-16.28
968,-18.52
969,-19.29
970,-18.01
971,-16.37
972,-16.33
973,-17.84
974,-18.90
975,-17.95
976,-15.41
977,-12.90
978,-11.46
979,-11.20
980,-12.11
981,-14.15
982,-16.41
983,-17.12
984,-15.37
985,-12.68
986,-11.86
987,-13.95
988,-16.84
989,-17.49
990,-15.56
991,-13.71
992,-14.41
993,-16.91
994,-18.34
995,-17.26
996,-15.40
997,-15.41
998,-17.89
999,-20.80
1000,-22.03
1001,-21.11
1002,-19.42
1003,-18.31
1004,-18.25
1005,-18.74
1006,-19.50
1007,-20.58
1008,-22.03
1009,-23.37
1010,-24.32
1011,-25.07
1012,-26.32
1013,-28.24
1014,-30.26
1015,-31.47
1016,-31.41
1017,-30.12
1018,-28.36
1019,-27.12
1020,-27.23
1021,-28.40
1022,-29.37
1023,-28.90
1024,-27.08
1025,-25.36
1026,-25.35
1027,-27.33
1028,-29.84
1029,-30.99
1030,-29.96
1031,-27.61
1032,-25.49
1033,-24.66
1034,-25.21
1035,-26.68
1036,-28.28
1037,-29.15
1038,-28.53
1039,-26.59
1040,-24.60
1041,-24.05
1042,-24.94
1043,-25.73
1044,-24.89
1045,-22.90
1046,-21.54
1047,-21.98
1048,-23.12
1049,-23.00
1050,-21.17
1051,-19.39
1052,-19.65
1053,-21.90
1054,-23.58
1055,-22.20
1056,-17.75
1057,-13.17
1058,-11.61
1059,-14.00
1060,-18.44
1061,-22.17
1062,-23.39
1063,-22.16
1064,-19.54
1065,-16.87
1066,-15.02
1067,-14.36
1068,-14.41
1069,-14.62
1070,-14.27
1071,-13.23
1072,-11.72
1073,-10.39
1074,-9.70
1075,-9.75
1076,-9.61
1077,-8.27
1078,-5.33
1079,-2.26
1080,-0.74
1081,-1.47
1082,-3.07
1083,-3.91
1084,-3.11
1085,-1.38
1086,0.59
1087,2.42
1088,4.37
1089,6.30
1090,7.91
1091,8.65
1092,8.90
1093,9.38
1094,10.72
1095,12.47
1096,13.64
1097,13.42
1098,12.19
1099,11.10
1100,11.37
1101,13.22
1102,15.81
1103,17.71
1104,18.05
1105,16.96
1106,15.20
1107,13.37
1108,11.66
1109,10.23
1110,9.39
1111,9.27
1112,9.55
1113,9.70
1114,9.35
1115,8.56
1116,7.73
1117,7.50
1118,8.27
1119,9.96
1120,11.55
1121,11.85
1122,10.49
1123,8.62
1124,7.91
1125,8.92
1126,10.48
1127,10.87
1128,9.50
1129,7.29
1130,5.66
1131,5.23
1132,5.74
1133,6.55
1134,7.48
1135,8.59
1136,9.71
1137,10.35
1138,10.64
1139,11.46
1140,13.45
1141,15.80
1142,16.98
1143,16.49
1144,15.57
1145,15.64
1146,16.58
1147,16.87
1148,15.72
1149,14.03
1150,13.42
1151,14.15
1152,15.11
1153,15.14
1154,14.48
1155,14.13
1156,14.55
1157,15.35
1158,15.98
1159,16.47
1160,16.89
1161,17.05
1162,16.70
1163,16.14
1164,15.99
1165,16.20
1166,15.94
1167,14.55
1168,12.38
1169,10.42
1170,9.21
1171,8.65
1172,8.69
1173,9.77
1174,11.95
1175,14.30
1176,15.37
1177,14.89
1178,13.84
1179,13.42
1180,13.62
1181,13.74
1182,13.42
1183,13.02
1184,12.55
1185,11.27
1186,8.83
1187,6.32
1188,5.45
1189,6.54
1190,7.82
1191,7.63
1192,6.38
1193,6.04
1194,7.58
1195,9.32
1196,9.61
1197,9.26
1198,10.43
1199,13.13
1200,12.66
