1,115.26
2,179.65
3,204.80
4,206.78
5,209.88
6,216.67
7,214.58
8,199.63
9,174.23
10,141.86
11,102.28
12,61.13
13,25.11
14,2.78
15,-1.21
16,14.37
17,47.27
18,90.39
19,136.83
20,177.65
21,208.71
22,225.74
23,230.01
24,221.77
25,204.06
26,177.84
27,144.90
28,106.23
29,64.06
30,21.25
31,-17.91
32,-49.89
33,-70.85
34,-80.54
35,-78.94
36,-70.52
37,-58.19
38,-47.41
39,-39.67
40,-37.19
41,-38.15
42,-41.69
43,-45.05
44,-47.21
45,-47.29
46,-45.66
47,-43.26
48,-40.86
49,-39.35
50,-38.69
51,-38.79
52,-39.09
53,-39.25
54,-38.99
55,-38.33
56,-37.34
57,-36.33
58,-35.39
59,-34.71
60,-34.11
61,-33.62
62,-33.06
63,-32.49
64,-31.78
65,-30.97
66,-29.95
67,-28.83
68,-27.58
69,-26.41
70,-25.28
71,-24.35
72,-23.51
73,-22.83
74,-22.18
75,-21.67
76,-21.21
77,-20.87
78,-20.54
79,-20.27
80,-19.95
81,-19.62
82,-19.16
83,-18.64
84,-18.03
85,-17.44
86,-16.85
87,-16.33
88,-15.84
89,-15.50
90,-15.25
91,-15.10
92,-14.86
93,-14.53
94,-14.02
95,-13.37
96,-12.54
97,-11.65
98,-10.76
99,-9.98
100,-9.31
101,-8.85
102,-8.59
103,-8.54
104,-8.59
105,-8.67
106,-8.69
107,-8.64
108,-8.45
109,-8.16
110,-7.77
111,-7.41
112,-7.12
113,-6.94
114,-6.87
115,-6.94
116,-7.13
117,-7.42
118,-7.79
119,-8.20
120,-8.72
121,-9.30
122,-9.96
123,-10.61
124,-11.30
125,-11.99
126,-12.76
127,-13.53
128,-14.32
129,-15.01
130,-15.68
131,-16.24
132,-16.85
133,-17.43
134,-18.04
135,-18.55
136,-19.07
137,-19.51
138,-20.03
139,-20.61
140,-21.32
141,-22.09
142,-22.92
143,-23.68
144,-24.39
145,-24.98
146,-25.48
147,-25.83
148,-26.05
149,-26.15
150,-26.27
151,-26.42
152,-26.70
153,-27.05
154,-27.50
155,-27.98
156,-28.44
157,-28.85
158,-29.25
159,-29.61
160,-29.91
161,-30.09
162,-30.14
163,-30.08
164,-29.92
165,-29.69
166,-29.35
167,-28.92
168,-28.47
169,-28.05
170,-27.68
171,-27.37
172,-27.15
173,-27.03
174,-27.05
175,-27.18
176,-27.30
177,-27.37
178,-27.40
179,-27.45
180,-27.54
181,-27.66
182,-27.82
183,-27.99
184,-28.20
185,-28.37
186,-28.50
187,-28.56
188,-28.58
189,-28.63
190,-28.80
191,-29.08
192,-29.49
193,-29.91
194,-30.33
195,-30.67
196,-30.94
197,-31.17
198,-31.49
199,-31.95
200,-32.61
201,-33.37
202,-34.26
203,-35.16
204,-36.00
205,-36.59
206,-36.87
207,-36.86
208,-36.73
209,-36.57
210,-36.53
211,-36.64
212,-37.03
213,-37.61
214,-38.32
215,-38.99
216,-39.57
217,-40.04
218,-40.41
219,-40.63
220,-40.79
221,-40.89
222,-41.03
223,-41.14
224,-41.24
225,-41.29
226,-41.34
227,-41.39
228,-41.46
229,-41.58
230,-41.80
231,-42.10
232,-42.40
233,-42.65
234,-42.84
235,-42.95
236,-42.96
237,-42.85
238,-42.63
239,-42.38
240,-42.14
241,-41.91
242,-41.67
243,-41.42
244,-41.18
245,-41.01
246,-40.95
247,-41.00
248,-41.12
249,-41.31
250,-41.60
251,-41.95
252,-42.30
253,-42.55
254,-42.69
255,-42.74
256,-42.73
257,-42.67
258,-42.58
259,-42.52
260,-42.50
261,-42.51
262,-42.46
263,-42.29
264,-41.98
265,-41.55
266,-41.05
267,-40.57
268,-40.19
269,-39.95
270,-39.83
271,-39.84
272,-39.96
273,-40.15
274,-40.28
275,-40.31
276,-40.17
277,-39.93
278,-39.57
279,-39.16
280,-38.72
281,-38.31
282,-37.88
283,-37.41
284,-36.86
285,-36.27
286,-35.63
287,-34.99
288,-34.29
289,-33.58
290,-32.82
291,-32.13
292,-31.46
293,-30.88
294,-30.28
295,-29.76
296,-29.34
297,-29.11
298,-28.98
299,-29.01
300,-29.11
301,-29.31
302,-29.47
303,-29.50
304,-29.25
305,-28.78
306,-28.10
307,-27.33
308,-26.47
309,-25.63
310,-24.87
311,-24.35
312,-24.06
313,-24.03
314,-24.06
315,-24.09
316,-23.99
317,-23.83
318,-23.51
319,-23.12
320,-22.58
321,-21.98
322,-21.34
323,-20.76
324,-20.22
325,-19.74
326,-19.28
327,-18.88
328,-18.54
329,-18.30
330,-18.11
331,-18.01
332,-17.97
333,-18.04
334,-18.13
335,-18.25
336,-18.45
337,-18.74
338,-19.10
339,-19.48
340,-19.80
341,-20.03
342,-20.16
343,-20.16
344,-20.04
345,-19.78
346,-19.49
347,-19.23
348,-19.15
349,-19.26
350,-19.59
351,-20.14
352,-20.86
353,-21.64
354,-22.36
355,-22.91
356,-23.26
357,-23.44
358,-23.44
359,-23.32
360,-23.14
361,-22.96
362,-22.77
363,-22.61
364,-22.42
365,-22.13
366,-21.64
367,-21.00
368,-20.21
369,-19.38
370,-18.46
371,-17.52
372,-16.56
373,-15.74
374,-14.99
375,-14.36
376,-13.73
377,-13.16
378,-12.54
379,-11.89
380,-11.15
381,-10.38
382,-9.61
383,-8.95
384,-8.44
385,-8.15
386,-8.06
387,-8.19
388,-8.49
389,-8.92
390,-9.41
391,-9.88
392,-10.33
393,-10.74
394,-11.16
395,-11.57
396,-11.99
397,-12.40
398,-12.85
399,-13.26
400,-13.62
401,-13.84
402,-14.01
403,-14.17
404,-14.43
405,-14.77
406,-15.23
407,-15.76
408,-16.43
409,-17.13
410,-17.85
411,-18.51
412,-19.12
413,-19.65
414,-20.10
415,-20.45
416,-20.75
417,-20.98
418,-21.16
419,-21.29
420,-21.35
421,-21.35
422,-21.27
423,-21.16
424,-21.01
425,-20.84
426,-20.57
427,-20.15
428,-19.58
429,-18.93
430,-18.22
431,-17.50
432,-16.76
433,-16.11
434,-15.63
435,-15.39
436,-15.31
437,-15.40
438,-15.59
439,-15.82
440,-16.01
441,-16.14
442,-16.26
443,-16.37
444,-16.44
445,-16.50
446,-16.64
447,-16.87
448,-17.16
449,-17.46
450,-17.82
451,-18.23
452,-18.67
453,-19.10
454,-19.49
455,-19.78
456,-19.96
457,-20.02
458,-19.99
459,-19.86
460,-19.63
461,-19.33
462,-19.02
463,-18.78
464,-18.62
465,-18.50
466,-18.39
467,-18.27
468,-18.18
469,-18.11
470,-18.06
471,-18.07
472,-18.16
473,-18.34
474,-18.55
475,-18.73
476,-18.90
477,-19.07
478,-19.26
479,-19.43
480,-19.59
481,-19.77
482,-20.03
483,-20.32
484,-20.60
485,-20.78
486,-20.89
487,-20.94
488,-20.95
489,-20.95
490,-20.97
491,-21.02
492,-21.14
493,-21.32
494,-21.55
495,-21.72
496,-21.82
497,-21.82
498,-21.75
499,-21.63
500,-21.44
501,-21.19
502,-20.97
503,-20.84
504,-20.87
505,-21.06
506,-21.35
507,-21.71
508,-22.09
509,-22.46
510,-22.74
511,-22.87
512,-22.80
513,-22.54
514,-22.21
515,-21.90
516,-21.72
517,-21.71
518,-21.90
519,-22.31
520,-22.99
521,-23.82
522,-24.70
523,-25.48
524,-26.17
525,-26.69
526,-27.08
527,-27.30
528,-27.48
529,-27.69
530,-28.05
531,-28.53
532,-29.11
533,-29.71
534,-30.28
535,-30.69
536,-30.92
537,-30.98
538,-30.94
539,-30.85
540,-30.81
541,-30.85
542,-31.11
543,-31.52
544,-32.02
545,-32.38
546,-32.57
547,-32.54
548,-32.43
549,-32.28
550,-32.26
551,-32.41
552,-32.88
553,-33.64
554,-34.74
555,-35.99
556,-37.32
557,-38.56
558,-39.73
559,-40.73
560,-41.62
561,-42.37
562,-43.13
563,-43.88
564,-44.72
565,-45.54
566,-46.38
567,-47.14
568,-47.88
569,-48.46
570,-48.88
571,-49.04
572,-49.03
573,-48.84
574,-48.52
575,-48.08
576,-47.63
577,-47.26
578,-47.08
579,-47.07
580,-47.23
581,-47.53
582,-48.00
583,-48.66
584,-49.45
585,-50.25
586,-50.90
587,-51.32
588,-51.50
589,-51.45
590,-51.13
591,-50.60
592,-49.87
593,-49.10
594,-48.32
595,-47.67
596,-47.15
597,-46.81
598,-46.53
599,-46.26
600,-45.84
601,-45.26
602,-44.46
603,-43.58
604,-42.61
605,-41.73
606,-40.92
607,-40.36
608,-39.93
609,-39.67
610,-39.36
611,-38.98
612,-38.35
613,-37.54
614,-36.45
615,-35.21
616,-33.82
617,-32.52
618,-31.34
619,-30.46
620,-29.84
621,-29.50
622,-29.31
623,-29.23
624,-29.08
625,-28.86
626,-28.48
627,-28.08
628,-27.65
629,-27.30
630,-26.99
631,-26.77
632,-26.58
633,-26.41
634,-26.15
635,-25.75
636,-25.17
637,-24.51
638,-23.83
639,-23.29
640,-22.96
641,-22.85
642,-22.87
643,-22.95
644,-23.02
645,-23.02
646,-22.88
647,-22.65
648,-22.37
649,-22.12
650,-21.92
651,-21.81
652,-21.80
653,-21.87
654,-21.90
655,-21.86
656,-21.73
657,-21.54
658,-21.29
659,-21.06
660,-20.88
661,-20.83
662,-20.84
663,-20.84
664,-20.82
665,-20.75
666,-20.65
667,-20.54
668,-20.41
669,-20.28
670,-20.19
671,-20.19
672,-20.32
673,-20.55
674,-20.85
675,-21.14
676,-21.48
677,-21.90
678,-22.40
679,-22.93
680,-23.48
681,-24.02
682,-24.57
683,-25.03
684,-25.39
685,-25.57
686,-25.63
687,-25.54
688,-25.37
689,-25.19
690,-25.12
691,-25.16
692,-25.30
693,-25.49
694,-25.75
695,-26.04
696,-26.29
697,-26.42
698,-26.42
699,-26.29
700,-26.05
701,-25.75
702,-25.46
703,-25.27
704,-25.24
705,-25.36
706,-25.60
707,-25.90
708,-26.22
709,-26.47
710,-26.59
711,-26.58
712,-26.52
713,-26.50
714,-26.63
715,-26.92
716,-27.42
717,-28.01
718,-28.63
719,-29.17
720,-29.62
721,-29.84
722,-29.84
723,-29.65
724,-29.44
725,-29.29
726,-29.30
727,-29.47
728,-29.88
729,-30.47
730,-31.16
731,-31.77
732,-32.25
733,-32.52
734,-32.65
735,-32.70
736,-32.81
737,-33.04
738,-33.40
739,-33.82
740,-34.30
741,-34.77
742,-35.21
743,-35.51
744,-35.64
745,-35.64
746,-35.55
747,-35.43
748,-35.28
749,-35.11
750,-34.90
751,-34.67
752,-34.37
753,-34.01
754,-33.60
755,-33.20
756,-32.77
757,-32.36
758,-31.91
759,-31.51
760,-31.14
761,-30.86
762,-30.55
763,-30.21
764,-29.78
765,-29.31
766,-28.76
767,-28.17
768,-27.54
769,-27.01
770,-26.60
771,-26.36
772,-26.27
773,-26.28
774,-26.31
775,-26.33
776,-26.26
777,-26.15
778,-25.98
779,-25.87
780,-25.83
781,-25.90
782,-26.00
783,-26.07
784,-26.05
785,-25.86
786,-25.49
787,-24.95
788,-24.34
789,-23.78
790,-23.40
791,-23.28
792,-23.45
793,-23.88
794,-24.47
795,-25.08
796,-25.61
797,-26.04
798,-26.31
799,-26.43
800,-26.39
801,-26.27
802,-26.15
803,-26.08
804,-26.08
805,-26.08
806,-26.06
807,-26.00
808,-25.91
809,-25.78
810,-25.63
811,-25.45
812,-25.28
813,-25.15
814,-25.09
815,-25.16
816,-25.36
817,-25.60
818,-25.76
819,-25.84
820,-25.84
821,-25.78
822,-25.58
823,-25.28
824,-24.98
825,-24.80
826,-24.76
827,-24.83
828,-24.93
829,-25.06
830,-25.18
831,-25.25
832,-25.19
833,-25.02
834,-24.73
835,-24.43
836,-24.15
837,-23.99
838,-23.90
839,-23.85
840,-23.77
841,-23.67
842,-23.49
843,-23.26
844,-22.90
845,-22.44
846,-21.84
847,-21.19
848,-20.48
849,-19.78
850,-19.04
851,-18.33
852,-17.63
853,-16.99
854,-16.34
855,-15.75
856,-15.22
857,-14.82
858,-14.48
859,-14.20
860,-13.89
861,-13.59
862,-13.32
863,-13.15
864,-13.04
865,-12.98
866,-12.96
867,-13.02
868,-13.19
869,-13.44
870,-13.67
871,-13.85
872,-14.00
873,-14.17
874,-14.41
875,-14.70
876,-15.06
877,-15.46
878,-15.99
879,-16.57
880,-17.21
881,-17.80
882,-18.38
883,-18.89
884,-19.42
885,-19.94
886,-20.57
887,-21.26
888,-22.08
889,-22.90
890,-23.77
891,-24.58
892,-25.42
893,-26.18
894,-26.91
895,-27.55
896,-28.18
897,-28.76
898,-29.35
899,-29.88
900,-30.36
901,-30.70
902,-30.95
903,-31.13
904,-31.27
905,-31.33
906,-31.25
907,-31.00
908,-30.67
909,-30.29
910,-29.94
911,-29.63
912,-29.46
913,-29.45
914,-29.61
915,-29.85
916,-30.14
917,-30.43
918,-30.74
919,-31.10
920,-31.56
921,-32.07
922,-32.68
923,-33.34
924,-34.08
925,-34.80
926,-35.39
927,-35.76
928,-35.92
929,-35.90
930,-35.74
931,-35.51
932,-35.24
933,-34.93
934,-34.55
935,-34.09
936,-33.54
937,-32.94
938,-32.26
939,-31.56
940,-30.85
941,-30.24
942,-29.79
943,-29.56
944,-29.54
945,-29.67
946,-29.82
947,-29.89
948,-29.85
949,-29.72
950,-29.53
951,-29.29
952,-29.06
953,-28.93
954,-28.97
955,-29.22
956,-29.63
957,-30.05
958,-30.36
959,-30.49
960,-30.46
961,-30.27
962,-29.89
963,-29.41
964,-28.98
965,-28.66
966,-28.47
967,-28.35
968,-28.37
969,-28.54
970,-28.85
971,-29.21
972,-29.59
973,-29.99
974,-30.49
975,-31.03
976,-31.55
977,-31.96
978,-32.32
979,-32.59
980,-32.87
981,-33.09
982,-33.35
983,-33.62
984,-34.01
985,-34.48
986,-35.06
987,-35.64
988,-36.22
989,-36.68
990,-37.10
991,-37.43
992,-37.80
993,-38.19
994,-38.73
995,-39.37
996,-40.16
997,-40.98
998,-41.88
999,-42.75
1000,-43.68
1001,-44.55
1002,-45.44
1003,-46.25
1004,-47.07
1005,-47.82
1006,-48.61
1007,-49.30
1008,-49.95
1009,-50.46
1010,-50.98
1011,-51.48
1012,-52.10
1013,-52.73
1014,-53.47
1015,-54.23
1016,-55.08
1017,-55.90
1018,-56.69
1019,-57.33
1020,-57.90
1021,-58.35
1022,-58.80
1023,-59.20
1024,-59.62
1025,-59.96
1026,-60.26
1027,-60.49
1028,-60.69
1029,-60.80
1030,-60.84
1031,-60.82
1032,-60.85
1033,-60.96
1034,-61.20
1035,-61.49
1036,-61.83
1037,-62.17
1038,-62.61
1039,-63.14
1040,-63.77
1041,-64.43
1042,-65.09
1043,-65.69
1044,-66.20
1045,-66.62
1046,-66.96
1047,-67.19
1048,-67.31
1049,-67.31
1050,-67.24
1051,-67.11
1052,-66.92
1053,-66.62
1054,-66.22
1055,-65.74
1056,-65.19
1057,-64.66
1058,-64.19
1059,-63.90
1060,-63.77
1061,-63.79
1062,-63.84
1063,-63.87
1064,-63.72
1065,-63.38
1066,-62.74
1067,-61.92
1068,-60.94
1069,-60.05
1070,-59.30
1071,-58.78
1072,-58.41
1073,-58.14
1074,-57.81
1075,-57.42
1076,-56.83
1077,-56.08
1078,-55.05
1079,-53.93
1080,-52.76
1081,-51.77
1082,-50.88
1083,-50.20
1084,-49.60
1085,-49.14
1086,-48.71
1087,-48.32
1088,-47.85
1089,-47.33
1090,-46.68
1091,-46.04
1092,-45.40
1093,-44.88
1094,-44.40
1095,-44.01
1096,-43.62
1097,-43.34
1098,-43.11
1099,-42.95
1100,-42.75
1101,-42.53
1102,-42.24
1103,-41.95
1104,-41.62
1105,-41.28
1106,-40.85
1107,-40.37
1108,-39.85
1109,-39.32
1110,-38.76
1111,-38.22
1112,-37.73
1113,-37.38
1114,-37.17
1115,-37.12
1116,-37.17
1117,-37.30
1118,-37.45
1119,-37.65
1120,-37.82
1121,-37.95
1122,-37.97
1123,-37.93
1124,-37.80
1125,-37.63
1126,-37.35
1127,-37.00
1128,-36.58
1129,-36.11
1130,-35.53
1131,-34.89
1132,-34.18
1133,-33.52
1134,-32.91
1135,-32.39
1136,-31.90
1137,-31.43
1138,-30.92
1139,-30.46
1140,-30.03
1141,-29.68
1142,-29.34
1143,-29.05
1144,-28.85
1145,-28.79
1146,-28.83
1147,-28.96
1148,-29.14
1149,-29.39
1150,-29.66
1151,-29.98
1152,-30.27
1153,-30.52
1154,-30.65
1155,-30.59
1156,-30.32
1157,-29.90
1158,-29.40
1159,-28.92
1160,-28.48
1161,-28.13
1162,-27.88
1163,-27.78
1164,-27.71
1165,-27.62
1166,-27.36
1167,-26.95
1168,-26.34
1169,-25.63
1170,-24.85
1171,-24.15
1172,-23.51
1173,-22.99
1174,-22.48
1175,-22.03
1176,-21.56
1177,-21.10
1178,-20.53
1179,-19.89
1180,-19.15
1181,-18.45
1182,-17.75
1183,-17.18
1184,-16.66
1185,-16.27
1186,-15.88
1187,-15.55
1188,-15.17
1189,-14.76
1190,-14.24
1191,-13.67
1192,-12.99
1193,-12.28
1194,-11.49
1195,-10.73
1196,-10.03
1197,-9.49
1198,-9.07
1199,-8.79
1200,-8.61
1201,-8.56
1202,-8.58
1203,-8.65
1204,-8.71
1205,-8.78
1206,-8.83
1207,-8.90
1208,-8.97
1209,-9.09
1210,-9.25
1211,-9.44
1212,-9.61
1213,-9.73
1214,-9.80
1215,-9.80
1216,-9.71
1217,-9.53
1218,-9.26
1219,-8.96
1220,-8.68
1221,-8.50
1222,-8.42
1223,-8.42
1224,-8.48
1225,-8.55
1226,-8.57
1227,-8.51
1228,-8.38
1229,-8.19
1230,-7.99
1231,-7.86
1232,-7.90
1233,-8.15
1234,-8.54
1235,-8.97
1236,-9.33
1237,-9.57
1238,-9.70
1239,-9.69
1240,-9.54
1241,-9.31
1242,-9.06
1243,-8.87
1244,-8.74
1245,-8.62
1246,-8.54
1247,-8.48
1248,-8.40
1249,-8.28
1250,-8.13
1251,-8.00
1252,-7.96
1253,-8.00
1254,-8.19
1255,-8.54
1256,-9.11
1257,-9.82
1258,-10.65
1259,-11.48
1260,-12.32
1261,-13.09
1262,-13.79
1263,-14.31
1264,-14.69
1265,-14.90
1266,-15.11
1267,-15.34
1268,-15.64
1269,-15.98
1270,-16.43
1271,-16.96
1272,-17.59
1273,-18.17
1274,-18.69
1275,-19.04
1276,-19.26
1277,-19.36
1278,-19.43
1279,-19.47
1280,-19.60
1281,-19.81
1282,-20.22
1283,-20.74
1284,-21.42
1285,-22.13
1286,-22.86
1287,-23.51
1288,-24.09
1289,-24.54
1290,-24.97
1291,-25.38
1292,-25.84
1293,-26.30
1294,-26.79
1295,-27.24
1296,-27.80
1297,-28.38
1298,-28.99
1299,-29.53
1300,-30.00
1301,-30.40
1302,-30.78
1303,-31.14
1304,-31.49
1305,-31.78
1306,-32.01
1307,-32.18
1308,-32.38
1309,-32.60
1310,-32.87
1311,-33.10
1312,-33.33
1313,-33.49
1314,-33.62
1315,-33.68
1316,-33.70
1317,-33.69
1318,-33.70
1319,-33.74
1320,-33.88
1321,-34.13
1322,-34.47
1323,-34.83
1324,-35.14
1325,-35.39
1326,-35.59
1327,-35.77
1328,-35.88
1329,-35.88
1330,-35.80
1331,-35.67
1332,-35.52
1333,-35.35
1334,-35.13
1335,-34.83
1336,-34.45
1337,-34.03
1338,-33.58
1339,-33.11
1340,-32.59
1341,-32.05
1342,-31.53
1343,-31.12
1344,-30.82
1345,-30.65
1346,-30.54
1347,-30.51
1348,-30.45
1349,-30.33
1350,-30.09
1351,-29.80
1352,-29.51
1353,-29.27
1354,-29.04
1355,-28.82
1356,-28.59
1357,-28.42
1358,-28.24
1359,-28.00
1360,-27.69
1361,-27.40
1362,-27.14
1363,-26.98
1364,-26.84
1365,-26.73
1366,-26.60
1367,-26.48
1368,-26.37
1369,-26.26
1370,-26.11
1371,-25.93
1372,-25.73
1373,-25.55
1374,-25.39
1375,-25.28
1376,-25.21
1377,-25.21
1378,-25.28
1379,-25.47
1380,-25.75
1381,-26.05
1382,-26.31
1383,-26.50
1384,-26.61
1385,-26.62
1386,-26.41
1387,-26.00
1388,-25.42
1389,-24.75
1390,-24.04
1391,-23.32
1392,-22.66
1393,-22.11
1394,-21.71
1395,-21.47
1396,-21.41
1397,-21.52
1398,-21.82
1399,-22.30
1400,-22.96
1401,-23.74
1402,-24.57
1403,-25.35
1404,-26.05
1405,-26.58
1406,-26.93
1407,-27.11
1408,-27.20
1409,-27.24
1410,-27.28
1411,-27.27
1412,-27.28
1413,-27.27
1414,-27.25
1415,-27.20
1416,-27.10
1417,-26.98
1418,-26.85
1419,-26.79
1420,-26.82
1421,-26.89
1422,-26.91
1423,-26.86
1424,-26.70
1425,-26.40
1426,-25.93
1427,-25.34
1428,-24.67
1429,-24.06
1430,-23.57
1431,-23.28
1432,-23.19
1433,-23.25
1434,-23.39
1435,-23.58
1436,-23.80
1437,-24.04
1438,-24.27
1439,-24.51
1440,-24.80
1441,-25.17
1442,-25.55
1443,-25.85
1444,-26.02
1445,-26.08
1446,-26.06
1447,-25.93
1448,-25.70
1449,-25.38
1450,-25.13
1451,-25.01
1452,-25.00
1453,-25.01
1454,-24.97
1455,-24.91
1456,-24.86
1457,-24.80
1458,-24.70
1459,-24.57
1460,-24.49
1461,-24.54
1462,-24.77
1463,-25.06
1464,-25.40
1465,-25.69
1466,-25.96
1467,-26.20
1468,-26.39
1469,-26.50
1470,-26.59
1471,-26.70
1472,-26.91
1473,-27.20
1474,-27.57
1475,-27.92
1476,-28.28
1477,-28.63
1478,-28.99
1479,-29.34
1480,-29.71
1481,-30.05
1482,-30.41
1483,-30.77
1484,-31.14
1485,-31.43
1486,-31.61
1487,-31.66
1488,-31.70
1489,-31.74
1490,-31.81
1491,-31.93
1492,-32.16
1493,-32.52
1494,-32.97
1495,-33.39
1496,-33.73
1497,-33.97
1498,-34.13
1499,-34.26
1500,-34.32
1501,-34.32
1502,-34.26
1503,-34.13
1504,-33.97
1505,-33.72
1506,-33.40
1507,-32.98
1508,-32.48
1509,-31.94
1510,-31.40
1511,-30.92
1512,-30.52
1513,-30.21
1514,-30.04
1515,-30.05
1516,-30.23
1517,-30.53
1518,-30.88
1519,-31.25
1520,-31.62
1521,-31.98
1522,-32.28
1523,-32.53
1524,-32.71
1525,-32.84
1526,-32.85
1527,-32.75
1528,-32.48
1529,-32.06
1530,-31.47
1531,-30.75
1532,-29.97
1533,-29.25
1534,-28.65
1535,-28.24
1536,-27.99
1537,-27.95
1538,-28.03
1539,-28.24
1540,-28.41
1541,-28.48
1542,-28.35
1543,-28.05
1544,-27.64
1545,-27.21
1546,-26.83
1547,-26.60
1548,-26.57
1549,-26.76
1550,-27.07
1551,-27.37
1552,-27.60
1553,-27.73
1554,-27.73
1555,-27.61
1556,-27.35
1557,-27.05
1558,-26.80
1559,-26.61
1560,-26.47
1561,-26.35
1562,-26.29
1563,-26.28
1564,-26.31
1565,-26.37
1566,-26.50
1567,-26.73
1568,-27.10
1569,-27.52
1570,-27.94
1571,-28.29
1572,-28.60
1573,-28.90
1574,-29.19
1575,-29.42
1576,-29.62
1577,-29.79
1578,-30.01
1579,-30.30
1580,-30.66
1581,-30.95
1582,-31.17
1583,-31.27
1584,-31.36
1585,-31.40
1586,-31.43
1587,-31.43
1588,-31.44
1589,-31.49
1590,-31.62
1591,-31.80
1592,-32.03
1593,-32.26
1594,-32.49
1595,-32.67
1596,-32.81
1597,-32.93
1598,-33.01
1599,-33.08
1600,-33.13
1601,-33.12
1602,-33.05
1603,-32.94
1604,-32.80
1605,-32.62
1606,-32.34
1607,-31.98
1608,-31.61
1609,-31.23
1610,-30.88
1611,-30.58
1612,-30.43
1613,-30.47
1614,-30.74
1615,-31.15
1616,-31.71
1617,-32.37
1618,-33.12
1619,-33.83
1620,-34.44
1621,-34.92
1622,-35.32
1623,-35.60
1624,-35.76
1625,-35.82
1626,-35.91
1627,-36.06
1628,-36.29
1629,-36.54
1630,-36.84
1631,-37.19
1632,-37.56
1633,-37.86
1634,-38.07
1635,-38.19
1636,-38.24
1637,-38.25
1638,-38.20
1639,-38.15
1640,-38.07
1641,-38.02
1642,-37.95
1643,-37.79
1644,-37.41
1645,-36.84
1646,-36.00
1647,-35.00
1648,-33.76
1649,-32.40
1650,-30.94
1651,-29.58
1652,-28.32
1653,-27.27
1654,-26.33
1655,-25.65
1656,-25.13
1657,-24.86
1658,-24.65
1659,-24.52
1660,-24.28
1661,-23.94
1662,-23.36
1663,-22.67
1664,-21.86
1665,-21.03
1666,-20.12
1667,-19.17
1668,-18.23
1669,-17.40
1670,-16.66
1671,-16.08
1672,-15.62
1673,-15.32
1674,-15.18
1675,-15.25
1676,-15.49
1677,-15.87
1678,-16.25
1679,-16.56
1680,-16.72
1681,-16.72
1682,-16.58
1683,-16.33
1684,-16.02
1685,-15.70
1686,-15.50
1687,-15.42
1688,-15.55
1689,-15.83
1690,-16.33
1691,-16.98
1692,-17.78
1693,-18.66
1694,-19.67
1695,-20.73
1696,-21.88
1697,-23.00
1698,-24.12
1699,-25.04
1700,-25.86
1701,-26.48
1702,-27.08
1703,-27.63
1704,-28.34
1705,-29.08
1706,-29.98
1707,-30.89
1708,-31.97
1709,-33.00
1710,-34.10
1711,-35.14
1712,-36.30
1713,-37.44
1714,-38.73
1715,-40.05
1716,-41.66
1717,-43.40
1718,-45.43
1719,-47.41
1720,-49.44
1721,-51.16
1722,-52.81
1723,-54.17
1724,-55.56
1725,-56.85
1726,-58.41
1727,-60.06
1728,-62.15
1729,-64.41
1730,-67.07
1731,-69.76
1732,-72.62
1733,-75.33
1734,-77.99
1735,-80.33
1736,-82.50
1737,-84.29
1738,-85.95
1739,-87.33
1740,-88.63
1741,-89.67
1742,-90.58
1743,-91.19
1744,-91.68
1745,-91.95
1746,-92.11
1747,-92.09
1748,-91.97
1749,-91.78
1750,-91.61
1751,-91.49
1752,-91.40
1753,-91.29
1754,-91.08
1755,-90.74
1756,-90.19
1757,-89.49
1758,-88.60
1759,-87.66
1760,-86.63
1761,-85.63
1762,-84.63
1763,-83.76
1764,-82.95
1765,-82.26
1766,-81.56
1767,-80.87
1768,-80.06
1769,-79.25
1770,-78.36
1771,-77.49
1772,-76.54
1773,-75.61
1774,-74.62
1775,-73.69
1776,-72.75
1777,-71.88
1778,-70.98
1779,-70.16
1780,-69.39
1781,-68.81
1782,-68.35
1783,-68.09
1784,-67.86
1785,-67.65
1786,-67.31
1787,-66.84
1788,-66.21
1789,-65.49
1790,-64.72
1791,-64.00
1792,-63.39
1793,-63.03
1794,-62.97
1795,-63.22
1796,-63.71
1797,-64.38
1798,-65.15
1799,-65.93
1800,-66.65
1801,-67.25
1802,-67.74
1803,-68.15
1804,-68.51
1805,-68.81
1806,-69.05
1807,-69.15
1808,-69.17
1809,-69.11
1810,-69.03
1811,-68.96
1812,-68.90
1813,-68.85
1814,-68.78
1815,-68.66
1816,-68.44
1817,-68.10
1818,-67.60
1819,-67.01
1820,-66.30
1821,-65.57
1822,-64.93
1823,-64.51
1824,-64.35
1825,-64.44
1826,-64.61
1827,-64.81
1828,-64.92
1829,-64.87
1830,-64.58
1831,-64.09
1832,-63.51
1833,-62.96
1834,-62.55
1835,-62.29
1836,-62.25
1837,-62.43
1838,-62.87
1839,-63.46
1840,-64.11
1841,-64.71
1842,-65.28
1843,-65.74
1844,-66.10
1845,-66.33
1846,-66.55
1847,-66.83
1848,-67.23
1849,-67.71
1850,-68.28
1851,-68.86
1852,-69.47
1853,-70.01
1854,-70.45
1855,-70.69
1856,-70.69
1857,-70.51
1858,-70.21
1859,-69.84
1860,-69.46
1861,-69.10
1862,-68.81
1863,-68.63
1864,-68.52
1865,-68.42
1866,-68.24
1867,-67.94
1868,-67.50
1869,-66.96
1870,-66.37
1871,-65.83
1872,-65.37
1873,-65.02
1874,-64.74
1875,-64.58
1876,-64.49
1877,-64.50
1878,-64.55
1879,-64.67
1880,-64.87
1881,-65.18
1882,-65.55
1883,-65.99
1884,-66.40
1885,-66.71
1886,-66.81
1887,-66.70
1888,-66.38
1889,-65.90
1890,-65.25
1891,-64.55
1892,-63.84
1893,-63.19
1894,-62.51
1895,-61.81
1896,-61.07
1897,-60.36
1898,-59.64
1899,-59.01
1900,-58.40
1901,-57.89
1902,-57.33
1903,-56.76
1904,-56.08
1905,-55.39
1906,-54.59
1907,-53.77
1908,-52.90
1909,-52.13
1910,-51.48
1911,-51.09
1912,-50.87
1913,-50.78
1914,-50.61
1915,-50.28
1916,-49.66
1917,-48.84
1918,-47.79
1919,-46.66
1920,-45.48
1921,-44.46
1922,-43.69
1923,-43.30
1924,-43.17
1925,-43.19
1926,-43.17
1927,-43.07
1928,-42.86
1929,-42.55
1930,-42.13
1931,-41.71
1932,-41.46
1933,-41.50
1934,-41.85
1935,-42.47
1936,-43.30
1937,-44.25
1938,-45.24
1939,-46.13
1940,-46.94
1941,-47.58
1942,-48.09
1943,-48.43
1944,-48.70
1945,-48.91
1946,-49.19
1947,-49.46
1948,-49.81
1949,-50.16
1950,-50.57
1951,-50.96
1952,-51.41
1953,-51.86
1954,-52.44
1955,-53.08
1956,-53.83
1957,-54.60
1958,-55.42
1959,-56.23
1960,-57.10
1961,-57.92
1962,-58.72
1963,-59.36
1964,-59.89
1965,-60.30
1966,-60.68
1967,-61.02
1968,-61.36
1969,-61.71
1970,-62.16
1971,-62.69
1972,-63.27
1973,-63.83
1974,-64.28
1975,-64.53
1976,-64.46
1977,-64.04
1978,-63.30
1979,-62.41
1980,-61.42
1981,-60.48
1982,-59.56
1983,-58.80
1984,-58.18
1985,-57.67
1986,-57.04
1987,-56.23
1988,-55.17
1989,-54.05
1990,-52.86
1991,-51.80
1992,-50.86
1993,-50.16
1994,-49.64
1995,-49.32
1996,-49.01
1997,-48.69
1998,-48.16
1999,-47.54
2000,-46.74
2001,-45.98
2002,-45.24
2003,-44.68
2004,-44.17
2005,-43.80
2006,-43.36
2007,-42.81
2008,-41.88
2009,-40.65
2010,-39.09
2011,-37.50
2012,-35.87
2013,-34.48
2014,-33.19
2015,-32.17
2016,-31.20
2017,-30.29
2018,-29.17
2019,-27.89
2020,-26.35
2021,-24.74
2022,-23.09
2023,-21.68
2024,-20.55
2025,-19.86
2026,-19.46
2027,-19.40
2028,-19.45
2029,-19.62
2030,-19.61
2031,-19.47
2032,-19.08
2033,-18.57
2034,-17.81
2035,-16.95
2036,-15.92
2037,-14.87
2038,-13.69
2039,-12.54
2040,-11.31
2041,-10.20
2042,-9.10
2043,-8.13
2044,-7.12
2045,-6.15
2046,-5.03
2047,-3.88
2048,-2.53
2049,-1.20
2050,0.24
2051,1.57
2052,2.91
2053,4.07
2054,5.16
2055,6.07
2056,7.02
2057,7.87
2058,8.77
2059,9.64
2060,10.63
2061,11.61
2062,12.63
2063,13.50
2064,14.34
2065,15.10
2066,15.83
2067,16.48
2068,17.07
2069,17.54
2070,17.89
2071,18.07
2072,18.08
2073,17.88
2074,17.52
2075,17.04
2076,16.53
2077,16.04
2078,15.63
2079,15.40
2080,15.35
2081,15.49
2082,15.67
2083,15.82
2084,15.80
2085,15.63
2086,15.25
2087,14.73
2088,14.03
2089,13.25
2090,12.43
2091,11.73
2092,11.18
2093,10.84
2094,10.57
2095,10.37
2096,10.09
2097,9.77
2098,9.20
2099,8.45
2100,7.45
2101,6.39
2102,5.24
2103,4.14
2104,2.99
2105,1.95
2106,0.92
2107,0.06
2108,-0.76
2109,-1.44
2110,-2.12
2111,-2.74
2112,-3.49
2113,-4.30
2114,-5.24
2115,-6.18
2116,-7.17
2117,-8.10
2118,-9.03
2119,-9.85
2120,-10.60
2121,-11.18
2122,-11.65
2123,-11.98
2124,-12.32
2125,-12.65
2126,-13.07
2127,-13.47
2128,-13.91
2129,-14.31
2130,-14.76
2131,-15.22
2132,-15.75
2133,-16.27
2134,-16.83
2135,-17.41
2136,-18.08
2137,-18.72
2138,-19.33
2139,-19.80
2140,-20.20
2141,-20.46
2142,-20.71
2143,-20.92
2144,-21.26
2145,-21.71
2146,-22.37
2147,-23.13
2148,-24.02
2149,-24.89
2150,-25.82
2151,-26.62
2152,-27.38
2153,-28.07
2154,-28.86
2155,-29.73
2156,-30.75
2157,-31.75
2158,-32.78
2159,-33.70
2160,-34.59
2161,-35.34
2162,-36.08
2163,-36.70
2164,-37.34
2165,-37.96
2166,-38.75
2167,-39.61
2168,-40.63
2169,-41.63
2170,-42.67
2171,-43.66
2172,-44.69
2173,-45.61
2174,-46.52
2175,-47.33
2176,-48.17
2177,-48.93
2178,-49.62
2179,-50.14
2180,-50.58
2181,-50.85
2182,-51.03
2183,-51.07
2184,-51.10
2185,-51.14
2186,-51.25
2187,-51.43
2188,-51.70
2189,-51.99
2190,-52.29
2191,-52.60
2192,-52.89
2193,-53.13
2194,-53.25
2195,-53.26
2196,-53.18
2197,-53.05
2198,-52.89
2199,-52.72
2200,-52.54
2201,-52.37
2202,-52.15
2203,-51.86
2204,-51.48
2205,-51.06
2206,-50.60
2207,-50.13
2208,-49.64
2209,-49.16
2210,-48.71
2211,-48.36
2212,-48.07
2213,-47.86
2214,-47.61
2215,-47.33
2216,-46.94
2217,-46.53
2218,-46.09
2219,-45.68
2220,-45.26
2221,-44.86
2222,-44.42
2223,-44.01
2224,-43.63
2225,-43.40
2226,-43.31
2227,-43.39
2228,-43.52
2229,-43.66
2230,-43.69
2231,-43.59
2232,-43.26
2233,-42.72
2234,-41.99
2235,-41.21
2236,-40.49
2237,-39.93
2238,-39.60
2239,-39.55
2240,-39.79
2241,-40.28
2242,-40.90
2243,-41.56
2244,-42.24
2245,-42.88
2246,-43.51
2247,-44.11
2248,-44.72
2249,-45.30
2250,-45.86
2251,-46.39
2252,-46.98
2253,-47.55
2254,-48.12
2255,-48.58
2256,-49.06
2257,-49.51
2258,-49.99
2259,-50.39
2260,-50.80
2261,-51.20
2262,-51.64
2263,-52.06
2264,-52.47
2265,-52.88
2266,-53.34
2267,-53.80
2268,-54.30
2269,-54.78
2270,-55.26
2271,-55.66
2272,-55.98
2273,-56.17
2274,-56.24
2275,-56.18
2276,-55.92
2277,-55.51
2278,-55.02
2279,-54.54
2280,-54.04
2281,-53.59
2282,-53.13
2283,-52.73
2284,-52.25
2285,-51.70
2286,-50.91
2287,-49.92
2288,-48.58
2289,-47.05
2290,-45.34
2291,-43.68
2292,-42.05
2293,-40.65
2294,-39.43
2295,-38.50
2296,-37.70
2297,-37.08
2298,-36.49
2299,-35.99
2300,-35.39
2301,-34.75
2302,-34.03
2303,-33.39
2304,-32.80
2305,-32.34
2306,-31.94
2307,-31.59
2308,-31.23
2309,-30.88
2310,-30.53
2311,-30.21
2312,-30.03
2313,-30.01
2314,-30.24
2315,-30.72
2316,-31.46
2317,-32.34
2318,-33.36
2319,-34.35
2320,-35.40
2321,-36.45
2322,-37.61
2323,-38.76
2324,-40.02
2325,-41.25
2326,-42.56
2327,-43.78
2328,-44.99
2329,-46.09
2330,-47.27
2331,-48.42
2332,-49.67
2333,-50.89
2334,-52.25
2335,-53.60
2336,-54.95
2337,-56.08
2338,-56.97
2339,-57.53
2340,-57.92
2341,-58.19
2342,-58.54
2343,-58.99
2344,-59.63
2345,-60.42
2346,-61.30
2347,-62.07
2348,-62.60
2349,-62.71
2350,-62.48
2351,-61.90
2352,-61.13
2353,-60.26
2354,-59.56
2355,-59.10
2356,-59.03
2357,-59.25
2358,-59.83
2359,-60.65
2360,-61.74
2361,-62.98
2362,-64.39
2363,-65.86
2364,-67.46
2365,-69.07
2366,-70.69
2367,-72.17
2368,-73.52
2369,-74.63
2370,-75.60
2371,-76.35
2372,-76.98
2373,-77.45
2374,-77.82
2375,-78.06
2376,-78.13
2377,-78.02
2378,-77.71
2379,-77.24
2380,-76.59
2381,-75.83
2382,-74.89
2383,-73.91
2384,-72.81
2385,-71.72
2386,-70.42
2387,-69.04
2388,-67.38
2389,-65.64
2390,-63.62
2391,-61.59
2392,-59.38
2393,-57.28
2394,-55.12
2395,-53.15
2396,-51.16
2397,-49.30
2398,-47.33
2399,-45.43
2400,-43.37
2401,-41.38
2402,-39.32
2403,-37.52
2404,-35.89
2405,-34.68
2406,-33.67
2407,-32.97
2408,-32.28
2409,-31.68
2410,-30.85
2411,-29.83
2412,-28.43
2413,-26.83
2414,-25.05
2415,-23.40
2416,-21.91
2417,-20.81
2418,-19.94
2419,-19.39
2420,-18.98
2421,-18.71
2422,-18.37
2423,-17.99
2424,-17.46
2425,-16.88
2426,-16.14
2427,-15.34
2428,-14.42
2429,-13.53
2430,-12.65
2431,-11.89
2432,-11.24
2433,-10.77
2434,-10.42
2435,-10.26
2436,-10.24
2437,-10.31
2438,-10.35
2439,-10.37
2440,-10.36
2441,-10.35
2442,-10.33
2443,-10.39
2444,-10.63
2445,-11.05
2446,-11.55
2447,-11.98
2448,-12.29
2449,-12.47
2450,-12.50
2451,-12.37
2452,-12.13
2453,-11.88
2454,-11.74
2455,-11.81
2456,-12.05
2457,-12.44
2458,-12.80
2459,-13.07
2460,-13.08
2461,-12.86
2462,-12.34
2463,-11.70
2464,-10.94
2465,-10.18
2466,-9.35
2467,-8.54
2468,-7.65
2469,-6.71
2470,-5.64
2471,-4.52
2472,-3.33
2473,-2.20
2474,-1.13
2475,-0.27
2476,0.42
2477,0.89
2478,1.25
2479,1.46
2480,1.56
2481,1.48
2482,1.37
2483,1.14
2484,0.92
2485,0.66
2486,0.56
2487,0.63
2488,1.04
2489,1.75
2490,2.84
2491,4.14
2492,5.55
2493,6.87
2494,8.08
2495,9.08
2496,9.89
2497,10.47
2498,10.96
2499,11.41
2500,11.92
2501,12.40
2502,12.82
2503,13.11
2504,13.29
2505,13.29
2506,13.08
2507,12.66
2508,12.08
2509,11.44
2510,10.70
2511,9.94
2512,9.10
2513,8.30
2514,7.42
2515,6.56
2516,5.54
2517,4.45
2518,3.14
2519,1.75
2520,0.09
2521,-1.66
2522,-3.60
2523,-5.46
2524,-7.35
2525,-9.04
2526,-10.70
2527,-12.07
2528,-13.34
2529,-14.42
2530,-15.63
2531,-16.88
2532,-18.37
2533,-19.88
2534,-21.59
2535,-23.28
2536,-25.04
2537,-26.61
2538,-28.13
2539,-29.46
2540,-30.78
2541,-31.93
2542,-33.05
2543,-34.03
2544,-35.05
2545,-35.96
2546,-36.87
2547,-37.61
2548,-38.36
2549,-39.04
2550,-39.77
2551,-40.47
2552,-41.23
2553,-41.92
2554,-42.58
2555,-43.11
2556,-43.59
2557,-43.92
2558,-44.13
2559,-44.19
2560,-44.18
2561,-44.10
2562,-43.97
2563,-43.79
2564,-43.63
2565,-43.51
2566,-43.37
2567,-43.19
2568,-43.01
2569,-42.89
2570,-42.82
2571,-42.77
2572,-42.69
2573,-42.64
2574,-42.62
2575,-42.62
2576,-42.59
2577,-42.53
2578,-42.48
2579,-42.49
2580,-42.50
2581,-42.52
2582,-42.48
2583,-42.43
2584,-42.35
2585,-42.24
2586,-42.03
2587,-41.74
2588,-41.36
2589,-40.94
2590,-40.47
2591,-40.00
2592,-39.52
2593,-39.10
2594,-38.77
2595,-38.60
2596,-38.57
2597,-38.70
2598,-38.93
2599,-39.17
2600,-39.38
2601,-39.51
2602,-39.51
2603,-39.39
2604,-39.16
2605,-38.93
2606,-38.73
2607,-38.60
2608,-38.54
2609,-38.49
2610,-38.42
2611,-38.31
2612,-38.12
2613,-37.88
2614,-37.61
2615,-37.38
2616,-37.17
2617,-37.01
2618,-36.80
2619,-36.52
2620,-36.06
2621,-35.42
2622,-34.52
2623,-33.45
2624,-32.25
2625,-31.11
2626,-30.14
2627,-29.48
2628,-29.15
2629,-29.17
2630,-29.44
2631,-29.88
2632,-30.34
2633,-30.77
2634,-31.10
2635,-31.34
2636,-31.49
2637,-31.62
2638,-31.75
2639,-31.92
2640,-32.12
2641,-32.32
2642,-32.45
2643,-32.44
2644,-32.27
2645,-31.97
2646,-31.62
2647,-31.25
2648,-30.88
2649,-30.53
2650,-30.22
2651,-29.98
2652,-29.77
2653,-29.60
2654,-29.46
2655,-29.35
2656,-29.19
2657,-29.01
2658,-28.86
2659,-28.80
2660,-28.82
2661,-28.88
2662,-28.99
2663,-29.17
2664,-29.43
2665,-29.75
2666,-30.01
2667,-30.14
2668,-30.06
2669,-29.83
2670,-29.46
2671,-29.06
2672,-28.56
2673,-28.04
2674,-27.48
2675,-26.96
2676,-26.37
2677,-25.75
2678,-24.97
2679,-24.09
2680,-23.03
2681,-21.93
2682,-20.71
2683,-19.55
2684,-18.30
2685,-17.14
2686,-15.98
2687,-14.94
2688,-13.85
2689,-12.74
2690,-11.51
2691,-10.35
2692,-9.20
2693,-8.21
2694,-7.26
2695,-6.45
2696,-5.71
2697,-5.13
2698,-4.59
2699,-4.14
2700,-3.73
2701,-3.44
2702,-3.19
2703,-3.02
2704,-2.96
2705,-3.02
2706,-3.14
2707,-3.27
2708,-3.37
2709,-3.50
2710,-3.67
2711,-3.91
2712,-4.19
2713,-4.56
2714,-5.02
2715,-5.49
2716,-5.87
2717,-6.07
2718,-6.05
2719,-5.80
2720,-5.33
2721,-4.66
2722,-3.91
2723,-3.24
2724,-2.77
2725,-2.53
2726,-2.52
2727,-2.70
2728,-3.04
2729,-3.46
2730,-3.90
2731,-4.26
2732,-4.51
2733,-4.62
2734,-4.64
2735,-4.63
2736,-4.68
2737,-4.78
2738,-4.98
2739,-5.28
2740,-5.73
2741,-6.26
2742,-6.82
2743,-7.30
2744,-7.70
2745,-7.99
2746,-8.16
2747,-8.23
2748,-8.20
2749,-8.07
2750,-7.86
2751,-7.56
2752,-7.23
2753,-6.86
2754,-6.45
2755,-6.03
2756,-5.66
2757,-5.42
2758,-5.33
2759,-5.34
2760,-5.37
2761,-5.44
2762,-5.52
2763,-5.59
2764,-5.55
2765,-5.37
2766,-5.10
2767,-4.78
2768,-4.49
2769,-4.26
2770,-4.10
2771,-4.04
2772,-4.08
2773,-4.26
2774,-4.58
2775,-5.00
2776,-5.47
2777,-5.90
2778,-6.22
2779,-6.40
2780,-6.42
2781,-6.24
2782,-5.85
2783,-5.30
2784,-4.72
2785,-4.23
2786,-3.91
2787,-3.80
2788,-3.87
2789,-4.04
2790,-4.28
2791,-4.53
2792,-4.75
2793,-4.86
2794,-4.84
2795,-4.72
2796,-4.59
2797,-4.51
2798,-4.54
2799,-4.66
2800,-4.90
2801,-5.20
2802,-5.51
2803,-5.74
2804,-5.90
2805,-6.01
2806,-6.16
2807,-6.32
2808,-6.51
2809,-6.69
2810,-6.91
2811,-7.14
2812,-7.35
2813,-7.46
2814,-7.54
2815,-7.58
2816,-7.64
2817,-7.69
2818,-7.80
2819,-7.97
2820,-8.22
2821,-8.45
2822,-8.66
2823,-8.83
2824,-9.06
2825,-9.35
2826,-9.70
2827,-10.05
2828,-10.43
2829,-10.77
2830,-11.11
2831,-11.33
2832,-11.49
2833,-11.59
2834,-11.75
2835,-11.96
2836,-12.33
2837,-12.79
2838,-13.43
2839,-14.12
2840,-14.90
2841,-15.66
2842,-16.49
2843,-17.30
2844,-18.14
2845,-18.95
2846,-19.89
2847,-20.87
2848,-21.99
2849,-23.10
2850,-24.29
2851,-25.46
2852,-26.67
2853,-27.79
2854,-28.87
2855,-29.79
2856,-30.65
2857,-31.35
2858,-31.97
2859,-32.41
2860,-32.81
2861,-33.13
2862,-33.58
2863,-34.09
2864,-34.74
2865,-35.45
2866,-36.27
2867,-37.09
2868,-37.88
2869,-38.48
2870,-38.86
2871,-39.02
2872,-39.05
2873,-38.96
2874,-38.89
2875,-38.82
2876,-38.83
2877,-38.87
2878,-38.98
2879,-39.15
2880,-39.47
2881,-39.87
2882,-40.34
2883,-40.82
2884,-41.37
2885,-41.96
2886,-42.52
2887,-42.95
2888,-43.22
2889,-43.33
2890,-43.31
2891,-43.18
2892,-43.04
2893,-42.97
2894,-43.04
2895,-43.24
2896,-43.46
2897,-43.66
2898,-43.69
2899,-43.53
2900,-43.10
2901,-42.45
2902,-41.58
2903,-40.63
2904,-39.62
2905,-38.67
2906,-37.79
2907,-37.04
2908,-36.32
2909,-35.62
2910,-34.83
2911,-34.01
2912,-33.13
2913,-32.30
2914,-31.50
2915,-30.87
2916,-30.36
2917,-30.02
2918,-29.73
2919,-29.52
2920,-29.32
2921,-29.21
2922,-29.11
2923,-29.08
2924,-29.02
2925,-28.92
2926,-28.64
2927,-28.25
2928,-27.73
2929,-27.14
2930,-26.39
2931,-25.57
2932,-24.71
2933,-24.00
2934,-23.39
2935,-22.88
2936,-22.36
2937,-21.84
2938,-21.22
2939,-20.52
2940,-19.69
2941,-18.87
2942,-18.07
2943,-17.49
2944,-17.09
2945,-16.88
2946,-16.67
2947,-16.46
2948,-16.14
2949,-15.75
2950,-15.14
2951,-14.39
2952,-13.45
2953,-12.49
2954,-11.57
2955,-10.80
2956,-10.19
2957,-9.78
2958,-9.52
2959,-9.42
2960,-9.39
2961,-9.40
2962,-9.38
2963,-9.39
2964,-9.43
2965,-9.56
2966,-9.71
2967,-9.84
2968,-9.89
2969,-9.83
2970,-9.67
2971,-9.42
2972,-9.15
2973,-8.90
2974,-8.74
2975,-8.74
2976,-8.95
2977,-9.32
2978,-9.71
2979,-10.03
2980,-10.19
2981,-10.19
2982,-10.02
2983,-9.71
2984,-9.35
2985,-9.03
2986,-8.87
2987,-8.93
2988,-9.20
2989,-9.57
2990,-9.93
2991,-10.17
2992,-10.25
2993,-10.12
2994,-9.82
2995,-9.38
2996,-8.96
2997,-8.69
2998,-8.76
2999,-9.17
3000,-9.93
3001,-10.89
3002,-11.96
3003,-12.97
3004,-13.90
3005,-14.61
3006,-15.08
3007,-15.29
3008,-15.41
3009,-15.50
3010,-15.72
3011,-15.98
3012,-16.40
3013,-16.85
3014,-17.46
3015,-18.09
3016,-18.81
3017,-19.50
3018,-20.27
3019,-21.09
3020,-22.02
3021,-22.96
3022,-23.96
3023,-24.96
3024,-26.02
3025,-27.02
3026,-27.95
3027,-28.66
3028,-29.17
3029,-29.45
3030,-29.59
3031,-29.56
3032,-29.49
3033,-29.35
3034,-29.25
3035,-29.24
3036,-29.40
3037,-29.69
3038,-30.09
3039,-30.52
3040,-30.93
3041,-31.23
3042,-31.34
3043,-31.23
3044,-30.91
3045,-30.49
3046,-29.98
3047,-29.44
3048,-28.89
3049,-28.37
3050,-27.84
3051,-27.30
3052,-26.73
3053,-26.19
3054,-25.75
3055,-25.44
3056,-25.28
3057,-25.29
3058,-25.48
3059,-25.86
3060,-26.27
3061,-26.65
3062,-26.91
3063,-27.10
3064,-27.19
3065,-27.21
3066,-27.05
3067,-26.76
3068,-26.33
3069,-25.79
3070,-25.13
3071,-24.36
3072,-23.49
3073,-22.65
3074,-21.93
3075,-21.46
3076,-21.22
3077,-21.18
3078,-21.20
3079,-21.23
3080,-21.13
3081,-20.84
3082,-20.29
3083,-19.58
3084,-18.77
3085,-18.06
3086,-17.45
3087,-17.07
3088,-16.81
3089,-16.65
3090,-16.40
3091,-16.02
3092,-15.37
3093,-14.55
3094,-13.51
3095,-12.44
3096,-11.40
3097,-10.51
3098,-9.74
3099,-9.10
3100,-8.53
3101,-8.06
3102,-7.64
3103,-7.29
3104,-6.99
3105,-6.75
3106,-6.56
3107,-6.45
3108,-6.40
3109,-6.40
3110,-6.42
3111,-6.41
3112,-6.42
3113,-6.52
3114,-6.85
3115,-7.37
3116,-8.11
3117,-9.00
3118,-10.10
3119,-11.28
3120,-12.49
3121,-13.55
3122,-14.53
3123,-15.33
3124,-16.05
3125,-16.62
3126,-17.20
3127,-17.76
3128,-18.44
3129,-19.12
3130,-19.94
3131,-20.81
3132,-21.82
3133,-22.81
3134,-23.83
3135,-24.77
3136,-25.70
3137,-26.57
3138,-27.47
3139,-28.28
3140,-29.10
3141,-29.85
3142,-30.64
3143,-31.39
3144,-32.18
3145,-32.88
3146,-33.55
3147,-34.12
3148,-34.69
3149,-35.22
3150,-35.75
3151,-36.16
3152,-36.43
3153,-36.54
3154,-36.57
3155,-36.49
3156,-36.35
3157,-36.18
3158,-36.00
3159,-35.82
3160,-35.59
3161,-35.29
3162,-34.95
3163,-34.59
3164,-34.21
3165,-33.79
3166,-33.33
3167,-32.92
3168,-32.60
3169,-32.42
3170,-32.33
3171,-32.29
3172,-32.26
3173,-32.26
3174,-32.23
3175,-32.18
3176,-32.11
3177,-31.98
3178,-31.78
3179,-31.54
3180,-31.36
3181,-31.29
3182,-31.33
3183,-31.45
3184,-31.68
3185,-32.04
3186,-32.49
3187,-32.91
3188,-33.24
3189,-33.42
3190,-33.46
3191,-33.33
3192,-33.04
3193,-32.60
3194,-32.17
3195,-31.84
3196,-31.77
3197,-31.94
3198,-32.39
3199,-33.03
3200,-33.90
3201,-34.91
3202,-36.04
3203,-37.11
3204,-38.07
3205,-38.82
3206,-39.50
3207,-40.13
3208,-40.83
3209,-41.54
3210,-42.28
3211,-42.99
3212,-43.70
3213,-44.29
3214,-44.74
3215,-44.98
3216,-45.02
3217,-44.88
3218,-44.63
3219,-44.33
3220,-44.06
3221,-43.81
3222,-43.56
3223,-43.27
3224,-42.94
3225,-42.52
3226,-41.94
3227,-41.24
3228,-40.45
3229,-39.73
3230,-39.09
3231,-38.64
3232,-38.32
3233,-38.22
3234,-38.23
3235,-38.31
3236,-38.34
3237,-38.30
3238,-38.11
3239,-37.82
3240,-37.41
3241,-36.94
3242,-36.39
3243,-35.80
3244,-35.14
3245,-34.50
3246,-33.86
3247,-33.27
3248,-32.66
3249,-32.09
3250,-31.50
3251,-30.98
3252,-30.43
3253,-29.91
3254,-29.37
3255,-28.92
3256,-28.47
3257,-28.01
3258,-27.44
3259,-26.85
3260,-26.28
3261,-25.87
3262,-25.56
3263,-25.40
3264,-25.34
3265,-25.42
3266,-25.51
3267,-25.53
3268,-25.37
3269,-25.08
3270,-24.68
3271,-24.25
3272,-23.83
3273,-23.54
3274,-23.44
3275,-23.57
3276,-23.80
3277,-23.93
3278,-23.85
3279,-23.54
3280,-23.09
3281,-22.60
3282,-22.17
3283,-21.92
3284,-21.97
3285,-22.33
3286,-22.93
3287,-23.59
3288,-24.22
3289,-24.70
3290,-25.01
3291,-25.10
3292,-25.09
3293,-25.06
3294,-25.22
3295,-25.57
3296,-26.10
3297,-26.70
3298,-27.38
3299,-28.08
3300,-28.81
3301,-29.46
3302,-30.06
3303,-30.59
3304,-31.08
3305,-31.49
3306,-31.83
3307,-32.07
3308,-32.23
3309,-32.28
3310,-32.22
3311,-32.04
3312,-31.79
3313,-31.49
3314,-31.11
3315,-30.62
3316,-30.10
3317,-29.61
3318,-29.21
3319,-28.98
3320,-28.92
3321,-29.05
3322,-29.30
3323,-29.60
3324,-29.91
3325,-30.22
3326,-30.51
3327,-30.75
3328,-30.86
3329,-30.88
3330,-30.82
3331,-30.69
3332,-30.44
3333,-30.03
3334,-29.51
3335,-28.96
3336,-28.41
3337,-27.88
3338,-27.37
3339,-26.95
3340,-26.63
3341,-26.47
3342,-26.42
3343,-26.50
3344,-26.60
3345,-26.66
3346,-26.63
3347,-26.51
3348,-26.33
3349,-26.15
3350,-25.99
3351,-25.81
3352,-25.59
3353,-25.34
3354,-25.15
3355,-25.02
3356,-24.99
3357,-24.99
3358,-25.01
3359,-25.06
3360,-25.18
3361,-25.37
3362,-25.57
3363,-25.76
3364,-25.89
3365,-26.01
3366,-26.15
3367,-26.32
3368,-26.53
3369,-26.70
3370,-26.86
3371,-26.98
3372,-27.05
3373,-27.04
3374,-27.00
3375,-26.92
3376,-26.89
3377,-26.93
3378,-27.15
3379,-27.50
3380,-27.96
3381,-28.50
3382,-29.15
3383,-29.79
3384,-30.39
3385,-30.91
3386,-31.51
3387,-32.20
3388,-33.04
3389,-33.93
3390,-34.91
3391,-35.85
3392,-36.71
3393,-37.36
3394,-37.86
3395,-38.13
3396,-38.26
3397,-38.23
3398,-38.22
3399,-38.31
3400,-38.66
3401,-39.18
3402,-39.88
3403,-40.66
3404,-41.52
3405,-42.34
3406,-43.08
3407,-43.62
3408,-43.97
3409,-44.07
3410,-43.98
3411,-43.79
3412,-43.66
3413,-43.71
3414,-43.97
3415,-44.41
3416,-44.93
3417,-45.43
3418,-45.72
3419,-45.68
3420,-45.20
3421,-44.31
3422,-43.01
3423,-41.53
3424,-39.94
3425,-38.45
3426,-37.05
3427,-35.84
3428,-34.69
3429,-33.63
3430,-32.52
3431,-31.40
3432,-30.25
3433,-29.19
3434,-28.17
3435,-27.35
3436,-26.74
3437,-26.47
3438,-26.40
3439,-26.48
3440,-26.60
3441,-26.80
3442,-27.02
3443,-27.28
3444,-27.45
3445,-27.59
3446,-27.67
3447,-27.74
3448,-27.71
3449,-27.54
3450,-27.20
3451,-26.72
3452,-26.13
3453,-25.53
3454,-24.97
3455,-24.56
3456,-24.28
3457,-24.10
3458,-23.97
3459,-23.86
3460,-23.76
3461,-23.64
3462,-23.46
3463,-23.28
3464,-23.19
3465,-23.24
3466,-23.43
3467,-23.80
3468,-24.38
3469,-25.16
3470,-26.03
3471,-26.82
3472,-27.41
3473,-27.72
3474,-27.70
3475,-27.34
3476,-26.66
3477,-25.81
3478,-24.96
3479,-24.29
3480,-23.88
3481,-23.71
3482,-23.70
3483,-23.78
3484,-23.83
3485,-23.80
3486,-23.52
3487,-23.05
3488,-22.41
3489,-21.76
3490,-21.13
3491,-20.59
3492,-20.14
3493,-19.87
3494,-19.70
3495,-19.61
3496,-19.40
3497,-19.07
3498,-18.54
3499,-17.89
3500,-17.07
3501,-16.20
3502,-15.26
3503,-14.37
3504,-13.48
3505,-12.67
3506,-11.87
3507,-11.12
3508,-10.28
3509,-9.47
3510,-8.64
3511,-7.94
3512,-7.29
3513,-6.77
3514,-6.36
3515,-6.14
3516,-6.00
3517,-5.92
3518,-5.73
3519,-5.45
3520,-4.99
3521,-4.53
3522,-4.09
3523,-3.75
3524,-3.39
3525,-3.06
3526,-2.69
3527,-2.29
3528,-1.70
3529,-0.89
3530,0.22
3531,1.47
3532,2.79
3533,3.97
3534,4.98
3535,5.70
3536,6.13
3537,6.16
3538,5.86
3539,5.30
3540,4.71
3541,4.20
3542,3.88
3543,3.75
3544,3.92
3545,4.32
3546,4.94
3547,5.66
3548,6.45
3549,7.23
3550,7.94
3551,8.53
3552,9.04
3553,9.51
3554,9.99
3555,10.41
3556,10.72
3557,10.89
3558,10.99
3559,10.97
3560,10.88
3561,10.68
3562,10.49
3563,10.37
3564,10.35
3565,10.41
3566,10.50
3567,10.63
3568,10.80
3569,10.98
3570,11.08
3571,11.08
3572,11.04
3573,11.03
3574,11.07
3575,11.12
3576,11.24
3577,11.41
3578,11.67
3579,11.96
3580,12.28
3581,12.57
3582,12.90
3583,13.24
3584,13.63
3585,14.06
3586,14.54
3587,15.01
3588,15.40
3589,15.66
3590,15.76
3591,15.70
3592,15.39
3593,14.87
3594,14.17
3595,13.39
3596,12.50
3597,11.56
3598,10.57
3599,9.67
3600,8.90
3601,8.32
3602,7.85
3603,7.51
3604,7.23
3605,7.01
3606,6.73
3607,6.40
3608,5.93
3609,5.40
3610,4.79
3611,4.20
3612,3.63
3613,3.17
3614,2.78
3615,2.51
3616,2.24
3617,1.95
3618,1.57
3619,1.17
3620,0.71
3621,0.25
3622,-0.27
3623,-0.79
3624,-1.34
3625,-1.86
3626,-2.44
3627,-3.08
3628,-3.84
3629,-4.61
3630,-5.39
3631,-6.03
3632,-6.55
3633,-6.89
3634,-7.14
3635,-7.29
3636,-7.47
3637,-7.62
3638,-7.87
3639,-8.13
3640,-8.56
3641,-9.07
3642,-9.75
3643,-10.51
3644,-11.40
3645,-12.28
3646,-13.18
3647,-13.99
3648,-14.80
3649,-15.55
3650,-16.35
3651,-17.11
3652,-17.91
3653,-18.65
3654,-19.45
3655,-20.26
3656,-21.19
3657,-22.06
3658,-22.90
3659,-23.59
3660,-24.28
3661,-24.92
3662,-25.54
3663,-26.05
3664,-26.58
3665,-27.10
3666,-27.69
3667,-28.28
3668,-28.87
3669,-29.40
3670,-29.90
3671,-30.32
3672,-30.62
3673,-30.68
3674,-30.45
3675,-29.96
3676,-29.31
3677,-28.58
3678,-27.85
3679,-27.18
3680,-26.70
3681,-26.45
3682,-26.45
3683,-26.65
3684,-26.93
3685,-27.24
3686,-27.50
3687,-27.69
3688,-27.76
3689,-27.71
3690,-27.49
3691,-27.14
3692,-26.68
3693,-26.20
3694,-25.70
3695,-25.24
3696,-24.79
3697,-24.36
3698,-23.96
3699,-23.67
3700,-23.53
3701,-23.54
3702,-23.59
3703,-23.66
3704,-23.74
3705,-23.87
3706,-23.96
3707,-23.92
3708,-23.66
3709,-23.24
3710,-22.71
3711,-22.18
3712,-21.63
3713,-21.10
3714,-20.59
3715,-20.17
3716,-19.85
3717,-19.62
3718,-19.42
3719,-19.25
3720,-19.08
3721,-18.97
3722,-18.90
3723,-18.91
3724,-18.95
3725,-19.02
3726,-19.07
3727,-19.14
3728,-19.19
3729,-19.20
3730,-19.10
3731,-18.93
3732,-18.68
3733,-18.45
3734,-18.22
3735,-17.97
3736,-17.72
3737,-17.47
3738,-17.33
3739,-17.32
3740,-17.44
3741,-17.68
3742,-18.08
3743,-18.62
3744,-19.23
3745,-19.84
3746,-20.37
3747,-20.80
3748,-21.07
3749,-21.13
3750,-20.95
3751,-20.57
3752,-20.14
3753,-19.70
3754,-19.35
3755,-19.09
3756,-19.06
3757,-19.28
3758,-19.82
3759,-20.60
3760,-21.55
3761,-22.57
3762,-23.61
3763,-24.57
3764,-25.39
3765,-25.98
3766,-26.36
3767,-26.57
3768,-26.79
3769,-27.00
3770,-27.30
3771,-27.66
3772,-28.11
3773,-28.58
3774,-29.01
3775,-29.30
3776,-29.51
3777,-29.56
3778,-29.44
3779,-29.20
3780,-28.94
3781,-28.76
3782,-28.66
3783,-28.68
3784,-28.77
3785,-28.96
3786,-29.14
3787,-29.22
3788,-29.08
3789,-28.68
3790,-27.92
3791,-26.86
3792,-25.47
3793,-23.90
3794,-22.29
3795,-20.85
3796,-19.70
3797,-18.99
3798,-18.72
3799,-18.86
3800,-19.26
3801,-19.82
3802,-20.40
3803,-20.96
3804,-21.39
3805,-21.70
3806,-21.86
3807,-21.93
3808,-21.87
3809,-21.77
3810,-21.58
3811,-21.35
3812,-21.03
3813,-20.62
3814,-20.07
3815,-19.50
3816,-18.87
3817,-18.23
3818,-17.46
3819,-16.65
3820,-15.76
3821,-14.95
3822,-14.09
3823,-13.23
3824,-12.25
3825,-11.25
3826,-10.18
3827,-9.13
3828,-8.00
3829,-6.88
3830,-5.72
3831,-4.67
3832,-3.69
3833,-2.94
3834,-2.33
3835,-1.94
3836,-1.66
3837,-1.50
3838,-1.34
3839,-1.18
3840,-0.94
3841,-0.71
3842,-0.50
3843,-0.39
3844,-0.31
3845,-0.27
3846,-0.19
3847,-0.02
3848,0.28
3849,0.77
3850,1.38
3851,2.00
3852,2.45
3853,2.65
3854,2.52
3855,2.04
3856,1.20
3857,0.12
3858,-1.04
3859,-2.06
3860,-2.88
3861,-3.40
3862,-3.69
3863,-3.85
3864,-4.05
3865,-4.32
3866,-4.75
3867,-5.29
3868,-5.98
3869,-6.68
3870,-7.31
3871,-7.72
3872,-7.97
3873,-8.01
3874,-7.88
3875,-7.56
3876,-7.20
3877,-6.87
3878,-6.74
3879,-6.77
3880,-7.07
3881,-7.61
3882,-8.41
3883,-9.42
3884,-10.60
3885,-11.80
3886,-12.95
3887,-13.91
3888,-14.61
3889,-14.96
3890,-14.98
3891,-14.74
3892,-14.31
3893,-13.76
3894,-13.18
3895,-12.63
3896,-12.20
3897,-11.91
3898,-11.70
3899,-11.54
3900,-11.33
3901,-11.05
3902,-10.59
3903,-10.03
3904,-9.25
3905,-8.38
3906,-7.29
3907,-6.07
3908,-4.63
3909,-3.10
3910,-1.40
3911,0.30
3912,2.05
3913,3.64
3914,5.10
3915,6.20
3916,7.03
3917,7.47
3918,7.71
3919,7.71
3920,7.77
3921,7.97
3922,8.54
3923,9.41
3924,10.60
3925,11.91
3926,13.30
3927,14.54
3928,15.59
3929,16.29
3930,16.73
3931,16.94
3932,17.09
3933,17.24
3934,17.56
3935,18.10
3936,18.88
3937,19.79
3938,20.67
3939,21.35
3940,21.67
3941,21.58
3942,20.94
3943,19.82
3944,18.20
3945,16.43
3946,14.60
3947,13.02
3948,11.54
3949,10.28
3950,9.04
3951,7.84
3952,6.34
3953,4.62
3954,2.45
3955,0.09
3956,-2.53
3957,-5.07
3958,-7.49
3959,-9.49
3960,-11.18
3961,-12.44
3962,-13.50
3963,-14.30
3964,-15.02
3965,-15.65
3966,-16.32
3967,-16.91
3968,-17.37
3969,-17.61
3970,-17.65
3971,-17.52
3972,-17.24
3973,-16.83
3974,-16.27
3975,-15.69
3976,-15.07
3977,-14.44
3978,-13.63
3979,-12.71
3980,-11.59
3981,-10.42
3982,-9.09
3983,-7.74
3984,-6.32
3985,-5.04
3986,-3.78
3987,-2.62
3988,-1.40
3989,-0.25
3990,0.93
3991,2.05
3992,3.20
3993,4.20
3994,4.99
3995,5.46
3996,5.72
3997,5.74
3998,5.60
3999,5.28
4000,4.98
4001,4.78
4002,4.75
4003,4.81
4004,4.94
4005,5.06
4006,5.12
4007,5.12
4008,5.09
4009,5.04
4010,4.91
4011,4.75
4012,4.52
4013,4.36
4014,4.21
4015,4.10
4016,3.97
4017,3.88
4018,3.76
4019,3.61
4020,3.23
4021,2.66
4022,1.83
4023,0.85
4024,-0.45
4025,-1.96
4026,-3.78
4027,-5.67
4028,-7.65
4029,-9.48
4030,-11.18
4031,-12.58
4032,-13.79
4033,-14.70
4034,-15.52
4035,-16.18
4036,-16.96
4037,-17.75
4038,-18.71
4039,-19.71
4040,-20.81
4041,-21.80
4042,-22.67
4043,-23.31
4044,-23.84
4045,-24.28
4046,-24.77
4047,-25.30
4048,-25.94
4049,-26.58
4050,-27.22
4051,-27.76
4052,-28.21
4053,-28.49
4054,-28.61
4055,-28.61
4056,-28.59
4057,-28.58
4058,-28.54
4059,-28.43
4060,-28.26
4061,-28.02
4062,-27.66
4063,-27.18
4064,-26.64
4065,-26.15
4066,-25.79
4067,-25.63
4068,-25.59
4069,-25.66
4070,-25.76
4071,-25.90
4072,-25.99
4073,-26.00
4074,-25.86
4075,-25.62
4076,-25.34
4077,-25.09
4078,-24.89
4079,-24.79
4080,-24.78
4081,-24.83
4082,-24.89
4083,-24.89
4084,-24.87
4085,-24.86
4086,-24.88
4087,-24.87
4088,-24.88
4089,-24.93
4090,-25.09
4091,-25.33
4092,-25.61
4093,-25.85
4094,-26.05
4095,-26.21
4096,-26.40
4097,-26.57
4098,-26.75
4099,-26.92
4100,-27.14
4101,-27.37
4102,-27.63
4103,-27.87
4104,-28.09
4105,-28.27
4106,-28.40
4107,-28.52
4108,-28.64
4109,-28.76
4110,-28.85
4111,-28.85
4112,-28.75
4113,-28.50
4114,-28.14
4115,-27.73
4116,-27.30
4117,-26.87
4118,-26.45
4119,-26.10
4120,-25.86
4121,-25.73
4122,-25.67
4123,-25.63
4124,-25.57
4125,-25.57
4126,-25.62
4127,-25.75
4128,-25.94
4129,-26.18
4130,-26.42
4131,-26.61
4132,-26.70
4133,-26.65
4134,-26.40
4135,-25.98
4136,-25.44
4137,-24.89
4138,-24.42
4139,-24.12
4140,-24.03
4141,-24.16
4142,-24.43
4143,-24.74
4144,-25.00
4145,-25.20
4146,-25.28
4147,-25.28
4148,-25.18
4149,-25.02
4150,-24.76
4151,-24.42
4152,-23.89
4153,-23.19
4154,-22.28
4155,-21.28
4156,-20.15
4157,-19.04
4158,-17.92
4159,-17.00
4160,-16.14
4161,-15.49
4162,-14.78
4163,-14.05
4164,-13.05
4165,-11.90
4166,-10.46
4167,-8.89
4168,-7.00
4169,-5.01
4170,-2.85
4171,-0.79
4172,1.24
4173,3.05
4174,4.71
4175,6.06
4176,7.23
4177,8.15
4178,8.96
4179,9.58
4180,10.17
4181,10.68
4182,11.25
4183,11.78
4184,12.24
4185,12.53
4186,12.67
4187,12.68
4188,12.53
4189,12.16
4190,11.57
4191,10.86
4192,10.12
4193,9.39
4194,8.62
4195,7.86
4196,7.16
4197,6.62
4198,6.18
4199,5.84
4200,5.59
4201,5.52
4202,5.63
4203,5.89
4204,6.23
4205,6.58
4206,6.91
4207,7.22
4208,7.54
4209,7.88
4210,8.26
4211,8.68
4212,9.20
4213,9.79
4214,10.41
4215,10.95
4216,11.40
4217,11.68
4218,11.80
4219,11.73
4220,11.57
4221,11.38
4222,11.25
4223,11.24
4224,11.42
4225,11.79
4226,12.25
4227,12.68
4228,12.96
4229,13.03
4230,12.85
4231,12.43
4232,11.79
4233,11.07
4234,10.39
4235,9.84
4236,9.42
4237,9.14
4238,8.97
4239,8.93
4240,8.90
4241,8.85
4242,8.73
4243,8.56
4244,8.29
4245,7.95
4246,7.48
4247,6.94
4248,6.36
4249,5.83
4250,5.33
4251,4.93
4252,4.60
4253,4.36
4254,4.17
4255,4.07
4256,4.02
4257,4.02
4258,4.01
4259,4.03
4260,4.06
4261,4.11
4262,4.15
4263,4.16
4264,4.17
4265,4.16
4266,4.10
4267,3.97
4268,3.88
4269,3.85
4270,3.98
4271,4.28
4272,4.78
4273,5.45
4274,6.19
4275,6.85
4276,7.36
4277,7.66
4278,7.76
4279,7.68
4280,7.51
4281,7.32
4282,7.22
4283,7.21
4284,7.28
4285,7.35
4286,7.39
4287,7.32
4288,7.12
4289,6.75
4290,6.31
4291,5.93
4292,5.76
4293,5.87
4294,6.28
4295,6.88
4296,7.61
4297,8.32
4298,8.99
4299,9.52
4300,9.94
4301,10.22
4302,10.45
4303,10.67
4304,11.00
4305,11.41
4306,11.90
4307,12.38
4308,12.83
4309,13.19
4310,13.42
4311,13.48
4312,13.38
4313,13.13
4314,12.77
4315,12.36
4316,11.92
4317,11.50
4318,11.10
4319,10.75
4320,10.43
4321,10.13
4322,9.81
4323,9.52
4324,9.30
4325,9.18
4326,9.11
4327,9.12
4328,9.22
4329,9.41
4330,9.59
4331,9.73
4332,9.77
4333,9.71
4334,9.51
4335,9.22
4336,8.87
4337,8.58
4338,8.32
4339,8.10
4340,7.84
4341,7.57
4342,7.16
4343,6.65
4344,5.90
4345,4.97
4346,3.80
4347,2.62
4348,1.44
4349,0.40
4350,-0.63
4351,-1.61
4352,-2.68
4353,-3.72
4354,-4.86
4355,-5.97
4356,-7.14
4357,-8.26
4358,-9.37
4359,-10.29
4360,-11.10
4361,-11.73
4362,-12.34
4363,-12.83
4364,-13.34
4365,-13.80
4366,-14.35
4367,-14.92
4368,-15.55
4369,-16.08
4370,-16.55
4371,-16.94
4372,-17.35
4373,-17.76
4374,-18.20
4375,-18.62
4376,-19.00
4377,-19.36
4378,-19.71
4379,-20.01
4380,-20.19
4381,-20.19
4382,-20.05
4383,-19.86
4384,-19.68
4385,-19.51
4386,-19.31
4387,-19.07
4388,-18.78
4389,-18.42
4390,-17.97
4391,-17.43
4392,-16.85
4393,-16.31
4394,-15.85
4395,-15.56
4396,-15.44
4397,-15.57
4398,-15.90
4399,-16.33
4400,-16.72
4401,-16.97
4402,-17.07
4403,-17.07
4404,-16.96
4405,-16.78
4406,-16.56
4407,-16.32
4408,-16.06
4409,-15.77
4410,-15.41
4411,-15.00
4412,-14.53
4413,-14.05
4414,-13.57
4415,-13.16
4416,-12.82
4417,-12.60
4418,-12.42
4419,-12.26
4420,-11.99
4421,-11.65
4422,-11.21
4423,-10.73
4424,-10.19
4425,-9.67
4426,-9.19
4427,-8.84
4428,-8.54
4429,-8.26
4430,-7.92
4431,-7.59
4432,-7.19
4433,-6.72
4434,-6.09
4435,-5.40
4436,-4.64
4437,-3.87
4438,-2.99
4439,-2.13
4440,-1.27
4441,-0.57
4442,0.10
4443,0.72
4444,1.39
4445,2.02
4446,2.74
4447,3.49
4448,4.36
4449,5.23
4450,6.16
4451,7.04
4452,7.93
4453,8.67
4454,9.35
4455,9.86
4456,10.38
4457,10.88
4458,11.47
4459,12.06
4460,12.69
4461,13.26
4462,13.85
4463,14.37
4464,14.89
4465,15.36
4466,15.80
4467,16.14
4468,16.43
4469,16.66
4470,16.91
4471,17.14
4472,17.34
4473,17.46
4474,17.53
4475,17.59
4476,17.62
4477,17.56
4478,17.40
4479,17.17
4480,16.87
4481,16.58
4482,16.27
4483,15.98
4484,15.66
4485,15.31
4486,14.91
4487,14.43
4488,13.82
4489,13.12
4490,12.35
4491,11.63
4492,10.96
4493,10.44
4494,10.07
4495,9.85
4496,9.59
4497,9.25
4498,8.80
4499,8.33
4500,7.79
4501,7.27
4502,6.78
4503,6.50
4504,6.38
4505,6.41
4506,6.39
4507,6.31
4508,6.02
4509,5.55
4510,4.84
4511,4.01
4512,3.14
4513,2.37
4514,1.67
4515,1.09
4516,0.56
4517,0.17
4518,-0.14
4519,-0.37
4520,-0.63
4521,-0.85
4522,-1.01
4523,-1.07
4524,-1.11
4525,-1.14
4526,-1.25
4527,-1.43
4528,-1.71
4529,-2.07
4530,-2.44
4531,-2.75
4532,-2.94
4533,-3.00
4534,-2.94
4535,-2.80
4536,-2.69
4537,-2.70
4538,-2.81
4539,-2.93
4540,-3.00
4541,-3.01
4542,-2.98
4543,-2.91
4544,-2.77
4545,-2.59
4546,-2.45
4547,-2.38
4548,-2.37
4549,-2.39
4550,-2.41
4551,-2.40
4552,-2.33
4553,-2.22
4554,-2.11
4555,-2.06
4556,-1.97
4557,-1.87
4558,-1.75
4559,-1.63
4560,-1.42
4561,-1.08
4562,-0.59
4563,0.00
4564,0.70
4565,1.46
4566,2.30
4567,3.07
4568,3.76
4569,4.28
4570,4.71
4571,5.05
4572,5.39
4573,5.66
4574,5.98
4575,6.32
4576,6.77
4577,7.30
4578,7.92
4579,8.49
4580,9.07
4581,9.59
4582,10.14
4583,10.66
4584,11.21
4585,11.73
4586,12.31
4587,12.88
4588,13.50
4589,14.09
4590,14.69
4591,15.21
4592,15.69
4593,16.10
4594,16.51
4595,16.91
4596,17.35
4597,17.76
4598,18.15
4599,18.43
4600,18.65
4601,18.76
4602,18.84
4603,18.88
4604,18.93
4605,18.98
4606,19.12
4607,19.35
4608,19.68
4609,20.03
4610,20.42
4611,20.77
4612,21.08
4613,21.32
4614,21.51
4615,21.62
4616,21.66
4617,21.65
4618,21.68
4619,21.74
4620,21.80
4621,21.79
4622,21.74
4623,21.68
4624,21.61
4625,21.48
4626,21.30
4627,21.11
4628,21.05
4629,21.16
4630,21.43
4631,21.84
4632,22.45
4633,23.22
4634,24.11
4635,24.96
4636,25.70
4637,26.29
4638,26.76
4639,27.10
4640,27.39
4641,27.62
4642,27.85
4643,28.08
4644,28.34
4645,28.59
4646,28.76
4647,28.75
4648,28.57
4649,28.26
4650,27.92
4651,27.61
4652,27.37
4653,27.26
4654,27.29
4655,27.47
4656,27.74
4657,28.06
4658,28.34
4659,28.53
4660,28.53
4661,28.35
4662,28.05
4663,27.69
4664,27.28
4665,26.86
4666,26.47
4667,26.18
4668,25.96
4669,25.79
4670,25.59
4671,25.36
4672,25.08
4673,24.80
4674,24.45
4675,24.10
4676,23.71
4677,23.37
4678,23.06
4679,22.77
4680,22.41
4681,22.01
4682,21.55
4683,21.06
4684,20.54
4685,20.01
4686,19.51
4687,19.09
4688,18.73
4689,18.50
4690,18.42
4691,18.49
4692,18.60
4693,18.68
4694,18.65
4695,18.52
4696,18.33
4697,18.16
4698,18.02
4699,17.95
4700,17.97
4701,18.10
4702,18.33
4703,18.64
4704,18.94
4705,19.19
4706,19.34
4707,19.41
4708,19.36
4709,19.18
4710,18.88
4711,18.52
4712,18.14
4713,17.78
4714,17.42
4715,17.07
4716,16.73
4717,16.44
4718,16.14
4719,15.85
4720,15.56
4721,15.27
4722,14.92
4723,14.57
4724,14.22
4725,13.93
4726,13.65
4727,13.36
4728,13.01
4729,12.66
4730,12.32
4731,12.02
4732,11.74
4733,11.51
4734,11.34
4735,11.29
4736,11.28
4737,11.29
4738,11.30
4739,11.30
4740,11.28
4741,11.21
4742,11.12
4743,11.05
4744,11.05
4745,11.12
4746,11.22
4747,11.33
4748,11.49
4749,11.78
4750,12.29
4751,13.01
4752,13.89
4753,14.85
4754,15.85
4755,16.82
4756,17.64
4757,18.18
4758,18.41
4759,18.33
4760,18.06
4761,17.68
4762,17.32
4763,17.03
4764,16.79
4765,16.56
4766,16.25
4767,15.84
4768,15.32
4769,14.71
4770,14.03
4771,13.39
4772,12.83
4773,12.41
4774,12.05
4775,11.84
4776,11.76
4777,11.83
4778,11.89
4779,11.92
4780,11.87
4781,11.81
4782,11.69
4783,11.51
4784,11.32
4785,11.20
4786,11.17
4787,11.30
4788,11.57
4789,11.94
4790,12.30
4791,12.54
4792,12.61
4793,12.50
4794,12.21
4795,11.77
4796,11.28
4797,10.86
4798,10.62
4799,10.62
4800,10.81
4801,11.12
4802,11.48
4803,11.86
4804,12.13
4805,12.19
4806,11.99
4807,11.63
4808,11.23
4809,10.93
4810,10.71
4811,10.60
4812,10.61
4813,10.73
4814,10.88
4815,11.02
4816,11.09
4817,11.09
4818,10.98
4819,10.80
4820,10.64
4821,10.57
4822,10.61
4823,10.74
4824,10.89
4825,11.02
4826,11.06
4827,11.01
4828,10.85
4829,10.61
4830,10.29
4831,10.00
4832,9.77
4833,9.65
4834,9.61
4835,9.64
4836,9.63
4837,9.52
4838,9.19
4839,8.66
4840,7.99
4841,7.32
4842,6.70
4843,6.17
4844,5.74
4845,5.45
4846,5.25
4847,5.13
4848,5.06
4849,5.00
4850,4.95
4851,4.89
4852,4.81
4853,4.75
4854,4.76
4855,4.81
4856,4.90
4857,5.02
4858,5.21
4859,5.50
4860,5.90
4861,6.38
4862,6.95
4863,7.55
4864,8.10
4865,8.52
4866,8.80
4867,8.91
4868,8.89
4869,8.75
4870,8.61
4871,8.54
4872,8.62
4873,8.80
4874,9.03
4875,9.22
4876,9.30
4877,9.23
4878,9.05
4879,8.80
4880,8.57
4881,8.38
4882,8.26
4883,8.21
4884,8.22
4885,8.22
4886,8.11
4887,7.82
4888,7.36
4889,6.81
4890,6.25
4891,5.75
4892,5.46
4893,5.46
4894,5.77
4895,6.32
4896,6.97
4897,7.58
4898,8.07
4899,8.42
4900,8.64
4901,8.76
4902,8.83
4903,8.87
4904,8.95
4905,9.07
4906,9.27
4907,9.43
4908,9.54
4909,9.59
4910,9.71
4911,9.93
4912,10.28
4913,10.69
4914,11.23
4915,11.89
4916,12.60
4917,13.21
4918,13.63
4919,13.79
4920,13.75
4921,13.56
4922,13.34
4923,13.15
4924,13.05
4925,13.11
4926,13.35
4927,13.72
4928,14.10
4929,14.34
4930,14.39
4931,14.27
4932,14.02
4933,13.66
4934,13.20
4935,12.73
4936,12.30
4937,12.00
4938,11.79
4939,11.62
4940,11.45
4941,11.28
4942,11.05
4943,10.76
4944,10.38
4945,9.96
4946,9.52
4947,9.16
4948,8.94
4949,8.89
4950,8.93
4951,9.06
4952,9.26
4953,9.50
4954,9.73
4955,9.91
4956,10.05
4957,10.15
4958,10.27
4959,10.39
4960,10.53
4961,10.64
4962,10.74
4963,10.86
4964,11.05
4965,11.27
4966,11.54
4967,11.83
4968,12.22
4969,12.69
4970,13.21
4971,13.68
4972,14.15
4973,14.62
4974,15.11
4975,15.59
4976,16.06
4977,16.46
4978,16.83
4979,17.19
4980,17.58
4981,17.93
4982,18.19
4983,18.31
4984,18.34
4985,18.28
4986,18.08
4987,17.72
4988,17.27
4989,16.84
4990,16.49
4991,16.27
4992,16.11
4993,16.05
4994,16.09
4995,16.23
4996,16.37
4997,16.44
4998,16.34
4999,16.11
5000,15.77
5001,15.35
5002,14.82
5003,14.23
5004,13.63
5005,13.10
5006,12.56
5007,12.04
5008,11.54
5009,11.12
5010,10.75
5011,10.47
5012,10.23
5013,10.06
5014,9.90
5015,9.73
5016,9.51
5017,9.28
5018,9.03
5019,8.78
5020,8.54
5021,8.38
5022,8.30
5023,8.35
5024,8.52
5025,8.77
5026,9.08
5027,9.38
5028,9.62
5029,9.80
5030,9.93
5031,9.99
5032,9.95
5033,9.76
5034,9.48
5035,9.18
5036,8.91
5037,8.67
5038,8.43
5039,8.26
5040,8.20
5041,8.27
5042,8.34
5043,8.35
5044,8.29
5045,8.16
5046,7.97
5047,7.74
5048,7.47
5049,7.23
5050,7.04
5051,6.92
5052,6.87
5053,6.87
5054,6.90
5055,6.97
5056,7.06
5057,7.17
5058,7.32
5059,7.51
5060,7.71
5061,7.89
5062,8.02
5063,8.08
5064,8.06
5065,7.93
5066,7.71
5067,7.40
5068,7.11
5069,6.86
5070,6.68
5071,6.55
5072,6.55
5073,6.66
5074,6.89
5075,7.19
5076,7.55
5077,7.97
5078,8.44
5079,8.91
5080,9.38
5081,9.79
5082,10.18
5083,10.53
5084,10.88
5085,11.16
5086,11.41
5087,11.65
5088,11.92
5089,12.21
5090,12.50
5091,12.73
5092,12.97
5093,13.21
5094,13.42
5095,13.54
5096,13.56
5097,13.50
5098,13.38
5099,13.21
5100,12.94
5101,12.58
5102,12.15
5103,11.74
5104,11.34
5105,10.99
5106,10.66
5107,10.36
5108,10.09
5109,9.86
5110,9.65
5111,9.48
5112,9.29
5113,9.12
5114,8.95
5115,8.79
5116,8.53
5117,8.19
5118,7.72
5119,7.19
5120,6.57
5121,5.92
5122,5.23
5123,4.65
5124,4.18
5125,3.90
5126,3.70
5127,3.59
5128,3.54
5129,3.56
5130,3.54
5131,3.43
5132,3.15
5133,2.80
5134,2.42
5135,2.05
5136,1.70
5137,1.40
5138,1.22
5139,1.22
5140,1.39
5141,1.69
5142,2.11
5143,2.66
5144,3.28
5145,3.89
5146,4.38
5147,4.67
5148,4.80
5149,4.78
5150,4.71
5151,4.58
5152,4.44
5153,4.30
5154,4.25
5155,4.31
5156,4.50
5157,4.74
5158,4.97
5159,5.13
5160,5.32
5161,5.55
5162,5.85
5163,6.21
5164,6.62
5165,7.10
5166,7.67
5167,8.26
5168,8.83
5169,9.31
5170,9.70
5171,9.99
5172,10.21
5173,10.31
5174,10.36
5175,10.35
5176,10.36
5177,10.40
5178,10.53
5179,10.77
5180,11.15
5181,11.63
5182,12.15
5183,12.61
5184,13.05
5185,13.47
5186,13.89
5187,14.24
5188,14.50
5189,14.67
5190,14.86
5191,15.10
5192,15.36
5193,15.54
5194,15.60
5195,15.54
5196,15.38
5197,15.14
5198,14.82
5199,14.47
5200,14.11
5201,13.81
5202,13.57
5203,13.40
5204,13.26
5205,13.15
5206,13.00
5207,12.76
5208,12.41
5209,11.99
5210,11.56
5211,11.15
5212,10.70
5213,10.31
5214,9.94
5215,9.64
5216,9.35
5217,9.06
5218,8.80
5219,8.61
5220,8.48
5221,8.43
5222,8.47
5223,8.60
5224,8.72
5225,8.79
5226,8.79
5227,8.72
5228,8.60
5229,8.42
5230,8.22
5231,8.09
5232,8.09
5233,8.21
5234,8.45
5235,8.75
5236,9.08
5237,9.39
5238,9.61
5239,9.67
5240,9.54
5241,9.30
5242,9.03
5243,8.84
5244,8.77
5245,8.77
5246,8.82
5247,8.83
5248,8.72
5249,8.48
5250,8.14
5251,7.77
5252,7.44
5253,7.20
5254,7.10
5255,7.16
5256,7.36
5257,7.68
5258,8.00
5259,8.25
5260,8.35
5261,8.29
5262,8.09
5263,7.85
5264,7.60
5265,7.42
5266,7.35
5267,7.41
5268,7.56
5269,7.74
5270,7.93
5271,8.05
5272,8.06
5273,7.94
5274,7.72
5275,7.47
5276,7.28
5277,7.22
5278,7.32
5279,7.57
5280,7.88
5281,8.19
5282,8.45
5283,8.62
5284,8.68
5285,8.63
5286,8.48
5287,8.29
5288,8.13
5289,8.07
5290,8.13
5291,8.32
5292,8.57
5293,8.88
5294,9.22
5295,9.53
5296,9.67
5297,9.57
5298,9.17
5299,8.58
5300,7.80
5301,6.98
5302,6.11
5303,5.35
5304,4.68
5305,4.17
5306,3.67
5307,3.23
5308,2.70
5309,2.14
5310,1.39
5311,0.58
5312,-0.37
5313,-1.28
5314,-2.28
5315,-3.26
5316,-4.38
5317,-5.53
5318,-6.86
5319,-8.26
5320,-9.87
5321,-11.52
5322,-13.23
5323,-14.75
5324,-16.18
5325,-17.40
5326,-18.55
5327,-19.45
5328,-20.27
5329,-20.95
5330,-21.74
5331,-22.54
5332,-23.40
5333,-24.17
5334,-24.93
5335,-25.63
5336,-26.27
5337,-26.76
5338,-27.08
5339,-27.20
5340,-27.05
5341,-26.65
5342,-25.98
5343,-25.15
5344,-24.13
5345,-23.09
5346,-21.98
5347,-20.99
5348,-19.98
5349,-19.02
5350,-17.88
5351,-16.53
5352,-14.78
5353,-12.77
5354,-10.55
5355,-8.41
5356,-6.36
5357,-4.71
5358,-3.52
5359,-2.95
5360,-2.79
5361,-2.98
5362,-3.21
5363,-3.43
5364,-3.36
5365,-3.10
5366,-2.59
5367,-2.07
5368,-1.50
5369,-0.98
5370,-0.47
5371,-0.01
5372,0.47
5373,0.92
5374,1.43
5375,1.97
5376,2.55
5377,3.07
5378,3.52
5379,3.88
5380,4.23
5381,4.58
5382,4.91
5383,5.14
5384,5.32
5385,5.43
5386,5.46
5387,5.35
5388,5.08
5389,4.71
5390,4.32
5391,4.03
5392,3.85
5393,3.81
5394,3.79
5395,3.82
5396,3.79
5397,3.69
5398,3.37
5399,2.85
5400,2.11
5401,1.28
5402,0.37
5403,-0.50
5404,-1.37
5405,-2.12
5406,-2.85
5407,-3.53
5408,-4.34
5409,-5.21
5410,-6.23
5411,-7.22
5412,-8.27
5413,-9.25
5414,-10.28
5415,-11.21
5416,-12.11
5417,-12.86
5418,-13.56
5419,-14.19
5420,-14.89
5421,-15.52
5422,-16.11
5423,-16.56
5424,-17.02
5425,-17.40
5426,-17.80
5427,-18.13
5428,-18.57
5429,-19.07
5430,-19.74
5431,-20.44
5432,-21.23
5433,-22.04
5434,-22.97
5435,-23.90
5436,-24.90
5437,-25.89
5438,-26.99
5439,-28.11
5440,-29.27
5441,-30.33
5442,-31.33
5443,-32.15
5444,-32.83
5445,-33.23
5446,-33.39
5447,-33.31
5448,-33.13
5449,-32.94
5450,-32.84
5451,-32.84
5452,-32.92
5453,-33.05
5454,-33.16
5455,-33.16
5456,-32.97
5457,-32.56
5458,-31.94
5459,-31.15
5460,-30.24
5461,-29.34
5462,-28.56
5463,-28.02
5464,-27.72
5465,-27.66
5466,-27.86
5467,-28.27
5468,-28.87
5469,-29.53
5470,-30.21
5471,-30.80
5472,-31.29
5473,-31.64
5474,-31.91
5475,-32.06
5476,-32.20
5477,-32.37
5478,-32.68
5479,-33.15
5480,-33.78
5481,-34.50
5482,-35.29
5483,-36.06
5484,-36.77
5485,-37.31
5486,-37.68
5487,-37.85
5488,-37.83
5489,-37.64
5490,-37.39
5491,-37.14
5492,-36.93
5493,-36.76
5494,-36.62
5495,-36.50
5496,-36.35
5497,-36.19
5498,-35.96
5499,-35.61
5500,-35.02
5501,-34.26
5502,-33.38
5503,-32.55
5504,-31.75
5505,-31.18
5506,-30.85
5507,-30.88
5508,-31.07
5509,-31.30
5510,-31.29
5511,-30.98
5512,-30.13
5513,-28.85
5514,-27.03
5515,-24.96
5516,-22.67
5517,-20.48
5518,-18.39
5519,-16.57
5520,-14.88
5521,-13.43
5522,-12.05
5523,-10.89
5524,-9.81
5525,-8.94
5526,-8.20
5527,-7.75
5528,-7.51
5529,-7.54
5530,-7.68
5531,-7.89
5532,-8.02
5533,-8.09
5534,-8.06
5535,-8.01
5536,-7.94
5537,-7.87
5538,-7.83
5539,-7.90
5540,-8.13
5541,-8.48
5542,-8.87
5543,-9.24
5544,-9.61
5545,-9.96
5546,-10.23
5547,-10.36
5548,-10.36
5549,-10.24
5550,-9.96
5551,-9.54
5552,-9.04
5553,-8.55
5554,-8.13
5555,-7.77
5556,-7.51
5557,-7.38
5558,-7.41
5559,-7.60
5560,-7.91
5561,-8.21
5562,-8.38
5563,-8.39
5564,-8.27
5565,-8.07
5566,-7.84
5567,-7.58
5568,-7.44
5569,-7.42
5570,-7.57
5571,-7.87
5572,-8.35
5573,-8.92
5574,-9.61
5575,-10.31
5576,-11.15
5577,-12.07
5578,-13.15
5579,-14.27
5580,-15.52
5581,-16.80
5582,-18.19
5583,-19.55
5584,-20.94
5585,-22.22
5586,-23.47
5587,-24.58
5588,-25.68
5589,-26.67
5590,-27.61
5591,-28.37
5592,-29.03
5593,-29.48
5594,-29.77
5595,-29.82
5596,-29.71
5597,-29.46
5598,-29.14
5599,-28.83
5600,-28.62
5601,-28.50
5602,-28.40
5603,-28.24
5604,-27.92
5605,-27.38
5606,-26.60
5607,-25.70
5608,-24.80
5609,-24.07
5610,-23.61
5611,-23.51
5612,-23.72
5613,-24.22
5614,-24.84
5615,-25.48
5616,-25.91
5617,-26.06
5618,-25.76
5619,-25.13
5620,-24.13
5621,-22.96
5622,-21.55
5623,-20.10
5624,-18.51
5625,-16.93
5626,-15.23
5627,-13.60
5628,-11.94
5629,-10.55
5630,-9.27
5631,-8.27
5632,-7.23
5633,-6.23
5634,-4.93
5635,-3.50
5636,-1.69
5637,0.28
5638,2.59
5639,4.94
5640,7.40
5641,9.63
5642,11.71
5643,13.44
5644,15.08
5645,16.51
5646,17.98
5647,19.29
5648,20.69
5649,22.00
5650,23.48
5651,24.91
5652,26.47
5653,27.92
5654,29.46
5655,30.83
5656,32.19
5657,33.33
5658,34.52
5659,35.65
5660,36.97
5661,38.30
5662,39.79
5663,41.25
5664,42.78
5665,44.12
5666,45.32
5667,46.18
5668,46.85
5669,47.28
5670,47.70
5671,48.13
5672,48.81
5673,49.67
5674,50.81
5675,51.99
5676,53.19
5677,54.25
5678,55.24
5679,56.05
5680,56.76
5681,57.33
5682,57.91
5683,58.43
5684,58.91
5685,59.27
5686,59.52
5687,59.62
5688,59.64
5689,59.57
5690,59.46
5691,59.33
5692,59.23
5693,59.10
5694,58.95
5695,58.72
5696,58.38
5697,57.96
5698,57.46
5699,56.92
5700,56.38
5701,55.96
5702,55.73
5703,55.74
5704,55.92
5705,56.24
5706,56.60
5707,56.98
5708,57.24
5709,57.38
5710,57.33
5711,57.16
5712,56.85
5713,56.50
5714,56.13
5715,55.78
5716,55.38
5717,54.99
5718,54.53
5719,54.08
5720,53.50
5721,52.87
5722,52.12
5723,51.36
5724,50.50
5725,49.64
5726,48.68
5727,47.70
5728,46.52
5729,45.24
5730,43.79
5731,42.37
5732,40.94
5733,39.67
5734,38.44
5735,37.40
5736,36.38
5737,35.55
5738,34.68
5739,33.89
5740,32.94
5741,31.97
5742,30.85
5743,29.74
5744,28.54
5745,27.39
5746,26.15
5747,24.99
5748,23.79
5749,22.68
5750,21.58
5751,20.66
5752,19.81
5753,19.14
5754,18.45
5755,17.77
5756,16.91
5757,15.99
5758,14.91
5759,13.79
5760,12.58
5761,11.47
5762,10.47
5763,9.77
5764,9.28
5765,9.03
5766,8.80
5767,8.60
5768,8.22
5769,7.77
5770,7.17
5771,6.53
5772,5.81
5773,5.10
5774,4.42
5775,3.83
5776,3.29
5777,2.84
5778,2.39
5779,1.98
5780,1.56
5781,1.22
5782,0.93
5783,0.72
5784,0.40
5785,-0.04
5786,-0.69
5787,-1.46
5788,-2.38
5789,-3.32
5790,-4.29
5791,-5.19
5792,-6.01
5793,-6.65
5794,-7.09
5795,-7.32
5796,-7.48
5797,-7.50
5798,-7.45
5799,-7.32
5800,-7.28
5801,-7.32
5802,-7.42
5803,-7.55
5804,-7.74
5805,-7.92
5806,-7.97
5807,-7.80
5808,-7.42
5809,-7.00
5810,-6.60
5811,-6.30
5812,-6.12
5813,-6.14
5814,-6.32
5815,-6.65
5816,-6.90
5817,-7.06
5818,-6.99
5819,-6.71
5820,-6.08
5821,-5.20
5822,-4.09
5823,-2.91
5824,-1.60
5825,-0.25
5826,1.17
5827,2.47
5828,3.62
5829,4.50
5830,5.22
5831,5.66
5832,5.91
5833,5.94
5834,5.99
5835,6.07
5836,6.31
5837,6.65
5838,7.19
5839,7.84
5840,8.55
5841,9.22
5842,9.80
5843,10.20
5844,10.43
5845,10.41
5846,10.25
5847,9.99
5848,9.75
5849,9.56
5850,9.48
5851,9.53
5852,9.77
5853,10.19
5854,10.73
5855,11.34
5856,11.96
5857,12.50
5858,12.90
5859,13.14
5860,13.24
5861,13.22
5862,13.16
5863,13.10
5864,13.11
5865,13.21
5866,13.44
5867,13.76
5868,14.08
5869,14.33
5870,14.39
5871,14.27
5872,14.03
5873,13.71
5874,13.38
5875,13.08
5876,12.88
5877,12.76
5878,12.67
5879,12.63
5880,12.60
5881,12.60
5882,12.58
5883,12.59
5884,12.66
5885,12.85
5886,13.06
5887,13.19
5888,13.17
5889,12.99
5890,12.67
5891,12.25
5892,11.75
5893,11.28
5894,10.89
5895,10.66
5896,10.51
5897,10.42
5898,10.25
5899,9.97
5900,9.46
5901,8.75
5902,7.87
5903,7.03
5904,6.32
5905,5.86
5906,5.56
5907,5.46
5908,5.50
5909,5.65
5910,5.71
5911,5.61
5912,5.26
5913,4.78
5914,4.23
5915,3.70
5916,3.17
5917,2.70
5918,2.30
5919,2.01
5920,1.76
5921,1.53
5922,1.29
5923,1.05
5924,0.81
5925,0.56
5926,0.33
5927,0.14
5928,0.08
5929,0.14
5930,0.31
5931,0.53
5932,0.88
5933,1.35
5934,1.98
5935,2.70
5936,3.46
5937,4.24
5938,5.05
5939,5.84
5940,6.48
5941,6.91
5942,7.09
5943,7.02
5944,6.71
5945,6.18
5946,5.46
5947,4.61
5948,3.72
5949,2.87
5950,2.14
5951,1.55
5952,1.05
5953,0.64
5954,0.30
5955,0.08
5956,-0.07
5957,-0.10
5958,-0.14
5959,-0.19
5960,-0.30
5961,-0.40
5962,-0.56
5963,-0.72
5964,-0.97
5965,-1.32
5966,-1.81
5967,-2.34
5968,-2.88
5969,-3.35
5970,-3.81
5971,-4.22
5972,-4.56
5973,-4.79
5974,-4.97
5975,-5.14
5976,-5.34
5977,-5.52
5978,-5.67
5979,-5.77
5980,-5.91
5981,-6.08
5982,-6.30
5983,-6.53
5984,-6.81
5985,-7.10
5986,-7.44
5987,-7.80
5988,-8.16
5989,-8.51
5990,-8.87
5991,-9.23
5992,-9.58
5993,-9.88
5994,-10.09
5995,-10.15
5996,-10.06
5997,-9.74
5998,-9.27
5999,-8.71
6000,-8.21
6001,-7.84
6002,-7.68
6003,-7.73
6004,-8.03
6005,-8.58
6006,-9.32
6007,-10.16
6008,-11.00
6009,-11.78
6010,-12.50
6011,-13.10
6012,-13.51
6013,-13.63
6014,-13.47
6015,-13.09
6016,-12.63
6017,-12.14
6018,-11.70
6019,-11.39
6020,-11.31
6021,-11.51
6022,-11.86
6023,-12.23
6024,-12.50
6025,-12.63
6026,-12.58
6027,-12.35
6028,-11.89
6029,-11.30
6030,-10.65
6031,-10.06
6032,-9.48
6033,-8.96
6034,-8.45
6035,-8.00
6036,-7.49
6037,-6.97
6038,-6.36
6039,-5.79
6040,-5.19
6041,-4.63
6042,-3.92
6043,-3.19
6044,-2.31
6045,-1.46
6046,-0.44
6047,0.64
6048,1.96
6049,3.36
6050,4.96
6051,6.59
6052,8.40
6053,10.22
6054,12.13
6055,13.95
6056,15.78
6057,17.36
6058,18.75
6059,19.80
6060,20.65
6061,21.25
6062,21.83
6063,22.34
6064,22.93
6065,23.50
6066,24.12
6067,24.65
6068,25.08
6069,25.25
6070,25.14
6071,24.77
6072,24.26
6073,23.77
6074,23.38
6075,23.15
6076,23.06
6077,23.06
6078,23.07
6079,23.03
6080,22.89
6081,22.64
6082,22.28
6083,21.93
6084,21.68
6085,21.62
6086,21.68
6087,21.83
6088,21.97
6089,22.10
6090,22.12
6091,21.95
6092,21.55
6093,21.01
6094,20.42
6095,19.88
6096,19.39
6097,18.99
6098,18.65
6099,18.36
6100,18.02
6101,17.62
6102,17.10
6103,16.57
6104,16.02
6105,15.50
6106,14.95
6107,14.49
6108,14.08
6109,13.81
6110,13.54
6111,13.26
6112,12.87
6113,12.47
6114,12.03
6115,11.62
6116,11.17
6117,10.77
6118,10.44
6119,10.20
6120,9.97
6121,9.74
6122,9.54
6123,9.41
6124,9.34
6125,9.28
6126,9.25
6127,9.25
6128,9.28
6129,9.34
6130,9.43
6131,9.61
6132,9.93
6133,10.41
6134,11.00
6135,11.60
6136,12.17
6137,12.65
6138,13.00
6139,13.18
6140,13.18
6141,13.06
6142,12.89
6143,12.70
6144,12.50
6145,12.33
6146,12.21
6147,12.17
6148,12.06
6149,11.84
6150,11.44
6151,10.98
6152,10.43
6153,9.85
6154,9.16
6155,8.46
6156,7.71
6157,7.02
6158,6.28
6159,5.53
6160,4.66
6161,3.78
6162,2.85
6163,1.98
6164,1.10
6165,0.30
6166,-0.53
6167,-1.27
6168,-2.03
6169,-2.72
6170,-3.49
6171,-4.23
6172,-5.02
6173,-5.77
6174,-6.66
6175,-7.64
6176,-8.80
6177,-9.96
6178,-11.23
6179,-12.45
6180,-13.74
6181,-14.91
6182,-16.01
6183,-16.87
6184,-17.63
6185,-18.25
6186,-18.92
6187,-19.60
6188,-20.45
6189,-21.37
6190,-22.48
6191,-23.61
6192,-24.70
6193,-25.52
6194,-26.07
6195,-26.28
6196,-26.31
6197,-26.22
6198,-26.17
6199,-26.19
6200,-26.47
6201,-27.00
6202,-27.81
6203,-28.69
6204,-29.60
6205,-30.43
6206,-31.24
6207,-31.99
6208,-32.74
6209,-33.43
6210,-34.20
6211,-35.02
6212,-35.94
6213,-36.83
6214,-37.69
6215,-38.38
6216,-38.98
6217,-39.44
6218,-39.86
6219,-40.19
6220,-40.53
6221,-40.81
6222,-41.11
6223,-41.39
6224,-41.73
6225,-42.08
6226,-42.44
6227,-42.79
6228,-43.17
6229,-43.52
6230,-43.82
6231,-44.07
6232,-44.29
6233,-44.45
6234,-44.57
6235,-44.69
6236,-44.89
6237,-45.17
6238,-45.52
6239,-45.89
6240,-46.29
6241,-46.70
6242,-47.10
6243,-47.40
6244,-47.60
6245,-47.65
6246,-47.55
6247,-47.31
6248,-47.00
6249,-46.69
6250,-46.42
6251,-46.19
6252,-45.96
6253,-45.72
6254,-45.46
6255,-45.23
6256,-45.03
6257,-44.85
6258,-44.65
6259,-44.43
6260,-44.13
6261,-43.77
6262,-43.33
6263,-42.86
6264,-42.39
6265,-41.95
6266,-41.60
6267,-41.43
6268,-41.50
6269,-41.80
6270,-42.21
6271,-42.65
6272,-43.08
6273,-43.49
6274,-43.83
6275,-44.14
6276,-44.49
6277,-44.89
6278,-45.33
6279,-45.76
6280,-46.20
6281,-46.61
6282,-46.93
6283,-47.12
6284,-47.20
6285,-47.20
6286,-47.07
6287,-46.84
6288,-46.49
6289,-46.09
6290,-45.58
6291,-45.00
6292,-44.27
6293,-43.52
6294,-42.70
6295,-41.95
6296,-41.16
6297,-40.42
6298,-39.59
6299,-38.72
6300,-37.67
6301,-36.56
6302,-35.34
6303,-34.17
6304,-32.97
6305,-31.85
6306,-30.78
6307,-29.98
6308,-29.37
6309,-29.05
6310,-28.81
6311,-28.67
6312,-28.48
6313,-28.28
6314,-27.85
6315,-27.22
6316,-26.31
6317,-25.25
6318,-24.02
6319,-22.77
6320,-21.51
6321,-20.46
6322,-19.62
6323,-19.04
6324,-18.59
6325,-18.33
6326,-18.14
6327,-18.11
6328,-18.07
6329,-18.04
6330,-17.91
6331,-17.76
6332,-17.47
6333,-17.08
6334,-16.46
6335,-15.72
6336,-14.76
6337,-13.78
6338,-12.66
6339,-11.56
6340,-10.35
6341,-9.20
6342,-7.97
6343,-6.76
6344,-5.36
6345,-3.91
6346,-2.30
6347,-0.85
6348,0.56
6349,1.69
6350,2.75
6351,3.62
6352,4.71
6353,5.87
6354,7.45
6355,9.25
6356,11.51
6357,13.89
6358,16.55
6359,19.12
6360,21.80
6361,24.30
6362,26.84
6363,29.17
6364,31.54
6365,33.74
6366,36.00
6367,38.05
6368,40.02
6369,41.57
6370,42.85
6371,43.69
6372,44.42
6373,45.01
6374,45.72
6375,46.46
6376,47.43
6377,48.48
6378,49.58
6379,50.48
6380,51.12
6381,51.35
6382,51.18
6383,50.63
6384,49.81
6385,48.91
6386,48.00
6387,47.19
6388,46.39
6389,45.63
6390,44.82
6391,44.01
6392,43.10
6393,42.16
6394,41.12
6395,40.12
6396,39.15
6397,38.34
6398,37.58
6399,36.95
6400,36.37
6401,35.91
6402,35.48
6403,35.08
6404,34.62
6405,34.15
6406,33.65
6407,33.18
6408,32.70
6409,32.22
6410,31.78
6411,31.40
6412,31.20
6413,31.19
6414,31.45
6415,31.98
6416,32.78
6417,33.81
6418,34.98
6419,36.19
6420,37.32
6421,38.28
6422,39.03
6423,39.51
6424,39.70
6425,39.63
6426,39.38
6427,39.02
6428,38.59
6429,38.10
6430,37.61
6431,37.19
6432,36.90
6433,36.78
6434,36.78
6435,36.86
6436,36.93
6437,37.01
6438,36.99
6439,36.90
6440,36.61
6441,36.15
6442,35.47
6443,34.71
6444,33.85
6445,33.04
6446,32.18
6447,31.36
6448,30.53
6449,29.77
6450,29.03
6451,28.34
6452,27.55
6453,26.74
6454,25.83
6455,24.94
6456,24.03
6457,23.22
6458,22.49
6459,21.90
6460,21.36
6461,20.95
6462,20.74
6463,20.79
6464,21.07
6465,21.56
6466,22.25
6467,23.09
6468,23.98
6469,24.76
6470,25.40
6471,25.86
6472,26.21
6473,26.44
6474,26.61
6475,26.70
6476,26.86
6477,27.07
6478,27.45
6479,27.92
6480,28.49
6481,29.07
6482,29.72
6483,30.36
6484,31.03
6485,31.61
6486,32.17
6487,32.68
6488,33.26
6489,33.84
6490,34.45
6491,34.99
6492,35.45
6493,35.80
6494,36.06
6495,36.23
6496,36.36
6497,36.42
6498,36.41
6499,36.35
6500,36.27
6501,36.21
6502,36.14
6503,36.10
6504,36.06
6505,36.00
6506,35.85
6507,35.63
6508,35.31
6509,34.92
6510,34.29
6511,33.42
6512,32.22
6513,30.91
6514,29.57
6515,28.39
6516,27.31
6517,26.44
6518,25.72
6519,25.22
6520,24.76
6521,24.32
6522,23.71
6523,23.03
6524,22.18
6525,21.37
6526,20.52
6527,19.78
6528,19.03
6529,18.36
6530,17.56
6531,16.65
6532,15.41
6533,13.95
6534,12.18
6535,10.35
6536,8.45
6537,6.75
6538,5.17
6539,3.89
6540,2.81
6541,2.01
6542,1.28
6543,0.69
6544,-0.02
6545,-0.75
6546,-1.72
6547,-2.82
6548,-4.12
6549,-5.48
6550,-6.97
6551,-8.46
6552,-9.86
6553,-11.00
6554,-11.82
6555,-12.24
6556,-12.23
6557,-11.81
6558,-11.02
6559,-10.00
6560,-8.85
6561,-7.72
6562,-6.62
6563,-5.62
6564,-4.63
6565,-3.64
6566,-2.52
6567,-1.34
6568,-0.08
6569,1.10
6570,2.18
6571,3.05
6572,3.81
6573,4.38
6574,4.88
6575,5.21
6576,5.49
6577,5.70
6578,5.98
6579,6.26
6580,6.55
6581,6.73
6582,6.81
6583,6.79
6584,6.75
6585,6.68
6586,6.62
6587,6.55
6588,6.52
6589,6.51
6590,6.58
6591,6.68
6592,6.86
6593,7.10
6594,7.43
6595,7.85
6596,8.29
6597,8.72
6598,9.12
6599,9.48
6600,9.76
6601,9.88
6602,9.81
6603,9.64
6604,9.44
6605,9.25
6606,9.04
6607,8.82
6608,8.58
6609,8.35
6610,8.02
6611,7.56
6612,6.91
6613,6.13
6614,5.23
6615,4.29
6616,3.31
6617,2.42
6618,1.63
6619,1.05
6620,0.63
6621,0.35
6622,0.06
6623,-0.21
6624,-0.48
6625,-0.65
6626,-0.79
6627,-0.89
6628,-1.02
6629,-1.14
6630,-1.24
6631,-1.35
6632,-1.55
6633,-1.84
6634,-2.20
6635,-2.57
6636,-2.91
6637,-3.13
6638,-3.25
6639,-3.30
6640,-3.40
6641,-3.56
6642,-3.81
6643,-4.11
6644,-4.49
6645,-4.91
6646,-5.29
6647,-5.60
6648,-5.84
6649,-6.00
6650,-6.13
6651,-6.25
6652,-6.40
6653,-6.58
6654,-6.73
6655,-6.81
6656,-6.78
6657,-6.65
6658,-6.42
6659,-6.13
6660,-5.82
6661,-5.58
6662,-5.37
6663,-5.21
6664,-5.05
6665,-4.88
6666,-4.62
6667,-4.27
6668,-3.83
6669,-3.36
6670,-2.81
6671,-2.22
6672,-1.59
6673,-1.00
6674,-0.43
6675,0.08
6676,0.58
6677,1.00
6678,1.35
6679,1.57
6680,1.72
6681,1.82
6682,1.98
6683,2.23
6684,2.54
6685,2.84
6686,3.07
6687,3.20
6688,3.19
6689,3.01
6690,2.62
6691,2.08
6692,1.48
6693,0.98
6694,0.71
6695,0.64
6696,0.76
6697,1.01
6698,1.36
6699,1.71
6700,2.01
6701,2.26
6702,2.49
6703,2.72
6704,2.93
6705,3.17
6706,3.53
6707,3.99
6708,4.52
6709,5.00
6710,5.49
6711,5.94
6712,6.39
6713,6.74
6714,7.04
6715,7.28
6716,7.44
6717,7.49
6718,7.46
6719,7.34
6720,7.14
6721,6.83
6722,6.45
6723,6.10
6724,5.84
6725,5.71
6726,5.69
6727,5.77
6728,5.90
6729,6.03
6730,6.03
6731,5.93
6732,5.71
6733,5.48
6734,5.21
6735,4.91
6736,4.59
6737,4.29
6738,4.04
6739,3.88
6740,3.70
6741,3.47
6742,3.14
6743,2.78
6744,2.43
6745,2.14
6746,1.88
6747,1.65
6748,1.42
6749,1.25
6750,1.11
6751,1.00
6752,0.86
6753,0.69
6754,0.47
6755,0.23
6756,-0.02
6757,-0.18
6758,-0.27
6759,-0.32
6760,-0.41
6761,-0.58
6762,-0.85
6763,-1.21
6764,-1.68
6765,-2.21
6766,-2.78
6767,-3.26
6768,-3.62
6769,-3.85
6770,-3.99
6771,-4.04
6772,-4.04
6773,-3.97
6774,-3.88
6775,-3.82
6776,-3.85
6777,-3.97
6778,-4.15
6779,-4.34
6780,-4.47
6781,-4.54
6782,-4.50
6783,-4.33
6784,-3.96
6785,-3.43
6786,-2.76
6787,-2.04
6788,-1.30
6789,-0.65
6790,-0.11
6791,0.29
6792,0.66
6793,1.00
6794,1.34
6795,1.69
6796,2.15
6797,2.68
6798,3.24
6799,3.74
6800,4.10
6801,4.26
6802,4.23
6803,4.06
6804,3.80
6805,3.49
6806,3.12
6807,2.66
6808,2.08
6809,1.43
6810,0.65
6811,-0.24
6812,-1.20
6813,-2.10
6814,-2.85
6815,-3.39
6816,-3.74
6817,-3.90
6818,-3.93
6819,-3.85
6820,-3.79
6821,-3.78
6822,-3.88
6823,-4.04
6824,-4.31
6825,-4.61
6826,-4.91
6827,-5.15
6828,-5.30
6829,-5.35
6830,-5.36
6831,-5.42
6832,-5.58
6833,-5.81
6834,-6.10
6835,-6.39
6836,-6.73
6837,-7.03
6838,-7.21
6839,-7.21
6840,-7.06
6841,-6.87
6842,-6.71
6843,-6.58
6844,-6.52
6845,-6.52
6846,-6.62
6847,-6.79
6848,-6.99
6849,-7.16
6850,-7.36
6851,-7.60
6852,-7.88
6853,-8.18
6854,-8.48
6855,-8.77
6856,-9.09
6857,-9.38
6858,-9.66
6859,-9.89
6860,-10.12
6861,-10.34
6862,-10.61
6863,-10.91
6864,-11.24
6865,-11.53
6866,-11.78
6867,-11.96
6868,-12.08
6869,-12.14
6870,-12.14
6871,-12.14
6872,-12.19
6873,-12.25
6874,-12.23
6875,-12.12
6876,-11.93
6877,-11.69
6878,-11.38
6879,-11.02
6880,-10.67
6881,-10.43
6882,-10.31
6883,-10.32
6884,-10.41
6885,-10.54
6886,-10.64
6887,-10.65
6888,-10.51
6889,-10.21
6890,-9.77
6891,-9.28
6892,-8.83
6893,-8.48
6894,-8.22
6895,-8.05
6896,-7.90
6897,-7.73
6898,-7.49
6899,-7.19
6900,-6.84
6901,-6.53
6902,-6.36
6903,-6.36
6904,-6.52
6905,-6.83
6906,-7.23
6907,-7.72
6908,-8.22
6909,-8.64
6910,-8.92
6911,-9.03
6912,-9.05
6913,-9.03
6914,-9.06
6915,-9.12
6916,-9.24
6917,-9.41
6918,-9.66
6919,-9.95
6920,-10.30
6921,-10.65
6922,-10.99
6923,-11.29
6924,-11.55
6925,-11.73
6926,-11.82
6927,-11.80
6928,-11.76
6929,-11.76
6930,-11.86
6931,-12.02
6932,-12.26
6933,-12.57
6934,-12.97
6935,-13.38
6936,-13.69
6937,-13.82
6938,-13.79
6939,-13.66
6940,-13.46
6941,-13.21
6942,-13.02
6943,-12.95
6944,-13.05
6945,-13.23
6946,-13.41
6947,-13.53
6948,-13.60
6949,-13.59
6950,-13.51
6951,-13.39
6952,-13.31
6953,-13.29
6954,-13.38
6955,-13.57
6956,-13.85
6957,-14.21
6958,-14.60
6959,-14.89
6960,-15.07
6961,-15.12
6962,-15.13
6963,-15.12
6964,-15.11
6965,-15.05
6966,-14.94
6967,-14.82
6968,-14.72
6969,-14.67
6970,-14.63
6971,-14.56
6972,-14.48
6973,-14.42
6974,-14.40
6975,-14.40
6976,-14.39
6977,-14.34
6978,-14.23
6979,-14.11
6980,-14.01
6981,-13.95
6982,-13.92
6983,-13.92
6984,-13.95
6985,-14.02
6986,-14.08
6987,-14.10
6988,-13.98
6989,-13.74
6990,-13.39
6991,-12.98
6992,-12.49
6993,-11.95
6994,-11.38
6995,-10.85
6996,-10.36
6997,-9.95
6998,-9.57
6999,-9.29
7000,-9.07
7001,-8.96
7002,-8.89
7003,-8.86
7004,-8.76
7005,-8.59
7006,-8.26
7007,-7.87
7008,-7.39
7009,-6.92
7010,-6.39
7011,-5.87
7012,-5.37
7013,-4.96
7014,-4.55
7015,-4.14
7016,-3.72
7017,-3.30
7018,-2.87
7019,-2.46
7020,-2.08
7021,-1.85
7022,-1.75
7023,-1.83
7024,-1.98
7025,-2.17
7026,-2.33
7027,-2.46
7028,-2.53
7029,-2.59
7030,-2.66
7031,-2.79
7032,-2.94
7033,-3.06
7034,-3.11
7035,-3.05
7036,-2.88
7037,-2.58
7038,-2.16
7039,-1.66
7040,-1.21
7041,-0.91
7042,-0.80
7043,-0.86
7044,-1.05
7045,-1.29
7046,-1.56
7047,-1.80
7048,-1.98
7049,-2.09
7050,-2.20
7051,-2.37
7052,-2.66
7053,-3.01
7054,-3.42
7055,-3.77
7056,-4.06
7057,-4.24
7058,-4.31
7059,-4.24
7060,-4.07
7061,-3.89
7062,-3.78
7063,-3.78
7064,-3.84
7065,-3.97
7066,-4.17
7067,-4.40
7068,-4.59
7069,-4.66
7070,-4.62
7071,-4.49
7072,-4.30
7073,-4.12
7074,-4.01
7075,-4.01
7076,-4.10
7077,-4.22
7078,-4.34
7079,-4.46
7080,-4.59
7081,-4.71
7082,-4.79
7083,-4.84
7084,-4.95
7085,-5.19
7086,-5.55
7087,-5.97
7088,-6.42
7089,-6.84
7090,-7.21
7091,-7.51
7092,-7.71
7093,-7.77
7094,-7.69
7095,-7.51
7096,-7.26
7097,-6.96
7098,-6.61
7099,-6.25
7100,-5.91
7101,-5.61
7102,-5.33
7103,-5.10
7104,-4.93
7105,-4.81
7106,-4.69
7107,-4.58
7108,-4.49
7109,-4.47
7110,-4.59
7111,-4.89
7112,-5.41
7113,-6.07
7114,-6.76
7115,-7.37
7116,-7.86
7117,-8.16
7118,-8.19
7119,-7.95
7120,-7.51
7121,-7.01
7122,-6.59
7123,-6.28
7124,-6.13
7125,-6.13
7126,-6.29
7127,-6.58
7128,-7.00
7129,-7.42
7130,-7.78
7131,-8.07
7132,-8.36
7133,-8.65
7134,-8.95
7135,-9.19
7136,-9.37
7137,-9.54
7138,-9.77
7139,-10.06
7140,-10.42
7141,-10.84
7142,-11.33
7143,-11.81
7144,-12.19
7145,-12.38
7146,-12.36
7147,-12.11
7148,-11.66
7149,-11.12
7150,-10.60
7151,-10.18
7152,-9.83
7153,-9.54
7154,-9.29
7155,-9.06
7156,-8.77
7157,-8.42
7158,-8.00
7159,-7.58
7160,-7.19
7161,-6.89
7162,-6.71
7163,-6.65
7164,-6.69
7165,-6.81
7166,-6.99
7167,-7.24
7168,-7.55
7169,-7.90
7170,-8.27
7171,-8.71
7172,-9.20
7173,-9.67
7174,-10.02
7175,-10.22
7176,-10.29
7177,-10.22
7178,-9.95
7179,-9.54
7180,-9.09
7181,-8.66
7182,-8.21
7183,-7.74
7184,-7.29
7185,-6.94
7186,-6.63
7187,-6.35
7188,-6.04
7189,-5.77
7190,-5.45
7191,-5.15
7192,-4.83
7193,-5.49
7194,-4.94
7195,-1.98
7196,-0.60
7197,-6.21
7198,-11.68
7199,-0.14
7200,17.14
