1,-36.29
2,-50.00
3,-50.00
4,-24.22
5,27.22
6,50.00
7,50.00
8,48.46
9,45.50
10,49.85
11,50.00
12,50.00
13,49.22
14,49.75
15,50.00
16,50.00
17,50.00
18,50.00
19,50.00
20,50.00
21,50.00
22,50.00
23,50.00
24,50.00
25,50.00
26,50.00
27,50.00
28,50.00
29,50.00
30,50.00
31,50.00
32,50.00
33,50.00
34,49.97
35,50.00
36,50.00
37,50.00
38,49.65
39,48.92
40,47.96
41,46.99
42,45.93
43,44.83
44,43.65
45,42.53
46,41.37
47,40.28
48,39.26
49,38.50
50,37.91
51,37.48
52,36.97
53,36.40
54,35.65
55,34.90
56,34.15
57,33.58
58,33.08
59,32.62
60,31.97
61,31.21
62,30.35
63,29.63
64,29.05
65,28.64
66,28.21
67,27.76
68,27.18
69,26.58
70,25.92
71,25.31
72,24.73
73,24.29
74,23.93
75,23.65
76,23.34
77,23.00
78,22.57
79,22.17
80,21.80
81,21.53
82,21.28
83,21.02
84,20.70
85,20.41
86,20.15
87,19.99
88,19.82
89,19.59
90,19.21
91,18.76
92,18.27
93,17.88
94,17.59
95,17.40
96,17.22
97,17.04
98,16.80
99,16.53
100,16.19
101,15.83
102,15.46
103,15.19
104,15.01
105,14.92
106,14.83
107,14.68
108,14.43
109,14.17
110,13.95
111,13.83
112,13.75
113,13.67
114,13.52
115,13.32
116,13.13
117,13.00
118,12.94
119,12.92
120,12.86
121,12.75
122,12.59
123,12.39
124,12.18
125,11.98
126,11.78
127,11.60
128,11.39
129,11.13
130,10.82
131,10.57
132,10.47
133,10.58
134,10.81
135,11.02
136,11.05
137,10.92
138,10.73
139,10.65
140,10.70
141,10.80
142,10.80
143,10.63
144,10.38
145,10.21
146,10.25
147,10.47
148,10.73
149,10.91
150,10.94
151,10.89
152,10.81
153,10.75
154,10.66
155,10.49
156,10.26
157,10.01
158,9.81
159,9.68
160,9.60
161,9.51
162,9.37
163,9.18
164,9.00
165,8.89
166,8.88
167,8.99
168,9.13
169,9.23
170,9.21
171,9.08
172,8.85
173,8.62
174,8.42
175,8.32
176,8.29
177,8.33
178,8.38
179,8.40
180,8.31
181,8.12
182,7.86
183,7.63
184,7.47
185,7.37
186,7.25
187,7.04
188,6.76
189,6.53
190,6.42
191,6.47
192,6.58
193,6.65
194,6.64
195,6.59
196,6.57
197,6.63
198,6.75
199,6.86
200,6.91
201,6.89
202,6.80
203,6.64
204,6.41
205,6.16
206,5.97
207,5.91
208,6.02
209,6.22
210,6.40
211,6.44
212,6.33
213,6.16
214,6.00
215,5.90
216,5.86
217,5.86
218,5.87
219,5.91
220,5.91
221,5.83
222,5.64
223,5.36
224,5.04
225,4.80
226,4.68
227,4.64
228,4.63
229,4.58
230,4.47
231,4.36
232,4.25
233,4.17
234,4.09
235,4.05
236,4.05
237,4.11
238,4.16
239,4.14
240,3.99
241,3.73
242,3.43
243,3.21
244,3.08
245,3.01
246,2.93
247,2.80
248,2.65
249,2.54
250,2.50
251,2.53
252,2.55
253,2.52
254,2.43
255,2.35
256,2.31
257,2.31
258,2.32
259,2.28
260,2.15
261,1.96
262,1.72
263,1.50
264,1.29
265,1.10
266,0.95
267,0.86
268,0.89
269,1.03
270,1.20
271,1.30
272,1.21
273,0.91
274,0.50
275,0.14
276,-0.03
277,0.05
278,0.28
279,0.51
280,0.56
281,0.40
282,0.12
283,-0.11
284,-0.19
285,-0.09
286,0.07
287,0.17
288,0.14
289,0.03
290,-0.12
291,-0.25
292,-0.38
293,-0.55
294,-0.75
295,-0.91
296,-0.98
297,-0.96
298,-0.93
299,-0.95
300,-1.03
301,-1.09
302,-1.06
303,-0.92
304,-0.79
305,-0.79
306,-0.98
307,-1.26
308,-1.48
309,-1.53
310,-1.48
311,-1.45
312,-1.59
313,-1.84
314,-2.08
315,-2.17
316,-2.14
317,-2.09
318,-2.15
319,-2.32
320,-2.55
321,-2.71
322,-2.79
323,-2.85
324,-3.00
325,-3.20
326,-3.36
327,-3.36
328,-3.16
329,-2.86
330,-2.62
331,-2.52
332,-2.56
333,-2.66
334,-2.75
335,-2.83
336,-2.93
337,-3.04
338,-3.12
339,-3.08
340,-2.94
341,-2.75
342,-2.66
343,-2.77
344,-3.08
345,-3.47
346,-3.81
347,-3.98
348,-4.02
349,-4.01
350,-4.09
351,-4.29
352,-4.56
353,-4.76
354,-4.81
355,-4.73
356,-4.65
357,-4.70
358,-4.93
359,-5.25
360,-5.49
361,-5.55
362,-5.40
363,-5.17
364,-4.99
365,-4.95
366,-5.06
367,-5.24
368,-5.41
369,-5.51
370,-5.52
371,-5.48
372,-5.43
373,-5.42
374,-5.47
375,-5.56
376,-5.63
377,-5.63
378,-5.54
379,-5.41
380,-5.35
381,-5.40
382,-5.56
383,-5.72
384,-5.76
385,-5.64
386,-5.40
387,-5.17
388,-5.07
389,-5.11
390,-5.21
391,-5.24
392,-5.14
393,-4.97
394,-4.84
395,-4.85
396,-4.96
397,-5.09
398,-5.13
399,-5.07
400,-5.00
401,-5.02
402,-5.17
403,-5.35
404,-5.48
405,-5.49
406,-5.43
407,-5.37
408,-5.34
409,-5.32
410,-5.27
411,-5.20
412,-5.16
413,-5.21
414,-5.32
415,-5.38
416,-5.32
417,-5.14
418,-4.95
419,-4.84
420,-4.86
421,-4.92
422,-4.95
423,-4.96
424,-5.02
425,-5.19
426,-5.44
427,-5.61
428,-5.57
429,-5.32
430,-5.03
431,-4.88
432,-4.96
433,-5.19
434,-5.38
435,-5.42
436,-5.33
437,-5.24
438,-5.26
439,-5.43
440,-5.68
441,-5.90
442,-6.04
443,-6.08
444,-6.03
445,-5.91
446,-5.72
447,-5.52
448,-5.36
449,-5.28
450,-5.26
451,-5.21
452,-5.09
453,-4.91
454,-4.71
455,-4.59
456,-4.55
457,-4.57
458,-4.59
459,-4.60
460,-4.61
461,-4.67
462,-4.78
463,-4.91
464,-4.96
465,-4.87
466,-4.65
467,-4.38
468,-4.17
469,-4.09
470,-4.12
471,-4.18
472,-4.18
473,-4.08
474,-3.96
475,-3.90
476,-3.96
477,-4.09
478,-4.16
479,-4.09
480,-3.88
481,-3.67
482,-3.58
483,-3.70
484,-3.95
485,-4.21
486,-4.33
487,-4.30
488,-4.15
489,-3.99
490,-3.88
491,-3.85
492,-3.83
493,-3.77
494,-3.63
495,-3.41
496,-3.18
497,-3.00
498,-2.88
499,-2.78
500,-2.67
501,-2.52
502,-2.38
503,-2.32
504,-2.34
505,-2.37
506,-2.33
507,-2.18
508,-2.01
509,-1.96
510,-2.10
511,-2.38
512,-2.61
513,-2.62
514,-2.36
515,-1.95
516,-1.60
517,-1.44
518,-1.52
519,-1.73
520,-1.92
521,-1.97
522,-1.88
523,-1.73
524,-1.65
525,-1.75
526,-1.97
527,-2.20
528,-2.30
529,-2.22
530,-2.02
531,-1.84
532,-1.78
533,-1.84
534,-1.91
535,-1.85
536,-1.62
537,-1.32
538,-1.14
539,-1.20
540,-1.48
541,-1.84
542,-2.11
543,-2.19
544,-2.09
545,-1.90
546,-1.66
547,-1.45
548,-1.27
549,-1.17
550,-1.16
551,-1.25
552,-1.39
553,-1.51
554,-1.53
555,-1.42
556,-1.21
557,-0.97
558,-0.75
559,-0.61
560,-0.51
561,-0.45
562,-0.44
563,-0.51
564,-0.65
565,-0.79
566,-0.83
567,-0.71
568,-0.42
569,-0.07
570,0.18
571,0.23
572,0.12
573,-0.07
574,-0.21
575,-0.23
576,-0.16
577,-0.05
578,0.04
579,0.07
580,0.07
581,0.05
582,0.04
583,0.03
584,0.08
585,0.21
586,0.42
587,0.64
588,0.77
589,0.73
590,0.54
591,0.30
592,0.17
593,0.22
594,0.41
595,0.60
596,0.65
597,0.56
598,0.41
599,0.35
600,0.44
601,0.61
602,0.77
603,0.83
604,0.80
605,0.77
606,0.81
607,0.92
608,1.03
609,1.07
610,1.03
611,0.95
612,0.89
613,0.88
614,0.88
615,0.84
616,0.76
617,0.70
618,0.74
619,0.89
620,1.12
621,1.31
622,1.38
623,1.31
624,1.14
625,0.98
626,0.91
627,0.98
628,1.16
629,1.35
630,1.50
631,1.57
632,1.61
633,1.66
634,1.73
635,1.82
636,1.90
637,1.95
638,1.97
639,1.98
640,1.99
641,1.97
642,1.93
643,1.88
644,1.88
645,1.94
646,2.05
647,2.11
648,2.05
649,1.88
650,1.68
651,1.57
652,1.58
653,1.68
654,1.76
655,1.77
656,1.69
657,1.62
658,1.62
659,1.73
660,1.91
661,2.09
662,2.20
663,2.22
664,2.16
665,2.10
666,2.06
667,2.05
668,2.03
669,1.95
670,1.81
671,1.67
672,1.61
673,1.66
674,1.79
675,1.88
676,1.85
677,1.71
678,1.56
679,1.55
680,1.72
681,1.98
682,2.17
683,2.17
684,1.96
685,1.67
686,1.45
687,1.39
688,1.47
689,1.63
690,1.77
691,1.83
692,1.79
693,1.70
694,1.57
695,1.47
696,1.38
697,1.33
698,1.29
699,1.28
700,1.28
701,1.27
702,1.21
703,1.05
704,0.79
705,0.51
706,0.30
707,0.24
708,0.31
709,0.41
710,0.42
711,0.32
712,0.13
713,-0.04
714,-0.12
715,-0.10
716,0.01
717,0.15
718,0.22
719,0.16
720,-0.05
721,-0.31
722,-0.46
723,-0.35
724,0.01
725,0.45
726,0.70
727,0.61
728,0.20
729,-0.30
730,-0.60
731,-0.57
732,-0.30
733,0.02
734,0.18
735,0.13
736,-0.07
737,-0.27
738,-0.41
739,-0.46
740,-0.47
741,-0.47
742,-0.52
743,-0.61
744,-0.75
745,-0.92
746,-1.10
747,-1.22
748,-1.26
749,-1.23
750,-1.18
751,-1.16
752,-1.21
753,-1.27
754,-1.30
755,-1.27
756,-1.21
757,-1.18
758,-1.22
759,-1.31
760,-1.42
761,-1.49
762,-1.52
763,-1.54
764,-1.61
765,-1.74
766,-1.89
767,-2.01
768,-2.06
769,-2.04
770,-2.00
771,-1.99
772,-2.04
773,-2.12
774,-2.22
775,-2.34
776,-2.50
777,-2.69
778,-2.88
779,-2.98
780,-2.95
781,-2.80
782,-2.64
783,-2.59
784,-2.70
785,-2.91
786,-3.09
787,-3.14
788,-3.09
789,-3.03
790,-3.06
791,-3.20
792,-3.36
793,-3.45
794,-3.46
795,-3.41
796,-3.36
797,-3.33
798,-3.34
799,-3.38
800,-3.50
801,-3.70
802,-3.96
803,-4.21
804,-4.35
805,-4.37
806,-4.32
807,-4.26
808,-4.27
809,-4.32
810,-4.37
811,-4.37
812,-4.37
813,-4.40
814,-4.48
815,-4.56
816,-4.59
817,-4.52
818,-4.41
819,-4.30
820,-4.24
821,-4.19
822,-4.09
823,-3.94
824,-3.82
825,-3.84
826,-4.04
827,-4.33
828,-4.56
829,-4.61
830,-4.51
831,-4.40
832,-4.45
833,-4.70
834,-5.06
835,-5.33
836,-5.44
837,-5.43
838,-5.44
839,-5.56
840,-5.78
841,-5.97
842,-6.05
843,-6.01
844,-5.90
845,-5.80
846,-5.76
847,-5.75
848,-5.79
849,-5.85
850,-5.97
851,-6.10
852,-6.18
853,-6.15
854,-6.02
855,-5.90
856,-5.88
857,-6.00
858,-6.21
859,-6.37
860,-6.39
861,-6.26
862,-6.08
863,-5.94
864,-5.95
865,-6.10
866,-6.33
867,-6.52
868,-6.61
869,-6.56
870,-6.45
871,-6.38
872,-6.40
873,-6.48
874,-6.54
875,-6.50
876,-6.38
877,-6.30
878,-6.37
879,-6.62
880,-6.94
881,-7.13
882,-7.09
883,-6.86
884,-6.62
885,-6.54
886,-6.65
887,-6.82
888,-6.84
889,-6.63
890,-6.29
891,-6.00
892,-5.91
893,-6.03
894,-6.26
895,-6.47
896,-6.59
897,-6.59
898,-6.50
899,-6.31
900,-6.04
901,-5.73
902,-5.49
903,-5.42
904,-5.54
905,-5.77
906,-5.97
907,-6.03
908,-5.95
909,-5.85
910,-5.85
911,-5.98
912,-6.16
913,-6.25
914,-6.20
915,-6.02
916,-5.85
917,-5.81
918,-5.97
919,-6.27
920,-6.57
921,-6.74
922,-6.76
923,-6.71
924,-6.73
925,-6.89
926,-7.15
927,-7.36
928,-7.40
929,-7.23
930,-6.96
931,-6.76
932,-6.74
933,-6.87
934,-7.00
935,-7.00
936,-6.86
937,-6.69
938,-6.58
939,-6.55
940,-6.51
941,-6.35
942,-6.07
943,-5.78
944,-5.63
945,-5.68
946,-5.85
947,-6.00
948,-6.01
949,-5.92
950,-5.83
951,-5.78
952,-5.76
953,-5.68
954,-5.56
955,-5.51
956,-5.64
957,-5.97
958,-6.34
959,-6.54
960,-6.44
961,-6.10
962,-5.75
963,-5.60
964,-5.68
965,-5.86
966,-5.94
967,-5.83
968,-5.58
969,-5.32
970,-5.17
971,-5.16
972,-5.20
973,-5.26
974,-5.32
975,-5.38
976,-5.42
977,-5.40
978,-5.28
979,-5.10
980,-4.95
981,-4.94
982,-5.07
983,-5.25
984,-5.32
985,-5.16
986,-4.79
987,-4.36
988,-4.05
989,-3.99
990,-4.14
991,-4.39
992,-4.58
993,-4.66
994,-4.62
995,-4.53
996,-4.44
997,-4.40
998,-4.38
999,-4.35
1000,-4.24
1001,-4.03
1002,-3.74
1003,-3.48
1004,-3.37
1005,-3.46
1006,-3.67
1007,-3.84
1008,-3.80
1009,-3.55
1010,-3.21
1011,-3.00
1012,-3.00
1013,-3.16
1014,-3.31
1015,-3.34
1016,-3.23
1017,-3.11
1018,-3.05
1019,-3.05
1020,-3.01
1021,-2.82
1022,-2.52
1023,-2.24
1024,-2.12
1025,-2.22
1026,-2.40
1027,-2.48
1028,-2.34
1029,-2.05
1030,-1.77
1031,-1.68
1032,-1.78
1033,-1.95
1034,-1.99
1035,-1.77
1036,-1.32
1037,-0.80
1038,-0.39
1039,-0.17
1040,-0.13
1041,-0.18
1042,-0.24
1043,-0.29
1044,-0.33
1045,-0.36
1046,-0.37
1047,-0.36
1048,-0.37
1049,-0.41
1050,-0.46
1051,-0.48
1052,-0.39
1053,-0.22
1054,-0.02
1055,0.09
1056,0.05
1057,-0.10
1058,-0.23
1059,-0.25
1060,-0.16
1061,-0.06
1062,-0.06
1063,-0.15
1064,-0.23
1065,-0.20
1066,-0.04
1067,0.10
1068,0.08
1069,-0.18
1070,-0.56
1071,-0.83
1072,-0.82
1073,-0.55
1074,-0.19
1075,0.02
1076,0.01
1077,-0.15
1078,-0.24
1079,-0.11
1080,0.25
1081,0.69
1082,1.00
1083,1.10
1084,1.01
1085,0.86
1086,0.75
1087,0.74
1088,0.82
1089,0.91
1090,0.98
1091,1.01
1092,1.01
1093,0.98
1094,0.95
1095,0.90
1096,0.85
1097,0.84
1098,0.89
1099,1.01
1100,1.19
1101,1.39
1102,1.58
1103,1.77
1104,1.96
1105,2.14
1106,2.30
1107,2.40
1108,2.49
1109,2.56
1110,2.65
1111,2.72
1112,2.71
1113,2.59
1114,2.40
1115,2.26
1116,2.29
1117,2.50
1118,2.80
1119,3.01
1120,3.00
1121,2.80
1122,2.53
1123,2.35
1124,2.33
1125,2.43
1126,2.53
1127,2.57
1128,2.58
1129,2.62
1130,2.74
1131,2.88
1132,2.95
1133,2.91
1134,2.78
1135,2.68
1136,2.69
1137,2.82
1138,3.02
1139,3.19
1140,3.29
1141,3.29
1142,3.22
1143,3.12
1144,3.06
1145,3.04
1146,3.08
1147,3.13
1148,3.12
1149,3.00
1150,2.80
1151,2.56
1152,2.37
1153,2.30
1154,2.35
1155,2.51
1156,2.72
1157,2.93
1158,3.05
1159,3.04
1160,2.85
1161,2.55
1162,2.24
1163,2.03
1164,1.97
1165,2.04
1166,2.12
1167,2.16
1168,2.12
1169,2.03
1170,1.94
1171,1.84
1172,1.68
1173,1.50
1174,1.36
1175,1.37
1176,1.55
1177,1.83
1178,2.03
1179,2.05
1180,1.88
1181,1.64
1182,1.47
1183,1.41
1184,1.43
1185,1.44
1186,1.41
1187,1.38
1188,1.42
1189,1.51
1190,1.57
1191,1.54
1192,1.39
1193,1.03
1194,0.94
1195,1.21
1196,1.34
1197,0.40
1198,-0.76
1199,0.29
1200,2.49
