1,36.70
2,50.00
3,50.00
4,41.94
5,14.47
6,-16.27
7,-40.99
8,-50.00
9,-50.00
10,-49.44
11,-48.56
12,-50.00
13,-50.00
14,-50.00
15,-49.74
16,-50.00
17,-50.00
18,-50.00
19,-50.00
20,-50.00
21,-50.00
22,-50.00
23,-50.00
24,-50.00
25,-50.00
26,-50.00
27,-50.00
28,-50.00
29,-50.00
30,-50.00
31,-50.00
32,-50.00
33,-50.00
34,-50.00
35,-50.00
36,-50.00
37,-50.00
38,-50.00
39,-50.00
40,-50.00
41,-50.00
42,-50.00
43,-50.00
44,-50.00
45,-50.00
46,-50.00
47,-50.00
48,-50.00
49,-50.00
50,-50.00
51,-50.00
52,-50.00
53,-50.00
54,-50.00
55,-50.00
56,-50.00
57,-50.00
58,-50.00
59,-50.00
60,-50.00
61,-50.00
62,-50.00
63,-50.00
64,-50.00
65,-50.00
66,-50.00
67,-50.00
68,-50.00
69,-50.00
70,-50.00
71,-50.00
72,-50.00
73,-50.00
74,-50.00
75,-50.00
76,-50.00
77,-50.00
78,-50.00
79,-50.00
80,-50.00
81,-50.00
82,-50.00
83,-50.00
84,-50.00
85,-50.00
86,-50.00
87,-50.00
88,-50.00
89,-50.00
90,-50.00
91,-50.00
92,-50.00
93,-50.00
94,-50.00
95,-50.00
96,-50.00
97,-50.00
98,-49.98
99,-50.00
100,-50.00
101,-50.00
102,-49.86
103,-49.96
104,-50.00
105,-50.00
106,-49.21
107,-47.24
108,-45.34
109,-44.38
110,-44.15
111,-44.03
112,-43.72
113,-43.69
114,-44.18
115,-44.86
116,-44.82
117,-43.73
118,-42.15
119,-41.20
120,-41.23
121,-41.63
122,-41.34
123,-40.18
124,-38.85
125,-38.24
126,-38.33
127,-38.51
128,-38.19
129,-37.60
130,-37.18
131,-37.19
132,-37.33
133,-37.33
134,-37.14
135,-36.93
136,-36.61
137,-35.99
138,-35.03
139,-34.19
140,-33.95
141,-34.34
142,-34.77
143,-34.67
144,-34.03
145,-33.51
146,-33.57
147,-34.04
148,-34.25
149,-33.89
150,-33.26
151,-33.00
152,-33.29
153,-33.79
154,-33.89
155,-33.36
156,-32.26
157,-30.97
158,-29.83
159,-29.19
160,-29.19
161,-29.69
162,-30.18
163,-30.19
164,-29.58
165,-28.73
166,-28.05
167,-27.73
168,-27.59
169,-27.54
170,-27.63
171,-28.00
172,-28.49
173,-28.70
174,-28.41
175,-27.85
176,-27.56
177,-27.88
178,-28.40
179,-28.37
180,-27.46
181,-26.32
182,-25.82
183,-26.21
184,-26.74
185,-26.65
186,-26.00
187,-25.63
188,-25.94
189,-26.47
190,-26.30
191,-25.24
192,-24.07
193,-23.80
194,-24.55
195,-25.59
196,-25.95
197,-25.32
198,-24.12
199,-23.12
200,-22.79
201,-23.08
202,-23.47
203,-23.50
204,-23.11
205,-22.78
206,-22.96
207,-23.55
208,-23.93
209,-23.59
210,-22.58
211,-21.56
212,-21.11
213,-21.34
214,-21.83
215,-22.05
216,-21.72
217,-21.07
218,-20.59
219,-20.70
220,-21.39
221,-22.13
222,-22.38
223,-22.06
224,-21.66
225,-21.71
226,-22.13
227,-22.26
228,-21.77
229,-21.19
230,-21.25
231,-21.90
232,-22.22
233,-21.52
234,-20.19
235,-19.22
236,-19.01
237,-19.00
238,-18.59
239,-17.98
240,-17.86
241,-18.44
242,-18.99
243,-18.81
244,-18.04
245,-17.59
246,-17.95
247,-18.69
248,-19.06
249,-18.88
250,-18.60
251,-18.55
252,-18.55
253,-18.35
254,-18.02
255,-17.86
256,-17.90
257,-17.88
258,-17.68
259,-17.50
260,-17.73
261,-18.39
262,-18.99
263,-18.96
264,-18.20
265,-17.28
266,-17.01
267,-17.78
268,-19.04
269,-19.70
270,-19.12
271,-17.83
272,-17.01
273,-17.23
274,-17.83
275,-17.69
276,-16.58
277,-15.54
278,-15.73
279,-17.12
280,-18.42
281,-18.48
282,-17.41
283,-16.40
284,-16.22
285,-16.49
286,-16.36
287,-15.68
288,-15.23
289,-15.64
290,-16.56
291,-16.98
292,-16.39
293,-15.30
294,-14.60
295,-14.79
296,-15.49
297,-16.06
298,-16.17
299,-16.02
300,-15.95
301,-16.03
302,-16.10
303,-15.99
304,-15.67
305,-15.31
306,-15.01
307,-14.86
308,-14.91
309,-15.17
310,-15.47
311,-15.50
312,-15.16
313,-14.77
314,-14.79
315,-15.27
316,-15.72
317,-15.68
318,-15.14
319,-14.53
320,-14.17
321,-14.06
322,-14.10
323,-14.33
324,-14.79
325,-15.27
326,-15.32
327,-14.79
328,-14.15
329,-14.14
330,-14.85
331,-15.53
332,-15.28
333,-14.13
334,-12.93
335,-12.54
336,-13.05
337,-14.04
338,-14.97
339,-15.49
340,-15.46
341,-14.99
342,-14.37
343,-13.89
344,-13.52
345,-13.15
346,-12.69
347,-12.30
348,-12.18
349,-12.35
350,-12.73
351,-13.23
352,-13.75
353,-14.01
354,-13.57
355,-12.32
356,-10.83
357,-10.06
358,-10.57
359,-11.99
360,-13.33
361,-13.89
362,-13.71
363,-13.29
364,-12.95
365,-12.67
366,-12.39
367,-12.27
368,-12.41
369,-12.63
370,-12.53
371,-11.93
372,-11.18
373,-10.81
374,-11.00
375,-11.46
376,-11.69
377,-11.50
378,-11.20
379,-11.34
380,-12.02
381,-12.65
382,-12.53
383,-11.69
384,-10.90
385,-10.84
386,-11.34
387,-11.71
388,-11.51
389,-11.00
390,-10.72
391,-10.91
392,-11.24
393,-11.29
394,-11.02
395,-10.81
396,-10.79
397,-10.68
398,-10.11
399,-9.19
400,-8.59
401,-8.86
402,-9.79
403,-10.62
404,-10.75
405,-10.23
406,-9.64
407,-9.48
408,-9.71
409,-9.94
410,-9.84
411,-9.44
412,-8.97
413,-8.67
414,-8.78
415,-9.38
416,-10.19
417,-10.56
418,-9.99
419,-8.81
420,-8.01
421,-8.37
422,-9.57
423,-10.51
424,-10.43
425,-9.66
426,-9.06
427,-9.00
428,-9.01
429,-8.52
430,-7.63
431,-7.04
432,-7.07
433,-7.31
434,-7.17
435,-6.69
436,-6.47
437,-6.88
438,-7.34
439,-6.98
440,-5.63
441,-4.19
442,-3.74
443,-4.53
444,-5.78
445,-6.59
446,-6.68
447,-6.51
448,-6.45
449,-6.42
450,-6.14
451,-5.67
452,-5.31
453,-5.23
454,-5.13
455,-4.72
456,-4.20
457,-4.24
458,-5.15
459,-6.36
460,-6.78
461,-5.89
462,-4.38
463,-3.49
464,-3.70
465,-4.36
466,-4.49
467,-3.99
468,-3.57
469,-3.80
470,-4.46
471,-4.90
472,-4.91
473,-4.81
474,-4.86
475,-4.88
476,-4.37
477,-3.20
478,-1.88
479,-1.18
480,-1.44
481,-2.34
482,-3.19
483,-3.58
484,-3.61
485,-3.58
486,-3.67
487,-3.79
488,-3.66
489,-3.13
490,-2.37
491,-1.89
492,-2.13
493,-3.05
494,-4.03
495,-4.40
496,-3.98
497,-3.27
498,-2.93
499,-3.14
500,-3.52
501,-3.60
502,-3.29
503,-2.96
504,-2.96
505,-3.29
506,-3.73
507,-4.14
508,-4.55
509,-4.95
510,-5.15
511,-4.99
512,-4.61
513,-4.33
514,-4.29
515,-4.24
516,-3.86
517,-3.17
518,-2.62
519,-2.52
520,-2.75
521,-2.92
522,-2.87
523,-2.90
524,-3.30
525,-3.94
526,-4.35
527,-4.25
528,-3.78
529,-3.29
530,-3.02
531,-3.14
532,-3.71
533,-4.53
534,-5.14
535,-5.09
536,-4.41
537,-3.64
538,-3.38
539,-3.73
540,-4.31
541,-4.73
542,-4.96
543,-5.17
544,-5.37
545,-5.30
546,-4.71
547,-3.83
548,-3.17
549,-3.13
550,-3.60
551,-4.15
552,-4.40
553,-4.35
554,-4.23
555,-4.20
556,-4.14
557,-3.83
558,-3.33
559,-3.03
560,-3.14
561,-3.40
562,-3.30
563,-2.78
564,-2.29
565,-2.26
566,-2.61
567,-3.05
568,-3.39
569,-3.65
570,-3.69
571,-3.28
572,-2.49
573,-1.99
574,-2.33
575,-3.35
576,-4.11
577,-3.94
578,-3.09
579,-2.43
580,-2.30
581,-2.23
582,-1.65
583,-0.76
584,-0.35
585,-0.88
586,-1.85
587,-2.40
588,-2.19
589,-1.66
590,-1.43
591,-1.62
592,-1.82
593,-1.68
594,-1.24
595,-0.85
596,-0.71
597,-0.76
598,-0.87
599,-1.03
600,-1.30
601,-1.60
602,-1.68
603,-1.40
604,-0.93
605,-0.65
606,-0.83
607,-1.36
608,-1.83
609,-1.87
610,-1.38
611,-0.70
612,-0.31
613,-0.55
614,-1.34
615,-2.22
616,-2.63
617,-2.34
618,-1.64
619,-1.04
620,-0.79
621,-0.71
622,-0.50
623,-0.21
624,-0.05
625,-0.09
626,-0.20
627,-0.40
628,-0.88
629,-1.53
630,-1.76
631,-1.09
632,0.18
633,1.00
634,0.78
635,0.01
636,-0.36
637,-0.09
638,0.14
639,-0.19
640,-0.69
641,-0.59
642,0.22
643,0.97
644,1.13
645,0.96
646,1.12
647,1.74
648,2.32
649,2.44
650,2.33
651,2.36
652,2.54
653,2.56
654,2.28
655,1.87
656,1.52
657,1.17
658,0.80
659,0.63
660,1.05
661,2.02
662,2.95
663,3.14
664,2.51
665,1.61
666,1.03
667,0.83
668,0.84
669,1.02
670,1.50
671,2.22
672,2.76
673,2.74
674,2.22
675,1.57
676,1.17
677,1.18
678,1.64
679,2.45
680,3.37
681,4.02
682,4.11
683,3.58
684,2.88
685,2.64
686,3.11
687,3.84
688,4.04
689,3.38
690,2.29
691,1.57
692,1.80
693,2.88
694,4.10
695,4.63
696,4.13
697,3.09
698,2.28
699,1.96
700,1.85
701,1.72
702,1.79
703,2.36
704,3.20
705,3.60
706,3.16
707,2.29
708,1.74
709,1.87
710,2.31
711,2.61
712,2.76
713,3.03
714,3.47
715,3.71
716,3.56
717,3.34
718,3.47
719,3.85
720,3.90
721,3.34
722,2.61
723,2.43
724,3.02
725,3.94
726,4.56
727,4.67
728,4.43
729,4.13
730,3.95
731,4.01
732,4.26
733,4.40
734,4.05
735,3.28
736,2.73
737,3.06
738,4.16
739,5.09
740,4.97
741,3.96
742,3.08
743,3.10
744,3.74
745,4.07
746,3.56
747,2.58
748,1.95
749,2.06
750,2.51
751,2.66
752,2.38
753,2.23
754,2.69
755,3.56
756,4.15
757,4.17
758,4.04
759,4.32
760,4.94
761,5.30
762,5.07
763,4.54
764,4.33
765,4.62
766,5.00
767,4.96
768,4.49
769,3.97
770,3.81
771,4.13
772,4.76
773,5.43
774,5.86
775,5.85
776,5.37
777,4.64
778,4.12
779,4.22
780,4.91
781,5.73
782,6.03
783,5.62
784,4.91
785,4.48
786,4.50
787,4.57
788,4.24
789,3.55
790,3.08
791,3.33
792,4.21
793,5.04
794,5.31
795,5.07
796,4.76
797,4.70
798,4.82
799,5.00
800,5.20
801,5.40
802,5.31
803,4.64
804,3.64
805,3.11
806,3.71
807,5.11
808,6.19
809,6.11
810,5.17
811,4.46
812,4.76
813,5.73
814,6.39
815,6.09
816,5.11
817,4.37
818,4.43
819,5.04
820,5.57
821,5.67
822,5.58
823,5.66
824,5.97
825,6.25
826,6.32
827,6.29
828,6.27
829,6.14
830,5.62
831,4.75
832,4.10
833,4.25
834,5.12
835,5.87
836,5.82
837,5.12
838,4.62
839,4.77
840,5.21
841,5.30
842,4.94
843,4.56
844,4.58
845,4.94
846,5.35
847,5.61
848,5.79
849,5.92
850,6.00
851,6.10
852,6.36
853,6.76
854,6.92
855,6.42
856,5.44
857,4.70
858,4.77
859,5.35
860,5.67
861,5.37
862,4.93
863,4.96
864,5.36
865,5.46
866,4.83
867,3.92
868,3.50
869,3.85
870,4.36
871,4.26
872,3.50
873,2.85
874,2.92
875,3.52
876,3.90
877,3.70
878,3.37
879,3.58
880,4.37
881,5.10
882,5.16
883,4.59
884,4.00
885,3.86
886,4.12
887,4.37
888,4.40
889,4.39
890,4.63
891,5.13
892,5.59
893,5.67
894,5.42
895,5.19
896,5.16
897,5.06
898,4.48
899,3.47
900,2.71
901,2.84
902,3.74
903,4.62
904,4.85
905,4.54
906,4.27
907,4.35
908,4.52
909,4.43
910,4.14
911,3.97
912,4.02
913,3.98
914,3.58
915,3.00
916,2.74
917,3.00
918,3.48
919,3.69
920,3.50
921,3.18
922,3.05
923,3.06
924,2.81
925,2.08
926,1.22
927,1.03
928,1.90
929,3.27
930,3.97
931,3.41
932,2.29
933,1.97
934,2.94
935,4.20
936,4.44
937,3.66
938,3.11
939,3.73
940,4.92
941,5.27
942,4.41
943,3.53
944,3.90
945,5.24
946,6.00
947,5.11
948,3.18
949,1.65
950,1.34
951,1.94
952,2.75
953,3.38
954,3.72
955,3.68
956,3.29
957,3.00
958,3.47
959,4.79
960,6.21
961,6.76
962,6.25
963,5.37
964,4.92
965,4.98
966,5.14
967,5.14
968,5.18
969,5.39
970,5.43
971,4.82
972,3.66
973,2.64
974,2.38
975,2.81
976,3.37
977,3.70
978,3.97
979,4.43
980,5.02
981,5.39
982,5.34
983,4.98
984,4.58
985,4.35
986,4.30
987,4.40
988,4.61
989,4.94
990,5.23
991,5.26
992,4.90
993,4.31
994,3.81
995,3.56
996,3.45
997,3.36
998,3.32
999,3.53
1000,4.08
1001,4.74
1002,5.22
1003,5.42
1004,5.40
1005,5.16
1006,4.65
1007,4.06
1008,3.83
1009,4.22
1010,4.92
1011,5.24
1012,4.85
1013,4.09
1014,3.56
1015,3.41
1016,3.29
1017,2.94
1018,2.63
1019,2.92
1020,3.92
1021,5.04
1022,5.55
1023,5.28
1024,4.60
1025,4.01
1026,3.67
1027,3.55
1028,3.65
1029,4.01
1030,4.49
1031,4.74
1032,4.61
1033,4.34
1034,4.34
1035,4.70
1036,4.99
1037,4.78
1038,4.07
1039,3.36
1040,3.12
1041,3.40
1042,3.88
1043,4.18
1044,4.27
1045,4.29
1046,4.27
1047,4.03
1048,3.60
1049,3.40
1050,3.74
1051,4.39
1052,4.72
1053,4.52
1054,4.25
1055,4.36
1056,4.72
1057,4.76
1058,4.22
1059,3.50
1060,3.23
1061,3.59
1062,4.25
1063,4.84
1064,5.29
1065,5.74
1066,6.07
1067,6.00
1068,5.45
1069,4.84
1070,4.73
1071,5.18
1072,5.64
1073,5.49
1074,4.64
1075,3.61
1076,3.04
1077,3.16
1078,3.78
1079,4.47
1080,4.91
1081,5.04
1082,4.91
1083,4.59
1084,4.18
1085,3.92
1086,4.01
1087,4.49
1088,5.14
1089,5.66
1090,5.94
1091,6.01
1092,5.92
1093,5.66
1094,5.17
1095,4.58
1096,4.19
1097,4.30
1098,4.92
1099,5.68
1100,6.05
1101,5.76
1102,4.97
1103,4.17
1104,3.85
1105,4.19
1106,4.97
1107,5.66
1108,5.77
1109,5.29
1110,4.74
1111,4.74
1112,5.43
1113,6.29
1114,6.63
1115,6.30
1116,5.81
1117,5.80
1118,6.41
1119,7.16
1120,7.51
1121,7.31
1122,6.71
1123,5.84
1124,4.82
1125,3.99
1126,3.82
1127,4.43
1128,5.24
1129,5.48
1130,4.95
1131,4.31
1132,4.33
1133,5.12
1134,5.97
1135,6.14
1136,5.64
1137,5.07
1138,4.87
1139,4.85
1140,4.57
1141,4.04
1142,3.73
1143,4.00
1144,4.66
1145,5.16
1146,5.27
1147,5.17
1148,5.15
1149,5.27
1150,5.35
1151,5.30
1152,5.24
1153,5.31
1154,5.57
1155,5.88
1156,6.13
1157,6.25
1158,6.29
1159,6.34
1160,6.47
1161,6.68
1162,6.82
1163,6.74
1164,6.45
1165,6.18
1166,6.14
1167,6.26
1168,6.23
1169,5.85
1170,5.22
1171,4.64
1172,4.37
1173,4.50
1174,4.98
1175,5.63
1176,6.15
1177,6.24
1178,5.87
1179,5.44
1180,5.33
1181,5.51
1182,5.65
1183,5.65
1184,5.78
1185,6.14
1186,6.51
1187,6.56
1188,6.34
1189,6.18
1190,6.26
1191,6.53
1192,6.87
1193,7.14
1194,7.62
1195,8.05
1196,8.05
1197,7.31
1198,6.74
1199,7.56
1200,7.56
