1,-116.77
2,-193.07
3,-233.04
4,-243.16
5,-245.92
6,-250.00
7,-248.62
8,-233.52
9,-202.08
10,-157.78
11,-105.26
12,-54.13
13,-11.80
14,14.43
15,21.03
16,7.27
17,-24.96
18,-68.53
19,-116.87
20,-160.51
21,-195.11
22,-215.33
23,-221.86
24,-214.00
25,-194.92
26,-165.86
27,-129.61
28,-88.01
29,-43.92
30,-0.23
31,39.19
32,71.53
33,93.56
34,105.35
35,106.66
36,101.38
37,91.61
38,82.17
39,74.20
40,70.00
41,68.18
42,68.44
43,68.70
44,68.26
45,66.44
46,63.40
47,59.91
48,56.42
49,53.81
50,51.90
51,50.87
52,50.08
53,49.41
54,48.43
55,47.21
56,45.65
57,44.07
58,42.46
59,41.12
60,39.95
61,39.12
62,38.51
63,38.19
64,37.98
65,37.86
66,37.65
67,37.35
68,36.85
69,36.29
70,35.70
71,35.16
72,34.69
73,34.34
74,34.12
75,34.07
76,34.12
77,34.26
78,34.42
79,34.59
80,34.75
81,34.85
82,34.84
83,34.61
84,34.23
85,33.72
86,33.28
87,32.98
88,32.97
89,33.29
90,34.03
91,35.12
92,36.52
93,37.99
94,39.41
95,40.63
96,41.66
97,42.44
98,43.09
99,43.66
100,44.36
101,45.14
102,46.04
103,46.97
104,47.93
105,48.78
106,49.48
107,49.93
108,50.15
109,50.17
110,50.04
111,49.80
112,49.46
113,49.06
114,48.55
115,47.97
116,47.24
117,46.44
118,45.55
119,44.69
120,43.86
121,43.13
122,42.45
123,41.87
124,41.33
125,40.86
126,40.41
127,40.03
128,39.71
129,39.51
130,39.39
131,39.44
132,39.61
133,39.89
134,40.16
135,40.37
136,40.41
137,40.27
138,39.87
139,39.28
140,38.55
141,37.83
142,37.16
143,36.61
144,36.13
145,35.76
146,35.42
147,35.10
148,34.74
149,34.36
150,33.92
151,33.48
152,33.04
153,32.68
154,32.42
155,32.28
156,32.20
157,32.18
158,32.19
159,32.24
160,32.37
161,32.55
162,32.75
163,32.89
164,33.00
165,33.01
166,33.00
167,32.98
168,33.08
169,33.36
170,33.94
171,34.79
172,35.93
173,37.18
174,38.48
175,39.60
176,40.53
177,41.12
178,41.50
179,41.63
180,41.81
181,42.05
182,42.59
183,43.37
184,44.55
185,45.97
186,47.71
187,49.55
188,51.52
189,53.41
190,55.21
191,56.71
192,57.98
193,58.88
194,59.48
195,59.68
196,59.68
197,59.50
198,59.32
199,59.11
200,58.97
201,58.84
202,58.78
203,58.71
204,58.60
205,58.43
206,58.24
207,58.11
208,58.05
209,58.15
210,58.46
211,59.01
212,59.68
213,60.34
214,60.78
215,60.94
216,60.65
217,59.91
218,58.67
219,57.15
220,55.50
221,53.94
222,52.48
223,51.28
224,50.20
225,49.29
226,48.24
227,47.09
228,45.73
229,44.36
230,42.96
231,41.73
232,40.65
233,39.88
234,39.28
235,38.91
236,38.55
237,38.23
238,37.79
239,37.30
240,36.68
241,36.07
242,35.46
243,34.98
244,34.52
245,34.14
246,33.68
247,33.20
248,32.59
249,31.96
250,31.21
251,30.47
252,29.62
253,28.75
254,27.75
255,26.73
256,25.63
257,24.54
258,23.38
259,22.26
260,21.19
261,20.31
262,19.55
263,18.97
264,18.50
265,18.16
266,17.88
267,17.68
268,17.53
269,17.47
270,17.50
271,17.65
272,17.94
273,18.33
274,18.78
275,19.22
276,19.66
277,20.08
278,20.60
279,21.17
280,21.89
281,22.71
282,23.74
283,24.85
284,26.07
285,27.22
286,28.32
287,29.19
288,29.89
289,30.36
290,30.80
291,31.21
292,31.78
293,32.43
294,33.28
295,34.23
296,35.30
297,36.31
298,37.19
299,37.81
300,38.20
301,38.33
302,38.25
303,38.00
304,37.72
305,37.49
306,37.40
307,37.44
308,37.57
309,37.76
310,37.93
311,38.03
312,38.00
313,37.86
314,37.57
315,37.19
316,36.71
317,36.18
318,35.58
319,34.97
320,34.28
321,33.55
322,32.73
323,31.95
324,31.15
325,30.43
326,29.66
327,28.92
328,28.10
329,27.33
330,26.44
331,25.49
332,24.33
333,23.12
334,21.73
335,20.33
336,18.78
337,17.27
338,15.72
339,14.38
340,13.11
341,12.05
342,11.04
343,10.16
344,9.18
345,8.09
346,6.68
347,5.08
348,3.30
349,1.57
350,-0.02
351,-1.27
352,-2.13
353,-2.46
354,-2.37
355,-1.92
356,-1.36
357,-0.80
358,-0.34
359,0.01
360,0.27
361,0.46
362,0.72
363,1.11
364,1.78
365,2.66
366,3.78
367,5.02
368,6.41
369,7.77
370,9.07
371,10.12
372,11.00
373,11.63
374,12.14
375,12.44
376,12.66
377,12.80
378,13.05
379,13.41
380,14.00
381,14.67
382,15.46
383,16.20
384,16.97
385,17.64
386,18.26
387,18.75
388,19.18
389,19.55
390,19.96
391,20.33
392,20.70
393,21.02
394,21.36
395,21.64
396,21.86
397,21.93
398,21.97
399,21.97
400,22.04
401,22.16
402,22.37
403,22.69
404,23.13
405,23.67
406,24.28
407,24.88
408,25.41
409,25.79
410,26.07
411,26.24
412,26.33
413,26.39
414,26.47
415,26.55
416,26.63
417,26.67
418,26.64
419,26.51
420,26.29
421,26.02
422,25.76
423,25.57
424,25.48
425,25.52
426,25.67
427,25.86
428,25.99
429,26.00
430,25.87
431,25.59
432,25.17
433,24.69
434,24.24
435,23.88
436,23.57
437,23.35
438,23.21
439,23.15
440,23.11
441,23.09
442,23.10
443,23.19
444,23.30
445,23.38
446,23.36
447,23.24
448,22.99
449,22.64
450,22.19
451,21.73
452,21.32
453,21.01
454,20.89
455,20.91
456,21.07
457,21.34
458,21.75
459,22.30
460,23.03
461,23.86
462,24.81
463,25.76
464,26.67
465,27.42
466,27.98
467,28.30
468,28.43
469,28.38
470,28.25
471,28.08
472,27.99
473,28.05
474,28.27
475,28.56
476,28.88
477,29.11
478,29.29
479,29.36
480,29.39
481,29.40
482,29.53
483,29.81
484,30.31
485,30.97
486,31.77
487,32.59
488,33.42
489,34.13
490,34.74
491,35.16
492,35.45
493,35.58
494,35.72
495,35.89
496,36.25
497,36.77
498,37.54
499,38.51
500,39.72
501,41.02
502,42.42
503,43.76
504,45.01
505,46.01
506,46.77
507,47.25
508,47.48
509,47.43
510,47.15
511,46.67
512,46.08
513,45.48
514,44.89
515,44.34
516,43.77
517,43.23
518,42.58
519,41.86
520,40.94
521,39.92
522,38.73
523,37.51
524,36.15
525,34.84
526,33.52
527,32.39
528,31.29
529,30.36
530,29.38
531,28.40
532,27.21
533,25.91
534,24.39
535,22.85
536,21.25
537,19.81
538,18.55
539,17.61
540,16.91
541,16.53
542,16.34
543,16.34
544,16.33
545,16.29
546,16.16
547,16.04
548,15.95
549,15.95
550,16.06
551,16.24
552,16.46
553,16.66
554,16.86
555,17.01
556,17.11
557,17.15
558,17.23
559,17.40
560,17.70
561,18.05
562,18.46
563,18.78
564,19.13
565,19.42
566,19.81
567,20.23
568,20.81
569,21.51
570,22.56
571,23.84
572,25.42
573,27.10
574,28.95
575,30.73
576,32.51
577,34.03
578,35.41
579,36.53
580,37.61
581,38.57
582,39.65
583,40.72
584,41.91
585,43.05
586,44.18
587,45.12
588,45.89
589,46.35
590,46.56
591,46.53
592,46.43
593,46.33
594,46.33
595,46.37
596,46.46
597,46.52
598,46.56
599,46.52
600,46.37
601,46.07
602,45.68
603,45.25
604,44.85
605,44.55
606,44.40
607,44.47
608,44.72
609,45.12
610,45.57
611,46.02
612,46.29
613,46.28
614,45.87
615,45.12
616,44.11
617,43.03
618,41.97
619,41.08
620,40.37
621,39.89
622,39.52
623,39.28
624,39.03
625,38.75
626,38.31
627,37.80
628,37.17
629,36.55
630,35.90
631,35.32
632,34.79
633,34.39
634,34.04
635,33.80
636,33.56
637,33.36
638,33.13
639,32.92
640,32.65
641,32.36
642,32.01
643,31.65
644,31.30
645,30.98
646,30.65
647,30.33
648,29.99
649,29.63
650,29.24
651,28.82
652,28.42
653,28.08
654,27.87
655,27.81
656,27.89
657,28.07
658,28.33
659,28.62
660,28.97
661,29.35
662,29.79
663,30.31
664,31.01
665,31.87
666,32.89
667,33.97
668,35.03
669,35.93
670,36.61
671,36.96
672,37.02
673,36.78
674,36.38
675,35.87
676,35.43
677,35.09
678,34.93
679,34.95
680,35.18
681,35.56
682,36.07
683,36.59
684,37.05
685,37.37
686,37.57
687,37.65
688,37.66
689,37.65
690,37.70
691,37.85
692,38.12
693,38.49
694,38.88
695,39.22
696,39.40
697,39.34
698,39.02
699,38.51
700,37.91
701,37.35
702,36.91
703,36.62
704,36.47
705,36.35
706,36.18
707,35.84
708,35.42
709,34.93
710,34.53
711,34.33
712,34.53
713,35.13
714,36.19
715,37.49
716,39.03
717,40.63
718,42.30
719,43.89
720,45.48
721,47.01
722,48.57
723,50.08
724,51.57
725,52.85
726,53.87
727,54.43
728,54.51
729,54.12
730,53.46
731,52.62
732,51.79
733,51.03
734,50.45
735,50.03
736,49.74
737,49.51
738,49.27
739,48.95
740,48.48
741,47.94
742,47.40
743,46.95
744,46.59
745,46.33
746,46.17
747,46.11
748,46.10
749,46.11
750,46.11
751,46.10
752,46.10
753,46.10
754,46.13
755,46.18
756,46.30
757,46.47
758,46.71
759,47.01
760,47.36
761,47.71
762,48.10
763,48.48
764,48.87
765,49.20
766,49.45
767,49.55
768,49.57
769,49.46
770,49.31
771,49.12
772,48.96
773,48.85
774,48.89
775,49.10
776,49.51
777,50.12
778,50.83
779,51.57
780,52.20
781,52.67
782,52.86
783,52.75
784,52.29
785,51.57
786,50.67
787,49.67
788,48.63
789,47.65
790,46.77
791,46.04
792,45.37
793,44.79
794,44.25
795,43.81
796,43.41
797,43.11
798,42.81
799,42.59
800,42.37
801,42.19
802,41.95
803,41.67
804,41.26
805,40.78
806,40.13
807,39.44
808,38.64
809,37.89
810,37.11
811,36.42
812,35.71
813,35.03
814,34.20
815,33.24
816,32.03
817,30.72
818,29.25
819,27.80
820,26.34
821,25.14
822,24.22
823,23.67
824,23.31
825,23.06
826,22.72
827,22.26
828,21.53
829,20.59
830,19.47
831,18.39
832,17.45
833,16.85
834,16.65
835,16.92
836,17.49
837,18.24
838,18.95
839,19.54
840,19.89
841,19.98
842,19.81
843,19.40
844,18.88
845,18.39
846,18.06
847,17.94
848,18.03
849,18.24
850,18.52
851,18.79
852,19.01
853,19.16
854,19.25
855,19.32
856,19.48
857,19.79
858,20.36
859,21.13
860,22.06
861,23.03
862,23.95
863,24.66
864,25.14
865,25.35
866,25.45
867,25.51
868,25.69
869,25.97
870,26.41
871,26.91
872,27.48
873,28.01
874,28.48
875,28.84
876,29.11
877,29.26
878,29.37
879,29.49
880,29.69
881,29.95
882,30.24
883,30.48
884,30.69
885,30.85
886,31.01
887,31.15
888,31.36
889,31.65
890,32.03
891,32.46
892,32.88
893,33.26
894,33.49
895,33.56
896,33.40
897,33.07
898,32.51
899,31.80
900,30.89
901,29.90
902,28.79
903,27.63
904,26.35
905,25.03
906,23.64
907,22.34
908,21.09
909,20.00
910,19.04
911,18.28
912,17.63
913,17.16
914,16.75
915,16.47
916,16.20
917,15.99
918,15.76
919,15.56
920,15.34
921,15.17
922,15.05
923,15.02
924,15.08
925,15.20
926,15.36
927,15.54
928,15.72
929,15.84
930,15.90
931,15.91
932,15.96
933,16.07
934,16.27
935,16.53
936,16.88
937,17.25
938,17.72
939,18.20
940,18.78
941,19.45
942,20.33
943,21.39
944,22.64
945,23.90
946,25.09
947,26.08
948,26.82
949,27.20
950,27.24
951,27.01
952,26.70
953,26.44
954,26.31
955,26.28
956,26.34
957,26.41
958,26.39
959,26.21
960,25.88
961,25.41
962,24.89
963,24.44
964,24.13
965,24.04
966,24.17
967,24.47
968,24.91
969,25.41
970,25.96
971,26.49
972,27.04
973,27.56
974,28.11
975,28.70
976,29.38
977,30.06
978,30.72
979,31.31
980,31.91
981,32.49
982,33.05
983,33.53
984,33.98
985,34.39
986,34.73
987,34.92
988,34.93
989,34.74
990,34.36
991,33.82
992,33.20
993,32.57
994,31.92
995,31.34
996,30.82
997,30.43
998,30.02
999,29.60
1000,29.04
1001,28.38
1002,27.51
1003,26.52
1004,25.34
1005,24.12
1006,22.88
1007,21.77
1008,20.73
1009,19.82
1010,18.96
1011,18.23
1012,17.57
1013,17.00
1014,16.37
1015,15.73
1016,15.07
1017,14.54
1018,14.12
1019,13.86
1020,13.73
1021,13.73
1022,13.86
1023,14.05
1024,14.21
1025,14.31
1026,14.33
1027,14.31
1028,14.33
1029,14.40
1030,14.63
1031,15.01
1032,15.57
1033,16.24
1034,17.07
1035,17.94
1036,18.91
1037,19.84
1038,20.82
1039,21.72
1040,22.63
1041,23.44
1042,24.27
1043,25.00
1044,25.79
1045,26.49
1046,27.28
1047,28.05
1048,28.95
1049,29.90
1050,31.05
1051,32.30
1052,33.78
1053,35.28
1054,36.83
1055,38.25
1056,39.55
1057,40.55
1058,41.28
1059,41.70
1060,41.96
1061,42.12
1062,42.30
1063,42.51
1064,42.74
1065,42.92
1066,42.98
1067,42.85
1068,42.45
1069,41.80
1070,40.90
1071,39.89
1072,38.80
1073,37.82
1074,36.87
1075,36.01
1076,35.02
1077,33.97
1078,32.66
1079,31.20
1080,29.40
1081,27.50
1082,25.46
1083,23.52
1084,21.57
1085,19.79
1086,18.09
1087,16.67
1088,15.35
1089,14.30
1090,13.34
1091,12.63
1092,11.99
1093,11.47
1094,10.86
1095,10.25
1096,9.44
1097,8.55
1098,7.48
1099,6.39
1100,5.26
1101,4.31
1102,3.46
1103,2.81
1104,2.19
1105,1.66
1106,1.07
1107,0.47
1108,-0.31
1109,-1.20
1110,-2.30
1111,-3.42
1112,-4.56
1113,-5.55
1114,-6.45
1115,-7.11
1116,-7.64
1117,-7.97
1118,-8.25
1119,-8.49
1120,-8.85
1121,-9.30
1122,-9.91
1123,-10.60
1124,-11.36
1125,-12.04
1126,-12.57
1127,-12.85
1128,-12.86
1129,-12.62
1130,-12.14
1131,-11.50
1132,-10.83
1133,-10.25
1134,-9.82
1135,-9.54
1136,-9.32
1137,-9.16
1138,-8.97
1139,-8.77
1140,-8.37
1141,-7.84
1142,-7.06
1143,-6.20
1144,-5.13
1145,-4.01
1146,-2.67
1147,-1.24
1148,0.41
1149,2.11
1150,3.95
1151,5.71
1152,7.46
1153,8.98
1154,10.38
1155,11.46
1156,12.43
1157,13.21
1158,14.08
1159,14.95
1160,16.01
1161,17.09
1162,18.27
1163,19.34
1164,20.36
1165,21.13
1166,21.80
1167,22.25
1168,22.70
1169,23.11
1170,23.70
1171,24.45
1172,25.45
1173,26.61
1174,27.95
1175,29.27
1176,30.41
1177,31.15
1178,31.49
1179,31.40
1180,31.04
1181,30.50
1182,29.97
1183,29.57
1184,29.43
1185,29.52
1186,29.76
1187,30.02
1188,30.17
1189,30.11
1190,29.80
1191,29.25
1192,28.56
1193,27.89
1194,27.37
1195,27.05
1196,26.86
1197,26.73
1198,26.58
1199,26.44
1200,26.25
1201,26.05
1202,25.83
1203,25.67
1204,25.63
1205,25.76
1206,26.02
1207,26.31
1208,26.49
1209,26.50
1210,26.30
1211,25.94
1212,25.43
1213,24.80
1214,24.06
1215,23.32
1216,22.64
1217,22.04
1218,21.51
1219,21.07
1220,20.73
1221,20.52
1222,20.40
1223,20.35
1224,20.34
1225,20.36
1226,20.42
1227,20.54
1228,20.76
1229,21.11
1230,21.61
1231,22.20
1232,22.89
1233,23.57
1234,24.25
1235,24.83
1236,25.37
1237,25.84
1238,26.41
1239,27.03
1240,27.85
1241,28.78
1242,29.96
1243,31.23
1244,32.65
1245,34.01
1246,35.37
1247,36.57
1248,37.67
1249,38.57
1250,39.40
1251,40.11
1252,40.86
1253,41.62
1254,42.47
1255,43.30
1256,44.09
1257,44.72
1258,45.16
1259,45.33
1260,45.22
1261,44.83
1262,44.19
1263,43.39
1264,42.44
1265,41.47
1266,40.46
1267,39.53
1268,38.56
1269,37.58
1270,36.43
1271,35.24
1272,33.93
1273,32.67
1274,31.34
1275,30.11
1276,28.83
1277,27.70
1278,26.58
1279,25.61
1280,24.64
1281,23.81
1282,22.96
1283,22.20
1284,21.36
1285,20.57
1286,19.63
1287,18.66
1288,17.48
1289,16.23
1290,14.82
1291,13.47
1292,12.13
1293,10.95
1294,9.75
1295,8.66
1296,7.52
1297,6.42
1298,5.17
1299,3.90
1300,2.53
1301,1.29
1302,0.11
1303,-0.83
1304,-1.63
1305,-2.24
1306,-2.82
1307,-3.36
1308,-3.94
1309,-4.50
1310,-5.09
1311,-5.62
1312,-6.05
1313,-6.24
1314,-6.14
1315,-5.78
1316,-5.18
1317,-4.47
1318,-3.67
1319,-2.85
1320,-1.92
1321,-0.93
1322,0.20
1323,1.39
1324,2.66
1325,3.86
1326,5.01
1327,5.99
1328,6.84
1329,7.42
1330,7.87
1331,8.17
1332,8.54
1333,8.94
1334,9.49
1335,10.07
1336,10.78
1337,11.47
1338,12.17
1339,12.72
1340,13.21
1341,13.57
1342,13.89
1343,14.17
1344,14.51
1345,14.91
1346,15.43
1347,16.01
1348,16.72
1349,17.48
1350,18.31
1351,19.07
1352,19.81
1353,20.41
1354,20.95
1355,21.34
1356,21.70
1357,22.02
1358,22.51
1359,23.17
1360,24.12
1361,25.19
1362,26.46
1363,27.75
1364,29.14
1365,30.43
1366,31.64
1367,32.59
1368,33.42
1369,34.10
1370,34.83
1371,35.52
1372,36.25
1373,36.96
1374,37.73
1375,38.51
1376,39.19
1377,39.66
1378,39.83
1379,39.70
1380,39.30
1381,38.65
1382,37.73
1383,36.67
1384,35.48
1385,34.27
1386,32.97
1387,31.69
1388,30.30
1389,28.93
1390,27.46
1391,26.03
1392,24.54
1393,23.19
1394,21.80
1395,20.59
1396,19.40
1397,18.38
1398,17.31
1399,16.32
1400,15.20
1401,14.09
1402,12.89
1403,11.79
1404,10.70
1405,9.74
1406,8.80
1407,7.96
1408,7.14
1409,6.47
1410,5.90
1411,5.49
1412,5.21
1413,5.10
1414,5.12
1415,5.25
1416,5.42
1417,5.54
1418,5.60
1419,5.58
1420,5.58
1421,5.68
1422,6.03
1423,6.68
1424,7.64
1425,8.78
1426,10.03
1427,11.20
1428,12.18
1429,12.79
1430,13.05
1431,13.00
1432,12.80
1433,12.57
1434,12.44
1435,12.44
1436,12.59
1437,12.77
1438,12.89
1439,12.84
1440,12.58
1441,12.12
1442,11.51
1443,10.87
1444,10.33
1445,9.99
1446,9.91
1447,10.06
1448,10.43
1449,10.94
1450,11.54
1451,12.11
1452,12.60
1453,12.95
1454,13.21
1455,13.40
1456,13.61
1457,13.86
1458,14.24
1459,14.72
1460,15.30
1461,15.93
1462,16.56
1463,17.11
1464,17.51
1465,17.71
1466,17.72
1467,17.56
1468,17.30
1469,17.01
1470,16.68
1471,16.32
1472,15.94
1473,15.58
1474,15.27
1475,15.04
1476,14.85
1477,14.77
1478,14.79
1479,14.92
1480,15.05
1481,15.10
1482,14.97
1483,14.68
1484,14.19
1485,13.57
1486,12.83
1487,12.08
1488,11.37
1489,10.78
1490,10.31
1491,9.99
1492,9.75
1493,9.53
1494,9.23
1495,8.85
1496,8.35
1497,7.81
1498,7.28
1499,6.80
1500,6.40
1501,6.13
1502,6.02
1503,6.10
1504,6.38
1505,6.77
1506,7.25
1507,7.77
1508,8.39
1509,9.06
1510,9.85
1511,10.67
1512,11.58
1513,12.49
1514,13.44
1515,14.31
1516,15.18
1517,15.92
1518,16.65
1519,17.24
1520,17.85
1521,18.34
1522,18.88
1523,19.34
1524,19.91
1525,20.44
1526,21.06
1527,21.65
1528,22.38
1529,23.17
1530,24.21
1531,25.37
1532,26.77
1533,28.27
1534,29.95
1535,31.62
1536,33.33
1537,34.85
1538,36.29
1539,37.51
1540,38.64
1541,39.58
1542,40.52
1543,41.42
1544,42.40
1545,43.37
1546,44.36
1547,45.28
1548,46.14
1549,46.78
1550,47.20
1551,47.26
1552,47.07
1553,46.64
1554,46.07
1555,45.39
1556,44.72
1557,44.10
1558,43.66
1559,43.40
1560,43.37
1561,43.49
1562,43.74
1563,44.06
1564,44.46
1565,44.88
1566,45.32
1567,45.75
1568,46.23
1569,46.82
1570,47.61
1571,48.55
1572,49.64
1573,50.74
1574,51.86
1575,52.87
1576,53.73
1577,54.32
1578,54.66
1579,54.80
1580,54.84
1581,54.80
1582,54.72
1583,54.60
1584,54.46
1585,54.23
1586,53.79
1587,53.12
1588,52.19
1589,51.12
1590,49.93
1591,48.78
1592,47.67
1593,46.76
1594,46.02
1595,45.55
1596,45.14
1597,44.81
1598,44.30
1599,43.69
1600,42.79
1601,41.78
1602,40.55
1603,39.30
1604,37.96
1605,36.73
1606,35.54
1607,34.53
1608,33.53
1609,32.61
1610,31.62
1611,30.65
1612,29.66
1613,28.72
1614,27.77
1615,26.92
1616,26.16
1617,25.63
1618,25.31
1619,25.19
1620,25.25
1621,25.47
1622,25.82
1623,26.30
1624,26.89
1625,27.55
1626,28.26
1627,29.00
1628,29.79
1629,30.59
1630,31.37
1631,32.06
1632,32.65
1633,33.09
1634,33.39
1635,33.53
1636,33.58
1637,33.53
1638,33.45
1639,33.39
1640,33.42
1641,33.55
1642,33.81
1643,34.08
1644,34.32
1645,34.45
1646,34.42
1647,34.23
1648,33.94
1649,33.67
1650,33.48
1651,33.48
1652,33.71
1653,34.21
1654,34.87
1655,35.55
1656,36.03
1657,36.15
1658,35.76
1659,34.90
1660,33.58
1661,32.05
1662,30.46
1663,29.07
1664,27.89
1665,27.01
1666,26.34
1667,25.88
1668,25.38
1669,24.84
1670,24.12
1671,23.37
1672,22.55
1673,21.85
1674,21.22
1675,20.77
1676,20.40
1677,20.10
1678,19.73
1679,19.32
1680,18.84
1681,18.37
1682,17.91
1683,17.52
1684,17.22
1685,17.09
1686,17.07
1687,17.15
1688,17.20
1689,17.18
1690,17.04
1691,16.84
1692,16.56
1693,16.24
1694,15.85
1695,15.46
1696,15.12
1697,14.85
1698,14.63
1699,14.42
1700,14.23
1701,14.08
1702,13.98
1703,13.92
1704,13.89
1705,13.88
1706,13.95
1707,14.10
1708,14.31
1709,14.57
1710,14.94
1711,15.40
1712,16.01
1713,16.69
1714,17.46
1715,18.20
1716,18.87
1717,19.33
1718,19.62
1719,19.68
1720,19.68
1721,19.65
1722,19.74
1723,20.02
1724,20.61
1725,21.43
1726,22.48
1727,23.55
1728,24.60
1729,25.48
1730,26.25
1731,26.86
1732,27.40
1733,27.89
1734,28.42
1735,28.98
1736,29.59
1737,30.19
1738,30.72
1739,31.11
1740,31.34
1741,31.39
1742,31.31
1743,31.12
1744,30.87
1745,30.63
1746,30.44
1747,30.30
1748,30.16
1749,29.98
1750,29.75
1751,29.46
1752,29.06
1753,28.59
1754,28.04
1755,27.49
1756,26.91
1757,26.38
1758,25.86
1759,25.41
1760,24.95
1761,24.51
1762,23.99
1763,23.46
1764,22.83
1765,22.20
1766,21.44
1767,20.66
1768,19.81
1769,19.04
1770,18.20
1771,17.40
1772,16.53
1773,15.72
1774,14.85
1775,13.97
1776,12.86
1777,11.64
1778,10.23
1779,8.81
1780,7.35
1781,6.02
1782,4.83
1783,3.96
1784,3.35
1785,3.02
1786,2.78
1787,2.61
1788,2.34
1789,2.00
1790,1.50
1791,0.93
1792,0.38
1793,-0.02
1794,-0.22
1795,-0.21
1796,-0.02
1797,0.31
1798,0.72
1799,1.13
1800,1.56
1801,2.00
1802,2.50
1803,3.02
1804,3.62
1805,4.29
1806,5.13
1807,6.04
1808,6.97
1809,7.80
1810,8.60
1811,9.25
1812,9.82
1813,10.19
1814,10.50
1815,10.77
1816,11.13
1817,11.54
1818,12.12
1819,12.79
1820,13.62
1821,14.43
1822,15.27
1823,15.96
1824,16.62
1825,17.22
1826,17.88
1827,18.61
1828,19.51
1829,20.50
1830,21.62
1831,22.69
1832,23.69
1833,24.45
1834,24.99
1835,25.23
1836,25.33
1837,25.29
1838,25.28
1839,25.38
1840,25.74
1841,26.31
1842,27.02
1843,27.70
1844,28.31
1845,28.76
1846,29.05
1847,29.16
1848,29.14
1849,29.04
1850,28.94
1851,28.88
1852,28.86
1853,28.87
1854,28.85
1855,28.81
1856,28.66
1857,28.41
1858,27.95
1859,27.34
1860,26.55
1861,25.70
1862,24.76
1863,23.82
1864,22.82
1865,21.87
1866,20.85
1867,19.84
1868,18.67
1869,17.44
1870,16.09
1871,14.76
1872,13.40
1873,12.17
1874,11.05
1875,10.25
1876,9.65
1877,9.32
1878,9.09
1879,8.97
1880,8.82
1881,8.67
1882,8.42
1883,8.16
1884,7.88
1885,7.71
1886,7.64
1887,7.65
1888,7.64
1889,7.59
1890,7.49
1891,7.36
1892,7.22
1893,7.06
1894,6.97
1895,6.95
1896,7.06
1897,7.29
1898,7.69
1899,8.19
1900,8.79
1901,9.44
1902,10.19
1903,11.01
1904,11.93
1905,12.89
1906,13.89
1907,14.84
1908,15.70
1909,16.38
1910,16.91
1911,17.29
1912,17.56
1913,17.72
1914,17.86
1915,17.97
1916,18.10
1917,18.18
1918,18.20
1919,18.07
1920,17.82
1921,17.45
1922,17.03
1923,16.63
1924,16.37
1925,16.30
1926,16.45
1927,16.82
1928,17.36
1929,17.96
1930,18.52
1931,18.94
1932,19.20
1933,19.30
1934,19.31
1935,19.26
1936,19.32
1937,19.50
1938,19.91
1939,20.54
1940,21.41
1941,22.40
1942,23.37
1943,24.16
1944,24.70
1945,24.97
1946,24.94
1947,24.67
1948,24.24
1949,23.73
1950,23.14
1951,22.52
1952,21.88
1953,21.29
1954,20.72
1955,20.20
1956,19.68
1957,19.25
1958,18.86
1959,18.55
1960,18.18
1961,17.77
1962,17.19
1963,16.49
1964,15.56
1965,14.54
1966,13.42
1967,12.37
1968,11.41
1969,10.67
1970,10.06
1971,9.61
1972,9.13
1973,8.68
1974,8.20
1975,7.79
1976,7.39
1977,7.09
1978,6.86
1979,6.77
1980,6.74
1981,6.77
1982,6.77
1983,6.71
1984,6.52
1985,6.23
1986,5.91
1987,5.68
1988,5.62
1989,5.71
1990,5.98
1991,6.40
1992,6.91
1993,7.42
1994,7.90
1995,8.29
1996,8.58
1997,8.80
1998,9.04
1999,9.29
2000,9.61
2001,9.94
2002,10.39
2003,10.86
2004,11.34
2005,11.70
2006,12.04
2007,12.31
2008,12.66
2009,13.08
2010,13.70
2011,14.50
2012,15.65
2013,17.00
2014,18.58
2015,20.18
2016,21.80
2017,23.24
2018,24.52
2019,25.51
2020,26.34
2021,26.99
2022,27.63
2023,28.23
2024,28.92
2025,29.66
2026,30.48
2027,31.21
2028,31.82
2029,32.21
2030,32.41
2031,32.42
2032,32.28
2033,32.05
2034,31.78
2035,31.52
2036,31.18
2037,30.75
2038,30.17
2039,29.46
2040,28.56
2041,27.53
2042,26.37
2043,25.28
2044,24.24
2045,23.36
2046,22.61
2047,22.06
2048,21.63
2049,21.29
2050,20.91
2051,20.56
2052,20.16
2053,19.80
2054,19.31
2055,18.78
2056,18.13
2057,17.52
2058,16.87
2059,16.27
2060,15.63
2061,15.06
2062,14.46
2063,13.92
2064,13.33
2065,12.73
2066,12.00
2067,11.22
2068,10.30
2069,9.37
2070,8.37
2071,7.44
2072,6.48
2073,5.61
2074,4.75
2075,4.00
2076,3.24
2077,2.53
2078,1.70
2079,0.86
2080,-0.06
2081,-0.95
2082,-1.82
2083,-2.58
2084,-3.23
2085,-3.66
2086,-3.92
2087,-3.94
2088,-3.79
2089,-3.50
2090,-3.23
2091,-3.04
2092,-2.97
2093,-3.01
2094,-3.11
2095,-3.28
2096,-3.43
2097,-3.51
2098,-3.37
2099,-3.03
2100,-2.45
2101,-1.74
2102,-0.89
2103,0.03
2104,1.01
2105,1.95
2106,2.88
2107,3.75
2108,4.69
2109,5.66
2110,6.72
2111,7.74
2112,8.77
2113,9.70
2114,10.61
2115,11.34
2116,11.92
2117,12.29
2118,12.58
2119,12.76
2120,12.93
2121,13.09
2122,13.36
2123,13.67
2124,14.02
2125,14.29
2126,14.47
2127,14.53
2128,14.47
2129,14.31
2130,14.12
2131,13.99
2132,14.00
2133,14.18
2134,14.52
2135,14.96
2136,15.37
2137,15.66
2138,15.71
2139,15.52
2140,15.01
2141,14.27
2142,13.30
2143,12.29
2144,11.29
2145,10.41
2146,9.58
2147,8.80
2148,7.93
2149,7.06
2150,6.10
2151,5.16
2152,4.21
2153,3.42
2154,2.79
2155,2.42
2156,2.20
2157,2.14
2158,2.13
2159,2.12
2160,1.96
2161,1.68
2162,1.27
2163,0.85
2164,0.44
2165,0.09
2166,-0.20
2167,-0.37
2168,-0.46
2169,-0.50
2170,-0.60
2171,-0.76
2172,-1.02
2173,-1.32
2174,-1.66
2175,-1.98
2176,-2.29
2177,-2.58
2178,-2.91
2179,-3.26
2180,-3.65
2181,-4.04
2182,-4.42
2183,-4.78
2184,-5.11
2185,-5.35
2186,-5.44
2187,-5.35
2188,-5.13
2189,-4.82
2190,-4.46
2191,-4.08
2192,-3.70
2193,-3.41
2194,-3.20
2195,-3.09
2196,-2.99
2197,-2.89
2198,-2.72
2199,-2.46
2200,-2.04
2201,-1.53
2202,-0.85
2203,-0.15
2204,0.60
2205,1.27
2206,1.88
2207,2.40
2208,2.94
2209,3.52
2210,4.20
2211,4.94
2212,5.80
2213,6.69
2214,7.68
2215,8.65
2216,9.66
2217,10.57
2218,11.41
2219,12.08
2220,12.64
2221,13.06
2222,13.45
2223,13.76
2224,14.08
2225,14.32
2226,14.58
2227,14.83
2228,15.17
2229,15.55
2230,15.98
2231,16.40
2232,16.79
2233,17.11
2234,17.35
2235,17.47
2236,17.49
2237,17.38
2238,17.21
2239,17.03
2240,16.91
2241,16.87
2242,16.92
2243,17.07
2244,17.33
2245,17.63
2246,17.90
2247,18.06
2248,18.09
2249,18.03
2250,17.89
2251,17.78
2252,17.73
2253,17.84
2254,18.04
2255,18.31
2256,18.43
2257,18.32
2258,17.79
2259,16.84
2260,15.43
2261,13.79
2262,12.07
2263,10.54
2264,9.27
2265,8.43
2266,7.96
2267,7.78
2268,7.63
2269,7.40
2270,6.94
2271,6.32
2272,5.52
2273,4.73
2274,4.09
2275,3.80
2276,3.88
2277,4.24
2278,4.78
2279,5.36
2280,5.91
2281,6.34
2282,6.55
2283,6.61
2284,6.64
2285,6.81
2286,7.16
2287,7.66
2288,8.19
2289,8.67
2290,8.90
2291,8.83
2292,8.35
2293,7.55
2294,6.45
2295,5.19
2296,3.85
2297,2.60
2298,1.49
2299,0.58
2300,-0.22
2301,-0.95
2302,-1.71
2303,-2.44
2304,-3.17
2305,-3.80
2306,-4.33
2307,-4.61
2308,-4.62
2309,-4.34
2310,-3.89
2311,-3.33
2312,-2.75
2313,-2.20
2314,-1.82
2315,-1.67
2316,-1.72
2317,-1.93
2318,-2.14
2319,-2.34
2320,-2.41
2321,-2.33
2322,-2.03
2323,-1.53
2324,-0.85
2325,-0.10
2326,0.67
2327,1.38
2328,2.02
2329,2.56
2330,3.01
2331,3.36
2332,3.65
2333,3.85
2334,3.98
2335,4.01
2336,3.92
2337,3.69
2338,3.32
2339,2.84
2340,2.27
2341,1.71
2342,1.15
2343,0.72
2344,0.37
2345,0.10
2346,-0.25
2347,-0.72
2348,-1.36
2349,-2.14
2350,-3.13
2351,-4.24
2352,-5.43
2353,-6.48
2354,-7.25
2355,-7.66
2356,-7.81
2357,-7.72
2358,-7.48
2359,-7.11
2360,-6.75
2361,-6.47
2362,-6.29
2363,-6.18
2364,-6.12
2365,-6.06
2366,-5.95
2367,-5.81
2368,-5.63
2369,-5.46
2370,-5.25
2371,-5.02
2372,-4.77
2373,-4.54
2374,-4.29
2375,-4.07
2376,-3.81
2377,-3.59
2378,-3.33
2379,-3.04
2380,-2.67
2381,-2.27
2382,-1.79
2383,-1.24
2384,-0.53
2385,0.24
2386,1.04
2387,1.75
2388,2.38
2389,2.88
2390,3.26
2391,3.51
2392,3.72
2393,3.88
2394,4.07
2395,4.25
2396,4.42
2397,4.53
2398,4.62
2399,4.67
2400,4.71
2401,4.73
2402,4.75
2403,4.77
2404,4.85
2405,5.00
2406,5.22
2407,5.42
2408,5.61
2409,5.72
2410,5.80
2411,5.81
2412,5.82
2413,5.84
2414,5.96
2415,6.16
2416,6.44
2417,6.80
2418,7.26
2419,7.77
2420,8.26
2421,8.65
2422,8.95
2423,9.18
2424,9.38
2425,9.56
2426,9.75
2427,9.96
2428,10.15
2429,10.28
2430,10.28
2431,10.11
2432,9.73
2433,9.19
2434,8.52
2435,7.84
2436,7.17
2437,6.61
2438,6.13
2439,5.76
2440,5.41
2441,5.08
2442,4.66
2443,4.19
2444,3.64
2445,3.11
2446,2.59
2447,2.12
2448,1.66
2449,1.28
2450,0.99
2451,0.79
2452,0.59
2453,0.37
2454,0.20
2455,0.09
2456,0.13
2457,0.30
2458,0.66
2459,1.21
2460,1.99
2461,2.91
2462,3.98
2463,5.07
2464,6.20
2465,7.25
2466,8.34
2467,9.38
2468,10.48
2469,11.56
2470,12.75
2471,13.95
2472,15.21
2473,16.36
2474,17.44
2475,18.31
2476,19.02
2477,19.48
2478,19.78
2479,19.86
2480,19.87
2481,19.78
2482,19.75
2483,19.72
2484,19.79
2485,19.88
2486,20.13
2487,20.46
2488,20.95
2489,21.50
2490,22.18
2491,22.94
2492,23.85
2493,24.82
2494,25.86
2495,26.87
2496,27.88
2497,28.76
2498,29.52
2499,30.08
2500,30.49
2501,30.71
2502,30.80
2503,30.82
2504,30.89
2505,31.03
2506,31.21
2507,31.38
2508,31.48
2509,31.46
2510,31.22
2511,30.78
2512,30.13
2513,29.40
2514,28.59
2515,27.83
2516,27.05
2517,26.34
2518,25.57
2519,24.77
2520,23.74
2521,22.61
2522,21.29
2523,19.94
2524,18.48
2525,17.07
2526,15.69
2527,14.52
2528,13.45
2529,12.59
2530,11.81
2531,11.22
2532,10.67
2533,10.23
2534,9.73
2535,9.25
2536,8.70
2537,8.15
2538,7.52
2539,6.92
2540,6.30
2541,5.78
2542,5.28
2543,4.89
2544,4.53
2545,4.22
2546,3.82
2547,3.37
2548,2.79
2549,2.18
2550,1.48
2551,0.82
2552,0.15
2553,-0.40
2554,-0.91
2555,-1.31
2556,-1.66
2557,-1.95
2558,-2.27
2559,-2.63
2560,-3.12
2561,-3.65
2562,-4.23
2563,-4.80
2564,-5.35
2565,-5.81
2566,-6.20
2567,-6.50
2568,-6.74
2569,-6.98
2570,-7.23
2571,-7.47
2572,-7.66
2573,-7.77
2574,-7.71
2575,-7.42
2576,-6.82
2577,-5.97
2578,-4.87
2579,-3.71
2580,-2.54
2581,-1.57
2582,-0.77
2583,-0.21
2584,0.31
2585,0.80
2586,1.50
2587,2.33
2588,3.41
2589,4.62
2590,6.00
2591,7.35
2592,8.67
2593,9.78
2594,10.79
2595,11.60
2596,12.31
2597,12.89
2598,13.43
2599,13.89
2600,14.31
2601,14.60
2602,14.77
2603,14.78
2604,14.72
2605,14.58
2606,14.45
2607,14.32
2608,14.27
2609,14.28
2610,14.43
2611,14.70
2612,15.10
2613,15.60
2614,16.17
2615,16.79
2616,17.37
2617,17.81
2618,17.94
2619,17.75
2620,17.22
2621,16.46
2622,15.52
2623,14.50
2624,13.50
2625,12.63
2626,11.91
2627,11.33
2628,10.80
2629,10.31
2630,9.80
2631,9.33
2632,8.87
2633,8.50
2634,8.17
2635,7.99
2636,7.87
2637,7.84
2638,7.72
2639,7.51
2640,7.08
2641,6.48
2642,5.73
2643,4.95
2644,4.23
2645,3.66
2646,3.25
2647,3.04
2648,2.94
2649,3.00
2650,3.07
2651,3.14
2652,3.14
2653,3.10
2654,2.93
2655,2.68
2656,2.30
2657,1.83
2658,1.21
2659,0.50
2660,-0.28
2661,-1.06
2662,-1.82
2663,-2.46
2664,-2.99
2665,-3.35
2666,-3.57
2667,-3.65
2668,-3.60
2669,-3.43
2670,-3.17
2671,-2.83
2672,-2.41
2673,-1.94
2674,-1.44
2675,-1.00
2676,-0.59
2677,-0.27
2678,-0.01
2679,0.18
2680,0.40
2681,0.67
2682,1.12
2683,1.69
2684,2.46
2685,3.35
2686,4.40
2687,5.46
2688,6.51
2689,7.45
2690,8.38
2691,9.21
2692,10.04
2693,10.80
2694,11.58
2695,12.28
2696,12.91
2697,13.35
2698,13.65
2699,13.74
2700,13.73
2701,13.62
2702,13.55
2703,13.57
2704,13.71
2705,13.95
2706,14.27
2707,14.60
2708,14.88
2709,15.07
2710,15.15
2711,15.11
2712,14.95
2713,14.72
2714,14.45
2715,14.22
2716,13.98
2717,13.72
2718,13.41
2719,13.13
2720,12.83
2721,12.50
2722,12.10
2723,11.70
2724,11.31
2725,11.00
2726,10.65
2727,10.25
2728,9.74
2729,9.19
2730,8.54
2731,7.88
2732,7.10
2733,6.32
2734,5.48
2735,4.70
2736,3.85
2737,2.99
2738,1.98
2739,0.87
2740,-0.47
2741,-1.87
2742,-3.38
2743,-4.76
2744,-6.04
2745,-7.03
2746,-7.83
2747,-8.38
2748,-8.90
2749,-9.36
2750,-9.98
2751,-10.70
2752,-11.62
2753,-12.59
2754,-13.62
2755,-14.56
2756,-15.43
2757,-16.11
2758,-16.62
2759,-16.96
2760,-17.22
2761,-17.40
2762,-17.49
2763,-17.46
2764,-17.28
2765,-16.93
2766,-16.39
2767,-15.70
2768,-14.88
2769,-14.08
2770,-13.35
2771,-12.79
2772,-12.37
2773,-12.12
2774,-11.95
2775,-11.83
2776,-11.59
2777,-11.23
2778,-10.65
2779,-9.95
2780,-9.09
2781,-8.25
2782,-7.38
2783,-6.62
2784,-5.88
2785,-5.27
2786,-4.63
2787,-3.97
2788,-3.11
2789,-2.12
2790,-0.98
2791,0.14
2792,1.27
2793,2.27
2794,3.14
2795,3.75
2796,4.19
2797,4.45
2798,4.70
2799,4.94
2800,5.32
2801,5.77
2802,6.39
2803,7.05
2804,7.82
2805,8.56
2806,9.27
2807,9.85
2808,10.37
2809,10.80
2810,11.22
2811,11.60
2812,11.96
2813,12.29
2814,12.60
2815,12.86
2816,13.08
2817,13.21
2818,13.22
2819,13.14
2820,12.92
2821,12.64
2822,12.24
2823,11.74
2824,11.09
2825,10.32
2826,9.42
2827,8.48
2828,7.45
2829,6.42
2830,5.36
2831,4.39
2832,3.49
2833,2.74
2834,2.01
2835,1.38
2836,0.76
2837,0.25
2838,-0.27
2839,-0.76
2840,-1.28
2841,-1.74
2842,-2.21
2843,-2.65
2844,-3.11
2845,-3.54
2846,-3.98
2847,-4.39
2848,-4.80
2849,-5.13
2850,-5.34
2851,-5.42
2852,-5.43
2853,-5.37
2854,-5.23
2855,-5.03
2856,-4.76
2857,-4.49
2858,-4.24
2859,-4.01
2860,-3.75
2861,-3.50
2862,-3.21
2863,-2.89
2864,-2.45
2865,-1.90
2866,-1.20
2867,-0.42
2868,0.43
2869,1.27
2870,2.04
2871,2.60
2872,2.93
2873,3.01
2874,2.93
2875,2.67
2876,2.28
2877,1.79
2878,1.32
2879,0.89
2880,0.53
2881,0.21
2882,-0.06
2883,-0.25
2884,-0.37
2885,-0.43
2886,-0.40
2887,-0.28
2888,-0.11
2889,0.07
2890,0.27
2891,0.47
2892,0.70
2893,0.96
2894,1.30
2895,1.71
2896,2.21
2897,2.75
2898,3.32
2899,3.82
2900,4.22
2901,4.46
2902,4.56
2903,4.62
2904,4.69
2905,4.88
2906,5.17
2907,5.61
2908,6.08
2909,6.50
2910,6.66
2911,6.46
2912,5.81
2913,4.81
2914,3.49
2915,2.12
2916,0.76
2917,-0.39
2918,-1.36
2919,-2.04
2920,-2.58
2921,-3.02
2922,-3.59
2923,-4.28
2924,-5.17
2925,-6.11
2926,-7.12
2927,-7.99
2928,-8.76
2929,-9.30
2930,-9.74
2931,-10.06
2932,-10.45
2933,-10.94
2934,-11.63
2935,-12.47
2936,-13.42
2937,-14.37
2938,-15.29
2939,-16.03
2940,-16.56
2941,-16.82
2942,-16.87
2943,-16.73
2944,-16.50
2945,-16.23
2946,-15.96
2947,-15.69
2948,-15.39
2949,-15.05
2950,-14.62
2951,-14.11
2952,-13.50
2953,-12.89
2954,-12.30
2955,-11.83
2956,-11.40
2957,-11.04
2958,-10.67
2959,-10.30
2960,-9.80
2961,-9.20
2962,-8.43
2963,-7.61
2964,-6.68
2965,-5.78
2966,-4.86
2967,-4.04
2968,-3.24
2969,-2.56
2970,-1.87
2971,-1.22
2972,-0.44
2973,0.39
2974,1.38
2975,2.37
2976,3.45
2977,4.49
2978,5.61
2979,6.68
2980,7.83
2981,8.91
2982,10.03
2983,11.11
2984,12.25
2985,13.40
2986,14.59
2987,15.66
2988,16.55
2989,17.13
2990,17.35
2991,17.15
2992,16.44
2993,15.28
2994,13.73
2995,11.99
2996,10.17
2997,8.45
2998,6.82
2999,5.42
3000,4.15
3001,3.04
3002,1.90
3003,0.75
3004,-0.55
3005,-1.84
3006,-3.20
3007,-4.44
3008,-5.55
3009,-6.34
3010,-6.83
3011,-6.95
3012,-6.87
3013,-6.58
3014,-6.30
3015,-6.07
3016,-6.03
3017,-6.14
3018,-6.40
3019,-6.63
3020,-6.81
3021,-6.88
3022,-6.94
3023,-6.98
3024,-7.07
3025,-7.27
3026,-7.69
3027,-8.35
3028,-9.19
3029,-10.06
3030,-10.89
3031,-11.57
3032,-12.08
3033,-12.37
3034,-12.49
3035,-12.47
3036,-12.46
3037,-12.50
3038,-12.65
3039,-12.85
3040,-13.11
3041,-13.36
3042,-13.65
3043,-13.90
3044,-14.18
3045,-14.43
3046,-14.75
3047,-15.15
3048,-15.72
3049,-16.40
3050,-17.20
3051,-18.00
3052,-18.79
3053,-19.54
3054,-20.23
3055,-20.84
3056,-21.31
3057,-21.61
3058,-21.71
3059,-21.64
3060,-21.33
3061,-20.81
3062,-19.99
3063,-18.96
3064,-17.72
3065,-16.43
3066,-15.13
3067,-13.99
3068,-12.98
3069,-12.17
3070,-11.40
3071,-10.72
3072,-9.98
3073,-9.21
3074,-8.25
3075,-7.19
3076,-6.03
3077,-4.96
3078,-3.98
3079,-3.23
3080,-2.66
3081,-2.35
3082,-2.20
3083,-2.25
3084,-2.45
3085,-2.79
3086,-3.15
3087,-3.54
3088,-3.86
3089,-4.14
3090,-4.28
3091,-4.23
3092,-3.95
3093,-3.40
3094,-2.61
3095,-1.60
3096,-0.54
3097,0.47
3098,1.26
3099,1.76
3100,1.85
3101,1.50
3102,0.69
3103,-0.45
3104,-1.79
3105,-3.11
3106,-4.35
3107,-5.41
3108,-6.35
3109,-7.16
3110,-7.99
3111,-8.83
3112,-9.80
3113,-10.83
3114,-11.95
3115,-12.95
3116,-13.80
3117,-14.33
3118,-14.58
3119,-14.52
3120,-14.27
3121,-13.93
3122,-13.63
3123,-13.44
3124,-13.40
3125,-13.47
3126,-13.61
3127,-13.76
3128,-13.85
3129,-13.82
3130,-13.66
3131,-13.40
3132,-13.02
3133,-12.60
3134,-12.18
3135,-11.80
3136,-11.43
3137,-11.09
3138,-10.73
3139,-10.44
3140,-10.19
3141,-10.06
3142,-9.99
3143,-10.01
3144,-10.01
3145,-10.00
3146,-9.89
3147,-9.64
3148,-9.13
3149,-8.37
3150,-7.32
3151,-6.17
3152,-4.94
3153,-3.76
3154,-2.59
3155,-1.57
3156,-0.64
3157,0.08
3158,0.72
3159,1.27
3160,1.95
3161,2.69
3162,3.63
3163,4.62
3164,5.73
3165,6.81
3166,7.93
3167,8.92
3168,9.85
3169,10.60
3170,11.30
3171,11.92
3172,12.60
3173,13.28
3174,14.00
3175,14.70
3176,15.43
3177,16.04
3178,16.53
3179,16.79
3180,16.87
3181,16.81
3182,16.65
3183,16.48
3184,16.27
3185,16.04
3186,15.75
3187,15.42
3188,14.94
3189,14.33
3190,13.50
3191,12.57
3192,11.50
3193,10.41
3194,9.19
3195,7.95
3196,6.56
3197,5.20
3198,3.70
3199,2.21
3200,0.61
3201,-0.91
3202,-2.41
3203,-3.68
3204,-4.88
3205,-5.84
3206,-6.79
3207,-7.61
3208,-8.50
3209,-9.35
3210,-10.33
3211,-11.28
3212,-12.31
3213,-13.20
3214,-14.05
3215,-14.70
3216,-15.29
3217,-15.70
3218,-16.08
3219,-16.40
3220,-16.87
3221,-17.49
3222,-18.40
3223,-19.49
3224,-20.78
3225,-22.09
3226,-23.38
3227,-24.53
3228,-25.57
3229,-26.45
3230,-27.24
3231,-27.87
3232,-28.45
3233,-28.91
3234,-29.33
3235,-29.62
3236,-29.79
3237,-29.78
3238,-29.65
3239,-29.42
3240,-29.18
3241,-29.00
3242,-28.92
3243,-28.92
3244,-28.98
3245,-29.01
3246,-28.96
3247,-28.82
3248,-28.57
3249,-28.24
3250,-27.81
3251,-27.37
3252,-26.98
3253,-26.69
3254,-26.43
3255,-26.21
3256,-25.98
3257,-25.79
3258,-25.52
3259,-25.18
3260,-24.68
3261,-24.10
3262,-23.42
3263,-22.76
3264,-22.03
3265,-21.33
3266,-20.61
3267,-19.99
3268,-19.33
3269,-18.68
3270,-17.87
3271,-16.98
3272,-15.88
3273,-14.71
3274,-13.38
3275,-12.06
3276,-10.70
3277,-9.46
3278,-8.32
3279,-7.42
3280,-6.68
3281,-6.13
3282,-5.66
3283,-5.31
3284,-4.95
3285,-4.64
3286,-4.26
3287,-3.90
3288,-3.50
3289,-3.14
3290,-2.78
3291,-2.47
3292,-2.22
3293,-2.07
3294,-1.98
3295,-1.96
3296,-2.00
3297,-2.08
3298,-2.18
3299,-2.27
3300,-2.37
3301,-2.50
3302,-2.74
3303,-3.08
3304,-3.62
3305,-4.29
3306,-5.13
3307,-6.04
3308,-7.10
3309,-8.15
3310,-9.22
3311,-10.25
3312,-11.34
3313,-12.40
3314,-13.42
3315,-14.24
3316,-14.95
3317,-15.49
3318,-15.94
3319,-16.22
3320,-16.42
3321,-16.54
3322,-16.73
3323,-16.99
3324,-17.36
3325,-17.75
3326,-18.10
3327,-18.36
3328,-18.43
3329,-18.33
3330,-17.97
3331,-17.45
3332,-16.75
3333,-16.02
3334,-15.20
3335,-14.39
3336,-13.51
3337,-12.67
3338,-11.77
3339,-10.91
3340,-9.96
3341,-9.01
3342,-7.89
3343,-6.70
3344,-5.31
3345,-3.88
3346,-2.30
3347,-0.76
3348,0.85
3349,2.32
3350,3.72
3351,4.88
3352,5.93
3353,6.76
3354,7.52
3355,8.15
3356,8.77
3357,9.31
3358,9.83
3359,10.22
3360,10.59
3361,10.83
3362,11.04
3363,11.17
3364,11.32
3365,11.48
3366,11.73
3367,12.01
3368,12.38
3369,12.79
3370,13.26
3371,13.70
3372,14.11
3373,14.43
3374,14.72
3375,14.92
3376,15.03
3377,15.06
3378,15.05
3379,15.05
3380,15.05
3381,15.06
3382,15.05
3383,15.03
3384,14.92
3385,14.71
3386,14.29
3387,13.74
3388,13.02
3389,12.30
3390,11.54
3391,10.84
3392,10.11
3393,9.43
3394,8.67
3395,7.90
3396,6.94
3397,5.89
3398,4.55
3399,3.13
3400,1.50
3401,-0.11
3402,-1.79
3403,-3.39
3404,-5.09
3405,-6.71
3406,-8.39
3407,-9.96
3408,-11.63
3409,-13.18
3410,-14.79
3411,-16.24
3412,-17.74
3413,-19.16
3414,-20.64
3415,-21.98
3416,-23.27
3417,-24.38
3418,-25.42
3419,-26.24
3420,-26.86
3421,-27.20
3422,-27.37
3423,-27.34
3424,-27.20
3425,-26.92
3426,-26.57
3427,-26.18
3428,-25.76
3429,-25.29
3430,-24.73
3431,-24.11
3432,-23.41
3433,-22.68
3434,-21.84
3435,-20.97
3436,-20.03
3437,-19.19
3438,-18.34
3439,-17.63
3440,-16.95
3441,-16.39
3442,-15.77
3443,-15.15
3444,-14.37
3445,-13.51
3446,-12.43
3447,-11.24
3448,-9.85
3449,-8.50
3450,-7.15
3451,-6.00
3452,-4.88
3453,-3.88
3454,-2.78
3455,-1.67
3456,-0.33
3457,1.17
3458,2.93
3459,4.66
3460,6.33
3461,7.68
3462,8.83
3463,9.65
3464,10.28
3465,10.73
3466,11.22
3467,11.83
3468,12.63
3469,13.50
3470,14.36
3471,15.02
3472,15.40
3473,15.40
3474,15.01
3475,14.31
3476,13.43
3477,12.54
3478,11.67
3479,10.91
3480,10.19
3481,9.50
3482,8.69
3483,7.76
3484,6.59
3485,5.29
3486,3.84
3487,2.43
3488,1.03
3489,-0.14
3490,-1.11
3491,-1.75
3492,-2.17
3493,-2.37
3494,-2.54
3495,-2.72
3496,-3.05
3497,-3.45
3498,-3.96
3499,-4.46
3500,-4.95
3501,-5.32
3502,-5.60
3503,-5.76
3504,-5.93
3505,-6.12
3506,-6.42
3507,-6.82
3508,-7.39
3509,-8.04
3510,-8.75
3511,-9.40
3512,-10.00
3513,-10.49
3514,-10.93
3515,-11.28
3516,-11.57
3517,-11.80
3518,-12.02
3519,-12.22
3520,-12.45
3521,-12.64
3522,-12.86
3523,-13.04
3524,-13.28
3525,-13.57
3526,-13.95
3527,-14.37
3528,-14.81
3529,-15.23
3530,-15.63
3531,-15.99
3532,-16.27
3533,-16.45
3534,-16.56
3535,-16.59
3536,-16.52
3537,-16.36
3538,-16.06
3539,-15.72
3540,-15.27
3541,-14.79
3542,-14.18
3543,-13.53
3544,-12.66
3545,-11.66
3546,-10.38
3547,-8.98
3548,-7.33
3549,-5.64
3550,-3.81
3551,-2.08
3552,-0.32
3553,1.24
3554,2.75
3555,4.05
3556,5.36
3557,6.56
3558,7.84
3559,9.03
3560,10.28
3561,11.44
3562,12.60
3563,13.60
3564,14.47
3565,15.11
3566,15.58
3567,15.82
3568,15.94
3569,15.90
3570,15.75
3571,15.51
3572,15.21
3573,14.92
3574,14.64
3575,14.41
3576,14.18
3577,13.97
3578,13.66
3579,13.24
3580,12.51
3581,11.54
3582,10.22
3583,8.75
3584,7.04
3585,5.32
3586,3.52
3587,1.85
3588,0.15
3589,-1.44
3590,-3.08
3591,-4.66
3592,-6.36
3593,-7.96
3594,-9.54
3595,-10.86
3596,-12.01
3597,-12.83
3598,-13.44
3599,-13.76
3600,-14.03
3601,-14.26
3602,-14.60
3603,-15.01
3604,-15.54
3605,-16.04
3606,-16.44
3607,-16.62
3608,-16.59
3609,-16.37
3610,-15.99
3611,-15.55
3612,-15.11
3613,-14.78
3614,-14.55
3615,-14.41
3616,-14.30
3617,-14.16
3618,-13.92
3619,-13.60
3620,-13.21
3621,-12.86
3622,-12.52
3623,-12.32
3624,-12.29
3625,-12.51
3626,-12.89
3627,-13.31
3628,-13.58
3629,-13.63
3630,-13.35
3631,-12.79
3632,-11.94
3633,-10.96
3634,-9.92
3635,-8.99
3636,-8.23
3637,-7.77
3638,-7.55
3639,-7.52
3640,-7.48
3641,-7.37
3642,-7.00
3643,-6.41
3644,-5.58
3645,-4.66
3646,-3.69
3647,-2.84
3648,-2.08
3649,-1.51
3650,-1.02
3651,-0.61
3652,-0.10
3653,0.55
3654,1.40
3655,2.29
3656,3.14
3657,3.81
3658,4.26
3659,4.47
3660,4.39
3661,4.08
3662,3.65
3663,3.23
3664,2.87
3665,2.52
3666,2.11
3667,1.64
3668,1.08
3669,0.50
3670,-0.15
3671,-0.79
3672,-1.45
3673,-1.97
3674,-2.40
3675,-2.69
3676,-3.05
3677,-3.49
3678,-4.17
3679,-5.06
3680,-6.22
3681,-7.48
3682,-8.82
3683,-9.97
3684,-10.95
3685,-11.60
3686,-12.03
3687,-12.20
3688,-12.35
3689,-12.54
3690,-13.01
3691,-13.69
3692,-14.72
3693,-15.89
3694,-17.23
3695,-18.52
3696,-19.78
3697,-20.83
3698,-21.76
3699,-22.53
3700,-23.34
3701,-24.17
3702,-25.17
3703,-26.23
3704,-27.36
3705,-28.35
3706,-29.24
3707,-29.86
3708,-30.34
3709,-30.65
3710,-30.91
3711,-31.17
3712,-31.49
3713,-31.91
3714,-32.42
3715,-32.91
3716,-33.23
3717,-33.31
3718,-33.10
3719,-32.65
3720,-31.98
3721,-31.23
3722,-30.48
3723,-29.83
3724,-29.24
3725,-28.73
3726,-28.18
3727,-27.54
3728,-26.70
3729,-25.70
3730,-24.53
3731,-23.40
3732,-22.34
3733,-21.50
3734,-20.80
3735,-20.32
3736,-19.94
3737,-19.70
3738,-19.46
3739,-19.26
3740,-18.96
3741,-18.65
3742,-18.26
3743,-17.89
3744,-17.47
3745,-17.02
3746,-16.40
3747,-15.68
3748,-14.78
3749,-13.78
3750,-12.63
3751,-11.47
3752,-10.36
3753,-9.45
3754,-8.68
3755,-8.16
3756,-7.74
3757,-7.51
3758,-7.26
3759,-7.00
3760,-6.56
3761,-6.03
3762,-5.26
3763,-4.36
3764,-3.24
3765,-2.09
3766,-0.92
3767,0.11
3768,1.06
3769,1.85
3770,2.51
3771,2.99
3772,3.31
3773,3.48
3774,3.54
3775,3.55
3776,3.52
3777,3.47
3778,3.29
3779,2.99
3780,2.49
3781,1.85
3782,0.95
3783,-0.12
3784,-1.41
3785,-2.73
3786,-4.18
3787,-5.60
3788,-7.12
3789,-8.57
3790,-10.15
3791,-11.73
3792,-13.56
3793,-15.45
3794,-17.54
3795,-19.57
3796,-21.63
3797,-23.50
3798,-25.31
3799,-26.86
3800,-28.26
3801,-29.35
3802,-30.27
3803,-30.90
3804,-31.36
3805,-31.52
3806,-31.57
3807,-31.50
3808,-31.54
3809,-31.69
3810,-32.05
3811,-32.57
3812,-33.21
3813,-33.85
3814,-34.33
3815,-34.56
3816,-34.45
3817,-34.07
3818,-33.39
3819,-32.60
3820,-31.73
3821,-30.93
3822,-30.17
3823,-29.49
3824,-28.72
3825,-27.85
3826,-26.73
3827,-25.49
3828,-24.15
3829,-22.94
3830,-21.85
3831,-21.03
3832,-20.44
3833,-20.11
3834,-19.86
3835,-19.65
3836,-19.36
3837,-19.01
3838,-18.61
3839,-18.29
3840,-18.07
3841,-18.10
3842,-18.27
3843,-18.61
3844,-18.91
3845,-19.08
3846,-18.96
3847,-18.56
3848,-17.85
3849,-16.96
3850,-15.91
3851,-14.87
3852,-13.89
3853,-13.10
3854,-12.42
3855,-11.89
3856,-11.36
3857,-10.81
3858,-10.10
3859,-9.25
3860,-8.22
3861,-7.11
3862,-5.96
3863,-4.92
3864,-4.07
3865,-3.52
3866,-3.32
3867,-3.45
3868,-3.85
3869,-4.43
3870,-5.08
3871,-5.75
3872,-6.36
3873,-6.87
3874,-7.26
3875,-7.58
3876,-7.91
3877,-8.24
3878,-8.65
3879,-9.09
3880,-9.67
3881,-10.31
3882,-11.12
3883,-11.96
3884,-12.95
3885,-13.97
3886,-15.08
3887,-16.14
3888,-17.23
3889,-18.22
3890,-19.14
3891,-19.94
3892,-20.71
3893,-21.40
3894,-22.05
3895,-22.58
3896,-23.05
3897,-23.42
3898,-23.73
3899,-23.89
3900,-23.98
3901,-24.02
3902,-24.10
3903,-24.21
3904,-24.38
3905,-24.58
3906,-24.84
3907,-25.08
3908,-25.25
3909,-25.31
3910,-25.27
3911,-25.14
3912,-24.99
3913,-24.85
3914,-24.81
3915,-24.89
3916,-25.13
3917,-25.43
3918,-25.73
3919,-25.98
3920,-26.15
3921,-26.23
3922,-26.26
3923,-26.31
3924,-26.48
3925,-26.82
3926,-27.28
3927,-27.85
3928,-28.39
3929,-28.86
3930,-29.07
3931,-28.95
3932,-28.40
3933,-27.52
3934,-26.28
3935,-24.83
3936,-23.17
3937,-21.49
3938,-19.74
3939,-18.07
3940,-16.36
3941,-14.73
3942,-13.02
3943,-11.44
3944,-9.76
3945,-8.18
3946,-6.44
3947,-4.74
3948,-2.88
3949,-1.11
3950,0.73
3951,2.36
3952,3.91
3953,5.21
3954,6.44
3955,7.46
3956,8.50
3957,9.48
3958,10.57
3959,11.68
3960,12.85
3961,13.88
3962,14.75
3963,15.27
3964,15.48
3965,15.34
3966,14.99
3967,14.52
3968,14.05
3969,13.69
3970,13.50
3971,13.49
3972,13.55
3973,13.63
3974,13.59
3975,13.38
3976,12.83
3977,12.02
3978,10.91
3979,9.67
3980,8.27
3981,6.90
3982,5.50
3983,4.26
3984,3.00
3985,1.82
3986,0.54
3987,-0.73
3988,-2.16
3989,-3.62
3990,-5.23
3991,-6.84
3992,-8.52
3993,-10.08
3994,-11.60
3995,-12.91
3996,-14.09
3997,-15.02
3998,-15.82
3999,-16.43
4000,-16.91
4001,-17.23
4002,-17.45
4003,-17.52
4004,-17.47
4005,-17.26
4006,-16.92
4007,-16.50
4008,-16.01
4009,-15.48
4010,-14.89
4011,-14.32
4012,-13.69
4013,-13.09
4014,-12.40
4015,-11.69
4016,-10.83
4017,-9.90
4018,-8.77
4019,-7.57
4020,-6.15
4021,-4.70
4022,-3.05
4023,-1.40
4024,0.43
4025,2.20
4026,4.10
4027,5.93
4028,7.87
4029,9.71
4030,11.57
4031,13.24
4032,14.83
4033,16.17
4034,17.38
4035,18.29
4036,19.07
4037,19.67
4038,20.23
4039,20.68
4040,21.10
4041,21.42
4042,21.70
4043,21.89
4044,22.01
4045,21.97
4046,21.80
4047,21.49
4048,21.10
4049,20.68
4050,20.28
4051,19.94
4052,19.71
4053,19.63
4054,19.68
4055,19.87
4056,20.12
4057,20.39
4058,20.52
4059,20.48
4060,20.16
4061,19.57
4062,18.70
4063,17.67
4064,16.61
4065,15.71
4066,15.06
4067,14.73
4068,14.69
4069,14.89
4070,15.21
4071,15.50
4072,15.59
4073,15.50
4074,15.32
4075,15.17
4076,15.17
4077,15.37
4078,15.90
4079,16.73
4080,17.80
4081,18.88
4082,19.87
4083,20.68
4084,21.29
4085,21.66
4086,21.84
4087,21.82
4088,21.74
4089,21.61
4090,21.49
4091,21.39
4092,21.38
4093,21.43
4094,21.55
4095,21.74
4096,21.97
4097,22.22
4098,22.37
4099,22.36
4100,22.13
4101,21.71
4102,21.10
4103,20.38
4104,19.62
4105,18.90
4106,18.25
4107,17.72
4108,17.31
4109,17.01
4110,16.76
4111,16.57
4112,16.40
4113,16.29
4114,16.17
4115,16.03
4116,15.85
4117,15.64
4118,15.39
4119,15.09
4120,14.78
4121,14.50
4122,14.32
4123,14.32
4124,14.53
4125,14.92
4126,15.41
4127,15.90
4128,16.34
4129,16.70
4130,16.94
4131,17.08
4132,17.20
4133,17.33
4134,17.55
4135,17.85
4136,18.23
4137,18.59
4138,18.86
4139,18.98
4140,18.97
4141,18.88
4142,18.72
4143,18.54
4144,18.37
4145,18.28
4146,18.28
4147,18.36
4148,18.41
4149,18.43
4150,18.35
4151,18.21
4152,17.95
4153,17.67
4154,17.33
4155,16.99
4156,16.53
4157,15.96
4158,15.18
4159,14.28
4160,13.18
4161,12.01
4162,10.74
4163,9.60
4164,8.52
4165,7.66
4166,6.87
4167,6.23
4168,5.53
4169,4.79
4170,3.84
4171,2.80
4172,1.57
4173,0.34
4174,-0.96
4175,-2.08
4176,-3.11
4177,-3.87
4178,-4.59
4179,-5.23
4180,-5.99
4181,-6.86
4182,-8.01
4183,-9.32
4184,-10.81
4185,-12.24
4186,-13.60
4187,-14.68
4188,-15.51
4189,-16.02
4190,-16.39
4191,-16.65
4192,-16.95
4193,-17.24
4194,-17.56
4195,-17.83
4196,-18.02
4197,-18.05
4198,-17.88
4199,-17.56
4200,-17.11
4201,-16.60
4202,-16.02
4203,-15.43
4204,-14.86
4205,-14.37
4206,-13.86
4207,-13.34
4208,-12.73
4209,-12.12
4210,-11.47
4211,-10.88
4212,-10.35
4213,-9.97
4214,-9.71
4215,-9.58
4216,-9.49
4217,-9.45
4218,-9.36
4219,-9.26
4220,-9.08
4221,-8.85
4222,-8.54
4223,-8.22
4224,-7.89
4225,-7.61
4226,-7.30
4227,-6.99
4228,-6.60
4229,-6.16
4230,-5.63
4231,-5.04
4232,-4.36
4233,-3.69
4234,-3.03
4235,-2.48
4236,-1.96
4237,-1.54
4238,-1.11
4239,-0.72
4240,-0.21
4241,0.36
4242,1.07
4243,1.84
4244,2.70
4245,3.52
4246,4.28
4247,4.87
4248,5.35
4249,5.69
4250,5.94
4251,6.06
4252,6.10
4253,6.11
4254,6.18
4255,6.30
4256,6.44
4257,6.54
4258,6.55
4259,6.43
4260,6.14
4261,5.68
4262,5.00
4263,4.23
4264,3.39
4265,2.63
4266,1.92
4267,1.36
4268,0.79
4269,0.23
4270,-0.51
4271,-1.37
4272,-2.48
4273,-3.68
4274,-5.04
4275,-6.36
4276,-7.69
4277,-8.87
4278,-9.93
4279,-10.77
4280,-11.49
4281,-12.07
4282,-12.62
4283,-13.04
4284,-13.37
4285,-13.54
4286,-13.63
4287,-13.63
4288,-13.64
4289,-13.66
4290,-13.79
4291,-14.05
4292,-14.46
4293,-14.92
4294,-15.34
4295,-15.63
4296,-15.67
4297,-15.47
4298,-14.98
4299,-14.31
4300,-13.44
4301,-12.50
4302,-11.45
4303,-10.37
4304,-9.16
4305,-7.87
4306,-6.41
4307,-4.90
4308,-3.34
4309,-1.91
4310,-0.62
4311,0.37
4312,1.10
4313,1.48
4314,1.71
4315,1.82
4316,2.01
4317,2.26
4318,2.64
4319,3.04
4320,3.49
4321,3.88
4322,4.17
4323,4.31
4324,4.35
4325,4.33
4326,4.37
4327,4.54
4328,4.90
4329,5.40
4330,6.03
4331,6.62
4332,7.12
4333,7.40
4334,7.52
4335,7.48
4336,7.39
4337,7.26
4338,7.25
4339,7.41
4340,7.90
4341,8.67
4342,9.67
4343,10.79
4344,11.96
4345,13.06
4346,14.02
4347,14.74
4348,15.24
4349,15.53
4350,15.64
4351,15.58
4352,15.37
4353,15.03
4354,14.61
4355,14.16
4356,13.71
4357,13.31
4358,12.89
4359,12.53
4360,12.13
4361,11.73
4362,11.20
4363,10.57
4364,9.77
4365,8.87
4366,7.76
4367,6.58
4368,5.33
4369,4.17
4370,3.11
4371,2.20
4372,1.35
4373,0.56
4374,-0.24
4375,-1.01
4376,-1.77
4377,-2.45
4378,-3.06
4379,-3.46
4380,-3.63
4381,-3.48
4382,-3.07
4383,-2.44
4384,-1.72
4385,-1.06
4386,-0.60
4387,-0.41
4388,-0.46
4389,-0.72
4390,-1.15
4391,-1.63
4392,-1.99
4393,-2.16
4394,-2.15
4395,-2.02
4396,-1.75
4397,-1.40
4398,-1.02
4399,-0.72
4400,-0.50
4401,-0.37
4402,-0.27
4403,-0.19
4404,-0.05
4405,0.14
4406,0.43
4407,0.81
4408,1.33
4409,1.88
4410,2.47
4411,2.96
4412,3.43
4413,3.84
4414,4.38
4415,5.00
4416,5.84
4417,6.87
4418,8.17
4419,9.58
4420,11.09
4421,12.45
4422,13.69
4423,14.70
4424,15.60
4425,16.36
4426,17.13
4427,17.90
4428,18.79
4429,19.74
4430,20.76
4431,21.62
4432,22.22
4433,22.42
4434,22.28
4435,21.84
4436,21.25
4437,20.64
4438,20.14
4439,19.84
4440,19.73
4441,19.72
4442,19.66
4443,19.47
4444,19.05
4445,18.39
4446,17.48
4447,16.43
4448,15.36
4449,14.43
4450,13.70
4451,13.21
4452,12.88
4453,12.70
4454,12.53
4455,12.34
4456,12.01
4457,11.58
4458,11.01
4459,10.43
4460,9.81
4461,9.26
4462,8.71
4463,8.26
4464,7.82
4465,7.46
4466,7.04
4467,6.59
4468,6.00
4469,5.36
4470,4.62
4471,3.86
4472,3.02
4473,2.20
4474,1.37
4475,0.62
4476,-0.14
4477,-0.81
4478,-1.45
4479,-1.96
4480,-2.45
4481,-2.88
4482,-3.34
4483,-3.79
4484,-4.33
4485,-4.94
4486,-5.70
4487,-6.49
4488,-7.30
4489,-8.01
4490,-8.68
4491,-9.22
4492,-9.68
4493,-9.99
4494,-10.25
4495,-10.45
4496,-10.65
4497,-10.86
4498,-11.11
4499,-11.40
4500,-11.73
4501,-12.07
4502,-12.38
4503,-12.66
4504,-12.83
4505,-12.84
4506,-12.63
4507,-12.21
4508,-11.56
4509,-10.73
4510,-9.76
4511,-8.75
4512,-7.70
4513,-6.75
4514,-5.94
4515,-5.36
4516,-4.94
4517,-4.71
4518,-4.49
4519,-4.28
4520,-3.91
4521,-3.43
4522,-2.75
4523,-2.00
4524,-1.10
4525,-0.22
4526,0.63
4527,1.33
4528,1.98
4529,2.59
4530,3.24
4531,3.88
4532,4.58
4533,5.31
4534,6.16
4535,7.04
4536,7.93
4537,8.75
4538,9.47
4539,10.03
4540,10.39
4541,10.48
4542,10.30
4543,9.85
4544,9.16
4545,8.28
4546,7.33
4547,6.46
4548,5.73
4549,5.23
4550,4.93
4551,4.87
4552,4.90
4553,4.93
4554,4.76
4555,4.39
4556,3.78
4557,3.03
4558,2.16
4559,1.30
4560,0.49
4561,-0.19
4562,-0.76
4563,-1.16
4564,-1.44
4565,-1.60
4566,-1.76
4567,-1.89
4568,-2.04
4569,-2.18
4570,-2.38
4571,-2.59
4572,-2.88
4573,-3.17
4574,-3.53
4575,-3.87
4576,-4.21
4577,-4.53
4578,-4.91
4579,-5.33
4580,-5.87
4581,-6.47
4582,-7.14
4583,-7.82
4584,-8.47
4585,-9.00
4586,-9.44
4587,-9.74
4588,-9.86
4589,-9.81
4590,-9.59
4591,-9.26
4592,-8.85
4593,-8.40
4594,-7.92
4595,-7.48
4596,-7.09
4597,-6.77
4598,-6.47
4599,-6.23
4600,-5.94
4601,-5.61
4602,-5.06
4603,-4.30
4604,-3.29
4605,-2.17
4606,-0.94
4607,0.28
4608,1.47
4609,2.47
4610,3.29
4611,3.87
4612,4.32
4613,4.62
4614,4.86
4615,5.00
4616,5.13
4617,5.21
4618,5.26
4619,5.26
4620,5.21
4621,5.13
4622,4.98
4623,4.79
4624,4.47
4625,4.07
4626,3.55
4627,2.95
4628,2.24
4629,1.49
4630,0.67
4631,-0.13
4632,-0.98
4633,-1.79
4634,-2.60
4635,-3.33
4636,-4.07
4637,-4.74
4638,-5.37
4639,-5.88
4640,-6.41
4641,-6.89
4642,-7.40
4643,-7.81
4644,-8.27
4645,-8.71
4646,-9.29
4647,-9.91
4648,-10.70
4649,-11.52
4650,-12.56
4651,-13.68
4652,-15.02
4653,-16.43
4654,-18.01
4655,-19.58
4656,-21.23
4657,-22.76
4658,-24.28
4659,-25.63
4660,-26.97
4661,-28.16
4662,-29.37
4663,-30.50
4664,-31.65
4665,-32.67
4666,-33.64
4667,-34.39
4668,-34.99
4669,-35.35
4670,-35.62
4671,-35.78
4672,-35.90
4673,-36.01
4674,-36.20
4675,-36.44
4676,-36.66
4677,-36.73
4678,-36.55
4679,-36.10
4680,-35.42
4681,-34.60
4682,-33.75
4683,-33.04
4684,-32.50
4685,-32.20
4686,-32.00
4687,-31.88
4688,-31.68
4689,-31.41
4690,-30.94
4691,-30.33
4692,-29.53
4693,-28.70
4694,-27.89
4695,-27.23
4696,-26.61
4697,-26.05
4698,-25.37
4699,-24.62
4700,-23.70
4701,-22.71
4702,-21.58
4703,-20.49
4704,-19.42
4705,-18.55
4706,-17.77
4707,-17.10
4708,-16.34
4709,-15.54
4710,-14.55
4711,-13.53
4712,-12.42
4713,-11.41
4714,-10.39
4715,-9.54
4716,-8.71
4717,-8.00
4718,-7.23
4719,-6.47
4720,-5.54
4721,-4.55
4722,-3.40
4723,-2.20
4724,-0.90
4725,0.33
4726,1.55
4727,2.62
4728,3.67
4729,4.62
4730,5.62
4731,6.55
4732,7.48
4733,8.34
4734,9.17
4735,9.87
4736,10.45
4737,10.80
4738,10.96
4739,10.93
4740,10.73
4741,10.39
4742,9.99
4743,9.60
4744,9.24
4745,8.93
4746,8.55
4747,8.13
4748,7.56
4749,6.89
4750,6.03
4751,5.07
4752,3.96
4753,2.86
4754,1.79
4755,0.87
4756,0.11
4757,-0.43
4758,-0.88
4759,-1.18
4760,-1.45
4761,-1.67
4762,-1.95
4763,-2.26
4764,-2.66
4765,-3.04
4766,-3.41
4767,-3.68
4768,-3.83
4769,-3.86
4770,-3.78
4771,-3.66
4772,-3.52
4773,-3.42
4774,-3.30
4775,-3.20
4776,-3.02
4777,-2.78
4778,-2.35
4779,-1.78
4780,-0.95
4781,0.02
4782,1.17
4783,2.35
4784,3.58
4785,4.75
4786,5.97
4787,7.16
4788,8.41
4789,9.61
4790,10.85
4791,12.02
4792,13.18
4793,14.15
4794,14.95
4795,15.46
4796,15.79
4797,15.95
4798,16.07
4799,16.17
4800,16.33
4801,16.46
4802,16.60
4803,16.68
4804,16.74
4805,16.72
4806,16.67
4807,16.60
4808,16.60
4809,16.67
4810,16.86
4811,17.13
4812,17.51
4813,17.94
4814,18.44
4815,18.94
4816,19.49
4817,20.07
4818,20.73
4819,21.41
4820,22.14
4821,22.85
4822,23.54
4823,24.13
4824,24.64
4825,25.05
4826,25.40
4827,25.69
4828,25.96
4829,26.20
4830,26.38
4831,26.46
4832,26.38
4833,26.14
4834,25.73
4835,25.19
4836,24.55
4837,23.90
4838,23.26
4839,22.74
4840,22.27
4841,21.88
4842,21.45
4843,21.00
4844,20.41
4845,19.74
4846,18.90
4847,18.00
4848,16.99
4849,16.00
4850,14.93
4851,13.88
4852,12.77
4853,11.73
4854,10.64
4855,9.62
4856,8.58
4857,7.68
4858,6.89
4859,6.35
4860,5.90
4861,5.58
4862,5.24
4863,4.91
4864,4.43
4865,3.82
4866,3.03
4867,2.20
4868,1.37
4869,0.69
4870,0.16
4871,-0.12
4872,-0.22
4873,-0.14
4874,0.01
4875,0.16
4876,0.26
4877,0.35
4878,0.47
4879,0.69
4880,0.95
4881,1.23
4882,1.47
4883,1.62
4884,1.66
4885,1.56
4886,1.37
4887,1.14
4888,1.01
4889,1.04
4890,1.38
4891,1.96
4892,2.79
4893,3.71
4894,4.72
4895,5.68
4896,6.65
4897,7.57
4898,8.62
4899,9.75
4900,11.08
4901,12.46
4902,13.95
4903,15.34
4904,16.62
4905,17.61
4906,18.40
4907,18.99
4908,19.58
4909,20.18
4910,20.91
4911,21.64
4912,22.37
4913,22.96
4914,23.43
4915,23.69
4916,23.76
4917,23.66
4918,23.49
4919,23.38
4920,23.30
4921,23.22
4922,23.03
4923,22.66
4924,22.05
4925,21.22
4926,20.15
4927,18.99
4928,17.82
4929,16.85
4930,16.04
4931,15.50
4932,15.11
4933,14.88
4934,14.62
4935,14.33
4936,13.84
4937,13.24
4938,12.43
4939,11.55
4940,10.57
4941,9.68
4942,8.77
4943,7.94
4944,7.03
4945,6.10
4946,5.07
4947,4.03
4948,2.84
4949,1.64
4950,0.37
4951,-0.80
4952,-1.93
4953,-2.88
4954,-3.80
4955,-4.57
4956,-5.32
4957,-5.94
4958,-6.59
4959,-7.20
4960,-7.84
4961,-8.38
4962,-8.90
4963,-9.35
4964,-9.86
4965,-10.38
4966,-10.95
4967,-11.45
4968,-11.91
4969,-12.23
4970,-12.39
4971,-12.35
4972,-12.15
4973,-11.85
4974,-11.49
4975,-11.12
4976,-10.81
4977,-10.61
4978,-10.50
4979,-10.49
4980,-10.47
4981,-10.42
4982,-10.27
4983,-10.06
4984,-9.70
4985,-9.22
4986,-8.49
4987,-7.58
4988,-6.45
4989,-5.27
4990,-4.04
4991,-2.87
4992,-1.80
4993,-0.98
4994,-0.40
4995,-0.16
4996,-0.11
4997,-0.16
4998,-0.17
4999,-0.08
5000,0.13
5001,0.43
5002,0.77
5003,1.01
5004,1.08
5005,0.89
5006,0.48
5007,-0.10
5008,-0.76
5009,-1.43
5010,-1.99
5011,-2.39
5012,-2.58
5013,-2.57
5014,-2.41
5015,-2.13
5016,-1.82
5017,-1.46
5018,-1.16
5019,-0.91
5020,-0.82
5021,-0.89
5022,-1.18
5023,-1.69
5024,-2.42
5025,-3.25
5026,-4.11
5027,-4.87
5028,-5.46
5029,-5.87
5030,-6.13
5031,-6.27
5032,-6.36
5033,-6.48
5034,-6.67
5035,-6.90
5036,-7.16
5037,-7.31
5038,-7.32
5039,-7.17
5040,-6.87
5041,-6.51
5042,-6.16
5043,-5.91
5044,-5.81
5045,-5.81
5046,-5.87
5047,-5.94
5048,-5.99
5049,-6.00
5050,-5.87
5051,-5.62
5052,-5.23
5053,-4.82
5054,-4.35
5055,-3.85
5056,-3.31
5057,-2.78
5058,-2.24
5059,-1.75
5060,-1.27
5061,-0.88
5062,-0.44
5063,-0.02
5064,0.48
5065,0.96
5066,1.53
5067,2.11
5068,2.77
5069,3.46
5070,4.27
5071,5.14
5072,6.16
5073,7.19
5074,8.29
5075,9.30
5076,10.29
5077,11.14
5078,11.92
5079,12.55
5080,13.12
5081,13.60
5082,14.14
5083,14.68
5084,15.29
5085,15.84
5086,16.38
5087,16.85
5088,17.28
5089,17.59
5090,17.84
5091,18.00
5092,18.21
5093,18.49
5094,18.88
5095,19.33
5096,19.84
5097,20.35
5098,20.77
5099,21.05
5100,21.17
5101,21.09
5102,20.85
5103,20.51
5104,20.22
5105,20.03
5106,19.96
5107,19.99
5108,20.13
5109,20.33
5110,20.58
5111,20.79
5112,20.95
5113,21.06
5114,21.16
5115,21.20
5116,21.25
5117,21.30
5118,21.43
5119,21.63
5120,21.91
5121,22.26
5122,22.75
5123,23.34
5124,24.00
5125,24.67
5126,25.33
5127,25.98
5128,26.60
5129,27.15
5130,27.57
5131,27.81
5132,27.85
5133,27.64
5134,27.18
5135,26.53
5136,25.71
5137,24.87
5138,24.06
5139,23.39
5140,22.80
5141,22.32
5142,21.82
5143,21.30
5144,20.66
5145,19.97
5146,19.16
5147,18.36
5148,17.56
5149,16.88
5150,16.32
5151,15.90
5152,15.47
5153,15.01
5154,14.46
5155,13.86
5156,13.23
5157,12.67
5158,12.21
5159,11.92
5160,11.76
5161,11.68
5162,11.63
5163,11.58
5164,11.47
5165,11.33
5166,11.15
5167,11.00
5168,10.90
5169,10.91
5170,10.99
5171,11.12
5172,11.23
5173,11.30
5174,11.29
5175,11.20
5176,11.02
5177,10.81
5178,10.60
5179,10.45
5180,10.37
5181,10.34
5182,10.35
5183,10.38
5184,10.43
5185,10.52
5186,10.66
5187,10.86
5188,11.17
5189,11.55
5190,12.02
5191,12.50
5192,12.96
5193,13.35
5194,13.63
5195,13.75
5196,13.72
5197,13.53
5198,13.24
5199,12.90
5200,12.57
5201,12.30
5202,12.11
5203,12.02
5204,12.02
5205,12.05
5206,12.07
5207,12.05
5208,11.96
5209,11.82
5210,11.62
5211,11.41
5212,11.18
5213,10.99
5214,10.80
5215,10.61
5216,10.31
5217,9.90
5218,9.35
5219,8.75
5220,8.00
5221,7.19
5222,6.21
5223,5.23
5224,4.17
5225,3.17
5226,2.01
5227,0.79
5228,-0.57
5229,-1.93
5230,-3.34
5231,-4.65
5232,-5.92
5233,-6.97
5234,-7.91
5235,-8.66
5236,-9.33
5237,-9.86
5238,-10.41
5239,-10.93
5240,-11.50
5241,-12.01
5242,-12.49
5243,-12.87
5244,-13.23
5245,-13.48
5246,-13.62
5247,-13.58
5248,-13.45
5249,-13.30
5250,-13.16
5251,-13.04
5252,-12.96
5253,-13.00
5254,-13.15
5255,-13.41
5256,-13.63
5257,-13.76
5258,-13.63
5259,-13.23
5260,-12.43
5261,-11.31
5262,-9.89
5263,-8.36
5264,-6.77
5265,-5.30
5266,-3.94
5267,-2.79
5268,-1.76
5269,-0.90
5270,-0.08
5271,0.61
5272,1.27
5273,1.85
5274,2.44
5275,2.89
5276,3.25
5277,3.48
5278,3.71
5279,3.91
5280,4.15
5281,4.39
5282,4.69
5283,5.00
5284,5.30
5285,5.49
5286,5.58
5287,5.56
5288,5.46
5289,5.27
5290,5.08
5291,4.95
5292,4.94
5293,5.03
5294,5.21
5295,5.42
5296,5.62
5297,5.78
5298,5.88
5299,5.94
5300,5.94
5301,5.88
5302,5.78
5303,5.67
5304,5.52
5305,5.32
5306,5.00
5307,4.63
5308,4.17
5309,3.64
5310,2.98
5311,2.25
5312,1.43
5313,0.61
5314,-0.27
5315,-1.11
5316,-1.95
5317,-2.62
5318,-3.17
5319,-3.52
5320,-3.84
5321,-4.12
5322,-4.64
5323,-5.37
5324,-6.48
5325,-7.87
5326,-9.61
5327,-11.51
5328,-13.47
5329,-15.19
5330,-16.67
5331,-17.74
5332,-18.52
5333,-19.03
5334,-19.45
5335,-19.81
5336,-20.24
5337,-20.70
5338,-21.28
5339,-21.86
5340,-22.44
5341,-22.90
5342,-23.29
5343,-23.58
5344,-23.80
5345,-23.93
5346,-23.94
5347,-23.86
5348,-23.64
5349,-23.32
5350,-22.87
5351,-22.35
5352,-21.71
5353,-21.06
5354,-20.40
5355,-19.83
5356,-19.23
5357,-18.67
5358,-18.00
5359,-17.29
5360,-16.40
5361,-15.45
5362,-14.32
5363,-13.19
5364,-11.96
5365,-10.81
5366,-9.59
5367,-8.45
5368,-7.16
5369,-5.89
5370,-4.39
5371,-2.87
5372,-1.06
5373,0.81
5374,3.00
5375,5.26
5376,7.87
5377,10.61
5378,13.70
5379,16.79
5380,19.94
5381,22.77
5382,25.38
5383,27.45
5384,29.11
5385,30.15
5386,30.89
5387,31.33
5388,31.80
5389,32.24
5390,32.81
5391,33.33
5392,33.79
5393,34.00
5394,33.92
5395,33.49
5396,32.76
5397,31.83
5398,30.78
5399,29.80
5400,28.92
5401,28.22
5402,27.62
5403,27.08
5404,26.42
5405,25.60
5406,24.54
5407,23.36
5408,22.06
5409,20.88
5410,19.84
5411,19.08
5412,18.56
5413,18.33
5414,18.21
5415,18.18
5416,18.06
5417,17.88
5418,17.56
5419,17.15
5420,16.62
5421,16.10
5422,15.59
5423,15.19
5424,14.81
5425,14.44
5426,13.99
5427,13.50
5428,12.91
5429,12.27
5430,11.51
5431,10.76
5432,9.96
5433,9.26
5434,8.61
5435,8.09
5436,7.62
5437,7.23
5438,6.80
5439,6.42
5440,5.96
5441,5.46
5442,4.83
5443,4.14
5444,3.35
5445,2.59
5446,1.79
5447,1.01
5448,0.30
5449,-0.30
5450,-0.78
5451,-1.14
5452,-1.39
5453,-1.51
5454,-1.48
5455,-1.34
5456,-1.10
5457,-0.76
5458,-0.18
5459,0.56
5460,1.53
5461,2.57
5462,3.84
5463,5.16
5464,6.68
5465,8.22
5466,9.96
5467,11.70
5468,13.62
5469,15.50
5470,17.59
5471,19.67
5472,21.98
5473,24.22
5474,26.57
5475,28.76
5476,30.97
5477,32.94
5478,34.85
5479,36.43
5480,37.93
5481,39.22
5482,40.53
5483,41.67
5484,42.83
5485,43.87
5486,44.96
5487,45.97
5488,46.98
5489,47.83
5490,48.59
5491,49.18
5492,49.61
5493,49.84
5494,49.93
5495,49.92
5496,49.86
5497,49.78
5498,49.62
5499,49.39
5500,48.91
5501,48.19
5502,47.08
5503,45.65
5504,43.80
5505,41.75
5506,39.53
5507,37.43
5508,35.47
5509,33.86
5510,32.48
5511,31.41
5512,30.47
5513,29.72
5514,28.92
5515,28.15
5516,27.25
5517,26.42
5518,25.61
5519,25.02
5520,24.48
5521,24.12
5522,23.76
5523,23.46
5524,23.03
5525,22.49
5526,21.77
5527,21.00
5528,20.14
5529,19.30
5530,18.42
5531,17.60
5532,16.79
5533,16.10
5534,15.44
5535,14.86
5536,14.28
5537,13.79
5538,13.36
5539,13.05
5540,12.74
5541,12.44
5542,12.05
5543,11.58
5544,10.99
5545,10.34
5546,9.64
5547,8.99
5548,8.35
5549,7.82
5550,7.43
5551,7.23
5552,7.17
5553,7.26
5554,7.48
5555,7.81
5556,8.22
5557,8.64
5558,9.06
5559,9.46
5560,9.90
5561,10.36
5562,10.93
5563,11.57
5564,12.34
5565,13.17
5566,14.06
5567,14.88
5568,15.68
5569,16.40
5570,17.14
5571,17.77
5572,18.37
5573,18.92
5574,19.54
5575,20.18
5576,20.86
5577,21.48
5578,22.09
5579,22.64
5580,23.17
5581,23.57
5582,23.87
5583,24.05
5584,24.15
5585,24.15
5586,24.01
5587,23.74
5588,23.40
5589,23.06
5590,22.76
5591,22.49
5592,22.25
5593,22.09
5594,21.96
5595,21.85
5596,21.66
5597,21.38
5598,20.97
5599,20.56
5600,20.13
5601,19.75
5602,19.41
5603,19.19
5604,19.02
5605,18.94
5606,18.78
5607,18.51
5608,17.99
5609,17.33
5610,16.43
5611,15.42
5612,14.17
5613,12.82
5614,11.32
5615,9.86
5616,8.35
5617,6.94
5618,5.55
5619,4.39
5620,3.36
5621,2.56
5622,1.81
5623,1.19
5624,0.58
5625,0.01
5626,-0.69
5627,-1.45
5628,-2.25
5629,-2.90
5630,-3.41
5631,-3.72
5632,-3.90
5633,-3.92
5634,-3.85
5635,-3.72
5636,-3.59
5637,-3.51
5638,-3.42
5639,-3.28
5640,-3.03
5641,-2.68
5642,-2.20
5643,-1.65
5644,-0.98
5645,-0.27
5646,0.49
5647,1.19
5648,1.86
5649,2.43
5650,3.01
5651,3.53
5652,4.05
5653,4.48
5654,4.91
5655,5.30
5656,5.78
5657,6.26
5658,6.84
5659,7.48
5660,8.26
5661,9.08
5662,9.94
5663,10.73
5664,11.52
5665,12.21
5666,12.83
5667,13.30
5668,13.70
5669,13.99
5670,14.30
5671,14.57
5672,14.95
5673,15.40
5674,16.01
5675,16.68
5676,17.47
5677,18.26
5678,19.07
5679,19.77
5680,20.42
5681,20.97
5682,21.48
5683,21.90
5684,22.35
5685,22.81
5686,23.38
5687,23.96
5688,24.59
5689,25.14
5690,25.66
5691,26.08
5692,26.51
5693,26.92
5694,27.34
5695,27.69
5696,28.01
5697,28.28
5698,28.50
5699,28.65
5700,28.70
5701,28.71
5702,28.66
5703,28.59
5704,28.41
5705,28.11
5706,27.57
5707,26.87
5708,25.93
5709,24.85
5710,23.57
5711,22.20
5712,20.74
5713,19.39
5714,18.14
5715,17.14
5716,16.29
5717,15.64
5718,15.06
5719,14.62
5720,14.14
5721,13.66
5722,13.07
5723,12.43
5724,11.68
5725,10.99
5726,10.32
5727,9.80
5728,9.32
5729,8.90
5730,8.45
5731,8.00
5732,7.53
5733,7.03
5734,6.46
5735,5.90
5736,5.40
5737,5.09
5738,5.03
5739,5.23
5740,5.73
5741,6.45
5742,7.33
5743,8.26
5744,9.18
5745,9.98
5746,10.67
5747,11.22
5748,11.74
5749,12.29
5750,12.95
5751,13.63
5752,14.31
5753,14.85
5754,15.21
5755,15.29
5756,15.11
5757,14.70
5758,14.21
5759,13.71
5760,13.32
5761,13.11
5762,13.10
5763,13.23
5764,13.38
5765,13.44
5766,13.41
5767,13.31
5768,13.19
5769,13.12
5770,13.18
5771,13.37
5772,13.76
5773,14.26
5774,14.89
5775,15.56
5776,16.18
5777,16.68
5778,17.07
5779,17.39
5780,17.72
5781,18.07
5782,18.48
5783,18.89
5784,19.31
5785,19.70
5786,20.04
5787,20.29
5788,20.36
5789,20.28
5790,20.05
5791,19.71
5792,19.29
5793,18.82
5794,18.30
5795,17.81
5796,17.30
5797,16.77
5798,16.18
5799,15.59
5800,15.00
5801,14.48
5802,13.95
5803,13.50
5804,13.03
5805,12.61
5806,12.12
5807,11.61
5808,11.00
5809,10.37
5810,9.60
5811,8.76
5812,7.76
5813,6.70
5814,5.53
5815,4.41
5816,3.32
5817,2.37
5818,1.54
5819,0.94
5820,0.51
5821,0.29
5822,0.15
5823,0.09
5824,-0.01
5825,-0.11
5826,-0.30
5827,-0.53
5828,-0.79
5829,-1.01
5830,-1.14
5831,-1.19
5832,-1.21
5833,-1.24
5834,-1.31
5835,-1.47
5836,-1.67
5837,-1.90
5838,-2.04
5839,-2.03
5840,-1.72
5841,-1.14
5842,-0.28
5843,0.71
5844,1.79
5845,2.79
5846,3.65
5847,4.20
5848,4.53
5849,4.60
5850,4.62
5851,4.60
5852,4.81
5853,5.19
5854,5.88
5855,6.81
5856,8.14
5857,9.78
5858,11.77
5859,13.85
5860,15.98
5861,17.94
5862,19.72
5863,21.06
5864,22.01
5865,22.45
5866,22.63
5867,22.67
5868,22.85
5869,23.21
5870,23.88
5871,24.77
5872,25.87
5873,26.95
5874,27.84
5875,28.33
5876,28.37
5877,28.04
5878,27.39
5879,26.58
5880,25.67
5881,24.81
5882,24.02
5883,23.35
5884,22.70
5885,21.99
5886,21.16
5887,20.27
5888,19.34
5889,18.51
5890,17.78
5891,17.33
5892,17.12
5893,17.20
5894,17.40
5895,17.65
5896,17.81
5897,17.85
5898,17.63
5899,17.20
5900,16.57
5901,15.88
5902,15.16
5903,14.54
5904,14.04
5905,13.69
5906,13.42
5907,13.17
5908,12.86
5909,12.52
5910,12.07
5911,11.58
5912,11.00
5913,10.48
5914,10.01
5915,9.70
5916,9.46
5917,9.31
5918,9.14
5919,8.94
5920,8.60
5921,8.10
5922,7.43
5923,6.66
5924,5.78
5925,4.90
5926,4.02
5927,3.24
5928,2.59
5929,2.17
5930,2.02
5931,2.15
5932,2.49
5933,2.94
5934,3.46
5935,3.94
5936,4.33
5937,4.56
5938,4.65
5939,4.63
5940,4.63
5941,4.72
5942,5.06
5943,5.63
5944,6.52
5945,7.58
5946,8.81
5947,10.04
5948,11.32
5949,12.52
5950,13.73
5951,14.80
5952,15.88
5953,16.89
5954,17.98
5955,19.06
5956,20.21
5957,21.32
5958,22.48
5959,23.57
5960,24.60
5961,25.45
5962,26.17
5963,26.66
5964,26.95
5965,26.99
5966,26.89
5967,26.69
5968,26.55
5969,26.50
5970,26.60
5971,26.80
5972,27.13
5973,27.53
5974,27.92
5975,28.23
5976,28.40
5977,28.43
5978,28.32
5979,28.12
5980,27.81
5981,27.44
5982,26.95
5983,26.34
5984,25.52
5985,24.54
5986,23.38
5987,22.20
5988,21.00
5989,19.91
5990,18.91
5991,18.09
5992,17.38
5993,16.85
5994,16.33
5995,15.85
5996,15.27
5997,14.73
5998,14.18
5999,13.69
6000,13.17
6001,12.68
6002,12.16
6003,11.70
6004,11.24
6005,10.77
6006,10.25
6007,9.76
6008,9.28
6009,8.87
6010,8.47
6011,8.13
6012,7.84
6013,7.63
6014,7.44
6015,7.31
6016,7.23
6017,7.20
6018,7.13
6019,7.00
6020,6.77
6021,6.45
6022,5.98
6023,5.39
6024,4.69
6025,4.01
6026,3.39
6027,2.92
6028,2.56
6029,2.30
6030,2.09
6031,1.92
6032,1.74
6033,1.53
6034,1.27
6035,0.98
6036,0.63
6037,0.30
6038,0.04
6039,-0.11
6040,-0.13
6041,0.01
6042,0.34
6043,0.85
6044,1.53
6045,2.23
6046,2.95
6047,3.60
6048,4.21
6049,4.73
6050,5.22
6051,5.68
6052,6.23
6053,6.90
6054,7.75
6055,8.67
6056,9.64
6057,10.48
6058,11.25
6059,11.83
6060,12.29
6061,12.60
6062,12.83
6063,13.02
6064,13.29
6065,13.57
6066,13.88
6067,14.11
6068,14.33
6069,14.52
6070,14.76
6071,15.01
6072,15.35
6073,15.79
6074,16.37
6075,16.97
6076,17.49
6077,17.79
6078,17.85
6079,17.63
6080,17.17
6081,16.56
6082,15.93
6083,15.43
6084,15.10
6085,14.99
6086,15.01
6087,15.13
6088,15.21
6089,15.21
6090,14.97
6091,14.51
6092,13.75
6093,12.81
6094,11.68
6095,10.50
6096,9.25
6097,8.08
6098,6.95
6099,5.99
6100,5.09
6101,4.34
6102,3.63
6103,3.01
6104,2.28
6105,1.48
6106,0.49
6107,-0.54
6108,-1.63
6109,-2.63
6110,-3.57
6111,-4.30
6112,-4.84
6113,-5.16
6114,-5.36
6115,-5.49
6116,-5.59
6117,-5.68
6118,-5.79
6119,-5.88
6120,-5.89
6121,-5.78
6122,-5.52
6123,-5.17
6124,-4.70
6125,-4.20
6126,-3.68
6127,-3.19
6128,-2.66
6129,-2.10
6130,-1.47
6131,-0.85
6132,-0.24
6133,0.29
6134,0.77
6135,1.14
6136,1.43
6137,1.59
6138,1.71
6139,1.75
6140,1.82
6141,1.88
6142,2.04
6143,2.26
6144,2.65
6145,3.14
6146,3.76
6147,4.47
6148,5.32
6149,6.23
6150,7.20
6151,8.09
6152,8.88
6153,9.49
6154,9.99
6155,10.35
6156,10.67
6157,10.89
6158,11.12
6159,11.34
6160,11.62
6161,11.92
6162,12.36
6163,12.85
6164,13.42
6165,13.98
6166,14.57
6167,15.12
6168,15.67
6169,16.17
6170,16.68
6171,17.17
6172,17.68
6173,18.16
6174,18.62
6175,19.00
6176,19.27
6177,19.41
6178,19.39
6179,19.20
6180,18.81
6181,18.26
6182,17.55
6183,16.78
6184,15.95
6185,15.12
6186,14.29
6187,13.56
6188,12.87
6189,12.27
6190,11.60
6191,10.88
6192,10.03
6193,9.16
6194,8.17
6195,7.23
6196,6.33
6197,5.57
6198,4.89
6199,4.34
6200,3.87
6201,3.49
6202,3.14
6203,2.88
6204,2.72
6205,2.69
6206,2.76
6207,2.92
6208,3.15
6209,3.48
6210,3.86
6211,4.20
6212,4.40
6213,4.43
6214,4.33
6215,4.09
6216,3.82
6217,3.59
6218,3.58
6219,3.85
6220,4.49
6221,5.42
6222,6.61
6223,7.86
6224,9.08
6225,10.09
6226,10.92
6227,11.49
6228,11.89
6229,12.16
6230,12.52
6231,13.03
6232,13.79
6233,14.65
6234,15.56
6235,16.37
6236,17.03
6237,17.43
6238,17.60
6239,17.52
6240,17.33
6241,17.07
6242,16.83
6243,16.61
6244,16.49
6245,16.39
6246,16.30
6247,16.17
6248,16.08
6249,16.06
6250,16.17
6251,16.41
6252,16.82
6253,17.35
6254,17.98
6255,18.61
6256,19.19
6257,19.63
6258,19.94
6259,20.10
6260,20.23
6261,20.36
6262,20.58
6263,20.91
6264,21.37
6265,21.90
6266,22.48
6267,23.03
6268,23.48
6269,23.80
6270,23.89
6271,23.74
6272,23.35
6273,22.79
6274,22.08
6275,21.28
6276,20.35
6277,19.39
6278,18.49
6279,17.75
6280,17.12
6281,16.62
6282,16.11
6283,15.67
6284,15.11
6285,14.50
6286,13.66
6287,12.70
6288,11.54
6289,10.39
6290,9.25
6291,8.29
6292,7.41
6293,6.66
6294,5.94
6295,5.27
6296,4.55
6297,3.85
6298,3.14
6299,2.52
6300,1.98
6301,1.60
6302,1.37
6303,1.28
6304,1.30
6305,1.40
6306,1.54
6307,1.72
6308,1.93
6309,2.24
6310,2.63
6311,3.10
6312,3.52
6313,3.86
6314,4.06
6315,4.08
6316,3.94
6317,3.62
6318,3.23
6319,2.83
6320,2.53
6321,2.33
6322,2.28
6323,2.33
6324,2.53
6325,2.78
6326,3.12
6327,3.49
6328,4.03
6329,4.71
6330,5.62
6331,6.62
6332,7.76
6333,8.90
6334,10.09
6335,11.14
6336,12.12
6337,12.95
6338,13.82
6339,14.73
6340,15.87
6341,17.13
6342,18.59
6343,20.04
6344,21.47
6345,22.64
6346,23.59
6347,24.26
6348,24.77
6349,25.18
6350,25.56
6351,25.95
6352,26.34
6353,26.66
6354,26.74
6355,26.47
6356,25.71
6357,24.56
6358,23.00
6359,21.25
6360,19.35
6361,17.58
6362,15.91
6363,14.53
6364,13.21
6365,12.05
6366,10.80
6367,9.55
6368,8.13
6369,6.74
6370,5.30
6371,4.03
6372,2.74
6373,1.59
6374,0.43
6375,-0.63
6376,-1.79
6377,-2.98
6378,-4.33
6379,-5.65
6380,-6.97
6381,-8.13
6382,-9.25
6383,-10.17
6384,-10.97
6385,-11.52
6386,-12.05
6387,-12.54
6388,-13.20
6389,-13.89
6390,-14.71
6391,-15.58
6392,-16.62
6393,-17.70
6394,-18.82
6395,-19.83
6396,-20.78
6397,-21.60
6398,-22.31
6399,-22.83
6400,-23.23
6401,-23.49
6402,-23.64
6403,-23.64
6404,-23.53
6405,-23.34
6406,-23.14
6407,-22.96
6408,-22.78
6409,-22.65
6410,-22.53
6411,-22.42
6412,-22.22
6413,-21.96
6414,-21.53
6415,-21.01
6416,-20.29
6417,-19.49
6418,-18.55
6419,-17.62
6420,-16.56
6421,-15.50
6422,-14.30
6423,-13.11
6424,-11.78
6425,-10.48
6426,-9.08
6427,-7.71
6428,-6.22
6429,-4.74
6430,-3.14
6431,-1.63
6432,-0.05
6433,1.40
6434,2.86
6435,4.14
6436,5.36
6437,6.36
6438,7.31
6439,8.13
6440,9.03
6441,9.88
6442,10.83
6443,11.72
6444,12.68
6445,13.54
6446,14.39
6447,15.08
6448,15.73
6449,16.26
6450,16.80
6451,17.35
6452,18.05
6453,18.84
6454,19.72
6455,20.55
6456,21.32
6457,21.96
6458,22.40
6459,22.58
6460,22.47
6461,22.11
6462,21.56
6463,20.86
6464,20.03
6465,19.14
6466,18.23
6467,17.40
6468,16.64
6469,16.01
6470,15.55
6471,15.29
6472,15.17
6473,15.19
6474,15.24
6475,15.31
6476,15.34
6477,15.35
6478,15.31
6479,15.27
6480,15.30
6481,15.45
6482,15.73
6483,16.09
6484,16.49
6485,16.85
6486,17.17
6487,17.40
6488,17.55
6489,17.60
6490,17.62
6491,17.66
6492,17.81
6493,18.08
6494,18.49
6495,18.97
6496,19.44
6497,19.84
6498,20.11
6499,20.20
6500,20.07
6501,19.72
6502,19.28
6503,18.81
6504,18.44
6505,18.21
6506,18.23
6507,18.49
6508,19.01
6509,19.66
6510,20.42
6511,21.19
6512,21.98
6513,22.70
6514,23.41
6515,24.05
6516,24.73
6517,25.38
6518,26.11
6519,26.79
6520,27.60
6521,28.45
6522,29.52
6523,30.64
6524,31.97
6525,33.36
6526,34.97
6527,36.61
6528,38.35
6529,39.92
6530,41.45
6531,42.78
6532,44.09
6533,45.28
6534,46.49
6535,47.62
6536,48.80
6537,49.91
6538,51.04
6539,52.00
6540,52.81
6541,53.37
6542,53.76
6543,53.94
6544,53.99
6545,53.89
6546,53.73
6547,53.55
6548,53.34
6549,53.08
6550,52.76
6551,52.38
6552,51.87
6553,51.29
6554,50.60
6555,49.90
6556,49.11
6557,48.30
6558,47.38
6559,46.46
6560,45.44
6561,44.46
6562,43.37
6563,42.27
6564,41.04
6565,39.86
6566,38.58
6567,37.38
6568,36.06
6569,34.80
6570,33.39
6571,31.98
6572,30.34
6573,28.61
6574,26.57
6575,24.46
6576,22.16
6577,19.98
6578,17.76
6579,15.79
6580,13.87
6581,12.26
6582,10.70
6583,9.33
6584,7.88
6585,6.47
6586,4.88
6587,3.31
6588,1.67
6589,0.18
6590,-1.27
6591,-2.49
6592,-3.56
6593,-4.33
6594,-4.95
6595,-5.40
6596,-5.81
6597,-6.13
6598,-6.39
6599,-6.53
6600,-6.58
6601,-6.52
6602,-6.33
6603,-6.00
6604,-5.57
6605,-5.09
6606,-4.59
6607,-4.12
6608,-3.65
6609,-3.21
6610,-2.77
6611,-2.37
6612,-1.95
6613,-1.58
6614,-1.20
6615,-0.85
6616,-0.47
6617,-0.11
6618,0.31
6619,0.69
6620,1.21
6621,1.77
6622,2.50
6623,3.35
6624,4.43
6625,5.66
6626,7.08
6627,8.47
6628,9.81
6629,10.93
6630,11.89
6631,12.57
6632,13.08
6633,13.38
6634,13.63
6635,13.78
6636,13.95
6637,14.08
6638,14.25
6639,14.43
6640,14.72
6641,15.02
6642,15.43
6643,15.88
6644,16.49
6645,17.16
6646,17.93
6647,18.69
6648,19.49
6649,20.22
6650,20.94
6651,21.59
6652,22.21
6653,22.73
6654,23.19
6655,23.57
6656,23.94
6657,24.26
6658,24.51
6659,24.67
6660,24.73
6661,24.70
6662,24.52
6663,24.17
6664,23.66
6665,23.06
6666,22.37
6667,21.64
6668,20.86
6669,20.15
6670,19.48
6671,18.90
6672,18.33
6673,17.74
6674,17.07
6675,16.37
6676,15.61
6677,14.89
6678,14.25
6679,13.80
6680,13.60
6681,13.69
6682,14.04
6683,14.56
6684,15.14
6685,15.70
6686,16.15
6687,16.44
6688,16.57
6689,16.57
6690,16.49
6691,16.35
6692,16.21
6693,16.04
6694,15.94
6695,15.82
6696,15.79
6697,15.79
6698,16.00
6699,16.43
6700,17.28
6701,18.48
6702,20.11
6703,22.02
6704,24.15
6705,26.17
6706,27.99
6707,29.40
6708,30.53
6709,31.30
6710,31.97
6711,32.57
6712,33.34
6713,34.23
6714,35.28
6715,36.28
6716,37.16
6717,37.72
6718,37.86
6719,37.52
6720,36.84
6721,35.97
6722,35.09
6723,34.30
6724,33.73
6725,33.41
6726,33.26
6727,33.19
6728,33.08
6729,32.88
6730,32.52
6731,32.04
6732,31.48
6733,30.94
6734,30.46
6735,30.14
6736,30.00
6737,30.07
6738,30.30
6739,30.70
6740,31.21
6741,31.80
6742,32.33
6743,32.74
6744,32.91
6745,32.83
6746,32.45
6747,31.80
6748,30.89
6749,29.87
6750,28.82
6751,27.90
6752,27.11
6753,26.48
6754,25.88
6755,25.33
6756,24.75
6757,24.20
6758,23.61
6759,23.03
6760,22.40
6761,21.85
6762,21.35
6763,21.00
6764,20.64
6765,20.31
6766,19.90
6767,19.47
6768,18.92
6769,18.35
6770,17.69
6771,17.01
6772,16.27
6773,15.50
6774,14.71
6775,13.97
6776,13.25
6777,12.64
6778,12.12
6779,11.73
6780,11.44
6781,11.31
6782,11.30
6783,11.37
6784,11.40
6785,11.34
6786,11.21
6787,11.06
6788,10.93
6789,10.80
6790,10.70
6791,10.70
6792,10.85
6793,11.18
6794,11.66
6795,12.23
6796,12.87
6797,13.52
6798,14.18
6799,14.76
6800,15.30
6801,15.72
6802,16.01
6803,16.11
6804,16.09
6805,15.98
6806,15.90
6807,15.85
6808,15.92
6809,16.11
6810,16.50
6811,17.02
6812,17.70
6813,18.34
6814,18.95
6815,19.42
6816,19.93
6817,20.46
6818,21.19
6819,22.09
6820,23.30
6821,24.70
6822,26.36
6823,28.02
6824,29.66
6825,31.01
6826,32.10
6827,32.84
6828,33.44
6829,33.91
6830,34.44
6831,35.04
6832,35.84
6833,36.74
6834,37.67
6835,38.43
6836,38.89
6837,38.94
6838,38.60
6839,37.96
6840,37.12
6841,36.23
6842,35.33
6843,34.50
6844,33.70
6845,32.95
6846,32.14
6847,31.30
6848,30.32
6849,29.31
6850,28.28
6851,27.40
6852,26.64
6853,26.13
6854,25.79
6855,25.67
6856,25.60
6857,25.58
6858,25.47
6859,25.28
6860,24.88
6861,24.37
6862,23.70
6863,22.99
6864,22.20
6865,21.42
6866,20.60
6867,19.81
6868,18.96
6869,18.12
6870,17.22
6871,16.35
6872,15.38
6873,14.42
6874,13.42
6875,12.51
6876,11.61
6877,10.84
6878,10.12
6879,9.57
6880,9.09
6881,8.77
6882,8.48
6883,8.23
6884,7.91
6885,7.58
6886,7.14
6887,6.65
6888,6.03
6889,5.36
6890,4.64
6891,3.99
6892,3.40
6893,2.93
6894,2.53
6895,2.24
6896,2.03
6897,1.85
6898,1.66
6899,1.47
6900,1.37
6901,1.37
6902,1.56
6903,1.91
6904,2.52
6905,3.27
6906,4.18
6907,5.13
6908,6.17
6909,7.23
6910,8.32
6911,9.38
6912,10.50
6913,11.58
6914,12.69
6915,13.68
6916,14.61
6917,15.37
6918,16.01
6919,16.44
6920,16.72
6921,16.85
6922,16.96
6923,17.06
6924,17.20
6925,17.30
6926,17.43
6927,17.55
6928,17.66
6929,17.75
6930,17.82
6931,17.90
6932,18.03
6933,18.24
6934,18.55
6935,18.94
6936,19.36
6937,19.73
6938,20.00
6939,20.13
6940,20.04
6941,19.78
6942,19.35
6943,18.78
6944,18.07
6945,17.30
6946,16.50
6947,15.76
6948,15.05
6949,14.40
6950,13.82
6951,13.35
6952,12.95
6953,12.65
6954,12.34
6955,12.05
6956,11.73
6957,11.42
6958,11.05
6959,10.70
6960,10.35
6961,10.07
6962,9.80
6963,9.58
6964,9.33
6965,9.08
6966,8.75
6967,8.40
6968,8.00
6969,7.62
6970,7.23
6971,6.86
6972,6.46
6973,6.11
6974,5.81
6975,5.61
6976,5.46
6977,5.36
6978,5.22
6979,5.08
6980,4.91
6981,4.67
6982,4.31
6983,3.86
6984,3.40
6985,2.99
6986,2.71
6987,2.53
6988,2.47
6989,2.52
6990,2.69
6991,2.92
6992,3.23
6993,3.62
6994,4.10
6995,4.65
6996,5.31
6997,6.05
6998,6.94
6999,7.87
7000,8.88
7001,9.84
7002,10.86
7003,11.85
7004,12.89
7005,13.85
7006,14.83
7007,15.72
7008,16.63
7009,17.44
7010,18.26
7011,19.00
7012,19.78
7013,20.53
7014,21.40
7015,22.29
7016,23.28
7017,24.25
7018,25.27
7019,26.21
7020,27.08
7021,27.81
7022,28.48
7023,29.06
7024,29.59
7025,30.01
7026,30.33
7027,30.52
7028,30.64
7029,30.66
7030,30.63
7031,30.53
7032,30.40
7033,30.25
7034,30.11
7035,29.96
7036,29.75
7037,29.45
7038,29.08
7039,28.70
7040,28.29
7041,27.89
7042,27.45
7043,27.04
7044,26.62
7045,26.29
7046,25.97
7047,25.69
7048,25.34
7049,25.00
7050,24.65
7051,24.35
7052,23.94
7053,23.43
7054,22.70
7055,21.84
7056,20.85
7057,19.82
7058,18.71
7059,17.72
7060,16.83
7061,16.23
7062,15.80
7063,15.56
7064,15.35
7065,15.11
7066,14.66
7067,14.02
7068,13.15
7069,12.16
7070,11.13
7071,10.21
7072,9.45
7073,8.94
7074,8.67
7075,8.63
7076,8.74
7077,8.96
7078,9.19
7079,9.39
7080,9.61
7081,9.83
7082,10.12
7083,10.47
7084,10.93
7085,11.46
7086,12.07
7087,12.68
7088,13.35
7089,14.02
7090,14.75
7091,15.42
7092,16.09
7093,16.67
7094,17.23
7095,17.72
7096,18.21
7097,18.67
7098,19.17
7099,19.65
7100,20.22
7101,20.77
7102,21.32
7103,21.76
7104,22.13
7105,22.34
7106,22.48
7107,22.55
7108,22.67
7109,22.83
7110,23.12
7111,23.47
7112,23.92
7113,24.39
7114,24.86
7115,25.25
7116,25.53
7117,25.67
7118,25.71
7119,25.65
7120,25.50
7121,25.25
7122,24.96
7123,24.69
7124,24.47
7125,24.29
7126,24.15
7127,24.06
7128,24.04
7129,24.11
7130,24.19
7131,24.24
7132,24.17
7133,24.06
7134,23.90
7135,23.77
7136,23.58
7137,23.39
7138,23.16
7139,22.96
7140,22.73
7141,22.46
7142,22.02
7143,21.45
7144,20.66
7145,19.82
7146,18.87
7147,17.94
7148,16.92
7149,15.91
7150,14.79
7151,13.63
7152,12.28
7153,10.86
7154,9.22
7155,7.58
7156,5.87
7157,4.33
7158,2.84
7159,1.56
7160,0.32
7161,-0.76
7162,-1.88
7163,-2.91
7164,-4.05
7165,-5.14
7166,-6.28
7167,-7.20
7168,-8.00
7169,-8.53
7170,-8.96
7171,-9.25
7172,-9.57
7173,-9.90
7174,-10.40
7175,-11.08
7176,-11.98
7177,-12.97
7178,-13.91
7179,-14.61
7180,-15.00
7181,-15.02
7182,-14.68
7183,-14.02
7184,-13.12
7185,-12.15
7186,-11.20
7187,-10.37
7188,-9.67
7189,-9.16
7190,-8.64
7191,-8.16
7192,-7.68
7193,-8.38
7194,-7.89
7195,-4.81
7196,-3.36
7197,-9.67
7198,-16.33
7199,-4.84
7200,14.34
