1,-111.61
2,-146.42
3,-119.40
4,-61.05
5,-12.03
6,18.19
7,39.22
8,53.70
9,56.50
10,48.81
11,37.90
12,29.49
13,25.25
14,25.18
15,27.66
16,31.57
17,34.29
18,35.36
19,34.30
20,31.85
21,28.98
22,26.38
23,24.77
24,23.96
25,23.88
26,23.99
27,24.00
28,23.60
29,22.78
30,21.52
31,20.11
32,18.53
33,17.04
34,15.58
35,14.29
36,13.11
37,12.15
38,11.31
39,10.65
40,10.01
41,9.47
42,8.96
43,8.55
44,8.18
45,7.89
46,7.70
47,7.60
48,7.56
49,7.56
50,7.66
51,7.87
52,8.29
53,8.93
54,9.95
55,11.30
56,13.00
57,14.93
58,17.01
59,19.05
60,20.87
61,22.25
62,23.12
63,23.41
64,23.14
65,22.35
66,21.16
67,19.74
68,18.25
69,16.79
70,15.46
71,14.33
72,13.44
73,12.86
74,12.51
75,12.37
76,12.37
77,12.53
78,12.79
79,13.19
80,13.68
81,14.22
82,14.79
83,15.41
84,16.13
85,16.94
86,17.83
87,18.68
88,19.48
89,20.17
90,20.77
91,21.20
92,21.47
93,21.56
94,21.51
95,21.34
96,21.00
97,20.49
98,19.87
99,19.18
100,18.42
101,17.62
102,16.79
103,16.03
104,15.30
105,14.66
106,14.01
107,13.37
108,12.66
109,11.96
110,11.21
111,10.51
112,9.85
113,9.35
114,9.00
115,8.87
116,8.89
117,9.06
118,9.25
119,9.41
120,9.45
121,9.37
122,9.16
123,8.88
124,8.61
125,8.42
126,8.38
127,8.51
128,8.74
129,9.03
130,9.28
131,9.45
132,9.42
133,9.22
134,8.85
135,8.40
136,7.89
137,7.38
138,6.92
139,6.56
140,6.30
141,6.13
142,5.99
143,5.91
144,5.89
145,5.98
146,6.15
147,6.33
148,6.48
149,6.60
150,6.71
151,6.76
152,6.74
153,6.57
154,6.39
155,6.20
156,6.16
157,6.29
158,6.71
159,7.39
160,8.35
161,9.51
162,10.86
163,12.25
164,13.66
165,14.92
166,16.12
167,17.14
168,18.05
169,18.77
170,19.40
171,19.95
172,20.53
173,21.05
174,21.53
175,21.90
176,22.25
177,22.54
178,22.77
179,22.86
180,22.83
181,22.67
182,22.40
183,22.01
184,21.53
185,21.03
186,20.52
187,20.08
188,19.68
189,19.36
190,19.10
191,18.89
192,18.68
193,18.42
194,18.06
195,17.62
196,17.13
197,16.71
198,16.40
199,16.29
200,16.37
201,16.69
202,17.16
203,17.72
204,18.17
205,18.44
206,18.39
207,18.01
208,17.26
209,16.24
210,15.05
211,13.95
212,13.02
213,12.31
214,11.74
215,11.30
216,10.85
217,10.37
218,9.66
219,8.77
220,7.61
221,6.36
222,5.01
223,3.75
224,2.60
225,1.72
226,1.03
227,0.57
228,0.27
229,0.16
230,0.15
231,0.24
232,0.31
233,0.38
234,0.40
235,0.36
236,0.31
237,0.23
238,0.21
239,0.21
240,0.37
241,0.67
242,1.25
243,2.01
244,2.99
245,4.04
246,5.23
247,6.40
248,7.61
249,8.68
250,9.71
251,10.57
252,11.41
253,12.12
254,12.86
255,13.54
256,14.32
257,15.12
258,16.10
259,17.15
260,18.35
261,19.52
262,20.68
263,21.61
264,22.38
265,22.83
266,23.05
267,23.01
268,22.93
269,22.83
270,22.91
271,23.13
272,23.57
273,24.16
274,24.91
275,25.70
276,26.53
277,27.27
278,27.93
279,28.46
280,28.88
281,29.16
282,29.37
283,29.50
284,29.65
285,29.82
286,30.08
287,30.40
288,30.76
289,31.14
290,31.48
291,31.72
292,31.75
293,31.52
294,31.04
295,30.44
296,29.79
297,29.15
298,28.57
299,28.14
300,27.84
301,27.68
302,27.51
303,27.34
304,27.06
305,26.77
306,26.41
307,26.07
308,25.70
309,25.38
310,24.96
311,24.41
312,23.61
313,22.65
314,21.50
315,20.31
316,19.08
317,18.02
318,17.16
319,16.62
320,16.24
321,16.01
322,15.76
323,15.49
324,15.01
325,14.35
326,13.44
327,12.41
328,11.38
329,10.51
330,9.88
331,9.55
332,9.53
333,9.74
334,10.11
335,10.54
336,10.96
337,11.34
338,11.70
339,12.04
340,12.47
341,13.05
342,13.89
343,14.93
344,16.15
345,17.34
346,18.44
347,19.29
348,19.94
349,20.33
350,20.58
351,20.70
352,20.87
353,21.12
354,21.52
355,22.03
356,22.63
357,23.17
358,23.57
359,23.74
360,23.73
361,23.56
362,23.32
363,23.01
364,22.71
365,22.45
366,22.32
367,22.29
368,22.32
369,22.29
370,22.19
371,22.00
372,21.79
373,21.64
374,21.59
375,21.68
376,21.91
377,22.31
378,22.83
379,23.41
380,23.92
381,24.25
382,24.37
383,24.28
384,24.01
385,23.65
386,23.26
387,22.93
388,22.67
389,22.48
390,22.26
391,22.04
392,21.75
393,21.44
394,21.03
395,20.58
396,20.01
397,19.47
398,18.88
399,18.37
400,17.82
401,17.28
402,16.62
403,15.90
404,15.02
405,14.06
406,12.92
407,11.68
408,10.28
409,8.87
410,7.43
411,6.16
412,5.03
413,4.17
414,3.59
415,3.31
416,3.23
417,3.31
418,3.43
419,3.62
420,3.85
421,4.12
422,4.42
423,4.75
424,5.13
425,5.58
426,6.09
427,6.57
428,6.94
429,7.15
430,7.23
431,7.22
432,7.17
433,7.10
434,7.07
435,7.13
436,7.30
437,7.57
438,7.90
439,8.22
440,8.53
441,8.75
442,8.94
443,9.10
444,9.34
445,9.58
446,9.90
447,10.22
448,10.63
449,11.08
450,11.65
451,12.28
452,13.09
453,13.99
454,15.05
455,16.11
456,17.21
457,18.21
458,19.13
459,19.89
460,20.58
461,21.18
462,21.80
463,22.39
464,22.96
465,23.37
466,23.61
467,23.63
468,23.50
469,23.24
470,22.93
471,22.63
472,22.40
473,22.31
474,22.35
475,22.49
476,22.61
477,22.69
478,22.64
479,22.50
480,22.22
481,21.84
482,21.35
483,20.82
484,20.21
485,19.57
486,18.86
487,18.15
488,17.44
489,16.82
490,16.27
491,15.87
492,15.55
493,15.36
494,15.23
495,15.19
496,15.14
497,15.11
498,15.01
499,14.95
500,14.81
501,14.65
502,14.37
503,14.01
504,13.47
505,12.79
506,11.92
507,10.95
508,9.86
509,8.77
510,7.64
511,6.61
512,5.68
513,4.94
514,4.35
515,3.92
516,3.56
517,3.29
518,2.98
519,2.67
520,2.30
521,1.95
522,1.61
523,1.37
524,1.24
525,1.21
526,1.24
527,1.31
528,1.41
529,1.49
530,1.53
531,1.52
532,1.56
533,1.69
534,2.00
535,2.49
536,3.28
537,4.31
538,5.55
539,6.78
540,7.93
541,8.84
542,9.53
543,9.93
544,10.15
545,10.21
546,10.28
547,10.41
548,10.68
549,11.00
550,11.37
551,11.65
552,11.88
553,12.01
554,12.15
555,12.28
556,12.47
557,12.76
558,13.24
559,13.86
560,14.56
561,15.21
562,15.72
563,16.02
564,16.18
565,16.20
566,16.17
567,16.13
568,16.13
569,16.18
570,16.35
571,16.61
572,16.95
573,17.31
574,17.68
575,18.04
576,18.39
577,18.75
578,19.10
579,19.40
580,19.61
581,19.71
582,19.69
583,19.54
584,19.23
585,18.78
586,18.23
587,17.59
588,16.89
589,16.17
590,15.49
591,14.92
592,14.49
593,14.25
594,14.21
595,14.40
596,14.77
597,15.29
598,15.88
599,16.46
600,16.96
601,17.33
602,17.59
603,17.72
604,17.85
605,17.98
606,18.20
607,18.46
608,18.81
609,19.23
610,19.71
611,20.19
612,20.61
613,20.95
614,21.16
615,21.23
616,21.10
617,20.74
618,20.15
619,19.37
620,18.47
621,17.57
622,16.73
623,16.02
624,15.40
625,14.88
626,14.39
627,13.92
628,13.41
629,12.88
630,12.34
631,11.87
632,11.56
633,11.47
634,11.65
635,12.09
636,12.79
637,13.65
638,14.67
639,15.78
640,16.93
641,18.04
642,19.08
643,19.99
644,20.79
645,21.40
646,21.87
647,22.15
648,22.34
649,22.40
650,22.44
651,22.39
652,22.36
653,22.35
654,22.42
655,22.59
656,22.89
657,23.31
658,23.84
659,24.44
660,25.05
661,25.54
662,25.79
663,25.76
664,25.47
665,24.95
666,24.29
667,23.63
668,23.05
669,22.64
670,22.39
671,22.31
672,22.32
673,22.37
674,22.33
675,22.13
676,21.73
677,21.22
678,20.68
679,20.23
680,19.90
681,19.77
682,19.81
683,20.04
684,20.30
685,20.50
686,20.50
687,20.28
688,19.76
689,19.02
690,18.07
691,17.09
692,16.17
693,15.49
694,15.05
695,14.88
696,14.79
697,14.74
698,14.49
699,14.05
700,13.26
701,12.24
702,10.91
703,9.46
704,7.89
705,6.38
706,4.94
707,3.67
708,2.53
709,1.59
710,0.80
711,0.22
712,-0.23
713,-0.47
714,-0.60
715,-0.59
716,-0.53
717,-0.40
718,-0.22
719,-0.05
720,0.07
721,0.10
722,0.12
723,0.18
724,0.38
725,0.73
726,1.34
727,2.19
728,3.30
729,4.53
730,5.81
731,6.94
732,7.84
733,8.36
734,8.60
735,8.54
736,8.33
737,8.06
738,7.93
739,8.00
740,8.33
741,8.80
742,9.41
743,9.96
744,10.44
745,10.79
746,11.08
747,11.32
748,11.63
749,12.03
750,12.66
751,13.48
752,14.49
753,15.54
754,16.61
755,17.55
756,18.33
757,18.89
758,19.29
759,19.49
760,19.49
761,19.26
762,18.92
763,18.52
764,18.13
765,17.76
766,17.49
767,17.36
768,17.41
769,17.57
770,17.75
771,17.88
772,17.89
773,17.81
774,17.63
775,17.43
776,17.19
777,17.03
778,16.91
779,16.83
780,16.69
781,16.43
782,16.01
783,15.46
784,14.72
785,13.92
786,13.11
787,12.43
788,11.87
789,11.51
790,11.26
791,11.10
792,10.86
793,10.50
794,9.94
795,9.28
796,8.55
797,7.87
798,7.26
799,6.86
800,6.61
801,6.55
802,6.53
803,6.48
804,6.30
805,5.94
806,5.40
807,4.76
808,4.16
809,3.76
810,3.66
811,3.91
812,4.48
813,5.29
814,6.23
815,7.07
816,7.71
817,8.03
818,8.07
819,7.93
820,7.78
821,7.70
822,7.81
823,8.16
824,8.80
825,9.58
826,10.35
827,10.89
828,11.18
829,11.22
830,11.10
831,10.91
832,10.80
833,10.86
834,11.20
835,11.75
836,12.44
837,13.13
838,13.73
839,14.15
840,14.38
841,14.38
842,14.11
843,13.63
844,13.01
845,12.34
846,11.69
847,11.12
848,10.70
849,10.48
850,10.49
851,10.70
852,11.09
853,11.57
854,12.08
855,12.54
856,12.86
857,13.07
858,13.18
859,13.24
860,13.27
861,13.29
862,13.37
863,13.52
864,13.73
865,13.98
866,14.24
867,14.48
868,14.66
869,14.79
870,14.85
871,14.83
872,14.64
873,14.33
874,13.90
875,13.47
876,12.97
877,12.45
878,11.82
879,11.12
880,10.28
881,9.35
882,8.23
883,7.06
884,5.78
885,4.54
886,3.30
887,2.19
888,1.14
889,0.27
890,-0.50
891,-1.11
892,-1.66
893,-2.09
894,-2.46
895,-2.72
896,-2.89
897,-2.92
898,-2.80
899,-2.53
900,-2.12
901,-1.62
902,-1.01
903,-0.40
904,0.24
905,0.79
906,1.32
907,1.77
908,2.24
909,2.67
910,3.16
911,3.65
912,4.19
913,4.71
914,5.29
915,5.89
916,6.61
917,7.33
918,8.13
919,8.89
920,9.67
921,10.36
922,11.03
923,11.57
924,12.08
925,12.47
926,12.86
927,13.15
928,13.50
929,13.91
930,14.58
931,15.44
932,16.59
933,17.85
934,19.29
935,20.70
936,22.10
937,23.31
938,24.39
939,25.31
940,26.24
941,27.12
942,28.11
943,29.11
944,30.20
945,31.20
946,32.04
947,32.58
948,32.85
949,32.79
950,32.49
951,32.03
952,31.58
953,31.23
954,31.02
955,30.95
956,30.99
957,31.09
958,31.11
959,31.01
960,30.75
961,30.43
962,29.98
963,29.46
964,28.85
965,28.24
966,27.56
967,26.83
968,25.98
969,25.09
970,24.18
971,23.39
972,22.69
973,22.17
974,21.75
975,21.49
976,21.22
977,20.96
978,20.52
979,19.98
980,19.23
981,18.39
982,17.39
983,16.40
984,15.40
985,14.56
986,13.79
987,13.19
988,12.66
989,12.25
990,11.77
991,11.29
992,10.70
993,10.06
994,9.28
995,8.45
996,7.47
997,6.46
998,5.42
999,4.47
1000,3.64
1001,3.05
1002,2.69
1003,2.59
1004,2.65
1005,2.82
1006,2.98
1007,3.14
1008,3.24
1009,3.30
1010,3.32
1011,3.31
1012,3.33
1013,3.35
1014,3.40
1015,3.49
1016,3.66
1017,3.94
1018,4.40
1019,4.99
1020,5.74
1021,6.57
1022,7.46
1023,8.29
1024,9.03
1025,9.56
1026,9.93
1027,10.12
1028,10.23
1029,10.33
1030,10.53
1031,10.82
1032,11.22
1033,11.60
1034,11.93
1035,12.10
1036,12.12
1037,11.91
1038,11.60
1039,11.28
1040,11.14
1041,11.25
1042,11.66
1043,12.34
1044,13.28
1045,14.37
1046,15.49
1047,16.44
1048,17.17
1049,17.65
1050,17.91
1051,17.96
1052,17.83
1053,17.59
1054,17.33
1055,17.15
1056,17.02
1057,16.92
1058,16.80
1059,16.65
1060,16.41
1061,16.07
1062,15.56
1063,14.92
1064,14.07
1065,13.13
1066,12.11
1067,11.13
1068,10.15
1069,9.28
1070,8.48
1071,7.87
1072,7.35
1073,6.95
1074,6.60
1075,6.34
1076,6.12
1077,5.98
1078,5.93
1079,6.03
1080,6.24
1081,6.55
1082,6.88
1083,7.23
1084,7.52
1085,7.71
1086,7.69
1087,7.44
1088,6.94
1089,6.26
1090,5.50
1091,4.78
1092,4.18
1093,3.80
1094,3.60
1095,3.56
1096,3.59
1097,3.66
1098,3.68
1099,3.60
1100,3.37
1101,3.04
1102,2.66
1103,2.33
1104,2.08
1105,1.94
1106,1.85
1107,1.81
1108,1.75
1109,1.63
1110,1.40
1111,1.07
1112,0.67
1113,0.29
1114,0.07
1115,0.05
1116,0.33
1117,0.85
1118,1.66
1119,2.56
1120,3.59
1121,4.59
1122,5.62
1123,6.60
1124,7.68
1125,8.82
1126,10.13
1127,11.52
1128,12.99
1129,14.32
1130,15.51
1131,16.38
1132,17.01
1133,17.30
1134,17.42
1135,17.40
1136,17.52
1137,17.78
1138,18.30
1139,18.95
1140,19.75
1141,20.52
1142,21.16
1143,21.55
1144,21.71
1145,21.66
1146,21.50
1147,21.31
1148,21.22
1149,21.30
1150,21.58
1151,21.97
1152,22.42
1153,22.77
1154,22.98
1155,22.95
1156,22.69
1157,22.26
1158,21.74
1159,21.29
1160,21.01
1161,21.02
1162,21.29
1163,21.80
1164,22.36
1165,22.84
1166,23.02
1167,22.83
1168,22.18
1169,21.13
1170,19.74
1171,18.29
1172,16.88
1173,15.76
1174,14.87
1175,14.29
1176,13.84
1177,13.50
1178,12.97
1179,12.24
1180,11.13
1181,9.77
1182,8.14
1183,6.48
1184,4.83
1185,3.39
1186,2.09
1187,1.01
1188,0.07
1189,-0.66
1190,-1.27
1191,-1.76
1192,-2.21
1193,-2.53
1194,-2.71
1195,-2.69
1196,-2.59
1197,-2.46
1198,-2.34
1199,-2.23
1200,-2.11
1201,-2.03
1202,-1.94
1203,-1.80
1204,-1.53
1205,-1.09
1206,-0.44
1207,0.39
1208,1.41
1209,2.51
1210,3.65
1211,4.69
1212,5.62
1213,6.32
1214,6.82
1215,7.07
1216,7.20
1217,7.20
1218,7.19
1219,7.16
1220,7.27
1221,7.48
1222,7.88
1223,8.38
1224,9.01
1225,9.69
1226,10.40
1227,11.02
1228,11.57
1229,11.99
1230,12.37
1231,12.68
1232,13.02
1233,13.37
1234,13.77
1235,14.21
1236,14.72
1237,15.26
1238,15.80
1239,16.23
1240,16.58
1241,16.83
1242,17.08
1243,17.30
1244,17.54
1245,17.74
1246,17.94
1247,18.16
1248,18.38
1249,18.55
1250,18.66
1251,18.72
1252,18.77
1253,18.79
1254,18.79
1255,18.80
1256,18.84
1257,18.93
1258,18.99
1259,19.00
1260,18.96
1261,18.84
1262,18.59
1263,18.24
1264,17.82
1265,17.40
1266,16.98
1267,16.64
1268,16.37
1269,16.21
1270,16.02
1271,15.77
1272,15.39
1273,14.88
1274,14.21
1275,13.40
1276,12.53
1277,11.76
1278,11.15
1279,10.77
1280,10.54
1281,10.44
1282,10.40
1283,10.41
1284,10.38
1285,10.30
1286,10.16
1287,10.00
1288,9.83
1289,9.72
1290,9.70
1291,9.79
1292,9.93
1293,10.08
1294,10.28
1295,10.51
1296,10.75
1297,10.95
1298,11.18
1299,11.47
1300,11.86
1301,12.31
1302,12.80
1303,13.27
1304,13.73
1305,14.15
1306,14.53
1307,14.82
1308,15.04
1309,15.21
1310,15.40
1311,15.57
1312,15.71
1313,15.77
1314,15.78
1315,15.74
1316,15.64
1317,15.46
1318,15.24
1319,14.99
1320,14.77
1321,14.63
1322,14.55
1323,14.56
1324,14.59
1325,14.56
1326,14.43
1327,14.20
1328,13.85
1329,13.44
1330,12.95
1331,12.41
1332,11.86
1333,11.38
1334,11.01
1335,10.80
1336,10.77
1337,10.95
1338,11.33
1339,11.86
1340,12.51
1341,13.21
1342,13.89
1343,14.50
1344,14.97
1345,15.29
1346,15.52
1347,15.69
1348,15.83
1349,15.96
1350,16.08
1351,16.17
1352,16.19
1353,16.11
1354,15.91
1355,15.61
1356,15.21
1357,14.77
1358,14.29
1359,13.82
1360,13.31
1361,12.83
1362,12.31
1363,11.75
1364,11.04
1365,10.22
1366,9.28
1367,8.33
1368,7.35
1369,6.43
1370,5.59
1371,4.95
1372,4.46
1373,4.18
1374,4.04
1375,4.05
1376,4.15
1377,4.31
1378,4.47
1379,4.63
1380,4.75
1381,4.84
1382,4.89
1383,4.92
1384,4.94
1385,4.97
1386,5.00
1387,5.01
1388,4.95
1389,4.80
1390,4.54
1391,4.18
1392,3.76
1393,3.30
1394,2.86
1395,2.50
1396,2.29
1397,2.25
1398,2.40
1399,2.74
1400,3.23
1401,3.84
1402,4.46
1403,5.04
1404,5.52
1405,5.87
1406,6.10
1407,6.16
1408,6.17
1409,6.09
1410,6.03
1411,6.06
1412,6.37
1413,6.97
1414,7.93
1415,9.06
1416,10.34
1417,11.61
1418,12.87
1419,13.93
1420,14.80
1421,15.43
1422,15.99
1423,16.47
1424,16.97
1425,17.43
1426,17.94
1427,18.40
1428,18.83
1429,19.11
1430,19.33
1431,19.49
1432,19.68
1433,19.91
1434,20.21
1435,20.55
1436,20.85
1437,21.07
1438,21.15
1439,21.06
1440,20.79
1441,20.40
1442,19.94
1443,19.46
1444,18.97
1445,18.48
1446,17.92
1447,17.33
1448,16.69
1449,16.01
1450,15.24
1451,14.48
1452,13.74
1453,13.15
1454,12.67
1455,12.34
1456,12.05
1457,11.83
1458,11.60
1459,11.41
1460,11.18
1461,11.00
1462,10.75
1463,10.48
1464,10.07
1465,9.57
1466,8.84
1467,7.97
1468,6.87
1469,5.71
1470,4.52
1471,3.44
1472,2.39
1473,1.45
1474,0.57
1475,-0.16
1476,-0.80
1477,-1.29
1478,-1.70
1479,-1.95
1480,-2.10
1481,-2.11
1482,-2.10
1483,-2.08
1484,-2.15
1485,-2.33
1486,-2.61
1487,-2.94
1488,-3.26
1489,-3.46
1490,-3.43
1491,-3.17
1492,-2.65
1493,-2.00
1494,-1.24
1495,-0.51
1496,0.22
1497,0.89
1498,1.61
1499,2.33
1500,3.13
1501,4.01
1502,5.07
1503,6.20
1504,7.33
1505,8.29
1506,9.06
1507,9.51
1508,9.69
1509,9.57
1510,9.37
1511,9.13
1512,8.97
1513,8.91
1514,9.02
1515,9.28
1516,9.64
1517,10.02
1518,10.34
1519,10.55
1520,10.57
1521,10.39
1522,10.06
1523,9.67
1524,9.25
1525,8.86
1526,8.52
1527,8.28
1528,8.16
1529,8.17
1530,8.25
1531,8.35
1532,8.43
1533,8.52
1534,8.61
1535,8.74
1536,8.89
1537,9.07
1538,9.24
1539,9.38
1540,9.41
1541,9.29
1542,8.96
1543,8.46
1544,7.82
1545,7.13
1546,6.42
1547,5.77
1548,5.19
1549,4.75
1550,4.43
1551,4.22
1552,4.09
1553,4.04
1554,4.05
1555,4.14
1556,4.29
1557,4.49
1558,4.80
1559,5.22
1560,5.73
1561,6.27
1562,6.81
1563,7.32
1564,7.77
1565,8.13
1566,8.38
1567,8.52
1568,8.62
1569,8.70
1570,8.80
1571,8.96
1572,9.18
1573,9.42
1574,9.61
1575,9.71
1576,9.68
1577,9.54
1578,9.22
1579,8.73
1580,8.03
1581,7.23
1582,6.34
1583,5.45
1584,4.55
1585,3.72
1586,2.96
1587,2.34
1588,1.80
1589,1.34
1590,0.90
1591,0.53
1592,0.15
1593,-0.18
1594,-0.47
1595,-0.63
1596,-0.66
1597,-0.55
1598,-0.33
1599,-0.02
1600,0.39
1601,0.82
1602,1.25
1603,1.63
1604,2.08
1605,2.60
1606,3.20
1607,3.83
1608,4.52
1609,5.26
1610,6.03
1611,6.71
1612,7.29
1613,7.66
1614,7.90
1615,8.03
1616,8.15
1617,8.29
1618,8.53
1619,8.88
1620,9.36
1621,9.87
1622,10.34
1623,10.64
1624,10.75
1625,10.68
1626,10.49
1627,10.22
1628,9.90
1629,9.60
1630,9.36
1631,9.18
1632,9.00
1633,8.77
1634,8.45
1635,8.06
1636,7.61
1637,7.16
1638,6.76
1639,6.49
1640,6.39
1641,6.49
1642,6.76
1643,7.16
1644,7.58
1645,7.93
1646,8.10
1647,8.08
1648,7.80
1649,7.33
1650,6.69
1651,6.00
1652,5.32
1653,4.76
1654,4.32
1655,4.04
1656,3.82
1657,3.65
1658,3.33
1659,2.88
1660,2.17
1661,1.29
1662,0.21
1663,-0.89
1664,-1.96
1665,-2.85
1666,-3.57
1667,-4.09
1668,-4.47
1669,-4.72
1670,-4.96
1671,-5.21
1672,-5.55
1673,-5.97
1674,-6.48
1675,-6.96
1676,-7.30
1677,-7.47
1678,-7.44
1679,-7.23
1680,-6.78
1681,-6.10
1682,-5.22
1683,-4.26
1684,-3.27
1685,-2.31
1686,-1.41
1687,-0.65
1688,-0.01
1689,0.48
1690,0.94
1691,1.33
1692,1.75
1693,2.12
1694,2.53
1695,2.89
1696,3.28
1697,3.62
1698,3.99
1699,4.33
1700,4.68
1701,5.00
1702,5.34
1703,5.68
1704,6.10
1705,6.56
1706,7.11
1707,7.72
1708,8.48
1709,9.34
1710,10.29
1711,11.24
1712,12.19
1713,13.04
1714,13.80
1715,14.38
1716,14.86
1717,15.19
1718,15.47
1719,15.66
1720,15.89
1721,16.16
1722,16.59
1723,17.14
1724,17.88
1725,18.71
1726,19.59
1727,20.43
1728,21.21
1729,21.83
1730,22.25
1731,22.36
1732,22.22
1733,21.84
1734,21.35
1735,20.87
1736,20.48
1737,20.28
1738,20.22
1739,20.29
1740,20.41
1741,20.52
1742,20.48
1743,20.23
1744,19.68
1745,18.95
1746,18.07
1747,17.17
1748,16.30
1749,15.59
1750,15.05
1751,14.72
1752,14.42
1753,14.06
1754,13.50
1755,12.76
1756,11.81
1757,10.81
1758,9.78
1759,8.90
1760,8.14
1761,7.62
1762,7.27
1763,7.12
1764,7.03
1765,6.96
1766,6.78
1767,6.52
1768,6.16
1769,5.80
1770,5.48
1771,5.27
1772,5.21
1773,5.33
1774,5.64
1775,6.12
1776,6.74
1777,7.39
1778,8.05
1779,8.64
1780,9.20
1781,9.70
1782,10.15
1783,10.53
1784,10.90
1785,11.22
1786,11.50
1787,11.70
1788,11.87
1789,11.95
1790,11.94
1791,11.80
1792,11.65
1793,11.54
1794,11.57
1795,11.73
1796,11.98
1797,12.28
1798,12.58
1799,12.79
1800,12.85
1801,12.70
1802,12.37
1803,11.90
1804,11.40
1805,11.00
1806,10.85
1807,10.97
1808,11.29
1809,11.70
1810,12.10
1811,12.43
1812,12.63
1813,12.69
1814,12.62
1815,12.53
1816,12.50
1817,12.54
1818,12.70
1819,12.94
1820,13.28
1821,13.63
1822,13.92
1823,14.10
1824,14.24
1825,14.37
1826,14.50
1827,14.63
1828,14.79
1829,14.99
1830,15.24
1831,15.45
1832,15.57
1833,15.61
1834,15.56
1835,15.48
1836,15.34
1837,15.17
1838,14.94
1839,14.63
1840,14.11
1841,13.46
1842,12.60
1843,11.62
1844,10.47
1845,9.22
1846,7.90
1847,6.62
1848,5.38
1849,4.30
1850,3.33
1851,2.57
1852,1.93
1853,1.44
1854,1.05
1855,0.79
1856,0.63
1857,0.68
1858,0.90
1859,1.33
1860,1.87
1861,2.46
1862,2.98
1863,3.38
1864,3.57
1865,3.51
1866,3.22
1867,2.78
1868,2.33
1869,1.93
1870,1.66
1871,1.53
1872,1.59
1873,1.74
1874,1.92
1875,2.04
1876,2.08
1877,2.07
1878,2.08
1879,2.13
1880,2.27
1881,2.47
1882,2.75
1883,3.07
1884,3.45
1885,3.78
1886,4.14
1887,4.41
1888,4.73
1889,5.05
1890,5.53
1891,6.13
1892,7.00
1893,8.09
1894,9.42
1895,10.83
1896,12.37
1897,13.88
1898,15.37
1899,16.67
1900,17.81
1901,18.70
1902,19.52
1903,20.20
1904,20.85
1905,21.37
1906,21.81
1907,22.09
1908,22.26
1909,22.28
1910,22.22
1911,22.08
1912,21.97
1913,21.93
1914,22.03
1915,22.27
1916,22.61
1917,22.99
1918,23.28
1919,23.45
1920,23.40
1921,23.17
1922,22.74
1923,22.17
1924,21.47
1925,20.72
1926,19.98
1927,19.31
1928,18.65
1929,18.01
1930,17.33
1931,16.72
1932,16.14
1933,15.68
1934,15.26
1935,14.95
1936,14.66
1937,14.45
1938,14.20
1939,13.92
1940,13.52
1941,13.06
1942,12.51
1943,11.96
1944,11.35
1945,10.78
1946,10.16
1947,9.56
1948,8.85
1949,8.07
1950,7.13
1951,6.16
1952,5.13
1953,4.16
1954,3.21
1955,2.40
1956,1.66
1957,1.09
1958,0.56
1959,0.11
1960,-0.37
1961,-0.84
1962,-1.34
1963,-1.80
1964,-2.27
1965,-2.70
1966,-3.15
1967,-3.56
1968,-3.97
1969,-4.33
1970,-4.64
1971,-4.91
1972,-5.13
1973,-5.25
1974,-5.22
1975,-5.05
1976,-4.73
1977,-4.29
1978,-3.66
1979,-2.90
1980,-2.00
1981,-1.04
1982,-0.02
1983,0.95
1984,1.85
1985,2.56
1986,3.12
1987,3.52
1988,3.84
1989,4.03
1990,4.17
1991,4.27
1992,4.43
1993,4.60
1994,4.78
1995,4.85
1996,4.88
1997,4.84
1998,4.80
1999,4.75
2000,4.77
2001,4.90
2002,5.26
2003,5.81
2004,6.57
2005,7.39
2006,8.19
2007,8.88
2008,9.40
2009,9.71
2010,9.90
2011,10.02
2012,10.11
2013,10.19
2014,10.30
2015,10.45
2016,10.64
2017,10.81
2018,10.83
2019,10.66
2020,10.26
2021,9.74
2022,9.06
2023,8.36
2024,7.58
2025,6.83
2026,6.03
2027,5.21
2028,4.26
2029,3.20
2030,1.98
2031,0.70
2032,-0.60
2033,-1.71
2034,-2.54
2035,-2.94
2036,-2.96
2037,-2.63
2038,-2.14
2039,-1.58
2040,-1.08
2041,-0.72
2042,-0.56
2043,-0.53
2044,-0.54
2045,-0.52
2046,-0.43
2047,-0.31
2048,-0.15
2049,0.03
2050,0.18
2051,0.25
2052,0.20
2053,0.05
2054,-0.18
2055,-0.44
2056,-0.77
2057,-1.12
2058,-1.50
2059,-1.89
2060,-2.33
2061,-2.79
2062,-3.28
2063,-3.74
2064,-4.14
2065,-4.40
2066,-4.52
2067,-4.49
2068,-4.36
2069,-4.21
2070,-4.04
2071,-3.87
2072,-3.68
2073,-3.52
2074,-3.30
2075,-2.98
2076,-2.49
2077,-1.89
2078,-1.10
2079,-0.19
2080,0.92
2081,2.09
2082,3.35
2083,4.52
2084,5.68
2085,6.70
2086,7.68
2087,8.51
2088,9.35
2089,10.09
2090,10.85
2091,11.58
2092,12.38
2093,13.15
2094,13.84
2095,14.34
2096,14.69
2097,14.88
2098,14.98
2099,14.98
2100,14.92
2101,14.81
2102,14.72
2103,14.63
2104,14.54
2105,14.40
2106,14.14
2107,13.79
2108,13.36
2109,12.95
2110,12.52
2111,12.11
2112,11.70
2113,11.32
2114,10.91
2115,10.44
2116,9.85
2117,9.21
2118,8.53
2119,7.93
2120,7.42
2121,7.07
2122,6.89
2123,6.90
2124,7.01
2125,7.15
2126,7.21
2127,7.20
2128,7.05
2129,6.76
2130,6.29
2131,5.80
2132,5.31
2133,4.97
2134,4.69
2135,4.51
2136,4.30
2137,4.05
2138,3.62
2139,2.98
2140,2.05
2141,0.93
2142,-0.39
2143,-1.76
2144,-3.12
2145,-4.28
2146,-5.19
2147,-5.74
2148,-6.03
2149,-6.07
2150,-5.97
2151,-5.74
2152,-5.48
2153,-5.17
2154,-4.88
2155,-4.62
2156,-4.36
2157,-4.12
2158,-3.88
2159,-3.72
2160,-3.59
2161,-3.52
2162,-3.38
2163,-3.14
2164,-2.69
2165,-2.11
2166,-1.32
2167,-0.43
2168,0.55
2169,1.53
2170,2.49
2171,3.35
2172,4.10
2173,4.65
2174,5.08
2175,5.35
2176,5.56
2177,5.66
2178,5.76
2179,5.85
2180,6.07
2181,6.45
2182,7.06
2183,7.78
2184,8.61
2185,9.38
2186,10.12
2187,10.66
2188,11.03
2189,11.19
2190,11.31
2191,11.42
2192,11.68
2193,12.08
2194,12.73
2195,13.53
2196,14.41
2197,15.21
2198,15.92
2199,16.45
2200,16.79
2201,16.91
2202,16.86
2203,16.73
2204,16.60
2205,16.51
2206,16.49
2207,16.54
2208,16.67
2209,16.87
2210,17.04
2211,17.15
2212,17.07
2213,16.82
2214,16.33
2215,15.66
2216,14.77
2217,13.79
2218,12.75
2219,11.83
2220,11.05
2221,10.48
2222,9.98
2223,9.57
2224,9.09
2225,8.59
2226,7.91
2227,7.19
2228,6.37
2229,5.65
2230,4.96
2231,4.39
2232,3.80
2233,3.20
2234,2.47
2235,1.65
2236,0.68
2237,-0.30
2238,-1.25
2239,-2.02
2240,-2.59
2241,-2.85
2242,-2.80
2243,-2.49
2244,-2.09
2245,-1.75
2246,-1.54
2247,-1.50
2248,-1.56
2249,-1.66
2250,-1.67
2251,-1.52
2252,-1.08
2253,-0.37
2254,0.64
2255,1.81
2256,3.04
2257,4.13
2258,5.09
2259,5.84
2260,6.51
2261,7.07
2262,7.68
2263,8.35
2264,9.19
2265,10.16
2266,11.26
2267,12.28
2268,13.13
2269,13.66
2270,13.86
2271,13.70
2272,13.25
2273,12.60
2274,11.92
2275,11.34
2276,10.96
2277,10.78
2278,10.77
2279,10.80
2280,10.80
2281,10.69
2282,10.42
2283,10.03
2284,9.57
2285,9.18
2286,8.92
2287,8.86
2288,9.01
2289,9.32
2290,9.69
2291,10.03
2292,10.26
2293,10.35
2294,10.30
2295,10.17
2296,10.05
2297,10.00
2298,10.12
2299,10.41
2300,10.89
2301,11.47
2302,12.08
2303,12.62
2304,13.04
2305,13.27
2306,13.33
2307,13.23
2308,13.04
2309,12.85
2310,12.77
2311,12.83
2312,13.00
2313,13.25
2314,13.53
2315,13.74
2316,13.81
2317,13.69
2318,13.40
2319,13.05
2320,12.66
2321,12.35
2322,12.06
2323,11.82
2324,11.50
2325,11.10
2326,10.51
2327,9.77
2328,8.74
2329,7.55
2330,6.21
2331,4.91
2332,3.69
2333,2.69
2334,1.83
2335,1.16
2336,0.63
2337,0.24
2338,-0.05
2339,-0.21
2340,-0.26
2341,-0.13
2342,0.12
2343,0.50
2344,0.94
2345,1.46
2346,1.97
2347,2.40
2348,2.67
2349,2.78
2350,2.78
2351,2.69
2352,2.51
2353,2.26
2354,2.01
2355,1.83
2356,1.75
2357,1.72
2358,1.70
2359,1.69
2360,1.77
2361,1.95
2362,2.21
2363,2.47
2364,2.73
2365,2.98
2366,3.32
2367,3.69
2368,4.13
2369,4.52
2370,4.98
2371,5.49
2372,6.19
2373,6.97
2374,7.87
2375,8.78
2376,9.78
2377,10.81
2378,11.93
2379,13.08
2380,14.32
2381,15.56
2382,16.83
2383,17.99
2384,19.01
2385,19.71
2386,20.06
2387,19.96
2388,19.49
2389,18.68
2390,17.69
2391,16.68
2392,15.89
2393,15.43
2394,15.31
2395,15.51
2396,15.97
2397,16.58
2398,17.15
2399,17.59
2400,17.85
2401,17.93
2402,17.81
2403,17.59
2404,17.29
2405,16.96
2406,16.54
2407,16.05
2408,15.50
2409,14.96
2410,14.40
2411,13.87
2412,13.41
2413,13.09
2414,12.83
2415,12.61
2416,12.34
2417,12.03
2418,11.58
2419,11.05
2420,10.46
2421,9.94
2422,9.46
2423,9.09
2424,8.76
2425,8.51
2426,8.29
2427,8.06
2428,7.71
2429,7.22
2430,6.54
2431,5.77
2432,4.91
2433,4.09
2434,3.30
2435,2.65
2436,2.14
2437,1.85
2438,1.76
2439,1.88
2440,2.03
2441,2.17
2442,2.18
2443,2.04
2444,1.70
2445,1.19
2446,0.55
2447,-0.15
2448,-0.82
2449,-1.37
2450,-1.71
2451,-1.82
2452,-1.74
2453,-1.50
2454,-1.11
2455,-0.64
2456,-0.11
2457,0.39
2458,0.87
2459,1.34
2460,1.87
2461,2.42
2462,3.03
2463,3.65
2464,4.33
2465,5.00
2466,5.68
2467,6.27
2468,6.81
2469,7.24
2470,7.60
2471,7.82
2472,7.97
2473,8.01
2474,8.05
2475,8.06
2476,8.10
2477,8.16
2478,8.29
2479,8.52
2480,8.85
2481,9.24
2482,9.70
2483,10.13
2484,10.53
2485,10.82
2486,11.05
2487,11.19
2488,11.25
2489,11.21
2490,11.17
2491,11.18
2492,11.34
2493,11.63
2494,12.09
2495,12.70
2496,13.38
2497,14.12
2498,14.78
2499,15.28
2500,15.48
2501,15.34
2502,14.82
2503,13.99
2504,12.86
2505,11.54
2506,10.11
2507,8.70
2508,7.39
2509,6.29
2510,5.41
2511,4.77
2512,4.26
2513,3.88
2514,3.60
2515,3.40
2516,3.20
2517,3.07
2518,2.99
2519,3.08
2520,3.34
2521,3.77
2522,4.33
2523,5.00
2524,5.71
2525,6.38
2526,6.90
2527,7.26
2528,7.48
2529,7.55
2530,7.51
2531,7.40
2532,7.28
2533,7.18
2534,7.10
2535,6.98
2536,6.82
2537,6.58
2538,6.23
2539,5.71
2540,5.07
2541,4.39
2542,3.71
2543,3.11
2544,2.60
2545,2.24
2546,2.06
2547,2.03
2548,2.10
2549,2.23
2550,2.40
2551,2.60
2552,2.83
2553,3.10
2554,3.46
2555,3.93
2556,4.52
2557,5.18
2558,5.87
2559,6.48
2560,7.01
2561,7.32
2562,7.51
2563,7.54
2564,7.57
2565,7.66
2566,7.99
2567,8.58
2568,9.45
2569,10.43
2570,11.43
2571,12.25
2572,12.90
2573,13.27
2574,13.44
2575,13.44
2576,13.47
2577,13.62
2578,14.03
2579,14.69
2580,15.58
2581,16.51
2582,17.36
2583,17.96
2584,18.28
2585,18.30
2586,18.07
2587,17.63
2588,17.11
2589,16.62
2590,16.27
2591,16.04
2592,15.87
2593,15.70
2594,15.46
2595,15.15
2596,14.69
2597,14.10
2598,13.37
2599,12.66
2600,12.02
2601,11.57
2602,11.29
2603,11.22
2604,11.31
2605,11.52
2606,11.62
2607,11.53
2608,11.15
2609,10.60
2610,9.83
2611,9.01
2612,8.14
2613,7.48
2614,7.03
2615,6.88
2616,6.81
2617,6.71
2618,6.33
2619,5.65
2620,4.47
2621,2.91
2622,0.95
2623,-1.14
2624,-3.24
2625,-5.05
2626,-6.52
2627,-7.51
2628,-8.16
2629,-8.53
2630,-8.89
2631,-9.27
2632,-9.86
2633,-10.56
2634,-11.40
2635,-12.18
2636,-12.79
2637,-13.10
2638,-13.05
2639,-12.68
2640,-12.06
2641,-11.34
2642,-10.62
2643,-10.03
2644,-9.53
2645,-9.14
2646,-8.74
2647,-8.29
2648,-7.64
2649,-6.82
2650,-5.79
2651,-4.69
2652,-3.54
2653,-2.54
2654,-1.72
2655,-1.21
2656,-0.88
2657,-0.74
2658,-0.57
2659,-0.37
2660,0.04
2661,0.64
2662,1.54
2663,2.54
2664,3.59
2665,4.48
2666,5.24
2667,5.81
2668,6.31
2669,6.78
2670,7.42
2671,8.26
2672,9.41
2673,10.73
2674,12.15
2675,13.43
2676,14.45
2677,15.07
2678,15.34
2679,15.25
2680,14.92
2681,14.42
2682,13.94
2683,13.53
2684,13.25
2685,13.05
2686,12.92
2687,12.85
2688,12.86
2689,12.92
2690,13.02
2691,13.11
2692,13.15
2693,13.11
2694,13.01
2695,12.87
2696,12.72
2697,12.59
2698,12.50
2699,12.50
2700,12.63
2701,12.86
2702,13.05
2703,13.12
2704,13.02
2705,12.75
2706,12.30
2707,11.75
2708,11.12
2709,10.48
2710,9.86
2711,9.34
2712,8.92
2713,8.61
2714,8.25
2715,7.83
2716,7.27
2717,6.65
2718,5.91
2719,5.15
2720,4.37
2721,3.68
2722,3.08
2723,2.62
2724,2.27
2725,2.04
2726,1.87
2727,1.75
2728,1.68
2729,1.65
2730,1.66
2731,1.72
2732,1.84
2733,2.04
2734,2.37
2735,2.81
2736,3.38
2737,4.01
2738,4.67
2739,5.29
2740,5.85
2741,6.30
2742,6.63
2743,6.80
2744,6.87
2745,6.87
2746,6.95
2747,7.11
2748,7.42
2749,7.84
2750,8.37
2751,8.93
2752,9.47
2753,9.89
2754,10.22
2755,10.41
2756,10.49
2757,10.52
2758,10.57
2759,10.70
2760,10.85
2761,10.94
2762,10.94
2763,10.86
2764,10.67
2765,10.38
2766,9.93
2767,9.42
2768,8.91
2769,8.49
2770,8.16
2771,7.90
2772,7.70
2773,7.57
2774,7.53
2775,7.60
2776,7.76
2777,7.96
2778,8.18
2779,8.42
2780,8.74
2781,9.11
2782,9.53
2783,9.94
2784,10.42
2785,10.95
2786,11.53
2787,12.10
2788,12.68
2789,13.24
2790,13.76
2791,14.18
2792,14.49
2793,14.70
2794,14.79
2795,14.71
2796,14.41
2797,13.92
2798,13.18
2799,12.25
2800,11.15
2801,10.00
2802,8.81
2803,7.72
2804,6.68
2805,5.79
2806,4.93
2807,4.17
2808,3.41
2809,2.72
2810,2.03
2811,1.42
2812,0.82
2813,0.34
2814,-0.08
2815,-0.40
2816,-0.72
2817,-1.02
2818,-1.37
2819,-1.69
2820,-2.02
2821,-2.29
2822,-2.45
2823,-2.44
2824,-2.31
2825,-2.12
2826,-1.98
2827,-1.91
2828,-1.94
2829,-2.03
2830,-2.18
2831,-2.36
2832,-2.52
2833,-2.58
2834,-2.49
2835,-2.28
2836,-2.00
2837,-1.73
2838,-1.52
2839,-1.40
2840,-1.39
2841,-1.53
2842,-1.75
2843,-2.07
2844,-2.36
2845,-2.59
2846,-2.65
2847,-2.55
2848,-2.20
2849,-1.68
2850,-0.95
2851,-0.09
2852,0.91
2853,1.95
2854,3.04
2855,4.08
2856,5.18
2857,6.26
2858,7.41
2859,8.50
2860,9.56
2861,10.47
2862,11.30
2863,11.99
2864,12.63
2865,13.15
2866,13.63
2867,14.02
2868,14.42
2869,14.79
2870,15.19
2871,15.51
2872,15.75
2873,15.86
2874,15.91
2875,15.93
2876,15.95
2877,15.99
2878,16.03
2879,16.07
2880,16.04
2881,15.90
2882,15.59
2883,15.14
2884,14.59
2885,14.00
2886,13.34
2887,12.70
2888,12.07
2889,11.57
2890,11.14
2891,10.81
2892,10.48
2893,10.17
2894,9.77
2895,9.35
2896,8.85
2897,8.35
2898,7.77
2899,7.23
2900,6.72
2901,6.35
2902,6.00
2903,5.71
2904,5.36
2905,5.02
2906,4.55
2907,4.03
2908,3.35
2909,2.62
2910,1.74
2911,0.84
2912,-0.12
2913,-1.03
2914,-1.98
2915,-2.91
2916,-3.92
2917,-4.95
2918,-6.04
2919,-7.10
2920,-8.16
2921,-9.07
2922,-9.86
2923,-10.42
2924,-10.76
2925,-10.83
2926,-10.72
2927,-10.44
2928,-10.05
2929,-9.57
2930,-9.05
2931,-8.52
2932,-8.06
2933,-7.74
2934,-7.58
2935,-7.59
2936,-7.68
2937,-7.83
2938,-7.91
2939,-7.87
2940,-7.53
2941,-6.92
2942,-6.04
2943,-5.07
2944,-3.99
2945,-2.93
2946,-1.87
2947,-0.96
2948,-0.17
2949,0.50
2950,1.17
2951,1.87
2952,2.66
2953,3.39
2954,4.07
2955,4.55
2956,4.91
2957,5.04
2958,5.15
2959,5.20
2960,5.39
2961,5.74
2962,6.45
2963,7.44
2964,8.78
2965,10.33
2966,12.07
2967,13.82
2968,15.54
2969,17.03
2970,18.26
2971,19.07
2972,19.52
2973,19.56
2974,19.33
2975,18.88
2976,18.39
2977,17.98
2978,17.81
2979,17.85
2980,18.01
2981,18.17
2982,18.21
2983,18.10
2984,17.79
2985,17.32
2986,16.68
2987,16.00
2988,15.34
2989,14.77
2990,14.27
2991,13.83
2992,13.40
2993,12.96
2994,12.45
2995,11.91
2996,11.40
2997,11.04
2998,10.89
2999,11.02
3000,11.38
3001,11.97
3002,12.68
3003,13.41
3004,14.02
3005,14.41
3006,14.56
3007,14.47
3008,14.15
3009,13.70
3010,13.22
3011,12.83
3012,12.57
3013,12.45
3014,12.46
3015,12.53
3016,12.57
3017,12.51
3018,12.33
3019,12.07
3020,11.73
3021,11.40
3022,11.12
3023,11.01
3024,11.05
3025,11.22
3026,11.38
3027,11.49
3028,11.44
3029,11.21
3030,10.73
3031,10.05
3032,9.19
3033,8.25
3034,7.34
3035,6.61
3036,6.18
3037,6.08
3038,6.32
3039,6.81
3040,7.48
3041,8.22
3042,8.97
3043,9.65
3044,10.32
3045,10.99
3046,11.75
3047,12.57
3048,13.50
3049,14.43
3050,15.30
3051,16.01
3052,16.55
3053,16.82
3054,16.91
3055,16.84
3056,16.75
3057,16.70
3058,16.78
3059,16.98
3060,17.34
3061,17.76
3062,18.17
3063,18.47
3064,18.63
3065,18.66
3066,18.56
3067,18.35
3068,18.05
3069,17.75
3070,17.50
3071,17.36
3072,17.30
3073,17.28
3074,17.21
3075,17.05
3076,16.70
3077,16.13
3078,15.34
3079,14.47
3080,13.66
3081,13.08
3082,12.79
3083,12.87
3084,13.28
3085,14.01
3086,14.80
3087,15.47
3088,15.73
3089,15.52
3090,14.74
3091,13.55
3092,12.00
3093,10.39
3094,8.85
3095,7.67
3096,6.84
3097,6.40
3098,6.10
3099,5.81
3100,5.29
3101,4.52
3102,3.35
3103,1.92
3104,0.30
3105,-1.21
3106,-2.53
3107,-3.47
3108,-4.13
3109,-4.48
3110,-4.68
3111,-4.84
3112,-5.15
3113,-5.65
3114,-6.31
3115,-6.97
3116,-7.57
3117,-7.97
3118,-8.08
3119,-7.84
3120,-7.26
3121,-6.43
3122,-5.51
3123,-4.64
3124,-3.87
3125,-3.26
3126,-2.74
3127,-2.32
3128,-1.86
3129,-1.37
3130,-0.76
3131,-0.11
3132,0.56
3133,1.17
3134,1.79
3135,2.33
3136,2.88
3137,3.36
3138,3.89
3139,4.45
3140,5.09
3141,5.70
3142,6.27
3143,6.71
3144,7.07
3145,7.31
3146,7.52
3147,7.71
3148,8.05
3149,8.50
3150,9.12
3151,9.83
3152,10.66
3153,11.49
3154,12.28
3155,12.92
3156,13.47
3157,13.90
3158,14.27
3159,14.53
3160,14.72
3161,14.86
3162,15.01
3163,15.12
3164,15.20
3165,15.20
3166,15.14
3167,15.08
3168,15.01
3169,14.92
3170,14.80
3171,14.69
3172,14.59
3173,14.51
3174,14.37
3175,14.14
3176,13.78
3177,13.36
3178,12.94
3179,12.59
3180,12.28
3181,12.05
3182,11.87
3183,11.77
3184,11.64
3185,11.43
3186,10.99
3187,10.38
3188,9.58
3189,8.72
3190,7.81
3191,7.00
3192,6.25
3193,5.64
3194,5.07
3195,4.56
3196,4.00
3197,3.42
3198,2.75
3199,2.10
3200,1.49
3201,1.05
3202,0.75
3203,0.63
3204,0.56
3205,0.52
3206,0.38
3207,0.14
3208,-0.19
3209,-0.58
3210,-1.01
3211,-1.40
3212,-1.70
3213,-1.83
3214,-1.72
3215,-1.39
3216,-0.86
3217,-0.24
3218,0.46
3219,1.20
3220,1.99
3221,2.73
3222,3.42
3223,3.97
3224,4.46
3225,4.89
3226,5.33
3227,5.73
3228,6.18
3229,6.64
3230,7.17
3231,7.67
3232,8.12
3233,8.44
3234,8.69
3235,8.85
3236,8.99
3237,9.09
3238,9.25
3239,9.45
3240,9.72
3241,9.99
3242,10.24
3243,10.41
3244,10.51
3245,10.47
3246,10.32
3247,10.10
3248,9.89
3249,9.70
3250,9.56
3251,9.44
3252,9.36
3253,9.35
3254,9.46
3255,9.67
3256,9.98
3257,10.40
3258,10.93
3259,11.53
3260,12.13
3261,12.67
3262,13.11
3263,13.37
3264,13.46
3265,13.32
3266,13.06
3267,12.73
3268,12.41
3269,12.13
3270,11.95
3271,11.91
3272,12.04
3273,12.32
3274,12.65
3275,12.91
3276,12.97
3277,12.81
3278,12.36
3279,11.74
3280,10.96
3281,10.16
3282,9.37
3283,8.68
3284,8.00
3285,7.33
3286,6.56
3287,5.72
3288,4.70
3289,3.58
3290,2.34
3291,1.17
3292,0.15
3293,-0.59
3294,-1.07
3295,-1.29
3296,-1.34
3297,-1.23
3298,-1.07
3299,-0.85
3300,-0.61
3301,-0.34
3302,-0.05
3303,0.29
3304,0.66
3305,1.01
3306,1.34
3307,1.61
3308,1.82
3309,1.94
3310,1.95
3311,1.85
3312,1.72
3313,1.59
3314,1.49
3315,1.42
3316,1.45
3317,1.63
3318,1.97
3319,2.40
3320,2.81
3321,3.10
3322,3.25
3323,3.21
3324,3.02
3325,2.67
3326,2.30
3327,1.99
3328,1.96
3329,2.27
3330,3.02
3331,4.08
3332,5.44
3333,6.89
3334,8.45
3335,9.92
3336,11.33
3337,12.53
3338,13.63
3339,14.58
3340,15.55
3341,16.44
3342,17.37
3343,18.23
3344,19.14
3345,19.95
3346,20.72
3347,21.30
3348,21.74
3349,21.96
3350,22.04
3351,22.00
3352,21.92
3353,21.85
3354,21.87
3355,21.95
3356,22.09
3357,22.25
3358,22.38
3359,22.42
3360,22.27
3361,21.95
3362,21.48
3363,20.94
3364,20.32
3365,19.68
3366,19.01
3367,18.39
3368,17.76
3369,17.18
3370,16.62
3371,16.14
3372,15.61
3373,15.12
3374,14.64
3375,14.27
3376,13.93
3377,13.69
3378,13.47
3379,13.31
3380,13.07
3381,12.74
3382,12.19
3383,11.49
3384,10.62
3385,9.70
3386,8.72
3387,7.81
3388,6.96
3389,6.26
3390,5.65
3391,5.20
3392,4.81
3393,4.52
3394,4.26
3395,4.02
3396,3.69
3397,3.33
3398,2.84
3399,2.32
3400,1.71
3401,1.05
3402,0.33
3403,-0.37
3404,-1.04
3405,-1.61
3406,-2.11
3407,-2.53
3408,-2.82
3409,-3.01
3410,-3.11
3411,-3.10
3412,-2.96
3413,-2.73
3414,-2.46
3415,-2.19
3416,-1.87
3417,-1.50
3418,-1.02
3419,-0.50
3420,0.14
3421,0.87
3422,1.74
3423,2.66
3424,3.64
3425,4.52
3426,5.30
3427,5.91
3428,6.44
3429,6.87
3430,7.29
3431,7.67
3432,8.07
3433,8.45
3434,8.78
3435,8.99
3436,9.07
3437,9.00
3438,8.83
3439,8.57
3440,8.34
3441,8.20
3442,8.26
3443,8.46
3444,8.78
3445,9.12
3446,9.41
3447,9.62
3448,9.76
3449,9.86
3450,10.03
3451,10.28
3452,10.69
3453,11.21
3454,11.76
3455,12.22
3456,12.47
3457,12.44
3458,12.13
3459,11.60
3460,10.88
3461,10.07
3462,9.22
3463,8.48
3464,7.87
3465,7.45
3466,7.08
3467,6.77
3468,6.43
3469,6.07
3470,5.53
3471,4.83
3472,3.90
3473,2.88
3474,1.88
3475,1.01
3476,0.32
3477,-0.09
3478,-0.23
3479,-0.07
3480,0.32
3481,0.84
3482,1.40
3483,1.91
3484,2.33
3485,2.66
3486,2.91
3487,3.16
3488,3.38
3489,3.59
3490,3.78
3491,3.91
3492,3.94
3493,3.82
3494,3.52
3495,3.04
3496,2.41
3497,1.72
3498,1.00
3499,0.29
3500,-0.40
3501,-1.03
3502,-1.59
3503,-2.07
3504,-2.46
3505,-2.76
3506,-2.95
3507,-3.01
3508,-2.94
3509,-2.75
3510,-2.52
3511,-2.30
3512,-2.17
3513,-2.14
3514,-2.20
3515,-2.37
3516,-2.56
3517,-2.76
3518,-2.82
3519,-2.72
3520,-2.41
3521,-1.98
3522,-1.37
3523,-0.63
3524,0.28
3525,1.31
3526,2.49
3527,3.74
3528,5.05
3529,6.29
3530,7.45
3531,8.37
3532,9.07
3533,9.49
3534,9.76
3535,9.88
3536,10.01
3537,10.16
3538,10.47
3539,10.87
3540,11.40
3541,11.91
3542,12.34
3543,12.63
3544,12.81
3545,12.89
3546,12.92
3547,12.92
3548,12.93
3549,12.99
3550,13.08
3551,13.15
3552,13.13
3553,12.99
3554,12.70
3555,12.25
3556,11.63
3557,10.87
3558,10.06
3559,9.32
3560,8.67
3561,8.19
3562,7.90
3563,7.87
3564,8.00
3565,8.26
3566,8.51
3567,8.72
3568,8.74
3569,8.56
3570,8.02
3571,7.20
3572,6.10
3573,4.89
3574,3.55
3575,2.24
3576,1.00
3577,0.00
3578,-0.80
3579,-1.36
3580,-1.86
3581,-2.27
3582,-2.75
3583,-3.23
3584,-3.85
3585,-4.55
3586,-5.36
3587,-6.16
3588,-6.96
3589,-7.71
3590,-8.49
3591,-9.26
3592,-10.05
3593,-10.79
3594,-11.49
3595,-12.05
3596,-12.44
3597,-12.60
3598,-12.53
3599,-12.25
3600,-11.79
3601,-11.22
3602,-10.62
3603,-10.03
3604,-9.39
3605,-8.75
3606,-8.06
3607,-7.35
3608,-6.58
3609,-5.78
3610,-4.94
3611,-4.19
3612,-3.46
3613,-2.85
3614,-2.30
3615,-1.90
3616,-1.59
3617,-1.40
3618,-1.22
3619,-1.08
3620,-0.85
3621,-0.60
3622,-0.21
3623,0.21
3624,0.71
3625,1.21
3626,1.77
3627,2.29
3628,2.76
3629,3.11
3630,3.43
3631,3.77
3632,4.20
3633,4.67
3634,5.23
3635,5.81
3636,6.43
3637,7.00
3638,7.51
3639,7.89
3640,8.13
3641,8.25
3642,8.32
3643,8.33
3644,8.31
3645,8.25
3646,8.21
3647,8.23
3648,8.28
3649,8.32
3650,8.32
3651,8.34
3652,8.32
3653,8.24
3654,7.99
3655,7.61
3656,7.15
3657,6.65
3658,6.04
3659,5.40
3660,4.73
3661,4.11
3662,3.47
3663,2.85
3664,2.17
3665,1.53
3666,0.84
3667,0.20
3668,-0.43
3669,-0.92
3670,-1.33
3671,-1.59
3672,-1.85
3673,-2.07
3674,-2.37
3675,-2.80
3676,-3.46
3677,-4.33
3678,-5.36
3679,-6.41
3680,-7.41
3681,-8.21
3682,-8.79
3683,-9.07
3684,-9.12
3685,-9.01
3686,-8.90
3687,-8.83
3688,-8.82
3689,-8.86
3690,-8.95
3691,-9.05
3692,-9.03
3693,-8.80
3694,-8.33
3695,-7.68
3696,-6.84
3697,-5.92
3698,-4.94
3699,-4.05
3700,-3.27
3701,-2.66
3702,-2.12
3703,-1.68
3704,-1.20
3705,-0.67
3706,0.01
3707,0.77
3708,1.60
3709,2.37
3710,3.07
3711,3.57
3712,3.86
3713,3.87
3714,3.72
3715,3.52
3716,3.43
3717,3.55
3718,3.88
3719,4.33
3720,4.83
3721,5.23
3722,5.42
3723,5.33
3724,4.95
3725,4.30
3726,3.51
3727,2.75
3728,2.19
3729,1.91
3730,1.91
3731,2.11
3732,2.41
3733,2.66
3734,2.72
3735,2.57
3736,2.24
3737,1.85
3738,1.48
3739,1.23
3740,1.19
3741,1.43
3742,1.95
3743,2.65
3744,3.37
3745,4.01
3746,4.52
3747,4.88
3748,5.07
3749,5.16
3750,5.21
3751,5.36
3752,5.63
3753,6.00
3754,6.36
3755,6.62
3756,6.68
3757,6.51
3758,6.04
3759,5.36
3760,4.52
3761,3.64
3762,2.78
3763,2.05
3764,1.44
3765,0.98
3766,0.54
3767,0.12
3768,-0.38
3769,-0.95
3770,-1.61
3771,-2.25
3772,-2.85
3773,-3.30
3774,-3.60
3775,-3.74
3776,-3.75
3777,-3.68
3778,-3.63
3779,-3.62
3780,-3.65
3781,-3.70
3782,-3.72
3783,-3.62
3784,-3.36
3785,-2.88
3786,-2.24
3787,-1.51
3788,-0.77
3789,-0.11
3790,0.42
3791,0.71
3792,0.76
3793,0.57
3794,0.22
3795,-0.21
3796,-0.62
3797,-0.97
3798,-1.16
3799,-1.16
3800,-0.95
3801,-0.63
3802,-0.25
3803,0.10
3804,0.47
3805,0.77
3806,1.05
3807,1.27
3808,1.57
3809,1.95
3810,2.56
3811,3.31
3812,4.32
3813,5.42
3814,6.70
3815,7.99
3816,9.39
3817,10.73
3818,12.08
3819,13.27
3820,14.46
3821,15.56
3822,16.66
3823,17.66
3824,18.65
3825,19.49
3826,20.22
3827,20.74
3828,21.13
3829,21.32
3830,21.36
3831,21.26
3832,21.12
3833,20.92
3834,20.71
3835,20.50
3836,20.34
3837,20.22
3838,20.10
3839,20.03
3840,20.00
3841,20.07
3842,20.16
3843,20.26
3844,20.31
3845,20.30
3846,20.10
3847,19.71
3848,19.04
3849,18.15
3850,17.02
3851,15.77
3852,14.45
3853,13.23
3854,12.14
3855,11.28
3856,10.64
3857,10.27
3858,10.09
3859,10.09
3860,10.09
3861,10.09
3862,9.98
3863,9.79
3864,9.42
3865,8.97
3866,8.38
3867,7.77
3868,7.07
3869,6.38
3870,5.65
3871,4.94
3872,4.20
3873,3.51
3874,2.80
3875,2.16
3876,1.51
3877,0.90
3878,0.27
3879,-0.31
3880,-0.90
3881,-1.43
3882,-1.92
3883,-2.30
3884,-2.58
3885,-2.72
3886,-2.78
3887,-2.76
3888,-2.74
3889,-2.71
3890,-2.69
3891,-2.66
3892,-2.59
3893,-2.48
3894,-2.30
3895,-2.07
3896,-1.75
3897,-1.41
3898,-0.99
3899,-0.53
3900,0.05
3901,0.69
3902,1.43
3903,2.17
3904,2.95
3905,3.68
3906,4.36
3907,4.93
3908,5.42
3909,5.82
3910,6.19
3911,6.48
3912,6.75
3913,6.94
3914,7.04
3915,6.98
3916,6.78
3917,6.43
3918,6.02
3919,5.58
3920,5.27
3921,5.17
3922,5.37
3923,5.91
3924,6.75
3925,7.82
3926,8.98
3927,10.06
3928,10.93
3929,11.47
3930,11.66
3931,11.47
3932,10.93
3933,10.19
3934,9.35
3935,8.57
3936,7.87
3937,7.31
3938,6.91
3939,6.72
3940,6.64
3941,6.62
3942,6.56
3943,6.47
3944,6.23
3945,5.85
3946,5.28
3947,4.61
3948,3.84
3949,3.10
3950,2.35
3951,1.65
3952,0.97
3953,0.37
3954,-0.14
3955,-0.53
3956,-0.78
3957,-0.91
3958,-0.91
3959,-0.72
3960,-0.31
3961,0.25
3962,0.89
3963,1.53
3964,2.15
3965,2.75
3966,3.28
3967,3.73
3968,4.12
3969,4.47
3970,4.80
3971,5.07
3972,5.28
3973,5.36
3974,5.30
3975,5.09
3976,4.79
3977,4.44
3978,4.10
3979,3.85
3980,3.70
3981,3.68
3982,3.69
3983,3.71
3984,3.69
3985,3.66
3986,3.58
3987,3.46
3988,3.31
3989,3.14
3990,2.90
3991,2.57
3992,2.15
3993,1.66
3994,1.14
3995,0.66
3996,0.30
3997,0.13
3998,0.26
3999,0.63
4000,1.26
4001,2.07
4002,3.04
4003,4.07
4004,5.17
4005,6.26
4006,7.43
4007,8.61
4008,9.79
4009,10.80
4010,11.66
4011,12.27
4012,12.66
4013,12.79
4014,12.76
4015,12.64
4016,12.60
4017,12.65
4018,12.83
4019,13.07
4020,13.35
4021,13.65
4022,13.95
4023,14.23
4024,14.43
4025,14.56
4026,14.57
4027,14.43
4028,14.08
4029,13.58
4030,12.95
4031,12.28
4032,11.61
4033,11.00
4034,10.45
4035,9.98
4036,9.51
4037,9.06
4038,8.56
4039,8.06
4040,7.51
4041,7.06
4042,6.81
4043,6.85
4044,7.08
4045,7.45
4046,7.79
4047,8.03
4048,7.95
4049,7.52
4050,6.69
4051,5.62
4052,4.37
4053,3.15
4054,1.98
4055,1.02
4056,0.24
4057,-0.33
4058,-0.86
4059,-1.39
4060,-2.10
4061,-2.94
4062,-4.02
4063,-5.17
4064,-6.39
4065,-7.54
4066,-8.64
4067,-9.57
4068,-10.41
4069,-11.11
4070,-11.76
4071,-12.37
4072,-13.03
4073,-13.64
4074,-14.21
4075,-14.60
4076,-14.77
4077,-14.64
4078,-14.25
4079,-13.66
4080,-13.02
4081,-12.47
4082,-12.12
4083,-12.01
4084,-12.10
4085,-12.33
4086,-12.56
4087,-12.73
4088,-12.71
4089,-12.48
4090,-11.99
4091,-11.34
4092,-10.58
4093,-9.84
4094,-9.10
4095,-8.44
4096,-7.80
4097,-7.23
4098,-6.58
4099,-5.88
4100,-5.06
4101,-4.23
4102,-3.41
4103,-2.74
4104,-2.19
4105,-1.88
4106,-1.74
4107,-1.81
4108,-1.90
4109,-1.96
4110,-1.81
4111,-1.44
4112,-0.78
4113,0.08
4114,1.13
4115,2.20
4116,3.22
4117,4.04
4118,4.72
4119,5.23
4120,5.68
4121,6.06
4122,6.43
4123,6.81
4124,7.24
4125,7.65
4126,8.02
4127,8.25
4128,8.37
4129,8.36
4130,8.25
4131,8.04
4132,7.77
4133,7.50
4134,7.27
4135,7.12
4136,7.03
4137,6.98
4138,6.92
4139,6.84
4140,6.69
4141,6.50
4142,6.21
4143,5.83
4144,5.29
4145,4.65
4146,3.92
4147,3.23
4148,2.61
4149,2.14
4150,1.82
4151,1.69
4152,1.66
4153,1.75
4154,1.81
4155,1.80
4156,1.60
4157,1.23
4158,0.62
4159,-0.15
4160,-1.07
4161,-1.99
4162,-2.88
4163,-3.62
4164,-4.23
4165,-4.69
4166,-5.08
4167,-5.40
4168,-5.71
4169,-6.00
4170,-6.30
4171,-6.59
4172,-6.88
4173,-7.10
4174,-7.17
4175,-7.08
4176,-6.84
4177,-6.48
4178,-5.99
4179,-5.40
4180,-4.75
4181,-4.11
4182,-3.56
4183,-3.12
4184,-2.75
4185,-2.43
4186,-2.11
4187,-1.83
4188,-1.51
4189,-1.17
4190,-0.73
4191,-0.25
4192,0.25
4193,0.69
4194,1.08
4195,1.37
4196,1.58
4197,1.67
4198,1.63
4199,1.48
4200,1.24
4201,0.97
4202,0.68
4203,0.35
4204,-0.02
4205,-0.41
4206,-0.79
4207,-1.11
4208,-1.40
4209,-1.67
4210,-1.92
4211,-2.11
4212,-2.17
4213,-2.05
4214,-1.75
4215,-1.31
4216,-0.73
4217,-0.10
4218,0.53
4219,1.06
4220,1.51
4221,1.85
4222,2.17
4223,2.46
4224,2.78
4225,3.12
4226,3.55
4227,3.98
4228,4.44
4229,4.83
4230,5.14
4231,5.34
4232,5.49
4233,5.62
4234,5.83
4235,6.10
4236,6.38
4237,6.61
4238,6.74
4239,6.73
4240,6.56
4241,6.27
4242,5.87
4243,5.38
4244,4.80
4245,4.19
4246,3.59
4247,3.01
4248,2.41
4249,1.82
4250,1.30
4251,0.90
4252,0.62
4253,0.48
4254,0.50
4255,0.65
4256,0.85
4257,1.05
4258,1.19
4259,1.34
4260,1.50
4261,1.68
4262,1.89
4263,2.16
4264,2.49
4265,2.89
4266,3.28
4267,3.56
4268,3.66
4269,3.59
4270,3.41
4271,3.16
4272,2.89
4273,2.65
4274,2.49
4275,2.44
4276,2.45
4277,2.48
4278,2.50
4279,2.54
4280,2.57
4281,2.54
4282,2.41
4283,2.20
4284,1.96
4285,1.71
4286,1.45
4287,1.14
4288,0.87
4289,0.67
4290,0.63
4291,0.74
4292,1.05
4293,1.51
4294,2.18
4295,2.98
4296,3.91
4297,4.88
4298,5.94
4299,6.99
4300,8.12
4301,9.20
4302,10.29
4303,11.28
4304,12.28
4305,13.15
4306,13.95
4307,14.60
4308,15.15
4309,15.57
4310,15.95
4311,16.26
4312,16.61
4313,17.01
4314,17.52
4315,18.04
4316,18.48
4317,18.78
4318,18.93
4319,18.90
4320,18.66
4321,18.23
4322,17.69
4323,17.19
4324,16.77
4325,16.49
4326,16.24
4327,16.00
4328,15.64
4329,15.14
4330,14.42
4331,13.56
4332,12.60
4333,11.67
4334,10.80
4335,10.13
4336,9.67
4337,9.49
4338,9.42
4339,9.46
4340,9.44
4341,9.38
4342,9.13
4343,8.77
4344,8.21
4345,7.57
4346,6.79
4347,6.00
4348,5.18
4349,4.46
4350,3.77
4351,3.13
4352,2.43
4353,1.74
4354,0.98
4355,0.18
4356,-0.73
4357,-1.67
4358,-2.62
4359,-3.42
4360,-4.10
4361,-4.55
4362,-4.82
4363,-4.86
4364,-4.81
4365,-4.73
4366,-4.73
4367,-4.81
4368,-5.01
4369,-5.31
4370,-5.67
4371,-5.97
4372,-6.15
4373,-6.11
4374,-5.89
4375,-5.55
4376,-5.19
4377,-4.85
4378,-4.58
4379,-4.41
4380,-4.34
4381,-4.38
4382,-4.43
4383,-4.45
4384,-4.36
4385,-4.15
4386,-3.81
4387,-3.42
4388,-3.05
4389,-2.81
4390,-2.71
4391,-2.78
4392,-2.99
4393,-3.30
4394,-3.62
4395,-3.90
4396,-4.08
4397,-4.18
4398,-4.16
4399,-4.09
4400,-3.92
4401,-3.72
4402,-3.43
4403,-3.03
4404,-2.43
4405,-1.67
4406,-0.69
4407,0.40
4408,1.63
4409,2.85
4410,4.00
4411,4.89
4412,5.51
4413,5.78
4414,5.84
4415,5.71
4416,5.61
4417,5.58
4418,5.78
4419,6.20
4420,6.84
4421,7.57
4422,8.22
4423,8.62
4424,8.67
4425,8.37
4426,7.74
4427,6.93
4428,6.06
4429,5.30
4430,4.74
4431,4.39
4432,4.20
4433,4.13
4434,4.08
4435,4.04
4436,3.89
4437,3.67
4438,3.32
4439,2.90
4440,2.41
4441,1.91
4442,1.42
4443,1.00
4444,0.65
4445,0.45
4446,0.41
4447,0.51
4448,0.66
4449,0.79
4450,0.86
4451,0.90
4452,0.84
4453,0.70
4454,0.48
4455,0.28
4456,0.08
4457,-0.11
4458,-0.41
4459,-0.85
4460,-1.45
4461,-2.17
4462,-2.98
4463,-3.79
4464,-4.53
4465,-5.07
4466,-5.37
4467,-5.46
4468,-5.39
4469,-5.23
4470,-5.04
4471,-4.88
4472,-4.84
4473,-4.94
4474,-5.10
4475,-5.26
4476,-5.33
4477,-5.25
4478,-4.97
4479,-4.50
4480,-3.81
4481,-3.05
4482,-2.25
4483,-1.54
4484,-0.85
4485,-0.26
4486,0.35
4487,0.99
4488,1.81
4489,2.80
4490,4.00
4491,5.26
4492,6.52
4493,7.55
4494,8.27
4495,8.53
4496,8.43
4497,8.01
4498,7.43
4499,6.81
4500,6.38
4501,6.26
4502,6.55
4503,7.13
4504,7.87
4505,8.59
4506,9.09
4507,9.28
4508,9.08
4509,8.58
4510,7.81
4511,6.94
4512,6.05
4513,5.31
4514,4.72
4515,4.30
4516,3.89
4517,3.46
4518,2.92
4519,2.33
4520,1.67
4521,1.02
4522,0.40
4523,0.01
4524,-0.18
4525,-0.10
4526,0.11
4527,0.38
4528,0.54
4529,0.53
4530,0.21
4531,-0.41
4532,-1.31
4533,-2.35
4534,-3.50
4535,-4.63
4536,-5.71
4537,-6.59
4538,-7.31
4539,-7.83
4540,-8.25
4541,-8.56
4542,-8.86
4543,-9.10
4544,-9.38
4545,-9.67
4546,-10.03
4547,-10.31
4548,-10.51
4549,-10.57
4550,-10.56
4551,-10.52
4552,-10.45
4553,-10.40
4554,-10.38
4555,-10.48
4556,-10.61
4557,-10.73
4558,-10.69
4559,-10.46
4560,-9.97
4561,-9.27
4562,-8.32
4563,-7.29
4564,-6.20
4565,-5.23
4566,-4.36
4567,-3.64
4568,-2.94
4569,-2.30
4570,-1.66
4571,-1.05
4572,-0.37
4573,0.29
4574,1.00
4575,1.64
4576,2.28
4577,2.85
4578,3.43
4579,3.97
4580,4.60
4581,5.20
4582,5.84
4583,6.42
4584,7.03
4585,7.60
4586,8.17
4587,8.66
4588,9.19
4589,9.76
4590,10.45
4591,11.18
4592,12.02
4593,12.87
4594,13.76
4595,14.59
4596,15.37
4597,16.01
4598,16.57
4599,17.01
4600,17.37
4601,17.65
4602,17.92
4603,18.13
4604,18.28
4605,18.30
4606,18.21
4607,18.02
4608,17.79
4609,17.56
4610,17.29
4611,17.03
4612,16.78
4613,16.57
4614,16.37
4615,16.14
4616,15.85
4617,15.53
4618,15.15
4619,14.78
4620,14.37
4621,14.02
4622,13.72
4623,13.50
4624,13.26
4625,13.02
4626,12.66
4627,12.26
4628,11.74
4629,11.16
4630,10.46
4631,9.78
4632,9.16
4633,8.74
4634,8.41
4635,8.17
4636,7.87
4637,7.54
4638,7.06
4639,6.45
4640,5.59
4641,4.59
4642,3.50
4643,2.49
4644,1.56
4645,0.79
4646,0.18
4647,-0.23
4648,-0.50
4649,-0.63
4650,-0.70
4651,-0.76
4652,-0.84
4653,-0.90
4654,-0.91
4655,-0.85
4656,-0.73
4657,-0.53
4658,-0.16
4659,0.37
4660,1.04
4661,1.75
4662,2.51
4663,3.26
4664,3.97
4665,4.57
4666,5.04
4667,5.35
4668,5.60
4669,5.82
4670,6.10
4671,6.36
4672,6.61
4673,6.75
4674,6.77
4675,6.65
4676,6.42
4677,6.11
4678,5.81
4679,5.58
4680,5.51
4681,5.58
4682,5.73
4683,5.86
4684,5.87
4685,5.71
4686,5.42
4687,5.04
4688,4.57
4689,4.14
4690,3.87
4691,3.83
4692,4.04
4693,4.41
4694,4.88
4695,5.33
4696,5.68
4697,5.88
4698,5.97
4699,5.98
4700,6.00
4701,6.09
4702,6.32
4703,6.68
4704,7.13
4705,7.57
4706,7.98
4707,8.31
4708,8.55
4709,8.67
4710,8.67
4711,8.61
4712,8.54
4713,8.48
4714,8.38
4715,8.25
4716,8.05
4717,7.79
4718,7.39
4719,6.93
4720,6.42
4721,5.94
4722,5.46
4723,5.00
4724,4.54
4725,4.08
4726,3.48
4727,2.72
4728,1.76
4729,0.72
4730,-0.41
4731,-1.47
4732,-2.44
4733,-3.21
4734,-3.80
4735,-4.17
4736,-4.40
4737,-4.51
4738,-4.59
4739,-4.67
4740,-4.76
4741,-4.79
4742,-4.71
4743,-4.50
4744,-4.18
4745,-3.75
4746,-3.26
4747,-2.75
4748,-2.30
4749,-2.00
4750,-1.85
4751,-1.86
4752,-1.98
4753,-2.16
4754,-2.37
4755,-2.55
4756,-2.66
4757,-2.72
4758,-2.75
4759,-2.82
4760,-2.91
4761,-3.07
4762,-3.27
4763,-3.52
4764,-3.75
4765,-3.91
4766,-3.97
4767,-3.92
4768,-3.70
4769,-3.40
4770,-2.96
4771,-2.43
4772,-1.72
4773,-0.94
4774,-0.05
4775,0.82
4776,1.82
4777,2.92
4778,4.23
4779,5.62
4780,7.13
4781,8.61
4782,10.06
4783,11.30
4784,12.31
4785,12.99
4786,13.38
4787,13.47
4788,13.40
4789,13.22
4790,13.10
4791,13.03
4792,13.04
4793,13.06
4794,13.11
4795,13.11
4796,13.03
4797,12.82
4798,12.49
4799,12.16
4800,11.89
4801,11.76
4802,11.70
4803,11.72
4804,11.74
4805,11.76
4806,11.65
4807,11.40
4808,10.92
4809,10.27
4810,9.45
4811,8.58
4812,7.72
4813,6.98
4814,6.34
4815,5.85
4816,5.46
4817,5.21
4818,5.02
4819,4.91
4820,4.82
4821,4.81
4822,4.81
4823,4.84
4824,4.74
4825,4.53
4826,4.11
4827,3.49
4828,2.59
4829,1.53
4830,0.37
4831,-0.70
4832,-1.66
4833,-2.40
4834,-2.91
4835,-3.17
4836,-3.27
4837,-3.27
4838,-3.31
4839,-3.42
4840,-3.68
4841,-4.03
4842,-4.43
4843,-4.79
4844,-5.13
4845,-5.39
4846,-5.55
4847,-5.58
4848,-5.52
4849,-5.36
4850,-5.11
4851,-4.79
4852,-4.40
4853,-4.03
4854,-3.63
4855,-3.25
4856,-2.85
4857,-2.47
4858,-2.08
4859,-1.72
4860,-1.27
4861,-0.74
4862,-0.08
4863,0.66
4864,1.50
4865,2.35
4866,3.23
4867,4.04
4868,4.72
4869,5.18
4870,5.46
4871,5.52
4872,5.52
4873,5.43
4874,5.37
4875,5.33
4876,5.38
4877,5.49
4878,5.68
4879,5.88
4880,6.10
4881,6.26
4882,6.42
4883,6.53
4884,6.63
4885,6.74
4886,6.97
4887,7.32
4888,7.80
4889,8.38
4890,9.01
4891,9.64
4892,10.19
4893,10.56
4894,10.68
4895,10.52
4896,10.12
4897,9.58
4898,9.00
4899,8.45
4900,7.99
4901,7.70
4902,7.58
4903,7.59
4904,7.59
4905,7.50
4906,7.23
4907,6.85
4908,6.32
4909,5.70
4910,5.00
4911,4.32
4912,3.64
4913,3.01
4914,2.45
4915,1.97
4916,1.57
4917,1.30
4918,1.18
4919,1.25
4920,1.48
4921,1.85
4922,2.28
4923,2.74
4924,3.17
4925,3.56
4926,3.89
4927,4.13
4928,4.29
4929,4.41
4930,4.51
4931,4.58
4932,4.55
4933,4.41
4934,4.11
4935,3.70
4936,3.19
4937,2.66
4938,2.11
4939,1.63
4940,1.22
4941,0.91
4942,0.64
4943,0.44
4944,0.25
4945,0.05
4946,-0.21
4947,-0.53
4948,-0.92
4949,-1.32
4950,-1.69
4951,-1.98
4952,-2.20
4953,-2.34
4954,-2.44
4955,-2.51
4956,-2.51
4957,-2.40
4958,-2.12
4959,-1.72
4960,-1.17
4961,-0.54
4962,0.19
4963,0.95
4964,1.73
4965,2.48
4966,3.25
4967,3.97
4968,4.66
4969,5.25
4970,5.81
4971,6.30
4972,6.74
4973,7.06
4974,7.33
4975,7.55
4976,7.75
4977,7.84
4978,7.82
4979,7.72
4980,7.62
4981,7.55
4982,7.55
4983,7.61
4984,7.75
4985,7.97
4986,8.20
4987,8.36
4988,8.37
4989,8.23
4990,7.93
4991,7.48
4992,6.89
4993,6.25
4994,5.55
4995,4.91
4996,4.24
4997,3.63
4998,3.04
4999,2.49
5000,1.88
5001,1.24
5002,0.52
5003,-0.13
5004,-0.68
5005,-1.02
5006,-1.23
5007,-1.26
5008,-1.23
5009,-1.14
5010,-1.17
5011,-1.39
5012,-1.93
5013,-2.72
5014,-3.71
5015,-4.72
5016,-5.73
5017,-6.55
5018,-7.19
5019,-7.55
5020,-7.78
5021,-7.95
5022,-8.29
5023,-8.82
5024,-9.69
5025,-10.77
5026,-12.00
5027,-13.16
5028,-14.18
5029,-14.88
5030,-15.31
5031,-15.46
5032,-15.50
5033,-15.50
5034,-15.64
5035,-15.95
5036,-16.38
5037,-16.83
5038,-17.20
5039,-17.36
5040,-17.25
5041,-16.82
5042,-16.09
5043,-15.16
5044,-14.14
5045,-13.18
5046,-12.31
5047,-11.64
5048,-11.17
5049,-10.92
5050,-10.78
5051,-10.74
5052,-10.69
5053,-10.61
5054,-10.42
5055,-10.11
5056,-9.60
5057,-8.99
5058,-8.26
5059,-7.52
5060,-6.77
5061,-6.16
5062,-5.70
5063,-5.48
5064,-5.39
5065,-5.46
5066,-5.52
5067,-5.62
5068,-5.55
5069,-5.34
5070,-4.84
5071,-4.10
5072,-3.13
5073,-2.04
5074,-0.82
5075,0.40
5076,1.57
5077,2.58
5078,3.40
5079,3.96
5080,4.30
5081,4.39
5082,4.38
5083,4.33
5084,4.40
5085,4.61
5086,4.93
5087,5.26
5088,5.57
5089,5.77
5090,5.85
5091,5.78
5092,5.61
5093,5.39
5094,5.21
5095,5.13
5096,5.13
5097,5.23
5098,5.38
5099,5.54
5100,5.62
5101,5.58
5102,5.32
5103,4.92
5104,4.36
5105,3.71
5106,2.91
5107,2.07
5108,1.16
5109,0.31
5110,-0.56
5111,-1.34
5112,-2.08
5113,-2.69
5114,-3.29
5115,-3.88
5116,-4.62
5117,-5.43
5118,-6.40
5119,-7.40
5120,-8.45
5121,-9.36
5122,-10.13
5123,-10.63
5124,-10.89
5125,-10.90
5126,-10.75
5127,-10.44
5128,-10.04
5129,-9.61
5130,-9.25
5131,-9.00
5132,-8.90
5133,-8.94
5134,-9.10
5135,-9.35
5136,-9.56
5137,-9.68
5138,-9.57
5139,-9.23
5140,-8.57
5141,-7.68
5142,-6.61
5143,-5.55
5144,-4.47
5145,-3.50
5146,-2.59
5147,-1.82
5148,-1.06
5149,-0.34
5150,0.47
5151,1.22
5152,1.96
5153,2.54
5154,3.04
5155,3.36
5156,3.64
5157,3.85
5158,4.15
5159,4.52
5160,5.00
5161,5.52
5162,6.03
5163,6.41
5164,6.61
5165,6.58
5166,6.36
5167,6.00
5168,5.63
5169,5.29
5170,5.09
5171,5.05
5172,5.18
5173,5.42
5174,5.76
5175,6.11
5176,6.46
5177,6.77
5178,7.13
5179,7.57
5180,8.14
5181,8.83
5182,9.63
5183,10.50
5184,11.40
5185,12.24
5186,12.94
5187,13.43
5188,13.66
5189,13.60
5190,13.25
5191,12.70
5192,12.05
5193,11.46
5194,10.96
5195,10.62
5196,10.35
5197,10.15
5198,9.81
5199,9.31
5200,8.46
5201,7.38
5202,6.05
5203,4.68
5204,3.29
5205,2.08
5206,1.05
5207,0.28
5208,-0.42
5209,-1.11
5210,-1.95
5211,-2.82
5212,-3.75
5213,-4.59
5214,-5.33
5215,-5.81
5216,-6.04
5217,-5.93
5218,-5.63
5219,-5.21
5220,-4.82
5221,-4.48
5222,-4.27
5223,-4.17
5224,-4.18
5225,-4.21
5226,-4.23
5227,-4.23
5228,-4.23
5229,-4.23
5230,-4.23
5231,-4.26
5232,-4.32
5233,-4.48
5234,-4.71
5235,-4.99
5236,-5.21
5237,-5.34
5238,-5.38
5239,-5.32
5240,-5.12
5241,-4.80
5242,-4.37
5243,-3.92
5244,-3.49
5245,-3.18
5246,-2.95
5247,-2.85
5248,-2.78
5249,-2.72
5250,-2.53
5251,-2.24
5252,-1.67
5253,-0.95
5254,-0.02
5255,0.98
5256,2.09
5257,3.20
5258,4.39
5259,5.50
5260,6.62
5261,7.67
5262,8.77
5263,9.81
5264,10.86
5265,11.76
5266,12.63
5267,13.34
5268,13.98
5269,14.44
5270,14.83
5271,15.14
5272,15.46
5273,15.81
5274,16.23
5275,16.68
5276,17.11
5277,17.45
5278,17.63
5279,17.60
5280,17.33
5281,16.86
5282,16.20
5283,15.48
5284,14.76
5285,14.11
5286,13.49
5287,12.91
5288,12.28
5289,11.64
5290,10.92
5291,10.15
5292,9.32
5293,8.56
5294,7.87
5295,7.42
5296,7.12
5297,7.03
5298,7.01
5299,7.08
5300,7.05
5301,6.94
5302,6.57
5303,6.00
5304,5.13
5305,4.11
5306,2.89
5307,1.63
5308,0.27
5309,-1.03
5310,-2.29
5311,-3.40
5312,-4.44
5313,-5.37
5314,-6.31
5315,-7.18
5316,-8.06
5317,-8.85
5318,-9.60
5319,-10.18
5320,-10.63
5321,-10.89
5322,-11.04
5323,-11.05
5324,-10.99
5325,-10.91
5326,-10.96
5327,-11.17
5328,-11.49
5329,-11.86
5330,-12.23
5331,-12.57
5332,-12.79
5333,-12.83
5334,-12.63
5335,-12.21
5336,-11.59
5337,-10.91
5338,-10.22
5339,-9.60
5340,-9.01
5341,-8.50
5342,-7.97
5343,-7.42
5344,-6.71
5345,-5.87
5346,-4.84
5347,-3.71
5348,-2.46
5349,-1.31
5350,-0.32
5351,0.36
5352,0.80
5353,1.01
5354,1.10
5355,1.11
5356,1.21
5357,1.39
5358,1.72
5359,2.08
5360,2.44
5361,2.64
5362,2.62
5363,2.38
5364,2.01
5365,1.59
5366,1.27
5367,1.11
5368,1.21
5369,1.54
5370,2.03
5371,2.56
5372,3.01
5373,3.30
5374,3.42
5375,3.35
5376,3.17
5377,2.95
5378,2.78
5379,2.66
5380,2.59
5381,2.57
5382,2.56
5383,2.51
5384,2.33
5385,2.02
5386,1.53
5387,0.93
5388,0.23
5389,-0.51
5390,-1.30
5391,-2.07
5392,-2.82
5393,-3.48
5394,-4.01
5395,-4.40
5396,-4.67
5397,-4.84
5398,-4.94
5399,-4.93
5400,-4.83
5401,-4.65
5402,-4.41
5403,-4.10
5404,-3.75
5405,-3.33
5406,-2.89
5407,-2.50
5408,-2.17
5409,-1.93
5410,-1.79
5411,-1.76
5412,-1.82
5413,-1.91
5414,-2.01
5415,-2.11
5416,-2.17
5417,-2.19
5418,-2.21
5419,-2.26
5420,-2.40
5421,-2.65
5422,-2.98
5423,-3.36
5424,-3.80
5425,-4.27
5426,-4.80
5427,-5.30
5428,-5.77
5429,-6.16
5430,-6.49
5431,-6.74
5432,-6.92
5433,-7.01
5434,-7.06
5435,-7.06
5436,-6.99
5437,-6.85
5438,-6.64
5439,-6.41
5440,-6.11
5441,-5.74
5442,-5.21
5443,-4.57
5444,-3.75
5445,-2.84
5446,-1.80
5447,-0.76
5448,0.24
5449,1.10
5450,1.85
5451,2.42
5452,2.89
5453,3.23
5454,3.56
5455,3.83
5456,4.14
5457,4.36
5458,4.53
5459,4.62
5460,4.66
5461,4.65
5462,4.62
5463,4.65
5464,4.80
5465,5.09
5466,5.50
5467,5.93
5468,6.29
5469,6.50
5470,6.50
5471,6.32
5472,6.03
5473,5.72
5474,5.45
5475,5.26
5476,5.23
5477,5.33
5478,5.47
5479,5.57
5480,5.58
5481,5.49
5482,5.29
5483,5.07
5484,4.81
5485,4.61
5486,4.46
5487,4.41
5488,4.40
5489,4.43
5490,4.36
5491,4.17
5492,3.75
5493,3.07
5494,2.08
5495,0.96
5496,-0.22
5497,-1.29
5498,-2.27
5499,-3.02
5500,-3.59
5501,-3.92
5502,-4.21
5503,-4.55
5504,-5.15
5505,-5.94
5506,-6.98
5507,-8.05
5508,-9.07
5509,-9.86
5510,-10.47
5511,-10.80
5512,-10.96
5513,-11.02
5514,-11.18
5515,-11.53
5516,-12.11
5517,-12.81
5518,-13.51
5519,-14.06
5520,-14.34
5521,-14.29
5522,-13.86
5523,-13.15
5524,-12.22
5525,-11.29
5526,-10.44
5527,-9.80
5528,-9.30
5529,-8.93
5530,-8.58
5531,-8.23
5532,-7.80
5533,-7.31
5534,-6.70
5535,-6.03
5536,-5.29
5537,-4.63
5538,-4.11
5539,-3.86
5540,-3.82
5541,-4.03
5542,-4.34
5543,-4.71
5544,-5.02
5545,-5.22
5546,-5.22
5547,-5.02
5548,-4.59
5549,-4.02
5550,-3.36
5551,-2.70
5552,-2.09
5553,-1.53
5554,-0.98
5555,-0.48
5556,-0.03
5557,0.36
5558,0.71
5559,0.98
5560,1.13
5561,1.12
5562,1.00
5563,0.78
5564,0.52
5565,0.24
5566,0.00
5567,-0.18
5568,-0.29
5569,-0.32
5570,-0.28
5571,-0.18
5572,-0.07
5573,0.05
5574,0.17
5575,0.25
5576,0.30
5577,0.30
5578,0.28
5579,0.24
5580,0.20
5581,0.14
5582,0.09
5583,0.02
5584,-0.05
5585,-0.15
5586,-0.21
5587,-0.18
5588,-0.05
5589,0.18
5590,0.55
5591,1.03
5592,1.56
5593,2.06
5594,2.41
5595,2.57
5596,2.49
5597,2.16
5598,1.56
5599,0.78
5600,-0.07
5601,-0.86
5602,-1.49
5603,-1.88
5604,-1.99
5605,-1.84
5606,-1.50
5607,-1.07
5608,-0.65
5609,-0.28
5610,-0.02
5611,0.13
5612,0.15
5613,0.11
5614,0.12
5615,0.26
5616,0.60
5617,1.13
5618,1.86
5619,2.69
5620,3.59
5621,4.36
5622,4.97
5623,5.31
5624,5.49
5625,5.58
5626,5.74
5627,6.03
5628,6.52
5629,7.17
5630,7.97
5631,8.70
5632,9.21
5633,9.36
5634,9.12
5635,8.58
5636,7.83
5637,7.03
5638,6.33
5639,5.89
5640,5.73
5641,5.81
5642,5.95
5643,6.00
5644,5.84
5645,5.45
5646,4.84
5647,4.18
5648,3.57
5649,3.16
5650,2.95
5651,2.94
5652,3.01
5653,3.09
5654,3.03
5655,2.77
5656,2.28
5657,1.63
5658,0.95
5659,0.40
5660,0.10
5661,0.07
5662,0.31
5663,0.76
5664,1.40
5665,2.08
5666,2.73
5667,3.27
5668,3.73
5669,4.14
5670,4.52
5671,4.88
5672,5.25
5673,5.67
5674,6.13
5675,6.58
5676,6.97
5677,7.25
5678,7.34
5679,7.23
5680,6.89
5681,6.39
5682,5.75
5683,5.07
5684,4.34
5685,3.59
5686,2.80
5687,2.04
5688,1.29
5689,0.55
5690,-0.25
5691,-1.01
5692,-1.70
5693,-2.21
5694,-2.56
5695,-2.70
5696,-2.62
5697,-2.31
5698,-1.91
5699,-1.50
5700,-1.14
5701,-0.85
5702,-0.65
5703,-0.55
5704,-0.53
5705,-0.57
5706,-0.64
5707,-0.70
5708,-0.71
5709,-0.66
5710,-0.53
5711,-0.38
5712,-0.22
5713,-0.08
5714,0.06
5715,0.18
5716,0.27
5717,0.30
5718,0.24
5719,0.10
5720,-0.12
5721,-0.37
5722,-0.60
5723,-0.82
5724,-0.97
5725,-1.05
5726,-0.97
5727,-0.74
5728,-0.34
5729,0.16
5730,0.78
5731,1.39
5732,2.01
5733,2.56
5734,3.14
5735,3.71
5736,4.36
5737,5.01
5738,5.84
5739,6.79
5740,7.99
5741,9.29
5742,10.70
5743,12.04
5744,13.25
5745,14.17
5746,14.79
5747,15.03
5748,15.04
5749,14.85
5750,14.66
5751,14.53
5752,14.56
5753,14.74
5754,15.01
5755,15.27
5756,15.41
5757,15.36
5758,15.05
5759,14.55
5760,13.86
5761,13.16
5762,12.44
5763,11.80
5764,11.15
5765,10.54
5766,9.91
5767,9.30
5768,8.63
5769,7.93
5770,7.16
5771,6.42
5772,5.70
5773,5.07
5774,4.43
5775,3.89
5776,3.39
5777,2.98
5778,2.58
5779,2.27
5780,2.02
5781,1.88
5782,1.77
5783,1.71
5784,1.63
5785,1.59
5786,1.43
5787,1.19
5788,0.79
5789,0.32
5790,-0.24
5791,-0.82
5792,-1.45
5793,-2.07
5794,-2.70
5795,-3.25
5796,-3.75
5797,-4.16
5798,-4.56
5799,-4.94
5800,-5.32
5801,-5.68
5802,-6.04
5803,-6.39
5804,-6.71
5805,-6.95
5806,-7.12
5807,-7.13
5808,-7.00
5809,-6.74
5810,-6.38
5811,-5.95
5812,-5.49
5813,-5.04
5814,-4.68
5815,-4.50
5816,-4.48
5817,-4.62
5818,-4.84
5819,-5.10
5820,-5.24
5821,-5.25
5822,-4.99
5823,-4.49
5824,-3.66
5825,-2.56
5826,-1.24
5827,0.17
5828,1.59
5829,2.90
5830,4.05
5831,4.91
5832,5.46
5833,5.69
5834,5.69
5835,5.49
5836,5.18
5837,4.78
5838,4.43
5839,4.13
5840,3.95
5841,3.89
5842,4.00
5843,4.23
5844,4.55
5845,4.92
5846,5.32
5847,5.73
5848,6.13
5849,6.46
5850,6.71
5851,6.82
5852,6.81
5853,6.69
5854,6.49
5855,6.25
5856,5.99
5857,5.78
5858,5.68
5859,5.74
5860,5.94
5861,6.20
5862,6.38
5863,6.42
5864,6.26
5865,5.91
5866,5.33
5867,4.59
5868,3.73
5869,2.92
5870,2.21
5871,1.63
5872,1.09
5873,0.63
5874,0.21
5875,-0.18
5876,-0.60
5877,-1.04
5878,-1.46
5879,-1.77
5880,-1.91
5881,-1.87
5882,-1.69
5883,-1.38
5884,-0.99
5885,-0.53
5886,-0.08
5887,0.34
5888,0.69
5889,0.97
5890,1.13
5891,1.14
5892,0.96
5893,0.60
5894,0.08
5895,-0.52
5896,-1.14
5897,-1.66
5898,-2.10
5899,-2.41
5900,-2.70
5901,-2.98
5902,-3.34
5903,-3.81
5904,-4.46
5905,-5.23
5906,-6.07
5907,-6.82
5908,-7.45
5909,-7.89
5910,-8.15
5911,-8.26
5912,-8.32
5913,-8.44
5914,-8.64
5915,-8.93
5916,-9.18
5917,-9.35
5918,-9.35
5919,-9.19
5920,-8.77
5921,-8.13
5922,-7.21
5923,-6.15
5924,-4.94
5925,-3.67
5926,-2.27
5927,-0.84
5928,0.70
5929,2.20
5930,3.70
5931,5.03
5932,6.22
5933,7.10
5934,7.84
5935,8.36
5936,8.90
5937,9.36
5938,9.91
5939,10.45
5940,11.12
5941,11.85
5942,12.69
5943,13.52
5944,14.31
5945,15.00
5946,15.56
5947,15.88
5948,15.93
5949,15.64
5950,15.03
5951,14.21
5952,13.28
5953,12.41
5954,11.67
5955,11.15
5956,10.77
5957,10.53
5958,10.28
5959,9.95
5960,9.36
5961,8.54
5962,7.46
5963,6.33
5964,5.24
5965,4.39
5966,3.75
5967,3.40
5968,3.17
5969,3.09
5970,2.92
5971,2.66
5972,2.14
5973,1.42
5974,0.43
5975,-0.63
5976,-1.72
5977,-2.66
5978,-3.51
5979,-4.22
5980,-4.93
5981,-5.58
5982,-6.35
5983,-7.18
5984,-8.23
5985,-9.41
5986,-10.73
5987,-11.98
5988,-13.11
5989,-13.95
5990,-14.58
5991,-14.94
5992,-15.17
5993,-15.30
5994,-15.44
5995,-15.64
5996,-15.97
5997,-16.35
5998,-16.74
5999,-16.98
6000,-17.04
6001,-16.88
6002,-16.56
6003,-16.13
6004,-15.68
6005,-15.36
6006,-15.18
6007,-15.17
6008,-15.20
6009,-15.19
6010,-15.01
6011,-14.61
6012,-13.89
6013,-12.94
6014,-11.83
6015,-10.76
6016,-9.77
6017,-9.00
6018,-8.43
6019,-8.08
6020,-7.76
6021,-7.41
6022,-6.84
6023,-6.14
6024,-5.30
6025,-4.48
6026,-3.65
6027,-2.99
6028,-2.44
6029,-2.08
6030,-1.74
6031,-1.39
6032,-0.84
6033,-0.12
6034,0.88
6035,2.03
6036,3.33
6037,4.57
6038,5.74
6039,6.71
6040,7.51
6041,8.05
6042,8.42
6043,8.61
6044,8.76
6045,8.88
6046,9.09
6047,9.31
6048,9.61
6049,9.93
6050,10.28
6051,10.64
6052,11.01
6053,11.38
6054,11.70
6055,11.98
6056,12.16
6057,12.26
6058,12.23
6059,12.05
6060,11.69
6061,11.16
6062,10.46
6063,9.62
6064,8.65
6065,7.67
6066,6.75
6067,6.01
6068,5.41
6069,5.02
6070,4.81
6071,4.79
6072,4.82
6073,4.88
6074,4.87
6075,4.86
6076,4.75
6077,4.57
6078,4.20
6079,3.69
6080,3.05
6081,2.34
6082,1.56
6083,0.75
6084,-0.04
6085,-0.70
6086,-1.19
6087,-1.45
6088,-1.53
6089,-1.45
6090,-1.31
6091,-1.16
6092,-1.04
6093,-0.95
6094,-0.88
6095,-0.85
6096,-0.85
6097,-0.84
6098,-0.69
6099,-0.40
6100,0.04
6101,0.54
6102,1.10
6103,1.66
6104,2.25
6105,2.78
6106,3.23
6107,3.58
6108,3.92
6109,4.26
6110,4.65
6111,5.06
6112,5.58
6113,6.16
6114,6.81
6115,7.42
6116,7.92
6117,8.26
6118,8.36
6119,8.22
6120,7.82
6121,7.24
6122,6.55
6123,5.87
6124,5.21
6125,4.62
6126,4.07
6127,3.56
6128,3.10
6129,2.72
6130,2.40
6131,2.13
6132,1.88
6133,1.68
6134,1.52
6135,1.46
6136,1.50
6137,1.63
6138,1.80
6139,2.04
6140,2.37
6141,2.82
6142,3.37
6143,3.97
6144,4.57
6145,5.11
6146,5.55
6147,5.81
6148,5.91
6149,5.84
6150,5.68
6151,5.46
6152,5.23
6153,5.03
6154,4.88
6155,4.83
6156,4.80
6157,4.77
6158,4.61
6159,4.29
6160,3.72
6161,2.99
6162,2.09
6163,1.12
6164,0.04
6165,-1.06
6166,-2.14
6167,-3.09
6168,-3.91
6169,-4.55
6170,-5.07
6171,-5.45
6172,-5.74
6173,-5.87
6174,-5.90
6175,-5.81
6176,-5.76
6177,-5.74
6178,-5.83
6179,-6.00
6180,-6.31
6181,-6.72
6182,-7.20
6183,-7.66
6184,-8.03
6185,-8.24
6186,-8.27
6187,-8.11
6188,-7.83
6189,-7.49
6190,-7.17
6191,-6.89
6192,-6.68
6193,-6.54
6194,-6.45
6195,-6.36
6196,-6.23
6197,-6.08
6198,-5.96
6199,-5.93
6200,-6.00
6201,-6.19
6202,-6.47
6203,-6.84
6204,-7.21
6205,-7.53
6206,-7.69
6207,-7.68
6208,-7.41
6209,-6.94
6210,-6.26
6211,-5.47
6212,-4.56
6213,-3.65
6214,-2.70
6215,-1.85
6216,-1.07
6217,-0.44
6218,0.18
6219,0.76
6220,1.50
6221,2.38
6222,3.51
6223,4.74
6224,6.08
6225,7.32
6226,8.48
6227,9.42
6228,10.15
6229,10.64
6230,11.02
6231,11.39
6232,11.85
6233,12.35
6234,12.89
6235,13.28
6236,13.43
6237,13.23
6238,12.66
6239,11.78
6240,10.67
6241,9.52
6242,8.48
6243,7.75
6244,7.32
6245,7.16
6246,7.10
6247,7.07
6248,6.94
6249,6.68
6250,6.20
6251,5.60
6252,4.84
6253,4.07
6254,3.28
6255,2.59
6256,1.98
6257,1.54
6258,1.21
6259,0.98
6260,0.80
6261,0.69
6262,0.49
6263,0.22
6264,-0.27
6265,-0.90
6266,-1.75
6267,-2.69
6268,-3.76
6269,-4.82
6270,-5.88
6271,-6.82
6272,-7.71
6273,-8.50
6274,-9.25
6275,-9.90
6276,-10.46
6277,-10.93
6278,-11.37
6279,-11.72
6280,-11.96
6281,-12.05
6282,-12.02
6283,-11.90
6284,-11.65
6285,-11.24
6286,-10.66
6287,-9.93
6288,-9.12
6289,-8.28
6290,-7.46
6291,-6.81
6292,-6.37
6293,-6.24
6294,-6.32
6295,-6.56
6296,-6.79
6297,-7.00
6298,-7.03
6299,-6.90
6300,-6.52
6301,-6.00
6302,-5.34
6303,-4.61
6304,-3.69
6305,-2.64
6306,-1.40
6307,-0.08
6308,1.27
6309,2.52
6310,3.59
6311,4.33
6312,4.75
6313,4.78
6314,4.57
6315,4.23
6316,4.01
6317,3.96
6318,4.17
6319,4.52
6320,4.96
6321,5.29
6322,5.46
6323,5.39
6324,5.11
6325,4.75
6326,4.43
6327,4.30
6328,4.41
6329,4.75
6330,5.28
6331,5.92
6332,6.54
6333,6.97
6334,7.10
6335,6.91
6336,6.47
6337,5.86
6338,5.17
6339,4.53
6340,4.08
6341,3.94
6342,4.11
6343,4.59
6344,5.20
6345,5.83
6346,6.27
6347,6.47
6348,6.29
6349,5.78
6350,4.84
6351,3.65
6352,2.27
6353,0.86
6354,-0.53
6355,-1.76
6356,-2.84
6357,-3.70
6358,-4.39
6359,-4.88
6360,-5.20
6361,-5.32
6362,-5.29
6363,-5.07
6364,-4.65
6365,-3.98
6366,-3.17
6367,-2.25
6368,-1.33
6369,-0.51
6370,0.05
6371,0.29
6372,0.24
6373,-0.02
6374,-0.36
6375,-0.70
6376,-0.92
6377,-0.95
6378,-0.77
6379,-0.47
6380,-0.17
6381,0.00
6382,-0.05
6383,-0.36
6384,-0.89
6385,-1.50
6386,-2.04
6387,-2.42
6388,-2.56
6389,-2.49
6390,-2.27
6391,-2.03
6392,-1.85
6393,-1.83
6394,-1.91
6395,-2.09
6396,-2.20
6397,-2.14
6398,-1.72
6399,-0.92
6400,0.27
6401,1.69
6402,3.28
6403,4.84
6404,6.29
6405,7.47
6406,8.38
6407,9.00
6408,9.42
6409,9.66
6410,9.84
6411,9.96
6412,10.16
6413,10.38
6414,10.66
6415,10.89
6416,11.11
6417,11.22
6418,11.20
6419,11.05
6420,10.83
6421,10.61
6422,10.46
6423,10.43
6424,10.55
6425,10.83
6426,11.19
6427,11.57
6428,11.84
6429,11.97
6430,11.90
6431,11.63
6432,11.15
6433,10.59
6434,10.02
6435,9.51
6436,9.03
6437,8.59
6438,8.19
6439,7.84
6440,7.45
6441,7.02
6442,6.52
6443,6.04
6444,5.62
6445,5.33
6446,5.14
6447,5.13
6448,5.25
6449,5.48
6450,5.66
6451,5.77
6452,5.74
6453,5.64
6454,5.39
6455,4.99
6456,4.34
6457,3.55
6458,2.62
6459,1.72
6460,0.78
6461,-0.14
6462,-1.05
6463,-1.80
6464,-2.45
6465,-2.96
6466,-3.49
6467,-4.00
6468,-4.58
6469,-5.16
6470,-5.83
6471,-6.48
6472,-7.19
6473,-7.87
6474,-8.61
6475,-9.34
6476,-10.06
6477,-10.69
6478,-11.22
6479,-11.60
6480,-11.81
6481,-11.79
6482,-11.52
6483,-11.04
6484,-10.38
6485,-9.62
6486,-8.86
6487,-8.16
6488,-7.57
6489,-7.09
6490,-6.65
6491,-6.20
6492,-5.68
6493,-5.16
6494,-4.65
6495,-4.24
6496,-3.85
6497,-3.55
6498,-3.28
6499,-3.12
6500,-2.94
6501,-2.73
6502,-2.38
6503,-1.97
6504,-1.49
6505,-1.06
6506,-0.65
6507,-0.31
6508,0.05
6509,0.35
6510,0.71
6511,1.13
6512,1.75
6513,2.52
6514,3.43
6515,4.33
6516,5.17
6517,5.84
6518,6.36
6519,6.71
6520,6.94
6521,7.07
6522,7.19
6523,7.33
6524,7.56
6525,7.87
6526,8.20
6527,8.47
6528,8.62
6529,8.62
6530,8.49
6531,8.29
6532,8.01
6533,7.74
6534,7.51
6535,7.38
6536,7.26
6537,7.13
6538,6.87
6539,6.46
6540,5.85
6541,5.10
6542,4.24
6543,3.38
6544,2.55
6545,1.87
6546,1.35
6547,1.05
6548,0.85
6549,0.76
6550,0.63
6551,0.50
6552,0.29
6553,0.08
6554,-0.21
6555,-0.50
6556,-0.81
6557,-1.06
6558,-1.32
6559,-1.57
6560,-1.89
6561,-2.27
6562,-2.77
6563,-3.36
6564,-4.04
6565,-4.73
6566,-5.38
6567,-5.88
6568,-6.23
6569,-6.37
6570,-6.34
6571,-6.18
6572,-5.98
6573,-5.82
6574,-5.78
6575,-5.84
6576,-5.98
6577,-6.11
6578,-6.13
6579,-6.00
6580,-5.63
6581,-5.04
6582,-4.20
6583,-3.24
6584,-2.27
6585,-1.43
6586,-0.75
6587,-0.26
6588,0.09
6589,0.32
6590,0.52
6591,0.74
6592,1.05
6593,1.45
6594,1.91
6595,2.33
6596,2.62
6597,2.74
6598,2.72
6599,2.53
6600,2.17
6601,1.69
6602,1.21
6603,0.81
6604,0.49
6605,0.24
6606,0.02
6607,-0.18
6608,-0.34
6609,-0.46
6610,-0.49
6611,-0.43
6612,-0.34
6613,-0.24
6614,-0.13
6615,0.02
6616,0.19
6617,0.36
6618,0.58
6619,0.86
6620,1.29
6621,1.82
6622,2.46
6623,3.16
6624,3.97
6625,4.81
6626,5.62
6627,6.31
6628,6.84
6629,7.19
6630,7.41
6631,7.45
6632,7.39
6633,7.29
6634,7.26
6635,7.32
6636,7.42
6637,7.51
6638,7.48
6639,7.35
6640,6.99
6641,6.44
6642,5.65
6643,4.76
6644,3.78
6645,2.84
6646,1.91
6647,1.08
6648,0.23
6649,-0.58
6650,-1.43
6651,-2.23
6652,-3.01
6653,-3.64
6654,-4.20
6655,-4.62
6656,-5.06
6657,-5.51
6658,-6.08
6659,-6.77
6660,-7.58
6661,-8.38
6662,-9.06
6663,-9.46
6664,-9.54
6665,-9.28
6666,-8.74
6667,-8.02
6668,-7.26
6669,-6.58
6670,-6.06
6671,-5.71
6672,-5.55
6673,-5.55
6674,-5.65
6675,-5.78
6676,-5.89
6677,-6.01
6678,-6.13
6679,-6.24
6680,-6.36
6681,-6.48
6682,-6.64
6683,-6.78
6684,-6.88
6685,-6.95
6686,-7.01
6687,-7.15
6688,-7.29
6689,-7.42
6690,-7.45
6691,-7.39
6692,-7.13
6693,-6.68
6694,-5.89
6695,-4.87
6696,-3.59
6697,-2.26
6698,-0.85
6699,0.47
6700,1.75
6701,2.93
6702,4.09
6703,5.17
6704,6.24
6705,7.21
6706,8.14
6707,8.90
6708,9.52
6709,9.91
6710,10.15
6711,10.25
6712,10.35
6713,10.38
6714,10.42
6715,10.42
6716,10.43
6717,10.39
6718,10.26
6719,10.03
6720,9.73
6721,9.43
6722,9.12
6723,8.83
6724,8.56
6725,8.38
6726,8.26
6727,8.19
6728,8.10
6729,7.96
6730,7.69
6731,7.35
6732,6.90
6733,6.37
6734,5.69
6735,4.96
6736,4.24
6737,3.68
6738,3.23
6739,2.95
6740,2.80
6741,2.78
6742,2.78
6743,2.74
6744,2.57
6745,2.32
6746,1.92
6747,1.46
6748,0.89
6749,0.31
6750,-0.31
6751,-0.90
6752,-1.49
6753,-1.98
6754,-2.40
6755,-2.68
6756,-2.92
6757,-3.11
6758,-3.32
6759,-3.54
6760,-3.89
6761,-4.39
6762,-5.06
6763,-5.81
6764,-6.57
6765,-7.23
6766,-7.74
6767,-8.03
6768,-8.13
6769,-8.06
6770,-7.89
6771,-7.71
6772,-7.56
6773,-7.41
6774,-7.22
6775,-6.93
6776,-6.52
6777,-6.00
6778,-5.42
6779,-4.89
6780,-4.48
6781,-4.28
6782,-4.22
6783,-4.30
6784,-4.41
6785,-4.46
6786,-4.28
6787,-3.78
6788,-2.93
6789,-1.85
6790,-0.66
6791,0.45
6792,1.38
6793,2.01
6794,2.31
6795,2.29
6796,2.08
6797,1.79
6798,1.59
6799,1.51
6800,1.57
6801,1.69
6802,1.88
6803,2.01
6804,2.09
6805,2.06
6806,1.98
6807,1.94
6808,1.99
6809,2.20
6810,2.61
6811,3.19
6812,3.84
6813,4.46
6814,4.92
6815,5.17
6816,5.12
6817,4.76
6818,4.10
6819,3.27
6820,2.34
6821,1.48
6822,0.69
6823,0.08
6824,-0.40
6825,-0.71
6826,-0.95
6827,-1.20
6828,-1.62
6829,-2.16
6830,-2.87
6831,-3.64
6832,-4.49
6833,-5.32
6834,-6.07
6835,-6.63
6836,-7.04
6837,-7.30
6838,-7.45
6839,-7.51
6840,-7.50
6841,-7.43
6842,-7.34
6843,-7.16
6844,-6.87
6845,-6.44
6846,-5.93
6847,-5.37
6848,-4.87
6849,-4.48
6850,-4.24
6851,-4.21
6852,-4.39
6853,-4.76
6854,-5.25
6855,-5.77
6856,-6.23
6857,-6.60
6858,-6.83
6859,-6.94
6860,-6.97
6861,-7.00
6862,-7.07
6863,-7.19
6864,-7.33
6865,-7.45
6866,-7.55
6867,-7.55
6868,-7.41
6869,-7.14
6870,-6.79
6871,-6.42
6872,-6.10
6873,-5.89
6874,-5.83
6875,-5.97
6876,-6.23
6877,-6.56
6878,-6.77
6879,-6.86
6880,-6.71
6881,-6.36
6882,-5.74
6883,-4.92
6884,-3.87
6885,-2.69
6886,-1.35
6887,0.04
6888,1.48
6889,2.85
6890,4.16
6891,5.32
6892,6.31
6893,7.00
6894,7.45
6895,7.64
6896,7.70
6897,7.61
6898,7.48
6899,7.26
6900,7.05
6901,6.85
6902,6.71
6903,6.62
6904,6.61
6905,6.66
6906,6.81
6907,7.05
6908,7.34
6909,7.63
6910,7.83
6911,7.92
6912,7.88
6913,7.74
6914,7.48
6915,7.15
6916,6.76
6917,6.35
6918,5.91
6919,5.47
6920,4.99
6921,4.49
6922,3.95
6923,3.45
6924,3.01
6925,2.71
6926,2.53
6927,2.50
6928,2.52
6929,2.57
6930,2.51
6931,2.36
6932,2.01
6933,1.56
6934,0.91
6935,0.14
6936,-0.77
6937,-1.74
6938,-2.81
6939,-3.86
6940,-4.95
6941,-5.98
6942,-6.99
6943,-7.83
6944,-8.54
6945,-9.03
6946,-9.41
6947,-9.67
6948,-9.98
6949,-10.31
6950,-10.82
6951,-11.45
6952,-12.28
6953,-13.16
6954,-14.13
6955,-15.11
6956,-16.08
6957,-16.92
6958,-17.58
6959,-18.00
6960,-18.19
6961,-18.16
6962,-17.91
6963,-17.49
6964,-16.92
6965,-16.30
6966,-15.63
6967,-14.92
6968,-14.11
6969,-13.27
6970,-12.35
6971,-11.44
6972,-10.44
6973,-9.45
6974,-8.45
6975,-7.60
6976,-6.83
6977,-6.21
6978,-5.62
6979,-5.11
6980,-4.52
6981,-3.93
6982,-3.21
6983,-2.46
6984,-1.56
6985,-0.67
6986,0.28
6987,1.15
6988,2.04
6989,2.91
6990,3.85
6991,4.78
6992,5.78
6993,6.74
6994,7.76
6995,8.70
6996,9.58
6997,10.28
6998,10.87
6999,11.32
7000,11.76
7001,12.16
7002,12.62
7003,13.11
7004,13.69
7005,14.31
7006,14.96
7007,15.54
7008,15.97
7009,16.14
7010,16.03
7011,15.68
7012,15.13
7013,14.47
7014,13.73
7015,13.01
7016,12.39
7017,11.96
7018,11.62
7019,11.34
7020,11.00
7021,10.59
7022,10.08
7023,9.55
7024,9.00
7025,8.54
7026,8.13
7027,7.84
7028,7.62
7029,7.50
7030,7.35
7031,7.19
7032,6.92
7033,6.61
7034,6.21
7035,5.81
7036,5.36
7037,4.86
7038,4.23
7039,3.51
7040,2.64
7041,1.69
7042,0.64
7043,-0.37
7044,-1.27
7045,-1.91
7046,-2.33
7047,-2.46
7048,-2.38
7049,-2.09
7050,-1.75
7051,-1.48
7052,-1.45
7053,-1.63
7054,-1.98
7055,-2.42
7056,-2.83
7057,-3.14
7058,-3.23
7059,-3.04
7060,-2.51
7061,-1.76
7062,-0.88
7063,-0.04
7064,0.69
7065,1.19
7066,1.46
7067,1.53
7068,1.55
7069,1.55
7070,1.65
7071,1.85
7072,2.23
7073,2.73
7074,3.33
7075,3.90
7076,4.40
7077,4.76
7078,4.94
7079,4.94
7080,4.76
7081,4.43
7082,3.98
7083,3.48
7084,2.94
7085,2.39
7086,1.88
7087,1.47
7088,1.17
7089,0.95
7090,0.79
7091,0.68
7092,0.62
7093,0.59
7094,0.54
7095,0.47
7096,0.47
7097,0.57
7098,0.84
7099,1.25
7100,1.88
7101,2.70
7102,3.73
7103,4.88
7104,6.07
7105,7.17
7106,8.09
7107,8.74
7108,9.06
7109,9.02
7110,8.64
7111,7.93
7112,7.03
7113,6.07
7114,5.17
7115,4.43
7116,3.85
7117,3.44
7118,3.11
7119,2.85
7120,2.48
7121,2.04
7122,1.37
7123,0.56
7124,-0.48
7125,-1.54
7126,-2.62
7127,-3.55
7128,-4.45
7129,-5.29
7130,-6.18
7131,-7.06
7132,-8.00
7133,-8.90
7134,-9.79
7135,-10.51
7136,-11.01
7137,-11.24
7138,-11.26
7139,-11.12
7140,-10.93
7141,-10.74
7142,-10.63
7143,-10.57
7144,-10.51
7145,-10.37
7146,-10.09
7147,-9.69
7148,-9.12
7149,-8.42
7150,-7.65
7151,-6.94
7152,-6.34
7153,-5.94
7154,-5.65
7155,-5.45
7156,-5.28
7157,-5.13
7158,-4.97
7159,-4.80
7160,-4.62
7161,-4.51
7162,-4.46
7163,-4.52
7164,-4.71
7165,-5.05
7166,-5.46
7167,-5.90
7168,-6.23
7169,-6.42
7170,-6.39
7171,-6.17
7172,-5.72
7173,-5.13
7174,-4.39
7175,-3.62
7176,-2.85
7177,-2.15
7178,-1.44
7179,-0.76
7180,0.02
7181,0.80
7182,1.69
7183,2.63
7184,3.68
7185,4.71
7186,5.73
7187,6.59
7188,7.30
7189,7.80
7190,8.13
7191,8.27
7192,8.34
7193,7.51
7194,7.82
7195,10.19
7196,10.72
7197,4.75
7198,-0.54
7199,10.50
7200,24.89
