1,-74.78
2,-100.00
3,-100.00
4,-98.91
5,-95.12
6,-99.73
7,-100.00
8,-100.00
9,-99.23
10,-99.76
11,-100.00
12,-100.00
13,-100.00
14,-100.00
15,-100.00
16,-100.00
17,-100.00
18,-100.00
19,-100.00
20,-100.00
21,-100.00
22,-100.00
23,-100.00
24,-100.00
25,-100.00
26,-100.00
27,-100.00
28,-100.00
29,-100.00
30,-100.00
31,-100.00
32,-100.00
33,-100.00
34,-100.00
35,-100.00
36,-100.00
37,-100.00
38,-100.00
39,-100.00
40,-100.00
41,-100.00
42,-100.00
43,-100.00
44,-100.00
45,-100.00
46,-100.00
47,-100.00
48,-100.00
49,-100.00
50,-100.00
51,-100.00
52,-100.00
53,-100.00
54,-100.00
55,-100.00
56,-100.00
57,-100.00
58,-100.00
59,-100.00
60,-100.00
61,-100.00
62,-100.00
63,-100.00
64,-100.00
65,-100.00
66,-100.00
67,-100.00
68,-100.00
69,-100.00
70,-100.00
71,-100.00
72,-100.00
73,-100.00
74,-100.00
75,-100.00
76,-100.00
77,-100.00
78,-100.00
79,-100.00
80,-100.00
81,-100.00
82,-100.00
83,-100.00
84,-100.00
85,-100.00
86,-100.00
87,-100.00
88,-100.00
89,-100.00
90,-100.00
91,-100.00
92,-100.00
93,-100.00
94,-100.00
95,-100.00
96,-100.00
97,-100.00
98,-100.00
99,-100.00
100,-100.00
101,-100.00
102,-100.00
103,-100.00
104,-100.00
105,-100.00
106,-100.00
107,-100.00
108,-100.00
109,-100.00
110,-100.00
111,-100.00
112,-100.00
113,-100.00
114,-100.00
115,-100.00
116,-100.00
117,-100.00
118,-100.00
119,-100.00
120,-100.00
121,-100.00
122,-100.00
123,-100.00
124,-100.00
125,-100.00
126,-100.00
127,-100.00
128,-100.00
129,-100.00
130,-100.00
131,-100.00
132,-100.00
133,-100.00
134,-100.00
135,-100.00
136,-100.00
137,-100.00
138,-100.00
139,-100.00
140,-100.00
141,-100.00
142,-100.00
143,-100.00
144,-100.00
145,-100.00
146,-100.00
147,-100.00
148,-100.00
149,-100.00
150,-100.00
151,-100.00
152,-100.00
153,-100.00
154,-100.00
155,-100.00
156,-100.00
157,-100.00
158,-100.00
159,-100.00
160,-100.00
161,-100.00
162,-100.00
163,-100.00
164,-100.00
165,-100.00
166,-100.00
167,-100.00
168,-100.00
169,-100.00
170,-100.00
171,-100.00
172,-100.00
173,-100.00
174,-100.00
175,-100.00
176,-100.00
177,-100.00
178,-100.00
179,-100.00
180,-100.00
181,-100.00
182,-100.00
183,-100.00
184,-100.00
185,-100.00
186,-100.00
187,-100.00
188,-100.00
189,-100.00
190,-100.00
191,-100.00
192,-100.00
193,-100.00
194,-100.00
195,-100.00
196,-100.00
197,-100.00
198,-100.00
199,-100.00
200,-100.00
201,-100.00
202,-100.00
203,-100.00
204,-100.00
205,-100.00
206,-100.00
207,-100.00
208,-100.00
209,-100.00
210,-100.00
211,-100.00
212,-100.00
213,-100.00
214,-100.00
215,-100.00
216,-100.00
217,-100.00
218,-100.00
219,-100.00
220,-100.00
221,-100.00
222,-100.00
223,-100.00
224,-100.00
225,-100.00
226,-100.00
227,-100.00
228,-100.00
229,-100.00
230,-100.00
231,-100.00
232,-100.00
233,-100.00
234,-100.00
235,-100.00
236,-100.00
237,-100.00
238,-100.00
239,-100.00
240,-100.00
241,-100.00
242,-100.00
243,-100.00
244,-100.00
245,-100.00
246,-100.00
247,-100.00
248,-100.00
249,-100.00
250,-100.00
251,-100.00
252,-100.00
253,-100.00
254,-100.00
255,-100.00
256,-100.00
257,-100.00
258,-100.00
259,-100.00
260,-100.00
261,-100.00
262,-100.00
263,-100.00
264,-100.00
265,-100.00
266,-100.00
267,-100.00
268,-100.00
269,-100.00
270,-100.00
271,-100.00
272,-100.00
273,-100.00
274,-100.00
275,-100.00
276,-100.00
277,-100.00
278,-100.00
279,-100.00
280,-100.00
281,-100.00
282,-100.00
283,-100.00
284,-100.00
285,-100.00
286,-100.00
287,-100.00
288,-100.00
289,-100.00
290,-100.00
291,-100.00
292,-100.00
293,-100.00
294,-100.00
295,-100.00
296,-100.00
297,-100.00
298,-100.00
299,-100.00
300,-100.00
301,-100.00
302,-100.00
303,-100.00
304,-100.00
305,-100.00
306,-100.00
307,-100.00
308,-100.00
309,-100.00
310,-100.00
311,-100.00
312,-100.00
313,-100.00
314,-100.00
315,-100.00
316,-100.00
317,-100.00
318,-100.00
319,-100.00
320,-100.00
321,-100.00
322,-100.00
323,-100.00
324,-100.00
325,-100.00
326,-100.00
327,-100.00
328,-100.00
329,-100.00
330,-100.00
331,-100.00
332,-100.00
333,-100.00
334,-100.00
335,-100.00
336,-100.00
337,-100.00
338,-100.00
339,-100.00
340,-100.00
341,-100.00
342,-100.00
343,-100.00
344,-100.00
345,-100.00
346,-100.00
347,-100.00
348,-100.00
349,-100.00
350,-100.00
351,-100.00
352,-100.00
353,-100.00
354,-100.00
355,-100.00
356,-100.00
357,-100.00
358,-100.00
359,-100.00
360,-100.00
361,-100.00
362,-100.00
363,-100.00
364,-100.00
365,-100.00
366,-100.00
367,-100.00
368,-100.00
369,-100.00
370,-100.00
371,-100.00
372,-100.00
373,-100.00
374,-100.00
375,-100.00
376,-100.00
377,-100.00
378,-100.00
379,-100.00
380,-100.00
381,-100.00
382,-100.00
383,-100.00
384,-100.00
385,-100.00
386,-100.00
387,-100.00
388,-100.00
389,-100.00
390,-100.00
391,-100.00
392,-100.00
393,-100.00
394,-100.00
395,-100.00
396,-100.00
397,-100.00
398,-100.00
399,-100.00
400,-100.00
401,-100.00
402,-100.00
403,-100.00
404,-100.00
405,-100.00
406,-100.00
407,-100.00
408,-100.00
409,-100.00
410,-100.00
411,-100.00
412,-100.00
413,-100.00
414,-100.00
415,-100.00
416,-100.00
417,-100.00
418,-100.00
419,-100.00
420,-100.00
421,-100.00
422,-100.00
423,-100.00
424,-100.00
425,-100.00
426,-100.00
427,-100.00
428,-100.00
429,-100.00
430,-100.00
431,-100.00
432,-100.00
433,-100.00
434,-100.00
435,-100.00
436,-100.00
437,-100.00
438,-100.00
439,-100.00
440,-100.00
441,-100.00
442,-100.00
443,-100.00
444,-100.00
445,-100.00
446,-100.00
447,-100.00
448,-100.00
449,-100.00
450,-100.00
451,-100.00
452,-100.00
453,-100.00
454,-100.00
455,-100.00
456,-100.00
457,-100.00
458,-100.00
459,-100.00
460,-100.00
461,-100.00
462,-100.00
463,-100.00
464,-100.00
465,-100.00
466,-100.00
467,-100.00
468,-100.00
469,-100.00
470,-100.00
471,-100.00
472,-100.00
473,-100.00
474,-100.00
475,-100.00
476,-100.00
477,-100.00
478,-100.00
479,-100.00
480,-100.00
481,-100.00
482,-100.00
483,-100.00
484,-100.00
485,-100.00
486,-100.00
487,-100.00
488,-100.00
489,-100.00
490,-100.00
491,-100.00
492,-100.00
493,-100.00
494,-100.00
495,-100.00
496,-100.00
497,-100.00
498,-100.00
499,-100.00
500,-100.00
501,-100.00
502,-100.00
503,-100.00
504,-100.00
505,-100.00
506,-100.00
507,-100.00
508,-100.00
509,-100.00
510,-100.00
511,-100.00
512,-100.00
513,-100.00
514,-100.00
515,-100.00
516,-100.00
517,-100.00
518,-100.00
519,-100.00
520,-100.00
521,-100.00
522,-100.00
523,-100.00
524,-100.00
525,-100.00
526,-100.00
527,-100.00
528,-100.00
529,-100.00
530,-100.00
531,-100.00
532,-100.00
533,-100.00
534,-100.00
535,-100.00
536,-100.00
537,-100.00
538,-100.00
539,-100.00
540,-100.00
541,-100.00
542,-100.00
543,-100.00
544,-100.00
545,-100.00
546,-100.00
547,-100.00
548,-100.00
549,-100.00
550,-100.00
551,-100.00
552,-100.00
553,-100.00
554,-100.00
555,-100.00
556,-100.00
557,-100.00
558,-100.00
559,-100.00
560,-100.00
561,-100.00
562,-100.00
563,-100.00
564,-100.00
565,-100.00
566,-100.00
567,-100.00
568,-100.00
569,-100.00
570,-100.00
571,-100.00
572,-100.00
573,-100.00
574,-100.00
575,-100.00
576,-100.00
577,-100.00
578,-100.00
579,-100.00
580,-100.00
581,-100.00
582,-100.00
583,-100.00
584,-100.00
585,-100.00
586,-100.00
587,-100.00
588,-100.00
589,-100.00
590,-100.00
591,-100.00
592,-100.00
593,-100.00
594,-100.00
595,-100.00
596,-100.00
597,-100.00
598,-100.00
599,-100.00
600,-100.00
601,-100.00
602,-100.00
603,-100.00
604,-100.00
605,-100.00
606,-100.00
607,-100.00
608,-100.00
609,-100.00
610,-100.00
611,-100.00
612,-100.00
613,-100.00
614,-100.00
615,-100.00
616,-100.00
617,-100.00
618,-100.00
619,-100.00
620,-100.00
621,-100.00
622,-100.00
623,-100.00
624,-100.00
625,-100.00
626,-100.00
627,-100.00
628,-100.00
629,-100.00
630,-100.00
631,-100.00
632,-100.00
633,-100.00
634,-100.00
635,-100.00
636,-100.00
637,-100.00
638,-100.00
639,-100.00
640,-100.00
641,-100.00
642,-100.00
643,-100.00
644,-100.00
645,-100.00
646,-100.00
647,-100.00
648,-100.00
649,-100.00
650,-100.00
651,-100.00
652,-100.00
653,-100.00
654,-100.00
655,-100.00
656,-100.00
657,-100.00
658,-100.00
659,-100.00
660,-100.00
661,-100.00
662,-100.00
663,-100.00
664,-100.00
665,-100.00
666,-100.00
667,-100.00
668,-100.00
669,-100.00
670,-100.00
671,-100.00
672,-100.00
673,-100.00
674,-100.00
675,-100.00
676,-100.00
677,-100.00
678,-100.00
679,-100.00
680,-100.00
681,-100.00
682,-100.00
683,-100.00
684,-100.00
685,-100.00
686,-100.00
687,-100.00
688,-100.00
689,-100.00
690,-100.00
691,-100.00
692,-100.00
693,-100.00
694,-100.00
695,-100.00
696,-100.00
697,-100.00
698,-100.00
699,-100.00
700,-100.00
701,-100.00
702,-100.00
703,-100.00
704,-100.00
705,-100.00
706,-100.00
707,-100.00
708,-100.00
709,-100.00
710,-100.00
711,-100.00
712,-100.00
713,-100.00
714,-100.00
715,-100.00
716,-100.00
717,-100.00
718,-100.00
719,-100.00
720,-100.00
721,-100.00
722,-100.00
723,-100.00
724,-100.00
725,-100.00
726,-100.00
727,-100.00
728,-100.00
729,-100.00
730,-100.00
731,-100.00
732,-100.00
733,-100.00
734,-100.00
735,-100.00
736,-100.00
737,-100.00
738,-100.00
739,-100.00
740,-100.00
741,-100.00
742,-100.00
743,-100.00
744,-100.00
745,-100.00
746,-100.00
747,-100.00
748,-100.00
749,-100.00
750,-100.00
751,-100.00
752,-100.00
753,-100.00
754,-100.00
755,-100.00
756,-100.00
757,-100.00
758,-100.00
759,-100.00
760,-100.00
761,-100.00
762,-100.00
763,-100.00
764,-100.00
765,-100.00
766,-100.00
767,-100.00
768,-100.00
769,-100.00
770,-100.00
771,-100.00
772,-100.00
773,-100.00
774,-100.00
775,-100.00
776,-100.00
777,-100.00
778,-100.00
779,-100.00
780,-100.00
781,-100.00
782,-100.00
783,-100.00
784,-100.00
785,-100.00
786,-100.00
787,-100.00
788,-100.00
789,-100.00
790,-100.00
791,-100.00
792,-100.00
793,-100.00
794,-100.00
795,-100.00
796,-100.00
797,-100.00
798,-100.00
799,-100.00
800,-100.00
801,-100.00
802,-100.00
803,-100.00
804,-100.00
805,-100.00
806,-100.00
807,-100.00
808,-100.00
809,-100.00
810,-100.00
811,-100.00
812,-100.00
813,-100.00
814,-100.00
815,-100.00
816,-100.00
817,-100.00
818,-100.00
819,-100.00
820,-100.00
821,-100.00
822,-100.00
823,-100.00
824,-100.00
825,-100.00
826,-100.00
827,-100.00
828,-100.00
829,-100.00
830,-100.00
831,-100.00
832,-100.00
833,-100.00
834,-100.00
835,-100.00
836,-100.00
837,-100.00
838,-100.00
839,-100.00
840,-100.00
841,-100.00
842,-100.00
843,-100.00
844,-100.00
845,-100.00
846,-100.00
847,-100.00
848,-100.00
849,-100.00
850,-100.00
851,-100.00
852,-100.00
853,-100.00
854,-100.00
855,-100.00
856,-100.00
857,-100.00
858,-100.00
859,-100.00
860,-100.00
861,-100.00
862,-100.00
863,-100.00
864,-100.00
865,-100.00
866,-100.00
867,-100.00
868,-100.00
869,-100.00
870,-100.00
871,-100.00
872,-100.00
873,-100.00
874,-100.00
875,-100.00
876,-100.00
877,-100.00
878,-100.00
879,-100.00
880,-100.00
881,-100.00
882,-100.00
883,-100.00
884,-100.00
885,-100.00
886,-100.00
887,-100.00
888,-100.00
889,-100.00
890,-100.00
891,-100.00
892,-100.00
893,-100.00
894,-100.00
895,-100.00
896,-100.00
897,-100.00
898,-100.00
899,-100.00
900,-100.00
901,-100.00
902,-100.00
903,-100.00
904,-100.00
905,-100.00
906,-100.00
907,-100.00
908,-100.00
909,-100.00
910,-100.00
911,-100.00
912,-100.00
913,-100.00
914,-100.00
915,-100.00
916,-100.00
917,-100.00
918,-100.00
919,-100.00
920,-100.00
921,-100.00
922,-100.00
923,-100.00
924,-100.00
925,-100.00
926,-100.00
927,-100.00
928,-100.00
929,-100.00
930,-100.00
931,-100.00
932,-100.00
933,-100.00
934,-100.00
935,-100.00
936,-100.00
937,-100.00
938,-100.00
939,-100.00
940,-100.00
941,-100.00
942,-100.00
943,-100.00
944,-100.00
945,-100.00
946,-100.00
947,-100.00
948,-100.00
949,-100.00
950,-100.00
951,-100.00
952,-100.00
953,-100.00
954,-100.00
955,-100.00
956,-100.00
957,-99.98
958,-99.95
959,-99.92
960,-99.91
961,-99.91
962,-99.91
963,-99.91
964,-99.91
965,-99.91
966,-99.91
967,-99.89
968,-99.87
969,-99.84
970,-99.80
971,-99.76
972,-99.71
973,-99.66
974,-99.62
975,-99.58
976,-99.53
977,-99.49
978,-99.44
979,-99.38
980,-99.31
981,-99.25
982,-99.20
983,-99.16
984,-99.10
985,-99.05
986,-99.00
987,-98.97
988,-98.93
989,-98.90
990,-98.85
991,-98.82
992,-98.80
993,-98.79
994,-98.77
995,-98.76
996,-98.74
997,-98.73
998,-98.71
999,-98.68
1000,-98.64
1001,-98.61
1002,-98.58
1003,-98.56
1004,-98.53
1005,-98.50
1006,-98.46
1007,-98.43
1008,-98.41
1009,-98.41
1010,-98.43
1011,-98.46
1012,-98.51
1013,-98.57
1014,-98.64
1015,-98.71
1016,-98.79
1017,-98.88
1018,-98.98
1019,-99.07
1020,-99.14
1021,-99.20
1022,-99.26
1023,-99.32
1024,-99.36
1025,-99.39
1026,-99.43
1027,-99.47
1028,-99.52
1029,-99.56
1030,-99.61
1031,-99.67
1032,-99.74
1033,-99.82
1034,-99.88
1035,-99.93
1036,-99.95
1037,-99.95
1038,-99.93
1039,-99.91
1040,-99.85
1041,-99.76
1042,-99.64
1043,-99.50
1044,-99.37
1045,-99.25
1046,-99.13
1047,-99.01
1048,-98.91
1049,-98.83
1050,-98.78
1051,-98.75
1052,-98.75
1053,-98.77
1054,-98.78
1055,-98.80
1056,-98.83
1057,-98.87
1058,-98.91
1059,-98.95
1060,-98.97
1061,-99.00
1062,-99.03
1063,-99.06
1064,-99.10
1065,-99.12
1066,-99.14
1067,-99.16
1068,-99.18
1069,-99.21
1070,-99.23
1071,-99.23
1072,-99.22
1073,-99.21
1074,-99.18
1075,-99.15
1076,-99.12
1077,-99.09
1078,-99.06
1079,-99.04
1080,-99.00
1081,-98.97
1082,-98.95
1083,-98.93
1084,-98.92
1085,-98.93
1086,-98.93
1087,-98.95
1088,-98.97
1089,-98.98
1090,-98.99
1091,-98.99
1092,-98.98
1093,-98.97
1094,-98.94
1095,-98.91
1096,-98.88
1097,-98.85
1098,-98.83
1099,-98.80
1100,-98.76
1101,-98.73
1102,-98.71
1103,-98.69
1104,-98.69
1105,-98.69
1106,-98.68
1107,-98.69
1108,-98.70
1109,-98.71
1110,-98.72
1111,-98.72
1112,-98.72
1113,-98.72
1114,-98.72
1115,-98.72
1116,-98.72
1117,-98.72
1118,-98.72
1119,-98.72
1120,-98.72
1121,-98.72
1122,-98.72
1123,-98.74
1124,-98.76
1125,-98.78
1126,-98.78
1127,-98.78
1128,-98.78
1129,-98.78
1130,-98.78
1131,-98.76
1132,-98.74
1133,-98.72
1134,-98.72
1135,-98.72
1136,-98.72
1137,-98.72
1138,-98.73
1139,-98.76
1140,-98.80
1141,-98.86
1142,-98.93
1143,-99.02
1144,-99.13
1145,-99.24
1146,-99.33
1147,-99.40
1148,-99.47
1149,-99.53
1150,-99.58
1151,-99.61
1152,-99.60
1153,-99.57
1154,-99.54
1155,-99.51
1156,-99.47
1157,-99.41
1158,-99.34
1159,-99.30
1160,-99.28
1161,-99.26
1162,-99.25
1163,-99.23
1164,-99.22
1165,-99.22
1166,-99.23
1167,-99.23
1168,-99.22
1169,-99.21
1170,-99.19
1171,-99.17
1172,-99.16
1173,-99.15
1174,-99.12
1175,-99.09
1176,-99.06
1177,-99.03
1178,-99.01
1179,-98.97
1180,-98.94
1181,-98.90
1182,-98.84
1183,-98.78
1184,-98.71
1185,-98.64
1186,-98.57
1187,-98.53
1188,-98.49
1189,-98.44
1190,-98.41
1191,-98.39
1192,-98.39
1193,-98.41
1194,-98.44
1195,-98.49
1196,-98.54
1197,-98.58
1198,-98.62
1199,-98.67
1200,-98.71
1201,-98.74
1202,-98.76
1203,-98.78
1204,-98.78
1205,-98.76
1206,-98.74
1207,-98.71
1208,-98.67
1209,-98.62
1210,-98.58
1211,-98.54
1212,-98.49
1213,-98.44
1214,-98.40
1215,-98.37
1216,-98.35
1217,-98.32
1218,-98.29
1219,-98.28
1220,-98.27
1221,-98.27
1222,-98.28
1223,-98.30
1224,-98.30
1225,-98.30
1226,-98.32
1227,-98.34
1228,-98.38
1229,-98.41
1230,-98.44
1231,-98.47
1232,-98.49
1233,-98.50
1234,-98.53
1235,-98.56
1236,-98.57
1237,-98.56
1238,-98.54
1239,-98.52
1240,-98.50
1241,-98.45
1242,-98.39
1243,-98.33
1244,-98.28
1245,-98.21
1246,-98.15
1247,-98.09
1248,-98.05
1249,-98.02
1250,-97.99
1251,-97.96
1252,-97.94
1253,-97.94
1254,-97.94
1255,-97.94
1256,-97.95
1257,-97.96
1258,-97.98
1259,-97.98
1260,-97.97
1261,-97.95
1262,-97.94
1263,-97.92
1264,-97.91
1265,-97.89
1266,-97.88
1267,-97.87
1268,-97.85
1269,-97.81
1270,-97.78
1271,-97.77
1272,-97.77
1273,-97.77
1274,-97.76
1275,-97.74
1276,-97.73
1277,-97.73
1278,-97.74
1279,-97.74
1280,-97.73
1281,-97.71
1282,-97.70
1283,-97.70
1284,-97.71
1285,-97.73
1286,-97.74
1287,-97.75
1288,-97.79
1289,-97.83
1290,-97.88
1291,-97.92
1292,-97.97
1293,-98.01
1294,-98.06
1295,-98.10
1296,-98.14
1297,-98.17
1298,-98.19
1299,-98.21
1300,-98.21
1301,-98.20
1302,-98.17
1303,-98.12
1304,-98.07
1305,-98.03
1306,-97.98
1307,-97.94
1308,-97.89
1309,-97.85
1310,-97.81
1311,-97.78
1312,-97.76
1313,-97.76
1314,-97.78
1315,-97.81
1316,-97.84
1317,-97.87
1318,-97.90
1319,-97.95
1320,-98.00
1321,-98.05
1322,-98.08
1323,-98.11
1324,-98.14
1325,-98.17
1326,-98.19
1327,-98.21
1328,-98.22
1329,-98.24
1330,-98.25
1331,-98.26
1332,-98.29
1333,-98.34
1334,-98.39
1335,-98.43
1336,-98.47
1337,-98.52
1338,-98.57
1339,-98.63
1340,-98.68
1341,-98.73
1342,-98.77
1343,-98.80
1344,-98.82
1345,-98.83
1346,-98.85
1347,-98.86
1348,-98.88
1349,-98.89
1350,-98.90
1351,-98.90
1352,-98.90
1353,-98.92
1354,-98.93
1355,-98.93
1356,-98.93
1357,-98.93
1358,-98.92
1359,-98.90
1360,-98.90
1361,-98.90
1362,-98.89
1363,-98.88
1364,-98.86
1365,-98.86
1366,-98.88
1367,-98.89
1368,-98.90
1369,-98.92
1370,-98.94
1371,-98.99
1372,-99.04
1373,-99.11
1374,-99.17
1375,-99.23
1376,-99.28
1377,-99.32
1378,-99.38
1379,-99.44
1380,-99.49
1381,-99.52
1382,-99.53
1383,-99.53
1384,-99.52
1385,-99.51
1386,-99.49
1387,-99.47
1388,-99.46
1389,-99.44
1390,-99.42
1391,-99.39
1392,-99.36
1393,-99.35
1394,-99.34
1395,-99.32
1396,-99.31
1397,-99.29
1398,-99.28
1399,-99.26
1400,-99.24
1401,-99.23
1402,-99.23
1403,-99.25
1404,-99.26
1405,-99.26
1406,-99.26
1407,-99.29
1408,-99.34
1409,-99.38
1410,-99.42
1411,-99.45
1412,-99.48
1413,-99.51
1414,-99.54
1415,-99.55
1416,-99.55
1417,-99.54
1418,-99.51
1419,-99.48
1420,-99.45
1421,-99.42
1422,-99.39
1423,-99.36
1424,-99.33
1425,-99.32
1426,-99.31
1427,-99.31
1428,-99.33
1429,-99.36
1430,-99.39
1431,-99.42
1432,-99.45
1433,-99.48
1434,-99.51
1435,-99.52
1436,-99.53
1437,-99.51
1438,-99.48
1439,-99.43
1440,-99.38
1441,-99.32
1442,-99.25
1443,-99.16
1444,-99.06
1445,-98.97
1446,-98.89
1447,-98.80
1448,-98.70
1449,-98.60
1450,-98.49
1451,-98.40
1452,-98.32
1453,-98.25
1454,-98.18
1455,-98.12
1456,-98.07
1457,-98.02
1458,-97.99
1459,-98.00
1460,-98.01
1461,-98.03
1462,-98.05
1463,-98.08
1464,-98.12
1465,-98.16
1466,-98.20
1467,-98.23
1468,-98.26
1469,-98.29
1470,-98.31
1471,-98.31
1472,-98.29
1473,-98.26
1474,-98.23
1475,-98.20
1476,-98.17
1477,-98.14
1478,-98.11
1479,-98.08
1480,-98.06
1481,-98.04
1482,-98.03
1483,-98.03
1484,-98.03
1485,-98.03
1486,-98.03
1487,-98.04
1488,-98.03
1489,-98.02
1490,-97.99
1491,-97.96
1492,-97.94
1493,-97.92
1494,-97.91
1495,-97.89
1496,-97.89
1497,-97.90
1498,-97.94
1499,-97.98
1500,-98.03
1501,-98.07
1502,-98.13
1503,-98.19
1504,-98.23
1505,-98.27
1506,-98.29
1507,-98.31
1508,-98.29
1509,-98.25
1510,-98.19
1511,-98.13
1512,-98.06
1513,-97.97
1514,-97.87
1515,-97.78
1516,-97.70
1517,-97.62
1518,-97.56
1519,-97.52
1520,-97.49
1521,-97.47
1522,-97.46
1523,-97.45
1524,-97.44
1525,-97.44
1526,-97.44
1527,-97.44
1528,-97.44
1529,-97.44
1530,-97.43
1531,-97.42
1532,-97.41
1533,-97.41
1534,-97.41
1535,-97.41
1536,-97.42
1537,-97.45
1538,-97.49
1539,-97.54
1540,-97.59
1541,-97.63
1542,-97.67
1543,-97.69
1544,-97.72
1545,-97.75
1546,-97.78
1547,-97.80
1548,-97.80
1549,-97.78
1550,-97.76
1551,-97.72
1552,-97.69
1553,-97.64
1554,-97.60
1555,-97.55
1556,-97.50
1557,-97.46
1558,-97.42
1559,-97.40
1560,-97.37
1561,-97.34
1562,-97.31
1563,-97.27
1564,-97.25
1565,-97.24
1566,-97.23
1567,-97.23
1568,-97.23
1569,-97.23
1570,-97.24
1571,-97.25
1572,-97.27
1573,-97.29
1574,-97.29
1575,-97.29
1576,-97.29
1577,-97.29
1578,-97.30
1579,-97.30
1580,-97.28
1581,-97.25
1582,-97.21
1583,-97.17
1584,-97.13
1585,-97.08
1586,-97.02
1587,-96.96
1588,-96.91
1589,-96.87
1590,-96.82
1591,-96.78
1592,-96.73
1593,-96.70
1594,-96.69
1595,-96.69
1596,-96.70
1597,-96.72
1598,-96.74
1599,-96.77
1600,-96.80
1601,-96.83
1602,-96.86
1603,-96.89
1604,-96.92
1605,-96.95
1606,-96.98
1607,-97.01
1608,-97.04
1609,-97.09
1610,-97.14
1611,-97.18
1612,-97.22
1613,-97.27
1614,-97.32
1615,-97.38
1616,-97.44
1617,-97.50
1618,-97.56
1619,-97.60
1620,-97.63
1621,-97.65
1622,-97.65
1623,-97.65
1624,-97.64
1625,-97.61
1626,-97.57
1627,-97.53
1628,-97.47
1629,-97.41
1630,-97.36
1631,-97.31
1632,-97.27
1633,-97.24
1634,-97.21
1635,-97.19
1636,-97.16
1637,-97.15
1638,-97.14
1639,-97.14
1640,-97.14
1641,-97.14
1642,-97.15
1643,-97.15
1644,-97.14
1645,-97.12
1646,-97.11
1647,-97.11
1648,-97.11
1649,-97.12
1650,-97.12
1651,-97.12
1652,-97.11
1653,-97.09
1654,-97.08
1655,-97.08
1656,-97.08
1657,-97.07
1658,-97.03
1659,-96.99
1660,-96.95
1661,-96.90
1662,-96.85
1663,-96.79
1664,-96.72
1665,-96.66
1666,-96.61
1667,-96.56
1668,-96.53
1669,-96.51
1670,-96.52
1671,-96.53
1672,-96.56
1673,-96.61
1674,-96.67
1675,-96.75
1676,-96.82
1677,-96.88
1678,-96.94
1679,-96.99
1680,-97.05
1681,-97.10
1682,-97.13
1683,-97.14
1684,-97.14
1685,-97.15
1686,-97.15
1687,-97.15
1688,-97.13
1689,-97.12
1690,-97.12
1691,-97.13
1692,-97.14
1693,-97.15
1694,-97.15
1695,-97.16
1696,-97.17
1697,-97.18
1698,-97.17
1699,-97.17
1700,-97.17
1701,-97.16
1702,-97.13
1703,-97.10
1704,-97.07
1705,-97.04
1706,-97.00
1707,-96.96
1708,-96.91
1709,-96.87
1710,-96.81
1711,-96.76
1712,-96.70
1713,-96.66
1714,-96.61
1715,-96.57
1716,-96.53
1717,-96.50
1718,-96.47
1719,-96.44
1720,-96.43
1721,-96.43
1722,-96.43
1723,-96.43
1724,-96.44
1725,-96.45
1726,-96.46
1727,-96.46
1728,-96.46
1729,-96.46
1730,-96.44
1731,-96.42
1732,-96.39
1733,-96.35
1734,-96.32
1735,-96.27
1736,-96.23
1737,-96.20
1738,-96.18
1739,-96.16
1740,-96.16
1741,-96.18
1742,-96.21
1743,-96.26
1744,-96.30
1745,-96.34
1746,-96.40
1747,-96.46
1748,-96.51
1749,-96.54
1750,-96.55
1751,-96.55
1752,-96.54
1753,-96.51
1754,-96.47
1755,-96.42
1756,-96.37
1757,-96.33
1758,-96.29
1759,-96.24
1760,-96.19
1761,-96.15
1762,-96.12
1763,-96.11
1764,-96.08
1765,-96.05
1766,-96.04
1767,-96.04
1768,-96.03
1769,-96.02
1770,-96.01
1771,-95.99
1772,-95.97
1773,-95.96
1774,-95.96
1775,-95.97
1776,-95.99
1777,-96.01
1778,-96.02
1779,-96.05
1780,-96.10
1781,-96.16
1782,-96.22
1783,-96.28
1784,-96.33
1785,-96.38
1786,-96.42
1787,-96.45
1788,-96.47
1789,-96.48
1790,-96.49
1791,-96.49
1792,-96.49
1793,-96.47
1794,-96.44
1795,-96.41
1796,-96.39
1797,-96.38
1798,-96.36
1799,-96.33
1800,-96.29
1801,-96.26
1802,-96.24
1803,-96.21
1804,-96.17
1805,-96.15
1806,-96.12
1807,-96.11
1808,-96.09
1809,-96.08
1810,-96.07
1811,-96.09
1812,-96.11
1813,-96.12
1814,-96.14
1815,-96.15
1816,-96.18
1817,-96.20
1818,-96.22
1819,-96.24
1820,-96.27
1821,-96.29
1822,-96.31
1823,-96.33
1824,-96.36
1825,-96.40
1826,-96.45
1827,-96.50
1828,-96.54
1829,-96.60
1830,-96.67
1831,-96.75
1832,-96.82
1833,-96.88
1834,-96.93
1835,-96.97
1836,-97.02
1837,-97.04
1838,-97.06
1839,-97.06
1840,-97.05
1841,-97.03
1842,-97.00
1843,-96.96
1844,-96.91
1845,-96.88
1846,-96.87
1847,-96.85
1848,-96.84
1849,-96.84
1850,-96.85
1851,-96.88
1852,-96.93
1853,-96.99
1854,-97.05
1855,-97.09
1856,-97.13
1857,-97.18
1858,-97.23
1859,-97.26
1860,-97.26
1861,-97.24
1862,-97.23
1863,-97.21
1864,-97.19
1865,-97.16
1866,-97.13
1867,-97.10
1868,-97.07
1869,-97.04
1870,-97.01
1871,-96.99
1872,-96.99
1873,-96.99
1874,-96.99
1875,-96.99
1876,-96.99
1877,-96.99
1878,-97.00
1879,-97.02
1880,-97.02
1881,-97.02
1882,-97.03
1883,-97.04
1884,-97.06
1885,-97.08
1886,-97.09
1887,-97.10
1888,-97.13
1889,-97.15
1890,-97.19
1891,-97.24
1892,-97.29
1893,-97.35
1894,-97.41
1895,-97.45
1896,-97.49
1897,-97.54
1898,-97.58
1899,-97.61
1900,-97.64
1901,-97.67
1902,-97.69
1903,-97.71
1904,-97.71
1905,-97.71
1906,-97.71
1907,-97.71
1908,-97.69
1909,-97.67
1910,-97.64
1911,-97.61
1912,-97.56
1913,-97.50
1914,-97.44
1915,-97.38
1916,-97.32
1917,-97.26
1918,-97.21
1919,-97.16
1920,-97.12
1921,-97.08
1922,-97.03
1923,-96.98
1924,-96.95
1925,-96.92
1926,-96.90
1927,-96.87
1928,-96.82
1929,-96.76
1930,-96.70
1931,-96.66
1932,-96.62
1933,-96.57
1934,-96.52
1935,-96.48
1936,-96.44
1937,-96.41
1938,-96.39
1939,-96.37
1940,-96.37
1941,-96.39
1942,-96.40
1943,-96.40
1944,-96.40
1945,-96.40
1946,-96.40
1947,-96.40
1948,-96.39
1949,-96.38
1950,-96.37
1951,-96.37
1952,-96.37
1953,-96.37
1954,-96.37
1955,-96.39
1956,-96.41
1957,-96.44
1958,-96.48
1959,-96.52
1960,-96.57
1961,-96.61
1962,-96.67
1963,-96.72
1964,-96.78
1965,-96.84
1966,-96.91
1967,-96.98
1968,-97.06
1969,-97.13
1970,-97.21
1971,-97.28
1972,-97.36
1973,-97.44
1974,-97.50
1975,-97.55
1976,-97.58
1977,-97.59
1978,-97.59
1979,-97.57
1980,-97.55
1981,-97.52
1982,-97.47
1983,-97.42
1984,-97.35
1985,-97.29
1986,-97.22
1987,-97.16
1988,-97.08
1989,-97.00
1990,-96.92
1991,-96.83
1992,-96.75
1993,-96.67
1994,-96.59
1995,-96.52
1996,-96.46
1997,-96.42
1998,-96.37
1999,-96.33
2000,-96.29
2001,-96.26
2002,-96.24
2003,-96.21
2004,-96.18
2005,-96.15
2006,-96.12
2007,-96.09
2008,-96.04
2009,-96.01
2010,-95.97
2011,-95.94
2012,-95.90
2013,-95.86
2014,-95.82
2015,-95.79
2016,-95.76
2017,-95.73
2018,-95.71
2019,-95.69
2020,-95.68
2021,-95.68
2022,-95.69
2023,-95.71
2024,-95.73
2025,-95.76
2026,-95.79
2027,-95.84
2028,-95.88
2029,-95.93
2030,-95.98
2031,-96.04
2032,-96.10
2033,-96.14
2034,-96.19
2035,-96.21
2036,-96.22
2037,-96.21
2038,-96.18
2039,-96.15
2040,-96.11
2041,-96.05
2042,-95.97
2043,-95.90
2044,-95.83
2045,-95.76
2046,-95.67
2047,-95.60
2048,-95.54
2049,-95.51
2050,-95.48
2051,-95.46
2052,-95.45
2053,-95.47
2054,-95.48
2055,-95.48
2056,-95.47
2057,-95.47
2058,-95.48
2059,-95.48
2060,-95.47
2061,-95.43
2062,-95.41
2063,-95.39
2064,-95.38
2065,-95.36
2066,-95.36
2067,-95.37
2068,-95.41
2069,-95.45
2070,-95.50
2071,-95.54
2072,-95.59
2073,-95.65
2074,-95.72
2075,-95.78
2076,-95.82
2077,-95.83
2078,-95.83
2079,-95.82
2080,-95.79
2081,-95.75
2082,-95.68
2083,-95.60
2084,-95.54
2085,-95.47
2086,-95.41
2087,-95.34
2088,-95.27
2089,-95.22
2090,-95.19
2091,-95.16
2092,-95.15
2093,-95.16
2094,-95.19
2095,-95.24
2096,-95.30
2097,-95.38
2098,-95.45
2099,-95.53
2100,-95.60
2101,-95.68
2102,-95.76
2103,-95.83
2104,-95.89
2105,-95.94
2106,-95.97
2107,-96.00
2108,-96.02
2109,-96.04
2110,-96.05
2111,-96.06
2112,-96.08
2113,-96.09
2114,-96.11
2115,-96.12
2116,-96.14
2117,-96.15
2118,-96.17
2119,-96.19
2120,-96.19
2121,-96.19
2122,-96.19
2123,-96.19
2124,-96.19
2125,-96.17
2126,-96.16
2127,-96.14
2128,-96.12
2129,-96.09
2130,-96.05
2131,-96.03
2132,-96.00
2133,-95.97
2134,-95.94
2135,-95.91
2136,-95.88
2137,-95.85
2138,-95.81
2139,-95.77
2140,-95.72
2141,-95.68
2142,-95.64
2143,-95.61
2144,-95.57
2145,-95.53
2146,-95.49
2147,-95.46
2148,-95.44
2149,-95.43
2150,-95.41
2151,-95.39
2152,-95.38
2153,-95.36
2154,-95.35
2155,-95.33
2156,-95.32
2157,-95.30
2158,-95.29
2159,-95.28
2160,-95.25
2161,-95.24
2162,-95.25
2163,-95.26
2164,-95.27
2165,-95.29
2166,-95.31
2167,-95.36
2168,-95.42
2169,-95.48
2170,-95.53
2171,-95.57
2172,-95.63
2173,-95.69
2174,-95.73
2175,-95.75
2176,-95.74
2177,-95.72
2178,-95.71
2179,-95.68
2180,-95.63
2181,-95.59
2182,-95.54
2183,-95.50
2184,-95.46
2185,-95.41
2186,-95.36
2187,-95.33
2188,-95.32
2189,-95.32
2190,-95.32
2191,-95.33
2192,-95.32
2193,-95.33
2194,-95.32
2195,-95.31
2196,-95.29
2197,-95.26
2198,-95.22
2199,-95.18
2200,-95.12
2201,-95.04
2202,-94.96
2203,-94.89
2204,-94.82
2205,-94.76
2206,-94.70
2207,-94.64
2208,-94.59
2209,-94.54
2210,-94.51
2211,-94.48
2212,-94.46
2213,-94.46
2214,-94.47
2215,-94.49
2216,-94.50
2217,-94.50
2218,-94.49
2219,-94.49
2220,-94.50
2221,-94.50
2222,-94.49
2223,-94.47
2224,-94.47
2225,-94.46
2226,-94.45
2227,-94.44
2228,-94.44
2229,-94.45
2230,-94.47
2231,-94.49
2232,-94.50
2233,-94.52
2234,-94.53
2235,-94.53
2236,-94.52
2237,-94.51
2238,-94.48
2239,-94.45
2240,-94.42
2241,-94.39
2242,-94.35
2243,-94.31
2244,-94.27
2245,-94.24
2246,-94.22
2247,-94.20
2248,-94.19
2249,-94.18
2250,-94.15
2251,-94.12
2252,-94.09
2253,-94.06
2254,-94.04
2255,-94.00
2256,-93.97
2257,-93.94
2258,-93.92
2259,-93.90
2260,-93.89
2261,-93.87
2262,-93.87
2263,-93.89
2264,-93.91
2265,-93.92
2266,-93.93
2267,-93.95
2268,-93.97
2269,-94.00
2270,-94.03
2271,-94.05
2272,-94.05
2273,-94.05
2274,-94.05
2275,-94.05
2276,-94.04
2277,-94.03
2278,-94.02
2279,-94.02
2280,-94.01
2281,-94.00
2282,-93.99
2283,-93.99
2284,-93.98
2285,-93.97
2286,-93.95
2287,-93.95
2288,-93.96
2289,-93.96
2290,-93.95
2291,-93.95
2292,-93.96
2293,-93.98
2294,-93.99
2295,-94.01
2296,-94.03
2297,-94.06
2298,-94.09
2299,-94.12
2300,-94.15
2301,-94.18
2302,-94.22
2303,-94.26
2304,-94.31
2305,-94.35
2306,-94.39
2307,-94.44
2308,-94.49
2309,-94.55
2310,-94.62
2311,-94.69
2312,-94.78
2313,-94.86
2314,-94.96
2315,-95.04
2316,-95.13
2317,-95.21
2318,-95.27
2319,-95.33
2320,-95.38
2321,-95.43
2322,-95.47
2323,-95.49
2324,-95.52
2325,-95.55
2326,-95.58
2327,-95.61
2328,-95.63
2329,-95.65
2330,-95.68
2331,-95.72
2332,-95.77
2333,-95.81
2334,-95.86
2335,-95.90
2336,-95.94
2337,-95.97
2338,-96.00
2339,-96.03
2340,-96.05
2341,-96.07
2342,-96.08
2343,-96.09
2344,-96.11
2345,-96.12
2346,-96.15
2347,-96.17
2348,-96.21
2349,-96.24
2350,-96.26
2351,-96.29
2352,-96.32
2353,-96.35
2354,-96.39
2355,-96.42
2356,-96.44
2357,-96.45
2358,-96.47
2359,-96.50
2360,-96.53
2361,-96.56
2362,-96.60
2363,-96.66
2364,-96.73
2365,-96.80
2366,-96.90
2367,-97.02
2368,-97.15
2369,-97.28
2370,-97.43
2371,-97.57
2372,-97.72
2373,-97.87
2374,-98.03
2375,-98.17
2376,-98.31
2377,-98.41
2378,-98.50
2379,-98.57
2380,-98.62
2381,-98.65
2382,-98.67
2383,-98.68
2384,-98.69
2385,-98.69
2386,-98.70
2387,-98.71
2388,-98.73
2389,-98.76
2390,-98.81
2391,-98.86
2392,-98.93
2393,-98.99
2394,-99.05
2395,-99.11
2396,-99.16
2397,-99.21
2398,-99.24
2399,-99.26
2400,-99.26
2401,-99.24
2402,-99.21
2403,-99.18
2404,-99.15
2405,-99.12
2406,-99.09
2407,-99.06
2408,-99.04
2409,-99.02
2410,-99.02
2411,-99.02
2412,-99.02
2413,-99.02
2414,-99.02
2415,-99.04
2416,-99.05
2417,-99.07
2418,-99.09
2419,-99.10
2420,-99.11
2421,-99.11
2422,-99.11
2423,-99.13
2424,-99.14
2425,-99.14
2426,-99.13
2427,-99.11
2428,-99.10
2429,-99.08
2430,-99.08
2431,-99.08
2432,-99.08
2433,-99.08
2434,-99.08
2435,-99.10
2436,-99.11
2437,-99.13
2438,-99.15
2439,-99.18
2440,-99.21
2441,-99.22
2442,-99.23
2443,-99.22
2444,-99.22
2445,-99.22
2446,-99.23
2447,-99.22
2448,-99.23
2449,-99.24
2450,-99.28
2451,-99.32
2452,-99.37
2453,-99.41
2454,-99.47
2455,-99.54
2456,-99.62
2457,-99.70
2458,-99.77
2459,-99.84
2460,-99.91
2461,-99.95
2462,-99.99
2463,-100.00
2464,-100.00
2465,-99.98
2466,-99.96
2467,-99.93
2468,-99.90
2469,-99.87
2470,-99.84
2471,-99.80
2472,-99.78
2473,-99.77
2474,-99.76
2475,-99.76
2476,-99.76
2477,-99.76
2478,-99.77
2479,-99.78
2480,-99.80
2481,-99.81
2482,-99.83
2483,-99.84
2484,-99.86
2485,-99.87
2486,-99.89
2487,-99.92
2488,-99.96
2489,-99.99
2490,-100.00
2491,-100.00
2492,-100.00
2493,-100.00
2494,-99.99
2495,-99.97
2496,-99.91
2497,-99.84
2498,-99.75
2499,-99.66
2500,-99.56
2501,-99.48
2502,-99.40
2503,-99.32
2504,-99.25
2505,-99.19
2506,-99.15
2507,-99.13
2508,-99.13
2509,-99.13
2510,-99.14
2511,-99.15
2512,-99.18
2513,-99.21
2514,-99.24
2515,-99.27
2516,-99.30
2517,-99.35
2518,-99.40
2519,-99.46
2520,-99.53
2521,-99.60
2522,-99.68
2523,-99.77
2524,-99.88
2525,-99.97
2526,-100.00
2527,-100.00
2528,-100.00
2529,-100.00
2530,-100.00
2531,-100.00
2532,-100.00
2533,-100.00
2534,-100.00
2535,-100.00
2536,-100.00
2537,-100.00
2538,-100.00
2539,-100.00
2540,-100.00
2541,-100.00
2542,-100.00
2543,-100.00
2544,-100.00
2545,-100.00
2546,-100.00
2547,-100.00
2548,-100.00
2549,-100.00
2550,-100.00
2551,-100.00
2552,-100.00
2553,-100.00
2554,-100.00
2555,-100.00
2556,-100.00
2557,-100.00
2558,-100.00
2559,-100.00
2560,-100.00
2561,-100.00
2562,-100.00
2563,-100.00
2564,-100.00
2565,-100.00
2566,-100.00
2567,-100.00
2568,-100.00
2569,-100.00
2570,-100.00
2571,-100.00
2572,-100.00
2573,-100.00
2574,-100.00
2575,-100.00
2576,-100.00
2577,-100.00
2578,-100.00
2579,-100.00
2580,-100.00
2581,-100.00
2582,-100.00
2583,-100.00
2584,-100.00
2585,-100.00
2586,-100.00
2587,-100.00
2588,-100.00
2589,-100.00
2590,-100.00
2591,-100.00
2592,-100.00
2593,-100.00
2594,-100.00
2595,-100.00
2596,-100.00
2597,-100.00
2598,-100.00
2599,-100.00
2600,-99.95
2601,-99.80
2602,-99.62
2603,-99.47
2604,-99.34
2605,-99.24
2606,-99.16
2607,-99.10
2608,-99.05
2609,-99.03
2610,-99.02
2611,-99.02
2612,-99.01
2613,-98.98
2614,-98.94
2615,-98.90
2616,-98.82
2617,-98.72
2618,-98.61
2619,-98.49
2620,-98.34
2621,-98.19
2622,-98.02
2623,-97.85
2624,-97.67
2625,-97.50
2626,-97.33
2627,-97.19
2628,-97.03
2629,-96.87
2630,-96.71
2631,-96.57
2632,-96.45
2633,-96.35
2634,-96.26
2635,-96.19
2636,-96.13
2637,-96.10
2638,-96.10
2639,-96.13
2640,-96.19
2641,-96.28
2642,-96.40
2643,-96.53
2644,-96.69
2645,-96.85
2646,-97.01
2647,-97.16
2648,-97.31
2649,-97.45
2650,-97.60
2651,-97.72
2652,-97.82
2653,-97.90
2654,-97.99
2655,-98.07
2656,-98.12
2657,-98.15
2658,-98.17
2659,-98.18
2660,-98.19
2661,-98.19
2662,-98.18
2663,-98.16
2664,-98.15
2665,-98.15
2666,-98.15
2667,-98.15
2668,-98.16
2669,-98.17
2670,-98.19
2671,-98.21
2672,-98.22
2673,-98.24
2674,-98.25
2675,-98.25
2676,-98.24
2677,-98.22
2678,-98.20
2679,-98.18
2680,-98.14
2681,-98.09
2682,-98.04
2683,-98.00
2684,-97.95
2685,-97.91
2686,-97.86
2687,-97.82
2688,-97.78
2689,-97.75
2690,-97.72
2691,-97.69
2692,-97.67
2693,-97.65
2694,-97.64
2695,-97.63
2696,-97.62
2697,-97.62
2698,-97.62
2699,-97.62
2700,-97.62
2701,-97.62
2702,-97.61
2703,-97.60
2704,-97.58
2705,-97.57
2706,-97.55
2707,-97.52
2708,-97.48
2709,-97.43
2710,-97.39
2711,-97.37
2712,-97.34
2713,-97.31
2714,-97.27
2715,-97.24
2716,-97.22
2717,-97.19
2718,-97.16
2719,-97.13
2720,-97.10
2721,-97.07
2722,-97.03
2723,-96.99
2724,-96.94
2725,-96.90
2726,-96.85
2727,-96.79
2728,-96.72
2729,-96.64
2730,-96.58
2731,-96.52
2732,-96.46
2733,-96.40
2734,-96.34
2735,-96.28
2736,-96.22
2737,-96.16
2738,-96.10
2739,-96.04
2740,-95.98
2741,-95.92
2742,-95.86
2743,-95.80
2744,-95.74
2745,-95.68
2746,-95.63
2747,-95.57
2748,-95.50
2749,-95.45
2750,-95.39
2751,-95.35
2752,-95.30
2753,-95.24
2754,-95.18
2755,-95.14
2756,-95.10
2757,-95.05
2758,-95.00
2759,-94.96
2760,-94.92
2761,-94.89
2762,-94.86
2763,-94.84
2764,-94.81
2765,-94.80
2766,-94.78
2767,-94.77
2768,-94.76
2769,-94.74
2770,-94.73
2771,-94.71
2772,-94.70
2773,-94.68
2774,-94.67
2775,-94.65
2776,-94.64
2777,-94.61
2778,-94.56
2779,-94.50
2780,-94.44
2781,-94.38
2782,-94.31
2783,-94.22
2784,-94.11
2785,-94.01
2786,-93.91
2787,-93.82
2788,-93.73
2789,-93.64
2790,-93.57
2791,-93.52
2792,-93.50
2793,-93.48
2794,-93.49
2795,-93.52
2796,-93.57
2797,-93.62
2798,-93.70
2799,-93.77
2800,-93.85
2801,-93.93
2802,-93.98
2803,-94.03
2804,-94.07
2805,-94.10
2806,-94.12
2807,-94.12
2808,-94.10
2809,-94.07
2810,-94.03
2811,-93.98
2812,-93.94
2813,-93.89
2814,-93.85
2815,-93.80
2816,-93.76
2817,-93.71
2818,-93.66
2819,-93.62
2820,-93.59
2821,-93.55
2822,-93.53
2823,-93.52
2824,-93.52
2825,-93.53
2826,-93.55
2827,-93.57
2828,-93.58
2829,-93.59
2830,-93.62
2831,-93.65
2832,-93.66
2833,-93.67
2834,-93.66
2835,-93.64
2836,-93.62
2837,-93.58
2838,-93.51
2839,-93.43
2840,-93.36
2841,-93.28
2842,-93.21
2843,-93.13
2844,-93.06
2845,-93.00
2846,-92.95
2847,-92.90
2848,-92.87
2849,-92.86
2850,-92.85
2851,-92.86
2852,-92.87
2853,-92.90
2854,-92.93
2855,-92.98
2856,-93.04
2857,-93.10
2858,-93.15
2859,-93.19
2860,-93.24
2861,-93.30
2862,-93.36
2863,-93.39
2864,-93.40
2865,-93.40
2866,-93.39
2867,-93.38
2868,-93.35
2869,-93.30
2870,-93.25
2871,-93.21
2872,-93.16
2873,-93.11
2874,-93.02
2875,-92.94
2876,-92.85
2877,-92.78
2878,-92.69
2879,-92.59
2880,-92.48
2881,-92.37
2882,-92.26
2883,-92.14
2884,-92.03
2885,-91.95
2886,-91.86
2887,-91.79
2888,-91.72
2889,-91.68
2890,-91.65
2891,-91.64
2892,-91.64
2893,-91.65
2894,-91.69
2895,-91.73
2896,-91.77
2897,-91.80
2898,-91.83
2899,-91.86
2900,-91.89
2901,-91.91
2902,-91.90
2903,-91.87
2904,-91.82
2905,-91.78
2906,-91.73
2907,-91.67
2908,-91.60
2909,-91.53
2910,-91.45
2911,-91.36
2912,-91.26
2913,-91.17
2914,-91.09
2915,-91.02
2916,-90.94
2917,-90.87
2918,-90.80
2919,-90.76
2920,-90.73
2921,-90.72
2922,-90.71
2923,-90.71
2924,-90.73
2925,-90.76
2926,-90.79
2927,-90.82
2928,-90.85
2929,-90.88
2930,-90.90
2931,-90.90
2932,-90.88
2933,-90.85
2934,-90.81
2935,-90.75
2936,-90.68
2937,-90.60
2938,-90.53
2939,-90.47
2940,-90.42
2941,-90.38
2942,-90.34
2943,-90.33
2944,-90.33
2945,-90.35
2946,-90.36
2947,-90.38
2948,-90.40
2949,-90.41
2950,-90.42
2951,-90.42
2952,-90.42
2953,-90.40
2954,-90.37
2955,-90.32
2956,-90.28
2957,-90.25
2958,-90.23
2959,-90.19
2960,-90.17
2961,-90.15
2962,-90.14
2963,-90.14
2964,-90.16
2965,-90.19
2966,-90.23
2967,-90.27
2968,-90.33
2969,-90.39
2970,-90.44
2971,-90.49
2972,-90.52
2973,-90.55
2974,-90.58
2975,-90.59
2976,-90.60
2977,-90.59
2978,-90.59
2979,-90.59
2980,-90.60
2981,-90.62
2982,-90.63
2983,-90.65
2984,-90.67
2985,-90.71
2986,-90.78
2987,-90.86
2988,-90.93
2989,-90.99
2990,-91.05
2991,-91.10
2992,-91.15
2993,-91.18
2994,-91.20
2995,-91.21
2996,-91.23
2997,-91.23
2998,-91.21
2999,-91.18
3000,-91.15
3001,-91.12
3002,-91.09
3003,-91.06
3004,-91.02
3005,-90.99
3006,-90.98
3007,-90.98
3008,-90.98
3009,-90.98
3010,-90.99
3011,-91.02
3012,-91.06
3013,-91.09
3014,-91.12
3015,-91.15
3016,-91.17
3017,-91.17
3018,-91.16
3019,-91.14
3020,-91.12
3021,-91.09
3022,-91.05
3023,-90.99
3024,-90.92
3025,-90.84
3026,-90.77
3027,-90.69
3028,-90.62
3029,-90.55
3030,-90.46
3031,-90.39
3032,-90.33
3033,-90.27
3034,-90.20
3035,-90.15
3036,-90.10
3037,-90.07
3038,-90.05
3039,-90.03
3040,-90.04
3041,-90.06
3042,-90.11
3043,-90.16
3044,-90.21
3045,-90.27
3046,-90.33
3047,-90.39
3048,-90.45
3049,-90.51
3050,-90.56
3051,-90.57
3052,-90.55
3053,-90.52
3054,-90.49
3055,-90.46
3056,-90.43
3057,-90.38
3058,-90.34
3059,-90.30
3060,-90.29
3061,-90.29
3062,-90.31
3063,-90.36
3064,-90.42
3065,-90.50
3066,-90.58
3067,-90.67
3068,-90.77
3069,-90.86
3070,-90.92
3071,-90.97
3072,-91.00
3073,-91.01
3074,-91.01
3075,-90.98
3076,-90.92
3077,-90.85
3078,-90.76
3079,-90.67
3080,-90.58
3081,-90.49
3082,-90.40
3083,-90.31
3084,-90.23
3085,-90.17
3086,-90.13
3087,-90.12
3088,-90.12
3089,-90.12
3090,-90.12
3091,-90.14
3092,-90.16
3093,-90.20
3094,-90.22
3095,-90.24
3096,-90.25
3097,-90.25
3098,-90.23
3099,-90.18
3100,-90.12
3101,-90.06
3102,-90.00
3103,-89.92
3104,-89.84
3105,-89.75
3106,-89.66
3107,-89.57
3108,-89.49
3109,-89.41
3110,-89.33
3111,-89.26
3112,-89.19
3113,-89.14
3114,-89.08
3115,-89.02
3116,-88.96
3117,-88.90
3118,-88.84
3119,-88.80
3120,-88.77
3121,-88.75
3122,-88.74
3123,-88.75
3124,-88.77
3125,-88.81
3126,-88.86
3127,-88.91
3128,-88.96
3129,-89.02
3130,-89.08
3131,-89.12
3132,-89.15
3133,-89.16
3134,-89.17
3135,-89.15
3136,-89.12
3137,-89.08
3138,-89.02
3139,-88.96
3140,-88.90
3141,-88.85
3142,-88.83
3143,-88.82
3144,-88.81
3145,-88.81
3146,-88.82
3147,-88.85
3148,-88.89
3149,-88.92
3150,-88.94
3151,-88.97
3152,-89.00
3153,-89.02
3154,-89.02
3155,-89.00
3156,-88.98
3157,-88.95
3158,-88.91
3159,-88.86
3160,-88.82
3161,-88.78
3162,-88.72
3163,-88.66
3164,-88.61
3165,-88.57
3166,-88.52
3167,-88.48
3168,-88.42
3169,-88.36
3170,-88.31
3171,-88.27
3172,-88.22
3173,-88.16
3174,-88.09
3175,-88.03
3176,-87.98
3177,-87.94
3178,-87.90
3179,-87.87
3180,-87.85
3181,-87.84
3182,-87.83
3183,-87.81
3184,-87.78
3185,-87.75
3186,-87.73
3187,-87.72
3188,-87.69
3189,-87.65
3190,-87.60
3191,-87.57
3192,-87.55
3193,-87.52
3194,-87.49
3195,-87.47
3196,-87.47
3197,-87.49
3198,-87.51
3199,-87.54
3200,-87.58
3201,-87.62
3202,-87.68
3203,-87.74
3204,-87.80
3205,-87.84
3206,-87.87
3207,-87.88
3208,-87.89
3209,-87.89
3210,-87.88
3211,-87.85
3212,-87.81
3213,-87.78
3214,-87.76
3215,-87.74
3216,-87.74
3217,-87.75
3218,-87.79
3219,-87.83
3220,-87.89
3221,-87.97
3222,-88.05
3223,-88.12
3224,-88.19
3225,-88.23
3226,-88.26
3227,-88.28
3228,-88.27
3229,-88.24
3230,-88.18
3231,-88.11
3232,-88.03
3233,-87.95
3234,-87.88
3235,-87.80
3236,-87.74
3237,-87.70
3238,-87.66
3239,-87.65
3240,-87.65
3241,-87.67
3242,-87.69
3243,-87.72
3244,-87.76
3245,-87.81
3246,-87.85
3247,-87.90
3248,-87.93
3249,-87.96
3250,-87.99
3251,-88.02
3252,-88.05
3253,-88.06
3254,-88.08
3255,-88.09
3256,-88.10
3257,-88.08
3258,-88.06
3259,-88.02
3260,-87.99
3261,-87.96
3262,-87.94
3263,-87.92
3264,-87.91
3265,-87.89
3266,-87.88
3267,-87.90
3268,-87.94
3269,-87.99
3270,-88.02
3271,-88.05
3272,-88.09
3273,-88.13
3274,-88.17
3275,-88.18
3276,-88.19
3277,-88.19
3278,-88.17
3279,-88.15
3280,-88.11
3281,-88.06
3282,-88.01
3283,-87.97
3284,-87.93
3285,-87.90
3286,-87.88
3287,-87.86
3288,-87.86
3289,-87.88
3290,-87.90
3291,-87.93
3292,-87.96
3293,-87.99
3294,-88.02
3295,-88.03
3296,-88.04
3297,-88.04
3298,-88.03
3299,-88.00
3300,-87.95
3301,-87.91
3302,-87.87
3303,-87.82
3304,-87.77
3305,-87.73
3306,-87.70
3307,-87.70
3308,-87.72
3309,-87.75
3310,-87.79
3311,-87.84
3312,-87.88
3313,-87.92
3314,-87.97
3315,-88.02
3316,-88.05
3317,-88.09
3318,-88.12
3319,-88.14
3320,-88.16
3321,-88.16
3322,-88.16
3323,-88.16
3324,-88.16
3325,-88.16
3326,-88.16
3327,-88.16
3328,-88.14
3329,-88.12
3330,-88.08
3331,-88.05
3332,-88.02
3333,-87.97
3334,-87.92
3335,-87.86
3336,-87.80
3337,-87.76
3338,-87.73
3339,-87.71
3340,-87.69
3341,-87.68
3342,-87.69
3343,-87.72
3344,-87.74
3345,-87.76
3346,-87.79
3347,-87.83
3348,-87.88
3349,-87.91
3350,-87.93
3351,-87.94
3352,-87.95
3353,-87.95
3354,-87.94
3355,-87.93
3356,-87.91
3357,-87.88
3358,-87.84
3359,-87.79
3360,-87.74
3361,-87.70
3362,-87.66
3363,-87.62
3364,-87.56
3365,-87.50
3366,-87.44
3367,-87.38
3368,-87.33
3369,-87.29
3370,-87.23
3371,-87.18
3372,-87.11
3373,-87.05
3374,-86.99
3375,-86.94
3376,-86.88
3377,-86.82
3378,-86.76
3379,-86.70
3380,-86.64
3381,-86.60
3382,-86.56
3383,-86.53
3384,-86.50
3385,-86.49
3386,-86.50
3387,-86.53
3388,-86.57
3389,-86.62
3390,-86.66
3391,-86.70
3392,-86.76
3393,-86.82
3394,-86.87
3395,-86.90
3396,-86.92
3397,-86.93
3398,-86.93
3399,-86.92
3400,-86.90
3401,-86.89
3402,-86.86
3403,-86.83
3404,-86.81
3405,-86.81
3406,-86.82
3407,-86.83
3408,-86.87
3409,-86.91
3410,-86.95
3411,-86.98
3412,-87.01
3413,-87.04
3414,-87.06
3415,-87.06
3416,-87.05
3417,-87.04
3418,-87.01
3419,-86.96
3420,-86.91
3421,-86.87
3422,-86.83
3423,-86.80
3424,-86.77
3425,-86.76
3426,-86.76
3427,-86.77
3428,-86.80
3429,-86.81
3430,-86.82
3431,-86.82
3432,-86.81
3433,-86.80
3434,-86.77
3435,-86.73
3436,-86.66
3437,-86.59
3438,-86.51
3439,-86.44
3440,-86.36
3441,-86.29
3442,-86.22
3443,-86.16
3444,-86.11
3445,-86.08
3446,-86.06
3447,-86.03
3448,-86.00
3449,-85.99
3450,-85.98
3451,-85.98
3452,-85.98
3453,-85.98
3454,-85.99
3455,-86.00
3456,-86.02
3457,-86.01
3458,-86.01
3459,-86.03
3460,-86.06
3461,-86.09
3462,-86.11
3463,-86.12
3464,-86.15
3465,-86.20
3466,-86.24
3467,-86.27
3468,-86.30
3469,-86.34
3470,-86.40
3471,-86.44
3472,-86.47
3473,-86.48
3474,-86.50
3475,-86.51
3476,-86.51
3477,-86.50
3478,-86.48
3479,-86.47
3480,-86.45
3481,-86.42
3482,-86.38
3483,-86.35
3484,-86.34
3485,-86.34
3486,-86.34
3487,-86.32
3488,-86.30
3489,-86.29
3490,-86.27
3491,-86.26
3492,-86.24
3493,-86.19
3494,-86.13
3495,-86.07
3496,-86.01
3497,-85.95
3498,-85.90
3499,-85.86
3500,-85.81
3501,-85.76
3502,-85.73
3503,-85.72
3504,-85.71
3505,-85.70
3506,-85.68
3507,-85.67
3508,-85.64
3509,-85.61
3510,-85.58
3511,-85.55
3512,-85.53
3513,-85.51
3514,-85.50
3515,-85.50
3516,-85.51
3517,-85.53
3518,-85.54
3519,-85.56
3520,-85.58
3521,-85.61
3522,-85.64
3523,-85.64
3524,-85.61
3525,-85.59
3526,-85.54
3527,-85.49
3528,-85.41
3529,-85.31
3530,-85.23
3531,-85.15
3532,-85.08
3533,-85.01
3534,-84.94
3535,-84.90
3536,-84.86
3537,-84.84
3538,-84.81
3539,-84.79
3540,-84.80
3541,-84.81
3542,-84.82
3543,-84.83
3544,-84.82
3545,-84.82
3546,-84.82
3547,-84.82
3548,-84.82
3549,-84.83
3550,-84.82
3551,-84.81
3552,-84.78
3553,-84.75
3554,-84.72
3555,-84.69
3556,-84.65
3557,-84.59
3558,-84.52
3559,-84.46
3560,-84.40
3561,-84.34
3562,-84.29
3563,-84.25
3564,-84.20
3565,-84.16
3566,-84.11
3567,-84.09
3568,-84.08
3569,-84.09
3570,-84.12
3571,-84.15
3572,-84.19
3573,-84.23
3574,-84.28
3575,-84.35
3576,-84.41
3577,-84.45
3578,-84.47
3579,-84.47
3580,-84.46
3581,-84.45
3582,-84.42
3583,-84.38
3584,-84.32
3585,-84.28
3586,-84.24
3587,-84.21
3588,-84.19
3589,-84.17
3590,-84.16
3591,-84.16
3592,-84.17
3593,-84.19
3594,-84.21
3595,-84.23
3596,-84.23
3597,-84.21
3598,-84.18
3599,-84.13
3600,-84.08
3601,-84.02
3602,-83.96
3603,-83.90
3604,-83.84
3605,-83.80
3606,-83.78
3607,-83.80
3608,-83.83
3609,-83.87
3610,-83.92
3611,-83.98
3612,-84.06
3613,-84.13
3614,-84.20
3615,-84.25
3616,-84.27
3617,-84.27
3618,-84.25
3619,-84.20
3620,-84.13
3621,-84.04
3622,-83.94
3623,-83.86
3624,-83.77
3625,-83.69
3626,-83.63
3627,-83.58
3628,-83.57
3629,-83.59
3630,-83.61
3631,-83.65
3632,-83.68
3633,-83.71
3634,-83.72
3635,-83.73
3636,-83.72
3637,-83.70
3638,-83.67
3639,-83.63
3640,-83.58
3641,-83.54
3642,-83.49
3643,-83.43
3644,-83.36
3645,-83.32
3646,-83.30
3647,-83.30
3648,-83.30
3649,-83.30
3650,-83.31
3651,-83.34
3652,-83.39
3653,-83.43
3654,-83.47
3655,-83.50
3656,-83.52
3657,-83.54
3658,-83.55
3659,-83.57
3660,-83.58
3661,-83.58
3662,-83.58
3663,-83.58
3664,-83.57
3665,-83.55
3666,-83.54
3667,-83.54
3668,-83.55
3669,-83.55
3670,-83.54
3671,-83.52
3672,-83.51
3673,-83.51
3674,-83.51
3675,-83.49
3676,-83.47
3677,-83.46
3678,-83.44
3679,-83.41
3680,-83.37
3681,-83.33
3682,-83.29
3683,-83.26
3684,-83.24
3685,-83.22
3686,-83.21
3687,-83.21
3688,-83.22
3689,-83.26
3690,-83.29
3691,-83.33
3692,-83.35
3693,-83.38
3694,-83.41
3695,-83.43
3696,-83.41
3697,-83.37
3698,-83.31
3699,-83.25
3700,-83.18
3701,-83.11
3702,-83.03
3703,-82.95
3704,-82.89
3705,-82.84
3706,-82.82
3707,-82.82
3708,-82.85
3709,-82.91
3710,-82.98
3711,-83.08
3712,-83.18
3713,-83.29
3714,-83.38
3715,-83.45
3716,-83.52
3717,-83.58
3718,-83.62
3719,-83.64
3720,-83.63
3721,-83.62
3722,-83.58
3723,-83.54
3724,-83.49
3725,-83.44
3726,-83.40
3727,-83.36
3728,-83.31
3729,-83.27
3730,-83.22
3731,-83.18
3732,-83.13
3733,-83.09
3734,-83.06
3735,-83.04
3736,-83.03
3737,-83.01
3738,-83.01
3739,-83.02
3740,-83.05
3741,-83.08
3742,-83.12
3743,-83.16
3744,-83.21
3745,-83.27
3746,-83.34
3747,-83.42
3748,-83.49
3749,-83.54
3750,-83.60
3751,-83.66
3752,-83.72
3753,-83.79
3754,-83.84
3755,-83.88
3756,-83.92
3757,-83.96
3758,-84.02
3759,-84.08
3760,-84.12
3761,-84.16
3762,-84.19
3763,-84.23
3764,-84.27
3765,-84.29
3766,-84.30
3767,-84.31
3768,-84.32
3769,-84.32
3770,-84.31
3771,-84.29
3772,-84.29
3773,-84.30
3774,-84.33
3775,-84.36
3776,-84.39
3777,-84.42
3778,-84.45
3779,-84.50
3780,-84.56
3781,-84.60
3782,-84.62
3783,-84.62
3784,-84.61
3785,-84.60
3786,-84.56
3787,-84.51
3788,-84.43
3789,-84.35
3790,-84.28
3791,-84.20
3792,-84.13
3793,-84.06
3794,-83.98
3795,-83.92
3796,-83.88
3797,-83.85
3798,-83.83
3799,-83.82
3800,-83.81
3801,-83.81
3802,-83.82
3803,-83.84
3804,-83.84
3805,-83.83
3806,-83.80
3807,-83.79
3808,-83.78
3809,-83.76
3810,-83.73
3811,-83.69
3812,-83.64
3813,-83.59
3814,-83.56
3815,-83.53
3816,-83.50
3817,-83.49
3818,-83.48
3819,-83.48
3820,-83.49
3821,-83.50
3822,-83.53
3823,-83.58
3824,-83.63
3825,-83.67
3826,-83.71
3827,-83.74
3828,-83.76
3829,-83.78
3830,-83.78
3831,-83.77
3832,-83.74
3833,-83.69
3834,-83.63
3835,-83.55
3836,-83.48
3837,-83.40
3838,-83.32
3839,-83.23
3840,-83.15
3841,-83.07
3842,-83.00
3843,-82.93
3844,-82.85
3845,-82.78
3846,-82.69
3847,-82.61
3848,-82.52
3849,-82.45
3850,-82.37
3851,-82.28
3852,-82.19
3853,-82.12
3854,-82.05
3855,-81.99
3856,-81.94
3857,-81.90
3858,-81.86
3859,-81.83
3860,-81.80
3861,-81.77
3862,-81.75
3863,-81.74
3864,-81.71
3865,-81.67
3866,-81.62
3867,-81.57
3868,-81.52
3869,-81.47
3870,-81.41
3871,-81.34
3872,-81.27
3873,-81.20
3874,-81.14
3875,-81.09
3876,-81.04
3877,-80.98
3878,-80.94
3879,-80.91
3880,-80.87
3881,-80.83
3882,-80.79
3883,-80.75
3884,-80.73
3885,-80.72
3886,-80.72
3887,-80.72
3888,-80.71
3889,-80.72
3890,-80.73
3891,-80.76
3892,-80.79
3893,-80.82
3894,-80.86
3895,-80.90
3896,-80.94
3897,-80.98
3898,-80.99
3899,-80.99
3900,-80.98
3901,-80.97
3902,-80.94
3903,-80.92
3904,-80.87
3905,-80.81
3906,-80.74
3907,-80.66
3908,-80.59
3909,-80.52
3910,-80.43
3911,-80.35
3912,-80.26
3913,-80.18
3914,-80.11
3915,-80.04
3916,-79.98
3917,-79.95
3918,-79.93
3919,-79.92
3920,-79.90
3921,-79.90
3922,-79.93
3923,-79.98
3924,-80.03
3925,-80.07
3926,-80.10
3927,-80.14
3928,-80.17
3929,-80.20
3930,-80.21
3931,-80.20
3932,-80.17
3933,-80.14
3934,-80.10
3935,-80.04
3936,-79.97
3937,-79.89
3938,-79.81
3939,-79.74
3940,-79.68
3941,-79.61
3942,-79.55
3943,-79.51
3944,-79.49
3945,-79.49
3946,-79.49
3947,-79.50
3948,-79.51
3949,-79.53
3950,-79.57
3951,-79.60
3952,-79.63
3953,-79.66
3954,-79.68
3955,-79.68
3956,-79.66
3957,-79.63
3958,-79.60
3959,-79.55
3960,-79.50
3961,-79.44
3962,-79.37
3963,-79.32
3964,-79.27
3965,-79.24
3966,-79.23
3967,-79.22
3968,-79.23
3969,-79.24
3970,-79.28
3971,-79.34
3972,-79.41
3973,-79.47
3974,-79.52
3975,-79.57
3976,-79.61
3977,-79.66
3978,-79.68
3979,-79.68
3980,-79.67
3981,-79.65
3982,-79.63
3983,-79.59
3984,-79.52
3985,-79.45
3986,-79.36
3987,-79.28
3988,-79.18
3989,-79.09
3990,-79.01
3991,-78.95
3992,-78.91
3993,-78.88
3994,-78.87
3995,-78.88
3996,-78.92
3997,-78.96
3998,-79.02
3999,-79.08
4000,-79.14
4001,-79.20
4002,-79.25
4003,-79.30
4004,-79.33
4005,-79.35
4006,-79.35
4007,-79.33
4008,-79.30
4009,-79.28
4010,-79.24
4011,-79.21
4012,-79.18
4013,-79.15
4014,-79.13
4015,-79.11
4016,-79.11
4017,-79.12
4018,-79.15
4019,-79.20
4020,-79.26
4021,-79.33
4022,-79.41
4023,-79.49
4024,-79.57
4025,-79.64
4026,-79.71
4027,-79.77
4028,-79.82
4029,-79.86
4030,-79.90
4031,-79.93
4032,-79.96
4033,-79.97
4034,-79.97
4035,-79.97
4036,-79.98
4037,-79.99
4038,-80.02
4039,-80.05
4040,-80.08
4041,-80.11
4042,-80.13
4043,-80.16
4044,-80.20
4045,-80.23
4046,-80.25
4047,-80.26
4048,-80.28
4049,-80.29
4050,-80.30
4051,-80.30
4052,-80.30
4053,-80.30
4054,-80.29
4055,-80.28
4056,-80.26
4057,-80.25
4058,-80.24
4059,-80.24
4060,-80.24
4061,-80.24
4062,-80.25
4063,-80.26
4064,-80.28
4065,-80.29
4066,-80.31
4067,-80.32
4068,-80.33
4069,-80.35
4070,-80.37
4071,-80.39
4072,-80.39
4073,-80.37
4074,-80.34
4075,-80.31
4076,-80.29
4077,-80.26
4078,-80.23
4079,-80.20
4080,-80.16
4081,-80.13
4082,-80.12
4083,-80.12
4084,-80.12
4085,-80.12
4086,-80.13
4087,-80.16
4088,-80.20
4089,-80.23
4090,-80.25
4091,-80.26
4092,-80.28
4093,-80.29
4094,-80.31
4095,-80.30
4096,-80.29
4097,-80.28
4098,-80.27
4099,-80.25
4100,-80.22
4101,-80.19
4102,-80.18
4103,-80.18
4104,-80.17
4105,-80.16
4106,-80.15
4107,-80.17
4108,-80.19
4109,-80.21
4110,-80.22
4111,-80.23
4112,-80.25
4113,-80.26
4114,-80.28
4115,-80.29
4116,-80.30
4117,-80.30
4118,-80.31
4119,-80.32
4120,-80.33
4121,-80.33
4122,-80.33
4123,-80.35
4124,-80.37
4125,-80.39
4126,-80.39
4127,-80.39
4128,-80.39
4129,-80.39
4130,-80.39
4131,-80.37
4132,-80.34
4133,-80.29
4134,-80.25
4135,-80.21
4136,-80.15
4137,-80.08
4138,-79.99
4139,-79.92
4140,-79.85
4141,-79.79
4142,-79.74
4143,-79.69
4144,-79.65
4145,-79.62
4146,-79.61
4147,-79.61
4148,-79.63
4149,-79.66
4150,-79.69
4151,-79.72
4152,-79.75
4153,-79.80
4154,-79.85
4155,-79.89
4156,-79.93
4157,-79.96
4158,-79.98
4159,-80.00
4160,-80.01
4161,-80.00
4162,-80.00
4163,-80.00
4164,-80.01
4165,-80.02
4166,-80.04
4167,-80.05
4168,-80.08
4169,-80.10
4170,-80.13
4171,-80.17
4172,-80.20
4173,-80.23
4174,-80.25
4175,-80.25
4176,-80.23
4177,-80.20
4178,-80.16
4179,-80.10
4180,-80.02
4181,-79.95
4182,-79.88
4183,-79.80
4184,-79.72
4185,-79.64
4186,-79.59
4187,-79.56
4188,-79.55
4189,-79.55
4190,-79.57
4191,-79.59
4192,-79.63
4193,-79.68
4194,-79.73
4195,-79.79
4196,-79.86
4197,-79.90
4198,-79.92
4199,-79.92
4200,-79.91
4201,-79.90
4202,-79.86
4203,-79.82
4204,-79.77
4205,-79.71
4206,-79.64
4207,-79.59
4208,-79.53
4209,-79.47
4210,-79.40
4211,-79.35
4212,-79.29
4213,-79.25
4214,-79.21
4215,-79.18
4216,-79.16
4217,-79.16
4218,-79.17
4219,-79.17
4220,-79.17
4221,-79.19
4222,-79.21
4223,-79.24
4224,-79.28
4225,-79.31
4226,-79.33
4227,-79.34
4228,-79.35
4229,-79.35
4230,-79.35
4231,-79.33
4232,-79.30
4233,-79.27
4234,-79.25
4235,-79.23
4236,-79.22
4237,-79.21
4238,-79.20
4239,-79.20
4240,-79.20
4241,-79.20
4242,-79.21
4243,-79.22
4244,-79.23
4245,-79.23
4246,-79.23
4247,-79.23
4248,-79.22
4249,-79.19
4250,-79.15
4251,-79.12
4252,-79.10
4253,-79.09
4254,-79.07
4255,-79.06
4256,-79.05
4257,-79.05
4258,-79.06
4259,-79.07
4260,-79.09
4261,-79.12
4262,-79.15
4263,-79.18
4264,-79.21
4265,-79.24
4266,-79.28
4267,-79.29
4268,-79.28
4269,-79.27
4270,-79.25
4271,-79.24
4272,-79.21
4273,-79.17
4274,-79.11
4275,-79.05
4276,-78.99
4277,-78.93
4278,-78.88
4279,-78.83
4280,-78.79
4281,-78.75
4282,-78.70
4283,-78.65
4284,-78.62
4285,-78.61
4286,-78.60
4287,-78.59
4288,-78.56
4289,-78.55
4290,-78.55
4291,-78.55
4292,-78.53
4293,-78.50
4294,-78.47
4295,-78.46
4296,-78.45
4297,-78.44
4298,-78.41
4299,-78.38
4300,-78.36
4301,-78.36
4302,-78.37
4303,-78.37
4304,-78.37
4305,-78.38
4306,-78.41
4307,-78.44
4308,-78.46
4309,-78.48
4310,-78.49
4311,-78.51
4312,-78.52
4313,-78.52
4314,-78.50
4315,-78.47
4316,-78.44
4317,-78.41
4318,-78.38
4319,-78.33
4320,-78.28
4321,-78.23
4322,-78.20
4323,-78.19
4324,-78.18
4325,-78.18
4326,-78.19
4327,-78.20
4328,-78.22
4329,-78.24
4330,-78.25
4331,-78.25
4332,-78.23
4333,-78.20
4334,-78.17
4335,-78.14
4336,-78.12
4337,-78.09
4338,-78.05
4339,-78.02
4340,-78.00
4341,-78.00
4342,-78.01
4343,-78.03
4344,-78.05
4345,-78.10
4346,-78.15
4347,-78.20
4348,-78.23
4349,-78.24
4350,-78.25
4351,-78.25
4352,-78.24
4353,-78.21
4354,-78.16
4355,-78.10
4356,-78.04
4357,-77.98
4358,-77.92
4359,-77.88
4360,-77.84
4361,-77.79
4362,-77.75
4363,-77.72
4364,-77.69
4365,-77.67
4366,-77.63
4367,-77.61
4368,-77.58
4369,-77.55
4370,-77.51
4371,-77.47
4372,-77.43
4373,-77.40
4374,-77.37
4375,-77.36
4376,-77.35
4377,-77.35
4378,-77.35
4379,-77.35
4380,-77.36
4381,-77.38
4382,-77.39
4383,-77.39
4384,-77.39
4385,-77.40
4386,-77.43
4387,-77.46
4388,-77.47
4389,-77.49
4390,-77.52
4391,-77.57
4392,-77.62
4393,-77.66
4394,-77.71
4395,-77.75
4396,-77.78
4397,-77.80
4398,-77.80
4399,-77.80
4400,-77.80
4401,-77.79
4402,-77.75
4403,-77.69
4404,-77.62
4405,-77.56
4406,-77.50
4407,-77.44
4408,-77.38
4409,-77.32
4410,-77.26
4411,-77.22
4412,-77.19
4413,-77.18
4414,-77.17
4415,-77.17
4416,-77.18
4417,-77.19
4418,-77.22
4419,-77.27
4420,-77.31
4421,-77.36
4422,-77.41
4423,-77.47
4424,-77.53
4425,-77.57
4426,-77.62
4427,-77.66
4428,-77.70
4429,-77.73
4430,-77.74
4431,-77.74
4432,-77.74
4433,-77.74
4434,-77.73
4435,-77.70
4436,-77.67
4437,-77.64
4438,-77.61
4439,-77.58
4440,-77.55
4441,-77.54
4442,-77.52
4443,-77.51
4444,-77.50
4445,-77.50
4446,-77.50
4447,-77.50
4448,-77.51
4449,-77.53
4450,-77.53
4451,-77.51
4452,-77.50
4453,-77.48
4454,-77.45
4455,-77.39
4456,-77.33
4457,-77.26
4458,-77.19
4459,-77.11
4460,-77.01
4461,-76.90
4462,-76.79
4463,-76.69
4464,-76.59
4465,-76.48
4466,-76.39
4467,-76.29
4468,-76.21
4469,-76.14
4470,-76.08
4471,-76.03
4472,-75.99
4473,-75.95
4474,-75.91
4475,-75.90
4476,-75.89
4477,-75.89
4478,-75.90
4479,-75.92
4480,-75.92
4481,-75.93
4482,-75.93
4483,-75.95
4484,-75.96
4485,-75.98
4486,-75.99
4487,-76.00
4488,-76.03
4489,-76.06
4490,-76.09
4491,-76.12
4492,-76.15
4493,-76.18
4494,-76.21
4495,-76.26
4496,-76.30
4497,-76.35
4498,-76.40
4499,-76.44
4500,-76.48
4501,-76.50
4502,-76.54
4503,-76.57
4504,-76.59
4505,-76.61
4506,-76.62
4507,-76.63
4508,-76.65
4509,-76.68
4510,-76.71
4511,-76.73
4512,-76.73
4513,-76.73
4514,-76.74
4515,-76.75
4516,-76.76
4517,-76.76
4518,-76.75
4519,-76.74
4520,-76.72
4521,-76.68
4522,-76.66
4523,-76.65
4524,-76.63
4525,-76.60
4526,-76.56
4527,-76.53
4528,-76.51
4529,-76.51
4530,-76.52
4531,-76.52
4532,-76.52
4533,-76.54
4534,-76.56
4535,-76.59
4536,-76.63
4537,-76.66
4538,-76.68
4539,-76.69
4540,-76.71
4541,-76.72
4542,-76.73
4543,-76.73
4544,-76.72
4545,-76.71
4546,-76.69
4547,-76.66
4548,-76.62
4549,-76.60
4550,-76.57
4551,-76.54
4552,-76.50
4553,-76.46
4554,-76.42
4555,-76.39
4556,-76.36
4557,-76.33
4558,-76.29
4559,-76.27
4560,-76.24
4561,-76.21
4562,-76.17
4563,-76.15
4564,-76.13
4565,-76.11
4566,-76.09
4567,-76.06
4568,-76.04
4569,-76.04
4570,-76.04
4571,-76.04
4572,-76.05
4573,-76.06
4574,-76.08
4575,-76.12
4576,-76.15
4577,-76.18
4578,-76.20
4579,-76.22
4580,-76.23
4581,-76.25
4582,-76.25
4583,-76.23
4584,-76.22
4585,-76.20
4586,-76.18
4587,-76.15
4588,-76.12
4589,-76.10
4590,-76.11
4591,-76.13
4592,-76.14
4593,-76.14
4594,-76.14
4595,-76.16
4596,-76.17
4597,-76.15
4598,-76.11
4599,-76.07
4600,-76.02
4601,-75.96
4602,-75.89
4603,-75.82
4604,-75.74
4605,-75.66
4606,-75.59
4607,-75.54
4608,-75.48
4609,-75.44
4610,-75.40
4611,-75.37
4612,-75.35
4613,-75.32
4614,-75.27
4615,-75.23
4616,-75.20
4617,-75.16
4618,-75.13
4619,-75.09
4620,-75.05
4621,-75.03
4622,-75.02
4623,-75.01
4624,-75.01
4625,-75.02
4626,-75.04
4627,-75.05
4628,-75.07
4629,-75.09
4630,-75.09
4631,-75.09
4632,-75.08
4633,-75.07
4634,-75.06
4635,-75.06
4636,-75.05
4637,-75.04
4638,-75.04
4639,-75.05
4640,-75.07
4641,-75.08
4642,-75.11
4643,-75.15
4644,-75.21
4645,-75.27
4646,-75.32
4647,-75.37
4648,-75.42
4649,-75.46
4650,-75.50
4651,-75.51
4652,-75.50
4653,-75.49
4654,-75.47
4655,-75.44
4656,-75.39
4657,-75.33
4658,-75.28
4659,-75.23
4660,-75.19
4661,-75.14
4662,-75.10
4663,-75.09
4664,-75.09
4665,-75.11
4666,-75.13
4667,-75.16
4668,-75.20
4669,-75.25
4670,-75.29
4671,-75.32
4672,-75.33
4673,-75.33
4674,-75.33
4675,-75.33
4676,-75.31
4677,-75.27
4678,-75.22
4679,-75.17
4680,-75.13
4681,-75.09
4682,-75.04
4683,-75.00
4684,-74.95
4685,-74.90
4686,-74.87
4687,-74.84
4688,-74.81
4689,-74.78
4690,-74.76
4691,-74.74
4692,-74.73
4693,-74.71
4694,-74.70
4695,-74.70
4696,-74.71
4697,-74.73
4698,-74.74
4699,-74.76
4700,-74.77
4701,-74.79
4702,-74.80
4703,-74.82
4704,-74.83
4705,-74.84
4706,-74.86
4707,-74.87
4708,-74.89
4709,-74.91
4710,-74.92
4711,-74.93
4712,-74.96
4713,-74.98
4714,-75.02
4715,-75.06
4716,-75.12
4717,-75.18
4718,-75.24
4719,-75.30
4720,-75.35
4721,-75.40
4722,-75.44
4723,-75.47
4724,-75.49
4725,-75.49
4726,-75.48
4727,-75.48
4728,-75.48
4729,-75.46
4730,-75.44
4731,-75.41
4732,-75.37
4733,-75.34
4734,-75.31
4735,-75.28
4736,-75.26
4737,-75.23
4738,-75.20
4739,-75.17
4740,-75.13
4741,-75.10
4742,-75.08
4743,-75.07
4744,-75.05
4745,-75.04
4746,-75.02
4747,-75.03
4748,-75.04
4749,-75.06
4750,-75.06
4751,-75.04
4752,-75.03
4753,-75.03
4754,-75.03
4755,-75.02
4756,-74.99
4757,-74.96
4758,-74.93
4759,-74.92
4760,-74.91
4761,-74.89
4762,-74.87
4763,-74.84
4764,-74.81
4765,-74.79
4766,-74.74
4767,-74.68
4768,-74.61
4769,-74.54
4770,-74.45
4771,-74.34
4772,-74.24
4773,-74.15
4774,-74.06
4775,-73.97
4776,-73.89
4777,-73.83
4778,-73.79
4779,-73.76
4780,-73.74
4781,-73.74
4782,-73.77
4783,-73.81
4784,-73.87
4785,-73.93
4786,-73.99
4787,-74.07
4788,-74.15
4789,-74.24
4790,-74.33
4791,-74.42
4792,-74.52
4793,-74.61
4794,-74.67
4795,-74.72
4796,-74.76
4797,-74.79
4798,-74.80
4799,-74.79
4800,-74.75
4801,-74.70
4802,-74.64
4803,-74.57
4804,-74.49
4805,-74.40
4806,-74.29
4807,-74.19
4808,-74.09
4809,-74.02
4810,-73.96
4811,-73.90
4812,-73.84
4813,-73.80
4814,-73.77
4815,-73.75
4816,-73.75
4817,-73.75
4818,-73.76
4819,-73.76
4820,-73.74
4821,-73.71
4822,-73.68
4823,-73.65
4824,-73.61
4825,-73.57
4826,-73.53
4827,-73.50
4828,-73.47
4829,-73.46
4830,-73.46
4831,-73.47
4832,-73.50
4833,-73.53
4834,-73.56
4835,-73.61
4836,-73.67
4837,-73.72
4838,-73.77
4839,-73.80
4840,-73.83
4841,-73.86
4842,-73.89
4843,-73.90
4844,-73.90
4845,-73.90
4846,-73.91
4847,-73.92
4848,-73.93
4849,-73.95
4850,-73.98
4851,-74.01
4852,-74.03
4853,-74.04
4854,-74.07
4855,-74.10
4856,-74.11
4857,-74.11
4858,-74.11
4859,-74.11
4860,-74.10
4861,-74.09
4862,-74.08
4863,-74.06
4864,-74.04
4865,-74.03
4866,-74.02
4867,-74.02
4868,-74.02
4869,-74.02
4870,-74.03
4871,-74.03
4872,-74.01
4873,-73.98
4874,-73.95
4875,-73.92
4876,-73.87
4877,-73.82
4878,-73.76
4879,-73.71
4880,-73.67
4881,-73.62
4882,-73.59
4883,-73.58
4884,-73.57
4885,-73.57
4886,-73.58
4887,-73.59
4888,-73.61
4889,-73.63
4890,-73.64
4891,-73.66
4892,-73.66
4893,-73.66
4894,-73.66
4895,-73.66
4896,-73.66
4897,-73.65
4898,-73.63
4899,-73.61
4900,-73.60
4901,-73.60
4902,-73.61
4903,-73.63
4904,-73.64
4905,-73.65
4906,-73.67
4907,-73.70
4908,-73.74
4909,-73.77
4910,-73.79
4911,-73.81
4912,-73.82
4913,-73.83
4914,-73.85
4915,-73.86
4916,-73.87
4917,-73.87
4918,-73.87
4919,-73.87
4920,-73.87
4921,-73.87
4922,-73.88
4923,-73.91
4924,-73.94
4925,-73.97
4926,-74.01
4927,-74.05
4928,-74.10
4929,-74.15
4930,-74.19
4931,-74.24
4932,-74.28
4933,-74.31
4934,-74.32
4935,-74.32
4936,-74.32
4937,-74.32
4938,-74.31
4939,-74.28
4940,-74.24
4941,-74.21
4942,-74.19
4943,-74.18
4944,-74.16
4945,-74.15
4946,-74.14
4947,-74.14
4948,-74.14
4949,-74.14
4950,-74.14
4951,-74.14
4952,-74.13
4953,-74.10
4954,-74.05
4955,-73.99
4956,-73.93
4957,-73.87
4958,-73.81
4959,-73.75
4960,-73.70
4961,-73.65
4962,-73.61
4963,-73.58
4964,-73.57
4965,-73.59
4966,-73.61
4967,-73.65
4968,-73.68
4969,-73.73
4970,-73.77
4971,-73.81
4972,-73.82
4973,-73.82
4974,-73.81
4975,-73.79
4976,-73.78
4977,-73.76
4978,-73.74
4979,-73.72
4980,-73.73
4981,-73.74
4982,-73.76
4983,-73.78
4984,-73.79
4985,-73.82
4986,-73.86
4987,-73.91
4988,-73.95
4989,-73.98
4990,-74.01
4991,-74.04
4992,-74.06
4993,-74.07
4994,-74.09
4995,-74.12
4996,-74.15
4997,-74.19
4998,-74.21
4999,-74.24
5000,-74.28
5001,-74.33
5002,-74.37
5003,-74.42
5004,-74.45
5005,-74.48
5006,-74.51
5007,-74.55
5008,-74.56
5009,-74.56
5010,-74.55
5011,-74.54
5012,-74.52
5013,-74.49
5014,-74.44
5015,-74.38
5016,-74.32
5017,-74.26
5018,-74.19
5019,-74.12
5020,-74.04
5021,-73.96
5022,-73.90
5023,-73.86
5024,-73.83
5025,-73.80
5026,-73.77
5027,-73.75
5028,-73.75
5029,-73.77
5030,-73.80
5031,-73.83
5032,-73.86
5033,-73.88
5034,-73.91
5035,-73.95
5036,-73.98
5037,-73.99
5038,-73.98
5039,-73.97
5040,-73.96
5041,-73.96
5042,-73.96
5043,-73.94
5044,-73.93
5045,-73.92
5046,-73.94
5047,-73.96
5048,-73.96
5049,-73.96
5050,-73.97
5051,-73.98
5052,-74.00
5053,-74.00
5054,-73.99
5055,-73.99
5056,-74.00
5057,-74.01
5058,-74.02
5059,-74.02
5060,-74.03
5061,-74.06
5062,-74.09
5063,-74.13
5064,-74.16
5065,-74.19
5066,-74.21
5067,-74.23
5068,-74.24
5069,-74.24
5070,-74.21
5071,-74.17
5072,-74.12
5073,-74.08
5074,-74.02
5075,-73.94
5076,-73.87
5077,-73.81
5078,-73.76
5079,-73.71
5080,-73.68
5081,-73.66
5082,-73.67
5083,-73.68
5084,-73.70
5085,-73.73
5086,-73.78
5087,-73.83
5088,-73.85
5089,-73.85
5090,-73.84
5091,-73.83
5092,-73.80
5093,-73.76
5094,-73.68
5095,-73.59
5096,-73.50
5097,-73.41
5098,-73.32
5099,-73.23
5100,-73.14
5101,-73.07
5102,-73.01
5103,-72.98
5104,-72.97
5105,-72.99
5106,-73.03
5107,-73.09
5108,-73.16
5109,-73.23
5110,-73.33
5111,-73.43
5112,-73.53
5113,-73.60
5114,-73.67
5115,-73.73
5116,-73.77
5117,-73.79
5118,-73.78
5119,-73.76
5120,-73.74
5121,-73.71
5122,-73.68
5123,-73.67
5124,-73.66
5125,-73.66
5126,-73.66
5127,-73.68
5128,-73.71
5129,-73.76
5130,-73.80
5131,-73.83
5132,-73.85
5133,-73.86
5134,-73.87
5135,-73.87
5136,-73.87
5137,-73.87
5138,-73.87
5139,-73.87
5140,-73.88
5141,-73.89
5142,-73.91
5143,-73.92
5144,-73.94
5145,-73.96
5146,-73.97
5147,-73.97
5148,-73.95
5149,-73.92
5150,-73.88
5151,-73.84
5152,-73.78
5153,-73.72
5154,-73.67
5155,-73.65
5156,-73.62
5157,-73.59
5158,-73.57
5159,-73.57
5160,-73.59
5161,-73.62
5162,-73.65
5163,-73.68
5164,-73.71
5165,-73.74
5166,-73.76
5167,-73.76
5168,-73.75
5169,-73.75
5170,-73.75
5171,-73.75
5172,-73.75
5173,-73.75
5174,-73.76
5175,-73.77
5176,-73.79
5177,-73.83
5178,-73.86
5179,-73.90
5180,-73.95
5181,-74.00
5182,-74.04
5183,-74.09
5184,-74.13
5185,-74.18
5186,-74.22
5187,-74.27
5188,-74.31
5189,-74.33
5190,-74.36
5191,-74.39
5192,-74.42
5193,-74.44
5194,-74.43
5195,-74.41
5196,-74.41
5197,-74.40
5198,-74.40
5199,-74.38
5200,-74.37
5201,-74.37
5202,-74.37
5203,-74.37
5204,-74.39
5205,-74.41
5206,-74.46
5207,-74.51
5208,-74.55
5209,-74.59
5210,-74.63
5211,-74.66
5212,-74.68
5213,-74.68
5214,-74.67
5215,-74.64
5216,-74.59
5217,-74.53
5218,-74.46
5219,-74.39
5220,-74.31
5221,-74.23
5222,-74.17
5223,-74.11
5224,-74.05
5225,-74.01
5226,-73.98
5227,-73.96
5228,-73.95
5229,-73.96
5230,-73.97
5231,-74.00
5232,-74.04
5233,-74.07
5234,-74.09
5235,-74.12
5236,-74.15
5237,-74.18
5238,-74.22
5239,-74.25
5240,-74.26
5241,-74.26
5242,-74.26
5243,-74.26
5244,-74.26
5245,-74.24
5246,-74.22
5247,-74.20
5248,-74.20
5249,-74.20
5250,-74.20
5251,-74.20
5252,-74.20
5253,-74.22
5254,-74.24
5255,-74.27
5256,-74.32
5257,-74.38
5258,-74.43
5259,-74.48
5260,-74.53
5261,-74.58
5262,-74.64
5263,-74.69
5264,-74.72
5265,-74.74
5266,-74.73
5267,-74.72
5268,-74.69
5269,-74.64
5270,-74.58
5271,-74.51
5272,-74.42
5273,-74.32
5274,-74.21
5275,-74.10
5276,-74.00
5277,-73.90
5278,-73.79
5279,-73.70
5280,-73.62
5281,-73.57
5282,-73.53
5283,-73.50
5284,-73.47
5285,-73.46
5286,-73.45
5287,-73.45
5288,-73.46
5289,-73.46
5290,-73.45
5291,-73.43
5292,-73.42
5293,-73.39
5294,-73.34
5295,-73.28
5296,-73.22
5297,-73.16
5298,-73.09
5299,-73.02
5300,-72.94
5301,-72.87
5302,-72.79
5303,-72.72
5304,-72.64
5305,-72.57
5306,-72.50
5307,-72.44
5308,-72.38
5309,-72.33
5310,-72.26
5311,-72.20
5312,-72.15
5313,-72.11
5314,-72.06
5315,-72.02
5316,-71.98
5317,-71.95
5318,-71.92
5319,-71.89
5320,-71.88
5321,-71.88
5322,-71.88
5323,-71.88
5324,-71.89
5325,-71.92
5326,-71.95
5327,-71.98
5328,-72.01
5329,-72.04
5330,-72.07
5331,-72.10
5332,-72.13
5333,-72.14
5334,-72.16
5335,-72.17
5336,-72.18
5337,-72.18
5338,-72.17
5339,-72.15
5340,-72.15
5341,-72.15
5342,-72.15
5343,-72.15
5344,-72.15
5345,-72.16
5346,-72.19
5347,-72.22
5348,-72.24
5349,-72.27
5350,-72.32
5351,-72.38
5352,-72.45
5353,-72.51
5354,-72.56
5355,-72.60
5356,-72.65
5357,-72.69
5358,-72.72
5359,-72.74
5360,-72.74
5361,-72.73
5362,-72.69
5363,-72.63
5364,-72.55
5365,-72.46
5366,-72.38
5367,-72.30
5368,-72.22
5369,-72.15
5370,-72.09
5371,-72.06
5372,-72.06
5373,-72.07
5374,-72.10
5375,-72.15
5376,-72.20
5377,-72.28
5378,-72.37
5379,-72.46
5380,-72.54
5381,-72.60
5382,-72.65
5383,-72.67
5384,-72.68
5385,-72.67
5386,-72.64
5387,-72.61
5388,-72.56
5389,-72.50
5390,-72.45
5391,-72.40
5392,-72.36
5393,-72.32
5394,-72.28
5395,-72.27
5396,-72.26
5397,-72.26
5398,-72.28
5399,-72.31
5400,-72.33
5401,-72.35
5402,-72.37
5403,-72.40
5404,-72.42
5405,-72.42
5406,-72.41
5407,-72.39
5408,-72.38
5409,-72.36
5410,-72.34
5411,-72.33
5412,-72.33
5413,-72.33
5414,-72.31
5415,-72.30
5416,-72.30
5417,-72.31
5418,-72.32
5419,-72.33
5420,-72.33
5421,-72.33
5422,-72.31
5423,-72.28
5424,-72.25
5425,-72.22
5426,-72.18
5427,-72.12
5428,-72.06
5429,-72.02
5430,-71.96
5431,-71.91
5432,-71.86
5433,-71.83
5434,-71.80
5435,-71.79
5436,-71.79
5437,-71.80
5438,-71.84
5439,-71.88
5440,-71.93
5441,-71.97
5442,-72.02
5443,-72.08
5444,-72.15
5445,-72.21
5446,-72.26
5447,-72.31
5448,-72.34
5449,-72.35
5450,-72.36
5451,-72.36
5452,-72.35
5453,-72.34
5454,-72.31
5455,-72.30
5456,-72.29
5457,-72.29
5458,-72.29
5459,-72.29
5460,-72.30
5461,-72.31
5462,-72.34
5463,-72.35
5464,-72.35
5465,-72.35
5466,-72.36
5467,-72.38
5468,-72.39
5469,-72.39
5470,-72.38
5471,-72.36
5472,-72.35
5473,-72.34
5474,-72.31
5475,-72.28
5476,-72.25
5477,-72.22
5478,-72.20
5479,-72.18
5480,-72.16
5481,-72.15
5482,-72.15
5483,-72.16
5484,-72.18
5485,-72.20
5486,-72.21
5487,-72.24
5488,-72.29
5489,-72.33
5490,-72.37
5491,-72.40
5492,-72.43
5493,-72.46
5494,-72.48
5495,-72.50
5496,-72.51
5497,-72.53
5498,-72.53
5499,-72.53
5500,-72.53
5501,-72.53
5502,-72.53
5503,-72.51
5504,-72.50
5505,-72.48
5506,-72.46
5507,-72.43
5508,-72.40
5509,-72.37
5510,-72.34
5511,-72.31
5512,-72.28
5513,-72.27
5514,-72.26
5515,-72.24
5516,-72.22
5517,-72.21
5518,-72.20
5519,-72.21
5520,-72.20
5521,-72.19
5522,-72.17
5523,-72.15
5524,-72.14
5525,-72.13
5526,-72.11
5527,-72.09
5528,-72.08
5529,-72.07
5530,-72.04
5531,-72.01
5532,-71.98
5533,-71.95
5534,-71.93
5535,-71.92
5536,-71.90
5537,-71.87
5538,-71.84
5539,-71.82
5540,-71.82
5541,-71.82
5542,-71.82
5543,-71.82
5544,-71.82
5545,-71.84
5546,-71.86
5547,-71.89
5548,-71.93
5549,-71.97
5550,-72.01
5551,-72.04
5552,-72.07
5553,-72.10
5554,-72.14
5555,-72.16
5556,-72.18
5557,-72.18
5558,-72.17
5559,-72.17
5560,-72.18
5561,-72.18
5562,-72.17
5563,-72.16
5564,-72.14
5565,-72.13
5566,-72.10
5567,-72.08
5568,-72.04
5569,-71.99
5570,-71.94
5571,-71.88
5572,-71.82
5573,-71.76
5574,-71.70
5575,-71.66
5576,-71.62
5577,-71.59
5578,-71.57
5579,-71.57
5580,-71.59
5581,-71.62
5582,-71.66
5583,-71.72
5584,-71.80
5585,-71.88
5586,-71.99
5587,-72.09
5588,-72.20
5589,-72.28
5590,-72.37
5591,-72.46
5592,-72.55
5593,-72.62
5594,-72.68
5595,-72.72
5596,-72.77
5597,-72.81
5598,-72.85
5599,-72.86
5600,-72.87
5601,-72.88
5602,-72.90
5603,-72.91
5604,-72.93
5605,-72.94
5606,-72.96
5607,-72.99
5608,-73.03
5609,-73.08
5610,-73.11
5611,-73.14
5612,-73.18
5613,-73.22
5614,-73.26
5615,-73.28
5616,-73.29
5617,-73.30
5618,-73.31
5619,-73.29
5620,-73.26
5621,-73.23
5622,-73.20
5623,-73.17
5624,-73.15
5625,-73.12
5626,-73.08
5627,-73.03
5628,-72.99
5629,-72.96
5630,-72.94
5631,-72.91
5632,-72.86
5633,-72.82
5634,-72.79
5635,-72.77
5636,-72.76
5637,-72.75
5638,-72.73
5639,-72.71
5640,-72.71
5641,-72.71
5642,-72.71
5643,-72.71
5644,-72.70
5645,-72.69
5646,-72.67
5647,-72.66
5648,-72.64
5649,-72.61
5650,-72.58
5651,-72.54
5652,-72.52
5653,-72.51
5654,-72.50
5655,-72.50
5656,-72.51
5657,-72.52
5658,-72.55
5659,-72.58
5660,-72.61
5661,-72.64
5662,-72.66
5663,-72.68
5664,-72.68
5665,-72.68
5666,-72.68
5667,-72.68
5668,-72.68
5669,-72.66
5670,-72.64
5671,-72.63
5672,-72.62
5673,-72.62
5674,-72.63
5675,-72.67
5676,-72.70
5677,-72.73
5678,-72.76
5679,-72.79
5680,-72.81
5681,-72.83
5682,-72.84
5683,-72.86
5684,-72.86
5685,-72.85
5686,-72.82
5687,-72.79
5688,-72.75
5689,-72.71
5690,-72.66
5691,-72.61
5692,-72.58
5693,-72.55
5694,-72.52
5695,-72.51
5696,-72.50
5697,-72.50
5698,-72.50
5699,-72.49
5700,-72.46
5701,-72.43
5702,-72.40
5703,-72.37
5704,-72.34
5705,-72.29
5706,-72.23
5707,-72.17
5708,-72.13
5709,-72.10
5710,-72.07
5711,-72.04
5712,-72.01
5713,-72.00
5714,-71.99
5715,-71.99
5716,-72.00
5717,-72.02
5718,-72.04
5719,-72.07
5720,-72.10
5721,-72.13
5722,-72.16
5723,-72.19
5724,-72.22
5725,-72.23
5726,-72.24
5727,-72.24
5728,-72.23
5729,-72.21
5730,-72.20
5731,-72.18
5732,-72.17
5733,-72.17
5734,-72.18
5735,-72.19
5736,-72.23
5737,-72.27
5738,-72.32
5739,-72.36
5740,-72.41
5741,-72.47
5742,-72.54
5743,-72.60
5744,-72.64
5745,-72.67
5746,-72.69
5747,-72.71
5748,-72.71
5749,-72.71
5750,-72.71
5751,-72.69
5752,-72.67
5753,-72.66
5754,-72.64
5755,-72.63
5756,-72.62
5757,-72.62
5758,-72.62
5759,-72.63
5760,-72.63
5761,-72.63
5762,-72.62
5763,-72.61
5764,-72.58
5765,-72.55
5766,-72.51
5767,-72.45
5768,-72.38
5769,-72.29
5770,-72.18
5771,-72.06
5772,-71.93
5773,-71.81
5774,-71.70
5775,-71.60
5776,-71.51
5777,-71.43
5778,-71.37
5779,-71.33
5780,-71.30
5781,-71.28
5782,-71.28
5783,-71.28
5784,-71.27
5785,-71.26
5786,-71.25
5787,-71.23
5788,-71.21
5789,-71.18
5790,-71.15
5791,-71.12
5792,-71.09
5793,-71.06
5794,-71.03
5795,-71.01
5796,-71.02
5797,-71.05
5798,-71.10
5799,-71.16
5800,-71.23
5801,-71.30
5802,-71.38
5803,-71.46
5804,-71.52
5805,-71.59
5806,-71.64
5807,-71.68
5808,-71.71
5809,-71.73
5810,-71.73
5811,-71.73
5812,-71.73
5813,-71.73
5814,-71.72
5815,-71.71
5816,-71.70
5817,-71.69
5818,-71.70
5819,-71.70
5820,-71.70
5821,-71.69
5822,-71.70
5823,-71.72
5824,-71.74
5825,-71.75
5826,-71.76
5827,-71.76
5828,-71.77
5829,-71.78
5830,-71.79
5831,-71.79
5832,-71.80
5833,-71.81
5834,-71.82
5835,-71.84
5836,-71.86
5837,-71.88
5838,-71.88
5839,-71.86
5840,-71.84
5841,-71.83
5842,-71.80
5843,-71.78
5844,-71.74
5845,-71.69
5846,-71.65
5847,-71.60
5848,-71.56
5849,-71.55
5850,-71.55
5851,-71.57
5852,-71.59
5853,-71.62
5854,-71.66
5855,-71.71
5856,-71.76
5857,-71.80
5858,-71.83
5859,-71.85
5860,-71.85
5861,-71.85
5862,-71.84
5863,-71.81
5864,-71.77
5865,-71.72
5866,-71.68
5867,-71.63
5868,-71.58
5869,-71.52
5870,-71.47
5871,-71.42
5872,-71.38
5873,-71.33
5874,-71.30
5875,-71.28
5876,-71.28
5877,-71.30
5878,-71.32
5879,-71.35
5880,-71.40
5881,-71.46
5882,-71.52
5883,-71.58
5884,-71.64
5885,-71.72
5886,-71.80
5887,-71.88
5888,-71.93
5889,-71.96
5890,-71.98
5891,-71.99
5892,-72.00
5893,-72.00
5894,-71.99
5895,-71.98
5896,-71.95
5897,-71.92
5898,-71.91
5899,-71.91
5900,-71.91
5901,-71.91
5902,-71.91
5903,-71.91
5904,-71.91
5905,-71.91
5906,-71.91
5907,-71.91
5908,-71.91
5909,-71.89
5910,-71.87
5911,-71.86
5912,-71.84
5913,-71.83
5914,-71.81
5915,-71.79
5916,-71.79
5917,-71.79
5918,-71.79
5919,-71.79
5920,-71.79
5921,-71.79
5922,-71.78
5923,-71.77
5924,-71.74
5925,-71.71
5926,-71.69
5927,-71.66
5928,-71.62
5929,-71.57
5930,-71.53
5931,-71.50
5932,-71.48
5933,-71.45
5934,-71.42
5935,-71.39
5936,-71.35
5937,-71.32
5938,-71.30
5939,-71.30
5940,-71.32
5941,-71.33
5942,-71.35
5943,-71.38
5944,-71.42
5945,-71.47
5946,-71.52
5947,-71.58
5948,-71.65
5949,-71.70
5950,-71.75
5951,-71.78
5952,-71.80
5953,-71.80
5954,-71.77
5955,-71.73
5956,-71.67
5957,-71.61
5958,-71.55
5959,-71.48
5960,-71.39
5961,-71.31
5962,-71.26
5963,-71.21
5964,-71.17
5965,-71.12
5966,-71.09
5967,-71.08
5968,-71.07
5969,-71.05
5970,-71.04
5971,-71.02
5972,-71.01
5973,-70.99
5974,-70.97
5975,-70.96
5976,-70.96
5977,-70.96
5978,-70.96
5979,-70.96
5980,-70.96
5981,-70.97
5982,-71.00
5983,-71.01
5984,-71.02
5985,-71.02
5986,-71.02
5987,-71.02
5988,-71.01
5989,-71.00
5990,-70.97
5991,-70.94
5992,-70.91
5993,-70.88
5994,-70.86
5995,-70.84
5996,-70.82
5997,-70.79
5998,-70.77
5999,-70.77
6000,-70.78
6001,-70.78
6002,-70.78
6003,-70.78
6004,-70.78
6005,-70.78
6006,-70.77
6007,-70.74
6008,-70.70
6009,-70.65
6010,-70.60
6011,-70.54
6012,-70.47
6013,-70.42
6014,-70.37
6015,-70.32
6016,-70.27
6017,-70.23
6018,-70.21
6019,-70.21
6020,-70.21
6021,-70.21
6022,-70.22
6023,-70.25
6024,-70.28
6025,-70.30
6026,-70.30
6027,-70.30
6028,-70.30
6029,-70.30
6030,-70.30
6031,-70.30
6032,-70.30
6033,-70.30
6034,-70.31
6035,-70.32
6036,-70.33
6037,-70.35
6038,-70.37
6039,-70.40
6040,-70.44
6041,-70.47
6042,-70.49
6043,-70.50
6044,-70.51
6045,-70.51
6046,-70.51
6047,-70.51
6048,-70.50
6049,-70.49
6050,-70.47
6051,-70.46
6052,-70.44
6053,-70.43
6054,-70.42
6055,-70.42
6056,-70.42
6057,-70.42
6058,-70.43
6059,-70.44
6060,-70.45
6061,-70.47
6062,-70.50
6063,-70.54
6064,-70.58
6065,-70.61
6066,-70.64
6067,-70.67
6068,-70.71
6069,-70.74
6070,-70.75
6071,-70.75
6072,-70.75
6073,-70.75
6074,-70.75
6075,-70.75
6076,-70.74
6077,-70.72
6078,-70.72
6079,-70.73
6080,-70.76
6081,-70.79
6082,-70.83
6083,-70.89
6084,-70.96
6085,-71.01
6086,-71.08
6087,-71.15
6088,-71.23
6089,-71.29
6090,-71.33
6091,-71.34
6092,-71.35
6093,-71.35
6094,-71.33
6095,-71.29
6096,-71.22
6097,-71.16
6098,-71.11
6099,-71.05
6100,-70.98
6101,-70.90
6102,-70.83
6103,-70.77
6104,-70.72
6105,-70.68
6106,-70.63
6107,-70.59
6108,-70.55
6109,-70.52
6110,-70.49
6111,-70.45
6112,-70.40
6113,-70.35
6114,-70.30
6115,-70.24
6116,-70.18
6117,-70.14
6118,-70.10
6119,-70.08
6120,-70.04
6121,-70.02
6122,-70.00
6123,-70.00
6124,-70.00
6125,-70.01
6126,-70.00
6127,-70.00
6128,-70.00
6129,-70.00
6130,-70.01
6131,-70.01
6132,-70.00
6133,-69.96
6134,-69.93
6135,-69.90
6136,-69.87
6137,-69.84
6138,-69.81
6139,-69.80
6140,-69.80
6141,-69.82
6142,-69.83
6143,-69.84
6144,-69.87
6145,-69.92
6146,-69.96
6147,-70.01
6148,-70.06
6149,-70.12
6150,-70.18
6151,-70.24
6152,-70.31
6153,-70.38
6154,-70.45
6155,-70.51
6156,-70.57
6157,-70.63
6158,-70.69
6159,-70.75
6160,-70.80
6161,-70.85
6162,-70.89
6163,-70.91
6164,-70.94
6165,-70.95
6166,-70.96
6167,-70.96
6168,-70.96
6169,-70.96
6170,-70.96
6171,-70.96
6172,-70.95
6173,-70.94
6174,-70.93
6175,-70.93
6176,-70.92
6177,-70.89
6178,-70.85
6179,-70.82
6180,-70.79
6181,-70.75
6182,-70.70
6183,-70.65
6184,-70.60
6185,-70.56
6186,-70.53
6187,-70.50
6188,-70.46
6189,-70.43
6190,-70.42
6191,-70.40
6192,-70.37
6193,-70.33
6194,-70.29
6195,-70.26
6196,-70.22
6197,-70.16
6198,-70.08
6199,-70.01
6200,-69.94
6201,-69.88
6202,-69.82
6203,-69.76
6204,-69.71
6205,-69.68
6206,-69.67
6207,-69.67
6208,-69.69
6209,-69.72
6210,-69.75
6211,-69.80
6212,-69.85
6213,-69.91
6214,-69.98
6215,-70.04
6216,-70.09
6217,-70.13
6218,-70.18
6219,-70.22
6220,-70.26
6221,-70.27
6222,-70.27
6223,-70.25
6224,-70.24
6225,-70.22
6226,-70.20
6227,-70.17
6228,-70.14
6229,-70.10
6230,-70.08
6231,-70.05
6232,-70.02
6233,-69.99
6234,-69.96
6235,-69.93
6236,-69.89
6237,-69.86
6238,-69.85
6239,-69.83
6240,-69.81
6241,-69.78
6242,-69.75
6243,-69.72
6244,-69.69
6245,-69.68
6246,-69.67
6247,-69.67
6248,-69.68
6249,-69.68
6250,-69.67
6251,-69.67
6252,-69.68
6253,-69.70
6254,-69.71
6255,-69.73
6256,-69.74
6257,-69.76
6258,-69.78
6259,-69.81
6260,-69.83
6261,-69.83
6262,-69.82
6263,-69.82
6264,-69.83
6265,-69.83
6266,-69.82
6267,-69.80
6268,-69.79
6269,-69.78
6270,-69.76
6271,-69.74
6272,-69.74
6273,-69.76
6274,-69.78
6275,-69.79
6276,-69.80
6277,-69.82
6278,-69.84
6279,-69.85
6280,-69.85
6281,-69.84
6282,-69.82
6283,-69.81
6284,-69.78
6285,-69.74
6286,-69.68
6287,-69.62
6288,-69.55
6289,-69.48
6290,-69.40
6291,-69.34
6292,-69.30
6293,-69.25
6294,-69.20
6295,-69.17
6296,-69.17
6297,-69.19
6298,-69.20
6299,-69.22
6300,-69.24
6301,-69.29
6302,-69.35
6303,-69.41
6304,-69.46
6305,-69.51
6306,-69.55
6307,-69.60
6308,-69.63
6309,-69.64
6310,-69.65
6311,-69.63
6312,-69.59
6313,-69.53
6314,-69.47
6315,-69.41
6316,-69.34
6317,-69.27
6318,-69.20
6319,-69.14
6320,-69.08
6321,-69.04
6322,-69.01
6323,-69.00
6324,-68.98
6325,-68.97
6326,-68.95
6327,-68.94
6328,-68.93
6329,-68.91
6330,-68.88
6331,-68.84
6332,-68.79
6333,-68.74
6334,-68.70
6335,-68.66
6336,-68.61
6337,-68.58
6338,-68.58
6339,-68.59
6340,-68.62
6341,-68.66
6342,-68.72
6343,-68.78
6344,-68.84
6345,-68.90
6346,-68.96
6347,-69.02
6348,-69.08
6349,-69.12
6350,-69.16
6351,-69.18
6352,-69.21
6353,-69.24
6354,-69.28
6355,-69.31
6356,-69.33
6357,-69.36
6358,-69.40
6359,-69.43
6360,-69.44
6361,-69.44
6362,-69.44
6363,-69.44
6364,-69.42
6365,-69.40
6366,-69.36
6367,-69.33
6368,-69.30
6369,-69.26
6370,-69.21
6371,-69.16
6372,-69.12
6373,-69.08
6374,-69.03
6375,-68.99
6376,-68.93
6377,-68.88
6378,-68.81
6379,-68.73
6380,-68.65
6381,-68.56
6382,-68.48
6383,-68.40
6384,-68.33
6385,-68.26
6386,-68.18
6387,-68.10
6388,-68.04
6389,-68.00
6390,-67.96
6391,-67.91
6392,-67.86
6393,-67.82
6394,-67.78
6395,-67.75
6396,-67.72
6397,-67.69
6398,-67.67
6399,-67.65
6400,-67.65
6401,-67.65
6402,-67.66
6403,-67.69
6404,-67.73
6405,-67.78
6406,-67.83
6407,-67.89
6408,-67.95
6409,-68.03
6410,-68.12
6411,-68.20
6412,-68.29
6413,-68.36
6414,-68.44
6415,-68.51
6416,-68.57
6417,-68.62
6418,-68.66
6419,-68.68
6420,-68.70
6421,-68.70
6422,-68.69
6423,-68.67
6424,-68.66
6425,-68.66
6426,-68.66
6427,-68.66
6428,-68.67
6429,-68.68
6430,-68.70
6431,-68.71
6432,-68.74
6433,-68.79
6434,-68.83
6435,-68.86
6436,-68.89
6437,-68.91
6438,-68.94
6439,-68.98
6440,-69.02
6441,-69.06
6442,-69.10
6443,-69.14
6444,-69.20
6445,-69.26
6446,-69.32
6447,-69.38
6448,-69.44
6449,-69.52
6450,-69.60
6451,-69.67
6452,-69.73
6453,-69.78
6454,-69.82
6455,-69.84
6456,-69.86
6457,-69.86
6458,-69.85
6459,-69.85
6460,-69.85
6461,-69.85
6462,-69.85
6463,-69.83
6464,-69.82
6465,-69.82
6466,-69.82
6467,-69.83
6468,-69.82
6469,-69.82
6470,-69.82
6471,-69.82
6472,-69.83
6473,-69.84
6474,-69.87
6475,-69.90
6476,-69.93
6477,-69.96
6478,-69.99
6479,-70.03
6480,-70.10
6481,-70.15
6482,-70.21
6483,-70.25
6484,-70.30
6485,-70.36
6486,-70.42
6487,-70.46
6488,-70.50
6489,-70.54
6490,-70.60
6491,-70.66
6492,-70.71
6493,-70.75
6494,-70.81
6495,-70.88
6496,-70.96
6497,-71.03
6498,-71.12
6499,-71.22
6500,-71.33
6501,-71.44
6502,-71.54
6503,-71.65
6504,-71.76
6505,-71.86
6506,-71.95
6507,-72.03
6508,-72.09
6509,-72.15
6510,-72.20
6511,-72.23
6512,-72.24
6513,-72.22
6514,-72.18
6515,-72.12
6516,-72.06
6517,-72.00
6518,-71.93
6519,-71.86
6520,-71.78
6521,-71.72
6522,-71.68
6523,-71.65
6524,-71.63
6525,-71.63
6526,-71.66
6527,-71.70
6528,-71.75
6529,-71.80
6530,-71.85
6531,-71.91
6532,-71.95
6533,-71.99
6534,-72.01
6535,-72.03
6536,-72.02
6537,-71.97
6538,-71.91
6539,-71.83
6540,-71.74
6541,-71.64
6542,-71.52
6543,-71.40
6544,-71.28
6545,-71.18
6546,-71.09
6547,-71.02
6548,-70.95
6549,-70.91
6550,-70.89
6551,-70.89
6552,-70.90
6553,-70.92
6554,-70.94
6555,-70.97
6556,-71.00
6557,-71.01
6558,-71.01
6559,-71.00
6560,-70.98
6561,-70.95
6562,-70.89
6563,-70.82
6564,-70.74
6565,-70.67
6566,-70.58
6567,-70.48
6568,-70.37
6569,-70.29
6570,-70.20
6571,-70.11
6572,-70.02
6573,-69.93
6574,-69.84
6575,-69.75
6576,-69.65
6577,-69.55
6578,-69.45
6579,-69.36
6580,-69.27
6581,-69.17
6582,-69.06
6583,-68.95
6584,-68.85
6585,-68.75
6586,-68.64
6587,-68.52
6588,-68.38
6589,-68.24
6590,-68.08
6591,-67.94
6592,-67.79
6593,-67.64
6594,-67.49
6595,-67.35
6596,-67.24
6597,-67.15
6598,-67.09
6599,-67.06
6600,-67.05
6601,-67.08
6602,-67.16
6603,-67.28
6604,-67.42
6605,-67.57
6606,-67.75
6607,-67.94
6608,-68.13
6609,-68.31
6610,-68.49
6611,-68.65
6612,-68.79
6613,-68.91
6614,-69.02
6615,-69.10
6616,-69.17
6617,-69.22
6618,-69.24
6619,-69.25
6620,-69.27
6621,-69.30
6622,-69.34
6623,-69.38
6624,-69.43
6625,-69.49
6626,-69.57
6627,-69.66
6628,-69.75
6629,-69.84
6630,-69.93
6631,-70.04
6632,-70.14
6633,-70.21
6634,-70.27
6635,-70.31
6636,-70.35
6637,-70.38
6638,-70.40
6639,-70.40
6640,-70.39
6641,-70.37
6642,-70.35
6643,-70.34
6644,-70.32
6645,-70.31
6646,-70.29
6647,-70.28
6648,-70.26
6649,-70.25
6650,-70.23
6651,-70.20
6652,-70.16
6653,-70.11
6654,-70.07
6655,-70.03
6656,-69.98
6657,-69.94
6658,-69.89
6659,-69.85
6660,-69.81
6661,-69.78
6662,-69.75
6663,-69.70
6664,-69.65
6665,-69.61
6666,-69.56
6667,-69.53
6668,-69.47
6669,-69.41
6670,-69.34
6671,-69.27
6672,-69.19
6673,-69.13
6674,-69.09
6675,-69.06
6676,-69.03
6677,-69.01
6678,-68.98
6679,-68.98
6680,-68.99
6681,-69.01
6682,-69.04
6683,-69.06
6684,-69.09
6685,-69.11
6686,-69.12
6687,-69.13
6688,-69.15
6689,-69.16
6690,-69.18
6691,-69.19
6692,-69.21
6693,-69.22
6694,-69.24
6695,-69.25
6696,-69.28
6697,-69.31
6698,-69.32
6699,-69.32
6700,-69.32
6701,-69.32
6702,-69.31
6703,-69.30
6704,-69.28
6705,-69.27
6706,-69.26
6707,-69.26
6708,-69.25
6709,-69.24
6710,-69.23
6711,-69.23
6712,-69.22
6713,-69.21
6714,-69.19
6715,-69.17
6716,-69.16
6717,-69.15
6718,-69.13
6719,-69.12
6720,-69.11
6721,-69.11
6722,-69.11
6723,-69.13
6724,-69.15
6725,-69.19
6726,-69.21
6727,-69.23
6728,-69.23
6729,-69.23
6730,-69.23
6731,-69.21
6732,-69.17
6733,-69.12
6734,-69.05
6735,-68.97
6736,-68.88
6737,-68.80
6738,-68.72
6739,-68.66
6740,-68.61
6741,-68.57
6742,-68.53
6743,-68.52
6744,-68.51
6745,-68.51
6746,-68.52
6747,-68.54
6748,-68.55
6749,-68.55
6750,-68.55
6751,-68.55
6752,-68.54
6753,-68.52
6754,-68.51
6755,-68.51
6756,-68.52
6757,-68.54
6758,-68.55
6759,-68.57
6760,-68.59
6761,-68.62
6762,-68.65
6763,-68.68
6764,-68.71
6765,-68.74
6766,-68.76
6767,-68.76
6768,-68.76
6769,-68.76
6770,-68.74
6771,-68.71
6772,-68.68
6773,-68.65
6774,-68.62
6775,-68.59
6776,-68.57
6777,-68.57
6778,-68.58
6779,-68.58
6780,-68.58
6781,-68.59
6782,-68.62
6783,-68.65
6784,-68.68
6785,-68.71
6786,-68.73
6787,-68.73
6788,-68.73
6789,-68.72
6790,-68.72
6791,-68.70
6792,-68.69
6793,-68.67
6794,-68.65
6795,-68.62
6796,-68.59
6797,-68.56
6798,-68.53
6799,-68.50
6800,-68.47
6801,-68.44
6802,-68.41
6803,-68.38
6804,-68.34
6805,-68.30
6806,-68.26
6807,-68.25
6808,-68.24
6809,-68.24
6810,-68.26
6811,-68.29
6812,-68.33
6813,-68.37
6814,-68.43
6815,-68.48
6816,-68.54
6817,-68.59
6818,-68.62
6819,-68.65
6820,-68.68
6821,-68.69
6822,-68.68
6823,-68.66
6824,-68.62
6825,-68.59
6826,-68.56
6827,-68.53
6828,-68.50
6829,-68.49
6830,-68.49
6831,-68.49
6832,-68.48
6833,-68.46
6834,-68.45
6835,-68.45
6836,-68.45
6837,-68.44
6838,-68.42
6839,-68.40
6840,-68.39
6841,-68.37
6842,-68.36
6843,-68.36
6844,-68.37
6845,-68.39
6846,-68.40
6847,-68.43
6848,-68.49
6849,-68.56
6850,-68.64
6851,-68.72
6852,-68.80
6853,-68.88
6854,-68.97
6855,-69.05
6856,-69.12
6857,-69.17
6858,-69.22
6859,-69.25
6860,-69.27
6861,-69.27
6862,-69.24
6863,-69.20
6864,-69.15
6865,-69.10
6866,-69.04
6867,-68.97
6868,-68.91
6869,-68.84
6870,-68.77
6871,-68.70
6872,-68.64
6873,-68.61
6874,-68.59
6875,-68.58
6876,-68.58
6877,-68.59
6878,-68.62
6879,-68.66
6880,-68.72
6881,-68.78
6882,-68.85
6883,-68.92
6884,-69.00
6885,-69.07
6886,-69.15
6887,-69.20
6888,-69.25
6889,-69.28
6890,-69.30
6891,-69.31
6892,-69.33
6893,-69.32
6894,-69.31
6895,-69.27
6896,-69.25
6897,-69.24
6898,-69.22
6899,-69.20
6900,-69.20
6901,-69.22
6902,-69.24
6903,-69.25
6904,-69.28
6905,-69.32
6906,-69.38
6907,-69.44
6908,-69.50
6909,-69.56
6910,-69.62
6911,-69.68
6912,-69.73
6913,-69.76
6914,-69.78
6915,-69.77
6916,-69.76
6917,-69.73
6918,-69.68
6919,-69.64
6920,-69.59
6921,-69.55
6922,-69.51
6923,-69.46
6924,-69.42
6925,-69.38
6926,-69.37
6927,-69.37
6928,-69.39
6929,-69.42
6930,-69.45
6931,-69.46
6932,-69.48
6933,-69.49
6934,-69.50
6935,-69.49
6936,-69.45
6937,-69.40
6938,-69.35
6939,-69.29
6940,-69.22
6941,-69.15
6942,-69.08
6943,-69.02
6944,-68.96
6945,-68.92
6946,-68.89
6947,-68.89
6948,-68.91
6949,-68.92
6950,-68.94
6951,-68.95
6952,-68.96
6953,-68.96
6954,-68.96
6955,-68.96
6956,-68.95
6957,-68.94
6958,-68.92
6959,-68.91
6960,-68.89
6961,-68.86
6962,-68.83
6963,-68.82
6964,-68.81
6965,-68.81
6966,-68.81
6967,-68.81
6968,-68.82
6969,-68.84
6970,-68.84
6971,-68.84
6972,-68.85
6973,-68.86
6974,-68.88
6975,-68.90
6976,-68.91
6977,-68.92
6978,-68.94
6979,-68.95
6980,-68.97
6981,-68.97
6982,-68.95
6983,-68.94
6984,-68.92
6985,-68.91
6986,-68.90
6987,-68.88
6988,-68.86
6989,-68.85
6990,-68.84
6991,-68.84
6992,-68.84
6993,-68.82
6994,-68.81
6995,-68.81
6996,-68.81
6997,-68.82
6998,-68.82
6999,-68.82
7000,-68.81
7001,-68.80
7002,-68.77
7003,-68.74
7004,-68.70
7005,-68.66
7006,-68.61
7007,-68.55
7008,-68.48
7009,-68.40
7010,-68.33
7011,-68.27
7012,-68.22
7013,-68.18
7014,-68.14
7015,-68.11
7016,-68.10
7017,-68.10
7018,-68.10
7019,-68.10
7020,-68.11
7021,-68.12
7022,-68.13
7023,-68.13
7024,-68.12
7025,-68.11
7026,-68.09
7027,-68.08
7028,-68.06
7029,-68.05
7030,-68.04
7031,-68.04
7032,-68.04
7033,-68.06
7034,-68.08
7035,-68.11
7036,-68.14
7037,-68.17
7038,-68.21
7039,-68.24
7040,-68.25
7041,-68.23
7042,-68.20
7043,-68.17
7044,-68.15
7045,-68.12
7046,-68.08
7047,-68.04
7048,-67.98
7049,-67.94
7050,-67.91
7051,-67.91
7052,-67.93
7053,-67.94
7054,-67.96
7055,-67.99
7056,-68.03
7057,-68.08
7058,-68.12
7059,-68.17
7060,-68.20
7061,-68.23
7062,-68.26
7063,-68.28
7064,-68.27
7065,-68.26
7066,-68.24
7067,-68.21
7068,-68.16
7069,-68.10
7070,-68.05
7071,-68.00
7072,-67.95
7073,-67.89
7074,-67.85
7075,-67.81
7076,-67.78
7077,-67.76
7078,-67.74
7079,-67.74
7080,-67.73
7081,-67.72
7082,-67.71
7083,-67.73
7084,-67.75
7085,-67.75
7086,-67.73
7087,-67.72
7088,-67.71
7089,-67.71
7090,-67.71
7091,-67.69
7092,-67.67
7093,-67.65
7094,-67.65
7095,-67.65
7096,-67.65
7097,-67.65
7098,-67.66
7099,-67.67
7100,-67.69
7101,-67.72
7102,-67.76
7103,-67.81
7104,-67.86
7105,-67.90
7106,-67.94
7107,-67.99
7108,-68.04
7109,-68.08
7110,-68.12
7111,-68.15
7112,-68.18
7113,-68.20
7114,-68.23
7115,-68.24
7116,-68.26
7117,-68.27
7118,-68.28
7119,-68.28
7120,-68.28
7121,-68.28
7122,-68.27
7123,-68.26
7124,-68.24
7125,-68.22
7126,-68.21
7127,-68.20
7128,-68.17
7129,-68.13
7130,-68.08
7131,-68.03
7132,-67.98
7133,-67.94
7134,-67.91
7135,-67.88
7136,-67.84
7137,-67.79
7138,-67.76
7139,-67.74
7140,-67.74
7141,-67.74
7142,-67.74
7143,-67.74
7144,-67.75
7145,-67.76
7146,-67.77
7147,-67.78
7148,-67.77
7149,-67.75
7150,-67.72
7151,-67.68
7152,-67.63
7153,-67.58
7154,-67.54
7155,-67.51
7156,-67.49
7157,-67.47
7158,-67.47
7159,-67.49
7160,-67.52
7161,-67.56
7162,-67.62
7163,-67.70
7164,-67.79
7165,-67.88
7166,-67.96
7167,-68.04
7168,-68.11
7169,-68.19
7170,-68.24
7171,-68.27
7172,-68.29
7173,-68.30
7174,-68.30
7175,-68.29
7176,-68.27
7177,-68.26
7178,-68.23
7179,-68.20
7180,-68.17
7181,-68.14
7182,-68.11
7183,-68.08
7184,-68.06
7185,-68.04
7186,-68.04
7187,-68.04
7188,-68.04
7189,-68.30
7190,-68.22
7191,-67.86
7192,-67.52
7193,-69.05
7194,-69.96
7195,-67.52
7196,-63.94
7197,-68.07
7198,-77.29
7199,-73.20
7200,-45.93
