1,-3.70
2,-5.20
3,-4.91
4,-4.08
5,-4.55
6,-6.49
7,-8.13
8,-7.75
9,-5.46
10,-2.98
11,-1.88
12,-2.10
13,-2.30
14,-1.34
15,0.64
16,2.34
17,2.27
18,0.24
19,-2.33
20,-3.48
21,-2.52
22,-0.58
23,0.57
24,0.25
25,-0.57
26,-0.52
27,0.63
28,1.46
29,0.42
30,-2.30
31,-4.50
32,-4.45
33,-2.93
34,-2.39
35,-4.02
36,-6.19
37,-6.39
38,-4.44
39,-2.74
40,-3.34
41,-5.33
42,-6.05
43,-4.26
44,-1.63
45,-0.58
46,-1.35
47,-2.06
48,-1.19
49,0.50
50,1.02
51,-0.62
52,-3.26
53,-4.87
54,-4.35
55,-2.27
56,-0.20
57,0.39
58,-0.64
59,-1.98
60,-2.17
61,-1.13
62,-0.21
63,-0.61
64,-2.00
65,-2.86
66,-2.34
67,-1.12
68,-0.43
69,-0.56
70,-0.70
71,-0.24
72,0.34
73,0.08
74,-1.16
75,-2.58
76,-3.43
77,-3.86
78,-4.27
79,-4.65
80,-4.50
81,-3.88
82,-3.51
83,-3.87
84,-4.12
85,-2.88
86,0.34
87,4.31
88,7.06
89,7.58
90,6.68
91,5.89
92,6.03
93,6.42
94,6.03
95,4.55
96,2.89
97,2.18
98,2.72
99,3.76
100,4.36
101,4.43
102,4.67
103,5.88
104,7.50
105,8.06
106,6.55
107,3.89
108,1.81
109,1.12
110,0.79
111,-0.52
112,-2.93
113,-5.21
114,-6.36
115,-6.49
116,-6.59
117,-7.19
118,-8.21
119,-9.03
120,-9.47
121,-9.35
122,-8.47
123,-6.55
124,-4.28
125,-3.19
126,-4.57
127,-7.98
128,-11.43
129,-13.03
130,-12.61
131,-11.37
132,-10.44
133,-9.79
134,-8.89
135,-7.74
136,-6.79
137,-6.29
138,-6.13
139,-6.36
140,-7.34
141,-9.06
142,-10.70
143,-11.47
144,-11.12
145,-10.15
146,-8.93
147,-7.60
148,-6.25
149,-5.37
150,-5.17
151,-5.16
152,-4.45
153,-2.91
154,-1.54
155,-1.52
156,-2.65
157,-3.38
158,-2.30
159,0.20
160,2.10
161,1.55
162,-1.16
163,-3.86
164,-4.50
165,-3.20
166,-1.87
167,-2.34
168,-4.43
169,-6.55
170,-7.18
171,-6.36
172,-5.04
173,-4.05
174,-3.12
175,-1.51
176,1.04
177,3.75
178,5.68
179,6.47
180,6.72
181,7.17
182,7.94
183,8.50
184,8.44
185,7.91
186,7.44
187,7.05
188,6.27
189,4.63
190,2.51
191,0.91
192,0.37
193,0.52
194,0.47
195,0.06
196,-0.07
197,0.89
198,2.66
199,4.17
200,4.18
201,2.45
202,-0.33
203,-2.93
204,-4.51
205,-4.95
206,-4.82
207,-4.85
208,-5.31
209,-5.71
210,-5.23
211,-3.53
212,-1.48
213,-0.53
214,-1.27
215,-2.45
216,-2.17
217,0.17
218,2.83
219,3.38
220,1.32
221,-1.26
222,-1.73
223,0.38
224,2.92
225,3.14
226,0.22
227,-4.07
228,-7.03
229,-7.06
230,-4.92
231,-2.95
232,-2.78
233,-3.85
234,-4.19
235,-2.77
236,-0.77
237,-0.42
238,-2.61
239,-5.80
240,-7.41
241,-6.04
242,-2.72
243,0.05
244,0.61
245,-0.82
246,-2.69
247,-3.78
248,-3.72
249,-2.82
250,-1.80
251,-1.52
252,-2.23
253,-2.99
254,-2.24
255,0.20
256,2.59
257,2.73
258,0.41
259,-2.26
260,-3.03
261,-1.82
262,-0.48
263,-0.45
264,-1.28
265,-1.40
266,-0.49
267,0.24
268,-0.20
269,-0.95
270,-0.85
271,-0.20
272,-0.91
273,-3.72
274,-7.25
275,-9.31
276,-9.68
277,-9.82
278,-11.04
279,-12.75
280,-13.52
281,-12.71
282,-11.50
283,-11.32
284,-12.68
285,-14.56
286,-15.85
287,-15.88
288,-14.92
289,-13.66
290,-12.88
291,-12.89
292,-13.39
293,-13.73
294,-13.93
295,-14.89
296,-17.17
297,-19.73
298,-20.58
299,-18.87
300,-15.92
301,-13.93
302,-13.74
303,-14.40
304,-14.47
305,-13.63
306,-12.63
307,-12.33
308,-12.59
309,-12.67
310,-11.89
311,-10.52
312,-9.33
313,-9.14
314,-9.63
315,-9.78
316,-8.53
317,-6.23
318,-4.02
319,-2.99
320,-2.76
321,-2.38
322,-1.27
323,-0.07
324,0.61
325,0.82
326,1.39
327,2.54
328,3.92
329,4.99
330,5.98
331,7.13
332,8.08
333,7.91
334,6.76
335,6.00
336,6.95
337,8.92
338,9.90
339,8.67
340,6.08
341,3.94
342,3.33
343,4.12
344,5.48
345,6.54
346,6.92
347,6.98
348,7.50
349,8.66
350,9.70
351,9.27
352,6.99
353,4.10
354,2.59
355,3.47
356,6.05
357,8.72
358,10.82
359,12.83
360,15.50
361,18.24
362,19.42
363,17.74
364,14.18
365,11.34
366,11.31
367,13.71
368,16.58
369,18.39
370,19.39
371,20.44
372,21.69
373,22.36
374,22.01
375,21.03
376,20.15
377,19.51
378,18.53
379,16.75
380,14.63
381,13.26
382,13.22
383,14.24
384,15.81
385,17.91
386,20.17
387,21.30
388,19.78
389,15.91
390,11.99
391,10.46
392,11.43
393,12.97
394,13.01
395,11.35
396,9.45
397,8.78
398,9.32
399,9.92
400,9.96
401,10.20
402,11.34
403,12.70
404,12.69
405,10.92
406,9.05
407,9.13
408,11.03
409,12.68
410,12.28
411,10.38
412,8.87
413,8.89
414,9.84
415,10.68
416,10.78
417,9.98
418,7.84
419,4.56
420,1.37
421,0.07
422,1.01
423,2.57
424,2.25
425,-0.71
426,-4.61
427,-6.59
428,-5.55
429,-2.95
430,-1.64
431,-3.01
432,-5.91
433,-7.63
434,-6.64
435,-3.98
436,-2.16
437,-2.71
438,-4.84
439,-6.43
440,-6.00
441,-3.95
442,-1.82
443,-0.94
444,-1.41
445,-2.20
446,-2.03
447,-0.37
448,2.01
449,3.56
450,3.36
451,2.02
452,0.83
453,0.22
454,-0.46
455,-1.82
456,-3.14
457,-3.22
458,-2.24
459,-2.04
460,-3.91
461,-6.64
462,-7.59
463,-5.56
464,-2.22
465,0.04
466,0.52
467,0.34
468,0.60
469,1.08
470,1.04
471,0.16
472,-1.25
473,-3.04
474,-4.86
475,-5.83
476,-4.87
477,-2.29
478,0.32
479,1.55
480,1.93
481,2.99
482,5.20
483,7.10
484,7.11
485,5.43
486,4.17
487,4.97
488,7.28
489,8.83
490,8.41
491,6.79
492,5.92
493,6.63
494,8.20
495,9.26
496,9.06
497,7.73
498,6.22
499,5.79
500,6.96
501,8.82
502,9.85
503,9.64
504,9.29
505,9.94
506,11.31
507,11.92
508,10.72
509,8.12
510,5.64
511,4.67
512,5.25
513,6.26
514,6.53
515,6.01
516,5.39
517,5.32
518,5.67
519,6.16
520,6.36
521,6.00
522,4.42
523,1.53
524,-1.81
525,-3.76
526,-3.43
527,-1.82
528,-1.24
529,-2.77
530,-5.31
531,-6.72
532,-6.37
533,-5.65
534,-6.21
535,-7.93
536,-9.36
537,-9.50
538,-8.84
539,-8.27
540,-7.64
541,-6.12
542,-3.61
543,-1.26
544,-0.23
545,-0.35
546,-0.54
547,-0.28
548,-0.26
549,-1.26
550,-2.78
551,-3.52
552,-2.97
553,-2.25
554,-2.76
555,-4.57
556,-6.22
557,-6.41
558,-5.38
559,-4.33
560,-4.05
561,-4.15
562,-3.90
563,-3.17
564,-2.73
565,-3.31
566,-4.72
567,-5.84
568,-5.80
569,-4.67
570,-3.34
571,-2.55
572,-2.42
573,-2.64
574,-2.83
575,-2.69
576,-2.55
577,-3.28
578,-5.56
579,-8.54
580,-10.27
581,-9.32
582,-6.68
583,-4.90
584,-5.63
585,-7.80
586,-9.05
587,-8.38
588,-7.51
589,-8.79
590,-12.34
591,-15.64
592,-16.35
593,-14.68
594,-12.98
595,-12.86
596,-13.72
597,-13.82
598,-12.53
599,-10.60
600,-9.29
601,-9.09
602,-9.98
603,-11.54
604,-13.29
605,-14.52
606,-14.69
607,-14.07
608,-13.66
609,-14.40
610,-16.25
611,-18.39
612,-19.87
613,-20.35
614,-20.11
615,-19.63
616,-19.09
617,-18.28
618,-16.98
619,-15.34
620,-13.78
621,-12.61
622,-11.81
623,-11.21
624,-10.69
625,-10.24
626,-9.79
627,-9.22
628,-8.59
629,-8.37
630,-9.05
631,-10.77
632,-12.82
633,-14.16
634,-14.47
635,-14.43
636,-15.11
637,-16.52
638,-17.45
639,-16.55
640,-14.11
641,-12.06
642,-12.36
643,-15.08
644,-18.57
645,-20.93
646,-21.91
647,-22.53
648,-23.41
649,-23.72
650,-22.38
651,-19.69
652,-17.40
653,-16.85
654,-17.56
655,-17.95
656,-17.53
657,-17.32
658,-18.45
659,-20.42
660,-21.63
661,-21.34
662,-20.34
663,-19.79
664,-19.75
665,-19.56
666,-19.24
667,-19.67
668,-21.23
669,-22.74
670,-22.40
671,-19.85
672,-16.97
673,-16.20
674,-17.89
675,-20.04
676,-20.65
677,-19.97
678,-19.90
679,-21.52
680,-23.48
681,-23.68
682,-21.61
683,-19.04
684,-17.83
685,-18.06
686,-18.10
687,-16.69
688,-14.37
689,-12.78
690,-12.49
691,-12.51
692,-11.68
693,-10.44
694,-10.05
695,-10.98
696,-12.14
697,-12.40
698,-11.70
699,-10.81
700,-10.32
701,-10.31
702,-10.72
703,-11.45
704,-12.38
705,-13.24
706,-13.79
707,-13.97
708,-14.03
709,-14.27
710,-14.76
711,-15.27
712,-15.85
713,-16.91
714,-18.65
715,-20.21
716,-20.30
717,-18.48
718,-16.06
719,-14.96
720,-15.70
721,-16.88
722,-16.75
723,-15.21
724,-13.84
725,-14.13
726,-15.70
727,-16.79
728,-16.04
729,-13.79
730,-11.51
731,-10.55
732,-11.17
733,-12.79
734,-14.19
735,-14.18
736,-12.33
737,-9.68
738,-8.07
739,-8.72
740,-11.01
741,-13.17
742,-13.40
743,-11.30
744,-8.07
745,-5.86
746,-6.03
747,-7.98
748,-9.58
749,-9.10
750,-6.77
751,-4.50
752,-3.93
753,-4.91
754,-5.89
755,-5.65
756,-4.61
757,-4.24
758,-5.30
759,-7.01
760,-8.25
761,-8.94
762,-9.83
763,-11.16
764,-12.15
765,-12.03
766,-11.31
767,-11.17
768,-11.98
769,-12.72
770,-12.24
771,-10.78
772,-9.91
773,-10.70
774,-12.26
775,-12.51
776,-10.72
777,-8.54
778,-7.93
779,-8.81
780,-9.16
781,-7.79
782,-5.83
783,-5.39
784,-6.74
785,-8.08
786,-7.81
787,-6.34
788,-5.31
789,-5.44
790,-5.85
791,-5.60
792,-4.94
793,-4.85
794,-5.73
795,-7.15
796,-8.47
797,-9.47
798,-10.37
799,-11.52
800,-12.75
801,-13.41
802,-12.95
803,-11.50
804,-9.80
805,-8.38
806,-7.21
807,-5.75
808,-3.91
809,-2.16
810,-1.60
811,-2.90
812,-5.68
813,-8.49
814,-10.25
815,-11.32
816,-12.89
817,-15.39
818,-17.81
819,-18.79
820,-18.23
821,-17.28
822,-17.11
823,-17.53
824,-17.41
825,-15.82
826,-13.31
827,-11.45
828,-11.29
829,-12.45
830,-13.84
831,-14.94
832,-15.79
833,-16.15
834,-15.38
835,-13.39
836,-11.29
837,-10.35
838,-10.37
839,-9.91
840,-8.41
841,-7.46
842,-9.15
843,-13.19
844,-16.93
845,-18.03
846,-17.00
847,-16.09
848,-16.37
849,-16.71
850,-15.88
851,-14.56
852,-14.72
853,-16.92
854,-19.42
855,-19.87
856,-18.04
857,-15.72
858,-14.69
859,-15.05
860,-15.70
861,-15.90
862,-15.90
863,-16.24
864,-16.87
865,-17.31
866,-17.35
867,-17.16
868,-16.87
869,-16.29
870,-15.25
871,-14.14
872,-13.75
873,-14.50
874,-15.87
875,-16.75
876,-16.76
877,-16.75
878,-17.54
879,-18.77
880,-18.89
881,-17.10
882,-14.57
883,-13.55
884,-14.82
885,-16.75
886,-16.62
887,-13.45
888,-8.98
889,-6.13
890,-6.34
891,-8.56
892,-10.65
893,-11.43
894,-11.15
895,-10.64
896,-10.49
897,-10.90
898,-11.85
899,-12.99
900,-13.97
901,-14.82
902,-15.83
903,-16.87
904,-17.66
905,-18.15
906,-18.86
907,-20.04
908,-21.32
909,-21.97
910,-21.75
911,-20.99
912,-20.21
913,-19.52
914,-18.77
915,-17.87
916,-17.23
917,-17.36
918,-18.27
919,-19.20
920,-19.09
921,-17.61
922,-15.65
923,-14.82
924,-15.88
925,-18.10
926,-19.94
927,-20.54
928,-20.12
929,-19.28
930,-18.07
931,-16.28
932,-14.52
933,-14.15
934,-15.60
935,-17.37
936,-17.37
937,-15.40
938,-13.15
939,-12.23
940,-12.40
941,-12.73
942,-13.14
943,-14.52
944,-16.71
945,-18.03
946,-16.82
947,-13.56
948,-10.41
949,-9.07
950,-9.11
951,-9.25
952,-9.01
953,-9.11
954,-9.88
955,-10.55
956,-10.12
957,-8.80
958,-7.62
959,-7.24
960,-7.24
961,-7.13
962,-7.04
963,-7.37
964,-7.74
965,-7.39
966,-6.24
967,-5.39
968,-5.91
969,-7.64
970,-9.00
971,-8.71
972,-6.67
973,-3.88
974,-1.46
975,-0.16
976,-0.34
977,-1.80
978,-3.40
979,-3.52
980,-1.18
981,2.66
982,5.43
983,4.74
984,0.92
985,-3.22
986,-4.66
987,-3.09
988,-0.72
989,0.13
990,-0.70
991,-1.61
992,-1.03
993,0.97
994,3.42
995,5.36
996,6.51
997,6.89
998,6.39
999,4.99
1000,3.73
1001,3.98
1002,6.17
1003,8.60
1004,9.14
1005,7.23
1006,4.70
1007,3.59
1008,4.35
1009,5.81
1010,6.97
1011,7.96
1012,9.49
1013,11.61
1014,13.48
1015,14.09
1016,13.21
1017,11.37
1018,9.62
1019,8.88
1020,9.33
1021,10.01
1022,9.63
1023,7.83
1024,5.81
1025,5.37
1026,7.04
1027,9.62
1028,11.17
1029,11.07
1030,10.19
1031,9.88
1032,10.26
1033,10.36
1034,9.06
1035,6.47
1036,3.41
1037,1.05
1038,0.02
1039,0.66
1040,2.48
1041,4.30
1042,4.53
1043,2.59
1044,-0.63
1045,-3.34
1046,-4.52
1047,-4.41
1048,-3.95
1049,-3.68
1050,-3.61
1051,-3.66
1052,-3.63
1053,-3.15
1054,-2.06
1055,-1.07
1056,-1.11
1057,-2.01
1058,-2.17
1059,-0.23
1060,3.29
1061,6.25
1062,7.35
1063,7.34
1064,7.83
1065,8.95
1066,9.29
1067,7.76
1068,5.18
1069,3.34
1070,3.16
1071,4.16
1072,5.54
1073,6.88
1074,7.85
1075,7.68
1076,5.77
1077,2.70
1078,0.09
1079,-0.77
1080,-0.08
1081,1.21
1082,2.54
1083,4.03
1084,5.55
1085,6.29
1086,5.99
1087,5.64
1088,6.50
1089,8.28
1090,9.01
1091,7.38
1092,4.52
1093,3.03
1094,4.20
1095,6.74
1096,8.23
1097,7.48
1098,5.19
1099,2.76
1100,1.04
1101,0.28
1102,0.58
1103,1.74
1104,2.85
1105,2.78
1106,1.47
1107,0.28
1108,0.82
1109,3.24
1110,5.96
1111,7.23
1112,6.70
1113,5.39
1114,4.51
1115,4.46
1116,5.08
1117,6.03
1118,7.04
1119,7.70
1120,7.78
1121,7.46
1122,7.43
1123,7.88
1124,8.28
1125,7.82
1126,6.69
1127,6.09
1128,7.12
1129,9.25
1130,10.65
1131,9.86
1132,7.66
1133,6.39
1134,7.71
1135,10.78
1136,13.09
1137,12.97
1138,11.20
1139,9.95
1140,10.48
1141,12.02
1142,13.00
1143,12.79
1144,12.02
1145,11.49
1146,11.19
1147,10.84
1148,10.66
1149,11.37
1150,12.85
1151,13.93
1152,13.29
1153,11.11
1154,8.64
1155,6.88
1156,5.53
1157,3.89
1158,1.72
1159,-0.35
1160,-1.75
1161,-2.18
1162,-1.80
1163,-0.80
1164,0.24
1165,0.77
1166,0.36
1167,-0.61
1168,-1.39
1169,-1.43
1170,-1.08
1171,-1.08
1172,-1.92
1173,-3.27
1174,-4.19
1175,-3.91
1176,-2.63
1177,-1.64
1178,-1.98
1179,-3.29
1180,-3.88
1181,-2.57
1182,-0.01
1183,1.79
1184,1.90
1185,1.51
1186,2.53
1187,5.00
1188,7.31
1189,7.96
1190,7.26
1191,6.40
1192,5.82
1193,4.82
1194,3.80
1195,3.96
1196,6.35
1197,9.89
1198,12.70
1199,13.74
1200,11.34
