1,184.98
2,249.99
3,249.99
4,229.36
5,150.02
6,59.50
7,-27.95
8,-82.00
9,-82.65
10,-44.45
11,1.01
12,33.60
13,48.03
14,45.04
15,29.04
16,6.90
17,-10.86
18,-20.26
19,-19.75
20,-13.05
21,-4.39
22,2.55
23,5.32
24,4.26
25,0.76
26,-3.31
27,-6.23
28,-7.59
29,-7.30
30,-6.20
31,-5.08
32,-4.49
33,-4.53
34,-4.83
35,-5.13
36,-5.34
37,-5.52
38,-5.70
39,-5.83
40,-5.78
41,-5.56
42,-5.04
43,-4.33
44,-3.29
45,-2.01
46,-0.38
47,1.49
48,3.59
49,5.77
50,7.99
51,10.08
52,11.93
53,13.40
54,14.42
55,14.92
56,14.84
57,14.25
58,13.21
59,11.83
60,10.12
61,8.21
62,6.09
63,3.93
64,1.68
65,-0.54
66,-2.80
67,-4.91
68,-6.94
69,-8.66
70,-10.14
71,-11.20
72,-11.97
73,-12.37
74,-12.54
75,-12.43
76,-12.21
77,-11.90
78,-11.64
79,-11.41
80,-11.28
81,-11.18
82,-11.15
83,-11.15
84,-11.18
85,-11.21
86,-11.16
87,-11.03
88,-10.89
89,-10.80
90,-10.80
91,-10.93
92,-11.22
93,-11.64
94,-12.18
95,-12.73
96,-13.23
97,-13.63
98,-13.89
99,-14.00
100,-14.02
101,-14.01
102,-14.02
103,-14.11
104,-14.28
105,-14.52
106,-14.76
107,-14.95
108,-15.05
109,-15.05
110,-14.94
111,-14.74
112,-14.48
113,-14.21
114,-13.90
115,-13.59
116,-13.25
117,-12.94
118,-12.64
119,-12.40
120,-12.14
121,-11.90
122,-11.60
123,-11.28
124,-10.86
125,-10.38
126,-9.85
127,-9.32
128,-8.80
129,-8.34
130,-7.95
131,-7.68
132,-7.51
133,-7.44
134,-7.40
135,-7.39
136,-7.39
137,-7.41
138,-7.44
139,-7.52
140,-7.66
141,-7.84
142,-8.03
143,-8.24
144,-8.45
145,-8.63
146,-8.71
147,-8.64
148,-8.51
149,-8.29
150,-8.03
151,-7.74
152,-7.55
153,-7.48
154,-7.55
155,-7.73
156,-8.03
157,-8.40
158,-8.83
159,-9.22
160,-9.57
161,-9.82
162,-10.02
163,-10.16
164,-10.31
165,-10.48
166,-10.75
167,-11.10
168,-11.54
169,-11.96
170,-12.41
171,-12.83
172,-13.28
173,-13.69
174,-14.09
175,-14.45
176,-14.85
177,-15.30
178,-15.85
179,-16.44
180,-17.08
181,-17.72
182,-18.33
183,-18.84
184,-19.22
185,-19.38
186,-19.33
187,-19.10
188,-18.75
189,-18.32
190,-17.89
191,-17.55
192,-17.34
193,-17.27
194,-17.30
195,-17.40
196,-17.54
197,-17.68
198,-17.80
199,-17.87
200,-17.85
201,-17.79
202,-17.72
203,-17.62
204,-17.45
205,-17.21
206,-16.93
207,-16.63
208,-16.30
209,-15.95
210,-15.59
211,-15.27
212,-14.99
213,-14.76
214,-14.53
215,-14.34
216,-14.18
217,-14.05
218,-13.89
219,-13.76
220,-13.66
221,-13.60
222,-13.53
223,-13.40
224,-13.18
225,-12.90
226,-12.57
227,-12.24
228,-11.90
229,-11.62
230,-11.42
231,-11.31
232,-11.23
233,-11.21
234,-11.21
235,-11.25
236,-11.29
237,-11.37
238,-11.45
239,-11.56
240,-11.60
241,-11.55
242,-11.39
243,-11.11
244,-10.67
245,-10.14
246,-9.57
247,-9.04
248,-8.60
249,-8.29
250,-8.10
251,-8.07
252,-8.13
253,-8.24
254,-8.34
255,-8.42
256,-8.49
257,-8.54
258,-8.60
259,-8.65
260,-8.74
261,-8.90
262,-9.13
263,-9.36
264,-9.59
265,-9.76
266,-9.93
267,-10.04
268,-10.18
269,-10.32
270,-10.59
271,-10.97
272,-11.51
273,-12.14
274,-12.89
275,-13.65
276,-14.43
277,-15.17
278,-15.88
279,-16.49
280,-17.06
281,-17.50
282,-17.91
283,-18.23
284,-18.51
285,-18.69
286,-18.88
287,-19.04
288,-19.23
289,-19.42
290,-19.65
291,-19.90
292,-20.20
293,-20.49
294,-20.77
295,-21.03
296,-21.30
297,-21.60
298,-21.90
299,-22.14
300,-22.32
301,-22.36
302,-22.30
303,-22.13
304,-21.92
305,-21.65
306,-21.35
307,-21.07
308,-20.88
309,-20.82
310,-20.88
311,-21.03
312,-21.22
313,-21.45
314,-21.66
315,-21.81
316,-21.83
317,-21.74
318,-21.51
319,-21.26
320,-20.91
321,-20.55
322,-20.11
323,-19.69
324,-19.24
325,-18.78
326,-18.19
327,-17.50
328,-16.65
329,-15.72
330,-14.66
331,-13.61
332,-12.54
333,-11.63
334,-10.79
335,-10.10
336,-9.46
337,-8.91
338,-8.32
339,-7.73
340,-7.03
341,-6.34
342,-5.57
343,-4.82
344,-3.99
345,-3.19
346,-2.32
347,-1.47
348,-0.59
349,0.22
350,1.01
351,1.69
352,2.35
353,2.87
354,3.27
355,3.52
356,3.73
357,3.89
358,4.01
359,4.05
360,4.05
361,4.02
362,3.96
363,3.82
364,3.62
365,3.38
366,3.11
367,2.86
368,2.61
369,2.38
370,2.14
371,1.94
372,1.72
373,1.53
374,1.30
375,1.07
376,0.75
377,0.39
378,-0.11
379,-0.65
380,-1.27
381,-1.88
382,-2.59
383,-3.28
384,-4.02
385,-4.71
386,-5.46
387,-6.23
388,-7.12
389,-8.00
390,-8.92
391,-9.77
392,-10.64
393,-11.47
394,-12.34
395,-13.16
396,-14.00
397,-14.77
398,-15.56
399,-16.28
400,-16.98
401,-17.55
402,-18.09
403,-18.53
404,-18.94
405,-19.26
406,-19.56
407,-19.83
408,-20.12
409,-20.39
410,-20.65
411,-20.85
412,-20.99
413,-21.05
414,-21.03
415,-20.91
416,-20.68
417,-20.39
418,-20.03
419,-19.68
420,-19.23
421,-18.74
422,-18.17
423,-17.62
424,-17.01
425,-16.39
426,-15.66
427,-14.92
428,-14.14
429,-13.45
430,-12.77
431,-12.15
432,-11.50
433,-10.89
434,-10.25
435,-9.63
436,-8.92
437,-8.24
438,-7.60
439,-7.07
440,-6.56
441,-6.11
442,-5.68
443,-5.30
444,-4.91
445,-4.48
446,-4.02
447,-3.62
448,-3.30
449,-3.08
450,-2.97
451,-2.97
452,-3.07
453,-3.23
454,-3.43
455,-3.63
456,-3.82
457,-4.00
458,-4.17
459,-4.36
460,-4.62
461,-4.91
462,-5.26
463,-5.65
464,-6.13
465,-6.70
466,-7.38
467,-8.06
468,-8.67
469,-9.12
470,-9.45
471,-9.60
472,-9.57
473,-9.41
474,-9.20
475,-9.04
476,-9.02
477,-9.09
478,-9.26
479,-9.48
480,-9.74
481,-9.93
482,-10.06
483,-10.08
484,-10.09
485,-10.12
486,-10.31
487,-10.67
488,-11.20
489,-11.84
490,-12.53
491,-13.15
492,-13.66
493,-13.94
494,-14.03
495,-13.97
496,-13.93
497,-13.98
498,-14.22
499,-14.62
500,-15.22
501,-15.94
502,-16.69
503,-17.33
504,-17.81
505,-18.10
506,-18.24
507,-18.27
508,-18.25
509,-18.21
510,-18.17
511,-18.10
512,-17.94
513,-17.65
514,-17.18
515,-16.54
516,-15.75
517,-14.91
518,-14.09
519,-13.40
520,-12.81
521,-12.35
522,-11.96
523,-11.65
524,-11.35
525,-11.09
526,-10.82
527,-10.56
528,-10.31
529,-10.16
530,-10.11
531,-10.19
532,-10.29
533,-10.41
534,-10.48
535,-10.49
536,-10.44
537,-10.31
538,-10.17
539,-10.05
540,-9.99
541,-9.99
542,-10.03
543,-10.11
544,-10.23
545,-10.42
546,-10.62
547,-10.77
548,-10.80
549,-10.70
550,-10.49
551,-10.21
552,-9.88
553,-9.54
554,-9.22
555,-8.97
556,-8.83
557,-8.80
558,-8.83
559,-8.89
560,-8.97
561,-9.05
562,-9.12
563,-9.17
564,-9.24
565,-9.33
566,-9.48
567,-9.69
568,-9.93
569,-10.19
570,-10.45
571,-10.71
572,-10.96
573,-11.17
574,-11.36
575,-11.53
576,-11.76
577,-12.03
578,-12.34
579,-12.66
580,-13.01
581,-13.38
582,-13.76
583,-14.09
584,-14.40
585,-14.67
586,-14.95
587,-15.17
588,-15.37
589,-15.53
590,-15.68
591,-15.81
592,-15.94
593,-16.03
594,-16.12
595,-16.24
596,-16.42
597,-16.67
598,-17.01
599,-17.41
600,-17.85
601,-18.25
602,-18.55
603,-18.76
604,-18.87
605,-18.86
606,-18.74
607,-18.54
608,-18.33
609,-18.10
610,-17.84
611,-17.53
612,-17.17
613,-16.80
614,-16.37
615,-15.97
616,-15.59
617,-15.36
618,-15.23
619,-15.21
620,-15.21
621,-15.18
622,-15.03
623,-14.76
624,-14.27
625,-13.65
626,-12.84
627,-11.95
628,-10.99
629,-10.11
630,-9.29
631,-8.64
632,-8.06
633,-7.59
634,-7.18
635,-6.88
636,-6.63
637,-6.45
638,-6.24
639,-6.04
640,-5.78
641,-5.52
642,-5.17
643,-4.79
644,-4.35
645,-3.94
646,-3.56
647,-3.29
648,-3.10
649,-3.01
650,-2.98
651,-3.03
652,-3.10
653,-3.18
654,-3.26
655,-3.32
656,-3.34
657,-3.36
658,-3.40
659,-3.43
660,-3.46
661,-3.49
662,-3.51
663,-3.54
664,-3.62
665,-3.73
666,-3.91
667,-4.13
668,-4.38
669,-4.59
670,-4.76
671,-4.81
672,-4.78
673,-4.65
674,-4.48
675,-4.35
676,-4.35
677,-4.52
678,-4.88
679,-5.36
680,-5.93
681,-6.48
682,-6.99
683,-7.35
684,-7.54
685,-7.58
686,-7.59
687,-7.61
688,-7.73
689,-7.95
690,-8.31
691,-8.74
692,-9.20
693,-9.58
694,-9.86
695,-9.99
696,-9.98
697,-9.83
698,-9.63
699,-9.45
700,-9.30
701,-9.20
702,-9.15
703,-9.12
704,-9.13
705,-9.13
706,-9.11
707,-9.07
708,-9.05
709,-9.06
710,-9.12
711,-9.22
712,-9.36
713,-9.48
714,-9.55
715,-9.55
716,-9.49
717,-9.43
718,-9.41
719,-9.47
720,-9.60
721,-9.83
722,-10.14
723,-10.46
724,-10.70
725,-10.81
726,-10.77
727,-10.60
728,-10.33
729,-10.03
730,-9.77
731,-9.61
732,-9.53
733,-9.54
734,-9.63
735,-9.76
736,-9.92
737,-10.06
738,-10.19
739,-10.32
740,-10.48
741,-10.63
742,-10.82
743,-11.02
744,-11.28
745,-11.51
746,-11.75
747,-11.94
748,-12.10
749,-12.24
750,-12.39
751,-12.54
752,-12.70
753,-12.86
754,-13.06
755,-13.29
756,-13.53
757,-13.77
758,-14.05
759,-14.34
760,-14.63
761,-14.90
762,-15.12
763,-15.28
764,-15.34
765,-15.28
766,-15.13
767,-14.92
768,-14.69
769,-14.46
770,-14.23
771,-14.05
772,-13.92
773,-13.85
774,-13.78
775,-13.71
776,-13.60
777,-13.47
778,-13.27
779,-13.04
780,-12.77
781,-12.50
782,-12.18
783,-11.84
784,-11.52
785,-11.27
786,-11.05
787,-10.84
788,-10.67
789,-10.57
790,-10.57
791,-10.65
792,-10.77
793,-10.94
794,-11.16
795,-11.44
796,-11.74
797,-12.02
798,-12.26
799,-12.44
800,-12.55
801,-12.57
802,-12.52
803,-12.39
804,-12.21
805,-12.02
806,-11.80
807,-11.57
808,-11.28
809,-10.98
810,-10.64
811,-10.25
812,-9.81
813,-9.36
814,-8.93
815,-8.62
816,-8.38
817,-8.22
818,-8.06
819,-7.92
820,-7.71
821,-7.44
822,-7.09
823,-6.74
824,-6.37
825,-6.04
826,-5.71
827,-5.39
828,-5.09
829,-4.80
830,-4.49
831,-4.17
832,-3.85
833,-3.58
834,-3.33
835,-3.17
836,-3.05
837,-3.01
838,-3.01
839,-3.01
840,-3.03
841,-3.04
842,-3.07
843,-3.13
844,-3.24
845,-3.41
846,-3.65
847,-3.97
848,-4.39
849,-4.84
850,-5.30
851,-5.73
852,-6.19
853,-6.61
854,-7.02
855,-7.38
856,-7.80
857,-8.26
858,-8.83
859,-9.45
860,-10.19
861,-10.99
862,-11.98
863,-12.97
864,-13.98
865,-14.89
866,-15.76
867,-16.53
868,-17.27
869,-17.89
870,-18.48
871,-19.02
872,-19.59
873,-20.16
874,-20.74
875,-21.25
876,-21.71
877,-22.02
878,-22.17
879,-22.15
880,-22.00
881,-21.74
882,-21.45
883,-21.13
884,-20.81
885,-20.52
886,-20.21
887,-19.86
888,-19.42
889,-18.94
890,-18.36
891,-17.81
892,-17.22
893,-16.68
894,-16.11
895,-15.56
896,-15.00
897,-14.48
898,-13.94
899,-13.44
900,-12.93
901,-12.48
902,-12.05
903,-11.71
904,-11.40
905,-11.14
906,-10.84
907,-10.51
908,-10.12
909,-9.73
910,-9.32
911,-9.00
912,-8.74
913,-8.58
914,-8.43
915,-8.30
916,-8.13
917,-7.94
918,-7.68
919,-7.39
920,-7.09
921,-6.87
922,-6.74
923,-6.71
924,-6.72
925,-6.73
926,-6.69
927,-6.58
928,-6.41
929,-6.16
930,-5.91
931,-5.67
932,-5.54
933,-5.53
934,-5.69
935,-6.01
936,-6.48
937,-7.02
938,-7.56
939,-8.06
940,-8.55
941,-9.06
942,-9.60
943,-10.12
944,-10.62
945,-11.06
946,-11.47
947,-11.76
948,-11.95
949,-11.95
950,-11.85
951,-11.71
952,-11.67
953,-11.73
954,-11.95
955,-12.25
956,-12.63
957,-13.05
958,-13.45
959,-13.75
960,-13.93
961,-14.00
962,-14.02
963,-14.03
964,-14.09
965,-14.21
966,-14.38
967,-14.60
968,-14.87
969,-15.13
970,-15.34
971,-15.43
972,-15.43
973,-15.39
974,-15.34
975,-15.29
976,-15.27
977,-15.27
978,-15.30
979,-15.39
980,-15.50
981,-15.65
982,-15.81
983,-15.99
984,-16.16
985,-16.30
986,-16.41
987,-16.47
988,-16.46
989,-16.37
990,-16.16
991,-15.85
992,-15.42
993,-14.93
994,-14.37
995,-13.82
996,-13.24
997,-12.73
998,-12.23
999,-11.78
1000,-11.31
1001,-10.87
1002,-10.41
1003,-9.96
1004,-9.45
1005,-8.95
1006,-8.45
1007,-8.06
1008,-7.74
1009,-7.51
1010,-7.35
1011,-7.30
1012,-7.32
1013,-7.43
1014,-7.58
1015,-7.74
1016,-7.90
1017,-8.07
1018,-8.19
1019,-8.26
1020,-8.23
1021,-8.16
1022,-8.06
1023,-7.93
1024,-7.78
1025,-7.61
1026,-7.45
1027,-7.34
1028,-7.28
1029,-7.24
1030,-7.23
1031,-7.26
1032,-7.29
1033,-7.31
1034,-7.32
1035,-7.32
1036,-7.29
1037,-7.23
1038,-7.15
1039,-7.06
1040,-7.00
1041,-6.99
1042,-7.00
1043,-7.01
1044,-7.04
1045,-7.08
1046,-7.16
1047,-7.27
1048,-7.43
1049,-7.62
1050,-7.88
1051,-8.19
1052,-8.59
1053,-9.02
1054,-9.48
1055,-9.86
1056,-10.21
1057,-10.48
1058,-10.72
1059,-10.93
1060,-11.15
1061,-11.40
1062,-11.73
1063,-12.12
1064,-12.57
1065,-13.01
1066,-13.43
1067,-13.76
1068,-14.01
1069,-14.18
1070,-14.33
1071,-14.47
1072,-14.60
1073,-14.71
1074,-14.84
1075,-14.97
1076,-15.11
1077,-15.25
1078,-15.40
1079,-15.51
1080,-15.61
1081,-15.69
1082,-15.78
1083,-15.88
1084,-15.96
1085,-15.98
1086,-15.91
1087,-15.75
1088,-15.53
1089,-15.24
1090,-14.91
1091,-14.57
1092,-14.27
1093,-14.03
1094,-13.85
1095,-13.74
1096,-13.67
1097,-13.66
1098,-13.65
1099,-13.69
1100,-13.72
1101,-13.77
1102,-13.76
1103,-13.68
1104,-13.47
1105,-13.15
1106,-12.70
1107,-12.15
1108,-11.51
1109,-10.88
1110,-10.26
1111,-9.74
1112,-9.27
1113,-8.90
1114,-8.57
1115,-8.31
1116,-8.05
1117,-7.80
1118,-7.49
1119,-7.15
1120,-6.74
1121,-6.38
1122,-6.00
1123,-5.68
1124,-5.39
1125,-5.13
1126,-4.88
1127,-4.68
1128,-4.49
1129,-4.29
1130,-4.02
1131,-3.73
1132,-3.46
1133,-3.26
1134,-3.10
1135,-3.03
1136,-3.07
1137,-3.25
1138,-3.49
1139,-3.72
1140,-3.91
1141,-4.05
1142,-4.10
1143,-4.06
1144,-3.95
1145,-3.81
1146,-3.67
1147,-3.56
1148,-3.52
1149,-3.54
1150,-3.62
1151,-3.72
1152,-3.84
1153,-3.96
1154,-4.07
1155,-4.14
1156,-4.19
1157,-4.23
1158,-4.29
1159,-4.38
1160,-4.54
1161,-4.73
1162,-4.96
1163,-5.18
1164,-5.38
1165,-5.53
1166,-5.65
1167,-5.72
1168,-5.80
1169,-5.89
1170,-6.03
1171,-6.20
1172,-6.42
1173,-6.66
1174,-6.94
1175,-7.17
1176,-7.33
1177,-7.40
1178,-7.47
1179,-7.55
1180,-7.70
1181,-7.87
1182,-8.09
1183,-8.35
1184,-8.65
1185,-8.97
1186,-9.28
1187,-9.52
1188,-9.68
1189,-9.78
1190,-9.86
1191,-9.89
1192,-9.86
1193,-9.78
1194,-9.70
1195,-9.62
1196,-9.50
1197,-9.35
1198,-9.19
1199,-9.04
1200,-8.90
1201,-8.75
1202,-8.58
1203,-8.41
1204,-8.18
1205,-7.88
1206,-7.52
1207,-7.19
1208,-6.90
1209,-6.66
1210,-6.44
1211,-6.26
1212,-6.16
1213,-6.13
1214,-6.08
1215,-6.00
1216,-5.94
1217,-5.91
1218,-5.93
1219,-5.97
1220,-6.03
1221,-6.16
1222,-6.32
1223,-6.51
1224,-6.66
1225,-6.75
1226,-6.83
1227,-6.88
1228,-6.94
1229,-7.01
1230,-7.14
1231,-7.35
1232,-7.68
1233,-8.06
1234,-8.53
1235,-9.00
1236,-9.51
1237,-9.97
1238,-10.41
1239,-10.76
1240,-11.07
1241,-11.31
1242,-11.54
1243,-11.75
1244,-12.02
1245,-12.32
1246,-12.70
1247,-13.07
1248,-13.46
1249,-13.81
1250,-14.13
1251,-14.36
1252,-14.53
1253,-14.62
1254,-14.67
1255,-14.71
1256,-14.77
1257,-14.84
1258,-14.93
1259,-15.03
1260,-15.14
1261,-15.19
1262,-15.18
1263,-15.12
1264,-15.05
1265,-15.01
1266,-15.00
1267,-15.01
1268,-15.09
1269,-15.25
1270,-15.49
1271,-15.75
1272,-16.00
1273,-16.22
1274,-16.41
1275,-16.53
1276,-16.56
1277,-16.49
1278,-16.38
1279,-16.30
1280,-16.28
1281,-16.34
1282,-16.46
1283,-16.62
1284,-16.82
1285,-17.04
1286,-17.17
1287,-17.14
1288,-16.86
1289,-16.37
1290,-15.69
1291,-14.95
1292,-14.20
1293,-13.57
1294,-13.08
1295,-12.82
1296,-12.70
1297,-12.72
1298,-12.79
1299,-12.88
1300,-12.91
1301,-12.86
1302,-12.69
1303,-12.45
1304,-12.15
1305,-11.89
1306,-11.63
1307,-11.40
1308,-11.15
1309,-10.90
1310,-10.64
1311,-10.38
1312,-10.09
1313,-9.80
1314,-9.51
1315,-9.23
1316,-8.94
1317,-8.67
1318,-8.43
1319,-8.27
1320,-8.18
1321,-8.18
1322,-8.29
1323,-8.51
1324,-8.81
1325,-9.11
1326,-9.37
1327,-9.55
1328,-9.65
1329,-9.66
1330,-9.62
1331,-9.57
1332,-9.59
1333,-9.68
1334,-9.86
1335,-10.09
1336,-10.41
1337,-10.80
1338,-11.28
1339,-11.75
1340,-12.22
1341,-12.67
1342,-13.13
1343,-13.56
1344,-13.98
1345,-14.35
1346,-14.69
1347,-14.98
1348,-15.26
1349,-15.47
1350,-15.65
1351,-15.75
1352,-15.84
1353,-15.91
1354,-16.02
1355,-16.15
1356,-16.32
1357,-16.50
1358,-16.71
1359,-16.88
1360,-16.99
1361,-17.01
1362,-16.97
1363,-16.87
1364,-16.69
1365,-16.46
1366,-16.19
1367,-15.96
1368,-15.81
1369,-15.74
1370,-15.71
1371,-15.69
1372,-15.66
1373,-15.58
1374,-15.43
1375,-15.24
1376,-15.01
1377,-14.78
1378,-14.50
1379,-14.25
1380,-14.05
1381,-13.94
1382,-13.85
1383,-13.76
1384,-13.63
1385,-13.50
1386,-13.33
1387,-13.10
1388,-12.76
1389,-12.36
1390,-11.94
1391,-11.59
1392,-11.29
1393,-11.11
1394,-11.00
1395,-10.99
1396,-11.01
1397,-11.05
1398,-11.03
1399,-10.94
1400,-10.70
1401,-10.35
1402,-9.90
1403,-9.42
1404,-8.91
1405,-8.40
1406,-7.88
1407,-7.42
1408,-6.98
1409,-6.58
1410,-6.18
1411,-5.81
1412,-5.49
1413,-5.27
1414,-5.13
1415,-5.07
1416,-5.13
1417,-5.31
1418,-5.58
1419,-5.87
1420,-6.19
1421,-6.50
1422,-6.86
1423,-7.23
1424,-7.61
1425,-7.97
1426,-8.32
1427,-8.63
1428,-8.91
1429,-9.12
1430,-9.28
1431,-9.40
1432,-9.50
1433,-9.55
1434,-9.59
1435,-9.62
1436,-9.70
1437,-9.82
1438,-9.96
1439,-10.06
1440,-10.10
1441,-10.10
1442,-10.06
1443,-9.98
1444,-9.85
1445,-9.68
1446,-9.54
1447,-9.43
1448,-9.40
1449,-9.46
1450,-9.61
1451,-9.86
1452,-10.15
1453,-10.45
1454,-10.73
1455,-10.96
1456,-11.17
1457,-11.34
1458,-11.53
1459,-11.73
1460,-12.02
1461,-12.37
1462,-12.83
1463,-13.34
1464,-13.89
1465,-14.36
1466,-14.76
1467,-15.08
1468,-15.34
1469,-15.53
1470,-15.66
1471,-15.72
1472,-15.75
1473,-15.77
1474,-15.72
1475,-15.59
1476,-15.39
1477,-15.16
1478,-14.93
1479,-14.72
1480,-14.51
1481,-14.34
1482,-14.16
1483,-13.98
1484,-13.79
1485,-13.57
1486,-13.33
1487,-13.11
1488,-12.95
1489,-12.87
1490,-12.86
1491,-12.92
1492,-12.97
1493,-13.02
1494,-13.01
1495,-12.91
1496,-12.71
1497,-12.46
1498,-12.16
1499,-11.91
1500,-11.69
1501,-11.54
1502,-11.42
1503,-11.31
1504,-11.14
1505,-10.89
1506,-10.54
1507,-10.13
1508,-9.62
1509,-9.12
1510,-8.62
1511,-8.19
1512,-7.77
1513,-7.41
1514,-7.07
1515,-6.74
1516,-6.31
1517,-5.84
1518,-5.37
1519,-4.98
1520,-4.68
1521,-4.49
1522,-4.43
1523,-4.51
1524,-4.69
1525,-4.94
1526,-5.22
1527,-5.48
1528,-5.70
1529,-5.89
1530,-6.10
1531,-6.40
1532,-6.81
1533,-7.30
1534,-7.86
1535,-8.42
1536,-8.97
1537,-9.42
1538,-9.76
1539,-9.94
1540,-10.06
1541,-10.16
1542,-10.34
1543,-10.59
1544,-10.95
1545,-11.36
1546,-11.83
1547,-12.31
1548,-12.79
1549,-13.20
1550,-13.53
1551,-13.79
1552,-14.01
1553,-14.22
1554,-14.45
1555,-14.67
1556,-14.88
1557,-15.06
1558,-15.17
1559,-15.22
1560,-15.20
1561,-15.10
1562,-14.89
1563,-14.59
1564,-14.24
1565,-13.92
1566,-13.65
1567,-13.44
1568,-13.25
1569,-13.12
1570,-13.01
1571,-12.89
1572,-12.71
1573,-12.47
1574,-12.22
1575,-12.00
1576,-11.81
1577,-11.70
1578,-11.68
1579,-11.79
1580,-11.96
1581,-12.16
1582,-12.28
1583,-12.31
1584,-12.21
1585,-11.99
1586,-11.63
1587,-11.20
1588,-10.75
1589,-10.37
1590,-10.05
1591,-9.80
1592,-9.60
1593,-9.47
1594,-9.35
1595,-9.19
1596,-8.97
1597,-8.76
1598,-8.56
1599,-8.41
1600,-8.25
1601,-8.12
1602,-8.02
1603,-8.00
1604,-8.05
1605,-8.13
1606,-8.22
1607,-8.37
1608,-8.56
1609,-8.78
1610,-8.99
1611,-9.18
1612,-9.34
1613,-9.45
1614,-9.50
1615,-9.51
1616,-9.50
1617,-9.51
1618,-9.55
1619,-9.64
1620,-9.77
1621,-9.90
1622,-9.99
1623,-9.98
1624,-9.86
1625,-9.65
1626,-9.38
1627,-9.06
1628,-8.74
1629,-8.45
1630,-8.24
1631,-8.13
1632,-8.17
1633,-8.33
1634,-8.59
1635,-8.90
1636,-9.21
1637,-9.51
1638,-9.77
1639,-9.97
1640,-10.11
1641,-10.19
1642,-10.21
1643,-10.15
1644,-10.00
1645,-9.80
1646,-9.59
1647,-9.41
1648,-9.25
1649,-9.14
1650,-9.06
1651,-9.09
1652,-9.21
1653,-9.38
1654,-9.50
1655,-9.53
1656,-9.44
1657,-9.25
1658,-8.90
1659,-8.42
1660,-7.84
1661,-7.26
1662,-6.73
1663,-6.30
1664,-5.97
1665,-5.76
1666,-5.62
1667,-5.55
1668,-5.50
1669,-5.42
1670,-5.27
1671,-5.08
1672,-4.87
1673,-4.69
1674,-4.53
1675,-4.45
1676,-4.41
1677,-4.46
1678,-4.52
1679,-4.58
1680,-4.55
1681,-4.47
1682,-4.26
1683,-3.97
1684,-3.56
1685,-3.09
1686,-2.57
1687,-2.08
1688,-1.61
1689,-1.21
1690,-0.89
1691,-0.65
1692,-0.50
1693,-0.46
1694,-0.43
1695,-0.43
1696,-0.38
1697,-0.31
1698,-0.16
1699,0.04
1700,0.27
1701,0.49
1702,0.69
1703,0.85
1704,0.96
1705,1.03
1706,1.00
1707,0.89
1708,0.66
1709,0.36
1710,-0.06
1711,-0.53
1712,-1.08
1713,-1.62
1714,-2.19
1715,-2.73
1716,-3.31
1717,-3.89
1718,-4.55
1719,-5.23
1720,-5.97
1721,-6.68
1722,-7.39
1723,-8.03
1724,-8.64
1725,-9.12
1726,-9.55
1727,-9.91
1728,-10.28
1729,-10.64
1730,-11.05
1731,-11.44
1732,-11.82
1733,-12.11
1734,-12.35
1735,-12.54
1736,-12.70
1737,-12.84
1738,-12.98
1739,-13.14
1740,-13.31
1741,-13.43
1742,-13.46
1743,-13.36
1744,-13.13
1745,-12.79
1746,-12.37
1747,-11.95
1748,-11.58
1749,-11.36
1750,-11.31
1751,-11.47
1752,-11.75
1753,-12.11
1754,-12.41
1755,-12.60
1756,-12.60
1757,-12.45
1758,-12.14
1759,-11.72
1760,-11.22
1761,-10.75
1762,-10.34
1763,-10.04
1764,-9.82
1765,-9.69
1766,-9.55
1767,-9.41
1768,-9.13
1769,-8.74
1770,-8.17
1771,-7.54
1772,-6.84
1773,-6.17
1774,-5.54
1775,-4.99
1776,-4.46
1777,-3.97
1778,-3.50
1779,-3.07
1780,-2.65
1781,-2.26
1782,-1.88
1783,-1.59
1784,-1.37
1785,-1.25
1786,-1.14
1787,-1.04
1788,-0.89
1789,-0.71
1790,-0.49
1791,-0.25
1792,0.01
1793,0.23
1794,0.37
1795,0.43
1796,0.43
1797,0.37
1798,0.25
1799,0.09
1800,-0.12
1801,-0.35
1802,-0.60
1803,-0.86
1804,-1.15
1805,-1.44
1806,-1.73
1807,-1.98
1808,-2.25
1809,-2.53
1810,-2.88
1811,-3.22
1812,-3.62
1813,-4.07
1814,-4.62
1815,-5.20
1816,-5.84
1817,-6.42
1818,-7.01
1819,-7.55
1820,-8.09
1821,-8.59
1822,-9.12
1823,-9.67
1824,-10.29
1825,-10.89
1826,-11.48
1827,-11.99
1828,-12.47
1829,-12.86
1830,-13.15
1831,-13.28
1832,-13.31
1833,-13.30
1834,-13.31
1835,-13.32
1836,-13.38
1837,-13.47
1838,-13.63
1839,-13.80
1840,-13.98
1841,-14.10
1842,-14.15
1843,-14.11
1844,-13.97
1845,-13.76
1846,-13.49
1847,-13.21
1848,-12.91
1849,-12.61
1850,-12.33
1851,-12.10
1852,-11.89
1853,-11.73
1854,-11.54
1855,-11.34
1856,-11.12
1857,-10.86
1858,-10.56
1859,-10.25
1860,-9.93
1861,-9.67
1862,-9.48
1863,-9.39
1864,-9.39
1865,-9.45
1866,-9.51
1867,-9.59
1868,-9.65
1869,-9.70
1870,-9.65
1871,-9.54
1872,-9.40
1873,-9.28
1874,-9.12
1875,-8.96
1876,-8.79
1877,-8.67
1878,-8.57
1879,-8.48
1880,-8.37
1881,-8.25
1882,-8.11
1883,-8.00
1884,-7.90
1885,-7.82
1886,-7.74
1887,-7.66
1888,-7.61
1889,-7.56
1890,-7.51
1891,-7.43
1892,-7.35
1893,-7.35
1894,-7.45
1895,-7.67
1896,-8.00
1897,-8.37
1898,-8.78
1899,-9.20
1900,-9.61
1901,-9.96
1902,-10.25
1903,-10.44
1904,-10.61
1905,-10.76
1906,-10.91
1907,-11.05
1908,-11.19
1909,-11.28
1910,-11.31
1911,-11.25
1912,-11.16
1913,-11.05
1914,-10.93
1915,-10.77
1916,-10.60
1917,-10.45
1918,-10.36
1919,-10.31
1920,-10.34
1921,-10.44
1922,-10.60
1923,-10.81
1924,-11.01
1925,-11.17
1926,-11.28
1927,-11.32
1928,-11.28
1929,-11.18
1930,-11.05
1931,-10.94
1932,-10.93
1933,-10.98
1934,-11.12
1935,-11.29
1936,-11.51
1937,-11.76
1938,-12.04
1939,-12.30
1940,-12.55
1941,-12.79
1942,-13.02
1943,-13.24
1944,-13.43
1945,-13.57
1946,-13.67
1947,-13.73
1948,-13.74
1949,-13.71
1950,-13.60
1951,-13.38
1952,-13.02
1953,-12.54
1954,-11.92
1955,-11.24
1956,-10.51
1957,-9.86
1958,-9.33
1959,-8.98
1960,-8.74
1961,-8.63
1962,-8.56
1963,-8.51
1964,-8.35
1965,-8.09
1966,-7.71
1967,-7.29
1968,-6.83
1969,-6.40
1970,-6.01
1971,-5.72
1972,-5.49
1973,-5.27
1974,-5.05
1975,-4.84
1976,-4.62
1977,-4.45
1978,-4.30
1979,-4.20
1980,-4.14
1981,-4.09
1982,-4.02
1983,-3.95
1984,-3.84
1985,-3.72
1986,-3.59
1987,-3.47
1988,-3.36
1989,-3.25
1990,-3.09
1991,-2.88
1992,-2.59
1993,-2.26
1994,-1.87
1995,-1.45
1996,-1.01
1997,-0.61
1998,-0.30
1999,-0.08
2000,0.08
2001,0.18
2002,0.19
2003,0.11
2004,-0.03
2005,-0.22
2006,-0.43
2007,-0.65
2008,-0.85
2009,-0.96
2010,-1.01
2011,-1.00
2012,-1.01
2013,-1.08
2014,-1.29
2015,-1.63
2016,-2.13
2017,-2.71
2018,-3.36
2019,-3.96
2020,-4.51
2021,-4.92
2022,-5.25
2023,-5.49
2024,-5.70
2025,-5.91
2026,-6.20
2027,-6.51
2028,-6.83
2029,-7.10
2030,-7.37
2031,-7.60
2032,-7.78
2033,-7.87
2034,-7.87
2035,-7.82
2036,-7.74
2037,-7.64
2038,-7.55
2039,-7.45
2040,-7.35
2041,-7.23
2042,-7.07
2043,-6.86
2044,-6.56
2045,-6.20
2046,-5.78
2047,-5.35
2048,-4.91
2049,-4.52
2050,-4.14
2051,-3.79
2052,-3.46
2053,-3.17
2054,-2.88
2055,-2.59
2056,-2.27
2057,-1.95
2058,-1.64
2059,-1.39
2060,-1.18
2061,-1.05
2062,-0.96
2063,-0.87
2064,-0.72
2065,-0.53
2066,-0.29
2067,-0.03
2068,0.27
2069,0.53
2070,0.77
2071,0.95
2072,1.11
2073,1.26
2074,1.41
2075,1.55
2076,1.71
2077,1.88
2078,2.05
2079,2.18
2080,2.23
2081,2.18
2082,2.07
2083,1.93
2084,1.82
2085,1.75
2086,1.72
2087,1.73
2088,1.75
2089,1.78
2090,1.75
2091,1.66
2092,1.47
2093,1.24
2094,0.97
2095,0.70
2096,0.47
2097,0.27
2098,0.11
2099,0.02
2100,-0.02
2101,0.02
2102,0.12
2103,0.25
2104,0.34
2105,0.41
2106,0.43
2107,0.40
2108,0.26
2109,0.02
2110,-0.27
2111,-0.53
2112,-0.75
2113,-0.92
2114,-1.08
2115,-1.21
2116,-1.34
2117,-1.49
2118,-1.73
2119,-2.08
2120,-2.57
2121,-3.16
2122,-3.85
2123,-4.57
2124,-5.29
2125,-5.92
2126,-6.46
2127,-6.84
2128,-7.10
2129,-7.24
2130,-7.30
2131,-7.31
2132,-7.32
2133,-7.31
2134,-7.32
2135,-7.32
2136,-7.31
2137,-7.25
2138,-7.12
2139,-6.94
2140,-6.74
2141,-6.52
2142,-6.25
2143,-5.94
2144,-5.60
2145,-5.29
2146,-5.02
2147,-4.80
2148,-4.62
2149,-4.50
2150,-4.39
2151,-4.32
2152,-4.29
2153,-4.30
2154,-4.25
2155,-4.12
2156,-3.90
2157,-3.65
2158,-3.41
2159,-3.20
2160,-3.02
2161,-2.90
2162,-2.84
2163,-2.82
2164,-2.82
2165,-2.76
2166,-2.62
2167,-2.43
2168,-2.19
2169,-1.97
2170,-1.75
2171,-1.58
2172,-1.46
2173,-1.40
2174,-1.39
2175,-1.39
2176,-1.39
2177,-1.43
2178,-1.56
2179,-1.79
2180,-2.11
2181,-2.45
2182,-2.81
2183,-3.14
2184,-3.43
2185,-3.61
2186,-3.68
2187,-3.59
2188,-3.46
2189,-3.28
2190,-3.18
2191,-3.19
2192,-3.36
2193,-3.71
2194,-4.27
2195,-4.99
2196,-5.81
2197,-6.64
2198,-7.40
2199,-8.03
2200,-8.54
2201,-8.89
2202,-9.12
2203,-9.25
2204,-9.35
2205,-9.43
2206,-9.57
2207,-9.72
2208,-9.92
2209,-10.09
2210,-10.22
2211,-10.28
2212,-10.28
2213,-10.24
2214,-10.15
2215,-10.06
2216,-9.98
2217,-9.96
2218,-9.98
2219,-10.05
2220,-10.12
2221,-10.21
2222,-10.27
2223,-10.29
2224,-10.25
2225,-10.13
2226,-9.93
2227,-9.69
2228,-9.45
2229,-9.22
2230,-9.04
2231,-8.94
2232,-8.95
2233,-9.06
2234,-9.28
2235,-9.56
2236,-9.91
2237,-10.31
2238,-10.73
2239,-11.13
2240,-11.49
2241,-11.77
2242,-11.96
2243,-12.02
2244,-11.94
2245,-11.74
2246,-11.44
2247,-11.06
2248,-10.60
2249,-10.11
2250,-9.61
2251,-9.15
2252,-8.74
2253,-8.43
2254,-8.19
2255,-8.03
2256,-7.85
2257,-7.67
2258,-7.40
2259,-7.07
2260,-6.65
2261,-6.21
2262,-5.70
2263,-5.21
2264,-4.73
2265,-4.33
2266,-3.94
2267,-3.58
2268,-3.19
2269,-2.77
2270,-2.31
2271,-1.88
2272,-1.50
2273,-1.16
2274,-0.81
2275,-0.48
2276,-0.19
2277,0.01
2278,0.16
2279,0.27
2280,0.33
2281,0.27
2282,0.08
2283,-0.22
2284,-0.57
2285,-0.89
2286,-1.14
2287,-1.27
2288,-1.34
2289,-1.32
2290,-1.30
2291,-1.30
2292,-1.45
2293,-1.74
2294,-2.17
2295,-2.67
2296,-3.23
2297,-3.75
2298,-4.23
2299,-4.56
2300,-4.79
2301,-4.93
2302,-5.07
2303,-5.21
2304,-5.46
2305,-5.78
2306,-6.25
2307,-6.75
2308,-7.31
2309,-7.84
2310,-8.36
2311,-8.83
2312,-9.25
2313,-9.58
2314,-9.87
2315,-10.12
2316,-10.38
2317,-10.64
2318,-10.99
2319,-11.38
2320,-11.80
2321,-12.18
2322,-12.51
2323,-12.73
2324,-12.81
2325,-12.76
2326,-12.64
2327,-12.50
2328,-12.37
2329,-12.28
2330,-12.28
2331,-12.34
2332,-12.43
2333,-12.47
2334,-12.44
2335,-12.33
2336,-12.11
2337,-11.80
2338,-11.38
2339,-10.93
2340,-10.53
2341,-10.23
2342,-10.04
2343,-9.97
2344,-9.99
2345,-10.07
2346,-10.17
2347,-10.24
2348,-10.22
2349,-10.12
2350,-9.88
2351,-9.56
2352,-9.18
2353,-8.80
2354,-8.45
2355,-8.17
2356,-7.97
2357,-7.84
2358,-7.73
2359,-7.61
2360,-7.45
2361,-7.26
2362,-7.03
2363,-6.79
2364,-6.55
2365,-6.38
2366,-6.26
2367,-6.22
2368,-6.17
2369,-6.12
2370,-6.03
2371,-5.91
2372,-5.74
2373,-5.56
2374,-5.41
2375,-5.33
2376,-5.33
2377,-5.41
2378,-5.55
2379,-5.78
2380,-6.07
2381,-6.39
2382,-6.68
2383,-6.97
2384,-7.28
2385,-7.59
2386,-7.88
2387,-8.10
2388,-8.26
2389,-8.36
2390,-8.36
2391,-8.22
2392,-7.96
2393,-7.64
2394,-7.32
2395,-7.01
2396,-6.72
2397,-6.46
2398,-6.28
2399,-6.20
2400,-6.20
2401,-6.29
2402,-6.45
2403,-6.65
2404,-6.84
2405,-7.01
2406,-7.14
2407,-7.26
2408,-7.36
2409,-7.48
2410,-7.63
2411,-7.80
2412,-8.01
2413,-8.23
2414,-8.47
2415,-8.68
2416,-8.87
2417,-9.02
2418,-9.20
2419,-9.41
2420,-9.66
2421,-9.91
2422,-10.12
2423,-10.28
2424,-10.35
2425,-10.34
2426,-10.23
2427,-10.06
2428,-9.82
2429,-9.59
2430,-9.34
2431,-9.09
2432,-8.76
2433,-8.32
2434,-7.71
2435,-6.98
2436,-6.10
2437,-5.19
2438,-4.22
2439,-3.30
2440,-2.43
2441,-1.69
2442,-1.07
2443,-0.60
2444,-0.19
2445,0.13
2446,0.40
2447,0.56
2448,0.70
2449,0.79
2450,0.85
2451,0.82
2452,0.76
2453,0.68
2454,0.59
2455,0.47
2456,0.30
2457,0.08
2458,-0.23
2459,-0.59
2460,-1.02
2461,-1.45
2462,-1.85
2463,-2.16
2464,-2.46
2465,-2.74
2466,-3.04
2467,-3.34
2468,-3.77
2469,-4.29
2470,-4.94
2471,-5.61
2472,-6.30
2473,-6.92
2474,-7.51
2475,-8.02
2476,-8.50
2477,-8.91
2478,-9.36
2479,-9.82
2480,-10.37
2481,-10.91
2482,-11.47
2483,-11.92
2484,-12.35
2485,-12.70
2486,-13.02
2487,-13.25
2488,-13.51
2489,-13.77
2490,-14.12
2491,-14.53
2492,-15.02
2493,-15.51
2494,-16.01
2495,-16.43
2496,-16.82
2497,-17.09
2498,-17.27
2499,-17.34
2500,-17.35
2501,-17.33
2502,-17.31
2503,-17.33
2504,-17.39
2505,-17.47
2506,-17.55
2507,-17.59
2508,-17.56
2509,-17.43
2510,-17.17
2511,-16.83
2512,-16.44
2513,-16.10
2514,-15.77
2515,-15.50
2516,-15.24
2517,-15.00
2518,-14.68
2519,-14.31
2520,-13.77
2521,-13.11
2522,-12.26
2523,-11.40
2524,-10.56
2525,-9.86
2526,-9.27
2527,-8.84
2528,-8.51
2529,-8.28
2530,-7.94
2531,-7.48
2532,-6.87
2533,-6.21
2534,-5.53
2535,-4.97
2536,-4.52
2537,-4.26
2538,-4.10
2539,-4.07
2540,-4.07
2541,-4.04
2542,-3.86
2543,-3.57
2544,-3.21
2545,-2.89
2546,-2.59
2547,-2.39
2548,-2.29
2549,-2.31
2550,-2.39
2551,-2.44
2552,-2.40
2553,-2.28
2554,-2.10
2555,-1.85
2556,-1.55
2557,-1.21
2558,-0.89
2559,-0.67
2560,-0.56
2561,-0.53
2562,-0.53
2563,-0.60
2564,-0.70
2565,-0.82
2566,-0.92
2567,-0.96
2568,-0.96
2569,-0.98
2570,-1.04
2571,-1.16
2572,-1.33
2573,-1.50
2574,-1.69
2575,-1.91
2576,-2.17
2577,-2.42
2578,-2.67
2579,-2.91
2580,-3.17
2581,-3.42
2582,-3.64
2583,-3.80
2584,-3.92
2585,-3.98
2586,-4.02
2587,-4.04
2588,-4.11
2589,-4.28
2590,-4.55
2591,-4.92
2592,-5.37
2593,-5.84
2594,-6.29
2595,-6.63
2596,-6.86
2597,-6.97
2598,-7.00
2599,-6.97
2600,-6.94
2601,-6.97
2602,-7.13
2603,-7.43
2604,-7.84
2605,-8.29
2606,-8.71
2607,-9.07
2608,-9.35
2609,-9.52
2610,-9.60
2611,-9.60
2612,-9.56
2613,-9.54
2614,-9.54
2615,-9.57
2616,-9.57
2617,-9.54
2618,-9.44
2619,-9.24
2620,-8.93
2621,-8.58
2622,-8.20
2623,-7.82
2624,-7.41
2625,-7.00
2626,-6.63
2627,-6.37
2628,-6.18
2629,-6.07
2630,-6.02
2631,-6.03
2632,-6.03
2633,-6.05
2634,-6.02
2635,-5.97
2636,-5.87
2637,-5.75
2638,-5.63
2639,-5.57
2640,-5.59
2641,-5.71
2642,-5.91
2643,-6.11
2644,-6.27
2645,-6.38
2646,-6.41
2647,-6.34
2648,-6.18
2649,-5.96
2650,-5.74
2651,-5.59
2652,-5.52
2653,-5.51
2654,-5.55
2655,-5.60
2656,-5.65
2657,-5.69
2658,-5.76
2659,-5.87
2660,-6.03
2661,-6.28
2662,-6.62
2663,-7.03
2664,-7.48
2665,-7.90
2666,-8.29
2667,-8.60
2668,-8.83
2669,-8.96
2670,-9.06
2671,-9.18
2672,-9.42
2673,-9.77
2674,-10.26
2675,-10.85
2676,-11.57
2677,-12.34
2678,-13.14
2679,-13.82
2680,-14.42
2681,-14.85
2682,-15.21
2683,-15.45
2684,-15.68
2685,-15.85
2686,-16.07
2687,-16.29
2688,-16.60
2689,-16.98
2690,-17.42
2691,-17.87
2692,-18.33
2693,-18.72
2694,-19.06
2695,-19.29
2696,-19.42
2697,-19.44
2698,-19.36
2699,-19.20
2700,-18.99
2701,-18.78
2702,-18.65
2703,-18.58
2704,-18.59
2705,-18.65
2706,-18.75
2707,-18.86
2708,-18.91
2709,-18.88
2710,-18.73
2711,-18.52
2712,-18.25
2713,-18.00
2714,-17.74
2715,-17.51
2716,-17.28
2717,-17.07
2718,-16.83
2719,-16.57
2720,-16.21
2721,-15.82
2722,-15.30
2723,-14.76
2724,-14.14
2725,-13.53
2726,-12.85
2727,-12.19
2728,-11.47
2729,-10.77
2730,-9.94
2731,-9.09
2732,-8.15
2733,-7.23
2734,-6.26
2735,-5.36
2736,-4.42
2737,-3.56
2738,-2.73
2739,-2.04
2740,-1.40
2741,-0.89
2742,-0.40
2743,-0.02
2744,0.31
2745,0.52
2746,0.76
2747,0.98
2748,1.25
2749,1.50
2750,1.75
2751,1.97
2752,2.24
2753,2.54
2754,2.85
2755,3.16
2756,3.45
2757,3.72
2758,3.96
2759,4.10
2760,4.13
2761,4.01
2762,3.73
2763,3.33
2764,2.84
2765,2.28
2766,1.69
2767,1.13
2768,0.63
2769,0.24
2770,-0.10
2771,-0.40
2772,-0.72
2773,-1.01
2774,-1.31
2775,-1.53
2776,-1.72
2777,-1.85
2778,-1.98
2779,-2.14
2780,-2.43
2781,-2.79
2782,-3.27
2783,-3.80
2784,-4.40
2785,-4.99
2786,-5.55
2787,-6.00
2788,-6.37
2789,-6.65
2790,-6.93
2791,-7.19
2792,-7.50
2793,-7.81
2794,-8.16
2795,-8.48
2796,-8.83
2797,-9.13
2798,-9.45
2799,-9.74
2800,-10.02
2801,-10.23
2802,-10.41
2803,-10.55
2804,-10.64
2805,-10.66
2806,-10.63
2807,-10.58
2808,-10.54
2809,-10.53
2810,-10.53
2811,-10.54
2812,-10.50
2813,-10.38
2814,-10.16
2815,-9.84
2816,-9.44
2817,-8.97
2818,-8.49
2819,-8.07
2820,-7.77
2821,-7.64
2822,-7.64
2823,-7.76
2824,-7.89
2825,-8.01
2826,-8.11
2827,-8.17
2828,-8.16
2829,-8.09
2830,-7.95
2831,-7.77
2832,-7.55
2833,-7.32
2834,-7.09
2835,-6.85
2836,-6.57
2837,-6.28
2838,-6.00
2839,-5.74
2840,-5.45
2841,-5.17
2842,-4.89
2843,-4.68
2844,-4.45
2845,-4.23
2846,-3.99
2847,-3.77
2848,-3.52
2849,-3.23
2850,-2.88
2851,-2.50
2852,-2.11
2853,-1.77
2854,-1.53
2855,-1.40
2856,-1.40
2857,-1.51
2858,-1.70
2859,-1.94
2860,-2.19
2861,-2.41
2862,-2.59
2863,-2.75
2864,-2.90
2865,-3.06
2866,-3.24
2867,-3.43
2868,-3.56
2869,-3.59
2870,-3.48
2871,-3.23
2872,-2.88
2873,-2.51
2874,-2.24
2875,-2.06
2876,-2.01
2877,-2.07
2878,-2.29
2879,-2.62
2880,-3.01
2881,-3.42
2882,-3.83
2883,-4.23
2884,-4.65
2885,-5.02
2886,-5.39
2887,-5.71
2888,-6.06
2889,-6.38
2890,-6.74
2891,-7.10
2892,-7.55
2893,-8.00
2894,-8.53
2895,-9.07
2896,-9.69
2897,-10.31
2898,-10.97
2899,-11.60
2900,-12.25
2901,-12.87
2902,-13.49
2903,-14.02
2904,-14.48
2905,-14.82
2906,-15.10
2907,-15.31
2908,-15.52
2909,-15.73
2910,-15.96
2911,-16.18
2912,-16.38
2913,-16.52
2914,-16.49
2915,-16.29
2916,-15.83
2917,-15.20
2918,-14.41
2919,-13.56
2920,-12.65
2921,-11.81
2922,-11.02
2923,-10.39
2924,-9.81
2925,-9.29
2926,-8.71
2927,-8.12
2928,-7.45
2929,-6.76
2930,-6.00
2931,-5.29
2932,-4.59
2933,-4.00
2934,-3.48
2935,-3.07
2936,-2.76
2937,-2.59
2938,-2.53
2939,-2.60
2940,-2.73
2941,-2.90
2942,-3.06
2943,-3.21
2944,-3.29
2945,-3.30
2946,-3.20
2947,-3.02
2948,-2.78
2949,-2.53
2950,-2.35
2951,-2.22
2952,-2.17
2953,-2.19
2954,-2.30
2955,-2.43
2956,-2.56
2957,-2.63
2958,-2.70
2959,-2.75
2960,-2.81
2961,-2.84
2962,-2.89
2963,-2.98
2964,-3.15
2965,-3.36
2966,-3.63
2967,-3.93
2968,-4.29
2969,-4.68
2970,-5.10
2971,-5.51
2972,-5.95
2973,-6.38
2974,-6.80
2975,-7.17
2976,-7.54
2977,-7.84
2978,-8.11
2979,-8.32
2980,-8.53
2981,-8.73
2982,-8.98
2983,-9.27
2984,-9.67
2985,-10.15
2986,-10.76
2987,-11.38
2988,-12.03
2989,-12.63
2990,-13.17
2991,-13.53
2992,-13.73
2993,-13.76
2994,-13.73
2995,-13.68
2996,-13.61
2997,-13.53
2998,-13.51
2999,-13.57
3000,-13.66
3001,-13.70
3002,-13.69
3003,-13.63
3004,-13.52
3005,-13.38
3006,-13.20
3007,-13.00
3008,-12.80
3009,-12.67
3010,-12.60
3011,-12.60
3012,-12.64
3013,-12.71
3014,-12.78
3015,-12.85
3016,-12.85
3017,-12.78
3018,-12.63
3019,-12.45
3020,-12.25
3021,-12.08
3022,-11.95
3023,-11.89
3024,-11.85
3025,-11.79
3026,-11.63
3027,-11.38
3028,-10.99
3029,-10.48
3030,-9.85
3031,-9.18
3032,-8.45
3033,-7.75
3034,-7.03
3035,-6.35
3036,-5.66
3037,-5.04
3038,-4.44
3039,-3.94
3040,-3.48
3041,-3.08
3042,-2.62
3043,-2.14
3044,-1.51
3045,-0.83
3046,-0.05
3047,0.74
3048,1.53
3049,2.22
3050,2.82
3051,3.26
3052,3.62
3053,3.92
3054,4.25
3055,4.55
3056,4.86
3057,5.09
3058,5.29
3059,5.39
3060,5.45
3061,5.46
3062,5.50
3063,5.59
3064,5.75
3065,5.97
3066,6.26
3067,6.54
3068,6.75
3069,6.84
3070,6.79
3071,6.65
3072,6.43
3073,6.20
3074,5.97
3075,5.80
3076,5.63
3077,5.48
3078,5.32
3079,5.17
3080,4.99
3081,4.80
3082,4.55
3083,4.28
3084,3.96
3085,3.60
3086,3.20
3087,2.77
3088,2.30
3089,1.86
3090,1.47
3091,1.20
3092,1.03
3093,0.98
3094,1.00
3095,1.08
3096,1.14
3097,1.21
3098,1.23
3099,1.23
3100,1.20
3101,1.17
3102,1.11
3103,1.04
3104,0.92
3105,0.79
3106,0.63
3107,0.47
3108,0.29
3109,0.11
3110,-0.02
3111,-0.09
3112,-0.18
3113,-0.31
3114,-0.53
3115,-0.80
3116,-1.14
3117,-1.47
3118,-1.79
3119,-2.05
3120,-2.23
3121,-2.32
3122,-2.37
3123,-2.39
3124,-2.40
3125,-2.39
3126,-2.40
3127,-2.42
3128,-2.42
3129,-2.40
3130,-2.38
3131,-2.38
3132,-2.40
3133,-2.44
3134,-2.50
3135,-2.59
3136,-2.67
3137,-2.72
3138,-2.66
3139,-2.51
3140,-2.27
3141,-1.98
3142,-1.69
3143,-1.43
3144,-1.22
3145,-1.08
3146,-1.01
3147,-0.98
3148,-0.95
3149,-0.88
3150,-0.79
3151,-0.70
3152,-0.69
3153,-0.76
3154,-0.92
3155,-1.21
3156,-1.64
3157,-2.17
3158,-2.74
3159,-3.25
3160,-3.66
3161,-3.95
3162,-4.10
3163,-4.10
3164,-3.99
3165,-3.78
3166,-3.52
3167,-3.28
3168,-3.11
3169,-3.02
3170,-3.04
3171,-3.14
3172,-3.33
3173,-3.54
3174,-3.76
3175,-3.95
3176,-4.07
3177,-4.14
3178,-4.12
3179,-4.06
3180,-3.99
3181,-3.94
3182,-3.93
3183,-3.91
3184,-3.86
3185,-3.75
3186,-3.56
3187,-3.35
3188,-3.10
3189,-2.85
3190,-2.66
3191,-2.57
3192,-2.62
3193,-2.82
3194,-3.07
3195,-3.32
3196,-3.48
3197,-3.51
3198,-3.38
3199,-3.14
3200,-2.82
3201,-2.52
3202,-2.27
3203,-2.14
3204,-2.12
3205,-2.19
3206,-2.27
3207,-2.30
3208,-2.23
3209,-2.03
3210,-1.68
3211,-1.20
3212,-0.64
3213,-0.16
3214,0.18
3215,0.34
3216,0.36
3217,0.27
3218,0.18
3219,0.11
3220,0.15
3221,0.30
3222,0.57
3223,0.92
3224,1.30
3225,1.66
3226,1.93
3227,2.09
3228,2.17
3229,2.20
3230,2.22
3231,2.20
3232,2.14
3233,2.08
3234,2.06
3235,2.08
3236,2.11
3237,2.15
3238,2.21
3239,2.27
3240,2.29
3241,2.24
3242,2.10
3243,1.90
3244,1.63
3245,1.38
3246,1.18
3247,1.08
3248,1.05
3249,1.07
3250,1.06
3251,1.01
3252,0.85
3253,0.53
3254,0.05
3255,-0.50
3256,-1.09
3257,-1.58
3258,-1.98
3259,-2.26
3260,-2.52
3261,-2.75
3262,-3.07
3263,-3.45
3264,-3.98
3265,-4.61
3266,-5.33
3267,-6.02
3268,-6.66
3269,-7.16
3270,-7.61
3271,-7.94
3272,-8.25
3273,-8.53
3274,-8.90
3275,-9.33
3276,-9.81
3277,-10.25
3278,-10.64
3279,-10.90
3280,-11.07
3281,-11.12
3282,-11.11
3283,-11.03
3284,-10.94
3285,-10.86
3286,-10.86
3287,-10.93
3288,-11.05
3289,-11.18
3290,-11.31
3291,-11.42
3292,-11.51
3293,-11.52
3294,-11.49
3295,-11.41
3296,-11.29
3297,-11.12
3298,-10.95
3299,-10.80
3300,-10.73
3301,-10.73
3302,-10.80
3303,-10.89
3304,-11.03
3305,-11.24
3306,-11.49
3307,-11.75
3308,-11.97
3309,-12.14
3310,-12.24
3311,-12.26
3312,-12.17
3313,-11.99
3314,-11.76
3315,-11.52
3316,-11.30
3317,-11.13
3318,-10.98
3319,-10.86
3320,-10.75
3321,-10.64
3322,-10.48
3323,-10.29
3324,-10.01
3325,-9.66
3326,-9.23
3327,-8.77
3328,-8.29
3329,-7.82
3330,-7.35
3331,-6.96
3332,-6.64
3333,-6.42
3334,-6.30
3335,-6.26
3336,-6.28
3337,-6.32
3338,-6.36
3339,-6.38
3340,-6.39
3341,-6.43
3342,-6.53
3343,-6.68
3344,-6.89
3345,-7.17
3346,-7.55
3347,-7.97
3348,-8.35
3349,-8.64
3350,-8.81
3351,-8.90
3352,-8.94
3353,-8.92
3354,-8.86
3355,-8.80
3356,-8.78
3357,-8.81
3358,-8.90
3359,-8.97
3360,-9.06
3361,-9.17
3362,-9.34
3363,-9.57
3364,-9.90
3365,-10.30
3366,-10.73
3367,-11.14
3368,-11.46
3369,-11.65
3370,-11.74
3371,-11.73
3372,-11.69
3373,-11.66
3374,-11.72
3375,-11.89
3376,-12.20
3377,-12.60
3378,-13.06
3379,-13.50
3380,-13.86
3381,-14.11
3382,-14.22
3383,-14.24
3384,-14.18
3385,-14.10
3386,-14.03
3387,-13.99
3388,-13.97
3389,-13.98
3390,-13.99
3391,-13.99
3392,-13.94
3393,-13.81
3394,-13.58
3395,-13.26
3396,-12.84
3397,-12.36
3398,-11.85
3399,-11.37
3400,-10.96
3401,-10.64
3402,-10.41
3403,-10.30
3404,-10.29
3405,-10.35
3406,-10.42
3407,-10.49
3408,-10.56
3409,-10.66
3410,-10.76
3411,-10.84
3412,-10.91
3413,-10.97
3414,-11.02
3415,-11.05
3416,-11.09
3417,-11.13
3418,-11.17
3419,-11.19
3420,-11.21
3421,-11.22
3422,-11.25
3423,-11.31
3424,-11.41
3425,-11.54
3426,-11.66
3427,-11.76
3428,-11.82
3429,-11.83
3430,-11.74
3431,-11.55
3432,-11.21
3433,-10.73
3434,-10.14
3435,-9.50
3436,-8.85
3437,-8.27
3438,-7.80
3439,-7.51
3440,-7.37
3441,-7.32
3442,-7.26
3443,-7.19
3444,-7.09
3445,-6.97
3446,-6.82
3447,-6.68
3448,-6.61
3449,-6.66
3450,-6.84
3451,-7.11
3452,-7.42
3453,-7.72
3454,-7.99
3455,-8.18
3456,-8.32
3457,-8.40
3458,-8.51
3459,-8.66
3460,-8.91
3461,-9.22
3462,-9.60
3463,-10.01
3464,-10.50
3465,-11.01
3466,-11.53
3467,-12.00
3468,-12.47
3469,-12.92
3470,-13.35
3471,-13.71
3472,-13.97
3473,-14.08
3474,-14.08
3475,-13.93
3476,-13.69
3477,-13.38
3478,-13.08
3479,-12.86
3480,-12.73
3481,-12.72
3482,-12.81
3483,-12.98
3484,-13.14
3485,-13.27
3486,-13.31
3487,-13.24
3488,-13.02
3489,-12.61
3490,-12.02
3491,-11.34
3492,-10.67
3493,-10.10
3494,-9.70
3495,-9.49
3496,-9.45
3497,-9.61
3498,-9.86
3499,-10.18
3500,-10.44
3501,-10.61
3502,-10.64
3503,-10.51
3504,-10.19
3505,-9.77
3506,-9.30
3507,-8.90
3508,-8.58
3509,-8.35
3510,-8.18
3511,-8.06
3512,-7.98
3513,-7.91
3514,-7.79
3515,-7.61
3516,-7.30
3517,-6.92
3518,-6.48
3519,-6.07
3520,-5.71
3521,-5.45
3522,-5.27
3523,-5.20
3524,-5.23
3525,-5.34
3526,-5.45
3527,-5.53
3528,-5.57
3529,-5.56
3530,-5.53
3531,-5.49
3532,-5.49
3533,-5.54
3534,-5.68
3535,-5.87
3536,-6.13
3537,-6.39
3538,-6.70
3539,-7.02
3540,-7.37
3541,-7.74
3542,-8.13
3543,-8.49
3544,-8.82
3545,-9.06
3546,-9.25
3547,-9.38
3548,-9.52
3549,-9.64
3550,-9.80
3551,-9.99
3552,-10.29
3553,-10.66
3554,-11.09
3555,-11.46
3556,-11.80
3557,-12.03
3558,-12.24
3559,-12.41
3560,-12.62
3561,-12.84
3562,-13.12
3563,-13.44
3564,-13.83
3565,-14.24
3566,-14.63
3567,-14.97
3568,-15.31
3569,-15.62
3570,-15.88
3571,-16.08
3572,-16.27
3573,-16.43
3574,-16.57
3575,-16.61
3576,-16.57
3577,-16.48
3578,-16.39
3579,-16.31
3580,-16.26
3581,-16.21
3582,-16.18
3583,-16.16
3584,-16.15
3585,-16.13
3586,-16.10
3587,-16.08
3588,-16.10
3589,-16.17
3590,-16.30
3591,-16.51
3592,-16.77
3593,-17.05
3594,-17.31
3595,-17.50
3596,-17.58
3597,-17.56
3598,-17.45
3599,-17.29
3600,-17.11
3601,-16.93
3602,-16.74
3603,-16.53
3604,-16.25
3605,-15.88
3606,-15.37
3607,-14.79
3608,-14.11
3609,-13.44
3610,-12.76
3611,-12.12
3612,-11.48
3613,-10.94
3614,-10.44
3615,-10.02
3616,-9.58
3617,-9.17
3618,-8.68
3619,-8.19
3620,-7.61
3621,-7.08
3622,-6.52
3623,-6.00
3624,-5.43
3625,-4.91
3626,-4.42
3627,-3.98
3628,-3.54
3629,-3.09
3630,-2.65
3631,-2.27
3632,-1.93
3633,-1.66
3634,-1.46
3635,-1.42
3636,-1.56
3637,-1.90
3638,-2.43
3639,-3.07
3640,-3.77
3641,-4.45
3642,-5.07
3643,-5.58
3644,-6.00
3645,-6.33
3646,-6.62
3647,-6.90
3648,-7.28
3649,-7.72
3650,-8.26
3651,-8.80
3652,-9.32
3653,-9.73
3654,-10.00
3655,-10.12
3656,-10.14
3657,-10.08
3658,-10.03
3659,-10.06
3660,-10.25
3661,-10.61
3662,-11.10
3663,-11.60
3664,-12.05
3665,-12.41
3666,-12.66
3667,-12.73
3668,-12.63
3669,-12.38
3670,-12.09
3671,-11.80
3672,-11.54
3673,-11.34
3674,-11.25
3675,-11.27
3676,-11.38
3677,-11.51
3678,-11.58
3679,-11.57
3680,-11.44
3681,-11.23
3682,-10.93
3683,-10.60
3684,-10.21
3685,-9.86
3686,-9.56
3687,-9.35
3688,-9.16
3689,-8.96
3690,-8.66
3691,-8.29
3692,-7.80
3693,-7.26
3694,-6.65
3695,-6.07
3696,-5.55
3697,-5.19
3698,-4.94
3699,-4.79
3700,-4.67
3701,-4.56
3702,-4.41
3703,-4.24
3704,-4.04
3705,-3.85
3706,-3.65
3707,-3.47
3708,-3.29
3709,-3.11
3710,-2.87
3711,-2.56
3712,-2.11
3713,-1.59
3714,-1.08
3715,-0.63
3716,-0.25
3717,0.02
3718,0.15
3719,0.12
3720,0.02
3721,-0.11
3722,-0.24
3723,-0.36
3724,-0.44
3725,-0.49
3726,-0.47
3727,-0.39
3728,-0.24
3729,-0.02
3730,0.25
3731,0.56
3732,0.87
3733,1.11
3734,1.23
3735,1.25
3736,1.21
3737,1.12
3738,0.98
3739,0.85
3740,0.78
3741,0.80
3742,0.85
3743,0.82
3744,0.66
3745,0.40
3746,0.05
3747,-0.36
3748,-0.86
3749,-1.37
3750,-1.85
3751,-2.20
3752,-2.48
3753,-2.68
3754,-2.87
3755,-3.05
3756,-3.33
3757,-3.69
3758,-4.20
3759,-4.75
3760,-5.34
3761,-5.87
3762,-6.34
3763,-6.68
3764,-6.89
3765,-6.97
3766,-7.00
3767,-6.98
3768,-7.00
3769,-7.03
3770,-7.10
3771,-7.18
3772,-7.28
3773,-7.37
3774,-7.47
3775,-7.57
3776,-7.71
3777,-7.85
3778,-8.00
3779,-8.12
3780,-8.24
3781,-8.37
3782,-8.54
3783,-8.71
3784,-8.93
3785,-9.18
3786,-9.48
3787,-9.80
3788,-10.13
3789,-10.41
3790,-10.60
3791,-10.72
3792,-10.80
3793,-10.85
3794,-10.91
3795,-11.00
3796,-11.18
3797,-11.41
3798,-11.68
3799,-11.89
3800,-11.99
3801,-11.99
3802,-11.91
3803,-11.79
3804,-11.63
3805,-11.49
3806,-11.41
3807,-11.37
3808,-11.34
3809,-11.27
3810,-11.10
3811,-10.84
3812,-10.51
3813,-10.16
3814,-9.87
3815,-9.72
3816,-9.68
3817,-9.77
3818,-9.93
3819,-10.12
3820,-10.28
3821,-10.39
3822,-10.39
3823,-10.30
3824,-10.10
3825,-9.88
3826,-9.66
3827,-9.49
3828,-9.35
3829,-9.22
3830,-9.04
3831,-8.83
3832,-8.56
3833,-8.29
3834,-8.00
3835,-7.74
3836,-7.52
3837,-7.35
3838,-7.19
3839,-7.06
3840,-6.92
3841,-6.74
3842,-6.50
3843,-6.20
3844,-5.87
3845,-5.55
3846,-5.28
3847,-5.08
3848,-4.94
3849,-4.84
3850,-4.78
3851,-4.74
3852,-4.71
3853,-4.71
3854,-4.75
3855,-4.87
3856,-5.09
3857,-5.40
3858,-5.81
3859,-6.29
3860,-6.84
3861,-7.42
3862,-7.98
3863,-8.48
3864,-8.91
3865,-9.24
3866,-9.48
3867,-9.62
3868,-9.70
3869,-9.71
3870,-9.67
3871,-9.57
3872,-9.44
3873,-9.27
3874,-9.08
3875,-8.87
3876,-8.62
3877,-8.38
3878,-8.15
3879,-7.94
3880,-7.72
3881,-7.54
3882,-7.32
3883,-7.13
3884,-6.85
3885,-6.48
3886,-5.96
3887,-5.33
3888,-4.62
3889,-3.92
3890,-3.25
3891,-2.68
3892,-2.20
3893,-1.88
3894,-1.65
3895,-1.53
3896,-1.42
3897,-1.33
3898,-1.21
3899,-1.07
3900,-0.93
3901,-0.85
3902,-0.84
3903,-0.90
3904,-1.03
3905,-1.21
3906,-1.43
3907,-1.69
3908,-1.98
3909,-2.29
3910,-2.56
3911,-2.78
3912,-2.94
3913,-3.03
3914,-3.10
3915,-3.14
3916,-3.16
3917,-3.17
3918,-3.20
3919,-3.27
3920,-3.36
3921,-3.45
3922,-3.53
3923,-3.57
3924,-3.59
3925,-3.59
3926,-3.63
3927,-3.72
3928,-3.91
3929,-4.19
3930,-4.55
3931,-4.94
3932,-5.38
3933,-5.79
3934,-6.20
3935,-6.57
3936,-6.94
3937,-7.28
3938,-7.65
3939,-8.00
3940,-8.34
3941,-8.61
3942,-8.84
3943,-8.99
3944,-9.11
3945,-9.22
3946,-9.38
3947,-9.59
3948,-9.86
3949,-10.13
3950,-10.44
3951,-10.76
3952,-11.06
3953,-11.29
3954,-11.48
3955,-11.63
3956,-11.80
3957,-11.96
3958,-12.17
3959,-12.38
3960,-12.63
3961,-12.87
3962,-13.08
3963,-13.25
3964,-13.45
3965,-13.66
3966,-13.88
3967,-14.05
3968,-14.23
3969,-14.40
3970,-14.56
3971,-14.66
3972,-14.69
3973,-14.71
3974,-14.77
3975,-14.89
3976,-15.04
3977,-15.18
3978,-15.33
3979,-15.47
3980,-15.55
3981,-15.52
3982,-15.36
3983,-15.12
3984,-14.82
3985,-14.50
3986,-14.18
3987,-13.92
3988,-13.66
3989,-13.44
3990,-13.15
3991,-12.84
3992,-12.40
3993,-11.88
3994,-11.22
3995,-10.48
3996,-9.63
3997,-8.80
3998,-7.98
3999,-7.28
4000,-6.65
4001,-6.16
4002,-5.71
4003,-5.33
4004,-4.92
4005,-4.52
4006,-4.04
4007,-3.53
4008,-2.97
4009,-2.43
4010,-1.97
4011,-1.63
4012,-1.40
4013,-1.32
4014,-1.33
4015,-1.41
4016,-1.52
4017,-1.64
4018,-1.79
4019,-1.97
4020,-2.16
4021,-2.33
4022,-2.53
4023,-2.69
4024,-2.87
4025,-3.01
4026,-3.19
4027,-3.38
4028,-3.64
4029,-3.92
4030,-4.27
4031,-4.68
4032,-5.18
4033,-5.69
4034,-6.20
4035,-6.63
4036,-7.03
4037,-7.37
4038,-7.71
4039,-8.01
4040,-8.37
4041,-8.74
4042,-9.15
4043,-9.51
4044,-9.85
4045,-10.12
4046,-10.37
4047,-10.60
4048,-10.85
4049,-11.10
4050,-11.38
4051,-11.66
4052,-11.94
4053,-12.19
4054,-12.42
4055,-12.58
4056,-12.66
4057,-12.62
4058,-12.46
4059,-12.19
4060,-11.86
4061,-11.48
4062,-11.09
4063,-10.73
4064,-10.42
4065,-10.22
4066,-10.14
4067,-10.16
4068,-10.25
4069,-10.36
4070,-10.44
4071,-10.47
4072,-10.41
4073,-10.29
4074,-10.11
4075,-9.91
4076,-9.71
4077,-9.56
4078,-9.45
4079,-9.39
4080,-9.37
4081,-9.38
4082,-9.38
4083,-9.36
4084,-9.29
4085,-9.19
4086,-9.01
4087,-8.79
4088,-8.53
4089,-8.27
4090,-8.03
4091,-7.84
4092,-7.67
4093,-7.52
4094,-7.41
4095,-7.34
4096,-7.29
4097,-7.23
4098,-7.12
4099,-6.98
4100,-6.86
4101,-6.79
4102,-6.77
4103,-6.80
4104,-6.89
4105,-7.04
4106,-7.23
4107,-7.37
4108,-7.47
4109,-7.53
4110,-7.62
4111,-7.75
4112,-7.99
4113,-8.27
4114,-8.64
4115,-9.05
4116,-9.54
4117,-10.05
4118,-10.58
4119,-11.07
4120,-11.57
4121,-12.08
4122,-12.63
4123,-13.20
4124,-13.79
4125,-14.34
4126,-14.87
4127,-15.27
4128,-15.59
4129,-15.78
4130,-15.90
4131,-15.92
4132,-15.91
4133,-15.85
4134,-15.85
4135,-15.90
4136,-16.04
4137,-16.20
4138,-16.33
4139,-16.46
4140,-16.59
4141,-16.70
4142,-16.78
4143,-16.80
4144,-16.80
4145,-16.78
4146,-16.75
4147,-16.70
4148,-16.65
4149,-16.65
4150,-16.69
4151,-16.80
4152,-16.96
4153,-17.16
4154,-17.36
4155,-17.52
4156,-17.62
4157,-17.62
4158,-17.52
4159,-17.36
4160,-17.18
4161,-17.06
4162,-17.03
4163,-17.10
4164,-17.21
4165,-17.36
4166,-17.50
4167,-17.59
4168,-17.55
4169,-17.40
4170,-17.14
4171,-16.82
4172,-16.43
4173,-16.04
4174,-15.66
4175,-15.37
4176,-15.12
4177,-14.89
4178,-14.63
4179,-14.34
4180,-14.00
4181,-13.66
4182,-13.31
4183,-13.02
4184,-12.80
4185,-12.71
4186,-12.72
4187,-12.81
4188,-12.93
4189,-13.04
4190,-13.07
4191,-13.03
4192,-12.93
4193,-12.79
4194,-12.61
4195,-12.41
4196,-12.21
4197,-12.03
4198,-11.88
4199,-11.76
4200,-11.68
4201,-11.66
4202,-11.69
4203,-11.78
4204,-11.89
4205,-12.02
4206,-12.10
4207,-12.13
4208,-12.08
4209,-11.93
4210,-11.70
4211,-11.44
4212,-11.22
4213,-11.05
4214,-10.93
4215,-10.87
4216,-10.91
4217,-11.03
4218,-11.17
4219,-11.28
4220,-11.36
4221,-11.42
4222,-11.52
4223,-11.66
4224,-11.87
4225,-12.15
4226,-12.47
4227,-12.79
4228,-13.07
4229,-13.28
4230,-13.39
4231,-13.36
4232,-13.20
4233,-12.96
4234,-12.72
4235,-12.54
4236,-12.40
4237,-12.31
4238,-12.24
4239,-12.17
4240,-12.04
4241,-11.86
4242,-11.63
4243,-11.38
4244,-11.09
4245,-10.82
4246,-10.55
4247,-10.31
4248,-10.09
4249,-9.90
4250,-9.71
4251,-9.54
4252,-9.35
4253,-9.19
4254,-9.06
4255,-8.97
4256,-8.88
4257,-8.78
4258,-8.67
4259,-8.60
4260,-8.57
4261,-8.63
4262,-8.78
4263,-9.00
4264,-9.26
4265,-9.57
4266,-9.90
4267,-10.22
4268,-10.49
4269,-10.63
4270,-10.62
4271,-10.48
4272,-10.25
4273,-9.98
4274,-9.74
4275,-9.57
4276,-9.51
4277,-9.54
4278,-9.60
4279,-9.65
4280,-9.64
4281,-9.55
4282,-9.32
4283,-9.00
4284,-8.54
4285,-8.03
4286,-7.47
4287,-6.96
4288,-6.48
4289,-6.06
4290,-5.61
4291,-5.16
4292,-4.70
4293,-4.29
4294,-3.89
4295,-3.56
4296,-3.29
4297,-3.14
4298,-3.06
4299,-3.04
4300,-2.99
4301,-2.92
4302,-2.78
4303,-2.61
4304,-2.40
4305,-2.17
4306,-1.97
4307,-1.81
4308,-1.70
4309,-1.64
4310,-1.62
4311,-1.58
4312,-1.50
4313,-1.38
4314,-1.25
4315,-1.14
4316,-1.09
4317,-1.11
4318,-1.23
4319,-1.40
4320,-1.63
4321,-1.84
4322,-2.07
4323,-2.30
4324,-2.56
4325,-2.83
4326,-3.14
4327,-3.42
4328,-3.73
4329,-4.04
4330,-4.38
4331,-4.71
4332,-5.05
4333,-5.38
4334,-5.76
4335,-6.20
4336,-6.77
4337,-7.38
4338,-8.03
4339,-8.62
4340,-9.13
4341,-9.49
4342,-9.71
4343,-9.77
4344,-9.74
4345,-9.64
4346,-9.61
4347,-9.68
4348,-9.88
4349,-10.17
4350,-10.49
4351,-10.77
4352,-10.96
4353,-10.99
4354,-10.81
4355,-10.45
4356,-9.95
4357,-9.41
4358,-8.87
4359,-8.44
4360,-8.12
4361,-7.93
4362,-7.81
4363,-7.74
4364,-7.65
4365,-7.55
4366,-7.36
4367,-7.13
4368,-6.82
4369,-6.52
4370,-6.26
4371,-6.09
4372,-6.00
4373,-5.97
4374,-6.03
4375,-6.15
4376,-6.32
4377,-6.51
4378,-6.68
4379,-6.81
4380,-6.92
4381,-7.02
4382,-7.13
4383,-7.25
4384,-7.35
4385,-7.47
4386,-7.65
4387,-7.87
4388,-8.08
4389,-8.26
4390,-8.43
4391,-8.56
4392,-8.64
4393,-8.61
4394,-8.54
4395,-8.42
4396,-8.33
4397,-8.26
4398,-8.27
4399,-8.35
4400,-8.49
4401,-8.64
4402,-8.80
4403,-8.96
4404,-9.16
4405,-9.36
4406,-9.61
4407,-9.90
4408,-10.30
4409,-10.81
4410,-11.44
4411,-12.12
4412,-12.80
4413,-13.37
4414,-13.82
4415,-14.08
4416,-14.25
4417,-14.34
4418,-14.49
4419,-14.66
4420,-14.97
4421,-15.37
4422,-15.93
4423,-16.56
4424,-17.27
4425,-17.93
4426,-18.57
4427,-19.12
4428,-19.61
4429,-19.97
4430,-20.26
4431,-20.47
4432,-20.66
4433,-20.85
4434,-21.09
4435,-21.32
4436,-21.56
4437,-21.76
4438,-21.90
4439,-21.96
4440,-21.93
4441,-21.80
4442,-21.54
4443,-21.22
4444,-20.87
4445,-20.55
4446,-20.26
4447,-19.97
4448,-19.63
4449,-19.24
4450,-18.78
4451,-18.26
4452,-17.68
4453,-17.09
4454,-16.50
4455,-16.00
4456,-15.53
4457,-15.13
4458,-14.72
4459,-14.37
4460,-13.98
4461,-13.62
4462,-13.21
4463,-12.84
4464,-12.52
4465,-12.31
4466,-12.15
4467,-12.03
4468,-11.88
4469,-11.70
4470,-11.38
4471,-10.96
4472,-10.37
4473,-9.70
4474,-8.94
4475,-8.21
4476,-7.53
4477,-6.98
4478,-6.55
4479,-6.30
4480,-6.20
4481,-6.22
4482,-6.33
4483,-6.50
4484,-6.66
4485,-6.81
4486,-6.91
4487,-6.99
4488,-7.05
4489,-7.09
4490,-7.12
4491,-7.16
4492,-7.23
4493,-7.35
4494,-7.50
4495,-7.68
4496,-7.90
4497,-8.14
4498,-8.37
4499,-8.57
4500,-8.75
4501,-8.90
4502,-9.02
4503,-9.06
4504,-9.03
4505,-8.93
4506,-8.77
4507,-8.58
4508,-8.42
4509,-8.33
4510,-8.36
4511,-8.51
4512,-8.83
4513,-9.20
4514,-9.60
4515,-9.95
4516,-10.28
4517,-10.57
4518,-10.83
4519,-11.07
4520,-11.34
4521,-11.67
4522,-12.08
4523,-12.51
4524,-12.99
4525,-13.44
4526,-13.87
4527,-14.24
4528,-14.58
4529,-14.89
4530,-15.21
4531,-15.50
4532,-15.79
4533,-16.04
4534,-16.27
4535,-16.42
4536,-16.51
4537,-16.55
4538,-16.59
4539,-16.62
4540,-16.63
4541,-16.65
4542,-16.64
4543,-16.60
4544,-16.47
4545,-16.24
4546,-15.92
4547,-15.56
4548,-15.15
4549,-14.73
4550,-14.35
4551,-14.06
4552,-13.82
4553,-13.64
4554,-13.42
4555,-13.18
4556,-12.85
4557,-12.48
4558,-12.05
4559,-11.60
4560,-11.11
4561,-10.65
4562,-10.17
4563,-9.72
4564,-9.25
4565,-8.79
4566,-8.30
4567,-7.84
4568,-7.32
4569,-6.81
4570,-6.31
4571,-5.88
4572,-5.50
4573,-5.19
4574,-4.91
4575,-4.70
4576,-4.54
4577,-4.40
4578,-4.22
4579,-4.01
4580,-3.80
4581,-3.60
4582,-3.37
4583,-3.16
4584,-3.00
4585,-2.94
4586,-2.94
4587,-2.99
4588,-3.06
4589,-3.16
4590,-3.28
4591,-3.39
4592,-3.52
4593,-3.69
4594,-3.97
4595,-4.34
4596,-4.80
4597,-5.27
4598,-5.78
4599,-6.27
4600,-6.75
4601,-7.16
4602,-7.54
4603,-7.87
4604,-8.26
4605,-8.69
4606,-9.21
4607,-9.74
4608,-10.28
4609,-10.75
4610,-11.15
4611,-11.46
4612,-11.73
4613,-11.93
4614,-12.14
4615,-12.31
4616,-12.48
4617,-12.65
4618,-12.86
4619,-13.06
4620,-13.28
4621,-13.50
4622,-13.76
4623,-14.08
4624,-14.45
4625,-14.84
4626,-15.27
4627,-15.69
4628,-16.13
4629,-16.49
4630,-16.75
4631,-16.86
4632,-16.85
4633,-16.75
4634,-16.61
4635,-16.44
4636,-16.29
4637,-16.17
4638,-16.09
4639,-16.00
4640,-15.82
4641,-15.56
4642,-15.17
4643,-14.72
4644,-14.15
4645,-13.55
4646,-12.93
4647,-12.41
4648,-11.92
4649,-11.50
4650,-11.07
4651,-10.64
4652,-10.15
4653,-9.61
4654,-8.96
4655,-8.32
4656,-7.66
4657,-7.12
4658,-6.66
4659,-6.29
4660,-5.94
4661,-5.62
4662,-5.27
4663,-4.94
4664,-4.59
4665,-4.25
4666,-3.95
4667,-3.78
4668,-3.72
4669,-3.75
4670,-3.81
4671,-3.88
4672,-3.88
4673,-3.81
4674,-3.64
4675,-3.40
4676,-3.11
4677,-2.87
4678,-2.75
4679,-2.78
4680,-2.97
4681,-3.27
4682,-3.66
4683,-4.10
4684,-4.56
4685,-4.97
4686,-5.34
4687,-5.63
4688,-5.88
4689,-6.07
4690,-6.24
4691,-6.35
4692,-6.45
4693,-6.54
4694,-6.67
4695,-6.81
4696,-7.00
4697,-7.19
4698,-7.44
4699,-7.68
4700,-7.96
4701,-8.21
4702,-8.46
4703,-8.69
4704,-8.94
4705,-9.19
4706,-9.48
4707,-9.79
4708,-10.15
4709,-10.52
4710,-10.91
4711,-11.26
4712,-11.60
4713,-11.89
4714,-12.19
4715,-12.50
4716,-12.83
4717,-13.15
4718,-13.46
4719,-13.71
4720,-13.89
4721,-13.97
4722,-13.99
4723,-13.96
4724,-13.90
4725,-13.82
4726,-13.76
4727,-13.76
4728,-13.82
4729,-13.92
4730,-14.04
4731,-14.11
4732,-14.11
4733,-14.00
4734,-13.76
4735,-13.44
4736,-13.05
4737,-12.67
4738,-12.35
4739,-12.14
4740,-12.01
4741,-11.98
4742,-12.02
4743,-12.13
4744,-12.25
4745,-12.33
4746,-12.34
4747,-12.34
4748,-12.35
4749,-12.40
4750,-12.45
4751,-12.52
4752,-12.60
4753,-12.68
4754,-12.72
4755,-12.66
4756,-12.50
4757,-12.28
4758,-12.02
4759,-11.74
4760,-11.45
4761,-11.19
4762,-10.98
4763,-10.83
4764,-10.69
4765,-10.49
4766,-10.20
4767,-9.86
4768,-9.52
4769,-9.23
4770,-9.02
4771,-8.90
4772,-8.90
4773,-9.02
4774,-9.23
4775,-9.49
4776,-9.80
4777,-10.13
4778,-10.49
4779,-10.84
4780,-11.24
4781,-11.64
4782,-12.08
4783,-12.50
4784,-12.91
4785,-13.28
4786,-13.63
4787,-13.96
4788,-14.31
4789,-14.64
4790,-14.98
4791,-15.27
4792,-15.52
4793,-15.72
4794,-15.89
4795,-15.96
4796,-15.91
4797,-15.75
4798,-15.55
4799,-15.37
4800,-15.21
4801,-15.05
4802,-14.90
4803,-14.79
4804,-14.76
4805,-14.78
4806,-14.83
4807,-14.87
4808,-14.88
4809,-14.88
4810,-14.90
4811,-14.92
4812,-14.92
4813,-14.94
4814,-15.04
4815,-15.23
4816,-15.50
4817,-15.76
4818,-16.01
4819,-16.17
4820,-16.26
4821,-16.26
4822,-16.21
4823,-16.17
4824,-16.16
4825,-16.22
4826,-16.37
4827,-16.65
4828,-17.03
4829,-17.48
4830,-17.91
4831,-18.24
4832,-18.39
4833,-18.33
4834,-18.07
4835,-17.65
4836,-17.11
4837,-16.52
4838,-15.90
4839,-15.34
4840,-14.79
4841,-14.31
4842,-13.82
4843,-13.36
4844,-12.85
4845,-12.33
4846,-11.73
4847,-11.10
4848,-10.41
4849,-9.74
4850,-9.07
4851,-8.49
4852,-7.97
4853,-7.54
4854,-7.15
4855,-6.82
4856,-6.53
4857,-6.32
4858,-6.15
4859,-6.03
4860,-5.97
4861,-6.00
4862,-6.18
4863,-6.49
4864,-6.95
4865,-7.49
4866,-8.16
4867,-8.93
4868,-9.76
4869,-10.54
4870,-11.26
4871,-11.85
4872,-12.38
4873,-12.78
4874,-13.05
4875,-13.18
4876,-13.29
4877,-13.38
4878,-13.51
4879,-13.62
4880,-13.80
4881,-14.05
4882,-14.37
4883,-14.73
4884,-15.13
4885,-15.50
4886,-15.85
4887,-16.18
4888,-16.56
4889,-16.99
4890,-17.46
4891,-17.90
4892,-18.33
4893,-18.69
4894,-18.98
4895,-19.12
4896,-19.13
4897,-19.04
4898,-18.91
4899,-18.75
4900,-18.58
4901,-18.44
4902,-18.36
4903,-18.33
4904,-18.35
4905,-18.36
4906,-18.39
4907,-18.39
4908,-18.36
4909,-18.29
4910,-18.22
4911,-18.18
4912,-18.20
4913,-18.28
4914,-18.41
4915,-18.59
4916,-18.82
4917,-19.07
4918,-19.26
4919,-19.36
4920,-19.36
4921,-19.28
4922,-19.13
4923,-18.96
4924,-18.78
4925,-18.64
4926,-18.54
4927,-18.47
4928,-18.36
4929,-18.17
4930,-17.84
4931,-17.36
4932,-16.76
4933,-16.13
4934,-15.50
4935,-14.95
4936,-14.43
4937,-14.04
4938,-13.71
4939,-13.47
4940,-13.19
4941,-12.88
4942,-12.44
4943,-11.98
4944,-11.44
4945,-10.96
4946,-10.51
4947,-10.14
4948,-9.80
4949,-9.54
4950,-9.28
4951,-9.03
4952,-8.72
4953,-8.35
4954,-7.93
4955,-7.49
4956,-7.05
4957,-6.65
4958,-6.32
4959,-6.14
4960,-6.13
4961,-6.30
4962,-6.60
4963,-6.97
4964,-7.39
4965,-7.82
4966,-8.23
4967,-8.56
4968,-8.80
4969,-8.93
4970,-9.03
4971,-9.16
4972,-9.36
4973,-9.64
4974,-10.02
4975,-10.44
4976,-10.93
4977,-11.40
4978,-11.89
4979,-12.34
4980,-12.74
4981,-13.08
4982,-13.39
4983,-13.68
4984,-13.97
4985,-14.18
4986,-14.32
4987,-14.37
4988,-14.39
4989,-14.34
4990,-14.24
4991,-14.09
4992,-13.91
4993,-13.70
4994,-13.44
4995,-13.15
4996,-12.85
4997,-12.53
4998,-12.13
4999,-11.69
5000,-11.22
5001,-10.78
5002,-10.31
5003,-9.85
5004,-9.41
5005,-9.05
5006,-8.75
5007,-8.55
5008,-8.42
5009,-8.39
5010,-8.35
5011,-8.28
5012,-8.06
5013,-7.71
5014,-7.18
5015,-6.55
5016,-5.84
5017,-5.20
5018,-4.62
5019,-4.19
5020,-3.88
5021,-3.69
5022,-3.55
5023,-3.40
5024,-3.17
5025,-2.84
5026,-2.40
5027,-1.95
5028,-1.50
5029,-1.13
5030,-0.81
5031,-0.58
5032,-0.40
5033,-0.29
5034,-0.21
5035,-0.16
5036,-0.10
5037,-0.04
5038,0.02
5039,0.08
5040,0.16
5041,0.25
5042,0.36
5043,0.44
5044,0.49
5045,0.49
5046,0.44
5047,0.36
5048,0.26
5049,0.18
5050,0.14
5051,0.16
5052,0.21
5053,0.29
5054,0.34
5055,0.36
5056,0.33
5057,0.25
5058,0.12
5059,-0.01
5060,-0.16
5061,-0.33
5062,-0.58
5063,-0.90
5064,-1.34
5065,-1.85
5066,-2.46
5067,-3.07
5068,-3.65
5069,-4.12
5070,-4.53
5071,-4.83
5072,-5.07
5073,-5.23
5074,-5.43
5075,-5.71
5076,-6.16
5077,-6.71
5078,-7.36
5079,-8.01
5080,-8.66
5081,-9.22
5082,-9.74
5083,-10.12
5084,-10.42
5085,-10.64
5086,-10.88
5087,-11.11
5088,-11.36
5089,-11.59
5090,-11.85
5091,-12.10
5092,-12.35
5093,-12.54
5094,-12.71
5095,-12.86
5096,-13.05
5097,-13.23
5098,-13.45
5099,-13.69
5100,-13.98
5101,-14.27
5102,-14.53
5103,-14.73
5104,-14.90
5105,-15.03
5106,-15.11
5107,-15.09
5108,-15.00
5109,-14.85
5110,-14.67
5111,-14.47
5112,-14.29
5113,-14.17
5114,-14.12
5115,-14.15
5116,-14.20
5117,-14.25
5118,-14.24
5119,-14.17
5120,-13.99
5121,-13.74
5122,-13.41
5123,-13.08
5124,-12.73
5125,-12.41
5126,-12.05
5127,-11.68
5128,-11.25
5129,-10.81
5130,-10.30
5131,-9.80
5132,-9.26
5133,-8.80
5134,-8.38
5135,-8.06
5136,-7.74
5137,-7.44
5138,-7.10
5139,-6.74
5140,-6.35
5141,-5.94
5142,-5.51
5143,-5.13
5144,-4.81
5145,-4.61
5146,-4.48
5147,-4.43
5148,-4.40
5149,-4.39
5150,-4.35
5151,-4.31
5152,-4.27
5153,-4.27
5154,-4.34
5155,-4.48
5156,-4.68
5157,-4.92
5158,-5.17
5159,-5.39
5160,-5.57
5161,-5.68
5162,-5.77
5163,-5.84
5164,-5.94
5165,-6.03
5166,-6.13
5167,-6.23
5168,-6.34
5169,-6.43
5170,-6.52
5171,-6.55
5172,-6.57
5173,-6.55
5174,-6.55
5175,-6.54
5176,-6.58
5177,-6.67
5178,-6.84
5179,-7.04
5180,-7.36
5181,-7.76
5182,-8.29
5183,-8.90
5184,-9.64
5185,-10.41
5186,-11.25
5187,-12.04
5188,-12.79
5189,-13.40
5190,-13.87
5191,-14.17
5192,-14.41
5193,-14.59
5194,-14.80
5195,-15.00
5196,-15.27
5197,-15.55
5198,-15.89
5199,-16.23
5200,-16.56
5201,-16.83
5202,-17.06
5203,-17.23
5204,-17.40
5205,-17.52
5206,-17.63
5207,-17.69
5208,-17.71
5209,-17.68
5210,-17.64
5211,-17.58
5212,-17.52
5213,-17.49
5214,-17.46
5215,-17.44
5216,-17.40
5217,-17.36
5218,-17.33
5219,-17.31
5220,-17.31
5221,-17.33
5222,-17.38
5223,-17.46
5224,-17.56
5225,-17.67
5226,-17.75
5227,-17.77
5228,-17.69
5229,-17.49
5230,-17.18
5231,-16.80
5232,-16.39
5233,-15.99
5234,-15.62
5235,-15.33
5236,-15.11
5237,-15.00
5238,-14.95
5239,-14.96
5240,-14.98
5241,-14.99
5242,-14.92
5243,-14.80
5244,-14.58
5245,-14.31
5246,-13.95
5247,-13.56
5248,-13.15
5249,-12.79
5250,-12.47
5251,-12.18
5252,-11.86
5253,-11.51
5254,-11.12
5255,-10.67
5256,-10.18
5257,-9.70
5258,-9.32
5259,-9.12
5260,-9.07
5261,-9.15
5262,-9.28
5263,-9.46
5264,-9.58
5265,-9.63
5266,-9.57
5267,-9.45
5268,-9.30
5269,-9.19
5270,-9.16
5271,-9.21
5272,-9.30
5273,-9.42
5274,-9.55
5275,-9.65
5276,-9.70
5277,-9.68
5278,-9.62
5279,-9.55
5280,-9.52
5281,-9.54
5282,-9.61
5283,-9.73
5284,-9.90
5285,-10.12
5286,-10.38
5287,-10.61
5288,-10.81
5289,-10.94
5290,-11.05
5291,-11.12
5292,-11.19
5293,-11.28
5294,-11.47
5295,-11.76
5296,-12.24
5297,-12.83
5298,-13.56
5299,-14.31
5300,-15.06
5301,-15.72
5302,-16.28
5303,-16.71
5304,-17.01
5305,-17.23
5306,-17.43
5307,-17.61
5308,-17.81
5309,-17.97
5310,-18.09
5311,-18.13
5312,-18.06
5313,-17.87
5314,-17.54
5315,-17.14
5316,-16.67
5317,-16.20
5318,-15.73
5319,-15.30
5320,-14.88
5321,-14.50
5322,-14.09
5323,-13.69
5324,-13.24
5325,-12.76
5326,-12.24
5327,-11.73
5328,-11.24
5329,-10.83
5330,-10.46
5331,-10.17
5332,-9.94
5333,-9.80
5334,-9.74
5335,-9.71
5336,-9.73
5337,-9.81
5338,-9.97
5339,-10.22
5340,-10.51
5341,-10.81
5342,-11.11
5343,-11.36
5344,-11.56
5345,-11.70
5346,-11.82
5347,-11.91
5348,-11.99
5349,-12.04
5350,-12.11
5351,-12.20
5352,-12.33
5353,-12.47
5354,-12.63
5355,-12.78
5356,-12.94
5357,-13.10
5358,-13.27
5359,-13.42
5360,-13.57
5361,-13.71
5362,-13.84
5363,-13.96
5364,-14.06
5365,-14.14
5366,-14.21
5367,-14.31
5368,-14.46
5369,-14.66
5370,-14.88
5371,-15.11
5372,-15.30
5373,-15.46
5374,-15.55
5375,-15.58
5376,-15.56
5377,-15.49
5378,-15.39
5379,-15.28
5380,-15.22
5381,-15.21
5382,-15.19
5383,-15.11
5384,-14.95
5385,-14.71
5386,-14.43
5387,-14.16
5388,-13.96
5389,-13.89
5390,-13.92
5391,-14.10
5392,-14.35
5393,-14.64
5394,-14.86
5395,-14.98
5396,-14.91
5397,-14.69
5398,-14.34
5399,-13.92
5400,-13.47
5401,-13.06
5402,-12.69
5403,-12.40
5404,-12.15
5405,-11.97
5406,-11.78
5407,-11.60
5408,-11.32
5409,-11.00
5410,-10.59
5411,-10.09
5412,-9.48
5413,-8.83
5414,-8.19
5415,-7.70
5416,-7.33
5417,-7.15
5418,-7.10
5419,-7.20
5420,-7.33
5421,-7.44
5422,-7.38
5423,-7.16
5424,-6.78
5425,-6.32
5426,-5.75
5427,-5.20
5428,-4.70
5429,-4.33
5430,-4.06
5431,-3.90
5432,-3.75
5433,-3.58
5434,-3.32
5435,-2.97
5436,-2.50
5437,-1.97
5438,-1.37
5439,-0.75
5440,-0.14
5441,0.37
5442,0.77
5443,1.02
5444,1.17
5445,1.23
5446,1.20
5447,1.09
5448,0.96
5449,0.84
5450,0.74
5451,0.65
5452,0.52
5453,0.37
5454,0.18
5455,0.01
5456,-0.19
5457,-0.40
5458,-0.64
5459,-0.89
5460,-1.12
5461,-1.32
5462,-1.46
5463,-1.56
5464,-1.64
5465,-1.71
5466,-1.79
5467,-1.86
5468,-1.97
5469,-2.10
5470,-2.30
5471,-2.49
5472,-2.68
5473,-2.85
5474,-3.04
5475,-3.27
5476,-3.57
5477,-3.92
5478,-4.38
5479,-4.88
5480,-5.45
5481,-5.96
5482,-6.42
5483,-6.77
5484,-7.03
5485,-7.20
5486,-7.35
5487,-7.49
5488,-7.70
5489,-7.97
5490,-8.35
5491,-8.80
5492,-9.23
5493,-9.57
5494,-9.80
5495,-9.87
5496,-9.80
5497,-9.60
5498,-9.31
5499,-8.97
5500,-8.67
5501,-8.42
5502,-8.29
5503,-8.27
5504,-8.35
5505,-8.51
5506,-8.74
5507,-8.96
5508,-9.14
5509,-9.28
5510,-9.40
5511,-9.50
5512,-9.54
5513,-9.51
5514,-9.41
5515,-9.28
5516,-9.15
5517,-9.05
5518,-9.01
5519,-9.03
5520,-9.09
5521,-9.20
5522,-9.32
5523,-9.42
5524,-9.48
5525,-9.41
5526,-9.23
5527,-8.96
5528,-8.67
5529,-8.39
5530,-8.13
5531,-7.94
5532,-7.84
5533,-7.84
5534,-7.88
5535,-7.93
5536,-7.97
5537,-7.97
5538,-7.90
5539,-7.76
5540,-7.58
5541,-7.40
5542,-7.22
5543,-7.08
5544,-7.03
5545,-7.10
5546,-7.27
5547,-7.50
5548,-7.77
5549,-8.02
5550,-8.24
5551,-8.39
5552,-8.53
5553,-8.65
5554,-8.80
5555,-8.96
5556,-9.16
5557,-9.37
5558,-9.60
5559,-9.81
5560,-10.06
5561,-10.30
5562,-10.58
5563,-10.89
5564,-11.29
5565,-11.76
5566,-12.29
5567,-12.79
5568,-13.24
5569,-13.57
5570,-13.79
5571,-13.93
5572,-14.03
5573,-14.09
5574,-14.17
5575,-14.24
5576,-14.36
5577,-14.50
5578,-14.64
5579,-14.76
5580,-14.85
5581,-14.88
5582,-14.88
5583,-14.83
5584,-14.77
5585,-14.69
5586,-14.59
5587,-14.44
5588,-14.28
5589,-14.14
5590,-14.05
5591,-14.03
5592,-14.07
5593,-14.18
5594,-14.34
5595,-14.52
5596,-14.67
5597,-14.76
5598,-14.74
5599,-14.65
5600,-14.49
5601,-14.29
5602,-14.05
5603,-13.82
5604,-13.61
5605,-13.46
5606,-13.30
5607,-13.14
5608,-12.92
5609,-12.67
5610,-12.31
5611,-11.88
5612,-11.31
5613,-10.66
5614,-9.87
5615,-9.03
5616,-8.13
5617,-7.29
5618,-6.47
5619,-5.74
5620,-5.10
5621,-4.59
5622,-4.17
5623,-3.89
5624,-3.68
5625,-3.57
5626,-3.42
5627,-3.23
5628,-2.96
5629,-2.66
5630,-2.35
5631,-2.08
5632,-1.83
5633,-1.66
5634,-1.56
5635,-1.54
5636,-1.56
5637,-1.61
5638,-1.67
5639,-1.73
5640,-1.75
5641,-1.73
5642,-1.69
5643,-1.73
5644,-1.89
5645,-2.13
5646,-2.40
5647,-2.66
5648,-2.92
5649,-3.16
5650,-3.34
5651,-3.43
5652,-3.48
5653,-3.49
5654,-3.51
5655,-3.55
5656,-3.62
5657,-3.74
5658,-3.91
5659,-4.10
5660,-4.32
5661,-4.52
5662,-4.78
5663,-5.07
5664,-5.42
5665,-5.77
5666,-6.16
5667,-6.59
5668,-7.10
5669,-7.60
5670,-8.10
5671,-8.55
5672,-9.00
5673,-9.38
5674,-9.74
5675,-10.03
5676,-10.34
5677,-10.64
5678,-10.94
5679,-11.17
5680,-11.38
5681,-11.59
5682,-11.84
5683,-12.10
5684,-12.36
5685,-12.60
5686,-12.82
5687,-13.02
5688,-13.18
5689,-13.30
5690,-13.40
5691,-13.45
5692,-13.44
5693,-13.34
5694,-13.18
5695,-12.98
5696,-12.72
5697,-12.42
5698,-12.13
5699,-11.90
5700,-11.78
5701,-11.78
5702,-11.91
5703,-12.15
5704,-12.46
5705,-12.77
5706,-13.02
5707,-13.14
5708,-13.11
5709,-12.95
5710,-12.70
5711,-12.41
5712,-12.12
5713,-11.84
5714,-11.63
5715,-11.47
5716,-11.33
5717,-11.18
5718,-10.99
5719,-10.75
5720,-10.44
5721,-10.09
5722,-9.69
5723,-9.32
5724,-8.97
5725,-8.67
5726,-8.33
5727,-8.00
5728,-7.67
5729,-7.39
5730,-7.14
5731,-6.88
5732,-6.61
5733,-6.38
5734,-6.19
5735,-6.03
5736,-5.86
5737,-5.68
5738,-5.55
5739,-5.53
5740,-5.60
5741,-5.74
5742,-5.97
5743,-6.26
5744,-6.61
5745,-6.99
5746,-7.38
5747,-7.74
5748,-8.04
5749,-8.24
5750,-8.33
5751,-8.33
5752,-8.26
5753,-8.14
5754,-7.97
5755,-7.80
5756,-7.71
5757,-7.71
5758,-7.78
5759,-7.93
5760,-8.14
5761,-8.35
5762,-8.53
5763,-8.61
5764,-8.61
5765,-8.56
5766,-8.51
5767,-8.51
5768,-8.61
5769,-8.78
5770,-9.00
5771,-9.22
5772,-9.42
5773,-9.54
5774,-9.56
5775,-9.46
5776,-9.28
5777,-9.12
5778,-9.03
5779,-9.09
5780,-9.29
5781,-9.60
5782,-9.96
5783,-10.30
5784,-10.57
5785,-10.76
5786,-10.83
5787,-10.79
5788,-10.65
5789,-10.47
5790,-10.26
5791,-10.06
5792,-9.79
5793,-9.46
5794,-9.03
5795,-8.54
5796,-8.00
5797,-7.46
5798,-6.91
5799,-6.44
5800,-6.08
5801,-5.87
5802,-5.73
5803,-5.63
5804,-5.49
5805,-5.37
5806,-5.20
5807,-5.00
5808,-4.74
5809,-4.44
5810,-4.15
5811,-3.91
5812,-3.72
5813,-3.59
5814,-3.52
5815,-3.54
5816,-3.62
5817,-3.72
5818,-3.85
5819,-4.01
5820,-4.18
5821,-4.33
5822,-4.47
5823,-4.61
5824,-4.79
5825,-5.00
5826,-5.26
5827,-5.52
5828,-5.86
5829,-6.21
5830,-6.57
5831,-6.84
5832,-7.04
5833,-7.15
5834,-7.23
5835,-7.26
5836,-7.29
5837,-7.34
5838,-7.47
5839,-7.70
5840,-8.06
5841,-8.50
5842,-8.98
5843,-9.41
5844,-9.79
5845,-10.06
5846,-10.25
5847,-10.38
5848,-10.51
5849,-10.63
5850,-10.83
5851,-11.11
5852,-11.47
5853,-11.86
5854,-12.27
5855,-12.61
5856,-12.95
5857,-13.23
5858,-13.53
5859,-13.79
5860,-14.08
5861,-14.36
5862,-14.70
5863,-15.05
5864,-15.43
5865,-15.73
5866,-16.01
5867,-16.26
5868,-16.53
5869,-16.78
5870,-17.01
5871,-17.21
5872,-17.41
5873,-17.61
5874,-17.78
5875,-17.93
5876,-18.04
5877,-18.14
5878,-18.22
5879,-18.25
5880,-18.17
5881,-17.97
5882,-17.65
5883,-17.23
5884,-16.72
5885,-16.17
5886,-15.60
5887,-15.13
5888,-14.75
5889,-14.50
5890,-14.32
5891,-14.21
5892,-14.04
5893,-13.84
5894,-13.53
5895,-13.18
5896,-12.76
5897,-12.39
5898,-12.02
5899,-11.70
5900,-11.33
5901,-10.93
5902,-10.44
5903,-9.92
5904,-9.28
5905,-8.62
5906,-7.90
5907,-7.25
5908,-6.60
5909,-6.02
5910,-5.43
5911,-4.87
5912,-4.27
5913,-3.68
5914,-3.07
5915,-2.48
5916,-1.91
5917,-1.42
5918,-0.99
5919,-0.66
5920,-0.39
5921,-0.20
5922,-0.06
5923,-0.01
5924,-0.02
5925,-0.06
5926,-0.09
5927,-0.10
5928,-0.06
5929,0.03
5930,0.14
5931,0.21
5932,0.21
5933,0.10
5934,-0.13
5935,-0.44
5936,-0.86
5937,-1.31
5938,-1.76
5939,-2.10
5940,-2.33
5941,-2.43
5942,-2.49
5943,-2.55
5944,-2.73
5945,-3.06
5946,-3.59
5947,-4.25
5948,-5.07
5949,-5.93
5950,-6.86
5951,-7.70
5952,-8.45
5953,-9.00
5954,-9.41
5955,-9.66
5956,-9.85
5957,-10.01
5958,-10.28
5959,-10.61
5960,-11.08
5961,-11.59
5962,-12.18
5963,-12.79
5964,-13.40
5965,-13.89
5966,-14.26
5967,-14.47
5968,-14.57
5969,-14.58
5970,-14.56
5971,-14.55
5972,-14.62
5973,-14.72
5974,-14.80
5975,-14.81
5976,-14.74
5977,-14.62
5978,-14.42
5979,-14.14
5980,-13.81
5981,-13.47
5982,-13.12
5983,-12.83
5984,-12.60
5985,-12.42
5986,-12.25
5987,-12.12
5988,-12.04
5989,-12.06
5990,-12.16
5991,-12.31
5992,-12.47
5993,-12.66
5994,-12.85
5995,-12.99
5996,-13.01
5997,-12.89
5998,-12.67
5999,-12.41
6000,-12.12
6001,-11.86
6002,-11.66
6003,-11.50
6004,-11.37
6005,-11.28
6006,-11.21
6007,-11.15
6008,-11.06
6009,-10.93
6010,-10.74
6011,-10.54
6012,-10.35
6013,-10.19
6014,-10.05
6015,-9.94
6016,-9.83
6017,-9.72
6018,-9.57
6019,-9.41
6020,-9.26
6021,-9.14
6022,-9.06
6023,-9.00
6024,-8.96
6025,-8.97
6026,-9.07
6027,-9.21
6028,-9.36
6029,-9.47
6030,-9.60
6031,-9.76
6032,-10.02
6033,-10.35
6034,-10.77
6035,-11.22
6036,-11.73
6037,-12.28
6038,-12.89
6039,-13.48
6040,-14.04
6041,-14.50
6042,-14.95
6043,-15.34
6044,-15.77
6045,-16.18
6046,-16.60
6047,-16.97
6048,-17.31
6049,-17.59
6050,-17.81
6051,-17.94
6052,-18.01
6053,-17.99
6054,-17.94
6055,-17.88
6056,-17.85
6057,-17.82
6058,-17.81
6059,-17.78
6060,-17.78
6061,-17.85
6062,-17.96
6063,-18.10
6064,-18.26
6065,-18.43
6066,-18.63
6067,-18.83
6068,-19.02
6069,-19.18
6070,-19.32
6071,-19.41
6072,-19.47
6073,-19.51
6074,-19.55
6075,-19.60
6076,-19.69
6077,-19.81
6078,-19.96
6079,-20.12
6080,-20.29
6081,-20.42
6082,-20.52
6083,-20.58
6084,-20.62
6085,-20.68
6086,-20.75
6087,-20.79
6088,-20.78
6089,-20.73
6090,-20.63
6091,-20.51
6092,-20.36
6093,-20.20
6094,-20.07
6095,-20.01
6096,-20.00
6097,-19.98
6098,-19.93
6099,-19.84
6100,-19.69
6101,-19.48
6102,-19.17
6103,-18.81
6104,-18.43
6105,-18.10
6106,-17.80
6107,-17.54
6108,-17.24
6109,-16.94
6110,-16.57
6111,-16.20
6112,-15.79
6113,-15.37
6114,-14.86
6115,-14.34
6116,-13.77
6117,-13.21
6118,-12.58
6119,-11.95
6120,-11.26
6121,-10.61
6122,-9.94
6123,-9.35
6124,-8.78
6125,-8.30
6126,-7.80
6127,-7.31
6128,-6.74
6129,-6.20
6130,-5.62
6131,-5.06
6132,-4.46
6133,-3.91
6134,-3.41
6135,-3.02
6136,-2.71
6137,-2.48
6138,-2.28
6139,-2.11
6140,-1.94
6141,-1.75
6142,-1.57
6143,-1.44
6144,-1.43
6145,-1.59
6146,-1.93
6147,-2.44
6148,-3.14
6149,-3.97
6150,-4.94
6151,-5.91
6152,-6.87
6153,-7.71
6154,-8.45
6155,-9.03
6156,-9.54
6157,-9.94
6158,-10.30
6159,-10.61
6160,-10.95
6161,-11.24
6162,-11.46
6163,-11.55
6164,-11.56
6165,-11.51
6166,-11.44
6167,-11.34
6168,-11.23
6169,-11.14
6170,-11.03
6171,-10.89
6172,-10.61
6173,-10.21
6174,-9.62
6175,-8.93
6176,-8.13
6177,-7.36
6178,-6.64
6179,-6.05
6180,-5.57
6181,-5.23
6182,-4.96
6183,-4.78
6184,-4.60
6185,-4.46
6186,-4.26
6187,-4.04
6188,-3.72
6189,-3.36
6190,-2.91
6191,-2.44
6192,-1.94
6193,-1.46
6194,-1.00
6195,-0.60
6196,-0.23
6197,0.06
6198,0.32
6199,0.55
6200,0.81
6201,1.08
6202,1.39
6203,1.70
6204,2.01
6205,2.26
6206,2.39
6207,2.37
6208,2.19
6209,1.83
6210,1.30
6211,0.66
6212,-0.04
6213,-0.67
6214,-1.20
6215,-1.59
6216,-1.90
6217,-2.14
6218,-2.39
6219,-2.63
6220,-2.96
6221,-3.34
6222,-3.81
6223,-4.28
6224,-4.78
6225,-5.25
6226,-5.71
6227,-6.13
6228,-6.58
6229,-7.03
6230,-7.51
6231,-7.97
6232,-8.39
6233,-8.74
6234,-9.04
6235,-9.26
6236,-9.46
6237,-9.63
6238,-9.84
6239,-10.09
6240,-10.40
6241,-10.70
6242,-10.98
6243,-11.18
6244,-11.35
6245,-11.48
6246,-11.63
6247,-11.83
6248,-12.08
6249,-12.38
6250,-12.71
6251,-12.99
6252,-13.18
6253,-13.21
6254,-13.14
6255,-12.96
6256,-12.75
6257,-12.53
6258,-12.35
6259,-12.27
6260,-12.29
6261,-12.37
6262,-12.47
6263,-12.54
6264,-12.55
6265,-12.55
6266,-12.54
6267,-12.55
6268,-12.56
6269,-12.59
6270,-12.59
6271,-12.56
6272,-12.44
6273,-12.23
6274,-11.89
6275,-11.44
6276,-10.88
6277,-10.31
6278,-9.73
6279,-9.24
6280,-8.81
6281,-8.49
6282,-8.20
6283,-7.95
6284,-7.67
6285,-7.37
6286,-6.98
6287,-6.54
6288,-5.98
6289,-5.39
6290,-4.78
6291,-4.20
6292,-3.65
6293,-3.23
6294,-2.94
6295,-2.87
6296,-2.95
6297,-3.14
6298,-3.37
6299,-3.60
6300,-3.76
6301,-3.82
6302,-3.77
6303,-3.65
6304,-3.49
6305,-3.36
6306,-3.27
6307,-3.27
6308,-3.36
6309,-3.51
6310,-3.65
6311,-3.72
6312,-3.68
6313,-3.53
6314,-3.30
6315,-2.98
6316,-2.59
6317,-2.21
6318,-1.87
6319,-1.61
6320,-1.44
6321,-1.34
6322,-1.31
6323,-1.35
6324,-1.44
6325,-1.56
6326,-1.71
6327,-1.90
6328,-2.17
6329,-2.51
6330,-2.92
6331,-3.37
6332,-3.87
6333,-4.36
6334,-4.85
6335,-5.29
6336,-5.68
6337,-6.01
6338,-6.31
6339,-6.56
6340,-6.80
6341,-7.01
6342,-7.23
6343,-7.42
6344,-7.61
6345,-7.74
6346,-7.84
6347,-7.91
6348,-8.00
6349,-8.09
6350,-8.19
6351,-8.32
6352,-8.48
6353,-8.69
6354,-8.86
6355,-8.93
6356,-8.87
6357,-8.66
6358,-8.32
6359,-7.86
6360,-7.32
6361,-6.73
6362,-6.14
6363,-5.63
6364,-5.23
6365,-4.97
6366,-4.81
6367,-4.75
6368,-4.74
6369,-4.77
6370,-4.75
6371,-4.65
6372,-4.39
6373,-4.01
6374,-3.53
6375,-3.05
6376,-2.62
6377,-2.30
6378,-2.10
6379,-2.04
6380,-2.14
6381,-2.34
6382,-2.57
6383,-2.76
6384,-2.88
6385,-2.91
6386,-2.86
6387,-2.77
6388,-2.68
6389,-2.61
6390,-2.56
6391,-2.53
6392,-2.50
6393,-2.46
6394,-2.38
6395,-2.24
6396,-2.05
6397,-1.87
6398,-1.74
6399,-1.66
6400,-1.62
6401,-1.62
6402,-1.68
6403,-1.82
6404,-2.01
6405,-2.19
6406,-2.33
6407,-2.43
6408,-2.49
6409,-2.53
6410,-2.56
6411,-2.56
6412,-2.53
6413,-2.50
6414,-2.54
6415,-2.66
6416,-2.85
6417,-3.11
6418,-3.43
6419,-3.75
6420,-4.03
6421,-4.23
6422,-4.34
6423,-4.36
6424,-4.31
6425,-4.23
6426,-4.14
6427,-4.07
6428,-4.06
6429,-4.10
6430,-4.19
6431,-4.29
6432,-4.37
6433,-4.40
6434,-4.41
6435,-4.40
6436,-4.43
6437,-4.50
6438,-4.66
6439,-4.91
6440,-5.30
6441,-5.80
6442,-6.36
6443,-6.90
6444,-7.39
6445,-7.76
6446,-8.03
6447,-8.18
6448,-8.26
6449,-8.29
6450,-8.32
6451,-8.35
6452,-8.45
6453,-8.56
6454,-8.67
6455,-8.71
6456,-8.67
6457,-8.59
6458,-8.49
6459,-8.41
6460,-8.37
6461,-8.38
6462,-8.46
6463,-8.57
6464,-8.65
6465,-8.66
6466,-8.54
6467,-8.32
6468,-8.04
6469,-7.77
6470,-7.60
6471,-7.58
6472,-7.72
6473,-8.00
6474,-8.37
6475,-8.78
6476,-9.17
6477,-9.43
6478,-9.49
6479,-9.37
6480,-9.16
6481,-8.93
6482,-8.72
6483,-8.56
6484,-8.48
6485,-8.50
6486,-8.58
6487,-8.69
6488,-8.80
6489,-8.87
6490,-8.91
6491,-8.95
6492,-9.02
6493,-9.13
6494,-9.28
6495,-9.45
6496,-9.63
6497,-9.80
6498,-9.95
6499,-10.03
6500,-10.06
6501,-10.05
6502,-10.05
6503,-10.06
6504,-10.11
6505,-10.21
6506,-10.38
6507,-10.57
6508,-10.78
6509,-10.96
6510,-11.12
6511,-11.23
6512,-11.30
6513,-11.29
6514,-11.25
6515,-11.23
6516,-11.27
6517,-11.37
6518,-11.51
6519,-11.67
6520,-11.85
6521,-12.00
6522,-12.11
6523,-12.12
6524,-12.08
6525,-12.00
6526,-11.89
6527,-11.78
6528,-11.67
6529,-11.60
6530,-11.60
6531,-11.64
6532,-11.72
6533,-11.77
6534,-11.80
6535,-11.75
6536,-11.65
6537,-11.51
6538,-11.35
6539,-11.21
6540,-11.11
6541,-11.06
6542,-11.10
6543,-11.22
6544,-11.42
6545,-11.69
6546,-11.96
6547,-12.20
6548,-12.39
6549,-12.55
6550,-12.70
6551,-12.83
6552,-12.95
6553,-13.11
6554,-13.37
6555,-13.68
6556,-14.01
6557,-14.29
6558,-14.52
6559,-14.69
6560,-14.81
6561,-14.85
6562,-14.82
6563,-14.76
6564,-14.69
6565,-14.64
6566,-14.66
6567,-14.75
6568,-14.85
6569,-14.95
6570,-14.96
6571,-14.88
6572,-14.71
6573,-14.50
6574,-14.25
6575,-14.02
6576,-13.76
6577,-13.51
6578,-13.25
6579,-13.00
6580,-12.71
6581,-12.41
6582,-12.05
6583,-11.68
6584,-11.26
6585,-10.84
6586,-10.38
6587,-9.96
6588,-9.51
6589,-9.09
6590,-8.63
6591,-8.18
6592,-7.71
6593,-7.31
6594,-6.93
6595,-6.58
6596,-6.20
6597,-5.80
6598,-5.33
6599,-4.85
6600,-4.38
6601,-3.94
6602,-3.54
6603,-3.23
6604,-3.01
6605,-2.88
6606,-2.76
6607,-2.68
6608,-2.59
6609,-2.49
6610,-2.33
6611,-2.10
6612,-1.82
6613,-1.53
6614,-1.24
6615,-0.97
6616,-0.72
6617,-0.55
6618,-0.44
6619,-0.42
6620,-0.49
6621,-0.65
6622,-0.86
6623,-1.07
6624,-1.24
6625,-1.35
6626,-1.44
6627,-1.52
6628,-1.60
6629,-1.69
6630,-1.83
6631,-2.03
6632,-2.30
6633,-2.62
6634,-2.97
6635,-3.32
6636,-3.68
6637,-4.00
6638,-4.26
6639,-4.43
6640,-4.53
6641,-4.55
6642,-4.52
6643,-4.46
6644,-4.38
6645,-4.31
6646,-4.32
6647,-4.44
6648,-4.66
6649,-4.92
6650,-5.15
6651,-5.33
6652,-5.47
6653,-5.52
6654,-5.46
6655,-5.28
6656,-5.06
6657,-4.83
6658,-4.62
6659,-4.42
6660,-4.26
6661,-4.20
6662,-4.24
6663,-4.39
6664,-4.60
6665,-4.87
6666,-5.17
6667,-5.44
6668,-5.63
6669,-5.70
6670,-5.65
6671,-5.49
6672,-5.30
6673,-5.11
6674,-5.02
6675,-5.05
6676,-5.23
6677,-5.49
6678,-5.80
6679,-6.10
6680,-6.36
6681,-6.54
6682,-6.63
6683,-6.61
6684,-6.56
6685,-6.51
6686,-6.56
6687,-6.72
6688,-7.03
6689,-7.45
6690,-8.00
6691,-8.58
6692,-9.19
6693,-9.72
6694,-10.22
6695,-10.61
6696,-10.96
6697,-11.22
6698,-11.51
6699,-11.80
6700,-12.17
6701,-12.54
6702,-12.96
6703,-13.40
6704,-13.92
6705,-14.43
6706,-14.94
6707,-15.41
6708,-15.86
6709,-16.28
6710,-16.67
6711,-16.99
6712,-17.21
6713,-17.31
6714,-17.28
6715,-17.12
6716,-16.85
6717,-16.47
6718,-15.99
6719,-15.48
6720,-14.94
6721,-14.41
6722,-13.83
6723,-13.22
6724,-12.59
6725,-12.00
6726,-11.41
6727,-10.87
6728,-10.33
6729,-9.86
6730,-9.44
6731,-9.05
6732,-8.63
6733,-8.22
6734,-7.83
6735,-7.52
6736,-7.34
6737,-7.32
6738,-7.48
6739,-7.82
6740,-8.30
6741,-8.83
6742,-9.32
6743,-9.70
6744,-9.95
6745,-10.10
6746,-10.25
6747,-10.43
6748,-10.70
6749,-11.09
6750,-11.60
6751,-12.16
6752,-12.67
6753,-13.00
6754,-13.08
6755,-12.90
6756,-12.46
6757,-11.84
6758,-11.13
6759,-10.45
6760,-9.83
6761,-9.30
6762,-8.84
6763,-8.46
6764,-8.06
6765,-7.62
6766,-7.04
6767,-6.36
6768,-5.53
6769,-4.69
6770,-3.82
6771,-3.04
6772,-2.30
6773,-1.66
6774,-1.05
6775,-0.49
6776,0.09
6777,0.63
6778,1.17
6779,1.65
6780,2.08
6781,2.36
6782,2.52
6783,2.53
6784,2.46
6785,2.33
6786,2.17
6787,1.95
6788,1.70
6789,1.48
6790,1.30
6791,1.14
6792,0.97
6793,0.80
6794,0.63
6795,0.50
6796,0.34
6797,0.14
6798,-0.08
6799,-0.32
6800,-0.58
6801,-0.85
6802,-1.15
6803,-1.42
6804,-1.69
6805,-1.94
6806,-2.21
6807,-2.48
6808,-2.78
6809,-3.11
6810,-3.52
6811,-3.97
6812,-4.44
6813,-4.84
6814,-5.17
6815,-5.39
6816,-5.55
6817,-5.65
6818,-5.74
6819,-5.82
6820,-5.95
6821,-6.14
6822,-6.45
6823,-6.78
6824,-7.08
6825,-7.29
6826,-7.41
6827,-7.43
6828,-7.39
6829,-7.28
6830,-7.22
6831,-7.23
6832,-7.33
6833,-7.51
6834,-7.77
6835,-8.06
6836,-8.37
6837,-8.64
6838,-8.83
6839,-8.93
6840,-8.91
6841,-8.80
6842,-8.62
6843,-8.39
6844,-8.12
6845,-7.82
6846,-7.57
6847,-7.40
6848,-7.30
6849,-7.25
6850,-7.23
6851,-7.26
6852,-7.26
6853,-7.26
6854,-7.20
6855,-7.15
6856,-7.08
6857,-7.00
6858,-6.90
6859,-6.81
6860,-6.70
6861,-6.58
6862,-6.45
6863,-6.31
6864,-6.16
6865,-6.04
6866,-5.97
6867,-5.97
6868,-6.05
6869,-6.20
6870,-6.36
6871,-6.51
6872,-6.61
6873,-6.65
6874,-6.61
6875,-6.51
6876,-6.36
6877,-6.16
6878,-5.91
6879,-5.64
6880,-5.42
6881,-5.30
6882,-5.29
6883,-5.37
6884,-5.50
6885,-5.67
6886,-5.84
6887,-6.01
6888,-6.12
6889,-6.14
6890,-6.08
6891,-5.97
6892,-5.87
6893,-5.78
6894,-5.74
6895,-5.74
6896,-5.80
6897,-5.90
6898,-6.03
6899,-6.13
6900,-6.16
6901,-6.12
6902,-6.03
6903,-5.92
6904,-5.83
6905,-5.73
6906,-5.65
6907,-5.59
6908,-5.65
6909,-5.82
6910,-6.12
6911,-6.48
6912,-6.87
6913,-7.23
6914,-7.53
6915,-7.77
6916,-7.96
6917,-8.08
6918,-8.18
6919,-8.26
6920,-8.38
6921,-8.52
6922,-8.71
6923,-8.91
6924,-9.14
6925,-9.37
6926,-9.62
6927,-9.85
6928,-10.09
6929,-10.33
6930,-10.57
6931,-10.78
6932,-10.97
6933,-11.10
6934,-11.19
6935,-11.23
6936,-11.25
6937,-11.22
6938,-11.17
6939,-11.11
6940,-11.06
6941,-11.02
6942,-10.96
6943,-10.89
6944,-10.81
6945,-10.77
6946,-10.77
6947,-10.81
6948,-10.88
6949,-10.96
6950,-11.05
6951,-11.19
6952,-11.38
6953,-11.60
6954,-11.82
6955,-12.00
6956,-12.15
6957,-12.25
6958,-12.27
6959,-12.19
6960,-12.01
6961,-11.75
6962,-11.44
6963,-11.12
6964,-10.80
6965,-10.50
6966,-10.24
6967,-10.07
6968,-9.96
6969,-9.89
6970,-9.80
6971,-9.73
6972,-9.65
6973,-9.62
6974,-9.61
6975,-9.59
6976,-9.54
6977,-9.48
6978,-9.43
6979,-9.39
6980,-9.34
6981,-9.25
6982,-9.17
6983,-9.12
6984,-9.16
6985,-9.28
6986,-9.48
6987,-9.74
6988,-10.03
6989,-10.35
6990,-10.68
6991,-10.97
6992,-11.24
6993,-11.47
6994,-11.73
6995,-11.99
6996,-12.30
6997,-12.63
6998,-13.02
6999,-13.44
7000,-13.86
7001,-14.25
7002,-14.66
7003,-15.06
7004,-15.50
7005,-15.93
7006,-16.37
7007,-16.78
7008,-17.19
7009,-17.56
7010,-17.90
7011,-18.14
7012,-18.29
7013,-18.33
7014,-18.33
7015,-18.28
7016,-18.25
7017,-18.23
7018,-18.21
7019,-18.19
7020,-18.16
7021,-18.12
7022,-18.07
7023,-18.01
7024,-17.94
7025,-17.89
7026,-17.84
7027,-17.78
7028,-17.68
7029,-17.59
7030,-17.49
7031,-17.40
7032,-17.27
7033,-17.07
7034,-16.82
7035,-16.54
7036,-16.23
7037,-15.92
7038,-15.59
7039,-15.26
7040,-14.91
7041,-14.58
7042,-14.24
7043,-13.93
7044,-13.62
7045,-13.34
7046,-13.01
7047,-12.65
7048,-12.19
7049,-11.71
7050,-11.14
7051,-10.54
7052,-9.86
7053,-9.14
7054,-8.34
7055,-7.57
7056,-6.81
7057,-6.18
7058,-5.59
7059,-5.11
7060,-4.67
7061,-4.30
7062,-3.95
7063,-3.63
7064,-3.27
7065,-2.88
7066,-2.45
7067,-2.05
7068,-1.69
7069,-1.42
7070,-1.22
7071,-1.11
7072,-1.05
7073,-1.06
7074,-1.09
7075,-1.11
7076,-1.11
7077,-1.08
7078,-1.08
7079,-1.12
7080,-1.21
7081,-1.37
7082,-1.60
7083,-1.86
7084,-2.11
7085,-2.31
7086,-2.46
7087,-2.56
7088,-2.62
7089,-2.63
7090,-2.62
7091,-2.62
7092,-2.66
7093,-2.69
7094,-2.69
7095,-2.64
7096,-2.55
7097,-2.42
7098,-2.27
7099,-2.06
7100,-1.85
7101,-1.70
7102,-1.66
7103,-1.75
7104,-1.94
7105,-2.19
7106,-2.50
7107,-2.88
7108,-3.34
7109,-3.84
7110,-4.33
7111,-4.72
7112,-5.04
7113,-5.26
7114,-5.44
7115,-5.53
7116,-5.59
7117,-5.62
7118,-5.68
7119,-5.79
7120,-6.00
7121,-6.25
7122,-6.52
7123,-6.77
7124,-6.97
7125,-7.13
7126,-7.23
7127,-7.31
7128,-7.40
7129,-7.51
7130,-7.65
7131,-7.77
7132,-7.87
7133,-7.93
7134,-7.93
7135,-7.85
7136,-7.71
7137,-7.55
7138,-7.39
7139,-7.32
7140,-7.33
7141,-7.43
7142,-7.58
7143,-7.73
7144,-7.84
7145,-7.90
7146,-7.88
7147,-7.80
7148,-7.68
7149,-7.52
7150,-7.34
7151,-7.14
7152,-6.93
7153,-6.74
7154,-6.55
7155,-6.38
7156,-6.17
7157,-5.96
7158,-5.72
7159,-5.51
7160,-5.31
7161,-5.10
7162,-4.82
7163,-4.51
7164,-4.17
7165,-3.90
7166,-3.67
7167,-3.49
7168,-3.36
7169,-3.26
7170,-3.19
7171,-3.17
7172,-3.20
7173,-3.26
7174,-3.34
7175,-3.42
7176,-3.49
7177,-3.56
7178,-3.68
7179,-3.86
7180,-4.10
7181,-4.37
7182,-4.68
7183,-5.02
7184,-5.41
7185,-5.79
7186,-6.17
7187,-6.52
7188,-6.84
7189,-7.17
7190,-7.42
7191,-7.59
7192,-7.74
7193,-8.99
7194,-9.07
7195,-6.48
7196,-5.32
7197,-11.54
7198,-17.99
7199,-6.50
7200,12.66
