1,185.73
2,249.99
3,249.99
4,240.87
5,186.49
6,113.59
7,24.89
8,-44.98
9,-63.66
10,-37.49
11,3.14
12,36.61
13,55.68
14,58.69
15,47.48
16,27.44
17,8.80
18,-3.46
19,-6.23
20,-2.14
21,5.46
22,12.64
23,16.55
24,16.72
25,13.92
26,9.80
27,6.16
28,3.68
29,2.85
30,2.96
31,3.40
32,3.49
33,3.04
34,2.30
35,1.56
36,0.92
37,0.38
38,-0.13
39,-0.60
40,-0.95
41,-1.17
42,-1.14
43,-0.86
44,-0.22
45,0.76
46,2.21
47,3.99
48,6.08
49,8.29
50,10.51
51,12.56
52,14.36
53,15.82
54,16.93
55,17.68
56,18.07
57,18.06
58,17.62
59,16.78
60,15.46
61,13.76
62,11.69
63,9.44
64,7.05
65,4.74
66,2.53
67,0.62
68,-1.06
69,-2.40
70,-3.54
71,-4.41
72,-5.14
73,-5.65
74,-6.04
75,-6.22
76,-6.27
77,-6.13
78,-5.87
79,-5.49
80,-5.10
81,-4.70
82,-4.29
83,-3.85
84,-3.38
85,-2.93
86,-2.49
87,-2.07
88,-1.66
89,-1.35
90,-1.15
91,-1.12
92,-1.18
93,-1.29
94,-1.42
95,-1.56
96,-1.69
97,-1.79
98,-1.87
99,-1.92
100,-1.98
101,-2.06
102,-2.16
103,-2.29
104,-2.42
105,-2.49
106,-2.49
107,-2.42
108,-2.29
109,-2.15
110,-1.97
111,-1.75
112,-1.54
113,-1.36
114,-1.21
115,-1.08
116,-0.92
117,-0.72
118,-0.45
119,-0.12
120,0.27
121,0.69
122,1.12
123,1.50
124,1.82
125,2.05
126,2.23
127,2.33
128,2.32
129,2.20
130,1.98
131,1.70
132,1.38
133,1.02
134,0.63
135,0.27
136,0.00
137,-0.17
138,-0.27
139,-0.31
140,-0.33
141,-0.32
142,-0.36
143,-0.45
144,-0.59
145,-0.72
146,-0.82
147,-0.89
148,-0.94
149,-0.98
150,-1.03
151,-1.06
152,-1.09
153,-1.13
154,-1.22
155,-1.34
156,-1.45
157,-1.51
158,-1.53
159,-1.52
160,-1.50
161,-1.50
162,-1.55
163,-1.66
164,-1.87
165,-2.12
166,-2.42
167,-2.71
168,-3.01
169,-3.29
170,-3.55
171,-3.78
172,-4.01
173,-4.24
174,-4.49
175,-4.75
176,-4.96
177,-5.10
178,-5.13
179,-5.10
180,-5.01
181,-4.91
182,-4.78
183,-4.65
184,-4.52
185,-4.39
186,-4.24
187,-4.04
188,-3.75
189,-3.38
190,-2.88
191,-2.33
192,-1.73
193,-1.12
194,-0.46
195,0.21
196,0.89
197,1.50
198,2.14
199,2.72
200,3.28
201,3.72
202,4.12
203,4.46
204,4.84
205,5.22
206,5.65
207,6.11
208,6.61
209,7.06
210,7.42
211,7.62
212,7.64
213,7.43
214,7.03
215,6.51
216,5.95
217,5.46
218,5.10
219,4.89
220,4.81
221,4.83
222,4.91
223,5.00
224,5.04
225,5.04
226,5.00
227,4.94
228,4.90
229,4.92
230,5.00
231,5.17
232,5.39
233,5.65
234,5.91
235,6.13
236,6.31
237,6.43
238,6.48
239,6.48
240,6.45
241,6.39
242,6.26
243,6.07
244,5.81
245,5.49
246,5.10
247,4.68
248,4.21
249,3.77
250,3.36
251,3.05
252,2.83
253,2.72
254,2.66
255,2.66
256,2.65
257,2.63
258,2.55
259,2.39
260,2.19
261,2.01
262,1.87
263,1.82
264,1.83
265,1.91
266,2.04
267,2.20
268,2.38
269,2.53
270,2.59
271,2.57
272,2.49
273,2.37
274,2.21
275,2.06
276,1.93
277,1.85
278,1.79
279,1.73
280,1.68
281,1.61
282,1.46
283,1.23
284,0.89
285,0.51
286,0.11
287,-0.24
288,-0.55
289,-0.80
290,-1.03
291,-1.21
292,-1.43
293,-1.69
294,-2.08
295,-2.51
296,-2.97
297,-3.35
298,-3.63
299,-3.78
300,-3.82
301,-3.75
302,-3.63
303,-3.51
304,-3.43
305,-3.38
306,-3.37
307,-3.38
308,-3.40
309,-3.42
310,-3.40
311,-3.33
312,-3.26
313,-3.18
314,-3.07
315,-2.92
316,-2.72
317,-2.49
318,-2.27
319,-2.05
320,-1.87
321,-1.76
322,-1.79
323,-1.94
324,-2.20
325,-2.53
326,-2.89
327,-3.25
328,-3.55
329,-3.75
330,-3.88
331,-3.97
332,-4.04
333,-4.10
334,-4.19
335,-4.30
336,-4.45
337,-4.64
338,-4.84
339,-5.02
340,-5.13
341,-5.13
342,-5.02
343,-4.80
344,-4.46
345,-4.01
346,-3.54
347,-3.09
348,-2.72
349,-2.46
350,-2.34
351,-2.38
352,-2.56
353,-2.85
354,-3.18
355,-3.52
356,-3.84
357,-4.10
358,-4.30
359,-4.41
360,-4.46
361,-4.48
362,-4.50
363,-4.52
364,-4.61
365,-4.76
366,-5.04
367,-5.37
368,-5.72
369,-6.04
370,-6.36
371,-6.62
372,-6.84
373,-6.94
374,-6.96
375,-6.94
376,-6.95
377,-6.99
378,-7.10
379,-7.23
380,-7.39
381,-7.58
382,-7.83
383,-8.08
384,-8.32
385,-8.51
386,-8.64
387,-8.71
388,-8.74
389,-8.76
390,-8.80
391,-8.90
392,-9.06
393,-9.26
394,-9.48
395,-9.66
396,-9.77
397,-9.77
398,-9.65
399,-9.40
400,-9.08
401,-8.74
402,-8.43
403,-8.21
404,-8.08
405,-8.05
406,-8.07
407,-8.12
408,-8.16
409,-8.19
410,-8.16
411,-8.11
412,-7.99
413,-7.87
414,-7.71
415,-7.53
416,-7.29
417,-7.00
418,-6.65
419,-6.30
420,-5.93
421,-5.55
422,-5.17
423,-4.80
424,-4.41
425,-4.01
426,-3.60
427,-3.23
428,-2.89
429,-2.65
430,-2.45
431,-2.30
432,-2.15
433,-2.02
434,-1.87
435,-1.72
436,-1.54
437,-1.34
438,-1.12
439,-0.95
440,-0.83
441,-0.79
442,-0.80
443,-0.83
444,-0.83
445,-0.82
446,-0.78
447,-0.74
448,-0.70
449,-0.69
450,-0.68
451,-0.66
452,-0.62
453,-0.54
454,-0.43
455,-0.27
456,-0.05
457,0.21
458,0.48
459,0.75
460,0.98
461,1.17
462,1.27
463,1.30
464,1.30
465,1.31
466,1.30
467,1.27
468,1.17
469,1.01
470,0.81
471,0.56
472,0.21
473,-0.23
474,-0.75
475,-1.28
476,-1.82
477,-2.30
478,-2.71
479,-3.02
480,-3.24
481,-3.38
482,-3.46
483,-3.46
484,-3.43
485,-3.37
486,-3.32
487,-3.27
488,-3.24
489,-3.20
490,-3.17
491,-3.16
492,-3.20
493,-3.28
494,-3.40
495,-3.56
496,-3.76
497,-4.00
498,-4.25
499,-4.47
500,-4.65
501,-4.76
502,-4.84
503,-4.89
504,-4.95
505,-5.05
506,-5.20
507,-5.41
508,-5.62
509,-5.83
510,-5.99
511,-6.12
512,-6.17
513,-6.13
514,-5.98
515,-5.77
516,-5.52
517,-5.27
518,-4.95
519,-4.59
520,-4.17
521,-3.75
522,-3.30
523,-2.85
524,-2.33
525,-1.82
526,-1.28
527,-0.81
528,-0.35
529,0.04
530,0.42
531,0.74
532,1.06
533,1.35
534,1.67
535,2.02
536,2.41
537,2.78
538,3.13
539,3.38
540,3.56
541,3.64
542,3.62
543,3.52
544,3.36
545,3.17
546,3.01
547,2.90
548,2.82
549,2.74
550,2.64
551,2.55
552,2.44
553,2.37
554,2.30
555,2.25
556,2.18
557,2.08
558,1.94
559,1.74
560,1.50
561,1.25
562,1.05
563,0.96
564,0.97
565,1.10
566,1.30
567,1.53
568,1.69
569,1.74
570,1.64
571,1.42
572,1.10
573,0.72
574,0.28
575,-0.13
576,-0.48
577,-0.76
578,-1.00
579,-1.23
580,-1.47
581,-1.71
582,-1.98
583,-2.27
584,-2.59
585,-2.90
586,-3.23
587,-3.52
588,-3.78
589,-3.95
590,-4.06
591,-4.11
592,-4.17
593,-4.22
594,-4.30
595,-4.39
596,-4.52
597,-4.64
598,-4.73
599,-4.77
600,-4.75
601,-4.64
602,-4.49
603,-4.33
604,-4.18
605,-4.07
606,-4.04
607,-4.10
608,-4.26
609,-4.52
610,-4.86
611,-5.21
612,-5.58
613,-5.91
614,-6.23
615,-6.48
616,-6.68
617,-6.86
618,-7.06
619,-7.27
620,-7.51
621,-7.74
622,-8.00
623,-8.23
624,-8.43
625,-8.51
626,-8.46
627,-8.29
628,-8.06
629,-7.82
630,-7.61
631,-7.41
632,-7.19
633,-6.98
634,-6.78
635,-6.59
636,-6.32
637,-5.97
638,-5.54
639,-5.10
640,-4.68
641,-4.32
642,-4.04
643,-3.88
644,-3.85
645,-3.89
646,-3.95
647,-4.02
648,-4.10
649,-4.18
650,-4.30
651,-4.46
652,-4.70
653,-5.00
654,-5.39
655,-5.83
656,-6.36
657,-6.90
658,-7.43
659,-7.87
660,-8.26
661,-8.60
662,-8.93
663,-9.21
664,-9.46
665,-9.67
666,-9.88
667,-10.05
668,-10.21
669,-10.35
670,-10.48
671,-10.57
672,-10.63
673,-10.60
674,-10.52
675,-10.40
676,-10.27
677,-10.15
678,-10.04
679,-9.97
680,-9.91
681,-9.86
682,-9.74
683,-9.56
684,-9.28
685,-8.90
686,-8.38
687,-7.77
688,-7.10
689,-6.48
690,-5.92
691,-5.46
692,-5.05
693,-4.75
694,-4.49
695,-4.30
696,-4.14
697,-3.99
698,-3.81
699,-3.64
700,-3.46
701,-3.29
702,-3.07
703,-2.82
704,-2.52
705,-2.21
706,-1.85
707,-1.46
708,-1.01
709,-0.55
710,-0.02
711,0.53
712,1.11
713,1.66
714,2.20
715,2.67
716,3.09
717,3.43
718,3.70
719,3.88
720,4.02
721,4.12
722,4.22
723,4.30
724,4.32
725,4.29
726,4.21
727,4.10
728,3.97
729,3.81
730,3.65
731,3.53
732,3.44
733,3.37
734,3.27
735,3.14
736,2.94
737,2.69
738,2.35
739,1.96
740,1.51
741,1.04
742,0.52
743,0.03
744,-0.43
745,-0.80
746,-1.13
747,-1.37
748,-1.55
749,-1.64
750,-1.72
751,-1.79
752,-1.89
753,-2.01
754,-2.23
755,-2.47
756,-2.78
757,-3.07
758,-3.37
759,-3.63
760,-3.91
761,-4.16
762,-4.43
763,-4.69
764,-5.00
765,-5.31
766,-5.64
767,-5.95
768,-6.27
769,-6.57
770,-6.84
771,-7.03
772,-7.19
773,-7.29
774,-7.33
775,-7.34
776,-7.28
777,-7.19
778,-7.04
779,-6.85
780,-6.55
781,-6.19
782,-5.73
783,-5.22
784,-4.61
785,-3.99
786,-3.36
787,-2.82
788,-2.27
789,-1.77
790,-1.29
791,-0.89
792,-0.46
793,-0.02
794,0.48
795,0.98
796,1.46
797,1.89
798,2.30
799,2.65
800,2.94
801,3.14
802,3.26
803,3.30
804,3.34
805,3.37
806,3.45
807,3.56
808,3.73
809,3.97
810,4.30
811,4.67
812,5.05
813,5.37
814,5.65
815,5.83
816,5.94
817,5.95
818,5.95
819,5.98
820,6.08
821,6.24
822,6.45
823,6.70
824,6.92
825,7.09
826,7.16
827,7.17
828,7.09
829,6.96
830,6.75
831,6.52
832,6.24
833,5.93
834,5.54
835,5.11
836,4.65
837,4.19
838,3.72
839,3.31
840,2.96
841,2.73
842,2.56
843,2.44
844,2.28
845,2.11
846,1.90
847,1.65
848,1.33
849,1.01
850,0.74
851,0.58
852,0.52
853,0.55
854,0.63
855,0.73
856,0.82
857,0.89
858,0.89
859,0.83
860,0.73
861,0.63
862,0.55
863,0.50
864,0.45
865,0.39
866,0.30
867,0.21
868,0.11
869,0.00
870,-0.11
871,-0.21
872,-0.26
873,-0.26
874,-0.25
875,-0.24
876,-0.24
877,-0.24
878,-0.28
879,-0.36
880,-0.44
881,-0.50
882,-0.56
883,-0.63
884,-0.72
885,-0.82
886,-0.95
887,-1.11
888,-1.30
889,-1.50
890,-1.67
891,-1.78
892,-1.79
893,-1.68
894,-1.49
895,-1.25
896,-1.00
897,-0.80
898,-0.66
899,-0.59
900,-0.55
901,-0.51
902,-0.42
903,-0.24
904,0.01
905,0.31
906,0.64
907,0.95
908,1.24
909,1.42
910,1.48
911,1.43
912,1.33
913,1.22
914,1.15
915,1.14
916,1.17
917,1.25
918,1.35
919,1.44
920,1.46
921,1.42
922,1.25
923,0.97
924,0.57
925,0.11
926,-0.35
927,-0.79
928,-1.21
929,-1.58
930,-1.90
931,-2.13
932,-2.33
933,-2.47
934,-2.61
935,-2.68
936,-2.71
937,-2.69
938,-2.65
939,-2.59
940,-2.58
941,-2.59
942,-2.66
943,-2.78
944,-2.94
945,-3.11
946,-3.31
947,-3.50
948,-3.73
949,-3.98
950,-4.29
951,-4.64
952,-5.07
953,-5.55
954,-6.04
955,-6.45
956,-6.70
957,-6.77
958,-6.71
959,-6.52
960,-6.25
961,-5.93
962,-5.61
963,-5.36
964,-5.22
965,-5.17
966,-5.16
967,-5.15
968,-5.07
969,-4.91
970,-4.66
971,-4.35
972,-3.99
973,-3.65
974,-3.33
975,-3.10
976,-2.96
977,-2.97
978,-3.10
979,-3.33
980,-3.59
981,-3.81
982,-3.94
983,-3.99
984,-3.94
985,-3.83
986,-3.62
987,-3.36
988,-3.10
989,-2.88
990,-2.69
991,-2.55
992,-2.40
993,-2.27
994,-2.10
995,-1.91
996,-1.67
997,-1.40
998,-1.06
999,-0.67
1000,-0.20
1001,0.31
1002,0.89
1003,1.50
1004,2.14
1005,2.75
1006,3.34
1007,3.85
1008,4.28
1009,4.57
1010,4.76
1011,4.85
1012,4.90
1013,4.91
1014,4.93
1015,4.98
1016,5.11
1017,5.29
1018,5.49
1019,5.67
1020,5.81
1021,5.87
1022,5.85
1023,5.77
1024,5.62
1025,5.47
1026,5.32
1027,5.18
1028,5.02
1029,4.87
1030,4.74
1031,4.64
1032,4.52
1033,4.40
1034,4.24
1035,4.09
1036,3.90
1037,3.66
1038,3.37
1039,3.06
1040,2.72
1041,2.38
1042,2.04
1043,1.77
1044,1.59
1045,1.52
1046,1.49
1047,1.50
1048,1.51
1049,1.53
1050,1.52
1051,1.47
1052,1.37
1053,1.23
1054,1.05
1055,0.85
1056,0.65
1057,0.43
1058,0.16
1059,-0.17
1060,-0.57
1061,-1.02
1062,-1.56
1063,-2.12
1064,-2.71
1065,-3.25
1066,-3.75
1067,-4.17
1068,-4.47
1069,-4.65
1070,-4.73
1071,-4.75
1072,-4.72
1073,-4.65
1074,-4.56
1075,-4.45
1076,-4.30
1077,-4.13
1078,-3.89
1079,-3.59
1080,-3.23
1081,-2.83
1082,-2.41
1083,-1.98
1084,-1.51
1085,-1.05
1086,-0.63
1087,-0.30
1088,-0.03
1089,0.14
1090,0.23
1091,0.18
1092,0.04
1093,-0.20
1094,-0.46
1095,-0.70
1096,-0.87
1097,-0.98
1098,-1.01
1099,-0.99
1100,-0.90
1101,-0.76
1102,-0.60
1103,-0.41
1104,-0.23
1105,-0.05
1106,0.10
1107,0.22
1108,0.32
1109,0.40
1110,0.45
1111,0.47
1112,0.47
1113,0.47
1114,0.48
1115,0.56
1116,0.72
1117,0.97
1118,1.23
1119,1.46
1120,1.62
1121,1.67
1122,1.61
1123,1.43
1124,1.17
1125,0.89
1126,0.61
1127,0.42
1128,0.33
1129,0.35
1130,0.41
1131,0.46
1132,0.39
1133,0.18
1134,-0.26
1135,-0.83
1136,-1.47
1137,-2.08
1138,-2.64
1139,-3.10
1140,-3.46
1141,-3.71
1142,-3.95
1143,-4.20
1144,-4.52
1145,-4.85
1146,-5.26
1147,-5.68
1148,-6.04
1149,-6.29
1150,-6.42
1151,-6.45
1152,-6.42
1153,-6.36
1154,-6.27
1155,-6.15
1156,-6.00
1157,-5.82
1158,-5.62
1159,-5.42
1160,-5.23
1161,-5.07
1162,-4.93
1163,-4.84
1164,-4.80
1165,-4.78
1166,-4.72
1167,-4.61
1168,-4.44
1169,-4.23
1170,-4.01
1171,-3.79
1172,-3.61
1173,-3.52
1174,-3.57
1175,-3.75
1176,-4.06
1177,-4.44
1178,-4.87
1179,-5.31
1180,-5.73
1181,-6.09
1182,-6.36
1183,-6.57
1184,-6.70
1185,-6.74
1186,-6.65
1187,-6.45
1188,-6.18
1189,-5.84
1190,-5.39
1191,-4.85
1192,-4.23
1193,-3.61
1194,-2.99
1195,-2.40
1196,-1.82
1197,-1.30
1198,-0.79
1199,-0.31
1200,0.22
1201,0.72
1202,1.23
1203,1.64
1204,1.97
1205,2.18
1206,2.32
1207,2.37
1208,2.37
1209,2.36
1210,2.42
1211,2.57
1212,2.82
1213,3.11
1214,3.36
1215,3.55
1216,3.63
1217,3.61
1218,3.49
1219,3.32
1220,3.08
1221,2.83
1222,2.56
1223,2.27
1224,2.00
1225,1.75
1226,1.51
1227,1.30
1228,1.14
1229,1.02
1230,0.95
1231,0.92
1232,0.88
1233,0.82
1234,0.73
1235,0.62
1236,0.46
1237,0.28
1238,0.10
1239,-0.05
1240,-0.20
1241,-0.31
1242,-0.40
1243,-0.48
1244,-0.60
1245,-0.74
1246,-0.93
1247,-1.15
1248,-1.42
1249,-1.68
1250,-1.88
1251,-1.98
1252,-2.01
1253,-1.98
1254,-1.91
1255,-1.82
1256,-1.70
1257,-1.60
1258,-1.51
1259,-1.42
1260,-1.28
1261,-1.11
1262,-0.89
1263,-0.63
1264,-0.33
1265,0.02
1266,0.37
1267,0.65
1268,0.81
1269,0.85
1270,0.79
1271,0.68
1272,0.48
1273,0.23
1274,-0.06
1275,-0.37
1276,-0.69
1277,-0.99
1278,-1.32
1279,-1.66
1280,-2.11
1281,-2.61
1282,-3.17
1283,-3.71
1284,-4.22
1285,-4.67
1286,-5.08
1287,-5.41
1288,-5.71
1289,-5.91
1290,-6.07
1291,-6.18
1292,-6.30
1293,-6.41
1294,-6.52
1295,-6.60
1296,-6.68
1297,-6.77
1298,-6.90
1299,-7.06
1300,-7.23
1301,-7.38
1302,-7.45
1303,-7.46
1304,-7.36
1305,-7.16
1306,-6.87
1307,-6.51
1308,-6.12
1309,-5.76
1310,-5.45
1311,-5.19
1312,-4.99
1313,-4.88
1314,-4.84
1315,-4.91
1316,-5.03
1317,-5.20
1318,-5.36
1319,-5.51
1320,-5.59
1321,-5.61
1322,-5.57
1323,-5.50
1324,-5.45
1325,-5.42
1326,-5.46
1327,-5.54
1328,-5.65
1329,-5.79
1330,-5.96
1331,-6.13
1332,-6.31
1333,-6.42
1334,-6.50
1335,-6.57
1336,-6.70
1337,-6.89
1338,-7.17
1339,-7.51
1340,-7.90
1341,-8.27
1342,-8.62
1343,-8.88
1344,-9.04
1345,-9.07
1346,-9.00
1347,-8.83
1348,-8.64
1349,-8.45
1350,-8.30
1351,-8.24
1352,-8.31
1353,-8.48
1354,-8.74
1355,-9.02
1356,-9.32
1357,-9.66
1358,-10.02
1359,-10.34
1360,-10.60
1361,-10.80
1362,-10.95
1363,-11.04
1364,-11.11
1365,-11.14
1366,-11.18
1367,-11.24
1368,-11.34
1369,-11.48
1370,-11.62
1371,-11.73
1372,-11.78
1373,-11.77
1374,-11.63
1375,-11.37
1376,-10.93
1377,-10.38
1378,-9.70
1379,-8.98
1380,-8.19
1381,-7.43
1382,-6.63
1383,-5.87
1384,-5.10
1385,-4.39
1386,-3.70
1387,-3.10
1388,-2.56
1389,-2.13
1390,-1.75
1391,-1.46
1392,-1.26
1393,-1.17
1394,-1.13
1395,-1.14
1396,-1.17
1397,-1.24
1398,-1.31
1399,-1.41
1400,-1.54
1401,-1.68
1402,-1.83
1403,-1.98
1404,-2.17
1405,-2.36
1406,-2.57
1407,-2.78
1408,-3.04
1409,-3.31
1410,-3.61
1411,-3.89
1412,-4.16
1413,-4.36
1414,-4.52
1415,-4.59
1416,-4.62
1417,-4.60
1418,-4.51
1419,-4.35
1420,-4.17
1421,-4.00
1422,-3.87
1423,-3.76
1424,-3.72
1425,-3.76
1426,-3.88
1427,-4.04
1428,-4.23
1429,-4.43
1430,-4.62
1431,-4.81
1432,-4.97
1433,-5.13
1434,-5.28
1435,-5.42
1436,-5.52
1437,-5.56
1438,-5.55
1439,-5.50
1440,-5.36
1441,-5.14
1442,-4.84
1443,-4.51
1444,-4.14
1445,-3.78
1446,-3.44
1447,-3.17
1448,-2.98
1449,-2.89
1450,-2.82
1451,-2.75
1452,-2.68
1453,-2.66
1454,-2.66
1455,-2.64
1456,-2.59
1457,-2.54
1458,-2.49
1459,-2.47
1460,-2.47
1461,-2.47
1462,-2.46
1463,-2.44
1464,-2.42
1465,-2.43
1466,-2.44
1467,-2.45
1468,-2.40
1469,-2.33
1470,-2.23
1471,-2.11
1472,-1.94
1473,-1.72
1474,-1.50
1475,-1.27
1476,-1.05
1477,-0.82
1478,-0.56
1479,-0.33
1480,-0.06
1481,0.18
1482,0.41
1483,0.62
1484,0.82
1485,1.01
1486,1.19
1487,1.33
1488,1.44
1489,1.52
1490,1.55
1491,1.51
1492,1.41
1493,1.27
1494,1.08
1495,0.87
1496,0.63
1497,0.39
1498,0.17
1499,-0.05
1500,-0.31
1501,-0.55
1502,-0.79
1503,-0.98
1504,-1.18
1505,-1.35
1506,-1.48
1507,-1.56
1508,-1.64
1509,-1.74
1510,-1.91
1511,-2.11
1512,-2.37
1513,-2.65
1514,-3.00
1515,-3.37
1516,-3.78
1517,-4.20
1518,-4.64
1519,-5.07
1520,-5.49
1521,-5.81
1522,-6.00
1523,-6.01
1524,-5.86
1525,-5.55
1526,-5.17
1527,-4.74
1528,-4.33
1529,-4.01
1530,-3.83
1531,-3.82
1532,-3.99
1533,-4.26
1534,-4.56
1535,-4.84
1536,-5.07
1537,-5.24
1538,-5.38
1539,-5.49
1540,-5.64
1541,-5.86
1542,-6.23
1543,-6.71
1544,-7.28
1545,-7.81
1546,-8.29
1547,-8.61
1548,-8.83
1549,-8.98
1550,-9.12
1551,-9.25
1552,-9.41
1553,-9.61
1554,-9.88
1555,-10.20
1556,-10.51
1557,-10.74
1558,-10.83
1559,-10.77
1560,-10.54
1561,-10.19
1562,-9.72
1563,-9.20
1564,-8.66
1565,-8.16
1566,-7.74
1567,-7.41
1568,-7.14
1569,-6.93
1570,-6.71
1571,-6.53
1572,-6.34
1573,-6.19
1574,-6.03
1575,-5.97
1576,-5.97
1577,-6.08
1578,-6.23
1579,-6.39
1580,-6.55
1581,-6.68
1582,-6.71
1583,-6.64
1584,-6.45
1585,-6.21
1586,-5.93
1587,-5.65
1588,-5.39
1589,-5.15
1590,-4.94
1591,-4.76
1592,-4.60
1593,-4.45
1594,-4.27
1595,-4.10
1596,-3.92
1597,-3.78
1598,-3.66
1599,-3.57
1600,-3.49
1601,-3.43
1602,-3.40
1603,-3.41
1604,-3.51
1605,-3.66
1606,-3.87
1607,-4.06
1608,-4.27
1609,-4.48
1610,-4.71
1611,-4.99
1612,-5.36
1613,-5.78
1614,-6.28
1615,-6.82
1616,-7.42
1617,-8.06
1618,-8.69
1619,-9.22
1620,-9.64
1621,-9.93
1622,-10.07
1623,-10.07
1624,-9.92
1625,-9.66
1626,-9.32
1627,-8.93
1628,-8.45
1629,-7.90
1630,-7.27
1631,-6.64
1632,-6.00
1633,-5.40
1634,-4.77
1635,-4.15
1636,-3.50
1637,-2.91
1638,-2.35
1639,-1.85
1640,-1.33
1641,-0.83
1642,-0.28
1643,0.24
1644,0.78
1645,1.27
1646,1.73
1647,2.14
1648,2.54
1649,2.85
1650,3.08
1651,3.20
1652,3.22
1653,3.17
1654,3.10
1655,3.00
1656,2.88
1657,2.76
1658,2.62
1659,2.43
1660,2.15
1661,1.83
1662,1.50
1663,1.21
1664,0.92
1665,0.63
1666,0.31
1667,0.04
1668,-0.19
1669,-0.36
1670,-0.53
1671,-0.68
1672,-0.82
1673,-0.94
1674,-1.07
1675,-1.20
1676,-1.34
1677,-1.47
1678,-1.66
1679,-1.83
1680,-1.97
1681,-2.02
1682,-2.03
1683,-2.03
1684,-2.05
1685,-2.07
1686,-2.07
1687,-2.08
1688,-2.17
1689,-2.30
1690,-2.44
1691,-2.55
1692,-2.63
1693,-2.71
1694,-2.77
1695,-2.79
1696,-2.77
1697,-2.72
1698,-2.62
1699,-2.50
1700,-2.34
1701,-2.15
1702,-1.91
1703,-1.66
1704,-1.38
1705,-1.08
1706,-0.74
1707,-0.39
1708,-0.03
1709,0.28
1710,0.56
1711,0.79
1712,1.01
1713,1.21
1714,1.42
1715,1.65
1716,1.91
1717,2.20
1718,2.46
1719,2.62
1720,2.62
1721,2.43
1722,2.07
1723,1.60
1724,1.07
1725,0.53
1726,0.04
1727,-0.32
1728,-0.54
1729,-0.63
1730,-0.66
1731,-0.63
1732,-0.60
1733,-0.61
1734,-0.72
1735,-0.92
1736,-1.17
1737,-1.41
1738,-1.62
1739,-1.72
1740,-1.69
1741,-1.50
1742,-1.21
1743,-0.89
1744,-0.57
1745,-0.30
1746,-0.05
1747,0.14
1748,0.30
1749,0.43
1750,0.60
1751,0.76
1752,0.93
1753,1.08
1754,1.22
1755,1.37
1756,1.53
1757,1.66
1758,1.82
1759,2.01
1760,2.24
1761,2.50
1762,2.78
1763,3.04
1764,3.27
1765,3.41
1766,3.53
1767,3.64
1768,3.80
1769,3.99
1770,4.24
1771,4.54
1772,4.91
1773,5.26
1774,5.58
1775,5.81
1776,5.98
1777,6.06
1778,6.03
1779,5.91
1780,5.74
1781,5.59
1782,5.52
1783,5.52
1784,5.59
1785,5.69
1786,5.78
1787,5.82
1788,5.79
1789,5.71
1790,5.60
1791,5.49
1792,5.36
1793,5.26
1794,5.21
1795,5.22
1796,5.24
1797,5.27
1798,5.28
1799,5.26
1800,5.17
1801,5.04
1802,4.88
1803,4.71
1804,4.55
1805,4.38
1806,4.18
1807,3.97
1808,3.70
1809,3.43
1810,3.17
1811,2.95
1812,2.75
1813,2.55
1814,2.37
1815,2.25
1816,2.18
1817,2.13
1818,2.03
1819,1.90
1820,1.76
1821,1.64
1822,1.48
1823,1.31
1824,1.14
1825,1.00
1826,0.87
1827,0.76
1828,0.67
1829,0.66
1830,0.66
1831,0.70
1832,0.71
1833,0.66
1834,0.56
1835,0.40
1836,0.22
1837,0.02
1838,-0.21
1839,-0.42
1840,-0.61
1841,-0.75
1842,-0.87
1843,-0.98
1844,-1.10
1845,-1.20
1846,-1.29
1847,-1.35
1848,-1.37
1849,-1.28
1850,-1.11
1851,-0.85
1852,-0.53
1853,-0.19
1854,0.16
1855,0.47
1856,0.75
1857,0.94
1858,1.08
1859,1.19
1860,1.36
1861,1.59
1862,1.90
1863,2.26
1864,2.66
1865,3.08
1866,3.48
1867,3.80
1868,4.02
1869,4.13
1870,4.17
1871,4.17
1872,4.14
1873,4.10
1874,4.07
1875,4.04
1876,4.04
1877,4.04
1878,4.03
1879,3.97
1880,3.86
1881,3.75
1882,3.63
1883,3.55
1884,3.50
1885,3.53
1886,3.61
1887,3.72
1888,3.78
1889,3.76
1890,3.67
1891,3.52
1892,3.34
1893,3.12
1894,2.88
1895,2.69
1896,2.55
1897,2.47
1898,2.44
1899,2.43
1900,2.39
1901,2.32
1902,2.18
1903,1.99
1904,1.72
1905,1.43
1906,1.10
1907,0.76
1908,0.40
1909,0.03
1910,-0.37
1911,-0.81
1912,-1.30
1913,-1.79
1914,-2.26
1915,-2.67
1916,-3.04
1917,-3.36
1918,-3.63
1919,-3.82
1920,-3.95
1921,-4.01
1922,-4.01
1923,-3.95
1924,-3.81
1925,-3.57
1926,-3.25
1927,-2.91
1928,-2.59
1929,-2.33
1930,-2.12
1931,-2.01
1932,-2.01
1933,-2.07
1934,-2.13
1935,-2.17
1936,-2.22
1937,-2.28
1938,-2.31
1939,-2.30
1940,-2.25
1941,-2.20
1942,-2.16
1943,-2.08
1944,-1.98
1945,-1.85
1946,-1.72
1947,-1.59
1948,-1.43
1949,-1.30
1950,-1.18
1951,-1.14
1952,-1.18
1953,-1.29
1954,-1.43
1955,-1.56
1956,-1.61
1957,-1.60
1958,-1.49
1959,-1.30
1960,-0.99
1961,-0.60
1962,-0.12
1963,0.34
1964,0.75
1965,1.05
1966,1.30
1967,1.49
1968,1.66
1969,1.82
1970,1.98
1971,2.14
1972,2.30
1973,2.44
1974,2.53
1975,2.56
1976,2.51
1977,2.41
1978,2.24
1979,2.04
1980,1.85
1981,1.69
1982,1.53
1983,1.33
1984,1.11
1985,0.92
1986,0.72
1987,0.56
1988,0.37
1989,0.17
1990,-0.03
1991,-0.18
1992,-0.30
1993,-0.40
1994,-0.52
1995,-0.65
1996,-0.81
1997,-0.98
1998,-1.21
1999,-1.44
2000,-1.66
2001,-1.82
2002,-1.93
2003,-1.96
2004,-1.90
2005,-1.74
2006,-1.53
2007,-1.29
2008,-1.09
2009,-0.95
2010,-0.92
2011,-1.01
2012,-1.24
2013,-1.54
2014,-1.88
2015,-2.21
2016,-2.56
2017,-2.91
2018,-3.29
2019,-3.66
2020,-4.03
2021,-4.36
2022,-4.70
2023,-5.04
2024,-5.39
2025,-5.70
2026,-5.96
2027,-6.13
2028,-6.26
2029,-6.32
2030,-6.27
2031,-6.12
2032,-5.87
2033,-5.57
2034,-5.23
2035,-4.92
2036,-4.64
2037,-4.41
2038,-4.17
2039,-3.92
2040,-3.62
2041,-3.31
2042,-2.94
2043,-2.56
2044,-2.14
2045,-1.75
2046,-1.43
2047,-1.21
2048,-1.14
2049,-1.18
2050,-1.28
2051,-1.38
2052,-1.48
2053,-1.58
2054,-1.69
2055,-1.83
2056,-2.01
2057,-2.25
2058,-2.52
2059,-2.78
2060,-3.01
2061,-3.15
2062,-3.17
2063,-3.07
2064,-2.88
2065,-2.63
2066,-2.39
2067,-2.19
2068,-2.04
2069,-1.95
2070,-1.88
2071,-1.79
2072,-1.70
2073,-1.59
2074,-1.43
2075,-1.23
2076,-0.98
2077,-0.75
2078,-0.57
2079,-0.47
2080,-0.42
2081,-0.42
2082,-0.50
2083,-0.67
2084,-0.92
2085,-1.16
2086,-1.38
2087,-1.53
2088,-1.63
2089,-1.66
2090,-1.68
2091,-1.71
2092,-1.81
2093,-1.99
2094,-2.33
2095,-2.78
2096,-3.36
2097,-3.97
2098,-4.60
2099,-5.17
2100,-5.68
2101,-6.07
2102,-6.39
2103,-6.65
2104,-6.94
2105,-7.25
2106,-7.60
2107,-7.91
2108,-8.19
2109,-8.42
2110,-8.63
2111,-8.79
2112,-8.90
2113,-8.96
2114,-8.99
2115,-9.00
2116,-9.03
2117,-9.04
2118,-9.06
2119,-9.03
2120,-8.98
2121,-8.90
2122,-8.80
2123,-8.68
2124,-8.53
2125,-8.37
2126,-8.22
2127,-8.09
2128,-7.92
2129,-7.73
2130,-7.51
2131,-7.32
2132,-7.13
2133,-6.95
2134,-6.80
2135,-6.72
2136,-6.71
2137,-6.81
2138,-6.95
2139,-7.16
2140,-7.39
2141,-7.63
2142,-7.84
2143,-8.00
2144,-8.09
2145,-8.10
2146,-7.98
2147,-7.74
2148,-7.42
2149,-7.06
2150,-6.68
2151,-6.33
2152,-5.99
2153,-5.68
2154,-5.38
2155,-5.10
2156,-4.82
2157,-4.57
2158,-4.34
2159,-4.14
2160,-3.94
2161,-3.75
2162,-3.56
2163,-3.40
2164,-3.28
2165,-3.18
2166,-3.08
2167,-3.01
2168,-2.97
2169,-2.99
2170,-3.04
2171,-3.08
2172,-3.11
2173,-3.13
2174,-3.14
2175,-3.16
2176,-3.20
2177,-3.26
2178,-3.34
2179,-3.46
2180,-3.62
2181,-3.82
2182,-4.04
2183,-4.23
2184,-4.35
2185,-4.38
2186,-4.34
2187,-4.23
2188,-4.10
2189,-3.98
2190,-3.90
2191,-3.86
2192,-3.87
2193,-3.91
2194,-3.96
2195,-3.98
2196,-3.94
2197,-3.82
2198,-3.62
2199,-3.37
2200,-3.07
2201,-2.74
2202,-2.43
2203,-2.22
2204,-2.11
2205,-2.10
2206,-2.12
2207,-2.14
2208,-2.14
2209,-2.11
2210,-2.03
2211,-1.91
2212,-1.72
2213,-1.53
2214,-1.37
2215,-1.31
2216,-1.34
2217,-1.43
2218,-1.52
2219,-1.55
2220,-1.46
2221,-1.27
2222,-0.96
2223,-0.60
2224,-0.20
2225,0.20
2226,0.58
2227,0.91
2228,1.21
2229,1.48
2230,1.76
2231,2.03
2232,2.33
2233,2.62
2234,2.92
2235,3.17
2236,3.39
2237,3.53
2238,3.66
2239,3.78
2240,3.90
2241,4.00
2242,4.05
2243,4.07
2244,4.09
2245,4.14
2246,4.25
2247,4.38
2248,4.57
2249,4.81
2250,5.09
2251,5.35
2252,5.55
2253,5.68
2254,5.71
2255,5.66
2256,5.57
2257,5.45
2258,5.32
2259,5.20
2260,5.10
2261,5.03
2262,4.94
2263,4.89
2264,4.86
2265,4.87
2266,4.85
2267,4.80
2268,4.70
2269,4.61
2270,4.50
2271,4.39
2272,4.23
2273,4.06
2274,3.87
2275,3.68
2276,3.43
2277,3.12
2278,2.74
2279,2.35
2280,1.94
2281,1.56
2282,1.21
2283,0.95
2284,0.72
2285,0.52
2286,0.24
2287,-0.11
2288,-0.54
2289,-0.98
2290,-1.42
2291,-1.79
2292,-2.10
2293,-2.29
2294,-2.40
2295,-2.44
2296,-2.50
2297,-2.59
2298,-2.75
2299,-2.97
2300,-3.25
2301,-3.52
2302,-3.78
2303,-3.97
2304,-4.14
2305,-4.30
2306,-4.43
2307,-4.55
2308,-4.68
2309,-4.81
2310,-4.96
2311,-5.10
2312,-5.24
2313,-5.39
2314,-5.57
2315,-5.79
2316,-6.07
2317,-6.34
2318,-6.58
2319,-6.74
2320,-6.85
2321,-6.89
2322,-6.82
2323,-6.68
2324,-6.52
2325,-6.44
2326,-6.45
2327,-6.55
2328,-6.66
2329,-6.74
2330,-6.74
2331,-6.62
2332,-6.39
2333,-6.04
2334,-5.62
2335,-5.18
2336,-4.77
2337,-4.45
2338,-4.23
2339,-4.13
2340,-4.07
2341,-4.01
2342,-3.90
2343,-3.75
2344,-3.57
2345,-3.41
2346,-3.26
2347,-3.14
2348,-3.07
2349,-3.07
2350,-3.15
2351,-3.29
2352,-3.46
2353,-3.63
2354,-3.84
2355,-4.05
2356,-4.28
2357,-4.49
2358,-4.71
2359,-4.92
2360,-5.19
2361,-5.47
2362,-5.81
2363,-6.16
2364,-6.56
2365,-6.95
2366,-7.32
2367,-7.64
2368,-7.92
2369,-8.13
2370,-8.29
2371,-8.40
2372,-8.53
2373,-8.65
2374,-8.80
2375,-8.96
2376,-9.16
2377,-9.35
2378,-9.54
2379,-9.67
2380,-9.79
2381,-9.91
2382,-10.13
2383,-10.43
2384,-10.86
2385,-11.37
2386,-12.01
2387,-12.67
2388,-13.31
2389,-13.85
2390,-14.33
2391,-14.71
2392,-15.03
2393,-15.25
2394,-15.47
2395,-15.69
2396,-15.99
2397,-16.32
2398,-16.71
2399,-17.07
2400,-17.44
2401,-17.75
2402,-18.05
2403,-18.32
2404,-18.58
2405,-18.81
2406,-19.05
2407,-19.28
2408,-19.53
2409,-19.75
2410,-19.93
2411,-20.00
2412,-19.99
2413,-19.91
2414,-19.79
2415,-19.67
2416,-19.55
2417,-19.46
2418,-19.38
2419,-19.31
2420,-19.18
2421,-19.00
2422,-18.69
2423,-18.30
2424,-17.80
2425,-17.26
2426,-16.65
2427,-16.09
2428,-15.52
2429,-15.00
2430,-14.48
2431,-13.99
2432,-13.48
2433,-13.01
2434,-12.50
2435,-12.05
2436,-11.52
2437,-10.99
2438,-10.38
2439,-9.76
2440,-9.02
2441,-8.25
2442,-7.42
2443,-6.65
2444,-5.89
2445,-5.22
2446,-4.57
2447,-4.03
2448,-3.51
2449,-3.04
2450,-2.59
2451,-2.17
2452,-1.79
2453,-1.48
2454,-1.24
2455,-1.13
2456,-1.11
2457,-1.17
2458,-1.30
2459,-1.49
2460,-1.69
2461,-1.87
2462,-2.02
2463,-2.14
2464,-2.22
2465,-2.27
2466,-2.28
2467,-2.25
2468,-2.18
2469,-2.06
2470,-1.92
2471,-1.81
2472,-1.70
2473,-1.63
2474,-1.57
2475,-1.57
2476,-1.63
2477,-1.69
2478,-1.72
2479,-1.70
2480,-1.63
2481,-1.53
2482,-1.42
2483,-1.28
2484,-1.10
2485,-0.90
2486,-0.70
2487,-0.53
2488,-0.35
2489,-0.15
2490,0.08
2491,0.31
2492,0.54
2493,0.72
2494,0.85
2495,0.92
2496,0.95
2497,0.93
2498,0.86
2499,0.76
2500,0.66
2501,0.57
2502,0.51
2503,0.47
2504,0.47
2505,0.53
2506,0.66
2507,0.83
2508,1.05
2509,1.27
2510,1.46
2511,1.61
2512,1.70
2513,1.71
2514,1.66
2515,1.59
2516,1.58
2517,1.61
2518,1.71
2519,1.87
2520,2.11
2521,2.40
2522,2.72
2523,3.02
2524,3.30
2525,3.56
2526,3.80
2527,3.99
2528,4.15
2529,4.26
2530,4.36
2531,4.42
2532,4.43
2533,4.41
2534,4.38
2535,4.37
2536,4.43
2537,4.52
2538,4.67
2539,4.85
2540,5.05
2541,5.25
2542,5.43
2543,5.57
2544,5.65
2545,5.67
2546,5.65
2547,5.60
2548,5.57
2549,5.55
2550,5.55
2551,5.59
2552,5.65
2553,5.74
2554,5.82
2555,5.86
2556,5.83
2557,5.73
2558,5.58
2559,5.42
2560,5.27
2561,5.13
2562,5.00
2563,4.91
2564,4.87
2565,4.91
2566,4.99
2567,5.09
2568,5.13
2569,5.10
2570,4.94
2571,4.65
2572,4.20
2573,3.65
2574,2.99
2575,2.32
2576,1.64
2577,1.03
2578,0.47
2579,-0.01
2580,-0.49
2581,-0.95
2582,-1.45
2583,-1.93
2584,-2.45
2585,-2.94
2586,-3.41
2587,-3.73
2588,-3.94
2589,-4.03
2590,-4.10
2591,-4.14
2592,-4.19
2593,-4.24
2594,-4.39
2595,-4.59
2596,-4.85
2597,-5.11
2598,-5.40
2599,-5.69
2600,-5.97
2601,-6.19
2602,-6.36
2603,-6.49
2604,-6.61
2605,-6.67
2606,-6.66
2607,-6.58
2608,-6.45
2609,-6.28
2610,-6.10
2611,-5.94
2612,-5.84
2613,-5.81
2614,-5.87
2615,-6.03
2616,-6.27
2617,-6.54
2618,-6.77
2619,-6.97
2620,-7.09
2621,-7.16
2622,-7.20
2623,-7.23
2624,-7.24
2625,-7.27
2626,-7.25
2627,-7.16
2628,-6.95
2629,-6.65
2630,-6.21
2631,-5.68
2632,-5.02
2633,-4.30
2634,-3.49
2635,-2.71
2636,-1.92
2637,-1.22
2638,-0.56
2639,0.01
2640,0.53
2641,0.92
2642,1.27
2643,1.55
2644,1.87
2645,2.19
2646,2.57
2647,2.95
2648,3.39
2649,3.82
2650,4.26
2651,4.60
2652,4.79
2653,4.80
2654,4.69
2655,4.50
2656,4.27
2657,4.04
2658,3.82
2659,3.66
2660,3.55
2661,3.45
2662,3.34
2663,3.24
2664,3.17
2665,3.13
2666,3.12
2667,3.14
2668,3.19
2669,3.25
2670,3.30
2671,3.33
2672,3.31
2673,3.24
2674,3.15
2675,3.07
2676,3.04
2677,3.07
2678,3.11
2679,3.16
2680,3.18
2681,3.17
2682,3.05
2683,2.83
2684,2.46
2685,2.01
2686,1.45
2687,0.86
2688,0.24
2689,-0.34
2690,-0.85
2691,-1.26
2692,-1.59
2693,-1.86
2694,-2.14
2695,-2.40
2696,-2.69
2697,-2.98
2698,-3.24
2699,-3.46
2700,-3.59
2701,-3.62
2702,-3.53
2703,-3.36
2704,-3.15
2705,-2.91
2706,-2.66
2707,-2.43
2708,-2.20
2709,-1.98
2710,-1.78
2711,-1.62
2712,-1.50
2713,-1.42
2714,-1.37
2715,-1.34
2716,-1.28
2717,-1.21
2718,-1.10
2719,-0.98
2720,-0.85
2721,-0.76
2722,-0.70
2723,-0.70
2724,-0.74
2725,-0.81
2726,-0.86
2727,-0.89
2728,-0.85
2729,-0.72
2730,-0.54
2731,-0.36
2732,-0.21
2733,-0.14
2734,-0.11
2735,-0.10
2736,-0.06
2737,-0.01
2738,0.07
2739,0.17
2740,0.31
2741,0.47
2742,0.63
2743,0.79
2744,0.95
2745,1.13
2746,1.32
2747,1.53
2748,1.71
2749,1.88
2750,1.99
2751,2.05
2752,2.04
2753,1.98
2754,1.80
2755,1.54
2756,1.21
2757,0.85
2758,0.50
2759,0.16
2760,-0.17
2761,-0.47
2762,-0.72
2763,-0.87
2764,-0.95
2765,-0.96
2766,-0.95
2767,-0.92
2768,-0.95
2769,-1.00
2770,-1.08
2771,-1.18
2772,-1.30
2773,-1.40
2774,-1.46
2775,-1.49
2776,-1.56
2777,-1.67
2778,-1.82
2779,-1.96
2780,-2.12
2781,-2.29
2782,-2.48
2783,-2.69
2784,-2.91
2785,-3.14
2786,-3.36
2787,-3.54
2788,-3.72
2789,-3.88
2790,-3.98
2791,-4.01
2792,-3.94
2793,-3.84
2794,-3.73
2795,-3.65
2796,-3.61
2797,-3.65
2798,-3.77
2799,-3.94
2800,-4.09
2801,-4.19
2802,-4.21
2803,-4.20
2804,-4.15
2805,-4.07
2806,-3.94
2807,-3.82
2808,-3.76
2809,-3.74
2810,-3.71
2811,-3.64
2812,-3.52
2813,-3.43
2814,-3.32
2815,-3.21
2816,-3.07
2817,-2.94
2818,-2.78
2819,-2.64
2820,-2.44
2821,-2.21
2822,-1.92
2823,-1.59
2824,-1.21
2825,-0.83
2826,-0.47
2827,-0.18
2828,0.07
2829,0.29
2830,0.50
2831,0.67
2832,0.81
2833,0.91
2834,0.99
2835,1.05
2836,1.06
2837,0.95
2838,0.76
2839,0.52
2840,0.27
2841,0.08
2842,-0.07
2843,-0.12
2844,-0.11
2845,-0.05
2846,0.02
2847,0.07
2848,0.07
2849,0.01
2850,-0.13
2851,-0.33
2852,-0.55
2853,-0.73
2854,-0.85
2855,-0.92
2856,-0.92
2857,-0.83
2858,-0.66
2859,-0.41
2860,-0.16
2861,0.08
2862,0.32
2863,0.54
2864,0.70
2865,0.76
2866,0.72
2867,0.58
2868,0.36
2869,0.08
2870,-0.25
2871,-0.61
2872,-0.98
2873,-1.31
2874,-1.63
2875,-1.91
2876,-2.23
2877,-2.58
2878,-3.00
2879,-3.43
2880,-3.88
2881,-4.27
2882,-4.60
2883,-4.81
2884,-4.92
2885,-4.89
2886,-4.77
2887,-4.60
2888,-4.47
2889,-4.40
2890,-4.42
2891,-4.52
2892,-4.72
2893,-4.95
2894,-5.17
2895,-5.34
2896,-5.48
2897,-5.61
2898,-5.72
2899,-5.83
2900,-5.94
2901,-6.06
2902,-6.14
2903,-6.15
2904,-6.08
2905,-5.94
2906,-5.73
2907,-5.46
2908,-5.20
2909,-4.99
2910,-4.89
2911,-4.90
2912,-4.96
2913,-5.03
2914,-5.06
2915,-5.05
2916,-4.96
2917,-4.81
2918,-4.56
2919,-4.26
2920,-3.92
2921,-3.57
2922,-3.20
2923,-2.82
2924,-2.43
2925,-2.04
2926,-1.63
2927,-1.28
2928,-0.98
2929,-0.74
2930,-0.55
2931,-0.41
2932,-0.33
2933,-0.31
2934,-0.34
2935,-0.39
2936,-0.40
2937,-0.37
2938,-0.37
2939,-0.40
2940,-0.48
2941,-0.56
2942,-0.65
2943,-0.74
2944,-0.86
2945,-0.98
2946,-1.08
2947,-1.12
2948,-1.09
2949,-1.01
2950,-0.92
2951,-0.81
2952,-0.72
2953,-0.65
2954,-0.66
2955,-0.76
2956,-0.94
2957,-1.16
2958,-1.39
2959,-1.61
2960,-1.84
2961,-2.05
2962,-2.23
2963,-2.35
2964,-2.42
2965,-2.43
2966,-2.42
2967,-2.36
2968,-2.27
2969,-2.18
2970,-2.12
2971,-2.08
2972,-2.08
2973,-2.11
2974,-2.20
2975,-2.36
2976,-2.59
2977,-2.87
2978,-3.15
2979,-3.39
2980,-3.60
2981,-3.79
2982,-3.98
2983,-4.16
2984,-4.33
2985,-4.51
2986,-4.73
2987,-4.98
2988,-5.26
2989,-5.52
2990,-5.77
2991,-5.97
2992,-6.07
2993,-6.10
2994,-6.06
2995,-5.98
2996,-5.83
2997,-5.59
2998,-5.29
2999,-4.99
3000,-4.71
3001,-4.44
3002,-4.11
3003,-3.75
3004,-3.33
3005,-2.94
3006,-2.55
3007,-2.19
3008,-1.86
3009,-1.59
3010,-1.37
3011,-1.21
3012,-1.11
3013,-1.14
3014,-1.27
3015,-1.47
3016,-1.69
3017,-1.94
3018,-2.21
3019,-2.47
3020,-2.66
3021,-2.72
3022,-2.69
3023,-2.59
3024,-2.40
3025,-2.17
3026,-1.91
3027,-1.69
3028,-1.50
3029,-1.37
3030,-1.27
3031,-1.17
3032,-1.05
3033,-0.91
3034,-0.76
3035,-0.65
3036,-0.57
3037,-0.53
3038,-0.52
3039,-0.56
3040,-0.66
3041,-0.77
3042,-0.80
3043,-0.72
3044,-0.56
3045,-0.35
3046,-0.11
3047,0.15
3048,0.38
3049,0.56
3050,0.60
3051,0.53
3052,0.30
3053,-0.07
3054,-0.60
3055,-1.24
3056,-1.98
3057,-2.73
3058,-3.45
3059,-4.07
3060,-4.58
3061,-4.97
3062,-5.26
3063,-5.42
3064,-5.52
3065,-5.55
3066,-5.57
3067,-5.58
3068,-5.65
3069,-5.72
3070,-5.79
3071,-5.79
3072,-5.72
3073,-5.60
3074,-5.43
3075,-5.23
3076,-5.01
3077,-4.78
3078,-4.52
3079,-4.26
3080,-4.00
3081,-3.75
3082,-3.51
3083,-3.29
3084,-3.05
3085,-2.84
3086,-2.67
3087,-2.59
3088,-2.57
3089,-2.54
3090,-2.45
3091,-2.31
3092,-2.13
3093,-1.93
3094,-1.71
3095,-1.48
3096,-1.31
3097,-1.27
3098,-1.40
3099,-1.66
3100,-2.00
3101,-2.37
3102,-2.74
3103,-3.07
3104,-3.31
3105,-3.44
3106,-3.47
3107,-3.40
3108,-3.23
3109,-2.98
3110,-2.68
3111,-2.36
3112,-2.01
3113,-1.63
3114,-1.25
3115,-0.93
3116,-0.68
3117,-0.53
3118,-0.45
3119,-0.43
3120,-0.43
3121,-0.44
3122,-0.43
3123,-0.42
3124,-0.37
3125,-0.29
3126,-0.18
3127,-0.05
3128,0.04
3129,0.12
3130,0.21
3131,0.31
3132,0.40
3133,0.49
3134,0.55
3135,0.55
3136,0.44
3137,0.21
3138,-0.14
3139,-0.56
3140,-1.05
3141,-1.52
3142,-1.95
3143,-2.28
3144,-2.56
3145,-2.77
3146,-2.92
3147,-3.00
3148,-3.05
3149,-3.07
3150,-3.11
3151,-3.14
3152,-3.23
3153,-3.33
3154,-3.50
3155,-3.68
3156,-3.95
3157,-4.26
3158,-4.63
3159,-5.02
3160,-5.49
3161,-5.99
3162,-6.54
3163,-7.05
3164,-7.55
3165,-7.99
3166,-8.43
3167,-8.83
3168,-9.25
3169,-9.64
3170,-10.03
3171,-10.34
3172,-10.62
3173,-10.83
3174,-11.08
3175,-11.34
3176,-11.70
3177,-12.11
3178,-12.58
3179,-13.08
3180,-13.61
3181,-14.10
3182,-14.53
3183,-14.84
3184,-15.08
3185,-15.23
3186,-15.33
3187,-15.35
3188,-15.37
3189,-15.43
3190,-15.56
3191,-15.70
3192,-15.79
3193,-15.79
3194,-15.72
3195,-15.60
3196,-15.42
3197,-15.19
3198,-14.92
3199,-14.63
3200,-14.34
3201,-14.10
3202,-13.87
3203,-13.66
3204,-13.39
3205,-13.07
3206,-12.66
3207,-12.20
3208,-11.59
3209,-10.89
3210,-10.06
3211,-9.22
3212,-8.32
3213,-7.46
3214,-6.59
3215,-5.81
3216,-5.10
3217,-4.51
3218,-3.98
3219,-3.57
3220,-3.20
3221,-2.91
3222,-2.64
3223,-2.40
3224,-2.13
3225,-1.86
3226,-1.55
3227,-1.26
3228,-0.97
3229,-0.72
3230,-0.47
3231,-0.24
3232,0.01
3233,0.21
3234,0.31
3235,0.34
3236,0.30
3237,0.18
3238,-0.08
3239,-0.47
3240,-0.96
3241,-1.49
3242,-2.02
3243,-2.51
3244,-2.94
3245,-3.23
3246,-3.43
3247,-3.51
3248,-3.54
3249,-3.55
3250,-3.63
3251,-3.75
3252,-3.94
3253,-4.14
3254,-4.40
3255,-4.71
3256,-5.07
3257,-5.42
3258,-5.78
3259,-6.16
3260,-6.55
3261,-6.88
3262,-7.16
3263,-7.38
3264,-7.57
3265,-7.70
3266,-7.77
3267,-7.76
3268,-7.73
3269,-7.70
3270,-7.71
3271,-7.77
3272,-7.90
3273,-8.12
3274,-8.43
3275,-8.78
3276,-9.14
3277,-9.48
3278,-9.83
3279,-10.15
3280,-10.38
3281,-10.52
3282,-10.60
3283,-10.65
3284,-10.71
3285,-10.77
3286,-10.83
3287,-10.89
3288,-10.96
3289,-11.03
3290,-11.02
3291,-10.95
3292,-10.82
3293,-10.66
3294,-10.45
3295,-10.21
3296,-9.95
3297,-9.71
3298,-9.50
3299,-9.29
3300,-9.02
3301,-8.71
3302,-8.36
3303,-8.04
3304,-7.74
3305,-7.51
3306,-7.35
3307,-7.32
3308,-7.38
3309,-7.54
3310,-7.78
3311,-8.07
3312,-8.33
3313,-8.49
3314,-8.54
3315,-8.51
3316,-8.47
3317,-8.46
3318,-8.53
3319,-8.69
3320,-8.96
3321,-9.32
3322,-9.74
3323,-10.12
3324,-10.41
3325,-10.60
3326,-10.66
3327,-10.61
3328,-10.49
3329,-10.37
3330,-10.32
3331,-10.40
3332,-10.56
3333,-10.75
3334,-10.92
3335,-11.00
3336,-10.94
3337,-10.71
3338,-10.29
3339,-9.77
3340,-9.19
3341,-8.67
3342,-8.26
3343,-8.00
3344,-7.90
3345,-7.96
3346,-8.08
3347,-8.23
3348,-8.33
3349,-8.38
3350,-8.36
3351,-8.35
3352,-8.33
3353,-8.33
3354,-8.34
3355,-8.34
3356,-8.34
3357,-8.32
3358,-8.26
3359,-8.16
3360,-8.03
3361,-7.91
3362,-7.83
3363,-7.77
3364,-7.72
3365,-7.68
3366,-7.64
3367,-7.59
3368,-7.48
3369,-7.32
3370,-7.15
3371,-7.05
3372,-7.03
3373,-7.07
3374,-7.14
3375,-7.25
3376,-7.38
3377,-7.52
3378,-7.61
3379,-7.62
3380,-7.54
3381,-7.43
3382,-7.35
3383,-7.29
3384,-7.25
3385,-7.23
3386,-7.25
3387,-7.32
3388,-7.45
3389,-7.58
3390,-7.66
3391,-7.71
3392,-7.71
3393,-7.67
3394,-7.58
3395,-7.46
3396,-7.32
3397,-7.17
3398,-6.94
3399,-6.63
3400,-6.25
3401,-5.84
3402,-5.42
3403,-5.01
3404,-4.62
3405,-4.35
3406,-4.19
3407,-4.16
3408,-4.18
3409,-4.23
3410,-4.26
3411,-4.22
3412,-4.08
3413,-3.86
3414,-3.61
3415,-3.38
3416,-3.23
3417,-3.16
3418,-3.22
3419,-3.42
3420,-3.75
3421,-4.16
3422,-4.55
3423,-4.90
3424,-5.20
3425,-5.45
3426,-5.65
3427,-5.81
3428,-5.96
3429,-6.13
3430,-6.34
3431,-6.56
3432,-6.78
3433,-6.96
3434,-7.10
3435,-7.19
3436,-7.29
3437,-7.38
3438,-7.48
3439,-7.62
3440,-7.82
3441,-8.06
3442,-8.29
3443,-8.45
3444,-8.54
3445,-8.49
3446,-8.32
3447,-8.03
3448,-7.71
3449,-7.41
3450,-7.13
3451,-6.92
3452,-6.77
3453,-6.68
3454,-6.59
3455,-6.48
3456,-6.28
3457,-6.05
3458,-5.79
3459,-5.55
3460,-5.31
3461,-5.10
3462,-4.93
3463,-4.84
3464,-4.76
3465,-4.70
3466,-4.59
3467,-4.44
3468,-4.20
3469,-3.91
3470,-3.56
3471,-3.20
3472,-2.85
3473,-2.54
3474,-2.24
3475,-1.98
3476,-1.79
3477,-1.66
3478,-1.52
3479,-1.34
3480,-1.05
3481,-0.72
3482,-0.31
3483,0.11
3484,0.59
3485,1.08
3486,1.60
3487,2.08
3488,2.49
3489,2.82
3490,3.12
3491,3.37
3492,3.58
3493,3.74
3494,3.88
3495,4.00
3496,4.07
3497,4.07
3498,4.02
3499,3.96
3500,3.88
3501,3.76
3502,3.59
3503,3.40
3504,3.18
3505,3.01
3506,2.88
3507,2.78
3508,2.69
3509,2.66
3510,2.66
3511,2.71
3512,2.75
3513,2.75
3514,2.69
3515,2.59
3516,2.49
3517,2.43
3518,2.40
3519,2.45
3520,2.54
3521,2.66
3522,2.72
3523,2.70
3524,2.59
3525,2.41
3526,2.19
3527,2.00
3528,1.82
3529,1.71
3530,1.63
3531,1.57
3532,1.41
3533,1.11
3534,0.59
3535,-0.14
3536,-1.11
3537,-2.14
3538,-3.17
3539,-4.05
3540,-4.81
3541,-5.39
3542,-5.85
3543,-6.17
3544,-6.45
3545,-6.71
3546,-7.05
3547,-7.40
3548,-7.77
3549,-8.04
3550,-8.22
3551,-8.25
3552,-8.18
3553,-8.03
3554,-7.85
3555,-7.67
3556,-7.51
3557,-7.42
3558,-7.36
3559,-7.34
3560,-7.28
3561,-7.13
3562,-6.87
3563,-6.53
3564,-6.18
3565,-5.83
3566,-5.49
3567,-5.18
3568,-4.94
3569,-4.80
3570,-4.71
3571,-4.65
3572,-4.66
3573,-4.73
3574,-4.85
3575,-4.99
3576,-5.18
3577,-5.43
3578,-5.76
3579,-6.13
3580,-6.50
3581,-6.85
3582,-7.19
3583,-7.48
3584,-7.74
3585,-7.96
3586,-8.16
3587,-8.36
3588,-8.54
3589,-8.71
3590,-8.85
3591,-8.93
3592,-8.91
3593,-8.77
3594,-8.52
3595,-8.22
3596,-7.90
3597,-7.61
3598,-7.32
3599,-7.07
3600,-6.83
3601,-6.60
3602,-6.34
3603,-6.05
3604,-5.68
3605,-5.26
3606,-4.82
3607,-4.43
3608,-4.08
3609,-3.81
3610,-3.59
3611,-3.40
3612,-3.20
3613,-2.96
3614,-2.65
3615,-2.30
3616,-1.93
3617,-1.63
3618,-1.41
3619,-1.30
3620,-1.27
3621,-1.37
3622,-1.52
3623,-1.69
3624,-1.79
3625,-1.79
3626,-1.69
3627,-1.53
3628,-1.32
3629,-1.10
3630,-0.90
3631,-0.73
3632,-0.62
3633,-0.56
3634,-0.57
3635,-0.63
3636,-0.73
3637,-0.86
3638,-1.05
3639,-1.28
3640,-1.59
3641,-1.93
3642,-2.37
3643,-2.85
3644,-3.41
3645,-3.97
3646,-4.62
3647,-5.27
3648,-6.00
3649,-6.72
3650,-7.51
3651,-8.26
3652,-9.04
3653,-9.77
3654,-10.56
3655,-11.31
3656,-12.09
3657,-12.81
3658,-13.55
3659,-14.24
3660,-14.96
3661,-15.60
3662,-16.24
3663,-16.80
3664,-17.35
3665,-17.81
3666,-18.21
3667,-18.51
3668,-18.74
3669,-18.85
3670,-18.84
3671,-18.68
3672,-18.39
3673,-18.06
3674,-17.66
3675,-17.23
3676,-16.74
3677,-16.24
3678,-15.69
3679,-15.14
3680,-14.53
3681,-13.91
3682,-13.25
3683,-12.65
3684,-12.03
3685,-11.46
3686,-10.84
3687,-10.25
3688,-9.58
3689,-8.90
3690,-8.15
3691,-7.42
3692,-6.71
3693,-6.10
3694,-5.56
3695,-5.17
3696,-4.86
3697,-4.66
3698,-4.45
3699,-4.23
3700,-3.94
3701,-3.63
3702,-3.26
3703,-2.91
3704,-2.61
3705,-2.43
3706,-2.36
3707,-2.36
3708,-2.43
3709,-2.55
3710,-2.71
3711,-2.87
3712,-3.01
3713,-3.12
3714,-3.26
3715,-3.43
3716,-3.66
3717,-3.94
3718,-4.26
3719,-4.62
3720,-4.98
3721,-5.29
3722,-5.51
3723,-5.62
3724,-5.65
3725,-5.62
3726,-5.50
3727,-5.34
3728,-5.17
3729,-5.00
3730,-4.86
3731,-4.71
3732,-4.49
3733,-4.23
3734,-3.89
3735,-3.53
3736,-3.14
3737,-2.76
3738,-2.43
3739,-2.20
3740,-2.03
3741,-1.91
3742,-1.74
3743,-1.51
3744,-1.17
3745,-0.73
3746,-0.22
3747,0.30
3748,0.78
3749,1.14
3750,1.37
3751,1.43
3752,1.40
3753,1.32
3754,1.23
3755,1.14
3756,1.07
3757,1.00
3758,0.89
3759,0.75
3760,0.50
3761,0.15
3762,-0.26
3763,-0.66
3764,-1.02
3765,-1.33
3766,-1.63
3767,-1.91
3768,-2.16
3769,-2.33
3770,-2.44
3771,-2.48
3772,-2.46
3773,-2.38
3774,-2.23
3775,-2.03
3776,-1.81
3777,-1.61
3778,-1.43
3779,-1.26
3780,-1.06
3781,-0.87
3782,-0.66
3783,-0.42
3784,-0.12
3785,0.21
3786,0.55
3787,0.83
3788,1.05
3789,1.17
3790,1.24
3791,1.24
3792,1.21
3793,1.14
3794,1.06
3795,0.96
3796,0.87
3797,0.81
3798,0.79
3799,0.83
3800,0.91
3801,0.99
3802,1.06
3803,1.08
3804,1.03
3805,0.90
3806,0.67
3807,0.40
3808,0.07
3809,-0.24
3810,-0.54
3811,-0.79
3812,-1.04
3813,-1.27
3814,-1.53
3815,-1.79
3816,-2.11
3817,-2.40
3818,-2.68
3819,-2.86
3820,-3.00
3821,-3.03
3822,-3.07
3823,-3.13
3824,-3.33
3825,-3.65
3826,-4.14
3827,-4.74
3828,-5.46
3829,-6.23
3830,-7.03
3831,-7.75
3832,-8.45
3833,-9.06
3834,-9.66
3835,-10.16
3836,-10.63
3837,-11.03
3838,-11.44
3839,-11.79
3840,-12.08
3841,-12.30
3842,-12.48
3843,-12.63
3844,-12.76
3845,-12.82
3846,-12.82
3847,-12.75
3848,-12.64
3849,-12.50
3850,-12.36
3851,-12.24
3852,-12.12
3853,-12.05
3854,-12.02
3855,-12.02
3856,-12.00
3857,-11.98
3858,-11.93
3859,-11.88
3860,-11.74
3861,-11.53
3862,-11.25
3863,-10.96
3864,-10.60
3865,-10.19
3866,-9.73
3867,-9.29
3868,-8.90
3869,-8.59
3870,-8.32
3871,-8.07
3872,-7.81
3873,-7.61
3874,-7.40
3875,-7.23
3876,-7.04
3877,-6.86
3878,-6.63
3879,-6.37
3880,-5.99
3881,-5.52
3882,-4.94
3883,-4.34
3884,-3.77
3885,-3.27
3886,-2.85
3887,-2.56
3888,-2.40
3889,-2.39
3890,-2.43
3891,-2.53
3892,-2.66
3893,-2.82
3894,-3.02
3895,-3.25
3896,-3.52
3897,-3.83
3898,-4.18
3899,-4.52
3900,-4.84
3901,-5.10
3902,-5.29
3903,-5.39
3904,-5.49
3905,-5.55
3906,-5.65
3907,-5.76
3908,-5.93
3909,-6.10
3910,-6.26
3911,-6.39
3912,-6.48
3913,-6.53
3914,-6.55
3915,-6.52
3916,-6.52
3917,-6.55
3918,-6.64
3919,-6.76
3920,-6.90
3921,-7.05
3922,-7.15
3923,-7.17
3924,-7.10
3925,-6.96
3926,-6.77
3927,-6.57
3928,-6.39
3929,-6.23
3930,-6.07
3931,-5.98
3932,-5.97
3933,-6.02
3934,-6.10
3935,-6.19
3936,-6.29
3937,-6.38
3938,-6.45
3939,-6.48
3940,-6.45
3941,-6.41
3942,-6.37
3943,-6.35
3944,-6.37
3945,-6.45
3946,-6.58
3947,-6.75
3948,-6.92
3949,-7.09
3950,-7.21
3951,-7.26
3952,-7.17
3953,-7.00
3954,-6.76
3955,-6.48
3956,-6.13
3957,-5.74
3958,-5.33
3959,-4.96
3960,-4.55
3961,-4.17
3962,-3.81
3963,-3.51
3964,-3.23
3965,-2.94
3966,-2.62
3967,-2.32
3968,-2.04
3969,-1.82
3970,-1.61
3971,-1.44
3972,-1.34
3973,-1.35
3974,-1.46
3975,-1.63
3976,-1.85
3977,-2.10
3978,-2.37
3979,-2.65
3980,-2.89
3981,-3.07
3982,-3.21
3983,-3.32
3984,-3.43
3985,-3.57
3986,-3.77
3987,-4.00
3988,-4.26
3989,-4.49
3990,-4.71
3991,-4.87
3992,-4.96
3993,-4.95
3994,-4.90
3995,-4.83
3996,-4.78
3997,-4.78
3998,-4.84
3999,-4.96
4000,-5.12
4001,-5.27
4002,-5.44
4003,-5.59
4004,-5.75
4005,-5.88
4006,-6.01
4007,-6.12
4008,-6.26
4009,-6.43
4010,-6.67
4011,-6.96
4012,-7.36
4013,-7.84
4014,-8.42
4015,-9.03
4016,-9.71
4017,-10.36
4018,-10.95
4019,-11.40
4020,-11.76
4021,-12.05
4022,-12.33
4023,-12.61
4024,-12.97
4025,-13.39
4026,-13.85
4027,-14.27
4028,-14.60
4029,-14.78
4030,-14.80
4031,-14.68
4032,-14.43
4033,-14.13
4034,-13.83
4035,-13.60
4036,-13.40
4037,-13.25
4038,-13.10
4039,-12.95
4040,-12.77
4041,-12.60
4042,-12.41
4043,-12.31
4044,-12.24
4045,-12.23
4046,-12.19
4047,-12.15
4048,-12.06
4049,-11.89
4050,-11.54
4051,-11.08
4052,-10.53
4053,-10.00
4054,-9.52
4055,-9.16
4056,-8.90
4057,-8.83
4058,-8.88
4059,-9.02
4060,-9.15
4061,-9.26
4062,-9.28
4063,-9.24
4064,-9.08
4065,-8.87
4066,-8.58
4067,-8.32
4068,-8.05
4069,-7.80
4070,-7.51
4071,-7.18
4072,-6.79
4073,-6.35
4074,-5.84
4075,-5.33
4076,-4.85
4077,-4.48
4078,-4.17
4079,-3.95
4080,-3.78
4081,-3.69
4082,-3.61
4083,-3.54
4084,-3.46
4085,-3.42
4086,-3.42
4087,-3.46
4088,-3.52
4089,-3.56
4090,-3.58
4091,-3.53
4092,-3.43
4093,-3.28
4094,-3.16
4095,-3.13
4096,-3.25
4097,-3.54
4098,-4.04
4099,-4.71
4100,-5.54
4101,-6.40
4102,-7.23
4103,-7.89
4104,-8.42
4105,-8.79
4106,-9.06
4107,-9.22
4108,-9.36
4109,-9.51
4110,-9.74
4111,-10.00
4112,-10.32
4113,-10.61
4114,-10.90
4115,-11.15
4116,-11.39
4117,-11.62
4118,-11.89
4119,-12.16
4120,-12.44
4121,-12.69
4122,-12.95
4123,-13.19
4124,-13.38
4125,-13.47
4126,-13.51
4127,-13.52
4128,-13.56
4129,-13.60
4130,-13.71
4131,-13.88
4132,-14.17
4133,-14.52
4134,-14.91
4135,-15.29
4136,-15.69
4137,-16.07
4138,-16.45
4139,-16.78
4140,-17.11
4141,-17.42
4142,-17.72
4143,-18.01
4144,-18.29
4145,-18.52
4146,-18.68
4147,-18.78
4148,-18.86
4149,-18.88
4150,-18.86
4151,-18.78
4152,-18.70
4153,-18.65
4154,-18.65
4155,-18.69
4156,-18.78
4157,-18.91
4158,-19.01
4159,-19.08
4160,-19.09
4161,-19.05
4162,-18.96
4163,-18.86
4164,-18.78
4165,-18.76
4166,-18.78
4167,-18.84
4168,-18.86
4169,-18.83
4170,-18.69
4171,-18.46
4172,-18.11
4173,-17.72
4174,-17.28
4175,-16.85
4176,-16.42
4177,-16.08
4178,-15.85
4179,-15.76
4180,-15.75
4181,-15.79
4182,-15.86
4183,-15.95
4184,-16.01
4185,-16.01
4186,-15.94
4187,-15.83
4188,-15.75
4189,-15.76
4190,-15.92
4191,-16.22
4192,-16.67
4193,-17.20
4194,-17.80
4195,-18.36
4196,-18.84
4197,-19.20
4198,-19.44
4199,-19.59
4200,-19.69
4201,-19.75
4202,-19.79
4203,-19.78
4204,-19.74
4205,-19.64
4206,-19.49
4207,-19.29
4208,-19.05
4209,-18.81
4210,-18.58
4211,-18.39
4212,-18.22
4213,-18.07
4214,-17.85
4215,-17.57
4216,-17.18
4217,-16.75
4218,-16.27
4219,-15.78
4220,-15.26
4221,-14.82
4222,-14.42
4223,-14.11
4224,-13.82
4225,-13.56
4226,-13.28
4227,-12.99
4228,-12.61
4229,-12.16
4230,-11.63
4231,-11.09
4232,-10.57
4233,-10.12
4234,-9.74
4235,-9.48
4236,-9.28
4237,-9.18
4238,-9.08
4239,-9.00
4240,-8.84
4241,-8.61
4242,-8.28
4243,-7.90
4244,-7.51
4245,-7.16
4246,-6.81
4247,-6.53
4248,-6.30
4249,-6.17
4250,-6.06
4251,-5.94
4252,-5.74
4253,-5.51
4254,-5.20
4255,-4.85
4256,-4.44
4257,-4.01
4258,-3.53
4259,-3.04
4260,-2.53
4261,-2.06
4262,-1.62
4263,-1.22
4264,-0.83
4265,-0.49
4266,-0.18
4267,0.10
4268,0.40
4269,0.71
4270,1.03
4271,1.31
4272,1.55
4273,1.71
4274,1.76
4275,1.68
4276,1.47
4277,1.19
4278,0.88
4279,0.56
4280,0.22
4281,-0.11
4282,-0.43
4283,-0.72
4284,-1.05
4285,-1.39
4286,-1.80
4287,-2.21
4288,-2.64
4289,-3.03
4290,-3.40
4291,-3.72
4292,-3.99
4293,-4.22
4294,-4.45
4295,-4.65
4296,-4.79
4297,-4.82
4298,-4.76
4299,-4.61
4300,-4.44
4301,-4.24
4302,-4.10
4303,-4.07
4304,-4.25
4305,-4.64
4306,-5.23
4307,-5.93
4308,-6.72
4309,-7.51
4310,-8.25
4311,-8.83
4312,-9.25
4313,-9.48
4314,-9.62
4315,-9.67
4316,-9.74
4317,-9.82
4318,-9.97
4319,-10.19
4320,-10.50
4321,-10.86
4322,-11.20
4323,-11.47
4324,-11.63
4325,-11.69
4326,-11.62
4327,-11.46
4328,-11.25
4329,-11.05
4330,-10.88
4331,-10.76
4332,-10.70
4333,-10.70
4334,-10.73
4335,-10.77
4336,-10.73
4337,-10.64
4338,-10.46
4339,-10.25
4340,-9.99
4341,-9.75
4342,-9.48
4343,-9.22
4344,-8.97
4345,-8.74
4346,-8.50
4347,-8.25
4348,-7.95
4349,-7.67
4350,-7.35
4351,-7.07
4352,-6.75
4353,-6.41
4354,-5.96
4355,-5.48
4356,-4.93
4357,-4.39
4358,-3.78
4359,-3.19
4360,-2.56
4361,-1.95
4362,-1.32
4363,-0.76
4364,-0.24
4365,0.21
4366,0.67
4367,1.07
4368,1.42
4369,1.68
4370,1.89
4371,2.06
4372,2.20
4373,2.30
4374,2.37
4375,2.41
4376,2.43
4377,2.43
4378,2.40
4379,2.35
4380,2.23
4381,2.03
4382,1.75
4383,1.40
4384,1.04
4385,0.68
4386,0.34
4387,0.07
4388,-0.14
4389,-0.27
4390,-0.37
4391,-0.43
4392,-0.56
4393,-0.72
4394,-0.98
4395,-1.29
4396,-1.69
4397,-2.09
4398,-2.49
4399,-2.83
4400,-3.12
4401,-3.36
4402,-3.56
4403,-3.73
4404,-3.92
4405,-4.14
4406,-4.39
4407,-4.64
4408,-4.89
4409,-5.09
4410,-5.22
4411,-5.25
4412,-5.22
4413,-5.15
4414,-5.09
4415,-5.04
4416,-5.04
4417,-5.07
4418,-5.17
4419,-5.33
4420,-5.56
4421,-5.84
4422,-6.15
4423,-6.47
4424,-6.79
4425,-7.09
4426,-7.34
4427,-7.54
4428,-7.71
4429,-7.84
4430,-7.95
4431,-8.03
4432,-8.09
4433,-8.11
4434,-8.06
4435,-7.97
4436,-7.84
4437,-7.70
4438,-7.55
4439,-7.39
4440,-7.23
4441,-7.06
4442,-6.84
4443,-6.55
4444,-6.14
4445,-5.65
4446,-5.06
4447,-4.43
4448,-3.75
4449,-3.11
4450,-2.53
4451,-2.11
4452,-1.83
4453,-1.72
4454,-1.69
4455,-1.74
4456,-1.85
4457,-2.01
4458,-2.17
4459,-2.32
4460,-2.45
4461,-2.60
4462,-2.81
4463,-3.03
4464,-3.27
4465,-3.49
4466,-3.75
4467,-4.01
4468,-4.26
4469,-4.50
4470,-4.74
4471,-4.97
4472,-5.20
4473,-5.40
4474,-5.55
4475,-5.63
4476,-5.65
4477,-5.60
4478,-5.52
4479,-5.42
4480,-5.31
4481,-5.19
4482,-5.06
4483,-4.89
4484,-4.70
4485,-4.50
4486,-4.32
4487,-4.16
4488,-4.02
4489,-3.91
4490,-3.89
4491,-3.94
4492,-4.06
4493,-4.20
4494,-4.38
4495,-4.55
4496,-4.74
4497,-4.95
4498,-5.25
4499,-5.62
4500,-6.07
4501,-6.52
4502,-6.98
4503,-7.42
4504,-7.82
4505,-8.13
4506,-8.35
4507,-8.47
4508,-8.52
4509,-8.51
4510,-8.46
4511,-8.40
4512,-8.38
4513,-8.39
4514,-8.42
4515,-8.42
4516,-8.42
4517,-8.44
4518,-8.45
4519,-8.46
4520,-8.44
4521,-8.40
4522,-8.34
4523,-8.30
4524,-8.30
4525,-8.34
4526,-8.41
4527,-8.49
4528,-8.58
4529,-8.66
4530,-8.69
4531,-8.65
4532,-8.57
4533,-8.45
4534,-8.29
4535,-8.15
4536,-8.06
4537,-8.08
4538,-8.20
4539,-8.38
4540,-8.59
4541,-8.78
4542,-8.90
4543,-8.95
4544,-8.90
4545,-8.81
4546,-8.66
4547,-8.51
4548,-8.33
4549,-8.16
4550,-7.95
4551,-7.69
4552,-7.29
4553,-6.78
4554,-6.14
4555,-5.47
4556,-4.79
4557,-4.20
4558,-3.69
4559,-3.34
4560,-3.13
4561,-3.08
4562,-3.13
4563,-3.23
4564,-3.27
4565,-3.26
4566,-3.16
4567,-3.02
4568,-2.85
4569,-2.67
4570,-2.49
4571,-2.36
4572,-2.27
4573,-2.20
4574,-2.16
4575,-2.12
4576,-2.11
4577,-2.10
4578,-2.11
4579,-2.17
4580,-2.33
4581,-2.58
4582,-2.90
4583,-3.24
4584,-3.59
4585,-3.88
4586,-4.10
4587,-4.20
4588,-4.20
4589,-4.16
4590,-4.11
4591,-4.06
4592,-4.04
4593,-4.07
4594,-4.20
4595,-4.40
4596,-4.65
4597,-4.88
4598,-5.11
4599,-5.32
4600,-5.55
4601,-5.79
4602,-6.03
4603,-6.29
4604,-6.59
4605,-6.94
4606,-7.35
4607,-7.73
4608,-8.06
4609,-8.29
4610,-8.45
4611,-8.52
4612,-8.53
4613,-8.48
4614,-8.43
4615,-8.41
4616,-8.44
4617,-8.51
4618,-8.64
4619,-8.77
4620,-8.87
4621,-8.90
4622,-8.87
4623,-8.79
4624,-8.71
4625,-8.64
4626,-8.59
4627,-8.54
4628,-8.47
4629,-8.35
4630,-8.13
4631,-7.80
4632,-7.37
4633,-6.93
4634,-6.49
4635,-6.12
4636,-5.81
4637,-5.62
4638,-5.50
4639,-5.43
4640,-5.36
4641,-5.29
4642,-5.19
4643,-5.10
4644,-5.00
4645,-4.96
4646,-4.98
4647,-5.08
4648,-5.25
4649,-5.43
4650,-5.58
4651,-5.66
4652,-5.66
4653,-5.58
4654,-5.46
4655,-5.33
4656,-5.24
4657,-5.22
4658,-5.30
4659,-5.43
4660,-5.58
4661,-5.71
4662,-5.81
4663,-5.88
4664,-5.92
4665,-5.96
4666,-6.06
4667,-6.23
4668,-6.45
4669,-6.66
4670,-6.83
4671,-6.92
4672,-6.94
4673,-6.90
4674,-6.86
4675,-6.86
4676,-6.97
4677,-7.20
4678,-7.60
4679,-8.09
4680,-8.64
4681,-9.12
4682,-9.51
4683,-9.76
4684,-9.90
4685,-9.93
4686,-9.92
4687,-9.93
4688,-10.03
4689,-10.19
4690,-10.38
4691,-10.58
4692,-10.77
4693,-10.89
4694,-10.89
4695,-10.73
4696,-10.44
4697,-10.09
4698,-9.76
4699,-9.49
4700,-9.35
4701,-9.37
4702,-9.54
4703,-9.79
4704,-10.03
4705,-10.19
4706,-10.25
4707,-10.22
4708,-10.17
4709,-10.12
4710,-10.12
4711,-10.18
4712,-10.32
4713,-10.54
4714,-10.79
4715,-10.99
4716,-11.13
4717,-11.21
4718,-11.24
4719,-11.26
4720,-11.28
4721,-11.32
4722,-11.38
4723,-11.44
4724,-11.50
4725,-11.50
4726,-11.43
4727,-11.28
4728,-11.10
4729,-10.93
4730,-10.73
4731,-10.55
4732,-10.33
4733,-10.12
4734,-9.89
4735,-9.67
4736,-9.38
4737,-9.07
4738,-8.69
4739,-8.31
4740,-7.89
4741,-7.48
4742,-7.03
4743,-6.54
4744,-6.00
4745,-5.47
4746,-4.93
4747,-4.43
4748,-3.91
4749,-3.44
4750,-2.98
4751,-2.57
4752,-2.22
4753,-1.95
4754,-1.71
4755,-1.53
4756,-1.43
4757,-1.40
4758,-1.46
4759,-1.60
4760,-1.84
4761,-2.15
4762,-2.53
4763,-2.93
4764,-3.34
4765,-3.76
4766,-4.18
4767,-4.58
4768,-4.94
4769,-5.21
4770,-5.42
4771,-5.58
4772,-5.71
4773,-5.82
4774,-5.95
4775,-6.06
4776,-6.16
4777,-6.23
4778,-6.31
4779,-6.37
4780,-6.48
4781,-6.61
4782,-6.82
4783,-7.06
4784,-7.39
4785,-7.74
4786,-8.15
4787,-8.53
4788,-8.91
4789,-9.25
4790,-9.65
4791,-10.07
4792,-10.55
4793,-11.04
4794,-11.61
4795,-12.21
4796,-12.87
4797,-13.50
4798,-14.11
4799,-14.63
4800,-15.05
4801,-15.31
4802,-15.46
4803,-15.45
4804,-15.31
4805,-15.05
4806,-14.73
4807,-14.40
4808,-14.08
4809,-13.82
4810,-13.67
4811,-13.60
4812,-13.60
4813,-13.65
4814,-13.75
4815,-13.89
4816,-14.03
4817,-14.17
4818,-14.32
4819,-14.50
4820,-14.70
4821,-14.90
4822,-15.10
4823,-15.28
4824,-15.43
4825,-15.53
4826,-15.56
4827,-15.52
4828,-15.43
4829,-15.29
4830,-15.10
4831,-14.86
4832,-14.59
4833,-14.34
4834,-14.11
4835,-13.94
4836,-13.77
4837,-13.62
4838,-13.45
4839,-13.27
4840,-12.98
4841,-12.59
4842,-12.08
4843,-11.52
4844,-10.94
4845,-10.41
4846,-9.93
4847,-9.57
4848,-9.33
4849,-9.22
4850,-9.22
4851,-9.28
4852,-9.34
4853,-9.39
4854,-9.45
4855,-9.52
4856,-9.60
4857,-9.68
4858,-9.81
4859,-9.98
4860,-10.17
4861,-10.34
4862,-10.48
4863,-10.55
4864,-10.54
4865,-10.44
4866,-10.31
4867,-10.22
4868,-10.19
4869,-10.21
4870,-10.30
4871,-10.46
4872,-10.65
4873,-10.80
4874,-10.86
4875,-10.83
4876,-10.76
4877,-10.67
4878,-10.61
4879,-10.64
4880,-10.76
4881,-10.96
4882,-11.19
4883,-11.42
4884,-11.60
4885,-11.70
4886,-11.70
4887,-11.61
4888,-11.49
4889,-11.39
4890,-11.33
4891,-11.31
4892,-11.32
4893,-11.34
4894,-11.35
4895,-11.31
4896,-11.20
4897,-11.02
4898,-10.79
4899,-10.54
4900,-10.33
4901,-10.16
4902,-10.09
4903,-10.12
4904,-10.30
4905,-10.62
4906,-11.05
4907,-11.54
4908,-12.02
4909,-12.47
4910,-12.83
4911,-13.08
4912,-13.18
4913,-13.15
4914,-13.05
4915,-12.91
4916,-12.73
4917,-12.52
4918,-12.24
4919,-11.90
4920,-11.51
4921,-11.07
4922,-10.59
4923,-10.07
4924,-9.52
4925,-9.02
4926,-8.54
4927,-8.13
4928,-7.72
4929,-7.35
4930,-7.03
4931,-6.77
4932,-6.54
4933,-6.33
4934,-6.13
4935,-5.98
4936,-5.82
4937,-5.65
4938,-5.46
4939,-5.30
4940,-5.19
4941,-5.16
4942,-5.17
4943,-5.21
4944,-5.26
4945,-5.32
4946,-5.31
4947,-5.22
4948,-4.99
4949,-4.68
4950,-4.30
4951,-3.95
4952,-3.61
4953,-3.30
4954,-2.98
4955,-2.69
4956,-2.40
4957,-2.13
4958,-1.83
4959,-1.52
4960,-1.19
4961,-0.87
4962,-0.56
4963,-0.31
4964,-0.11
4965,-0.02
4966,0.02
4967,0.01
4968,-0.01
4969,-0.05
4970,-0.13
4971,-0.27
4972,-0.46
4973,-0.69
4974,-0.99
4975,-1.33
4976,-1.69
4977,-2.04
4978,-2.40
4979,-2.71
4980,-3.01
4981,-3.25
4982,-3.51
4983,-3.79
4984,-4.17
4985,-4.63
4986,-5.17
4987,-5.68
4988,-6.13
4989,-6.47
4990,-6.70
4991,-6.79
4992,-6.76
4993,-6.64
4994,-6.49
4995,-6.32
4996,-6.13
4997,-5.91
4998,-5.71
4999,-5.55
5000,-5.39
5001,-5.24
5002,-5.10
5003,-4.97
5004,-4.86
5005,-4.75
5006,-4.62
5007,-4.49
5008,-4.32
5009,-4.13
5010,-3.88
5011,-3.62
5012,-3.36
5013,-3.14
5014,-2.98
5015,-2.88
5016,-2.82
5017,-2.78
5018,-2.78
5019,-2.82
5020,-2.91
5021,-3.07
5022,-3.29
5023,-3.57
5024,-3.89
5025,-4.22
5026,-4.50
5027,-4.71
5028,-4.81
5029,-4.78
5030,-4.64
5031,-4.40
5032,-4.10
5033,-3.75
5034,-3.39
5035,-3.04
5036,-2.73
5037,-2.49
5038,-2.27
5039,-2.11
5040,-2.00
5041,-1.98
5042,-1.98
5043,-2.01
5044,-2.05
5045,-2.08
5046,-2.02
5047,-1.87
5048,-1.63
5049,-1.37
5050,-1.08
5051,-0.85
5052,-0.71
5053,-0.70
5054,-0.82
5055,-1.01
5056,-1.22
5057,-1.42
5058,-1.59
5059,-1.75
5060,-1.91
5061,-2.11
5062,-2.33
5063,-2.59
5064,-2.89
5065,-3.19
5066,-3.45
5067,-3.59
5068,-3.61
5069,-3.50
5070,-3.31
5071,-3.07
5072,-2.90
5073,-2.82
5074,-2.85
5075,-2.97
5076,-3.14
5077,-3.36
5078,-3.63
5079,-3.95
5080,-4.29
5081,-4.61
5082,-4.91
5083,-5.18
5084,-5.44
5085,-5.65
5086,-5.85
5087,-6.02
5088,-6.21
5089,-6.40
5090,-6.61
5091,-6.80
5092,-7.02
5093,-7.23
5094,-7.45
5095,-7.64
5096,-7.87
5097,-8.09
5098,-8.33
5099,-8.54
5100,-8.77
5101,-8.96
5102,-9.11
5103,-9.18
5104,-9.16
5105,-9.05
5106,-8.88
5107,-8.68
5108,-8.48
5109,-8.30
5110,-8.14
5111,-8.01
5112,-7.87
5113,-7.69
5114,-7.45
5115,-7.18
5116,-6.86
5117,-6.51
5118,-6.11
5119,-5.74
5120,-5.41
5121,-5.19
5122,-5.07
5123,-5.07
5124,-5.10
5125,-5.20
5126,-5.27
5127,-5.32
5128,-5.30
5129,-5.23
5130,-5.07
5131,-4.85
5132,-4.58
5133,-4.28
5134,-3.97
5135,-3.72
5136,-3.52
5137,-3.43
5138,-3.41
5139,-3.44
5140,-3.46
5141,-3.44
5142,-3.36
5143,-3.25
5144,-3.09
5145,-2.91
5146,-2.73
5147,-2.63
5148,-2.66
5149,-2.79
5150,-3.00
5151,-3.21
5152,-3.38
5153,-3.45
5154,-3.41
5155,-3.28
5156,-3.17
5157,-3.14
5158,-3.23
5159,-3.45
5160,-3.81
5161,-4.30
5162,-4.83
5163,-5.31
5164,-5.68
5165,-5.87
5166,-5.93
5167,-5.87
5168,-5.80
5169,-5.77
5170,-5.86
5171,-6.06
5172,-6.33
5173,-6.61
5174,-6.88
5175,-7.06
5176,-7.13
5177,-7.07
5178,-6.97
5179,-6.86
5180,-6.81
5181,-6.82
5182,-6.92
5183,-7.10
5184,-7.35
5185,-7.61
5186,-7.84
5187,-8.00
5188,-8.11
5189,-8.18
5190,-8.23
5191,-8.27
5192,-8.33
5193,-8.41
5194,-8.50
5195,-8.58
5196,-8.65
5197,-8.74
5198,-8.89
5199,-9.09
5200,-9.33
5201,-9.57
5202,-9.79
5203,-9.96
5204,-10.03
5205,-9.99
5206,-9.82
5207,-9.55
5208,-9.28
5209,-9.05
5210,-8.90
5211,-8.85
5212,-8.88
5213,-8.96
5214,-9.03
5215,-9.05
5216,-8.96
5217,-8.83
5218,-8.63
5219,-8.42
5220,-8.18
5221,-7.94
5222,-7.68
5223,-7.42
5224,-7.10
5225,-6.71
5226,-6.18
5227,-5.57
5228,-4.93
5229,-4.37
5230,-3.88
5231,-3.50
5232,-3.20
5233,-3.01
5234,-2.86
5235,-2.73
5236,-2.59
5237,-2.45
5238,-2.30
5239,-2.17
5240,-2.03
5241,-1.94
5242,-1.89
5243,-1.91
5244,-2.00
5245,-2.14
5246,-2.31
5247,-2.52
5248,-2.74
5249,-2.94
5250,-3.09
5251,-3.14
5252,-3.11
5253,-3.01
5254,-2.85
5255,-2.67
5256,-2.49
5257,-2.37
5258,-2.37
5259,-2.47
5260,-2.69
5261,-2.91
5262,-3.19
5263,-3.48
5264,-3.81
5265,-4.17
5266,-4.56
5267,-4.99
5268,-5.50
5269,-6.04
5270,-6.66
5271,-7.31
5272,-8.02
5273,-8.72
5274,-9.44
5275,-10.09
5276,-10.72
5277,-11.26
5278,-11.74
5279,-12.11
5280,-12.42
5281,-12.63
5282,-12.76
5283,-12.76
5284,-12.73
5285,-12.63
5286,-12.52
5287,-12.37
5288,-12.22
5289,-12.08
5290,-11.97
5291,-11.87
5292,-11.77
5293,-11.66
5294,-11.51
5295,-11.38
5296,-11.25
5297,-11.15
5298,-11.08
5299,-11.04
5300,-11.02
5301,-11.04
5302,-11.01
5303,-10.94
5304,-10.79
5305,-10.60
5306,-10.38
5307,-10.17
5308,-9.99
5309,-9.86
5310,-9.76
5311,-9.69
5312,-9.58
5313,-9.43
5314,-9.19
5315,-8.93
5316,-8.62
5317,-8.31
5318,-7.97
5319,-7.63
5320,-7.30
5321,-7.00
5322,-6.65
5323,-6.26
5324,-5.79
5325,-5.32
5326,-4.84
5327,-4.41
5328,-4.00
5329,-3.65
5330,-3.36
5331,-3.17
5332,-3.03
5333,-2.94
5334,-2.86
5335,-2.81
5336,-2.74
5337,-2.66
5338,-2.57
5339,-2.49
5340,-2.45
5341,-2.43
5342,-2.41
5343,-2.39
5344,-2.38
5345,-2.40
5346,-2.44
5347,-2.50
5348,-2.59
5349,-2.73
5350,-2.93
5351,-3.19
5352,-3.52
5353,-3.87
5354,-4.23
5355,-4.58
5356,-4.87
5357,-5.08
5358,-5.23
5359,-5.32
5360,-5.42
5361,-5.55
5362,-5.72
5363,-5.91
5364,-6.10
5365,-6.27
5366,-6.42
5367,-6.50
5368,-6.52
5369,-6.49
5370,-6.45
5371,-6.39
5372,-6.31
5373,-6.20
5374,-6.10
5375,-6.02
5376,-5.98
5377,-5.97
5378,-6.00
5379,-6.07
5380,-6.25
5381,-6.50
5382,-6.81
5383,-7.11
5384,-7.42
5385,-7.71
5386,-8.01
5387,-8.31
5388,-8.61
5389,-8.93
5390,-9.27
5391,-9.63
5392,-9.99
5393,-10.31
5394,-10.54
5395,-10.64
5396,-10.60
5397,-10.45
5398,-10.18
5399,-9.82
5400,-9.40
5401,-8.98
5402,-8.61
5403,-8.33
5404,-8.13
5405,-7.95
5406,-7.77
5407,-7.59
5408,-7.42
5409,-7.22
5410,-6.95
5411,-6.68
5412,-6.47
5413,-6.41
5414,-6.45
5415,-6.58
5416,-6.78
5417,-7.01
5418,-7.25
5419,-7.45
5420,-7.64
5421,-7.79
5422,-7.93
5423,-8.06
5424,-8.23
5425,-8.45
5426,-8.70
5427,-8.91
5428,-9.09
5429,-9.21
5430,-9.27
5431,-9.24
5432,-9.16
5433,-9.00
5434,-8.87
5435,-8.80
5436,-8.85
5437,-9.03
5438,-9.33
5439,-9.69
5440,-10.06
5441,-10.38
5442,-10.64
5443,-10.77
5444,-10.77
5445,-10.62
5446,-10.41
5447,-10.16
5448,-9.99
5449,-9.92
5450,-10.03
5451,-10.29
5452,-10.76
5453,-11.34
5454,-12.07
5455,-12.86
5456,-13.72
5457,-14.53
5458,-15.37
5459,-16.14
5460,-16.94
5461,-17.68
5462,-18.42
5463,-19.13
5464,-19.87
5465,-20.54
5466,-21.19
5467,-21.74
5468,-22.25
5469,-22.65
5470,-22.96
5471,-23.13
5472,-23.26
5473,-23.34
5474,-23.41
5475,-23.47
5476,-23.57
5477,-23.68
5478,-23.75
5479,-23.70
5480,-23.52
5481,-23.22
5482,-22.78
5483,-22.28
5484,-21.71
5485,-21.16
5486,-20.59
5487,-20.07
5488,-19.55
5489,-19.05
5490,-18.46
5491,-17.78
5492,-16.98
5493,-16.19
5494,-15.40
5495,-14.73
5496,-14.08
5497,-13.55
5498,-13.05
5499,-12.63
5500,-12.19
5501,-11.73
5502,-11.16
5503,-10.56
5504,-9.92
5505,-9.36
5506,-8.83
5507,-8.42
5508,-8.05
5509,-7.77
5510,-7.47
5511,-7.14
5512,-6.74
5513,-6.29
5514,-5.77
5515,-5.22
5516,-4.63
5517,-4.10
5518,-3.64
5519,-3.33
5520,-3.12
5521,-3.02
5522,-2.94
5523,-2.89
5524,-2.82
5525,-2.71
5526,-2.51
5527,-2.24
5528,-1.88
5529,-1.49
5530,-1.08
5531,-0.73
5532,-0.40
5533,-0.14
5534,0.13
5535,0.37
5536,0.65
5537,0.94
5538,1.29
5539,1.64
5540,1.99
5541,2.30
5542,2.61
5543,2.86
5544,3.07
5545,3.22
5546,3.36
5547,3.50
5548,3.61
5549,3.67
5550,3.71
5551,3.72
5552,3.72
5553,3.70
5554,3.65
5555,3.62
5556,3.59
5557,3.57
5558,3.55
5559,3.52
5560,3.43
5561,3.28
5562,3.02
5563,2.69
5564,2.29
5565,1.91
5566,1.55
5567,1.21
5568,0.84
5569,0.51
5570,0.21
5571,-0.06
5572,-0.37
5573,-0.67
5574,-1.00
5575,-1.29
5576,-1.60
5577,-1.93
5578,-2.29
5579,-2.62
5580,-2.94
5581,-3.20
5582,-3.39
5583,-3.49
5584,-3.51
5585,-3.46
5586,-3.36
5587,-3.20
5588,-3.01
5589,-2.85
5590,-2.73
5591,-2.65
5592,-2.60
5593,-2.57
5594,-2.52
5595,-2.42
5596,-2.25
5597,-2.01
5598,-1.72
5599,-1.37
5600,-1.00
5601,-0.66
5602,-0.41
5603,-0.29
5604,-0.30
5605,-0.40
5606,-0.56
5607,-0.79
5608,-1.04
5609,-1.24
5610,-1.37
5611,-1.40
5612,-1.37
5613,-1.34
5614,-1.30
5615,-1.28
5616,-1.27
5617,-1.31
5618,-1.43
5619,-1.58
5620,-1.73
5621,-1.85
5622,-1.96
5623,-2.05
5624,-2.13
5625,-2.17
5626,-2.22
5627,-2.31
5628,-2.46
5629,-2.64
5630,-2.85
5631,-3.07
5632,-3.28
5633,-3.50
5634,-3.74
5635,-3.97
5636,-4.19
5637,-4.39
5638,-4.59
5639,-4.74
5640,-4.84
5641,-4.92
5642,-5.02
5643,-5.13
5644,-5.26
5645,-5.40
5646,-5.58
5647,-5.81
5648,-6.00
5649,-6.13
5650,-6.19
5651,-6.18
5652,-6.10
5653,-5.93
5654,-5.65
5655,-5.31
5656,-4.94
5657,-4.57
5658,-4.26
5659,-4.06
5660,-3.98
5661,-4.03
5662,-4.17
5663,-4.39
5664,-4.65
5665,-4.92
5666,-5.13
5667,-5.22
5668,-5.23
5669,-5.21
5670,-5.20
5671,-5.20
5672,-5.27
5673,-5.39
5674,-5.58
5675,-5.84
5676,-6.14
5677,-6.46
5678,-6.81
5679,-7.13
5680,-7.44
5681,-7.72
5682,-8.02
5683,-8.30
5684,-8.58
5685,-8.84
5686,-9.13
5687,-9.45
5688,-9.74
5689,-9.95
5690,-10.06
5691,-10.09
5692,-10.06
5693,-9.94
5694,-9.73
5695,-9.45
5696,-9.13
5697,-8.80
5698,-8.42
5699,-8.03
5700,-7.61
5701,-7.21
5702,-6.76
5703,-6.28
5704,-5.69
5705,-5.06
5706,-4.39
5707,-3.74
5708,-3.08
5709,-2.46
5710,-1.84
5711,-1.29
5712,-0.79
5713,-0.39
5714,-0.02
5715,0.28
5716,0.60
5717,0.91
5718,1.24
5719,1.55
5720,1.86
5721,2.18
5722,2.50
5723,2.76
5724,2.91
5725,2.87
5726,2.65
5727,2.28
5728,1.82
5729,1.33
5730,0.82
5731,0.35
5732,-0.02
5733,-0.27
5734,-0.43
5735,-0.52
5736,-0.60
5737,-0.67
5738,-0.76
5739,-0.85
5740,-0.99
5741,-1.11
5742,-1.26
5743,-1.40
5744,-1.64
5745,-1.94
5746,-2.36
5747,-2.86
5748,-3.51
5749,-4.21
5750,-4.98
5751,-5.73
5752,-6.48
5753,-7.17
5754,-7.81
5755,-8.33
5756,-8.81
5757,-9.22
5758,-9.59
5759,-9.89
5760,-10.20
5761,-10.51
5762,-10.85
5763,-11.18
5764,-11.52
5765,-11.80
5766,-12.01
5767,-12.12
5768,-12.15
5769,-12.11
5770,-12.05
5771,-11.97
5772,-11.92
5773,-11.90
5774,-11.94
5775,-12.02
5776,-12.08
5777,-12.12
5778,-12.09
5779,-12.03
5780,-11.92
5781,-11.76
5782,-11.58
5783,-11.41
5784,-11.23
5785,-11.07
5786,-10.92
5787,-10.81
5788,-10.72
5789,-10.67
5790,-10.60
5791,-10.54
5792,-10.41
5793,-10.25
5794,-9.98
5795,-9.63
5796,-9.16
5797,-8.65
5798,-8.10
5799,-7.59
5800,-7.11
5801,-6.71
5802,-6.32
5803,-5.98
5804,-5.62
5805,-5.27
5806,-4.89
5807,-4.53
5808,-4.21
5809,-4.00
5810,-3.88
5811,-3.87
5812,-3.92
5813,-4.01
5814,-4.08
5815,-4.12
5816,-4.13
5817,-4.13
5818,-4.14
5819,-4.15
5820,-4.20
5821,-4.27
5822,-4.39
5823,-4.53
5824,-4.67
5825,-4.79
5826,-4.89
5827,-4.97
5828,-5.03
5829,-5.06
5830,-5.10
5831,-5.13
5832,-5.18
5833,-5.22
5834,-5.25
5835,-5.29
5836,-5.36
5837,-5.46
5838,-5.58
5839,-5.77
5840,-6.01
5841,-6.29
5842,-6.55
5843,-6.75
5844,-6.90
5845,-6.97
5846,-6.97
5847,-6.87
5848,-6.72
5849,-6.57
5850,-6.43
5851,-6.29
5852,-6.17
5853,-6.05
5854,-5.93
5855,-5.83
5856,-5.79
5857,-5.82
5858,-5.91
5859,-6.06
5860,-6.25
5861,-6.43
5862,-6.56
5863,-6.61
5864,-6.65
5865,-6.70
5866,-6.81
5867,-6.96
5868,-7.19
5869,-7.51
5870,-7.92
5871,-8.34
5872,-8.69
5873,-8.91
5874,-9.00
5875,-8.98
5876,-8.88
5877,-8.71
5878,-8.51
5879,-8.32
5880,-8.21
5881,-8.18
5882,-8.18
5883,-8.16
5884,-8.09
5885,-7.98
5886,-7.80
5887,-7.58
5888,-7.32
5889,-7.06
5890,-6.85
5891,-6.69
5892,-6.58
5893,-6.52
5894,-6.52
5895,-6.56
5896,-6.59
5897,-6.59
5898,-6.58
5899,-6.55
5900,-6.55
5901,-6.58
5902,-6.71
5903,-6.93
5904,-7.30
5905,-7.78
5906,-8.35
5907,-8.90
5908,-9.41
5909,-9.87
5910,-10.29
5911,-10.65
5912,-10.93
5913,-11.12
5914,-11.27
5915,-11.41
5916,-11.54
5917,-11.63
5918,-11.69
5919,-11.69
5920,-11.65
5921,-11.57
5922,-11.44
5923,-11.29
5924,-11.10
5925,-10.86
5926,-10.54
5927,-10.12
5928,-9.63
5929,-9.10
5930,-8.61
5931,-8.19
5932,-7.87
5933,-7.69
5934,-7.63
5935,-7.71
5936,-7.87
5937,-8.13
5938,-8.35
5939,-8.54
5940,-8.67
5941,-8.74
5942,-8.79
5943,-8.81
5944,-8.80
5945,-8.80
5946,-8.83
5947,-8.87
5948,-8.90
5949,-8.93
5950,-8.93
5951,-8.91
5952,-8.86
5953,-8.77
5954,-8.62
5955,-8.42
5956,-8.16
5957,-7.87
5958,-7.53
5959,-7.20
5960,-6.85
5961,-6.52
5962,-6.20
5963,-5.93
5964,-5.68
5965,-5.49
5966,-5.31
5967,-5.19
5968,-5.07
5969,-4.94
5970,-4.72
5971,-4.41
5972,-4.01
5973,-3.58
5974,-3.10
5975,-2.62
5976,-2.17
5977,-1.84
5978,-1.63
5979,-1.58
5980,-1.64
5981,-1.79
5982,-1.95
5983,-2.05
5984,-2.04
5985,-1.94
5986,-1.72
5987,-1.43
5988,-1.04
5989,-0.63
5990,-0.21
5991,0.17
5992,0.52
5993,0.85
5994,1.19
5995,1.56
5996,2.01
5997,2.48
5998,2.98
5999,3.43
6000,3.87
6001,4.23
6002,4.52
6003,4.66
6004,4.67
6005,4.56
6006,4.39
6007,4.20
6008,4.05
6009,3.97
6010,3.97
6011,4.01
6012,4.07
6013,4.14
6014,4.18
6015,4.18
6016,4.11
6017,4.02
6018,3.91
6019,3.84
6020,3.75
6021,3.66
6022,3.54
6023,3.36
6024,3.10
6025,2.75
6026,2.31
6027,1.90
6028,1.51
6029,1.23
6030,1.01
6031,0.91
6032,0.83
6033,0.79
6034,0.71
6035,0.60
6036,0.40
6037,0.14
6038,-0.16
6039,-0.46
6040,-0.72
6041,-0.94
6042,-1.13
6043,-1.26
6044,-1.35
6045,-1.40
6046,-1.48
6047,-1.59
6048,-1.75
6049,-1.95
6050,-2.21
6051,-2.52
6052,-2.87
6053,-3.18
6054,-3.46
6055,-3.65
6056,-3.79
6057,-3.90
6058,-4.06
6059,-4.28
6060,-4.63
6061,-5.09
6062,-5.65
6063,-6.25
6064,-6.84
6065,-7.36
6066,-7.79
6067,-8.08
6068,-8.26
6069,-8.32
6070,-8.36
6071,-8.37
6072,-8.38
6073,-8.38
6074,-8.38
6075,-8.33
6076,-8.22
6077,-8.05
6078,-7.84
6079,-7.64
6080,-7.45
6081,-7.29
6082,-7.16
6083,-7.11
6084,-7.12
6085,-7.18
6086,-7.26
6087,-7.35
6088,-7.43
6089,-7.51
6090,-7.55
6091,-7.55
6092,-7.54
6093,-7.49
6094,-7.40
6095,-7.29
6096,-7.19
6097,-7.12
6098,-7.07
6099,-7.04
6100,-7.03
6101,-7.02
6102,-7.01
6103,-6.98
6104,-6.92
6105,-6.84
6106,-6.72
6107,-6.61
6108,-6.52
6109,-6.47
6110,-6.45
6111,-6.42
6112,-6.34
6113,-6.18
6114,-5.96
6115,-5.70
6116,-5.42
6117,-5.18
6118,-5.00
6119,-4.97
6120,-5.11
6121,-5.39
6122,-5.70
6123,-5.97
6124,-6.17
6125,-6.26
6126,-6.22
6127,-6.07
6128,-5.87
6129,-5.74
6130,-5.70
6131,-5.73
6132,-5.81
6133,-5.89
6134,-5.93
6135,-5.87
6136,-5.68
6137,-5.39
6138,-5.00
6139,-4.65
6140,-4.34
6141,-4.15
6142,-4.05
6143,-4.04
6144,-4.08
6145,-4.17
6146,-4.25
6147,-4.29
6148,-4.27
6149,-4.22
6150,-4.20
6151,-4.24
6152,-4.34
6153,-4.48
6154,-4.67
6155,-4.91
6156,-5.20
6157,-5.52
6158,-5.83
6159,-6.13
6160,-6.45
6161,-6.81
6162,-7.16
6163,-7.46
6164,-7.71
6165,-7.86
6166,-7.93
6167,-7.90
6168,-7.81
6169,-7.65
6170,-7.42
6171,-7.13
6172,-6.86
6173,-6.65
6174,-6.48
6175,-6.35
6176,-6.20
6177,-6.04
6178,-5.87
6179,-5.72
6180,-5.55
6181,-5.36
6182,-5.10
6183,-4.80
6184,-4.39
6185,-3.94
6186,-3.44
6187,-2.97
6188,-2.53
6189,-2.18
6190,-1.91
6191,-1.74
6192,-1.62
6193,-1.53
6194,-1.39
6195,-1.17
6196,-0.86
6197,-0.47
6198,-0.02
6199,0.38
6200,0.68
6201,0.82
6202,0.80
6203,0.66
6204,0.43
6205,0.18
6206,-0.03
6207,-0.19
6208,-0.30
6209,-0.37
6210,-0.43
6211,-0.49
6212,-0.56
6213,-0.64
6214,-0.72
6215,-0.79
6216,-0.81
6217,-0.79
6218,-0.75
6219,-0.69
6220,-0.67
6221,-0.69
6222,-0.76
6223,-0.87
6224,-1.04
6225,-1.21
6226,-1.42
6227,-1.64
6228,-1.94
6229,-2.29
6230,-2.74
6231,-3.24
6232,-3.84
6233,-4.47
6234,-5.17
6235,-5.85
6236,-6.52
6237,-7.10
6238,-7.58
6239,-7.93
6240,-8.19
6241,-8.32
6242,-8.35
6243,-8.25
6244,-8.02
6245,-7.69
6246,-7.33
6247,-6.98
6248,-6.70
6249,-6.48
6250,-6.32
6251,-6.21
6252,-6.11
6253,-6.03
6254,-5.87
6255,-5.64
6256,-5.29
6257,-4.88
6258,-4.41
6259,-3.98
6260,-3.57
6261,-3.23
6262,-2.96
6263,-2.78
6264,-2.64
6265,-2.53
6266,-2.40
6267,-2.26
6268,-2.12
6269,-2.05
6270,-2.02
6271,-2.05
6272,-2.11
6273,-2.19
6274,-2.26
6275,-2.31
6276,-2.30
6277,-2.20
6278,-1.99
6279,-1.69
6280,-1.34
6281,-0.97
6282,-0.62
6283,-0.32
6284,-0.11
6285,0.03
6286,0.12
6287,0.18
6288,0.21
6289,0.17
6290,0.05
6291,-0.16
6292,-0.42
6293,-0.70
6294,-0.98
6295,-1.19
6296,-1.33
6297,-1.36
6298,-1.34
6299,-1.28
6300,-1.28
6301,-1.37
6302,-1.60
6303,-1.95
6304,-2.37
6305,-2.81
6306,-3.20
6307,-3.49
6308,-3.72
6309,-3.85
6310,-3.92
6311,-3.91
6312,-3.88
6313,-3.85
6314,-3.87
6315,-3.92
6316,-4.04
6317,-4.19
6318,-4.41
6319,-4.68
6320,-5.02
6321,-5.37
6322,-5.74
6323,-6.07
6324,-6.40
6325,-6.67
6326,-6.89
6327,-7.05
6328,-7.16
6329,-7.21
6330,-7.23
6331,-7.23
6332,-7.23
6333,-7.25
6334,-7.29
6335,-7.31
6336,-7.29
6337,-7.23
6338,-7.13
6339,-6.97
6340,-6.76
6341,-6.51
6342,-6.27
6343,-6.10
6344,-6.01
6345,-6.03
6346,-6.13
6347,-6.32
6348,-6.58
6349,-6.90
6350,-7.20
6351,-7.45
6352,-7.62
6353,-7.70
6354,-7.67
6355,-7.53
6356,-7.31
6357,-7.05
6358,-6.77
6359,-6.50
6360,-6.22
6361,-5.94
6362,-5.65
6363,-5.38
6364,-5.10
6365,-4.84
6366,-4.51
6367,-4.12
6368,-3.64
6369,-3.15
6370,-2.66
6371,-2.23
6372,-1.84
6373,-1.55
6374,-1.34
6375,-1.25
6376,-1.24
6377,-1.28
6378,-1.34
6379,-1.38
6380,-1.38
6381,-1.32
6382,-1.22
6383,-1.11
6384,-1.05
6385,-1.05
6386,-1.13
6387,-1.27
6388,-1.44
6389,-1.65
6390,-1.86
6391,-2.04
6392,-2.15
6393,-2.13
6394,-1.98
6395,-1.74
6396,-1.43
6397,-1.10
6398,-0.74
6399,-0.41
6400,-0.18
6401,-0.08
6402,-0.11
6403,-0.23
6404,-0.42
6405,-0.66
6406,-0.92
6407,-1.14
6408,-1.28
6409,-1.30
6410,-1.30
6411,-1.30
6412,-1.42
6413,-1.63
6414,-1.98
6415,-2.44
6416,-3.07
6417,-3.78
6418,-4.53
6419,-5.23
6420,-5.86
6421,-6.41
6422,-6.92
6423,-7.37
6424,-7.79
6425,-8.16
6426,-8.52
6427,-8.83
6428,-9.09
6429,-9.24
6430,-9.35
6431,-9.39
6432,-9.41
6433,-9.39
6434,-9.36
6435,-9.33
6436,-9.34
6437,-9.38
6438,-9.45
6439,-9.53
6440,-9.59
6441,-9.64
6442,-9.67
6443,-9.67
6444,-9.59
6445,-9.41
6446,-9.15
6447,-8.83
6448,-8.46
6449,-8.05
6450,-7.58
6451,-7.10
6452,-6.63
6453,-6.20
6454,-5.78
6455,-5.39
6456,-5.03
6457,-4.75
6458,-4.57
6459,-4.57
6460,-4.75
6461,-5.10
6462,-5.55
6463,-6.06
6464,-6.57
6465,-7.01
6466,-7.32
6467,-7.46
6468,-7.44
6469,-7.29
6470,-7.06
6471,-6.78
6472,-6.50
6473,-6.23
6474,-6.01
6475,-5.84
6476,-5.68
6477,-5.53
6478,-5.35
6479,-5.17
6480,-5.00
6481,-4.89
6482,-4.80
6483,-4.77
6484,-4.78
6485,-4.84
6486,-4.92
6487,-4.95
6488,-4.86
6489,-4.65
6490,-4.30
6491,-3.88
6492,-3.42
6493,-2.99
6494,-2.68
6495,-2.52
6496,-2.52
6497,-2.66
6498,-2.90
6499,-3.22
6500,-3.61
6501,-4.01
6502,-4.38
6503,-4.70
6504,-4.98
6505,-5.25
6506,-5.55
6507,-5.84
6508,-6.14
6509,-6.39
6510,-6.60
6511,-6.71
6512,-6.77
6513,-6.77
6514,-6.80
6515,-6.85
6516,-7.05
6517,-7.37
6518,-7.90
6519,-8.56
6520,-9.39
6521,-10.28
6522,-11.22
6523,-12.11
6524,-12.95
6525,-13.65
6526,-14.26
6527,-14.73
6528,-15.19
6529,-15.63
6530,-16.14
6531,-16.67
6532,-17.23
6533,-17.74
6534,-18.23
6535,-18.65
6536,-19.05
6537,-19.36
6538,-19.60
6539,-19.78
6540,-19.94
6541,-20.10
6542,-20.23
6543,-20.29
6544,-20.26
6545,-20.10
6546,-19.82
6547,-19.42
6548,-18.89
6549,-18.26
6550,-17.52
6551,-16.78
6552,-16.01
6553,-15.30
6554,-14.61
6555,-14.02
6556,-13.49
6557,-13.10
6558,-12.77
6559,-12.57
6560,-12.46
6561,-12.42
6562,-12.29
6563,-12.05
6564,-11.67
6565,-11.24
6566,-10.72
6567,-10.19
6568,-9.67
6569,-9.25
6570,-8.93
6571,-8.76
6572,-8.65
6573,-8.58
6574,-8.46
6575,-8.32
6576,-8.13
6577,-7.96
6578,-7.74
6579,-7.55
6580,-7.41
6581,-7.35
6582,-7.32
6583,-7.32
6584,-7.30
6585,-7.28
6586,-7.24
6587,-7.18
6588,-7.10
6589,-7.03
6590,-6.94
6591,-6.86
6592,-6.79
6593,-6.75
6594,-6.76
6595,-6.79
6596,-6.85
6597,-6.95
6598,-7.12
6599,-7.33
6600,-7.58
6601,-7.82
6602,-8.06
6603,-8.29
6604,-8.45
6605,-8.52
6606,-8.54
6607,-8.51
6608,-8.48
6609,-8.43
6610,-8.38
6611,-8.35
6612,-8.35
6613,-8.36
6614,-8.37
6615,-8.35
6616,-8.31
6617,-8.27
6618,-8.23
6619,-8.19
6620,-8.16
6621,-8.18
6622,-8.29
6623,-8.49
6624,-8.73
6625,-8.96
6626,-9.13
6627,-9.23
6628,-9.22
6629,-9.09
6630,-8.84
6631,-8.51
6632,-8.15
6633,-7.81
6634,-7.55
6635,-7.41
6636,-7.38
6637,-7.43
6638,-7.51
6639,-7.59
6640,-7.65
6641,-7.70
6642,-7.70
6643,-7.68
6644,-7.63
6645,-7.56
6646,-7.44
6647,-7.30
6648,-7.15
6649,-7.01
6650,-6.88
6651,-6.77
6652,-6.65
6653,-6.55
6654,-6.46
6655,-6.37
6656,-6.23
6657,-6.09
6658,-5.91
6659,-5.74
6660,-5.54
6661,-5.33
6662,-5.07
6663,-4.78
6664,-4.42
6665,-4.00
6666,-3.46
6667,-2.88
6668,-2.30
6669,-1.81
6670,-1.40
6671,-1.07
6672,-0.76
6673,-0.50
6674,-0.22
6675,0.06
6676,0.43
6677,0.82
6678,1.22
6679,1.56
6680,1.85
6681,2.10
6682,2.33
6683,2.57
6684,2.82
6685,3.07
6686,3.27
6687,3.39
6688,3.41
6689,3.33
6690,3.15
6691,2.91
6692,2.64
6693,2.38
6694,2.14
6695,1.92
6696,1.72
6697,1.55
6698,1.39
6699,1.25
6700,1.11
6701,1.01
6702,0.90
6703,0.82
6704,0.66
6705,0.46
6706,0.15
6707,-0.24
6708,-0.76
6709,-1.37
6710,-2.07
6711,-2.76
6712,-3.43
6713,-3.99
6714,-4.51
6715,-4.95
6716,-5.36
6717,-5.69
6718,-5.99
6719,-6.24
6720,-6.48
6721,-6.67
6722,-6.83
6723,-6.92
6724,-6.96
6725,-6.94
6726,-6.87
6727,-6.77
6728,-6.63
6729,-6.45
6730,-6.26
6731,-6.08
6732,-5.94
6733,-5.84
6734,-5.75
6735,-5.68
6736,-5.61
6737,-5.55
6738,-5.48
6739,-5.41
6740,-5.32
6741,-5.21
6742,-5.10
6743,-5.00
6744,-4.95
6745,-4.93
6746,-4.90
6747,-4.84
6748,-4.78
6749,-4.73
6750,-4.71
6751,-4.71
6752,-4.78
6753,-4.89
6754,-5.03
6755,-5.20
6756,-5.40
6757,-5.60
6758,-5.72
6759,-5.73
6760,-5.64
6761,-5.47
6762,-5.23
6763,-4.91
6764,-4.55
6765,-4.23
6766,-3.97
6767,-3.75
6768,-3.57
6769,-3.41
6770,-3.27
6771,-3.13
6772,-2.99
6773,-2.85
6774,-2.70
6775,-2.59
6776,-2.51
6777,-2.50
6778,-2.57
6779,-2.69
6780,-2.88
6781,-3.08
6782,-3.33
6783,-3.60
6784,-3.94
6785,-4.32
6786,-4.71
6787,-5.10
6788,-5.55
6789,-6.01
6790,-6.51
6791,-6.96
6792,-7.42
6793,-7.86
6794,-8.32
6795,-8.72
6796,-9.14
6797,-9.54
6798,-9.99
6799,-10.44
6800,-10.89
6801,-11.31
6802,-11.73
6803,-12.12
6804,-12.50
6805,-12.81
6806,-13.05
6807,-13.24
6808,-13.37
6809,-13.44
6810,-13.45
6811,-13.39
6812,-13.30
6813,-13.18
6814,-13.01
6815,-12.79
6816,-12.54
6817,-12.26
6818,-11.94
6819,-11.58
6820,-11.19
6821,-10.82
6822,-10.47
6823,-10.19
6824,-9.99
6825,-9.87
6826,-9.80
6827,-9.77
6828,-9.75
6829,-9.76
6830,-9.77
6831,-9.78
6832,-9.73
6833,-9.64
6834,-9.50
6835,-9.34
6836,-9.14
6837,-8.91
6838,-8.64
6839,-8.36
6840,-8.07
6841,-7.80
6842,-7.52
6843,-7.26
6844,-6.96
6845,-6.65
6846,-6.28
6847,-5.90
6848,-5.44
6849,-4.97
6850,-4.47
6851,-4.02
6852,-3.61
6853,-3.28
6854,-3.01
6855,-2.78
6856,-2.54
6857,-2.31
6858,-2.06
6859,-1.81
6860,-1.53
6861,-1.27
6862,-1.07
6863,-1.01
6864,-1.08
6865,-1.27
6866,-1.53
6867,-1.82
6868,-2.05
6869,-2.20
6870,-2.21
6871,-2.14
6872,-1.99
6873,-1.83
6874,-1.67
6875,-1.55
6876,-1.50
6877,-1.50
6878,-1.51
6879,-1.50
6880,-1.46
6881,-1.46
6882,-1.50
6883,-1.57
6884,-1.69
6885,-1.83
6886,-2.00
6887,-2.16
6888,-2.27
6889,-2.28
6890,-2.23
6891,-2.14
6892,-2.07
6893,-2.04
6894,-2.10
6895,-2.25
6896,-2.53
6897,-2.91
6898,-3.35
6899,-3.81
6900,-4.30
6901,-4.79
6902,-5.26
6903,-5.70
6904,-6.14
6905,-6.57
6906,-7.00
6907,-7.32
6908,-7.58
6909,-7.73
6910,-7.83
6911,-7.86
6912,-7.84
6913,-7.74
6914,-7.64
6915,-7.56
6916,-7.55
6917,-7.60
6918,-7.73
6919,-7.93
6920,-8.21
6921,-8.57
6922,-8.97
6923,-9.38
6924,-9.74
6925,-10.03
6926,-10.19
6927,-10.19
6928,-10.03
6929,-9.79
6930,-9.51
6931,-9.25
6932,-9.03
6933,-8.86
6934,-8.70
6935,-8.56
6936,-8.43
6937,-8.34
6938,-8.25
6939,-8.18
6940,-8.10
6941,-8.07
6942,-8.04
6943,-8.00
6944,-7.86
6945,-7.63
6946,-7.28
6947,-6.84
6948,-6.32
6949,-5.78
6950,-5.27
6951,-4.87
6952,-4.52
6953,-4.26
6954,-4.01
6955,-3.75
6956,-3.45
6957,-3.13
6958,-2.75
6959,-2.38
6960,-1.99
6961,-1.63
6962,-1.31
6963,-1.11
6964,-0.98
6965,-0.96
6966,-0.95
6967,-0.92
6968,-0.82
6969,-0.66
6970,-0.43
6971,-0.10
6972,0.27
6973,0.64
6974,0.93
6975,1.10
6976,1.10
6977,0.90
6978,0.47
6979,-0.18
6980,-0.95
6981,-1.73
6982,-2.46
6983,-3.07
6984,-3.57
6985,-3.92
6986,-4.17
6987,-4.29
6988,-4.36
6989,-4.43
6990,-4.59
6991,-4.81
6992,-5.13
6993,-5.48
6994,-5.90
6995,-6.32
6996,-6.77
6997,-7.18
6998,-7.58
6999,-7.91
7000,-8.28
7001,-8.67
7002,-9.14
7003,-9.66
7004,-10.26
7005,-10.87
7006,-11.52
7007,-12.10
7008,-12.62
7009,-13.02
7010,-13.42
7011,-13.76
7012,-14.08
7013,-14.33
7014,-14.59
7015,-14.83
7016,-15.08
7017,-15.27
7018,-15.46
7019,-15.65
7020,-15.88
7021,-16.11
7022,-16.35
7023,-16.58
7024,-16.78
7025,-16.91
7026,-16.88
7027,-16.64
7028,-16.18
7029,-15.59
7030,-14.89
7031,-14.16
7032,-13.38
7033,-12.66
7034,-12.00
7035,-11.47
7036,-10.99
7037,-10.58
7038,-10.15
7039,-9.73
7040,-9.21
7041,-8.63
7042,-7.93
7043,-7.26
7044,-6.57
7045,-5.97
7046,-5.40
7047,-4.95
7048,-4.60
7049,-4.38
7050,-4.19
7051,-4.02
7052,-3.83
7053,-3.65
7054,-3.49
7055,-3.35
7056,-3.24
7057,-3.18
7058,-3.19
7059,-3.29
7060,-3.47
7061,-3.69
7062,-3.93
7063,-4.14
7064,-4.36
7065,-4.55
7066,-4.75
7067,-4.93
7068,-5.17
7069,-5.49
7070,-5.89
7071,-6.30
7072,-6.70
7073,-7.01
7074,-7.27
7075,-7.46
7076,-7.61
7077,-7.72
7078,-7.85
7079,-8.00
7080,-8.20
7081,-8.43
7082,-8.73
7083,-9.02
7084,-9.31
7085,-9.54
7086,-9.74
7087,-9.90
7088,-10.10
7089,-10.31
7090,-10.56
7091,-10.77
7092,-10.96
7093,-11.11
7094,-11.28
7095,-11.44
7096,-11.64
7097,-11.85
7098,-12.14
7099,-12.48
7100,-12.91
7101,-13.34
7102,-13.79
7103,-14.20
7104,-14.61
7105,-14.96
7106,-15.25
7107,-15.45
7108,-15.59
7109,-15.68
7110,-15.73
7111,-15.72
7112,-15.72
7113,-15.71
7114,-15.72
7115,-15.74
7116,-15.78
7117,-15.84
7118,-15.91
7119,-15.98
7120,-16.08
7121,-16.17
7122,-16.30
7123,-16.41
7124,-16.53
7125,-16.63
7126,-16.70
7127,-16.72
7128,-16.69
7129,-16.61
7130,-16.49
7131,-16.37
7132,-16.17
7133,-15.97
7134,-15.73
7135,-15.50
7136,-15.20
7137,-14.85
7138,-14.45
7139,-14.04
7140,-13.56
7141,-13.06
7142,-12.50
7143,-11.96
7144,-11.36
7145,-10.77
7146,-10.09
7147,-9.43
7148,-8.73
7149,-8.07
7150,-7.42
7151,-6.87
7152,-6.41
7153,-6.11
7154,-5.89
7155,-5.75
7156,-5.59
7157,-5.45
7158,-5.26
7159,-5.05
7160,-4.77
7161,-4.48
7162,-4.20
7163,-4.03
7164,-3.92
7165,-3.90
7166,-3.91
7167,-3.94
7168,-3.91
7169,-3.84
7170,-3.72
7171,-3.61
7172,-3.46
7173,-3.29
7174,-3.07
7175,-2.86
7176,-2.62
7177,-2.35
7178,-2.01
7179,-1.60
7180,-1.17
7181,-0.77
7182,-0.44
7183,-0.22
7184,-0.11
7185,-0.14
7186,-0.29
7187,-0.57
7188,-0.95
7189,-1.39
7190,-1.84
7191,-2.30
7192,-2.75
7193,-4.19
7194,-4.42
7195,-2.11
7196,-1.26
7197,-7.31
7198,-13.15
7199,-1.64
7200,16.08
