1,-189.77
2,-250.00
3,-250.00
4,-237.74
5,-238.50
6,-250.00
7,-236.37
8,-102.28
9,82.87
10,219.20
11,249.99
12,249.99
13,242.52
14,249.99
15,249.99
16,249.60
17,248.28
18,249.99
19,249.99
20,232.75
21,184.07
22,132.00
23,93.71
24,69.94
25,54.60
26,42.53
27,35.57
28,31.54
29,29.34
30,25.62
31,21.50
32,15.39
33,9.06
34,1.31
35,-5.85
36,-13.14
37,-19.31
38,-25.29
39,-30.52
40,-35.74
41,-40.34
42,-44.92
43,-48.93
44,-52.99
45,-56.54
46,-60.16
47,-63.33
48,-66.58
49,-69.44
50,-72.36
51,-74.94
52,-77.59
53,-79.94
54,-82.34
55,-84.43
56,-86.55
57,-88.41
58,-90.29
59,-91.93
60,-93.57
61,-94.99
62,-96.47
63,-97.78
64,-99.13
65,-100.30
66,-101.49
67,-102.58
68,-103.74
69,-104.80
70,-105.90
71,-106.87
72,-107.90
73,-108.86
74,-109.83
75,-110.69
76,-111.59
77,-112.39
78,-113.20
79,-113.89
80,-114.58
81,-115.17
82,-115.78
83,-116.33
84,-116.91
85,-117.42
86,-117.94
87,-118.39
88,-118.87
89,-119.34
90,-119.84
91,-120.30
92,-120.77
93,-121.17
94,-121.57
95,-121.92
96,-122.27
97,-122.57
98,-122.88
99,-123.15
100,-123.42
101,-123.65
102,-123.86
103,-124.02
104,-124.20
105,-124.34
106,-124.45
107,-124.51
108,-124.53
109,-124.53
110,-124.52
111,-124.47
112,-124.34
113,-124.16
114,-123.92
115,-123.66
116,-123.35
117,-123.00
118,-122.60
119,-122.18
120,-121.76
121,-121.33
122,-120.90
123,-120.53
124,-120.21
125,-119.96
126,-119.77
127,-119.63
128,-119.57
129,-119.59
130,-119.67
131,-119.79
132,-119.99
133,-120.28
134,-120.65
135,-121.05
136,-121.45
137,-121.83
138,-122.21
139,-122.56
140,-122.92
141,-123.27
142,-123.63
143,-123.95
144,-124.24
145,-124.50
146,-124.78
147,-125.04
148,-125.31
149,-125.53
150,-125.78
151,-126.03
152,-126.34
153,-126.67
154,-127.02
155,-127.34
156,-127.66
157,-127.94
158,-128.25
159,-128.55
160,-128.83
161,-129.07
162,-129.26
163,-129.40
164,-129.52
165,-129.57
166,-129.59
167,-129.55
168,-129.49
169,-129.43
170,-129.38
171,-129.32
172,-129.25
173,-129.20
174,-129.17
175,-129.17
176,-129.17
177,-129.17
178,-129.18
179,-129.17
180,-129.15
181,-129.13
182,-129.10
183,-129.07
184,-128.99
185,-128.88
186,-128.77
187,-128.67
188,-128.56
189,-128.42
190,-128.25
191,-128.10
192,-127.97
193,-127.85
194,-127.75
195,-127.69
196,-127.68
197,-127.71
198,-127.75
199,-127.82
200,-127.91
201,-127.99
202,-128.06
203,-128.12
204,-128.19
205,-128.25
206,-128.27
207,-128.24
208,-128.19
209,-128.13
210,-128.05
211,-127.97
212,-127.88
213,-127.82
214,-127.77
215,-127.71
216,-127.65
217,-127.62
218,-127.62
219,-127.66
220,-127.69
221,-127.69
222,-127.66
223,-127.67
224,-127.69
225,-127.69
226,-127.62
227,-127.52
228,-127.40
229,-127.30
230,-127.20
231,-127.09
232,-126.96
233,-126.84
234,-126.73
235,-126.65
236,-126.57
237,-126.51
238,-126.46
239,-126.43
240,-126.43
241,-126.43
242,-126.40
243,-126.34
244,-126.29
245,-126.27
246,-126.24
247,-126.17
248,-126.08
249,-125.99
250,-125.92
251,-125.85
252,-125.80
253,-125.74
254,-125.67
255,-125.62
256,-125.58
257,-125.55
258,-125.52
259,-125.49
260,-125.47
261,-125.47
262,-125.48
263,-125.48
264,-125.47
265,-125.47
266,-125.49
267,-125.53
268,-125.54
269,-125.55
270,-125.53
271,-125.53
272,-125.55
273,-125.59
274,-125.61
275,-125.61
276,-125.58
277,-125.56
278,-125.53
279,-125.50
280,-125.43
281,-125.34
282,-125.26
283,-125.20
284,-125.14
285,-125.09
286,-125.04
287,-125.00
288,-124.99
289,-125.00
290,-125.02
291,-125.05
292,-125.07
293,-125.07
294,-125.05
295,-125.02
296,-124.99
297,-124.97
298,-124.91
299,-124.82
300,-124.69
301,-124.54
302,-124.38
303,-124.24
304,-124.10
305,-123.98
306,-123.86
307,-123.74
308,-123.66
309,-123.63
310,-123.63
311,-123.63
312,-123.62
313,-123.63
314,-123.65
315,-123.68
316,-123.69
317,-123.66
318,-123.61
319,-123.58
320,-123.56
321,-123.53
322,-123.48
323,-123.41
324,-123.36
325,-123.34
326,-123.34
327,-123.34
328,-123.32
329,-123.32
330,-123.35
331,-123.41
332,-123.47
333,-123.50
334,-123.51
335,-123.54
336,-123.60
337,-123.70
338,-123.80
339,-123.89
340,-123.95
341,-124.01
342,-124.09
343,-124.18
344,-124.26
345,-124.29
346,-124.29
347,-124.29
348,-124.29
349,-124.26
350,-124.18
351,-124.05
352,-123.92
353,-123.80
354,-123.71
355,-123.62
356,-123.51
357,-123.42
358,-123.36
359,-123.37
360,-123.41
361,-123.47
362,-123.54
363,-123.60
364,-123.66
365,-123.76
366,-123.86
367,-123.95
368,-124.03
369,-124.08
370,-124.11
371,-124.11
372,-124.09
373,-124.05
374,-124.02
375,-124.00
376,-123.99
377,-123.98
378,-123.99
379,-124.02
380,-124.08
381,-124.18
382,-124.28
383,-124.36
384,-124.46
385,-124.57
386,-124.71
387,-124.82
388,-124.92
389,-125.01
390,-125.13
391,-125.27
392,-125.40
393,-125.50
394,-125.60
395,-125.70
396,-125.83
397,-125.95
398,-126.08
399,-126.19
400,-126.30
401,-126.43
402,-126.55
403,-126.67
404,-126.79
405,-126.88
406,-126.93
407,-126.95
408,-126.97
409,-127.01
410,-127.04
411,-127.03
412,-126.99
413,-126.93
414,-126.89
415,-126.86
416,-126.82
417,-126.76
418,-126.72
419,-126.72
420,-126.72
421,-126.73
422,-126.74
423,-126.77
424,-126.80
425,-126.83
426,-126.86
427,-126.89
428,-126.91
429,-126.91
430,-126.89
431,-126.86
432,-126.83
433,-126.79
434,-126.76
435,-126.74
436,-126.73
437,-126.72
438,-126.72
439,-126.72
440,-126.75
441,-126.81
442,-126.86
443,-126.90
444,-126.92
445,-126.95
446,-126.97
447,-126.97
448,-126.96
449,-126.95
450,-126.95
451,-126.92
452,-126.89
453,-126.82
454,-126.73
455,-126.64
456,-126.59
457,-126.59
458,-126.59
459,-126.57
460,-126.53
461,-126.49
462,-126.47
463,-126.48
464,-126.50
465,-126.53
466,-126.56
467,-126.59
468,-126.63
469,-126.66
470,-126.67
471,-126.67
472,-126.67
473,-126.67
474,-126.66
475,-126.63
476,-126.58
477,-126.52
478,-126.45
479,-126.37
480,-126.26
481,-126.14
482,-126.01
483,-125.89
484,-125.78
485,-125.66
486,-125.51
487,-125.37
488,-125.24
489,-125.15
490,-125.07
491,-124.99
492,-124.90
493,-124.81
494,-124.69
495,-124.59
496,-124.48
497,-124.40
498,-124.28
499,-124.13
500,-123.97
501,-123.83
502,-123.66
503,-123.46
504,-123.21
505,-122.97
506,-122.74
507,-122.54
508,-122.32
509,-122.12
510,-121.94
511,-121.82
512,-121.74
513,-121.68
514,-121.64
515,-121.64
516,-121.68
517,-121.75
518,-121.81
519,-121.87
520,-121.94
521,-122.03
522,-122.13
523,-122.22
524,-122.28
525,-122.31
526,-122.34
527,-122.37
528,-122.38
529,-122.38
530,-122.39
531,-122.42
532,-122.44
533,-122.45
534,-122.44
535,-122.43
536,-122.45
537,-122.48
538,-122.52
539,-122.55
540,-122.56
541,-122.56
542,-122.57
543,-122.60
544,-122.63
545,-122.63
546,-122.61
547,-122.58
548,-122.54
549,-122.51
550,-122.50
551,-122.50
552,-122.50
553,-122.49
554,-122.52
555,-122.57
556,-122.65
557,-122.71
558,-122.76
559,-122.82
560,-122.89
561,-122.99
562,-123.09
563,-123.18
564,-123.26
565,-123.34
566,-123.43
567,-123.51
568,-123.63
569,-123.74
570,-123.88
571,-124.02
572,-124.19
573,-124.37
574,-124.56
575,-124.73
576,-124.90
577,-125.05
578,-125.20
579,-125.34
580,-125.47
581,-125.56
582,-125.63
583,-125.65
584,-125.63
585,-125.58
586,-125.51
587,-125.44
588,-125.38
589,-125.32
590,-125.28
591,-125.24
592,-125.21
593,-125.18
594,-125.19
595,-125.25
596,-125.32
597,-125.35
598,-125.36
599,-125.38
600,-125.46
601,-125.56
602,-125.63
603,-125.65
604,-125.66
605,-125.69
606,-125.73
607,-125.76
608,-125.76
609,-125.76
610,-125.79
611,-125.82
612,-125.85
613,-125.84
614,-125.82
615,-125.79
616,-125.77
617,-125.74
618,-125.67
619,-125.59
620,-125.50
621,-125.44
622,-125.39
623,-125.32
624,-125.26
625,-125.24
626,-125.24
627,-125.27
628,-125.30
629,-125.37
630,-125.50
631,-125.68
632,-125.83
633,-125.95
634,-126.10
635,-126.27
636,-126.45
637,-126.60
638,-126.75
639,-126.88
640,-127.04
641,-127.15
642,-127.25
643,-127.33
644,-127.44
645,-127.56
646,-127.66
647,-127.75
648,-127.85
649,-127.97
650,-128.10
651,-128.22
652,-128.32
653,-128.38
654,-128.40
655,-128.36
656,-128.30
657,-128.20
658,-128.10
659,-127.98
660,-127.85
661,-127.70
662,-127.53
663,-127.35
664,-127.19
665,-127.07
666,-126.97
667,-126.88
668,-126.79
669,-126.71
670,-126.63
671,-126.56
672,-126.52
673,-126.50
674,-126.47
675,-126.44
676,-126.40
677,-126.34
678,-126.28
679,-126.25
680,-126.24
681,-126.24
682,-126.24
683,-126.24
684,-126.26
685,-126.30
686,-126.32
687,-126.32
688,-126.30
689,-126.30
690,-126.32
691,-126.36
692,-126.37
693,-126.34
694,-126.30
695,-126.26
696,-126.23
697,-126.17
698,-126.10
699,-126.04
700,-125.99
701,-125.97
702,-125.93
703,-125.87
704,-125.79
705,-125.72
706,-125.70
707,-125.70
708,-125.69
709,-125.67
710,-125.64
711,-125.61
712,-125.56
713,-125.51
714,-125.45
715,-125.39
716,-125.31
717,-125.23
718,-125.13
719,-125.04
720,-124.95
721,-124.86
722,-124.77
723,-124.68
724,-124.61
725,-124.55
726,-124.48
727,-124.43
728,-124.39
729,-124.40
730,-124.40
731,-124.37
732,-124.31
733,-124.25
734,-124.21
735,-124.18
736,-124.14
737,-124.08
738,-124.01
739,-123.95
740,-123.90
741,-123.84
742,-123.76
743,-123.68
744,-123.58
745,-123.49
746,-123.41
747,-123.36
748,-123.30
749,-123.25
750,-123.19
751,-123.12
752,-123.05
753,-122.99
754,-122.98
755,-122.98
756,-122.94
757,-122.88
758,-122.86
759,-122.89
760,-122.92
761,-122.93
762,-122.90
763,-122.86
764,-122.84
765,-122.82
766,-122.76
767,-122.67
768,-122.57
769,-122.48
770,-122.40
771,-122.31
772,-122.19
773,-122.11
774,-122.08
775,-122.08
776,-122.06
777,-122.00
778,-121.96
779,-121.95
780,-121.97
781,-121.97
782,-121.96
783,-121.96
784,-121.99
785,-122.05
786,-122.10
787,-122.16
788,-122.26
789,-122.40
790,-122.60
791,-122.80
792,-123.02
793,-123.23
794,-123.43
795,-123.64
796,-123.88
797,-124.11
798,-124.32
799,-124.47
800,-124.59
801,-124.70
802,-124.81
803,-124.87
804,-124.89
805,-124.89
806,-124.89
807,-124.88
808,-124.87
809,-124.87
810,-124.92
811,-124.97
812,-125.02
813,-125.05
814,-125.09
815,-125.18
816,-125.27
817,-125.34
818,-125.37
819,-125.40
820,-125.43
821,-125.47
822,-125.48
823,-125.48
824,-125.49
825,-125.48
826,-125.46
827,-125.43
828,-125.43
829,-125.46
830,-125.48
831,-125.48
832,-125.49
833,-125.51
834,-125.56
835,-125.59
836,-125.62
837,-125.64
838,-125.67
839,-125.70
840,-125.72
841,-125.75
842,-125.78
843,-125.82
844,-125.84
845,-125.84
846,-125.82
847,-125.78
848,-125.76
849,-125.76
850,-125.77
851,-125.77
852,-125.78
853,-125.80
854,-125.85
855,-125.91
856,-126.00
857,-126.12
858,-126.27
859,-126.39
860,-126.46
861,-126.53
862,-126.58
863,-126.65
864,-126.68
865,-126.66
866,-126.56
867,-126.43
868,-126.30
869,-126.16
870,-125.98
871,-125.78
872,-125.53
873,-125.27
874,-124.95
875,-124.63
876,-124.31
877,-123.99
878,-123.62
879,-123.24
880,-122.85
881,-122.49
882,-122.13
883,-121.82
884,-121.53
885,-121.29
886,-121.07
887,-120.86
888,-120.70
889,-120.61
890,-120.58
891,-120.59
892,-120.59
893,-120.59
894,-120.60
895,-120.63
896,-120.67
897,-120.74
898,-120.81
899,-120.90
900,-121.01
901,-121.12
902,-121.25
903,-121.39
904,-121.59
905,-121.83
906,-122.12
907,-122.41
908,-122.72
909,-123.04
910,-123.41
911,-123.76
912,-124.07
913,-124.34
914,-124.61
915,-124.87
916,-125.11
917,-125.28
918,-125.44
919,-125.58
920,-125.71
921,-125.79
922,-125.86
923,-125.92
924,-125.98
925,-126.01
926,-126.00
927,-125.97
928,-125.95
929,-125.95
930,-125.95
931,-125.95
932,-125.95
933,-125.95
934,-125.94
935,-125.95
936,-125.97
937,-125.99
938,-126.01
939,-126.01
940,-126.03
941,-126.05
942,-126.07
943,-126.08
944,-126.09
945,-126.11
946,-126.13
947,-126.14
948,-126.15
949,-126.17
950,-126.19
951,-126.21
952,-126.21
953,-126.21
954,-126.16
955,-126.08
956,-125.96
957,-125.84
958,-125.70
959,-125.53
960,-125.31
961,-125.07
962,-124.82
963,-124.58
964,-124.34
965,-124.14
966,-123.96
967,-123.82
968,-123.67
969,-123.52
970,-123.38
971,-123.30
972,-123.25
973,-123.22
974,-123.21
975,-123.21
976,-123.21
977,-123.21
978,-123.22
979,-123.25
980,-123.28
981,-123.28
982,-123.28
983,-123.28
984,-123.27
985,-123.24
986,-123.18
987,-123.12
988,-123.08
989,-123.02
990,-122.92
991,-122.80
992,-122.68
993,-122.60
994,-122.53
995,-122.47
996,-122.41
997,-122.38
998,-122.38
999,-122.41
1000,-122.45
1001,-122.48
1002,-122.52
1003,-122.57
1004,-122.65
1005,-122.74
1006,-122.85
1007,-122.94
1008,-122.99
1009,-123.02
1010,-123.05
1011,-123.09
1012,-123.11
1013,-123.11
1014,-123.09
1015,-123.05
1016,-123.02
1017,-122.99
1018,-122.96
1019,-122.92
1020,-122.90
1021,-122.87
1022,-122.83
1023,-122.77
1024,-122.70
1025,-122.64
1026,-122.60
1027,-122.57
1028,-122.54
1029,-122.51
1030,-122.51
1031,-122.54
1032,-122.57
1033,-122.60
1034,-122.64
1035,-122.70
1036,-122.78
1037,-122.86
1038,-122.96
1039,-123.05
1040,-123.15
1041,-123.23
1042,-123.31
1043,-123.37
1044,-123.41
1045,-123.44
1046,-123.44
1047,-123.41
1048,-123.38
1049,-123.34
1050,-123.31
1051,-123.28
1052,-123.26
1053,-123.26
1054,-123.29
1055,-123.31
1056,-123.33
1057,-123.37
1058,-123.45
1059,-123.57
1060,-123.66
1061,-123.73
1062,-123.81
1063,-123.91
1064,-124.03
1065,-124.12
1066,-124.22
1067,-124.30
1068,-124.37
1069,-124.44
1070,-124.51
1071,-124.59
1072,-124.66
1073,-124.73
1074,-124.81
1075,-124.92
1076,-125.06
1077,-125.21
1078,-125.39
1079,-125.56
1080,-125.72
1081,-125.88
1082,-126.04
1083,-126.21
1084,-126.38
1085,-126.54
1086,-126.68
1087,-126.79
1088,-126.88
1089,-126.95
1090,-127.00
1091,-127.02
1092,-127.00
1093,-126.95
1094,-126.88
1095,-126.82
1096,-126.74
1097,-126.66
1098,-126.59
1099,-126.52
1100,-126.42
1101,-126.31
1102,-126.24
1103,-126.20
1104,-126.14
1105,-126.06
1106,-126.01
1107,-126.00
1108,-125.99
1109,-125.97
1110,-125.95
1111,-125.94
1112,-125.95
1113,-125.95
1114,-125.95
1115,-125.98
1116,-126.05
1117,-126.14
1118,-126.23
1119,-126.31
1120,-126.43
1121,-126.58
1122,-126.75
1123,-126.90
1124,-127.03
1125,-127.14
1126,-127.27
1127,-127.43
1128,-127.57
1129,-127.69
1130,-127.77
1131,-127.80
1132,-127.79
1133,-127.76
1134,-127.72
1135,-127.66
1136,-127.57
1137,-127.45
1138,-127.32
1139,-127.20
1140,-127.10
1141,-126.98
1142,-126.81
1143,-126.64
1144,-126.48
1145,-126.33
1146,-126.14
1147,-125.94
1148,-125.75
1149,-125.60
1150,-125.45
1151,-125.31
1152,-125.18
1153,-125.09
1154,-125.00
1155,-124.92
1156,-124.86
1157,-124.82
1158,-124.81
1159,-124.78
1160,-124.73
1161,-124.71
1162,-124.69
1163,-124.70
1164,-124.69
1165,-124.66
1166,-124.63
1167,-124.60
1168,-124.57
1169,-124.53
1170,-124.52
1171,-124.52
1172,-124.52
1173,-124.52
1174,-124.54
1175,-124.57
1176,-124.57
1177,-124.58
1178,-124.59
1179,-124.62
1180,-124.65
1181,-124.65
1182,-124.63
1183,-124.60
1184,-124.58
1185,-124.58
1186,-124.59
1187,-124.59
1188,-124.57
1189,-125.02
1190,-124.86
1191,-124.17
1192,-123.46
1193,-126.41
1194,-127.91
1195,-121.99
1196,-115.23
1197,-125.73
1198,-144.73
1199,-130.39
1200,-72.58
