1,36.37
2,50.00
3,50.00
4,27.90
5,-18.57
6,-49.31
7,-50.00
8,-49.39
9,-47.05
10,-49.77
11,-50.00
12,-50.00
13,-49.55
14,-49.87
15,-50.00
16,-50.00
17,-50.00
18,-49.96
19,-50.00
20,-50.00
21,-50.00
22,-49.57
23,-49.82
24,-50.00
25,-50.00
26,-47.30
27,-38.95
28,-28.29
29,-19.18
30,-13.20
31,-10.00
32,-8.20
33,-8.04
34,-9.47
35,-12.11
36,-13.98
37,-14.48
38,-13.50
39,-12.14
40,-10.09
41,-7.37
42,-3.63
43,0.50
44,4.88
45,9.05
46,13.15
47,16.85
48,20.23
49,22.90
50,25.03
51,26.45
52,27.58
53,28.35
54,29.13
55,29.76
56,30.41
57,30.85
58,31.20
59,31.37
60,31.58
61,31.81
62,32.11
63,32.32
64,32.48
65,32.61
66,32.85
67,33.18
68,33.54
69,33.79
70,33.91
71,33.94
72,33.96
73,34.02
74,34.10
75,34.16
76,34.17
77,34.12
78,34.08
79,34.06
80,34.05
81,34.01
82,33.92
83,33.82
84,33.72
85,33.67
86,33.64
87,33.58
88,33.44
89,33.23
90,32.99
91,32.79
92,32.60
93,32.43
94,32.25
95,32.12
96,32.00
97,31.88
98,31.71
99,31.50
100,31.27
101,31.06
102,30.82
103,30.56
104,30.28
105,30.07
106,29.93
107,29.82
108,29.61
109,29.26
110,28.81
111,28.44
112,28.19
113,28.06
114,27.95
115,27.86
116,27.76
117,27.68
118,27.50
119,27.20
120,26.79
121,26.42
122,26.18
123,26.07
124,25.94
125,25.70
126,25.35
127,25.05
128,24.84
129,24.71
130,24.50
131,24.23
132,23.94
133,23.72
134,23.48
135,23.21
136,22.88
137,22.65
138,22.54
139,22.51
140,22.37
141,22.06
142,21.65
143,21.32
144,21.12
145,21.04
146,20.94
147,20.78
148,20.57
149,20.39
150,20.24
151,20.10
152,19.89
153,19.61
154,19.25
155,18.93
156,18.67
157,18.52
158,18.39
159,18.22
160,17.95
161,17.65
162,17.39
163,17.25
164,17.17
165,17.11
166,16.96
167,16.74
168,16.45
169,16.18
170,15.95
171,15.80
172,15.69
173,15.59
174,15.44
175,15.28
176,15.12
177,15.00
178,14.87
179,14.65
180,14.31
181,13.98
182,13.74
183,13.67
184,13.64
185,13.60
186,13.48
187,13.34
188,13.21
189,13.09
190,12.93
191,12.73
192,12.51
193,12.35
194,12.27
195,12.22
196,12.12
197,11.95
198,11.73
199,11.53
200,11.38
201,11.28
202,11.18
203,11.07
204,10.91
205,10.78
206,10.70
207,10.68
208,10.65
209,10.55
210,10.35
211,10.11
212,9.87
213,9.72
214,9.66
215,9.67
216,9.64
217,9.56
218,9.45
219,9.37
220,9.32
221,9.26
222,9.17
223,9.07
224,8.99
225,8.94
226,8.89
227,8.80
228,8.63
229,8.44
230,8.27
231,8.16
232,8.09
233,8.04
234,7.97
235,7.88
236,7.75
237,7.64
238,7.55
239,7.49
240,7.42
241,7.32
242,7.20
243,7.10
244,7.04
245,6.97
246,6.83
247,6.66
248,6.54
249,6.58
250,6.74
251,6.85
252,6.78
253,6.57
254,6.40
255,6.41
256,6.51
257,6.54
258,6.40
259,6.15
260,5.92
261,5.80
262,5.77
263,5.79
264,5.82
265,5.82
266,5.72
267,5.54
268,5.40
269,5.42
270,5.60
271,5.75
272,5.67
273,5.40
274,5.13
275,5.02
276,5.04
277,5.00
278,4.81
279,4.57
280,4.43
281,4.45
282,4.53
283,4.61
284,4.64
285,4.66
286,4.64
287,4.55
288,4.41
289,4.30
290,4.27
291,4.26
292,4.18
293,4.01
294,3.87
295,3.86
296,3.94
297,3.99
298,3.96
299,3.91
300,3.93
301,4.02
302,4.07
303,3.99
304,3.83
305,3.69
306,3.65
307,3.69
308,3.75
309,3.79
310,3.80
311,3.79
312,3.74
313,3.66
314,3.58
315,3.56
316,3.61
317,3.73
318,3.85
319,3.91
320,3.89
321,3.79
322,3.68
323,3.64
324,3.70
325,3.79
326,3.84
327,3.83
328,3.83
329,3.87
330,3.90
331,3.80
332,3.58
333,3.40
334,3.40
335,3.63
336,3.91
337,4.03
338,3.93
339,3.72
340,3.55
341,3.50
342,3.51
343,3.50
344,3.48
345,3.50
346,3.61
347,3.78
348,3.92
349,3.96
350,3.85
351,3.66
352,3.53
353,3.55
354,3.71
355,3.87
356,3.87
357,3.76
358,3.64
359,3.60
360,3.55
361,3.39
362,3.16
363,3.02
364,3.05
365,3.22
366,3.37
367,3.38
368,3.31
369,3.28
370,3.34
371,3.38
372,3.31
373,3.16
374,3.08
375,3.14
376,3.26
377,3.25
378,3.07
379,2.85
380,2.72
381,2.73
382,2.77
383,2.76
384,2.73
385,2.79
386,2.95
387,3.13
388,3.20
389,3.11
390,2.96
391,2.82
392,2.73
393,2.68
394,2.69
395,2.75
396,2.82
397,2.83
398,2.74
399,2.64
400,2.69
401,2.91
402,3.12
403,3.12
404,2.88
405,2.59
406,2.48
407,2.57
408,2.70
409,2.69
410,2.59
411,2.52
412,2.57
413,2.67
414,2.72
415,2.71
416,2.70
417,2.73
418,2.79
419,2.80
420,2.75
421,2.72
422,2.79
423,2.92
424,3.02
425,3.06
426,3.07
427,3.07
428,3.03
429,2.92
430,2.81
431,2.79
432,2.92
433,3.13
434,3.28
435,3.28
436,3.17
437,3.06
438,3.03
439,3.08
440,3.14
441,3.16
442,3.14
443,3.10
444,3.09
445,3.14
446,3.22
447,3.28
448,3.28
449,3.23
450,3.17
451,3.17
452,3.23
453,3.36
454,3.47
455,3.45
456,3.25
457,2.96
458,2.76
459,2.83
460,3.11
461,3.40
462,3.52
463,3.44
464,3.28
465,3.14
466,3.06
467,3.05
468,3.12
469,3.27
470,3.41
471,3.48
472,3.45
473,3.35
474,3.22
475,3.06
476,2.88
477,2.75
478,2.72
479,2.75
480,2.75
481,2.68
482,2.60
483,2.62
484,2.70
485,2.74
486,2.63
487,2.42
488,2.24
489,2.22
490,2.31
491,2.38
492,2.34
493,2.22
494,2.10
495,2.07
496,2.11
497,2.15
498,2.10
499,1.96
500,1.81
501,1.79
502,1.98
503,2.28
504,2.47
505,2.40
506,2.13
507,1.83
508,1.66
509,1.63
510,1.66
511,1.68
512,1.70
513,1.72
514,1.73
515,1.66
516,1.51
517,1.37
518,1.34
519,1.41
520,1.45
521,1.40
522,1.30
523,1.28
524,1.37
525,1.41
526,1.32
527,1.16
528,1.16
529,1.37
530,1.66
531,1.80
532,1.73
533,1.59
534,1.51
535,1.51
536,1.51
537,1.50
538,1.48
539,1.47
540,1.41
541,1.27
542,1.14
543,1.12
544,1.20
545,1.29
546,1.25
547,1.09
548,0.93
549,0.90
550,1.01
551,1.16
552,1.23
553,1.16
554,1.01
555,0.89
556,0.88
557,0.95
558,0.99
559,0.94
560,0.81
561,0.70
562,0.68
563,0.70
564,0.73
565,0.73
566,0.77
567,0.85
568,0.94
569,0.97
570,0.95
571,0.94
572,0.94
573,0.91
574,0.80
575,0.64
576,0.54
577,0.53
578,0.57
579,0.56
580,0.49
581,0.42
582,0.37
583,0.38
584,0.42
585,0.48
586,0.53
587,0.52
588,0.43
589,0.29
590,0.21
591,0.25
592,0.36
593,0.43
594,0.39
595,0.27
596,0.15
597,0.10
598,0.08
599,0.05
600,0.01
601,0.03
602,0.12
603,0.22
604,0.26
605,0.22
606,0.16
607,0.19
608,0.28
609,0.37
610,0.38
611,0.33
612,0.26
613,0.18
614,0.08
615,-0.03
616,-0.11
617,-0.15
618,-0.18
619,-0.19
620,-0.14
621,-0.01
622,0.14
623,0.21
624,0.17
625,0.15
626,0.25
627,0.37
628,0.36
629,0.18
630,0.02
631,0.05
632,0.23
633,0.32
634,0.18
635,-0.04
636,-0.10
637,0.02
638,0.16
639,0.14
640,0.04
641,-0.01
642,-0.01
643,-0.09
644,-0.29
645,-0.48
646,-0.48
647,-0.31
648,-0.17
649,-0.23
650,-0.43
651,-0.59
652,-0.59
653,-0.53
654,-0.53
655,-0.60
656,-0.63
657,-0.60
658,-0.55
659,-0.55
660,-0.57
661,-0.56
662,-0.51
663,-0.50
664,-0.60
665,-0.76
666,-0.87
667,-0.83
668,-0.72
669,-0.65
670,-0.69
671,-0.78
672,-0.83
673,-0.82
674,-0.80
675,-0.83
676,-0.91
677,-0.97
678,-0.97
679,-0.91
680,-0.84
681,-0.81
682,-0.85
683,-0.94
684,-1.01
685,-0.97
686,-0.82
687,-0.67
688,-0.68
689,-0.83
690,-0.96
691,-0.87
692,-0.60
693,-0.40
694,-0.48
695,-0.76
696,-0.96
697,-0.90
698,-0.65
699,-0.42
700,-0.37
701,-0.46
702,-0.60
703,-0.73
704,-0.82
705,-0.83
706,-0.76
707,-0.62
708,-0.52
709,-0.55
710,-0.74
711,-0.94
712,-0.99
713,-0.85
714,-0.70
715,-0.75
716,-1.04
717,-1.37
718,-1.49
719,-1.30
720,-0.99
721,-0.83
722,-0.91
723,-1.07
724,-1.08
725,-0.91
726,-0.74
727,-0.71
728,-0.79
729,-0.83
730,-0.76
731,-0.68
732,-0.70
733,-0.79
734,-0.82
735,-0.72
736,-0.59
737,-0.53
738,-0.60
739,-0.69
740,-0.74
741,-0.70
742,-0.61
743,-0.50
744,-0.39
745,-0.31
746,-0.31
747,-0.37
748,-0.47
749,-0.57
750,-0.65
751,-0.69
752,-0.68
753,-0.61
754,-0.53
755,-0.51
756,-0.58
757,-0.70
758,-0.78
759,-0.78
760,-0.74
761,-0.72
762,-0.76
763,-0.82
764,-0.81
765,-0.71
766,-0.57
767,-0.48
768,-0.52
769,-0.63
770,-0.74
771,-0.80
772,-0.84
773,-0.91
774,-0.96
775,-0.94
776,-0.81
777,-0.69
778,-0.68
779,-0.80
780,-0.92
781,-0.95
782,-0.90
783,-0.86
784,-0.88
785,-0.91
786,-0.89
787,-0.83
788,-0.73
789,-0.64
790,-0.55
791,-0.50
792,-0.54
793,-0.69
794,-0.81
795,-0.76
796,-0.53
797,-0.27
798,-0.14
799,-0.19
800,-0.28
801,-0.33
802,-0.34
803,-0.37
804,-0.43
805,-0.44
806,-0.35
807,-0.20
808,-0.07
809,-0.03
810,-0.03
811,-0.01
812,0.04
813,0.06
814,0.02
815,-0.04
816,-0.03
817,0.10
818,0.26
819,0.32
820,0.23
821,0.07
822,-0.02
823,0.03
824,0.14
825,0.18
826,0.12
827,0.06
828,0.12
829,0.28
830,0.42
831,0.43
832,0.35
833,0.26
834,0.25
835,0.34
836,0.43
837,0.49
838,0.49
839,0.47
840,0.49
841,0.53
842,0.59
843,0.60
844,0.52
845,0.42
846,0.43
847,0.60
848,0.83
849,0.98
850,0.95
851,0.81
852,0.74
853,0.81
854,0.96
855,1.08
856,1.10
857,1.06
858,1.01
859,0.95
860,0.87
861,0.79
862,0.78
863,0.90
864,1.11
865,1.30
866,1.34
867,1.21
868,1.05
869,1.00
870,1.11
871,1.28
872,1.34
873,1.22
874,1.08
875,1.07
876,1.21
877,1.38
878,1.41
879,1.26
880,1.04
881,0.92
882,0.97
883,1.12
884,1.24
885,1.32
886,1.43
887,1.59
888,1.74
889,1.75
890,1.61
891,1.43
892,1.33
893,1.38
894,1.53
895,1.62
896,1.61
897,1.55
898,1.60
899,1.78
900,1.97
901,1.99
902,1.80
903,1.55
904,1.41
905,1.45
906,1.59
907,1.72
908,1.79
909,1.85
910,1.93
911,2.03
912,2.08
913,1.99
914,1.77
915,1.55
916,1.47
917,1.57
918,1.75
919,1.86
920,1.86
921,1.82
922,1.83
923,1.90
924,1.96
925,1.92
926,1.84
927,1.81
928,1.85
929,1.92
930,1.93
931,1.85
932,1.74
933,1.67
934,1.70
935,1.82
936,1.95
937,2.04
938,2.04
939,2.01
940,2.02
941,2.11
942,2.22
943,2.25
944,2.15
945,1.97
946,1.82
947,1.77
948,1.84
949,1.97
950,2.10
951,2.18
952,2.18
953,2.12
954,2.05
955,2.02
956,1.99
957,1.91
958,1.80
959,1.72
960,1.75
961,1.87
962,2.02
963,2.10
964,2.05
965,1.87
966,1.62
967,1.44
968,1.43
969,1.62
970,1.84
971,1.95
972,1.86
973,1.67
974,1.52
975,1.48
976,1.46
977,1.39
978,1.27
979,1.22
980,1.32
981,1.51
982,1.66
983,1.66
984,1.52
985,1.34
986,1.23
987,1.23
988,1.33
989,1.49
990,1.63
991,1.66
992,1.56
993,1.41
994,1.31
995,1.27
996,1.24
997,1.19
998,1.12
999,1.06
1000,0.99
1001,0.90
1002,0.82
1003,0.81
1004,0.86
1005,0.91
1006,0.87
1007,0.80
1008,0.77
1009,0.79
1010,0.77
1011,0.63
1012,0.42
1013,0.31
1014,0.38
1015,0.54
1016,0.62
1017,0.57
1018,0.47
1019,0.40
1020,0.39
1021,0.38
1022,0.37
1023,0.41
1024,0.52
1025,0.67
1026,0.73
1027,0.65
1028,0.48
1029,0.37
1030,0.40
1031,0.53
1032,0.64
1033,0.65
1034,0.59
1035,0.51
1036,0.45
1037,0.37
1038,0.26
1039,0.16
1040,0.14
1041,0.25
1042,0.46
1043,0.64
1044,0.67
1045,0.54
1046,0.33
1047,0.17
1048,0.12
1049,0.16
1050,0.24
1051,0.30
1052,0.33
1053,0.34
1054,0.34
1055,0.32
1056,0.29
1057,0.29
1058,0.32
1059,0.37
1060,0.39
1061,0.34
1062,0.28
1063,0.31
1064,0.44
1065,0.56
1066,0.52
1067,0.31
1068,0.08
1069,0.04
1070,0.18
1071,0.32
1072,0.27
1073,0.04
1074,-0.21
1075,-0.27
1076,-0.15
1077,0.01
1078,0.06
1079,0.00
1080,-0.09
1081,-0.16
1082,-0.21
1083,-0.26
1084,-0.32
1085,-0.35
1086,-0.34
1087,-0.27
1088,-0.17
1089,-0.12
1090,-0.20
1091,-0.40
1092,-0.58
1093,-0.64
1094,-0.60
1095,-0.60
1096,-0.72
1097,-0.87
1098,-0.93
1099,-0.87
1100,-0.76
1101,-0.65
1102,-0.56
1103,-0.47
1104,-0.46
1105,-0.60
1106,-0.86
1107,-1.06
1108,-1.03
1109,-0.83
1110,-0.63
1111,-0.63
1112,-0.81
1113,-0.99
1114,-1.05
1115,-1.01
1116,-0.98
1117,-1.01
1118,-1.03
1119,-0.96
1120,-0.81
1121,-0.66
1122,-0.59
1123,-0.62
1124,-0.71
1125,-0.81
1126,-0.90
1127,-0.97
1128,-1.00
1129,-0.98
1130,-0.93
1131,-0.90
1132,-0.93
1133,-0.94
1134,-0.88
1135,-0.75
1136,-0.66
1137,-0.65
1138,-0.70
1139,-0.77
1140,-0.87
1141,-1.02
1142,-1.16
1143,-1.19
1144,-1.06
1145,-0.86
1146,-0.74
1147,-0.81
1148,-1.01
1149,-1.20
1150,-1.23
1151,-1.12
1152,-0.96
1153,-0.89
1154,-0.94
1155,-1.07
1156,-1.21
1157,-1.28
1158,-1.22
1159,-1.06
1160,-0.88
1161,-0.80
1162,-0.86
1163,-1.01
1164,-1.14
1165,-1.18
1166,-1.14
1167,-1.06
1168,-0.99
1169,-0.91
1170,-0.86
1171,-0.87
1172,-0.97
1173,-1.15
1174,-1.32
1175,-1.35
1176,-1.24
1177,-1.06
1178,-0.95
1179,-0.99
1180,-1.10
1181,-1.19
1182,-1.19
1183,-1.14
1184,-1.12
1185,-1.20
1186,-1.34
1187,-1.45
1188,-1.45
1189,-1.35
1190,-1.21
1191,-1.14
1192,-1.19
1193,-1.32
1194,-1.41
1195,-1.37
1196,-1.21
1197,-1.04
1198,-0.99
1199,-1.09
1200,-1.24
1201,-1.33
1202,-1.34
1203,-1.34
1204,-1.35
1205,-1.35
1206,-1.28
1207,-1.18
1208,-1.14
1209,-1.22
1210,-1.34
1211,-1.36
1212,-1.27
1213,-1.17
1214,-1.17
1215,-1.24
1216,-1.25
1217,-1.14
1218,-1.02
1219,-1.02
1220,-1.14
1221,-1.23
1222,-1.18
1223,-1.02
1224,-0.89
1225,-0.85
1226,-0.89
1227,-0.91
1228,-0.90
1229,-0.90
1230,-0.90
1231,-0.88
1232,-0.84
1233,-0.79
1234,-0.75
1235,-0.74
1236,-0.74
1237,-0.72
1238,-0.68
1239,-0.60
1240,-0.51
1241,-0.45
1242,-0.45
1243,-0.50
1244,-0.54
1245,-0.55
1246,-0.56
1247,-0.61
1248,-0.67
1249,-0.69
1250,-0.65
1251,-0.61
1252,-0.66
1253,-0.79
1254,-0.87
1255,-0.76
1256,-0.51
1257,-0.30
1258,-0.29
1259,-0.50
1260,-0.73
1261,-0.82
1262,-0.75
1263,-0.60
1264,-0.51
1265,-0.51
1266,-0.51
1267,-0.45
1268,-0.30
1269,-0.11
1270,0.05
1271,0.14
1272,0.14
1273,0.05
1274,-0.07
1275,-0.16
1276,-0.16
1277,-0.05
1278,0.07
1279,0.08
1280,-0.06
1281,-0.23
1282,-0.31
1283,-0.25
1284,-0.17
1285,-0.13
1286,-0.15
1287,-0.14
1288,-0.04
1289,0.10
1290,0.20
1291,0.21
1292,0.15
1293,0.05
1294,-0.04
1295,-0.08
1296,-0.06
1297,-0.01
1298,0.07
1299,0.18
1300,0.33
1301,0.47
1302,0.49
1303,0.35
1304,0.17
1305,0.11
1306,0.22
1307,0.36
1308,0.38
1309,0.24
1310,0.12
1311,0.14
1312,0.33
1313,0.53
1314,0.63
1315,0.60
1316,0.48
1317,0.32
1318,0.18
1319,0.15
1320,0.27
1321,0.47
1322,0.60
1323,0.58
1324,0.46
1325,0.36
1326,0.32
1327,0.32
1328,0.30
1329,0.28
1330,0.30
1331,0.36
1332,0.47
1333,0.59
1334,0.68
1335,0.74
1336,0.77
1337,0.78
1338,0.76
1339,0.74
1340,0.72
1341,0.73
1342,0.79
1343,0.88
1344,0.91
1345,0.84
1346,0.73
1347,0.70
1348,0.81
1349,1.01
1350,1.16
1351,1.13
1352,0.99
1353,0.87
1354,0.88
1355,0.97
1356,1.02
1357,0.99
1358,0.97
1359,1.03
1360,1.17
1361,1.28
1362,1.29
1363,1.22
1364,1.15
1365,1.14
1366,1.15
1367,1.10
1368,1.02
1369,0.99
1370,1.08
1371,1.20
1372,1.20
1373,1.07
1374,0.97
1375,1.04
1376,1.25
1377,1.44
1378,1.46
1379,1.34
1380,1.18
1381,1.09
1382,1.08
1383,1.14
1384,1.24
1385,1.31
1386,1.30
1387,1.19
1388,1.07
1389,1.09
1390,1.28
1391,1.52
1392,1.62
1393,1.56
1394,1.45
1395,1.39
1396,1.38
1397,1.37
1398,1.36
1399,1.40
1400,1.49
1401,1.56
1402,1.56
1403,1.48
1404,1.39
1405,1.33
1406,1.28
1407,1.24
1408,1.23
1409,1.29
1410,1.41
1411,1.54
1412,1.65
1413,1.68
1414,1.64
1415,1.61
1416,1.64
1417,1.73
1418,1.79
1419,1.77
1420,1.74
1421,1.77
1422,1.83
1423,1.84
1424,1.72
1425,1.56
1426,1.51
1427,1.66
1428,1.89
1429,1.98
1430,1.82
1431,1.52
1432,1.31
1433,1.36
1434,1.61
1435,1.86
1436,1.95
1437,1.85
1438,1.66
1439,1.48
1440,1.40
1441,1.41
1442,1.51
1443,1.64
1444,1.72
1445,1.70
1446,1.63
1447,1.58
1448,1.60
1449,1.68
1450,1.75
1451,1.75
1452,1.69
1453,1.61
1454,1.52
1455,1.44
1456,1.37
1457,1.34
1458,1.37
1459,1.38
1460,1.31
1461,1.17
1462,1.10
1463,1.16
1464,1.28
1465,1.34
1466,1.31
1467,1.24
1468,1.20
1469,1.19
1470,1.13
1471,1.03
1472,0.93
1473,0.85
1474,0.77
1475,0.64
1476,0.50
1477,0.43
1478,0.46
1479,0.56
1480,0.65
1481,0.74
1482,0.84
1483,0.91
1484,0.86
1485,0.69
1486,0.50
1487,0.44
1488,0.52
1489,0.61
1490,0.58
1491,0.45
1492,0.35
1493,0.42
1494,0.62
1495,0.81
1496,0.85
1497,0.73
1498,0.56
1499,0.48
1500,0.56
1501,0.73
1502,0.87
1503,0.83
1504,0.61
1505,0.35
1506,0.23
1507,0.37
1508,0.63
1509,0.78
1510,0.62
1511,0.28
1512,0.04
1513,0.14
1514,0.46
1515,0.72
1516,0.68
1517,0.43
1518,0.22
1519,0.20
1520,0.29
1521,0.32
1522,0.24
1523,0.13
1524,0.09
1525,0.09
1526,0.06
1527,0.00
1528,-0.03
1529,0.04
1530,0.12
1531,0.11
1532,0.01
1533,-0.06
1534,0.00
1535,0.13
1536,0.17
1537,0.03
1538,-0.20
1539,-0.36
1540,-0.37
1541,-0.31
1542,-0.26
1543,-0.25
1544,-0.23
1545,-0.17
1546,-0.13
1547,-0.16
1548,-0.27
1549,-0.34
1550,-0.27
1551,-0.16
1552,-0.16
1553,-0.36
1554,-0.59
1555,-0.64
1556,-0.43
1557,-0.14
1558,-0.04
1559,-0.19
1560,-0.45
1561,-0.59
1562,-0.54
1563,-0.40
1564,-0.33
1565,-0.34
1566,-0.39
1567,-0.44
1568,-0.50
1569,-0.59
1570,-0.70
1571,-0.75
1572,-0.75
1573,-0.71
1574,-0.66
1575,-0.61
1576,-0.56
1577,-0.48
1578,-0.44
1579,-0.48
1580,-0.63
1581,-0.78
1582,-0.85
1583,-0.81
1584,-0.75
1585,-0.73
1586,-0.76
1587,-0.77
1588,-0.71
1589,-0.63
1590,-0.60
1591,-0.65
1592,-0.76
1593,-0.86
1594,-0.91
1595,-0.93
1596,-0.97
1597,-1.03
1598,-1.10
1599,-1.15
1600,-1.19
1601,-1.21
1602,-1.21
1603,-1.22
1604,-1.28
1605,-1.37
1606,-1.43
1607,-1.40
1608,-1.28
1609,-1.20
1610,-1.23
1611,-1.37
1612,-1.49
1613,-1.49
1614,-1.36
1615,-1.20
1616,-1.12
1617,-1.14
1618,-1.22
1619,-1.28
1620,-1.26
1621,-1.16
1622,-1.03
1623,-0.94
1624,-0.95
1625,-1.01
1626,-1.06
1627,-1.12
1628,-1.22
1629,-1.36
1630,-1.44
1631,-1.34
1632,-1.12
1633,-0.99
1634,-1.08
1635,-1.34
1636,-1.52
1637,-1.48
1638,-1.33
1639,-1.26
1640,-1.39
1641,-1.56
1642,-1.60
1643,-1.49
1644,-1.38
1645,-1.41
1646,-1.57
1647,-1.72
1648,-1.73
1649,-1.65
1650,-1.60
1651,-1.64
1652,-1.73
1653,-1.77
1654,-1.74
1655,-1.70
1656,-1.74
1657,-1.82
1658,-1.82
1659,-1.68
1660,-1.47
1661,-1.35
1662,-1.41
1663,-1.58
1664,-1.66
1665,-1.57
1666,-1.35
1667,-1.15
1668,-1.09
1669,-1.15
1670,-1.22
1671,-1.26
1672,-1.23
1673,-1.18
1674,-1.11
1675,-1.07
1676,-1.07
1677,-1.09
1678,-1.08
1679,-1.02
1680,-0.95
1681,-0.97
1682,-1.09
1683,-1.25
1684,-1.33
1685,-1.29
1686,-1.16
1687,-0.99
1688,-0.87
1689,-0.82
1690,-0.88
1691,-1.05
1692,-1.26
1693,-1.39
1694,-1.35
1695,-1.16
1696,-0.91
1697,-0.67
1698,-0.49
1699,-0.40
1700,-0.41
1701,-0.51
1702,-0.65
1703,-0.72
1704,-0.70
1705,-0.62
1706,-0.58
1707,-0.59
1708,-0.64
1709,-0.65
1710,-0.63
1711,-0.63
1712,-0.69
1713,-0.78
1714,-0.83
1715,-0.81
1716,-0.76
1717,-0.71
1718,-0.68
1719,-0.66
1720,-0.68
1721,-0.70
1722,-0.68
1723,-0.60
1724,-0.50
1725,-0.47
1726,-0.54
1727,-0.60
1728,-0.57
1729,-0.48
1730,-0.40
1731,-0.38
1732,-0.35
1733,-0.25
1734,-0.11
1735,-0.04
1736,-0.10
1737,-0.24
1738,-0.35
1739,-0.37
1740,-0.34
1741,-0.32
1742,-0.31
1743,-0.28
1744,-0.25
1745,-0.24
1746,-0.23
1747,-0.13
1748,0.08
1749,0.27
1750,0.28
1751,0.07
1752,-0.17
1753,-0.29
1754,-0.25
1755,-0.21
1756,-0.26
1757,-0.37
1758,-0.43
1759,-0.40
1760,-0.31
1761,-0.24
1762,-0.18
1763,-0.14
1764,-0.14
1765,-0.17
1766,-0.20
1767,-0.18
1768,-0.15
1769,-0.15
1770,-0.21
1771,-0.26
1772,-0.25
1773,-0.21
1774,-0.25
1775,-0.42
1776,-0.62
1777,-0.68
1778,-0.58
1779,-0.44
1780,-0.40
1781,-0.44
1782,-0.44
1783,-0.35
1784,-0.23
1785,-0.20
1786,-0.29
1787,-0.38
1788,-0.40
1789,-0.36
1790,-0.33
1791,-0.33
1792,-0.31
1793,-0.22
1794,-0.06
1795,0.08
1796,0.16
1797,0.17
1798,0.18
1799,0.23
1800,0.32
1801,0.41
1802,0.47
1803,0.47
1804,0.39
1805,0.29
1806,0.22
1807,0.21
1808,0.23
1809,0.22
1810,0.14
1811,0.07
1812,0.09
1813,0.19
1814,0.32
1815,0.42
1816,0.46
1817,0.48
1818,0.50
1819,0.51
1820,0.52
1821,0.50
1822,0.45
1823,0.42
1824,0.44
1825,0.51
1826,0.59
1827,0.61
1828,0.56
1829,0.51
1830,0.52
1831,0.59
1832,0.67
1833,0.70
1834,0.70
1835,0.71
1836,0.77
1837,0.80
1838,0.75
1839,0.61
1840,0.46
1841,0.36
1842,0.36
1843,0.43
1844,0.55
1845,0.67
1846,0.76
1847,0.79
1848,0.80
1849,0.84
1850,0.91
1851,0.99
1852,1.01
1853,0.98
1854,0.93
1855,0.91
1856,0.89
1857,0.85
1858,0.83
1859,0.85
1860,0.91
1861,0.97
1862,0.98
1863,0.96
1864,0.94
1865,0.93
1866,0.91
1867,0.83
1868,0.74
1869,0.71
1870,0.78
1871,0.91
1872,1.02
1873,1.07
1874,1.06
1875,1.02
1876,0.96
1877,0.93
1878,0.94
1879,1.00
1880,1.04
1881,1.02
1882,0.96
1883,0.91
1884,0.93
1885,0.98
1886,1.02
1887,0.99
1888,0.93
1889,0.91
1890,0.96
1891,1.09
1892,1.19
1893,1.18
1894,1.03
1895,0.86
1896,0.81
1897,0.92
1898,1.12
1899,1.29
1900,1.37
1901,1.41
1902,1.48
1903,1.54
1904,1.56
1905,1.48
1906,1.34
1907,1.21
1908,1.13
1909,1.13
1910,1.19
1911,1.28
1912,1.39
1913,1.47
1914,1.53
1915,1.58
1916,1.63
1917,1.64
1918,1.56
1919,1.45
1920,1.43
1921,1.55
1922,1.70
1923,1.76
1924,1.66
1925,1.49
1926,1.37
1927,1.36
1928,1.39
1929,1.39
1930,1.34
1931,1.29
1932,1.24
1933,1.20
1934,1.14
1935,1.10
1936,1.10
1937,1.16
1938,1.19
1939,1.15
1940,1.07
1941,1.04
1942,1.14
1943,1.32
1944,1.45
1945,1.44
1946,1.30
1947,1.16
1948,1.09
1949,1.10
1950,1.13
1951,1.12
1952,1.05
1953,0.96
1954,0.89
1955,0.86
1956,0.91
1957,1.01
1958,1.09
1959,1.12
1960,1.09
1961,1.02
1962,0.92
1963,0.82
1964,0.73
1965,0.71
1966,0.76
1967,0.85
1968,0.89
1969,0.83
1970,0.72
1971,0.64
1972,0.62
1973,0.64
1974,0.63
1975,0.55
1976,0.48
1977,0.48
1978,0.59
1979,0.73
1980,0.80
1981,0.72
1982,0.54
1983,0.38
1984,0.36
1985,0.46
1986,0.54
1987,0.47
1988,0.26
1989,0.11
1990,0.15
1991,0.30
1992,0.37
1993,0.24
1994,0.01
1995,-0.10
1996,-0.02
1997,0.14
1998,0.20
1999,0.13
2000,0.04
2001,0.00
2002,0.03
2003,0.07
2004,0.14
2005,0.26
2006,0.40
2007,0.45
2008,0.37
2009,0.22
2010,0.11
2011,0.11
2012,0.15
2013,0.13
2014,0.07
2015,0.05
2016,0.11
2017,0.18
2018,0.18
2019,0.15
2020,0.15
2021,0.22
2022,0.28
2023,0.25
2024,0.12
2025,0.01
2026,-0.01
2027,0.00
2028,-0.05
2029,-0.17
2030,-0.24
2031,-0.21
2032,-0.16
2033,-0.14
2034,-0.15
2035,-0.09
2036,-0.01
2037,-0.01
2038,-0.16
2039,-0.35
2040,-0.45
2041,-0.41
2042,-0.34
2043,-0.34
2044,-0.42
2045,-0.52
2046,-0.60
2047,-0.67
2048,-0.70
2049,-0.68
2050,-0.62
2051,-0.65
2052,-0.81
2053,-0.99
2054,-1.00
2055,-0.74
2056,-0.36
2057,-0.11
2058,-0.13
2059,-0.34
2060,-0.56
2061,-0.70
2062,-0.78
2063,-0.81
2064,-0.80
2065,-0.75
2066,-0.71
2067,-0.69
2068,-0.69
2069,-0.70
2070,-0.73
2071,-0.79
2072,-0.87
2073,-0.90
2074,-0.90
2075,-0.91
2076,-0.98
2077,-1.08
2078,-1.11
2079,-1.02
2080,-0.87
2081,-0.79
2082,-0.91
2083,-1.12
2084,-1.25
2085,-1.15
2086,-0.92
2087,-0.75
2088,-0.76
2089,-0.92
2090,-1.07
2091,-1.11
2092,-1.05
2093,-1.00
2094,-1.03
2095,-1.13
2096,-1.18
2097,-1.11
2098,-0.98
2099,-0.91
2100,-0.99
2101,-1.14
2102,-1.25
2103,-1.25
2104,-1.16
2105,-1.03
2106,-0.92
2107,-0.84
2108,-0.84
2109,-0.94
2110,-1.09
2111,-1.20
2112,-1.22
2113,-1.16
2114,-1.08
2115,-1.00
2116,-0.91
2117,-0.86
2118,-0.89
2119,-1.02
2120,-1.16
2121,-1.21
2122,-1.17
2123,-1.14
2124,-1.21
2125,-1.33
2126,-1.39
2127,-1.32
2128,-1.22
2129,-1.21
2130,-1.32
2131,-1.41
2132,-1.38
2133,-1.25
2134,-1.19
2135,-1.28
2136,-1.48
2137,-1.61
2138,-1.54
2139,-1.31
2140,-1.09
2141,-1.02
2142,-1.11
2143,-1.25
2144,-1.32
2145,-1.28
2146,-1.16
2147,-1.07
2148,-1.05
2149,-1.08
2150,-1.09
2151,-0.99
2152,-0.83
2153,-0.72
2154,-0.77
2155,-0.94
2156,-1.08
2157,-1.06
2158,-0.92
2159,-0.87
2160,-1.02
2161,-1.29
2162,-1.46
2163,-1.41
2164,-1.21
2165,-1.03
2166,-0.98
2167,-1.05
2168,-1.14
2169,-1.18
2170,-1.13
2171,-1.04
2172,-1.02
2173,-1.12
2174,-1.28
2175,-1.34
2176,-1.23
2177,-1.03
2178,-0.92
2179,-0.98
2180,-1.12
2181,-1.16
2182,-1.11
2183,-1.07
2184,-1.16
2185,-1.31
2186,-1.35
2187,-1.23
2188,-1.07
2189,-1.03
2190,-1.12
2191,-1.15
2192,-1.01
2193,-0.81
2194,-0.76
2195,-0.91
2196,-1.07
2197,-1.05
2198,-0.88
2199,-0.75
2200,-0.79
2201,-0.94
2202,-1.04
2203,-1.03
2204,-0.99
2205,-1.03
2206,-1.09
2207,-1.08
2208,-0.97
2209,-0.83
2210,-0.73
2211,-0.69
2212,-0.67
2213,-0.69
2214,-0.79
2215,-0.90
2216,-0.92
2217,-0.78
2218,-0.57
2219,-0.44
2220,-0.43
2221,-0.47
2222,-0.44
2223,-0.37
2224,-0.33
2225,-0.36
2226,-0.41
2227,-0.42
2228,-0.42
2229,-0.46
2230,-0.54
2231,-0.61
2232,-0.59
2233,-0.50
2234,-0.43
2235,-0.42
2236,-0.42
2237,-0.40
2238,-0.37
2239,-0.37
2240,-0.43
2241,-0.50
2242,-0.56
2243,-0.60
2244,-0.59
2245,-0.54
2246,-0.43
2247,-0.33
2248,-0.31
2249,-0.39
2250,-0.49
2251,-0.49
2252,-0.34
2253,-0.16
2254,-0.10
2255,-0.21
2256,-0.35
2257,-0.37
2258,-0.22
2259,-0.05
2260,-0.01
2261,-0.09
2262,-0.18
2263,-0.14
2264,0.01
2265,0.14
2266,0.18
2267,0.19
2268,0.24
2269,0.33
2270,0.40
2271,0.34
2272,0.18
2273,0.01
2274,-0.09
2275,-0.15
2276,-0.21
2277,-0.27
2278,-0.27
2279,-0.21
2280,-0.13
2281,-0.11
2282,-0.14
2283,-0.19
2284,-0.20
2285,-0.17
2286,-0.12
2287,-0.07
2288,0.03
2289,0.20
2290,0.36
2291,0.42
2292,0.35
2293,0.22
2294,0.15
2295,0.22
2296,0.38
2297,0.49
2298,0.48
2299,0.33
2300,0.15
2301,0.02
2302,0.01
2303,0.06
2304,0.11
2305,0.12
2306,0.11
2307,0.14
2308,0.22
2309,0.29
2310,0.30
2311,0.27
2312,0.30
2313,0.43
2314,0.61
2315,0.70
2316,0.67
2317,0.54
2318,0.42
2319,0.40
2320,0.47
2321,0.61
2322,0.77
2323,0.89
2324,0.95
2325,0.93
2326,0.89
2327,0.86
2328,0.88
2329,0.91
2330,0.92
2331,0.90
2332,0.86
2333,0.82
2334,0.79
2335,0.76
2336,0.76
2337,0.78
2338,0.85
2339,0.93
2340,0.98
2341,0.94
2342,0.83
2343,0.71
2344,0.67
2345,0.72
2346,0.80
2347,0.85
2348,0.88
2349,0.92
2350,0.98
2351,0.99
2352,0.93
2353,0.82
2354,0.74
2355,0.70
2356,0.66
2357,0.62
2358,0.64
2359,0.75
2360,0.88
2361,0.90
2362,0.80
2363,0.70
2364,0.70
2365,0.78
2366,0.79
2367,0.66
2368,0.52
2369,0.52
2370,0.70
2371,0.91
2372,1.03
2373,1.04
2374,1.03
2375,1.06
2376,1.08
2377,1.06
2378,1.00
2379,0.93
2380,0.88
2381,0.82
2382,0.75
2383,0.70
2384,0.73
2385,0.80
2386,0.87
2387,0.89
2388,0.87
2389,0.85
2390,0.90
2391,1.02
2392,1.17
2393,1.24
2394,1.17
2395,1.02
2396,0.92
2397,0.99
2398,1.17
2399,1.32
2400,1.36
2401,1.30
2402,1.22
2403,1.15
2404,1.06
2405,0.98
2406,0.96
2407,1.01
2408,1.08
2409,1.09
2410,1.07
2411,1.14
2412,1.30
2413,1.43
2414,1.40
2415,1.23
2416,1.09
2417,1.10
2418,1.21
2419,1.26
2420,1.18
2421,1.04
2422,0.96
2423,0.99
2424,1.10
2425,1.21
2426,1.26
2427,1.22
2428,1.12
2429,1.02
2430,1.01
2431,1.07
2432,1.07
2433,0.94
2434,0.75
2435,0.67
2436,0.73
2437,0.84
2438,0.87
2439,0.80
2440,0.77
2441,0.85
2442,0.97
2443,0.97
2444,0.81
2445,0.62
2446,0.52
2447,0.50
2448,0.45
2449,0.32
2450,0.22
2451,0.28
2452,0.48
2453,0.64
2454,0.59
2455,0.35
2456,0.13
2457,0.07
2458,0.18
2459,0.30
2460,0.35
2461,0.33
2462,0.30
2463,0.25
2464,0.18
2465,0.16
2466,0.24
2467,0.41
2468,0.52
2469,0.43
2470,0.19
2471,0.01
2472,0.07
2473,0.32
2474,0.56
2475,0.61
2476,0.47
2477,0.31
2478,0.22
2479,0.22
2480,0.29
2481,0.37
2482,0.45
2483,0.49
2484,0.46
2485,0.32
2486,0.13
2487,-0.02
2488,-0.06
2489,0.00
2490,0.08
2491,0.10
2492,0.03
2493,-0.06
2494,-0.09
2495,-0.06
2496,-0.02
2497,-0.07
2498,-0.18
2499,-0.25
2500,-0.20
2501,-0.08
2502,0.01
2503,-0.02
2504,-0.11
2505,-0.14
2506,-0.08
2507,-0.03
2508,-0.10
2509,-0.27
2510,-0.41
2511,-0.40
2512,-0.22
2513,-0.02
2514,0.12
2515,0.14
2516,0.11
2517,0.05
2518,-0.03
2519,-0.15
2520,-0.29
2521,-0.37
2522,-0.37
2523,-0.31
2524,-0.29
2525,-0.33
2526,-0.43
2527,-0.55
2528,-0.62
2529,-0.61
2530,-0.53
2531,-0.43
2532,-0.39
2533,-0.46
2534,-0.57
2535,-0.61
2536,-0.52
2537,-0.38
2538,-0.30
2539,-0.36
2540,-0.49
2541,-0.59
2542,-0.60
2543,-0.54
2544,-0.48
2545,-0.46
2546,-0.48
2547,-0.49
2548,-0.50
2549,-0.51
2550,-0.55
2551,-0.61
2552,-0.67
2553,-0.73
2554,-0.75
2555,-0.73
2556,-0.69
2557,-0.71
2558,-0.81
2559,-0.95
2560,-1.01
2561,-0.90
2562,-0.70
2563,-0.57
2564,-0.61
2565,-0.76
2566,-0.85
2567,-0.79
2568,-0.67
2569,-0.60
2570,-0.66
2571,-0.75
2572,-0.78
2573,-0.71
2574,-0.65
2575,-0.69
2576,-0.83
2577,-0.97
2578,-1.02
2579,-0.99
2580,-0.98
2581,-1.00
2582,-1.02
2583,-0.97
2584,-0.87
2585,-0.81
2586,-0.85
2587,-0.97
2588,-1.07
2589,-1.10
2590,-1.07
2591,-1.00
2592,-0.97
2593,-0.99
2594,-1.04
2595,-1.06
2596,-1.00
2597,-0.90
2598,-0.82
2599,-0.82
2600,-0.90
2601,-0.97
2602,-0.99
2603,-0.93
2604,-0.85
2605,-0.79
2606,-0.80
2607,-0.88
2608,-0.99
2609,-1.07
2610,-1.09
2611,-1.05
2612,-0.99
2613,-0.99
2614,-1.05
2615,-1.11
2616,-1.11
2617,-1.05
2618,-0.99
2619,-0.98
2620,-0.98
2621,-0.95
2622,-0.91
2623,-0.89
2624,-0.87
2625,-0.84
2626,-0.80
2627,-0.77
2628,-0.77
2629,-0.79
2630,-0.82
2631,-0.84
2632,-0.83
2633,-0.77
2634,-0.64
2635,-0.52
2636,-0.51
2637,-0.62
2638,-0.76
2639,-0.83
2640,-0.80
2641,-0.73
2642,-0.67
2643,-0.65
2644,-0.64
2645,-0.63
2646,-0.62
2647,-0.60
2648,-0.56
2649,-0.54
2650,-0.61
2651,-0.78
2652,-0.92
2653,-0.91
2654,-0.74
2655,-0.58
2656,-0.56
2657,-0.70
2658,-0.86
2659,-0.91
2660,-0.84
2661,-0.73
2662,-0.61
2663,-0.50
2664,-0.40
2665,-0.35
2666,-0.36
2667,-0.42
2668,-0.47
2669,-0.51
2670,-0.57
2671,-0.62
2672,-0.64
2673,-0.62
2674,-0.62
2675,-0.68
2676,-0.76
2677,-0.73
2678,-0.55
2679,-0.31
2680,-0.20
2681,-0.29
2682,-0.49
2683,-0.65
2684,-0.65
2685,-0.54
2686,-0.40
2687,-0.34
2688,-0.38
2689,-0.47
2690,-0.53
2691,-0.53
2692,-0.47
2693,-0.42
2694,-0.38
2695,-0.31
2696,-0.20
2697,-0.05
2698,0.06
2699,0.09
2700,0.04
2701,-0.04
2702,-0.11
2703,-0.17
2704,-0.21
2705,-0.18
2706,-0.08
2707,-0.02
2708,-0.08
2709,-0.21
2710,-0.24
2711,-0.09
2712,0.13
2713,0.19
2714,0.05
2715,-0.12
2716,-0.13
2717,0.07
2718,0.27
2719,0.29
2720,0.14
2721,-0.03
2722,-0.05
2723,0.04
2724,0.12
2725,0.08
2726,-0.03
2727,-0.07
2728,0.02
2729,0.18
2730,0.25
2731,0.18
2732,0.04
2733,-0.03
2734,0.04
2735,0.20
2736,0.34
2737,0.37
2738,0.26
2739,0.10
2740,0.00
2741,0.04
2742,0.18
2743,0.31
2744,0.36
2745,0.31
2746,0.27
2747,0.31
2748,0.41
2749,0.46
2750,0.43
2751,0.34
2752,0.29
2753,0.33
2754,0.38
2755,0.36
2756,0.29
2757,0.24
2758,0.29
2759,0.38
2760,0.39
2761,0.32
2762,0.26
2763,0.30
2764,0.41
2765,0.50
2766,0.49
2767,0.45
2768,0.48
2769,0.61
2770,0.79
2771,0.89
2772,0.89
2773,0.87
2774,0.88
2775,0.92
2776,0.94
2777,0.92
2778,0.93
2779,0.98
2780,1.02
2781,0.97
2782,0.83
2783,0.73
2784,0.76
2785,0.88
2786,0.99
2787,0.96
2788,0.85
2789,0.78
2790,0.84
2791,0.95
2792,0.98
2793,0.92
2794,0.90
2795,1.02
2796,1.21
2797,1.31
2798,1.25
2799,1.08
2800,0.95
2801,0.91
2802,0.91
2803,0.90
2804,0.92
2805,1.02
2806,1.17
2807,1.27
2808,1.25
2809,1.11
2810,0.96
2811,0.88
2812,0.88
2813,0.92
2814,0.94
2815,0.95
2816,0.95
2817,0.97
2818,1.02
2819,1.09
2820,1.13
2821,1.10
2822,1.01
2823,0.91
2824,0.85
2825,0.86
2826,0.90
2827,0.95
2828,0.97
2829,0.98
2830,1.03
2831,1.08
2832,1.12
2833,1.10
2834,1.06
2835,1.06
2836,1.12
2837,1.25
2838,1.37
2839,1.41
2840,1.34
2841,1.22
2842,1.16
2843,1.21
2844,1.34
2845,1.39
2846,1.28
2847,1.04
2848,0.81
2849,0.71
2850,0.75
2851,0.87
2852,1.00
2853,1.08
2854,1.09
2855,1.04
2856,0.99
2857,1.01
2858,1.08
2859,1.17
2860,1.19
2861,1.14
2862,1.06
2863,1.02
2864,1.02
2865,1.05
2866,1.07
2867,1.08
2868,1.05
2869,1.01
2870,0.98
2871,1.02
2872,1.14
2873,1.27
2874,1.33
2875,1.31
2876,1.25
2877,1.23
2878,1.25
2879,1.27
2880,1.23
2881,1.13
2882,1.05
2883,1.02
2884,1.04
2885,1.05
2886,0.99
2887,0.87
2888,0.76
2889,0.74
2890,0.84
2891,1.02
2892,1.16
2893,1.20
2894,1.14
2895,1.02
2896,0.92
2897,0.87
2898,0.85
2899,0.88
2900,0.92
2901,0.96
2902,0.94
2903,0.86
2904,0.78
2905,0.77
2906,0.86
2907,0.96
2908,0.96
2909,0.89
2910,0.81
2911,0.81
2912,0.88
2913,0.91
2914,0.86
2915,0.77
2916,0.73
2917,0.75
2918,0.77
2919,0.70
2920,0.56
2921,0.45
2922,0.47
2923,0.57
2924,0.63
2925,0.56
2926,0.40
2927,0.26
2928,0.25
2929,0.35
2930,0.46
2931,0.49
2932,0.42
2933,0.34
2934,0.35
2935,0.45
2936,0.54
2937,0.54
2938,0.45
2939,0.39
2940,0.40
2941,0.43
2942,0.40
2943,0.28
2944,0.14
2945,0.10
2946,0.17
2947,0.27
2948,0.32
2949,0.27
2950,0.21
2951,0.22
2952,0.30
2953,0.35
2954,0.29
2955,0.15
2956,0.06
2957,0.13
2958,0.27
2959,0.36
2960,0.31
2961,0.22
2962,0.25
2963,0.42
2964,0.61
2965,0.67
2966,0.56
2967,0.41
2968,0.32
2969,0.29
2970,0.23
2971,0.15
2972,0.09
2973,0.11
2974,0.14
2975,0.12
2976,0.04
2977,-0.03
2978,-0.04
2979,-0.04
2980,-0.10
2981,-0.20
2982,-0.29
2983,-0.27
2984,-0.16
2985,0.00
2986,0.14
2987,0.24
2988,0.22
2989,0.05
2990,-0.21
2991,-0.38
2992,-0.33
2993,-0.11
2994,0.06
2995,0.00
2996,-0.25
2997,-0.45
2998,-0.43
2999,-0.23
3000,-0.06
3001,-0.03
3002,-0.10
3003,-0.17
3004,-0.20
3005,-0.23
3006,-0.29
3007,-0.36
3008,-0.41
3009,-0.42
3010,-0.40
3011,-0.38
3012,-0.36
3013,-0.32
3014,-0.27
3015,-0.26
3016,-0.30
3017,-0.36
3018,-0.41
3019,-0.40
3020,-0.36
3021,-0.35
3022,-0.39
3023,-0.46
3024,-0.51
3025,-0.49
3026,-0.43
3027,-0.32
3028,-0.20
3029,-0.15
3030,-0.23
3031,-0.44
3032,-0.62
3033,-0.65
3034,-0.56
3035,-0.49
3036,-0.58
3037,-0.74
3038,-0.79
3039,-0.64
3040,-0.43
3041,-0.37
3042,-0.55
3043,-0.85
3044,-1.03
3045,-1.00
3046,-0.87
3047,-0.78
3048,-0.79
3049,-0.85
3050,-0.88
3051,-0.90
3052,-0.93
3053,-0.96
3054,-0.95
3055,-0.88
3056,-0.77
3057,-0.69
3058,-0.66
3059,-0.69
3060,-0.74
3061,-0.85
3062,-0.99
3063,-1.10
3064,-1.11
3065,-1.06
3066,-1.00
3067,-0.96
3068,-0.90
3069,-0.79
3070,-0.67
3071,-0.58
3072,-0.58
3073,-0.62
3074,-0.68
3075,-0.73
3076,-0.76
3077,-0.76
3078,-0.70
3079,-0.63
3080,-0.63
3081,-0.73
3082,-0.87
3083,-0.94
3084,-0.90
3085,-0.82
3086,-0.80
3087,-0.88
3088,-1.02
3089,-1.13
3090,-1.18
3091,-1.13
3092,-1.03
3093,-0.92
3094,-0.88
3095,-0.95
3096,-1.09
3097,-1.24
3098,-1.35
3099,-1.39
3100,-1.33
3101,-1.17
3102,-0.97
3103,-0.86
3104,-0.90
3105,-1.04
3106,-1.13
3107,-1.06
3108,-0.90
3109,-0.79
3110,-0.81
3111,-0.91
3112,-0.97
3113,-0.91
3114,-0.74
3115,-0.57
3116,-0.48
3117,-0.46
3118,-0.49
3119,-0.55
3120,-0.65
3121,-0.78
3122,-0.88
3123,-0.90
3124,-0.83
3125,-0.69
3126,-0.55
3127,-0.44
3128,-0.43
3129,-0.54
3130,-0.74
3131,-0.92
3132,-1.00
3133,-0.97
3134,-0.89
3135,-0.82
3136,-0.78
3137,-0.77
3138,-0.80
3139,-0.91
3140,-1.09
3141,-1.24
3142,-1.28
3143,-1.19
3144,-1.04
3145,-0.95
3146,-0.95
3147,-0.99
3148,-1.01
3149,-1.01
3150,-1.06
3151,-1.16
3152,-1.27
3153,-1.31
3154,-1.20
3155,-0.99
3156,-0.77
3157,-0.66
3158,-0.71
3159,-0.86
3160,-0.99
3161,-1.00
3162,-0.87
3163,-0.66
3164,-0.48
3165,-0.43
3166,-0.55
3167,-0.78
3168,-0.98
3169,-1.01
3170,-0.86
3171,-0.63
3172,-0.46
3173,-0.39
3174,-0.35
3175,-0.28
3176,-0.20
3177,-0.16
3178,-0.19
3179,-0.25
3180,-0.31
3181,-0.36
3182,-0.40
3183,-0.42
3184,-0.41
3185,-0.42
3186,-0.46
3187,-0.51
3188,-0.48
3189,-0.31
3190,-0.09
3191,0.01
3192,-0.13
3193,-0.35
3194,-0.40
3195,-0.23
3196,0.00
3197,0.02
3198,-0.19
3199,-0.37
3200,-0.29
3201,0.02
3202,0.29
3203,0.30
3204,0.10
3205,-0.07
3206,-0.04
3207,0.14
3208,0.30
3209,0.32
3210,0.25
3211,0.18
3212,0.20
3213,0.28
3214,0.37
3215,0.41
3216,0.40
3217,0.36
3218,0.35
3219,0.40
3220,0.49
3221,0.60
3222,0.69
3223,0.75
3224,0.77
3225,0.70
3226,0.54
3227,0.36
3228,0.26
3229,0.29
3230,0.39
3231,0.46
3232,0.46
3233,0.43
3234,0.38
3235,0.32
3236,0.26
3237,0.25
3238,0.35
3239,0.53
3240,0.67
3241,0.67
3242,0.57
3243,0.47
3244,0.47
3245,0.53
3246,0.61
3247,0.66
3248,0.70
3249,0.70
3250,0.62
3251,0.48
3252,0.38
3253,0.40
3254,0.51
3255,0.58
3256,0.55
3257,0.48
3258,0.49
3259,0.58
3260,0.69
3261,0.72
3262,0.72
3263,0.76
3264,0.84
3265,0.85
3266,0.75
3267,0.58
3268,0.44
3269,0.37
3270,0.33
3271,0.29
3272,0.34
3273,0.49
3274,0.70
3275,0.83
3276,0.80
3277,0.69
3278,0.65
3279,0.73
3280,0.87
3281,0.96
3282,0.97
3283,0.94
3284,0.93
3285,0.94
3286,0.98
3287,1.05
3288,1.15
3289,1.24
3290,1.23
3291,1.11
3292,0.99
3293,0.94
3294,0.98
3295,1.00
3296,0.96
3297,0.89
3298,0.90
3299,1.02
3300,1.17
3301,1.25
3302,1.21
3303,1.09
3304,1.00
3305,0.98
3306,0.99
3307,0.98
3308,0.93
3309,0.88
3310,0.89
3311,0.96
3312,1.03
3313,1.06
3314,1.02
3315,0.98
3316,0.97
3317,1.01
3318,1.04
3319,1.03
3320,0.98
3321,0.91
3322,0.85
3323,0.84
3324,0.89
3325,0.97
3326,1.00
3327,0.96
3328,0.87
3329,0.82
3330,0.85
3331,0.94
3332,0.99
3333,0.96
3334,0.84
3335,0.71
3336,0.64
3337,0.66
3338,0.74
3339,0.82
3340,0.82
3341,0.73
3342,0.59
3343,0.48
3344,0.45
3345,0.50
3346,0.60
3347,0.67
3348,0.68
3349,0.68
3350,0.73
3351,0.83
3352,0.92
3353,0.92
3354,0.86
3355,0.82
3356,0.88
3357,0.99
3358,1.03
3359,0.92
3360,0.74
3361,0.64
3362,0.70
3363,0.85
3364,0.97
3365,1.01
3366,1.03
3367,1.07
3368,1.08
3369,1.03
3370,0.96
3371,0.91
3372,0.89
3373,0.88
3374,0.88
3375,0.87
3376,0.88
3377,0.91
3378,0.94
3379,0.96
3380,0.95
3381,0.90
3382,0.83
3383,0.81
3384,0.90
3385,1.04
3386,1.13
3387,1.09
3388,0.97
3389,0.92
3390,1.00
3391,1.11
3392,1.10
3393,0.96
3394,0.82
3395,0.80
3396,0.91
3397,0.99
3398,0.95
3399,0.83
3400,0.75
3401,0.75
3402,0.78
3403,0.78
3404,0.77
3405,0.81
3406,0.90
3407,0.98
3408,0.97
3409,0.84
3410,0.70
3411,0.66
3412,0.76
3413,0.89
3414,0.91
3415,0.78
3416,0.63
3417,0.60
3418,0.74
3419,0.94
3420,1.04
3421,1.00
3422,0.87
3423,0.77
3424,0.71
3425,0.67
3426,0.64
3427,0.67
3428,0.75
3429,0.83
3430,0.80
3431,0.68
3432,0.54
3433,0.47
3434,0.47
3435,0.50
3436,0.50
3437,0.48
3438,0.43
3439,0.36
3440,0.27
3441,0.19
3442,0.15
3443,0.18
3444,0.23
3445,0.25
3446,0.26
3447,0.29
3448,0.35
3449,0.37
3450,0.29
3451,0.13
3452,-0.02
3453,-0.06
3454,0.02
3455,0.11
3456,0.14
3457,0.12
3458,0.10
3459,0.10
3460,0.08
3461,0.03
3462,0.00
3463,0.07
3464,0.20
3465,0.27
3466,0.19
3467,0.04
3468,-0.02
3469,0.09
3470,0.25
3471,0.29
3472,0.20
3473,0.08
3474,0.08
3475,0.20
3476,0.34
3477,0.36
3478,0.25
3479,0.07
3480,-0.08
3481,-0.13
3482,-0.09
3483,-0.03
3484,-0.04
3485,-0.11
3486,-0.21
3487,-0.29
3488,-0.34
3489,-0.41
3490,-0.52
3491,-0.58
3492,-0.56
3493,-0.48
3494,-0.42
3495,-0.45
3496,-0.51
3497,-0.55
3498,-0.57
3499,-0.58
3500,-0.58
3501,-0.55
3502,-0.54
3503,-0.56
3504,-0.61
3505,-0.62
3506,-0.55
3507,-0.47
3508,-0.49
3509,-0.64
3510,-0.80
3511,-0.83
3512,-0.72
3513,-0.58
3514,-0.51
3515,-0.54
3516,-0.60
3517,-0.64
3518,-0.66
3519,-0.65
3520,-0.63
3521,-0.60
3522,-0.63
3523,-0.73
3524,-0.83
3525,-0.84
3526,-0.72
3527,-0.58
3528,-0.57
3529,-0.69
3530,-0.87
3531,-1.01
3532,-1.08
3533,-1.13
3534,-1.14
3535,-1.08
3536,-0.97
3537,-0.86
3538,-0.80
3539,-0.77
3540,-0.76
3541,-0.79
3542,-0.88
3543,-1.01
3544,-1.11
3545,-1.11
3546,-1.04
3547,-0.98
3548,-0.98
3549,-1.01
3550,-1.03
3551,-1.00
3552,-0.96
3553,-0.96
3554,-1.00
3555,-1.05
3556,-1.07
3557,-1.05
3558,-1.03
3559,-1.03
3560,-1.05
3561,-1.08
3562,-1.07
3563,-1.03
3564,-0.98
3565,-0.96
3566,-0.94
3567,-0.93
3568,-0.94
3569,-1.00
3570,-1.10
3571,-1.19
3572,-1.20
3573,-1.14
3574,-1.08
3575,-1.08
3576,-1.11
3577,-1.12
3578,-1.08
3579,-0.99
3580,-0.94
3581,-0.99
3582,-1.12
3583,-1.23
3584,-1.23
3585,-1.14
3586,-1.04
3587,-0.98
3588,-0.94
3589,-0.88
3590,-0.81
3591,-0.77
3592,-0.81
3593,-0.90
3594,-0.99
3595,-1.04
3596,-1.00
3597,-0.89
3598,-0.76
3599,-0.64
3600,-0.59
3601,-0.61
3602,-0.65
3603,-0.65
3604,-0.61
3605,-0.57
3606,-0.56
3607,-0.61
3608,-0.67
3609,-0.69
3610,-0.70
3611,-0.74
3612,-0.85
3613,-0.94
3614,-0.92
3615,-0.79
3616,-0.66
3617,-0.67
3618,-0.81
3619,-0.94
3620,-0.93
3621,-0.79
3622,-0.67
3623,-0.70
3624,-0.83
3625,-0.93
3626,-0.89
3627,-0.76
3628,-0.71
3629,-0.79
3630,-0.90
3631,-0.93
3632,-0.85
3633,-0.73
3634,-0.64
3635,-0.62
3636,-0.67
3637,-0.75
3638,-0.85
3639,-0.93
3640,-0.94
3641,-0.90
3642,-0.86
3643,-0.83
3644,-0.79
3645,-0.71
3646,-0.60
3647,-0.52
3648,-0.52
3649,-0.59
3650,-0.67
3651,-0.67
3652,-0.59
3653,-0.50
3654,-0.45
3655,-0.41
3656,-0.33
3657,-0.26
3658,-0.32
3659,-0.54
3660,-0.77
3661,-0.80
3662,-0.59
3663,-0.33
3664,-0.21
3665,-0.26
3666,-0.33
3667,-0.32
3668,-0.27
3669,-0.27
3670,-0.34
3671,-0.37
3672,-0.29
3673,-0.15
3674,-0.06
3675,-0.04
3676,-0.04
3677,-0.01
3678,0.01
3679,-0.02
3680,-0.09
3681,-0.13
3682,-0.13
3683,-0.13
3684,-0.13
3685,-0.13
3686,-0.13
3687,-0.15
3688,-0.19
3689,-0.18
3690,-0.06
3691,0.13
3692,0.28
3693,0.31
3694,0.26
3695,0.22
3696,0.20
3697,0.17
3698,0.13
3699,0.14
3700,0.25
3701,0.40
3702,0.44
3703,0.33
3704,0.15
3705,0.04
3706,0.04
3707,0.09
3708,0.14
3709,0.22
3710,0.36
3711,0.52
3712,0.61
3713,0.54
3714,0.35
3715,0.19
3716,0.17
3717,0.27
3718,0.39
3719,0.43
3720,0.39
3721,0.32
3722,0.27
3723,0.27
3724,0.31
3725,0.36
3726,0.40
3727,0.41
3728,0.37
3729,0.29
3730,0.22
3731,0.21
3732,0.30
3733,0.45
3734,0.54
3735,0.49
3736,0.31
3737,0.11
3738,0.03
3739,0.10
3740,0.24
3741,0.31
3742,0.25
3743,0.08
3744,-0.08
3745,-0.14
3746,-0.08
3747,0.05
3748,0.16
3749,0.26
3750,0.35
3751,0.44
3752,0.50
3753,0.51
3754,0.49
3755,0.47
3756,0.52
3757,0.61
3758,0.70
3759,0.72
3760,0.67
3761,0.61
3762,0.59
3763,0.65
3764,0.76
3765,0.88
3766,0.94
3767,0.91
3768,0.81
3769,0.73
3770,0.79
3771,1.03
3772,1.31
3773,1.43
3774,1.32
3775,1.15
3776,1.16
3777,1.39
3778,1.62
3779,1.59
3780,1.31
3781,1.03
3782,0.97
3783,1.10
3784,1.22
3785,1.21
3786,1.14
3787,1.14
3788,1.21
3789,1.27
3790,1.26
3791,1.26
3792,1.31
3793,1.34
3794,1.28
3795,1.15
3796,1.08
3797,1.13
3798,1.21
3799,1.15
3800,0.95
3801,0.73
3802,0.65
3803,0.76
3804,0.93
3805,1.05
3806,1.03
3807,0.92
3808,0.84
3809,0.84
3810,0.93
3811,1.00
3812,0.98
3813,0.88
3814,0.81
3815,0.89
3816,1.11
3817,1.32
3818,1.37
3819,1.29
3820,1.17
3821,1.11
3822,1.14
3823,1.23
3824,1.34
3825,1.42
3826,1.41
3827,1.26
3828,1.07
3829,1.00
3830,1.11
3831,1.27
3832,1.30
3833,1.17
3834,1.05
3835,1.11
3836,1.30
3837,1.42
3838,1.35
3839,1.21
3840,1.16
3841,1.23
3842,1.31
3843,1.29
3844,1.19
3845,1.09
3846,1.01
3847,0.93
3848,0.84
3849,0.83
3850,0.90
3851,0.98
3852,0.91
3853,0.73
3854,0.57
3855,0.56
3856,0.68
3857,0.79
3858,0.81
3859,0.78
3860,0.76
3861,0.75
3862,0.73
3863,0.70
3864,0.71
3865,0.81
3866,0.89
3867,0.86
3868,0.67
3869,0.45
3870,0.34
3871,0.36
3872,0.40
3873,0.35
3874,0.20
3875,0.07
3876,0.07
3877,0.16
3878,0.25
3879,0.27
3880,0.22
3881,0.19
3882,0.20
3883,0.18
3884,0.08
3885,-0.05
3886,-0.08
3887,0.05
3888,0.23
3889,0.30
3890,0.20
3891,0.03
3892,-0.04
3893,0.04
3894,0.16
3895,0.23
3896,0.21
3897,0.16
3898,0.15
3899,0.21
3900,0.32
3901,0.42
3902,0.46
3903,0.43
3904,0.35
3905,0.30
3906,0.30
3907,0.34
3908,0.34
3909,0.26
3910,0.18
3911,0.17
3912,0.26
3913,0.34
3914,0.31
3915,0.20
3916,0.14
3917,0.21
3918,0.33
3919,0.36
3920,0.27
3921,0.15
3922,0.11
3923,0.14
3924,0.15
3925,0.11
3926,0.03
3927,-0.01
3928,-0.02
3929,-0.03
3930,-0.08
3931,-0.17
3932,-0.28
3933,-0.36
3934,-0.37
3935,-0.31
3936,-0.21
3937,-0.12
3938,-0.12
3939,-0.19
3940,-0.27
3941,-0.31
3942,-0.28
3943,-0.22
3944,-0.18
3945,-0.20
3946,-0.26
3947,-0.30
3948,-0.28
3949,-0.18
3950,-0.08
3951,-0.10
3952,-0.30
3953,-0.59
3954,-0.76
3955,-0.71
3956,-0.51
3957,-0.36
3958,-0.35
3959,-0.46
3960,-0.59
3961,-0.67
3962,-0.71
3963,-0.74
3964,-0.76
3965,-0.78
3966,-0.82
3967,-0.86
3968,-0.89
3969,-0.86
3970,-0.80
3971,-0.79
3972,-0.88
3973,-1.01
3974,-1.09
3975,-1.05
3976,-0.92
3977,-0.81
3978,-0.77
3979,-0.78
3980,-0.81
3981,-0.85
3982,-0.88
3983,-0.88
3984,-0.86
3985,-0.79
3986,-0.71
3987,-0.65
3988,-0.68
3989,-0.80
3990,-0.98
3991,-1.14
3992,-1.20
3993,-1.16
3994,-1.08
3995,-1.07
3996,-1.12
3997,-1.17
3998,-1.12
3999,-0.97
4000,-0.81
4001,-0.79
4002,-0.95
4003,-1.18
4004,-1.34
4005,-1.36
4006,-1.29
4007,-1.26
4008,-1.32
4009,-1.40
4010,-1.42
4011,-1.39
4012,-1.37
4013,-1.39
4014,-1.38
4015,-1.25
4016,-1.00
4017,-0.79
4018,-0.76
4019,-0.95
4020,-1.21
4021,-1.35
4022,-1.27
4023,-1.03
4024,-0.80
4025,-0.70
4026,-0.73
4027,-0.79
4028,-0.80
4029,-0.73
4030,-0.63
4031,-0.56
4032,-0.52
4033,-0.48
4034,-0.40
4035,-0.36
4036,-0.40
4037,-0.51
4038,-0.61
4039,-0.63
4040,-0.57
4041,-0.51
4042,-0.52
4043,-0.59
4044,-0.65
4045,-0.65
4046,-0.57
4047,-0.45
4048,-0.35
4049,-0.33
4050,-0.39
4051,-0.48
4052,-0.55
4053,-0.57
4054,-0.54
4055,-0.51
4056,-0.49
4057,-0.50
4058,-0.54
4059,-0.60
4060,-0.64
4061,-0.64
4062,-0.59
4063,-0.56
4064,-0.59
4065,-0.67
4066,-0.74
4067,-0.76
4068,-0.78
4069,-0.83
4070,-0.87
4071,-0.83
4072,-0.71
4073,-0.63
4074,-0.69
4075,-0.83
4076,-0.93
4077,-0.91
4078,-0.84
4079,-0.84
4080,-0.89
4081,-0.88
4082,-0.72
4083,-0.49
4084,-0.36
4085,-0.44
4086,-0.64
4087,-0.77
4088,-0.73
4089,-0.61
4090,-0.60
4091,-0.72
4092,-0.88
4093,-0.90
4094,-0.77
4095,-0.65
4096,-0.71
4097,-0.95
4098,-1.18
4099,-1.23
4100,-1.08
4101,-0.86
4102,-0.75
4103,-0.76
4104,-0.82
4105,-0.83
4106,-0.77
4107,-0.73
4108,-0.74
4109,-0.79
4110,-0.82
4111,-0.83
4112,-0.84
4113,-0.90
4114,-0.96
4115,-0.99
4116,-0.99
4117,-1.00
4118,-1.03
4119,-1.05
4120,-0.99
4121,-0.88
4122,-0.76
4123,-0.68
4124,-0.63
4125,-0.60
4126,-0.62
4127,-0.74
4128,-0.92
4129,-1.06
4130,-1.05
4131,-0.90
4132,-0.68
4133,-0.54
4134,-0.53
4135,-0.58
4136,-0.61
4137,-0.61
4138,-0.58
4139,-0.56
4140,-0.58
4141,-0.62
4142,-0.67
4143,-0.73
4144,-0.79
4145,-0.85
4146,-0.85
4147,-0.80
4148,-0.70
4149,-0.63
4150,-0.62
4151,-0.67
4152,-0.71
4153,-0.69
4154,-0.63
4155,-0.55
4156,-0.47
4157,-0.40
4158,-0.35
4159,-0.32
4160,-0.31
4161,-0.29
4162,-0.25
4163,-0.21
4164,-0.21
4165,-0.23
4166,-0.19
4167,-0.09
4168,-0.03
4169,-0.07
4170,-0.18
4171,-0.25
4172,-0.21
4173,-0.11
4174,-0.08
4175,-0.12
4176,-0.14
4177,-0.12
4178,-0.13
4179,-0.23
4180,-0.40
4181,-0.47
4182,-0.37
4183,-0.19
4184,-0.06
4185,-0.02
4186,-0.01
4187,0.00
4188,0.00
4189,-0.04
4190,-0.04
4191,0.05
4192,0.17
4193,0.19
4194,0.08
4195,-0.09
4196,-0.21
4197,-0.24
4198,-0.21
4199,-0.14
4200,-0.04
4201,0.07
4202,0.11
4203,0.00
4204,-0.19
4205,-0.32
4206,-0.31
4207,-0.18
4208,-0.07
4209,-0.08
4210,-0.17
4211,-0.22
4212,-0.14
4213,0.02
4214,0.14
4215,0.12
4216,0.03
4217,0.05
4218,0.26
4219,0.56
4220,0.71
4221,0.63
4222,0.44
4223,0.38
4224,0.51
4225,0.62
4226,0.56
4227,0.36
4228,0.24
4229,0.33
4230,0.55
4231,0.71
4232,0.73
4233,0.67
4234,0.62
4235,0.63
4236,0.71
4237,0.83
4238,0.98
4239,1.10
4240,1.15
4241,1.11
4242,1.04
4243,1.01
4244,1.03
4245,1.05
4246,1.00
4247,0.90
4248,0.81
4249,0.80
4250,0.85
4251,0.91
4252,0.93
4253,0.93
4254,0.91
4255,0.89
4256,0.83
4257,0.74
4258,0.66
4259,0.66
4260,0.73
4261,0.81
4262,0.82
4263,0.74
4264,0.63
4265,0.56
4266,0.54
4267,0.54
4268,0.54
4269,0.55
4270,0.60
4271,0.68
4272,0.75
4273,0.76
4274,0.74
4275,0.72
4276,0.71
4277,0.70
4278,0.64
4279,0.56
4280,0.52
4281,0.59
4282,0.70
4283,0.75
4284,0.70
4285,0.61
4286,0.58
4287,0.67
4288,0.79
4289,0.84
4290,0.77
4291,0.67
4292,0.64
4293,0.70
4294,0.78
4295,0.77
4296,0.66
4297,0.54
4298,0.51
4299,0.59
4300,0.69
4301,0.72
4302,0.65
4303,0.56
4304,0.51
4305,0.53
4306,0.56
4307,0.55
4308,0.51
4309,0.50
4310,0.56
4311,0.63
4312,0.65
4313,0.61
4314,0.56
4315,0.57
4316,0.63
4317,0.73
4318,0.83
4319,0.91
4320,0.91
4321,0.82
4322,0.69
4323,0.60
4324,0.55
4325,0.52
4326,0.48
4327,0.48
4328,0.54
4329,0.67
4330,0.74
4331,0.66
4332,0.43
4333,0.21
4334,0.12
4335,0.18
4336,0.26
4337,0.26
4338,0.24
4339,0.29
4340,0.44
4341,0.58
4342,0.59
4343,0.49
4344,0.37
4345,0.34
4346,0.38
4347,0.43
4348,0.42
4349,0.35
4350,0.27
4351,0.22
4352,0.23
4353,0.27
4354,0.32
4355,0.33
4356,0.28
4357,0.17
4358,0.07
4359,0.06
4360,0.16
4361,0.32
4362,0.42
4363,0.43
4364,0.42
4365,0.45
4366,0.52
4367,0.59
4368,0.61
4369,0.57
4370,0.52
4371,0.47
4372,0.45
4373,0.41
4374,0.36
4375,0.32
4376,0.31
4377,0.34
4378,0.41
4379,0.52
4380,0.64
4381,0.73
4382,0.72
4383,0.59
4384,0.39
4385,0.21
4386,0.13
4387,0.16
4388,0.30
4389,0.47
4390,0.57
4391,0.53
4392,0.34
4393,0.11
4394,-0.03
4395,0.01
4396,0.15
4397,0.28
4398,0.29
4399,0.20
4400,0.11
4401,0.12
4402,0.23
4403,0.34
4404,0.33
4405,0.19
4406,0.05
4407,-0.01
4408,0.01
4409,0.02
4410,-0.06
4411,-0.19
4412,-0.26
4413,-0.23
4414,-0.15
4415,-0.14
4416,-0.22
4417,-0.32
4418,-0.35
4419,-0.30
4420,-0.24
4421,-0.19
4422,-0.16
4423,-0.18
4424,-0.30
4425,-0.50
4426,-0.64
4427,-0.58
4428,-0.34
4429,-0.13
4430,-0.16
4431,-0.39
4432,-0.59
4433,-0.56
4434,-0.33
4435,-0.11
4436,-0.07
4437,-0.15
4438,-0.21
4439,-0.17
4440,-0.09
4441,-0.07
4442,-0.08
4443,-0.09
4444,-0.09
4445,-0.14
4446,-0.25
4447,-0.39
4448,-0.45
4449,-0.42
4450,-0.38
4451,-0.41
4452,-0.53
4453,-0.64
4454,-0.67
4455,-0.61
4456,-0.54
4457,-0.55
4458,-0.67
4459,-0.80
4460,-0.86
4461,-0.77
4462,-0.63
4463,-0.55
4464,-0.60
4465,-0.69
4466,-0.71
4467,-0.65
4468,-0.60
4469,-0.61
4470,-0.60
4471,-0.49
4472,-0.32
4473,-0.27
4474,-0.43
4475,-0.71
4476,-0.90
4477,-0.86
4478,-0.66
4479,-0.49
4480,-0.46
4481,-0.50
4482,-0.50
4483,-0.47
4484,-0.53
4485,-0.72
4486,-0.91
4487,-0.95
4488,-0.83
4489,-0.68
4490,-0.60
4491,-0.56
4492,-0.47
4493,-0.29
4494,-0.15
4495,-0.20
4496,-0.42
4497,-0.65
4498,-0.68
4499,-0.49
4500,-0.27
4501,-0.26
4502,-0.50
4503,-0.78
4504,-0.91
4505,-0.85
4506,-0.76
4507,-0.78
4508,-0.86
4509,-0.86
4510,-0.75
4511,-0.66
4512,-0.73
4513,-0.92
4514,-1.07
4515,-1.05
4516,-0.89
4517,-0.72
4518,-0.60
4519,-0.52
4520,-0.51
4521,-0.58
4522,-0.70
4523,-0.75
4524,-0.67
4525,-0.54
4526,-0.49
4527,-0.59
4528,-0.70
4529,-0.71
4530,-0.63
4531,-0.58
4532,-0.60
4533,-0.62
4534,-0.53
4535,-0.38
4536,-0.28
4537,-0.27
4538,-0.30
4539,-0.33
4540,-0.37
4541,-0.45
4542,-0.53
4543,-0.51
4544,-0.40
4545,-0.31
4546,-0.32
4547,-0.41
4548,-0.46
4549,-0.43
4550,-0.36
4551,-0.35
4552,-0.43
4553,-0.51
4554,-0.50
4555,-0.40
4556,-0.30
4557,-0.31
4558,-0.44
4559,-0.59
4560,-0.65
4561,-0.60
4562,-0.47
4563,-0.39
4564,-0.40
4565,-0.46
4566,-0.50
4567,-0.49
4568,-0.50
4569,-0.55
4570,-0.61
4571,-0.64
4572,-0.67
4573,-0.71
4574,-0.77
4575,-0.80
4576,-0.75
4577,-0.66
4578,-0.56
4579,-0.51
4580,-0.52
4581,-0.57
4582,-0.64
4583,-0.69
4584,-0.68
4585,-0.61
4586,-0.55
4587,-0.54
4588,-0.60
4589,-0.69
4590,-0.76
4591,-0.79
4592,-0.81
4593,-0.84
4594,-0.87
4595,-0.90
4596,-0.90
4597,-0.90
4598,-0.88
4599,-0.85
4600,-0.82
4601,-0.85
4602,-0.94
4603,-1.05
4604,-1.06
4605,-0.96
4606,-0.83
4607,-0.78
4608,-0.74
4609,-0.64
4610,-0.48
4611,-0.40
4612,-0.51
4613,-0.70
4614,-0.72
4615,-0.46
4616,-0.13
4617,-0.02
4618,-0.18
4619,-0.40
4620,-0.38
4621,-0.11
4622,0.15
4623,0.15
4624,-0.11
4625,-0.40
4626,-0.52
4627,-0.47
4628,-0.36
4629,-0.28
4630,-0.23
4631,-0.19
4632,-0.17
4633,-0.17
4634,-0.20
4635,-0.23
4636,-0.28
4637,-0.33
4638,-0.31
4639,-0.21
4640,-0.02
4641,0.14
4642,0.18
4643,0.13
4644,0.10
4645,0.18
4646,0.35
4647,0.48
4648,0.48
4649,0.37
4650,0.24
4651,0.15
4652,0.11
4653,0.11
4654,0.14
4655,0.20
4656,0.27
4657,0.33
4658,0.38
4659,0.43
4660,0.48
4661,0.49
4662,0.42
4663,0.31
4664,0.21
4665,0.19
4666,0.23
4667,0.27
4668,0.29
4669,0.32
4670,0.40
4671,0.54
4672,0.66
4673,0.69
4674,0.61
4675,0.50
4676,0.43
4677,0.42
4678,0.44
4679,0.47
4680,0.48
4681,0.49
4682,0.49
4683,0.47
4684,0.43
4685,0.38
4686,0.36
4687,0.37
4688,0.40
4689,0.42
4690,0.44
4691,0.43
4692,0.37
4693,0.29
4694,0.26
4695,0.32
4696,0.44
4697,0.53
4698,0.52
4699,0.48
4700,0.50
4701,0.56
4702,0.59
4703,0.54
4704,0.45
4705,0.44
4706,0.51
4707,0.53
4708,0.45
4709,0.35
4710,0.38
4711,0.53
4712,0.64
4713,0.58
4714,0.36
4715,0.18
4716,0.15
4717,0.24
4718,0.34
4719,0.38
4720,0.42
4721,0.52
4722,0.65
4723,0.74
4724,0.74
4725,0.64
4726,0.54
4727,0.47
4728,0.48
4729,0.55
4730,0.63
4731,0.64
4732,0.57
4733,0.48
4734,0.47
4735,0.57
4736,0.71
4737,0.78
4738,0.75
4739,0.69
4740,0.70
4741,0.80
4742,0.94
4743,1.03
4744,1.01
4745,0.87
4746,0.67
4747,0.52
4748,0.56
4749,0.79
4750,1.11
4751,1.28
4752,1.21
4753,0.98
4754,0.77
4755,0.74
4756,0.83
4757,0.91
4758,0.87
4759,0.75
4760,0.66
4761,0.66
4762,0.71
4763,0.78
4764,0.83
4765,0.89
4766,0.96
4767,1.02
4768,1.07
4769,1.07
4770,1.03
4771,0.96
4772,0.92
4773,0.90
4774,0.88
4775,0.85
4776,0.85
4777,0.89
4778,0.97
4779,1.03
4780,1.05
4781,1.02
4782,0.97
4783,0.92
4784,0.90
4785,0.90
4786,0.94
4787,1.00
4788,1.05
4789,1.01
4790,0.83
4791,0.55
4792,0.35
4793,0.34
4794,0.49
4795,0.67
4796,0.77
4797,0.78
4798,0.77
4799,0.75
4800,0.69
4801,0.58
4802,0.49
4803,0.49
4804,0.59
4805,0.67
4806,0.69
4807,0.66
4808,0.67
4809,0.78
4810,0.93
4811,1.03
4812,1.02
4813,0.94
4814,0.87
4815,0.85
4816,0.92
4817,1.04
4818,1.15
4819,1.18
4820,1.12
4821,1.02
4822,0.95
4823,0.97
4824,1.03
4825,1.07
4826,1.05
4827,0.97
4828,0.90
4829,0.89
4830,0.91
4831,0.95
4832,0.97
4833,0.94
4834,0.86
4835,0.76
4836,0.70
4837,0.72
4838,0.77
4839,0.78
4840,0.73
4841,0.65
4842,0.63
4843,0.70
4844,0.83
4845,0.94
4846,1.02
4847,1.13
4848,1.29
4849,1.41
4850,1.37
4851,1.16
4852,0.92
4853,0.82
4854,0.88
4855,0.99
4856,1.05
4857,1.01
4858,0.93
4859,0.85
4860,0.80
4861,0.77
4862,0.76
4863,0.75
4864,0.74
4865,0.68
4866,0.59
4867,0.49
4868,0.43
4869,0.43
4870,0.43
4871,0.36
4872,0.20
4873,0.08
4874,0.12
4875,0.35
4876,0.61
4877,0.72
4878,0.56
4879,0.26
4880,0.02
4881,-0.02
4882,0.11
4883,0.23
4884,0.21
4885,0.06
4886,-0.08
4887,-0.07
4888,0.05
4889,0.15
4890,0.11
4891,-0.02
4892,-0.14
4893,-0.15
4894,-0.12
4895,-0.14
4896,-0.21
4897,-0.22
4898,-0.12
4899,0.01
4900,0.00
4901,-0.16
4902,-0.30
4903,-0.29
4904,-0.17
4905,-0.11
4906,-0.16
4907,-0.26
4908,-0.32
4909,-0.34
4910,-0.35
4911,-0.35
4912,-0.33
4913,-0.31
4914,-0.40
4915,-0.57
4916,-0.67
4917,-0.54
4918,-0.28
4919,-0.13
4920,-0.27
4921,-0.55
4922,-0.66
4923,-0.47
4924,-0.21
4925,-0.16
4926,-0.40
4927,-0.71
4928,-0.85
4929,-0.77
4930,-0.65
4931,-0.62
4932,-0.67
4933,-0.72
4934,-0.74
4935,-0.80
4936,-0.97
4937,-1.15
4938,-1.23
4939,-1.16
4940,-1.04
4941,-0.97
4942,-1.00
4943,-1.07
4944,-1.17
4945,-1.25
4946,-1.29
4947,-1.26
4948,-1.17
4949,-1.08
4950,-1.06
4951,-1.10
4952,-1.15
4953,-1.13
4954,-1.04
4955,-0.98
4956,-1.00
4957,-1.04
4958,-1.03
4959,-0.96
4960,-0.97
4961,-1.12
4962,-1.32
4963,-1.41
4964,-1.34
4965,-1.20
4966,-1.12
4967,-1.12
4968,-1.15
4969,-1.17
4970,-1.20
4971,-1.23
4972,-1.23
4973,-1.17
4974,-1.12
4975,-1.11
4976,-1.15
4977,-1.14
4978,-1.05
4979,-0.97
4980,-1.03
4981,-1.22
4982,-1.41
4983,-1.47
4984,-1.41
4985,-1.33
4986,-1.27
4987,-1.23
4988,-1.19
4989,-1.19
4990,-1.26
4991,-1.35
4992,-1.38
4993,-1.25
4994,-1.02
4995,-0.84
4996,-0.81
4997,-0.96
4998,-1.17
4999,-1.31
5000,-1.33
5001,-1.26
5002,-1.22
5003,-1.21
5004,-1.21
5005,-1.18
5006,-1.13
5007,-1.15
5008,-1.30
5009,-1.55
5010,-1.82
5011,-1.99
5012,-2.05
5013,-2.08
5014,-2.17
5015,-2.26
5016,-2.23
5017,-2.06
5018,-1.86
5019,-1.73
5020,-1.69
5021,-1.66
5022,-1.60
5023,-1.52
5024,-1.48
5025,-1.53
5026,-1.66
5027,-1.76
5028,-1.79
5029,-1.78
5030,-1.83
5031,-1.95
5032,-2.05
5033,-2.05
5034,-1.96
5035,-1.89
5036,-1.92
5037,-2.02
5038,-2.08
5039,-2.06
5040,-1.95
5041,-1.82
5042,-1.72
5043,-1.73
5044,-1.84
5045,-1.98
5046,-2.05
5047,-1.97
5048,-1.81
5049,-1.71
5050,-1.75
5051,-1.89
5052,-1.97
5053,-1.93
5054,-1.87
5055,-1.86
5056,-1.88
5057,-1.80
5058,-1.55
5059,-1.23
5060,-1.00
5061,-0.93
5062,-0.96
5063,-0.97
5064,-0.95
5065,-0.95
5066,-1.02
5067,-1.17
5068,-1.34
5069,-1.43
5070,-1.39
5071,-1.23
5072,-1.06
5073,-1.01
5074,-1.07
5075,-1.13
5076,-1.07
5077,-0.91
5078,-0.79
5079,-0.76
5080,-0.77
5081,-0.71
5082,-0.57
5083,-0.45
5084,-0.45
5085,-0.53
5086,-0.57
5087,-0.49
5088,-0.34
5089,-0.24
5090,-0.24
5091,-0.31
5092,-0.37
5093,-0.36
5094,-0.29
5095,-0.19
5096,-0.11
5097,-0.11
5098,-0.16
5099,-0.22
5100,-0.25
5101,-0.29
5102,-0.37
5103,-0.50
5104,-0.61
5105,-0.62
5106,-0.54
5107,-0.40
5108,-0.27
5109,-0.23
5110,-0.32
5111,-0.49
5112,-0.62
5113,-0.62
5114,-0.49
5115,-0.35
5116,-0.30
5117,-0.35
5118,-0.43
5119,-0.46
5120,-0.43
5121,-0.35
5122,-0.26
5123,-0.17
5124,-0.12
5125,-0.12
5126,-0.15
5127,-0.19
5128,-0.22
5129,-0.22
5130,-0.21
5131,-0.20
5132,-0.22
5133,-0.29
5134,-0.39
5135,-0.41
5136,-0.31
5137,-0.14
5138,-0.04
5139,-0.07
5140,-0.14
5141,-0.09
5142,0.07
5143,0.11
5144,-0.16
5145,-0.67
5146,-1.13
5147,-1.28
5148,-1.16
5149,-1.04
5150,-1.09
5151,-1.27
5152,-1.37
5153,-1.27
5154,-1.09
5155,-0.97
5156,-0.95
5157,-0.93
5158,-0.82
5159,-0.67
5160,-0.58
5161,-0.61
5162,-0.71
5163,-0.75
5164,-0.66
5165,-0.49
5166,-0.32
5167,-0.22
5168,-0.14
5169,-0.07
5170,0.00
5171,0.03
5172,-0.03
5173,-0.17
5174,-0.38
5175,-0.64
5176,-0.91
5177,-1.09
5178,-1.14
5179,-1.09
5180,-1.02
5181,-1.00
5182,-0.99
5183,-0.93
5184,-0.83
5185,-0.72
5186,-0.59
5187,-0.44
5188,-0.24
5189,-0.04
5190,0.14
5191,0.28
5192,0.43
5193,0.60
5194,0.80
5195,0.95
5196,1.04
5197,1.08
5198,1.11
5199,1.16
5200,1.20
5201,1.22
5202,1.22
5203,1.22
5204,1.24
5205,1.31
5206,1.43
5207,1.54
5208,1.55
5209,1.43
5210,1.27
5211,1.21
5212,1.32
5213,1.50
5214,1.64
5215,1.64
5216,1.55
5217,1.46
5218,1.46
5219,1.55
5220,1.67
5221,1.75
5222,1.76
5223,1.71
5224,1.64
5225,1.56
5226,1.53
5227,1.59
5228,1.73
5229,1.85
5230,1.86
5231,1.74
5232,1.59
5233,1.51
5234,1.54
5235,1.60
5236,1.60
5237,1.54
5238,1.49
5239,1.53
5240,1.68
5241,1.87
5242,2.04
5243,2.14
5244,2.15
5245,2.07
5246,1.92
5247,1.79
5248,1.75
5249,1.82
5250,1.95
5251,2.05
5252,2.08
5253,2.04
5254,2.02
5255,2.06
5256,2.15
5257,2.21
5258,2.20
5259,2.14
5260,2.12
5261,2.17
5262,2.24
5263,2.20
5264,2.04
5265,1.91
5266,1.94
5267,2.12
5268,2.24
5269,2.19
5270,1.97
5271,1.74
5272,1.56
5273,1.41
5274,1.26
5275,1.14
5276,1.14
5277,1.25
5278,1.36
5279,1.37
5280,1.27
5281,1.17
5282,1.15
5283,1.18
5284,1.16
5285,1.10
5286,1.07
5287,1.12
5288,1.21
5289,1.24
5290,1.20
5291,1.16
5292,1.16
5293,1.15
5294,1.02
5295,0.81
5296,0.65
5297,0.64
5298,0.75
5299,0.83
5300,0.84
5301,0.83
5302,0.89
5303,1.00
5304,1.05
5305,0.99
5306,0.91
5307,0.90
5308,0.96
5309,0.98
5310,0.90
5311,0.73
5312,0.59
5313,0.56
5314,0.61
5315,0.62
5316,0.53
5317,0.40
5318,0.39
5319,0.55
5320,0.79
5321,0.92
5322,0.87
5323,0.72
5324,0.66
5325,0.78
5326,1.01
5327,1.16
5328,1.10
5329,0.90
5330,0.73
5331,0.70
5332,0.75
5333,0.76
5334,0.67
5335,0.58
5336,0.59
5337,0.67
5338,0.71
5339,0.60
5340,0.38
5341,0.20
5342,0.15
5343,0.22
5344,0.33
5345,0.43
5346,0.54
5347,0.65
5348,0.72
5349,0.72
5350,0.68
5351,0.65
5352,0.62
5353,0.53
5354,0.40
5355,0.29
5356,0.30
5357,0.40
5358,0.46
5359,0.38
5360,0.18
5361,0.01
5362,-0.02
5363,0.12
5364,0.33
5365,0.52
5366,0.61
5367,0.61
5368,0.55
5369,0.47
5370,0.35
5371,0.24
5372,0.19
5373,0.26
5374,0.41
5375,0.50
5376,0.40
5377,0.13
5378,-0.14
5379,-0.22
5380,-0.10
5381,0.05
5382,0.06
5383,-0.10
5384,-0.31
5385,-0.44
5386,-0.44
5387,-0.40
5388,-0.37
5389,-0.35
5390,-0.28
5391,-0.18
5392,-0.10
5393,-0.11
5394,-0.20
5395,-0.28
5396,-0.29
5397,-0.27
5398,-0.29
5399,-0.36
5400,-0.41
5401,-0.40
5402,-0.34
5403,-0.33
5404,-0.42
5405,-0.54
5406,-0.61
5407,-0.57
5408,-0.49
5409,-0.48
5410,-0.58
5411,-0.72
5412,-0.84
5413,-0.93
5414,-1.07
5415,-1.29
5416,-1.56
5417,-1.78
5418,-1.89
5419,-1.86
5420,-1.74
5421,-1.60
5422,-1.54
5423,-1.62
5424,-1.84
5425,-2.13
5426,-2.35
5427,-2.44
5428,-2.41
5429,-2.30
5430,-2.20
5431,-2.15
5432,-2.18
5433,-2.27
5434,-2.29
5435,-2.17
5436,-1.92
5437,-1.72
5438,-1.70
5439,-1.82
5440,-1.91
5441,-1.92
5442,-1.91
5443,-1.94
5444,-1.98
5445,-2.01
5446,-2.04
5447,-2.08
5448,-2.10
5449,-2.05
5450,-1.94
5451,-1.82
5452,-1.73
5453,-1.70
5454,-1.70
5455,-1.71
5456,-1.71
5457,-1.76
5458,-1.88
5459,-2.02
5460,-2.10
5461,-2.10
5462,-2.06
5463,-2.01
5464,-1.89
5465,-1.66
5466,-1.37
5467,-1.14
5468,-1.06
5469,-1.07
5470,-1.14
5471,-1.31
5472,-1.62
5473,-1.97
5474,-2.17
5475,-2.19
5476,-2.11
5477,-2.04
5478,-2.02
5479,-2.02
5480,-2.09
5481,-2.24
5482,-2.39
5483,-2.41
5484,-2.32
5485,-2.23
5486,-2.24
5487,-2.33
5488,-2.39
5489,-2.31
5490,-2.12
5491,-1.97
5492,-1.94
5493,-1.99
5494,-2.02
5495,-2.03
5496,-2.05
5497,-2.12
5498,-2.14
5499,-2.06
5500,-1.94
5501,-1.93
5502,-2.09
5503,-2.28
5504,-2.35
5505,-2.25
5506,-2.08
5507,-1.98
5508,-1.99
5509,-2.03
5510,-2.03
5511,-2.01
5512,-2.01
5513,-2.07
5514,-2.16
5515,-2.23
5516,-2.24
5517,-2.20
5518,-2.13
5519,-2.07
5520,-2.07
5521,-2.12
5522,-2.18
5523,-2.23
5524,-2.26
5525,-2.28
5526,-2.29
5527,-2.29
5528,-2.28
5529,-2.31
5530,-2.38
5531,-2.43
5532,-2.37
5533,-2.17
5534,-1.94
5535,-1.85
5536,-1.97
5537,-2.20
5538,-2.35
5539,-2.31
5540,-2.12
5541,-2.01
5542,-2.07
5543,-2.22
5544,-2.20
5545,-1.91
5546,-1.52
5547,-1.29
5548,-1.32
5549,-1.46
5550,-1.43
5551,-1.15
5552,-0.76
5553,-0.46
5554,-0.33
5555,-0.27
5556,-0.18
5557,-0.06
5558,0.02
5559,-0.01
5560,-0.07
5561,-0.08
5562,0.02
5563,0.19
5564,0.36
5565,0.44
5566,0.43
5567,0.38
5568,0.36
5569,0.42
5570,0.56
5571,0.68
5572,0.71
5573,0.63
5574,0.51
5575,0.48
5576,0.61
5577,0.81
5578,0.94
5579,0.92
5580,0.88
5581,0.96
5582,1.18
5583,1.39
5584,1.44
5585,1.32
5586,1.17
5587,1.14
5588,1.23
5589,1.31
5590,1.30
5591,1.21
5592,1.13
5593,1.11
5594,1.16
5595,1.23
5596,1.31
5597,1.36
5598,1.32
5599,1.22
5600,1.14
5601,1.19
5602,1.38
5603,1.60
5604,1.70
5605,1.63
5606,1.48
5607,1.39
5608,1.43
5609,1.56
5610,1.66
5611,1.66
5612,1.55
5613,1.41
5614,1.35
5615,1.42
5616,1.59
5617,1.75
5618,1.78
5619,1.67
5620,1.51
5621,1.41
5622,1.44
5623,1.55
5624,1.64
5625,1.64
5626,1.56
5627,1.48
5628,1.47
5629,1.50
5630,1.50
5631,1.46
5632,1.43
5633,1.48
5634,1.60
5635,1.68
5636,1.70
5637,1.67
5638,1.69
5639,1.75
5640,1.77
5641,1.70
5642,1.57
5643,1.53
5644,1.65
5645,1.83
5646,1.92
5647,1.89
5648,1.87
5649,1.95
5650,2.12
5651,2.22
5652,2.18
5653,2.07
5654,1.99
5655,1.99
5656,2.05
5657,2.11
5658,2.15
5659,2.19
5660,2.27
5661,2.35
5662,2.37
5663,2.29
5664,2.13
5665,1.96
5666,1.87
5667,1.91
5668,2.06
5669,2.27
5670,2.44
5671,2.54
5672,2.51
5673,2.38
5674,2.22
5675,2.13
5676,2.18
5677,2.37
5678,2.55
5679,2.58
5680,2.43
5681,2.23
5682,2.14
5683,2.21
5684,2.31
5685,2.32
5686,2.21
5687,2.12
5688,2.15
5689,2.25
5690,2.29
5691,2.25
5692,2.22
5693,2.31
5694,2.44
5695,2.49
5696,2.36
5697,2.16
5698,2.01
5699,1.99
5700,2.01
5701,2.00
5702,1.96
5703,1.92
5704,1.89
5705,1.83
5706,1.76
5707,1.73
5708,1.76
5709,1.80
5710,1.74
5711,1.57
5712,1.35
5713,1.21
5714,1.19
5715,1.25
5716,1.33
5717,1.39
5718,1.38
5719,1.28
5720,1.09
5721,0.90
5722,0.76
5723,0.74
5724,0.79
5725,0.89
5726,0.96
5727,0.98
5728,0.96
5729,0.94
5730,0.98
5731,1.08
5732,1.19
5733,1.26
5734,1.30
5735,1.39
5736,1.52
5737,1.59
5738,1.54
5739,1.38
5740,1.24
5741,1.24
5742,1.36
5743,1.48
5744,1.54
5745,1.54
5746,1.54
5747,1.57
5748,1.61
5749,1.63
5750,1.63
5751,1.59
5752,1.55
5753,1.50
5754,1.49
5755,1.56
5756,1.71
5757,1.89
5758,2.02
5759,2.05
5760,2.02
5761,1.99
5762,1.98
5763,1.96
5764,1.89
5765,1.76
5766,1.65
5767,1.66
5768,1.77
5769,1.86
5770,1.82
5771,1.69
5772,1.57
5773,1.58
5774,1.68
5775,1.76
5776,1.74
5777,1.66
5778,1.61
5779,1.62
5780,1.64
5781,1.60
5782,1.49
5783,1.39
5784,1.37
5785,1.45
5786,1.57
5787,1.64
5788,1.64
5789,1.61
5790,1.59
5791,1.60
5792,1.57
5793,1.48
5794,1.36
5795,1.31
5796,1.36
5797,1.45
5798,1.47
5799,1.38
5800,1.23
5801,1.11
5802,1.06
5803,1.10
5804,1.20
5805,1.31
5806,1.33
5807,1.24
5808,1.09
5809,0.99
5810,1.02
5811,1.14
5812,1.26
5813,1.32
5814,1.32
5815,1.30
5816,1.24
5817,1.18
5818,1.13
5819,1.12
5820,1.14
5821,1.14
5822,1.09
5823,0.99
5824,0.90
5825,0.85
5826,0.84
5827,0.84
5828,0.83
5829,0.81
5830,0.83
5831,0.86
5832,0.87
5833,0.84
5834,0.78
5835,0.74
5836,0.71
5837,0.65
5838,0.54
5839,0.42
5840,0.37
5841,0.43
5842,0.55
5843,0.57
5844,0.46
5845,0.30
5846,0.24
5847,0.32
5848,0.44
5849,0.46
5850,0.37
5851,0.30
5852,0.34
5853,0.43
5854,0.45
5855,0.33
5856,0.14
5857,0.03
5858,0.07
5859,0.22
5860,0.35
5861,0.38
5862,0.35
5863,0.35
5864,0.45
5865,0.57
5866,0.63
5867,0.57
5868,0.47
5869,0.41
5870,0.42
5871,0.44
5872,0.40
5873,0.29
5874,0.19
5875,0.17
5876,0.24
5877,0.33
5878,0.36
5879,0.33
5880,0.29
5881,0.35
5882,0.53
5883,0.70
5884,0.74
5885,0.65
5886,0.55
5887,0.56
5888,0.68
5889,0.75
5890,0.71
5891,0.58
5892,0.50
5893,0.52
5894,0.59
5895,0.59
5896,0.51
5897,0.40
5898,0.33
5899,0.30
5900,0.28
5901,0.23
5902,0.15
5903,0.10
5904,0.12
5905,0.26
5906,0.49
5907,0.68
5908,0.68
5909,0.48
5910,0.22
5911,0.14
5912,0.29
5913,0.50
5914,0.57
5915,0.42
5916,0.19
5917,0.04
5918,0.04
5919,0.16
5920,0.33
5921,0.46
5922,0.48
5923,0.40
5924,0.29
5925,0.20
5926,0.12
5927,0.03
5928,-0.06
5929,-0.07
5930,0.04
5931,0.15
5932,0.17
5933,0.08
5934,0.00
5935,0.04
5936,0.17
5937,0.23
5938,0.12
5939,-0.05
5940,-0.14
5941,-0.09
5942,0.02
5943,0.08
5944,0.07
5945,0.01
5946,-0.08
5947,-0.21
5948,-0.33
5949,-0.36
5950,-0.31
5951,-0.25
5952,-0.28
5953,-0.36
5954,-0.38
5955,-0.31
5956,-0.26
5957,-0.35
5958,-0.57
5959,-0.76
5960,-0.81
5961,-0.74
5962,-0.70
5963,-0.73
5964,-0.83
5965,-0.92
5966,-0.97
5967,-0.97
5968,-0.89
5969,-0.76
5970,-0.65
5971,-0.67
5972,-0.83
5973,-1.03
5974,-1.15
5975,-1.14
5976,-1.06
5977,-1.01
5978,-1.02
5979,-1.03
5980,-0.99
5981,-0.89
5982,-0.79
5983,-0.74
5984,-0.72
5985,-0.70
5986,-0.66
5987,-0.61
5988,-0.55
5989,-0.53
5990,-0.57
5991,-0.63
5992,-0.64
5993,-0.58
5994,-0.52
5995,-0.53
5996,-0.60
5997,-0.64
5998,-0.57
5999,-0.41
6000,-0.29
6001,-0.30
6002,-0.43
6003,-0.57
6004,-0.61
6005,-0.58
6006,-0.53
6007,-0.50
6008,-0.48
6009,-0.48
6010,-0.54
6011,-0.66
6012,-0.78
6013,-0.81
6014,-0.74
6015,-0.59
6016,-0.42
6017,-0.30
6018,-0.27
6019,-0.35
6020,-0.51
6021,-0.65
6022,-0.68
6023,-0.57
6024,-0.42
6025,-0.33
6026,-0.35
6027,-0.43
6028,-0.51
6029,-0.56
6030,-0.59
6031,-0.62
6032,-0.65
6033,-0.65
6034,-0.63
6035,-0.61
6036,-0.61
6037,-0.63
6038,-0.63
6039,-0.58
6040,-0.49
6041,-0.40
6042,-0.32
6043,-0.28
6044,-0.29
6045,-0.29
6046,-0.24
6047,-0.15
6048,-0.09
6049,-0.16
6050,-0.32
6051,-0.44
6052,-0.43
6053,-0.31
6054,-0.23
6055,-0.27
6056,-0.38
6057,-0.47
6058,-0.46
6059,-0.39
6060,-0.29
6061,-0.20
6062,-0.12
6063,-0.12
6064,-0.23
6065,-0.39
6066,-0.47
6067,-0.43
6068,-0.38
6069,-0.40
6070,-0.47
6071,-0.46
6072,-0.34
6073,-0.23
6074,-0.27
6075,-0.42
6076,-0.50
6077,-0.40
6078,-0.20
6079,-0.09
6080,-0.15
6081,-0.27
6082,-0.35
6083,-0.37
6084,-0.40
6085,-0.46
6086,-0.50
6087,-0.45
6088,-0.37
6089,-0.36
6090,-0.44
6091,-0.52
6092,-0.48
6093,-0.31
6094,-0.12
6095,-0.07
6096,-0.19
6097,-0.43
6098,-0.61
6099,-0.64
6100,-0.50
6101,-0.33
6102,-0.26
6103,-0.30
6104,-0.36
6105,-0.35
6106,-0.30
6107,-0.30
6108,-0.34
6109,-0.34
6110,-0.25
6111,-0.17
6112,-0.16
6113,-0.20
6114,-0.18
6115,-0.04
6116,0.11
6117,0.10
6118,-0.04
6119,-0.15
6120,-0.05
6121,0.20
6122,0.39
6123,0.33
6124,0.11
6125,-0.02
6126,0.08
6127,0.30
6128,0.44
6129,0.40
6130,0.31
6131,0.32
6132,0.46
6133,0.58
6134,0.59
6135,0.52
6136,0.51
6137,0.61
6138,0.71
6139,0.72
6140,0.64
6141,0.59
6142,0.64
6143,0.74
6144,0.79
6145,0.71
6146,0.57
6147,0.48
6148,0.47
6149,0.50
6150,0.55
6151,0.63
6152,0.76
6153,0.90
6154,0.94
6155,0.82
6156,0.60
6157,0.38
6158,0.28
6159,0.32
6160,0.44
6161,0.55
6162,0.59
6163,0.59
6164,0.62
6165,0.70
6166,0.80
6167,0.84
6168,0.79
6169,0.72
6170,0.69
6171,0.75
6172,0.84
6173,0.87
6174,0.79
6175,0.66
6176,0.58
6177,0.58
6178,0.63
6179,0.68
6180,0.68
6181,0.61
6182,0.49
6183,0.40
6184,0.43
6185,0.54
6186,0.60
6187,0.53
6188,0.41
6189,0.38
6190,0.51
6191,0.73
6192,0.89
6193,0.90
6194,0.80
6195,0.70
6196,0.64
6197,0.63
6198,0.62
6199,0.60
6200,0.58
6201,0.57
6202,0.58
6203,0.63
6204,0.67
6205,0.64
6206,0.49
6207,0.28
6208,0.16
6209,0.15
6210,0.19
6211,0.17
6212,0.08
6213,-0.03
6214,-0.14
6215,-0.26
6216,-0.35
6217,-0.33
6218,-0.15
6219,0.08
6220,0.18
6221,0.08
6222,-0.11
6223,-0.22
6224,-0.19
6225,-0.11
6226,-0.11
6227,-0.21
6228,-0.32
6229,-0.34
6230,-0.29
6231,-0.22
6232,-0.20
6233,-0.22
6234,-0.26
6235,-0.27
6236,-0.26
6237,-0.25
6238,-0.29
6239,-0.36
6240,-0.46
6241,-0.53
6242,-0.57
6243,-0.58
6244,-0.55
6245,-0.45
6246,-0.29
6247,-0.21
6248,-0.29
6249,-0.48
6250,-0.57
6251,-0.42
6252,-0.12
6253,0.13
6254,0.16
6255,0.04
6256,-0.05
6257,0.01
6258,0.20
6259,0.35
6260,0.33
6261,0.12
6262,-0.15
6263,-0.33
6264,-0.33
6265,-0.19
6266,-0.01
6267,0.12
6268,0.18
6269,0.17
6270,0.10
6271,-0.03
6272,-0.19
6273,-0.32
6274,-0.33
6275,-0.27
6276,-0.21
6277,-0.19
6278,-0.17
6279,-0.10
6280,0.03
6281,0.13
6282,0.14
6283,0.08
6284,0.05
6285,0.08
6286,0.15
6287,0.21
6288,0.24
6289,0.24
6290,0.22
6291,0.18
6292,0.12
6293,0.05
6294,-0.02
6295,-0.05
6296,-0.04
6297,-0.01
6298,0.02
6299,0.06
6300,0.13
6301,0.27
6302,0.45
6303,0.58
6304,0.59
6305,0.56
6306,0.59
6307,0.70
6308,0.78
6309,0.69
6310,0.49
6311,0.33
6312,0.32
6313,0.43
6314,0.53
6315,0.55
6316,0.50
6317,0.44
6318,0.39
6319,0.34
6320,0.29
6321,0.24
6322,0.21
6323,0.22
6324,0.29
6325,0.37
6326,0.35
6327,0.22
6328,0.03
6329,-0.08
6330,-0.03
6331,0.09
6332,0.16
6333,0.13
6334,0.09
6335,0.15
6336,0.27
6337,0.34
6338,0.29
6339,0.16
6340,0.05
6341,-0.01
6342,-0.07
6343,-0.14
6344,-0.19
6345,-0.14
6346,-0.02
6347,0.10
6348,0.12
6349,0.03
6350,-0.10
6351,-0.16
6352,-0.16
6353,-0.16
6354,-0.19
6355,-0.23
6356,-0.23
6357,-0.22
6358,-0.25
6359,-0.34
6360,-0.41
6361,-0.36
6362,-0.21
6363,-0.08
6364,-0.09
6365,-0.22
6366,-0.34
6367,-0.33
6368,-0.21
6369,-0.08
6370,-0.03
6371,-0.09
6372,-0.21
6373,-0.30
6374,-0.27
6375,-0.14
6376,-0.02
6377,-0.01
6378,-0.11
6379,-0.24
6380,-0.29
6381,-0.25
6382,-0.18
6383,-0.17
6384,-0.21
6385,-0.23
6386,-0.14
6387,0.04
6388,0.18
6389,0.16
6390,0.00
6391,-0.17
6392,-0.20
6393,-0.10
6394,-0.02
6395,-0.03
6396,-0.12
6397,-0.17
6398,-0.16
6399,-0.13
6400,-0.15
6401,-0.17
6402,-0.13
6403,-0.03
6404,0.06
6405,0.08
6406,0.06
6407,0.05
6408,0.08
6409,0.11
6410,0.12
6411,0.16
6412,0.24
6413,0.32
6414,0.33
6415,0.28
6416,0.25
6417,0.26
6418,0.26
6419,0.19
6420,0.06
6421,-0.01
6422,0.01
6423,0.07
6424,0.08
6425,0.04
6426,0.01
6427,0.05
6428,0.11
6429,0.10
6430,0.04
6431,0.02
6432,0.08
6433,0.13
6434,0.04
6435,-0.16
6436,-0.34
6437,-0.34
6438,-0.18
6439,0.00
6440,0.07
6441,0.04
6442,-0.02
6443,-0.05
6444,-0.05
6445,-0.08
6446,-0.13
6447,-0.15
6448,-0.13
6449,-0.11
6450,-0.14
6451,-0.22
6452,-0.30
6453,-0.34
6454,-0.33
6455,-0.29
6456,-0.27
6457,-0.26
6458,-0.28
6459,-0.33
6460,-0.38
6461,-0.37
6462,-0.30
6463,-0.24
6464,-0.27
6465,-0.45
6466,-0.70
6467,-0.88
6468,-0.89
6469,-0.78
6470,-0.70
6471,-0.72
6472,-0.81
6473,-0.86
6474,-0.83
6475,-0.76
6476,-0.76
6477,-0.82
6478,-0.88
6479,-0.90
6480,-0.88
6481,-0.85
6482,-0.82
6483,-0.75
6484,-0.65
6485,-0.57
6486,-0.56
6487,-0.66
6488,-0.83
6489,-0.99
6490,-1.05
6491,-0.95
6492,-0.76
6493,-0.58
6494,-0.53
6495,-0.63
6496,-0.79
6497,-0.93
6498,-0.97
6499,-0.90
6500,-0.79
6501,-0.70
6502,-0.65
6503,-0.60
6504,-0.52
6505,-0.45
6506,-0.47
6507,-0.59
6508,-0.69
6509,-0.63
6510,-0.42
6511,-0.20
6512,-0.10
6513,-0.15
6514,-0.22
6515,-0.22
6516,-0.14
6517,-0.10
6518,-0.15
6519,-0.27
6520,-0.35
6521,-0.32
6522,-0.21
6523,-0.07
6524,0.03
6525,0.07
6526,0.06
6527,0.00
6528,-0.04
6529,-0.05
6530,-0.04
6531,-0.05
6532,-0.13
6533,-0.23
6534,-0.23
6535,-0.11
6536,0.08
6537,0.17
6538,0.07
6539,-0.14
6540,-0.29
6541,-0.25
6542,-0.07
6543,0.06
6544,0.06
6545,-0.03
6546,-0.08
6547,-0.03
6548,0.08
6549,0.17
6550,0.18
6551,0.11
6552,-0.01
6553,-0.14
6554,-0.25
6555,-0.30
6556,-0.29
6557,-0.26
6558,-0.20
6559,-0.08
6560,0.08
6561,0.21
6562,0.22
6563,0.10
6564,-0.04
6565,-0.07
6566,0.00
6567,0.03
6568,-0.04
6569,-0.20
6570,-0.31
6571,-0.29
6572,-0.18
6573,-0.05
6574,0.03
6575,0.07
6576,0.08
6577,0.04
6578,-0.05
6579,-0.14
6580,-0.18
6581,-0.17
6582,-0.12
6583,-0.08
6584,-0.08
6585,-0.14
6586,-0.19
6587,-0.16
6588,0.00
6589,0.24
6590,0.40
6591,0.38
6592,0.21
6593,0.08
6594,0.08
6595,0.15
6596,0.16
6597,0.08
6598,0.01
6599,0.07
6600,0.22
6601,0.33
6602,0.31
6603,0.19
6604,0.05
6605,-0.02
6606,-0.01
6607,0.03
6608,0.07
6609,0.12
6610,0.19
6611,0.24
6612,0.26
6613,0.22
6614,0.17
6615,0.16
6616,0.21
6617,0.30
6618,0.39
6619,0.41
6620,0.36
6621,0.31
6622,0.32
6623,0.37
6624,0.35
6625,0.24
6626,0.11
6627,0.07
6628,0.14
6629,0.22
6630,0.25
6631,0.19
6632,0.09
6633,0.04
6634,0.08
6635,0.18
6636,0.27
6637,0.32
6638,0.33
6639,0.33
6640,0.32
6641,0.25
6642,0.16
6643,0.13
6644,0.20
6645,0.33
6646,0.39
6647,0.34
6648,0.21
6649,0.11
6650,0.07
6651,0.06
6652,0.03
6653,0.03
6654,0.15
6655,0.34
6656,0.49
6657,0.45
6658,0.26
6659,0.05
6660,-0.01
6661,0.08
6662,0.20
6663,0.23
6664,0.17
6665,0.07
6666,0.03
6667,0.07
6668,0.15
6669,0.19
6670,0.16
6671,0.07
6672,0.02
6673,0.04
6674,0.15
6675,0.28
6676,0.36
6677,0.35
6678,0.29
6679,0.19
6680,0.09
6681,-0.01
6682,-0.07
6683,-0.02
6684,0.13
6685,0.30
6686,0.36
6687,0.29
6688,0.16
6689,0.11
6690,0.19
6691,0.32
6692,0.39
6693,0.38
6694,0.35
6695,0.37
6696,0.40
6697,0.37
6698,0.25
6699,0.14
6700,0.17
6701,0.33
6702,0.52
6703,0.60
6704,0.55
6705,0.44
6706,0.36
6707,0.33
6708,0.35
6709,0.41
6710,0.49
6711,0.56
6712,0.56
6713,0.46
6714,0.33
6715,0.28
6716,0.35
6717,0.47
6718,0.48
6719,0.34
6720,0.16
6721,0.11
6722,0.23
6723,0.39
6724,0.43
6725,0.31
6726,0.15
6727,0.09
6728,0.14
6729,0.19
6730,0.18
6731,0.11
6732,0.07
6733,0.12
6734,0.22
6735,0.25
6736,0.20
6737,0.10
6738,0.05
6739,0.09
6740,0.18
6741,0.26
6742,0.29
6743,0.27
6744,0.22
6745,0.16
6746,0.12
6747,0.09
6748,0.04
6749,-0.03
6750,-0.04
6751,0.06
6752,0.26
6753,0.43
6754,0.43
6755,0.28
6756,0.13
6757,0.14
6758,0.31
6759,0.49
6760,0.51
6761,0.38
6762,0.25
6763,0.19
6764,0.21
6765,0.28
6766,0.38
6767,0.50
6768,0.56
6769,0.50
6770,0.37
6771,0.29
6772,0.34
6773,0.46
6774,0.48
6775,0.39
6776,0.32
6777,0.40
6778,0.58
6779,0.67
6780,0.55
6781,0.34
6782,0.26
6783,0.35
6784,0.52
6785,0.62
6786,0.64
6787,0.65
6788,0.67
6789,0.65
6790,0.58
6791,0.52
6792,0.54
6793,0.60
6794,0.61
6795,0.54
6796,0.44
6797,0.42
6798,0.48
6799,0.53
6800,0.51
6801,0.42
6802,0.35
6803,0.33
6804,0.38
6805,0.48
6806,0.58
6807,0.63
6808,0.58
6809,0.45
6810,0.32
6811,0.26
6812,0.29
6813,0.36
6814,0.43
6815,0.45
6816,0.40
6817,0.28
6818,0.15
6819,0.04
6820,0.02
6821,0.07
6822,0.15
6823,0.23
6824,0.30
6825,0.37
6826,0.46
6827,0.52
6828,0.54
6829,0.51
6830,0.43
6831,0.31
6832,0.16
6833,0.05
6834,0.02
6835,0.11
6836,0.26
6837,0.39
6838,0.45
6839,0.46
6840,0.42
6841,0.36
6842,0.30
6843,0.25
6844,0.24
6845,0.29
6846,0.36
6847,0.40
6848,0.34
6849,0.20
6850,0.09
6851,0.11
6852,0.26
6853,0.40
6854,0.40
6855,0.27
6856,0.18
6857,0.23
6858,0.36
6859,0.37
6860,0.17
6861,-0.11
6862,-0.23
6863,-0.12
6864,0.11
6865,0.27
6866,0.25
6867,0.12
6868,-0.04
6869,-0.14
6870,-0.12
6871,0.00
6872,0.15
6873,0.23
6874,0.14
6875,-0.07
6876,-0.28
6877,-0.41
6878,-0.44
6879,-0.48
6880,-0.57
6881,-0.67
6882,-0.73
6883,-0.73
6884,-0.70
6885,-0.67
6886,-0.66
6887,-0.64
6888,-0.64
6889,-0.66
6890,-0.69
6891,-0.70
6892,-0.71
6893,-0.73
6894,-0.79
6895,-0.88
6896,-0.94
6897,-0.93
6898,-0.87
6899,-0.83
6900,-0.85
6901,-0.87
6902,-0.80
6903,-0.65
6904,-0.57
6905,-0.69
6906,-0.93
6907,-1.08
6908,-0.98
6909,-0.73
6910,-0.59
6911,-0.65
6912,-0.80
6913,-0.86
6914,-0.81
6915,-0.77
6916,-0.79
6917,-0.78
6918,-0.67
6919,-0.55
6920,-0.52
6921,-0.63
6922,-0.76
6923,-0.81
6924,-0.83
6925,-0.88
6926,-0.93
6927,-0.89
6928,-0.75
6929,-0.63
6930,-0.62
6931,-0.72
6932,-0.78
6933,-0.75
6934,-0.66
6935,-0.60
6936,-0.57
6937,-0.55
6938,-0.55
6939,-0.61
6940,-0.68
6941,-0.67
6942,-0.56
6943,-0.45
6944,-0.47
6945,-0.59
6946,-0.68
6947,-0.67
6948,-0.60
6949,-0.58
6950,-0.63
6951,-0.66
6952,-0.61
6953,-0.50
6954,-0.42
6955,-0.41
6956,-0.44
6957,-0.44
6958,-0.43
6959,-0.41
6960,-0.38
6961,-0.31
6962,-0.20
6963,-0.12
6964,-0.15
6965,-0.26
6966,-0.37
6967,-0.39
6968,-0.33
6969,-0.23
6970,-0.15
6971,-0.15
6972,-0.24
6973,-0.40
6974,-0.55
6975,-0.60
6976,-0.57
6977,-0.53
6978,-0.54
6979,-0.57
6980,-0.57
6981,-0.52
6982,-0.45
6983,-0.41
6984,-0.40
6985,-0.41
6986,-0.45
6987,-0.53
6988,-0.59
6989,-0.57
6990,-0.44
6991,-0.30
6992,-0.25
6993,-0.35
6994,-0.53
6995,-0.65
6996,-0.63
6997,-0.54
6998,-0.49
6999,-0.56
7000,-0.71
7001,-0.84
7002,-0.85
7003,-0.72
7004,-0.52
7005,-0.36
7006,-0.31
7007,-0.33
7008,-0.35
7009,-0.33
7010,-0.25
7011,-0.16
7012,-0.10
7013,-0.09
7014,-0.14
7015,-0.25
7016,-0.34
7017,-0.38
7018,-0.33
7019,-0.26
7020,-0.17
7021,-0.09
7022,0.02
7023,0.11
7024,0.14
7025,0.06
7026,-0.09
7027,-0.19
7028,-0.15
7029,0.02
7030,0.17
7031,0.24
7032,0.22
7033,0.18
7034,0.18
7035,0.23
7036,0.29
7037,0.31
7038,0.26
7039,0.18
7040,0.13
7041,0.13
7042,0.17
7043,0.18
7044,0.15
7045,0.15
7046,0.22
7047,0.33
7048,0.37
7049,0.25
7050,0.05
7051,-0.04
7052,0.05
7053,0.25
7054,0.36
7055,0.31
7056,0.21
7057,0.15
7058,0.11
7059,-0.02
7060,-0.24
7061,-0.39
7062,-0.35
7063,-0.16
7064,0.02
7065,0.07
7066,0.05
7067,0.08
7068,0.15
7069,0.16
7070,0.04
7071,-0.12
7072,-0.21
7073,-0.20
7074,-0.15
7075,-0.14
7076,-0.13
7077,-0.09
7078,-0.03
7079,-0.02
7080,-0.09
7081,-0.14
7082,-0.06
7083,0.14
7084,0.33
7085,0.39
7086,0.29
7087,0.13
7088,0.00
7089,-0.06
7090,-0.03
7091,0.07
7092,0.15
7093,0.18
7094,0.14
7095,0.11
7096,0.12
7097,0.17
7098,0.22
7099,0.22
7100,0.19
7101,0.16
7102,0.15
7103,0.17
7104,0.22
7105,0.28
7106,0.32
7107,0.26
7108,0.10
7109,-0.05
7110,-0.05
7111,0.11
7112,0.31
7113,0.40
7114,0.34
7115,0.24
7116,0.20
7117,0.20
7118,0.17
7119,0.07
7120,0.00
7121,0.04
7122,0.20
7123,0.33
7124,0.34
7125,0.26
7126,0.19
7127,0.22
7128,0.33
7129,0.40
7130,0.39
7131,0.31
7132,0.26
7133,0.28
7134,0.36
7135,0.44
7136,0.45
7137,0.39
7138,0.33
7139,0.31
7140,0.34
7141,0.39
7142,0.39
7143,0.34
7144,0.26
7145,0.23
7146,0.29
7147,0.40
7148,0.49
7149,0.52
7150,0.49
7151,0.44
7152,0.36
7153,0.28
7154,0.22
7155,0.19
7156,0.21
7157,0.25
7158,0.28
7159,0.28
7160,0.23
7161,0.15
7162,0.06
7163,0.03
7164,0.10
7165,0.20
7166,0.24
7167,0.17
7168,0.04
7169,-0.02
7170,0.04
7171,0.16
7172,0.25
7173,0.27
7174,0.25
7175,0.19
7176,0.08
7177,-0.08
7178,-0.22
7179,-0.29
7180,-0.30
7181,-0.30
7182,-0.29
7183,-0.23
7184,-0.12
7185,-0.02
7186,-0.05
7187,-0.21
7188,-0.37
7189,-0.40
7190,-0.28
7191,-0.16
7192,-0.12
7193,-0.33
7194,-0.26
7195,0.20
7196,0.58
7197,-0.14
7198,-1.09
7199,0.14
7200,2.50
