1,74.81
2,100.00
3,100.00
4,100.00
5,95.30
6,96.95
7,100.00
8,100.00
9,100.00
10,76.57
11,18.88
12,-48.53
13,-90.17
14,-82.03
15,-30.01
16,36.41
17,86.36
18,100.00
19,100.00
20,97.99
21,99.12
22,100.00
23,100.00
24,96.61
25,100.00
26,100.00
27,84.99
28,23.43
29,-54.73
30,-100.00
31,-100.00
32,-97.46
33,-93.80
34,-100.00
35,-100.00
36,-91.06
37,-67.63
38,-49.19
39,-42.86
40,-48.07
41,-57.30
42,-64.46
43,-66.17
44,-62.11
45,-54.42
46,-45.58
47,-38.63
48,-34.61
49,-33.89
50,-34.89
51,-36.38
52,-36.98
53,-36.37
54,-34.58
55,-32.28
56,-29.87
57,-28.03
58,-26.65
59,-25.81
60,-25.05
61,-24.31
62,-23.41
63,-22.51
64,-21.57
65,-20.72
66,-19.82
67,-19.00
68,-18.13
69,-17.33
70,-16.49
71,-15.70
72,-14.87
73,-14.13
74,-13.42
75,-12.84
76,-12.31
77,-11.90
78,-11.50
79,-11.17
80,-10.81
81,-10.47
82,-10.09
83,-9.71
84,-9.30
85,-8.92
86,-8.53
87,-8.18
88,-7.86
89,-7.64
90,-7.50
91,-7.47
92,-7.54
93,-7.70
94,-7.87
95,-8.03
96,-8.11
97,-8.10
98,-7.99
99,-7.82
100,-7.62
101,-7.47
102,-7.42
103,-7.49
104,-7.66
105,-7.90
106,-8.12
107,-8.26
108,-8.26
109,-8.11
110,-7.80
111,-7.38
112,-6.86
113,-6.36
114,-5.87
115,-5.45
116,-5.05
117,-4.68
118,-4.28
119,-3.88
120,-3.40
121,-2.88
122,-2.29
123,-1.72
124,-1.12
125,-0.59
126,-0.03
127,0.48
128,1.04
129,1.61
130,2.29
131,3.00
132,3.81
133,4.64
134,5.53
135,6.35
136,7.17
137,7.86
138,8.52
139,9.06
140,9.59
141,10.06
142,10.55
143,11.01
144,11.49
145,11.93
146,12.37
147,12.75
148,13.13
149,13.48
150,13.84
151,14.15
152,14.46
153,14.73
154,14.97
155,15.14
156,15.25
157,15.28
158,15.25
159,15.14
160,14.99
161,14.82
162,14.65
163,14.53
164,14.46
165,14.45
166,14.51
167,14.61
168,14.74
169,14.87
170,14.95
171,14.97
172,14.91
173,14.81
174,14.67
175,14.54
176,14.43
177,14.36
178,14.30
179,14.21
180,14.07
181,13.87
182,13.59
183,13.27
184,12.94
185,12.65
186,12.43
187,12.33
188,12.30
189,12.34
190,12.36
191,12.36
192,12.29
193,12.15
194,11.93
195,11.69
196,11.46
197,11.25
198,11.05
199,10.83
200,10.56
201,10.23
202,9.81
203,9.34
204,8.79
205,8.26
206,7.77
207,7.38
208,7.06
209,6.83
210,6.65
211,6.51
212,6.34
213,6.17
214,5.94
215,5.68
216,5.39
217,5.10
218,4.80
219,4.53
220,4.29
221,4.11
222,3.99
223,3.94
224,3.97
225,4.07
226,4.21
227,4.37
228,4.51
229,4.61
230,4.62
231,4.56
232,4.44
233,4.32
234,4.24
235,4.23
236,4.32
237,4.47
238,4.67
239,4.87
240,5.07
241,5.25
242,5.42
243,5.58
244,5.73
245,5.90
246,6.07
247,6.26
248,6.43
249,6.57
250,6.64
251,6.65
252,6.63
253,6.58
254,6.53
255,6.49
256,6.44
257,6.38
258,6.30
259,6.20
260,6.07
261,5.91
262,5.75
263,5.58
264,5.43
265,5.30
266,5.19
267,5.10
268,5.00
269,4.89
270,4.74
271,4.58
272,4.40
273,4.24
274,4.10
275,4.01
276,3.96
277,3.95
278,3.94
279,3.94
280,3.95
281,3.95
282,3.96
283,3.97
284,4.03
285,4.15
286,4.37
287,4.64
288,4.97
289,5.30
290,5.63
291,5.92
292,6.17
293,6.36
294,6.53
295,6.70
296,6.92
297,7.18
298,7.50
299,7.85
300,8.22
301,8.56
302,8.89
303,9.16
304,9.42
305,9.64
306,9.87
307,10.08
308,10.31
309,10.52
310,10.74
311,10.96
312,11.20
313,11.44
314,11.70
315,11.95
316,12.19
317,12.41
318,12.59
319,12.71
320,12.77
321,12.77
322,12.75
323,12.73
324,12.71
325,12.68
326,12.64
327,12.59
328,12.52
329,12.43
330,12.29
331,12.15
332,12.00
333,11.89
334,11.78
335,11.67
336,11.53
337,11.34
338,11.08
339,10.77
340,10.43
341,10.11
342,9.84
343,9.66
344,9.59
345,9.61
346,9.69
347,9.80
348,9.87
349,9.88
350,9.79
351,9.63
352,9.40
353,9.18
354,8.98
355,8.84
356,8.75
357,8.72
358,8.71
359,8.74
360,8.75
361,8.76
362,8.73
363,8.69
364,8.63
365,8.53
366,8.37
367,8.17
368,7.92
369,7.65
370,7.36
371,7.08
372,6.77
373,6.47
374,6.12
375,5.76
376,5.34
377,4.88
378,4.39
379,3.92
380,3.48
381,3.12
382,2.81
383,2.60
384,2.44
385,2.35
386,2.27
387,2.20
388,2.09
389,1.96
390,1.83
391,1.72
392,1.63
393,1.60
394,1.62
395,1.73
396,1.90
397,2.12
398,2.35
399,2.58
400,2.76
401,2.89
402,2.94
403,2.89
404,2.76
405,2.58
406,2.39
407,2.21
408,2.07
409,1.95
410,1.90
411,1.92
412,2.01
413,2.19
414,2.47
415,2.83
416,3.28
417,3.77
418,4.26
419,4.69
420,5.06
421,5.31
422,5.47
423,5.55
424,5.64
425,5.73
426,5.89
427,6.11
428,6.40
429,6.70
430,6.97
431,7.16
432,7.27
433,7.27
434,7.20
435,7.07
436,6.92
437,6.79
438,6.69
439,6.64
440,6.63
441,6.63
442,6.64
443,6.63
444,6.58
445,6.49
446,6.34
447,6.18
448,5.99
449,5.82
450,5.66
451,5.54
452,5.44
453,5.37
454,5.30
455,5.22
456,5.09
457,4.91
458,4.66
459,4.39
460,4.08
461,3.78
462,3.48
463,3.24
464,3.03
465,2.89
466,2.74
467,2.60
468,2.39
469,2.13
470,1.77
471,1.34
472,0.84
473,0.33
474,-0.19
475,-0.66
476,-1.09
477,-1.41
478,-1.66
479,-1.83
480,-1.99
481,-2.12
482,-2.29
483,-2.47
484,-2.70
485,-2.94
486,-3.22
487,-3.44
488,-3.65
489,-3.79
490,-3.94
491,-4.06
492,-4.26
493,-4.52
494,-4.94
495,-5.48
496,-6.18
497,-6.96
498,-7.79
499,-8.54
500,-9.23
501,-9.76
502,-10.15
503,-10.39
504,-10.51
505,-10.55
506,-10.56
507,-10.55
508,-10.53
509,-10.51
510,-10.48
511,-10.42
512,-10.33
513,-10.19
514,-9.99
515,-9.75
516,-9.51
517,-9.27
518,-9.07
519,-8.93
520,-8.85
521,-8.87
522,-8.96
523,-9.12
524,-9.29
525,-9.45
526,-9.56
527,-9.65
528,-9.70
529,-9.73
530,-9.72
531,-9.70
532,-9.69
533,-9.68
534,-9.67
535,-9.63
536,-9.56
537,-9.45
538,-9.34
539,-9.25
540,-9.19
541,-9.19
542,-9.23
543,-9.31
544,-9.41
545,-9.48
546,-9.48
547,-9.42
548,-9.28
549,-9.11
550,-8.92
551,-8.78
552,-8.69
553,-8.69
554,-8.76
555,-8.88
556,-9.03
557,-9.18
558,-9.32
559,-9.42
560,-9.50
561,-9.56
562,-9.63
563,-9.71
564,-9.79
565,-9.86
566,-9.91
567,-9.95
568,-9.98
569,-9.99
570,-9.99
571,-9.97
572,-9.93
573,-9.88
574,-9.81
575,-9.71
576,-9.57
577,-9.40
578,-9.23
579,-9.08
580,-8.98
581,-8.95
582,-9.03
583,-9.22
584,-9.52
585,-9.89
586,-10.26
587,-10.59
588,-10.82
589,-10.93
590,-10.90
591,-10.73
592,-10.45
593,-10.11
594,-9.73
595,-9.37
596,-9.03
597,-8.74
598,-8.49
599,-8.30
600,-8.14
601,-8.04
602,-8.00
603,-8.01
604,-8.06
605,-8.12
606,-8.16
607,-8.15
608,-8.09
609,-8.00
610,-7.87
611,-7.75
612,-7.65
613,-7.59
614,-7.59
615,-7.64
616,-7.70
617,-7.75
618,-7.72
619,-7.64
620,-7.48
621,-7.28
622,-7.02
623,-6.74
624,-6.43
625,-6.14
626,-5.84
627,-5.58
628,-5.34
629,-5.16
630,-5.00
631,-4.88
632,-4.78
633,-4.69
634,-4.58
635,-4.43
636,-4.22
637,-3.97
638,-3.70
639,-3.44
640,-3.19
641,-3.02
642,-2.90
643,-2.86
644,-2.84
645,-2.85
646,-2.82
647,-2.78
648,-2.67
649,-2.54
650,-2.34
651,-2.11
652,-1.82
653,-1.50
654,-1.08
655,-0.59
656,0.00
657,0.61
658,1.22
659,1.75
660,2.20
661,2.51
662,2.72
663,2.80
664,2.84
665,2.85
666,2.90
667,2.96
668,3.04
669,3.08
670,3.09
671,3.05
672,2.98
673,2.88
674,2.81
675,2.80
676,2.85
677,2.97
678,3.15
679,3.33
680,3.50
681,3.64
682,3.76
683,3.88
684,4.01
685,4.15
686,4.32
687,4.49
688,4.66
689,4.79
690,4.88
691,4.92
692,4.96
693,5.03
694,5.20
695,5.46
696,5.81
697,6.20
698,6.60
699,6.96
700,7.24
701,7.41
702,7.49
703,7.48
704,7.46
705,7.45
706,7.53
707,7.68
708,7.99
709,8.38
710,8.90
711,9.48
712,10.17
713,10.90
714,11.70
715,12.50
716,13.33
717,14.10
718,14.80
719,15.35
720,15.77
721,15.99
722,16.06
723,15.96
724,15.79
725,15.55
726,15.31
727,15.09
728,14.95
729,14.87
730,14.86
731,14.88
732,14.95
733,15.05
734,15.17
735,15.29
736,15.40
737,15.54
738,15.67
739,15.81
740,15.91
741,15.96
742,15.91
743,15.76
744,15.47
745,15.09
746,14.61
747,14.13
748,13.64
749,13.19
750,12.77
751,12.43
752,12.10
753,11.79
754,11.43
755,11.07
756,10.65
757,10.23
758,9.78
759,9.37
760,8.99
761,8.68
762,8.35
763,8.03
764,7.67
765,7.31
766,6.91
767,6.51
768,6.08
769,5.70
770,5.35
771,5.08
772,4.82
773,4.62
774,4.39
775,4.17
776,3.93
777,3.69
778,3.44
779,3.23
780,3.02
781,2.85
782,2.69
783,2.55
784,2.44
785,2.37
786,2.33
787,2.34
788,2.41
789,2.55
790,2.72
791,2.91
792,3.06
793,3.13
794,3.06
795,2.85
796,2.49
797,2.04
798,1.52
799,1.02
800,0.58
801,0.23
802,-0.06
803,-0.30
804,-0.54
805,-0.78
806,-1.07
807,-1.38
808,-1.70
809,-1.99
810,-2.23
811,-2.37
812,-2.45
813,-2.45
814,-2.44
815,-2.44
816,-2.49
817,-2.60
818,-2.76
819,-2.92
820,-3.06
821,-3.12
822,-3.08
823,-2.94
824,-2.72
825,-2.45
826,-2.15
827,-1.86
828,-1.61
829,-1.40
830,-1.24
831,-1.14
832,-1.10
833,-1.10
834,-1.15
835,-1.22
836,-1.31
837,-1.41
838,-1.47
839,-1.48
840,-1.42
841,-1.28
842,-1.07
843,-0.81
844,-0.52
845,-0.26
846,-0.02
847,0.18
848,0.35
849,0.50
850,0.67
851,0.85
852,1.06
853,1.27
854,1.48
855,1.65
856,1.76
857,1.79
858,1.71
859,1.55
860,1.32
861,1.07
862,0.82
863,0.61
864,0.43
865,0.28
866,0.10
867,-0.11
868,-0.42
869,-0.79
870,-1.30
871,-1.88
872,-2.56
873,-3.24
874,-3.95
875,-4.59
876,-5.21
877,-5.75
878,-6.27
879,-6.71
880,-7.12
881,-7.46
882,-7.78
883,-8.04
884,-8.28
885,-8.49
886,-8.70
887,-8.91
888,-9.13
889,-9.32
890,-9.47
891,-9.55
892,-9.53
893,-9.38
894,-9.09
895,-8.72
896,-8.30
897,-7.89
898,-7.50
899,-7.16
900,-6.86
901,-6.63
902,-6.41
903,-6.21
904,-5.99
905,-5.78
906,-5.55
907,-5.33
908,-5.10
909,-4.89
910,-4.64
911,-4.40
912,-4.12
913,-3.83
914,-3.51
915,-3.19
916,-2.86
917,-2.55
918,-2.26
919,-2.02
920,-1.82
921,-1.71
922,-1.64
923,-1.64
924,-1.68
925,-1.74
926,-1.75
927,-1.71
928,-1.53
929,-1.24
930,-0.80
931,-0.29
932,0.31
933,0.90
934,1.48
935,1.98
936,2.43
937,2.83
938,3.21
939,3.56
940,3.92
941,4.24
942,4.54
943,4.75
944,4.87
945,4.89
946,4.79
947,4.60
948,4.32
949,3.99
950,3.61
951,3.20
952,2.72
953,2.22
954,1.66
955,1.08
956,0.46
957,-0.15
958,-0.78
959,-1.37
960,-1.96
961,-2.51
962,-3.07
963,-3.60
964,-4.15
965,-4.65
966,-5.17
967,-5.64
968,-6.10
969,-6.48
970,-6.83
971,-7.10
972,-7.34
973,-7.53
974,-7.73
975,-7.89
976,-8.07
977,-8.24
978,-8.43
979,-8.59
980,-8.77
981,-8.94
982,-9.13
983,-9.33
984,-9.57
985,-9.83
986,-10.11
987,-10.38
988,-10.62
989,-10.81
990,-10.94
991,-11.00
992,-11.02
993,-11.00
994,-10.98
995,-10.96
996,-10.98
997,-11.00
998,-11.02
999,-11.02
1000,-10.99
1001,-10.93
1002,-10.86
1003,-10.78
1004,-10.71
1005,-10.69
1006,-10.68
1007,-10.66
1008,-10.60
1009,-10.47
1010,-10.28
1011,-10.03
1012,-9.76
1013,-9.48
1014,-9.20
1015,-8.97
1016,-8.80
1017,-8.67
1018,-8.55
1019,-8.43
1020,-8.28
1021,-8.12
1022,-7.93
1023,-7.75
1024,-7.59
1025,-7.49
1026,-7.42
1027,-7.39
1028,-7.40
1029,-7.45
1030,-7.53
1031,-7.64
1032,-7.78
1033,-7.95
1034,-8.17
1035,-8.42
1036,-8.68
1037,-8.94
1038,-9.18
1039,-9.39
1040,-9.57
1041,-9.71
1042,-9.84
1043,-9.96
1044,-10.10
1045,-10.23
1046,-10.34
1047,-10.40
1048,-10.42
1049,-10.39
1050,-10.31
1051,-10.20
1052,-10.08
1053,-9.98
1054,-9.93
1055,-9.91
1056,-9.91
1057,-9.93
1058,-9.95
1059,-9.97
1060,-9.99
1061,-10.00
1062,-10.01
1063,-10.04
1064,-10.07
1065,-10.12
1066,-10.14
1067,-10.14
1068,-10.07
1069,-9.96
1070,-9.80
1071,-9.58
1072,-9.30
1073,-8.98
1074,-8.62
1075,-8.26
1076,-7.88
1077,-7.50
1078,-7.11
1079,-6.74
1080,-6.38
1081,-6.06
1082,-5.77
1083,-5.55
1084,-5.33
1085,-5.12
1086,-4.87
1087,-4.61
1088,-4.29
1089,-3.97
1090,-3.66
1091,-3.40
1092,-3.21
1093,-3.13
1094,-3.13
1095,-3.21
1096,-3.31
1097,-3.42
1098,-3.48
1099,-3.49
1100,-3.43
1101,-3.37
1102,-3.30
1103,-3.27
1104,-3.26
1105,-3.26
1106,-3.23
1107,-3.15
1108,-2.98
1109,-2.74
1110,-2.40
1111,-2.03
1112,-1.62
1113,-1.24
1114,-0.85
1115,-0.48
1116,-0.13
1117,0.20
1118,0.53
1119,0.81
1120,1.07
1121,1.26
1122,1.41
1123,1.50
1124,1.61
1125,1.72
1126,1.88
1127,2.09
1128,2.40
1129,2.76
1130,3.18
1131,3.57
1132,3.96
1133,4.31
1134,4.63
1135,4.92
1136,5.19
1137,5.43
1138,5.66
1139,5.85
1140,6.03
1141,6.14
1142,6.24
1143,6.29
1144,6.38
1145,6.50
1146,6.74
1147,7.07
1148,7.54
1149,8.07
1150,8.71
1151,9.36
1152,10.07
1153,10.76
1154,11.52
1155,12.27
1156,13.08
1157,13.89
1158,14.77
1159,15.60
1160,16.44
1161,17.18
1162,17.89
1163,18.51
1164,19.13
1165,19.66
1166,20.17
1167,20.59
1168,20.99
1169,21.31
1170,21.55
1171,21.69
1172,21.77
1173,21.80
1174,21.84
1175,21.86
1176,21.87
1177,21.86
1178,21.81
1179,21.71
1180,21.55
1181,21.33
1182,21.09
1183,20.86
1184,20.66
1185,20.49
1186,20.33
1187,20.16
1188,19.94
1189,19.67
1190,19.35
1191,19.00
1192,18.63
1193,18.31
1194,18.05
1195,17.87
1196,17.77
1197,17.75
1198,17.76
1199,17.80
1200,17.85
1201,17.90
1202,17.94
1203,17.98
1204,18.05
1205,18.15
1206,18.26
1207,18.39
1208,18.56
1209,18.75
1210,18.97
1211,19.18
1212,19.40
1213,19.59
1214,19.78
1215,19.92
1216,20.04
1217,20.14
1218,20.25
1219,20.38
1220,20.49
1221,20.59
1222,20.65
1223,20.65
1224,20.55
1225,20.34
1226,20.00
1227,19.59
1228,19.08
1229,18.55
1230,17.98
1231,17.45
1232,16.90
1233,16.39
1234,15.86
1235,15.35
1236,14.80
1237,14.30
1238,13.77
1239,13.30
1240,12.84
1241,12.46
1242,12.08
1243,11.74
1244,11.33
1245,10.90
1246,10.36
1247,9.77
1248,9.04
1249,8.27
1250,7.40
1251,6.58
1252,5.74
1253,4.99
1254,4.24
1255,3.58
1256,2.92
1257,2.34
1258,1.73
1259,1.14
1260,0.51
1261,-0.09
1262,-0.71
1263,-1.27
1264,-1.83
1265,-2.29
1266,-2.71
1267,-3.03
1268,-3.32
1269,-3.54
1270,-3.78
1271,-4.01
1272,-4.32
1273,-4.65
1274,-5.05
1275,-5.47
1276,-5.92
1277,-6.34
1278,-6.75
1279,-7.11
1280,-7.50
1281,-7.87
1282,-8.25
1283,-8.61
1284,-8.95
1285,-9.24
1286,-9.48
1287,-9.63
1288,-9.72
1289,-9.75
1290,-9.80
1291,-9.87
1292,-10.01
1293,-10.22
1294,-10.48
1295,-10.74
1296,-10.99
1297,-11.19
1298,-11.36
1299,-11.47
1300,-11.58
1301,-11.69
1302,-11.86
1303,-12.08
1304,-12.36
1305,-12.65
1306,-12.96
1307,-13.26
1308,-13.57
1309,-13.83
1310,-14.08
1311,-14.30
1312,-14.51
1313,-14.70
1314,-14.85
1315,-14.94
1316,-14.99
1317,-14.98
1318,-14.95
1319,-14.89
1320,-14.81
1321,-14.72
1322,-14.61
1323,-14.51
1324,-14.41
1325,-14.31
1326,-14.19
1327,-14.06
1328,-13.90
1329,-13.71
1330,-13.49
1331,-13.23
1332,-12.93
1333,-12.61
1334,-12.29
1335,-12.01
1336,-11.77
1337,-11.59
1338,-11.46
1339,-11.38
1340,-11.35
1341,-11.38
1342,-11.46
1343,-11.59
1344,-11.78
1345,-12.02
1346,-12.30
1347,-12.59
1348,-12.84
1349,-13.03
1350,-13.13
1351,-13.16
1352,-13.10
1353,-12.96
1354,-12.77
1355,-12.56
1356,-12.33
1357,-12.10
1358,-11.88
1359,-11.66
1360,-11.46
1361,-11.29
1362,-11.18
1363,-11.14
1364,-11.15
1365,-11.19
1366,-11.24
1367,-11.29
1368,-11.32
1369,-11.31
1370,-11.26
1371,-11.22
1372,-11.22
1373,-11.27
1374,-11.39
1375,-11.54
1376,-11.69
1377,-11.81
1378,-11.87
1379,-11.83
1380,-11.72
1381,-11.56
1382,-11.43
1383,-11.36
1384,-11.38
1385,-11.47
1386,-11.63
1387,-11.80
1388,-11.92
1389,-11.97
1390,-11.93
1391,-11.82
1392,-11.68
1393,-11.56
1394,-11.49
1395,-11.51
1396,-11.59
1397,-11.70
1398,-11.80
1399,-11.81
1400,-11.70
1401,-11.48
1402,-11.19
1403,-10.89
1404,-10.60
1405,-10.40
1406,-10.25
1407,-10.17
1408,-10.08
1409,-9.96
1410,-9.77
1411,-9.52
1412,-9.19
1413,-8.85
1414,-8.51
1415,-8.22
1416,-7.97
1417,-7.80
1418,-7.68
1419,-7.60
1420,-7.51
1421,-7.42
1422,-7.29
1423,-7.16
1424,-7.00
1425,-6.82
1426,-6.60
1427,-6.40
1428,-6.22
1429,-6.11
1430,-6.06
1431,-6.08
1432,-6.18
1433,-6.35
1434,-6.53
1435,-6.68
1436,-6.76
1437,-6.74
1438,-6.63
1439,-6.45
1440,-6.25
1441,-6.10
1442,-6.03
1443,-6.07
1444,-6.18
1445,-6.35
1446,-6.49
1447,-6.57
1448,-6.51
1449,-6.30
1450,-5.91
1451,-5.43
1452,-4.85
1453,-4.30
1454,-3.73
1455,-3.21
1456,-2.68
1457,-2.17
1458,-1.55
1459,-0.90
1460,-0.08
1461,0.80
1462,1.84
1463,2.90
1464,4.10
1465,5.27
1466,6.54
1467,7.77
1468,9.09
1469,10.37
1470,11.74
1471,13.04
1472,14.38
1473,15.60
1474,16.80
1475,17.82
1476,18.79
1477,19.60
1478,20.36
1479,21.01
1480,21.66
1481,22.26
1482,22.89
1483,23.46
1484,24.02
1485,24.48
1486,24.85
1487,25.07
1488,25.14
1489,25.05
1490,24.82
1491,24.46
1492,24.00
1493,23.49
1494,22.97
1495,22.51
1496,22.16
1497,21.96
1498,21.90
1499,21.97
1500,22.09
1501,22.19
1502,22.16
1503,21.95
1504,21.53
1505,20.95
1506,20.28
1507,19.66
1508,19.18
1509,18.95
1510,18.98
1511,19.24
1512,19.61
1513,20.01
1514,20.33
1515,20.50
1516,20.51
1517,20.39
1518,20.28
1519,20.25
1520,20.43
1521,20.80
1522,21.37
1523,22.06
1524,22.83
1525,23.57
1526,24.27
1527,24.89
1528,25.51
1529,26.10
1530,26.74
1531,27.36
1532,28.02
1533,28.63
1534,29.19
1535,29.60
1536,29.91
1537,30.08
1538,30.16
1539,30.15
1540,30.10
1541,30.01
1542,29.88
1543,29.69
1544,29.42
1545,29.09
1546,28.68
1547,28.23
1548,27.74
1549,27.28
1550,26.79
1551,26.35
1552,25.89
1553,25.44
1554,24.89
1555,24.29
1556,23.54
1557,22.72
1558,21.74
1559,20.73
1560,19.62
1561,18.56
1562,17.48
1563,16.52
1564,15.61
1565,14.83
1566,14.11
1567,13.51
1568,12.93
1569,12.44
1570,11.91
1571,11.43
1572,10.93
1573,10.51
1574,10.13
1575,9.86
1576,9.67
1577,9.61
1578,9.58
1579,9.58
1580,9.52
1581,9.42
1582,9.23
1583,8.97
1584,8.62
1585,8.26
1586,7.89
1587,7.55
1588,7.20
1589,6.85
1590,6.48
1591,6.10
1592,5.67
1593,5.24
1594,4.80
1595,4.44
1596,4.11
1597,3.85
1598,3.57
1599,3.28
1600,2.87
1601,2.35
1602,1.66
1603,0.89
1604,0.04
1605,-0.76
1606,-1.51
1607,-2.09
1608,-2.55
1609,-2.83
1610,-3.04
1611,-3.17
1612,-3.34
1613,-3.52
1614,-3.76
1615,-4.01
1616,-4.31
1617,-4.61
1618,-4.94
1619,-5.24
1620,-5.58
1621,-5.93
1622,-6.35
1623,-6.82
1624,-7.35
1625,-7.88
1626,-8.41
1627,-8.87
1628,-9.29
1629,-9.59
1630,-9.79
1631,-9.88
1632,-9.93
1633,-9.94
1634,-9.96
1635,-9.99
1636,-10.08
1637,-10.19
1638,-10.32
1639,-10.43
1640,-10.51
1641,-10.52
1642,-10.49
1643,-10.42
1644,-10.32
1645,-10.22
1646,-10.16
1647,-10.14
1648,-10.20
1649,-10.31
1650,-10.48
1651,-10.67
1652,-10.86
1653,-11.03
1654,-11.18
1655,-11.28
1656,-11.36
1657,-11.41
1658,-11.44
1659,-11.46
1660,-11.50
1661,-11.57
1662,-11.66
1663,-11.77
1664,-11.88
1665,-11.98
1666,-12.06
1667,-12.10
1668,-12.11
1669,-12.12
1670,-12.11
1671,-12.11
1672,-12.09
1673,-12.05
1674,-11.94
1675,-11.76
1676,-11.46
1677,-11.06
1678,-10.53
1679,-9.96
1680,-9.36
1681,-8.80
1682,-8.27
1683,-7.82
1684,-7.44
1685,-7.14
1686,-6.86
1687,-6.59
1688,-6.28
1689,-5.96
1690,-5.58
1691,-5.20
1692,-4.80
1693,-4.44
1694,-4.12
1695,-3.90
1696,-3.76
1697,-3.70
1698,-3.70
1699,-3.76
1700,-3.81
1701,-3.85
1702,-3.82
1703,-3.75
1704,-3.66
1705,-3.57
1706,-3.53
1707,-3.57
1708,-3.72
1709,-3.98
1710,-4.30
1711,-4.64
1712,-4.95
1713,-5.19
1714,-5.33
1715,-5.34
1716,-5.25
1717,-5.09
1718,-4.92
1719,-4.78
1720,-4.67
1721,-4.60
1722,-4.53
1723,-4.45
1724,-4.34
1725,-4.20
1726,-4.01
1727,-3.81
1728,-3.62
1729,-3.50
1730,-3.45
1731,-3.50
1732,-3.59
1733,-3.72
1734,-3.80
1735,-3.82
1736,-3.76
1737,-3.62
1738,-3.42
1739,-3.20
1740,-2.98
1741,-2.79
1742,-2.63
1743,-2.50
1744,-2.40
1745,-2.31
1746,-2.19
1747,-2.03
1748,-1.82
1749,-1.59
1750,-1.31
1751,-1.01
1752,-0.68
1753,-0.38
1754,-0.07
1755,0.19
1756,0.46
1757,0.70
1758,0.96
1759,1.22
1760,1.55
1761,1.90
1762,2.35
1763,2.84
1764,3.42
1765,4.02
1766,4.70
1767,5.39
1768,6.15
1769,6.92
1770,7.77
1771,8.60
1772,9.44
1773,10.17
1774,10.86
1775,11.42
1776,11.95
1777,12.40
1778,12.89
1779,13.42
1780,14.09
1781,14.84
1782,15.73
1783,16.63
1784,17.53
1785,18.32
1786,18.98
1787,19.44
1788,19.72
1789,19.81
1790,19.77
1791,19.63
1792,19.45
1793,19.25
1794,19.09
1795,18.95
1796,18.87
1797,18.80
1798,18.73
1799,18.61
1800,18.41
1801,18.15
1802,17.82
1803,17.48
1804,17.17
1805,16.94
1806,16.79
1807,16.77
1808,16.83
1809,16.96
1810,17.06
1811,17.08
1812,16.95
1813,16.68
1814,16.28
1815,15.81
1816,15.29
1817,14.79
1818,14.31
1819,13.91
1820,13.54
1821,13.20
1822,12.86
1823,12.52
1824,12.19
1825,11.90
1826,11.63
1827,11.42
1828,11.25
1829,11.15
1830,11.13
1831,11.21
1832,11.38
1833,11.65
1834,12.00
1835,12.44
1836,12.91
1837,13.37
1838,13.76
1839,14.03
1840,14.17
1841,14.20
1842,14.16
1843,14.07
1844,14.00
1845,13.95
1846,13.96
1847,14.01
1848,14.12
1849,14.23
1850,14.37
1851,14.51
1852,14.69
1853,14.91
1854,15.18
1855,15.50
1856,15.85
1857,16.23
1858,16.61
1859,16.94
1860,17.20
1861,17.35
1862,17.41
1863,17.38
1864,17.31
1865,17.21
1866,17.14
1867,17.11
1868,17.16
1869,17.25
1870,17.37
1871,17.49
1872,17.58
1873,17.63
1874,17.64
1875,17.63
1876,17.65
1877,17.75
1878,17.94
1879,18.22
1880,18.54
1881,18.85
1882,19.09
1883,19.22
1884,19.20
1885,19.06
1886,18.81
1887,18.53
1888,18.26
1889,18.05
1890,17.89
1891,17.78
1892,17.64
1893,17.46
1894,17.14
1895,16.69
1896,16.08
1897,15.39
1898,14.65
1899,13.97
1900,13.34
1901,12.84
1902,12.43
1903,12.14
1904,11.87
1905,11.66
1906,11.44
1907,11.26
1908,11.06
1909,10.90
1910,10.74
1911,10.61
1912,10.44
1913,10.24
1914,9.95
1915,9.58
1916,9.09
1917,8.57
1918,8.00
1919,7.50
1920,7.04
1921,6.67
1922,6.31
1923,6.01
1924,5.67
1925,5.29
1926,4.79
1927,4.24
1928,3.60
1929,2.99
1930,2.39
1931,1.88
1932,1.41
1933,1.03
1934,0.68
1935,0.37
1936,0.03
1937,-0.29
1938,-0.63
1939,-0.93
1940,-1.22
1941,-1.44
1942,-1.61
1943,-1.71
1944,-1.78
1945,-1.82
1946,-1.89
1947,-1.95
1948,-2.03
1949,-2.10
1950,-2.18
1951,-2.23
1952,-2.27
1953,-2.29
1954,-2.30
1955,-2.33
1956,-2.37
1957,-2.42
1958,-2.45
1959,-2.43
1960,-2.34
1961,-2.18
1962,-1.95
1963,-1.70
1964,-1.45
1965,-1.24
1966,-1.07
1967,-0.96
1968,-0.86
1969,-0.78
1970,-0.65
1971,-0.50
1972,-0.31
1973,-0.12
1974,0.05
1975,0.17
1976,0.24
1977,0.27
1978,0.32
1979,0.41
1980,0.60
1981,0.89
1982,1.29
1983,1.76
1984,2.28
1985,2.77
1986,3.23
1987,3.63
1988,4.02
1989,4.36
1990,4.71
1991,5.06
1992,5.41
1993,5.73
1994,6.05
1995,6.29
1996,6.49
1997,6.63
1998,6.75
1999,6.86
2000,7.03
2001,7.24
2002,7.53
2003,7.84
2004,8.18
2005,8.51
2006,8.81
2007,9.06
2008,9.26
2009,9.37
2010,9.41
2011,9.38
2012,9.31
2013,9.23
2014,9.17
2015,9.12
2016,9.14
2017,9.22
2018,9.38
2019,9.59
2020,9.83
2021,10.07
2022,10.28
2023,10.44
2024,10.53
2025,10.57
2026,10.54
2027,10.48
2028,10.34
2029,10.17
2030,9.92
2031,9.64
2032,9.27
2033,8.85
2034,8.38
2035,7.90
2036,7.43
2037,7.01
2038,6.63
2039,6.34
2040,6.07
2041,5.85
2042,5.62
2043,5.38
2044,5.09
2045,4.78
2046,4.43
2047,4.10
2048,3.79
2049,3.55
2050,3.34
2051,3.20
2052,3.08
2053,2.99
2054,2.85
2055,2.67
2056,2.43
2057,2.16
2058,1.85
2059,1.56
2060,1.29
2061,1.09
2062,0.94
2063,0.86
2064,0.81
2065,0.78
2066,0.73
2067,0.67
2068,0.59
2069,0.52
2070,0.48
2071,0.50
2072,0.57
2073,0.67
2074,0.77
2075,0.86
2076,0.93
2077,0.95
2078,0.94
2079,0.89
2080,0.86
2081,0.84
2082,0.88
2083,0.98
2084,1.15
2085,1.39
2086,1.68
2087,2.00
2088,2.30
2089,2.57
2090,2.76
2091,2.86
2092,2.85
2093,2.74
2094,2.56
2095,2.36
2096,2.15
2097,1.97
2098,1.80
2099,1.66
2100,1.50
2101,1.32
2102,1.04
2103,0.67
2104,0.19
2105,-0.34
2106,-0.92
2107,-1.47
2108,-1.99
2109,-2.42
2110,-2.82
2111,-3.16
2112,-3.56
2113,-3.99
2114,-4.50
2115,-5.03
2116,-5.59
2117,-6.07
2118,-6.49
2119,-6.77
2120,-7.00
2121,-7.17
2122,-7.37
2123,-7.59
2124,-7.91
2125,-8.28
2126,-8.72
2127,-9.15
2128,-9.53
2129,-9.77
2130,-9.90
2131,-9.91
2132,-9.86
2133,-9.79
2134,-9.74
2135,-9.72
2136,-9.73
2137,-9.74
2138,-9.74
2139,-9.68
2140,-9.55
2141,-9.35
2142,-9.10
2143,-8.86
2144,-8.61
2145,-8.40
2146,-8.18
2147,-8.00
2148,-7.77
2149,-7.53
2150,-7.20
2151,-6.81
2152,-6.34
2153,-5.84
2154,-5.30
2155,-4.79
2156,-4.31
2157,-3.92
2158,-3.57
2159,-3.33
2160,-3.15
2161,-3.03
2162,-2.92
2163,-2.80
2164,-2.64
2165,-2.45
2166,-2.20
2167,-1.94
2168,-1.67
2169,-1.46
2170,-1.30
2171,-1.24
2172,-1.23
2173,-1.28
2174,-1.35
2175,-1.43
2176,-1.45
2177,-1.42
2178,-1.32
2179,-1.17
2180,-0.97
2181,-0.75
2182,-0.49
2183,-0.23
2184,0.03
2185,0.29
2186,0.56
2187,0.83
2188,1.09
2189,1.30
2190,1.49
2191,1.62
2192,1.72
2193,1.78
2194,1.83
2195,1.86
2196,1.92
2197,1.98
2198,2.07
2199,2.17
2200,2.28
2201,2.39
2202,2.50
2203,2.60
2204,2.71
2205,2.82
2206,2.95
2207,3.09
2208,3.24
2209,3.39
2210,3.54
2211,3.68
2212,3.84
2213,3.98
2214,4.12
2215,4.21
2216,4.30
2217,4.38
2218,4.46
2219,4.52
2220,4.61
2221,4.73
2222,4.95
2223,5.23
2224,5.58
2225,5.96
2226,6.38
2227,6.79
2228,7.18
2229,7.50
2230,7.77
2231,8.00
2232,8.19
2233,8.37
2234,8.51
2235,8.60
2236,8.61
2237,8.52
2238,8.31
2239,8.00
2240,7.57
2241,7.07
2242,6.51
2243,5.96
2244,5.41
2245,4.93
2246,4.46
2247,4.05
2248,3.61
2249,3.20
2250,2.75
2251,2.31
2252,1.81
2253,1.32
2254,0.77
2255,0.25
2256,-0.29
2257,-0.77
2258,-1.23
2259,-1.61
2260,-1.96
2261,-2.25
2262,-2.55
2263,-2.85
2264,-3.22
2265,-3.62
2266,-4.10
2267,-4.58
2268,-5.07
2269,-5.48
2270,-5.83
2271,-6.05
2272,-6.16
2273,-6.16
2274,-6.09
2275,-5.94
2276,-5.77
2277,-5.56
2278,-5.36
2279,-5.18
2280,-5.01
2281,-4.87
2282,-4.77
2283,-4.75
2284,-4.80
2285,-4.90
2286,-5.03
2287,-5.16
2288,-5.25
2289,-5.28
2290,-5.23
2291,-5.10
2292,-4.92
2293,-4.70
2294,-4.49
2295,-4.29
2296,-4.15
2297,-4.08
2298,-4.08
2299,-4.15
2300,-4.29
2301,-4.49
2302,-4.74
2303,-5.03
2304,-5.33
2305,-5.64
2306,-5.93
2307,-6.17
2308,-6.37
2309,-6.50
2310,-6.60
2311,-6.67
2312,-6.70
2313,-6.70
2314,-6.69
2315,-6.67
2316,-6.63
2317,-6.55
2318,-6.41
2319,-6.22
2320,-5.97
2321,-5.67
2322,-5.31
2323,-4.95
2324,-4.56
2325,-4.19
2326,-3.78
2327,-3.38
2328,-2.92
2329,-2.46
2330,-1.95
2331,-1.46
2332,-0.90
2333,-0.37
2334,0.22
2335,0.80
2336,1.47
2337,2.16
2338,2.94
2339,3.72
2340,4.59
2341,5.41
2342,6.22
2343,6.89
2344,7.49
2345,7.94
2346,8.38
2347,8.75
2348,9.16
2349,9.58
2350,10.10
2351,10.65
2352,11.25
2353,11.82
2354,12.38
2355,12.86
2356,13.29
2357,13.61
2358,13.90
2359,14.14
2360,14.40
2361,14.64
2362,14.89
2363,15.11
2364,15.36
2365,15.59
2366,15.85
2367,16.11
2368,16.43
2369,16.78
2370,17.17
2371,17.56
2372,17.96
2373,18.31
2374,18.65
2375,18.93
2376,19.18
2377,19.40
2378,19.59
2379,19.73
2380,19.85
2381,19.89
2382,19.87
2383,19.76
2384,19.57
2385,19.34
2386,19.09
2387,18.86
2388,18.69
2389,18.60
2390,18.59
2391,18.66
2392,18.77
2393,18.88
2394,18.97
2395,19.01
2396,18.97
2397,18.87
2398,18.73
2399,18.57
2400,18.42
2401,18.29
2402,18.21
2403,18.16
2404,18.16
2405,18.18
2406,18.24
2407,18.32
2408,18.45
2409,18.62
2410,18.82
2411,19.04
2412,19.25
2413,19.42
2414,19.52
2415,19.53
2416,19.45
2417,19.33
2418,19.20
2419,19.11
2420,19.06
2421,19.04
2422,19.00
2423,18.93
2424,18.75
2425,18.45
2426,18.01
2427,17.47
2428,16.87
2429,16.28
2430,15.75
2431,15.34
2432,15.03
2433,14.86
2434,14.71
2435,14.59
2436,14.39
2437,14.14
2438,13.79
2439,13.41
2440,12.95
2441,12.52
2442,12.05
2443,11.62
2444,11.15
2445,10.68
2446,10.17
2447,9.67
2448,9.15
2449,8.67
2450,8.21
2451,7.82
2452,7.44
2453,7.12
2454,6.77
2455,6.42
2456,6.02
2457,5.63
2458,5.21
2459,4.82
2460,4.44
2461,4.14
2462,3.86
2463,3.61
2464,3.32
2465,3.02
2466,2.63
2467,2.22
2468,1.74
2469,1.26
2470,0.76
2471,0.31
2472,-0.10
2473,-0.44
2474,-0.76
2475,-1.03
2476,-1.29
2477,-1.50
2478,-1.69
2479,-1.85
2480,-2.02
2481,-2.19
2482,-2.41
2483,-2.66
2484,-3.01
2485,-3.41
2486,-3.92
2487,-4.44
2488,-4.97
2489,-5.42
2490,-5.79
2491,-6.02
2492,-6.15
2493,-6.18
2494,-6.18
2495,-6.18
2496,-6.28
2497,-6.48
2498,-6.81
2499,-7.22
2500,-7.71
2501,-8.22
2502,-8.72
2503,-9.15
2504,-9.50
2505,-9.74
2506,-9.94
2507,-10.07
2508,-10.19
2509,-10.29
2510,-10.42
2511,-10.57
2512,-10.76
2513,-10.96
2514,-11.21
2515,-11.46
2516,-11.74
2517,-12.02
2518,-12.30
2519,-12.55
2520,-12.77
2521,-12.98
2522,-13.19
2523,-13.39
2524,-13.57
2525,-13.73
2526,-13.84
2527,-13.90
2528,-13.88
2529,-13.75
2530,-13.50
2531,-13.17
2532,-12.77
2533,-12.34
2534,-11.90
2535,-11.48
2536,-11.09
2537,-10.78
2538,-10.49
2539,-10.23
2540,-9.96
2541,-9.70
2542,-9.39
2543,-9.08
2544,-8.71
2545,-8.35
2546,-7.97
2547,-7.64
2548,-7.33
2549,-7.09
2550,-6.88
2551,-6.73
2552,-6.59
2553,-6.47
2554,-6.30
2555,-6.11
2556,-5.87
2557,-5.61
2558,-5.34
2559,-5.08
2560,-4.84
2561,-4.63
2562,-4.42
2563,-4.25
2564,-4.08
2565,-3.96
2566,-3.85
2567,-3.75
2568,-3.62
2569,-3.47
2570,-3.24
2571,-2.96
2572,-2.56
2573,-2.08
2574,-1.54
2575,-1.01
2576,-0.53
2577,-0.15
2578,0.14
2579,0.29
2580,0.35
2581,0.33
2582,0.29
2583,0.24
2584,0.21
2585,0.20
2586,0.21
2587,0.26
2588,0.34
2589,0.46
2590,0.62
2591,0.81
2592,1.04
2593,1.28
2594,1.49
2595,1.64
2596,1.71
2597,1.71
2598,1.64
2599,1.54
2600,1.39
2601,1.23
2602,1.00
2603,0.73
2604,0.36
2605,-0.10
2606,-0.71
2607,-1.41
2608,-2.23
2609,-3.03
2610,-3.83
2611,-4.53
2612,-5.21
2613,-5.79
2614,-6.39
2615,-6.97
2616,-7.68
2617,-8.43
2618,-9.30
2619,-10.18
2620,-11.11
2621,-11.95
2622,-12.77
2623,-13.44
2624,-14.04
2625,-14.53
2626,-15.03
2627,-15.48
2628,-15.98
2629,-16.45
2630,-16.97
2631,-17.46
2632,-17.96
2633,-18.40
2634,-18.82
2635,-19.18
2636,-19.54
2637,-19.85
2638,-20.18
2639,-20.47
2640,-20.76
2641,-21.01
2642,-21.23
2643,-21.38
2644,-21.47
2645,-21.48
2646,-21.47
2647,-21.42
2648,-21.36
2649,-21.29
2650,-21.24
2651,-21.22
2652,-21.22
2653,-21.25
2654,-21.30
2655,-21.37
2656,-21.43
2657,-21.46
2658,-21.43
2659,-21.32
2660,-21.12
2661,-20.83
2662,-20.49
2663,-20.12
2664,-19.76
2665,-19.45
2666,-19.20
2667,-19.03
2668,-18.91
2669,-18.85
2670,-18.81
2671,-18.78
2672,-18.73
2673,-18.68
2674,-18.65
2675,-18.66
2676,-18.70
2677,-18.77
2678,-18.85
2679,-18.95
2680,-19.04
2681,-19.08
2682,-19.09
2683,-19.06
2684,-19.03
2685,-19.02
2686,-19.06
2687,-19.16
2688,-19.36
2689,-19.64
2690,-20.00
2691,-20.38
2692,-20.78
2693,-21.18
2694,-21.59
2695,-21.96
2696,-22.29
2697,-22.56
2698,-22.77
2699,-22.91
2700,-22.98
2701,-22.95
2702,-22.85
2703,-22.71
2704,-22.54
2705,-22.39
2706,-22.25
2707,-22.10
2708,-21.91
2709,-21.68
2710,-21.36
2711,-20.98
2712,-20.48
2713,-19.93
2714,-19.35
2715,-18.82
2716,-18.34
2717,-17.98
2718,-17.68
2719,-17.47
2720,-17.21
2721,-16.92
2722,-16.44
2723,-15.83
2724,-15.00
2725,-14.09
2726,-13.03
2727,-11.98
2728,-10.92
2729,-9.97
2730,-9.06
2731,-8.30
2732,-7.52
2733,-6.80
2734,-6.01
2735,-5.23
2736,-4.35
2737,-3.48
2738,-2.52
2739,-1.64
2740,-0.74
2741,0.04
2742,0.83
2743,1.53
2744,2.30
2745,3.06
2746,3.97
2747,4.92
2748,6.02
2749,7.12
2750,8.30
2751,9.41
2752,10.51
2753,11.48
2754,12.45
2755,13.30
2756,14.20
2757,15.08
2758,16.08
2759,17.10
2760,18.21
2761,19.28
2762,20.36
2763,21.30
2764,22.16
2765,22.85
2766,23.51
2767,24.01
2768,24.39
2769,24.59
2770,24.77
2771,24.99
2772,25.37
2773,25.82
2774,26.33
2775,26.80
2776,27.21
2777,27.48
2778,27.62
2779,27.61
2780,27.51
2781,27.37
2782,27.26
2783,27.20
2784,27.24
2785,27.37
2786,27.58
2787,27.81
2788,28.05
2789,28.21
2790,28.31
2791,28.36
2792,28.38
2793,28.41
2794,28.49
2795,28.63
2796,28.87
2797,29.17
2798,29.56
2799,30.01
2800,30.53
2801,31.09
2802,31.68
2803,32.28
2804,32.84
2805,33.29
2806,33.59
2807,33.76
2808,33.77
2809,33.56
2810,33.03
2811,32.23
2812,31.29
2813,30.39
2814,29.54
2815,28.79
2816,28.10
2817,27.52
2818,26.99
2819,26.54
2820,26.07
2821,25.64
2822,25.16
2823,24.69
2824,24.11
2825,23.52
2826,22.85
2827,22.23
2828,21.64
2829,21.17
2830,20.80
2831,20.57
2832,20.41
2833,20.31
2834,20.17
2835,19.98
2836,19.69
2837,19.37
2838,19.02
2839,18.73
2840,18.50
2841,18.40
2842,18.40
2843,18.48
2844,18.58
2845,18.68
2846,18.68
2847,18.60
2848,18.40
2849,18.12
2850,17.72
2851,17.25
2852,16.66
2853,16.00
2854,15.24
2855,14.45
2856,13.59
2857,12.77
2858,11.96
2859,11.26
2860,10.63
2861,10.13
2862,9.67
2863,9.28
2864,8.83
2865,8.38
2866,7.86
2867,7.36
2868,6.87
2869,6.47
2870,6.12
2871,5.90
2872,5.75
2873,5.69
2874,5.65
2875,5.64
2876,5.60
2877,5.58
2878,5.57
2879,5.59
2880,5.64
2881,5.72
2882,5.85
2883,6.01
2884,6.19
2885,6.38
2886,6.61
2887,6.87
2888,7.20
2889,7.57
2890,7.98
2891,8.39
2892,8.79
2893,9.14
2894,9.47
2895,9.73
2896,9.97
2897,10.16
2898,10.34
2899,10.50
2900,10.67
2901,10.80
2902,10.90
2903,10.93
2904,10.93
2905,10.86
2906,10.79
2907,10.72
2908,10.70
2909,10.75
2910,10.90
2911,11.11
2912,11.33
2913,11.55
2914,11.72
2915,11.81
2916,11.82
2917,11.76
2918,11.67
2919,11.60
2920,11.60
2921,11.65
2922,11.78
2923,11.94
2924,12.12
2925,12.29
2926,12.43
2927,12.53
2928,12.63
2929,12.75
2930,12.92
2931,13.13
2932,13.39
2933,13.65
2934,13.90
2935,14.09
2936,14.20
2937,14.22
2938,14.17
2939,14.10
2940,14.05
2941,14.04
2942,14.09
2943,14.21
2944,14.37
2945,14.52
2946,14.62
2947,14.64
2948,14.56
2949,14.41
2950,14.20
2951,13.98
2952,13.76
2953,13.59
2954,13.44
2955,13.30
2956,13.11
2957,12.90
2958,12.62
2959,12.30
2960,11.92
2961,11.52
2962,11.09
2963,10.69
2964,10.26
2965,9.84
2966,9.34
2967,8.82
2968,8.24
2969,7.69
2970,7.13
2971,6.65
2972,6.19
2973,5.82
2974,5.47
2975,5.15
2976,4.76
2977,4.34
2978,3.80
2979,3.21
2980,2.55
2981,1.89
2982,1.25
2983,0.71
2984,0.27
2985,-0.03
2986,-0.25
2987,-0.36
2988,-0.43
2989,-0.43
2990,-0.39
2991,-0.32
2992,-0.24
2993,-0.16
2994,-0.07
2995,0.03
2996,0.13
2997,0.21
2998,0.31
2999,0.40
3000,0.51
3001,0.62
3002,0.75
3003,0.87
3004,1.01
3005,1.12
3006,1.22
3007,1.28
3008,1.34
3009,1.41
3010,1.50
3011,1.61
3012,1.75
3013,1.93
3014,2.11
3015,2.28
3016,2.43
3017,2.54
3018,2.64
3019,2.71
3020,2.75
3021,2.77
3022,2.80
3023,2.82
3024,2.87
3025,2.94
3026,3.04
3027,3.20
3028,3.39
3029,3.61
3030,3.84
3031,4.06
3032,4.24
3033,4.37
3034,4.39
3035,4.31
3036,4.10
3037,3.77
3038,3.33
3039,2.83
3040,2.29
3041,1.78
3042,1.31
3043,0.94
3044,0.60
3045,0.36
3046,0.10
3047,-0.16
3048,-0.55
3049,-1.01
3050,-1.63
3051,-2.32
3052,-3.16
3053,-4.05
3054,-5.05
3055,-6.02
3056,-7.04
3057,-8.00
3058,-8.99
3059,-9.87
3060,-10.71
3061,-11.43
3062,-12.16
3063,-12.82
3064,-13.54
3065,-14.23
3066,-15.01
3067,-15.75
3068,-16.53
3069,-17.21
3070,-17.85
3071,-18.35
3072,-18.82
3073,-19.19
3074,-19.61
3075,-20.04
3076,-20.62
3077,-21.27
3078,-22.10
3079,-22.96
3080,-23.92
3081,-24.86
3082,-25.85
3083,-26.82
3084,-27.87
3085,-28.90
3086,-30.01
3087,-31.06
3088,-32.09
3089,-32.94
3090,-33.69
3091,-34.26
3092,-34.80
3093,-35.26
3094,-35.75
3095,-36.21
3096,-36.75
3097,-37.30
3098,-37.90
3099,-38.44
3100,-38.95
3101,-39.37
3102,-39.74
3103,-40.06
3104,-40.39
3105,-40.72
3106,-41.08
3107,-41.41
3108,-41.74
3109,-41.99
3110,-42.16
3111,-42.21
3112,-42.16
3113,-42.05
3114,-41.94
3115,-41.90
3116,-41.95
3117,-42.10
3118,-42.36
3119,-42.71
3120,-43.09
3121,-43.41
3122,-43.55
3123,-43.45
3124,-43.08
3125,-42.52
3126,-41.82
3127,-41.08
3128,-40.32
3129,-39.65
3130,-39.03
3131,-38.55
3132,-38.10
3133,-37.70
3134,-37.19
3135,-36.60
3136,-35.78
3137,-34.84
3138,-33.68
3139,-32.47
3140,-31.17
3141,-29.97
3142,-28.77
3143,-27.73
3144,-26.69
3145,-25.73
3146,-24.65
3147,-23.56
3148,-22.31
3149,-21.06
3150,-19.73
3151,-18.50
3152,-17.29
3153,-16.28
3154,-15.36
3155,-14.65
3156,-13.99
3157,-13.47
3158,-12.93
3159,-12.46
3160,-11.90
3161,-11.36
3162,-10.68
3163,-9.97
3164,-9.09
3165,-8.17
3166,-7.09
3167,-5.99
3168,-4.80
3169,-3.68
3170,-2.53
3171,-1.51
3172,-0.49
3173,0.42
3174,1.35
3175,2.21
3176,3.13
3177,3.99
3178,4.92
3179,5.74
3180,6.54
3181,7.18
3182,7.75
3183,8.19
3184,8.62
3185,8.97
3186,9.37
3187,9.79
3188,10.31
3189,10.87
3190,11.49
3191,12.06
3192,12.58
3193,12.96
3194,13.24
3195,13.38
3196,13.45
3197,13.45
3198,13.50
3199,13.62
3200,13.87
3201,14.21
3202,14.67
3203,15.14
3204,15.68
3205,16.19
3206,16.72
3207,17.23
3208,17.78
3209,18.35
3210,19.01
3211,19.67
3212,20.39
3213,21.07
3214,21.75
3215,22.35
3216,22.89
3217,23.30
3218,23.67
3219,23.95
3220,24.18
3221,24.34
3222,24.44
3223,24.47
3224,24.43
3225,24.33
3226,24.19
3227,24.03
3228,23.81
3229,23.54
3230,23.18
3231,22.78
3232,22.26
3233,21.69
3234,21.02
3235,20.32
3236,19.57
3237,18.88
3238,18.17
3239,17.50
3240,16.79
3241,16.08
3242,15.29
3243,14.52
3244,13.73
3245,13.02
3246,12.34
3247,11.77
3248,11.23
3249,10.77
3250,10.25
3251,9.72
3252,9.06
3253,8.35
3254,7.55
3255,6.79
3256,6.06
3257,5.48
3258,5.00
3259,4.68
3260,4.43
3261,4.27
3262,4.14
3263,4.07
3264,4.03
3265,4.05
3266,4.14
3267,4.31
3268,4.57
3269,4.89
3270,5.29
3271,5.74
3272,6.22
3273,6.69
3274,7.15
3275,7.56
3276,7.92
3277,8.17
3278,8.33
3279,8.37
3280,8.35
3281,8.26
3282,8.11
3283,7.93
3284,7.74
3285,7.57
3286,7.44
3287,7.33
3288,7.25
3289,7.20
3290,7.21
3291,7.29
3292,7.47
3293,7.72
3294,8.09
3295,8.49
3296,8.98
3297,9.48
3298,10.06
3299,10.65
3300,11.35
3301,12.09
3302,13.01
3303,14.03
3304,15.26
3305,16.55
3306,17.99
3307,19.40
3308,20.86
3309,22.19
3310,23.48
3311,24.60
3312,25.71
3313,26.71
3314,27.79
3315,28.83
3316,29.99
3317,31.11
3318,32.31
3319,33.42
3320,34.51
3321,35.42
3322,36.25
3323,36.90
3324,37.48
3325,37.93
3326,38.32
3327,38.60
3328,38.82
3329,38.96
3330,39.06
3331,39.09
3332,39.11
3333,39.10
3334,39.10
3335,39.08
3336,39.06
3337,39.01
3338,38.92
3339,38.79
3340,38.64
3341,38.47
3342,38.35
3343,38.28
3344,38.31
3345,38.42
3346,38.59
3347,38.80
3348,39.04
3349,39.29
3350,39.51
3351,39.71
3352,39.88
3353,40.01
3354,40.09
3355,40.12
3356,40.10
3357,40.01
3358,39.81
3359,39.53
3360,39.20
3361,38.88
3362,38.62
3363,38.45
3364,38.34
3365,38.23
3366,38.01
3367,37.72
3368,37.38
3369,37.08
3370,36.75
3371,36.42
3372,36.00
3373,35.57
3374,35.05
3375,34.49
3376,33.85
3377,33.19
3378,32.48
3379,31.77
3380,31.01
3381,30.26
3382,29.48
3383,28.74
3384,27.98
3385,27.31
3386,26.69
3387,26.20
3388,25.79
3389,25.51
3390,25.26
3391,25.08
3392,24.87
3393,24.67
3394,24.43
3395,24.19
3396,23.91
3397,23.65
3398,23.38
3399,23.13
3400,22.85
3401,22.59
3402,22.30
3403,22.02
3404,21.73
3405,21.47
3406,21.22
3407,21.05
3408,20.90
3409,20.79
3410,20.67
3411,20.54
3412,20.34
3413,20.10
3414,19.77
3415,19.39
3416,18.95
3417,18.52
3418,18.09
3419,17.72
3420,17.41
3421,17.20
3422,17.05
3423,16.96
3424,16.85
3425,16.71
3426,16.47
3427,16.16
3428,15.73
3429,15.26
3430,14.76
3431,14.32
3432,13.95
3433,13.68
3434,13.44
3435,13.24
3436,12.99
3437,12.70
3438,12.31
3439,11.87
3440,11.35
3441,10.82
3442,10.31
3443,9.88
3444,9.52
3445,9.26
3446,9.06
3447,8.94
3448,8.84
3449,8.78
3450,8.75
3451,8.76
3452,8.78
3453,8.83
3454,8.90
3455,9.00
3456,9.13
3457,9.27
3458,9.44
3459,9.63
3460,9.89
3461,10.18
3462,10.49
3463,10.78
3464,11.04
3465,11.25
3466,11.39
3467,11.45
3468,11.46
3469,11.45
3470,11.45
3471,11.46
3472,11.51
3473,11.55
3474,11.63
3475,11.70
3476,11.78
3477,11.87
3478,12.02
3479,12.25
3480,12.57
3481,12.96
3482,13.37
3483,13.76
3484,14.07
3485,14.24
3486,14.26
3487,14.11
3488,13.85
3489,13.52
3490,13.25
3491,13.07
3492,13.04
3493,13.16
3494,13.43
3495,13.80
3496,14.25
3497,14.70
3498,15.13
3499,15.51
3500,15.85
3501,16.15
3502,16.45
3503,16.71
3504,16.97
3505,17.21
3506,17.47
3507,17.70
3508,17.93
3509,18.10
3510,18.26
3511,18.36
3512,18.46
3513,18.55
3514,18.68
3515,18.84
3516,19.09
3517,19.37
3518,19.71
3519,20.05
3520,20.41
3521,20.73
3522,21.05
3523,21.34
3524,21.62
3525,21.89
3526,22.15
3527,22.38
3528,22.57
3529,22.69
3530,22.73
3531,22.69
3532,22.60
3533,22.49
3534,22.39
3535,22.34
3536,22.34
3537,22.40
3538,22.48
3539,22.53
3540,22.51
3541,22.42
3542,22.23
3543,21.98
3544,21.64
3545,21.27
3546,20.86
3547,20.47
3548,20.07
3549,19.71
3550,19.36
3551,19.05
3552,18.72
3553,18.40
3554,18.03
3555,17.64
3556,17.19
3557,16.73
3558,16.24
3559,15.80
3560,15.39
3561,15.08
3562,14.86
3563,14.75
3564,14.69
3565,14.67
3566,14.63
3567,14.57
3568,14.47
3569,14.37
3570,14.28
3571,14.23
3572,14.27
3573,14.40
3574,14.65
3575,14.99
3576,15.39
3577,15.81
3578,16.24
3579,16.64
3580,17.03
3581,17.38
3582,17.67
3583,17.89
3584,18.05
3585,18.13
3586,18.15
3587,18.11
3588,18.01
3589,17.90
3590,17.82
3591,17.78
3592,17.81
3593,17.90
3594,18.07
3595,18.29
3596,18.55
3597,18.83
3598,19.11
3599,19.38
3600,19.63
3601,19.85
3602,20.04
3603,20.18
3604,20.28
3605,20.31
3606,20.31
3607,20.29
3608,20.28
3609,20.30
3610,20.37
3611,20.48
3612,20.63
3613,20.78
3614,20.90
3615,20.95
3616,20.92
3617,20.79
3618,20.58
3619,20.34
3620,20.09
3621,19.91
3622,19.79
3623,19.75
3624,19.74
3625,19.73
3626,19.67
3627,19.52
3628,19.25
3629,18.89
3630,18.47
3631,18.07
3632,17.72
3633,17.49
3634,17.34
3635,17.30
3636,17.29
3637,17.29
3638,17.22
3639,17.06
3640,16.76
3641,16.37
3642,15.89
3643,15.40
3644,14.91
3645,14.50
3646,14.16
3647,13.95
3648,13.82
3649,13.76
3650,13.70
3651,13.64
3652,13.53
3653,13.37
3654,13.13
3655,12.87
3656,12.58
3657,12.31
3658,12.06
3659,11.87
3660,11.70
3661,11.59
3662,11.47
3663,11.34
3664,11.15
3665,10.92
3666,10.61
3667,10.29
3668,9.96
3669,9.65
3670,9.36
3671,9.12
3672,8.90
3673,8.72
3674,8.58
3675,8.45
3676,8.31
3677,8.17
3678,8.04
3679,7.96
3680,7.89
3681,7.85
3682,7.77
3683,7.67
3684,7.52
3685,7.33
3686,7.09
3687,6.84
3688,6.59
3689,6.41
3690,6.31
3691,6.32
3692,6.42
3693,6.61
3694,6.83
3695,7.02
3696,7.14
3697,7.15
3698,7.08
3699,6.94
3700,6.76
3701,6.60
3702,6.49
3703,6.46
3704,6.52
3705,6.63
3706,6.77
3707,6.91
3708,7.03
3709,7.10
3710,7.15
3711,7.18
3712,7.22
3713,7.27
3714,7.32
3715,7.36
3716,7.36
3717,7.32
3718,7.22
3719,7.07
3720,6.86
3721,6.62
3722,6.36
3723,6.11
3724,5.83
3725,5.53
3726,5.20
3727,4.87
3728,4.52
3729,4.17
3730,3.81
3731,3.49
3732,3.20
3733,2.97
3734,2.77
3735,2.64
3736,2.55
3737,2.54
3738,2.55
3739,2.60
3740,2.64
3741,2.65
3742,2.59
3743,2.48
3744,2.31
3745,2.11
3746,1.89
3747,1.71
3748,1.59
3749,1.55
3750,1.61
3751,1.74
3752,1.90
3753,2.05
3754,2.15
3755,2.19
3756,2.15
3757,2.04
3758,1.87
3759,1.69
3760,1.53
3761,1.40
3762,1.33
3763,1.32
3764,1.38
3765,1.47
3766,1.57
3767,1.65
3768,1.70
3769,1.74
3770,1.76
3771,1.78
3772,1.79
3773,1.79
3774,1.78
3775,1.73
3776,1.64
3777,1.49
3778,1.28
3779,1.05
3780,0.83
3781,0.66
3782,0.56
3783,0.55
3784,0.62
3785,0.75
3786,0.91
3787,1.06
3788,1.17
3789,1.25
3790,1.29
3791,1.34
3792,1.43
3793,1.56
3794,1.76
3795,2.00
3796,2.27
3797,2.52
3798,2.73
3799,2.86
3800,2.90
3801,2.83
3802,2.66
3803,2.42
3804,2.15
3805,1.86
3806,1.57
3807,1.30
3808,1.09
3809,0.94
3810,0.87
3811,0.86
3812,0.91
3813,0.99
3814,1.08
3815,1.16
3816,1.19
3817,1.19
3818,1.16
3819,1.11
3820,1.08
3821,1.08
3822,1.09
3823,1.12
3824,1.14
3825,1.14
3826,1.09
3827,0.98
3828,0.78
3829,0.51
3830,0.18
3831,-0.17
3832,-0.55
3833,-0.90
3834,-1.26
3835,-1.57
3836,-1.89
3837,-2.19
3838,-2.51
3839,-2.84
3840,-3.20
3841,-3.56
3842,-3.97
3843,-4.38
3844,-4.80
3845,-5.18
3846,-5.55
3847,-5.87
3848,-6.15
3849,-6.36
3850,-6.52
3851,-6.63
3852,-6.73
3853,-6.81
3854,-6.91
3855,-6.99
3856,-7.06
3857,-7.12
3858,-7.17
3859,-7.19
3860,-7.22
3861,-7.26
3862,-7.34
3863,-7.47
3864,-7.67
3865,-7.91
3866,-8.18
3867,-8.44
3868,-8.66
3869,-8.83
3870,-8.98
3871,-9.09
3872,-9.22
3873,-9.37
3874,-9.59
3875,-9.88
3876,-10.21
3877,-10.54
3878,-10.83
3879,-11.02
3880,-11.05
3881,-10.91
3882,-10.60
3883,-10.18
3884,-9.70
3885,-9.23
3886,-8.80
3887,-8.45
3888,-8.14
3889,-7.89
3890,-7.61
3891,-7.32
3892,-6.93
3893,-6.49
3894,-5.98
3895,-5.47
3896,-4.97
3897,-4.54
3898,-4.16
3899,-3.86
3900,-3.60
3901,-3.39
3902,-3.17
3903,-2.96
3904,-2.71
3905,-2.47
3906,-2.25
3907,-2.08
3908,-1.95
3909,-1.89
3910,-1.83
3911,-1.80
3912,-1.75
3913,-1.68
3914,-1.57
3915,-1.45
3916,-1.29
3917,-1.13
3918,-0.95
3919,-0.76
3920,-0.54
3921,-0.31
3922,-0.05
3923,0.23
3924,0.52
3925,0.81
3926,1.11
3927,1.39
3928,1.68
3929,1.95
3930,2.26
3931,2.54
3932,2.85
3933,3.12
3934,3.35
3935,3.52
3936,3.68
3937,3.81
3938,4.00
3939,4.24
3940,4.62
3941,5.11
3942,5.74
3943,6.42
3944,7.19
3945,7.95
3946,8.73
3947,9.45
3948,10.16
3949,10.81
3950,11.47
3951,12.07
3952,12.68
3953,13.22
3954,13.75
3955,14.21
3956,14.66
3957,15.05
3958,15.48
3959,15.88
3960,16.31
3961,16.72
3962,17.16
3963,17.54
3964,17.89
3965,18.15
3966,18.34
3967,18.47
3968,18.57
3969,18.64
3970,18.69
3971,18.70
3972,18.69
3973,18.63
3974,18.53
3975,18.38
3976,18.17
3977,17.91
3978,17.63
3979,17.36
3980,17.08
3981,16.84
3982,16.62
3983,16.46
3984,16.33
3985,16.24
3986,16.14
3987,16.05
3988,15.90
3989,15.71
3990,15.43
3991,15.12
3992,14.77
3993,14.43
3994,14.09
3995,13.81
3996,13.54
3997,13.31
3998,13.05
3999,12.79
4000,12.47
4001,12.15
4002,11.80
4003,11.47
4004,11.19
4005,10.99
4006,10.88
4007,10.86
4008,10.89
4009,10.96
4010,11.00
4011,11.02
4012,11.00
4013,10.94
4014,10.82
4015,10.65
4016,10.48
4017,10.32
4018,10.19
4019,10.11
4020,10.08
4021,10.13
4022,10.23
4023,10.37
4024,10.55
4025,10.73
4026,10.92
4027,11.10
4028,11.24
4029,11.36
4030,11.44
4031,11.46
4032,11.43
4033,11.34
4034,11.22
4035,11.05
4036,10.87
4037,10.69
4038,10.58
4039,10.55
4040,10.64
4041,10.85
4042,11.19
4043,11.61
4044,12.10
4045,12.57
4046,13.02
4047,13.38
4048,13.68
4049,13.89
4050,14.07
4051,14.23
4052,14.44
4053,14.69
4054,15.02
4055,15.39
4056,15.80
4057,16.17
4058,16.51
4059,16.76
4060,16.96
4061,17.11
4062,17.25
4063,17.36
4064,17.51
4065,17.70
4066,17.96
4067,18.24
4068,18.55
4069,18.87
4070,19.18
4071,19.44
4072,19.67
4073,19.86
4074,20.01
4075,20.10
4076,20.13
4077,20.10
4078,20.01
4079,19.85
4080,19.63
4081,19.37
4082,19.09
4083,18.82
4084,18.55
4085,18.33
4086,18.13
4087,17.98
4088,17.84
4089,17.71
4090,17.53
4091,17.33
4092,17.09
4093,16.85
4094,16.58
4095,16.30
4096,16.00
4097,15.71
4098,15.41
4099,15.12
4100,14.82
4101,14.55
4102,14.28
4103,14.07
4104,13.86
4105,13.67
4106,13.45
4107,13.22
4108,12.92
4109,12.58
4110,12.15
4111,11.71
4112,11.24
4113,10.84
4114,10.47
4115,10.20
4116,9.99
4117,9.87
4118,9.78
4119,9.70
4120,9.59
4121,9.46
4122,9.33
4123,9.22
4124,9.12
4125,9.08
4126,9.09
4127,9.16
4128,9.27
4129,9.43
4130,9.62
4131,9.82
4132,10.00
4133,10.14
4134,10.24
4135,10.29
4136,10.29
4137,10.23
4138,10.13
4139,9.99
4140,9.84
4141,9.72
4142,9.63
4143,9.57
4144,9.54
4145,9.52
4146,9.50
4147,9.48
4148,9.48
4149,9.51
4150,9.56
4151,9.63
4152,9.69
4153,9.71
4154,9.69
4155,9.61
4156,9.51
4157,9.38
4158,9.27
4159,9.17
4160,9.14
4161,9.19
4162,9.31
4163,9.50
4164,9.72
4165,9.93
4166,10.10
4167,10.21
4168,10.27
4169,10.29
4170,10.29
4171,10.28
4172,10.28
4173,10.29
4174,10.34
4175,10.40
4176,10.47
4177,10.53
4178,10.59
4179,10.65
4180,10.72
4181,10.82
4182,10.96
4183,11.13
4184,11.34
4185,11.55
4186,11.77
4187,11.96
4188,12.14
4189,12.26
4190,12.33
4191,12.37
4192,12.41
4193,12.45
4194,12.51
4195,12.54
4196,12.58
4197,12.62
4198,12.68
4199,12.75
4200,12.88
4201,13.05
4202,13.28
4203,13.56
4204,13.88
4205,14.19
4206,14.50
4207,14.74
4208,14.95
4209,15.12
4210,15.30
4211,15.48
4212,15.69
4213,15.92
4214,16.17
4215,16.42
4216,16.64
4217,16.78
4218,16.82
4219,16.73
4220,16.51
4221,16.21
4222,15.83
4223,15.42
4224,14.97
4225,14.54
4226,14.11
4227,13.71
4228,13.33
4229,12.98
4230,12.65
4231,12.39
4232,12.18
4233,12.05
4234,11.96
4235,11.93
4236,11.94
4237,12.00
4238,12.07
4239,12.17
4240,12.30
4241,12.47
4242,12.68
4243,12.94
4244,13.23
4245,13.54
4246,13.85
4247,14.11
4248,14.32
4249,14.44
4250,14.48
4251,14.43
4252,14.34
4253,14.23
4254,14.15
4255,14.09
4256,14.07
4257,14.08
4258,14.11
4259,14.12
4260,14.10
4261,14.04
4262,13.97
4263,13.92
4264,13.89
4265,13.87
4266,13.85
4267,13.82
4268,13.73
4269,13.57
4270,13.33
4271,13.05
4272,12.74
4273,12.47
4274,12.25
4275,12.10
4276,12.01
4277,11.96
4278,11.88
4279,11.73
4280,11.45
4281,11.07
4282,10.57
4283,10.00
4284,9.36
4285,8.73
4286,8.08
4287,7.49
4288,6.94
4289,6.47
4290,6.05
4291,5.73
4292,5.44
4293,5.23
4294,5.08
4295,5.01
4296,4.95
4297,4.92
4298,4.85
4299,4.77
4300,4.65
4301,4.54
4302,4.41
4303,4.29
4304,4.13
4305,3.96
4306,3.74
4307,3.50
4308,3.17
4309,2.79
4310,2.31
4311,1.81
4312,1.25
4313,0.71
4314,0.15
4315,-0.36
4316,-0.87
4317,-1.33
4318,-1.82
4319,-2.32
4320,-2.88
4321,-3.43
4322,-4.02
4323,-4.58
4324,-5.17
4325,-5.71
4326,-6.26
4327,-6.76
4328,-7.28
4329,-7.77
4330,-8.28
4331,-8.75
4332,-9.23
4333,-9.67
4334,-10.12
4335,-10.54
4336,-10.96
4337,-11.36
4338,-11.77
4339,-12.16
4340,-12.55
4341,-12.89
4342,-13.18
4343,-13.40
4344,-13.55
4345,-13.60
4346,-13.61
4347,-13.58
4348,-13.56
4349,-13.55
4350,-13.56
4351,-13.58
4352,-13.60
4353,-13.62
4354,-13.59
4355,-13.49
4356,-13.28
4357,-13.02
4358,-12.69
4359,-12.32
4360,-11.91
4361,-11.49
4362,-11.07
4363,-10.69
4364,-10.35
4365,-10.07
4366,-9.84
4367,-9.68
4368,-9.57
4369,-9.54
4370,-9.53
4371,-9.55
4372,-9.55
4373,-9.55
4374,-9.52
4375,-9.47
4376,-9.41
4377,-9.36
4378,-9.28
4379,-9.20
4380,-9.11
4381,-9.00
4382,-8.85
4383,-8.68
4384,-8.48
4385,-8.30
4386,-8.14
4387,-8.04
4388,-7.97
4389,-7.94
4390,-7.90
4391,-7.86
4392,-7.75
4393,-7.58
4394,-7.34
4395,-7.04
4396,-6.69
4397,-6.35
4398,-6.02
4399,-5.75
4400,-5.52
4401,-5.33
4402,-5.15
4403,-4.98
4404,-4.77
4405,-4.55
4406,-4.28
4407,-4.01
4408,-3.72
4409,-3.47
4410,-3.26
4411,-3.12
4412,-3.03
4413,-3.01
4414,-3.00
4415,-3.01
4416,-2.99
4417,-2.95
4418,-2.85
4419,-2.73
4420,-2.58
4421,-2.44
4422,-2.31
4423,-2.22
4424,-2.17
4425,-2.13
4426,-2.09
4427,-2.06
4428,-2.04
4429,-2.01
4430,-1.99
4431,-1.98
4432,-2.01
4433,-2.08
4434,-2.20
4435,-2.34
4436,-2.47
4437,-2.56
4438,-2.61
4439,-2.60
4440,-2.54
4441,-2.46
4442,-2.36
4443,-2.28
4444,-2.19
4445,-2.08
4446,-1.95
4447,-1.81
4448,-1.65
4449,-1.49
4450,-1.30
4451,-1.09
4452,-0.89
4453,-0.72
4454,-0.57
4455,-0.47
4456,-0.40
4457,-0.37
4458,-0.38
4459,-0.42
4460,-0.50
4461,-0.62
4462,-0.75
4463,-0.86
4464,-0.90
4465,-0.85
4466,-0.71
4467,-0.50
4468,-0.23
4469,0.05
4470,0.31
4471,0.50
4472,0.62
4473,0.64
4474,0.60
4475,0.52
4476,0.47
4477,0.45
4478,0.52
4479,0.66
4480,0.90
4481,1.20
4482,1.57
4483,1.96
4484,2.39
4485,2.80
4486,3.25
4487,3.69
4488,4.16
4489,4.61
4490,5.09
4491,5.54
4492,6.02
4493,6.46
4494,6.96
4495,7.43
4496,7.97
4497,8.50
4498,9.13
4499,9.78
4500,10.49
4501,11.18
4502,11.88
4503,12.49
4504,13.05
4505,13.46
4506,13.81
4507,14.05
4508,14.27
4509,14.45
4510,14.67
4511,14.90
4512,15.18
4513,15.46
4514,15.77
4515,16.04
4516,16.29
4517,16.46
4518,16.61
4519,16.72
4520,16.84
4521,16.99
4522,17.21
4523,17.50
4524,17.88
4525,18.27
4526,18.70
4527,19.10
4528,19.48
4529,19.78
4530,20.05
4531,20.27
4532,20.46
4533,20.62
4534,20.77
4535,20.87
4536,20.97
4537,21.05
4538,21.11
4539,21.13
4540,21.13
4541,21.11
4542,21.10
4543,21.07
4544,21.03
4545,20.97
4546,20.90
4547,20.80
4548,20.68
4549,20.54
4550,20.39
4551,20.25
4552,20.10
4553,19.97
4554,19.83
4555,19.70
4556,19.56
4557,19.40
4558,19.20
4559,18.97
4560,18.72
4561,18.48
4562,18.29
4563,18.17
4564,18.17
4565,18.31
4566,18.59
4567,18.97
4568,19.40
4569,19.84
4570,20.22
4571,20.50
4572,20.65
4573,20.66
4574,20.55
4575,20.36
4576,20.15
4577,19.95
4578,19.81
4579,19.72
4580,19.71
4581,19.74
4582,19.82
4583,19.94
4584,20.13
4585,20.37
4586,20.69
4587,21.06
4588,21.51
4589,22.03
4590,22.60
4591,23.14
4592,23.63
4593,24.01
4594,24.29
4595,24.45
4596,24.50
4597,24.45
4598,24.36
4599,24.23
4600,24.10
4601,23.96
4602,23.83
4603,23.69
4604,23.53
4605,23.33
4606,23.03
4607,22.68
4608,22.27
4609,21.85
4610,21.40
4611,20.96
4612,20.49
4613,20.04
4614,19.54
4615,19.04
4616,18.43
4617,17.79
4618,17.04
4619,16.28
4620,15.44
4621,14.61
4622,13.76
4623,12.98
4624,12.21
4625,11.53
4626,10.87
4627,10.31
4628,9.76
4629,9.31
4630,8.87
4631,8.51
4632,8.15
4633,7.84
4634,7.48
4635,7.13
4636,6.68
4637,6.20
4638,5.62
4639,5.01
4640,4.33
4641,3.68
4642,3.03
4643,2.46
4644,1.93
4645,1.52
4646,1.17
4647,0.93
4648,0.71
4649,0.55
4650,0.37
4651,0.19
4652,-0.06
4653,-0.32
4654,-0.65
4655,-0.99
4656,-1.41
4657,-1.85
4658,-2.35
4659,-2.84
4660,-3.33
4661,-3.76
4662,-4.16
4663,-4.45
4664,-4.70
4665,-4.88
4666,-5.05
4667,-5.20
4668,-5.40
4669,-5.60
4670,-5.87
4671,-6.16
4672,-6.52
4673,-6.90
4674,-7.34
4675,-7.78
4676,-8.25
4677,-8.72
4678,-9.24
4679,-9.74
4680,-10.26
4681,-10.75
4682,-11.26
4683,-11.72
4684,-12.17
4685,-12.54
4686,-12.91
4687,-13.24
4688,-13.57
4689,-13.89
4690,-14.25
4691,-14.63
4692,-15.07
4693,-15.52
4694,-15.99
4695,-16.44
4696,-16.87
4697,-17.26
4698,-17.60
4699,-17.87
4700,-18.08
4701,-18.22
4702,-18.30
4703,-18.31
4704,-18.23
4705,-18.05
4706,-17.81
4707,-17.51
4708,-17.18
4709,-16.88
4710,-16.61
4711,-16.42
4712,-16.28
4713,-16.19
4714,-16.10
4715,-16.02
4716,-15.85
4717,-15.64
4718,-15.31
4719,-14.94
4720,-14.46
4721,-13.96
4722,-13.36
4723,-12.77
4724,-12.12
4725,-11.49
4726,-10.81
4727,-10.17
4728,-9.46
4729,-8.77
4730,-7.99
4731,-7.22
4732,-6.35
4733,-5.49
4734,-4.52
4735,-3.57
4736,-2.55
4737,-1.61
4738,-0.67
4739,0.15
4740,0.98
4741,1.73
4742,2.54
4743,3.30
4744,4.16
4745,5.00
4746,5.97
4747,6.92
4748,7.97
4749,8.97
4750,10.00
4751,10.95
4752,11.92
4753,12.80
4754,13.69
4755,14.49
4756,15.32
4757,16.05
4758,16.78
4759,17.40
4760,18.00
4761,18.52
4762,19.05
4763,19.54
4764,20.06
4765,20.57
4766,21.13
4767,21.64
4768,22.12
4769,22.49
4770,22.78
4771,22.97
4772,23.12
4773,23.23
4774,23.35
4775,23.47
4776,23.64
4777,23.80
4778,23.97
4779,24.09
4780,24.17
4781,24.17
4782,24.14
4783,24.09
4784,24.07
4785,24.09
4786,24.16
4787,24.27
4788,24.44
4789,24.61
4790,24.78
4791,24.91
4792,25.02
4793,25.13
4794,25.26
4795,25.44
4796,25.71
4797,26.08
4798,26.54
4799,27.06
4800,27.59
4801,28.07
4802,28.44
4803,28.64
4804,28.68
4805,28.57
4806,28.34
4807,28.06
4808,27.77
4809,27.52
4810,27.33
4811,27.21
4812,27.07
4813,26.90
4814,26.62
4815,26.25
4816,25.73
4817,25.12
4818,24.41
4819,23.69
4820,22.95
4821,22.28
4822,21.66
4823,21.17
4824,20.73
4825,20.38
4826,20.03
4827,19.72
4828,19.35
4829,18.98
4830,18.50
4831,18.00
4832,17.43
4833,16.89
4834,16.34
4835,15.87
4836,15.46
4837,15.18
4838,14.98
4839,14.88
4840,14.80
4841,14.76
4842,14.69
4843,14.62
4844,14.50
4845,14.36
4846,14.18
4847,14.00
4848,13.77
4849,13.54
4850,13.27
4851,12.99
4852,12.66
4853,12.32
4854,11.90
4855,11.50
4856,11.08
4857,10.71
4858,10.33
4859,9.99
4860,9.60
4861,9.21
4862,8.76
4863,8.30
4864,7.80
4865,7.32
4866,6.84
4867,6.42
4868,6.06
4869,5.81
4870,5.62
4871,5.52
4872,5.42
4873,5.36
4874,5.25
4875,5.11
4876,4.89
4877,4.62
4878,4.29
4879,3.96
4880,3.62
4881,3.30
4882,3.01
4883,2.76
4884,2.56
4885,2.41
4886,2.30
4887,2.23
4888,2.19
4889,2.17
4890,2.18
4891,2.23
4892,2.37
4893,2.57
4894,2.86
4895,3.19
4896,3.56
4897,3.95
4898,4.33
4899,4.65
4900,4.92
4901,5.09
4902,5.20
4903,5.25
4904,5.26
4905,5.25
4906,5.26
4907,5.30
4908,5.40
4909,5.55
4910,5.73
4911,5.87
4912,5.97
4913,5.98
4914,5.92
4915,5.77
4916,5.56
4917,5.32
4918,5.08
4919,4.90
4920,4.80
4921,4.82
4922,4.95
4923,5.17
4924,5.45
4925,5.74
4926,6.00
4927,6.19
4928,6.25
4929,6.19
4930,6.02
4931,5.79
4932,5.54
4933,5.30
4934,5.11
4935,4.99
4936,4.93
4937,4.92
4938,4.91
4939,4.91
4940,4.86
4941,4.79
4942,4.66
4943,4.50
4944,4.30
4945,4.11
4946,3.88
4947,3.66
4948,3.39
4949,3.11
4950,2.80
4951,2.50
4952,2.20
4953,1.94
4954,1.68
4955,1.47
4956,1.22
4957,0.98
4958,0.64
4959,0.24
4960,-0.29
4961,-0.89
4962,-1.61
4963,-2.35
4964,-3.12
4965,-3.81
4966,-4.47
4967,-5.04
4968,-5.58
4969,-6.05
4970,-6.53
4971,-6.96
4972,-7.42
4973,-7.82
4974,-8.26
4975,-8.64
4976,-9.00
4977,-9.30
4978,-9.62
4979,-9.95
4980,-10.34
4981,-10.74
4982,-11.18
4983,-11.62
4984,-12.10
4985,-12.55
4986,-13.02
4987,-13.46
4988,-13.90
4989,-14.33
4990,-14.79
4991,-15.21
4992,-15.63
4993,-15.94
4994,-16.24
4995,-16.46
4996,-16.71
4997,-16.97
4998,-17.37
4999,-17.89
5000,-18.59
5001,-19.39
5002,-20.32
5003,-21.25
5004,-22.18
5005,-23.00
5006,-23.76
5007,-24.40
5008,-25.02
5009,-25.57
5010,-26.18
5011,-26.79
5012,-27.48
5013,-28.16
5014,-28.90
5015,-29.60
5016,-30.31
5017,-30.94
5018,-31.55
5019,-32.04
5020,-32.47
5021,-32.79
5022,-33.05
5023,-33.22
5024,-33.37
5025,-33.48
5026,-33.62
5027,-33.76
5028,-33.95
5029,-34.13
5030,-34.31
5031,-34.42
5032,-34.49
5033,-34.50
5034,-34.46
5035,-34.39
5036,-34.34
5037,-34.34
5038,-34.44
5039,-34.62
5040,-34.87
5041,-35.15
5042,-35.44
5043,-35.70
5044,-35.87
5045,-35.95
5046,-35.91
5047,-35.78
5048,-35.59
5049,-35.37
5050,-35.16
5051,-34.99
5052,-34.84
5053,-34.76
5054,-34.71
5055,-34.69
5056,-34.64
5057,-34.57
5058,-34.39
5059,-34.15
5060,-33.77
5061,-33.31
5062,-32.70
5063,-32.02
5064,-31.20
5065,-30.36
5066,-29.43
5067,-28.53
5068,-27.55
5069,-26.63
5070,-25.67
5071,-24.79
5072,-23.86
5073,-23.00
5074,-22.06
5075,-21.16
5076,-20.15
5077,-19.18
5078,-18.04
5079,-16.89
5080,-15.55
5081,-14.18
5082,-12.59
5083,-10.98
5084,-9.18
5085,-7.42
5086,-5.52
5087,-3.75
5088,-1.93
5089,-0.31
5090,1.35
5091,2.84
5092,4.42
5093,5.88
5094,7.46
5095,8.92
5096,10.50
5097,11.96
5098,13.50
5099,14.90
5100,16.39
5101,17.78
5102,19.31
5103,20.82
5104,22.48
5105,24.12
5106,25.89
5107,27.57
5108,29.25
5109,30.72
5110,32.10
5111,33.30
5112,34.41
5113,35.18
5114,35.58
5115,35.61
5116,35.58
5117,35.57
5118,35.62
5119,35.58
5120,35.46
5121,35.25
5122,34.98
5123,34.63
5124,34.23
5125,33.82
5126,33.46
5127,33.19
5128,33.06
5129,33.09
5130,33.31
5131,33.66
5132,34.12
5133,34.61
5134,35.10
5135,35.53
5136,35.91
5137,36.21
5138,36.49
5139,36.75
5140,37.06
5141,37.41
5142,37.81
5143,38.21
5144,38.60
5145,38.91
5146,39.14
5147,39.25
5148,39.25
5149,39.15
5150,38.99
5151,38.78
5152,38.54
5153,38.28
5154,37.98
5155,37.66
5156,37.30
5157,36.93
5158,36.52
5159,36.13
5160,35.71
5161,35.35
5162,35.01
5163,34.74
5164,34.45
5165,34.14
5166,33.73
5167,33.40
5168,33.07
5169,32.65
5170,31.84
5171,30.71
5172,29.39
5173,28.18
5174,27.00
5175,25.91
5176,24.76
5177,23.71
5178,22.63
5179,21.63
5180,20.56
5181,19.54
5182,18.48
5183,17.47
5184,16.43
5185,15.48
5186,14.55
5187,13.78
5188,13.10
5189,12.59
5190,12.21
5191,11.99
5192,11.86
5193,11.85
5194,11.92
5195,12.09
5196,12.31
5197,12.57
5198,12.84
5199,13.10
5200,13.37
5201,13.60
5202,13.83
5203,14.03
5204,14.24
5205,14.47
5206,14.75
5207,15.08
5208,15.47
5209,15.88
5210,16.30
5211,16.68
5212,16.99
5213,17.18
5214,17.25
5215,17.20
5216,17.10
5217,16.93
5218,16.72
5219,16.48
5220,16.24
5221,16.02
5222,15.81
5223,15.63
5224,15.47
5225,15.37
5226,15.35
5227,15.40
5228,15.49
5229,15.59
5230,15.68
5231,15.73
5232,15.76
5233,15.75
5234,15.73
5235,15.74
5236,15.82
5237,15.98
5238,16.22
5239,16.51
5240,16.79
5241,17.03
5242,17.18
5243,17.23
5244,17.14
5245,16.93
5246,16.65
5247,16.35
5248,16.05
5249,15.77
5250,15.51
5251,15.29
5252,15.09
5253,14.92
5254,14.74
5255,14.58
5256,14.38
5257,14.16
5258,13.87
5259,13.54
5260,13.13
5261,12.69
5262,12.19
5263,11.72
5264,11.29
5265,10.93
5266,10.61
5267,10.34
5268,10.03
5269,9.70
5270,9.26
5271,8.75
5272,8.15
5273,7.57
5274,7.00
5275,6.54
5276,6.17
5277,5.93
5278,5.76
5279,5.67
5280,5.52
5281,5.32
5282,4.98
5283,4.55
5284,4.04
5285,3.54
5286,3.03
5287,2.58
5288,2.16
5289,1.82
5290,1.51
5291,1.25
5292,1.00
5293,0.80
5294,0.63
5295,0.53
5296,0.46
5297,0.42
5298,0.33
5299,0.20
5300,-0.04
5301,-0.38
5302,-0.84
5303,-1.34
5304,-1.84
5305,-2.27
5306,-2.63
5307,-2.89
5308,-3.08
5309,-3.21
5310,-3.38
5311,-3.60
5312,-3.90
5313,-4.21
5314,-4.50
5315,-4.72
5316,-4.86
5317,-4.90
5318,-4.83
5319,-4.69
5320,-4.52
5321,-4.36
5322,-4.25
5323,-4.20
5324,-4.20
5325,-4.21
5326,-4.24
5327,-4.26
5328,-4.29
5329,-4.32
5330,-4.37
5331,-4.43
5332,-4.51
5333,-4.63
5334,-4.79
5335,-4.95
5336,-5.10
5337,-5.21
5338,-5.26
5339,-5.27
5340,-5.20
5341,-5.07
5342,-4.86
5343,-4.63
5344,-4.38
5345,-4.15
5346,-3.94
5347,-3.76
5348,-3.61
5349,-3.47
5350,-3.29
5351,-3.09
5352,-2.84
5353,-2.55
5354,-2.22
5355,-1.89
5356,-1.55
5357,-1.27
5358,-0.99
5359,-0.79
5360,-0.57
5361,-0.38
5362,-0.11
5363,0.19
5364,0.62
5365,1.14
5366,1.83
5367,2.62
5368,3.56
5369,4.52
5370,5.52
5371,6.43
5372,7.24
5373,7.86
5374,8.32
5375,8.57
5376,8.71
5377,8.72
5378,8.74
5379,8.77
5380,8.90
5381,9.11
5382,9.44
5383,9.82
5384,10.23
5385,10.57
5386,10.80
5387,10.87
5388,10.78
5389,10.55
5390,10.24
5391,9.90
5392,9.64
5393,9.50
5394,9.55
5395,9.77
5396,10.13
5397,10.58
5398,11.04
5399,11.41
5400,11.67
5401,11.79
5402,11.82
5403,11.78
5404,11.74
5405,11.70
5406,11.73
5407,11.81
5408,11.98
5409,12.20
5410,12.50
5411,12.84
5412,13.24
5413,13.68
5414,14.18
5415,14.71
5416,15.26
5417,15.80
5418,16.29
5419,16.69
5420,16.98
5421,17.13
5422,17.16
5423,17.05
5424,16.80
5425,16.42
5426,15.92
5427,15.37
5428,14.79
5429,14.27
5430,13.85
5431,13.58
5432,13.43
5433,13.39
5434,13.40
5435,13.42
5436,13.36
5437,13.22
5438,12.98
5439,12.71
5440,12.47
5441,12.34
5442,12.37
5443,12.59
5444,12.97
5445,13.47
5446,14.03
5447,14.56
5448,14.99
5449,15.28
5450,15.44
5451,15.47
5452,15.40
5453,15.28
5454,15.18
5455,15.11
5456,15.12
5457,15.19
5458,15.32
5459,15.47
5460,15.65
5461,15.82
5462,16.00
5463,16.18
5464,16.40
5465,16.63
5466,16.91
5467,17.22
5468,17.56
5469,17.87
5470,18.17
5471,18.42
5472,18.63
5473,18.77
5474,18.85
5475,18.88
5476,18.90
5477,18.91
5478,18.96
5479,19.01
5480,19.12
5481,19.26
5482,19.47
5483,19.69
5484,19.96
5485,20.23
5486,20.52
5487,20.79
5488,21.06
5489,21.27
5490,21.46
5491,21.59
5492,21.72
5493,21.81
5494,21.95
5495,22.12
5496,22.38
5497,22.71
5498,23.16
5499,23.65
5500,24.23
5501,24.86
5502,25.55
5503,26.23
5504,26.91
5505,27.51
5506,28.10
5507,28.62
5508,29.14
5509,29.59
5510,30.05
5511,30.48
5512,30.95
5513,31.42
5514,31.90
5515,32.32
5516,32.72
5517,33.07
5518,33.39
5519,33.66
5520,33.90
5521,34.10
5522,34.30
5523,34.46
5524,34.59
5525,34.65
5526,34.62
5527,34.49
5528,34.27
5529,33.97
5530,33.62
5531,33.25
5532,32.90
5533,32.61
5534,32.39
5535,32.23
5536,32.08
5537,31.92
5538,31.75
5539,31.59
5540,31.41
5541,31.29
5542,31.19
5543,31.18
5544,31.19
5545,31.22
5546,31.18
5547,31.04
5548,30.74
5549,30.31
5550,29.74
5551,29.11
5552,28.45
5553,27.84
5554,27.34
5555,27.00
5556,26.80
5557,26.77
5558,26.81
5559,26.91
5560,26.96
5561,26.97
5562,26.86
5563,26.65
5564,26.30
5565,25.85
5566,25.33
5567,24.82
5568,24.32
5569,23.91
5570,23.55
5571,23.28
5572,23.00
5573,22.74
5574,22.40
5575,22.00
5576,21.47
5577,20.88
5578,20.22
5579,19.59
5580,18.96
5581,18.42
5582,17.90
5583,17.47
5584,17.02
5585,16.61
5586,16.11
5587,15.60
5588,14.97
5589,14.32
5590,13.57
5591,12.81
5592,12.01
5593,11.28
5594,10.53
5595,9.88
5596,9.24
5597,8.68
5598,8.09
5599,7.52
5600,6.88
5601,6.25
5602,5.53
5603,4.82
5604,4.09
5605,3.42
5606,2.78
5607,2.27
5608,1.83
5609,1.52
5610,1.25
5611,1.08
5612,0.97
5613,0.98
5614,1.04
5615,1.16
5616,1.27
5617,1.38
5618,1.43
5619,1.43
5620,1.36
5621,1.25
5622,1.11
5623,1.01
5624,0.98
5625,1.04
5626,1.21
5627,1.44
5628,1.72
5629,1.99
5630,2.23
5631,2.41
5632,2.52
5633,2.56
5634,2.60
5635,2.62
5636,2.68
5637,2.75
5638,2.89
5639,3.06
5640,3.30
5641,3.55
5642,3.87
5643,4.22
5644,4.64
5645,5.10
5646,5.62
5647,6.12
5648,6.63
5649,7.09
5650,7.54
5651,7.93
5652,8.27
5653,8.55
5654,8.80
5655,9.03
5656,9.25
5657,9.43
5658,9.58
5659,9.65
5660,9.65
5661,9.58
5662,9.46
5663,9.31
5664,9.17
5665,9.06
5666,8.99
5667,8.93
5668,8.86
5669,8.76
5670,8.59
5671,8.36
5672,8.03
5673,7.68
5674,7.33
5675,7.04
5676,6.79
5677,6.61
5678,6.47
5679,6.35
5680,6.20
5681,6.00
5682,5.73
5683,5.44
5684,5.12
5685,4.81
5686,4.48
5687,4.20
5688,3.89
5689,3.58
5690,3.19
5691,2.74
5692,2.20
5693,1.63
5694,1.03
5695,0.48
5696,0.00
5697,-0.36
5698,-0.64
5699,-0.81
5700,-0.93
5701,-1.01
5702,-1.08
5703,-1.13
5704,-1.14
5705,-1.11
5706,-1.05
5707,-0.96
5708,-0.86
5709,-0.75
5710,-0.63
5711,-0.52
5712,-0.41
5713,-0.29
5714,-0.09
5715,0.19
5716,0.55
5717,0.95
5718,1.37
5719,1.74
5720,2.07
5721,2.32
5722,2.52
5723,2.68
5724,2.88
5725,3.11
5726,3.41
5727,3.72
5728,4.06
5729,4.38
5730,4.68
5731,4.91
5732,5.13
5733,5.31
5734,5.50
5735,5.69
5736,5.89
5737,6.07
5738,6.21
5739,6.28
5740,6.25
5741,6.12
5742,5.89
5743,5.62
5744,5.30
5745,5.00
5746,4.72
5747,4.46
5748,4.20
5749,3.97
5750,3.74
5751,3.54
5752,3.35
5753,3.20
5754,3.09
5755,3.04
5756,3.05
5757,3.08
5758,3.11
5759,3.13
5760,3.14
5761,3.17
5762,3.25
5763,3.38
5764,3.58
5765,3.87
5766,4.26
5767,4.72
5768,5.19
5769,5.63
5770,6.00
5771,6.26
5772,6.42
5773,6.49
5774,6.53
5775,6.53
5776,6.53
5777,6.52
5778,6.52
5779,6.52
5780,6.54
5781,6.52
5782,6.49
5783,6.47
5784,6.48
5785,6.56
5786,6.72
5787,6.95
5788,7.22
5789,7.51
5790,7.81
5791,8.07
5792,8.28
5793,8.42
5794,8.49
5795,8.50
5796,8.50
5797,8.49
5798,8.52
5799,8.58
5800,8.68
5801,8.80
5802,8.97
5803,9.15
5804,9.34
5805,9.52
5806,9.71
5807,9.91
5808,10.13
5809,10.35
5810,10.61
5811,10.86
5812,11.13
5813,11.37
5814,11.61
5815,11.81
5816,12.01
5817,12.22
5818,12.47
5819,12.73
5820,13.05
5821,13.37
5822,13.72
5823,14.07
5824,14.41
5825,14.69
5826,14.93
5827,15.08
5828,15.16
5829,15.17
5830,15.12
5831,15.02
5832,14.90
5833,14.79
5834,14.68
5835,14.57
5836,14.44
5837,14.31
5838,14.14
5839,13.95
5840,13.72
5841,13.49
5842,13.30
5843,13.20
5844,13.19
5845,13.30
5846,13.50
5847,13.76
5848,14.00
5849,14.20
5850,14.26
5851,14.21
5852,14.02
5853,13.78
5854,13.52
5855,13.29
5856,13.09
5857,12.94
5858,12.77
5859,12.58
5860,12.31
5861,11.94
5862,11.48
5863,10.99
5864,10.48
5865,10.03
5866,9.67
5867,9.44
5868,9.33
5869,9.34
5870,9.44
5871,9.59
5872,9.75
5873,9.92
5874,10.08
5875,10.24
5876,10.40
5877,10.56
5878,10.71
5879,10.86
5880,11.01
5881,11.17
5882,11.36
5883,11.56
5884,11.78
5885,11.97
5886,12.14
5887,12.26
5888,12.37
5889,12.45
5890,12.56
5891,12.70
5892,12.95
5893,13.30
5894,13.76
5895,14.27
5896,14.85
5897,15.40
5898,15.93
5899,16.36
5900,16.74
5901,17.06
5902,17.38
5903,17.68
5904,18.01
5905,18.34
5906,18.70
5907,19.03
5908,19.34
5909,19.58
5910,19.75
5911,19.82
5912,19.84
5913,19.80
5914,19.76
5915,19.70
5916,19.65
5917,19.60
5918,19.60
5919,19.63
5920,19.70
5921,19.82
5922,20.02
5923,20.28
5924,20.60
5925,20.93
5926,21.26
5927,21.52
5928,21.71
5929,21.80
5930,21.82
5931,21.79
5932,21.76
5933,21.75
5934,21.78
5935,21.86
5936,21.95
5937,22.02
5938,22.01
5939,21.90
5940,21.66
5941,21.32
5942,20.86
5943,20.36
5944,19.81
5945,19.29
5946,18.76
5947,18.27
5948,17.76
5949,17.28
5950,16.76
5951,16.25
5952,15.69
5953,15.13
5954,14.55
5955,14.02
5956,13.50
5957,13.06
5958,12.63
5959,12.27
5960,11.92
5961,11.62
5962,11.31
5963,11.02
5964,10.71
5965,10.46
5966,10.21
5967,10.00
5968,9.80
5969,9.66
5970,9.52
5971,9.41
5972,9.28
5973,9.15
5974,9.00
5975,8.86
5976,8.70
5977,8.57
5978,8.46
5979,8.40
5980,8.38
5981,8.41
5982,8.47
5983,8.54
5984,8.61
5985,8.66
5986,8.69
5987,8.70
5988,8.70
5989,8.69
5990,8.69
5991,8.71
5992,8.73
5993,8.76
5994,8.75
5995,8.66
5996,8.46
5997,8.15
5998,7.68
5999,7.10
6000,6.45
6001,5.80
6002,5.17
6003,4.62
6004,4.16
6005,3.81
6006,3.55
6007,3.38
6008,3.25
6009,3.18
6010,3.12
6011,3.10
6012,3.08
6013,3.07
6014,3.06
6015,3.08
6016,3.10
6017,3.15
6018,3.22
6019,3.31
6020,3.42
6021,3.53
6022,3.63
6023,3.73
6024,3.81
6025,3.87
6026,3.88
6027,3.87
6028,3.81
6029,3.74
6030,3.64
6031,3.54
6032,3.43
6033,3.34
6034,3.24
6035,3.17
6036,3.10
6037,3.05
6038,2.96
6039,2.85
6040,2.66
6041,2.40
6042,2.03
6043,1.62
6044,1.14
6045,0.70
6046,0.24
6047,-0.17
6048,-0.58
6049,-0.97
6050,-1.40
6051,-1.87
6052,-2.44
6053,-3.06
6054,-3.74
6055,-4.40
6056,-5.02
6057,-5.53
6058,-5.94
6059,-6.23
6060,-6.46
6061,-6.63
6062,-6.79
6063,-6.95
6064,-7.14
6065,-7.29
6066,-7.40
6067,-7.40
6068,-7.30
6069,-7.10
6070,-6.83
6071,-6.53
6072,-6.24
6073,-6.00
6074,-5.81
6075,-5.66
6076,-5.53
6077,-5.43
6078,-5.31
6079,-5.19
6080,-5.02
6081,-4.82
6082,-4.59
6083,-4.37
6084,-4.16
6085,-3.97
6086,-3.80
6087,-3.67
6088,-3.56
6089,-3.46
6090,-3.37
6091,-3.27
6092,-3.14
6093,-3.00
6094,-2.85
6095,-2.72
6096,-2.63
6097,-2.60
6098,-2.62
6099,-2.67
6100,-2.72
6101,-2.76
6102,-2.76
6103,-2.73
6104,-2.65
6105,-2.58
6106,-2.52
6107,-2.52
6108,-2.55
6109,-2.63
6110,-2.69
6111,-2.72
6112,-2.60
6113,-2.34
6114,-1.88
6115,-1.29
6116,-0.56
6117,0.24
6118,1.06
6119,1.80
6120,2.46
6121,2.98
6122,3.41
6123,3.70
6124,3.93
6125,4.05
6126,4.12
6127,4.12
6128,4.11
6129,4.05
6130,3.96
6131,3.84
6132,3.71
6133,3.60
6134,3.53
6135,3.50
6136,3.53
6137,3.61
6138,3.74
6139,3.90
6140,4.07
6141,4.24
6142,4.42
6143,4.58
6144,4.76
6145,4.93
6146,5.15
6147,5.40
6148,5.71
6149,6.03
6150,6.38
6151,6.68
6152,6.99
6153,7.24
6154,7.51
6155,7.77
6156,8.13
6157,8.55
6158,9.11
6159,9.74
6160,10.47
6161,11.22
6162,12.01
6163,12.74
6164,13.45
6165,14.06
6166,14.59
6167,15.01
6168,15.36
6169,15.60
6170,15.77
6171,15.84
6172,15.84
6173,15.79
6174,15.71
6175,15.59
6176,15.43
6177,15.21
6178,14.94
6179,14.59
6180,14.19
6181,13.75
6182,13.32
6183,12.97
6184,12.73
6185,12.61
6186,12.63
6187,12.76
6188,12.97
6189,13.24
6190,13.52
6191,13.79
6192,14.04
6193,14.28
6194,14.52
6195,14.77
6196,15.04
6197,15.30
6198,15.53
6199,15.74
6200,15.88
6201,15.97
6202,15.94
6203,15.83
6204,15.59
6205,15.23
6206,14.71
6207,14.06
6208,13.29
6209,12.48
6210,11.61
6211,10.78
6212,9.99
6213,9.34
6214,8.75
6215,8.30
6216,7.87
6217,7.52
6218,7.14
6219,6.79
6220,6.39
6221,6.00
6222,5.51
6223,5.01
6224,4.41
6225,3.78
6226,3.04
6227,2.26
6228,1.36
6229,0.46
6230,-0.52
6231,-1.47
6232,-2.45
6233,-3.33
6234,-4.15
6235,-4.83
6236,-5.44
6237,-5.91
6238,-6.31
6239,-6.56
6240,-6.76
6241,-6.87
6242,-6.96
6243,-6.98
6244,-6.99
6245,-6.97
6246,-7.00
6247,-7.06
6248,-7.17
6249,-7.29
6250,-7.46
6251,-7.65
6252,-7.88
6253,-8.11
6254,-8.37
6255,-8.65
6256,-9.01
6257,-9.39
6258,-9.82
6259,-10.21
6260,-10.60
6261,-10.91
6262,-11.18
6263,-11.37
6264,-11.56
6265,-11.73
6266,-11.98
6267,-12.28
6268,-12.69
6269,-13.14
6270,-13.65
6271,-14.14
6272,-14.59
6273,-14.96
6274,-15.28
6275,-15.55
6276,-15.81
6277,-16.06
6278,-16.31
6279,-16.52
6280,-16.69
6281,-16.79
6282,-16.80
6283,-16.73
6284,-16.61
6285,-16.46
6286,-16.29
6287,-16.13
6288,-15.97
6289,-15.81
6290,-15.59
6291,-15.34
6292,-14.99
6293,-14.58
6294,-14.11
6295,-13.66
6296,-13.19
6297,-12.79
6298,-12.40
6299,-12.05
6300,-11.67
6301,-11.30
6302,-10.84
6303,-10.37
6304,-9.82
6305,-9.27
6306,-8.64
6307,-8.02
6308,-7.32
6309,-6.65
6310,-5.91
6311,-5.22
6312,-4.46
6313,-3.74
6314,-2.94
6315,-2.15
6316,-1.28
6317,-0.42
6318,0.54
6319,1.47
6320,2.49
6321,3.46
6322,4.48
6323,5.42
6324,6.40
6325,7.31
6326,8.32
6327,9.31
6328,10.45
6329,11.56
6330,12.77
6331,13.88
6332,15.02
6333,16.02
6334,17.03
6335,17.93
6336,18.88
6337,19.77
6338,20.79
6339,21.81
6340,22.96
6341,24.07
6342,25.20
6343,26.20
6344,27.12
6345,27.85
6346,28.50
6347,28.99
6348,29.43
6349,29.79
6350,30.17
6351,30.54
6352,30.97
6353,31.40
6354,31.86
6355,32.28
6356,32.68
6357,32.99
6358,33.25
6359,33.40
6360,33.50
6361,33.50
6362,33.47
6363,33.41
6364,33.36
6365,33.35
6366,33.42
6367,33.56
6368,33.77
6369,34.02
6370,34.27
6371,34.48
6372,34.59
6373,34.61
6374,34.50
6375,34.32
6376,34.07
6377,33.80
6378,33.50
6379,33.18
6380,32.80
6381,32.39
6382,31.91
6383,31.39
6384,30.80
6385,30.23
6386,29.68
6387,29.24
6388,28.88
6389,28.64
6390,28.39
6391,28.16
6392,27.84
6393,27.45
6394,26.93
6395,26.35
6396,25.70
6397,25.11
6398,24.57
6399,24.16
6400,23.82
6401,23.53
6402,23.18
6403,22.78
6404,22.25
6405,21.66
6406,20.98
6407,20.31
6408,19.64
6409,19.10
6410,18.61
6411,18.24
6412,17.87
6413,17.54
6414,17.11
6415,16.66
6416,16.07
6417,15.45
6418,14.72
6419,13.98
6420,13.17
6421,12.37
6422,11.49
6423,10.61
6424,9.70
6425,8.85
6426,8.03
6427,7.33
6428,6.70
6429,6.25
6430,5.87
6431,5.59
6432,5.31
6433,5.04
6434,4.72
6435,4.37
6436,3.98
6437,3.63
6438,3.37
6439,3.23
6440,3.28
6441,3.51
6442,3.91
6443,4.43
6444,5.03
6445,5.62
6446,6.18
6447,6.64
6448,7.00
6449,7.26
6450,7.46
6451,7.64
6452,7.84
6453,8.09
6454,8.44
6455,8.84
6456,9.30
6457,9.70
6458,10.01
6459,10.18
6460,10.23
6461,10.11
6462,9.88
6463,9.58
6464,9.30
6465,9.11
6466,9.08
6467,9.21
6468,9.50
6469,9.87
6470,10.29
6471,10.68
6472,11.00
6473,11.24
6474,11.40
6475,11.48
6476,11.55
6477,11.62
6478,11.77
6479,11.98
6480,12.25
6481,12.52
6482,12.78
6483,13.00
6484,13.19
6485,13.33
6486,13.47
6487,13.60
6488,13.79
6489,14.03
6490,14.34
6491,14.67
6492,15.01
6493,15.27
6494,15.44
6495,15.51
6496,15.49
6497,15.39
6498,15.23
6499,15.04
6500,14.88
6501,14.79
6502,14.76
6503,14.77
6504,14.82
6505,14.89
6506,14.97
6507,15.03
6508,15.09
6509,15.12
6510,15.18
6511,15.26
6512,15.42
6513,15.62
6514,15.88
6515,16.18
6516,16.56
6517,16.96
6518,17.42
6519,17.88
6520,18.38
6521,18.89
6522,19.46
6523,20.06
6524,20.71
6525,21.37
6526,22.06
6527,22.74
6528,23.37
6529,23.90
6530,24.28
6531,24.48
6532,24.50
6533,24.33
6534,24.02
6535,23.60
6536,23.14
6537,22.68
6538,22.25
6539,21.88
6540,21.56
6541,21.26
6542,20.94
6543,20.58
6544,20.18
6545,19.78
6546,19.40
6547,19.10
6548,18.89
6549,18.82
6550,18.88
6551,19.04
6552,19.24
6553,19.42
6554,19.53
6555,19.56
6556,19.51
6557,19.41
6558,19.25
6559,19.09
6560,18.94
6561,18.81
6562,18.68
6563,18.54
6564,18.38
6565,18.23
6566,18.08
6567,17.94
6568,17.85
6569,17.84
6570,17.91
6571,18.06
6572,18.25
6573,18.44
6574,18.56
6575,18.62
6576,18.55
6577,18.37
6578,18.08
6579,17.73
6580,17.32
6581,16.93
6582,16.53
6583,16.14
6584,15.74
6585,15.34
6586,14.87
6587,14.38
6588,13.83
6589,13.27
6590,12.64
6591,12.02
6592,11.33
6593,10.67
6594,9.95
6595,9.24
6596,8.45
6597,7.67
6598,6.82
6599,6.03
6600,5.20
6601,4.45
6602,3.67
6603,2.95
6604,2.22
6605,1.54
6606,0.84
6607,0.20
6608,-0.44
6609,-1.00
6610,-1.56
6611,-2.02
6612,-2.45
6613,-2.78
6614,-3.06
6615,-3.26
6616,-3.45
6617,-3.61
6618,-3.80
6619,-4.00
6620,-4.26
6621,-4.57
6622,-4.93
6623,-5.31
6624,-5.69
6625,-6.02
6626,-6.28
6627,-6.42
6628,-6.42
6629,-6.28
6630,-6.03
6631,-5.70
6632,-5.34
6633,-5.00
6634,-4.71
6635,-4.52
6636,-4.41
6637,-4.38
6638,-4.34
6639,-4.27
6640,-4.08
6641,-3.78
6642,-3.29
6643,-2.69
6644,-1.98
6645,-1.27
6646,-0.56
6647,0.05
6648,0.62
6649,1.08
6650,1.52
6651,1.89
6652,2.29
6653,2.69
6654,3.17
6655,3.65
6656,4.20
6657,4.72
6658,5.26
6659,5.76
6660,6.28
6661,6.77
6662,7.30
6663,7.84
6664,8.45
6665,9.07
6666,9.74
6667,10.36
6668,10.96
6669,11.45
6670,11.87
6671,12.13
6672,12.33
6673,12.42
6674,12.54
6675,12.66
6676,12.88
6677,13.17
6678,13.57
6679,14.03
6680,14.56
6681,15.08
6682,15.63
6683,16.14
6684,16.67
6685,17.21
6686,17.82
6687,18.45
6688,19.16
6689,19.84
6690,20.51
6691,21.08
6692,21.60
6693,22.03
6694,22.46
6695,22.89
6696,23.41
6697,24.01
6698,24.74
6699,25.53
6700,26.35
6701,27.10
6702,27.73
6703,28.19
6704,28.47
6705,28.56
6706,28.48
6707,28.24
6708,27.89
6709,27.49
6710,27.04
6711,26.59
6712,26.14
6713,25.72
6714,25.34
6715,25.00
6716,24.63
6717,24.26
6718,23.81
6719,23.29
6720,22.64
6721,21.93
6722,21.15
6723,20.44
6724,19.78
6725,19.25
6726,18.81
6727,18.51
6728,18.25
6729,18.03
6730,17.75
6731,17.44
6732,17.06
6733,16.70
6734,16.31
6735,16.00
6736,15.72
6737,15.54
6738,15.39
6739,15.29
6740,15.17
6741,15.03
6742,14.79
6743,14.49
6744,14.10
6745,13.65
6746,13.14
6747,12.62
6748,12.11
6749,11.65
6750,11.27
6751,11.02
6752,10.88
6753,10.87
6754,10.96
6755,11.10
6756,11.23
6757,11.33
6758,11.35
6759,11.30
6760,11.19
6761,11.04
6762,10.87
6763,10.73
6764,10.64
6765,10.58
6766,10.57
6767,10.59
6768,10.68
6769,10.86
6770,11.13
6771,11.49
6772,11.92
6773,12.38
6774,12.84
6775,13.21
6776,13.46
6777,13.56
6778,13.54
6779,13.43
6780,13.29
6781,13.16
6782,13.10
6783,13.14
6784,13.25
6785,13.42
6786,13.58
6787,13.71
6788,13.77
6789,13.74
6790,13.59
6791,13.35
6792,12.96
6793,12.49
6794,11.90
6795,11.26
6796,10.54
6797,9.85
6798,9.15
6799,8.51
6800,7.84
6801,7.19
6802,6.50
6803,5.81
6804,5.04
6805,4.28
6806,3.49
6807,2.82
6808,2.24
6809,1.85
6810,1.59
6811,1.49
6812,1.44
6813,1.42
6814,1.35
6815,1.22
6816,1.02
6817,0.79
6818,0.55
6819,0.36
6820,0.23
6821,0.20
6822,0.21
6823,0.24
6824,0.24
6825,0.19
6826,0.08
6827,-0.09
6828,-0.31
6829,-0.54
6830,-0.74
6831,-0.87
6832,-0.91
6833,-0.87
6834,-0.78
6835,-0.67
6836,-0.54
6837,-0.42
6838,-0.30
6839,-0.20
6840,-0.07
6841,0.09
6842,0.34
6843,0.67
6844,1.13
6845,1.65
6846,2.24
6847,2.82
6848,3.42
6849,3.97
6850,4.53
6851,5.02
6852,5.52
6853,6.00
6854,6.53
6855,7.07
6856,7.68
6857,8.28
6858,8.90
6859,9.43
6860,9.90
6861,10.22
6862,10.46
6863,10.60
6864,10.72
6865,10.82
6866,10.98
6867,11.18
6868,11.47
6869,11.79
6870,12.16
6871,12.52
6872,12.88
6873,13.17
6874,13.41
6875,13.57
6876,13.68
6877,13.75
6878,13.81
6879,13.87
6880,13.96
6881,14.07
6882,14.23
6883,14.41
6884,14.63
6885,14.85
6886,15.08
6887,15.27
6888,15.44
6889,15.57
6890,15.68
6891,15.77
6892,15.86
6893,15.92
6894,15.99
6895,16.05
6896,16.11
6897,16.17
6898,16.27
6899,16.38
6900,16.52
6901,16.67
6902,16.84
6903,17.02
6904,17.21
6905,17.40
6906,17.61
6907,17.82
6908,18.04
6909,18.25
6910,18.45
6911,18.62
6912,18.75
6913,18.82
6914,18.82
6915,18.75
6916,18.59
6917,18.40
6918,18.17
6919,17.94
6920,17.69
6921,17.41
6922,17.07
6923,16.70
6924,16.29
6925,15.88
6926,15.48
6927,15.12
6928,14.78
6929,14.52
6930,14.30
6931,14.14
6932,14.01
6933,13.91
6934,13.81
6935,13.74
6936,13.68
6937,13.67
6938,13.72
6939,13.82
6940,13.96
6941,14.12
6942,14.29
6943,14.43
6944,14.57
6945,14.68
6946,14.78
6947,14.88
6948,14.99
6949,15.09
6950,15.21
6951,15.33
6952,15.46
6953,15.59
6954,15.73
6955,15.89
6956,16.04
6957,16.18
6958,16.28
6959,16.32
6960,16.26
6961,16.09
6962,15.78
6963,15.36
6964,14.84
6965,14.27
6966,13.67
6967,13.11
6968,12.59
6969,12.17
6970,11.83
6971,11.59
6972,11.39
6973,11.26
6974,11.13
6975,11.01
6976,10.85
6977,10.70
6978,10.52
6979,10.35
6980,10.19
6981,10.03
6982,9.88
6983,9.75
6984,9.63
6985,9.55
6986,9.46
6987,9.39
6988,9.32
6989,9.29
6990,9.27
6991,9.27
6992,9.26
6993,9.24
6994,9.19
6995,9.12
6996,9.01
6997,8.88
6998,8.72
6999,8.58
7000,8.44
7001,8.34
7002,8.28
7003,8.25
7004,8.25
7005,8.27
7006,8.32
7007,8.39
7008,8.49
7009,8.62
7010,8.76
7011,8.91
7012,9.10
7013,9.32
7014,9.56
7015,9.79
7016,10.01
7017,10.17
7018,10.27
7019,10.28
7020,10.20
7021,10.03
7022,9.81
7023,9.54
7024,9.30
7025,9.09
7026,8.94
7027,8.82
7028,8.72
7029,8.65
7030,8.55
7031,8.43
7032,8.28
7033,8.12
7034,7.97
7035,7.85
7036,7.79
7037,7.79
7038,7.87
7039,8.01
7040,8.19
7041,8.38
7042,8.56
7043,8.72
7044,8.88
7045,9.01
7046,9.12
7047,9.22
7048,9.32
7049,9.42
7050,9.52
7051,9.60
7052,9.67
7053,9.70
7054,9.73
7055,9.75
7056,9.79
7057,9.86
7058,10.00
7059,10.16
7060,10.35
7061,10.51
7062,10.66
7063,10.77
7064,10.84
7065,10.85
7066,10.87
7067,10.92
7068,11.07
7069,11.32
7070,11.72
7071,12.24
7072,12.88
7073,13.56
7074,14.26
7075,14.90
7076,15.44
7077,15.83
7078,16.08
7079,16.17
7080,16.13
7081,15.99
7082,15.81
7083,15.60
7084,15.46
7085,15.38
7086,15.41
7087,15.52
7088,15.71
7089,15.97
7090,16.31
7091,16.68
7092,17.07
7093,17.45
7094,17.80
7095,18.13
7096,18.42
7097,18.66
7098,18.85
7099,18.99
7100,19.09
7101,19.12
7102,19.09
7103,19.02
7104,18.93
7105,18.82
7106,18.74
7107,18.69
7108,18.70
7109,18.80
7110,18.95
7111,19.13
7112,19.29
7113,19.39
7114,19.41
7115,19.33
7116,19.12
7117,18.84
7118,18.48
7119,18.14
7120,17.79
7121,17.51
7122,17.25
7123,17.05
7124,16.83
7125,16.60
7126,16.30
7127,15.94
7128,15.46
7129,14.91
7130,14.28
7131,13.63
7132,12.96
7133,12.39
7134,11.89
7135,11.54
7136,11.28
7137,11.15
7138,11.07
7139,11.04
7140,10.96
7141,10.84
7142,10.64
7143,10.39
7144,10.07
7145,9.76
7146,9.44
7147,9.17
7148,8.91
7149,8.67
7150,8.38
7151,8.06
7152,7.65
7153,7.19
7154,6.67
7155,6.14
7156,5.64
7157,5.23
7158,4.93
7159,4.77
7160,4.72
7161,4.79
7162,4.91
7163,5.04
7164,5.14
7165,5.19
7166,5.15
7167,5.05
7168,4.90
7169,4.75
7170,4.61
7171,4.49
7172,4.38
7173,4.29
7174,4.23
7175,4.19
7176,4.15
7177,4.13
7178,4.13
7179,4.17
7180,4.23
7181,4.30
7182,4.35
7183,4.35
7184,4.30
7185,4.19
7186,4.05
7187,3.89
7188,3.72
7189,3.58
7190,3.46
7191,3.37
7192,3.32
7193,3.03
7194,3.21
7195,3.85
7196,4.20
7197,2.91
7198,1.66
7199,4.31
7200,7.85
