1,36.40
2,50.00
3,50.00
4,43.26
5,13.81
6,-20.31
7,-42.95
8,-44.89
9,-36.18
10,-34.94
11,-43.04
12,-47.01
13,-40.57
14,-33.71
15,-35.14
16,-40.27
17,-39.46
18,-33.61
19,-29.97
20,-31.59
21,-34.04
22,-32.92
23,-29.67
24,-28.30
25,-29.65
26,-30.61
27,-29.37
28,-27.56
29,-27.28
30,-27.91
31,-27.89
32,-27.06
33,-26.58
34,-26.82
35,-27.39
36,-27.61
37,-27.53
38,-27.25
39,-27.02
40,-26.55
41,-25.72
42,-24.26
43,-22.23
44,-19.62
45,-16.61
46,-13.37
47,-10.16
48,-7.22
49,-4.78
50,-3.12
51,-2.47
52,-3.06
53,-4.89
54,-7.77
55,-11.32
56,-15.16
57,-18.90
58,-22.35
59,-25.29
60,-27.64
61,-29.30
62,-30.35
63,-30.77
64,-30.77
65,-30.33
66,-29.64
67,-28.70
68,-27.67
69,-26.57
70,-25.46
71,-24.39
72,-23.40
73,-22.54
74,-21.75
75,-21.06
76,-20.39
77,-19.83
78,-19.33
79,-18.97
80,-18.63
81,-18.36
82,-18.10
83,-17.92
84,-17.75
85,-17.60
86,-17.41
87,-17.24
88,-17.07
89,-16.95
90,-16.84
91,-16.76
92,-16.66
93,-16.59
94,-16.53
95,-16.49
96,-16.47
97,-16.46
98,-16.44
99,-16.43
100,-16.39
101,-16.34
102,-16.27
103,-16.20
104,-16.14
105,-16.08
106,-16.04
107,-16.01
108,-15.97
109,-15.92
110,-15.84
111,-15.75
112,-15.65
113,-15.58
114,-15.51
115,-15.47
116,-15.43
117,-15.40
118,-15.35
119,-15.28
120,-15.17
121,-15.05
122,-14.94
123,-14.87
124,-14.83
125,-14.81
126,-14.78
127,-14.74
128,-14.67
129,-14.59
130,-14.50
131,-14.43
132,-14.38
133,-14.34
134,-14.30
135,-14.26
136,-14.18
137,-14.09
138,-13.99
139,-13.92
140,-13.88
141,-13.86
142,-13.81
143,-13.75
144,-13.67
145,-13.59
146,-13.52
147,-13.44
148,-13.35
149,-13.28
150,-13.21
151,-13.17
152,-13.14
153,-13.12
154,-13.08
155,-13.02
156,-12.94
157,-12.86
158,-12.80
159,-12.76
160,-12.72
161,-12.69
162,-12.65
163,-12.62
164,-12.58
165,-12.53
166,-12.47
167,-12.40
168,-12.34
169,-12.29
170,-12.26
171,-12.23
172,-12.20
173,-12.15
174,-12.10
175,-12.04
176,-11.99
177,-11.94
178,-11.89
179,-11.83
180,-11.78
181,-11.76
182,-11.73
183,-11.69
184,-11.64
185,-11.59
186,-11.54
187,-11.50
188,-11.46
189,-11.41
190,-11.35
191,-11.27
192,-11.21
193,-11.18
194,-11.19
195,-11.20
196,-11.19
197,-11.13
198,-11.03
199,-10.94
200,-10.87
201,-10.83
202,-10.80
203,-10.77
204,-10.76
205,-10.73
206,-10.68
207,-10.64
208,-10.64
209,-10.65
210,-10.52
211,-10.13
212,-9.69
213,-9.66
214,-10.04
215,-10.26
216,-10.02
217,-9.92
218,-10.44
219,-10.86
220,-10.27
221,-9.29
222,-9.38
223,-10.62
224,-11.11
225,-9.65
226,-8.21
227,-9.54
228,-12.08
229,-11.24
230,-6.91
231,-6.66
232,-12.60
233,-15.51
234,-7.90
235,0.05
236,-7.05
237,-24.31
238,-28.28
239,-5.97
240,27.20
241,47.31
242,49.73
243,49.39
244,50.00
245,50.00
246,34.82
247,-4.33
248,-39.26
249,-50.00
250,-41.25
251,-33.63
252,-38.35
253,-46.00
254,-44.16
255,-35.40
256,-32.48
257,-37.65
258,-41.44
259,-37.04
260,-30.82
261,-30.15
262,-33.37
263,-34.11
264,-31.12
265,-28.56
266,-28.89
267,-30.35
268,-30.15
269,-28.45
270,-27.28
271,-27.60
272,-28.03
273,-27.54
274,-26.68
275,-26.62
276,-27.15
277,-27.60
278,-27.56
279,-27.41
280,-27.18
281,-26.89
282,-26.19
283,-25.07
284,-23.33
285,-21.04
286,-18.23
287,-15.08
288,-11.80
289,-8.67
290,-5.94
291,-3.86
292,-2.71
293,-2.69
294,-3.89
295,-6.24
296,-9.47
297,-13.19
298,-17.03
299,-20.67
300,-23.90
301,-26.55
302,-28.58
303,-29.92
304,-30.66
305,-30.82
306,-30.60
307,-30.02
308,-29.22
309,-28.20
310,-27.11
311,-25.99
312,-24.92
313,-23.93
314,-23.00
315,-22.17
316,-21.38
317,-20.70
318,-20.08
319,-19.58
320,-19.14
321,-18.81
322,-18.50
323,-18.27
324,-18.04
325,-17.86
326,-17.66
327,-17.47
328,-17.29
329,-17.16
330,-17.05
331,-16.97
332,-16.85
333,-16.73
334,-16.63
335,-16.57
336,-16.53
337,-16.49
338,-16.44
339,-16.43
340,-16.44
341,-16.45
342,-16.40
343,-16.33
344,-16.23
345,-16.17
346,-16.13
347,-16.11
348,-16.06
349,-16.01
350,-15.94
351,-15.88
352,-15.81
353,-15.73
354,-15.64
355,-15.56
356,-15.48
357,-15.43
358,-15.41
359,-15.40
360,-15.34
361,-15.24
362,-15.11
363,-15.01
364,-14.92
365,-14.87
366,-14.82
367,-14.79
368,-14.77
369,-14.73
370,-14.65
371,-14.56
372,-14.47
373,-14.41
374,-14.38
375,-14.36
376,-14.29
377,-14.20
378,-14.10
379,-14.03
380,-13.99
381,-13.95
382,-13.89
383,-13.82
384,-13.76
385,-13.72
386,-13.67
387,-13.59
388,-13.48
389,-13.37
390,-13.29
391,-13.25
392,-13.23
393,-13.20
394,-13.17
395,-13.12
396,-13.05
397,-12.96
398,-12.88
399,-12.82
400,-12.79
401,-12.78
402,-12.74
403,-12.69
404,-12.64
405,-12.60
406,-12.56
407,-12.51
408,-12.45
409,-12.39
410,-12.34
411,-12.29
412,-12.24
413,-12.20
414,-12.16
415,-12.13
416,-12.10
417,-12.05
418,-11.98
419,-11.90
420,-11.84
421,-11.81
422,-11.81
423,-11.80
424,-11.76
425,-11.69
426,-11.62
427,-11.57
428,-11.52
429,-11.49
430,-11.43
431,-11.37
432,-11.31
433,-11.26
434,-11.24
435,-11.22
436,-11.20
437,-11.18
438,-11.14
439,-11.09
440,-11.01
441,-10.93
442,-10.85
443,-10.79
444,-10.77
445,-10.78
446,-10.79
447,-10.74
448,-10.65
449,-10.62
450,-10.67
451,-10.62
452,-10.32
453,-9.87
454,-9.65
455,-9.87
456,-10.22
457,-10.21
458,-9.95
459,-10.12
460,-10.72
461,-10.74
462,-9.74
463,-9.09
464,-9.95
465,-11.10
466,-10.52
467,-8.68
468,-8.51
469,-10.99
470,-12.38
471,-9.49
472,-5.58
473,-8.46
474,-15.64
475,-14.62
476,-2.54
477,2.33
478,-14.44
479,-35.21
480,-27.94
481,11.07
482,48.52
483,50.00
484,45.42
485,45.29
486,50.00
487,50.00
488,24.57
489,-26.32
490,-50.00
491,-50.00
492,-36.07
493,-33.87
494,-43.78
495,-47.93
496,-40.55
497,-32.52
498,-34.01
499,-39.88
500,-40.25
501,-33.88
502,-29.54
503,-31.44
504,-34.39
505,-33.07
506,-29.42
507,-28.29
508,-29.74
509,-30.52
510,-29.24
511,-27.67
512,-27.37
513,-27.92
514,-27.87
515,-27.06
516,-26.44
517,-26.78
518,-27.43
519,-27.74
520,-27.52
521,-27.29
522,-27.02
523,-26.59
524,-25.67
525,-24.29
526,-22.30
527,-19.75
528,-16.72
529,-13.46
530,-10.22
531,-7.26
532,-4.82
533,-3.16
534,-2.55
535,-3.14
536,-4.95
537,-7.77
538,-11.28
539,-15.09
540,-18.87
541,-22.33
542,-25.29
543,-27.59
544,-29.28
545,-30.31
546,-30.81
547,-30.77
548,-30.36
549,-29.61
550,-28.70
551,-27.65
552,-26.56
553,-25.46
554,-24.41
555,-23.47
556,-22.59
557,-21.80
558,-21.04
559,-20.39
560,-19.80
561,-19.36
562,-18.97
563,-18.66
564,-18.37
565,-18.14
566,-17.94
567,-17.78
568,-17.59
569,-17.41
570,-17.22
571,-17.09
572,-16.98
573,-16.89
574,-16.78
575,-16.67
576,-16.59
577,-16.55
578,-16.52
579,-16.50
580,-16.47
581,-16.46
582,-16.45
583,-16.41
584,-16.33
585,-16.24
586,-16.18
587,-16.14
588,-16.11
589,-16.09
590,-16.05
591,-16.01
592,-15.94
593,-15.85
594,-15.75
595,-15.66
596,-15.61
597,-15.57
598,-15.50
599,-15.42
600,-15.35
601,-15.32
602,-15.30
603,-15.23
604,-15.10
605,-14.98
606,-14.90
607,-14.86
608,-14.83
609,-14.78
610,-14.71
611,-14.66
612,-14.60
613,-14.54
614,-14.46
615,-14.40
616,-14.37
617,-14.34
618,-14.27
619,-14.17
620,-14.05
621,-13.99
622,-13.96
623,-13.95
624,-13.90
625,-13.82
626,-13.74
627,-13.68
628,-13.62
629,-13.55
630,-13.46
631,-13.35
632,-13.25
633,-13.19
634,-13.17
635,-13.19
636,-13.17
637,-13.11
638,-13.00
639,-12.91
640,-12.85
641,-12.83
642,-12.81
643,-12.76
644,-12.70
645,-12.65
646,-12.62
647,-12.59
648,-12.54
649,-12.47
650,-12.40
651,-12.36
652,-12.34
653,-12.31
654,-12.25
655,-12.18
656,-12.12
657,-12.08
658,-12.05
659,-12.01
660,-11.94
661,-11.86
662,-11.81
663,-11.80
664,-11.80
665,-11.79
666,-11.73
667,-11.67
668,-11.61
669,-11.56
670,-11.49
671,-11.42
672,-11.35
673,-11.31
674,-11.28
675,-11.26
676,-11.24
677,-11.22
678,-11.20
679,-11.18
680,-11.12
681,-11.04
682,-10.95
683,-10.87
684,-10.82
685,-10.79
686,-10.78
687,-10.78
688,-10.77
689,-10.68
690,-10.58
691,-10.59
692,-10.67
693,-10.54
694,-10.08
695,-9.67
696,-9.71
697,-10.09
698,-10.25
699,-10.03
700,-9.94
701,-10.39
702,-10.84
703,-10.37
704,-9.32
705,-9.33
706,-10.64
707,-11.14
708,-9.59
709,-8.16
710,-9.49
711,-12.03
712,-11.34
713,-7.61
714,-6.22
715,-11.28
716,-16.04
717,-10.85
718,0.08
719,-1.61
720,-21.53
721,-35.60
722,-17.28
723,25.83
724,50.00
725,50.00
726,47.45
727,46.35
728,50.00
729,39.33
730,2.30
731,-35.95
732,-50.00
733,-42.04
734,-34.34
735,-39.33
736,-47.23
737,-45.18
738,-36.70
739,-33.15
740,-37.36
741,-40.46
742,-37.14
743,-31.28
744,-30.03
745,-33.00
746,-34.19
747,-31.35
748,-28.40
749,-28.79
750,-30.44
751,-30.16
752,-28.27
753,-27.27
754,-27.63
755,-28.01
756,-27.48
757,-26.71
758,-26.53
759,-27.09
760,-27.58
761,-27.67
762,-27.37
763,-27.16
764,-26.84
765,-26.24
766,-25.04
767,-23.34
768,-21.05
769,-18.29
770,-15.15
771,-11.88
772,-8.74
773,-5.98
774,-3.87
775,-2.69
776,-2.67
777,-3.88
778,-6.24
779,-9.45
780,-13.15
781,-16.96
782,-20.60
783,-23.83
784,-26.50
785,-28.50
786,-29.87
787,-30.60
788,-30.84
789,-30.59
790,-30.02
791,-29.16
792,-28.18
793,-27.09
794,-25.99
795,-24.91
796,-23.89
797,-22.99
798,-22.16
799,-21.42
800,-20.72
801,-20.12
802,-19.56
803,-19.14
804,-18.77
805,-18.50
806,-18.24
807,-18.05
808,-17.85
809,-17.68
810,-17.48
811,-17.31
812,-17.16
813,-17.04
814,-16.92
815,-16.82
816,-16.71
817,-16.62
818,-16.56
819,-16.53
820,-16.50
821,-16.48
822,-16.47
823,-16.46
824,-16.43
825,-16.38
826,-16.30
827,-16.22
828,-16.15
829,-16.11
830,-16.08
831,-16.05
832,-16.00
833,-15.94
834,-15.88
835,-15.82
836,-15.74
837,-15.66
838,-15.58
839,-15.52
840,-15.48
841,-15.44
842,-15.39
843,-15.32
844,-15.23
845,-15.12
846,-15.00
847,-14.91
848,-14.85
849,-14.83
850,-14.81
851,-14.77
852,-14.70
853,-14.63
854,-14.56
855,-14.49
856,-14.41
857,-14.36
858,-14.33
859,-14.31
860,-14.24
861,-14.13
862,-14.02
863,-13.96
864,-13.94
865,-13.93
866,-13.89
867,-13.81
868,-13.72
869,-13.63
870,-13.55
871,-13.48
872,-13.39
873,-13.30
874,-13.22
875,-13.18
876,-13.16
877,-13.16
878,-13.14
879,-13.08
880,-12.97
881,-12.87
882,-12.81
883,-12.79
884,-12.78
885,-12.73
886,-12.67
887,-12.61
888,-12.58
889,-12.56
890,-12.52
891,-12.46
892,-12.38
893,-12.33
894,-12.30
895,-12.27
896,-12.22
897,-12.16
898,-12.10
899,-12.06
900,-12.03
901,-11.98
902,-11.90
903,-11.83
904,-11.79
905,-11.78
906,-11.77
907,-11.73
908,-11.68
909,-11.63
910,-11.57
911,-11.51
912,-11.44
913,-11.39
914,-11.35
915,-11.31
916,-11.26
917,-11.22
918,-11.20
919,-11.22
920,-11.22
921,-11.17
922,-11.06
923,-10.94
924,-10.85
925,-10.83
926,-10.82
927,-10.81
928,-10.77
929,-10.75
930,-10.71
931,-10.66
932,-10.61
933,-10.63
934,-10.62
935,-10.33
936,-9.83
937,-9.59
938,-9.88
939,-10.24
940,-10.15
941,-9.89
942,-10.12
943,-10.69
944,-10.68
945,-9.79
946,-9.14
947,-9.89
948,-11.10
949,-10.61
950,-8.69
951,-8.50
952,-10.93
953,-12.14
954,-9.14
955,-6.48
956,-9.04
957,-14.00
958,-12.77
959,-5.20
960,-2.39
961,-12.16
962,-25.07
963,-21.48
964,4.47
965,36.54
966,50.00
967,50.00
968,50.00
969,50.00
970,43.80
971,17.64
972,-19.69
973,-44.59
974,-45.44
975,-35.55
976,-34.51
977,-43.14
978,-47.19
979,-40.55
980,-33.67
981,-35.10
982,-40.25
983,-39.44
984,-33.59
985,-29.95
986,-31.58
987,-34.02
988,-32.91
989,-29.65
990,-28.29
991,-29.64
992,-30.59
993,-29.35
994,-27.54
995,-27.27
996,-27.89
997,-27.87
998,-27.04
999,-26.55
1000,-26.79
1001,-27.37
1002,-27.59
1003,-27.52
1004,-27.24
1005,-27.01
1006,-26.55
1007,-25.74
1008,-24.30
1009,-22.30
1010,-19.71
1011,-16.73
1012,-13.50
1013,-10.29
1014,-7.34
1015,-4.90
1016,-3.21
1017,-2.54
1018,-3.10
1019,-4.89
1020,-7.74
1021,-11.27
1022,-15.09
1023,-18.83
1024,-22.27
1025,-25.22
1026,-27.57
1027,-29.24
1028,-30.29
1029,-30.73
1030,-30.73
1031,-30.31
1032,-29.62
1033,-28.69
1034,-27.67
1035,-26.57
1036,-25.46
1037,-24.39
1038,-23.40
1039,-22.54
1040,-21.76
1041,-21.08
1042,-20.40
1043,-19.84
1044,-19.34
1045,-18.97
1046,-18.63
1047,-18.37
1048,-18.11
1049,-17.93
1050,-17.76
1051,-17.60
1052,-17.41
1053,-17.24
1054,-17.08
1055,-16.96
1056,-16.86
1057,-16.77
1058,-16.68
1059,-16.60
1060,-16.55
1061,-16.51
1062,-16.48
1063,-16.46
1064,-16.44
1065,-16.43
1066,-16.40
1067,-16.35
1068,-16.29
1069,-16.22
1070,-16.15
1071,-16.10
1072,-16.05
1073,-16.01
1074,-15.97
1075,-15.92
1076,-15.84
1077,-15.76
1078,-15.66
1079,-15.58
1080,-15.52
1081,-15.47
1082,-15.44
1083,-15.41
1084,-15.36
1085,-15.29
1086,-15.18
1087,-15.06
1088,-14.95
1089,-14.88
1090,-14.83
1091,-14.81
1092,-14.78
1093,-14.74
1094,-14.67
1095,-14.60
1096,-14.51
1097,-14.44
1098,-14.38
1099,-14.35
1100,-14.31
1101,-14.27
1102,-14.19
1103,-14.10
1104,-14.00
1105,-13.94
1106,-13.90
1107,-13.88
1108,-13.83
1109,-13.76
1110,-13.68
1111,-13.60
1112,-13.52
1113,-13.45
1114,-13.37
1115,-13.29
1116,-13.22
1117,-13.18
1118,-13.15
1119,-13.12
1120,-13.08
1121,-13.02
1122,-12.93
1123,-12.86
1124,-12.81
1125,-12.77
1126,-12.73
1127,-12.69
1128,-12.65
1129,-12.62
1130,-12.58
1131,-12.54
1132,-12.47
1133,-12.41
1134,-12.34
1135,-12.29
1136,-12.26
1137,-12.23
1138,-12.19
1139,-12.15
1140,-12.10
1141,-12.04
1142,-11.99
1143,-11.94
1144,-11.89
1145,-11.84
1146,-11.79
1147,-11.76
1148,-11.73
1149,-11.69
1150,-11.63
1151,-11.58
1152,-11.53
1153,-11.49
1154,-11.45
1155,-11.40
1156,-11.34
1157,-11.27
1158,-11.21
1159,-11.18
1160,-11.18
1161,-11.20
1162,-11.19
1163,-11.13
1164,-11.04
1165,-10.94
1166,-10.87
1167,-10.82
1168,-10.79
1169,-10.77
1170,-10.75
1171,-10.72
1172,-10.66
1173,-10.62
1174,-10.62
1175,-10.64
1176,-10.51
1177,-10.12
1178,-9.68
1179,-9.65
1180,-10.03
1181,-10.25
1182,-10.01
1183,-9.91
1184,-10.43
1185,-10.84
1186,-10.26
1187,-9.27
1188,-9.37
1189,-10.60
1190,-11.10
1191,-9.65
1192,-8.20
1193,-9.53
1194,-12.06
1195,-11.22
1196,-6.88
1197,-6.64
1198,-12.57
1199,-15.50
1200,-7.89
1201,0.07
1202,-7.03
1203,-24.28
1204,-28.26
1205,-5.96
1206,27.21
1207,47.31
1208,49.73
1209,49.39
1210,50.00
1211,50.00
1212,34.83
1213,-4.32
1214,-39.25
1215,-50.00
1216,-41.20
1217,-33.56
1218,-38.28
1219,-45.96
1220,-44.14
1221,-35.36
1222,-32.41
1223,-37.59
1224,-41.39
1225,-37.00
1226,-30.78
1227,-30.10
1228,-33.31
1229,-34.06
1230,-31.07
1231,-28.52
1232,-28.85
1233,-30.31
1234,-30.12
1235,-28.41
1236,-27.26
1237,-27.57
1238,-28.00
1239,-27.50
1240,-26.64
1241,-26.57
1242,-27.10
1243,-27.56
1244,-27.52
1245,-27.37
1246,-27.14
1247,-26.86
1248,-26.19
1249,-25.08
1250,-23.36
1251,-21.09
1252,-18.29
1253,-15.16
1254,-11.90
1255,-8.76
1256,-6.02
1257,-3.93
1258,-2.76
1259,-2.71
1260,-3.89
1261,-6.20
1262,-9.40
1263,-13.11
1264,-16.95
1265,-20.58
1266,-23.81
1267,-26.46
1268,-28.49
1269,-29.84
1270,-30.59
1271,-30.76
1272,-30.56
1273,-29.98
1274,-29.19
1275,-28.18
1276,-27.09
1277,-25.98
1278,-24.91
1279,-23.92
1280,-22.99
1281,-22.16
1282,-21.37
1283,-20.70
1284,-20.07
1285,-19.57
1286,-19.13
1287,-18.79
1288,-18.48
1289,-18.25
1290,-18.03
1291,-17.85
1292,-17.65
1293,-17.47
1294,-17.28
1295,-17.15
1296,-17.05
1297,-16.96
1298,-16.84
1299,-16.72
1300,-16.62
1301,-16.57
1302,-16.53
1303,-16.48
1304,-16.43
1305,-16.41
1306,-16.42
1307,-16.44
1308,-16.40
1309,-16.32
1310,-16.22
1311,-16.16
1312,-16.12
1313,-16.10
1314,-16.05
1315,-15.99
1316,-15.93
1317,-15.86
1318,-15.79
1319,-15.72
1320,-15.63
1321,-15.55
1322,-15.46
1323,-15.42
1324,-15.40
1325,-15.39
1326,-15.34
1327,-15.24
1328,-15.10
1329,-14.99
1330,-14.91
1331,-14.86
1332,-14.81
1333,-14.79
1334,-14.76
1335,-14.71
1336,-14.64
1337,-14.55
1338,-14.46
1339,-14.41
1340,-14.38
1341,-14.36
1342,-14.30
1343,-14.20
1344,-14.10
1345,-14.03
1346,-13.98
1347,-13.95
1348,-13.89
1349,-13.83
1350,-13.76
1351,-13.71
1352,-13.66
1353,-13.58
1354,-13.48
1355,-13.37
1356,-13.30
1357,-13.26
1358,-13.23
1359,-13.20
1360,-13.16
1361,-13.11
1362,-13.04
1363,-12.95
1364,-12.86
1365,-12.81
1366,-12.79
1367,-12.77
1368,-12.74
1369,-12.68
1370,-12.62
1371,-12.59
1372,-12.55
1373,-12.50
1374,-12.44
1375,-12.38
1376,-12.32
1377,-12.27
1378,-12.23
1379,-12.19
1380,-12.15
1381,-12.12
1382,-12.09
1383,-12.04
1384,-11.97
1385,-11.89
1386,-11.83
1387,-11.80
1388,-11.80
1389,-11.79
1390,-11.74
1391,-11.67
1392,-11.59
1393,-11.54
1394,-11.50
1395,-11.46
1396,-11.40
1397,-11.34
1398,-11.29
1399,-11.25
1400,-11.22
1401,-11.20
1402,-11.18
1403,-11.16
1404,-11.13
1405,-11.07
1406,-10.99
1407,-10.91
1408,-10.83
1409,-10.78
1410,-10.75
1411,-10.77
1412,-10.77
1413,-10.72
1414,-10.63
1415,-10.60
1416,-10.65
1417,-10.60
1418,-10.30
1419,-9.85
1420,-9.63
1421,-9.85
1422,-10.20
1423,-10.19
1424,-9.92
1425,-10.09
1426,-10.70
1427,-10.72
1428,-9.72
1429,-9.08
1430,-9.93
1431,-11.09
1432,-10.51
1433,-8.66
1434,-8.49
1435,-10.96
1436,-12.34
1437,-9.45
1438,-5.55
1439,-8.44
1440,-15.61
1441,-14.60
1442,-2.52
1443,2.36
1444,-14.41
1445,-35.19
1446,-27.93
1447,11.08
1448,48.52
1449,50.00
1450,45.42
1451,45.29
1452,50.00
1453,50.00
1454,24.58
1455,-26.32
1456,-50.00
1457,-50.00
1458,-36.00
1459,-33.80
1460,-43.73
1461,-47.90
1462,-40.50
1463,-32.46
1464,-33.95
1465,-39.82
1466,-40.20
1467,-33.83
1468,-29.49
1469,-31.38
1470,-34.34
1471,-33.02
1472,-29.38
1473,-28.26
1474,-29.70
1475,-30.48
1476,-29.20
1477,-27.64
1478,-27.34
1479,-27.88
1480,-27.82
1481,-27.01
1482,-26.39
1483,-26.73
1484,-27.39
1485,-27.70
1486,-27.48
1487,-27.25
1488,-26.98
1489,-26.56
1490,-25.66
1491,-24.29
1492,-22.31
1493,-19.78
1494,-16.77
1495,-13.52
1496,-10.30
1497,-7.33
1498,-4.88
1499,-3.20
1500,-2.57
1501,-3.14
1502,-4.94
1503,-7.73
1504,-11.22
1505,-15.01
1506,-18.78
1507,-22.24
1508,-25.20
1509,-27.51
1510,-29.21
1511,-30.24
1512,-30.74
1513,-30.71
1514,-30.32
1515,-29.58
1516,-28.68
1517,-27.63
1518,-26.54
1519,-25.44
1520,-24.39
1521,-23.45
1522,-22.57
1523,-21.79
1524,-21.03
1525,-20.38
1526,-19.79
1527,-19.34
1528,-18.95
1529,-18.65
1530,-18.36
1531,-18.14
1532,-17.93
1533,-17.77
1534,-17.58
1535,-17.40
1536,-17.21
1537,-17.08
1538,-16.97
1539,-16.87
1540,-16.76
1541,-16.66
1542,-16.58
1543,-16.54
1544,-16.51
1545,-16.48
1546,-16.46
1547,-16.45
1548,-16.44
1549,-16.40
1550,-16.32
1551,-16.23
1552,-16.16
1553,-16.12
1554,-16.09
1555,-16.07
1556,-16.03
1557,-15.99
1558,-15.93
1559,-15.84
1560,-15.74
1561,-15.65
1562,-15.60
1563,-15.56
1564,-15.49
1565,-15.41
1566,-15.34
1567,-15.31
1568,-15.28
1569,-15.21
1570,-15.08
1571,-14.96
1572,-14.88
1573,-14.85
1574,-14.82
1575,-14.77
1576,-14.70
1577,-14.65
1578,-14.59
1579,-14.52
1580,-14.44
1581,-14.39
1582,-14.36
1583,-14.34
1584,-14.27
1585,-14.16
1586,-14.04
1587,-13.97
1588,-13.95
1589,-13.94
1590,-13.89
1591,-13.81
1592,-13.73
1593,-13.66
1594,-13.61
1595,-13.54
1596,-13.45
1597,-13.34
1598,-13.24
1599,-13.18
1600,-13.17
1601,-13.17
1602,-13.15
1603,-13.08
1604,-12.98
1605,-12.89
1606,-12.83
1607,-12.81
1608,-12.80
1609,-12.75
1610,-12.69
1611,-12.63
1612,-12.59
1613,-12.57
1614,-12.52
1615,-12.46
1616,-12.39
1617,-12.34
1618,-12.32
1619,-12.29
1620,-12.23
1621,-12.17
1622,-12.11
1623,-12.07
1624,-12.04
1625,-12.00
1626,-11.93
1627,-11.85
1628,-11.80
1629,-11.79
1630,-11.79
1631,-11.77
1632,-11.72
1633,-11.65
1634,-11.58
1635,-11.53
1636,-11.47
1637,-11.40
1638,-11.33
1639,-11.28
1640,-11.25
1641,-11.24
1642,-11.22
1643,-11.20
1644,-11.18
1645,-11.15
1646,-11.10
1647,-11.02
1648,-10.93
1649,-10.86
1650,-10.81
1651,-10.78
1652,-10.76
1653,-10.77
1654,-10.75
1655,-10.67
1656,-10.57
1657,-10.58
1658,-10.65
1659,-10.52
1660,-10.06
1661,-9.64
1662,-9.69
1663,-10.07
1664,-10.23
1665,-10.02
1666,-9.92
1667,-10.36
1668,-10.81
1669,-10.34
1670,-9.31
1671,-9.31
1672,-10.62
1673,-11.13
1674,-9.58
1675,-8.15
1676,-9.47
1677,-12.01
1678,-11.31
1679,-7.59
1680,-6.20
1681,-11.26
1682,-16.02
1683,-10.83
1684,0.10
1685,-1.59
1686,-21.51
1687,-35.58
1688,-17.27
1689,25.84
1690,50.00
1691,50.00
1692,47.44
1693,46.35
1694,50.00
1695,39.35
1696,2.30
1697,-35.95
1698,-50.00
1699,-41.97
1700,-34.26
1701,-39.28
1702,-47.20
1703,-45.15
1704,-36.65
1705,-33.08
1706,-37.29
1707,-40.40
1708,-37.08
1709,-31.23
1710,-29.98
1711,-32.96
1712,-34.15
1713,-31.30
1714,-28.36
1715,-28.76
1716,-30.41
1717,-30.13
1718,-28.25
1719,-27.24
1720,-27.60
1721,-27.99
1722,-27.45
1723,-26.68
1724,-26.50
1725,-27.05
1726,-27.55
1727,-27.64
1728,-27.34
1729,-27.12
1730,-26.81
1731,-26.22
1732,-25.04
1733,-23.35
1734,-21.07
1735,-18.32
1736,-15.19
1737,-11.93
1738,-8.80
1739,-6.03
1740,-3.92
1741,-2.73
1742,-2.69
1743,-3.88
1744,-6.22
1745,-9.40
1746,-13.09
1747,-16.89
1748,-20.53
1749,-23.75
1750,-26.42
1751,-28.42
1752,-29.81
1753,-30.55
1754,-30.80
1755,-30.55
1756,-29.99
1757,-29.14
1758,-28.16
1759,-27.07
1760,-25.97
1761,-24.88
1762,-23.87
1763,-22.97
1764,-22.15
1765,-21.42
1766,-20.71
1767,-20.10
1768,-19.54
1769,-19.12
1770,-18.75
1771,-18.48
1772,-18.23
1773,-18.04
1774,-17.84
1775,-17.66
1776,-17.46
1777,-17.29
1778,-17.14
1779,-17.02
1780,-16.90
1781,-16.79
1782,-16.68
1783,-16.60
1784,-16.54
1785,-16.51
1786,-16.48
1787,-16.46
1788,-16.43
1789,-16.43
1790,-16.40
1791,-16.36
1792,-16.28
1793,-16.19
1794,-16.12
1795,-16.08
1796,-16.05
1797,-16.02
1798,-15.98
1799,-15.92
1800,-15.86
1801,-15.79
1802,-15.72
1803,-15.64
1804,-15.56
1805,-15.50
1806,-15.45
1807,-15.41
1808,-15.36
1809,-15.30
1810,-15.21
1811,-15.11
1812,-14.99
1813,-14.89
1814,-14.83
1815,-14.81
1816,-14.79
1817,-14.75
1818,-14.68
1819,-14.61
1820,-14.53
1821,-14.46
1822,-14.39
1823,-14.35
1824,-14.32
1825,-14.29
1826,-14.22
1827,-14.11
1828,-14.01
1829,-13.95
1830,-13.93
1831,-13.91
1832,-13.86
1833,-13.78
1834,-13.69
1835,-13.61
1836,-13.53
1837,-13.46
1838,-13.37
1839,-13.29
1840,-13.21
1841,-13.16
1842,-13.14
1843,-13.14
1844,-13.12
1845,-13.05
1846,-12.94
1847,-12.84
1848,-12.78
1849,-12.77
1850,-12.76
1851,-12.72
1852,-12.64
1853,-12.58
1854,-12.55
1855,-12.54
1856,-12.50
1857,-12.44
1858,-12.36
1859,-12.30
1860,-12.27
1861,-12.25
1862,-12.20
1863,-12.14
1864,-12.08
1865,-12.04
1866,-12.01
1867,-11.96
1868,-11.89
1869,-11.81
1870,-11.77
1871,-11.76
1872,-11.75
1873,-11.72
1874,-11.66
1875,-11.61
1876,-11.54
1877,-11.48
1878,-11.42
1879,-11.37
1880,-11.32
1881,-11.28
1882,-11.23
1883,-11.19
1884,-11.17
1885,-11.19
1886,-11.19
1887,-11.15
1888,-11.04
1889,-10.92
1890,-10.83
1891,-10.81
1892,-10.81
1893,-10.80
1894,-10.76
1895,-10.73
1896,-10.70
1897,-10.64
1898,-10.59
1899,-10.61
1900,-10.60
1901,-10.31
1902,-9.79
1903,-9.55
1904,-9.84
1905,-10.21
1906,-10.13
1907,-9.87
1908,-10.09
1909,-10.66
1910,-10.65
1911,-9.76
1912,-9.12
1913,-9.88
1914,-11.09
1915,-10.59
1916,-8.67
1917,-8.48
1918,-10.90
1919,-12.12
1920,-9.12
1921,-6.46
1922,-9.02
1923,-13.97
1924,-12.74
1925,-5.18
1926,-2.37
1927,-12.12
1928,-25.04
1929,-21.46
1930,4.48
1931,36.54
1932,50.00
1933,50.00
1934,50.00
1935,50.00
1936,43.82
1937,17.66
1938,-19.69
1939,-44.59
1940,-45.40
1941,-35.45
1942,-34.42
1943,-43.10
1944,-47.18
1945,-40.51
1946,-33.60
1947,-35.02
1948,-40.18
1949,-39.38
1950,-33.53
1951,-29.89
1952,-31.52
1953,-33.98
1954,-32.86
1955,-29.61
1956,-28.25
1957,-29.60
1958,-30.56
1959,-29.32
1960,-27.52
1961,-27.24
1962,-27.86
1963,-27.84
1964,-27.00
1965,-26.52
1966,-26.76
1967,-27.33
1968,-27.55
1969,-27.48
1970,-27.19
1971,-26.97
1972,-26.53
1973,-25.73
1974,-24.30
1975,-22.30
1976,-19.72
1977,-16.74
1978,-13.53
1979,-10.33
1980,-7.38
1981,-4.93
1982,-3.24
1983,-2.56
1984,-3.10
1985,-4.87
1986,-7.70
1987,-11.21
1988,-15.02
1989,-18.76
1990,-22.20
1991,-25.14
1992,-27.50
1993,-29.17
1994,-30.23
1995,-30.68
1996,-30.69
1997,-30.27
1998,-29.59
1999,-28.67
2000,-27.65
2001,-26.55
2002,-25.44
2003,-24.37
2004,-23.38
2005,-22.53
2006,-21.75
2007,-21.06
2008,-20.38
2009,-19.81
2010,-19.31
2011,-18.94
2012,-18.61
2013,-18.34
2014,-18.09
2015,-17.92
2016,-17.75
2017,-17.59
2018,-17.40
2019,-17.22
2020,-17.05
2021,-16.94
2022,-16.83
2023,-16.74
2024,-16.65
2025,-16.58
2026,-16.53
2027,-16.49
2028,-16.45
2029,-16.42
2030,-16.41
2031,-16.40
2032,-16.37
2033,-16.33
2034,-16.26
2035,-16.18
2036,-16.11
2037,-16.06
2038,-16.02
2039,-15.99
2040,-15.95
2041,-15.90
2042,-15.82
2043,-15.73
2044,-15.63
2045,-15.55
2046,-15.49
2047,-15.45
2048,-15.41
2049,-15.38
2050,-15.33
2051,-15.26
2052,-15.16
2053,-15.04
2054,-14.94
2055,-14.86
2056,-14.81
2057,-14.79
2058,-14.76
2059,-14.72
2060,-14.65
2061,-14.56
2062,-14.48
2063,-14.42
2064,-14.36
2065,-14.33
2066,-14.29
2067,-14.25
2068,-14.18
2069,-14.08
2070,-13.98
2071,-13.91
2072,-13.87
2073,-13.84
2074,-13.80
2075,-13.74
2076,-13.65
2077,-13.57
2078,-13.49
2079,-13.42
2080,-13.35
2081,-13.27
2082,-13.20
2083,-13.15
2084,-13.12
2085,-13.10
2086,-13.05
2087,-12.98
2088,-12.90
2089,-12.83
2090,-12.78
2091,-12.75
2092,-12.71
2093,-12.66
2094,-12.62
2095,-12.59
2096,-12.55
2097,-12.51
2098,-12.45
2099,-12.38
2100,-12.31
2101,-12.26
2102,-12.23
2103,-12.20
2104,-12.17
2105,-12.12
2106,-12.06
2107,-12.01
2108,-11.96
2109,-11.91
2110,-11.85
2111,-11.81
2112,-11.76
2113,-11.74
2114,-11.70
2115,-11.66
2116,-11.61
2117,-11.56
2118,-11.50
2119,-11.46
2120,-11.41
2121,-11.36
2122,-11.30
2123,-11.24
2124,-11.17
2125,-11.14
2126,-11.14
2127,-11.16
2128,-11.15
2129,-11.09
2130,-11.00
2131,-10.91
2132,-10.84
2133,-10.79
2134,-10.76
2135,-10.74
2136,-10.73
2137,-10.70
2138,-10.64
2139,-10.59
2140,-10.59
2141,-10.61
2142,-10.48
2143,-10.09
2144,-9.64
2145,-9.61
2146,-10.00
2147,-10.22
2148,-9.98
2149,-9.88
2150,-10.40
2151,-10.81
2152,-10.23
2153,-9.25
2154,-9.35
2155,-10.59
2156,-11.08
2157,-9.62
2158,-8.17
2159,-9.49
2160,-12.03
2161,-11.19
2162,-6.86
2163,-6.62
2164,-12.55
2165,-15.46
2166,-7.86
2167,0.10
2168,-7.00
2169,-24.26
2170,-28.23
2171,-5.94
2172,27.22
2173,47.31
2174,49.73
2175,49.38
2176,50.00
2177,50.00
2178,34.84
2179,-4.30
2180,-39.23
2181,-50.00
2182,-41.14
2183,-33.47
2184,-38.21
2185,-45.93
2186,-44.11
2187,-35.31
2188,-32.34
2189,-37.51
2190,-41.33
2191,-36.94
2192,-30.71
2193,-30.04
2194,-33.26
2195,-34.01
2196,-31.03
2197,-28.48
2198,-28.82
2199,-30.28
2200,-30.08
2201,-28.38
2202,-27.22
2203,-27.53
2204,-27.95
2205,-27.46
2206,-26.59
2207,-26.53
2208,-27.07
2209,-27.52
2210,-27.48
2211,-27.32
2212,-27.09
2213,-26.82
2214,-26.16
2215,-25.06
2216,-23.35
2217,-21.08
2218,-18.29
2219,-15.17
2220,-11.92
2221,-8.80
2222,-6.05
2223,-3.95
2224,-2.77
2225,-2.71
2226,-3.88
2227,-6.18
2228,-9.36
2229,-13.05
2230,-16.88
2231,-20.51
2232,-23.74
2233,-26.39
2234,-28.43
2235,-29.77
2236,-30.53
2237,-30.71
2238,-30.51
2239,-29.95
2240,-29.16
2241,-28.15
2242,-27.06
2243,-25.95
2244,-24.88
2245,-23.90
2246,-22.97
2247,-22.14
2248,-21.36
2249,-20.68
2250,-20.05
2251,-19.55
2252,-19.10
2253,-18.77
2254,-18.46
2255,-18.23
2256,-18.01
2257,-17.83
2258,-17.63
2259,-17.44
2260,-17.25
2261,-17.12
2262,-17.02
2263,-16.93
2264,-16.82
2265,-16.70
2266,-16.60
2267,-16.55
2268,-16.50
2269,-16.45
2270,-16.40
2271,-16.38
2272,-16.39
2273,-16.40
2274,-16.36
2275,-16.28
2276,-16.19
2277,-16.13
2278,-16.09
2279,-16.07
2280,-16.02
2281,-15.97
2282,-15.90
2283,-15.84
2284,-15.77
2285,-15.69
2286,-15.60
2287,-15.52
2288,-15.44
2289,-15.39
2290,-15.38
2291,-15.37
2292,-15.31
2293,-15.21
2294,-15.08
2295,-14.97
2296,-14.89
2297,-14.84
2298,-14.80
2299,-14.77
2300,-14.74
2301,-14.69
2302,-14.62
2303,-14.52
2304,-14.43
2305,-14.38
2306,-14.36
2307,-14.33
2308,-14.27
2309,-14.18
2310,-14.07
2311,-14.00
2312,-13.95
2313,-13.92
2314,-13.87
2315,-13.80
2316,-13.73
2317,-13.69
2318,-13.64
2319,-13.57
2320,-13.45
2321,-13.35
2322,-13.27
2323,-13.23
2324,-13.20
2325,-13.16
2326,-13.12
2327,-13.08
2328,-13.01
2329,-12.92
2330,-12.83
2331,-12.77
2332,-12.76
2333,-12.75
2334,-12.72
2335,-12.66
2336,-12.59
2337,-12.56
2338,-12.52
2339,-12.47
2340,-12.41
2341,-12.34
2342,-12.29
2343,-12.24
2344,-12.20
2345,-12.16
2346,-12.12
2347,-12.08
2348,-12.05
2349,-12.01
2350,-11.94
2351,-11.86
2352,-11.79
2353,-11.77
2354,-11.77
2355,-11.76
2356,-11.71
2357,-11.63
2358,-11.55
2359,-11.51
2360,-11.47
2361,-11.43
2362,-11.37
2363,-11.30
2364,-11.24
2365,-11.20
2366,-11.17
2367,-11.15
2368,-11.14
2369,-11.12
2370,-11.09
2371,-11.04
2372,-10.96
2373,-10.88
2374,-10.80
2375,-10.75
2376,-10.72
2377,-10.74
2378,-10.75
2379,-10.70
2380,-10.61
2381,-10.57
2382,-10.61
2383,-10.56
2384,-10.26
2385,-9.82
2386,-9.60
2387,-9.82
2388,-10.17
2389,-10.16
2390,-9.90
2391,-10.06
2392,-10.66
2393,-10.67
2394,-9.69
2395,-9.05
2396,-9.92
2397,-11.08
2398,-10.49
2399,-8.63
2400,-8.45
2401,-10.92
2402,-12.32
2403,-9.43
2404,-5.53
2405,-8.41
2406,-15.59
2407,-14.57
2408,-2.49
2409,2.38
2410,-14.38
2411,-35.16
2412,-27.90
2413,11.09
2414,48.53
2415,50.00
2416,45.41
2417,45.28
2418,50.00
2419,50.00
2420,24.59
2421,-26.32
2422,-50.00
2423,-50.00
2424,-35.93
2425,-33.73
2426,-43.68
2427,-47.86
2428,-40.46
2429,-32.41
2430,-33.88
2431,-39.75
2432,-40.14
2433,-33.78
2434,-29.44
2435,-31.33
2436,-34.29
2437,-32.97
2438,-29.33
2439,-28.21
2440,-29.67
2441,-30.45
2442,-29.16
2443,-27.59
2444,-27.29
2445,-27.84
2446,-27.78
2447,-26.97
2448,-26.35
2449,-26.69
2450,-27.35
2451,-27.66
2452,-27.43
2453,-27.20
2454,-26.93
2455,-26.52
2456,-25.63
2457,-24.27
2458,-22.30
2459,-19.77
2460,-16.76
2461,-13.53
2462,-10.32
2463,-7.36
2464,-4.92
2465,-3.23
2466,-2.59
2467,-3.15
2468,-4.93
2469,-7.71
2470,-11.18
2471,-14.96
2472,-18.72
2473,-22.17
2474,-25.13
2475,-27.44
2476,-29.14
2477,-30.18
2478,-30.69
2479,-30.66
2480,-30.27
2481,-29.54
2482,-28.64
2483,-27.60
2484,-26.51
2485,-25.42
2486,-24.37
2487,-23.43
2488,-22.56
2489,-21.77
2490,-21.01
2491,-20.35
2492,-19.76
2493,-19.31
2494,-18.92
2495,-18.62
2496,-18.33
2497,-18.12
2498,-17.91
2499,-17.75
2500,-17.55
2501,-17.36
2502,-17.18
2503,-17.05
2504,-16.94
2505,-16.85
2506,-16.74
2507,-16.65
2508,-16.56
2509,-16.52
2510,-16.49
2511,-16.46
2512,-16.43
2513,-16.42
2514,-16.40
2515,-16.36
2516,-16.29
2517,-16.20
2518,-16.13
2519,-16.09
2520,-16.07
2521,-16.04
2522,-16.01
2523,-15.97
2524,-15.90
2525,-15.81
2526,-15.71
2527,-15.63
2528,-15.57
2529,-15.52
2530,-15.45
2531,-15.37
2532,-15.31
2533,-15.29
2534,-15.26
2535,-15.19
2536,-15.06
2537,-14.94
2538,-14.86
2539,-14.83
2540,-14.80
2541,-14.75
2542,-14.68
2543,-14.62
2544,-14.57
2545,-14.50
2546,-14.41
2547,-14.36
2548,-14.34
2549,-14.32
2550,-14.26
2551,-14.14
2552,-14.02
2553,-13.94
2554,-13.92
2555,-13.91
2556,-13.86
2557,-13.79
2558,-13.71
2559,-13.65
2560,-13.59
2561,-13.53
2562,-13.43
2563,-13.32
2564,-13.22
2565,-13.17
2566,-13.15
2567,-13.14
2568,-13.12
2569,-13.05
2570,-12.95
2571,-12.86
2572,-12.80
2573,-12.79
2574,-12.77
2575,-12.74
2576,-12.67
2577,-12.61
2578,-12.58
2579,-12.55
2580,-12.50
2581,-12.43
2582,-12.36
2583,-12.31
2584,-12.28
2585,-12.26
2586,-12.21
2587,-12.14
2588,-12.08
2589,-12.04
2590,-12.01
2591,-11.97
2592,-11.90
2593,-11.82
2594,-11.76
2595,-11.75
2596,-11.76
2597,-11.75
2598,-11.69
2599,-11.61
2600,-11.55
2601,-11.49
2602,-11.44
2603,-11.37
2604,-11.30
2605,-11.25
2606,-11.22
2607,-11.21
2608,-11.19
2609,-11.17
2610,-11.15
2611,-11.12
2612,-11.06
2613,-10.99
2614,-10.91
2615,-10.84
2616,-10.79
2617,-10.75
2618,-10.73
2619,-10.74
2620,-10.73
2621,-10.64
2622,-10.54
2623,-10.54
2624,-10.62
2625,-10.48
2626,-10.03
2627,-9.62
2628,-9.67
2629,-10.05
2630,-10.21
2631,-9.99
2632,-9.89
2633,-10.33
2634,-10.78
2635,-10.31
2636,-9.28
2637,-9.30
2638,-10.61
2639,-11.11
2640,-9.55
2641,-8.11
2642,-9.44
2643,-11.98
2644,-11.30
2645,-7.58
2646,-6.18
2647,-11.23
2648,-16.00
2649,-10.80
2650,0.13
2651,-1.57
2652,-21.48
2653,-35.56
2654,-17.26
2655,25.84
2656,50.00
2657,50.00
2658,47.43
2659,46.35
2660,50.00
2661,39.36
2662,2.31
2663,-35.95
2664,-50.00
2665,-41.91
2666,-34.18
2667,-39.22
2668,-47.17
2669,-45.12
2670,-36.60
2671,-33.02
2672,-37.23
2673,-40.35
2674,-37.04
2675,-31.19
2676,-29.94
2677,-32.91
2678,-34.10
2679,-31.26
2680,-28.32
2681,-28.72
2682,-30.37
2683,-30.09
2684,-28.20
2685,-27.20
2686,-27.55
2687,-27.94
2688,-27.40
2689,-26.64
2690,-26.45
2691,-27.01
2692,-27.50
2693,-27.58
2694,-27.29
2695,-27.08
2696,-26.77
2697,-26.18
2698,-25.01
2699,-23.32
2700,-21.06
2701,-18.32
2702,-15.20
2703,-11.96
2704,-8.83
2705,-6.07
2706,-3.97
2707,-2.77
2708,-2.72
2709,-3.90
2710,-6.22
2711,-9.39
2712,-13.06
2713,-16.85
2714,-20.48
2715,-23.69
2716,-26.36
2717,-28.36
2718,-29.75
2719,-30.49
2720,-30.74
2721,-30.50
2722,-29.95
2723,-29.11
2724,-28.14
2725,-27.05
2726,-25.94
2727,-24.86
2728,-23.85
2729,-22.96
2730,-22.14
2731,-21.41
2732,-20.70
2733,-20.08
2734,-19.53
2735,-19.10
2736,-18.73
2737,-18.46
2738,-18.21
2739,-18.03
2740,-17.83
2741,-17.65
2742,-17.45
2743,-17.28
2744,-17.12
2745,-17.00
2746,-16.88
2747,-16.78
2748,-16.67
2749,-16.60
2750,-16.54
2751,-16.50
2752,-16.47
2753,-16.44
2754,-16.42
2755,-16.41
2756,-16.39
2757,-16.34
2758,-16.26
2759,-16.17
2760,-16.10
2761,-16.06
2762,-16.04
2763,-16.02
2764,-15.97
2765,-15.91
2766,-15.84
2767,-15.77
2768,-15.70
2769,-15.62
2770,-15.55
2771,-15.49
2772,-15.44
2773,-15.40
2774,-15.35
2775,-15.28
2776,-15.20
2777,-15.10
2778,-14.98
2779,-14.89
2780,-14.83
2781,-14.80
2782,-14.78
2783,-14.74
2784,-14.68
2785,-14.61
2786,-14.53
2787,-14.45
2788,-14.38
2789,-14.33
2790,-14.31
2791,-14.29
2792,-14.22
2793,-14.11
2794,-14.00
2795,-13.94
2796,-13.92
2797,-13.91
2798,-13.86
2799,-13.78
2800,-13.69
2801,-13.61
2802,-13.53
2803,-13.46
2804,-13.37
2805,-13.29
2806,-13.21
2807,-13.15
2808,-13.13
2809,-13.13
2810,-13.11
2811,-13.04
2812,-12.93
2813,-12.83
2814,-12.77
2815,-12.76
2816,-12.75
2817,-12.72
2818,-12.64
2819,-12.57
2820,-12.54
2821,-12.52
2822,-12.49
2823,-12.43
2824,-12.35
2825,-12.29
2826,-12.26
2827,-12.24
2828,-12.19
2829,-12.13
2830,-12.07
2831,-12.03
2832,-12.00
2833,-11.95
2834,-11.86
2835,-11.79
2836,-11.75
2837,-11.74
2838,-11.74
2839,-11.71
2840,-11.65
2841,-11.58
2842,-11.52
2843,-11.46
2844,-11.40
2845,-11.35
2846,-11.30
2847,-11.26
2848,-11.21
2849,-11.17
2850,-11.16
2851,-11.17
2852,-11.17
2853,-11.12
2854,-11.02
2855,-10.90
2856,-10.82
2857,-10.80
2858,-10.79
2859,-10.78
2860,-10.73
2861,-10.70
2862,-10.67
2863,-10.62
2864,-10.57
2865,-10.59
2866,-10.57
2867,-10.29
2868,-9.78
2869,-9.54
2870,-9.84
2871,-10.21
2872,-10.12
2873,-9.86
2874,-10.07
2875,-10.64
2876,-10.63
2877,-9.75
2878,-9.11
2879,-9.87
2880,-11.08
2881,-10.58
2882,-8.65
2883,-8.46
2884,-10.89
2885,-12.12
2886,-9.12
2887,-6.45
2888,-9.01
2889,-13.96
2890,-12.73
2891,-5.17
2892,-2.35
2893,-12.11
2894,-25.02
2895,-21.46
2896,4.47
2897,36.54
2898,50.00
2899,50.00
2900,50.00
2901,50.00
2902,43.84
2903,17.68
2904,-19.70
2905,-44.60
2906,-45.36
2907,-35.37
2908,-34.34
2909,-43.07
2910,-47.18
2911,-40.49
2912,-33.54
2913,-34.95
2914,-40.12
2915,-39.33
2916,-33.49
2917,-29.84
2918,-31.49
2919,-33.94
2920,-32.82
2921,-29.57
2922,-28.22
2923,-29.57
2924,-30.53
2925,-29.29
2926,-27.48
2927,-27.21
2928,-27.83
2929,-27.80
2930,-26.97
2931,-26.49
2932,-26.73
2933,-27.30
2934,-27.51
2935,-27.43
2936,-27.15
2937,-26.94
2938,-26.50
2939,-25.71
2940,-24.28
2941,-22.29
2942,-19.72
2943,-16.76
2944,-13.56
2945,-10.37
2946,-7.44
2947,-4.99
2948,-3.30
2949,-2.61
2950,-3.15
2951,-4.90
2952,-7.71
2953,-11.20
2954,-14.99
2955,-18.71
2956,-22.15
2957,-25.09
2958,-27.45
2959,-29.12
2960,-30.18
2961,-30.63
2962,-30.65
2963,-30.23
2964,-29.56
2965,-28.64
2966,-27.62
2967,-26.53
2968,-25.42
2969,-24.36
2970,-23.37
2971,-22.52
2972,-21.74
2973,-21.06
2974,-20.38
2975,-19.81
2976,-19.31
2977,-18.93
2978,-18.60
2979,-18.34
2980,-18.09
2981,-17.91
2982,-17.74
2983,-17.58
2984,-17.39
2985,-17.21
2986,-17.05
2987,-16.93
2988,-16.83
2989,-16.74
2990,-16.64
2991,-16.57
2992,-16.52
2993,-16.48
2994,-16.44
2995,-16.41
2996,-16.39
2997,-16.38
2998,-16.36
2999,-16.31
3000,-16.25
3001,-16.17
3002,-16.10
3003,-16.06
3004,-16.02
3005,-15.99
3006,-15.95
3007,-15.89
3008,-15.81
3009,-15.73
3010,-15.64
3011,-15.56
3012,-15.49
3013,-15.44
3014,-15.41
3015,-15.38
3016,-15.33
3017,-15.26
3018,-15.15
3019,-15.04
3020,-14.93
3021,-14.86
3022,-14.81
3023,-14.79
3024,-14.76
3025,-14.72
3026,-14.65
3027,-14.57
3028,-14.48
3029,-14.41
3030,-14.36
3031,-14.32
3032,-14.29
3033,-14.25
3034,-14.18
3035,-14.08
3036,-13.98
3037,-13.91
3038,-13.87
3039,-13.85
3040,-13.81
3041,-13.75
3042,-13.66
3043,-13.58
3044,-13.50
3045,-13.42
3046,-13.35
3047,-13.27
3048,-13.20
3049,-13.16
3050,-13.13
3051,-13.10
3052,-13.06
3053,-12.98
3054,-12.89
3055,-12.82
3056,-12.78
3057,-12.75
3058,-12.72
3059,-12.67
3060,-12.63
3061,-12.59
3062,-12.55
3063,-12.51
3064,-12.45
3065,-12.38
3066,-12.31
3067,-12.26
3068,-12.23
3069,-12.21
3070,-12.17
3071,-12.12
3072,-12.06
3073,-12.01
3074,-11.96
3075,-11.90
3076,-11.84
3077,-11.79
3078,-11.75
3079,-11.73
3080,-11.70
3081,-11.65
3082,-11.60
3083,-11.54
3084,-11.49
3085,-11.45
3086,-11.41
3087,-11.36
3088,-11.30
3089,-11.23
3090,-11.16
3091,-11.13
3092,-11.13
3093,-11.15
3094,-11.14
3095,-11.09
3096,-11.00
3097,-10.91
3098,-10.84
3099,-10.80
3100,-10.76
3101,-10.74
3102,-10.71
3103,-10.68
3104,-10.63
3105,-10.59
3106,-10.59
3107,-10.60
3108,-10.48
3109,-10.08
3110,-9.64
3111,-9.61
3112,-10.00
3113,-10.22
3114,-9.97
3115,-9.87
3116,-10.38
3117,-10.79
3118,-10.22
3119,-9.25
3120,-9.35
3121,-10.59
3122,-11.08
3123,-9.62
3124,-8.17
3125,-9.50
3126,-12.03
3127,-11.20
3128,-6.87
3129,-6.62
3130,-12.55
3131,-15.46
3132,-7.85
3133,0.10
3134,-7.00
3135,-24.26
3136,-28.24
3137,-5.95
3138,27.21
3139,47.31
3140,49.73
3141,49.38
3142,50.00
3143,50.00
3144,34.85
3145,-4.29
3146,-39.22
3147,-50.00
3148,-41.09
3149,-33.41
3150,-38.16
3151,-45.90
3152,-44.10
3153,-35.27
3154,-32.28
3155,-37.44
3156,-41.27
3157,-36.90
3158,-30.68
3159,-30.00
3160,-33.22
3161,-33.97
3162,-30.99
3163,-28.45
3164,-28.79
3165,-30.25
3166,-30.06
3167,-28.35
3168,-27.19
3169,-27.50
3170,-27.93
3171,-27.43
3172,-26.57
3173,-26.50
3174,-27.04
3175,-27.50
3176,-27.45
3177,-27.29
3178,-27.06
3179,-26.79
3180,-26.13
3181,-25.05
3182,-23.34
3183,-21.09
3184,-18.31
3185,-15.20
3186,-11.97
3187,-8.86
3188,-6.12
3189,-4.02
3190,-2.84
3191,-2.77
3192,-3.92
3193,-6.21
3194,-9.37
3195,-13.04
3196,-16.85
3197,-20.46
3198,-23.69
3199,-26.34
3200,-28.38
3201,-29.72
3202,-30.48
3203,-30.67
3204,-30.48
3205,-29.91
3206,-29.13
3207,-28.13
3208,-27.05
3209,-25.93
3210,-24.87
3211,-23.89
3212,-22.97
3213,-22.14
3214,-21.35
3215,-20.68
3216,-20.05
3217,-19.55
3218,-19.11
3219,-18.77
3220,-18.46
3221,-18.23
3222,-18.00
3223,-17.83
3224,-17.63
3225,-17.44
3226,-17.25
3227,-17.12
3228,-17.01
3229,-16.93
3230,-16.81
3231,-16.70
3232,-16.60
3233,-16.54
3234,-16.49
3235,-16.44
3236,-16.39
3237,-16.38
3238,-16.39
3239,-16.40
3240,-16.36
3241,-16.28
3242,-16.19
3243,-16.12
3244,-16.09
3245,-16.06
3246,-16.03
3247,-15.98
3248,-15.91
3249,-15.84
3250,-15.77
3251,-15.70
3252,-15.61
3253,-15.52
3254,-15.44
3255,-15.40
3256,-15.38
3257,-15.37
3258,-15.32
3259,-15.22
3260,-15.08
3261,-14.97
3262,-14.90
3263,-14.85
3264,-14.80
3265,-14.77
3266,-14.74
3267,-14.70
3268,-14.63
3269,-14.53
3270,-14.43
3271,-14.38
3272,-14.36
3273,-14.34
3274,-14.28
3275,-14.19
3276,-14.08
3277,-14.00
3278,-13.96
3279,-13.93
3280,-13.88
3281,-13.82
3282,-13.76
3283,-13.71
3284,-13.66
3285,-13.58
3286,-13.46
3287,-13.36
3288,-13.28
3289,-13.24
3290,-13.21
3291,-13.17
3292,-13.13
3293,-13.08
3294,-13.01
3295,-12.93
3296,-12.83
3297,-12.78
3298,-12.77
3299,-12.76
3300,-12.73
3301,-12.67
3302,-12.61
3303,-12.57
3304,-12.53
3305,-12.48
3306,-12.42
3307,-12.35
3308,-12.29
3309,-12.25
3310,-12.21
3311,-12.17
3312,-12.13
3313,-12.10
3314,-12.06
3315,-12.01
3316,-11.94
3317,-11.85
3318,-11.79
3319,-11.77
3320,-11.77
3321,-11.76
3322,-11.71
3323,-11.63
3324,-11.55
3325,-11.50
3326,-11.46
3327,-11.43
3328,-11.37
3329,-11.31
3330,-11.25
3331,-11.21
3332,-11.18
3333,-11.16
3334,-11.14
3335,-11.12
3336,-11.09
3337,-11.04
3338,-10.96
3339,-10.88
3340,-10.81
3341,-10.75
3342,-10.73
3343,-10.74
3344,-10.74
3345,-10.69
3346,-10.60
3347,-10.57
3348,-10.61
3349,-10.57
3350,-10.27
3351,-9.83
3352,-9.61
3353,-9.83
3354,-10.17
3355,-10.16
3356,-9.89
3357,-10.05
3358,-10.65
3359,-10.67
3360,-9.69
3361,-9.05
3362,-9.92
3363,-11.07
3364,-10.49
3365,-8.64
3366,-8.46
3367,-10.94
3368,-12.33
3369,-9.45
3370,-5.54
3371,-8.42
3372,-15.60
3373,-14.58
3374,-2.50
3375,2.37
3376,-14.38
3377,-35.16
3378,-27.91
3379,11.09
3380,48.53
3381,50.00
3382,45.41
3383,45.28
3384,50.00
3385,50.00
3386,24.60
3387,-26.32
3388,-50.00
3389,-50.00
3390,-35.88
3391,-33.68
3392,-43.64
3393,-47.83
3394,-40.43
3395,-32.37
3396,-33.83
3397,-39.69
3398,-40.10
3399,-33.74
3400,-29.41
3401,-31.30
3402,-34.26
3403,-32.95
3404,-29.32
3405,-28.20
3406,-29.66
3407,-30.44
3408,-29.15
3409,-27.58
3410,-27.28
3411,-27.82
3412,-27.77
3413,-26.96
3414,-26.34
3415,-26.68
3416,-27.34
3417,-27.64
3418,-27.41
3419,-27.18
3420,-26.91
3421,-26.51
3422,-25.62
3423,-24.28
3424,-22.31
3425,-19.80
3426,-16.80
3427,-13.58
3428,-10.38
3429,-7.44
3430,-5.00
3431,-3.32
3432,-2.66
3433,-3.20
3434,-4.96
3435,-7.73
3436,-11.19
3437,-14.95
3438,-18.70
3439,-22.14
3440,-25.09
3441,-27.40
3442,-29.10
3443,-30.14
3444,-30.65
3445,-30.62
3446,-30.24
3447,-29.52
3448,-28.63
3449,-27.58
3450,-26.50
3451,-25.40
3452,-24.37
3453,-23.43
3454,-22.56
3455,-21.78
3456,-21.02
3457,-20.36
3458,-19.77
3459,-19.32
3460,-18.93
3461,-18.63
3462,-18.34
3463,-18.11
3464,-17.91
3465,-17.75
3466,-17.56
3467,-17.37
3468,-17.18
3469,-17.05
3470,-16.94
3471,-16.85
3472,-16.75
3473,-16.65
3474,-16.57
3475,-16.52
3476,-16.49
3477,-16.46
3478,-16.43
3479,-16.42
3480,-16.40
3481,-16.37
3482,-16.29
3483,-16.20
3484,-16.13
3485,-16.09
3486,-16.07
3487,-16.05
3488,-16.02
3489,-15.98
3490,-15.91
3491,-15.82
3492,-15.72
3493,-15.64
3494,-15.59
3495,-15.54
3496,-15.47
3497,-15.39
3498,-15.32
3499,-15.30
3500,-15.27
3501,-15.20
3502,-15.07
3503,-14.95
3504,-14.87
3505,-14.85
3506,-14.82
3507,-14.77
3508,-14.70
3509,-14.63
3510,-14.57
3511,-14.50
3512,-14.42
3513,-14.37
3514,-14.35
3515,-14.33
3516,-14.26
3517,-14.15
3518,-14.03
3519,-13.96
3520,-13.94
3521,-13.93
3522,-13.88
3523,-13.81
3524,-13.74
3525,-13.67
3526,-13.62
3527,-13.54
3528,-13.44
3529,-13.33
3530,-13.23
3531,-13.18
3532,-13.16
3533,-13.16
3534,-13.13
3535,-13.07
3536,-12.96
3537,-12.87
3538,-12.81
3539,-12.80
3540,-12.79
3541,-12.75
3542,-12.69
3543,-12.63
3544,-12.58
3545,-12.55
3546,-12.51
3547,-12.44
3548,-12.37
3549,-12.32
3550,-12.29
3551,-12.27
3552,-12.22
3553,-12.16
3554,-12.10
3555,-12.05
3556,-12.02
3557,-11.97
3558,-11.89
3559,-11.81
3560,-11.75
3561,-11.74
3562,-11.75
3563,-11.74
3564,-11.68
3565,-11.60
3566,-11.54
3567,-11.50
3568,-11.44
3569,-11.38
3570,-11.31
3571,-11.26
3572,-11.23
3573,-11.21
3574,-11.19
3575,-11.17
3576,-11.15
3577,-11.11
3578,-11.06
3579,-10.98
3580,-10.90
3581,-10.84
3582,-10.80
3583,-10.76
3584,-10.74
3585,-10.74
3586,-10.72
3587,-10.64
3588,-10.54
3589,-10.55
3590,-10.62
3591,-10.49
3592,-10.04
3593,-9.63
3594,-9.68
3595,-10.05
3596,-10.21
3597,-9.99
3598,-9.89
3599,-10.33
3600,-10.78
3601,-10.31
3602,-9.29
3603,-9.30
3604,-10.61
3605,-11.11
3606,-9.55
3607,-8.12
3608,-9.45
3609,-12.00
3610,-11.31
3611,-7.59
3612,-6.19
3613,-11.24
3614,-16.01
3615,-10.82
3616,0.11
3617,-1.58
3618,-21.49
3619,-35.57
3620,-17.26
3621,25.84
3622,50.00
3623,50.00
3624,47.43
3625,46.35
3626,50.00
3627,39.37
3628,2.31
3629,-35.95
3630,-50.00
3631,-41.86
3632,-34.12
3633,-39.18
3634,-47.15
3635,-45.10
3636,-36.56
3637,-32.97
3638,-37.18
3639,-40.30
3640,-37.00
3641,-31.16
3642,-29.91
3643,-32.88
3644,-34.07
3645,-31.23
3646,-28.30
3647,-28.71
3648,-30.36
3649,-30.08
3650,-28.19
3651,-27.18
3652,-27.54
3653,-27.93
3654,-27.40
3655,-26.63
3656,-26.44
3657,-26.99
3658,-27.49
3659,-27.57
3660,-27.28
3661,-27.06
3662,-26.75
3663,-26.17
3664,-25.00
3665,-23.33
3666,-21.09
3667,-18.36
3668,-15.25
3669,-12.01
3670,-8.89
3671,-6.14
3672,-4.04
3673,-2.84
3674,-2.77
3675,-3.93
3676,-6.24
3677,-9.39
3678,-13.05
3679,-16.83
3680,-20.45
3681,-23.65
3682,-26.32
3683,-28.32
3684,-29.71
3685,-30.45
3686,-30.70
3687,-30.47
3688,-29.92
3689,-29.09
3690,-28.12
3691,-27.03
3692,-25.93
3693,-24.85
3694,-23.84
3695,-22.96
3696,-22.14
3697,-21.41
3698,-20.70
3699,-20.09
3700,-19.53
3701,-19.11
3702,-18.74
3703,-18.47
3704,-18.22
3705,-18.03
3706,-17.83
3707,-17.65
3708,-17.45
3709,-17.27
3710,-17.11
3711,-16.99
3712,-16.88
3713,-16.77
3714,-16.67
3715,-16.59
3716,-16.53
3717,-16.50
3718,-16.46
3719,-16.43
3720,-16.41
3721,-16.41
3722,-16.39
3723,-16.34
3724,-16.26
3725,-16.17
3726,-16.10
3727,-16.06
3728,-16.04
3729,-16.03
3730,-15.98
3731,-15.93
3732,-15.85
3733,-15.78
3734,-15.70
3735,-15.62
3736,-15.55
3737,-15.50
3738,-15.45
3739,-15.41
3740,-15.36
3741,-15.30
3742,-15.21
3743,-15.11
3744,-14.99
3745,-14.90
3746,-14.84
3747,-14.81
3748,-14.79
3749,-14.75
3750,-14.69
3751,-14.61
3752,-14.54
3753,-14.46
3754,-14.38
3755,-14.33
3756,-14.31
3757,-14.29
3758,-14.23
3759,-14.11
3760,-14.00
3761,-13.95
3762,-13.93
3763,-13.93
3764,-13.88
3765,-13.80
3766,-13.70
3767,-13.62
3768,-13.55
3769,-13.47
3770,-13.38
3771,-13.29
3772,-13.22
3773,-13.17
3774,-13.14
3775,-13.14
3776,-13.11
3777,-13.05
3778,-12.94
3779,-12.84
3780,-12.78
3781,-12.77
3782,-12.77
3783,-12.73
3784,-12.66
3785,-12.59
3786,-12.54
3787,-12.53
3788,-12.49
3789,-12.43
3790,-12.36
3791,-12.30
3792,-12.27
3793,-12.24
3794,-12.20
3795,-12.14
3796,-12.07
3797,-12.04
3798,-12.00
3799,-11.94
3800,-11.86
3801,-11.78
3802,-11.74
3803,-11.73
3804,-11.72
3805,-11.69
3806,-11.64
3807,-11.58
3808,-11.52
3809,-11.46
3810,-11.40
3811,-11.35
3812,-11.31
3813,-11.26
3814,-11.21
3815,-11.17
3816,-11.16
3817,-11.17
3818,-11.17
3819,-11.12
3820,-11.01
3821,-10.90
3822,-10.83
3823,-10.81
3824,-10.81
3825,-10.79
3826,-10.74
3827,-10.71
3828,-10.68
3829,-10.63
3830,-10.58
3831,-10.60
3832,-10.58
3833,-10.29
3834,-9.78
3835,-9.54
3836,-9.84
3837,-10.21
3838,-10.12
3839,-9.86
3840,-10.07
3841,-10.64
3842,-10.64
3843,-9.76
3844,-9.12
3845,-9.87
3846,-11.07
3847,-10.58
3848,-8.66
3849,-8.47
3850,-10.90
3851,-12.12
3852,-9.13
3853,-6.46
3854,-9.01
3855,-13.96
3856,-12.74
3857,-5.18
3858,-2.37
3859,-12.12
3860,-25.03
3861,-21.47
3862,4.47
3863,36.54
3864,50.00
3865,50.00
3866,50.00
3867,50.00
3868,43.85
3869,17.69
3870,-19.70
3871,-44.60
3872,-45.33
3873,-35.30
3874,-34.27
3875,-43.04
3876,-47.17
3877,-40.46
3878,-33.48
3879,-34.89
3880,-40.07
3881,-39.30
3882,-33.45
3883,-29.81
3884,-31.46
3885,-33.92
3886,-32.80
3887,-29.55
3888,-28.20
3889,-29.55
3890,-30.51
3891,-29.28
3892,-27.47
3893,-27.20
3894,-27.82
3895,-27.79
3896,-26.96
3897,-26.48
3898,-26.72
3899,-27.29
3900,-27.50
3901,-27.42
3902,-27.14
3903,-26.92
3904,-26.49
3905,-25.70
3906,-24.29
3907,-22.31
3908,-19.76
3909,-16.80
3910,-13.61
3911,-10.43
3912,-7.50
3913,-5.05
3914,-3.36
3915,-2.67
3916,-3.19
3917,-4.93
3918,-7.73
3919,-11.20
3920,-14.97
3921,-18.69
3922,-22.11
3923,-25.05
3924,-27.40
3925,-29.07
3926,-30.14
3927,-30.59
3928,-30.61
3929,-30.20
3930,-29.53
3931,-28.61
3932,-27.60
3933,-26.51
3934,-25.41
3935,-24.35
3936,-23.36
3937,-22.51
3938,-21.75
3939,-21.07
3940,-20.39
3941,-19.82
3942,-19.31
3943,-18.94
3944,-18.61
3945,-18.34
3946,-18.09
3947,-17.91
3948,-17.74
3949,-17.58
3950,-17.39
3951,-17.21
3952,-17.04
3953,-16.93
3954,-16.83
3955,-16.74
3956,-16.65
3957,-16.58
3958,-16.51
3959,-16.47
3960,-16.43
3961,-16.41
3962,-16.39
3963,-16.38
3964,-16.36
3965,-16.32
3966,-16.25
3967,-16.17
3968,-16.10
3969,-16.06
3970,-16.02
3971,-16.00
3972,-15.96
3973,-15.90
3974,-15.82
3975,-15.73
3976,-15.65
3977,-15.57
3978,-15.50
3979,-15.45
3980,-15.41
3981,-15.39
3982,-15.34
3983,-15.27
3984,-15.17
3985,-15.05
3986,-14.95
3987,-14.87
3988,-14.83
3989,-14.80
3990,-14.77
3991,-14.73
3992,-14.66
3993,-14.58
3994,-14.49
3995,-14.41
3996,-14.36
3997,-14.34
3998,-14.31
3999,-14.26
4000,-14.18
4001,-14.08
4002,-13.98
4003,-13.92
4004,-13.89
4005,-13.88
4006,-13.84
4007,-13.77
4008,-13.69
4009,-13.60
4010,-13.51
4011,-13.44
4012,-13.35
4013,-13.28
4014,-13.22
4015,-13.17
4016,-13.14
4017,-13.11
4018,-13.06
4019,-12.99
4020,-12.90
4021,-12.83
4022,-12.79
4023,-12.76
4024,-12.73
4025,-12.69
4026,-12.64
4027,-12.60
4028,-12.56
4029,-12.51
4030,-12.45
4031,-12.39
4032,-12.33
4033,-12.28
4034,-12.25
4035,-12.22
4036,-12.17
4037,-12.13
4038,-12.08
4039,-12.03
4040,-11.97
4041,-11.91
4042,-11.85
4043,-11.79
4044,-11.75
4045,-11.72
4046,-11.69
4047,-11.65
4048,-11.60
4049,-11.55
4050,-11.50
4051,-11.46
4052,-11.42
4053,-11.37
4054,-11.31
4055,-11.24
4056,-11.17
4057,-11.14
4058,-11.14
4059,-11.15
4060,-11.14
4061,-11.09
4062,-11.00
4063,-10.91
4064,-10.85
4065,-10.82
4066,-10.78
4067,-10.76
4068,-10.73
4069,-10.69
4070,-10.64
4071,-10.59
4072,-10.59
4073,-10.61
4074,-10.49
4075,-10.09
4076,-9.65
4077,-9.62
4078,-10.00
4079,-10.22
4080,-9.97
4081,-9.87
4082,-10.39
4083,-10.81
4084,-10.23
4085,-9.26
4086,-9.35
4087,-10.59
4088,-11.07
4089,-9.62
4090,-8.17
4091,-9.50
4092,-12.04
4093,-11.21
4094,-6.88
4095,-6.64
4096,-12.56
4097,-15.47
4098,-7.87
4099,0.08
4100,-7.01
4101,-24.26
4102,-28.23
4103,-5.94
4104,27.21
4105,47.31
4106,49.73
4107,49.39
4108,50.00
4109,50.00
4110,34.86
4111,-4.28
4112,-39.21
4113,-49.97
4114,-41.05
4115,-33.35
4116,-38.11
4117,-45.87
4118,-44.08
4119,-35.24
4120,-32.22
4121,-37.39
4122,-41.23
4123,-36.87
4124,-30.65
4125,-29.98
4126,-33.21
4127,-33.96
4128,-30.98
4129,-28.43
4130,-28.77
4131,-30.23
4132,-30.04
4133,-28.35
4134,-27.19
4135,-27.50
4136,-27.92
4137,-27.42
4138,-26.55
4139,-26.49
4140,-27.02
4141,-27.48
4142,-27.44
4143,-27.28
4144,-27.05
4145,-26.78
4146,-26.13
4147,-25.05
4148,-23.35
4149,-21.11
4150,-18.34
4151,-15.25
4152,-12.02
4153,-8.91
4154,-6.19
4155,-4.09
4156,-2.90
4157,-2.82
4158,-3.96
4159,-6.22
4160,-9.38
4161,-13.03
4162,-16.83
4163,-20.43
4164,-23.65
4165,-26.30
4166,-28.34
4167,-29.69
4168,-30.45
4169,-30.64
4170,-30.46
4171,-29.89
4172,-29.11
4173,-28.10
4174,-27.03
4175,-25.92
4176,-24.87
4177,-23.89
4178,-22.97
4179,-22.14
4180,-21.36
4181,-20.69
4182,-20.06
4183,-19.56
4184,-19.11
4185,-18.78
4186,-18.47
4187,-18.23
4188,-18.01
4189,-17.83
4190,-17.63
4191,-17.44
4192,-17.24
4193,-17.10
4194,-17.00
4195,-16.92
4196,-16.81
4197,-16.69
4198,-16.59
4199,-16.53
4200,-16.48
4201,-16.43
4202,-16.38
4203,-16.36
4204,-16.37
4205,-16.39
4206,-16.36
4207,-16.28
4208,-16.19
4209,-16.13
4210,-16.09
4211,-16.07
4212,-16.03
4213,-15.98
4214,-15.92
4215,-15.85
4216,-15.78
4217,-15.71
4218,-15.62
4219,-15.54
4220,-15.45
4221,-15.40
4222,-15.39
4223,-15.38
4224,-15.34
4225,-15.23
4226,-15.10
4227,-14.99
4228,-14.90
4229,-14.86
4230,-14.81
4231,-14.78
4232,-14.74
4233,-14.70
4234,-14.62
4235,-14.53
4236,-14.43
4237,-14.38
4238,-14.36
4239,-14.34
4240,-14.29
4241,-14.20
4242,-14.09
4243,-14.01
4244,-13.97
4245,-13.94
4246,-13.90
4247,-13.84
4248,-13.78
4249,-13.73
4250,-13.67
4251,-13.58
4252,-13.47
4253,-13.36
4254,-13.29
4255,-13.25
4256,-13.21
4257,-13.18
4258,-13.14
4259,-13.09
4260,-13.02
4261,-12.93
4262,-12.84
4263,-12.79
4264,-12.78
4265,-12.78
4266,-12.74
4267,-12.68
4268,-12.61
4269,-12.56
4270,-12.52
4271,-12.48
4272,-12.42
4273,-12.36
4274,-12.30
4275,-12.26
4276,-12.21
4277,-12.17
4278,-12.14
4279,-12.10
4280,-12.07
4281,-12.02
4282,-11.94
4283,-11.85
4284,-11.78
4285,-11.76
4286,-11.77
4287,-11.76
4288,-11.70
4289,-11.62
4290,-11.54
4291,-11.50
4292,-11.47
4293,-11.44
4294,-11.38
4295,-11.32
4296,-11.26
4297,-11.22
4298,-11.18
4299,-11.16
4300,-11.14
4301,-11.12
4302,-11.08
4303,-11.04
4304,-10.97
4305,-10.90
4306,-10.83
4307,-10.78
4308,-10.74
4309,-10.75
4310,-10.75
4311,-10.71
4312,-10.61
4313,-10.58
4314,-10.62
4315,-10.58
4316,-10.28
4317,-9.84
4318,-9.61
4319,-9.83
4320,-10.17
4321,-10.16
4322,-9.89
4323,-10.05
4324,-10.66
4325,-10.68
4326,-9.70
4327,-9.06
4328,-9.92
4329,-11.08
4330,-10.49
4331,-8.64
4332,-8.47
4333,-10.95
4334,-12.34
4335,-9.46
4336,-5.55
4337,-8.43
4338,-15.60
4339,-14.59
4340,-2.52
4341,2.36
4342,-14.39
4343,-35.15
4344,-27.90
4345,11.09
4346,48.52
4347,50.00
4348,45.41
4349,45.28
4350,50.00
4351,50.00
4352,24.61
4353,-26.31
4354,-50.00
4355,-50.00
4356,-35.83
4357,-33.62
4358,-43.60
4359,-47.81
4360,-40.40
4361,-32.32
4362,-33.77
4363,-39.65
4364,-40.06
4365,-33.72
4366,-29.39
4367,-31.28
4368,-34.24
4369,-32.93
4370,-29.30
4371,-28.18
4372,-29.64
4373,-30.42
4374,-29.14
4375,-27.58
4376,-27.28
4377,-27.82
4378,-27.76
4379,-26.95
4380,-26.32
4381,-26.66
4382,-27.32
4383,-27.62
4384,-27.39
4385,-27.17
4386,-26.90
4387,-26.50
4388,-25.62
4389,-24.28
4390,-22.33
4391,-19.82
4392,-16.84
4393,-13.63
4394,-10.44
4395,-7.50
4396,-5.07
4397,-3.38
4398,-2.72
4399,-3.24
4400,-4.98
4401,-7.73
4402,-11.17
4403,-14.93
4404,-18.67
4405,-22.10
4406,-25.05
4407,-27.36
4408,-29.06
4409,-30.10
4410,-30.62
4411,-30.60
4412,-30.22
4413,-29.49
4414,-28.60
4415,-27.56
4416,-26.48
4417,-25.40
4418,-24.37
4419,-23.43
4420,-22.56
4421,-21.78
4422,-21.02
4423,-20.36
4424,-19.77
4425,-19.33
4426,-18.93
4427,-18.63
4428,-18.34
4429,-18.12
4430,-17.91
4431,-17.75
4432,-17.55
4433,-17.36
4434,-17.17
4435,-17.03
4436,-16.92
4437,-16.84
4438,-16.74
4439,-16.65
4440,-16.57
4441,-16.52
4442,-16.47
4443,-16.43
4444,-16.41
4445,-16.41
4446,-16.40
4447,-16.37
4448,-16.29
4449,-16.20
4450,-16.13
4451,-16.10
4452,-16.08
4453,-16.05
4454,-16.02
4455,-15.98
4456,-15.91
4457,-15.82
4458,-15.72
4459,-15.65
4460,-15.59
4461,-15.55
4462,-15.48
4463,-15.40
4464,-15.34
4465,-15.31
4466,-15.28
4467,-15.21
4468,-15.08
4469,-14.96
4470,-14.88
4471,-14.85
4472,-14.81
4473,-14.76
4474,-14.69
4475,-14.63
4476,-14.57
4477,-14.50
4478,-14.42
4479,-14.37
4480,-14.35
4481,-14.34
4482,-14.27
4483,-14.15
4484,-14.03
4485,-13.97
4486,-13.95
4487,-13.94
4488,-13.89
4489,-13.82
4490,-13.74
4491,-13.69
4492,-13.63
4493,-13.55
4494,-13.44
4495,-13.33
4496,-13.24
4497,-13.19
4498,-13.17
4499,-13.17
4500,-13.14
4501,-13.07
4502,-12.97
4503,-12.87
4504,-12.82
4505,-12.81
4506,-12.80
4507,-12.77
4508,-12.70
4509,-12.63
4510,-12.58
4511,-12.55
4512,-12.51
4513,-12.45
4514,-12.38
4515,-12.33
4516,-12.30
4517,-12.28
4518,-12.23
4519,-12.17
4520,-12.10
4521,-12.06
4522,-12.03
4523,-11.98
4524,-11.89
4525,-11.81
4526,-11.75
4527,-11.74
4528,-11.75
4529,-11.74
4530,-11.68
4531,-11.61
4532,-11.55
4533,-11.50
4534,-11.45
4535,-11.39
4536,-11.33
4537,-11.28
4538,-11.24
4539,-11.22
4540,-11.19
4541,-11.18
4542,-11.16
4543,-11.13
4544,-11.07
4545,-11.00
4546,-10.92
4547,-10.87
4548,-10.82
4549,-10.79
4550,-10.75
4551,-10.75
4552,-10.73
4553,-10.66
4554,-10.56
4555,-10.57
4556,-10.64
4557,-10.51
4558,-10.06
4559,-9.64
4560,-9.68
4561,-10.06
4562,-10.22
4563,-9.99
4564,-9.89
4565,-10.33
4566,-10.79
4567,-10.33
4568,-9.30
4569,-9.31
4570,-10.62
4571,-11.12
4572,-9.56
4573,-8.13
4574,-9.46
4575,-12.01
4576,-11.33
4577,-7.60
4578,-6.20
4579,-11.25
4580,-16.02
4581,-10.84
4582,0.09
4583,-1.59
4584,-21.50
4585,-35.57
4586,-17.27
4587,25.84
4588,50.00
4589,50.00
4590,47.43
4591,46.35
4592,50.00
4593,39.39
4594,2.32
4595,-35.95
4596,-50.00
4597,-41.82
4598,-34.07
4599,-39.14
4600,-47.13
4601,-45.07
4602,-36.52
4603,-32.92
4604,-37.14
4605,-40.27
4606,-36.98
4607,-31.14
4608,-29.90
4609,-32.87
4610,-34.06
4611,-31.21
4612,-28.29
4613,-28.70
4614,-30.35
4615,-30.08
4616,-28.19
4617,-27.19
4618,-27.55
4619,-27.93
4620,-27.40
4621,-26.63
4622,-26.44
4623,-26.99
4624,-27.48
4625,-27.57
4626,-27.27
4627,-27.06
4628,-26.75
4629,-26.17
4630,-25.01
4631,-23.36
4632,-21.12
4633,-18.39
4634,-15.29
4635,-12.06
4636,-8.96
4637,-6.23
4638,-4.13
4639,-2.91
4640,-2.83
4641,-3.98
4642,-6.27
4643,-9.41
4644,-13.05
4645,-16.81
4646,-20.42
4647,-23.62
4648,-26.28
4649,-28.29
4650,-29.68
4651,-30.42
4652,-30.68
4653,-30.45
4654,-29.91
4655,-29.07
4656,-28.11
4657,-27.03
4658,-25.93
4659,-24.85
4660,-23.85
4661,-22.97
4662,-22.15
4663,-21.42
4664,-20.71
4665,-20.09
4666,-19.54
4667,-19.11
4668,-18.75
4669,-18.48
4670,-18.23
4671,-18.03
4672,-17.83
4673,-17.66
4674,-17.45
4675,-17.27
4676,-17.11
4677,-16.99
4678,-16.87
4679,-16.77
4680,-16.67
4681,-16.59
4682,-16.53
4683,-16.49
4684,-16.45
4685,-16.42
4686,-16.40
4687,-16.40
4688,-16.39
4689,-16.35
4690,-16.26
4691,-16.18
4692,-16.10
4693,-16.06
4694,-16.04
4695,-16.03
4696,-15.99
4697,-15.94
4698,-15.86
4699,-15.78
4700,-15.70
4701,-15.63
4702,-15.57
4703,-15.52
4704,-15.47
4705,-15.43
4706,-15.38
4707,-15.32
4708,-15.23
4709,-15.12
4710,-15.00
4711,-14.91
4712,-14.85
4713,-14.83
4714,-14.79
4715,-14.75
4716,-14.69
4717,-14.62
4718,-14.54
4719,-14.46
4720,-14.38
4721,-14.34
4722,-14.33
4723,-14.31
4724,-14.24
4725,-14.13
4726,-14.02
4727,-13.96
4728,-13.95
4729,-13.94
4730,-13.89
4731,-13.81
4732,-13.72
4733,-13.64
4734,-13.56
4735,-13.48
4736,-13.39
4737,-13.30
4738,-13.22
4739,-13.18
4740,-13.16
4741,-13.15
4742,-13.13
4743,-13.06
4744,-12.95
4745,-12.85
4746,-12.79
4747,-12.79
4748,-12.78
4749,-12.75
4750,-12.67
4751,-12.59
4752,-12.55
4753,-12.53
4754,-12.51
4755,-12.45
4756,-12.38
4757,-12.32
4758,-12.28
4759,-12.26
4760,-12.22
4761,-12.16
4762,-12.09
4763,-12.05
4764,-12.01
4765,-11.95
4766,-11.86
4767,-11.79
4768,-11.74
4769,-11.74
4770,-11.74
4771,-11.71
4772,-11.65
4773,-11.59
4774,-11.53
4775,-11.47
4776,-11.42
4777,-11.38
4778,-11.34
4779,-11.29
4780,-11.23
4781,-11.18
4782,-11.17
4783,-11.19
4784,-11.19
4785,-11.14
4786,-11.03
4787,-10.92
4788,-10.85
4789,-10.84
4790,-10.84
4791,-10.81
4792,-10.76
4793,-10.72
4794,-10.69
4795,-10.64
4796,-10.59
4797,-10.62
4798,-10.61
4799,-10.32
4800,-9.81
4801,-9.56
4802,-9.84
4803,-10.22
4804,-10.13
4805,-9.87
4806,-10.08
4807,-10.65
4808,-10.65
4809,-9.77
4810,-9.14
4811,-9.89
4812,-11.09
4813,-10.58
4814,-8.67
4815,-8.48
4816,-10.92
4817,-12.15
4818,-9.15
4819,-6.48
4820,-9.03
4821,-13.98
4822,-12.76
4823,-5.21
4824,-2.39
4825,-12.13
4826,-25.04
4827,-21.48
4828,4.46
4829,36.54
4830,50.00
4831,50.00
4832,50.00
4833,50.00
4834,43.86
4835,17.70
4836,-19.70
4837,-44.60
4838,-45.30
4839,-35.24
4840,-34.21
4841,-43.02
4842,-47.17
4843,-40.44
4844,-33.44
4845,-34.84
4846,-40.04
4847,-39.27
4848,-33.43
4849,-29.80
4850,-31.45
4851,-33.91
4852,-32.79
4853,-29.54
4854,-28.19
4855,-29.55
4856,-30.51
4857,-29.28
4858,-27.48
4859,-27.20
4860,-27.82
4861,-27.79
4862,-26.96
4863,-26.48
4864,-26.72
4865,-27.29
4866,-27.51
4867,-27.42
4868,-27.14
4869,-26.92
4870,-26.49
4871,-25.71
4872,-24.31
4873,-22.34
4874,-19.79
4875,-16.84
4876,-13.66
4877,-10.50
4878,-7.59
4879,-5.15
4880,-3.45
4881,-2.74
4882,-3.24
4883,-4.97
4884,-7.75
4885,-11.21
4886,-14.97
4887,-18.67
4888,-22.09
4889,-25.02
4890,-27.38
4891,-29.05
4892,-30.12
4893,-30.58
4894,-30.60
4895,-30.19
4896,-29.52
4897,-28.60
4898,-27.60
4899,-26.51
4900,-25.42
4901,-24.35
4902,-23.37
4903,-22.52
4904,-21.75
4905,-21.07
4906,-20.40
4907,-19.82
4908,-19.31
4909,-18.94
4910,-18.60
4911,-18.34
4912,-18.09
4913,-17.92
4914,-17.74
4915,-17.58
4916,-17.39
4917,-17.20
4918,-17.03
4919,-16.91
4920,-16.82
4921,-16.74
4922,-16.65
4923,-16.57
4924,-16.51
4925,-16.46
4926,-16.43
4927,-16.41
4928,-16.39
4929,-16.38
4930,-16.36
4931,-16.32
4932,-16.26
4933,-16.18
4934,-16.11
4935,-16.06
4936,-16.02
4937,-16.00
4938,-15.96
4939,-15.91
4940,-15.82
4941,-15.74
4942,-15.65
4943,-15.58
4944,-15.51
4945,-15.46
4946,-15.43
4947,-15.41
4948,-15.37
4949,-15.29
4950,-15.18
4951,-15.06
4952,-14.96
4953,-14.89
4954,-14.85
4955,-14.81
4956,-14.78
4957,-14.73
4958,-14.66
4959,-14.58
4960,-14.49
4961,-14.42
4962,-14.37
4963,-14.35
4964,-14.32
4965,-14.27
4966,-14.19
4967,-14.09
4968,-13.99
4969,-13.93
4970,-13.90
4971,-13.88
4972,-13.84
4973,-13.78
4974,-13.70
4975,-13.61
4976,-13.52
4977,-13.43
4978,-13.35
4979,-13.28
4980,-13.22
4981,-13.18
4982,-13.14
4983,-13.11
4984,-13.06
4985,-12.99
4986,-12.90
4987,-12.84
4988,-12.80
4989,-12.77
4990,-12.74
4991,-12.69
4992,-12.64
4993,-12.61
4994,-12.57
4995,-12.53
4996,-12.46
4997,-12.40
4998,-12.34
4999,-12.29
5000,-12.25
5001,-12.22
5002,-12.18
5003,-12.14
5004,-12.10
5005,-12.04
5006,-11.98
5007,-11.91
5008,-11.85
5009,-11.80
5010,-11.76
5011,-11.73
5012,-11.69
5013,-11.65
5014,-11.60
5015,-11.55
5016,-11.50
5017,-11.46
5018,-11.43
5019,-11.39
5020,-11.33
5021,-11.25
5022,-11.18
5023,-11.13
5024,-11.14
5025,-11.16
5026,-11.16
5027,-11.10
5028,-11.01
5029,-10.93
5030,-10.87
5031,-10.84
5032,-10.80
5033,-10.77
5034,-10.74
5035,-10.70
5036,-10.64
5037,-10.60
5038,-10.60
5039,-10.62
5040,-10.50
5041,-10.11
5042,-9.66
5043,-9.62
5044,-10.01
5045,-10.23
5046,-9.98
5047,-9.87
5048,-10.38
5049,-10.80
5050,-10.23
5051,-9.27
5052,-9.36
5053,-10.59
5054,-11.08
5055,-9.63
5056,-8.18
5057,-9.51
5058,-12.05
5059,-11.23
5060,-6.90
5061,-6.66
5062,-12.57
5063,-15.49
5064,-7.88
5065,0.06
5066,-7.03
5067,-24.27
5068,-28.24
5069,-5.96
5070,27.20
5071,47.30
5072,49.73
5073,49.39
5074,50.00
5075,50.00
5076,34.86
5077,-4.26
5078,-39.20
5079,-49.95
5080,-41.01
5081,-33.30
5082,-38.06
5083,-45.85
5084,-44.06
5085,-35.21
5086,-32.18
5087,-37.35
5088,-41.20
5089,-36.85
5090,-30.63
5091,-29.97
5092,-33.19
5093,-33.95
5094,-30.97
5095,-28.41
5096,-28.76
5097,-30.22
5098,-30.04
5099,-28.35
5100,-27.20
5101,-27.50
5102,-27.92
5103,-27.41
5104,-26.55
5105,-26.49
5106,-27.02
5107,-27.48
5108,-27.43
5109,-27.28
5110,-27.05
5111,-26.79
5112,-26.13
5113,-25.06
5114,-23.37
5115,-21.14
5116,-18.39
5117,-15.30
5118,-12.08
5119,-8.99
5120,-6.27
5121,-4.17
5122,-2.97
5123,-2.88
5124,-4.00
5125,-6.26
5126,-9.40
5127,-13.04
5128,-16.81
5129,-20.40
5130,-23.61
5131,-26.27
5132,-28.31
5133,-29.66
5134,-30.42
5135,-30.61
5136,-30.43
5137,-29.87
5138,-29.10
5139,-28.10
5140,-27.03
5141,-25.93
5142,-24.87
5143,-23.89
5144,-22.97
5145,-22.15
5146,-21.37
5147,-20.70
5148,-20.07
5149,-19.56
5150,-19.11
5151,-18.78
5152,-18.47
5153,-18.24
5154,-18.02
5155,-17.84
5156,-17.63
5157,-17.44
5158,-17.24
5159,-17.11
5160,-17.00
5161,-16.92
5162,-16.81
5163,-16.70
5164,-16.60
5165,-16.54
5166,-16.49
5167,-16.44
5168,-16.38
5169,-16.37
5170,-16.39
5171,-16.40
5172,-16.36
5173,-16.28
5174,-16.19
5175,-16.14
5176,-16.10
5177,-16.07
5178,-16.03
5179,-15.99
5180,-15.93
5181,-15.86
5182,-15.78
5183,-15.70
5184,-15.62
5185,-15.54
5186,-15.46
5187,-15.42
5188,-15.41
5189,-15.40
5190,-15.35
5191,-15.25
5192,-15.11
5193,-15.00
5194,-14.92
5195,-14.87
5196,-14.83
5197,-14.79
5198,-14.75
5199,-14.71
5200,-14.64
5201,-14.54
5202,-14.44
5203,-14.39
5204,-14.37
5205,-14.36
5206,-14.30
5207,-14.21
5208,-14.09
5209,-14.02
5210,-13.98
5211,-13.95
5212,-13.91
5213,-13.85
5214,-13.78
5215,-13.74
5216,-13.68
5217,-13.60
5218,-13.48
5219,-13.37
5220,-13.29
5221,-13.25
5222,-13.22
5223,-13.18
5224,-13.14
5225,-13.09
5226,-13.02
5227,-12.93
5228,-12.84
5229,-12.80
5230,-12.79
5231,-12.79
5232,-12.75
5233,-12.69
5234,-12.62
5235,-12.57
5236,-12.53
5237,-12.49
5238,-12.43
5239,-12.38
5240,-12.32
5241,-12.27
5242,-12.23
5243,-12.19
5244,-12.15
5245,-12.12
5246,-12.08
5247,-12.03
5248,-11.94
5249,-11.85
5250,-11.79
5251,-11.76
5252,-11.76
5253,-11.75
5254,-11.71
5255,-11.63
5256,-11.55
5257,-11.50
5258,-11.47
5259,-11.44
5260,-11.40
5261,-11.34
5262,-11.28
5263,-11.22
5264,-11.18
5265,-11.16
5266,-11.14
5267,-11.13
5268,-11.10
5269,-11.05
5270,-10.98
5271,-10.91
5272,-10.84
5273,-10.79
5274,-10.76
5275,-10.76
5276,-10.76
5277,-10.71
5278,-10.62
5279,-10.59
5280,-10.63
5281,-10.59
5282,-10.29
5283,-9.84
5284,-9.61
5285,-9.83
5286,-10.17
5287,-10.16
5288,-9.90
5289,-10.05
5290,-10.66
5291,-10.68
5292,-9.70
5293,-9.07
5294,-9.93
5295,-11.08
5296,-10.49
5297,-8.64
5298,-8.46
5299,-10.95
5300,-12.35
5301,-9.47
5302,-5.57
5303,-8.44
5304,-15.61
5305,-14.60
5306,-2.53
5307,2.35
5308,-14.39
5309,-35.16
5310,-27.91
5311,11.08
5312,48.52
5313,50.00
5314,45.41
5315,45.28
5316,50.00
5317,50.00
5318,24.62
5319,-26.31
5320,-50.00
5321,-50.00
5322,-35.77
5323,-33.57
5324,-43.56
5325,-47.78
5326,-40.37
5327,-32.28
5328,-33.72
5329,-39.60
5330,-40.03
5331,-33.70
5332,-29.37
5333,-31.26
5334,-34.21
5335,-32.90
5336,-29.27
5337,-28.16
5338,-29.62
5339,-30.40
5340,-29.13
5341,-27.57
5342,-27.27
5343,-27.81
5344,-27.75
5345,-26.93
5346,-26.31
5347,-26.65
5348,-27.31
5349,-27.61
5350,-27.38
5351,-27.15
5352,-26.89
5353,-26.50
5354,-25.63
5355,-24.30
5356,-22.35
5357,-19.85
5358,-16.88
5359,-13.68
5360,-10.51
5361,-7.58
5362,-5.15
5363,-3.45
5364,-2.78
5365,-3.30
5366,-5.03
5367,-7.77
5368,-11.19
5369,-14.92
5370,-18.64
5371,-22.07
5372,-25.02
5373,-27.33
5374,-29.03
5375,-30.07
5376,-30.58
5377,-30.57
5378,-30.19
5379,-29.48
5380,-28.59
5381,-27.56
5382,-26.49
5383,-25.40
5384,-24.37
5385,-23.43
5386,-22.57
5387,-21.79
5388,-21.03
5389,-20.38
5390,-19.78
5391,-19.33
5392,-18.93
5393,-18.64
5394,-18.35
5395,-18.13
5396,-17.92
5397,-17.75
5398,-17.55
5399,-17.36
5400,-17.17
5401,-17.04
5402,-16.93
5403,-16.84
5404,-16.74
5405,-16.65
5406,-16.57
5407,-16.52
5408,-16.47
5409,-16.44
5410,-16.42
5411,-16.42
5412,-16.41
5413,-16.37
5414,-16.29
5415,-16.20
5416,-16.14
5417,-16.10
5418,-16.08
5419,-16.06
5420,-16.03
5421,-15.99
5422,-15.92
5423,-15.83
5424,-15.72
5425,-15.64
5426,-15.60
5427,-15.56
5428,-15.49
5429,-15.41
5430,-15.34
5431,-15.32
5432,-15.30
5433,-15.22
5434,-15.09
5435,-14.96
5436,-14.88
5437,-14.86
5438,-14.83
5439,-14.78
5440,-14.71
5441,-14.64
5442,-14.58
5443,-14.50
5444,-14.43
5445,-14.38
5446,-14.37
5447,-14.35
5448,-14.28
5449,-14.16
5450,-14.04
5451,-13.98
5452,-13.97
5453,-13.96
5454,-13.90
5455,-13.82
5456,-13.75
5457,-13.69
5458,-13.64
5459,-13.56
5460,-13.45
5461,-13.34
5462,-13.24
5463,-13.19
5464,-13.17
5465,-13.17
5466,-13.14
5467,-13.08
5468,-12.97
5469,-12.88
5470,-12.82
5471,-12.81
5472,-12.81
5473,-12.78
5474,-12.71
5475,-12.64
5476,-12.59
5477,-12.56
5478,-12.52
5479,-12.46
5480,-12.39
5481,-12.34
5482,-12.32
5483,-12.29
5484,-12.25
5485,-12.18
5486,-12.11
5487,-12.07
5488,-12.03
5489,-11.98
5490,-11.90
5491,-11.81
5492,-11.76
5493,-11.75
5494,-11.75
5495,-11.74
5496,-11.68
5497,-11.61
5498,-11.54
5499,-11.50
5500,-11.45
5501,-11.40
5502,-11.34
5503,-11.29
5504,-11.25
5505,-11.22
5506,-11.19
5507,-11.18
5508,-11.16
5509,-11.14
5510,-11.08
5511,-11.01
5512,-10.93
5513,-10.88
5514,-10.83
5515,-10.79
5516,-10.75
5517,-10.75
5518,-10.73
5519,-10.66
5520,-10.55
5521,-10.56
5522,-10.64
5523,-10.51
5524,-10.06
5525,-9.64
5526,-9.68
5527,-10.05
5528,-10.22
5529,-10.00
5530,-9.90
5531,-10.33
5532,-10.78
5533,-10.32
5534,-9.29
5535,-9.31
5536,-10.62
5537,-11.12
5538,-9.56
5539,-8.12
5540,-9.46
5541,-12.01
5542,-11.33
5543,-7.61
5544,-6.21
5545,-11.26
5546,-16.03
5547,-10.84
5548,0.09
5549,-1.59
5550,-21.50
5551,-35.58
5552,-17.27
5553,25.84
5554,50.00
5555,50.00
5556,47.42
5557,46.35
5558,50.00
5559,39.40
5560,2.32
5561,-35.95
5562,-50.00
5563,-41.76
5564,-34.00
5565,-39.09
5566,-47.10
5567,-45.04
5568,-36.47
5569,-32.87
5570,-37.08
5571,-40.22
5572,-36.94
5573,-31.11
5574,-29.87
5575,-32.84
5576,-34.03
5577,-31.18
5578,-28.25
5579,-28.67
5580,-30.32
5581,-30.05
5582,-28.17
5583,-27.16
5584,-27.52
5585,-27.91
5586,-27.37
5587,-26.60
5588,-26.42
5589,-26.97
5590,-27.46
5591,-27.55
5592,-27.25
5593,-27.04
5594,-26.74
5595,-26.16
5596,-25.02
5597,-23.37
5598,-21.14
5599,-18.42
5600,-15.33
5601,-12.11
5602,-9.02
5603,-6.29
5604,-4.20
5605,-2.98
5606,-2.89
5607,-4.02
5608,-6.29
5609,-9.42
5610,-13.04
5611,-16.78
5612,-20.37
5613,-23.57
5614,-26.24
5615,-28.25
5616,-29.64
5617,-30.38
5618,-30.64
5619,-30.41
5620,-29.88
5621,-29.05
5622,-28.09
5623,-27.01
5624,-25.92
5625,-24.84
5626,-23.84
5627,-22.96
5628,-22.15
5629,-21.43
5630,-20.72
5631,-20.10
5632,-19.54
5633,-19.11
5634,-18.74
5635,-18.47
5636,-18.23
5637,-18.05
5638,-17.84
5639,-17.65
5640,-17.44
5641,-17.26
5642,-17.10
5643,-16.99
5644,-16.87
5645,-16.77
5646,-16.66
5647,-16.59
5648,-16.53
5649,-16.49
5650,-16.45
5651,-16.42
5652,-16.40
5653,-16.40
5654,-16.39
5655,-16.35
5656,-16.27
5657,-16.18
5658,-16.11
5659,-16.07
5660,-16.05
5661,-16.03
5662,-15.99
5663,-15.93
5664,-15.86
5665,-15.78
5666,-15.70
5667,-15.63
5668,-15.56
5669,-15.51
5670,-15.46
5671,-15.43
5672,-15.38
5673,-15.32
5674,-15.22
5675,-15.12
5676,-15.00
5677,-14.91
5678,-14.86
5679,-14.83
5680,-14.80
5681,-14.76
5682,-14.70
5683,-14.62
5684,-14.54
5685,-14.46
5686,-14.38
5687,-14.35
5688,-14.33
5689,-14.31
5690,-14.24
5691,-14.13
5692,-14.02
5693,-13.97
5694,-13.96
5695,-13.94
5696,-13.89
5697,-13.81
5698,-13.72
5699,-13.64
5700,-13.56
5701,-13.48
5702,-13.38
5703,-13.29
5704,-13.22
5705,-13.18
5706,-13.15
5707,-13.15
5708,-13.12
5709,-13.05
5710,-12.95
5711,-12.85
5712,-12.79
5713,-12.78
5714,-12.78
5715,-12.74
5716,-12.66
5717,-12.59
5718,-12.55
5719,-12.54
5720,-12.52
5721,-12.46
5722,-12.38
5723,-12.32
5724,-12.28
5725,-12.27
5726,-12.22
5727,-12.16
5728,-12.09
5729,-12.05
5730,-12.01
5731,-11.95
5732,-11.87
5733,-11.79
5734,-11.74
5735,-11.73
5736,-11.72
5737,-11.69
5738,-11.64
5739,-11.58
5740,-11.52
5741,-11.47
5742,-11.42
5743,-11.37
5744,-11.33
5745,-11.28
5746,-11.22
5747,-11.18
5748,-11.16
5749,-11.18
5750,-11.18
5751,-11.13
5752,-11.02
5753,-10.91
5754,-10.85
5755,-10.84
5756,-10.83
5757,-10.80
5758,-10.75
5759,-10.71
5760,-10.68
5761,-10.63
5762,-10.58
5763,-10.60
5764,-10.60
5765,-10.31
5766,-9.80
5767,-9.55
5768,-9.83
5769,-10.20
5770,-10.12
5771,-9.86
5772,-10.07
5773,-10.64
5774,-10.63
5775,-9.76
5776,-9.12
5777,-9.88
5778,-11.08
5779,-10.57
5780,-8.65
5781,-8.47
5782,-10.91
5783,-12.14
5784,-9.15
5785,-6.48
5786,-9.02
5787,-13.97
5788,-12.75
5789,-5.20
5790,-2.38
5791,-12.12
5792,-25.02
5793,-21.47
5794,4.46
5795,36.53
5796,50.00
5797,50.00
5798,50.00
5799,50.00
5800,43.87
5801,17.72
5802,-19.70
5803,-44.60
5804,-45.26
5805,-35.14
5806,-34.12
5807,-42.98
5808,-47.16
5809,-40.41
5810,-33.37
5811,-34.77
5812,-39.98
5813,-39.22
5814,-33.39
5815,-29.75
5816,-31.41
5817,-33.87
5818,-32.75
5819,-29.50
5820,-28.14
5821,-29.50
5822,-30.47
5823,-29.24
5824,-27.45
5825,-27.17
5826,-27.79
5827,-27.76
5828,-26.93
5829,-26.44
5830,-26.68
5831,-27.26
5832,-27.48
5833,-27.40
5834,-27.11
5835,-26.89
5836,-26.46
5837,-25.70
5838,-24.31
5839,-22.35
5840,-19.81
5841,-16.87
5842,-13.70
5843,-10.54
5844,-7.63
5845,-5.20
5846,-3.49
5847,-2.78
5848,-3.27
5849,-4.99
5850,-7.75
5851,-11.19
5852,-14.93
5853,-18.62
5854,-22.03
5855,-24.97
5856,-27.33
5857,-29.01
5858,-30.07
5859,-30.53
5860,-30.55
5861,-30.15
5862,-29.48
5863,-28.57
5864,-27.58
5865,-26.50
5866,-25.41
5867,-24.34
5868,-23.35
5869,-22.51
5870,-21.74
5871,-21.07
5872,-20.41
5873,-19.83
5874,-19.31
5875,-18.93
5876,-18.60
5877,-18.34
5878,-18.10
5879,-17.92
5880,-17.74
5881,-17.57
5882,-17.37
5883,-17.19
5884,-17.02
5885,-16.91
5886,-16.82
5887,-16.74
5888,-16.64
5889,-16.57
5890,-16.51
5891,-16.47
5892,-16.43
5893,-16.41
5894,-16.39
5895,-16.38
5896,-16.36
5897,-16.32
5898,-16.26
5899,-16.19
5900,-16.12
5901,-16.06
5902,-16.02
5903,-16.00
5904,-15.96
5905,-15.91
5906,-15.82
5907,-15.73
5908,-15.64
5909,-15.57
5910,-15.51
5911,-15.46
5912,-15.42
5913,-15.40
5914,-15.35
5915,-15.28
5916,-15.17
5917,-15.06
5918,-14.96
5919,-14.89
5920,-14.84
5921,-14.81
5922,-14.77
5923,-14.73
5924,-14.66
5925,-14.58
5926,-14.49
5927,-14.42
5928,-14.37
5929,-14.35
5930,-14.32
5931,-14.27
5932,-14.18
5933,-14.08
5934,-13.99
5935,-13.94
5936,-13.90
5937,-13.88
5938,-13.83
5939,-13.77
5940,-13.69
5941,-13.61
5942,-13.52
5943,-13.43
5944,-13.34
5945,-13.27
5946,-13.21
5947,-13.17
5948,-13.14
5949,-13.11
5950,-13.05
5951,-12.98
5952,-12.90
5953,-12.84
5954,-12.79
5955,-12.77
5956,-12.73
5957,-12.68
5958,-12.64
5959,-12.60
5960,-12.57
5961,-12.53
5962,-12.47
5963,-12.41
5964,-12.34
5965,-12.29
5966,-12.25
5967,-12.22
5968,-12.18
5969,-12.14
5970,-12.09
5971,-12.04
5972,-11.98
5973,-11.92
5974,-11.85
5975,-11.80
5976,-11.75
5977,-11.71
5978,-11.68
5979,-11.64
5980,-11.59
5981,-11.54
5982,-11.49
5983,-11.46
5984,-11.43
5985,-11.40
5986,-11.33
5987,-11.25
5988,-11.16
5989,-11.13
5990,-11.13
5991,-11.16
5992,-11.15
5993,-11.09
5994,-11.00
5995,-10.92
5996,-10.87
5997,-10.83
5998,-10.80
5999,-10.77
6000,-10.74
6001,-10.70
6002,-10.64
6003,-10.59
6004,-10.59
6005,-10.61
6006,-10.49
6007,-10.10
6008,-9.65
6009,-9.60
6010,-9.99
6011,-10.21
6012,-9.97
6013,-9.87
6014,-10.38
6015,-10.80
6016,-10.23
6017,-9.26
6018,-9.36
6019,-10.59
6020,-11.07
6021,-9.62
6022,-8.17
6023,-9.49
6024,-12.04
6025,-11.22
6026,-6.89
6027,-6.65
6028,-12.56
6029,-15.48
6030,-7.88
6031,0.07
6032,-7.01
6033,-24.25
6034,-28.23
6035,-5.95
6036,27.20
6037,47.30
6038,49.74
6039,49.39
6040,50.00
6041,50.00
6042,34.87
6043,-4.25
6044,-39.18
6045,-49.93
6046,-40.95
6047,-33.22
6048,-38.00
6049,-45.82
6050,-44.04
6051,-35.17
6052,-32.12
6053,-37.28
6054,-41.15
6055,-36.81
6056,-30.60
6057,-29.93
6058,-33.16
6059,-33.91
6060,-30.93
6061,-28.38
6062,-28.72
6063,-30.19
6064,-30.01
6065,-28.32
6066,-27.17
6067,-27.47
6068,-27.89
6069,-27.39
6070,-26.53
6071,-26.47
6072,-27.00
6073,-27.46
6074,-27.41
6075,-27.26
6076,-27.04
6077,-26.77
6078,-26.12
6079,-25.05
6080,-23.38
6081,-21.16
6082,-18.41
6083,-15.33
6084,-12.13
6085,-9.04
6086,-6.33
6087,-4.23
6088,-3.03
6089,-2.93
6090,-4.04
6091,-6.27
6092,-9.40
6093,-13.02
6094,-16.78
6095,-20.36
6096,-23.57
6097,-26.21
6098,-28.26
6099,-29.61
6100,-30.38
6101,-30.58
6102,-30.39
6103,-29.84
6104,-29.07
6105,-28.08
6106,-27.02
6107,-25.92
6108,-24.86
6109,-23.88
6110,-22.96
6111,-22.15
6112,-21.38
6113,-20.70
6114,-20.07
6115,-19.56
6116,-19.12
6117,-18.79
6118,-18.48
6119,-18.24
6120,-18.02
6121,-17.84
6122,-17.63
6123,-17.44
6124,-17.24
6125,-17.10
6126,-17.00
6127,-16.92
6128,-16.81
6129,-16.70
6130,-16.60
6131,-16.54
6132,-16.49
6133,-16.43
6134,-16.38
6135,-16.38
6136,-16.39
6137,-16.41
6138,-16.37
6139,-16.29
6140,-16.20
6141,-16.14
6142,-16.11
6143,-16.08
6144,-16.04
6145,-15.99
6146,-15.93
6147,-15.86
6148,-15.78
6149,-15.70
6150,-15.62
6151,-15.54
6152,-15.46
6153,-15.42
6154,-15.40
6155,-15.39
6156,-15.34
6157,-15.24
6158,-15.10
6159,-14.99
6160,-14.92
6161,-14.87
6162,-14.82
6163,-14.79
6164,-14.75
6165,-14.71
6166,-14.63
6167,-14.53
6168,-14.44
6169,-14.39
6170,-14.37
6171,-14.36
6172,-14.30
6173,-14.20
6174,-14.09
6175,-14.02
6176,-13.98
6177,-13.95
6178,-13.91
6179,-13.84
6180,-13.78
6181,-13.73
6182,-13.68
6183,-13.59
6184,-13.48
6185,-13.37
6186,-13.29
6187,-13.25
6188,-13.21
6189,-13.18
6190,-13.13
6191,-13.09
6192,-13.02
6193,-12.93
6194,-12.84
6195,-12.79
6196,-12.78
6197,-12.78
6198,-12.74
6199,-12.68
6200,-12.61
6201,-12.56
6202,-12.52
6203,-12.49
6204,-12.43
6205,-12.38
6206,-12.32
6207,-12.27
6208,-12.23
6209,-12.19
6210,-12.15
6211,-12.12
6212,-12.09
6213,-12.03
6214,-11.95
6215,-11.85
6216,-11.78
6217,-11.76
6218,-11.76
6219,-11.75
6220,-11.70
6221,-11.63
6222,-11.55
6223,-11.49
6224,-11.46
6225,-11.44
6226,-11.40
6227,-11.34
6228,-11.28
6229,-11.22
6230,-11.17
6231,-11.15
6232,-11.13
6233,-11.11
6234,-11.08
6235,-11.04
6236,-10.98
6237,-10.91
6238,-10.84
6239,-10.78
6240,-10.75
6241,-10.76
6242,-10.76
6243,-10.71
6244,-10.61
6245,-10.58
6246,-10.62
6247,-10.58
6248,-10.28
6249,-9.83
6250,-9.60
6251,-9.81
6252,-10.16
6253,-10.15
6254,-9.89
6255,-10.05
6256,-10.65
6257,-10.67
6258,-9.69
6259,-9.06
6260,-9.93
6261,-11.08
6262,-10.49
6263,-8.63
6264,-8.45
6265,-10.94
6266,-12.34
6267,-9.47
6268,-5.56
6269,-8.43
6270,-15.61
6271,-14.60
6272,-2.53
6273,2.35
6274,-14.38
6275,-35.15
6276,-27.90
6277,11.08
6278,48.52
6279,50.00
6280,45.40
6281,45.28
6282,50.00
6283,50.00
6284,24.63
6285,-26.31
6286,-50.00
6287,-50.00
6288,-35.72
6289,-33.51
6290,-43.51
6291,-47.75
6292,-40.34
6293,-32.24
6294,-33.68
6295,-39.55
6296,-39.99
6297,-33.67
6298,-29.34
6299,-31.23
6300,-34.19
6301,-32.87
6302,-29.25
6303,-28.14
6304,-29.60
6305,-30.38
6306,-29.10
6307,-27.54
6308,-27.24
6309,-27.78
6310,-27.73
6311,-26.92
6312,-26.30
6313,-26.64
6314,-27.30
6315,-27.60
6316,-27.37
6317,-27.15
6318,-26.89
6319,-26.49
6320,-25.62
6321,-24.30
6322,-22.36
6323,-19.87
6324,-16.91
6325,-13.73
6326,-10.56
6327,-7.64
6328,-5.22
6329,-3.53
6330,-2.85
6331,-3.35
6332,-5.06
6333,-7.78
6334,-11.18
6335,-14.90
6336,-18.61
6337,-22.02
6338,-24.97
6339,-27.29
6340,-28.98
6341,-30.03
6342,-30.55
6343,-30.55
6344,-30.18
6345,-29.47
6346,-28.58
6347,-27.54
6348,-26.47
6349,-25.40
6350,-24.37
6351,-23.43
6352,-22.57
6353,-21.79
6354,-21.04
6355,-20.39
6356,-19.79
6357,-19.33
6358,-18.93
6359,-18.64
6360,-18.36
6361,-18.15
6362,-17.94
6363,-17.75
6364,-17.55
6365,-17.36
6366,-17.18
6367,-17.05
6368,-16.93
6369,-16.84
6370,-16.74
6371,-16.65
6372,-16.57
6373,-16.53
6374,-16.48
6375,-16.45
6376,-16.42
6377,-16.42
6378,-16.41
6379,-16.38
6380,-16.30
6381,-16.22
6382,-16.15
6383,-16.11
6384,-16.09
6385,-16.07
6386,-16.03
6387,-15.99
6388,-15.93
6389,-15.84
6390,-15.73
6391,-15.65
6392,-15.60
6393,-15.56
6394,-15.49
6395,-15.41
6396,-15.34
6397,-15.32
6398,-15.29
6399,-15.22
6400,-15.09
6401,-14.96
6402,-14.88
6403,-14.86
6404,-14.83
6405,-14.78
6406,-14.70
6407,-14.64
6408,-14.57
6409,-14.50
6410,-14.42
6411,-14.38
6412,-14.36
6413,-14.35
6414,-14.28
6415,-14.16
6416,-14.04
6417,-13.98
6418,-13.96
6419,-13.95
6420,-13.90
6421,-13.82
6422,-13.74
6423,-13.69
6424,-13.63
6425,-13.56
6426,-13.45
6427,-13.33
6428,-13.23
6429,-13.18
6430,-13.16
6431,-13.16
6432,-13.14
6433,-13.07
6434,-12.97
6435,-12.88
6436,-12.83
6437,-12.81
6438,-12.80
6439,-12.76
6440,-12.70
6441,-12.63
6442,-12.58
6443,-12.56
6444,-12.52
6445,-12.46
6446,-12.39
6447,-12.35
6448,-12.32
6449,-12.30
6450,-12.25
6451,-12.18
6452,-12.12
6453,-12.08
6454,-12.04
6455,-11.99
6456,-11.90
6457,-11.81
6458,-11.75
6459,-11.74
6460,-11.75
6461,-11.74
6462,-11.68
6463,-11.61
6464,-11.54
6465,-11.50
6466,-11.46
6467,-11.41
6468,-11.35
6469,-11.29
6470,-11.25
6471,-11.21
6472,-11.19
6473,-11.18
6474,-11.16
6475,-11.12
6476,-11.06
6477,-11.00
6478,-10.94
6479,-10.89
6480,-10.84
6481,-10.79
6482,-10.76
6483,-10.75
6484,-10.74
6485,-10.66
6486,-10.55
6487,-10.56
6488,-10.63
6489,-10.51
6490,-10.05
6491,-9.64
6492,-9.67
6493,-10.04
6494,-10.21
6495,-9.99
6496,-9.89
6497,-10.33
6498,-10.78
6499,-10.31
6500,-9.29
6501,-9.31
6502,-10.61
6503,-11.11
6504,-9.56
6505,-8.13
6506,-9.47
6507,-12.02
6508,-11.34
6509,-7.61
6510,-6.20
6511,-11.25
6512,-16.04
6513,-10.86
6514,0.08
6515,-1.59
6516,-21.49
6517,-35.57
6518,-17.27
6519,25.83
6520,50.00
6521,50.00
6522,47.42
6523,46.35
6524,50.00
6525,39.42
6526,2.33
6527,-35.95
6528,-49.98
6529,-41.71
6530,-33.94
6531,-39.05
6532,-47.07
6533,-45.01
6534,-36.43
6535,-32.82
6536,-37.04
6537,-40.19
6538,-36.92
6539,-31.09
6540,-29.86
6541,-32.82
6542,-34.01
6543,-31.17
6544,-28.25
6545,-28.66
6546,-30.31
6547,-30.03
6548,-28.15
6549,-27.15
6550,-27.52
6551,-27.91
6552,-27.37
6553,-26.60
6554,-26.42
6555,-26.97
6556,-27.46
6557,-27.54
6558,-27.25
6559,-27.04
6560,-26.73
6561,-26.17
6562,-25.02
6563,-23.38
6564,-21.16
6565,-18.46
6566,-15.38
6567,-12.17
6568,-9.08
6569,-6.36
6570,-4.27
6571,-3.05
6572,-2.95
6573,-4.07
6574,-6.32
6575,-9.43
6576,-13.03
6577,-16.77
6578,-20.35
6579,-23.54
6580,-26.20
6581,-28.21
6582,-29.60
6583,-30.35
6584,-30.62
6585,-30.40
6586,-29.87
6587,-29.04
6588,-28.08
6589,-27.01
6590,-25.93
6591,-24.86
6592,-23.86
6593,-22.97
6594,-22.16
6595,-21.43
6596,-20.73
6597,-20.12
6598,-19.55
6599,-19.11
6600,-18.75
6601,-18.49
6602,-18.25
6603,-18.07
6604,-17.85
6605,-17.66
6606,-17.45
6607,-17.28
6608,-17.12
6609,-17.00
6610,-16.88
6611,-16.78
6612,-16.67
6613,-16.60
6614,-16.55
6615,-16.51
6616,-16.47
6617,-16.43
6618,-16.41
6619,-16.41
6620,-16.40
6621,-16.37
6622,-16.29
6623,-16.20
6624,-16.13
6625,-16.09
6626,-16.06
6627,-16.04
6628,-16.00
6629,-15.94
6630,-15.87
6631,-15.79
6632,-15.71
6633,-15.64
6634,-15.57
6635,-15.52
6636,-15.48
6637,-15.43
6638,-15.38
6639,-15.31
6640,-15.22
6641,-15.12
6642,-15.01
6643,-14.92
6644,-14.86
6645,-14.83
6646,-14.80
6647,-14.76
6648,-14.70
6649,-14.62
6650,-14.54
6651,-14.46
6652,-14.38
6653,-14.34
6654,-14.33
6655,-14.31
6656,-14.24
6657,-14.13
6658,-14.02
6659,-13.97
6660,-13.95
6661,-13.94
6662,-13.89
6663,-13.81
6664,-13.72
6665,-13.64
6666,-13.56
6667,-13.48
6668,-13.39
6669,-13.30
6670,-13.22
6671,-13.18
6672,-13.16
6673,-13.15
6674,-13.12
6675,-13.06
6676,-12.95
6677,-12.86
6678,-12.80
6679,-12.79
6680,-12.78
6681,-12.74
6682,-12.66
6683,-12.59
6684,-12.55
6685,-12.54
6686,-12.52
6687,-12.47
6688,-12.39
6689,-12.32
6690,-12.29
6691,-12.27
6692,-12.23
6693,-12.17
6694,-12.11
6695,-12.06
6696,-12.02
6697,-11.96
6698,-11.87
6699,-11.79
6700,-11.74
6701,-11.73
6702,-11.73
6703,-11.70
6704,-11.65
6705,-11.59
6706,-11.53
6707,-11.48
6708,-11.43
6709,-11.39
6710,-11.35
6711,-11.29
6712,-11.23
6713,-11.18
6714,-11.17
6715,-11.18
6716,-11.18
6717,-11.12
6718,-11.02
6719,-10.92
6720,-10.87
6721,-10.86
6722,-10.85
6723,-10.82
6724,-10.76
6725,-10.73
6726,-10.69
6727,-10.64
6728,-10.59
6729,-10.61
6730,-10.60
6731,-10.31
6732,-9.80
6733,-9.55
6734,-9.84
6735,-10.21
6736,-10.12
6737,-9.86
6738,-10.08
6739,-10.65
6740,-10.65
6741,-9.77
6742,-9.13
6743,-9.88
6744,-11.08
6745,-10.58
6746,-8.67
6747,-8.48
6748,-10.92
6749,-12.15
6750,-9.16
6751,-6.48
6752,-9.03
6753,-13.98
6754,-12.77
6755,-5.22
6756,-2.39
6757,-12.12
6758,-25.02
6759,-21.48
6760,4.44
6761,36.53
6762,50.00
6763,50.00
6764,50.00
6765,50.00
6766,43.89
6767,17.73
6768,-19.70
6769,-44.60
6770,-45.23
6771,-35.08
6772,-34.06
6773,-42.95
6774,-47.15
6775,-40.39
6776,-33.33
6777,-34.72
6778,-39.95
6779,-39.20
6780,-33.37
6781,-29.74
6782,-31.40
6783,-33.86
6784,-32.75
6785,-29.50
6786,-28.15
6787,-29.51
6788,-30.46
6789,-29.23
6790,-27.44
6791,-27.17
6792,-27.79
6793,-27.76
6794,-26.93
6795,-26.45
6796,-26.69
6797,-27.27
6798,-27.49
6799,-27.40
6800,-27.11
6801,-26.89
6802,-26.47
6803,-25.71
6804,-24.32
6805,-22.37
6806,-19.85
6807,-16.92
6808,-13.76
6809,-10.61
6810,-7.71
6811,-5.27
6812,-3.58
6813,-2.86
6814,-3.35
6815,-5.04
6816,-7.79
6817,-11.21
6818,-14.93
6819,-18.61
6820,-22.00
6821,-24.93
6822,-27.29
6823,-28.96
6824,-30.03
6825,-30.50
6826,-30.53
6827,-30.13
6828,-29.47
6829,-28.56
6830,-27.57
6831,-26.50
6832,-25.42
6833,-24.36
6834,-23.38
6835,-22.53
6836,-21.76
6837,-21.09
6838,-20.42
6839,-19.85
6840,-19.33
6841,-18.95
6842,-18.61
6843,-18.37
6844,-18.13
6845,-17.95
6846,-17.76
6847,-17.59
6848,-17.39
6849,-17.20
6850,-17.03
6851,-16.92
6852,-16.83
6853,-16.75
6854,-16.66
6855,-16.60
6856,-16.53
6857,-16.48
6858,-16.44
6859,-16.41
6860,-16.40
6861,-16.39
6862,-16.38
6863,-16.34
6864,-16.28
6865,-16.20
6866,-16.13
6867,-16.08
6868,-16.04
6869,-16.01
6870,-15.97
6871,-15.91
6872,-15.82
6873,-15.74
6874,-15.65
6875,-15.58
6876,-15.52
6877,-15.47
6878,-15.44
6879,-15.41
6880,-15.37
6881,-15.29
6882,-15.18
6883,-15.07
6884,-14.96
6885,-14.89
6886,-14.84
6887,-14.81
6888,-14.78
6889,-14.74
6890,-14.67
6891,-14.58
6892,-14.49
6893,-14.42
6894,-14.37
6895,-14.36
6896,-14.33
6897,-14.28
6898,-14.19
6899,-14.09
6900,-13.99
6901,-13.94
6902,-13.91
6903,-13.89
6904,-13.84
6905,-13.78
6906,-13.70
6907,-13.62
6908,-13.53
6909,-13.44
6910,-13.35
6911,-13.28
6912,-13.22
6913,-13.19
6914,-13.16
6915,-13.13
6916,-13.07
6917,-13.00
6918,-12.92
6919,-12.85
6920,-12.81
6921,-12.78
6922,-12.74
6923,-12.69
6924,-12.64
6925,-12.61
6926,-12.58
6927,-12.54
6928,-12.48
6929,-12.41
6930,-12.35
6931,-12.31
6932,-12.27
6933,-12.24
6934,-12.21
6935,-12.16
6936,-12.11
6937,-12.06
6938,-11.99
6939,-11.92
6940,-11.86
6941,-11.81
6942,-11.77
6943,-11.74
6944,-11.70
6945,-11.66
6946,-11.61
6947,-11.56
6948,-11.51
6949,-11.49
6950,-11.46
6951,-11.43
6952,-11.36
6953,-11.26
6954,-11.18
6955,-11.15
6956,-11.15
6957,-11.17
6958,-11.16
6959,-11.10
6960,-11.01
6961,-10.95
6962,-10.90
6963,-10.86
6964,-10.82
6965,-10.78
6966,-10.76
6967,-10.72
6968,-10.66
6969,-10.61
6970,-10.60
6971,-10.62
6972,-10.50
6973,-10.11
6974,-9.66
6975,-9.62
6976,-10.01
6977,-10.23
6978,-9.99
6979,-9.88
6980,-10.39
6981,-10.81
6982,-10.25
6983,-9.28
6984,-9.38
6985,-10.60
6986,-11.09
6987,-9.64
6988,-8.19
6989,-9.52
6990,-12.06
6991,-11.24
6992,-6.92
6993,-6.66
6994,-12.58
6995,-15.49
6996,-7.90
6997,0.05
6998,-7.03
6999,-24.26
7000,-28.24
7001,-5.96
7002,27.19
7003,47.29
7004,49.74
7005,49.39
7006,50.00
7007,50.00
7008,34.87
7009,-4.24
7010,-39.17
7011,-49.91
7012,-40.92
7013,-33.17
7014,-37.95
7015,-45.79
7016,-44.03
7017,-35.14
7018,-32.08
7019,-37.24
7020,-41.11
7021,-36.78
7022,-30.58
7023,-29.92
7024,-33.15
7025,-33.91
7026,-30.93
7027,-28.38
7028,-28.73
7029,-30.19
7030,-30.01
7031,-28.31
7032,-27.16
7033,-27.47
7034,-27.89
7035,-27.40
7036,-26.54
7037,-26.47
7038,-27.01
7039,-27.47
7040,-27.42
7041,-27.26
7042,-27.04
7043,-26.77
7044,-26.13
7045,-25.07
7046,-23.40
7047,-21.19
7048,-18.45
7049,-15.39
7050,-12.19
7051,-9.11
7052,-6.40
7053,-4.32
7054,-3.12
7055,-3.01
7056,-4.10
7057,-6.32
7058,-9.42
7059,-13.02
7060,-16.77
7061,-20.34
7062,-23.54
7063,-26.18
7064,-28.21
7065,-29.57
7066,-30.34
7067,-30.55
7068,-30.38
7069,-29.83
7070,-29.05
7071,-28.07
7072,-27.01
7073,-25.93
7074,-24.88
7075,-23.90
7076,-22.99
7077,-22.16
7078,-21.39
7079,-20.71
7080,-20.08
7081,-19.57
7082,-19.13
7083,-18.81
7084,-18.51
7085,-18.27
7086,-18.04
7087,-17.86
7088,-17.66
7089,-17.46
7090,-17.26
7091,-17.12
7092,-17.01
7093,-16.93
7094,-16.83
7095,-16.72
7096,-16.63
7097,-16.57
7098,-16.51
7099,-16.45
7100,-16.40
7101,-16.39
7102,-16.41
7103,-16.43
7104,-16.39
7105,-16.31
7106,-16.22
7107,-16.16
7108,-16.12
7109,-16.10
7110,-16.06
7111,-16.00
7112,-15.93
7113,-15.86
7114,-15.78
7115,-15.71
7116,-15.63
7117,-15.55
7118,-15.48
7119,-15.44
7120,-15.43
7121,-15.42
7122,-15.36
7123,-15.25
7124,-15.11
7125,-14.99
7126,-14.92
7127,-14.87
7128,-14.83
7129,-14.79
7130,-14.76
7131,-14.72
7132,-14.64
7133,-14.55
7134,-14.45
7135,-14.40
7136,-14.38
7137,-14.36
7138,-14.31
7139,-14.22
7140,-14.11
7141,-14.03
7142,-13.99
7143,-13.97
7144,-13.92
7145,-13.86
7146,-13.79
7147,-13.74
7148,-13.69
7149,-13.60
7150,-13.48
7151,-13.37
7152,-13.29
7153,-13.26
7154,-13.23
7155,-13.20
7156,-13.16
7157,-13.11
7158,-13.04
7159,-12.95
7160,-12.87
7161,-12.82
7162,-12.80
7163,-12.80
7164,-12.76
7165,-12.70
7166,-12.62
7167,-12.58
7168,-12.54
7169,-12.50
7170,-12.45
7171,-12.39
7172,-12.34
7173,-12.30
7174,-12.26
7175,-12.22
7176,-12.18
7177,-12.15
7178,-12.11
7179,-12.05
7180,-11.97
7181,-11.87
7182,-11.80
7183,-11.78
7184,-11.78
7185,-11.78
7186,-11.73
7187,-11.65
7188,-11.57
7189,-11.57
7190,-11.53
7191,-11.45
7192,-11.34
7193,-11.65
7194,-11.69
7195,-10.99
7196,-10.20
7197,-11.37
7198,-13.47
7199,-11.85
7200,-5.69
