1,153.16
2,204.86
3,181.43
4,127.97
5,93.07
6,77.65
7,53.58
8,12.94
9,-34.32
10,-76.29
11,-106.89
12,-116.45
13,-96.02
14,-43.43
15,33.97
16,116.68
17,184.96
18,225.14
19,241.13
20,239.69
21,222.91
22,186.61
23,133.76
24,76.45
25,23.86
26,-22.35
27,-66.22
28,-105.96
29,-135.98
30,-150.47
31,-145.42
32,-121.62
33,-81.92
34,-35.38
35,9.21
36,42.22
37,59.56
38,60.78
39,50.49
40,35.21
41,21.05
42,12.63
43,10.48
44,13.95
45,19.23
46,24.10
47,25.97
48,24.95
49,21.86
50,18.26
51,15.66
52,14.37
53,14.47
54,15.25
55,16.16
56,16.68
57,16.59
58,16.01
59,15.27
60,14.65
61,14.31
62,14.12
63,14.03
64,13.94
65,13.86
66,13.84
67,13.87
68,13.99
69,14.19
70,14.49
71,14.91
72,15.47
73,16.13
74,16.81
75,17.42
76,17.92
77,18.31
78,18.56
79,18.71
80,18.79
81,18.79
82,18.68
83,18.42
84,17.98
85,17.41
86,16.73
87,15.98
88,15.18
89,14.44
90,13.81
91,13.36
92,13.05
93,12.89
94,12.83
95,12.84
96,12.82
97,12.77
98,12.70
99,12.67
100,12.66
101,12.67
102,12.66
103,12.60
104,12.48
105,12.30
106,12.08
107,11.83
108,11.60
109,11.42
110,11.34
111,11.38
112,11.48
113,11.64
114,11.80
115,11.93
116,11.96
117,11.84
118,11.57
119,11.17
120,10.70
121,10.26
122,9.87
123,9.57
124,9.35
125,9.20
126,9.13
127,9.13
128,9.16
129,9.20
130,9.24
131,9.27
132,9.26
133,9.25
134,9.22
135,9.19
136,9.11
137,8.97
138,8.75
139,8.48
140,8.16
141,7.80
142,7.43
143,7.06
144,6.71
145,6.38
146,6.12
147,5.97
148,5.94
149,6.03
150,6.25
151,6.58
152,6.97
153,7.34
154,7.62
155,7.74
156,7.66
157,7.42
158,7.10
159,6.82
160,6.63
161,6.57
162,6.69
163,6.95
164,7.32
165,7.69
166,8.00
167,8.20
168,8.29
169,8.29
170,8.25
171,8.23
172,8.31
173,8.48
174,8.77
175,9.12
176,9.54
177,9.94
178,10.41
179,10.86
180,11.37
181,11.89
182,12.51
183,13.22
184,14.04
185,14.83
186,15.60
187,16.28
188,16.94
189,17.51
190,18.05
191,18.55
192,19.11
193,19.69
194,20.26
195,20.69
196,20.97
197,21.01
198,20.82
199,20.39
200,19.83
201,19.22
202,18.63
203,18.12
204,17.75
205,17.54
206,17.48
207,17.52
208,17.58
209,17.68
210,17.80
211,17.96
212,18.08
213,18.15
214,18.14
215,18.06
216,17.85
217,17.52
218,17.11
219,16.68
220,16.31
221,16.05
222,15.85
223,15.72
224,15.57
225,15.41
226,15.14
227,14.77
228,14.24
229,13.65
230,13.01
231,12.42
232,11.86
233,11.41
234,10.99
235,10.64
236,10.27
237,9.87
238,9.38
239,8.86
240,8.25
241,7.63
242,7.00
243,6.45
244,6.04
245,5.85
246,5.84
247,6.00
248,6.23
249,6.51
250,6.81
251,7.09
252,7.26
253,7.26
254,7.10
255,6.85
256,6.58
257,6.40
258,6.37
259,6.48
260,6.74
261,7.10
262,7.55
263,7.96
264,8.26
265,8.38
266,8.38
267,8.26
268,8.12
269,7.99
270,8.01
271,8.21
272,8.59
273,9.10
274,9.72
275,10.38
276,11.01
277,11.48
278,11.79
279,11.92
280,11.99
281,11.98
282,11.92
283,11.86
284,11.86
285,11.94
286,12.10
287,12.31
288,12.57
289,12.85
290,13.08
291,13.23
292,13.31
293,13.34
294,13.32
295,13.20
296,12.93
297,12.51
298,11.99
299,11.45
300,10.91
301,10.44
302,10.08
303,9.93
304,9.98
305,10.24
306,10.58
307,10.90
308,11.06
309,11.05
310,10.81
311,10.42
312,9.91
313,9.41
314,8.96
315,8.64
316,8.41
317,8.27
318,8.16
319,8.02
320,7.75
321,7.34
322,6.79
323,6.23
324,5.68
325,5.20
326,4.80
327,4.52
328,4.41
329,4.43
330,4.59
331,4.83
332,5.16
333,5.55
334,5.96
335,6.38
336,6.84
337,7.30
338,7.77
339,8.22
340,8.67
341,9.08
342,9.45
343,9.74
344,10.02
345,10.28
346,10.55
347,10.79
348,10.99
349,11.14
350,11.22
351,11.18
352,11.03
353,10.75
354,10.41
355,10.07
356,9.82
357,9.66
358,9.63
359,9.71
360,9.96
361,10.34
362,10.83
363,11.34
364,11.83
365,12.31
366,12.79
367,13.23
368,13.63
369,13.98
370,14.37
371,14.78
372,15.21
373,15.56
374,15.85
375,16.02
376,16.08
377,16.01
378,15.88
379,15.72
380,15.58
381,15.50
382,15.47
383,15.50
384,15.56
385,15.62
386,15.69
387,15.78
388,15.85
389,15.92
390,15.97
391,15.99
392,16.01
393,16.04
394,16.11
395,16.23
396,16.40
397,16.62
398,16.83
399,16.99
400,17.01
401,16.83
402,16.44
403,15.87
404,15.19
405,14.49
406,13.85
407,13.40
408,13.21
409,13.28
410,13.47
411,13.71
412,13.89
413,14.02
414,14.00
415,13.87
416,13.63
417,13.32
418,12.95
419,12.61
420,12.30
421,12.06
422,11.85
423,11.67
424,11.56
425,11.54
426,11.53
427,11.53
428,11.43
429,11.26
430,10.96
431,10.55
432,10.01
433,9.42
434,8.79
435,8.17
436,7.54
437,6.94
438,6.39
439,5.95
440,5.58
441,5.33
442,5.15
443,5.07
444,5.00
445,4.97
446,4.88
447,4.70
448,4.37
449,3.92
450,3.46
451,3.07
452,2.88
453,2.97
454,3.43
455,4.23
456,5.29
457,6.41
458,7.48
459,8.31
460,8.82
461,8.93
462,8.75
463,8.38
464,8.04
465,7.77
466,7.74
467,7.94
468,8.41
469,9.03
470,9.77
471,10.51
472,11.24
473,11.88
474,12.47
475,12.97
476,13.44
477,13.81
478,14.12
479,14.35
480,14.59
481,14.87
482,15.29
483,15.82
484,16.46
485,17.16
486,17.81
487,18.27
488,18.42
489,18.18
490,17.61
491,16.84
492,16.01
493,15.29
494,14.80
495,14.63
496,14.68
497,14.86
498,14.99
499,14.95
500,14.59
501,13.94
502,13.02
503,12.03
504,11.05
505,10.28
506,9.77
507,9.58
508,9.61
509,9.78
510,9.96
511,10.09
512,10.10
513,10.02
514,9.83
515,9.59
516,9.32
517,9.12
518,9.02
519,8.99
520,8.93
521,8.83
522,8.66
523,8.42
524,8.06
525,7.62
526,7.16
527,6.75
528,6.45
529,6.30
530,6.35
531,6.55
532,6.85
533,7.16
534,7.47
535,7.73
536,7.91
537,8.06
538,8.28
539,8.62
540,9.12
541,9.72
542,10.41
543,11.09
544,11.70
545,12.08
546,12.26
547,12.21
548,12.02
549,11.73
550,11.51
551,11.46
552,11.69
553,12.14
554,12.75
555,13.38
556,13.98
557,14.46
558,14.77
559,14.92
560,14.94
561,14.90
562,14.86
563,14.84
564,14.79
565,14.68
566,14.46
567,14.12
568,13.70
569,13.24
570,12.83
571,12.57
572,12.49
573,12.59
574,12.76
575,12.92
576,13.02
577,12.99
578,12.76
579,12.31
580,11.70
581,11.10
582,10.60
583,10.26
584,10.12
585,10.15
586,10.33
587,10.58
588,10.80
589,10.96
590,11.02
591,11.02
592,10.98
593,10.95
594,10.97
595,11.09
596,11.29
597,11.54
598,11.77
599,11.93
600,11.96
601,11.80
602,11.48
603,11.03
604,10.51
605,10.03
606,9.64
607,9.38
608,9.19
609,9.06
610,8.90
611,8.70
612,8.42
613,8.09
614,7.71
615,7.35
616,7.04
617,6.84
618,6.72
619,6.71
620,6.74
621,6.81
622,6.84
623,6.81
624,6.72
625,6.61
626,6.47
627,6.34
628,6.28
629,6.31
630,6.42
631,6.58
632,6.74
633,6.89
634,7.03
635,7.12
636,7.12
637,7.00
638,6.79
639,6.53
640,6.30
641,6.18
642,6.23
643,6.48
644,6.87
645,7.32
646,7.79
647,8.18
648,8.42
649,8.42
650,8.20
651,7.81
652,7.40
653,7.05
654,6.91
655,6.96
656,7.20
657,7.56
658,8.04
659,8.52
660,9.04
661,9.57
662,10.21
663,10.93
664,11.79
665,12.69
666,13.64
667,14.53
668,15.30
669,15.86
670,16.27
671,16.54
672,16.78
673,17.01
674,17.31
675,17.66
676,18.04
677,18.36
678,18.52
679,18.45
680,18.14
681,17.65
682,17.11
683,16.62
684,16.25
685,16.04
686,16.01
687,16.14
688,16.35
689,16.54
690,16.62
691,16.57
692,16.36
693,16.06
694,15.71
695,15.38
696,15.09
697,14.86
698,14.66
699,14.49
700,14.31
701,14.11
702,13.85
703,13.56
704,13.20
705,12.83
706,12.38
707,11.92
708,11.38
709,10.86
710,10.33
711,9.86
712,9.41
713,9.03
714,8.72
715,8.49
716,8.28
717,8.08
718,7.87
719,7.69
720,7.52
721,7.39
722,7.23
723,7.06
724,6.82
725,6.52
726,6.19
727,5.86
728,5.55
729,5.30
730,5.19
731,5.22
732,5.38
733,5.66
734,6.00
735,6.36
736,6.70
737,6.97
738,7.18
739,7.32
740,7.40
741,7.42
742,7.44
743,7.42
744,7.42
745,7.41
746,7.49
747,7.71
748,8.15
749,8.74
750,9.48
751,10.26
752,11.02
753,11.66
754,12.08
755,12.28
756,12.33
757,12.28
758,12.24
759,12.23
760,12.30
761,12.42
762,12.59
763,12.73
764,12.82
765,12.79
766,12.66
767,12.41
768,12.07
769,11.68
770,11.30
771,11.00
772,10.82
773,10.80
774,10.89
775,11.09
776,11.27
777,11.37
778,11.32
779,11.11
780,10.75
781,10.33
782,9.92
783,9.62
784,9.45
785,9.44
786,9.50
787,9.57
788,9.55
789,9.44
790,9.24
791,9.00
792,8.71
793,8.48
794,8.34
795,8.29
796,8.22
797,8.09
798,7.84
799,7.48
800,6.98
801,6.39
802,5.78
803,5.32
804,5.06
805,5.00
806,5.11
807,5.31
808,5.49
809,5.62
810,5.65
811,5.62
812,5.55
813,5.52
814,5.55
815,5.74
816,6.09
817,6.54
818,6.99
819,7.32
820,7.53
821,7.58
822,7.48
823,7.29
824,7.12
825,7.08
826,7.26
827,7.61
828,8.11
829,8.69
830,9.29
831,9.80
832,10.12
833,10.19
834,9.99
835,9.59
836,9.06
837,8.48
838,7.97
839,7.60
840,7.41
841,7.40
842,7.61
843,7.97
844,8.42
845,8.83
846,9.22
847,9.54
848,9.85
849,10.17
850,10.54
851,10.99
852,11.53
853,12.12
854,12.75
855,13.32
856,13.78
857,14.05
858,14.11
859,13.91
860,13.55
861,13.11
862,12.75
863,12.50
864,12.40
865,12.42
866,12.60
867,12.91
868,13.27
869,13.54
870,13.66
871,13.62
872,13.50
873,13.40
874,13.37
875,13.44
876,13.61
877,13.89
878,14.18
879,14.40
880,14.49
881,14.36
882,14.04
883,13.61
884,13.20
885,12.92
886,12.82
887,12.92
888,13.18
889,13.53
890,13.82
891,13.95
892,13.83
893,13.47
894,12.90
895,12.31
896,11.77
897,11.39
898,11.12
899,10.99
900,10.93
901,10.92
902,10.81
903,10.56
904,10.09
905,9.51
906,8.80
907,8.06
908,7.29
909,6.58
910,5.95
911,5.52
912,5.23
913,5.10
914,5.00
915,4.91
916,4.70
917,4.35
918,3.79
919,3.14
920,2.45
921,1.85
922,1.37
923,1.14
924,1.19
925,1.46
926,1.82
927,2.11
928,2.24
929,2.14
930,1.79
931,1.24
932,0.66
933,0.16
934,-0.14
935,-0.21
936,0.03
937,0.50
938,1.14
939,1.81
940,2.44
941,3.01
942,3.49
943,3.88
944,4.19
945,4.44
946,4.72
947,5.00
948,5.33
949,5.58
950,5.81
951,5.94
952,6.09
953,6.24
954,6.49
955,6.84
956,7.35
957,7.98
958,8.69
959,9.37
960,9.99
961,10.51
962,10.89
963,11.09
964,11.10
965,10.97
966,10.83
967,10.72
968,10.71
969,10.77
970,10.93
971,11.22
972,11.67
973,12.21
974,12.77
975,13.22
976,13.50
977,13.57
978,13.40
979,13.03
980,12.53
981,11.95
982,11.38
983,10.93
984,10.67
985,10.58
986,10.60
987,10.65
988,10.63
989,10.51
990,10.25
991,9.90
992,9.49
993,9.13
994,8.86
995,8.72
996,8.65
997,8.61
998,8.48
999,8.28
1000,8.00
1001,7.73
1002,7.51
1003,7.38
1004,7.39
1005,7.58
1006,7.91
1007,8.28
1008,8.58
1009,8.73
1010,8.74
1011,8.63
1012,8.45
1013,8.27
1014,8.18
1015,8.20
1016,8.34
1017,8.55
1018,8.83
1019,9.13
1020,9.38
1021,9.56
1022,9.71
1023,9.85
1024,9.99
1025,10.14
1026,10.32
1027,10.50
1028,10.64
1029,10.70
1030,10.72
1031,10.76
1032,10.94
1033,11.31
1034,11.93
1035,12.78
1036,13.79
1037,14.85
1038,15.81
1039,16.48
1040,16.76
1041,16.62
1042,16.17
1043,15.56
1044,14.94
1045,14.40
1046,13.95
1047,13.60
1048,13.31
1049,13.02
1050,12.62
1051,12.05
1052,11.35
1053,10.64
1054,9.96
1055,9.45
1056,9.13
1057,9.09
1058,9.28
1059,9.69
1060,10.17
1061,10.67
1062,11.10
1063,11.44
1064,11.59
1065,11.57
1066,11.37
1067,11.01
1068,10.49
1069,9.86
1070,9.21
1071,8.62
1072,8.16
1073,7.87
1074,7.75
1075,7.80
1076,7.91
1077,8.08
1078,8.21
1079,8.28
1080,8.21
1081,8.04
1082,7.77
1083,7.48
1084,7.14
1085,6.81
1086,6.52
1087,6.31
1088,6.18
1089,6.07
1090,5.91
1091,5.71
1092,5.48
1093,5.26
1094,5.05
1095,4.88
1096,4.80
1097,4.85
1098,5.02
1099,5.27
1100,5.56
1101,5.87
1102,6.13
1103,6.28
1104,6.29
1105,6.17
1106,5.93
1107,5.57
1108,5.12
1109,4.64
1110,4.16
1111,3.73
1112,3.41
1113,3.20
1114,3.11
1115,3.07
1116,3.09
1117,3.18
1118,3.37
1119,3.65
1120,3.94
1121,4.27
1122,4.67
1123,5.16
1124,5.66
1125,6.06
1126,6.26
1127,6.26
1128,6.10
1129,5.74
1130,5.26
1131,4.70
1132,4.26
1133,4.00
1134,3.98
1135,4.17
1136,4.55
1137,5.05
1138,5.63
1139,6.16
1140,6.65
1141,7.11
1142,7.63
1143,8.21
1144,8.92
1145,9.65
1146,10.44
1147,11.18
1148,11.89
1149,12.44
1150,12.87
1151,13.21
1152,13.62
1153,14.14
1154,14.81
1155,15.56
1156,16.37
1157,17.11
1158,17.71
1159,18.01
1160,18.01
1161,17.72
1162,17.22
1163,16.61
1164,16.03
1165,15.57
1166,15.28
1167,15.14
1168,15.09
1169,15.08
1170,15.03
1171,14.98
1172,14.91
1173,14.89
1174,14.86
1175,14.85
1176,14.79
1177,14.75
1178,14.63
1179,14.44
1180,14.09
1181,13.62
1182,13.03
1183,12.41
1184,11.74
1185,11.10
1186,10.46
1187,9.87
1188,9.28
1189,8.79
1190,8.37
1191,8.09
1192,7.85
1193,7.65
1194,7.44
1195,7.24
1196,7.03
1197,6.80
1198,6.48
1199,6.13
1200,5.78
1201,5.48
1202,5.23
1203,5.09
1204,5.03
1205,5.04
1206,5.04
1207,4.99
1208,4.84
1209,4.60
1210,4.29
1211,3.97
1212,3.76
1213,3.73
1214,3.93
1215,4.32
1216,4.84
1217,5.39
1218,5.88
1219,6.24
1220,6.42
1221,6.42
1222,6.29
1223,6.13
1224,6.03
1225,6.02
1226,6.12
1227,6.30
1228,6.57
1229,6.86
1230,7.15
1231,7.39
1232,7.60
1233,7.77
1234,7.92
1235,8.03
1236,8.16
1237,8.35
1238,8.56
1239,8.74
1240,8.85
1241,8.88
1242,8.83
1243,8.65
1244,8.32
1245,7.86
1246,7.38
1247,6.98
1248,6.72
1249,6.65
1250,6.74
1251,6.98
1252,7.31
1253,7.64
1254,7.91
1255,8.04
1256,7.95
1257,7.65
1258,7.17
1259,6.63
1260,6.12
1261,5.73
1262,5.49
1263,5.46
1264,5.65
1265,6.02
1266,6.45
1267,6.84
1268,7.03
1269,7.01
1270,6.74
1271,6.30
1272,5.70
1273,5.07
1274,4.49
1275,4.05
1276,3.70
1277,3.43
1278,3.11
1279,2.73
1280,2.21
1281,1.59
1282,0.89
1283,0.19
1284,-0.43
1285,-0.91
1286,-1.23
1287,-1.37
1288,-1.37
1289,-1.21
1290,-0.92
1291,-0.53
1292,-0.11
1293,0.29
1294,0.63
1295,0.94
1296,1.17
1297,1.30
1298,1.27
1299,1.08
1300,0.81
1301,0.52
1302,0.31
1303,0.18
1304,0.18
1305,0.27
1306,0.44
1307,0.65
1308,0.88
1309,1.12
1310,1.40
1311,1.68
1312,1.97
1313,2.25
1314,2.53
1315,2.72
1316,2.79
1317,2.67
1318,2.43
1319,2.14
1320,1.88
1321,1.73
1322,1.78
1323,2.01
1324,2.39
1325,2.82
1326,3.25
1327,3.57
1328,3.75
1329,3.73
1330,3.62
1331,3.49
1332,3.42
1333,3.44
1334,3.60
1335,3.88
1336,4.22
1337,4.55
1338,4.81
1339,5.00
1340,5.11
1341,5.16
1342,5.16
1343,5.13
1344,5.13
1345,5.18
1346,5.29
1347,5.41
1348,5.54
1349,5.65
1350,5.74
1351,5.78
1352,5.75
1353,5.62
1354,5.39
1355,5.13
1356,4.90
1357,4.75
1358,4.63
1359,4.51
1360,4.41
1361,4.35
1362,4.31
1363,4.23
1364,4.07
1365,3.88
1366,3.75
1367,3.75
1368,3.89
1369,4.17
1370,4.54
1371,5.04
1372,5.57
1373,6.03
1374,6.26
1375,6.25
1376,5.98
1377,5.52
1378,4.90
1379,4.18
1380,3.45
1381,2.82
1382,2.31
1383,1.97
1384,1.75
1385,1.61
1386,1.43
1387,1.21
1388,0.92
1389,0.61
1390,0.31
1391,0.08
1392,-0.05
1393,-0.02
1394,0.14
1395,0.39
1396,0.67
1397,0.92
1398,1.05
1399,1.05
1400,0.93
1401,0.78
1402,0.66
1403,0.63
1404,0.71
1405,0.92
1406,1.23
1407,1.53
1408,1.72
1409,1.69
1410,1.45
1411,1.07
1412,0.69
1413,0.36
1414,0.24
1415,0.38
1416,0.89
1417,1.68
1418,2.72
1419,3.85
1420,5.04
1421,6.14
1422,7.11
1423,7.80
1424,8.32
1425,8.68
1426,9.06
1427,9.38
1428,9.77
1429,10.19
1430,10.81
1431,11.57
1432,12.47
1433,13.36
1434,14.26
1435,15.08
1436,15.83
1437,16.39
1438,16.78
1439,16.99
1440,17.17
1441,17.30
1442,17.47
1443,17.67
1444,17.94
1445,18.26
1446,18.64
1447,19.00
1448,19.33
1449,19.56
1450,19.69
1451,19.72
1452,19.69
1453,19.63
1454,19.52
1455,19.35
1456,19.08
1457,18.73
1458,18.27
1459,17.74
1460,17.14
1461,16.58
1462,16.05
1463,15.58
1464,15.10
1465,14.67
1466,14.27
1467,13.96
1468,13.63
1469,13.32
1470,12.99
1471,12.70
1472,12.41
1473,12.12
1474,11.78
1475,11.43
1476,11.07
1477,10.77
1478,10.53
1479,10.36
1480,10.23
1481,10.15
1482,10.06
1483,9.95
1484,9.78
1485,9.54
1486,9.22
1487,8.86
1488,8.53
1489,8.32
1490,8.22
1491,8.26
1492,8.42
1493,8.66
1494,8.91
1495,9.12
1496,9.29
1497,9.37
1498,9.38
1499,9.34
1500,9.36
1501,9.50
1502,9.79
1503,10.20
1504,10.77
1505,11.42
1506,12.12
1507,12.76
1508,13.28
1509,13.62
1510,13.85
1511,13.98
1512,14.11
1513,14.24
1514,14.46
1515,14.72
1516,15.06
1517,15.39
1518,15.66
1519,15.77
1520,15.75
1521,15.63
1522,15.46
1523,15.30
1524,15.17
1525,15.08
1526,15.05
1527,15.03
1528,14.94
1529,14.74
1530,14.38
1531,13.91
1532,13.31
1533,12.69
1534,12.08
1535,11.57
1536,11.17
1537,10.91
1538,10.78
1539,10.80
1540,10.86
1541,10.96
1542,11.04
1543,11.11
1544,11.09
1545,10.99
1546,10.77
1547,10.49
1548,10.20
1549,9.96
1550,9.81
1551,9.78
1552,9.86
1553,10.02
1554,10.21
1555,10.39
1556,10.53
1557,10.59
1558,10.55
1559,10.44
1560,10.28
1561,10.12
1562,9.99
1563,9.94
1564,9.96
1565,10.02
1566,10.07
1567,10.06
1568,9.91
1569,9.61
1570,9.13
1571,8.53
1572,7.90
1573,7.35
1574,6.96
1575,6.79
1576,6.82
1577,7.05
1578,7.35
1579,7.64
1580,7.79
1581,7.80
1582,7.64
1583,7.37
1584,7.01
1585,6.65
1586,6.36
1587,6.20
1588,6.18
1589,6.29
1590,6.45
1591,6.60
1592,6.68
1593,6.72
1594,6.72
1595,6.72
1596,6.69
1597,6.65
1598,6.58
1599,6.51
1600,6.45
1601,6.42
1602,6.44
1603,6.53
1604,6.68
1605,6.87
1606,7.04
1607,7.16
1608,7.20
1609,7.14
1610,6.99
1611,6.77
1612,6.54
1613,6.32
1614,6.19
1615,6.18
1616,6.32
1617,6.55
1618,6.87
1619,7.22
1620,7.64
1621,8.07
1622,8.57
1623,9.09
1624,9.73
1625,10.43
1626,11.23
1627,11.99
1628,12.74
1629,13.37
1630,13.98
1631,14.54
1632,15.11
1633,15.66
1634,16.24
1635,16.80
1636,17.37
1637,17.81
1638,18.07
1639,18.07
1640,17.85
1641,17.48
1642,17.02
1643,16.53
1644,16.12
1645,15.91
1646,15.91
1647,16.11
1648,16.38
1649,16.63
1650,16.79
1651,16.86
1652,16.80
1653,16.62
1654,16.33
1655,16.03
1656,15.77
1657,15.60
1658,15.47
1659,15.37
1660,15.21
1661,15.05
1662,14.82
1663,14.60
1664,14.32
1665,14.07
1666,13.79
1667,13.53
1668,13.21
1669,12.84
1670,12.37
1671,11.85
1672,11.21
1673,10.53
1674,9.81
1675,9.13
1676,8.48
1677,7.89
1678,7.34
1679,6.90
1680,6.55
1681,6.32
1682,6.16
1683,6.06
1684,5.94
1685,5.84
1686,5.68
1687,5.52
1688,5.28
1689,5.01
1690,4.74
1691,4.46
1692,4.20
1693,3.99
1694,3.89
1695,3.91
1696,4.04
1697,4.25
1698,4.57
1699,4.96
1700,5.35
1701,5.68
1702,5.96
1703,6.16
1704,6.29
1705,6.35
1706,6.38
1707,6.43
1708,6.55
1709,6.69
1710,6.87
1711,7.05
1712,7.23
1713,7.40
1714,7.58
1715,7.73
1716,7.86
1717,7.97
1718,8.08
1719,8.17
1720,8.23
1721,8.27
1722,8.27
1723,8.24
1724,8.16
1725,8.04
1726,7.90
1727,7.75
1728,7.59
1729,7.45
1730,7.32
1731,7.21
1732,7.06
1733,6.91
1734,6.78
1735,6.71
1736,6.59
1737,6.39
1738,6.05
1739,5.65
1740,5.20
1741,4.78
1742,4.36
1743,4.04
1744,3.85
1745,3.83
1746,3.87
1747,3.89
1748,3.81
1749,3.65
1750,3.33
1751,2.95
1752,2.52
1753,2.17
1754,1.91
1755,1.77
1756,1.69
1757,1.62
1758,1.43
1759,1.10
1760,0.50
1761,-0.31
1762,-1.28
1763,-2.24
1764,-3.11
1765,-3.76
1766,-4.19
1767,-4.36
1768,-4.31
1769,-4.09
1770,-3.81
1771,-3.52
1772,-3.30
1773,-3.12
1774,-2.98
1775,-2.87
1776,-2.75
1777,-2.64
1778,-2.49
1779,-2.35
1780,-2.19
1781,-2.04
1782,-1.91
1783,-1.79
1784,-1.65
1785,-1.49
1786,-1.26
1787,-0.95
1788,-0.58
1789,-0.18
1790,0.15
1791,0.36
1792,0.43
1793,0.37
1794,0.17
1795,-0.17
1796,-0.56
1797,-0.94
1798,-1.19
1799,-1.25
1800,-1.08
1801,-0.75
1802,-0.34
1803,0.02
1804,0.31
1805,0.44
1806,0.43
1807,0.30
1808,0.16
1809,0.12
1810,0.27
1811,0.60
1812,1.09
1813,1.69
1814,2.35
1815,2.98
1816,3.50
1817,3.83
1818,3.98
1819,3.97
1820,3.85
1821,3.62
1822,3.40
1823,3.17
1824,3.02
1825,2.99
1826,3.13
1827,3.43
1828,3.85
1829,4.33
1830,4.80
1831,5.17
1832,5.37
1833,5.36
1834,5.17
1835,4.90
1836,4.65
1837,4.48
1838,4.43
1839,4.52
1840,4.79
1841,5.14
1842,5.52
1843,5.86
1844,6.17
1845,6.48
1846,6.82
1847,7.18
1848,7.58
1849,8.03
1850,8.51
1851,8.96
1852,9.32
1853,9.50
1854,9.51
1855,9.38
1856,9.16
1857,8.88
1858,8.61
1859,8.37
1860,8.19
1861,8.10
1862,8.07
1863,8.11
1864,8.19
1865,8.29
1866,8.35
1867,8.35
1868,8.31
1869,8.25
1870,8.16
1871,8.07
1872,8.00
1873,8.00
1874,8.07
1875,8.21
1876,8.32
1877,8.35
1878,8.27
1879,8.06
1880,7.74
1881,7.35
1882,6.92
1883,6.56
1884,6.32
1885,6.26
1886,6.35
1887,6.51
1888,6.69
1889,6.81
1890,6.81
1891,6.65
1892,6.41
1893,6.16
1894,6.00
1895,6.03
1896,6.26
1897,6.64
1898,7.16
1899,7.73
1900,8.33
1901,8.87
1902,9.30
1903,9.62
1904,9.90
1905,10.15
1906,10.41
1907,10.61
1908,10.81
1909,10.98
1910,11.13
1911,11.18
1912,11.16
1913,11.09
1914,11.05
1915,11.03
1916,11.09
1917,11.24
1918,11.55
1919,12.05
1920,12.73
1921,13.48
1922,14.24
1923,14.90
1924,15.40
1925,15.67
1926,15.69
1927,15.48
1928,15.08
1929,14.63
1930,14.22
1931,13.92
1932,13.70
1933,13.53
1934,13.36
1935,13.13
1936,12.77
1937,12.28
1938,11.61
1939,10.89
1940,10.17
1941,9.58
1942,9.14
1943,8.88
1944,8.74
1945,8.67
1946,8.58
1947,8.45
1948,8.16
1949,7.75
1950,7.20
1951,6.64
1952,6.10
1953,5.72
1954,5.49
1955,5.44
1956,5.52
1957,5.71
1958,5.94
1959,6.14
1960,6.18
1961,6.01
1962,5.58
1963,4.91
1964,4.08
1965,3.23
1966,2.49
1967,1.99
1968,1.75
1969,1.72
1970,1.85
1971,2.10
1972,2.43
1973,2.78
1974,3.13
1975,3.49
1976,3.91
1977,4.42
1978,4.97
1979,5.48
1980,5.91
1981,6.20
1982,6.35
1983,6.30
1984,6.15
1985,5.92
1986,5.75
1987,5.64
1988,5.66
1989,5.81
1990,6.13
1991,6.54
1992,7.01
1993,7.48
1994,8.00
1995,8.62
1996,9.38
1997,10.22
1998,11.07
1999,11.76
2000,12.24
2001,12.41
2002,12.29
2003,11.89
2004,11.27
2005,10.51
2006,9.74
2007,9.08
2008,8.58
2009,8.29
2010,8.16
2011,8.14
2012,8.14
2013,8.13
2014,8.01
2015,7.81
2016,7.50
2017,7.14
2018,6.77
2019,6.51
2020,6.36
2021,6.33
2022,6.39
2023,6.53
2024,6.68
2025,6.77
2026,6.74
2027,6.63
2028,6.47
2029,6.37
2030,6.38
2031,6.54
2032,6.81
2033,7.19
2034,7.56
2035,7.84
2036,7.94
2037,7.82
2038,7.49
2039,7.03
2040,6.52
2041,6.04
2042,5.64
2043,5.34
2044,5.14
2045,5.06
2046,5.06
2047,5.13
2048,5.20
2049,5.28
2050,5.29
2051,5.20
2052,4.97
2053,4.62
2054,4.16
2055,3.68
2056,3.22
2057,2.85
2058,2.63
2059,2.64
2060,2.87
2061,3.27
2062,3.72
2063,4.12
2064,4.42
2065,4.59
2066,4.65
2067,4.61
2068,4.55
2069,4.55
2070,4.64
2071,4.85
2072,5.17
2073,5.54
2074,5.85
2075,5.97
2076,5.86
2077,5.49
2078,4.94
2079,4.26
2080,3.57
2081,2.96
2082,2.56
2083,2.43
2084,2.59
2085,3.00
2086,3.55
2087,4.13
2088,4.62
2089,4.94
2090,5.12
2091,5.17
2092,5.14
2093,5.07
2094,5.02
2095,4.94
2096,4.90
2097,4.85
2098,4.91
2099,5.04
2100,5.31
2101,5.68
2102,6.24
2103,6.94
2104,7.83
2105,8.77
2106,9.76
2107,10.68
2108,11.54
2109,12.25
2110,12.83
2111,13.21
2112,13.55
2113,13.86
2114,14.25
2115,14.66
2116,15.10
2117,15.56
2118,16.03
2119,16.40
2120,16.59
2121,16.54
2122,16.30
2123,15.86
2124,15.24
2125,14.52
2126,13.87
2127,13.40
2128,13.14
2129,13.07
2130,13.19
2131,13.49
2132,13.86
2133,14.22
2134,14.44
2135,14.51
2136,14.35
2137,13.96
2138,13.38
2139,12.72
2140,12.04
2141,11.48
2142,11.07
2143,10.87
2144,10.80
2145,10.86
2146,10.93
2147,10.98
2148,10.85
2149,10.51
2150,9.92
2151,9.17
2152,8.30
2153,7.44
2154,6.61
2155,5.94
2156,5.39
2157,4.96
2158,4.54
2159,4.14
2160,3.70
2161,3.30
2162,2.87
2163,2.49
2164,2.17
2165,1.98
2166,1.93
2167,2.00
2168,2.14
2169,2.33
2170,2.50
2171,2.62
2172,2.69
2173,2.75
2174,2.84
2175,2.98
2176,3.19
2177,3.43
2178,3.70
2179,3.94
2180,4.12
2181,4.23
2182,4.33
2183,4.43
2184,4.59
2185,4.79
2186,5.10
2187,5.48
2188,5.94
2189,6.41
2190,6.91
2191,7.39
2192,7.81
2193,8.14
2194,8.39
2195,8.56
2196,8.69
2197,8.80
2198,8.95
2199,9.16
2200,9.41
2201,9.69
2202,9.93
2203,10.09
2204,10.12
2205,10.03
2206,9.82
2207,9.48
2208,9.06
2209,8.64
2210,8.30
2211,8.09
2212,7.98
2213,7.93
2214,7.89
2215,7.81
2216,7.62
2217,7.30
2218,6.84
2219,6.32
2220,5.83
2221,5.44
2222,5.17
2223,5.07
2224,5.05
2225,5.10
2226,5.10
2227,5.03
2228,4.79
2229,4.45
2230,4.00
2231,3.51
2232,3.01
2233,2.61
2234,2.31
2235,2.14
2236,1.98
2237,1.80
2238,1.52
2239,1.13
2240,0.57
2241,-0.10
2242,-0.85
2243,-1.58
2244,-2.24
2245,-2.77
2246,-3.16
2247,-3.36
2248,-3.43
2249,-3.43
2250,-3.40
2251,-3.34
2252,-3.22
2253,-3.01
2254,-2.72
2255,-2.39
2256,-2.02
2257,-1.63
2258,-1.25
2259,-0.92
2260,-0.66
2261,-0.49
2262,-0.36
2263,-0.24
2264,-0.13
2265,-0.03
2266,0.02
2267,-0.02
2268,-0.14
2269,-0.29
2270,-0.40
2271,-0.44
2272,-0.40
2273,-0.27
2274,-0.06
2275,0.21
2276,0.46
2277,0.60
2278,0.55
2279,0.33
2280,-0.01
2281,-0.35
2282,-0.59
2283,-0.65
2284,-0.51
2285,-0.18
2286,0.32
2287,0.86
2288,1.35
2289,1.69
2290,1.84
2291,1.83
2292,1.71
2293,1.58
2294,1.53
2295,1.63
2296,1.85
2297,2.14
2298,2.50
2299,2.83
2300,3.08
2301,3.20
2302,3.17
2303,3.02
2304,2.79
2305,2.55
2306,2.34
2307,2.22
2308,2.20
2309,2.26
2310,2.37
2311,2.50
2312,2.59
2313,2.59
2314,2.49
2315,2.33
2316,2.20
2317,2.17
2318,2.25
2319,2.46
2320,2.78
2321,3.17
2322,3.61
2323,3.97
2324,4.17
2325,4.18
2326,4.01
2327,3.70
2328,3.30
2329,2.84
2330,2.41
2331,2.12
2332,1.97
2333,1.95
2334,1.96
2335,1.98
2336,1.95
2337,1.87
2338,1.66
2339,1.35
2340,0.89
2341,0.39
2342,-0.16
2343,-0.69
2344,-1.24
2345,-1.76
2346,-2.30
2347,-2.83
2348,-3.39
2349,-3.94
2350,-4.52
2351,-5.02
2352,-5.46
2353,-5.74
2354,-5.91
2355,-5.92
2356,-5.88
2357,-5.80
2358,-5.78
2359,-5.81
2360,-6.03
2361,-6.45
2362,-7.06
2363,-7.72
2364,-8.34
2365,-8.79
2366,-9.05
2367,-9.12
2368,-9.09
2369,-9.03
2370,-9.00
2371,-9.06
2372,-9.21
2373,-9.40
2374,-9.53
2375,-9.51
2376,-9.28
2377,-8.84
2378,-8.17
2379,-7.40
2380,-6.56
2381,-5.83
2382,-5.20
2383,-4.76
2384,-4.46
2385,-4.28
2386,-4.05
2387,-3.72
2388,-3.12
2389,-2.30
2390,-1.24
2391,-0.09
2392,1.14
2393,2.27
2394,3.26
2395,3.95
2396,4.45
2397,4.77
2398,5.12
2399,5.54
2400,6.16
2401,6.89
2402,7.76
2403,8.61
2404,9.47
2405,10.16
2406,10.73
2407,11.07
2408,11.28
2409,11.34
2410,11.41
2411,11.54
2412,11.83
2413,12.25
2414,12.75
2415,13.24
2416,13.64
2417,13.89
2418,13.91
2419,13.69
2420,13.30
2421,12.85
2422,12.41
2423,12.08
2424,11.89
2425,11.86
2426,11.97
2427,12.10
2428,12.12
2429,11.99
2430,11.67
2431,11.22
2432,10.64
2433,10.07
2434,9.61
2435,9.40
2436,9.46
2437,9.78
2438,10.23
2439,10.70
2440,11.03
2441,11.13
2442,10.91
2443,10.37
2444,9.57
2445,8.69
2446,7.90
2447,7.32
2448,7.01
2449,6.96
2450,7.12
2451,7.40
2452,7.68
2453,7.83
2454,7.81
2455,7.65
2456,7.44
2457,7.26
2458,7.16
2459,7.19
2460,7.35
2461,7.59
2462,7.87
2463,8.14
2464,8.38
2465,8.58
2466,8.77
2467,8.95
2468,9.13
2469,9.31
2470,9.49
2471,9.65
2472,9.84
2473,10.05
2474,10.33
2475,10.67
2476,11.12
2477,11.60
2478,12.09
2479,12.51
2480,12.80
2481,12.92
2482,12.88
2483,12.66
2484,12.31
2485,11.88
2486,11.47
2487,11.11
2488,10.79
2489,10.50
2490,10.23
2491,10.03
2492,9.83
2493,9.61
2494,9.29
2495,8.94
2496,8.54
2497,8.15
2498,7.77
2499,7.46
2500,7.17
2501,6.94
2502,6.73
2503,6.56
2504,6.41
2505,6.29
2506,6.17
2507,6.03
2508,5.84
2509,5.68
2510,5.52
2511,5.44
2512,5.37
2513,5.33
2514,5.26
2515,5.17
2516,5.02
2517,4.82
2518,4.57
2519,4.31
2520,4.01
2521,3.72
2522,3.42
2523,3.16
2524,2.91
2525,2.71
2526,2.51
2527,2.31
2528,2.06
2529,1.77
2530,1.41
2531,1.02
2532,0.62
2533,0.24
2534,-0.14
2535,-0.47
2536,-0.72
2537,-0.84
2538,-0.81
2539,-0.63
2540,-0.34
2541,0.00
2542,0.35
2543,0.69
2544,0.92
2545,1.01
2546,0.98
2547,0.82
2548,0.59
2549,0.31
2550,0.05
2551,-0.17
2552,-0.32
2553,-0.40
2554,-0.43
2555,-0.40
2556,-0.35
2557,-0.28
2558,-0.21
2559,-0.15
2560,-0.12
2561,-0.12
2562,-0.13
2563,-0.10
2564,-0.02
2565,0.10
2566,0.24
2567,0.40
2568,0.54
2569,0.63
2570,0.65
2571,0.61
2572,0.58
2573,0.56
2574,0.62
2575,0.69
2576,0.85
2577,1.05
2578,1.32
2579,1.58
2580,1.83
2581,2.05
2582,2.35
2583,2.72
2584,3.23
2585,3.85
2586,4.63
2587,5.52
2588,6.50
2589,7.42
2590,8.25
2591,8.88
2592,9.40
2593,9.80
2594,10.20
2595,10.64
2596,11.19
2597,11.81
2598,12.47
2599,13.05
2600,13.47
2601,13.57
2602,13.35
2603,12.83
2604,12.17
2605,11.49
2606,10.90
2607,10.48
2608,10.29
2609,10.32
2610,10.49
2611,10.70
2612,10.83
2613,10.85
2614,10.76
2615,10.61
2616,10.44
2617,10.33
2618,10.26
2619,10.30
2620,10.42
2621,10.62
2622,10.80
2623,10.89
2624,10.86
2625,10.71
2626,10.45
2627,10.09
2628,9.64
2629,9.19
2630,8.81
2631,8.51
2632,8.25
2633,8.03
2634,7.84
2635,7.68
2636,7.50
2637,7.27
2638,7.02
2639,6.77
2640,6.52
2641,6.28
2642,6.09
2643,5.97
2644,5.91
2645,5.88
2646,5.90
2647,5.94
2648,6.07
2649,6.23
2650,6.49
2651,6.81
2652,7.23
2653,7.69
2654,8.25
2655,8.83
2656,9.46
2657,10.03
2658,10.53
2659,10.90
2660,11.20
2661,11.39
2662,11.56
2663,11.73
2664,11.99
2665,12.33
2666,12.78
2667,13.25
2668,13.76
2669,14.24
2670,14.66
2671,14.98
2672,15.24
2673,15.43
2674,15.63
2675,15.83
2676,16.09
2677,16.35
2678,16.59
2679,16.78
2680,16.91
2681,16.96
2682,16.94
2683,16.82
2684,16.62
2685,16.42
2686,16.20
2687,15.99
2688,15.77
2689,15.54
2690,15.29
2691,14.99
2692,14.61
2693,14.20
2694,13.79
2695,13.47
2696,13.19
2697,12.99
2698,12.84
2699,12.73
2700,12.60
2701,12.39
2702,12.08
2703,11.73
2704,11.36
2705,11.04
2706,10.75
2707,10.54
2708,10.42
2709,10.40
2710,10.41
2711,10.40
2712,10.29
2713,10.12
2714,9.86
2715,9.56
2716,9.24
2717,8.95
2718,8.66
2719,8.35
2720,7.90
2721,7.32
2722,6.55
2723,5.72
2724,4.87
2725,4.14
2726,3.61
2727,3.38
2728,3.46
2729,3.80
2730,4.27
2731,4.74
2732,5.08
2733,5.23
2734,5.16
2735,4.88
2736,4.50
2737,4.16
2738,3.96
2739,3.96
2740,4.16
2741,4.49
2742,4.91
2743,5.33
2744,5.69
2745,5.94
2746,6.05
2747,6.07
2748,6.07
2749,6.13
2750,6.27
2751,6.51
2752,6.83
2753,7.16
2754,7.45
2755,7.56
2756,7.48
2757,7.21
2758,6.81
2759,6.37
2760,6.00
2761,5.78
2762,5.81
2763,6.05
2764,6.44
2765,6.84
2766,7.17
2767,7.38
2768,7.43
2769,7.36
2770,7.27
2771,7.27
2772,7.42
2773,7.71
2774,8.13
2775,8.61
2776,9.12
2777,9.51
2778,9.72
2779,9.70
2780,9.54
2781,9.29
2782,9.03
2783,8.82
2784,8.70
2785,8.73
2786,8.93
2787,9.22
2788,9.55
2789,9.83
2790,10.01
2791,10.01
2792,9.79
2793,9.40
2794,8.92
2795,8.49
2796,8.21
2797,8.12
2798,8.22
2799,8.48
2800,8.77
2801,9.00
2802,9.03
2803,8.82
2804,8.38
2805,7.80
2806,7.18
2807,6.67
2808,6.36
2809,6.31
2810,6.45
2811,6.70
2812,6.97
2813,7.19
2814,7.30
2815,7.29
2816,7.08
2817,6.76
2818,6.33
2819,5.89
2820,5.39
2821,4.91
2822,4.39
2823,3.92
2824,3.45
2825,3.05
2826,2.69
2827,2.37
2828,1.98
2829,1.56
2830,1.05
2831,0.49
2832,-0.19
2833,-0.89
2834,-1.59
2835,-2.12
2836,-2.49
2837,-2.66
2838,-2.69
2839,-2.62
2840,-2.53
2841,-2.41
2842,-2.37
2843,-2.36
2844,-2.45
2845,-2.62
2846,-2.90
2847,-3.25
2848,-3.69
2849,-4.20
2850,-4.75
2851,-5.29
2852,-5.78
2853,-6.19
2854,-6.44
2855,-6.47
2856,-6.23
2857,-5.78
2858,-5.20
2859,-4.56
2860,-3.91
2861,-3.32
2862,-2.82
2863,-2.48
2864,-2.17
2865,-1.86
2866,-1.45
2867,-0.96
2868,-0.34
2869,0.37
2870,1.20
2871,2.00
2872,2.70
2873,3.16
2874,3.46
2875,3.59
2876,3.64
2877,3.59
2878,3.56
2879,3.60
2880,3.82
2881,4.20
2882,4.75
2883,5.37
2884,6.03
2885,6.63
2886,7.13
2887,7.49
2888,7.71
2889,7.79
2890,7.78
2891,7.72
2892,7.64
2893,7.58
2894,7.54
2895,7.51
2896,7.48
2897,7.41
2898,7.19
2899,6.84
2900,6.37
2901,5.87
2902,5.30
2903,4.75
2904,4.18
2905,3.68
2906,3.20
2907,2.80
2908,2.44
2909,2.11
2910,1.77
2911,1.42
2912,1.09
2913,0.85
2914,0.69
2915,0.69
2916,0.78
2917,1.00
2918,1.24
2919,1.47
2920,1.58
2921,1.53
2922,1.26
2923,0.78
2924,0.14
2925,-0.56
2926,-1.24
2927,-1.78
2928,-2.12
2929,-2.25
2930,-2.16
2931,-1.91
2932,-1.54
2933,-1.16
2934,-0.81
2935,-0.51
2936,-0.24
2937,-0.01
2938,0.21
2939,0.41
2940,0.66
2941,0.95
2942,1.31
2943,1.69
2944,2.12
2945,2.55
2946,3.03
2947,3.52
2948,4.07
2949,4.61
2950,5.13
2951,5.56
2952,5.96
2953,6.31
2954,6.68
2955,7.03
2956,7.38
2957,7.71
2958,8.02
2959,8.29
2960,8.48
2961,8.58
2962,8.54
2963,8.36
2964,8.03
2965,7.58
2966,7.06
2967,6.58
2968,6.16
2969,5.81
2970,5.46
2971,5.08
2972,4.66
2973,4.25
2974,3.83
2975,3.48
2976,3.19
2977,3.02
2978,2.94
2979,2.95
2980,2.98
2981,3.00
2982,2.91
2983,2.73
2984,2.46
2985,2.16
2986,1.86
2987,1.66
2988,1.58
2989,1.62
2990,1.70
2991,1.80
2992,1.86
2993,1.90
2994,1.88
2995,1.79
2996,1.63
2997,1.45
2998,1.29
2999,1.17
3000,1.08
3001,0.96
3002,0.79
3003,0.62
3004,0.46
3005,0.34
3006,0.23
3007,0.12
3008,-0.02
3009,-0.20
3010,-0.45
3011,-0.76
3012,-1.15
3013,-1.57
3014,-2.01
3015,-2.37
3016,-2.61
3017,-2.69
3018,-2.68
3019,-2.60
3020,-2.54
3021,-2.54
3022,-2.63
3023,-2.81
3024,-3.05
3025,-3.33
3026,-3.59
3027,-3.78
3028,-3.82
3029,-3.72
3030,-3.55
3031,-3.37
3032,-3.21
3033,-3.09
3034,-3.01
3035,-3.02
3036,-3.08
3037,-3.15
3038,-3.14
3039,-3.03
3040,-2.82
3041,-2.54
3042,-2.20
3043,-1.88
3044,-1.63
3045,-1.51
3046,-1.50
3047,-1.53
3048,-1.59
3049,-1.62
3050,-1.59
3051,-1.46
3052,-1.27
3053,-1.10
3054,-0.99
3055,-1.02
3056,-1.17
3057,-1.43
3058,-1.71
3059,-1.94
3060,-1.98
3061,-1.79
3062,-1.29
3063,-0.54
3064,0.43
3065,1.50
3066,2.62
3067,3.62
3068,4.55
3069,5.33
3070,6.07
3071,6.75
3072,7.42
3073,8.00
3074,8.54
3075,9.01
3076,9.45
3077,9.77
3078,9.94
3079,9.88
3080,9.62
3081,9.19
3082,8.64
3083,8.01
3084,7.35
3085,6.71
3086,6.16
3087,5.74
3088,5.48
3089,5.40
3090,5.45
3091,5.58
3092,5.68
3093,5.70
3094,5.54
3095,5.25
3096,4.83
3097,4.33
3098,3.74
3099,3.17
3100,2.71
3101,2.44
3102,2.35
3103,2.43
3104,2.58
3105,2.75
3106,2.78
3107,2.63
3108,2.19
3109,1.53
3110,0.69
3111,-0.21
3112,-1.09
3113,-1.84
3114,-2.41
3115,-2.76
3116,-2.94
3117,-2.98
3118,-2.98
3119,-3.01
3120,-3.11
3121,-3.28
3122,-3.53
3123,-3.80
3124,-4.10
3125,-4.36
3126,-4.56
3127,-4.65
3128,-4.65
3129,-4.61
3130,-4.58
3131,-4.61
3132,-4.75
3133,-4.98
3134,-5.28
3135,-5.59
3136,-5.87
3137,-6.02
3138,-5.95
3139,-5.65
3140,-5.19
3141,-4.68
3142,-4.17
3143,-3.75
3144,-3.47
3145,-3.36
3146,-3.33
3147,-3.29
3148,-3.14
3149,-2.85
3150,-2.37
3151,-1.78
3152,-1.11
3153,-0.47
3154,0.09
3155,0.50
3156,0.76
3157,0.93
3158,1.12
3159,1.34
3160,1.60
3161,1.85
3162,2.10
3163,2.33
3164,2.49
3165,2.50
3166,2.35
3167,2.07
3168,1.72
3169,1.40
3170,1.11
3171,0.90
3172,0.79
3173,0.79
3174,0.87
3175,1.01
3176,1.11
3177,1.15
3178,1.08
3179,0.91
3180,0.61
3181,0.22
3182,-0.24
3183,-0.66
3184,-0.97
3185,-1.11
3186,-1.16
3187,-1.17
3188,-1.23
3189,-1.37
3190,-1.69
3191,-2.18
3192,-2.87
3193,-3.62
3194,-4.35
3195,-4.91
3196,-5.29
3197,-5.39
3198,-5.28
3199,-5.01
3200,-4.79
3201,-4.75
3202,-4.98
3203,-5.46
3204,-6.13
3205,-6.89
3206,-7.66
3207,-8.29
3208,-8.66
3209,-8.69
3210,-8.45
3211,-8.03
3212,-7.58
3213,-7.15
3214,-6.84
3215,-6.65
3216,-6.59
3217,-6.60
3218,-6.63
3219,-6.61
3220,-6.48
3221,-6.26
3222,-6.02
3223,-5.81
3224,-5.63
3225,-5.52
3226,-5.47
3227,-5.47
3228,-5.49
3229,-5.49
3230,-5.47
3231,-5.41
3232,-5.29
3233,-5.16
3234,-4.99
3235,-4.84
3236,-4.70
3237,-4.59
3238,-4.49
3239,-4.40
3240,-4.30
3241,-4.15
3242,-3.94
3243,-3.70
3244,-3.47
3245,-3.30
3246,-3.14
3247,-3.06
3248,-3.06
3249,-3.15
3250,-3.29
3251,-3.42
3252,-3.50
3253,-3.53
3254,-3.49
3255,-3.37
3256,-3.20
3257,-3.01
3258,-2.85
3259,-2.77
3260,-2.75
3261,-2.75
3262,-2.73
3263,-2.65
3264,-2.46
3265,-2.20
3266,-1.86
3267,-1.53
3268,-1.25
3269,-1.13
3270,-1.18
3271,-1.40
3272,-1.72
3273,-2.02
3274,-2.24
3275,-2.33
3276,-2.30
3277,-2.14
3278,-1.92
3279,-1.71
3280,-1.55
3281,-1.50
3282,-1.53
3283,-1.66
3284,-1.82
3285,-1.98
3286,-2.07
3287,-2.01
3288,-1.77
3289,-1.41
3290,-0.98
3291,-0.53
3292,-0.08
3293,0.31
3294,0.60
3295,0.78
3296,0.89
3297,0.95
3298,0.92
3299,0.85
3300,0.69
3301,0.43
3302,-0.01
3303,-0.60
3304,-1.33
3305,-2.11
3306,-2.91
3307,-3.68
3308,-4.41
3309,-5.00
3310,-5.47
3311,-5.81
3312,-6.13
3313,-6.43
3314,-6.80
3315,-7.15
3316,-7.51
3317,-7.83
3318,-8.13
3319,-8.39
3320,-8.65
3321,-8.87
3322,-9.11
3323,-9.37
3324,-9.71
3325,-10.09
3326,-10.51
3327,-10.93
3328,-11.36
3329,-11.80
3330,-12.27
3331,-12.72
3332,-13.15
3333,-13.53
3334,-13.86
3335,-14.08
3336,-14.10
3337,-13.86
3338,-13.39
3339,-12.76
3340,-12.02
3341,-11.31
3342,-10.64
3343,-10.12
3344,-9.71
3345,-9.43
3346,-9.17
3347,-8.96
3348,-8.67
3349,-8.34
3350,-7.83
3351,-7.23
3352,-6.48
3353,-5.71
3354,-4.88
3355,-4.12
3356,-3.44
3357,-2.94
3358,-2.56
3359,-2.35
3360,-2.20
3361,-2.10
3362,-1.93
3363,-1.63
3364,-1.19
3365,-0.68
3366,-0.18
3367,0.21
3368,0.47
3369,0.50
3370,0.26
3371,-0.23
3372,-0.86
3373,-1.46
3374,-1.96
3375,-2.31
3376,-2.56
3377,-2.73
3378,-2.86
3379,-2.97
3380,-3.14
3381,-3.33
3382,-3.59
3383,-3.85
3384,-4.14
3385,-4.40
3386,-4.65
3387,-4.88
3388,-5.17
3389,-5.48
3390,-5.85
3391,-6.27
3392,-6.76
3393,-7.26
3394,-7.71
3395,-8.02
3396,-8.19
3397,-8.20
3398,-8.10
3399,-7.94
3400,-7.82
3401,-7.78
3402,-7.85
3403,-8.00
3404,-8.23
3405,-8.54
3406,-8.87
3407,-9.11
3408,-9.18
3409,-9.06
3410,-8.81
3411,-8.51
3412,-8.16
3413,-7.84
3414,-7.59
3415,-7.53
3416,-7.64
3417,-7.90
3418,-8.19
3419,-8.45
3420,-8.55
3421,-8.47
3422,-8.16
3423,-7.69
3424,-7.09
3425,-6.46
3426,-5.84
3427,-5.34
3428,-4.97
3429,-4.81
3430,-4.75
3431,-4.74
3432,-4.64
3433,-4.42
3434,-4.00
3435,-3.40
3436,-2.62
3437,-1.75
3438,-0.88
3439,-0.13
3440,0.44
3441,0.76
3442,0.85
3443,0.73
3444,0.44
3445,0.05
3446,-0.41
3447,-0.92
3448,-1.47
3449,-2.01
3450,-2.49
3451,-2.91
3452,-3.30
3453,-3.58
3454,-3.78
3455,-3.89
3456,-4.04
3457,-4.22
3458,-4.49
3459,-4.81
3460,-5.25
3461,-5.72
3462,-6.16
3463,-6.37
3464,-6.32
3465,-6.00
3466,-5.55
3467,-5.04
3468,-4.63
3469,-4.42
3470,-4.51
3471,-4.92
3472,-5.58
3473,-6.32
3474,-6.99
3475,-7.41
3476,-7.52
3477,-7.33
3478,-6.94
3479,-6.46
3480,-6.08
3481,-5.88
3482,-5.97
3483,-6.30
3484,-6.81
3485,-7.35
3486,-7.87
3487,-8.26
3488,-8.49
3489,-8.60
3490,-8.70
3491,-8.90
3492,-9.25
3493,-9.77
3494,-10.41
3495,-11.09
3496,-11.77
3497,-12.31
3498,-12.64
3499,-12.70
3500,-12.50
3501,-12.13
3502,-11.69
3503,-11.22
3504,-10.84
3505,-10.63
3506,-10.66
3507,-10.89
3508,-11.28
3509,-11.67
3510,-12.02
3511,-12.27
3512,-12.34
3513,-12.26
3514,-12.04
3515,-11.76
3516,-11.49
3517,-11.31
3518,-11.25
3519,-11.29
3520,-11.33
3521,-11.28
3522,-11.09
3523,-10.73
3524,-10.20
3525,-9.53
3526,-8.82
3527,-8.25
3528,-7.92
3529,-7.90
3530,-8.11
3531,-8.52
3532,-9.03
3533,-9.52
3534,-9.82
3535,-9.86
3536,-9.64
3537,-9.24
3538,-8.74
3539,-8.26
3540,-7.89
3541,-7.74
3542,-7.81
3543,-8.04
3544,-8.27
3545,-8.38
3546,-8.24
3547,-7.77
3548,-6.92
3549,-5.84
3550,-4.67
3551,-3.62
3552,-2.75
3553,-2.14
3554,-1.74
3555,-1.52
3556,-1.34
3557,-1.14
3558,-0.86
3559,-0.53
3560,-0.18
3561,0.06
3562,0.13
3563,-0.04
3564,-0.34
3565,-0.69
3566,-0.96
3567,-1.05
3568,-0.92
3569,-0.62
3570,-0.22
3571,0.16
3572,0.38
3573,0.36
3574,0.02
3575,-0.55
3576,-1.24
3577,-1.88
3578,-2.41
3579,-2.78
3580,-3.01
3581,-3.12
3582,-3.22
3583,-3.37
3584,-3.68
3585,-4.10
3586,-4.62
3587,-5.12
3588,-5.56
3589,-5.88
3590,-6.13
3591,-6.26
3592,-6.34
3593,-6.42
3594,-6.65
3595,-7.03
3596,-7.63
3597,-8.35
3598,-9.22
3599,-10.14
3600,-11.03
3601,-11.78
3602,-12.40
3603,-12.83
3604,-13.09
3605,-13.21
3606,-13.27
3607,-13.31
3608,-13.37
3609,-13.40
3610,-13.45
3611,-13.53
3612,-13.64
3613,-13.71
3614,-13.67
3615,-13.50
3616,-13.16
3617,-12.70
3618,-12.18
3619,-11.63
3620,-11.12
3621,-10.71
3622,-10.41
3623,-10.27
3624,-10.24
3625,-10.32
3626,-10.43
3627,-10.53
3628,-10.52
3629,-10.45
3630,-10.29
3631,-10.09
3632,-9.77
3633,-9.41
3634,-8.96
3635,-8.48
3636,-7.93
3637,-7.31
3638,-6.63
3639,-5.94
3640,-5.25
3641,-4.65
3642,-4.21
3643,-3.97
3644,-3.91
3645,-4.01
3646,-4.23
3647,-4.53
3648,-4.87
3649,-5.17
3650,-5.41
3651,-5.65
3652,-5.95
3653,-6.33
3654,-6.77
3655,-7.19
3656,-7.58
3657,-7.90
3658,-8.19
3659,-8.42
3660,-8.61
3661,-8.78
3662,-9.00
3663,-9.23
3664,-9.48
3665,-9.62
3666,-9.65
3667,-9.52
3668,-9.28
3669,-8.97
3670,-8.67
3671,-8.48
3672,-8.48
3673,-8.72
3674,-9.20
3675,-9.77
3676,-10.31
3677,-10.70
3678,-10.96
3679,-11.12
3680,-11.25
3681,-11.43
3682,-11.74
3683,-12.21
3684,-12.82
3685,-13.45
3686,-14.05
3687,-14.47
3688,-14.67
3689,-14.66
3690,-14.53
3691,-14.37
3692,-14.25
3693,-14.26
3694,-14.39
3695,-14.60
3696,-14.80
3697,-14.88
3698,-14.75
3699,-14.39
3700,-13.78
3701,-13.00
3702,-12.13
3703,-11.28
3704,-10.54
3705,-9.97
3706,-9.63
3707,-9.51
3708,-9.55
3709,-9.76
3710,-10.06
3711,-10.39
3712,-10.66
3713,-10.88
3714,-11.05
3715,-11.20
3716,-11.27
3717,-11.25
3718,-11.15
3719,-11.00
3720,-10.77
3721,-10.48
3722,-10.15
3723,-9.88
3724,-9.68
3725,-9.56
3726,-9.51
3727,-9.51
3728,-9.54
3729,-9.52
3730,-9.38
3731,-9.15
3732,-8.83
3733,-8.53
3734,-8.28
3735,-8.16
3736,-8.19
3737,-8.35
3738,-8.55
3739,-8.71
3740,-8.77
3741,-8.71
3742,-8.55
3743,-8.34
3744,-8.11
3745,-7.92
3746,-7.83
3747,-7.86
3748,-8.00
3749,-8.22
3750,-8.45
3751,-8.64
3752,-8.75
3753,-8.81
3754,-8.82
3755,-8.81
3756,-8.83
3757,-8.86
3758,-8.90
3759,-8.93
3760,-8.93
3761,-8.87
3762,-8.77
3763,-8.64
3764,-8.52
3765,-8.45
3766,-8.48
3767,-8.64
3768,-8.90
3769,-9.23
3770,-9.58
3771,-9.91
3772,-10.22
3773,-10.48
3774,-10.71
3775,-10.85
3776,-10.93
3777,-10.94
3778,-10.99
3779,-11.06
3780,-11.21
3781,-11.41
3782,-11.73
3783,-12.13
3784,-12.66
3785,-13.24
3786,-13.92
3787,-14.60
3788,-15.27
3789,-15.79
3790,-16.22
3791,-16.56
3792,-16.92
3793,-17.27
3794,-17.61
3795,-17.91
3796,-18.20
3797,-18.42
3798,-18.58
3799,-18.66
3800,-18.76
3801,-18.89
3802,-19.10
3803,-19.39
3804,-19.83
3805,-20.34
3806,-20.85
3807,-21.24
3808,-21.49
3809,-21.63
3810,-21.73
3811,-21.84
3812,-22.02
3813,-22.30
3814,-22.64
3815,-22.99
3816,-23.18
3817,-23.13
3818,-22.76
3819,-22.04
3820,-21.00
3821,-19.83
3822,-18.68
3823,-17.78
3824,-17.18
3825,-16.90
3826,-16.85
3827,-17.00
3828,-17.17
3829,-17.25
3830,-17.10
3831,-16.78
3832,-16.33
3833,-15.88
3834,-15.44
3835,-15.06
3836,-14.73
3837,-14.51
3838,-14.32
3839,-14.13
3840,-13.82
3841,-13.41
3842,-12.89
3843,-12.36
3844,-11.81
3845,-11.34
3846,-10.97
3847,-10.73
3848,-10.60
3849,-10.57
3850,-10.64
3851,-10.73
3852,-10.78
3853,-10.78
3854,-10.78
3855,-10.83
3856,-10.97
3857,-11.24
3858,-11.67
3859,-12.27
3860,-12.99
3861,-13.74
3862,-14.47
3863,-15.07
3864,-15.49
3865,-15.65
3866,-15.63
3867,-15.49
3868,-15.37
3869,-15.35
3870,-15.56
3871,-15.93
3872,-16.49
3873,-17.08
3874,-17.68
3875,-18.15
3876,-18.49
3877,-18.62
3878,-18.62
3879,-18.50
3880,-18.43
3881,-18.47
3882,-18.73
3883,-19.21
3884,-19.90
3885,-20.68
3886,-21.46
3887,-22.09
3888,-22.53
3889,-22.74
3890,-22.72
3891,-22.54
3892,-22.25
3893,-21.96
3894,-21.66
3895,-21.39
3896,-21.13
3897,-20.88
3898,-20.58
3899,-20.21
3900,-19.66
3901,-19.01
3902,-18.27
3903,-17.60
3904,-16.97
3905,-16.43
3906,-15.87
3907,-15.36
3908,-14.79
3909,-14.22
3910,-13.50
3911,-12.73
3912,-11.81
3913,-10.90
3914,-9.95
3915,-9.05
3916,-8.11
3917,-7.20
3918,-6.25
3919,-5.33
3920,-4.44
3921,-3.64
3922,-2.92
3923,-2.37
3924,-1.97
3925,-1.80
3926,-1.79
3927,-1.92
3928,-2.15
3929,-2.49
3930,-2.89
3931,-3.35
3932,-3.79
3933,-4.16
3934,-4.38
3935,-4.41
3936,-4.26
3937,-3.94
3938,-3.56
3939,-3.15
3940,-2.84
3941,-2.68
3942,-2.75
3943,-3.01
3944,-3.44
3945,-3.95
3946,-4.52
3947,-5.01
3948,-5.40
3949,-5.61
3950,-5.70
3951,-5.71
3952,-5.74
3953,-5.81
3954,-6.04
3955,-6.45
3956,-7.05
3957,-7.71
3958,-8.38
3959,-8.94
3960,-9.38
3961,-9.64
3962,-9.74
3963,-9.70
3964,-9.61
3965,-9.50
3966,-9.45
3967,-9.48
3968,-9.62
3969,-9.82
3970,-10.05
3971,-10.26
3972,-10.49
3973,-10.69
3974,-10.83
3975,-10.93
3976,-11.02
3977,-11.17
3978,-11.34
3979,-11.49
3980,-11.63
3981,-11.74
3982,-11.83
3983,-11.86
3984,-11.84
3985,-11.77
3986,-11.70
3987,-11.63
3988,-11.60
3989,-11.60
3990,-11.63
3991,-11.67
3992,-11.69
3993,-11.72
3994,-11.75
3995,-11.82
3996,-11.90
3997,-11.99
3998,-12.06
3999,-12.12
4000,-12.18
4001,-12.17
4002,-12.08
4003,-11.94
4004,-11.80
4005,-11.68
4006,-11.67
4007,-11.78
4008,-12.11
4009,-12.58
4010,-13.12
4011,-13.64
4012,-14.14
4013,-14.59
4014,-14.90
4015,-15.06
4016,-15.09
4017,-15.05
4018,-14.95
4019,-14.79
4020,-14.54
4021,-14.25
4022,-13.86
4023,-13.43
4024,-12.90
4025,-12.31
4026,-11.60
4027,-10.80
4028,-9.92
4029,-9.06
4030,-8.23
4031,-7.49
4032,-6.83
4033,-6.33
4034,-5.98
4035,-5.79
4036,-5.63
4037,-5.46
4038,-5.23
4039,-4.97
4040,-4.66
4041,-4.36
4042,-4.10
4043,-3.99
4044,-4.05
4045,-4.30
4046,-4.68
4047,-5.13
4048,-5.58
4049,-5.97
4050,-6.27
4051,-6.41
4052,-6.42
4053,-6.29
4054,-6.10
4055,-5.87
4056,-5.70
4057,-5.62
4058,-5.75
4059,-6.06
4060,-6.59
4061,-7.28
4062,-8.10
4063,-8.93
4064,-9.74
4065,-10.44
4066,-11.11
4067,-11.66
4068,-12.14
4069,-12.50
4070,-12.88
4071,-13.25
4072,-13.68
4073,-14.09
4074,-14.51
4075,-14.88
4076,-15.26
4077,-15.63
4078,-16.08
4079,-16.51
4080,-16.94
4081,-17.29
4082,-17.61
4083,-17.86
4084,-18.10
4085,-18.30
4086,-18.52
4087,-18.78
4088,-19.12
4089,-19.48
4090,-19.82
4091,-20.10
4092,-20.26
4093,-20.32
4094,-20.26
4095,-20.13
4096,-19.91
4097,-19.63
4098,-19.30
4099,-18.98
4100,-18.70
4101,-18.47
4102,-18.22
4103,-17.96
4104,-17.67
4105,-17.38
4106,-16.99
4107,-16.50
4108,-15.87
4109,-15.15
4110,-14.36
4111,-13.55
4112,-12.77
4113,-12.15
4114,-11.72
4115,-11.58
4116,-11.70
4117,-12.05
4118,-12.50
4119,-12.96
4120,-13.30
4121,-13.46
4122,-13.44
4123,-13.30
4124,-13.14
4125,-13.05
4126,-13.09
4127,-13.27
4128,-13.54
4129,-13.82
4130,-14.04
4131,-14.11
4132,-14.06
4133,-13.87
4134,-13.64
4135,-13.47
4136,-13.50
4137,-13.76
4138,-14.28
4139,-14.98
4140,-15.75
4141,-16.44
4142,-16.96
4143,-17.22
4144,-17.25
4145,-17.09
4146,-16.85
4147,-16.56
4148,-16.33
4149,-16.16
4150,-16.15
4151,-16.33
4152,-16.72
4153,-17.23
4154,-17.76
4155,-18.18
4156,-18.45
4157,-18.53
4158,-18.46
4159,-18.30
4160,-18.17
4161,-18.19
4162,-18.46
4163,-19.00
4164,-19.74
4165,-20.50
4166,-21.14
4167,-21.47
4168,-21.40
4169,-20.91
4170,-20.14
4171,-19.30
4172,-18.65
4173,-18.36
4174,-18.55
4175,-19.20
4176,-20.16
4177,-21.18
4178,-21.97
4179,-22.34
4180,-22.19
4181,-21.58
4182,-20.63
4183,-19.58
4184,-18.59
4185,-17.88
4186,-17.46
4187,-17.36
4188,-17.45
4189,-17.65
4190,-17.81
4191,-17.85
4192,-17.69
4193,-17.40
4194,-17.01
4195,-16.66
4196,-16.35
4197,-16.14
4198,-16.03
4199,-16.04
4200,-16.13
4201,-16.27
4202,-16.36
4203,-16.37
4204,-16.24
4205,-16.01
4206,-15.67
4207,-15.27
4208,-14.85
4209,-14.47
4210,-14.14
4211,-13.91
4212,-13.73
4213,-13.62
4214,-13.57
4215,-13.60
4216,-13.66
4217,-13.77
4218,-13.86
4219,-13.96
4220,-14.02
4221,-13.95
4222,-13.75
4223,-13.38
4224,-12.91
4225,-12.40
4226,-11.92
4227,-11.54
4228,-11.37
4229,-11.43
4230,-11.73
4231,-12.21
4232,-12.79
4233,-13.38
4234,-13.88
4235,-14.20
4236,-14.34
4237,-14.36
4238,-14.37
4239,-14.39
4240,-14.40
4241,-14.38
4242,-14.35
4243,-14.31
4244,-14.25
4245,-14.14
4246,-13.99
4247,-13.86
4248,-13.77
4249,-13.71
4250,-13.68
4251,-13.65
4252,-13.61
4253,-13.55
4254,-13.49
4255,-13.45
4256,-13.48
4257,-13.59
4258,-13.80
4259,-14.13
4260,-14.60
4261,-15.13
4262,-15.71
4263,-16.24
4264,-16.75
4265,-17.18
4266,-17.56
4267,-17.86
4268,-18.10
4269,-18.30
4270,-18.50
4271,-18.73
4272,-19.03
4273,-19.35
4274,-19.69
4275,-19.95
4276,-20.14
4277,-20.19
4278,-20.13
4279,-19.97
4280,-19.79
4281,-19.62
4282,-19.57
4283,-19.68
4284,-20.05
4285,-20.64
4286,-21.41
4287,-22.25
4288,-23.13
4289,-23.97
4290,-24.69
4291,-25.23
4292,-25.58
4293,-25.76
4294,-25.76
4295,-25.54
4296,-25.14
4297,-24.60
4298,-23.98
4299,-23.28
4300,-22.54
4301,-21.87
4302,-21.32
4303,-20.97
4304,-20.69
4305,-20.48
4306,-20.25
4307,-20.03
4308,-19.68
4309,-19.20
4310,-18.54
4311,-17.85
4312,-17.18
4313,-16.62
4314,-16.15
4315,-15.81
4316,-15.54
4317,-15.38
4318,-15.22
4319,-15.03
4320,-14.70
4321,-14.27
4322,-13.69
4323,-13.06
4324,-12.44
4325,-11.93
4326,-11.58
4327,-11.47
4328,-11.58
4329,-11.89
4330,-12.28
4331,-12.65
4332,-12.92
4333,-13.00
4334,-12.87
4335,-12.57
4336,-12.21
4337,-11.86
4338,-11.63
4339,-11.55
4340,-11.75
4341,-12.18
4342,-12.83
4343,-13.55
4344,-14.30
4345,-14.98
4346,-15.58
4347,-16.05
4348,-16.45
4349,-16.75
4350,-17.06
4351,-17.37
4352,-17.78
4353,-18.23
4354,-18.67
4355,-19.00
4356,-19.19
4357,-19.17
4358,-19.01
4359,-18.76
4360,-18.55
4361,-18.48
4362,-18.60
4363,-18.93
4364,-19.45
4365,-20.07
4366,-20.62
4367,-21.00
4368,-21.10
4369,-20.87
4370,-20.37
4371,-19.70
4372,-19.01
4373,-18.44
4374,-18.04
4375,-17.88
4376,-17.91
4377,-18.07
4378,-18.23
4379,-18.27
4380,-18.14
4381,-17.91
4382,-17.57
4383,-17.18
4384,-16.76
4385,-16.40
4386,-16.16
4387,-16.05
4388,-15.99
4389,-15.88
4390,-15.65
4391,-15.34
4392,-14.92
4393,-14.43
4394,-13.87
4395,-13.31
4396,-12.82
4397,-12.43
4398,-12.10
4399,-11.81
4400,-11.57
4401,-11.41
4402,-11.33
4403,-11.34
4404,-11.41
4405,-11.56
4406,-11.80
4407,-12.09
4408,-12.46
4409,-12.83
4410,-13.24
4411,-13.69
4412,-14.19
4413,-14.70
4414,-15.16
4415,-15.49
4416,-15.70
4417,-15.80
4418,-15.85
4419,-15.84
4420,-15.82
4421,-15.85
4422,-15.98
4423,-16.19
4424,-16.46
4425,-16.69
4426,-16.87
4427,-16.93
4428,-16.87
4429,-16.65
4430,-16.32
4431,-15.95
4432,-15.66
4433,-15.53
4434,-15.59
4435,-15.83
4436,-16.24
4437,-16.75
4438,-17.30
4439,-17.75
4440,-18.03
4441,-18.09
4442,-17.96
4443,-17.71
4444,-17.43
4445,-17.20
4446,-17.14
4447,-17.25
4448,-17.56
4449,-18.01
4450,-18.55
4451,-19.06
4452,-19.48
4453,-19.78
4454,-19.98
4455,-20.10
4456,-20.11
4457,-20.05
4458,-19.97
4459,-19.91
4460,-19.87
4461,-19.84
4462,-19.82
4463,-19.81
4464,-19.84
4465,-19.87
4466,-19.88
4467,-19.82
4468,-19.69
4469,-19.51
4470,-19.31
4471,-19.10
4472,-18.87
4473,-18.66
4474,-18.52
4475,-18.49
4476,-18.55
4477,-18.70
4478,-18.94
4479,-19.22
4480,-19.45
4481,-19.57
4482,-19.58
4483,-19.52
4484,-19.39
4485,-19.21
4486,-19.01
4487,-18.83
4488,-18.67
4489,-18.56
4490,-18.49
4491,-18.46
4492,-18.46
4493,-18.51
4494,-18.52
4495,-18.53
4496,-18.50
4497,-18.45
4498,-18.33
4499,-18.14
4500,-17.80
4501,-17.40
4502,-16.91
4503,-16.41
4504,-15.85
4505,-15.30
4506,-14.74
4507,-14.24
4508,-13.74
4509,-13.25
4510,-12.72
4511,-12.19
4512,-11.60
4513,-10.98
4514,-10.33
4515,-9.74
4516,-9.20
4517,-8.73
4518,-8.29
4519,-7.94
4520,-7.68
4521,-7.53
4522,-7.49
4523,-7.58
4524,-7.80
4525,-8.16
4526,-8.63
4527,-9.12
4528,-9.57
4529,-9.92
4530,-10.19
4531,-10.36
4532,-10.48
4533,-10.52
4534,-10.57
4535,-10.65
4536,-10.83
4537,-11.05
4538,-11.33
4539,-11.60
4540,-11.89
4541,-12.18
4542,-12.48
4543,-12.73
4544,-12.95
4545,-13.15
4546,-13.42
4547,-13.73
4548,-14.12
4549,-14.56
4550,-15.11
4551,-15.75
4552,-16.53
4553,-17.30
4554,-18.04
4555,-18.66
4556,-19.17
4557,-19.51
4558,-19.77
4559,-19.97
4560,-20.17
4561,-20.36
4562,-20.59
4563,-20.83
4564,-21.12
4565,-21.38
4566,-21.58
4567,-21.66
4568,-21.68
4569,-21.68
4570,-21.66
4571,-21.63
4572,-21.60
4573,-21.63
4574,-21.74
4575,-21.93
4576,-22.11
4577,-22.24
4578,-22.29
4579,-22.23
4580,-22.01
4581,-21.63
4582,-21.12
4583,-20.55
4584,-19.94
4585,-19.41
4586,-19.00
4587,-18.74
4588,-18.52
4589,-18.30
4590,-18.04
4591,-17.74
4592,-17.36
4593,-16.95
4594,-16.52
4595,-16.17
4596,-15.88
4597,-15.64
4598,-15.43
4599,-15.23
4600,-15.02
4601,-14.81
4602,-14.60
4603,-14.45
4604,-14.40
4605,-14.49
4606,-14.72
4607,-15.08
4608,-15.53
4609,-16.02
4610,-16.45
4611,-16.75
4612,-16.91
4613,-16.99
4614,-17.06
4615,-17.11
4616,-17.16
4617,-17.19
4618,-17.23
4619,-17.29
4620,-17.34
4621,-17.37
4622,-17.41
4623,-17.49
4624,-17.64
4625,-17.81
4626,-18.02
4627,-18.20
4628,-18.33
4629,-18.39
4630,-18.38
4631,-18.33
4632,-18.36
4633,-18.49
4634,-18.79
4635,-19.17
4636,-19.63
4637,-20.05
4638,-20.40
4639,-20.60
4640,-20.67
4641,-20.66
4642,-20.68
4643,-20.79
4644,-21.04
4645,-21.43
4646,-21.94
4647,-22.46
4648,-22.86
4649,-23.01
4650,-22.89
4651,-22.52
4652,-21.97
4653,-21.34
4654,-20.71
4655,-20.20
4656,-19.83
4657,-19.60
4658,-19.45
4659,-19.34
4660,-19.22
4661,-19.10
4662,-18.99
4663,-18.90
4664,-18.84
4665,-18.84
4666,-18.91
4667,-19.04
4668,-19.17
4669,-19.26
4670,-19.29
4671,-19.26
4672,-19.18
4673,-19.06
4674,-18.91
4675,-18.76
4676,-18.63
4677,-18.55
4678,-18.49
4679,-18.47
4680,-18.44
4681,-18.38
4682,-18.26
4683,-18.12
4684,-17.96
4685,-17.78
4686,-17.54
4687,-17.27
4688,-17.04
4689,-16.86
4690,-16.70
4691,-16.56
4692,-16.43
4693,-16.33
4694,-16.29
4695,-16.29
4696,-16.34
4697,-16.46
4698,-16.64
4699,-16.86
4700,-17.07
4701,-17.27
4702,-17.37
4703,-17.37
4704,-17.25
4705,-17.01
4706,-16.68
4707,-16.28
4708,-15.85
4709,-15.44
4710,-15.08
4711,-14.83
4712,-14.74
4713,-14.83
4714,-15.08
4715,-15.42
4716,-15.75
4717,-16.04
4718,-16.21
4719,-16.26
4720,-16.20
4721,-16.11
4722,-16.08
4723,-16.16
4724,-16.38
4725,-16.69
4726,-17.02
4727,-17.33
4728,-17.52
4729,-17.52
4730,-17.30
4731,-16.94
4732,-16.54
4733,-16.23
4734,-16.07
4735,-16.04
4736,-16.12
4737,-16.27
4738,-16.46
4739,-16.60
4740,-16.70
4741,-16.78
4742,-16.95
4743,-17.27
4744,-17.76
4745,-18.39
4746,-19.10
4747,-19.76
4748,-20.30
4749,-20.62
4750,-20.77
4751,-20.77
4752,-20.78
4753,-20.86
4754,-21.09
4755,-21.44
4756,-21.91
4757,-22.39
4758,-22.83
4759,-23.12
4760,-23.28
4761,-23.28
4762,-23.26
4763,-23.24
4764,-23.33
4765,-23.53
4766,-23.87
4767,-24.32
4768,-24.86
4769,-25.39
4770,-25.91
4771,-26.37
4772,-26.85
4773,-27.29
4774,-27.70
4775,-28.01
4776,-28.18
4777,-28.21
4778,-28.09
4779,-27.85
4780,-27.50
4781,-27.15
4782,-26.83
4783,-26.60
4784,-26.39
4785,-26.23
4786,-26.04
4787,-25.79
4788,-25.36
4789,-24.77
4790,-24.03
4791,-23.32
4792,-22.66
4793,-22.17
4794,-21.79
4795,-21.57
4796,-21.44
4797,-21.41
4798,-21.31
4799,-21.10
4800,-20.64
4801,-19.98
4802,-19.15
4803,-18.25
4804,-17.33
4805,-16.49
4806,-15.82
4807,-15.39
4808,-15.24
4809,-15.37
4810,-15.72
4811,-16.24
4812,-16.85
4813,-17.48
4814,-18.10
4815,-18.62
4816,-19.06
4817,-19.38
4818,-19.66
4819,-19.88
4820,-20.10
4821,-20.29
4822,-20.57
4823,-20.91
4824,-21.35
4825,-21.76
4826,-22.16
4827,-22.48
4828,-22.75
4829,-22.98
4830,-23.21
4831,-23.38
4832,-23.51
4833,-23.62
4834,-23.77
4835,-23.97
4836,-24.23
4837,-24.51
4838,-24.79
4839,-25.05
4840,-25.30
4841,-25.51
4842,-25.68
4843,-25.83
4844,-25.98
4845,-26.12
4846,-26.25
4847,-26.31
4848,-26.31
4849,-26.29
4850,-26.22
4851,-26.13
4852,-26.01
4853,-25.92
4854,-25.89
4855,-25.93
4856,-25.93
4857,-25.87
4858,-25.68
4859,-25.35
4860,-24.83
4861,-24.18
4862,-23.48
4863,-22.90
4864,-22.51
4865,-22.38
4866,-22.43
4867,-22.64
4868,-22.84
4869,-22.98
4870,-22.92
4871,-22.66
4872,-22.17
4873,-21.55
4874,-20.81
4875,-20.07
4876,-19.36
4877,-18.70
4878,-18.08
4879,-17.55
4880,-17.14
4881,-16.85
4882,-16.72
4883,-16.75
4884,-16.98
4885,-17.40
4886,-17.93
4887,-18.45
4888,-18.91
4889,-19.25
4890,-19.52
4891,-19.78
4892,-20.13
4893,-20.64
4894,-21.31
4895,-22.06
4896,-22.82
4897,-23.48
4898,-23.97
4899,-24.15
4900,-24.00
4901,-23.56
4902,-22.99
4903,-22.43
4904,-22.06
4905,-21.93
4906,-22.06
4907,-22.44
4908,-22.96
4909,-23.48
4910,-23.83
4911,-23.93
4912,-23.75
4913,-23.28
4914,-22.60
4915,-21.80
4916,-21.10
4917,-20.60
4918,-20.39
4919,-20.48
4920,-20.90
4921,-21.63
4922,-22.56
4923,-23.52
4924,-24.42
4925,-25.17
4926,-25.73
4927,-26.08
4928,-26.25
4929,-26.24
4930,-26.15
4931,-26.04
4932,-26.00
4933,-26.06
4934,-26.25
4935,-26.51
4936,-26.82
4937,-27.13
4938,-27.40
4939,-27.58
4940,-27.60
4941,-27.49
4942,-27.29
4943,-27.05
4944,-26.76
4945,-26.46
4946,-26.21
4947,-26.05
4948,-25.96
4949,-25.89
4950,-25.76
4951,-25.58
4952,-25.35
4953,-25.08
4954,-24.79
4955,-24.51
4956,-24.31
4957,-24.25
4958,-24.35
4959,-24.60
4960,-24.96
4961,-25.42
4962,-25.89
4963,-26.29
4964,-26.55
4965,-26.60
4966,-26.44
4967,-26.12
4968,-25.67
4969,-25.12
4970,-24.49
4971,-23.86
4972,-23.35
4973,-23.01
4974,-22.85
4975,-22.89
4976,-23.14
4977,-23.60
4978,-24.14
4979,-24.64
4980,-24.95
4981,-25.05
4982,-24.92
4983,-24.59
4984,-24.07
4985,-23.45
4986,-22.77
4987,-22.09
4988,-21.36
4989,-20.64
4990,-19.85
4991,-19.09
4992,-18.30
4993,-17.59
4994,-16.97
4995,-16.53
4996,-16.23
4997,-16.01
4998,-15.73
4999,-15.39
5000,-14.92
5001,-14.39
5002,-13.79
5003,-13.25
5004,-12.86
5005,-12.74
5006,-12.89
5007,-13.30
5008,-13.86
5009,-14.47
5010,-15.00
5011,-15.34
5012,-15.45
5013,-15.34
5014,-15.08
5015,-14.78
5016,-14.54
5017,-14.48
5018,-14.62
5019,-14.95
5020,-15.43
5021,-16.01
5022,-16.58
5023,-16.97
5024,-17.10
5025,-16.91
5026,-16.51
5027,-15.96
5028,-15.43
5029,-15.06
5030,-15.05
5031,-15.42
5032,-16.18
5033,-17.20
5034,-18.42
5035,-19.65
5036,-20.77
5037,-21.67
5038,-22.34
5039,-22.76
5040,-23.05
5041,-23.24
5042,-23.48
5043,-23.73
5044,-24.02
5045,-24.29
5046,-24.54
5047,-24.71
5048,-24.77
5049,-24.68
5050,-24.51
5051,-24.31
5052,-24.15
5053,-24.03
5054,-23.96
5055,-23.94
5056,-23.93
5057,-23.91
5058,-23.84
5059,-23.69
5060,-23.41
5061,-23.03
5062,-22.59
5063,-22.14
5064,-21.65
5065,-21.19
5066,-20.75
5067,-20.40
5068,-20.07
5069,-19.73
5070,-19.30
5071,-18.83
5072,-18.30
5073,-17.80
5074,-17.32
5075,-16.94
5076,-16.66
5077,-16.53
5078,-16.45
5079,-16.38
5080,-16.18
5081,-15.81
5082,-15.21
5083,-14.45
5084,-13.62
5085,-12.89
5086,-12.42
5087,-12.36
5088,-12.73
5089,-13.47
5090,-14.40
5091,-15.35
5092,-16.12
5093,-16.57
5094,-16.68
5095,-16.50
5096,-16.20
5097,-15.91
5098,-15.81
5099,-15.95
5100,-16.39
5101,-17.04
5102,-17.85
5103,-18.67
5104,-19.41
5105,-19.94
5106,-20.23
5107,-20.32
5108,-20.28
5109,-20.16
5110,-20.07
5111,-19.99
5112,-20.05
5113,-20.25
5114,-20.61
5115,-21.02
5116,-21.47
5117,-21.85
5118,-22.16
5119,-22.32
5120,-22.40
5121,-22.45
5122,-22.60
5123,-22.91
5124,-23.45
5125,-24.13
5126,-24.95
5127,-25.76
5128,-26.47
5129,-26.92
5130,-27.07
5131,-26.94
5132,-26.62
5133,-26.21
5134,-25.83
5135,-25.54
5136,-25.32
5137,-25.15
5138,-24.97
5139,-24.70
5140,-24.31
5141,-23.79
5142,-23.21
5143,-22.67
5144,-22.23
5145,-22.00
5146,-21.98
5147,-22.20
5148,-22.57
5149,-23.00
5150,-23.41
5151,-23.74
5152,-23.97
5153,-24.12
5154,-24.19
5155,-24.19
5156,-24.14
5157,-24.02
5158,-23.84
5159,-23.64
5160,-23.41
5161,-23.16
5162,-22.90
5163,-22.63
5164,-22.39
5165,-22.22
5166,-22.07
5167,-21.93
5168,-21.74
5169,-21.50
5170,-21.22
5171,-20.96
5172,-20.72
5173,-20.52
5174,-20.32
5175,-20.20
5176,-20.20
5177,-20.36
5178,-20.58
5179,-20.80
5180,-20.98
5181,-21.16
5182,-21.33
5183,-21.46
5184,-21.48
5185,-21.42
5186,-21.33
5187,-21.23
5188,-21.12
5189,-20.98
5190,-20.83
5191,-20.70
5192,-20.61
5193,-20.55
5194,-20.51
5195,-20.48
5196,-20.47
5197,-20.45
5198,-20.37
5199,-20.25
5200,-20.11
5201,-19.99
5202,-19.90
5203,-19.87
5204,-19.93
5205,-20.07
5206,-20.29
5207,-20.53
5208,-20.78
5209,-20.99
5210,-21.13
5211,-21.18
5212,-21.19
5213,-21.16
5214,-21.09
5215,-20.99
5216,-20.94
5217,-20.96
5218,-21.06
5219,-21.18
5220,-21.30
5221,-21.41
5222,-21.58
5223,-21.84
5224,-22.23
5225,-22.73
5226,-23.35
5227,-24.04
5228,-24.76
5229,-25.39
5230,-25.89
5231,-26.21
5232,-26.41
5233,-26.50
5234,-26.60
5235,-26.71
5236,-26.89
5237,-27.12
5238,-27.41
5239,-27.65
5240,-27.79
5241,-27.76
5242,-27.58
5243,-27.33
5244,-27.08
5245,-26.90
5246,-26.82
5247,-26.89
5248,-27.08
5249,-27.37
5250,-27.62
5251,-27.78
5252,-27.80
5253,-27.73
5254,-27.50
5255,-27.19
5256,-26.75
5257,-26.28
5258,-25.74
5259,-25.13
5260,-24.36
5261,-23.51
5262,-22.58
5263,-21.69
5264,-20.81
5265,-19.99
5266,-19.20
5267,-18.53
5268,-17.91
5269,-17.36
5270,-16.78
5271,-16.21
5272,-15.56
5273,-14.93
5274,-14.23
5275,-13.59
5276,-12.99
5277,-12.57
5278,-12.21
5279,-11.98
5280,-11.72
5281,-11.44
5282,-11.02
5283,-10.47
5284,-9.74
5285,-8.92
5286,-7.97
5287,-7.05
5288,-6.21
5289,-5.62
5290,-5.26
5291,-5.14
5292,-5.11
5293,-5.09
5294,-5.01
5295,-4.89
5296,-4.75
5297,-4.65
5298,-4.65
5299,-4.80
5300,-5.13
5301,-5.62
5302,-6.18
5303,-6.72
5304,-7.20
5305,-7.51
5306,-7.68
5307,-7.72
5308,-7.79
5309,-7.96
5310,-8.29
5311,-8.73
5312,-9.28
5313,-9.84
5314,-10.38
5315,-10.76
5316,-10.98
5317,-11.02
5318,-11.02
5319,-10.99
5320,-11.05
5321,-11.28
5322,-11.79
5323,-12.53
5324,-13.44
5325,-14.34
5326,-15.15
5327,-15.75
5328,-16.10
5329,-16.15
5330,-15.95
5331,-15.54
5332,-15.07
5333,-14.60
5334,-14.23
5335,-14.00
5336,-13.92
5337,-13.95
5338,-14.00
5339,-14.01
5340,-13.96
5341,-13.88
5342,-13.70
5343,-13.47
5344,-13.19
5345,-12.93
5346,-12.66
5347,-12.44
5348,-12.22
5349,-12.05
5350,-11.87
5351,-11.67
5352,-11.42
5353,-11.12
5354,-10.77
5355,-10.38
5356,-9.98
5357,-9.63
5358,-9.32
5359,-9.05
5360,-8.80
5361,-8.60
5362,-8.43
5363,-8.28
5364,-8.13
5365,-8.00
5366,-7.97
5367,-8.05
5368,-8.26
5369,-8.56
5370,-8.94
5371,-9.36
5372,-9.80
5373,-10.18
5374,-10.52
5375,-10.83
5376,-11.19
5377,-11.57
5378,-12.00
5379,-12.44
5380,-12.93
5381,-13.40
5382,-13.85
5383,-14.14
5384,-14.28
5385,-14.27
5386,-14.19
5387,-14.08
5388,-14.01
5389,-13.98
5390,-14.03
5391,-14.15
5392,-14.31
5393,-14.46
5394,-14.60
5395,-14.72
5396,-14.77
5397,-14.71
5398,-14.55
5399,-14.31
5400,-14.02
5401,-13.70
5402,-13.44
5403,-13.28
5404,-13.31
5405,-13.55
5406,-13.98
5407,-14.56
5408,-15.22
5409,-15.85
5410,-16.37
5411,-16.73
5412,-16.94
5413,-17.04
5414,-17.12
5415,-17.17
5416,-17.24
5417,-17.33
5418,-17.47
5419,-17.62
5420,-17.72
5421,-17.73
5422,-17.60
5423,-17.36
5424,-17.03
5425,-16.63
5426,-16.20
5427,-15.76
5428,-15.32
5429,-14.92
5430,-14.61
5431,-14.43
5432,-14.43
5433,-14.58
5434,-14.82
5435,-15.13
5436,-15.47
5437,-15.84
5438,-16.17
5439,-16.41
5440,-16.52
5441,-16.49
5442,-16.35
5443,-16.10
5444,-15.78
5445,-15.44
5446,-15.19
5447,-15.04
5448,-14.98
5449,-14.98
5450,-15.06
5451,-15.24
5452,-15.47
5453,-15.70
5454,-15.84
5455,-15.91
5456,-15.88
5457,-15.77
5458,-15.52
5459,-15.17
5460,-14.72
5461,-14.28
5462,-13.82
5463,-13.40
5464,-12.92
5465,-12.43
5466,-11.86
5467,-11.28
5468,-10.60
5469,-9.84
5470,-8.95
5471,-8.03
5472,-7.10
5473,-6.30
5474,-5.65
5475,-5.26
5476,-5.00
5477,-4.88
5478,-4.74
5479,-4.55
5480,-4.21
5481,-3.75
5482,-3.12
5483,-2.43
5484,-1.75
5485,-1.24
5486,-0.96
5487,-0.93
5488,-1.11
5489,-1.49
5490,-2.00
5491,-2.56
5492,-3.11
5493,-3.59
5494,-4.04
5495,-4.41
5496,-4.71
5497,-4.88
5498,-5.00
5499,-5.07
5500,-5.14
5501,-5.20
5502,-5.30
5503,-5.42
5504,-5.65
5505,-5.94
5506,-6.35
5507,-6.81
5508,-7.33
5509,-7.80
5510,-8.26
5511,-8.65
5512,-9.06
5513,-9.47
5514,-9.96
5515,-10.54
5516,-11.27
5517,-12.11
5518,-13.05
5519,-13.97
5520,-14.79
5521,-15.43
5522,-15.88
5523,-16.10
5524,-16.12
5525,-15.98
5526,-15.84
5527,-15.76
5528,-15.82
5529,-15.98
5530,-16.20
5531,-16.45
5532,-16.64
5533,-16.71
5534,-16.59
5535,-16.29
5536,-15.85
5537,-15.37
5538,-14.87
5539,-14.43
5540,-14.04
5541,-13.72
5542,-13.44
5543,-13.22
5544,-12.98
5545,-12.73
5546,-12.38
5547,-12.04
5548,-11.66
5549,-11.28
5550,-10.83
5551,-10.29
5552,-9.70
5553,-9.13
5554,-8.63
5555,-8.24
5556,-7.95
5557,-7.82
5558,-7.82
5559,-7.95
5560,-8.09
5561,-8.19
5562,-8.22
5563,-8.22
5564,-8.19
5565,-8.13
5566,-8.03
5567,-7.95
5568,-7.90
5569,-7.87
5570,-7.80
5571,-7.69
5572,-7.56
5573,-7.45
5574,-7.41
5575,-7.44
5576,-7.60
5577,-7.87
5578,-8.20
5579,-8.53
5580,-8.84
5581,-9.10
5582,-9.32
5583,-9.50
5584,-9.69
5585,-9.89
5586,-10.10
5587,-10.28
5588,-10.44
5589,-10.55
5590,-10.64
5591,-10.69
5592,-10.75
5593,-10.83
5594,-10.98
5595,-11.15
5596,-11.34
5597,-11.48
5598,-11.59
5599,-11.61
5600,-11.57
5601,-11.49
5602,-11.53
5603,-11.76
5604,-12.23
5605,-12.86
5606,-13.57
5607,-14.23
5608,-14.78
5609,-15.11
5610,-15.17
5611,-14.95
5612,-14.58
5613,-14.23
5614,-14.04
5615,-14.04
5616,-14.21
5617,-14.50
5618,-14.79
5619,-15.01
5620,-15.05
5621,-14.88
5622,-14.49
5623,-13.98
5624,-13.42
5625,-12.94
5626,-12.57
5627,-12.34
5628,-12.19
5629,-12.09
5630,-11.96
5631,-11.78
5632,-11.52
5633,-11.24
5634,-10.90
5635,-10.58
5636,-10.24
5637,-9.95
5638,-9.70
5639,-9.51
5640,-9.28
5641,-9.03
5642,-8.71
5643,-8.38
5644,-8.04
5645,-7.71
5646,-7.40
5647,-7.17
5648,-7.03
5649,-7.01
5650,-7.03
5651,-7.07
5652,-7.10
5653,-7.10
5654,-7.03
5655,-6.92
5656,-6.78
5657,-6.67
5658,-6.52
5659,-6.39
5660,-6.26
5661,-6.10
5662,-5.87
5663,-5.56
5664,-5.17
5665,-4.73
5666,-4.27
5667,-3.83
5668,-3.49
5669,-3.30
5670,-3.27
5671,-3.39
5672,-3.68
5673,-4.16
5674,-4.75
5675,-5.37
5676,-5.92
5677,-6.34
5678,-6.59
5679,-6.68
5680,-6.66
5681,-6.58
5682,-6.52
5683,-6.52
5684,-6.63
5685,-6.83
5686,-7.10
5687,-7.34
5688,-7.53
5689,-7.61
5690,-7.58
5691,-7.42
5692,-7.20
5693,-6.97
5694,-6.84
5695,-6.84
5696,-7.00
5697,-7.29
5698,-7.71
5699,-8.22
5700,-8.82
5701,-9.44
5702,-10.06
5703,-10.59
5704,-11.08
5705,-11.47
5706,-11.84
5707,-12.16
5708,-12.49
5709,-12.81
5710,-13.15
5711,-13.47
5712,-13.80
5713,-14.13
5714,-14.46
5715,-14.72
5716,-14.88
5717,-14.85
5718,-14.63
5719,-14.25
5720,-13.82
5721,-13.42
5722,-13.15
5723,-13.05
5724,-13.19
5725,-13.54
5726,-14.11
5727,-14.84
5728,-15.64
5729,-16.43
5730,-17.13
5731,-17.69
5732,-18.14
5733,-18.46
5734,-18.68
5735,-18.81
5736,-18.80
5737,-18.62
5738,-18.26
5739,-17.75
5740,-17.17
5741,-16.56
5742,-15.95
5743,-15.42
5744,-15.01
5745,-14.79
5746,-14.61
5747,-14.43
5748,-14.13
5749,-13.69
5750,-13.02
5751,-12.20
5752,-11.25
5753,-10.36
5754,-9.55
5755,-8.96
5756,-8.59
5757,-8.47
5758,-8.47
5759,-8.52
5760,-8.45
5761,-8.22
5762,-7.79
5763,-7.19
5764,-6.45
5765,-5.67
5766,-4.96
5767,-4.46
5768,-4.17
5769,-4.12
5770,-4.25
5771,-4.49
5772,-4.78
5773,-5.05
5774,-5.28
5775,-5.42
5776,-5.48
5777,-5.47
5778,-5.52
5779,-5.68
5780,-6.02
5781,-6.49
5782,-7.10
5783,-7.78
5784,-8.52
5785,-9.21
5786,-9.81
5787,-10.24
5788,-10.57
5789,-10.82
5790,-11.10
5791,-11.41
5792,-11.81
5793,-12.22
5794,-12.67
5795,-13.03
5796,-13.24
5797,-13.20
5798,-12.95
5799,-12.57
5800,-12.20
5801,-11.92
5802,-11.83
5803,-11.97
5804,-12.39
5805,-12.99
5806,-13.67
5807,-14.28
5808,-14.74
5809,-14.98
5810,-14.95
5811,-14.69
5812,-14.22
5813,-13.67
5814,-13.13
5815,-12.69
5816,-12.36
5817,-12.18
5818,-12.12
5819,-12.15
5820,-12.13
5821,-12.02
5822,-11.76
5823,-11.41
5824,-10.96
5825,-10.52
5826,-10.08
5827,-9.74
5828,-9.48
5829,-9.31
5830,-9.12
5831,-8.83
5832,-8.39
5833,-7.83
5834,-7.15
5835,-6.49
5836,-5.90
5837,-5.49
5838,-5.27
5839,-5.25
5840,-5.35
5841,-5.48
5842,-5.55
5843,-5.53
5844,-5.40
5845,-5.21
5846,-5.01
5847,-4.91
5848,-5.03
5849,-5.38
5850,-5.95
5851,-6.61
5852,-7.30
5853,-7.90
5854,-8.38
5855,-8.67
5856,-8.79
5857,-8.77
5858,-8.73
5859,-8.69
5860,-8.70
5861,-8.76
5862,-8.90
5863,-9.10
5864,-9.35
5865,-9.60
5866,-9.79
5867,-9.91
5868,-9.96
5869,-9.89
5870,-9.70
5871,-9.43
5872,-9.15
5873,-8.92
5874,-8.84
5875,-8.93
5876,-9.22
5877,-9.66
5878,-10.22
5879,-10.83
5880,-11.43
5881,-11.91
5882,-12.18
5883,-12.27
5884,-12.26
5885,-12.18
5886,-12.07
5887,-11.89
5888,-11.70
5889,-11.54
5890,-11.44
5891,-11.44
5892,-11.58
5893,-11.87
5894,-12.32
5895,-12.86
5896,-13.46
5897,-14.00
5898,-14.41
5899,-14.62
5900,-14.61
5901,-14.42
5902,-14.15
5903,-13.90
5904,-13.76
5905,-13.72
5906,-13.82
5907,-14.06
5908,-14.43
5909,-14.82
5910,-15.12
5911,-15.27
5912,-15.32
5913,-15.28
5914,-15.14
5915,-14.95
5916,-14.73
5917,-14.57
5918,-14.47
5919,-14.42
5920,-14.42
5921,-14.41
5922,-14.37
5923,-14.29
5924,-14.19
5925,-14.09
5926,-13.96
5927,-13.82
5928,-13.72
5929,-13.69
5930,-13.69
5931,-13.74
5932,-13.79
5933,-13.85
5934,-13.89
5935,-13.94
5936,-13.92
5937,-13.85
5938,-13.63
5939,-13.29
5940,-12.77
5941,-12.15
5942,-11.41
5943,-10.67
5944,-9.95
5945,-9.34
5946,-8.79
5947,-8.30
5948,-7.77
5949,-7.19
5950,-6.46
5951,-5.67
5952,-4.79
5953,-3.96
5954,-3.21
5955,-2.65
5956,-2.24
5957,-2.02
5958,-1.91
5959,-1.84
5960,-1.69
5961,-1.46
5962,-1.14
5963,-0.86
5964,-0.72
5965,-0.80
5966,-1.15
5967,-1.73
5968,-2.44
5969,-3.14
5970,-3.72
5971,-4.04
5972,-4.10
5973,-3.91
5974,-3.57
5975,-3.20
5976,-2.91
5977,-2.82
5978,-2.97
5979,-3.36
5980,-3.94
5981,-4.61
5982,-5.26
5983,-5.76
5984,-6.10
5985,-6.26
5986,-6.34
5987,-6.39
5988,-6.47
5989,-6.58
5990,-6.77
5991,-7.06
5992,-7.50
5993,-8.03
5994,-8.64
5995,-9.19
5996,-9.73
5997,-10.19
5998,-10.64
5999,-11.06
6000,-11.44
6001,-11.69
6002,-11.86
6003,-11.97
6004,-12.12
6005,-12.28
6006,-12.47
6007,-12.65
6008,-12.86
6009,-13.06
6010,-13.24
6011,-13.36
6012,-13.41
6013,-13.41
6014,-13.38
6015,-13.35
6016,-13.33
6017,-13.33
6018,-13.34
6019,-13.36
6020,-13.31
6021,-13.15
6022,-12.89
6023,-12.60
6024,-12.31
6025,-12.07
6026,-11.86
6027,-11.73
6028,-11.63
6029,-11.58
6030,-11.49
6031,-11.35
6032,-11.15
6033,-10.95
6034,-10.72
6035,-10.49
6036,-10.25
6037,-10.01
6038,-9.76
6039,-9.52
6040,-9.29
6041,-9.09
6042,-8.88
6043,-8.66
6044,-8.48
6045,-8.35
6046,-8.32
6047,-8.36
6048,-8.43
6049,-8.54
6050,-8.72
6051,-8.96
6052,-9.25
6053,-9.59
6054,-9.92
6055,-10.19
6056,-10.37
6057,-10.46
6058,-10.48
6059,-10.44
6060,-10.35
6061,-10.27
6062,-10.24
6063,-10.25
6064,-10.31
6065,-10.40
6066,-10.59
6067,-10.87
6068,-11.25
6069,-11.64
6070,-12.08
6071,-12.51
6072,-12.93
6073,-13.29
6074,-13.62
6075,-13.88
6076,-14.07
6077,-14.15
6078,-14.18
6079,-14.13
6080,-14.06
6081,-13.93
6082,-13.81
6083,-13.76
6084,-13.92
6085,-14.31
6086,-14.88
6087,-15.55
6088,-16.23
6089,-16.79
6090,-17.20
6091,-17.37
6092,-17.36
6093,-17.19
6094,-16.98
6095,-16.78
6096,-16.72
6097,-16.78
6098,-16.93
6099,-17.08
6100,-17.19
6101,-17.19
6102,-17.07
6103,-16.83
6104,-16.49
6105,-16.13
6106,-15.79
6107,-15.55
6108,-15.46
6109,-15.49
6110,-15.59
6111,-15.71
6112,-15.85
6113,-15.97
6114,-16.02
6115,-16.00
6116,-15.90
6117,-15.74
6118,-15.54
6119,-15.30
6120,-15.05
6121,-14.80
6122,-14.61
6123,-14.53
6124,-14.56
6125,-14.71
6126,-14.94
6127,-15.25
6128,-15.61
6129,-15.95
6130,-16.15
6131,-16.19
6132,-16.06
6133,-15.82
6134,-15.48
6135,-15.09
6136,-14.69
6137,-14.33
6138,-14.02
6139,-13.79
6140,-13.60
6141,-13.45
6142,-13.33
6143,-13.25
6144,-13.18
6145,-13.15
6146,-13.18
6147,-13.26
6148,-13.39
6149,-13.53
6150,-13.60
6151,-13.60
6152,-13.53
6153,-13.44
6154,-13.35
6155,-13.29
6156,-13.26
6157,-13.27
6158,-13.29
6159,-13.30
6160,-13.21
6161,-13.00
6162,-12.70
6163,-12.40
6164,-12.15
6165,-12.01
6166,-11.94
6167,-11.99
6168,-12.12
6169,-12.27
6170,-12.31
6171,-12.20
6172,-11.96
6173,-11.65
6174,-11.31
6175,-10.95
6176,-10.61
6177,-10.36
6178,-10.25
6179,-10.24
6180,-10.35
6181,-10.56
6182,-10.90
6183,-11.36
6184,-11.97
6185,-12.72
6186,-13.64
6187,-14.61
6188,-15.59
6189,-16.46
6190,-17.23
6191,-17.81
6192,-18.18
6193,-18.32
6194,-18.36
6195,-18.36
6196,-18.42
6197,-18.50
6198,-18.70
6199,-18.95
6200,-19.26
6201,-19.49
6202,-19.65
6203,-19.73
6204,-19.80
6205,-19.87
6206,-20.02
6207,-20.25
6208,-20.65
6209,-21.18
6210,-21.82
6211,-22.49
6212,-23.11
6213,-23.62
6214,-23.98
6215,-24.15
6216,-24.15
6217,-24.05
6218,-23.83
6219,-23.54
6220,-23.12
6221,-22.60
6222,-21.95
6223,-21.23
6224,-20.44
6225,-19.68
6226,-18.93
6227,-18.26
6228,-17.59
6229,-16.96
6230,-16.25
6231,-15.50
6232,-14.57
6233,-13.55
6234,-12.39
6235,-11.27
6236,-10.18
6237,-9.24
6238,-8.39
6239,-7.74
6240,-7.15
6241,-6.67
6242,-6.16
6243,-5.71
6244,-5.25
6245,-4.88
6246,-4.52
6247,-4.23
6248,-4.00
6249,-3.83
6250,-3.65
6251,-3.49
6252,-3.32
6253,-3.17
6254,-3.01
6255,-2.87
6256,-2.75
6257,-2.69
6258,-2.70
6259,-2.76
6260,-2.86
6261,-3.01
6262,-3.22
6263,-3.48
6264,-3.78
6265,-4.04
6266,-4.28
6267,-4.43
6268,-4.49
6269,-4.52
6270,-4.59
6271,-4.78
6272,-5.14
6273,-5.62
6274,-6.20
6275,-6.77
6276,-7.25
6277,-7.48
6278,-7.46
6279,-7.18
6280,-6.73
6281,-6.23
6282,-5.84
6283,-5.68
6284,-5.81
6285,-6.20
6286,-6.81
6287,-7.51
6288,-8.19
6289,-8.71
6290,-8.97
6291,-9.00
6292,-8.85
6293,-8.60
6294,-8.29
6295,-7.97
6296,-7.66
6297,-7.39
6298,-7.16
6299,-6.94
6300,-6.74
6301,-6.56
6302,-6.45
6303,-6.42
6304,-6.45
6305,-6.55
6306,-6.69
6307,-6.85
6308,-6.94
6309,-6.92
6310,-6.74
6311,-6.39
6312,-5.84
6313,-5.15
6314,-4.38
6315,-3.63
6316,-2.94
6317,-2.31
6318,-1.75
6319,-1.27
6320,-0.87
6321,-0.51
6322,-0.20
6323,0.02
6324,0.06
6325,-0.11
6326,-0.51
6327,-1.14
6328,-2.00
6329,-2.99
6330,-3.99
6331,-4.83
6332,-5.49
6333,-5.92
6334,-6.19
6335,-6.32
6336,-6.45
6337,-6.61
6338,-6.87
6339,-7.13
6340,-7.40
6341,-7.61
6342,-7.76
6343,-7.81
6344,-7.76
6345,-7.64
6346,-7.51
6347,-7.41
6348,-7.33
6349,-7.29
6350,-7.26
6351,-7.26
6352,-7.26
6353,-7.23
6354,-7.19
6355,-7.16
6356,-7.12
6357,-7.09
6358,-7.10
6359,-7.19
6360,-7.34
6361,-7.51
6362,-7.73
6363,-7.97
6364,-8.22
6365,-8.47
6366,-8.65
6367,-8.74
6368,-8.75
6369,-8.68
6370,-8.57
6371,-8.38
6372,-8.17
6373,-8.01
6374,-7.98
6375,-8.06
6376,-8.24
6377,-8.48
6378,-8.80
6379,-9.19
6380,-9.61
6381,-10.00
6382,-10.36
6383,-10.66
6384,-10.87
6385,-10.99
6386,-11.02
6387,-10.96
6388,-10.81
6389,-10.63
6390,-10.48
6391,-10.37
6392,-10.33
6393,-10.35
6394,-10.40
6395,-10.48
6396,-10.57
6397,-10.64
6398,-10.67
6399,-10.67
6400,-10.63
6401,-10.57
6402,-10.51
6403,-10.48
6404,-10.45
6405,-10.40
6406,-10.29
6407,-10.15
6408,-9.96
6409,-9.76
6410,-9.52
6411,-9.28
6412,-9.07
6413,-8.95
6414,-8.95
6415,-9.07
6416,-9.28
6417,-9.57
6418,-9.86
6419,-10.15
6420,-10.32
6421,-10.38
6422,-10.20
6423,-9.82
6424,-9.20
6425,-8.43
6426,-7.51
6427,-6.50
6428,-5.39
6429,-4.26
6430,-3.14
6431,-2.14
6432,-1.20
6433,-0.44
6434,0.14
6435,0.45
6436,0.60
6437,0.60
6438,0.60
6439,0.56
6440,0.63
6441,0.76
6442,1.04
6443,1.37
6444,1.69
6445,1.90
6446,1.97
6447,1.88
6448,1.66
6449,1.35
6450,1.03
6451,0.79
6452,0.68
6453,0.78
6454,1.02
6455,1.34
6456,1.59
6457,1.69
6458,1.57
6459,1.21
6460,0.63
6461,-0.06
6462,-0.79
6463,-1.37
6464,-1.77
6465,-1.91
6466,-1.85
6467,-1.65
6468,-1.43
6469,-1.29
6470,-1.41
6471,-1.84
6472,-2.63
6473,-3.65
6474,-4.83
6475,-6.00
6476,-7.07
6477,-7.90
6478,-8.45
6479,-8.64
6480,-8.58
6481,-8.38
6482,-8.19
6483,-8.06
6484,-8.05
6485,-8.13
6486,-8.32
6487,-8.55
6488,-8.84
6489,-9.14
6490,-9.41
6491,-9.63
6492,-9.78
6493,-9.90
6494,-9.97
6495,-9.98
6496,-9.89
6497,-9.72
6498,-9.45
6499,-9.06
6500,-8.54
6501,-7.95
6502,-7.32
6503,-6.76
6504,-6.24
6505,-5.84
6506,-5.53
6507,-5.36
6508,-5.26
6509,-5.20
6510,-5.05
6511,-4.82
6512,-4.44
6513,-3.97
6514,-3.42
6515,-2.85
6516,-2.28
6517,-1.79
6518,-1.37
6519,-1.00
6520,-0.65
6521,-0.34
6522,-0.05
6523,0.22
6524,0.53
6525,0.82
6526,1.00
6527,0.98
6528,0.79
6529,0.44
6530,-0.04
6531,-0.63
6532,-1.25
6533,-1.80
6534,-2.22
6535,-2.47
6536,-2.62
6537,-2.63
6538,-2.60
6539,-2.55
6540,-2.60
6541,-2.77
6542,-3.10
6543,-3.51
6544,-4.00
6545,-4.47
6546,-4.91
6547,-5.24
6548,-5.45
6549,-5.52
6550,-5.54
6551,-5.55
6552,-5.66
6553,-5.86
6554,-6.19
6555,-6.60
6556,-7.10
6557,-7.58
6558,-7.98
6559,-8.22
6560,-8.32
6561,-8.30
6562,-8.24
6563,-8.20
6564,-8.29
6565,-8.51
6566,-8.87
6567,-9.27
6568,-9.67
6569,-9.97
6570,-10.09
6571,-10.00
6572,-9.74
6573,-9.38
6574,-8.96
6575,-8.61
6576,-8.35
6577,-8.27
6578,-8.32
6579,-8.39
6580,-8.36
6581,-8.16
6582,-7.74
6583,-7.16
6584,-6.50
6585,-5.87
6586,-5.36
6587,-5.08
6588,-5.09
6589,-5.37
6590,-5.84
6591,-6.40
6592,-6.89
6593,-7.23
6594,-7.36
6595,-7.26
6596,-6.98
6597,-6.61
6598,-6.28
6599,-6.03
6600,-5.89
6601,-5.84
6602,-5.87
6603,-6.00
6604,-6.14
6605,-6.21
6606,-6.13
6607,-5.96
6608,-5.71
6609,-5.45
6610,-5.13
6611,-4.81
6612,-4.49
6613,-4.23
6614,-3.98
6615,-3.72
6616,-3.40
6617,-3.04
6618,-2.69
6619,-2.39
6620,-2.16
6621,-2.04
6622,-2.06
6623,-2.24
6624,-2.53
6625,-2.88
6626,-3.18
6627,-3.36
6628,-3.39
6629,-3.23
6630,-2.94
6631,-2.61
6632,-2.30
6633,-2.08
6634,-2.01
6635,-2.11
6636,-2.34
6637,-2.65
6638,-2.94
6639,-3.15
6640,-3.28
6641,-3.34
6642,-3.33
6643,-3.27
6644,-3.17
6645,-3.07
6646,-3.02
6647,-3.02
6648,-3.06
6649,-3.09
6650,-3.09
6651,-3.06
6652,-3.02
6653,-2.98
6654,-2.98
6655,-3.00
6656,-3.06
6657,-3.11
6658,-3.17
6659,-3.23
6660,-3.33
6661,-3.49
6662,-3.79
6663,-4.23
6664,-4.85
6665,-5.62
6666,-6.52
6667,-7.45
6668,-8.38
6669,-9.17
6670,-9.84
6671,-10.33
6672,-10.73
6673,-11.01
6674,-11.24
6675,-11.40
6676,-11.60
6677,-11.83
6678,-12.12
6679,-12.34
6680,-12.52
6681,-12.63
6682,-12.74
6683,-12.84
6684,-12.98
6685,-13.15
6686,-13.44
6687,-13.82
6688,-14.25
6689,-14.71
6690,-15.21
6691,-15.68
6692,-16.05
6693,-16.27
6694,-16.36
6695,-16.38
6696,-16.33
6697,-16.22
6698,-16.06
6699,-15.91
6700,-15.79
6701,-15.71
6702,-15.62
6703,-15.54
6704,-15.44
6705,-15.33
6706,-15.12
6707,-14.84
6708,-14.45
6709,-14.01
6710,-13.47
6711,-12.89
6712,-12.24
6713,-11.55
6714,-10.80
6715,-10.10
6716,-9.46
6717,-8.96
6718,-8.53
6719,-8.22
6720,-8.00
6721,-7.85
6722,-7.70
6723,-7.50
6724,-7.23
6725,-6.94
6726,-6.61
6727,-6.32
6728,-6.10
6729,-6.00
6730,-6.04
6731,-6.23
6732,-6.53
6733,-6.89
6734,-7.25
6735,-7.51
6736,-7.71
6737,-7.84
6738,-8.00
6739,-8.19
6740,-8.50
6741,-8.88
6742,-9.37
6743,-9.90
6744,-10.48
6745,-11.04
6746,-11.57
6747,-12.02
6748,-12.36
6749,-12.58
6750,-12.77
6751,-12.94
6752,-13.15
6753,-13.31
6754,-13.44
6755,-13.50
6756,-13.55
6757,-13.59
6758,-13.66
6759,-13.78
6760,-14.02
6761,-14.40
6762,-14.88
6763,-15.44
6764,-16.01
6765,-16.53
6766,-16.88
6767,-17.04
6768,-16.98
6769,-16.80
6770,-16.53
6771,-16.24
6772,-15.93
6773,-15.66
6774,-15.43
6775,-15.23
6776,-15.01
6777,-14.75
6778,-14.41
6779,-14.03
6780,-13.58
6781,-13.13
6782,-12.71
6783,-12.39
6784,-12.15
6785,-12.04
6786,-12.05
6787,-12.18
6788,-12.34
6789,-12.51
6790,-12.61
6791,-12.63
6792,-12.46
6793,-12.11
6794,-11.55
6795,-10.89
6796,-10.19
6797,-9.57
6798,-9.03
6799,-8.62
6800,-8.32
6801,-8.12
6802,-7.94
6803,-7.77
6804,-7.56
6805,-7.32
6806,-7.06
6807,-6.85
6808,-6.73
6809,-6.72
6810,-6.85
6811,-7.10
6812,-7.46
6813,-7.93
6814,-8.51
6815,-9.19
6816,-9.99
6817,-10.83
6818,-11.65
6819,-12.37
6820,-12.97
6821,-13.41
6822,-13.70
6823,-13.85
6824,-13.90
6825,-13.88
6826,-13.86
6827,-13.83
6828,-13.81
6829,-13.71
6830,-13.53
6831,-13.25
6832,-12.95
6833,-12.67
6834,-12.47
6835,-12.37
6836,-12.43
6837,-12.61
6838,-12.86
6839,-13.08
6840,-13.20
6841,-13.17
6842,-12.99
6843,-12.75
6844,-12.50
6845,-12.31
6846,-12.21
6847,-12.23
6848,-12.33
6849,-12.46
6850,-12.50
6851,-12.46
6852,-12.31
6853,-12.09
6854,-11.80
6855,-11.48
6856,-11.18
6857,-10.98
6858,-10.80
6859,-10.64
6860,-10.44
6861,-10.24
6862,-10.00
6863,-9.70
6864,-9.30
6865,-8.83
6866,-8.32
6867,-7.84
6868,-7.39
6869,-7.06
6870,-6.94
6871,-7.03
6872,-7.26
6873,-7.55
6874,-7.82
6875,-8.06
6876,-8.20
6877,-8.18
6878,-7.97
6879,-7.64
6880,-7.23
6881,-6.85
6882,-6.52
6883,-6.22
6884,-5.94
6885,-5.68
6886,-5.42
6887,-5.19
6888,-4.94
6889,-4.74
6890,-4.59
6891,-4.53
6892,-4.54
6893,-4.62
6894,-4.70
6895,-4.80
6896,-4.84
6897,-4.81
6898,-4.71
6899,-4.54
6900,-4.27
6901,-3.95
6902,-3.58
6903,-3.23
6904,-2.86
6905,-2.55
6906,-2.25
6907,-2.02
6908,-1.81
6909,-1.59
6910,-1.27
6911,-0.86
6912,-0.31
6913,0.31
6914,0.98
6915,1.60
6916,2.17
6917,2.65
6918,3.06
6919,3.40
6920,3.75
6921,4.14
6922,4.60
6923,5.07
6924,5.48
6925,5.74
6926,5.79
6927,5.57
6928,5.05
6929,4.30
6930,3.46
6931,2.66
6932,1.99
6933,1.53
6934,1.28
6935,1.21
6936,1.13
6937,0.97
6938,0.66
6939,0.21
6940,-0.39
6941,-1.05
6942,-1.68
6943,-2.12
6944,-2.38
6945,-2.44
6946,-2.43
6947,-2.38
6948,-2.40
6949,-2.50
6950,-2.80
6951,-3.20
6952,-3.71
6953,-4.18
6954,-4.62
6955,-4.97
6956,-5.26
6957,-5.49
6958,-5.72
6959,-6.00
6960,-6.44
6961,-7.00
6962,-7.68
6963,-8.40
6964,-9.13
6965,-9.77
6966,-10.31
6967,-10.70
6968,-10.95
6969,-11.03
6970,-10.97
6971,-10.78
6972,-10.54
6973,-10.33
6974,-10.20
6975,-10.13
6976,-10.12
6977,-10.19
6978,-10.33
6979,-10.49
6980,-10.57
6981,-10.48
6982,-10.22
6983,-9.86
6984,-9.43
6985,-9.02
6986,-8.63
6987,-8.31
6988,-8.03
6989,-7.83
6990,-7.66
6991,-7.53
6992,-7.36
6993,-7.16
6994,-6.89
6995,-6.59
6996,-6.27
6997,-5.97
6998,-5.71
6999,-5.51
7000,-5.33
7001,-5.22
7002,-5.18
7003,-5.24
7004,-5.36
7005,-5.55
7006,-5.79
7007,-6.03
7008,-6.21
7009,-6.24
7010,-6.08
7011,-5.74
7012,-5.31
7013,-4.84
7014,-4.46
7015,-4.20
7016,-4.19
7017,-4.38
7018,-4.81
7019,-5.41
7020,-6.16
7021,-6.97
7022,-7.75
7023,-8.41
7024,-8.95
7025,-9.32
7026,-9.56
7027,-9.67
7028,-9.77
7029,-9.86
7030,-10.03
7031,-10.22
7032,-10.53
7033,-10.87
7034,-11.25
7035,-11.54
7036,-11.77
7037,-11.91
7038,-12.00
7039,-12.02
7040,-12.05
7041,-12.08
7042,-12.21
7043,-12.41
7044,-12.75
7045,-13.19
7046,-13.72
7047,-14.29
7048,-14.88
7049,-15.42
7050,-15.86
7051,-16.11
7052,-16.12
7053,-15.91
7054,-15.50
7055,-14.98
7056,-14.43
7057,-13.95
7058,-13.60
7059,-13.39
7060,-13.31
7061,-13.29
7062,-13.24
7063,-13.17
7064,-13.02
7065,-12.81
7066,-12.52
7067,-12.17
7068,-11.76
7069,-11.37
7070,-11.04
7071,-10.81
7072,-10.62
7073,-10.48
7074,-10.35
7075,-10.27
7076,-10.21
7077,-10.19
7078,-10.19
7079,-10.22
7080,-10.25
7081,-10.30
7082,-10.30
7083,-10.25
7084,-10.09
7085,-9.86
7086,-9.57
7087,-9.30
7088,-9.03
7089,-8.77
7090,-8.49
7091,-8.20
7092,-7.84
7093,-7.40
7094,-6.87
7095,-6.30
7096,-5.72
7097,-5.24
7098,-4.94
7099,-4.88
7100,-5.04
7101,-5.38
7102,-5.85
7103,-6.37
7104,-6.82
7105,-7.15
7106,-7.36
7107,-7.48
7108,-7.51
7109,-7.45
7110,-7.31
7111,-7.16
7112,-7.07
7113,-7.00
7114,-6.90
7115,-6.75
7116,-6.62
7117,-6.53
7118,-6.43
7119,-6.32
7120,-6.23
7121,-6.22
7122,-6.32
7123,-6.53
7124,-6.83
7125,-7.16
7126,-7.46
7127,-7.71
7128,-7.88
7129,-7.97
7130,-7.96
7131,-7.86
7132,-7.75
7133,-7.68
7134,-7.70
7135,-7.80
7136,-8.04
7137,-8.31
7138,-8.58
7139,-8.74
7140,-8.84
7141,-8.92
7142,-9.09
7143,-9.38
7144,-9.82
7145,-10.41
7146,-11.19
7147,-12.08
7148,-13.03
7149,-13.86
7150,-14.54
7151,-14.94
7152,-15.12
7153,-15.07
7154,-14.93
7155,-14.78
7156,-14.79
7157,-15.02
7158,-15.52
7159,-16.17
7160,-16.92
7161,-17.62
7162,-18.20
7163,-18.55
7164,-18.67
7165,-18.56
7166,-18.34
7167,-18.08
7168,-17.90
7169,-17.84
7170,-17.93
7171,-18.14
7172,-18.41
7173,-18.69
7174,-18.92
7175,-19.08
7176,-19.11
7177,-19.03
7178,-18.81
7179,-18.51
7180,-18.14
7181,-17.75
7182,-17.37
7183,-17.02
7184,-16.69
7185,-16.42
7186,-16.23
7187,-16.15
7188,-16.12
7189,-16.19
7190,-16.16
7191,-16.02
7192,-15.71
7193,-16.42
7194,-15.74
7195,-12.15
7196,-9.87
7197,-15.24
7198,-20.97
7199,-8.35
7200,12.29
