1,-189.09
2,-250.00
3,-250.00
4,-240.65
5,-237.50
6,-250.00
7,-244.57
8,-144.59
9,12.18
10,156.62
11,237.38
12,249.99
13,249.99
14,248.13
15,249.22
16,249.99
17,249.99
18,249.99
19,249.15
20,243.16
21,229.48
22,211.23
23,190.61
24,170.52
25,153.66
26,141.53
27,135.42
28,132.51
29,131.11
30,128.87
31,126.26
32,122.02
33,117.00
34,110.51
35,104.17
36,97.63
37,91.97
38,86.46
39,81.65
40,76.90
41,72.71
42,68.51
43,64.83
44,61.12
45,57.87
46,54.55
47,51.64
48,48.66
49,46.06
50,43.37
51,40.99
52,38.51
53,36.31
54,34.03
55,31.99
56,29.88
57,27.99
58,26.05
59,24.34
60,22.57
61,20.97
62,19.31
63,17.81
64,16.28
65,14.92
66,13.52
67,12.28
68,10.98
69,9.80
70,8.56
71,7.44
72,6.29
73,5.26
74,4.19
75,3.20
76,2.16
77,1.24
78,0.28
79,-0.56
80,-1.43
81,-2.22
82,-3.04
83,-3.78
84,-4.54
85,-5.23
86,-5.94
87,-6.58
88,-7.22
89,-7.79
90,-8.38
91,-8.90
92,-9.45
93,-9.94
94,-10.46
95,-10.94
96,-11.42
97,-11.86
98,-12.31
99,-12.74
100,-13.19
101,-13.60
102,-14.01
103,-14.37
104,-14.76
105,-15.11
106,-15.49
107,-15.84
108,-16.17
109,-16.47
110,-16.78
111,-17.08
112,-17.39
113,-17.65
114,-17.92
115,-18.18
116,-18.46
117,-18.72
118,-18.98
119,-19.21
120,-19.45
121,-19.68
122,-19.95
123,-20.21
124,-20.46
125,-20.68
126,-20.92
127,-21.16
128,-21.40
129,-21.61
130,-21.82
131,-22.01
132,-22.22
133,-22.42
134,-22.63
135,-22.81
136,-23.00
137,-23.18
138,-23.37
139,-23.54
140,-23.72
141,-23.90
142,-24.08
143,-24.25
144,-24.44
145,-24.63
146,-24.80
147,-24.93
148,-25.06
149,-25.18
150,-25.28
151,-25.35
152,-25.42
153,-25.47
154,-25.54
155,-25.57
156,-25.60
157,-25.63
158,-25.66
159,-25.70
160,-25.73
161,-25.73
162,-25.75
163,-25.77
164,-25.82
165,-25.86
166,-25.89
167,-25.91
168,-25.95
169,-26.00
170,-26.05
171,-26.11
172,-26.16
173,-26.22
174,-26.28
175,-26.31
176,-26.36
177,-26.41
178,-26.49
179,-26.57
180,-26.63
181,-26.67
182,-26.72
183,-26.77
184,-26.84
185,-26.91
186,-26.99
187,-27.06
188,-27.12
189,-27.18
190,-27.24
191,-27.31
192,-27.39
193,-27.47
194,-27.55
195,-27.64
196,-27.74
197,-27.83
198,-27.94
199,-28.05
200,-28.16
201,-28.26
202,-28.34
203,-28.42
204,-28.50
205,-28.58
206,-28.63
207,-28.67
208,-28.69
209,-28.70
210,-28.70
211,-28.68
212,-28.64
213,-28.59
214,-28.54
215,-28.48
216,-28.43
217,-28.38
218,-28.34
219,-28.27
220,-28.19
221,-28.11
222,-28.05
223,-28.02
224,-27.98
225,-27.93
226,-27.88
227,-27.84
228,-27.82
229,-27.79
230,-27.76
231,-27.73
232,-27.69
233,-27.66
234,-27.64
235,-27.63
236,-27.61
237,-27.58
238,-27.54
239,-27.52
240,-27.50
241,-27.46
242,-27.40
243,-27.34
244,-27.30
245,-27.26
246,-27.21
247,-27.15
248,-27.11
249,-27.08
250,-27.08
251,-27.11
252,-27.16
253,-27.22
254,-27.28
255,-27.35
256,-27.44
257,-27.54
258,-27.64
259,-27.73
260,-27.84
261,-27.94
262,-28.02
263,-28.06
264,-28.09
265,-28.12
266,-28.14
267,-28.14
268,-28.14
269,-28.11
270,-28.08
271,-28.04
272,-27.99
273,-27.95
274,-27.92
275,-27.89
276,-27.86
277,-27.85
278,-27.85
279,-27.86
280,-27.89
281,-27.89
282,-27.91
283,-27.93
284,-27.97
285,-28.01
286,-28.03
287,-28.05
288,-28.08
289,-28.13
290,-28.18
291,-28.21
292,-28.24
293,-28.27
294,-28.31
295,-28.34
296,-28.37
297,-28.39
298,-28.40
299,-28.40
300,-28.38
301,-28.34
302,-28.27
303,-28.21
304,-28.12
305,-28.05
306,-27.96
307,-27.89
308,-27.80
309,-27.73
310,-27.66
311,-27.63
312,-27.59
313,-27.57
314,-27.58
315,-27.61
316,-27.66
317,-27.72
318,-27.77
319,-27.83
320,-27.89
321,-27.96
322,-28.03
323,-28.08
324,-28.12
325,-28.15
326,-28.18
327,-28.21
328,-28.24
329,-28.26
330,-28.29
331,-28.31
332,-28.34
333,-28.35
334,-28.37
335,-28.37
336,-28.35
337,-28.32
338,-28.29
339,-28.26
340,-28.22
341,-28.17
342,-28.11
343,-28.07
344,-28.03
345,-28.00
346,-27.98
347,-27.96
348,-27.95
349,-27.94
350,-27.92
351,-27.92
352,-27.94
353,-27.96
354,-27.98
355,-27.98
356,-27.99
357,-27.99
358,-28.00
359,-28.01
360,-28.02
361,-28.04
362,-28.05
363,-28.08
364,-28.11
365,-28.14
366,-28.18
367,-28.22
368,-28.26
369,-28.31
370,-28.37
371,-28.42
372,-28.47
373,-28.52
374,-28.58
375,-28.64
376,-28.72
377,-28.79
378,-28.87
379,-28.95
380,-29.03
381,-29.08
382,-29.12
383,-29.16
384,-29.20
385,-29.23
386,-29.25
387,-29.25
388,-29.24
389,-29.23
390,-29.23
391,-29.22
392,-29.20
393,-29.15
394,-29.11
395,-29.09
396,-29.06
397,-29.02
398,-28.96
399,-28.90
400,-28.83
401,-28.76
402,-28.67
403,-28.57
404,-28.48
405,-28.40
406,-28.34
407,-28.28
408,-28.23
409,-28.20
410,-28.19
411,-28.19
412,-28.18
413,-28.18
414,-28.21
415,-28.26
416,-28.31
417,-28.35
418,-28.37
419,-28.38
420,-28.39
421,-28.39
422,-28.39
423,-28.37
424,-28.34
425,-28.32
426,-28.30
427,-28.28
428,-28.27
429,-28.27
430,-28.25
431,-28.23
432,-28.21
433,-28.21
434,-28.21
435,-28.23
436,-28.25
437,-28.27
438,-28.27
439,-28.27
440,-28.26
441,-28.26
442,-28.26
443,-28.26
444,-28.26
445,-28.26
446,-28.25
447,-28.23
448,-28.21
449,-28.21
450,-28.20
451,-28.18
452,-28.17
453,-28.15
454,-28.14
455,-28.14
456,-28.16
457,-28.18
458,-28.19
459,-28.20
460,-28.22
461,-28.25
462,-28.30
463,-28.34
464,-28.40
465,-28.47
466,-28.53
467,-28.57
468,-28.61
469,-28.66
470,-28.71
471,-28.75
472,-28.76
473,-28.76
474,-28.77
475,-28.78
476,-28.78
477,-28.76
478,-28.74
479,-28.74
480,-28.76
481,-28.79
482,-28.82
483,-28.85
484,-28.88
485,-28.93
486,-28.98
487,-29.05
488,-29.12
489,-29.18
490,-29.24
491,-29.29
492,-29.34
493,-29.37
494,-29.40
495,-29.42
496,-29.43
497,-29.43
498,-29.43
499,-29.46
500,-29.47
501,-29.47
502,-29.46
503,-29.45
504,-29.45
505,-29.46
506,-29.46
507,-29.44
508,-29.40
509,-29.36
510,-29.34
511,-29.32
512,-29.29
513,-29.23
514,-29.16
515,-29.11
516,-29.07
517,-29.03
518,-28.99
519,-28.96
520,-28.95
521,-28.93
522,-28.92
523,-28.92
524,-28.96
525,-29.00
526,-29.04
527,-29.06
528,-29.09
529,-29.14
530,-29.18
531,-29.21
532,-29.24
533,-29.27
534,-29.29
535,-29.30
536,-29.29
537,-29.25
538,-29.21
539,-29.17
540,-29.14
541,-29.12
542,-29.09
543,-29.05
544,-29.02
545,-28.99
546,-28.98
547,-28.99
548,-29.03
549,-29.08
550,-29.13
551,-29.19
552,-29.27
553,-29.35
554,-29.44
555,-29.53
556,-29.60
557,-29.67
558,-29.73
559,-29.79
560,-29.85
561,-29.91
562,-29.93
563,-29.95
564,-29.97
565,-29.98
566,-29.97
567,-29.94
568,-29.91
569,-29.90
570,-29.88
571,-29.82
572,-29.75
573,-29.69
574,-29.65
575,-29.61
576,-29.56
577,-29.49
578,-29.42
579,-29.37
580,-29.32
581,-29.28
582,-29.24
583,-29.21
584,-29.17
585,-29.16
586,-29.13
587,-29.09
588,-29.05
589,-29.03
590,-29.02
591,-29.02
592,-29.01
593,-29.00
594,-28.99
595,-29.01
596,-29.04
597,-29.05
598,-29.05
599,-29.05
600,-29.08
601,-29.12
602,-29.15
603,-29.16
604,-29.17
605,-29.18
606,-29.19
607,-29.20
608,-29.19
609,-29.19
610,-29.19
611,-29.19
612,-29.19
613,-29.19
614,-29.18
615,-29.18
616,-29.17
617,-29.17
618,-29.15
619,-29.13
620,-29.11
621,-29.10
622,-29.08
623,-29.05
624,-29.02
625,-29.00
626,-28.98
627,-28.96
628,-28.95
629,-28.95
630,-28.95
631,-28.95
632,-28.93
633,-28.93
634,-28.92
635,-28.90
636,-28.86
637,-28.83
638,-28.81
639,-28.79
640,-28.74
641,-28.69
642,-28.62
643,-28.57
644,-28.52
645,-28.47
646,-28.39
647,-28.32
648,-28.26
649,-28.21
650,-28.16
651,-28.09
652,-28.02
653,-27.95
654,-27.91
655,-27.88
656,-27.85
657,-27.82
658,-27.77
659,-27.72
660,-27.68
661,-27.65
662,-27.63
663,-27.58
664,-27.53
665,-27.50
666,-27.48
667,-27.47
668,-27.47
669,-27.46
670,-27.47
671,-27.49
672,-27.53
673,-27.58
674,-27.64
675,-27.71
676,-27.79
677,-27.89
678,-27.98
679,-28.07
680,-28.15
681,-28.22
682,-28.26
683,-28.27
684,-28.28
685,-28.29
686,-28.29
687,-28.28
688,-28.27
689,-28.23
690,-28.18
691,-28.11
692,-28.03
693,-27.95
694,-27.89
695,-27.83
696,-27.77
697,-27.70
698,-27.62
699,-27.52
700,-27.44
701,-27.37
702,-27.31
703,-27.24
704,-27.17
705,-27.11
706,-27.09
707,-27.08
708,-27.05
709,-27.01
710,-26.97
711,-26.95
712,-26.94
713,-26.92
714,-26.90
715,-26.87
716,-26.85
717,-26.82
718,-26.80
719,-26.79
720,-26.77
721,-26.76
722,-26.76
723,-26.77
724,-26.78
725,-26.79
726,-26.82
727,-26.86
728,-26.89
729,-26.93
730,-26.96
731,-27.01
732,-27.05
733,-27.11
734,-27.19
735,-27.26
736,-27.32
737,-27.37
738,-27.43
739,-27.49
740,-27.57
741,-27.64
742,-27.70
743,-27.75
744,-27.79
745,-27.84
746,-27.89
747,-27.91
748,-27.92
749,-27.92
750,-27.91
751,-27.89
752,-27.88
753,-27.85
754,-27.82
755,-27.78
756,-27.74
757,-27.70
758,-27.66
759,-27.63
760,-27.59
761,-27.55
762,-27.51
763,-27.47
764,-27.44
765,-27.41
766,-27.40
767,-27.40
768,-27.38
769,-27.34
770,-27.31
771,-27.29
772,-27.28
773,-27.25
774,-27.23
775,-27.20
776,-27.16
777,-27.11
778,-27.07
779,-27.04
780,-27.02
781,-27.00
782,-26.97
783,-26.95
784,-26.95
785,-26.96
786,-26.99
787,-27.01
788,-27.03
789,-27.06
790,-27.10
791,-27.14
792,-27.18
793,-27.21
794,-27.25
795,-27.28
796,-27.31
797,-27.34
798,-27.37
799,-27.38
800,-27.40
801,-27.44
802,-27.47
803,-27.50
804,-27.53
805,-27.57
806,-27.62
807,-27.68
808,-27.75
809,-27.79
810,-27.82
811,-27.84
812,-27.87
813,-27.91
814,-27.95
815,-27.95
816,-27.95
817,-27.95
818,-27.95
819,-27.93
820,-27.90
821,-27.87
822,-27.86
823,-27.85
824,-27.82
825,-27.79
826,-27.76
827,-27.73
828,-27.73
829,-27.72
830,-27.71
831,-27.73
832,-27.73
833,-27.73
834,-27.73
835,-27.73
836,-27.74
837,-27.75
838,-27.75
839,-27.74
840,-27.73
841,-27.70
842,-27.67
843,-27.64
844,-27.62
845,-27.60
846,-27.58
847,-27.58
848,-27.60
849,-27.62
850,-27.65
851,-27.68
852,-27.73
853,-27.79
854,-27.85
855,-27.90
856,-27.94
857,-27.99
858,-28.05
859,-28.09
860,-28.13
861,-28.16
862,-28.19
863,-28.19
864,-28.18
865,-28.18
866,-28.18
867,-28.18
868,-28.17
869,-28.14
870,-28.11
871,-28.09
872,-28.07
873,-28.04
874,-28.00
875,-27.97
876,-27.93
877,-27.89
878,-27.84
879,-27.81
880,-27.79
881,-27.78
882,-27.74
883,-27.70
884,-27.66
885,-27.64
886,-27.64
887,-27.65
888,-27.64
889,-27.62
890,-27.60
891,-27.60
892,-27.60
893,-27.61
894,-27.60
895,-27.60
896,-27.61
897,-27.64
898,-27.67
899,-27.70
900,-27.74
901,-27.78
902,-27.81
903,-27.84
904,-27.86
905,-27.91
906,-27.95
907,-27.98
908,-27.99
909,-27.98
910,-27.98
911,-27.98
912,-27.96
913,-27.93
914,-27.89
915,-27.86
916,-27.84
917,-27.82
918,-27.80
919,-27.79
920,-27.79
921,-27.79
922,-27.80
923,-27.81
924,-27.83
925,-27.87
926,-27.89
927,-27.90
928,-27.91
929,-27.94
930,-27.97
931,-27.98
932,-27.98
933,-27.95
934,-27.92
935,-27.88
936,-27.84
937,-27.80
938,-27.76
939,-27.71
940,-27.65
941,-27.59
942,-27.53
943,-27.49
944,-27.47
945,-27.45
946,-27.43
947,-27.41
948,-27.40
949,-27.43
950,-27.45
951,-27.47
952,-27.50
953,-27.53
954,-27.57
955,-27.60
956,-27.62
957,-27.65
958,-27.68
959,-27.70
960,-27.71
961,-27.69
962,-27.66
963,-27.65
964,-27.63
965,-27.62
966,-27.60
967,-27.58
968,-27.57
969,-27.58
970,-27.60
971,-27.63
972,-27.66
973,-27.69
974,-27.73
975,-27.79
976,-27.85
977,-27.89
978,-27.91
979,-27.92
980,-27.92
981,-27.92
982,-27.90
983,-27.87
984,-27.83
985,-27.79
986,-27.73
987,-27.66
988,-27.60
989,-27.55
990,-27.50
991,-27.44
992,-27.40
993,-27.38
994,-27.36
995,-27.34
996,-27.31
997,-27.31
998,-27.32
999,-27.31
1000,-27.28
1001,-27.26
1002,-27.26
1003,-27.28
1004,-27.29
1005,-27.28
1006,-27.26
1007,-27.26
1008,-27.28
1009,-27.28
1010,-27.29
1011,-27.31
1012,-27.34
1013,-27.38
1014,-27.42
1015,-27.44
1016,-27.45
1017,-27.47
1018,-27.50
1019,-27.55
1020,-27.60
1021,-27.64
1022,-27.69
1023,-27.73
1024,-27.77
1025,-27.80
1026,-27.83
1027,-27.87
1028,-27.94
1029,-28.00
1030,-28.06
1031,-28.12
1032,-28.20
1033,-28.29
1034,-28.39
1035,-28.47
1036,-28.53
1037,-28.57
1038,-28.63
1039,-28.68
1040,-28.72
1041,-28.76
1042,-28.78
1043,-28.79
1044,-28.81
1045,-28.82
1046,-28.84
1047,-28.85
1048,-28.86
1049,-28.86
1050,-28.84
1051,-28.82
1052,-28.80
1053,-28.79
1054,-28.76
1055,-28.69
1056,-28.61
1057,-28.54
1058,-28.47
1059,-28.38
1060,-28.27
1061,-28.17
1062,-28.08
1063,-28.02
1064,-27.95
1065,-27.87
1066,-27.80
1067,-27.76
1068,-27.73
1069,-27.70
1070,-27.69
1071,-27.69
1072,-27.70
1073,-27.73
1074,-27.74
1075,-27.76
1076,-27.80
1077,-27.86
1078,-27.93
1079,-27.98
1080,-28.01
1081,-28.05
1082,-28.11
1083,-28.17
1084,-28.20
1085,-28.20
1086,-28.19
1087,-28.18
1088,-28.16
1089,-28.13
1090,-28.08
1091,-28.04
1092,-27.98
1093,-27.93
1094,-27.88
1095,-27.83
1096,-27.80
1097,-27.78
1098,-27.75
1099,-27.73
1100,-27.69
1101,-27.69
1102,-27.68
1103,-27.67
1104,-27.65
1105,-27.61
1106,-27.58
1107,-27.57
1108,-27.55
1109,-27.54
1110,-27.51
1111,-27.47
1112,-27.44
1113,-27.43
1114,-27.42
1115,-27.41
1116,-27.40
1117,-27.38
1118,-27.37
1119,-27.35
1120,-27.31
1121,-27.26
1122,-27.19
1123,-27.13
1124,-27.06
1125,-26.97
1126,-26.86
1127,-26.76
1128,-26.66
1129,-26.57
1130,-26.47
1131,-26.41
1132,-26.36
1133,-26.31
1134,-26.28
1135,-26.25
1136,-26.26
1137,-26.28
1138,-26.28
1139,-26.29
1140,-26.32
1141,-26.37
1142,-26.42
1143,-26.44
1144,-26.46
1145,-26.47
1146,-26.50
1147,-26.52
1148,-26.51
1149,-26.50
1150,-26.48
1151,-26.48
1152,-26.49
1153,-26.49
1154,-26.48
1155,-26.48
1156,-26.50
1157,-26.54
1158,-26.57
1159,-26.61
1160,-26.65
1161,-26.70
1162,-26.75
1163,-26.79
1164,-26.82
1165,-26.84
1166,-26.85
1167,-26.85
1168,-26.86
1169,-26.86
1170,-26.83
1171,-26.80
1172,-26.76
1173,-26.72
1174,-26.67
1175,-26.62
1176,-26.57
1177,-26.52
1178,-26.49
1179,-26.46
1180,-26.41
1181,-26.35
1182,-26.30
1183,-26.25
1184,-26.18
1185,-26.08
1186,-25.97
1187,-25.87
1188,-25.79
1189,-25.81
1190,-25.67
1191,-25.40
1192,-25.14
1193,-26.40
1194,-26.45
1195,-23.16
1196,-21.00
1197,-27.69
1198,-35.79
1199,-23.71
1200,1.08
