1,-95.42
2,-133.80
3,-125.69
4,-90.48
5,-55.55
6,-26.20
7,5.24
8,38.26
9,64.57
10,79.70
11,84.05
12,79.11
13,65.43
14,45.89
15,23.63
16,3.87
17,-10.73
18,-16.78
19,-14.08
20,-3.01
21,13.97
22,33.81
23,53.50
24,70.07
25,82.07
26,88.13
27,88.47
28,83.26
29,73.62
30,60.84
31,46.49
32,32.39
33,20.04
34,10.77
35,5.17
36,3.07
37,3.81
38,5.85
39,8.27
40,9.68
41,10.06
42,9.03
43,7.46
44,5.69
45,4.53
46,4.00
47,4.10
48,4.49
49,4.88
50,5.04
51,4.89
52,4.48
53,3.97
54,3.48
55,3.13
56,2.89
57,2.78
58,2.69
59,2.61
60,2.52
61,2.46
62,2.46
63,2.54
64,2.67
65,2.82
66,2.96
67,3.04
68,3.02
69,2.88
70,2.64
71,2.34
72,1.99
73,1.66
74,1.38
75,1.20
76,1.11
77,1.08
78,1.05
79,0.99
80,0.89
81,0.74
82,0.60
83,0.50
84,0.45
85,0.47
86,0.56
87,0.69
88,0.88
89,1.05
90,1.21
91,1.31
92,1.43
93,1.61
94,1.89
95,2.26
96,2.73
97,3.27
98,3.87
99,4.44
100,4.94
101,5.29
102,5.55
103,5.74
104,5.91
105,6.07
106,6.31
107,6.62
108,7.03
109,7.47
110,7.90
111,8.26
112,8.54
113,8.71
114,8.80
115,8.83
116,8.86
117,8.87
118,8.90
119,8.91
120,8.93
121,8.95
122,8.97
123,8.97
124,8.93
125,8.83
126,8.69
127,8.53
128,8.33
129,8.08
130,7.76
131,7.42
132,7.08
133,6.78
134,6.52
135,6.29
136,6.10
137,5.92
138,5.71
139,5.53
140,5.35
141,5.21
142,5.07
143,4.94
144,4.81
145,4.70
146,4.56
147,4.41
148,4.21
149,4.00
150,3.75
151,3.52
152,3.30
153,3.12
154,2.96
155,2.83
156,2.71
157,2.59
158,2.45
159,2.32
160,2.19
161,2.09
162,2.01
163,1.98
164,1.99
165,2.04
166,2.04
167,2.01
168,1.95
169,1.86
170,1.75
171,1.61
172,1.50
173,1.43
174,1.41
175,1.43
176,1.51
177,1.63
178,1.74
179,1.79
180,1.76
181,1.65
182,1.50
183,1.33
184,1.21
185,1.18
186,1.28
187,1.49
188,1.85
189,2.33
190,2.89
191,3.43
192,3.92
193,4.33
194,4.70
195,5.00
196,5.29
197,5.56
198,5.88
199,6.22
200,6.62
201,7.03
202,7.49
203,7.93
204,8.38
205,8.79
206,9.22
207,9.60
208,9.96
209,10.22
210,10.47
211,10.66
212,10.82
213,10.91
214,10.97
215,11.02
216,11.12
217,11.23
218,11.34
219,11.41
220,11.41
221,11.36
222,11.22
223,11.01
224,10.69
225,10.31
226,9.90
227,9.53
228,9.19
229,8.87
230,8.55
231,8.25
232,7.93
233,7.66
234,7.38
235,7.13
236,6.90
237,6.71
238,6.50
239,6.30
240,6.07
241,5.88
242,5.68
243,5.49
244,5.27
245,5.08
246,4.90
247,4.75
248,4.59
249,4.42
250,4.20
251,3.94
252,3.64
253,3.33
254,3.00
255,2.73
256,2.53
257,2.41
258,2.34
259,2.31
260,2.29
261,2.25
262,2.15
263,2.00
264,1.80
265,1.62
266,1.48
267,1.40
268,1.38
269,1.44
270,1.59
271,1.79
272,2.01
273,2.20
274,2.38
275,2.53
276,2.69
277,2.83
278,2.94
279,3.02
280,3.07
281,3.13
282,3.23
283,3.36
284,3.54
285,3.75
286,4.01
287,4.27
288,4.52
289,4.69
290,4.81
291,4.85
292,4.89
293,4.91
294,4.91
295,4.90
296,4.94
297,5.06
298,5.24
299,5.42
300,5.58
301,5.69
302,5.79
303,5.89
304,5.98
305,6.03
306,6.08
307,6.13
308,6.24
309,6.38
310,6.53
311,6.67
312,6.81
313,6.97
314,7.16
315,7.32
316,7.42
317,7.48
318,7.53
319,7.57
320,7.54
321,7.42
322,7.25
323,7.06
324,6.87
325,6.64
326,6.36
327,6.08
328,5.80
329,5.58
330,5.39
331,5.23
332,5.05
333,4.86
334,4.65
335,4.44
336,4.17
337,3.84
338,3.45
339,3.09
340,2.79
341,2.57
342,2.42
343,2.33
344,2.27
345,2.24
346,2.18
347,2.11
348,2.01
349,1.91
350,1.81
351,1.75
352,1.73
353,1.78
354,1.85
355,1.96
356,2.06
357,2.15
358,2.18
359,2.13
360,1.95
361,1.69
362,1.40
363,1.13
364,0.90
365,0.73
366,0.63
367,0.63
368,0.70
369,0.82
370,0.98
371,1.11
372,1.22
373,1.27
374,1.32
375,1.37
376,1.47
377,1.64
378,1.92
379,2.26
380,2.64
381,3.01
382,3.38
383,3.71
384,4.04
385,4.35
386,4.69
387,5.06
388,5.49
389,5.94
390,6.43
391,6.88
392,7.26
393,7.54
394,7.75
395,7.92
396,8.09
397,8.23
398,8.40
399,8.61
400,8.86
401,9.09
402,9.25
403,9.29
404,9.24
405,9.12
406,8.93
407,8.71
408,8.51
409,8.41
410,8.42
411,8.53
412,8.65
413,8.75
414,8.76
415,8.66
416,8.41
417,8.06
418,7.64
419,7.26
420,6.93
421,6.68
422,6.51
423,6.42
424,6.32
425,6.20
426,5.97
427,5.71
428,5.37
429,5.02
430,4.64
431,4.30
432,4.04
433,3.88
434,3.80
435,3.74
436,3.60
437,3.37
438,3.01
439,2.58
440,2.06
441,1.53
442,0.99
443,0.52
444,0.11
445,-0.18
446,-0.37
447,-0.47
448,-0.58
449,-0.69
450,-0.85
451,-1.06
452,-1.35
453,-1.68
454,-2.08
455,-2.47
456,-2.86
457,-3.20
458,-3.47
459,-3.68
460,-3.87
461,-4.02
462,-4.15
463,-4.26
464,-4.33
465,-4.34
466,-4.30
467,-4.19
468,-4.00
469,-3.72
470,-3.33
471,-2.86
472,-2.33
473,-1.79
474,-1.24
475,-0.74
476,-0.26
477,0.11
478,0.50
479,0.88
480,1.35
481,1.85
482,2.43
483,3.04
484,3.72
485,4.38
486,5.04
487,5.63
488,6.19
489,6.65
490,7.03
491,7.32
492,7.59
493,7.84
494,8.09
495,8.32
496,8.58
497,8.81
498,9.00
499,9.10
500,9.15
501,9.13
502,9.08
503,9.00
504,8.93
505,8.89
506,8.86
507,8.85
508,8.86
509,8.87
510,8.78
511,8.62
512,8.35
513,8.04
514,7.63
515,7.18
516,6.71
517,6.27
518,5.84
519,5.43
520,5.06
521,4.72
522,4.34
523,3.94
524,3.51
525,3.14
526,2.80
527,2.56
528,2.38
529,2.33
530,2.35
531,2.42
532,2.48
533,2.49
534,2.39
535,2.17
536,1.85
537,1.50
538,1.20
539,0.96
540,0.77
541,0.68
542,0.69
543,0.80
544,0.90
545,0.95
546,0.94
547,0.88
548,0.75
549,0.56
550,0.37
551,0.24
552,0.18
553,0.18
554,0.21
555,0.27
556,0.36
557,0.47
558,0.63
559,0.76
560,0.88
561,0.98
562,1.14
563,1.36
564,1.64
565,1.98
566,2.38
567,2.82
568,3.35
569,3.90
570,4.49
571,5.04
572,5.56
573,6.03
574,6.50
575,6.92
576,7.32
577,7.68
578,8.03
579,8.38
580,8.76
581,9.10
582,9.45
583,9.79
584,10.13
585,10.42
586,10.66
587,10.81
588,10.93
589,11.02
590,11.11
591,11.17
592,11.20
593,11.18
594,11.10
595,10.98
596,10.83
597,10.67
598,10.50
599,10.32
600,10.15
601,10.05
602,9.94
603,9.81
604,9.59
605,9.30
606,8.92
607,8.51
608,8.05
609,7.62
610,7.23
611,6.91
612,6.66
613,6.47
614,6.28
615,6.12
616,5.91
617,5.66
618,5.33
619,4.97
620,4.62
621,4.34
622,4.06
623,3.78
624,3.49
625,3.23
626,2.94
627,2.62
628,2.16
629,1.63
630,1.06
631,0.53
632,0.00
633,-0.45
634,-0.80
635,-0.99
636,-1.08
637,-1.08
638,-1.08
639,-1.09
640,-1.20
641,-1.38
642,-1.66
643,-1.95
644,-2.18
645,-2.33
646,-2.37
647,-2.31
648,-2.23
649,-2.16
650,-2.16
651,-2.24
652,-2.42
653,-2.64
654,-2.84
655,-2.97
656,-2.99
657,-2.88
658,-2.66
659,-2.37
660,-2.10
661,-1.88
662,-1.72
663,-1.60
664,-1.51
665,-1.42
666,-1.27
667,-1.07
668,-0.76
669,-0.44
670,-0.15
671,0.03
672,0.18
673,0.28
674,0.43
675,0.62
676,0.92
677,1.30
678,1.81
679,2.34
680,2.88
681,3.30
682,3.64
683,3.86
684,4.04
685,4.17
686,4.30
687,4.40
688,4.57
689,4.75
690,4.99
691,5.20
692,5.42
693,5.62
694,5.87
695,6.12
696,6.39
697,6.68
698,6.98
699,7.27
700,7.55
701,7.76
702,7.94
703,8.10
704,8.22
705,8.26
706,8.21
707,8.09
708,7.92
709,7.70
710,7.42
711,7.10
712,6.79
713,6.52
714,6.25
715,6.00
716,5.74
717,5.49
718,5.20
719,4.91
720,4.60
721,4.33
722,4.09
723,3.89
724,3.69
725,3.52
726,3.38
727,3.27
728,3.11
729,2.94
730,2.76
731,2.60
732,2.44
733,2.28
734,2.14
735,2.04
736,1.97
737,1.89
738,1.81
739,1.75
740,1.73
741,1.75
742,1.79
743,1.83
744,1.88
745,1.94
746,1.99
747,2.01
748,2.00
749,1.98
750,1.97
751,1.96
752,1.98
753,2.01
754,2.11
755,2.23
756,2.33
757,2.42
758,2.49
759,2.59
760,2.70
761,2.84
762,3.04
763,3.30
764,3.61
765,3.93
766,4.22
767,4.44
768,4.57
769,4.56
770,4.43
771,4.21
772,3.96
773,3.73
774,3.56
775,3.51
776,3.59
777,3.75
778,3.91
779,4.04
780,4.12
781,4.14
782,4.05
783,3.88
784,3.65
785,3.47
786,3.33
787,3.22
788,3.11
789,3.01
790,2.91
791,2.82
792,2.71
793,2.61
794,2.54
795,2.50
796,2.48
797,2.46
798,2.45
799,2.46
800,2.44
801,2.40
802,2.27
803,2.10
804,1.86
805,1.60
806,1.31
807,1.04
808,0.79
809,0.59
810,0.43
811,0.30
812,0.16
813,0.02
814,-0.12
815,-0.26
816,-0.40
817,-0.53
818,-0.60
819,-0.60
820,-0.55
821,-0.48
822,-0.40
823,-0.32
824,-0.27
825,-0.27
826,-0.31
827,-0.40
828,-0.50
829,-0.60
830,-0.66
831,-0.66
832,-0.62
833,-0.55
834,-0.50
835,-0.45
836,-0.43
837,-0.43
838,-0.47
839,-0.52
840,-0.60
841,-0.70
842,-0.83
843,-0.97
844,-1.08
845,-1.14
846,-1.17
847,-1.16
848,-1.14
849,-1.10
850,-1.07
851,-1.07
852,-1.11
853,-1.18
854,-1.30
855,-1.42
856,-1.53
857,-1.59
858,-1.59
859,-1.56
860,-1.48
861,-1.38
862,-1.24
863,-1.09
864,-0.91
865,-0.72
866,-0.47
867,-0.15
868,0.23
869,0.60
870,0.95
871,1.26
872,1.58
873,1.89
874,2.21
875,2.53
876,2.88
877,3.24
878,3.63
879,3.99
880,4.32
881,4.55
882,4.69
883,4.75
884,4.78
885,4.75
886,4.72
887,4.68
888,4.71
889,4.80
890,4.93
891,5.05
892,5.19
893,5.36
894,5.56
895,5.74
896,5.91
897,6.06
898,6.23
899,6.37
900,6.45
901,6.48
902,6.45
903,6.44
904,6.41
905,6.37
906,6.31
907,6.24
908,6.13
909,5.95
910,5.68
911,5.35
912,4.95
913,4.55
914,4.15
915,3.78
916,3.44
917,3.14
918,2.85
919,2.56
920,2.26
921,1.95
922,1.59
923,1.20
924,0.77
925,0.40
926,0.08
927,-0.11
928,-0.21
929,-0.21
930,-0.20
931,-0.15
932,-0.10
933,-0.04
934,0.02
935,0.05
936,0.08
937,0.14
938,0.26
939,0.43
940,0.66
941,0.88
942,1.08
943,1.25
944,1.42
945,1.59
946,1.80
947,2.03
948,2.33
949,2.68
950,3.14
951,3.65
952,4.26
953,4.84
954,5.43
955,5.94
956,6.41
957,6.81
958,7.23
959,7.61
960,8.01
961,8.42
962,8.90
963,9.40
964,9.94
965,10.43
966,10.89
967,11.25
968,11.54
969,11.76
970,11.96
971,12.15
972,12.35
973,12.57
974,12.85
975,13.16
976,13.47
977,13.69
978,13.82
979,13.85
980,13.79
981,13.67
982,13.54
983,13.44
984,13.36
985,13.31
986,13.27
987,13.21
988,13.10
989,12.93
990,12.68
991,12.41
992,12.09
993,11.79
994,11.45
995,11.15
996,10.83
997,10.52
998,10.15
999,9.77
1000,9.37
1001,9.01
1002,8.66
1003,8.33
1004,8.01
1005,7.74
1006,7.47
1007,7.20
1008,6.89
1009,6.60
1010,6.33
1011,6.12
1012,5.93
1013,5.78
1014,5.65
1015,5.57
1016,5.51
1017,5.46
1018,5.39
1019,5.29
1020,5.16
1021,5.04
1022,4.94
1023,4.87
1024,4.78
1025,4.71
1026,4.65
1027,4.62
1028,4.52
1029,4.38
1030,4.20
1031,4.01
1032,3.81
1033,3.59
1034,3.40
1035,3.25
1036,3.15
1037,3.06
1038,2.94
1039,2.83
1040,2.70
1041,2.53
1042,2.34
1043,2.18
1044,2.13
1045,2.18
1046,2.30
1047,2.44
1048,2.64
1049,2.88
1050,3.11
1051,3.27
1052,3.38
1053,3.49
1054,3.65
1055,3.84
1056,4.07
1057,4.30
1058,4.56
1059,4.81
1060,5.07
1061,5.26
1062,5.42
1063,5.55
1064,5.71
1065,5.87
1066,6.10
1067,6.33
1068,6.59
1069,6.85
1070,7.10
1071,7.32
1072,7.48
1073,7.55
1074,7.56
1075,7.54
1076,7.54
1077,7.55
1078,7.59
1079,7.62
1080,7.69
1081,7.79
1082,7.90
1083,8.03
1084,8.15
1085,8.26
1086,8.36
1087,8.42
1088,8.45
1089,8.42
1090,8.37
1091,8.33
1092,8.33
1093,8.39
1094,8.49
1095,8.59
1096,8.67
1097,8.72
1098,8.71
1099,8.63
1100,8.46
1101,8.27
1102,8.09
1103,7.94
1104,7.82
1105,7.71
1106,7.59
1107,7.46
1108,7.25
1109,6.96
1110,6.59
1111,6.23
1112,5.88
1113,5.59
1114,5.34
1115,5.15
1116,4.98
1117,4.84
1118,4.65
1119,4.44
1120,4.17
1121,3.90
1122,3.62
1123,3.42
1124,3.23
1125,3.11
1126,2.99
1127,2.90
1128,2.78
1129,2.65
1130,2.48
1131,2.28
1132,2.05
1133,1.84
1134,1.63
1135,1.46
1136,1.29
1137,1.14
1138,0.99
1139,0.86
1140,0.78
1141,0.74
1142,0.76
1143,0.79
1144,0.85
1145,0.91
1146,1.00
1147,1.15
1148,1.37
1149,1.63
1150,1.91
1151,2.19
1152,2.46
1153,2.69
1154,2.91
1155,3.11
1156,3.37
1157,3.68
1158,4.10
1159,4.59
1160,5.17
1161,5.77
1162,6.34
1163,6.81
1164,7.20
1165,7.47
1166,7.67
1167,7.77
1168,7.84
1169,7.87
1170,7.92
1171,7.99
1172,8.09
1173,8.19
1174,8.29
1175,8.38
1176,8.51
1177,8.67
1178,8.84
1179,9.03
1180,9.22
1181,9.42
1182,9.59
1183,9.70
1184,9.71
1185,9.63
1186,9.45
1187,9.24
1188,9.01
1189,8.81
1190,8.62
1191,8.43
1192,8.20
1193,7.97
1194,7.72
1195,7.49
1196,7.24
1197,6.99
1198,6.73
1199,6.49
1200,6.26
1201,6.03
1202,5.78
1203,5.52
1204,5.26
1205,5.04
1206,4.79
1207,4.54
1208,4.23
1209,3.88
1210,3.47
1211,3.04
1212,2.56
1213,2.11
1214,1.71
1215,1.43
1216,1.25
1217,1.18
1218,1.19
1219,1.25
1220,1.34
1221,1.42
1222,1.49
1223,1.53
1224,1.52
1225,1.50
1226,1.51
1227,1.56
1228,1.66
1229,1.78
1230,1.95
1231,2.18
1232,2.49
1233,2.80
1234,3.15
1235,3.49
1236,3.88
1237,4.27
1238,4.71
1239,5.13
1240,5.56
1241,5.97
1242,6.39
1243,6.76
1244,7.07
1245,7.29
1246,7.47
1247,7.63
1248,7.83
1249,8.04
1250,8.29
1251,8.59
1252,8.94
1253,9.29
1254,9.61
1255,9.83
1256,9.97
1257,9.99
1258,9.94
1259,9.83
1260,9.77
1261,9.74
1262,9.77
1263,9.86
1264,10.06
1265,10.34
1266,10.66
1267,10.98
1268,11.30
1269,11.60
1270,11.86
1271,12.03
1272,12.13
1273,12.15
1274,12.11
1275,12.02
1276,11.92
1277,11.85
1278,11.80
1279,11.78
1280,11.77
1281,11.79
1282,11.76
1283,11.69
1284,11.51
1285,11.27
1286,10.93
1287,10.54
1288,10.06
1289,9.54
1290,9.02
1291,8.52
1292,8.01
1293,7.51
1294,6.99
1295,6.50
1296,6.00
1297,5.54
1298,5.06
1299,4.65
1300,4.30
1301,4.01
1302,3.74
1303,3.52
1304,3.29
1305,3.07
1306,2.82
1307,2.56
1308,2.28
1309,2.04
1310,1.81
1311,1.62
1312,1.48
1313,1.44
1314,1.48
1315,1.59
1316,1.73
1317,1.92
1318,2.10
1319,2.22
1320,2.26
1321,2.22
1322,2.11
1323,1.95
1324,1.75
1325,1.59
1326,1.51
1327,1.53
1328,1.65
1329,1.82
1330,2.04
1331,2.24
1332,2.40
1333,2.50
1334,2.53
1335,2.50
1336,2.48
1337,2.47
1338,2.52
1339,2.61
1340,2.78
1341,2.97
1342,3.20
1343,3.43
1344,3.69
1345,3.98
1346,4.33
1347,4.68
1348,5.07
1349,5.43
1350,5.81
1351,6.13
1352,6.45
1353,6.72
1354,6.98
1355,7.21
1356,7.47
1357,7.71
1358,7.96
1359,8.19
1360,8.46
1361,8.71
1362,8.93
1363,9.06
1364,9.17
1365,9.25
1366,9.37
1367,9.50
1368,9.70
1369,9.93
1370,10.21
1371,10.46
1372,10.69
1373,10.84
1374,10.93
1375,10.92
1376,10.88
1377,10.83
1378,10.83
1379,10.86
1380,10.95
1381,11.07
1382,11.22
1383,11.34
1384,11.39
1385,11.34
1386,11.15
1387,10.90
1388,10.59
1389,10.28
1390,9.94
1391,9.64
1392,9.32
1393,9.04
1394,8.71
1395,8.35
1396,7.91
1397,7.46
1398,6.93
1399,6.37
1400,5.74
1401,5.10
1402,4.39
1403,3.70
1404,3.04
1405,2.48
1406,1.95
1407,1.52
1408,1.19
1409,1.00
1410,0.88
1411,0.79
1412,0.68
1413,0.55
1414,0.37
1415,0.17
1416,-0.02
1417,-0.17
1418,-0.24
1419,-0.19
1420,-0.03
1421,0.21
1422,0.47
1423,0.71
1424,0.96
1425,1.19
1426,1.38
1427,1.52
1428,1.66
1429,1.83
1430,2.04
1431,2.26
1432,2.51
1433,2.75
1434,3.01
1435,3.23
1436,3.42
1437,3.54
1438,3.64
1439,3.72
1440,3.82
1441,3.95
1442,4.10
1443,4.26
1444,4.46
1445,4.65
1446,4.82
1447,4.92
1448,4.97
1449,4.99
1450,5.00
1451,4.99
1452,4.99
1453,5.00
1454,5.07
1455,5.17
1456,5.29
1457,5.39
1458,5.43
1459,5.46
1460,5.51
1461,5.60
1462,5.71
1463,5.84
1464,6.00
1465,6.21
1466,6.47
1467,6.69
1468,6.84
1469,6.87
1470,6.83
1471,6.71
1472,6.52
1473,6.32
1474,6.15
1475,6.08
1476,6.07
1477,6.10
1478,6.08
1479,6.01
1480,5.87
1481,5.63
1482,5.26
1483,4.81
1484,4.32
1485,3.88
1486,3.49
1487,3.23
1488,3.07
1489,3.04
1490,3.05
1491,3.09
1492,3.09
1493,3.05
1494,2.91
1495,2.73
1496,2.50
1497,2.26
1498,1.98
1499,1.69
1500,1.42
1501,1.21
1502,1.06
1503,0.95
1504,0.87
1505,0.83
1506,0.82
1507,0.85
1508,0.89
1509,0.95
1510,1.01
1511,1.05
1512,1.08
1513,1.12
1514,1.17
1515,1.18
1516,1.16
1517,1.11
1518,1.11
1519,1.14
1520,1.21
1521,1.27
1522,1.34
1523,1.41
1524,1.50
1525,1.59
1526,1.72
1527,1.87
1528,2.08
1529,2.33
1530,2.68
1531,3.09
1532,3.56
1533,4.01
1534,4.44
1535,4.78
1536,5.10
1537,5.35
1538,5.58
1539,5.79
1540,6.02
1541,6.24
1542,6.52
1543,6.81
1544,7.14
1545,7.45
1546,7.76
1547,8.03
1548,8.29
1549,8.50
1550,8.68
1551,8.79
1552,8.87
1553,8.90
1554,8.95
1555,9.00
1556,9.06
1557,9.14
1558,9.26
1559,9.42
1560,9.59
1561,9.74
1562,9.83
1563,9.91
1564,9.98
1565,10.03
1566,10.09
1567,10.12
1568,10.17
1569,10.21
1570,10.23
1571,10.21
1572,10.15
1573,10.07
1574,9.99
1575,9.91
1576,9.83
1577,9.78
1578,9.73
1579,9.70
1580,9.63
1581,9.52
1582,9.32
1583,9.07
1584,8.77
1585,8.45
1586,8.08
1587,7.72
1588,7.37
1589,7.07
1590,6.78
1591,6.52
1592,6.25
1593,5.97
1594,5.63
1595,5.25
1596,4.81
1597,4.32
1598,3.72
1599,3.07
1600,2.40
1601,1.83
1602,1.35
1603,1.01
1604,0.74
1605,0.56
1606,0.45
1607,0.39
1608,0.31
1609,0.21
1610,0.09
1611,-0.03
1612,-0.14
1613,-0.19
1614,-0.19
1615,-0.13
1616,-0.03
1617,0.07
1618,0.14
1619,0.17
1620,0.12
1621,0.02
1622,-0.11
1623,-0.23
1624,-0.34
1625,-0.43
1626,-0.44
1627,-0.39
1628,-0.26
1629,-0.12
1630,0.02
1631,0.13
1632,0.25
1633,0.40
1634,0.63
1635,0.93
1636,1.29
1637,1.68
1638,2.13
1639,2.60
1640,3.08
1641,3.50
1642,3.85
1643,4.12
1644,4.35
1645,4.54
1646,4.75
1647,4.94
1648,5.11
1649,5.23
1650,5.31
1651,5.34
1652,5.32
1653,5.24
1654,5.15
1655,5.08
1656,5.05
1657,5.07
1658,5.07
1659,5.06
1660,4.97
1661,4.81
1662,4.60
1663,4.39
1664,4.16
1665,3.95
1666,3.72
1667,3.52
1668,3.29
1669,3.04
1670,2.71
1671,2.34
1672,1.92
1673,1.49
1674,1.02
1675,0.59
1676,0.21
1677,-0.09
1678,-0.34
1679,-0.53
1680,-0.68
1681,-0.77
1682,-0.85
1683,-0.90
1684,-0.94
1685,-0.95
1686,-0.97
1687,-0.98
1688,-1.02
1689,-1.08
1690,-1.15
1691,-1.24
1692,-1.32
1693,-1.40
1694,-1.46
1695,-1.49
1696,-1.46
1697,-1.37
1698,-1.24
1699,-1.11
1700,-0.98
1701,-0.83
1702,-0.67
1703,-0.50
1704,-0.33
1705,-0.18
1706,-0.05
1707,0.06
1708,0.13
1709,0.18
1710,0.24
1711,0.34
1712,0.43
1713,0.49
1714,0.55
1715,0.60
1716,0.64
1717,0.66
1718,0.68
1719,0.71
1720,0.80
1721,0.95
1722,1.19
1723,1.51
1724,1.92
1725,2.36
1726,2.78
1727,3.13
1728,3.43
1729,3.67
1730,3.85
1731,3.96
1732,4.05
1733,4.14
1734,4.27
1735,4.40
1736,4.55
1737,4.68
1738,4.83
1739,4.97
1740,5.10
1741,5.19
1742,5.26
1743,5.32
1744,5.37
1745,5.40
1746,5.43
1747,5.44
1748,5.50
1749,5.62
1750,5.81
1751,6.01
1752,6.26
1753,6.51
1754,6.83
1755,7.18
1756,7.55
1757,7.88
1758,8.21
1759,8.52
1760,8.84
1761,9.14
1762,9.41
1763,9.61
1764,9.71
1765,9.69
1766,9.56
1767,9.35
1768,9.12
1769,8.90
1770,8.72
1771,8.61
1772,8.52
1773,8.43
1774,8.28
1775,8.06
1776,7.77
1777,7.46
1778,7.13
1779,6.83
1780,6.57
1781,6.39
1782,6.29
1783,6.25
1784,6.17
1785,6.03
1786,5.81
1787,5.54
1788,5.24
1789,4.94
1790,4.64
1791,4.41
1792,4.26
1793,4.20
1794,4.19
1795,4.20
1796,4.20
1797,4.23
1798,4.23
1799,4.20
1800,4.10
1801,3.95
1802,3.80
1803,3.65
1804,3.54
1805,3.48
1806,3.52
1807,3.65
1808,3.87
1809,4.11
1810,4.36
1811,4.58
1812,4.75
1813,4.89
1814,5.00
1815,5.07
1816,5.14
1817,5.20
1818,5.27
1819,5.34
1820,5.42
1821,5.47
1822,5.54
1823,5.61
1824,5.73
1825,5.87
1826,6.09
1827,6.36
1828,6.72
1829,7.10
1830,7.47
1831,7.78
1832,8.06
1833,8.29
1834,8.48
1835,8.63
1836,8.80
1837,9.02
1838,9.32
1839,9.62
1840,9.93
1841,10.22
1842,10.48
1843,10.67
1844,10.77
1845,10.74
1846,10.68
1847,10.65
1848,10.69
1849,10.77
1850,10.88
1851,11.05
1852,11.25
1853,11.46
1854,11.57
1855,11.58
1856,11.50
1857,11.32
1858,11.06
1859,10.77
1860,10.51
1861,10.33
1862,10.18
1863,10.05
1864,9.95
1865,9.90
1866,9.81
1867,9.68
1868,9.49
1869,9.30
1870,9.09
1871,8.90
1872,8.71
1873,8.53
1874,8.34
1875,8.18
1876,7.99
1877,7.76
1878,7.41
1879,6.96
1880,6.42
1881,5.87
1882,5.26
1883,4.66
1884,4.07
1885,3.61
1886,3.22
1887,2.94
1888,2.69
1889,2.50
1890,2.31
1891,2.14
1892,1.93
1893,1.70
1894,1.45
1895,1.21
1896,0.98
1897,0.81
1898,0.70
1899,0.66
1900,0.65
1901,0.68
1902,0.77
1903,0.90
1904,1.05
1905,1.16
1906,1.30
1907,1.47
1908,1.69
1909,1.94
1910,2.27
1911,2.66
1912,3.13
1913,3.58
1914,4.01
1915,4.35
1916,4.68
1917,4.95
1918,5.17
1919,5.29
1920,5.41
1921,5.53
1922,5.71
1923,5.94
1924,6.19
1925,6.42
1926,6.64
1927,6.77
1928,6.84
1929,6.85
1930,6.85
1931,6.87
1932,6.94
1933,7.06
1934,7.20
1935,7.36
1936,7.53
1937,7.64
1938,7.68
1939,7.60
1940,7.44
1941,7.29
1942,7.23
1943,7.25
1944,7.33
1945,7.47
1946,7.71
1947,8.00
1948,8.29
1949,8.53
1950,8.67
1951,8.72
1952,8.68
1953,8.59
1954,8.46
1955,8.32
1956,8.15
1957,7.96
1958,7.77
1959,7.58
1960,7.37
1961,7.13
1962,6.84
1963,6.57
1964,6.26
1965,5.95
1966,5.61
1967,5.29
1968,5.02
1969,4.83
1970,4.68
1971,4.56
1972,4.46
1973,4.37
1974,4.24
1975,4.09
1976,3.89
1977,3.70
1978,3.51
1979,3.36
1980,3.21
1981,3.12
1982,3.07
1983,3.06
1984,3.01
1985,2.92
1986,2.78
1987,2.57
1988,2.30
1989,2.01
1990,1.74
1991,1.58
1992,1.50
1993,1.50
1994,1.51
1995,1.55
1996,1.59
1997,1.64
1998,1.67
1999,1.66
2000,1.63
2001,1.60
2002,1.65
2003,1.79
2004,2.01
2005,2.28
2006,2.62
2007,2.99
2008,3.40
2009,3.80
2010,4.18
2011,4.49
2012,4.76
2013,4.98
2014,5.26
2015,5.55
2016,5.94
2017,6.37
2018,6.91
2019,7.48
2020,8.03
2021,8.46
2022,8.80
2023,9.00
2024,9.10
2025,9.10
2026,9.08
2027,9.06
2028,9.09
2029,9.15
2030,9.27
2031,9.41
2032,9.50
2033,9.51
2034,9.44
2035,9.29
2036,9.07
2037,8.81
2038,8.54
2039,8.35
2040,8.24
2041,8.20
2042,8.19
2043,8.22
2044,8.28
2045,8.32
2046,8.26
2047,8.11
2048,7.91
2049,7.72
2050,7.55
2051,7.44
2052,7.42
2053,7.50
2054,7.63
2055,7.76
2056,7.84
2057,7.88
2058,7.86
2059,7.79
2060,7.66
2061,7.52
2062,7.37
2063,7.22
2064,7.05
2065,6.86
2066,6.61
2067,6.32
2068,5.96
2069,5.57
2070,5.11
2071,4.66
2072,4.21
2073,3.81
2074,3.40
2075,3.04
2076,2.67
2077,2.36
2078,2.06
2079,1.82
2080,1.59
2081,1.42
2082,1.26
2083,1.15
2084,1.05
2085,0.98
2086,0.89
2087,0.78
2088,0.61
2089,0.41
2090,0.21
2091,0.02
2092,-0.11
2093,-0.19
2094,-0.22
2095,-0.19
2096,-0.13
2097,-0.05
2098,0.02
2099,0.08
2100,0.14
2101,0.20
2102,0.25
2103,0.28
2104,0.34
2105,0.40
2106,0.53
2107,0.71
2108,0.95
2109,1.27
2110,1.67
2111,2.10
2112,2.54
2113,2.93
2114,3.32
2115,3.71
2116,4.13
2117,4.53
2118,4.97
2119,5.39
2120,5.87
2121,6.35
2122,6.87
2123,7.36
2124,7.84
2125,8.24
2126,8.63
2127,8.96
2128,9.27
2129,9.50
2130,9.65
2131,9.70
2132,9.72
2133,9.73
2134,9.79
2135,9.90
2136,10.09
2137,10.33
2138,10.59
2139,10.83
2140,11.05
2141,11.21
2142,11.28
2143,11.26
2144,11.17
2145,11.07
2146,10.97
2147,10.88
2148,10.75
2149,10.56
2150,10.25
2151,9.86
2152,9.38
2153,8.87
2154,8.32
2155,7.83
2156,7.40
2157,7.10
2158,6.86
2159,6.71
2160,6.60
2161,6.53
2162,6.44
2163,6.36
2164,6.24
2165,6.13
2166,6.00
2167,5.88
2168,5.77
2169,5.66
2170,5.49
2171,5.26
2172,4.94
2173,4.63
2174,4.33
2175,4.10
2176,3.89
2177,3.75
2178,3.63
2179,3.58
2180,3.53
2181,3.46
2182,3.33
2183,3.17
2184,2.99
2185,2.79
2186,2.58
2187,2.40
2188,2.29
2189,2.29
2190,2.38
2191,2.54
2192,2.75
2193,2.98
2194,3.19
2195,3.36
2196,3.49
2197,3.59
2198,3.68
2199,3.78
2200,3.88
2201,3.96
2202,4.03
2203,4.10
2204,4.21
2205,4.36
2206,4.58
2207,4.81
2208,5.08
2209,5.37
2210,5.71
2211,6.05
2212,6.36
2213,6.60
2214,6.78
2215,6.90
2216,7.04
2217,7.15
2218,7.26
2219,7.33
2220,7.41
2221,7.48
2222,7.58
2223,7.65
2224,7.72
2225,7.78
2226,7.84
2227,7.92
2228,8.01
2229,8.11
2230,8.21
2231,8.31
2232,8.41
2233,8.49
2234,8.54
2235,8.56
2236,8.57
2237,8.56
2238,8.54
2239,8.53
2240,8.52
2241,8.52
2242,8.51
2243,8.47
2244,8.41
2245,8.33
2246,8.22
2247,8.09
2248,7.92
2249,7.77
2250,7.62
2251,7.48
2252,7.32
2253,7.16
2254,6.94
2255,6.69
2256,6.36
2257,6.00
2258,5.65
2259,5.35
2260,5.11
2261,4.94
2262,4.80
2263,4.73
2264,4.68
2265,4.62
2266,4.46
2267,4.22
2268,3.93
2269,3.67
2270,3.46
2271,3.33
2272,3.23
2273,3.20
2274,3.20
2275,3.21
2276,3.16
2277,3.05
2278,2.88
2279,2.68
2280,2.44
2281,2.23
2282,2.06
2283,1.98
2284,1.98
2285,2.02
2286,2.10
2287,2.20
2288,2.31
2289,2.41
2290,2.48
2291,2.49
2292,2.48
2293,2.43
2294,2.37
2295,2.29
2296,2.21
2297,2.14
2298,2.14
2299,2.19
2300,2.33
2301,2.52
2302,2.80
2303,3.11
2304,3.45
2305,3.76
2306,4.07
2307,4.38
2308,4.72
2309,5.07
2310,5.46
2311,5.83
2312,6.19
2313,6.50
2314,6.81
2315,7.10
2316,7.38
2317,7.59
2318,7.77
2319,7.93
2320,8.09
2321,8.22
2322,8.33
2323,8.37
2324,8.34
2325,8.26
2326,8.15
2327,8.02
2328,7.91
2329,7.87
2330,7.92
2331,8.06
2332,8.26
2333,8.44
2334,8.60
2335,8.70
2336,8.71
2337,8.64
2338,8.48
2339,8.27
2340,8.06
2341,7.89
2342,7.75
2343,7.66
2344,7.55
2345,7.45
2346,7.30
2347,7.13
2348,6.87
2349,6.56
2350,6.20
2351,5.85
2352,5.48
2353,5.10
2354,4.65
2355,4.20
2356,3.72
2357,3.27
2358,2.82
2359,2.37
2360,1.88
2361,1.42
2362,0.95
2363,0.50
2364,0.01
2365,-0.50
2366,-1.01
2367,-1.47
2368,-1.89
2369,-2.24
2370,-2.53
2371,-2.70
2372,-2.81
2373,-2.83
2374,-2.82
2375,-2.78
2376,-2.74
2377,-2.67
2378,-2.57
2379,-2.42
2380,-2.20
2381,-1.91
2382,-1.51
2383,-1.06
2384,-0.54
2385,-0.05
2386,0.42
2387,0.82
2388,1.23
2389,1.59
2390,1.98
2391,2.36
2392,2.82
2393,3.28
2394,3.78
2395,4.22
2396,4.64
2397,4.97
2398,5.23
2399,5.39
2400,5.53
2401,5.64
2402,5.77
2403,5.92
2404,6.14
2405,6.39
2406,6.66
2407,6.86
2408,6.98
2409,7.00
2410,6.94
2411,6.81
2412,6.67
2413,6.58
2414,6.61
2415,6.74
2416,6.95
2417,7.18
2418,7.41
2419,7.61
2420,7.73
2421,7.73
2422,7.61
2423,7.42
2424,7.26
2425,7.13
2426,7.04
2427,7.03
2428,7.10
2429,7.22
2430,7.32
2431,7.39
2432,7.42
2433,7.42
2434,7.38
2435,7.28
2436,7.13
2437,7.00
2438,6.88
2439,6.77
2440,6.61
2441,6.42
2442,6.20
2443,5.98
2444,5.74
2445,5.49
2446,5.20
2447,4.92
2448,4.65
2449,4.43
2450,4.20
2451,4.01
2452,3.83
2453,3.70
2454,3.59
2455,3.52
2456,3.44
2457,3.38
2458,3.36
2459,3.37
2460,3.42
2461,3.46
2462,3.50
2463,3.50
2464,3.44
2465,3.32
2466,3.15
2467,2.97
2468,2.79
2469,2.68
2470,2.65
2471,2.70
2472,2.82
2473,2.98
2474,3.19
2475,3.41
2476,3.59
2477,3.67
2478,3.66
2479,3.59
2480,3.52
2481,3.46
2482,3.43
2483,3.44
2484,3.53
2485,3.68
2486,3.91
2487,4.17
2488,4.43
2489,4.65
2490,4.83
2491,4.94
2492,5.03
2493,5.10
2494,5.20
2495,5.33
2496,5.54
2497,5.81
2498,6.14
2499,6.45
2500,6.69
2501,6.84
2502,6.90
2503,6.90
2504,6.88
2505,6.86
2506,6.84
2507,6.86
2508,6.96
2509,7.12
2510,7.28
2511,7.39
2512,7.43
2513,7.39
2514,7.23
2515,6.99
2516,6.72
2517,6.50
2518,6.34
2519,6.26
2520,6.26
2521,6.33
2522,6.42
2523,6.46
2524,6.42
2525,6.30
2526,6.12
2527,5.94
2528,5.78
2529,5.65
2530,5.52
2531,5.43
2532,5.35
2533,5.29
2534,5.23
2535,5.18
2536,5.12
2537,5.07
2538,4.98
2539,4.89
2540,4.76
2541,4.62
2542,4.40
2543,4.15
2544,3.83
2545,3.50
2546,3.14
2547,2.78
2548,2.43
2549,2.10
2550,1.78
2551,1.49
2552,1.19
2553,0.90
2554,0.57
2555,0.25
2556,-0.11
2557,-0.46
2558,-0.85
2559,-1.22
2560,-1.56
2561,-1.84
2562,-2.08
2563,-2.28
2564,-2.51
2565,-2.69
2566,-2.86
2567,-2.99
2568,-3.15
2569,-3.33
2570,-3.51
2571,-3.66
2572,-3.80
2573,-3.94
2574,-4.09
2575,-4.23
2576,-4.33
2577,-4.37
2578,-4.36
2579,-4.33
2580,-4.24
2581,-4.10
2582,-3.91
2583,-3.66
2584,-3.40
2585,-3.15
2586,-2.90
2587,-2.66
2588,-2.41
2589,-2.20
2590,-2.03
2591,-1.90
2592,-1.75
2593,-1.59
2594,-1.36
2595,-1.07
2596,-0.66
2597,-0.18
2598,0.39
2599,0.95
2600,1.56
2601,2.15
2602,2.72
2603,3.19
2604,3.59
2605,3.89
2606,4.16
2607,4.38
2608,4.65
2609,4.96
2610,5.36
2611,5.78
2612,6.26
2613,6.80
2614,7.39
2615,7.97
2616,8.48
2617,8.92
2618,9.33
2619,9.73
2620,10.08
2621,10.34
2622,10.51
2623,10.60
2624,10.65
2625,10.65
2626,10.58
2627,10.45
2628,10.24
2629,9.96
2630,9.61
2631,9.19
2632,8.72
2633,8.22
2634,7.71
2635,7.25
2636,6.88
2637,6.63
2638,6.43
2639,6.29
2640,6.14
2641,5.97
2642,5.70
2643,5.33
2644,4.87
2645,4.46
2646,4.10
2647,3.86
2648,3.66
2649,3.54
2650,3.43
2651,3.32
2652,3.14
2653,2.87
2654,2.49
2655,2.05
2656,1.58
2657,1.17
2658,0.82
2659,0.59
2660,0.45
2661,0.39
2662,0.37
2663,0.40
2664,0.44
2665,0.47
2666,0.44
2667,0.38
2668,0.31
2669,0.27
2670,0.27
2671,0.31
2672,0.39
2673,0.49
2674,0.62
2675,0.77
2676,0.96
2677,1.15
2678,1.36
2679,1.57
2680,1.83
2681,2.12
2682,2.47
2683,2.82
2684,3.17
2685,3.49
2686,3.78
2687,4.01
2688,4.20
2689,4.33
2690,4.46
2691,4.58
2692,4.77
2693,5.00
2694,5.30
2695,5.59
2696,5.87
2697,6.10
2698,6.32
2699,6.49
2700,6.65
2701,6.77
2702,6.94
2703,7.13
2704,7.38
2705,7.64
2706,7.97
2707,8.30
2708,8.65
2709,8.95
2710,9.18
2711,9.31
2712,9.40
2713,9.45
2714,9.49
2715,9.52
2716,9.61
2717,9.74
2718,9.92
2719,10.14
2720,10.39
2721,10.64
2722,10.83
2723,10.95
2724,11.01
2725,11.00
2726,10.93
2727,10.80
2728,10.61
2729,10.45
2730,10.33
2731,10.25
2732,10.19
2733,10.15
2734,10.07
2735,9.97
2736,9.83
2737,9.66
2738,9.45
2739,9.22
2740,9.00
2741,8.83
2742,8.69
2743,8.56
2744,8.38
2745,8.15
2746,7.87
2747,7.58
2748,7.29
2749,7.03
2750,6.77
2751,6.58
2752,6.40
2753,6.23
2754,6.04
2755,5.83
2756,5.56
2757,5.27
2758,4.94
2759,4.60
2760,4.26
2761,3.94
2762,3.65
2763,3.40
2764,3.17
2765,2.98
2766,2.82
2767,2.70
2768,2.59
2769,2.47
2770,2.34
2771,2.20
2772,2.04
2773,1.85
2774,1.63
2775,1.43
2776,1.26
2777,1.16
2778,1.14
2779,1.18
2780,1.27
2781,1.37
2782,1.45
2783,1.51
2784,1.56
2785,1.60
2786,1.62
2787,1.63
2788,1.69
2789,1.83
2790,2.03
2791,2.24
2792,2.43
2793,2.59
2794,2.78
2795,2.98
2796,3.20
2797,3.41
2798,3.64
2799,3.88
2800,4.14
2801,4.35
2802,4.49
2803,4.53
2804,4.50
2805,4.39
2806,4.22
2807,4.06
2808,3.98
2809,4.02
2810,4.13
2811,4.28
2812,4.46
2813,4.65
2814,4.82
2815,4.94
2816,4.96
2817,4.91
2818,4.81
2819,4.70
2820,4.59
2821,4.51
2822,4.44
2823,4.37
2824,4.26
2825,4.13
2826,3.95
2827,3.73
2828,3.46
2829,3.17
2830,2.85
2831,2.54
2832,2.20
2833,1.88
2834,1.53
2835,1.17
2836,0.78
2837,0.40
2838,0.00
2839,-0.38
2840,-0.84
2841,-1.32
2842,-1.85
2843,-2.37
2844,-2.90
2845,-3.37
2846,-3.84
2847,-4.23
2848,-4.60
2849,-4.94
2850,-5.31
2851,-5.64
2852,-5.94
2853,-6.22
2854,-6.52
2855,-6.78
2856,-7.01
2857,-7.18
2858,-7.31
2859,-7.40
2860,-7.45
2861,-7.42
2862,-7.36
2863,-7.30
2864,-7.24
2865,-7.17
2866,-7.04
2867,-6.85
2868,-6.56
2869,-6.21
2870,-5.79
2871,-5.36
2872,-4.90
2873,-4.49
2874,-4.11
2875,-3.82
2876,-3.59
2877,-3.42
2878,-3.26
2879,-3.11
2880,-2.92
2881,-2.71
2882,-2.44
2883,-2.17
2884,-1.88
2885,-1.63
2886,-1.40
2887,-1.23
2888,-1.11
2889,-1.03
2890,-0.93
2891,-0.83
2892,-0.70
2893,-0.54
2894,-0.29
2895,0.02
2896,0.34
2897,0.63
2898,0.89
2899,1.10
2900,1.24
2901,1.28
2902,1.24
2903,1.14
2904,1.06
2905,1.01
2906,1.05
2907,1.13
2908,1.22
2909,1.28
2910,1.33
2911,1.39
2912,1.44
2913,1.49
2914,1.51
2915,1.51
2916,1.49
2917,1.47
2918,1.44
2919,1.41
2920,1.34
2921,1.20
2922,0.99
2923,0.76
2924,0.50
2925,0.24
2926,-0.03
2927,-0.29
2928,-0.50
2929,-0.66
2930,-0.79
2931,-0.85
2932,-0.89
2933,-0.86
2934,-0.82
2935,-0.82
2936,-0.87
2937,-0.98
2938,-1.11
2939,-1.23
2940,-1.31
2941,-1.36
2942,-1.37
2943,-1.35
2944,-1.26
2945,-1.12
2946,-0.98
2947,-0.91
2948,-0.85
2949,-0.79
2950,-0.64
2951,-0.47
2952,-0.27
2953,-0.05
2954,0.22
2955,0.51
2956,0.80
2957,1.04
2958,1.27
2959,1.46
2960,1.69
2961,1.91
2962,2.21
2963,2.56
2964,2.98
2965,3.39
2966,3.81
2967,4.18
2968,4.50
2969,4.73
2970,4.93
2971,5.11
2972,5.35
2973,5.64
2974,6.03
2975,6.48
2976,7.00
2977,7.51
2978,8.02
2979,8.45
2980,8.79
2981,9.02
2982,9.20
2983,9.38
2984,9.58
2985,9.81
2986,10.10
2987,10.41
2988,10.75
2989,11.03
2990,11.22
2991,11.28
2992,11.20
2993,11.02
2994,10.78
2995,10.54
2996,10.31
2997,10.14
2998,10.03
2999,9.98
3000,10.00
3001,10.07
3002,10.15
3003,10.21
3004,10.21
3005,10.15
3006,10.06
3007,9.96
3008,9.84
3009,9.72
3010,9.61
3011,9.54
3012,9.50
3013,9.48
3014,9.45
3015,9.41
3016,9.39
3017,9.44
3018,9.49
3019,9.53
3020,9.48
3021,9.39
3022,9.24
3023,9.06
3024,8.83
3025,8.58
3026,8.31
3027,8.05
3028,7.78
3029,7.50
3030,7.15
3031,6.76
3032,6.30
3033,5.81
3034,5.27
3035,4.76
3036,4.29
3037,3.91
3038,3.61
3039,3.37
3040,3.11
3041,2.84
3042,2.53
3043,2.23
3044,1.97
3045,1.79
3046,1.68
3047,1.65
3048,1.69
3049,1.79
3050,1.88
3051,1.93
3052,1.93
3053,1.89
3054,1.81
3055,1.70
3056,1.63
3057,1.63
3058,1.70
3059,1.82
3060,1.96
3061,2.07
3062,2.19
3063,2.32
3064,2.49
3065,2.68
3066,2.93
3067,3.22
3068,3.61
3069,4.04
3070,4.51
3071,4.96
3072,5.41
3073,5.84
3074,6.29
3075,6.71
3076,7.15
3077,7.53
3078,7.91
3079,8.28
3080,8.71
3081,9.15
3082,9.62
3083,10.07
3084,10.54
3085,11.01
3086,11.48
3087,11.88
3088,12.20
3089,12.38
3090,12.50
3091,12.57
3092,12.66
3093,12.77
3094,12.92
3095,13.07
3096,13.28
3097,13.51
3098,13.73
3099,13.88
3100,13.95
3101,13.95
3102,13.87
3103,13.76
3104,13.63
3105,13.53
3106,13.44
3107,13.35
3108,13.21
3109,13.02
3110,12.73
3111,12.35
3112,11.89
3113,11.40
3114,10.89
3115,10.43
3116,10.03
3117,9.74
3118,9.54
3119,9.41
3120,9.28
3121,9.18
3122,9.06
3123,8.92
3124,8.71
3125,8.49
3126,8.26
3127,8.06
3128,7.85
3129,7.63
3130,7.36
3131,7.09
3132,6.76
3133,6.39
3134,5.98
3135,5.56
3136,5.12
3137,4.71
3138,4.33
3139,3.97
3140,3.61
3141,3.26
3142,2.92
3143,2.62
3144,2.34
3145,2.11
3146,1.94
3147,1.86
3148,1.85
3149,1.93
3150,2.04
3151,2.19
3152,2.29
3153,2.33
3154,2.31
3155,2.23
3156,2.08
3157,1.92
3158,1.82
3159,1.78
3160,1.85
3161,2.01
3162,2.29
3163,2.61
3164,2.97
3165,3.31
3166,3.68
3167,4.04
3168,4.42
3169,4.79
3170,5.21
3171,5.63
3172,6.06
3173,6.41
3174,6.74
3175,7.05
3176,7.35
3177,7.61
3178,7.84
3179,8.07
3180,8.35
3181,8.61
3182,8.88
3183,9.09
3184,9.32
3185,9.52
3186,9.73
3187,9.88
3188,10.03
3189,10.18
3190,10.35
3191,10.54
3192,10.73
3193,10.88
3194,11.00
3195,11.10
3196,11.22
3197,11.35
3198,11.49
3199,11.61
3200,11.71
3201,11.78
3202,11.77
3203,11.68
3204,11.47
3205,11.15
3206,10.73
3207,10.27
3208,9.71
3209,9.15
3210,8.54
3211,7.96
3212,7.34
3213,6.74
3214,6.11
3215,5.52
3216,4.93
3217,4.40
3218,3.93
3219,3.56
3220,3.24
3221,3.02
3222,2.85
3223,2.74
3224,2.62
3225,2.49
3226,2.31
3227,2.12
3228,1.88
3229,1.66
3230,1.43
3231,1.28
3232,1.16
3233,1.10
3234,1.05
3235,0.99
3236,0.88
3237,0.72
3238,0.52
3239,0.31
3240,0.05
3241,-0.22
3242,-0.52
3243,-0.79
3244,-1.05
3245,-1.24
3246,-1.38
3247,-1.46
3248,-1.50
3249,-1.49
3250,-1.46
3251,-1.44
3252,-1.45
3253,-1.51
3254,-1.63
3255,-1.74
3256,-1.85
3257,-1.93
3258,-2.00
3259,-2.03
3260,-2.01
3261,-1.98
3262,-1.96
3263,-1.96
3264,-1.94
3265,-1.87
3266,-1.72
3267,-1.53
3268,-1.26
3269,-0.93
3270,-0.51
3271,-0.06
3272,0.43
3273,0.90
3274,1.37
3275,1.80
3276,2.20
3277,2.56
3278,2.91
3279,3.25
3280,3.64
3281,3.98
3282,4.30
3283,4.55
3284,4.80
3285,4.98
3286,5.11
3287,5.17
3288,5.24
3289,5.36
3290,5.55
3291,5.78
3292,6.03
3293,6.29
3294,6.53
3295,6.71
3296,6.83
3297,6.88
3298,6.89
3299,6.85
3300,6.77
3301,6.68
3302,6.56
3303,6.43
3304,6.24
3305,5.97
3306,5.58
3307,5.14
3308,4.68
3309,4.26
3310,3.83
3311,3.44
3312,3.06
3313,2.72
3314,2.33
3315,1.91
3316,1.37
3317,0.82
3318,0.21
3319,-0.36
3320,-0.91
3321,-1.37
3322,-1.79
3323,-2.09
3324,-2.36
3325,-2.56
3326,-2.78
3327,-3.02
3328,-3.37
3329,-3.77
3330,-4.17
3331,-4.50
3332,-4.80
3333,-5.05
3334,-5.26
3335,-5.37
3336,-5.42
3337,-5.42
3338,-5.39
3339,-5.30
3340,-5.18
3341,-5.02
3342,-4.83
3343,-4.63
3344,-4.45
3345,-4.30
3346,-4.12
3347,-3.94
3348,-3.71
3349,-3.43
3350,-3.07
3351,-2.64
3352,-2.13
3353,-1.62
3354,-1.10
3355,-0.63
3356,-0.20
3357,0.15
3358,0.46
3359,0.69
3360,0.95
3361,1.22
3362,1.56
3363,1.91
3364,2.27
3365,2.59
3366,2.87
3367,3.07
3368,3.24
3369,3.36
3370,3.52
3371,3.68
3372,3.91
3373,4.17
3374,4.47
3375,4.76
3376,5.06
3377,5.33
3378,5.59
3379,5.82
3380,6.04
3381,6.23
3382,6.43
3383,6.62
3384,6.84
3385,7.06
3386,7.29
3387,7.48
3388,7.64
3389,7.77
3390,7.92
3391,8.09
3392,8.32
3393,8.58
3394,8.86
3395,9.12
3396,9.34
3397,9.49
3398,9.60
3399,9.65
3400,9.68
3401,9.68
3402,9.67
3403,9.66
3404,9.68
3405,9.74
3406,9.84
3407,9.94
3408,10.01
3409,10.05
3410,10.09
3411,10.13
3412,10.15
3413,10.13
3414,10.09
3415,10.03
3416,9.93
3417,9.82
3418,9.67
3419,9.51
3420,9.33
3421,9.14
3422,8.93
3423,8.73
3424,8.54
3425,8.41
3426,8.34
3427,8.32
3428,8.30
3429,8.26
3430,8.22
3431,8.20
3432,8.18
3433,8.15
3434,8.09
3435,8.00
3436,7.91
3437,7.81
3438,7.72
3439,7.62
3440,7.50
3441,7.39
3442,7.29
3443,7.25
3444,7.24
3445,7.24
3446,7.25
3447,7.25
3448,7.24
3449,7.20
3450,7.13
3451,7.02
3452,6.93
3453,6.86
3454,6.84
3455,6.88
3456,7.00
3457,7.15
3458,7.33
3459,7.51
3460,7.69
3461,7.87
3462,8.07
3463,8.30
3464,8.58
3465,8.85
3466,9.13
3467,9.39
3468,9.62
3469,9.80
3470,9.93
3471,9.97
3472,9.98
3473,9.95
3474,9.96
3475,10.02
3476,10.12
3477,10.28
3478,10.51
3479,10.77
3480,11.03
3481,11.25
3482,11.41
3483,11.49
3484,11.50
3485,11.44
3486,11.31
3487,11.12
3488,10.90
3489,10.67
3490,10.42
3491,10.19
3492,9.95
3493,9.76
3494,9.58
3495,9.41
3496,9.20
3497,8.95
3498,8.64
3499,8.33
3500,8.00
3501,7.69
3502,7.38
3503,7.11
3504,6.84
3505,6.59
3506,6.31
3507,6.03
3508,5.67
3509,5.24
3510,4.71
3511,4.16
3512,3.59
3513,3.11
3514,2.69
3515,2.36
3516,2.08
3517,1.87
3518,1.69
3519,1.54
3520,1.37
3521,1.17
3522,0.94
3523,0.70
3524,0.47
3525,0.30
3526,0.15
3527,0.04
3528,-0.05
3529,-0.14
3530,-0.22
3531,-0.31
3532,-0.43
3533,-0.55
3534,-0.67
3535,-0.77
3536,-0.83
3537,-0.85
3538,-0.82
3539,-0.79
3540,-0.75
3541,-0.71
3542,-0.65
3543,-0.57
3544,-0.49
3545,-0.37
3546,-0.17
3547,0.08
3548,0.36
3549,0.57
3550,0.76
3551,0.92
3552,1.11
3553,1.28
3554,1.46
3555,1.67
3556,1.98
3557,2.37
3558,2.85
3559,3.35
3560,3.87
3561,4.32
3562,4.76
3563,5.17
3564,5.62
3565,6.04
3566,6.43
3567,6.74
3568,7.05
3569,7.33
3570,7.62
3571,7.85
3572,8.08
3573,8.30
3574,8.58
3575,8.90
3576,9.25
3577,9.61
3578,9.96
3579,10.21
3580,10.38
3581,10.48
3582,10.53
3583,10.52
3584,10.48
3585,10.44
3586,10.44
3587,10.48
3588,10.52
3589,10.50
3590,10.41
3591,10.28
3592,10.08
3593,9.83
3594,9.49
3595,9.14
3596,8.79
3597,8.50
3598,8.22
3599,8.00
3600,7.79
3601,7.64
3602,7.51
3603,7.40
3604,7.24
3605,7.03
3606,6.74
3607,6.41
3608,6.04
3609,5.68
3610,5.33
3611,5.00
3612,4.68
3613,4.41
3614,4.14
3615,3.88
3616,3.64
3617,3.40
3618,3.15
3619,2.91
3620,2.71
3621,2.57
3622,2.48
3623,2.43
3624,2.40
3625,2.40
3626,2.42
3627,2.46
3628,2.51
3629,2.55
3630,2.57
3631,2.59
3632,2.62
3633,2.62
3634,2.57
3635,2.49
3636,2.42
3637,2.34
3638,2.31
3639,2.33
3640,2.43
3641,2.66
3642,2.98
3643,3.36
3644,3.75
3645,4.14
3646,4.48
3647,4.71
3648,4.82
3649,4.82
3650,4.77
3651,4.70
3652,4.62
3653,4.50
3654,4.39
3655,4.32
3656,4.33
3657,4.39
3658,4.46
3659,4.52
3660,4.61
3661,4.72
3662,4.84
3663,4.92
3664,4.97
3665,5.00
3666,5.07
3667,5.18
3668,5.36
3669,5.60
3670,5.89
3671,6.20
3672,6.55
3673,6.87
3674,7.16
3675,7.42
3676,7.64
3677,7.86
3678,8.08
3679,8.29
3680,8.50
3681,8.66
3682,8.77
3683,8.81
3684,8.76
3685,8.63
3686,8.42
3687,8.19
3688,7.91
3689,7.64
3690,7.33
3691,7.03
3692,6.67
3693,6.30
3694,5.91
3695,5.52
3696,5.10
3697,4.69
3698,4.26
3699,3.91
3700,3.55
3701,3.22
3702,2.85
3703,2.46
3704,2.04
3705,1.60
3706,1.13
3707,0.66
3708,0.21
3709,-0.20
3710,-0.54
3711,-0.77
3712,-0.88
3713,-0.88
3714,-0.85
3715,-0.82
3716,-0.76
3717,-0.68
3718,-0.65
3719,-0.66
3720,-0.67
3721,-0.65
3722,-0.56
3723,-0.42
3724,-0.20
3725,0.07
3726,0.37
3727,0.68
3728,0.99
3729,1.30
3730,1.60
3731,1.84
3732,2.03
3733,2.17
3734,2.32
3735,2.46
3736,2.62
3737,2.76
3738,2.93
3739,3.10
3740,3.32
3741,3.53
3742,3.74
3743,3.87
3744,3.97
3745,4.06
3746,4.19
3747,4.34
3748,4.52
3749,4.74
3750,5.01
3751,5.31
3752,5.60
3753,5.82
3754,5.96
3755,6.03
3756,6.08
3757,6.10
3758,6.08
3759,6.04
3760,6.01
3761,6.00
3762,5.95
3763,5.85
3764,5.70
3765,5.52
3766,5.33
3767,5.15
3768,4.97
3769,4.84
3770,4.76
3771,4.76
3772,4.81
3773,4.91
3774,4.99
3775,5.04
3776,5.07
3777,5.07
3778,5.07
3779,5.13
3780,5.26
3781,5.49
3782,5.75
3783,6.00
3784,6.19
3785,6.28
3786,6.29
3787,6.23
3788,6.12
3789,6.02
3790,5.97
3791,5.96
3792,6.00
3793,6.07
3794,6.13
3795,6.13
3796,6.01
3797,5.80
3798,5.55
3799,5.31
3800,5.04
3801,4.78
3802,4.51
3803,4.26
3804,3.95
3805,3.59
3806,3.14
3807,2.64
3808,2.10
3809,1.59
3810,1.13
3811,0.79
3812,0.48
3813,0.23
3814,-0.01
3815,-0.20
3816,-0.38
3817,-0.56
3818,-0.81
3819,-1.06
3820,-1.32
3821,-1.54
3822,-1.72
3823,-1.88
3824,-2.01
3825,-2.09
3826,-2.13
3827,-2.13
3828,-2.10
3829,-2.06
3830,-2.00
3831,-1.91
3832,-1.75
3833,-1.51
3834,-1.21
3835,-0.89
3836,-0.57
3837,-0.29
3838,-0.08
3839,0.04
3840,0.07
3841,0.02
3842,-0.05
3843,-0.11
3844,-0.12
3845,-0.07
3846,0.07
3847,0.27
3848,0.53
3849,0.80
3850,1.08
3851,1.34
3852,1.59
3853,1.84
3854,2.11
3855,2.41
3856,2.75
3857,3.11
3858,3.45
3859,3.72
3860,3.95
3861,4.17
3862,4.39
3863,4.59
3864,4.76
3865,4.92
3866,5.08
3867,5.24
3868,5.37
3869,5.43
3870,5.42
3871,5.36
3872,5.26
3873,5.19
3874,5.12
3875,5.07
3876,5.00
3877,4.93
3878,4.83
3879,4.71
3880,4.52
3881,4.28
3882,3.95
3883,3.60
3884,3.19
3885,2.78
3886,2.37
3887,1.97
3888,1.57
3889,1.21
3890,0.84
3891,0.49
3892,0.12
3893,-0.23
3894,-0.58
3895,-0.91
3896,-1.26
3897,-1.59
3898,-1.91
3899,-2.16
3900,-2.38
3901,-2.55
3902,-2.71
3903,-2.82
3904,-2.91
3905,-2.98
3906,-3.07
3907,-3.20
3908,-3.41
3909,-3.65
3910,-3.90
3911,-4.11
3912,-4.30
3913,-4.43
3914,-4.53
3915,-4.57
3916,-4.55
3917,-4.51
3918,-4.47
3919,-4.47
3920,-4.50
3921,-4.54
3922,-4.60
3923,-4.65
3924,-4.72
3925,-4.78
3926,-4.82
3927,-4.84
3928,-4.85
3929,-4.83
3930,-4.78
3931,-4.75
3932,-4.72
3933,-4.71
3934,-4.66
3935,-4.58
3936,-4.49
3937,-4.40
3938,-4.33
3939,-4.26
3940,-4.17
3941,-4.10
3942,-4.03
3943,-3.97
3944,-3.89
3945,-3.78
3946,-3.61
3947,-3.43
3948,-3.25
3949,-3.09
3950,-2.95
3951,-2.84
3952,-2.72
3953,-2.63
3954,-2.55
3955,-2.47
3956,-2.37
3957,-2.24
3958,-2.06
3959,-1.85
3960,-1.56
3961,-1.23
3962,-0.87
3963,-0.54
3964,-0.20
3965,0.14
3966,0.48
3967,0.78
3968,1.01
3969,1.18
3970,1.36
3971,1.56
3972,1.77
3973,1.97
3974,2.15
3975,2.33
3976,2.49
3977,2.62
3978,2.65
3979,2.62
3980,2.54
3981,2.43
3982,2.29
3983,2.11
3984,1.93
3985,1.75
3986,1.54
3987,1.34
3988,1.14
3989,1.00
3990,0.89
3991,0.82
3992,0.77
3993,0.76
3994,0.72
3995,0.64
3996,0.53
3997,0.39
3998,0.21
3999,0.02
4000,-0.19
4001,-0.35
4002,-0.44
4003,-0.47
4004,-0.50
4005,-0.54
4006,-0.59
4007,-0.65
4008,-0.75
4009,-0.88
4010,-1.03
4011,-1.17
4012,-1.31
4013,-1.45
4014,-1.56
4015,-1.63
4016,-1.63
4017,-1.57
4018,-1.44
4019,-1.27
4020,-1.05
4021,-0.85
4022,-0.67
4023,-0.51
4024,-0.38
4025,-0.31
4026,-0.27
4027,-0.24
4028,-0.16
4029,-0.01
4030,0.24
4031,0.51
4032,0.82
4033,1.13
4034,1.46
4035,1.78
4036,2.08
4037,2.33
4038,2.56
4039,2.78
4040,3.08
4041,3.41
4042,3.78
4043,4.15
4044,4.57
4045,5.00
4046,5.46
4047,5.85
4048,6.17
4049,6.39
4050,6.53
4051,6.60
4052,6.63
4053,6.62
4054,6.64
4055,6.67
4056,6.73
4057,6.77
4058,6.79
4059,6.80
4060,6.77
4061,6.68
4062,6.54
4063,6.39
4064,6.24
4065,6.14
4066,6.05
4067,5.99
4068,5.93
4069,5.85
4070,5.68
4071,5.41
4072,5.05
4073,4.64
4074,4.20
4075,3.81
4076,3.52
4077,3.37
4078,3.35
4079,3.44
4080,3.63
4081,3.87
4082,4.10
4083,4.29
4084,4.43
4085,4.55
4086,4.62
4087,4.66
4088,4.70
4089,4.74
4090,4.75
4091,4.71
4092,4.65
4093,4.55
4094,4.38
4095,4.16
4096,3.93
4097,3.75
4098,3.62
4099,3.52
4100,3.45
4101,3.40
4102,3.33
4103,3.23
4104,3.08
4105,2.91
4106,2.70
4107,2.53
4108,2.37
4109,2.27
4110,2.22
4111,2.20
4112,2.21
4113,2.20
4114,2.20
4115,2.17
4116,2.17
4117,2.20
4118,2.30
4119,2.46
4120,2.69
4121,3.01
4122,3.40
4123,3.81
4124,4.24
4125,4.62
4126,4.95
4127,5.22
4128,5.47
4129,5.68
4130,5.88
4131,6.05
4132,6.24
4133,6.45
4134,6.71
4135,6.97
4136,7.20
4137,7.38
4138,7.53
4139,7.66
4140,7.79
4141,7.89
4142,7.96
4143,7.99
4144,8.03
4145,8.10
4146,8.24
4147,8.44
4148,8.70
4149,8.97
4150,9.26
4151,9.50
4152,9.67
4153,9.74
4154,9.75
4155,9.73
4156,9.70
4157,9.67
4158,9.68
4159,9.71
4160,9.80
4161,9.92
4162,10.06
4163,10.16
4164,10.18
4165,10.12
4166,10.02
4167,9.90
4168,9.74
4169,9.59
4170,9.46
4171,9.40
4172,9.38
4173,9.40
4174,9.38
4175,9.35
4176,9.27
4177,9.13
4178,8.91
4179,8.62
4180,8.25
4181,7.87
4182,7.50
4183,7.17
4184,6.84
4185,6.52
4186,6.15
4187,5.78
4188,5.39
4189,5.07
4190,4.76
4191,4.49
4192,4.22
4193,3.99
4194,3.78
4195,3.61
4196,3.43
4197,3.25
4198,3.08
4199,2.93
4200,2.75
4201,2.56
4202,2.33
4203,2.10
4204,1.85
4205,1.63
4206,1.44
4207,1.34
4208,1.29
4209,1.31
4210,1.35
4211,1.40
4212,1.43
4213,1.43
4214,1.37
4215,1.27
4216,1.18
4217,1.14
4218,1.14
4219,1.20
4220,1.33
4221,1.50
4222,1.72
4223,1.91
4224,2.10
4225,2.24
4226,2.41
4227,2.60
4228,2.87
4229,3.20
4230,3.61
4231,4.04
4232,4.51
4233,4.98
4234,5.47
4235,5.90
4236,6.26
4237,6.54
4238,6.77
4239,6.95
4240,7.15
4241,7.32
4242,7.50
4243,7.70
4244,7.92
4245,8.11
4246,8.26
4247,8.34
4248,8.38
4249,8.39
4250,8.39
4251,8.41
4252,8.51
4253,8.71
4254,8.96
4255,9.22
4256,9.39
4257,9.48
4258,9.45
4259,9.33
4260,9.11
4261,8.83
4262,8.53
4263,8.32
4264,8.20
4265,8.16
4266,8.15
4267,8.12
4268,8.04
4269,7.95
4270,7.79
4271,7.58
4272,7.32
4273,7.06
4274,6.81
4275,6.60
4276,6.40
4277,6.23
4278,6.03
4279,5.83
4280,5.57
4281,5.28
4282,4.92
4283,4.53
4284,4.10
4285,3.70
4286,3.27
4287,2.85
4288,2.45
4289,2.12
4290,1.83
4291,1.59
4292,1.32
4293,1.08
4294,0.82
4295,0.56
4296,0.26
4297,-0.07
4298,-0.43
4299,-0.76
4300,-1.09
4301,-1.38
4302,-1.63
4303,-1.84
4304,-2.01
4305,-2.14
4306,-2.24
4307,-2.30
4308,-2.35
4309,-2.37
4310,-2.31
4311,-2.17
4312,-1.98
4313,-1.78
4314,-1.57
4315,-1.37
4316,-1.20
4317,-1.10
4318,-1.08
4319,-1.14
4320,-1.27
4321,-1.38
4322,-1.48
4323,-1.54
4324,-1.56
4325,-1.55
4326,-1.47
4327,-1.37
4328,-1.28
4329,-1.24
4330,-1.24
4331,-1.30
4332,-1.35
4333,-1.40
4334,-1.38
4335,-1.30
4336,-1.17
4337,-0.99
4338,-0.75
4339,-0.45
4340,-0.13
4341,0.17
4342,0.43
4343,0.65
4344,0.82
4345,0.93
4346,1.02
4347,1.09
4348,1.21
4349,1.35
4350,1.56
4351,1.82
4352,2.14
4353,2.50
4354,2.88
4355,3.23
4356,3.58
4357,3.88
4358,4.11
4359,4.29
4360,4.43
4361,4.50
4362,4.51
4363,4.41
4364,4.21
4365,3.97
4366,3.71
4367,3.45
4368,3.20
4369,2.96
4370,2.75
4371,2.62
4372,2.53
4373,2.52
4374,2.56
4375,2.65
4376,2.72
4377,2.77
4378,2.75
4379,2.67
4380,2.53
4381,2.38
4382,2.20
4383,1.99
4384,1.78
4385,1.59
4386,1.43
4387,1.34
4388,1.25
4389,1.18
4390,1.11
4391,1.05
4392,0.95
4393,0.82
4394,0.67
4395,0.53
4396,0.39
4397,0.26
4398,0.13
4399,0.02
4400,-0.05
4401,-0.06
4402,-0.02
4403,0.06
4404,0.13
4405,0.17
4406,0.21
4407,0.27
4408,0.34
4409,0.39
4410,0.46
4411,0.52
4412,0.62
4413,0.79
4414,1.06
4415,1.40
4416,1.81
4417,2.22
4418,2.69
4419,3.18
4420,3.66
4421,4.08
4422,4.46
4423,4.79
4424,5.09
4425,5.33
4426,5.54
4427,5.73
4428,5.92
4429,6.06
4430,6.13
4431,6.14
4432,6.14
4433,6.11
4434,6.08
4435,6.03
4436,6.02
4437,6.06
4438,6.16
4439,6.30
4440,6.46
4441,6.62
4442,6.77
4443,6.91
4444,7.01
4445,7.07
4446,7.10
4447,7.10
4448,7.07
4449,7.01
4450,6.93
4451,6.85
4452,6.78
4453,6.75
4454,6.72
4455,6.66
4456,6.55
4457,6.42
4458,6.28
4459,6.13
4460,5.95
4461,5.74
4462,5.52
4463,5.28
4464,4.99
4465,4.68
4466,4.35
4467,4.04
4468,3.72
4469,3.43
4470,3.16
4471,2.94
4472,2.74
4473,2.53
4474,2.27
4475,1.98
4476,1.63
4477,1.27
4478,0.86
4479,0.48
4480,0.14
4481,-0.11
4482,-0.31
4483,-0.45
4484,-0.61
4485,-0.73
4486,-0.85
4487,-0.92
4488,-1.01
4489,-1.08
4490,-1.14
4491,-1.17
4492,-1.24
4493,-1.34
4494,-1.43
4495,-1.48
4496,-1.46
4497,-1.40
4498,-1.31
4499,-1.19
4500,-1.04
4501,-0.90
4502,-0.80
4503,-0.76
4504,-0.76
4505,-0.77
4506,-0.74
4507,-0.65
4508,-0.44
4509,-0.17
4510,0.16
4511,0.47
4512,0.78
4513,1.03
4514,1.24
4515,1.37
4516,1.45
4517,1.50
4518,1.59
4519,1.77
4520,2.05
4521,2.40
4522,2.84
4523,3.33
4524,3.88
4525,4.39
4526,4.84
4527,5.20
4528,5.50
4529,5.72
4530,5.89
4531,5.99
4532,6.07
4533,6.13
4534,6.21
4535,6.27
4536,6.34
4537,6.37
4538,6.36
4539,6.29
4540,6.24
4541,6.20
4542,6.13
4543,6.03
4544,5.86
4545,5.68
4546,5.49
4547,5.26
4548,5.00
4549,4.71
4550,4.39
4551,4.10
4552,3.82
4553,3.59
4554,3.38
4555,3.20
4556,3.05
4557,2.91
4558,2.75
4559,2.61
4560,2.46
4561,2.37
4562,2.28
4563,2.17
4564,2.01
4565,1.84
4566,1.64
4567,1.44
4568,1.23
4569,1.02
4570,0.79
4571,0.58
4572,0.35
4573,0.11
4574,-0.14
4575,-0.40
4576,-0.66
4577,-0.89
4578,-1.11
4579,-1.31
4580,-1.49
4581,-1.59
4582,-1.66
4583,-1.70
4584,-1.74
4585,-1.78
4586,-1.82
4587,-1.85
4588,-1.92
4589,-2.00
4590,-2.05
4591,-2.04
4592,-1.95
4593,-1.79
4594,-1.54
4595,-1.23
4596,-0.86
4597,-0.47
4598,-0.02
4599,0.40
4600,0.82
4601,1.15
4602,1.45
4603,1.69
4604,1.94
4605,2.17
4606,2.44
4607,2.75
4608,3.09
4609,3.43
4610,3.78
4611,4.09
4612,4.36
4613,4.57
4614,4.78
4615,5.00
4616,5.21
4617,5.39
4618,5.55
4619,5.68
4620,5.79
4621,5.84
4622,5.87
4623,5.86
4624,5.86
4625,5.86
4626,5.85
4627,5.83
4628,5.81
4629,5.80
4630,5.75
4631,5.67
4632,5.57
4633,5.51
4634,5.50
4635,5.55
4636,5.62
4637,5.69
4638,5.78
4639,5.86
4640,5.91
4641,5.94
4642,5.94
4643,5.94
4644,5.93
4645,5.91
4646,5.88
4647,5.84
4648,5.81
4649,5.81
4650,5.85
4651,5.94
4652,6.02
4653,6.07
4654,6.03
4655,5.92
4656,5.71
4657,5.41
4658,5.03
4659,4.63
4660,4.25
4661,3.94
4662,3.67
4663,3.46
4664,3.27
4665,3.07
4666,2.85
4667,2.57
4668,2.23
4669,1.89
4670,1.59
4671,1.34
4672,1.10
4673,0.92
4674,0.77
4675,0.69
4676,0.63
4677,0.54
4678,0.39
4679,0.22
4680,0.01
4681,-0.23
4682,-0.51
4683,-0.82
4684,-1.18
4685,-1.53
4686,-1.88
4687,-2.15
4688,-2.37
4689,-2.50
4690,-2.58
4691,-2.59
4692,-2.59
4693,-2.62
4694,-2.75
4695,-2.95
4696,-3.18
4697,-3.39
4698,-3.54
4699,-3.62
4700,-3.59
4701,-3.43
4702,-3.15
4703,-2.82
4704,-2.46
4705,-2.15
4706,-1.84
4707,-1.53
4708,-1.21
4709,-0.89
4710,-0.55
4711,-0.21
4712,0.19
4713,0.60
4714,1.03
4715,1.40
4716,1.74
4717,2.02
4718,2.33
4719,2.61
4720,2.91
4721,3.20
4722,3.53
4723,3.86
4724,4.23
4725,4.55
4726,4.86
4727,5.11
4728,5.36
4729,5.56
4730,5.77
4731,5.96
4732,6.18
4733,6.41
4734,6.64
4735,6.84
4736,7.03
4737,7.20
4738,7.37
4739,7.51
4740,7.63
4741,7.70
4742,7.74
4743,7.78
4744,7.84
4745,7.90
4746,7.93
4747,7.90
4748,7.79
4749,7.63
4750,7.42
4751,7.19
4752,6.92
4753,6.67
4754,6.42
4755,6.19
4756,5.92
4757,5.62
4758,5.21
4759,4.77
4760,4.24
4761,3.69
4762,3.09
4763,2.50
4764,1.94
4765,1.46
4766,1.07
4767,0.79
4768,0.56
4769,0.40
4770,0.20
4771,-0.02
4772,-0.34
4773,-0.69
4774,-1.09
4775,-1.48
4776,-1.87
4777,-2.20
4778,-2.49
4779,-2.72
4780,-2.93
4781,-3.12
4782,-3.32
4783,-3.52
4784,-3.72
4785,-3.91
4786,-4.03
4787,-4.07
4788,-4.02
4789,-3.88
4790,-3.65
4791,-3.36
4792,-3.01
4793,-2.67
4794,-2.37
4795,-2.13
4796,-1.94
4797,-1.79
4798,-1.64
4799,-1.51
4800,-1.36
4801,-1.17
4802,-0.95
4803,-0.72
4804,-0.51
4805,-0.35
4806,-0.21
4807,-0.08
4808,0.05
4809,0.12
4810,0.21
4811,0.32
4812,0.47
4813,0.65
4814,0.88
4815,1.13
4816,1.39
4817,1.59
4818,1.72
4819,1.79
4820,1.82
4821,1.82
4822,1.81
4823,1.78
4824,1.78
4825,1.82
4826,1.92
4827,2.04
4828,2.12
4829,2.14
4830,2.14
4831,2.11
4832,2.06
4833,1.97
4834,1.84
4835,1.72
4836,1.60
4837,1.52
4838,1.42
4839,1.33
4840,1.19
4841,1.04
4842,0.85
4843,0.64
4844,0.37
4845,0.05
4846,-0.32
4847,-0.69
4848,-1.08
4849,-1.47
4850,-1.88
4851,-2.21
4852,-2.46
4853,-2.61
4854,-2.72
4855,-2.78
4856,-2.84
4857,-2.85
4858,-2.88
4859,-2.94
4860,-3.02
4861,-3.10
4862,-3.17
4863,-3.22
4864,-3.30
4865,-3.37
4866,-3.45
4867,-3.50
4868,-3.57
4869,-3.66
4870,-3.79
4871,-3.91
4872,-4.00
4873,-4.02
4874,-3.99
4875,-3.91
4876,-3.78
4877,-3.66
4878,-3.59
4879,-3.59
4880,-3.64
4881,-3.73
4882,-3.85
4883,-3.94
4884,-3.97
4885,-3.90
4886,-3.73
4887,-3.49
4888,-3.16
4889,-2.81
4890,-2.49
4891,-2.24
4892,-2.04
4893,-1.88
4894,-1.73
4895,-1.59
4896,-1.40
4897,-1.14
4898,-0.78
4899,-0.40
4900,-0.01
4901,0.32
4902,0.59
4903,0.76
4904,0.89
4905,1.02
4906,1.20
4907,1.41
4908,1.69
4909,1.98
4910,2.29
4911,2.54
4912,2.73
4913,2.83
4914,2.87
4915,2.84
4916,2.77
4917,2.67
4918,2.58
4919,2.51
4920,2.48
4921,2.48
4922,2.52
4923,2.60
4924,2.71
4925,2.83
4926,2.95
4927,3.03
4928,3.04
4929,2.96
4930,2.82
4931,2.63
4932,2.44
4933,2.30
4934,2.24
4935,2.26
4936,2.33
4937,2.47
4938,2.60
4939,2.69
4940,2.67
4941,2.56
4942,2.35
4943,2.11
4944,1.84
4945,1.56
4946,1.31
4947,1.14
4948,1.00
4949,0.89
4950,0.75
4951,0.60
4952,0.43
4953,0.27
4954,0.10
4955,-0.08
4956,-0.25
4957,-0.40
4958,-0.56
4959,-0.70
4960,-0.82
4961,-0.92
4962,-1.01
4963,-1.09
4964,-1.17
4965,-1.21
4966,-1.26
4967,-1.32
4968,-1.43
4969,-1.54
4970,-1.63
4971,-1.70
4972,-1.75
4973,-1.79
4974,-1.78
4975,-1.70
4976,-1.59
4977,-1.46
4978,-1.31
4979,-1.14
4980,-0.93
4981,-0.73
4982,-0.55
4983,-0.40
4984,-0.24
4985,-0.08
4986,0.14
4987,0.35
4988,0.59
4989,0.83
4990,1.14
4991,1.48
4992,1.82
4993,2.11
4994,2.38
4995,2.61
4996,2.83
4997,3.04
4998,3.30
4999,3.61
5000,3.99
5001,4.40
5002,4.88
5003,5.37
5004,5.88
5005,6.36
5006,6.80
5007,7.14
5008,7.42
5009,7.61
5010,7.77
5011,7.90
5012,8.03
5013,8.17
5014,8.35
5015,8.54
5016,8.74
5017,8.92
5018,9.07
5019,9.15
5020,9.13
5021,9.01
5022,8.83
5023,8.62
5024,8.42
5025,8.26
5026,8.17
5027,8.16
5028,8.18
5029,8.19
5030,8.11
5031,7.93
5032,7.58
5033,7.10
5034,6.49
5035,5.86
5036,5.26
5037,4.78
5038,4.43
5039,4.22
5040,4.13
5041,4.14
5042,4.16
5043,4.14
5044,4.00
5045,3.78
5046,3.49
5047,3.20
5048,2.91
5049,2.72
5050,2.60
5051,2.57
5052,2.56
5053,2.53
5054,2.43
5055,2.28
5056,2.04
5057,1.77
5058,1.47
5059,1.21
5060,1.02
5061,0.95
5062,0.95
5063,1.03
5064,1.09
5065,1.12
5066,1.06
5067,0.92
5068,0.71
5069,0.49
5070,0.30
5071,0.18
5072,0.13
5073,0.13
5074,0.16
5075,0.20
5076,0.24
5077,0.26
5078,0.27
5079,0.28
5080,0.36
5081,0.51
5082,0.76
5083,1.08
5084,1.44
5085,1.81
5086,2.12
5087,2.33
5088,2.46
5089,2.53
5090,2.59
5091,2.66
5092,2.73
5093,2.80
5094,2.91
5095,3.04
5096,3.21
5097,3.37
5098,3.50
5099,3.58
5100,3.62
5101,3.63
5102,3.64
5103,3.65
5104,3.64
5105,3.59
5106,3.52
5107,3.44
5108,3.40
5109,3.39
5110,3.41
5111,3.46
5112,3.52
5113,3.62
5114,3.74
5115,3.88
5116,4.05
5117,4.19
5118,4.25
5119,4.23
5120,4.17
5121,4.14
5122,4.09
5123,4.04
5124,3.97
5125,3.93
5126,3.91
5127,3.88
5128,3.79
5129,3.68
5130,3.53
5131,3.42
5132,3.31
5133,3.23
5134,3.11
5135,2.95
5136,2.74
5137,2.49
5138,2.17
5139,1.85
5140,1.47
5141,1.10
5142,0.72
5143,0.36
5144,0.01
5145,-0.30
5146,-0.59
5147,-0.82
5148,-1.02
5149,-1.17
5150,-1.28
5151,-1.34
5152,-1.37
5153,-1.43
5154,-1.53
5155,-1.66
5156,-1.84
5157,-2.01
5158,-2.21
5159,-2.43
5160,-2.67
5161,-2.90
5162,-3.13
5163,-3.32
5164,-3.50
5165,-3.66
5166,-3.81
5167,-3.92
5168,-4.01
5169,-4.07
5170,-4.14
5171,-4.23
5172,-4.36
5173,-4.52
5174,-4.68
5175,-4.83
5176,-4.94
5177,-5.00
5178,-4.99
5179,-4.95
5180,-4.91
5181,-4.90
5182,-4.88
5183,-4.82
5184,-4.71
5185,-4.58
5186,-4.41
5187,-4.20
5188,-3.90
5189,-3.54
5190,-3.15
5191,-2.80
5192,-2.46
5193,-2.11
5194,-1.71
5195,-1.27
5196,-0.82
5197,-0.39
5198,0.06
5199,0.50
5200,0.98
5201,1.39
5202,1.76
5203,2.04
5204,2.29
5205,2.49
5206,2.74
5207,2.98
5208,3.24
5209,3.48
5210,3.74
5211,4.00
5212,4.30
5213,4.57
5214,4.84
5215,5.08
5216,5.28
5217,5.42
5218,5.50
5219,5.56
5220,5.62
5221,5.65
5222,5.66
5223,5.65
5224,5.62
5225,5.58
5226,5.49
5227,5.36
5228,5.17
5229,4.98
5230,4.75
5231,4.50
5232,4.20
5233,3.91
5234,3.61
5235,3.30
5236,2.94
5237,2.53
5238,2.05
5239,1.56
5240,1.05
5241,0.58
5242,0.13
5243,-0.25
5244,-0.62
5245,-0.95
5246,-1.30
5247,-1.62
5248,-1.96
5249,-2.29
5250,-2.66
5251,-3.03
5252,-3.40
5253,-3.72
5254,-3.99
5255,-4.20
5256,-4.36
5257,-4.47
5258,-4.59
5259,-4.71
5260,-4.81
5261,-4.88
5262,-4.89
5263,-4.85
5264,-4.74
5265,-4.56
5266,-4.33
5267,-4.07
5268,-3.79
5269,-3.52
5270,-3.24
5271,-2.99
5272,-2.73
5273,-2.46
5274,-2.14
5275,-1.81
5276,-1.44
5277,-1.11
5278,-0.82
5279,-0.60
5280,-0.46
5281,-0.40
5282,-0.40
5283,-0.43
5284,-0.43
5285,-0.35
5286,-0.20
5287,-0.02
5288,0.16
5289,0.27
5290,0.33
5291,0.32
5292,0.30
5293,0.24
5294,0.21
5295,0.23
5296,0.34
5297,0.53
5298,0.79
5299,1.05
5300,1.30
5301,1.53
5302,1.78
5303,1.99
5304,2.19
5305,2.38
5306,2.62
5307,2.88
5308,3.20
5309,3.52
5310,3.83
5311,4.08
5312,4.30
5313,4.48
5314,4.64
5315,4.77
5316,4.88
5317,4.97
5318,5.02
5319,5.04
5320,5.00
5321,4.91
5322,4.76
5323,4.59
5324,4.36
5325,4.10
5326,3.81
5327,3.52
5328,3.20
5329,2.85
5330,2.43
5331,2.01
5332,1.66
5333,1.39
5334,1.21
5335,1.14
5336,1.17
5337,1.27
5338,1.39
5339,1.46
5340,1.44
5341,1.38
5342,1.30
5343,1.20
5344,1.09
5345,1.03
5346,1.06
5347,1.17
5348,1.34
5349,1.49
5350,1.59
5351,1.67
5352,1.72
5353,1.75
5354,1.72
5355,1.69
5356,1.66
5357,1.63
5358,1.59
5359,1.54
5360,1.49
5361,1.43
5362,1.40
5363,1.35
5364,1.35
5365,1.40
5366,1.52
5367,1.66
5368,1.82
5369,2.00
5370,2.20
5371,2.39
5372,2.58
5373,2.75
5374,2.95
5375,3.16
5376,3.42
5377,3.68
5378,4.01
5379,4.32
5380,4.65
5381,4.96
5382,5.26
5383,5.52
5384,5.73
5385,5.91
5386,6.07
5387,6.23
5388,6.37
5389,6.48
5390,6.59
5391,6.67
5392,6.72
5393,6.74
5394,6.74
5395,6.74
5396,6.73
5397,6.71
5398,6.68
5399,6.62
5400,6.52
5401,6.38
5402,6.23
5403,6.11
5404,6.01
5405,5.94
5406,5.87
5407,5.84
5408,5.80
5409,5.73
5410,5.58
5411,5.39
5412,5.17
5413,4.97
5414,4.78
5415,4.62
5416,4.49
5417,4.42
5418,4.39
5419,4.40
5420,4.39
5421,4.36
5422,4.25
5423,4.10
5424,3.89
5425,3.66
5426,3.36
5427,3.06
5428,2.73
5429,2.42
5430,2.08
5431,1.72
5432,1.37
5433,1.03
5434,0.68
5435,0.34
5436,-0.03
5437,-0.38
5438,-0.76
5439,-1.11
5440,-1.42
5441,-1.66
5442,-1.85
5443,-2.01
5444,-2.12
5445,-2.15
5446,-2.14
5447,-2.14
5448,-2.18
5449,-2.27
5450,-2.43
5451,-2.61
5452,-2.82
5453,-3.04
5454,-3.22
5455,-3.33
5456,-3.35
5457,-3.28
5458,-3.12
5459,-2.90
5460,-2.69
5461,-2.55
5462,-2.48
5463,-2.46
5464,-2.49
5465,-2.58
5466,-2.67
5467,-2.74
5468,-2.72
5469,-2.63
5470,-2.45
5471,-2.20
5472,-1.85
5473,-1.46
5474,-1.03
5475,-0.62
5476,-0.20
5477,0.16
5478,0.50
5479,0.80
5480,1.11
5481,1.37
5482,1.61
5483,1.84
5484,2.16
5485,2.52
5486,2.91
5487,3.27
5488,3.65
5489,4.01
5490,4.34
5491,4.56
5492,4.71
5493,4.84
5494,4.99
5495,5.18
5496,5.47
5497,5.82
5498,6.24
5499,6.66
5500,7.06
5501,7.40
5502,7.64
5503,7.77
5504,7.75
5505,7.64
5506,7.42
5507,7.15
5508,6.78
5509,6.37
5510,5.91
5511,5.41
5512,4.88
5513,4.35
5514,3.83
5515,3.40
5516,3.02
5517,2.72
5518,2.41
5519,2.17
5520,1.95
5521,1.76
5522,1.53
5523,1.25
5524,0.96
5525,0.72
5526,0.53
5527,0.40
5528,0.31
5529,0.30
5530,0.34
5531,0.39
5532,0.35
5533,0.21
5534,0.02
5535,-0.17
5536,-0.34
5537,-0.47
5538,-0.55
5539,-0.53
5540,-0.43
5541,-0.28
5542,-0.14
5543,-0.06
5544,-0.07
5545,-0.17
5546,-0.34
5547,-0.57
5548,-0.79
5549,-0.98
5550,-1.08
5551,-1.08
5552,-0.99
5553,-0.85
5554,-0.69
5555,-0.55
5556,-0.43
5557,-0.36
5558,-0.31
5559,-0.25
5560,-0.16
5561,-0.05
5562,0.11
5563,0.28
5564,0.51
5565,0.76
5566,1.02
5567,1.27
5568,1.50
5569,1.71
5570,1.89
5571,2.04
5572,2.24
5573,2.48
5574,2.72
5575,2.92
5576,3.08
5577,3.22
5578,3.35
5579,3.45
5580,3.49
5581,3.46
5582,3.42
5583,3.40
5584,3.43
5585,3.49
5586,3.56
5587,3.65
5588,3.73
5589,3.81
5590,3.85
5591,3.84
5592,3.75
5593,3.61
5594,3.41
5595,3.22
5596,3.07
5597,2.98
5598,2.94
5599,2.91
5600,2.88
5601,2.85
5602,2.82
5603,2.77
5604,2.69
5605,2.59
5606,2.45
5607,2.30
5608,2.15
5609,2.01
5610,1.83
5611,1.63
5612,1.39
5613,1.15
5614,0.89
5615,0.60
5616,0.27
5617,-0.07
5618,-0.44
5619,-0.82
5620,-1.18
5621,-1.49
5622,-1.77
5623,-2.02
5624,-2.27
5625,-2.51
5626,-2.73
5627,-2.93
5628,-3.11
5629,-3.27
5630,-3.41
5631,-3.50
5632,-3.57
5633,-3.58
5634,-3.56
5635,-3.54
5636,-3.56
5637,-3.59
5638,-3.64
5639,-3.70
5640,-3.79
5641,-3.88
5642,-3.96
5643,-4.01
5644,-4.04
5645,-4.05
5646,-4.03
5647,-4.00
5648,-3.97
5649,-3.92
5650,-3.82
5651,-3.69
5652,-3.58
5653,-3.52
5654,-3.46
5655,-3.40
5656,-3.39
5657,-3.45
5658,-3.55
5659,-3.64
5660,-3.67
5661,-3.63
5662,-3.51
5663,-3.33
5664,-3.11
5665,-2.85
5666,-2.56
5667,-2.29
5668,-2.02
5669,-1.80
5670,-1.55
5671,-1.27
5672,-0.87
5673,-0.40
5674,0.16
5675,0.71
5676,1.26
5677,1.72
5678,2.15
5679,2.47
5680,2.72
5681,2.88
5682,2.98
5683,3.04
5684,3.14
5685,3.25
5686,3.41
5687,3.56
5688,3.71
5689,3.81
5690,3.87
5691,3.92
5692,4.01
5693,4.10
5694,4.20
5695,4.26
5696,4.31
5697,4.34
5698,4.36
5699,4.32
5700,4.23
5701,4.14
5702,4.03
5703,3.91
5704,3.77
5705,3.62
5706,3.43
5707,3.26
5708,3.07
5709,2.90
5710,2.72
5711,2.57
5712,2.43
5713,2.30
5714,2.10
5715,1.86
5716,1.54
5717,1.18
5718,0.76
5719,0.31
5720,-0.15
5721,-0.59
5722,-1.01
5723,-1.37
5724,-1.72
5725,-2.01
5726,-2.30
5727,-2.57
5728,-2.84
5729,-3.07
5730,-3.30
5731,-3.52
5732,-3.72
5733,-3.87
5734,-3.99
5735,-4.10
5736,-4.26
5737,-4.43
5738,-4.61
5739,-4.75
5740,-4.88
5741,-5.00
5742,-5.10
5743,-5.15
5744,-5.17
5745,-5.19
5746,-5.23
5747,-5.32
5748,-5.39
5749,-5.44
5750,-5.43
5751,-5.37
5752,-5.23
5753,-5.04
5754,-4.81
5755,-4.57
5756,-4.32
5757,-4.10
5758,-3.94
5759,-3.85
5760,-3.76
5761,-3.69
5762,-3.63
5763,-3.57
5764,-3.48
5765,-3.35
5766,-3.18
5767,-3.01
5768,-2.78
5769,-2.53
5770,-2.25
5771,-2.01
5772,-1.82
5773,-1.68
5774,-1.59
5775,-1.56
5776,-1.56
5777,-1.54
5778,-1.46
5779,-1.33
5780,-1.14
5781,-0.97
5782,-0.79
5783,-0.63
5784,-0.51
5785,-0.43
5786,-0.35
5787,-0.27
5788,-0.22
5789,-0.18
5790,-0.13
5791,-0.05
5792,0.05
5793,0.13
5794,0.19
5795,0.23
5796,0.24
5797,0.21
5798,0.11
5799,-0.06
5800,-0.27
5801,-0.49
5802,-0.69
5803,-0.86
5804,-1.06
5805,-1.25
5806,-1.44
5807,-1.62
5808,-1.82
5809,-2.08
5810,-2.38
5811,-2.70
5812,-3.03
5813,-3.32
5814,-3.59
5815,-3.78
5816,-3.91
5817,-3.96
5818,-3.99
5819,-4.00
5820,-4.03
5821,-4.08
5822,-4.21
5823,-4.43
5824,-4.72
5825,-5.04
5826,-5.36
5827,-5.64
5828,-5.87
5829,-6.03
5830,-6.11
5831,-6.13
5832,-6.11
5833,-6.08
5834,-6.09
5835,-6.10
5836,-6.13
5837,-6.16
5838,-6.16
5839,-6.14
5840,-6.09
5841,-5.99
5842,-5.84
5843,-5.66
5844,-5.46
5845,-5.26
5846,-4.98
5847,-4.65
5848,-4.26
5849,-3.86
5850,-3.47
5851,-3.12
5852,-2.77
5853,-2.44
5854,-2.09
5855,-1.75
5856,-1.35
5857,-0.93
5858,-0.43
5859,0.10
5860,0.69
5861,1.27
5862,1.80
5863,2.23
5864,2.57
5865,2.82
5866,3.03
5867,3.19
5868,3.40
5869,3.64
5870,3.98
5871,4.35
5872,4.75
5873,5.14
5874,5.57
5875,5.98
5876,6.36
5877,6.63
5878,6.84
5879,6.97
5880,7.06
5881,7.09
5882,7.10
5883,7.09
5884,7.12
5885,7.17
5886,7.26
5887,7.34
5888,7.40
5889,7.44
5890,7.44
5891,7.40
5892,7.34
5893,7.28
5894,7.23
5895,7.21
5896,7.22
5897,7.23
5898,7.18
5899,7.05
5900,6.80
5901,6.48
5902,6.10
5903,5.73
5904,5.36
5905,5.09
5906,4.84
5907,4.62
5908,4.30
5909,3.94
5910,3.52
5911,3.08
5912,2.58
5913,2.08
5914,1.58
5915,1.19
5916,0.85
5917,0.54
5918,0.23
5919,-0.08
5920,-0.43
5921,-0.78
5922,-1.16
5923,-1.49
5924,-1.78
5925,-1.98
5926,-2.15
5927,-2.24
5928,-2.28
5929,-2.27
5930,-2.29
5931,-2.33
5932,-2.44
5933,-2.58
5934,-2.78
5935,-2.99
5936,-3.20
5937,-3.36
5938,-3.47
5939,-3.53
5940,-3.52
5941,-3.46
5942,-3.37
5943,-3.31
5944,-3.30
5945,-3.33
5946,-3.34
5947,-3.33
5948,-3.28
5949,-3.22
5950,-3.13
5951,-3.01
5952,-2.88
5953,-2.77
5954,-2.64
5955,-2.47
5956,-2.22
5957,-1.90
5958,-1.53
5959,-1.15
5960,-0.76
5961,-0.42
5962,-0.09
5963,0.18
5964,0.45
5965,0.69
5966,0.95
5967,1.20
5968,1.50
5969,1.79
5970,2.07
5971,2.26
5972,2.40
5973,2.47
5974,2.51
5975,2.52
5976,2.56
5977,2.62
5978,2.70
5979,2.80
5980,2.91
5981,3.04
5982,3.15
5983,3.23
5984,3.23
5985,3.19
5986,3.07
5987,2.87
5988,2.56
5989,2.19
5990,1.76
5991,1.34
5992,0.86
5993,0.37
5994,-0.14
5995,-0.64
5996,-1.11
5997,-1.50
5998,-1.83
5999,-2.08
6000,-2.30
6001,-2.49
6002,-2.67
6003,-2.82
6004,-3.00
6005,-3.20
6006,-3.42
6007,-3.59
6008,-3.71
6009,-3.75
6010,-3.73
6011,-3.68
6012,-3.62
6013,-3.55
6014,-3.48
6015,-3.42
6016,-3.34
6017,-3.27
6018,-3.19
6019,-3.08
6020,-2.93
6021,-2.74
6022,-2.52
6023,-2.32
6024,-2.13
6025,-2.00
6026,-1.91
6027,-1.91
6028,-1.89
6029,-1.87
6030,-1.79
6031,-1.65
6032,-1.43
6033,-1.16
6034,-0.83
6035,-0.50
6036,-0.15
6037,0.16
6038,0.43
6039,0.63
6040,0.79
6041,0.93
6042,1.13
6043,1.37
6044,1.65
6045,1.94
6046,2.25
6047,2.55
6048,2.83
6049,3.04
6050,3.18
6051,3.23
6052,3.26
6053,3.29
6054,3.36
6055,3.46
6056,3.59
6057,3.73
6058,3.87
6059,3.94
6060,3.94
6061,3.86
6062,3.75
6063,3.59
6064,3.43
6065,3.27
6066,3.17
6067,3.17
6068,3.22
6069,3.30
6070,3.36
6071,3.42
6072,3.45
6073,3.43
6074,3.39
6075,3.34
6076,3.30
6077,3.30
6078,3.37
6079,3.51
6080,3.68
6081,3.88
6082,4.04
6083,4.17
6084,4.22
6085,4.22
6086,4.17
6087,4.10
6088,3.98
6089,3.87
6090,3.74
6091,3.62
6092,3.48
6093,3.33
6094,3.15
6095,2.91
6096,2.59
6097,2.20
6098,1.76
6099,1.33
6100,0.86
6101,0.43
6102,0.08
6103,-0.18
6104,-0.41
6105,-0.63
6106,-0.89
6107,-1.11
6108,-1.37
6109,-1.61
6110,-1.89
6111,-2.17
6112,-2.45
6113,-2.69
6114,-2.94
6115,-3.17
6116,-3.44
6117,-3.71
6118,-3.99
6119,-4.26
6120,-4.56
6121,-4.84
6122,-5.07
6123,-5.22
6124,-5.36
6125,-5.49
6126,-5.62
6127,-5.74
6128,-5.86
6129,-5.97
6130,-6.10
6131,-6.20
6132,-6.28
6133,-6.36
6134,-6.44
6135,-6.52
6136,-6.58
6137,-6.56
6138,-6.45
6139,-6.28
6140,-6.03
6141,-5.74
6142,-5.37
6143,-4.98
6144,-4.56
6145,-4.20
6146,-3.84
6147,-3.50
6148,-3.09
6149,-2.62
6150,-2.04
6151,-1.44
6152,-0.79
6153,-0.19
6154,0.41
6155,0.92
6156,1.35
6157,1.61
6158,1.77
6159,1.86
6160,1.97
6161,2.09
6162,2.26
6163,2.46
6164,2.70
6165,2.96
6166,3.20
6167,3.36
6168,3.43
6169,3.45
6170,3.46
6171,3.45
6172,3.43
6173,3.42
6174,3.42
6175,3.43
6176,3.46
6177,3.44
6178,3.37
6179,3.27
6180,3.15
6181,3.03
6182,2.91
6183,2.82
6184,2.73
6185,2.65
6186,2.47
6187,2.20
6188,1.81
6189,1.38
6190,0.91
6191,0.48
6192,0.08
6193,-0.21
6194,-0.43
6195,-0.59
6196,-0.80
6197,-1.05
6198,-1.41
6199,-1.82
6200,-2.36
6201,-2.91
6202,-3.49
6203,-4.01
6204,-4.51
6205,-4.94
6206,-5.35
6207,-5.66
6208,-5.94
6209,-6.16
6210,-6.40
6211,-6.63
6212,-6.90
6213,-7.16
6214,-7.46
6215,-7.75
6216,-8.05
6217,-8.31
6218,-8.51
6219,-8.58
6220,-8.54
6221,-8.39
6222,-8.20
6223,-8.02
6224,-7.88
6225,-7.80
6226,-7.77
6227,-7.75
6228,-7.72
6229,-7.63
6230,-7.43
6231,-7.11
6232,-6.68
6233,-6.23
6234,-5.86
6235,-5.62
6236,-5.52
6237,-5.53
6238,-5.58
6239,-5.65
6240,-5.68
6241,-5.65
6242,-5.51
6243,-5.29
6244,-5.04
6245,-4.80
6246,-4.58
6247,-4.39
6248,-4.21
6249,-4.08
6250,-3.94
6251,-3.77
6252,-3.54
6253,-3.30
6254,-3.07
6255,-2.88
6256,-2.68
6257,-2.51
6258,-2.36
6259,-2.26
6260,-2.18
6261,-2.11
6262,-2.02
6263,-1.91
6264,-1.74
6265,-1.55
6266,-1.32
6267,-1.08
6268,-0.82
6269,-0.58
6270,-0.42
6271,-0.37
6272,-0.43
6273,-0.54
6274,-0.64
6275,-0.72
6276,-0.79
6277,-0.80
6278,-0.76
6279,-0.67
6280,-0.62
6281,-0.63
6282,-0.72
6283,-0.86
6284,-1.06
6285,-1.28
6286,-1.50
6287,-1.67
6288,-1.82
6289,-1.95
6290,-2.11
6291,-2.28
6292,-2.49
6293,-2.69
6294,-2.88
6295,-3.04
6296,-3.14
6297,-3.18
6298,-3.18
6299,-3.16
6300,-3.11
6301,-3.05
6302,-2.99
6303,-2.94
6304,-2.88
6305,-2.79
6306,-2.71
6307,-2.62
6308,-2.57
6309,-2.53
6310,-2.48
6311,-2.42
6312,-2.37
6313,-2.33
6314,-2.27
6315,-2.20
6316,-2.11
6317,-2.00
6318,-1.91
6319,-1.89
6320,-1.97
6321,-2.14
6322,-2.32
6323,-2.49
6324,-2.61
6325,-2.69
6326,-2.69
6327,-2.57
6328,-2.35
6329,-2.07
6330,-1.75
6331,-1.46
6332,-1.20
6333,-1.01
6334,-0.85
6335,-0.72
6336,-0.56
6337,-0.39
6338,-0.18
6339,0.02
6340,0.21
6341,0.37
6342,0.54
6343,0.68
6344,0.80
6345,0.92
6346,1.06
6347,1.23
6348,1.46
6349,1.69
6350,1.93
6351,2.11
6352,2.21
6353,2.25
6354,2.27
6355,2.25
6356,2.25
6357,2.27
6358,2.34
6359,2.46
6360,2.59
6361,2.72
6362,2.83
6363,2.94
6364,3.05
6365,3.17
6366,3.26
6367,3.32
6368,3.30
6369,3.24
6370,3.17
6371,3.11
6372,3.06
6373,2.98
6374,2.88
6375,2.82
6376,2.82
6377,2.84
6378,2.83
6379,2.78
6380,2.69
6381,2.54
6382,2.33
6383,2.08
6384,1.80
6385,1.55
6386,1.27
6387,0.96
6388,0.60
6389,0.22
6390,-0.17
6391,-0.53
6392,-0.91
6393,-1.24
6394,-1.54
6395,-1.79
6396,-2.04
6397,-2.22
6398,-2.38
6399,-2.49
6400,-2.61
6401,-2.69
6402,-2.78
6403,-2.85
6404,-2.96
6405,-3.07
6406,-3.18
6407,-3.27
6408,-3.33
6409,-3.36
6410,-3.37
6411,-3.40
6412,-3.46
6413,-3.55
6414,-3.68
6415,-3.82
6416,-3.96
6417,-4.08
6418,-4.15
6419,-4.11
6420,-3.96
6421,-3.74
6422,-3.49
6423,-3.30
6424,-3.15
6425,-3.07
6426,-3.04
6427,-3.04
6428,-2.99
6429,-2.89
6430,-2.73
6431,-2.53
6432,-2.31
6433,-2.12
6434,-1.95
6435,-1.83
6436,-1.77
6437,-1.75
6438,-1.74
6439,-1.69
6440,-1.56
6441,-1.36
6442,-1.10
6443,-0.80
6444,-0.49
6445,-0.20
6446,0.08
6447,0.31
6448,0.53
6449,0.72
6450,0.92
6451,1.11
6452,1.34
6453,1.59
6454,1.88
6455,2.17
6456,2.49
6457,2.84
6458,3.26
6459,3.68
6460,4.14
6461,4.55
6462,4.96
6463,5.30
6464,5.60
6465,5.79
6466,5.92
6467,5.95
6468,5.92
6469,5.83
6470,5.74
6471,5.65
6472,5.58
6473,5.53
6474,5.49
6475,5.49
6476,5.53
6477,5.62
6478,5.72
6479,5.84
6480,5.95
6481,6.03
6482,6.08
6483,6.08
6484,6.03
6485,5.96
6486,5.84
6487,5.71
6488,5.55
6489,5.41
6490,5.30
6491,5.25
6492,5.20
6493,5.17
6494,5.13
6495,5.12
6496,5.09
6497,5.07
6498,5.01
6499,4.96
6500,4.85
6501,4.72
6502,4.53
6503,4.30
6504,3.99
6505,3.62
6506,3.17
6507,2.66
6508,2.14
6509,1.67
6510,1.27
6511,1.02
6512,0.89
6513,0.89
6514,1.00
6515,1.21
6516,1.46
6517,1.66
6518,1.75
6519,1.70
6520,1.59
6521,1.48
6522,1.45
6523,1.54
6524,1.81
6525,2.21
6526,2.76
6527,3.36
6528,3.98
6529,4.52
6530,4.94
6531,5.19
6532,5.33
6533,5.39
6534,5.46
6535,5.57
6536,5.78
6537,6.03
6538,6.33
6539,6.61
6540,6.85
6541,7.03
6542,7.13
6543,7.17
6544,7.16
6545,7.13
6546,7.16
6547,7.22
6548,7.29
6549,7.35
6550,7.41
6551,7.51
6552,7.64
6553,7.77
6554,7.83
6555,7.81
6556,7.75
6557,7.67
6558,7.54
6559,7.35
6560,7.09
6561,6.83
6562,6.57
6563,6.31
6564,6.04
6565,5.77
6566,5.47
6567,5.18
6568,4.88
6569,4.62
6570,4.36
6571,4.12
6572,3.85
6573,3.61
6574,3.37
6575,3.16
6576,2.89
6577,2.57
6578,2.19
6579,1.84
6580,1.48
6581,1.15
6582,0.82
6583,0.56
6584,0.33
6585,0.14
6586,-0.10
6587,-0.37
6588,-0.67
6589,-0.92
6590,-1.14
6591,-1.34
6592,-1.53
6593,-1.66
6594,-1.75
6595,-1.83
6596,-1.94
6597,-2.07
6598,-2.23
6599,-2.39
6600,-2.56
6601,-2.72
6602,-2.82
6603,-2.87
6604,-2.87
6605,-2.85
6606,-2.86
6607,-2.86
6608,-2.88
6609,-2.89
6610,-2.92
6611,-2.95
6612,-3.01
6613,-3.07
6614,-3.14
6615,-3.22
6616,-3.30
6617,-3.40
6618,-3.52
6619,-3.65
6620,-3.73
6621,-3.74
6622,-3.65
6623,-3.50
6624,-3.23
6625,-2.89
6626,-2.44
6627,-1.97
6628,-1.46
6629,-0.99
6630,-0.53
6631,-0.11
6632,0.34
6633,0.75
6634,1.14
6635,1.44
6636,1.71
6637,1.93
6638,2.17
6639,2.40
6640,2.66
6641,2.93
6642,3.23
6643,3.50
6644,3.75
6645,3.94
6646,4.12
6647,4.26
6648,4.43
6649,4.60
6650,4.84
6651,5.14
6652,5.47
6653,5.80
6654,6.09
6655,6.31
6656,6.42
6657,6.39
6658,6.29
6659,6.13
6660,5.98
6661,5.85
6662,5.73
6663,5.62
6664,5.46
6665,5.27
6666,5.03
6667,4.73
6668,4.33
6669,3.86
6670,3.36
6671,2.93
6672,2.54
6673,2.22
6674,1.90
6675,1.61
6676,1.31
6677,1.03
6678,0.69
6679,0.33
6680,-0.11
6681,-0.53
6682,-0.98
6683,-1.38
6684,-1.81
6685,-2.24
6686,-2.70
6687,-3.13
6688,-3.55
6689,-3.92
6690,-4.26
6691,-4.52
6692,-4.69
6693,-4.75
6694,-4.78
6695,-4.79
6696,-4.84
6697,-4.90
6698,-4.95
6699,-5.01
6700,-5.11
6701,-5.23
6702,-5.32
6703,-5.37
6704,-5.36
6705,-5.30
6706,-5.16
6707,-4.94
6708,-4.67
6709,-4.37
6710,-4.04
6711,-3.68
6712,-3.32
6713,-2.98
6714,-2.67
6715,-2.44
6716,-2.27
6717,-2.17
6718,-2.11
6719,-2.11
6720,-2.12
6721,-2.13
6722,-2.05
6723,-1.91
6724,-1.75
6725,-1.62
6726,-1.47
6727,-1.32
6728,-1.17
6729,-1.09
6730,-1.08
6731,-1.14
6732,-1.18
6733,-1.21
6734,-1.20
6735,-1.16
6736,-1.08
6737,-0.94
6738,-0.74
6739,-0.54
6740,-0.37
6741,-0.23
6742,-0.11
6743,-0.02
6744,0.05
6745,0.09
6746,0.14
6747,0.21
6748,0.34
6749,0.53
6750,0.72
6751,0.92
6752,1.11
6753,1.27
6754,1.40
6755,1.46
6756,1.45
6757,1.41
6758,1.36
6759,1.30
6760,1.21
6761,1.10
6762,0.95
6763,0.77
6764,0.56
6765,0.32
6766,0.05
6767,-0.22
6768,-0.52
6769,-0.79
6770,-1.04
6771,-1.26
6772,-1.49
6773,-1.67
6774,-1.81
6775,-1.87
6776,-1.89
6777,-1.88
6778,-1.84
6779,-1.77
6780,-1.76
6781,-1.81
6782,-1.93
6783,-2.07
6784,-2.24
6785,-2.46
6786,-2.71
6787,-2.94
6788,-3.17
6789,-3.36
6790,-3.56
6791,-3.75
6792,-3.97
6793,-4.20
6794,-4.46
6795,-4.69
6796,-4.91
6797,-5.10
6798,-5.29
6799,-5.47
6800,-5.65
6801,-5.81
6802,-5.96
6803,-6.09
6804,-6.23
6805,-6.35
6806,-6.44
6807,-6.48
6808,-6.46
6809,-6.40
6810,-6.32
6811,-6.24
6812,-6.14
6813,-6.01
6814,-5.84
6815,-5.64
6816,-5.39
6817,-5.11
6818,-4.73
6819,-4.30
6820,-3.81
6821,-3.32
6822,-2.81
6823,-2.37
6824,-1.95
6825,-1.63
6826,-1.32
6827,-1.05
6828,-0.79
6829,-0.53
6830,-0.25
6831,-0.01
6832,0.23
6833,0.40
6834,0.54
6835,0.63
6836,0.70
6837,0.76
6838,0.84
6839,0.95
6840,1.11
6841,1.29
6842,1.49
6843,1.66
6844,1.81
6845,1.91
6846,1.97
6847,1.98
6848,1.95
6849,1.87
6850,1.78
6851,1.69
6852,1.63
6853,1.59
6854,1.57
6855,1.56
6856,1.50
6857,1.42
6858,1.34
6859,1.30
6860,1.31
6861,1.33
6862,1.34
6863,1.38
6864,1.49
6865,1.65
6866,1.81
6867,1.93
6868,2.03
6869,2.11
6870,2.14
6871,2.13
6872,2.06
6873,1.94
6874,1.76
6875,1.59
6876,1.43
6877,1.31
6878,1.20
6879,1.08
6880,0.98
6881,0.92
6882,0.89
6883,0.87
6884,0.87
6885,0.89
6886,0.91
6887,0.93
6888,0.96
6889,0.98
6890,0.96
6891,0.91
6892,0.82
6893,0.74
6894,0.67
6895,0.63
6896,0.62
6897,0.61
6898,0.63
6899,0.65
6900,0.67
6901,0.69
6902,0.72
6903,0.75
6904,0.82
6905,0.94
6906,1.10
6907,1.30
6908,1.54
6909,1.78
6910,1.99
6911,2.17
6912,2.33
6913,2.48
6914,2.63
6915,2.79
6916,3.01
6917,3.29
6918,3.59
6919,3.87
6920,4.14
6921,4.38
6922,4.64
6923,4.88
6924,5.10
6925,5.28
6926,5.49
6927,5.72
6928,6.00
6929,6.28
6930,6.53
6931,6.73
6932,6.90
6933,7.03
6934,7.13
6935,7.17
6936,7.16
6937,7.12
6938,7.05
6939,6.96
6940,6.84
6941,6.71
6942,6.61
6943,6.58
6944,6.58
6945,6.61
6946,6.61
6947,6.55
6948,6.42
6949,6.21
6950,5.87
6951,5.46
6952,4.99
6953,4.53
6954,4.10
6955,3.76
6956,3.48
6957,3.28
6958,3.12
6959,3.00
6960,2.85
6961,2.66
6962,2.37
6963,1.99
6964,1.56
6965,1.17
6966,0.82
6967,0.56
6968,0.38
6969,0.29
6970,0.27
6971,0.30
6972,0.28
6973,0.24
6974,0.14
6975,0.00
6976,-0.22
6977,-0.50
6978,-0.76
6979,-0.95
6980,-1.06
6981,-1.14
6982,-1.17
6983,-1.11
6984,-0.95
6985,-0.79
6986,-0.69
6987,-0.67
6988,-0.69
6989,-0.72
6990,-0.76
6991,-0.82
6992,-0.85
6993,-0.84
6994,-0.76
6995,-0.66
6996,-0.55
6997,-0.45
6998,-0.34
6999,-0.23
7000,-0.10
7001,0.04
7002,0.20
7003,0.40
7004,0.63
7005,0.89
7006,1.14
7007,1.38
7008,1.60
7009,1.75
7010,1.85
7011,1.88
7012,1.91
7013,1.98
7014,2.04
7015,2.08
7016,2.11
7017,2.14
7018,2.20
7019,2.26
7020,2.33
7021,2.38
7022,2.43
7023,2.44
7024,2.46
7025,2.52
7026,2.63
7027,2.78
7028,3.00
7029,3.23
7030,3.49
7031,3.71
7032,3.85
7033,3.90
7034,3.85
7035,3.75
7036,3.61
7037,3.49
7038,3.44
7039,3.49
7040,3.63
7041,3.81
7042,4.03
7043,4.26
7044,4.44
7045,4.55
7046,4.53
7047,4.43
7048,4.29
7049,4.17
7050,4.07
7051,3.98
7052,3.86
7053,3.68
7054,3.41
7055,3.06
7056,2.62
7057,2.15
7058,1.63
7059,1.11
7060,0.65
7061,0.34
7062,0.14
7063,0.04
7064,-0.06
7065,-0.15
7066,-0.26
7067,-0.38
7068,-0.55
7069,-0.72
7070,-0.86
7071,-0.90
7072,-0.86
7073,-0.75
7074,-0.60
7075,-0.43
7076,-0.33
7077,-0.32
7078,-0.43
7079,-0.61
7080,-0.84
7081,-1.09
7082,-1.39
7083,-1.68
7084,-1.94
7085,-2.14
7086,-2.32
7087,-2.49
7088,-2.66
7089,-2.79
7090,-2.94
7091,-3.07
7092,-3.21
7093,-3.33
7094,-3.43
7095,-3.51
7096,-3.56
7097,-3.58
7098,-3.56
7099,-3.55
7100,-3.55
7101,-3.56
7102,-3.59
7103,-3.62
7104,-3.64
7105,-3.68
7106,-3.69
7107,-3.68
7108,-3.62
7109,-3.52
7110,-3.38
7111,-3.20
7112,-2.98
7113,-2.72
7114,-2.44
7115,-2.17
7116,-1.88
7117,-1.58
7118,-1.28
7119,-1.02
7120,-0.83
7121,-0.74
7122,-0.71
7123,-0.72
7124,-0.72
7125,-0.73
7126,-0.71
7127,-0.65
7128,-0.52
7129,-0.34
7130,-0.14
7131,0.08
7132,0.32
7133,0.53
7134,0.70
7135,0.78
7136,0.79
7137,0.77
7138,0.72
7139,0.64
7140,0.52
7141,0.40
7142,0.32
7143,0.28
7144,0.26
7145,0.23
7146,0.15
7147,0.02
7148,-0.24
7149,-0.58
7150,-1.02
7151,-1.47
7152,-1.96
7153,-2.40
7154,-2.81
7155,-3.14
7156,-3.46
7157,-3.76
7158,-4.11
7159,-4.46
7160,-4.86
7161,-5.31
7162,-5.84
7163,-6.35
7164,-6.80
7165,-7.13
7166,-7.39
7167,-7.58
7168,-7.71
7169,-7.79
7170,-7.87
7171,-7.95
7172,-8.09
7173,-8.25
7174,-8.45
7175,-8.67
7176,-8.87
7177,-9.03
7178,-9.14
7179,-9.19
7180,-9.21
7181,-9.19
7182,-9.16
7183,-9.14
7184,-9.12
7185,-9.11
7186,-9.06
7187,-8.99
7188,-8.86
7189,-8.69
7190,-8.38
7191,-7.97
7192,-7.46
7193,-7.99
7194,-7.32
7195,-4.17
7196,-2.60
7197,-8.31
7198,-14.03
7199,-2.24
7200,16.01
