1,-150.04
2,-198.84
3,-166.49
4,-93.38
5,-32.88
6,3.00
7,27.69
8,44.79
9,47.58
10,37.35
11,23.65
12,13.56
13,9.00
14,9.58
15,13.19
16,18.33
17,21.76
18,22.98
19,21.48
20,18.39
21,14.92
22,12.01
23,10.36
24,9.75
25,9.92
26,10.23
27,10.32
28,9.95
29,9.21
30,8.19
31,7.18
32,6.13
33,5.17
34,4.16
35,3.20
36,2.27
37,1.51
38,0.87
39,0.40
40,-0.02
41,-0.34
42,-0.65
43,-0.93
44,-1.27
45,-1.65
46,-2.04
47,-2.43
48,-2.75
49,-2.99
50,-3.04
51,-2.88
52,-2.42
53,-1.67
54,-0.59
55,0.81
56,2.49
57,4.33
58,6.23
59,8.04
60,9.63
61,10.84
62,11.52
63,11.59
64,11.01
65,9.84
66,8.19
67,6.17
68,3.97
69,1.78
70,-0.21
71,-1.82
72,-3.05
73,-3.87
74,-4.36
75,-4.53
76,-4.54
77,-4.39
78,-4.14
79,-3.78
80,-3.32
81,-2.78
82,-2.16
83,-1.52
84,-0.89
85,-0.34
86,0.15
87,0.58
88,1.02
89,1.49
90,2.03
91,2.60
92,3.20
93,3.75
94,4.15
95,4.34
96,4.26
97,3.91
98,3.35
99,2.67
100,1.94
101,1.24
102,0.59
103,-0.02
104,-0.62
105,-1.19
106,-1.78
107,-2.34
108,-2.91
109,-3.41
110,-3.83
111,-4.08
112,-4.17
113,-4.08
114,-3.88
115,-3.59
116,-3.24
117,-2.85
118,-2.43
119,-2.02
120,-1.66
121,-1.40
122,-1.25
123,-1.20
124,-1.21
125,-1.25
126,-1.29
127,-1.34
128,-1.37
129,-1.35
130,-1.24
131,-1.12
132,-1.07
133,-1.10
134,-1.20
135,-1.32
136,-1.47
137,-1.65
138,-1.85
139,-2.04
140,-2.25
141,-2.49
142,-2.78
143,-3.11
144,-3.42
145,-3.68
146,-3.85
147,-3.92
148,-3.85
149,-3.65
150,-3.33
151,-2.96
152,-2.55
153,-2.14
154,-1.68
155,-1.18
156,-0.58
157,0.07
158,0.81
159,1.55
160,2.32
161,3.01
162,3.64
163,4.14
164,4.57
165,4.93
166,5.31
167,5.68
168,6.13
169,6.58
170,7.09
171,7.59
172,8.10
173,8.58
174,9.05
175,9.46
176,9.77
177,9.93
178,9.97
179,9.88
180,9.67
181,9.34
182,8.90
183,8.40
184,7.83
185,7.25
186,6.66
187,6.10
188,5.54
189,5.03
190,4.59
191,4.27
192,4.05
193,3.93
194,3.85
195,3.86
196,3.91
197,4.00
198,4.08
199,4.21
200,4.36
201,4.54
202,4.64
203,4.62
204,4.39
205,3.95
206,3.30
207,2.53
208,1.67
209,0.85
210,0.12
211,-0.42
212,-0.81
213,-1.03
214,-1.20
215,-1.34
216,-1.54
217,-1.75
218,-1.99
219,-2.23
220,-2.56
221,-2.96
222,-3.49
223,-4.12
224,-4.89
225,-5.74
226,-6.65
227,-7.45
228,-8.16
229,-8.67
230,-9.03
231,-9.22
232,-9.34
233,-9.41
234,-9.54
235,-9.70
236,-9.93
237,-10.15
238,-10.37
239,-10.57
240,-10.71
241,-10.77
242,-10.73
243,-10.67
244,-10.55
245,-10.36
246,-10.01
247,-9.52
248,-8.91
249,-8.29
250,-7.68
251,-7.15
252,-6.71
253,-6.42
254,-6.24
255,-6.19
256,-6.11
257,-6.00
258,-5.73
259,-5.36
260,-4.87
261,-4.34
262,-3.77
263,-3.28
264,-2.88
265,-2.61
266,-2.42
267,-2.30
268,-2.15
269,-1.93
270,-1.52
271,-0.93
272,-0.15
273,0.72
274,1.67
275,2.57
276,3.34
277,3.91
278,4.24
279,4.33
280,4.19
281,3.82
282,3.32
283,2.74
284,2.17
285,1.65
286,1.24
287,0.94
288,0.72
289,0.61
290,0.60
291,0.68
292,0.82
293,0.98
294,1.12
295,1.24
296,1.34
297,1.38
298,1.36
299,1.31
300,1.30
301,1.34
302,1.43
303,1.53
304,1.62
305,1.67
306,1.64
307,1.50
308,1.23
309,0.87
310,0.49
311,0.15
312,-0.17
313,-0.41
314,-0.59
315,-0.66
316,-0.70
317,-0.72
318,-0.79
319,-0.89
320,-1.05
321,-1.29
322,-1.59
323,-1.92
324,-2.31
325,-2.73
326,-3.16
327,-3.47
328,-3.62
329,-3.56
330,-3.34
331,-2.97
332,-2.48
333,-1.93
334,-1.46
335,-1.19
336,-1.17
337,-1.38
338,-1.75
339,-2.23
340,-2.69
341,-3.09
342,-3.33
343,-3.40
344,-3.33
345,-3.25
346,-3.22
347,-3.27
348,-3.33
349,-3.36
350,-3.30
351,-3.14
352,-2.86
353,-2.44
354,-1.91
355,-1.39
356,-0.98
357,-0.76
358,-0.72
359,-0.89
360,-1.14
361,-1.44
362,-1.62
363,-1.59
364,-1.30
365,-0.78
366,-0.07
367,0.76
368,1.63
369,2.43
370,3.07
371,3.49
372,3.70
373,3.75
374,3.69
375,3.55
376,3.35
377,3.14
378,2.99
379,2.91
380,2.88
381,2.87
382,2.82
383,2.77
384,2.72
385,2.66
386,2.56
387,2.47
388,2.40
389,2.36
390,2.30
391,2.24
392,2.13
393,1.98
394,1.70
395,1.27
396,0.59
397,-0.25
398,-1.29
399,-2.40
400,-3.56
401,-4.62
402,-5.60
403,-6.40
404,-7.07
405,-7.53
406,-7.86
407,-8.06
408,-8.25
409,-8.41
410,-8.59
411,-8.71
412,-8.84
413,-8.93
414,-9.00
415,-9.02
416,-9.00
417,-8.95
418,-8.91
419,-8.90
420,-8.89
421,-8.87
422,-8.83
423,-8.77
424,-8.67
425,-8.54
426,-8.37
427,-8.19
428,-8.01
429,-7.87
430,-7.80
431,-7.82
432,-7.93
433,-8.11
434,-8.25
435,-8.35
436,-8.40
437,-8.38
438,-8.26
439,-8.02
440,-7.62
441,-7.14
442,-6.59
443,-6.05
444,-5.49
445,-4.93
446,-4.37
447,-3.91
448,-3.54
449,-3.31
450,-3.11
451,-2.93
452,-2.73
453,-2.56
454,-2.36
455,-2.11
456,-1.78
457,-1.43
458,-1.03
459,-0.61
460,-0.09
461,0.45
462,1.04
463,1.62
464,2.21
465,2.78
466,3.30
467,3.72
468,4.05
469,4.27
470,4.43
471,4.50
472,4.55
473,4.58
474,4.62
475,4.65
476,4.72
477,4.84
478,5.00
479,5.20
480,5.42
481,5.66
482,5.91
483,6.13
484,6.29
485,6.37
486,6.37
487,6.32
488,6.20
489,6.07
490,5.91
491,5.78
492,5.64
493,5.49
494,5.27
495,4.98
496,4.62
497,4.26
498,3.93
499,3.72
500,3.60
501,3.56
502,3.48
503,3.35
504,3.05
505,2.58
506,1.88
507,1.05
508,0.13
509,-0.74
510,-1.58
511,-2.30
512,-2.94
513,-3.46
514,-3.95
515,-4.41
516,-4.89
517,-5.33
518,-5.71
519,-5.94
520,-6.03
521,-5.90
522,-5.58
523,-5.11
524,-4.61
525,-4.17
526,-3.90
527,-3.85
528,-4.01
529,-4.33
530,-4.71
531,-5.02
532,-5.20
533,-5.19
534,-5.00
535,-4.72
536,-4.43
537,-4.18
538,-4.01
539,-3.97
540,-4.09
541,-4.32
542,-4.57
543,-4.75
544,-4.85
545,-4.88
546,-4.88
547,-4.88
548,-4.92
549,-5.00
550,-5.10
551,-5.18
552,-5.25
553,-5.29
554,-5.26
555,-5.17
556,-4.99
557,-4.71
558,-4.31
559,-3.79
560,-3.20
561,-2.62
562,-2.10
563,-1.69
564,-1.35
565,-1.14
566,-1.05
567,-1.08
568,-1.14
569,-1.17
570,-1.12
571,-1.00
572,-0.82
573,-0.59
574,-0.36
575,-0.18
576,-0.09
577,-0.09
578,-0.15
579,-0.23
580,-0.32
581,-0.43
582,-0.62
583,-0.89
584,-1.28
585,-1.78
586,-2.37
587,-3.01
588,-3.66
589,-4.26
590,-4.78
591,-5.14
592,-5.40
593,-5.55
594,-5.67
595,-5.78
596,-5.93
597,-6.10
598,-6.31
599,-6.50
600,-6.68
601,-6.79
602,-6.87
603,-6.92
604,-6.98
605,-7.01
606,-7.04
607,-7.05
608,-7.09
609,-7.12
610,-7.16
611,-7.24
612,-7.40
613,-7.61
614,-7.84
615,-8.05
616,-8.24
617,-8.41
618,-8.57
619,-8.71
620,-8.86
621,-9.05
622,-9.29
623,-9.56
624,-9.80
625,-9.99
626,-10.07
627,-10.03
628,-9.87
629,-9.63
630,-9.35
631,-9.07
632,-8.81
633,-8.58
634,-8.34
635,-8.09
636,-7.77
637,-7.39
638,-6.88
639,-6.29
640,-5.61
641,-4.92
642,-4.23
643,-3.59
644,-2.92
645,-2.28
646,-1.62
647,-0.99
648,-0.37
649,0.15
650,0.63
651,1.01
652,1.37
653,1.66
654,1.91
655,2.13
656,2.32
657,2.43
658,2.46
659,2.37
660,2.14
661,1.82
662,1.42
663,1.01
664,0.60
665,0.20
666,-0.24
667,-0.71
668,-1.19
669,-1.63
670,-2.04
671,-2.40
672,-2.65
673,-2.73
674,-2.66
675,-2.43
676,-2.08
677,-1.63
678,-1.19
679,-0.84
680,-0.66
681,-0.63
682,-0.76
683,-1.05
684,-1.53
685,-2.13
686,-2.78
687,-3.40
688,-3.98
689,-4.46
690,-4.88
691,-5.18
692,-5.46
693,-5.72
694,-6.03
695,-6.36
696,-6.75
697,-7.18
698,-7.68
699,-8.14
700,-8.58
701,-8.90
702,-9.18
703,-9.41
704,-9.74
705,-10.14
706,-10.68
707,-11.28
708,-11.98
709,-12.66
710,-13.35
711,-13.95
712,-14.44
713,-14.79
714,-15.03
715,-15.16
716,-15.24
717,-15.27
718,-15.29
719,-15.29
720,-15.30
721,-15.31
722,-15.34
723,-15.32
724,-15.23
725,-15.10
726,-14.91
727,-14.70
728,-14.40
729,-14.04
730,-13.57
731,-13.08
732,-12.55
733,-12.05
734,-11.54
735,-11.09
736,-10.68
737,-10.38
738,-10.12
739,-9.94
740,-9.74
741,-9.54
742,-9.28
743,-9.00
744,-8.62
745,-8.22
746,-7.75
747,-7.32
748,-6.91
749,-6.61
750,-6.35
751,-6.08
752,-5.72
753,-5.30
754,-4.78
755,-4.25
756,-3.68
757,-3.15
758,-2.68
759,-2.35
760,-2.12
761,-2.01
762,-1.90
763,-1.77
764,-1.54
765,-1.27
766,-0.98
767,-0.72
768,-0.47
769,-0.27
770,-0.10
771,0.02
772,0.15
773,0.37
774,0.67
775,1.01
776,1.35
777,1.63
778,1.83
779,1.95
780,1.99
781,1.96
782,1.91
783,1.89
784,1.93
785,1.99
786,2.02
787,1.99
788,1.88
789,1.70
790,1.45
791,1.15
792,0.82
793,0.53
794,0.28
795,0.11
796,-0.04
797,-0.17
798,-0.32
799,-0.45
800,-0.59
801,-0.73
802,-0.96
803,-1.23
804,-1.55
805,-1.89
806,-2.28
807,-2.71
808,-3.17
809,-3.63
810,-4.07
811,-4.43
812,-4.68
813,-4.80
814,-4.79
815,-4.68
816,-4.53
817,-4.33
818,-4.08
819,-3.82
820,-3.59
821,-3.38
822,-3.21
823,-3.07
824,-2.99
825,-2.94
826,-2.93
827,-2.94
828,-3.04
829,-3.21
830,-3.46
831,-3.77
832,-4.10
833,-4.43
834,-4.68
835,-4.83
836,-4.85
837,-4.75
838,-4.55
839,-4.34
840,-4.20
841,-4.19
842,-4.25
843,-4.36
844,-4.46
845,-4.49
846,-4.36
847,-3.98
848,-3.36
849,-2.59
850,-1.79
851,-1.08
852,-0.55
853,-0.30
854,-0.33
855,-0.58
856,-0.92
857,-1.22
858,-1.38
859,-1.38
860,-1.19
861,-0.89
862,-0.56
863,-0.31
864,-0.19
865,-0.26
866,-0.52
867,-0.85
868,-1.17
869,-1.37
870,-1.47
871,-1.46
872,-1.36
873,-1.17
874,-1.00
875,-0.94
876,-1.08
877,-1.41
878,-1.97
879,-2.69
880,-3.61
881,-4.59
882,-5.63
883,-6.60
884,-7.53
885,-8.32
886,-9.03
887,-9.62
888,-10.18
889,-10.70
890,-11.22
891,-11.67
892,-12.08
893,-12.34
894,-12.47
895,-12.41
896,-12.19
897,-11.84
898,-11.42
899,-11.04
900,-10.76
901,-10.58
902,-10.44
903,-10.31
904,-10.18
905,-10.03
906,-9.77
907,-9.45
908,-9.06
909,-8.70
910,-8.37
911,-8.15
912,-8.02
913,-8.03
914,-8.11
915,-8.25
916,-8.35
917,-8.40
918,-8.31
919,-8.10
920,-7.77
921,-7.35
922,-6.84
923,-6.32
924,-5.80
925,-5.42
926,-5.10
927,-4.87
928,-4.58
929,-4.26
930,-3.84
931,-3.31
932,-2.60
933,-1.79
934,-0.92
935,-0.14
936,0.51
937,0.99
938,1.36
939,1.60
940,1.82
941,1.97
942,2.14
943,2.32
944,2.53
945,2.72
946,2.88
947,2.95
948,2.98
949,2.96
950,2.97
951,3.02
952,3.18
953,3.44
954,3.78
955,4.12
956,4.44
957,4.69
958,4.87
959,4.97
960,5.00
961,4.94
962,4.77
963,4.49
964,4.15
965,3.87
966,3.68
967,3.63
968,3.68
969,3.85
970,4.08
971,4.33
972,4.50
973,4.52
974,4.30
975,3.88
976,3.30
977,2.66
978,2.01
979,1.46
980,1.01
981,0.65
982,0.28
983,-0.11
984,-0.57
985,-1.05
986,-1.58
987,-2.05
988,-2.46
989,-2.70
990,-2.83
991,-2.88
992,-2.97
993,-3.15
994,-3.47
995,-3.91
996,-4.47
997,-5.05
998,-5.55
999,-5.87
1000,-6.01
1001,-5.96
1002,-5.78
1003,-5.51
1004,-5.23
1005,-5.03
1006,-4.94
1007,-4.97
1008,-5.05
1009,-5.14
1010,-5.17
1011,-5.12
1012,-4.95
1013,-4.67
1014,-4.29
1015,-3.87
1016,-3.46
1017,-3.14
1018,-2.94
1019,-2.90
1020,-3.01
1021,-3.23
1022,-3.52
1023,-3.80
1024,-4.05
1025,-4.23
1026,-4.32
1027,-4.30
1028,-4.20
1029,-4.10
1030,-4.03
1031,-4.01
1032,-4.03
1033,-4.07
1034,-4.12
1035,-4.15
1036,-4.11
1037,-4.00
1038,-3.78
1039,-3.49
1040,-3.12
1041,-2.73
1042,-2.27
1043,-1.79
1044,-1.26
1045,-0.77
1046,-0.27
1047,0.21
1048,0.72
1049,1.20
1050,1.65
1051,2.08
1052,2.54
1053,2.99
1054,3.43
1055,3.76
1056,4.00
1057,4.07
1058,3.98
1059,3.72
1060,3.33
1061,2.87
1062,2.37
1063,1.88
1064,1.46
1065,1.13
1066,0.86
1067,0.66
1068,0.46
1069,0.28
1070,0.09
1071,-0.12
1072,-0.40
1073,-0.68
1074,-0.99
1075,-1.27
1076,-1.55
1077,-1.79
1078,-2.03
1079,-2.26
1080,-2.56
1081,-2.93
1082,-3.36
1083,-3.81
1084,-4.32
1085,-4.83
1086,-5.32
1087,-5.68
1088,-5.88
1089,-5.93
1090,-5.89
1091,-5.80
1092,-5.72
1093,-5.67
1094,-5.71
1095,-5.84
1096,-6.10
1097,-6.42
1098,-6.77
1099,-7.13
1100,-7.50
1101,-7.88
1102,-8.24
1103,-8.58
1104,-8.90
1105,-9.21
1106,-9.45
1107,-9.56
1108,-9.48
1109,-9.20
1110,-8.72
1111,-8.09
1112,-7.30
1113,-6.45
1114,-5.56
1115,-4.76
1116,-4.01
1117,-3.40
1118,-2.83
1119,-2.37
1120,-1.93
1121,-1.53
1122,-1.00
1123,-0.38
1124,0.40
1125,1.22
1126,2.11
1127,2.93
1128,3.70
1129,4.33
1130,4.83
1131,5.17
1132,5.43
1133,5.64
1134,5.88
1135,6.15
1136,6.46
1137,6.76
1138,7.04
1139,7.26
1140,7.39
1141,7.37
1142,7.19
1143,6.87
1144,6.45
1145,5.97
1146,5.42
1147,4.87
1148,4.35
1149,3.94
1150,3.69
1151,3.60
1152,3.62
1153,3.75
1154,3.95
1155,4.20
1156,4.43
1157,4.64
1158,4.79
1159,4.94
1160,5.04
1161,5.13
1162,5.16
1163,5.11
1164,4.94
1165,4.63
1166,4.14
1167,3.50
1168,2.75
1169,2.00
1170,1.27
1171,0.64
1172,0.10
1173,-0.30
1174,-0.66
1175,-0.97
1176,-1.36
1177,-1.75
1178,-2.23
1179,-2.70
1180,-3.27
1181,-3.85
1182,-4.49
1183,-5.10
1184,-5.79
1185,-6.51
1186,-7.33
1187,-8.17
1188,-9.06
1189,-9.86
1190,-10.61
1191,-11.18
1192,-11.66
1193,-11.98
1194,-12.26
1195,-12.47
1196,-12.70
1197,-12.93
1198,-13.22
1199,-13.53
1200,-13.85
1201,-14.11
1202,-14.31
1203,-14.43
1204,-14.43
1205,-14.33
1206,-14.09
1207,-13.77
1208,-13.39
1209,-13.01
1210,-12.66
1211,-12.36
1212,-12.10
1213,-11.85
1214,-11.57
1215,-11.25
1216,-10.89
1217,-10.51
1218,-10.12
1219,-9.81
1220,-9.58
1221,-9.51
1222,-9.57
1223,-9.81
1224,-10.14
1225,-10.52
1226,-10.82
1227,-10.99
1228,-10.97
1229,-10.78
1230,-10.40
1231,-9.88
1232,-9.25
1233,-8.55
1234,-7.81
1235,-7.10
1236,-6.42
1237,-5.87
1238,-5.45
1239,-5.20
1240,-5.09
1241,-5.14
1242,-5.27
1243,-5.45
1244,-5.57
1245,-5.60
1246,-5.48
1247,-5.23
1248,-4.83
1249,-4.36
1250,-3.82
1251,-3.33
1252,-2.91
1253,-2.64
1254,-2.46
1255,-2.36
1256,-2.26
1257,-2.17
1258,-2.04
1259,-1.85
1260,-1.53
1261,-1.14
1262,-0.70
1263,-0.34
1264,-0.11
1265,-0.04
1266,-0.17
1267,-0.50
1268,-0.98
1269,-1.52
1270,-2.02
1271,-2.38
1272,-2.58
1273,-2.56
1274,-2.40
1275,-2.14
1276,-1.95
1277,-1.95
1278,-2.25
1279,-2.80
1280,-3.59
1281,-4.48
1282,-5.46
1283,-6.39
1284,-7.25
1285,-7.91
1286,-8.41
1287,-8.74
1288,-8.98
1289,-9.16
1290,-9.28
1291,-9.31
1292,-9.28
1293,-9.17
1294,-9.01
1295,-8.79
1296,-8.53
1297,-8.25
1298,-7.95
1299,-7.65
1300,-7.36
1301,-7.10
1302,-6.87
1303,-6.70
1304,-6.57
1305,-6.51
1306,-6.53
1307,-6.65
1308,-6.84
1309,-7.07
1310,-7.31
1311,-7.55
1312,-7.77
1313,-7.96
1314,-8.08
1315,-8.14
1316,-8.13
1317,-8.10
1318,-8.04
1319,-7.97
1320,-7.84
1321,-7.66
1322,-7.45
1323,-7.22
1324,-6.91
1325,-6.48
1326,-5.87
1327,-5.12
1328,-4.25
1329,-3.33
1330,-2.37
1331,-1.51
1332,-0.79
1333,-0.31
1334,-0.04
1335,0.02
1336,-0.05
1337,-0.21
1338,-0.34
1339,-0.39
1340,-0.30
1341,-0.08
1342,0.26
1343,0.64
1344,1.01
1345,1.27
1346,1.40
1347,1.41
1348,1.36
1349,1.32
1350,1.34
1351,1.42
1352,1.53
1353,1.63
1354,1.63
1355,1.50
1356,1.17
1357,0.68
1358,0.03
1359,-0.72
1360,-1.61
1361,-2.49
1362,-3.34
1363,-4.10
1364,-4.83
1365,-5.50
1366,-6.16
1367,-6.75
1368,-7.35
1369,-7.88
1370,-8.36
1371,-8.74
1372,-9.08
1373,-9.32
1374,-9.47
1375,-9.47
1376,-9.38
1377,-9.21
1378,-8.94
1379,-8.59
1380,-8.18
1381,-7.74
1382,-7.25
1383,-6.71
1384,-6.16
1385,-5.64
1386,-5.18
1387,-4.84
1388,-4.67
1389,-4.70
1390,-4.95
1391,-5.40
1392,-5.97
1393,-6.57
1394,-7.04
1395,-7.33
1396,-7.41
1397,-7.32
1398,-7.13
1399,-6.90
1400,-6.72
1401,-6.65
1402,-6.65
1403,-6.73
1404,-6.79
1405,-6.81
1406,-6.69
1407,-6.46
1408,-6.10
1409,-5.66
1410,-5.16
1411,-4.63
1412,-4.04
1413,-3.39
1414,-2.65
1415,-1.88
1416,-1.08
1417,-0.33
1418,0.37
1419,0.91
1420,1.34
1421,1.60
1422,1.79
1423,1.88
1424,2.01
1425,2.17
1426,2.45
1427,2.79
1428,3.21
1429,3.60
1430,3.97
1431,4.26
1432,4.52
1433,4.75
1434,5.01
1435,5.33
1436,5.71
1437,6.14
1438,6.63
1439,7.13
1440,7.61
1441,8.03
1442,8.35
1443,8.51
1444,8.50
1445,8.32
1446,8.00
1447,7.55
1448,7.03
1449,6.47
1450,5.91
1451,5.39
1452,4.91
1453,4.49
1454,4.08
1455,3.69
1456,3.26
1457,2.84
1458,2.39
1459,1.97
1460,1.48
1461,1.01
1462,0.51
1463,0.06
1464,-0.43
1465,-0.95
1466,-1.53
1467,-2.10
1468,-2.70
1469,-3.28
1470,-3.88
1471,-4.41
1472,-4.89
1473,-5.27
1474,-5.62
1475,-5.91
1476,-6.17
1477,-6.36
1478,-6.49
1479,-6.55
1480,-6.57
1481,-6.54
1482,-6.48
1483,-6.37
1484,-6.27
1485,-6.20
1486,-6.19
1487,-6.21
1488,-6.27
1489,-6.37
1490,-6.49
1491,-6.60
1492,-6.66
1493,-6.66
1494,-6.61
1495,-6.50
1496,-6.36
1497,-6.18
1498,-5.98
1499,-5.80
1500,-5.65
1501,-5.55
1502,-5.50
1503,-5.49
1504,-5.47
1505,-5.44
1506,-5.43
1507,-5.46
1508,-5.51
1509,-5.57
1510,-5.63
1511,-5.73
1512,-5.89
1513,-6.10
1514,-6.29
1515,-6.44
1516,-6.51
1517,-6.49
1518,-6.36
1519,-6.13
1520,-5.79
1521,-5.39
1522,-4.94
1523,-4.52
1524,-4.09
1525,-3.70
1526,-3.30
1527,-2.94
1528,-2.56
1529,-2.19
1530,-1.75
1531,-1.29
1532,-0.79
1533,-0.29
1534,0.23
1535,0.72
1536,1.15
1537,1.43
1538,1.57
1539,1.58
1540,1.51
1541,1.37
1542,1.24
1543,1.09
1544,0.97
1545,0.89
1546,0.85
1547,0.88
1548,0.95
1549,1.01
1550,1.00
1551,0.93
1552,0.82
1553,0.69
1554,0.53
1555,0.36
1556,0.21
1557,0.12
1558,0.11
1559,0.18
1560,0.31
1561,0.49
1562,0.66
1563,0.76
1564,0.77
1565,0.72
1566,0.63
1567,0.55
1568,0.47
1569,0.43
1570,0.46
1571,0.54
1572,0.63
1573,0.69
1574,0.63
1575,0.46
1576,0.13
1577,-0.28
1578,-0.75
1579,-1.19
1580,-1.60
1581,-1.97
1582,-2.33
1583,-2.71
1584,-3.12
1585,-3.56
1586,-4.00
1587,-4.39
1588,-4.68
1589,-4.84
1590,-4.83
1591,-4.67
1592,-4.41
1593,-4.13
1594,-3.85
1595,-3.65
1596,-3.49
1597,-3.36
1598,-3.15
1599,-2.85
1600,-2.40
1601,-1.85
1602,-1.16
1603,-0.42
1604,0.39
1605,1.17
1606,1.98
1607,2.75
1608,3.49
1609,4.12
1610,4.74
1611,5.29
1612,5.88
1613,6.40
1614,6.89
1615,7.32
1616,7.77
1617,8.19
1618,8.59
1619,8.87
1620,9.03
1621,9.04
1622,8.91
1623,8.66
1624,8.31
1625,7.90
1626,7.47
1627,7.05
1628,6.70
1629,6.46
1630,6.30
1631,6.22
1632,6.14
1633,6.10
1634,6.02
1635,5.95
1636,5.85
1637,5.74
1638,5.58
1639,5.41
1640,5.20
1641,4.99
1642,4.78
1643,4.56
1644,4.30
1645,4.04
1646,3.75
1647,3.48
1648,3.15
1649,2.80
1650,2.43
1651,2.10
1652,1.75
1653,1.42
1654,1.04
1655,0.67
1656,0.27
1657,-0.11
1658,-0.53
1659,-0.89
1660,-1.26
1661,-1.58
1662,-1.93
1663,-2.26
1664,-2.66
1665,-3.11
1666,-3.67
1667,-4.27
1668,-4.96
1669,-5.69
1670,-6.49
1671,-7.24
1672,-7.90
1673,-8.41
1674,-8.83
1675,-9.13
1676,-9.32
1677,-9.37
1678,-9.31
1679,-9.18
1680,-9.00
1681,-8.76
1682,-8.46
1683,-8.13
1684,-7.76
1685,-7.35
1686,-6.92
1687,-6.47
1688,-6.02
1689,-5.62
1690,-5.26
1691,-4.99
1692,-4.81
1693,-4.78
1694,-4.84
1695,-5.02
1696,-5.24
1697,-5.49
1698,-5.68
1699,-5.78
1700,-5.70
1701,-5.49
1702,-5.15
1703,-4.77
1704,-4.37
1705,-4.02
1706,-3.72
1707,-3.51
1708,-3.34
1709,-3.20
1710,-3.00
1711,-2.75
1712,-2.41
1713,-2.03
1714,-1.60
1715,-1.17
1716,-0.75
1717,-0.35
1718,0.02
1719,0.30
1720,0.46
1721,0.47
1722,0.39
1723,0.26
1724,0.14
1725,0.03
1726,-0.02
1727,0.02
1728,0.16
1729,0.34
1730,0.50
1731,0.58
1732,0.57
1733,0.47
1734,0.27
1735,0.03
1736,-0.18
1737,-0.26
1738,-0.20
1739,0.02
1740,0.34
1741,0.77
1742,1.20
1743,1.57
1744,1.78
1745,1.79
1746,1.56
1747,1.09
1748,0.37
1749,-0.52
1750,-1.54
1751,-2.56
1752,-3.53
1753,-4.30
1754,-4.85
1755,-5.17
1756,-5.39
1757,-5.55
1758,-5.75
1759,-6.04
1760,-6.49
1761,-7.02
1762,-7.59
1763,-8.09
1764,-8.51
1765,-8.77
1766,-8.90
1767,-8.87
1768,-8.78
1769,-8.74
1770,-8.78
1771,-8.93
1772,-9.12
1773,-9.33
1774,-9.50
1775,-9.57
1776,-9.53
1777,-9.35
1778,-9.06
1779,-8.72
1780,-8.35
1781,-7.97
1782,-7.59
1783,-7.24
1784,-6.90
1785,-6.59
1786,-6.28
1787,-6.04
1788,-5.91
1789,-5.91
1790,-5.93
1791,-5.99
1792,-6.01
1793,-6.03
1794,-5.95
1795,-5.76
1796,-5.40
1797,-4.94
1798,-4.36
1799,-3.72
1800,-3.02
1801,-2.31
1802,-1.62
1803,-1.01
1804,-0.54
1805,-0.27
1806,-0.18
1807,-0.30
1808,-0.51
1809,-0.79
1810,-1.04
1811,-1.22
1812,-1.28
1813,-1.21
1814,-1.00
1815,-0.70
1816,-0.35
1817,-0.01
1818,0.30
1819,0.53
1820,0.71
1821,0.85
1822,0.98
1823,1.11
1824,1.27
1825,1.43
1826,1.59
1827,1.71
1828,1.75
1829,1.69
1830,1.54
1831,1.34
1832,1.09
1833,0.84
1834,0.59
1835,0.37
1836,0.18
1837,0.03
1838,-0.12
1839,-0.31
1840,-0.61
1841,-0.98
1842,-1.42
1843,-1.85
1844,-2.30
1845,-2.72
1846,-3.07
1847,-3.28
1848,-3.36
1849,-3.36
1850,-3.35
1851,-3.34
1852,-3.33
1853,-3.27
1854,-3.17
1855,-2.98
1856,-2.70
1857,-2.30
1858,-1.82
1859,-1.31
1860,-0.86
1861,-0.50
1862,-0.25
1863,-0.14
1864,-0.15
1865,-0.29
1866,-0.51
1867,-0.79
1868,-1.12
1869,-1.50
1870,-1.94
1871,-2.43
1872,-2.91
1873,-3.33
1874,-3.65
1875,-3.88
1876,-3.98
1877,-3.97
1878,-3.81
1879,-3.54
1880,-3.23
1881,-2.98
1882,-2.78
1883,-2.61
1884,-2.40
1885,-2.17
1886,-1.91
1887,-1.61
1888,-1.21
1889,-0.76
1890,-0.24
1891,0.26
1892,0.76
1893,1.27
1894,1.81
1895,2.32
1896,2.83
1897,3.27
1898,3.68
1899,4.03
1900,4.37
1901,4.68
1902,4.99
1903,5.26
1904,5.52
1905,5.77
1906,6.03
1907,6.26
1908,6.48
1909,6.64
1910,6.82
1911,7.01
1912,7.25
1913,7.50
1914,7.81
1915,8.19
1916,8.65
1917,9.16
1918,9.70
1919,10.18
1920,10.57
1921,10.81
1922,10.87
1923,10.73
1924,10.40
1925,9.90
1926,9.26
1927,8.58
1928,7.95
1929,7.47
1930,7.16
1931,7.05
1932,7.10
1933,7.29
1934,7.45
1935,7.57
1936,7.54
1937,7.42
1938,7.15
1939,6.76
1940,6.21
1941,5.61
1942,4.95
1943,4.33
1944,3.65
1945,2.99
1946,2.34
1947,1.79
1948,1.30
1949,0.92
1950,0.59
1951,0.32
1952,0.03
1953,-0.28
1954,-0.72
1955,-1.23
1956,-1.82
1957,-2.42
1958,-2.98
1959,-3.42
1960,-3.71
1961,-3.82
1962,-3.81
1963,-3.68
1964,-3.47
1965,-3.23
1966,-3.00
1967,-2.80
1968,-2.62
1969,-2.46
1970,-2.32
1971,-2.20
1972,-2.08
1973,-1.92
1974,-1.72
1975,-1.48
1976,-1.22
1977,-0.98
1978,-0.78
1979,-0.63
1980,-0.59
1981,-0.66
1982,-0.88
1983,-1.17
1984,-1.53
1985,-1.87
1986,-2.18
1987,-2.46
1988,-2.70
1989,-2.92
1990,-3.12
1991,-3.30
1992,-3.46
1993,-3.59
1994,-3.64
1995,-3.61
1996,-3.45
1997,-3.19
1998,-2.85
1999,-2.47
2000,-2.05
2001,-1.65
2002,-1.24
2003,-0.87
2004,-0.49
2005,-0.14
2006,0.18
2007,0.45
2008,0.72
2009,0.99
2010,1.29
2011,1.60
2012,1.98
2013,2.41
2014,2.91
2015,3.41
2016,3.87
2017,4.25
2018,4.53
2019,4.68
2020,4.62
2021,4.34
2022,3.86
2023,3.23
2024,2.51
2025,1.75
2026,1.04
2027,0.44
2028,-0.03
2029,-0.32
2030,-0.44
2031,-0.38
2032,-0.27
2033,-0.19
2034,-0.29
2035,-0.56
2036,-1.01
2037,-1.56
2038,-2.22
2039,-2.85
2040,-3.38
2041,-3.69
2042,-3.82
2043,-3.81
2044,-3.73
2045,-3.66
2046,-3.69
2047,-3.80
2048,-3.98
2049,-4.18
2050,-4.39
2051,-4.52
2052,-4.58
2053,-4.55
2054,-4.51
2055,-4.52
2056,-4.64
2057,-4.87
2058,-5.23
2059,-5.64
2060,-6.11
2061,-6.55
2062,-6.94
2063,-7.24
2064,-7.52
2065,-7.80
2066,-8.09
2067,-8.36
2068,-8.62
2069,-8.84
2070,-9.04
2071,-9.18
2072,-9.22
2073,-9.17
2074,-9.02
2075,-8.78
2076,-8.42
2077,-8.00
2078,-7.50
2079,-6.97
2080,-6.36
2081,-5.74
2082,-5.08
2083,-4.45
2084,-3.78
2085,-3.15
2086,-2.51
2087,-1.92
2088,-1.32
2089,-0.76
2090,-0.23
2091,0.21
2092,0.60
2093,0.92
2094,1.22
2095,1.47
2096,1.69
2097,1.85
2098,1.92
2099,1.91
2100,1.80
2101,1.59
2102,1.21
2103,0.72
2104,0.15
2105,-0.43
2106,-1.03
2107,-1.61
2108,-2.19
2109,-2.72
2110,-3.25
2111,-3.72
2112,-4.14
2113,-4.49
2114,-4.81
2115,-5.04
2116,-5.17
2117,-5.19
2118,-5.16
2119,-5.07
2120,-4.92
2121,-4.71
2122,-4.52
2123,-4.36
2124,-4.29
2125,-4.29
2126,-4.40
2127,-4.65
2128,-5.06
2129,-5.55
2130,-6.13
2131,-6.72
2132,-7.31
2133,-7.82
2134,-8.27
2135,-8.59
2136,-8.84
2137,-9.03
2138,-9.25
2139,-9.49
2140,-9.78
2141,-10.06
2142,-10.35
2143,-10.64
2144,-10.93
2145,-11.20
2146,-11.51
2147,-11.83
2148,-12.21
2149,-12.62
2150,-13.10
2151,-13.61
2152,-14.18
2153,-14.73
2154,-15.25
2155,-15.68
2156,-16.07
2157,-16.40
2158,-16.70
2159,-16.98
2160,-17.26
2161,-17.56
2162,-17.85
2163,-18.05
2164,-18.12
2165,-18.03
2166,-17.76
2167,-17.34
2168,-16.76
2169,-16.07
2170,-15.30
2171,-14.56
2172,-13.85
2173,-13.26
2174,-12.73
2175,-12.28
2176,-11.84
2177,-11.44
2178,-11.04
2179,-10.69
2180,-10.33
2181,-10.02
2182,-9.69
2183,-9.42
2184,-9.15
2185,-8.91
2186,-8.65
2187,-8.41
2188,-8.09
2189,-7.77
2190,-7.39
2191,-7.00
2192,-6.55
2193,-6.11
2194,-5.65
2195,-5.23
2196,-4.84
2197,-4.50
2198,-4.17
2199,-3.88
2200,-3.59
2201,-3.34
2202,-3.10
2203,-2.89
2204,-2.66
2205,-2.43
2206,-2.20
2207,-1.98
2208,-1.75
2209,-1.53
2210,-1.36
2211,-1.29
2212,-1.28
2213,-1.31
2214,-1.31
2215,-1.26
2216,-1.11
2217,-0.86
2218,-0.47
2219,0.00
2220,0.54
2221,1.04
2222,1.46
2223,1.75
2224,1.95
2225,2.08
2226,2.20
2227,2.33
2228,2.51
2229,2.69
2230,2.87
2231,2.97
2232,2.95
2233,2.81
2234,2.59
2235,2.33
2236,2.11
2237,1.96
2238,1.87
2239,1.83
2240,1.82
2241,1.75
2242,1.61
2243,1.38
2244,1.07
2245,0.73
2246,0.37
2247,0.05
2248,-0.19
2249,-0.33
2250,-0.40
2251,-0.47
2252,-0.58
2253,-0.74
2254,-0.95
2255,-1.17
2256,-1.37
2257,-1.44
2258,-1.39
2259,-1.17
2260,-0.79
2261,-0.31
2262,0.22
2263,0.69
2264,1.01
2265,1.13
2266,1.04
2267,0.75
2268,0.31
2269,-0.19
2270,-0.66
2271,-1.03
2272,-1.24
2273,-1.32
2274,-1.30
2275,-1.21
2276,-1.11
2277,-1.02
2278,-1.00
2279,-1.04
2280,-1.14
2281,-1.24
2282,-1.30
2283,-1.32
2284,-1.32
2285,-1.34
2286,-1.39
2287,-1.45
2288,-1.50
2289,-1.55
2290,-1.56
2291,-1.51
2292,-1.31
2293,-0.98
2294,-0.53
2295,-0.07
2296,0.38
2297,0.78
2298,1.11
2299,1.32
2300,1.42
2301,1.43
2302,1.43
2303,1.44
2304,1.49
2305,1.49
2306,1.42
2307,1.31
2308,1.24
2309,1.26
2310,1.37
2311,1.56
2312,1.80
2313,2.11
2314,2.39
2315,2.59
2316,2.60
2317,2.37
2318,1.85
2319,1.11
2320,0.22
2321,-0.70
2322,-1.61
2323,-2.40
2324,-3.04
2325,-3.51
2326,-3.89
2327,-4.21
2328,-4.52
2329,-4.78
2330,-5.00
2331,-5.15
2332,-5.26
2333,-5.27
2334,-5.20
2335,-5.02
2336,-4.75
2337,-4.45
2338,-4.14
2339,-3.91
2340,-3.75
2341,-3.68
2342,-3.64
2343,-3.59
2344,-3.49
2345,-3.33
2346,-3.08
2347,-2.75
2348,-2.33
2349,-1.91
2350,-1.54
2351,-1.28
2352,-1.14
2353,-1.15
2354,-1.28
2355,-1.49
2356,-1.69
2357,-1.84
2358,-1.89
2359,-1.85
2360,-1.72
2361,-1.53
2362,-1.27
2363,-1.01
2364,-0.76
2365,-0.55
2366,-0.37
2367,-0.24
2368,-0.08
2369,0.08
2370,0.29
2371,0.53
2372,0.91
2373,1.39
2374,2.03
2375,2.78
2376,3.65
2377,4.52
2378,5.35
2379,6.02
2380,6.56
2381,6.92
2382,7.16
2383,7.26
2384,7.33
2385,7.37
2386,7.45
2387,7.56
2388,7.76
2389,7.97
2390,8.19
2391,8.38
2392,8.59
2393,8.80
2394,9.01
2395,9.14
2396,9.14
2397,9.00
2398,8.72
2399,8.35
2400,7.98
2401,7.66
2402,7.42
2403,7.30
2404,7.29
2405,7.36
2406,7.43
2407,7.44
2408,7.35
2409,7.22
2410,7.05
2411,6.91
2412,6.81
2413,6.77
2414,6.79
2415,6.82
2416,6.79
2417,6.67
2418,6.39
2419,6.00
2420,5.48
2421,4.95
2422,4.40
2423,3.89
2424,3.38
2425,2.88
2426,2.34
2427,1.79
2428,1.19
2429,0.58
2430,-0.04
2431,-0.56
2432,-1.01
2433,-1.32
2434,-1.53
2435,-1.63
2436,-1.72
2437,-1.83
2438,-2.02
2439,-2.24
2440,-2.46
2441,-2.64
2442,-2.76
2443,-2.78
2444,-2.67
2445,-2.40
2446,-2.02
2447,-1.61
2448,-1.28
2449,-1.08
2450,-1.01
2451,-1.03
2452,-1.15
2453,-1.33
2454,-1.52
2455,-1.64
2456,-1.68
2457,-1.65
2458,-1.62
2459,-1.61
2460,-1.66
2461,-1.78
2462,-1.98
2463,-2.24
2464,-2.50
2465,-2.71
2466,-2.85
2467,-2.88
2468,-2.83
2469,-2.77
2470,-2.76
2471,-2.88
2472,-3.11
2473,-3.42
2474,-3.75
2475,-4.06
2476,-4.26
2477,-4.30
2478,-4.07
2479,-3.62
2480,-2.95
2481,-2.20
2482,-1.40
2483,-0.66
2484,-0.02
2485,0.44
2486,0.74
2487,0.89
2488,1.01
2489,1.14
2490,1.40
2491,1.74
2492,2.26
2493,2.88
2494,3.59
2495,4.27
2496,4.91
2497,5.42
2498,5.78
2499,5.97
2500,6.07
2501,6.07
2502,6.03
2503,5.94
2504,5.80
2505,5.64
2506,5.45
2507,5.19
2508,4.85
2509,4.43
2510,3.94
2511,3.43
2512,2.92
2513,2.46
2514,2.04
2515,1.71
2516,1.47
2517,1.37
2518,1.30
2519,1.27
2520,1.24
2521,1.23
2522,1.21
2523,1.17
2524,1.09
2525,0.98
2526,0.82
2527,0.61
2528,0.31
2529,-0.03
2530,-0.34
2531,-0.58
2532,-0.79
2533,-0.95
2534,-1.11
2535,-1.21
2536,-1.37
2537,-1.59
2538,-1.95
2539,-2.37
2540,-2.81
2541,-3.23
2542,-3.62
2543,-3.95
2544,-4.20
2545,-4.36
2546,-4.49
2547,-4.62
2548,-4.75
2549,-4.88
2550,-5.00
2551,-5.07
2552,-5.08
2553,-5.01
2554,-4.84
2555,-4.62
2556,-4.28
2557,-3.85
2558,-3.29
2559,-2.66
2560,-1.96
2561,-1.25
2562,-0.52
2563,0.18
2564,0.82
2565,1.34
2566,1.79
2567,2.15
2568,2.53
2569,2.90
2570,3.28
2571,3.62
2572,4.01
2573,4.38
2574,4.75
2575,5.02
2576,5.20
2577,5.27
2578,5.27
2579,5.20
2580,5.07
2581,4.90
2582,4.71
2583,4.53
2584,4.33
2585,4.14
2586,3.96
2587,3.78
2588,3.56
2589,3.30
2590,3.04
2591,2.80
2592,2.57
2593,2.38
2594,2.23
2595,2.15
2596,2.11
2597,2.11
2598,2.09
2599,2.08
2600,2.03
2601,1.98
2602,1.89
2603,1.80
2604,1.66
2605,1.52
2606,1.32
2607,1.07
2608,0.71
2609,0.28
2610,-0.20
2611,-0.66
2612,-1.10
2613,-1.47
2614,-1.75
2615,-1.91
2616,-1.99
2617,-2.04
2618,-2.11
2619,-2.20
2620,-2.35
2621,-2.54
2622,-2.81
2623,-3.09
2624,-3.43
2625,-3.75
2626,-4.11
2627,-4.46
2628,-4.84
2629,-5.23
2630,-5.68
2631,-6.19
2632,-6.77
2633,-7.34
2634,-7.90
2635,-8.40
2636,-8.83
2637,-9.16
2638,-9.40
2639,-9.51
2640,-9.54
2641,-9.51
2642,-9.48
2643,-9.44
2644,-9.40
2645,-9.36
2646,-9.30
2647,-9.19
2648,-8.98
2649,-8.68
2650,-8.30
2651,-7.90
2652,-7.51
2653,-7.17
2654,-6.91
2655,-6.75
2656,-6.69
2657,-6.70
2658,-6.71
2659,-6.71
2660,-6.61
2661,-6.44
2662,-6.17
2663,-5.88
2664,-5.57
2665,-5.32
2666,-5.10
2667,-5.00
2668,-4.95
2669,-4.95
2670,-4.88
2671,-4.71
2672,-4.39
2673,-3.97
2674,-3.40
2675,-2.78
2676,-2.08
2677,-1.41
2678,-0.76
2679,-0.21
2680,0.28
2681,0.70
2682,1.11
2683,1.49
2684,1.85
2685,2.14
2686,2.35
2687,2.42
2688,2.38
2689,2.17
2690,1.82
2691,1.34
2692,0.88
2693,0.48
2694,0.25
2695,0.25
2696,0.53
2697,1.09
2698,1.85
2699,2.69
2700,3.47
2701,4.07
2702,4.41
2703,4.45
2704,4.23
2705,3.83
2706,3.36
2707,2.91
2708,2.59
2709,2.43
2710,2.42
2711,2.49
2712,2.57
2713,2.60
2714,2.51
2715,2.31
2716,2.02
2717,1.71
2718,1.38
2719,1.09
2720,0.81
2721,0.56
2722,0.29
2723,0.00
2724,-0.37
2725,-0.80
2726,-1.30
2727,-1.80
2728,-2.26
2729,-2.66
2730,-3.01
2731,-3.28
2732,-3.48
2733,-3.58
2734,-3.58
2735,-3.50
2736,-3.34
2737,-3.07
2738,-2.71
2739,-2.28
2740,-1.88
2741,-1.53
2742,-1.25
2743,-1.08
2744,-1.03
2745,-1.12
2746,-1.34
2747,-1.66
2748,-2.10
2749,-2.59
2750,-3.10
2751,-3.55
2752,-3.91
2753,-4.19
2754,-4.36
2755,-4.45
2756,-4.47
2757,-4.46
2758,-4.44
2759,-4.45
2760,-4.49
2761,-4.60
2762,-4.71
2763,-4.76
2764,-4.67
2765,-4.44
2766,-4.04
2767,-3.50
2768,-2.84
2769,-2.13
2770,-1.39
2771,-0.70
2772,-0.04
2773,0.56
2774,1.16
2775,1.70
2776,2.24
2777,2.70
2778,3.15
2779,3.53
2780,3.91
2781,4.23
2782,4.59
2783,4.93
2784,5.29
2785,5.61
2786,5.87
2787,6.05
2788,6.13
2789,6.10
2790,5.94
2791,5.71
2792,5.49
2793,5.35
2794,5.30
2795,5.35
2796,5.43
2797,5.50
2798,5.48
2799,5.33
2800,5.01
2801,4.55
2802,3.97
2803,3.36
2804,2.75
2805,2.24
2806,1.79
2807,1.38
2808,0.97
2809,0.56
2810,0.11
2811,-0.37
2812,-0.94
2813,-1.45
2814,-1.85
2815,-2.08
2816,-2.15
2817,-2.10
2818,-1.92
2819,-1.65
2820,-1.34
2821,-1.05
2822,-0.79
2823,-0.56
2824,-0.34
2825,-0.14
2826,0.05
2827,0.25
2828,0.44
2829,0.59
2830,0.66
2831,0.66
2832,0.58
2833,0.42
2834,0.21
2835,-0.02
2836,-0.23
2837,-0.39
2838,-0.47
2839,-0.49
2840,-0.47
2841,-0.46
2842,-0.42
2843,-0.37
2844,-0.30
2845,-0.23
2846,-0.12
2847,0.03
2848,0.27
2849,0.56
2850,0.92
2851,1.30
2852,1.79
2853,2.35
2854,3.04
2855,3.83
2856,4.75
2857,5.71
2858,6.72
2859,7.68
2860,8.55
2861,9.28
2862,9.89
2863,10.32
2864,10.65
2865,10.84
2866,10.96
2867,10.96
2868,10.91
2869,10.77
2870,10.64
2871,10.54
2872,10.49
2873,10.50
2874,10.60
2875,10.78
2876,11.05
2877,11.32
2878,11.54
2879,11.69
2880,11.79
2881,11.86
2882,11.90
2883,11.89
2884,11.82
2885,11.73
2886,11.55
2887,11.28
2888,10.89
2889,10.43
2890,9.94
2891,9.53
2892,9.22
2893,9.06
2894,9.03
2895,9.06
2896,9.06
2897,8.98
2898,8.74
2899,8.42
2900,7.98
2901,7.55
2902,7.12
2903,6.76
2904,6.40
2905,6.04
2906,5.57
2907,4.98
2908,4.25
2909,3.46
2910,2.63
2911,1.86
2912,1.15
2913,0.65
2914,0.36
2915,0.29
2916,0.32
2917,0.42
2918,0.53
2919,0.63
2920,0.63
2921,0.48
2922,0.18
2923,-0.20
2924,-0.61
2925,-0.97
2926,-1.24
2927,-1.36
2928,-1.32
2929,-1.16
2930,-0.91
2931,-0.62
2932,-0.37
2933,-0.18
2934,-0.10
2935,-0.08
2936,-0.07
2937,-0.04
2938,0.03
2939,0.11
2940,0.21
2941,0.28
2942,0.31
2943,0.30
2944,0.26
2945,0.23
2946,0.24
2947,0.33
2948,0.49
2949,0.66
2950,0.81
2951,0.87
2952,0.85
2953,0.77
2954,0.63
2955,0.43
2956,0.27
2957,0.18
2958,0.22
2959,0.41
2960,0.79
2961,1.26
2962,1.81
2963,2.32
2964,2.78
2965,3.13
2966,3.42
2967,3.62
2968,3.81
2969,4.02
2970,4.33
2971,4.75
2972,5.34
2973,6.06
2974,6.87
2975,7.68
2976,8.38
2977,8.87
2978,9.07
2979,8.97
2980,8.58
2981,7.96
2982,7.18
2983,6.36
2984,5.55
2985,4.86
2986,4.30
2987,3.88
2988,3.47
2989,3.07
2990,2.63
2991,2.20
2992,1.72
2993,1.25
2994,0.80
2995,0.45
2996,0.16
2997,-0.02
2998,-0.13
2999,-0.12
3000,-0.05
3001,0.08
3002,0.22
3003,0.39
3004,0.54
3005,0.66
3006,0.65
3007,0.53
3008,0.33
3009,0.10
3010,-0.11
3011,-0.27
3012,-0.34
3013,-0.34
3014,-0.30
3015,-0.24
3016,-0.24
3017,-0.31
3018,-0.53
3019,-0.84
3020,-1.23
3021,-1.63
3022,-2.03
3023,-2.37
3024,-2.62
3025,-2.78
3026,-2.85
3027,-2.85
3028,-2.79
3029,-2.72
3030,-2.64
3031,-2.56
3032,-2.46
3033,-2.35
3034,-2.22
3035,-2.05
3036,-1.73
3037,-1.25
3038,-0.58
3039,0.20
3040,1.08
3041,1.95
3042,2.76
3043,3.40
3044,3.85
3045,4.09
3046,4.20
3047,4.26
3048,4.41
3049,4.63
3050,4.97
3051,5.36
3052,5.84
3053,6.32
3054,6.82
3055,7.26
3056,7.66
3057,8.03
3058,8.38
3059,8.69
3060,8.98
3061,9.22
3062,9.40
3063,9.45
3064,9.39
3065,9.23
3066,9.01
3067,8.74
3068,8.44
3069,8.10
3070,7.75
3071,7.42
3072,7.09
3073,6.77
3074,6.47
3075,6.19
3076,5.94
3077,5.81
3078,5.79
3079,5.93
3080,6.13
3081,6.39
3082,6.61
3083,6.74
3084,6.68
3085,6.46
3086,6.04
3087,5.48
3088,4.79
3089,4.12
3090,3.53
3091,3.14
3092,2.89
3093,2.78
3094,2.69
3095,2.57
3096,2.29
3097,1.87
3098,1.26
3099,0.57
3100,-0.21
3101,-0.97
3102,-1.71
3103,-2.30
3104,-2.84
3105,-3.28
3106,-3.72
3107,-4.14
3108,-4.61
3109,-5.11
3110,-5.72
3111,-6.36
3112,-6.97
3113,-7.51
3114,-7.98
3115,-8.35
3116,-8.61
3117,-8.75
3118,-8.80
3119,-8.81
3120,-8.82
3121,-8.84
3122,-8.87
3123,-8.90
3124,-8.89
3125,-8.83
3126,-8.72
3127,-8.56
3128,-8.33
3129,-8.06
3130,-7.74
3131,-7.40
3132,-7.06
3133,-6.73
3134,-6.37
3135,-6.00
3136,-5.58
3137,-5.15
3138,-4.71
3139,-4.32
3140,-3.94
3141,-3.68
3142,-3.50
3143,-3.42
3144,-3.32
3145,-3.20
3146,-3.01
3147,-2.77
3148,-2.44
3149,-2.05
3150,-1.60
3151,-1.15
3152,-0.68
3153,-0.25
3154,0.15
3155,0.50
3156,0.84
3157,1.14
3158,1.46
3159,1.71
3160,1.91
3161,2.04
3162,2.16
3163,2.25
3164,2.34
3165,2.39
3166,2.43
3167,2.46
3168,2.55
3169,2.68
3170,2.84
3171,2.98
3172,3.10
3173,3.15
3174,3.14
3175,3.08
3176,3.02
3177,3.01
3178,3.07
3179,3.20
3180,3.40
3181,3.66
3182,3.94
3183,4.14
3184,4.23
3185,4.17
3186,3.97
3187,3.69
3188,3.35
3189,3.01
3190,2.71
3191,2.46
3192,2.20
3193,1.89
3194,1.50
3195,1.07
3196,0.57
3197,0.07
3198,-0.50
3199,-1.05
3200,-1.56
3201,-1.99
3202,-2.40
3203,-2.71
3204,-2.99
3205,-3.20
3206,-3.42
3207,-3.63
3208,-3.92
3209,-4.25
3210,-4.67
3211,-5.14
3212,-5.66
3213,-6.16
3214,-6.63
3215,-7.03
3216,-7.32
3217,-7.45
3218,-7.44
3219,-7.33
3220,-7.21
3221,-7.09
3222,-6.96
3223,-6.82
3224,-6.70
3225,-6.58
3226,-6.41
3227,-6.18
3228,-5.89
3229,-5.63
3230,-5.41
3231,-5.28
3232,-5.22
3233,-5.21
3234,-5.20
3235,-5.17
3236,-5.07
3237,-4.88
3238,-4.55
3239,-4.16
3240,-3.72
3241,-3.35
3242,-3.03
3243,-2.78
3244,-2.56
3245,-2.40
3246,-2.23
3247,-2.04
3248,-1.75
3249,-1.37
3250,-0.84
3251,-0.27
3252,0.34
3253,0.90
3254,1.46
3255,1.95
3256,2.37
3257,2.66
3258,2.89
3259,3.14
3260,3.49
3261,3.96
3262,4.55
3263,5.20
3264,5.84
3265,6.35
3266,6.56
3267,6.41
3268,5.91
3269,5.16
3270,4.23
3271,3.29
3272,2.50
3273,2.04
3274,1.90
3275,2.08
3276,2.40
3277,2.75
3278,2.89
3279,2.78
3280,2.30
3281,1.55
3282,0.53
3283,-0.60
3284,-1.78
3285,-2.86
3286,-3.87
3287,-4.72
3288,-5.49
3289,-6.14
3290,-6.73
3291,-7.21
3292,-7.62
3293,-7.93
3294,-8.19
3295,-8.30
3296,-8.26
3297,-8.08
3298,-7.83
3299,-7.55
3300,-7.29
3301,-7.03
3302,-6.81
3303,-6.65
3304,-6.52
3305,-6.42
3306,-6.29
3307,-6.13
3308,-5.91
3309,-5.65
3310,-5.39
3311,-5.23
3312,-5.11
3313,-5.05
3314,-5.04
3315,-5.08
3316,-5.17
3317,-5.20
3318,-5.15
3319,-5.04
3320,-4.93
3321,-4.87
3322,-4.81
3323,-4.76
3324,-4.74
3325,-4.77
3326,-4.75
3327,-4.65
3328,-4.38
3329,-3.97
3330,-3.40
3331,-2.69
3332,-1.83
3333,-0.94
3334,-0.05
3335,0.69
3336,1.31
3337,1.74
3338,2.01
3339,2.13
3340,2.15
3341,2.08
3342,2.04
3343,2.02
3344,2.14
3345,2.34
3346,2.65
3347,2.98
3348,3.36
3349,3.71
3350,4.04
3351,4.31
3352,4.57
3353,4.79
3354,5.02
3355,5.23
3356,5.47
3357,5.71
3358,5.93
3359,6.09
3360,6.20
3361,6.29
3362,6.42
3363,6.55
3364,6.65
3365,6.67
3366,6.55
3367,6.29
3368,5.85
3369,5.29
3370,4.62
3371,4.01
3372,3.45
3373,3.04
3374,2.76
3375,2.62
3376,2.52
3377,2.38
3378,2.07
3379,1.61
3380,0.98
3381,0.29
3382,-0.47
3383,-1.16
3384,-1.75
3385,-2.12
3386,-2.39
3387,-2.59
3388,-2.85
3389,-3.16
3390,-3.62
3391,-4.20
3392,-5.00
3393,-5.91
3394,-6.87
3395,-7.77
3396,-8.57
3397,-9.16
3398,-9.52
3399,-9.62
3400,-9.50
3401,-9.20
3402,-8.81
3403,-8.38
3404,-8.01
3405,-7.69
3406,-7.41
3407,-7.16
3408,-6.93
3409,-6.71
3410,-6.46
3411,-6.20
3412,-5.88
3413,-5.57
3414,-5.23
3415,-4.88
3416,-4.49
3417,-4.12
3418,-3.75
3419,-3.41
3420,-3.12
3421,-2.92
3422,-2.82
3423,-2.85
3424,-2.96
3425,-3.08
3426,-3.17
3427,-3.23
3428,-3.31
3429,-3.38
3430,-3.43
3431,-3.52
3432,-3.68
3433,-3.90
3434,-4.08
3435,-4.16
3436,-4.10
3437,-3.94
3438,-3.65
3439,-3.23
3440,-2.72
3441,-2.20
3442,-1.70
3443,-1.26
3444,-0.90
3445,-0.63
3446,-0.42
3447,-0.31
3448,-0.28
3449,-0.37
3450,-0.53
3451,-0.76
3452,-1.08
3453,-1.44
3454,-1.79
3455,-2.04
3456,-2.22
3457,-2.33
3458,-2.44
3459,-2.53
3460,-2.63
3461,-2.77
3462,-2.99
3463,-3.26
3464,-3.55
3465,-3.82
3466,-4.14
3467,-4.51
3468,-4.93
3469,-5.35
3470,-5.77
3471,-6.16
3472,-6.54
3473,-6.84
3474,-7.04
3475,-7.16
3476,-7.23
3477,-7.22
3478,-7.13
3479,-6.95
3480,-6.73
3481,-6.48
3482,-6.20
3483,-5.91
3484,-5.63
3485,-5.39
3486,-5.17
3487,-4.97
3488,-4.83
3489,-4.75
3490,-4.69
3491,-4.62
3492,-4.49
3493,-4.31
3494,-4.08
3495,-3.85
3496,-3.62
3497,-3.44
3498,-3.31
3499,-3.23
3500,-3.22
3501,-3.26
3502,-3.34
3503,-3.46
3504,-3.62
3505,-3.87
3506,-4.18
3507,-4.57
3508,-4.97
3509,-5.36
3510,-5.68
3511,-5.91
3512,-5.97
3513,-5.83
3514,-5.43
3515,-4.84
3516,-4.04
3517,-3.14
3518,-2.11
3519,-1.11
3520,-0.11
3521,0.75
3522,1.50
3523,2.08
3524,2.57
3525,2.98
3526,3.46
3527,3.97
3528,4.59
3529,5.23
3530,5.87
3531,6.42
3532,6.87
3533,7.16
3534,7.32
3535,7.32
3536,7.25
3537,7.15
3538,7.07
3539,7.03
3540,7.00
3541,6.99
3542,6.99
3543,6.94
3544,6.79
3545,6.57
3546,6.29
3547,5.99
3548,5.61
3549,5.17
3550,4.67
3551,4.17
3552,3.63
3553,3.11
3554,2.62
3555,2.24
3556,1.95
3557,1.76
3558,1.66
3559,1.68
3560,1.70
3561,1.72
3562,1.67
3563,1.61
3564,1.55
3565,1.53
3566,1.49
3567,1.43
3568,1.30
3569,1.12
3570,0.83
3571,0.42
3572,-0.14
3573,-0.80
3574,-1.48
3575,-2.08
3576,-2.59
3577,-2.98
3578,-3.27
3579,-3.45
3580,-3.64
3581,-3.85
3582,-4.19
3583,-4.58
3584,-5.04
3585,-5.51
3586,-6.02
3587,-6.51
3588,-6.98
3589,-7.37
3590,-7.71
3591,-8.02
3592,-8.35
3593,-8.66
3594,-8.96
3595,-9.18
3596,-9.30
3597,-9.32
3598,-9.25
3599,-9.11
3600,-8.90
3601,-8.64
3602,-8.37
3603,-8.16
3604,-7.97
3605,-7.80
3606,-7.61
3607,-7.39
3608,-7.12
3609,-6.81
3610,-6.45
3611,-6.07
3612,-5.62
3613,-5.17
3614,-4.70
3615,-4.31
3616,-3.97
3617,-3.68
3618,-3.37
3619,-3.05
3620,-2.67
3621,-2.26
3622,-1.77
3623,-1.26
3624,-0.73
3625,-0.31
3626,0.02
3627,0.24
3628,0.38
3629,0.44
3630,0.47
3631,0.50
3632,0.64
3633,0.86
3634,1.17
3635,1.50
3636,1.85
3637,2.18
3638,2.45
3639,2.61
3640,2.70
3641,2.75
3642,2.77
3643,2.75
3644,2.72
3645,2.66
3646,2.62
3647,2.56
3648,2.50
3649,2.41
3650,2.31
3651,2.21
3652,2.14
3653,2.10
3654,2.09
3655,2.11
3656,2.17
3657,2.28
3658,2.49
3659,2.77
3660,3.07
3661,3.34
3662,3.51
3663,3.53
3664,3.39
3665,3.09
3666,2.67
3667,2.20
3668,1.75
3669,1.40
3670,1.16
3671,1.01
3672,0.86
3673,0.66
3674,0.34
3675,-0.08
3676,-0.58
3677,-1.05
3678,-1.48
3679,-1.79
3680,-2.03
3681,-2.20
3682,-2.34
3683,-2.47
3684,-2.64
3685,-2.82
3686,-2.98
3687,-3.11
3688,-3.18
3689,-3.21
3690,-3.23
3691,-3.26
3692,-3.37
3693,-3.58
3694,-3.83
3695,-4.06
3696,-4.18
3697,-4.17
3698,-4.00
3699,-3.72
3700,-3.35
3701,-2.94
3702,-2.56
3703,-2.24
3704,-2.00
3705,-1.83
3706,-1.67
3707,-1.49
3708,-1.29
3709,-1.13
3710,-1.04
3711,-1.05
3712,-1.12
3713,-1.25
3714,-1.39
3715,-1.51
3716,-1.57
3717,-1.53
3718,-1.38
3719,-1.14
3720,-0.86
3721,-0.60
3722,-0.39
3723,-0.25
3724,-0.16
3725,-0.13
3726,-0.14
3727,-0.19
3728,-0.21
3729,-0.14
3730,0.08
3731,0.42
3732,0.85
3733,1.30
3734,1.79
3735,2.24
3736,2.62
3737,2.90
3738,3.11
3739,3.26
3740,3.39
3741,3.51
3742,3.64
3743,3.82
3744,4.04
3745,4.20
3746,4.25
3747,4.12
3748,3.77
3749,3.26
3750,2.59
3751,1.85
3752,1.09
3753,0.43
3754,-0.17
3755,-0.63
3756,-1.05
3757,-1.40
3758,-1.81
3759,-2.24
3760,-2.79
3761,-3.40
3762,-4.09
3763,-4.75
3764,-5.41
3765,-5.99
3766,-6.56
3767,-7.06
3768,-7.55
3769,-7.99
3770,-8.46
3771,-8.93
3772,-9.41
3773,-9.87
3774,-10.31
3775,-10.67
3776,-10.98
3777,-11.16
3778,-11.21
3779,-11.10
3780,-10.86
3781,-10.52
3782,-10.15
3783,-9.77
3784,-9.43
3785,-9.14
3786,-8.91
3787,-8.71
3788,-8.47
3789,-8.19
3790,-7.93
3791,-7.75
3792,-7.66
3793,-7.71
3794,-7.90
3795,-8.22
3796,-8.61
3797,-9.00
3798,-9.32
3799,-9.53
3800,-9.57
3801,-9.45
3802,-9.10
3803,-8.67
3804,-8.19
3805,-7.70
3806,-7.13
3807,-6.53
3808,-5.87
3809,-5.27
3810,-4.67
3811,-4.12
3812,-3.51
3813,-2.91
3814,-2.25
3815,-1.58
3816,-0.77
3817,0.11
3818,1.09
3819,2.04
3820,2.95
3821,3.72
3822,4.41
3823,4.93
3824,5.35
3825,5.62
3826,5.87
3827,6.05
3828,6.23
3829,6.33
3830,6.42
3831,6.43
3832,6.48
3833,6.53
3834,6.63
3835,6.76
3836,6.95
3837,7.19
3838,7.47
3839,7.77
3840,8.09
3841,8.41
3842,8.72
3843,8.96
3844,9.07
3845,9.04
3846,8.87
3847,8.57
3848,8.13
3849,7.57
3850,6.94
3851,6.34
3852,5.81
3853,5.40
3854,5.10
3855,4.90
3856,4.68
3857,4.45
3858,4.07
3859,3.60
3860,2.94
3861,2.17
3862,1.27
3863,0.37
3864,-0.52
3865,-1.28
3866,-1.98
3867,-2.58
3868,-3.14
3869,-3.62
3870,-4.10
3871,-4.55
3872,-4.98
3873,-5.35
3874,-5.69
3875,-5.98
3876,-6.25
3877,-6.44
3878,-6.59
3879,-6.70
3880,-6.81
3881,-6.90
3882,-6.99
3883,-7.05
3884,-7.10
3885,-7.11
3886,-7.10
3887,-7.02
3888,-6.87
3889,-6.68
3890,-6.43
3891,-6.17
3892,-5.91
3893,-5.72
3894,-5.59
3895,-5.56
3896,-5.56
3897,-5.55
3898,-5.47
3899,-5.28
3900,-4.93
3901,-4.46
3902,-3.87
3903,-3.26
3904,-2.72
3905,-2.33
3906,-2.16
3907,-2.19
3908,-2.37
3909,-2.64
3910,-2.94
3911,-3.23
3912,-3.43
3913,-3.54
3914,-3.53
3915,-3.46
3916,-3.30
3917,-3.10
3918,-2.81
3919,-2.46
3920,-2.00
3921,-1.45
3922,-0.77
3923,-0.07
3924,0.66
3925,1.33
3926,2.00
3927,2.61
3928,3.22
3929,3.77
3930,4.33
3931,4.87
3932,5.41
3933,5.91
3934,6.39
3935,6.82
3936,7.19
3937,7.46
3938,7.69
3939,7.84
3940,7.90
3941,7.83
3942,7.61
3943,7.29
3944,6.88
3945,6.41
3946,5.86
3947,5.29
3948,4.71
3949,4.17
3950,3.66
3951,3.20
3952,2.73
3953,2.33
3954,1.95
3955,1.66
3956,1.43
3957,1.33
3958,1.29
3959,1.32
3960,1.34
3961,1.38
3962,1.38
3963,1.35
3964,1.22
3965,1.03
3966,0.79
3967,0.58
3968,0.34
3969,0.12
3970,-0.11
3971,-0.34
3972,-0.57
3973,-0.80
3974,-1.02
3975,-1.17
3976,-1.27
3977,-1.30
3978,-1.33
3979,-1.31
3980,-1.30
3981,-1.32
3982,-1.43
3983,-1.63
3984,-1.89
3985,-2.17
3986,-2.46
3987,-2.73
3988,-2.98
3989,-3.23
3990,-3.49
3991,-3.76
3992,-4.02
3993,-4.23
3994,-4.36
3995,-4.36
3996,-4.18
3997,-3.83
3998,-3.32
3999,-2.70
4000,-2.01
4001,-1.31
4002,-0.63
4003,-0.01
4004,0.63
4005,1.25
4006,1.90
4007,2.50
4008,3.11
4009,3.68
4010,4.23
4011,4.65
4012,4.98
4013,5.17
4014,5.29
4015,5.39
4016,5.55
4017,5.75
4018,6.07
4019,6.42
4020,6.80
4021,7.10
4022,7.31
4023,7.42
4024,7.45
4025,7.39
4026,7.26
4027,7.10
4028,6.95
4029,6.81
4030,6.66
4031,6.50
4032,6.35
4033,6.19
4034,6.00
4035,5.83
4036,5.68
4037,5.65
4038,5.71
4039,5.91
4040,6.15
4041,6.37
4042,6.45
4043,6.36
4044,6.06
4045,5.60
4046,5.00
4047,4.33
4048,3.59
4049,2.91
4050,2.25
4051,1.69
4052,1.15
4053,0.63
4054,0.05
4055,-0.49
4056,-1.01
4057,-1.42
4058,-1.75
4059,-1.96
4060,-2.14
4061,-2.28
4062,-2.53
4063,-2.83
4064,-3.30
4065,-3.87
4066,-4.60
4067,-5.38
4068,-6.17
4069,-6.88
4070,-7.58
4071,-8.22
4072,-8.82
4073,-9.33
4074,-9.82
4075,-10.26
4076,-10.67
4077,-10.97
4078,-11.18
4079,-11.29
4080,-11.33
4081,-11.32
4082,-11.34
4083,-11.40
4084,-11.47
4085,-11.57
4086,-11.63
4087,-11.67
4088,-11.58
4089,-11.38
4090,-10.98
4091,-10.43
4092,-9.70
4093,-8.84
4094,-7.91
4095,-7.03
4096,-6.29
4097,-5.78
4098,-5.48
4099,-5.46
4100,-5.64
4101,-5.96
4102,-6.23
4103,-6.35
4104,-6.23
4105,-5.90
4106,-5.33
4107,-4.65
4108,-3.97
4109,-3.46
4110,-3.12
4111,-2.98
4112,-2.93
4113,-2.94
4114,-2.85
4115,-2.62
4116,-2.17
4117,-1.54
4118,-0.75
4119,0.06
4120,0.84
4121,1.45
4122,1.89
4123,2.14
4124,2.27
4125,2.33
4126,2.42
4127,2.54
4128,2.78
4129,3.11
4130,3.56
4131,4.01
4132,4.45
4133,4.78
4134,5.01
4135,5.11
4136,5.09
4137,4.98
4138,4.84
4139,4.72
4140,4.64
4141,4.58
4142,4.53
4143,4.49
4144,4.46
4145,4.47
4146,4.50
4147,4.58
4148,4.69
4149,4.89
4150,5.11
4151,5.31
4152,5.35
4153,5.20
4154,4.82
4155,4.26
4156,3.47
4157,2.56
4158,1.56
4159,0.63
4160,-0.21
4161,-0.89
4162,-1.48
4163,-1.96
4164,-2.40
4165,-2.75
4166,-3.07
4167,-3.29
4168,-3.46
4169,-3.56
4170,-3.68
4171,-3.84
4172,-4.05
4173,-4.26
4174,-4.48
4175,-4.66
4176,-4.80
4177,-4.87
4178,-4.81
4179,-4.63
4180,-4.34
4181,-4.01
4182,-3.64
4183,-3.28
4184,-2.93
4185,-2.59
4186,-2.27
4187,-1.95
4188,-1.63
4189,-1.34
4190,-1.07
4191,-0.85
4192,-0.69
4193,-0.59
4194,-0.56
4195,-0.63
4196,-0.76
4197,-0.97
4198,-1.17
4199,-1.39
4200,-1.57
4201,-1.72
4202,-1.76
4203,-1.69
4204,-1.49
4205,-1.18
4206,-0.79
4207,-0.35
4208,0.07
4209,0.37
4210,0.53
4211,0.52
4212,0.38
4213,0.17
4214,0.00
4215,-0.07
4216,0.02
4217,0.26
4218,0.64
4219,1.11
4220,1.66
4221,2.20
4222,2.69
4223,3.06
4224,3.32
4225,3.46
4226,3.49
4227,3.38
4228,3.17
4229,2.89
4230,2.59
4231,2.33
4232,2.14
4233,2.08
4234,2.15
4235,2.35
4236,2.54
4237,2.62
4238,2.46
4239,2.05
4240,1.37
4241,0.48
4242,-0.60
4243,-1.69
4244,-2.71
4245,-3.50
4246,-4.07
4247,-4.36
4248,-4.48
4249,-4.46
4250,-4.46
4251,-4.56
4252,-4.87
4253,-5.36
4254,-6.04
4255,-6.82
4256,-7.62
4257,-8.29
4258,-8.73
4259,-8.84
4260,-8.64
4261,-8.16
4262,-7.55
4263,-6.91
4264,-6.38
4265,-6.00
4266,-5.87
4267,-5.91
4268,-6.08
4269,-6.29
4270,-6.48
4271,-6.68
4272,-6.89
4273,-7.15
4274,-7.46
4275,-7.83
4276,-8.20
4277,-8.58
4278,-8.90
4279,-9.09
4280,-9.12
4281,-8.98
4282,-8.72
4283,-8.44
4284,-8.17
4285,-7.93
4286,-7.71
4287,-7.53
4288,-7.34
4289,-7.16
4290,-6.87
4291,-6.54
4292,-6.10
4293,-5.63
4294,-5.07
4295,-4.45
4296,-3.74
4297,-3.04
4298,-2.31
4299,-1.63
4300,-0.92
4301,-0.24
4302,0.45
4303,1.09
4304,1.76
4305,2.40
4306,3.05
4307,3.62
4308,4.14
4309,4.50
4310,4.73
4311,4.75
4312,4.65
4313,4.45
4314,4.27
4315,4.16
4316,4.20
4317,4.39
4318,4.76
4319,5.27
4320,5.83
4321,6.33
4322,6.69
4323,6.84
4324,6.74
4325,6.42
4326,5.91
4327,5.26
4328,4.55
4329,3.90
4330,3.33
4331,2.92
4332,2.65
4333,2.52
4334,2.48
4335,2.53
4336,2.60
4337,2.69
4338,2.68
4339,2.58
4340,2.29
4341,1.88
4342,1.34
4343,0.70
4344,-0.02
4345,-0.76
4346,-1.45
4347,-2.04
4348,-2.57
4349,-3.01
4350,-3.40
4351,-3.71
4352,-4.01
4353,-4.27
4354,-4.55
4355,-4.82
4356,-5.13
4357,-5.40
4358,-5.61
4359,-5.71
4360,-5.71
4361,-5.63
4362,-5.48
4363,-5.25
4364,-4.99
4365,-4.75
4366,-4.57
4367,-4.48
4368,-4.43
4369,-4.42
4370,-4.39
4371,-4.34
4372,-4.23
4373,-4.05
4374,-3.80
4375,-3.52
4376,-3.23
4377,-3.00
4378,-2.82
4379,-2.71
4380,-2.64
4381,-2.59
4382,-2.56
4383,-2.55
4384,-2.55
4385,-2.55
4386,-2.51
4387,-2.46
4388,-2.41
4389,-2.39
4390,-2.35
4391,-2.32
4392,-2.34
4393,-2.45
4394,-2.63
4395,-2.85
4396,-3.07
4397,-3.29
4398,-3.46
4399,-3.59
4400,-3.66
4401,-3.68
4402,-3.61
4403,-3.46
4404,-3.25
4405,-3.02
4406,-2.76
4407,-2.47
4408,-2.16
4409,-1.88
4410,-1.65
4411,-1.50
4412,-1.46
4413,-1.52
4414,-1.66
4415,-1.85
4416,-2.03
4417,-2.13
4418,-2.12
4419,-1.97
4420,-1.73
4421,-1.48
4422,-1.33
4423,-1.32
4424,-1.50
4425,-1.85
4426,-2.40
4427,-3.07
4428,-3.85
4429,-4.56
4430,-5.13
4431,-5.49
4432,-5.68
4433,-5.71
4434,-5.61
4435,-5.44
4436,-5.34
4437,-5.36
4438,-5.53
4439,-5.82
4440,-6.23
4441,-6.67
4442,-7.04
4443,-7.23
4444,-7.17
4445,-6.91
4446,-6.48
4447,-6.00
4448,-5.54
4449,-5.19
4450,-5.01
4451,-5.01
4452,-5.17
4453,-5.38
4454,-5.54
4455,-5.57
4456,-5.43
4457,-5.19
4458,-4.91
4459,-4.68
4460,-4.55
4461,-4.56
4462,-4.71
4463,-4.95
4464,-5.20
4465,-5.40
4466,-5.47
4467,-5.41
4468,-5.21
4469,-4.98
4470,-4.76
4471,-4.62
4472,-4.52
4473,-4.46
4474,-4.40
4475,-4.30
4476,-4.00
4477,-3.52
4478,-2.85
4479,-2.10
4480,-1.24
4481,-0.39
4482,0.50
4483,1.30
4484,2.10
4485,2.85
4486,3.65
4487,4.49
4488,5.45
4489,6.42
4490,7.42
4491,8.29
4492,9.06
4493,9.59
4494,9.94
4495,10.07
4496,10.07
4497,9.96
4498,9.86
4499,9.77
4500,9.77
4501,9.80
4502,9.86
4503,9.88
4504,9.85
4505,9.75
4506,9.57
4507,9.33
4508,9.05
4509,8.76
4510,8.44
4511,8.08
4512,7.65
4513,7.20
4514,6.75
4515,6.36
4516,6.00
4517,5.73
4518,5.55
4519,5.52
4520,5.59
4521,5.74
4522,5.88
4523,6.03
4524,6.16
4525,6.25
4526,6.22
4527,6.07
4528,5.80
4529,5.46
4530,5.04
4531,4.55
4532,3.99
4533,3.40
4534,2.77
4535,2.20
4536,1.70
4537,1.31
4538,0.98
4539,0.72
4540,0.44
4541,0.12
4542,-0.34
4543,-0.89
4544,-1.56
4545,-2.26
4546,-3.00
4547,-3.65
4548,-4.20
4549,-4.55
4550,-4.81
4551,-4.99
4552,-5.24
4553,-5.59
4554,-6.15
4555,-6.89
4556,-7.83
4557,-8.87
4558,-9.96
4559,-10.92
4560,-11.63
4561,-11.99
4562,-12.02
4563,-11.81
4564,-11.42
4565,-10.91
4566,-10.38
4567,-9.94
4568,-9.64
4569,-9.47
4570,-9.36
4571,-9.27
4572,-9.14
4573,-8.97
4574,-8.71
4575,-8.38
4576,-7.99
4577,-7.61
4578,-7.25
4579,-6.94
4580,-6.65
4581,-6.39
4582,-6.07
4583,-5.71
4584,-5.23
4585,-4.69
4586,-4.12
4587,-3.62
4588,-3.23
4589,-3.03
4590,-2.96
4591,-3.04
4592,-3.17
4593,-3.29
4594,-3.28
4595,-3.14
4596,-2.82
4597,-2.42
4598,-1.97
4599,-1.57
4600,-1.27
4601,-1.10
4602,-0.99
4603,-0.89
4604,-0.68
4605,-0.32
4606,0.20
4607,0.82
4608,1.49
4609,2.04
4610,2.40
4611,2.43
4612,2.08
4613,1.38
4614,0.46
4615,-0.50
4616,-1.26
4617,-1.66
4618,-1.60
4619,-1.11
4620,-0.27
4621,0.72
4622,1.66
4623,2.33
4624,2.63
4625,2.53
4626,2.08
4627,1.44
4628,0.79
4629,0.29
4630,0.00
4631,-0.05
4632,0.08
4633,0.29
4634,0.47
4635,0.51
4636,0.39
4637,0.15
4638,-0.18
4639,-0.53
4640,-0.90
4641,-1.22
4642,-1.55
4643,-1.85
4644,-2.19
4645,-2.55
4646,-2.95
4647,-3.39
4648,-3.85
4649,-4.30
4650,-4.76
4651,-5.17
4652,-5.54
4653,-5.81
4654,-6.03
4655,-6.19
4656,-6.26
4657,-6.23
4658,-6.07
4659,-5.78
4660,-5.41
4661,-4.99
4662,-4.53
4663,-4.05
4664,-3.59
4665,-3.17
4666,-2.82
4667,-2.60
4668,-2.55
4669,-2.69
4670,-2.98
4671,-3.43
4672,-3.99
4673,-4.59
4674,-5.14
4675,-5.56
4676,-5.77
4677,-5.74
4678,-5.49
4679,-5.04
4680,-4.51
4681,-4.01
4682,-3.58
4683,-3.27
4684,-3.07
4685,-2.95
4686,-2.85
4687,-2.75
4688,-2.59
4689,-2.37
4690,-2.07
4691,-1.74
4692,-1.39
4693,-1.08
4694,-0.76
4695,-0.40
4696,0.02
4697,0.47
4698,0.96
4699,1.47
4700,2.01
4701,2.53
4702,2.98
4703,3.32
4704,3.57
4705,3.76
4706,3.91
4707,4.02
4708,4.04
4709,3.99
4710,3.83
4711,3.53
4712,3.07
4713,2.45
4714,1.73
4715,0.99
4716,0.27
4717,-0.33
4718,-0.81
4719,-1.07
4720,-1.21
4721,-1.24
4722,-1.31
4723,-1.46
4724,-1.85
4725,-2.46
4726,-3.40
4727,-4.57
4728,-5.93
4729,-7.30
4730,-8.64
4731,-9.77
4732,-10.65
4733,-11.17
4734,-11.41
4735,-11.38
4736,-11.24
4737,-11.02
4738,-10.82
4739,-10.65
4740,-10.59
4741,-10.58
4742,-10.60
4743,-10.59
4744,-10.54
4745,-10.45
4746,-10.33
4747,-10.19
4748,-10.04
4749,-9.89
4750,-9.70
4751,-9.48
4752,-9.25
4753,-9.01
4754,-8.76
4755,-8.52
4756,-8.31
4757,-8.17
4758,-8.11
4759,-8.09
4760,-8.09
4761,-8.09
4762,-8.10
4763,-8.13
4764,-8.14
4765,-8.13
4766,-8.06
4767,-8.00
4768,-7.89
4769,-7.72
4770,-7.41
4771,-7.01
4772,-6.51
4773,-5.94
4774,-5.22
4775,-4.40
4776,-3.47
4777,-2.52
4778,-1.53
4779,-0.55
4780,0.37
4781,1.12
4782,1.69
4783,1.99
4784,2.10
4785,1.99
4786,1.79
4787,1.50
4788,1.29
4789,1.15
4790,1.15
4791,1.27
4792,1.53
4793,1.84
4794,2.17
4795,2.45
4796,2.68
4797,2.85
4798,2.98
4799,3.08
4800,3.18
4801,3.32
4802,3.51
4803,3.75
4804,4.02
4805,4.27
4806,4.43
4807,4.43
4808,4.23
4809,3.85
4810,3.26
4811,2.53
4812,1.72
4813,0.97
4814,0.35
4815,-0.05
4816,-0.24
4817,-0.26
4818,-0.22
4819,-0.18
4820,-0.29
4821,-0.56
4822,-1.07
4823,-1.68
4824,-2.38
4825,-3.03
4826,-3.62
4827,-4.07
4828,-4.42
4829,-4.64
4830,-4.81
4831,-4.95
4832,-5.17
4833,-5.43
4834,-5.76
4835,-6.05
4836,-6.33
4837,-6.58
4838,-6.84
4839,-7.08
4840,-7.36
4841,-7.65
4842,-8.00
4843,-8.37
4844,-8.79
4845,-9.20
4846,-9.60
4847,-9.95
4848,-10.29
4849,-10.57
4850,-10.74
4851,-10.79
4852,-10.72
4853,-10.55
4854,-10.31
4855,-10.05
4856,-9.83
4857,-9.70
4858,-9.70
4859,-9.78
4860,-9.92
4861,-10.04
4862,-10.09
4863,-10.03
4864,-9.87
4865,-9.64
4866,-9.39
4867,-9.19
4868,-9.12
4869,-9.23
4870,-9.54
4871,-9.96
4872,-10.43
4873,-10.84
4874,-11.11
4875,-11.23
4876,-11.21
4877,-11.09
4878,-10.88
4879,-10.64
4880,-10.35
4881,-10.09
4882,-9.84
4883,-9.64
4884,-9.43
4885,-9.19
4886,-8.80
4887,-8.29
4888,-7.66
4889,-6.99
4890,-6.26
4891,-5.55
4892,-4.87
4893,-4.31
4894,-3.88
4895,-3.54
4896,-3.27
4897,-3.06
4898,-2.90
4899,-2.82
4900,-2.82
4901,-2.93
4902,-3.23
4903,-3.72
4904,-4.42
4905,-5.23
4906,-6.11
4907,-6.93
4908,-7.63
4909,-8.13
4910,-8.44
4911,-8.60
4912,-8.74
4913,-8.88
4914,-9.09
4915,-9.32
4916,-9.60
4917,-9.83
4918,-10.00
4919,-10.04
4920,-9.94
4921,-9.69
4922,-9.35
4923,-8.97
4924,-8.65
4925,-8.45
4926,-8.42
4927,-8.58
4928,-8.92
4929,-9.42
4930,-10.06
4931,-10.73
4932,-11.38
4933,-11.88
4934,-12.20
4935,-12.33
4936,-12.33
4937,-12.21
4938,-12.08
4939,-11.99
4940,-12.04
4941,-12.25
4942,-12.62
4943,-13.07
4944,-13.53
4945,-13.93
4946,-14.20
4947,-14.31
4948,-14.27
4949,-14.11
4950,-13.89
4951,-13.66
4952,-13.46
4953,-13.31
4954,-13.19
4955,-13.09
4956,-12.97
4957,-12.85
4958,-12.60
4959,-12.30
4960,-11.85
4961,-11.34
4962,-10.69
4963,-9.99
4964,-9.17
4965,-8.33
4966,-7.35
4967,-6.31
4968,-5.13
4969,-3.90
4970,-2.51
4971,-1.12
4972,0.28
4973,1.52
4974,2.66
4975,3.56
4976,4.31
4977,4.83
4978,5.32
4979,5.78
4980,6.38
4981,7.06
4982,7.88
4983,8.71
4984,9.52
4985,10.20
4986,10.71
4987,10.96
4988,10.94
4989,10.67
4990,10.26
4991,9.79
4992,9.35
4993,9.01
4994,8.80
4995,8.68
4996,8.60
4997,8.50
4998,8.31
4999,8.03
5000,7.64
5001,7.21
5002,6.77
5003,6.39
5004,6.07
5005,5.85
5006,5.69
5007,5.59
5008,5.40
5009,5.13
5010,4.70
5011,4.15
5012,3.41
5013,2.55
5014,1.57
5015,0.65
5016,-0.23
5017,-0.97
5018,-1.64
5019,-2.17
5020,-2.67
5021,-3.11
5022,-3.60
5023,-4.11
5024,-4.72
5025,-5.33
5026,-5.97
5027,-6.58
5028,-7.15
5029,-7.61
5030,-8.04
5031,-8.42
5032,-8.82
5033,-9.23
5034,-9.68
5035,-10.12
5036,-10.51
5037,-10.79
5038,-10.93
5039,-10.89
5040,-10.66
5041,-10.27
5042,-9.83
5043,-9.45
5044,-9.16
5045,-9.01
5046,-8.97
5047,-9.04
5048,-9.14
5049,-9.24
5050,-9.23
5051,-9.11
5052,-8.80
5053,-8.38
5054,-7.80
5055,-7.13
5056,-6.36
5057,-5.58
5058,-4.76
5059,-3.95
5060,-3.11
5061,-2.31
5062,-1.53
5063,-0.82
5064,-0.13
5065,0.51
5066,1.14
5067,1.60
5068,1.93
5069,2.04
5070,2.06
5071,1.98
5072,1.89
5073,1.82
5074,1.85
5075,1.98
5076,2.24
5077,2.59
5078,3.04
5079,3.47
5080,3.86
5081,4.14
5082,4.32
5083,4.36
5084,4.32
5085,4.25
5086,4.27
5087,4.42
5088,4.71
5089,5.04
5090,5.40
5091,5.72
5092,5.97
5093,6.04
5094,5.94
5095,5.71
5096,5.49
5097,5.39
5098,5.49
5099,5.81
5100,6.29
5101,6.87
5102,7.45
5103,7.85
5104,8.01
5105,7.91
5106,7.59
5107,7.19
5108,6.78
5109,6.48
5110,6.31
5111,6.24
5112,6.20
5113,6.16
5114,6.03
5115,5.77
5116,5.36
5117,4.90
5118,4.37
5119,3.89
5120,3.40
5121,2.98
5122,2.56
5123,2.18
5124,1.75
5125,1.27
5126,0.68
5127,0.08
5128,-0.56
5129,-1.13
5130,-1.65
5131,-2.08
5132,-2.46
5133,-2.79
5134,-3.11
5135,-3.36
5136,-3.55
5137,-3.62
5138,-3.59
5139,-3.41
5140,-3.11
5141,-2.70
5142,-2.24
5143,-1.75
5144,-1.30
5145,-0.88
5146,-0.50
5147,-0.18
5148,0.06
5149,0.26
5150,0.47
5151,0.65
5152,0.82
5153,0.94
5154,1.06
5155,1.17
5156,1.25
5157,1.30
5158,1.33
5159,1.34
5160,1.31
5161,1.20
5162,1.00
5163,0.75
5164,0.50
5165,0.24
5166,0.05
5167,-0.10
5168,-0.13
5169,-0.04
5170,0.18
5171,0.50
5172,0.93
5173,1.44
5174,2.02
5175,2.62
5176,3.23
5177,3.83
5178,4.39
5179,4.85
5180,5.18
5181,5.38
5182,5.49
5183,5.52
5184,5.49
5185,5.46
5186,5.45
5187,5.47
5188,5.44
5189,5.32
5190,5.05
5191,4.66
5192,4.09
5193,3.39
5194,2.54
5195,1.68
5196,0.79
5197,-0.03
5198,-0.83
5199,-1.53
5200,-2.19
5201,-2.75
5202,-3.30
5203,-3.80
5204,-4.31
5205,-4.75
5206,-5.17
5207,-5.51
5208,-5.84
5209,-6.12
5210,-6.45
5211,-6.81
5212,-7.29
5213,-7.87
5214,-8.61
5215,-9.45
5216,-10.32
5217,-11.15
5218,-11.86
5219,-12.34
5220,-12.54
5221,-12.45
5222,-12.15
5223,-11.74
5224,-11.29
5225,-10.83
5226,-10.38
5227,-9.95
5228,-9.50
5229,-9.03
5230,-8.50
5231,-7.94
5232,-7.37
5233,-6.90
5234,-6.57
5235,-6.52
5236,-6.71
5237,-7.16
5238,-7.70
5239,-8.22
5240,-8.56
5241,-8.66
5242,-8.43
5243,-7.96
5244,-7.26
5245,-6.48
5246,-5.69
5247,-5.00
5248,-4.40
5249,-3.94
5250,-3.54
5251,-3.17
5252,-2.67
5253,-2.10
5254,-1.40
5255,-0.66
5256,0.18
5257,1.00
5258,1.83
5259,2.55
5260,3.22
5261,3.78
5262,4.28
5263,4.68
5264,5.06
5265,5.36
5266,5.65
5267,5.94
5268,6.29
5269,6.61
5270,6.90
5271,7.08
5272,7.18
5273,7.19
5274,7.13
5275,7.00
5276,6.89
5277,6.84
5278,6.88
5279,7.00
5280,7.20
5281,7.46
5282,7.76
5283,8.04
5284,8.26
5285,8.38
5286,8.39
5287,8.28
5288,8.01
5289,7.64
5290,7.18
5291,6.69
5292,6.22
5293,5.83
5294,5.53
5295,5.38
5296,5.31
5297,5.29
5298,5.22
5299,5.05
5300,4.72
5301,4.31
5302,3.84
5303,3.41
5304,3.01
5305,2.71
5306,2.46
5307,2.28
5308,2.04
5309,1.75
5310,1.30
5311,0.73
5312,0.02
5313,-0.71
5314,-1.43
5315,-2.04
5316,-2.58
5317,-3.02
5318,-3.41
5319,-3.72
5320,-3.98
5321,-4.15
5322,-4.25
5323,-4.24
5324,-4.18
5325,-4.04
5326,-3.87
5327,-3.66
5328,-3.52
5329,-3.48
5330,-3.53
5331,-3.65
5332,-3.84
5333,-4.03
5334,-4.21
5335,-4.36
5336,-4.46
5337,-4.52
5338,-4.52
5339,-4.48
5340,-4.45
5341,-4.48
5342,-4.60
5343,-4.76
5344,-4.94
5345,-5.07
5346,-5.16
5347,-5.14
5348,-5.00
5349,-4.73
5350,-4.40
5351,-4.12
5352,-3.96
5353,-3.97
5354,-4.18
5355,-4.58
5356,-5.09
5357,-5.60
5358,-5.95
5359,-6.06
5360,-5.89
5361,-5.49
5362,-4.88
5363,-4.13
5364,-3.36
5365,-2.70
5366,-2.23
5367,-1.95
5368,-1.81
5369,-1.76
5370,-1.75
5371,-1.77
5372,-1.72
5373,-1.60
5374,-1.43
5375,-1.25
5376,-1.06
5377,-0.85
5378,-0.58
5379,-0.30
5380,-0.03
5381,0.21
5382,0.41
5383,0.56
5384,0.60
5385,0.46
5386,0.13
5387,-0.34
5388,-0.85
5389,-1.34
5390,-1.74
5391,-1.99
5392,-2.09
5393,-2.08
5394,-1.99
5395,-1.91
5396,-1.85
5397,-1.88
5398,-1.99
5399,-2.17
5400,-2.35
5401,-2.43
5402,-2.38
5403,-2.14
5404,-1.72
5405,-1.14
5406,-0.53
5407,0.03
5408,0.39
5409,0.49
5410,0.31
5411,-0.11
5412,-0.71
5413,-1.40
5414,-2.07
5415,-2.56
5416,-2.76
5417,-2.67
5418,-2.40
5419,-2.04
5420,-1.80
5421,-1.75
5422,-1.99
5423,-2.51
5424,-3.25
5425,-4.03
5426,-4.76
5427,-5.33
5428,-5.68
5429,-5.81
5430,-5.76
5431,-5.64
5432,-5.52
5433,-5.46
5434,-5.45
5435,-5.46
5436,-5.43
5437,-5.33
5438,-5.05
5439,-4.63
5440,-4.02
5441,-3.32
5442,-2.55
5443,-1.83
5444,-1.14
5445,-0.52
5446,0.11
5447,0.72
5448,1.34
5449,1.89
5450,2.45
5451,2.98
5452,3.51
5453,3.95
5454,4.33
5455,4.59
5456,4.84
5457,5.09
5458,5.36
5459,5.64
5460,5.96
5461,6.29
5462,6.61
5463,6.88
5464,7.06
5465,7.13
5466,7.00
5467,6.69
5468,6.20
5469,5.60
5470,4.93
5471,4.25
5472,3.62
5473,3.17
5474,2.90
5475,2.84
5476,2.87
5477,2.95
5478,2.96
5479,2.87
5480,2.62
5481,2.24
5482,1.77
5483,1.32
5484,0.91
5485,0.62
5486,0.43
5487,0.35
5488,0.27
5489,0.14
5490,-0.11
5491,-0.50
5492,-1.06
5493,-1.73
5494,-2.49
5495,-3.20
5496,-3.85
5497,-4.36
5498,-4.74
5499,-4.94
5500,-5.05
5501,-5.08
5502,-5.18
5503,-5.38
5504,-5.78
5505,-6.32
5506,-7.02
5507,-7.72
5508,-8.45
5509,-9.09
5510,-9.69
5511,-10.17
5512,-10.63
5513,-11.09
5514,-11.64
5515,-12.30
5516,-13.06
5517,-13.79
5518,-14.43
5519,-14.80
5520,-14.92
5521,-14.76
5522,-14.41
5523,-13.96
5524,-13.56
5525,-13.32
5526,-13.26
5527,-13.35
5528,-13.49
5529,-13.61
5530,-13.58
5531,-13.34
5532,-12.79
5533,-12.06
5534,-11.19
5535,-10.34
5536,-9.53
5537,-8.87
5538,-8.35
5539,-8.02
5540,-7.80
5541,-7.69
5542,-7.55
5543,-7.40
5544,-7.11
5545,-6.72
5546,-6.20
5547,-5.63
5548,-5.02
5549,-4.45
5550,-3.91
5551,-3.50
5552,-3.14
5553,-2.86
5554,-2.54
5555,-2.20
5556,-1.79
5557,-1.34
5558,-0.79
5559,-0.22
5560,0.32
5561,0.72
5562,1.01
5563,1.14
5564,1.18
5565,1.14
5566,1.10
5567,1.08
5568,1.14
5569,1.24
5570,1.38
5571,1.48
5572,1.48
5573,1.34
5574,1.10
5575,0.79
5576,0.46
5577,0.18
5578,0.02
5579,0.04
5580,0.21
5581,0.46
5582,0.62
5583,0.66
5584,0.50
5585,0.17
5586,-0.37
5587,-0.99
5588,-1.59
5589,-2.02
5590,-2.31
5591,-2.45
5592,-2.54
5593,-2.60
5594,-2.74
5595,-2.98
5596,-3.42
5597,-3.98
5598,-4.68
5599,-5.36
5600,-6.03
5601,-6.60
5602,-7.11
5603,-7.51
5604,-7.88
5605,-8.21
5606,-8.56
5607,-8.91
5608,-9.28
5609,-9.64
5610,-9.99
5611,-10.31
5612,-10.65
5613,-10.96
5614,-11.20
5615,-11.34
5616,-11.34
5617,-11.18
5618,-10.86
5619,-10.38
5620,-9.67
5621,-8.82
5622,-7.86
5623,-6.90
5624,-5.96
5625,-5.10
5626,-4.31
5627,-3.71
5628,-3.25
5629,-3.01
5630,-2.90
5631,-2.96
5632,-3.11
5633,-3.33
5634,-3.47
5635,-3.52
5636,-3.36
5637,-2.98
5638,-2.37
5639,-1.59
5640,-0.75
5641,0.02
5642,0.63
5643,0.97
5644,1.08
5645,0.98
5646,0.82
5647,0.67
5648,0.69
5649,0.89
5650,1.37
5651,2.04
5652,2.88
5653,3.73
5654,4.57
5655,5.29
5656,5.91
5657,6.37
5658,6.77
5659,7.09
5660,7.40
5661,7.69
5662,8.03
5663,8.35
5664,8.68
5665,8.96
5666,9.20
5667,9.40
5668,9.51
5669,9.50
5670,9.34
5671,9.03
5672,8.55
5673,7.98
5674,7.33
5675,6.74
5676,6.23
5677,5.86
5678,5.58
5679,5.40
5680,5.25
5681,5.09
5682,4.78
5683,4.30
5684,3.59
5685,2.76
5686,1.81
5687,0.86
5688,-0.05
5689,-0.80
5690,-1.40
5691,-1.80
5692,-2.08
5693,-2.21
5694,-2.31
5695,-2.40
5696,-2.56
5697,-2.79
5698,-3.11
5699,-3.44
5700,-3.80
5701,-4.12
5702,-4.36
5703,-4.51
5704,-4.55
5705,-4.46
5706,-4.24
5707,-3.91
5708,-3.48
5709,-2.99
5710,-2.48
5711,-1.98
5712,-1.56
5713,-1.24
5714,-1.08
5715,-1.08
5716,-1.27
5717,-1.64
5718,-2.09
5719,-2.56
5720,-3.00
5721,-3.40
5722,-3.75
5723,-4.04
5724,-4.30
5725,-4.52
5726,-4.71
5727,-4.86
5728,-4.91
5729,-4.87
5730,-4.65
5731,-4.28
5732,-3.72
5733,-3.03
5734,-2.20
5735,-1.33
5736,-0.44
5737,0.37
5738,1.10
5739,1.69
5740,2.16
5741,2.44
5742,2.58
5743,2.58
5744,2.58
5745,2.59
5746,2.72
5747,2.94
5748,3.35
5749,3.88
5750,4.51
5751,5.15
5752,5.77
5753,6.24
5754,6.52
5755,6.52
5756,6.28
5757,5.87
5758,5.45
5759,5.08
5760,4.87
5761,4.87
5762,5.09
5763,5.50
5764,5.99
5765,6.45
5766,6.74
5767,6.83
5768,6.67
5769,6.29
5770,5.71
5771,5.01
5772,4.24
5773,3.51
5774,2.85
5775,2.36
5776,2.03
5777,1.88
5778,1.86
5779,1.96
5780,2.05
5781,2.12
5782,2.04
5783,1.79
5784,1.33
5785,0.75
5786,0.05
5787,-0.65
5788,-1.33
5789,-1.89
5790,-2.36
5791,-2.67
5792,-2.97
5793,-3.29
5794,-3.74
5795,-4.30
5796,-5.03
5797,-5.82
5798,-6.67
5799,-7.44
5800,-8.10
5801,-8.60
5802,-8.93
5803,-9.07
5804,-9.07
5805,-8.96
5806,-8.86
5807,-8.74
5808,-8.62
5809,-8.50
5810,-8.45
5811,-8.45
5812,-8.53
5813,-8.63
5814,-8.79
5815,-9.00
5816,-9.25
5817,-9.48
5818,-9.66
5819,-9.78
5820,-9.80
5821,-9.75
5822,-9.64
5823,-9.48
5824,-9.23
5825,-8.93
5826,-8.55
5827,-8.13
5828,-7.64
5829,-7.15
5830,-6.68
5831,-6.33
5832,-6.07
5833,-5.88
5834,-5.73
5835,-5.62
5836,-5.48
5837,-5.32
5838,-5.07
5839,-4.76
5840,-4.34
5841,-3.93
5842,-3.49
5843,-3.11
5844,-2.69
5845,-2.27
5846,-1.78
5847,-1.23
5848,-0.58
5849,0.11
5850,0.83
5851,1.51
5852,2.13
5853,2.59
5854,2.91
5855,3.06
5856,3.14
5857,3.16
5858,3.17
5859,3.20
5860,3.24
5861,3.31
5862,3.33
5863,3.27
5864,3.05
5865,2.74
5866,2.32
5867,1.82
5868,1.24
5869,0.60
5870,-0.08
5871,-0.74
5872,-1.43
5873,-2.09
5874,-2.75
5875,-3.30
5876,-3.75
5877,-4.01
5878,-4.16
5879,-4.16
5880,-4.10
5881,-3.98
5882,-3.90
5883,-3.83
5884,-3.81
5885,-3.78
5886,-3.76
5887,-3.76
5888,-3.80
5889,-3.88
5890,-3.98
5891,-4.14
5892,-4.39
5893,-4.72
5894,-5.10
5895,-5.47
5896,-5.80
5897,-6.05
5898,-6.23
5899,-6.35
5900,-6.45
5901,-6.56
5902,-6.69
5903,-6.85
5904,-7.06
5905,-7.23
5906,-7.34
5907,-7.32
5908,-7.20
5909,-6.99
5910,-6.72
5911,-6.47
5912,-6.29
5913,-6.23
5914,-6.25
5915,-6.33
5916,-6.39
5917,-6.36
5918,-6.14
5919,-5.72
5920,-5.06
5921,-4.23
5922,-3.30
5923,-2.40
5924,-1.56
5925,-0.89
5926,-0.36
5927,0.02
5928,0.34
5929,0.60
5930,0.91
5931,1.27
5932,1.77
5933,2.33
5934,2.98
5935,3.54
5936,4.04
5937,4.41
5938,4.68
5939,4.84
5940,4.97
5941,5.07
5942,5.26
5943,5.51
5944,5.84
5945,6.16
5946,6.43
5947,6.61
5948,6.69
5949,6.65
5950,6.48
5951,6.23
5952,6.00
5953,5.84
5954,5.74
5955,5.67
5956,5.58
5957,5.46
5958,5.31
5959,5.10
5960,4.78
5961,4.43
5962,4.07
5963,3.81
5964,3.65
5965,3.56
5966,3.49
5967,3.40
5968,3.22
5969,2.94
5970,2.50
5971,1.97
5972,1.34
5973,0.76
5974,0.22
5975,-0.19
5976,-0.51
5977,-0.69
5978,-0.79
5979,-0.76
5980,-0.77
5981,-0.82
5982,-1.04
5983,-1.37
5984,-1.92
5985,-2.61
5986,-3.46
5987,-4.32
5988,-5.19
5989,-5.94
5990,-6.58
5991,-7.04
5992,-7.38
5993,-7.61
5994,-7.88
5995,-8.19
5996,-8.59
5997,-9.03
5998,-9.48
5999,-9.83
6000,-10.07
6001,-10.13
6002,-10.01
6003,-9.73
6004,-9.32
6005,-8.88
6006,-8.45
6007,-8.05
6008,-7.67
6009,-7.32
6010,-6.98
6011,-6.65
6012,-6.28
6013,-5.90
6014,-5.47
6015,-5.07
6016,-4.63
6017,-4.21
6018,-3.75
6019,-3.27
6020,-2.77
6021,-2.28
6022,-1.79
6023,-1.32
6024,-0.83
6025,-0.39
6026,0.02
6027,0.34
6028,0.59
6029,0.72
6030,0.81
6031,0.82
6032,0.85
6033,0.93
6034,1.13
6035,1.44
6036,1.93
6037,2.54
6038,3.24
6039,3.92
6040,4.54
6041,5.04
6042,5.39
6043,5.56
6044,5.58
6045,5.46
6046,5.31
6047,5.13
6048,5.00
6049,4.91
6050,4.94
6051,5.05
6052,5.25
6053,5.45
6054,5.62
6055,5.72
6056,5.73
6057,5.65
6058,5.53
6059,5.42
6060,5.36
6061,5.42
6062,5.63
6063,6.00
6064,6.46
6065,6.95
6066,7.39
6067,7.73
6068,7.95
6069,8.03
6070,7.97
6071,7.80
6072,7.58
6073,7.35
6074,7.10
6075,6.83
6076,6.48
6077,6.07
6078,5.58
6079,5.02
6080,4.39
6081,3.77
6082,3.14
6083,2.57
6084,2.03
6085,1.56
6086,1.12
6087,0.77
6088,0.49
6089,0.31
6090,0.16
6091,0.07
6092,-0.01
6093,-0.04
6094,-0.05
6095,-0.05
6096,-0.07
6097,-0.09
6098,-0.07
6099,0.02
6100,0.19
6101,0.41
6102,0.70
6103,1.04
6104,1.39
6105,1.72
6106,2.00
6107,2.24
6108,2.43
6109,2.61
6110,2.78
6111,2.92
6112,2.99
6113,2.93
6114,2.72
6115,2.37
6116,1.90
6117,1.39
6118,0.93
6119,0.58
6120,0.39
6121,0.35
6122,0.46
6123,0.69
6124,0.97
6125,1.23
6126,1.43
6127,1.61
6128,1.80
6129,2.01
6130,2.24
6131,2.43
6132,2.64
6133,2.82
6134,3.01
6135,3.14
6136,3.27
6137,3.42
6138,3.64
6139,3.91
6140,4.24
6141,4.60
6142,5.00
6143,5.39
6144,5.77
6145,6.07
6146,6.27
6147,6.33
6148,6.23
6149,5.97
6150,5.59
6151,5.17
6152,4.75
6153,4.43
6154,4.17
6155,4.04
6156,3.89
6157,3.70
6158,3.31
6159,2.73
6160,1.89
6161,0.89
6162,-0.27
6163,-1.40
6164,-2.47
6165,-3.30
6166,-3.97
6167,-4.48
6168,-4.99
6169,-5.49
6170,-6.04
6171,-6.60
6172,-7.25
6173,-7.90
6174,-8.53
6175,-9.03
6176,-9.39
6177,-9.59
6178,-9.68
6179,-9.67
6180,-9.54
6181,-9.30
6182,-8.95
6183,-8.51
6184,-8.02
6185,-7.49
6186,-6.95
6187,-6.43
6188,-5.97
6189,-5.64
6190,-5.41
6191,-5.29
6192,-5.21
6193,-5.17
6194,-5.14
6195,-5.16
6196,-5.17
6197,-5.23
6198,-5.26
6199,-5.35
6200,-5.48
6201,-5.65
6202,-5.78
6203,-5.83
6204,-5.76
6205,-5.58
6206,-5.25
6207,-4.76
6208,-4.10
6209,-3.37
6210,-2.60
6211,-1.91
6212,-1.32
6213,-0.92
6214,-0.64
6215,-0.50
6216,-0.38
6217,-0.27
6218,-0.05
6219,0.30
6220,0.85
6221,1.52
6222,2.27
6223,2.98
6224,3.67
6225,4.23
6226,4.68
6227,4.94
6228,5.10
6229,5.17
6230,5.20
6231,5.17
6232,5.14
6233,5.10
6234,5.11
6235,5.17
6236,5.31
6237,5.52
6238,5.80
6239,6.10
6240,6.43
6241,6.81
6242,7.21
6243,7.58
6244,7.86
6245,8.00
6246,7.97
6247,7.73
6248,7.29
6249,6.66
6250,5.91
6251,5.14
6252,4.47
6253,3.97
6254,3.66
6255,3.57
6256,3.67
6257,3.91
6258,4.15
6259,4.35
6260,4.41
6261,4.40
6262,4.30
6263,4.22
6264,4.12
6265,4.07
6266,4.03
6267,3.98
6268,3.85
6269,3.56
6270,3.04
6271,2.23
6272,1.10
6273,-0.24
6274,-1.69
6275,-3.02
6276,-4.15
6277,-4.92
6278,-5.34
6279,-5.36
6280,-5.08
6281,-4.59
6282,-4.13
6283,-3.80
6284,-3.76
6285,-3.99
6286,-4.49
6287,-5.16
6288,-5.89
6289,-6.53
6290,-6.99
6291,-7.19
6292,-7.13
6293,-6.88
6294,-6.52
6295,-6.15
6296,-5.88
6297,-5.74
6298,-5.72
6299,-5.79
6300,-5.89
6301,-5.97
6302,-6.00
6303,-5.91
6304,-5.72
6305,-5.46
6306,-5.19
6307,-4.98
6308,-4.88
6309,-4.91
6310,-5.03
6311,-5.22
6312,-5.42
6313,-5.61
6314,-5.73
6315,-5.78
6316,-5.72
6317,-5.61
6318,-5.44
6319,-5.25
6320,-4.98
6321,-4.65
6322,-4.24
6323,-3.79
6324,-3.27
6325,-2.72
6326,-2.12
6327,-1.57
6328,-1.09
6329,-0.72
6330,-0.40
6331,-0.18
6332,-0.02
6333,0.08
6334,0.17
6335,0.25
6336,0.38
6337,0.54
6338,0.74
6339,0.96
6340,1.17
6341,1.34
6342,1.41
6343,1.34
6344,1.04
6345,0.49
6346,-0.30
6347,-1.20
6348,-2.14
6349,-3.03
6350,-3.78
6351,-4.31
6352,-4.61
6353,-4.65
6354,-4.56
6355,-4.40
6356,-4.29
6357,-4.23
6358,-4.31
6359,-4.48
6360,-4.75
6361,-5.03
6362,-5.28
6363,-5.43
6364,-5.50
6365,-5.49
6366,-5.47
6367,-5.46
6368,-5.52
6369,-5.65
6370,-5.90
6371,-6.26
6372,-6.72
6373,-7.22
6374,-7.69
6375,-8.01
6376,-8.15
6377,-8.06
6378,-7.78
6379,-7.39
6380,-7.00
6381,-6.71
6382,-6.60
6383,-6.74
6384,-7.16
6385,-7.78
6386,-8.48
6387,-9.15
6388,-9.66
6389,-9.98
6390,-10.06
6391,-9.96
6392,-9.74
6393,-9.48
6394,-9.21
6395,-8.94
6396,-8.63
6397,-8.26
6398,-7.78
6399,-7.24
6400,-6.59
6401,-5.91
6402,-5.16
6403,-4.48
6404,-3.83
6405,-3.27
6406,-2.70
6407,-2.14
6408,-1.52
6409,-0.88
6410,-0.14
6411,0.57
6412,1.30
6413,1.97
6414,2.64
6415,3.22
6416,3.72
6417,4.11
6418,4.46
6419,4.78
6420,5.04
6421,5.23
6422,5.32
6423,5.31
6424,5.21
6425,4.99
6426,4.66
6427,4.23
6428,3.75
6429,3.30
6430,2.91
6431,2.60
6432,2.39
6433,2.30
6434,2.32
6435,2.45
6436,2.59
6437,2.72
6438,2.80
6439,2.84
6440,2.83
6441,2.80
6442,2.73
6443,2.66
6444,2.56
6445,2.45
6446,2.29
6447,2.11
6448,1.92
6449,1.75
6450,1.55
6451,1.34
6452,1.11
6453,0.89
6454,0.66
6455,0.42
6456,0.10
6457,-0.27
6458,-0.70
6459,-1.14
6460,-1.58
6461,-1.95
6462,-2.25
6463,-2.46
6464,-2.62
6465,-2.78
6466,-2.98
6467,-3.18
6468,-3.41
6469,-3.62
6470,-3.85
6471,-4.02
6472,-4.14
6473,-4.19
6474,-4.26
6475,-4.36
6476,-4.55
6477,-4.82
6478,-5.23
6479,-5.70
6480,-6.20
6481,-6.61
6482,-6.95
6483,-7.19
6484,-7.31
6485,-7.32
6486,-7.20
6487,-7.03
6488,-6.81
6489,-6.61
6490,-6.41
6491,-6.20
6492,-5.94
6493,-5.58
6494,-5.10
6495,-4.50
6496,-3.82
6497,-3.14
6498,-2.53
6499,-2.08
6500,-1.79
6501,-1.76
6502,-1.94
6503,-2.30
6504,-2.70
6505,-3.02
6506,-3.13
6507,-3.04
6508,-2.73
6509,-2.27
6510,-1.68
6511,-1.06
6512,-0.50
6513,-0.06
6514,0.27
6515,0.53
6516,0.82
6517,1.13
6518,1.49
6519,1.84
6520,2.17
6521,2.43
6522,2.62
6523,2.67
6524,2.60
6525,2.39
6526,2.12
6527,1.87
6528,1.72
6529,1.70
6530,1.79
6531,2.00
6532,2.29
6533,2.62
6534,2.90
6535,3.10
6536,3.22
6537,3.27
6538,3.22
6539,3.09
6540,2.91
6541,2.73
6542,2.57
6543,2.43
6544,2.22
6545,1.95
6546,1.60
6547,1.24
6548,0.88
6549,0.57
6550,0.31
6551,0.17
6552,0.11
6553,0.14
6554,0.17
6555,0.19
6556,0.12
6557,-0.02
6558,-0.34
6559,-0.80
6560,-1.37
6561,-1.95
6562,-2.57
6563,-3.17
6564,-3.75
6565,-4.23
6566,-4.64
6567,-4.98
6568,-5.28
6569,-5.49
6570,-5.59
6571,-5.58
6572,-5.49
6573,-5.39
6574,-5.26
6575,-5.10
6576,-4.93
6577,-4.75
6578,-4.53
6579,-4.28
6580,-3.97
6581,-3.59
6582,-3.15
6583,-2.69
6584,-2.24
6585,-1.85
6586,-1.50
6587,-1.19
6588,-0.89
6589,-0.62
6590,-0.36
6591,-0.12
6592,0.14
6593,0.37
6594,0.53
6595,0.56
6596,0.54
6597,0.48
6598,0.47
6599,0.47
6600,0.55
6601,0.66
6602,0.84
6603,1.07
6604,1.37
6605,1.70
6606,2.08
6607,2.46
6608,2.92
6609,3.39
6610,3.89
6611,4.33
6612,4.76
6613,5.15
6614,5.55
6615,5.94
6616,6.34
6617,6.73
6618,7.16
6619,7.58
6620,7.93
6621,8.15
6622,8.23
6623,8.21
6624,8.12
6625,8.00
6626,7.87
6627,7.79
6628,7.78
6629,7.84
6630,7.92
6631,7.95
6632,7.89
6633,7.71
6634,7.40
6635,7.03
6636,6.61
6637,6.23
6638,5.84
6639,5.47
6640,5.08
6641,4.70
6642,4.25
6643,3.77
6644,3.19
6645,2.56
6646,1.85
6647,1.12
6648,0.37
6649,-0.31
6650,-0.96
6651,-1.49
6652,-1.92
6653,-2.22
6654,-2.47
6655,-2.68
6656,-2.91
6657,-3.20
6658,-3.59
6659,-4.04
6660,-4.48
6661,-4.80
6662,-4.94
6663,-4.83
6664,-4.52
6665,-4.01
6666,-3.36
6667,-2.69
6668,-2.11
6669,-1.69
6670,-1.45
6671,-1.35
6672,-1.37
6673,-1.48
6674,-1.63
6675,-1.81
6676,-2.00
6677,-2.22
6678,-2.49
6679,-2.77
6680,-3.01
6681,-3.17
6682,-3.27
6683,-3.30
6684,-3.28
6685,-3.20
6686,-3.10
6687,-3.01
6688,-2.97
6689,-2.98
6690,-3.00
6691,-2.99
6692,-2.88
6693,-2.66
6694,-2.27
6695,-1.78
6696,-1.17
6697,-0.50
6698,0.25
6699,0.98
6700,1.68
6701,2.27
6702,2.85
6703,3.35
6704,3.84
6705,4.26
6706,4.71
6707,5.19
6708,5.77
6709,6.36
6710,6.94
6711,7.42
6712,7.86
6713,8.17
6714,8.37
6715,8.42
6716,8.38
6717,8.33
6718,8.34
6719,8.38
6720,8.50
6721,8.64
6722,8.81
6723,8.93
6724,8.96
6725,8.90
6726,8.78
6727,8.66
6728,8.51
6729,8.32
6730,8.07
6731,7.77
6732,7.42
6733,7.07
6734,6.72
6735,6.42
6736,6.20
6737,6.12
6738,6.20
6739,6.45
6740,6.78
6741,7.13
6742,7.36
6743,7.48
6744,7.39
6745,7.14
6746,6.70
6747,6.16
6748,5.58
6749,5.03
6750,4.47
6751,3.93
6752,3.36
6753,2.79
6754,2.17
6755,1.54
6756,0.89
6757,0.32
6758,-0.16
6759,-0.48
6760,-0.71
6761,-0.82
6762,-0.85
6763,-0.81
6764,-0.73
6765,-0.65
6766,-0.59
6767,-0.56
6768,-0.57
6769,-0.57
6770,-0.54
6771,-0.47
6772,-0.33
6773,-0.15
6774,0.06
6775,0.30
6776,0.56
6777,0.78
6778,0.92
6779,0.96
6780,0.92
6781,0.81
6782,0.66
6783,0.52
6784,0.44
6785,0.46
6786,0.57
6787,0.76
6788,0.99
6789,1.23
6790,1.45
6791,1.60
6792,1.70
6793,1.75
6794,1.80
6795,1.85
6796,1.95
6797,2.06
6798,2.20
6799,2.37
6800,2.55
6801,2.72
6802,2.89
6803,3.04
6804,3.22
6805,3.40
6806,3.63
6807,3.87
6808,4.14
6809,4.38
6810,4.63
6811,4.84
6812,5.07
6813,5.29
6814,5.55
6815,5.81
6816,6.10
6817,6.39
6818,6.66
6819,6.87
6820,7.01
6821,7.09
6822,7.09
6823,7.03
6824,6.94
6825,6.84
6826,6.71
6827,6.55
6828,6.29
6829,5.97
6830,5.58
6831,5.13
6832,4.59
6833,4.02
6834,3.43
6835,2.90
6836,2.40
6837,2.00
6838,1.66
6839,1.43
6840,1.26
6841,1.15
6842,1.05
6843,0.98
6844,0.91
6845,0.85
6846,0.79
6847,0.74
6848,0.69
6849,0.67
6850,0.67
6851,0.68
6852,0.65
6853,0.57
6854,0.44
6855,0.31
6856,0.16
6857,0.05
6858,-0.06
6859,-0.13
6860,-0.21
6861,-0.30
6862,-0.47
6863,-0.74
6864,-1.11
6865,-1.51
6866,-1.92
6867,-2.26
6868,-2.49
6869,-2.59
6870,-2.58
6871,-2.52
6872,-2.43
6873,-2.38
6874,-2.36
6875,-2.38
6876,-2.40
6877,-2.38
6878,-2.24
6879,-1.92
6880,-1.37
6881,-0.65
6882,0.23
6883,1.14
6884,2.08
6885,2.91
6886,3.61
6887,4.10
6888,4.44
6889,4.68
6890,4.92
6891,5.18
6892,5.54
6893,5.95
6894,6.43
6895,6.86
6896,7.20
6897,7.36
6898,7.35
6899,7.15
6900,6.85
6901,6.56
6902,6.40
6903,6.42
6904,6.59
6905,6.87
6906,7.17
6907,7.41
6908,7.50
6909,7.41
6910,7.14
6911,6.77
6912,6.37
6913,6.03
6914,5.83
6915,5.79
6916,5.87
6917,5.97
6918,6.06
6919,6.07
6920,6.00
6921,5.89
6922,5.76
6923,5.68
6924,5.65
6925,5.71
6926,5.81
6927,5.91
6928,5.94
6929,5.90
6930,5.75
6931,5.53
6932,5.23
6933,4.90
6934,4.54
6935,4.23
6936,3.94
6937,3.71
6938,3.52
6939,3.44
6940,3.39
6941,3.38
6942,3.33
6943,3.26
6944,3.05
6945,2.75
6946,2.29
6947,1.73
6948,1.10
6949,0.49
6950,-0.08
6951,-0.54
6952,-0.98
6953,-1.37
6954,-1.82
6955,-2.30
6956,-2.89
6957,-3.52
6958,-4.20
6959,-4.78
6960,-5.20
6961,-5.41
6962,-5.45
6963,-5.34
6964,-5.16
6965,-4.94
6966,-4.78
6967,-4.68
6968,-4.65
6969,-4.61
6970,-4.50
6971,-4.26
6972,-3.90
6973,-3.48
6974,-3.06
6975,-2.74
6976,-2.56
6977,-2.54
6978,-2.65
6979,-2.85
6980,-3.03
6981,-3.14
6982,-3.08
6983,-2.87
6984,-2.51
6985,-2.10
6986,-1.63
6987,-1.21
6988,-0.81
6989,-0.43
6990,-0.05
6991,0.34
6992,0.75
6993,1.16
6994,1.62
6995,2.09
6996,2.56
6997,2.94
6998,3.22
6999,3.39
7000,3.49
7001,3.52
7002,3.51
7003,3.48
7004,3.51
7005,3.62
7006,3.84
7007,4.09
7008,4.39
7009,4.71
7010,5.05
7011,5.39
7012,5.69
7013,5.93
7014,6.12
7015,6.23
7016,6.27
7017,6.23
7018,6.13
7019,5.96
7020,5.77
7021,5.60
7022,5.52
7023,5.57
7024,5.70
7025,5.87
7026,6.01
7027,6.10
7028,6.07
7029,5.96
7030,5.77
7031,5.61
7032,5.52
7033,5.52
7034,5.58
7035,5.71
7036,5.79
7037,5.79
7038,5.59
7039,5.20
7040,4.61
7041,3.90
7042,3.07
7043,2.24
7044,1.42
7045,0.72
7046,0.10
7047,-0.40
7048,-0.86
7049,-1.23
7050,-1.55
7051,-1.79
7052,-2.06
7053,-2.35
7054,-2.69
7055,-3.05
7056,-3.41
7057,-3.72
7058,-3.91
7059,-3.98
7060,-3.88
7061,-3.59
7062,-3.14
7063,-2.56
7064,-1.90
7065,-1.22
7066,-0.54
7067,0.15
7068,0.87
7069,1.55
7070,2.15
7071,2.60
7072,2.90
7073,2.99
7074,2.91
7075,2.62
7076,2.20
7077,1.71
7078,1.24
7079,0.88
7080,0.67
7081,0.63
7082,0.72
7083,0.91
7084,1.13
7085,1.31
7086,1.40
7087,1.36
7088,1.22
7089,1.03
7090,0.85
7091,0.72
7092,0.70
7093,0.80
7094,1.04
7095,1.37
7096,1.79
7097,2.22
7098,2.66
7099,3.06
7100,3.40
7101,3.66
7102,3.85
7103,3.96
7104,4.04
7105,4.12
7106,4.20
7107,4.24
7108,4.21
7109,4.10
7110,3.89
7111,3.59
7112,3.19
7113,2.72
7114,2.19
7115,1.66
7116,1.10
7117,0.55
7118,0.00
7119,-0.48
7120,-0.93
7121,-1.32
7122,-1.72
7123,-2.08
7124,-2.44
7125,-2.78
7126,-3.21
7127,-3.69
7128,-4.25
7129,-4.80
7130,-5.39
7131,-5.98
7132,-6.56
7133,-7.03
7134,-7.42
7135,-7.70
7136,-7.97
7137,-8.24
7138,-8.54
7139,-8.88
7140,-9.25
7141,-9.57
7142,-9.78
7143,-9.80
7144,-9.63
7145,-9.26
7146,-8.76
7147,-8.16
7148,-7.57
7149,-7.04
7150,-6.67
7151,-6.45
7152,-6.36
7153,-6.35
7154,-6.36
7155,-6.36
7156,-6.33
7157,-6.29
7158,-6.26
7159,-6.29
7160,-6.36
7161,-6.52
7162,-6.67
7163,-6.80
7164,-6.86
7165,-6.84
7166,-6.71
7167,-6.48
7168,-6.13
7169,-5.72
7170,-5.26
7171,-4.79
7172,-4.26
7173,-3.77
7174,-3.26
7175,-2.79
7176,-2.28
7177,-1.77
7178,-1.20
7179,-0.61
7180,0.08
7181,0.84
7182,1.69
7183,2.54
7184,3.41
7185,4.15
7186,4.75
7187,5.10
7188,5.35
7189,5.49
7190,5.60
7191,5.67
7192,5.80
7193,5.15
7194,5.71
7195,8.35
7196,9.20
7197,3.62
7198,-1.21
7199,10.26
7200,24.90
