1,574.77
2,835.42
3,854.98
4,750.12
5,671.33
6,631.81
7,557.31
8,428.25
9,270.75
10,112.24
11,-40.13
12,-160.34
13,-218.54
14,-192.29
15,-80.05
16,95.70
17,305.36
18,503.48
19,659.73
20,746.70
21,764.22
22,717.83
23,628.23
24,511.81
25,382.45
26,248.05
27,111.11
28,-22.86
29,-147.00
30,-249.21
31,-315.43
32,-337.62
33,-311.00
34,-247.04
35,-158.97
36,-71.29
37,0.67
38,42.91
39,56.37
40,46.63
41,26.73
42,8.51
43,-0.55
44,2.96
45,14.65
46,30.98
47,44.19
48,52.52
49,53.83
50,51.18
51,47.15
52,44.65
53,44.65
54,47.09
55,50.75
56,54.84
57,58.14
58,60.58
59,61.86
60,62.68
61,63.29
62,64.27
63,65.46
64,66.77
65,67.93
66,69.12
67,70.25
68,71.56
69,72.69
70,73.76
71,74.68
72,75.81
73,76.93
74,78.09
75,79.04
76,79.99
77,80.87
78,81.76
79,82.46
80,83.16
81,83.83
82,84.59
83,85.30
84,86.03
85,86.73
86,87.49
87,88.17
88,88.75
89,89.20
90,89.81
91,90.52
92,91.22
93,91.71
94,91.98
95,92.19
96,92.47
97,92.71
98,92.83
99,92.80
100,92.83
101,93.08
102,93.48
103,93.69
104,93.69
105,93.69
106,93.96
107,94.42
108,94.82
109,95.09
110,95.40
111,95.83
112,96.28
113,96.59
114,96.68
115,96.65
116,96.56
117,96.53
118,96.80
119,97.53
120,98.60
121,99.55
122,100.16
123,100.40
124,100.49
125,100.46
126,100.19
127,99.70
128,99.30
129,99.30
130,99.67
131,100.16
132,100.59
133,100.83
134,100.95
135,100.92
136,100.77
137,100.52
138,100.34
139,100.31
140,100.49
141,100.77
142,101.01
143,101.26
144,101.50
145,101.75
146,101.93
147,101.90
148,101.68
149,101.47
150,101.41
151,101.38
152,101.23
153,101.04
154,100.89
155,100.86
156,100.77
157,100.56
158,100.40
159,100.34
160,100.34
161,100.40
162,100.56
163,100.80
164,100.83
165,100.62
166,100.25
167,100.01
168,99.85
169,99.64
170,99.27
171,98.75
172,98.24
173,97.78
174,97.38
175,96.89
176,96.22
177,95.52
178,95.00
179,94.76
180,94.54
181,94.36
182,94.24
183,94.21
184,94.15
185,93.93
186,93.60
187,93.35
188,93.14
189,92.93
190,92.68
191,92.44
192,92.19
193,91.98
194,91.74
195,91.49
196,91.19
197,90.97
198,90.85
199,90.85
200,90.85
201,90.85
202,90.97
203,91.22
204,91.43
205,91.46
206,91.31
207,91.00
208,90.70
209,90.48
210,90.48
211,90.70
212,90.97
213,91.25
214,91.55
215,91.80
216,91.80
217,91.58
218,91.22
219,90.94
220,90.82
221,90.85
222,90.94
223,90.91
224,90.76
225,90.55
226,90.36
227,90.09
228,89.66
229,89.20
230,88.93
231,88.87
232,89.02
233,89.32
234,89.75
235,90.21
236,90.45
237,90.48
238,90.48
239,90.42
240,90.27
241,90.06
242,89.97
243,89.94
244,89.75
245,89.32
246,88.75
247,88.23
248,87.83
249,87.62
250,87.62
251,87.86
252,88.17
253,88.44
254,88.59
255,88.56
256,88.32
257,88.13
258,88.07
259,88.07
260,87.83
261,87.37
262,86.94
263,86.67
264,86.49
265,86.27
266,86.00
267,85.75
268,85.51
269,85.27
270,85.08
271,85.08
272,85.30
273,85.54
274,85.69
275,85.69
276,85.66
277,85.63
278,85.60
279,85.63
280,85.82
281,86.00
282,86.06
283,86.09
284,86.33
285,86.79
286,87.25
287,87.52
288,87.68
289,87.89
290,88.17
291,88.44
292,88.59
293,88.59
294,88.32
295,87.83
296,87.31
297,86.82
298,86.33
299,85.88
300,85.51
301,85.27
302,85.02
303,84.78
304,84.72
305,84.96
306,85.39
307,85.88
308,86.33
309,86.82
310,87.37
311,87.86
312,88.10
313,88.10
314,88.01
315,87.98
316,88.07
317,88.29
318,88.75
319,89.48
320,90.42
321,91.37
322,92.25
323,92.96
324,93.60
325,94.06
326,94.30
327,94.27
328,94.24
329,94.45
330,95.00
331,95.70
332,96.53
333,97.47
334,98.66
335,99.82
336,100.83
337,101.53
338,102.23
339,102.91
340,103.55
341,104.03
342,104.46
343,104.89
344,105.41
345,105.90
346,106.41
347,106.87
348,107.27
349,107.51
350,107.60
351,107.60
352,107.57
353,107.54
354,107.60
355,107.85
356,108.31
357,108.80
358,109.01
359,108.80
360,108.22
361,107.48
362,106.66
363,105.96
364,105.44
365,105.19
366,105.13
367,105.19
368,105.13
369,104.92
370,104.40
371,103.70
372,102.84
373,101.90
374,100.77
375,99.58
376,98.51
377,97.81
378,97.35
379,97.14
380,97.05
381,97.08
382,97.05
383,96.80
384,96.31
385,95.83
386,95.55
387,95.55
388,95.67
389,95.95
390,96.44
391,97.17
392,97.90
393,98.39
394,98.57
395,98.57
396,98.42
397,98.18
398,97.87
399,97.63
400,97.60
401,97.81
402,98.24
403,98.72
404,99.27
405,99.73
406,100.10
407,100.31
408,100.46
409,100.71
410,101.14
411,101.59
412,101.99
413,102.23
414,102.45
415,102.66
416,102.87
417,102.84
418,102.66
419,102.42
420,102.33
421,102.29
422,102.26
423,102.29
424,102.51
425,102.94
426,103.52
427,104.03
428,104.40
429,104.61
430,104.71
431,104.74
432,104.74
433,104.71
434,104.64
435,104.64
436,104.92
437,105.38
438,105.83
439,106.11
440,106.20
441,106.17
442,106.02
443,105.77
444,105.59
445,105.59
446,105.74
447,105.99
448,106.32
449,106.81
450,107.39
451,107.88
452,108.03
453,107.82
454,107.33
455,106.84
456,106.35
457,105.90
458,105.44
459,105.19
460,105.22
461,105.50
462,105.74
463,105.77
464,105.47
465,104.98
466,104.43
467,103.97
468,103.55
469,103.03
470,102.48
471,102.02
472,101.72
473,101.47
474,101.20
475,100.95
476,100.92
477,101.20
478,101.53
479,101.78
480,101.84
481,101.84
482,101.90
483,101.90
484,101.65
485,101.20
486,100.68
487,100.19
488,99.61
489,98.91
490,98.18
491,97.69
492,97.50
493,97.50
494,97.60
495,97.87
496,98.27
497,98.79
498,99.12
499,99.15
500,98.82
501,98.33
502,97.72
503,97.02
504,96.16
505,95.18
506,94.27
507,93.54
508,93.02
509,92.80
510,92.86
511,93.14
512,93.32
513,93.32
514,93.14
515,92.93
516,92.68
517,92.44
518,92.16
519,91.95
520,91.80
521,91.80
522,91.92
523,92.16
524,92.47
525,92.71
526,92.83
527,92.83
528,92.77
529,92.77
530,92.86
531,93.08
532,93.48
533,93.96
534,94.48
535,94.97
536,95.37
537,95.61
538,95.61
539,95.37
540,94.97
541,94.48
542,93.96
543,93.48
544,93.08
545,92.83
546,92.80
547,93.05
548,93.51
549,93.99
550,94.39
551,94.64
552,94.73
553,94.70
554,94.64
555,94.67
556,94.79
557,95.03
558,95.28
559,95.52
560,95.79
561,96.04
562,96.16
563,96.16
564,96.13
565,96.10
566,96.10
567,96.13
568,96.16
569,96.16
570,96.04
571,95.79
572,95.49
573,95.28
574,95.09
575,94.85
576,94.51
577,94.27
578,94.30
579,94.54
580,94.76
581,94.79
582,94.60
583,94.36
584,94.12
585,93.87
586,93.57
587,93.35
588,93.26
589,93.23
590,93.20
591,93.23
592,93.38
593,93.63
594,93.75
595,93.75
596,93.84
597,94.06
598,94.33
599,94.57
600,94.88
601,95.34
602,95.92
603,96.44
604,96.77
605,96.74
606,96.41
607,95.89
608,95.46
609,95.21
610,95.15
611,95.15
612,95.25
613,95.49
614,95.79
615,96.04
616,96.16
617,96.16
618,96.10
619,96.10
620,96.22
621,96.47
622,96.74
623,97.02
624,97.17
625,97.14
626,96.92
627,96.71
628,96.62
629,96.62
630,96.50
631,96.28
632,96.07
633,96.07
634,96.16
635,96.19
636,96.04
637,95.79
638,95.52
639,95.28
640,95.09
641,95.09
642,95.37
643,95.86
644,96.41
645,96.89
646,97.26
647,97.53
648,97.56
649,97.32
650,96.74
651,96.04
652,95.31
653,94.57
654,93.81
655,93.11
656,92.62
657,92.38
658,92.19
659,92.01
660,91.77
661,91.52
662,91.13
663,90.67
664,90.24
665,90.03
666,89.81
667,89.60
668,89.32
669,89.11
670,88.90
671,88.65
672,88.23
673,87.80
674,87.43
675,87.16
676,86.91
677,86.73
678,86.61
679,86.61
680,86.52
681,86.30
682,86.00
683,85.75
684,85.54
685,85.33
686,85.02
687,84.78
688,84.66
689,84.69
690,84.75
691,84.75
692,84.63
693,84.38
694,84.08
695,83.83
696,83.62
697,83.40
698,83.13
699,82.89
700,82.70
701,82.73
702,82.92
703,83.16
704,83.31
705,83.34
706,83.22
707,82.92
708,82.55
709,82.34
710,82.49
711,82.98
712,83.50
713,84.01
714,84.56
715,85.27
716,86.00
717,86.52
718,86.64
719,86.36
720,85.85
721,85.11
722,84.29
723,83.62
724,83.07
725,82.55
726,82.03
727,81.54
728,81.33
729,81.30
730,81.27
731,81.09
732,80.75
733,80.51
734,80.26
735,80.08
736,79.86
737,79.59
738,79.28
739,79.07
740,78.98
741,78.98
742,78.86
743,78.64
744,78.52
745,78.49
746,78.40
747,78.22
748,77.94
749,77.67
750,77.39
751,77.18
752,77.09
753,77.09
754,76.97
755,76.72
756,76.54
757,76.54
758,76.63
759,76.63
760,76.51
761,76.51
762,76.81
763,77.30
764,77.70
765,77.94
766,78.22
767,78.70
768,79.19
769,79.47
770,79.41
771,79.13
772,78.86
773,78.64
774,78.34
775,77.88
776,77.27
777,76.51
778,75.71
779,75.04
780,74.43
781,73.97
782,73.49
783,73.03
784,72.63
785,72.39
786,72.24
787,71.99
788,71.56
789,71.11
790,70.74
791,70.53
792,70.25
793,70.04
794,69.98
795,70.22
796,70.56
797,70.83
798,70.95
799,70.92
800,70.77
801,70.56
802,70.31
803,70.07
804,69.76
805,69.52
806,69.46
807,69.73
808,70.19
809,70.65
810,71.08
811,71.59
812,72.17
813,72.63
814,72.81
815,72.85
816,72.97
817,73.12
818,73.21
819,73.24
820,73.49
821,73.91
822,74.37
823,74.62
824,74.89
825,75.32
826,75.96
827,76.45
828,76.66
829,76.63
830,76.60
831,76.57
832,76.54
833,76.54
834,76.78
835,77.24
836,77.79
837,78.31
838,78.80
839,79.22
840,79.59
841,79.83
842,80.14
843,80.60
844,81.15
845,81.60
846,82.06
847,82.52
848,83.10
849,83.53
850,83.83
851,84.08
852,84.53
853,85.21
854,86.03
855,86.76
856,87.49
857,88.13
858,88.75
859,89.26
860,89.78
861,90.21
862,90.55
863,90.76
864,91.09
865,91.55
866,92.13
867,92.59
868,93.02
869,93.48
870,94.12
871,94.82
872,95.49
873,95.95
874,96.31
875,96.56
876,96.59
877,96.34
878,95.89
879,95.40
880,95.00
881,94.76
882,94.67
883,94.67
884,94.73
885,95.00
886,95.46
887,95.95
888,96.19
889,96.19
890,96.13
891,96.13
892,96.07
893,95.83
894,95.49
895,95.21
896,95.21
897,95.46
898,95.83
899,96.07
900,96.10
901,95.86
902,95.37
903,94.88
904,94.57
905,94.57
906,94.85
907,95.34
908,95.98
909,96.71
910,97.38
911,97.87
912,98.11
913,98.08
914,97.93
915,97.69
916,97.44
917,97.20
918,96.95
919,96.71
920,96.53
921,96.56
922,96.77
923,96.98
924,97.05
925,97.08
926,97.23
927,97.47
928,97.50
929,97.29
930,96.98
931,96.74
932,96.44
933,95.95
934,95.34
935,94.88
936,94.57
937,94.36
938,94.02
939,93.54
940,93.02
941,92.53
942,92.04
943,91.58
944,91.25
945,91.28
946,91.49
947,91.80
948,91.86
949,91.61
950,91.06
951,90.36
952,89.48
953,88.53
954,87.59
955,86.85
956,86.40
957,86.18
958,86.06
959,85.82
960,85.39
961,84.93
962,84.59
963,84.32
964,84.01
965,83.80
966,83.83
967,84.05
968,84.23
969,84.29
970,84.26
971,84.23
972,84.11
973,83.89
974,83.65
975,83.37
976,83.13
977,82.89
978,82.76
979,82.76
980,82.76
981,82.79
982,82.82
983,82.82
984,82.67
985,82.46
986,82.31
987,82.31
988,82.31
989,82.34
990,82.40
991,82.40
992,82.15
993,81.67
994,81.09
995,80.60
996,80.20
997,79.74
998,79.16
999,78.67
1000,78.43
1001,78.43
1002,78.61
1003,78.86
1004,79.07
1005,79.35
1006,79.59
1007,79.86
1008,79.99
1009,80.02
1010,79.90
1011,79.65
1012,79.25
1013,78.77
1014,78.31
1015,78.09
1016,78.06
1017,78.06
1018,77.91
1019,77.70
1020,77.55
1021,77.55
1022,77.51
1023,77.30
1024,76.87
1025,76.35
1026,75.90
1027,75.44
1028,74.92
1029,74.43
1030,74.01
1031,73.76
1032,73.79
1033,74.04
1034,74.40
1035,74.89
1036,75.50
1037,76.23
1038,76.93
1039,77.42
1040,77.64
1041,77.64
1042,77.51
1043,77.24
1044,76.84
1045,76.39
1046,75.99
1047,75.71
1048,75.59
1049,75.59
1050,75.78
1051,76.02
1052,76.17
1053,76.20
1054,76.08
1055,75.81
1056,75.41
1057,74.95
1058,74.52
1059,74.25
1060,74.13
1061,74.16
1062,74.37
1063,74.58
1064,74.71
1065,74.71
1066,74.80
1067,75.01
1068,75.29
1069,75.56
1070,75.78
1071,76.02
1072,76.20
1073,76.20
1074,76.05
1075,75.78
1076,75.50
1077,75.26
1078,75.20
1079,75.41
1080,75.96
1081,76.69
1082,77.45
1083,78.19
1084,78.86
1085,79.32
1086,79.53
1087,79.53
1088,79.44
1089,79.44
1090,79.50
1091,79.50
1092,79.38
1093,79.13
1094,78.83
1095,78.58
1096,78.46
1097,78.46
1098,78.61
1099,78.86
1100,79.07
1101,79.04
1102,78.83
1103,78.61
1104,78.52
1105,78.52
1106,78.37
1107,78.16
1108,78.03
1109,78.00
1110,77.94
1111,77.76
1112,77.48
1113,77.18
1114,76.90
1115,76.66
1116,76.63
1117,76.87
1118,77.24
1119,77.48
1120,77.61
1121,77.61
1122,77.48
1123,77.24
1124,76.90
1125,76.66
1126,76.63
1127,76.87
1128,77.27
1129,77.79
1130,78.31
1131,78.83
1132,79.04
1133,78.83
1134,78.13
1135,77.15
1136,76.08
1137,75.13
1138,74.28
1139,73.55
1140,73.06
1141,72.81
1142,72.81
1143,72.81
1144,72.69
1145,72.45
1146,72.17
1147,71.93
1148,71.69
1149,71.44
1150,71.38
1151,71.59
1152,72.11
1153,72.85
1154,73.67
1155,74.37
1156,74.98
1157,75.44
1158,75.87
1159,76.32
1160,76.84
1161,77.33
1162,77.82
1163,78.28
1164,78.77
1165,79.22
1166,79.71
1167,80.20
1168,80.63
1169,80.84
1170,80.90
1171,80.87
1172,80.99
1173,81.21
1174,81.42
1175,81.70
1176,82.09
1177,82.55
1178,82.92
1179,83.16
1180,83.50
1181,83.92
1182,84.44
1183,84.93
1184,85.51
1185,86.24
1186,86.91
1187,87.40
1188,87.71
1189,87.92
1190,88.17
1191,88.41
1192,88.56
1193,88.56
1194,88.41
1195,88.17
1196,87.92
1197,87.68
1198,87.43
1199,87.19
1200,87.04
1201,87.07
1202,87.13
1203,87.16
1204,86.98
1205,86.76
1206,86.52
1207,86.27
1208,85.91
1209,85.45
1210,84.93
1211,84.44
1212,83.98
1213,83.53
1214,83.04
1215,82.58
1216,82.09
1217,81.60
1218,81.09
1219,80.60
1220,80.26
1221,80.05
1222,79.83
1223,79.62
1224,79.28
1225,79.04
1226,78.92
1227,78.95
1228,78.98
1229,78.98
1230,78.95
1231,78.98
1232,79.01
1233,78.98
1234,78.92
1235,78.95
1236,79.13
1237,79.35
1238,79.44
1239,79.47
1240,79.62
1241,79.80
1242,79.93
1243,79.96
1244,80.11
1245,80.57
1246,81.18
1247,81.67
1248,82.03
1249,82.24
1250,82.40
1251,82.40
1252,82.24
1253,82.00
1254,81.76
1255,81.48
1256,81.18
1257,80.96
1258,80.93
1259,80.93
1260,80.72
1261,80.23
1262,79.74
1263,79.47
1264,79.44
1265,79.47
1266,79.44
1267,79.44
1268,79.53
1269,79.80
1270,80.08
1271,80.32
1272,80.51
1273,80.75
1274,81.09
1275,81.30
1276,81.30
1277,81.05
1278,80.75
1279,80.51
1280,80.29
1281,80.05
1282,79.83
1283,79.86
1284,80.17
1285,80.66
1286,81.02
1287,81.30
1288,81.54
1289,81.76
1290,81.76
1291,81.54
1292,81.27
1293,80.99
1294,80.69
1295,80.47
1296,80.54
1297,80.75
1298,80.87
1299,80.93
1300,81.02
1301,81.21
1302,81.33
1303,81.39
1304,81.48
1305,81.70
1306,81.91
1307,81.94
1308,81.76
1309,81.54
1310,81.15
1311,80.44
1312,79.35
1313,78.16
1314,77.15
1315,76.39
1316,75.78
1317,75.35
1318,75.20
1319,75.44
1320,75.78
1321,76.05
1322,76.23
1323,76.45
1324,76.72
1325,77.00
1326,77.12
1327,77.15
1328,77.03
1329,76.75
1330,76.35
1331,75.90
1332,75.50
1333,75.26
1334,75.10
1335,75.10
1336,75.38
1337,75.87
1338,76.32
1339,76.60
1340,76.54
1341,76.29
1342,75.93
1343,75.44
1344,74.89
1345,74.40
1346,74.13
1347,74.13
1348,74.31
1349,74.55
1350,74.89
1351,75.38
1352,75.96
1353,76.42
1354,76.66
1355,76.66
1356,76.54
1357,76.29
1358,75.90
1359,75.41
1360,75.04
1361,75.04
1362,75.41
1363,75.90
1364,76.26
1365,76.51
1366,76.75
1367,76.97
1368,77.09
1369,77.12
1370,77.12
1371,77.09
1372,77.03
1373,77.03
1374,77.27
1375,77.76
1376,78.25
1377,78.52
1378,78.49
1379,78.22
1380,77.82
1381,77.33
1382,76.84
1383,76.39
1384,75.90
1385,75.41
1386,74.95
1387,74.74
1388,74.80
1389,75.04
1390,75.23
1391,75.26
1392,75.20
1393,75.20
1394,75.10
1395,74.89
1396,74.52
1397,74.04
1398,73.43
1399,72.72
1400,71.93
1401,71.17
1402,70.65
1403,70.47
1404,70.47
1405,70.47
1406,70.28
1407,70.04
1408,69.92
1409,69.92
1410,69.82
1411,69.61
1412,69.37
1413,69.37
1414,69.55
1415,69.79
1416,70.04
1417,70.28
1418,70.59
1419,70.83
1420,70.83
1421,70.59
1422,70.34
1423,70.31
1424,70.59
1425,71.11
1426,71.66
1427,72.17
1428,72.42
1429,72.17
1430,71.35
1431,70.13
1432,68.82
1433,67.60
1434,66.56
1435,65.86
1436,65.58
1437,65.83
1438,66.47
1439,67.20
1440,67.84
1441,68.33
1442,68.66
1443,68.88
1444,69.03
1445,69.24
1446,69.79
1447,70.50
1448,71.17
1449,71.66
1450,72.05
1451,72.51
1452,73.09
1453,73.55
1454,73.97
1455,74.37
1456,75.07
1457,76.05
1458,77.18
1459,78.13
1460,78.80
1461,79.25
1462,79.77
1463,80.20
1464,80.44
1465,80.47
1466,80.54
1467,80.72
1468,80.96
1469,81.24
1470,81.67
1471,82.09
1472,82.37
1473,82.40
1474,82.40
1475,82.34
1476,82.18
1477,81.97
1478,81.91
1479,82.12
1480,82.46
1481,82.70
1482,82.92
1483,83.16
1484,83.37
1485,83.37
1486,83.10
1487,82.61
1488,82.09
1489,81.60
1490,81.09
1491,80.60
1492,80.29
1493,80.32
1494,80.57
1495,80.81
1496,80.90
1497,80.90
1498,80.93
1499,80.93
1500,80.75
1501,80.26
1502,79.65
1503,79.13
1504,78.86
1505,78.89
1506,79.10
1507,79.35
1508,79.50
1509,79.50
1510,79.47
1511,79.44
1512,79.44
1513,79.44
1514,79.56
1515,79.80
1516,80.08
1517,80.29
1518,80.54
1519,80.78
1520,80.99
1521,80.99
1522,80.72
1523,80.23
1524,79.71
1525,79.47
1526,79.53
1527,79.77
1528,80.11
1529,80.32
1530,80.44
1531,80.44
1532,80.35
1533,80.11
1534,79.77
1535,79.53
1536,79.50
1537,79.74
1538,80.14
1539,80.66
1540,81.21
1541,81.70
1542,81.85
1543,81.60
1544,81.09
1545,80.35
1546,79.50
1547,78.49
1548,77.61
1549,77.12
1550,77.21
1551,77.70
1552,78.31
1553,78.80
1554,79.16
1555,79.38
1556,79.47
1557,79.47
1558,79.53
1559,79.74
1560,80.14
1561,80.66
1562,81.21
1563,81.67
1564,81.91
1565,81.91
1566,81.82
1567,81.54
1568,81.02
1569,80.29
1570,79.71
1571,79.44
1572,79.53
1573,79.77
1574,80.14
1575,80.60
1576,81.24
1577,81.97
1578,82.61
1579,83.10
1580,83.44
1581,83.65
1582,83.77
1583,83.77
1584,83.74
1585,83.71
1586,83.77
1587,84.01
1588,84.56
1589,85.27
1590,85.97
1591,86.46
1592,86.76
1593,87.01
1594,87.16
1595,87.16
1596,87.01
1597,86.76
1598,86.49
1599,86.24
1600,86.00
1601,85.78
1602,85.57
1603,85.33
1604,84.96
1605,84.50
1606,83.95
1607,83.50
1608,83.07
1609,82.61
1610,82.00
1611,81.30
1612,80.51
1613,79.83
1614,79.13
1615,78.40
1616,77.61
1617,76.90
1618,76.35
1619,75.90
1620,75.32
1621,74.62
1622,73.85
1623,73.15
1624,72.45
1625,71.72
1626,71.01
1627,70.56
1628,70.40
1629,70.40
1630,70.34
1631,70.13
1632,69.82
1633,69.55
1634,69.27
1635,69.09
1636,68.97
1637,68.97
1638,68.97
1639,69.00
1640,69.06
1641,69.03
1642,68.79
1643,68.36
1644,67.84
1645,67.29
1646,66.74
1647,66.28
1648,66.13
1649,66.38
1650,66.77
1651,67.02
1652,67.08
1653,67.08
1654,67.08
1655,67.08
1656,67.05
1657,67.05
1658,67.17
1659,67.41
1660,67.69
1661,67.93
1662,68.18
1663,68.39
1664,68.57
1665,68.57
1666,68.42
1667,68.15
1668,67.93
1669,67.93
1670,68.27
1671,68.97
1672,69.95
1673,70.95
1674,71.75
1675,72.20
1676,72.39
1677,72.36
1678,72.30
1679,72.27
1680,72.39
1681,72.63
1682,73.06
1683,73.52
1684,73.91
1685,74.13
1686,74.34
1687,74.55
1688,74.80
1689,75.04
1690,75.41
1691,75.87
1692,76.39
1693,76.87
1694,77.30
1695,77.55
1696,77.51
1697,77.27
1698,76.93
1699,76.66
1700,76.54
1701,76.54
1702,76.66
1703,76.90
1704,77.27
1705,77.76
1706,78.31
1707,78.77
1708,79.10
1709,79.32
1710,79.68
1711,80.11
1712,80.63
1713,81.12
1714,81.63
1715,82.09
1716,82.49
1717,82.70
1718,82.86
1719,83.10
1720,83.53
1721,83.95
1722,84.41
1723,84.90
1724,85.57
1725,86.27
1726,86.76
1727,87.07
1728,87.28
1729,87.46
1730,87.49
1731,87.31
1732,86.98
1733,86.73
1734,86.43
1735,86.00
1736,85.33
1737,84.59
1738,83.86
1739,83.19
1740,82.37
1741,81.42
1742,80.35
1743,79.38
1744,78.61
1745,78.19
1746,77.94
1747,77.73
1748,77.33
1749,76.87
1750,76.35
1751,75.90
1752,75.32
1753,74.62
1754,73.85
1755,73.15
1756,72.45
1757,71.75
1758,70.98
1759,70.28
1760,69.64
1761,69.18
1762,68.82
1763,68.57
1764,68.45
1765,68.48
1766,68.51
1767,68.51
1768,68.48
1769,68.51
1770,68.51
1771,68.51
1772,68.45
1773,68.45
1774,68.63
1775,68.88
1776,69.03
1777,69.03
1778,69.00
1779,68.97
1780,68.97
1781,68.97
1782,69.06
1783,69.31
1784,69.64
1785,69.89
1786,69.89
1787,69.67
1788,69.31
1789,68.79
1790,68.12
1791,67.41
1792,66.89
1793,66.62
1794,66.53
1795,66.59
1796,66.74
1797,66.99
1798,67.05
1799,66.83
1800,66.38
1801,65.86
1802,65.46
1803,65.25
1804,65.16
1805,65.12
1806,65.22
1807,65.49
1808,65.95
1809,66.41
1810,66.65
1811,66.68
1812,66.65
1813,66.62
1814,66.50
1815,66.28
1816,66.07
1817,66.04
1818,66.22
1819,66.50
1820,66.74
1821,66.71
1822,66.41
1823,65.92
1824,65.49
1825,65.25
1826,65.06
1827,64.82
1828,64.61
1829,64.58
1830,64.82
1831,65.34
1832,66.04
1833,66.74
1834,67.35
1835,67.84
1836,68.27
1837,68.45
1838,68.42
1839,68.21
1840,67.96
1841,67.69
1842,67.35
1843,67.11
1844,67.20
1845,67.69
1846,68.36
1847,68.85
1848,69.09
1849,69.34
1850,69.64
1851,69.89
1852,69.85
1853,69.61
1854,69.40
1855,69.37
1856,69.49
1857,69.79
1858,70.22
1859,70.68
1860,70.95
1861,70.98
1862,70.83
1863,70.59
1864,70.22
1865,69.70
1866,69.21
1867,69.00
1868,69.12
1869,69.34
1870,69.46
1871,69.46
1872,69.55
1873,69.79
1874,69.98
1875,70.01
1876,69.92
1877,69.92
1878,69.98
1879,69.95
1880,69.89
1881,69.89
1882,70.10
1883,70.31
1884,70.40
1885,70.43
1886,70.56
1887,70.77
1888,70.89
1889,70.92
1890,70.98
1891,71.20
1892,71.50
1893,71.78
1894,71.93
1895,71.90
1896,71.66
1897,71.20
1898,70.59
1899,69.82
1900,69.00
1901,68.30
1902,67.99
1903,68.18
1904,68.85
1905,69.85
1906,71.08
1907,72.30
1908,73.15
1909,73.39
1910,73.06
1911,72.30
1912,71.32
1913,70.34
1914,69.67
1915,69.40
1916,69.58
1917,70.10
1918,70.80
1919,71.50
1920,72.08
1921,72.33
1922,72.20
1923,71.93
1924,71.84
1925,72.08
1926,72.57
1927,73.06
1928,73.46
1929,73.70
1930,73.76
1931,73.79
1932,73.79
1933,73.76
1934,73.70
1935,73.73
1936,73.88
1937,74.10
1938,74.22
1939,74.22
1940,74.25
1941,74.25
1942,74.04
1943,73.55
1944,73.03
1945,72.75
1946,72.97
1947,73.70
1948,74.77
1949,75.99
1950,77.18
1951,78.16
1952,78.77
1953,79.01
1954,78.89
1955,78.40
1956,77.58
1957,76.60
1958,75.74
1959,75.26
1960,75.23
1961,75.44
1962,75.84
1963,76.32
1964,76.87
1965,77.39
1966,77.67
1967,77.67
1968,77.42
1969,77.18
1970,77.06
1971,77.06
1972,77.09
1973,77.09
1974,77.12
1975,77.15
1976,76.97
1977,76.48
1978,75.74
1979,75.04
1980,74.46
1981,73.97
1982,73.46
1983,73.00
1984,72.72
1985,72.75
1986,72.85
1987,72.88
1988,72.72
1989,72.48
1990,72.11
1991,71.69
1992,71.04
1993,70.34
1994,69.52
1995,68.85
1996,68.27
1997,67.78
1998,67.26
1999,66.83
2000,66.50
2001,66.25
2002,65.89
2003,65.46
2004,64.94
2005,64.48
2006,63.90
2007,63.20
2008,62.38
2009,61.68
2010,61.10
2011,60.64
2012,60.18
2013,59.69
2014,59.23
2015,59.02
2016,58.99
2017,58.99
2018,58.84
2019,58.65
2020,58.53
2021,58.50
2022,58.38
2023,58.17
2024,58.04
2025,58.01
2026,57.89
2027,57.68
2028,57.56
2029,57.77
2030,58.29
2031,59.05
2032,59.97
2033,60.91
2034,61.71
2035,62.19
2036,62.44
2037,62.41
2038,62.13
2039,61.65
2040,61.16
2041,60.91
2042,60.94
2043,61.22
2044,61.52
2045,61.77
2046,61.89
2047,61.86
2048,61.86
2049,61.83
2050,61.83
2051,61.83
2052,61.89
2053,62.10
2054,62.53
2055,63.05
2056,63.51
2057,63.69
2058,63.72
2059,63.72
2060,63.84
2061,64.09
2062,64.33
2063,64.58
2064,64.91
2065,65.37
2066,65.92
2067,66.44
2068,66.80
2069,67.02
2070,67.08
2071,67.08
2072,67.11
2073,67.08
2074,67.02
2075,66.77
2076,66.47
2077,66.19
2078,66.10
2079,66.07
2080,66.16
2081,66.44
2082,66.86
2083,67.32
2084,67.69
2085,67.93
2086,68.27
2087,68.73
2088,69.18
2089,69.43
2090,69.46
2091,69.46
2092,69.49
2093,69.49
2094,69.37
2095,69.15
2096,68.94
2097,68.66
2098,68.24
2099,67.81
2100,67.44
2101,67.20
2102,66.86
2103,66.38
2104,65.92
2105,65.67
2106,65.67
2107,65.70
2108,65.55
2109,65.31
2110,65.16
2111,65.16
2112,65.12
2113,64.88
2114,64.51
2115,64.24
2116,64.27
2117,64.54
2118,64.79
2119,64.79
2120,64.54
2121,64.30
2122,64.27
2123,64.51
2124,64.85
2125,65.12
2126,65.22
2127,65.19
2128,65.19
2129,65.19
2130,65.12
2131,64.88
2132,64.45
2133,63.93
2134,63.63
2135,63.63
2136,63.87
2137,64.15
2138,64.27
2139,64.24
2140,64.27
2141,64.48
2142,64.91
2143,65.43
2144,65.92
2145,66.10
2146,66.01
2147,65.80
2148,65.70
2149,65.67
2150,65.52
2151,65.31
2152,65.22
2153,65.46
2154,65.83
2155,66.10
2156,66.16
2157,66.13
2158,66.10
2159,66.13
2160,66.13
2161,66.13
2162,66.13
2163,66.13
2164,66.10
2165,66.13
2166,66.16
2167,66.16
2168,66.01
2169,65.83
2170,65.58
2171,65.31
2172,64.97
2173,64.76
2174,64.76
2175,65.00
2176,65.25
2177,65.28
2178,65.09
2179,64.82
2180,64.51
2181,64.30
2182,64.24
2183,64.48
2184,64.94
2185,65.43
2186,65.86
2187,66.10
2188,66.10
2189,65.89
2190,65.40
2191,64.67
2192,63.81
2193,63.05
2194,62.65
2195,62.65
2196,63.02
2197,63.51
2198,63.93
2199,64.21
2200,64.21
2201,63.96
2202,63.45
2203,62.96
2204,62.74
2205,63.02
2206,63.60
2207,64.36
2208,65.03
2209,65.52
2210,65.77
2211,65.77
2212,65.52
2213,65.03
2214,64.30
2215,63.60
2216,63.08
2217,62.84
2218,62.81
2219,62.81
2220,62.77
2221,62.77
2222,62.84
2223,62.84
2224,62.68
2225,62.44
2226,62.23
2227,62.23
2228,62.41
2229,62.65
2230,62.96
2231,63.20
2232,63.32
2233,63.32
2234,63.20
2235,62.96
2236,62.65
2237,62.38
2238,62.29
2239,62.56
2240,63.14
2241,63.84
2242,64.54
2243,65.03
2244,65.31
2245,65.28
2246,64.97
2247,64.48
2248,64.06
2249,63.81
2250,63.69
2251,63.69
2252,63.87
2253,64.36
2254,65.09
2255,65.83
2256,66.31
2257,66.56
2258,66.68
2259,66.68
2260,66.44
2261,65.95
2262,65.46
2263,65.19
2264,65.22
2265,65.49
2266,65.86
2267,66.35
2268,66.89
2269,67.38
2270,67.63
2271,67.66
2272,67.47
2273,67.23
2274,66.86
2275,66.41
2276,65.86
2277,65.37
2278,65.00
2279,64.79
2280,64.64
2281,64.39
2282,63.96
2283,63.48
2284,63.20
2285,63.20
2286,63.35
2287,63.60
2288,63.93
2289,64.42
2290,64.91
2291,65.16
2292,65.06
2293,64.82
2294,64.67
2295,64.64
2296,64.67
2297,64.70
2298,64.79
2299,65.00
2300,65.31
2301,65.58
2302,65.77
2303,65.77
2304,65.49
2305,64.97
2306,64.42
2307,63.96
2308,63.54
2309,63.05
2310,62.47
2311,62.01
2312,61.83
2313,61.83
2314,61.74
2315,61.49
2316,61.34
2317,61.34
2318,61.28
2319,61.10
2320,60.73
2321,60.49
2322,60.39
2323,60.39
2324,60.42
2325,60.39
2326,60.46
2327,60.70
2328,61.16
2329,61.65
2330,61.98
2331,62.23
2332,62.44
2333,62.68
2334,62.87
2335,62.87
2336,62.71
2337,62.44
2338,62.19
2339,61.98
2340,61.74
2341,61.46
2342,61.28
2343,61.28
2344,61.46
2345,61.74
2346,61.92
2347,61.92
2348,61.74
2349,61.49
2350,61.28
2351,61.04
2352,60.73
2353,60.49
2354,60.46
2355,60.73
2356,61.07
2357,61.31
2358,61.40
2359,61.40
2360,61.31
2361,61.10
2362,60.64
2363,59.91
2364,58.99
2365,58.26
2366,57.92
2367,57.92
2368,58.11
2369,58.35
2370,58.78
2371,59.48
2372,60.36
2373,61.07
2374,61.52
2375,61.77
2376,62.01
2377,62.19
2378,62.29
2379,62.29
2380,62.50
2381,62.96
2382,63.57
2383,64.03
2384,64.42
2385,64.88
2386,65.52
2387,66.25
2388,66.93
2389,67.38
2390,67.72
2391,67.93
2392,68.18
2393,68.39
2394,68.60
2395,68.88
2396,69.21
2397,69.43
2398,69.31
2399,68.85
2400,68.30
2401,67.78
2402,67.23
2403,66.80
2404,66.59
2405,66.56
2406,66.50
2407,66.31
2408,66.04
2409,65.77
2410,65.49
2411,65.25
2412,65.22
2413,65.46
2414,65.89
2415,66.38
2416,66.83
2417,67.32
2418,67.81
2419,68.05
2420,67.90
2421,67.41
2422,66.80
2423,66.28
2424,65.95
2425,65.73
2426,65.67
2427,65.64
2428,65.61
2429,65.64
2430,65.77
2431,66.01
2432,66.16
2433,66.16
2434,66.10
2435,66.10
2436,66.13
2437,66.16
2438,66.07
2439,65.80
2440,65.52
2441,65.25
2442,65.12
2443,65.12
2444,65.22
2445,65.49
2446,65.92
2447,66.38
2448,66.77
2449,66.99
2450,67.17
2451,67.41
2452,67.72
2453,67.96
2454,68.05
2455,68.05
2456,68.08
2457,68.08
2458,67.93
2459,67.41
2460,66.68
2461,65.95
2462,65.46
2463,65.22
2464,65.12
2465,65.16
2466,65.25
2467,65.52
2468,65.83
2469,66.04
2470,66.13
2471,66.13
2472,66.16
2473,66.16
2474,66.04
2475,65.80
2476,65.58
2477,65.58
2478,65.80
2479,66.04
2480,66.16
2481,66.16
2482,66.10
2483,66.10
2484,66.16
2485,66.16
2486,66.01
2487,65.77
2488,65.61
2489,65.61
2490,65.73
2491,65.73
2492,65.52
2493,65.28
2494,65.19
2495,65.16
2496,65.09
2497,64.88
2498,64.61
2499,64.33
2500,64.06
2501,63.84
2502,63.72
2503,63.72
2504,63.66
2505,63.48
2506,63.14
2507,62.87
2508,62.74
2509,62.77
2510,62.87
2511,62.84
2512,62.65
2513,62.41
2514,62.32
2515,62.29
2516,62.16
2517,61.95
2518,61.92
2519,62.10
2520,62.41
2521,62.68
2522,62.99
2523,63.45
2524,64.06
2525,64.54
2526,64.76
2527,64.73
2528,64.67
2529,64.67
2530,64.73
2531,64.73
2532,64.64
2533,64.64
2534,64.91
2535,65.37
2536,65.89
2537,66.41
2538,66.93
2539,67.38
2540,67.54
2541,67.32
2542,66.89
2543,66.38
2544,65.80
2545,65.34
2546,65.19
2547,65.43
2548,65.89
2549,66.41
2550,66.86
2551,67.08
2552,66.93
2553,66.44
2554,65.83
2555,65.34
2556,65.03
2557,64.79
2558,64.61
2559,64.58
2560,64.88
2561,65.40
2562,65.89
2563,66.10
2564,66.07
2565,66.10
2566,66.25
2567,66.50
2568,66.62
2569,66.62
2570,66.74
2571,66.96
2572,67.05
2573,66.86
2574,66.41
2575,65.89
2576,65.43
2577,64.94
2578,64.42
2579,63.93
2580,63.60
2581,63.39
2582,63.14
2583,62.90
2584,62.71
2585,62.71
2586,62.87
2587,63.14
2588,63.42
2589,63.66
2590,63.84
2591,64.09
2592,64.45
2593,64.94
2594,65.40
2595,65.64
2596,65.64
2597,65.37
2598,64.94
2599,64.48
2600,64.03
2601,63.54
2602,63.02
2603,62.50
2604,62.19
2605,62.19
2606,62.47
2607,62.99
2608,63.63
2609,64.33
2610,65.00
2611,65.52
2612,65.77
2613,65.73
2614,65.55
2615,65.31
2616,65.09
2617,64.82
2618,64.51
2619,64.27
2620,64.30
2621,64.54
2622,64.79
2623,64.79
2624,64.58
2625,64.33
2626,64.15
2627,63.90
2628,63.48
2629,63.02
2630,62.71
2631,62.68
2632,62.84
2633,63.14
2634,63.54
2635,64.00
2636,64.36
2637,64.61
2638,64.79
2639,65.03
2640,65.31
2641,65.55
2642,65.80
2643,66.01
2644,66.25
2645,66.50
2646,66.74
2647,66.96
2648,67.17
2649,67.41
2650,67.81
2651,68.27
2652,68.70
2653,68.94
2654,69.06
2655,69.03
2656,68.88
2657,68.66
2658,68.39
2659,68.15
2660,67.90
2661,67.66
2662,67.54
2663,67.47
2664,67.60
2665,67.87
2666,68.30
2667,68.76
2668,69.12
2669,69.34
2670,69.64
2671,70.13
2672,70.68
2673,71.20
2674,71.56
2675,71.78
2676,71.84
2677,71.87
2678,71.87
2679,71.87
2680,71.75
2681,71.53
2682,71.29
2683,71.04
2684,70.68
2685,70.25
2686,69.70
2687,69.21
2688,68.76
2689,68.33
2690,67.78
2691,67.08
2692,66.07
2693,64.88
2694,63.60
2695,62.44
2696,61.25
2697,60.06
2698,58.87
2699,57.92
2700,57.28
2701,56.82
2702,56.24
2703,55.57
2704,54.81
2705,54.11
2706,53.34
2707,52.64
2708,52.09
2709,51.85
2710,51.82
2711,51.82
2712,51.79
2713,51.82
2714,51.88
2715,51.88
2716,51.67
2717,51.45
2718,51.42
2719,51.64
2720,51.94
2721,52.22
2722,52.58
2723,53.01
2724,53.44
2725,53.71
2726,53.89
2727,54.08
2728,54.32
2729,54.60
2730,54.84
2731,55.08
2732,55.24
2733,55.24
2734,55.08
2735,54.84
2736,54.63
2737,54.35
2738,54.05
2739,53.86
2740,53.80
2741,53.77
2742,53.62
2743,53.41
2744,53.28
2745,53.25
2746,53.13
2747,52.95
2748,52.80
2749,52.76
2750,52.67
2751,52.49
2752,52.31
2753,52.28
2754,52.31
2755,52.34
2756,52.40
2757,52.37
2758,52.15
2759,51.70
2760,51.03
2761,50.29
2762,49.56
2763,48.86
2764,48.25
2765,47.76
2766,47.36
2767,47.15
2768,47.06
2769,47.09
2770,47.00
2771,46.78
2772,46.39
2773,45.90
2774,45.35
2775,44.92
2776,44.53
2777,44.04
2778,43.37
2779,42.66
2780,42.11
2781,41.87
2782,41.72
2783,41.53
2784,41.23
2785,40.99
2786,40.80
2787,40.59
2788,40.19
2789,39.70
2790,39.25
2791,39.03
2792,38.94
2793,38.97
2794,39.06
2795,39.28
2796,39.64
2797,40.16
2798,40.71
2799,41.17
2800,41.50
2801,41.72
2802,41.96
2803,42.21
2804,42.39
2805,42.36
2806,42.27
2807,42.24
2808,42.48
2809,42.97
2810,43.55
2811,44.01
2812,44.40
2813,44.89
2814,45.56
2815,46.23
2816,46.88
2817,47.36
2818,47.85
2819,48.28
2820,48.68
2821,48.89
2822,49.07
2823,49.32
2824,49.62
2825,49.87
2826,49.99
2827,49.99
2828,49.93
2829,49.93
2830,49.96
2831,49.96
2832,49.93
2833,49.93
2834,50.02
2835,50.26
2836,50.57
2837,50.81
2838,50.90
2839,50.90
2840,50.93
2841,50.93
2842,50.75
2843,50.54
2844,50.38
2845,50.38
2846,50.35
2847,50.11
2848,49.80
2849,49.53
2850,49.41
2851,49.41
2852,49.50
2853,49.77
2854,50.23
2855,50.69
2856,50.93
2857,50.96
2858,50.93
2859,50.90
2860,50.72
2861,50.51
2862,50.48
2863,50.69
2864,50.99
2865,51.27
2866,51.51
2867,51.73
2868,51.85
2869,51.85
2870,51.88
2871,52.09
2872,52.64
2873,53.34
2874,54.14
2875,54.84
2876,55.51
2877,55.97
2878,56.18
2879,56.18
2880,56.18
2881,56.12
2882,56.09
2883,56.09
2884,56.34
2885,56.79
2886,57.34
2887,57.83
2888,58.29
2889,58.75
2890,59.17
2891,59.42
2892,59.48
2893,59.45
2894,59.54
2895,59.75
2896,60.09
2897,60.58
2898,61.31
2899,62.26
2900,63.29
2901,64.27
2902,65.09
2903,65.80
2904,66.41
2905,66.89
2906,67.26
2907,67.47
2908,67.66
2909,67.87
2910,68.30
2911,68.76
2912,69.15
2913,69.37
2914,69.55
2915,69.79
2916,70.10
2917,70.34
2918,70.47
2919,70.47
2920,70.43
2921,70.40
2922,70.43
2923,70.43
2924,70.43
2925,70.43
2926,70.47
2927,70.43
2928,70.37
2929,70.40
2930,70.53
2931,70.77
2932,70.92
2933,70.92
2934,70.86
2935,70.86
2936,70.95
2937,70.92
2938,70.77
2939,70.53
2940,70.43
2941,70.40
2942,70.31
2943,70.10
2944,69.85
2945,69.58
2946,69.21
2947,68.76
2948,68.30
2949,68.08
2950,68.05
2951,68.05
2952,67.99
2953,68.02
2954,68.18
2955,68.39
2956,68.54
2957,68.54
2958,68.51
2959,68.51
2960,68.42
2961,68.24
2962,67.90
2963,67.38
2964,66.65
2965,65.98
2966,65.52
2967,65.25
2968,65.00
2969,64.79
2970,64.76
2971,65.00
2972,65.25
2973,65.28
2974,65.06
2975,64.82
2976,64.58
2977,64.36
2978,64.06
2979,63.84
2980,63.75
2981,63.75
2982,63.63
2983,63.45
2984,63.20
2985,62.93
2986,62.56
2987,62.10
2988,61.68
2989,61.43
2990,61.25
2991,61.04
2992,60.79
2993,60.52
2994,60.27
2995,60.03
2996,59.88
2997,59.84
2998,60.03
2999,60.55
3000,61.40
3001,62.35
3002,63.11
3003,63.60
3004,63.93
3005,64.15
3006,64.21
3007,63.96
3008,63.51
3009,63.02
3010,62.62
3011,62.38
3012,62.29
3013,62.29
3014,62.35
3015,62.35
3016,62.23
3017,61.98
3018,61.68
3019,61.43
3020,61.34
3021,61.34
3022,61.34
3023,61.34
3024,61.46
3025,61.68
3026,61.95
3027,62.19
3028,62.47
3029,62.68
3030,62.84
3031,62.84
3032,62.81
3033,62.77
3034,62.81
3035,62.81
3036,62.81
3037,62.81
3038,62.81
3039,62.81
3040,62.81
3041,62.81
3042,62.77
3043,62.81
3044,62.84
3045,62.81
3046,62.71
3047,62.74
3048,63.02
3049,63.48
3050,63.90
3051,64.21
3052,64.33
3053,64.30
3054,64.06
3055,63.60
3056,63.02
3057,62.53
3058,62.13
3059,61.65
3060,61.00
3061,60.27
3062,59.63
3063,59.17
3064,58.75
3065,58.29
3066,57.80
3067,57.56
3068,57.62
3069,57.86
3070,58.17
3071,58.41
3072,58.65
3073,58.90
3074,59.05
3075,59.05
3076,58.90
3077,58.65
3078,58.41
3079,58.20
3080,57.86
3081,57.37
3082,56.82
3083,56.34
3084,55.97
3085,55.76
3086,55.54
3087,55.33
3088,55.02
3089,54.78
3090,54.69
3091,54.72
3092,54.69
3093,54.47
3094,53.92
3095,53.19
3096,52.40
3097,51.70
3098,51.03
3099,50.32
3100,49.56
3101,48.80
3102,48.28
3103,48.03
3104,48.00
3105,48.07
3106,47.94
3107,47.70
3108,47.39
3109,47.42
3110,47.85
3111,48.55
3112,49.26
3113,50.02
3114,50.96
3115,51.88
3116,52.55
3117,52.80
3118,52.86
3119,52.83
3120,52.61
3121,52.12
3122,51.64
3123,51.33
3124,51.42
3125,51.67
3126,52.00
3127,52.22
3128,52.43
3129,52.61
3130,52.98
3131,53.44
3132,54.11
3133,54.78
3134,55.54
3135,56.24
3136,56.98
3137,57.68
3138,58.41
3139,59.11
3140,59.84
3141,60.58
3142,61.22
3143,61.68
3144,62.01
3145,62.23
3146,62.44
3147,62.65
3148,62.93
3149,63.20
3150,63.39
3151,63.35
3152,63.14
3153,62.90
3154,62.84
3155,62.81
3156,62.62
3157,62.41
3158,62.41
3159,62.62
3160,62.81
3161,62.84
3162,62.87
3163,63.08
3164,63.45
3165,63.69
3166,63.78
3167,63.78
3168,63.75
3169,63.75
3170,63.75
3171,63.75
3172,63.78
3173,63.78
3174,63.66
3175,63.48
3176,63.11
3177,62.62
3178,61.92
3179,61.25
3180,60.67
3181,60.18
3182,59.60
3183,58.90
3184,58.20
3185,57.71
3186,57.40
3187,57.19
3188,56.98
3189,56.76
3190,56.46
3191,56.21
3192,56.12
3193,56.15
3194,56.12
3195,55.91
3196,55.33
3197,54.63
3198,53.86
3199,53.16
3200,52.40
3201,51.70
3202,51.06
3203,50.63
3204,50.20
3205,49.74
3206,49.10
3207,48.40
3208,47.70
3209,46.97
3210,46.05
3211,45.17
3212,44.43
3213,43.91
3214,43.43
3215,43.00
3216,42.76
3217,42.76
3218,42.72
3219,42.51
3220,42.14
3221,41.87
3222,41.75
3223,41.78
3224,41.90
3225,42.14
3226,42.48
3227,42.97
3228,43.58
3229,44.31
3230,45.07
3231,45.78
3232,46.45
3233,47.18
3234,48.03
3235,48.95
3236,49.93
3237,50.90
3238,51.85
3239,52.55
3240,52.86
3241,52.83
3242,52.86
3243,53.04
3244,53.47
3245,53.96
3246,54.57
3247,55.27
3248,56.03
3249,56.73
3250,57.46
3251,58.20
3252,58.84
3253,59.30
3254,59.63
3255,59.84
3256,60.06
3257,60.30
3258,60.55
3259,60.79
3260,61.07
3261,61.28
3262,61.40
3263,61.40
3264,61.31
3265,61.07
3266,60.67
3267,60.18
3268,59.72
3269,59.48
3270,59.51
3271,59.75
3272,60.12
3273,60.64
3274,61.22
3275,61.71
3276,61.83
3277,61.61
3278,61.16
3279,60.64
3280,60.12
3281,59.66
3282,59.39
3283,59.39
3284,59.57
3285,59.81
3286,60.03
3287,60.30
3288,60.58
3289,60.82
3290,60.88
3291,60.91
3292,61.00
3293,61.22
3294,61.40
3295,61.43
3296,61.34
3297,61.10
3298,60.58
3299,59.88
3300,59.17
3301,58.69
3302,58.35
3303,58.14
3304,58.01
3305,58.01
3306,58.04
3307,58.04
3308,58.04
3309,58.01
3310,58.01
3311,58.04
3312,58.04
3313,58.04
3314,57.98
3315,58.01
3316,58.14
3317,58.38
3318,58.62
3319,58.87
3320,59.11
3321,59.36
3322,59.54
3323,59.54
3324,59.39
3325,59.11
3326,58.81
3327,58.59
3328,58.53
3329,58.50
3330,58.50
3331,58.50
3332,58.62
3333,58.87
3334,59.02
3335,59.05
3336,58.93
3337,58.69
3338,58.26
3339,57.77
3340,57.40
3341,57.16
3342,56.98
3343,56.73
3344,56.49
3345,56.49
3346,56.79
3347,57.31
3348,57.74
3349,57.98
3350,58.11
3351,58.38
3352,58.72
3353,58.96
3354,58.90
3355,58.69
3356,58.47
3357,58.23
3358,57.68
3359,56.73
3360,55.63
3361,54.63
3362,53.80
3363,53.10
3364,52.52
3365,52.28
3366,52.49
3367,53.01
3368,53.47
3369,53.71
3370,53.80
3371,53.80
3372,53.68
3373,53.44
3374,53.10
3375,52.83
3376,52.83
3377,53.10
3378,53.44
3379,53.71
3380,53.83
3381,53.83
3382,53.62
3383,53.41
3384,53.25
3385,53.22
3386,53.25
3387,53.28
3388,53.31
3389,53.28
3390,53.19
3391,52.95
3392,52.64
3393,52.40
3394,52.28
3395,52.28
3396,52.40
3397,52.61
3398,52.98
3399,53.47
3400,54.08
3401,54.53
3402,54.78
3403,54.78
3404,54.69
3405,54.66
3406,54.78
3407,55.02
3408,55.33
3409,55.57
3410,55.69
3411,55.69
3412,55.63
3413,55.63
3414,55.69
3415,55.69
3416,55.54
3417,55.30
3418,55.08
3419,55.08
3420,55.30
3421,55.54
3422,55.73
3423,55.73
3424,55.57
3425,55.30
3426,54.99
3427,54.75
3428,54.75
3429,54.99
3430,55.33
3431,55.60
3432,55.66
3433,55.63
3434,55.73
3435,55.97
3436,56.34
3437,56.55
3438,56.58
3439,56.58
3440,56.70
3441,56.95
3442,57.13
3443,57.19
3444,57.07
3445,56.76
3446,56.34
3447,55.88
3448,55.57
3449,55.30
3450,54.90
3451,54.44
3452,54.17
3453,54.14
3454,54.23
3455,54.26
3456,54.23
3457,54.23
3458,54.14
3459,53.92
3460,53.59
3461,53.31
3462,53.28
3463,53.56
3464,54.02
3465,54.50
3466,54.90
3467,55.11
3468,55.18
3469,55.21
3470,55.15
3471,54.90
3472,54.41
3473,53.68
3474,52.89
3475,52.15
3476,51.51
3477,51.03
3478,50.81
3479,51.06
3480,51.76
3481,52.73
3482,53.77
3483,54.75
3484,55.60
3485,56.30
3486,56.79
3487,57.04
3488,57.16
3489,57.13
3490,57.01
3491,56.76
3492,56.49
3493,56.21
3494,56.09
3495,56.09
3496,56.24
3497,56.46
3498,56.70
3499,56.98
3500,57.25
3501,57.46
3502,57.56
3503,57.56
3504,57.62
3505,57.86
3506,58.20
3507,58.47
3508,58.53
3509,58.53
3510,58.56
3511,58.56
3512,58.38
3513,58.17
3514,58.01
3515,58.01
3516,57.98
3517,57.74
3518,57.37
3519,57.13
3520,57.16
3521,57.40
3522,57.65
3523,57.89
3524,58.26
3525,58.75
3526,59.17
3527,59.45
3528,59.54
3529,59.51
3530,59.39
3531,59.17
3532,58.81
3533,58.35
3534,57.74
3535,57.01
3536,56.18
3537,55.48
3538,54.90
3539,54.44
3540,53.96
3541,53.50
3542,53.13
3543,52.86
3544,52.61
3545,52.43
3546,52.31
3547,52.31
3548,52.28
3549,52.31
3550,52.43
3551,52.67
3552,52.83
3553,52.83
3554,52.80
3555,52.76
3556,52.76
3557,52.80
3558,52.83
3559,52.83
3560,52.67
3561,52.46
3562,52.31
3563,52.28
3564,52.34
3565,52.34
3566,52.34
3567,52.31
3568,52.31
3569,52.34
3570,52.34
3571,52.34
3572,52.31
3573,52.31
3574,52.43
3575,52.64
3576,52.92
3577,53.16
3578,53.41
3579,53.65
3580,53.86
3581,54.11
3582,54.41
3583,54.66
3584,54.69
3585,54.41
3586,54.05
3587,53.80
3588,53.77
3589,53.77
3590,53.65
3591,53.44
3592,53.19
3593,52.92
3594,52.55
3595,52.09
3596,51.67
3597,51.39
3598,51.27
3599,51.27
3600,51.54
3601,52.03
3602,52.58
3603,53.10
3604,53.47
3605,53.68
3606,53.77
3607,53.77
3608,53.80
3609,53.77
3610,53.65
3611,53.44
3612,53.19
3613,52.95
3614,52.55
3615,52.06
3616,51.73
3617,51.73
3618,51.97
3619,52.25
3620,52.34
3621,52.37
3622,52.34
3623,52.34
3624,52.25
3625,52.00
3626,51.70
3627,51.45
3628,51.24
3629,51.03
3630,50.75
3631,50.51
3632,50.35
3633,50.32
3634,50.45
3635,50.72
3636,51.18
3637,51.61
3638,51.94
3639,52.22
3640,52.61
3641,53.04
3642,53.31
3643,53.34
3644,53.34
3645,53.31
3646,53.07
3647,52.61
3648,52.19
3649,51.91
3650,51.73
3651,51.51
3652,51.21
3653,50.99
3654,50.81
3655,50.57
3656,50.14
3657,49.71
3658,49.35
3659,49.10
3660,48.71
3661,48.28
3662,47.91
3663,47.67
3664,47.33
3665,46.91
3666,46.39
3667,45.87
3668,45.32
3669,44.89
3670,44.65
3671,44.65
3672,44.68
3673,44.71
3674,44.71
3675,44.71
3676,44.62
3677,44.37
3678,44.04
3679,43.82
3680,43.76
3681,43.73
3682,43.70
3683,43.73
3684,43.88
3685,44.10
3686,44.16
3687,43.95
3688,43.64
3689,43.37
3690,43.06
3691,42.88
3692,42.88
3693,43.09
3694,43.37
3695,43.64
3696,43.95
3697,44.40
3698,44.95
3699,45.47
3700,45.84
3701,46.05
3702,46.17
3703,46.17
3704,46.08
3705,45.81
3706,45.41
3707,44.95
3708,44.56
3709,44.28
3710,44.10
3711,44.13
3712,44.46
3713,44.95
3714,45.23
3715,45.29
3716,45.20
3717,44.92
3718,44.25
3719,43.33
3720,42.48
3721,41.96
3722,41.66
3723,41.47
3724,41.38
3725,41.38
3726,41.32
3727,41.08
3728,40.65
3729,40.19
3730,39.70
3731,39.25
3732,38.70
3733,38.21
3734,37.96
3735,37.96
3736,38.09
3737,38.12
3738,37.90
3739,37.66
3740,37.51
3741,37.51
3742,37.57
3743,37.60
3744,37.57
3745,37.54
3746,37.51
3747,37.54
3748,37.63
3749,37.63
3750,37.38
3751,36.90
3752,36.38
3753,36.13
3754,36.16
3755,36.41
3756,36.80
3757,37.29
3758,37.84
3759,38.33
3760,38.57
3761,38.57
3762,38.42
3763,38.18
3764,37.90
3765,37.63
3766,37.54
3767,37.78
3768,38.39
3769,39.09
3770,39.73
3771,40.22
3772,40.62
3773,40.83
3774,40.80
3775,40.56
3776,40.34
3777,40.31
3778,40.59
3779,41.08
3780,41.69
3781,42.39
3782,43.27
3783,44.22
3784,45.14
3785,45.84
3786,46.42
3787,46.84
3788,47.30
3789,47.76
3790,48.31
3791,49.04
3792,49.99
3793,50.90
3794,51.70
3795,52.19
3796,52.49
3797,52.70
3798,52.83
3799,52.83
3800,52.76
3801,52.73
3802,52.89
3803,53.10
3804,53.41
3805,53.65
3806,53.92
3807,54.11
3808,54.26
3809,54.53
3810,55.05
3811,55.76
3812,56.40
3813,56.92
3814,57.37
3815,57.83
3816,58.14
3817,58.14
3818,57.98
3819,57.71
3820,57.34
3821,56.88
3822,56.34
3823,55.85
3824,55.51
3825,55.27
3826,55.05
3827,54.81
3828,54.60
3829,54.60
3830,54.90
3831,55.39
3832,55.88
3833,56.34
3834,56.95
3835,57.65
3836,58.35
3837,58.87
3838,59.08
3839,59.05
3840,58.87
3841,58.62
3842,58.50
3843,58.47
3844,58.56
3845,58.81
3846,59.23
3847,59.72
3848,60.03
3849,60.03
3850,59.81
3851,59.60
3852,59.39
3853,59.14
3854,58.78
3855,58.32
3856,57.80
3857,57.31
3858,56.82
3859,56.40
3860,55.94
3861,55.45
3862,54.81
3863,54.14
3864,53.50
3865,53.01
3866,52.52
3867,52.09
3868,51.64
3869,51.18
3870,50.54
3871,49.84
3872,49.16
3873,48.71
3874,48.28
3875,47.82
3876,47.27
3877,46.78
3878,46.42
3879,46.20
3880,46.02
3881,45.75
3882,45.53
3883,45.53
3884,45.84
3885,46.30
3886,46.81
3887,47.30
3888,47.91
3889,48.58
3890,49.26
3891,49.77
3892,50.14
3893,50.32
3894,50.45
3895,50.42
3896,50.42
3897,50.42
3898,50.42
3899,50.42
3900,50.38
3901,50.38
3902,50.45
3903,50.45
3904,50.32
3905,50.08
3906,49.87
3907,49.87
3908,50.08
3909,50.32
3910,50.45
3911,50.45
3912,50.38
3913,50.38
3914,50.45
3915,50.45
3916,50.29
3917,50.05
3918,49.90
3919,49.90
3920,49.99
3921,49.99
3922,49.84
3923,49.59
3924,49.38
3925,49.10
3926,48.74
3927,48.28
3928,47.85
3929,47.61
3930,47.52
3931,47.52
3932,47.67
3933,47.91
3934,48.10
3935,48.10
3936,47.94
3937,47.70
3938,47.42
3939,47.18
3940,46.97
3941,46.72
3942,46.45
3943,46.20
3944,46.08
3945,46.08
3946,46.17
3947,46.14
3948,46.05
3949,46.05
3950,46.33
3951,47.03
3952,48.13
3953,49.35
3954,50.57
3955,51.48
3956,52.06
3957,52.31
3958,52.40
3959,52.37
3960,52.22
3961,51.97
3962,51.82
3963,51.79
3964,51.85
3965,51.85
3966,51.88
3967,51.85
3968,51.73
3969,51.51
3970,51.24
3971,50.99
3972,50.72
3973,50.51
3974,50.42
3975,50.38
3976,50.35
3977,50.38
3978,50.54
3979,50.78
3980,50.90
3981,50.90
3982,50.96
3983,51.21
3984,51.45
3985,51.45
3986,51.21
3987,50.99
3988,50.93
3989,50.90
3990,50.72
3991,50.51
3992,50.51
3993,50.72
3994,50.93
3995,50.96
3996,50.90
3997,50.87
3998,50.81
3999,50.60
4000,50.20
4001,49.71
4002,49.19
4003,48.71
4004,48.34
4005,48.10
4006,47.94
4007,47.97
4008,48.13
4009,48.37
4010,48.58
4011,48.83
4012,49.19
4013,49.68
4014,50.17
4015,50.42
4016,50.35
4017,50.11
4018,49.84
4019,49.59
4020,49.35
4021,49.07
4022,48.92
4023,48.92
4024,49.07
4025,49.35
4026,49.53
4027,49.56
4028,49.32
4029,48.83
4030,48.13
4031,47.42
4032,46.84
4033,46.33
4034,45.87
4035,45.65
4036,45.84
4037,46.30
4038,46.72
4039,47.00
4040,47.21
4041,47.45
4042,47.58
4043,47.30
4044,46.78
4045,46.30
4046,46.11
4047,46.08
4048,46.05
4049,46.08
4050,46.39
4051,46.81
4052,47.12
4053,47.18
4054,47.12
4055,47.06
4056,46.94
4057,46.75
4058,46.57
4059,46.54
4060,46.60
4061,46.60
4062,46.60
4063,46.60
4064,46.54
4065,46.33
4066,45.90
4067,45.41
4068,44.98
4069,44.74
4070,44.68
4071,44.68
4072,44.71
4073,44.71
4074,44.65
4075,44.68
4076,44.77
4077,45.01
4078,45.35
4079,45.84
4080,46.51
4081,47.24
4082,47.82
4083,48.03
4084,47.94
4085,47.70
4086,47.45
4087,47.21
4088,46.94
4089,46.69
4090,46.54
4091,46.51
4092,46.69
4093,46.94
4094,47.21
4095,47.45
4096,47.67
4097,47.94
4098,48.13
4099,48.13
4100,47.79
4101,47.33
4102,46.97
4103,46.66
4104,46.39
4105,46.20
4106,46.23
4107,46.45
4108,46.60
4109,46.63
4110,46.66
4111,46.88
4112,47.24
4113,47.52
4114,47.58
4115,47.55
4116,47.67
4117,47.91
4118,48.07
4119,47.82
4120,47.21
4121,46.45
4122,45.93
4123,45.65
4124,45.56
4125,45.59
4126,45.84
4127,46.30
4128,46.81
4129,47.33
4130,47.88
4131,48.34
4132,48.52
4133,48.28
4134,47.79
4135,47.27
4136,46.94
4137,46.66
4138,46.51
4139,46.54
4140,46.75
4141,47.00
4142,47.03
4143,46.78
4144,46.45
4145,46.20
4146,45.99
4147,45.78
4148,45.56
4149,45.53
4150,45.81
4151,46.30
4152,46.84
4153,47.36
4154,47.79
4155,47.97
4156,47.94
4157,47.73
4158,47.45
4159,47.18
4160,46.91
4161,46.66
4162,46.63
4163,46.84
4164,47.30
4165,47.79
4166,48.28
4167,48.74
4168,49.19
4169,49.74
4170,50.17
4171,50.38
4172,50.29
4173,50.11
4174,49.90
4175,49.62
4176,49.13
4177,48.40
4178,47.79
4179,47.52
4180,47.58
4181,47.85
4182,48.28
4183,48.74
4184,49.10
4185,49.38
4186,49.62
4187,49.84
4188,49.96
4189,49.99
4190,49.96
4191,49.99
4192,49.90
4193,49.62
4194,49.29
4195,49.07
4196,48.95
4197,48.71
4198,48.16
4199,47.45
4200,46.88
4201,46.63
4202,46.51
4203,46.30
4204,45.99
4205,45.72
4206,45.59
4207,45.62
4208,45.68
4209,45.68
4210,45.53
4211,45.29
4212,45.14
4213,45.14
4214,45.20
4215,45.23
4216,45.17
4217,44.89
4218,44.40
4219,43.95
4220,43.70
4221,43.67
4222,43.73
4223,43.76
4224,43.85
4225,44.04
4226,44.31
4227,44.59
4228,44.86
4229,45.07
4230,45.17
4231,45.20
4232,45.26
4233,45.23
4234,44.98
4235,44.49
4236,44.04
4237,43.76
4238,43.67
4239,43.73
4240,43.88
4241,44.10
4242,44.19
4243,44.22
4244,44.28
4245,44.25
4246,44.01
4247,43.52
4248,43.15
4249,43.09
4250,43.43
4251,43.95
4252,44.53
4253,44.98
4254,45.32
4255,45.56
4256,45.78
4257,46.02
4258,46.20
4259,46.20
4260,46.02
4261,45.78
4262,45.53
4263,45.29
4264,45.04
4265,44.80
4266,44.65
4267,44.65
4268,44.77
4269,45.01
4270,45.41
4271,45.90
4272,46.33
4273,46.54
4274,46.57
4275,46.60
4276,46.63
4277,46.63
4278,46.45
4279,46.23
4280,46.17
4281,46.39
4282,46.78
4283,47.30
4284,47.91
4285,48.61
4286,49.29
4287,49.80
4288,50.08
4289,50.08
4290,49.68
4291,48.95
4292,48.10
4293,47.36
4294,46.88
4295,46.63
4296,46.54
4297,46.57
4298,46.63
4299,46.63
4300,46.48
4301,46.26
4302,46.08
4303,46.08
4304,46.17
4305,46.42
4306,46.84
4307,47.33
4308,47.70
4309,47.73
4310,47.33
4311,46.60
4312,45.59
4313,44.37
4314,43.12
4315,42.11
4316,41.72
4317,41.96
4318,42.72
4319,43.70
4320,44.68
4321,45.68
4322,46.60
4323,47.33
4324,47.64
4325,47.42
4326,46.72
4327,45.75
4328,44.56
4329,43.37
4330,42.39
4331,41.63
4332,41.05
4333,40.86
4334,41.14
4335,41.56
4336,41.84
4337,41.90
4338,41.96
4339,42.14
4340,42.27
4341,42.36
4342,42.48
4343,42.69
4344,42.72
4345,42.51
4346,42.24
4347,41.99
4348,41.53
4349,40.83
4350,40.07
4351,39.55
4352,39.43
4353,39.46
4354,39.34
4355,39.12
4356,38.94
4357,38.94
4358,39.00
4359,39.00
4360,39.00
4361,39.25
4362,39.73
4363,40.22
4364,40.44
4365,40.47
4366,40.56
4367,40.74
4368,40.86
4369,40.92
4370,41.02
4371,41.20
4372,41.44
4373,41.72
4374,42.08
4375,42.54
4376,43.00
4377,43.24
4378,43.30
4379,43.27
4380,43.24
4381,43.27
4382,43.27
4383,43.03
4384,42.45
4385,41.72
4386,41.20
4387,40.92
4388,40.74
4389,40.56
4390,40.41
4391,40.37
4392,40.41
4393,40.44
4394,40.44
4395,40.44
4396,40.37
4397,40.41
4398,40.50
4399,40.74
4400,41.02
4401,41.26
4402,41.47
4403,41.75
4404,41.93
4405,41.93
4406,41.63
4407,41.14
4408,40.71
4409,40.50
4410,40.34
4411,40.13
4412,39.73
4413,39.25
4414,38.73
4415,38.27
4416,37.81
4417,37.32
4418,36.77
4419,36.29
4420,36.01
4421,36.01
4422,36.22
4423,36.50
4424,36.68
4425,36.65
4426,36.47
4427,36.22
4428,36.04
4429,36.04
4430,36.25
4431,36.71
4432,37.54
4433,38.73
4434,40.22
4435,41.72
4436,42.82
4437,43.27
4438,43.12
4439,42.63
4440,42.05
4441,41.56
4442,41.17
4443,40.92
4444,40.95
4445,41.17
4446,41.50
4447,41.78
4448,41.90
4449,41.87
4450,41.69
4451,41.47
4452,41.35
4453,41.32
4454,41.38
4455,41.63
4456,42.18
4457,42.88
4458,43.52
4459,44.01
4460,44.53
4461,45.01
4462,45.20
4463,44.98
4464,44.46
4465,43.95
4466,43.58
4467,43.33
4468,43.21
4469,43.21
4470,43.40
4471,43.64
4472,43.79
4473,43.82
4474,43.67
4475,43.43
4476,43.06
4477,42.57
4478,42.08
4479,41.84
4480,41.90
4481,42.14
4482,42.45
4483,42.69
4484,42.94
4485,43.18
4486,43.30
4487,43.30
4488,43.21
4489,43.21
4490,43.40
4491,43.64
4492,43.76
4493,43.79
4494,43.82
4495,43.79
4496,43.52
4497,43.09
4498,42.69
4499,42.42
4500,42.08
4501,41.66
4502,41.20
4503,40.95
4504,40.80
4505,40.59
4506,40.19
4507,39.73
4508,39.22
4509,38.70
4510,38.27
4511,38.06
4512,38.18
4513,38.67
4514,39.25
4515,39.76
4516,40.13
4517,40.37
4518,40.41
4519,40.16
4520,39.67
4521,39.22
4522,38.85
4523,38.60
4524,38.36
4525,38.15
4526,38.02
4527,37.99
4528,38.02
4529,38.06
4530,38.09
4531,38.09
4532,37.93
4533,37.69
4534,37.48
4535,37.48
4536,37.69
4537,37.93
4538,38.12
4539,38.36
4540,38.76
4541,39.22
4542,39.55
4543,39.55
4544,39.37
4545,39.09
4546,38.85
4547,38.60
4548,38.42
4549,38.42
4550,38.70
4551,39.15
4552,39.67
4553,40.19
4554,40.71
4555,41.17
4556,41.47
4557,41.47
4558,41.29
4559,41.02
4560,40.74
4561,40.50
4562,40.37
4563,40.41
4564,40.47
4565,40.47
4566,40.31
4567,40.04
4568,39.89
4569,39.89
4570,39.95
4571,39.95
4572,39.92
4573,39.92
4574,39.98
4575,39.98
4576,39.83
4577,39.58
4578,39.40
4579,39.37
4580,39.52
4581,39.79
4582,40.10
4583,40.37
4584,40.41
4585,40.19
4586,39.64
4587,38.91
4588,38.09
4589,37.35
4590,36.87
4591,36.65
4592,36.59
4593,36.62
4594,36.59
4595,36.62
4596,36.62
4597,36.65
4598,36.53
4599,36.29
4600,35.98
4601,35.77
4602,35.55
4603,35.34
4604,35.00
4605,34.52
4606,33.91
4607,33.45
4608,33.23
4609,33.23
4610,33.26
4611,33.26
4612,33.36
4613,33.60
4614,33.84
4615,33.81
4616,33.57
4617,33.36
4618,33.36
4619,33.57
4620,33.84
4621,34.09
4622,34.45
4623,34.91
4624,35.37
4625,35.64
4626,35.64
4627,35.34
4628,34.97
4629,34.73
4630,34.76
4631,34.97
4632,35.34
4633,35.83
4634,36.56
4635,37.51
4636,38.48
4637,39.22
4638,39.70
4639,39.89
4640,39.86
4641,39.61
4642,39.37
4643,39.09
4644,38.79
4645,38.57
4646,38.60
4647,38.82
4648,39.06
4649,39.34
4650,39.67
4651,40.16
4652,40.62
4653,40.86
4654,40.89
4655,40.89
4656,40.89
4657,40.86
4658,40.86
4659,40.89
4660,40.92
4661,40.89
4662,40.83
4663,40.83
4664,41.08
4665,41.56
4666,42.02
4667,42.30
4668,42.30
4669,42.05
4670,41.53
4671,40.83
4672,40.01
4673,39.31
4674,38.79
4675,38.51
4676,38.51
4677,38.79
4678,39.28
4679,39.76
4680,39.98
4681,39.73
4682,39.12
4683,38.39
4684,37.75
4685,37.26
4686,36.90
4687,36.65
4688,36.62
4689,36.87
4690,37.32
4691,37.81
4692,38.18
4693,38.45
4694,38.60
4695,38.57
4696,38.27
4697,37.81
4698,37.41
4699,37.14
4700,36.93
4701,36.71
4702,36.59
4703,36.56
4704,36.59
4705,36.59
4706,36.68
4707,36.90
4708,37.23
4709,37.51
4710,37.57
4711,37.57
4712,37.63
4713,37.87
4714,38.21
4715,38.48
4716,38.48
4717,38.24
4718,37.84
4719,37.35
4720,36.77
4721,36.04
4722,35.28
4723,34.55
4724,34.00
4725,33.75
4726,33.78
4727,34.06
4728,34.45
4729,34.91
4730,35.40
4731,35.95
4732,36.29
4733,36.29
4734,35.80
4735,35.10
4736,34.45
4737,33.94
4738,33.42
4739,32.96
4740,32.84
4741,33.05
4742,33.39
4743,33.66
4744,33.87
4745,34.12
4746,34.27
4747,34.24
4748,34.21
4749,34.45
4750,35.06
4751,35.77
4752,36.32
4753,36.56
4754,36.74
4755,36.96
4756,37.11
4757,37.11
4758,37.08
4759,37.05
4760,37.08
4761,37.08
4762,37.05
4763,37.08
4764,37.11
4765,37.11
4766,36.93
4767,36.74
4768,36.59
4769,36.56
4770,36.56
4771,36.59
4772,36.74
4773,36.99
4774,37.02
4775,36.80
4776,36.47
4777,36.19
4778,36.01
4779,35.80
4780,35.52
4781,35.28
4782,35.13
4783,35.13
4784,35.25
4785,35.52
4786,35.83
4787,36.04
4788,36.13
4789,36.16
4790,36.10
4791,35.86
4792,35.34
4793,34.61
4794,33.94
4795,33.42
4796,33.14
4797,33.14
4798,33.60
4799,34.55
4800,35.83
4801,37.02
4802,37.99
4803,38.73
4804,39.25
4805,39.46
4806,39.28
4807,38.79
4808,38.30
4809,38.06
4810,38.09
4811,38.33
4812,38.76
4813,39.22
4814,39.61
4815,39.89
4816,40.04
4817,40.04
4818,39.70
4819,38.97
4820,38.02
4821,37.08
4822,36.19
4823,35.46
4824,34.88
4825,34.70
4826,34.85
4827,35.10
4828,35.06
4829,34.85
4830,34.70
4831,34.67
4832,34.52
4833,34.09
4834,33.48
4835,32.99
4836,32.56
4837,32.17
4838,31.56
4839,30.82
4840,29.97
4841,29.27
4842,28.84
4843,28.63
4844,28.32
4845,27.83
4846,27.31
4847,26.82
4848,26.31
4849,25.60
4850,24.72
4851,23.99
4852,23.65
4853,23.68
4854,23.77
4855,23.80
4856,23.71
4857,23.74
4858,23.80
4859,23.83
4860,23.59
4861,23.13
4862,22.46
4863,21.73
4864,21.03
4865,20.54
4866,20.42
4867,20.66
4868,21.12
4869,21.61
4870,22.06
4871,22.52
4872,23.04
4873,23.56
4874,23.90
4875,23.90
4876,23.59
4877,23.07
4878,22.49
4879,22.03
4880,21.70
4881,21.48
4882,21.27
4883,21.03
4884,20.78
4885,20.51
4886,20.26
4887,20.02
4888,19.87
4889,19.90
4890,20.05
4891,20.26
4892,20.48
4893,20.75
4894,21.09
4895,21.30
4896,21.33
4897,21.33
4898,21.55
4899,22.00
4900,22.55
4901,23.04
4902,23.56
4903,24.26
4904,25.15
4905,25.85
4906,26.31
4907,26.52
4908,26.76
4909,27.19
4910,27.86
4911,28.59
4912,29.39
4913,30.06
4914,30.67
4915,31.13
4916,31.62
4917,32.04
4918,32.50
4919,32.99
4920,33.72
4921,34.64
4922,35.68
4923,36.65
4924,37.54
4925,38.24
4926,38.67
4927,38.91
4928,39.22
4929,39.67
4930,40.16
4931,40.44
4932,40.44
4933,40.13
4934,39.67
4935,39.22
4936,38.85
4937,38.60
4938,38.36
4939,38.12
4940,38.06
4941,38.30
4942,38.70
4943,38.97
4944,38.91
4945,38.67
4946,38.42
4947,38.18
4948,37.81
4949,37.32
4950,36.90
4951,36.62
4952,36.56
4953,36.59
4954,36.71
4955,36.90
4956,37.20
4957,37.75
4958,38.45
4959,39.12
4960,39.61
4961,39.86
4962,40.10
4963,40.34
4964,40.37
4965,40.16
4966,39.79
4967,39.52
4968,39.37
4969,39.40
4970,39.58
4971,39.83
4972,40.01
4973,40.01
4974,39.79
4975,39.58
4976,39.40
4977,39.15
4978,38.70
4979,38.27
4980,38.06
4981,37.99
4982,37.90
4983,37.72
4984,37.60
4985,37.57
4986,37.35
4987,36.93
4988,36.41
4989,35.89
4990,35.31
4991,34.61
4992,33.94
4993,33.45
4994,33.11
4995,32.90
4996,32.75
4997,32.75
4998,32.87
4999,33.14
5000,33.42
5001,33.69
5002,33.75
5003,33.51
5004,32.99
5005,32.50
5006,32.23
5007,32.26
5008,32.32
5009,32.35
5010,32.29
5011,32.32
5012,32.32
5013,32.10
5014,31.46
5015,30.49
5016,29.42
5017,28.47
5018,27.59
5019,26.89
5020,26.46
5021,26.46
5022,26.73
5023,27.01
5024,27.07
5025,26.82
5026,26.31
5027,25.57
5028,24.72
5029,24.02
5030,23.62
5031,23.62
5032,23.93
5033,24.44
5034,24.99
5035,25.48
5036,25.76
5037,25.76
5038,25.48
5039,24.99
5040,24.38
5041,23.93
5042,23.71
5043,23.71
5044,23.74
5045,23.74
5046,23.86
5047,24.08
5048,24.26
5049,24.26
5050,24.20
5051,24.20
5052,24.23
5053,24.26
5054,24.14
5055,23.93
5056,23.62
5057,23.35
5058,23.19
5059,23.22
5060,23.41
5061,23.62
5062,23.83
5063,24.08
5064,24.48
5065,24.93
5066,25.24
5067,25.24
5068,25.12
5069,25.09
5070,25.24
5071,25.51
5072,25.82
5073,26.03
5074,26.25
5075,26.46
5076,26.76
5077,27.04
5078,27.07
5079,26.82
5080,26.34
5081,25.88
5082,25.48
5083,24.99
5084,24.32
5085,23.59
5086,23.10
5087,23.10
5088,23.44
5089,23.99
5090,24.51
5091,24.96
5092,25.30
5093,25.57
5094,25.76
5095,25.76
5096,25.45
5097,24.99
5098,24.51
5099,24.26
5100,24.20
5101,24.23
5102,24.23
5103,24.23
5104,24.17
5105,23.96
5106,23.47
5107,22.77
5108,21.91
5109,21.18
5110,20.66
5111,20.45
5112,20.39
5113,20.39
5114,20.42
5115,20.39
5116,20.36
5117,20.39
5118,20.45
5119,20.45
5120,20.26
5121,20.05
5122,19.93
5123,19.90
5124,19.93
5125,19.93
5126,20.02
5127,20.23
5128,20.57
5129,20.81
5130,20.90
5131,20.90
5132,20.90
5133,20.90
5134,20.81
5135,20.57
5136,20.26
5137,20.02
5138,19.90
5139,19.93
5140,19.96
5141,19.99
5142,19.93
5143,19.93
5144,19.99
5145,20.26
5146,20.63
5147,20.87
5148,20.75
5149,20.29
5150,19.65
5151,18.89
5152,18.04
5153,17.09
5154,16.24
5155,15.75
5156,15.59
5157,15.59
5158,15.63
5159,15.66
5160,15.66
5161,15.66
5162,15.59
5163,15.59
5164,15.81
5165,16.27
5166,16.94
5167,17.67
5168,18.37
5169,18.86
5170,19.04
5171,18.77
5172,18.19
5173,17.46
5174,16.78
5175,16.27
5176,16.02
5177,16.02
5178,16.36
5179,16.82
5180,17.24
5181,17.52
5182,17.64
5183,17.61
5184,17.40
5185,17.18
5186,17.09
5187,17.06
5188,16.94
5189,16.72
5190,16.66
5191,16.88
5192,17.21
5193,17.49
5194,17.70
5195,17.91
5196,18.07
5197,18.07
5198,17.94
5199,17.97
5200,18.19
5201,18.43
5202,18.46
5203,18.22
5204,17.91
5205,17.64
5206,17.43
5207,17.18
5208,17.03
5209,17.00
5210,17.12
5211,17.40
5212,17.82
5213,18.28
5214,18.65
5215,18.92
5216,19.13
5217,19.35
5218,19.50
5219,19.53
5220,19.44
5221,19.17
5222,18.74
5223,18.28
5224,17.85
5225,17.36
5226,16.66
5227,15.72
5228,14.74
5229,14.01
5230,13.46
5231,13.03
5232,12.57
5233,12.08
5234,11.57
5235,11.08
5236,10.71
5237,10.47
5238,10.35
5239,10.35
5240,10.56
5241,11.05
5242,11.69
5243,12.42
5244,13.18
5245,13.89
5246,14.53
5247,15.01
5248,15.32
5249,15.50
5250,15.78
5251,16.27
5252,17.06
5253,17.97
5254,18.98
5255,19.93
5256,20.94
5257,21.85
5258,22.74
5259,23.44
5260,24.11
5261,24.78
5262,25.51
5263,26.21
5264,27.01
5265,27.95
5266,29.14
5267,30.33
5268,31.40
5269,32.07
5270,32.44
5271,32.68
5272,33.02
5273,33.45
5274,34.00
5275,34.73
5276,35.83
5277,36.99
5278,37.93
5279,38.42
5280,38.64
5281,38.57
5282,38.30
5283,37.84
5284,37.38
5285,37.08
5286,37.05
5287,37.32
5288,37.90
5289,38.60
5290,39.28
5291,39.76
5292,40.13
5293,40.37
5294,40.41
5295,40.16
5296,39.70
5297,39.22
5298,38.79
5299,38.54
5300,38.54
5301,38.79
5302,39.25
5303,39.70
5304,40.10
5305,40.37
5306,40.44
5307,40.22
5308,39.55
5309,38.57
5310,37.57
5311,36.87
5312,36.47
5313,36.22
5314,35.95
5315,35.77
5316,35.71
5317,35.68
5318,35.46
5319,35.00
5320,34.45
5321,33.94
5322,33.42
5323,32.99
5324,32.75
5325,32.71
5326,32.81
5327,32.84
5328,32.81
5329,32.75
5330,32.81
5331,33.08
5332,33.63
5333,34.33
5334,34.94
5335,35.46
5336,35.95
5337,36.41
5338,36.68
5339,36.71
5340,36.56
5341,36.29
5342,35.92
5343,35.46
5344,34.94
5345,34.45
5346,34.00
5347,33.54
5348,33.05
5349,32.56
5350,32.01
5351,31.56
5352,31.25
5353,31.01
5354,30.70
5355,30.49
5356,30.49
5357,30.73
5358,30.98
5359,31.25
5360,31.59
5361,32.07
5362,32.44
5363,32.47
5364,32.07
5365,31.31
5366,30.46
5367,29.75
5368,29.30
5369,29.05
5370,28.90
5371,28.90
5372,29.14
5373,29.60
5374,30.21
5375,30.73
5376,31.01
5377,30.98
5378,30.79
5379,30.55
5380,30.27
5381,30.03
5382,29.82
5383,29.57
5384,29.36
5385,29.08
5386,28.84
5387,28.63
5388,28.47
5389,28.44
5390,28.59
5391,29.08
5392,30.03
5393,31.22
5394,32.32
5395,33.08
5396,33.51
5397,33.69
5398,33.66
5399,33.45
5400,33.17
5401,32.90
5402,32.65
5403,32.41
5404,32.26
5405,32.26
5406,32.35
5407,32.35
5408,32.20
5409,31.95
5410,31.80
5411,31.80
5412,31.86
5413,31.86
5414,31.83
5415,31.83
5416,31.86
5417,31.89
5418,31.77
5419,31.52
5420,31.22
5421,30.98
5422,30.85
5423,30.88
5424,30.94
5425,30.94
5426,30.79
5427,30.58
5428,30.27
5429,29.75
5430,29.05
5431,28.35
5432,27.86
5433,27.56
5434,27.40
5435,27.47
5436,27.86
5437,28.56
5438,29.21
5439,29.75
5440,30.27
5441,30.70
5442,30.85
5443,30.64
5444,30.27
5445,30.00
5446,29.82
5447,29.57
5448,29.39
5449,29.39
5450,29.60
5451,29.82
5452,29.91
5453,29.97
5454,30.00
5455,29.97
5456,29.69
5457,29.24
5458,28.90
5459,28.90
5460,28.99
5461,29.02
5462,28.99
5463,28.99
5464,28.93
5465,28.72
5466,28.26
5467,27.77
5468,27.40
5469,27.16
5470,26.92
5471,26.67
5472,26.61
5473,26.86
5474,27.34
5475,27.83
5476,28.20
5477,28.41
5478,28.63
5479,28.87
5480,29.11
5481,29.36
5482,29.54
5483,29.79
5484,30.15
5485,30.36
5486,30.30
5487,30.06
5488,29.94
5489,29.91
5490,29.82
5491,29.60
5492,29.45
5493,29.69
5494,30.21
5495,30.73
5496,30.94
5497,30.98
5498,30.94
5499,30.91
5500,30.79
5501,30.58
5502,30.40
5503,30.36
5504,30.40
5505,30.43
5506,30.49
5507,30.46
5508,30.21
5509,29.79
5510,29.30
5511,28.78
5512,28.11
5513,27.44
5514,26.92
5515,26.64
5516,26.46
5517,26.28
5518,26.12
5519,26.09
5520,26.12
5521,26.15
5522,26.15
5523,26.15
5524,26.06
5525,25.85
5526,25.48
5527,24.99
5528,24.35
5529,23.65
5530,22.95
5531,22.46
5532,22.22
5533,22.25
5534,22.43
5535,22.67
5536,22.83
5537,22.83
5538,22.74
5539,22.74
5540,22.86
5541,23.10
5542,23.41
5543,23.65
5544,23.90
5545,24.11
5546,24.32
5547,24.54
5548,24.90
5549,25.39
5550,25.91
5551,26.37
5552,26.79
5553,27.25
5554,27.89
5555,28.63
5556,29.30
5557,29.75
5558,30.09
5559,30.30
5560,30.52
5561,30.76
5562,31.07
5563,31.28
5564,31.34
5565,31.34
5566,31.46
5567,31.68
5568,31.95
5569,32.20
5570,32.50
5571,32.99
5572,33.57
5573,34.06
5574,34.36
5575,34.58
5576,34.85
5577,35.10
5578,35.13
5579,34.91
5580,34.52
5581,34.00
5582,33.42
5583,32.71
5584,31.95
5585,31.22
5586,30.55
5587,30.09
5588,29.88
5589,29.88
5590,29.88
5591,29.91
5592,30.06
5593,30.27
5594,30.43
5595,30.46
5596,30.46
5597,30.43
5598,30.30
5599,30.09
5600,29.82
5601,29.57
5602,29.30
5603,29.08
5604,28.96
5605,28.93
5606,28.93
5607,28.96
5608,29.08
5609,29.30
5610,29.54
5611,29.79
5612,30.15
5613,30.61
5614,31.10
5615,31.59
5616,32.23
5617,32.93
5618,33.54
5619,33.78
5620,33.69
5621,33.42
5622,33.14
5623,32.93
5624,32.68
5625,32.41
5626,32.20
5627,32.20
5628,32.53
5629,33.02
5630,33.45
5631,33.72
5632,33.81
5633,33.78
5634,33.63
5635,33.42
5636,33.23
5637,32.96
5638,32.50
5639,31.83
5640,30.94
5641,29.97
5642,28.90
5643,27.95
5644,27.31
5645,27.07
5646,27.07
5647,27.34
5648,27.92
5649,28.63
5650,29.14
5651,29.45
5652,29.54
5653,29.51
5654,29.27
5655,28.81
5656,28.32
5657,28.08
5658,28.02
5659,28.05
5660,28.02
5661,28.02
5662,28.11
5663,28.35
5664,28.69
5665,28.90
5666,28.99
5667,28.99
5668,28.99
5669,28.99
5670,28.93
5671,28.96
5672,29.08
5673,29.33
5674,29.54
5675,29.54
5676,29.39
5677,29.11
5678,28.81
5679,28.59
5680,28.53
5681,28.53
5682,28.44
5683,28.20
5684,27.86
5685,27.62
5686,27.50
5687,27.50
5688,27.59
5689,27.83
5690,28.35
5691,29.05
5692,29.82
5693,30.58
5694,31.25
5695,31.74
5696,31.83
5697,31.59
5698,31.19
5699,30.94
5700,30.91
5701,30.88
5702,30.88
5703,30.88
5704,30.98
5705,30.98
5706,30.70
5707,30.21
5708,29.75
5709,29.48
5710,29.39
5711,29.42
5712,29.63
5713,30.06
5714,30.73
5715,31.49
5716,32.23
5717,32.68
5718,32.75
5719,32.47
5720,32.26
5721,32.20
5722,32.38
5723,32.65
5724,33.02
5725,33.48
5726,34.00
5727,34.48
5728,34.88
5729,35.16
5730,35.16
5731,34.88
5732,34.48
5733,34.27
5734,34.33
5735,34.55
5736,34.70
5737,34.73
5738,34.76
5739,34.73
5740,34.48
5741,34.03
5742,33.54
5743,33.29
5744,33.29
5745,33.54
5746,34.03
5747,34.79
5748,35.58
5749,36.07
5750,35.98
5751,35.25
5752,34.12
5753,32.90
5754,31.74
5755,30.79
5756,30.12
5757,29.88
5758,30.06
5759,30.58
5760,31.19
5761,31.71
5762,31.95
5763,31.92
5764,31.71
5765,31.46
5766,31.31
5767,31.31
5768,31.37
5769,31.37
5770,31.34
5771,31.34
5772,31.37
5773,31.37
5774,31.31
5775,31.34
5776,31.46
5777,31.71
5778,31.95
5779,32.20
5780,32.47
5781,32.68
5782,32.81
5783,32.84
5784,32.81
5785,32.81
5786,32.75
5787,32.47
5788,32.14
5789,31.92
5790,31.89
5791,31.86
5792,31.68
5793,31.46
5794,31.46
5795,31.68
5796,31.86
5797,31.92
5798,31.89
5799,31.86
5800,31.71
5801,31.49
5802,31.37
5803,31.34
5804,31.25
5805,31.04
5806,30.85
5807,30.85
5808,30.91
5809,30.94
5810,30.88
5811,30.85
5812,30.98
5813,31.22
5814,31.46
5815,31.74
5816,31.98
5817,32.26
5818,32.32
5819,32.07
5820,31.56
5821,31.07
5822,30.85
5823,30.85
5824,30.88
5825,30.91
5826,31.01
5827,31.22
5828,31.43
5829,31.46
5830,31.25
5831,31.01
5832,30.85
5833,30.85
5834,30.94
5835,30.98
5836,30.79
5837,30.52
5838,30.36
5839,30.36
5840,30.46
5841,30.49
5842,30.33
5843,30.06
5844,29.75
5845,29.54
5846,29.48
5847,29.48
5848,29.36
5849,29.11
5850,28.93
5851,28.93
5852,28.99
5853,29.02
5854,28.99
5855,28.96
5856,28.96
5857,28.99
5858,28.99
5859,28.96
5860,28.96
5861,28.96
5862,29.02
5863,29.02
5864,28.87
5865,28.63
5866,28.50
5867,28.47
5868,28.50
5869,28.50
5870,28.63
5871,28.84
5872,29.05
5873,29.05
5874,28.87
5875,28.59
5876,28.50
5877,28.75
5878,29.27
5879,30.00
5880,30.82
5881,31.56
5882,32.07
5883,32.32
5884,32.26
5885,32.01
5886,31.71
5887,31.43
5888,31.28
5889,31.28
5890,31.49
5891,31.74
5892,31.89
5893,31.89
5894,31.83
5895,31.80
5896,31.89
5897,32.14
5898,32.53
5899,33.02
5900,33.54
5901,34.03
5902,34.42
5903,34.64
5904,34.70
5905,34.70
5906,34.73
5907,34.73
5908,34.58
5909,34.33
5910,34.21
5911,34.21
5912,34.18
5913,33.94
5914,33.57
5915,33.33
5916,33.33
5917,33.57
5918,33.87
5919,34.12
5920,34.36
5921,34.58
5922,34.76
5923,34.76
5924,34.61
5925,34.36
5926,34.12
5927,33.87
5928,33.60
5929,33.39
5930,33.23
5931,33.23
5932,33.36
5933,33.60
5934,33.87
5935,34.12
5936,34.30
5937,34.33
5938,34.09
5939,33.57
5940,32.96
5941,32.50
5942,32.20
5943,31.98
5944,31.65
5945,31.16
5946,30.70
5947,30.49
5948,30.36
5949,30.12
5950,29.63
5951,29.17
5952,28.93
5953,28.90
5954,28.96
5955,28.99
5956,29.08
5957,29.30
5958,29.54
5959,29.82
5960,30.12
5961,30.33
5962,30.30
5963,30.09
5964,29.91
5965,29.85
5966,29.91
5967,29.94
5968,30.00
5969,30.21
5970,30.58
5971,31.07
5972,31.71
5973,32.44
5974,33.08
5975,33.57
5976,33.91
5977,34.12
5978,34.30
5979,34.55
5980,34.88
5981,35.10
5982,35.19
5983,35.16
5984,35.28
5985,35.52
5986,35.77
5987,35.74
5988,35.55
5989,35.55
5990,35.95
5991,36.62
5992,37.41
5993,38.18
5994,38.91
5995,39.61
5996,40.13
5997,40.41
5998,40.50
5999,40.47
6000,40.34
6001,40.10
6002,39.79
6003,39.55
6004,39.37
6005,39.15
6006,38.79
6007,38.33
6008,37.81
6009,37.29
6010,36.80
6011,36.38
6012,35.95
6013,35.46
6014,34.79
6015,34.12
6016,33.51
6017,32.99
6018,32.47
6019,32.04
6020,31.83
6021,31.80
6022,31.71
6023,31.56
6024,31.31
6025,31.04
6026,30.58
6027,29.91
6028,29.17
6029,28.41
6030,27.50
6031,26.61
6032,25.85
6033,25.33
6034,24.87
6035,24.44
6036,24.14
6037,24.14
6038,24.26
6039,24.29
6040,24.11
6041,23.90
6042,23.65
6043,23.41
6044,23.04
6045,22.58
6046,22.16
6047,21.88
6048,21.76
6049,21.79
6050,21.94
6051,22.19
6052,22.43
6053,22.67
6054,22.95
6055,23.19
6056,23.25
6057,23.01
6058,22.55
6059,22.06
6060,21.67
6061,21.45
6062,21.36
6063,21.36
6064,21.39
6065,21.42
6066,21.33
6067,21.09
6068,20.63
6069,20.14
6070,19.87
6071,19.84
6072,20.02
6073,20.29
6074,20.57
6075,20.78
6076,20.87
6077,20.87
6078,21.00
6079,21.21
6080,21.48
6081,21.70
6082,22.03
6083,22.49
6084,23.07
6085,23.56
6086,23.90
6087,24.11
6088,24.38
6089,24.60
6090,24.72
6091,24.72
6092,24.78
6093,24.96
6094,25.36
6095,25.88
6096,26.49
6097,26.92
6098,27.10
6099,27.10
6100,27.19
6101,27.40
6102,27.62
6103,27.62
6104,27.50
6105,27.47
6106,27.65
6107,27.92
6108,28.08
6109,28.11
6110,28.02
6111,27.98
6112,28.08
6113,28.38
6114,28.75
6115,28.96
6116,28.81
6117,28.35
6118,27.83
6119,27.31
6120,26.70
6121,26.03
6122,25.48
6123,25.18
6124,25.05
6125,25.15
6126,25.36
6127,25.60
6128,25.48
6129,25.05
6130,24.48
6131,23.99
6132,23.47
6133,22.77
6134,21.88
6135,21.15
6136,20.72
6137,20.51
6138,20.20
6139,19.74
6140,19.17
6141,18.71
6142,18.34
6143,18.10
6144,17.94
6145,17.94
6146,18.13
6147,18.40
6148,18.59
6149,18.59
6150,18.37
6151,18.13
6152,17.97
6153,17.97
6154,18.01
6155,18.01
6156,18.10
6157,18.31
6158,18.71
6159,19.20
6160,19.74
6161,20.20
6162,20.51
6163,20.75
6164,21.12
6165,21.55
6166,22.03
6167,22.52
6168,23.16
6169,23.83
6170,24.44
6171,24.93
6172,25.54
6173,26.21
6174,26.86
6175,27.37
6176,27.83
6177,28.29
6178,28.66
6179,28.90
6180,29.17
6181,29.36
6182,29.45
6183,29.48
6184,29.60
6185,29.79
6186,29.94
6187,29.94
6188,30.03
6189,30.24
6190,30.49
6191,30.76
6192,31.16
6193,31.59
6194,32.01
6195,32.26
6196,32.38
6197,32.35
6198,32.20
6199,31.95
6200,31.86
6201,32.04
6202,32.59
6203,33.36
6204,34.18
6205,34.88
6206,35.37
6207,35.64
6208,35.71
6209,35.68
6210,35.64
6211,35.64
6212,35.77
6213,36.01
6214,36.19
6215,36.22
6216,35.98
6217,35.49
6218,34.82
6219,34.09
6220,33.42
6221,32.96
6222,32.71
6223,32.71
6224,32.93
6225,33.42
6226,34.09
6227,34.85
6228,35.43
6229,35.71
6230,35.55
6231,35.03
6232,34.30
6233,33.60
6234,33.05
6235,32.81
6236,32.84
6237,33.08
6238,33.48
6239,34.00
6240,34.48
6241,34.70
6242,34.52
6243,34.03
6244,33.54
6245,33.29
6246,33.33
6247,33.60
6248,33.91
6249,34.18
6250,34.21
6251,34.00
6252,33.45
6253,32.71
6254,31.89
6255,31.19
6256,30.70
6257,30.46
6258,30.40
6259,30.40
6260,30.43
6261,30.43
6262,30.40
6263,30.40
6264,30.43
6265,30.46
6266,30.36
6267,30.12
6268,29.63
6269,29.21
6270,28.90
6271,28.63
6272,28.26
6273,27.77
6274,27.47
6275,27.44
6276,27.62
6277,27.86
6278,28.26
6279,28.72
6280,29.17
6281,29.42
6282,29.45
6283,29.45
6284,29.57
6285,29.79
6286,30.00
6287,30.24
6288,30.70
6289,31.40
6290,32.29
6291,33.02
6292,33.48
6293,33.69
6294,33.78
6295,33.78
6296,33.66
6297,33.45
6298,33.17
6299,32.90
6300,32.71
6301,32.71
6302,32.99
6303,33.48
6304,33.94
6305,34.21
6306,34.24
6307,33.97
6308,33.39
6309,32.68
6310,32.01
6311,31.52
6312,31.16
6313,30.94
6314,30.94
6315,31.19
6316,31.52
6317,31.77
6318,31.89
6319,31.89
6320,31.77
6321,31.52
6322,31.16
6323,30.70
6324,30.18
6325,29.66
6326,29.27
6327,29.05
6328,28.99
6329,28.99
6330,28.84
6331,28.66
6332,28.50
6333,28.50
6334,28.41
6335,28.23
6336,27.92
6337,27.65
6338,27.40
6339,27.19
6340,27.04
6341,27.07
6342,27.13
6343,27.13
6344,26.98
6345,26.73
6346,26.49
6347,26.28
6348,25.94
6349,25.45
6350,24.90
6351,24.41
6352,24.02
6353,23.80
6354,23.80
6355,24.05
6356,24.35
6357,24.60
6358,24.81
6359,25.02
6360,25.27
6361,25.51
6362,25.82
6363,26.06
6364,26.15
6365,26.15
6366,26.18
6367,26.40
6368,26.82
6369,27.31
6370,27.74
6371,27.95
6372,28.05
6373,28.05
6374,28.08
6375,28.02
6376,27.95
6377,27.98
6378,28.29
6379,28.72
6380,29.05
6381,29.36
6382,29.79
6383,30.18
6384,30.40
6385,30.46
6386,30.61
6387,31.04
6388,31.56
6389,31.83
6390,31.92
6391,31.89
6392,31.74
6393,31.52
6394,31.28
6395,31.01
6396,30.76
6397,30.52
6398,30.40
6399,30.40
6400,30.43
6401,30.43
6402,30.40
6403,30.40
6404,30.43
6405,30.46
6406,30.36
6407,30.12
6408,29.69
6409,29.21
6410,28.81
6411,28.63
6412,28.44
6413,28.23
6414,27.86
6415,27.37
6416,26.76
6417,26.06
6418,25.21
6419,24.29
6420,23.19
6421,22.00
6422,20.72
6423,19.53
6424,18.55
6425,17.82
6426,17.27
6427,16.82
6428,16.45
6429,16.20
6430,16.02
6431,16.05
6432,16.27
6433,16.51
6434,16.63
6435,16.63
6436,16.66
6437,16.91
6438,17.24
6439,17.49
6440,17.58
6441,17.58
6442,17.64
6443,17.82
6444,18.19
6445,18.71
6446,19.38
6447,20.08
6448,20.60
6449,20.84
6450,20.97
6451,20.94
6452,20.78
6453,20.51
6454,20.39
6455,20.63
6456,21.24
6457,21.97
6458,22.64
6459,23.10
6460,23.41
6461,23.65
6462,23.86
6463,23.83
6464,23.59
6465,23.32
6466,23.41
6467,23.86
6468,24.54
6469,25.27
6470,26.15
6471,27.07
6472,27.89
6473,28.41
6474,28.59
6475,28.59
6476,28.44
6477,28.17
6478,27.86
6479,27.65
6480,27.53
6481,27.53
6482,27.53
6483,27.53
6484,27.65
6485,27.89
6486,28.14
6487,28.14
6488,27.86
6489,27.37
6490,26.82
6491,26.34
6492,25.97
6493,25.73
6494,25.63
6495,25.60
6496,25.70
6497,25.97
6498,26.40
6499,26.89
6500,27.16
6501,27.19
6502,27.04
6503,26.76
6504,26.34
6505,25.88
6506,25.54
6507,25.27
6508,24.96
6509,24.51
6510,23.99
6511,23.47
6512,23.04
6513,22.83
6514,22.86
6515,23.10
6516,23.38
6517,23.65
6518,23.90
6519,24.11
6520,24.23
6521,24.23
6522,24.23
6523,24.20
6524,24.20
6525,24.20
6526,24.29
6527,24.54
6528,24.87
6529,25.36
6530,26.00
6531,26.73
6532,27.37
6533,27.86
6534,28.20
6535,28.44
6536,28.56
6537,28.59
6538,28.47
6539,28.20
6540,27.86
6541,27.59
6542,27.59
6543,27.86
6544,28.23
6545,28.47
6546,28.50
6547,28.53
6548,28.59
6549,28.56
6550,28.32
6551,27.83
6552,27.37
6553,27.10
6554,27.01
6555,27.04
6556,27.25
6557,27.71
6558,28.32
6559,29.08
6560,29.94
6561,30.64
6562,31.01
6563,31.01
6564,30.85
6565,30.58
6566,30.15
6567,29.69
6568,29.39
6569,29.36
6570,29.57
6571,29.82
6572,30.03
6573,30.27
6574,30.58
6575,30.82
6576,30.88
6577,30.91
6578,31.01
6579,31.22
6580,31.43
6581,31.71
6582,32.10
6583,32.56
6584,32.87
6585,32.90
6586,32.75
6587,32.44
6588,32.07
6589,31.62
6590,31.22
6591,30.94
6592,30.88
6593,31.13
6594,31.74
6595,32.47
6596,32.96
6597,32.99
6598,32.56
6599,31.80
6600,30.82
6601,29.91
6602,29.17
6603,28.66
6604,28.35
6605,28.41
6606,28.84
6607,29.27
6608,29.39
6609,29.21
6610,28.93
6611,28.66
6612,28.17
6613,27.50
6614,26.82
6615,26.58
6616,26.64
6617,26.64
6618,26.49
6619,26.25
6620,26.12
6621,26.12
6622,26.03
6623,25.82
6624,25.57
6625,25.30
6626,24.93
6627,24.48
6628,24.05
6629,23.80
6630,23.71
6631,23.74
6632,23.83
6633,23.83
6634,23.56
6635,23.07
6636,22.55
6637,22.06
6638,21.58
6639,21.09
6640,20.75
6641,20.75
6642,21.09
6643,21.61
6644,22.06
6645,22.31
6646,22.25
6647,22.03
6648,21.67
6649,21.15
6650,20.54
6651,20.08
6652,19.99
6653,20.20
6654,20.51
6655,20.81
6656,21.09
6657,21.30
6658,21.33
6659,21.09
6660,20.75
6661,20.51
6662,20.32
6663,20.11
6664,19.78
6665,19.29
6666,18.71
6667,17.97
6668,17.09
6669,16.14
6670,15.20
6671,14.50
6672,14.07
6673,13.82
6674,13.64
6675,13.40
6676,13.12
6677,12.91
6678,12.70
6679,12.45
6680,12.15
6681,11.93
6682,11.84
6683,11.84
6684,11.84
6685,11.84
6686,11.93
6687,12.15
6688,12.42
6689,12.70
6690,12.94
6691,13.12
6692,13.37
6693,13.61
6694,13.92
6695,14.16
6696,14.25
6697,14.25
6698,14.28
6699,14.50
6700,14.92
6701,15.38
6702,15.90
6703,16.36
6704,16.88
6705,17.33
6706,17.76
6707,18.25
6708,18.86
6709,19.56
6710,20.32
6711,21.06
6712,21.76
6713,22.46
6714,23.10
6715,23.62
6716,23.90
6717,23.86
6718,23.59
6719,23.10
6720,22.46
6721,21.76
6722,21.03
6723,20.29
6724,19.62
6725,19.13
6726,18.92
6727,18.95
6728,19.07
6729,19.07
6730,18.83
6731,18.59
6732,18.55
6733,18.80
6734,19.10
6735,19.38
6736,19.59
6737,19.87
6738,19.96
6739,19.71
6740,19.13
6741,18.37
6742,17.73
6743,17.24
6744,16.91
6745,16.66
6746,16.66
6747,16.91
6748,17.24
6749,17.52
6750,17.55
6751,17.55
6752,17.67
6753,17.88
6754,18.10
6755,18.07
6756,17.97
6757,17.97
6758,18.16
6759,18.40
6760,18.55
6761,18.55
6762,18.49
6763,18.49
6764,18.49
6765,18.52
6766,18.52
6767,18.49
6768,18.46
6769,18.49
6770,18.59
6771,18.55
6772,18.34
6773,18.10
6774,18.13
6775,18.34
6776,18.52
6777,18.55
6778,18.59
6779,18.80
6780,19.17
6781,19.44
6782,19.41
6783,19.17
6784,18.86
6785,18.62
6786,18.37
6787,18.13
6788,17.97
6789,17.94
6790,18.10
6791,18.37
6792,18.65
6793,18.92
6794,19.07
6795,19.04
6796,18.89
6797,18.65
6798,18.43
6799,18.16
6800,17.82
6801,17.64
6802,17.64
6803,17.88
6804,18.07
6805,18.10
6806,17.97
6807,17.73
6808,17.27
6809,16.57
6810,15.72
6811,14.95
6812,14.43
6813,14.25
6814,14.31
6815,14.56
6816,14.77
6817,15.05
6818,15.41
6819,15.87
6820,16.27
6821,16.54
6822,16.75
6823,16.94
6824,17.15
6825,17.40
6826,17.82
6827,18.25
6828,18.62
6829,18.86
6830,19.26
6831,19.68
6832,20.05
6833,20.29
6834,20.60
6835,21.06
6836,21.67
6837,22.37
6838,23.28
6839,24.44
6840,25.88
6841,27.31
6842,28.72
6843,29.91
6844,30.88
6845,31.59
6846,32.04
6847,32.23
6848,32.41
6849,32.62
6850,33.02
6851,33.48
6852,34.00
6853,34.48
6854,34.91
6855,35.10
6856,35.13
6857,35.13
6858,35.40
6859,35.83
6860,36.29
6861,36.80
6862,37.57
6863,38.48
6864,39.31
6865,39.83
6866,40.13
6867,40.31
6868,40.44
6869,40.47
6870,40.47
6871,40.44
6872,40.31
6873,40.10
6874,39.86
6875,39.58
6876,39.25
6877,38.79
6878,38.27
6879,37.75
6880,37.35
6881,37.11
6882,37.11
6883,37.38
6884,37.75
6885,37.99
6886,37.99
6887,37.75
6888,37.35
6889,36.87
6890,36.32
6891,35.86
6892,35.61
6893,35.61
6894,35.68
6895,35.71
6896,35.68
6897,35.68
6898,35.61
6899,35.37
6900,34.94
6901,34.48
6902,34.03
6903,33.57
6904,32.93
6905,32.23
6906,31.59
6907,31.10
6908,30.64
6909,30.18
6910,29.75
6911,29.51
6912,29.42
6913,29.45
6914,29.51
6915,29.51
6916,29.36
6917,29.11
6918,28.87
6919,28.63
6920,28.38
6921,28.14
6922,27.98
6923,28.02
6924,28.05
6925,28.05
6926,28.02
6927,28.02
6928,28.08
6929,28.08
6930,27.92
6931,27.71
6932,27.44
6933,27.19
6934,26.92
6935,26.70
6936,26.58
6937,26.55
6938,26.55
6939,26.58
6940,26.70
6941,26.95
6942,27.16
6943,27.40
6944,27.80
6945,28.26
6946,28.69
6947,28.93
6948,29.02
6949,29.02
6950,28.87
6951,28.38
6952,27.56
6953,26.61
6954,25.79
6955,25.27
6956,25.05
6957,25.05
6958,25.39
6959,26.12
6960,27.07
6961,28.08
6962,28.90
6963,29.39
6964,29.45
6965,29.17
6966,28.81
6967,28.59
6968,28.50
6969,28.50
6970,28.53
6971,28.53
6972,28.53
6973,28.56
6974,28.44
6975,28.20
6976,27.86
6977,27.62
6978,27.50
6979,27.53
6980,27.56
6981,27.56
6982,27.53
6983,27.53
6984,27.59
6985,27.59
6986,27.44
6987,27.19
6988,27.07
6989,27.04
6990,27.07
6991,27.10
6992,27.13
6993,27.10
6994,26.95
6995,26.73
6996,26.55
6997,26.55
6998,26.61
6999,26.64
7000,26.58
7001,26.55
7002,26.64
7003,26.89
7004,27.31
7005,27.80
7006,28.23
7007,28.47
7008,28.53
7009,28.53
7010,28.56
7011,28.53
7012,28.44
7013,28.47
7014,28.75
7015,29.21
7016,29.60
7017,29.85
7018,30.09
7019,30.33
7020,30.36
7021,30.12
7022,29.75
7023,29.51
7024,29.45
7025,29.48
7026,29.39
7027,29.14
7028,28.84
7029,28.59
7030,28.47
7031,28.50
7032,28.53
7033,28.53
7034,28.50
7035,28.47
7036,28.56
7037,28.81
7038,29.14
7039,29.42
7040,29.42
7041,29.17
7042,28.81
7043,28.56
7044,28.56
7045,28.78
7046,29.17
7047,29.66
7048,30.21
7049,30.70
7050,31.04
7051,31.28
7052,31.52
7053,31.74
7054,31.86
7055,31.89
7056,31.89
7057,31.86
7058,31.74
7059,31.52
7060,31.25
7061,31.01
7062,30.76
7063,30.52
7064,30.36
7065,30.40
7066,30.46
7067,30.46
7068,30.30
7069,30.09
7070,29.79
7071,29.30
7072,28.50
7073,27.56
7074,26.76
7075,26.28
7076,25.94
7077,25.76
7078,25.70
7079,25.67
7080,25.48
7081,25.27
7082,25.27
7083,25.48
7084,25.67
7085,25.73
7086,25.70
7087,25.67
7088,25.48
7089,25.02
7090,24.48
7091,23.96
7092,23.56
7093,23.32
7094,23.32
7095,23.59
7096,23.93
7097,24.20
7098,24.20
7099,23.96
7100,23.53
7101,23.04
7102,22.52
7103,22.06
7104,21.64
7105,21.42
7106,21.42
7107,21.67
7108,22.00
7109,22.25
7110,22.37
7111,22.37
7112,22.28
7113,22.03
7114,21.58
7115,21.09
7116,20.78
7117,20.78
7118,21.03
7119,21.27
7120,21.45
7121,21.70
7122,22.09
7123,22.55
7124,22.86
7125,22.89
7126,22.71
7127,22.43
7128,22.16
7129,21.94
7130,21.85
7131,21.85
7132,21.73
7133,21.51
7134,21.33
7135,21.33
7136,21.39
7137,21.42
7138,21.36
7139,21.33
7140,21.45
7141,21.70
7142,21.97
7143,22.25
7144,22.43
7145,22.40
7146,22.13
7147,21.64
7148,21.21
7149,20.94
7150,20.81
7151,20.84
7152,21.09
7153,21.55
7154,22.06
7155,22.58
7156,23.04
7157,23.25
7158,23.10
7159,22.61
7160,22.16
7161,21.88
7162,21.73
7163,21.51
7164,21.27
7165,21.27
7166,21.58
7167,22.06
7168,22.49
7169,22.71
7170,22.86
7171,23.10
7172,23.44
7173,23.68
7174,23.77
7175,23.74
7176,23.83
7177,24.05
7178,24.35
7179,24.60
7180,24.84
7181,25.09
7182,25.21
7183,25.21
7184,25.15
7185,25.12
7186,25.24
7187,25.48
7188,25.85
7189,26.15
7190,26.15
7191,25.76
7192,25.27
7193,21.48
7194,22.37
7195,31.49
7196,33.63
7197,11.05
7198,-7.69
7199,38.48
7200,96.74
