1,22.94
2,36.87
3,45.30
4,52.70
5,63.42
6,76.45
7,86.69
8,91.71
9,90.56
10,84.06
11,72.42
12,58.58
13,45.29
14,36.30
15,33.26
16,37.14
17,47.00
18,60.98
19,76.81
20,91.90
21,104.80
22,113.95
23,119.24
24,119.92
25,116.23
26,107.85
27,95.26
28,79.03
29,60.58
30,41.63
31,24.38
32,10.53
33,1.53
34,-2.71
35,-2.52
36,0.21
37,4.33
38,7.84
39,10.38
40,11.18
41,11.06
42,10.26
43,9.71
44,9.57
45,10.03
46,10.81
47,11.59
48,12.15
49,12.28
50,12.10
51,11.73
52,11.38
53,11.19
54,11.13
55,11.15
56,11.12
57,11.01
58,10.77
59,10.44
60,10.01
61,9.57
62,9.16
63,8.84
64,8.62
65,8.48
66,8.32
67,8.14
68,7.86
69,7.53
70,7.12
71,6.64
72,6.03
73,5.39
74,4.69
75,4.07
76,3.48
77,2.96
78,2.43
79,1.95
80,1.43
81,0.93
82,0.38
83,-0.14
84,-0.66
85,-1.14
86,-1.59
87,-1.96
88,-2.24
89,-2.42
90,-2.53
91,-2.59
92,-2.58
93,-2.48
94,-2.27
95,-1.98
96,-1.60
97,-1.18
98,-0.73
99,-0.27
100,0.16
101,0.52
102,0.80
103,1.01
104,1.20
105,1.35
106,1.50
107,1.61
108,1.71
109,1.76
110,1.79
111,1.79
112,1.77
113,1.72
114,1.66
115,1.62
116,1.64
117,1.73
118,1.90
119,2.12
120,2.40
121,2.69
122,2.98
123,3.24
124,3.48
125,3.72
126,3.95
127,4.15
128,4.30
129,4.35
130,4.36
131,4.31
132,4.24
133,4.13
134,4.03
135,3.96
136,3.97
137,4.05
138,4.18
139,4.32
140,4.49
141,4.65
142,4.84
143,5.04
144,5.27
145,5.54
146,5.87
147,6.22
148,6.62
149,7.01
150,7.39
151,7.68
152,7.91
153,8.07
154,8.17
155,8.23
156,8.26
157,8.26
158,8.22
159,8.17
160,8.06
161,7.91
162,7.69
163,7.42
164,7.06
165,6.62
166,6.12
167,5.60
168,5.10
169,4.66
170,4.31
171,4.07
172,3.93
173,3.89
174,3.94
175,4.01
176,4.10
177,4.18
178,4.29
179,4.42
180,4.59
181,4.81
182,5.11
183,5.45
184,5.77
185,6.02
186,6.25
187,6.44
188,6.61
189,6.70
190,6.77
191,6.79
192,6.81
193,6.81
194,6.81
195,6.81
196,6.88
197,7.01
198,7.28
199,7.62
200,8.05
201,8.51
202,9.03
203,9.55
204,10.08
205,10.54
206,10.95
207,11.28
208,11.54
209,11.69
210,11.78
211,11.80
212,11.82
213,11.82
214,11.81
215,11.77
216,11.69
217,11.53
218,11.29
219,11.02
220,10.72
221,10.44
222,10.17
223,9.96
224,9.80
225,9.70
226,9.61
227,9.46
228,9.23
229,8.93
230,8.56
231,8.16
232,7.77
233,7.45
234,7.22
235,7.10
236,7.09
237,7.16
238,7.24
239,7.29
240,7.26
241,7.16
242,6.98
243,6.75
244,6.49
245,6.26
246,6.03
247,5.86
248,5.74
249,5.71
250,5.70
251,5.70
252,5.62
253,5.49
254,5.28
255,5.04
256,4.79
257,4.55
258,4.32
259,4.11
260,3.91
261,3.71
262,3.46
263,3.20
264,2.89
265,2.62
266,2.36
267,2.15
268,1.96
269,1.79
270,1.58
271,1.36
272,1.08
273,0.79
274,0.44
275,0.09
276,-0.24
277,-0.49
278,-0.72
279,-0.95
280,-1.23
281,-1.53
282,-1.83
283,-2.08
284,-2.28
285,-2.40
286,-2.45
287,-2.43
288,-2.33
289,-2.18
290,-2.04
291,-1.91
292,-1.82
293,-1.75
294,-1.66
295,-1.56
296,-1.43
297,-1.26
298,-1.05
299,-0.86
300,-0.76
301,-0.79
302,-0.93
303,-1.17
304,-1.47
305,-1.80
306,-2.09
307,-2.30
308,-2.36
309,-2.26
310,-2.02
311,-1.70
312,-1.34
313,-1.01
314,-0.80
315,-0.79
316,-0.93
317,-1.17
318,-1.36
319,-1.45
320,-1.39
321,-1.14
322,-0.72
323,-0.20
324,0.31
325,0.67
326,0.89
327,0.95
328,0.93
329,0.84
330,0.76
331,0.73
332,0.81
333,0.91
334,0.97
335,0.93
336,0.79
337,0.55
338,0.21
339,-0.20
340,-0.61
341,-0.93
342,-1.13
343,-1.22
344,-1.27
345,-1.30
346,-1.33
347,-1.34
348,-1.31
349,-1.24
350,-1.07
351,-0.77
352,-0.34
353,0.17
354,0.67
355,1.10
356,1.40
357,1.51
358,1.44
359,1.19
360,0.84
361,0.46
362,0.10
363,-0.21
364,-0.43
365,-0.56
366,-0.63
367,-0.65
368,-0.65
369,-0.60
370,-0.51
371,-0.37
372,-0.22
373,-0.09
374,-0.01
375,0.06
376,0.08
377,0.05
378,-0.06
379,-0.24
380,-0.49
381,-0.76
382,-1.07
383,-1.38
384,-1.72
385,-2.05
386,-2.38
387,-2.69
388,-3.06
389,-3.46
390,-3.94
391,-4.46
392,-5.03
393,-5.58
394,-6.07
395,-6.42
396,-6.68
397,-6.85
398,-6.97
399,-7.01
400,-6.97
401,-6.87
402,-6.73
403,-6.58
404,-6.38
405,-6.07
406,-5.57
407,-4.94
408,-4.22
409,-3.48
410,-2.69
411,-1.93
412,-1.21
413,-0.63
414,-0.11
415,0.32
416,0.68
417,0.95
418,1.21
419,1.43
420,1.63
421,1.73
422,1.72
423,1.58
424,1.32
425,0.95
426,0.53
427,0.10
428,-0.25
429,-0.45
430,-0.47
431,-0.33
432,-0.08
433,0.19
434,0.41
435,0.55
436,0.60
437,0.56
438,0.44
439,0.27
440,0.10
441,-0.05
442,-0.19
443,-0.34
444,-0.49
445,-0.65
446,-0.80
447,-0.90
448,-0.92
449,-0.88
450,-0.81
451,-0.72
452,-0.64
453,-0.59
454,-0.57
455,-0.60
456,-0.59
457,-0.55
458,-0.43
459,-0.24
460,0.02
461,0.33
462,0.67
463,0.99
464,1.30
465,1.59
466,1.88
467,2.13
468,2.38
469,2.61
470,2.87
471,3.10
472,3.30
473,3.43
474,3.52
475,3.58
476,3.63
477,3.68
478,3.77
479,3.90
480,4.10
481,4.31
482,4.55
483,4.76
484,4.98
485,5.19
486,5.42
487,5.67
488,6.00
489,6.38
490,6.87
491,7.43
492,8.05
493,8.65
494,9.25
495,9.79
496,10.26
497,10.61
498,10.84
499,10.93
500,10.94
501,10.89
502,10.83
503,10.80
504,10.86
505,11.00
506,11.20
507,11.43
508,11.65
509,11.80
510,11.86
511,11.78
512,11.60
513,11.38
514,11.14
515,10.93
516,10.82
517,10.80
518,10.86
519,10.96
520,11.09
521,11.24
522,11.35
523,11.44
524,11.47
525,11.48
526,11.44
527,11.37
528,11.22
529,11.04
530,10.77
531,10.41
532,9.93
533,9.38
534,8.80
535,8.24
536,7.69
537,7.19
538,6.71
539,6.29
540,5.90
541,5.55
542,5.24
543,5.01
544,4.80
545,4.62
546,4.41
547,4.24
548,4.07
549,3.95
550,3.83
551,3.72
552,3.57
553,3.43
554,3.24
555,3.04
556,2.74
557,2.39
558,1.97
559,1.54
560,1.08
561,0.60
562,0.11
563,-0.34
564,-0.76
565,-1.09
566,-1.37
567,-1.60
568,-1.83
569,-2.04
570,-2.27
571,-2.48
572,-2.69
573,-2.85
574,-2.94
575,-2.90
576,-2.75
577,-2.49
578,-2.20
579,-1.88
580,-1.56
581,-1.28
582,-1.04
583,-0.83
584,-0.63
585,-0.43
586,-0.21
587,-0.01
588,0.13
589,0.18
590,0.20
591,0.15
592,0.04
593,-0.13
594,-0.27
595,-0.31
596,-0.23
597,-0.05
598,0.19
599,0.47
600,0.78
601,1.03
602,1.21
603,1.29
604,1.30
605,1.28
606,1.24
607,1.19
608,1.19
609,1.22
610,1.30
611,1.40
612,1.53
613,1.66
614,1.79
615,1.91
616,2.04
617,2.17
618,2.33
619,2.44
620,2.53
621,2.55
622,2.59
623,2.63
624,2.75
625,2.95
626,3.25
627,3.62
628,4.07
629,4.52
630,4.97
631,5.35
632,5.65
633,5.83
634,5.87
635,5.81
636,5.68
637,5.54
638,5.41
639,5.29
640,5.18
641,5.09
642,4.99
643,4.88
644,4.69
645,4.43
646,4.05
647,3.64
648,3.17
649,2.70
650,2.20
651,1.73
652,1.28
653,0.89
654,0.51
655,0.16
656,-0.18
657,-0.50
658,-0.81
659,-1.06
660,-1.25
661,-1.33
662,-1.30
663,-1.17
664,-0.97
665,-0.69
666,-0.37
667,-0.05
668,0.27
669,0.56
670,0.82
671,1.02
672,1.18
673,1.29
674,1.37
675,1.40
676,1.45
677,1.54
678,1.71
679,1.92
680,2.20
681,2.54
682,2.93
683,3.28
684,3.59
685,3.80
686,3.97
687,4.10
688,4.20
689,4.24
690,4.24
691,4.23
692,4.25
693,4.24
694,4.19
695,4.07
696,3.93
697,3.76
698,3.58
699,3.40
700,3.28
701,3.24
702,3.23
703,3.24
704,3.25
705,3.28
706,3.28
707,3.26
708,3.14
709,2.97
710,2.71
711,2.40
712,2.01
713,1.56
714,1.04
715,0.53
716,0.02
717,-0.43
718,-0.86
719,-1.23
720,-1.56
721,-1.82
722,-2.10
723,-2.34
724,-2.59
725,-2.80
726,-3.01
727,-3.20
728,-3.41
729,-3.61
730,-3.80
731,-3.99
732,-4.23
733,-4.46
734,-4.65
735,-4.74
736,-4.72
737,-4.65
738,-4.58
739,-4.51
740,-4.49
741,-4.57
742,-4.76
743,-5.03
744,-5.30
745,-5.47
746,-5.47
747,-5.29
748,-5.01
749,-4.68
750,-4.38
751,-4.18
752,-4.14
753,-4.23
754,-4.43
755,-4.67
756,-4.87
757,-4.99
758,-5.00
759,-4.90
760,-4.71
761,-4.49
762,-4.24
763,-3.99
764,-3.73
765,-3.47
766,-3.20
767,-2.94
768,-2.72
769,-2.56
770,-2.45
771,-2.36
772,-2.27
773,-2.17
774,-2.04
775,-1.93
776,-1.83
777,-1.75
778,-1.66
779,-1.55
780,-1.42
781,-1.30
782,-1.16
783,-1.01
784,-0.84
785,-0.66
786,-0.47
787,-0.29
788,-0.13
789,-0.02
790,0.06
791,0.14
792,0.25
793,0.41
794,0.60
795,0.77
796,0.94
797,1.10
798,1.27
799,1.40
800,1.50
801,1.57
802,1.68
803,1.82
804,2.04
805,2.30
806,2.62
807,2.95
808,3.30
809,3.59
810,3.83
811,4.01
812,4.15
813,4.24
814,4.30
815,4.32
816,4.33
817,4.35
818,4.36
819,4.34
820,4.29
821,4.20
822,4.11
823,4.04
824,3.96
825,3.88
826,3.78
827,3.64
828,3.48
829,3.30
830,3.10
831,2.90
832,2.74
833,2.69
834,2.72
835,2.81
836,2.88
837,2.93
838,2.94
839,2.92
840,2.82
841,2.65
842,2.44
843,2.28
844,2.16
845,2.08
846,2.04
847,2.02
848,2.01
849,1.98
850,1.87
851,1.67
852,1.40
853,1.14
854,0.91
855,0.78
856,0.75
857,0.83
858,0.99
859,1.17
860,1.27
861,1.24
862,1.01
863,0.61
864,0.07
865,-0.51
866,-1.08
867,-1.55
868,-1.92
869,-2.17
870,-2.36
871,-2.49
872,-2.62
873,-2.78
874,-2.99
875,-3.23
876,-3.46
877,-3.64
878,-3.76
879,-3.80
880,-3.72
881,-3.56
882,-3.27
883,-2.92
884,-2.47
885,-1.98
886,-1.46
887,-1.01
888,-0.62
889,-0.31
890,-0.05
891,0.14
892,0.32
893,0.50
894,0.76
895,1.07
896,1.47
897,1.91
898,2.36
899,2.74
900,3.02
901,3.14
902,3.08
903,2.90
904,2.64
905,2.36
906,2.08
907,1.87
908,1.74
909,1.68
910,1.63
911,1.56
912,1.44
913,1.27
914,0.99
915,0.64
916,0.23
917,-0.16
918,-0.56
919,-0.95
920,-1.38
921,-1.85
922,-2.37
923,-2.92
924,-3.53
925,-4.10
926,-4.60
927,-4.94
928,-5.13
929,-5.20
930,-5.21
931,-5.18
932,-5.17
933,-5.19
934,-5.23
935,-5.26
936,-5.23
937,-5.10
938,-4.88
939,-4.56
940,-4.17
941,-3.73
942,-3.27
943,-2.88
944,-2.56
945,-2.35
946,-2.19
947,-2.08
948,-1.98
949,-1.91
950,-1.82
951,-1.67
952,-1.43
953,-1.15
954,-0.85
955,-0.60
956,-0.36
957,-0.16
958,0.05
959,0.25
960,0.46
961,0.65
962,0.85
963,1.08
964,1.37
965,1.63
966,1.88
967,2.08
968,2.27
969,2.43
970,2.62
971,2.85
972,3.20
973,3.65
974,4.18
975,4.75
976,5.34
977,5.89
978,6.34
979,6.59
980,6.70
981,6.66
982,6.56
983,6.43
984,6.36
985,6.39
986,6.57
987,6.88
988,7.32
989,7.82
990,8.33
991,8.77
992,9.12
993,9.35
994,9.51
995,9.62
996,9.74
997,9.87
998,10.04
999,10.20
1000,10.32
1001,10.34
1002,10.25
1003,10.08
1004,9.82
1005,9.51
1006,9.21
1007,8.96
1008,8.82
1009,8.80
1010,8.90
1011,9.04
1012,9.16
1013,9.25
1014,9.32
1015,9.33
1016,9.25
1017,9.09
1018,8.93
1019,8.77
1020,8.56
1021,8.32
1022,8.03
1023,7.75
1024,7.46
1025,7.20
1026,6.94
1027,6.71
1028,6.43
1029,6.13
1030,5.77
1031,5.40
1032,4.94
1033,4.44
1034,3.88
1035,3.33
1036,2.76
1037,2.24
1038,1.71
1039,1.21
1040,0.68
1041,0.17
1042,-0.34
1043,-0.77
1044,-1.13
1045,-1.38
1046,-1.58
1047,-1.70
1048,-1.80
1049,-1.88
1050,-1.98
1051,-2.07
1052,-2.14
1053,-2.17
1054,-2.14
1055,-2.03
1056,-1.82
1057,-1.53
1058,-1.19
1059,-0.87
1060,-0.58
1061,-0.32
1062,-0.08
1063,0.09
1064,0.19
1065,0.24
1066,0.24
1067,0.24
1068,0.23
1069,0.18
1070,0.11
1071,-0.01
1072,-0.16
1073,-0.37
1074,-0.61
1075,-0.83
1076,-0.97
1077,-1.01
1078,-0.98
1079,-0.89
1080,-0.75
1081,-0.57
1082,-0.43
1083,-0.36
1084,-0.37
1085,-0.41
1086,-0.47
1087,-0.56
1088,-0.64
1089,-0.70
1090,-0.73
1091,-0.73
1092,-0.72
1093,-0.72
1094,-0.72
1095,-0.73
1096,-0.71
1097,-0.65
1098,-0.55
1099,-0.44
1100,-0.31
1101,-0.13
1102,0.12
1103,0.41
1104,0.75
1105,1.06
1106,1.38
1107,1.72
1108,2.09
1109,2.46
1110,2.82
1111,3.12
1112,3.37
1113,3.57
1114,3.72
1115,3.82
1116,3.88
1117,3.88
1118,3.79
1119,3.59
1120,3.30
1121,2.92
1122,2.45
1123,1.91
1124,1.33
1125,0.77
1126,0.26
1127,-0.17
1128,-0.57
1129,-0.94
1130,-1.29
1131,-1.59
1132,-1.85
1133,-2.06
1134,-2.25
1135,-2.39
1136,-2.46
1137,-2.46
1138,-2.40
1139,-2.30
1140,-2.17
1141,-1.98
1142,-1.75
1143,-1.50
1144,-1.24
1145,-0.95
1146,-0.64
1147,-0.33
1148,-0.04
1149,0.18
1150,0.36
1151,0.50
1152,0.66
1153,0.80
1154,1.01
1155,1.27
1156,1.65
1157,2.08
1158,2.59
1159,3.09
1160,3.63
1161,4.13
1162,4.64
1163,5.08
1164,5.52
1165,5.90
1166,6.29
1167,6.67
1168,7.13
1169,7.64
1170,8.23
1171,8.84
1172,9.47
1173,10.02
1174,10.50
1175,10.83
1176,11.01
1177,10.96
1178,10.73
1179,10.39
1180,10.09
1181,9.88
1182,9.80
1183,9.85
1184,10.01
1185,10.23
1186,10.43
1187,10.52
1188,10.45
1189,10.23
1190,9.89
1191,9.48
1192,9.06
1193,8.71
1194,8.45
1195,8.34
1196,8.32
1197,8.40
1198,8.51
1199,8.60
1200,8.57
1201,8.44
1202,8.21
1203,7.95
1204,7.65
1205,7.35
1206,7.02
1207,6.72
1208,6.43
1209,6.17
1210,5.87
1211,5.54
1212,5.13
1213,4.73
1214,4.31
1215,3.95
1216,3.65
1217,3.44
1218,3.30
1219,3.23
1220,3.14
1221,3.00
1222,2.75
1223,2.46
1224,2.11
1225,1.78
1226,1.49
1227,1.33
1228,1.31
1229,1.45
1230,1.63
1231,1.78
1232,1.82
1233,1.72
1234,1.48
1235,1.14
1236,0.74
1237,0.34
1238,-0.02
1239,-0.32
1240,-0.55
1241,-0.70
1242,-0.82
1243,-0.92
1244,-1.02
1245,-1.12
1246,-1.19
1247,-1.21
1248,-1.19
1249,-1.13
1250,-1.02
1251,-0.89
1252,-0.73
1253,-0.57
1254,-0.38
1255,-0.17
1256,0.07
1257,0.29
1258,0.50
1259,0.69
1260,0.88
1261,1.05
1262,1.25
1263,1.45
1264,1.63
1265,1.79
1266,1.94
1267,2.07
1268,2.19
1269,2.27
1270,2.32
1271,2.33
1272,2.33
1273,2.34
1274,2.41
1275,2.51
1276,2.62
1277,2.69
1278,2.76
1279,2.82
1280,2.88
1281,2.98
1282,3.14
1283,3.35
1284,3.62
1285,3.93
1286,4.24
1287,4.52
1288,4.74
1289,4.86
1290,4.88
1291,4.81
1292,4.68
1293,4.49
1294,4.22
1295,3.90
1296,3.53
1297,3.15
1298,2.78
1299,2.45
1300,2.14
1301,1.86
1302,1.63
1303,1.50
1304,1.45
1305,1.47
1306,1.53
1307,1.61
1308,1.72
1309,1.87
1310,2.01
1311,2.13
1312,2.24
1313,2.38
1314,2.53
1315,2.66
1316,2.70
1317,2.64
1318,2.49
1319,2.30
1320,2.06
1321,1.82
1322,1.59
1323,1.40
1324,1.31
1325,1.31
1326,1.37
1327,1.47
1328,1.61
1329,1.75
1330,1.88
1331,1.98
1332,2.04
1333,2.11
1334,2.17
1335,2.24
1336,2.35
1337,2.47
1338,2.59
1339,2.70
1340,2.75
1341,2.75
1342,2.72
1343,2.66
1344,2.54
1345,2.41
1346,2.28
1347,2.16
1348,2.01
1349,1.81
1350,1.51
1351,1.13
1352,0.65
1353,0.11
1354,-0.45
1355,-0.95
1356,-1.37
1357,-1.63
1358,-1.75
1359,-1.70
1360,-1.55
1361,-1.34
1362,-1.14
1363,-0.98
1364,-0.89
1365,-0.83
1366,-0.78
1367,-0.69
1368,-0.51
1369,-0.28
1370,0.02
1371,0.38
1372,0.80
1373,1.22
1374,1.60
1375,1.90
1376,2.13
1377,2.28
1378,2.38
1379,2.42
1380,2.40
1381,2.32
1382,2.17
1383,1.97
1384,1.73
1385,1.46
1386,1.14
1387,0.81
1388,0.54
1389,0.39
1390,0.33
1391,0.32
1392,0.28
1393,0.21
1394,0.08
1395,-0.09
1396,-0.34
1397,-0.63
1398,-0.97
1399,-1.30
1400,-1.64
1401,-1.93
1402,-2.20
1403,-2.45
1404,-2.73
1405,-3.07
1406,-3.48
1407,-3.94
1408,-4.41
1409,-4.85
1410,-5.22
1411,-5.48
1412,-5.62
1413,-5.61
1414,-5.49
1415,-5.29
1416,-5.05
1417,-4.78
1418,-4.52
1419,-4.28
1420,-4.10
1421,-3.97
1422,-3.89
1423,-3.85
1424,-3.81
1425,-3.78
1426,-3.67
1427,-3.51
1428,-3.25
1429,-2.94
1430,-2.53
1431,-2.07
1432,-1.54
1433,-1.05
1434,-0.58
1435,-0.20
1436,0.16
1437,0.49
1438,0.86
1439,1.24
1440,1.68
1441,2.13
1442,2.64
1443,3.12
1444,3.57
1445,3.94
1446,4.30
1447,4.64
1448,5.00
1449,5.31
1450,5.62
1451,5.87
1452,6.08
1453,6.25
1454,6.43
1455,6.62
1456,6.86
1457,7.12
1458,7.39
1459,7.65
1460,7.88
1461,8.00
1462,7.96
1463,7.72
1464,7.32
1465,6.81
1466,6.26
1467,5.75
1468,5.39
1469,5.23
1470,5.26
1471,5.42
1472,5.59
1473,5.72
1474,5.73
1475,5.62
1476,5.36
1477,5.05
1478,4.71
1479,4.39
1480,4.08
1481,3.81
1482,3.56
1483,3.36
1484,3.20
1485,3.07
1486,2.94
1487,2.87
1488,2.85
1489,2.91
1490,3.03
1491,3.20
1492,3.37
1493,3.52
1494,3.57
1495,3.50
1496,3.30
1497,2.99
1498,2.61
1499,2.26
1500,1.97
1501,1.75
1502,1.55
1503,1.34
1504,1.10
1505,0.87
1506,0.61
1507,0.34
1508,0.03
1509,-0.26
1510,-0.54
1511,-0.77
1512,-0.99
1513,-1.20
1514,-1.44
1515,-1.69
1516,-1.96
1517,-2.24
1518,-2.56
1519,-2.87
1520,-3.16
1521,-3.37
1522,-3.55
1523,-3.70
1524,-3.85
1525,-3.95
1526,-3.97
1527,-3.89
1528,-3.75
1529,-3.57
1530,-3.34
1531,-3.08
1532,-2.82
1533,-2.60
1534,-2.42
1535,-2.27
1536,-2.11
1537,-1.96
1538,-1.78
1539,-1.59
1540,-1.34
1541,-1.05
1542,-0.69
1543,-0.31
1544,0.05
1545,0.37
1546,0.64
1547,0.83
1548,0.95
1549,0.94
1550,0.86
1551,0.72
1552,0.60
1553,0.51
1554,0.53
1555,0.64
1556,0.86
1557,1.17
1558,1.60
1559,2.08
1560,2.57
1561,2.99
1562,3.31
1563,3.56
1564,3.73
1565,3.83
1566,3.83
1567,3.75
1568,3.63
1569,3.54
1570,3.50
1571,3.50
1572,3.53
1573,3.59
1574,3.68
1575,3.75
1576,3.73
1577,3.63
1578,3.49
1579,3.34
1580,3.23
1581,3.17
1582,3.19
1583,3.35
1584,3.65
1585,4.05
1586,4.49
1587,4.90
1588,5.21
1589,5.37
1590,5.35
1591,5.17
1592,4.89
1593,4.57
1594,4.23
1595,3.94
1596,3.72
1597,3.58
1598,3.48
1599,3.40
1600,3.27
1601,3.11
1602,2.89
1603,2.65
1604,2.35
1605,2.06
1606,1.73
1607,1.40
1608,1.05
1609,0.69
1610,0.32
1611,-0.03
1612,-0.37
1613,-0.67
1614,-0.92
1615,-1.09
1616,-1.23
1617,-1.32
1618,-1.39
1619,-1.40
1620,-1.38
1621,-1.30
1622,-1.16
1623,-1.00
1624,-0.86
1625,-0.76
1626,-0.68
1627,-0.62
1628,-0.60
1629,-0.63
1630,-0.65
1631,-0.63
1632,-0.56
1633,-0.49
1634,-0.39
1635,-0.25
1636,-0.06
1637,0.15
1638,0.39
1639,0.66
1640,1.01
1641,1.40
1642,1.82
1643,2.21
1644,2.52
1645,2.72
1646,2.78
1647,2.71
1648,2.48
1649,2.12
1650,1.66
1651,1.21
1652,0.79
1653,0.45
1654,0.18
1655,-0.02
1656,-0.13
1657,-0.18
1658,-0.27
1659,-0.40
1660,-0.65
1661,-0.92
1662,-1.24
1663,-1.56
1664,-1.88
1665,-2.17
1666,-2.43
1667,-2.62
1668,-2.78
1669,-2.89
1670,-3.01
1671,-3.16
1672,-3.37
1673,-3.62
1674,-3.85
1675,-3.99
1676,-4.01
1677,-3.88
1678,-3.64
1679,-3.30
1680,-2.90
1681,-2.54
1682,-2.27
1683,-2.15
1684,-2.17
1685,-2.27
1686,-2.37
1687,-2.42
1688,-2.33
1689,-2.14
1690,-1.85
1691,-1.59
1692,-1.37
1693,-1.22
1694,-1.11
1695,-1.00
1696,-0.82
1697,-0.53
1698,-0.11
1699,0.38
1700,0.85
1701,1.20
1702,1.37
1703,1.30
1704,1.03
1705,0.63
1706,0.24
1707,-0.05
1708,-0.14
1709,-0.08
1710,0.07
1711,0.24
1712,0.37
1713,0.39
1714,0.27
1715,0.05
1716,-0.21
1717,-0.40
1718,-0.56
1719,-0.65
1720,-0.71
1721,-0.76
1722,-0.85
1723,-1.01
1724,-1.25
1725,-1.52
1726,-1.72
1727,-1.83
1728,-1.82
1729,-1.72
1730,-1.52
1731,-1.27
1732,-0.99
1733,-0.75
1734,-0.53
1735,-0.31
1736,-0.08
1737,0.14
1738,0.40
1739,0.67
1740,0.98
1741,1.26
1742,1.46
1743,1.51
1744,1.48
1745,1.38
1746,1.28
1747,1.19
1748,1.20
1749,1.30
1750,1.54
1751,1.85
1752,2.26
1753,2.70
1754,3.14
1755,3.52
1756,3.82
1757,4.03
1758,4.20
1759,4.33
1760,4.46
1761,4.53
1762,4.56
1763,4.53
1764,4.51
1765,4.52
1766,4.60
1767,4.70
1768,4.81
1769,4.91
1770,5.00
1771,5.04
1772,5.00
1773,4.86
1774,4.64
1775,4.36
1776,4.02
1777,3.65
1778,3.26
1779,2.88
1780,2.49
1781,2.15
1782,1.82
1783,1.53
1784,1.22
1785,0.91
1786,0.60
1787,0.34
1788,0.14
1789,0.03
1790,-0.05
1791,-0.05
1792,-0.01
1793,0.07
1794,0.12
1795,0.14
1796,0.09
1797,-0.01
1798,-0.20
1799,-0.46
1800,-0.73
1801,-0.98
1802,-1.17
1803,-1.33
1804,-1.44
1805,-1.50
1806,-1.52
1807,-1.50
1808,-1.46
1809,-1.40
1810,-1.30
1811,-1.14
1812,-0.93
1813,-0.69
1814,-0.52
1815,-0.43
1816,-0.46
1817,-0.58
1818,-0.78
1819,-1.04
1820,-1.35
1821,-1.64
1822,-1.91
1823,-2.15
1824,-2.40
1825,-2.67
1826,-2.96
1827,-3.26
1828,-3.58
1829,-3.87
1830,-4.13
1831,-4.30
1832,-4.44
1833,-4.55
1834,-4.67
1835,-4.82
1836,-5.05
1837,-5.34
1838,-5.69
1839,-6.03
1840,-6.36
1841,-6.61
1842,-6.78
1843,-6.82
1844,-6.74
1845,-6.55
1846,-6.31
1847,-6.03
1848,-5.71
1849,-5.40
1850,-5.10
1851,-4.84
1852,-4.59
1853,-4.36
1854,-4.14
1855,-3.95
1856,-3.76
1857,-3.59
1858,-3.40
1859,-3.23
1860,-3.07
1861,-2.92
1862,-2.78
1863,-2.68
1864,-2.61
1865,-2.59
1866,-2.57
1867,-2.50
1868,-2.36
1869,-2.16
1870,-1.89
1871,-1.60
1872,-1.27
1873,-0.94
1874,-0.59
1875,-0.25
1876,0.08
1877,0.33
1878,0.50
1879,0.56
1880,0.53
1881,0.40
1882,0.21
1883,-0.06
1884,-0.36
1885,-0.65
1886,-0.85
1887,-0.96
1888,-0.95
1889,-0.87
1890,-0.74
1891,-0.60
1892,-0.47
1893,-0.37
1894,-0.28
1895,-0.18
1896,-0.05
1897,0.10
1898,0.27
1899,0.47
1900,0.71
1901,0.92
1902,1.07
1903,1.11
1904,1.11
1905,1.06
1906,1.03
1907,1.03
1908,1.14
1909,1.37
1910,1.72
1911,2.09
1912,2.49
1913,2.88
1914,3.28
1915,3.63
1916,3.94
1917,4.17
1918,4.37
1919,4.58
1920,4.84
1921,5.09
1922,5.35
1923,5.58
1924,5.82
1925,6.07
1926,6.36
1927,6.67
1928,7.04
1929,7.48
1930,7.98
1931,8.48
1932,8.94
1933,9.29
1934,9.55
1935,9.70
1936,9.78
1937,9.76
1938,9.64
1939,9.46
1940,9.25
1941,9.03
1942,8.80
1943,8.51
1944,8.20
1945,7.92
1946,7.71
1947,7.61
1948,7.60
1949,7.64
1950,7.72
1951,7.80
1952,7.84
1953,7.81
1954,7.71
1955,7.55
1956,7.34
1957,7.18
1958,7.13
1959,7.23
1960,7.45
1961,7.71
1962,7.97
1963,8.17
1964,8.29
1965,8.35
1966,8.36
1967,8.34
1968,8.31
1969,8.30
1970,8.37
1971,8.49
1972,8.62
1973,8.69
1974,8.65
1975,8.53
1976,8.36
1977,8.19
1978,7.98
1979,7.77
1980,7.55
1981,7.37
1982,7.23
1983,7.12
1984,6.99
1985,6.86
1986,6.69
1987,6.55
1988,6.38
1989,6.21
1990,6.00
1991,5.77
1992,5.49
1993,5.18
1994,4.80
1995,4.39
1996,3.92
1997,3.43
1998,2.88
1999,2.33
2000,1.80
2001,1.31
2002,0.79
2003,0.28
2004,-0.18
2005,-0.51
2006,-0.76
2007,-0.95
2008,-1.12
2009,-1.24
2010,-1.32
2011,-1.37
2012,-1.44
2013,-1.52
2014,-1.58
2015,-1.61
2016,-1.59
2017,-1.49
2018,-1.27
2019,-0.95
2020,-0.52
2021,-0.05
2022,0.43
2023,0.86
2024,1.21
2025,1.45
2026,1.62
2027,1.72
2028,1.82
2029,1.96
2030,2.17
2031,2.42
2032,2.72
2033,3.01
2034,3.33
2035,3.62
2036,3.88
2037,4.07
2038,4.26
2039,4.47
2040,4.71
2041,4.94
2042,5.18
2043,5.42
2044,5.68
2045,5.91
2046,6.10
2047,6.23
2048,6.29
2049,6.30
2050,6.27
2051,6.15
2052,5.94
2053,5.71
2054,5.48
2055,5.27
2056,5.09
2057,4.94
2058,4.84
2059,4.81
2060,4.85
2061,4.94
2062,5.04
2063,5.13
2064,5.21
2065,5.27
2066,5.36
2067,5.49
2068,5.67
2069,5.87
2070,6.12
2071,6.38
2072,6.61
2073,6.78
2074,6.84
2075,6.78
2076,6.58
2077,6.29
2078,5.94
2079,5.60
2080,5.28
2081,5.00
2082,4.76
2083,4.58
2084,4.38
2085,4.15
2086,3.81
2087,3.43
2088,2.99
2089,2.56
2090,2.08
2091,1.61
2092,1.15
2093,0.76
2094,0.41
2095,0.11
2096,-0.14
2097,-0.34
2098,-0.47
2099,-0.50
2100,-0.46
2101,-0.30
2102,-0.02
2103,0.32
2104,0.67
2105,0.98
2106,1.22
2107,1.37
2108,1.42
2109,1.36
2110,1.25
2111,1.14
2112,1.06
2113,1.04
2114,1.12
2115,1.29
2116,1.53
2117,1.77
2118,2.00
2119,2.20
2120,2.44
2121,2.67
2122,2.93
2123,3.20
2124,3.52
2125,3.85
2126,4.22
2127,4.58
2128,4.92
2129,5.22
2130,5.45
2131,5.61
2132,5.71
2133,5.74
2134,5.72
2135,5.65
2136,5.52
2137,5.34
2138,5.10
2139,4.82
2140,4.51
2141,4.20
2142,3.87
2143,3.54
2144,3.18
2145,2.82
2146,2.47
2147,2.18
2148,1.92
2149,1.72
2150,1.52
2151,1.35
2152,1.17
2153,1.03
2154,0.85
2155,0.66
2156,0.42
2157,0.14
2158,-0.16
2159,-0.47
2160,-0.81
2161,-1.14
2162,-1.49
2163,-1.80
2164,-2.09
2165,-2.30
2166,-2.45
2167,-2.48
2168,-2.42
2169,-2.27
2170,-2.12
2171,-2.01
2172,-1.98
2173,-2.07
2174,-2.27
2175,-2.55
2176,-2.85
2177,-3.11
2178,-3.32
2179,-3.43
2180,-3.46
2181,-3.43
2182,-3.43
2183,-3.48
2184,-3.59
2185,-3.73
2186,-3.92
2187,-4.14
2188,-4.36
2189,-4.55
2190,-4.74
2191,-4.91
2192,-5.12
2193,-5.39
2194,-5.75
2195,-6.14
2196,-6.55
2197,-6.90
2198,-7.23
2199,-7.52
2200,-7.77
2201,-7.95
2202,-8.09
2203,-8.22
2204,-8.37
2205,-8.49
2206,-8.58
2207,-8.62
2208,-8.61
2209,-8.53
2210,-8.37
2211,-8.16
2212,-7.97
2213,-7.79
2214,-7.60
2215,-7.39
2216,-7.14
2217,-6.90
2218,-6.67
2219,-6.44
2220,-6.19
2221,-5.95
2222,-5.72
2223,-5.55
2224,-5.41
2225,-5.29
2226,-5.18
2227,-5.09
2228,-5.00
2229,-4.95
2230,-4.88
2231,-4.78
2232,-4.58
2233,-4.30
2234,-3.93
2235,-3.50
2236,-3.02
2237,-2.52
2238,-2.01
2239,-1.59
2240,-1.23
2241,-0.93
2242,-0.63
2243,-0.35
2244,-0.07
2245,0.18
2246,0.38
2247,0.52
2248,0.56
2249,0.46
2250,0.25
2251,0.00
2252,-0.24
2253,-0.47
2254,-0.65
2255,-0.79
2256,-0.87
2257,-0.92
2258,-1.01
2259,-1.12
2260,-1.27
2261,-1.43
2262,-1.59
2263,-1.73
2264,-1.84
2265,-1.90
2266,-1.91
2267,-1.89
2268,-1.85
2269,-1.79
2270,-1.71
2271,-1.60
2272,-1.51
2273,-1.44
2274,-1.43
2275,-1.46
2276,-1.57
2277,-1.73
2278,-1.94
2279,-2.14
2280,-2.29
2281,-2.40
2282,-2.46
2283,-2.51
2284,-2.58
2285,-2.66
2286,-2.77
2287,-2.91
2288,-3.04
2289,-3.08
2290,-3.02
2291,-2.85
2292,-2.63
2293,-2.40
2294,-2.22
2295,-2.10
2296,-2.06
2297,-2.10
2298,-2.22
2299,-2.36
2300,-2.48
2301,-2.57
2302,-2.69
2303,-2.88
2304,-3.19
2305,-3.63
2306,-4.19
2307,-4.78
2308,-5.37
2309,-5.89
2310,-6.33
2311,-6.64
2312,-6.83
2313,-6.95
2314,-7.07
2315,-7.20
2316,-7.34
2317,-7.46
2318,-7.59
2319,-7.69
2320,-7.68
2321,-7.53
2322,-7.25
2323,-6.93
2324,-6.57
2325,-6.23
2326,-5.87
2327,-5.54
2328,-5.18
2329,-4.85
2330,-4.46
2331,-4.01
2332,-3.42
2333,-2.73
2334,-1.98
2335,-1.24
2336,-0.50
2337,0.18
2338,0.82
2339,1.35
2340,1.82
2341,2.17
2342,2.49
2343,2.72
2344,2.90
2345,3.01
2346,3.11
2347,3.17
2348,3.25
2349,3.39
2350,3.63
2351,3.97
2352,4.34
2353,4.69
2354,4.98
2355,5.20
2356,5.32
2357,5.29
2358,5.15
2359,4.93
2360,4.67
2361,4.42
2362,4.15
2363,3.88
2364,3.56
2365,3.23
2366,2.85
2367,2.46
2368,2.04
2369,1.64
2370,1.27
2371,0.98
2372,0.76
2373,0.58
2374,0.43
2375,0.31
2376,0.23
2377,0.19
2378,0.20
2379,0.21
2380,0.23
2381,0.27
2382,0.37
2383,0.50
2384,0.66
2385,0.82
2386,1.01
2387,1.24
2388,1.53
2389,1.85
2390,2.28
2391,2.75
2392,3.26
2393,3.73
2394,4.19
2395,4.59
2396,4.97
2397,5.33
2398,5.68
2399,5.98
2400,6.27
2401,6.50
2402,6.73
2403,6.91
2404,7.09
2405,7.21
2406,7.36
2407,7.55
2408,7.84
2409,8.22
2410,8.75
2411,9.35
2412,9.99
2413,10.61
2414,11.19
2415,11.67
2416,12.10
2417,12.47
2418,12.83
2419,13.15
2420,13.38
2421,13.44
2422,13.34
2423,13.05
2424,12.60
2425,12.02
2426,11.37
2427,10.76
2428,10.29
2429,10.03
2430,9.98
2431,10.11
2432,10.34
2433,10.61
2434,10.86
2435,11.02
2436,11.06
2437,11.00
2438,10.87
2439,10.76
2440,10.65
2441,10.54
2442,10.38
2443,10.18
2444,9.97
2445,9.82
2446,9.70
2447,9.64
2448,9.64
2449,9.73
2450,9.88
2451,10.09
2452,10.29
2453,10.42
2454,10.40
2455,10.25
2456,9.96
2457,9.58
2458,9.10
2459,8.57
2460,8.02
2461,7.51
2462,7.07
2463,6.73
2464,6.46
2465,6.31
2466,6.21
2467,6.16
2468,6.10
2469,6.02
2470,5.83
2471,5.55
2472,5.20
2473,4.89
2474,4.63
2475,4.46
2476,4.33
2477,4.24
2478,4.16
2479,4.07
2480,3.91
2481,3.69
2482,3.43
2483,3.14
2484,2.85
2485,2.64
2486,2.53
2487,2.51
2488,2.53
2489,2.53
2490,2.54
2491,2.57
2492,2.64
2493,2.72
2494,2.82
2495,2.94
2496,3.08
2497,3.27
2498,3.46
2499,3.64
2500,3.78
2501,3.88
2502,3.95
2503,4.04
2504,4.14
2505,4.28
2506,4.43
2507,4.55
2508,4.63
2509,4.64
2510,4.54
2511,4.33
2512,4.04
2513,3.70
2514,3.35
2515,3.05
2516,2.82
2517,2.71
2518,2.69
2519,2.75
2520,2.85
2521,2.98
2522,3.11
2523,3.20
2524,3.19
2525,3.11
2526,2.99
2527,2.86
2528,2.74
2529,2.62
2530,2.52
2531,2.46
2532,2.44
2533,2.44
2534,2.43
2535,2.41
2536,2.43
2537,2.49
2538,2.64
2539,2.84
2540,3.11
2541,3.40
2542,3.71
2543,3.97
2544,4.17
2545,4.28
2546,4.33
2547,4.36
2548,4.44
2549,4.58
2550,4.79
2551,5.03
2552,5.26
2553,5.44
2554,5.55
2555,5.57
2556,5.50
2557,5.38
2558,5.23
2559,5.10
2560,4.96
2561,4.81
2562,4.61
2563,4.40
2564,4.14
2565,3.81
2566,3.37
2567,2.86
2568,2.30
2569,1.75
2570,1.16
2571,0.56
2572,-0.09
2573,-0.70
2574,-1.29
2575,-1.82
2576,-2.31
2577,-2.74
2578,-3.13
2579,-3.41
2580,-3.64
2581,-3.79
2582,-3.93
2583,-4.00
2584,-4.01
2585,-3.94
2586,-3.86
2587,-3.77
2588,-3.67
2589,-3.56
2590,-3.46
2591,-3.37
2592,-3.27
2593,-3.19
2594,-3.11
2595,-3.05
2596,-2.97
2597,-2.85
2598,-2.71
2599,-2.56
2600,-2.35
2601,-2.10
2602,-1.79
2603,-1.46
2604,-1.10
2605,-0.77
2606,-0.43
2607,-0.14
2608,0.12
2609,0.35
2610,0.60
2611,0.85
2612,1.11
2613,1.34
2614,1.49
2615,1.56
2616,1.59
2617,1.56
2618,1.50
2619,1.37
2620,1.23
2621,1.06
2622,0.91
2623,0.79
2624,0.72
2625,0.74
2626,0.84
2627,1.00
2628,1.21
2629,1.43
2630,1.63
2631,1.77
2632,1.85
2633,1.90
2634,1.89
2635,1.82
2636,1.71
2637,1.59
2638,1.50
2639,1.46
2640,1.45
2641,1.40
2642,1.34
2643,1.30
2644,1.33
2645,1.40
2646,1.50
2647,1.61
2648,1.72
2649,1.86
2650,1.99
2651,2.05
2652,2.04
2653,1.95
2654,1.82
2655,1.68
2656,1.58
2657,1.57
2658,1.70
2659,1.94
2660,2.26
2661,2.58
2662,2.86
2663,3.08
2664,3.24
2665,3.32
2666,3.30
2667,3.24
2668,3.20
2669,3.22
2670,3.27
2671,3.31
2672,3.33
2673,3.31
2674,3.22
2675,3.06
2676,2.86
2677,2.68
2678,2.56
2679,2.49
2680,2.49
2681,2.53
2682,2.62
2683,2.73
2684,2.86
2685,2.98
2686,3.11
2687,3.25
2688,3.46
2689,3.72
2690,4.04
2691,4.39
2692,4.79
2693,5.19
2694,5.56
2695,5.90
2696,6.22
2697,6.51
2698,6.78
2699,6.99
2700,7.17
2701,7.32
2702,7.50
2703,7.67
2704,7.87
2705,8.06
2706,8.29
2707,8.51
2708,8.77
2709,9.04
2710,9.37
2711,9.69
2712,10.03
2713,10.34
2714,10.70
2715,11.07
2716,11.51
2717,11.96
2718,12.47
2719,13.00
2720,13.54
2721,14.05
2722,14.52
2723,14.91
2724,15.19
2725,15.35
2726,15.43
2727,15.44
2728,15.39
2729,15.29
2730,15.19
2731,15.11
2732,15.02
2733,14.90
2734,14.69
2735,14.42
2736,14.02
2737,13.53
2738,12.95
2739,12.34
2740,11.70
2741,11.09
2742,10.49
2743,9.96
2744,9.48
2745,9.08
2746,8.67
2747,8.29
2748,7.88
2749,7.51
2750,7.14
2751,6.84
2752,6.58
2753,6.41
2754,6.27
2755,6.18
2756,6.10
2757,6.05
2758,5.99
2759,5.90
2760,5.74
2761,5.52
2762,5.24
2763,4.94
2764,4.62
2765,4.30
2766,4.01
2767,3.78
2768,3.69
2769,3.78
2770,4.01
2771,4.33
2772,4.68
2773,5.01
2774,5.28
2775,5.44
2776,5.46
2777,5.37
2778,5.28
2779,5.23
2780,5.23
2781,5.24
2782,5.23
2783,5.20
2784,5.07
2785,4.80
2786,4.35
2787,3.81
2788,3.27
2789,2.80
2790,2.43
2791,2.14
2792,1.93
2793,1.81
2794,1.74
2795,1.72
2796,1.70
2797,1.71
2798,1.75
2799,1.85
2800,2.04
2801,2.25
2802,2.44
2803,2.56
2804,2.66
2805,2.72
2806,2.78
2807,2.84
2808,2.97
2809,3.20
2810,3.55
2811,3.96
2812,4.43
2813,4.89
2814,5.32
2815,5.65
2816,5.89
2817,6.04
2818,6.17
2819,6.24
2820,6.26
2821,6.22
2822,6.16
2823,6.07
2824,5.95
2825,5.78
2826,5.57
2827,5.39
2828,5.25
2829,5.16
2830,5.07
2831,4.98
2832,4.84
2833,4.65
2834,4.36
2835,4.03
2836,3.65
2837,3.30
2838,2.97
2839,2.71
2840,2.43
2841,2.13
2842,1.72
2843,1.24
2844,0.64
2845,-0.01
2846,-0.74
2847,-1.46
2848,-2.11
2849,-2.62
2850,-3.04
2851,-3.34
2852,-3.56
2853,-3.68
2854,-3.72
2855,-3.67
2856,-3.56
2857,-3.40
2858,-3.22
2859,-3.06
2860,-2.94
2861,-2.86
2862,-2.81
2863,-2.78
2864,-2.73
2865,-2.69
2866,-2.64
2867,-2.57
2868,-2.43
2869,-2.19
2870,-1.86
2871,-1.51
2872,-1.15
2873,-0.79
2874,-0.40
2875,-0.05
2876,0.23
2877,0.38
2878,0.47
2879,0.52
2880,0.56
2881,0.57
2882,0.60
2883,0.69
2884,0.90
2885,1.17
2886,1.50
2887,1.83
2888,2.20
2889,2.55
2890,2.89
2891,3.18
2892,3.46
2893,3.76
2894,4.10
2895,4.43
2896,4.75
2897,5.03
2898,5.28
2899,5.46
2900,5.52
2901,5.44
2902,5.26
2903,5.01
2904,4.71
2905,4.37
2906,4.02
2907,3.70
2908,3.43
2909,3.23
2910,3.12
2911,3.12
2912,3.21
2913,3.36
2914,3.53
2915,3.71
2916,3.88
2917,4.04
2918,4.18
2919,4.29
2920,4.33
2921,4.29
2922,4.17
2923,4.01
2924,3.83
2925,3.65
2926,3.48
2927,3.34
2928,3.23
2929,3.18
2930,3.16
2931,3.14
2932,3.09
2933,3.04
2934,2.99
2935,2.99
2936,3.01
2937,3.02
2938,3.01
2939,2.97
2940,2.88
2941,2.74
2942,2.56
2943,2.36
2944,2.16
2945,1.96
2946,1.75
2947,1.56
2948,1.37
2949,1.24
2950,1.13
2951,1.02
2952,0.87
2953,0.72
2954,0.56
2955,0.43
2956,0.27
2957,0.04
2958,-0.31
2959,-0.75
2960,-1.25
2961,-1.79
2962,-2.38
2963,-2.98
2964,-3.53
2965,-3.94
2966,-4.22
2967,-4.35
2968,-4.39
2969,-4.36
2970,-4.30
2971,-4.23
2972,-4.21
2973,-4.23
2974,-4.29
2975,-4.30
2976,-4.25
2977,-4.12
2978,-3.89
2979,-3.57
2980,-3.15
2981,-2.68
2982,-2.20
2983,-1.79
2984,-1.48
2985,-1.32
2986,-1.29
2987,-1.35
2988,-1.40
2989,-1.40
2990,-1.31
2991,-1.17
2992,-0.95
2993,-0.70
2994,-0.43
2995,-0.24
2996,-0.11
2997,-0.03
2998,0.02
2999,0.08
3000,0.15
3001,0.29
3002,0.53
3003,0.83
3004,1.13
3005,1.34
3006,1.49
3007,1.56
3008,1.59
3009,1.59
3010,1.57
3011,1.56
3012,1.61
3013,1.70
3014,1.84
3015,1.98
3016,2.11
3017,2.23
3018,2.34
3019,2.47
3020,2.68
3021,2.97
3022,3.37
3023,3.82
3024,4.33
3025,4.82
3026,5.31
3027,5.76
3028,6.20
3029,6.61
3030,7.02
3031,7.45
3032,7.96
3033,8.48
3034,8.97
3035,9.36
3036,9.64
3037,9.80
3038,9.83
3039,9.74
3040,9.51
3041,9.20
3042,8.80
3043,8.36
3044,7.90
3045,7.48
3046,7.05
3047,6.65
3048,6.20
3049,5.81
3050,5.37
3051,4.96
3052,4.45
3053,3.88
3054,3.22
3055,2.54
3056,1.79
3057,1.05
3058,0.28
3059,-0.41
3060,-1.04
3061,-1.52
3062,-1.89
3063,-2.16
3064,-2.40
3065,-2.56
3066,-2.67
3067,-2.69
3068,-2.66
3069,-2.59
3070,-2.51
3071,-2.40
3072,-2.21
3073,-1.98
3074,-1.69
3075,-1.37
3076,-0.95
3077,-0.48
3078,0.05
3079,0.59
3080,1.14
3081,1.69
3082,2.26
3083,2.78
3084,3.30
3085,3.76
3086,4.26
3087,4.72
3088,5.16
3089,5.49
3090,5.78
3091,6.00
3092,6.20
3093,6.36
3094,6.48
3095,6.55
3096,6.61
3097,6.62
3098,6.61
3099,6.52
3100,6.38
3101,6.18
3102,5.96
3103,5.73
3104,5.50
3105,5.33
3106,5.24
3107,5.26
3108,5.35
3109,5.48
3110,5.62
3111,5.76
3112,5.87
3113,5.91
3114,5.89
3115,5.85
3116,5.81
3117,5.78
3118,5.81
3119,5.87
3120,5.93
3121,5.96
3122,5.91
3123,5.79
3124,5.59
3125,5.35
3126,5.11
3127,4.91
3128,4.75
3129,4.67
3130,4.71
3131,4.85
3132,5.03
3133,5.19
3134,5.35
3135,5.51
3136,5.65
3137,5.77
3138,5.87
3139,6.01
3140,6.21
3141,6.45
3142,6.70
3143,6.90
3144,7.05
3145,7.13
3146,7.19
3147,7.23
3148,7.29
3149,7.38
3150,7.52
3151,7.75
3152,8.05
3153,8.35
3154,8.56
3155,8.63
3156,8.56
3157,8.35
3158,8.00
3159,7.55
3160,7.05
3161,6.61
3162,6.26
3163,6.00
3164,5.81
3165,5.70
3166,5.64
3167,5.64
3168,5.69
3169,5.79
3170,5.94
3171,6.14
3172,6.38
3173,6.62
3174,6.84
3175,7.00
3176,7.09
3177,7.10
3178,7.07
3179,6.98
3180,6.88
3181,6.77
3182,6.68
3183,6.61
3184,6.53
3185,6.45
3186,6.39
3187,6.36
3188,6.40
3189,6.52
3190,6.71
3191,6.98
3192,7.29
3193,7.60
3194,7.91
3195,8.21
3196,8.51
3197,8.76
3198,8.96
3199,9.09
3200,9.22
3201,9.35
3202,9.52
3203,9.67
3204,9.81
3205,9.90
3206,10.01
3207,10.12
3208,10.25
3209,10.37
3210,10.49
3211,10.62
3212,10.71
3213,10.73
3214,10.65
3215,10.46
3216,10.13
3217,9.68
3218,9.09
3219,8.43
3220,7.75
3221,7.13
3222,6.61
3223,6.23
3224,6.00
3225,5.91
3226,5.89
3227,5.91
3228,5.87
3229,5.83
3230,5.73
3231,5.61
3232,5.46
3233,5.36
3234,5.29
3235,5.29
3236,5.31
3237,5.33
3238,5.29
3239,5.19
3240,4.98
3241,4.68
3242,4.36
3243,4.03
3244,3.72
3245,3.46
3246,3.30
3247,3.28
3248,3.37
3249,3.59
3250,3.88
3251,4.25
3252,4.61
3253,4.92
3254,5.13
3255,5.25
3256,5.27
3257,5.21
3258,5.08
3259,4.92
3260,4.75
3261,4.60
3262,4.42
3263,4.19
3264,3.86
3265,3.46
3266,2.94
3267,2.39
3268,1.81
3269,1.26
3270,0.72
3271,0.25
3272,-0.20
3273,-0.60
3274,-1.02
3275,-1.43
3276,-1.86
3277,-2.26
3278,-2.60
3279,-2.84
3280,-2.96
3281,-2.97
3282,-2.91
3283,-2.78
3284,-2.63
3285,-2.47
3286,-2.32
3287,-2.19
3288,-2.03
3289,-1.82
3290,-1.50
3291,-1.08
3292,-0.58
3293,-0.05
3294,0.52
3295,1.06
3296,1.61
3297,2.10
3298,2.55
3299,2.91
3300,3.24
3301,3.49
3302,3.69
3303,3.79
3304,3.86
3305,3.89
3306,3.97
3307,4.09
3308,4.33
3309,4.68
3310,5.18
3311,5.74
3312,6.29
3313,6.75
3314,7.09
3315,7.30
3316,7.42
3317,7.40
3318,7.32
3319,7.21
3320,7.19
3321,7.26
3322,7.41
3323,7.58
3324,7.74
3325,7.85
3326,7.88
3327,7.78
3328,7.58
3329,7.31
3330,7.01
3331,6.75
3332,6.61
3333,6.61
3334,6.71
3335,6.90
3336,7.16
3337,7.44
3338,7.64
3339,7.73
3340,7.71
3341,7.64
3342,7.56
3343,7.48
3344,7.44
3345,7.48
3346,7.62
3347,7.84
3348,8.09
3349,8.32
3350,8.48
3351,8.56
3352,8.54
3353,8.48
3354,8.42
3355,8.39
3356,8.40
3357,8.41
3358,8.40
3359,8.40
3360,8.41
3361,8.40
3362,8.38
3363,8.35
3364,8.39
3365,8.48
3366,8.61
3367,8.74
3368,8.87
3369,9.02
3370,9.21
3371,9.41
3372,9.61
3373,9.79
3374,9.93
3375,10.01
3376,10.03
3377,9.94
3378,9.76
3379,9.54
3380,9.35
3381,9.25
3382,9.21
3383,9.20
3384,9.19
3385,9.18
3386,9.11
3387,8.98
3388,8.76
3389,8.50
3390,8.23
3391,8.03
3392,7.91
3393,7.88
3394,7.90
3395,7.95
3396,7.97
3397,7.95
3398,7.90
3399,7.80
3400,7.65
3401,7.49
3402,7.33
3403,7.23
3404,7.14
3405,7.07
3406,6.97
3407,6.83
3408,6.64
3409,6.42
3410,6.16
3411,5.87
3412,5.52
3413,5.13
3414,4.68
3415,4.27
3416,3.91
3417,3.64
3418,3.41
3419,3.24
3420,3.09
3421,2.98
3422,2.86
3423,2.71
3424,2.49
3425,2.26
3426,2.02
3427,1.82
3428,1.64
3429,1.50
3430,1.35
3431,1.24
3432,1.11
3433,0.99
3434,0.82
3435,0.62
3436,0.40
3437,0.20
3438,0.04
3439,-0.08
3440,-0.18
3441,-0.27
3442,-0.37
3443,-0.49
3444,-0.66
3445,-0.89
3446,-1.21
3447,-1.59
3448,-2.02
3449,-2.44
3450,-2.80
3451,-3.07
3452,-3.23
3453,-3.28
3454,-3.23
3455,-3.07
3456,-2.83
3457,-2.52
3458,-2.17
3459,-1.83
3460,-1.54
3461,-1.33
3462,-1.16
3463,-1.05
3464,-0.96
3465,-0.89
3466,-0.78
3467,-0.64
3468,-0.47
3469,-0.29
3470,-0.11
3471,0.01
3472,0.04
3473,-0.05
3474,-0.22
3475,-0.44
3476,-0.66
3477,-0.80
3478,-0.85
3479,-0.79
3480,-0.62
3481,-0.41
3482,-0.28
3483,-0.27
3484,-0.39
3485,-0.61
3486,-0.95
3487,-1.34
3488,-1.74
3489,-2.07
3490,-2.30
3491,-2.44
3492,-2.47
3493,-2.43
3494,-2.38
3495,-2.36
3496,-2.36
3497,-2.37
3498,-2.37
3499,-2.32
3500,-2.19
3501,-1.96
3502,-1.63
3503,-1.25
3504,-0.82
3505,-0.40
3506,-0.04
3507,0.21
3508,0.38
3509,0.47
3510,0.55
3511,0.62
3512,0.73
3513,0.89
3514,1.10
3515,1.31
3516,1.51
3517,1.66
3518,1.75
3519,1.79
3520,1.75
3521,1.63
3522,1.45
3523,1.25
3524,1.03
3525,0.79
3526,0.53
3527,0.26
3528,-0.05
3529,-0.37
3530,-0.69
3531,-0.98
3532,-1.24
3533,-1.43
3534,-1.61
3535,-1.72
3536,-1.77
3537,-1.74
3538,-1.69
3539,-1.65
3540,-1.65
3541,-1.68
3542,-1.75
3543,-1.84
3544,-1.91
3545,-1.95
3546,-1.95
3547,-1.86
3548,-1.72
3549,-1.56
3550,-1.40
3551,-1.31
3552,-1.27
3553,-1.27
3554,-1.29
3555,-1.28
3556,-1.19
3557,-1.01
3558,-0.72
3559,-0.35
3560,0.11
3561,0.63
3562,1.20
3563,1.72
3564,2.18
3565,2.52
3566,2.78
3567,2.97
3568,3.11
3569,3.19
3570,3.23
3571,3.28
3572,3.40
3573,3.57
3574,3.80
3575,4.02
3576,4.21
3577,4.35
3578,4.44
3579,4.48
3580,4.47
3581,4.40
3582,4.30
3583,4.20
3584,4.13
3585,4.04
3586,3.94
3587,3.82
3588,3.73
3589,3.67
3590,3.59
3591,3.49
3592,3.40
3593,3.34
3594,3.30
3595,3.25
3596,3.17
3597,3.11
3598,3.06
3599,3.02
3600,2.98
3601,2.93
3602,2.84
3603,2.70
3604,2.50
3605,2.29
3606,2.05
3607,1.84
3608,1.65
3609,1.51
3610,1.42
3611,1.39
3612,1.36
3613,1.29
3614,1.13
3615,0.91
3616,0.66
3617,0.49
3618,0.39
3619,0.41
3620,0.56
3621,0.82
3622,1.15
3623,1.48
3624,1.71
3625,1.78
3626,1.66
3627,1.44
3628,1.16
3629,0.92
3630,0.77
3631,0.70
3632,0.72
3633,0.79
3634,0.89
3635,0.95
3636,0.90
3637,0.74
3638,0.50
3639,0.26
3640,0.03
3641,-0.14
3642,-0.24
3643,-0.30
3644,-0.29
3645,-0.24
3646,-0.14
3647,-0.02
3648,0.14
3649,0.34
3650,0.62
3651,0.96
3652,1.40
3653,1.87
3654,2.41
3655,2.94
3656,3.44
3657,3.85
3658,4.20
3659,4.47
3660,4.70
3661,4.87
3662,5.03
3663,5.18
3664,5.37
3665,5.57
3666,5.75
3667,5.89
3668,5.99
3669,6.06
3670,6.14
3671,6.23
3672,6.38
3673,6.55
3674,6.77
3675,7.00
3676,7.26
3677,7.54
3678,7.84
3679,8.11
3680,8.38
3681,8.65
3682,8.97
3683,9.31
3684,9.64
3685,9.90
3686,10.07
3687,10.15
3688,10.13
3689,10.03
3690,9.87
3691,9.71
3692,9.60
3693,9.56
3694,9.54
3695,9.52
3696,9.41
3697,9.20
3698,8.84
3699,8.34
3700,7.74
3701,7.11
3702,6.55
3703,6.13
3704,5.87
3705,5.78
3706,5.79
3707,5.90
3708,6.06
3709,6.20
3710,6.28
3711,6.30
3712,6.30
3713,6.38
3714,6.57
3715,6.90
3716,7.32
3717,7.78
3718,8.22
3719,8.52
3720,8.62
3721,8.48
3722,8.13
3723,7.61
3724,7.04
3725,6.47
3726,5.98
3727,5.61
3728,5.42
3729,5.42
3730,5.60
3731,5.93
3732,6.36
3733,6.81
3734,7.26
3735,7.68
3736,8.06
3737,8.41
3738,8.71
3739,8.96
3740,9.19
3741,9.38
3742,9.56
3743,9.67
3744,9.63
3745,9.40
3746,8.96
3747,8.34
3748,7.56
3749,6.74
3750,5.95
3751,5.33
3752,4.84
3753,4.52
3754,4.27
3755,4.07
3756,3.82
3757,3.51
3758,3.10
3759,2.69
3760,2.31
3761,2.08
3762,1.97
3763,1.99
3764,2.11
3765,2.27
3766,2.43
3767,2.58
3768,2.74
3769,2.94
3770,3.23
3771,3.59
3772,4.04
3773,4.53
3774,5.04
3775,5.49
3776,5.84
3777,6.03
3778,6.04
3779,5.88
3780,5.61
3781,5.26
3782,4.86
3783,4.43
3784,3.99
3785,3.62
3786,3.36
3787,3.21
3788,3.13
3789,3.12
3790,3.14
3791,3.17
3792,3.15
3793,3.11
3794,2.98
3795,2.78
3796,2.50
3797,2.19
3798,1.85
3799,1.50
3800,1.09
3801,0.66
3802,0.19
3803,-0.27
3804,-0.79
3805,-1.30
3806,-1.82
3807,-2.27
3808,-2.66
3809,-2.96
3810,-3.26
3811,-3.50
3812,-3.73
3813,-3.91
3814,-4.06
3815,-4.17
3816,-4.23
3817,-4.23
3818,-4.20
3819,-4.12
3820,-3.96
3821,-3.70
3822,-3.36
3823,-3.00
3824,-2.65
3825,-2.33
3826,-2.04
3827,-1.79
3828,-1.59
3829,-1.46
3830,-1.41
3831,-1.41
3832,-1.46
3833,-1.54
3834,-1.63
3835,-1.72
3836,-1.79
3837,-1.83
3838,-1.80
3839,-1.73
3840,-1.62
3841,-1.50
3842,-1.36
3843,-1.23
3844,-1.11
3845,-1.04
3846,-0.95
3847,-0.85
3848,-0.66
3849,-0.44
3850,-0.12
3851,0.29
3852,0.82
3853,1.40
3854,1.98
3855,2.51
3856,3.04
3857,3.52
3858,3.97
3859,4.34
3860,4.71
3861,5.05
3862,5.39
3863,5.66
3864,5.93
3865,6.16
3866,6.35
3867,6.46
3868,6.53
3869,6.58
3870,6.67
3871,6.77
3872,6.94
3873,7.16
3874,7.45
3875,7.75
3876,8.06
3877,8.35
3878,8.61
3879,8.85
3880,9.05
3881,9.19
3882,9.28
3883,9.36
3884,9.42
3885,9.45
3886,9.40
3887,9.31
3888,9.17
3889,9.02
3890,8.81
3891,8.58
3892,8.32
3893,8.05
3894,7.71
3895,7.35
3896,6.92
3897,6.45
3898,5.87
3899,5.20
3900,4.46
3901,3.77
3902,3.14
3903,2.66
3904,2.26
3905,2.00
3906,1.82
3907,1.75
3908,1.70
3909,1.64
3910,1.49
3911,1.30
3912,1.05
3913,0.77
3914,0.47
3915,0.20
3916,-0.04
3917,-0.21
3918,-0.37
3919,-0.56
3920,-0.82
3921,-1.10
3922,-1.37
3923,-1.63
3924,-1.88
3925,-2.08
3926,-2.17
3927,-2.14
3928,-2.01
3929,-1.84
3930,-1.66
3931,-1.49
3932,-1.33
3933,-1.23
3934,-1.18
3935,-1.17
3936,-1.14
3937,-1.05
3938,-0.85
3939,-0.52
3940,-0.02
3941,0.62
3942,1.37
3943,2.17
3944,2.96
3945,3.65
3946,4.23
3947,4.64
3948,4.92
3949,5.04
3950,5.05
3951,4.93
3952,4.81
3953,4.71
3954,4.70
3955,4.75
3956,4.94
3957,5.23
3958,5.63
3959,6.04
3960,6.44
3961,6.77
3962,7.09
3963,7.35
3964,7.59
3965,7.78
3966,7.99
3967,8.24
3968,8.58
3969,8.93
3970,9.28
3971,9.57
3972,9.77
3973,9.86
3974,9.83
3975,9.69
3976,9.48
3977,9.25
3978,9.06
3979,8.93
3980,8.92
3981,9.02
3982,9.22
3983,9.47
3984,9.70
3985,9.90
3986,10.08
3987,10.21
3988,10.30
3989,10.36
3990,10.44
3991,10.57
3992,10.77
3993,10.99
3994,11.20
3995,11.38
3996,11.52
3997,11.63
3998,11.67
3999,11.63
4000,11.51
4001,11.34
4002,11.18
4003,11.01
4004,10.77
4005,10.51
4006,10.20
4007,9.91
4008,9.57
4009,9.20
4010,8.80
4011,8.45
4012,8.13
4013,7.84
4014,7.53
4015,7.23
4016,6.95
4017,6.71
4018,6.52
4019,6.39
4020,6.32
4021,6.33
4022,6.42
4023,6.58
4024,6.79
4025,7.01
4026,7.25
4027,7.46
4028,7.65
4029,7.80
4030,7.95
4031,8.06
4032,8.16
4033,8.22
4034,8.25
4035,8.22
4036,8.16
4037,8.09
4038,8.09
4039,8.17
4040,8.40
4041,8.72
4042,9.12
4043,9.54
4044,9.95
4045,10.31
4046,10.61
4047,10.83
4048,10.96
4049,11.03
4050,11.09
4051,11.12
4052,11.15
4053,11.13
4054,11.06
4055,10.96
4056,10.86
4057,10.73
4058,10.57
4059,10.40
4060,10.23
4061,10.09
4062,9.93
4063,9.75
4064,9.51
4065,9.25
4066,8.97
4067,8.71
4068,8.48
4069,8.32
4070,8.17
4071,8.04
4072,7.87
4073,7.65
4074,7.39
4075,7.14
4076,6.90
4077,6.68
4078,6.47
4079,6.34
4080,6.28
4081,6.29
4082,6.29
4083,6.30
4084,6.30
4085,6.30
4086,6.26
4087,6.20
4088,6.09
4089,5.97
4090,5.82
4091,5.71
4092,5.65
4093,5.61
4094,5.53
4095,5.39
4096,5.23
4097,5.09
4098,4.96
4099,4.87
4100,4.84
4101,4.91
4102,5.07
4103,5.28
4104,5.49
4105,5.63
4106,5.66
4107,5.59
4108,5.42
4109,5.20
4110,4.94
4111,4.71
4112,4.52
4113,4.43
4114,4.36
4115,4.32
4116,4.23
4117,4.11
4118,3.94
4119,3.72
4120,3.47
4121,3.23
4122,3.01
4123,2.82
4124,2.65
4125,2.51
4126,2.39
4127,2.28
4128,2.22
4129,2.21
4130,2.27
4131,2.40
4132,2.59
4133,2.85
4134,3.15
4135,3.49
4136,3.88
4137,4.24
4138,4.61
4139,4.94
4140,5.29
4141,5.59
4142,5.87
4143,6.08
4144,6.29
4145,6.50
4146,6.72
4147,6.91
4148,7.13
4149,7.35
4150,7.61
4151,7.84
4152,8.08
4153,8.29
4154,8.51
4155,8.72
4156,8.97
4157,9.26
4158,9.63
4159,10.04
4160,10.50
4161,10.97
4162,11.48
4163,11.93
4164,12.29
4165,12.50
4166,12.62
4167,12.67
4168,12.71
4169,12.73
4170,12.73
4171,12.76
4172,12.79
4173,12.83
4174,12.83
4175,12.74
4176,12.52
4177,12.18
4178,11.74
4179,11.29
4180,10.84
4181,10.43
4182,10.03
4183,9.65
4184,9.32
4185,9.06
4186,8.87
4187,8.74
4188,8.61
4189,8.53
4190,8.44
4191,8.39
4192,8.34
4193,8.32
4194,8.32
4195,8.33
4196,8.29
4197,8.18
4198,7.97
4199,7.72
4200,7.41
4201,7.10
4202,6.78
4203,6.52
4204,6.34
4205,6.25
4206,6.20
4207,6.17
4208,6.10
4209,5.97
4210,5.80
4211,5.58
4212,5.33
4213,5.07
4214,4.84
4215,4.66
4216,4.53
4217,4.46
4218,4.40
4219,4.37
4220,4.35
4221,4.36
4222,4.35
4223,4.32
4224,4.20
4225,4.01
4226,3.72
4227,3.37
4228,2.94
4229,2.50
4230,2.11
4231,1.81
4232,1.60
4233,1.50
4234,1.44
4235,1.40
4236,1.32
4237,1.19
4238,1.01
4239,0.82
4240,0.66
4241,0.56
4242,0.54
4243,0.64
4244,0.88
4245,1.19
4246,1.54
4247,1.86
4248,2.17
4249,2.43
4250,2.67
4251,2.88
4252,3.14
4253,3.43
4254,3.76
4255,4.08
4256,4.41
4257,4.74
4258,5.09
4259,5.40
4260,5.67
4261,5.87
4262,6.02
4263,6.10
4264,6.09
4265,5.99
4266,5.82
4267,5.58
4268,5.27
4269,4.93
4270,4.60
4271,4.32
4272,4.08
4273,3.90
4274,3.72
4275,3.56
4276,3.31
4277,2.98
4278,2.53
4279,2.04
4280,1.50
4281,0.98
4282,0.43
4283,-0.05
4284,-0.49
4285,-0.85
4286,-1.18
4287,-1.49
4288,-1.79
4289,-2.04
4290,-2.29
4291,-2.53
4292,-2.73
4293,-2.88
4294,-2.93
4295,-2.91
4296,-2.82
4297,-2.66
4298,-2.43
4299,-2.14
4300,-1.78
4301,-1.40
4302,-1.01
4303,-0.64
4304,-0.26
4305,0.11
4306,0.50
4307,0.85
4308,1.17
4309,1.42
4310,1.65
4311,1.83
4312,2.04
4313,2.22
4314,2.45
4315,2.70
4316,3.02
4317,3.36
4318,3.75
4319,4.12
4320,4.52
4321,4.89
4322,5.22
4323,5.46
4324,5.63
4325,5.76
4326,5.87
4327,5.92
4328,5.97
4329,5.99
4330,6.06
4331,6.19
4332,6.42
4333,6.77
4334,7.19
4335,7.62
4336,8.04
4337,8.38
4338,8.63
4339,8.74
4340,8.75
4341,8.67
4342,8.61
4343,8.60
4344,8.69
4345,8.87
4346,9.12
4347,9.37
4348,9.55
4349,9.65
4350,9.68
4351,9.65
4352,9.58
4353,9.52
4354,9.53
4355,9.61
4356,9.74
4357,9.91
4358,10.09
4359,10.26
4360,10.42
4361,10.54
4362,10.63
4363,10.69
4364,10.71
4365,10.72
4366,10.69
4367,10.63
4368,10.55
4369,10.48
4370,10.39
4371,10.31
4372,10.22
4373,10.15
4374,10.08
4375,9.99
4376,9.80
4377,9.51
4378,9.10
4379,8.62
4380,8.08
4381,7.55
4382,7.05
4383,6.64
4384,6.29
4385,6.07
4386,5.91
4387,5.82
4388,5.72
4389,5.62
4390,5.46
4391,5.29
4392,5.08
4393,4.88
4394,4.65
4395,4.46
4396,4.26
4397,4.05
4398,3.79
4399,3.50
4400,3.15
4401,2.78
4402,2.37
4403,1.99
4404,1.66
4405,1.43
4406,1.28
4407,1.22
4408,1.23
4409,1.30
4410,1.37
4411,1.42
4412,1.37
4413,1.26
4414,1.11
4415,0.94
4416,0.78
4417,0.66
4418,0.63
4419,0.74
4420,1.01
4421,1.39
4422,1.85
4423,2.34
4424,2.88
4425,3.40
4426,3.85
4427,4.23
4428,4.55
4429,4.81
4430,4.97
4431,5.04
4432,5.01
4433,4.92
4434,4.81
4435,4.66
4436,4.52
4437,4.42
4438,4.39
4439,4.44
4440,4.58
4441,4.76
4442,4.97
4443,5.20
4444,5.39
4445,5.55
4446,5.67
4447,5.73
4448,5.74
4449,5.71
4450,5.68
4451,5.70
4452,5.79
4453,5.94
4454,6.11
4455,6.25
4456,6.32
4457,6.29
4458,6.20
4459,6.07
4460,5.99
4461,5.97
4462,6.09
4463,6.32
4464,6.69
4465,7.11
4466,7.53
4467,7.89
4468,8.20
4469,8.44
4470,8.66
4471,8.88
4472,9.15
4473,9.45
4474,9.74
4475,9.96
4476,10.10
4477,10.15
4478,10.11
4479,9.99
4480,9.85
4481,9.77
4482,9.78
4483,9.89
4484,10.03
4485,10.17
4486,10.19
4487,10.04
4488,9.66
4489,9.09
4490,8.32
4491,7.48
4492,6.56
4493,5.68
4494,4.88
4495,4.20
4496,3.65
4497,3.25
4498,2.93
4499,2.73
4500,2.57
4501,2.48
4502,2.40
4503,2.35
4504,2.31
4505,2.28
4506,2.20
4507,2.10
4508,2.00
4509,1.92
4510,1.85
4511,1.79
4512,1.77
4513,1.82
4514,1.98
4515,2.20
4516,2.46
4517,2.74
4518,3.04
4519,3.33
4520,3.62
4521,3.87
4522,4.12
4523,4.36
4524,4.65
4525,4.94
4526,5.26
4527,5.58
4528,5.91
4529,6.24
4530,6.58
4531,6.90
4532,7.19
4533,7.44
4534,7.70
4535,7.97
4536,8.29
4537,8.60
4538,8.91
4539,9.19
4540,9.45
4541,9.64
4542,9.77
4543,9.80
4544,9.77
4545,9.68
4546,9.57
4547,9.44
4548,9.25
4549,9.03
4550,8.74
4551,8.41
4552,8.06
4553,7.71
4554,7.35
4555,7.06
4556,6.81
4557,6.64
4558,6.52
4559,6.45
4560,6.39
4561,6.36
4562,6.32
4563,6.33
4564,6.35
4565,6.36
4566,6.30
4567,6.23
4568,6.13
4569,6.04
4570,5.91
4571,5.74
4572,5.51
4573,5.23
4574,4.89
4575,4.54
4576,4.18
4577,3.87
4578,3.56
4579,3.32
4580,3.11
4581,2.98
4582,2.87
4583,2.80
4584,2.75
4585,2.69
4586,2.58
4587,2.41
4588,2.18
4589,1.96
4590,1.75
4591,1.60
4592,1.49
4593,1.41
4594,1.34
4595,1.27
4596,1.17
4597,1.01
4598,0.79
4599,0.57
4600,0.39
4601,0.27
4602,0.17
4603,0.08
4604,-0.03
4605,-0.17
4606,-0.37
4607,-0.62
4608,-0.90
4609,-1.15
4610,-1.31
4611,-1.34
4612,-1.18
4613,-0.90
4614,-0.55
4615,-0.21
4616,0.08
4617,0.27
4618,0.38
4619,0.42
4620,0.44
4621,0.47
4622,0.54
4623,0.69
4624,0.93
4625,1.22
4626,1.53
4627,1.79
4628,2.01
4629,2.20
4630,2.36
4631,2.47
4632,2.62
4633,2.73
4634,2.86
4635,3.01
4636,3.30
4637,3.67
4638,4.14
4639,4.66
4640,5.29
4641,5.98
4642,6.75
4643,7.47
4644,8.13
4645,8.65
4646,9.06
4647,9.31
4648,9.48
4649,9.58
4650,9.67
4651,9.77
4652,9.95
4653,10.22
4654,10.55
4655,10.88
4656,11.16
4657,11.36
4658,11.42
4659,11.33
4660,11.09
4661,10.74
4662,10.32
4663,9.90
4664,9.48
4665,9.09
4666,8.74
4667,8.40
4668,8.10
4669,7.87
4670,7.68
4671,7.56
4672,7.51
4673,7.59
4674,7.71
4675,7.83
4676,7.83
4677,7.70
4678,7.43
4679,7.06
4680,6.62
4681,6.16
4682,5.74
4683,5.42
4684,5.22
4685,5.14
4686,5.17
4687,5.25
4688,5.36
4689,5.46
4690,5.55
4691,5.67
4692,5.81
4693,6.00
4694,6.21
4695,6.39
4696,6.50
4697,6.55
4698,6.54
4699,6.48
4700,6.40
4701,6.30
4702,6.23
4703,6.21
4704,6.22
4705,6.21
4706,6.13
4707,5.97
4708,5.72
4709,5.40
4710,5.04
4711,4.68
4712,4.37
4713,4.14
4714,3.94
4715,3.78
4716,3.67
4717,3.55
4718,3.37
4719,3.15
4720,2.95
4721,2.82
4722,2.78
4723,2.82
4724,2.97
4725,3.27
4726,3.72
4727,4.29
4728,4.88
4729,5.43
4730,5.96
4731,6.45
4732,6.94
4733,7.37
4734,7.74
4735,8.04
4736,8.29
4737,8.45
4738,8.55
4739,8.57
4740,8.56
4741,8.55
4742,8.57
4743,8.58
4744,8.64
4745,8.71
4746,8.81
4747,8.92
4748,9.01
4749,9.04
4750,9.02
4751,8.96
4752,8.90
4753,8.88
4754,8.88
4755,8.91
4756,8.95
4757,8.97
4758,8.93
4759,8.83
4760,8.61
4761,8.32
4762,7.90
4763,7.37
4764,6.74
4765,6.08
4766,5.39
4767,4.75
4768,4.15
4769,3.68
4770,3.30
4771,3.05
4772,2.89
4773,2.84
4774,2.85
4775,2.89
4776,2.94
4777,2.96
4778,2.94
4779,2.88
4780,2.82
4781,2.78
4782,2.84
4783,3.00
4784,3.27
4785,3.60
4786,4.00
4787,4.39
4788,4.78
4789,5.07
4790,5.27
4791,5.34
4792,5.33
4793,5.26
4794,5.20
4795,5.13
4796,5.08
4797,5.04
4798,5.04
4799,5.08
4800,5.20
4801,5.33
4802,5.52
4803,5.69
4804,5.84
4805,5.98
4806,6.14
4807,6.29
4808,6.43
4809,6.55
4810,6.70
4811,6.93
4812,7.26
4813,7.62
4814,7.98
4815,8.30
4816,8.58
4817,8.75
4818,8.80
4819,8.72
4820,8.55
4821,8.38
4822,8.28
4823,8.23
4824,8.26
4825,8.30
4826,8.33
4827,8.29
4828,8.16
4829,7.97
4830,7.71
4831,7.45
4832,7.23
4833,7.13
4834,7.16
4835,7.26
4836,7.39
4837,7.50
4838,7.55
4839,7.51
4840,7.37
4841,7.19
4842,7.02
4843,6.92
4844,6.87
4845,6.88
4846,6.93
4847,7.00
4848,7.02
4849,6.97
4850,6.81
4851,6.62
4852,6.38
4853,6.13
4854,5.84
4855,5.55
4856,5.23
4857,4.91
4858,4.49
4859,4.00
4860,3.46
4861,2.95
4862,2.51
4863,2.18
4864,1.95
4865,1.84
4866,1.78
4867,1.78
4868,1.78
4869,1.77
4870,1.67
4871,1.50
4872,1.25
4873,0.99
4874,0.73
4875,0.52
4876,0.34
4877,0.19
4878,0.02
4879,-0.20
4880,-0.45
4881,-0.69
4882,-0.90
4883,-1.08
4884,-1.22
4885,-1.28
4886,-1.25
4887,-1.17
4888,-1.10
4889,-1.11
4890,-1.22
4891,-1.41
4892,-1.64
4893,-1.88
4894,-2.08
4895,-2.19
4896,-2.15
4897,-1.95
4898,-1.60
4899,-1.18
4900,-0.74
4901,-0.34
4902,0.00
4903,0.30
4904,0.56
4905,0.78
4906,0.95
4907,1.08
4908,1.22
4909,1.36
4910,1.47
4911,1.51
4912,1.49
4913,1.42
4914,1.35
4915,1.30
4916,1.30
4917,1.34
4918,1.41
4919,1.47
4920,1.52
4921,1.56
4922,1.59
4923,1.66
4924,1.75
4925,1.88
4926,2.06
4927,2.24
4928,2.41
4929,2.50
4930,2.53
4931,2.51
4932,2.48
4933,2.43
4934,2.40
4935,2.42
4936,2.53
4937,2.68
4938,2.84
4939,2.94
4940,2.99
4941,3.01
4942,3.07
4943,3.17
4944,3.33
4945,3.52
4946,3.76
4947,4.02
4948,4.30
4949,4.55
4950,4.78
4951,4.97
4952,5.20
4953,5.42
4954,5.65
4955,5.85
4956,6.05
4957,6.25
4958,6.42
4959,6.55
4960,6.60
4961,6.60
4962,6.55
4963,6.49
4964,6.42
4965,6.34
4966,6.16
4967,5.87
4968,5.42
4969,4.87
4970,4.23
4971,3.59
4972,2.98
4973,2.47
4974,2.06
4975,1.79
4976,1.63
4977,1.57
4978,1.57
4979,1.59
4980,1.62
4981,1.64
4982,1.67
4983,1.71
4984,1.75
4985,1.83
4986,1.98
4987,2.19
4988,2.47
4989,2.75
4990,3.01
4991,3.24
4992,3.48
4993,3.69
4994,3.91
4995,4.07
4996,4.23
4997,4.33
4998,4.46
4999,4.61
5000,4.83
5001,5.07
5002,5.36
5003,5.67
5004,6.07
5005,6.52
5006,7.02
5007,7.49
5008,7.97
5009,8.39
5010,8.79
5011,9.12
5012,9.42
5013,9.70
5014,9.96
5015,10.15
5016,10.31
5017,10.46
5018,10.66
5019,10.87
5020,11.07
5021,11.19
5022,11.24
5023,11.20
5024,11.05
5025,10.77
5026,10.37
5027,9.91
5028,9.44
5029,9.02
5030,8.66
5031,8.37
5032,8.12
5033,7.93
5034,7.75
5035,7.61
5036,7.45
5037,7.29
5038,7.12
5039,6.99
5040,6.89
5041,6.81
5042,6.70
5043,6.58
5044,6.44
5045,6.30
5046,6.11
5047,5.90
5048,5.69
5049,5.55
5050,5.45
5051,5.36
5052,5.26
5053,5.19
5054,5.10
5055,4.98
5056,4.83
5057,4.66
5058,4.51
5059,4.42
5060,4.39
5061,4.41
5062,4.46
5063,4.55
5064,4.67
5065,4.83
5066,4.97
5067,5.08
5068,5.13
5069,5.16
5070,5.12
5071,5.02
5072,4.87
5073,4.71
5074,4.59
5075,4.55
5076,4.56
5077,4.59
5078,4.59
5079,4.55
5080,4.46
5081,4.34
5082,4.20
5083,4.08
5084,4.02
5085,4.01
5086,4.05
5087,4.08
5088,4.08
5089,4.04
5090,3.94
5091,3.80
5092,3.64
5093,3.51
5094,3.48
5095,3.56
5096,3.75
5097,4.01
5098,4.31
5099,4.60
5100,4.88
5101,5.14
5102,5.38
5103,5.58
5104,5.74
5105,5.83
5106,5.90
5107,5.94
5108,6.00
5109,6.07
5110,6.14
5111,6.23
5112,6.36
5113,6.52
5114,6.73
5115,6.94
5116,7.16
5117,7.40
5118,7.67
5119,7.94
5120,8.21
5121,8.43
5122,8.64
5123,8.83
5124,9.01
5125,9.15
5126,9.25
5127,9.33
5128,9.38
5129,9.42
5130,9.46
5131,9.48
5132,9.46
5133,9.41
5134,9.33
5135,9.25
5136,9.14
5137,8.99
5138,8.77
5139,8.54
5140,8.26
5141,7.96
5142,7.58
5143,7.16
5144,6.71
5145,6.26
5146,5.79
5147,5.36
5148,4.96
5149,4.66
5150,4.46
5151,4.39
5152,4.41
5153,4.50
5154,4.59
5155,4.66
5156,4.66
5157,4.60
5158,4.49
5159,4.35
5160,4.20
5161,4.07
5162,4.03
5163,4.04
5164,4.10
5165,4.17
5166,4.24
5167,4.29
5168,4.31
5169,4.31
5170,4.33
5171,4.43
5172,4.61
5173,4.84
5174,5.14
5175,5.43
5176,5.71
5177,5.96
5178,6.16
5179,6.32
5180,6.41
5181,6.47
5182,6.55
5183,6.65
5184,6.72
5185,6.73
5186,6.64
5187,6.44
5188,6.11
5189,5.68
5190,5.17
5191,4.66
5192,4.21
5193,3.88
5194,3.67
5195,3.59
5196,3.60
5197,3.65
5198,3.70
5199,3.70
5200,3.62
5201,3.46
5202,3.26
5203,3.07
5204,2.94
5205,2.92
5206,3.04
5207,3.27
5208,3.60
5209,3.98
5210,4.41
5211,4.84
5212,5.27
5213,5.68
5214,6.12
5215,6.52
5216,6.92
5217,7.27
5218,7.63
5219,7.97
5220,8.27
5221,8.50
5222,8.70
5223,8.85
5224,8.97
5225,9.01
5226,8.98
5227,8.91
5228,8.87
5229,8.82
5230,8.77
5231,8.72
5232,8.67
5233,8.64
5234,8.64
5235,8.65
5236,8.64
5237,8.55
5238,8.38
5239,8.15
5240,7.88
5241,7.61
5242,7.27
5243,6.94
5244,6.65
5245,6.45
5246,6.29
5247,6.15
5248,5.98
5249,5.80
5250,5.58
5251,5.37
5252,5.18
5253,5.06
5254,5.00
5255,5.07
5256,5.26
5257,5.58
5258,5.97
5259,6.33
5260,6.65
5261,6.92
5262,7.19
5263,7.44
5264,7.71
5265,7.96
5266,8.22
5267,8.48
5268,8.73
5269,8.90
5270,9.00
5271,9.01
5272,9.00
5273,8.97
5274,8.95
5275,8.95
5276,8.99
5277,9.05
5278,9.09
5279,9.06
5280,8.93
5281,8.77
5282,8.58
5283,8.42
5284,8.32
5285,8.26
5286,8.22
5287,8.19
5288,8.21
5289,8.25
5290,8.29
5291,8.31
5292,8.32
5293,8.38
5294,8.51
5295,8.69
5296,8.90
5297,9.08
5298,9.22
5299,9.27
5300,9.25
5301,9.12
5302,8.95
5303,8.78
5304,8.68
5305,8.69
5306,8.76
5307,8.84
5308,8.91
5309,8.93
5310,8.89
5311,8.81
5312,8.71
5313,8.60
5314,8.51
5315,8.48
5316,8.48
5317,8.53
5318,8.58
5319,8.58
5320,8.53
5321,8.47
5322,8.42
5323,8.39
5324,8.40
5325,8.43
5326,8.47
5327,8.47
5328,8.38
5329,8.23
5330,8.03
5331,7.82
5332,7.63
5333,7.50
5334,7.43
5335,7.45
5336,7.53
5337,7.60
5338,7.60
5339,7.51
5340,7.30
5341,7.04
5342,6.75
5343,6.49
5344,6.27
5345,6.10
5346,5.96
5347,5.87
5348,5.79
5349,5.74
5350,5.68
5351,5.65
5352,5.61
5353,5.58
5354,5.50
5355,5.37
5356,5.13
5357,4.79
5358,4.38
5359,3.94
5360,3.50
5361,3.13
5362,2.82
5363,2.62
5364,2.53
5365,2.52
5366,2.53
5367,2.52
5368,2.43
5369,2.28
5370,2.04
5371,1.76
5372,1.48
5373,1.27
5374,1.19
5375,1.23
5376,1.37
5377,1.57
5378,1.83
5379,2.11
5380,2.39
5381,2.62
5382,2.81
5383,2.99
5384,3.18
5385,3.40
5386,3.63
5387,3.88
5388,4.14
5389,4.37
5390,4.54
5391,4.60
5392,4.57
5393,4.44
5394,4.26
5395,4.02
5396,3.82
5397,3.70
5398,3.70
5399,3.78
5400,3.89
5401,4.04
5402,4.23
5403,4.44
5404,4.62
5405,4.72
5406,4.78
5407,4.84
5408,4.90
5409,4.94
5410,4.97
5411,5.02
5412,5.12
5413,5.22
5414,5.30
5415,5.34
5416,5.35
5417,5.32
5418,5.29
5419,5.22
5420,5.16
5421,5.13
5422,5.18
5423,5.29
5424,5.47
5425,5.68
5426,5.97
5427,6.30
5428,6.69
5429,7.08
5430,7.51
5431,7.95
5432,8.39
5433,8.76
5434,9.05
5435,9.23
5436,9.33
5437,9.32
5438,9.21
5439,9.03
5440,8.85
5441,8.73
5442,8.64
5443,8.54
5444,8.43
5445,8.28
5446,8.03
5447,7.66
5448,7.13
5449,6.52
5450,5.85
5451,5.21
5452,4.61
5453,4.12
5454,3.75
5455,3.56
5456,3.50
5457,3.57
5458,3.72
5459,3.91
5460,4.06
5461,4.17
5462,4.21
5463,4.23
5464,4.25
5465,4.29
5466,4.33
5467,4.39
5468,4.50
5469,4.65
5470,4.84
5471,5.00
5472,5.13
5473,5.17
5474,5.18
5475,5.15
5476,5.15
5477,5.19
5478,5.29
5479,5.42
5480,5.59
5481,5.77
5482,5.95
5483,6.10
5484,6.24
5485,6.36
5486,6.48
5487,6.65
5488,6.91
5489,7.25
5490,7.66
5491,8.08
5492,8.48
5493,8.81
5494,9.09
5495,9.29
5496,9.38
5497,9.37
5498,9.25
5499,9.05
5500,8.77
5501,8.42
5502,8.06
5503,7.74
5504,7.48
5505,7.31
5506,7.21
5507,7.16
5508,7.08
5509,6.98
5510,6.81
5511,6.58
5512,6.23
5513,5.82
5514,5.38
5515,5.00
5516,4.66
5517,4.42
5518,4.25
5519,4.18
5520,4.12
5521,4.06
5522,3.92
5523,3.73
5524,3.45
5525,3.11
5526,2.73
5527,2.36
5528,1.98
5529,1.66
5530,1.35
5531,1.08
5532,0.81
5533,0.60
5534,0.43
5535,0.34
5536,0.27
5537,0.21
5538,0.15
5539,0.12
5540,0.11
5541,0.11
5542,0.10
5543,0.11
5544,0.13
5545,0.17
5546,0.20
5547,0.22
5548,0.24
5549,0.24
5550,0.22
5551,0.18
5552,0.12
5553,0.08
5554,0.05
5555,0.00
5556,-0.12
5557,-0.32
5558,-0.56
5559,-0.79
5560,-1.05
5561,-1.30
5562,-1.54
5563,-1.72
5564,-1.85
5565,-1.92
5566,-1.98
5567,-2.04
5568,-2.10
5569,-2.10
5570,-2.02
5571,-1.87
5572,-1.64
5573,-1.38
5574,-1.08
5575,-0.79
5576,-0.51
5577,-0.27
5578,-0.05
5579,0.15
5580,0.38
5581,0.63
5582,0.97
5583,1.34
5584,1.75
5585,2.12
5586,2.46
5587,2.73
5588,2.95
5589,3.10
5590,3.23
5591,3.33
5592,3.49
5593,3.67
5594,3.96
5595,4.29
5596,4.68
5597,5.07
5598,5.49
5599,5.89
5600,6.30
5601,6.67
5602,7.03
5603,7.40
5604,7.83
5605,8.26
5606,8.69
5607,9.06
5608,9.41
5609,9.70
5610,9.93
5611,10.06
5612,10.13
5613,10.15
5614,10.15
5615,10.12
5616,10.08
5617,10.00
5618,9.89
5619,9.73
5620,9.52
5621,9.29
5622,9.09
5623,8.96
5624,8.90
5625,8.90
5626,8.93
5627,9.00
5628,9.09
5629,9.16
5630,9.18
5631,9.17
5632,9.16
5633,9.18
5634,9.17
5635,9.12
5636,9.05
5637,9.00
5638,8.97
5639,8.94
5640,8.91
5641,8.89
5642,8.86
5643,8.80
5644,8.71
5645,8.59
5646,8.43
5647,8.26
5648,8.07
5649,7.89
5650,7.71
5651,7.58
5652,7.50
5653,7.48
5654,7.47
5655,7.46
5656,7.45
5657,7.45
5658,7.43
5659,7.43
5660,7.40
5661,7.37
5662,7.27
5663,7.10
5664,6.83
5665,6.46
5666,5.95
5667,5.32
5668,4.56
5669,3.78
5670,3.04
5671,2.43
5672,1.95
5673,1.66
5674,1.51
5675,1.50
5676,1.58
5677,1.69
5678,1.74
5679,1.69
5680,1.51
5681,1.25
5682,0.93
5683,0.59
5684,0.27
5685,0.05
5686,-0.05
5687,0.02
5688,0.23
5689,0.53
5690,0.95
5691,1.43
5692,1.98
5693,2.57
5694,3.19
5695,3.80
5696,4.42
5697,4.99
5698,5.51
5699,5.90
5700,6.20
5701,6.43
5702,6.65
5703,6.83
5704,7.04
5705,7.25
5706,7.50
5707,7.71
5708,7.90
5709,8.00
5710,8.09
5711,8.16
5712,8.26
5713,8.38
5714,8.52
5715,8.73
5716,8.98
5717,9.25
5718,9.45
5719,9.56
5720,9.53
5721,9.35
5722,9.01
5723,8.54
5724,7.95
5725,7.35
5726,6.77
5727,6.26
5728,5.79
5729,5.39
5730,5.00
5731,4.65
5732,4.30
5733,3.98
5734,3.68
5735,3.46
5736,3.26
5737,3.07
5738,2.83
5739,2.59
5740,2.32
5741,2.08
5742,1.85
5743,1.69
5744,1.65
5745,1.72
5746,1.91
5747,2.15
5748,2.44
5749,2.73
5750,3.02
5751,3.30
5752,3.60
5753,3.91
5754,4.24
5755,4.58
5756,4.93
5757,5.26
5758,5.58
5759,5.79
5760,5.91
5761,5.97
5762,6.03
5763,6.10
5764,6.25
5765,6.44
5766,6.74
5767,7.09
5768,7.47
5769,7.79
5770,8.04
5771,8.20
5772,8.33
5773,8.45
5774,8.62
5775,8.82
5776,9.08
5777,9.38
5778,9.75
5779,10.15
5780,10.51
5781,10.80
5782,11.01
5783,11.16
5784,11.27
5785,11.32
5786,11.34
5787,11.32
5788,11.26
5789,11.13
5790,10.96
5791,10.78
5792,10.64
5793,10.53
5794,10.48
5795,10.47
5796,10.56
5797,10.76
5798,11.03
5799,11.34
5800,11.64
5801,11.92
5802,12.16
5803,12.36
5804,12.54
5805,12.66
5806,12.77
5807,12.85
5808,12.92
5809,12.98
5810,13.01
5811,13.01
5812,13.01
5813,13.03
5814,13.05
5815,13.05
5816,13.04
5817,13.02
5818,12.99
5819,12.91
5820,12.75
5821,12.52
5822,12.21
5823,11.90
5824,11.57
5825,11.25
5826,10.94
5827,10.70
5828,10.48
5829,10.29
5830,10.06
5831,9.79
5832,9.46
5833,9.11
5834,8.71
5835,8.32
5836,7.93
5837,7.64
5838,7.42
5839,7.26
5840,7.06
5841,6.86
5842,6.60
5843,6.31
5844,5.94
5845,5.49
5846,4.95
5847,4.39
5848,3.81
5849,3.29
5850,2.81
5851,2.41
5852,2.08
5853,1.85
5854,1.70
5855,1.65
5856,1.65
5857,1.72
5858,1.83
5859,1.99
5860,2.18
5861,2.43
5862,2.73
5863,3.07
5864,3.40
5865,3.70
5866,3.97
5867,4.23
5868,4.47
5869,4.68
5870,4.91
5871,5.14
5872,5.39
5873,5.61
5874,5.79
5875,5.92
5876,6.04
5877,6.11
5878,6.15
5879,6.14
5880,6.16
5881,6.23
5882,6.38
5883,6.56
5884,6.76
5885,6.96
5886,7.14
5887,7.26
5888,7.29
5889,7.26
5890,7.16
5891,7.03
5892,6.90
5893,6.82
5894,6.84
5895,6.98
5896,7.18
5897,7.41
5898,7.66
5899,7.89
5900,8.07
5901,8.19
5902,8.29
5903,8.36
5904,8.42
5905,8.44
5906,8.46
5907,8.51
5908,8.62
5909,8.80
5910,9.06
5911,9.35
5912,9.67
5913,9.99
5914,10.32
5915,10.64
5916,10.89
5917,11.01
5918,11.02
5919,10.98
5920,10.90
5921,10.83
5922,10.75
5923,10.69
5924,10.64
5925,10.57
5926,10.43
5927,10.18
5928,9.75
5929,9.19
5930,8.54
5931,7.89
5932,7.24
5933,6.67
5934,6.20
5935,5.88
5936,5.70
5937,5.63
5938,5.60
5939,5.59
5940,5.55
5941,5.47
5942,5.35
5943,5.23
5944,5.14
5945,5.09
5946,5.10
5947,5.19
5948,5.36
5949,5.57
5950,5.82
5951,6.07
5952,6.36
5953,6.70
5954,7.08
5955,7.45
5956,7.82
5957,8.18
5958,8.54
5959,8.87
5960,9.17
5961,9.41
5962,9.70
5963,10.01
5964,10.35
5965,10.62
5966,10.86
5967,11.05
5968,11.23
5969,11.38
5970,11.53
5971,11.68
5972,11.89
5973,12.15
5974,12.45
5975,12.76
5976,13.00
5977,13.15
5978,13.15
5979,13.03
5980,12.79
5981,12.48
5982,12.11
5983,11.73
5984,11.35
5985,11.06
5986,10.85
5987,10.70
5988,10.52
5989,10.31
5990,10.06
5991,9.78
5992,9.44
5993,9.03
5994,8.56
5995,8.13
5996,7.74
5997,7.44
5998,7.23
5999,7.16
6000,7.21
6001,7.38
6002,7.60
6003,7.81
6004,7.93
6005,7.93
6006,7.80
6007,7.56
6008,7.26
6009,6.93
6010,6.63
6011,6.43
6012,6.36
6013,6.45
6014,6.65
6015,6.92
6016,7.19
6017,7.40
6018,7.47
6019,7.35
6020,7.04
6021,6.60
6022,6.09
6023,5.61
6024,5.19
6025,4.88
6026,4.65
6027,4.48
6028,4.30
6029,4.04
6030,3.68
6031,3.24
6032,2.76
6033,2.33
6034,1.95
6035,1.73
6036,1.63
6037,1.63
6038,1.68
6039,1.73
6040,1.72
6041,1.66
6042,1.46
6043,1.19
6044,0.83
6045,0.50
6046,0.22
6047,0.05
6048,-0.07
6049,-0.14
6050,-0.19
6051,-0.21
6052,-0.20
6053,-0.18
6054,-0.16
6055,-0.08
6056,0.10
6057,0.34
6058,0.65
6059,0.97
6060,1.33
6061,1.68
6062,2.01
6063,2.28
6064,2.54
6065,2.78
6066,3.05
6067,3.30
6068,3.60
6069,3.93
6070,4.31
6071,4.70
6072,5.13
6073,5.56
6074,6.01
6075,6.40
6076,6.74
6077,6.97
6078,7.13
6079,7.23
6080,7.35
6081,7.48
6082,7.68
6083,7.93
6084,8.26
6085,8.61
6086,8.99
6087,9.32
6088,9.62
6089,9.83
6090,9.96
6091,10.02
6092,10.06
6093,10.09
6094,10.12
6095,10.13
6096,10.19
6097,10.26
6098,10.32
6099,10.33
6100,10.27
6101,10.14
6102,9.97
6103,9.75
6104,9.50
6105,9.25
6106,9.07
6107,8.97
6108,8.95
6109,9.00
6110,9.10
6111,9.26
6112,9.45
6113,9.65
6114,9.84
6115,9.96
6116,9.99
6117,9.93
6118,9.83
6119,9.72
6120,9.62
6121,9.51
6122,9.45
6123,9.44
6124,9.53
6125,9.70
6126,9.90
6127,10.07
6128,10.20
6129,10.26
6130,10.26
6131,10.22
6132,10.15
6133,10.07
6134,9.98
6135,9.90
6136,9.84
6137,9.83
6138,9.83
6139,9.83
6140,9.82
6141,9.79
6142,9.70
6143,9.61
6144,9.49
6145,9.36
6146,9.18
6147,8.93
6148,8.57
6149,8.16
6150,7.71
6151,7.26
6152,6.83
6153,6.46
6154,6.16
6155,6.00
6156,5.89
6157,5.80
6158,5.66
6159,5.49
6160,5.26
6161,5.03
6162,4.77
6163,4.53
6164,4.33
6165,4.22
6166,4.17
6167,4.17
6168,4.20
6169,4.24
6170,4.33
6171,4.46
6172,4.65
6173,4.86
6174,5.11
6175,5.39
6176,5.69
6177,5.95
6178,6.16
6179,6.29
6180,6.39
6181,6.48
6182,6.58
6183,6.68
6184,6.72
6185,6.70
6186,6.60
6187,6.42
6188,6.17
6189,5.87
6190,5.53
6191,5.20
6192,4.89
6193,4.68
6194,4.54
6195,4.46
6196,4.33
6197,4.17
6198,3.91
6199,3.59
6200,3.20
6201,2.78
6202,2.36
6203,1.99
6204,1.66
6205,1.36
6206,1.07
6207,0.80
6208,0.54
6209,0.30
6210,0.05
6211,-0.18
6212,-0.39
6213,-0.53
6214,-0.60
6215,-0.57
6216,-0.48
6217,-0.32
6218,-0.09
6219,0.19
6220,0.49
6221,0.77
6222,1.03
6223,1.24
6224,1.43
6225,1.56
6226,1.66
6227,1.75
6228,1.88
6229,2.01
6230,2.19
6231,2.40
6232,2.67
6233,2.94
6234,3.23
6235,3.51
6236,3.79
6237,4.04
6238,4.24
6239,4.38
6240,4.51
6241,4.59
6242,4.62
6243,4.61
6244,4.61
6245,4.65
6246,4.75
6247,4.90
6248,5.11
6249,5.38
6250,5.69
6251,5.97
6252,6.20
6253,6.34
6254,6.38
6255,6.32
6256,6.18
6257,5.97
6258,5.73
6259,5.49
6260,5.31
6261,5.19
6262,5.10
6263,5.04
6264,5.04
6265,5.07
6266,5.13
6267,5.17
6268,5.13
6269,5.03
6270,4.85
6271,4.64
6272,4.39
6273,4.14
6274,3.87
6275,3.62
6276,3.44
6277,3.33
6278,3.25
6279,3.19
6280,3.14
6281,3.12
6282,3.14
6283,3.20
6284,3.27
6285,3.36
6286,3.46
6287,3.52
6288,3.49
6289,3.40
6290,3.27
6291,3.11
6292,2.88
6293,2.60
6294,2.34
6295,2.14
6296,1.95
6297,1.76
6298,1.58
6299,1.42
6300,1.24
6301,1.08
6302,0.91
6303,0.81
6304,0.77
6305,0.80
6306,0.85
6307,0.92
6308,0.95
6309,0.93
6310,0.78
6311,0.51
6312,0.09
6313,-0.42
6314,-1.02
6315,-1.63
6316,-2.26
6317,-2.85
6318,-3.43
6319,-3.93
6320,-4.39
6321,-4.80
6322,-5.23
6323,-5.63
6324,-6.04
6325,-6.41
6326,-6.78
6327,-7.12
6328,-7.40
6329,-7.58
6330,-7.68
6331,-7.73
6332,-7.78
6333,-7.84
6334,-7.90
6335,-7.99
6336,-8.09
6337,-8.18
6338,-8.16
6339,-7.99
6340,-7.63
6341,-7.13
6342,-6.49
6343,-5.78
6344,-5.02
6345,-4.30
6346,-3.59
6347,-2.98
6348,-2.46
6349,-2.06
6350,-1.69
6351,-1.39
6352,-1.10
6353,-0.88
6354,-0.63
6355,-0.42
6356,-0.14
6357,0.14
6358,0.50
6359,0.90
6360,1.40
6361,1.95
6362,2.59
6363,3.21
6364,3.81
6365,4.32
6366,4.80
6367,5.20
6368,5.55
6369,5.80
6370,6.03
6371,6.23
6372,6.43
6373,6.57
6374,6.68
6375,6.72
6376,6.74
6377,6.69
6378,6.62
6379,6.55
6380,6.54
6381,6.63
6382,6.87
6383,7.23
6384,7.68
6385,8.16
6386,8.64
6387,9.05
6388,9.41
6389,9.67
6390,9.90
6391,10.09
6392,10.31
6393,10.58
6394,10.94
6395,11.34
6396,11.73
6397,12.05
6398,12.28
6399,12.38
6400,12.34
6401,12.17
6402,11.94
6403,11.72
6404,11.54
6405,11.39
6406,11.22
6407,11.00
6408,10.72
6409,10.38
6410,9.97
6411,9.51
6412,9.04
6413,8.64
6414,8.33
6415,8.12
6416,7.97
6417,7.90
6418,7.87
6419,7.92
6420,8.01
6421,8.15
6422,8.32
6423,8.54
6424,8.83
6425,9.14
6426,9.46
6427,9.74
6428,10.00
6429,10.23
6430,10.43
6431,10.57
6432,10.67
6433,10.77
6434,10.87
6435,10.96
6436,11.06
6437,11.15
6438,11.28
6439,11.41
6440,11.58
6441,11.75
6442,11.93
6443,12.11
6444,12.31
6445,12.50
6446,12.70
6447,12.89
6448,13.13
6449,13.40
6450,13.71
6451,14.02
6452,14.30
6453,14.50
6454,14.56
6455,14.49
6456,14.28
6457,13.99
6458,13.66
6459,13.33
6460,13.02
6461,12.78
6462,12.61
6463,12.52
6464,12.46
6465,12.44
6466,12.38
6467,12.29
6468,12.08
6469,11.78
6470,11.35
6471,10.87
6472,10.35
6473,9.86
6474,9.40
6475,9.00
6476,8.67
6477,8.45
6478,8.29
6479,8.22
6480,8.16
6481,8.11
6482,8.05
6483,8.02
6484,7.97
6485,7.94
6486,7.91
6487,7.93
6488,7.92
6489,7.87
6490,7.71
6491,7.46
6492,7.11
6493,6.71
6494,6.27
6495,5.84
6496,5.44
6497,5.17
6498,5.00
6499,4.93
6500,4.89
6501,4.86
6502,4.79
6503,4.74
6504,4.69
6505,4.67
6506,4.66
6507,4.69
6508,4.75
6509,4.83
6510,4.89
6511,4.91
6512,4.91
6513,4.88
6514,4.84
6515,4.81
6516,4.78
6517,4.78
6518,4.79
6519,4.78
6520,4.71
6521,4.62
6522,4.49
6523,4.36
6524,4.26
6525,4.19
6526,4.12
6527,4.06
6528,4.01
6529,3.96
6530,3.93
6531,3.93
6532,3.99
6533,4.10
6534,4.29
6535,4.50
6536,4.75
6537,5.01
6538,5.27
6539,5.51
6540,5.73
6541,5.92
6542,6.10
6543,6.29
6544,6.48
6545,6.65
6546,6.79
6547,6.87
6548,6.93
6549,6.94
6550,6.90
6551,6.81
6552,6.66
6553,6.52
6554,6.39
6555,6.27
6556,6.16
6557,6.07
6558,6.08
6559,6.17
6560,6.35
6561,6.59
6562,6.90
6563,7.26
6564,7.64
6565,8.00
6566,8.34
6567,8.63
6568,8.88
6569,9.07
6570,9.24
6571,9.38
6572,9.48
6573,9.54
6574,9.57
6575,9.57
6576,9.54
6577,9.48
6578,9.38
6579,9.25
6580,9.05
6581,8.80
6582,8.54
6583,8.29
6584,8.04
6585,7.85
6586,7.69
6587,7.58
6588,7.48
6589,7.41
6590,7.34
6591,7.28
6592,7.23
6593,7.18
6594,7.16
6595,7.18
6596,7.27
6597,7.43
6598,7.63
6599,7.86
6600,8.09
6601,8.29
6602,8.42
6603,8.45
6604,8.36
6605,8.20
6606,7.95
6607,7.64
6608,7.27
6609,6.89
6610,6.49
6611,6.12
6612,5.78
6613,5.50
6614,5.26
6615,5.10
6616,4.97
6617,4.91
6618,4.88
6619,4.91
6620,4.93
6621,4.95
6622,4.91
6623,4.82
6624,4.68
6625,4.52
6626,4.33
6627,4.12
6628,3.86
6629,3.59
6630,3.30
6631,3.02
6632,2.75
6633,2.54
6634,2.38
6635,2.27
6636,2.16
6637,2.06
6638,1.97
6639,1.89
6640,1.80
6641,1.66
6642,1.48
6643,1.29
6644,1.16
6645,1.11
6646,1.20
6647,1.39
6648,1.71
6649,2.11
6650,2.66
6651,3.26
6652,3.93
6653,4.60
6654,5.29
6655,5.94
6656,6.55
6657,7.06
6658,7.52
6659,7.93
6660,8.33
6661,8.72
6662,9.12
6663,9.50
6664,9.86
6665,10.13
6666,10.31
6667,10.35
6668,10.25
6669,10.00
6670,9.64
6671,9.19
6672,8.74
6673,8.34
6674,8.01
6675,7.80
6676,7.69
6677,7.68
6678,7.68
6679,7.68
6680,7.61
6681,7.50
6682,7.31
6683,7.07
6684,6.79
6685,6.52
6686,6.23
6687,5.99
6688,5.75
6689,5.55
6690,5.29
6691,5.01
6692,4.65
6693,4.28
6694,3.87
6695,3.50
6696,3.17
6697,2.91
6698,2.70
6699,2.56
6700,2.44
6701,2.35
6702,2.21
6703,2.04
6704,1.83
6705,1.66
6706,1.50
6707,1.38
6708,1.30
6709,1.26
6710,1.25
6711,1.26
6712,1.25
6713,1.23
6714,1.22
6715,1.26
6716,1.35
6717,1.46
6718,1.61
6719,1.79
6720,2.01
6721,2.23
6722,2.40
6723,2.53
6724,2.62
6725,2.72
6726,2.80
6727,2.88
6728,2.99
6729,3.12
6730,3.28
6731,3.43
6732,3.62
6733,3.81
6734,4.03
6735,4.22
6736,4.40
6737,4.58
6738,4.77
6739,4.97
6740,5.17
6741,5.29
6742,5.39
6743,5.44
6744,5.49
6745,5.50
6746,5.51
6747,5.50
6748,5.51
6749,5.53
6750,5.53
6751,5.48
6752,5.36
6753,5.19
6754,5.02
6755,4.86
6756,4.71
6757,4.60
6758,4.52
6759,4.51
6760,4.52
6761,4.56
6762,4.62
6763,4.71
6764,4.79
6765,4.88
6766,4.94
6767,4.94
6768,4.85
6769,4.70
6770,4.46
6771,4.19
6772,3.88
6773,3.58
6774,3.31
6775,3.16
6776,3.12
6777,3.22
6778,3.35
6779,3.49
6780,3.55
6781,3.52
6782,3.33
6783,3.03
6784,2.59
6785,2.10
6786,1.54
6787,0.99
6788,0.46
6789,0.01
6790,-0.39
6791,-0.72
6792,-1.05
6793,-1.35
6794,-1.69
6795,-2.04
6796,-2.45
6797,-2.88
6798,-3.33
6799,-3.74
6800,-4.14
6801,-4.47
6802,-4.73
6803,-4.88
6804,-4.97
6805,-5.00
6806,-5.02
6807,-5.04
6808,-5.08
6809,-5.16
6810,-5.26
6811,-5.36
6812,-5.45
6813,-5.52
6814,-5.52
6815,-5.42
6816,-5.21
6817,-4.94
6818,-4.61
6819,-4.28
6820,-3.91
6821,-3.52
6822,-3.10
6823,-2.69
6824,-2.24
6825,-1.79
6826,-1.32
6827,-0.85
6828,-0.34
6829,0.14
6830,0.63
6831,1.01
6832,1.34
6833,1.63
6834,1.96
6835,2.27
6836,2.62
6837,2.96
6838,3.41
6839,3.89
6840,4.38
6841,4.78
6842,5.13
6843,5.43
6844,5.72
6845,5.97
6846,6.25
6847,6.51
6848,6.79
6849,7.05
6850,7.32
6851,7.57
6852,7.78
6853,7.93
6854,8.10
6855,8.29
6856,8.51
6857,8.73
6858,8.95
6859,9.16
6860,9.39
6861,9.58
6862,9.74
6863,9.90
6864,10.12
6865,10.41
6866,10.77
6867,11.15
6868,11.54
6869,11.91
6870,12.27
6871,12.54
6872,12.73
6873,12.82
6874,12.89
6875,12.98
6876,13.11
6877,13.28
6878,13.47
6879,13.69
6880,13.92
6881,14.14
6882,14.31
6883,14.40
6884,14.38
6885,14.31
6886,14.16
6887,13.95
6888,13.63
6889,13.24
6890,12.79
6891,12.34
6892,11.92
6893,11.56
6894,11.22
6895,10.95
6896,10.70
6897,10.50
6898,10.28
6899,10.07
6900,9.83
6901,9.60
6902,9.35
6903,9.13
6904,8.93
6905,8.78
6906,8.66
6907,8.57
6908,8.46
6909,8.36
6910,8.29
6911,8.24
6912,8.22
6913,8.25
6914,8.32
6915,8.42
6916,8.52
6917,8.58
6918,8.59
6919,8.56
6920,8.55
6921,8.59
6922,8.69
6923,8.85
6924,9.06
6925,9.32
6926,9.61
6927,9.92
6928,10.20
6929,10.44
6930,10.64
6931,10.80
6932,10.93
6933,11.00
6934,11.02
6935,10.99
6936,10.89
6937,10.75
6938,10.58
6939,10.41
6940,10.20
6941,10.00
6942,9.83
6943,9.74
6944,9.70
6945,9.73
6946,9.77
6947,9.80
6948,9.77
6949,9.67
6950,9.49
6951,9.26
6952,8.96
6953,8.67
6954,8.38
6955,8.13
6956,7.89
6957,7.68
6958,7.45
6959,7.20
6960,6.88
6961,6.54
6962,6.13
6963,5.71
6964,5.26
6965,4.87
6966,4.51
6967,4.22
6968,3.91
6969,3.61
6970,3.29
6971,2.99
6972,2.70
6973,2.45
6974,2.23
6975,2.09
6976,2.02
6977,2.04
6978,2.08
6979,2.12
6980,2.11
6981,2.08
6982,2.04
6983,2.00
6984,1.95
6985,1.93
6986,1.98
6987,2.11
6988,2.22
6989,2.27
6990,2.24
6991,2.14
6992,1.95
6993,1.70
6994,1.39
6995,1.11
6996,0.89
6997,0.77
6998,0.72
6999,0.70
7000,0.62
7001,0.44
7002,0.14
7003,-0.21
7004,-0.60
7005,-0.96
7006,-1.28
7007,-1.50
7008,-1.56
7009,-1.48
7010,-1.33
7011,-1.15
7012,-1.01
7013,-0.89
7014,-0.82
7015,-0.79
7016,-0.83
7017,-0.91
7018,-1.03
7019,-1.16
7020,-1.31
7021,-1.50
7022,-1.71
7023,-1.91
7024,-2.04
7025,-2.08
7026,-2.06
7027,-1.98
7028,-1.82
7029,-1.66
7030,-1.50
7031,-1.37
7032,-1.24
7033,-1.11
7034,-0.98
7035,-0.83
7036,-0.59
7037,-0.27
7038,0.08
7039,0.43
7040,0.75
7041,1.06
7042,1.37
7043,1.66
7044,1.96
7045,2.24
7046,2.50
7047,2.72
7048,2.88
7049,2.96
7050,2.97
7051,2.92
7052,2.86
7053,2.81
7054,2.82
7055,2.91
7056,3.04
7057,3.14
7058,3.15
7059,3.06
7060,2.88
7061,2.63
7062,2.33
7063,2.01
7064,1.72
7065,1.55
7066,1.47
7067,1.47
7068,1.44
7069,1.35
7070,1.15
7071,0.85
7072,0.47
7073,0.07
7074,-0.30
7075,-0.55
7076,-0.69
7077,-0.71
7078,-0.64
7079,-0.50
7080,-0.40
7081,-0.36
7082,-0.48
7083,-0.75
7084,-1.11
7085,-1.46
7086,-1.77
7087,-2.03
7088,-2.29
7089,-2.52
7090,-2.69
7091,-2.79
7092,-2.88
7093,-2.94
7094,-2.98
7095,-2.93
7096,-2.80
7097,-2.61
7098,-2.39
7099,-2.12
7100,-1.88
7101,-1.70
7102,-1.68
7103,-1.77
7104,-1.98
7105,-2.24
7106,-2.53
7107,-2.83
7108,-3.12
7109,-3.40
7110,-3.69
7111,-4.03
7112,-4.41
7113,-4.79
7114,-5.13
7115,-5.39
7116,-5.57
7117,-5.62
7118,-5.55
7119,-5.40
7120,-5.19
7121,-4.98
7122,-4.73
7123,-4.45
7124,-4.07
7125,-3.62
7126,-3.04
7127,-2.38
7128,-1.58
7129,-0.72
7130,0.22
7131,1.14
7132,2.10
7133,3.00
7134,3.88
7135,4.64
7136,5.33
7137,5.87
7138,6.32
7139,6.59
7140,6.77
7141,6.87
7142,7.03
7143,7.21
7144,7.45
7145,7.71
7146,8.03
7147,8.38
7148,8.74
7149,9.03
7150,9.28
7151,9.45
7152,9.56
7153,9.61
7154,9.67
7155,9.77
7156,9.91
7157,10.12
7158,10.37
7159,10.65
7160,10.92
7161,11.13
7162,11.22
7163,11.18
7164,10.99
7165,10.67
7166,10.25
7167,9.77
7168,9.26
7169,8.78
7170,8.35
7171,7.98
7172,7.64
7173,7.35
7174,7.07
7175,6.84
7176,6.65
7177,6.51
7178,6.41
7179,6.35
7180,6.33
7181,6.39
7182,6.54
7183,6.74
7184,6.98
7185,7.26
7186,7.58
7187,7.96
7188,8.35
7189,8.77
7190,9.12
7191,9.41
7192,9.71
7193,9.29
7194,9.96
7195,12.36
7196,12.89
7197,7.72
7198,3.75
7199,14.79
7200,27.16
