1,74.99
2,100.00
3,100.00
4,99.42
5,95.56
6,97.99
7,94.73
8,81.80
9,60.82
10,34.27
11,4.99
12,-18.73
13,-28.74
14,-19.81
15,7.20
16,44.05
17,77.97
18,97.18
19,100.00
20,99.90
21,99.06
22,100.00
23,100.00
24,99.51
25,91.81
26,73.44
27,42.40
28,3.59
29,-33.47
30,-61.40
31,-78.06
32,-85.39
33,-83.05
34,-71.03
35,-51.22
36,-30.67
37,-15.17
38,-7.75
39,-6.69
40,-10.14
41,-15.12
42,-19.39
43,-21.16
44,-20.05
45,-17.29
46,-13.95
47,-11.66
48,-10.75
49,-11.41
50,-12.95
51,-14.68
52,-16.06
53,-16.82
54,-17.05
55,-16.92
56,-16.70
57,-16.58
58,-16.71
59,-17.03
60,-17.45
61,-17.85
62,-18.24
63,-18.59
64,-18.93
65,-19.20
66,-19.41
67,-19.56
68,-19.73
69,-19.92
70,-20.16
71,-20.40
72,-20.63
73,-20.82
74,-20.97
75,-21.05
76,-21.08
77,-21.07
78,-21.04
79,-21.00
80,-20.95
81,-20.89
82,-20.79
83,-20.68
84,-20.51
85,-20.32
86,-20.08
87,-19.83
88,-19.49
89,-19.10
90,-18.59
91,-17.98
92,-17.24
93,-16.46
94,-15.62
95,-14.84
96,-14.11
97,-13.48
98,-12.88
99,-12.34
100,-11.78
101,-11.23
102,-10.63
103,-10.06
104,-9.51
105,-9.08
106,-8.72
107,-8.49
108,-8.31
109,-8.21
110,-8.06
111,-7.89
112,-7.60
113,-7.23
114,-6.73
115,-6.19
116,-5.55
117,-4.87
118,-4.14
119,-3.43
120,-2.73
121,-2.11
122,-1.55
123,-1.12
124,-0.81
125,-0.67
126,-0.65
127,-0.76
128,-0.95
129,-1.17
130,-1.39
131,-1.58
132,-1.73
133,-1.86
134,-2.00
135,-2.18
136,-2.45
137,-2.80
138,-3.24
139,-3.71
140,-4.19
141,-4.60
142,-4.90
143,-5.07
144,-5.16
145,-5.20
146,-5.25
147,-5.32
148,-5.45
149,-5.59
150,-5.76
151,-5.87
152,-5.94
153,-5.93
154,-5.89
155,-5.86
156,-5.91
157,-6.09
158,-6.45
159,-6.94
160,-7.57
161,-8.26
162,-8.96
163,-9.59
164,-10.11
165,-10.48
166,-10.74
167,-10.90
168,-11.05
169,-11.20
170,-11.41
171,-11.63
172,-11.85
173,-11.98
174,-12.01
175,-11.90
176,-11.68
177,-11.38
178,-11.13
179,-11.00
180,-11.11
181,-11.44
182,-12.01
183,-12.73
184,-13.53
185,-14.29
186,-14.97
187,-15.52
188,-15.98
189,-16.36
190,-16.75
191,-17.14
192,-17.56
193,-17.93
194,-18.22
195,-18.38
196,-18.41
197,-18.29
198,-18.05
199,-17.71
200,-17.30
201,-16.85
202,-16.36
203,-15.85
204,-15.30
205,-14.75
206,-14.18
207,-13.63
208,-13.09
209,-12.64
210,-12.26
211,-12.01
212,-11.82
213,-11.69
214,-11.55
215,-11.42
216,-11.25
217,-11.08
218,-10.85
219,-10.63
220,-10.39
221,-10.18
222,-9.96
223,-9.75
224,-9.50
225,-9.23
226,-8.88
227,-8.47
228,-8.04
229,-7.62
230,-7.26
231,-6.97
232,-6.78
233,-6.72
234,-6.78
235,-6.94
236,-7.19
237,-7.49
238,-7.82
239,-8.16
240,-8.52
241,-8.91
242,-9.31
243,-9.70
244,-10.07
245,-10.38
246,-10.64
247,-10.82
248,-10.96
249,-11.05
250,-11.14
251,-11.20
252,-11.27
253,-11.32
254,-11.37
255,-11.41
256,-11.49
257,-11.59
258,-11.74
259,-11.93
260,-12.21
261,-12.54
262,-12.93
263,-13.34
264,-13.78
265,-14.20
266,-14.65
267,-15.09
268,-15.57
269,-16.05
270,-16.53
271,-16.94
272,-17.26
273,-17.45
274,-17.49
275,-17.40
276,-17.21
277,-16.95
278,-16.67
279,-16.42
280,-16.19
281,-16.01
282,-15.82
283,-15.60
284,-15.26
285,-14.84
286,-14.27
287,-13.64
288,-12.92
289,-12.24
290,-11.59
291,-11.07
292,-10.58
293,-10.17
294,-9.71
295,-9.24
296,-8.67
297,-8.06
298,-7.38
299,-6.75
300,-6.17
301,-5.76
302,-5.46
303,-5.32
304,-5.20
305,-5.06
306,-4.79
307,-4.38
308,-3.84
309,-3.27
310,-2.74
311,-2.34
312,-2.08
313,-1.98
314,-2.01
315,-2.12
316,-2.27
317,-2.40
318,-2.51
319,-2.62
320,-2.77
321,-2.96
322,-3.24
323,-3.58
324,-3.96
325,-4.33
326,-4.66
327,-4.93
328,-5.18
329,-5.40
330,-5.63
331,-5.85
332,-6.14
333,-6.44
334,-6.77
335,-7.05
336,-7.35
337,-7.68
338,-8.14
339,-8.71
340,-9.46
341,-10.30
342,-11.26
343,-12.20
344,-13.13
345,-13.90
346,-14.55
347,-15.01
348,-15.41
349,-15.72
350,-16.08
351,-16.46
352,-16.98
353,-17.56
354,-18.20
355,-18.80
356,-19.37
357,-19.86
358,-20.34
359,-20.77
360,-21.22
361,-21.66
362,-22.13
363,-22.58
364,-22.96
365,-23.20
366,-23.29
367,-23.21
368,-23.01
369,-22.71
370,-22.38
371,-22.06
372,-21.77
373,-21.54
374,-21.33
375,-21.09
376,-20.79
377,-20.42
378,-19.98
379,-19.54
380,-19.11
381,-18.78
382,-18.55
383,-18.44
384,-18.38
385,-18.36
386,-18.29
387,-18.18
388,-17.99
389,-17.77
390,-17.55
391,-17.40
392,-17.30
393,-17.31
394,-17.39
395,-17.55
396,-17.69
397,-17.80
398,-17.78
399,-17.65
400,-17.38
401,-17.03
402,-16.57
403,-16.06
404,-15.50
405,-14.94
406,-14.38
407,-13.86
408,-13.39
409,-13.01
410,-12.71
411,-12.49
412,-12.33
413,-12.23
414,-12.13
415,-12.07
416,-11.99
417,-11.92
418,-11.80
419,-11.66
420,-11.48
421,-11.30
422,-11.06
423,-10.76
424,-10.38
425,-9.95
426,-9.48
427,-9.00
428,-8.50
429,-8.04
430,-7.64
431,-7.33
432,-7.11
433,-6.98
434,-6.95
435,-7.03
436,-7.22
437,-7.50
438,-7.87
439,-8.33
440,-8.87
441,-9.45
442,-10.07
443,-10.64
444,-11.16
445,-11.57
446,-11.91
447,-12.16
448,-12.34
449,-12.44
450,-12.53
451,-12.62
452,-12.76
453,-12.94
454,-13.18
455,-13.43
456,-13.71
457,-13.96
458,-14.20
459,-14.38
460,-14.54
461,-14.62
462,-14.70
463,-14.76
464,-14.90
465,-15.14
466,-15.49
467,-15.91
468,-16.37
469,-16.78
470,-17.12
471,-17.35
472,-17.44
473,-17.40
474,-17.26
475,-17.05
476,-16.83
477,-16.65
478,-16.50
479,-16.40
480,-16.33
481,-16.29
482,-16.24
483,-16.13
484,-15.96
485,-15.73
486,-15.43
487,-15.07
488,-14.65
489,-14.22
490,-13.80
491,-13.47
492,-13.22
493,-13.11
494,-13.10
495,-13.21
496,-13.39
497,-13.64
498,-13.85
499,-14.02
500,-14.06
501,-14.00
502,-13.80
503,-13.52
504,-13.14
505,-12.73
506,-12.27
507,-11.80
508,-11.29
509,-10.80
510,-10.32
511,-9.89
512,-9.51
513,-9.19
514,-8.96
515,-8.83
516,-8.79
517,-8.82
518,-8.92
519,-9.09
520,-9.32
521,-9.62
522,-9.99
523,-10.40
524,-10.87
525,-11.33
526,-11.80
527,-12.22
528,-12.66
529,-13.08
530,-13.55
531,-14.01
532,-14.52
533,-15.02
534,-15.54
535,-16.00
536,-16.45
537,-16.85
538,-17.28
539,-17.71
540,-18.22
541,-18.75
542,-19.36
543,-19.96
544,-20.55
545,-21.04
546,-21.45
547,-21.74
548,-21.98
549,-22.18
550,-22.40
551,-22.65
552,-22.97
553,-23.31
554,-23.68
555,-24.04
556,-24.37
557,-24.62
558,-24.81
559,-24.95
560,-25.05
561,-25.12
562,-25.11
563,-25.04
564,-24.89
565,-24.69
566,-24.44
567,-24.15
568,-23.79
569,-23.42
570,-23.02
571,-22.64
572,-22.20
573,-21.73
574,-21.20
575,-20.65
576,-20.02
577,-19.39
578,-18.71
579,-18.09
580,-17.48
581,-16.96
582,-16.46
583,-16.05
584,-15.62
585,-15.22
586,-14.77
587,-14.33
588,-13.83
589,-13.35
590,-12.85
591,-12.40
592,-11.93
593,-11.48
594,-10.99
595,-10.51
596,-10.00
597,-9.51
598,-8.98
599,-8.45
600,-7.87
601,-7.28
602,-6.68
603,-6.11
604,-5.58
605,-5.15
606,-4.84
607,-4.73
608,-4.82
609,-5.10
610,-5.56
611,-6.12
612,-6.72
613,-7.30
614,-7.85
615,-8.35
616,-8.82
617,-9.27
618,-9.76
619,-10.25
620,-10.78
621,-11.24
622,-11.65
623,-11.95
624,-12.16
625,-12.25
626,-12.28
627,-12.25
628,-12.25
629,-12.28
630,-12.39
631,-12.51
632,-12.63
633,-12.67
634,-12.63
635,-12.49
636,-12.34
637,-12.20
638,-12.20
639,-12.37
640,-12.80
641,-13.44
642,-14.25
643,-15.08
644,-15.84
645,-16.41
646,-16.75
647,-16.85
648,-16.78
649,-16.60
650,-16.45
651,-16.36
652,-16.41
653,-16.56
654,-16.79
655,-17.01
656,-17.21
657,-17.33
658,-17.41
659,-17.47
660,-17.57
661,-17.73
662,-18.00
663,-18.34
664,-18.81
665,-19.33
666,-19.92
667,-20.53
668,-21.19
669,-21.87
670,-22.58
671,-23.25
672,-23.89
673,-24.42
674,-24.84
675,-25.08
676,-25.19
677,-25.16
678,-25.04
679,-24.85
680,-24.65
681,-24.45
682,-24.25
683,-24.03
684,-23.74
685,-23.43
686,-23.06
687,-22.68
688,-22.27
689,-21.89
690,-21.50
691,-21.16
692,-20.77
693,-20.33
694,-19.77
695,-19.13
696,-18.43
697,-17.75
698,-17.11
699,-16.64
700,-16.35
701,-16.30
702,-16.43
703,-16.68
704,-16.91
705,-17.05
706,-16.99
707,-16.73
708,-16.29
709,-15.77
710,-15.27
711,-14.89
712,-14.69
713,-14.68
714,-14.82
715,-15.03
716,-15.23
717,-15.34
718,-15.34
719,-15.22
720,-15.05
721,-14.89
722,-14.86
723,-15.03
724,-15.43
725,-16.06
726,-16.84
727,-17.69
728,-18.49
729,-19.11
730,-19.47
731,-19.49
732,-19.18
733,-18.61
734,-17.93
735,-17.25
736,-16.72
737,-16.43
738,-16.46
739,-16.78
740,-17.35
741,-18.05
742,-18.81
743,-19.56
744,-20.25
745,-20.81
746,-21.26
747,-21.57
748,-21.84
749,-22.06
750,-22.31
751,-22.52
752,-22.73
753,-22.90
754,-23.05
755,-23.17
756,-23.27
757,-23.34
758,-23.38
759,-23.40
760,-23.40
761,-23.38
762,-23.27
763,-23.06
764,-22.67
765,-22.14
766,-21.41
767,-20.57
768,-19.64
769,-18.73
770,-17.88
771,-17.20
772,-16.64
773,-16.25
774,-15.90
775,-15.56
776,-15.12
777,-14.61
778,-13.99
779,-13.36
780,-12.72
781,-12.21
782,-11.80
783,-11.54
784,-11.31
785,-11.09
786,-10.75
787,-10.32
788,-9.77
789,-9.20
790,-8.65
791,-8.24
792,-7.99
793,-7.95
794,-8.06
795,-8.27
796,-8.52
797,-8.77
798,-8.98
799,-9.17
800,-9.38
801,-9.64
802,-9.92
803,-10.17
804,-10.37
805,-10.44
806,-10.39
807,-10.18
808,-9.93
809,-9.69
810,-9.59
811,-9.67
812,-10.03
813,-10.60
814,-11.36
815,-12.17
816,-12.97
817,-13.64
818,-14.21
819,-14.64
820,-15.04
821,-15.41
822,-15.84
823,-16.29
824,-16.82
825,-17.32
826,-17.81
827,-18.18
828,-18.48
829,-18.69
830,-18.89
831,-19.11
832,-19.46
833,-19.93
834,-20.52
835,-21.13
836,-21.72
837,-22.21
838,-22.60
839,-22.87
840,-23.08
841,-23.26
842,-23.47
843,-23.73
844,-24.04
845,-24.33
846,-24.54
847,-24.56
848,-24.37
849,-23.97
850,-23.44
851,-22.85
852,-22.30
853,-21.88
854,-21.63
855,-21.55
856,-21.55
857,-21.58
858,-21.54
859,-21.39
860,-21.06
861,-20.61
862,-20.09
863,-19.59
864,-19.16
865,-18.85
866,-18.68
867,-18.65
868,-18.75
869,-18.95
870,-19.19
871,-19.48
872,-19.77
873,-20.07
874,-20.32
875,-20.52
876,-20.62
877,-20.61
878,-20.45
879,-20.18
880,-19.78
881,-19.31
882,-18.74
883,-18.14
884,-17.50
885,-16.84
886,-16.17
887,-15.54
888,-14.96
889,-14.54
890,-14.26
891,-14.14
892,-14.13
893,-14.22
894,-14.31
895,-14.36
896,-14.30
897,-14.11
898,-13.76
899,-13.35
900,-12.89
901,-12.48
902,-12.10
903,-11.79
904,-11.51
905,-11.23
906,-10.93
907,-10.60
908,-10.25
909,-9.94
910,-9.73
911,-9.67
912,-9.80
913,-10.08
914,-10.49
915,-10.92
916,-11.31
917,-11.58
918,-11.73
919,-11.78
920,-11.83
921,-11.93
922,-12.20
923,-12.64
924,-13.28
925,-14.01
926,-14.80
927,-15.51
928,-16.09
929,-16.47
930,-16.68
931,-16.71
932,-16.65
933,-16.54
934,-16.46
935,-16.40
936,-16.42
937,-16.47
938,-16.60
939,-16.75
940,-16.98
941,-17.24
942,-17.57
943,-17.95
944,-18.41
945,-18.91
946,-19.46
947,-20.02
948,-20.58
949,-21.09
950,-21.51
951,-21.80
952,-21.95
953,-21.97
954,-21.87
955,-21.69
956,-21.46
957,-21.24
958,-21.05
959,-20.90
960,-20.77
961,-20.64
962,-20.46
963,-20.21
964,-19.89
965,-19.53
966,-19.16
967,-18.84
968,-18.61
969,-18.50
970,-18.50
971,-18.59
972,-18.71
973,-18.82
974,-18.85
975,-18.78
976,-18.57
977,-18.29
978,-17.95
979,-17.63
980,-17.35
981,-17.17
982,-17.07
983,-17.06
984,-17.03
985,-16.94
986,-16.72
987,-16.36
988,-15.82
989,-15.17
990,-14.47
991,-13.81
992,-13.24
993,-12.83
994,-12.60
995,-12.57
996,-12.68
997,-12.88
998,-13.15
999,-13.45
1000,-13.77
1001,-14.09
1002,-14.43
1003,-14.78
1004,-15.19
1005,-15.63
1006,-16.10
1007,-16.53
1008,-16.96
1009,-17.36
1010,-17.79
1011,-18.18
1012,-18.60
1013,-18.98
1014,-19.38
1015,-19.73
1016,-20.12
1017,-20.50
1018,-20.93
1019,-21.38
1020,-21.93
1021,-22.50
1022,-23.14
1023,-23.76
1024,-24.41
1025,-24.99
1026,-25.55
1027,-26.01
1028,-26.44
1029,-26.81
1030,-27.16
1031,-27.47
1032,-27.78
1033,-28.08
1034,-28.40
1035,-28.69
1036,-28.97
1037,-29.19
1038,-29.34
1039,-29.40
1040,-29.40
1041,-29.35
1042,-29.27
1043,-29.16
1044,-29.02
1045,-28.87
1046,-28.67
1047,-28.43
1048,-28.12
1049,-27.74
1050,-27.29
1051,-26.80
1052,-26.27
1053,-25.77
1054,-25.28
1055,-24.87
1056,-24.48
1057,-24.18
1058,-23.84
1059,-23.47
1060,-22.97
1061,-22.39
1062,-21.68
1063,-20.94
1064,-20.12
1065,-19.33
1066,-18.54
1067,-17.86
1068,-17.23
1069,-16.68
1070,-16.13
1071,-15.60
1072,-15.01
1073,-14.42
1074,-13.79
1075,-13.20
1076,-12.63
1077,-12.16
1078,-11.80
1079,-11.61
1080,-11.48
1081,-11.42
1082,-11.34
1083,-11.23
1084,-11.03
1085,-10.76
1086,-10.46
1087,-10.18
1088,-9.99
1089,-9.92
1090,-10.00
1091,-10.23
1092,-10.58
1093,-11.00
1094,-11.45
1095,-11.86
1096,-12.21
1097,-12.49
1098,-12.71
1099,-12.90
1100,-13.10
1101,-13.32
1102,-13.56
1103,-13.77
1104,-13.92
1105,-13.96
1106,-13.88
1107,-13.67
1108,-13.34
1109,-12.95
1110,-12.54
1111,-12.17
1112,-11.90
1113,-11.72
1114,-11.68
1115,-11.75
1116,-11.91
1117,-12.13
1118,-12.39
1119,-12.65
1120,-12.95
1121,-13.26
1122,-13.61
1123,-13.99
1124,-14.40
1125,-14.82
1126,-15.22
1127,-15.55
1128,-15.83
1129,-16.02
1130,-16.16
1131,-16.24
1132,-16.29
1133,-16.27
1134,-16.21
1135,-16.09
1136,-15.96
1137,-15.81
1138,-15.70
1139,-15.63
1140,-15.70
1141,-15.91
1142,-16.30
1143,-16.82
1144,-17.48
1145,-18.19
1146,-18.94
1147,-19.67
1148,-20.42
1149,-21.14
1150,-21.87
1151,-22.55
1152,-23.17
1153,-23.69
1154,-24.07
1155,-24.24
1156,-24.23
1157,-24.03
1158,-23.71
1159,-23.32
1160,-22.93
1161,-22.58
1162,-22.24
1163,-21.90
1164,-21.51
1165,-21.05
1166,-20.51
1167,-19.94
1168,-19.35
1169,-18.84
1170,-18.40
1171,-18.10
1172,-17.87
1173,-17.74
1174,-17.62
1175,-17.54
1176,-17.41
1177,-17.26
1178,-17.07
1179,-16.89
1180,-16.72
1181,-16.57
1182,-16.39
1183,-16.17
1184,-15.88
1185,-15.52
1186,-15.10
1187,-14.67
1188,-14.27
1189,-13.97
1190,-13.79
1191,-13.74
1192,-13.81
1193,-13.97
1194,-14.19
1195,-14.44
1196,-14.72
1197,-14.98
1198,-15.24
1199,-15.48
1200,-15.75
1201,-16.03
1202,-16.35
1203,-16.69
1204,-17.10
1205,-17.53
1206,-17.98
1207,-18.40
1208,-18.79
1209,-19.12
1210,-19.39
1211,-19.54
1212,-19.61
1213,-19.60
1214,-19.57
1215,-19.55
1216,-19.59
1217,-19.67
1218,-19.83
1219,-20.02
1220,-20.26
1221,-20.51
1222,-20.80
1223,-21.09
1224,-21.41
1225,-21.73
1226,-22.09
1227,-22.45
1228,-22.86
1229,-23.27
1230,-23.72
1231,-24.18
1232,-24.64
1233,-25.08
1234,-25.48
1235,-25.82
1236,-26.08
1237,-26.21
1238,-26.19
1239,-26.02
1240,-25.69
1241,-25.27
1242,-24.73
1243,-24.16
1244,-23.52
1245,-22.87
1246,-22.18
1247,-21.50
1248,-20.77
1249,-20.07
1250,-19.34
1251,-18.66
1252,-18.01
1253,-17.46
1254,-16.90
1255,-16.36
1256,-15.76
1257,-15.18
1258,-14.58
1259,-14.04
1260,-13.55
1261,-13.23
1262,-13.04
1263,-13.04
1264,-13.11
1265,-13.24
1266,-13.29
1267,-13.26
1268,-13.08
1269,-12.79
1270,-12.44
1271,-12.11
1272,-11.88
1273,-11.78
1274,-11.81
1275,-11.93
1276,-12.12
1277,-12.33
1278,-12.49
1279,-12.58
1280,-12.61
1281,-12.61
1282,-12.62
1283,-12.63
1284,-12.69
1285,-12.78
1286,-12.94
1287,-13.14
1288,-13.41
1289,-13.69
1290,-14.05
1291,-14.43
1292,-14.85
1293,-15.25
1294,-15.66
1295,-16.02
1296,-16.39
1297,-16.76
1298,-17.23
1299,-17.77
1300,-18.44
1301,-19.17
1302,-19.97
1303,-20.72
1304,-21.39
1305,-21.85
1306,-22.15
1307,-22.23
1308,-22.24
1309,-22.22
1310,-22.33
1311,-22.56
1312,-23.03
1313,-23.65
1314,-24.42
1315,-25.20
1316,-25.98
1317,-26.66
1318,-27.28
1319,-27.81
1320,-28.35
1321,-28.90
1322,-29.49
1323,-30.08
1324,-30.65
1325,-31.10
1326,-31.40
1327,-31.49
1328,-31.40
1329,-31.17
1330,-30.86
1331,-30.55
1332,-30.28
1333,-30.08
1334,-29.89
1335,-29.66
1336,-29.33
1337,-28.86
1338,-28.24
1339,-27.54
1340,-26.83
1341,-26.23
1342,-25.78
1343,-25.56
1344,-25.51
1345,-25.62
1346,-25.80
1347,-25.99
1348,-26.12
1349,-26.17
1350,-26.11
1351,-26.03
1352,-25.93
1353,-25.89
1354,-25.88
1355,-25.91
1356,-25.92
1357,-25.89
1358,-25.73
1359,-25.44
1360,-24.98
1361,-24.39
1362,-23.69
1363,-22.96
1364,-22.20
1365,-21.51
1366,-20.88
1367,-20.34
1368,-19.86
1369,-19.48
1370,-19.20
1371,-19.06
1372,-19.00
1373,-19.05
1374,-19.13
1375,-19.26
1376,-19.33
1377,-19.32
1378,-19.20
1379,-19.00
1380,-18.73
1381,-18.47
1382,-18.21
1383,-18.00
1384,-17.80
1385,-17.59
1386,-17.30
1387,-16.93
1388,-16.46
1389,-15.93
1390,-15.37
1391,-14.87
1392,-14.48
1393,-14.27
1394,-14.24
1395,-14.38
1396,-14.64
1397,-14.98
1398,-15.36
1399,-15.72
1400,-16.05
1401,-16.35
1402,-16.67
1403,-17.03
1404,-17.48
1405,-17.97
1406,-18.50
1407,-18.99
1408,-19.45
1409,-19.79
1410,-20.02
1411,-20.11
1412,-20.18
1413,-20.22
1414,-20.34
1415,-20.51
1416,-20.79
1417,-21.09
1418,-21.42
1419,-21.68
1420,-21.87
1421,-21.94
1422,-21.96
1423,-21.98
1424,-22.11
1425,-22.44
1426,-23.01
1427,-23.76
1428,-24.63
1429,-25.50
1430,-26.26
1431,-26.80
1432,-27.07
1433,-27.05
1434,-26.81
1435,-26.44
1436,-26.03
1437,-25.66
1438,-25.38
1439,-25.19
1440,-25.06
1441,-24.96
1442,-24.84
1443,-24.70
1444,-24.48
1445,-24.21
1446,-23.87
1447,-23.51
1448,-23.15
1449,-22.85
1450,-22.60
1451,-22.46
1452,-22.40
1453,-22.43
1454,-22.50
1455,-22.57
1456,-22.56
1457,-22.47
1458,-22.24
1459,-21.91
1460,-21.48
1461,-21.03
1462,-20.58
1463,-20.24
1464,-19.98
1465,-19.80
1466,-19.60
1467,-19.36
1468,-19.02
1469,-18.59
1470,-18.05
1471,-17.46
1472,-16.87
1473,-16.38
1474,-16.02
1475,-15.84
1476,-15.84
1477,-15.98
1478,-16.20
1479,-16.47
1480,-16.77
1481,-17.08
1482,-17.44
1483,-17.84
1484,-18.30
1485,-18.80
1486,-19.34
1487,-19.85
1488,-20.32
1489,-20.65
1490,-20.91
1491,-21.05
1492,-21.20
1493,-21.38
1494,-21.71
1495,-22.17
1496,-22.80
1497,-23.49
1498,-24.26
1499,-25.01
1500,-25.78
1501,-26.46
1502,-27.13
1503,-27.74
1504,-28.39
1505,-29.04
1506,-29.73
1507,-30.36
1508,-30.95
1509,-31.45
1510,-31.87
1511,-32.17
1512,-32.42
1513,-32.59
1514,-32.73
1515,-32.79
1516,-32.83
1517,-32.82
1518,-32.82
1519,-32.82
1520,-32.86
1521,-32.96
1522,-33.15
1523,-33.42
1524,-33.73
1525,-34.04
1526,-34.25
1527,-34.34
1528,-34.24
1529,-33.99
1530,-33.56
1531,-33.03
1532,-32.41
1533,-31.79
1534,-31.16
1535,-30.57
1536,-30.00
1537,-29.49
1538,-28.96
1539,-28.44
1540,-27.86
1541,-27.31
1542,-26.73
1543,-26.19
1544,-25.62
1545,-25.10
1546,-24.59
1547,-24.17
1548,-23.76
1549,-23.40
1550,-23.02
1551,-22.65
1552,-22.21
1553,-21.75
1554,-21.22
1555,-20.69
1556,-20.15
1557,-19.68
1558,-19.26
1559,-18.91
1560,-18.59
1561,-18.30
1562,-17.99
1563,-17.65
1564,-17.24
1565,-16.82
1566,-16.44
1567,-16.18
1568,-16.05
1569,-16.08
1570,-16.29
1571,-16.66
1572,-17.15
1573,-17.68
1574,-18.22
1575,-18.73
1576,-19.25
1577,-19.76
1578,-20.28
1579,-20.77
1580,-21.27
1581,-21.74
1582,-22.18
1583,-22.50
1584,-22.72
1585,-22.78
1586,-22.76
1587,-22.63
1588,-22.49
1589,-22.32
1590,-22.21
1591,-22.16
1592,-22.19
1593,-22.26
1594,-22.37
1595,-22.45
1596,-22.55
1597,-22.63
1598,-22.75
1599,-22.89
1600,-23.13
1601,-23.48
1602,-23.96
1603,-24.51
1604,-25.09
1605,-25.59
1606,-26.00
1607,-26.26
1608,-26.41
1609,-26.46
1610,-26.48
1611,-26.52
1612,-26.64
1613,-26.81
1614,-27.04
1615,-27.24
1616,-27.43
1617,-27.53
1618,-27.56
1619,-27.54
1620,-27.55
1621,-27.65
1622,-27.88
1623,-28.22
1624,-28.66
1625,-29.14
1626,-29.66
1627,-30.15
1628,-30.63
1629,-31.08
1630,-31.55
1631,-32.02
1632,-32.51
1633,-32.98
1634,-33.41
1635,-33.75
1636,-33.97
1637,-34.05
1638,-34.01
1639,-33.89
1640,-33.70
1641,-33.47
1642,-33.17
1643,-32.82
1644,-32.38
1645,-31.87
1646,-31.26
1647,-30.62
1648,-29.94
1649,-29.30
1650,-28.68
1651,-28.16
1652,-27.69
1653,-27.30
1654,-26.94
1655,-26.62
1656,-26.32
1657,-26.09
1658,-25.90
1659,-25.81
1660,-25.74
1661,-25.72
1662,-25.66
1663,-25.53
1664,-25.27
1665,-24.89
1666,-24.42
1667,-23.97
1668,-23.59
1669,-23.37
1670,-23.33
1671,-23.48
1672,-23.76
1673,-24.11
1674,-24.44
1675,-24.67
1676,-24.77
1677,-24.76
1678,-24.67
1679,-24.54
1680,-24.43
1681,-24.34
1682,-24.32
1683,-24.36
1684,-24.46
1685,-24.59
1686,-24.74
1687,-24.89
1688,-25.02
1689,-25.11
1690,-25.16
1691,-25.20
1692,-25.23
1693,-25.24
1694,-25.22
1695,-25.16
1696,-25.09
1697,-25.00
1698,-24.90
1699,-24.78
1700,-24.68
1701,-24.60
1702,-24.56
1703,-24.57
1704,-24.66
1705,-24.84
1706,-25.09
1707,-25.37
1708,-25.65
1709,-25.91
1710,-26.14
1711,-26.32
1712,-26.43
1713,-26.49
1714,-26.50
1715,-26.51
1716,-26.51
1717,-26.52
1718,-26.50
1719,-26.46
1720,-26.35
1721,-26.17
1722,-25.87
1723,-25.48
1724,-24.99
1725,-24.46
1726,-23.87
1727,-23.27
1728,-22.60
1729,-21.96
1730,-21.30
1731,-20.71
1732,-20.09
1733,-19.51
1734,-18.91
1735,-18.33
1736,-17.69
1737,-17.05
1738,-16.35
1739,-15.69
1740,-15.02
1741,-14.46
1742,-13.98
1743,-13.68
1744,-13.47
1745,-13.36
1746,-13.20
1747,-13.00
1748,-12.68
1749,-12.29
1750,-11.87
1751,-11.52
1752,-11.29
1753,-11.22
1754,-11.30
1755,-11.51
1756,-11.78
1757,-12.05
1758,-12.29
1759,-12.48
1760,-12.67
1761,-12.87
1762,-13.12
1763,-13.38
1764,-13.67
1765,-13.93
1766,-14.15
1767,-14.29
1768,-14.42
1769,-14.54
1770,-14.77
1771,-15.10
1772,-15.59
1773,-16.18
1774,-16.90
1775,-17.65
1776,-18.44
1777,-19.16
1778,-19.84
1779,-20.43
1780,-20.99
1781,-21.48
1782,-21.97
1783,-22.38
1784,-22.76
1785,-23.05
1786,-23.34
1787,-23.55
1788,-23.78
1789,-23.99
1790,-24.33
1791,-24.76
1792,-25.33
1793,-25.96
1794,-26.67
1795,-27.37
1796,-28.09
1797,-28.73
1798,-29.36
1799,-29.96
1800,-30.60
1801,-31.26
1802,-31.98
1803,-32.67
1804,-33.32
1805,-33.81
1806,-34.14
1807,-34.24
1808,-34.15
1809,-33.90
1810,-33.57
1811,-33.22
1812,-32.92
1813,-32.68
1814,-32.49
1815,-32.32
1816,-32.08
1817,-31.74
1818,-31.24
1819,-30.65
1820,-29.97
1821,-29.32
1822,-28.70
1823,-28.20
1824,-27.86
1825,-27.71
1826,-27.71
1827,-27.84
1828,-28.02
1829,-28.22
1830,-28.40
1831,-28.56
1832,-28.65
1833,-28.71
1834,-28.71
1835,-28.70
1836,-28.63
1837,-28.51
1838,-28.27
1839,-27.91
1840,-27.42
1841,-26.81
1842,-26.07
1843,-25.29
1844,-24.52
1845,-23.85
1846,-23.27
1847,-22.86
1848,-22.61
1849,-22.53
1850,-22.55
1851,-22.67
1852,-22.81
1853,-22.97
1854,-23.09
1855,-23.18
1856,-23.20
1857,-23.15
1858,-22.99
1859,-22.74
1860,-22.37
1861,-21.96
1862,-21.51
1863,-21.05
1864,-20.56
1865,-20.07
1866,-19.54
1867,-18.98
1868,-18.36
1869,-17.70
1870,-17.03
1871,-16.44
1872,-15.99
1873,-15.76
1874,-15.76
1875,-15.99
1876,-16.39
1877,-16.89
1878,-17.42
1879,-17.92
1880,-18.35
1881,-18.70
1882,-19.04
1883,-19.39
1884,-19.84
1885,-20.36
1886,-20.98
1887,-21.62
1888,-22.26
1889,-22.76
1890,-23.12
1891,-23.30
1892,-23.36
1893,-23.32
1894,-23.29
1895,-23.30
1896,-23.43
1897,-23.63
1898,-23.90
1899,-24.16
1900,-24.40
1901,-24.55
1902,-24.67
1903,-24.76
1904,-24.91
1905,-25.14
1906,-25.52
1907,-26.03
1908,-26.65
1909,-27.28
1910,-27.85
1911,-28.27
1912,-28.49
1913,-28.51
1914,-28.33
1915,-28.01
1916,-27.59
1917,-27.16
1918,-26.75
1919,-26.43
1920,-26.18
1921,-26.01
1922,-25.85
1923,-25.67
1924,-25.42
1925,-25.09
1926,-24.65
1927,-24.15
1928,-23.61
1929,-23.12
1930,-22.70
1931,-22.43
1932,-22.27
1933,-22.26
1934,-22.32
1935,-22.44
1936,-22.51
1937,-22.53
1938,-22.42
1939,-22.20
1940,-21.86
1941,-21.44
1942,-20.95
1943,-20.47
1944,-19.98
1945,-19.54
1946,-19.13
1947,-18.77
1948,-18.41
1949,-18.05
1950,-17.66
1951,-17.28
1952,-16.91
1953,-16.58
1954,-16.32
1955,-16.18
1956,-16.17
1957,-16.30
1958,-16.53
1959,-16.84
1960,-17.21
1961,-17.61
1962,-18.05
1963,-18.47
1964,-18.90
1965,-19.28
1966,-19.68
1967,-20.04
1968,-20.44
1969,-20.81
1970,-21.21
1971,-21.61
1972,-22.06
1973,-22.51
1974,-23.01
1975,-23.47
1976,-23.94
1977,-24.37
1978,-24.80
1979,-25.19
1980,-25.60
1981,-26.02
1982,-26.54
1983,-27.11
1984,-27.78
1985,-28.45
1986,-29.13
1987,-29.74
1988,-30.28
1989,-30.67
1990,-30.93
1991,-31.06
1992,-31.12
1993,-31.16
1994,-31.24
1995,-31.37
1996,-31.59
1997,-31.86
1998,-32.16
1999,-32.42
2000,-32.60
2001,-32.68
2002,-32.62
2003,-32.45
2004,-32.19
2005,-31.90
2006,-31.60
2007,-31.32
2008,-31.04
2009,-30.78
2010,-30.49
2011,-30.21
2012,-29.87
2013,-29.51
2014,-29.09
2015,-28.66
2016,-28.20
2017,-27.77
2018,-27.30
2019,-26.84
2020,-26.33
2021,-25.83
2022,-25.28
2023,-24.75
2024,-24.19
2025,-23.69
2026,-23.20
2027,-22.80
2028,-22.42
2029,-22.10
2030,-21.75
2031,-21.40
2032,-20.92
2033,-20.38
2034,-19.68
2035,-18.91
2036,-18.01
2037,-17.11
2038,-16.20
2039,-15.38
2040,-14.62
2041,-13.98
2042,-13.40
2043,-12.94
2044,-12.58
2045,-12.33
2046,-12.18
2047,-12.16
2048,-12.26
2049,-12.52
2050,-12.93
2051,-13.44
2052,-14.02
2053,-14.61
2054,-15.18
2055,-15.70
2056,-16.15
2057,-16.51
2058,-16.81
2059,-17.01
2060,-17.19
2061,-17.31
2062,-17.42
2063,-17.51
2064,-17.62
2065,-17.74
2066,-17.91
2067,-18.08
2068,-18.28
2069,-18.47
2070,-18.68
2071,-18.88
2072,-19.05
2073,-19.16
2074,-19.24
2075,-19.27
2076,-19.30
2077,-19.31
2078,-19.38
2079,-19.52
2080,-19.80
2081,-20.21
2082,-20.78
2083,-21.45
2084,-22.21
2085,-22.92
2086,-23.55
2087,-24.00
2088,-24.26
2089,-24.34
2090,-24.30
2091,-24.16
2092,-24.07
2093,-24.04
2094,-24.17
2095,-24.36
2096,-24.60
2097,-24.79
2098,-24.95
2099,-25.02
2100,-25.08
2101,-25.14
2102,-25.33
2103,-25.64
2104,-26.12
2105,-26.72
2106,-27.44
2107,-28.18
2108,-28.90
2109,-29.53
2110,-30.07
2111,-30.51
2112,-30.87
2113,-31.14
2114,-31.33
2115,-31.42
2116,-31.38
2117,-31.19
2118,-30.87
2119,-30.45
2120,-29.99
2121,-29.51
2122,-29.03
2123,-28.58
2124,-28.19
2125,-27.86
2126,-27.53
2127,-27.24
2128,-26.94
2129,-26.72
2130,-26.54
2131,-26.44
2132,-26.34
2133,-26.26
2134,-26.10
2135,-25.85
2136,-25.46
2137,-24.98
2138,-24.42
2139,-23.87
2140,-23.37
2141,-23.03
2142,-22.85
2143,-22.81
2144,-22.81
2145,-22.79
2146,-22.64
2147,-22.36
2148,-21.93
2149,-21.43
2150,-20.92
2151,-20.51
2152,-20.28
2153,-20.24
2154,-20.38
2155,-20.64
2156,-20.94
2157,-21.20
2158,-21.39
2159,-21.50
2160,-21.59
2161,-21.72
2162,-21.95
2163,-22.27
2164,-22.71
2165,-23.20
2166,-23.70
2167,-24.14
2168,-24.51
2169,-24.78
2170,-24.97
2171,-25.05
2172,-25.06
2173,-24.99
2174,-24.88
2175,-24.69
2176,-24.47
2177,-24.20
2178,-23.98
2179,-23.83
2180,-23.82
2181,-23.97
2182,-24.31
2183,-24.77
2184,-25.35
2185,-25.98
2186,-26.63
2187,-27.23
2188,-27.79
2189,-28.31
2190,-28.83
2191,-29.31
2192,-29.71
2193,-29.99
2194,-30.18
2195,-30.31
2196,-30.39
2197,-30.40
2198,-30.37
2199,-30.30
2200,-30.18
2201,-30.02
2202,-29.79
2203,-29.54
2204,-29.23
2205,-28.91
2206,-28.52
2207,-28.10
2208,-27.60
2209,-27.06
2210,-26.39
2211,-25.68
2212,-24.92
2213,-24.22
2214,-23.54
2215,-22.97
2216,-22.39
2217,-21.84
2218,-21.20
2219,-20.52
2220,-19.68
2221,-18.79
2222,-17.84
2223,-17.01
2224,-16.31
2225,-15.84
2226,-15.54
2227,-15.41
2228,-15.33
2229,-15.27
2230,-15.15
2231,-14.98
2232,-14.75
2233,-14.52
2234,-14.34
2235,-14.27
2236,-14.33
2237,-14.51
2238,-14.78
2239,-15.09
2240,-15.42
2241,-15.70
2242,-15.94
2243,-16.08
2244,-16.17
2245,-16.20
2246,-16.22
2247,-16.25
2248,-16.35
2249,-16.50
2250,-16.76
2251,-17.08
2252,-17.45
2253,-17.77
2254,-18.03
2255,-18.16
2256,-18.21
2257,-18.20
2258,-18.23
2259,-18.34
2260,-18.66
2261,-19.20
2262,-19.96
2263,-20.80
2264,-21.69
2265,-22.45
2266,-23.05
2267,-23.40
2268,-23.59
2269,-23.64
2270,-23.72
2271,-23.86
2272,-24.19
2273,-24.66
2274,-25.29
2275,-25.96
2276,-26.65
2277,-27.22
2278,-27.67
2279,-27.97
2280,-28.22
2281,-28.42
2282,-28.65
2283,-28.93
2284,-29.28
2285,-29.66
2286,-30.02
2287,-30.26
2288,-30.35
2289,-30.28
2290,-30.07
2291,-29.79
2292,-29.51
2293,-29.27
2294,-29.08
2295,-28.92
2296,-28.73
2297,-28.48
2298,-28.13
2299,-27.67
2300,-27.11
2301,-26.53
2302,-25.99
2303,-25.61
2304,-25.38
2305,-25.32
2306,-25.37
2307,-25.48
2308,-25.57
2309,-25.60
2310,-25.51
2311,-25.31
2312,-25.03
2313,-24.74
2314,-24.47
2315,-24.27
2316,-24.17
2317,-24.17
2318,-24.22
2319,-24.31
2320,-24.39
2321,-24.44
2322,-24.39
2323,-24.24
2324,-23.97
2325,-23.63
2326,-23.18
2327,-22.69
2328,-22.12
2329,-21.55
2330,-20.99
2331,-20.48
2332,-20.00
2333,-19.57
2334,-19.15
2335,-18.76
2336,-18.38
2337,-18.06
2338,-17.72
2339,-17.43
2340,-17.15
2341,-16.98
2342,-16.89
2343,-16.93
2344,-17.01
2345,-17.13
2346,-17.17
2347,-17.07
2348,-16.76
2349,-16.26
2350,-15.61
2351,-14.89
2352,-14.21
2353,-13.69
2354,-13.42
2355,-13.43
2356,-13.71
2357,-14.17
2358,-14.76
2359,-15.37
2360,-15.96
2361,-16.49
2362,-16.98
2363,-17.40
2364,-17.83
2365,-18.24
2366,-18.66
2367,-19.02
2368,-19.34
2369,-19.56
2370,-19.76
2371,-19.92
2372,-20.13
2373,-20.40
2374,-20.79
2375,-21.27
2376,-21.84
2377,-22.42
2378,-22.97
2379,-23.39
2380,-23.67
2381,-23.74
2382,-23.66
2383,-23.49
2384,-23.31
2385,-23.20
2386,-23.23
2387,-23.42
2388,-23.75
2389,-24.17
2390,-24.59
2391,-24.94
2392,-25.15
2393,-25.20
2394,-25.09
2395,-24.89
2396,-24.64
2397,-24.43
2398,-24.30
2399,-24.26
2400,-24.28
2401,-24.33
2402,-24.32
2403,-24.23
2404,-23.99
2405,-23.60
2406,-23.09
2407,-22.53
2408,-21.96
2409,-21.45
2410,-20.98
2411,-20.59
2412,-20.27
2413,-20.06
2414,-19.91
2415,-19.87
2416,-19.91
2417,-20.05
2418,-20.22
2419,-20.41
2420,-20.53
2421,-20.59
2422,-20.50
2423,-20.28
2424,-19.90
2425,-19.45
2426,-18.93
2427,-18.41
2428,-17.90
2429,-17.43
2430,-16.98
2431,-16.57
2432,-16.16
2433,-15.76
2434,-15.38
2435,-15.08
2436,-14.90
2437,-14.87
2438,-14.99
2439,-15.27
2440,-15.66
2441,-16.09
2442,-16.54
2443,-16.96
2444,-17.36
2445,-17.70
2446,-18.03
2447,-18.30
2448,-18.61
2449,-18.90
2450,-19.23
2451,-19.52
2452,-19.85
2453,-20.19
2454,-20.63
2455,-21.14
2456,-21.77
2457,-22.45
2458,-23.18
2459,-23.87
2460,-24.52
2461,-25.07
2462,-25.56
2463,-25.97
2464,-26.37
2465,-26.72
2466,-27.09
2467,-27.41
2468,-27.70
2469,-27.87
2470,-27.98
2471,-28.01
2472,-28.02
2473,-28.04
2474,-28.13
2475,-28.31
2476,-28.58
2477,-28.91
2478,-29.26
2479,-29.57
2480,-29.82
2481,-29.98
2482,-30.05
2483,-30.05
2484,-30.00
2485,-29.91
2486,-29.77
2487,-29.57
2488,-29.27
2489,-28.91
2490,-28.47
2491,-28.01
2492,-27.51
2493,-27.04
2494,-26.58
2495,-26.20
2496,-25.84
2497,-25.53
2498,-25.17
2499,-24.77
2500,-24.26
2501,-23.71
2502,-23.07
2503,-22.42
2504,-21.75
2505,-21.15
2506,-20.62
2507,-20.21
2508,-19.84
2509,-19.53
2510,-19.16
2511,-18.79
2512,-18.30
2513,-17.74
2514,-17.04
2515,-16.32
2516,-15.55
2517,-14.85
2518,-14.18
2519,-13.60
2520,-13.07
2521,-12.64
2522,-12.24
2523,-11.89
2524,-11.54
2525,-11.21
2526,-10.93
2527,-10.71
2528,-10.60
2529,-10.60
2530,-10.77
2531,-11.10
2532,-11.58
2533,-12.14
2534,-12.73
2535,-13.32
2536,-13.89
2537,-14.42
2538,-14.90
2539,-15.34
2540,-15.78
2541,-16.19
2542,-16.58
2543,-16.89
2544,-17.11
2545,-17.14
2546,-17.02
2547,-16.73
2548,-16.36
2549,-15.97
2550,-15.64
2551,-15.41
2552,-15.39
2553,-15.54
2554,-15.86
2555,-16.24
2556,-16.64
2557,-16.99
2558,-17.28
2559,-17.48
2560,-17.66
2561,-17.86
2562,-18.17
2563,-18.61
2564,-19.19
2565,-19.82
2566,-20.47
2567,-21.05
2568,-21.54
2569,-21.87
2570,-22.04
2571,-22.07
2572,-22.01
2573,-21.90
2574,-21.80
2575,-21.72
2576,-21.66
2577,-21.60
2578,-21.58
2579,-21.58
2580,-21.64
2581,-21.76
2582,-21.94
2583,-22.18
2584,-22.50
2585,-22.84
2586,-23.22
2587,-23.57
2588,-23.91
2589,-24.21
2590,-24.53
2591,-24.87
2592,-25.27
2593,-25.72
2594,-26.20
2595,-26.68
2596,-27.09
2597,-27.38
2598,-27.52
2599,-27.49
2600,-27.30
2601,-26.98
2602,-26.54
2603,-26.01
2604,-25.42
2605,-24.77
2606,-24.07
2607,-23.35
2608,-22.61
2609,-21.96
2610,-21.40
2611,-21.03
2612,-20.84
2613,-20.88
2614,-21.03
2615,-21.27
2616,-21.45
2617,-21.56
2618,-21.48
2619,-21.26
2620,-20.86
2621,-20.42
2622,-19.95
2623,-19.55
2624,-19.21
2625,-18.94
2626,-18.68
2627,-18.40
2628,-18.05
2629,-17.64
2630,-17.14
2631,-16.63
2632,-16.15
2633,-15.79
2634,-15.59
2635,-15.60
2636,-15.77
2637,-16.08
2638,-16.46
2639,-16.87
2640,-17.24
2641,-17.54
2642,-17.76
2643,-17.89
2644,-17.98
2645,-18.05
2646,-18.16
2647,-18.30
2648,-18.49
2649,-18.70
2650,-18.94
2651,-19.18
2652,-19.42
2653,-19.60
2654,-19.76
2655,-19.87
2656,-19.97
2657,-20.03
2658,-20.09
2659,-20.13
2660,-20.19
2661,-20.27
2662,-20.41
2663,-20.58
2664,-20.81
2665,-21.08
2666,-21.42
2667,-21.79
2668,-22.22
2669,-22.68
2670,-23.21
2671,-23.75
2672,-24.31
2673,-24.85
2674,-25.35
2675,-25.78
2676,-26.07
2677,-26.21
2678,-26.15
2679,-25.93
2680,-25.57
2681,-25.12
2682,-24.62
2683,-24.11
2684,-23.61
2685,-23.16
2686,-22.73
2687,-22.31
2688,-21.84
2689,-21.37
2690,-20.82
2691,-20.28
2692,-19.67
2693,-19.12
2694,-18.56
2695,-18.08
2696,-17.54
2697,-16.99
2698,-16.33
2699,-15.67
2700,-14.96
2701,-14.28
2702,-13.63
2703,-13.09
2704,-12.64
2705,-12.33
2706,-12.07
2707,-11.83
2708,-11.55
2709,-11.23
2710,-10.86
2711,-10.53
2712,-10.27
2713,-10.17
2714,-10.25
2715,-10.49
2716,-10.81
2717,-11.13
2718,-11.39
2719,-11.55
2720,-11.64
2721,-11.66
2722,-11.68
2723,-11.75
2724,-11.93
2725,-12.23
2726,-12.62
2727,-13.03
2728,-13.42
2729,-13.71
2730,-13.91
2731,-14.00
2732,-14.08
2733,-14.16
2734,-14.35
2735,-14.62
2736,-15.05
2737,-15.57
2738,-16.23
2739,-16.93
2740,-17.72
2741,-18.48
2742,-19.24
2743,-19.93
2744,-20.61
2745,-21.19
2746,-21.72
2747,-22.14
2748,-22.54
2749,-22.89
2750,-23.30
2751,-23.72
2752,-24.25
2753,-24.85
2754,-25.56
2755,-26.27
2756,-26.97
2757,-27.56
2758,-28.04
2759,-28.34
2760,-28.54
2761,-28.66
2762,-28.79
2763,-28.95
2764,-29.21
2765,-29.52
2766,-29.86
2767,-30.16
2768,-30.37
2769,-30.45
2770,-30.42
2771,-30.31
2772,-30.13
2773,-29.96
2774,-29.79
2775,-29.64
2776,-29.44
2777,-29.13
2778,-28.65
2779,-28.00
2780,-27.20
2781,-26.36
2782,-25.56
2783,-24.91
2784,-24.45
2785,-24.22
2786,-24.19
2787,-24.35
2788,-24.57
2789,-24.78
2790,-24.92
2791,-24.99
2792,-24.99
2793,-24.98
2794,-24.95
2795,-24.95
2796,-24.94
2797,-24.92
2798,-24.85
2799,-24.73
2800,-24.50
2801,-24.17
2802,-23.72
2803,-23.24
2804,-22.71
2805,-22.18
2806,-21.62
2807,-21.09
2808,-20.55
2809,-20.06
2810,-19.58
2811,-19.19
2812,-18.86
2813,-18.66
2814,-18.53
2815,-18.47
2816,-18.39
2817,-18.28
2818,-18.04
2819,-17.68
2820,-17.18
2821,-16.63
2822,-16.08
2823,-15.65
2824,-15.34
2825,-15.19
2826,-15.14
2827,-15.16
2828,-15.14
2829,-15.02
2830,-14.77
2831,-14.41
2832,-13.99
2833,-13.59
2834,-13.28
2835,-13.12
2836,-13.14
2837,-13.31
2838,-13.59
2839,-13.89
2840,-14.21
2841,-14.52
2842,-14.87
2843,-15.25
2844,-15.73
2845,-16.30
2846,-16.96
2847,-17.66
2848,-18.38
2849,-19.03
2850,-19.58
2851,-19.93
2852,-20.11
2853,-20.11
2854,-20.03
2855,-19.91
2856,-19.84
2857,-19.85
2858,-20.03
2859,-20.31
2860,-20.69
2861,-21.08
2862,-21.44
2863,-21.69
2864,-21.85
2865,-21.91
2866,-21.95
2867,-22.02
2868,-22.17
2869,-22.40
2870,-22.71
2871,-23.03
2872,-23.30
2873,-23.42
2874,-23.36
2875,-23.14
2876,-22.80
2877,-22.41
2878,-22.01
2879,-21.67
2880,-21.41
2881,-21.24
2882,-21.11
2883,-21.00
2884,-20.85
2885,-20.66
2886,-20.44
2887,-20.22
2888,-20.02
2889,-19.85
2890,-19.67
2891,-19.53
2892,-19.41
2893,-19.31
2894,-19.22
2895,-19.13
2896,-19.05
2897,-18.96
2898,-18.84
2899,-18.70
2900,-18.48
2901,-18.23
2902,-17.92
2903,-17.59
2904,-17.26
2905,-17.00
2906,-16.83
2907,-16.76
2908,-16.73
2909,-16.72
2910,-16.67
2911,-16.55
2912,-16.31
2913,-15.97
2914,-15.57
2915,-15.18
2916,-14.88
2917,-14.72
2918,-14.72
2919,-14.87
2920,-15.15
2921,-15.50
2922,-15.88
2923,-16.24
2924,-16.61
2925,-16.95
2926,-17.32
2927,-17.68
2928,-18.09
2929,-18.49
2930,-18.91
2931,-19.28
2932,-19.65
2933,-19.98
2934,-20.33
2935,-20.68
2936,-21.13
2937,-21.65
2938,-22.28
2939,-22.92
2940,-23.58
2941,-24.19
2942,-24.77
2943,-25.26
2944,-25.73
2945,-26.13
2946,-26.54
2947,-26.93
2948,-27.33
2949,-27.70
2950,-28.05
2951,-28.34
2952,-28.60
2953,-28.81
2954,-29.01
2955,-29.15
2956,-29.24
2957,-29.23
2958,-29.14
2959,-28.97
2960,-28.77
2961,-28.57
2962,-28.43
2963,-28.42
2964,-28.53
2965,-28.73
2966,-28.92
2967,-29.03
2968,-29.00
2969,-28.82
2970,-28.43
2971,-27.88
2972,-27.19
2973,-26.50
2974,-25.83
2975,-25.27
2976,-24.75
2977,-24.32
2978,-23.86
2979,-23.43
2980,-22.91
2981,-22.36
2982,-21.71
2983,-21.05
2984,-20.33
2985,-19.64
2986,-18.93
2987,-18.29
2988,-17.67
2989,-17.14
2990,-16.64
2991,-16.22
2992,-15.80
2993,-15.40
2994,-14.94
2995,-14.47
2996,-13.93
2997,-13.38
2998,-12.81
2999,-12.34
3000,-11.93
3001,-11.61
3002,-11.32
3003,-11.04
3004,-10.74
3005,-10.43
3006,-10.10
3007,-9.80
3008,-9.53
3009,-9.37
3010,-9.33
3011,-9.40
3012,-9.56
3013,-9.75
3014,-9.96
3015,-10.15
3016,-10.36
3017,-10.61
3018,-10.96
3019,-11.43
3020,-12.05
3021,-12.73
3022,-13.46
3023,-14.11
3024,-14.64
3025,-14.98
3026,-15.14
3027,-15.12
3028,-15.00
3029,-14.84
3030,-14.71
3031,-14.61
3032,-14.58
3033,-14.58
3034,-14.59
3035,-14.56
3036,-14.51
3037,-14.42
3038,-14.35
3039,-14.32
3040,-14.39
3041,-14.60
3042,-14.96
3043,-15.46
3044,-16.06
3045,-16.68
3046,-17.28
3047,-17.81
3048,-18.25
3049,-18.56
3050,-18.76
3051,-18.84
3052,-18.86
3053,-18.84
3054,-18.83
3055,-18.80
3056,-18.79
3057,-18.75
3058,-18.74
3059,-18.72
3060,-18.74
3061,-18.80
3062,-18.96
3063,-19.24
3064,-19.68
3065,-20.23
3066,-20.88
3067,-21.53
3068,-22.15
3069,-22.66
3070,-23.07
3071,-23.37
3072,-23.61
3073,-23.81
3074,-24.04
3075,-24.30
3076,-24.58
3077,-24.84
3078,-25.05
3079,-25.15
3080,-25.11
3081,-24.90
3082,-24.52
3083,-24.00
3084,-23.37
3085,-22.71
3086,-22.03
3087,-21.38
3088,-20.77
3089,-20.24
3090,-19.78
3091,-19.41
3092,-19.08
3093,-18.81
3094,-18.52
3095,-18.26
3096,-18.00
3097,-17.79
3098,-17.62
3099,-17.54
3100,-17.52
3101,-17.57
3102,-17.63
3103,-17.68
3104,-17.61
3105,-17.41
3106,-17.04
3107,-16.57
3108,-16.04
3109,-15.52
3110,-15.09
3111,-14.79
3112,-14.64
3113,-14.64
3114,-14.79
3115,-15.01
3116,-15.25
3117,-15.46
3118,-15.64
3119,-15.81
3120,-15.98
3121,-16.16
3122,-16.39
3123,-16.65
3124,-16.96
3125,-17.28
3126,-17.61
3127,-17.89
3128,-18.13
3129,-18.30
3130,-18.44
3131,-18.54
3132,-18.64
3133,-18.73
3134,-18.85
3135,-18.96
3136,-19.09
3137,-19.18
3138,-19.27
3139,-19.35
3140,-19.46
3141,-19.60
3142,-19.81
3143,-20.07
3144,-20.41
3145,-20.76
3146,-21.14
3147,-21.48
3148,-21.81
3149,-22.11
3150,-22.42
3151,-22.74
3152,-23.11
3153,-23.53
3154,-23.99
3155,-24.45
3156,-24.87
3157,-25.19
3158,-25.34
3159,-25.32
3160,-25.14
3161,-24.84
3162,-24.40
3163,-23.88
3164,-23.27
3165,-22.64
3166,-21.97
3167,-21.32
3168,-20.68
3169,-20.14
3170,-19.65
3171,-19.30
3172,-19.02
3173,-18.86
3174,-18.68
3175,-18.46
3176,-18.08
3177,-17.57
3178,-16.89
3179,-16.13
3180,-15.29
3181,-14.55
3182,-13.92
3183,-13.51
3184,-13.26
3185,-13.13
3186,-13.02
3187,-12.86
3188,-12.56
3189,-12.10
3190,-11.48
3191,-10.81
3192,-10.15
3193,-9.65
3194,-9.33
3195,-9.25
3196,-9.35
3197,-9.61
3198,-9.95
3199,-10.30
3200,-10.57
3201,-10.73
3202,-10.79
3203,-10.77
3204,-10.73
3205,-10.70
3206,-10.75
3207,-10.86
3208,-11.10
3209,-11.41
3210,-11.82
3211,-12.24
3212,-12.71
3213,-13.15
3214,-13.59
3215,-13.96
3216,-14.32
3217,-14.61
3218,-14.92
3219,-15.24
3220,-15.65
3221,-16.13
3222,-16.71
3223,-17.32
3224,-17.95
3225,-18.52
3226,-19.05
3227,-19.47
3228,-19.83
3229,-20.12
3230,-20.45
3231,-20.80
3232,-21.26
3233,-21.77
3234,-22.38
3235,-23.03
3236,-23.71
3237,-24.33
3238,-24.96
3239,-25.54
3240,-26.12
3241,-26.65
3242,-27.16
3243,-27.59
3244,-27.96
3245,-28.24
3246,-28.42
3247,-28.50
3248,-28.49
3249,-28.38
3250,-28.20
3251,-27.95
3252,-27.66
3253,-27.33
3254,-26.95
3255,-26.55
3256,-26.11
3257,-25.66
3258,-25.16
3259,-24.67
3260,-24.18
3261,-23.74
3262,-23.32
3263,-22.99
3264,-22.74
3265,-22.64
3266,-22.66
3267,-22.79
3268,-22.95
3269,-23.10
3270,-23.15
3271,-23.10
3272,-22.94
3273,-22.72
3274,-22.45
3275,-22.21
3276,-22.02
3277,-21.95
3278,-21.93
3279,-21.98
3280,-21.99
3281,-21.91
3282,-21.66
3283,-21.29
3284,-20.77
3285,-20.18
3286,-19.53
3287,-18.89
3288,-18.27
3289,-17.72
3290,-17.19
3291,-16.72
3292,-16.27
3293,-15.89
3294,-15.55
3295,-15.31
3296,-15.16
3297,-15.10
3298,-15.05
3299,-14.98
3300,-14.81
3301,-14.55
3302,-14.15
3303,-13.65
3304,-13.05
3305,-12.44
3306,-11.82
3307,-11.25
3308,-10.74
3309,-10.28
3310,-9.83
3311,-9.41
3312,-9.00
3313,-8.69
3314,-8.47
3315,-8.38
3316,-8.41
3317,-8.55
3318,-8.76
3319,-9.00
3320,-9.24
3321,-9.47
3322,-9.70
3323,-9.96
3324,-10.30
3325,-10.73
3326,-11.28
3327,-11.90
3328,-12.55
3329,-13.13
3330,-13.60
3331,-13.89
3332,-14.01
3333,-13.96
3334,-13.82
3335,-13.64
3336,-13.47
3337,-13.35
3338,-13.31
3339,-13.33
3340,-13.41
3341,-13.50
3342,-13.61
3343,-13.73
3344,-13.88
3345,-14.05
3346,-14.26
3347,-14.52
3348,-14.81
3349,-15.12
3350,-15.45
3351,-15.77
3352,-16.04
3353,-16.22
3354,-16.31
3355,-16.31
3356,-16.21
3357,-16.01
3358,-15.73
3359,-15.41
3360,-15.06
3361,-14.71
3362,-14.35
3363,-14.02
3364,-13.72
3365,-13.46
3366,-13.20
3367,-12.97
3368,-12.74
3369,-12.56
3370,-12.41
3371,-12.34
3372,-12.36
3373,-12.50
3374,-12.71
3375,-12.96
3376,-13.18
3377,-13.33
3378,-13.35
3379,-13.24
3380,-12.96
3381,-12.57
3382,-12.08
3383,-11.59
3384,-11.12
3385,-10.73
3386,-10.40
3387,-10.15
3388,-9.93
3389,-9.70
3390,-9.40
3391,-9.02
3392,-8.58
3393,-8.12
3394,-7.67
3395,-7.30
3396,-7.04
3397,-6.92
3398,-6.94
3399,-7.07
3400,-7.29
3401,-7.53
3402,-7.81
3403,-8.08
3404,-8.39
3405,-8.73
3406,-9.18
3407,-9.69
3408,-10.28
3409,-10.88
3410,-11.49
3411,-12.04
3412,-12.54
3413,-12.95
3414,-13.35
3415,-13.71
3416,-14.12
3417,-14.54
3418,-15.04
3419,-15.53
3420,-16.04
3421,-16.48
3422,-16.90
3423,-17.29
3424,-17.72
3425,-18.19
3426,-18.74
3427,-19.32
3428,-19.92
3429,-20.43
3430,-20.86
3431,-21.11
3432,-21.23
3433,-21.23
3434,-21.21
3435,-21.24
3436,-21.38
3437,-21.64
3438,-22.00
3439,-22.38
3440,-22.73
3441,-22.98
3442,-23.07
3443,-22.99
3444,-22.75
3445,-22.41
3446,-22.00
3447,-21.59
3448,-21.18
3449,-20.82
3450,-20.46
3451,-20.11
3452,-19.74
3453,-19.35
3454,-18.89
3455,-18.40
3456,-17.83
3457,-17.23
3458,-16.56
3459,-15.91
3460,-15.21
3461,-14.56
3462,-13.90
3463,-13.32
3464,-12.77
3465,-12.30
3466,-11.82
3467,-11.38
3468,-10.88
3469,-10.40
3470,-9.87
3471,-9.36
3472,-8.82
3473,-8.36
3474,-7.92
3475,-7.55
3476,-7.18
3477,-6.85
3478,-6.48
3479,-6.09
3480,-5.62
3481,-5.10
3482,-4.48
3483,-3.84
3484,-3.18
3485,-2.60
3486,-2.15
3487,-1.88
3488,-1.80
3489,-1.93
3490,-2.21
3491,-2.58
3492,-2.95
3493,-3.29
3494,-3.59
3495,-3.84
3496,-4.08
3497,-4.32
3498,-4.63
3499,-5.01
3500,-5.48
3501,-5.97
3502,-6.47
3503,-6.90
3504,-7.25
3505,-7.49
3506,-7.63
3507,-7.69
3508,-7.71
3509,-7.69
3510,-7.69
3511,-7.68
3512,-7.67
3513,-7.58
3514,-7.45
3515,-7.27
3516,-7.09
3517,-6.91
3518,-6.79
3519,-6.76
3520,-6.88
3521,-7.15
3522,-7.56
3523,-8.09
3524,-8.72
3525,-9.39
3526,-10.09
3527,-10.71
3528,-11.21
3529,-11.55
3530,-11.77
3531,-11.83
3532,-11.80
3533,-11.67
3534,-11.57
3535,-11.51
3536,-11.57
3537,-11.68
3538,-11.86
3539,-12.04
3540,-12.23
3541,-12.38
3542,-12.52
3543,-12.66
3544,-12.88
3545,-13.22
3546,-13.71
3547,-14.31
3548,-14.99
3549,-15.68
3550,-16.33
3551,-16.88
3552,-17.31
3553,-17.61
3554,-17.83
3555,-17.97
3556,-18.08
3557,-18.15
3558,-18.17
3559,-18.09
3560,-17.89
3561,-17.54
3562,-17.04
3563,-16.44
3564,-15.75
3565,-15.07
3566,-14.40
3567,-13.83
3568,-13.34
3569,-12.96
3570,-12.65
3571,-12.40
3572,-12.11
3573,-11.78
3574,-11.33
3575,-10.83
3576,-10.27
3577,-9.75
3578,-9.28
3579,-8.94
3580,-8.72
3581,-8.68
3582,-8.77
3583,-8.95
3584,-9.09
3585,-9.12
3586,-8.98
3587,-8.67
3588,-8.19
3589,-7.60
3590,-6.97
3591,-6.41
3592,-6.01
3593,-5.81
3594,-5.81
3595,-5.96
3596,-6.23
3597,-6.55
3598,-6.85
3599,-7.09
3600,-7.25
3601,-7.38
3602,-7.52
3603,-7.72
3604,-8.02
3605,-8.39
3606,-8.81
3607,-9.23
3608,-9.62
3609,-9.92
3610,-10.10
3611,-10.15
3612,-10.12
3613,-10.02
3614,-9.90
3615,-9.77
3616,-9.69
3617,-9.63
3618,-9.62
3619,-9.62
3620,-9.68
3621,-9.77
3622,-9.92
3623,-10.09
3624,-10.31
3625,-10.54
3626,-10.81
3627,-11.11
3628,-11.43
3629,-11.75
3630,-12.10
3631,-12.43
3632,-12.77
3633,-13.09
3634,-13.42
3635,-13.77
3636,-14.15
3637,-14.56
3638,-14.94
3639,-15.25
3640,-15.46
3641,-15.52
3642,-15.41
3643,-15.12
3644,-14.63
3645,-14.02
3646,-13.29
3647,-12.55
3648,-11.80
3649,-11.07
3650,-10.33
3651,-9.62
3652,-8.88
3653,-8.20
3654,-7.52
3655,-6.92
3656,-6.34
3657,-5.86
3658,-5.38
3659,-4.97
3660,-4.50
3661,-4.03
3662,-3.50
3663,-2.99
3664,-2.48
3665,-2.06
3666,-1.69
3667,-1.41
3668,-1.17
3669,-0.95
3670,-0.70
3671,-0.42
3672,-0.07
3673,0.32
3674,0.71
3675,1.02
3676,1.22
3677,1.29
3678,1.22
3679,1.04
3680,0.78
3681,0.50
3682,0.22
3683,-0.03
3684,-0.23
3685,-0.34
3686,-0.40
3687,-0.40
3688,-0.39
3689,-0.37
3690,-0.43
3691,-0.56
3692,-0.86
3693,-1.28
3694,-1.83
3695,-2.43
3696,-3.09
3697,-3.72
3698,-4.32
3699,-4.83
3700,-5.33
3701,-5.81
3702,-6.34
3703,-6.87
3704,-7.47
3705,-8.03
3706,-8.58
3707,-8.99
3708,-9.31
3709,-9.49
3710,-9.63
3711,-9.73
3712,-9.94
3713,-10.26
3714,-10.82
3715,-11.55
3716,-12.44
3717,-13.34
3718,-14.22
3719,-14.97
3720,-15.59
3721,-16.02
3722,-16.34
3723,-16.56
3724,-16.80
3725,-17.07
3726,-17.40
3727,-17.73
3728,-18.04
3729,-18.25
3730,-18.33
3731,-18.24
3732,-17.98
3733,-17.61
3734,-17.17
3735,-16.76
3736,-16.36
3737,-16.01
3738,-15.66
3739,-15.31
3740,-14.87
3741,-14.36
3742,-13.75
3743,-13.09
3744,-12.37
3745,-11.69
3746,-11.07
3747,-10.61
3748,-10.33
3749,-10.27
3750,-10.36
3751,-10.62
3752,-10.98
3753,-11.41
3754,-11.80
3755,-12.11
3756,-12.27
3757,-12.32
3758,-12.19
3759,-11.91
3760,-11.47
3761,-10.92
3762,-10.27
3763,-9.59
3764,-8.87
3765,-8.19
3766,-7.54
3767,-6.96
3768,-6.46
3769,-6.09
3770,-5.80
3771,-5.64
3772,-5.56
3773,-5.58
3774,-5.62
3775,-5.71
3776,-5.75
3777,-5.77
3778,-5.69
3779,-5.51
3780,-5.18
3781,-4.75
3782,-4.22
3783,-3.67
3784,-3.13
3785,-2.65
3786,-2.22
3787,-1.87
3788,-1.54
3789,-1.21
3790,-0.82
3791,-0.38
3792,0.12
3793,0.59
3794,0.98
3795,1.20
3796,1.21
3797,1.00
3798,0.61
3799,0.12
3800,-0.38
3801,-0.79
3802,-1.11
3803,-1.30
3804,-1.43
3805,-1.55
3806,-1.78
3807,-2.17
3808,-2.76
3809,-3.50
3810,-4.34
3811,-5.16
3812,-5.90
3813,-6.47
3814,-6.87
3815,-7.06
3816,-7.13
3817,-7.07
3818,-6.97
3819,-6.82
3820,-6.68
3821,-6.54
3822,-6.44
3823,-6.37
3824,-6.40
3825,-6.52
3826,-6.80
3827,-7.23
3828,-7.80
3829,-8.47
3830,-9.15
3831,-9.74
3832,-10.19
3833,-10.44
3834,-10.49
3835,-10.36
3836,-10.11
3837,-9.80
3838,-9.48
3839,-9.21
3840,-8.99
3841,-8.81
3842,-8.63
3843,-8.41
3844,-8.12
3845,-7.75
3846,-7.32
3847,-6.88
3848,-6.45
3849,-6.08
3850,-5.76
3851,-5.52
3852,-5.32
3853,-5.17
3854,-5.04
3855,-4.94
3856,-4.81
3857,-4.66
3858,-4.47
3859,-4.27
3860,-4.01
3861,-3.73
3862,-3.42
3863,-3.13
3864,-2.87
3865,-2.66
3866,-2.49
3867,-2.40
3868,-2.38
3869,-2.40
3870,-2.40
3871,-2.35
3872,-2.20
3873,-1.97
3874,-1.66
3875,-1.31
3876,-0.95
3877,-0.63
3878,-0.38
3879,-0.20
3880,-0.13
3881,-0.16
3882,-0.34
3883,-0.64
3884,-1.09
3885,-1.67
3886,-2.36
3887,-3.06
3888,-3.73
3889,-4.24
3890,-4.61
3891,-4.79
3892,-4.85
3893,-4.79
3894,-4.76
3895,-4.81
3896,-5.07
3897,-5.46
3898,-6.03
3899,-6.65
3900,-7.32
3901,-7.93
3902,-8.52
3903,-9.05
3904,-9.58
3905,-10.11
3906,-10.70
3907,-11.30
3908,-11.92
3909,-12.44
3910,-12.85
3911,-13.07
3912,-13.15
3913,-13.08
3914,-12.94
3915,-12.76
3916,-12.62
3917,-12.53
3918,-12.53
3919,-12.58
3920,-12.67
3921,-12.78
3922,-12.91
3923,-13.06
3924,-13.23
3925,-13.43
3926,-13.64
3927,-13.83
3928,-13.93
3929,-13.92
3930,-13.76
3931,-13.47
3932,-13.03
3933,-12.53
3934,-11.98
3935,-11.47
3936,-10.98
3937,-10.54
3938,-10.07
3939,-9.59
3940,-9.01
3941,-8.35
3942,-7.53
3943,-6.64
3944,-5.65
3945,-4.73
3946,-3.87
3947,-3.20
3948,-2.67
3949,-2.36
3950,-2.15
3951,-2.08
3952,-1.96
3953,-1.79
3954,-1.42
3955,-0.89
3956,-0.15
3957,0.65
3958,1.52
3959,2.31
3960,3.02
3961,3.55
3962,3.96
3963,4.24
3964,4.51
3965,4.79
3966,5.15
3967,5.57
3968,6.04
3969,6.49
3970,6.87
3971,7.10
3972,7.16
3973,7.06
3974,6.82
3975,6.48
3976,6.06
3977,5.60
3978,5.12
3979,4.63
3980,4.09
3981,3.54
3982,2.97
3983,2.46
3984,2.03
3985,1.73
3986,1.54
3987,1.47
3988,1.46
3989,1.50
3990,1.53
3991,1.54
3992,1.49
3993,1.44
3994,1.38
3995,1.39
3996,1.44
3997,1.53
3998,1.60
3999,1.64
4000,1.56
4001,1.37
4002,1.02
4003,0.54
4004,-0.04
4005,-0.66
4006,-1.29
4007,-1.90
4008,-2.47
4009,-2.96
4010,-3.39
4011,-3.75
4012,-4.06
4013,-4.27
4014,-4.40
4015,-4.42
4016,-4.39
4017,-4.28
4018,-4.16
4019,-4.01
4020,-3.91
4021,-3.88
4022,-4.00
4023,-4.25
4024,-4.62
4025,-5.08
4026,-5.61
4027,-6.16
4028,-6.68
4029,-7.14
4030,-7.54
4031,-7.87
4032,-8.15
4033,-8.38
4034,-8.58
4035,-8.77
4036,-8.94
4037,-9.09
4038,-9.17
4039,-9.16
4040,-9.04
4041,-8.82
4042,-8.48
4043,-8.07
4044,-7.57
4045,-7.03
4046,-6.47
4047,-5.93
4048,-5.40
4049,-4.94
4050,-4.53
4051,-4.20
4052,-3.90
4053,-3.62
4054,-3.31
4055,-3.01
4056,-2.66
4057,-2.31
4058,-1.94
4059,-1.61
4060,-1.34
4061,-1.20
4062,-1.17
4063,-1.26
4064,-1.40
4065,-1.57
4066,-1.68
4067,-1.69
4068,-1.56
4069,-1.29
4070,-0.91
4071,-0.46
4072,0.03
4073,0.51
4074,0.90
4075,1.14
4076,1.20
4077,1.09
4078,0.83
4079,0.48
4080,0.07
4081,-0.33
4082,-0.69
4083,-0.97
4084,-1.16
4085,-1.28
4086,-1.35
4087,-1.43
4088,-1.53
4089,-1.66
4090,-1.81
4091,-1.94
4092,-2.01
4093,-1.98
4094,-1.85
4095,-1.63
4096,-1.39
4097,-1.16
4098,-1.05
4099,-1.07
4100,-1.27
4101,-1.61
4102,-2.06
4103,-2.54
4104,-3.01
4105,-3.40
4106,-3.71
4107,-3.92
4108,-4.10
4109,-4.27
4110,-4.47
4111,-4.71
4112,-5.00
4113,-5.28
4114,-5.55
4115,-5.73
4116,-5.85
4117,-5.89
4118,-5.90
4119,-5.90
4120,-5.91
4121,-5.98
4122,-6.07
4123,-6.16
4124,-6.19
4125,-6.13
4126,-5.97
4127,-5.71
4128,-5.32
4129,-4.85
4130,-4.27
4131,-3.66
4132,-2.98
4133,-2.33
4134,-1.65
4135,-1.01
4136,-0.36
4137,0.24
4138,0.87
4139,1.47
4140,2.10
4141,2.70
4142,3.34
4143,3.92
4144,4.48
4145,4.94
4146,5.32
4147,5.59
4148,5.84
4149,6.06
4150,6.34
4151,6.69
4152,7.11
4153,7.55
4154,7.96
4155,8.24
4156,8.34
4157,8.23
4158,7.92
4159,7.49
4160,7.00
4161,6.54
4162,6.18
4163,5.94
4164,5.82
4165,5.79
4166,5.80
4167,5.82
4168,5.79
4169,5.73
4170,5.62
4171,5.53
4172,5.43
4173,5.34
4174,5.22
4175,5.06
4176,4.80
4177,4.45
4178,3.95
4179,3.36
4180,2.66
4181,1.92
4182,1.13
4183,0.40
4184,-0.30
4185,-0.89
4186,-1.44
4187,-1.91
4188,-2.38
4189,-2.80
4190,-3.28
4191,-3.75
4192,-4.27
4193,-4.76
4194,-5.28
4195,-5.74
4196,-6.20
4197,-6.63
4198,-7.12
4199,-7.61
4200,-8.16
4201,-8.71
4202,-9.29
4203,-9.84
4204,-10.36
4205,-10.78
4206,-11.07
4207,-11.22
4208,-11.24
4209,-11.12
4210,-10.90
4211,-10.60
4212,-10.26
4213,-9.93
4214,-9.60
4215,-9.28
4216,-8.94
4217,-8.57
4218,-8.13
4219,-7.64
4220,-7.11
4221,-6.62
4222,-6.18
4223,-5.89
4224,-5.73
4225,-5.72
4226,-5.80
4227,-5.95
4228,-6.07
4229,-6.12
4230,-6.07
4231,-5.94
4232,-5.74
4233,-5.54
4234,-5.35
4235,-5.22
4236,-5.13
4237,-5.10
4238,-5.07
4239,-5.03
4240,-4.89
4241,-4.66
4242,-4.29
4243,-3.84
4244,-3.29
4245,-2.71
4246,-2.09
4247,-1.50
4248,-0.93
4249,-0.44
4250,-0.02
4251,0.31
4252,0.59
4253,0.74
4254,0.81
4255,0.73
4256,0.61
4257,0.45
4258,0.34
4259,0.27
4260,0.39
4261,0.70
4262,1.28
4263,1.98
4264,2.80
4265,3.59
4266,4.34
4267,4.96
4268,5.47
4269,5.90
4270,6.36
4271,6.86
4272,7.43
4273,8.02
4274,8.59
4275,9.07
4276,9.38
4277,9.43
4278,9.23
4279,8.84
4280,8.33
4281,7.76
4282,7.16
4283,6.58
4284,6.01
4285,5.47
4286,4.91
4287,4.36
4288,3.82
4289,3.35
4290,2.96
4291,2.71
4292,2.59
4293,2.61
4294,2.65
4295,2.69
4296,2.69
4297,2.66
4298,2.55
4299,2.40
4300,2.25
4301,2.12
4302,2.00
4303,1.89
4304,1.76
4305,1.61
4306,1.42
4307,1.18
4308,0.91
4309,0.62
4310,0.36
4311,0.16
4312,0.04
4313,0.03
4314,0.14
4315,0.31
4316,0.54
4317,0.79
4318,1.06
4319,1.31
4320,1.55
4321,1.78
4322,2.04
4323,2.35
4324,2.74
4325,3.18
4326,3.70
4327,4.25
4328,4.83
4329,5.36
4330,5.86
4331,6.25
4332,6.54
4333,6.70
4334,6.77
4335,6.73
4336,6.63
4337,6.45
4338,6.25
4339,6.04
4340,5.87
4341,5.73
4342,5.66
4343,5.64
4344,5.71
4345,5.83
4346,6.03
4347,6.28
4348,6.57
4349,6.90
4350,7.26
4351,7.65
4352,8.06
4353,8.42
4354,8.69
4355,8.87
4356,8.94
4357,8.93
4358,8.82
4359,8.63
4360,8.39
4361,8.14
4362,7.89
4363,7.63
4364,7.32
4365,6.98
4366,6.57
4367,6.13
4368,5.65
4369,5.22
4370,4.79
4371,4.46
4372,4.17
4373,3.95
4374,3.69
4375,3.35
4376,2.84
4377,2.19
4378,1.40
4379,0.62
4380,-0.13
4381,-0.72
4382,-1.19
4383,-1.50
4384,-1.75
4385,-2.01
4386,-2.41
4387,-2.94
4388,-3.63
4389,-4.36
4390,-5.08
4391,-5.66
4392,-6.09
4393,-6.30
4394,-6.39
4395,-6.41
4396,-6.47
4397,-6.58
4398,-6.74
4399,-6.91
4400,-7.08
4401,-7.21
4402,-7.28
4403,-7.30
4404,-7.28
4405,-7.28
4406,-7.26
4407,-7.25
4408,-7.19
4409,-7.03
4410,-6.71
4411,-6.21
4412,-5.51
4413,-4.74
4414,-3.94
4415,-3.27
4416,-2.73
4417,-2.37
4418,-2.11
4419,-1.94
4420,-1.75
4421,-1.51
4422,-1.11
4423,-0.59
4424,0.09
4425,0.82
4426,1.59
4427,2.26
4428,2.86
4429,3.29
4430,3.66
4431,3.92
4432,4.20
4433,4.49
4434,4.89
4435,5.38
4436,6.03
4437,6.75
4438,7.58
4439,8.42
4440,9.26
4441,10.01
4442,10.68
4443,11.22
4444,11.67
4445,12.02
4446,12.30
4447,12.50
4448,12.66
4449,12.75
4450,12.75
4451,12.65
4452,12.46
4453,12.19
4454,11.83
4455,11.44
4456,11.03
4457,10.64
4458,10.25
4459,9.87
4460,9.49
4461,9.13
4462,8.79
4463,8.50
4464,8.26
4465,8.15
4466,8.14
4467,8.25
4468,8.42
4469,8.62
4470,8.78
4471,8.86
4472,8.80
4473,8.64
4474,8.36
4475,8.07
4476,7.78
4477,7.57
4478,7.40
4479,7.27
4480,7.13
4481,6.96
4482,6.69
4483,6.32
4484,5.83
4485,5.29
4486,4.69
4487,4.13
4488,3.62
4489,3.21
4490,2.91
4491,2.73
4492,2.68
4493,2.74
4494,2.85
4495,2.99
4496,3.10
4497,3.18
4498,3.19
4499,3.15
4500,3.02
4501,2.84
4502,2.59
4503,2.33
4504,2.03
4505,1.73
4506,1.41
4507,1.08
4508,0.69
4509,0.29
4510,-0.14
4511,-0.59
4512,-1.07
4513,-1.56
4514,-2.07
4515,-2.56
4516,-3.02
4517,-3.38
4518,-3.63
4519,-3.71
4520,-3.63
4521,-3.40
4522,-3.02
4523,-2.50
4524,-1.88
4525,-1.23
4526,-0.58
4527,0.03
4528,0.62
4529,1.15
4530,1.65
4531,2.06
4532,2.45
4533,2.77
4534,3.11
4535,3.44
4536,3.83
4537,4.23
4538,4.70
4539,5.16
4540,5.66
4541,6.13
4542,6.59
4543,7.00
4544,7.39
4545,7.73
4546,8.06
4547,8.35
4548,8.68
4549,9.01
4550,9.41
4551,9.83
4552,10.29
4553,10.71
4554,11.10
4555,11.36
4556,11.49
4557,11.44
4558,11.27
4559,11.02
4560,10.77
4561,10.58
4562,10.53
4563,10.63
4564,10.86
4565,11.18
4566,11.47
4567,11.66
4568,11.66
4569,11.43
4570,10.97
4571,10.35
4572,9.64
4573,8.94
4574,8.30
4575,7.82
4576,7.51
4577,7.41
4578,7.45
4579,7.60
4580,7.80
4581,8.01
4582,8.15
4583,8.18
4584,8.04
4585,7.76
4586,7.28
4587,6.65
4588,5.90
4589,5.13
4590,4.37
4591,3.70
4592,3.14
4593,2.71
4594,2.42
4595,2.26
4596,2.17
4597,2.15
4598,2.17
4599,2.25
4600,2.42
4601,2.68
4602,3.03
4603,3.41
4604,3.83
4605,4.22
4606,4.61
4607,4.94
4608,5.27
4609,5.58
4610,5.97
4611,6.41
4612,6.97
4613,7.57
4614,8.25
4615,8.91
4616,9.62
4617,10.29
4618,11.00
4619,11.68
4620,12.41
4621,13.16
4622,13.99
4623,14.78
4624,15.55
4625,16.18
4626,16.68
4627,17.01
4628,17.22
4629,17.31
4630,17.37
4631,17.40
4632,17.49
4633,17.61
4634,17.75
4635,17.86
4636,17.92
4637,17.92
4638,17.86
4639,17.74
4640,17.61
4641,17.50
4642,17.43
4643,17.41
4644,17.38
4645,17.33
4646,17.21
4647,17.03
4648,16.75
4649,16.41
4650,16.01
4651,15.63
4652,15.25
4653,14.94
4654,14.63
4655,14.38
4656,14.11
4657,13.85
4658,13.51
4659,13.10
4660,12.53
4661,11.87
4662,11.08
4663,10.27
4664,9.41
4665,8.62
4666,7.93
4667,7.43
4668,7.07
4669,6.85
4670,6.63
4671,6.43
4672,6.12
4673,5.75
4674,5.26
4675,4.77
4676,4.29
4677,3.91
4678,3.60
4679,3.37
4680,3.12
4681,2.84
4682,2.45
4683,1.93
4684,1.27
4685,0.53
4686,-0.21
4687,-0.83
4688,-1.30
4689,-1.57
4690,-1.66
4691,-1.60
4692,-1.43
4693,-1.20
4694,-0.94
4695,-0.66
4696,-0.34
4697,0.03
4698,0.49
4699,1.05
4700,1.74
4701,2.49
4702,3.29
4703,4.03
4704,4.68
4705,5.17
4706,5.49
4707,5.61
4708,5.60
4709,5.48
4710,5.35
4711,5.19
4712,5.10
4713,5.05
4714,5.07
4715,5.11
4716,5.15
4717,5.18
4718,5.20
4719,5.23
4720,5.31
4721,5.45
4722,5.71
4723,6.07
4724,6.55
4725,7.07
4726,7.63
4727,8.13
4728,8.59
4729,8.96
4730,9.31
4731,9.64
4732,10.01
4733,10.41
4734,10.86
4735,11.30
4736,11.74
4737,12.11
4738,12.45
4739,12.71
4740,12.95
4741,13.14
4742,13.38
4743,13.60
4744,13.83
4745,13.94
4746,13.96
4747,13.88
4748,13.78
4749,13.73
4750,13.85
4751,14.18
4752,14.76
4753,15.53
4754,16.37
4755,17.11
4756,17.62
4757,17.80
4758,17.64
4759,17.23
4760,16.70
4761,16.21
4762,15.86
4763,15.71
4764,15.66
4765,15.63
4766,15.47
4767,15.08
4768,14.40
4769,13.52
4770,12.49
4771,11.51
4772,10.67
4773,10.13
4774,9.88
4775,9.92
4776,10.11
4777,10.38
4778,10.58
4779,10.69
4780,10.59
4781,10.35
4782,9.98
4783,9.55
4784,9.08
4785,8.63
4786,8.21
4787,7.86
4788,7.57
4789,7.36
4790,7.21
4791,7.10
4792,7.05
4793,7.03
4794,7.05
4795,7.08
4796,7.10
4797,7.12
4798,7.17
4799,7.27
4800,7.44
4801,7.66
4802,7.94
4803,8.25
4804,8.55
4805,8.83
4806,9.10
4807,9.33
4808,9.53
4809,9.68
4810,9.83
4811,9.96
4812,10.10
4813,10.18
4814,10.24
4815,10.30
4816,10.38
4817,10.49
4818,10.66
4819,10.88
4820,11.19
4821,11.56
4822,11.96
4823,12.31
4824,12.62
4825,12.83
4826,12.97
4827,13.02
4828,13.04
4829,13.05
4830,13.15
4831,13.37
4832,13.72
4833,14.18
4834,14.71
4835,15.24
4836,15.69
4837,15.99
4838,16.10
4839,16.02
4840,15.77
4841,15.43
4842,15.05
4843,14.69
4844,14.36
4845,14.08
4846,13.82
4847,13.56
4848,13.24
4849,12.86
4850,12.41
4851,11.94
4852,11.42
4853,10.93
4854,10.42
4855,9.97
4856,9.50
4857,9.04
4858,8.52
4859,8.00
4860,7.43
4861,6.88
4862,6.32
4863,5.79
4864,5.24
4865,4.74
4866,4.22
4867,3.74
4868,3.24
4869,2.80
4870,2.40
4871,2.13
4872,1.97
4873,1.96
4874,2.02
4875,2.14
4876,2.25
4877,2.31
4878,2.29
4879,2.21
4880,2.06
4881,1.88
4882,1.67
4883,1.45
4884,1.24
4885,1.06
4886,0.96
4887,0.96
4888,1.08
4889,1.30
4890,1.64
4891,2.08
4892,2.61
4893,3.16
4894,3.71
4895,4.19
4896,4.63
4897,4.98
4898,5.31
4899,5.60
4900,5.96
4901,6.38
4902,6.92
4903,7.50
4904,8.16
4905,8.78
4906,9.40
4907,9.93
4908,10.44
4909,10.89
4910,11.37
4911,11.85
4912,12.44
4913,13.08
4914,13.84
4915,14.61
4916,15.42
4917,16.17
4918,16.91
4919,17.54
4920,18.11
4921,18.58
4922,19.04
4923,19.47
4924,19.89
4925,20.25
4926,20.58
4927,20.81
4928,20.96
4929,20.97
4930,20.87
4931,20.70
4932,20.50
4933,20.32
4934,20.17
4935,20.04
4936,19.92
4937,19.76
4938,19.49
4939,19.07
4940,18.45
4941,17.69
4942,16.85
4943,16.05
4944,15.35
4945,14.84
4946,14.56
4947,14.51
4948,14.62
4949,14.86
4950,15.12
4951,15.39
4952,15.60
4953,15.76
4954,15.84
4955,15.92
4956,15.98
4957,16.03
4958,16.01
4959,15.92
4960,15.74
4961,15.52
4962,15.22
4963,14.89
4964,14.51
4965,14.14
4966,13.74
4967,13.33
4968,12.88
4969,12.41
4970,11.93
4971,11.48
4972,11.10
4973,10.87
4974,10.78
4975,10.87
4976,11.08
4977,11.38
4978,11.65
4979,11.86
4980,11.92
4981,11.85
4982,11.61
4983,11.26
4984,10.78
4985,10.23
4986,9.60
4987,8.94
4988,8.27
4989,7.66
4990,7.12
4991,6.68
4992,6.33
4993,6.11
4994,5.96
4995,5.88
4996,5.78
4997,5.62
4998,5.38
4999,5.08
5000,4.76
5001,4.45
5002,4.25
5003,4.21
5004,4.38
5005,4.74
5006,5.28
5007,5.94
5008,6.67
5009,7.39
5010,8.05
5011,8.62
5012,9.09
5013,9.45
5014,9.73
5015,9.93
5016,10.14
5017,10.34
5018,10.62
5019,10.93
5020,11.29
5021,11.64
5022,11.99
5023,12.29
5024,12.58
5025,12.81
5026,13.05
5027,13.28
5028,13.56
5029,13.90
5030,14.32
5031,14.78
5032,15.26
5033,15.71
5034,16.09
5035,16.34
5036,16.46
5037,16.43
5038,16.27
5039,15.99
5040,15.63
5041,15.19
5042,14.71
5043,14.20
5044,13.69
5045,13.22
5046,12.76
5047,12.35
5048,11.97
5049,11.69
5050,11.49
5051,11.41
5052,11.40
5053,11.45
5054,11.52
5055,11.61
5056,11.65
5057,11.63
5058,11.51
5059,11.33
5060,11.08
5061,10.82
5062,10.52
5063,10.25
5064,10.00
5065,9.82
5066,9.66
5067,9.52
5068,9.32
5069,9.07
5070,8.71
5071,8.27
5072,7.75
5073,7.21
5074,6.70
5075,6.29
5076,5.99
5077,5.83
5078,5.79
5079,5.84
5080,5.97
5081,6.14
5082,6.33
5083,6.53
5084,6.79
5085,7.12
5086,7.56
5087,8.06
5088,8.63
5089,9.22
5090,9.86
5091,10.48
5092,11.12
5093,11.71
5094,12.32
5095,12.89
5096,13.49
5097,14.02
5098,14.53
5099,14.97
5100,15.42
5101,15.83
5102,16.27
5103,16.69
5104,17.15
5105,17.60
5106,18.07
5107,18.51
5108,18.94
5109,19.33
5110,19.72
5111,20.09
5112,20.47
5113,20.82
5114,21.12
5115,21.30
5116,21.36
5117,21.26
5118,21.02
5119,20.68
5120,20.31
5121,19.96
5122,19.66
5123,19.46
5124,19.32
5125,19.23
5126,19.12
5127,18.97
5128,18.74
5129,18.46
5130,18.10
5131,17.73
5132,17.36
5133,17.07
5134,16.83
5135,16.67
5136,16.50
5137,16.33
5138,16.07
5139,15.73
5140,15.23
5141,14.62
5142,13.88
5143,13.11
5144,12.34
5145,11.68
5146,11.13
5147,10.76
5148,10.49
5149,10.34
5150,10.17
5151,9.98
5152,9.63
5153,9.18
5154,8.57
5155,7.92
5156,7.20
5157,6.50
5158,5.80
5159,5.14
5160,4.50
5161,3.90
5162,3.31
5163,2.74
5164,2.16
5165,1.65
5166,1.21
5167,0.92
5168,0.79
5169,0.85
5170,1.07
5171,1.43
5172,1.85
5173,2.26
5174,2.62
5175,2.85
5176,2.98
5177,3.02
5178,3.03
5179,3.06
5180,3.20
5181,3.47
5182,3.90
5183,4.43
5184,5.02
5185,5.57
5186,6.03
5187,6.35
5188,6.55
5189,6.62
5190,6.61
5191,6.53
5192,6.43
5193,6.29
5194,6.15
5195,5.98
5196,5.83
5197,5.71
5198,5.68
5199,5.75
5200,5.98
5201,6.35
5202,6.91
5203,7.55
5204,8.26
5205,8.92
5206,9.55
5207,10.07
5208,10.53
5209,10.93
5210,11.35
5211,11.80
5212,12.33
5213,12.89
5214,13.46
5215,13.91
5216,14.20
5217,14.23
5218,14.06
5219,13.70
5220,13.30
5221,12.93
5222,12.76
5223,12.84
5224,13.24
5225,13.89
5226,14.73
5227,15.62
5228,16.45
5229,17.12
5230,17.64
5231,17.99
5232,18.21
5233,18.35
5234,18.44
5235,18.46
5236,18.42
5237,18.29
5238,18.09
5239,17.85
5240,17.58
5241,17.34
5242,17.12
5243,16.98
5244,16.87
5245,16.78
5246,16.60
5247,16.30
5248,15.84
5249,15.28
5250,14.65
5251,14.04
5252,13.51
5253,13.12
5254,12.88
5255,12.79
5256,12.79
5257,12.84
5258,12.88
5259,12.91
5260,12.91
5261,12.94
5262,13.01
5263,13.17
5264,13.39
5265,13.64
5266,13.84
5267,13.94
5268,13.87
5269,13.64
5270,13.27
5271,12.80
5272,12.30
5273,11.83
5274,11.43
5275,11.14
5276,10.96
5277,10.87
5278,10.86
5279,10.90
5280,11.04
5281,11.31
5282,11.72
5283,12.24
5284,12.88
5285,13.57
5286,14.27
5287,14.89
5288,15.38
5289,15.69
5290,15.83
5291,15.80
5292,15.67
5293,15.47
5294,15.25
5295,15.03
5296,14.85
5297,14.69
5298,14.60
5299,14.57
5300,14.62
5301,14.74
5302,14.95
5303,15.24
5304,15.62
5305,16.01
5306,16.39
5307,16.74
5308,17.05
5309,17.32
5310,17.58
5311,17.82
5312,18.10
5313,18.40
5314,18.74
5315,19.06
5316,19.34
5317,19.51
5318,19.55
5319,19.47
5320,19.30
5321,19.09
5322,18.90
5323,18.78
5324,18.70
5325,18.66
5326,18.53
5327,18.27
5328,17.79
5329,17.08
5330,16.15
5331,15.11
5332,14.02
5333,13.05
5334,12.22
5335,11.63
5336,11.23
5337,11.03
5338,10.87
5339,10.75
5340,10.53
5341,10.30
5342,9.95
5343,9.56
5344,9.05
5345,8.50
5346,7.88
5347,7.25
5348,6.58
5349,5.91
5350,5.28
5351,4.78
5352,4.42
5353,4.24
5354,4.18
5355,4.26
5356,4.39
5357,4.55
5358,4.65
5359,4.68
5360,4.62
5361,4.51
5362,4.35
5363,4.18
5364,4.03
5365,3.90
5366,3.82
5367,3.78
5368,3.81
5369,3.88
5370,4.04
5371,4.24
5372,4.53
5373,4.87
5374,5.32
5375,5.80
5376,6.38
5377,7.01
5378,7.76
5379,8.56
5380,9.45
5381,10.34
5382,11.24
5383,12.06
5384,12.79
5385,13.33
5386,13.74
5387,13.94
5388,14.04
5389,14.03
5390,14.03
5391,14.02
5392,14.12
5393,14.28
5394,14.63
5395,15.11
5396,15.78
5397,16.55
5398,17.43
5399,18.33
5400,19.24
5401,20.07
5402,20.81
5403,21.36
5404,21.74
5405,21.92
5406,21.99
5407,21.97
5408,21.93
5409,21.87
5410,21.83
5411,21.80
5412,21.77
5413,21.73
5414,21.63
5415,21.48
5416,21.23
5417,20.93
5418,20.56
5419,20.17
5420,19.73
5421,19.29
5422,18.84
5423,18.47
5424,18.16
5425,17.94
5426,17.76
5427,17.65
5428,17.57
5429,17.49
5430,17.35
5431,17.19
5432,17.01
5433,16.92
5434,16.91
5435,17.05
5436,17.31
5437,17.69
5438,18.06
5439,18.35
5440,18.42
5441,18.23
5442,17.72
5443,16.95
5444,15.94
5445,14.83
5446,13.71
5447,12.71
5448,11.89
5449,11.31
5450,10.95
5451,10.83
5452,10.89
5453,11.10
5454,11.37
5455,11.68
5456,11.94
5457,12.14
5458,12.17
5459,12.10
5460,11.90
5461,11.68
5462,11.41
5463,11.18
5464,10.94
5465,10.70
5466,10.38
5467,9.95
5468,9.38
5469,8.69
5470,7.90
5471,7.11
5472,6.39
5473,5.84
5474,5.48
5475,5.31
5476,5.28
5477,5.33
5478,5.43
5479,5.52
5480,5.60
5481,5.68
5482,5.82
5483,6.07
5484,6.48
5485,7.03
5486,7.70
5487,8.41
5488,9.15
5489,9.81
5490,10.40
5491,10.86
5492,11.25
5493,11.55
5494,11.87
5495,12.23
5496,12.67
5497,13.16
5498,13.67
5499,14.10
5500,14.44
5501,14.60
5502,14.60
5503,14.41
5504,14.13
5505,13.80
5506,13.56
5507,13.47
5508,13.59
5509,13.90
5510,14.37
5511,14.93
5512,15.49
5513,15.95
5514,16.27
5515,16.43
5516,16.44
5517,16.36
5518,16.20
5519,15.99
5520,15.71
5521,15.37
5522,14.96
5523,14.49
5524,13.94
5525,13.37
5526,12.82
5527,12.36
5528,12.02
5529,11.84
5530,11.78
5531,11.81
5532,11.90
5533,12.03
5534,12.16
5535,12.32
5536,12.47
5537,12.65
5538,12.87
5539,13.12
5540,13.37
5541,13.58
5542,13.70
5543,13.70
5544,13.57
5545,13.35
5546,13.04
5547,12.70
5548,12.34
5549,12.03
5550,11.76
5551,11.54
5552,11.31
5553,11.06
5554,10.75
5555,10.42
5556,10.03
5557,9.62
5558,9.22
5559,8.87
5560,8.63
5561,8.50
5562,8.49
5563,8.58
5564,8.79
5565,9.06
5566,9.42
5567,9.82
5568,10.28
5569,10.78
5570,11.36
5571,12.01
5572,12.75
5573,13.52
5574,14.33
5575,15.10
5576,15.82
5577,16.42
5578,16.93
5579,17.32
5580,17.65
5581,17.90
5582,18.17
5583,18.43
5584,18.77
5585,19.13
5586,19.56
5587,19.95
5588,20.35
5589,20.69
5590,21.00
5591,21.27
5592,21.55
5593,21.83
5594,22.14
5595,22.46
5596,22.77
5597,22.98
5598,23.05
5599,22.96
5600,22.73
5601,22.39
5602,22.00
5603,21.61
5604,21.27
5605,21.03
5606,20.87
5607,20.76
5608,20.65
5609,20.52
5610,20.33
5611,20.11
5612,19.83
5613,19.54
5614,19.24
5615,19.04
5616,18.88
5617,18.81
5618,18.73
5619,18.64
5620,18.43
5621,18.08
5622,17.50
5623,16.72
5624,15.74
5625,14.68
5626,13.57
5627,12.58
5628,11.72
5629,11.12
5630,10.71
5631,10.52
5632,10.41
5633,10.35
5634,10.16
5635,9.85
5636,9.31
5637,8.62
5638,7.77
5639,6.88
5640,5.98
5641,5.20
5642,4.53
5643,4.03
5644,3.64
5645,3.37
5646,3.15
5647,2.99
5648,2.87
5649,2.81
5650,2.80
5651,2.86
5652,2.97
5653,3.14
5654,3.39
5655,3.70
5656,4.08
5657,4.52
5658,5.00
5659,5.51
5660,6.05
5661,6.59
5662,7.12
5663,7.60
5664,8.03
5665,8.36
5666,8.60
5667,8.71
5668,8.74
5669,8.68
5670,8.61
5671,8.54
5672,8.54
5673,8.60
5674,8.75
5675,8.92
5676,9.11
5677,9.24
5678,9.34
5679,9.35
5680,9.35
5681,9.35
5682,9.47
5683,9.75
5684,10.25
5685,10.95
5686,11.80
5687,12.66
5688,13.45
5689,14.06
5690,14.45
5691,14.61
5692,14.60
5693,14.48
5694,14.37
5695,14.31
5696,14.36
5697,14.49
5698,14.68
5699,14.85
5700,15.01
5701,15.14
5702,15.29
5703,15.45
5704,15.69
5705,15.98
5706,16.36
5707,16.80
5708,17.29
5709,17.78
5710,18.28
5711,18.77
5712,19.25
5713,19.72
5714,20.15
5715,20.50
5716,20.70
5717,20.75
5718,20.61
5719,20.34
5720,19.92
5721,19.44
5722,18.93
5723,18.45
5724,17.97
5725,17.46
5726,16.87
5727,16.21
5728,15.48
5729,14.75
5730,14.04
5731,13.47
5732,13.07
5733,12.93
5734,12.95
5735,13.13
5736,13.32
5737,13.48
5738,13.48
5739,13.33
5740,12.97
5741,12.52
5742,12.03
5743,11.58
5744,11.20
5745,10.90
5746,10.65
5747,10.43
5748,10.23
5749,10.03
5750,9.84
5751,9.66
5752,9.49
5753,9.35
5754,9.26
5755,9.24
5756,9.27
5757,9.31
5758,9.35
5759,9.39
5760,9.46
5761,9.58
5762,9.77
5763,10.04
5764,10.42
5765,10.85
5766,11.31
5767,11.75
5768,12.13
5769,12.43
5770,12.61
5771,12.66
5772,12.60
5773,12.47
5774,12.33
5775,12.18
5776,12.05
5777,11.93
5778,11.84
5779,11.80
5780,11.80
5781,11.84
5782,11.92
5783,12.05
5784,12.27
5785,12.55
5786,12.91
5787,13.30
5788,13.71
5789,14.13
5790,14.56
5791,14.98
5792,15.41
5793,15.84
5794,16.26
5795,16.63
5796,16.93
5797,17.10
5798,17.11
5799,16.96
5800,16.66
5801,16.25
5802,15.77
5803,15.30
5804,14.88
5805,14.56
5806,14.29
5807,14.07
5808,13.77
5809,13.42
5810,12.94
5811,12.42
5812,11.86
5813,11.36
5814,10.88
5815,10.50
5816,10.14
5817,9.81
5818,9.40
5819,8.91
5820,8.24
5821,7.49
5822,6.67
5823,5.90
5824,5.18
5825,4.63
5826,4.16
5827,3.81
5828,3.47
5829,3.14
5830,2.75
5831,2.34
5832,1.89
5833,1.50
5834,1.18
5835,1.02
5836,0.97
5837,1.01
5838,1.03
5839,1.01
5840,0.89
5841,0.69
5842,0.43
5843,0.16
5844,-0.04
5845,-0.11
5846,-0.02
5847,0.22
5848,0.56
5849,0.94
5850,1.35
5851,1.73
5852,2.08
5853,2.35
5854,2.60
5855,2.83
5856,3.11
5857,3.39
5858,3.75
5859,4.13
5860,4.59
5861,5.05
5862,5.57
5863,6.09
5864,6.68
5865,7.27
5866,7.92
5867,8.54
5868,9.19
5869,9.79
5870,10.39
5871,10.89
5872,11.39
5873,11.83
5874,12.30
5875,12.75
5876,13.24
5877,13.71
5878,14.23
5879,14.73
5880,15.21
5881,15.63
5882,16.05
5883,16.48
5884,16.93
5885,17.38
5886,17.83
5887,18.24
5888,18.57
5889,18.74
5890,18.72
5891,18.51
5892,18.14
5893,17.68
5894,17.20
5895,16.75
5896,16.37
5897,16.08
5898,15.81
5899,15.54
5900,15.19
5901,14.79
5902,14.31
5903,13.86
5904,13.46
5905,13.20
5906,13.08
5907,13.12
5908,13.24
5909,13.42
5910,13.53
5911,13.54
5912,13.40
5913,13.18
5914,12.88
5915,12.62
5916,12.39
5917,12.23
5918,12.09
5919,11.95
5920,11.72
5921,11.41
5922,10.99
5923,10.53
5924,10.06
5925,9.64
5926,9.30
5927,9.05
5928,8.85
5929,8.70
5930,8.54
5931,8.37
5932,8.15
5933,7.94
5934,7.73
5935,7.58
5936,7.46
5937,7.38
5938,7.29
5939,7.18
5940,7.01
5941,6.81
5942,6.56
5943,6.31
5944,6.07
5945,5.87
5946,5.63
5947,5.37
5948,5.00
5949,4.54
5950,3.97
5951,3.35
5952,2.71
5953,2.12
5954,1.61
5955,1.20
5956,0.90
5957,0.70
5958,0.60
5959,0.58
5960,0.64
5961,0.78
5962,1.01
5963,1.35
5964,1.83
5965,2.39
5966,2.99
5967,3.56
5968,4.13
5969,4.61
5970,5.04
5971,5.35
5972,5.63
5973,5.85
5974,6.08
5975,6.26
5976,6.47
5977,6.68
5978,6.93
5979,7.17
5980,7.43
5981,7.70
5982,8.03
5983,8.40
5984,8.83
5985,9.28
5986,9.77
5987,10.25
5988,10.73
5989,11.15
5990,11.49
5991,11.72
5992,11.87
5993,11.94
5994,11.98
5995,11.98
5996,11.99
5997,12.01
5998,12.04
5999,12.05
6000,12.03
6001,11.96
6002,11.83
6003,11.61
6004,11.34
6005,11.03
6006,10.71
6007,10.43
6008,10.20
6009,10.06
6010,9.99
6011,9.99
6012,10.04
6013,10.12
6014,10.24
6015,10.39
6016,10.55
6017,10.73
6018,10.90
6019,11.06
6020,11.18
6021,11.23
6022,11.16
6023,10.97
6024,10.67
6025,10.27
6026,9.80
6027,9.34
6028,8.94
6029,8.66
6030,8.50
6031,8.44
6032,8.43
6033,8.43
6034,8.36
6035,8.19
6036,7.92
6037,7.54
6038,7.11
6039,6.68
6040,6.35
6041,6.19
6042,6.22
6043,6.44
6044,6.84
6045,7.35
6046,7.90
6047,8.37
6048,8.72
6049,8.92
6050,9.02
6051,9.06
6052,9.15
6053,9.33
6054,9.71
6055,10.27
6056,11.02
6057,11.80
6058,12.61
6059,13.30
6060,13.93
6061,14.44
6062,14.94
6063,15.43
6064,16.02
6065,16.67
6066,17.37
6067,18.01
6068,18.59
6069,18.98
6070,19.23
6071,19.31
6072,19.34
6073,19.34
6074,19.40
6075,19.51
6076,19.67
6077,19.83
6078,19.95
6079,19.97
6080,19.87
6081,19.64
6082,19.35
6083,19.03
6084,18.74
6085,18.52
6086,18.39
6087,18.36
6088,18.39
6089,18.51
6090,18.68
6091,18.89
6092,19.06
6093,19.19
6094,19.20
6095,19.11
6096,18.87
6097,18.51
6098,18.02
6099,17.49
6100,16.92
6101,16.39
6102,15.88
6103,15.43
6104,14.97
6105,14.52
6106,14.04
6107,13.56
6108,13.02
6109,12.49
6110,11.95
6111,11.50
6112,11.05
6113,10.67
6114,10.28
6115,9.91
6116,9.48
6117,9.06
6118,8.54
6119,8.00
6120,7.39
6121,6.78
6122,6.14
6123,5.51
6124,4.87
6125,4.28
6126,3.73
6127,3.30
6128,2.98
6129,2.82
6130,2.82
6131,2.98
6132,3.25
6133,3.60
6134,3.99
6135,4.38
6136,4.76
6137,5.11
6138,5.47
6139,5.83
6140,6.23
6141,6.66
6142,7.11
6143,7.54
6144,7.92
6145,8.17
6146,8.30
6147,8.27
6148,8.13
6149,7.89
6150,7.63
6151,7.38
6152,7.20
6153,7.10
6154,7.11
6155,7.17
6156,7.24
6157,7.26
6158,7.22
6159,7.11
6160,6.99
6161,6.92
6162,6.98
6163,7.20
6164,7.63
6165,8.22
6166,8.92
6167,9.64
6168,10.29
6169,10.76
6170,11.04
6171,11.13
6172,11.12
6173,11.08
6174,11.11
6175,11.22
6176,11.46
6177,11.76
6178,12.12
6179,12.41
6180,12.63
6181,12.72
6182,12.74
6183,12.75
6184,12.81
6185,12.95
6186,13.21
6187,13.54
6188,13.91
6189,14.25
6190,14.58
6191,14.85
6192,15.10
6193,15.32
6194,15.56
6195,15.84
6196,16.16
6197,16.48
6198,16.73
6199,16.88
6200,16.87
6201,16.71
6202,16.40
6203,15.95
6204,15.33
6205,14.61
6206,13.79
6207,12.94
6208,12.05
6209,11.20
6210,10.40
6211,9.74
6212,9.20
6213,8.83
6214,8.55
6215,8.37
6216,8.19
6217,8.04
6218,7.85
6219,7.67
6220,7.47
6221,7.34
6222,7.28
6223,7.30
6224,7.33
6225,7.37
6226,7.34
6227,7.24
6228,7.01
6229,6.66
6230,6.22
6231,5.75
6232,5.31
6233,4.97
6234,4.74
6235,4.67
6236,4.74
6237,4.90
6238,5.12
6239,5.34
6240,5.53
6241,5.68
6242,5.82
6243,5.96
6244,6.14
6245,6.37
6246,6.66
6247,7.01
6248,7.39
6249,7.76
6250,8.09
6251,8.33
6252,8.51
6253,8.60
6254,8.65
6255,8.63
6256,8.58
6257,8.51
6258,8.47
6259,8.44
6260,8.45
6261,8.47
6262,8.56
6263,8.71
6264,8.94
6265,9.20
6266,9.53
6267,9.90
6268,10.29
6269,10.67
6270,11.07
6271,11.47
6272,11.85
6273,12.18
6274,12.45
6275,12.61
6276,12.68
6277,12.64
6278,12.50
6279,12.27
6280,11.98
6281,11.70
6282,11.46
6283,11.29
6284,11.17
6285,11.07
6286,10.95
6287,10.79
6288,10.52
6289,10.16
6290,9.66
6291,9.10
6292,8.46
6293,7.83
6294,7.22
6295,6.70
6296,6.23
6297,5.85
6298,5.46
6299,5.12
6300,4.75
6301,4.42
6302,4.07
6303,3.77
6304,3.45
6305,3.17
6306,2.86
6307,2.54
6308,2.11
6309,1.60
6310,1.01
6311,0.42
6312,-0.15
6313,-0.61
6314,-0.95
6315,-1.11
6316,-1.14
6317,-1.03
6318,-0.88
6319,-0.74
6320,-0.68
6321,-0.69
6322,-0.75
6323,-0.79
6324,-0.80
6325,-0.77
6326,-0.70
6327,-0.62
6328,-0.49
6329,-0.37
6330,-0.24
6331,-0.12
6332,0.04
6333,0.23
6334,0.49
6335,0.78
6336,1.11
6337,1.41
6338,1.69
6339,1.91
6340,2.13
6341,2.36
6342,2.69
6343,3.10
6344,3.67
6345,4.31
6346,5.05
6347,5.77
6348,6.46
6349,7.04
6350,7.58
6351,8.02
6352,8.46
6353,8.86
6354,9.33
6355,9.83
6356,10.44
6357,11.05
6358,11.73
6359,12.38
6360,13.07
6361,13.74
6362,14.44
6363,15.13
6364,15.85
6365,16.52
6366,17.18
6367,17.74
6368,18.23
6369,18.54
6370,18.70
6371,18.71
6372,18.62
6373,18.45
6374,18.26
6375,18.06
6376,17.86
6377,17.66
6378,17.40
6379,17.06
6380,16.59
6381,16.03
6382,15.41
6383,14.82
6384,14.32
6385,13.99
6386,13.87
6387,13.99
6388,14.28
6389,14.68
6390,15.05
6391,15.33
6392,15.45
6393,15.42
6394,15.25
6395,15.01
6396,14.75
6397,14.54
6398,14.41
6399,14.36
6400,14.34
6401,14.34
6402,14.25
6403,14.06
6404,13.72
6405,13.25
6406,12.67
6407,12.03
6408,11.36
6409,10.75
6410,10.22
6411,9.84
6412,9.58
6413,9.45
6414,9.40
6415,9.44
6416,9.52
6417,9.64
6418,9.70
6419,9.73
6420,9.66
6421,9.54
6422,9.34
6423,9.11
6424,8.82
6425,8.51
6426,8.15
6427,7.74
6428,7.23
6429,6.64
6430,5.95
6431,5.25
6432,4.54
6433,3.89
6434,3.33
6435,2.92
6436,2.69
6437,2.62
6438,2.68
6439,2.81
6440,3.01
6441,3.26
6442,3.55
6443,3.88
6444,4.26
6445,4.70
6446,5.22
6447,5.77
6448,6.32
6449,6.83
6450,7.28
6451,7.62
6452,7.87
6453,8.01
6454,8.09
6455,8.12
6456,8.15
6457,8.18
6458,8.25
6459,8.32
6460,8.44
6461,8.58
6462,8.75
6463,8.91
6464,9.05
6465,9.18
6466,9.31
6467,9.45
6468,9.63
6469,9.84
6470,10.10
6471,10.40
6472,10.69
6473,10.90
6474,11.03
6475,11.05
6476,10.99
6477,10.88
6478,10.76
6479,10.67
6480,10.60
6481,10.52
6482,10.39
6483,10.17
6484,9.83
6485,9.38
6486,8.85
6487,8.32
6488,7.84
6489,7.50
6490,7.29
6491,7.26
6492,7.35
6493,7.53
6494,7.68
6495,7.77
6496,7.75
6497,7.65
6498,7.44
6499,7.19
6500,6.90
6501,6.64
6502,6.38
6503,6.14
6504,5.89
6505,5.66
6506,5.40
6507,5.13
6508,4.82
6509,4.50
6510,4.13
6511,3.74
6512,3.32
6513,2.90
6514,2.48
6515,2.10
6516,1.80
6517,1.62
6518,1.57
6519,1.64
6520,1.81
6521,2.03
6522,2.27
6523,2.50
6524,2.71
6525,2.88
6526,3.05
6527,3.25
6528,3.54
6529,3.89
6530,4.36
6531,4.89
6532,5.51
6533,6.14
6534,6.81
6535,7.44
6536,8.11
6537,8.77
6538,9.47
6539,10.11
6540,10.76
6541,11.36
6542,11.96
6543,12.51
6544,13.08
6545,13.62
6546,14.20
6547,14.76
6548,15.32
6549,15.84
6550,16.35
6551,16.80
6552,17.20
6553,17.50
6554,17.71
6555,17.79
6556,17.74
6557,17.54
6558,17.22
6559,16.79
6560,16.30
6561,15.81
6562,15.39
6563,15.09
6564,14.94
6565,14.92
6566,14.96
6567,15.04
6568,15.07
6569,15.02
6570,14.81
6571,14.50
6572,14.07
6573,13.64
6574,13.19
6575,12.79
6576,12.42
6577,12.15
6578,11.91
6579,11.70
6580,11.41
6581,11.06
6582,10.58
6583,10.02
6584,9.32
6585,8.61
6586,7.88
6587,7.26
6588,6.73
6589,6.34
6590,6.02
6591,5.81
6592,5.56
6593,5.26
6594,4.78
6595,4.20
6596,3.47
6597,2.71
6598,1.89
6599,1.12
6600,0.40
6601,-0.23
6602,-0.81
6603,-1.31
6604,-1.79
6605,-2.20
6606,-2.57
6607,-2.83
6608,-3.00
6609,-3.04
6610,-2.99
6611,-2.88
6612,-2.74
6613,-2.62
6614,-2.53
6615,-2.48
6616,-2.41
6617,-2.31
6618,-2.12
6619,-1.85
6620,-1.47
6621,-1.04
6622,-0.55
6623,-0.07
6624,0.41
6625,0.84
6626,1.21
6627,1.52
6628,1.76
6629,1.93
6630,2.07
6631,2.15
6632,2.20
6633,2.21
6634,2.23
6635,2.26
6636,2.34
6637,2.43
6638,2.55
6639,2.67
6640,2.80
6641,2.93
6642,3.10
6643,3.31
6644,3.60
6645,3.94
6646,4.35
6647,4.75
6648,5.16
6649,5.52
6650,5.85
6651,6.11
6652,6.35
6653,6.55
6654,6.78
6655,6.99
6656,7.21
6657,7.36
6658,7.44
6659,7.42
6660,7.37
6661,7.31
6662,7.34
6663,7.50
6664,7.90
6665,8.50
6666,9.28
6667,10.09
6668,10.87
6669,11.51
6670,11.97
6671,12.23
6672,12.40
6673,12.53
6674,12.73
6675,13.04
6676,13.47
6677,13.96
6678,14.42
6679,14.75
6680,14.85
6681,14.71
6682,14.30
6683,13.69
6684,12.92
6685,12.08
6686,11.22
6687,10.41
6688,9.64
6689,8.95
6690,8.31
6691,7.78
6692,7.32
6693,6.99
6694,6.74
6695,6.64
6696,6.62
6697,6.69
6698,6.73
6699,6.72
6700,6.58
6701,6.34
6702,5.97
6703,5.52
6704,5.03
6705,4.58
6706,4.20
6707,3.93
6708,3.74
6709,3.62
6710,3.51
6711,3.41
6712,3.27
6713,3.13
6714,2.97
6715,2.86
6716,2.82
6717,2.90
6718,3.10
6719,3.39
6720,3.75
6721,4.12
6722,4.48
6723,4.81
6724,5.09
6725,5.32
6726,5.50
6727,5.63
6728,5.75
6729,5.82
6730,5.87
6731,5.88
6732,5.87
6733,5.85
6734,5.86
6735,5.89
6736,5.98
6737,6.08
6738,6.20
6739,6.27
6740,6.32
6741,6.30
6742,6.25
6743,6.19
6744,6.20
6745,6.34
6746,6.66
6747,7.16
6748,7.82
6749,8.57
6750,9.34
6751,10.01
6752,10.55
6753,10.91
6754,11.12
6755,11.21
6756,11.24
6757,11.25
6758,11.26
6759,11.29
6760,11.30
6761,11.29
6762,11.24
6763,11.13
6764,10.92
6765,10.64
6766,10.26
6767,9.84
6768,9.35
6769,8.85
6770,8.28
6771,7.71
6772,7.09
6773,6.50
6774,5.93
6775,5.47
6776,5.10
6777,4.85
6778,4.64
6779,4.49
6780,4.29
6781,4.06
6782,3.68
6783,3.22
6784,2.63
6785,2.01
6786,1.37
6787,0.81
6788,0.32
6789,-0.05
6790,-0.38
6791,-0.62
6792,-0.85
6793,-1.05
6794,-1.27
6795,-1.49
6796,-1.75
6797,-1.99
6798,-2.22
6799,-2.43
6800,-2.62
6801,-2.76
6802,-2.83
6803,-2.80
6804,-2.68
6805,-2.48
6806,-2.24
6807,-2.00
6808,-1.81
6809,-1.73
6810,-1.76
6811,-1.90
6812,-2.05
6813,-2.16
6814,-2.13
6815,-1.93
6816,-1.54
6817,-1.01
6818,-0.38
6819,0.24
6820,0.83
6821,1.27
6822,1.63
6823,1.88
6824,2.16
6825,2.47
6826,2.94
6827,3.52
6828,4.28
6829,5.08
6830,5.93
6831,6.69
6832,7.36
6833,7.89
6834,8.35
6835,8.76
6836,9.24
6837,9.77
6838,10.45
6839,11.17
6840,11.98
6841,12.73
6842,13.43
6843,13.98
6844,14.41
6845,14.69
6846,14.90
6847,15.05
6848,15.20
6849,15.36
6850,15.52
6851,15.62
6852,15.62
6853,15.49
6854,15.19
6855,14.75
6856,14.15
6857,13.49
6858,12.83
6859,12.28
6860,11.83
6861,11.54
6862,11.37
6863,11.32
6864,11.29
6865,11.25
6866,11.13
6867,10.92
6868,10.58
6869,10.17
6870,9.74
6871,9.35
6872,9.03
6873,8.84
6874,8.76
6875,8.83
6876,8.99
6877,9.20
6878,9.34
6879,9.42
6880,9.37
6881,9.23
6882,8.97
6883,8.65
6884,8.30
6885,7.98
6886,7.70
6887,7.42
6888,7.07
6889,6.63
6890,6.08
6891,5.48
6892,4.86
6893,4.32
6894,3.92
6895,3.77
6896,3.86
6897,4.17
6898,4.57
6899,4.98
6900,5.27
6901,5.41
6902,5.34
6903,5.13
6904,4.79
6905,4.43
6906,4.03
6907,3.63
6908,3.19
6909,2.69
6910,2.08
6911,1.39
6912,0.63
6913,-0.08
6914,-0.68
6915,-1.07
6916,-1.24
6917,-1.17
6918,-0.96
6919,-0.69
6920,-0.47
6921,-0.38
6922,-0.42
6923,-0.56
6924,-0.72
6925,-0.80
6926,-0.72
6927,-0.46
6928,0.01
6929,0.61
6930,1.30
6931,1.92
6932,2.42
6933,2.73
6934,2.91
6935,2.97
6936,3.00
6937,3.03
6938,3.15
6939,3.38
6940,3.74
6941,4.17
6942,4.68
6943,5.16
6944,5.61
6945,5.97
6946,6.27
6947,6.52
6948,6.77
6949,7.01
6950,7.30
6951,7.63
6952,8.02
6953,8.43
6954,8.83
6955,9.16
6956,9.39
6957,9.49
6958,9.45
6959,9.26
6960,8.93
6961,8.50
6962,8.00
6963,7.50
6964,6.99
6965,6.54
6966,6.13
6967,5.80
6968,5.56
6969,5.40
6970,5.29
6971,5.22
6972,5.12
6973,5.02
6974,4.87
6975,4.71
6976,4.53
6977,4.40
6978,4.31
6979,4.30
6980,4.36
6981,4.47
6982,4.57
6983,4.60
6984,4.49
6985,4.23
6986,3.80
6987,3.27
6988,2.66
6989,2.02
6990,1.40
6991,0.86
6992,0.37
6993,-0.05
6994,-0.43
6995,-0.75
6996,-1.05
6997,-1.29
6998,-1.45
6999,-1.51
7000,-1.47
7001,-1.34
7002,-1.13
7003,-0.89
7004,-0.61
7005,-0.34
7006,-0.04
7007,0.24
7008,0.58
7009,0.96
7010,1.46
7011,2.05
7012,2.76
7013,3.49
7014,4.23
7015,4.90
7016,5.52
7017,6.01
7018,6.41
7019,6.70
7020,6.99
7021,7.27
7022,7.67
7023,8.16
7024,8.83
7025,9.57
7026,10.39
7027,11.14
7028,11.81
7029,12.30
7030,12.60
7031,12.67
7032,12.59
7033,12.38
7034,12.15
7035,11.93
7036,11.79
7037,11.69
7038,11.64
7039,11.60
7040,11.54
7041,11.46
7042,11.33
7043,11.18
7044,11.02
7045,10.89
7046,10.76
7047,10.64
7048,10.51
7049,10.39
7050,10.23
7051,10.00
7052,9.66
7053,9.28
7054,8.85
7055,8.43
7056,8.00
7057,7.62
7058,7.27
7059,6.97
7060,6.67
7061,6.38
7062,6.02
7063,5.63
7064,5.14
7065,4.62
7066,4.07
7067,3.61
7068,3.20
7069,2.92
7070,2.74
7071,2.69
7072,2.64
7073,2.55
7074,2.28
7075,1.84
7076,1.18
7077,0.39
7078,-0.54
7079,-1.46
7080,-2.36
7081,-3.09
7082,-3.67
7083,-4.07
7084,-4.37
7085,-4.58
7086,-4.81
7087,-5.07
7088,-5.40
7089,-5.78
7090,-6.20
7091,-6.60
7092,-6.92
7093,-7.10
7094,-7.09
7095,-6.88
7096,-6.51
7097,-6.02
7098,-5.46
7099,-4.90
7100,-4.36
7101,-3.90
7102,-3.51
7103,-3.22
7104,-2.97
7105,-2.75
7106,-2.53
7107,-2.35
7108,-2.17
7109,-2.05
7110,-1.97
7111,-1.96
7112,-1.97
7113,-2.01
7114,-2.01
7115,-2.00
7116,-1.93
7117,-1.84
7118,-1.70
7119,-1.53
7120,-1.33
7121,-1.11
7122,-0.84
7123,-0.54
7124,-0.17
7125,0.23
7126,0.68
7127,1.14
7128,1.62
7129,2.05
7130,2.45
7131,2.74
7132,2.98
7133,3.18
7134,3.42
7135,3.72
7136,4.10
7137,4.53
7138,5.00
7139,5.47
7140,5.94
7141,6.31
7142,6.60
7143,6.78
7144,6.94
7145,7.06
7146,7.22
7147,7.39
7148,7.61
7149,7.83
7150,8.07
7151,8.28
7152,8.51
7153,8.75
7154,9.04
7155,9.40
7156,9.82
7157,10.25
7158,10.60
7159,10.82
7160,10.86
7161,10.71
7162,10.33
7163,9.77
7164,9.06
7165,8.32
7166,7.57
7167,6.86
7168,6.14
7169,5.44
7170,4.72
7171,4.07
7172,3.46
7173,2.95
7174,2.53
7175,2.24
7176,2.04
7177,1.97
7178,1.95
7179,1.98
7180,2.01
7181,2.06
7182,2.11
7183,2.18
7184,2.25
7185,2.31
7186,2.32
7187,2.25
7188,2.08
7189,1.79
7190,1.41
7191,0.99
7192,0.59
7193,-0.04
7194,-0.06
7195,0.61
7196,1.20
7197,0.09
7198,-0.99
7199,2.22
7200,6.80
