1,16.59
2,23.78
3,22.82
4,17.77
5,15.03
6,16.72
7,19.88
8,21.31
9,20.23
10,18.21
11,16.90
12,16.98
13,17.72
14,18.52
15,19.20
16,19.94
17,20.51
18,20.20
19,18.65
20,16.43
21,14.86
22,14.96
23,16.70
24,18.79
25,19.70
26,18.81
27,16.99
28,15.67
29,15.59
30,16.09
31,16.10
32,15.27
33,14.38
34,14.00
35,13.76
36,12.90
37,11.63
38,11.05
39,11.93
40,13.28
41,13.57
42,12.41
43,11.27
44,11.24
45,11.72
46,11.04
47,9.00
48,6.97
49,6.22
50,6.19
51,5.63
52,3.94
53,1.85
54,0.20
55,-0.45
56,-0.17
57,0.92
58,2.03
59,2.20
60,0.55
61,-2.39
62,-4.93
63,-5.46
64,-4.36
65,-3.58
66,-4.86
67,-7.69
68,-10.06
69,-10.33
70,-8.69
71,-6.42
72,-4.59
73,-3.54
74,-3.37
75,-4.19
76,-5.94
77,-8.06
78,-9.56
79,-9.56
80,-7.95
81,-5.47
82,-3.24
83,-2.01
84,-1.36
85,-0.30
86,1.56
87,3.06
88,2.69
89,0.24
90,-2.68
91,-4.24
92,-3.74
93,-1.88
94,0.25
95,1.72
96,2.22
97,2.02
98,1.79
99,1.89
100,1.96
101,1.26
102,-0.36
103,-1.90
104,-2.07
105,-0.69
106,1.00
107,1.57
108,0.74
109,-0.56
110,-1.52
111,-2.09
112,-2.30
113,-1.66
114,0.12
115,2.06
116,2.43
117,0.66
118,-1.93
119,-3.48
120,-3.40
121,-2.37
122,-1.07
123,0.52
124,2.21
125,3.11
126,2.46
127,0.94
128,0.03
129,0.40
130,1.06
131,0.77
132,-0.54
133,-2.04
134,-3.36
135,-4.94
136,-7.19
137,-9.44
138,-10.34
139,-8.97
140,-5.96
141,-2.96
142,-1.45
143,-1.63
144,-2.60
145,-3.14
146,-2.90
147,-2.51
148,-2.88
149,-4.07
150,-5.10
151,-4.95
152,-3.78
153,-2.97
154,-3.68
155,-5.50
156,-6.87
157,-6.67
158,-5.31
159,-4.11
160,-3.95
161,-4.59
162,-5.61
163,-6.81
164,-8.12
165,-8.94
166,-8.61
167,-7.26
168,-6.14
169,-6.41
170,-8.08
171,-10.10
172,-11.37
173,-11.64
174,-11.40
175,-11.23
176,-11.24
177,-11.16
178,-10.91
179,-10.79
180,-10.77
181,-10.15
182,-8.24
183,-5.50
184,-3.60
185,-3.91
186,-5.91
187,-7.46
188,-6.72
189,-3.97
190,-1.30
191,-0.74
192,-2.31
193,-4.29
194,-5.29
195,-5.70
196,-6.70
197,-8.44
198,-9.44
199,-8.34
200,-5.85
201,-4.38
202,-5.59
203,-8.54
204,-10.64
205,-10.09
206,-7.64
207,-5.47
208,-4.95
209,-5.51
210,-5.82
211,-5.44
212,-5.29
213,-6.41
214,-8.58
215,-10.34
216,-10.36
217,-8.77
218,-6.82
219,-5.81
220,-5.96
221,-6.70
222,-7.19
223,-7.08
224,-6.39
225,-5.50
226,-4.49
227,-3.38
228,-2.07
229,-0.83
230,0.03
231,0.50
232,1.09
233,2.38
234,4.52
235,6.87
236,8.56
237,8.80
238,7.54
239,5.27
240,2.65
241,0.11
242,-1.83
243,-2.58
244,-1.93
245,-0.63
246,0.23
247,0.20
248,-0.34
249,-1.05
250,-2.15
251,-3.58
252,-4.16
253,-2.22
254,2.10
255,6.21
256,7.21
257,4.80
258,1.75
259,0.81
260,2.27
261,4.07
262,4.33
263,2.86
264,0.81
265,-0.66
266,-0.92
267,0.21
268,2.66
269,5.78
270,8.11
271,8.30
272,6.18
273,3.14
274,0.86
275,-0.03
276,-0.11
277,-0.08
278,-0.16
279,-0.23
280,-0.32
281,-0.53
282,-0.69
283,-0.48
284,0.21
285,1.14
286,1.63
287,1.10
288,-0.34
289,-1.71
290,-1.72
291,-0.05
292,2.09
293,2.86
294,1.86
295,0.77
296,1.47
297,3.62
298,4.83
299,3.33
300,0.38
301,-1.02
302,0.70
303,3.70
304,4.80
305,2.62
306,-0.77
307,-2.07
308,0.37
309,5.10
310,9.21
311,10.52
312,9.24
313,7.36
314,7.00
315,8.65
316,11.19
317,12.95
318,13.08
319,11.92
320,10.68
321,10.29
322,10.72
323,10.97
324,10.21
325,8.73
326,7.40
327,6.65
328,6.16
329,5.62
330,5.11
331,4.67
332,3.91
333,2.60
334,1.30
335,1.11
336,2.47
337,4.66
338,6.43
339,7.26
340,7.86
341,9.07
342,10.57
343,10.82
344,9.21
345,7.08
346,6.81
347,9.04
348,12.14
349,13.76
350,13.58
351,13.13
352,14.04
353,16.13
354,17.74
355,17.42
356,15.57
357,14.04
358,14.24
359,15.75
360,16.83
361,16.12
362,14.00
363,12.18
364,12.09
365,13.53
366,14.86
367,14.38
368,12.25
369,10.44
370,10.60
371,12.30
372,13.63
373,13.73
374,13.92
375,16.04
376,20.13
377,23.98
378,25.16
379,23.08
380,19.37
381,16.34
382,15.16
383,15.32
384,15.72
385,15.70
386,15.38
387,15.12
388,15.26
389,16.03
390,17.27
391,18.43
392,18.82
393,18.50
394,18.01
395,17.73
396,17.41
397,16.79
398,16.23
399,16.42
400,17.19
401,17.36
402,15.81
403,12.90
404,10.38
405,9.84
406,10.96
407,11.93
408,11.15
409,8.84
410,6.66
411,6.18
412,7.46
413,9.46
414,11.16
415,12.39
416,13.09
417,12.77
418,11.21
419,9.35
420,8.90
421,10.52
422,12.84
423,13.81
424,12.85
425,11.35
426,10.98
427,11.96
428,13.16
429,13.62
430,13.29
431,12.53
432,11.40
433,9.93
434,8.61
435,8.08
436,8.37
437,8.80
438,8.77
439,8.53
440,8.74
441,9.55
442,10.38
443,10.71
444,10.80
445,11.25
446,11.90
447,11.86
448,10.70
449,9.31
450,9.15
451,10.68
452,12.83
453,14.11
454,13.69
455,11.66
456,8.75
457,6.11
458,4.88
459,5.61
460,7.48
461,9.03
462,9.03
463,7.74
464,6.48
465,6.58
466,7.98
467,9.36
468,9.09
469,6.71
470,3.07
471,-0.29
472,-2.24
473,-2.47
474,-1.51
475,-0.14
476,0.92
477,1.59
478,2.04
479,2.48
480,2.71
481,2.63
482,2.35
483,2.26
484,2.08
485,1.01
486,-1.26
487,-3.62
488,-4.43
489,-3.30
490,-1.74
491,-1.37
492,-2.31
493,-3.22
494,-3.43
495,-3.62
496,-4.53
497,-5.40
498,-5.10
499,-4.02
500,-4.32
501,-7.11
502,-10.63
503,-11.62
504,-8.94
505,-4.83
506,-2.63
507,-3.53
508,-5.91
509,-7.62
510,-8.12
511,-8.29
512,-8.55
513,-8.30
514,-7.08
515,-5.67
516,-5.03
517,-5.03
518,-4.51
519,-3.18
520,-2.44
521,-3.58
522,-5.78
523,-6.46
524,-4.24
525,-0.71
526,0.84
527,-1.13
528,-5.02
529,-7.81
530,-8.09
531,-6.85
532,-6.02
533,-6.50
534,-8.02
535,-9.87
536,-11.76
537,-13.38
538,-14.28
539,-14.01
540,-13.02
541,-12.25
542,-12.34
543,-12.73
544,-12.58
545,-11.77
546,-11.47
547,-12.73
548,-15.15
549,-16.98
550,-17.04
551,-16.02
552,-15.60
553,-16.45
554,-17.48
555,-17.21
556,-15.41
557,-13.23
558,-11.81
559,-11.43
560,-11.56
561,-11.67
562,-11.61
563,-11.54
564,-11.41
565,-11.04
566,-10.24
567,-9.16
568,-8.02
569,-7.16
570,-6.52
571,-5.96
572,-5.46
573,-5.47
574,-6.33
575,-7.69
576,-8.37
577,-7.57
578,-5.89
579,-5.17
580,-6.35
581,-8.35
582,-9.00
583,-7.51
584,-5.16
585,-3.81
586,-3.97
587,-4.71
588,-5.06
589,-4.99
590,-4.83
591,-4.60
592,-4.30
593,-4.38
594,-5.27
595,-6.44
596,-6.58
597,-5.24
598,-3.69
599,-3.61
600,-5.14
601,-6.58
602,-6.66
603,-5.99
604,-6.04
605,-6.95
606,-7.46
607,-6.85
608,-6.18
609,-6.93
610,-8.89
611,-10.30
612,-9.70
613,-7.37
614,-4.99
615,-3.99
616,-4.57
617,-5.79
618,-6.45
619,-5.84
620,-4.10
621,-2.20
622,-1.58
623,-2.95
624,-5.51
625,-7.39
626,-7.40
627,-6.22
628,-5.67
629,-6.74
630,-8.94
631,-11.04
632,-12.31
633,-12.62
634,-12.25
635,-11.59
636,-11.23
637,-11.46
638,-11.98
639,-12.15
640,-11.81
641,-11.55
642,-12.10
643,-13.26
644,-13.89
645,-12.98
646,-10.68
647,-8.35
648,-7.24
649,-7.72
650,-9.23
651,-11.13
652,-12.65
653,-12.97
654,-11.35
655,-8.17
656,-4.99
657,-3.53
658,-3.79
659,-4.14
660,-2.92
661,-0.50
662,1.35
663,1.35
664,0.08
665,-1.00
666,-1.11
667,-0.84
668,-0.90
669,-1.31
670,-1.27
671,-0.24
672,1.52
673,2.89
674,2.78
675,0.78
676,-2.10
677,-3.91
678,-3.23
679,-0.64
680,2.10
681,3.54
682,3.81
683,3.55
684,3.19
685,2.69
686,2.49
687,3.26
688,5.09
689,7.01
690,8.01
691,8.29
692,9.12
693,11.21
694,13.60
695,14.52
696,13.40
697,11.35
698,9.89
699,9.09
700,7.70
701,4.65
702,0.58
703,-2.59
704,-3.08
705,-0.57
706,3.33
707,6.17
708,6.49
709,5.16
710,4.28
711,5.16
712,6.89
713,7.69
714,6.71
715,4.95
716,3.90
717,4.10
718,4.90
719,5.29
720,4.76
721,3.26
722,1.23
723,-0.36
724,-0.52
725,0.86
726,2.41
727,2.44
728,0.70
729,-0.99
730,-0.70
731,1.46
732,3.22
733,2.69
734,0.42
735,-1.08
736,-0.31
737,1.56
738,2.24
739,0.93
740,-0.88
741,-1.38
742,-0.71
743,-0.59
744,-1.84
745,-3.13
746,-2.69
747,-0.54
748,1.40
749,1.53
750,0.33
751,-0.65
752,-0.80
753,-0.97
754,-2.05
755,-3.68
756,-4.76
757,-4.87
758,-4.38
759,-3.72
760,-2.50
761,-0.46
762,1.44
763,1.59
764,-0.13
765,-1.54
766,-0.21
767,3.72
768,7.35
769,7.98
770,5.88
771,3.68
772,3.29
773,3.93
774,3.67
775,1.83
776,-0.16
777,-0.71
778,-0.03
779,0.19
780,-1.04
781,-2.64
782,-2.79
783,-0.75
784,2.22
785,4.40
786,5.05
787,4.87
788,4.55
789,4.13
790,3.01
791,1.07
792,-1.00
793,-2.05
794,-1.85
795,-1.30
796,-1.84
797,-3.81
798,-6.16
799,-7.24
800,-6.68
801,-5.64
802,-5.92
803,-7.93
804,-10.60
805,-12.32
806,-12.70
807,-12.37
808,-11.86
809,-10.68
810,-8.89
811,-7.83
812,-9.15
813,-12.44
814,-15.19
815,-15.29
816,-13.42
817,-12.03
818,-12.65
819,-14.31
820,-14.98
821,-13.95
822,-12.45
823,-11.99
824,-12.47
825,-12.40
826,-11.41
827,-11.10
828,-13.14
829,-16.61
830,-18.38
831,-16.46
832,-12.40
833,-9.83
834,-10.76
835,-13.82
836,-16.26
837,-16.74
838,-16.24
839,-16.00
840,-15.80
841,-14.32
842,-11.43
843,-8.96
844,-8.99
845,-11.60
846,-14.94
847,-17.14
848,-18.16
849,-18.99
850,-20.10
851,-20.77
852,-20.30
853,-19.15
854,-18.81
855,-20.27
856,-23.13
857,-25.63
858,-26.15
859,-24.26
860,-21.25
861,-19.15
862,-19.38
863,-21.56
864,-23.85
865,-24.46
866,-23.09
867,-20.96
868,-19.50
869,-19.13
870,-19.26
871,-19.32
872,-19.11
873,-18.84
874,-18.82
875,-19.53
876,-21.18
877,-23.13
878,-24.01
879,-22.81
880,-19.94
881,-17.22
882,-16.44
883,-18.01
884,-20.44
885,-21.63
886,-21.09
887,-20.38
888,-21.20
889,-23.12
890,-23.63
891,-21.12
892,-16.62
893,-13.28
894,-13.47
895,-17.10
896,-21.72
897,-24.40
898,-23.60
899,-20.01
900,-15.50
901,-11.84
902,-9.65
903,-8.92
904,-9.32
905,-10.62
906,-12.22
907,-13.24
908,-12.89
909,-11.23
910,-9.26
911,-8.37
912,-8.76
913,-9.33
914,-8.68
915,-6.92
916,-5.47
917,-5.66
918,-7.29
919,-9.04
920,-9.81
921,-9.60
922,-9.15
923,-9.13
924,-9.39
925,-9.11
926,-7.99
927,-6.74
928,-6.44
929,-7.21
930,-7.97
931,-7.56
932,-6.34
933,-5.88
934,-7.39
935,-10.38
936,-13.19
937,-14.59
938,-14.44
939,-13.22
940,-11.58
941,-10.29
942,-10.31
943,-11.85
944,-13.67
945,-13.99
946,-12.28
947,-10.08
948,-9.38
949,-10.50
950,-12.01
951,-12.64
952,-12.28
953,-11.42
954,-9.87
955,-7.40
956,-4.73
957,-3.57
958,-4.50
959,-6.30
960,-7.35
961,-7.86
962,-8.92
963,-10.19
964,-9.34
965,-5.12
966,0.46
967,3.46
968,2.32
969,-0.64
970,-1.92
971,-0.71
972,0.75
973,0.25
974,-1.63
975,-2.61
976,-1.59
977,-0.06
978,-0.38
979,-3.38
980,-7.45
981,-9.87
982,-9.20
983,-6.17
984,-2.95
985,-1.33
986,-1.65
987,-2.82
988,-3.54
989,-3.19
990,-2.20
991,-1.40
992,-1.64
993,-3.10
994,-4.97
995,-5.84
996,-4.85
997,-2.86
998,-1.69
999,-2.36
1000,-4.23
1001,-5.71
1002,-5.85
1003,-4.91
1004,-4.00
1005,-4.06
1006,-5.07
1007,-5.97
1008,-5.81
1009,-4.83
1010,-4.22
1011,-4.89
1012,-6.48
1013,-7.67
1014,-7.59
1015,-6.52
1016,-5.52
1017,-5.28
1018,-5.36
1019,-4.84
1020,-3.67
1021,-3.12
1022,-4.04
1023,-5.55
1024,-5.88
1025,-4.62
1026,-3.15
1027,-2.93
1028,-3.60
1029,-3.75
1030,-2.73
1031,-1.47
1032,-1.17
1033,-1.86
1034,-2.36
1035,-1.65
1036,-0.11
1037,0.82
1038,0.14
1039,-1.77
1040,-3.50
1041,-4.03
1042,-3.80
1043,-4.30
1044,-6.39
1045,-9.05
1046,-10.15
1047,-8.42
1048,-5.05
1049,-2.71
1050,-3.01
1051,-4.77
1052,-5.55
1053,-4.34
1054,-2.53
1055,-2.26
1056,-3.89
1057,-5.84
1058,-6.54
1059,-6.10
1060,-5.68
1061,-5.79
1062,-5.47
1063,-3.65
1064,-0.87
1065,0.87
1066,0.35
1067,-1.45
1068,-2.53
1069,-2.26
1070,-1.94
1071,-3.02
1072,-5.01
1073,-6.16
1074,-5.44
1075,-3.91
1076,-3.35
1077,-4.39
1078,-5.71
1079,-5.54
1080,-3.60
1081,-1.41
1082,-0.62
1083,-1.46
1084,-2.66
1085,-3.02
1086,-2.49
1087,-2.01
1088,-2.25
1089,-2.98
1090,-3.14
1091,-1.94
1092,0.56
1093,3.22
1094,4.82
1095,4.77
1096,3.56
1097,1.98
1098,0.64
1099,-0.38
1100,-0.88
1101,-0.49
1102,1.03
1103,3.10
1104,4.72
1105,5.18
1106,4.92
1107,4.93
1108,5.75
1109,6.94
1110,7.76
1111,7.88
1112,7.72
1113,7.65
1114,7.77
1115,7.85
1116,7.99
1117,8.31
1118,8.78
1119,8.91
1120,8.57
1121,8.14
1122,8.40
1123,9.48
1124,10.82
1125,11.74
1126,12.12
1127,12.41
1128,13.29
1129,15.06
1130,17.16
1131,18.32
1132,17.67
1133,15.71
1134,13.53
1135,11.73
1136,10.30
1137,9.52
1138,9.98
1139,11.49
1140,12.52
1141,11.57
1142,8.72
1143,5.76
1144,4.35
1145,4.77
1146,6.04
1147,7.34
1148,8.45
1149,9.27
1150,8.97
1151,6.71
1152,3.27
1153,1.26
1154,2.64
1155,6.52
1156,9.48
1157,8.95
1158,5.82
1159,3.38
1160,4.04
1161,6.99
1162,9.29
1163,8.90
1164,6.52
1165,4.71
1166,5.02
1167,6.59
1168,7.63
1169,7.68
1170,7.91
1171,9.27
1172,10.86
1173,10.76
1174,8.22
1175,4.63
1176,2.47
1177,3.14
1178,5.75
1179,8.00
1180,8.58
1181,8.18
1182,8.42
1183,9.75
1184,11.05
1185,11.10
1186,10.08
1187,9.34
1188,9.81
1189,11.12
1190,12.14
1191,12.32
1192,12.06
1193,11.89
1194,11.80
1195,10.88
1196,9.01
1197,7.39
1198,7.69
1199,9.98
1200,10.19
