1,42.58
2,61.39
3,62.56
4,56.30
5,54.13
6,56.76
7,58.25
8,57.41
9,56.46
10,56.76
11,57.06
12,57.12
13,56.90
14,56.90
15,56.91
16,56.92
17,56.94
18,56.95
19,56.96
20,56.98
21,56.99
22,57.01
23,57.02
24,57.03
25,57.04
26,57.05
27,57.05
28,57.05
29,57.05
30,57.06
31,57.06
32,57.06
33,57.07
34,57.07
35,57.07
36,57.06
37,57.05
38,57.03
39,57.02
40,57.00
41,56.98
42,56.96
43,56.94
44,56.92
45,56.89
46,56.87
47,56.85
48,56.83
49,56.81
50,56.80
51,56.78
52,56.77
53,56.75
54,56.74
55,56.74
56,56.74
57,56.74
58,56.74
59,56.74
60,56.75
61,56.76
62,56.78
63,56.80
64,56.81
65,56.82
66,56.84
67,56.85
68,56.87
69,56.88
70,56.88
71,56.88
72,56.88
73,56.88
74,56.88
75,56.88
76,56.87
77,56.87
78,56.87
79,56.86
80,56.86
81,56.86
82,56.86
83,56.86
84,56.86
85,56.87
86,56.87
87,56.88
88,56.89
89,56.90
90,56.91
91,56.92
92,56.94
93,56.95
94,56.96
95,56.97
96,56.99
97,57.00
98,57.01
99,57.02
100,57.03
101,57.05
102,57.06
103,57.07
104,57.08
105,57.08
106,57.10
107,57.10
108,57.11
109,57.11
110,57.11
111,57.12
112,57.13
113,57.13
114,57.13
115,57.13
116,57.14
117,57.14
118,57.14
119,57.15
120,57.16
121,57.16
122,57.16
123,57.17
124,57.17
125,57.17
126,57.17
127,57.17
128,57.17
129,57.18
130,57.18
131,57.18
132,57.17
133,57.17
134,57.17
135,57.17
136,57.17
137,57.17
138,57.17
139,57.18
140,57.19
141,57.20
142,57.21
143,57.23
144,57.24
145,57.25
146,57.26
147,57.28
148,57.29
149,57.30
150,57.32
151,57.33
152,57.35
153,57.36
154,57.38
155,57.39
156,57.41
157,57.42
158,57.44
159,57.47
160,57.49
161,57.50
162,57.51
163,57.52
164,57.52
165,57.52
166,57.50
167,57.49
168,57.48
169,57.46
170,57.44
171,57.42
172,57.39
173,57.37
174,57.35
175,57.34
176,57.33
177,57.32
178,57.32
179,57.31
180,57.32
181,57.33
182,57.34
183,57.34
184,57.35
185,57.35
186,57.35
187,57.35
188,57.35
189,57.34
190,57.34
191,57.33
192,57.31
193,57.30
194,57.29
195,57.28
196,57.27
197,57.26
198,57.25
199,57.24
200,57.24
201,57.24
202,57.24
203,57.24
204,57.24
205,57.24
206,57.25
207,57.26
208,57.26
209,57.26
210,57.27
211,57.28
212,57.28
213,57.29
214,57.29
215,57.29
216,57.29
217,57.28
218,57.28
219,57.27
220,57.26
221,57.26
222,57.25
223,57.24
224,57.24
225,57.25
226,57.26
227,57.26
228,57.27
229,57.28
230,57.30
231,57.32
232,57.32
233,57.33
234,57.34
235,57.34
236,57.34
237,57.33
238,57.33
239,57.33
240,57.33
241,57.33
242,57.34
243,57.35
244,57.36
245,57.37
246,57.39
247,57.41
248,57.43
249,57.45
250,57.46
251,57.47
252,57.48
253,57.49
254,57.49
255,57.48
256,57.47
257,57.47
258,57.46
259,57.46
260,57.45
261,57.44
262,57.44
263,57.44
264,57.45
265,57.45
266,57.46
267,57.46
268,57.46
269,57.47
270,57.48
271,57.48
272,57.48
273,57.47
274,57.46
275,57.46
276,57.45
277,57.44
278,57.42
279,57.41
280,57.39
281,57.38
282,57.36
283,57.34
284,57.32
285,57.30
286,57.28
287,57.27
288,57.25
289,57.24
290,57.24
291,57.22
292,57.21
293,57.21
294,57.21
295,57.20
296,57.19
297,57.18
298,57.17
299,57.17
300,57.17
301,57.18
302,57.19
303,57.21
304,57.23
305,57.26
306,57.28
307,57.31
308,57.33
309,57.36
310,57.39
311,57.41
312,57.43
313,57.45
314,57.46
315,57.47
316,57.47
317,57.47
318,57.47
319,57.47
320,57.47
321,57.47
322,57.46
323,57.46
324,57.46
325,57.45
326,57.44
327,57.44
328,57.44
329,57.43
330,57.43
331,57.42
332,57.42
333,57.42
334,57.43
335,57.43
336,57.44
337,57.45
338,57.47
339,57.49
340,57.51
341,57.53
342,57.55
343,57.56
344,57.58
345,57.60
346,57.61
347,57.63
348,57.65
349,57.66
350,57.68
351,57.69
352,57.69
353,57.70
354,57.71
355,57.71
356,57.72
357,57.72
358,57.72
359,57.72
360,57.72
361,57.72
362,57.72
363,57.72
364,57.71
365,57.71
366,57.72
367,57.73
368,57.73
369,57.74
370,57.75
371,57.76
372,57.78
373,57.79
374,57.79
375,57.81
376,57.81
377,57.82
378,57.81
379,57.80
380,57.79
381,57.78
382,57.76
383,57.75
384,57.73
385,57.71
386,57.68
387,57.66
388,57.64
389,57.61
390,57.60
391,57.58
392,57.56
393,57.55
394,57.53
395,57.51
396,57.50
397,57.49
398,57.48
399,57.47
400,57.47
401,57.46
402,57.46
403,57.45
404,57.45
405,57.45
406,57.45
407,57.45
408,57.45
409,57.45
410,57.45
411,57.45
412,57.45
413,57.45
414,57.46
415,57.46
416,57.46
417,57.45
418,57.45
419,57.46
420,57.46
421,57.46
422,57.47
423,57.49
424,57.51
425,57.53
426,57.55
427,57.57
428,57.60
429,57.64
430,57.68
431,57.72
432,57.75
433,57.80
434,57.85
435,57.89
436,57.93
437,57.96
438,57.99
439,58.00
440,58.01
441,58.02
442,58.02
443,58.02
444,58.01
445,58.00
446,58.00
447,57.98
448,57.97
449,57.97
450,57.97
451,57.98
452,58.00
453,58.02
454,58.05
455,58.08
456,58.12
457,58.16
458,58.20
459,58.24
460,58.28
461,58.31
462,58.34
463,58.36
464,58.38
465,58.39
466,58.39
467,58.39
468,58.38
469,58.36
470,58.34
471,58.32
472,58.29
473,58.26
474,58.23
475,58.20
476,58.18
477,58.16
478,58.15
479,58.13
480,58.13
481,58.14
482,58.15
483,58.17
484,58.20
485,58.22
486,58.25
487,58.28
488,58.31
489,58.34
490,58.36
491,58.38
492,58.39
493,58.40
494,58.41
495,58.41
496,58.41
497,58.40
498,58.40
499,58.39
500,58.38
501,58.37
502,58.36
503,58.36
504,58.36
505,58.36
506,58.37
507,58.39
508,58.41
509,58.44
510,58.47
511,58.51
512,58.56
513,58.60
514,58.64
515,58.68
516,58.72
517,58.76
518,58.78
519,58.80
520,58.80
521,58.80
522,58.80
523,58.78
524,58.76
525,58.73
526,58.71
527,58.69
528,58.66
529,58.64
530,58.62
531,58.60
532,58.59
533,58.58
534,58.57
535,58.57
536,58.56
537,58.55
538,58.54
539,58.53
540,58.52
541,58.51
542,58.50
543,58.49
544,58.48
545,58.48
546,58.48
547,58.48
548,58.50
549,58.51
550,58.53
551,58.56
552,58.59
553,58.62
554,58.65
555,58.67
556,58.69
557,58.71
558,58.72
559,58.72
560,58.71
561,58.70
562,58.69
563,58.66
564,58.63
565,58.61
566,58.58
567,58.55
568,58.52
569,58.50
570,58.47
571,58.46
572,58.45
573,58.45
574,58.45
575,58.47
576,58.47
577,58.49
578,58.51
579,58.52
580,58.54
581,58.56
582,58.57
583,58.58
584,58.58
585,58.59
586,58.59
587,58.58
588,58.58
589,58.58
590,58.57
591,58.57
592,58.56
593,58.56
594,58.55
595,58.55
596,58.55
597,58.55
598,58.55
599,58.56
600,58.58
601,58.59
602,58.61
603,58.62
604,58.65
605,58.67
606,58.70
607,58.73
608,58.76
609,58.78
610,58.80
611,58.83
612,58.86
613,58.88
614,58.91
615,58.93
616,58.94
617,58.96
618,58.97
619,58.98
620,58.98
621,58.99
622,58.99
623,58.98
624,58.98
625,58.98
626,58.97
627,58.96
628,58.95
629,58.95
630,58.94
631,58.94
632,58.94
633,58.95
634,58.96
635,58.97
636,58.98
637,59.00
638,59.01
639,59.03
640,59.05
641,59.06
642,59.08
643,59.09
644,59.10
645,59.10
646,59.09
647,59.08
648,59.07
649,59.05
650,59.04
651,59.01
652,59.00
653,58.98
654,58.97
655,58.96
656,58.96
657,58.96
658,58.97
659,58.98
660,59.00
661,59.02
662,59.04
663,59.05
664,59.06
665,59.07
666,59.08
667,59.08
668,59.08
669,59.07
670,59.07
671,59.07
672,59.07
673,59.07
674,59.08
675,59.09
676,59.11
677,59.12
678,59.15
679,59.16
680,59.19
681,59.21
682,59.23
683,59.25
684,59.27
685,59.28
686,59.30
687,59.31
688,59.31
689,59.31
690,59.32
691,59.33
692,59.34
693,59.34
694,59.35
695,59.36
696,59.37
697,59.38
698,59.39
699,59.39
700,59.39
701,59.39
702,59.39
703,59.39
704,59.38
705,59.37
706,59.36
707,59.36
708,59.35
709,59.35
710,59.34
711,59.34
712,59.34
713,59.34
714,59.34
715,59.33
716,59.33
717,59.33
718,59.32
719,59.31
720,59.31
721,59.31
722,59.31
723,59.31
724,59.30
725,59.30
726,59.30
727,59.30
728,59.30
729,59.29
730,59.28
731,59.28
732,59.28
733,59.28
734,59.29
735,59.30
736,59.32
737,59.34
738,59.35
739,59.38
740,59.39
741,59.41
742,59.43
743,59.45
744,59.46
745,59.46
746,59.45
747,59.45
748,59.45
749,59.44
750,59.44
751,59.45
752,59.45
753,59.46
754,59.48
755,59.50
756,59.52
757,59.54
758,59.57
759,59.58
760,59.59
761,59.59
762,59.59
763,59.57
764,59.54
765,59.50
766,59.45
767,59.41
768,59.38
769,59.33
770,59.29
771,59.26
772,59.23
773,59.21
774,59.19
775,59.17
776,59.15
777,59.13
778,59.12
779,59.10
780,59.07
781,59.05
782,59.02
783,58.98
784,58.95
785,58.91
786,58.87
787,58.84
788,58.81
789,58.78
790,58.76
791,58.73
792,58.71
793,58.69
794,58.69
795,58.69
796,58.69
797,58.69
798,58.70
799,58.71
800,58.73
801,58.76
802,58.79
803,58.83
804,58.87
805,58.91
806,58.95
807,59.00
808,59.05
809,59.09
810,59.13
811,59.17
812,59.20
813,59.23
814,59.25
815,59.27
816,59.28
817,59.30
818,59.31
819,59.32
820,59.34
821,59.35
822,59.37
823,59.40
824,59.42
825,59.45
826,59.48
827,59.51
828,59.54
829,59.57
830,59.60
831,59.62
832,59.65
833,59.67
834,59.69
835,59.70
836,59.71
837,59.72
838,59.73
839,59.74
840,59.75
841,59.75
842,59.75
843,59.74
844,59.74
845,59.73
846,59.72
847,59.71
848,59.69
849,59.67
850,59.65
851,59.62
852,59.59
853,59.57
854,59.54
855,59.52
856,59.49
857,59.47
858,59.45
859,59.45
860,59.45
861,59.46
862,59.47
863,59.48
864,59.50
865,59.52
866,59.55
867,59.57
868,59.59
869,59.60
870,59.61
871,59.61
872,59.61
873,59.60
874,59.59
875,59.57
876,59.55
877,59.53
878,59.51
879,59.50
880,59.49
881,59.48
882,59.48
883,59.48
884,59.48
885,59.49
886,59.50
887,59.51
888,59.52
889,59.52
890,59.53
891,59.53
892,59.53
893,59.54
894,59.55
895,59.56
896,59.58
897,59.59
898,59.62
899,59.65
900,59.69
901,59.73
902,59.77
903,59.81
904,59.85
905,59.89
906,59.93
907,59.97
908,60.00
909,60.03
910,60.06
911,60.09
912,60.11
913,60.13
914,60.16
915,60.18
916,60.20
917,60.22
918,60.24
919,60.25
920,60.27
921,60.28
922,60.29
923,60.30
924,60.31
925,60.31
926,60.30
927,60.29
928,60.28
929,60.27
930,60.26
931,60.25
932,60.24
933,60.24
934,60.24
935,60.25
936,60.26
937,60.28
938,60.30
939,60.33
940,60.37
941,60.41
942,60.45
943,60.49
944,60.53
945,60.58
946,60.62
947,60.66
948,60.70
949,60.73
950,60.75
951,60.77
952,60.79
953,60.81
954,60.82
955,60.83
956,60.84
957,60.85
958,60.86
959,60.88
960,60.89
961,60.89
962,60.90
963,60.91
964,60.91
965,60.90
966,60.90
967,60.89
968,60.89
969,60.90
970,60.90
971,60.91
972,60.91
973,60.91
974,60.92
975,60.92
976,60.91
977,60.91
978,60.90
979,60.89
980,60.88
981,60.87
982,60.86
983,60.86
984,60.85
985,60.85
986,60.85
987,60.86
988,60.86
989,60.87
990,60.88
991,60.88
992,60.89
993,60.89
994,60.89
995,60.89
996,60.88
997,60.87
998,60.85
999,60.83
1000,60.80
1001,60.77
1002,60.74
1003,60.70
1004,60.66
1005,60.62
1006,60.58
1007,60.54
1008,60.50
1009,60.46
1010,60.42
1011,60.38
1012,60.35
1013,60.33
1014,60.32
1015,60.31
1016,60.30
1017,60.30
1018,60.30
1019,60.32
1020,60.34
1021,60.35
1022,60.37
1023,60.38
1024,60.40
1025,60.42
1026,60.44
1027,60.46
1028,60.48
1029,60.49
1030,60.51
1031,60.53
1032,60.54
1033,60.56
1034,60.58
1035,60.60
1036,60.61
1037,60.62
1038,60.62
1039,60.62
1040,60.62
1041,60.61
1042,60.59
1043,60.57
1044,60.54
1045,60.51
1046,60.48
1047,60.44
1048,60.41
1049,60.39
1050,60.37
1051,60.36
1052,60.36
1053,60.36
1054,60.37
1055,60.39
1056,60.40
1057,60.43
1058,60.45
1059,60.47
1060,60.50
1061,60.52
1062,60.54
1063,60.56
1064,60.57
1065,60.57
1066,60.56
1067,60.55
1068,60.54
1069,60.53
1070,60.52
1071,60.51
1072,60.51
1073,60.51
1074,60.53
1075,60.54
1076,60.55
1077,60.57
1078,60.59
1079,60.62
1080,60.64
1081,60.65
1082,60.67
1083,60.68
1084,60.68
1085,60.68
1086,60.66
1087,60.63
1088,60.60
1089,60.57
1090,60.54
1091,60.51
1092,60.48
1093,60.46
1094,60.44
1095,60.42
1096,60.42
1097,60.42
1098,60.42
1099,60.43
1100,60.44
1101,60.45
1102,60.46
1103,60.48
1104,60.48
1105,60.48
1106,60.46
1107,60.45
1108,60.44
1109,60.43
1110,60.41
1111,60.39
1112,60.37
1113,60.37
1114,60.36
1115,60.35
1116,60.35
1117,60.35
1118,60.35
1119,60.36
1120,60.36
1121,60.36
1122,60.36
1123,60.36
1124,60.37
1125,60.38
1126,60.38
1127,60.39
1128,60.40
1129,60.42
1130,60.43
1131,60.45
1132,60.46
1133,60.47
1134,60.48
1135,60.49
1136,60.48
1137,60.47
1138,60.46
1139,60.45
1140,60.43
1141,60.42
1142,60.40
1143,60.39
1144,60.37
1145,60.36
1146,60.35
1147,60.34
1148,60.34
1149,60.33
1150,60.33
1151,60.34
1152,60.34
1153,60.34
1154,60.33
1155,60.33
1156,60.33
1157,60.33
1158,60.33
1159,60.33
1160,60.35
1161,60.36
1162,60.38
1163,60.39
1164,60.41
1165,60.42
1166,60.46
1167,60.49
1168,60.52
1169,60.53
1170,60.55
1171,60.56
1172,60.57
1173,60.58
1174,60.58
1175,60.58
1176,60.57
1177,60.56
1178,60.55
1179,60.54
1180,60.54
1181,60.55
1182,60.55
1183,60.57
1184,60.58
1185,60.60
1186,60.63
1187,60.66
1188,60.71
1189,60.75
1190,60.78
1191,60.82
1192,60.86
1193,60.89
1194,60.91
1195,60.93
1196,60.94
1197,60.95
1198,60.95
1199,60.95
1200,60.94
1201,60.93
1202,60.93
1203,60.92
1204,60.92
1205,60.92
1206,60.93
1207,60.93
1208,60.94
1209,60.95
1210,60.96
1211,60.99
1212,61.02
1213,61.05
1214,61.08
1215,61.11
1216,61.14
1217,61.16
1218,61.19
1219,61.21
1220,61.23
1221,61.24
1222,61.26
1223,61.27
1224,61.28
1225,61.28
1226,61.29
1227,61.29
1228,61.31
1229,61.33
1230,61.36
1231,61.39
1232,61.42
1233,61.45
1234,61.48
1235,61.51
1236,61.54
1237,61.56
1238,61.58
1239,61.59
1240,61.60
1241,61.60
1242,61.60
1243,61.59
1244,61.58
1245,61.57
1246,61.55
1247,61.54
1248,61.51
1249,61.49
1250,61.47
1251,61.44
1252,61.41
1253,61.38
1254,61.35
1255,61.32
1256,61.29
1257,61.25
1258,61.22
1259,61.20
1260,61.18
1261,61.17
1262,61.15
1263,61.14
1264,61.14
1265,61.14
1266,61.14
1267,61.15
1268,61.16
1269,61.18
1270,61.18
1271,61.19
1272,61.21
1273,61.21
1274,61.21
1275,61.21
1276,61.20
1277,61.20
1278,61.19
1279,61.17
1280,61.16
1281,61.15
1282,61.14
1283,61.13
1284,61.11
1285,61.10
1286,61.10
1287,61.09
1288,61.08
1289,61.06
1290,61.04
1291,61.02
1292,61.00
1293,60.98
1294,60.95
1295,60.92
1296,60.89
1297,60.86
1298,60.84
1299,60.82
1300,60.81
1301,60.80
1302,60.80
1303,60.80
1304,60.81
1305,60.82
1306,60.83
1307,60.84
1308,60.86
1309,60.86
1310,60.86
1311,60.86
1312,60.85
1313,60.83
1314,60.82
1315,60.79
1316,60.77
1317,60.75
1318,60.73
1319,60.71
1320,60.70
1321,60.69
1322,60.69
1323,60.68
1324,60.67
1325,60.68
1326,60.68
1327,60.69
1328,60.69
1329,60.68
1330,60.68
1331,60.67
1332,60.66
1333,60.65
1334,60.65
1335,60.64
1336,60.64
1337,60.65
1338,60.65
1339,60.66
1340,60.68
1341,60.69
1342,60.71
1343,60.73
1344,60.75
1345,60.78
1346,60.81
1347,60.83
1348,60.85
1349,60.86
1350,60.86
1351,60.87
1352,60.88
1353,60.89
1354,60.89
1355,60.89
1356,60.89
1357,60.90
1358,60.90
1359,60.92
1360,60.93
1361,60.94
1362,60.96
1363,60.97
1364,60.99
1365,61.00
1366,61.02
1367,61.04
1368,61.05
1369,61.06
1370,61.07
1371,61.08
1372,61.09
1373,61.10
1374,61.10
1375,61.11
1376,61.12
1377,61.13
1378,61.14
1379,61.15
1380,61.17
1381,61.20
1382,61.22
1383,61.24
1384,61.26
1385,61.29
1386,61.32
1387,61.34
1388,61.36
1389,61.37
1390,61.38
1391,61.40
1392,61.40
1393,61.40
1394,61.41
1395,61.42
1396,61.44
1397,61.46
1398,61.47
1399,61.49
1400,61.51
1401,61.54
1402,61.57
1403,61.59
1404,61.61
1405,61.62
1406,61.62
1407,61.62
1408,61.62
1409,61.61
1410,61.61
1411,61.60
1412,61.59
1413,61.57
1414,61.56
1415,61.55
1416,61.55
1417,61.55
1418,61.55
1419,61.54
1420,61.54
1421,61.54
1422,61.54
1423,61.54
1424,61.55
1425,61.55
1426,61.56
1427,61.58
1428,61.59
1429,61.60
1430,61.62
1431,61.64
1432,61.67
1433,61.69
1434,61.71
1435,61.74
1436,61.76
1437,61.78
1438,61.80
1439,61.81
1440,61.83
1441,61.83
1442,61.85
1443,61.86
1444,61.87
1445,61.88
1446,61.88
1447,61.89
1448,61.90
1449,61.91
1450,61.93
1451,61.94
1452,61.95
1453,61.97
1454,61.98
1455,61.99
1456,62.01
1457,62.02
1458,62.03
1459,62.04
1460,62.03
1461,62.02
1462,62.01
1463,62.02
1464,62.02
1465,62.02
1466,62.04
1467,62.06
1468,62.08
1469,62.11
1470,62.15
1471,62.19
1472,62.23
1473,62.26
1474,62.30
1475,62.33
1476,62.36
1477,62.38
1478,62.39
1479,62.40
1480,62.40
1481,62.40
1482,62.40
1483,62.39
1484,62.38
1485,62.37
1486,62.37
1487,62.37
1488,62.37
1489,62.37
1490,62.38
1491,62.40
1492,62.42
1493,62.44
1494,62.45
1495,62.47
1496,62.48
1497,62.48
1498,62.48
1499,62.48
1500,62.47
1501,62.46
1502,62.44
1503,62.42
1504,62.40
1505,62.38
1506,62.36
1507,62.34
1508,62.32
1509,62.30
1510,62.28
1511,62.27
1512,62.26
1513,62.26
1514,62.26
1515,62.25
1516,62.25
1517,62.27
1518,62.28
1519,62.30
1520,62.31
1521,62.33
1522,62.35
1523,62.37
1524,62.39
1525,62.41
1526,62.42
1527,62.43
1528,62.45
1529,62.45
1530,62.46
1531,62.46
1532,62.46
1533,62.46
1534,62.48
1535,62.48
1536,62.50
1537,62.52
1538,62.54
1539,62.56
1540,62.58
1541,62.60
1542,62.61
1543,62.62
1544,62.63
1545,62.64
1546,62.65
1547,62.64
1548,62.64
1549,62.63
1550,62.63
1551,62.62
1552,62.61
1553,62.60
1554,62.60
1555,62.60
1556,62.60
1557,62.62
1558,62.64
1559,62.66
1560,62.70
1561,62.73
1562,62.77
1563,62.82
1564,62.86
1565,62.91
1566,62.95
1567,63.00
1568,63.05
1569,63.10
1570,63.14
1571,63.18
1572,63.22
1573,63.25
1574,63.28
1575,63.28
1576,63.29
1577,63.29
1578,63.30
1579,63.31
1580,63.32
1581,63.33
1582,63.33
1583,63.33
1584,63.33
1585,63.34
1586,63.33
1587,63.33
1588,63.31
1589,63.30
1590,63.28
1591,63.27
1592,63.24
1593,63.21
1594,63.18
1595,63.15
1596,63.12
1597,63.09
1598,63.04
1599,63.00
1600,62.97
1601,62.93
1602,62.89
1603,62.86
1604,62.83
1605,62.81
1606,62.78
1607,62.77
1608,62.75
1609,62.74
1610,62.73
1611,62.73
1612,62.73
1613,62.75
1614,62.78
1615,62.81
1616,62.83
1617,62.86
1618,62.89
1619,62.92
1620,62.94
1621,62.96
1622,62.97
1623,62.98
1624,62.98
1625,62.98
1626,62.96
1627,62.94
1628,62.91
1629,62.88
1630,62.86
1631,62.82
1632,62.79
1633,62.76
1634,62.74
1635,62.73
1636,62.71
1637,62.71
1638,62.71
1639,62.72
1640,62.74
1641,62.76
1642,62.78
1643,62.81
1644,62.85
1645,62.88
1646,62.91
1647,62.92
1648,62.95
1649,62.97
1650,63.00
1651,63.03
1652,63.06
1653,63.09
1654,63.11
1655,63.14
1656,63.17
1657,63.19
1658,63.21
1659,63.23
1660,63.24
1661,63.24
1662,63.25
1663,63.25
1664,63.25
1665,63.25
1666,63.24
1667,63.23
1668,63.22
1669,63.22
1670,63.23
1671,63.23
1672,63.22
1673,63.21
1674,63.21
1675,63.22
1676,63.23
1677,63.24
1678,63.26
1679,63.28
1680,63.29
1681,63.31
1682,63.31
1683,63.32
1684,63.32
1685,63.32
1686,63.31
1687,63.31
1688,63.30
1689,63.29
1690,63.28
1691,63.27
1692,63.26
1693,63.25
1694,63.24
1695,63.24
1696,63.23
1697,63.23
1698,63.24
1699,63.24
1700,63.25
1701,63.26
1702,63.27
1703,63.28
1704,63.29
1705,63.30
1706,63.31
1707,63.31
1708,63.31
1709,63.31
1710,63.31
1711,63.29
1712,63.26
1713,63.23
1714,63.19
1715,63.16
1716,63.13
1717,63.10
1718,63.08
1719,63.06
1720,63.04
1721,63.02
1722,63.00
1723,62.98
1724,62.97
1725,62.95
1726,62.94
1727,62.92
1728,62.90
1729,62.88
1730,62.86
1731,62.83
1732,62.80
1733,62.76
1734,62.72
1735,62.68
1736,62.64
1737,62.60
1738,62.55
1739,62.52
1740,62.48
1741,62.45
1742,62.42
1743,62.40
1744,62.38
1745,62.38
1746,62.38
1747,62.38
1748,62.39
1749,62.40
1750,62.42
1751,62.45
1752,62.47
1753,62.50
1754,62.52
1755,62.55
1756,62.58
1757,62.60
1758,62.63
1759,62.64
1760,62.66
1761,62.66
1762,62.67
1763,62.68
1764,62.68
1765,62.68
1766,62.68
1767,62.67
1768,62.66
1769,62.66
1770,62.66
1771,62.66
1772,62.67
1773,62.68
1774,62.68
1775,62.68
1776,62.68
1777,62.69
1778,62.68
1779,62.67
1780,62.66
1781,62.63
1782,62.61
1783,62.59
1784,62.55
1785,62.51
1786,62.48
1787,62.45
1788,62.41
1789,62.39
1790,62.36
1791,62.35
1792,62.34
1793,62.34
1794,62.33
1795,62.33
1796,62.34
1797,62.36
1798,62.38
1799,62.40
1800,62.43
1801,62.46
1802,62.48
1803,62.52
1804,62.55
1805,62.57
1806,62.61
1807,62.63
1808,62.66
1809,62.68
1810,62.69
1811,62.71
1812,62.72
1813,62.73
1814,62.73
1815,62.73
1816,62.72
1817,62.71
1818,62.70
1819,62.68
1820,62.66
1821,62.63
1822,62.60
1823,62.58
1824,62.55
1825,62.52
1826,62.50
1827,62.48
1828,62.47
1829,62.46
1830,62.45
1831,62.45
1832,62.46
1833,62.48
1834,62.50
1835,62.52
1836,62.55
1837,62.58
1838,62.60
1839,62.63
1840,62.65
1841,62.66
1842,62.67
1843,62.66
1844,62.66
1845,62.65
1846,62.63
1847,62.61
1848,62.59
1849,62.57
1850,62.55
1851,62.52
1852,62.51
1853,62.50
1854,62.50
1855,62.50
1856,62.50
1857,62.50
1858,62.52
1859,62.52
1860,62.54
1861,62.55
1862,62.55
1863,62.56
1864,62.57
1865,62.57
1866,62.57
1867,62.57
1868,62.56
1869,62.56
1870,62.55
1871,62.54
1872,62.53
1873,62.53
1874,62.53
1875,62.53
1876,62.53
1877,62.53
1878,62.54
1879,62.55
1880,62.56
1881,62.58
1882,62.60
1883,62.62
1884,62.64
1885,62.66
1886,62.68
1887,62.69
1888,62.70
1889,62.70
1890,62.71
1891,62.72
1892,62.72
1893,62.72
1894,62.72
1895,62.72
1896,62.73
1897,62.73
1898,62.75
1899,62.77
1900,62.78
1901,62.81
1902,62.82
1903,62.85
1904,62.88
1905,62.91
1906,62.93
1907,62.95
1908,62.97
1909,62.98
1910,62.99
1911,62.99
1912,62.99
1913,62.99
1914,62.98
1915,62.96
1916,62.95
1917,62.93
1918,62.92
1919,62.92
1920,62.92
1921,62.92
1922,62.93
1923,62.94
1924,62.96
1925,62.99
1926,63.01
1927,63.04
1928,63.07
1929,63.09
1930,63.12
1931,63.14
1932,63.16
1933,63.17
1934,63.19
1935,63.20
1936,63.21
1937,63.22
1938,63.24
1939,63.25
1940,63.27
1941,63.28
1942,63.31
1943,63.34
1944,63.37
1945,63.40
1946,63.42
1947,63.44
1948,63.46
1949,63.48
1950,63.49
1951,63.49
1952,63.49
1953,63.48
1954,63.47
1955,63.46
1956,63.44
1957,63.41
1958,63.40
1959,63.39
1960,63.38
1961,63.38
1962,63.37
1963,63.36
1964,63.35
1965,63.35
1966,63.35
1967,63.35
1968,63.36
1969,63.37
1970,63.38
1971,63.39
1972,63.39
1973,63.40
1974,63.41
1975,63.42
1976,63.42
1977,63.43
1978,63.43
1979,63.43
1980,63.43
1981,63.43
1982,63.43
1983,63.42
1984,63.41
1985,63.40
1986,63.39
1987,63.38
1988,63.37
1989,63.35
1990,63.34
1991,63.34
1992,63.34
1993,63.34
1994,63.34
1995,63.35
1996,63.36
1997,63.39
1998,63.41
1999,63.43
2000,63.46
2001,63.49
2002,63.53
2003,63.57
2004,63.60
2005,63.63
2006,63.65
2007,63.67
2008,63.69
2009,63.71
2010,63.72
2011,63.72
2012,63.73
2013,63.73
2014,63.74
2015,63.74
2016,63.73
2017,63.72
2018,63.73
2019,63.73
2020,63.73
2021,63.73
2022,63.73
2023,63.73
2024,63.74
2025,63.74
2026,63.75
2027,63.76
2028,63.78
2029,63.79
2030,63.81
2031,63.83
2032,63.85
2033,63.88
2034,63.91
2035,63.94
2036,63.96
2037,63.98
2038,64.01
2039,64.03
2040,64.04
2041,64.05
2042,64.06
2043,64.06
2044,64.05
2045,64.04
2046,64.03
2047,64.02
2048,64.00
2049,63.99
2050,63.98
2051,63.98
2052,63.97
2053,63.97
2054,63.98
2055,64.00
2056,64.02
2057,64.03
2058,64.05
2059,64.07
2060,64.09
2061,64.10
2062,64.11
2063,64.12
2064,64.13
2065,64.14
2066,64.13
2067,64.12
2068,64.10
2069,64.09
2070,64.07
2071,64.06
2072,64.05
2073,64.04
2074,64.03
2075,64.02
2076,64.03
2077,64.04
2078,64.05
2079,64.06
2080,64.07
2081,64.09
2082,64.11
2083,64.12
2084,64.13
2085,64.14
2086,64.15
2087,64.16
2088,64.16
2089,64.16
2090,64.16
2091,64.15
2092,64.14
2093,64.14
2094,64.13
2095,64.12
2096,64.12
2097,64.12
2098,64.12
2099,64.11
2100,64.12
2101,64.13
2102,64.14
2103,64.14
2104,64.14
2105,64.14
2106,64.15
2107,64.15
2108,64.15
2109,64.15
2110,64.16
2111,64.16
2112,64.16
2113,64.16
2114,64.17
2115,64.18
2116,64.19
2117,64.20
2118,64.21
2119,64.22
2120,64.25
2121,64.26
2122,64.27
2123,64.27
2124,64.27
2125,64.27
2126,64.27
2127,64.25
2128,64.22
2129,64.20
2130,64.17
2131,64.14
2132,64.11
2133,64.08
2134,64.05
2135,64.02
2136,63.99
2137,63.96
2138,63.94
2139,63.93
2140,63.93
2141,63.93
2142,63.93
2143,63.93
2144,63.94
2145,63.94
2146,63.94
2147,63.94
2148,63.93
2149,63.92
2150,63.91
2151,63.89
2152,63.87
2153,63.85
2154,63.84
2155,63.83
2156,63.82
2157,63.82
2158,63.84
2159,63.86
2160,63.90
2161,63.94
2162,63.98
2163,64.03
2164,64.08
2165,64.14
2166,64.18
2167,64.21
2168,64.23
2169,64.24
2170,64.24
2171,64.24
2172,64.22
2173,64.19
2174,64.16
2175,64.11
2176,64.07
2177,64.02
2178,63.98
2179,63.94
2180,63.91
2181,63.87
2182,63.84
2183,63.81
2184,63.78
2185,63.76
2186,63.75
2187,63.74
2188,63.73
2189,63.73
2190,63.73
2191,63.74
2192,63.76
2193,63.78
2194,63.82
2195,63.86
2196,63.90
2197,63.95
2198,64.01
2199,64.07
2200,64.12
2201,64.18
2202,64.22
2203,64.27
2204,64.32
2205,64.36
2206,64.40
2207,64.41
2208,64.43
2209,64.43
2210,64.43
2211,64.42
2212,64.41
2213,64.40
2214,64.39
2215,64.37
2216,64.36
2217,64.35
2218,64.34
2219,64.33
2220,64.33
2221,64.34
2222,64.35
2223,64.36
2224,64.37
2225,64.38
2226,64.39
2227,64.40
2228,64.41
2229,64.43
2230,64.44
2231,64.44
2232,64.45
2233,64.45
2234,64.46
2235,64.46
2236,64.46
2237,64.46
2238,64.46
2239,64.45
2240,64.44
2241,64.44
2242,64.43
2243,64.41
2244,64.40
2245,64.39
2246,64.39
2247,64.39
2248,64.39
2249,64.39
2250,64.40
2251,64.41
2252,64.44
2253,64.46
2254,64.49
2255,64.52
2256,64.55
2257,64.58
2258,64.61
2259,64.65
2260,64.68
2261,64.71
2262,64.74
2263,64.77
2264,64.79
2265,64.82
2266,64.84
2267,64.87
2268,64.88
2269,64.90
2270,64.90
2271,64.90
2272,64.88
2273,64.87
2274,64.85
2275,64.83
2276,64.81
2277,64.79
2278,64.77
2279,64.75
2280,64.73
2281,64.73
2282,64.74
2283,64.76
2284,64.78
2285,64.81
2286,64.84
2287,64.88
2288,64.93
2289,64.98
2290,65.03
2291,65.07
2292,65.10
2293,65.13
2294,65.14
2295,65.15
2296,65.15
2297,65.14
2298,65.13
2299,65.12
2300,65.10
2301,65.08
2302,65.07
2303,65.05
2304,65.06
2305,65.06
2306,65.08
2307,65.09
2308,65.12
2309,65.15
2310,65.19
2311,65.23
2312,65.27
2313,65.32
2314,65.37
2315,65.41
2316,65.45
2317,65.48
2318,65.50
2319,65.52
2320,65.54
2321,65.54
2322,65.53
2323,65.52
2324,65.51
2325,65.49
2326,65.48
2327,65.46
2328,65.44
2329,65.41
2330,65.40
2331,65.38
2332,65.37
2333,65.36
2334,65.35
2335,65.35
2336,65.35
2337,65.34
2338,65.33
2339,65.32
2340,65.31
2341,65.30
2342,65.29
2343,65.28
2344,65.26
2345,65.25
2346,65.24
2347,65.23
2348,65.21
2349,65.20
2350,65.19
2351,65.19
2352,65.19
2353,65.19
2354,65.20
2355,65.21
2356,65.23
2357,65.25
2358,65.27
2359,65.29
2360,65.30
2361,65.32
2362,65.34
2363,65.35
2364,65.35
2365,65.35
2366,65.33
2367,65.31
2368,65.29
2369,65.26
2370,65.23
2371,65.19
2372,65.16
2373,65.12
2374,65.09
2375,65.06
2376,65.03
2377,65.00
2378,64.98
2379,64.97
2380,64.95
2381,64.94
2382,64.94
2383,64.95
2384,64.96
2385,64.96
2386,64.98
2387,65.00
2388,65.03
2389,65.06
2390,65.09
2391,65.13
2392,65.17
2393,65.21
2394,65.24
2395,65.27
2396,65.30
2397,65.33
2398,65.35
2399,65.38
2400,65.40
2401,65.42
2402,65.44
2403,65.47
2404,65.49
2405,65.50
2406,65.52
2407,65.54
2408,65.57
2409,65.60
2410,65.64
2411,65.68
2412,65.72
2413,65.76
2414,65.81
2415,65.87
2416,65.92
2417,65.97
2418,66.02
2419,66.05
2420,66.09
2421,66.13
2422,66.16
2423,66.18
2424,66.19
2425,66.20
2426,66.20
2427,66.19
2428,66.18
2429,66.18
2430,66.18
2431,66.18
2432,66.18
2433,66.19
2434,66.20
2435,66.22
2436,66.25
2437,66.28
2438,66.31
2439,66.35
2440,66.38
2441,66.42
2442,66.45
2443,66.48
2444,66.50
2445,66.52
2446,66.54
2447,66.55
2448,66.55
2449,66.55
2450,66.55
2451,66.56
2452,66.57
2453,66.58
2454,66.60
2455,66.62
2456,66.65
2457,66.67
2458,66.71
2459,66.74
2460,66.77
2461,66.79
2462,66.81
2463,66.83
2464,66.84
2465,66.85
2466,66.85
2467,66.85
2468,66.85
2469,66.85
2470,66.86
2471,66.87
2472,66.89
2473,66.91
2474,66.93
2475,66.96
2476,66.99
2477,67.02
2478,67.04
2479,67.07
2480,67.08
2481,67.09
2482,67.10
2483,67.09
2484,67.07
2485,67.05
2486,67.02
2487,66.98
2488,66.95
2489,66.92
2490,66.88
2491,66.85
2492,66.82
2493,66.79
2494,66.78
2495,66.77
2496,66.76
2497,66.75
2498,66.75
2499,66.74
2500,66.74
2501,66.73
2502,66.72
2503,66.70
2504,66.69
2505,66.68
2506,66.67
2507,66.67
2508,66.67
2509,66.68
2510,66.70
2511,66.72
2512,66.74
2513,66.77
2514,66.81
2515,66.84
2516,66.87
2517,66.89
2518,66.89
2519,66.90
2520,66.90
2521,66.91
2522,66.91
2523,66.89
2524,66.88
2525,66.87
2526,66.86
2527,66.86
2528,66.86
2529,66.87
2530,66.87
2531,66.88
2532,66.88
2533,66.88
2534,66.88
2535,66.88
2536,66.87
2537,66.86
2538,66.85
2539,66.83
2540,66.81
2541,66.79
2542,66.77
2543,66.75
2544,66.74
2545,66.73
2546,66.71
2547,66.71
2548,66.70
2549,66.69
2550,66.69
2551,66.69
2552,66.69
2553,66.69
2554,66.69
2555,66.69
2556,66.68
2557,66.67
2558,66.66
2559,66.65
2560,66.64
2561,66.64
2562,66.64
2563,66.64
2564,66.64
2565,66.65
2566,66.66
2567,66.68
2568,66.70
2569,66.72
2570,66.74
2571,66.76
2572,66.78
2573,66.81
2574,66.83
2575,66.83
2576,66.83
2577,66.82
2578,66.81
2579,66.79
2580,66.77
2581,66.74
2582,66.71
2583,66.68
2584,66.67
2585,66.65
2586,66.66
2587,66.67
2588,66.70
2589,66.74
2590,66.78
2591,66.82
2592,66.87
2593,66.92
2594,66.97
2595,67.02
2596,67.06
2597,67.09
2598,67.12
2599,67.14
2600,67.17
2601,67.18
2602,67.20
2603,67.21
2604,67.23
2605,67.24
2606,67.25
2607,67.26
2608,67.26
2609,67.26
2610,67.24
2611,67.22
2612,67.18
2613,67.14
2614,67.10
2615,67.07
2616,67.03
2617,67.00
2618,66.96
2619,66.94
2620,66.91
2621,66.89
2622,66.88
2623,66.87
2624,66.86
2625,66.86
2626,66.85
2627,66.85
2628,66.84
2629,66.83
2630,66.82
2631,66.80
2632,66.77
2633,66.74
2634,66.70
2635,66.67
2636,66.64
2637,66.62
2638,66.60
2639,66.59
2640,66.58
2641,66.58
2642,66.58
2643,66.59
2644,66.60
2645,66.60
2646,66.61
2647,66.62
2648,66.63
2649,66.63
2650,66.61
2651,66.59
2652,66.56
2653,66.53
2654,66.49
2655,66.46
2656,66.42
2657,66.38
2658,66.36
2659,66.34
2660,66.32
2661,66.32
2662,66.32
2663,66.33
2664,66.34
2665,66.35
2666,66.37
2667,66.40
2668,66.42
2669,66.44
2670,66.47
2671,66.49
2672,66.53
2673,66.56
2674,66.58
2675,66.60
2676,66.63
2677,66.66
2678,66.69
2679,66.71
2680,66.74
2681,66.77
2682,66.79
2683,66.81
2684,66.83
2685,66.84
2686,66.85
2687,66.85
2688,66.85
2689,66.85
2690,66.83
2691,66.81
2692,66.79
2693,66.77
2694,66.74
2695,66.71
2696,66.68
2697,66.65
2698,66.63
2699,66.61
2700,66.60
2701,66.58
2702,66.57
2703,66.57
2704,66.58
2705,66.60
2706,66.60
2707,66.61
2708,66.63
2709,66.65
2710,66.67
2711,66.68
2712,66.69
2713,66.70
2714,66.71
2715,66.72
2716,66.73
2717,66.74
2718,66.75
2719,66.76
2720,66.77
2721,66.78
2722,66.79
2723,66.80
2724,66.82
2725,66.82
2726,66.83
2727,66.83
2728,66.82
2729,66.82
2730,66.79
2731,66.77
2732,66.74
2733,66.71
2734,66.68
2735,66.64
2736,66.60
2737,66.56
2738,66.53
2739,66.51
2740,66.49
2741,66.49
2742,66.48
2743,66.48
2744,66.48
2745,66.49
2746,66.50
2747,66.52
2748,66.53
2749,66.55
2750,66.58
2751,66.60
2752,66.63
2753,66.65
2754,66.68
2755,66.72
2756,66.75
2757,66.79
2758,66.83
2759,66.87
2760,66.92
2761,66.96
2762,66.99
2763,67.01
2764,67.01
2765,67.00
2766,67.00
2767,66.98
2768,66.97
2769,66.96
2770,66.94
2771,66.92
2772,66.90
2773,66.88
2774,66.86
2775,66.85
2776,66.83
2777,66.81
2778,66.78
2779,66.75
2780,66.73
2781,66.71
2782,66.69
2783,66.67
2784,66.65
2785,66.64
2786,66.63
2787,66.62
2788,66.61
2789,66.61
2790,66.61
2791,66.61
2792,66.61
2793,66.62
2794,66.62
2795,66.62
2796,66.63
2797,66.63
2798,66.64
2799,66.64
2800,66.64
2801,66.64
2802,66.64
2803,66.63
2804,66.63
2805,66.62
2806,66.60
2807,66.60
2808,66.60
2809,66.60
2810,66.61
2811,66.62
2812,66.63
2813,66.65
2814,66.68
2815,66.71
2816,66.74
2817,66.78
2818,66.81
2819,66.85
2820,66.89
2821,66.91
2822,66.93
2823,66.95
2824,66.96
2825,66.97
2826,66.97
2827,66.96
2828,66.95
2829,66.95
2830,66.93
2831,66.92
2832,66.90
2833,66.88
2834,66.86
2835,66.85
2836,66.85
2837,66.84
2838,66.84
2839,66.83
2840,66.84
2841,66.85
2842,66.86
2843,66.88
2844,66.90
2845,66.91
2846,66.93
2847,66.94
2848,66.96
2849,66.98
2850,67.00
2851,67.02
2852,67.03
2853,67.04
2854,67.04
2855,67.05
2856,67.05
2857,67.04
2858,67.04
2859,67.04
2860,67.05
2861,67.06
2862,67.07
2863,67.07
2864,67.09
2865,67.11
2866,67.13
2867,67.14
2868,67.16
2869,67.18
2870,67.19
2871,67.20
2872,67.20
2873,67.20
2874,67.19
2875,67.18
2876,67.16
2877,67.14
2878,67.11
2879,67.08
2880,67.05
2881,67.03
2882,67.00
2883,66.98
2884,66.95
2885,66.93
2886,66.90
2887,66.87
2888,66.84
2889,66.81
2890,66.78
2891,66.76
2892,66.72
2893,66.69
2894,66.65
2895,66.62
2896,66.60
2897,66.58
2898,66.56
2899,66.55
2900,66.55
2901,66.56
2902,66.58
2903,66.60
2904,66.63
2905,66.66
2906,66.69
2907,66.73
2908,66.76
2909,66.78
2910,66.81
2911,66.83
2912,66.84
2913,66.86
2914,66.86
2915,66.86
2916,66.86
2917,66.86
2918,66.86
2919,66.86
2920,66.86
2921,66.86
2922,66.86
2923,66.86
2924,66.86
2925,66.86
2926,66.86
2927,66.86
2928,66.85
2929,66.85
2930,66.84
2931,66.83
2932,66.83
2933,66.82
2934,66.82
2935,66.82
2936,66.82
2937,66.82
2938,66.83
2939,66.84
2940,66.85
2941,66.86
2942,66.87
2943,66.89
2944,66.89
2945,66.89
2946,66.89
2947,66.89
2948,66.88
2949,66.87
2950,66.85
2951,66.82
2952,66.81
2953,66.79
2954,66.77
2955,66.74
2956,66.73
2957,66.71
2958,66.71
2959,66.70
2960,66.70
2961,66.70
2962,66.70
2963,66.70
2964,66.70
2965,66.70
2966,66.70
2967,66.70
2968,66.69
2969,66.67
2970,66.64
2971,66.62
2972,66.59
2973,66.56
2974,66.53
2975,66.50
2976,66.47
2977,66.44
2978,66.41
2979,66.39
2980,66.37
2981,66.37
2982,66.36
2983,66.35
2984,66.35
2985,66.35
2986,66.36
2987,66.37
2988,66.38
2989,66.39
2990,66.40
2991,66.41
2992,66.42
2993,66.44
2994,66.45
2995,66.47
2996,66.49
2997,66.50
2998,66.52
2999,66.53
3000,66.55
3001,66.56
3002,66.58
3003,66.59
3004,66.60
3005,66.61
3006,66.62
3007,66.63
3008,66.64
3009,66.65
3010,66.67
3011,66.68
3012,66.70
3013,66.72
3014,66.73
3015,66.73
3016,66.74
3017,66.76
3018,66.78
3019,66.80
3020,66.82
3021,66.83
3022,66.85
3023,66.88
3024,66.90
3025,66.92
3026,66.95
3027,66.97
3028,67.00
3029,67.01
3030,67.03
3031,67.04
3032,67.04
3033,67.04
3034,67.04
3035,67.03
3036,67.01
3037,66.99
3038,66.97
3039,66.96
3040,66.93
3041,66.91
3042,66.89
3043,66.88
3044,66.87
3045,66.86
3046,66.85
3047,66.85
3048,66.85
3049,66.86
3050,66.86
3051,66.87
3052,66.87
3053,66.87
3054,66.87
3055,66.87
3056,66.86
3057,66.85
3058,66.85
3059,66.84
3060,66.82
3061,66.79
3062,66.75
3063,66.72
3064,66.69
3065,66.65
3066,66.61
3067,66.56
3068,66.50
3069,66.46
3070,66.42
3071,66.39
3072,66.36
3073,66.33
3074,66.31
3075,66.29
3076,66.28
3077,66.28
3078,66.28
3079,66.28
3080,66.29
3081,66.29
3082,66.30
3083,66.29
3084,66.29
3085,66.28
3086,66.28
3087,66.27
3088,66.26
3089,66.26
3090,66.25
3091,66.26
3092,66.26
3093,66.27
3094,66.28
3095,66.29
3096,66.30
3097,66.32
3098,66.35
3099,66.36
3100,66.38
3101,66.40
3102,66.42
3103,66.44
3104,66.46
3105,66.48
3106,66.50
3107,66.52
3108,66.54
3109,66.56
3110,66.58
3111,66.60
3112,66.62
3113,66.62
3114,66.63
3115,66.63
3116,66.64
3117,66.64
3118,66.63
3119,66.62
3120,66.60
3121,66.58
3122,66.56
3123,66.55
3124,66.53
3125,66.51
3126,66.49
3127,66.47
3128,66.46
3129,66.44
3130,66.43
3131,66.42
3132,66.40
3133,66.38
3134,66.37
3135,66.36
3136,66.35
3137,66.35
3138,66.35
3139,66.35
3140,66.36
3141,66.38
3142,66.39
3143,66.42
3144,66.43
3145,66.46
3146,66.49
3147,66.51
3148,66.53
3149,66.53
3150,66.53
3151,66.53
3152,66.52
3153,66.51
3154,66.49
3155,66.46
3156,66.44
3157,66.42
3158,66.39
3159,66.37
3160,66.34
3161,66.32
3162,66.31
3163,66.31
3164,66.29
3165,66.28
3166,66.27
3167,66.26
3168,66.26
3169,66.26
3170,66.26
3171,66.26
3172,66.26
3173,66.26
3174,66.25
3175,66.24
3176,66.24
3177,66.23
3178,66.21
3179,66.19
3180,66.17
3181,66.14
3182,66.10
3183,66.07
3184,66.04
3185,66.01
3186,65.98
3187,65.95
3188,65.92
3189,65.91
3190,65.90
3191,65.89
3192,65.89
3193,65.89
3194,65.90
3195,65.91
3196,65.91
3197,65.92
3198,65.92
3199,65.92
3200,65.92
3201,65.91
3202,65.91
3203,65.91
3204,65.91
3205,65.91
3206,65.91
3207,65.91
3208,65.91
3209,65.91
3210,65.92
3211,65.91
3212,65.91
3213,65.91
3214,65.92
3215,65.93
3216,65.94
3217,65.95
3218,65.97
3219,66.00
3220,66.03
3221,66.06
3222,66.09
3223,66.13
3224,66.17
3225,66.20
3226,66.24
3227,66.27
3228,66.30
3229,66.33
3230,66.35
3231,66.37
3232,66.40
3233,66.42
3234,66.44
3235,66.46
3236,66.47
3237,66.50
3238,66.53
3239,66.56
3240,66.60
3241,66.64
3242,66.68
3243,66.72
3244,66.76
3245,66.80
3246,66.83
3247,66.86
3248,66.89
3249,66.91
3250,66.93
3251,66.94
3252,66.95
3253,66.96
3254,66.97
3255,66.99
3256,67.00
3257,67.01
3258,67.03
3259,67.04
3260,67.05
3261,67.06
3262,67.07
3263,67.07
3264,67.07
3265,67.06
3266,67.05
3267,67.03
3268,67.02
3269,67.00
3270,66.98
3271,66.96
3272,66.94
3273,66.92
3274,66.90
3275,66.88
3276,66.87
3277,66.85
3278,66.84
3279,66.83
3280,66.80
3281,66.78
3282,66.76
3283,66.75
3284,66.73
3285,66.71
3286,66.69
3287,66.67
3288,66.66
3289,66.65
3290,66.65
3291,66.65
3292,66.64
3293,66.64
3294,66.63
3295,66.61
3296,66.60
3297,66.57
3298,66.54
3299,66.50
3300,66.46
3301,66.41
3302,66.35
3303,66.29
3304,66.22
3305,66.15
3306,66.09
3307,66.02
3308,65.96
3309,65.91
3310,65.85
3311,65.80
3312,65.75
3313,65.71
3314,65.69
3315,65.66
3316,65.65
3317,65.64
3318,65.63
3319,65.63
3320,65.64
3321,65.66
3322,65.67
3323,65.69
3324,65.71
3325,65.72
3326,65.74
3327,65.76
3328,65.77
3329,65.76
3330,65.75
3331,65.75
3332,65.74
3333,65.74
3334,65.74
3335,65.74
3336,65.75
3337,65.77
3338,65.80
3339,65.82
3340,65.86
3341,65.91
3342,65.95
3343,66.01
3344,66.06
3345,66.11
3346,66.16
3347,66.20
3348,66.24
3349,66.27
3350,66.30
3351,66.32
3352,66.34
3353,66.35
3354,66.36
3355,66.36
3356,66.37
3357,66.38
3358,66.38
3359,66.38
3360,66.38
3361,66.38
3362,66.40
3363,66.41
3364,66.43
3365,66.45
3366,66.47
3367,66.50
3368,66.53
3369,66.57
3370,66.62
3371,66.66
3372,66.71
3373,66.75
3374,66.81
3375,66.86
3376,66.91
3377,66.96
3378,67.00
3379,67.05
3380,67.10
3381,67.14
3382,67.18
3383,67.21
3384,67.23
3385,67.25
3386,67.28
3387,67.29
3388,67.31
3389,67.32
3390,67.33
3391,67.35
3392,67.36
3393,67.37
3394,67.39
3395,67.40
3396,67.40
3397,67.40
3398,67.41
3399,67.41
3400,67.40
3401,67.39
3402,67.36
3403,67.34
3404,67.30
3405,67.27
3406,67.24
3407,67.21
3408,67.18
3409,67.15
3410,67.14
3411,67.13
3412,67.12
3413,67.11
3414,67.10
3415,67.10
3416,67.10
3417,67.10
3418,67.09
3419,67.08
3420,67.07
3421,67.06
3422,67.04
3423,67.03
3424,67.00
3425,66.99
3426,66.97
3427,66.97
3428,66.96
3429,66.95
3430,66.95
3431,66.94
3432,66.94
3433,66.93
3434,66.93
3435,66.92
3436,66.92
3437,66.92
3438,66.92
3439,66.92
3440,66.91
3441,66.92
3442,66.93
3443,66.93
3444,66.95
3445,66.96
3446,66.97
3447,66.98
3448,67.00
3449,67.02
3450,67.03
3451,67.04
3452,67.05
3453,67.05
3454,67.05
3455,67.06
3456,67.05
3457,67.05
3458,67.04
3459,67.03
3460,67.02
3461,67.01
3462,67.01
3463,67.00
3464,67.00
3465,67.00
3466,66.99
3467,67.00
3468,67.00
3469,66.99
3470,67.00
3471,67.00
3472,67.01
3473,67.03
3474,67.05
3475,67.07
3476,67.09
3477,67.12
3478,67.15
3479,67.19
3480,67.24
3481,67.29
3482,67.35
3483,67.39
3484,67.44
3485,67.49
3486,67.53
3487,67.56
3488,67.59
3489,67.60
3490,67.60
3491,67.59
3492,67.58
3493,67.56
3494,67.54
3495,67.51
3496,67.49
3497,67.47
3498,67.47
3499,67.46
3500,67.47
3501,67.48
3502,67.50
3503,67.52
3504,67.55
3505,67.57
3506,67.59
3507,67.61
3508,67.62
3509,67.64
3510,67.65
3511,67.65
3512,67.64
3513,67.64
3514,67.64
3515,67.64
3516,67.64
3517,67.65
3518,67.65
3519,67.66
3520,67.68
3521,67.69
3522,67.71
3523,67.73
3524,67.74
3525,67.76
3526,67.77
3527,67.77
3528,67.77
3529,67.77
3530,67.76
3531,67.75
3532,67.73
3533,67.72
3534,67.70
3535,67.68
3536,67.66
3537,67.63
3538,67.61
3539,67.59
3540,67.57
3541,67.54
3542,67.53
3543,67.51
3544,67.50
3545,67.50
3546,67.50
3547,67.50
3548,67.50
3549,67.52
3550,67.53
3551,67.56
3552,67.58
3553,67.61
3554,67.63
3555,67.64
3556,67.65
3557,67.66
3558,67.66
3559,67.65
3560,67.64
3561,67.62
3562,67.59
3563,67.56
3564,67.51
3565,67.47
3566,67.43
3567,67.39
3568,67.35
3569,67.32
3570,67.29
3571,67.25
3572,67.22
3573,67.20
3574,67.19
3575,67.18
3576,67.18
3577,67.19
3578,67.20
3579,67.21
3580,67.22
3581,67.24
3582,67.26
3583,67.28
3584,67.30
3585,67.32
3586,67.34
3587,67.36
3588,67.36
3589,67.37
3590,67.36
3591,67.36
3592,67.35
3593,67.33
3594,67.32
3595,67.29
3596,67.27
3597,67.25
3598,67.24
3599,67.22
3600,67.22
3601,67.22
3602,67.23
3603,67.24
3604,67.25
3605,67.26
3606,67.29
3607,67.31
3608,67.33
3609,67.35
3610,67.37
3611,67.39
3612,67.41
3613,67.42
3614,67.43
3615,67.44
3616,67.46
3617,67.47
3618,67.49
3619,67.50
3620,67.52
3621,67.54
3622,67.57
3623,67.59
3624,67.61
3625,67.62
3626,67.64
3627,67.65
3628,67.65
3629,67.65
3630,67.65
3631,67.65
3632,67.65
3633,67.63
3634,67.61
3635,67.60
3636,67.58
3637,67.57
3638,67.55
3639,67.53
3640,67.52
3641,67.51
3642,67.50
3643,67.49
3644,67.49
3645,67.48
3646,67.48
3647,67.48
3648,67.48
3649,67.48
3650,67.48
3651,67.47
3652,67.47
3653,67.46
3654,67.45
3655,67.44
3656,67.43
3657,67.43
3658,67.42
3659,67.41
3660,67.40
3661,67.39
3662,67.39
3663,67.40
3664,67.42
3665,67.43
3666,67.45
3667,67.47
3668,67.50
3669,67.54
3670,67.57
3671,67.60
3672,67.63
3673,67.66
3674,67.69
3675,67.72
3676,67.74
3677,67.74
3678,67.75
3679,67.76
3680,67.76
3681,67.77
3682,67.77
3683,67.76
3684,67.75
3685,67.74
3686,67.72
3687,67.70
3688,67.68
3689,67.67
3690,67.65
3691,67.64
3692,67.63
3693,67.63
3694,67.63
3695,67.63
3696,67.64
3697,67.66
3698,67.68
3699,67.70
3700,67.73
3701,67.75
3702,67.76
3703,67.77
3704,67.77
3705,67.77
3706,67.77
3707,67.76
3708,67.75
3709,67.73
3710,67.72
3711,67.72
3712,67.72
3713,67.72
3714,67.72
3715,67.73
3716,67.74
3717,67.76
3718,67.79
3719,67.82
3720,67.85
3721,67.88
3722,67.91
3723,67.94
3724,67.97
3725,67.99
3726,68.01
3727,68.02
3728,68.03
3729,68.05
3730,68.05
3731,68.05
3732,68.05
3733,68.05
3734,68.05
3735,68.04
3736,68.04
3737,68.04
3738,68.05
3739,68.05
3740,68.07
3741,68.08
3742,68.11
3743,68.14
3744,68.17
3745,68.20
3746,68.24
3747,68.29
3748,68.32
3749,68.35
3750,68.39
3751,68.42
3752,68.44
3753,68.45
3754,68.46
3755,68.47
3756,68.48
3757,68.48
3758,68.47
3759,68.45
3760,68.44
3761,68.43
3762,68.41
3763,68.40
3764,68.39
3765,68.38
3766,68.36
3767,68.34
3768,68.33
3769,68.31
3770,68.29
3771,68.27
3772,68.24
3773,68.22
3774,68.19
3775,68.17
3776,68.14
3777,68.11
3778,68.08
3779,68.05
3780,68.02
3781,67.99
3782,67.96
3783,67.93
3784,67.90
3785,67.86
3786,67.83
3787,67.80
3788,67.76
3789,67.72
3790,67.68
3791,67.65
3792,67.61
3793,67.58
3794,67.56
3795,67.54
3796,67.53
3797,67.54
3798,67.56
3799,67.58
3800,67.61
3801,67.65
3802,67.70
3803,67.75
3804,67.81
3805,67.86
3806,67.92
3807,67.98
3808,68.03
3809,68.07
3810,68.11
3811,68.15
3812,68.18
3813,68.21
3814,68.23
3815,68.24
3816,68.26
3817,68.26
3818,68.25
3819,68.25
3820,68.24
3821,68.24
3822,68.23
3823,68.22
3824,68.21
3825,68.20
3826,68.19
3827,68.18
3828,68.17
3829,68.16
3830,68.15
3831,68.15
3832,68.14
3833,68.14
3834,68.14
3835,68.14
3836,68.14
3837,68.13
3838,68.13
3839,68.13
3840,68.13
3841,68.13
3842,68.13
3843,68.12
3844,68.12
3845,68.12
3846,68.11
3847,68.11
3848,68.10
3849,68.10
3850,68.11
3851,68.12
3852,68.13
3853,68.14
3854,68.15
3855,68.16
3856,68.16
3857,68.17
3858,68.17
3859,68.16
3860,68.15
3861,68.13
3862,68.12
3863,68.09
3864,68.06
3865,68.03
3866,68.00
3867,67.97
3868,67.94
3869,67.91
3870,67.88
3871,67.86
3872,67.84
3873,67.82
3874,67.80
3875,67.78
3876,67.76
3877,67.74
3878,67.73
3879,67.72
3880,67.71
3881,67.69
3882,67.68
3883,67.67
3884,67.67
3885,67.66
3886,67.65
3887,67.64
3888,67.63
3889,67.62
3890,67.61
3891,67.61
3892,67.61
3893,67.61
3894,67.60
3895,67.60
3896,67.60
3897,67.60
3898,67.60
3899,67.60
3900,67.59
3901,67.59
3902,67.58
3903,67.57
3904,67.55
3905,67.53
3906,67.50
3907,67.48
3908,67.45
3909,67.42
3910,67.39
3911,67.36
3912,67.34
3913,67.32
3914,67.29
3915,67.28
3916,67.28
3917,67.28
3918,67.28
3919,67.28
3920,67.28
3921,67.29
3922,67.29
3923,67.29
3924,67.29
3925,67.28
3926,67.28
3927,67.27
3928,67.25
3929,67.23
3930,67.22
3931,67.21
3932,67.19
3933,67.18
3934,67.16
3935,67.15
3936,67.15
3937,67.15
3938,67.15
3939,67.16
3940,67.16
3941,67.17
3942,67.19
3943,67.21
3944,67.23
3945,67.25
3946,67.26
3947,67.28
3948,67.30
3949,67.33
3950,67.35
3951,67.36
3952,67.37
3953,67.39
3954,67.40
3955,67.41
3956,67.42
3957,67.43
3958,67.44
3959,67.45
3960,67.46
3961,67.48
3962,67.49
3963,67.51
3964,67.53
3965,67.55
3966,67.58
3967,67.60
3968,67.63
3969,67.65
3970,67.67
3971,67.68
3972,67.70
3973,67.71
3974,67.71
3975,67.70
3976,67.69
3977,67.68
3978,67.67
3979,67.65
3980,67.63
3981,67.61
3982,67.59
3983,67.58
3984,67.58
3985,67.58
3986,67.58
3987,67.58
3988,67.60
3989,67.61
3990,67.63
3991,67.64
3992,67.66
3993,67.67
3994,67.68
3995,67.69
3996,67.70
3997,67.70
3998,67.70
3999,67.70
4000,67.69
4001,67.68
4002,67.67
4003,67.66
4004,67.66
4005,67.65
4006,67.66
4007,67.66
4008,67.66
4009,67.66
4010,67.67
4011,67.69
4012,67.70
4013,67.70
4014,67.70
4015,67.70
4016,67.69
4017,67.68
4018,67.66
4019,67.64
4020,67.61
4021,67.59
4022,67.56
4023,67.54
4024,67.52
4025,67.51
4026,67.50
4027,67.49
4028,67.48
4029,67.48
4030,67.47
4031,67.47
4032,67.47
4033,67.46
4034,67.45
4035,67.44
4036,67.42
4037,67.41
4038,67.39
4039,67.37
4040,67.36
4041,67.35
4042,67.33
4043,67.31
4044,67.30
4045,67.29
4046,67.29
4047,67.29
4048,67.28
4049,67.27
4050,67.26
4051,67.25
4052,67.24
4053,67.22
4054,67.21
4055,67.20
4056,67.19
4057,67.18
4058,67.18
4059,67.17
4060,67.17
4061,67.17
4062,67.18
4063,67.18
4064,67.20
4065,67.21
4066,67.23
4067,67.24
4068,67.26
4069,67.27
4070,67.29
4071,67.29
4072,67.30
4073,67.31
4074,67.31
4075,67.31
4076,67.31
4077,67.32
4078,67.32
4079,67.33
4080,67.35
4081,67.36
4082,67.38
4083,67.41
4084,67.45
4085,67.49
4086,67.54
4087,67.58
4088,67.63
4089,67.68
4090,67.73
4091,67.79
4092,67.84
4093,67.89
4094,67.94
4095,67.98
4096,68.02
4097,68.06
4098,68.09
4099,68.11
4100,68.12
4101,68.12
4102,68.12
4103,68.12
4104,68.11
4105,68.10
4106,68.08
4107,68.06
4108,68.04
4109,68.02
4110,68.01
4111,68.00
4112,68.00
4113,68.00
4114,68.00
4115,68.01
4116,68.01
4117,68.02
4118,68.03
4119,68.04
4120,68.04
4121,68.03
4122,68.01
4123,67.99
4124,67.97
4125,67.95
4126,67.93
4127,67.90
4128,67.87
4129,67.85
4130,67.83
4131,67.81
4132,67.79
4133,67.78
4134,67.76
4135,67.74
4136,67.72
4137,67.71
4138,67.68
4139,67.66
4140,67.64
4141,67.62
4142,67.60
4143,67.58
4144,67.56
4145,67.56
4146,67.56
4147,67.56
4148,67.56
4149,67.57
4150,67.60
4151,67.63
4152,67.66
4153,67.69
4154,67.72
4155,67.75
4156,67.78
4157,67.80
4158,67.82
4159,67.83
4160,67.83
4161,67.83
4162,67.82
4163,67.81
4164,67.80
4165,67.78
4166,67.76
4167,67.74
4168,67.72
4169,67.72
4170,67.72
4171,67.72
4172,67.72
4173,67.73
4174,67.74
4175,67.76
4176,67.78
4177,67.80
4178,67.83
4179,67.85
4180,67.87
4181,67.88
4182,67.89
4183,67.90
4184,67.91
4185,67.92
4186,67.92
4187,67.92
4188,67.92
4189,67.91
4190,67.92
4191,67.93
4192,67.94
4193,67.96
4194,67.98
4195,68.00
4196,68.03
4197,68.06
4198,68.10
4199,68.15
4200,68.19
4201,68.24
4202,68.29
4203,68.33
4204,68.38
4205,68.42
4206,68.46
4207,68.50
4208,68.52
4209,68.54
4210,68.56
4211,68.57
4212,68.58
4213,68.58
4214,68.57
4215,68.56
4216,68.55
4217,68.53
4218,68.50
4219,68.48
4220,68.45
4221,68.42
4222,68.39
4223,68.36
4224,68.33
4225,68.30
4226,68.27
4227,68.25
4228,68.23
4229,68.21
4230,68.19
4231,68.18
4232,68.15
4233,68.14
4234,68.12
4235,68.12
4236,68.11
4237,68.11
4238,68.12
4239,68.12
4240,68.14
4241,68.16
4242,68.19
4243,68.22
4244,68.26
4245,68.29
4246,68.33
4247,68.37
4248,68.41
4249,68.43
4250,68.46
4251,68.48
4252,68.51
4253,68.53
4254,68.54
4255,68.55
4256,68.57
4257,68.58
4258,68.59
4259,68.59
4260,68.60
4261,68.59
4262,68.59
4263,68.57
4264,68.55
4265,68.53
4266,68.50
4267,68.46
4268,68.42
4269,68.38
4270,68.33
4271,68.29
4272,68.25
4273,68.21
4274,68.18
4275,68.16
4276,68.15
4277,68.14
4278,68.13
4279,68.13
4280,68.14
4281,68.15
4282,68.15
4283,68.16
4284,68.17
4285,68.18
4286,68.18
4287,68.17
4288,68.16
4289,68.14
4290,68.12
4291,68.10
4292,68.08
4293,68.06
4294,68.03
4295,68.01
4296,67.98
4297,67.96
4298,67.93
4299,67.90
4300,67.88
4301,67.86
4302,67.85
4303,67.84
4304,67.83
4305,67.82
4306,67.83
4307,67.83
4308,67.84
4309,67.85
4310,67.86
4311,67.88
4312,67.90
4313,67.93
4314,67.94
4315,67.95
4316,67.96
4317,67.96
4318,67.96
4319,67.95
4320,67.94
4321,67.92
4322,67.90
4323,67.87
4324,67.84
4325,67.82
4326,67.79
4327,67.77
4328,67.74
4329,67.72
4330,67.70
4331,67.70
4332,67.70
4333,67.70
4334,67.71
4335,67.72
4336,67.74
4337,67.76
4338,67.78
4339,67.79
4340,67.81
4341,67.81
4342,67.81
4343,67.81
4344,67.79
4345,67.78
4346,67.75
4347,67.72
4348,67.68
4349,67.64
4350,67.59
4351,67.54
4352,67.49
4353,67.44
4354,67.39
4355,67.34
4356,67.30
4357,67.26
4358,67.22
4359,67.19
4360,67.17
4361,67.17
4362,67.17
4363,67.17
4364,67.19
4365,67.22
4366,67.25
4367,67.28
4368,67.31
4369,67.35
4370,67.39
4371,67.42
4372,67.45
4373,67.48
4374,67.50
4375,67.51
4376,67.52
4377,67.53
4378,67.53
4379,67.53
4380,67.52
4381,67.50
4382,67.48
4383,67.46
4384,67.43
4385,67.41
4386,67.40
4387,67.37
4388,67.36
4389,67.34
4390,67.32
4391,67.31
4392,67.31
4393,67.31
4394,67.32
4395,67.34
4396,67.35
4397,67.37
4398,67.38
4399,67.40
4400,67.42
4401,67.44
4402,67.45
4403,67.46
4404,67.46
4405,67.46
4406,67.46
4407,67.45
4408,67.44
4409,67.43
4410,67.42
4411,67.41
4412,67.39
4413,67.38
4414,67.36
4415,67.35
4416,67.34
4417,67.33
4418,67.31
4419,67.29
4420,67.26
4421,67.23
4422,67.20
4423,67.18
4424,67.14
4425,67.11
4426,67.07
4427,67.04
4428,67.02
4429,67.00
4430,66.98
4431,66.97
4432,66.96
4433,66.96
4434,66.96
4435,66.96
4436,66.95
4437,66.95
4438,66.96
4439,66.96
4440,66.95
4441,66.94
4442,66.93
4443,66.93
4444,66.93
4445,66.92
4446,66.93
4447,66.93
4448,66.94
4449,66.95
4450,66.96
4451,66.97
4452,66.99
4453,67.01
4454,67.04
4455,67.07
4456,67.09
4457,67.12
4458,67.15
4459,67.18
4460,67.20
4461,67.23
4462,67.25
4463,67.28
4464,67.30
4465,67.33
4466,67.36
4467,67.39
4468,67.41
4469,67.43
4470,67.45
4471,67.47
4472,67.48
4473,67.50
4474,67.50
4475,67.50
4476,67.50
4477,67.50
4478,67.49
4479,67.48
4480,67.47
4481,67.46
4482,67.45
4483,67.43
4484,67.43
4485,67.42
4486,67.42
4487,67.41
4488,67.41
4489,67.40
4490,67.41
4491,67.41
4492,67.41
4493,67.40
4494,67.39
4495,67.38
4496,67.38
4497,67.37
4498,67.37
4499,67.36
4500,67.34
4501,67.33
4502,67.33
4503,67.32
4504,67.32
4505,67.31
4506,67.30
4507,67.29
4508,67.29
4509,67.29
4510,67.29
4511,67.31
4512,67.32
4513,67.33
4514,67.35
4515,67.36
4516,67.38
4517,67.40
4518,67.42
4519,67.44
4520,67.47
4521,67.49
4522,67.50
4523,67.52
4524,67.53
4525,67.52
4526,67.51
4527,67.50
4528,67.49
4529,67.47
4530,67.45
4531,67.44
4532,67.42
4533,67.41
4534,67.39
4535,67.37
4536,67.36
4537,67.37
4538,67.37
4539,67.37
4540,67.37
4541,67.38
4542,67.40
4543,67.40
4544,67.40
4545,67.39
4546,67.38
4547,67.37
4548,67.36
4549,67.34
4550,67.32
4551,67.30
4552,67.28
4553,67.25
4554,67.22
4555,67.20
4556,67.18
4557,67.15
4558,67.14
4559,67.11
4560,67.10
4561,67.09
4562,67.09
4563,67.09
4564,67.11
4565,67.12
4566,67.15
4567,67.18
4568,67.22
4569,67.25
4570,67.29
4571,67.33
4572,67.37
4573,67.40
4574,67.43
4575,67.45
4576,67.48
4577,67.50
4578,67.53
4579,67.55
4580,67.58
4581,67.60
4582,67.62
4583,67.65
4584,67.68
4585,67.70
4586,67.72
4587,67.72
4588,67.72
4589,67.72
4590,67.71
4591,67.68
4592,67.65
4593,67.61
4594,67.58
4595,67.53
4596,67.49
4597,67.45
4598,67.42
4599,67.39
4600,67.36
4601,67.34
4602,67.33
4603,67.32
4604,67.32
4605,67.32
4606,67.33
4607,67.35
4608,67.37
4609,67.39
4610,67.41
4611,67.44
4612,67.47
4613,67.50
4614,67.53
4615,67.56
4616,67.58
4617,67.60
4618,67.61
4619,67.61
4620,67.61
4621,67.60
4622,67.59
4623,67.58
4624,67.55
4625,67.53
4626,67.52
4627,67.50
4628,67.49
4629,67.48
4630,67.47
4631,67.47
4632,67.47
4633,67.47
4634,67.47
4635,67.47
4636,67.47
4637,67.47
4638,67.47
4639,67.46
4640,67.44
4641,67.43
4642,67.41
4643,67.39
4644,67.37
4645,67.34
4646,67.32
4647,67.30
4648,67.29
4649,67.27
4650,67.27
4651,67.26
4652,67.26
4653,67.26
4654,67.28
4655,67.29
4656,67.31
4657,67.33
4658,67.35
4659,67.37
4660,67.39
4661,67.41
4662,67.43
4663,67.45
4664,67.46
4665,67.47
4666,67.47
4667,67.49
4668,67.49
4669,67.49
4670,67.48
4671,67.49
4672,67.49
4673,67.49
4674,67.49
4675,67.48
4676,67.48
4677,67.49
4678,67.49
4679,67.50
4680,67.51
4681,67.52
4682,67.53
4683,67.54
4684,67.55
4685,67.56
4686,67.57
4687,67.58
4688,67.58
4689,67.57
4690,67.57
4691,67.55
4692,67.54
4693,67.53
4694,67.50
4695,67.48
4696,67.45
4697,67.42
4698,67.40
4699,67.36
4700,67.34
4701,67.32
4702,67.29
4703,67.26
4704,67.24
4705,67.23
4706,67.22
4707,67.21
4708,67.19
4709,67.19
4710,67.18
4711,67.18
4712,67.17
4713,67.15
4714,67.13
4715,67.12
4716,67.11
4717,67.09
4718,67.08
4719,67.07
4720,67.06
4721,67.05
4722,67.05
4723,67.06
4724,67.07
4725,67.08
4726,67.11
4727,67.13
4728,67.16
4729,67.18
4730,67.21
4731,67.23
4732,67.26
4733,67.27
4734,67.29
4735,67.30
4736,67.31
4737,67.32
4738,67.33
4739,67.34
4740,67.35
4741,67.37
4742,67.39
4743,67.40
4744,67.42
4745,67.43
4746,67.44
4747,67.45
4748,67.46
4749,67.46
4750,67.46
4751,67.46
4752,67.44
4753,67.43
4754,67.41
4755,67.39
4756,67.37
4757,67.36
4758,67.35
4759,67.34
4760,67.34
4761,67.34
4762,67.35
4763,67.36
4764,67.37
4765,67.40
4766,67.42
4767,67.45
4768,67.47
4769,67.49
4770,67.52
4771,67.54
4772,67.55
4773,67.57
4774,67.58
4775,67.58
4776,67.59
4777,67.59
4778,67.59
4779,67.58
4780,67.58
4781,67.58
4782,67.58
4783,67.58
4784,67.58
4785,67.58
4786,67.58
4787,67.59
4788,67.59
4789,67.59
4790,67.59
4791,67.59
4792,67.60
4793,67.60
4794,67.61
4795,67.61
4796,67.61
4797,67.61
4798,67.61
4799,67.61
4800,67.62
4801,67.63
4802,67.64
4803,67.64
4804,67.64
4805,67.65
4806,67.65
4807,67.65
4808,67.65
4809,67.65
4810,67.65
4811,67.65
4812,67.65
4813,67.65
4814,67.64
4815,67.63
4816,67.61
4817,67.59
4818,67.58
4819,67.56
4820,67.55
4821,67.53
4822,67.51
4823,67.49
4824,67.48
4825,67.47
4826,67.46
4827,67.45
4828,67.44
4829,67.43
4830,67.43
4831,67.43
4832,67.43
4833,67.43
4834,67.43
4835,67.45
4836,67.47
4837,67.48
4838,67.49
4839,67.50
4840,67.51
4841,67.53
4842,67.54
4843,67.56
4844,67.57
4845,67.58
4846,67.58
4847,67.58
4848,67.58
4849,67.57
4850,67.56
4851,67.54
4852,67.53
4853,67.53
4854,67.52
4855,67.50
4856,67.49
4857,67.48
4858,67.47
4859,67.46
4860,67.45
4861,67.44
4862,67.43
4863,67.43
4864,67.43
4865,67.43
4866,67.43
4867,67.43
4868,67.44
4869,67.45
4870,67.45
4871,67.46
4872,67.47
4873,67.47
4874,67.46
4875,67.46
4876,67.45
4877,67.43
4878,67.41
4879,67.39
4880,67.38
4881,67.36
4882,67.34
4883,67.32
4884,67.30
4885,67.30
4886,67.30
4887,67.30
4888,67.30
4889,67.30
4890,67.31
4891,67.32
4892,67.32
4893,67.33
4894,67.32
4895,67.32
4896,67.31
4897,67.30
4898,67.29
4899,67.26
4900,67.24
4901,67.21
4902,67.18
4903,67.15
4904,67.12
4905,67.10
4906,67.08
4907,67.06
4908,67.04
4909,67.03
4910,67.02
4911,67.02
4912,67.02
4913,67.01
4914,67.01
4915,67.00
4916,67.00
4917,66.98
4918,66.96
4919,66.95
4920,66.94
4921,66.93
4922,66.92
4923,66.91
4924,66.90
4925,66.89
4926,66.89
4927,66.89
4928,66.90
4929,66.92
4930,66.93
4931,66.93
4932,66.94
4933,66.96
4934,66.98
4935,66.99
4936,66.99
4937,67.00
4938,67.01
4939,67.01
4940,67.01
4941,67.01
4942,67.02
4943,67.02
4944,67.02
4945,67.02
4946,67.02
4947,67.02
4948,67.02
4949,67.02
4950,67.02
4951,67.02
4952,67.02
4953,67.01
4954,67.01
4955,67.00
4956,67.00
4957,67.00
4958,67.01
4959,67.01
4960,67.01
4961,67.02
4962,67.02
4963,67.03
4964,67.03
4965,67.02
4966,67.01
4967,67.00
4968,67.00
4969,66.98
4970,66.96
4971,66.94
4972,66.92
4973,66.91
4974,66.90
4975,66.89
4976,66.88
4977,66.87
4978,66.88
4979,66.89
4980,66.90
4981,66.93
4982,66.95
4983,66.97
4984,66.99
4985,67.01
4986,67.03
4987,67.03
4988,67.03
4989,67.03
4990,67.03
4991,67.02
4992,67.01
4993,66.99
4994,66.98
4995,66.98
4996,66.97
4997,66.97
4998,66.98
4999,66.99
5000,67.00
5001,67.02
5002,67.04
5003,67.06
5004,67.07
5005,67.09
5006,67.10
5007,67.11
5008,67.11
5009,67.11
5010,67.11
5011,67.10
5012,67.10
5013,67.09
5014,67.08
5015,67.07
5016,67.06
5017,67.06
5018,67.06
5019,67.06
5020,67.07
5021,67.08
5022,67.09
5023,67.10
5024,67.11
5025,67.11
5026,67.11
5027,67.11
5028,67.11
5029,67.10
5030,67.09
5031,67.08
5032,67.07
5033,67.07
5034,67.06
5035,67.06
5036,67.06
5037,67.06
5038,67.07
5039,67.09
5040,67.11
5041,67.13
5042,67.16
5043,67.19
5044,67.22
5045,67.26
5046,67.29
5047,67.32
5048,67.35
5049,67.37
5050,67.40
5051,67.42
5052,67.43
5053,67.44
5054,67.45
5055,67.46
5056,67.46
5057,67.45
5058,67.44
5059,67.43
5060,67.41
5061,67.39
5062,67.37
5063,67.35
5064,67.33
5065,67.31
5066,67.29
5067,67.28
5068,67.26
5069,67.25
5070,67.25
5071,67.25
5072,67.24
5073,67.22
5074,67.21
5075,67.19
5076,67.18
5077,67.15
5078,67.13
5079,67.11
5080,67.08
5081,67.06
5082,67.04
5083,67.02
5084,67.02
5085,67.02
5086,67.03
5087,67.04
5088,67.07
5089,67.10
5090,67.13
5091,67.16
5092,67.20
5093,67.23
5094,67.27
5095,67.31
5096,67.34
5097,67.35
5098,67.37
5099,67.38
5100,67.39
5101,67.39
5102,67.38
5103,67.37
5104,67.36
5105,67.34
5106,67.32
5107,67.31
5108,67.30
5109,67.29
5110,67.28
5111,67.28
5112,67.28
5113,67.28
5114,67.29
5115,67.30
5116,67.32
5117,67.33
5118,67.35
5119,67.36
5120,67.37
5121,67.37
5122,67.38
5123,67.39
5124,67.40
5125,67.40
5126,67.40
5127,67.40
5128,67.40
5129,67.40
5130,67.40
5131,67.40
5132,67.41
5133,67.40
5134,67.39
5135,67.38
5136,67.37
5137,67.36
5138,67.35
5139,67.34
5140,67.32
5141,67.31
5142,67.30
5143,67.29
5144,67.29
5145,67.30
5146,67.31
5147,67.32
5148,67.32
5149,67.33
5150,67.34
5151,67.36
5152,67.37
5153,67.39
5154,67.40
5155,67.42
5156,67.43
5157,67.44
5158,67.45
5159,67.47
5160,67.48
5161,67.49
5162,67.51
5163,67.52
5164,67.54
5165,67.56
5166,67.57
5167,67.58
5168,67.58
5169,67.59
5170,67.59
5171,67.59
5172,67.59
5173,67.58
5174,67.58
5175,67.57
5176,67.56
5177,67.55
5178,67.54
5179,67.54
5180,67.54
5181,67.54
5182,67.54
5183,67.55
5184,67.56
5185,67.58
5186,67.59
5187,67.61
5188,67.62
5189,67.64
5190,67.66
5191,67.68
5192,67.69
5193,67.70
5194,67.71
5195,67.72
5196,67.73
5197,67.73
5198,67.73
5199,67.73
5200,67.73
5201,67.72
5202,67.71
5203,67.70
5204,67.69
5205,67.69
5206,67.69
5207,67.69
5208,67.70
5209,67.70
5210,67.70
5211,67.71
5212,67.71
5213,67.72
5214,67.72
5215,67.73
5216,67.73
5217,67.73
5218,67.74
5219,67.74
5220,67.75
5221,67.76
5222,67.77
5223,67.79
5224,67.80
5225,67.83
5226,67.85
5227,67.86
5228,67.88
5229,67.90
5230,67.91
5231,67.92
5232,67.91
5233,67.90
5234,67.89
5235,67.86
5236,67.84
5237,67.80
5238,67.77
5239,67.75
5240,67.73
5241,67.72
5242,67.70
5243,67.69
5244,67.69
5245,67.70
5246,67.70
5247,67.72
5248,67.73
5249,67.74
5250,67.75
5251,67.76
5252,67.76
5253,67.77
5254,67.76
5255,67.76
5256,67.76
5257,67.75
5258,67.74
5259,67.72
5260,67.71
5261,67.70
5262,67.69
5263,67.67
5264,67.66
5265,67.66
5266,67.66
5267,67.66
5268,67.66
5269,67.66
5270,67.67
5271,67.68
5272,67.68
5273,67.69
5274,67.69
5275,67.69
5276,67.69
5277,67.68
5278,67.68
5279,67.67
5280,67.65
5281,67.65
5282,67.64
5283,67.64
5284,67.64
5285,67.64
5286,67.66
5287,67.68
5288,67.70
5289,67.72
5290,67.74
5291,67.77
5292,67.80
5293,67.82
5294,67.84
5295,67.85
5296,67.86
5297,67.87
5298,67.86
5299,67.86
5300,67.86
5301,67.85
5302,67.85
5303,67.85
5304,67.85
5305,67.86
5306,67.87
5307,67.89
5308,67.91
5309,67.93
5310,67.94
5311,67.96
5312,67.97
5313,67.98
5314,67.97
5315,67.97
5316,67.96
5317,67.94
5318,67.92
5319,67.90
5320,67.88
5321,67.86
5322,67.84
5323,67.83
5324,67.82
5325,67.81
5326,67.81
5327,67.82
5328,67.83
5329,67.85
5330,67.87
5331,67.88
5332,67.90
5333,67.93
5334,67.95
5335,67.97
5336,67.99
5337,68.00
5338,68.02
5339,68.04
5340,68.05
5341,68.07
5342,68.08
5343,68.08
5344,68.07
5345,68.07
5346,68.06
5347,68.05
5348,68.03
5349,68.02
5350,68.00
5351,67.99
5352,67.97
5353,67.96
5354,67.95
5355,67.95
5356,67.95
5357,67.95
5358,67.96
5359,67.97
5360,67.97
5361,67.97
5362,67.98
5363,67.98
5364,67.98
5365,67.97
5366,67.97
5367,67.95
5368,67.94
5369,67.92
5370,67.90
5371,67.88
5372,67.86
5373,67.84
5374,67.82
5375,67.79
5376,67.78
5377,67.76
5378,67.75
5379,67.74
5380,67.72
5381,67.70
5382,67.68
5383,67.67
5384,67.65
5385,67.64
5386,67.62
5387,67.61
5388,67.58
5389,67.56
5390,67.54
5391,67.52
5392,67.51
5393,67.49
5394,67.48
5395,67.47
5396,67.47
5397,67.46
5398,67.47
5399,67.48
5400,67.49
5401,67.51
5402,67.53
5403,67.54
5404,67.56
5405,67.58
5406,67.59
5407,67.60
5408,67.61
5409,67.61
5410,67.61
5411,67.60
5412,67.58
5413,67.57
5414,67.56
5415,67.53
5416,67.50
5417,67.46
5418,67.42
5419,67.37
5420,67.32
5421,67.26
5422,67.19
5423,67.13
5424,67.07
5425,67.00
5426,66.93
5427,66.86
5428,66.81
5429,66.75
5430,66.71
5431,66.67
5432,66.64
5433,66.61
5434,66.58
5435,66.56
5436,66.55
5437,66.54
5438,66.53
5439,66.53
5440,66.52
5441,66.51
5442,66.51
5443,66.50
5444,66.51
5445,66.52
5446,66.53
5447,66.54
5448,66.56
5449,66.57
5450,66.60
5451,66.62
5452,66.65
5453,66.68
5454,66.72
5455,66.75
5456,66.80
5457,66.83
5458,66.88
5459,66.93
5460,66.98
5461,67.03
5462,67.08
5463,67.12
5464,67.17
5465,67.21
5466,67.25
5467,67.28
5468,67.29
5469,67.30
5470,67.30
5471,67.30
5472,67.29
5473,67.28
5474,67.26
5475,67.24
5476,67.23
5477,67.23
5478,67.22
5479,67.23
5480,67.23
5481,67.25
5482,67.26
5483,67.29
5484,67.31
5485,67.33
5486,67.35
5487,67.36
5488,67.37
5489,67.37
5490,67.36
5491,67.35
5492,67.34
5493,67.33
5494,67.33
5495,67.32
5496,67.31
5497,67.31
5498,67.32
5499,67.32
5500,67.34
5501,67.36
5502,67.38
5503,67.40
5504,67.41
5505,67.43
5506,67.43
5507,67.44
5508,67.44
5509,67.44
5510,67.43
5511,67.41
5512,67.40
5513,67.38
5514,67.36
5515,67.35
5516,67.33
5517,67.32
5518,67.31
5519,67.30
5520,67.29
5521,67.27
5522,67.26
5523,67.25
5524,67.23
5525,67.21
5526,67.19
5527,67.16
5528,67.12
5529,67.08
5530,67.04
5531,67.00
5532,66.95
5533,66.91
5534,66.87
5535,66.83
5536,66.79
5537,66.76
5538,66.73
5539,66.71
5540,66.68
5541,66.67
5542,66.65
5543,66.65
5544,66.64
5545,66.63
5546,66.63
5547,66.63
5548,66.64
5549,66.65
5550,66.65
5551,66.66
5552,66.67
5553,66.68
5554,66.70
5555,66.70
5556,66.70
5557,66.71
5558,66.70
5559,66.70
5560,66.68
5561,66.66
5562,66.64
5563,66.62
5564,66.59
5565,66.56
5566,66.53
5567,66.50
5568,66.47
5569,66.44
5570,66.40
5571,66.38
5572,66.35
5573,66.33
5574,66.30
5575,66.28
5576,66.26
5577,66.25
5578,66.24
5579,66.25
5580,66.25
5581,66.26
5582,66.26
5583,66.26
5584,66.25
5585,66.24
5586,66.22
5587,66.21
5588,66.20
5589,66.20
5590,66.18
5591,66.17
5592,66.14
5593,66.12
5594,66.10
5595,66.08
5596,66.06
5597,66.04
5598,66.02
5599,65.99
5600,65.97
5601,65.95
5602,65.94
5603,65.93
5604,65.92
5605,65.91
5606,65.90
5607,65.90
5608,65.89
5609,65.88
5610,65.86
5611,65.85
5612,65.83
5613,65.80
5614,65.77
5615,65.75
5616,65.72
5617,65.70
5618,65.67
5619,65.64
5620,65.61
5621,65.58
5622,65.56
5623,65.54
5624,65.53
5625,65.52
5626,65.51
5627,65.50
5628,65.50
5629,65.50
5630,65.50
5631,65.50
5632,65.49
5633,65.48
5634,65.46
5635,65.44
5636,65.41
5637,65.37
5638,65.32
5639,65.26
5640,65.20
5641,65.13
5642,65.07
5643,65.01
5644,64.95
5645,64.90
5646,64.85
5647,64.83
5648,64.81
5649,64.81
5650,64.81
5651,64.82
5652,64.83
5653,64.85
5654,64.87
5655,64.88
5656,64.88
5657,64.88
5658,64.86
5659,64.83
5660,64.79
5661,64.74
5662,64.69
5663,64.63
5664,64.57
5665,64.51
5666,64.44
5667,64.38
5668,64.32
5669,64.27
5670,64.22
5671,64.17
5672,64.12
5673,64.08
5674,64.04
5675,64.01
5676,63.97
5677,63.93
5678,63.89
5679,63.85
5680,63.80
5681,63.77
5682,63.72
5683,63.68
5684,63.64
5685,63.59
5686,63.54
5687,63.49
5688,63.45
5689,63.41
5690,63.37
5691,63.33
5692,63.29
5693,63.27
5694,63.24
5695,63.22
5696,63.20
5697,63.17
5698,63.15
5699,63.13
5700,63.11
5701,63.08
5702,63.05
5703,63.01
5704,62.97
5705,62.93
5706,62.87
5707,62.81
5708,62.75
5709,62.68
5710,62.62
5711,62.57
5712,62.53
5713,62.49
5714,62.45
5715,62.43
5716,62.41
5717,62.42
5718,62.44
5719,62.46
5720,62.49
5721,62.51
5722,62.54
5723,62.58
5724,62.61
5725,62.63
5726,62.65
5727,62.66
5728,62.66
5729,62.66
5730,62.64
5731,62.62
5732,62.59
5733,62.56
5734,62.52
5735,62.47
5736,62.41
5737,62.36
5738,62.30
5739,62.24
5740,62.18
5741,62.11
5742,62.05
5743,61.99
5744,61.93
5745,61.87
5746,61.82
5747,61.78
5748,61.73
5749,61.70
5750,61.67
5751,61.65
5752,61.62
5753,61.60
5754,61.58
5755,61.55
5756,61.52
5757,61.50
5758,61.47
5759,61.43
5760,61.40
5761,61.37
5762,61.34
5763,61.31
5764,61.29
5765,61.27
5766,61.26
5767,61.25
5768,61.25
5769,61.26
5770,61.27
5771,61.29
5772,61.31
5773,61.32
5774,61.34
5775,61.35
5776,61.36
5777,61.37
5778,61.38
5779,61.37
5780,61.36
5781,61.35
5782,61.33
5783,61.30
5784,61.27
5785,61.24
5786,61.20
5787,61.16
5788,61.13
5789,61.09
5790,61.05
5791,61.01
5792,60.96
5793,60.93
5794,60.89
5795,60.85
5796,60.81
5797,60.79
5798,60.77
5799,60.75
5800,60.74
5801,60.74
5802,60.73
5803,60.74
5804,60.76
5805,60.79
5806,60.81
5807,60.83
5808,60.85
5809,60.88
5810,60.90
5811,60.92
5812,60.94
5813,60.96
5814,60.99
5815,61.00
5816,61.01
5817,61.02
5818,61.03
5819,61.04
5820,61.04
5821,61.04
5822,61.03
5823,61.01
5824,60.99
5825,60.97
5826,60.95
5827,60.92
5828,60.89
5829,60.85
5830,60.81
5831,60.76
5832,60.72
5833,60.68
5834,60.64
5835,60.60
5836,60.57
5837,60.53
5838,60.50
5839,60.49
5840,60.46
5841,60.43
5842,60.41
5843,60.39
5844,60.36
5845,60.34
5846,60.31
5847,60.28
5848,60.26
5849,60.23
5850,60.20
5851,60.16
5852,60.12
5853,60.09
5854,60.06
5855,60.02
5856,59.98
5857,59.95
5858,59.91
5859,59.87
5860,59.82
5861,59.77
5862,59.74
5863,59.71
5864,59.68
5865,59.65
5866,59.63
5867,59.61
5868,59.60
5869,59.60
5870,59.61
5871,59.62
5872,59.62
5873,59.63
5874,59.64
5875,59.65
5876,59.66
5877,59.67
5878,59.66
5879,59.66
5880,59.65
5881,59.64
5882,59.62
5883,59.60
5884,59.58
5885,59.56
5886,59.54
5887,59.52
5888,59.50
5889,59.47
5890,59.45
5891,59.43
5892,59.41
5893,59.39
5894,59.36
5895,59.34
5896,59.33
5897,59.31
5898,59.29
5899,59.27
5900,59.27
5901,59.27
5902,59.27
5903,59.27
5904,59.27
5905,59.27
5906,59.27
5907,59.27
5908,59.27
5909,59.26
5910,59.24
5911,59.22
5912,59.19
5913,59.17
5914,59.13
5915,59.09
5916,59.04
5917,58.99
5918,58.95
5919,58.91
5920,58.88
5921,58.85
5922,58.82
5923,58.80
5924,58.78
5925,58.77
5926,58.76
5927,58.75
5928,58.73
5929,58.72
5930,58.69
5931,58.66
5932,58.63
5933,58.59
5934,58.55
5935,58.50
5936,58.45
5937,58.40
5938,58.34
5939,58.28
5940,58.21
5941,58.15
5942,58.10
5943,58.06
5944,58.00
5945,57.95
5946,57.90
5947,57.85
5948,57.81
5949,57.77
5950,57.72
5951,57.68
5952,57.64
5953,57.61
5954,57.59
5955,57.56
5956,57.54
5957,57.53
5958,57.53
5959,57.53
5960,57.53
5961,57.54
5962,57.55
5963,57.55
5964,57.56
5965,57.57
5966,57.57
5967,57.57
5968,57.56
5969,57.56
5970,57.55
5971,57.53
5972,57.50
5973,57.48
5974,57.44
5975,57.40
5976,57.35
5977,57.30
5978,57.24
5979,57.18
5980,57.12
5981,57.06
5982,57.00
5983,56.95
5984,56.90
5985,56.86
5986,56.82
5987,56.79
5988,56.77
5989,56.75
5990,56.74
5991,56.74
5992,56.72
5993,56.72
5994,56.71
5995,56.70
5996,56.67
5997,56.64
5998,56.60
5999,56.56
6000,56.50
6001,56.45
6002,56.39
6003,56.33
6004,56.26
6005,56.20
6006,56.12
6007,56.06
6008,55.99
6009,55.94
6010,55.88
6011,55.83
6012,55.77
6013,55.72
6014,55.67
6015,55.63
6016,55.58
6017,55.53
6018,55.48
6019,55.45
6020,55.41
6021,55.38
6022,55.35
6023,55.32
6024,55.30
6025,55.28
6026,55.26
6027,55.24
6028,55.22
6029,55.20
6030,55.18
6031,55.17
6032,55.14
6033,55.11
6034,55.09
6035,55.06
6036,55.03
6037,55.00
6038,54.97
6039,54.94
6040,54.91
6041,54.89
6042,54.86
6043,54.84
6044,54.81
6045,54.79
6046,54.76
6047,54.74
6048,54.71
6049,54.69
6050,54.65
6051,54.63
6052,54.59
6053,54.55
6054,54.50
6055,54.45
6056,54.40
6057,54.35
6058,54.30
6059,54.25
6060,54.20
6061,54.15
6062,54.10
6063,54.06
6064,54.01
6065,53.97
6066,53.93
6067,53.88
6068,53.84
6069,53.79
6070,53.75
6071,53.71
6072,53.66
6073,53.61
6074,53.56
6075,53.52
6076,53.47
6077,53.43
6078,53.39
6079,53.36
6080,53.34
6081,53.32
6082,53.31
6083,53.30
6084,53.29
6085,53.28
6086,53.26
6087,53.25
6088,53.23
6089,53.21
6090,53.18
6091,53.15
6092,53.12
6093,53.08
6094,53.03
6095,52.98
6096,52.94
6097,52.89
6098,52.84
6099,52.81
6100,52.77
6101,52.74
6102,52.71
6103,52.68
6104,52.65
6105,52.62
6106,52.58
6107,52.55
6108,52.52
6109,52.49
6110,52.45
6111,52.42
6112,52.39
6113,52.36
6114,52.33
6115,52.29
6116,52.26
6117,52.24
6118,52.21
6119,52.18
6120,52.15
6121,52.11
6122,52.07
6123,52.03
6124,51.98
6125,51.93
6126,51.88
6127,51.83
6128,51.78
6129,51.74
6130,51.69
6131,51.66
6132,51.62
6133,51.60
6134,51.58
6135,51.56
6136,51.54
6137,51.53
6138,51.51
6139,51.49
6140,51.46
6141,51.43
6142,51.39
6143,51.37
6144,51.34
6145,51.32
6146,51.29
6147,51.28
6148,51.27
6149,51.27
6150,51.28
6151,51.29
6152,51.32
6153,51.34
6154,51.36
6155,51.38
6156,51.40
6157,51.42
6158,51.43
6159,51.44
6160,51.44
6161,51.44
6162,51.43
6163,51.40
6164,51.39
6165,51.37
6166,51.35
6167,51.33
6168,51.30
6169,51.28
6170,51.26
6171,51.25
6172,51.23
6173,51.22
6174,51.22
6175,51.21
6176,51.21
6177,51.21
6178,51.22
6179,51.22
6180,51.22
6181,51.21
6182,51.22
6183,51.21
6184,51.20
6185,51.18
6186,51.16
6187,51.14
6188,51.12
6189,51.10
6190,51.08
6191,51.07
6192,51.07
6193,51.06
6194,51.06
6195,51.07
6196,51.09
6197,51.12
6198,51.14
6199,51.16
6200,51.18
6201,51.20
6202,51.20
6203,51.20
6204,51.19
6205,51.17
6206,51.14
6207,51.10
6208,51.05
6209,50.99
6210,50.92
6211,50.85
6212,50.78
6213,50.70
6214,50.63
6215,50.56
6216,50.49
6217,50.42
6218,50.35
6219,50.28
6220,50.21
6221,50.15
6222,50.09
6223,50.03
6224,49.97
6225,49.92
6226,49.88
6227,49.85
6228,49.82
6229,49.80
6230,49.78
6231,49.78
6232,49.78
6233,49.78
6234,49.78
6235,49.77
6236,49.77
6237,49.76
6238,49.74
6239,49.72
6240,49.69
6241,49.66
6242,49.63
6243,49.59
6244,49.55
6245,49.50
6246,49.47
6247,49.44
6248,49.42
6249,49.41
6250,49.40
6251,49.40
6252,49.41
6253,49.42
6254,49.44
6255,49.46
6256,49.48
6257,49.49
6258,49.51
6259,49.51
6260,49.52
6261,49.53
6262,49.53
6263,49.52
6264,49.52
6265,49.51
6266,49.51
6267,49.51
6268,49.50
6269,49.48
6270,49.48
6271,49.47
6272,49.47
6273,49.46
6274,49.45
6275,49.44
6276,49.42
6277,49.41
6278,49.40
6279,49.40
6280,49.39
6281,49.38
6282,49.38
6283,49.38
6284,49.39
6285,49.40
6286,49.42
6287,49.43
6288,49.45
6289,49.48
6290,49.51
6291,49.53
6292,49.56
6293,49.59
6294,49.62
6295,49.65
6296,49.67
6297,49.68
6298,49.68
6299,49.68
6300,49.66
6301,49.65
6302,49.62
6303,49.59
6304,49.55
6305,49.50
6306,49.45
6307,49.41
6308,49.36
6309,49.32
6310,49.27
6311,49.23
6312,49.19
6313,49.16
6314,49.14
6315,49.12
6316,49.11
6317,49.10
6318,49.08
6319,49.06
6320,49.03
6321,49.01
6322,48.98
6323,48.94
6324,48.89
6325,48.83
6326,48.76
6327,48.69
6328,48.62
6329,48.54
6330,48.46
6331,48.39
6332,48.30
6333,48.23
6334,48.17
6335,48.12
6336,48.08
6337,48.05
6338,48.03
6339,48.01
6340,48.00
6341,47.99
6342,47.99
6343,47.98
6344,47.96
6345,47.95
6346,47.92
6347,47.89
6348,47.85
6349,47.80
6350,47.75
6351,47.71
6352,47.66
6353,47.62
6354,47.56
6355,47.53
6356,47.49
6357,47.46
6358,47.43
6359,47.41
6360,47.39
6361,47.38
6362,47.37
6363,47.36
6364,47.34
6365,47.33
6366,47.31
6367,47.30
6368,47.28
6369,47.26
6370,47.24
6371,47.22
6372,47.20
6373,47.17
6374,47.15
6375,47.12
6376,47.09
6377,47.06
6378,47.03
6379,46.99
6380,46.95
6381,46.92
6382,46.88
6383,46.85
6384,46.82
6385,46.79
6386,46.77
6387,46.76
6388,46.74
6389,46.73
6390,46.73
6391,46.72
6392,46.73
6393,46.73
6394,46.73
6395,46.72
6396,46.71
6397,46.70
6398,46.69
6399,46.66
6400,46.63
6401,46.60
6402,46.57
6403,46.52
6404,46.47
6405,46.42
6406,46.38
6407,46.33
6408,46.29
6409,46.26
6410,46.22
6411,46.19
6412,46.16
6413,46.14
6414,46.13
6415,46.12
6416,46.10
6417,46.09
6418,46.08
6419,46.06
6420,46.04
6421,46.02
6422,45.99
6423,45.95
6424,45.91
6425,45.87
6426,45.83
6427,45.79
6428,45.75
6429,45.71
6430,45.68
6431,45.65
6432,45.63
6433,45.62
6434,45.61
6435,45.61
6436,45.61
6437,45.61
6438,45.62
6439,45.64
6440,45.65
6441,45.66
6442,45.67
6443,45.67
6444,45.67
6445,45.68
6446,45.67
6447,45.66
6448,45.65
6449,45.64
6450,45.63
6451,45.61
6452,45.60
6453,45.58
6454,45.56
6455,45.53
6456,45.51
6457,45.49
6458,45.48
6459,45.47
6460,45.45
6461,45.43
6462,45.42
6463,45.42
6464,45.42
6465,45.41
6466,45.41
6467,45.41
6468,45.41
6469,45.40
6470,45.39
6471,45.38
6472,45.36
6473,45.34
6474,45.31
6475,45.27
6476,45.22
6477,45.18
6478,45.13
6479,45.08
6480,45.04
6481,44.99
6482,44.94
6483,44.91
6484,44.88
6485,44.85
6486,44.83
6487,44.81
6488,44.79
6489,44.78
6490,44.77
6491,44.76
6492,44.76
6493,44.75
6494,44.74
6495,44.73
6496,44.72
6497,44.70
6498,44.68
6499,44.67
6500,44.65
6501,44.64
6502,44.61
6503,44.59
6504,44.56
6505,44.55
6506,44.52
6507,44.50
6508,44.47
6509,44.45
6510,44.42
6511,44.40
6512,44.37
6513,44.35
6514,44.33
6515,44.30
6516,44.28
6517,44.25
6518,44.22
6519,44.21
6520,44.20
6521,44.19
6522,44.18
6523,44.17
6524,44.16
6525,44.16
6526,44.15
6527,44.15
6528,44.14
6529,44.13
6530,44.12
6531,44.11
6532,44.09
6533,44.07
6534,44.05
6535,44.03
6536,44.01
6537,43.99
6538,43.97
6539,43.96
6540,43.95
6541,43.93
6542,43.92
6543,43.91
6544,43.91
6545,43.91
6546,43.91
6547,43.91
6548,43.91
6549,43.90
6550,43.90
6551,43.89
6552,43.87
6553,43.84
6554,43.82
6555,43.80
6556,43.78
6557,43.75
6558,43.71
6559,43.68
6560,43.65
6561,43.62
6562,43.59
6563,43.56
6564,43.53
6565,43.50
6566,43.47
6567,43.45
6568,43.42
6569,43.40
6570,43.38
6571,43.36
6572,43.33
6573,43.31
6574,43.29
6575,43.27
6576,43.26
6577,43.25
6578,43.25
6579,43.26
6580,43.27
6581,43.30
6582,43.33
6583,43.37
6584,43.40
6585,43.44
6586,43.48
6587,43.53
6588,43.57
6589,43.61
6590,43.64
6591,43.66
6592,43.68
6593,43.70
6594,43.70
6595,43.70
6596,43.69
6597,43.67
6598,43.66
6599,43.64
6600,43.62
6601,43.60
6602,43.58
6603,43.56
6604,43.55
6605,43.53
6606,43.51
6607,43.49
6608,43.48
6609,43.47
6610,43.44
6611,43.41
6612,43.38
6613,43.36
6614,43.34
6615,43.32
6616,43.31
6617,43.30
6618,43.29
6619,43.29
6620,43.29
6621,43.30
6622,43.31
6623,43.32
6624,43.34
6625,43.36
6626,43.37
6627,43.38
6628,43.40
6629,43.41
6630,43.42
6631,43.43
6632,43.43
6633,43.44
6634,43.44
6635,43.45
6636,43.47
6637,43.48
6638,43.50
6639,43.52
6640,43.54
6641,43.55
6642,43.57
6643,43.58
6644,43.59
6645,43.60
6646,43.60
6647,43.59
6648,43.59
6649,43.58
6650,43.57
6651,43.56
6652,43.55
6653,43.55
6654,43.55
6655,43.55
6656,43.56
6657,43.57
6658,43.59
6659,43.60
6660,43.62
6661,43.63
6662,43.65
6663,43.66
6664,43.66
6665,43.66
6666,43.65
6667,43.65
6668,43.63
6669,43.62
6670,43.59
6671,43.56
6672,43.52
6673,43.50
6674,43.47
6675,43.44
6676,43.41
6677,43.38
6678,43.36
6679,43.33
6680,43.31
6681,43.28
6682,43.26
6683,43.23
6684,43.21
6685,43.19
6686,43.17
6687,43.15
6688,43.12
6689,43.10
6690,43.07
6691,43.05
6692,43.03
6693,43.01
6694,42.99
6695,42.97
6696,42.95
6697,42.94
6698,42.93
6699,42.92
6700,42.91
6701,42.91
6702,42.92
6703,42.93
6704,42.94
6705,42.95
6706,42.96
6707,42.98
6708,43.00
6709,43.02
6710,43.04
6711,43.06
6712,43.08
6713,43.10
6714,43.12
6715,43.13
6716,43.15
6717,43.16
6718,43.18
6719,43.19
6720,43.21
6721,43.22
6722,43.23
6723,43.25
6724,43.27
6725,43.29
6726,43.31
6727,43.33
6728,43.35
6729,43.38
6730,43.40
6731,43.42
6732,43.44
6733,43.46
6734,43.47
6735,43.48
6736,43.50
6737,43.51
6738,43.53
6739,43.54
6740,43.55
6741,43.55
6742,43.56
6743,43.58
6744,43.59
6745,43.60
6746,43.60
6747,43.61
6748,43.61
6749,43.61
6750,43.61
6751,43.60
6752,43.59
6753,43.57
6754,43.56
6755,43.54
6756,43.52
6757,43.50
6758,43.48
6759,43.46
6760,43.44
6761,43.42
6762,43.40
6763,43.38
6764,43.37
6765,43.36
6766,43.35
6767,43.34
6768,43.34
6769,43.34
6770,43.34
6771,43.34
6772,43.33
6773,43.34
6774,43.34
6775,43.34
6776,43.34
6777,43.33
6778,43.33
6779,43.33
6780,43.32
6781,43.30
6782,43.28
6783,43.26
6784,43.25
6785,43.22
6786,43.19
6787,43.16
6788,43.13
6789,43.10
6790,43.08
6791,43.06
6792,43.05
6793,43.04
6794,43.03
6795,43.04
6796,43.05
6797,43.07
6798,43.09
6799,43.12
6800,43.16
6801,43.20
6802,43.24
6803,43.28
6804,43.32
6805,43.35
6806,43.38
6807,43.41
6808,43.44
6809,43.47
6810,43.48
6811,43.48
6812,43.48
6813,43.48
6814,43.47
6815,43.46
6816,43.43
6817,43.41
6818,43.38
6819,43.35
6820,43.31
6821,43.28
6822,43.26
6823,43.23
6824,43.21
6825,43.20
6826,43.18
6827,43.17
6828,43.15
6829,43.15
6830,43.13
6831,43.11
6832,43.08
6833,43.06
6834,43.02
6835,42.99
6836,42.94
6837,42.90
6838,42.86
6839,42.82
6840,42.78
6841,42.75
6842,42.73
6843,42.71
6844,42.70
6845,42.70
6846,42.70
6847,42.71
6848,42.73
6849,42.74
6850,42.76
6851,42.78
6852,42.80
6853,42.82
6854,42.84
6855,42.86
6856,42.88
6857,42.90
6858,42.93
6859,42.95
6860,42.98
6861,43.01
6862,43.03
6863,43.05
6864,43.06
6865,43.07
6866,43.08
6867,43.09
6868,43.10
6869,43.10
6870,43.10
6871,43.10
6872,43.11
6873,43.11
6874,43.12
6875,43.12
6876,43.12
6877,43.12
6878,43.14
6879,43.16
6880,43.17
6881,43.18
6882,43.20
6883,43.22
6884,43.25
6885,43.28
6886,43.30
6887,43.32
6888,43.34
6889,43.36
6890,43.37
6891,43.38
6892,43.39
6893,43.39
6894,43.39
6895,43.39
6896,43.39
6897,43.38
6898,43.38
6899,43.38
6900,43.38
6901,43.40
6902,43.42
6903,43.45
6904,43.48
6905,43.51
6906,43.54
6907,43.57
6908,43.60
6909,43.63
6910,43.65
6911,43.66
6912,43.66
6913,43.66
6914,43.63
6915,43.61
6916,43.58
6917,43.55
6918,43.52
6919,43.49
6920,43.45
6921,43.42
6922,43.39
6923,43.37
6924,43.34
6925,43.33
6926,43.32
6927,43.31
6928,43.31
6929,43.30
6930,43.30
6931,43.30
6932,43.30
6933,43.30
6934,43.31
6935,43.31
6936,43.32
6937,43.33
6938,43.33
6939,43.34
6940,43.34
6941,43.34
6942,43.34
6943,43.34
6944,43.34
6945,43.33
6946,43.33
6947,43.31
6948,43.30
6949,43.29
6950,43.28
6951,43.27
6952,43.27
6953,43.27
6954,43.28
6955,43.29
6956,43.31
6957,43.33
6958,43.36
6959,43.38
6960,43.41
6961,43.43
6962,43.45
6963,43.46
6964,43.47
6965,43.48
6966,43.49
6967,43.49
6968,43.48
6969,43.48
6970,43.47
6971,43.47
6972,43.46
6973,43.46
6974,43.45
6975,43.46
6976,43.46
6977,43.47
6978,43.48
6979,43.49
6980,43.50
6981,43.51
6982,43.53
6983,43.55
6984,43.58
6985,43.59
6986,43.61
6987,43.63
6988,43.66
6989,43.66
6990,43.67
6991,43.67
6992,43.67
6993,43.67
6994,43.67
6995,43.67
6996,43.67
6997,43.67
6998,43.67
6999,43.66
7000,43.66
7001,43.66
7002,43.65
7003,43.66
7004,43.66
7005,43.66
7006,43.66
7007,43.66
7008,43.67
7009,43.68
7010,43.70
7011,43.72
7012,43.74
7013,43.77
7014,43.81
7015,43.85
7016,43.89
7017,43.92
7018,43.96
7019,44.00
7020,44.03
7021,44.05
7022,44.06
7023,44.07
7024,44.07
7025,44.06
7026,44.04
7027,44.02
7028,44.00
7029,43.98
7030,43.95
7031,43.93
7032,43.91
7033,43.89
7034,43.87
7035,43.85
7036,43.84
7037,43.83
7038,43.81
7039,43.79
7040,43.77
7041,43.76
7042,43.74
7043,43.72
7044,43.68
7045,43.64
7046,43.61
7047,43.58
7048,43.55
7049,43.52
7050,43.49
7051,43.46
7052,43.44
7053,43.44
7054,43.43
7055,43.44
7056,43.44
7057,43.45
7058,43.46
7059,43.47
7060,43.48
7061,43.50
7062,43.51
7063,43.52
7064,43.52
7065,43.54
7066,43.55
7067,43.56
7068,43.58
7069,43.59
7070,43.62
7071,43.65
7072,43.67
7073,43.70
7074,43.74
7075,43.77
7076,43.80
7077,43.83
7078,43.86
7079,43.88
7080,43.90
7081,43.91
7082,43.91
7083,43.91
7084,43.92
7085,43.92
7086,43.91
7087,43.91
7088,43.90
7089,43.90
7090,43.90
7091,43.90
7092,43.91
7093,43.91
7094,43.92
7095,43.94
7096,43.95
7097,43.96
7098,43.97
7099,43.99
7100,44.00
7101,44.00
7102,44.00
7103,43.99
7104,43.98
7105,43.98
7106,43.96
7107,43.94
7108,43.91
7109,43.88
7110,43.84
7111,43.81
7112,43.78
7113,43.75
7114,43.73
7115,43.70
7116,43.68
7117,43.66
7118,43.64
7119,43.63
7120,43.62
7121,43.62
7122,43.62
7123,43.63
7124,43.63
7125,43.65
7126,43.66
7127,43.68
7128,43.69
7129,43.70
7130,43.71
7131,43.71
7132,43.72
7133,43.72
7134,43.72
7135,43.70
7136,43.69
7137,43.68
7138,43.66
7139,43.66
7140,43.64
7141,43.63
7142,43.62
7143,43.62
7144,43.61
7145,43.60
7146,43.59
7147,43.58
7148,43.58
7149,43.57
7150,43.55
7151,43.54
7152,43.52
7153,43.49
7154,43.47
7155,43.45
7156,43.42
7157,43.39
7158,43.37
7159,43.34
7160,43.33
7161,43.31
7162,43.29
7163,43.27
7164,43.25
7165,43.24
7166,43.22
7167,43.21
7168,43.20
7169,43.19
7170,43.19
7171,43.18
7172,43.18
7173,43.18
7174,43.19
7175,43.19
7176,43.20
7177,43.21
7178,43.21
7179,43.21
7180,43.21
7181,43.21
7182,43.21
7183,43.22
7184,43.22
7185,43.21
7186,43.21
7187,43.21
7188,43.20
7189,43.36
7190,43.31
7191,43.08
7192,42.86
7193,43.22
7194,43.95
7195,43.47
7196,41.92
7197,42.09
7198,45.15
7199,46.89
7200,37.23
