1,-2.53
2,-3.69
3,-3.83
4,-3.51
5,-3.37
6,-3.47
7,-3.49
8,-3.42
9,-3.41
10,-3.50
11,-3.58
12,-3.61
13,-3.59
14,-3.54
15,-3.49
16,-3.46
17,-3.47
18,-3.51
19,-3.52
20,-3.48
21,-3.37
22,-3.27
23,-3.24
24,-3.33
25,-3.49
26,-3.66
27,-3.74
28,-3.74
29,-3.67
30,-3.61
31,-3.58
32,-3.60
33,-3.66
34,-3.70
35,-3.74
36,-3.78
37,-3.83
38,-3.89
39,-3.92
40,-3.92
41,-3.87
42,-3.83
43,-3.83
44,-3.89
45,-3.98
46,-4.06
47,-4.09
48,-4.07
49,-4.00
50,-3.89
51,-3.79
52,-3.77
53,-3.84
54,-3.95
55,-4.00
56,-3.95
57,-3.83
58,-3.71
59,-3.65
60,-3.65
61,-3.69
62,-3.72
63,-3.71
64,-3.67
65,-3.63
66,-3.63
67,-3.69
68,-3.79
69,-3.89
70,-3.94
71,-3.94
72,-3.87
73,-3.77
74,-3.68
75,-3.63
76,-3.63
77,-3.67
78,-3.72
79,-3.78
80,-3.83
81,-3.86
82,-3.88
83,-3.86
84,-3.81
85,-3.76
86,-3.74
87,-3.77
88,-3.85
89,-3.94
90,-4.05
91,-4.14
92,-4.24
93,-4.31
94,-4.33
95,-4.28
96,-4.19
97,-4.12
98,-4.13
99,-4.24
100,-4.42
101,-4.60
102,-4.70
103,-4.70
104,-4.64
105,-4.60
106,-4.62
107,-4.71
108,-4.82
109,-4.90
110,-4.91
111,-4.88
112,-4.85
113,-4.83
114,-4.83
115,-4.83
116,-4.80
117,-4.75
118,-4.70
119,-4.68
120,-4.68
121,-4.70
122,-4.75
123,-4.82
124,-4.92
125,-4.98
126,-4.98
127,-4.90
128,-4.79
129,-4.70
130,-4.68
131,-4.74
132,-4.83
133,-4.89
134,-4.92
135,-4.94
136,-4.98
137,-5.05
138,-5.09
139,-5.07
140,-4.98
141,-4.87
142,-4.83
143,-4.89
144,-5.03
145,-5.15
146,-5.16
147,-5.05
148,-4.87
149,-4.72
150,-4.71
151,-4.86
152,-5.09
153,-5.29
154,-5.35
155,-5.27
156,-5.15
157,-5.11
158,-5.20
159,-5.40
160,-5.59
161,-5.69
162,-5.64
163,-5.52
164,-5.45
165,-5.47
166,-5.58
167,-5.69
168,-5.70
169,-5.60
170,-5.44
171,-5.33
172,-5.32
173,-5.42
174,-5.58
175,-5.71
176,-5.77
177,-5.75
178,-5.66
179,-5.52
180,-5.38
181,-5.29
182,-5.26
183,-5.31
184,-5.41
185,-5.51
186,-5.55
187,-5.51
188,-5.42
189,-5.36
190,-5.36
191,-5.42
192,-5.51
193,-5.56
194,-5.55
195,-5.48
196,-5.39
197,-5.29
198,-5.20
199,-5.13
200,-5.11
201,-5.16
202,-5.24
203,-5.32
204,-5.37
205,-5.39
206,-5.38
207,-5.37
208,-5.37
209,-5.38
210,-5.38
211,-5.34
212,-5.27
213,-5.17
214,-5.10
215,-5.09
216,-5.15
217,-5.26
218,-5.38
219,-5.46
220,-5.46
221,-5.38
222,-5.26
223,-5.14
224,-5.06
225,-5.04
226,-5.03
227,-5.02
228,-4.99
229,-4.92
230,-4.85
231,-4.79
232,-4.75
233,-4.76
234,-4.79
235,-4.84
236,-4.89
237,-4.95
238,-5.02
239,-5.09
240,-5.16
241,-5.20
242,-5.18
243,-5.08
244,-4.92
245,-4.73
246,-4.56
247,-4.46
248,-4.47
249,-4.54
250,-4.63
251,-4.65
252,-4.58
253,-4.44
254,-4.29
255,-4.20
256,-4.20
257,-4.27
258,-4.32
259,-4.33
260,-4.30
261,-4.30
262,-4.38
263,-4.52
264,-4.67
265,-4.73
266,-4.68
267,-4.57
268,-4.49
269,-4.50
270,-4.61
271,-4.74
272,-4.78
273,-4.68
274,-4.45
275,-4.20
276,-4.04
277,-4.02
278,-4.11
279,-4.23
280,-4.30
281,-4.27
282,-4.19
283,-4.14
284,-4.17
285,-4.28
286,-4.39
287,-4.44
288,-4.41
289,-4.34
290,-4.29
291,-4.30
292,-4.36
293,-4.45
294,-4.53
295,-4.59
296,-4.64
297,-4.65
298,-4.61
299,-4.53
300,-4.45
301,-4.42
302,-4.46
303,-4.55
304,-4.63
305,-4.65
306,-4.62
307,-4.57
308,-4.52
309,-4.51
310,-4.52
311,-4.53
312,-4.51
313,-4.50
314,-4.49
315,-4.51
316,-4.51
317,-4.46
318,-4.32
319,-4.14
320,-3.96
321,-3.85
322,-3.82
323,-3.86
324,-3.92
325,-3.94
326,-3.88
327,-3.77
328,-3.62
329,-3.48
330,-3.36
331,-3.29
332,-3.27
333,-3.29
334,-3.33
335,-3.37
336,-3.36
337,-3.30
338,-3.22
339,-3.17
340,-3.15
341,-3.16
342,-3.16
343,-3.12
344,-3.05
345,-2.98
346,-2.96
347,-2.99
348,-3.06
349,-3.11
350,-3.13
351,-3.13
352,-3.13
353,-3.13
354,-3.12
355,-3.09
356,-3.06
357,-3.08
358,-3.18
359,-3.35
360,-3.52
361,-3.63
362,-3.63
363,-3.58
364,-3.55
365,-3.59
366,-3.72
367,-3.87
368,-3.98
369,-4.00
370,-3.95
371,-3.87
372,-3.84
373,-3.86
374,-3.89
375,-3.88
376,-3.81
377,-3.72
378,-3.67
379,-3.69
380,-3.77
381,-3.85
382,-3.87
383,-3.83
384,-3.73
385,-3.63
386,-3.54
387,-3.48
388,-3.44
389,-3.43
390,-3.44
391,-3.47
392,-3.49
393,-3.46
394,-3.38
395,-3.28
396,-3.19
397,-3.16
398,-3.17
399,-3.15
400,-3.05
401,-2.90
402,-2.74
403,-2.67
404,-2.69
405,-2.77
406,-2.84
407,-2.88
408,-2.91
409,-2.96
410,-3.02
411,-3.05
412,-3.02
413,-2.91
414,-2.78
415,-2.70
416,-2.69
417,-2.73
418,-2.79
419,-2.81
420,-2.81
421,-2.83
422,-2.89
423,-3.00
424,-3.13
425,-3.26
426,-3.38
427,-3.46
428,-3.50
429,-3.49
430,-3.45
431,-3.41
432,-3.42
433,-3.47
434,-3.54
435,-3.60
436,-3.61
437,-3.60
438,-3.59
439,-3.63
440,-3.71
441,-3.80
442,-3.82
443,-3.73
444,-3.57
445,-3.43
446,-3.39
447,-3.47
448,-3.57
449,-3.61
450,-3.53
451,-3.38
452,-3.24
453,-3.20
454,-3.26
455,-3.34
456,-3.37
457,-3.32
458,-3.25
459,-3.20
460,-3.21
461,-3.27
462,-3.30
463,-3.28
464,-3.22
465,-3.15
466,-3.12
467,-3.14
468,-3.15
469,-3.12
470,-3.03
471,-2.91
472,-2.86
473,-2.91
474,-3.04
475,-3.16
476,-3.20
477,-3.17
478,-3.16
479,-3.23
480,-3.41
481,-3.62
482,-3.74
483,-3.69
484,-3.51
485,-3.33
486,-3.27
487,-3.35
488,-3.49
489,-3.59
490,-3.57
491,-3.49
492,-3.40
493,-3.37
494,-3.41
495,-3.49
496,-3.55
497,-3.56
498,-3.55
499,-3.54
500,-3.56
501,-3.62
502,-3.68
503,-3.74
504,-3.78
505,-3.80
506,-3.78
507,-3.73
508,-3.64
509,-3.56
510,-3.50
511,-3.50
512,-3.58
513,-3.71
514,-3.84
515,-3.92
516,-3.91
517,-3.82
518,-3.70
519,-3.59
520,-3.56
521,-3.58
522,-3.65
523,-3.72
524,-3.78
525,-3.82
526,-3.85
527,-3.87
528,-3.88
529,-3.90
530,-3.95
531,-4.02
532,-4.06
533,-4.05
534,-3.96
535,-3.83
536,-3.76
537,-3.80
538,-3.97
539,-4.17
540,-4.31
541,-4.33
542,-4.23
543,-4.07
544,-3.96
545,-3.95
546,-4.09
547,-4.32
548,-4.53
549,-4.62
550,-4.60
551,-4.53
552,-4.46
553,-4.46
554,-4.52
555,-4.60
556,-4.63
557,-4.59
558,-4.53
559,-4.51
560,-4.55
561,-4.61
562,-4.61
563,-4.54
564,-4.46
565,-4.42
566,-4.45
567,-4.50
568,-4.54
569,-4.54
570,-4.52
571,-4.53
572,-4.62
573,-4.76
574,-4.92
575,-5.03
576,-5.08
577,-5.08
578,-5.10
579,-5.15
580,-5.22
581,-5.26
582,-5.25
583,-5.18
584,-5.10
585,-5.05
586,-5.04
587,-5.04
588,-5.03
589,-4.99
590,-4.97
591,-4.98
592,-5.04
593,-5.14
594,-5.23
595,-5.30
596,-5.31
597,-5.28
598,-5.22
599,-5.14
600,-5.07
601,-5.00
602,-4.99
603,-5.03
604,-5.14
605,-5.28
606,-5.42
607,-5.49
608,-5.48
609,-5.41
610,-5.35
611,-5.35
612,-5.43
613,-5.56
614,-5.67
615,-5.69
616,-5.63
617,-5.51
618,-5.40
619,-5.36
620,-5.40
621,-5.50
622,-5.60
623,-5.67
624,-5.67
625,-5.60
626,-5.48
627,-5.39
628,-5.38
629,-5.48
630,-5.65
631,-5.83
632,-5.96
633,-5.99
634,-5.94
635,-5.86
636,-5.80
637,-5.77
638,-5.77
639,-5.77
640,-5.74
641,-5.68
642,-5.61
643,-5.57
644,-5.58
645,-5.66
646,-5.78
647,-5.89
648,-5.94
649,-5.94
650,-5.91
651,-5.87
652,-5.86
653,-5.87
654,-5.90
655,-5.90
656,-5.86
657,-5.81
658,-5.76
659,-5.75
660,-5.76
661,-5.76
662,-5.73
663,-5.67
664,-5.61
665,-5.54
666,-5.47
667,-5.40
668,-5.35
669,-5.35
670,-5.40
671,-5.48
672,-5.51
673,-5.45
674,-5.31
675,-5.15
676,-5.08
677,-5.14
678,-5.29
679,-5.45
680,-5.51
681,-5.43
682,-5.27
683,-5.10
684,-5.00
685,-4.97
686,-4.98
687,-4.99
688,-4.97
689,-4.92
690,-4.86
691,-4.82
692,-4.79
693,-4.77
694,-4.73
695,-4.69
696,-4.67
697,-4.66
698,-4.71
699,-4.81
700,-4.96
701,-5.11
702,-5.24
703,-5.29
704,-5.25
705,-5.16
706,-5.08
707,-5.06
708,-5.14
709,-5.26
710,-5.37
711,-5.40
712,-5.37
713,-5.30
714,-5.26
715,-5.27
716,-5.35
717,-5.45
718,-5.55
719,-5.61
720,-5.62
721,-5.59
722,-5.51
723,-5.39
724,-5.22
725,-5.08
726,-5.01
727,-5.05
728,-5.18
729,-5.31
730,-5.37
731,-5.33
732,-5.20
733,-5.08
734,-4.99
735,-4.96
736,-4.93
737,-4.88
738,-4.80
739,-4.73
740,-4.71
741,-4.75
742,-4.81
743,-4.86
744,-4.87
745,-4.85
746,-4.82
747,-4.82
748,-4.85
749,-4.92
750,-4.97
751,-5.00
752,-4.99
753,-4.93
754,-4.84
755,-4.73
756,-4.62
757,-4.56
758,-4.56
759,-4.64
760,-4.75
761,-4.82
762,-4.77
763,-4.59
764,-4.35
765,-4.17
766,-4.16
767,-4.29
768,-4.45
769,-4.51
770,-4.41
771,-4.24
772,-4.14
773,-4.20
774,-4.39
775,-4.59
776,-4.67
777,-4.57
778,-4.39
779,-4.24
780,-4.23
781,-4.34
782,-4.50
783,-4.58
784,-4.54
785,-4.40
786,-4.25
787,-4.17
788,-4.16
789,-4.20
790,-4.22
791,-4.19
792,-4.13
793,-4.07
794,-4.03
795,-4.00
796,-3.96
797,-3.89
798,-3.85
799,-3.84
800,-3.89
801,-3.94
802,-3.94
803,-3.88
804,-3.79
805,-3.76
806,-3.79
807,-3.86
808,-3.90
809,-3.87
810,-3.79
811,-3.73
812,-3.73
813,-3.77
814,-3.78
815,-3.73
816,-3.66
817,-3.66
818,-3.78
819,-3.93
820,-4.03
821,-3.97
822,-3.82
823,-3.70
824,-3.71
825,-3.87
826,-4.09
827,-4.24
828,-4.27
829,-4.20
830,-4.16
831,-4.21
832,-4.35
833,-4.49
834,-4.57
835,-4.55
836,-4.49
837,-4.44
838,-4.44
839,-4.46
840,-4.50
841,-4.53
842,-4.55
843,-4.56
844,-4.56
845,-4.55
846,-4.55
847,-4.57
848,-4.62
849,-4.67
850,-4.67
851,-4.59
852,-4.44
853,-4.30
854,-4.23
855,-4.24
856,-4.31
857,-4.35
858,-4.32
859,-4.24
860,-4.14
861,-4.06
862,-4.01
863,-3.98
864,-3.93
865,-3.87
866,-3.82
867,-3.81
868,-3.79
869,-3.76
870,-3.69
871,-3.62
872,-3.55
873,-3.49
874,-3.42
875,-3.30
876,-3.16
877,-3.05
878,-3.05
879,-3.14
880,-3.27
881,-3.32
882,-3.25
883,-3.10
884,-2.97
885,-2.92
886,-2.95
887,-3.02
888,-3.05
889,-3.02
890,-2.95
891,-2.87
892,-2.81
893,-2.77
894,-2.76
895,-2.78
896,-2.82
897,-2.88
898,-2.94
899,-2.96
900,-2.94
901,-2.89
902,-2.83
903,-2.83
904,-2.91
905,-3.04
906,-3.12
907,-3.09
908,-2.98
909,-2.90
910,-2.91
911,-3.06
912,-3.28
913,-3.47
914,-3.54
915,-3.47
916,-3.32
917,-3.20
918,-3.18
919,-3.28
920,-3.42
921,-3.52
922,-3.54
923,-3.52
924,-3.52
925,-3.59
926,-3.68
927,-3.74
928,-3.71
929,-3.63
930,-3.55
931,-3.54
932,-3.62
933,-3.75
934,-3.88
935,-3.96
936,-3.99
937,-3.99
938,-3.98
939,-3.95
940,-3.88
941,-3.76
942,-3.59
943,-3.45
944,-3.38
945,-3.41
946,-3.50
947,-3.63
948,-3.72
949,-3.76
950,-3.76
951,-3.75
952,-3.76
953,-3.78
954,-3.77
955,-3.70
956,-3.56
957,-3.41
958,-3.32
959,-3.31
960,-3.38
961,-3.44
962,-3.45
963,-3.42
964,-3.39
965,-3.40
966,-3.49
967,-3.61
968,-3.71
969,-3.75
970,-3.73
971,-3.70
972,-3.71
973,-3.74
974,-3.77
975,-3.73
976,-3.63
977,-3.54
978,-3.52
979,-3.60
980,-3.75
981,-3.89
982,-3.94
983,-3.90
984,-3.82
985,-3.77
986,-3.78
987,-3.85
988,-3.92
989,-3.94
990,-3.90
991,-3.81
992,-3.71
993,-3.65
994,-3.63
995,-3.68
996,-3.77
997,-3.86
998,-3.92
999,-3.94
1000,-3.93
1001,-3.92
1002,-3.93
1003,-3.94
1004,-3.95
1005,-3.92
1006,-3.88
1007,-3.85
1008,-3.86
1009,-3.91
1010,-3.96
1011,-3.99
1012,-3.98
1013,-3.96
1014,-3.98
1015,-4.06
1016,-4.17
1017,-4.27
1018,-4.31
1019,-4.28
1020,-4.19
1021,-4.10
1022,-4.06
1023,-4.07
1024,-4.13
1025,-4.21
1026,-4.28
1027,-4.36
1028,-4.44
1029,-4.51
1030,-4.53
1031,-4.49
1032,-4.39
1033,-4.29
1034,-4.23
1035,-4.24
1036,-4.29
1037,-4.33
1038,-4.33
1039,-4.31
1040,-4.28
1041,-4.29
1042,-4.32
1043,-4.36
1044,-4.41
1045,-4.44
1046,-4.49
1047,-4.54
1048,-4.57
1049,-4.56
1050,-4.51
1051,-4.45
1052,-4.42
1053,-4.46
1054,-4.56
1055,-4.67
1056,-4.73
1057,-4.72
1058,-4.67
1059,-4.62
1060,-4.61
1061,-4.63
1062,-4.68
1063,-4.76
1064,-4.87
1065,-4.98
1066,-5.07
1067,-5.08
1068,-5.03
1069,-4.94
1070,-4.88
1071,-4.88
1072,-4.91
1073,-4.93
1074,-4.92
1075,-4.86
1076,-4.80
1077,-4.76
1078,-4.75
1079,-4.75
1080,-4.71
1081,-4.66
1082,-4.61
1083,-4.60
1084,-4.62
1085,-4.65
1086,-4.66
1087,-4.66
1088,-4.66
1089,-4.68
1090,-4.70
1091,-4.70
1092,-4.64
1093,-4.57
1094,-4.55
1095,-4.61
1096,-4.73
1097,-4.83
1098,-4.86
1099,-4.82
1100,-4.79
1101,-4.82
1102,-4.94
1103,-5.09
1104,-5.21
1105,-5.22
1106,-5.17
1107,-5.09
1108,-5.05
1109,-5.06
1110,-5.11
1111,-5.17
1112,-5.26
1113,-5.34
1114,-5.43
1115,-5.51
1116,-5.56
1117,-5.60
1118,-5.64
1119,-5.67
1120,-5.69
1121,-5.69
1122,-5.67
1123,-5.64
1124,-5.65
1125,-5.69
1126,-5.73
1127,-5.75
1128,-5.68
1129,-5.55
1130,-5.38
1131,-5.25
1132,-5.16
1133,-5.13
1134,-5.14
1135,-5.17
1136,-5.23
1137,-5.32
1138,-5.42
1139,-5.48
1140,-5.45
1141,-5.33
1142,-5.15
1143,-5.00
1144,-4.91
1145,-4.91
1146,-4.94
1147,-4.93
1148,-4.87
1149,-4.79
1150,-4.71
1151,-4.68
1152,-4.67
1153,-4.65
1154,-4.63
1155,-4.59
1156,-4.55
1157,-4.51
1158,-4.46
1159,-4.39
1160,-4.30
1161,-4.24
1162,-4.26
1163,-4.35
1164,-4.48
1165,-4.59
1166,-4.65
1167,-4.69
1168,-4.73
1169,-4.76
1170,-4.79
1171,-4.79
1172,-4.76
1173,-4.73
1174,-4.71
1175,-4.70
1176,-4.68
1177,-4.67
1178,-4.68
1179,-4.70
1180,-4.72
1181,-4.73
1182,-4.70
1183,-4.65
1184,-4.60
1185,-4.57
1186,-4.61
1187,-4.67
1188,-4.74
1189,-4.79
1190,-4.81
1191,-4.81
1192,-4.81
1193,-4.80
1194,-4.79
1195,-4.79
1196,-4.85
1197,-4.97
1198,-5.14
1199,-5.30
1200,-5.40
1201,-5.40
1202,-5.34
1203,-5.29
1204,-5.29
1205,-5.33
1206,-5.35
1207,-5.27
1208,-5.10
1209,-4.94
1210,-4.90
1211,-5.03
1212,-5.28
1213,-5.51
1214,-5.62
1215,-5.54
1216,-5.36
1217,-5.19
1218,-5.10
1219,-5.11
1220,-5.15
1221,-5.17
1222,-5.13
1223,-5.07
1224,-5.03
1225,-5.06
1226,-5.15
1227,-5.24
1228,-5.30
1229,-5.31
1230,-5.26
1231,-5.20
1232,-5.15
1233,-5.13
1234,-5.12
1235,-5.09
1236,-5.06
1237,-5.04
1238,-5.05
1239,-5.09
1240,-5.12
1241,-5.09
1242,-4.97
1243,-4.81
1244,-4.70
1245,-4.71
1246,-4.83
1247,-4.99
1248,-5.08
1249,-5.04
1250,-4.88
1251,-4.70
1252,-4.61
1253,-4.65
1254,-4.82
1255,-5.03
1256,-5.17
1257,-5.16
1258,-5.02
1259,-4.83
1260,-4.68
1261,-4.64
1262,-4.66
1263,-4.67
1264,-4.60
1265,-4.45
1266,-4.28
1267,-4.16
1268,-4.16
1269,-4.24
1270,-4.35
1271,-4.42
1272,-4.40
1273,-4.33
1274,-4.24
1275,-4.20
1276,-4.20
1277,-4.25
1278,-4.31
1279,-4.32
1280,-4.24
1281,-4.09
1282,-3.92
1283,-3.79
1284,-3.76
1285,-3.81
1286,-3.86
1287,-3.86
1288,-3.80
1289,-3.73
1290,-3.70
1291,-3.72
1292,-3.76
1293,-3.79
1294,-3.76
1295,-3.70
1296,-3.65
1297,-3.65
1298,-3.70
1299,-3.78
1300,-3.82
1301,-3.79
1302,-3.66
1303,-3.45
1304,-3.23
1305,-3.09
1306,-3.08
1307,-3.17
1308,-3.30
1309,-3.38
1310,-3.39
1311,-3.35
1312,-3.32
1313,-3.34
1314,-3.39
1315,-3.42
1316,-3.40
1317,-3.35
1318,-3.31
1319,-3.34
1320,-3.43
1321,-3.56
1322,-3.65
1323,-3.67
1324,-3.65
1325,-3.59
1326,-3.53
1327,-3.43
1328,-3.31
1329,-3.19
1330,-3.13
1331,-3.18
1332,-3.34
1333,-3.52
1334,-3.66
1335,-3.70
1336,-3.66
1337,-3.62
1338,-3.62
1339,-3.66
1340,-3.68
1341,-3.63
1342,-3.50
1343,-3.37
1344,-3.31
1345,-3.34
1346,-3.42
1347,-3.49
1348,-3.47
1349,-3.40
1350,-3.32
1351,-3.30
1352,-3.38
1353,-3.52
1354,-3.66
1355,-3.75
1356,-3.78
1357,-3.77
1358,-3.75
1359,-3.72
1360,-3.71
1361,-3.70
1362,-3.70
1363,-3.74
1364,-3.78
1365,-3.84
1366,-3.88
1367,-3.90
1368,-3.90
1369,-3.91
1370,-3.95
1371,-4.03
1372,-4.10
1373,-4.11
1374,-4.04
1375,-3.90
1376,-3.76
1377,-3.67
1378,-3.67
1379,-3.71
1380,-3.73
1381,-3.70
1382,-3.64
1383,-3.62
1384,-3.67
1385,-3.76
1386,-3.82
1387,-3.78
1388,-3.63
1389,-3.46
1390,-3.34
1391,-3.33
1392,-3.41
1393,-3.53
1394,-3.63
1395,-3.68
1396,-3.67
1397,-3.63
1398,-3.60
1399,-3.60
1400,-3.65
1401,-3.73
1402,-3.80
1403,-3.81
1404,-3.76
1405,-3.66
1406,-3.59
1407,-3.59
1408,-3.63
1409,-3.68
1410,-3.72
1411,-3.75
1412,-3.78
1413,-3.84
1414,-3.90
1415,-3.92
1416,-3.92
1417,-3.92
1418,-3.96
1419,-4.07
1420,-4.19
1421,-4.27
1422,-4.29
1423,-4.28
1424,-4.26
1425,-4.30
1426,-4.39
1427,-4.49
1428,-4.53
1429,-4.49
1430,-4.42
1431,-4.36
1432,-4.34
1433,-4.34
1434,-4.35
1435,-4.36
1436,-4.36
1437,-4.36
1438,-4.38
1439,-4.39
1440,-4.39
1441,-4.38
1442,-4.36
1443,-4.34
1444,-4.35
1445,-4.39
1446,-4.43
1447,-4.45
1448,-4.43
1449,-4.35
1450,-4.24
1451,-4.15
1452,-4.16
1453,-4.28
1454,-4.49
1455,-4.66
1456,-4.72
1457,-4.66
1458,-4.55
1459,-4.49
1460,-4.52
1461,-4.61
1462,-4.68
1463,-4.69
1464,-4.68
1465,-4.67
1466,-4.72
1467,-4.80
1468,-4.85
1469,-4.80
1470,-4.69
1471,-4.57
1472,-4.53
1473,-4.59
1474,-4.68
1475,-4.75
1476,-4.75
1477,-4.72
1478,-4.69
1479,-4.72
1480,-4.79
1481,-4.88
1482,-4.94
1483,-4.93
1484,-4.88
1485,-4.84
1486,-4.86
1487,-4.94
1488,-5.05
1489,-5.11
1490,-5.09
1491,-5.00
1492,-4.91
1493,-4.87
1494,-4.90
1495,-4.96
1496,-4.99
1497,-4.97
1498,-4.91
1499,-4.90
1500,-4.95
1501,-5.05
1502,-5.11
1503,-5.04
1504,-4.82
1505,-4.56
1506,-4.39
1507,-4.41
1508,-4.59
1509,-4.82
1510,-4.97
1511,-4.99
1512,-4.90
1513,-4.77
1514,-4.66
1515,-4.60
1516,-4.61
1517,-4.66
1518,-4.74
1519,-4.81
1520,-4.85
1521,-4.86
1522,-4.85
1523,-4.84
1524,-4.86
1525,-4.90
1526,-4.92
1527,-4.93
1528,-4.92
1529,-4.92
1530,-4.93
1531,-4.95
1532,-4.96
1533,-4.94
1534,-4.92
1535,-4.91
1536,-4.95
1537,-5.01
1538,-5.08
1539,-5.09
1540,-5.07
1541,-5.03
1542,-5.03
1543,-5.10
1544,-5.20
1545,-5.27
1546,-5.28
1547,-5.23
1548,-5.16
1549,-5.14
1550,-5.16
1551,-5.22
1552,-5.23
1553,-5.18
1554,-5.09
1555,-5.05
1556,-5.13
1557,-5.30
1558,-5.47
1559,-5.53
1560,-5.42
1561,-5.20
1562,-4.99
1563,-4.87
1564,-4.86
1565,-4.89
1566,-4.92
1567,-4.93
1568,-4.96
1569,-5.03
1570,-5.15
1571,-5.28
1572,-5.39
1573,-5.46
1574,-5.48
1575,-5.49
1576,-5.50
1577,-5.52
1578,-5.55
1579,-5.58
1580,-5.60
1581,-5.64
1582,-5.69
1583,-5.76
1584,-5.78
1585,-5.74
1586,-5.66
1587,-5.59
1588,-5.59
1589,-5.68
1590,-5.80
1591,-5.88
1592,-5.87
1593,-5.80
1594,-5.76
1595,-5.79
1596,-5.88
1597,-5.98
1598,-6.01
1599,-5.94
1600,-5.84
1601,-5.76
1602,-5.76
1603,-5.82
1604,-5.87
1605,-5.88
1606,-5.86
1607,-5.83
1608,-5.82
1609,-5.85
1610,-5.89
1611,-5.92
1612,-5.90
1613,-5.85
1614,-5.79
1615,-5.77
1616,-5.80
1617,-5.84
1618,-5.85
1619,-5.81
1620,-5.71
1621,-5.58
1622,-5.48
1623,-5.42
1624,-5.41
1625,-5.43
1626,-5.42
1627,-5.38
1628,-5.32
1629,-5.25
1630,-5.22
1631,-5.22
1632,-5.25
1633,-5.30
1634,-5.34
1635,-5.34
1636,-5.31
1637,-5.24
1638,-5.18
1639,-5.16
1640,-5.19
1641,-5.27
1642,-5.35
1643,-5.39
1644,-5.40
1645,-5.36
1646,-5.29
1647,-5.21
1648,-5.15
1649,-5.16
1650,-5.26
1651,-5.41
1652,-5.55
1653,-5.59
1654,-5.50
1655,-5.34
1656,-5.20
1657,-5.17
1658,-5.24
1659,-5.36
1660,-5.41
1661,-5.39
1662,-5.34
1663,-5.33
1664,-5.39
1665,-5.50
1666,-5.62
1667,-5.70
1668,-5.75
1669,-5.77
1670,-5.81
1671,-5.82
1672,-5.77
1673,-5.67
1674,-5.55
1675,-5.47
1676,-5.51
1677,-5.64
1678,-5.80
1679,-5.92
1680,-5.95
1681,-5.91
1682,-5.87
1683,-5.87
1684,-5.94
1685,-6.07
1686,-6.19
1687,-6.29
1688,-6.33
1689,-6.31
1690,-6.23
1691,-6.11
1692,-5.98
1693,-5.88
1694,-5.83
1695,-5.84
1696,-5.88
1697,-5.93
1698,-5.96
1699,-5.95
1700,-5.89
1701,-5.79
1702,-5.70
1703,-5.65
1704,-5.63
1705,-5.64
1706,-5.62
1707,-5.55
1708,-5.40
1709,-5.21
1710,-5.03
1711,-4.93
1712,-4.92
1713,-4.96
1714,-4.96
1715,-4.92
1716,-4.84
1717,-4.81
1718,-4.87
1719,-5.01
1720,-5.13
1721,-5.17
1722,-5.08
1723,-4.91
1724,-4.74
1725,-4.63
1726,-4.60
1727,-4.59
1728,-4.57
1729,-4.54
1730,-4.53
1731,-4.59
1732,-4.72
1733,-4.89
1734,-5.04
1735,-5.11
1736,-5.06
1737,-4.90
1738,-4.70
1739,-4.54
1740,-4.49
1741,-4.57
1742,-4.71
1743,-4.85
1744,-4.93
1745,-4.93
1746,-4.88
1747,-4.83
1748,-4.78
1749,-4.70
1750,-4.61
1751,-4.51
1752,-4.47
1753,-4.50
1754,-4.57
1755,-4.63
1756,-4.66
1757,-4.67
1758,-4.69
1759,-4.78
1760,-4.92
1761,-5.05
1762,-5.11
1763,-5.07
1764,-4.96
1765,-4.84
1766,-4.78
1767,-4.79
1768,-4.82
1769,-4.84
1770,-4.83
1771,-4.81
1772,-4.79
1773,-4.78
1774,-4.76
1775,-4.72
1776,-4.68
1777,-4.65
1778,-4.66
1779,-4.71
1780,-4.79
1781,-4.86
1782,-4.88
1783,-4.82
1784,-4.68
1785,-4.53
1786,-4.44
1787,-4.45
1788,-4.53
1789,-4.61
1790,-4.62
1791,-4.53
1792,-4.38
1793,-4.26
1794,-4.22
1795,-4.29
1796,-4.39
1797,-4.46
1798,-4.46
1799,-4.41
1800,-4.39
1801,-4.43
1802,-4.51
1803,-4.57
1804,-4.55
1805,-4.43
1806,-4.29
1807,-4.20
1808,-4.21
1809,-4.30
1810,-4.42
1811,-4.47
1812,-4.43
1813,-4.31
1814,-4.17
1815,-4.08
1816,-4.04
1817,-4.04
1818,-4.03
1819,-3.97
1820,-3.87
1821,-3.78
1822,-3.72
1823,-3.74
1824,-3.81
1825,-3.87
1826,-3.87
1827,-3.81
1828,-3.74
1829,-3.70
1830,-3.69
1831,-3.70
1832,-3.69
1833,-3.65
1834,-3.57
1835,-3.46
1836,-3.35
1837,-3.27
1838,-3.23
1839,-3.26
1840,-3.34
1841,-3.41
1842,-3.45
1843,-3.46
1844,-3.44
1845,-3.41
1846,-3.39
1847,-3.36
1848,-3.31
1849,-3.25
1850,-3.21
1851,-3.23
1852,-3.30
1853,-3.38
1854,-3.42
1855,-3.41
1856,-3.38
1857,-3.37
1858,-3.41
1859,-3.49
1860,-3.56
1861,-3.58
1862,-3.57
1863,-3.55
1864,-3.55
1865,-3.57
1866,-3.60
1867,-3.63
1868,-3.67
1869,-3.75
1870,-3.88
1871,-4.03
1872,-4.15
1873,-4.20
1874,-4.19
1875,-4.15
1876,-4.13
1877,-4.14
1878,-4.20
1879,-4.30
1880,-4.43
1881,-4.55
1882,-4.63
1883,-4.63
1884,-4.58
1885,-4.54
1886,-4.57
1887,-4.68
1888,-4.84
1889,-4.97
1890,-5.01
1891,-4.94
1892,-4.84
1893,-4.76
1894,-4.74
1895,-4.77
1896,-4.81
1897,-4.83
1898,-4.81
1899,-4.75
1900,-4.70
1901,-4.65
1902,-4.62
1903,-4.60
1904,-4.59
1905,-4.60
1906,-4.59
1907,-4.58
1908,-4.54
1909,-4.50
1910,-4.46
1911,-4.42
1912,-4.36
1913,-4.31
1914,-4.27
1915,-4.26
1916,-4.26
1917,-4.21
1918,-4.10
1919,-3.93
1920,-3.78
1921,-3.71
1922,-3.73
1923,-3.81
1924,-3.83
1925,-3.77
1926,-3.64
1927,-3.55
1928,-3.56
1929,-3.68
1930,-3.84
1931,-3.94
1932,-3.92
1933,-3.82
1934,-3.69
1935,-3.62
1936,-3.63
1937,-3.71
1938,-3.82
1939,-3.91
1940,-3.97
1941,-3.99
1942,-3.97
1943,-3.96
1944,-3.98
1945,-4.04
1946,-4.12
1947,-4.20
1948,-4.25
1949,-4.28
1950,-4.31
1951,-4.34
1952,-4.35
1953,-4.36
1954,-4.37
1955,-4.39
1956,-4.47
1957,-4.57
1958,-4.68
1959,-4.73
1960,-4.73
1961,-4.69
1962,-4.66
1963,-4.69
1964,-4.77
1965,-4.85
1966,-4.88
1967,-4.83
1968,-4.71
1969,-4.59
1970,-4.56
1971,-4.63
1972,-4.77
1973,-4.89
1974,-4.93
1975,-4.86
1976,-4.76
1977,-4.67
1978,-4.65
1979,-4.69
1980,-4.77
1981,-4.84
1982,-4.90
1983,-4.95
1984,-5.00
1985,-5.04
1986,-5.06
1987,-5.06
1988,-5.03
1989,-5.00
1990,-4.97
1991,-4.98
1992,-5.01
1993,-5.04
1994,-5.04
1995,-4.99
1996,-4.94
1997,-4.91
1998,-4.94
1999,-5.00
2000,-5.05
2001,-5.05
2002,-5.02
2003,-4.98
2004,-4.97
2005,-5.00
2006,-5.07
2007,-5.14
2008,-5.22
2009,-5.26
2010,-5.28
2011,-5.25
2012,-5.20
2013,-5.16
2014,-5.14
2015,-5.14
2016,-5.16
2017,-5.21
2018,-5.31
2019,-5.42
2020,-5.52
2021,-5.58
2022,-5.58
2023,-5.51
2024,-5.42
2025,-5.33
2026,-5.31
2027,-5.36
2028,-5.43
2029,-5.47
2030,-5.46
2031,-5.39
2032,-5.31
2033,-5.26
2034,-5.27
2035,-5.34
2036,-5.46
2037,-5.57
2038,-5.62
2039,-5.58
2040,-5.46
2041,-5.32
2042,-5.24
2043,-5.27
2044,-5.39
2045,-5.54
2046,-5.61
2047,-5.57
2048,-5.48
2049,-5.42
2050,-5.46
2051,-5.58
2052,-5.72
2053,-5.79
2054,-5.79
2055,-5.75
2056,-5.74
2057,-5.74
2058,-5.74
2059,-5.69
2060,-5.61
2061,-5.55
2062,-5.59
2063,-5.73
2064,-5.90
2065,-6.03
2066,-6.05
2067,-5.97
2068,-5.87
2069,-5.82
2070,-5.91
2071,-6.10
2072,-6.34
2073,-6.50
2074,-6.54
2075,-6.45
2076,-6.32
2077,-6.23
2078,-6.25
2079,-6.36
2080,-6.49
2081,-6.56
2082,-6.53
2083,-6.42
2084,-6.32
2085,-6.28
2086,-6.30
2087,-6.35
2088,-6.41
2089,-6.45
2090,-6.52
2091,-6.60
2092,-6.69
2093,-6.73
2094,-6.69
2095,-6.59
2096,-6.49
2097,-6.45
2098,-6.49
2099,-6.57
2100,-6.65
2101,-6.68
2102,-6.66
2103,-6.63
2104,-6.59
2105,-6.53
2106,-6.41
2107,-6.25
2108,-6.08
2109,-5.98
2110,-5.97
2111,-6.09
2112,-6.25
2113,-6.39
2114,-6.43
2115,-6.33
2116,-6.12
2117,-5.85
2118,-5.60
2119,-5.44
2120,-5.37
2121,-5.39
2122,-5.44
2123,-5.48
2124,-5.48
2125,-5.48
2126,-5.50
2127,-5.55
2128,-5.62
2129,-5.69
2130,-5.72
2131,-5.70
2132,-5.64
2133,-5.56
2134,-5.48
2135,-5.41
2136,-5.36
2137,-5.36
2138,-5.42
2139,-5.51
2140,-5.62
2141,-5.67
2142,-5.67
2143,-5.60
2144,-5.49
2145,-5.38
2146,-5.29
2147,-5.24
2148,-5.23
2149,-5.28
2150,-5.37
2151,-5.48
2152,-5.58
2153,-5.65
2154,-5.68
2155,-5.71
2156,-5.76
2157,-5.82
2158,-5.87
2159,-5.91
2160,-5.91
2161,-5.90
2162,-5.91
2163,-5.91
2164,-5.90
2165,-5.82
2166,-5.69
2167,-5.53
2168,-5.40
2169,-5.34
2170,-5.34
2171,-5.34
2172,-5.31
2173,-5.25
2174,-5.19
2175,-5.19
2176,-5.27
2177,-5.40
2178,-5.56
2179,-5.69
2180,-5.76
2181,-5.73
2182,-5.65
2183,-5.53
2184,-5.44
2185,-5.41
2186,-5.43
2187,-5.43
2188,-5.35
2189,-5.21
2190,-5.08
2191,-5.04
2192,-5.13
2193,-5.29
2194,-5.41
2195,-5.41
2196,-5.29
2197,-5.13
2198,-5.02
2199,-4.99
2200,-5.00
2201,-4.98
2202,-4.90
2203,-4.78
2204,-4.70
2205,-4.70
2206,-4.78
2207,-4.90
2208,-5.02
2209,-5.10
2210,-5.13
2211,-5.12
2212,-5.08
2213,-5.04
2214,-5.00
2215,-4.97
2216,-4.95
2217,-4.93
2218,-4.90
2219,-4.85
2220,-4.80
2221,-4.77
2222,-4.76
2223,-4.76
2224,-4.75
2225,-4.75
2226,-4.77
2227,-4.83
2228,-4.93
2229,-5.06
2230,-5.19
2231,-5.28
2232,-5.33
2233,-5.32
2234,-5.25
2235,-5.18
2236,-5.13
2237,-5.13
2238,-5.17
2239,-5.20
2240,-5.19
2241,-5.13
2242,-5.06
2243,-5.03
2244,-5.03
2245,-5.06
2246,-5.08
2247,-5.09
2248,-5.10
2249,-5.15
2250,-5.21
2251,-5.26
2252,-5.28
2253,-5.25
2254,-5.21
2255,-5.19
2256,-5.21
2257,-5.21
2258,-5.17
2259,-5.11
2260,-5.08
2261,-5.15
2262,-5.30
2263,-5.44
2264,-5.50
2265,-5.45
2266,-5.33
2267,-5.20
2268,-5.11
2269,-5.03
2270,-4.96
2271,-4.88
2272,-4.83
2273,-4.85
2274,-4.93
2275,-5.03
2276,-5.07
2277,-5.03
2278,-4.96
2279,-4.93
2280,-4.98
2281,-5.08
2282,-5.17
2283,-5.16
2284,-5.05
2285,-4.91
2286,-4.82
2287,-4.78
2288,-4.79
2289,-4.82
2290,-4.84
2291,-4.86
2292,-4.86
2293,-4.85
2294,-4.80
2295,-4.75
2296,-4.73
2297,-4.75
2298,-4.82
2299,-4.90
2300,-4.98
2301,-5.00
2302,-4.99
2303,-4.97
2304,-5.00
2305,-5.06
2306,-5.14
2307,-5.16
2308,-5.12
2309,-5.03
2310,-4.97
2311,-4.97
2312,-5.06
2313,-5.21
2314,-5.36
2315,-5.43
2316,-5.41
2317,-5.33
2318,-5.26
2319,-5.22
2320,-5.22
2321,-5.26
2322,-5.33
2323,-5.38
2324,-5.40
2325,-5.38
2326,-5.30
2327,-5.20
2328,-5.11
2329,-5.07
2330,-5.08
2331,-5.15
2332,-5.20
2333,-5.21
2334,-5.15
2335,-5.06
2336,-4.99
2337,-4.99
2338,-5.05
2339,-5.10
2340,-5.07
2341,-4.94
2342,-4.75
2343,-4.61
2344,-4.57
2345,-4.66
2346,-4.79
2347,-4.84
2348,-4.76
2349,-4.58
2350,-4.38
2351,-4.26
2352,-4.25
2353,-4.31
2354,-4.36
2355,-4.33
2356,-4.21
2357,-4.08
2358,-4.03
2359,-4.10
2360,-4.26
2361,-4.43
2362,-4.54
2363,-4.56
2364,-4.53
2365,-4.51
2366,-4.54
2367,-4.61
2368,-4.71
2369,-4.79
2370,-4.85
2371,-4.91
2372,-4.98
2373,-5.05
2374,-5.09
2375,-5.06
2376,-4.99
2377,-4.91
2378,-4.86
2379,-4.84
2380,-4.82
2381,-4.81
2382,-4.80
2383,-4.82
2384,-4.89
2385,-4.98
2386,-5.08
2387,-5.15
2388,-5.18
2389,-5.20
2390,-5.20
2391,-5.18
2392,-5.13
2393,-5.05
2394,-4.96
2395,-4.89
2396,-4.85
2397,-4.85
2398,-4.86
2399,-4.86
2400,-4.79
2401,-4.67
2402,-4.50
2403,-4.35
2404,-4.26
2405,-4.24
2406,-4.27
2407,-4.32
2408,-4.33
2409,-4.33
2410,-4.31
2411,-4.27
2412,-4.21
2413,-4.13
2414,-4.08
2415,-4.09
2416,-4.20
2417,-4.36
2418,-4.53
2419,-4.63
2420,-4.64
2421,-4.60
2422,-4.57
2423,-4.59
2424,-4.68
2425,-4.78
2426,-4.86
2427,-4.90
2428,-4.90
2429,-4.87
2430,-4.85
2431,-4.83
2432,-4.85
2433,-4.87
2434,-4.88
2435,-4.86
2436,-4.82
2437,-4.79
2438,-4.81
2439,-4.89
2440,-5.03
2441,-5.18
2442,-5.29
2443,-5.35
2444,-5.38
2445,-5.41
2446,-5.45
2447,-5.44
2448,-5.36
2449,-5.25
2450,-5.19
2451,-5.24
2452,-5.41
2453,-5.59
2454,-5.69
2455,-5.65
2456,-5.51
2457,-5.34
2458,-5.28
2459,-5.35
2460,-5.50
2461,-5.64
2462,-5.69
2463,-5.63
2464,-5.50
2465,-5.36
2466,-5.27
2467,-5.23
2468,-5.28
2469,-5.36
2470,-5.47
2471,-5.54
2472,-5.55
2473,-5.51
2474,-5.49
2475,-5.54
2476,-5.69
2477,-5.89
2478,-6.06
2479,-6.14
2480,-6.12
2481,-6.04
2482,-5.98
2483,-5.98
2484,-6.02
2485,-6.05
2486,-6.07
2487,-6.06
2488,-6.06
2489,-6.08
2490,-6.12
2491,-6.17
2492,-6.20
2493,-6.22
2494,-6.26
2495,-6.31
2496,-6.39
2497,-6.48
2498,-6.57
2499,-6.65
2500,-6.71
2501,-6.77
2502,-6.85
2503,-6.91
2504,-6.91
2505,-6.85
2506,-6.78
2507,-6.74
2508,-6.73
2509,-6.76
2510,-6.83
2511,-6.95
2512,-7.03
2513,-6.99
2514,-6.83
2515,-6.62
2516,-6.47
2517,-6.45
2518,-6.54
2519,-6.65
2520,-6.67
2521,-6.57
2522,-6.41
2523,-6.30
2524,-6.28
2525,-6.37
2526,-6.46
2527,-6.49
2528,-6.45
2529,-6.38
2530,-6.34
2531,-6.37
2532,-6.39
2533,-6.35
2534,-6.21
2535,-6.01
2536,-5.84
2537,-5.79
2538,-5.85
2539,-5.97
2540,-6.07
2541,-6.11
2542,-6.11
2543,-6.12
2544,-6.17
2545,-6.25
2546,-6.32
2547,-6.36
2548,-6.40
2549,-6.47
2550,-6.59
2551,-6.71
2552,-6.79
2553,-6.78
2554,-6.72
2555,-6.66
2556,-6.64
2557,-6.65
2558,-6.65
2559,-6.62
2560,-6.58
2561,-6.58
2562,-6.65
2563,-6.76
2564,-6.88
2565,-6.95
2566,-6.97
2567,-6.94
2568,-6.90
2569,-6.86
2570,-6.84
2571,-6.87
2572,-6.97
2573,-7.10
2574,-7.22
2575,-7.25
2576,-7.19
2577,-7.08
2578,-6.97
2579,-6.91
2580,-6.88
2581,-6.85
2582,-6.81
2583,-6.76
2584,-6.72
2585,-6.72
2586,-6.73
2587,-6.69
2588,-6.59
2589,-6.46
2590,-6.38
2591,-6.38
2592,-6.45
2593,-6.52
2594,-6.51
2595,-6.41
2596,-6.28
2597,-6.21
2598,-6.25
2599,-6.37
2600,-6.45
2601,-6.40
2602,-6.23
2603,-6.03
2604,-5.93
2605,-5.99
2606,-6.18
2607,-6.37
2608,-6.43
2609,-6.33
2610,-6.15
2611,-6.00
2612,-6.00
2613,-6.14
2614,-6.34
2615,-6.49
2616,-6.54
2617,-6.48
2618,-6.41
2619,-6.36
2620,-6.37
2621,-6.39
2622,-6.38
2623,-6.34
2624,-6.29
2625,-6.29
2626,-6.36
2627,-6.48
2628,-6.61
2629,-6.74
2630,-6.82
2631,-6.86
2632,-6.87
2633,-6.85
2634,-6.84
2635,-6.82
2636,-6.83
2637,-6.84
2638,-6.84
2639,-6.81
2640,-6.78
2641,-6.77
2642,-6.81
2643,-6.88
2644,-6.95
2645,-6.95
2646,-6.91
2647,-6.85
2648,-6.84
2649,-6.89
2650,-6.99
2651,-7.05
2652,-7.03
2653,-6.92
2654,-6.75
2655,-6.60
2656,-6.49
2657,-6.43
2658,-6.41
2659,-6.41
2660,-6.41
2661,-6.41
2662,-6.39
2663,-6.34
2664,-6.27
2665,-6.20
2666,-6.17
2667,-6.20
2668,-6.27
2669,-6.33
2670,-6.31
2671,-6.20
2672,-6.04
2673,-5.88
2674,-5.78
2675,-5.77
2676,-5.82
2677,-5.91
2678,-5.97
2679,-6.00
2680,-5.98
2681,-5.95
2682,-5.92
2683,-5.90
2684,-5.91
2685,-5.92
2686,-5.92
2687,-5.87
2688,-5.74
2689,-5.56
2690,-5.40
2691,-5.31
2692,-5.33
2693,-5.44
2694,-5.58
2695,-5.68
2696,-5.71
2697,-5.69
2698,-5.62
2699,-5.55
2700,-5.51
2701,-5.50
2702,-5.51
2703,-5.55
2704,-5.59
2705,-5.60
2706,-5.56
2707,-5.45
2708,-5.31
2709,-5.22
2710,-5.22
2711,-5.32
2712,-5.48
2713,-5.60
2714,-5.62
2715,-5.53
2716,-5.39
2717,-5.30
2718,-5.32
2719,-5.44
2720,-5.58
2721,-5.67
2722,-5.68
2723,-5.63
2724,-5.59
2725,-5.59
2726,-5.63
2727,-5.68
2728,-5.72
2729,-5.73
2730,-5.69
2731,-5.63
2732,-5.55
2733,-5.47
2734,-5.41
2735,-5.40
2736,-5.41
2737,-5.44
2738,-5.45
2739,-5.42
2740,-5.36
2741,-5.30
2742,-5.25
2743,-5.22
2744,-5.19
2745,-5.15
2746,-5.10
2747,-5.06
2748,-5.08
2749,-5.14
2750,-5.23
2751,-5.30
2752,-5.34
2753,-5.34
2754,-5.32
2755,-5.30
2756,-5.30
2757,-5.33
2758,-5.36
2759,-5.38
2760,-5.39
2761,-5.41
2762,-5.45
2763,-5.49
2764,-5.48
2765,-5.42
2766,-5.32
2767,-5.22
2768,-5.18
2769,-5.22
2770,-5.33
2771,-5.45
2772,-5.54
2773,-5.57
2774,-5.55
2775,-5.51
2776,-5.46
2777,-5.45
2778,-5.48
2779,-5.54
2780,-5.62
2781,-5.68
2782,-5.73
2783,-5.75
2784,-5.72
2785,-5.66
2786,-5.56
2787,-5.46
2788,-5.38
2789,-5.33
2790,-5.34
2791,-5.36
2792,-5.39
2793,-5.40
2794,-5.41
2795,-5.41
2796,-5.41
2797,-5.40
2798,-5.42
2799,-5.47
2800,-5.54
2801,-5.62
2802,-5.70
2803,-5.74
2804,-5.74
2805,-5.68
2806,-5.57
2807,-5.44
2808,-5.36
2809,-5.36
2810,-5.41
2811,-5.50
2812,-5.57
2813,-5.59
2814,-5.57
2815,-5.50
2816,-5.44
2817,-5.44
2818,-5.50
2819,-5.61
2820,-5.70
2821,-5.73
2822,-5.67
2823,-5.60
2824,-5.55
2825,-5.53
2826,-5.54
2827,-5.54
2828,-5.56
2829,-5.61
2830,-5.69
2831,-5.74
2832,-5.75
2833,-5.72
2834,-5.71
2835,-5.74
2836,-5.80
2837,-5.85
2838,-5.84
2839,-5.78
2840,-5.73
2841,-5.72
2842,-5.79
2843,-5.88
2844,-5.94
2845,-5.96
2846,-5.95
2847,-5.97
2848,-6.01
2849,-6.01
2850,-5.95
2851,-5.82
2852,-5.69
2853,-5.63
2854,-5.66
2855,-5.75
2856,-5.81
2857,-5.83
2858,-5.79
2859,-5.75
2860,-5.75
2861,-5.76
2862,-5.76
2863,-5.70
2864,-5.62
2865,-5.57
2866,-5.59
2867,-5.66
2868,-5.73
2869,-5.71
2870,-5.60
2871,-5.42
2872,-5.26
2873,-5.18
2874,-5.18
2875,-5.26
2876,-5.34
2877,-5.38
2878,-5.36
2879,-5.31
2880,-5.27
2881,-5.29
2882,-5.34
2883,-5.41
2884,-5.42
2885,-5.35
2886,-5.23
2887,-5.13
2888,-5.11
2889,-5.18
2890,-5.30
2891,-5.39
2892,-5.38
2893,-5.26
2894,-5.12
2895,-5.04
2896,-5.07
2897,-5.18
2898,-5.30
2899,-5.36
2900,-5.34
2901,-5.29
2902,-5.26
2903,-5.26
2904,-5.27
2905,-5.24
2906,-5.16
2907,-5.06
2908,-5.00
2909,-5.01
2910,-5.09
2911,-5.21
2912,-5.33
2913,-5.45
2914,-5.58
2915,-5.68
2916,-5.75
2917,-5.75
2918,-5.71
2919,-5.66
2920,-5.68
2921,-5.77
2922,-5.91
2923,-6.03
2924,-6.10
2925,-6.15
2926,-6.20
2927,-6.27
2928,-6.34
2929,-6.35
2930,-6.30
2931,-6.21
2932,-6.15
2933,-6.17
2934,-6.26
2935,-6.38
2936,-6.43
2937,-6.41
2938,-6.33
2939,-6.27
2940,-6.29
2941,-6.40
2942,-6.54
2943,-6.63
2944,-6.62
2945,-6.54
2946,-6.45
2947,-6.43
2948,-6.49
2949,-6.59
2950,-6.67
2951,-6.69
2952,-6.67
2953,-6.66
2954,-6.71
2955,-6.80
2956,-6.88
2957,-6.90
2958,-6.83
2959,-6.71
2960,-6.62
2961,-6.59
2962,-6.64
2963,-6.73
2964,-6.78
2965,-6.79
2966,-6.77
2967,-6.74
2968,-6.70
2969,-6.67
2970,-6.69
2971,-6.76
2972,-6.88
2973,-6.99
2974,-7.05
2975,-7.07
2976,-7.07
2977,-7.06
2978,-7.03
2979,-6.97
2980,-6.91
2981,-6.88
2982,-6.89
2983,-6.92
2984,-6.95
2985,-6.95
2986,-6.93
2987,-6.92
2988,-6.92
2989,-6.91
2990,-6.86
2991,-6.77
2992,-6.67
2993,-6.63
2994,-6.71
2995,-6.89
2996,-7.10
2997,-7.26
2998,-7.29
2999,-7.21
3000,-7.08
3001,-7.00
3002,-7.01
3003,-7.09
3004,-7.18
3005,-7.23
3006,-7.19
3007,-7.07
3008,-6.93
3009,-6.86
3010,-6.92
3011,-7.09
3012,-7.28
3013,-7.39
3014,-7.35
3015,-7.19
3016,-7.03
3017,-6.96
3018,-7.03
3019,-7.15
3020,-7.24
3021,-7.24
3022,-7.19
3023,-7.14
3024,-7.15
3025,-7.18
3026,-7.19
3027,-7.14
3028,-7.08
3029,-7.06
3030,-7.14
3031,-7.28
3032,-7.42
3033,-7.52
3034,-7.53
3035,-7.49
3036,-7.46
3037,-7.48
3038,-7.52
3039,-7.54
3040,-7.49
3041,-7.35
3042,-7.18
3043,-7.06
3044,-7.06
3045,-7.15
3046,-7.31
3047,-7.44
3048,-7.50
3049,-7.47
3050,-7.38
3051,-7.28
3052,-7.21
3053,-7.19
3054,-7.22
3055,-7.28
3056,-7.33
3057,-7.34
3058,-7.31
3059,-7.26
3060,-7.22
3061,-7.24
3062,-7.29
3063,-7.35
3064,-7.38
3065,-7.34
3066,-7.25
3067,-7.17
3068,-7.11
3069,-7.10
3070,-7.08
3071,-7.02
3072,-6.91
3073,-6.78
3074,-6.72
3075,-6.74
3076,-6.83
3077,-6.90
3078,-6.87
3079,-6.74
3080,-6.59
3081,-6.53
3082,-6.58
3083,-6.71
3084,-6.84
3085,-6.89
3086,-6.87
3087,-6.82
3088,-6.77
3089,-6.74
3090,-6.70
3091,-6.66
3092,-6.61
3093,-6.61
3094,-6.67
3095,-6.78
3096,-6.88
3097,-6.92
3098,-6.89
3099,-6.85
3100,-6.83
3101,-6.84
3102,-6.86
3103,-6.86
3104,-6.84
3105,-6.82
3106,-6.81
3107,-6.83
3108,-6.87
3109,-6.92
3110,-6.96
3111,-6.98
3112,-6.97
3113,-6.91
3114,-6.84
3115,-6.79
3116,-6.81
3117,-6.93
3118,-7.11
3119,-7.31
3120,-7.41
3121,-7.39
3122,-7.23
3123,-7.03
3124,-6.88
3125,-6.84
3126,-6.90
3127,-6.98
3128,-7.01
3129,-6.96
3130,-6.85
3131,-6.73
3132,-6.67
3133,-6.67
3134,-6.72
3135,-6.78
3136,-6.83
3137,-6.86
3138,-6.88
3139,-6.89
3140,-6.88
3141,-6.86
3142,-6.81
3143,-6.74
3144,-6.65
3145,-6.57
3146,-6.53
3147,-6.52
3148,-6.53
3149,-6.52
3150,-6.48
3151,-6.43
3152,-6.37
3153,-6.29
3154,-6.23
3155,-6.19
3156,-6.18
3157,-6.22
3158,-6.30
3159,-6.41
3160,-6.48
3161,-6.49
3162,-6.41
3163,-6.29
3164,-6.16
3165,-6.13
3166,-6.21
3167,-6.38
3168,-6.54
3169,-6.62
3170,-6.57
3171,-6.45
3172,-6.31
3173,-6.23
3174,-6.23
3175,-6.27
3176,-6.30
3177,-6.31
3178,-6.31
3179,-6.33
3180,-6.39
3181,-6.46
3182,-6.51
3183,-6.51
3184,-6.48
3185,-6.47
3186,-6.50
3187,-6.56
3188,-6.59
3189,-6.55
3190,-6.47
3191,-6.38
3192,-6.33
3193,-6.32
3194,-6.33
3195,-6.29
3196,-6.17
3197,-6.00
3198,-5.81
3199,-5.69
3200,-5.64
3201,-5.68
3202,-5.77
3203,-5.86
3204,-5.91
3205,-5.88
3206,-5.83
3207,-5.79
3208,-5.80
3209,-5.86
3210,-5.92
3211,-5.93
3212,-5.86
3213,-5.74
3214,-5.65
3215,-5.64
3216,-5.72
3217,-5.81
3218,-5.81
3219,-5.69
3220,-5.53
3221,-5.41
3222,-5.37
3223,-5.39
3224,-5.40
3225,-5.36
3226,-5.28
3227,-5.22
3228,-5.26
3229,-5.39
3230,-5.56
3231,-5.68
3232,-5.72
3233,-5.69
3234,-5.66
3235,-5.69
3236,-5.80
3237,-5.94
3238,-6.04
3239,-6.05
3240,-6.01
3241,-5.93
3242,-5.90
3243,-5.91
3244,-5.96
3245,-6.02
3246,-6.07
3247,-6.10
3248,-6.12
3249,-6.15
3250,-6.20
3251,-6.24
3252,-6.27
3253,-6.27
3254,-6.26
3255,-6.24
3256,-6.26
3257,-6.33
3258,-6.43
3259,-6.52
3260,-6.55
3261,-6.46
3262,-6.30
3263,-6.11
3264,-5.98
3265,-5.98
3266,-6.09
3267,-6.26
3268,-6.39
3269,-6.44
3270,-6.40
3271,-6.30
3272,-6.16
3273,-6.05
3274,-6.01
3275,-6.05
3276,-6.15
3277,-6.26
3278,-6.31
3279,-6.29
3280,-6.23
3281,-6.19
3282,-6.23
3283,-6.34
3284,-6.49
3285,-6.59
3286,-6.58
3287,-6.47
3288,-6.31
3289,-6.17
3290,-6.11
3291,-6.10
3292,-6.11
3293,-6.12
3294,-6.14
3295,-6.16
3296,-6.20
3297,-6.24
3298,-6.28
3299,-6.32
3300,-6.34
3301,-6.32
3302,-6.30
3303,-6.28
3304,-6.28
3305,-6.30
3306,-6.33
3307,-6.33
3308,-6.28
3309,-6.23
3310,-6.20
3311,-6.24
3312,-6.32
3313,-6.41
3314,-6.44
3315,-6.41
3316,-6.34
3317,-6.29
3318,-6.32
3319,-6.41
3320,-6.49
3321,-6.49
3322,-6.38
3323,-6.23
3324,-6.12
3325,-6.09
3326,-6.13
3327,-6.18
3328,-6.20
3329,-6.20
3330,-6.23
3331,-6.29
3332,-6.36
3333,-6.37
3334,-6.31
3335,-6.22
3336,-6.15
3337,-6.14
3338,-6.16
3339,-6.17
3340,-6.10
3341,-5.97
3342,-5.86
3343,-5.84
3344,-5.95
3345,-6.12
3346,-6.24
3347,-6.24
3348,-6.11
3349,-5.93
3350,-5.79
3351,-5.77
3352,-5.86
3353,-6.01
3354,-6.10
3355,-6.08
3356,-5.98
3357,-5.89
3358,-5.87
3359,-5.93
3360,-6.00
3361,-5.99
3362,-5.88
3363,-5.73
3364,-5.66
3365,-5.72
3366,-5.89
3367,-6.08
3368,-6.18
3369,-6.16
3370,-6.08
3371,-5.99
3372,-5.97
3373,-5.99
3374,-6.02
3375,-6.05
3376,-6.09
3377,-6.18
3378,-6.29
3379,-6.39
3380,-6.42
3381,-6.36
3382,-6.25
3383,-6.14
3384,-6.09
3385,-6.12
3386,-6.20
3387,-6.29
3388,-6.37
3389,-6.45
3390,-6.55
3391,-6.69
3392,-6.84
3393,-6.97
3394,-7.05
3395,-7.03
3396,-6.96
3397,-6.89
3398,-6.87
3399,-6.91
3400,-6.98
3401,-7.03
3402,-7.05
3403,-7.04
3404,-7.05
3405,-7.06
3406,-7.09
3407,-7.10
3408,-7.09
3409,-7.09
3410,-7.14
3411,-7.24
3412,-7.33
3413,-7.36
3414,-7.30
3415,-7.17
3416,-7.03
3417,-6.95
3418,-6.95
3419,-6.99
3420,-7.06
3421,-7.11
3422,-7.17
3423,-7.21
3424,-7.25
3425,-7.27
3426,-7.24
3427,-7.18
3428,-7.11
3429,-7.06
3430,-7.02
3431,-6.97
3432,-6.93
3433,-6.90
3434,-6.91
3435,-6.98
3436,-7.11
3437,-7.27
3438,-7.40
3439,-7.50
3440,-7.55
3441,-7.54
3442,-7.51
3443,-7.47
3444,-7.46
3445,-7.49
3446,-7.54
3447,-7.57
3448,-7.55
3449,-7.47
3450,-7.37
3451,-7.32
3452,-7.37
3453,-7.52
3454,-7.73
3455,-7.91
3456,-7.99
3457,-7.97
3458,-7.88
3459,-7.76
3460,-7.65
3461,-7.58
3462,-7.53
3463,-7.50
3464,-7.50
3465,-7.51
3466,-7.53
3467,-7.55
3468,-7.58
3469,-7.62
3470,-7.69
3471,-7.74
3472,-7.75
3473,-7.70
3474,-7.64
3475,-7.60
3476,-7.58
3477,-7.56
3478,-7.55
3479,-7.56
3480,-7.57
3481,-7.56
3482,-7.54
3483,-7.51
3484,-7.48
3485,-7.46
3486,-7.45
3487,-7.45
3488,-7.44
3489,-7.40
3490,-7.33
3491,-7.25
3492,-7.20
3493,-7.22
3494,-7.31
3495,-7.41
3496,-7.48
3497,-7.50
3498,-7.51
3499,-7.54
3500,-7.59
3501,-7.61
3502,-7.60
3503,-7.56
3504,-7.55
3505,-7.60
3506,-7.72
3507,-7.86
3508,-8.00
3509,-8.08
3510,-8.12
3511,-8.15
3512,-8.19
3513,-8.22
3514,-8.24
3515,-8.25
3516,-8.27
3517,-8.33
3518,-8.40
3519,-8.44
3520,-8.41
3521,-8.32
3522,-8.22
3523,-8.17
3524,-8.21
3525,-8.31
3526,-8.41
3527,-8.43
3528,-8.35
3529,-8.21
3530,-8.09
3531,-8.07
3532,-8.15
3533,-8.28
3534,-8.36
3535,-8.35
3536,-8.27
3537,-8.18
3538,-8.15
3539,-8.18
3540,-8.21
3541,-8.21
3542,-8.16
3543,-8.09
3544,-8.05
3545,-8.05
3546,-8.07
3547,-8.08
3548,-8.04
3549,-7.94
3550,-7.84
3551,-7.79
3552,-7.82
3553,-7.89
3554,-7.93
3555,-7.89
3556,-7.71
3557,-7.45
3558,-7.21
3559,-7.10
3560,-7.11
3561,-7.19
3562,-7.24
3563,-7.20
3564,-7.10
3565,-7.01
3566,-7.00
3567,-7.08
3568,-7.16
3569,-7.19
3570,-7.14
3571,-7.07
3572,-7.07
3573,-7.17
3574,-7.32
3575,-7.40
3576,-7.38
3577,-7.27
3578,-7.17
3579,-7.17
3580,-7.30
3581,-7.47
3582,-7.57
3583,-7.54
3584,-7.43
3585,-7.34
3586,-7.35
3587,-7.48
3588,-7.68
3589,-7.88
3590,-8.04
3591,-8.14
3592,-8.18
3593,-8.18
3594,-8.18
3595,-8.18
3596,-8.21
3597,-8.25
3598,-8.28
3599,-8.29
3600,-8.28
3601,-8.30
3602,-8.36
3603,-8.45
3604,-8.48
3605,-8.42
3606,-8.27
3607,-8.10
3608,-8.01
3609,-8.05
3610,-8.16
3611,-8.26
3612,-8.26
3613,-8.16
3614,-8.05
3615,-8.01
3616,-8.09
3617,-8.22
3618,-8.33
3619,-8.34
3620,-8.24
3621,-8.08
3622,-7.90
3623,-7.71
3624,-7.56
3625,-7.50
3626,-7.57
3627,-7.77
3628,-8.00
3629,-8.14
3630,-8.10
3631,-7.93
3632,-7.72
3633,-7.60
3634,-7.60
3635,-7.65
3636,-7.69
3637,-7.66
3638,-7.59
3639,-7.53
3640,-7.52
3641,-7.53
3642,-7.53
3643,-7.52
3644,-7.50
3645,-7.55
3646,-7.65
3647,-7.76
3648,-7.83
3649,-7.81
3650,-7.74
3651,-7.66
3652,-7.61
3653,-7.57
3654,-7.53
3655,-7.48
3656,-7.46
3657,-7.51
3658,-7.63
3659,-7.77
3660,-7.86
3661,-7.90
3662,-7.89
3663,-7.89
3664,-7.89
3665,-7.88
3666,-7.80
3667,-7.68
3668,-7.55
3669,-7.46
3670,-7.45
3671,-7.46
3672,-7.48
3673,-7.46
3674,-7.42
3675,-7.40
3676,-7.40
3677,-7.42
3678,-7.41
3679,-7.35
3680,-7.29
3681,-7.26
3682,-7.27
3683,-7.32
3684,-7.33
3685,-7.29
3686,-7.20
3687,-7.09
3688,-7.01
3689,-6.99
3690,-7.05
3691,-7.15
3692,-7.25
3693,-7.30
3694,-7.27
3695,-7.20
3696,-7.13
3697,-7.10
3698,-7.13
3699,-7.20
3700,-7.24
3701,-7.22
3702,-7.11
3703,-6.97
3704,-6.86
3705,-6.82
3706,-6.85
3707,-6.90
3708,-6.94
3709,-6.94
3710,-6.95
3711,-7.00
3712,-7.11
3713,-7.26
3714,-7.38
3715,-7.41
3716,-7.32
3717,-7.17
3718,-7.03
3719,-6.95
3720,-6.94
3721,-6.95
3722,-6.97
3723,-6.97
3724,-6.98
3725,-6.99
3726,-7.02
3727,-7.03
3728,-7.05
3729,-7.09
3730,-7.15
3731,-7.21
3732,-7.22
3733,-7.15
3734,-7.04
3735,-6.95
3736,-6.97
3737,-7.06
3738,-7.15
3739,-7.15
3740,-7.05
3741,-6.96
3742,-6.98
3743,-7.12
3744,-7.29
3745,-7.38
3746,-7.31
3747,-7.15
3748,-7.00
3749,-6.93
3750,-6.97
3751,-7.06
3752,-7.16
3753,-7.24
3754,-7.28
3755,-7.30
3756,-7.31
3757,-7.32
3758,-7.32
3759,-7.29
3760,-7.24
3761,-7.18
3762,-7.10
3763,-7.04
3764,-7.03
3765,-7.06
3766,-7.09
3767,-7.06
3768,-6.98
3769,-6.86
3770,-6.76
3771,-6.74
3772,-6.77
3773,-6.80
3774,-6.74
3775,-6.59
3776,-6.41
3777,-6.27
3778,-6.24
3779,-6.28
3780,-6.35
3781,-6.36
3782,-6.33
3783,-6.28
3784,-6.28
3785,-6.34
3786,-6.42
3787,-6.49
3788,-6.52
3789,-6.56
3790,-6.62
3791,-6.71
3792,-6.81
3793,-6.86
3794,-6.89
3795,-6.92
3796,-6.96
3797,-7.02
3798,-7.09
3799,-7.13
3800,-7.14
3801,-7.11
3802,-7.08
3803,-7.06
3804,-7.04
3805,-7.03
3806,-7.02
3807,-7.02
3808,-7.05
3809,-7.07
3810,-7.08
3811,-7.07
3812,-7.06
3813,-7.07
3814,-7.11
3815,-7.16
3816,-7.17
3817,-7.15
3818,-7.09
3819,-7.04
3820,-7.03
3821,-7.05
3822,-7.08
3823,-7.10
3824,-7.11
3825,-7.09
3826,-7.04
3827,-6.98
3828,-6.94
3829,-6.95
3830,-7.05
3831,-7.19
3832,-7.30
3833,-7.28
3834,-7.15
3835,-6.98
3836,-6.88
3837,-6.91
3838,-7.06
3839,-7.19
3840,-7.20
3841,-7.07
3842,-6.90
3843,-6.79
3844,-6.80
3845,-6.89
3846,-6.98
3847,-7.01
3848,-6.98
3849,-6.94
3850,-6.92
3851,-6.95
3852,-7.00
3853,-7.03
3854,-7.00
3855,-6.93
3856,-6.84
3857,-6.77
3858,-6.75
3859,-6.80
3860,-6.89
3861,-7.00
3862,-7.10
3863,-7.16
3864,-7.17
3865,-7.13
3866,-7.06
3867,-6.99
3868,-6.92
3869,-6.86
3870,-6.86
3871,-6.91
3872,-7.00
3873,-7.11
3874,-7.18
3875,-7.18
3876,-7.14
3877,-7.10
3878,-7.12
3879,-7.20
3880,-7.32
3881,-7.42
3882,-7.45
3883,-7.40
3884,-7.29
3885,-7.18
3886,-7.12
3887,-7.13
3888,-7.18
3889,-7.26
3890,-7.35
3891,-7.45
3892,-7.53
3893,-7.58
3894,-7.57
3895,-7.50
3896,-7.41
3897,-7.33
3898,-7.30
3899,-7.35
3900,-7.44
3901,-7.55
3902,-7.60
3903,-7.61
3904,-7.60
3905,-7.60
3906,-7.62
3907,-7.65
3908,-7.70
3909,-7.75
3910,-7.80
3911,-7.79
3912,-7.72
3913,-7.60
3914,-7.50
3915,-7.52
3916,-7.67
3917,-7.85
3918,-7.93
3919,-7.89
3920,-7.78
3921,-7.72
3922,-7.77
3923,-7.89
3924,-8.03
3925,-8.07
3926,-7.99
3927,-7.82
3928,-7.67
3929,-7.62
3930,-7.69
3931,-7.81
3932,-7.91
3933,-7.93
3934,-7.89
3935,-7.86
3936,-7.88
3937,-7.97
3938,-8.09
3939,-8.20
3940,-8.28
3941,-8.32
3942,-8.36
3943,-8.40
3944,-8.43
3945,-8.44
3946,-8.44
3947,-8.43
3948,-8.44
3949,-8.47
3950,-8.51
3951,-8.56
3952,-8.59
3953,-8.60
3954,-8.60
3955,-8.62
3956,-8.68
3957,-8.80
3958,-8.94
3959,-9.05
3960,-9.05
3961,-8.93
3962,-8.73
3963,-8.59
3964,-8.58
3965,-8.71
3966,-8.87
3967,-8.95
3968,-8.91
3969,-8.79
3970,-8.66
3971,-8.58
3972,-8.57
3973,-8.59
3974,-8.61
3975,-8.59
3976,-8.54
3977,-8.49
3978,-8.44
3979,-8.40
3980,-8.38
3981,-8.39
3982,-8.43
3983,-8.49
3984,-8.55
3985,-8.59
3986,-8.61
3987,-8.58
3988,-8.53
3989,-8.47
3990,-8.41
3991,-8.40
3992,-8.41
3993,-8.44
3994,-8.48
3995,-8.54
3996,-8.60
3997,-8.66
3998,-8.70
3999,-8.70
4000,-8.63
4001,-8.50
4002,-8.35
4003,-8.22
4004,-8.16
4005,-8.20
4006,-8.30
4007,-8.40
4008,-8.47
4009,-8.50
4010,-8.52
4011,-8.54
4012,-8.55
4013,-8.54
4014,-8.48
4015,-8.38
4016,-8.24
4017,-8.12
4018,-8.07
4019,-8.13
4020,-8.29
4021,-8.45
4022,-8.54
4023,-8.54
4024,-8.46
4025,-8.38
4026,-8.33
4027,-8.33
4028,-8.35
4029,-8.35
4030,-8.36
4031,-8.40
4032,-8.48
4033,-8.58
4034,-8.64
4035,-8.58
4036,-8.40
4037,-8.18
4038,-8.03
4039,-8.02
4040,-8.13
4041,-8.28
4042,-8.38
4043,-8.37
4044,-8.29
4045,-8.18
4046,-8.12
4047,-8.13
4048,-8.18
4049,-8.23
4050,-8.22
4051,-8.16
4052,-8.10
4053,-8.09
4054,-8.16
4055,-8.27
4056,-8.38
4057,-8.43
4058,-8.39
4059,-8.30
4060,-8.24
4061,-8.26
4062,-8.36
4063,-8.46
4064,-8.50
4065,-8.46
4066,-8.37
4067,-8.29
4068,-8.27
4069,-8.30
4070,-8.34
4071,-8.36
4072,-8.33
4073,-8.29
4074,-8.25
4075,-8.26
4076,-8.31
4077,-8.38
4078,-8.44
4079,-8.48
4080,-8.52
4081,-8.57
4082,-8.64
4083,-8.73
4084,-8.82
4085,-8.88
4086,-8.91
4087,-8.91
4088,-8.89
4089,-8.87
4090,-8.87
4091,-8.85
4092,-8.81
4093,-8.74
4094,-8.64
4095,-8.54
4096,-8.46
4097,-8.41
4098,-8.41
4099,-8.45
4100,-8.50
4101,-8.55
4102,-8.58
4103,-8.56
4104,-8.50
4105,-8.41
4106,-8.30
4107,-8.22
4108,-8.19
4109,-8.23
4110,-8.29
4111,-8.32
4112,-8.27
4113,-8.15
4114,-7.97
4115,-7.82
4116,-7.77
4117,-7.84
4118,-8.00
4119,-8.19
4120,-8.32
4121,-8.32
4122,-8.19
4123,-7.97
4124,-7.74
4125,-7.62
4126,-7.63
4127,-7.76
4128,-7.90
4129,-7.98
4130,-7.97
4131,-7.91
4132,-7.88
4133,-7.90
4134,-7.95
4135,-8.00
4136,-8.01
4137,-7.99
4138,-7.95
4139,-7.91
4140,-7.87
4141,-7.85
4142,-7.84
4143,-7.87
4144,-7.92
4145,-7.98
4146,-7.99
4147,-7.96
4148,-7.89
4149,-7.82
4150,-7.78
4151,-7.74
4152,-7.70
4153,-7.64
4154,-7.60
4155,-7.58
4156,-7.59
4157,-7.61
4158,-7.61
4159,-7.57
4160,-7.52
4161,-7.47
4162,-7.47
4163,-7.53
4164,-7.62
4165,-7.71
4166,-7.75
4167,-7.74
4168,-7.71
4169,-7.74
4170,-7.84
4171,-7.97
4172,-8.05
4173,-7.98
4174,-7.76
4175,-7.49
4176,-7.30
4177,-7.26
4178,-7.35
4179,-7.45
4180,-7.49
4181,-7.46
4182,-7.43
4183,-7.50
4184,-7.66
4185,-7.83
4186,-7.90
4187,-7.81
4188,-7.60
4189,-7.39
4190,-7.27
4191,-7.24
4192,-7.27
4193,-7.28
4194,-7.28
4195,-7.30
4196,-7.36
4197,-7.43
4198,-7.48
4199,-7.49
4200,-7.47
4201,-7.45
4202,-7.47
4203,-7.54
4204,-7.65
4205,-7.75
4206,-7.84
4207,-7.90
4208,-7.97
4209,-8.01
4210,-8.04
4211,-8.04
4212,-8.02
4213,-7.99
4214,-7.93
4215,-7.83
4216,-7.72
4217,-7.64
4218,-7.65
4219,-7.74
4220,-7.86
4221,-7.91
4222,-7.84
4223,-7.69
4224,-7.55
4225,-7.53
4226,-7.63
4227,-7.75
4228,-7.79
4229,-7.68
4230,-7.47
4231,-7.29
4232,-7.21
4233,-7.28
4234,-7.39
4235,-7.47
4236,-7.45
4237,-7.34
4238,-7.22
4239,-7.17
4240,-7.21
4241,-7.27
4242,-7.29
4243,-7.24
4244,-7.17
4245,-7.14
4246,-7.18
4247,-7.29
4248,-7.39
4249,-7.42
4250,-7.36
4251,-7.24
4252,-7.15
4253,-7.12
4254,-7.16
4255,-7.24
4256,-7.28
4257,-7.25
4258,-7.17
4259,-7.10
4260,-7.10
4261,-7.20
4262,-7.37
4263,-7.52
4264,-7.61
4265,-7.62
4266,-7.59
4267,-7.58
4268,-7.59
4269,-7.60
4270,-7.60
4271,-7.54
4272,-7.45
4273,-7.36
4274,-7.33
4275,-7.39
4276,-7.53
4277,-7.65
4278,-7.69
4279,-7.64
4280,-7.57
4281,-7.57
4282,-7.70
4283,-7.93
4284,-8.14
4285,-8.24
4286,-8.20
4287,-8.10
4288,-8.04
4289,-8.09
4290,-8.22
4291,-8.36
4292,-8.43
4293,-8.38
4294,-8.28
4295,-8.19
4296,-8.19
4297,-8.26
4298,-8.35
4299,-8.40
4300,-8.38
4301,-8.33
4302,-8.32
4303,-8.37
4304,-8.46
4305,-8.53
4306,-8.51
4307,-8.40
4308,-8.24
4309,-8.09
4310,-7.97
4311,-7.87
4312,-7.75
4313,-7.64
4314,-7.55
4315,-7.54
4316,-7.62
4317,-7.72
4318,-7.77
4319,-7.74
4320,-7.67
4321,-7.63
4322,-7.65
4323,-7.73
4324,-7.80
4325,-7.86
4326,-7.87
4327,-7.86
4328,-7.84
4329,-7.79
4330,-7.71
4331,-7.57
4332,-7.43
4333,-7.35
4334,-7.35
4335,-7.43
4336,-7.54
4337,-7.65
4338,-7.72
4339,-7.75
4340,-7.79
4341,-7.84
4342,-7.93
4343,-8.02
4344,-8.09
4345,-8.14
4346,-8.18
4347,-8.23
4348,-8.31
4349,-8.38
4350,-8.42
4351,-8.42
4352,-8.41
4353,-8.43
4354,-8.53
4355,-8.65
4356,-8.73
4357,-8.71
4358,-8.59
4359,-8.46
4360,-8.39
4361,-8.43
4362,-8.57
4363,-8.71
4364,-8.80
4365,-8.82
4366,-8.82
4367,-8.87
4368,-9.00
4369,-9.15
4370,-9.24
4371,-9.22
4372,-9.08
4373,-8.88
4374,-8.71
4375,-8.62
4376,-8.63
4377,-8.71
4378,-8.80
4379,-8.86
4380,-8.86
4381,-8.83
4382,-8.77
4383,-8.72
4384,-8.69
4385,-8.68
4386,-8.69
4387,-8.73
4388,-8.78
4389,-8.81
4390,-8.83
4391,-8.82
4392,-8.78
4393,-8.74
4394,-8.70
4395,-8.70
4396,-8.72
4397,-8.75
4398,-8.77
4399,-8.79
4400,-8.83
4401,-8.89
4402,-8.95
4403,-8.99
4404,-9.01
4405,-9.03
4406,-9.05
4407,-9.07
4408,-9.07
4409,-9.00
4410,-8.89
4411,-8.78
4412,-8.75
4413,-8.83
4414,-9.01
4415,-9.19
4416,-9.31
4417,-9.35
4418,-9.34
4419,-9.34
4420,-9.37
4421,-9.45
4422,-9.50
4423,-9.47
4424,-9.31
4425,-9.10
4426,-8.97
4427,-8.94
4428,-8.98
4429,-8.98
4430,-8.94
4431,-8.92
4432,-8.97
4433,-9.09
4434,-9.23
4435,-9.30
4436,-9.27
4437,-9.16
4438,-9.07
4439,-9.03
4440,-9.04
4441,-9.04
4442,-8.98
4443,-8.85
4444,-8.72
4445,-8.66
4446,-8.70
4447,-8.81
4448,-8.90
4449,-8.91
4450,-8.84
4451,-8.75
4452,-8.72
4453,-8.78
4454,-8.91
4455,-9.02
4456,-9.07
4457,-9.07
4458,-9.06
4459,-9.07
4460,-9.13
4461,-9.21
4462,-9.28
4463,-9.30
4464,-9.26
4465,-9.20
4466,-9.16
4467,-9.14
4468,-9.17
4469,-9.22
4470,-9.26
4471,-9.28
4472,-9.28
4473,-9.28
4474,-9.27
4475,-9.29
4476,-9.32
4477,-9.37
4478,-9.44
4479,-9.52
4480,-9.58
4481,-9.60
4482,-9.57
4483,-9.50
4484,-9.44
4485,-9.40
4486,-9.40
4487,-9.42
4488,-9.43
4489,-9.43
4490,-9.42
4491,-9.41
4492,-9.42
4493,-9.44
4494,-9.45
4495,-9.47
4496,-9.50
4497,-9.54
4498,-9.58
4499,-9.56
4500,-9.47
4501,-9.35
4502,-9.27
4503,-9.26
4504,-9.34
4505,-9.44
4506,-9.48
4507,-9.45
4508,-9.35
4509,-9.26
4510,-9.21
4511,-9.22
4512,-9.25
4513,-9.25
4514,-9.19
4515,-9.09
4516,-8.99
4517,-8.93
4518,-8.94
4519,-9.01
4520,-9.09
4521,-9.12
4522,-9.06
4523,-8.95
4524,-8.85
4525,-8.82
4526,-8.86
4527,-8.91
4528,-8.92
4529,-8.86
4530,-8.77
4531,-8.72
4532,-8.73
4533,-8.82
4534,-8.91
4535,-8.96
4536,-8.93
4537,-8.85
4538,-8.76
4539,-8.70
4540,-8.68
4541,-8.67
4542,-8.67
4543,-8.69
4544,-8.71
4545,-8.73
4546,-8.74
4547,-8.71
4548,-8.68
4549,-8.68
4550,-8.73
4551,-8.87
4552,-9.05
4553,-9.21
4554,-9.31
4555,-9.34
4556,-9.33
4557,-9.33
4558,-9.37
4559,-9.41
4560,-9.42
4561,-9.36
4562,-9.27
4563,-9.22
4564,-9.24
4565,-9.33
4566,-9.45
4567,-9.55
4568,-9.59
4569,-9.58
4570,-9.54
4571,-9.49
4572,-9.43
4573,-9.33
4574,-9.21
4575,-9.11
4576,-9.06
4577,-9.08
4578,-9.13
4579,-9.18
4580,-9.18
4581,-9.16
4582,-9.15
4583,-9.15
4584,-9.16
4585,-9.14
4586,-9.06
4587,-8.94
4588,-8.82
4589,-8.78
4590,-8.82
4591,-8.89
4592,-8.89
4593,-8.78
4594,-8.60
4595,-8.44
4596,-8.40
4597,-8.47
4598,-8.57
4599,-8.59
4600,-8.47
4601,-8.28
4602,-8.15
4603,-8.16
4604,-8.32
4605,-8.54
4606,-8.70
4607,-8.75
4608,-8.67
4609,-8.53
4610,-8.40
4611,-8.34
4612,-8.37
4613,-8.45
4614,-8.53
4615,-8.56
4616,-8.53
4617,-8.49
4618,-8.48
4619,-8.54
4620,-8.61
4621,-8.65
4622,-8.63
4623,-8.59
4624,-8.58
4625,-8.62
4626,-8.69
4627,-8.74
4628,-8.73
4629,-8.67
4630,-8.60
4631,-8.58
4632,-8.61
4633,-8.67
4634,-8.69
4635,-8.65
4636,-8.56
4637,-8.47
4638,-8.41
4639,-8.40
4640,-8.44
4641,-8.50
4642,-8.57
4643,-8.60
4644,-8.59
4645,-8.54
4646,-8.45
4647,-8.36
4648,-8.31
4649,-8.28
4650,-8.26
4651,-8.21
4652,-8.14
4653,-8.07
4654,-8.03
4655,-8.05
4656,-8.11
4657,-8.16
4658,-8.14
4659,-8.03
4660,-7.86
4661,-7.69
4662,-7.61
4663,-7.68
4664,-7.88
4665,-8.12
4666,-8.27
4667,-8.27
4668,-8.15
4669,-8.04
4670,-8.04
4671,-8.17
4672,-8.34
4673,-8.45
4674,-8.44
4675,-8.35
4676,-8.27
4677,-8.27
4678,-8.37
4679,-8.52
4680,-8.62
4681,-8.65
4682,-8.61
4683,-8.54
4684,-8.50
4685,-8.50
4686,-8.54
4687,-8.60
4688,-8.66
4689,-8.72
4690,-8.76
4691,-8.78
4692,-8.77
4693,-8.72
4694,-8.63
4695,-8.51
4696,-8.40
4697,-8.39
4698,-8.47
4699,-8.65
4700,-8.84
4701,-8.96
4702,-8.97
4703,-8.89
4704,-8.76
4705,-8.63
4706,-8.56
4707,-8.52
4708,-8.48
4709,-8.44
4710,-8.42
4711,-8.45
4712,-8.51
4713,-8.58
4714,-8.61
4715,-8.58
4716,-8.48
4717,-8.35
4718,-8.24
4719,-8.18
4720,-8.20
4721,-8.29
4722,-8.42
4723,-8.54
4724,-8.60
4725,-8.58
4726,-8.50
4727,-8.41
4728,-8.37
4729,-8.41
4730,-8.48
4731,-8.51
4732,-8.47
4733,-8.36
4734,-8.23
4735,-8.15
4736,-8.13
4737,-8.15
4738,-8.18
4739,-8.19
4740,-8.20
4741,-8.23
4742,-8.29
4743,-8.37
4744,-8.43
4745,-8.43
4746,-8.36
4747,-8.28
4748,-8.23
4749,-8.24
4750,-8.29
4751,-8.35
4752,-8.37
4753,-8.39
4754,-8.41
4755,-8.46
4756,-8.51
4757,-8.55
4758,-8.60
4759,-8.65
4760,-8.72
4761,-8.79
4762,-8.82
4763,-8.80
4764,-8.71
4765,-8.61
4766,-8.56
4767,-8.59
4768,-8.69
4769,-8.78
4770,-8.83
4771,-8.84
4772,-8.83
4773,-8.80
4774,-8.77
4775,-8.70
4776,-8.60
4777,-8.52
4778,-8.51
4779,-8.54
4780,-8.57
4781,-8.54
4782,-8.47
4783,-8.44
4784,-8.49
4785,-8.59
4786,-8.68
4787,-8.70
4788,-8.66
4789,-8.60
4790,-8.56
4791,-8.55
4792,-8.55
4793,-8.55
4794,-8.56
4795,-8.59
4796,-8.65
4797,-8.70
4798,-8.73
4799,-8.70
4800,-8.62
4801,-8.54
4802,-8.56
4803,-8.68
4804,-8.83
4805,-8.92
4806,-8.92
4807,-8.87
4808,-8.87
4809,-8.96
4810,-9.09
4811,-9.19
4812,-9.17
4813,-9.05
4814,-8.92
4815,-8.84
4816,-8.83
4817,-8.87
4818,-8.90
4819,-8.90
4820,-8.87
4821,-8.80
4822,-8.74
4823,-8.69
4824,-8.70
4825,-8.74
4826,-8.80
4827,-8.87
4828,-8.92
4829,-8.94
4830,-8.91
4831,-8.84
4832,-8.76
4833,-8.72
4834,-8.75
4835,-8.82
4836,-8.88
4837,-8.88
4838,-8.81
4839,-8.71
4840,-8.65
4841,-8.68
4842,-8.78
4843,-8.90
4844,-8.98
4845,-9.00
4846,-8.97
4847,-8.91
4848,-8.89
4849,-8.93
4850,-9.05
4851,-9.22
4852,-9.38
4853,-9.45
4854,-9.43
4855,-9.33
4856,-9.22
4857,-9.18
4858,-9.24
4859,-9.37
4860,-9.47
4861,-9.49
4862,-9.45
4863,-9.41
4864,-9.43
4865,-9.51
4866,-9.62
4867,-9.69
4868,-9.72
4869,-9.70
4870,-9.65
4871,-9.61
4872,-9.59
4873,-9.58
4874,-9.60
4875,-9.65
4876,-9.74
4877,-9.81
4878,-9.83
4879,-9.80
4880,-9.73
4881,-9.66
4882,-9.56
4883,-9.43
4884,-9.27
4885,-9.13
4886,-9.07
4887,-9.11
4888,-9.19
4889,-9.23
4890,-9.19
4891,-9.07
4892,-8.93
4893,-8.86
4894,-8.88
4895,-8.98
4896,-9.06
4897,-9.10
4898,-9.09
4899,-9.05
4900,-9.05
4901,-9.09
4902,-9.18
4903,-9.27
4904,-9.35
4905,-9.39
4906,-9.38
4907,-9.34
4908,-9.31
4909,-9.31
4910,-9.34
4911,-9.38
4912,-9.38
4913,-9.30
4914,-9.15
4915,-9.01
4916,-8.96
4917,-9.07
4918,-9.29
4919,-9.52
4920,-9.63
4921,-9.58
4922,-9.44
4923,-9.32
4924,-9.32
4925,-9.43
4926,-9.57
4927,-9.61
4928,-9.54
4929,-9.40
4930,-9.30
4931,-9.31
4932,-9.41
4933,-9.51
4934,-9.56
4935,-9.51
4936,-9.42
4937,-9.35
4938,-9.34
4939,-9.37
4940,-9.42
4941,-9.47
4942,-9.53
4943,-9.59
4944,-9.65
4945,-9.68
4946,-9.66
4947,-9.59
4948,-9.52
4949,-9.48
4950,-9.52
4951,-9.60
4952,-9.69
4953,-9.72
4954,-9.72
4955,-9.70
4956,-9.70
4957,-9.70
4958,-9.68
4959,-9.66
4960,-9.66
4961,-9.71
4962,-9.82
4963,-9.94
4964,-10.04
4965,-10.06
4966,-10.04
4967,-10.02
4968,-10.03
4969,-10.06
4970,-10.06
4971,-10.00
4972,-9.91
4973,-9.87
4974,-9.93
4975,-10.09
4976,-10.27
4977,-10.35
4978,-10.27
4979,-10.06
4980,-9.81
4981,-9.66
4982,-9.66
4983,-9.79
4984,-9.95
4985,-10.03
4986,-10.02
4987,-9.94
4988,-9.86
4989,-9.85
4990,-9.89
4991,-9.96
4992,-10.00
4993,-9.99
4994,-9.97
4995,-9.93
4996,-9.87
4997,-9.80
4998,-9.70
4999,-9.60
5000,-9.52
5001,-9.49
5002,-9.50
5003,-9.55
5004,-9.63
5005,-9.73
5006,-9.81
5007,-9.84
5008,-9.77
5009,-9.62
5010,-9.45
5011,-9.33
5012,-9.33
5013,-9.43
5014,-9.54
5015,-9.60
5016,-9.58
5017,-9.51
5018,-9.45
5019,-9.44
5020,-9.46
5021,-9.50
5022,-9.50
5023,-9.48
5024,-9.47
5025,-9.49
5026,-9.52
5027,-9.52
5028,-9.45
5029,-9.35
5030,-9.30
5031,-9.35
5032,-9.50
5033,-9.64
5034,-9.68
5035,-9.61
5036,-9.53
5037,-9.53
5038,-9.66
5039,-9.88
5040,-10.07
5041,-10.14
5042,-10.10
5043,-10.00
5044,-9.92
5045,-9.87
5046,-9.83
5047,-9.77
5048,-9.72
5049,-9.70
5050,-9.71
5051,-9.72
5052,-9.72
5053,-9.73
5054,-9.79
5055,-9.93
5056,-10.10
5057,-10.20
5058,-10.17
5059,-10.01
5060,-9.82
5061,-9.74
5062,-9.79
5063,-9.92
5064,-10.01
5065,-9.95
5066,-9.77
5067,-9.57
5068,-9.48
5069,-9.56
5070,-9.71
5071,-9.83
5072,-9.80
5073,-9.63
5074,-9.44
5075,-9.32
5076,-9.31
5077,-9.37
5078,-9.40
5079,-9.38
5080,-9.32
5081,-9.30
5082,-9.34
5083,-9.42
5084,-9.49
5085,-9.49
5086,-9.44
5087,-9.37
5088,-9.33
5089,-9.34
5090,-9.36
5091,-9.36
5092,-9.34
5093,-9.33
5094,-9.36
5095,-9.44
5096,-9.52
5097,-9.57
5098,-9.55
5099,-9.47
5100,-9.36
5101,-9.30
5102,-9.33
5103,-9.42
5104,-9.53
5105,-9.58
5106,-9.54
5107,-9.44
5108,-9.35
5109,-9.32
5110,-9.34
5111,-9.36
5112,-9.37
5113,-9.36
5114,-9.37
5115,-9.44
5116,-9.55
5117,-9.67
5118,-9.73
5119,-9.72
5120,-9.68
5121,-9.66
5122,-9.66
5123,-9.69
5124,-9.69
5125,-9.64
5126,-9.55
5127,-9.47
5128,-9.46
5129,-9.52
5130,-9.64
5131,-9.73
5132,-9.75
5133,-9.68
5134,-9.56
5135,-9.46
5136,-9.43
5137,-9.50
5138,-9.62
5139,-9.73
5140,-9.79
5141,-9.80
5142,-9.77
5143,-9.75
5144,-9.76
5145,-9.77
5146,-9.79
5147,-9.78
5148,-9.77
5149,-9.75
5150,-9.74
5151,-9.72
5152,-9.72
5153,-9.75
5154,-9.82
5155,-9.91
5156,-9.96
5157,-9.94
5158,-9.87
5159,-9.80
5160,-9.76
5161,-9.78
5162,-9.83
5163,-9.87
5164,-9.85
5165,-9.77
5166,-9.65
5167,-9.52
5168,-9.40
5169,-9.33
5170,-9.30
5171,-9.33
5172,-9.38
5173,-9.42
5174,-9.40
5175,-9.29
5176,-9.11
5177,-8.94
5178,-8.85
5179,-8.90
5180,-9.05
5181,-9.22
5182,-9.32
5183,-9.31
5184,-9.21
5185,-9.11
5186,-9.05
5187,-9.05
5188,-9.03
5189,-8.97
5190,-8.85
5191,-8.74
5192,-8.68
5193,-8.67
5194,-8.68
5195,-8.67
5196,-8.65
5197,-8.64
5198,-8.68
5199,-8.75
5200,-8.80
5201,-8.77
5202,-8.69
5203,-8.61
5204,-8.58
5205,-8.62
5206,-8.68
5207,-8.70
5208,-8.67
5209,-8.64
5210,-8.63
5211,-8.68
5212,-8.73
5213,-8.74
5214,-8.68
5215,-8.54
5216,-8.40
5217,-8.29
5218,-8.26
5219,-8.32
5220,-8.43
5221,-8.54
5222,-8.60
5223,-8.62
5224,-8.62
5225,-8.66
5226,-8.74
5227,-8.84
5228,-8.93
5229,-8.96
5230,-8.95
5231,-8.91
5232,-8.89
5233,-8.91
5234,-8.97
5235,-9.05
5236,-9.18
5237,-9.32
5238,-9.48
5239,-9.61
5240,-9.72
5241,-9.79
5242,-9.80
5243,-9.78
5244,-9.76
5245,-9.76
5246,-9.81
5247,-9.89
5248,-9.96
5249,-9.98
5250,-9.93
5251,-9.82
5252,-9.69
5253,-9.58
5254,-9.52
5255,-9.50
5256,-9.53
5257,-9.59
5258,-9.65
5259,-9.70
5260,-9.70
5261,-9.66
5262,-9.59
5263,-9.51
5264,-9.45
5265,-9.42
5266,-9.43
5267,-9.43
5268,-9.39
5269,-9.31
5270,-9.21
5271,-9.10
5272,-9.02
5273,-8.98
5274,-8.97
5275,-9.00
5276,-9.05
5277,-9.09
5278,-9.10
5279,-9.07
5280,-9.02
5281,-8.96
5282,-8.96
5283,-9.04
5284,-9.18
5285,-9.30
5286,-9.34
5287,-9.27
5288,-9.15
5289,-9.09
5290,-9.15
5291,-9.33
5292,-9.55
5293,-9.71
5294,-9.74
5295,-9.66
5296,-9.57
5297,-9.54
5298,-9.58
5299,-9.64
5300,-9.66
5301,-9.59
5302,-9.47
5303,-9.37
5304,-9.35
5305,-9.43
5306,-9.56
5307,-9.68
5308,-9.77
5309,-9.80
5310,-9.82
5311,-9.84
5312,-9.88
5313,-9.91
5314,-9.92
5315,-9.91
5316,-9.88
5317,-9.89
5318,-9.95
5319,-10.05
5320,-10.15
5321,-10.19
5322,-10.16
5323,-10.08
5324,-10.02
5325,-10.04
5326,-10.13
5327,-10.25
5328,-10.35
5329,-10.37
5330,-10.33
5331,-10.26
5332,-10.20
5333,-10.15
5334,-10.13
5335,-10.14
5336,-10.19
5337,-10.26
5338,-10.32
5339,-10.35
5340,-10.32
5341,-10.25
5342,-10.20
5343,-10.22
5344,-10.29
5345,-10.35
5346,-10.35
5347,-10.27
5348,-10.19
5349,-10.16
5350,-10.18
5351,-10.24
5352,-10.31
5353,-10.38
5354,-10.41
5355,-10.39
5356,-10.34
5357,-10.30
5358,-10.28
5359,-10.29
5360,-10.31
5361,-10.31
5362,-10.33
5363,-10.37
5364,-10.42
5365,-10.47
5366,-10.50
5367,-10.49
5368,-10.49
5369,-10.52
5370,-10.58
5371,-10.66
5372,-10.73
5373,-10.75
5374,-10.72
5375,-10.63
5376,-10.54
5377,-10.50
5378,-10.54
5379,-10.64
5380,-10.75
5381,-10.83
5382,-10.84
5383,-10.81
5384,-10.78
5385,-10.79
5386,-10.86
5387,-10.98
5388,-11.10
5389,-11.14
5390,-11.10
5391,-11.01
5392,-10.92
5393,-10.86
5394,-10.86
5395,-10.90
5396,-10.95
5397,-11.00
5398,-11.02
5399,-11.00
5400,-10.95
5401,-10.87
5402,-10.82
5403,-10.82
5404,-10.90
5405,-11.03
5406,-11.15
5407,-11.19
5408,-11.17
5409,-11.08
5410,-10.99
5411,-10.94
5412,-10.95
5413,-11.01
5414,-11.09
5415,-11.16
5416,-11.18
5417,-11.15
5418,-11.09
5419,-11.05
5420,-11.06
5421,-11.13
5422,-11.24
5423,-11.35
5424,-11.42
5425,-11.45
5426,-11.43
5427,-11.42
5428,-11.44
5429,-11.50
5430,-11.58
5431,-11.65
5432,-11.69
5433,-11.69
5434,-11.69
5435,-11.68
5436,-11.69
5437,-11.69
5438,-11.70
5439,-11.69
5440,-11.70
5441,-11.74
5442,-11.80
5443,-11.90
5444,-11.99
5445,-12.07
5446,-12.10
5447,-12.09
5448,-12.05
5449,-12.01
5450,-11.99
5451,-11.98
5452,-11.99
5453,-12.01
5454,-12.04
5455,-12.08
5456,-12.12
5457,-12.16
5458,-12.15
5459,-12.08
5460,-11.98
5461,-11.87
5462,-11.80
5463,-11.82
5464,-11.91
5465,-12.01
5466,-12.03
5467,-11.94
5468,-11.74
5469,-11.51
5470,-11.36
5471,-11.32
5472,-11.37
5473,-11.44
5474,-11.43
5475,-11.33
5476,-11.20
5477,-11.12
5478,-11.10
5479,-11.11
5480,-11.10
5481,-11.04
5482,-10.94
5483,-10.87
5484,-10.88
5485,-10.96
5486,-11.04
5487,-11.08
5488,-11.05
5489,-10.99
5490,-10.94
5491,-10.93
5492,-10.93
5493,-10.95
5494,-10.96
5495,-10.97
5496,-10.98
5497,-11.01
5498,-11.06
5499,-11.12
5500,-11.19
5501,-11.26
5502,-11.32
5503,-11.33
5504,-11.31
5505,-11.25
5506,-11.24
5507,-11.29
5508,-11.41
5509,-11.56
5510,-11.69
5511,-11.74
5512,-11.73
5513,-11.69
5514,-11.69
5515,-11.72
5516,-11.76
5517,-11.79
5518,-11.77
5519,-11.72
5520,-11.68
5521,-11.65
5522,-11.65
5523,-11.69
5524,-11.73
5525,-11.77
5526,-11.81
5527,-11.85
5528,-11.89
5529,-11.92
5530,-11.93
5531,-11.92
5532,-11.88
5533,-11.83
5534,-11.77
5535,-11.72
5536,-11.67
5537,-11.61
5538,-11.52
5539,-11.42
5540,-11.33
5541,-11.31
5542,-11.37
5543,-11.49
5544,-11.58
5545,-11.59
5546,-11.48
5547,-11.31
5548,-11.19
5549,-11.18
5550,-11.27
5551,-11.40
5552,-11.48
5553,-11.48
5554,-11.38
5555,-11.23
5556,-11.11
5557,-11.06
5558,-11.10
5559,-11.19
5560,-11.29
5561,-11.33
5562,-11.29
5563,-11.21
5564,-11.16
5565,-11.17
5566,-11.23
5567,-11.31
5568,-11.35
5569,-11.35
5570,-11.33
5571,-11.31
5572,-11.31
5573,-11.31
5574,-11.27
5575,-11.19
5576,-11.07
5577,-10.99
5578,-10.98
5579,-11.05
5580,-11.14
5581,-11.19
5582,-11.16
5583,-11.05
5584,-10.92
5585,-10.83
5586,-10.79
5587,-10.82
5588,-10.89
5589,-10.98
5590,-11.07
5591,-11.15
5592,-11.18
5593,-11.14
5594,-11.06
5595,-10.99
5596,-10.99
5597,-11.07
5598,-11.18
5599,-11.23
5600,-11.15
5601,-10.97
5602,-10.77
5603,-10.64
5604,-10.60
5605,-10.63
5606,-10.63
5607,-10.57
5608,-10.46
5609,-10.39
5610,-10.38
5611,-10.41
5612,-10.39
5613,-10.29
5614,-10.16
5615,-10.10
5616,-10.15
5617,-10.31
5618,-10.47
5619,-10.53
5620,-10.45
5621,-10.31
5622,-10.22
5623,-10.25
5624,-10.35
5625,-10.43
5626,-10.40
5627,-10.29
5628,-10.17
5629,-10.13
5630,-10.18
5631,-10.29
5632,-10.41
5633,-10.49
5634,-10.51
5635,-10.48
5636,-10.45
5637,-10.42
5638,-10.42
5639,-10.45
5640,-10.50
5641,-10.53
5642,-10.53
5643,-10.48
5644,-10.45
5645,-10.50
5646,-10.67
5647,-10.90
5648,-11.09
5649,-11.14
5650,-11.04
5651,-10.88
5652,-10.77
5653,-10.77
5654,-10.86
5655,-10.94
5656,-10.95
5657,-10.90
5658,-10.86
5659,-10.87
5660,-10.94
5661,-11.03
5662,-11.08
5663,-11.07
5664,-10.97
5665,-10.84
5666,-10.73
5667,-10.70
5668,-10.73
5669,-10.79
5670,-10.82
5671,-10.82
5672,-10.80
5673,-10.82
5674,-10.88
5675,-10.96
5676,-11.04
5677,-11.10
5678,-11.13
5679,-11.12
5680,-11.04
5681,-10.89
5682,-10.75
5683,-10.68
5684,-10.71
5685,-10.83
5686,-10.95
5687,-10.97
5688,-10.88
5689,-10.70
5690,-10.54
5691,-10.49
5692,-10.56
5693,-10.67
5694,-10.73
5695,-10.70
5696,-10.62
5697,-10.57
5698,-10.61
5699,-10.73
5700,-10.87
5701,-10.96
5702,-10.98
5703,-10.93
5704,-10.86
5705,-10.79
5706,-10.71
5707,-10.62
5708,-10.57
5709,-10.56
5710,-10.61
5711,-10.68
5712,-10.69
5713,-10.66
5714,-10.60
5715,-10.58
5716,-10.60
5717,-10.62
5718,-10.62
5719,-10.57
5720,-10.48
5721,-10.39
5722,-10.32
5723,-10.31
5724,-10.35
5725,-10.41
5726,-10.46
5727,-10.49
5728,-10.51
5729,-10.51
5730,-10.49
5731,-10.42
5732,-10.35
5733,-10.30
5734,-10.31
5735,-10.38
5736,-10.42
5737,-10.38
5738,-10.23
5739,-10.02
5740,-9.87
5741,-9.85
5742,-9.99
5743,-10.20
5744,-10.36
5745,-10.40
5746,-10.33
5747,-10.22
5748,-10.19
5749,-10.28
5750,-10.42
5751,-10.55
5752,-10.57
5753,-10.48
5754,-10.34
5755,-10.23
5756,-10.20
5757,-10.24
5758,-10.31
5759,-10.37
5760,-10.41
5761,-10.42
5762,-10.41
5763,-10.38
5764,-10.35
5765,-10.33
5766,-10.32
5767,-10.33
5768,-10.35
5769,-10.39
5770,-10.43
5771,-10.47
5772,-10.51
5773,-10.54
5774,-10.56
5775,-10.58
5776,-10.64
5777,-10.74
5778,-10.85
5779,-10.91
5780,-10.88
5781,-10.75
5782,-10.60
5783,-10.52
5784,-10.55
5785,-10.66
5786,-10.80
5787,-10.88
5788,-10.87
5789,-10.80
5790,-10.74
5791,-10.71
5792,-10.71
5793,-10.71
5794,-10.70
5795,-10.69
5796,-10.71
5797,-10.76
5798,-10.84
5799,-10.89
5800,-10.91
5801,-10.89
5802,-10.85
5803,-10.85
5804,-10.91
5805,-11.00
5806,-11.04
5807,-11.02
5808,-10.95
5809,-10.88
5810,-10.88
5811,-10.96
5812,-11.09
5813,-11.20
5814,-11.22
5815,-11.16
5816,-11.08
5817,-11.04
5818,-11.06
5819,-11.12
5820,-11.16
5821,-11.16
5822,-11.11
5823,-11.05
5824,-11.04
5825,-11.07
5826,-11.11
5827,-11.16
5828,-11.20
5829,-11.22
5830,-11.24
5831,-11.26
5832,-11.27
5833,-11.26
5834,-11.24
5835,-11.22
5836,-11.21
5837,-11.24
5838,-11.29
5839,-11.35
5840,-11.40
5841,-11.43
5842,-11.46
5843,-11.48
5844,-11.51
5845,-11.54
5846,-11.53
5847,-11.48
5848,-11.40
5849,-11.32
5850,-11.26
5851,-11.25
5852,-11.29
5853,-11.34
5854,-11.35
5855,-11.31
5856,-11.24
5857,-11.23
5858,-11.30
5859,-11.43
5860,-11.57
5861,-11.64
5862,-11.65
5863,-11.62
5864,-11.61
5865,-11.62
5866,-11.65
5867,-11.65
5868,-11.58
5869,-11.47
5870,-11.36
5871,-11.30
5872,-11.27
5873,-11.24
5874,-11.18
5875,-11.11
5876,-11.11
5877,-11.22
5878,-11.40
5879,-11.59
5880,-11.69
5881,-11.70
5882,-11.69
5883,-11.73
5884,-11.85
5885,-12.00
5886,-12.10
5887,-12.09
5888,-11.99
5889,-11.88
5890,-11.83
5891,-11.86
5892,-11.94
5893,-12.02
5894,-12.08
5895,-12.11
5896,-12.15
5897,-12.22
5898,-12.29
5899,-12.34
5900,-12.34
5901,-12.30
5902,-12.25
5903,-12.21
5904,-12.19
5905,-12.16
5906,-12.07
5907,-11.94
5908,-11.83
5909,-11.80
5910,-11.92
5911,-12.14
5912,-12.36
5913,-12.45
5914,-12.31
5915,-12.04
5916,-11.76
5917,-11.65
5918,-11.74
5919,-11.93
5920,-12.08
5921,-12.08
5922,-11.92
5923,-11.72
5924,-11.60
5925,-11.60
5926,-11.69
5927,-11.81
5928,-11.90
5929,-11.92
5930,-11.89
5931,-11.83
5932,-11.77
5933,-11.73
5934,-11.71
5935,-11.74
5936,-11.82
5937,-11.92
5938,-11.99
5939,-11.99
5940,-11.92
5941,-11.84
5942,-11.80
5943,-11.82
5944,-11.86
5945,-11.87
5946,-11.83
5947,-11.76
5948,-11.71
5949,-11.68
5950,-11.66
5951,-11.65
5952,-11.63
5953,-11.63
5954,-11.65
5955,-11.70
5956,-11.74
5957,-11.73
5958,-11.64
5959,-11.51
5960,-11.37
5961,-11.30
5962,-11.31
5963,-11.39
5964,-11.52
5965,-11.66
5966,-11.79
5967,-11.89
5968,-11.96
5969,-12.02
5970,-12.05
5971,-12.05
5972,-12.00
5973,-11.91
5974,-11.81
5975,-11.73
5976,-11.69
5977,-11.67
5978,-11.66
5979,-11.62
5980,-11.58
5981,-11.56
5982,-11.59
5983,-11.67
5984,-11.76
5985,-11.82
5986,-11.82
5987,-11.79
5988,-11.74
5989,-11.69
5990,-11.67
5991,-11.67
5992,-11.69
5993,-11.73
5994,-11.77
5995,-11.83
5996,-11.90
5997,-11.98
5998,-12.03
5999,-12.06
6000,-12.06
6001,-12.04
6002,-12.00
6003,-11.98
6004,-11.98
6005,-12.00
6006,-12.00
6007,-11.97
6008,-11.91
6009,-11.85
6010,-11.79
6011,-11.77
6012,-11.81
6013,-11.88
6014,-11.95
6015,-11.97
6016,-11.92
6017,-11.84
6018,-11.75
6019,-11.69
6020,-11.68
6021,-11.69
6022,-11.70
6023,-11.71
6024,-11.72
6025,-11.75
6026,-11.76
6027,-11.73
6028,-11.64
6029,-11.52
6030,-11.41
6031,-11.37
6032,-11.37
6033,-11.39
6034,-11.38
6035,-11.35
6036,-11.32
6037,-11.33
6038,-11.40
6039,-11.48
6040,-11.53
6041,-11.49
6042,-11.38
6043,-11.23
6044,-11.11
6045,-11.06
6046,-11.08
6047,-11.15
6048,-11.26
6049,-11.38
6050,-11.48
6051,-11.54
6052,-11.52
6053,-11.44
6054,-11.33
6055,-11.21
6056,-11.11
6057,-11.04
6058,-11.00
6059,-10.96
6060,-10.91
6061,-10.86
6062,-10.85
6063,-10.90
6064,-10.99
6065,-11.08
6066,-11.15
6067,-11.17
6068,-11.19
6069,-11.23
6070,-11.30
6071,-11.39
6072,-11.45
6073,-11.45
6074,-11.39
6075,-11.31
6076,-11.30
6077,-11.39
6078,-11.57
6079,-11.74
6080,-11.81
6081,-11.72
6082,-11.53
6083,-11.39
6084,-11.40
6085,-11.59
6086,-11.86
6087,-12.05
6088,-12.10
6089,-12.03
6090,-11.96
6091,-11.97
6092,-12.07
6093,-12.18
6094,-12.21
6095,-12.14
6096,-12.05
6097,-12.03
6098,-12.08
6099,-12.16
6100,-12.16
6101,-12.07
6102,-11.97
6103,-11.93
6104,-11.98
6105,-12.04
6106,-12.01
6107,-11.82
6108,-11.53
6109,-11.24
6110,-11.07
6111,-11.06
6112,-11.16
6113,-11.29
6114,-11.38
6115,-11.38
6116,-11.30
6117,-11.19
6118,-11.12
6119,-11.14
6120,-11.23
6121,-11.34
6122,-11.38
6123,-11.30
6124,-11.15
6125,-11.01
6126,-10.96
6127,-10.99
6128,-11.06
6129,-11.09
6130,-11.03
6131,-10.92
6132,-10.80
6133,-10.77
6134,-10.85
6135,-11.00
6136,-11.12
6137,-11.15
6138,-11.06
6139,-10.91
6140,-10.78
6141,-10.74
6142,-10.79
6143,-10.90
6144,-11.00
6145,-11.01
6146,-10.94
6147,-10.82
6148,-10.75
6149,-10.75
6150,-10.81
6151,-10.89
6152,-10.93
6153,-10.92
6154,-10.88
6155,-10.85
6156,-10.85
6157,-10.88
6158,-10.91
6159,-10.93
6160,-10.93
6161,-10.90
6162,-10.87
6163,-10.87
6164,-10.89
6165,-10.91
6166,-10.92
6167,-10.88
6168,-10.81
6169,-10.73
6170,-10.71
6171,-10.74
6172,-10.80
6173,-10.83
6174,-10.79
6175,-10.71
6176,-10.64
6177,-10.66
6178,-10.76
6179,-10.91
6180,-11.01
6181,-11.03
6182,-11.00
6183,-10.97
6184,-11.01
6185,-11.10
6186,-11.20
6187,-11.24
6188,-11.21
6189,-11.15
6190,-11.10
6191,-11.11
6192,-11.18
6193,-11.29
6194,-11.40
6195,-11.51
6196,-11.58
6197,-11.60
6198,-11.56
6199,-11.51
6200,-11.51
6201,-11.61
6202,-11.75
6203,-11.87
6204,-11.92
6205,-11.92
6206,-11.91
6207,-11.93
6208,-11.99
6209,-12.05
6210,-12.08
6211,-12.09
6212,-12.10
6213,-12.13
6214,-12.21
6215,-12.29
6216,-12.33
6217,-12.31
6218,-12.23
6219,-12.15
6220,-12.07
6221,-11.99
6222,-11.91
6223,-11.85
6224,-11.83
6225,-11.84
6226,-11.88
6227,-11.90
6228,-11.89
6229,-11.83
6230,-11.74
6231,-11.66
6232,-11.61
6233,-11.59
6234,-11.62
6235,-11.69
6236,-11.78
6237,-11.87
6238,-11.90
6239,-11.85
6240,-11.75
6241,-11.63
6242,-11.57
6243,-11.58
6244,-11.65
6245,-11.73
6246,-11.78
6247,-11.80
6248,-11.81
6249,-11.83
6250,-11.83
6251,-11.79
6252,-11.71
6253,-11.61
6254,-11.54
6255,-11.54
6256,-11.59
6257,-11.66
6258,-11.72
6259,-11.73
6260,-11.72
6261,-11.72
6262,-11.72
6263,-11.73
6264,-11.75
6265,-11.75
6266,-11.77
6267,-11.82
6268,-11.90
6269,-12.00
6270,-12.12
6271,-12.24
6272,-12.37
6273,-12.48
6274,-12.57
6275,-12.61
6276,-12.60
6277,-12.53
6278,-12.46
6279,-12.41
6280,-12.40
6281,-12.45
6282,-12.54
6283,-12.64
6284,-12.73
6285,-12.77
6286,-12.74
6287,-12.67
6288,-12.59
6289,-12.55
6290,-12.59
6291,-12.66
6292,-12.74
6293,-12.77
6294,-12.74
6295,-12.70
6296,-12.65
6297,-12.61
6298,-12.54
6299,-12.44
6300,-12.34
6301,-12.32
6302,-12.37
6303,-12.46
6304,-12.48
6305,-12.45
6306,-12.39
6307,-12.39
6308,-12.45
6309,-12.50
6310,-12.45
6311,-12.32
6312,-12.18
6313,-12.13
6314,-12.21
6315,-12.36
6316,-12.50
6317,-12.56
6318,-12.55
6319,-12.53
6320,-12.53
6321,-12.54
6322,-12.55
6323,-12.51
6324,-12.45
6325,-12.41
6326,-12.37
6327,-12.32
6328,-12.22
6329,-12.08
6330,-11.94
6331,-11.89
6332,-11.99
6333,-12.20
6334,-12.43
6335,-12.55
6336,-12.50
6337,-12.34
6338,-12.19
6339,-12.14
6340,-12.23
6341,-12.39
6342,-12.51
6343,-12.50
6344,-12.38
6345,-12.23
6346,-12.14
6347,-12.15
6348,-12.23
6349,-12.34
6350,-12.42
6351,-12.45
6352,-12.46
6353,-12.45
6354,-12.42
6355,-12.39
6356,-12.38
6357,-12.44
6358,-12.58
6359,-12.74
6360,-12.85
6361,-12.84
6362,-12.72
6363,-12.59
6364,-12.55
6365,-12.64
6366,-12.80
6367,-12.92
6368,-12.96
6369,-12.91
6370,-12.82
6371,-12.75
6372,-12.71
6373,-12.69
6374,-12.64
6375,-12.57
6376,-12.51
6377,-12.50
6378,-12.54
6379,-12.60
6380,-12.64
6381,-12.63
6382,-12.59
6383,-12.57
6384,-12.57
6385,-12.59
6386,-12.61
6387,-12.61
6388,-12.61
6389,-12.62
6390,-12.66
6391,-12.71
6392,-12.75
6393,-12.74
6394,-12.70
6395,-12.63
6396,-12.61
6397,-12.66
6398,-12.76
6399,-12.85
6400,-12.88
6401,-12.83
6402,-12.75
6403,-12.70
6404,-12.74
6405,-12.83
6406,-12.92
6407,-12.99
6408,-13.01
6409,-13.04
6410,-13.10
6411,-13.17
6412,-13.24
6413,-13.26
6414,-13.26
6415,-13.26
6416,-13.31
6417,-13.42
6418,-13.52
6419,-13.58
6420,-13.57
6421,-13.53
6422,-13.51
6423,-13.53
6424,-13.57
6425,-13.58
6426,-13.55
6427,-13.48
6428,-13.42
6429,-13.38
6430,-13.37
6431,-13.37
6432,-13.35
6433,-13.31
6434,-13.24
6435,-13.18
6436,-13.13
6437,-13.12
6438,-13.12
6439,-13.11
6440,-13.07
6441,-12.99
6442,-12.88
6443,-12.76
6444,-12.67
6445,-12.63
6446,-12.65
6447,-12.71
6448,-12.75
6449,-12.71
6450,-12.58
6451,-12.38
6452,-12.17
6453,-12.03
6454,-12.02
6455,-12.10
6456,-12.21
6457,-12.26
6458,-12.23
6459,-12.15
6460,-12.06
6461,-12.00
6462,-11.96
6463,-11.93
6464,-11.90
6465,-11.88
6466,-11.90
6467,-11.96
6468,-12.05
6469,-12.12
6470,-12.19
6471,-12.23
6472,-12.27
6473,-12.33
6474,-12.41
6475,-12.50
6476,-12.59
6477,-12.67
6478,-12.75
6479,-12.82
6480,-12.87
6481,-12.88
6482,-12.87
6483,-12.86
6484,-12.90
6485,-12.99
6486,-13.12
6487,-13.25
6488,-13.31
6489,-13.25
6490,-13.12
6491,-12.96
6492,-12.85
6493,-12.81
6494,-12.81
6495,-12.82
6496,-12.80
6497,-12.77
6498,-12.74
6499,-12.71
6500,-12.69
6501,-12.67
6502,-12.66
6503,-12.67
6504,-12.69
6505,-12.74
6506,-12.82
6507,-12.89
6508,-12.92
6509,-12.89
6510,-12.77
6511,-12.62
6512,-12.47
6513,-12.40
6514,-12.43
6515,-12.52
6516,-12.59
6517,-12.60
6518,-12.56
6519,-12.55
6520,-12.63
6521,-12.81
6522,-12.98
6523,-13.03
6524,-12.90
6525,-12.65
6526,-12.42
6527,-12.33
6528,-12.40
6529,-12.56
6530,-12.70
6531,-12.72
6532,-12.63
6533,-12.49
6534,-12.41
6535,-12.43
6536,-12.51
6537,-12.58
6538,-12.59
6539,-12.52
6540,-12.41
6541,-12.30
6542,-12.25
6543,-12.27
6544,-12.33
6545,-12.39
6546,-12.42
6547,-12.38
6548,-12.28
6549,-12.16
6550,-12.04
6551,-11.97
6552,-11.95
6553,-11.97
6554,-12.00
6555,-12.03
6556,-12.04
6557,-12.03
6558,-12.00
6559,-11.95
6560,-11.89
6561,-11.85
6562,-11.85
6563,-11.90
6564,-11.98
6565,-12.05
6566,-12.09
6567,-12.13
6568,-12.19
6569,-12.26
6570,-12.30
6571,-12.26
6572,-12.13
6573,-11.96
6574,-11.84
6575,-11.83
6576,-11.94
6577,-12.10
6578,-12.23
6579,-12.26
6580,-12.17
6581,-11.99
6582,-11.78
6583,-11.60
6584,-11.51
6585,-11.51
6586,-11.58
6587,-11.66
6588,-11.72
6589,-11.75
6590,-11.75
6591,-11.75
6592,-11.75
6593,-11.75
6594,-11.75
6595,-11.77
6596,-11.80
6597,-11.85
6598,-11.90
6599,-11.92
6600,-11.90
6601,-11.84
6602,-11.77
6603,-11.72
6604,-11.70
6605,-11.74
6606,-11.84
6607,-11.97
6608,-12.10
6609,-12.16
6610,-12.15
6611,-12.07
6612,-11.98
6613,-11.96
6614,-12.01
6615,-12.09
6616,-12.12
6617,-12.04
6618,-11.87
6619,-11.71
6620,-11.65
6621,-11.72
6622,-11.87
6623,-12.02
6624,-12.09
6625,-12.04
6626,-11.89
6627,-11.71
6628,-11.57
6629,-11.50
6630,-11.48
6631,-11.49
6632,-11.48
6633,-11.43
6634,-11.39
6635,-11.40
6636,-11.50
6637,-11.66
6638,-11.80
6639,-11.83
6640,-11.74
6641,-11.56
6642,-11.40
6643,-11.33
6644,-11.36
6645,-11.45
6646,-11.55
6647,-11.63
6648,-11.64
6649,-11.58
6650,-11.49
6651,-11.40
6652,-11.36
6653,-11.34
6654,-11.32
6655,-11.26
6656,-11.16
6657,-11.07
6658,-11.04
6659,-11.11
6660,-11.26
6661,-11.43
6662,-11.51
6663,-11.49
6664,-11.41
6665,-11.40
6666,-11.50
6667,-11.68
6668,-11.84
6669,-11.89
6670,-11.83
6671,-11.74
6672,-11.73
6673,-11.83
6674,-11.96
6675,-12.08
6676,-12.16
6677,-12.16
6678,-12.08
6679,-11.98
6680,-11.95
6681,-12.02
6682,-12.15
6683,-12.24
6684,-12.27
6685,-12.24
6686,-12.18
6687,-12.12
6688,-12.10
6689,-12.12
6690,-12.19
6691,-12.30
6692,-12.40
6693,-12.45
6694,-12.45
6695,-12.40
6696,-12.35
6697,-12.34
6698,-12.36
6699,-12.39
6700,-12.44
6701,-12.49
6702,-12.55
6703,-12.59
6704,-12.59
6705,-12.57
6706,-12.52
6707,-12.48
6708,-12.47
6709,-12.52
6710,-12.59
6711,-12.64
6712,-12.63
6713,-12.58
6714,-12.49
6715,-12.40
6716,-12.33
6717,-12.27
6718,-12.21
6719,-12.15
6720,-12.12
6721,-12.14
6722,-12.20
6723,-12.29
6724,-12.35
6725,-12.36
6726,-12.32
6727,-12.24
6728,-12.18
6729,-12.15
6730,-12.16
6731,-12.21
6732,-12.24
6733,-12.24
6734,-12.20
6735,-12.15
6736,-12.12
6737,-12.09
6738,-12.08
6739,-12.06
6740,-12.05
6741,-12.06
6742,-12.07
6743,-12.11
6744,-12.20
6745,-12.31
6746,-12.41
6747,-12.43
6748,-12.38
6749,-12.33
6750,-12.31
6751,-12.35
6752,-12.41
6753,-12.44
6754,-12.42
6755,-12.39
6756,-12.39
6757,-12.45
6758,-12.54
6759,-12.60
6760,-12.59
6761,-12.52
6762,-12.47
6763,-12.47
6764,-12.53
6765,-12.59
6766,-12.60
6767,-12.57
6768,-12.53
6769,-12.51
6770,-12.52
6771,-12.54
6772,-12.56
6773,-12.59
6774,-12.63
6775,-12.69
6776,-12.74
6777,-12.74
6778,-12.70
6779,-12.61
6780,-12.54
6781,-12.50
6782,-12.52
6783,-12.59
6784,-12.66
6785,-12.73
6786,-12.78
6787,-12.81
6788,-12.83
6789,-12.85
6790,-12.90
6791,-12.99
6792,-13.10
6793,-13.20
6794,-13.28
6795,-13.29
6796,-13.26
6797,-13.23
6798,-13.23
6799,-13.29
6800,-13.38
6801,-13.44
6802,-13.46
6803,-13.42
6804,-13.38
6805,-13.33
6806,-13.29
6807,-13.24
6808,-13.19
6809,-13.17
6810,-13.19
6811,-13.22
6812,-13.27
6813,-13.29
6814,-13.29
6815,-13.28
6816,-13.30
6817,-13.32
6818,-13.33
6819,-13.27
6820,-13.17
6821,-13.07
6822,-13.07
6823,-13.18
6824,-13.35
6825,-13.49
6826,-13.53
6827,-13.48
6828,-13.37
6829,-13.25
6830,-13.17
6831,-13.13
6832,-13.10
6833,-13.07
6834,-13.04
6835,-13.01
6836,-12.97
6837,-12.92
6838,-12.86
6839,-12.80
6840,-12.78
6841,-12.83
6842,-12.96
6843,-13.11
6844,-13.24
6845,-13.31
6846,-13.32
6847,-13.31
6848,-13.30
6849,-13.32
6850,-13.37
6851,-13.44
6852,-13.53
6853,-13.63
6854,-13.72
6855,-13.75
6856,-13.70
6857,-13.55
6858,-13.38
6859,-13.27
6860,-13.29
6861,-13.46
6862,-13.72
6863,-13.95
6864,-14.08
6865,-14.07
6866,-13.98
6867,-13.89
6868,-13.87
6869,-13.92
6870,-14.02
6871,-14.09
6872,-14.13
6873,-14.12
6874,-14.11
6875,-14.10
6876,-14.10
6877,-14.07
6878,-14.00
6879,-13.87
6880,-13.71
6881,-13.54
6882,-13.41
6883,-13.35
6884,-13.35
6885,-13.40
6886,-13.47
6887,-13.53
6888,-13.57
6889,-13.61
6890,-13.66
6891,-13.71
6892,-13.75
6893,-13.76
6894,-13.74
6895,-13.70
6896,-13.69
6897,-13.71
6898,-13.75
6899,-13.74
6900,-13.67
6901,-13.55
6902,-13.45
6903,-13.43
6904,-13.50
6905,-13.58
6906,-13.60
6907,-13.53
6908,-13.42
6909,-13.33
6910,-13.30
6911,-13.32
6912,-13.31
6913,-13.25
6914,-13.15
6915,-13.06
6916,-13.03
6917,-13.08
6918,-13.17
6919,-13.22
6920,-13.23
6921,-13.21
6922,-13.22
6923,-13.26
6924,-13.32
6925,-13.38
6926,-13.42
6927,-13.44
6928,-13.45
6929,-13.45
6930,-13.44
6931,-13.43
6932,-13.42
6933,-13.39
6934,-13.32
6935,-13.22
6936,-13.11
6937,-13.06
6938,-13.12
6939,-13.27
6940,-13.43
6941,-13.52
6942,-13.48
6943,-13.35
6944,-13.25
6945,-13.23
6946,-13.27
6947,-13.31
6948,-13.26
6949,-13.14
6950,-13.04
6951,-13.05
6952,-13.20
6953,-13.40
6954,-13.58
6955,-13.66
6956,-13.65
6957,-13.58
6958,-13.49
6959,-13.42
6960,-13.38
6961,-13.36
6962,-13.39
6963,-13.46
6964,-13.54
6965,-13.61
6966,-13.62
6967,-13.55
6968,-13.44
6969,-13.34
6970,-13.29
6971,-13.32
6972,-13.38
6973,-13.44
6974,-13.47
6975,-13.47
6976,-13.46
6977,-13.46
6978,-13.49
6979,-13.53
6980,-13.56
6981,-13.52
6982,-13.43
6983,-13.34
6984,-13.32
6985,-13.38
6986,-13.51
6987,-13.63
6988,-13.68
6989,-13.65
6990,-13.58
6991,-13.52
6992,-13.49
6993,-13.47
6994,-13.44
6995,-13.39
6996,-13.37
6997,-13.43
6998,-13.55
6999,-13.68
7000,-13.77
7001,-13.78
7002,-13.74
7003,-13.67
7004,-13.62
7005,-13.57
7006,-13.49
7007,-13.39
7008,-13.30
7009,-13.25
7010,-13.25
7011,-13.30
7012,-13.34
7013,-13.34
7014,-13.31
7015,-13.29
7016,-13.30
7017,-13.35
7018,-13.41
7019,-13.44
7020,-13.38
7021,-13.25
7022,-13.11
7023,-13.03
7024,-13.06
7025,-13.15
7026,-13.22
7027,-13.21
7028,-13.11
7029,-12.95
7030,-12.81
7031,-12.74
7032,-12.76
7033,-12.82
7034,-12.86
7035,-12.85
7036,-12.81
7037,-12.76
7038,-12.73
7039,-12.70
7040,-12.66
7041,-12.62
7042,-12.59
7043,-12.59
7044,-12.60
7045,-12.62
7046,-12.63
7047,-12.65
7048,-12.65
7049,-12.64
7050,-12.64
7051,-12.62
7052,-12.57
7053,-12.51
7054,-12.46
7055,-12.46
7056,-12.52
7057,-12.61
7058,-12.68
7059,-12.70
7060,-12.68
7061,-12.65
7062,-12.67
7063,-12.74
7064,-12.84
7065,-12.91
7066,-12.90
7067,-12.82
7068,-12.70
7069,-12.60
7070,-12.56
7071,-12.57
7072,-12.59
7073,-12.58
7074,-12.54
7075,-12.49
7076,-12.47
7077,-12.51
7078,-12.61
7079,-12.76
7080,-12.91
7081,-13.00
7082,-13.01
7083,-12.93
7084,-12.83
7085,-12.77
7086,-12.77
7087,-12.81
7088,-12.84
7089,-12.83
7090,-12.77
7091,-12.74
7092,-12.77
7093,-12.89
7094,-13.03
7095,-13.13
7096,-13.15
7097,-13.10
7098,-13.02
7099,-12.97
7100,-12.97
7101,-13.00
7102,-13.00
7103,-12.95
7104,-12.84
7105,-12.75
7106,-12.71
7107,-12.73
7108,-12.81
7109,-12.93
7110,-13.05
7111,-13.16
7112,-13.23
7113,-13.24
7114,-13.17
7115,-13.06
7116,-12.95
7117,-12.88
7118,-12.84
7119,-12.82
7120,-12.82
7121,-12.85
7122,-12.94
7123,-13.07
7124,-13.19
7125,-13.25
7126,-13.19
7127,-13.03
7128,-12.84
7129,-12.72
7130,-12.73
7131,-12.84
7132,-12.94
7133,-12.95
7134,-12.86
7135,-12.69
7136,-12.53
7137,-12.42
7138,-12.39
7139,-12.44
7140,-12.52
7141,-12.57
7142,-12.54
7143,-12.43
7144,-12.30
7145,-12.22
7146,-12.23
7147,-12.30
7148,-12.37
7149,-12.38
7150,-12.32
7151,-12.23
7152,-12.18
7153,-12.20
7154,-12.26
7155,-12.30
7156,-12.29
7157,-12.24
7158,-12.22
7159,-12.24
7160,-12.30
7161,-12.35
7162,-12.37
7163,-12.37
7164,-12.38
7165,-12.42
7166,-12.50
7167,-12.61
7168,-12.75
7169,-12.89
7170,-12.99
7171,-13.02
7172,-12.96
7173,-12.85
7174,-12.75
7175,-12.73
7176,-12.80
7177,-12.92
7178,-12.99
7179,-12.94
7180,-12.79
7181,-12.63
7182,-12.55
7183,-12.59
7184,-12.74
7185,-12.90
7186,-12.99
7187,-12.96
7188,-12.87
7189,-12.82
7190,-12.75
7191,-12.71
7192,-12.73
7193,-13.42
7194,-13.59
7195,-12.61
7196,-11.50
7197,-13.40
7198,-16.44
7199,-13.46
7200,-4.50
