AYGX_min,AZ_mean,AYGX_mean,AYGX_std,AZ_mean,GX_std,Gnorm_max,Gnorm_median,timestamp
1.4946,-9.7875,1.6082,0.078,-9.7875,0.0505,2.6887,2.6208,0
1.5542,-9.7871,1.6245,0.043,-9.7871,0.0284,2.6762,2.6332,1
1.5392,-9.7872,1.6113,0.0409,-9.7872,0.0268,2.6529,2.6296,2
1.5127,-9.7866,1.6363,0.063,-9.7866,0.0392,2.6803,2.6286,3
1.4807,-9.787,1.6538,0.0903,-9.787,0.0616,2.7178,2.6365,4
1.4612,-9.7887,1.6203,0.1094,-9.7887,0.0705,2.6798,2.6272,5
1.366,-9.7868,1.6292,0.1864,-9.7868,0.1245,2.7283,2.6252,6
1.2604,-9.7883,1.5292,0.2209,-9.7883,0.1465,2.7014,2.5992,7
1.2771,-9.7887,1.5917,0.2408,-9.7887,0.1613,2.7187,2.6078,8
1.1453,-9.7884,1.6907,0.4394,-9.7884,0.2934,2.8676,2.6276,9
1.1898,-9.7876,1.6757,0.3554,-9.7876,0.2342,2.7958,2.6579,10
1.3919,-9.7878,1.6247,0.1005,-9.7878,0.0664,2.6945,2.6346,11
1.5045,-9.7873,1.6059,0.0511,-9.7873,0.0333,2.6453,2.6246,12
1.5513,-9.7872,1.6439,0.0656,-9.7872,0.0432,2.6736,2.6333,13
1.4969,-9.7877,1.6259,0.0743,-9.7877,0.0481,2.6849,2.6227,14
1.5032,-9.7875,1.6136,0.071,-9.7875,0.0465,2.6665,2.6309,15
1.5676,-9.7869,1.6328,0.0451,-9.7869,0.0305,2.6465,2.6217,16
1.5823,-9.7887,1.645,0.0487,-9.7887,0.0344,2.6644,2.6338,17
1.6163,-9.7877,1.6489,0.0247,-9.7877,0.0164,2.6521,2.6384,18
1.5966,-9.7887,1.6179,0.0178,-9.7887,0.0119,2.6415,2.6169,19
1.5865,-9.7896,1.6277,0.0247,-9.7896,0.0153,2.64,2.6294,20
1.5894,-9.7884,1.6406,0.0221,-9.7884,0.0135,2.6558,2.6392,21
1.5972,-9.7881,1.6259,0.0248,-9.7881,0.0148,2.6622,2.6251,22
1.5579,-9.7886,1.6194,0.0287,-9.7886,0.0173,2.6416,2.6232,23
1.5642,-9.7889,1.6139,0.0338,-9.7889,0.023,2.642,2.6131,24
1.5333,-9.7892,1.6268,0.0529,-9.7892,0.0347,2.6567,2.6266,25
1.5804,-9.7886,1.622,0.0227,-9.7886,0.0147,2.6526,2.6216,26
1.5673,-9.7901,1.6142,0.0279,-9.7901,0.0163,2.6685,2.6407,27
1.5691,-9.7906,1.6227,0.0304,-9.7906,0.0206,2.655,2.6257,28
1.467,-9.7888,1.6306,0.124,-9.7888,0.0831,2.7099,2.6457,29
1.5251,-9.7904,1.6212,0.0607,-9.7904,0.0401,2.6621,2.6197,30
1.5644,-9.788,7.166,9.2233,-9.788,4.3666,16.9188,2.6451,31
-7.8874,-9.8082,6.9749,10.7016,-9.8082,2.0879,20.6418,18.0531,32
-8.3908,-9.8935,-3.3634,2.4915,-9.8935,2.2317,13.4494,8.1511,33
-40.264,-9.5618,-16.3502,15.3644,-9.5618,4.2378,12.1905,4.5723,34
-0.9311,-9.8069,14.6272,9.4288,-9.8069,7.8336,39.8079,19.5069,35
-16.0784,-9.9374,4.3498,10.224,-9.9374,4.3047,41.4331,32.8982,36
-3.0703,-9.8806,-0.816,0.9921,-9.8806,1.0191,39.5893,36.8095,37
-1.9093,-9.8995,4.325,3.8106,-9.8995,2.2078,33.1277,22.9871,38
0.0048,-10.116,0.934,0.9601,-10.116,5.8464,28.5059,23.0828,39
-2.3062,-9.7893,0.4641,2.1007,-9.7893,2.4413,17.5301,14.2885,40
-2.2094,-9.9357,-0.008,0.769,-9.9357,1.8169,11.5529,7.2076,41
-1.2855,-10.0725,-0.0129,0.5955,-10.0725,1.6756,11.4492,8.5625,43
-3.8682,-9.9905,0.4112,2.0311,-9.9905,1.8609,35.3747,27.0002,44
-1.9894,-10.138,0.1484,1.9901,-10.138,2.6731,43.3747,38.3901,45
-1.7796,-10.1356,0.5795,1.4682,-10.1356,5.5036,28.9929,25.7645,46
-6.1549,-8.124,-1.7477,2.3219,-8.124,2.121,23.0287,9.3382,47
-3.9125,-9.9579,-0.751,1.7432,-9.9579,4.0549,9.305,7.7143,48
-5.2218,-9.9612,-0.292,2.2159,-9.9612,5.6642,17.4508,11.1793,49
-8.5343,-9.912,-0.543,2.818,-9.912,5.2808,12.8897,7.2742,50
-16.5115,-9.6142,-0.8236,5.4937,-9.6142,3.6086,16.5543,7.9436,51
-0.5649,-9.9685,-0.149,0.215,-9.9685,1.0206,4.5602,2.5411,52
-3.5296,-9.4745,0.5385,2.0038,-9.4745,3.5315,39.2096,7.687,53
-0.4156,-10.0387,0.2043,0.3936,-10.0387,1.7784,8.1987,6.4163,54
-4.6406,-9.382,-0.3317,1.7531,-9.382,2.4068,10.9724,7.5258,55
-2.4105,-9.9104,0.8965,2.3854,-9.9104,3.14,10.7366,7.4513,56
-0.9,-9.945,-0.1106,0.3697,-9.945,1.7213,8.4003,6.6141,57
-2.7589,-9.6824,0.1021,1.8184,-9.6824,0.8652,7.1533,6.8971,58
-2.4494,-9.9003,-0.2002,1.4847,-9.9003,3.0426,16.9089,14.9945,59
-0.9952,-9.1371,-0.0306,0.7005,-9.1371,1.3078,12.6786,5.6106,60
-0.9173,-10.0016,0.2341,0.946,-10.0016,1.9309,17.4309,6.6944,61
-1.6619,-9.9891,-0.0601,0.6263,-9.9891,1.6486,14.8642,9.785,62
-2.6064,-9.9589,0.2993,1.5325,-9.9589,2.6132,15.9,12.8052,63
-25.0705,-9.8698,-1.864,9.1385,-9.8698,4.6595,16.606,11.8636,64
-3.409,-10.2376,3.7041,4.2079,-10.2376,2.8346,53.7985,50.9116,65
-4.546,-10.2142,1.5929,3.873,-10.2142,2.0923,45.9116,43.1553,66
-10.2388,-10.197,-0.7673,3.6132,-10.197,5.0758,36.2887,19.6585,67
-12.429,-9.888,-0.1045,4.3003,-9.888,7.9737,27.8444,12.8982,68
-4.0302,-9.9203,1.7693,3.8187,-9.9203,6.4951,12.1659,9.6407,69
-6.0976,-9.8058,-0.091,3.5724,-9.8058,6.7114,12.035,9.2725,70
-5.4448,-9.8535,-0.2894,2.1562,-9.8535,6.6121,14.3738,9.087,71
-6.474,-9.9409,-0.3504,2.9304,-9.9409,6.5141,15.2764,9.9066,72
-5.045,-10.0543,-1.0241,3.2366,-10.0543,3.8549,14.8429,12.84,73
-4.1148,-10.0044,-1.0456,1.6507,-10.0044,5.5683,15.0824,10.4921,74
-5.2514,-9.994,-0.631,2.9453,-9.994,5.0699,18.7466,9.5583,75
-8.0311,-9.9306,-2.4124,2.6779,-9.9306,4.8434,10.7816,8.282,76
-5.6241,-10.2835,-1.8924,1.9262,-10.2835,4.9877,13.227,7.5819,77
-6.0054,-9.823,0.5181,3.3335,-9.823,5.5913,12.1089,9.3506,78
-5.1059,-9.7565,-2.4449,2.0065,-9.7565,5.9499,11.783,9.2063,79
-3.4319,-10.2572,-0.9451,1.6451,-10.2572,5.5065,15.0984,9.3503,80
-5.8136,-9.9308,-0.0845,1.9885,-9.9308,7.2392,15.5241,9.2744,81
-5.5638,-9.9526,-0.761,2.1251,-9.9526,4.5652,9.5437,7.499,82
-4.3659,-9.9938,-1.1574,1.7548,-9.9938,5.4448,10.3881,6.5056,83
-3.2729,-9.9004,-0.4288,1.5216,-9.9004,4.7614,11.721,8.2883,84
-7.1214,-10.1038,-1.6455,2.5608,-10.1038,3.8955,10.5031,6.5252,85
-6.4788,-9.9349,-1.3257,2.8353,-9.9349,1.7688,9.507,7.07,86
-5.2135,-9.7366,-0.9876,2.439,-9.7366,5.4685,12.942,7.6773,87
-4.8059,-10.0191,-0.9623,2.466,-10.0191,3.8504,10.0805,5.6585,88
-6.9588,-10.0885,-1.3096,2.3661,-10.0885,3.2559,11.9943,9.2836,89
-2.7535,-9.7977,0.7878,2.0055,-9.7977,7.3305,17.8328,12.5273,90
-8.1688,-10.0042,-0.014,4.0213,-10.0042,7.6034,25.9582,14.1597,91
-3.4192,-9.8588,-0.2045,2.7018,-9.8588,4.3556,14.7209,10.9986,92
-8.1,-9.6641,-0.151,4.1274,-9.6641,4.4102,14.7215,9.9319,93
-6.5058,-10.0107,-1.018,2.1953,-10.0107,4.04,12.9967,7.5519,94
-2.165,-10.0902,0.2389,1.4511,-10.0902,3.8562,13.4679,8.1868,95
-12.6577,-10.1806,-2.1631,5.9478,-10.1806,4.9621,13.9036,10.6992,96
-5.2121,-11.015,-1.9938,2.2121,-11.015,4.1939,29.6859,14.6318,97
-4.2985,-10.1001,-1.8412,1.525,-10.1001,1.0028,9.3452,7.1724,98
-1.392,-10.0566,-0.1097,0.6331,-10.0566,1.9899,6.5677,4.5626,99
-1.3947,-9.7989,-0.1127,0.6346,-9.7989,0.489,5.5093,3.9996,100
-0.1767,-9.9274,1.2002,1.8059,-9.9274,4.2437,12.7821,10.4152,101
-0.7831,-10.1328,0.1248,0.6375,-10.1328,1.1832,13.9689,7.4978,102
-0.8182,-9.821,0.4464,0.9928,-9.821,0.5381,13.1047,9.9151,103
-1.9303,-9.9196,0.3856,1.9758,-9.9196,0.4751,13.1991,11.5718,104
-2.9219,-9.9324,-0.1924,1.2595,-9.9324,5.6301,19.4142,8.7938,105
-4.8066,-9.8988,-3.0087,1.5667,-9.8988,0.7581,8.3441,6.6643,106
0.052,-9.959,0.6889,0.978,-9.959,2.3909,8.7701,5.5832,107
-0.7762,-9.7649,0.5334,1.1924,-9.7649,2.847,8.0311,3.7359,108
-4.2943,-9.992,-0.9283,1.8103,-9.992,3.9957,9.8099,4.9689,109
-1.9558,-9.871,-0.6817,0.9528,-9.871,4.6587,9.6294,5.9733,110
-4.8864,-10.0031,-0.475,1.9036,-10.0031,4.2154,16.1392,6.5951,111
-9.8425,-10.0736,-1.801,3.6952,-10.0736,4.7779,12.2561,7.4664,112
-6.0294,-9.9821,-0.4986,2.356,-9.9821,5.2671,14.4072,5.7626,113
-2.7219,-10.0035,1.5234,3.1728,-10.0035,8.2539,14.7723,9.9013,114
-2.6877,-9.8077,-0.1166,1.9159,-9.8077,5.5218,23.8466,11.5063,115
-5.8886,-9.427,-0.897,3.0064,-9.427,3.1828,16.3796,12.8228,116
-2.6137,-10.0373,-0.7146,1.5318,-10.0373,6.7058,14.6219,9.3574,117
-1.127,-9.8164,1.0942,3.1882,-9.8164,5.349,12.9513,6.7629,118
-3.9102,-9.8402,0.1764,2.4458,-9.8402,6.7388,16.3214,9.6837,119
-4.8543,-9.9919,-0.2082,2.8709,-9.9919,5.1954,14.35,8.3576,120
-10.3346,-9.9328,-0.7105,3.1996,-9.9328,7.5175,18.0363,10.2076,121
-6.0229,-9.8088,0.9089,3.9075,-9.8088,7.4358,19.0525,10.6623,122
-1.826,-9.8883,0.3902,1.1448,-9.8883,4.902,14.2006,9.8804,123
-5.5392,-10.1,-0.8839,2.4468,-10.1,5.3631,17.9845,12.1349,124
-2.3725,-9.9742,-0.3644,1.0431,-9.9742,4.5768,11.0353,7.0875,125
-6.4067,-10.0316,-1.0307,3.2077,-10.0316,6.3139,17.0336,6.8976,126
-2.6545,-9.8614,-1.0611,1.0858,-9.8614,1.8829,6.4798,4.2861,127
-2.2503,-10.4335,-0.09,1.5341,-10.4335,1.6826,10.2153,8.4865,128
-4.5288,-10.2857,-1.3786,1.8632,-10.2857,3.1513,8.0294,6.0918,129
-7.7378,-9.8012,-0.5601,2.4778,-9.8012,5.704,18.1419,7.7825,130
-7.0739,-9.6668,-0.2048,2.4103,-9.6668,6.3468,23.5694,11.371,131
-7.3853,-10.0174,2.4934,6.5049,-10.0174,9.1823,26.5189,13.6982,132
-5.7995,-9.3754,0.0489,2.9757,-9.3754,4.8152,20.423,9.0939,133
-2.3774,-9.6067,-0.4279,1.8457,-9.6067,3.6778,14.1532,8.0381,134
-3.5923,-9.741,1.5151,2.8607,-9.741,2.371,17.9327,13.6162,135
-4.8239,-9.7228,-1.5514,1.6661,-9.7228,3.1577,9.8365,7.0373,136
-2.2438,-9.5863,0.1663,1.7611,-9.5863,2.6162,15.1889,7.7433,137
-3.467,-9.7896,-0.8572,1.9974,-9.7896,0.8182,8.9421,6.663,138
-5.8771,-9.7635,0.4597,3.4553,-9.7635,5.0927,18.2278,10.249,139
-8.9338,-9.6856,-0.2037,3.0253,-9.6856,3.8924,18.9389,9.7492,140
-3.4763,-9.277,-1.0379,1.7839,-9.277,2.5764,9.55,6.4599,141
-4.7616,-9.8099,-0.2692,1.8907,-9.8099,4.7202,12.3084,4.7948,142
-4.4668,-9.9046,-0.4011,1.6193,-9.9046,4.2514,9.5628,6.8109,143
-6.5467,-10.0001,-0.7986,2.4663,-10.0001,5.5327,12.9211,8.8621,144
-1.5045,-9.8612,-0.3433,0.9907,-9.8612,3.4192,7.4581,4.5972,145
-0.6093,-9.9929,0.5488,0.7094,-9.9929,1.1914,12.9505,10.5095,146
-1.3821,-9.9623,0.0664,0.8708,-9.9623,0.9992,9.011,5.6875,147
-0.0268,-9.8685,0.5621,0.5599,-9.8685,0.6382,5.9745,4.5944,148
-3.425,-9.9484,-1.0037,1.7163,-9.9484,1.6343,9.452,8.4661,149
-3.1465,-9.9667,-0.3841,1.0032,-9.9667,3.9734,12.176,9.8041,150
-3.0478,-10.354,0.5169,1.9154,-10.354,5.5124,11.9574,7.4912,151
-6.7314,-8.4131,0.1599,2.4036,-8.4131,5.1526,26.6128,10.1502,152
-5.2041,-9.6514,0.6106,2.8593,-9.6514,3.1962,15.2798,9.7042,153
-0.8137,-9.9922,1.1865,2.0251,-9.9922,3.9811,7.7735,5.6793,154
-0.8492,-9.8914,0.1351,0.5885,-9.8914,2.6202,10.4551,7.977,155
-7.5525,-9.8779,-0.4351,4.4624,-9.8779,1.2735,10.7302,8.1991,156
0.4282,-10.1908,5.7392,3.9182,-10.1908,0.534,37.6195,29.6201,157
-0.2349,-9.6789,18.5045,14.8063,-9.6789,3.7271,57.1756,36.6003,158
-3.2854,-10.0342,-0.852,1.4882,-10.0342,2.7917,11.3485,7.8884,159
-3.1288,-10.0743,-0.6608,1.7007,-10.0743,4.7053,13.4074,9.1997,160
-2.4365,-10.1062,0.2565,1.1605,-10.1062,3.3379,17.4335,13.1041,161
-2.3318,-9.9454,0.7114,1.1876,-9.9454,2.6835,13.2365,7.8135,162
-11.1583,-9.95,1.1119,7.1051,-9.95,7.584,28.8916,21.8545,163
-3.2991,-10.1904,5.412,5.3466,-10.1904,1.1305,36.9929,35.7425,164
-1.5838,-9.8727,0.8604,1.7057,-9.8727,3.8214,28.4533,20.151,165
-4.0388,-9.9685,-0.7637,2.3221,-9.9685,1.2735,12.3035,9.8951,166
-1.53,-9.7351,0.4881,1.1879,-9.7351,1.1742,8.0681,5.5731,167
0.2228,-9.7971,0.6829,0.4272,-9.7971,1.7723,8.8429,6.7734,168
-3.2418,-9.6221,0.4654,1.7417,-9.6221,1.857,15.9821,4.9004,169
-6.0558,-9.9409,-0.1534,2.7826,-9.9409,2.4537,10.4371,7.6397,170
-6.2667,-9.8968,-0.1436,2.398,-9.8968,5.14,16.7891,9.0119,171
-1.107,-10.0016,-0.0167,0.5708,-10.0016,1.2187,7.8314,4.319,172
-1.2101,-10.0465,0.2893,1.0946,-10.0465,1.4558,11.5848,4.4869,173
-6.2802,-10.0381,-0.762,1.839,-10.0381,2.7507,16.3534,8.8828,174
-1.2939,-10.408,2.4943,3.635,-10.408,4.8554,32.0389,25.461,175
-3.0389,-9.9273,1.9314,5.0399,-9.9273,2.9747,33.3175,29.3361,176
-19.6472,-9.9177,-1.8366,11.1304,-9.9177,0.7353,28.0253,24.8159,177
-3.3392,-9.8825,0.4863,2.1807,-9.8825,2.2523,9.631,7.1997,178
-3.7796,-10.1061,0.242,1.7573,-10.1061,4.1367,20.5261,8.6546,179
-8.9186,-9.8926,0.0785,3.8704,-9.8926,6.4961,18.8639,9.1427,180
-7.5843,-10.0047,-0.3072,2.1496,-10.0047,5.2949,16.1232,7.4479,181
-5.2063,-9.8292,-0.3802,1.932,-9.8292,6.0975,14.7944,10.3162,182
-2.9685,-9.9038,0.1358,2.0914,-9.9038,6.4253,12.7825,8.1062,183
-5.8582,-10.0267,-1.0474,2.0874,-10.0267,4.7923,13.5203,7.8837,184
-1.3511,-9.5874,-0.0977,0.9587,-9.5874,1.7403,5.2779,3.944,185
-0.9953,-10.1042,0.084,0.5326,-10.1042,2.0524,12.9852,4.2525,186
-3.9661,-9.7866,0.4858,2.7506,-9.7866,2.6571,13.8754,10.3018,187
-5.7096,-10.0235,0.603,3.9003,-10.0235,2.66,22.8101,13.3839,188
-2.3321,-10.8407,-0.2816,1.1997,-10.8407,3.1682,32.735,29.114,189
-1.8093,-10.1611,2.9417,3.4104,-10.1611,1.2666,14.9642,12.8747,190
-15.897,-9.9115,1.091,5.9916,-9.9115,3.0794,30.189,24.9721,191
-12.0571,-10.2816,-0.524,4.0818,-10.2816,3.3185,48.0024,28.0863,192
-7.3689,-9.9912,1.588,4.7648,-9.9912,3.6424,28.4129,18.2828,193
-4.627,-9.8441,1.007,3.8124,-9.8441,1.865,17.5173,9.8867,194
-3.6218,-9.8374,-0.8033,2.1206,-9.8374,2.959,10.2672,8.1938,195
-11.2692,-10.0963,6.2462,11.4744,-10.0963,1.669,24.2683,20.676,196
-1.3503,-9.8771,0.921,1.345,-9.8771,0.569,10.3844,7.9483,197
-3.6647,-9.6853,-1.3028,1.4948,-9.6853,1.2289,9.1675,7.5799,198
-6.8307,-9.2453,1.6737,6.5517,-9.2453,4.9853,18.8939,9.5572,199
-12.1716,-9.903,-0.4446,4.8172,-9.903,7.5356,18.4525,12.9719,200
-6.1174,-10.019,-0.2825,3.0595,-10.019,5.8756,16.4091,9.9772,201
-6.2377,-9.7889,-0.4608,2.1908,-9.7889,5.914,20.0025,8.3627,202
-4.4027,-9.9604,-0.1812,2.0232,-9.9604,4.6848,16.5788,8.4143,203
-2.8694,-10.1253,-0.5225,1.2955,-10.1253,3.9311,11.3772,7.3522,204
-2.8218,-9.2264,0.4827,2.1349,-9.2264,2.7326,12.9528,8.1367,205
-3.9727,-9.8724,0.3721,2.8115,-9.8724,4.9483,13.7249,9.5554,206
-4.7861,-9.9323,-1.3671,2.3382,-9.9323,2.6242,12.5037,8.5042,207
-4.8911,-10.6645,-1.2373,2.1636,-10.6645,4.684,13.4084,10.089,208
-9.0511,-10.3908,2.2335,7.2566,-10.3908,5.6726,13.9023,7.6509,209
-6.7961,-9.7051,-0.2637,3.44,-9.7051,7.0959,16.9586,10.3444,210
-4.9534,-9.8629,-0.2715,1.8408,-9.8629,4.9282,16.9457,7.7089,211
-3.1973,-9.9523,0.8834,3.439,-9.9523,8.1341,17.286,11.5872,212
-4.736,-10.0683,-0.8502,2.413,-10.0683,4.8616,11.2723,7.6041,213
-12.5808,-10.0696,-0.6849,3.5981,-10.0696,7.085,13.3007,10.5243,214
-4.3944,-9.9868,-0.2755,1.9406,-9.9868,4.1721,11.5457,4.7976,215
-3.2488,-10.0389,0.3497,2.6029,-10.0389,5.3284,13.392,7.0458,216
-7.341,-10.0043,-0.1112,5.6526,-10.0043,3.7544,18.7564,10.4974,217
-4.0281,-9.9551,-0.7205,3.318,-9.9551,1.1279,13.79,12.1322,218
-2.6228,-9.3958,-0.1854,1.084,-9.3958,1.9618,9.302,7.1183,219
-4.9695,-9.8548,-0.8296,1.5653,-9.8548,4.9414,11.7415,7.034,220
-8.0147,-9.9596,-0.7065,2.3934,-9.9596,6.4452,14.0782,9.1135,221
-1.8746,-10.0191,-0.0878,1.008,-10.0191,2.3463,8.8154,4.5286,222
-6.4377,-10.0086,-1.0492,2.1766,-10.0086,5.8589,14.0453,10.4628,223
-2.7576,-9.9145,-0.5531,1.2066,-9.9145,5.4886,11.7867,7.3062,224
-3.2128,-9.9521,-1.0464,1.0854,-9.9521,1.6777,6.6555,4.6157,225
-3.8579,-9.8007,-0.627,2.4383,-9.8007,5.4604,12.9775,8.8782,226
-2.9208,-9.9361,-0.4685,1.0941,-9.9361,1.0671,5.4179,3.9815,227
-6.9657,-10.1119,-0.6549,3.298,-10.1119,7.9948,18.9796,12.8406,228
-6.8153,-9.1368,-1.1898,2.7272,-9.1368,6.9544,15.0385,11.6401,229
-6.8505,-9.51,-0.1015,2.2725,-9.51,2.8673,14.4394,7.3715,230
-10.5561,-9.9611,-0.1702,3.6354,-9.9611,6.6855,13.6154,9.7566,231
-8.4308,-9.8329,-0.8888,3.6006,-9.8329,6.9779,13.9353,9.7218,232
-5.5095,-9.9557,-0.2786,2.9059,-9.9557,3.6409,13.7208,7.8248,233
-4.4373,-10.1021,-0.5509,1.2925,-10.1021,4.2637,11.0708,6.8789,234
-1.8247,-9.9458,0.5023,2.1137,-9.9458,3.2844,6.7999,4.7967,235
-0.2424,-9.8957,0.1995,0.3425,-9.8957,2.2729,8.3367,6.5053,236
-0.5075,-10.1135,0.3196,0.5237,-10.1135,0.8241,4.6294,3.3828,237
-0.4323,-9.8584,0.383,0.6395,-9.8584,1.6271,7.6844,6.9349,238
-0.7511,-9.9699,0.9743,1.2639,-9.9699,3.582,14.9243,11.3222,239
-1.4195,-10.0724,0.1864,0.6273,-10.0724,1.9507,9.8687,5.0282,240
-0.1916,-9.9113,0.005,0.1175,-9.9113,0.7961,6.1346,3.2249,241
-0.3616,-10.0361,0.0091,0.1509,-10.0361,0.6525,5.3327,3.2851,242
-0.2486,-9.9567,0.0393,0.129,-9.9567,0.6566,4.3867,2.617,243
-0.2014,-9.9002,0.1553,0.3194,-9.9002,1.272,5.6036,4.4918,244
-2.5603,-9.8888,0.2164,1.3343,-9.8888,2.609,8.6372,4.4897,245
1.4659,-9.8759,5.6986,4.195,-9.8759,2.6219,28.0403,16.1304,246
-3.3333,-9.8654,-0.5145,1.7565,-9.8654,5.292,15.3606,7.677,247
-5.7819,-10.072,-0.6359,4.8866,-10.072,2.944,13.8831,10.4155,248
-0.8567,-10.4079,-0.1634,0.3203,-10.4079,4.5319,15.5679,10.0432,249
-3.4997,-9.9609,-0.5748,1.3094,-9.9609,4.7054,13.9165,6.5785,250
-6.514,-9.9731,-1.4314,2.3113,-9.9731,4.4693,13.0861,8.1887,251
-5.9744,-9.835,-0.9775,2.1066,-9.835,4.714,12.9509,7.8709,252
-7.6493,-9.9229,-0.7989,2.1322,-9.9229,4.7725,11.9342,7.1418,253
-4.3191,-10.0298,-0.0784,2.3092,-10.0298,4.1734,9.8558,6.2503,254
-1.1492,-8.922,0.4439,1.0749,-8.922,6.0172,21.8224,12.5678,255
-4.6403,-9.8864,-0.6848,2.557,-9.8864,2.6567,8.6889,6.1778,256
-3.8421,-10.0426,-0.0243,1.6542,-10.0426,5.0535,11.0342,7.7085,257
-8.4474,-10.0824,-2.751,2.7951,-10.0824,2.5455,13.9719,10.1441,258
-2.4213,-9.6919,3.2843,4.8308,-9.6919,5.1359,19.161,15.4462,259
-3.0468,-9.8429,-0.6821,1.3351,-9.8429,3.5453,11.6089,6.3017,260
-5.7507,-9.9042,-0.8566,2.3941,-9.9042,4.8331,15.1535,7.3411,261
-2.5179,-9.917,-0.782,0.9692,-9.917,4.431,11.7934,6.8677,262
-8.9456,-10.0,-0.7661,2.3646,-10.0,5.7801,12.17,7.7572,263
-2.4067,-9.7934,0.2633,2.0354,-9.7934,4.6883,11.6864,9.7332,264
-6.7704,-9.5112,-0.5551,3.512,-9.5112,3.2035,14.94,10.8477,265
-3.7828,-10.1968,-1.7022,1.5647,-10.1968,1.7326,10.6671,9.6217,266
-2.5998,-9.9107,1.2795,1.9037,-9.9107,5.4529,11.0703,8.1412,267
-2.5477,-9.4945,0.3288,2.1182,-9.4945,3.6195,13.0896,8.3722,268
-0.4274,-9.9394,2.1594,2.2959,-9.9394,5.0805,15.617,9.1821,269
-8.4458,-10.0366,0.277,5.1278,-10.0366,7.8856,25.5483,17.9114,270
-5.965,-10.102,0.7299,3.4013,-10.102,3.6187,21.822,13.0881,271
-2.3103,-9.9222,0.4505,1.3155,-9.9222,4.0807,13.833,7.8591,272
-1.0541,-9.9319,0.1933,0.5367,-9.9319,1.71,6.0888,3.6016,273
-0.4531,-9.8391,-0.1081,0.1677,-9.8391,0.5435,5.8995,5.0572,274
-2.1613,-10.0037,0.4596,1.4326,-10.0037,2.0144,9.3721,5.3097,275
-7.6218,-9.7187,-1.8387,2.81,-9.7187,4.0294,16.5619,9.4141,276
-10.2908,-10.5246,0.8447,5.8542,-10.5246,0.7782,37.2132,35.3486,277
-6.5299,-10.2098,1.0459,4.7515,-10.2098,1.8449,55.2449,42.7512,278
-1.4135,-9.8654,5.4501,7.6375,-9.8654,6.2328,19.3664,13.9726,279
-12.9204,-9.8089,-0.5003,5.5757,-9.8089,4.1347,17.5936,13.496,280
-10.5992,-10.1528,-0.2606,2.8435,-10.1528,4.6961,20.3965,10.1895,281
-2.6723,-9.7516,0.8795,2.1681,-9.7516,7.6403,15.4842,9.3757,282
-1.3223,-10.0547,0.2142,0.6454,-10.0547,2.6663,7.9546,5.6733,283
-1.8552,-9.9467,0.55,1.4726,-9.9467,1.2879,9.6419,7.3584,284
-0.1847,-9.9553,0.0243,0.1603,-9.9553,0.6933,7.1432,4.3325,285
-0.059,-9.8305,-0.0126,0.0269,-9.8305,0.6915,5.712,3.4625,286
-0.5558,-10.1773,-0.1862,0.2318,-10.1773,1.2624,6.6846,4.6618,287
-1.7174,-9.6894,0.2181,1.2635,-9.6894,1.1235,7.1926,5.9305,288
-4.9966,-9.8662,-0.9029,1.5646,-9.8662,4.1502,10.8335,5.4619,289
-6.0907,-10.2544,5.1109,8.4353,-10.2544,5.3071,16.159,13.0144,290
-8.679,-10.0558,-1.3999,2.5787,-10.0558,4.6017,12.5131,7.9984,291
-2.8725,-9.9575,-0.9878,1.1883,-9.9575,3.0049,14.4212,9.0664,292
