AYGX_min,AZ_mean,AYGX_mean,AYGX_std,AZ_mean.1,GX_std,Gnorm_max,Gnorm_median,timestamp
-0.0073,-9.9195,-0.0063,0.0007,-9.9195,0.0071,0.6924,0.6788,1408
-0.0072,-9.9197,-0.0062,0.0006,-9.9197,0.0126,0.7051,0.6737,1409
-489.46,-9.3732,-38.3023,282.4257,-9.3732,27.938,73.1114,53.2336,1410
-53.0179,-9.7413,-2.7552,32.6275,-9.7413,14.1677,32.6351,16.8476,1411
-30.3882,-9.9028,-5.0716,14.2431,-9.9028,8.555,19.6825,7.7176,1412
