AYGX_min,AZ_mean,AYGX_mean,AYGX_std,AZ_mean,GX_std,Gnorm_max,Gnorm_median,timestamp
-0.0872,-9.9228,-0.0813,0.0024,-9.9228,0.0189,2.6991,2.6762,0
-0.0852,-9.9236,-0.0811,0.0019,-9.9236,0.0123,2.7157,2.6728,1
-0.0857,-9.9242,-0.0813,0.0028,-9.9242,0.0159,2.7074,2.6815,2
-0.0886,-9.9242,-0.0824,0.0029,-9.9242,0.0183,2.712,2.6896,3
-0.0844,-9.9231,-0.0809,0.0018,-9.9231,0.0114,2.6962,2.6781,4
-0.0856,-9.9232,-0.0803,0.0027,-9.9232,0.0177,2.7227,2.6809,5
-0.0875,-9.9233,-0.0827,0.0024,-9.9233,0.0149,2.709,2.6793,6
-0.0842,-9.9236,-0.0808,0.0023,-9.9236,0.0142,2.7182,2.6772,7
-0.305,-9.9243,-0.0927,0.0596,-9.9243,0.2046,3.479,2.6897,8
-1.7176,-9.922,-0.1917,0.4028,-9.922,0.7822,4.1051,2.9306,9
-36.0493,-9.8402,-9.4275,12.1466,-9.8402,6.5134,19.8393,9.3224,10
-7.4875,-9.7922,-1.1588,3.8711,-9.7922,2.2406,5.6756,4.0555,11
-2.0988,-9.8184,4.3825,3.5837,-9.8184,2.8166,7.7697,4.4221,12
0.7387,-9.8973,2.8142,1.9431,-9.8973,2.0345,7.7713,6.1629,13
-1.5964,-9.8987,-0.2847,0.9482,-9.8987,1.3351,3.5294,2.8452,15
-1.8919,-9.9044,-0.5999,0.7501,-9.9044,1.0814,3.7695,2.7339,16
-1.7752,-9.91,-0.5677,0.768,-9.91,1.3515,4.1539,2.7365,17
-2.2337,-9.8986,-1.3726,0.6045,-9.8986,0.7567,3.8112,3.264,18
-1.1104,-9.8933,-0.2871,0.3904,-9.8933,0.4336,2.8184,2.646,19
-3.1415,-9.9073,-0.8027,1.3356,-9.9073,2.078,4.9236,3.0355,20
0.25,-9.9056,1.4373,0.932,-9.9056,1.1159,4.3312,3.7737,21
-17.8048,-9.791,-3.5512,4.4904,-9.791,3.9846,12.1043,2.8488,23
-3.1013,-9.7631,-0.7589,1.0958,-9.7631,0.573,3.1593,2.5934,24
-4.178,-9.7826,-1.0896,2.5902,-9.7826,1.4751,3.5404,2.9047,25
0.7624,-9.7889,1.4687,0.4645,-9.7889,0.2774,2.7728,2.6396,26
-1.835,-9.8497,-0.406,1.3816,-9.8497,1.2631,3.2771,2.783,27
-8.85,-9.8321,-4.4667,2.9306,-9.8321,1.8687,6.1548,4.6919,28
-0.4486,-9.8288,1.403,1.3593,-9.8288,1.0012,3.8183,2.7043,29
-38.1447,-9.7899,-13.2679,12.9947,-9.7899,5.5621,15.7503,10.3077,30
-42.2248,-9.4567,18.0982,44.5367,-9.4567,18.894,48.9034,42.7898,31
-11.4817,-9.8331,-3.248,4.6782,-9.8331,3.1948,25.0474,14.959,33
0.5037,-9.8322,3.2483,1.6271,-9.8322,1.3183,22.4452,19.6452,34
1.7859,-10.0261,3.3221,1.3461,-10.0261,1.4512,15.5616,14.6541,35
-18.5332,-9.9151,-6.5793,9.3156,-9.9151,1.4961,14.5491,13.0882,36
-57.2562,-9.6836,-27.7005,20.0878,-9.6836,4.4799,18.5117,14.9101,37
-9.2477,-9.8521,18.4097,15.654,-9.8521,5.0839,36.6093,28.7512,38
-7.0858,-9.9402,-0.7087,2.2411,-9.9402,4.7181,17.7283,10.4808,39
-6.0529,-9.9302,-0.0394,3.2681,-9.9302,4.8016,17.6749,5.9283,41
-3.4327,-9.8494,3.6813,5.9291,-9.8494,4.7983,33.0595,24.5939,42
-0.1498,-10.1081,2.5721,2.9776,-10.1081,3.5625,24.1815,21.2988,43
-2.1984,-9.9593,-0.271,0.6456,-9.9593,1.2506,9.5719,5.011,44
-0.1662,-9.8864,1.8614,2.4078,-9.8864,3.7426,12.3955,8.5851,45
-0.0442,-9.8952,0.2943,0.2333,-9.8952,1.6519,12.8857,10.9148,47
-2.5458,-9.9343,3.0205,3.6461,-9.9343,4.4128,22.8305,12.3149,48
-0.3436,-9.9636,1.1472,2.7538,-9.9636,3.8801,32.9267,28.9439,50
-1.1963,-9.9032,1.5678,1.5965,-9.9032,3.3313,23.6645,9.5616,52
-0.8614,-9.801,0.8848,2.2334,-9.801,2.6558,9.6049,5.8865,53
-4.1123,-10.0237,2.749,4.8489,-10.0237,5.4281,32.1549,12.2066,55
-4.4404,-9.8426,1.5018,3.6595,-9.8426,2.6121,14.8071,9.086,57
-0.1623,-9.9589,1.0045,1.5131,-9.9589,2.7804,10.8513,6.5323,58
-1.4105,-10.0545,0.6746,1.2073,-10.0545,1.1963,17.1727,9.3986,59
-1.7582,-10.0471,1.0807,2.1914,-10.0471,3.9278,24.4276,19.9436,60
-0.6695,-9.8537,0.1689,0.5858,-9.8537,1.5443,8.957,7.0835,61
-14.286,-9.8962,-3.7373,4.6968,-9.8962,2.3054,9.4028,7.8731,62
-1.3909,-9.9169,0.4608,1.1982,-9.9169,3.2317,6.522,4.2809,64
-1.5536,-9.9174,0.0661,0.84,-9.9174,2.0141,4.6024,2.9691,65
-0.2826,-9.9283,0.155,0.3769,-9.9283,1.0188,3.4825,3.1005,66
0.0515,-9.9483,0.0657,0.0136,-9.9483,0.1736,2.8519,2.619,67
-0.0324,-9.9218,0.0207,0.0353,-9.9218,0.6321,2.7963,2.6795,68
-1.0702,-9.9239,-0.2922,0.5525,-9.9239,0.0598,5.8515,5.7775,69
-0.8126,-9.9199,-0.4309,0.2002,-9.9199,0.2802,2.8775,2.6471,70
-1.3287,-9.9251,-0.0126,0.976,-9.9251,3.5825,6.0015,4.1169,71
-0.5521,-9.9267,-0.0076,0.2229,-9.9267,1.3593,4.1331,2.7536,72
-4.8982,-9.9092,-0.7388,2.7436,-9.9092,2.8786,5.4363,3.7259,74
-4.163,-9.9208,-1.5891,1.432,-9.9208,1.461,6.7411,6.0727,75
0.0483,-9.9241,0.3967,0.2698,-9.9241,0.2761,3.6829,3.5756,76
-0.0296,-9.9246,0.0033,0.0354,-9.9246,0.2542,2.6665,2.5791,77
0.0513,-9.9222,0.3153,0.234,-9.9222,0.7835,3.668,3.0837,78
-0.2118,-9.9291,-0.1271,0.067,-9.9291,0.2986,2.9261,2.8283,79
-2.2656,-9.9299,-0.2728,0.8789,-9.9299,0.9191,4.7407,3.469,80
-1.9284,-9.9089,-1.024,0.3662,-9.9089,0.763,4.8599,3.3767,81
-19.0875,-9.8903,-2.49,4.5252,-9.8903,3.9998,11.5803,3.457,83
-59.1007,-9.7744,-4.6265,34.7762,-9.7744,13.599,36.6948,15.2102,84
-12.6066,-9.7978,-3.1608,6.615,-9.7978,3.5397,6.9448,3.0947,85
-57.5065,-9.9393,-4.867,18.7491,-9.9393,7.4023,25.8997,19.5694,86
-10.4061,-10.0099,4.1793,16.7251,-10.0099,8.6212,24.6394,9.9997,87
-1.8452,-10.0139,0.4203,1.7427,-10.0139,2.0149,9.5166,5.8806,88
-0.7619,-9.8553,0.0716,0.6305,-9.8553,0.7218,16.7613,15.6967,89
-0.9455,-10.1804,1.6513,2.3644,-10.1804,3.0168,17.1326,14.9904,90
-0.9821,-9.903,-0.0625,0.5186,-9.903,1.0372,10.2874,8.9867,91
-2.5575,-10.0436,3.2323,4.6568,-10.0436,5.2062,31.2523,24.128,93
-1.3837,-9.9331,1.7966,2.7183,-9.9331,3.7245,26.9151,7.4071,94
-2.4611,-9.9618,3.4531,5.0935,-9.9618,2.4871,25.8183,12.8984,95
-0.7205,-9.851,0.0373,0.3933,-9.851,0.6483,9.2995,7.2201,96
-0.2041,-9.8081,0.0047,0.1785,-9.8081,0.994,11.1424,9.4478,97
-0.2768,-9.9861,2.5406,2.7759,-9.9861,1.6274,25.6061,23.9042,98
-0.8087,-9.9025,0.5391,1.3345,-9.9025,1.7415,9.5128,6.8968,99
-0.6213,-10.0141,2.847,3.3453,-10.0141,5.0411,37.335,24.6508,100
-0.062,-10.0445,0.0463,0.0873,-10.0445,1.0151,12.0123,9.7883,101
-2.1887,-9.8956,1.682,5.0321,-9.8956,4.6605,20.0689,8.5647,103
-1.3201,-9.8775,1.0717,2.1621,-9.8775,2.8498,13.9186,8.479,104
-1.0139,-9.8677,3.9335,3.7642,-9.8677,7.029,31.9187,13.358,105
-0.586,-10.1348,1.1435,1.0889,-10.1348,0.4454,13.264,10.6187,106
-1.1116,-9.7726,0.287,1.1923,-9.7726,1.1839,6.138,5.3609,107
-0.4972,-10.1134,0.3527,0.4627,-10.1134,1.8185,7.1156,5.8216,108
-1.1593,-10.0115,0.0536,0.6623,-10.0115,2.2146,16.5423,11.5812,109
-1.5826,-9.991,2.4894,2.9404,-9.991,3.1672,50.4812,40.1488,110
-0.4376,-9.9381,5.9401,3.1571,-9.9381,9.0968,35.6487,23.0845,111
-0.9373,-9.9408,1.1525,1.5741,-9.9408,4.1522,20.8243,11.0444,113
-2.1315,-9.8731,0.458,0.9263,-9.8731,1.7432,11.0409,4.2858,114
-3.7508,-9.9921,0.8072,1.9748,-9.9921,3.0307,24.6634,15.4997,115
-2.683,-10.1466,-0.4192,1.0162,-10.1466,0.9066,15.1348,13.5402,116
-0.1573,-10.1017,1.0476,1.375,-10.1017,2.253,31.7293,28.4511,117
-0.9534,-9.9076,0.5365,1.0637,-9.9076,1.1923,14.4286,12.5804,118
-0.1188,-9.9569,0.3603,0.385,-9.9569,1.6596,13.6329,10.8366,119
-0.376,-9.9301,0.2979,0.5798,-9.9301,1.2982,12.007,5.5239,120
0.1451,-9.8726,1.0186,0.7114,-9.8726,1.6065,7.3725,5.4994,121
-2.4789,-9.9389,1.8664,2.6695,-9.9389,4.492,20.1071,9.4667,123
-7.6004,-10.0448,11.9002,12.1561,-10.0448,11.7553,67.6451,33.5069,124
-4.5771,-9.7953,2.0855,4.7357,-9.7953,4.898,40.5776,35.4587,125
-0.6778,-10.0775,1.3576,1.575,-10.0775,3.3257,11.415,8.6928,126
-1.0752,-9.9985,2.8776,2.244,-9.9985,1.8138,24.1205,11.5269,127
-1.3986,-10.0552,4.9721,4.3513,-10.0552,3.0376,38.35,34.7648,128
-2.428,-10.0653,9.6148,8.1806,-10.0653,4.487,47.3384,20.6635,129
-3.3528,-10.2058,0.4517,1.8469,-10.2058,3.0505,41.3685,32.7666,130
-4.3463,-9.9952,-0.4459,2.8753,-9.9952,2.9168,49.6508,44.358,131
-1.2345,-10.013,1.8994,2.8247,-10.013,4.139,33.5273,13.3945,133
-1.1704,-9.9842,0.2378,0.8943,-9.9842,2.0193,20.8504,11.8699,134
-1.4096,-10.0264,1.0184,1.9986,-10.0264,4.3341,10.3397,8.4087,135
0.0519,-9.6348,1.568,1.6493,-9.6348,3.5677,9.006,6.4039,136
-1.7987,-10.1743,0.2512,1.5807,-10.1743,2.1109,15.9603,10.804,137
-7.5712,-9.7911,-0.1971,4.7431,-9.7911,3.7155,22.5853,11.0735,138
-3.3187,-9.8711,5.1115,6.5202,-9.8711,7.416,20.0222,15.1573,140
-6.3472,-9.8091,20.2666,23.5862,-9.8091,14.0924,41.7069,23.0034,141
-0.0235,-9.5772,6.8077,4.5308,-9.5772,5.4214,22.4441,15.0935,142
-2.2358,-10.0526,0.9061,1.7829,-10.0526,4.8487,14.7,11.851,143
-4.5582,-9.9409,4.3039,6.8701,-9.9409,5.7668,19.9777,9.8067,144
-0.9867,-10.1326,1.3721,2.6904,-10.1326,2.8027,8.6861,6.131,145
-0.2583,-9.9839,0.4014,0.7111,-9.9839,2.7705,8.7493,7.1477,146
-2.3281,-9.5061,0.2383,2.0219,-9.5061,1.3923,14.2214,4.5731,147
-0.635,-10.1121,1.2687,1.3291,-10.1121,1.5757,10.7935,6.4218,148
0.0603,-9.4519,3.0786,2.9486,-9.4519,3.2827,15.1222,9.8562,149
-0.3525,-9.6475,0.325,0.5994,-9.6475,0.9043,9.5448,5.6477,150
-1.3556,-9.9076,0.4475,1.2993,-9.9076,3.4124,29.4935,15.0817,151
-3.8067,-10.0187,-0.9702,1.9453,-10.0187,1.2684,8.5098,6.0958,152
-1.2554,-9.9267,4.0742,7.1605,-9.9267,6.8314,22.3124,11.7851,153
-4.895,-9.8549,8.3599,9.2557,-9.8549,8.7921,40.6677,17.2215,154
0.2751,-10.1342,3.3903,2.1278,-10.1342,3.4624,23.2838,18.5187,155
-0.2259,-9.6453,2.3516,2.5329,-9.6453,1.8908,13.264,11.8872,156
-4.0842,-9.6202,-0.1091,2.0084,-9.6202,1.0886,12.0002,6.5771,157
-3.134,-10.146,0.8449,2.3823,-10.146,2.4913,14.3874,12.2577,158
-4.6298,-9.4296,8.5125,9.4859,-9.4296,4.6373,29.9452,13.7814,159
-0.8839,-10.0355,9.6446,7.5092,-10.0355,10.1566,23.9603,20.095,160
-1.6589,-9.9631,0.3911,0.9915,-9.9631,2.0443,11.016,5.586,161
-0.844,-9.8951,0.3892,0.6997,-9.8951,2.7349,13.9754,5.9128,163
-2.617,-9.9275,0.5035,1.307,-9.9275,0.984,10.5738,5.3046,164
-1.9398,-9.948,-0.2123,0.7053,-9.948,1.4316,10.9696,10.2627,165
-0.7786,-9.5928,4.1864,5.9068,-9.5928,5.2509,12.823,7.1454,166
-0.1443,-9.8195,0.9269,0.889,-9.8195,3.9828,19.0396,18.115,167
-2.5062,-9.977,0.5686,2.1744,-9.977,1.1655,11.0732,10.5683,168
-0.4616,-10.0544,1.3423,1.5436,-10.0544,3.7277,8.4862,4.5391,169
-1.1809,-9.5413,-0.4462,0.7053,-9.5413,1.8031,12.0014,6.9018,170
-1.0228,-9.7939,1.3392,2.3911,-9.7939,3.6228,14.7432,6.7692,171
-2.0135,-9.8209,2.3571,4.6483,-9.8209,5.0469,14.0166,9.9716,173
-1.4955,-9.8833,0.9031,1.9581,-9.8833,3.9867,10.1988,7.0074,174
-5.3934,-9.7824,7.6249,9.3955,-9.7824,9.9433,22.0553,14.7594,175
-1.866,-9.738,7.5746,9.4989,-9.738,9.7705,25.9841,12.5921,176
-3.2927,-9.8887,11.1092,10.3289,-9.8887,10.8086,28.2222,15.3651,177
-1.0071,-9.5524,0.7864,1.1775,-9.5524,2.1399,11.8979,7.4556,178
-5.1626,-10.0196,2.6655,5.2417,-10.0196,2.3754,11.183,9.8483,179
-1.813,-9.9075,0.1825,1.0163,-9.9075,2.0906,10.169,6.4594,180
-2.1518,-9.8747,0.7115,2.222,-9.8747,1.7202,8.1637,4.2564,181
-4.4744,-9.8903,0.8319,2.1412,-9.8903,3.6659,15.5119,6.8363,183
-1.4591,-9.8471,0.3222,0.9566,-9.8471,1.1716,8.6918,4.2323,184
-1.2852,-9.7932,0.3359,1.8484,-9.7932,1.2921,7.5305,4.3435,185
-0.3415,-9.9801,1.0269,1.5399,-9.9801,2.4528,12.0942,7.538,186
-1.9137,-10.0663,0.6467,1.6984,-10.0663,0.9846,7.1374,5.3175,187
-0.3449,-9.7631,0.2519,0.3842,-9.7631,1.2106,6.4599,3.912,188
-9.7451,-9.8374,-0.1569,4.8818,-9.8374,3.7791,13.7121,12.3445,189
0.0669,-9.6606,7.3756,7.8852,-9.6606,7.6839,28.5415,11.3313,190
-0.1813,-9.5827,4.0326,5.4929,-9.5827,9.0451,22.332,19.5855,191
-6.0302,-9.8622,4.5225,7.4029,-9.8622,7.3094,20.1344,10.4734,193
-2.6908,-10.0895,3.3423,5.3301,-10.0895,5.8622,19.3385,8.3127,194
-0.2276,-9.4959,0.8872,0.9722,-9.4959,1.7693,8.5411,4.4417,195
-0.6958,-9.9244,1.5627,1.5515,-9.9244,2.5189,9.6616,5.973,196
-2.4843,-10.0595,3.4877,3.9768,-10.0595,4.1736,15.6942,10.9175,197
-1.9003,-9.8931,2.9128,4.442,-9.8931,3.9187,12.7154,9.2564,198
-0.9566,-9.5545,5.2524,4.8046,-9.5545,5.9088,18.7477,11.9686,199
-0.5151,-9.8983,5.8903,8.2738,-9.8983,9.2452,25.8671,11.7275,200
0.0218,-9.7924,1.2871,0.7899,-9.7924,3.317,8.6294,6.6273,201
-2.1397,-9.944,0.7292,1.9069,-9.944,3.2163,9.6294,5.8174,203
-3.7035,-9.9527,1.8122,3.1969,-9.9527,5.1458,21.1297,9.4459,204
-0.0148,-9.8498,2.9959,2.057,-9.8498,4.4705,11.889,9.4264,205
-1.2974,-9.8592,-0.4292,0.5051,-9.8592,2.0379,17.5313,9.4565,206
-0.5962,-9.5153,0.6722,1.5144,-9.5153,2.9506,10.0371,5.5098,207
-1.6977,-9.8909,0.0308,0.9878,-9.8909,1.5684,10.0473,5.2791,208
-1.8217,-10.2827,0.4742,1.4208,-10.2827,0.4583,8.7274,7.833,209
-2.8605,-9.992,0.9597,2.0626,-9.992,3.8825,10.8046,7.3106,210
-3.2886,-10.178,-0.1477,2.701,-10.178,3.0482,11.1026,7.8442,211
-12.0172,-9.9019,13.1677,23.4745,-9.9019,11.5681,33.2024,19.3452,213
-4.5494,-9.8823,0.7023,1.7085,-9.8823,2.7899,14.2626,9.5131,214
-4.2342,-10.0944,1.6732,4.9697,-10.0944,4.4378,17.783,7.9632,215
0.4853,-9.8484,4.766,4.8517,-9.8484,5.272,20.7383,7.3136,216
-5.0636,-8.1872,-0.0736,2.7911,-8.1872,3.8726,15.5199,8.5444,217
-3.379,-10.2593,6.2727,9.1293,-10.2593,7.0754,14.2074,11.3301,218
-0.8916,-9.9607,0.012,0.6733,-9.9607,2.2099,10.5605,6.5719,219
-3.5066,-9.907,1.0683,5.5813,-9.907,4.776,16.6343,10.3095,220
-3.9679,-9.2255,-0.3461,2.2686,-9.2255,2.6615,10.9033,8.64,221
-13.6018,-9.8112,3.1251,9.0706,-9.8112,8.0799,25.7488,8.6837,223
-3.961,-9.8796,0.4173,2.1964,-9.8796,3.3164,12.3473,7.3362,224
-3.3115,-9.0119,0.1416,2.0608,-9.0119,4.0053,10.2855,5.9652,225
-8.5997,-9.8077,10.5136,14.3978,-9.8077,8.9347,29.2872,17.8908,226
-5.1224,-9.1854,1.8206,5.5461,-9.1854,3.4923,15.7566,10.8774,228
-0.1736,-9.5426,0.0915,0.1956,-9.5426,0.5497,10.8736,5.5925,229
-1.8562,-9.7162,-0.1374,0.9767,-9.7162,1.3688,13.7039,6.1329,230
-2.3009,-9.9454,1.3268,2.0556,-9.9454,4.1892,14.6822,8.3283,231
-0.3575,-9.2008,0.4589,0.6072,-9.2008,1.7596,8.1193,5.6376,232
-2.0905,-9.5283,4.8545,5.028,-9.5283,3.7054,23.0532,17.7764,233
-2.9446,-9.7321,0.414,1.3959,-9.7321,1.9771,17.7743,6.4525,234
-0.7806,-9.9845,0.684,1.4369,-9.9845,2.0915,10.7632,5.3138,235
-1.2204,-9.8902,0.3001,1.4957,-9.8902,1.8433,12.0694,5.0806,236
-0.429,-9.692,1.6085,1.7754,-9.692,2.6288,11.5976,7.2931,237
-0.6002,-9.7153,0.63,1.22,-9.7153,1.6155,6.7562,4.745,238
-2.4786,-9.2128,1.621,2.7214,-9.2128,2.101,11.9151,8.5436,239
-0.6665,-10.1693,0.3049,0.7675,-10.1693,2.0861,10.7598,4.0385,240
-4.0432,-9.8011,0.7245,2.5882,-9.8011,3.8608,10.7966,8.5693,241
-0.9854,-9.4228,1.8067,1.9397,-9.4228,6.0602,16.8765,12.3507,242
-0.5963,-10.1507,0.8009,1.2764,-10.1507,3.2341,17.2566,6.2099,243
-1.075,-9.6323,0.2123,0.6547,-9.6323,1.3048,13.0619,5.7042,244
-0.8324,-9.453,1.1636,1.6827,-9.453,3.8376,13.6618,7.0315,245
-0.5624,-9.828,0.5146,0.9644,-9.828,0.6644,12.7717,5.4632,246
-2.5729,-9.6804,0.3283,1.8592,-9.6804,1.1266,11.8582,7.4651,247
-1.1171,-9.1727,2.2659,3.1169,-9.1727,4.3306,17.5066,8.1159,248
-1.022,-9.4056,0.1106,0.9454,-9.4056,0.5434,7.5262,4.0132,249
-1.5989,-10.1754,1.8145,3.3657,-10.1754,2.5021,10.4615,8.4216,250
-2.6003,-9.8246,0.2465,1.6556,-9.8246,4.8473,14.0712,9.0397,251
-8.2833,-9.7238,1.1276,4.5743,-9.7238,6.1206,20.4994,11.7126,253
-3.4205,-9.9565,2.0837,2.7217,-9.9565,5.1897,18.9962,9.3601,254
-1.4656,-9.4226,4.2128,4.7244,-9.4226,1.6464,15.6487,8.2987,255
-0.5362,-9.6181,1.7304,2.7719,-9.6181,3.956,10.4166,8.7022,256
-3.214,-9.2294,7.6413,10.7441,-9.2294,4.9995,22.1701,13.6107,257
-5.5283,-10.2372,0.7954,5.3197,-10.2372,2.0769,18.1573,9.0551,258
-2.0915,-9.7333,0.3224,1.5508,-9.7333,1.1623,9.3736,4.1958,259
0.1056,-9.5317,3.81,3.6092,-9.5317,5.4516,13.8838,8.6736,260
-2.2734,-9.701,3.8481,5.0641,-9.701,5.8586,14.9529,11.4684,261
-15.0458,-9.45,3.3902,10.4989,-9.45,9.5478,22.1771,13.9987,263
-6.5719,-10.0026,0.7626,4.5378,-10.0026,2.6499,13.3141,8.3759,264
-5.0078,-9.7911,4.6943,5.2721,-9.7911,6.8424,19.2546,15.9109,265
-6.2432,-9.1286,2.1634,3.9143,-9.1286,1.7937,10.7788,6.6628,266
-1.15,-10.1379,-0.0572,0.753,-10.1379,1.1733,12.3516,7.8409,267
-1.2405,-10.2557,2.4291,2.3853,-10.2557,4.2575,10.6848,7.3197,268
-1.282,-9.5635,4.5788,4.8055,-9.5635,4.7603,13.3803,9.6491,269
-1.8143,-9.5653,2.0225,3.053,-9.5653,5.4775,12.0904,8.4775,270
-0.153,-10.2393,1.8016,1.9544,-10.2393,4.641,9.4889,7.5371,271
-5.3673,-9.7795,0.691,3.752,-9.7795,3.5292,13.3472,7.6267,273
-3.2326,-9.765,1.3224,2.4377,-9.765,4.0177,13.6646,8.3649,274
-1.8382,-9.9843,0.5854,1.4032,-9.9843,1.964,8.3037,6.2485,275
-1.4927,-9.827,0.9465,1.8587,-9.827,3.8509,12.2948,7.728,276
-1.6902,-10.0139,0.7175,1.7966,-10.0139,1.7287,13.6004,9.0504,277
-0.6857,-9.8464,0.2482,0.7532,-9.8464,1.6494,11.7158,8.8246,278
-0.6909,-10.1072,12.6001,9.8493,-10.1072,4.5539,24.5602,19.2693,279
-1.4168,-10.0817,6.2216,5.7653,-10.0817,8.0416,22.3009,15.1195,280
-2.4333,-10.2085,1.8279,3.9042,-10.2085,3.8358,11.6696,10.3668,281
-2.9204,-9.7558,2.4664,3.3389,-9.7558,5.9294,18.8465,9.6591,283
-9.2648,-9.7421,0.6701,3.4147,-9.7421,5.1244,25.0889,10.0536,284
-13.2333,-9.8094,0.5866,7.3752,-9.8094,3.5166,21.6193,17.337,285
-3.6173,-10.2821,0.0837,1.7836,-10.2821,3.5297,15.3955,6.0796,286
-0.3074,-9.9169,1.8238,2.8228,-9.9169,3.3624,12.0128,10.2963,287
-3.929,-9.0581,-0.0019,2.3253,-9.0581,0.9576,9.8351,7.5738,288
-2.6656,-9.8468,1.5898,3.4909,-9.8468,5.1823,16.3603,11.6706,289
-0.9341,-8.8951,0.4007,0.9775,-8.8951,0.9405,18.3844,7.4997,290
-5.2712,-9.7912,1.9612,3.6991,-9.7912,6.0696,16.5745,11.6721,291
-0.9945,-10.0883,0.2708,0.7682,-10.0883,1.4375,9.1589,7.0835,292
-2.0881,-9.8465,0.3858,1.0562,-9.8465,2.5542,7.9802,6.2312,293
-4.4075,-10.0888,3.6607,3.9929,-10.0888,10.05,21.167,14.985,294
-2.2343,-9.8514,1.1872,2.1232,-9.8514,1.6419,10.6413,6.8377,295
-3.0647,-9.9967,3.2388,5.1042,-9.9967,9.0163,23.6532,12.1813,296
0.0449,-9.8888,1.3147,1.0927,-9.8888,1.8008,10.6232,9.565,297
-0.2537,-10.0826,1.8755,1.9249,-10.0826,3.7201,14.2349,8.1336,298
-1.0948,-9.962,3.0451,5.2071,-9.962,4.9975,15.3122,6.4703,299
-0.5642,-9.965,0.8291,1.9306,-9.965,2.4662,8.0144,5.3157,300
-0.7115,-9.9788,0.3884,0.7527,-9.9788,0.8157,3.6285,2.8308,301
-1.3026,-9.9259,0.6953,1.184,-9.9259,4.1807,10.8204,6.4865,303
-2.1605,-9.8891,0.5125,1.4553,-9.8891,3.7053,20.4363,7.3314,304
-0.296,-9.8769,0.2272,0.4099,-9.8769,1.485,6.5816,4.4361,305
-0.9105,-9.9103,0.1121,0.5443,-9.9103,1.717,6.9612,3.0678,306
-0.095,-9.9989,0.933,0.7718,-9.9989,0.9388,7.3885,5.4948,307
0.0046,-9.8669,0.3177,0.2967,-9.8669,1.5789,6.4473,4.6201,308
-0.1651,-10.0413,1.5249,1.8026,-10.0413,3.8867,18.7117,17.3888,309
-2.8345,-10.0305,0.9552,2.4603,-10.0305,4.9687,35.0783,28.1041,310
-0.8784,-9.8638,6.8012,4.1856,-9.8638,1.2942,20.047,17.0412,311
-1.1708,-9.9012,1.0758,1.8427,-9.9012,4.4788,23.4722,5.3578,313
-0.1106,-9.9335,0.1447,0.2168,-9.9335,1.1972,9.4715,7.0653,314
-0.5708,-10.0124,0.755,0.7606,-10.0124,1.1299,8.57,7.4596,315
-0.1248,-9.941,0.1601,0.364,-9.941,1.1554,5.113,3.7274,317
-0.5418,-9.9095,0.3754,0.5794,-9.9095,2.3805,21.9977,5.2745,318
-2.5359,-9.9517,0.8766,1.4979,-9.9517,2.3306,22.7359,7.808,319
-4.6627,-9.877,1.4435,2.9689,-9.877,5.1792,30.9321,12.6022,320
-8.5303,-10.0172,5.7991,11.5712,-10.0172,9.9694,32.753,21.6521,321
-3.5081,-9.775,4.527,7.3403,-9.775,7.1744,23.3517,8.5991,322
-6.9324,-10.0223,1.9405,4.6504,-10.0223,6.7682,24.6535,9.2655,323
-3.871,-9.861,0.9436,2.3886,-9.861,4.7615,13.6901,8.4776,324
-1.9966,-9.9006,1.2415,1.91,-9.9006,4.1521,14.9338,6.9607,325
-1.0531,-10.0732,-0.2018,0.8538,-10.0732,0.7418,6.1636,4.1092,326
-1.1032,-9.8073,4.4898,5.8144,-9.8073,3.0605,16.7094,11.098,327
-0.6913,-10.1014,1.2318,1.9452,-10.1014,3.7327,9.9874,8.8205,328
0.1119,-10.1596,0.6897,0.6717,-10.1596,2.4955,13.5245,9.2931,329
-1.6785,-9.6766,0.1402,1.2458,-9.6766,0.8472,9.7362,5.8922,330
-1.5501,-10.0929,0.773,2.1059,-10.0929,1.6343,16.2399,6.3055,331
-0.7097,-10.0503,0.6594,1.5706,-10.0503,3.8183,10.5077,4.9074,332
-4.9023,-9.5775,3.4421,6.4815,-9.5775,6.163,36.3471,17.1274,333
-3.3985,-9.7459,1.6702,3.5012,-9.7459,3.9462,14.946,7.8343,334
-5.7775,-9.7892,2.6485,5.7329,-9.7892,4.0005,16.9134,10.8371,335
-7.0649,-10.0403,6.8702,10.5641,-10.0403,7.7722,20.2884,13.2329,336
0.2598,-9.991,4.215,3.7974,-9.991,6.5897,22.1371,12.7525,337
-0.3717,-9.4352,4.0343,4.5952,-9.4352,7.4054,20.6647,19.2408,338
-3.425,-8.7791,4.5554,12.0127,-8.7791,3.9472,28.0551,15.3133,339
-5.0134,-8.49,0.7706,3.2193,-8.49,5.4455,18.1259,14.3475,340
-6.8334,-9.883,6.0811,10.5405,-9.883,11.2825,26.0733,18.9929,341
-6.8584,-11.4254,3.9525,13.9842,-11.4254,8.796,35.747,26.912,342
-2.9683,-10.3729,23.9029,33.9577,-10.3729,15.837,50.7477,20.8987,343
-25.4407,-9.9126,13.298,25.4229,-9.9126,14.6149,37.0574,19.626,344
-3.1007,-9.8566,4.5159,6.1284,-9.8566,7.3164,17.4083,12.267,345
-0.1955,-10.253,14.2669,16.1506,-10.253,10.5912,21.5587,14.5044,346
0.3718,-10.5345,16.0812,15.4209,-10.5345,6.572,26.1345,21.119,347
-0.512,-9.4786,-0.1065,0.3543,-9.4786,1.032,12.6393,4.8605,348
0.0002,-9.6284,1.3369,1.3537,-9.6284,3.4932,14.9696,7.9476,349
-3.5645,-10.1537,1.8284,4.2819,-10.1537,4.3729,13.0609,7.569,350
-1.2467,-9.8686,6.1694,6.6823,-9.8686,9.4313,21.1265,13.2669,351
-4.3056,-9.8631,4.0133,6.1881,-9.8631,7.3193,24.4058,9.7946,353
-7.2516,-9.8424,3.5417,8.3232,-9.8424,5.6122,27.6776,9.3894,354
-9.6291,-9.2162,9.4843,24.8884,-9.2162,10.1978,33.4731,14.6926,356
-8.5125,-9.8375,4.3266,9.1964,-9.8375,6.7702,25.4681,15.8229,357
-3.471,-9.8528,5.7678,12.6696,-9.8528,5.8934,27.0191,8.8174,358
-3.8758,-9.9759,-0.6603,1.571,-9.9759,3.9323,15.8429,8.0133,359
-5.4499,-10.1323,15.0241,28.089,-10.1323,11.1613,39.2951,10.4133,361
-4.9953,-9.6562,2.0138,3.2819,-9.6562,4.7309,21.347,8.5967,362
-10.4377,-10.1678,-1.3698,5.5803,-10.1678,0.9852,16.0145,8.8655,363
-1.0998,-9.6769,0.4409,1.0773,-9.6769,2.0178,6.7064,4.5988,364
-3.0891,-9.9768,0.5067,2.1862,-9.9768,3.874,11.4244,8.7173,365
-1.8444,-9.8009,4.7232,7.4329,-9.8009,6.2956,18.5252,9.584,366
-2.5363,-9.6688,4.3109,4.9641,-9.6688,6.759,14.7763,12.6194,367
-8.3683,-10.0464,2.1662,6.0392,-10.0464,7.2529,19.4874,11.7716,368
-15.2833,-9.7208,2.3017,6.101,-9.7208,5.8832,20.3405,9.3477,369
-1.1756,-9.8281,3.1524,3.8583,-9.8281,6.6487,14.9519,11.5297,370
0.1128,-9.9294,3.7348,4.2301,-9.9294,6.2567,17.0255,10.9404,371
-4.562,-9.9964,1.8952,3.8591,-9.9964,5.7992,15.2847,9.3412,372
-3.0996,-9.8891,2.3706,4.1972,-9.8891,6.4895,16.6847,11.621,373
-1.6307,-10.0476,0.4842,1.3991,-10.0476,2.8423,11.0722,5.012,374
-1.6933,-9.9679,0.9202,1.7164,-9.9679,3.7815,14.6434,7.6072,375
-3.9903,-9.7341,0.4015,4.049,-9.7341,2.5441,16.4978,13.2677,376
-3.1512,-9.8359,2.9845,4.0509,-9.8359,6.1714,17.7288,9.9092,378
-2.2808,-9.8964,0.6833,1.6466,-9.8964,2.3376,9.2456,5.603,379
-2.1562,-9.9499,2.3241,3.7064,-9.9499,4.9441,16.8836,9.4936,380
-9.0264,-9.6389,-0.2889,4.7791,-9.6389,2.6988,18.7647,13.7922,381
-0.1995,-10.0528,1.2818,1.1454,-10.0528,1.1279,9.3147,5.2316,382
-1.143,-10.1877,1.786,2.8878,-10.1877,1.6891,9.8244,6.141,383
-1.0287,-9.6786,0.3254,0.798,-9.6786,2.2633,6.0425,4.2208,384
-2.1987,-9.9726,2.9715,5.1764,-9.9726,4.7264,15.5901,13.1392,385
-6.5251,-9.5987,0.9637,2.9581,-9.5987,2.7534,32.132,9.5067,386
-2.8294,-9.8358,0.3635,1.3344,-9.8358,3.0044,11.1898,6.0532,388
-3.5513,-9.9199,0.6248,2.1145,-9.9199,4.6626,14.3384,8.5149,389
0.049,-9.8712,1.7338,1.1992,-9.8712,0.6451,11.3793,8.0314,390
-3.6313,-9.9148,0.5179,3.4498,-9.9148,2.3064,11.5322,7.2155,391
-0.3501,-9.9222,0.942,1.3279,-9.9222,1.8173,7.7588,5.3692,392
-0.6777,-10.005,0.6392,1.0149,-10.005,1.8145,8.5189,5.4579,393
-0.0585,-9.9479,0.0154,0.0717,-9.9479,0.3873,3.5528,3.0472,394
-0.0241,-9.9474,1.2175,1.2293,-9.9474,3.0058,10.8005,7.2355,395
-0.1839,-9.9417,0.1074,0.2623,-9.9417,1.1704,9.5547,5.8377,396
-11.4518,-9.9326,-0.2531,2.3648,-9.9326,2.4631,10.3125,5.1166,398
-14.1244,-9.9024,0.0965,5.1807,-9.9024,7.5974,14.0176,5.3444,399
-7.8691,-9.8625,-3.5482,2.7363,-9.8625,1.6674,5.3483,3.2098,400
-4.5864,-9.8177,-2.4753,2.5903,-9.8177,1.5998,3.8664,3.4054,401
-0.6597,-9.93,0.043,0.9535,-9.93,2.3452,8.9149,6.7756,402
-0.6036,-9.9238,0.8944,0.9809,-9.9238,3.6907,8.56,4.4511,403
-5.682,-9.8927,-3.6662,1.1475,-9.8927,0.833,5.2646,3.7776,404
-1.4496,-9.9056,1.0512,1.1989,-9.9056,1.1909,3.7937,2.9356,405
-5.3899,-9.8926,-4.72,0.4611,-9.8926,0.4054,5.5094,5.2825,406
0.2784,-9.8841,0.6007,0.2565,-9.8841,0.247,2.6714,2.5808,408
-0.8706,-9.9001,-0.1951,0.3589,-9.9001,0.4002,2.6004,2.4936,409
-0.4272,-9.9047,0.0125,0.2473,-9.9047,0.319,2.5157,2.4469,410
-1.2969,-9.9152,-0.9565,0.2837,-9.9152,0.3309,2.9947,2.836,411
-0.8511,-9.9027,-0.4831,0.194,-9.9027,0.1997,2.5892,2.4704,412
-1.8814,-9.8963,-1.3939,0.3747,-9.8963,0.4246,3.2138,2.87,413
-0.5179,-9.8964,0.1437,0.4878,-9.8964,0.4874,2.6223,2.3723,414
-1.3928,-9.903,-1.0911,0.2492,-9.903,0.2479,2.9729,2.8017,415
-1.5563,-9.8978,-1.1904,0.1982,-9.8978,0.1664,2.8771,2.7787,416
-1.4894,-9.8948,-0.9783,0.3873,-9.8948,0.3631,2.8607,2.6604,417
-0.8044,-9.8815,-0.3971,0.2634,-9.8815,0.262,2.7115,2.4103,418
-1.4355,-9.8949,-1.0599,0.1798,-9.8949,0.191,2.861,2.699,419
-1.3923,-9.8915,-0.6472,0.3187,-9.8915,0.3066,2.865,2.5231,420
-0.7769,-9.8914,-0.4525,0.208,-9.8914,0.2058,2.675,2.4963,421
-1.1089,-9.8977,-0.5881,0.2811,-9.8977,0.3169,2.7769,2.5565,422
-2.3407,-9.8945,-1.5166,0.5373,-9.8945,0.4994,3.3619,2.7809,423
-0.8059,-9.8662,0.1161,0.4981,-9.8662,0.6438,3.0014,2.5287,424
-16.4555,-9.8626,-1.0342,7.6396,-9.8626,6.2167,16.8776,9.5646,425
-5.6577,-9.8711,1.8941,4.3594,-9.8711,3.285,20.1443,5.2473,426
-16.0506,-9.7573,-0.204,9.5038,-9.7573,6.496,21.7441,12.1442,427
-2.3669,-9.8416,4.4276,8.4054,-9.8416,8.1308,32.4092,21.1878,428
-5.3986,-9.9683,0.8573,2.6094,-9.9683,4.9048,9.1556,7.1527,429
0.3913,-9.9588,7.186,5.5508,-9.9588,6.2042,18.4415,14.3734,430
-2.6143,-10.2309,1.1378,2.957,-10.2309,4.985,19.3424,10.6071,431
-0.4836,-9.9204,2.9973,3.0688,-9.9204,2.3914,14.0591,10.8771,432
-3.0396,-9.7491,9.4947,14.866,-9.7491,7.6525,18.889,13.0099,433
-1.9818,-10.3978,17.757,18.1677,-10.3978,10.2397,28.2348,22.1796,434
-2.4092,-9.6339,7.9562,11.9365,-9.6339,5.89,24.0327,14.6097,435
-3.3492,-9.7897,3.8032,6.3803,-9.7897,5.5194,18.8739,13.1713,436
-0.1359,-10.0561,1.5812,2.3999,-10.0561,3.6429,14.9743,7.2688,438
-2.6669,-9.7859,13.7004,19.4571,-9.7859,13.1446,42.3589,11.9336,439
-1.2995,-10.0662,8.0221,9.4487,-10.0662,9.9845,33.4432,28.0321,440
-1.4104,-9.7292,-0.0146,0.8567,-9.7292,0.9477,12.7377,9.4366,441
-1.8108,-9.5953,3.6527,3.3315,-9.5953,2.977,24.3049,15.1843,442
-5.1127,-9.5498,7.3545,12.9156,-9.5498,7.551,27.9523,24.0259,443
-1.6484,-10.4285,6.7544,6.0659,-10.4285,1.7899,44.6027,34.9912,444
-3.9853,-9.7468,0.1249,2.4575,-9.7468,2.9603,9.0345,5.7593,445
-0.6029,-9.9004,1.7399,1.8183,-9.9004,4.3825,11.0138,8.9384,446
-1.2155,-9.8755,1.5269,2.8733,-9.8755,3.5158,14.0556,5.6524,448
-2.5843,-9.8538,0.9838,2.8891,-9.8538,3.7971,11.9468,7.6134,449
-1.8302,-9.9277,1.1501,2.0905,-9.9277,1.8164,9.1224,6.341,450
0.5639,-9.6387,4.5231,3.8865,-9.6387,5.9357,11.0917,9.0381,451
-0.035,-10.2689,2.5405,2.2231,-10.2689,5.5056,14.5184,10.916,452
-3.8377,-9.9384,-1.3223,1.6881,-9.9384,2.1457,13.4249,6.8808,453
-1.634,-10.2107,6.9011,6.1168,-10.2107,9.1633,19.6947,14.0607,454
-1.8098,-9.8958,4.0719,6.3706,-9.8958,6.435,17.7958,10.9014,455
-1.1525,-10.2622,0.7031,2.0145,-10.2622,3.4492,7.7986,4.5268,456
-2.7151,-9.9235,1.4037,3.7642,-9.9235,7.4214,18.2659,11.0606,458
-0.6495,-9.9357,0.2008,0.588,-9.9357,1.2505,7.6045,4.3717,459
0.0301,-10.1055,0.7937,0.8745,-10.1055,2.0412,5.9515,4.7087,460
-0.7292,-9.9408,0.15,0.5931,-9.9408,1.0715,3.6491,2.7551,461
-0.2525,-10.0683,1.1943,1.3022,-10.0683,2.3942,9.0394,6.6144,462
-5.3762,-9.877,0.7595,3.1862,-9.877,5.87,19.8006,8.119,463
-11.4263,-9.5444,1.48,5.6431,-9.5444,1.0885,14.8018,8.6246,464
-1.114,-9.9594,0.4396,1.0293,-9.9594,2.6069,10.0349,5.539,465
-0.8847,-10.0406,1.0844,1.6487,-10.0406,0.9885,9.1219,8.3676,466
-4.3853,-9.9307,3.5182,5.0873,-9.9307,9.4599,14.9471,10.244,468
-2.1021,-9.9474,0.4703,1.7824,-9.9474,3.1521,13.017,6.9968,469
-7.0818,-9.9972,-1.2303,2.6035,-9.9972,1.3896,7.3514,4.9669,470
-0.4243,-9.9176,1.3824,2.6201,-9.9176,3.7759,10.7945,6.2589,471
-1.1636,-10.0072,0.4712,1.2149,-10.0072,2.1951,6.2948,5.0269,472
-9.8655,-9.982,2.7416,6.4452,-9.982,6.0582,18.3675,10.1615,473
0.2242,-10.013,1.3049,0.8051,-10.013,4.6666,9.5931,6.5913,474
-0.2829,-10.0432,1.4048,2.0421,-10.0432,3.641,12.6087,6.7554,475
-2.0667,-10.0606,1.1673,2.0774,-10.0606,1.2307,13.0613,9.9671,476
-3.1741,-9.9265,-0.0193,0.7155,-9.9265,1.8945,10.8764,4.3326,478
-0.0758,-9.9928,4.7659,5.0468,-9.9928,7.4568,37.6695,25.0636,479
-4.6233,-9.9617,5.3607,4.972,-9.9617,5.3038,38.0324,18.7708,480
-1.9024,-9.9134,0.1088,1.1099,-9.9134,2.1084,11.8169,7.1761,481
-0.9437,-9.9075,0.5386,0.9469,-9.9075,3.2415,9.0243,5.3452,482
-1.9133,-9.9184,0.5734,1.8194,-9.9184,3.544,9.984,5.524,483
-0.8687,-10.002,0.0083,0.4854,-10.002,1.987,8.8981,4.245,484
-0.4838,-10.0052,-0.0896,0.2303,-10.0052,0.5444,7.635,4.3639,485
-0.6066,-9.8909,0.3804,0.6705,-9.8909,2.212,7.3083,4.0699,486
-1.9567,-9.9705,0.2648,0.8909,-9.9705,3.8102,13.0077,6.9425,488
-7.7125,-9.7198,-0.0878,3.7271,-9.7198,3.0421,17.9834,9.3284,489
-3.2395,-10.0402,10.818,13.368,-10.0402,12.0795,50.5227,27.6717,490
0.0293,-8.2575,2.0924,1.651,-8.2575,4.1867,26.4585,16.1753,491
-6.7302,-9.6239,5.2432,7.971,-9.6239,3.3653,15.3157,13.3386,492
-0.1225,-9.7647,1.1167,1.4763,-9.7647,2.7975,12.0253,8.1186,493
-1.3397,-10.0667,-0.1554,0.8394,-10.0667,0.9164,6.3998,5.0644,494
-5.0225,-9.0772,2.8167,5.9249,-9.0772,6.2924,54.0937,24.1691,495
-47.6011,-10.007,8.9523,42.3668,-10.007,18.8062,71.8329,58.6867,497
-5.7774,-9.4843,-1.6189,2.046,-9.4843,3.5211,41.6304,33.5468,498
-20.3864,-9.6312,20.3449,25.1807,-9.6312,21.095,43.0153,36.8047,499
-7.3301,-9.7743,0.4018,2.1747,-9.7743,4.0099,16.7962,7.8522,500
-4.0765,-9.7976,2.1368,4.4989,-9.7976,2.7177,13.1052,10.8805,501
-0.7765,-9.7997,4.2308,5.4105,-9.7997,7.1187,17.6,11.0606,502
-1.4947,-10.3344,1.9724,2.2507,-10.3344,2.4873,11.1606,8.8295,503
-0.2987,-9.8097,9.8405,8.9111,-9.8097,7.4373,20.2011,14.3766,504
-3.7456,-9.9761,0.117,1.8226,-9.9761,1.3206,6.3548,4.6761,505
-1.1254,-9.9005,0.5174,1.0668,-9.9005,2.7785,7.5898,5.2452,506
-0.564,-9.948,0.2806,0.618,-9.948,2.1758,9.8671,4.3682,507
-4.9324,-9.9974,0.7787,2.0432,-9.9974,3.6939,12.8453,6.623,508
-3.2132,-9.9233,0.5961,1.2858,-9.9233,3.7555,10.8968,6.7558,509
-1.9253,-9.9991,0.6624,1.5925,-9.9991,3.1857,10.8695,7.0955,510
-4.449,-9.9816,2.4457,3.2692,-9.9816,6.4515,16.2238,11.0202,511
-1.1214,-9.9347,0.6176,1.1671,-9.9347,3.3111,12.1424,6.7537,512
-0.3155,-9.9933,0.8936,1.3393,-9.9933,3.1656,10.8214,5.5163,513
-0.9931,-9.8928,0.4632,1.1009,-9.8928,2.357,8.7227,4.6133,514
-0.1989,-10.0387,0.2605,0.5125,-10.0387,1.4854,9.7706,6.9606,515
-2.062,-9.9271,1.8795,3.3384,-9.9271,4.0076,14.7914,10.8073,516
-1.5926,-9.8602,2.9475,3.8352,-9.8602,2.709,11.6216,9.2457,517
-1.3871,-9.9157,5.4652,5.2774,-9.9157,11.0246,26.7848,20.2158,518
-0.6072,-9.8157,2.0485,2.0186,-9.8157,4.6679,15.0292,11.0257,519
-1.2476,-9.9032,0.893,1.7927,-9.9032,3.4588,11.1451,4.5628,520
-1.6667,-9.9446,0.5342,1.4464,-9.9446,0.5641,16.9685,13.4337,521
-0.1232,-10.0622,0.523,0.577,-10.0622,1.5365,21.4515,14.8914,522
-0.0604,-10.0593,0.8208,0.6666,-10.0593,1.2099,17.7914,5.9382,523
-0.1435,-9.751,0.5502,0.6026,-9.751,1.104,7.7021,3.4871,524
-0.6571,-9.9122,0.272,0.7987,-9.9122,2.4256,6.1785,4.1992,525
-4.2154,-9.7437,0.7752,3.1806,-9.7437,3.4007,25.952,16.9,526
-3.4545,-9.9558,3.6418,5.5386,-9.9558,6.4444,23.5775,13.0289,528
-5.0549,-10.0386,0.9265,2.9373,-10.0386,3.8281,27.5337,11.078,529
-8.3647,-9.7952,5.087,8.7062,-9.7952,10.2388,26.2646,19.4862,530
-0.8364,-9.9315,2.104,2.7206,-9.9315,3.4823,14.2561,12.3499,531
-1.3273,-9.9635,2.2593,2.1582,-9.9635,4.6224,16.5035,9.4874,532
-3.3578,-9.1565,0.438,2.1826,-9.1565,2.2759,12.9984,9.5303,533
-3.8464,-9.4983,0.1962,2.6224,-9.4983,3.5663,18.1658,9.1964,534
-3.449,-10.0651,2.2851,3.2178,-10.0651,5.7738,20.7017,15.9011,535
-2.5175,-10.6856,0.1938,2.0769,-10.6856,1.0619,21.9872,9.3991,536
-8.7183,-9.8454,3.7144,9.2377,-9.8454,8.6607,33.8974,9.8343,538
-4.8552,-9.9033,1.901,3.8214,-9.9033,4.0308,14.314,7.235,539
-9.2762,-9.8724,0.3685,3.1694,-9.8724,3.7771,14.8815,6.6323,541
-4.0722,-9.8871,4.3146,5.5621,-9.8871,6.7894,19.5915,11.9211,542
-7.7195,-9.7959,2.0143,3.7402,-9.7959,4.6256,14.9651,8.864,543
0.3839,-9.5818,1.4608,1.0456,-9.5818,2.3072,9.1936,5.4551,544
-1.0203,-10.0139,1.1431,2.0903,-10.0139,3.1205,10.1285,4.946,546
-1.5134,-9.6898,0.8097,2.0804,-9.6898,4.1658,10.7157,9.2559,547
-1.6855,-9.776,0.1931,1.2154,-9.776,2.7039,18.0814,9.9183,548
-0.5391,-10.1758,-0.027,0.2215,-10.1758,0.6389,4.5008,2.887,549
-0.8295,-9.8912,2.5779,2.6406,-9.8912,5.5299,17.5419,10.7962,550
-1.6291,-9.7716,3.9025,4.1936,-9.7716,5.6589,38.5711,17.8955,551
-19.6081,-10.0822,3.0379,10.0733,-10.0822,9.1593,49.738,38.9363,552
-8.0286,-9.9789,16.4484,20.4187,-9.9789,16.1827,38.1623,32.9473,553
-11.1992,-10.1947,6.5092,8.8689,-10.1947,10.5994,62.5406,35.3582,554
-4.6098,-9.9332,9.3971,13.9536,-9.9332,7.4342,63.102,41.7545,555
-1.3267,-9.9825,0.4027,1.0301,-9.9825,2.4584,10.1377,6.8483,556
-3.274,-9.9189,0.8744,2.736,-9.9189,2.9263,17.4396,5.3162,557
-2.725,-9.9707,1.9591,2.8827,-9.9707,5.0843,28.0218,11.07,558
-5.0487,-10.0219,6.7256,8.6572,-10.0219,10.0014,32.6268,26.5802,559
-2.294,-9.8561,1.6588,2.6513,-9.8561,5.1563,24.5916,11.9026,560
-0.7581,-10.078,3.9743,4.6887,-10.078,6.1289,18.1457,14.7812,561
-1.4456,-9.9977,2.2141,4.3561,-9.9977,4.8722,23.3331,7.0804,563
-1.6119,-10.0188,2.5244,4.6082,-10.0188,6.1108,21.8703,7.6311,564
-0.4475,-9.8756,6.4901,7.4569,-9.8756,10.8979,23.1272,18.2527,565
-9.5908,-9.9009,0.2323,4.2209,-9.9009,4.4439,16.5878,6.2987,566
-5.7584,-10.2566,-0.4677,2.7185,-10.2566,2.0636,12.6734,9.3426,567
-4.2167,-10.0641,8.425,12.17,-10.0641,13.1698,32.0665,17.1583,568
-0.7569,-9.7545,3.3347,4.7562,-9.7545,7.159,20.2039,18.9516,569
-2.809,-10.2137,0.1497,1.1698,-10.2137,3.0031,15.444,11.5355,570
-3.2166,-9.97,-0.0982,2.3755,-9.97,3.0092,22.6877,10.7886,571
-0.6909,-9.8782,0.6425,0.8697,-9.8782,2.7522,10.4334,5.101,573
-1.267,-9.8891,0.9265,1.8537,-9.8891,3.6165,12.2028,6.6194,574
-0.6546,-9.8087,0.0324,0.3585,-9.8087,0.9749,5.5056,3.0864,575
0.2291,-9.964,1.35,1.4746,-9.964,0.9392,5.1846,4.0043,576
1.8544,-9.7291,7.8556,6.1561,-9.7291,3.1982,20.9443,17.8053,577
-0.8872,-9.7531,0.5832,0.8362,-9.7531,2.9314,10.3798,7.1573,578
-1.3677,-10.1506,-0.104,0.4963,-10.1506,1.1755,8.4555,4.4288,579
-0.9919,-10.0253,1.1765,1.6118,-10.0253,4.6424,11.8302,9.2105,580
-2.5268,-10.0132,1.6897,3.1258,-10.0132,3.7876,15.032,13.6018,581
-2.4743,-9.8944,1.0814,2.0732,-9.8944,4.3663,14.2509,6.0747,583
1.1409,-9.8773,3.3264,1.6617,-9.8773,1.5098,12.1637,10.6063,584
-1.3922,-9.9916,-0.2658,0.6525,-9.9916,1.4328,11.1794,7.3657,585
-4.5294,-9.9539,-0.0647,2.3087,-9.9539,7.2537,21.8193,14.5007,587
-2.9363,-10.0159,2.902,4.4027,-10.0159,1.7609,13.6126,8.2938,588
1.549,-9.9565,6.024,3.2809,-9.9565,0.9184,13.9327,11.7414,589
-1.0243,-10.0487,5.694,3.8221,-10.0487,11.2982,24.9931,17.7105,590
-2.2181,-9.9643,8.2815,8.5168,-9.9643,12.6329,25.3226,20.6744,591
-0.8621,-10.0793,2.0149,2.1369,-10.0793,2.1658,13.5165,9.1475,592
-1.204,-9.9437,0.6636,1.1301,-9.9437,3.5673,9.4313,6.349,593
-0.9278,-9.9321,2.3367,2.518,-9.9321,5.8505,12.0719,8.9496,594
-1.637,-9.9208,0.4784,1.1033,-9.9208,2.7435,7.1185,4.9833,595
-1.9021,-9.9163,4.6645,5.1461,-9.9163,8.3182,19.3206,14.5041,596
0.0589,-9.7821,0.9888,0.8912,-9.7821,1.2098,8.8889,7.8308,597
-4.1677,-9.9372,2.6457,4.9248,-9.9372,6.8312,30.2489,29.2066,598
-14.5832,-10.0549,7.3687,15.4228,-10.0549,2.7282,35.0836,23.1424,599
-0.3721,-9.9049,3.7651,5.3319,-9.9049,10.4693,20.1009,14.6184,600
-1.0161,-9.9503,6.1419,6.7473,-9.9503,8.7103,15.6514,11.876,601
-1.6327,-10.0599,12.2904,14.4427,-10.0599,13.7254,35.2122,25.3546,603
-5.6421,-9.9374,8.2124,11.3051,-9.9374,8.6744,35.0248,22.2455,604
-1.0112,-10.0324,1.1352,1.7198,-10.0324,2.1315,18.2446,10.0052,605
-0.0011,-9.9197,0.7209,0.8601,-9.9197,3.3363,9.595,4.3627,606
-0.136,-9.998,0.0953,0.1702,-9.998,1.3665,4.6295,2.4904,607
-1.5718,-10.0855,0.8815,2.1433,-10.0855,1.8429,10.2382,4.4897,608
-0.4405,-9.857,0.3198,0.4098,-9.857,0.9146,6.1189,4.3801,609
-0.4881,-9.9968,0.5393,1.2683,-9.9968,1.9915,7.9011,6.8117,610
-0.2421,-9.9002,0.1642,0.2829,-9.9002,0.6744,6.4228,3.3376,611
-0.2186,-9.9822,0.0993,0.3298,-9.9822,0.9594,8.2722,6.6672,612
-5.8651,-10.0525,0.9477,3.9217,-10.0525,5.4423,21.0492,12.1058,613
-14.2861,-9.6805,0.0959,5.7664,-9.6805,3.3255,17.1336,12.4113,614
-3.1069,-9.8832,0.7799,2.7557,-9.8832,4.3994,15.3101,7.6629,615
-2.1107,-9.2154,1.8395,2.1325,-9.2154,2.8269,10.8186,9.0622,616
-1.9088,-10.1169,1.3032,3.226,-10.1169,3.025,11.1669,9.6406,617
0.1331,-10.0388,14.5297,15.7113,-10.0388,10.678,23.9151,18.3326,618
-2.0525,-10.3442,1.4378,3.5135,-10.3442,3.1836,18.0312,15.6632,619
-1.6673,-9.715,3.0464,6.9145,-9.715,6.4908,16.5694,6.9404,620
-2.2926,-10.1297,4.3894,4.0864,-10.1297,8.7797,20.3776,14.7015,621
-1.234,-9.8977,0.8075,1.9318,-9.8977,4.8853,16.7881,8.2716,623
-0.1585,-9.9784,0.6319,0.6759,-9.9784,2.2986,8.5012,5.5906,624
-0.077,-9.9292,0.183,0.2573,-9.9292,1.1105,4.9009,3.5575,625
-0.1861,-9.988,0.0475,0.1995,-9.988,0.7371,4.5844,4.0405,626
0.0462,-9.9668,1.1858,0.8094,-9.9668,1.3347,12.5149,7.9465,627
-0.163,-9.9157,0.4727,0.4671,-9.9157,0.3583,7.5192,5.7099,628
-0.1776,-9.9114,0.8624,0.9531,-9.9114,0.9396,11.3872,9.0097,629
-1.8094,-9.7969,3.3188,3.8166,-9.7969,6.9353,25.7627,20.3784,630
-0.9288,-9.966,0.3656,1.0494,-9.966,2.373,21.2416,19.0739,631
-0.0631,-9.9215,0.8399,0.8882,-9.9215,2.6105,12.4831,8.8442,633
-0.489,-9.8916,0.2656,0.4255,-9.8916,2.0046,14.2921,8.3666,634
0.466,-9.9481,2.9584,1.5313,-9.9481,1.884,16.1116,15.8663,635
-0.2281,-9.919,0.6508,0.701,-9.919,0.7718,6.3361,3.6133,636
-0.7203,-9.96,0.1389,0.4325,-9.96,1.0931,8.0359,3.7905,637
-38.5118,-9.8064,-12.2153,12.7349,-9.8064,4.8506,16.1763,13.3769,638
-7.4553,-9.789,2.6886,6.7512,-9.789,4.0386,10.0846,3.8102,640
-1.3278,-9.7956,0.9855,1.8591,-9.7956,1.1006,3.5099,2.5395,641
-3.2788,-9.7955,-2.8246,0.3241,-9.7955,0.1554,2.9756,2.8755,642
-2.0771,-9.78,-0.37,0.9386,-9.78,0.4899,2.5979,2.3943,643
-0.9707,-9.8001,0.1155,0.6452,-9.8001,0.3918,2.514,2.4339,644
-2.2747,-9.8596,2.2806,2.9527,-9.8596,2.1785,8.1637,3.5648,645
-13.3283,-9.8881,0.0913,4.8766,-9.8881,4.5177,22.5842,10.8577,646
-33.059,-9.8523,0.22,11.89,-9.8523,6.8345,42.709,9.7652,648
-0.1743,-9.9264,2.9445,2.5038,-9.9264,6.4846,23.1695,10.237,649
-0.3345,-10.0204,3.8859,3.7522,-10.0204,3.3104,15.7708,12.7238,650
-2.1151,-9.9075,2.0581,2.9738,-9.9075,1.4082,11.272,5.3864,651
-1.6073,-9.7026,-0.1294,0.7375,-9.7026,2.8798,14.7858,11.2446,652
-0.7356,-10.0255,0.6787,1.0953,-10.0255,1.7149,7.4636,4.2925,653
-0.9738,-10.0246,0.5535,1.4104,-10.0246,2.1461,11.7242,7.7382,654
-1.3,-9.9347,-0.1756,0.4787,-9.9347,1.5219,5.7486,4.5899,655
-7.3181,-9.9421,-1.3263,2.6258,-9.9421,1.9799,6.515,3.7153,656
-8.3375,-9.8534,-1.0076,2.6886,-9.8534,1.9823,5.6058,2.9773,658
-2.8308,-9.8681,-0.4483,1.6495,-9.8681,1.3731,3.2462,2.785,659
-2.3494,-9.8617,-0.9639,1.1299,-9.8617,0.8407,3.0747,2.7033,660
-0.259,-9.8852,-0.1997,0.0444,-9.8852,0.0466,2.4466,2.4175,661
-0.5163,-9.8938,0.051,0.3413,-9.8938,0.3575,2.4624,2.4216,662
-4.524,-9.876,-2.5593,1.3533,-9.876,1.1571,4.5353,3.6604,663
-3.7467,-9.8741,-0.4324,1.2236,-9.8741,1.8914,11.6578,3.8231,664
-2.5633,-9.9076,2.5233,4.4978,-9.9076,4.63,17.275,5.7559,665
-0.2274,-9.9672,0.211,0.4462,-9.9672,1.556,10.5731,7.376,666
-1.9647,-9.9219,1.2172,2.5367,-9.9219,4.1338,17.1844,7.9616,668
-0.5429,-9.9013,0.3311,0.6288,-9.9013,1.8779,7.9388,4.4056,669
-0.5534,-9.6858,-0.023,0.3875,-9.6858,0.7586,8.1848,2.1276,670
-0.9043,-9.907,0.7385,1.4795,-9.907,1.5536,9.5643,8.1513,671
-1.565,-10.0128,0.1854,0.9253,-10.0128,2.5916,14.0505,5.9922,673
-1.0549,-10.4641,-0.0448,1.0264,-10.4641,1.8728,12.0399,8.407,675
-1.8686,-9.4957,0.7556,1.1275,-9.4957,3.4277,9.6931,5.7924,676
-1.7758,-9.8657,0.4505,1.1178,-9.8657,4.0409,11.8712,7.4002,677
-0.0285,-9.9557,4.0042,4.0926,-9.9557,5.6949,17.1233,11.8492,678
-1.4803,-9.9023,1.3044,1.7644,-9.9023,3.4765,12.15,7.4422,679
-0.9853,-10.0033,0.0937,0.5704,-10.0033,2.1671,14.3479,8.4026,680
-0.7915,-9.9518,0.3943,0.6191,-9.9518,0.7025,6.1493,5.728,681
-1.5009,-10.0179,-0.2117,0.7818,-10.0179,1.415,6.8287,4.3037,682
-0.9894,-10.1237,1.8474,3.5418,-10.1237,3.1388,13.8865,13.3606,683
-1.9795,-9.9351,7.1224,6.0546,-9.9351,5.0342,19.0813,13.2502,684
-1.0033,-9.9335,0.6687,1.303,-9.9335,2.9795,14.4911,10.0923,685
-1.5549,-9.4644,2.3741,3.5518,-9.4644,4.767,25.2428,9.6348,686
-0.2416,-10.1366,0.818,1.3729,-10.1366,2.1606,11.7711,6.0136,687
-12.6942,-9.2109,1.1285,4.7085,-9.2109,5.6034,29.119,7.2234,688
-4.378,-9.9121,10.5673,14.1756,-9.9121,11.4426,29.9606,17.2649,689
-0.0069,-9.713,3.5536,3.1547,-9.713,5.0638,11.8044,9.3686,690
-1.9377,-10.0142,-0.0758,1.5249,-10.0142,3.2768,14.6603,13.2899,691
-4.1252,-9.9316,3.8832,5.9398,-9.9316,2.7417,15.4847,13.765,692
-4.4466,-10.0747,4.8243,8.9327,-10.0747,7.5694,23.6416,15.1297,693
-2.1161,-10.2588,-0.1158,2.1707,-10.2588,0.6961,9.6907,5.6892,694
-5.9293,-9.869,-0.9275,4.4005,-9.869,3.2344,12.2514,10.0994,695
-0.702,-9.9227,4.7578,4.1396,-9.9227,5.9633,36.2232,21.1262,696
-18.6856,-9.192,9.8906,17.4657,-9.192,15.1118,44.62,17.7179,698
-1.5196,-9.7919,9.8498,12.0626,-9.7919,9.1346,31.4598,13.7118,699
-3.0455,-9.4802,5.315,12.8639,-9.4802,9.2336,29.9753,22.7594,700
-1.1278,-9.2676,15.4501,20.1327,-9.2676,13.3387,27.1755,25.2602,701
-0.6482,-10.2379,0.1967,0.5108,-10.2379,2.0643,7.7358,5.0274,702
-1.2017,-9.4139,1.0628,1.2349,-9.4139,1.6032,9.7605,5.3176,703
-0.1334,-9.4952,34.2535,30.5325,-9.4952,7.3391,38.4078,29.0974,704
-1.3842,-9.8722,2.3729,3.95,-9.8722,5.0227,15.3504,8.9369,705
-12.1615,-10.0431,15.8914,30.7069,-10.0431,16.3484,52.4371,15.7248,706
-3.7862,-9.827,4.5162,8.333,-9.827,8.5946,27.7177,14.5037,708
-19.3226,-9.9297,6.8711,9.6931,-9.9297,11.7995,23.3571,15.5006,709
-5.3872,-9.9121,-0.8515,2.1892,-9.9121,3.7974,13.7516,10.9929,710
-2.4921,-10.2733,-0.6296,1.0557,-10.2733,1.3307,7.7351,5.6588,711
-1.3193,-9.4929,2.5601,2.3922,-9.4929,5.8426,15.7772,10.6776,712
-5.8876,-8.2905,2.914,4.6375,-8.2905,7.0231,17.6204,15.1566,713
-1.0153,-8.2795,0.1054,1.05,-8.2795,2.5739,28.1943,6.1618,714
-3.6331,-9.7568,1.1382,3.449,-9.7568,4.372,16.1035,8.1072,715
-78.4801,-5.2828,26.0204,61.5818,-5.2828,20.4369,62.8381,27.8355,716
-22.9482,-9.4297,3.6783,9.8755,-9.4297,8.1873,30.325,9.67,718
-28.105,-9.733,0.0218,8.5976,-9.733,7.5695,22.8372,8.1069,719
-7.04,-10.0935,27.0181,26.9154,-10.0935,15.2417,43.5211,30.1155,720
-0.4711,-9.78,3.1822,3.3695,-9.78,4.7651,13.7931,10.8934,721
-3.7539,-9.9009,3.5084,5.3837,-9.9009,6.3462,20.1532,15.4852,722
0.1331,-9.9146,2.4888,2.3911,-9.9146,3.9629,7.191,4.4639,723
-0.6188,-10.0728,6.3402,8.3614,-10.0728,7.5827,17.2928,14.1381,724
-3.1225,-9.903,1.7862,3.4816,-9.903,6.0679,17.8548,11.2284,725
-0.8852,-9.6623,5.0019,6.8362,-9.6623,7.0596,21.124,8.4643,726
-2.078,-7.9559,4.2312,5.5133,-7.9559,5.8323,26.7713,16.3896,727
-3.7374,-9.8109,-0.0304,2.0764,-9.8109,2.7391,16.4358,7.3079,728
-2.0881,-9.506,0.4208,1.2844,-9.506,2.6263,14.1662,5.2125,729
-0.3393,-9.7125,0.5778,1.3121,-9.7125,1.8972,7.2575,2.7465,730
-1.7041,-10.0169,2.66,4.511,-10.0169,2.3669,11.1394,5.7365,731
-2.2849,-10.1099,5.622,8.9856,-10.1099,5.4976,14.7935,13.665,732
-1.1208,-9.8834,2.2202,3.8125,-9.8834,3.6959,12.146,7.0293,733
-1.9036,-10.1659,1.724,2.6446,-10.1659,4.1649,14.858,8.6045,734
-2.7,-9.8685,0.5173,2.6424,-9.8685,2.6641,12.2572,7.6277,735
-1.9104,-10.2036,-0.5684,0.8676,-10.2036,2.8844,5.9706,4.3426,736
-4.7316,-9.8599,3.3854,6.4415,-9.8599,7.6193,21.3958,12.4002,738
-1.7099,-9.9846,3.9091,7.5253,-9.9846,6.879,24.1102,7.6117,739
0.0026,-9.9144,0.6366,0.6051,-9.9144,1.7734,8.2782,7.0142,740
-1.1557,-9.7002,0.5961,1.7582,-9.7002,1.2994,18.0711,15.4873,741
-0.6524,-9.9295,8.239,9.0302,-9.9295,6.2117,24.5169,19.1703,742
-0.6123,-9.9563,0.2608,0.6443,-9.9563,1.1252,9.0952,6.7087,743
-3.4243,-10.0835,9.9248,15.603,-10.0835,8.9027,42.5967,31.9432,744
-2.2477,-10.0235,1.492,2.1145,-10.0235,3.5922,10.6496,7.6386,745
-0.5874,-9.8747,2.0053,2.3998,-9.8747,4.5788,9.5391,6.8886,746
-2.137,-9.9416,0.1078,0.9804,-9.9416,2.1222,8.0292,4.283,748
-1.47,-10.0194,-0.038,1.0253,-10.0194,1.2044,9.6524,6.085,749
0.0884,-9.8395,0.9726,0.8501,-9.8395,2.3627,6.3232,5.2213,750
-0.9312,-9.8783,2.4929,2.4185,-9.8783,5.4048,15.7567,11.8721,751
-0.4166,-10.1796,4.2612,4.0593,-10.1796,3.1215,29.9048,20.7143,752
-4.4355,-9.4175,-1.6318,2.2892,-9.4175,2.6731,13.7632,8.2855,753
-12.2246,-9.9942,9.3304,27.229,-9.9942,11.8153,43.936,19.4835,754
-30.5594,-8.3466,-0.475,21.1345,-8.3466,3.6187,38.1317,18.5156,755
-1.1777,-9.3982,5.6975,8.3192,-9.3982,6.0522,25.2565,19.0505,756
-3.6324,-9.8504,4.0861,5.6598,-9.8504,9.0777,38.0935,13.8924,758
-4.857,-9.9911,0.8458,3.1701,-9.9911,2.1897,11.8642,7.1362,759
-0.4008,-10.0368,3.5832,3.4181,-10.0368,5.1998,16.8748,9.5586,760
-0.3091,-10.0652,1.6636,2.7483,-10.0652,3.9365,13.049,4.7298,761
-1.6904,-9.9146,7.1032,7.1711,-9.9146,9.3428,18.6299,15.1915,762
-1.3349,-9.6908,1.3363,1.815,-9.6908,3.5366,13.1391,11.3127,763
-1.0262,-9.9295,1.4927,1.5537,-9.9295,2.495,6.3513,5.7967,765
-6.0653,-10.0067,5.6358,9.4171,-10.0067,8.9401,21.7238,16.7309,766
-2.1546,-9.8831,2.343,2.8563,-9.8831,5.7214,16.3244,6.1887,767
-2.7683,-9.6765,-0.3184,1.3546,-9.6765,3.3439,10.8642,7.9957,768
-4.5455,-9.8465,0.8819,4.523,-9.8465,4.1538,18.0934,6.9658,769
-0.7429,-10.0233,3.9042,4.9421,-10.0233,7.1756,19.5875,11.3733,770
-0.0762,-9.806,0.483,0.5908,-9.806,1.3288,8.62,4.1081,771
-1.8569,-9.8295,3.2557,3.5495,-9.8295,3.7651,20.9095,13.4592,772
-2.7194,-10.2237,1.7152,4.1352,-10.2237,3.3041,17.2682,13.8566,773
-1.3006,-9.9223,0.272,1.2705,-9.9223,1.7131,9.5581,6.9441,774
-1.9421,-9.9362,0.7994,2.701,-9.9362,1.8386,10.1109,8.2876,775
-1.2612,-9.9731,1.3157,2.1275,-9.9731,5.5952,13.6104,7.952,776
-0.3082,-9.991,1.2203,0.9053,-9.991,1.5081,7.5254,6.4628,777
-2.7685,-9.9512,1.4592,2.2296,-9.9512,4.6478,13.4748,7.2638,778
-2.109,-9.8031,2.5868,4.366,-9.8031,5.6638,20.9823,10.4782,779
-4.7772,-10.5328,0.5814,2.8985,-10.5328,4.4864,23.3868,14.2549,780
0.284,-10.1055,5.9766,4.3417,-10.1055,5.8011,14.2592,9.5703,781
-1.101,-9.8587,1.1253,2.9301,-9.8587,4.5743,19.5556,15.2188,782
-0.8085,-9.814,0.4585,1.161,-9.814,1.4611,14.3335,11.1046,783
-0.3957,-10.0947,0.0607,0.3594,-10.0947,1.1441,13.4973,8.6545,784
-0.5571,-9.8851,-0.0436,0.2813,-9.8851,1.1469,8.0179,5.3822,785
-0.426,-9.7704,0.4337,0.8271,-9.7704,1.6447,10.7679,5.8366,786
-4.6177,-9.6845,0.1329,2.051,-9.6845,1.4481,21.0099,9.0697,787
-0.9732,-9.9594,0.6622,0.9864,-9.9594,2.5676,12.8257,9.4291,788
-1.1627,-9.6839,1.2488,1.6915,-9.6839,1.2834,14.683,6.3425,789
-1.1627,-10.1669,0.2411,0.5851,-10.1669,1.5512,14.0576,4.4028,790
-0.6426,-10.058,0.5274,0.9657,-10.058,1.228,10.7525,5.3805,791
-0.0271,-10.1703,1.0921,1.0649,-10.1703,2.691,7.6783,5.5103,792
0.0254,-9.7103,0.4021,0.3384,-9.7103,1.0499,6.9388,5.3603,793
-0.6732,-9.1944,0.5873,0.8631,-9.1944,1.3285,10.1221,3.9623,794
-6.1418,-10.3207,11.7578,17.5677,-10.3207,15.2234,40.8727,23.5129,795
-3.9127,-9.8747,5.0364,7.1615,-9.8747,6.7961,17.2438,14.2501,796
-3.2766,-9.9491,2.4276,3.1781,-9.9491,6.7527,22.3785,9.0831,798
-3.8033,-9.0444,1.162,3.7609,-9.0444,4.7993,19.8983,8.1017,799
-0.9878,-9.9314,4.0629,3.9567,-9.9314,2.3727,13.0758,9.0461,800
-0.0666,-9.3412,1.4702,2.1381,-9.3412,4.545,10.6716,9.957,801
-0.4091,-10.0843,0.9097,0.9081,-10.0843,1.1258,9.5309,6.8412,802
0.4602,-9.7842,0.9481,0.3297,-9.7842,0.9411,6.9252,4.7407,803
-2.5219,-9.9207,10.7808,8.3838,-9.9207,3.9016,21.8639,16.3989,804
-15.7637,-9.3662,0.2681,8.5977,-9.3662,1.9806,20.4325,11.5093,805
-3.4009,-9.2804,1.9629,3.4023,-9.2804,4.0216,16.0186,8.0829,806
-1.9271,-9.7332,1.637,2.9218,-9.7332,3.6051,13.9536,6.5347,808
-1.1631,-9.9259,4.1192,7.4392,-9.9259,7.9513,17.9035,11.6973,809
-1.0874,-9.6839,3.7177,3.5336,-9.6839,2.0232,12.9445,9.781,810
-3.5482,-10.048,1.3844,3.4118,-10.048,4.1698,8.2526,5.283,811
-1.6343,-9.9941,1.5866,2.1065,-9.9941,3.7632,11.9122,7.8587,812
-1.5517,-8.6849,0.3265,0.9751,-8.6849,1.3524,9.0723,4.4438,813
0.397,-10.1825,20.3937,15.4173,-10.1825,12.5794,26.5418,21.6263,814
-3.0069,-9.6462,1.606,2.7415,-9.6462,4.6149,14.212,7.9015,815
-1.9993,-9.7851,3.9888,5.9851,-9.7851,6.0274,14.0474,11.1647,816
-5.8273,-9.9023,1.5263,2.9516,-9.9023,5.5967,16.0751,8.4534,818
-7.806,-9.7842,1.899,7.0464,-9.7842,5.0131,15.6692,9.4985,819
-3.9619,-10.1437,-0.5042,2.169,-10.1437,5.3292,11.9099,9.9056,820
0.0739,-8.8587,3.3015,2.3375,-8.8587,4.051,15.512,7.9227,821
-7.145,-8.998,7.4028,11.1787,-8.998,5.2671,21.7597,17.3691,822
1.9337,-9.7973,8.2488,4.8977,-9.7973,2.7225,19.3625,17.7897,823
-13.0564,-10.2101,-0.0431,5.7086,-10.2101,8.4315,22.8935,13.9239,824
-3.8678,-10.0076,1.8996,4.5262,-10.0076,6.1258,20.1921,10.4289,825
-0.5466,-9.1984,2.8075,1.7896,-9.1984,2.4688,12.7795,9.6956,826
-7.1552,-9.3133,0.1766,3.3593,-9.3133,4.0558,21.271,8.5168,828
-5.1568,-9.5156,0.5699,3.2517,-9.5156,3.522,19.4499,8.8189,829
-7.9949,-9.3297,3.6993,10.0458,-9.3297,3.6138,18.1041,11.3744,830
-1.8398,-10.1252,2.2128,3.1298,-10.1252,1.4294,14.3236,12.59,831
-0.1067,-10.0003,0.3182,0.4995,-10.0003,0.5133,5.5399,3.547,832
-2.1259,-9.7894,-0.4046,0.9184,-9.7894,1.48,10.5645,6.268,833
-0.0882,-9.906,3.0511,4.7356,-9.906,3.8882,11.4804,10.1232,834
-2.1398,-9.9179,-0.301,0.8121,-9.9179,1.3389,19.026,3.9733,835
-4.3785,-9.5302,1.4677,3.6675,-9.5302,3.2348,15.0628,11.6762,836
-5.4296,-9.185,0.6245,2.3462,-9.185,3.7279,26.9127,9.9536,838
-1.6605,-9.8251,1.0262,1.6342,-9.8251,3.0453,11.9,7.1217,839
-0.7688,-9.916,-0.1182,0.5298,-9.916,0.4838,6.447,4.8292,840
-0.8946,-9.7076,0.0366,0.6171,-9.7076,0.6583,11.2649,10.6867,841
-1.2723,-9.8563,1.453,1.608,-9.8563,2.4709,14.051,9.3598,842
-1.5141,-9.6085,-0.2558,0.5747,-9.6085,0.9579,11.6674,5.2845,843
-0.9952,-10.0097,1.6104,1.7438,-10.0097,1.518,11.7291,9.368,844
-1.1199,-9.9795,2.7429,3.1901,-9.9795,6.1322,16.5095,11.1151,845
-0.8572,-9.8917,1.0765,1.377,-9.8917,2.1121,10.3592,7.836,846
-2.0417,-9.9215,0.3353,0.7848,-9.9215,2.7984,10.6141,5.758,848
-1.0942,-9.8698,0.6777,0.8869,-9.8698,0.7901,9.3557,4.4413,849
-1.812,-10.1714,-0.1225,0.7401,-10.1714,0.9667,10.0245,3.0136,850
-1.42,-9.938,0.0285,0.7791,-9.938,0.7568,8.5465,5.0691,851
0.0178,-9.9893,0.4413,0.3632,-9.9893,0.7488,7.916,5.0446,852
-0.1904,-9.8778,0.1862,0.2929,-9.8778,0.2526,5.4072,4.1198,853
-0.7371,-10.0723,-0.1347,0.4165,-10.0723,1.4959,6.9122,5.7258,855
-0.4105,-9.9334,0.159,0.2945,-9.9334,0.9757,5.3236,3.0561,856
-0.6867,-9.9873,1.3731,1.3637,-9.9873,5.1256,11.9289,7.2252,857
-2.2762,-9.8708,0.2069,0.8993,-9.8708,2.5335,14.3501,9.1567,858
-1.3593,-10.0149,1.5271,2.8258,-10.0149,3.7706,16.8095,8.2504,859
-0.6002,-9.9466,0.0572,0.4012,-9.9466,1.0671,6.9987,4.0759,860
-0.1037,-9.9349,0.0144,0.0658,-9.9349,0.6365,7.9819,7.3898,861
-0.0789,-9.9333,0.0417,0.0998,-9.9333,0.5384,4.9035,3.0107,862
-0.4852,-10.1793,0.9133,1.0409,-10.1793,1.0919,8.2732,5.8808,863
-0.1426,-9.9123,1.2498,1.1811,-9.9123,2.2429,11.3941,8.2549,864
-0.4756,-9.6706,-0.0218,0.2225,-9.6706,0.6282,8.6864,5.3531,865
-1.6327,-10.0021,-0.0805,0.8478,-10.0021,1.0478,12.7972,6.3682,866
-4.7067,-10.2233,-0.3675,2.1073,-10.2233,1.8575,17.4008,5.9378,867
-0.9487,-9.9777,2.0673,3.3406,-9.9777,5.3512,23.883,6.9361,868
-3.4668,-9.8961,2.7105,3.491,-9.8961,6.8459,17.5423,13.2435,869
-4.694,-10.0061,-0.0156,2.2237,-10.0061,1.654,22.041,9.3724,870
-2.5898,-9.8415,0.6237,3.342,-9.8415,5.0203,19.1063,11.7561,871
-0.9889,-10.3672,0.9772,2.1718,-10.3672,2.7348,12.4921,6.3044,872
-0.0024,-10.058,0.6389,0.5298,-10.058,1.3292,6.4181,5.0402,873
-0.1409,-9.7934,0.6355,0.8284,-9.7934,1.6333,10.5826,7.593,874
-0.6763,-10.0393,-0.094,0.2794,-10.0393,0.9902,9.3838,3.8289,875
-0.6618,-9.921,0.7615,1.4075,-9.921,2.7894,11.649,6.1597,876
-0.2657,-10.1054,0.9107,0.982,-10.1054,1.8467,8.3904,5.3319,877
-3.8918,-10.3004,4.4395,6.1562,-10.3004,5.5084,32.3048,16.827,878
-3.3975,-10.0619,2.5559,5.4137,-10.0619,4.3898,23.1862,13.3827,879
-1.5843,-9.9556,0.4391,1.1618,-9.9556,3.5166,21.2613,15.7207,880
-1.3643,-9.326,7.0898,8.4283,-9.326,4.1739,17.212,15.731,881
0.4309,-10.1736,14.398,7.1645,-10.1736,3.5809,38.5899,25.5874,882
-1.7843,-9.7987,3.4831,6.8087,-9.7987,5.6892,26.3996,22.814,883
-0.1134,-10.058,0.0508,0.0957,-10.058,0.9432,7.4523,4.5142,884
-0.1001,-9.9023,2.7136,3.119,-9.9023,4.1992,12.5813,9.1611,885
-0.7548,-9.9378,0.684,1.406,-9.9378,2.5656,12.7675,8.8329,886
-1.6092,-9.93,1.6209,2.5561,-9.93,5.3083,27.493,11.9021,888
-2.2775,-9.9241,1.0426,1.8292,-9.9241,3.0517,14.5579,10.1099,889
-3.5854,-9.9193,-0.535,1.6626,-9.9193,1.0705,11.8288,10.0964,890
-3.2507,-10.3196,-0.078,2.0123,-10.3196,2.7655,32.6782,26.361,891
-4.5886,-11.4023,21.0931,18.8134,-11.4023,18.7192,67.1359,52.5329,892
-0.8189,-10.0178,8.9643,6.8483,-10.0178,2.8288,31.0165,20.1339,893
-0.7708,-10.0008,4.4868,4.8166,-10.0008,4.3397,13.5073,11.9454,894
-0.5897,-9.9123,1.4271,2.3086,-9.9123,3.0269,10.437,5.943,895
-0.3399,-8.9248,0.4342,1.1209,-8.9248,2.9119,12.8161,6.8388,896
-2.1219,-9.8309,0.1424,1.0726,-9.8309,1.7608,15.6545,7.4883,898
-0.8956,-9.9682,0.1857,0.7772,-9.9682,1.5941,10.4757,3.5581,899
-0.1742,-10.0087,0.1898,0.4577,-10.0087,0.942,4.8371,3.7997,900
-0.0511,-9.5574,0.0255,0.1253,-9.5574,0.7288,8.3646,7.7098,901
-0.1335,-9.9899,0.0639,0.1998,-9.9899,0.8701,4.7196,4.1237,902
-0.1897,-9.9206,0.0567,0.1463,-9.9206,0.8003,4.4952,2.643,903
-0.1167,-9.6827,0.2208,0.4131,-9.6827,0.9157,4.0057,1.8977,904
-0.9963,-9.9255,-0.0379,0.7075,-9.9255,0.8101,13.4009,4.4949,905
-25.1112,-9.8927,-4.1488,7.5434,-9.8927,3.2031,11.6683,6.46,906
-7.2402,-9.8322,-5.0341,1.8514,-9.8322,0.946,5.7494,4.633,907
-4.6917,-9.8079,-0.637,1.6428,-9.8079,1.0501,3.529,2.4376,908
-0.3785,-9.8298,0.4359,0.4049,-9.8298,0.3201,2.5502,2.4302,909
-0.3324,-9.84,-0.1002,0.1318,-9.84,0.1201,2.5281,2.3595,910
-0.3846,-9.8439,0.0639,0.2132,-9.8439,0.1795,2.422,2.3798,911
-2.4897,-9.8326,-2.1738,0.257,-9.8326,0.2608,3.2253,3.0623,912
0.5511,-9.8353,3.3537,2.7225,-9.8353,1.736,6.5519,3.8211,913
-4.1854,-9.9011,0.0338,2.1756,-9.9011,4.2636,15.5506,11.775,914
-7.1586,-9.8903,-1.3408,2.2066,-9.8903,6.3563,13.8114,4.8625,915
-0.5265,-9.8772,0.259,0.355,-9.8772,0.4763,2.002,1.9737,916
-0.1357,-9.8954,0.3122,0.3972,-9.8954,1.4905,3.8833,2.7675,918
-0.0992,-9.8974,-0.0344,0.0187,-9.8974,0.1458,2.5342,2.4666,919
-0.0494,-9.8993,-0.0395,0.0057,-9.8993,0.0353,2.5243,2.4956,920
-0.0442,-9.8981,-0.0331,0.0083,-9.8981,0.0304,2.5144,2.4964,921
-0.0825,-9.8999,-0.0632,0.0148,-9.8999,0.1312,2.6016,2.5291,922
-0.0626,-9.8981,-0.0341,0.0145,-9.8981,0.1421,2.5396,2.5263,923
-90.5958,-9.5451,-51.4914,22.7868,-9.5451,7.6988,80.6722,71.1484,924
-16.3746,-9.8881,2.1016,6.3004,-9.8881,4.1225,20.6281,7.8781,925
-22.2349,-9.8493,-12.6693,4.7041,-9.8493,2.0209,14.6514,9.8455,926
-3.1201,-9.8106,0.1937,1.4135,-9.8106,0.8412,3.6466,2.475,928
-6.7688,-9.8126,0.0308,3.6542,-9.8126,2.1046,11.8334,3.3577,929
0.1044,-9.7359,5.7611,3.2597,-9.7359,1.9589,21.0657,11.3677,930
-4.8647,-10.1765,4.7226,5.6069,-10.1765,4.3141,14.9554,13.158,931
-12.8994,-10.2417,12.2605,14.158,-10.2417,2.7589,50.2924,33.6503,932
0.0432,-9.8169,0.751,0.6946,-9.8169,1.0916,4.9125,3.0662,933
-1.4798,-9.9879,-0.0695,1.0382,-9.9879,1.3196,7.3267,5.3342,934
-0.185,-10.0017,1.346,1.6365,-10.0017,3.1658,14.2632,8.7628,935
-1.2968,-9.3952,0.9562,1.5035,-9.3952,2.2544,13.3488,9.7038,936
-2.6117,-9.8743,0.3444,0.7764,-9.8743,1.909,11.1479,6.4939,938
-1.2683,-10.0079,2.0556,3.1859,-10.0079,4.5412,14.3651,8.7438,939
-0.3193,-9.6834,0.2095,0.5595,-9.6834,1.2446,8.7364,5.2991,940
-0.8922,-9.9292,-0.2134,0.4117,-9.9292,0.7208,7.6174,6.238,941
-7.1446,-10.1067,1.7271,4.1457,-10.1067,2.3289,24.7468,16.4568,942
-0.3288,-9.9481,1.6175,1.8053,-9.9481,4.8434,16.4093,15.1042,944
-5.8265,-10.0673,1.1284,3.6714,-10.0673,3.5795,16.8732,10.3056,945
-2.9668,-9.7482,0.4656,2.358,-9.7482,4.0477,20.3705,13.5589,946
-1.4142,-9.921,0.5681,1.6358,-9.921,2.0794,10.3126,7.0328,947
-0.4614,-9.9008,0.1431,0.4543,-9.9008,0.9055,7.258,4.973,948
-1.2204,-9.8392,0.04,0.4263,-9.8392,0.9954,7.1221,3.0748,949
-0.2082,-10.3066,-0.0171,0.1224,-10.3066,0.742,14.0365,7.3574,950
-4.7183,-9.9903,1.398,5.1532,-9.9903,1.9845,12.419,8.0698,951
-3.4669,-9.7226,3.0174,3.7146,-9.7226,1.6461,16.1161,13.1707,952
-1.8303,-10.0322,0.2411,1.5667,-10.0322,1.2604,14.904,14.1909,953
-6.4258,-10.4693,4.7323,8.1632,-10.4693,2.1651,29.4829,17.5485,954
-14.7307,-9.5481,-9.2349,4.9153,-9.5481,2.0808,13.546,11.5946,955
-2.9459,-9.9256,-0.0927,0.8828,-9.9256,2.7414,7.5721,2.8302,956
-9.6164,-9.8832,-4.1533,2.7975,-9.8832,2.1359,15.1301,11.5368,957
-4.6811,-9.8648,2.634,3.5976,-9.8648,2.9044,16.4685,12.0997,958
-35.7409,-9.7625,-10.0443,10.8483,-9.7625,4.9342,16.2542,6.2505,959
-5.2739,-9.7496,0.5533,2.6333,-9.7496,1.4416,5.5608,3.3665,960
-1.7706,-9.7982,6.0028,4.2618,-9.7982,2.2356,10.197,4.8848,961
-3.5752,-9.9379,3.5346,6.151,-9.9379,4.565,24.6346,9.6549,962
-3.1489,-10.3663,12.242,14.1215,-10.3663,9.9092,25.4783,15.4571,963
-19.0928,-9.7989,23.0065,32.6779,-9.7989,19.8909,48.2788,33.2155,964
-2.4037,-9.8698,6.6232,7.8301,-9.8698,7.0568,36.3845,29.8044,965
-6.1062,-9.3951,-0.0491,2.3754,-9.3951,3.2119,16.6068,8.3724,966
-0.0365,-9.9877,6.4509,6.4416,-9.9877,8.2648,24.8064,13.4544,967
-1.789,-8.5272,1.1689,3.7271,-8.5272,2.0898,16.5574,8.6865,968
-11.5767,-8.2219,0.8077,5.247,-8.2219,5.1178,16.4487,11.0573,969
0.4619,-9.5525,15.4659,13.5846,-9.5525,12.3099,28.8004,24.4446,970
-3.8968,-9.9409,10.2152,14.5264,-9.9409,8.1378,37.9552,11.7934,971
-5.396,-9.9694,2.9725,5.7943,-9.9694,6.6657,19.2845,11.7961,973
-3.3629,-9.9041,4.3695,5.9536,-9.9041,7.1822,24.7624,11.7121,974
-4.6709,-9.6988,0.8125,2.0387,-9.6988,2.998,22.2675,7.0663,975
-3.7623,-10.5086,1.6893,3.5524,-10.5086,3.2801,16.6025,7.6469,976
-1.0006,-9.7713,2.0312,2.3484,-9.7713,1.5588,27.2941,11.2035,977
-0.4266,-9.8684,0.4426,0.8678,-9.8684,2.3699,14.65,7.7293,978
-1.8139,-10.4352,0.3621,1.577,-10.4352,1.2707,8.9078,6.7987,979
-1.4945,-9.8796,0.6355,1.6303,-9.8796,1.9921,8.0206,6.6505,980
-6.0511,-10.1435,0.2943,2.5818,-10.1435,2.9504,10.2964,6.6472,981
-1.3798,-9.8866,0.4213,1.1949,-9.8866,2.6042,15.2255,6.1181,983
-1.9424,-9.822,0.8805,1.8453,-9.822,2.6868,13.633,8.1718,984
-1.3255,-9.9973,-0.019,0.8185,-9.9973,1.2347,11.6987,6.7499,985
-40.3864,-9.7109,-0.2585,19.464,-9.7109,4.7536,33.6284,22.6959,986
-16.8315,-9.879,-4.2293,5.4346,-9.879,4.3276,23.8242,10.3722,987
-5.2503,-9.9129,-0.854,2.0332,-9.9129,3.1695,7.4698,3.3886,989
-6.128,-9.8307,-2.7126,1.7924,-9.8307,1.2777,4.7522,2.717,990
-1.5965,-9.8285,-0.7892,0.504,-9.8285,0.3358,2.6088,2.438,991
-0.8265,-9.8399,-0.442,0.1801,-9.8399,0.14,2.4811,2.408,992
-1.6354,-9.8388,-1.4449,0.1589,-9.8388,0.124,2.6884,2.6298,993
-1.6299,-9.8382,-1.0964,0.3416,-9.8382,0.2605,2.6235,2.5297,994
-12.6773,-9.8473,0.9772,7.1279,-9.8473,4.6132,8.2021,5.094,995
-1.9867,-9.8734,-0.7169,1.0056,-9.8734,1.0209,3.3118,2.5745,996
-22.0875,-9.7226,-4.0485,8.9272,-9.7226,4.9706,12.787,7.837,998
-29.3661,-9.729,-9.3668,9.0044,-9.729,3.8357,12.6463,8.8865,999
-464.378,-8.9851,-79.9812,132.2252,-8.9851,17.9624,90.6545,38.7011,1000
-8.0772,-9.4268,30.1736,41.789,-9.4268,13.9253,56.765,34.7265,1001
-30.3548,-9.9428,-15.5789,11.3336,-9.9428,2.5852,18.2461,12.85,1002
-13.7938,-9.8209,-1.5934,6.0269,-9.8209,4.7116,29.5909,21.8078,1003
4.8095,-9.9323,7.7097,1.7552,-9.9323,1.0457,26.3932,25.2573,1004
-14.9094,-9.893,-3.2113,6.0341,-9.893,3.2792,9.6875,5.0911,1006
-22.572,-9.5751,-5.5836,9.6491,-9.5751,4.3501,10.7659,4.9596,1007
-15.6152,-9.6771,-6.9981,4.3069,-9.6771,2.7028,13.498,10.3023,1008
-16.8201,-9.4421,0.7989,12.604,-9.4421,6.3918,10.0641,5.8466,1009
-314.6435,-8.2885,-21.5794,87.8091,-8.2885,30.1292,101.4963,18.9147,1010
-25.6082,-9.0397,22.0208,34.3785,-9.0397,12.6717,67.0595,22.1631,1011
-18.8026,-9.7225,-10.2879,5.6284,-9.7225,2.8883,9.2064,6.368,1013
-6.1354,-9.6117,4.1537,7.7469,-9.6117,3.0864,11.4926,6.1852,1014
-2.3624,-9.7569,0.2922,1.6943,-9.7569,0.7326,9.7885,6.0051,1015
-15.4335,-9.4124,-7.6553,5.7679,-9.4124,2.0379,8.7814,8.241,1016
-6.8776,-9.7164,1.0454,5.8266,-9.7164,2.1367,9.4716,3.9299,1017
-4.1341,-9.8016,-1.3971,1.3247,-9.8016,0.6039,5.5084,4.5459,1018
-2.6924,-10.0832,2.7138,3.8181,-10.0832,2.0338,8.0717,5.1352,1019
-10.8756,-9.8243,1.5922,7.1871,-9.8243,4.6088,13.5595,5.6299,1020
-16.0836,-9.4409,-10.76,2.8314,-9.4409,1.019,17.807,16.8309,1021
-5.0301,-9.7886,2.4662,4.2883,-9.7886,2.2225,15.7766,5.3317,1023
1.6527,-9.9159,6.2602,3.2655,-9.9159,2.2599,8.3755,7.2137,1024
-2.2961,-10.1694,0.1573,1.0759,-10.1694,1.4651,9.5515,7.0369,1025
-20.5332,-9.7538,0.9952,14.8617,-9.7538,6.4957,13.8878,8.0171,1026
-12.731,-9.7912,-3.3567,4.9561,-9.7912,3.2881,17.2006,9.181,1027
-10.9784,-9.8321,-4.0252,2.6391,-9.8321,1.3595,7.4969,4.1274,1028
-12.3123,-9.8554,8.8931,14.935,-9.8554,12.4107,24.8165,14.493,1030
-14.3731,-9.9364,3.1754,12.8745,-9.9364,8.1127,27.174,10.5054,1031
-1.317,-10.0044,1.1002,1.8674,-10.0044,3.9617,25.3634,18.5255,1032
-1.5137,-9.758,0.3702,1.3961,-9.758,2.6083,10.0919,4.0598,1034
-4.6156,-10.0164,0.4988,3.2282,-10.0164,2.7297,46.8042,36.401,1035
0.2647,-9.9693,7.3828,6.9504,-9.9693,4.4459,42.0149,28.6855,1036
-1.9407,-9.9556,-0.3225,0.7081,-9.9556,1.6716,18.3053,14.3631,1037
-0.8142,-10.4969,0.5263,1.0247,-10.4969,2.6918,7.2072,5.0931,1038
-4.8957,-9.2845,0.6515,1.9564,-9.2845,3.4479,16.6129,6.618,1039
-1.7376,-10.0798,2.2769,3.314,-10.0798,5.3333,16.1861,8.6604,1040
-3.6453,-10.2853,3.7586,7.2376,-10.2853,8.5663,20.3113,15.9479,1041
-6.7157,-9.6054,6.8911,9.9124,-9.6054,1.0434,23.4419,16.7384,1042
-0.8493,-9.5489,4.8859,4.0907,-9.5489,1.7866,20.0194,17.4326,1043
-19.4557,-9.3282,39.6272,66.0702,-9.3282,18.0742,84.736,65.9861,1044
-9.3459,-8.8018,5.2075,9.859,-8.8018,2.8081,25.6336,21.6526,1045
-7.4982,-9.9913,1.7149,4.158,-9.9913,7.1146,16.9648,10.1318,1046
0.1097,-10.2553,17.8335,16.0605,-10.2553,11.961,26.8147,24.257,1047
-2.3911,-9.9269,5.5771,6.7481,-9.9269,4.6195,20.1963,12.3128,1048
-13.6594,-9.753,1.0048,6.6678,-9.753,8.1309,21.7297,13.5879,1049
-7.2986,-10.4206,2.5206,7.4555,-10.4206,6.2113,16.5981,7.8421,1050
-2.7247,-10.123,18.5603,24.0473,-10.123,11.6301,26.4363,21.0708,1051
-16.7469,-9.3436,-1.8143,4.8048,-9.3436,5.7038,18.6307,11.0314,1052
-2.9582,-8.2569,18.0909,13.3347,-8.2569,8.6849,25.1391,16.6827,1053
-5.6324,-9.6208,0.9659,4.7019,-9.6208,1.7745,9.1725,8.0864,1054
-0.4585,-9.9503,14.717,14.4472,-9.9503,8.5482,28.925,21.7079,1055
-3.2766,-9.6704,4.4826,9.8552,-9.6704,8.3329,20.7058,10.1928,1056
-3.5917,-10.3205,3.3854,4.8946,-10.3205,6.7215,14.1192,9.4891,1057
-2.1331,-9.861,4.2978,5.4071,-9.861,5.9732,13.4097,9.8772,1058
-2.4683,-9.9794,1.1707,2.8606,-9.9794,3.6499,11.7795,6.2414,1059
-0.684,-10.2038,0.9529,1.5497,-10.2038,1.0109,12.3532,6.5742,1060
-0.3364,-10.3358,0.346,0.7192,-10.3358,1.4492,7.0447,5.5588,1061
-2.3612,-10.1007,1.979,3.4118,-10.1007,1.2829,12.1285,6.1868,1062
-1.1976,-9.7024,0.1074,0.994,-9.7024,1.2909,12.4182,4.3468,1063
-0.4187,-9.8921,0.3321,0.5093,-9.8921,1.2402,8.0333,4.5537,1064
-1.2723,-9.804,0.2002,0.9347,-9.804,0.8822,7.3195,5.7312,1065
-1.0452,-10.1381,0.2007,0.4412,-10.1381,1.1599,9.3528,4.3528,1066
-3.0573,-9.7749,0.5208,2.2601,-9.7749,3.1274,11.1018,7.3686,1068
-1.601,-9.9015,1.5704,3.0639,-9.9015,4.9009,14.8009,10.8054,1069
-1.046,-10.6883,1.0911,1.5089,-10.6883,0.9991,18.5523,10.042,1070
-2.407,-9.4278,3.9172,6.3495,-9.4278,5.2423,13.5642,10.8565,1071
-0.3879,-10.3522,3.1086,3.6682,-10.3522,1.1371,11.863,10.3215,1072
-4.3568,-9.515,0.4092,1.9588,-9.515,2.5865,23.1467,5.6779,1073
-0.294,-9.9186,0.4568,0.7234,-9.9186,2.5929,10.5579,7.1815,1074
-0.2155,-9.8312,2.2196,2.1717,-9.8312,5.46,16.7238,10.6271,1075
-1.9858,-10.1303,0.3063,1.925,-10.1303,3.1318,7.9519,7.175,1076
-2.4388,-9.8091,1.0368,2.3929,-9.8091,4.5577,17.3437,9.1383,1078
-2.449,-9.982,0.3737,1.6039,-9.982,4.2391,14.1699,7.5164,1079
-1.0531,-10.2543,1.4086,1.9239,-10.2543,2.8244,10.9645,7.4876,1080
-0.1411,-10.0171,0.6221,1.2318,-10.0171,2.2929,8.4497,6.9731,1081
-0.7368,-9.9359,0.069,0.556,-9.9359,1.1358,5.5656,3.1528,1082
-0.9909,-9.9232,-0.0006,0.4423,-9.9232,1.1587,7.2369,5.0922,1083
-1.664,-9.8468,0.8387,1.4052,-9.8468,0.5236,8.0903,7.0849,1084
-2.8463,-9.7863,3.8292,4.5617,-9.7863,4.6067,19.5946,15.3419,1085
-2.328,-9.9808,0.6019,2.0391,-9.9808,2.9714,13.9998,11.2013,1086
-4.2989,-10.3541,16.2165,16.4931,-10.3541,15.5294,60.0751,38.4468,1087
-2.2605,-9.884,2.9087,5.0915,-9.884,4.7812,19.7817,11.2646,1088
-8.6253,-9.8951,3.4958,7.4839,-9.8951,9.8229,33.9293,25.4673,1089
-9.7989,-10.0318,-1.823,4.3941,-10.0318,1.8158,12.2455,10.1031,1090
-5.0937,-9.8496,3.5973,9.3225,-9.8496,6.5276,31.9369,29.0562,1091
-1.5686,-9.1298,2.6756,4.2136,-9.1298,1.7062,25.1709,20.1201,1092
0.0056,-9.0262,2.0834,1.8286,-9.0262,1.7053,17.013,14.7745,1093
-1.1619,-9.7708,2.0576,4.2359,-9.7708,2.6853,10.0568,8.4888,1094
-2.7425,-9.6433,0.3419,1.4723,-9.6433,1.9886,17.9678,6.573,1095
-0.2874,-9.4467,5.0187,3.8246,-9.4467,7.9461,20.4799,11.9703,1096
-9.144,-9.8678,4.3665,8.4864,-9.8678,9.3237,25.4925,11.8088,1098
-4.2883,-9.9413,2.3053,4.5503,-9.9413,2.9153,29.0366,10.1062,1099
-1.1762,-9.8866,0.0764,0.6176,-9.8866,0.6244,5.9862,4.3026,1100
-5.0453,-10.1757,6.7783,8.8347,-10.1757,2.8964,18.7955,14.6274,1101
-0.6135,-9.8867,0.0035,0.2928,-9.8867,0.9595,8.8245,7.2409,1102
-0.6253,-10.0308,2.1276,2.0051,-10.0308,1.4414,8.1021,6.9847,1103
-0.9243,-9.9769,0.2607,0.7699,-9.9769,1.408,6.9876,5.0801,1104
-20.9358,-9.8971,-2.7946,7.214,-9.8971,2.5119,12.4308,7.2452,1105
-25.0558,-9.7455,-17.777,5.2651,-9.7455,0.6918,11.4025,10.6112,1106
-4.9978,-9.8607,0.3316,3.5778,-9.8607,3.0291,7.7433,2.9061,1108
-4.2548,-9.8703,-0.4622,1.7577,-9.8703,1.6105,6.2314,2.6355,1109
-9.4505,-9.8586,-1.9571,4.3985,-9.8586,3.2007,6.3242,3.762,1110
-1.7097,-9.8569,-0.9878,0.4405,-9.8569,0.2941,2.6158,2.5193,1111
-0.5253,-9.8411,0.5015,1.1083,-9.8411,0.6956,2.9407,2.3327,1112
3.3689,-9.8601,5.8962,1.1867,-9.8601,1.3291,6.5642,5.5834,1113
-6.779,-9.9027,-4.2275,2.4662,-9.9027,1.1057,9.7225,9.2325,1114
-0.1237,-9.878,0.5637,0.5657,-9.878,0.6157,2.9044,2.4275,1115
3.8287,-9.8976,4.8524,1.2056,-9.8976,1.2178,12.4858,10.0905,1116
-8.4876,-9.9406,1.9688,5.98,-9.9406,2.7655,13.417,11.825,1118
-129.6389,-8.7974,-39.1694,59.4078,-8.7974,29.748,83.1067,51.9859,1119
-37.6891,-9.674,-24.9105,14.1185,-9.674,4.9276,25.8805,22.6534,1120
-22.0006,-9.7997,0.8876,12.333,-9.7997,9.8429,30.4727,19.1741,1122
-4.78,-9.9425,6.0035,5.5218,-9.9425,5.1462,23.0997,22.0544,1123
-3.9697,-9.9361,-0.2423,2.2224,-9.9361,4.9137,22.6468,12.4777,1124
-28.6308,-9.9774,-1.3526,11.8478,-9.9774,9.1187,37.4683,14.4108,1125
-4.1626,-9.9068,0.8996,2.3006,-9.9068,3.2074,16.9282,6.2668,1126
-0.0807,-9.9305,1.0427,1.3491,-9.9305,4.3476,20.9987,3.7351,1127
-0.8138,-9.9765,0.1521,1.1642,-9.9765,2.4034,16.6561,14.3643,1128
-0.9133,-9.6363,1.0734,2.142,-9.6363,1.2291,18.814,16.5747,1129
-1.3106,-10.0429,0.0747,0.9705,-10.0429,0.88,12.4737,7.098,1130
0.2983,-9.9091,6.0762,3.6008,-9.9091,2.8993,29.123,18.1747,1131
5.5969,-9.8133,11.6855,4.5162,-9.8133,2.5338,31.3653,19.1007,1132
-2.2654,-9.9142,0.36,1.0862,-9.9142,3.1452,22.9289,8.8752,1133
-1.5994,-9.9445,1.0509,2.4181,-9.9445,4.102,25.4139,12.8188,1134
-0.8389,-9.9192,-0.0907,0.31,-9.9192,0.733,8.3377,3.959,1135
-3.3673,-9.9159,-2.6,0.5962,-9.9159,0.4572,6.3135,5.168,1136
-14.0012,-9.8222,-10.2244,3.5131,-9.8222,1.0772,8.9974,8.3034,1137
-0.682,-9.8729,1.1432,1.4591,-9.8729,1.5037,4.1208,2.66,1138
-5.0727,-9.8334,-3.3895,1.1964,-9.8334,0.8685,4.2152,3.3632,1139
-2.749,-9.8267,0.4474,2.3055,-9.8267,1.7421,3.5041,2.8115,1140
-2.6603,-9.9007,2.3539,5.4965,-9.9007,6.7777,14.3906,5.5329,1141
-3.8063,-9.9016,-1.0454,2.2056,-9.9016,1.7121,12.0067,10.6837,1142
-1.8214,-9.9763,4.0702,4.2982,-9.9763,3.586,15.2032,10.3388,1143
-1.7544,-9.9529,0.3088,1.3183,-9.9529,1.9485,10.0573,6.5904,1144
-4.6278,-9.7976,-0.8373,1.5672,-9.7976,2.401,10.2195,6.84,1145
-1.138,-9.9895,0.0712,0.8434,-9.9895,1.7023,8.275,4.5625,1146
-0.9462,-9.9668,0.1081,0.6239,-9.9668,1.4884,9.1964,6.1383,1147
-6.5564,-9.994,-1.7063,2.0382,-9.994,2.0308,10.6929,6.367,1148
-9.701,-9.9064,-2.2676,4.1903,-9.9064,3.7968,11.3584,7.7288,1150
-29.4003,-9.829,-9.2841,11.2701,-9.829,6.773,22.427,17.8616,1151
-35.1921,-9.602,-26.7205,6.2115,-9.602,1.0742,24.813,22.9425,1152
-0.7312,-9.5665,2.2219,1.6833,-9.5665,0.7168,22.5524,18.0198,1153
-5.4588,-9.6328,-3.8219,0.9971,-9.6328,0.3336,3.5077,2.901,1154
-3.4489,-9.5336,-1.6703,0.9085,-9.5336,0.2983,2.6052,2.4437,1155
-3.2932,-9.5469,-1.5065,1.6502,-9.5469,0.5932,3.0677,2.6657,1156
-2.6644,-9.5562,0.2177,3.1158,-9.5562,1.0982,4.6948,2.4737,1158
-10.4412,-9.6466,3.5101,8.4154,-9.6466,3.4148,15.8597,10.2093,1159
-3.6921,-9.6769,5.8608,6.9221,-9.6769,3.2258,21.0335,15.7062,1160
-5.8542,-9.8306,0.4724,4.4254,-9.8306,2.746,30.3234,27.451,1161
-4.3835,-9.6778,0.7525,3.7946,-9.6778,1.8627,29.6125,27.9845,1162
0.2634,-9.8423,1.8986,1.6614,-9.8423,1.5967,16.4749,6.9373,1163
-1.4233,-10.2512,0.1282,0.6841,-10.2512,1.0991,17.7075,16.3643,1164
-11.6062,-9.9033,-3.7875,5.7292,-9.9033,5.6338,39.1983,26.8497,1165
-6.1611,-9.9211,-1.9914,2.6587,-9.9211,2.3837,33.6875,29.3575,1166
-23.8717,-9.8307,3.4847,8.2551,-9.8307,4.2788,20.6946,10.8768,1168
-24.2388,-9.7658,-5.7534,8.2247,-9.7658,4.4378,28.4478,13.3435,1169
-23.7059,-9.8359,-8.277,8.297,-9.8359,4.2319,11.9266,10.7614,1170
-3.2897,-9.6701,-0.5434,2.1104,-9.6701,0.8738,3.0989,2.4498,1171
-9.5368,-9.6709,18.1944,16.0019,-9.6709,5.5999,13.946,7.4208,1172
-10.6737,-9.8945,-0.8613,4.2917,-9.8945,2.8722,12.2683,8.2862,1173
-5.563,-9.8253,1.397,4.868,-9.8253,6.567,14.9012,8.5439,1174
-2.9029,-9.8876,0.0161,2.1922,-9.8876,5.5696,27.7123,15.4746,1175
-2.2438,-10.1956,18.4802,11.5417,-10.1956,0.6569,41.6309,29.3703,1176
-1.3662,-9.9979,2.1037,4.1203,-9.9979,6.5333,29.6301,14.6197,1178
-4.3567,-9.966,2.7437,4.9006,-9.966,4.193,30.1195,18.2992,1179
-0.365,-10.0068,0.8871,0.9684,-10.0068,2.5488,12.2808,7.1598,1180
-4.9625,-9.6484,0.4213,2.4276,-9.6484,1.1199,12.4307,9.5453,1181
-3.9709,-10.2213,2.2994,4.7563,-10.2213,1.5622,39.4143,31.0183,1182
-2.2824,-9.9565,19.2409,20.1126,-9.9565,10.0275,42.5733,18.6442,1183
-6.1319,-9.6643,14.176,17.9159,-9.6643,8.3604,48.2476,41.5162,1184
-8.7829,-9.7186,12.8132,14.6055,-9.7186,6.796,45.2611,25.5959,1185
-5.0417,-9.5874,-1.2044,3.8111,-9.5874,1.7129,17.3579,14.7307,1186
-14.1566,-10.1423,4.6542,15.4237,-10.1423,10.005,38.0704,24.6924,1188
-3.0589,-9.8162,10.0047,14.4543,-9.8162,6.3436,78.26,21.4437,1189
-2.2184,-9.9611,0.5267,1.2856,-9.9611,2.6432,9.4276,6.8198,1190
-0.1651,-9.9564,4.3064,4.2576,-9.9564,7.0736,18.9625,11.7342,1191
0.3291,-9.9616,15.0575,14.2409,-9.9616,7.5814,22.2375,19.9039,1192
-3.1421,-9.9786,1.8211,3.4655,-9.9786,1.623,14.114,7.6529,1193
0.0109,-9.9556,1.9556,1.8709,-9.9556,1.6398,10.0382,5.4935,1194
-2.6756,-9.8863,0.657,1.3291,-9.8863,2.3867,13.6944,9.3005,1195
-1.2013,-10.0155,5.0119,4.4502,-10.0155,2.1899,17.651,11.723,1196
-3.6676,-9.9246,0.4875,1.2917,-9.9246,2.5283,19.4708,5.3651,1198
-1.8562,-10.0392,5.3872,5.961,-10.0392,9.9357,73.0151,56.1533,1199
-12.9589,-9.7194,5.204,9.3143,-9.7194,9.7105,46.322,27.536,1200
-0.2755,-10.0464,3.12,3.1344,-10.0464,5.8804,12.6242,10.4812,1201
-2.5985,-10.0256,6.904,7.748,-10.0256,7.0615,36.8724,27.2641,1202
-0.7043,-9.8224,-0.0607,0.5248,-9.8224,1.0489,8.7168,7.3501,1203
-0.3411,-9.7789,0.5925,0.923,-9.7789,1.9927,8.3299,6.6741,1204
-33.4233,-9.8638,-13.5042,11.9478,-9.8638,2.5564,15.4276,13.2007,1205
-43.6052,-9.6527,-4.1656,24.4914,-9.6527,10.1521,15.8567,11.2023,1206
-8.7212,-9.8667,2.925,9.0332,-9.8667,8.4334,17.2805,10.7832,1208
-12.1577,-9.9182,-4.7945,3.9315,-9.9182,4.2696,18.7686,11.9724,1209
1.3329,-9.9771,9.3986,5.9466,-9.9771,5.0216,20.1466,14.6854,1210
-12.944,-10.0036,-2.6182,3.9091,-10.0036,2.7392,26.0016,19.3737,1211
-28.2669,-9.7389,-16.6634,7.9313,-9.7389,5.7614,20.7619,15.153,1213
-17.6316,-9.7183,-12.2512,3.4086,-9.7183,0.6417,7.1676,6.1188,1214
-0.6134,-9.6688,1.689,2.3664,-9.6688,0.8242,3.7392,2.308,1215
-3.8775,-9.8661,2.0622,4.4306,-9.8661,5.2436,13.9793,6.5847,1216
-2.2891,-9.9383,-0.9825,0.9727,-9.9383,1.1816,8.3411,7.2543,1217
0.4454,-10.428,7.2356,4.8238,-10.428,4.5001,12.5164,9.199,1218
-3.8767,-10.3991,-1.0604,1.7182,-10.3991,1.8895,18.0189,9.5303,1219
-5.8378,-9.9312,-2.8482,1.8132,-9.9312,3.6277,19.4773,15.7478,1220
-3.6978,-9.8096,-0.9007,2.1732,-9.8096,1.3455,3.3227,2.7084,1221
-5.818,-9.8166,1.2724,4.5778,-9.8166,2.6974,5.7507,3.1994,1222
-12.7741,-9.8141,-7.9918,4.0,-9.8141,1.9415,7.5219,6.8538,1223
-19.3045,-9.5906,-2.1539,8.7696,-9.5906,2.7762,6.2559,4.5443,1224
-7.4831,-9.6787,1.5174,5.7253,-9.6787,3.043,4.6055,3.1222,1225
-4.2104,-9.555,-2.7327,1.2475,-9.555,0.4446,2.7924,2.6517,1226
-2.8307,-9.5533,-1.2261,1.0097,-9.5533,0.3593,2.5264,2.3706,1228
-2.8883,-9.5911,-0.5651,1.8477,-9.5911,0.6987,2.6842,2.4351,1229
-4.6183,-9.5885,-2.7953,1.1675,-9.5885,0.4288,2.9074,2.5194,1230
-1.6169,-9.5888,-0.9745,0.6184,-9.5888,0.2306,2.4303,2.3749,1231
-2.4228,-9.59,-1.9489,0.4375,-9.59,0.1627,2.5498,2.4691,1232
-1.0168,-9.5777,0.1551,1.7751,-9.5777,0.5743,4.3124,2.4111,1233
-8.4035,-9.7081,-4.7942,2.2806,-9.7081,0.9167,13.3286,12.0697,1234
0.4152,-9.7801,3.1417,1.5972,-9.7801,0.8143,15.0965,13.155,1235
-10.3246,-9.6385,-5.892,2.7742,-9.6385,1.2303,12.11,9.9339,1236
-10.104,-9.6407,-2.0478,4.7798,-9.6407,1.7729,10.7996,2.9998,1238
-7.4174,-9.7334,7.0723,11.2017,-9.7334,5.2538,10.6712,4.2541,1239
-4.2752,-9.7825,-1.3113,1.965,-9.7825,1.0815,4.3659,3.226,1240
-30.4753,-9.6265,-24.0683,5.1952,-9.6265,2.0566,13.8927,11.8814,1241
-5.3218,-9.5461,3.4171,5.3613,-9.5461,1.8066,25.1998,24.5841,1242
2.7821,-9.7637,7.1199,4.546,-9.7637,2.2979,15.9125,14.7565,1243
-3.2829,-9.8776,-2.3877,0.7349,-9.8776,0.4762,4.5416,4.0429,1244
-14.2272,-9.4089,-1.4445,11.6605,-9.4089,10.1123,17.6047,15.088,1245
-17.2358,-9.9065,-0.4318,7.8612,-9.9065,7.6974,33.2578,9.3798,1246
-1.4502,-9.8516,2.6731,3.2448,-9.8516,1.5479,7.9141,6.2036,1247
-30.9418,-9.8388,-7.6168,11.7834,-9.8388,6.0278,15.4875,5.5237,1249
-24.8791,-9.9065,0.9919,8.808,-9.9065,8.9392,25.6391,10.4895,1250
-8.9179,-9.8708,1.6018,6.0313,-9.8708,4.4005,28.4242,21.3331,1251
-29.1753,-9.8148,-3.9003,16.334,-9.8148,8.3069,19.0414,15.4998,1252
-8.9929,-10.0446,-4.1276,3.9225,-10.0446,4.5365,22.6574,20.4511,1253
-1.0192,-9.9949,-0.4986,0.4043,-9.9949,0.7697,6.391,5.1775,1254
-0.4866,-9.9493,-0.0899,0.1602,-9.9493,0.3983,2.8288,2.5426,1255
-0.0441,-9.9309,-0.036,0.0049,-9.9309,0.0317,2.4781,2.4505,1256
-0.0666,-9.93,-0.043,0.0102,-9.93,0.0273,2.5104,2.455,1258
-0.0507,-9.9303,-0.0475,0.0021,-9.9303,0.0213,2.4798,2.4516,1259
-0.0509,-9.9302,-0.0439,0.0038,-9.9302,0.0159,2.4637,2.4404,1260
-0.0459,-9.9275,-0.0437,0.002,-9.9275,0.0138,2.4814,2.4534,1261
-0.0469,-9.9291,-0.0443,0.0022,-9.9291,0.0187,2.4696,2.4475,1262
-0.0478,-9.9293,-0.0443,0.0019,-9.9293,0.0137,2.5052,2.4649,1263
-0.0468,-9.9287,-0.0438,0.0016,-9.9287,0.0122,2.4783,2.4587,1264
-0.0465,-9.9299,-0.0441,0.0017,-9.9299,0.0196,2.4594,2.4436,1265
-0.047,-9.9299,-0.0434,0.0018,-9.9299,0.0158,2.4722,2.4527,1266
-0.0492,-9.9295,-0.0443,0.0018,-9.9295,0.0136,2.5016,2.4478,1267
-0.0462,-9.9299,-0.0432,0.0015,-9.9299,0.0177,2.461,2.4479,1268
-1.5442,-9.9278,-0.1407,0.351,-9.9278,0.8662,9.5553,2.682,1269
-0.129,-9.9309,-0.0837,0.0208,-9.9309,0.1476,3.0332,2.5796,1270
-0.1817,-9.9305,-0.0864,0.0253,-9.9305,0.0839,2.6239,2.4701,1271
