AYGX_min,AZ_mean,AYGX_mean,AYGX_std,AZ_mean,GX_std,Gnorm_max,Gnorm_median,timestamp
-0.0545,-9.7538,-0.0478,0.0026,-9.7538,0.0162,2.3602,2.3308,0
-0.0537,-9.754,-0.0487,0.0022,-9.754,0.0132,2.3513,2.3261,1
-171.5556,-9.7087,-7.2155,46.1512,-9.7087,11.3563,35.0445,2.3747,2
-22.6365,-9.6585,1.2674,13.3948,-9.6585,8.6822,17.4734,8.6584,3
-16.6649,-9.7175,-2.1859,6.9927,-9.7175,10.7584,17.6223,11.2386,4
-61.2476,-9.2959,-13.0451,20.1622,-9.2959,7.9468,23.4123,8.7523,6
-63.3184,-9.4152,0.1772,26.0592,-9.4152,7.86,60.9455,52.1554,7
-17.5076,-9.6467,2.2797,9.9906,-9.6467,6.7569,27.067,5.9734,8
-10.2473,-9.6072,9.5956,10.864,-9.6072,5.3823,18.7497,7.4846,9
-25.9923,-9.6712,-3.704,6.96,-9.6712,4.3839,9.545,5.3647,10
-21.9621,-9.6129,0.8348,13.4387,-9.6129,7.1837,11.8338,6.5108,11
-17.0685,-9.7267,2.2816,6.7909,-9.7267,6.1014,11.2436,6.2156,13
-28.0492,-9.6928,-1.9697,12.2159,-9.6928,10.448,22.0411,4.9064,14
-0.4045,-9.7418,1.1053,1.1119,-9.7418,0.7792,6.3351,5.3416,15
-0.0069,-9.7546,0.0027,0.007,-9.7546,0.1111,2.3699,2.3012,16
-0.4518,-9.7505,-0.2854,0.1565,-9.7505,0.2823,3.0725,3.0161,17
-2.0856,-9.7626,-0.6019,1.4237,-9.7626,2.0328,4.0767,3.0254,18
-10.2708,-9.71,-3.9044,3.4718,-9.71,1.3375,7.6435,5.8163,19
-72.1307,-9.7352,-8.3123,20.7129,-9.7352,11.7902,55.4417,28.7736,20
-3.8015,-9.8543,0.6411,4.0662,-9.8543,5.0927,21.3437,13.2858,21
-6.1395,-9.8362,4.1533,7.4672,-9.8362,10.9947,35.1814,14.5085,23
-10.3964,-10.0934,4.5589,7.7712,-10.0934,5.3211,61.207,35.3427,24
-15.0338,-10.0653,6.8452,14.604,-10.0653,7.3824,70.6111,63.5309,25
-9.7236,-9.6114,0.3079,8.4216,-9.6114,5.1975,26.4484,18.5429,26
-12.1873,-10.3352,-2.6274,6.0467,-10.3352,2.6347,70.394,52.8616,27
-10.2117,-10.0261,27.3194,22.582,-10.0261,15.9812,66.4322,40.0849,28
-76.6744,-9.4586,16.8247,35.0925,-9.4586,17.5224,77.291,33.226,30
-8.5929,-9.5298,9.7801,13.5981,-9.5298,18.4901,40.4409,25.22,31
-30.9581,-9.1115,1.5175,9.1715,-9.1115,9.7909,39.5427,17.5046,33
-2.2862,-9.8891,0.2221,2.8901,-9.8891,4.2359,21.9829,18.2484,34
-6.0907,-9.8086,16.8423,14.2991,-9.8086,2.3836,27.369,22.2816,35
-1.2581,-9.4524,7.7305,8.4282,-9.4524,8.0632,24.4528,16.7499,36
-1.1335,-9.9066,0.4367,0.9798,-9.9066,1.4266,7.9036,5.2448,37
-2.1807,-9.4638,0.0128,1.1091,-9.4638,1.7962,9.3645,6.6372,38
-4.1905,-9.755,-0.7695,1.4421,-9.755,1.8092,10.3539,7.3449,39
0.7987,-9.8617,3.6549,1.9127,-9.8617,1.5529,14.6865,11.2906,40
-4.1607,-9.6105,3.0124,5.1741,-9.6105,3.1665,23.9944,14.1415,41
-3.6201,-9.7666,1.6169,2.8465,-9.7666,5.1133,20.5548,12.8498,43
-1.4571,-9.598,0.9544,1.6429,-9.598,4.1982,16.7184,10.684,44
-0.0738,-9.557,0.818,0.7135,-9.557,2.3089,9.4371,8.7613,45
-7.4206,-9.0172,-0.2124,6.6397,-9.0172,2.3644,40.2168,29.9184,46
0.7416,-9.511,6.4857,3.3884,-9.511,2.4913,31.5797,20.7655,47
-5.7815,-8.5845,2.8815,7.714,-8.5845,3.4945,56.3976,14.1928,48
-1.1471,-9.889,7.2527,6.9507,-9.889,2.3703,28.0014,23.3893,49
-4.267,-9.695,3.3436,5.5112,-9.695,5.5494,32.4556,25.1126,50
-19.1652,-9.3317,2.5423,9.6346,-9.3317,6.0635,30.0432,16.3678,51
-3.3844,-9.6386,0.5943,2.0088,-9.6386,6.5737,17.5166,9.0688,53
-13.6022,-9.7782,2.4067,10.5046,-9.7782,8.5488,37.7153,18.7265,54
-9.9756,-9.7475,0.3932,5.405,-9.7475,1.6155,20.6058,16.8091,55
0.7794,-9.9295,10.0139,6.9426,-9.9295,1.5682,26.9128,15.4143,56
-10.9378,-10.017,8.6083,14.6275,-10.017,12.8241,65.8838,58.599,57
-20.751,-3.6203,-2.9166,9.1154,-3.6203,5.6955,76.3132,44.6991,58
-99.9529,-10.0001,-30.2628,42.7662,-10.0001,13.5285,55.9239,26.5998,59
-36.7379,-6.3665,0.0306,19.8554,-6.3665,3.9127,56.2246,29.7949,60
-38.3878,-9.7115,-3.2705,14.799,-9.7115,11.0678,29.9148,19.8416,61
-33.7152,-9.796,51.2012,87.5294,-9.796,28.3869,68.7482,40.1988,63
-11.7982,-10.0158,7.8896,13.1618,-10.0158,12.9912,50.6195,30.9476,64
-11.7933,-9.9091,4.1355,11.4359,-9.9091,6.0074,16.9731,13.8086,65
-2.6489,-9.5802,0.0575,1.3857,-9.5802,2.0794,7.5017,4.6921,66
-1.8011,-9.8135,0.8863,2.3459,-9.8135,1.2421,7.4277,5.9352,67
-0.4475,-10.2819,0.0771,0.4286,-10.2819,1.2168,9.4302,7.0362,68
-0.9902,-9.3851,0.3251,2.7966,-9.3851,5.3685,10.52,8.6515,69
-2.7578,-9.8557,-0.7029,1.2486,-9.8557,1.1345,6.3515,3.8558,70
-0.9593,-9.7641,1.4976,1.931,-9.7641,3.2964,9.2099,7.8245,71
-0.5725,-9.5807,0.5521,0.7077,-9.5807,1.6788,5.6061,3.1245,72
-1.57,-9.5778,1.0218,2.342,-9.5778,4.0725,13.5635,10.2952,74
-0.3776,-9.2768,0.8287,0.8043,-9.2768,1.2477,7.2998,5.2178,75
-11.6734,-9.8192,3.786,6.8566,-9.8192,7.8845,18.4878,15.8375,76
-7.7632,-7.3198,2.3835,5.8087,-7.3198,1.9048,13.6253,9.6226,77
-0.088,-8.9577,3.8913,3.6533,-8.9577,3.3672,14.9063,9.0424,78
-0.4801,-9.5483,0.6896,1.4213,-9.5483,2.8764,12.4655,6.2109,79
-3.3847,-9.7485,-0.0269,3.8194,-9.7485,1.6011,11.3303,7.3922,80
-1.4547,-9.915,2.1545,3.7854,-9.915,3.2826,19.0832,8.8221,81
-3.1859,-9.6021,3.8947,4.6816,-9.6021,3.1149,14.8371,12.2201,82
-2.0711,-9.8727,0.7279,2.1267,-9.8727,4.61,16.4411,8.289,83
-4.5755,-9.6727,2.1179,3.9074,-9.6727,5.0428,16.7057,7.5515,84
-1.8588,-9.7523,1.1002,2.1109,-9.7523,5.6844,11.6553,8.4119,85
-3.0752,-9.7718,0.671,1.709,-9.7718,4.0252,10.6458,7.9075,86
-1.9149,-9.8848,-0.3018,1.4276,-9.8848,1.9804,6.5088,4.3732,87
-0.9839,-9.8021,-0.1061,0.5509,-9.8021,1.8187,7.6611,5.5604,88
-1.6136,-9.9279,-0.2048,0.8359,-9.9279,4.3318,8.6805,6.7865,89
-8.4655,-9.9573,5.4656,11.7395,-9.9573,6.7909,19.0915,14.1506,90
-4.8159,-9.8016,2.6431,3.6381,-9.8016,5.5686,16.0749,14.3667,91
-0.2694,-9.5126,0.2495,0.331,-9.5126,1.845,9.2515,5.1671,92
-2.6881,-9.1061,3.7521,5.4186,-9.1061,4.5107,15.7251,12.4091,93
-1.4721,-9.7476,2.7913,3.6962,-9.7476,5.7788,13.216,8.2539,94
-1.0045,-9.7402,0.2455,1.072,-9.7402,1.6139,6.5933,4.3883,95
-8.8813,-9.7937,0.283,5.6249,-9.7937,3.7839,18.5852,8.6065,96
-3.5047,-10.0093,-0.1565,2.6008,-10.0093,8.303,31.7459,19.8872,97
-1.2733,-9.9268,-0.2973,1.2619,-9.9268,2.2613,16.6207,7.8129,98
-1.4983,-9.4333,0.231,1.4527,-9.4333,3.1501,9.4286,6.2163,99
-9.5762,-9.7484,2.3435,9.9223,-9.7484,2.498,15.1588,12.1624,100
-3.347,-9.0298,0.7568,2.6391,-9.0298,2.1348,13.8493,6.5576,101
-2.4683,-9.987,0.3781,1.7306,-9.987,1.9451,8.1462,4.2478,102
-6.4839,-9.6677,0.5353,3.5055,-9.6677,5.4661,14.6689,7.9327,103
-4.4551,-9.7301,2.7527,5.2667,-9.7301,8.9421,15.7934,10.5582,104
-0.4152,-9.7991,1.7805,2.3941,-9.7991,2.7119,12.7974,9.9835,105
-1.1564,-9.6827,12.4171,9.158,-9.6827,15.2315,30.2624,24.5576,106
-6.0468,-9.6149,8.66,12.9468,-9.6149,4.9805,31.5345,18.9208,107
-18.915,-7.9414,46.1377,68.0723,-7.9414,19.9803,47.0972,43.7564,108
-22.0591,-6.8136,8.1861,21.5931,-6.8136,9.244,44.5992,24.9019,109
-7.7994,-9.8566,2.1735,6.7559,-9.8566,11.2744,28.4396,17.8484,110
-6.8491,-9.7712,6.1911,7.2057,-9.7712,6.5363,27.4969,18.7342,111
-9.9835,-9.9105,5.6857,9.2239,-9.9105,12.0083,36.8804,21.883,112
3.8867,-9.4113,25.9324,13.4436,-9.4113,4.9544,33.7301,31.7654,113
-0.0652,-9.9326,9.8293,10.5081,-9.9326,14.8725,35.957,20.6953,114
-0.3654,-9.7427,1.2824,1.2872,-9.7427,1.9928,9.2314,5.9129,115
-1.0757,-9.7679,0.2297,0.7742,-9.7679,0.9972,8.3379,4.2123,116
-0.3831,-9.8758,0.0409,0.3094,-9.8758,0.6185,7.5257,5.9696,117
-0.3924,-9.8296,0.2787,0.4508,-9.8296,0.6029,6.1177,2.9455,118
-0.0143,-9.8003,0.7004,0.5605,-9.8003,1.4551,9.4848,7.1844,119
-1.2838,-9.6007,0.2993,1.0063,-9.6007,2.0355,13.9445,8.6062,120
-2.2361,-9.7552,1.3808,2.3915,-9.7552,1.5526,13.5104,11.6312,121
-2.287,-9.6667,3.6303,4.0062,-9.6667,7.6883,29.9045,19.7068,122
-7.3337,-9.8285,1.4903,5.3312,-9.8285,6.6988,24.7838,11.1654,123
-32.1449,-10.19,3.6828,11.1654,-10.19,14.9621,50.4851,24.8823,124
-15.5443,-9.849,5.6322,12.8772,-9.849,2.2753,42.4252,36.1791,125
-28.2758,-10.6375,2.3556,14.7857,-10.6375,6.5459,54.9008,49.6804,126
-2.8867,-10.7364,37.8738,28.6572,-10.7364,19.8456,56.9921,49.2184,127
-2.5825,-10.1218,8.1538,16.7574,-10.1218,7.3345,35.6046,31.1597,128
3.7841,-9.7118,9.5124,6.3424,-9.7118,7.452,25.2165,23.4917,129
-1.9734,-9.6549,5.3578,6.4859,-9.6549,3.9814,18.3917,16.0162,130
-5.1568,-9.8863,0.0685,2.6068,-9.8863,4.0311,15.7463,7.0014,131
-2.1716,-9.6802,12.4964,17.1324,-9.6802,12.7743,29.8151,25.9028,132
-10.4616,-9.7939,1.46,4.8734,-9.7939,6.9748,14.9026,12.5019,133
-3.0624,-9.7712,0.031,0.8227,-9.7712,1.8604,8.2501,3.5656,134
-0.4979,-10.0873,0.3481,0.781,-10.0873,1.1715,9.5203,6.6272,135
-1.7902,-9.6854,0.5668,1.6286,-9.6854,4.0849,11.1288,10.3484,136
-1.1417,-9.7176,1.3715,2.0105,-9.7176,3.3077,8.5438,6.0061,137
-0.1009,-9.7798,2.2589,2.2683,-9.7798,5.15,18.1877,15.0803,138
-5.6744,-9.6121,-0.3436,2.7168,-9.6121,2.2006,6.6347,4.4493,139
0.0932,-9.756,1.2592,1.2085,-9.756,1.2045,5.9956,5.026,140
-7.6062,-9.6734,5.6844,9.5826,-9.6734,9.0709,22.0499,18.1251,141
-1.2223,-9.9906,0.3593,1.6174,-9.9906,3.622,13.2846,12.049,142
-3.5209,-9.4838,1.975,3.8928,-9.4838,6.1697,13.8915,8.669,143
-5.8038,-9.5366,-0.0087,1.9033,-9.5366,3.3949,18.5644,5.0724,144
-1.336,-9.8903,0.6068,1.3514,-9.8903,2.9271,8.9583,6.7957,145
-2.5566,-10.135,3.4093,5.8679,-10.135,6.5777,20.2809,17.6235,146
-11.4968,-9.7603,2.9497,9.2316,-9.7603,6.1425,26.1111,19.6763,147
-0.5352,-9.8652,1.1742,1.9544,-9.8652,2.8004,7.1418,5.223,148
-2.8571,-9.389,-0.5522,2.1036,-9.389,4.1704,11.7708,6.5311,149
-1.4512,-10.1393,0.8166,1.2999,-10.1393,1.94,8.2439,4.1926,150
-0.7576,-9.7255,0.6367,1.1276,-9.7255,2.2985,5.2696,3.7864,151
-0.2572,-9.9878,3.4206,3.7273,-9.9878,1.6175,11.6467,8.8698,152
-1.5285,-10.0565,1.6485,3.13,-10.0565,4.8422,15.2026,11.8079,153
-2.3944,-9.7662,0.6744,2.1006,-9.7662,4.0384,12.263,5.7775,154
-4.2957,-9.7635,3.578,5.5242,-9.7635,8.3388,19.9337,9.6477,155
-2.4575,-9.826,-0.1969,0.9508,-9.826,3.8572,8.5243,5.3166,156
-2.9715,-9.9961,0.5487,2.1992,-9.9961,1.5296,8.4607,4.974,157
-1.101,-9.7065,1.4149,1.8546,-9.7065,4.4695,11.8671,7.8393,158
-0.8389,-9.89,0.1885,0.4366,-9.89,0.7451,11.0659,3.527,160
-0.4655,-9.8628,0.1576,0.325,-9.8628,0.7085,10.8645,5.7423,161
-1.1341,-9.7246,1.992,2.3928,-9.7246,4.6402,19.1814,8.1682,163
-0.8193,-9.8538,1.5477,3.0262,-9.8538,6.5423,36.3855,33.6654,164
-1.5247,-9.699,20.2668,12.7283,-9.699,1.7798,28.617,22.8512,165
30.8432,-9.9345,45.5699,9.5895,-9.9345,3.6873,48.2172,30.8536,166
-4.1038,-9.7173,-0.2716,4.5536,-9.7173,1.9339,9.7461,8.0551,167
-0.0246,-9.7245,0.9482,1.1174,-9.7245,1.8688,18.335,12.3664,168
-3.6726,-9.6953,4.368,4.4286,-9.6953,2.7572,33.3411,31.2165,169
-8.2851,-9.9139,5.8162,10.2192,-9.9139,6.8667,46.4366,34.9749,171
-4.7624,-9.8556,4.4238,6.4375,-9.8556,11.899,41.1142,20.4939,173
-8.3502,-9.8006,14.5752,18.5549,-9.8006,11.0444,32.8823,27.6005,174
7.1552,-9.8605,23.5922,14.829,-9.8605,1.8285,38.1017,33.2709,175
-11.1197,-10.5127,-2.0045,4.3862,-10.5127,2.0473,59.0225,55.1059,176
38.5642,-10.1784,56.8776,21.2655,-10.1784,9.0581,53.5478,51.503,177
2.5356,-9.7874,18.1219,12.8408,-9.7874,3.9528,34.001,23.2672,178
-3.715,-10.1207,-0.2068,1.6774,-10.1207,0.7449,7.5036,4.8698,179
-6.8629,-9.6974,2.184,4.4792,-9.6974,2.6564,21.3859,10.18,180
4.9206,-10.0649,50.1498,22.6483,-10.0649,8.8875,46.9604,29.6925,181
-3.547,-10.0506,5.0577,6.4035,-10.0506,7.7592,70.9166,17.1959,183
-0.7874,-10.5247,0.3417,1.3223,-10.5247,3.8129,47.7936,42.1689,184
-10.452,-9.8555,0.6892,10.669,-9.8555,3.4354,45.2188,33.3692,185
-3.2792,-10.2366,6.2068,6.2593,-10.2366,3.1282,73.6234,62.3394,186
-5.776,-10.1162,75.4317,43.5905,-10.1162,3.6625,48.8177,42.7967,187
-16.7281,-9.9734,-0.5701,7.1647,-9.9734,5.2116,40.4609,24.6042,189
-15.6898,-9.8137,2.0032,7.5565,-9.8137,9.4956,34.5787,14.2561,190
-4.911,-9.776,1.101,2.9769,-9.776,5.7692,17.1246,10.535,191
-6.5157,-9.8133,0.0349,1.8169,-9.8133,3.2493,15.3916,6.2351,193
-1.9519,-9.8912,-0.1903,1.3988,-9.8912,1.0277,12.4186,8.8978,194
-0.5922,-9.9482,-0.1674,0.4275,-9.9482,1.2474,19.7418,16.3686,195
-2.3927,-9.8798,0.2934,1.1031,-9.8798,1.7959,16.3373,9.413,196
15.417,-9.5364,19.2696,3.7118,-9.5364,1.9073,26.6281,21.2725,197
-1.9068,-10.9529,4.8049,5.0305,-10.9529,3.0689,72.8068,63.713,198
20.0885,-9.7226,28.917,9.3604,-9.7226,5.7605,39.6449,33.2588,199
-1.6491,-10.1301,0.2791,1.5754,-10.1301,1.043,44.7387,36.7181,200
4.2546,-9.9263,11.7477,4.6322,-9.9263,2.9055,45.1345,42.1906,201
-11.4766,-9.8059,0.0979,3.4461,-9.8059,3.9261,18.8334,8.6428,203
-9.5203,-9.725,0.78,8.8615,-9.725,10.3288,33.8076,22.5419,204
4.2072,-10.4629,13.1083,5.996,-10.4629,2.4337,60.9726,49.3679,205
1.3037,-9.6043,28.0461,14.2374,-9.6043,3.5462,42.7918,30.245,206
-10.9153,-9.8644,2.6465,7.8301,-9.8644,2.3008,22.214,19.2595,210
-6.6946,-9.7819,1.1012,3.1677,-9.7819,5.8996,14.7203,9.6634,211
-18.5762,-9.8105,2.26,8.6444,-9.8105,11.7057,31.2609,12.6608,213
-10.9554,-9.9633,8.3327,10.0173,-9.9633,15.1155,33.1475,24.8252,214
-7.113,-9.8126,-0.8912,3.0833,-9.8126,4.7604,15.6839,7.2167,215
-2.6425,-9.8325,0.6855,2.5079,-9.8325,5.719,21.695,7.8392,216
-0.9204,-9.7665,3.0412,3.5182,-9.7665,6.7159,16.1449,14.5654,217
-0.8192,-9.7947,4.6176,4.2336,-9.7947,2.8464,17.2633,15.4726,218
0.0892,-9.7068,3.9967,3.3703,-9.7068,9.9598,20.9362,10.0488,219
-2.6518,-9.7566,0.3553,2.6781,-9.7566,2.4747,10.876,9.1597,220
-7.5678,-9.7444,0.4474,2.4814,-9.7444,6.197,19.1773,6.4667,221
-12.2287,-10.0517,7.5868,11.451,-10.0517,13.4328,44.5705,21.9186,223
-21.8432,-9.7547,10.1114,14.6009,-9.7547,2.9151,40.4289,27.1741,224
-1.4809,-9.8178,0.9549,2.5706,-9.8178,4.3197,29.7795,24.4468,225
-3.8963,-10.0322,3.619,3.9065,-10.0322,1.8386,13.4384,10.5802,226
-5.2394,-9.8424,-0.9186,2.3568,-9.8424,2.9156,14.671,13.4346,227
-8.0661,-10.4344,1.4919,4.0708,-10.4344,8.158,51.7465,32.6938,228
-2.3594,-9.4543,8.1302,7.5114,-9.4543,1.2358,23.6722,19.6313,229
-9.399,-9.4988,-5.1451,3.0962,-9.4988,3.2476,18.6151,6.9028,230
-64.4665,-10.6586,11.5087,64.3648,-10.6586,18.7486,85.4735,56.7535,231
-49.0151,-9.9098,31.6839,54.2236,-9.9098,25.2392,101.1439,49.2379,233
-11.8078,-10.4198,3.1621,8.1533,-10.4198,10.1536,77.4654,50.2435,234
-1.5125,-9.7758,1.6197,3.0382,-9.7758,4.537,21.4049,16.6799,235
-0.0562,-10.3785,4.846,3.8001,-10.3785,5.4417,41.1289,28.8444,236
3.5916,-9.8163,13.2456,7.8197,-9.8163,4.1168,21.3291,18.2253,237
-1.3718,-9.6856,0.1159,0.772,-9.6856,2.947,9.7786,5.9617,238
-5.993,-9.8904,-0.7863,2.7755,-9.8904,1.9406,21.8328,18.8272,239
-1.1062,-9.4583,10.7081,14.0468,-9.4583,11.3494,41.1116,34.8327,240
-13.818,-9.5638,5.7321,13.7014,-9.5638,6.5472,78.6283,27.1726,241
-7.8871,-9.805,-4.4837,3.1835,-9.805,2.8249,23.4998,16.5854,242
-42.2527,-8.9563,0.4973,14.4181,-8.9563,8.6023,41.6369,17.2016,243
-9.1651,-9.6752,-1.4528,3.4247,-9.6752,3.7304,20.7279,9.1454,244
-6.5979,-9.9943,2.1024,8.1467,-9.9943,5.1591,21.3884,18.5299,245
-5.8048,-9.7367,24.7822,19.4672,-9.7367,6.928,42.0028,30.939,246
4.6431,-9.505,10.4623,5.6616,-9.505,6.3658,48.6804,36.4885,247
-5.6229,-9.4904,4.2655,6.2987,-9.4904,4.6492,17.4259,15.6754,248
-25.8349,-9.7007,8.199,14.7198,-9.7007,5.843,39.2459,31.8192,249
-0.904,-9.5946,0.8429,2.4453,-9.5946,4.1872,14.5363,6.4159,250
-12.97,-9.6547,-0.0339,6.036,-9.6547,7.8556,16.4672,12.0406,251
-2.939,-9.8173,1.487,4.6905,-9.8173,7.6506,18.5642,10.821,253
-0.8013,-9.7655,3.7052,4.0608,-9.7655,7.5041,13.8786,9.5009,254
-0.5599,-10.05,4.0432,3.166,-10.05,2.0545,15.5201,13.0029,255
-5.0495,-9.9444,2.087,5.6311,-9.9444,9.7528,34.8547,29.606,258
-6.6444,-9.659,3.4518,6.074,-9.659,10.9691,21.1438,14.7169,260
-4.7376,-9.8398,2.5331,4.7379,-9.8398,7.2029,21.3313,15.4856,261
-3.8009,-9.834,4.0557,5.2316,-9.834,8.6862,20.5024,11.6129,263
-10.27,-8.9222,-0.053,5.1756,-8.9222,7.1087,28.3443,11.5193,264
-2.4791,-10.0063,-0.6581,1.3297,-10.0063,4.9053,23.4148,18.1236,265
-22.1725,-10.3195,-1.2092,14.2239,-10.3195,9.3348,35.6715,32.4719,266
-6.2064,-9.6561,-0.7366,3.1178,-9.6561,3.1668,18.1818,11.1411,267
-0.4626,-9.7001,5.4641,7.352,-9.7001,6.3766,17.4561,13.7981,268
-1.4684,-9.4789,6.6057,10.547,-9.4789,5.946,28.5893,24.0038,269
-1.4414,-9.5103,11.0553,11.5975,-9.5103,10.6796,22.7186,20.454,270
-16.816,-9.1258,5.0077,10.7206,-9.1258,11.2727,30.4891,17.3051,271
-1.1625,-9.6854,8.295,8.0502,-9.6854,11.9148,23.2805,18.3463,273
-8.9975,-9.1482,4.552,7.9371,-9.1482,9.6764,21.2378,14.3838,274
-1.0219,-9.6607,5.7278,7.5383,-9.6607,4.7269,17.682,15.8757,275
-3.2764,-9.6777,-0.1651,1.4653,-9.6777,2.6628,12.1919,6.7522,276
-0.4462,-9.6835,0.0275,0.3117,-9.6835,1.1005,12.3122,4.7058,277
-0.4843,-10.5871,0.0189,0.2542,-10.5871,1.0649,6.5652,4.9559,278
-1.0507,-9.4032,0.0352,0.5745,-9.4032,1.3189,9.3203,4.9692,279
-1.0954,-10.0124,3.2122,4.7542,-10.0124,4.1797,15.8492,14.4042,280
-10.2532,-10.2511,30.5481,16.8743,-10.2511,8.031,64.7908,39.7533,281
-2.7819,-9.6664,8.3572,13.4927,-9.6664,10.251,59.5091,18.0736,283
-18.4519,-9.484,2.1799,12.5555,-9.484,6.757,26.2902,23.4825,284
-11.8094,-9.7164,5.4182,13.2634,-9.7164,1.8669,34.4211,27.0414,285
-3.5392,-9.9904,23.2749,23.1337,-9.9904,4.8791,44.9883,40.0665,286
-18.0911,-10.0867,-1.2294,13.0174,-10.0867,6.0353,29.8431,14.5259,287
-1.9402,-9.1512,-0.4465,1.2676,-9.1512,2.5482,15.7464,7.4889,288
0.0832,-9.7665,4.5489,3.0457,-9.7665,2.8896,21.1818,13.4779,289
-4.3016,-9.445,-0.8703,2.5153,-9.445,6.8951,21.6766,9.7124,290
-5.2612,-9.8387,2.3867,8.296,-9.8387,6.6416,24.8957,16.4867,291
-3.7653,-9.5236,3.8435,8.4437,-9.5236,10.3438,28.4108,12.35,293
-21.3369,-10.1352,2.8323,11.4192,-10.1352,6.1173,32.7949,22.1336,294
-22.8781,-9.8561,-1.5292,15.8638,-9.8561,5.4835,37.2153,33.4879,295
-4.8363,-5.8314,-1.0842,1.9039,-5.8314,2.4501,35.8934,9.8257,296
-26.7136,-5.6737,9.9582,31.1905,-5.6737,4.8818,49.2314,26.2267,297
-6.7214,-9.892,1.6097,6.0045,-9.892,3.8211,25.5499,11.9604,298
-8.2345,-10.2244,4.4772,10.5089,-10.2244,6.2308,35.6492,34.1768,299
-28.2377,-9.7742,-10.0692,10.9085,-9.7742,1.8983,23.4205,15.4579,300
-14.4077,-7.9038,13.9722,24.3294,-7.9038,12.9535,78.8905,45.2427,301
-51.1998,-7.5874,2.2987,17.1683,-7.5874,6.4534,98.3803,25.5479,302
-24.6793,-9.8572,1.8555,16.357,-9.8572,17.8715,43.0444,33.0914,303
-6.5083,-9.2366,0.3974,2.5849,-9.2366,4.6321,31.3085,9.0544,304
-4.843,-8.4283,0.0054,3.8722,-8.4283,3.0156,21.3793,12.7069,305
-25.8597,-9.9067,6.5837,22.8112,-9.9067,3.0696,36.8888,30.8822,306
-5.4476,-9.9271,0.7447,2.5801,-9.9271,4.6094,17.609,10.5524,307
-4.0804,-9.8706,-0.1394,2.6189,-9.8706,2.5735,19.9472,9.1158,308
-0.085,-9.8589,0.0911,0.247,-9.8589,0.8491,5.4912,3.9909,309
-4.7671,-9.9003,-0.3377,2.0484,-9.9003,5.6234,19.3574,12.8974,310
-10.8304,-9.5839,1.5879,5.8078,-9.5839,5.2214,22.7079,14.6219,311
-0.7196,-9.7759,-0.0526,0.2907,-9.7759,1.3494,6.0889,3.0339,313
-4.4948,-9.7933,1.3132,2.7799,-9.7933,4.2823,12.4117,8.5654,314
-0.0358,-9.7806,1.524,1.4124,-9.7806,1.6336,8.8725,6.4679,315
-2.1265,-9.6483,0.7947,1.8734,-9.6483,1.0892,7.2343,6.9949,316
-2.9884,-9.7141,-1.2976,1.3764,-9.7141,4.578,15.3632,7.8392,317
0.2725,-9.8156,7.2774,4.296,-9.8156,3.7924,25.4857,19.1415,318
-18.2547,-9.2043,-0.1907,4.3406,-9.2043,2.8526,26.1007,6.5082,320
-7.1846,-9.9318,2.2455,4.0962,-9.9318,8.6573,27.0654,18.7787,321
-0.5632,-9.7461,5.4472,3.4117,-9.7461,1.9501,18.8841,14.0269,323
-6.6192,-9.7091,-0.1146,4.1869,-9.7091,1.2932,11.4812,10.0951,324
-10.6143,-9.7075,2.7989,7.4561,-9.7075,5.557,31.0297,16.2224,325
-7.1199,-9.8217,-0.933,3.0575,-9.8217,2.2627,22.1106,18.222,326
-17.5768,-10.1816,-2.3432,11.2757,-10.1816,5.8071,19.7782,18.9587,327
3.5909,-11.766,37.5217,50.6363,-11.766,17.865,75.307,51.032,328
-4.8493,-9.8281,0.317,2.8884,-9.8281,2.755,42.4937,26.2001,329
-5.1925,-9.992,17.7371,17.163,-9.992,1.0351,35.6735,31.142,330
-3.0666,-9.5832,0.1898,1.4814,-9.5832,3.6279,12.309,6.0314,331
-1.1988,-9.8367,4.2741,4.7624,-9.8367,8.8952,17.439,12.6187,333
-1.3461,-9.7539,0.7045,1.3112,-9.7539,2.8068,10.0166,6.102,334
-1.7878,-9.7138,-0.0825,1.1489,-9.7138,2.2427,9.0842,4.8587,335
-2.2957,-9.9879,0.3991,1.4343,-9.9879,2.7526,11.5281,5.2508,336
-10.5426,-10.0039,0.3375,4.6571,-10.0039,2.7142,9.6855,7.4513,337
-1.9285,-9.9646,-0.0354,1.936,-9.9646,5.1247,22.3912,15.5077,338
0.0532,-9.7841,3.4393,2.7786,-9.7841,2.7573,11.5915,9.6616,339
-0.5005,-9.6835,1.3694,1.9174,-9.6835,4.5533,12.8831,11.8231,340
-1.2672,-9.8093,1.4788,2.0545,-9.8093,3.4013,8.5941,5.3331,341
-15.8858,-9.6271,4.9003,17.1605,-9.6271,12.6193,34.647,11.0957,343
-7.222,-9.8862,1.4289,9.9742,-9.8862,8.0704,26.4523,8.2648,344
-2.4331,-9.4189,3.5271,4.6631,-9.4189,7.2326,15.0266,9.4861,345
0.3567,-9.6895,3.9563,3.1613,-9.6895,1.3355,9.6414,8.3241,346
-8.5683,-10.1747,-0.1384,4.3352,-10.1747,2.9316,16.1129,13.326,347
-6.6881,-9.7071,0.6939,3.2274,-9.7071,1.1589,11.5674,7.8566,348
-2.1211,-9.653,2.1371,3.1358,-9.653,2.9382,9.9988,7.8392,349
-1.0284,-9.5998,1.261,1.4903,-9.5998,1.0798,6.9178,5.3406,350
-1.8274,-9.7551,1.553,2.4671,-9.7551,4.8517,9.9868,6.5382,351
-6.2887,-9.6382,1.7562,4.1659,-9.6382,7.9849,15.3318,10.7094,353
-11.2755,-9.2814,3.4401,8.7048,-9.2814,8.3145,31.009,15.4808,354
-4.1764,-6.7879,2.5154,5.0591,-6.7879,3.0954,18.8739,8.9852,355
-3.8408,-9.8617,0.4537,3.5121,-9.8617,5.4757,22.9257,9.5729,356
-5.3604,-9.7075,-2.1864,2.9118,-9.7075,2.9313,16.4615,12.4659,357
-2.5213,-9.9988,0.9968,2.1834,-9.9988,5.6503,16.0085,9.5135,358
0.1053,-9.8219,5.7536,6.0257,-9.8219,6.799,16.8816,12.323,361
-3.2313,-9.8051,1.7769,3.6422,-9.8051,1.5771,16.6552,12.2112,362
-7.2366,-9.8272,4.9223,6.7051,-9.8272,10.8131,21.8705,15.7744,363
-3.4842,-9.7704,2.2647,4.3684,-9.7704,8.3178,18.6293,11.934,364
-2.0991,-9.6596,1.1127,3.132,-9.6596,5.5662,11.0381,9.3279,365
-3.4348,-9.7197,0.2578,2.9014,-9.7197,2.271,12.484,8.9854,366
-2.7857,-9.9497,0.6103,1.6825,-9.9497,6.0826,18.7001,13.3936,367
-16.8829,-10.0934,6.9203,13.0844,-10.0934,2.372,22.7553,16.1439,368
-3.5041,-9.6446,-0.6079,1.7166,-9.6446,3.9678,11.8525,6.4869,369
-3.5015,-10.1252,-0.1436,1.6331,-10.1252,2.4898,12.1389,4.9097,370
-3.6602,-9.7664,0.8807,1.8873,-9.7664,3.7264,13.0794,6.4303,371
-3.7195,-9.7196,0.126,1.6402,-9.7196,3.2015,11.1193,5.3071,373
-8.7729,-9.7591,0.7262,4.3128,-9.7591,5.1247,14.1771,7.2118,374
-2.0431,-9.7676,-0.1214,0.8343,-9.7676,1.4304,13.5778,5.319,375
-5.1326,-9.9302,-0.6261,3.5092,-9.9302,5.7029,13.3389,12.5811,376
-0.7299,-9.743,0.1309,0.7652,-9.743,0.8684,10.3215,7.9517,377
-1.3737,-9.8067,0.0436,0.8356,-9.8067,1.4085,12.3006,4.799,378
-25.0749,-9.5977,0.992,10.017,-9.5977,6.5689,22.2812,16.4936,379
-9.1891,-9.9036,-1.2156,3.7519,-9.9036,6.716,27.7619,24.0187,380
-10.2489,-10.03,-1.101,4.3258,-10.03,3.5639,22.4251,15.758,381
-21.9603,-9.8935,-0.2163,10.7432,-9.8935,3.7046,19.9321,16.4846,382
-6.5413,-9.863,-0.1999,2.1853,-9.863,3.8504,29.8717,25.5568,383
-3.0615,-10.3214,0.554,2.8537,-10.3214,2.8396,31.7235,28.0221,384
-12.0939,-9.9599,0.6483,9.975,-9.9599,2.0583,35.0779,29.6291,385
-3.3316,-9.6821,1.0849,2.5584,-9.6821,3.5277,13.071,7.4113,386
-4.5382,-9.8847,-1.2746,2.5683,-9.8847,1.475,10.8824,9.1111,387
-4.1749,-9.6117,-1.5621,1.8128,-9.6117,1.9119,11.4708,6.5091,388
-3.1044,-10.1626,4.002,4.1165,-10.1626,2.1492,26.2626,24.5869,389
0.1657,-9.7213,5.4172,5.3213,-9.7213,6.388,19.9026,11.2913,390
-6.4271,-9.8182,0.0578,3.1117,-9.8182,5.7648,14.7293,9.3695,391
-0.7381,-9.7452,3.1044,2.8248,-9.7452,3.4473,17.1375,12.3608,392
-7.1765,-9.7368,1.5282,5.5625,-9.7368,7.8981,14.8192,13.3261,393
-2.7431,-9.939,0.3939,2.0478,-9.939,5.0632,12.4786,10.5069,394
-1.9026,-9.6951,0.0661,0.9174,-9.6951,1.1213,7.7817,5.5268,395
-34.5991,-9.2316,1.9123,14.0392,-9.2316,7.4054,27.4163,16.4886,396
-2.4161,-9.8323,4.3238,3.3236,-9.8323,3.5374,19.0959,15.7434,397
-10.2999,-8.5932,25.1854,26.2428,-8.5932,19.5636,51.8315,44.4863,398
-5.4257,-9.7039,1.3017,4.714,-9.7039,1.86,22.655,8.7982,399
-6.4032,-8.7427,0.2213,3.2191,-8.7427,5.8227,23.4526,16.2314,400
-1.1569,-9.8352,5.1548,5.8988,-9.8352,9.1884,22.1579,16.4273,402
-3.5766,-9.8327,2.4827,3.9632,-9.8327,6.3343,17.0166,14.4878,403
-1.1191,-9.5715,-0.2038,0.5027,-9.5715,1.3017,6.9838,4.4229,404
-5.7371,-9.7469,0.9061,2.3622,-9.7469,6.7576,17.4093,9.1146,405
-2.0276,-9.803,0.2215,1.2773,-9.803,3.2191,9.8928,5.3396,406
-1.8,-9.9683,4.0698,3.6446,-9.9683,2.4155,16.1093,11.3897,407
-1.6541,-9.6076,-0.1148,1.1006,-9.6076,3.3523,14.4318,7.1424,408
-0.6461,-10.16,0.7468,1.7578,-10.16,1.7163,9.1137,5.0815,409
-0.645,-9.4337,0.6128,1.3635,-9.4337,4.5134,11.2959,7.2385,410
0.0153,-9.8972,2.1759,1.6208,-9.8972,1.5082,10.1162,8.4052,411
-3.0986,-8.9535,-0.2322,1.338,-8.9535,1.1332,16.4611,6.1746,412
-0.8213,-9.8044,2.8143,2.4731,-9.8044,2.8223,16.2752,13.5779,413
-3.0647,-9.2573,-0.6157,1.1819,-9.2573,2.51,11.6055,9.1952,414
-5.0076,-8.4555,0.2376,3.2799,-8.4555,5.3634,28.9609,10.4991,415
-1.0275,-9.866,1.1083,1.5687,-9.866,1.878,9.8855,4.8012,416
-0.8779,-9.8102,-0.0486,0.3852,-9.8102,0.884,5.0179,4.335,417
-2.9286,-9.8635,0.2282,1.7864,-9.8635,1.1852,14.8381,8.8531,418
-2.2629,-9.707,4.9748,5.7811,-9.707,1.3544,15.8214,12.6632,419
-2.9108,-9.3974,0.4048,2.1526,-9.3974,1.064,13.248,7.9218,420
-2.8649,-9.9195,0.0153,1.5145,-9.9195,0.5905,8.3957,5.8323,421
-18.5824,-9.9194,-4.4156,6.9538,-9.9194,5.7185,31.4008,25.7413,422
-7.198,-9.1687,2.5951,6.1655,-9.1687,7.0183,30.0923,14.1103,423
-1.2099,-9.5473,1.1524,1.5531,-9.5473,4.9211,16.7871,13.06,424
-10.4706,-9.8062,-1.6277,5.9651,-9.8062,1.9889,14.3497,13.3702,425
-1.2118,-9.7386,1.7282,3.5536,-9.7386,2.9881,11.626,5.7627,427
-0.3804,-10.6861,2.297,1.9266,-10.6861,3.1367,49.8604,47.668,429
-2.9606,-9.1948,6.6111,6.2407,-9.1948,7.0338,20.6691,16.5566,431
0.0467,-9.9432,11.093,11.3414,-9.9432,4.7587,22.8038,15.9061,432
-1.0362,-9.8064,0.2413,0.7785,-9.8064,2.2833,7.6668,4.8255,433
-1.7584,-9.7282,0.2454,0.9667,-9.7282,2.3957,9.0991,5.0243,434
-0.6268,-9.8245,1.6191,2.6696,-9.8245,4.3377,17.0607,9.7165,435
-5.075,-9.6857,-0.1113,2.3849,-9.6857,1.9836,17.1493,6.1547,436
-4.286,-9.7505,0.506,2.3895,-9.7505,5.0237,16.809,10.059,437
-2.7683,-9.7116,0.3058,1.2223,-9.7116,2.905,15.7219,9.0683,438
-1.2668,-9.8023,1.4647,2.8934,-9.8023,4.2158,12.2198,6.7767,439
-2.2239,-9.9103,0.1888,0.9327,-9.9103,2.1428,21.6182,4.4002,440
-2.7372,-9.5681,0.0229,1.0149,-9.5681,1.4027,11.6061,4.7331,441
-0.64,-9.8561,0.3088,0.8964,-9.8561,2.053,9.391,4.7902,442
-2.4389,-9.9909,2.1441,3.2873,-9.9909,2.6376,29.7373,15.9121,443
-8.0991,-9.6988,3.5325,6.4087,-9.6988,3.8209,37.7902,23.5019,444
-7.6024,-9.6187,0.2195,3.4645,-9.6187,2.0644,27.1209,19.2667,445
-3.3196,-9.8423,0.4103,1.8491,-9.8423,2.1887,35.9653,31.7309,446
24.9649,-9.9173,69.9129,27.3169,-9.9173,3.0163,52.4067,39.9002,447
4.6203,-9.5282,49.7799,44.0637,-9.5282,10.0474,51.6475,45.0132,448
-3.7371,-10.4261,5.4964,8.2231,-10.4261,1.8173,27.8712,18.318,449
-5.7821,-10.0785,30.8785,29.5619,-10.0785,6.9652,50.5773,36.5322,450
-4.2438,-10.596,3.6599,5.521,-10.596,6.1685,74.4479,68.8752,451
9.1815,-9.7327,51.3295,37.5678,-9.7327,9.2903,56.0369,35.5984,452
-12.2785,-10.3211,-0.3535,5.9933,-10.3211,7.1326,27.4699,18.1476,453
-8.15,-9.9452,3.0211,12.4567,-9.9452,9.7757,36.6445,20.8782,455
-64.5243,-9.1772,1.0391,33.0832,-9.1772,13.0056,56.4899,49.9503,456
-20.4296,-10.1705,12.8088,23.8653,-10.1705,5.852,31.8726,24.9527,457
-3.9929,-10.0348,5.2473,7.3007,-10.0348,2.4496,69.2188,16.1402,458
-16.8758,-5.9005,0.555,9.0438,-5.9005,4.1065,25.9115,22.0646,459
-23.226,-9.4392,1.9876,20.454,-9.4392,10.3245,51.5153,34.9112,460
-11.2711,-9.4298,-0.5863,5.5695,-9.4298,6.0587,23.7607,16.2202,461
-23.5395,-6.7858,-1.3548,10.6117,-6.7858,5.9523,34.9911,25.5209,462
-19.1938,-9.9829,0.2853,9.886,-9.9829,5.0278,25.4822,18.3226,463
-2.2424,-9.0318,-0.0634,1.7905,-9.0318,1.5776,17.695,9.3248,464
-1.9293,-8.7454,0.7338,1.9348,-8.7454,1.9643,21.2299,5.2204,465
-118.5729,-9.4651,-19.0544,51.0423,-9.4651,11.1791,34.0489,19.6779,466
-0.3728,-9.7847,6.2034,4.5355,-9.7847,3.2481,17.3597,15.0687,467
-0.6576,-9.927,0.6989,1.4208,-9.927,3.2597,10.5204,6.971,468
-3.3033,-9.5638,0.4966,2.8728,-9.5638,2.2762,9.7027,5.1722,469
-1.4755,-9.6413,-0.2339,0.7564,-9.6413,2.1574,5.3988,4.9273,470
-1.1687,-9.7233,0.0721,1.1187,-9.7233,3.3818,14.0183,9.1572,471
-5.1343,-10.217,-1.233,1.6998,-10.217,2.3606,10.737,6.1566,472
-0.0914,-9.4463,0.0786,0.1164,-9.4463,0.3227,6.0381,4.5706,473
-1.7173,-9.8119,0.4801,1.46,-9.8119,2.9581,8.1091,5.4191,474
-0.2801,-9.7072,0.0079,0.1655,-9.7072,0.8913,13.4247,11.9029,475
-9.503,-10.214,1.2418,5.7505,-10.214,8.0639,76.3799,45.674,476
-52.8571,-9.6743,2.7864,23.8137,-9.6743,15.535,27.5724,13.7681,477
-88.506,-9.5262,-21.3484,41.2795,-9.5262,9.4005,35.5409,28.4042,478
4.0159,-9.6537,7.9889,3.8979,-9.6537,3.6355,16.2468,10.4091,479
-8.1112,-9.7243,-1.3627,5.7882,-9.7243,0.9051,12.1838,11.5499,480
-11.189,-9.7733,-1.2221,4.7274,-9.7733,4.3857,15.3196,5.7219,481
-24.2229,-9.6124,3.0671,11.7194,-9.6124,11.1271,65.36,9.3992,482
-125.3906,-9.6942,-22.9862,72.9324,-9.6942,23.018,58.2629,25.7019,483
-14.9973,-9.6783,3.2744,9.7512,-9.6783,4.9327,16.1035,10.214,484
-114.7866,-9.4341,-7.8762,43.6931,-9.4341,14.5908,37.3521,30.5532,485
-52.4449,-9.6431,5.1775,34.0106,-9.6431,16.3502,30.1593,16.5216,486
-36.7894,-9.6836,-8.3047,14.9626,-9.6836,4.3091,14.7456,10.4197,487
-104.6721,-9.6147,-13.7115,32.2546,-9.6147,10.7205,29.0806,10.0548,488
-59.8957,-9.6528,3.2344,19.3847,-9.6528,6.9789,17.7533,8.4398,489
-19.0207,-9.6881,-0.1669,6.4436,-9.6881,4.5265,17.026,4.755,490
-6.8848,-9.8315,-2.5087,2.2301,-9.8315,2.0794,7.9744,3.6827,491
-35.7316,-9.7646,-8.3963,13.1637,-9.7646,4.7552,12.9128,6.2583,492
-354.7099,-9.66,-30.8521,197.05,-9.66,34.813,68.0155,37.8863,493
-95.0006,-8.7529,-13.5271,41.2974,-8.7529,20.5497,45.7395,20.4648,494
-8.5853,-9.7702,1.7418,6.5905,-9.7702,6.522,14.2609,6.0506,495
-11.0734,-9.6887,-0.9042,3.7043,-9.6887,4.3921,23.7841,5.0701,496
3.3227,-9.7467,6.6763,3.1741,-9.7467,5.9651,20.7621,11.3129,497
-11.4044,-9.4667,1.5761,7.3584,-9.4667,8.4351,20.3936,13.7552,498
-4.2819,-9.7175,0.2075,4.4945,-9.7175,7.3958,15.9991,7.5539,499
-24.9494,-9.7373,0.0183,10.8924,-9.7373,6.7321,11.9647,8.288,500
-39.4202,-9.6654,1.492,14.946,-9.6654,5.3994,19.8697,11.6442,502
-7.3925,-9.8624,-1.6309,5.4162,-9.8624,3.1858,34.0191,12.831,503
-33.0063,-9.5567,-22.1444,8.329,-9.5567,3.8252,14.7072,13.5156,504
-27.7692,-9.5322,-10.3513,11.6259,-9.5322,4.5854,27.4164,26.9162,505
-14.178,-9.5489,-3.9171,8.4121,-9.5489,4.5015,43.3249,40.1208,506
7.5021,-9.5182,19.179,8.1703,-9.5182,3.5297,11.8946,7.9681,507
-113.4078,-9.0726,-55.8564,57.1714,-9.0726,12.8991,33.6163,28.9494,508
17.26,-9.6915,21.4166,3.0688,-9.6915,2.6304,17.415,14.5015,509
-4.1709,-9.7403,-0.5038,1.8938,-9.7403,2.2853,10.6118,8.7787,510
-10.3573,-9.7425,-3.6558,5.545,-9.7425,7.872,12.3756,7.7197,511
-80.8139,-9.9117,-15.6387,29.311,-9.9117,11.0501,51.6184,18.1074,512
-14.2506,-9.9848,7.6096,10.3152,-9.9848,5.9058,20.4455,16.7909,513
-50.6686,-9.6912,-17.2804,22.0498,-9.6912,11.7339,23.6419,9.67,514
-25.6641,-9.7174,-4.64,10.2243,-9.7174,3.5583,19.2693,11.9102,515
-13.1186,-9.7499,-1.5182,4.1451,-9.7499,6.0398,16.0122,3.0559,516
-20.8329,-9.7541,-0.1601,10.778,-9.7541,8.8498,38.8051,33.7591,517
-43.3413,-9.7633,-0.6594,6.497,-9.7633,4.0193,16.7745,2.3342,519
