AYGX_min,AZ_mean,AYGX_mean,AYGX_std,AZ_mean.1,GX_std,Gnorm_max,Gnorm_median,timestamp
-2.9862,-9.6782,0.5891,2.0145,-9.6782,3.2082,9.9828,7.007,1004
-28.4944,-9.6819,-1.1011,6.5568,-9.6819,5.9052,21.3297,6.7769,1005
-231.0482,-9.1585,-28.9861,68.6064,-9.1585,17.9979,40.5614,17.2656,1006
-25.0424,-9.388,8.3718,20.8613,-9.388,8.52,17.4011,6.3158,1007
-4.3672,-9.4533,2.3241,5.1126,-9.4533,2.5184,5.3961,2.0408,1008
