timestamp,AX_mean,AX_min,AX_max,AX_median,AX_std,AX_meandiff,AX_mediandiff,AX_extremum,AX_delta,AY_mean,AY_min,AY_max,AY_median,AY_std,AY_meandiff,AY_mediandiff,AY_extremum,AY_delta,AZ_mean,AZ_min,AZ_max,AZ_median,AZ_std,AZ_meandiff,AZ_mediandiff,AZ_extremum,AZ_delta,GX_mean,GX_min,GX_max,GX_median,GX_std,GX_meandiff,GX_mediandiff,GX_extremum,GX_delta,GY_mean,GY_min,GY_max,GY_median,GY_std,GY_meandiff,GY_mediandiff,GY_extremum,GY_delta,GZ_mean,GZ_min,GZ_max,GZ_median,GZ_std,GZ_meandiff,GZ_mediandiff,GZ_extremum,GZ_delta,AYGX_mean,AYGX_min,AYGX_max,AYGX_median,AYGX_std,AYGX_meandiff,AYGX_mediandiff,AYGX_extremum,AYGX_delta,Anorm_mean,Anorm_min,Anorm_max,Anorm_median,Anorm_std,Anorm_meandiff,Anorm_mediandiff,Anorm_extremum,Anorm_delta,Gnorm_mean,Gnorm_min,Gnorm_max,Gnorm_median,Gnorm_std,Gnorm_meandiff,Gnorm_mediandiff,Gnorm_extremum,Gnorm_delta
0,0.2982,0.2947,0.3017,0.2982,0.002,-0.0013,-0.0006,0.3017,0.0071,2.5087,2.5014,2.5229,2.5085,0.0044,-0.0006,-0.0006,2.5229,0.0215,-9.6151,-9.6202,-9.6092,-9.615,0.0028,0.0008,0.0003,9.6202,0.011,-0.2514,-0.2822,-0.1907,-0.2507,0.0196,-0.0089,-0.0113,0.2822,0.0915,2.3379,2.3188,2.3625,2.3362,0.0105,0.0084,0.0088,2.3625,0.0438,0.1799,0.1589,0.1979,0.1814,0.0101,0.0005,-0.0,0.1979,0.039,-0.6307,-0.708,-0.4794,-0.6291,0.0494,-0.0223,-0.0283,0.708,0.2286,9.9415,9.936,9.9462,9.9413,0.0027,-0.0009,-0.001,9.9462,0.0102,2.3584,2.3336,2.3828,2.358,0.0112,0.0093,0.0072,2.3828,0.0492
1,0.2969,0.2902,0.3002,0.2975,0.0023,0.0002,-0.0003,0.3002,0.0101,2.5081,2.4936,2.5229,2.5079,0.0056,0.0001,0.0,2.5229,0.0293,-9.6143,-9.6192,-9.6068,-9.6147,0.003,-0.0003,-0.0003,9.6192,0.0124,-0.2604,-0.2927,-0.2372,-0.262,0.0156,0.0003,0.0034,0.2927,0.0555,2.3463,2.3188,2.3713,2.345,0.0137,-0.0003,0.0,2.3713,0.0525,0.1804,0.1619,0.1994,0.1814,0.0088,-0.0006,-0.0026,0.1994,0.0375,-0.653,-0.7343,-0.5953,-0.6573,0.0391,0.0008,0.0085,0.7343,0.1391,9.9405,9.9347,9.9482,9.9404,0.0035,0.0003,0.0004,9.9482,0.0135,2.3677,2.3373,2.3929,2.3652,0.0137,-0.0004,0.0011,2.3929,0.0555
3,0.2973,0.2916,0.3027,0.2969,0.0028,0.0005,0.0011,0.3027,0.0111,2.5084,2.5008,2.5157,2.5079,0.0042,0.0002,0.0006,2.5157,0.015,-9.615,-9.6192,-9.6099,-9.6154,0.0022,0.0001,0.0,9.6192,0.0093,-0.2597,-0.2912,-0.2087,-0.2552,0.0206,-0.0038,-0.0127,0.2912,0.0825,2.3457,2.3275,2.3625,2.345,0.0108,0.004,0.0088,2.3625,0.035,0.1793,0.1574,0.2009,0.1762,0.0121,-0.0019,-0.0008,0.2009,0.0435,-0.6513,-0.7291,-0.5237,-0.6403,0.0513,-0.0096,-0.0306,0.7291,0.2054,9.9412,9.9371,9.9465,9.9412,0.0023,-0.0001,0.0,9.9465,0.0094,2.3669,2.3423,2.3875,2.3674,0.0113,0.0043,0.006,2.3875,0.0452
4,0.2978,0.2916,0.303,0.2981,0.0026,-0.0004,-0.0005,0.303,0.0114,2.5085,2.5008,2.5157,2.5085,0.0037,0.0002,0.0009,2.5157,0.015,-9.6148,-9.6195,-9.6099,-9.6154,0.0024,-0.0003,0.0011,9.6195,0.0096,-0.2634,-0.3047,-0.2222,-0.268,0.0198,0.0042,0.0113,0.3047,0.0825,2.3497,2.3275,2.3625,2.3538,0.0092,0.0013,0.0,2.3625,0.035,0.1774,0.1559,0.2084,0.1754,0.0116,-0.0014,0.0008,0.2084,0.0525,-0.6609,-0.7646,-0.5573,-0.6709,0.05,0.0105,0.027,0.7646,0.2074,9.9411,9.9363,9.9453,9.9413,0.0024,0.0003,-0.0003,9.9453,0.009,2.3712,2.3455,2.3869,2.3735,0.0098,0.0007,0.0006,2.3869,0.0414
5,0.2974,0.292,0.3011,0.2976,0.0025,0.0007,0.0003,0.3011,0.0091,2.5088,2.502,2.5127,2.5094,0.0027,-0.0001,-0.0024,2.5127,0.0108,-9.6151,-9.6232,-9.6098,-9.6142,0.0031,0.0006,-0.0012,9.6232,0.0134,-0.2593,-0.2852,-0.2417,-0.2567,0.0107,-0.0032,-0.0045,0.2852,0.0435,2.3511,2.31,2.3713,2.3538,0.0123,-0.003,0.0,2.3713,0.0613,0.176,0.1529,0.1994,0.1762,0.0108,0.004,0.0038,0.1994,0.0465,-0.6504,-0.7162,-0.6066,-0.6439,0.0271,-0.0079,-0.0109,0.7162,0.1096,9.9415,9.9359,9.9501,9.9409,0.0033,-0.0006,0.0005,9.9501,0.0142,2.3719,2.3306,2.3924,2.374,0.0122,-0.0023,-0.0006,2.3924,0.0617
6,0.2981,0.2916,0.3039,0.2979,0.0024,0.0002,0.0003,0.3039,0.0123,2.5086,2.5031,2.5157,2.507,0.004,0.0004,0.003,2.5157,0.0126,-9.6146,-9.6199,-9.6104,-9.6154,0.0028,-0.0004,0.0008,9.6199,0.0095,-0.2624,-0.2927,-0.2297,-0.2612,0.0174,-0.0047,-0.0075,0.2927,0.063,2.348,2.3275,2.3713,2.3538,0.0124,-0.0017,-0.0088,2.3713,0.0438,0.18,0.1604,0.1979,0.1799,0.0084,-0.0001,-0.003,0.1979,0.0375,-0.6584,-0.7336,-0.5757,-0.6548,0.0438,-0.0118,-0.019,0.7336,0.158,9.9409,9.9354,9.9475,9.9415,0.0027,0.0004,-0.0003,9.9475,0.0121,2.3696,2.349,2.3904,2.3735,0.0118,-0.0011,-0.0052,2.3904,0.0414
7,0.2982,0.2925,0.3024,0.2982,0.0027,-0.0004,-0.0002,0.3024,0.0099,2.509,2.502,2.5157,2.51,0.0036,-0.0001,-0.0024,2.5157,0.0138,-9.6149,-9.6196,-9.6087,-9.6146,0.0024,0.0003,0.0001,9.6196,0.0109,-0.2671,-0.3077,-0.2387,-0.2687,0.0181,0.0001,0.003,0.3077,0.069,2.3463,2.3275,2.3625,2.345,0.0085,0.0017,0.0,2.3625,0.035,0.1799,0.1589,0.2114,0.1769,0.0133,-0.0027,-0.0015,0.2114,0.0525,-0.6702,-0.7742,-0.5987,-0.6739,0.0457,0.0002,0.006,0.7742,0.1755,9.9414,9.9363,9.9465,9.9411,0.0024,-0.0003,-0.0003,9.9465,0.0103,2.3684,2.3475,2.3887,2.3683,0.0095,0.0015,-0.0011,2.3887,0.0412
8,0.2978,0.2894,0.3043,0.298,0.0028,0.0015,0.0011,0.3043,0.0149,2.5089,2.5002,2.5157,2.5076,0.004,0.0014,0.0033,2.5157,0.0156,-9.6146,-9.6197,-9.6108,-9.6146,0.0021,-0.0004,-0.0003,9.6197,0.0089,-0.267,-0.3333,-0.2207,-0.2657,0.0224,0.0096,0.003,0.3333,0.1126,2.348,2.3275,2.3713,2.345,0.0102,-0.014,-0.0131,2.3713,0.0438,0.1772,0.1544,0.1979,0.1754,0.0109,-0.0014,0.0023,0.1979,0.0435,-0.67,-0.8376,-0.553,-0.6679,0.0565,0.0237,0.0088,0.8376,0.2846,9.941,9.9364,9.9459,9.9409,0.0022,0.0007,0.0003,9.9459,0.0095,2.3699,2.3485,2.4027,2.3672,0.0118,-0.015,-0.0145,2.4027,0.0542
9,0.2992,0.2974,0.3021,0.2991,0.0016,-0.0028,-0.003,0.3021,0.0046,2.5103,2.5049,2.5145,2.5109,0.0033,-0.0022,-0.003,2.5145,0.0096,-9.615,-9.6181,-9.6127,-9.6148,0.002,0.0003,0.0005,9.6181,0.0053,-0.2575,-0.2807,-0.2207,-0.2627,0.0218,-0.0022,0.0045,0.2807,0.06,2.3341,2.3188,2.345,2.3319,0.0102,0.0055,0.0044,2.345,0.0263,0.1758,0.1634,0.1859,0.1777,0.009,-0.0034,-0.006,0.1859,0.0225,-0.6463,-0.7049,-0.553,-0.6591,0.0551,-0.0049,0.0115,0.7049,0.1519,9.9418,9.9398,9.9449,9.9411,0.0018,-0.001,-0.0001,9.9449,0.0051,2.3549,2.3388,2.3685,2.3527,0.0103,0.0054,0.0045,2.3685,0.0297
10,0.2965,0.2936,0.3013,0.2961,0.0022,-0.0002,0.0007,0.3013,0.0077,2.5081,2.5049,2.5109,2.5079,0.0018,0.0018,0.0012,2.5109,0.006,-9.6146,-9.6188,-9.6107,-9.6143,0.0021,0.0014,0.0012,9.6188,0.0081,-0.2597,-0.2807,-0.2432,-0.2582,0.0107,-0.0064,-0.0045,0.2807,0.0375,2.3395,2.3275,2.3625,2.3362,0.0099,0.0098,0.0175,2.3625,0.035,0.1723,0.1484,0.2009,0.1717,0.0131,0.0008,0.0015,0.2009,0.0525,-0.6512,-0.7044,-0.6097,-0.6476,0.0269,-0.0166,-0.0123,0.7044,0.0947,9.9408,9.9374,9.9447,9.941,0.002,-0.0009,-0.0015,9.9447,0.0073,2.3603,2.3465,2.3816,2.3572,0.0101,0.0105,0.0168,2.3816,0.0352
11,0.2963,0.2928,0.3007,0.2968,0.0026,0.1013,0.017,0.3007,0.0079,2.5099,2.5079,2.5145,2.5091,0.0022,-0.8216,-0.1418,2.5145,0.0066,-9.6133,-9.6179,-9.6091,-9.6131,0.0029,-0.013,-0.0005,9.6179,0.0087,-0.2661,-0.2927,-0.2372,-0.2627,0.0187,6.4495,5.2909,0.2927,0.0555,2.3494,2.3275,2.3625,2.3538,0.0105,0.2656,0.0941,2.3625,0.035,0.1732,0.1649,0.1814,0.1732,0.0056,0.2258,0.003,0.1814,0.0165,-0.6679,-0.7343,-0.5949,-0.6599,0.0469,-0.2722,-0.0177,0.7343,0.1394,9.9399,9.9359,9.9439,9.9395,0.0027,0.0049,0.0003,9.9439,0.008,2.3708,2.346,2.3875,2.374,0.0122,5.7552,4.1655,2.3875,0.0415
13,0.4989,-0.2027,1.3161,0.3307,0.3492,0.397,0.5586,1.3161,1.5188,0.8667,-3.6383,3.5396,2.2255,2.2531,-2.6607,-3.925,3.6383,7.1779,-9.6393,-10.177,-9.311,-9.6141,0.1484,0.034,0.0377,10.177,0.8659,12.6329,-1.1781,32.9605,10.319,12.0556,-5.0228,-2.6952,32.9605,34.1386,2.8805,1.575,4.5937,2.5419,0.7495,-1.451,-1.085,4.5937,3.0187,0.6248,-2.6697,4.6337,0.1792,1.7823,-4.3475,-4.095,4.6337,7.3034,-1.2123,-64.5151,67.4549,-0.6953,30.3101,-12.6749,-9.5006,67.4549,131.9699,9.9498,9.5294,10.4918,9.9401,0.1845,-0.1277,-0.136,10.4918,0.9624,13.8811,2.2388,33.3306,10.705,11.1431,-5.0283,-1.6645,33.3306,31.0917
14,0.8958,0.5813,1.0776,0.8893,0.1637,0.0305,0.0152,1.0776,0.4963,-1.794,-2.5869,-1.3021,-1.6995,0.4368,-0.6398,-0.6651,2.5869,1.2848,-9.6053,-9.7886,-9.4641,-9.5764,0.1268,0.0813,0.0695,9.7886,0.3244,7.6101,1.4961,13.8211,7.6238,4.9788,-10.5244,-11.4343,13.8211,12.325,1.4295,1.1462,1.645,1.4569,0.159,0.7339,0.6913,1.645,0.4987,-3.7227,-4.6401,-2.388,-3.9158,0.9224,2.9146,3.0625,4.6401,2.2521,-13.8872,-35.7542,-3.2983,-10.1959,11.4231,26.2626,25.4529,35.7542,32.4559,9.8221,9.6436,10.0145,9.8042,0.1227,0.1074,0.1323,10.0145,0.3709,8.8528,3.1743,14.2615,9.0405,4.5228,2.6567,3.2182,14.2615,11.0871
16,0.9568,0.2331,1.5747,0.9197,0.4431,-1.0691,-1.1906,1.5747,1.3416,-3.0735,-4.442,-1.0454,-3.0297,1.1411,2.4369,2.5106,4.442,3.3966,-9.4428,-9.6765,-9.2008,-9.4374,0.1507,-0.437,-0.3909,9.6765,0.4757,-13.4388,-16.2107,-5.5866,-15.2448,3.7747,10.4588,13.4824,16.2107,10.624,2.8973,2.4763,3.5175,2.8394,0.3474,0.8728,1.4656,3.5175,1.0412,2.1064,0.0938,4.4728,2.2093,1.7849,6.357,6.5785,4.4728,4.379,38.6379,15.8401,52.5872,40.7098,12.8362,-38.9606,-40.3582,52.5872,36.7471,10.0369,9.263,10.4354,10.0688,0.3682,-0.088,-0.118,10.4354,1.1724,14.1663,7.9743,16.4971,15.477,3.0441,-3.595,-3.7544,16.4971,8.5229
17,-0.1123,-0.5566,0.727,-0.2708,0.4384,0.7305,0.9243,0.727,1.2836,-0.6366,-2.1573,0.827,-0.5191,0.9545,0.1932,0.1583,2.1573,2.9843,-9.8798,-10.2088,-9.6411,-9.8282,0.2064,0.0353,0.0148,10.2088,0.5677,-2.9799,-11.5415,3.0409,-1.7625,4.7191,-11.7378,-13.124,11.5415,14.5824,3.7702,1.8025,4.6375,4.305,0.9928,0.0744,-0.385,4.6375,2.835,8.4634,3.6544,11.6484,8.7878,2.7341,1.499,1.7174,11.6484,7.994,-0.3227,-6.5749,4.8047,0.3516,3.5341,6.8084,4.8287,6.5749,11.3796,9.949,9.6614,10.3285,9.9508,0.2357,-0.0641,-0.0599,10.3285,0.6671,10.5713,5.0844,14.44,11.7226,3.3572,7.697,7.2931,14.44,9.3556
18,0.6182,0.2786,0.8694,0.6535,0.1959,-0.1982,-0.1188,0.8694,0.5908,-0.4434,-1.1651,0.1203,-0.3608,0.4616,-0.2698,-0.3507,1.1651,1.2854,-9.8445,-10.1107,-9.5792,-9.8134,0.1874,-0.1107,-0.1158,10.1107,0.5315,-14.7177,-16.884,-12.6788,-14.8865,1.511,15.5872,14.6981,16.884,4.2052,3.8445,3.2288,4.2263,3.92,0.3554,3.3031,3.1544,4.2263,0.9975,9.9625,4.9785,12.2024,10.5052,2.3676,27.9967,27.8877,12.2024,7.2239,6.4857,-1.9074,17.119,5.1802,6.9978,-8.3367,-5.0777,17.119,19.0264,9.8848,9.6041,10.1893,9.8909,0.1948,0.1205,0.0637,10.1893,0.5851,18.2683,13.9987,20.2749,19.0157,2.118,20.5527,20.0411,20.2749,6.2762
19,0.42,-0.0893,0.8505,0.5347,0.3108,-0.3924,-0.563,0.8505,0.9399,-0.7132,-1.4398,0.0497,-0.7115,0.5271,0.985,1.0296,1.4398,1.4894,-9.9552,-10.2911,-9.6424,-9.9292,0.2238,0.003,0.0405,10.2911,0.6486,0.8694,-4.357,8.5007,-0.1884,3.8952,10.5056,11.6819,8.5007,12.8576,7.1477,6.2738,8.05,7.0744,0.5108,-3.2572,-3.5175,8.05,1.7763,37.9591,33.7106,41.3992,38.3929,2.7511,1.4521,1.4532,41.3992,7.6885,-1.8509,-12.239,1.5591,0.1026,4.7593,4.6377,4.1375,12.239,13.7982,10.0053,9.643,10.426,9.9546,0.2523,-0.0217,-0.0376,10.426,0.7831,38.821,35.3274,42.399,39.0568,2.5733,2.4314,3.1648,42.399,7.0716
20,0.0277,-0.4241,0.5669,-0.0283,0.3096,0.0971,0.0948,0.5669,0.991,0.2718,-0.6128,1.1992,0.3181,0.7296,0.3654,0.2717,1.1992,1.812,-9.9522,-10.4038,-9.6663,-9.8887,0.257,0.028,0.0143,10.4038,0.7375,11.375,8.0781,13.5127,11.4935,2.0518,-15.0616,-13.3665,13.5127,5.4345,3.8905,2.7475,6.265,3.5569,1.2505,-1.5862,-1.3956,6.265,3.5175,39.4112,35.0594,42.8894,39.846,3.1668,-0.0557,-0.4682,42.8894,7.83,2.7867,-6.3199,11.7077,4.2401,7.7383,-6.0243,-5.2837,11.7077,18.0276,9.9836,9.6875,10.4134,9.917,0.2522,-0.0249,-0.0115,10.4134,0.7259,41.2524,36.1037,44.4913,42.2217,3.3536,-1.529,-2.5821,44.4913,8.3875
21,0.1247,-0.3759,0.8045,0.0665,0.2737,-0.0448,0.0005,0.8045,1.1804,0.6371,-0.1789,1.5505,0.5897,0.4437,0.8868,0.9443,1.5505,1.7294,-9.9242,-10.9211,-8.6564,-9.8744,0.5055,0.0986,0.0608,10.9211,2.2647,-3.6866,-12.1131,0.6036,-1.873,3.3941,-0.9688,-2.8571,12.1131,12.7167,2.3043,0.5425,4.6375,2.1613,1.0408,-2.6247,-2.3888,4.6375,4.095,39.3556,34.9348,45.3033,39.3778,2.8475,7.5668,8.2815,45.3033,10.3686,-3.2376,-14.345,0.1069,-1.0436,4.4449,-3.8329,-5.9059,14.345,14.4519,9.9587,8.7489,10.9322,9.9055,0.5015,-0.0123,0.0612,10.9322,2.1833,39.7234,34.9997,47.0094,39.6395,3.1804,7.4547,8.2133,47.0094,12.0097
22,0.0799,-0.0442,0.2481,0.067,0.1104,0.2517,0.2572,0.2481,0.2923,1.5239,1.0825,1.9688,1.534,0.2507,-1.2027,-1.0975,1.9688,0.8862,-9.8256,-10.1338,-9.4318,-9.8136,0.248,-0.0686,0.0188,10.1338,0.7019,-4.6553,-6.6133,-1.7274,-4.7301,1.4387,3.0454,3.0721,6.6133,4.8859,-0.3205,-0.9012,0.0875,-0.2275,0.3857,2.2202,2.0081,0.9012,0.9887,46.9223,42.9118,48.8633,47.6593,2.1139,-31.9149,-29.6039,48.8633,5.9515,-7.0705,-10.3053,-2.6308,-6.9496,2.4457,6.4216,6.5585,10.3053,7.6745,9.9464,9.5314,10.2699,9.9667,0.2584,0.0045,-0.1237,10.2699,0.7384,47.1781,43.4202,49.0406,47.8529,2.0162,-30.928,-29.7598,49.0406,5.6205
23,0.3317,-0.9607,2.0811,0.3242,0.6394,0.4487,0.365,2.0811,3.0418,0.3212,-1.818,1.6265,0.4365,0.7253,0.1233,0.0595,1.818,3.4444,-9.8942,-10.8638,-9.1143,-9.7948,0.4424,-0.0095,-0.0626,10.8638,1.7496,-1.6099,-5.3559,2.0726,-1.658,2.0956,3.3083,2.8913,5.3559,7.4285,1.8998,0.4725,3.9638,1.7806,0.8822,0.5994,0.5994,3.9638,3.4913,15.0075,-2.729,26.7954,18.0554,10.4022,-15.4876,-18.4153,26.7954,29.5244,-0.649,-3.9838,3.6988,-0.3911,1.5949,1.4128,0.4828,3.9838,7.6826,9.9509,9.15,10.8654,9.843,0.4258,0.0285,0.0582,10.8654,1.7155,16.2501,1.411,26.8993,18.0931,8.9122,-11.7503,-13.2312,26.8993,25.4884
24,0.7804,-0.388,1.8765,0.6892,0.5796,0.2067,0.4145,1.8765,2.2645,0.4445,-0.8539,1.5666,0.4961,0.6135,-0.2376,-0.1685,1.5666,2.4206,-9.9037,-11.0503,-8.5472,-9.8574,0.6889,-0.0158,-0.0164,11.0503,2.5032,1.6984,-1.7684,5.765,1.2332,1.8757,0.0107,0.3164,5.765,7.5334,2.4991,1.3475,3.9025,2.38,0.7098,-0.0925,-0.2231,3.9025,2.555,-0.4801,-5.8315,5.4098,-0.3599,3.0022,3.2853,3.6608,5.8315,11.2413,0.7638,-1.9425,6.0558,0.0918,1.8625,-0.1242,0.3971,6.0558,7.9982,9.9795,8.5944,11.1484,9.9011,0.677,0.0374,0.0889,11.1484,2.5541,4.4998,2.2959,6.9961,4.8618,1.3084,2.6541,1.9545,6.9961,4.7002
25,0.9871,-0.5342,2.4941,1.1038,0.7385,-0.6738,-0.7563,2.4941,3.0284,0.207,-1.0562,1.3165,0.3276,0.6281,-0.8779,-0.9569,1.3165,2.3727,-9.9194,-11.084,-8.4929,-9.8738,0.5438,-0.1,0.0654,11.084,2.5911,1.709,-3.9469,7.3036,1.5496,2.8758,-7.6929,-9.6618,7.3036,11.2505,2.4066,1.33,4.725,2.1569,0.9144,-0.5801,-0.0962,4.725,3.395,2.8052,-8.1122,14.7065,3.301,6.0084,-0.1432,-1.0012,14.7065,22.8187,0.6397,-2.2438,3.4106,0.4888,1.6082,3.7918,3.6637,3.4106,5.6544,10.0168,8.7229,11.1114,9.99,0.52,0.0401,-0.1215,11.1114,2.3885,7.1539,2.4479,15.2888,6.8163,3.0176,5.0511,5.2889,15.2888,12.8409
26,0.3133,-0.2662,0.8919,0.3475,0.3823,0.3784,0.3571,0.8919,1.158,-0.671,-1.1675,-0.1813,-0.6292,0.2863,0.3675,0.3324,1.1675,0.9862,-10.0194,-11.5533,-8.9558,-9.8084,0.8844,-0.0425,-0.3618,11.5533,2.5975,-5.9839,-10.0723,1.8181,-8.1122,4.7215,1.9255,2.8263,10.0723,11.8905,1.8266,0.49,2.73,2.0606,0.8074,2.4628,1.5663,2.73,2.24,2.6621,-13.2703,18.1949,2.2998,11.0779,-21.3956,-20.0665,18.1949,31.4652,4.4315,-1.026,11.3492,4.1526,4.466,-3.2085,-3.7503,11.3492,12.3752,10.057,8.9782,11.5702,9.8685,0.8805,0.0453,0.3714,11.5702,2.592,12.2051,5.2755,20.6624,12.1052,5.3155,8.7804,7.4187,20.6624,15.3869
27,0.6917,0.0233,1.3212,0.7046,0.3604,0.0372,-0.1097,1.3212,1.2979,-0.3035,-0.9305,0.295,-0.2968,0.3482,1.6447,1.327,0.9305,1.2255,-10.0619,-11.697,-7.947,-10.1702,0.7851,0.1625,0.4031,11.697,3.7501,-4.0584,-8.8695,6.8928,-5.2859,4.625,18.2733,19.6044,8.8695,15.7622,4.2893,0.8313,7.805,3.6269,2.1718,0.0868,1.015,7.805,6.9738,-18.7335,-36.2925,-2.409,-17.7667,12.7239,-9.6618,-14.804,36.2925,33.8834,1.223,-5.6673,7.7569,0.4023,2.8531,19.8116,14.3319,7.7569,13.4242,10.1023,7.9543,11.6972,10.2399,0.7828,-0.0049,-0.2561,11.6972,3.7429,20.9855,5.7002,37.4909,19.5239,11.448,12.1067,16.3788,37.4909,31.7907
28,0.7289,0.3271,1.6879,0.5949,0.4334,0.2396,0.2467,1.6879,1.3609,1.3412,-0.219,3.1159,1.0302,1.295,-1.4151,-0.8701,3.1159,3.3349,-9.8994,-10.4879,-9.3285,-9.7671,0.4328,0.0356,-0.1438,10.4879,1.1594,14.2149,11.0872,16.57,14.3184,1.8944,-9.0914,-10.4645,16.57,5.4827,4.3761,2.8787,5.3025,4.6419,0.8608,-2.0792,-2.2137,5.3025,2.4238,-28.3954,-41.4384,-5.5741,-32.5707,12.8947,27.5221,31.9358,41.4384,35.8643,21.0346,-2.4283,51.6307,14.7342,21.0005,-22.3427,-14.1487,51.6307,54.059,10.0974,9.6353,10.87,9.9839,0.4369,-0.1552,0.0009,10.87,1.2347,33.0922,16.9014,43.1385,35.9027,9.6627,-27.1652,-30.5328,43.1385,26.2371
29,0.9685,0.3114,1.7945,0.8416,0.4818,0.0925,0.2421,1.7945,1.4831,-0.0739,-1.3566,0.5069,0.1601,0.6143,-1.2882,-1.5484,1.3566,1.8634,-9.8639,-11.0664,-8.4253,-9.9109,0.9109,0.0392,0.1746,11.0664,2.641,5.1235,3.4218,8.6318,3.8539,2.1601,-15.4788,-15.0796,8.6318,5.2099,2.2969,0.6562,4.0688,2.4281,1.1627,0.688,0.2056,4.0688,3.4125,-0.8733,-2.7452,0.6103,-0.635,1.0721,13.9048,13.0961,2.7452,3.3554,-1.3081,-11.7098,1.9217,0.5854,4.6774,16.4891,15.0633,11.7098,13.6315,9.9422,8.6292,11.1082,9.9847,0.8627,0.0518,-0.0408,11.1082,2.479,5.927,3.9693,9.2354,5.3699,1.9799,14.2215,12.9489,9.2354,5.2661
30,1.061,0.4758,1.5259,1.0837,0.3493,-0.6517,-0.6903,1.5259,1.0501,-1.3621,-2.3069,-0.6122,-1.3883,0.5724,1.3985,1.5044,2.3069,1.6947,-9.8247,-10.3378,-9.4329,-9.7363,0.3645,-0.1371,-0.188,10.3378,0.9049,-10.3553,-13.4331,-4.2422,-11.2257,3.1195,6.2654,8.0441,13.4331,9.1909,2.9848,1.5575,5.6175,2.6338,1.3436,0.0653,0.4506,5.6175,4.06,13.0315,-7.0916,34.1792,12.4612,15.7467,-13.7587,-13.2045,34.1792,41.2708,15.181,4.3588,29.6777,15.6488,9.4003,-13.94,-15.4688,29.6777,25.3189,9.994,9.5708,10.6556,9.9439,0.3915,0.0108,0.0308,10.6556,1.0847,20.1485,8.4598,36.0109,18.3188,11.0614,-8.8508,-6.9995,36.0109,27.5511
31,0.4093,-0.6926,1.3035,0.3934,0.513,0.1875,0.201,1.3035,1.9961,0.0365,-1.3572,1.1118,0.1161,0.653,-0.1374,-0.1583,1.3572,2.469,-9.9617,-11.5371,-8.368,-9.9242,0.8705,0.0612,0.0065,11.5371,3.1691,-4.0899,-12.5883,3.4622,-3.1816,4.9287,2.3083,1.8755,12.5883,16.0506,3.0501,1.3913,5.425,3.0844,1.0189,-0.2578,-0.2516,5.425,4.0338,-0.7272,-17.364,13.7301,-0.7433,10.0251,-2.9108,-2.3605,17.364,31.0942,1.2409,-7.1036,13.903,0.18,4.9628,-0.9037,-0.1228,13.903,21.0066,10.0048,8.4465,11.5548,9.9748,0.8521,-0.0268,0.0205,11.5548,3.1083,11.2976,3.953,18.7811,11.3194,4.5123,-0.8878,-1.8177,18.7811,14.8281
33,0.7843,-2.0885,2.6645,0.7954,0.8692,-0.3571,-0.3298,2.6645,4.753,-0.2383,-0.9132,0.4674,-0.2005,0.3286,0.4106,0.4186,0.9132,1.3805,-9.8394,-17.8829,-2.407,-9.9112,2.7672,-0.0859,0.1207,17.8829,15.4759,0.5267,-3.6092,5.1352,0.5694,2.327,6.0849,7.0468,5.1352,8.7444,2.5346,-3.22,11.025,2.5812,2.4552,1.3965,0.8706,11.025,14.245,-6.5488,-17.5765,7.5538,-5.4644,7.6351,26.1987,23.3644,17.5765,25.1303,-0.5665,-4.6893,0.6067,-0.0657,1.2045,2.2782,0.6908,4.6893,5.296,9.9513,3.6081,18.0267,10.0158,2.629,0.0044,-0.1701,18.0267,14.4186,9.522,3.2223,18.181,7.684,5.1839,12.001,11.4977,18.181,14.9587
34,0.4272,-0.8176,1.4085,0.4656,0.5057,-0.1933,-0.3019,1.4085,2.226,0.1724,-0.6349,0.7007,0.2181,0.3629,-0.2114,-0.2851,0.7007,1.3357,-9.9253,-12.0154,-8.6451,-9.7906,0.7553,0.185,0.1001,12.0154,3.3703,6.6116,-0.8133,10.9035,7.6162,3.4279,-0.2628,-1.4878,10.9035,11.7168,3.9311,1.2162,7.6912,3.4519,1.797,2.545,2.7256,7.6912,6.475,19.6499,11.3346,33.0207,17.9,6.364,14.9281,16.6865,33.0207,21.6861,1.7117,-3.4357,6.5055,0.6251,2.8102,-2.1716,-1.1111,6.5055,9.9412,9.9556,8.7853,12.0257,9.8457,0.7425,-0.2033,-0.1459,12.0257,3.2404,21.523,14.0688,33.7034,19.1817,6.067,14.2509,16.6172,33.7034,19.6346
35,0.2339,-0.2375,0.8192,0.1636,0.3263,-0.556,-0.6835,0.8192,1.0568,-0.039,-0.4063,0.2813,-0.067,0.2734,-0.0087,0.0739,0.4063,0.6876,-9.7403,-11.4489,-8.0535,-9.6905,1.1962,-0.5907,-1.0634,11.4489,3.3953,6.3488,5.1101,7.807,6.1283,1.0784,-15.1107,-14.8146,7.807,2.6969,6.4761,5.3463,8.9338,6.1775,1.1316,5.8855,7.4856,8.9338,3.5875,34.578,33.0046,36.018,34.5865,1.1228,11.7016,11.2528,36.018,3.0134,-0.4598,-3.1721,1.7363,-0.486,1.8342,0.6119,0.6165,3.1721,4.9084,9.7524,8.0963,11.4548,9.6998,1.1858,0.9099,1.0725,11.4548,3.3585,35.7739,34.3823,37.8662,35.7989,1.2435,13.1682,12.3433,37.8662,3.4839
36,-0.322,-4.0008,3.0052,-0.5199,2.3405,0.4986,0.6744,4.0008,7.0059,-0.0477,-1.0634,0.7229,0.0069,0.5623,0.364,0.3573,1.0634,1.7863,-10.331,-16.772,-3.4875,-10.7538,4.2214,0.3752,0.6832,16.772,13.2845,-8.7619,-12.7848,-5.8702,-8.6863,2.0401,9.0372,8.2743,12.7848,6.9145,12.3616,2.3888,16.9838,13.6631,4.7527,-7.6628,-8.7325,16.9838,14.595,46.2795,43.3301,49.575,45.8392,2.6388,-27.5125,-27.1269,49.575,6.2449,0.1521,-6.4373,7.5872,0.1305,4.553,0.0147,-0.0497,7.5872,14.0245,10.6623,4.6601,17.2495,10.7722,3.973,-0.6863,-0.6934,17.2495,12.5894,48.942,45.8701,52.2478,48.1422,2.519,-29.457,-28.5319,52.2478,6.3777
37,0.1766,-0.5402,1.1972,0.1545,0.526,0.2187,0.232,1.1972,1.7374,0.3163,-0.0227,0.5128,0.3641,0.1764,-0.4207,-0.3833,0.5128,0.5356,-9.9558,-11.3302,-8.5364,-10.0706,0.8761,0.0229,0.1186,11.3302,2.7938,0.2753,-1.4089,2.7883,-0.412,1.8066,-14.1464,-13.5764,2.7883,4.1973,4.6988,2.275,6.5275,4.9306,1.736,-3.8697,-3.7844,6.5275,4.2525,18.767,17.9121,19.8501,18.7123,0.7638,-17.2726,-18.5674,19.8501,1.938,0.1668,-0.5776,1.0128,0.0808,0.6085,1.4668,0.1834,1.0128,1.5904,9.976,8.5617,11.3349,10.0788,0.8741,-0.0247,-0.119,11.3349,2.7732,19.4851,18.1659,21.0037,19.6103,0.8886,-4.54,-5.4961,21.0037,2.8377
38,0.3953,-0.1613,1.0325,0.3865,0.3816,-0.2278,-0.228,1.0325,1.1938,-0.1044,-0.5691,0.1747,-0.0191,0.2724,0.2878,0.123,0.5691,0.7438,-9.9329,-10.3778,-9.4158,-9.952,0.2969,0.0766,0.292,10.3778,0.962,-13.8711,-15.8788,-11.8441,-13.9884,1.3415,17.8399,17.8457,15.8788,4.0347,0.8291,-0.6737,1.8288,1.1463,0.8463,1.435,1.1112,1.8288,2.5025,1.4945,-5.1771,10.7118,0.1449,5.8481,-4.0096,-1.585,10.7118,15.8889,1.6336,-2.179,8.2383,0.2642,3.8796,-0.4445,0.1354,8.2383,10.4174,9.9513,9.4894,10.3789,9.9598,0.2823,-0.0831,-0.2902,10.3789,0.8896,14.9451,13.0548,19.1672,14.1142,2.1645,-9.5253,-9.4265,19.1672,6.1123
39,0.1675,-0.3742,0.5411,0.1585,0.3061,-0.0137,0.0225,0.5411,0.9152,0.1833,-0.2501,0.6451,0.1038,0.3241,-0.1824,-0.1131,0.6451,0.8952,-9.8563,-10.5444,-9.4129,-9.66,0.4818,-0.0301,-0.3202,10.5444,1.1315,3.9688,1.6668,6.8414,3.8572,1.781,-5.5773,-5.5805,6.8414,5.1746,2.2641,1.05,3.8675,2.2575,0.9119,0.0191,0.0744,3.8675,2.8175,-2.5151,-7.2406,-0.7876,-1.4401,2.2985,1.0893,-1.3794,7.2406,6.453,1.1891,-0.5471,3.6078,0.3996,1.7098,-1.304,-0.4229,3.6078,4.1549,9.8682,9.4131,10.5681,9.6696,0.4817,0.0275,0.3128,10.5681,1.155,5.4198,2.6967,10.2521,4.6877,2.609,-1.4603,-0.4745,10.2521,7.5554
40,0.1538,-0.3518,0.6773,0.181,0.2831,-0.5676,-0.6192,0.6773,1.0291,0.0009,-0.5182,0.7851,-0.0093,0.2996,0.1754,0.207,0.7851,1.3033,-9.8863,-10.6765,-8.462,-9.9802,0.6033,-0.1172,-0.0433,10.6765,2.2145,-1.6085,-3.0013,0.1821,-1.7233,1.0443,2.4736,4.0054,3.0013,3.1835,2.2832,0.9188,4.4713,2.3319,1.0792,1.0454,1.6231,4.4713,3.5525,-1.4258,-3.5146,3.4094,-2.8195,2.385,9.5877,11.1368,3.5146,6.9241,-0.1149,-2.3564,0.8773,-0.0232,0.7263,0.6955,0.6086,2.3564,3.2337,9.8957,8.4823,10.6821,9.9824,0.6008,0.1249,0.06,10.6821,2.1999,3.9594,1.2198,6.1959,4.2132,1.3077,6.2489,5.9903,6.1959,4.9761
41,-0.4138,-1.0211,0.3247,-0.4382,0.3193,-0.3912,-0.3232,1.0211,1.3458,0.1763,-0.225,0.6307,0.1978,0.2182,-0.04,-0.0335,0.6307,0.8557,-10.0035,-11.1403,-8.7171,-10.0235,0.6319,-0.1385,-0.0061,11.1403,2.4232,0.8651,-6.1389,7.3326,2.2822,4.3439,0.2315,-0.6598,7.3326,13.4716,3.3286,-0.7438,6.65,3.955,1.94,-0.6426,-0.7831,6.65,7.3938,8.1618,1.3537,13.554,8.3173,3.1566,-0.2805,-2.8554,13.554,12.2003,0.5806,-1.26,2.6713,0.5854,0.9671,0.2042,-0.1694,2.6713,3.9313,10.0206,8.7233,11.1423,10.0425,0.6351,0.1938,0.0286,11.1423,2.419,10.2084,7.1142,14.2393,10.2036,2.3895,0.035,-2.1641,14.2393,7.1251
43,-1.1962,-6.1687,1.0742,-1.0846,1.1328,1.2739,1.594,6.1687,7.2429,0.0964,-3.4271,1.639,0.1308,0.8353,-0.179,-0.479,3.4271,5.0661,-10.2806,-19.7285,-8.3801,-10.0357,1.7981,1.083,-0.3632,19.7285,11.3484,1.3281,-4.7303,7.402,0.9626,3.4646,-5.109,-3.1532,7.402,12.1324,2.0434,-5.1538,11.4625,2.3888,3.117,0.294,1.1025,11.4625,16.6162,7.6008,-1.8451,31.4874,2.6064,10.3772,5.2398,7.8408,31.4874,33.3324,0.989,-2.7846,11.5962,0.2466,2.6538,-6.9176,0.5772,11.5962,14.3808,10.4082,8.4153,20.9526,10.0996,1.9942,-0.7288,0.6447,20.9526,12.5373,10.2784,1.7907,32.334,5.8754,9.2843,10.7246,12.1859,32.334,30.5433
44,0.0778,-4.3626,2.8252,0.5094,1.7624,-1.0939,-1.4342,4.3626,7.1878,-0.0826,-2.9322,3.6982,-0.3483,2.0242,1.3326,1.7399,3.6982,6.6304,-9.1975,-13.7811,-0.5029,-10.3989,3.3765,-1.0623,-0.4028,13.7811,13.2782,-3.7809,-18.5017,9.036,-2.1907,6.8461,5.1284,4.764,18.5017,27.5377,2.3373,-19.5913,35.07,3.4913,13.6728,0.8684,-0.1969,35.07,54.6612,12.8406,-15.8845,34.6317,10.4472,14.2369,21.2499,23.8184,34.6317,50.5162,-5.9286,-34.3068,6.4695,0.8238,14.0278,8.3357,2.1419,34.3068,40.7763,9.6794,3.1478,14.0292,10.7443,2.986,0.7393,0.1961,14.0292,10.8815,21.003,3.9802,45.4696,18.0613,12.764,13.598,16.797,45.4696,41.4893
45,-1.0162,-2.3314,-0.0028,-0.9248,0.8228,1.1362,0.8829,2.3314,2.3285,1.25,0.538,1.7701,1.3916,0.4104,-1.3842,-1.5562,1.7701,1.2321,-10.2598,-11.6915,-7.4339,-10.8017,1.5256,0.5684,1.3492,11.6915,4.2575,1.3476,-5.5999,5.6058,2.5734,4.1979,-7.6408,-8.8769,5.6058,11.2058,3.2058,0.4637,6.9475,3.2944,1.8814,0.2013,-0.4944,6.9475,6.4838,34.0905,17.3431,49.2781,34.2656,12.0384,-20.1277,-20.384,49.2781,31.935,2.4071,-4.6598,8.316,2.9657,4.8386,-1.6164,-1.9866,8.316,12.9758,10.4187,7.5993,11.827,10.9405,1.5444,-0.7114,-1.4765,11.827,4.2277,34.601,18.2325,49.718,34.8583,11.8247,-18.7213,-19.2635,49.718,31.4855
46,0.12,-0.5321,0.7767,-0.0419,0.4232,-0.5247,-0.5198,0.7767,1.3088,-0.1342,-0.6313,0.3519,-0.1646,0.3361,0.0828,0.0625,0.6313,0.9832,-9.6915,-11.3477,-8.3778,-9.4525,1.1113,-0.2333,-0.5411,11.3477,2.9699,-6.2932,-6.8411,-5.7048,-6.3036,0.4387,-1.4368,-1.2075,6.8411,1.1363,3.407,0.2538,7.945,2.8,2.447,-0.0405,0.1181,7.945,7.6913,13.9628,9.3686,18.1418,13.8816,2.8039,-31.453,-31.352,18.1418,8.7732,0.7907,-2.4071,4.1854,0.9791,2.2059,-0.568,-0.2306,4.1854,6.5926,9.7072,8.4185,11.3547,9.464,1.1021,0.2402,0.5417,11.3547,2.9362,15.8797,12.3918,20.6105,15.5948,2.6817,3.6208,3.8064,20.6105,8.2187
47,-0.4047,-0.9916,0.2881,-0.5618,0.4778,-0.1506,-0.108,0.9916,1.2797,-0.0514,-0.5559,0.5553,-0.102,0.3405,0.4574,0.6035,0.5559,1.1112,-9.9248,-10.9761,-8.5827,-9.9936,0.829,-0.0722,-0.0103,10.9761,2.3933,-7.73,-8.9973,-6.919,-7.511,0.7254,4.0649,4.038,8.9973,2.0783,3.3666,0.98,5.6525,2.9181,1.5518,6.6183,7.3062,5.6525,4.6725,-17.4902,-24.2706,-12.1596,-17.4704,4.6235,-17.0307,-16.7689,24.2706,12.111,0.2227,-4.7592,3.9921,0.7484,2.7101,-3.2077,-3.1766,4.7592,8.7514,9.9474,8.6016,11.0142,10.0056,0.8408,0.1698,0.2283,11.0142,2.4126,19.5005,14.1495,26.4946,19.4013,4.5351,16.699,16.8363,26.4946,12.3452
48,-0.5553,-2.2052,1.3359,-0.6697,1.208,-0.1708,-0.3183,2.2052,3.5411,0.406,-1.1112,1.3398,0.5015,0.8493,0.5187,0.4698,1.3398,2.4511,-9.997,-11.13,-8.8678,-10.0038,0.7976,0.078,0.5156,11.13,2.2622,-3.6652,-6.0593,0.8973,-3.473,2.2627,15.1967,14.0446,6.0593,6.9566,9.9848,8.3038,11.7338,10.2244,1.3065,-1.4623,-2.4544,11.7338,3.43,-34.5209,-39.084,-30.1782,-34.2393,3.6829,-33.4888,-36.3708,39.084,8.9058,-2.985,-7.4182,0.5039,-2.4282,3.2583,12.4743,13.4428,7.4182,7.9221,10.1172,8.9633,11.1333,10.2339,0.7713,-0.0497,-0.6255,11.1333,2.17,36.1995,31.5015,40.1878,36.2376,3.7436,33.3558,35.3485,40.1878,8.6863
49,-0.7261,-1.755,0.586,-0.988,0.8687,1.1983,1.2971,1.755,2.341,0.9248,-0.5278,2.2913,0.9712,1.0306,-1.2285,-1.0804,2.2913,2.8191,-9.9191,-11.3199,-9.0352,-9.4882,0.8806,-0.2851,-0.838,11.3199,2.2847,11.5315,8.5664,15.9531,10.5716,2.7761,-12.3706,-11.7206,15.9531,7.3867,8.5225,6.44,13.4575,7.77,2.5044,-0.4681,0.6562,13.4575,7.0175,-68.0097,-80.9472,-50.9068,-70.6101,9.4295,19.52,25.0978,80.9472,30.0404,9.4893,-8.42,21.6461,11.0146,10.7814,-9.5581,-10.8803,21.6461,30.0661,10.0675,9.228,11.45,9.6084,0.8839,0.1967,0.7723,11.45,2.222,69.5553,52.1836,83.3855,71.5861,9.7407,-20.3401,-25.2313,83.3855,31.2019
50,0.4723,-0.3849,1.804,0.3091,0.7195,0.0716,0.4319,1.804,2.1889,-0.3037,-1.2938,0.6475,-0.1092,0.6438,0.5128,0.3734,1.2938,1.9412,-10.2042,-11.5556,-8.2493,-10.3262,1.1122,0.2492,0.662,11.5556,3.3063,-0.8391,-2.8353,1.6116,-1.149,1.5585,5.4879,6.1563,2.8353,4.4469,8.0544,5.495,11.0775,8.4262,1.8743,-4.0715,-4.9875,11.0775,5.5825,-48.4896,-56.8602,-43.8763,-45.5122,5.4993,6.8958,3.0128,56.8602,12.9839,-0.0688,-1.2769,0.7804,0.1343,0.7273,0.4407,1.1538,1.2769,2.0572,10.2642,8.4515,11.5621,10.3807,1.0604,-0.2378,-0.6896,11.5621,3.1106,49.2152,44.6981,57.583,46.3548,5.4873,-7.0758,-3.3299,57.583,12.885
51,0.5439,-0.8817,2.1997,0.7411,0.8585,0.256,0.1979,2.1997,3.0814,0.2091,-0.8587,1.0885,0.2642,0.5327,-0.1355,-0.1707,1.0885,1.9472,-9.9549,-13.422,-7.1553,-9.6642,1.6417,0.0181,-0.1318,13.422,6.2668,4.6488,1.3468,7.3665,5.0073,1.6788,-1.4855,-0.9416,7.3665,6.0196,3.9829,-0.6388,8.8025,3.4388,2.9314,-0.9304,-0.6562,8.8025,9.4412,-41.5939,-50.8791,-27.3783,-42.4995,7.0964,17.8639,16.7863,50.8791,23.5008,0.372,-5.5499,3.3236,1.2881,2.724,0.3254,-0.3313,5.5499,8.8735,10.0265,7.3682,13.4512,9.6911,1.5978,0.0216,0.1438,13.4512,6.083,42.1394,27.5413,51.9568,43.025,7.2814,-13.0933,-14.1452,51.9568,24.4156
53,1.0559,-1.359,2.7542,1.1369,0.9727,-0.8963,-1.0058,2.7542,4.1133,-0.0619,-1.5577,1.6552,-0.0772,0.7913,-0.555,-0.5197,1.6552,3.2129,-9.9187,-15.3915,-4.8956,-9.9279,2.2438,0.1051,0.2124,15.3915,10.4959,1.6778,-10.2603,13.4826,3.1242,6.8156,-13.1332,-14.8132,13.4826,23.7429,2.1221,-4.1563,9.765,2.1263,2.8684,-1.1891,-0.9012,9.765,13.9213,-5.866,-33.0137,18.5657,-8.9268,14.6764,11.0807,13.6515,33.0137,51.5795,1.0227,-13.2882,16.2659,0.6255,5.6254,5.976,6.3518,16.2659,29.5542,10.0697,5.0093,15.4036,9.9787,2.159,-0.1831,-0.2076,15.4036,10.3942,15.9529,5.6329,34.0135,14.7346,7.2196,-1.6857,-1.0902,34.0135,28.3805
54,0.1596,-0.9135,1.6648,0.1312,0.9528,-0.308,-0.6873,1.6648,2.5783,-0.6169,-1.122,-0.1652,-0.5969,0.3243,0.8193,0.4985,1.122,0.9569,-9.8136,-13.053,-7.3821,-9.7155,1.9635,0.0495,-0.4093,13.053,5.6709,-11.4554,-12.2493,-10.4316,-11.689,0.6497,18.03,18.3908,12.2493,1.8177,0.933,-3.4912,6.405,1.225,3.1021,1.2534,0.7962,6.405,9.8963,5.2147,-5.7655,15.5155,4.7247,7.1195,-54.5477,-55.185,15.5155,21.2809,6.9987,2.0231,12.1812,6.9773,3.5593,-6.2229,-7.6009,12.1812,10.1581,9.8866,7.6222,13.0898,9.7711,1.9207,-0.0585,0.3862,13.0898,5.4675,14.2672,10.6926,20.0001,13.6445,3.1853,35.613,37.4093,20.0001,9.3075
55,-0.1484,-0.9577,1.066,-0.5561,0.7862,-0.4938,-0.0574,1.066,2.0237,0.2024,-0.7247,1.6755,-0.0984,0.8678,0.3593,0.4153,1.6755,2.4002,-9.7641,-11.2514,-6.8259,-10.1248,1.4287,-0.1944,0.2587,11.2514,4.4254,6.5746,5.1881,8.0955,6.7018,1.1489,0.0489,1.2104,8.0955,2.9073,2.1864,-1.5838,5.915,2.0212,2.5957,2.9843,4.3269,5.915,7.4988,-49.333,-54.0259,-41.8697,-50.4603,4.6465,5.9137,5.2649,54.0259,12.1562,0.7759,-5.0647,9.3246,-0.6236,5.155,6.1141,3.6983,9.3246,14.3893,9.8281,6.9131,11.2884,10.1573,1.4324,0.2379,-0.2525,11.2884,4.3753,49.8802,42.2365,54.8508,51.0538,4.74,-5.0765,-5.8095,54.8508,12.6142
56,-0.6422,-1.489,0.6076,-0.6135,0.5717,0.5875,1.2829,1.489,2.0966,0.5617,-1.2549,2.8897,0.3169,1.0683,-0.6266,-0.023,2.8897,4.1446,-9.9585,-12.665,-8.1695,-9.8661,1.1088,0.0716,0.0071,12.665,4.4954,6.6235,-0.2001,13.0725,7.9122,4.792,-11.9845,-13.7895,13.0725,13.2725,5.1707,-0.0613,9.5287,6.3481,3.0229,-2.2909,-3.9375,9.5287,9.59,-43.4193,-56.838,-23.0229,-45.1954,11.2251,47.2114,48.6056,56.838,33.8151,6.89,-0.8432,25.2541,3.0747,8.4363,-8.3115,-5.6303,25.2541,26.0973,10.0659,8.193,12.6848,9.9048,1.0854,-0.0086,0.0499,12.6848,4.4918,44.8037,26.2938,58.2221,45.2443,10.1562,-36.3718,-36.2124,58.2221,31.9283
57,-0.0546,-4.1769,1.4409,0.6694,1.6498,0.1402,-0.2201,4.1769,5.6178,-0.0649,-1.9089,1.119,0.2938,0.9642,0.4712,0.6235,1.9089,3.028,-9.8869,-10.7536,-9.0216,-9.859,0.3593,0.0364,0.0445,10.7536,1.732,-5.361,-12.8609,3.2475,-5.8773,5.0442,4.0516,4.5106,12.8609,16.1084,2.8798,1.0938,7.1138,2.4106,1.3714,-0.4053,-0.2144,7.1138,6.02,3.7921,0.4197,7.5426,3.4103,2.0741,1.0171,1.3217,7.5426,7.1229,-1.4215,-10.0752,11.5127,-2.5555,4.9638,-0.1104,0.8203,11.5127,21.5879,10.0574,9.0259,11.5329,9.9547,0.5016,-0.0478,0.0042,11.5329,2.507,8.4319,2.5095,13.544,9.0318,3.34,2.4504,1.4468,13.544,11.0346
59,0.2257,-0.3818,0.9256,0.2292,0.2984,0.5935,0.4157,0.9256,1.3074,0.8776,-2.2536,2.417,1.5409,1.433,-0.917,-1.6205,2.417,4.6706,-9.8141,-10.6187,-9.3976,-9.7699,0.1933,-0.0619,-0.1074,10.6187,1.2211,2.7423,-20.7015,23.7736,3.144,13.1636,-13.2171,-16.7078,23.7736,44.4752,2.0692,0.8925,3.6488,1.9819,0.7714,0.7866,0.7919,3.6488,2.7563,5.8263,1.7832,10.3315,6.0537,1.9899,1.4399,-2.4298,10.3315,8.5483,-1.6422,-41.4826,34.4214,-0.9149,19.9412,-4.6616,-3.4838,41.4826,75.904,9.9618,9.4214,10.6197,9.9631,0.1912,0.0325,0.0319,10.6197,1.1983,13.3326,2.3948,25.3468,11.9255,6.5673,0.6351,4.1688,25.3468,22.9519
60,0.8192,-0.2011,1.8667,0.6448,0.6215,-0.1207,-0.1208,1.8667,2.0678,-0.0394,-1.4392,1.2962,-0.0796,1.1862,-0.7238,-0.6819,1.4392,2.7353,-9.876,-9.9972,-9.6865,-9.8774,0.0832,-0.1269,-0.2943,9.9972,0.3107,-10.4748,-18.1266,2.0749,-13.5638,7.2056,16.3551,19.2961,18.1266,20.2015,2.8558,2.38,3.4825,2.7738,0.3834,-1.1397,-0.6475,3.4825,1.1025,7.2662,2.0632,17.3012,3.6239,5.8996,6.5707,10.833,17.3012,15.2381,-6.3037,-23.4838,13.1411,-4.3987,12.4955,3.3305,2.0049,23.4838,36.6249,9.9943,9.791,10.1125,9.995,0.0944,0.0758,0.2341,10.1125,0.3215,13.9677,3.7484,22.3139,16.0943,7.7989,1.5912,0.2671,22.3139,18.5655
61,0.6985,0.4593,1.2795,0.524,0.3358,-0.3896,-0.1634,1.2795,0.8202,-0.7632,-1.3309,-0.1825,-0.7615,0.4478,0.3581,0.1807,1.3309,1.1483,-10.0029,-10.6008,-9.0594,-10.1717,0.5805,0.0819,0.4051,10.6008,1.5414,5.8802,-0.3619,12.0033,5.7323,4.4151,-1.4392,0.1272,12.0033,12.3652,1.7161,-0.595,3.2287,2.1262,1.3938,-0.8723,-1.2075,3.2287,3.8238,13.8369,9.8783,16.7874,14.457,2.3198,-17.4554,-18.7477,16.7874,6.9091,-2.9732,-7.0033,0.4816,-2.3938,2.3154,2.8825,2.525,7.0033,7.4849,10.0701,9.1128,10.6939,10.2291,0.5748,-0.1175,-0.4359,10.6939,1.5811,15.5589,10.2231,20.6731,16.3613,3.4421,-6.2371,-6.5111,20.6731,10.45
62,0.3088,-0.2816,1.1428,0.3605,0.3666,0.1044,0.0584,1.1428,1.4244,-0.405,-0.8617,0.6194,-0.5808,0.5006,1.7308,1.9502,0.8617,1.4811,-9.921,-11.2365,-8.833,-9.7666,0.6916,0.0339,0.1245,11.2365,2.4034,4.441,-9.7287,13.2699,5.8595,7.9547,-3.7141,-3.7278,13.2699,22.9986,0.8438,-1.05,2.8787,0.9187,1.2664,1.907,1.7413,2.8787,3.9287,-3.6185,-4.9705,0.421,-4.2907,1.4848,7.7263,8.2271,4.9705,5.3915,-0.0907,-7.8621,6.6526,0.1312,4.8398,-0.2233,1.6495,7.8621,14.5146,9.9526,8.8806,11.242,9.7932,0.6847,0.0533,0.0773,11.242,2.3614,9.3219,4.5733,13.4816,9.8502,3.1871,-3.3211,-3.9264,13.4816,8.9084
63,0.4132,-0.1829,0.9751,0.4189,0.4256,-0.5064,-0.3489,0.9751,1.1579,1.3258,0.7043,2.043,1.3695,0.5254,1.8113,1.5657,2.043,1.3386,-9.8871,-11.2401,-8.4806,-9.6421,1.0591,0.2165,-0.4031,11.2401,2.7595,0.7269,-6.3884,3.9766,2.1317,3.571,-11.7918,-14.6559,6.3884,10.365,2.7508,0.49,4.8912,2.66,1.6883,-3.0537,-2.2312,4.8912,4.4013,4.1078,2.9006,5.1956,3.9364,0.79,13.6065,13.9524,5.1956,2.295,-0.314,-12.0879,4.0729,1.7807,5.6304,-32.2823,-39.4538,12.0879,16.1608,10.006,8.5367,11.3032,9.8705,1.0393,0.2195,0.6192,11.3032,2.7665,6.0007,3.4046,9.3994,5.9238,1.9,15.8924,15.2547,9.3994,5.9948
64,-0.0932,-1.0066,0.5304,0.07,0.5208,0.5265,0.3486,1.0066,1.5371,3.1371,2.2578,4.3199,2.9352,0.7772,-1.4929,-0.9018,4.3199,2.0621,-9.6706,-11.7568,-7.2228,-10.0452,1.4479,-0.0673,0.2888,11.7568,4.5339,-11.0649,-21.1142,-0.2498,-12.5242,8.278,20.4696,23.415,21.1142,20.8644,-0.303,-4.4975,1.4263,0.4288,2.0398,1.4139,0.6475,4.4975,5.9238,17.7143,13.7866,22.2452,17.8888,2.5943,-8.9219,-9.3096,22.2452,8.4586,-32.5963,-65.093,-0.7811,-37.6731,23.8838,32.7896,45.6124,65.093,64.3119,10.2255,8.4282,11.9833,10.4897,1.2698,-0.2128,-0.4534,11.9833,3.5551,21.8931,13.999,30.6894,21.1785,5.5034,-4.2372,-4.2731,30.6894,16.6904
65,0.4333,-0.3428,1.6616,0.4186,0.4185,-0.0517,-0.0838,1.6616,2.0043,1.6442,-1.8311,3.6168,2.0334,1.577,-2.1944,-2.4409,3.6168,5.4479,-9.7379,-10.3617,-9.2678,-9.7564,0.2533,-0.1658,-0.1376,10.3617,1.0939,9.4047,-18.3394,28.0793,10.8908,13.5767,-19.3272,-23.0404,28.0793,46.4187,1.1109,-0.63,2.765,1.0762,1.1207,1.6815,1.8594,2.765,3.395,8.7924,3.0166,13.2732,8.5792,2.8817,0.2463,0.0068,13.2732,10.2566,0.1933,-56.5895,36.8466,7.9394,28.7156,2.3214,-6.34,56.5895,93.4361,10.0126,9.4688,10.4959,10.0363,0.2847,-0.0535,-0.1274,10.4959,1.027,17.6559,7.3677,29.1084,16.9053,6.5462,-3.333,-1.9953,29.1084,21.7406
66,0.3816,0.078,0.7074,0.3348,0.2193,0.0666,0.0825,0.7074,0.6294,-0.5502,-1.6145,0.6032,-0.4075,0.8384,0.7858,0.7615,1.6145,2.2177,-9.9037,-10.3657,-9.4302,-9.8941,0.2574,0.0194,0.0175,10.3657,0.9355,-9.9225,-13.4062,0.5694,-12.1496,4.9372,4.6481,5.8467,13.4062,13.9756,2.7923,2.31,3.1238,2.9356,0.3197,-0.2306,-0.3041,3.1238,0.8138,9.0387,7.5746,11.0932,8.586,1.232,-4.4261,-4.137,11.0932,3.5186,2.5146,-7.6036,11.3529,1.5993,6.6313,-1.8089,-1.0566,11.3529,18.9564,9.9591,9.5725,10.5095,9.9088,0.2691,-0.0105,0.0131,10.5095,0.937,14.3229,8.7269,16.4628,14.91,2.519,-5.3528,-6.0923,16.4628,7.736
68,0.5149,0.1011,1.2513,0.4999,0.2098,-0.0107,-0.0117,1.2513,1.1503,1.0215,-0.1813,1.4416,1.1154,0.3166,0.2062,0.0592,1.4416,1.6229,-9.8648,-10.0844,-9.7334,-9.8591,0.0559,0.0108,0.008,10.0844,0.351,-0.6264,-8.0163,5.994,-0.4563,3.016,1.9821,0.8225,8.0163,14.0104,2.3312,2.0125,2.66,2.3275,0.1307,0.0475,0.0438,2.66,0.6475,0.1865,-3.2061,2.9185,0.312,1.19,-0.8033,-0.3043,3.2061,6.1246,-1.1032,-10.384,4.9886,-0.5138,2.9934,2.9891,0.9521,10.384,15.3726,9.938,9.7411,10.1727,9.9351,0.0589,0.0064,0.0064,10.1727,0.4316,3.6173,2.3116,8.7947,2.7254,1.7791,-0.0631,-0.2544,8.7947,6.4831
69,0.5042,0.3208,0.7239,0.4882,0.098,-0.0544,-0.0624,0.7239,0.4031,1.2276,1.0646,1.6432,1.1747,0.1471,-0.4415,-0.2292,1.6432,0.5787,-9.854,-9.91,-9.8043,-9.8511,0.0208,-0.0252,-0.0212,9.91,0.1057,1.3557,-0.9126,10.0169,0.3662,3.0024,15.3553,15.6194,10.0169,10.9295,2.3787,2.3362,2.45,2.3713,0.0317,0.0648,0.07,2.45,0.1137,-0.6169,-2.8928,0.3296,0.0077,1.1009,-3.6015,-4.1168,2.8928,3.2224,1.8859,-1.0392,12.2729,0.4383,4.0381,10.0872,11.594,12.2729,13.3122,9.9445,9.8821,10.0355,9.9415,0.0282,-0.0187,-0.0211,10.0355,0.1534,3.5541,2.3669,10.6964,2.471,2.2983,13.8692,14.2306,10.6964,8.3296
70,0.4497,0.229,0.6546,0.4257,0.1368,0.3525,0.3094,0.6546,0.4256,0.7862,0.1317,1.0137,0.9455,0.3121,-2.4649,-2.6997,1.0137,0.8821,-9.8792,-10.0344,-9.7396,-9.8723,0.1098,0.141,0.1533,10.0344,0.2948,16.7111,11.2804,24.6086,15.9857,4.7024,-19.1965,-18.2099,24.6086,13.3282,2.4434,2.2925,2.5725,2.4412,0.0848,-0.0317,-0.1619,2.5725,0.28,-4.2183,-7.2324,-2.815,-4.1092,1.4631,6.0336,5.8147,7.2324,4.4174,11.9731,3.2397,16.1894,12.0323,4.0425,-9.0987,-8.4655,16.1894,12.9497,9.9258,9.7631,10.0812,9.9204,0.1082,0.0323,-0.0457,10.0812,0.3181,17.4234,11.8747,25.7516,16.7016,4.8614,-12.3393,-11.8353,25.7516,13.877
71,0.8022,0.4579,1.3593,0.7351,0.3334,-0.1641,-0.0787,1.3593,0.9013,-1.6788,-3.101,-0.1287,-1.7542,0.9208,4.4688,4.8307,3.101,2.9723,-9.7382,-10.5522,-8.6506,-9.719,0.5755,0.1481,0.0327,10.5522,1.9016,-2.4854,-5.9014,0.3053,-2.2242,1.7947,-25.8055,-32.7327,5.9014,6.2068,2.4117,0.8312,4.1475,2.2794,1.0624,-0.1837,0.0525,4.1475,3.3162,1.8153,-3.107,6.0327,1.7055,2.9845,-4.1184,-3.0381,6.0327,9.1397,2.8745,-0.9468,5.0319,3.5668,2.1156,-63.7777,-60.6701,5.0319,5.9786,9.9581,9.2074,10.843,9.8747,0.5441,0.3302,0.0517,10.843,1.6356,5.084,3.5554,6.8239,4.8663,1.0909,23.9316,30.1719,6.8239,3.2684
72,0.6381,-1.1421,1.7498,0.6564,0.8423,-0.0209,-0.0508,1.7498,2.8919,2.79,-0.3303,5.9207,3.0764,2.4413,-1.4275,-1.6944,5.9207,6.251,-9.5901,-10.3853,-7.7716,-9.6863,0.7978,-0.2152,-0.1268,10.3853,2.6137,-28.2909,-38.526,-0.3762,-34.9569,13.4512,26.8909,33.2796,38.526,38.1499,2.228,0.7525,3.8938,2.3319,0.8885,0.0569,-0.0481,3.8938,3.1412,-2.3031,-6.0057,-0.0098,-1.3326,2.3,1.8511,0.9484,6.0057,5.9959,-60.9033,-145.5623,11.4979,-57.1033,63.1905,58.9007,54.8149,145.5623,157.0602,10.2883,9.4782,11.8655,9.9265,0.8974,-0.3686,0.003,11.8655,2.3874,29.0156,3.7578,38.612,35.0382,12.3,-25.8296,-32.0362,38.612,34.8542
73,0.6173,0.5398,0.678,0.6056,0.0508,-0.2664,-0.3555,0.678,0.1383,1.3625,1.1549,1.5134,1.382,0.1332,1.6817,0.0132,1.5134,0.3584,-9.8053,-9.852,-9.7443,-9.8131,0.0348,7.6905,8.9011,9.852,0.1077,-1.4,-3.7364,1.336,-1.6773,1.924,-76.9594,-72.3741,3.7364,5.0724,2.2848,2.1788,2.4412,2.2838,0.0785,-9.8926,-2.94,2.4412,0.2625,-0.452,-0.7736,-0.1744,-0.3842,0.2162,4.0134,-5.0986,0.7736,0.5992,-2.0026,-5.4444,2.0219,-2.2883,2.767,-243.985,-1.1237,5.4444,7.4662,9.9196,9.8668,9.962,9.9295,0.0352,-3.4776,-4.2382,9.962,0.0952,3.186,2.2569,4.4047,3.002,0.7706,89.8905,74.7074,4.4047,2.1479
74,0.3509,-2.0184,3.7753,0.2501,1.2663,1.6061,1.4781,3.7753,5.7937,3.0442,-1.3404,11.1813,1.3952,4.0811,6.3541,8.3762,11.1813,12.5217,-2.1148,-9.4344,6.7986,-0.912,4.9036,3.009,1.8066,9.4344,16.233,-78.3594,-236.9417,27.2978,-74.0514,77.8191,79.4371,73.8483,236.9417,264.2396,-7.6078,-54.0925,7.14,-0.6562,17.1965,10.4483,3.3994,54.0925,61.2325,3.5614,-34.6749,58.4641,-5.4828,23.8019,-3.9448,5.5397,58.4641,93.1389,-245.9876,-2591.1814,287.4685,-3.412,653.6161,248.7383,1.4328,2591.1814,2878.6498,6.4421,1.4467,12.6053,5.6913,3.6825,3.4768,4.2102,12.6053,11.1585,93.0765,12.5791,244.0845,77.7094,66.087,-88.6243,-74.8835,244.0845,231.5054
75,1.957,0.0016,5.3883,1.7282,1.542,-0.1819,-0.0727,5.3883,5.3867,9.3983,4.2798,12.8179,9.7714,2.3706,0.2261,0.0386,12.8179,8.5381,0.8942,-0.1944,2.2393,0.8947,0.9043,-0.0367,-0.0343,2.2393,2.4336,1.0777,-2.1567,11.8784,-0.2031,4.4265,-0.6715,-0.0257,11.8784,14.0351,2.8405,1.8462,3.8675,2.7431,0.7525,-0.2537,-0.2034,3.8675,2.0213,-0.3835,-4.4371,2.9098,0.0569,2.115,0.2734,0.0593,4.4371,7.3469,2.7507,-19.2868,50.8375,-1.9792,20.6034,-2.6823,-0.2599,50.8375,70.1242,9.9189,6.8839,12.8459,9.9015,1.6163,0.0467,0.0558,12.8459,5.962,4.4522,1.8623,12.5862,2.8259,3.5631,-1.049,-0.2335,12.5862,10.7239
77,1.5931,1.5558,1.6377,1.5829,0.0297,0.0055,0.0155,1.6377,0.0819,9.8504,9.8169,9.9097,9.8486,0.0316,-0.0101,-0.0087,9.9097,0.0928,0.8209,0.7569,0.8742,0.826,0.0336,0.0014,-0.0035,0.8742,0.1172,-0.2653,-0.3288,-0.2282,-0.2545,0.0363,-0.0022,-0.0158,0.3288,0.1006,2.333,2.275,2.3625,2.3362,0.0284,0.0077,0.0,2.3625,0.0875,0.1634,0.1079,0.2084,0.1754,0.0376,0.0089,-0.0052,0.2084,0.1005,-2.6139,-3.2433,-2.2554,-2.499,0.3602,-0.0185,-0.1605,3.2433,0.9879,10.0122,9.9826,10.0614,10.013,0.0268,-0.0091,-0.01,10.0614,0.0788,2.3542,2.289,2.3846,2.359,0.0305,0.0081,0.0003,2.3846,0.0956
78,1.5986,1.5894,1.6105,1.5984,0.0067,0.0,-0.0001,1.6105,0.0211,9.8403,9.8271,9.8552,9.84,0.0083,-0.0003,0.0006,9.8552,0.0281,0.8222,0.8117,0.8351,0.8224,0.0073,0.0028,0.0025,0.8351,0.0234,-0.2675,-0.2957,-0.2297,-0.2702,0.0214,-0.0036,-0.0015,0.2957,0.066,2.3406,2.3275,2.3538,2.3362,0.0101,0.0061,0.0088,2.3538,0.0263,0.1723,0.1619,0.1904,0.1702,0.008,-0.0027,-0.0038,0.1904,0.0285,-2.6323,-2.9115,-2.2587,-2.6595,0.212,-0.0357,-0.0136,2.9115,0.6527,10.0031,9.9925,10.0158,10.003,0.0067,-0.0001,0.0006,10.0158,0.0233,2.3623,2.3466,2.3788,2.3593,0.0115,0.0062,0.0078,2.3788,0.0322
79,1.5986,1.5916,1.6065,1.5983,0.0035,0.0024,0.0019,1.6065,0.0149,9.84,9.8319,9.8468,9.8406,0.004,0.001,-0.0003,9.8468,0.015,0.825,0.8161,0.8332,0.8249,0.0042,-0.0002,0.0004,0.8332,0.0171,-0.2711,-0.2927,-0.2522,-0.2717,0.0121,0.0035,0.0045,0.2927,0.0405,2.3467,2.3275,2.38,2.345,0.0131,-0.005,-0.0088,2.38,0.0525,0.1696,0.1424,0.1949,0.1664,0.013,0.0039,0.0045,0.1949,0.0525,-2.668,-2.8823,-2.4819,-2.673,0.1188,0.0347,0.0438,2.8823,0.4004,10.0031,9.9968,10.0087,10.0035,0.0034,0.0014,0.0005,10.0087,0.0119,2.3684,2.3496,2.4042,2.3671,0.0135,-0.005,-0.0078,2.4042,0.0547
80,1.601,1.5988,1.6047,1.6002,0.0022,-0.0001,0.0011,1.6047,0.0058,9.841,9.8373,9.8456,9.8403,0.0031,-0.0016,-0.0003,9.8456,0.0084,0.8248,0.8209,0.8277,0.8254,0.0024,0.0001,-0.0006,0.8277,0.0068,-0.2676,-0.2837,-0.2582,-0.2672,0.0093,-0.0054,-0.003,0.2837,0.0255,2.3417,2.3362,2.3625,2.3362,0.0093,-0.0033,0.0,2.3625,0.0263,0.1735,0.1559,0.1919,0.1709,0.0161,0.0006,-0.0015,0.1919,0.036,-2.6334,-2.7912,-2.5412,-2.6292,0.0906,-0.0531,-0.0299,2.7912,0.25,10.0044,10.0012,10.0085,10.0041,0.0029,-0.0016,-0.001,10.0085,0.0073,2.3634,2.3561,2.3853,2.3593,0.0099,-0.0026,0.0008,2.3853,0.0292
81,1.6009,1.5978,1.6035,1.6014,0.0023,-0.0032,-0.0038,1.6035,0.0057,9.8394,9.8331,9.8432,9.84,0.0031,0.0008,0.0003,9.8432,0.0102,0.8249,0.822,0.8287,0.8248,0.0024,-0.0013,-0.0012,0.8287,0.0067,-0.273,-0.2927,-0.2642,-0.2702,0.0103,0.0165,0.0113,0.2927,0.0285,2.3384,2.3275,2.345,2.3362,0.0062,-0.0044,-0.0044,2.345,0.0175,0.1741,0.1634,0.1979,0.1694,0.0111,-0.0009,0.0023,0.1979,0.0345,-2.6865,-2.8804,-2.598,-2.6592,0.1011,0.1622,0.1108,2.8804,0.2824,10.0029,9.9962,10.0074,10.003,0.0034,0.0002,0.0002,10.0074,0.0112,2.3608,2.3485,2.3702,2.3601,0.0067,-0.0062,-0.0068,2.3702,0.0217
82,1.5977,1.5943,1.6018,1.5975,0.002,0.0001,-0.0,1.6018,0.0075,9.8403,9.8367,9.8426,9.8403,0.0013,-0.0005,-0.0006,9.8426,0.006,0.8236,0.8197,0.8291,0.8236,0.0027,0.0001,0.0007,0.8291,0.0094,-0.2565,-0.2972,-0.2177,-0.259,0.0185,-0.0055,-0.0023,0.2972,0.0795,2.3341,2.3012,2.3538,2.3319,0.0137,0.0051,0.0088,2.3538,0.0525,0.1732,0.1514,0.1934,0.1717,0.0126,-0.0082,-0.0067,0.1934,0.042,-2.5243,-2.9255,-2.1425,-2.5484,0.1819,-0.054,-0.0221,2.9255,0.783,10.0031,9.9996,10.006,10.0032,0.0015,-0.0005,-0.0006,10.006,0.0063,2.3546,2.3182,2.38,2.3534,0.0153,0.0051,0.0069,2.38,0.0618
83,1.5978,1.5934,1.6026,1.5975,0.0025,0.0007,-0.0001,1.6026,0.0092,9.8397,9.8379,9.8444,9.8397,0.0016,-0.0013,-0.0006,9.8444,0.0066,0.8237,0.8167,0.8268,0.8242,0.0025,0.0014,0.001,0.8268,0.0102,-0.262,-0.2957,-0.2372,-0.2612,0.0143,-0.0009,-0.0052,0.2957,0.0585,2.3392,2.3188,2.3713,2.3406,0.0133,-0.0106,-0.0131,2.3713,0.0525,0.165,0.1394,0.1844,0.1649,0.0111,0.0114,0.0105,0.1844,0.045,-2.5782,-2.9097,-2.3339,-2.5705,0.1409,-0.0084,-0.0514,2.9097,0.5758,10.0026,10.0003,10.0077,10.0026,0.0017,-0.001,-0.0004,10.0077,0.0074,2.3596,2.3393,2.3909,2.3603,0.0131,-0.0096,-0.0104,2.3909,0.0516
84,1.5985,1.5959,1.6031,1.5975,0.0026,0.001,0.0014,1.6031,0.0072,9.8385,9.8343,9.8409,9.8391,0.0022,0.0031,0.0033,9.8409,0.0066,0.825,0.8222,0.826,0.8253,0.0012,-0.0008,-0.0009,0.826,0.0038,-0.2629,-0.2687,-0.2417,-0.2665,0.0093,-0.0024,0.0038,0.2687,0.027,2.3286,2.3188,2.345,2.3275,0.0099,0.0044,-0.0044,2.345,0.0263,0.1763,0.1559,0.1919,0.1754,0.0112,-0.0066,-0.0083,0.1919,0.036,-2.5866,-2.6444,-2.3775,-2.6219,0.0913,-0.0248,0.036,2.6444,0.2669,10.0016,9.997,10.0044,10.0022,0.0024,0.0031,0.0029,10.0044,0.0074,2.3501,2.3384,2.3658,2.3498,0.0101,0.0041,-0.0046,2.3658,0.0274
85,1.5995,1.5964,1.6032,1.5989,0.0024,-0.0024,-0.0018,1.6032,0.0068,9.8415,9.8379,9.8438,9.8423,0.0022,-0.0009,-0.0015,9.8438,0.006,0.8242,0.8211,0.8279,0.8243,0.002,-0.001,-0.0012,0.8279,0.0068,-0.2653,-0.2837,-0.2522,-0.2627,0.0122,-0.0015,-0.006,0.2837,0.0315,2.333,2.3188,2.3625,2.3231,0.0181,0.0036,0.0131,2.3625,0.0438,0.1698,0.1529,0.1844,0.1671,0.0104,0.0004,0.0045,0.1844,0.0315,-2.6114,-2.7919,-2.4812,-2.5858,0.1203,-0.0145,-0.0591,2.7919,0.3107,10.0047,10.0007,10.0078,10.0051,0.0023,-0.0013,-0.0015,10.0078,0.0072,2.3542,2.3378,2.3837,2.3452,0.0187,0.0038,0.0138,2.3837,0.0459
86,1.597,1.5914,1.6016,1.5971,0.0021,0.0015,0.0027,1.6016,0.0102,9.8407,9.8367,9.8438,9.8409,0.0022,-0.0003,-0.0009,9.8438,0.0072,0.8232,0.8173,0.8283,0.8232,0.0028,-0.0007,-0.0004,0.8283,0.011,-0.2668,-0.2912,-0.2297,-0.2687,0.0155,0.0019,0.0045,0.2912,0.0615,2.3366,2.31,2.3625,2.3362,0.012,-0.0026,0.0,2.3625,0.0525,0.1702,0.1469,0.1889,0.1717,0.01,-0.0021,-0.0038,0.1889,0.042,-2.6259,-2.8652,-2.2608,-2.6449,0.1524,0.0186,0.0451,2.8652,0.6044,10.0033,9.9996,10.007,10.0036,0.0021,-0.0001,-0.0007,10.007,0.0074,2.358,2.3322,2.3842,2.359,0.0123,-0.0029,-0.0031,2.3842,0.052
87,1.5985,1.5947,1.6027,1.5998,0.0032,0.0357,0.0006,1.6027,0.008,9.8403,9.8355,9.8468,9.84,0.0032,0.0109,0.0012,9.8468,0.0114,0.8225,0.8141,0.8286,0.8228,0.004,0.0951,0.0076,0.8286,0.0145,-0.265,-0.2927,-0.2402,-0.2642,0.0151,0.6401,0.0173,0.2927,0.0525,2.3341,2.31,2.3538,2.3362,0.0141,-0.5545,-0.035,2.3538,0.0438,0.1681,0.1484,0.1814,0.1679,0.0099,-0.3238,-0.0097,0.1814,0.033,-2.6073,-2.8792,-2.3635,-2.5999,0.1484,6.2952,0.1693,2.8792,0.5157,10.0032,9.9979,10.0089,10.0029,0.0029,0.0271,0.0015,10.0089,0.011,2.3551,2.3322,2.3788,2.3559,0.0138,0.2263,-0.0017,2.3788,0.0466
88,1.6342,1.5375,2.0698,1.6004,0.1136,-1.8591,-1.3663,2.0698,0.5323,9.8512,9.4477,10.1251,9.8412,0.1165,0.2309,0.2014,10.1251,0.6774,0.9176,0.8039,1.4328,0.8304,0.1865,-2.101,-1.7515,1.4328,0.629,0.3751,-0.3828,4.515,-0.247,1.3819,24.9731,26.6319,4.515,4.8977,1.7795,-2.4063,2.5988,2.3013,1.292,9.7886,4.7994,2.5988,5.005,-0.1557,-2.5142,0.1979,0.1582,0.7174,-10.522,-14.5582,2.5142,2.7121,3.6879,-3.7551,42.6561,-2.4306,13.5226,251.2705,268.0316,42.6561,46.4112,10.0303,9.7773,10.3352,10.0044,0.1013,0.3108,0.1787,10.3352,0.5579,2.5814,1.8946,5.0538,2.3542,0.7852,31.8278,32.3677,5.0538,3.1592
89,-0.2249,-3.4565,1.4575,0.234,1.4463,0.7294,-0.2439,3.4565,4.9141,10.0821,7.8063,13.5372,10.0425,1.0745,-2.5099,-3.3337,13.5372,5.731,-1.1834,-5.2317,0.6392,-0.9211,1.5032,-4.9823,-5.3773,5.2317,5.8709,25.3482,8.3351,36.9514,26.385,8.4754,8.3191,8.3868,36.9514,28.6163,11.5682,1.1725,25.8475,7.1006,8.3946,-9.692,-5.1275,25.8475,24.675,-10.6777,-33.7293,18.4869,-14.4,16.7072,13.6409,16.1721,33.7293,52.2163,254.9584,85.4562,383.2043,265.601,87.5471,-7.8737,-36.7657,383.2043,297.7481,10.3412,7.8411,14.0736,10.183,1.2299,-0.0454,-0.2295,14.0736,6.2325,34.4092,11.7732,49.1992,34.7219,10.773,1.3625,1.0344,49.1992,37.4261
90,0.5045,-3.5079,9.2957,-0.0098,2.4166,0.0499,0.5222,9.2957,12.8037,7.5722,3.5803,15.2499,6.7088,2.3559,-6.2603,-6.6468,15.2499,11.6696,-6.1657,-13.058,0.7955,-6.2984,2.4168,-3.0292,-3.0106,13.058,13.8536,33.6673,8.936,44.5644,34.7718,8.8093,7.7985,4.6325,44.5644,35.6284,1.8762,-21.5425,26.145,1.9731,8.7921,1.0688,1.1812,26.145,47.6875,2.9632,-6.9212,18.928,1.7721,6.214,-2.1347,-0.7102,18.928,25.8492,247.0847,88.9337,387.6227,228.8352,81.1245,-181.1412,-226.3756,387.6227,298.689,10.2958,6.4303,20.3512,9.9535,2.534,-0.6207,-0.3247,20.3512,13.9209,35.7718,14.2619,51.4397,35.7563,7.3714,5.8604,3.8012,51.4397,37.1778
91,0.5544,-0.1311,1.4016,0.5124,0.2934,0.3387,0.2771,1.4016,1.5327,1.3119,-2.0077,5.3127,0.0619,2.6501,-4.1291,-2.8801,5.3127,7.3203,-9.1949,-10.0529,-7.6216,-9.309,0.5889,-0.3534,-0.2551,10.0529,2.4314,41.4659,29.4529,57.945,39.4043,10.0082,-37.8183,-37.3959,57.945,28.4921,2.945,0.7175,4.4275,3.1544,0.9149,0.5001,0.2275,4.4275,3.71,0.8285,-2.1692,3.7284,1.0619,1.6188,3.314,3.0134,3.7284,5.8976,65.9436,-59.1315,245.8774,2.4597,112.0461,-77.7972,-7.5789,245.8774,305.009,9.6751,9.1177,10.6981,9.6288,0.3768,0.3413,0.4033,10.6981,1.5804,41.6321,29.8073,58.0568,39.5575,9.9491,-31.6732,-32.3295,58.0568,28.2496
92,0.8931,0.1443,1.6958,0.7895,0.3828,-0.4871,-0.3113,1.6958,1.5514,-2.8172,-3.9681,-1.8222,-2.8182,0.538,0.6176,0.6696,3.9681,2.1459,-9.5483,-10.3501,-9.0602,-9.5641,0.3348,-0.0368,0.0059,10.3501,1.29,3.6475,-7.6734,29.012,2.0084,9.806,-8.3572,-6.113,29.012,36.6855,3.4451,1.3738,4.9,3.3819,0.971,-0.4989,-0.5512,4.9,3.5262,4.1426,-1.1056,7.7374,4.0753,1.9656,-2.3099,-2.1464,7.7374,8.843,-11.8537,-79.3055,18.8499,-5.1192,28.1955,21.1955,12.5442,79.3055,98.1554,10.0164,9.415,10.7634,10.0321,0.3287,-0.1471,-0.1372,10.7634,1.3484,9.959,4.3955,29.3366,7.228,6.4687,-2.8713,-1.6755,29.3366,24.9411
93,0.406,-0.2187,0.8059,0.4781,0.2949,,,0.8059,1.0247,-2.1996,-3.2003,-0.9754,-2.1486,0.6898,,,3.2003,2.2249,-9.5851,-10.035,-9.1067,-9.5582,0.211,,,10.035,0.9283,-4.7097,-13.0747,3.3772,-4.1047,5.2231,,,13.0747,16.4519,2.9462,2.0038,4.27,2.8306,0.6161,,,4.27,2.2663,1.8326,0.8666,2.6124,1.9288,0.4662,,,2.6124,1.7458,9.3418,-7.8457,29.143,7.4249,11.4438,,,29.143,36.9887,9.8693,9.3538,10.4909,9.8948,0.2436,,,10.4909,1.1371,7.0877,3.0291,13.5782,5.5525,3.3415,,,13.5782,10.5491
