AYGX_min,AZ_mean,AYGX_mean,AYGX_std,AZ_mean.1,GX_std,Gnorm_max,Gnorm_median,timestamp
-3.4378,-9.8757,3.925,3.3937,-9.8757,6.4683,17.8938,9.2327,366
-126.8963,-9.6117,-28.4544,33.7702,-9.6117,7.4839,38.2967,18.5843,367
-308.313,-8.4052,-36.2556,111.9915,-8.4052,17.3259,45.0818,31.9476,368
-15.0808,-9.1837,18.3905,22.2075,-9.1837,5.8014,55.0562,46.1323,369
-5.282,-9.6673,10.8505,11.5352,-9.6673,4.5608,37.3593,27.0554,370
