AYGX_min,AZ_mean,AYGX_mean,AYGX_std,AZ_mean,GX_std,Gnorm_max,Gnorm_median,timestamp
-0.2343,-9.9334,-0.2275,0.0038,-9.9334,0.0129,1.722,1.6941,0
-0.2332,-9.9339,-0.226,0.0033,-9.9339,0.011,1.7097,1.6869,1
-149.4031,-9.8865,-8.5437,37.2156,-9.8865,10.2323,28.0507,2.1309,2
-33.6598,-9.7925,-6.9622,9.5074,-9.7925,4.4385,13.5507,4.683,3
-3.6802,-9.794,-0.8507,2.2987,-9.794,1.3587,2.5922,1.9599,4
-1.4257,-9.8049,-0.9632,0.3187,-9.8049,0.205,1.567,1.3947,5
-3.7307,-9.837,0.2954,1.9991,-9.837,1.6231,3.8038,1.5599,7
-5.3056,-9.8514,-3.4933,1.1151,-9.8514,0.8478,4.3299,2.9529,8
-3.802,-9.8338,-1.9456,1.2131,-9.8338,0.808,2.8967,1.992,9
-3.5426,-9.8352,-1.179,1.0241,-9.8352,0.6896,2.4287,1.5746,10
-4.589,-9.8282,-2.0064,1.3156,-9.8282,0.8835,3.1131,1.8284,12
-3.6617,-9.8318,-1.6373,1.2485,-9.8318,0.8445,2.7122,1.6593,13
-10.19,-9.8296,-6.0106,2.7289,-9.8296,1.6328,6.519,4.7673,14
-17.7859,-9.6335,-11.3732,3.675,-9.6335,1.9829,8.6697,6.1159,15
-16.3307,-9.5628,-8.5909,8.237,-9.5628,2.9519,6.2392,4.1593,16
-10.0956,-9.7142,-0.0303,5.732,-9.7142,2.4671,12.404,6.5143,17
4.246,-9.7737,17.5617,10.0468,-9.7737,5.4745,23.4426,17.3997,18
-9.0649,-9.8122,-4.9004,4.2623,-9.8122,2.7984,8.6732,6.3144,19
-5.404,-9.9473,-1.0513,2.5119,-9.9473,6.3252,9.556,6.4364,20
-4.6308,-9.9323,-2.579,1.3854,-9.9323,1.9295,5.9689,4.1136,21
-7.7136,-9.9283,-1.3337,3.6111,-9.9283,3.9546,9.2633,4.0841,22
0.0345,-9.9458,1.6571,1.1211,-9.9458,0.9941,4.75,3.5065,23
-15.2964,-9.9362,-6.2861,6.43,-9.9362,3.6626,13.1343,8.6971,24
-7.0045,-9.8817,-0.6638,2.5394,-9.8817,1.6488,4.5411,1.3217,25
-1.3997,-9.9089,-0.4501,1.0715,-9.9089,0.7426,1.4188,0.8333,26
-98.8239,-9.198,-19.454,77.3441,-9.198,22.7256,51.0082,38.6044,27
-104.1375,-9.702,-5.8597,34.1454,-9.702,10.0733,87.3096,8.5129,29
-44.5086,-9.6756,-20.4773,12.3603,-9.6756,4.0786,15.212,8.7404,30
-16.5475,-9.6334,16.3427,21.6965,-9.6334,9.1612,20.9931,14.6972,31
-3.182,-9.8133,0.0635,2.3653,-9.8133,4.3995,21.9345,13.2763,32
0.9365,-10.1328,6.6415,4.5866,-10.1328,3.5078,27.0503,19.774,33
-3.7533,-9.9365,4.1057,4.6582,-9.9365,4.0133,44.4945,43.6525,34
-0.9915,-9.9784,0.6966,1.1139,-9.9784,2.3846,20.4832,13.0174,35
-2.4441,-9.9581,1.4709,2.9212,-9.9581,5.2827,17.8396,8.9392,37
-1.0758,-10.0068,1.1146,1.5177,-10.0068,5.3429,13.7876,8.4838,39
-2.509,-9.9103,-0.1605,0.7544,-9.9103,1.3063,16.7348,12.1845,40
-0.7168,-9.9176,0.2596,0.4895,-9.9176,0.3628,13.4447,11.1451,42
-0.6497,-10.0355,0.3293,0.5028,-10.0355,0.4104,8.1342,5.9918,43
-0.3715,-9.9309,0.0812,0.1911,-9.9309,0.8802,3.7667,2.3236,44
-0.4781,-9.9366,0.1237,0.2837,-9.9366,0.7758,3.9578,3.1636,45
0.0638,-10.0136,0.9242,0.6214,-10.0136,0.8245,9.0324,5.9625,46
-1.8771,-9.9525,0.1227,0.9555,-9.9525,1.7469,5.7749,3.3544,47
-0.1773,-9.9589,0.4023,0.4,-9.9589,0.9509,3.8773,1.6752,48
-1.161,-9.9604,-0.1669,0.4138,-9.9604,1.6768,3.8109,1.7383,49
-0.2044,-9.9541,0.4804,0.4224,-9.9541,0.9263,2.5499,1.7745,50
0.6218,-9.9591,0.7159,0.0664,-9.9591,0.1944,2.5834,2.2949,51
-0.2976,-9.9637,0.3852,0.4064,-9.9637,0.958,3.9172,2.0449,52
-0.2768,-9.9602,-0.0883,0.139,-9.9602,0.4124,1.7223,1.4652,53
0.2799,-9.956,0.4063,0.0943,-9.956,0.1482,1.7984,1.5597,54
0.1187,-9.9645,0.323,0.1251,-9.9645,0.3489,2.2785,1.7178,55
0.1592,-9.9646,0.3901,0.1112,-9.9646,0.3026,2.2451,2.0672,56
0.228,-9.9594,0.3712,0.1098,-9.9594,0.3472,2.3551,1.9529,57
-0.0912,-9.9619,0.059,0.0879,-9.9619,0.3282,1.7719,1.3951,58
0.2536,-9.9627,0.4369,0.0945,-9.9627,0.3103,2.2898,2.0944,59
0.1753,-9.9638,0.2608,0.0575,-9.9638,0.1764,1.9744,1.7721,60
0.078,-9.962,0.1921,0.0874,-9.962,0.3667,1.9172,1.4422,62
0.1374,-9.9612,0.2629,0.0797,-9.9612,0.2466,1.7583,1.6138,63
0.3382,-9.9556,0.8229,0.5746,-9.9556,1.445,5.4405,2.0048,64
-1.773,-9.9542,0.2113,0.8783,-9.9542,2.5695,14.7071,8.6457,65
-0.8617,-9.8868,-0.2469,0.2817,-9.8868,1.2171,5.374,3.9002,66
-0.6424,-10.077,1.6015,2.1183,-10.077,2.3207,20.1546,19.2633,67
-1.5455,-9.9127,2.762,3.5482,-9.9127,5.0298,17.586,13.7764,68
-4.3407,-10.0252,0.8569,2.9517,-10.0252,2.7738,24.3647,20.6352,69
-4.0343,-10.278,0.1846,1.8927,-10.278,6.2103,48.0426,30.6727,70
-10.1279,-9.7742,16.5666,25.6852,-9.7742,2.1999,49.1516,46.0842,71
-1.7892,-9.7775,0.685,1.3523,-9.7775,2.968,12.4049,7.8044,72
-1.3079,-9.8641,0.3066,1.6177,-9.8641,1.1976,10.3254,4.9305,73
-3.459,-10.528,-0.5761,2.4538,-10.528,5.258,20.8923,10.7316,74
-4.578,-9.9614,0.7467,2.0026,-9.9614,3.7448,12.0701,7.804,75
-1.9355,-9.9312,0.1745,1.0117,-9.9312,3.3048,10.215,3.7282,77
-1.4836,-10.0704,0.109,1.1748,-10.0704,2.5724,7.5025,2.8175,78
-2.5179,-9.7263,0.119,1.582,-9.7263,2.0086,11.0414,8.2395,79
-1.3988,-9.9571,-0.0354,0.6082,-9.9571,2.0672,4.9053,3.3777,80
-2.0314,-9.9585,-0.1592,0.7893,-9.9585,2.3052,8.6194,3.4514,82
-5.2323,-9.9826,-0.0986,3.1839,-9.9826,2.3605,10.5875,7.7273,83
-2.3551,-10.1173,3.9476,6.3729,-10.1173,5.2841,27.793,26.1951,84
-1.8361,-9.8595,1.3611,3.716,-9.8595,5.0703,17.1304,12.9439,85
-4.0925,-9.994,0.9213,1.9128,-9.994,5.8627,12.6511,8.0961,87
-1.3866,-10.1328,1.6685,2.8929,-10.1328,4.6914,18.1402,14.0414,88
-2.5219,-10.2771,0.682,2.1842,-10.2771,1.9656,11.4493,10.8402,89
-4.2078,-10.0182,0.7389,2.7494,-10.0182,2.7956,10.315,7.316,90
-2.9405,-9.2485,-0.4259,1.8962,-9.2485,1.2708,16.4167,4.7088,91
-4.6419,-9.9315,0.7181,2.361,-9.9315,3.4032,10.5614,5.1636,92
-2.1511,-9.9491,1.6771,2.0397,-9.9491,4.7245,12.3839,8.6118,93
-3.3773,-5.2893,-0.4627,1.6088,-5.2893,1.9994,23.1377,10.3744,94
-3.9413,-10.0375,0.2343,2.0116,-10.0375,5.5405,14.7142,7.0276,95
-2.0587,-9.9513,0.0013,0.629,-9.9513,1.587,8.4309,4.1348,97
-0.0855,-9.75,0.0306,0.1342,-9.75,0.4754,4.3663,3.2093,98
-0.9373,-10.4882,-0.1607,0.3634,-10.4882,1.0162,9.8116,4.7522,99
-11.7833,-10.2123,0.0657,3.4475,-10.2123,3.8887,17.281,6.8169,100
-0.4031,-9.6825,0.9426,1.5779,-9.6825,1.7647,9.8599,5.0181,102
-6.1718,-9.897,-0.0685,1.9943,-9.897,2.1536,9.8142,5.1025,103
-4.427,-9.9294,-0.004,1.4808,-9.9294,3.2909,11.4723,6.6084,104
-4.1775,-9.8944,-0.5084,2.2392,-9.8944,2.67,7.7575,6.767,105
-4.3115,-9.9406,-0.1261,2.378,-9.9406,3.6139,9.0433,6.4647,106
-2.9161,-10.0893,-0.0357,1.152,-10.0893,3.2586,9.151,5.0862,107
-11.5775,-9.8973,2.5847,6.1987,-9.8973,9.8603,22.1985,14.7278,108
-4.4706,-9.9671,4.7679,6.3271,-9.9671,3.5612,26.0643,15.8619,109
-2.1909,-9.974,1.1293,2.5278,-9.974,4.8554,17.4694,5.6437,110
-0.0112,-10.0109,1.3022,0.9878,-10.0109,0.8638,5.7746,5.4266,111
-1.9389,-10.0224,-0.1806,1.1758,-10.0224,1.1351,14.5266,12.2484,112
-1.7973,-9.9789,-0.29,0.5597,-9.9789,1.861,5.719,4.1823,113
-4.0237,-9.9352,0.3219,1.9257,-9.9352,2.4534,5.8196,3.6003,114
0.256,-9.9545,1.5337,0.6825,-9.9545,0.6687,4.3043,3.1367,115
0.3119,-9.9535,0.5771,0.2475,-9.9535,0.4625,2.2449,1.8627,116
-0.5367,-9.959,0.2467,0.4187,-9.959,0.8608,2.1824,1.5163,117
0.6306,-9.9571,0.8652,0.1529,-9.9571,0.2858,2.8559,2.0733,118
0.2152,-9.9595,0.4348,0.1972,-9.9595,0.6436,2.8235,1.7071,119
0.1735,-9.964,0.4355,0.1379,-9.964,0.3109,2.1239,1.7531,120
0.2174,-9.961,0.4062,0.142,-9.961,0.3354,2.0491,1.6997,121
0.3471,-9.9622,0.4395,0.0858,-9.9622,0.2211,1.9323,1.6061,122
0.137,-9.9616,0.421,0.1981,-9.9616,0.4741,2.3163,1.6782,123
0.1203,-9.9593,0.3725,0.2436,-9.9593,0.4849,2.0265,1.4638,124
0.37,-9.9611,0.5655,0.0702,-9.9611,0.2147,2.1942,1.9292,125
0.3431,-9.9666,0.4574,0.0783,-9.9666,0.1713,2.1048,2.0693,126
0.2475,-9.9642,0.3904,0.1148,-9.9642,0.3238,2.1399,1.7222,127
0.308,-9.964,0.3418,0.0479,-9.964,0.1157,1.8501,1.7945,128
0.346,-9.9636,0.4626,0.063,-9.9636,0.1732,2.0389,1.9501,129
-2.2803,-9.9619,0.373,1.0145,-9.9619,1.7095,5.7656,1.7473,130
-5.0991,-9.9441,-1.1994,1.9455,-9.9441,1.308,6.9439,4.4073,131
-4.6492,-9.9662,4.3011,5.5178,-9.9662,4.5838,28.0117,23.5376,132
-2.8702,-9.9329,2.8833,4.6795,-9.9329,8.2435,31.1852,16.5761,133
-3.5911,-10.0316,7.116,5.4385,-10.0316,1.6329,16.3394,16.1933,134
-3.1559,-9.9502,0.2027,1.1488,-9.9502,3.8688,9.0577,4.9457,135
-0.4284,-9.9615,0.4492,0.7045,-9.9615,2.7687,11.3729,7.3664,136
-1.7988,-9.8469,0.3733,1.1339,-9.8469,0.9986,10.2318,6.544,137
-2.3314,-9.6972,0.2599,1.1192,-9.6972,2.4219,11.0527,5.3913,138
-2.5355,-9.9351,-0.1654,1.7414,-9.9351,2.5804,7.0204,4.1456,139
-2.4369,-9.9449,0.1789,1.3264,-9.9449,3.2083,13.82,7.5294,140
-0.8515,-10.2098,0.3546,0.8864,-10.2098,1.4299,12.6588,8.4578,141
-3.7234,-9.8646,-0.1003,1.0854,-9.8646,1.9065,12.7171,4.5839,142
-0.7069,-9.9722,0.1612,0.5182,-9.9722,1.0709,7.0996,4.9174,143
-2.2994,-9.9685,0.1143,1.1177,-9.9685,1.4628,10.5808,5.1357,144
-0.6008,-10.0124,1.2909,1.1174,-10.0124,0.7141,7.1669,6.5449,145
-0.5829,-9.9704,0.4574,0.916,-9.9704,1.445,7.2008,6.4063,146
-3.0174,-9.8695,0.2399,1.6562,-9.8695,2.458,11.3021,7.8456,148
-0.5457,-10.3703,0.2649,0.7062,-10.3703,0.775,12.2138,6.2799,149
-2.7793,-9.8819,0.6706,2.4681,-9.8819,2.6134,12.4004,5.8911,150
-5.9699,-10.2849,0.1538,4.6857,-10.2849,0.9636,16.9726,12.7508,151
-0.8034,-10.507,0.4004,0.7382,-10.507,1.8745,23.8471,12.3429,152
-9.045,-9.9616,-0.0997,4.1707,-9.9616,1.0041,20.8106,18.7055,153
-5.8748,-9.8787,4.5474,5.779,-9.8787,2.0297,18.7963,14.682,154
-3.376,-10.0127,0.1692,1.6412,-10.0127,4.2154,26.7461,23.2696,156
-3.7113,-10.1281,1.6802,4.4636,-10.1281,3.7153,33.6424,30.8988,157
-1.2526,-10.0041,7.8433,9.2091,-10.0041,5.1177,21.2727,19.1037,158
-2.2149,-9.8817,1.4154,3.1138,-9.8817,3.131,11.3175,8.2381,159
-6.1876,-10.0493,4.6101,6.2048,-10.0493,7.1363,35.2858,25.4137,160
-7.8118,-9.9882,-0.8321,5.2968,-9.9882,3.7888,38.129,35.0832,161
-5.3324,-10.6987,-1.9748,1.5377,-10.6987,2.1919,23.1949,21.1669,162
-4.9909,-9.7037,-1.6798,2.8226,-9.7037,4.2962,18.9579,13.3577,163
-6.3507,-9.8054,0.7319,6.852,-9.8054,3.1473,16.693,11.7809,164
-5.8207,-9.5233,-0.0083,3.5162,-9.5233,3.8031,21.3135,14.2863,165
-6.2554,-9.8578,-1.4274,3.7298,-9.8578,4.1955,13.8647,9.1317,166
-9.7604,-9.7525,-1.5049,4.9013,-9.7525,4.3936,19.6326,14.0335,167
-5.1489,-10.1998,2.0725,5.9046,-10.1998,10.0025,22.4503,14.1505,168
-0.7716,-10.0177,2.4113,3.1196,-10.0177,4.8791,11.8436,9.6206,169
-0.8332,-9.638,0.0246,0.6006,-9.638,3.002,15.3787,12.1926,170
-0.3055,-9.7,0.9481,1.4927,-9.7,2.2804,10.8833,8.1024,171
-1.7657,-9.9458,-0.3126,0.7495,-9.9458,1.3892,14.0667,4.3817,172
-1.9225,-9.8809,-0.6099,0.8885,-9.8809,1.78,8.4114,2.7375,173
-3.4273,-10.2008,-0.7592,1.5106,-10.2008,4.2529,14.265,10.8813,174
-2.9318,-9.9144,-0.3357,1.5992,-9.9144,2.5165,8.9907,5.078,175
-0.3028,-9.9788,0.0078,0.1666,-9.9788,1.4933,3.4777,2.6179,176
-2.8137,-10.165,0.5981,1.636,-10.165,1.336,16.3552,14.4566,177
-0.147,-9.7929,0.1964,0.336,-9.7929,1.0219,9.8655,7.7747,178
-0.3396,-9.847,0.2967,0.5849,-9.847,0.7713,13.71,12.2705,179
-0.0611,-10.0193,0.4967,0.3955,-10.0193,0.787,9.6826,9.0943,180
-1.248,-8.9241,0.9295,2.0631,-8.9241,1.0201,11.704,8.0352,181
-6.6983,-9.8872,0.8157,3.2239,-9.8872,3.2527,25.5942,9.3299,182
-0.975,-9.4331,0.1051,0.7803,-9.4331,3.1112,11.594,10.053,183
-0.2251,-10.0513,0.3978,0.5696,-10.0513,1.0373,7.1643,4.9645,184
-0.4545,-9.8681,0.0671,0.4028,-9.8681,0.7137,5.8974,3.7501,185
-2.434,-9.9626,0.8518,2.3473,-9.9626,1.8336,9.0326,8.3858,189
-1.225,-9.8471,-0.1809,0.7526,-9.8471,0.8413,5.3735,3.6992,190
-0.0675,-10.005,0.6165,0.7166,-10.005,0.7251,4.7521,3.8287,191
-3.9038,-9.86,1.0389,3.1839,-9.86,3.0549,15.3075,8.2628,193
-0.9786,-8.9933,-0.136,0.5031,-8.9933,1.1556,16.1293,12.0381,194
-2.4797,-9.7264,3.592,3.1778,-9.7264,1.0323,15.0094,12.3625,195
-4.2448,-9.8437,-0.2956,1.7656,-9.8437,4.26,13.7522,7.8844,196
-3.0513,-9.5698,0.6351,1.5654,-9.5698,2.7973,16.2019,8.2344,197
-5.4903,-10.0005,1.165,3.1745,-10.0005,3.9462,17.7411,8.2911,198
-7.4379,-10.1233,2.9684,5.8243,-10.1233,8.5564,16.1363,11.4709,199
-4.9762,-9.3867,2.4493,6.4177,-9.3867,6.3988,18.9372,7.6579,200
-7.303,-9.995,0.1261,2.3998,-9.995,3.0867,19.4149,7.2796,202
-3.4387,-9.8358,0.8201,2.0391,-9.8358,4.205,14.2228,6.9946,204
-4.976,-10.1164,0.6672,2.6872,-10.1164,3.6096,22.5057,6.8396,205
-2.7194,-9.6812,-0.1591,0.7858,-9.6812,1.3666,7.9365,3.7109,206
-2.3776,-9.847,1.2031,2.7568,-9.847,4.2199,13.7435,8.7825,208
-1.538,-10.4443,2.0317,2.61,-10.4443,3.1395,15.9081,14.2461,210
-5.7659,-9.8065,0.0464,2.738,-9.8065,3.0004,15.7573,7.8666,211
-2.436,-9.7837,0.2735,1.2871,-9.7837,1.8635,10.0466,4.644,212
-2.6175,-10.1572,0.0896,1.0132,-10.1572,2.4189,13.6517,4.5268,213
-0.9058,-10.049,-0.0157,0.9465,-10.049,0.7468,7.5245,3.5146,214
-2.7743,-9.6757,0.0852,2.2877,-9.6757,1.9744,14.8882,7.43,215
-2.6274,-9.7297,-0.2437,1.4891,-9.7297,2.2846,8.4077,3.3433,216
-0.5153,-9.836,-0.059,0.3652,-9.836,2.3164,10.3283,5.3008,217
-2.5343,-9.9516,2.4216,3.6848,-9.9516,5.7716,15.7749,10.3821,218
-5.939,-9.6685,-0.2578,2.356,-9.6685,2.1754,8.3801,5.5981,219
-1.4738,-9.9841,-0.1718,0.5692,-9.9841,0.9102,7.8018,3.4542,221
-2.1278,-9.884,0.2367,1.2467,-9.884,1.474,6.7771,5.9564,224
-2.7553,-9.6198,1.3225,2.8279,-9.6198,1.3878,11.3554,7.8371,225
-7.5723,-9.7382,0.0033,4.5825,-9.7382,2.4269,13.0871,9.2252,226
-2.0355,-9.9517,-0.0495,1.0888,-9.9517,0.6836,3.6041,2.5399,227
-1.2286,-9.9657,0.5091,1.6254,-9.9657,2.683,10.206,5.6581,228
-1.1265,-9.8762,-0.1434,0.4448,-9.8762,1.0314,7.6178,3.788,229
-0.9174,-9.9538,0.0642,0.5159,-9.9538,1.4737,7.5889,3.6955,230
-9.2753,-9.9298,-3.6077,3.7214,-9.9298,1.7723,8.0334,5.7579,231
0.2668,-9.9366,1.5245,0.6123,-9.9366,0.9274,2.9208,2.71,232
0.1893,-9.947,0.6031,0.2766,-9.947,0.4076,2.362,1.9414,233
-0.2828,-9.9419,0.8388,0.7468,-9.9419,0.9371,3.259,1.8695,234
-1.5475,-9.9362,0.6474,1.3118,-9.9362,1.6401,2.9196,2.0482,235
1.026,-9.9463,1.3127,0.2977,-9.9463,0.3727,2.7761,2.2112,236
0.3412,-9.9524,0.554,0.1229,-9.9524,0.191,1.7485,1.6005,237
0.7626,-9.9542,1.0333,0.172,-9.9542,0.3104,2.5135,2.2965,238
0.1927,-9.9572,0.5209,0.1502,-9.9572,0.2581,1.7499,1.656,240
0.511,-9.9562,0.5522,0.0206,-9.9562,0.0261,1.6365,1.623,241
0.486,-9.9566,0.522,0.032,-9.9566,0.0616,1.6352,1.5846,242
0.5063,-9.9549,0.5802,0.0462,-9.9549,0.0822,1.7457,1.6215,243
0.5412,-9.9552,0.5815,0.0302,-9.9552,0.0496,1.7234,1.6448,244
0.48,-9.9557,0.5247,0.0296,-9.9557,0.0583,1.6354,1.5804,245
0.5331,-9.9562,0.5681,0.0215,-9.9562,0.0349,1.6824,1.6291,246
0.5437,-9.956,0.5908,0.0303,-9.956,0.0595,1.7186,1.6483,247
0.4082,-9.955,0.4994,0.0694,-9.955,0.1435,1.6651,1.5641,248
0.5343,-9.9556,0.5883,0.0285,-9.9556,0.0466,1.6799,1.6368,249
0.5198,-9.9552,0.5542,0.0238,-9.9552,0.0343,1.6204,1.5786,250
0.52,-9.9536,0.5651,0.0277,-9.9536,0.0412,1.6489,1.6167,251
0.5794,-9.9535,0.5997,0.0137,-9.9535,0.0178,1.6636,1.6365,252
0.4317,-9.9544,0.5896,0.0968,-9.9544,0.1677,1.7708,1.635,253
0.5463,-9.9553,0.6161,0.0342,-9.9553,0.0549,1.7078,1.6789,254
0.3641,-9.9544,0.4045,0.0288,-9.9544,0.0489,1.4924,1.4432,255
0.347,-9.95,0.4889,0.1003,-9.95,0.156,1.5881,1.4938,256
0.5007,-9.9519,0.6791,0.0972,-9.9519,0.1546,1.7773,1.7076,257
0.5736,-9.9479,0.6311,0.0363,-9.9479,0.049,1.6512,1.5777,259
0.617,-9.9505,0.6675,0.0298,-9.9505,0.042,1.6721,1.631,260
0.5253,-9.9498,0.6236,0.0653,-9.9498,0.103,1.6983,1.5665,261
0.6126,-9.9495,0.6772,0.0384,-9.9495,0.0657,1.676,1.6218,262
0.5732,-9.9494,0.6181,0.0448,-9.9494,0.0818,1.6587,1.5639,263
0.6641,-9.9505,0.7107,0.028,-9.9505,0.0238,1.676,1.6454,264
0.7325,-9.9477,0.7843,0.0348,-9.9477,0.0445,1.7595,1.7155,265
0.6486,-9.9474,0.6818,0.0269,-9.9474,0.0451,1.6566,1.6148,266
0.5983,-9.9456,0.6724,0.0591,-9.9456,0.0703,1.7059,1.6032,267
-0.4512,-9.9458,0.8588,0.745,-9.9458,1.0106,3.0793,1.8624,268
0.5744,-9.9445,0.8121,0.1574,-9.9445,0.2327,2.0945,1.7957,269
-0.6331,-9.9464,0.9613,0.7594,-9.9464,1.1117,3.8966,2.3682,270
-2.1828,-9.944,-0.3271,1.2935,-9.944,1.6151,3.0779,2.182,271
0.4403,-9.935,1.1033,0.4037,-9.935,0.4904,2.3172,2.0309,272
0.2616,-9.9378,0.5308,0.2164,-9.9378,0.2603,1.6493,1.4592,273
0.6437,-9.9333,1.1043,0.3535,-9.9333,0.4013,2.227,1.7835,274
0.6069,-9.9036,3.0247,1.5843,-9.9036,1.1692,5.3353,3.0684,275
-4.3372,-9.9736,1.0617,2.2621,-9.9736,4.1849,22.2631,9.2794,276
-3.0361,-9.9717,0.1581,1.4055,-9.9717,3.6117,13.3278,9.8528,277
-2.5113,-9.9322,-1.1063,0.8383,-9.9322,0.8594,8.4899,6.6956,278
-3.2149,-9.9238,0.7095,2.7356,-9.9238,3.4214,11.5166,5.7601,279
-1.6648,-10.0293,2.5383,3.2473,-10.0293,6.2707,27.5722,19.3305,280
-0.8633,-9.315,0.7651,1.3643,-9.315,3.8484,22.1461,13.3807,281
-7.5724,-11.5765,-0.8602,3.3259,-11.5765,3.4487,18.2715,14.2703,283
-2.1904,-9.6832,3.1123,4.8728,-9.6832,2.7112,11.6975,7.4879,284
-6.6801,-9.7113,-0.0888,2.4406,-9.7113,3.7721,10.0887,6.7776,285
-6.2756,-9.8882,0.2293,2.9073,-9.8882,3.9617,16.8424,7.9565,286
-0.8707,-10.6119,-0.0773,0.5322,-10.6119,2.4786,6.9715,5.0142,287
-12.0538,-9.8463,-0.2996,4.577,-9.8463,5.131,12.963,7.0808,290
-4.651,-9.8975,0.4422,1.9777,-9.8975,4.1456,9.7951,5.4953,291
-0.4239,-10.0232,0.0423,0.3269,-10.0232,2.0513,7.3517,4.0111,292
-4.5891,-10.5057,-0.5203,2.2567,-10.5057,1.5258,10.8141,5.3596,293
-2.2787,-9.2085,1.2722,2.1357,-9.2085,1.4247,12.1837,6.9654,294
-0.5353,-9.9792,-0.0845,0.2953,-9.9792,2.0262,7.4829,6.9454,295
-3.7595,-10.0627,-0.114,1.6172,-10.0627,3.8818,12.2104,7.207,296
-5.4288,-10.398,2.4452,4.0526,-10.398,1.2729,13.7726,10.6151,297
-2.02,-9.7029,-0.0538,0.9117,-9.7029,1.9514,14.9218,4.8361,298
-7.4416,-9.8152,0.0101,2.8679,-9.8152,3.1686,11.0004,5.6852,300
-1.1653,-9.8421,-0.1842,0.4555,-9.8421,1.8885,5.0689,4.3811,302
-3.8524,-9.9948,0.8339,2.9313,-9.9948,6.2492,13.7629,6.3466,303
-4.4015,-10.0529,4.2323,6.4954,-10.0529,12.7808,28.1765,14.9409,305
-1.914,-10.5312,-0.3362,0.92,-10.5312,1.3481,11.0135,10.1934,307
-4.9346,-10.438,0.2566,2.6582,-10.438,4.5924,36.7576,23.8267,308
-10.4575,-9.7615,0.7975,5.1077,-9.7615,5.7031,25.0884,19.4389,309
-4.0755,-10.1985,1.1424,2.4657,-10.1985,5.3684,35.7809,20.2371,310
-8.4929,-10.34,-1.7188,3.3297,-10.34,1.4878,22.9456,21.0444,311
-8.5751,-9.8327,6.073,9.7095,-9.8327,4.1348,16.8653,14.9796,312
-1.3676,-9.9264,-0.414,0.5981,-9.9264,1.7701,13.8591,9.438,313
-4.5515,-10.0459,0.6824,2.3961,-10.0459,4.2086,11.4308,7.1521,314
-0.138,-9.4103,0.4169,0.5059,-9.4103,1.6778,7.2585,4.3135,315
-3.3911,-10.0372,-0.8516,1.2031,-10.0372,2.8508,6.7462,4.5908,316
-3.7366,-9.966,0.63,2.035,-9.966,4.5098,10.2626,5.1603,317
-5.4631,-10.0977,-0.405,3.6431,-10.0977,5.1612,17.603,10.6971,318
-9.4356,-9.9093,0.8447,3.2867,-9.9093,4.6529,15.0332,5.2776,320
-0.5379,-9.7999,-0.012,0.4641,-9.7999,0.6572,6.306,3.9613,321
-0.001,-9.9663,0.2596,0.2191,-9.9663,1.7066,3.8346,3.0566,322
-0.1867,-9.9834,0.0091,0.1278,-9.9834,0.9373,5.1462,3.4825,323
-0.9465,-9.9638,0.0541,0.6675,-9.9638,1.1679,4.8906,4.4393,324
0.0009,-10.0283,0.5844,0.4113,-10.0283,1.8311,8.1609,7.4124,325
-0.2658,-9.909,-0.0575,0.1735,-9.909,0.4978,4.224,3.5489,326
-0.92,-9.9721,0.7357,0.9447,-9.9721,2.5097,8.2931,5.8787,327
-0.2662,-9.9631,-0.0837,0.14,-9.9631,0.3063,3.5477,1.9426,328
-0.5616,-9.9673,0.1036,0.3449,-9.9673,1.441,11.2244,9.3572,331
-0.5743,-9.9347,-0.0483,0.2621,-9.9347,0.6557,2.4739,1.6464,332
-0.8339,-9.9637,0.181,0.7858,-9.9637,1.2224,15.4941,14.303,333
0.0815,-9.9574,1.3569,1.1468,-9.9574,1.2926,18.7693,11.7305,334
-0.5852,-9.9966,0.0064,0.4403,-9.9966,0.1821,7.766,7.274,335
-0.7241,-10.0103,0.0977,0.7166,-10.0103,0.7478,7.7111,7.1711,336
-0.4525,-9.9616,0.1284,0.4958,-9.9616,1.5977,16.1433,7.4335,337
-1.9315,-9.9714,0.038,0.6614,-9.9714,1.4296,10.1151,6.7755,340
-5.4102,-9.9727,-0.0267,1.8619,-9.9727,1.2177,10.2477,6.5919,342
-6.1369,-9.9415,-1.5157,2.5642,-9.9415,3.1752,6.93,3.7762,343
-4.3557,-9.9245,-1.6042,1.444,-9.9245,2.0361,4.1061,3.1553,344
-2.2506,-9.9576,-0.4618,0.9203,-9.9576,1.4203,3.0404,1.7793,345
-0.2041,-9.9586,-0.0026,0.1164,-9.9586,0.3391,1.459,1.4021,346
-0.6911,-9.9595,-0.4038,0.151,-9.9595,0.5099,2.3566,1.6776,347
-0.5649,-9.9583,-0.2363,0.1923,-9.9583,0.5361,1.8545,1.422,348
-0.597,-9.9583,-0.3186,0.1199,-9.9583,0.2472,1.7619,1.4829,349
-3.1821,-9.9482,-1.7471,1.2574,-9.9482,1.6062,5.6077,3.9409,350
-3.5518,-9.9372,-0.4056,1.7051,-9.9372,2.0357,3.884,1.9956,351
-3.2985,-9.9477,-0.2386,1.2558,-9.9477,1.8283,4.0908,2.8169,352
-6.3033,-9.9191,-2.1832,2.2867,-9.9191,1.2748,6.616,4.4367,353
-4.8033,-9.9412,-0.0436,2.6895,-9.9412,3.2305,11.4872,7.6937,354
-4.3507,-9.9321,-1.3252,1.1477,-9.9321,1.3062,4.8841,2.225,355
-3.219,-9.9334,0.0865,1.253,-9.9334,1.3413,3.1515,1.5324,356
-3.9524,-9.9535,0.1387,2.9332,-9.9535,3.8465,20.6151,11.5265,357
-25.542,-10.0014,0.9648,10.3237,-10.0014,6.6306,30.0248,21.7781,358
-25.0791,-9.9142,2.1138,10.2522,-9.9142,7.3234,34.3029,23.4008,360
-2.6992,-9.9648,-0.185,0.9318,-9.9648,2.4161,9.5209,2.8725,361
-2.6648,-9.9381,0.2026,1.8493,-9.9381,2.1899,9.457,6.951,362
-1.336,-10.1043,-0.2382,0.8558,-10.1043,5.4175,22.7176,19.9358,363
-0.5759,-9.9001,0.9815,1.576,-9.9001,2.3548,8.4443,6.9205,364
-0.4613,-9.9421,0.1194,0.513,-9.9421,2.0567,11.5511,7.7227,365
-0.7116,-9.9504,0.7801,1.3415,-9.9504,2.1259,9.7052,8.5989,366
-1.2927,-9.8104,12.6201,9.7136,-9.8104,2.3442,25.2119,18.4388,367
-0.3168,-9.9868,0.4693,0.8432,-9.9868,2.7281,8.8056,4.027,368
-0.029,-9.9956,4.5414,3.706,-9.9956,3.9698,14.011,11.7629,369
-2.1081,-9.9633,0.0675,0.5382,-9.9633,2.1489,6.7012,4.2906,370
-1.5898,-9.951,1.8091,2.0745,-9.951,2.8686,10.7956,9.3591,371
-0.3065,-9.9549,0.0648,0.251,-9.9549,1.3712,3.7956,2.4442,372
-6.487,-9.9962,0.9302,3.5871,-9.9962,6.3959,16.5359,7.8632,374
-1.922,-9.8472,-0.0407,1.0767,-9.8472,2.944,11.8836,10.9139,375
-0.7492,-9.9984,-0.2155,0.2493,-9.9984,1.6175,2.8425,2.2228,376
-1.4746,-10.0129,0.082,0.9905,-10.0129,2.252,6.0623,2.6998,377
-2.4318,-9.758,0.6241,2.4897,-9.758,0.6902,11.9485,9.6688,378
-2.6674,-9.9898,0.1775,0.9841,-9.9898,3.5836,9.6443,3.9547,380
-0.5217,-10.0399,0.0347,0.295,-10.0399,1.603,3.9455,2.1005,381
-0.5215,-10.4265,0.4727,0.8664,-10.4265,1.97,8.9437,5.2066,382
0.0,-9.8871,0.9315,1.0436,-9.8871,4.2861,11.1991,8.1339,383
-1.4409,-9.9681,0.9003,1.3063,-9.9681,0.7258,11.4325,8.3217,384
-0.7181,-9.9259,0.039,0.3816,-9.9259,1.7705,5.0502,3.0115,385
-1.3273,-9.9438,0.0879,0.6285,-9.9438,2.2536,7.5966,3.2737,387
-0.5143,-10.068,0.5508,0.6938,-10.068,1.5134,8.4887,4.3349,388
-2.8527,-9.9545,0.5568,2.0284,-9.9545,5.2836,16.9807,8.2247,390
-10.3922,-9.9771,0.8953,3.4646,-9.9771,5.2486,15.9541,9.3351,391
-3.1067,-9.8094,0.7931,2.0187,-9.8094,2.9953,10.2348,6.6335,392
-3.7396,-10.3069,-0.1183,1.9287,-10.3069,1.929,10.7431,7.7349,393
-0.5914,-10.3854,4.8759,3.5518,-10.3854,0.8215,14.4233,10.2316,394
-2.6462,-10.2354,-0.2376,1.5954,-10.2354,1.3349,10.5839,8.3957,395
-0.7729,-9.8471,-0.167,0.3242,-9.8471,2.7485,4.2402,3.2422,396
-5.6793,-10.1067,2.4414,4.4289,-10.1067,4.9257,14.2662,11.7699,397
-0.7547,-10.1323,1.0965,1.1159,-10.1323,1.9925,10.4192,6.9211,399
-11.604,-9.8788,0.1913,3.2187,-9.8788,4.5666,15.9572,5.9693,400
-0.5168,-9.9488,-0.0628,0.2196,-9.9488,1.3858,6.7503,5.3197,402
-0.2514,-9.9129,2.899,2.6217,-9.9129,3.8163,12.0328,7.6996,403
-0.8622,-9.6907,-0.1423,0.5437,-9.6907,1.4575,4.3824,2.3126,404
-1.0449,-10.0512,0.3582,1.2059,-10.0512,2.0547,6.8397,4.1462,405
-1.8983,-10.2595,0.122,1.15,-10.2595,1.9909,8.3446,6.8913,406
-2.2521,-10.0901,1.981,2.9493,-10.0901,4.5912,13.0722,11.245,407
-4.0989,-9.9971,0.4751,1.7499,-9.9971,4.0936,14.0552,10.3521,408
-0.415,-9.9792,1.4298,1.877,-9.9792,3.4321,18.1725,16.6537,409
-3.6935,-10.0948,0.7424,2.0231,-10.0948,3.9985,10.7829,6.779,410
-4.1661,-9.9645,0.713,2.0365,-9.9645,3.996,19.7608,8.6255,411
-11.8296,-9.7175,0.239,5.4672,-9.7175,5.625,37.0319,7.8496,412
-1.7827,-10.043,0.7131,1.703,-10.043,2.9066,12.8363,9.1184,413
-1.1343,-10.009,0.4614,0.8531,-10.009,2.6058,8.5858,6.5143,414
0.6712,-9.9747,2.2853,1.0878,-9.9747,4.703,14.9863,10.2124,415
-2.9118,-9.8815,0.3192,1.7936,-9.8815,4.6599,10.5437,6.7375,416
-3.1853,-9.9812,-0.1197,1.1046,-9.9812,2.5955,9.2755,4.5848,417
-0.8866,-9.9534,0.0409,0.7859,-9.9534,1.8193,5.9254,4.0731,418
-2.0184,-9.9975,-0.1802,0.9783,-9.9975,2.203,6.5483,3.6702,419
-4.602,-9.9588,-0.3804,1.6489,-9.9588,2.6275,13.2948,5.0862,420
-2.9107,-9.9424,0.0443,1.3821,-9.9424,2.0283,10.1015,5.5486,421
-3.9829,-9.9931,0.1437,2.3089,-9.9931,4.1458,11.808,6.7946,422
-2.3485,-9.8103,-0.231,1.3223,-9.8103,1.9907,12.1101,10.5113,423
-4.993,-9.9867,-0.8884,2.4586,-9.9867,4.5989,14.7542,10.8656,424
2.1632,-9.9693,9.2585,7.3721,-9.9693,6.2613,19.1017,18.0017,425
-2.5603,-9.9513,2.0421,3.1268,-9.9513,1.442,11.1775,9.8786,426
-4.2757,-9.9233,1.1218,2.3946,-9.9233,1.8244,8.8645,7.4199,427
-4.3587,-10.3207,-0.7287,1.9782,-10.3207,1.9115,10.2034,6.724,428
-3.6581,-9.9499,0.2909,1.6512,-9.9499,3.3729,13.5486,4.8603,430
-2.0825,-10.0146,-0.1434,1.0753,-10.0146,3.0465,5.4325,3.5542,431
-1.9053,-10.004,1.3931,2.731,-10.004,1.2173,11.7838,7.2449,432
-5.3501,-10.3026,3.1142,6.0039,-10.3026,5.5495,18.466,11.7316,434
-2.7524,-9.9246,0.4347,1.9493,-9.9246,4.2286,10.3404,5.3136,435
-1.0499,-9.8944,0.2315,0.936,-9.8944,2.617,6.4006,4.9517,436
-2.2889,-9.8518,-0.2859,1.0012,-9.8518,3.6503,8.5578,4.9869,437
0.1142,-8.7697,1.2586,0.9928,-8.7697,1.4529,8.5698,5.5687,438
-3.6984,-9.923,0.7321,2.5381,-9.923,4.6484,10.8927,5.3346,440
-0.4179,-10.0665,1.0857,1.97,-10.0665,3.4231,15.6294,7.9689,441
-3.8819,-9.8888,-0.8876,2.0042,-9.8888,3.0357,9.0077,5.9574,442
-1.7424,-9.4005,-0.4447,1.0826,-9.4005,2.6258,11.6164,8.2778,443
-2.1694,-9.8841,-0.4671,1.0501,-9.8841,1.474,5.3143,4.7204,444
-1.3444,-9.9655,0.4083,0.9163,-9.9655,2.5024,5.5073,2.8133,445
-1.1375,-10.0383,0.807,1.9092,-10.0383,5.4546,11.2403,6.6809,447
-4.0504,-9.8901,-0.3534,2.0652,-9.8901,1.3131,7.6009,6.4879,448
-3.8061,-9.963,0.6547,1.8353,-9.963,3.754,11.781,5.5755,450
-2.9153,-9.9762,0.5676,2.0393,-9.9762,3.776,8.3623,5.1088,451
-1.7189,-9.9271,0.7359,2.1263,-9.9271,4.674,12.0666,7.2902,452
-0.1817,-9.921,0.4151,0.5149,-9.921,1.1557,4.9687,3.4144,453
-1.6165,-9.9256,-0.2119,0.8538,-9.9256,1.3468,4.5584,3.3673,454
-0.7237,-9.9279,0.6907,0.8062,-9.9279,1.0115,5.3117,4.4075,455
-1.6698,-9.9033,-0.1637,0.7261,-9.9033,2.3118,3.982,2.7735,457
-2.1943,-9.9546,0.4081,1.1807,-9.9546,1.9379,8.767,3.8022,458
-1.4483,-10.0873,0.2252,0.854,-10.0873,1.4997,5.2896,3.787,459
-2.2949,-9.9327,-0.2585,0.6066,-9.9327,2.35,10.2752,4.6509,460
-0.918,-9.9767,1.7563,2.6458,-9.9767,5.6608,13.9252,7.9247,461
-1.5272,-10.0104,-0.4174,0.699,-10.0104,1.4386,6.9289,4.1533,462
-0.4229,-10.0082,0.7024,1.0559,-10.0082,2.7817,8.2009,3.8967,463
-0.6281,-10.0937,0.7358,1.27,-10.0937,2.0517,6.7956,3.6514,464
-0.1341,-10.2654,0.6728,0.4909,-10.2654,1.2756,4.9541,3.6046,465
-0.71,-10.1132,0.5425,0.7256,-10.1132,1.7519,8.6304,4.8703,466
-2.3322,-9.8416,-0.9122,0.7542,-9.8416,0.5787,8.8297,5.5607,467
-1.2111,-9.8267,0.3542,0.9806,-9.8267,2.7442,6.5015,4.6937,468
-1.6781,-9.9558,0.6698,1.463,-9.9558,4.3129,9.5184,6.4321,470
-1.7103,-9.9864,0.153,0.7579,-9.9864,2.7759,6.9593,3.1968,471
-1.2908,-10.0485,0.4229,1.24,-10.0485,2.4352,7.0439,3.9659,472
-0.5821,-10.0449,1.6308,1.2961,-10.0449,1.6922,5.7699,5.2489,473
-1.9217,-9.896,0.0347,1.0096,-9.896,2.5771,9.1109,4.5174,474
-3.0628,-9.9735,-0.1139,1.3707,-9.9735,2.9217,6.4939,5.302,475
-1.9332,-9.8636,0.3454,0.9733,-9.8636,1.696,7.0114,4.7536,476
-0.8478,-9.8688,0.0751,0.7007,-9.8688,0.8312,5.0572,4.2646,477
-4.1349,-10.0685,1.6829,3.7262,-10.0685,5.7326,12.3171,9.3754,478
-7.3865,-9.9521,1.8788,3.611,-9.9521,6.2745,18.3784,8.3317,480
-7.7481,-9.7852,0.0693,3.8509,-9.7852,2.3838,12.3008,9.3707,481
-9.079,-9.852,-1.3555,3.6807,-9.852,2.1546,10.5916,7.6483,482
-1.3817,-9.7816,-0.0317,1.0707,-9.7816,1.7207,14.2022,5.179,483
-0.3979,-9.9223,0.3124,0.4788,-9.9223,1.1027,9.9431,9.209,484
-0.3461,-9.9032,0.3054,0.4628,-9.9032,0.7773,3.4083,3.0123,485
-0.997,-9.9889,1.9034,2.0915,-9.9889,2.0868,12.3991,10.6728,486
-0.4365,-10.0268,0.1402,0.4346,-10.0268,1.9657,6.6343,4.2622,487
-0.0683,-10.0068,0.6409,0.7074,-10.0068,1.8657,8.2612,7.3446,488
-0.85,-9.9593,0.3423,0.6316,-9.9593,3.0463,11.5673,6.782,490
-0.0904,-10.0828,0.2873,0.3588,-10.0828,1.2913,10.085,8.3132,491
-1.8577,-8.5239,0.0868,1.3539,-8.5239,1.4727,14.4646,6.9087,492
-2.9494,-10.1495,2.2229,3.9631,-10.1495,8.3258,25.6835,18.9937,494
-13.5561,-9.8687,1.2651,4.6402,-9.8687,6.7023,29.0044,12.4804,495
-4.5778,-9.8688,0.5611,2.1118,-9.8688,2.4097,30.932,23.4201,497
-0.4529,-10.4033,0.0364,0.6271,-10.4033,1.5829,27.0458,19.8233,498
-2.305,-10.0254,-0.0608,0.7384,-10.0254,2.4537,8.5337,4.3312,500
-2.076,-9.8117,0.8036,1.6451,-9.8117,1.9014,9.8058,6.8689,501
-1.7446,-10.1528,0.5913,2.1973,-10.1528,0.6499,8.1492,6.6636,502
-2.4497,-9.9923,-0.7008,1.589,-9.9923,0.8189,12.0273,7.697,503
-1.5562,-10.0159,0.5027,1.1897,-10.0159,0.8436,10.4966,8.2968,504
-0.6033,-10.2181,0.9508,1.2304,-10.2181,4.9127,17.9546,13.3356,505
-0.9402,-10.0289,-0.1829,0.4646,-10.0289,2.427,8.9888,7.2319,506
-0.8163,-9.9435,0.0939,0.4718,-9.9435,1.5605,7.8238,5.1515,507
-0.6635,-9.9953,0.514,0.6145,-9.9953,1.4207,7.2619,4.4401,508
-5.6967,-9.9319,3.281,5.9966,-9.9319,10.6333,28.6445,18.8509,510
-9.4615,-10.0273,3.3586,5.8728,-10.0273,5.9118,37.0495,22.7606,511
-0.8433,-9.9802,-0.0333,0.843,-9.9802,1.5453,6.2035,5.2399,512
-7.3453,-9.9569,-3.377,2.5356,-9.9569,1.4367,9.3129,5.376,513
-7.4051,-9.9443,0.0253,3.3815,-9.9443,4.6256,9.9481,6.1081,514
-1.3061,-9.9436,-0.2766,0.489,-9.9436,0.7766,3.1822,1.5905,516
-3.1457,-9.9514,-0.3996,1.1499,-9.9514,1.8882,4.3064,1.8197,517
-4.5778,-9.9396,-0.1487,1.4643,-9.9396,1.7515,4.0646,2.0707,518
0.2476,-9.9291,1.2867,0.6349,-9.9291,0.8879,3.5313,2.1549,519
0.5486,-9.938,0.6857,0.148,-9.938,0.1608,1.7981,1.6288,520
0.6212,-9.9416,0.7322,0.0989,-9.9416,0.1348,1.9254,1.7256,521
0.3603,-9.9467,0.7216,0.1601,-9.9467,0.2649,2.09,1.8944,522
0.2311,-9.9433,0.6069,0.1474,-9.9433,0.2738,1.8414,1.668,523
0.2638,-9.9447,0.4436,0.1422,-9.9447,0.2665,1.7434,1.4751,524
-0.0058,-9.9456,0.5879,0.4299,-9.9456,0.7981,2.3976,1.7617,525
0.1804,-9.9455,0.4916,0.2545,-9.9455,0.4981,2.231,1.4519,526
0.3647,-9.9411,0.4688,0.0896,-9.9411,0.1275,1.6619,1.4495,527
0.6415,-9.9411,0.7574,0.0762,-9.9411,0.1191,1.9372,1.7526,528
0.6015,-9.9419,0.6895,0.0577,-9.9419,0.0804,1.8389,1.751,529
0.4519,-9.9435,0.4855,0.0296,-9.9435,0.0579,1.5038,1.4801,530
0.6817,-9.9423,0.7247,0.0373,-9.9423,0.0344,1.7771,1.7435,531
0.4381,-9.9428,0.4878,0.0381,-9.9428,0.0525,1.5156,1.4648,532
0.6999,-9.9417,0.7914,0.0459,-9.9417,0.0975,1.9306,1.8144,533
0.5616,-9.9449,0.6257,0.0324,-9.9449,0.0756,1.7334,1.6552,534
0.5154,-9.9451,0.6196,0.0718,-9.9451,0.1118,2.0525,1.6302,536
0.2913,-9.945,0.4662,0.1009,-9.945,0.1999,1.9688,1.4803,537
0.4563,-9.9428,0.6205,0.121,-9.9428,0.1547,2.0118,1.6289,538
0.412,-9.9437,0.649,0.2095,-9.9437,0.348,1.9616,1.7371,539
0.5132,-9.9423,0.571,0.037,-9.9423,0.0429,1.6152,1.5396,540
0.6078,-9.9436,0.6745,0.0693,-9.9436,0.1137,1.8385,1.6843,541
0.3817,-9.9434,0.4689,0.0795,-9.9434,0.154,1.6005,1.4863,542
0.5741,-9.9442,0.6795,0.0431,-9.9442,0.0673,1.8294,1.7369,543
0.1494,-9.9444,0.5157,0.1806,-9.9444,0.3404,1.9772,1.5925,545
0.2167,-9.9437,0.5183,0.2084,-9.9437,0.3666,1.7715,1.5428,546
0.8157,-9.943,0.9172,0.0787,-9.943,0.1321,2.1771,2.0525,547
-0.0675,-9.9447,0.3473,0.3079,-9.9447,0.5912,2.1677,1.6237,548
-0.4796,-9.9349,0.8799,1.1776,-9.9349,1.8721,4.3565,2.3854,549
-1.6779,-9.9473,-1.1621,0.5604,-9.9473,0.764,2.9472,2.6627,550
1.2995,-9.925,2.0068,0.4003,-9.925,0.5737,3.116,2.826,551
0.4331,-9.9243,1.0838,0.3344,-9.9243,0.4028,2.3205,1.8525,552
0.4621,-9.9271,1.1139,0.4394,-9.9271,0.5556,2.5073,1.9572,553
0.6005,-9.9306,0.7624,0.1656,-9.9306,0.2163,2.012,1.5539,555
0.6943,-9.93,0.7859,0.0496,-9.93,0.0706,1.7089,1.6316,556
0.7304,-9.9311,0.8853,0.091,-9.9311,0.0978,1.8346,1.768,557
0.6294,-9.9307,0.7996,0.0914,-9.9307,0.1157,1.7868,1.6384,558
0.6237,-9.9313,0.6926,0.0492,-9.9313,0.067,1.6093,1.5439,559
0.9563,-9.932,1.0389,0.088,-9.932,0.11,2.0379,1.8344,560
0.5229,-9.9337,0.592,0.0551,-9.9337,0.0485,1.6272,1.5134,561
0.5919,-9.9363,0.8058,0.1157,-9.9363,0.1812,1.9084,1.7333,562
-0.1257,-9.9349,0.0886,0.1438,-9.9349,0.2163,1.4325,1.2013,563
-10.5282,-9.9075,0.1631,2.4945,-9.9075,2.3792,12.8638,2.3664,565
-4.4939,-9.9506,4.2556,7.9903,-9.9506,6.1957,30.4897,29.3811,566
-1.2778,-10.0437,1.1959,2.271,-10.0437,3.8705,11.947,9.1926,567
-1.2546,-10.2567,0.5871,0.9701,-10.2567,1.6196,16.2988,13.7155,568
-1.1305,-9.7766,0.1422,1.0876,-9.7766,2.3273,13.2742,7.9231,569
-0.1079,-10.1072,0.4811,0.7697,-10.1072,1.4815,9.8049,8.6396,570
-3.8769,-10.0991,-0.5207,1.6618,-10.0991,2.9849,18.4901,9.4328,571
-2.1344,-9.9766,0.4879,1.5028,-9.9766,2.1212,8.1549,3.8169,572
-0.904,-9.9167,0.495,0.64,-9.9167,0.9193,10.69,4.9539,574
-0.9257,-9.8488,0.2512,0.9505,-9.8488,2.0659,8.1985,4.0238,575
-1.1368,-10.0344,0.3863,0.8307,-10.0344,2.3007,7.8045,4.3593,576
-1.4031,-9.7084,0.2047,0.5576,-9.7084,1.3485,6.3038,3.5786,577
-0.6666,-10.0764,0.6013,0.8706,-10.0764,0.7012,6.7128,5.8015,578
-1.6544,-9.7364,0.1578,0.9628,-9.7364,1.6223,14.2167,6.456,579
-0.4465,-10.0675,0.0023,0.2539,-10.0675,0.7201,6.1269,3.6804,580
-0.039,-9.7902,0.4564,0.4597,-9.7902,0.296,7.776,3.5334,581
-1.8797,-10.176,-0.6722,0.6977,-10.176,1.7967,6.2708,3.6486,582
-2.1183,-9.9995,0.326,0.8297,-9.9995,2.1693,12.3848,4.8839,583
-4.9697,-10.2268,-0.1517,1.6596,-10.2268,2.0059,15.8174,4.9138,584
-2.5732,-10.1432,-0.0981,1.0631,-10.1432,2.6488,10.5994,4.2861,585
-5.6027,-10.0606,0.5577,2.9885,-10.0606,2.6203,16.2978,8.6774,586
-4.8245,-10.7086,-0.3111,3.3222,-10.7086,2.9072,17.4966,7.963,587
-2.1116,-9.7908,0.4177,1.2496,-9.7908,1.2189,12.4086,7.1769,588
-2.6727,-9.7748,3.4853,4.0176,-9.7748,2.2851,12.3139,9.8796,589
-1.147,-9.9368,-0.237,0.6524,-9.9368,0.4427,4.3985,3.3424,590
-0.373,-10.0088,0.3891,0.4246,-10.0088,0.2692,5.574,5.0196,591
-0.029,-9.9331,0.098,0.0756,-9.9331,0.7159,4.5211,3.6264,592
-1.2267,-9.9475,0.293,0.7848,-9.9475,2.1953,9.7473,5.9889,593
-2.1516,-9.926,0.1367,0.9393,-9.926,3.3565,12.8128,5.7928,595
-2.1192,-9.979,2.1933,3.4252,-9.979,2.6892,33.0123,22.9482,596
-4.4359,-9.948,0.7502,2.7598,-9.948,3.7439,24.6662,13.0001,597
-0.9198,-9.955,0.3424,0.6709,-9.955,2.6497,8.7452,7.0094,598
-5.1765,-10.1034,0.6632,4.4041,-10.1034,2.7919,8.0755,5.5704,599
-1.5459,-9.1569,-0.3853,1.0142,-9.1569,1.6669,12.9509,6.945,600
-0.7869,-9.9082,-0.0478,0.4374,-9.9082,1.4572,9.1353,7.856,601
-11.4265,-9.9343,0.575,4.1382,-9.9343,6.2992,20.1841,13.9232,602
-0.4311,-10.2442,3.1579,2.8225,-10.2442,5.3435,15.4579,12.1767,603
-1.9984,-9.9001,1.0035,2.3811,-9.9001,4.2348,19.5024,4.828,605
-0.4327,-9.9689,-0.0447,0.3649,-9.9689,1.0566,4.4611,3.2268,606
-1.7826,-9.9458,-0.1684,1.0521,-9.9458,1.3908,7.5906,4.9929,607
-0.6132,-9.9459,0.1101,0.3893,-9.9459,0.6294,3.8132,2.8345,608
-0.87,-10.0958,-0.0099,1.0016,-10.0958,1.4851,12.8347,8.9125,609
-5.4168,-9.7939,1.7692,3.8146,-9.7939,1.2303,14.7246,9.4476,610
-0.6057,-9.8212,-0.1292,0.2251,-9.8212,0.8415,11.0642,3.6722,611
-7.8116,-9.6785,0.7588,4.1991,-9.6785,4.5888,18.4675,8.6,612
-1.7328,-9.5812,0.7165,2.6211,-9.5812,5.7308,16.5878,13.6291,613
-3.9972,-9.1355,-0.6508,1.6674,-9.1355,1.9791,20.0035,8.1674,614
-4.4419,-9.969,-1.2186,1.584,-9.969,3.539,12.0939,6.181,615
-1.6521,-9.6712,0.6774,1.2313,-9.6712,1.2784,10.0657,5.8954,616
-3.6449,-9.6408,-0.4192,1.3365,-9.6408,1.8058,9.0973,6.795,617
-0.1475,-10.8477,0.2343,0.3485,-10.8477,0.5881,20.7674,12.8604,618
-0.371,-9.3687,0.2679,0.5594,-9.3687,2.231,12.2291,9.5382,619
-1.1135,-9.5552,-0.0498,0.5592,-9.5552,0.81,6.1378,3.0726,620
-0.8039,-9.7679,-0.2682,0.3163,-9.7679,1.0496,9.5783,5.2282,621
-5.3111,-9.8021,1.7718,2.7765,-9.8021,2.7151,17.0084,9.4012,622
-1.2049,-9.8938,0.9294,1.7344,-9.8938,1.5571,11.994,5.1058,623
-0.0629,-9.9883,1.4325,1.806,-9.9883,5.0211,12.6603,10.3057,625
-0.6628,-9.9546,0.1439,0.5274,-9.9546,1.6867,11.5846,10.2972,626
-4.3394,-10.2721,0.9597,3.679,-10.2721,0.6194,15.2261,12.3016,627
-6.3876,-9.4021,-0.3375,3.0728,-9.4021,3.1415,17.0199,10.4035,628
0.1016,-10.056,2.8252,2.7051,-10.056,2.4948,25.6974,14.1442,629
-2.1274,-10.1839,-0.5456,0.9242,-10.1839,2.9798,39.3848,36.0273,630
-3.0388,-9.9755,0.7832,1.4529,-9.9755,1.1455,19.7948,14.9093,631
-4.7455,-9.9581,2.0909,4.0891,-9.9581,5.3573,29.3804,19.141,632
-0.9168,-10.4187,-0.1662,0.595,-10.4187,1.5375,14.5959,7.5014,634
-1.6781,-9.984,1.0951,1.7276,-9.984,2.0068,25.4869,8.0619,635
-2.7018,-9.9913,0.9601,1.7411,-9.9913,4.4609,13.9561,10.1323,636
-3.6425,-9.9206,1.365,3.1333,-9.9206,4.5007,18.8039,12.3359,637
-3.7259,-10.0319,1.1514,2.0788,-10.0319,5.3307,21.9484,11.4531,638
-1.5731,-10.0085,0.9747,2.2382,-10.0085,0.4109,15.9635,8.7644,639
-11.9084,-10.15,-1.1713,4.9208,-10.15,3.7458,16.8957,15.8223,640
-1.8271,-9.9823,8.5141,10.1327,-9.9823,11.1231,23.5828,16.5641,641
-2.5123,-9.9955,0.2544,2.2119,-9.9955,3.6958,12.9988,8.4415,642
-6.6763,-10.0284,2.2142,4.921,-10.0284,10.3232,23.2836,12.6687,643
0.2956,-10.1313,6.8191,5.0544,-10.1313,8.2761,20.387,13.853,644
-2.074,-9.9486,-0.1651,0.9842,-9.9486,3.8654,9.4299,3.8662,645
-1.2978,-10.0073,0.0663,0.6447,-10.0073,1.9455,8.8847,3.3122,646
-3.2413,-10.1175,0.2438,3.5527,-10.1175,4.6354,8.9496,8.3958,647
-1.979,-9.9311,-0.2847,0.8318,-9.9311,2.1239,5.1349,2.9936,648
-1.4514,-9.9393,-0.3275,0.5713,-9.9393,1.1917,2.5433,2.0042,649
-0.3559,-10.1895,0.533,0.8236,-10.1895,1.6198,4.7899,4.5861,650
-1.8784,-9.7875,0.2666,1.706,-9.7875,3.9999,14.3245,9.095,651
-1.0475,-10.0753,0.7019,1.1224,-10.0753,2.5385,8.5984,6.1206,652
-4.0821,-10.0683,1.2791,3.3757,-10.0683,3.161,12.9645,6.5399,653
-3.2713,-10.0613,2.5406,3.8091,-10.0613,9.0238,29.5063,13.3945,655
-3.4374,-10.493,0.7991,2.4479,-10.493,5.1738,36.7382,29.4272,656
-3.6215,-10.1375,-0.256,1.5579,-10.1375,2.8675,27.8675,20.7363,657
-7.4534,-10.4607,-4.4375,2.0087,-10.4607,1.1697,20.8258,19.976,658
-1.9299,-9.5884,0.815,3.1318,-9.5884,2.3489,10.4474,8.8474,659
-1.5612,-10.0922,1.2124,1.9543,-10.0922,5.552,12.1484,10.8633,660
-2.6606,-10.2232,0.0557,1.3593,-10.2232,3.1921,5.8209,5.0001,661
-4.5656,-9.9837,-0.0069,1.7398,-9.9837,3.0671,11.4639,8.5129,662
-4.1066,-9.9188,3.3699,4.0509,-9.9188,1.2645,10.7615,8.129,663
-7.6455,-9.8942,3.1247,5.6271,-9.8942,8.0269,17.8177,11.4349,665
-11.6881,-9.8457,1.7507,4.8039,-9.8457,5.5783,15.6528,8.6081,666
-1.9162,-9.6554,-0.4124,0.7467,-9.6554,3.1717,23.2221,15.5638,667
0.0318,-9.9232,1.8203,2.1386,-9.9232,1.119,16.0577,6.246,668
-16.148,-9.8108,2.2911,11.0839,-9.8108,5.9062,24.6474,15.6269,669
-5.4982,-9.5519,-0.4542,2.2926,-9.5519,4.5652,22.1837,19.3033,670
-3.4479,-10.8402,3.2492,4.0115,-10.8402,1.3534,17.8939,11.5744,671
-21.9538,-9.9599,-1.6468,7.8905,-9.9599,6.3531,16.866,6.7248,672
-6.5379,-9.4603,-1.3935,3.0498,-9.4603,2.6657,13.9425,10.2409,673
-4.5817,-10.0796,-0.2987,3.0812,-10.0796,6.9698,23.9443,11.8413,674
-18.8119,-9.8371,-1.1909,5.3724,-9.8371,4.5914,13.9146,8.4975,676
-2.2776,-9.9557,0.0195,1.4986,-9.9557,2.5209,10.6156,3.3616,678
-7.9441,-9.9725,-3.2504,3.6767,-9.9725,5.1385,20.4892,6.6938,679
-9.5799,-9.9537,0.7997,8.7605,-9.9537,2.0482,19.0331,17.0607,680
-1.4494,-9.8198,-0.0843,0.5723,-9.8198,1.3274,6.6846,3.3802,681
-2.0321,-9.9234,0.4983,2.1405,-9.9234,2.339,13.1026,7.9387,682
-2.357,-9.9634,-0.075,0.8751,-9.9634,2.9438,11.1715,4.2217,683
-1.6707,-9.9371,0.1796,1.1901,-9.9371,2.7795,8.8065,5.1816,685
-0.9082,-9.9357,0.5574,1.0791,-9.9357,1.9625,9.3357,7.2059,686
-2.1919,-9.979,0.7023,1.965,-9.979,2.6052,10.0199,5.4933,687
-0.7654,-10.2043,0.3152,0.9041,-10.2043,2.9816,12.8767,9.8475,688
-2.8212,-10.0873,-0.5452,0.9438,-10.0873,2.2128,7.8449,4.5719,689
-4.2035,-9.9519,-0.5974,1.6687,-9.9519,1.8566,4.5592,3.3371,690
-4.5052,-10.1285,0.5055,3.2262,-10.1285,4.6373,16.3183,8.6534,691
-7.0146,-10.0259,2.8609,5.9745,-10.0259,7.1186,16.3814,9.4516,692
-3.1412,-9.0654,-0.0409,1.9897,-9.0654,3.0568,12.9317,10.7849,694
-10.771,-9.7207,-1.3187,4.0216,-9.7207,5.0734,16.3113,11.3671,695
-17.7838,-9.4027,0.5204,5.6645,-9.4027,5.7576,27.5219,11.5394,696
-2.914,-10.1038,0.2315,2.283,-10.1038,2.8499,8.07,5.9277,697
-6.5762,-10.0535,2.6655,6.4281,-10.0535,1.5932,11.4657,10.2872,698
-0.9533,-9.4792,0.5462,1.3069,-9.4792,2.6668,8.5166,6.7032,699
-0.9377,-9.8598,0.6549,1.4446,-9.8598,5.5737,13.038,10.2633,700
-2.5276,-9.7667,4.1292,3.1665,-9.7667,3.5608,16.2163,13.5786,701
-2.3328,-10.1031,-0.7142,0.8835,-10.1031,3.1773,6.8078,5.2035,702
-4.5079,-9.9266,0.7103,3.0043,-9.9266,7.3526,18.8938,9.5806,703
-3.2872,-9.9958,3.3975,4.9805,-9.9958,2.7826,15.4094,13.7604,704
-0.4747,-10.0239,0.631,0.6642,-10.0239,2.2181,22.1458,15.8349,705
-1.2032,-10.1119,0.3843,0.8286,-10.1119,2.0734,27.4951,22.1503,706
-3.2166,-10.0888,1.677,4.4384,-10.0888,4.998,37.6742,22.9115,708
-2.2324,-9.8819,2.8961,3.2077,-9.8819,2.361,26.7251,9.8615,709
-4.9061,-10.1898,-1.1308,2.0647,-10.1898,5.445,12.0567,5.4756,710
-1.9982,-9.936,-0.6407,1.1474,-9.936,1.279,13.9745,10.3005,711
-1.3729,-10.0044,-0.0258,0.9752,-10.0044,2.6418,8.7479,5.0597,712
-7.1694,-9.9094,-0.6014,2.0477,-9.9094,4.3964,12.1781,4.1316,713
-4.8933,-9.9572,-0.092,1.2112,-9.9572,2.4207,7.0413,3.2145,715
-1.9646,-9.9916,0.1124,1.2113,-9.9916,3.1437,17.29,4.7504,716
-4.9507,-9.663,2.1126,5.8524,-9.663,3.5515,14.1305,11.966,717
-0.2318,-9.9168,1.1279,1.3178,-9.9168,3.3556,7.7746,5.9314,718
-0.2983,-10.1451,0.4517,0.5832,-10.1451,2.3682,6.3215,3.3554,719
-5.8443,-10.1741,-0.2585,2.4866,-10.1741,2.768,8.5559,5.489,720
-3.5429,-10.0368,3.2683,6.6683,-10.0368,8.7244,23.1189,19.3933,721
-26.3808,-10.0637,3.1404,14.1354,-10.0637,9.3498,23.3312,17.7059,722
-6.6023,-9.9382,3.0068,6.9425,-9.9382,7.2865,16.6067,12.0179,723
-3.4052,-9.9526,0.8572,3.2915,-9.9526,5.4374,11.0815,8.3837,725
-2.8591,-10.0864,2.3146,2.4671,-10.0864,2.7477,11.538,8.9672,726
-0.0074,-9.5093,2.236,3.0566,-9.5093,2.5002,8.9055,7.0424,727
-1.1181,-9.9503,0.3445,1.3781,-9.9503,2.8009,8.4424,7.0082,728
-1.651,-9.5097,0.6026,1.9199,-9.5097,3.9859,11.5239,5.4783,729
-4.1614,-9.7794,-0.6806,1.6281,-9.7794,1.1711,5.0705,4.0141,730
-1.6755,-9.8034,1.1071,2.6514,-9.8034,2.3849,8.6615,5.5554,731
-1.4728,-9.9693,-0.1748,0.4775,-9.9693,1.5032,5.2759,3.052,732
-0.2959,-10.0262,0.0565,0.2524,-10.0262,2.5864,9.5757,6.6563,733
-0.7297,-9.97,0.2212,0.6519,-9.97,2.0818,8.5547,3.3834,734
-0.344,-9.9755,0.3009,0.5777,-9.9755,2.1471,8.6047,3.6546,735
-0.7638,-9.9434,0.5948,1.6701,-9.9434,3.5011,14.6312,11.0591,736
-0.1563,-9.8583,2.6033,3.0528,-9.8583,2.5302,9.3985,6.1504,737
-1.0984,-9.9009,2.9696,2.1622,-9.9009,1.005,11.6417,7.9456,738
-1.2213,-9.9592,1.1203,1.4343,-9.9592,0.6304,17.9112,14.1069,739
-7.7324,-10.1085,-1.4561,5.2157,-10.1085,6.0556,37.8675,30.8813,740
-0.8802,-9.9836,-0.1276,0.5155,-9.9836,1.1961,16.0626,11.5163,741
-4.373,-10.0604,0.3216,2.7267,-10.0604,7.8313,31.5798,20.9221,742
4.7603,-9.865,10.5736,3.5847,-9.865,3.9465,32.9732,23.1757,743
-3.03,-10.0502,1.9361,4.724,-10.0502,4.9048,35.5361,18.2663,745
-5.9362,-9.7225,0.7971,3.0906,-9.7225,3.8291,36.0516,24.9281,747
-14.5995,-9.8748,0.3006,3.8811,-9.8748,4.3169,45.4218,15.6825,748
-4.1206,-9.5115,0.3715,2.8695,-9.5115,1.3785,7.3929,5.4287,749
-3.2687,-9.0989,-0.5527,2.7407,-9.0989,3.3323,29.9896,12.2323,751
-3.007,-10.3254,0.3849,1.665,-10.3254,1.3757,11.149,6.171,752
-12.2806,-9.732,3.0839,7.0307,-9.732,7.3487,27.5348,10.8668,753
-10.2081,-9.6833,-1.0795,6.3786,-9.6833,2.9326,17.1489,13.7137,754
-1.5656,-9.9101,0.8061,1.6204,-9.9101,3.5628,12.6733,6.4002,755
-5.4429,-10.1732,0.1596,2.2106,-10.1732,5.8071,15.3641,9.8035,756
-4.0229,-9.9835,0.4589,2.5085,-9.9835,4.2657,13.2944,10.9309,757
-9.468,-9.8962,-2.0433,3.5959,-9.8962,2.6438,10.4507,5.9741,758
-3.5904,-9.82,-0.7673,1.4552,-9.82,2.2553,5.1538,3.3458,759
-1.314,-10.0459,1.5483,2.4479,-10.0459,5.2341,14.4571,9.3647,760
-0.3302,-9.6189,0.4742,0.6819,-9.6189,0.772,8.6222,6.2163,761
-0.2829,-9.8323,0.4329,0.8686,-9.8323,1.7505,6.6674,4.4643,762
-3.716,-9.7812,1.5941,3.7966,-9.7812,5.3077,22.5777,10.8503,763
-5.604,-10.0291,1.0639,3.0889,-10.0291,5.5225,12.4302,8.5988,765
-2.7775,-9.9686,1.3002,2.9096,-9.9686,4.8553,11.1088,6.2631,766
-7.2349,-10.0063,-0.7311,3.233,-10.0063,4.0599,15.37,10.9579,767
-1.3652,-9.9742,0.0467,0.7513,-9.9742,1.1256,5.8651,4.3881,768
-0.7476,-10.0257,0.2289,0.6353,-10.0257,1.3012,13.4165,8.6548,769
-1.1463,-10.1633,3.1195,3.1746,-10.1633,1.3053,10.8164,8.3516,770
-0.968,-10.042,0.9994,1.691,-10.042,3.9157,8.4279,6.1602,771
-0.1674,-10.0895,0.1353,0.3837,-10.0895,1.6399,5.6315,2.5729,772
-0.3466,-9.9807,0.8303,1.1127,-9.9807,2.3861,11.7115,6.6436,773
-1.4173,-9.9658,0.0601,0.5956,-9.9658,1.2217,10.6777,4.3447,775
-2.1317,-9.9628,0.2073,1.1356,-9.9628,2.046,4.2596,2.9123,776
-0.4915,-9.9212,0.6037,0.6381,-9.9212,1.242,4.0848,2.0082,777
0.1671,-9.9524,0.4036,0.1861,-9.9524,0.5357,2.8225,1.5657,778
0.4172,-9.9385,0.5028,0.0807,-9.9385,0.124,1.7369,1.5777,779
0.3859,-9.9403,0.677,0.1482,-9.9403,0.3177,2.1726,1.9051,780
0.1895,-9.9497,0.2693,0.0718,-9.9497,0.1426,1.6997,1.4698,781
0.1054,-9.9468,0.6236,0.2346,-9.9468,0.5626,2.764,1.9911,782
-3.9716,-9.9432,-1.0266,1.5425,-9.9432,1.6229,4.5341,3.4129,783
-0.5323,-9.9174,0.1988,0.5115,-9.9174,0.642,1.6711,1.5423,784
0.4904,-9.9396,0.8509,0.3121,-9.9396,0.5121,2.9717,2.0654,785
0.2411,-9.9429,0.4767,0.1948,-9.9429,0.3978,2.1955,1.5313,786
0.1187,-9.9423,0.3718,0.1618,-9.9423,0.3261,1.8973,1.47,787
0.05,-9.9368,0.3642,0.2384,-9.9368,0.4153,1.7813,1.3912,788
0.7814,-9.9375,0.9532,0.1171,-9.9375,0.166,2.486,2.2635,789
0.3796,-9.9397,0.418,0.0272,-9.9397,0.0701,1.5267,1.4977,790
0.2517,-9.9397,0.3526,0.0962,-9.9397,0.2081,1.674,1.5136,791
0.2312,-9.9382,0.5012,0.1793,-9.9382,0.3246,1.9559,1.6071,792
0.4946,-9.9407,0.5929,0.0707,-9.9407,0.1409,1.6962,1.635,793
-1.4242,-9.9291,0.1672,0.6954,-9.9291,1.1703,2.7236,1.8001,795
-0.1076,-9.9279,1.0961,0.6113,-9.9279,0.8696,2.8534,2.2592,796
-0.7246,-9.9353,0.5404,0.841,-9.9353,1.3416,3.2515,1.6883,797
0.3963,-9.9376,0.4904,0.0736,-9.9376,0.1211,1.5695,1.4794,798
0.7878,-9.9432,1.0034,0.147,-9.9432,0.1735,2.2394,2.1814,799
-1.1049,-9.9241,0.9722,2.1492,-9.9241,2.2025,5.8152,1.9371,800
-0.5792,-9.9107,-0.0472,0.3444,-9.9107,0.7256,1.4179,0.9895,801
-8.5811,-9.9319,-0.5306,3.4216,-9.9319,3.7473,7.4105,3.0667,802
-0.4241,-9.9293,0.1286,0.5455,-9.9293,0.5121,1.3731,1.0591,803
-3.8273,-9.9255,0.7353,1.613,-9.9255,2.1121,5.9342,1.8627,805
-0.833,-9.9244,1.0016,0.7859,-9.9244,1.0559,3.1498,2.2166,806
1.4098,-9.9347,2.1455,0.4116,-9.9347,0.2461,3.9048,3.7271,807
0.2062,-9.9224,0.822,0.9237,-9.9224,0.988,2.9168,1.6431,808
-0.0318,-9.9359,0.2914,0.3691,-9.9359,0.5129,2.031,1.3184,810
-0.2332,-9.8877,1.0943,1.0717,-9.8877,1.0287,2.7434,1.8913,811
-0.2568,-9.9279,0.6008,0.6156,-9.9279,0.7377,2.3999,1.6203,812
-0.7198,-9.9196,1.1269,1.0851,-9.9196,1.6397,3.9988,2.719,813
-1.6512,-9.894,0.3078,1.6291,-9.894,0.6509,6.9866,4.6967,814
-2.0698,-9.9513,-0.3689,0.7777,-9.9513,1.3514,8.7671,4.5059,815
-8.2845,-9.9909,-0.7777,2.6867,-9.9909,2.7067,13.4078,6.4687,816
-5.2912,-10.1854,0.7919,2.3445,-10.1854,3.5536,22.7731,15.1439,817
-3.3505,-9.7884,1.6037,2.591,-9.7884,2.7411,23.0337,7.8907,818
-3.4496,-10.043,0.5266,2.8897,-10.043,5.5958,14.5755,11.5821,819
-3.2507,-10.0546,0.6012,1.4143,-10.0546,1.3293,12.2396,7.3041,820
-0.4391,-9.9373,3.3385,4.0196,-9.9373,0.6437,10.258,8.5665,821
-0.4149,-10.0087,1.0374,1.7153,-10.0087,1.8025,6.2045,4.4748,822
-1.5189,-9.9193,0.2262,0.7369,-9.9193,1.951,6.5088,3.166,823
-1.0457,-9.8929,0.0629,0.5831,-9.8929,1.9341,10.3201,4.3244,825
-2.9255,-9.9969,-0.2331,0.8833,-9.9969,1.2924,8.5201,4.986,826
-0.1543,-9.8578,0.1162,0.294,-9.8578,1.274,9.2885,7.6544,827
0.5787,-10.3804,2.5992,1.7838,-10.3804,2.3952,16.7923,10.6901,828
-0.8552,-10.5841,-0.1763,0.3268,-10.5841,0.5559,8.5312,5.0591,829
-1.771,-9.9333,0.7368,1.5531,-9.9333,0.7847,7.2255,5.8955,830
-0.115,-10.1177,0.015,0.1214,-10.1177,0.8257,5.6756,4.098,831
-0.3265,-9.8327,0.4295,0.892,-9.8327,1.6371,11.5588,10.0589,832
-4.1253,-9.6286,0.2202,3.0124,-9.6286,3.5824,20.1693,8.6028,833
-1.455,-9.8679,3.7417,4.8743,-9.8679,8.983,23.0643,20.6853,835
-7.4566,-10.1216,6.0782,10.5287,-10.1216,8.5111,34.2212,27.244,836
-2.8262,-10.3372,0.1131,1.858,-10.3372,4.2182,30.6955,29.2479,837
-7.2871,-8.886,1.3379,5.4938,-8.886,2.4887,26.6678,20.5158,838
-7.4764,-9.6272,-1.0059,2.7916,-9.6272,3.5985,10.9777,8.5095,839
-7.6178,-9.3014,1.5736,5.643,-9.3014,5.9316,23.7195,20.0487,840
-1.9983,-9.9386,1.4773,2.1211,-9.9386,1.1058,9.2631,8.0045,841
-3.3483,-10.0309,0.0452,1.6022,-10.0309,2.3456,7.6968,3.04,842
-1.7934,-10.0643,-0.0236,1.2114,-10.0643,1.6122,6.8788,4.5762,843
-1.9872,-10.0107,0.7482,1.3905,-10.0107,3.0597,10.493,5.2409,845
-0.7991,-9.811,0.4053,1.4118,-9.811,0.9634,5.4789,4.538,846
-0.0877,-10.0832,1.6079,1.5134,-10.0832,2.5623,13.2601,12.4255,847
0.0988,-10.0048,6.4208,3.9096,-10.0048,2.3235,16.2012,13.6516,848
-1.505,-10.0717,-0.0476,0.7979,-10.0717,1.0716,8.4343,7.9855,849
0.5115,-9.6867,2.8315,2.2881,-9.6867,1.3026,10.2483,8.7909,850
-2.3081,-10.3151,1.0368,2.9346,-10.3151,3.7801,39.1554,25.3786,855
-4.8393,-10.3417,-1.8361,2.6755,-10.3417,1.7747,32.5889,29.9583,856
-2.0374,-10.1532,-0.2669,1.3099,-10.1532,3.548,10.317,9.1034,857
-2.0996,-10.3734,-0.4321,1.4265,-10.3734,1.2282,7.5164,5.7895,858
-5.3802,-9.5136,0.9734,4.2328,-9.5136,1.3131,12.1115,9.4477,859
-1.9995,-9.8496,-0.1272,0.9952,-9.8496,5.2282,17.8368,16.0922,860
-4.4327,-9.8507,1.6744,3.7396,-9.8507,3.5551,17.3675,16.5931,861
-0.6494,-9.917,1.7847,2.3597,-9.917,3.717,14.4109,5.7584,862
-0.9216,-10.0176,0.0616,0.454,-10.0176,0.7276,5.3805,2.8023,863
-19.1102,-9.9857,0.3516,4.3945,-9.9857,6.2614,23.3487,7.1913,865
-17.4427,-10.1405,1.3233,9.3865,-10.1405,3.4445,42.227,29.0821,866
-1.1658,-10.9754,3.6872,4.283,-10.9754,5.2815,57.0896,40.3735,868
-6.73,-10.3162,-1.0894,3.8795,-10.3162,1.9747,36.2862,35.6053,869
-8.7023,-9.8886,-0.2347,6.1593,-9.8886,6.0797,13.9985,12.1114,870
-2.4781,-9.9629,-0.1906,1.4801,-9.9629,3.0402,7.0384,5.3238,871
-4.0692,-9.9789,0.6709,2.2166,-9.9789,3.8222,8.4858,5.4689,872
-3.5162,-9.9867,0.3834,1.8028,-9.9867,3.4461,10.3247,6.0827,873
-6.0887,-9.9663,0.2135,3.2919,-9.9663,2.0791,10.102,7.3326,874
-1.9837,-9.9925,0.2089,1.7461,-9.9925,3.0713,10.6244,5.3987,875
-3.0815,-9.9016,0.3099,2.1378,-9.9016,3.5544,10.842,5.1912,876
-6.7548,-10.3606,0.8732,4.6911,-10.3606,1.8306,9.6486,8.5496,877
-2.5957,-9.7588,-0.1163,1.6263,-9.7588,1.561,10.0263,9.1428,878
-4.8168,-9.8696,1.019,3.3027,-9.8696,5.2662,10.4791,7.9538,879
-2.2425,-9.8695,1.1613,2.0633,-9.8695,4.1666,8.6104,5.1119,880
-3.5024,-10.0505,-0.913,1.433,-10.0505,3.4879,8.3726,3.5247,881
-3.6806,-9.5052,2.016,4.1934,-9.5052,3.7117,10.6462,8.5344,882
-1.6464,-9.9778,0.371,1.2453,-9.9778,2.0941,8.174,3.04,883
-2.9791,-10.0129,0.0931,1.5369,-10.0129,3.5319,9.3438,4.8313,885
-2.7006,-9.9486,0.4429,1.3069,-9.9486,2.511,7.5736,5.3067,886
-0.7597,-9.9493,-0.0605,0.3454,-9.9493,0.9388,5.4666,3.5173,887
-0.6712,-9.9683,1.0702,1.4465,-9.9683,0.9066,7.616,4.6241,888
-6.7407,-9.0121,-0.8668,3.3692,-9.0121,1.5317,10.3937,7.5552,889
-0.0734,-10.0491,0.4011,0.4294,-10.0491,2.9025,11.0561,9.6794,890
-0.5385,-10.0102,0.1115,0.7802,-10.0102,1.3847,8.9901,7.575,891
-0.5513,-10.1422,-0.14,0.2362,-10.1422,0.4768,7.7519,6.4517,892
-1.8779,-9.6911,0.8263,2.1438,-9.6911,3.1366,14.206,6.4002,893
-2.4525,-9.9195,0.0495,1.0885,-9.9195,1.8942,12.9758,2.7458,895
-3.64,-9.9996,0.4955,1.378,-9.9996,2.3679,11.5274,3.4411,896
-2.4421,-9.8215,-0.7357,0.912,-9.8215,1.5029,4.1743,2.158,897
-1.2942,-9.9185,0.1618,0.7608,-9.9185,1.2024,9.8714,7.334,898
-1.3187,-9.9152,0.0875,1.0415,-9.9152,1.611,5.9053,4.3854,899
-1.8076,-9.9884,0.588,1.2149,-9.9884,2.6554,5.1534,4.0478,900
-1.0134,-9.9285,0.8835,1.2612,-9.9285,1.2612,8.1853,7.1102,901
-2.6199,-9.8463,1.164,2.3722,-9.8463,4.238,17.5185,6.1689,902
-2.6712,-9.6547,-0.1954,1.4368,-9.6547,3.2543,7.2069,6.0478,903
-6.283,-10.048,2.4528,4.3092,-10.048,9.9794,26.0907,19.0378,905
-0.3714,-10.0173,1.7478,1.9883,-10.0173,2.1796,20.3064,18.5577,906
-0.5123,-9.8493,6.8297,4.4252,-9.8493,1.0445,24.8665,21.7353,907
2.9787,-10.1158,5.5055,2.8126,-10.1158,1.4926,21.8018,18.5935,908
-40.089,-5.4075,-6.6513,21.1709,-5.4075,11.1646,70.4354,20.6113,909
-12.3261,-9.974,-0.7049,6.718,-9.974,1.2974,12.7035,7.579,910
-6.9198,-10.0167,-1.3567,2.6908,-10.0167,2.6416,12.7588,11.7886,911
-0.957,-9.9687,1.0382,1.8481,-9.9687,3.9551,27.3087,19.4022,912
-2.9568,-9.9398,1.7858,2.3465,-9.9398,1.3786,27.8998,22.1013,913
-0.6112,-9.969,0.3384,0.7385,-9.969,2.3517,8.776,5.3676,915
-7.2697,-10.0197,2.0684,6.3434,-10.0197,5.6106,22.4491,6.8621,916
-3.9999,-9.9441,-0.095,2.7889,-9.9441,4.0219,20.5741,18.577,917
-1.7683,-10.0694,0.3552,1.3164,-10.0694,2.6758,22.7113,19.7312,918
-2.4655,-9.9884,0.6123,2.7316,-9.9884,2.1147,25.2024,24.176,919
-2.9022,-9.9095,0.664,2.568,-9.9095,4.2085,25.5706,22.2325,920
0.0487,-10.0046,9.573,9.8023,-10.0046,5.0399,19.6136,14.5926,921
-3.2865,-10.2331,2.7668,6.5769,-10.2331,2.9501,18.5702,11.5701,922
-1.6897,-9.9582,0.6122,1.8367,-9.9582,2.6449,14.8354,12.7059,923
-18.9974,-10.1182,3.1818,9.1359,-10.1182,9.9158,78.7139,58.9984,925
-21.8657,-10.0996,2.1157,17.8198,-10.0996,6.284,60.3104,46.4205,927
-46.2847,-9.8397,-5.0653,16.2209,-9.8397,9.1821,23.8427,4.709,928
5.2294,-9.8257,7.1745,1.2166,-9.8257,0.7589,5.8735,4.9908,929
-1.5641,-9.9045,3.238,2.4722,-9.9045,2.227,7.424,6.2092,930
-16.1281,-9.9384,-10.7317,3.785,-9.9384,0.9817,10.2437,9.3639,931
-50.9265,-9.7352,-13.5837,35.4307,-9.7352,15.0415,37.9532,23.0507,932
-6.4519,-9.9408,-0.4785,3.7281,-9.9408,4.0583,8.5597,3.217,933
-42.8116,-9.9873,-0.4511,15.3009,-9.9873,7.2842,26.7409,7.9644,934
-15.1703,-9.944,-0.9484,3.4827,-9.944,2.5892,11.598,2.9999,935
0.0511,-9.9581,0.1749,0.0679,-9.9581,0.2138,2.1726,1.6595,936
