AYGX_min,AZ_mean,AYGX_mean,AYGX_std,AZ_mean.1,GX_std,Gnorm_max,Gnorm_median,timestamp
-85.2064,-9.4116,11.7312,65.0928,-9.4116,22.6258,69.9873,39.4611,421
-32.4056,-9.5657,9.7214,17.4649,-9.5657,10.6421,24.0409,15.0326,423
-112.0211,-9.5984,-26.2479,34.4582,-9.5984,13.6107,26.1568,14.2939,424
-21.139,-9.4469,-2.3059,13.9015,-9.4469,5.2959,7.52,5.4417,425
-10.2976,-9.5663,-0.0316,7.6691,-9.5663,3.2031,4.4236,2.9126,426
