AYGX_min,AZ_mean,AYGX_mean,AYGX_std,AZ_mean.1,GX_std,Gnorm_max,Gnorm_median,timestamp
-6.9926,-9.8428,-3.4708,2.2664,-9.8428,1.6663,5.8109,2.9934,3079
-16.9555,-9.6974,-5.9784,7.0359,-9.6974,5.3752,12.275,5.4451,3080
-254.7626,-9.4479,-36.6508,99.4753,-9.4479,25.9104,64.3392,14.5614,3081
-65.4273,-9.9693,-6.1293,24.4707,-9.9693,7.0504,18.4674,11.0271,3082
-5.5765,-9.7816,-2.0193,1.9263,-9.7816,2.9764,8.7116,2.4246,3084
