AYGX_min,AZ_mean,AYGX_mean,AYGX_std,AZ_mean,GX_std,Gnorm_max,Gnorm_median,timestamp
-0.1647,-9.7761,-0.0658,0.0524,-9.7761,0.2467,3.2903,2.882,1
-0.1741,-9.7736,-0.0497,0.0494,-9.7736,0.4408,3.3954,2.8087,2
-137.5823,-9.7009,-10.2218,41.6899,-9.7009,10.4555,35.6752,7.8895,3
-90.1247,-9.3855,-16.3356,45.4525,-9.3855,16.728,44.4625,18.3302,5
-86.691,-9.596,1.382,29.3955,-9.596,11.5218,83.5328,24.0847,6
-228.5819,-9.6459,-5.7489,71.2509,-9.6459,23.767,94.8895,34.7765,8
-6.052,-9.7635,-3.2337,2.1321,-9.7635,1.506,8.5601,7.5795,9
-19.6624,-9.6662,-9.1785,4.6263,-9.6662,3.0296,17.3566,9.0513,10
-19.3019,-9.4919,6.109,20.8295,-9.4919,7.905,25.4384,10.3829,11
-9.2353,-9.7518,0.7191,6.3945,-9.7518,6.903,30.4577,15.3666,13
-2.2087,-9.8106,0.8157,2.4606,-9.8106,1.7801,17.7446,16.0431,14
-43.7209,-9.7814,-22.0899,13.1091,-9.7814,3.6288,48.9497,41.1163,15
-44.6731,-9.6401,16.662,28.7616,-9.6401,6.5657,46.284,18.4946,16
-23.5874,-9.7203,0.4222,8.5513,-9.7203,7.8981,14.8341,7.9361,18
-5.8293,-9.7694,-0.6398,2.4975,-9.7694,3.5357,8.1257,5.4888,19
-14.3539,-9.7324,-3.7324,5.3542,-9.7324,4.9347,13.7584,4.5855,20
-4.991,-9.7895,2.7883,4.4724,-9.7895,5.8036,48.9706,24.2356,21
-11.9657,-9.765,1.0485,6.8929,-9.765,4.5816,39.2186,33.9647,23
-2.9187,-9.749,3.8749,4.4155,-9.749,4.2184,11.8103,4.22,24
-10.6023,-9.7673,-2.2278,4.3186,-9.7673,6.9102,16.55,11.0558,25
-2.9056,-9.7775,0.4209,2.0537,-9.7775,3.1802,9.9111,5.8956,26
-7.7471,-9.7857,5.2729,8.0516,-9.7857,6.2972,47.3161,31.49,28
-7.5462,-9.1838,0.6139,5.1324,-9.1838,2.0973,51.7005,35.4544,29
-1.3002,-9.5961,0.1802,1.1379,-9.5961,1.7998,14.9741,11.1079,30
-31.0514,-9.3533,12.2333,21.5708,-9.3533,5.4432,44.53,25.7126,31
-13.1552,-9.9603,4.1595,9.8372,-9.9603,7.4814,78.0396,40.0145,33
-18.0609,-10.2847,21.2771,35.9471,-10.2847,15.0486,82.4619,73.7674,34
0.0602,-9.9168,7.9965,6.7843,-9.9168,4.6353,35.2359,22.6636,35
-19.5387,-9.7979,10.3452,18.3882,-9.7979,14.1226,38.5985,24.0765,36
-0.9991,-10.1477,7.1402,10.8806,-10.1477,8.9571,51.3836,41.1688,37
-14.7976,-9.8817,-1.4355,5.772,-9.8817,7.3453,39.71,20.0094,38
-6.126,-9.8769,1.554,4.9514,-9.8769,3.3493,16.9407,12.8614,39
-3.8307,-9.8042,1.0531,3.7118,-9.8042,3.7446,14.7486,8.0886,40
-11.1544,-9.903,18.1493,36.9293,-9.903,9.016,36.4068,26.9509,41
-6.9746,-9.8838,-0.0929,3.5141,-9.8838,1.0834,14.8699,10.4053,42
-6.8992,-9.8393,2.4631,5.7811,-9.8393,5.8972,19.4428,6.6426,43
-28.3328,-9.8092,-0.2645,11.1592,-9.8092,8.6525,26.6453,11.8757,44
-10.1951,-9.9247,-1.7897,5.7327,-9.9247,8.2831,21.928,19.0162,45
-25.6463,-9.6479,-1.4789,17.0424,-9.6479,7.5252,33.1168,31.031,46
-45.661,-9.5785,-7.8371,15.9221,-9.5785,8.6243,24.9142,12.4393,47
-12.6494,-9.7578,8.8837,17.4469,-9.7578,10.6629,27.8416,16.8298,48
-5.2166,-9.831,7.4758,11.3161,-9.831,9.1053,24.9927,12.9257,49
-7.2947,-10.0969,3.3555,6.752,-10.0969,9.4164,36.3245,12.6196,50
-10.4001,-9.8002,-0.4803,6.0249,-9.8002,8.7478,25.4864,10.2312,51
-5.5146,-9.8495,2.1863,5.215,-9.8495,5.4996,20.5508,9.9092,53
-0.7761,-9.4357,1.7496,1.6982,-9.4357,2.6105,10.7715,5.8836,54
-26.2124,-10.0069,-6.3302,14.5197,-10.0069,3.8983,22.1506,19.7083,55
-1.4784,-9.5059,48.1571,49.7614,-9.5059,23.4805,53.0272,34.3534,56
-23.8858,-9.4729,0.3519,8.8209,-9.4729,6.5528,21.2325,9.6989,58
-10.3638,-9.7354,-4.3591,3.8021,-9.7354,4.6808,14.6653,11.1013,59
-5.3364,-9.6172,1.3395,8.0763,-9.6172,5.8382,23.8756,13.9687,60
-31.2851,-9.2774,4.396,20.1226,-9.2774,10.3284,25.7549,17.5282,61
-31.9292,-9.6517,0.6385,11.8175,-9.6517,10.1537,25.9851,14.2077,63
-2.965,-9.4788,5.3415,6.6293,-9.4788,5.7907,12.82,8.6252,64
-15.5781,-9.4002,-0.9011,6.1153,-9.4002,5.2507,24.9181,11.69,66
-4.9173,-10.0011,6.8588,7.2355,-10.0011,5.328,23.7267,16.9802,67
-22.5468,-9.8103,0.8536,8.8539,-9.8103,6.955,23.4332,11.7275,68
-6.2367,-9.9073,-1.1142,2.9456,-9.9073,2.3807,11.066,9.8084,69
-0.4171,-9.6405,7.2197,8.1699,-9.6405,10.1579,25.5557,12.095,70
-18.8946,-10.0201,-0.0076,13.6135,-10.0201,3.5806,16.7738,12.4888,71
-6.5003,-9.6808,4.5917,5.5499,-9.6808,7.5612,20.9313,14.3854,72
-14.9115,-10.0117,0.4002,8.787,-10.0117,3.1469,14.7099,9.749,73
-9.9007,-8.9243,-1.0234,3.9086,-8.9243,3.295,16.7703,5.6716,74
-6.7898,-9.9144,2.8125,7.4511,-9.9144,3.6029,14.1237,10.0515,75
-5.0149,-9.9033,22.5474,24.4136,-9.9033,11.0157,42.3164,30.9176,76
-4.5144,-9.9167,-1.3695,1.8916,-9.9167,0.8865,21.607,16.0417,77
-21.072,-9.8843,-7.4509,6.1761,-9.8843,5.8252,13.175,10.1015,78
-19.5791,-8.7524,3.8455,18.3775,-8.7524,7.8481,31.0816,19.348,79
-11.1585,-9.7062,5.4236,10.4746,-9.7062,3.9447,21.2033,15.9262,80
-7.4683,-9.6067,2.2682,6.5026,-9.6067,6.6833,13.3775,11.0988,81
-0.2782,-10.0045,2.8319,3.3668,-10.0045,4.4889,13.9395,11.8172,82
-7.0555,-9.8211,2.4309,8.0697,-9.8211,6.334,21.3026,11.4766,83
-1.5105,-9.6312,5.8211,6.8509,-9.6312,5.1373,18.1335,13.1054,84
-35.2059,-9.8868,-17.5277,13.8415,-9.8868,2.3574,28.2075,16.7628,85
-23.2194,-9.8827,14.8023,29.2075,-9.8827,3.5666,39.4531,30.2761,86
-21.0165,-10.2191,-6.2142,7.3623,-10.2191,3.1786,22.8748,12.7975,87
-6.8727,-10.0444,9.273,13.0558,-10.0444,2.6742,18.3326,14.384,88
-6.4322,-10.1049,20.9789,37.9964,-10.1049,8.2823,33.7533,29.7958,89
-5.4628,-9.6105,5.1547,5.5985,-9.6105,3.0244,18.6593,13.9664,90
-9.8093,-9.7432,3.2777,13.5345,-9.7432,6.6302,24.5689,13.8765,91
-5.5518,-9.7527,-0.5283,7.7794,-9.7527,1.8352,16.2278,12.3833,92
-14.8091,-9.816,-4.0305,7.6796,-9.816,8.4002,32.3206,21.782,93
-0.4642,-8.9586,10.9213,14.3052,-8.9586,6.4061,31.1666,18.1101,94
-6.3655,-10.1818,11.4802,15.5121,-10.1818,4.3255,24.2255,16.0493,95
-3.1087,-9.6397,4.0225,7.3811,-9.6397,5.4891,13.1472,8.6926,96
-15.9431,-9.5923,-3.8923,7.2864,-9.5923,6.5104,22.8537,12.4521,97
-6.1603,-9.5856,-1.8567,2.6244,-9.5856,3.7303,20.6841,14.6543,98
-34.3254,-9.4054,-6.4662,10.6589,-9.4054,5.8404,19.7119,10.7724,99
-17.5955,-9.611,-2.7818,6.3018,-9.611,5.6652,18.1563,14.874,100
-62.8324,-9.596,1.7477,43.0773,-9.596,3.4872,43.3557,30.7072,101
-11.4712,-9.8174,6.3156,12.5957,-9.8174,4.8669,23.8594,14.6891,102
-1.6178,-8.8822,-0.644,0.4983,-8.8822,1.7797,10.7683,5.4433,103
6.7607,-9.8071,23.4956,11.0155,-9.8071,3.1103,47.7599,30.0603,104
5.7953,-9.9643,14.4297,6.8179,-9.9643,0.8515,20.1233,14.1556,105
-4.6777,-9.7128,-0.9652,1.8974,-9.7128,2.3413,8.004,4.9085,106
-2.346,-9.8408,1.0334,1.99,-9.8408,1.8665,18.191,8.4905,107
0.0431,-9.807,5.3603,4.3363,-9.807,1.3846,25.9002,13.5342,108
-10.8548,-9.7179,2.7936,8.2527,-9.7179,2.4109,21.4974,14.65,109
-8.2497,-9.7352,0.7003,8.2544,-9.7352,5.7687,21.126,15.7353,110
-3.6663,-9.3593,-0.9058,1.9233,-9.3593,2.279,13.8544,7.1349,111
-9.2164,-9.6869,-1.8612,3.652,-9.6869,1.9878,9.191,4.3888,112
-5.7583,-9.7354,-0.4444,2.2563,-9.7354,4.8739,10.2618,7.7056,113
-10.3958,-8.5946,-3.9018,4.4219,-8.5946,4.8875,14.1639,10.6424,114
-5.0745,-9.8148,-0.3276,2.4202,-9.8148,2.9861,19.4561,13.5794,115
-8.4725,-9.6139,10.3796,17.9151,-9.6139,5.869,21.9057,20.3972,116
-3.5437,-9.6449,4.409,7.6465,-9.6449,7.7835,26.1937,12.5429,117
-1.7023,-9.7501,3.5139,4.8084,-9.7501,6.0179,21.6557,14.0298,118
-12.8854,-9.6498,-5.4388,4.2247,-9.6498,0.8839,18.3573,13.0953,119
-12.0425,-9.7125,2.9609,7.7925,-9.7125,6.3482,30.5574,11.5125,120
-4.7832,-9.8201,2.3247,7.0508,-9.8201,6.2851,36.1168,17.7919,121
-12.3991,-9.6546,8.8533,12.9614,-9.6546,4.2248,34.4676,16.5257,122
-5.7672,-9.7023,2.6324,5.3125,-9.7023,4.8694,24.8695,12.9896,123
-24.4591,-9.6339,-2.7368,12.4589,-9.6339,9.7982,25.4898,18.7159,124
-35.7976,-9.845,0.5448,19.8619,-9.845,8.7101,47.9587,22.2816,125
-28.5396,-9.685,18.6141,23.2736,-9.685,15.9972,51.6686,25.8969,126
-3.0896,-9.7181,2.8047,5.8503,-9.7181,6.4853,22.7983,16.8774,127
-1.4913,-9.794,0.5954,1.4309,-9.794,2.6071,11.7528,7.9917,128
-4.9808,-9.4768,0.4822,2.577,-9.4768,2.9704,20.8714,9.407,129
-1.0506,-9.8023,0.7135,1.2896,-9.8023,3.0899,18.1325,8.513,130
-2.7099,-9.8252,0.1435,0.9799,-9.8252,1.2737,8.3873,5.1239,131
-15.2863,-9.7486,-1.5891,3.1241,-9.7486,3.3193,7.9885,4.1315,133
0.663,-9.7335,3.4933,1.7997,-9.7335,2.0408,7.1264,4.5001,134
1.851,-9.7648,3.1161,1.2384,-9.7648,0.3227,7.5225,7.0053,135
-0.1573,-9.7853,-0.017,0.0657,-9.7853,0.3388,3.2729,2.9831,136
-0.53,-9.7843,-0.0992,0.1481,-9.7843,0.7758,3.4953,2.783,138
-0.0371,-9.7838,0.0723,0.0618,-9.7838,0.2876,2.7993,2.6968,139
-0.7402,-9.7813,-0.4352,0.3222,-9.7813,0.1823,4.1807,3.9745,140
-0.2662,-9.7849,-0.1109,0.0912,-9.7849,0.1899,2.8063,2.6742,141
-0.6616,-9.7853,-0.126,0.162,-9.7853,0.5026,3.6077,3.0951,143
-0.3945,-9.7843,-0.2046,0.1126,-9.7843,0.5488,3.1025,2.8995,144
-0.1053,-9.7848,-0.0135,0.0311,-9.7848,0.2715,2.6988,2.527,145
-0.6284,-9.7835,0.1148,0.3206,-9.7835,1.1837,3.8989,2.672,146
-17.8957,-9.7662,-1.2118,5.4885,-9.7662,4.6437,14.0031,6.369,148
-22.6526,-9.7741,-2.4313,7.389,-9.7741,7.4261,14.7878,10.3803,149
-3.9152,-9.7886,1.4276,3.1702,-9.7886,3.1176,8.0882,5.9216,150
-1.8574,-9.7809,-0.4347,0.51,-9.7809,1.1444,5.3692,3.7714,151
0.6034,-9.7714,2.1515,1.0788,-9.7714,2.9792,9.9172,5.545,152
-4.7,-9.7771,3.7755,5.7662,-9.7771,5.4399,11.8983,5.4948,154
-14.6403,-9.7493,-1.9066,4.8768,-9.7493,4.6999,11.4544,4.5194,155
-7.0908,-9.7249,-0.6926,3.1029,-9.7249,2.594,15.0363,10.5315,156
-17.5866,-9.6792,-2.3007,8.1568,-9.6792,5.9947,26.0924,16.7756,157
-11.4879,-9.6739,0.6099,11.5934,-9.6739,5.1741,20.7659,13.4469,158
-43.5079,-9.7251,11.3348,38.1246,-9.7251,12.8941,38.5543,24.9934,159
-1.8706,-9.7795,0.8578,1.8557,-9.7795,2.0419,21.5301,16.1792,160
-262.9981,-9.7778,-25.7985,100.7495,-9.7778,20.3137,57.6858,37.9077,161
-38.3448,-9.8785,16.5385,30.4127,-9.8785,18.6894,57.6965,41.4808,163
-20.9279,-9.7259,-0.9004,7.1079,-9.7259,5.5252,35.1517,16.8004,164
-12.7784,-9.8883,1.8,10.7785,-9.8883,5.8681,36.8572,23.0886,165
-0.4331,-9.7331,5.0276,2.7715,-9.7331,2.0303,13.8407,12.8531,166
-15.7187,-9.69,-4.5309,5.9961,-9.69,3.5149,17.9245,7.4822,167
-11.2059,-9.7401,2.2077,9.3341,-9.7401,5.0602,37.8418,16.1535,168
-4.896,-9.77,8.0032,11.2119,-9.77,7.7906,37.6978,14.6949,169
-27.0739,-9.7787,-2.185,12.9773,-9.7787,6.4951,25.4328,18.629,170
1.368,-9.4245,10.3307,7.9093,-9.4245,5.3701,16.1481,10.9897,171
-22.124,-10.0503,-7.4607,12.0107,-10.0503,13.0686,43.6066,34.031,172
-5.5863,-9.4722,25.6333,22.8021,-9.4722,9.3099,62.5448,40.7471,174
-11.4655,-9.7915,3.9018,10.8162,-9.7915,9.6465,28.1037,22.3952,175
-21.0852,-9.9874,0.5077,13.4675,-9.9874,11.8481,32.1628,21.6894,176
-7.7539,-9.6647,-2.3008,3.5416,-9.6647,3.2288,13.8095,7.4762,177
-4.9208,-9.8875,1.9227,4.1514,-9.8875,7.577,21.6891,11.14,178
-3.3222,-10.0832,0.6922,1.6307,-10.0832,5.0929,14.5537,6.9145,180
-17.6009,-10.04,-0.2567,6.5814,-10.04,12.0641,26.7341,17.9575,181
-3.1856,-9.6626,0.5654,1.9901,-9.6626,5.307,13.7615,7.5806,183
-1.6755,-10.3117,0.3369,1.89,-10.3117,1.8114,12.7065,7.443,184
-0.8518,-9.6098,1.5954,2.122,-9.6098,1.3376,8.2624,6.8334,185
-8.4696,-10.1059,3.3531,6.0171,-10.1059,10.606,24.3632,21.5856,186
-68.683,-9.9138,-1.7918,19.9397,-9.9138,13.6769,49.857,15.699,188
-1.2492,-9.9209,-0.1387,0.9533,-9.9209,1.1319,16.3865,11.6137,189
-1.6114,-9.8511,2.0201,1.9556,-9.8511,2.741,14.2273,9.7098,190
-14.8181,-9.6051,1.3224,10.3557,-9.6051,3.6412,21.0809,15.2815,191
-8.9523,-9.9944,10.132,12.3498,-9.9944,16.7799,42.6253,23.4053,193
-2.4774,-9.4597,1.8297,3.3665,-9.4597,1.2435,13.9977,11.3009,194
-2.865,-9.6717,1.2157,2.7371,-9.6717,0.6771,18.3273,15.0216,195
-3.3729,-9.6157,0.6999,4.1465,-9.6157,5.8115,17.9688,9.7708,196
-17.9157,-9.8066,2.4961,10.1406,-9.8066,9.5854,42.2369,17.3805,198
-13.7957,-10.1276,14.8545,19.0971,-10.1276,4.4036,32.4993,14.6242,199
-5.9543,-9.4596,3.4628,6.4753,-9.4596,2.8858,14.2807,11.0419,200
-30.1738,-8.8002,-1.5604,9.9714,-8.8002,7.6142,33.7097,12.8531,201
-59.562,-9.0051,6.8861,26.1144,-9.0051,11.5548,43.4522,9.576,203
-10.4928,-9.8022,-1.2817,6.7162,-9.8022,4.9646,11.5641,7.1654,204
-2.1188,-9.4619,4.3583,6.9242,-9.4619,5.0738,19.61,17.1351,205
-16.0099,-9.7956,-1.1205,6.875,-9.7956,4.6527,24.6469,10.2373,206
-17.1938,-9.8058,16.444,42.3993,-9.8058,15.041,45.295,22.0829,208
-18.3654,-9.7793,14.5916,35.9792,-9.7793,12.342,40.2525,10.3594,209
-123.178,-10.5666,-45.3693,44.7787,-10.5666,18.3088,74.5939,54.7908,210
-97.7431,-9.0287,59.359,157.6874,-9.0287,31.4592,106.9588,48.8841,211
-32.2222,-9.5419,3.4248,13.0351,-9.5419,10.4455,31.277,16.5012,213
-19.2877,-9.477,2.3161,9.4683,-9.477,12.3219,26.9414,19.1231,214
-7.5425,-9.5933,2.8743,6.2163,-9.5933,6.7053,31.9776,15.1259,215
-9.8602,-9.8984,4.7496,9.6779,-9.8984,12.8617,22.3794,18.3652,216
-12.642,-8.8312,1.3238,6.216,-8.8312,7.3846,31.9773,13.1424,218
-35.6653,-9.5052,1.7926,11.6288,-9.5052,8.8374,29.1159,15.3466,219
-6.9431,-9.6332,-0.0271,2.6879,-9.6332,3.4594,12.1393,6.0717,220
-1.5733,-10.1715,0.1522,1.221,-10.1715,2.4549,17.388,13.4792,221
-3.1925,-9.8937,1.7834,5.5214,-9.8937,6.6488,17.9546,9.4974,223
-5.6521,-9.7489,-0.171,1.884,-9.7489,4.3084,22.557,19.5591,224
-6.1975,-9.2777,7.2767,12.6459,-9.2777,2.2682,27.2898,13.7924,225
0.6286,-10.0057,1.976,0.9557,-10.0057,3.9544,33.2567,24.7593,226
-5.0216,-9.7423,-0.3365,3.8828,-9.7423,3.3767,17.0566,10.8391,227
-14.2181,-9.7124,0.5146,10.6485,-9.7124,7.2109,73.2263,29.7756,228
-15.1352,-9.4317,10.2284,18.6596,-9.4317,18.5294,55.9901,21.7281,229
-81.6097,-10.268,6.1618,47.2339,-10.268,22.873,80.5363,42.9394,230
-1.5233,-10.4031,8.443,7.4379,-10.4031,5.4744,22.399,14.0715,231
-0.6879,-9.5055,2.7935,5.8555,-9.5055,3.9273,14.0921,8.5734,232
-24.7493,-9.7273,4.9219,17.9185,-9.7273,10.5606,74.0354,13.7932,233
-10.2589,-9.86,0.535,5.1928,-9.86,1.6176,36.6694,23.2142,234
-1.7597,-9.7644,0.1829,1.3726,-9.7644,2.2894,24.4848,8.8938,235
-9.7333,-9.8215,6.2812,13.2131,-9.8215,6.7098,40.3612,26.6313,236
-8.9038,-10.0047,6.2729,12.6878,-10.0047,5.499,52.0862,44.6774,237
-4.3368,-9.4515,1.2193,3.358,-9.4515,4.111,26.4302,20.9064,238
-1.605,-9.5663,2.2021,3.2156,-9.5663,2.5492,17.6084,6.3624,239
-16.4078,-9.5554,7.0019,14.558,-9.5554,3.1069,21.0354,16.2988,240
-23.0439,-9.63,5.8486,12.8949,-9.63,5.3062,50.8556,31.6981,241
-51.589,-9.7345,-0.2037,14.7313,-9.7345,10.5061,41.2461,15.4069,243
-11.714,-9.8393,0.0376,6.4655,-9.8393,4.8256,23.8362,13.6679,244
-42.2244,-9.7629,-6.6297,10.8124,-9.7629,6.9249,19.969,12.9929,245
-27.7145,-9.7329,-4.296,9.1312,-9.7329,8.3934,34.064,14.4589,246
-9.523,-9.5767,-2.1354,3.4068,-9.5767,4.7275,13.3925,9.0724,248
-4.9666,-9.7392,-1.3386,2.1913,-9.7392,3.3704,19.6597,10.1427,249
-0.7145,-9.2832,3.3842,3.7249,-9.2832,3.8895,16.4878,6.5509,250
-3.1375,-9.9204,1.3984,3.1354,-9.9204,5.188,16.0972,7.297,251
-58.2153,-9.5997,2.817,15.8903,-9.5997,10.1404,36.4393,17.8097,253
-0.6694,-9.7145,8.0803,8.6671,-9.7145,2.6578,24.4173,13.1721,254
-9.2291,-9.6578,-1.5499,4.9232,-9.6578,3.9843,12.6596,10.4359,255
-37.7508,-9.8266,-5.267,14.4686,-9.8266,9.518,34.6156,10.6231,256
-4.8978,-9.6101,-0.2444,2.6623,-9.6101,3.7589,13.3966,6.5154,258
-34.3536,-10.1099,-2.8953,15.295,-10.1099,1.9142,24.8109,17.751,259
-27.5862,-9.4445,-0.4032,23.0398,-9.4445,1.0885,17.9244,15.2577,260
-21.6743,-9.6341,-6.4701,6.9037,-9.6341,5.8408,19.3123,13.563,261
-48.3662,-10.002,-6.6844,13.2885,-10.002,10.5488,34.9105,20.6965,263
-44.397,-9.7459,6.1679,27.4461,-9.7459,13.6521,47.8853,20.1378,264
-72.218,-8.5078,0.3899,24.6205,-8.5078,9.6691,58.9759,13.2322,265
-17.5047,-9.8031,-1.9346,4.3938,-9.8031,6.1395,20.8028,11.125,266
-12.9806,-10.0309,13.5756,17.1239,-10.0309,11.986,52.957,33.7418,268
-41.8301,-9.9621,-3.6152,12.9907,-9.9621,10.4994,63.0174,53.5525,269
-14.574,-9.8833,-0.2642,9.1267,-9.8833,5.5831,17.6518,14.5611,270
-42.3167,-9.4005,38.8898,72.033,-9.4005,24.6705,95.2098,39.6748,271
-23.3479,-9.651,1.5511,8.0183,-9.651,7.9994,39.0047,8.7272,273
-32.066,-9.8006,2.0592,16.2406,-9.8006,10.445,40.6321,21.0861,274
-1.0671,-9.5804,2.1331,1.8581,-9.5804,2.5983,15.8961,11.7009,275
-7.1711,-9.6236,0.9889,4.8899,-9.6236,3.8146,21.6947,16.32,276
-17.1309,-9.8755,4.7227,9.9198,-9.8755,9.5717,30.4088,18.7909,278
-25.3692,-9.7685,-0.714,9.7754,-9.7685,8.1326,21.8284,16.8291,279
-16.327,-9.7803,6.1135,20.9104,-9.7803,12.4453,35.8228,14.7386,280
-9.7903,-9.7332,2.028,8.9193,-9.7332,5.035,22.297,11.2737,281
-15.3548,-9.7228,1.8868,5.9763,-9.7228,8.0829,28.8034,15.8627,283
-20.6568,-9.7567,9.12,17.4414,-9.7567,8.3546,44.4817,22.4449,284
-26.9686,-9.5615,11.0118,18.8706,-9.5615,2.6733,52.3808,37.805,285
-2.6853,-9.7186,3.3785,5.0891,-9.7186,2.3365,13.1314,6.9693,286
-10.278,-9.7349,8.0129,12.4772,-9.7349,7.6866,20.4849,14.8027,287
-20.3704,-9.7988,7.6387,17.8143,-9.7988,9.7356,38.0164,17.9981,288
-13.9238,-9.7764,2.1755,9.0215,-9.7764,6.7384,23.7366,12.6482,289
-3.5521,-9.6785,0.3806,3.1154,-9.6785,2.9548,27.0032,7.7321,290
-1.9628,-9.7008,3.7635,4.3497,-9.7008,4.3921,17.8676,10.8707,291
-27.9874,-9.7406,-6.2159,8.4484,-9.7406,4.0936,15.6966,12.9178,292
-32.8612,-9.7258,-4.2657,20.9934,-9.7258,2.8514,26.3361,20.5571,293
-36.7817,-9.9288,-0.8919,9.7998,-9.9288,5.2789,32.7602,23.2757,294
-4.819,-9.613,2.8904,4.2562,-9.613,2.3444,15.4179,9.4718,295
-24.6787,-9.7789,2.5136,13.8057,-9.7789,6.9166,29.6221,15.6107,296
-25.8683,-9.6096,-8.7981,11.9732,-9.6096,9.5756,23.7835,15.7238,297
-47.9887,-9.8406,9.9584,27.4279,-9.8406,18.214,49.6465,25.1413,298
-22.5115,-9.7581,10.1256,26.5239,-9.7581,11.2302,45.3189,24.0183,299
-18.016,-9.9392,5.7895,11.7683,-9.9392,9.877,24.5628,16.0633,300
-7.5317,-9.3526,-2.3568,3.3649,-9.3526,7.1426,17.4444,10.7231,302
-33.261,-10.0238,-1.0377,16.4653,-10.0238,10.2525,39.0048,23.2854,303
-53.036,-9.7964,4.2924,20.3546,-9.7964,13.6364,49.0803,15.8971,304
-41.1353,-8.9991,0.4107,20.6689,-8.9991,11.3151,31.4888,17.1392,305
-19.2328,-8.1204,-6.6115,7.0827,-8.1204,6.3113,22.4835,15.6738,306
-33.3204,-9.8686,3.1832,11.8951,-9.8686,10.5674,32.3077,14.3223,308
-20.3864,-9.5565,3.4921,17.2645,-9.5565,2.6616,18.952,14.0208,309
-8.7007,-7.3919,3.6015,9.8025,-7.3919,4.0509,48.2819,29.5036,310
-24.0312,-9.7636,-2.335,8.1733,-9.7636,6.4899,14.1677,10.4942,311
-6.7291,-9.1794,0.5743,4.8684,-9.1794,5.2119,33.4609,9.6538,313
-0.5592,-8.573,4.8922,4.2672,-8.573,6.8559,18.447,12.243,314
-3.1617,-9.8574,2.0567,3.7151,-9.8574,4.8232,17.9212,8.5836,315
-22.1285,-9.6163,0.9344,10.3556,-9.6163,5.7941,24.3813,7.0118,316
-40.1802,-9.8832,-0.9877,26.4178,-9.8832,16.2749,47.5534,25.3765,318
-40.6241,-9.9968,-10.3073,13.7115,-9.9968,5.7851,27.1498,15.5459,319
-12.6484,-9.6859,-0.3325,8.9709,-9.6859,6.3482,16.4896,10.1039,320
-12.5979,-9.6834,1.5623,7.6947,-9.6834,4.83,33.9016,16.5811,321
-10.8504,-11.018,2.5579,10.9132,-11.018,7.7512,62.7125,48.0242,323
-14.1375,-10.3396,1.9529,9.4593,-10.3396,4.8327,61.1314,47.2289,324
-92.9931,-11.0456,-8.6187,50.0956,-11.0456,15.4194,68.2631,32.0609,325
-31.1955,-9.7155,4.403,15.4438,-9.7155,13.4904,27.7929,15.4062,326
-69.9595,-9.7907,-8.8042,16.2677,-9.7907,9.1363,39.1011,19.719,328
-7.3327,-10.0416,-1.1129,6.5861,-10.0416,4.8171,17.5673,7.627,329
-7.4165,-10.912,16.174,26.0756,-10.912,9.15,43.3632,34.2464,330
-200.6694,-9.614,29.4507,114.8798,-9.614,33.576,69.7879,38.9664,331
-135.1137,-9.7013,-4.6849,37.702,-9.7013,18.2262,52.4608,23.5181,333
-18.0286,-10.0859,-0.2511,10.5665,-10.0859,4.7941,26.6492,15.7962,334
-10.9026,-8.9919,0.5341,7.7067,-8.9919,11.0911,32.0291,14.7548,335
-40.907,-9.1333,8.7237,24.5741,-9.1333,12.6957,33.848,22.1309,336
-41.3088,-8.3152,12.9354,30.6821,-8.3152,10.965,43.5512,21.8146,338
-74.2624,-9.7565,-7.6665,23.6191,-9.7565,11.3629,35.9146,15.5367,339
-24.4597,-9.1449,-0.5071,13.7229,-9.1449,4.7463,20.5097,13.6292,340
-25.0166,-8.0856,-4.3715,11.3027,-8.0856,10.461,26.2505,14.2693,341
-39.927,-8.7331,4.4261,28.076,-8.7331,14.0281,62.8147,23.9819,343
-120.967,-9.8,-10.9591,61.7759,-9.8,14.6144,36.3522,20.585,344
-67.0874,-9.6846,4.4489,40.9717,-9.6846,3.1567,24.6499,20.4561,345
-33.1372,-8.7675,1.1265,11.7803,-8.7675,7.4563,26.5543,19.5342,346
-39.6229,-10.109,13.8545,25.8506,-10.109,17.7131,42.478,30.2189,348
-37.7883,-9.9998,12.8002,41.7931,-9.9998,14.0965,54.0507,25.1716,349
-67.8274,-10.06,8.9297,63.3866,-10.06,9.5388,43.225,24.0879,350
-83.8738,-9.6151,8.8078,51.096,-9.6151,15.509,36.9914,29.5633,351
-79.8909,-10.3856,2.1951,47.7694,-10.3856,8.5439,34.5755,29.551,352
-17.8229,-9.6408,2.0888,11.6296,-9.6408,2.9467,17.331,13.5649,353
-16.9627,-9.3393,6.5664,16.7441,-9.3393,7.5495,29.9766,13.209,354
-5.9111,-10.3993,4.6006,7.4882,-10.3993,1.7251,19.5858,17.2809,355
-16.1307,-10.018,8.8934,18.7689,-10.018,8.7071,39.0621,25.8723,356
-41.7436,-10.845,7.9151,37.7411,-10.845,12.0196,32.1143,17.7864,357
-100.4537,-10.2096,7.9143,49.3392,-10.2096,15.2506,52.9387,19.098,358
-255.0175,-5.8602,19.6339,83.9941,-5.8602,20.7437,143.791,50.5222,359
-15.7937,-9.5683,13.0159,38.042,-9.5683,7.2507,55.3139,23.6405,360
-110.2522,-7.6521,-9.8389,43.0165,-7.6521,11.2819,90.4407,66.465,361
-24.1941,-7.0321,81.001,112.6549,-7.0321,3.9167,95.0683,39.5266,362
-141.3412,-8.5251,17.0536,46.0687,-8.5251,10.0069,68.327,18.2217,363
-0.2781,-8.7126,3.0678,1.7059,-8.7126,0.4264,3.3347,2.7637,364
0.8804,-8.7481,4.7347,2.9734,-8.7481,0.7503,3.2277,2.8293,365
3.9976,-8.7417,5.2854,0.9156,-8.7417,0.2316,2.9939,2.8251,366
-15.0777,-8.6869,-0.2568,5.0801,-8.6869,1.1377,6.7822,3.3359,368
9.5221,-8.7689,88.517,37.0001,-8.7689,11.8188,35.358,28.6026,369
-4.1891,-9.7394,-0.2737,2.3103,-9.7394,6.6511,14.6561,8.0673,370
-13.7181,-9.6634,-4.5823,6.5535,-9.6634,10.0153,14.9337,11.6263,371
-19.0888,-8.6284,1.011,12.2343,-8.6284,10.407,53.1271,20.8771,372
-44.0963,-9.7131,1.5144,12.1734,-9.7131,9.8897,26.6515,10.0735,374
-17.7289,-9.6965,-5.2696,11.9392,-9.6965,9.4874,19.3342,11.3868,375
-1.6616,-9.7703,1.1178,2.2353,-9.7703,2.1778,11.4999,7.5721,376
-1.7634,-9.7854,-0.6152,0.6424,-9.7854,1.0525,5.2896,3.913,377
-0.6651,-9.7681,-0.02,0.3225,-9.7681,0.9983,3.8676,3.4961,378
-0.9397,-9.7867,-0.3086,0.4386,-9.7867,0.9286,4.094,3.1941,379
-1.617,-9.7864,-1.0918,0.3599,-9.7864,0.361,4.1539,3.9575,380
-1.5227,-9.7823,-0.5525,0.4654,-9.7823,0.7022,3.7683,3.0313,381
-4.2476,-9.7795,0.8507,2.6117,-9.7795,6.7373,27.5254,4.3752,383
-21.5103,-9.8107,-2.585,5.3182,-9.8107,3.8872,51.7847,40.9783,384
-9.6928,-9.7126,4.2953,9.5718,-9.7126,6.9041,42.5277,32.9341,385
-18.0587,-9.7302,-2.2578,4.8253,-9.7302,4.0467,14.8766,9.2723,386
-13.0006,-9.7486,-0.0071,5.9885,-9.7486,7.2327,16.4688,5.0857,388
-33.205,-9.6915,-5.8471,12.9756,-9.6915,5.9471,19.2983,8.9139,389
-22.9908,-9.5471,16.4434,25.2113,-9.5471,8.3461,23.9036,7.4035,390
-63.9064,-9.6774,1.0632,27.2207,-9.6774,11.3689,33.1644,8.014,391
-2.3146,-9.7415,1.4663,2.2515,-9.7415,3.109,6.8563,5.8116,393
-0.0258,-9.7674,0.1706,0.211,-9.7674,0.43,4.114,3.6751,394
0.3169,-9.7737,0.8116,0.34,-9.7737,0.7073,4.6244,3.4285,395
-0.4853,-9.779,0.6893,1.0153,-9.779,1.9405,5.0791,3.3567,396
-1.3738,-9.7678,1.4709,2.0627,-9.7678,3.7492,14.0678,4.1348,398
-4.1771,-9.7396,-1.4543,2.1285,-9.7396,2.3671,5.4543,3.0429,399
-6.0991,-9.7391,-3.2735,1.7871,-9.7391,1.3917,6.0868,4.2868,400
-11.1638,-9.7536,0.3304,4.5157,-9.7536,8.683,13.1309,8.438,401
-5.3993,-9.793,-1.5411,1.9325,-9.793,1.7765,12.0006,6.7749,402
-48.8992,-9.7926,-3.5225,20.8222,-9.7926,9.8428,25.4933,19.955,403
-46.3756,-9.6752,-6.7402,12.8376,-9.6752,5.8789,18.0433,6.5648,405
-49.2696,-9.8115,-3.6257,14.4896,-9.8115,8.7181,47.644,35.9341,406
-2.6981,-9.7462,7.4056,6.4145,-9.7462,2.4514,45.6281,16.9077,407
-2.9784,-9.7772,7.8126,8.3845,-9.7772,3.7137,22.0045,16.5611,408
-0.1131,-9.7681,2.3573,1.638,-9.7681,3.8235,31.3893,20.1887,409
-19.8982,-9.8974,-5.7681,7.4928,-9.8974,3.8274,11.7603,7.5105,410
-3.6499,-9.7734,1.1941,2.6084,-9.7734,3.0683,16.855,5.9037,411
-8.3327,-9.699,-4.0003,4.0367,-9.699,4.155,15.7012,9.5605,412
-3.7174,-9.8059,24.3388,24.9913,-9.8059,18.5536,48.2019,29.677,413
-8.8633,-9.8718,4.4173,9.2413,-9.8718,7.2798,40.5066,30.7746,414
-1.7434,-9.62,15.6378,15.5291,-9.62,2.9363,26.3144,21.193,415
-9.5788,-9.826,0.4679,8.6136,-9.826,7.4009,44.4688,32.0452,416
-7.5455,-9.7518,-1.5752,2.7113,-9.7518,3.6481,13.0453,10.8108,417
-14.0335,-9.7123,-0.9416,4.0126,-9.7123,5.5011,11.7689,7.4012,418
-18.1203,-9.7682,-2.2206,8.9423,-9.7682,12.5825,30.6155,15.4744,419
-10.6326,-9.5875,-1.0814,10.6798,-9.5875,3.6536,20.678,18.3907,420
-31.2551,-9.824,20.0013,46.2772,-9.824,17.2334,56.6416,42.4836,421
-50.9452,-9.5386,-11.8911,20.1295,-9.5386,8.7382,40.5084,28.517,422
-17.6641,-9.7461,3.2253,12.5868,-9.7461,12.8011,45.6997,16.76,423
-30.4315,-9.7489,2.3308,13.3677,-9.7489,11.6229,31.7461,17.72,424
-6.7788,-9.7663,4.0016,10.8507,-9.7663,2.5335,19.1753,10.9627,425
-17.7643,-9.7579,-2.0779,6.0381,-9.7579,4.6622,22.4649,9.0977,426
-12.986,-9.7177,-1.3856,4.669,-9.7177,4.9792,31.258,15.8724,428
-2.3537,-9.6941,1.883,4.1626,-9.6941,5.1419,22.0614,11.3236,429
-5.8677,-9.3128,-0.648,3.7226,-9.3128,2.6686,12.9641,6.7152,430
-3.396,-9.7244,-0.8588,1.7185,-9.7244,3.1785,28.4607,10.5049,431
-36.987,-9.7442,3.4317,15.2506,-9.7442,10.7096,69.0936,24.1509,433
-0.9273,-9.684,10.3997,13.5263,-9.684,9.8066,33.8687,26.8639,434
-11.8243,-9.7902,-2.4374,5.3829,-9.7902,2.6292,15.0641,8.7703,435
-9.2092,-9.7299,-1.2982,3.7135,-9.7299,4.3873,14.6522,7.9305,436
-9.0911,-9.7384,-1.781,3.8175,-9.7384,6.1267,22.5517,9.8078,438
-2.8059,-9.9111,0.6304,1.9298,-9.9111,1.2167,10.8671,8.2893,439
-0.2121,-10.2537,7.7195,6.2108,-10.2537,3.4124,18.7086,11.0828,440
-4.2668,-10.0793,9.4877,9.0522,-10.0793,7.3155,42.2811,28.7903,441
-22.8051,-9.883,0.9056,8.706,-9.883,8.8685,28.7612,13.7473,443
-3.5573,-9.8563,6.6656,8.1556,-9.8563,9.7372,32.384,21.6328,444
-0.7924,-9.7371,7.021,5.7146,-9.7371,5.6443,23.9288,13.3934,445
-19.1807,-9.6088,1.9742,17.1731,-9.6088,1.6662,29.494,18.444,446
-7.2349,-9.7978,4.8256,9.2087,-9.7978,9.1786,38.0294,15.1037,448
-3.4284,-9.8168,1.8581,5.7517,-9.8168,4.3985,21.1224,18.1246,449
-16.1484,-9.2098,11.4497,19.4982,-9.2098,10.0714,35.4877,24.6479,450
-4.5035,-9.729,0.9563,1.9165,-9.729,1.5774,15.844,8.8513,451
-56.0469,-9.7473,0.1849,18.6806,-9.7473,14.6098,34.7148,19.4478,453
-18.6662,-9.7978,0.6369,8.5133,-9.7978,11.9983,30.5247,13.0123,454
-30.7855,-9.7888,-6.6469,8.966,-9.7888,5.4197,24.4811,13.3757,455
-20.7755,-9.8286,-2.8496,8.7093,-9.8286,9.6477,27.8064,17.0275,456
-19.6103,-9.5879,11.7943,32.6002,-9.5879,13.8718,41.3009,19.9056,458
-16.0551,-9.8756,1.1111,6.9676,-9.8756,7.8152,19.063,13.4676,459
-37.6883,-10.1328,-7.8285,17.6738,-10.1328,4.8401,18.3546,13.1134,460
-54.2586,-9.5328,9.8357,28.2139,-9.5328,7.1624,38.5858,25.5882,461
-66.9533,-9.4364,-2.4431,20.0791,-9.4364,11.1078,32.9583,12.8311,463
-9.4334,-9.7979,1.5057,3.757,-9.7979,8.0253,20.8606,15.0194,464
-1.3451,-9.4099,-0.0116,1.2047,-9.4099,2.2812,18.4252,12.4756,465
-1.7815,-9.9394,15.4747,18.5556,-9.9394,11.1761,41.9399,29.8166,466
-22.8603,-9.8871,-2.9975,8.0281,-9.8871,7.3125,25.6656,10.9897,468
-19.9373,-9.68,-0.2027,7.0777,-9.68,7.5746,24.7117,17.7036,469
-12.0772,-10.3862,4.8986,8.1191,-10.3862,7.7564,44.392,28.5618,470
-19.6931,-10.5584,0.5181,12.274,-10.5584,2.4877,56.6474,39.4678,471
-22.2031,-10.4012,5.8217,14.0146,-10.4012,8.0123,58.8123,41.8267,472
-35.2345,-10.4723,-6.5438,14.2661,-10.4723,9.2736,58.5171,43.2853,474
-0.068,-10.0101,14.1356,19.4684,-10.0101,8.8314,30.8537,23.6223,475
-46.0956,-9.7439,-11.2654,15.6642,-9.7439,10.0178,28.475,17.1063,476
-7.5038,-10.3774,27.7254,35.8552,-10.3774,17.2643,59.1914,37.9165,478
-22.702,-10.3872,5.4994,18.7328,-10.3872,16.2877,54.3538,43.5958,479
-38.183,-9.149,19.4758,42.8461,-9.149,20.1047,51.8223,18.4928,480
-42.645,-9.615,-9.8162,21.2213,-9.615,2.8541,18.3726,14.1298,481
-29.7292,-9.6112,-0.1154,19.1313,-9.6112,10.6324,24.3098,13.1943,482
-35.4626,-7.7707,2.5794,21.0475,-7.7707,11.0125,32.6499,22.9735,483
-25.6289,-9.2456,11.452,23.5807,-9.2456,10.6825,25.7809,20.1637,484
-44.715,-9.9644,-0.8332,18.7913,-9.9644,4.9123,33.5456,14.6514,485
-12.5951,-9.6496,2.5257,7.7673,-9.6496,4.704,15.9331,10.0569,486
-49.0612,-8.8272,-5.0167,11.5082,-8.8272,6.4077,21.9022,9.5997,488
-15.1649,-7.9378,4.0742,17.2951,-7.9378,9.1996,44.1491,24.5564,489
-1.0827,-9.987,-0.2738,0.6971,-9.987,1.7162,8.3656,5.059,490
-25.6737,-7.1559,-1.4764,10.2315,-7.1559,8.519,57.5106,26.0677,491
-42.303,-9.8504,6.98,21.1086,-9.8504,18.8553,35.9072,21.629,493
-4.2018,-9.4904,6.8387,11.3426,-9.4904,9.6412,28.9665,24.7458,494
-47.7097,-10.7827,6.3002,40.9103,-10.7827,9.2918,32.8438,29.0746,495
-33.5651,-9.8169,13.6549,25.6169,-9.8169,19.8304,44.1936,35.242,496
-47.5815,-10.2853,-1.0249,14.4478,-10.2853,9.1236,43.1597,19.9396,498
-27.6461,-9.0793,5.7003,24.7156,-9.0793,14.4485,36.6384,22.8926,499
-14.3199,-9.4673,2.7602,10.6808,-9.4673,10.5917,38.2196,22.861,500
-36.3999,-9.7168,0.0103,12.05,-9.7168,8.4995,28.3735,18.0823,501
-13.8714,-10.108,9.7037,15.5529,-10.108,7.4079,36.875,26.9322,503
-19.0374,-11.6647,6.0922,21.2017,-11.6647,15.9732,50.4919,46.1408,504
-28.1887,-10.3318,5.4438,26.9015,-10.3318,8.2731,40.1119,31.8262,505
-12.2757,-9.1171,-1.7025,6.5809,-9.1171,3.1622,25.4465,13.4789,506
-67.3336,-9.7823,8.8869,36.0547,-9.7823,19.0615,62.8157,35.2321,508
-13.6281,-10.0731,-1.2018,7.4667,-10.0731,4.3776,25.8111,10.7703,509
-75.5712,-10.0728,19.8925,59.2833,-10.0728,11.7025,68.9117,29.1878,510
-141.3247,-7.9776,-31.5344,62.4516,-7.9776,18.3647,69.0189,39.2873,511
-77.043,-9.5243,15.255,64.4244,-9.5243,15.5746,67.2074,31.8712,513
-70.2343,-6.8138,-12.9222,38.1295,-6.8138,5.8959,37.2362,31.2671,514
-18.7382,-9.2343,-3.2678,9.0972,-9.2343,4.3719,21.0318,8.4424,515
-26.8257,-9.6976,12.4243,24.2364,-9.6976,10.3896,32.6218,22.9054,516
-181.6094,-8.1593,-4.0774,41.863,-8.1593,14.8479,40.5223,21.8284,518
-187.6002,-9.2413,-16.0294,61.9598,-9.2413,20.3432,51.1619,21.2872,519
-54.9772,-9.3272,-9.6758,22.2968,-9.3272,5.8341,20.3515,16.012,520
-8.1095,-8.0884,4.0873,10.4465,-8.0884,9.328,46.1003,13.038,521
-6.3258,-8.7063,1.2715,3.0425,-8.7063,5.2529,30.1435,12.1181,523
-10.4629,-9.4969,0.1644,7.3872,-9.4969,5.4981,27.846,18.4857,524
-1.809,-10.9143,2.7385,4.2996,-10.9143,6.6062,38.3423,29.631,525
-288.0028,-9.6646,0.1134,102.5022,-9.6646,17.7724,58.2907,23.5646,526
-12.2396,-10.1448,1.0051,6.2531,-10.1448,8.5794,45.992,13.8718,528
-11.5611,-9.9091,0.6542,6.7417,-9.9091,7.0293,23.2436,14.3497,529
-13.9249,-10.0172,14.2153,25.2468,-10.0172,22.5431,38.7239,26.6849,530
-47.6155,-9.6256,-8.3199,23.971,-9.6256,9.9895,25.3496,16.7124,531
-11.2193,-9.7983,7.9519,17.7685,-9.7983,11.4243,31.1979,10.5341,533
-106.4613,-9.4813,17.8083,46.3985,-9.4813,23.1115,62.8419,24.1492,534
-102.4813,-9.9299,-21.6581,37.1064,-9.9299,7.7105,24.3884,17.9637,535
-43.0246,-9.8135,8.9542,32.7409,-9.8135,18.1082,51.7776,17.992,536
-52.4318,-10.047,-18.4768,21.6412,-10.047,10.4509,32.5504,19.2296,537
-109.6228,-9.6952,10.0058,65.439,-9.6952,23.4932,41.2917,29.3035,538
-104.079,-9.2399,-2.9498,32.853,-9.2399,15.0019,36.2021,22.943,539
-44.9411,-9.8753,-1.8205,26.2352,-9.8753,4.9861,18.7404,12.1913,540
-102.0647,-9.6654,-15.0451,56.0667,-9.6654,6.4184,37.5512,27.4713,541
-21.23,-6.3634,-2.3314,18.801,-6.3634,4.5043,64.3152,32.4431,542
-16.4625,-9.4328,6.3468,11.5665,-9.4328,4.9503,25.5562,16.078,543
-33.5272,-9.8412,12.3715,37.7623,-9.8412,15.3271,74.6135,24.0327,544
-6.4028,-7.2599,35.5064,54.0939,-7.2599,27.0054,47.0261,32.9487,545
-0.4666,-9.4728,7.6925,7.7679,-9.4728,7.9367,23.6962,17.5819,546
-26.1582,-9.779,6.2588,16.2849,-9.779,5.4707,42.1067,16.3667,547
-19.7931,-9.835,-0.2695,8.2294,-9.835,7.2783,27.3522,12.7295,548
-2.6989,-9.4111,1.2771,3.5265,-9.4111,3.7888,11.7407,7.3224,549
-15.4553,-9.6314,-2.763,9.1754,-9.6314,3.6991,25.8107,21.4326,550
-5.566,-9.8083,1.5219,6.7775,-9.8083,4.8737,19.953,8.898,551
-4.5792,-9.8195,4.6808,6.9058,-9.8195,9.0894,21.3765,13.7598,553
-4.3287,-9.7952,0.6093,2.1098,-9.7952,3.8526,17.6035,12.1673,554
-0.8684,-10.2798,2.5048,2.5698,-10.2798,4.0363,13.7611,8.1108,555
-18.8192,-9.7772,0.1799,9.1302,-9.7772,5.4316,21.7383,13.4224,556
-23.6665,-9.4672,3.572,14.159,-9.4672,10.7893,57.3107,14.0061,558
-4.9373,-9.6839,1.612,3.5088,-9.6839,3.9745,18.7283,10.3666,559
-14.4443,-9.9068,3.2409,9.8525,-9.9068,5.701,18.1491,15.2929,560
-12.9132,-9.7728,3.1207,13.7035,-9.7728,9.298,55.8984,36.3107,561
-29.5999,-9.9993,18.5205,40.0736,-9.9993,18.0318,75.9045,40.1669,563
-34.642,-9.784,-6.0185,14.8329,-9.784,9.2323,30.3459,19.7912,564
13.8667,-10.1987,24.8119,6.7831,-10.1987,5.9237,35.4936,27.1951,565
-41.4595,-10.089,-3.8032,14.7556,-10.089,11.1009,36.9586,24.1984,566
-5.4219,-9.8156,7.7049,9.5602,-9.8156,7.7213,26.7225,13.1285,568
-5.4746,-9.7978,0.8092,4.0948,-9.7978,5.39,13.1698,9.0377,569
-43.5211,-9.6807,10.8258,25.0682,-9.6807,10.9089,49.9843,22.2397,570
-54.0512,-9.8271,-2.984,20.2039,-9.8271,9.4151,22.3481,12.9954,571
-63.861,-9.9067,-0.7679,26.3832,-9.9067,15.2789,35.8789,18.9419,573
-54.8203,-9.4224,5.3781,31.9461,-9.4224,19.1077,49.1074,25.2827,574
-7.4367,-9.7581,2.0714,9.8838,-9.7581,7.0429,19.9849,11.6605,575
-20.9987,-9.9641,20.3383,27.3651,-9.9641,14.9046,38.4537,29.0891,576
-20.9355,-9.8831,10.1671,19.1776,-9.8831,9.0297,32.8723,20.1247,578
-4.4151,-10.0861,6.0844,8.8654,-10.0861,7.0287,21.4348,17.8669,579
-22.1409,-9.9377,-2.1713,14.6841,-9.9377,2.7394,21.7001,18.5336,580
-6.7238,-9.9147,-0.1908,4.3743,-9.9147,4.1326,17.1432,9.6506,581
-11.012,-9.8951,5.9216,9.6798,-9.8951,7.0879,27.1767,18.4788,583
-12.1169,-9.677,-2.509,3.5692,-9.677,4.4186,11.8585,5.3272,584
-5.5694,-8.4253,2.7419,5.9126,-8.4253,11.9199,23.8953,17.621,585
-7.9505,-10.0032,4.4798,7.0362,-10.0032,8.788,28.5981,15.5361,586
-14.7094,-9.7307,14.0614,19.7908,-9.7307,14.4693,28.1252,13.5449,588
-25.0399,-9.8226,22.1912,36.6879,-9.8226,16.0381,43.3351,31.0136,589
-2.6565,-9.9128,1.1308,3.2743,-9.9128,3.7346,17.0851,10.9504,590
-19.081,-9.7292,0.9911,8.7654,-9.7292,4.6795,14.2714,11.4271,591
-5.5146,-9.7732,3.1794,8.438,-9.7732,5.0461,22.4861,7.3806,593
-19.8235,-9.9062,-0.3777,7.6762,-9.9062,4.7636,22.5509,8.5362,594
-14.6909,-9.8596,-2.6326,6.1067,-9.8596,2.5039,11.0358,7.9287,595
-7.307,-9.7765,2.7887,5.4799,-9.7765,4.297,14.6257,9.0605,596
-0.4452,-9.8574,1.6711,2.9303,-9.8574,3.2743,9.2331,6.9462,597
-9.5804,-9.8253,-0.345,5.746,-9.8253,6.2758,19.8538,7.6478,598
-16.2308,-9.8848,2.8212,9.8731,-9.8848,10.0371,23.9632,18.1215,599
-10.4662,-9.7946,8.6225,18.2127,-9.7946,7.2159,19.3584,14.3055,600
-2.128,-9.567,2.8188,3.433,-9.567,3.6634,17.4015,5.6623,601
-13.0207,-10.7807,27.1608,31.973,-10.7807,19.8551,56.9649,42.0339,602
-16.1356,-9.8246,-2.1213,7.4275,-9.8246,4.2785,15.6209,9.0766,604
-2.7159,-10.0013,7.3,5.472,-10.0013,4.6082,20.9625,12.9931,605
0.0639,-9.1937,6.4429,6.6755,-9.1937,6.3056,17.9839,13.6081,606
-1.0605,-9.6424,8.4672,8.4258,-9.6424,4.4757,19.8141,13.5557,607
-3.2966,-9.6106,0.9593,2.8081,-9.6106,3.7195,14.885,8.2907,608
-9.4227,-9.7784,2.6209,7.741,-9.7784,7.3045,15.1579,11.4564,609
-2.8482,-9.662,-0.8277,1.1442,-9.662,2.2349,5.945,4.1109,610
-31.6793,-9.8504,0.8777,13.7041,-9.8504,7.9429,22.6988,13.6701,611
-5.0492,-9.8346,21.5322,18.8513,-9.8346,12.2041,35.6194,19.8356,613
-2.1739,-9.8022,4.085,4.9808,-9.8022,4.0558,20.6897,15.1056,614
-1.1239,-9.2674,7.1692,9.4142,-9.2674,6.7448,21.5128,13.3871,615
-2.5478,-9.9286,1.948,2.9771,-9.9286,4.2356,15.9648,10.5848,616
-6.4132,-9.78,-0.5676,2.0181,-9.78,2.978,10.4536,5.3735,618
-2.2035,-9.7762,6.5831,7.9957,-9.7762,8.5645,19.4534,12.9466,619
-2.1507,-9.8349,0.6962,2.1666,-9.8349,3.1327,12.5998,6.2891,620
-9.0501,-9.7866,-0.2029,3.6227,-9.7866,4.5507,8.1103,5.1247,621
-10.2456,-9.7642,0.5874,3.1016,-9.7642,3.8538,10.0907,5.1788,623
0.3876,-9.7826,0.5384,0.1304,-9.7826,0.4096,3.8292,3.223,624
-0.4326,-9.7756,-0.1554,0.1902,-9.7756,0.4259,2.5711,2.4549,625
-1.8364,-9.7667,2.3303,2.7904,-9.7667,2.6279,8.8554,5.9761,626
-0.164,-9.786,0.1121,0.1762,-9.786,1.0688,3.9266,2.7524,628
0.2066,-9.786,0.3657,0.1255,-9.786,0.2775,3.3329,3.1136,629
-0.0475,-9.7848,0.1243,0.0808,-9.7848,0.3961,2.9676,2.5829,630
0.1679,-9.7856,0.2385,0.0548,-9.7856,0.1625,2.777,2.6733,631
0.0859,-9.7853,0.2625,0.0947,-9.7853,0.3705,3.0374,2.7565,633
-0.0379,-9.7851,0.3813,0.2874,-9.7851,0.5525,3.3666,2.9632,634
0.2025,-9.7854,0.4423,0.178,-9.7854,0.1397,3.3598,3.2799,635
0.2035,-9.7847,0.494,0.2368,-9.7847,0.9825,4.3831,3.2709,636
-0.4697,-9.788,0.0567,0.2723,-9.788,0.8257,4.5809,2.92,638
-0.1438,-9.787,-0.0205,0.0811,-9.787,0.2556,2.9071,2.6799,639
-0.0635,-9.7887,-0.0239,0.0223,-9.7887,0.1677,2.4634,2.3994,640
0.0643,-9.7865,0.1561,0.0593,-9.7865,0.3427,2.9122,2.6096,641
-0.157,-9.7858,0.2952,0.1564,-9.7858,0.4399,3.6482,3.0812,643
-0.1592,-9.7877,0.0701,0.1348,-9.7877,0.4725,3.4749,3.0049,644
-0.1734,-9.7854,0.0684,0.1219,-9.7854,0.2873,3.1522,2.7619,645
-0.284,-9.7874,-0.0467,0.1201,-9.7874,0.4694,2.8769,2.5497,646
-0.0449,-9.7873,0.1127,0.0937,-9.7873,0.4284,3.0947,2.6578,648
0.0414,-9.7866,0.1923,0.1057,-9.7866,0.3947,3.2345,2.704,649
0.0733,-9.785,0.1692,0.0685,-9.785,0.3183,2.7393,2.5319,650
0.0688,-9.7856,0.1037,0.0251,-9.7856,0.2447,2.9034,2.5791,651
0.0445,-9.7856,0.2868,0.1341,-9.7856,0.4483,3.2224,2.8448,653
-0.4662,-9.7837,0.0704,0.1809,-9.7837,0.6782,2.8489,2.4636,654
-0.0225,-9.7788,0.9358,0.5368,-9.7788,1.6213,4.8247,3.6796,655
-0.1144,-9.7843,0.0856,0.1642,-9.7843,0.9249,3.6116,2.6083,656
-0.1195,-9.7719,0.3309,0.2771,-9.7719,0.7515,3.4591,2.7728,657
-1.7824,-9.7803,0.2214,0.8896,-9.7803,2.0647,5.6229,2.8766,658
-5.0034,-9.7809,4.2439,7.8187,-9.7809,6.0614,17.2771,11.3553,659
-17.7949,-9.7782,-0.62,6.0696,-9.7782,5.8166,33.5687,21.1008,660
-33.977,-9.6926,-8.2187,15.6425,-9.6926,5.5225,16.3308,10.5886,661
-10.5304,-9.7438,-8.6085,1.3105,-9.7438,1.3627,10.1135,9.5908,662
-4.4931,-9.7214,-1.7234,0.9712,-9.7214,0.7179,4.2315,2.736,663
-2.5288,-9.7271,-1.3898,0.4181,-9.7271,0.3151,3.2143,2.7181,664
-5.4759,-9.7235,-2.6495,1.3668,-9.7235,1.1473,5.0351,3.5193,665
-4.0761,-9.6991,2.7754,6.7907,-9.6991,5.9036,29.0752,16.0248,666
-0.1568,-9.7062,0.3011,0.5918,-9.7062,1.2972,6.1764,2.8699,667
-4.7904,-9.7664,-0.5799,1.2533,-9.7664,1.9339,6.1487,3.5887,668
-2.5463,-9.7895,-0.4979,0.6708,-9.7895,1.0051,4.4559,2.8081,669
-0.3414,-9.7883,-0.1348,0.1196,-9.7883,0.5264,2.8977,2.7473,670
-1.2799,-9.775,-0.9286,0.2979,-9.775,0.3231,3.4769,3.251,671
-1.1707,-9.7983,-0.1474,0.3937,-9.7983,0.8143,3.4283,2.6343,672
-5.4716,-9.7794,-0.0553,1.9539,-9.7794,3.5844,7.5141,3.8075,673
-3.4765,-9.7849,-1.0386,1.1947,-9.7849,1.3497,7.6368,4.6787,674
-1.2775,-9.7694,-0.7582,0.4837,-9.7694,0.5694,4.1994,3.6927,675
-2.6383,-9.7715,-0.9988,1.6075,-9.7715,2.4488,5.1845,4.4214,676
-0.9249,-9.7919,-0.1923,0.2917,-9.7919,1.1644,3.6406,2.8451,678
-0.3059,-9.7856,-0.1437,0.1074,-9.7856,0.4977,2.8463,2.5824,679
-0.0175,-9.7815,0.1436,0.1148,-9.7815,0.1701,2.9437,2.638,680
-0.5203,-9.7827,0.0953,0.4948,-9.7827,0.8798,4.4871,3.6964,681
-13.2871,-9.7689,-2.0514,4.395,-9.7689,3.8267,12.81,3.5277,683
-6.1109,-9.7118,-0.4847,3.4343,-9.7118,2.5435,7.339,3.2372,684
-12.0888,-9.7556,0.1693,5.3757,-9.7556,3.5236,13.5197,9.3553,685
-0.1731,-9.7369,3.9846,3.0809,-9.7369,3.8264,10.9604,6.8625,686
-10.8356,-9.7219,-2.3409,6.1993,-9.7219,5.3583,11.1828,5.0295,688
1.8996,-9.8014,4.383,1.811,-9.8014,2.942,17.8124,14.913,689
-22.4977,-9.74,2.6292,18.9091,-9.74,9.1361,22.4193,18.5888,690
-11.1983,-9.8092,0.4192,5.162,-9.8092,5.3461,24.333,11.9326,691
-16.2233,-9.7691,0.6398,7.0875,-9.7691,7.3303,22.1944,8.1524,692
-26.4342,-9.7502,-2.856,8.2591,-9.7502,6.7568,18.1071,9.9282,694
-12.2926,-9.7668,1.0521,5.4523,-9.7668,5.2066,18.9243,10.604,695
-12.9468,-9.8389,1.9859,7.6654,-9.8389,6.7979,41.5624,15.8451,696
-23.6729,-9.7477,-0.4527,6.9939,-9.7477,5.192,31.3496,16.8621,697
-17.059,-9.7338,6.4888,8.768,-9.7338,6.6247,28.1998,13.938,698
-1.4542,-9.7899,0.1256,1.3127,-9.7899,1.6471,14.3216,12.2021,699
-2.1626,-10.039,1.6068,2.8848,-10.039,1.7893,19.6838,10.4564,700
-5.653,-9.8735,3.8589,6.6658,-9.8735,7.7746,34.6404,15.124,701
-37.0458,-9.8741,-1.6222,10.0559,-9.8741,6.9118,25.4275,9.489,703
-24.3329,-9.8361,9.7685,21.1647,-9.8361,10.2474,24.2157,13.8491,704
-19.7654,-9.7833,25.8388,24.4458,-9.7833,3.2519,50.5633,22.7766,705
-8.6542,-9.9266,12.7673,11.8126,-9.9266,9.453,25.6662,17.2419,706
-15.9102,-9.8285,-0.8383,4.4879,-9.8285,3.9702,25.9287,9.3694,708
-11.703,-9.8242,0.0282,6.2884,-9.8242,4.5497,24.2059,9.5736,709
-29.4,-9.7487,-3.0853,15.8897,-9.7487,9.7201,31.6119,11.6709,710
-20.5491,-9.8679,2.7372,11.9332,-9.8679,7.2585,32.9649,13.4728,711
-35.894,-9.7236,10.8006,19.9888,-9.7236,14.5233,29.8207,20.7956,713
-43.8358,-9.8483,-5.8355,22.0715,-9.8483,6.169,21.3787,16.5189,714
-11.5782,-9.2763,-1.0537,6.7356,-9.2763,4.1725,15.5324,12.3905,715
-16.4028,-9.7222,6.6351,12.9497,-9.7222,9.2173,23.673,13.8246,716
-32.8274,-9.3641,3.569,16.3942,-9.3641,3.6839,16.0239,9.8029,717
-71.317,-10.0182,9.0473,56.6465,-10.0182,18.2922,49.8967,30.265,718
-24.0804,-9.8396,7.2783,19.7077,-9.8396,9.3104,26.515,17.5094,719
-19.4977,-9.7063,40.6216,47.4303,-9.7063,6.3895,33.5716,30.216,720
-26.6251,-10.0183,4.6876,26.6476,-10.0183,12.4619,44.4205,32.0992,721
-20.2168,-9.5818,2.3644,17.3821,-9.5818,7.0426,25.1036,14.5268,722
-8.7226,-9.7181,2.1916,6.8855,-9.7181,3.9387,19.2209,12.1227,723
-13.9937,-9.7576,15.6713,19.7231,-9.7576,14.9528,39.1441,21.2977,724
-12.6936,-9.8138,14.4788,16.9761,-9.8138,13.2551,39.1324,24.7107,725
-12.1894,-9.8491,-1.1435,8.5482,-9.8491,5.8515,36.168,9.9369,726
-24.0833,-9.9421,-4.8563,8.5809,-9.9421,4.2625,13.4629,7.0962,727
-44.1623,-9.5805,19.4544,35.3144,-9.5805,11.1714,33.9471,24.992,729
-26.4527,-9.9241,-0.2696,16.096,-9.9241,4.2445,19.6007,12.3645,730
-8.003,-10.0009,1.9353,6.6106,-10.0009,5.6734,18.051,12.4445,731
-8.9976,-9.3979,2.6369,9.0264,-9.3979,4.966,18.5919,12.6229,732
-8.2411,-9.9932,6.8171,11.0297,-9.9932,7.051,30.3379,21.2651,733
-27.1448,-10.0102,4.0065,17.3037,-10.0102,12.7738,35.3404,24.2495,734
-12.6439,-9.8835,39.7475,35.8569,-9.8835,1.1953,37.6683,25.3133,735
-12.8732,-9.784,1.8655,9.8061,-9.784,9.9905,25.8406,9.6086,736
-35.3865,-9.8841,11.6255,25.8671,-9.8841,12.4432,30.1704,22.5156,738
-7.8232,-9.6916,-1.7457,4.2825,-9.6916,2.7878,8.2946,5.9319,739
-17.0834,-10.1112,-3.5076,8.7776,-10.1112,16.0847,39.5578,34.3225,740
-5.2891,-9.8208,10.2637,9.2084,-9.8208,11.0425,19.2427,16.3613,741
-35.6516,-9.7428,9.2516,22.2443,-9.7428,15.9214,36.6386,20.449,743
-4.8343,-9.5353,19.7712,16.7148,-9.5353,5.3446,27.9876,21.0697,744
-9.7194,-9.8595,0.6158,6.0256,-9.8595,6.2858,12.0572,8.5086,745
-33.6366,-9.8396,3.0556,23.3506,-9.8396,18.8588,28.6953,21.2675,746
-36.1706,-9.7958,19.3163,31.9487,-9.7958,16.3231,44.512,22.316,748
-6.53,-9.6338,0.0499,5.6959,-9.6338,5.6404,15.327,9.4469,749
-7.924,-9.8828,4.5334,8.0651,-9.8828,5.7179,23.9429,14.476,750
-22.295,-9.6889,4.1509,14.0579,-9.6889,8.0674,22.2264,12.6204,751
-40.3627,-9.7453,-0.712,10.3395,-9.7453,6.2803,21.7736,11.4494,753
-6.7328,-10.1169,9.4504,14.92,-10.1169,9.5578,22.2903,12.3993,754
-49.349,-9.489,-7.4301,18.273,-9.489,3.2701,14.6673,9.0508,755
-5.184,-9.7431,18.5395,18.785,-9.7431,14.0942,39.5749,21.208,756
-78.0675,-8.7749,5.6527,29.4111,-8.7749,14.8316,31.9364,19.9929,758
-29.9709,-9.3244,-5.926,8.3306,-9.3244,4.6344,22.8585,10.6729,759
-52.918,-9.4621,-7.8243,27.8823,-9.4621,3.3699,26.6904,19.1894,760
-28.5471,-9.2728,2.6056,15.3166,-9.2728,7.2624,22.2427,12.3104,761
-36.3705,-9.7829,6.3424,18.3244,-9.7829,13.9816,39.0901,15.7244,763
-60.1915,-10.0977,-5.1569,20.3951,-10.0977,15.0374,25.9686,15.1348,764
-55.9831,-9.8014,-11.2827,23.3442,-9.8014,7.9605,26.2242,17.93,765
-49.1851,-9.1832,25.7547,36.2104,-9.1832,21.8871,42.0017,28.6128,766
-49.3054,-9.8797,-5.8006,14.9598,-9.8797,7.2809,19.2845,9.8752,768
-25.1149,-9.7381,-7.7511,11.7352,-9.7381,10.1032,25.4312,18.4025,769
-23.6809,-10.0719,0.1437,13.69,-10.0719,7.8824,31.4148,27.0653,770
-22.6585,-9.6712,9.2401,19.2938,-9.6712,12.5138,40.0167,23.4909,771
-9.37,-9.6393,4.1163,9.7973,-9.6393,5.0528,15.3164,9.2406,772
5.8927,-10.0985,20.6852,12.7631,-10.0985,4.9437,31.2605,22.2543,773
-7.6915,-9.8705,3.8073,8.8185,-9.8705,6.6592,16.735,11.8835,774
-76.3045,-9.9174,-15.9818,39.2727,-9.9174,18.3104,57.9232,43.0443,775
-44.2223,-9.7761,20.1631,34.4512,-9.7761,14.6485,36.9903,20.7774,776
-17.3032,-9.7624,11.4442,19.6495,-9.7624,12.6201,35.6223,18.6225,777
-21.4468,-9.8984,12.0435,18.8511,-9.8984,9.451,37.4033,17.0766,778
-5.6458,-10.1073,46.5611,46.6119,-10.1073,15.1278,51.17,36.2005,779
-59.4208,-9.8768,-6.9518,34.718,-9.8768,4.3429,45.3445,27.4284,780
-12.1425,-9.7302,5.7996,18.2227,-9.7302,6.0474,22.1241,15.647,781
-19.627,-9.8624,26.2704,37.588,-9.8624,10.304,29.776,19.8258,782
-7.8064,-9.7238,55.4863,48.9711,-9.7238,17.6752,38.1786,27.1366,783
3.6611,-10.0448,22.778,13.6846,-10.0448,12.2967,35.4868,17.517,784
-10.9408,-9.9202,22.1108,32.8964,-9.9202,16.3597,33.3421,29.4841,785
-19.903,-9.8625,9.3845,18.5214,-9.8625,12.6818,27.8603,15.2641,787
-19.9014,-9.7939,3.3425,17.3982,-9.7939,4.1488,22.2468,11.1712,788
-19.3916,-9.8972,11.6771,18.6305,-9.8972,4.9436,22.8262,19.0399,789
-17.6013,-9.7284,-2.007,7.7007,-9.7284,4.5179,12.7278,8.0188,790
-73.2413,-10.0879,15.1478,56.1065,-10.0879,6.62,43.4842,32.2567,791
-5.2794,-9.7479,-2.2322,2.4225,-9.7479,2.6351,13.4125,8.5683,792
-18.448,-9.9044,3.069,15.1423,-9.9044,9.9005,31.1657,18.8374,793
-13.0818,-9.7656,2.0936,15.8295,-9.7656,6.3972,31.1129,23.3082,794
-2.757,-9.7914,0.58,2.128,-9.7914,2.1184,11.1116,6.8071,795
-12.7553,-9.7182,2.832,8.0722,-9.7182,6.4037,13.5702,7.9902,796
-14.7872,-9.7719,3.3236,10.1211,-9.7719,9.1039,19.496,15.2491,797
-57.5455,-9.8649,0.2443,24.7228,-9.8649,8.9572,37.0685,21.0737,798
-11.0206,-9.8485,6.328,14.1528,-9.8485,5.3066,18.0165,15.3192,799
-7.6507,-9.8673,1.1799,5.871,-9.8673,2.4416,16.0786,7.3731,800
-3.765,-9.9257,4.9509,6.2375,-9.9257,9.1737,18.7253,12.6561,801
-13.4484,-9.9513,6.6335,12.5753,-9.9513,4.0589,26.3941,22.0843,802
-14.6826,-9.8145,10.3406,28.0064,-9.8145,6.7256,26.9499,20.2896,803
-2.4527,-9.8079,-0.3191,2.399,-9.8079,1.0697,8.1013,6.6783,804
-39.5149,-9.7882,-3.659,14.2751,-9.7882,6.3922,26.0901,7.1301,806
-21.7659,-9.7849,5.233,18.7546,-9.7849,12.8629,45.6139,12.9871,807
0.4003,-9.9776,21.5687,25.1819,-9.9776,20.4629,39.4881,34.8884,808
0.1055,-10.2291,8.2623,5.8941,-10.2291,13.4744,31.715,28.1309,809
-4.574,-9.7328,2.2133,4.7716,-9.7328,2.8735,14.7229,11.6225,810
-13.28,-9.8501,1.441,8.402,-9.8501,5.8702,15.2569,12.6438,811
-9.4617,-9.7145,16.1923,16.2846,-9.7145,20.4471,32.4714,23.6133,812
-3.824,-9.5906,2.9421,4.9315,-9.5906,4.452,19.9363,12.156,813
-10.5272,-9.537,35.1807,32.4495,-9.537,8.371,50.5719,38.5872,814
-13.8393,-9.7832,9.0736,15.7031,-9.7832,17.5198,30.485,21.5012,816
-7.5022,-9.7972,8.4252,13.9805,-9.7972,14.7445,33.7068,17.5764,817
-0.3441,-9.803,24.0534,20.5709,-9.803,26.4566,49.5417,38.2293,818
-3.6482,-9.698,18.1257,20.709,-9.698,19.8797,32.9244,24.3961,819
-2.5265,-9.7551,-0.0884,1.4041,-9.7551,1.3926,12.2633,5.8397,820
-52.518,-9.7719,10.5555,37.6239,-9.7719,14.1065,46.2414,21.0665,821
-18.4167,-10.0,-6.1199,6.5491,-10.0,4.234,29.9738,25.9162,822
-15.8056,-9.6741,8.9748,18.3033,-9.6741,4.9785,26.451,19.1574,823
-4.0295,-10.0292,30.2273,20.951,-10.0292,14.2536,43.1262,30.3868,824
-13.5448,-9.7912,-1.0905,8.5115,-9.7912,5.3742,13.5609,8.9824,825
-17.0957,-9.8169,8.6199,15.9123,-9.8169,13.3123,29.4755,20.1154,827
-16.4094,-9.8126,2.2222,12.239,-9.8126,8.3879,36.1205,25.3377,828
-7.6562,-10.1206,-2.1424,3.4984,-10.1206,4.2136,17.3874,13.8,829
-16.8918,-9.5448,-1.6008,7.8429,-9.5448,10.1841,20.5889,13.9068,830
-12.3118,-9.8554,-1.0513,3.5897,-9.8554,8.6927,31.2498,9.2964,831
0.0333,-9.6342,47.2531,44.885,-9.6342,18.3567,47.6817,37.2267,832
-14.1063,-9.6306,20.893,25.93,-9.6306,13.4801,41.5872,36.6323,833
-29.8594,-9.6603,16.7458,28.0435,-9.6603,11.618,35.1332,29.9375,834
-19.8837,-9.83,1.9442,10.2556,-9.83,11.6548,25.0652,19.4775,835
-57.3892,-9.8077,-4.0514,17.8505,-9.8077,14.3114,39.0508,22.0242,836
-9.8162,-9.7943,0.459,4.0371,-9.7943,4.702,15.8013,10.4891,837
-14.853,-9.9066,-1.3649,6.6367,-9.9066,6.2872,26.5346,14.4232,838
-0.9006,-9.8991,13.4473,16.2962,-9.8991,6.2599,25.8489,19.3147,839
-7.5628,-9.7448,28.8994,25.3869,-9.7448,1.2286,28.472,25.0292,840
-20.2988,-9.6556,8.3044,14.6247,-9.6556,14.2331,34.7189,20.2856,841
-0.8807,-9.7251,1.1281,1.8083,-9.7251,5.0178,18.7386,11.5467,842
-18.7457,-9.8276,-7.366,8.5578,-9.8276,3.2903,11.9631,8.7769,843
-0.7543,-9.7021,1.4791,2.9713,-9.7021,4.1568,21.6098,6.3708,844
-1.1693,-9.809,0.4942,1.118,-9.809,1.9489,7.7915,5.6289,845
-10.0155,-9.8207,4.7753,9.1999,-9.8207,7.6739,26.1391,11.3086,847
-31.1691,-9.8607,14.9362,23.4584,-9.8607,13.1341,40.8073,25.1326,848
-1.166,-9.789,-0.5105,0.4702,-9.789,2.0876,5.9294,4.909,849
-6.2346,-9.7643,6.2817,9.4932,-9.7643,9.0572,27.3745,22.2996,850
-3.386,-9.7902,17.0347,17.3941,-9.7902,12.3655,23.1157,18.3411,851
-17.8408,-9.7633,1.0336,13.2808,-9.7633,3.939,23.2406,18.3023,852
-257.2134,-10.5839,-18.5345,189.2904,-10.5839,32.4674,118.83,51.6748,853
-32.3548,-9.857,20.4294,47.9939,-9.857,9.6257,30.3178,25.434,854
-11.9804,-9.8378,-1.6714,5.3051,-9.8378,4.4765,24.5707,18.6564,855
-15.0275,-9.77,4.2051,8.7638,-9.77,11.3469,29.0399,22.6624,856
-3.0795,-9.7696,9.3031,11.3055,-9.7696,15.8709,31.0221,23.305,857
-7.6941,-9.9011,0.9605,6.3319,-9.9011,12.3254,26.116,20.7295,858
-8.5082,-9.8267,-0.179,6.2902,-9.8267,10.6185,32.6895,30.3483,859
-27.7373,-10.023,3.7891,17.7247,-10.023,11.0694,36.272,26.6156,860
-8.835,-9.8351,-1.5584,4.1239,-9.8351,5.6676,24.9888,17.6741,861
-24.7205,-10.7139,3.9935,19.8381,-10.7139,17.3268,53.223,46.2856,862
-7.5302,-9.6827,14.5039,13.7124,-9.6827,2.7961,27.8559,20.1464,863
-10.9931,-9.8669,63.9656,74.7818,-9.8669,19.1985,62.8133,49.96,864
-18.0064,-9.8642,31.1005,36.1067,-9.8642,25.2258,51.2424,35.866,866
-20.6244,-9.7812,5.3924,12.7096,-9.7812,9.699,30.0823,12.4705,867
-6.8861,-9.6813,-1.0524,2.7571,-9.6813,3.0934,12.7676,7.4958,868
-22.3221,-9.5781,2.2092,25.0225,-9.5781,6.916,32.6748,25.9657,869
-5.9006,-9.5866,15.1705,20.6754,-9.5866,8.7914,32.051,27.6291,870
-22.3167,-9.812,-0.686,10.7851,-9.812,2.2075,25.1603,11.7339,871
-12.4946,-9.7373,11.3413,16.2011,-9.7373,2.2759,32.3616,28.2833,872
-28.5131,-9.9487,12.8859,30.7191,-9.9487,10.4309,42.8951,36.7205,873
-6.2732,-9.8186,8.619,9.614,-9.8186,8.7198,20.0951,15.6138,874
-14.5972,-9.8027,5.6637,14.3357,-9.8027,7.2043,24.8493,18.3251,876
-12.627,-9.79,9.5034,18.2038,-9.79,15.6907,41.8676,21.7545,877
-23.2315,-9.8678,13.5017,27.7193,-9.8678,15.9127,35.0276,29.5603,878
-12.1629,-9.7057,3.7451,10.777,-9.7057,2.1355,18.2509,7.2872,879
-3.8121,-9.6902,0.2529,4.193,-9.6902,2.6383,18.0229,12.0711,880
-18.1931,-9.8451,8.9903,17.6475,-9.8451,17.7896,40.193,20.9524,881
-2.2072,-9.8739,1.8107,5.0371,-9.8739,2.4057,29.673,16.1732,882
-11.4427,-9.8118,-0.7687,5.5498,-9.8118,2.535,13.0815,8.5112,883
-9.5505,-9.6844,-3.0465,7.19,-9.6844,1.753,26.6072,19.3074,885
-33.1871,-9.8079,5.8136,14.4721,-9.8079,14.11,38.4712,16.9181,887
14.8709,-9.6937,21.1471,6.2499,-9.6937,2.6519,27.5147,17.7514,888
-0.2936,-9.9591,10.9556,9.0504,-9.9591,2.3316,23.0498,13.4195,889
-0.6315,-9.7743,2.8947,5.5689,-9.7743,3.1096,16.0579,14.2497,890
-7.4698,-9.7788,11.3457,20.3903,-9.7788,7.3045,31.7922,18.4908,891
-0.2757,-9.7726,10.4058,8.3964,-9.7726,4.8263,22.118,16.1895,892
-1.7851,-9.8956,-0.405,0.9745,-9.8956,2.3475,7.5304,4.3084,893
-3.861,-9.7174,8.7588,10.6905,-9.7174,4.4082,27.56,22.9472,894
-11.0844,-9.7322,-2.0257,4.9551,-9.7322,6.9436,14.1942,7.1224,895
-12.1704,-9.8354,2.5549,9.4532,-9.8354,9.6322,27.041,15.4461,896
-6.3178,-9.8193,12.4451,14.1907,-9.8193,11.8375,23.6405,16.9162,897
-12.1849,-9.7419,6.8836,12.4988,-9.7419,15.2418,32.934,14.5811,898
-11.1354,-9.8826,-4.6278,3.8722,-9.8826,9.8959,30.4022,22.9473,899
-0.5984,-9.7587,12.4416,16.1083,-9.7587,8.9645,23.6871,13.8642,900
-16.9247,-9.8428,2.9115,17.3455,-9.8428,13.5912,29.0634,22.0653,901
-4.3494,-9.894,0.8264,3.2112,-9.894,4.9884,22.4624,17.6039,902
-6.0126,-9.9178,1.0992,4.678,-9.9178,2.8813,14.958,13.458,903
4.0532,-9.8311,21.1712,9.9541,-9.8311,17.4386,34.965,30.3772,904
-4.8003,-9.9378,-0.4818,3.1021,-9.9378,0.9938,41.4344,22.4504,905
-15.5596,-9.8848,14.6738,21.5584,-9.8848,14.6057,39.8456,27.209,907
-1.3982,-9.816,3.7124,4.4594,-9.816,3.9461,14.8489,11.1621,908
-6.5823,-9.9261,-1.4327,2.1698,-9.9261,2.9282,9.3103,4.9215,909
-14.7114,-9.8817,-2.4005,6.3819,-9.8817,5.9306,19.6452,7.8711,910
-7.5581,-9.8216,2.362,6.0636,-9.8216,5.8144,24.8754,20.8851,911
-8.7377,-9.9474,3.0663,9.7596,-9.9474,5.5775,19.1593,12.6061,912
-4.8632,-9.7833,0.1456,3.2286,-9.7833,3.7595,13.0751,11.9221,913
-5.9718,-9.9139,1.6881,4.6422,-9.9139,3.0033,14.0642,13.1039,914
-21.6786,-9.9088,-5.5673,8.4086,-9.9088,6.1833,21.79,15.4344,915
-10.3578,-9.8498,1.1608,4.6412,-9.8498,4.0962,20.6788,12.4664,916
-8.3546,-9.7775,1.2565,4.4061,-9.7775,4.3396,10.061,6.9097,917
-0.5065,-9.6968,-0.0734,0.2984,-9.6968,2.6606,8.5023,6.4435,918
-7.3323,-9.8497,5.5153,9.9621,-9.8497,7.9009,25.2134,18.0995,919
-8.9668,-9.8158,9.0184,13.9098,-9.8158,12.4738,30.0988,16.2958,920
-1.0182,-9.6734,1.0963,2.2306,-9.6734,3.8603,14.7542,7.5678,921
-27.1992,-9.8391,14.9729,23.8582,-9.8391,23.0109,45.1663,28.4665,922
-2.275,-9.7299,11.1236,9.8999,-9.7299,6.7426,31.5351,27.418,923
-5.6593,-9.5123,40.0293,26.5156,-9.5123,12.9006,60.606,48.8223,924
-20.0164,-10.0298,8.3628,15.0749,-10.0298,15.0057,31.6825,28.4664,926
-3.769,-9.8516,17.7861,16.2077,-9.8516,10.9781,33.4311,26.5358,927
-20.8442,-9.894,-7.3167,9.2857,-9.894,2.2533,23.7693,21.9256,928
-1.2076,-9.7458,24.8792,21.972,-9.7458,7.4873,24.4593,20.1787,929
-3.5834,-9.7671,0.3695,2.4315,-9.7671,0.9544,12.8491,10.3776,930
-2.6087,-9.6172,2.1989,3.7409,-9.6172,2.6145,11.2105,8.2264,931
-8.0466,-9.7891,-1.4492,3.3656,-9.7891,2.3138,16.5877,11.6264,932
-7.3921,-9.6884,-1.6545,3.5111,-9.6884,2.4374,12.1639,6.7057,933
-2.4289,-9.7441,0.776,2.7399,-9.7441,3.051,9.6239,8.4891,934
-10.4203,-9.794,1.5176,6.5892,-9.794,3.8428,21.8602,11.0984,936
-13.1383,-9.8248,0.9203,6.8612,-9.8248,3.6769,17.5182,15.1056,937
0.5593,-9.8196,3.6024,2.3726,-9.8196,1.8228,11.1233,6.6983,938
0.0224,-9.8515,1.0059,0.7345,-9.8515,0.8437,5.1205,3.725,939
-2.1906,-8.8903,-0.3034,1.0131,-8.8903,1.5148,18.099,10.6313,940
-41.7791,-10.0003,9.2294,17.1519,-10.0003,14.4637,91.8346,29.3191,941
-9.714,-9.5789,27.5666,30.2858,-9.5789,2.5223,58.499,25.5773,942
-134.2442,-8.7994,-27.591,66.2861,-8.7994,8.1438,41.294,29.8632,943
-4.3476,-9.8529,15.0828,13.6155,-9.8529,10.3786,54.1693,21.3236,944
-5.3969,-9.4772,4.95,10.1388,-9.4772,2.1852,32.5265,13.3202,945
-40.8482,-9.7786,0.8798,8.7419,-9.7786,5.4623,17.9447,6.5527,947
-0.64,-9.7445,-0.2154,0.3118,-9.7445,1.4945,9.3737,7.6986,948
-20.5854,-9.8122,-4.6941,8.0336,-9.8122,4.1358,18.7398,12.0637,949
-39.7213,-9.809,-2.9421,9.6508,-9.809,7.7202,19.0913,8.46,950
-22.8646,-9.7275,-4.5307,7.5626,-9.7275,5.1264,12.1735,7.6539,951
-16.2718,-8.7457,-0.7539,7.4866,-8.7457,7.4943,40.6222,18.0297,953
-33.4361,-8.6473,1.3877,17.5169,-8.6473,2.9804,22.8196,11.1563,954
4.2031,-9.88,18.2965,10.4902,-9.88,9.3517,63.1342,26.7339,955
-3.8706,-9.6524,4.3465,5.1685,-9.6524,5.1607,30.3033,16.5177,956
-12.9606,-9.7811,0.6426,9.8028,-9.7811,2.943,22.8476,15.7163,957
-19.5818,-10.1225,0.1352,11.0092,-10.1225,13.6257,46.4837,28.1686,959
-72.2581,-10.7213,45.7504,75.975,-10.7213,21.7918,83.9343,41.6194,960
-4.2988,-9.5956,1.9131,3.2924,-9.5956,3.6179,16.7999,12.1154,961
2.1329,-10.0859,11.3451,6.4579,-10.0859,3.1338,27.5884,16.6276,962
-6.8867,-9.7608,-1.5838,2.1078,-9.7608,4.1972,12.9171,6.5889,963
-4.2318,-9.6596,-0.5569,1.6694,-9.6596,2.6961,7.9077,5.3601,964
-7.2738,-9.6898,-0.8962,4.2763,-9.6898,2.6919,14.9389,8.0927,965
-18.5263,-9.7119,6.8877,21.9085,-9.7119,13.2051,38.9787,18.3098,967
-11.7587,-9.7653,-1.5774,5.2696,-9.7653,6.1183,20.9249,12.0793,968
-1.7309,-10.3418,2.4868,3.4502,-10.3418,5.1799,32.6909,21.2023,969
-14.1029,-9.9172,-4.3793,6.069,-9.9172,5.0546,26.7199,16.4211,970
-3.178,-9.7427,-1.1048,1.27,-9.7427,1.4783,20.7523,16.5467,971
-33.0164,-9.6986,7.2828,25.8942,-9.6986,2.2326,31.742,22.0228,972
-21.4229,-9.7865,28.8932,34.4145,-9.7865,18.8142,50.7942,28.9004,974
-9.3754,-9.7669,1.1827,5.4988,-9.7669,5.516,32.7676,11.6119,975
-8.8756,-9.7881,8.966,14.6725,-9.7881,5.1436,27.0537,23.9338,976
-4.0531,-9.6866,-0.8497,1.4072,-9.6866,1.5161,7.4905,4.1505,977
-12.6993,-9.6471,-5.2345,5.0347,-9.6471,2.5512,20.9232,12.4587,978
-23.0142,-9.6972,1.0994,15.8228,-9.6972,10.5977,20.7137,12.3739,979
-22.095,-9.7106,16.988,30.5735,-9.7106,4.1107,30.8739,24.9359,980
-1.1687,-10.3131,30.7988,28.2303,-10.3131,17.4075,67.8821,57.3313,981
-8.2949,-9.7996,12.0841,14.6079,-9.7996,11.2489,30.9327,24.3418,982
-94.8978,-9.7277,2.3941,29.9864,-9.7277,14.7796,34.4577,20.2418,983
-11.139,-9.8471,7.101,13.112,-9.8471,7.5431,46.9863,22.4525,984
-1.3742,-9.7397,21.2027,23.9919,-9.7397,17.0504,54.5227,29.2848,986
-27.5769,-9.6844,3.7069,11.7257,-9.6844,12.8066,30.6137,18.4607,988
-11.314,-9.7626,5.376,19.8923,-9.7626,13.3793,34.6838,15.7453,989
-15.8536,-10.0045,-1.1555,9.2913,-10.0045,7.1924,34.0253,31.5807,990
-12.7583,-9.6766,-2.4679,4.6913,-9.6766,3.9806,19.5324,7.0106,991
-13.7117,-9.8545,2.0154,7.169,-9.8545,9.9083,26.1108,14.6439,993
-4.6674,-9.7353,-0.8652,1.5724,-9.7353,2.9457,16.8014,13.9835,994
-6.1401,-9.5075,5.1941,6.6428,-9.5075,2.0009,24.9953,16.1645,995
-6.3517,-9.7994,0.7622,3.656,-9.7994,1.3312,27.4781,24.8559,996
-11.3901,-9.9124,5.5803,10.2642,-9.9124,10.2348,52.0127,25.6802,998
-4.2085,-9.7634,1.5788,4.9305,-9.7634,4.7243,22.4262,12.0091,999
-9.3839,-9.4617,2.4609,6.7735,-9.4617,2.3559,20.4397,18.7017,1000
-3.3869,-9.7032,5.523,6.9203,-9.7032,6.8772,18.1723,14.0779,1001
-14.7877,-9.6434,6.8217,13.5528,-9.6434,9.0112,32.2716,14.8034,1003
-8.0476,-9.9427,12.1254,14.559,-9.9427,13.3277,33.5322,24.032,1004
-12.5574,-9.5143,67.019,67.7915,-9.5143,20.7125,48.4187,39.5861,1005
-6.9455,-9.5127,3.0323,7.8789,-9.5127,7.9594,26.019,9.7855,1006
-20.2964,-9.8278,27.9741,32.8806,-9.8278,16.8103,42.6181,28.36,1008
-11.1602,-9.0781,11.137,17.2023,-9.0781,7.6531,22.7739,16.2162,1009
-17.1797,-9.7921,24.2226,32.4451,-9.7921,14.1838,37.4442,23.4436,1010
-76.9442,-9.9842,-3.6482,27.5296,-9.9842,12.3932,28.176,12.8563,1011
-45.5601,-10.0969,26.5989,41.3863,-10.0969,19.8482,39.7639,26.0022,1013
-8.6387,-9.6765,12.6021,14.4012,-9.6765,9.4114,18.3291,13.8342,1014
-18.4092,-10.1094,13.4534,29.7514,-10.1094,3.8372,25.2138,17.7538,1015
-39.6384,-9.4814,12.9064,22.8938,-9.4814,13.1708,37.0094,24.2187,1016
-69.8966,-8.814,11.4349,37.2888,-8.814,15.139,39.7258,28.2819,1017
-22.9468,-9.8125,34.4452,34.1074,-9.8125,15.5108,43.5978,28.1152,1018
-28.7464,-9.7986,22.0355,37.1418,-9.7986,15.6484,48.3873,27.5713,1019
-15.7925,-9.9403,7.6381,14.5923,-9.9403,5.2508,21.358,18.8745,1020
-12.051,-9.7686,7.5145,10.4003,-9.7686,10.2379,29.4215,17.759,1021
-26.1778,-10.0068,19.564,42.4266,-10.0068,17.1697,48.4185,25.741,1023
-15.3217,-9.7276,5.4714,14.5473,-9.7276,8.5207,28.092,11.1609,1024
-15.0109,-9.6847,7.031,17.7734,-9.6847,5.017,25.8326,13.9215,1025
-16.4873,-9.7249,0.3942,9.0013,-9.7249,6.683,19.3094,10.846,1026
-25.3357,-9.7885,-0.1105,10.3463,-9.7885,7.4811,27.9623,12.1563,1028
-6.5173,-9.7835,6.3063,10.1143,-9.7835,8.5289,24.4987,14.2019,1029
-1.1919,-9.7393,2.4086,3.1938,-9.7393,3.5433,17.273,13.3687,1030
-22.1689,-10.5725,26.0915,35.156,-10.5725,13.4903,37.5001,25.6528,1031
-6.3276,-9.7859,11.7292,24.2785,-9.7859,11.0945,27.4497,21.2779,1032
-59.7146,-9.8326,7.3555,22.5298,-9.8326,11.9864,45.0794,16.2154,1033
-8.6733,-9.8393,12.797,15.8637,-9.8393,17.6585,31.9863,27.1378,1034
-10.8589,-10.0387,4.8916,9.191,-10.0387,10.0629,44.0395,27.7156,1035
-13.8762,-9.958,5.5821,10.6013,-9.958,9.4335,36.9154,23.3971,1036
-1.0246,-10.0675,16.1941,13.5002,-10.0675,13.2726,38.0687,27.4894,1037
-31.8962,-9.8755,5.9649,21.7596,-9.8755,12.2877,36.3076,20.8657,1038
-46.1026,-9.7812,-3.5985,15.2442,-9.7812,8.5341,29.6274,11.5337,1039
-6.4848,-9.9009,0.4815,5.7385,-9.9009,3.4174,19.5021,13.9884,1040
-22.0379,-9.808,-6.8866,7.7238,-9.808,2.5149,15.5021,10.8299,1041
-37.2626,-9.7855,-12.0272,14.0763,-9.7855,5.9773,20.883,12.4165,1042
-4.8434,-10.1191,-0.213,2.6211,-10.1191,5.2689,38.0242,34.6344,1043
-0.1982,-9.9685,0.0691,0.2498,-9.9685,1.0487,22.372,18.811,1044
-81.8586,-9.9636,4.3754,47.9062,-9.9636,7.785,62.8439,51.7729,1045
-67.8609,-9.8894,17.2287,38.0569,-9.8894,11.9182,50.8629,34.9378,1046
-24.9641,-9.7661,4.4785,11.0811,-9.7661,8.3864,25.1404,12.549,1048
-12.4349,-9.9079,0.5062,6.2897,-9.9079,2.8082,20.3377,11.2367,1049
-0.522,-10.361,12.4931,15.6511,-10.361,8.571,33.3805,22.476,1050
-7.3256,-9.4089,2.38,8.3886,-9.4089,7.0684,25.2928,13.3142,1051
-30.5858,-9.7632,7.0216,22.975,-9.7632,13.7813,28.7874,17.2272,1053
-14.5682,-9.7936,-2.1631,5.7038,-9.7936,3.8153,24.3316,13.2983,1054
-12.7338,-8.8178,-3.6135,5.5997,-8.8178,3.9119,16.9244,14.6886,1055
-13.1696,-9.8261,4.5908,18.9127,-9.8261,8.3306,29.7181,14.3465,1056
-36.5889,-9.7239,7.8597,19.6314,-9.7239,13.2643,28.6239,18.6965,1058
-12.168,-10.0137,2.3705,8.6027,-10.0137,7.2429,26.1863,17.935,1059
-12.9445,-9.7408,3.2427,10.3343,-9.7408,8.7865,20.2656,13.3526,1060
-21.7108,-10.0369,5.4067,12.8906,-10.0369,9.6584,22.7494,16.8308,1061
-26.4646,-9.7405,10.2263,22.3083,-9.7405,14.6462,41.573,20.4064,1063
-28.7736,-10.487,-7.7331,12.1517,-10.487,6.11,17.2768,10.9368,1064
-11.2252,-9.7996,0.7817,8.4444,-9.7996,6.8551,23.7382,12.3716,1066
-23.3632,-9.669,-1.2763,8.1082,-9.669,8.3095,33.6571,9.7366,1067
-28.3719,-9.8374,12.4526,18.2099,-9.8374,15.9772,37.9763,22.2016,1068
-17.0985,-8.7561,14.2428,25.4255,-8.7561,10.2808,35.9529,17.5742,1069
-12.288,-9.7792,15.5712,19.6148,-9.7792,14.7141,25.6025,19.741,1070
-7.4932,-9.7933,19.5464,31.4414,-9.7933,11.7709,34.6179,24.7729,1071
-16.1529,-9.648,6.1962,12.8273,-9.648,5.7516,38.5574,10.4072,1073
-9.0884,-9.54,3.2642,8.8227,-9.54,4.4932,20.8266,12.4519,1074
-2.8207,-9.7576,10.0038,9.5667,-9.7576,2.8776,20.7552,14.074,1075
-2.9463,-9.3237,2.3579,4.2916,-9.3237,2.7719,13.9788,12.0028,1076
-15.1974,-9.5144,-6.0326,5.2533,-9.5144,3.1109,27.479,23.7137,1077
-6.0194,-10.0015,1.093,3.9122,-10.0015,5.1489,30.4981,24.6915,1078
-77.3713,-10.2535,9.7733,27.6516,-10.2535,12.7868,79.2419,38.0401,1079
-234.1099,-9.3915,-58.1976,75.5461,-9.3915,10.9173,39.5758,23.5613,1080
-0.0528,-9.2578,122.424,170.3587,-9.2578,27.5381,159.1673,52.8565,1081
-42.1977,-9.7647,10.9146,22.7162,-9.7647,9.4706,71.6377,38.749,1083
-9.7915,-9.7731,1.1801,4.7496,-9.7731,4.5393,22.8916,10.4322,1084
-4.9151,-9.8198,5.8567,14.3583,-9.8198,6.3344,31.7803,28.7808,1085
-29.3482,-9.6495,0.3892,15.4313,-9.6495,9.7236,56.6508,27.5213,1086
-39.6457,-9.9211,6.0933,22.4577,-9.9211,13.2458,42.8818,28.7555,1088
-46.4503,-9.8799,-1.8808,22.9668,-9.8799,9.4717,45.3397,24.3009,1089
-52.4163,-10.0641,-1.768,33.7653,-10.0641,6.4341,33.9056,22.9449,1090
-42.6553,-9.4652,-5.2484,18.0671,-9.4652,5.2835,28.3281,13.2891,1091
-14.2102,-9.6222,2.7864,7.3691,-9.6222,7.1334,13.4763,9.2373,1092
-34.2881,-9.7992,-3.2539,10.2899,-9.7992,6.7685,17.5663,12.6847,1093
-4.1717,-9.7188,22.8533,23.0847,-9.7188,12.8667,30.2144,20.6991,1094
-0.1245,-9.8192,12.2111,11.7898,-9.8192,7.9345,31.1722,19.0451,1095
-1.0324,-9.9585,30.2145,18.9993,-9.9585,11.2863,39.188,23.3495,1096
-25.0402,-10.1207,2.8946,15.7615,-10.1207,14.2365,27.952,24.4616,1097
-44.3122,-9.8571,19.9698,57.3598,-9.8571,25.1504,68.3754,24.425,1098
-35.9691,-9.7902,-1.6433,16.8959,-9.7902,10.2997,45.5429,18.6017,1099
-31.9707,-9.6626,-7.4013,13.5922,-9.6626,9.4105,23.8807,9.1519,1100
-3.4053,-9.7831,3.8036,4.6318,-9.7831,3.8991,22.1812,17.2736,1101
-18.0091,-9.8212,30.8051,53.2298,-9.8212,19.7155,54.9972,39.2687,1102
-16.6222,-9.7771,10.1548,14.8554,-9.7771,15.3219,31.6307,21.6094,1103
-2.8553,-9.8373,7.872,8.9358,-9.8373,9.1103,17.4015,15.1228,1104
-4.2553,-9.3161,25.3607,24.0216,-9.3161,15.2711,48.3665,26.824,1105
-8.7364,-9.8609,3.5278,10.6343,-9.8609,3.8781,47.8153,18.569,1106
-15.5533,-9.8119,30.7123,64.5064,-9.8119,20.0849,71.6399,20.1595,1108
-6.2623,-10.0027,6.1712,11.7885,-10.0027,10.9673,54.5058,32.4565,1109
-28.4754,-9.8967,-2.7781,13.0791,-9.8967,8.2397,31.6285,21.6276,1110
-7.2183,-9.7362,7.5303,15.9777,-9.7362,6.4706,16.4067,8.0756,1111
-54.06,-9.9111,11.4562,28.6672,-9.9111,16.9998,73.1717,24.8904,1113
-19.3583,-9.763,36.739,53.2307,-9.763,17.3542,32.0178,26.4808,1114
-16.4937,-9.2482,96.4718,96.5107,-9.2482,9.5634,60.7035,43.0173,1115
-14.0814,-9.8039,4.4695,16.6663,-9.8039,4.812,31.1479,18.8463,1116
-15.5796,-9.8036,4.9412,9.7173,-9.8036,9.2935,28.7768,17.2944,1118
-1.128,-9.7521,1.7377,1.8977,-9.7521,3.0991,25.3978,15.105,1119
-29.1038,-9.8494,4.5933,14.4671,-9.8494,8.0783,41.8788,17.6918,1120
-18.6153,-9.9152,10.8371,25.3064,-9.9152,15.3194,42.2609,23.5336,1121
-12.794,-9.8194,14.2676,24.4069,-9.8194,11.6994,65.7733,18.3326,1123
-13.4863,-9.7818,3.0405,10.5853,-9.7818,8.462,25.9425,16.5836,1124
-10.8253,-9.7257,1.901,5.2737,-9.7257,3.876,26.1741,9.439,1126
-17.7035,-9.7977,13.5422,17.1844,-9.7977,12.5459,42.5985,24.4336,1128
-17.6548,-9.7514,4.4,8.484,-9.7514,8.8431,20.1096,11.7946,1129
-15.8577,-9.979,-1.757,11.5852,-9.979,6.3756,42.3043,34.9059,1130
-87.5371,-9.8409,-6.0353,26.399,-9.8409,10.085,30.84,12.6635,1131
-19.0465,-9.785,12.348,25.8534,-9.785,12.978,43.8777,13.8212,1133
-5.6588,-9.725,0.3737,2.9946,-9.725,1.9712,8.8858,4.7894,1134
-1.3268,-9.7554,-0.177,0.881,-9.7554,0.4794,10.2404,6.1117,1135
-2.6442,-9.7956,5.0327,6.3555,-9.7956,6.5851,14.5782,11.9748,1136
-12.3831,-9.8712,1.6463,9.6716,-9.8712,5.9901,19.6964,11.2975,1138
-5.3774,-9.715,0.1569,2.5646,-9.715,2.0625,8.4655,7.2874,1139
-7.0035,-9.8312,3.585,9.6437,-9.8312,0.461,13.8227,13.1987,1140
-18.174,-9.784,1.3089,15.8212,-9.784,10.2798,27.2413,20.4741,1141
-12.1638,-9.817,6.4418,12.5382,-9.817,8.6752,28.0141,11.7454,1143
-0.7391,-9.7762,1.6409,2.428,-9.7762,3.09,10.3197,6.0221,1144
-7.501,-9.1528,0.8888,6.0342,-9.1528,10.2172,27.0993,9.6641,1145
-114.1506,-9.757,5.9371,54.9912,-9.757,9.5591,34.468,16.7426,1146
-95.8565,-9.9098,2.5781,44.0769,-9.9098,14.1885,56.8228,23.0837,1148
-111.7742,-9.5548,-4.1798,35.3379,-9.5548,6.6541,37.7357,17.6411,1149
-12.1152,-9.6148,4.1498,14.3737,-9.6148,6.0522,20.4342,9.8306,1150
-77.4186,-9.8747,-6.7225,28.3675,-9.8747,9.3793,37.1934,15.3765,1151
-194.7584,-10.2017,-27.785,81.2657,-10.2017,9.4364,26.5663,20.1186,1152
-57.3329,-9.3879,0.2602,36.6238,-9.3879,17.3602,40.4035,19.5464,1153
-113.7571,-9.9145,-5.4306,43.2736,-9.9145,13.6146,41.4257,20.1197,1154
3.2922,-10.5059,41.1613,42.9156,-10.5059,26.9074,54.2387,43.8369,1155
-149.3495,-9.7874,-18.1183,58.4634,-9.7874,8.3563,25.4284,18.9652,1156
-59.8502,-10.0106,-8.3826,25.1187,-10.0106,8.7143,18.5677,12.6518,1157
-5.3135,-9.8569,6.5874,6.7216,-9.8569,7.0612,20.7234,11.5826,1158
-2.8064,-9.7334,5.0568,6.5641,-9.7334,7.8336,15.8957,11.9114,1159
-0.5109,-10.1299,6.6917,6.1601,-10.1299,6.4273,14.8642,10.4411,1160
-3.7549,-9.4762,-0.6473,1.8469,-9.4762,4.2287,14.9382,7.7182,1161
-0.4166,-9.9674,-0.073,0.2278,-9.9674,0.51,5.9271,3.3539,1162
-3.744,-10.1793,-0.3879,1.7094,-10.1793,2.5367,10.1317,6.0989,1163
-13.6699,-10.1326,4.3541,9.5083,-10.1326,8.9383,32.4122,18.1403,1164
-6.0435,-9.4415,11.8304,15.4898,-9.4415,15.7939,37.1935,17.7742,1165
-19.4166,-9.89,12.2946,19.8622,-9.89,14.2254,48.8372,36.0429,1166
-15.3132,-9.7813,3.019,9.7486,-9.7813,11.0324,27.8077,18.6999,1168
0.2976,-9.5497,2.0955,1.3176,-9.5497,1.386,13.2215,9.8707,1169
-28.8216,-9.678,-0.0467,13.5774,-9.678,12.9099,25.684,13.7552,1170
-14.5962,-10.4281,1.5329,7.7198,-10.4281,1.9436,41.4876,34.4306,1171
-30.0284,-10.544,7.0416,17.3496,-10.544,13.1449,107.0136,52.9251,1173
-74.223,-9.7671,7.3171,56.9281,-9.7671,12.5155,71.6593,31.2224,1174
-24.5437,-11.0862,27.4534,39.5373,-11.0862,10.0774,64.9583,57.8085,1175
-24.2329,-9.761,-2.5148,10.0084,-9.761,14.1624,32.085,21.1348,1176
-95.4308,-9.771,60.8092,142.1288,-9.771,39.7291,116.3677,47.7763,1178
-51.0652,-10.2138,-3.7468,22.3223,-10.2138,19.1887,39.804,38.0304,1179
-6.6482,-9.892,12.3267,19.4331,-9.892,13.6551,29.4347,25.1386,1180
-10.9332,-9.8982,-0.9591,4.7176,-9.8982,6.59,23.7244,11.9653,1181
-31.082,-9.8909,17.6674,37.5082,-9.8909,24.5899,61.1156,31.2949,1183
-2.514,-9.7229,-0.2727,1.0805,-9.7229,1.9677,17.5652,9.1088,1184
-7.8943,-9.7407,6.1859,13.454,-9.7407,2.6446,14.2059,11.2695,1185
-14.6974,-9.6125,0.6948,6.2073,-9.6125,3.485,13.9027,8.0845,1186
-14.1204,-9.8074,14.4906,35.7468,-9.8074,14.2598,56.1897,15.2382,1188
-8.1875,-10.1231,1.8881,11.5835,-10.1231,9.2479,19.2461,15.991,1189
-0.0766,-9.7673,2.0647,1.735,-9.7673,2.3134,14.9947,11.6509,1190
-15.1631,-9.8299,13.411,19.291,-9.8299,10.3208,32.7828,25.6978,1191
-5.1294,-9.7662,3.802,6.6344,-9.7662,6.9606,18.1349,10.3929,1193
-8.6517,-9.9086,1.7123,9.4943,-9.9086,5.1028,14.7354,10.2191,1194
-1.7177,-9.7043,10.4919,13.154,-9.7043,4.4256,19.702,18.3294,1195
-3.078,-9.8594,0.403,1.6173,-9.8594,5.6168,14.6546,9.2465,1196
-9.8978,-9.7684,1.9162,4.1135,-9.7684,5.1766,14.0865,7.5373,1198
-5.9328,-9.9465,0.9353,3.57,-9.9465,4.244,17.0368,9.4977,1199
-1.3352,-9.4834,4.4159,4.3864,-9.4834,1.9397,16.1311,8.8616,1200
-6.4821,-9.724,4.1073,4.8259,-9.724,10.7332,22.5942,14.6021,1201
-7.6724,-9.7106,-0.183,3.1565,-9.7106,5.9137,12.2348,9.3046,1203
-4.4427,-9.8176,-0.4413,2.0621,-9.8176,4.2675,15.298,9.6506,1204
-2.4368,-9.7793,-0.1075,1.2032,-9.7793,1.9338,6.6538,3.7121,1205
-3.4202,-9.8415,1.7516,3.226,-9.8415,4.4489,14.669,10.4402,1206
-5.1479,-9.7755,3.8867,6.8037,-9.7755,5.2397,21.6847,11.7343,1207
-6.3134,-9.7441,1.1899,3.5833,-9.7441,6.0445,22.369,8.5761,1208
-11.8878,-9.7213,-0.2899,3.8374,-9.7213,4.5342,22.8717,10.6387,1209
-5.249,-9.8575,6.9618,9.4088,-9.8575,7.8618,27.2151,21.987,1210
-2.0865,-9.7386,3.4898,5.0447,-9.7386,5.2913,21.5427,10.3899,1211
-9.1981,-9.9135,1.0056,5.723,-9.9135,4.6499,25.1696,8.3955,1213
-14.9519,-9.8372,12.3042,18.9221,-9.8372,15.7446,43.9749,26.6568,1214
-37.6309,-10.1796,3.7561,28.9935,-10.1796,14.7463,81.9802,76.7026,1215
-12.2334,-9.8132,3.9173,13.1174,-9.8132,11.5024,30.8898,20.858,1216
-0.7182,-9.7137,1.3744,1.3502,-9.7137,3.0359,18.295,10.4802,1217
-23.7795,-9.8076,-2.0251,7.5681,-9.8076,6.1473,33.4052,16.7236,1218
-40.3848,-9.7394,-0.0249,12.4303,-9.7394,8.5239,21.9692,11.5285,1219
-26.022,-10.049,15.688,26.2359,-10.049,8.9021,36.9756,24.1452,1220
-11.4593,-9.6605,17.4642,21.1267,-9.6605,5.7344,32.5413,28.0707,1221
7.0486,-9.714,11.2039,3.1284,-9.714,1.3368,16.3251,15.8694,1222
-97.8822,-10.0989,36.5348,85.5917,-10.0989,39.8307,90.0846,61.9592,1223
-16.5111,-10.0041,19.4159,28.152,-10.0041,27.8954,90.9337,32.3983,1224
-0.3638,-9.6691,4.0025,3.8382,-9.6691,4.6626,17.4694,10.5862,1225
-8.1925,-9.6133,-0.8959,3.489,-9.6133,3.7648,15.7901,14.072,1226
-9.2917,-9.8897,20.9438,26.3528,-9.8897,23.8119,44.7686,32.2251,1227
-43.6227,-9.702,2.9471,13.1026,-9.702,14.1556,33.7124,17.4292,1228
2.0776,-10.0689,37.9623,27.175,-10.0689,15.3134,39.8181,31.4895,1229
1.6808,-9.706,21.2797,17.2044,-9.706,8.8425,22.1673,18.9328,1230
-4.3236,-9.632,8.2223,12.571,-9.632,15.025,28.1546,20.2941,1231
-27.0911,-9.776,6.178,19.6236,-9.776,16.907,39.3145,22.5722,1233
-9.8719,-10.0669,2.6969,11.3929,-10.0669,3.2373,21.509,15.0421,1234
-2.2355,-9.8607,0.7367,1.9425,-9.8607,1.4634,27.4758,11.7104,1235
-5.708,-8.6856,1.052,3.6835,-8.6856,4.8636,23.5096,6.6417,1236
-4.6181,-9.8766,-0.7309,1.68,-9.8766,2.2959,16.4031,6.2038,1238
0.0619,-9.6296,0.6034,0.3637,-9.6296,0.5322,6.8644,6.0416,1239
-6.6961,-9.7831,5.1777,8.8139,-9.7831,12.4103,28.0702,19.4774,1240
-6.3295,-9.8436,1.5751,3.7889,-9.8436,4.3999,21.8595,13.9563,1241
-8.7615,-9.7161,9.4059,18.2881,-9.7161,9.9164,39.721,12.805,1243
-8.8781,-9.766,-1.8455,3.0831,-9.766,1.9858,11.5946,9.1731,1244
-3.38,-10.4778,-0.9132,1.1951,-10.4778,2.15,8.0271,6.5375,1245
-4.3268,-10.1125,1.8694,4.6751,-10.1125,4.8347,12.3978,9.5076,1246
-5.9868,-9.813,0.186,2.3948,-9.813,4.8289,15.5357,6.8154,1248
-5.0545,-9.7225,-0.2348,2.386,-9.7225,1.2395,10.7476,7.1608,1249
-1.3032,-10.1198,-0.2451,0.7569,-10.1198,1.688,6.4814,4.1624,1250
-1.4346,-9.8021,-0.1238,0.3896,-9.8021,1.0006,5.9452,3.9938,1251
-4.2498,-9.8833,-0.8659,1.3209,-9.8833,3.1296,11.0266,6.168,1253
-2.6653,-9.84,-1.1146,0.9638,-9.84,0.75,8.8595,5.4764,1254
-1.3352,-9.6044,-0.0098,0.5957,-9.6044,0.9256,9.0083,5.6764,1255
-2.315,-9.7907,3.8483,3.5062,-9.7907,2.3538,13.0458,8.5832,1256
-14.1131,-9.6381,12.4812,21.148,-9.6381,11.8396,41.8511,27.424,1258
-4.2695,-9.9411,0.5826,3.267,-9.9411,5.9757,25.7131,18.3892,1259
-5.3128,-9.821,-0.4707,2.9036,-9.821,2.6309,27.2467,23.7774,1260
-3.7956,-10.3226,10.7158,8.6132,-10.3226,2.4863,58.1356,29.7207,1261
-40.6799,-10.0366,13.4581,26.4436,-10.0366,13.5887,134.7685,44.1781,1263
0.9865,-9.8951,6.3627,5.0004,-9.8951,7.6644,18.7282,15.256,1264
-4.0678,-9.4886,1.1798,4.4078,-9.4886,0.3699,25.5167,22.0429,1265
-5.7817,-9.9758,6.8326,7.5161,-9.9758,5.0144,44.9349,35.4112,1266
-12.0634,-9.7216,1.7111,7.5959,-9.7216,5.3419,23.5876,16.7996,1268
-6.3847,-10.0839,3.5861,6.5983,-10.0839,7.0237,53.7302,31.9076,1269
-1.5889,-10.1478,7.4924,10.6773,-10.1478,3.7083,46.2294,44.1752,1270
-28.3432,-9.4227,4.4471,22.312,-9.4227,14.1715,31.4834,17.368,1271
-20.1018,-9.9747,0.1795,7.9763,-9.9747,7.6991,58.9279,38.0766,1273
-17.3827,-9.7214,-1.0282,4.7318,-9.7214,5.463,30.5191,16.4582,1274
-11.6709,-9.6321,-0.216,4.4089,-9.6321,1.8093,18.2649,9.4066,1275
-7.5137,-9.6578,0.1128,3.2437,-9.6578,5.7684,22.0449,9.5081,1276
-8.9157,-9.7113,5.902,11.0558,-9.7113,3.0202,37.8577,22.5093,1277
-0.5438,-9.7758,1.0662,1.4153,-9.7758,1.9516,11.0345,7.1283,1278
-4.9661,-9.7948,0.1781,1.6557,-9.7948,3.2808,15.9307,11.4382,1279
-2.1931,-10.0363,1.2712,2.0286,-10.0363,0.7864,27.4403,23.5939,1280
-8.5013,-9.4132,12.7369,12.1944,-9.4132,1.2794,44.0915,32.3947,1281
-2.4164,-9.911,1.8793,3.2409,-9.911,2.2982,16.7029,11.0018,1282
-3.456,-9.8164,1.1717,2.9086,-9.8164,3.5529,12.7781,9.5757,1283
-8.3575,-9.6976,2.4068,6.0206,-9.6976,4.5077,16.2754,8.1422,1284
-2.0205,-9.9391,2.2409,3.0144,-9.9391,6.0408,23.3281,20.6828,1285
-2.6705,-9.8859,0.5584,1.9222,-9.8859,2.4884,25.0953,22.57,1286
-4.3442,-10.1643,-0.0157,2.1424,-10.1643,2.4614,15.8151,11.9928,1287
-37.3735,-9.537,21.7285,37.9188,-9.537,23.3494,90.7938,54.9497,1288
-33.1849,-8.783,17.9969,46.8056,-8.783,19.7894,44.8774,32.6233,1289
-23.7015,-9.4588,72.318,60.7202,-9.4588,4.2087,85.1576,71.0573,1290
-13.2201,-6.007,4.5782,11.028,-6.007,9.9304,49.9587,27.1097,1291
-24.6701,-9.835,1.4049,8.4311,-9.835,7.5321,37.8249,18.945,1293
-18.9911,-9.5667,19.2285,21.7474,-9.5667,3.758,28.9163,23.2173,1294
-1.906,-9.5013,-0.475,0.8751,-9.5013,3.4495,7.8448,7.1816,1295
-22.3608,-9.3933,49.7601,45.6792,-9.3933,14.752,61.4535,54.0507,1296
-11.6386,-9.8996,9.3822,20.4796,-9.8996,13.8847,52.8519,19.4912,1298
-3.8396,-10.0641,0.011,2.3001,-10.0641,1.7195,7.4154,6.7547,1299
-8.7987,-10.0699,0.0552,4.2348,-10.0699,7.1635,20.4802,17.2416,1300
-14.8403,-9.5504,22.3877,33.1261,-9.5504,11.2968,40.9082,28.9325,1301
-42.3311,-9.7574,2.3201,18.5042,-9.7574,8.7995,33.9727,16.8763,1303
-12.6548,-9.8305,1.5068,7.7788,-9.8305,10.1477,17.7329,12.9053,1304
-9.9394,-9.6985,14.8979,22.45,-9.6985,19.3126,38.5271,23.2859,1306
-10.3751,-9.8173,1.9039,5.725,-9.8173,8.8076,20.7625,11.5964,1308
-13.9767,-9.6841,1.8066,7.21,-9.6841,9.3231,19.6875,15.8849,1309
-39.3814,-9.6254,0.2756,13.965,-9.6254,8.6963,23.9583,11.8885,1310
-24.6464,-9.8125,1.2518,8.2466,-9.8125,8.0909,18.7942,11.3754,1311
-15.3309,-9.7623,1.5256,6.8946,-9.7623,7.7634,15.2037,9.7277,1313
-1.3784,-9.8424,2.17,4.8864,-9.8424,4.39,12.1162,6.5945,1314
-1.767,-9.6686,9.7187,9.6359,-9.6686,7.9945,16.4812,12.6747,1315
-7.5559,-9.7175,5.9924,9.1094,-9.7175,10.5877,23.2236,17.9835,1316
-8.8108,-9.9412,4.3023,12.6307,-9.9412,5.0741,19.4377,18.0487,1317
-2.7647,-9.6104,2.2694,3.9727,-9.6104,6.2457,16.8368,12.4966,1318
-3.981,-9.8843,-0.4866,1.5459,-9.8843,2.9632,10.3928,9.5966,1319
-3.9758,-10.5087,-0.0694,2.3485,-10.5087,4.8277,13.0855,10.2642,1320
-7.5607,-10.0805,0.709,8.5734,-10.0805,4.8337,41.9471,31.0603,1321
-43.0546,-10.7454,3.4179,22.0926,-10.7454,13.669,98.0787,66.2523,1323
-2.7647,-8.9681,33.8874,19.5352,-8.9681,12.3214,61.1077,36.0569,1324
-44.5647,-11.0868,55.2885,54.5838,-11.0868,19.6767,91.9095,73.59,1325
-22.5986,-9.8999,10.0098,18.264,-9.8999,8.2693,36.5585,27.9752,1326
-181.5525,-9.5027,-6.8344,66.3801,-9.5027,7.2452,109.2357,26.1455,1328
-37.3648,-9.2147,11.3329,24.3121,-9.2147,6.7016,13.9241,9.2521,1329
20.9633,-9.5258,35.4963,11.5093,-9.5258,5.2292,28.053,16.8945,1330
0.6047,-9.7393,6.3692,3.6847,-9.7393,3.7262,18.4516,16.6507,1331
-16.8464,-9.7867,2.1333,8.3487,-9.7867,10.4136,21.3877,11.6943,1333
-28.5177,-9.7381,-1.4975,9.3641,-9.7381,7.9562,14.203,9.617,1334
-38.1846,-9.7456,0.0089,15.9004,-9.7456,8.5327,23.4311,13.284,1335
-13.1499,-9.7337,-1.3136,4.8102,-9.7337,5.6148,11.8904,6.4579,1336
-39.1848,-9.7171,-7.9212,15.5644,-9.7171,12.463,52.9103,30.4295,1338
-14.3215,-9.6807,6.6264,15.7275,-9.6807,9.1843,26.6664,11.4705,1339
-35.7927,-9.7741,-16.2344,14.0095,-9.7741,9.0734,48.8875,14.5054,1340
-3.1977,-9.7721,-0.1098,2.1907,-9.7721,4.1097,9.222,6.1242,1341
0.3938,-9.7409,2.8624,1.9237,-9.7409,0.633,5.4062,4.5424,1342
-88.8707,-9.6158,-18.2946,23.8574,-9.6158,6.4141,25.5113,10.3149,1343
-68.5259,-9.435,13.176,33.6407,-9.435,9.8139,19.0536,12.0545,1344
-254.8736,-8.9933,77.6512,182.9077,-8.9933,25.7128,66.4165,34.9261,1345
-1.6184,-9.7875,-0.2892,1.0935,-9.7875,0.6804,5.9436,4.8802,1346
-8.7163,-9.7766,-1.3508,4.7298,-9.7766,3.9357,8.6197,3.6226,1347
-12.769,-9.8048,-0.766,6.6644,-9.8048,5.9517,15.3823,5.054,1348
-0.6114,-9.7986,0.3889,0.9777,-9.7986,1.9191,7.1056,2.7338,1349
-8.8148,-9.7722,0.6246,6.0055,-9.7722,3.7193,14.4401,3.7364,1350
0.082,-9.787,0.1409,0.0313,-9.787,0.0588,2.8172,2.7251,1351
0.1156,-9.7856,0.1416,0.0175,-9.7856,0.0308,2.7803,2.7336,1352
