AYGX_min,AZ_mean,AYGX_mean,AYGX_std,AZ_mean,GX_std,Gnorm_max,Gnorm_median,timestamp
0.5056,-9.6976,0.5169,0.006,-9.6976,0.0092,2.0809,2.0637,0
0.5061,-9.6972,0.5161,0.0068,-9.6972,0.0109,2.0734,2.0569,1
0.5004,-9.6977,0.518,0.0067,-9.6977,0.01,2.0832,2.0609,2
0.5108,-9.6977,0.5215,0.0059,-9.6977,0.0092,2.0816,2.0614,3
0.067,-9.7022,0.61,0.3004,-9.7022,0.5079,3.242,2.0718,4
-8.9186,-9.6336,-1.992,2.9643,-9.6336,2.075,9.4276,6.372,6
-9.7191,-9.7118,-2.2887,3.2837,-9.7118,3.6814,10.0791,5.4311,7
-6.3364,-9.6661,-0.498,2.7902,-9.6661,4.2604,11.4964,5.744,8
-35.617,-9.6216,0.8935,15.0492,-9.6216,10.5724,14.6938,11.848,9
-19.9134,-9.6807,-6.777,7.502,-9.6807,6.7942,13.9995,9.9171,10
-19.6407,-9.5754,-0.7422,11.0347,-9.5754,6.0104,11.4491,5.6716,11
-12.1584,-9.606,-1.3421,8.0208,-9.606,4.7214,8.8092,5.4663,12
-0.3478,-9.6426,12.0823,7.1934,-9.6426,6.2106,13.7278,12.4629,13
-3.1398,-9.7186,-0.7233,1.4272,-9.7186,2.7417,5.7698,2.831,14
-0.842,-9.7238,0.167,0.4004,-9.7238,1.6408,9.8681,3.7329,15
-5.7424,-9.7184,-2.9682,1.6519,-9.7184,1.9176,10.102,9.7703,16
-1.6102,-9.6818,1.6199,1.7109,-9.6818,3.9018,12.4784,6.7393,17
-24.3369,-9.6367,-10.9531,7.5981,-9.6367,3.9668,25.46,18.9539,18
-1.2987,-9.5288,4.6203,3.9799,-9.5288,2.0762,28.266,25.935,19
-11.9515,-9.6221,8.9082,10.5597,-9.6221,7.9481,31.4013,27.8524,20
-33.2541,-9.5984,-3.7423,21.4152,-9.5984,9.05,22.5478,18.7379,21
-11.9576,-9.6045,6.3735,7.0164,-9.6045,4.0892,10.5786,6.9088,22
-30.7888,-9.6367,-2.5432,17.5613,-9.6367,4.2212,22.0488,17.2111,23
-54.2111,-9.4561,-0.886,35.5762,-9.4561,3.0825,33.9639,32.843,24
4.4156,-9.629,13.9651,7.0138,-9.629,2.4883,15.1996,12.9478,25
-0.5179,-9.7104,-0.1275,0.249,-9.7104,0.6811,3.1383,2.3108,26
-23.9126,-9.6861,-3.292,6.6139,-9.6861,3.9023,12.6803,4.5068,27
-27.0485,-9.7016,2.1257,14.6799,-9.7016,5.7502,16.872,5.3623,28
-11.4346,-9.6658,-0.6193,4.8614,-9.6658,7.0044,13.8482,6.519,29
-2.8756,-9.6946,0.3495,2.9039,-9.6946,2.0311,8.6052,7.2796,30
-0.3902,-9.7006,0.1271,0.3811,-9.7006,1.3071,4.0507,2.1023,31
-1.8579,-9.7054,-0.3515,0.5038,-9.7054,0.8434,3.5352,2.5122,32
-0.0198,-9.6952,0.0837,0.0808,-9.6952,0.4928,3.3086,2.774,33
-2.4342,-9.6928,-0.1761,1.0465,-9.6928,2.3236,5.2916,2.5751,34
-4.4344,-9.7264,-0.9855,1.8889,-9.7264,1.1011,6.9124,5.9813,35
-39.7438,-9.7042,-0.2732,13.3025,-9.7042,7.3558,42.7703,8.2486,36
0.0463,-9.7504,1.4453,0.92,-9.7504,1.1163,7.8134,3.2953,37
-54.7209,-9.759,-2.9818,15.5965,-9.759,6.5233,20.581,7.9551,38
-9.5723,-9.7035,-1.5473,4.535,-9.7035,2.7736,10.3804,5.036,39
-15.0121,-9.7415,1.383,5.6902,-9.7415,5.1161,15.0807,9.1387,40
-24.3444,-9.7121,2.3253,9.8067,-9.7121,6.0339,22.8255,12.0893,41
-3.1043,-9.4967,3.1047,5.1669,-9.4967,5.5023,20.6541,9.6197,42
-3.2205,-9.652,-0.6912,1.747,-9.652,2.3618,10.975,10.0094,43
-17.9152,-9.7074,5.1471,18.7275,-9.7074,3.5213,19.7519,16.3716,44
-10.8429,-8.8303,8.2471,22.3191,-8.8303,8.6245,21.806,14.2208,45
-12.475,-9.6456,4.3152,8.0891,-9.6456,6.6296,33.8094,12.4447,46
-4.6361,-9.5381,-1.8114,1.8571,-9.5381,1.3778,44.1193,41.642,47
-86.7625,-9.24,-15.5156,32.8019,-9.24,8.596,52.419,45.3755,48
-31.764,-9.6374,7.5556,16.3766,-9.6374,10.458,39.8971,20.7255,49
-51.7225,-10.0614,6.5256,50.828,-10.0614,14.8554,44.9149,23.9642,50
-1.5253,-9.1708,11.3034,13.8898,-9.1708,7.137,45.4052,13.0456,51
-4.1725,-10.3021,0.0412,2.252,-10.3021,2.404,15.325,12.8266,52
-8.8384,-9.6836,1.6869,4.0813,-9.6836,6.4569,28.5535,15.954,53
-6.4544,-9.7594,0.3627,3.1079,-9.7594,5.4204,29.4464,18.0837,54
-2.2763,-9.6957,0.6615,1.0916,-9.6957,1.6574,22.5355,5.9592,55
-11.0071,-9.7552,-0.9039,4.9089,-9.7552,5.4077,27.3306,15.7697,56
-3.6365,-9.7376,1.415,4.027,-9.7376,4.7542,31.844,12.3838,57
-9.6624,-9.8951,1.0353,8.6336,-9.8951,3.6566,40.5639,31.4947,58
-2.5997,-9.7292,0.6357,1.8916,-9.7292,1.8669,8.7213,4.6952,59
-1.8292,-9.6443,1.4542,3.5226,-9.6443,2.2419,17.1362,12.7936,60
-6.2669,-9.7224,1.505,4.3208,-9.7224,4.6574,17.6704,12.4328,62
-5.4881,-9.6534,0.9875,6.0279,-9.6534,3.3702,18.02,9.5612,63
-13.8511,-9.7624,5.194,16.5802,-9.7624,12.4585,44.7105,31.2863,64
0.1673,-9.5503,8.5072,15.1243,-9.5503,6.7759,33.145,14.2552,65
-1.4728,-9.5821,2.399,3.9562,-9.5821,4.3679,29.6165,26.2466,66
-6.923,-8.3029,5.9618,7.0536,-8.3029,4.2672,21.3474,16.5269,67
-6.4602,-9.6658,5.9103,9.2225,-9.6658,9.5523,31.0738,18.9475,68
-10.4578,-9.6429,1.1319,5.3901,-9.6429,5.5373,24.4976,9.0763,69
-2.9719,-9.8258,1.1141,3.3958,-9.8258,1.6195,9.5167,6.4394,70
-2.6479,-9.4991,0.0095,1.3479,-9.4991,3.5224,11.3799,5.6918,71
-4.0955,-9.5128,5.9859,9.8097,-9.5128,2.8627,32.0653,16.7041,72
-2.5265,-9.5157,-0.091,2.2851,-9.5157,0.9508,9.9868,8.8113,73
-23.6883,-9.7605,3.6862,22.2861,-9.7605,9.782,23.3381,20.2818,74
-0.4107,-9.521,0.9734,1.3954,-9.521,3.5718,14.4066,5.4258,75
-4.3326,-9.8487,2.5235,5.738,-9.8487,5.9501,18.4874,12.9804,76
-3.4836,-9.7633,0.0605,1.6251,-9.7633,3.08,12.709,5.5194,78
-2.0254,-9.7837,1.6701,2.0203,-9.7837,4.0366,14.8219,7.585,79
-0.3145,-9.6736,0.6804,0.7821,-9.6736,3.1299,8.6293,6.3257,80
-5.847,-9.731,1.2639,2.8848,-9.731,3.1094,11.1288,7.7998,81
-1.8864,-9.6612,1.7053,3.205,-9.6612,4.1863,20.2667,13.3527,82
-8.4842,-9.9007,10.8192,10.1401,-9.9007,2.2124,25.6634,16.4233,83
0.0465,-9.5678,6.1914,8.3908,-9.5678,5.8776,23.1654,19.5154,84
-2.6318,-9.7392,6.4199,6.2473,-9.7392,8.6101,32.4105,19.7481,85
-34.2285,-9.9774,19.986,56.209,-9.9774,13.9529,88.9834,78.2921,86
-2.4911,-9.7499,3.3948,5.1453,-9.7499,4.9674,17.9895,9.6632,87
-1.0981,-9.8093,2.6936,3.0109,-9.8093,3.4674,23.7576,21.1048,88
-9.2788,-9.8848,15.5935,20.8409,-9.8848,8.8303,46.3674,37.3885,89
-0.7364,-9.7503,2.956,2.9681,-9.7503,2.6993,29.9302,25.8549,90
-5.621,-9.532,-1.1247,1.9219,-9.532,4.7964,26.3682,14.3122,91
-21.9922,-9.8809,-7.7797,7.2054,-9.8809,5.1065,37.2376,34.0056,92
-21.021,-9.687,1.6252,12.7707,-9.687,7.1634,34.1061,11.2063,93
-6.3648,-9.7134,0.5313,4.1386,-9.7134,5.524,18.6883,11.0224,94
-0.5064,-9.5223,5.2254,3.8553,-9.5223,8.9525,15.6664,12.8866,95
-1.2783,-9.6432,0.6281,1.1625,-9.6432,1.1081,6.7739,5.4033,96
-0.1509,-9.7463,0.1049,0.3611,-9.7463,0.8576,4.3699,2.5131,97
-3.8425,-9.8395,0.3822,2.6876,-9.8395,3.5397,12.0982,9.3275,98
-0.3799,-9.8398,0.2239,0.6539,-9.8398,2.4669,7.9151,5.5339,99
0.3348,-9.8205,3.1161,3.0229,-9.8205,2.7541,11.1111,9.8379,100
-2.7166,-8.9203,0.8168,2.9577,-8.9203,2.5841,9.9927,5.6329,101
-0.1406,-9.8802,9.1004,11.835,-9.8802,7.3639,17.6463,11.1134,102
-0.4239,-9.5933,-0.0343,0.2392,-9.5933,1.3245,4.7923,2.5481,103
-2.0917,-9.6651,1.3423,3.1559,-9.6651,2.5084,11.4179,8.6947,104
-5.0743,-9.7263,-0.6015,2.0593,-9.7263,1.1992,11.4583,7.8583,105
-11.2862,-9.7292,3.1792,8.0078,-9.7292,6.768,17.9151,9.9998,106
-1.0222,-9.4372,0.3271,0.9983,-9.4372,1.557,8.606,3.3678,107
-2.4504,-9.7818,3.0277,3.7376,-9.7818,5.3704,13.4935,9.3795,108
-2.2924,-9.8169,0.3693,1.4498,-9.8169,4.7099,8.5239,5.4661,109
-0.0152,-9.609,1.7046,1.7982,-9.609,2.106,8.4223,5.2301,110
-0.8368,-9.7247,1.0033,2.1513,-9.7247,2.3187,7.0418,5.074,111
-0.8161,-9.8686,1.2092,1.3671,-9.8686,4.4219,11.9021,8.8444,112
-0.4654,-8.7826,1.1056,1.7948,-8.7826,1.6198,16.8703,4.5472,113
-1.4442,-9.7144,-0.0172,1.3717,-9.7144,1.5143,10.9288,7.6102,114
-2.8686,-9.77,-0.2816,1.1193,-9.77,2.7384,13.9919,5.7901,115
-8.3465,-9.6219,0.2855,4.3399,-9.6219,1.2748,19.4532,18.3003,116
-4.7204,-9.7691,3.0666,5.0185,-9.7691,6.5774,32.8995,15.2367,118
-7.8047,-9.7135,-1.3037,2.9556,-9.7135,3.1955,13.5868,4.5617,119
-3.7897,-9.7914,-1.0254,1.7775,-9.7914,1.222,5.5255,4.5022,120
-7.7723,-9.6708,8.1484,8.4071,-9.6708,2.7028,16.5108,12.9722,121
-1.3454,-9.7426,0.0535,0.609,-9.7426,1.3796,4.8865,2.5522,123
-1.5716,-9.7377,-0.01,0.8387,-9.7377,2.3489,4.5922,2.9175,124
-4.21,-9.7273,-0.0174,1.8683,-9.7273,2.7327,8.0747,3.812,125
-2.8612,-9.7302,-0.7414,1.2593,-9.7302,1.6128,5.8639,3.6667,126
-4.8517,-9.7096,-0.3528,1.3388,-9.7096,2.1948,6.7761,2.3755,128
-2.3378,-9.7165,-0.7332,1.034,-9.7165,1.4791,3.2358,2.6126,129
-0.1091,-9.7186,0.0877,0.1927,-9.7186,0.4603,2.3566,2.0515,130
-0.8531,-9.7218,-0.4777,0.2694,-9.7218,0.458,2.3792,2.2097,131
-1.1487,-9.7395,-0.6887,0.3007,-9.7395,0.2692,2.7781,2.3053,132
-2.6409,-9.7283,-0.8449,0.8854,-9.7283,1.9634,3.9718,2.8728,133
-2.0327,-9.7327,-0.0854,0.7556,-9.7327,1.4295,4.1193,2.0864,134
-1.6397,-9.6955,1.9396,5.1641,-9.6955,5.9983,19.8103,5.0011,135
-4.7099,-9.8213,2.7421,5.8022,-9.8213,5.61,22.9535,20.9902,136
-1.4636,-8.7226,0.2873,1.4513,-8.7226,4.9501,22.9468,9.8772,137
-9.8411,-9.6775,1.8948,7.0952,-9.6775,4.0676,21.8102,14.8426,138
-28.6944,-9.9799,1.182,15.7721,-9.9799,11.3619,46.3903,37.4737,139
-5.0398,-10.004,2.6314,7.7795,-10.004,5.572,35.0585,18.0888,140
-26.6618,-8.5557,-3.5957,13.9402,-8.5557,11.809,48.7618,25.7138,141
-16.2641,-9.7177,-1.5266,6.0854,-9.7177,5.6505,19.5409,8.5346,142
-0.8009,-10.005,14.7651,11.8996,-10.005,9.9938,30.2782,21.4212,143
-4.7534,-9.6199,5.3774,7.2603,-9.6199,4.0304,18.1759,13.9687,144
-23.0431,-9.8812,-4.8748,7.6795,-9.8812,7.1802,15.4956,11.3901,145
-25.5519,-9.9324,4.6453,19.3289,-9.9324,11.911,26.3942,18.2522,146
-2.787,-9.8023,1.4535,3.0177,-9.8023,3.4414,21.6228,16.7227,147
-1.7905,-9.7399,0.0092,0.9165,-9.7399,2.9538,18.404,10.2598,148
-3.5407,-9.5725,1.0986,2.2198,-9.5725,4.4713,14.5375,8.8519,149
-9.5755,-9.8449,0.7885,5.5304,-9.8449,4.2749,19.249,8.624,150
-16.6394,-9.8248,1.8419,14.038,-9.8248,5.4855,32.2354,22.9798,151
-10.2532,-9.8558,-2.578,4.6712,-9.8558,3.1758,30.7807,22.0771,152
-3.1376,-10.1799,6.4867,9.1009,-10.1799,7.2296,45.8672,33.5476,153
-25.6467,-9.3259,0.4217,9.4561,-9.3259,4.0619,34.851,23.1674,154
-6.814,-10.298,8.3317,11.581,-10.298,1.9296,27.5449,19.182,155
-4.1506,-10.1348,2.9288,7.2737,-10.1348,4.8534,48.649,30.0956,156
-2.2848,-9.6925,3.0681,3.7749,-9.6925,1.4428,37.2602,28.0411,157
-4.6933,-9.4656,0.8166,3.6664,-9.4656,3.5378,18.4183,14.5764,158
-19.4785,-9.3931,8.9592,18.7271,-9.3931,11.5476,29.3704,18.8557,159
-10.7579,-9.4408,-3.6792,3.8158,-9.4408,4.4255,15.6606,8.8608,160
-0.135,-10.1243,6.1726,5.3387,-10.1243,4.9719,15.5003,10.5701,161
-11.1293,-10.6685,2.5251,7.605,-10.6685,7.2967,20.2766,15.3197,162
-7.9823,-9.1872,-1.6941,3.2181,-9.1872,1.8135,9.9211,7.163,163
-4.541,-9.5072,2.5491,5.4806,-9.5072,2.7296,9.5373,8.6547,164
-13.8116,-9.5761,-5.6297,5.9219,-9.5761,8.7117,22.2402,15.1117,165
-15.7925,-9.7772,5.3519,10.7824,-9.7772,7.6014,24.228,14.3565,166
-4.2783,-10.3682,0.4004,2.3371,-10.3682,6.0488,15.0539,10.7651,167
-15.9455,-9.6755,14.4499,22.9208,-9.6755,15.0054,48.7043,22.9936,168
-17.4576,-7.9689,2.5153,13.6524,-7.9689,8.0513,35.2563,19.4105,169
-9.9186,-9.9325,3.619,9.0085,-9.9325,9.95,16.2826,11.2379,170
-7.7202,-8.9766,-3.0198,3.6121,-8.9766,8.7706,31.221,25.4025,171
-13.8476,-9.1834,2.2053,8.7703,-9.1834,10.1758,20.3224,13.3776,172
-1.033,-10.0237,2.3271,3.6132,-10.0237,4.2093,17.2906,8.0383,173
-8.2807,-9.8632,-0.9948,4.0713,-9.8632,4.925,24.9591,7.5984,174
-11.0636,-9.7937,4.235,11.9816,-9.7937,10.8716,23.4438,17.0288,175
-5.2343,-10.3599,0.6123,3.8191,-10.3599,1.728,25.8354,16.6637,176
-7.8702,-9.8395,12.6893,23.2705,-9.8395,13.3272,30.0509,25.8,177
-8.9423,-7.0084,3.4108,10.4932,-7.0084,6.1408,33.3267,13.5364,178
-4.9929,-9.8657,1.8538,6.4513,-9.8657,3.4782,19.2273,10.1186,179
-5.1717,-10.2987,0.1403,3.0645,-10.2987,3.3466,23.6925,9.6839,180
-21.2663,-10.7718,25.4032,44.0507,-10.7718,20.8429,50.7737,41.6258,181
-17.2751,-9.4445,1.5218,10.0926,-9.4445,2.8674,25.4463,11.1451,182
-58.1242,-9.645,-5.5293,23.5327,-9.645,8.6321,20.2008,15.8281,183
-11.2514,-8.1364,0.7452,7.8939,-8.1364,5.9226,37.9237,14.3281,184
-6.4853,-9.3055,18.977,30.2288,-9.3055,18.9999,44.488,28.2645,185
-16.008,-9.5314,-0.561,7.5356,-9.5314,5.8054,16.7577,11.3528,186
-3.9443,-9.6436,7.0483,14.8024,-9.6436,11.5764,32.9072,21.852,187
-17.6244,-9.4684,4.0407,15.9588,-9.4684,8.6367,33.2229,21.0035,188
-6.8357,-9.6326,3.2134,7.0994,-9.6326,6.3069,39.5063,13.1129,189
-11.4631,-10.035,0.1577,6.9057,-10.035,5.7649,22.9399,12.6978,190
-15.4994,-10.2052,4.9579,14.7172,-10.2052,4.5794,30.6533,20.3922,191
-8.2757,-9.9787,4.1848,10.3245,-9.9787,7.8751,48.7994,32.0725,192
-14.1077,-8.3663,0.5379,11.5318,-8.3663,1.4042,40.6622,33.264,193
2.0193,-9.3807,19.8705,13.7872,-9.3807,2.504,49.9771,32.1759,194
-22.257,-10.1847,13.9964,31.4368,-10.1847,12.691,77.1025,27.4147,195
-2.6335,-9.7613,9.0929,9.7086,-9.7613,8.6718,51.2075,41.0709,196
-7.2039,-9.6515,6.2005,10.9444,-9.6515,6.8938,42.9259,17.0744,197
4.1111,-10.1813,17.2035,5.5199,-10.1813,4.8483,43.9522,22.2492,198
-12.7339,-9.9127,20.0729,24.3045,-9.9127,12.9209,53.6374,22.8293,199
-74.1542,-8.8333,2.8602,26.8612,-8.8333,6.8188,46.6222,28.5915,200
-6.5893,-9.8407,4.8005,7.7844,-9.8407,5.4754,48.5894,25.1447,201
-12.023,-9.1811,1.3635,7.565,-9.1811,5.9315,33.9692,26.2164,202
-17.2323,-9.9966,-1.1503,11.0827,-9.9966,8.9985,17.8906,13.6143,203
-3.7426,-9.5814,0.6222,2.4659,-9.5814,2.5664,6.6625,5.0277,204
-9.1899,-9.7172,0.852,4.4349,-9.7172,4.3283,12.6515,10.4334,205
-11.5454,-9.6942,2.7492,8.4981,-9.6942,5.0899,33.8297,14.1157,206
-6.817,-9.5421,0.5374,2.496,-9.5421,3.6987,31.5927,20.1717,207
-4.1496,-10.0674,-0.2937,3.5805,-10.0674,0.8693,34.2686,32.4295,208
-8.7576,-9.7526,0.0788,2.9032,-9.7526,2.7717,15.1429,8.8349,209
-5.1078,-9.8658,4.5853,6.6478,-9.8658,8.9501,29.2264,19.6044,210
-6.0045,-9.9887,14.0273,19.2726,-9.9887,4.9317,29.6603,22.2579,211
-1.5658,-9.7348,7.0277,8.4761,-9.7348,7.4756,22.2351,16.2229,212
0.1764,-9.6005,2.4012,1.9366,-9.6005,4.0473,13.6763,11.2042,213
-6.9803,-10.1747,-0.8618,2.5856,-10.1747,3.4307,17.7938,8.075,214
0.0627,-9.8751,5.106,5.2244,-9.8751,6.1122,16.1527,8.3221,215
-1.8939,-9.4387,0.3485,1.332,-9.4387,4.4167,18.2568,7.2473,216
-2.0307,-9.8257,-0.1667,0.7656,-9.8257,1.2373,14.0482,7.1597,217
-15.7789,-10.3949,-3.3306,9.8145,-10.3949,2.7126,15.6246,11.5178,218
-6.384,-9.1023,3.2137,6.8558,-9.1023,5.6411,49.69,15.0758,219
-3.4107,-9.8313,8.0004,10.0861,-9.8313,8.0637,26.4561,14.2726,220
-3.6762,-9.4802,0.5038,1.6032,-9.4802,4.1638,18.2131,9.7181,221
-5.3628,-9.5988,1.5055,8.5276,-9.5988,2.4561,15.1904,13.111,222
-2.6946,-9.5119,2.6151,4.1721,-9.5119,8.0219,26.284,21.7755,223
-17.3495,-10.0176,5.4268,13.2615,-10.0176,8.1208,26.9334,21.3558,224
-9.7527,-9.555,0.7779,4.6164,-9.555,2.3838,22.7505,8.3773,225
-3.4284,-9.755,-0.1782,1.3467,-9.755,3.3682,7.6312,3.8351,226
-5.4027,-9.4792,2.1056,4.4406,-9.4792,6.7354,36.09,12.0198,228
-5.3761,-9.7224,2.0934,6.1025,-9.7224,4.9095,17.5333,10.2747,229
-3.4331,-8.8633,0.4012,2.3481,-8.8633,1.3833,10.8726,6.9238,230
-7.1011,-8.2623,4.6391,10.6913,-8.2623,3.2257,15.7917,12.3027,231
-7.8147,-9.7804,0.7116,3.3512,-9.7804,4.5318,16.4995,8.0023,232
-10.3764,-9.7982,-0.3332,4.4934,-9.7982,2.9738,10.5979,8.7731,233
-0.1231,-9.5695,0.4355,0.5411,-9.5695,1.6909,8.4594,6.4623,234
-6.1718,-10.1448,0.8838,3.4692,-10.1448,2.2095,16.8382,10.6438,235
-5.9683,-9.8858,0.1522,3.5592,-9.8858,2.6352,15.1865,8.0952,236
-10.2295,-9.7908,1.7143,4.5379,-9.7908,7.2484,23.3995,8.9632,238
-1.5531,-9.6102,3.7135,5.1809,-9.6102,6.8488,24.3675,16.4315,239
-1.609,-9.5135,1.9644,3.2027,-9.5135,3.41,19.1364,15.5122,240
-12.4633,-9.7584,2.6656,7.8764,-9.7584,3.6138,26.7841,13.2292,241
-8.9263,-9.7022,15.4888,29.4372,-9.7022,11.9804,37.9992,32.5621,242
-6.5594,-9.8987,5.2558,10.8931,-9.8987,7.468,45.362,28.5262,243
-7.2789,-9.8106,6.4688,11.716,-9.8106,6.5265,27.1939,10.366,244
-1.7862,-9.8281,2.4014,3.747,-9.8281,4.8776,41.8278,7.8371,245
-0.505,-9.7591,3.3555,6.0827,-9.7591,5.1589,33.4983,29.1692,246
-3.0251,-9.6969,4.014,5.0353,-9.6969,3.1173,18.5625,4.9615,247
-17.3452,-9.8094,9.982,20.6586,-9.8094,4.3917,26.9308,25.2594,248
-17.1555,-9.8803,12.1303,25.2808,-9.8803,10.1422,53.637,33.3733,249
-7.9239,-9.667,2.3278,8.0699,-9.667,5.7379,16.4858,8.2837,250
-8.5839,-9.6917,-2.4788,3.3882,-9.6917,5.7099,9.0901,8.0425,251
-2.5654,-9.9836,7.4183,7.9409,-9.9836,8.0371,28.4586,24.0218,252
-8.7869,-9.768,-0.8278,4.9138,-9.768,4.3002,9.8647,7.042,253
-1.5541,-9.6498,0.5903,1.3595,-9.6498,1.1339,6.9152,5.1743,254
-7.4125,-9.8891,0.3435,3.4652,-9.8891,5.6494,20.1429,11.6841,255
-3.2461,-9.6943,0.7972,2.6154,-9.6943,3.5174,8.0099,4.6237,256
-0.2409,-10.0999,0.2701,0.4931,-10.0999,1.0389,10.9686,3.6039,257
-3.194,-9.8913,2.133,2.9731,-9.8913,1.4662,8.8079,7.8982,258
-5.5742,-9.7581,1.0615,3.0821,-9.7581,4.5872,13.2627,8.6963,259
-9.2718,-9.8303,0.1931,3.9037,-9.8303,3.5124,15.2751,6.6317,260
-18.5061,-9.7677,5.3058,13.7017,-9.7677,14.5432,30.283,19.2787,261
-2.1685,-9.6713,9.0199,8.6602,-9.6713,11.6867,21.7728,17.7199,262
1.204,-9.353,6.3907,4.0979,-9.353,5.5359,31.4823,23.4268,263
-2.9743,-9.7537,5.041,7.0394,-9.7537,10.4114,19.965,11.9806,264
-2.567,-9.7414,4.3258,7.25,-9.7414,8.9087,20.4517,11.9072,265
-0.0541,-9.9494,0.5896,0.6203,-9.9494,1.3662,5.7877,3.7689,266
-1.617,-10.3062,1.5212,2.7219,-10.3062,1.0398,13.1689,8.6119,267
-23.5556,-9.6775,-1.8656,7.1642,-9.6775,5.7794,15.4511,9.986,268
-2.8251,-9.7146,0.3471,1.9734,-9.7146,2.2984,14.723,8.4032,269
-2.5866,-9.3756,0.3097,2.7524,-9.3756,2.5184,10.1653,4.6188,270
-2.909,-10.0439,1.8289,2.598,-10.0439,1.0079,8.4729,7.2927,271
-7.7037,-9.776,5.0278,8.0816,-9.776,6.7454,14.5907,8.8276,272
-6.4509,-9.7194,-0.8808,3.3264,-9.7194,5.0721,14.8384,4.6919,273
-7.3446,-9.7866,2.1559,4.1013,-9.7866,7.802,23.1212,13.5417,274
-0.6298,-9.7515,-0.0616,0.4134,-9.7515,0.4704,6.0745,5.2065,275
-6.134,-9.7484,0.3137,2.4764,-9.7484,2.4989,13.9737,10.4394,276
-3.1411,-9.7331,-1.5721,1.65,-9.7331,2.457,31.829,22.5028,277
-3.4707,-9.7912,1.1089,4.2485,-9.7912,3.267,30.3576,26.0826,278
-30.0928,-9.6886,-9.2316,12.8751,-9.6886,3.5416,43.2478,35.9938,279
-4.2907,-9.6951,-0.7387,2.3506,-9.6951,0.6024,26.0416,24.5405,280
-10.615,-9.7814,0.0525,3.3762,-9.7814,4.2998,37.7503,17.5051,281
-11.3387,-9.8577,-2.5844,3.8241,-9.8577,2.1971,11.8872,10.5157,282
-52.8222,-9.5938,-3.2966,20.4881,-9.5938,11.1951,16.8768,12.1673,283
-32.2958,-9.6343,-4.7282,11.3262,-9.6343,4.9237,17.9616,8.7884,284
-29.5548,-9.4699,2.4858,11.5927,-9.4699,8.8573,38.5339,17.971,286
-7.4468,-9.7092,-5.4405,1.7957,-9.7092,3.2834,41.5127,36.4338,287
-0.7847,-9.798,0.6601,1.4101,-9.798,2.6866,26.3846,21.357,288
-2.0483,-9.7131,-0.6663,0.4911,-9.7131,0.5844,2.8288,2.1015,290
-0.9145,-9.7163,-0.6665,0.171,-9.7163,0.2202,2.2545,2.1083,291
-0.8195,-9.7181,-0.6592,0.1072,-9.7181,0.1375,2.221,2.1217,292
-0.7529,-9.7186,-0.6513,0.0602,-9.7186,0.0777,2.1649,2.1106,293
-0.717,-9.7178,-0.6541,0.0443,-9.7178,0.0564,2.161,2.102,294
-0.6856,-9.7192,-0.6458,0.0277,-9.7192,0.0372,2.151,2.0934,295
-0.6806,-9.7179,-0.6505,0.0166,-9.7179,0.0213,2.1103,2.0938,296
-0.6623,-9.7172,-0.6481,0.0125,-9.7172,0.0174,2.1276,2.1037,297
-0.6621,-9.7175,-0.6489,0.0097,-9.7175,0.0104,2.1213,2.1042,298
-0.6596,-9.7179,-0.6455,0.0096,-9.7179,0.0141,2.1123,2.0955,299
-0.6566,-9.7181,-0.646,0.007,-9.7181,0.0107,2.1244,2.103,300
-0.6571,-9.7209,-0.6461,0.0073,-9.7209,0.011,2.1247,2.1039,301
-0.6671,-9.7184,-0.6519,0.0072,-9.7184,0.0113,2.134,2.112,303
-0.6638,-9.7191,-0.6496,0.0063,-9.7191,0.0081,2.1302,2.1062,304
-0.6628,-9.7184,-0.6551,0.0058,-9.7184,0.0095,2.1352,2.1085,305
-0.6568,-9.7198,-0.6463,0.0078,-9.7198,0.0094,2.1215,2.1019,306
-0.6513,-9.718,-0.6449,0.0036,-9.718,0.0073,2.1365,2.1071,307
-0.6749,-9.7181,-0.6532,0.0115,-9.7181,0.0166,2.1337,2.1212,308
-0.6546,-9.7209,-0.646,0.0064,-9.7209,0.0097,2.1123,2.1018,309
-15.2207,-9.6853,-1.4567,7.8132,-9.6853,1.7106,14.18,13.0368,310
-20.7538,-9.6441,-4.9658,10.6407,-9.6441,1.1439,23.6444,22.3106,311
-4.681,-9.673,0.6267,3.4194,-9.673,3.5197,13.2388,10.5001,312
-7.1316,-9.2885,-4.4933,2.1062,-9.2885,1.5466,22.1945,20.276,313
-67.0456,-9.3946,-2.7548,43.8715,-9.3946,15.1299,26.1764,15.1574,314
-22.7181,-9.6976,4.4945,20.2063,-9.6976,14.8744,53.9094,23.7498,315
-117.8237,-9.2993,2.4937,66.3722,-9.2993,23.3874,50.8719,21.4949,316
-170.4417,-9.5184,-8.5456,57.3992,-9.5184,17.3415,40.3373,17.5395,317
-23.815,-9.4055,11.3551,30.2227,-9.4055,9.2651,21.8832,10.2567,318
-9.426,-9.601,-2.1084,4.1994,-9.601,2.5711,5.3033,2.8677,319
-5.2352,-9.6032,-1.6164,2.759,-9.6032,1.5882,3.3379,2.3199,320
-3.4106,-9.5974,-1.5549,1.2204,-9.5974,0.7024,2.7029,2.0716,321
-2.588,-9.5967,-1.5984,0.6342,-9.5967,0.3623,2.3866,2.0956,322
-2.2111,-9.5962,-1.6335,0.4546,-9.5962,0.2575,2.2843,2.1263,323
-1.9957,-9.5961,-1.6368,0.2367,-9.5961,0.1343,2.2166,2.1166,324
-1.8854,-9.5959,-1.6579,0.1553,-9.5959,0.0873,2.1823,2.1201,325
-1.7937,-9.5957,-1.6483,0.0979,-9.5957,0.0558,2.1515,2.1217,326
-1.7436,-9.5953,-1.6409,0.0716,-9.5953,0.0407,2.1518,2.1074,327
-1.7268,-9.5957,-1.655,0.0507,-9.5957,0.0286,2.1488,2.122,328
-1.6777,-9.5958,-1.6273,0.0286,-9.5958,0.0165,2.134,2.1071,329
-1.6982,-9.5957,-1.6463,0.0268,-9.5957,0.0158,2.144,2.1215,330
-1.6551,-9.5942,-1.6295,0.0175,-9.5942,0.0101,2.1313,2.1146,331
-1.6571,-9.5962,-1.6332,0.0208,-9.5962,0.0134,2.1338,2.1215,332
-1.6765,-9.5975,-1.6506,0.0185,-9.5975,0.0122,2.1289,2.1145,333
-1.6721,-9.5963,-1.6434,0.0258,-9.5963,0.0146,2.1311,2.1145,334
-1.6982,-9.5958,-1.6346,0.0338,-9.5958,0.02,2.1361,2.1131,335
-1.7118,-9.5962,-1.6505,0.022,-9.5962,0.0129,2.1398,2.1209,336
-1.6683,-9.5952,-1.6365,0.022,-9.5952,0.013,2.1361,2.1161,337
-1.6683,-9.5951,-1.6472,0.0162,-9.5951,0.0088,2.1244,2.1157,338
-1.7037,-9.5969,-1.6466,0.0309,-9.5969,0.0177,2.1412,2.1168,339
-1.6702,-9.5967,-1.6397,0.0198,-9.5967,0.0116,2.1365,2.1196,340
-1.6857,-9.5963,-1.6478,0.0214,-9.5963,0.0124,2.1319,2.115,341
-1.6888,-9.5958,-1.6585,0.0158,-9.5958,0.0095,2.1264,2.1148,342
-1.6701,-9.5952,-1.6434,0.0257,-9.5952,0.0157,2.1273,2.1171,343
-1.7037,-9.5958,-1.6481,0.035,-9.5958,0.0188,2.144,2.1272,344
-1.6906,-9.5961,-1.6444,0.0232,-9.5961,0.0139,2.1318,2.1084,345
-1.733,-9.595,-1.6594,0.036,-9.595,0.0206,2.1485,2.1144,346
-1.6832,-9.5955,-1.6535,0.021,-9.5955,0.0126,2.1392,2.1184,348
-1.6689,-9.5973,-1.6399,0.0189,-9.5973,0.0108,2.1221,2.1061,349
-1.6931,-9.5957,-1.6585,0.0177,-9.5957,0.0101,2.1456,2.122,350
-1.6938,-9.5966,-1.6631,0.0172,-9.5966,0.0097,2.1373,2.1195,351
-1.6907,-9.5956,-1.6622,0.0169,-9.5956,0.0102,2.1464,2.1209,352
-1.6677,-9.5954,-1.6526,0.013,-9.5954,0.0077,2.1415,2.1182,353
-1.6976,-9.5942,-1.6701,0.0203,-9.5942,0.0125,2.1368,2.1228,354
-1.7007,-9.5942,-1.6607,0.0242,-9.5942,0.014,2.1323,2.1176,355
-1.6713,-9.5957,-1.6581,0.009,-9.5957,0.0055,2.1395,2.1202,356
-1.7038,-9.5952,-1.6662,0.0171,-9.5952,0.0102,2.1462,2.1222,358
-1.6926,-9.5952,-1.6577,0.0186,-9.5952,0.0111,2.1409,2.1198,359
-1.6683,-9.5947,-1.6626,0.0042,-9.5947,0.0028,2.1289,2.112,360
-1.6665,-9.5955,-1.6512,0.0106,-9.5955,0.0062,2.1311,2.1179,361
-1.692,-9.5956,-1.6447,0.0262,-9.5956,0.0153,2.1415,2.1207,362
-1.6945,-9.5937,-1.6562,0.019,-9.5937,0.011,2.1335,2.1125,363
-1.6863,-9.5949,-1.6651,0.0128,-9.5949,0.0078,2.1462,2.1244,364
-1.6862,-9.594,-1.6656,0.0182,-9.594,0.0108,2.1445,2.1184,365
-1.687,-9.5955,-1.6715,0.0095,-9.5955,0.0061,2.1289,2.1165,366
-1.677,-9.5957,-1.6626,0.0124,-9.5957,0.0076,2.1395,2.1264,367
-1.7175,-9.5954,-1.6643,0.023,-9.5954,0.0137,2.1559,2.1171,368
-1.6776,-9.5951,-1.6614,0.0118,-9.5951,0.0078,2.134,2.1209,369
-1.6907,-9.5951,-1.664,0.0146,-9.5951,0.0088,2.139,2.1242,370
-1.687,-9.5958,-1.6615,0.011,-9.5958,0.0066,2.1311,2.117,371
-1.6801,-9.5956,-1.6542,0.014,-9.5956,0.0079,2.1244,2.113,372
-1.6846,-9.5953,-1.6651,0.0123,-9.5953,0.0077,2.1273,2.1144,373
-1.7001,-9.5951,-1.6741,0.0194,-9.5951,0.0118,2.153,2.1283,374
-1.6901,-9.5947,-1.6752,0.0123,-9.5947,0.0071,2.127,2.1193,375
-1.7175,-9.5957,-1.6735,0.0182,-9.5957,0.0111,2.1542,2.1235,376
-1.6957,-9.5958,-1.6681,0.0123,-9.5958,0.0078,2.1342,2.1255,377
-1.6813,-9.596,-1.6631,0.0121,-9.596,0.008,2.1464,2.128,378
-1.6933,-9.5959,-1.6629,0.0174,-9.5959,0.0108,2.1586,2.1195,379
-1.6926,-9.5962,-1.6649,0.0167,-9.5962,0.0102,2.146,2.1249,380
-1.7125,-9.5957,-1.6902,0.0188,-9.5957,0.0106,2.1445,2.128,381
-1.7001,-9.5957,-1.6643,0.0205,-9.5957,0.012,2.1513,2.1253,382
-1.6839,-9.5961,-1.6605,0.0149,-9.5961,0.0089,2.134,2.1258,383
-1.6956,-9.5959,-1.6733,0.0137,-9.5959,0.0075,2.1555,2.1393,384
-1.6939,-9.5961,-1.674,0.0144,-9.5961,0.0087,2.1395,2.1268,385
-1.7032,-9.5966,-1.6713,0.0183,-9.5966,0.0109,2.1438,2.1286,386
-1.7143,-9.5958,-1.6857,0.0149,-9.5958,0.0093,2.1402,2.1252,387
-1.7075,-9.595,-1.6855,0.0143,-9.595,0.0081,2.1368,2.1295,388
-1.7082,-9.5958,-1.6746,0.0184,-9.5958,0.0111,2.1462,2.126,389
-1.7056,-9.5961,-1.6851,0.0141,-9.5961,0.0085,2.1406,2.1254,390
-1.7081,-9.596,-1.6836,0.0149,-9.596,0.0092,2.1421,2.125,391
-1.6833,-9.5957,-1.669,0.0083,-9.5957,0.0054,2.134,2.1206,392
-1.7125,-9.5964,-1.6864,0.0149,-9.5964,0.0097,2.1423,2.1272,393
-1.7162,-9.5965,-1.6847,0.0194,-9.5965,0.0115,2.1388,2.1314,394
-1.7125,-9.5965,-1.6756,0.0171,-9.5965,0.0104,2.1314,2.1194,395
-1.692,-9.5967,-1.6718,0.0168,-9.5967,0.01,2.1445,2.1141,396
-1.6926,-9.5982,-1.6729,0.0122,-9.5982,0.0079,2.143,2.1336,397
-1.7187,-9.597,-1.681,0.0145,-9.597,0.0084,2.1458,2.1216,398
-1.7063,-9.596,-1.6821,0.0167,-9.596,0.0099,2.1296,2.1159,399
-1.7131,-9.5964,-1.6826,0.0243,-9.5964,0.0142,2.1368,2.1278,400
-1.7057,-9.5973,-1.6742,0.0282,-9.5973,0.0174,2.1347,2.1204,401
-1.7062,-9.5966,-1.6739,0.0258,-9.5966,0.0153,2.144,2.1301,402
-1.7231,-9.5973,-1.6856,0.0209,-9.5973,0.0126,2.139,2.1232,403
-1.7237,-9.5961,-1.6847,0.022,-9.5961,0.0127,2.1438,2.1319,404
-1.715,-9.5972,-1.6858,0.0179,-9.5972,0.0109,2.1483,2.1204,405
-1.7175,-9.5973,-1.6917,0.0181,-9.5973,0.0108,2.137,2.1234,406
-1.7162,-9.5973,-1.6852,0.0184,-9.5973,0.0109,2.1564,2.1292,408
-1.743,-9.5972,-1.6938,0.025,-9.5972,0.0144,2.1583,2.1282,409
-1.7056,-9.5964,-1.6768,0.0177,-9.5964,0.0102,2.1464,2.1242,410
-1.7131,-9.5983,-1.6736,0.022,-9.5983,0.0128,2.1293,2.1104,411
-1.7225,-9.5981,-1.6908,0.0225,-9.5981,0.0141,2.1407,2.1234,412
-1.7088,-9.5988,-1.6874,0.015,-9.5988,0.0086,2.1347,2.1255,413
-1.7075,-9.5956,-1.6779,0.0195,-9.5956,0.0111,2.1474,2.1199,414
-1.7268,-9.5976,-1.6833,0.0324,-9.5976,0.0182,2.1417,2.1186,415
-1.715,-9.5964,-1.6814,0.0192,-9.5964,0.0103,2.1345,2.1244,416
-1.7062,-9.5964,-1.6861,0.0173,-9.5964,0.0099,2.1501,2.1252,417
-1.7249,-9.5973,-1.6857,0.0239,-9.5973,0.0147,2.1318,2.1224,418
-1.7579,-9.5973,-1.6909,0.0355,-9.5973,0.0199,2.1586,2.1247,419
-1.7249,-9.5964,-1.6847,0.0252,-9.5964,0.0149,2.1456,2.1292,420
-1.7106,-9.5969,-1.6856,0.0188,-9.5969,0.011,2.1511,2.1281,421
-1.7797,-9.5974,-1.6863,0.0539,-9.5974,0.0317,2.1462,2.1264,422
-1.7437,-9.5961,-1.6926,0.0453,-9.5961,0.0259,2.1537,2.1231,423
-1.7599,-9.5961,-1.697,0.0517,-9.5961,0.0284,2.1569,2.1257,424
-1.7661,-9.5965,-1.6908,0.0505,-9.5965,0.0288,2.1443,2.1275,425
-1.7474,-9.5976,-1.6888,0.0344,-9.5976,0.0177,2.1446,2.1254,426
-1.7199,-9.5966,-1.689,0.0263,-9.5966,0.0148,2.1388,2.1253,427
-1.71,-9.5951,-1.6795,0.0232,-9.5951,0.0131,2.1553,2.135,428
-1.7193,-9.5972,-1.6947,0.0212,-9.5972,0.0117,2.1511,2.1345,429
-1.7168,-9.5978,-1.6952,0.0162,-9.5978,0.0096,2.1313,2.1261,430
-1.7094,-9.5962,-1.6863,0.0172,-9.5962,0.0103,2.1445,2.1279,431
-1.7373,-9.5944,-1.7076,0.0182,-9.5944,0.0109,2.1518,2.1375,432
-1.7137,-9.5973,-1.6962,0.0164,-9.5973,0.0105,2.1397,2.1253,433
-1.7107,-9.5962,-1.6915,0.0091,-9.5962,0.0068,2.1442,2.129,434
-1.728,-9.5963,-1.7078,0.017,-9.5963,0.0098,2.1438,2.1361,435
-1.7392,-9.5969,-1.7026,0.0207,-9.5969,0.0126,2.1502,2.1337,436
-1.7299,-9.596,-1.6991,0.0134,-9.596,0.0081,2.1633,2.1297,437
-1.7331,-9.5974,-1.7123,0.017,-9.5974,0.0098,2.1402,2.1296,438
-1.7404,-9.5964,-1.7005,0.015,-9.5964,0.009,2.1529,2.1276,439
-1.7224,-9.5966,-1.6959,0.0176,-9.5966,0.0104,2.1469,2.1284,440
-1.7486,-9.5945,-1.7115,0.0174,-9.5945,0.0095,2.1418,2.1258,441
-1.7112,-9.5967,-1.6891,0.0181,-9.5967,0.0113,2.1418,2.1285,442
-1.7218,-9.5947,-1.7029,0.018,-9.5947,0.0108,2.1326,2.1273,443
-1.7312,-9.595,-1.7073,0.0131,-9.595,0.0089,2.146,2.134,444
-1.7767,-9.5946,-1.7087,0.041,-9.5946,0.024,2.1551,2.1368,445
-1.7368,-9.597,-1.6979,0.0272,-9.597,0.015,2.1467,2.1303,446
-1.7305,-9.5959,-1.7018,0.0264,-9.5959,0.0141,2.1395,2.1279,447
-1.7287,-9.5963,-1.6951,0.0184,-9.5963,0.011,2.1485,2.1253,448
-1.7629,-9.5961,-1.7059,0.0214,-9.5961,0.0127,2.1579,2.1295,449
-1.7336,-9.5964,-1.7059,0.0155,-9.5964,0.0091,2.1486,2.1295,450
-1.7542,-9.5956,-1.7184,0.0237,-9.5956,0.0131,2.1471,2.131,451
-1.7306,-9.5971,-1.7038,0.0188,-9.5971,0.0123,2.1564,2.1278,452
-1.7287,-9.5979,-1.7012,0.0201,-9.5979,0.0104,2.1467,2.1331,453
-1.733,-9.5973,-1.7001,0.0211,-9.5973,0.0124,2.1456,2.1232,454
-1.7243,-9.5981,-1.6981,0.0148,-9.5981,0.0088,2.1467,2.1305,455
-1.7299,-9.5966,-1.7035,0.0205,-9.5966,0.0128,2.1474,2.1303,456
-1.7398,-9.5971,-1.7116,0.0148,-9.5971,0.0094,2.1578,2.1399,457
-1.723,-9.5974,-1.709,0.0134,-9.5974,0.0084,2.1508,2.1418,458
-1.7225,-9.5975,-1.697,0.0184,-9.5975,0.0113,2.1385,2.1287,460
-1.7567,-9.5985,-1.7152,0.0211,-9.5985,0.012,2.154,2.1412,461
-1.7448,-9.5974,-1.7097,0.0228,-9.5974,0.0142,2.15,2.1353,462
-1.7361,-9.5972,-1.7069,0.0185,-9.5972,0.0111,2.14,2.1324,463
-1.7305,-9.5972,-1.7157,0.0162,-9.5972,0.0107,2.1467,2.13,464
-1.7467,-9.5978,-1.7116,0.015,-9.5978,0.009,2.1467,2.133,465
-1.7435,-9.5964,-1.7141,0.0208,-9.5964,0.0131,2.1642,2.1274,466
-1.7337,-9.5972,-1.6998,0.0196,-9.5972,0.0115,2.1474,2.1328,467
-1.7567,-9.5978,-1.7106,0.0265,-9.5978,0.0155,2.1516,2.1305,468
-1.7424,-9.5976,-1.7072,0.018,-9.5976,0.0107,2.1589,2.1344,469
-1.7411,-9.5983,-1.709,0.0165,-9.5983,0.0102,2.1607,2.1283,470
-1.7549,-9.5978,-1.7147,0.0174,-9.5978,0.0104,2.1573,2.1311,471
-1.7343,-9.5974,-1.6987,0.0211,-9.5974,0.0123,2.1471,2.1289,472
-1.7591,-9.5974,-1.7213,0.0224,-9.5974,0.0135,2.1453,2.1355,473
-1.7169,-9.5976,-1.7005,0.0082,-9.5976,0.0056,2.1421,2.1285,474
-1.7435,-9.5985,-1.7133,0.0184,-9.5985,0.0109,2.1627,2.1324,475
-1.7442,-9.5978,-1.7202,0.0165,-9.5978,0.0096,2.1448,2.134,476
-1.7193,-9.5977,-1.7003,0.0205,-9.5977,0.0119,2.1397,2.1327,477
-1.7542,-9.5993,-1.7205,0.018,-9.5993,0.0109,2.1569,2.1329,478
-1.7579,-9.5986,-1.7229,0.0166,-9.5986,0.0097,2.1519,2.131,479
-1.7598,-9.598,-1.7298,0.0218,-9.598,0.0126,2.1502,2.1326,480
-1.7535,-9.5991,-1.7276,0.0165,-9.5991,0.0097,2.1427,2.1271,481
-1.741,-9.5984,-1.73,0.0115,-9.5984,0.007,2.1698,2.1431,482
-1.7454,-9.5983,-1.7238,0.0188,-9.5983,0.0115,2.1429,2.1324,483
-1.7597,-9.5981,-1.7269,0.026,-9.5981,0.016,2.1496,2.1373,484
-1.7479,-9.5989,-1.7216,0.0131,-9.5989,0.0084,2.1516,2.1284,485
-1.7855,-9.5973,-1.7335,0.025,-9.5973,0.0146,2.1671,2.1352,486
-1.7777,-9.5984,-1.7259,0.0327,-9.5984,0.0189,2.1394,2.1337,487
-1.7772,-9.5982,-1.7375,0.0235,-9.5982,0.0139,2.1573,2.1485,488
-1.7692,-9.5981,-1.7227,0.0229,-9.5981,0.0133,2.1573,2.1352,489
-1.7686,-9.5984,-1.7278,0.018,-9.5984,0.01,2.1514,2.1348,490
-1.7554,-9.5973,-1.7343,0.0157,-9.5973,0.0097,2.141,2.1369,491
-1.748,-9.5992,-1.7333,0.0162,-9.5992,0.0096,2.157,2.1314,492
-1.7616,-9.5984,-1.7217,0.0171,-9.5984,0.0105,2.1683,2.133,493
-1.7529,-9.5986,-1.7236,0.0173,-9.5986,0.0103,2.1467,2.1272,494
-1.7548,-9.5976,-1.7245,0.0196,-9.5976,0.0113,2.1448,2.1371,495
-1.9641,-9.598,-1.7269,0.0976,-9.598,0.057,2.2097,2.1324,496
-1.882,-9.5978,-1.7357,0.1202,-9.5978,0.0665,2.1823,2.1389,497
-1.8478,-9.5992,-1.7196,0.0808,-9.5992,0.045,2.167,2.1357,498
-1.8138,-9.5994,-1.7262,0.054,-9.5994,0.031,2.1757,2.1393,499
-1.7797,-9.5975,-1.7316,0.0281,-9.5975,0.0167,2.1591,2.1409,500
-1.7567,-9.5979,-1.7328,0.0189,-9.5979,0.0108,2.1438,2.1325,501
-1.7698,-9.5985,-1.7262,0.02,-9.5985,0.0116,2.1549,2.1355,502
-1.7429,-9.5981,-1.7185,0.0154,-9.5981,0.0087,2.1451,2.1276,503
-1.7504,-9.5986,-1.7252,0.021,-9.5986,0.0135,2.1591,2.1411,504
-1.7529,-9.5968,-1.7292,0.0163,-9.5968,0.0091,2.1559,2.1316,505
-1.7653,-9.5987,-1.7236,0.0202,-9.5987,0.0118,2.162,2.1372,506
-1.7311,-9.5983,-1.7105,0.0149,-9.5983,0.0091,2.14,2.1285,507
-1.7597,-9.5983,-1.7345,0.0173,-9.5983,0.0101,2.1567,2.1323,508
-1.7567,-9.5978,-1.734,0.0141,-9.5978,0.0085,2.1471,2.1343,509
-1.7722,-9.5977,-1.7271,0.0212,-9.5977,0.0126,2.1618,2.1326,510
-1.743,-9.5973,-1.7223,0.0139,-9.5973,0.0081,2.1464,2.1289,511
-1.7585,-9.598,-1.7271,0.0187,-9.598,0.0109,2.1567,2.1374,512
-1.7783,-9.5976,-1.7433,0.0245,-9.5976,0.0152,2.1546,2.1443,513
-1.7504,-9.5978,-1.729,0.0198,-9.5978,0.0121,2.1427,2.1387,514
-1.7559,-9.5977,-1.7259,0.0157,-9.5977,0.0098,2.1467,2.131,515
-1.7572,-9.5983,-1.7288,0.0196,-9.5983,0.012,2.1538,2.1366,516
-1.7741,-9.5968,-1.7351,0.0165,-9.5968,0.0096,2.1695,2.1344,518
-1.7605,-9.5964,-1.7289,0.019,-9.5964,0.0112,2.1569,2.1359,519
-1.7417,-9.5964,-1.7265,0.0162,-9.5964,0.0099,2.1464,2.1368,520
-1.7728,-9.5962,-1.7424,0.0199,-9.5962,0.0118,2.1573,2.1486,521
-1.7672,-9.5978,-1.7409,0.0264,-9.5978,0.0158,2.1498,2.1313,522
-1.751,-9.5968,-1.726,0.0163,-9.5968,0.0096,2.136,2.1272,523
-1.7685,-9.5963,-1.7308,0.0188,-9.5963,0.0103,2.1434,2.1379,524
-1.7854,-9.598,-1.7306,0.0263,-9.598,0.015,2.1502,2.133,525
-1.7684,-9.5976,-1.7417,0.0132,-9.5976,0.0079,2.1448,2.1365,526
-1.7679,-9.5971,-1.7378,0.0215,-9.5971,0.0127,2.164,2.1388,528
-1.7892,-9.5975,-1.734,0.0309,-9.5975,0.0175,2.157,2.1311,529
-1.7696,-9.5966,-1.7332,0.033,-9.5966,0.0179,2.1425,2.1342,530
-1.7854,-9.5972,-1.741,0.0281,-9.5972,0.0155,2.1485,2.1369,531
-1.7801,-9.596,-1.7576,0.0194,-9.596,0.0123,2.1599,2.1428,532
-1.7653,-9.5983,-1.7412,0.0171,-9.5983,0.0109,2.1445,2.1295,533
-1.7717,-9.5975,-1.7335,0.0234,-9.5975,0.0131,2.1498,2.1335,534
-1.8026,-9.5977,-1.738,0.0423,-9.5977,0.0241,2.1564,2.1378,535
-1.7918,-9.5978,-1.7383,0.0331,-9.5978,0.0202,2.1581,2.1374,536
-1.7771,-9.5969,-1.7465,0.0315,-9.5969,0.0187,2.1463,2.1305,537
-1.7771,-9.598,-1.7409,0.0259,-9.598,0.0148,2.1569,2.1476,538
-1.7752,-9.5975,-1.7324,0.0202,-9.5975,0.0119,2.1566,2.1358,539
-1.7591,-9.5979,-1.7307,0.018,-9.5979,0.0111,2.1659,2.137,540
-1.7554,-9.5969,-1.733,0.0176,-9.5969,0.01,2.15,2.1263,541
-1.7715,-9.5966,-1.7363,0.0225,-9.5966,0.0134,2.162,2.1403,542
-1.7623,-9.5975,-1.7491,0.0109,-9.5975,0.0064,2.148,2.1384,543
-1.7585,-9.5976,-1.7309,0.0216,-9.5976,0.012,2.1436,2.1395,544
-1.7621,-9.5974,-1.7363,0.0132,-9.5974,0.0082,2.1538,2.1356,545
-1.7535,-9.5981,-1.7272,0.016,-9.5981,0.0099,2.1591,2.1397,546
-1.789,-9.5959,-1.7401,0.0227,-9.5959,0.0138,2.1545,2.1393,547
-1.756,-9.5982,-1.7339,0.014,-9.5982,0.0086,2.1483,2.144,548
-1.7684,-9.5974,-1.7325,0.0192,-9.5974,0.0113,2.1656,2.1313,549
-1.7511,-9.5982,-1.7253,0.0181,-9.5982,0.0109,2.1587,2.1364,550
-1.7541,-9.5977,-1.7311,0.0156,-9.5977,0.009,2.1485,2.1404,551
-1.7497,-9.5966,-1.7291,0.0187,-9.5966,0.0118,2.1463,2.1294,552
-1.7815,-9.5985,-1.7325,0.031,-9.5985,0.0188,2.1446,2.1299,553
-1.7647,-9.5988,-1.7417,0.017,-9.5988,0.0105,2.1515,2.1359,554
-1.7547,-9.5992,-1.7348,0.0158,-9.5992,0.0102,2.1555,2.1457,555
-1.7827,-9.5987,-1.7399,0.0167,-9.5987,0.0102,2.1725,2.1415,556
-1.7678,-9.597,-1.7439,0.0212,-9.597,0.0127,2.1584,2.1373,557
-1.756,-9.5982,-1.7365,0.011,-9.5982,0.0066,2.1535,2.1415,558
-1.7884,-9.5985,-1.7513,0.0178,-9.5985,0.0109,2.1616,2.142,559
-1.7586,-9.5978,-1.7465,0.0064,-9.5978,0.0037,2.1462,2.1446,560
-1.7877,-9.5977,-1.758,0.018,-9.5977,0.0109,2.1565,2.1373,561
-1.779,-9.5992,-1.7417,0.0159,-9.5992,0.0096,2.1546,2.1395,562
-1.7728,-9.5984,-1.7435,0.021,-9.5984,0.0126,2.1618,2.1394,563
-1.7828,-9.598,-1.7618,0.0173,-9.598,0.0108,2.1622,2.1488,564
-1.7779,-9.5988,-1.7422,0.0176,-9.5988,0.0104,2.148,2.1357,565
-1.7684,-9.5984,-1.7483,0.0138,-9.5984,0.0082,2.1496,2.1392,566
-1.7715,-9.5997,-1.748,0.0137,-9.5997,0.0084,2.1691,2.1385,567
-1.8021,-9.5989,-1.7508,0.018,-9.5989,0.0104,2.168,2.1394,568
-1.7841,-9.5993,-1.7517,0.0209,-9.5993,0.012,2.1518,2.1425,569
-1.7628,-9.6004,-1.7414,0.012,-9.6004,0.0086,2.1535,2.1389,570
-1.7995,-9.5986,-1.7581,0.0259,-9.5986,0.0145,2.1505,2.1416,571
-1.7822,-9.5995,-1.7483,0.0243,-9.5995,0.0128,2.162,2.1393,572
-1.7797,-9.598,-1.7478,0.0214,-9.598,0.0134,2.1502,2.1366,573
-1.7635,-9.6002,-1.7476,0.0198,-9.6002,0.012,2.1377,2.1302,574
-1.798,-9.5994,-1.7483,0.0243,-9.5994,0.0136,2.1575,2.1379,575
-1.7834,-9.5989,-1.7489,0.0182,-9.5989,0.0105,2.1641,2.135,576
-1.7916,-9.5994,-1.7504,0.0185,-9.5994,0.0109,2.1591,2.1405,578
-1.7878,-9.6009,-1.7548,0.0239,-9.6009,0.014,2.1546,2.1416,579
-1.7777,-9.599,-1.7481,0.0222,-9.599,0.0135,2.1688,2.1418,580
-1.776,-9.6005,-1.7483,0.0219,-9.6005,0.0132,2.146,2.1302,581
-1.7739,-9.5988,-1.7506,0.0171,-9.5988,0.0105,2.1601,2.1358,582
-1.779,-9.5985,-1.7507,0.0186,-9.5985,0.0112,2.1547,2.1436,583
-1.7729,-9.6002,-1.7543,0.0159,-9.6002,0.0101,2.1618,2.1383,584
-1.8002,-9.5997,-1.752,0.0176,-9.5997,0.0103,2.1657,2.1414,585
-1.8051,-9.5999,-1.7599,0.0225,-9.5999,0.0134,2.1686,2.1424,586
-1.7802,-9.6001,-1.7533,0.0164,-9.6001,0.0095,2.1637,2.1372,588
-1.7871,-9.6003,-1.7577,0.0138,-9.6003,0.0084,2.1585,2.1383,589
-1.7871,-9.6025,-1.7622,0.0163,-9.6025,0.0097,2.1549,2.1398,590
-1.7877,-9.6003,-1.7656,0.0117,-9.6003,0.0063,2.1618,2.1425,591
-1.7878,-9.6,-1.7648,0.0186,-9.6,0.0104,2.1636,2.1397,592
-7.2491,-9.6494,-3.4376,2.8603,-9.6494,3.3098,20.6031,15.1885,593
8.6848,-9.3511,13.8103,3.6825,-9.3511,2.2712,15.7823,13.1509,594
-5.5052,-9.6924,-0.3728,3.5748,-9.6924,4.5695,7.3122,5.0194,595
-9.041,-9.7061,-1.9414,4.5328,-9.7061,5.7426,12.4012,6.7606,596
-25.2162,-9.6422,-16.7515,6.7857,-9.6422,4.8042,15.28,13.5183,598
-1.1623,-9.6766,2.788,1.7629,-9.6766,2.0377,6.1173,3.6523,599
0.597,-9.7109,0.9433,0.2113,-9.7109,0.3718,3.1445,2.6611,600
0.3124,-9.7038,0.5427,0.1831,-9.7038,0.3499,2.4113,2.2294,601
-0.5779,-9.6681,0.8648,1.0716,-9.6681,1.6339,3.5884,3.0876,602
-0.4518,-9.6976,1.6513,1.7086,-9.6976,1.5064,6.501,6.2038,603
0.2297,-9.6942,0.7906,0.4637,-9.6942,0.5982,2.8273,2.0851,604
-0.0114,-9.6774,0.2162,0.19,-9.6774,0.211,1.9274,1.8637,605
-0.1842,-9.7007,1.8258,1.2373,-9.7007,1.3363,5.2171,3.6776,606
-0.5242,-9.6918,0.5003,0.4877,-9.6918,0.6341,2.5364,2.0555,608
0.1402,-9.6916,0.8205,0.3327,-9.6916,0.4502,2.5419,2.2795,609
-1.3098,-9.6947,-0.0839,0.9049,-9.6947,1.403,2.6732,2.3461,610
0.9943,-9.6599,1.3578,0.2544,-9.6599,0.2286,5.0508,4.7195,611
-0.1282,-9.7176,1.1707,1.387,-9.7176,2.0653,4.6993,3.7053,612
-3.0318,-9.6746,4.3047,5.3288,-9.6746,6.7248,17.3587,11.6674,613
-6.721,-9.6828,-0.5994,4.8815,-9.6828,1.654,17.0847,12.9406,614
-5.7191,-9.7243,5.9936,6.7011,-9.7243,1.9377,47.4064,35.9476,615
-0.7036,-9.7388,0.5284,1.0886,-9.7388,2.304,18.1283,6.2026,616
-0.8509,-9.7588,0.6478,1.4403,-9.7588,5.6118,19.2193,17.7493,617
-0.5606,-9.746,2.6619,4.0478,-9.746,4.1186,19.3519,16.1465,618
-0.6319,-9.7466,1.835,2.7938,-9.7466,4.2185,16.9445,14.7788,619
-0.6737,-9.7726,4.3801,5.6457,-9.7726,2.869,18.3569,15.2232,620
-3.673,-9.7621,0.1664,2.2556,-9.7621,1.312,10.7841,7.3668,621
-5.7259,-9.7255,2.4662,3.8285,-9.7255,3.1742,33.1942,24.6333,622
0.6829,-9.8062,15.8661,11.3435,-9.8062,2.638,36.4532,27.05,623
1.1698,-10.0563,13.7907,6.8829,-10.0563,3.473,50.1996,37.3436,624
-1.9973,-10.0393,0.1339,1.6339,-10.0393,2.48,23.8648,18.9832,625
-5.1468,-9.7357,1.2115,3.4256,-9.7357,5.1298,19.0955,13.0625,626
-11.8737,-9.7727,1.8093,5.8129,-9.7727,3.9763,26.9396,14.2905,628
-4.0982,-9.7524,14.343,14.4431,-9.7524,6.3618,34.5603,24.5625,629
-2.6192,-9.5497,2.2391,3.333,-9.5497,2.6166,20.8193,17.6349,630
-2.6303,-9.8413,0.5426,2.8732,-9.8413,5.2583,20.6966,16.7458,631
-2.7034,-9.8833,-0.8383,1.2853,-9.8833,1.7695,9.3577,8.5715,632
-3.1276,-10.0511,7.7671,7.4792,-10.0511,6.4557,32.4322,19.8428,633
-2.518,-9.6576,-0.2254,1.2655,-9.6576,3.1553,23.147,16.9214,634
-16.3587,-9.7647,4.2784,14.0889,-9.7647,11.105,32.6734,21.1767,635
-10.8979,-8.9766,7.864,11.1646,-8.9766,14.5242,35.9816,21.2414,636
-0.508,-9.8879,3.0433,2.8285,-9.8879,5.1132,19.2597,11.279,637
-4.9562,-9.6759,2.2489,4.1823,-9.6759,4.4895,14.4637,10.1066,638
-9.1702,-9.8147,2.9422,5.7683,-9.8147,8.7588,19.9191,15.2988,639
-7.6708,-9.2815,0.756,4.9309,-9.2815,4.5282,12.4332,8.6288,640
-3.7962,-9.6033,8.4928,9.9569,-9.6033,7.7257,21.2621,18.0248,641
-5.1556,-9.8902,4.6668,7.1807,-9.8902,1.9547,20.5519,15.4475,642
-9.4942,-9.8361,15.3164,11.0761,-9.8361,2.1146,25.0418,20.0006,643
-7.3515,-9.9134,1.5836,5.1293,-9.9134,8.6668,31.5881,27.3611,644
-10.7243,-10.0293,12.1904,19.4589,-10.0293,11.2558,41.8752,26.1801,645
-4.6758,-9.2683,-0.4649,2.0298,-9.2683,4.1735,15.2242,12.8332,646
-7.601,-9.819,2.6314,7.0923,-9.819,4.2314,14.8063,10.6205,647
-7.509,-9.7344,-0.7309,2.3813,-9.7344,2.4258,14.9388,6.891,648
-9.8749,-9.7035,2.262,5.9749,-9.7035,7.4267,24.7457,15.5733,649
-2.4697,-9.9886,9.321,9.9555,-9.9886,5.0712,17.7897,14.8579,651
-5.2216,-9.8914,2.3402,5.7492,-9.8914,2.4732,13.9846,9.2061,652
-10.4819,-10.1287,2.8778,7.0581,-10.1287,5.7469,18.7521,11.6513,653
-8.1859,-9.8534,0.1177,5.1464,-9.8534,2.2639,15.4002,14.2696,654
-1.5335,-9.7491,3.6581,5.4957,-9.7491,3.6459,15.2497,9.8752,655
-2.292,-9.6473,0.2388,1.4609,-9.6473,3.8467,11.6974,8.9162,656
-1.153,-9.6962,6.5867,8.7177,-9.6962,7.9877,23.3354,16.761,658
-14.1454,-9.8265,6.8726,15.8755,-9.8265,10.511,30.4125,19.123,659
-8.1928,-9.6736,4.3314,9.4837,-9.6736,7.5361,22.8205,13.5881,660
-1.0735,-9.8672,3.6514,4.7502,-9.8672,2.2124,9.4632,8.4074,661
-2.1059,-9.6079,0.5382,1.957,-9.6079,4.4874,11.4169,8.9917,662
-1.0216,-9.8198,-0.271,0.5791,-9.8198,0.6405,7.1485,4.7158,663
-2.7294,-9.6939,1.3602,1.8035,-9.6939,2.8838,12.6638,6.7338,664
-1.1469,-9.8843,0.2809,0.5983,-9.8843,1.2489,9.4209,5.9979,665
-5.3523,-9.7225,6.0453,9.0105,-9.7225,4.2867,15.992,11.4578,666
-5.2848,-9.7424,0.0821,2.8153,-9.7424,5.0575,10.6906,7.0938,668
-6.9876,-9.7414,0.3417,3.3777,-9.7414,5.1563,15.1202,7.6307,669
-3.4755,-9.7374,0.2422,1.7263,-9.7374,4.9514,12.5981,8.8396,670
-7.3998,-9.7517,1.5147,4.4476,-9.7517,5.8713,13.1022,10.2288,671
-4.58,-9.7359,0.9842,2.4023,-9.7359,4.4933,8.7569,6.9764,672
-0.8575,-9.7103,0.245,0.7277,-9.7103,0.8804,7.6318,5.5328,673
-2.4275,-9.6487,1.2669,3.1696,-9.6487,1.3401,9.6236,8.6084,674
-2.0429,-9.3286,-0.1949,1.0823,-9.3286,1.2822,7.3586,5.0859,675
-8.4277,-9.7554,0.6637,3.9747,-9.7554,4.2691,13.3623,8.731,676
-0.4681,-9.5127,2.1311,2.159,-9.5127,3.3771,10.1324,7.6353,677
-2.3955,-9.7474,-0.0821,1.6085,-9.7474,2.2201,9.6487,6.8492,678
-2.8742,-9.7461,1.967,3.0544,-9.7461,6.4415,15.709,11.9521,679
-3.5318,-9.8243,1.6475,2.8741,-9.8243,6.9681,33.7132,23.22,680
0.4764,-9.7219,7.1293,4.8868,-9.7219,2.6615,17.1067,13.0111,681
-0.9656,-9.7673,0.0236,0.4239,-9.7673,1.51,14.3435,13.7782,682
-2.3196,-9.7813,-0.0806,0.8294,-9.7813,1.3546,6.2643,4.5458,683
-3.828,-9.7012,1.6819,3.1167,-9.7012,5.1265,10.8348,5.0735,684
-10.3703,-9.7347,-1.5793,3.4415,-9.7347,3.4748,10.4245,2.5385,685
-4.63,-9.717,-2.0741,1.3869,-9.717,0.857,4.3882,3.6276,686
-10.5546,-9.6822,-4.6839,3.4902,-9.6822,2.7542,8.0656,3.8612,687
0.2249,-9.729,1.7499,1.2654,-9.729,0.948,5.2571,4.7854,688
-0.2558,-9.7236,0.2455,0.3429,-9.7236,0.7055,2.5804,1.8571,689
-0.9401,-9.739,-0.4424,0.293,-9.739,0.6945,2.6815,2.5248,690
-0.4068,-9.7287,0.1006,0.3037,-9.7287,1.089,2.8697,2.2205,691
-4.4076,-9.7111,-0.4188,1.8734,-9.7111,3.2729,17.0178,8.7184,692
-6.2532,-9.7399,4.3799,4.7338,-9.7399,7.3647,28.8845,16.0375,693
-4.9072,-9.7917,0.0394,2.2543,-9.7917,2.7387,13.7697,6.3172,694
-8.1007,-9.7271,-1.3277,3.0478,-9.7271,3.931,8.4021,3.7064,695
-1.6789,-9.732,1.3534,2.0347,-9.732,1.2644,8.5568,7.4215,696
-2.0586,-9.718,-0.6203,0.7805,-9.718,1.2653,3.6065,2.1672,697
-1.8719,-9.7327,-1.3367,0.4798,-9.7327,0.5174,3.9295,3.6923,698
-0.0767,-9.7255,0.4797,0.4345,-9.7255,0.9166,3.1849,1.9414,699
-0.7646,-9.7223,-0.0883,0.3718,-9.7223,2.3752,12.3538,4.1044,700
-6.5027,-9.7418,1.4461,3.2682,-9.7418,5.4072,20.7454,13.2034,701
-4.2255,-9.6996,0.8182,2.2181,-9.6996,4.0922,20.1469,11.2812,703
-28.4692,-9.8847,21.0769,28.8409,-9.8847,25.4711,99.0346,36.2157,704
19.0411,-9.8886,34.2017,7.3065,-9.8886,1.7238,42.535,32.699,705
0.968,-9.6674,51.1881,37.2972,-9.6674,16.7048,68.3178,37.4986,706
-37.2926,-9.4273,-8.9417,13.0102,-9.4273,8.9925,55.0883,18.8065,707
-2.631,-9.8567,4.665,8.5357,-9.8567,3.8895,32.1065,28.2793,708
-49.8467,-9.9889,30.6861,47.967,-9.9889,4.1197,94.8716,64.9471,709
-13.7034,-10.071,29.6504,39.2282,-10.071,12.6635,47.9835,38.796,710
-61.03,-11.1735,-8.207,23.5354,-11.1735,9.5055,76.4211,46.2951,711
-8.9611,-9.83,10.1928,15.6547,-9.83,5.06,47.4417,28.7344,712
-6.2558,-10.2115,5.8214,9.7691,-10.2115,3.4509,22.4608,18.9639,713
-1.7065,-9.7768,0.9608,2.2636,-9.7768,5.2,16.3035,12.2149,714
-1.1619,-9.7892,1.3071,1.6047,-9.7892,4.2777,13.495,7.1695,715
-12.6725,-9.7595,-4.6101,5.9745,-9.7595,4.1704,17.4679,11.9034,716
-3.7737,-9.969,-0.1676,1.6326,-9.969,2.4879,16.4447,5.9853,717
-6.185,-9.8221,1.5887,4.6521,-9.8221,3.1617,14.33,9.9314,718
0.0,-9.941,12.1774,13.6339,-9.941,1.0812,19.4939,18.4376,719
-3.6343,-9.683,9.3779,8.8962,-9.683,1.7501,19.3064,18.1579,720
-7.9506,-10.003,0.1758,3.1531,-10.003,3.8623,17.9322,14.1482,721
-1.9432,-9.9766,2.835,3.7449,-9.9766,6.0194,17.5302,11.1671,722
-2.0903,-9.7583,0.1153,1.1203,-9.7583,1.8859,8.5911,5.1487,723
-1.1011,-9.7142,0.2116,0.8783,-9.7142,2.681,13.5496,3.8878,724
-3.2549,-9.7487,2.4108,3.5624,-9.7487,7.3351,19.1625,12.4279,725
-3.2696,-9.9667,1.778,4.0007,-9.9667,6.4353,27.7196,25.1044,726
-30.7812,-9.7779,29.4705,36.916,-9.7779,11.2123,51.7929,39.7532,727
-9.553,-10.1927,-1.044,6.7381,-10.1927,4.3369,46.3558,41.4037,728
-4.4152,-9.7821,8.9914,10.9676,-9.7821,6.8206,60.1805,51.6877,729
-2.6314,-9.7229,2.839,4.5506,-9.7229,2.6305,10.1932,6.391,730
-1.8724,-9.9702,4.3548,5.3183,-9.9702,3.8777,23.1864,15.6411,731
-8.3893,-9.5681,9.5602,11.8469,-9.5681,3.7656,23.5342,18.3963,732
-1.5547,-9.2523,-0.2435,0.6194,-9.2523,1.5663,6.8266,4.4367,733
-8.8325,-9.7244,3.7809,7.2013,-9.7244,4.5435,26.587,12.5459,734
-5.2838,-9.6429,1.6962,4.514,-9.6429,7.0842,26.4884,12.1976,735
-6.6777,-10.0469,0.8813,3.2416,-10.0469,3.6912,11.3123,8.3268,736
-4.5885,-9.6918,-0.5152,2.3722,-9.6918,2.9245,15.2816,10.2118,737
-5.1521,-9.2762,3.0358,5.7207,-9.2762,2.338,23.4327,15.6445,738
-1.7406,-9.5881,1.1598,2.074,-9.5881,2.914,22.0529,10.4312,739
-1.9775,-9.7885,1.3201,2.2151,-9.7885,2.6464,20.417,10.192,740
-4.8238,-9.7201,2.654,4.7815,-9.7201,7.0076,29.1901,10.7403,741
-1.5286,-9.5949,0.6343,1.5936,-9.5949,1.1515,16.1508,12.5279,743
-10.7783,-9.258,3.1758,7.194,-9.258,8.2298,43.6711,19.5165,744
-23.5512,-9.6834,0.5006,5.3363,-9.6834,4.537,54.0058,8.9875,746
-27.4716,-9.6169,1.2463,10.5522,-9.6169,5.5167,25.8637,9.1339,747
-15.3747,-9.6496,2.1161,9.8308,-9.6496,7.265,50.7661,19.0971,748
-13.4165,-9.3551,81.4603,72.8297,-9.3551,10.6969,67.6904,61.8376,749
-2.8323,-10.2224,54.1851,59.5495,-10.2224,22.6463,64.9066,47.8328,750
-7.3167,-9.9287,8.6847,13.4594,-9.9287,5.3697,29.0309,21.4705,751
-14.9032,-9.7149,8.6273,13.8732,-9.7149,12.0778,33.5315,13.7566,753
-8.7831,-9.1896,0.3363,5.127,-9.1896,6.1137,20.9095,10.85,754
-1.8498,-9.7451,-0.0813,1.3054,-9.7451,1.8365,14.3806,7.0567,755
-2.8369,-10.0945,-0.5004,2.5124,-10.0945,4.104,12.19,7.88,756
-8.8955,-9.4183,14.0506,18.5763,-9.4183,4.7617,44.2447,28.1408,757
-8.9193,-10.1424,5.0533,10.2278,-10.1424,3.778,23.1208,11.6014,758
-0.0586,-9.4382,2.0798,2.2921,-9.4382,2.6384,22.9585,14.6725,759
-8.1904,-9.6616,-0.2132,2.6569,-9.6616,3.2721,7.6417,4.3525,760
-1.7459,-9.6674,1.5962,2.0428,-9.6674,3.695,11.2199,7.5321,761
-21.6502,-9.6563,-7.1066,8.6971,-9.6563,7.9887,26.776,17.9056,762
-0.5704,-10.1504,4.403,3.5344,-10.1504,1.119,25.4572,17.763,763
-3.9741,-9.6309,1.4943,2.885,-9.6309,3.1001,12.7124,6.6176,764
-2.8532,-9.957,0.0881,2.105,-9.957,3.0442,8.6857,6.1846,765
-1.0689,-10.0213,2.1764,2.6418,-10.0213,1.8523,13.2901,9.3057,766
-3.3967,-9.7729,-0.417,1.1353,-9.7729,1.9638,20.8101,13.2678,767
-6.5903,-9.476,4.3419,9.9781,-9.476,2.5771,13.2802,11.4912,768
-1.4346,-9.4237,3.5453,3.6753,-9.4237,3.4026,27.8986,19.8792,769
-1.3222,-10.2192,5.3295,7.9766,-10.2192,6.7027,33.1373,24.2162,770
-6.2113,-9.6678,1.3634,5.3578,-9.6678,2.9225,21.0281,19.0534,771
-28.0066,-9.836,0.7812,9.9683,-9.836,4.0315,46.2898,20.4136,774
3.6176,-9.495,6.3124,2.0865,-9.495,3.0168,36.2544,19.9953,775
-8.1174,-9.7713,-0.897,3.5357,-9.7713,6.6744,36.3385,23.1049,777
-3.1696,-9.4173,0.9977,2.6421,-9.4173,3.8485,21.5148,14.3309,778
-12.0778,-9.608,1.5002,6.2186,-9.608,6.3271,16.9017,10.2534,780
-46.3506,-10.0915,2.5523,15.3991,-10.0915,7.7324,46.1209,22.3934,782
-2.5433,-9.9585,5.5405,6.4528,-9.9585,4.2137,49.0463,35.3834,784
-2.2719,-9.6889,0.6341,2.0136,-9.6889,2.2188,7.5799,5.9402,785
-13.0438,-9.5145,0.6986,7.7669,-9.5145,2.5005,20.9061,16.6109,786
-2.7044,-9.4759,7.1516,10.8288,-9.4759,10.0547,31.982,16.5834,787
-13.2773,-9.5669,-2.7677,4.5551,-9.5669,2.6822,12.2066,7.0074,789
-6.1456,-9.2979,1.9623,5.237,-9.2979,2.7731,18.6424,9.7482,790
-67.5237,-9.7394,2.486,36.735,-9.7394,13.0433,37.5786,23.0117,791
-16.5305,-9.5362,-3.3721,9.5842,-9.5362,5.1867,16.8682,11.8704,792
-13.0223,-9.6277,6.0074,14.4525,-9.6277,9.6111,30.1924,11.1382,794
-27.5995,-9.7258,-2.35,13.4698,-9.7258,5.7986,21.5081,12.252,795
-3.6346,-9.9452,0.676,5.5862,-9.9452,3.9508,18.0139,9.9164,796
-50.0935,-9.9772,25.3449,75.364,-9.9772,7.825,34.7305,27.3251,797
-5.7476,-7.3869,-1.6461,2.6345,-7.3869,1.4258,25.152,5.8096,798
-46.9121,-9.2401,-2.8926,22.017,-9.2401,4.4373,22.3458,13.0776,799
-25.4463,-9.8959,-1.7292,8.5738,-9.8959,6.1523,18.7864,11.1745,800
-6.3686,-9.9336,-0.6421,2.5225,-9.9336,4.079,15.4842,5.6849,801
-4.6369,-10.0626,5.4722,7.3022,-10.0626,6.0387,24.4654,19.407,803
-12.1336,-9.7541,16.6417,28.1563,-9.7541,9.883,38.3023,19.6599,804
-18.2765,-10.0641,-5.919,8.7678,-10.0641,5.9236,41.8226,38.3655,805
2.2406,-8.9923,38.5722,17.0678,-8.9923,2.8688,36.9161,34.7452,806
-8.6823,-9.5191,6.1675,11.9047,-9.5191,1.981,27.8806,18.0258,807
-10.5599,-9.2609,1.8896,7.5683,-9.2609,5.2251,19.1318,10.7078,808
-2.037,-9.5742,13.7516,20.7112,-9.5742,10.4699,26.5442,20.26,809
-7.3762,-9.5675,2.3021,9.061,-9.5675,8.1809,24.1602,19.4514,810
-2.1698,-9.7933,3.2603,4.6338,-9.7933,2.4843,17.3018,8.9065,811
-7.0691,-9.7121,1.098,3.6062,-9.7121,6.3026,17.9368,9.9709,813
-22.1991,-9.8266,5.3651,12.7354,-9.8266,5.5636,27.7474,24.7013,814
-26.7692,-9.321,16.9697,22.8548,-9.321,3.6924,48.1734,39.9081,816
-8.6429,-9.8831,3.1791,8.215,-9.8831,9.2402,37.2021,12.0622,817
-3.7487,-9.6667,2.847,5.8966,-9.6667,4.2835,18.4406,9.2365,819
-4.4347,-9.7324,0.2693,2.33,-9.7324,3.1125,17.3043,9.7678,820
-0.605,-9.6714,2.5045,3.1956,-9.6714,3.14,22.4423,11.2263,821
-1.705,-9.7846,1.3538,2.1033,-9.7846,0.6995,10.6731,7.9565,823
-11.7041,-9.7643,7.5825,9.1294,-9.7643,10.1107,37.0161,26.5467,824
-6.9545,-9.515,0.4978,3.7926,-9.515,4.7628,30.2114,13.9033,825
-2.4039,-9.6286,40.8434,39.3566,-9.6286,8.3592,42.7342,27.512,826
-3.028,-9.5698,1.453,2.7374,-9.5698,3.4116,9.8502,6.6144,827
-16.561,-9.1733,-1.1545,9.8891,-9.1733,3.5079,30.0166,18.3122,828
-11.4845,-10.3882,3.884,9.1434,-10.3882,4.6073,24.4223,18.5723,829
-29.2035,-9.718,0.5024,23.3701,-9.718,9.6563,32.0995,7.9616,830
-9.821,-9.8216,7.2311,13.43,-9.8216,11.9856,34.3965,23.7091,831
-9.4934,-10.0077,3.1517,6.6623,-10.0077,5.5638,20.2336,11.685,833
-3.461,-9.778,2.3136,3.5942,-9.778,3.6474,15.964,7.4123,834
0.3001,-9.7164,17.3082,14.7996,-9.7164,6.6967,19.8007,17.0563,835
-4.9558,-9.7452,3.4785,7.6011,-9.7452,6.1766,19.8241,11.5826,836
-3.0564,-10.116,3.8298,7.293,-10.116,5.9251,34.0479,11.2093,837
-1.2823,-9.6765,0.4407,1.3166,-9.6765,3.3737,8.5682,5.8998,838
-24.583,-9.5735,20.0084,36.7692,-9.5735,19.6222,53.3302,28.7304,840
-10.2383,-9.7928,1.9822,13.2578,-9.7928,5.1895,20.5105,10.3013,841
-17.7076,-9.4762,10.9584,27.5534,-9.4762,11.8848,36.3367,26.6367,842
-12.8912,-9.5185,6.0717,14.2524,-9.5185,7.9048,29.4938,18.7455,843
-12.7944,-9.3867,6.9011,15.024,-9.3867,6.409,31.6303,22.4182,844
-5.8175,-9.7457,0.326,5.6467,-9.7457,4.9786,12.1802,7.3511,845
-4.6828,-9.7081,1.5575,3.4528,-9.7081,4.2542,18.0031,8.957,846
-9.9974,-9.8008,-2.6513,6.0533,-9.8008,6.593,11.7573,7.314,847
-3.9281,-9.7564,1.5717,3.7669,-9.7564,5.9135,12.6784,10.7095,848
-7.3934,-9.8034,14.3016,19.0027,-9.8034,8.7138,39.0696,17.3905,849
-13.2619,-9.4915,3.6307,11.637,-9.4915,3.9958,31.3411,15.2093,850
-56.2441,-9.8439,49.48,82.1121,-9.8439,20.3223,58.4886,45.6365,851
-7.6033,-10.1466,7.4129,14.7565,-10.1466,11.5145,30.863,22.2029,853
-15.0568,-9.5736,-0.1713,8.722,-9.5736,2.619,26.1775,19.1996,854
-6.4823,-9.3994,1.6944,4.4855,-9.3994,4.5134,16.8391,12.1282,855
-4.1513,-9.5606,-0.3018,2.9045,-9.5606,3.5187,13.6804,7.4583,856
-12.0736,-9.4521,-1.0982,5.0142,-9.4521,2.722,17.7851,13.1095,857
-9.4591,-9.7134,5.2681,12.6699,-9.7134,3.83,18.5106,14.2736,858
-7.3792,-9.4011,2.7675,5.7351,-9.4011,1.0066,12.2494,9.3853,859
-5.9994,-9.5969,0.2686,2.9498,-9.5969,3.3517,12.4365,6.1812,860
-10.1506,-9.889,0.5905,10.4263,-9.889,5.1211,20.8717,16.6177,861
-7.6164,-9.7742,2.5839,5.2557,-9.7742,5.971,28.6009,13.9913,863
-4.4695,-9.6272,3.8244,5.0783,-9.6272,5.3997,21.7419,8.3079,864
-3.1804,-9.8633,5.0998,9.1788,-9.8633,3.2818,15.8937,8.1874,865
-7.4615,-10.0207,1.6699,6.9799,-10.0207,5.517,28.2665,20.758,866
-18.8104,-9.6115,1.1876,14.3816,-9.6115,7.7108,28.5318,19.7617,867
-4.7601,-10.5562,-0.1418,4.2927,-10.5562,8.9618,30.826,21.3581,868
3.6661,-9.833,12.2177,9.4113,-9.833,4.5412,22.81,15.7758,869
-4.4666,-8.9914,-0.9692,1.8407,-8.9914,3.0347,13.2656,8.7716,870
-7.2379,-9.4992,1.8963,8.2952,-9.4992,3.7013,13.2051,7.679,871
-0.3418,-10.0467,1.7871,1.8173,-10.0467,2.5091,9.7776,4.763,872
-2.831,-10.1206,0.0018,1.7435,-10.1206,4.563,9.4926,4.64,873
-2.3693,-9.5346,2.4163,4.442,-9.5346,5.7761,14.7159,10.5341,874
-14.4086,-9.7837,2.9692,10.8499,-9.7837,8.5576,23.7883,13.3407,875
-10.6789,-9.6243,1.2185,9.4988,-9.6243,9.9095,22.8977,13.5557,876
-2.6051,-9.8326,8.9267,13.6534,-9.8326,8.9974,24.9825,12.9398,877
-8.7257,-9.6724,3.4215,10.3284,-9.6724,6.6268,20.9249,14.1864,878
-3.5358,-9.576,0.4013,2.5833,-9.576,5.1144,12.5601,9.1752,879
-3.3655,-9.598,2.2587,5.1469,-9.598,6.7261,16.7654,11.2796,880
-7.3388,-9.7807,5.9562,12.0131,-9.7807,7.9679,23.4283,14.3402,881
-7.4333,-9.7822,3.9651,7.7289,-9.7822,4.9061,16.8993,12.5376,882
-9.8359,-9.8475,3.3304,7.2331,-9.8475,3.3919,23.1934,13.8725,883
-6.7626,-10.1578,6.0349,13.0644,-10.1578,8.9661,49.6024,40.5604,884
-14.6422,-9.6623,6.5665,11.9251,-9.6623,9.7529,39.4486,22.3315,885
-19.8296,-9.6575,-2.3833,6.2201,-9.6575,4.0605,26.838,17.652,886
-6.5976,-9.536,0.4197,6.2404,-9.536,3.7171,12.1616,9.7152,887
-2.3601,-9.8784,0.2548,1.3582,-9.8784,2.5433,8.7423,6.2231,888
-2.7008,-9.7308,1.0073,2.0194,-9.7308,2.5675,11.6957,10.5627,889
-5.2907,-9.7458,5.4141,9.1411,-9.7458,6.8201,36.8174,15.6145,890
-7.9367,-9.7031,-3.7557,2.9908,-9.7031,5.4504,34.6774,27.5965,891
-4.4278,-9.6724,3.4752,5.2439,-9.6724,7.052,47.5288,14.9663,893
-0.2779,-8.9398,9.4838,10.4374,-8.9398,8.0494,18.9325,16.0775,894
-6.7836,-9.9427,-1.8429,3.3703,-9.9427,4.0969,20.6109,12.7138,895
-3.2687,-9.539,0.0965,2.8766,-9.539,3.7744,11.2647,7.5096,896
-2.0254,-9.7453,-0.586,0.868,-9.7453,1.5056,20.8791,19.633,897
-4.2258,-9.9604,8.9827,8.9794,-9.9604,1.5569,32.6982,20.3904,898
-10.1622,-10.2912,0.1093,6.1567,-10.2912,6.2491,60.7703,58.2645,899
-20.5376,-9.3639,6.7667,19.2333,-9.3639,7.0644,42.2678,18.0821,900
0.13,-9.58,2.5185,2.0944,-9.58,4.529,14.901,10.7879,901
-10.7279,-9.8416,8.09,12.9432,-9.8416,8.4149,57.1988,22.4762,903
-96.0257,-10.364,8.6154,33.7934,-10.364,19.9123,123.2783,47.8604,904
-1.4685,-8.8902,47.8659,49.2917,-8.8902,9.8212,72.0892,31.5653,905
-2.3663,-9.5666,11.2077,10.652,-9.5666,1.5886,32.2643,29.8487,906
-26.1015,-10.0161,17.2776,23.3842,-10.0161,17.7671,63.5344,30.5813,907
-3.5152,-9.7325,1.4228,4.7073,-9.7325,4.3449,32.0499,27.6794,908
-3.0772,-9.797,0.1181,2.0322,-9.797,1.845,12.8454,9.147,909
-2.3811,-9.8307,0.0584,1.382,-9.8307,2.3241,27.859,15.146,910
-17.6769,-9.6916,-1.1925,5.7364,-9.6916,6.482,13.6808,8.2711,912
-10.5893,-9.8193,2.0373,6.2581,-9.8193,7.2119,22.1021,12.291,913
-8.2372,-9.694,-1.4285,5.5791,-9.694,5.2023,13.3767,9.2456,914
-25.6738,-9.6836,9.3966,19.9108,-9.6836,12.8167,45.3581,27.0903,915
-6.5653,-9.6627,6.7968,7.2829,-9.6627,2.5709,19.4028,14.8778,916
-7.5901,-9.5703,4.1853,9.2589,-9.5703,8.4541,19.2034,16.002,918
-10.9774,-9.9374,20.7251,22.5715,-9.9374,17.722,60.5653,26.2177,919
-8.3629,-9.674,-1.0809,3.3016,-9.674,3.1103,16.5515,10.0934,920
-3.6143,-9.8585,3.4087,6.6541,-9.8585,3.3546,37.7554,34.6474,921
-12.7498,-9.8461,10.6162,19.7426,-9.8461,14.6883,36.3872,23.2525,922
-3.8638,-9.7332,-0.3736,1.3181,-9.7332,1.6786,14.2003,11.2107,923
-10.1666,-9.2103,0.2092,6.4087,-9.2103,4.4377,20.9949,13.2103,924
-7.8081,-9.6384,-1.5983,3.6163,-9.6384,3.4829,13.7178,9.3463,925
-2.7944,-9.7485,3.652,6.5099,-9.7485,10.8375,19.5795,13.9619,926
-9.9701,-9.8212,-2.2311,4.3828,-9.8212,3.9233,27.4028,24.4985,927
-11.1616,-9.7938,0.5959,5.4436,-9.7938,3.5596,16.273,6.949,928
-17.6285,-9.6871,3.3109,10.5334,-9.6871,10.4208,47.6231,22.5029,929
-25.311,-9.7401,10.154,16.4397,-9.7401,9.5595,43.3146,17.8183,930
-6.8232,-10.0415,5.3782,8.8488,-10.0415,7.0658,25.1324,21.9506,931
-4.7913,-9.833,-0.2473,2.7048,-9.833,2.5731,15.7622,13.835,932
-1.644,-9.8174,0.8718,2.0829,-9.8174,2.9535,17.8599,11.7713,933
-0.3448,-9.6536,2.0518,1.9768,-9.6536,4.2382,8.6674,6.2372,934
-1.738,-9.6064,0.5266,0.8977,-9.6064,4.2111,9.3468,5.6751,935
-4.6017,-9.7798,2.8169,4.7876,-9.7798,6.1025,30.7963,13.1387,936
0.2005,-9.8694,0.9269,0.4702,-9.8694,0.7782,12.2578,9.5578,937
3.1954,-9.9971,5.107,1.8479,-9.9971,2.0176,16.3128,10.7948,938
-11.2066,-9.344,1.4106,4.874,-9.344,4.6489,27.4307,18.568,939
-16.941,-9.7212,0.2035,7.7202,-9.7212,6.246,51.8694,12.303,940
-12.3288,-9.8925,5.9716,14.742,-9.8925,7.8413,48.8379,18.6913,941
-16.3249,-9.6738,2.221,6.8584,-9.6738,7.2165,47.7666,23.807,942
1.8292,-9.7088,11.5715,5.147,-9.7088,1.9927,22.1735,15.7986,943
-10.5605,-9.3458,1.4118,8.6129,-9.3458,4.0082,27.5187,12.4519,944
-6.8661,-9.8594,2.628,5.649,-9.8594,4.2665,34.9323,16.2234,945
-4.6634,-8.9294,5.6609,8.3624,-8.9294,2.9577,17.6991,12.0091,946
-21.8534,-9.5817,6.1389,19.2572,-9.5817,8.647,47.0719,13.0649,948
-1.721,-9.8882,0.8117,2.4367,-9.8882,3.5805,12.4368,6.4846,949
-5.5949,-9.4741,0.8283,2.9348,-9.4741,1.6092,9.9777,7.121,950
-3.2886,-9.8508,1.8509,5.0434,-9.8508,3.2678,12.5536,7.3322,951
-0.3198,-9.9792,10.4397,7.3079,-9.9792,3.2869,16.8307,15.3846,952
-0.0232,-9.8979,0.6801,0.7789,-9.8979,1.5476,6.599,4.2156,953
-0.8521,-9.5501,0.1832,1.0564,-9.5501,0.7913,5.5259,4.6239,954
-8.4021,-9.7744,13.7013,22.6047,-9.7744,9.8584,32.0589,23.956,955
-0.7704,-10.1509,4.5066,4.2485,-10.1509,3.8554,39.7438,29.7644,956
-9.3521,-8.3869,1.1812,3.8696,-8.3869,5.2902,25.3489,15.5937,958
-6.3238,-9.7208,1.193,4.8523,-9.7208,7.0734,25.544,7.7141,959
-4.0698,-9.8005,0.8782,3.0933,-9.8005,4.3298,21.1432,12.5654,960
-9.108,-9.5999,1.1779,8.7693,-9.5999,11.7006,30.8812,12.8516,961
-4.2401,-10.1417,22.1802,43.587,-10.1417,14.9889,45.9212,39.8318,962
-9.604,-9.7705,1.0886,5.5542,-9.7705,6.4798,17.3466,15.6437,963
-2.1829,-9.7021,2.4226,3.339,-9.7021,2.6468,38.8982,18.6319,964
-10.8194,-9.4952,-0.3384,3.396,-9.4952,5.7773,24.7475,6.8424,965
-4.736,-9.7369,2.998,6.154,-9.7369,1.9951,16.1002,9.7245,966
-23.3714,-9.7439,5.6963,15.5544,-9.7439,10.684,23.8741,13.343,968
-6.1504,-9.6926,0.7815,4.5642,-9.6926,2.4341,11.4942,8.4573,969
-4.505,-9.5244,-0.7669,1.9111,-9.5244,2.233,13.2988,6.7108,970
-8.9381,-9.8954,7.9286,11.2258,-9.8954,8.2863,24.7022,12.4994,971
-16.6523,-10.0791,22.4896,35.6141,-10.0791,7.9477,37.2914,18.8768,972
-4.2503,-9.5607,0.0804,2.2523,-9.5607,5.6826,12.4517,10.5492,973
-2.5118,-9.7853,3.4389,5.3911,-9.7853,1.9182,11.2524,10.2709,974
-2.3342,-10.0,-0.1918,1.2572,-10.0,1.3158,6.2207,4.2484,975
-9.4472,-9.5892,2.3219,10.7304,-9.5892,10.2608,21.5321,14.9595,976
-16.6051,-9.7351,-0.3165,4.9733,-9.7351,4.7463,15.5014,7.0979,978
-6.9895,-9.5613,4.9125,8.0967,-9.5613,10.0466,24.6015,16.7662,979
-21.9052,-9.75,5.0655,12.189,-9.75,11.9077,26.0384,16.9766,980
-3.1245,-10.1275,2.3458,6.1995,-10.1275,2.8175,21.1258,14.86,981
-5.4921,-9.607,0.5098,4.5277,-9.607,2.7192,13.5522,7.572,982
-8.2283,-9.551,4.5043,9.2796,-9.551,7.8106,19.1276,10.999,983
-11.6968,-9.7797,-2.2258,5.156,-9.7797,5.5056,13.2278,5.103,984
-3.8335,-10.0815,7.2661,6.9997,-10.0815,4.6005,16.9444,14.4841,985
-3.9021,-9.7728,1.7129,2.2022,-9.7728,5.2932,12.8066,8.4904,986
-0.5731,-9.5876,0.1689,0.6233,-9.5876,1.0661,7.2132,2.9478,987
-6.5362,-8.9466,-0.3486,2.4418,-8.9466,2.7841,12.116,7.199,988
-6.2591,-9.7502,4.9733,9.3755,-9.7502,6.5961,18.9649,11.173,989
-3.3044,-9.3653,5.4967,7.35,-9.3653,1.827,17.665,14.8419,990
-0.3409,-9.7338,0.6691,0.8832,-9.7338,1.5126,8.4904,4.7047,991
-0.4526,-9.738,0.6524,0.6449,-9.738,1.1244,12.6465,5.5085,992
-5.8703,-9.7959,3.8814,7.3542,-9.7959,6.7412,25.4455,9.9322,993
-15.3624,-9.6617,3.7764,10.4598,-9.6617,5.677,20.6165,13.4309,994
1.0994,-9.8354,8.1807,4.1845,-9.8354,3.5688,31.8159,23.1233,995
-8.6695,-9.4943,4.8084,10.3909,-9.4943,4.0014,20.2068,9.2952,996
-3.6407,-10.2096,-0.2688,3.1435,-10.2096,1.6074,14.999,12.937,997
-8.9224,-9.5062,-0.0602,4.0753,-9.5062,5.5546,15.1611,8.627,998
-5.8476,-9.7286,1.221,4.0651,-9.7286,6.2654,17.834,8.9169,999
-0.7271,-9.592,0.443,0.86,-9.592,2.2234,9.457,6.1545,1000
-6.7266,-9.6488,-0.4248,4.2165,-9.6488,6.467,17.1236,13.6164,1001
-4.8123,-9.9086,-0.5502,2.5318,-9.9086,2.1636,8.9623,5.1259,1002
-6.1697,-9.634,7.4985,11.8488,-9.634,10.3151,25.1903,12.2361,1003
-5.5263,-9.7073,1.6466,5.7007,-9.7073,7.2258,17.5808,8.675,1004
-10.9655,-9.7949,2.8828,8.5262,-9.7949,7.9853,17.4958,12.0384,1005
-4.6509,-9.7159,0.7278,3.0638,-9.7159,3.9823,13.6819,9.8145,1006
-7.776,-9.5731,0.7289,4.3599,-9.5731,4.4355,13.4885,6.5627,1008
-4.3952,-9.1687,1.3081,3.4178,-9.1687,3.6427,12.3828,9.7542,1009
-0.3604,-9.5726,2.9982,2.9099,-9.5726,1.485,13.699,11.5066,1010
-6.9722,-9.6513,1.8436,6.489,-9.6513,3.7282,15.0159,11.874,1011
-10.8524,-9.8033,-1.1504,7.1074,-9.8033,4.5212,13.1705,9.7042,1012
-2.4078,-8.5288,1.4884,3.5276,-8.5288,5.7229,18.8256,11.5475,1013
-1.0892,-9.6288,1.1868,1.7596,-9.6288,4.0189,12.0083,9.7193,1014
-1.7955,-9.7871,0.3488,1.3254,-9.7871,4.2383,10.8591,8.3119,1015
-5.0026,-9.884,5.2075,9.0879,-9.884,7.1723,24.5352,15.8294,1016
-4.6526,-9.5837,0.3402,2.1286,-9.5837,3.5711,10.7617,6.4877,1018
-6.8875,-9.7075,0.5192,3.2769,-9.7075,3.645,17.9583,6.8501,1019
-0.1052,-10.0177,1.5725,2.2174,-10.0177,1.9982,10.7604,6.5687,1020
-8.192,-10.0606,3.9605,7.1175,-10.0606,5.9465,20.6506,11.8044,1021
-38.5591,-9.5876,0.577,17.2382,-9.5876,4.9638,22.6938,17.7808,1022
-1.7767,-10.0079,15.4983,13.4918,-10.0079,7.1403,33.2377,19.5607,1023
-18.7072,-10.0202,-1.7551,7.4237,-10.0202,5.7917,19.3722,16.2748,1024
-23.305,-9.796,6.8251,15.0293,-9.796,8.2914,31.8693,12.8812,1025
-5.3894,-9.6026,0.3609,3.9789,-9.6026,1.3937,7.9194,6.2362,1026
-11.2355,-9.7384,4.3241,8.7498,-9.7384,8.534,23.5172,12.0417,1028
-6.884,-9.5987,2.0402,6.2843,-9.5987,7.781,18.4308,11.5738,1029
-2.4743,-9.9036,0.973,2.5595,-9.9036,4.2465,13.9003,6.5081,1030
-7.5869,-9.1139,0.9071,5.9293,-9.1139,3.369,16.1618,9.2211,1031
-14.3733,-9.7281,3.4776,8.5166,-9.7281,7.0628,18.0981,9.4652,1032
-1.7642,-10.0083,1.8798,3.517,-10.0083,5.4227,16.359,10.9128,1033
-2.7782,-9.7883,2.976,4.6326,-9.7883,6.7729,16.8905,13.4723,1034
-13.152,-9.7214,1.1608,5.3965,-9.7214,4.0257,20.4291,5.0207,1035
-13.1517,-9.8513,3.6248,14.6122,-9.8513,8.7867,18.2396,15.0058,1036
-8.2718,-9.6715,-3.5665,3.3883,-9.6715,6.1251,20.2379,16.1283,1037
-7.968,-9.2628,5.2709,8.7848,-9.2628,7.3806,21.8087,11.0685,1038
-3.5304,-9.7435,2.555,3.2896,-9.7435,5.1524,13.9747,9.011,1039
-9.6892,-9.6909,0.2958,3.3459,-9.6909,3.2233,16.7836,6.9625,1040
-1.1573,-9.8194,1.7932,2.4293,-9.8194,4.4644,8.8421,5.8759,1041
-19.8407,-9.9279,-1.5894,17.6657,-9.9279,9.4923,18.1009,14.7271,1042
-1.6229,-9.7994,0.6404,1.4896,-9.7994,2.9669,12.2031,4.6039,1043
-1.7291,-9.8343,0.1751,0.769,-9.8343,1.7481,9.8671,6.6658,1044
-2.3518,-9.7545,0.4121,3.1843,-9.7545,1.1627,8.6485,6.7161,1045
-8.9768,-9.7209,2.7465,6.4061,-9.7209,6.7752,26.2389,16.0678,1046
-5.3292,-9.8577,2.3171,4.7483,-9.8577,2.2187,11.0581,9.689,1047
-16.4602,-9.782,1.3268,8.7694,-9.782,5.8919,31.5958,11.5163,1048
0.1094,-9.8264,9.1645,6.3683,-9.8264,6.1072,25.9291,22.48,1049
-4.0774,-9.7466,1.8158,3.5955,-9.7466,1.3206,12.954,8.0168,1050
-5.2294,-9.0671,5.9191,9.8474,-9.0671,5.5584,22.2062,10.6847,1051
-3.1637,-9.6772,0.9128,3.1854,-9.6772,4.327,10.2747,9.0263,1052
-3.0983,-9.8154,11.7826,11.8551,-9.8154,7.6058,30.7952,18.0935,1053
-21.5937,-9.4846,4.9933,14.8378,-9.4846,5.3556,17.3879,13.4831,1054
-32.4892,-9.75,1.6382,21.189,-9.75,7.8646,22.3181,12.921,1055
-43.512,-9.6959,14.3011,46.4347,-9.6959,4.5614,31.158,21.9674,1056
-45.225,-9.62,5.3095,16.6905,-9.62,9.309,25.934,13.5301,1058
-7.2595,-9.6143,8.1975,11.832,-9.6143,8.9269,22.3386,16.8778,1059
-10.5358,-9.6512,0.6796,6.9606,-9.6512,4.6657,16.6862,9.3243,1060
-1.7004,-9.9219,6.0296,7.5781,-9.9219,3.7641,12.7102,10.7407,1061
-4.8054,-9.4127,1.3157,5.0649,-9.4127,2.1105,13.6285,10.8492,1062
-3.2751,-9.7821,3.9267,5.8433,-9.7821,3.1789,13.0925,10.7133,1063
-15.3414,-9.4327,1.3673,13.5616,-9.4327,6.4988,20.5229,14.7925,1064
-10.6922,-9.2726,3.256,9.093,-9.2726,4.0761,17.0067,10.5994,1065
-0.6688,-9.9544,2.3649,3.0097,-9.9544,6.588,16.7509,9.0229,1066
-3.9522,-9.7041,4.3047,5.5342,-9.7041,6.5954,18.5778,10.3411,1068
-23.8302,-9.7349,1.1669,6.276,-9.7349,7.5995,17.18,12.2092,1069
-3.1198,-9.6318,3.4147,5.5024,-9.6318,1.5094,9.5525,8.9876,1070
-2.8632,-9.9786,-0.3296,1.7283,-9.9786,2.113,6.8542,3.5209,1071
-4.7953,-9.9963,0.2336,2.7266,-9.9963,3.9852,19.7225,3.9414,1072
-5.158,-9.8098,0.3381,3.5072,-9.8098,4.823,10.2802,7.8659,1073
-4.9086,-9.7043,0.7961,5.5022,-9.7043,1.7996,12.1656,7.9128,1074
-3.547,-9.675,1.3133,2.8574,-9.675,3.4129,11.8464,7.5319,1075
-8.2335,-9.0531,6.5297,9.8964,-9.0531,3.6351,20.584,12.6129,1076
-8.897,-9.6244,0.8816,3.2363,-9.6244,4.2468,13.2923,6.8332,1078
-7.1453,-9.4157,3.5414,8.19,-9.4157,6.8538,17.5616,8.7498,1079
-17.5012,-9.3518,2.7268,11.5101,-9.3518,1.8345,16.1655,10.7045,1080
-1.2249,-9.7132,1.6766,3.7435,-9.7132,3.4794,12.5339,8.0504,1081
-3.0478,-9.9114,1.3197,2.5708,-9.9114,3.4028,9.4554,6.3226,1082
-7.2015,-9.8138,2.6886,6.4051,-9.8138,5.9473,16.8397,7.6417,1083
-0.7367,-9.3101,3.5483,2.7384,-9.3101,2.7949,14.5616,9.1307,1084
-3.4888,-9.6025,2.4629,3.2364,-9.6025,5.5526,13.7103,8.3322,1085
-9.3678,-9.6821,0.3598,6.1404,-9.6821,2.9193,15.1846,10.1508,1086
-2.707,-9.5732,2.3562,3.5613,-9.5732,5.9691,19.3108,6.3126,1088
-7.0905,-9.8033,2.7069,5.9813,-9.8033,5.6901,15.9329,8.3845,1089
-0.1707,-9.4658,44.7328,45.9319,-9.4658,19.1542,47.3202,39.5598,1090
-1.1026,-9.5318,9.5161,17.5421,-9.5318,8.0655,25.8255,11.5668,1091
-1.761,-9.6497,0.4434,1.4878,-9.6497,2.6461,7.3663,6.138,1092
-3.2031,-9.2843,4.7924,5.1149,-9.2843,8.3342,19.9897,17.5858,1093
-6.8904,-9.7415,0.6358,5.1412,-9.7415,5.3149,14.2981,7.8291,1094
-1.8116,-9.6833,-0.6627,0.8222,-9.6833,1.8931,7.0612,4.1524,1095
-8.6525,-9.6136,-0.5948,3.9166,-9.6136,6.0061,16.7233,10.4285,1096
-6.532,-8.8262,5.2937,8.7745,-8.8262,4.6489,15.23,11.331,1097
-5.6909,-9.7253,3.1964,4.4735,-9.7253,6.5359,23.0063,10.2462,1098
-7.7051,-9.7107,0.3265,2.9368,-9.7107,3.2359,16.0048,5.6058,1099
-3.0101,-8.6601,0.1284,2.1543,-8.6601,3.8665,9.7368,6.4197,1100
-3.1487,-9.9515,1.5642,2.6628,-9.9515,5.9941,14.148,11.2443,1101
-13.5255,-9.1902,4.7192,12.173,-9.1902,3.7375,19.5728,12.3464,1102
-6.0241,-9.412,-0.7318,2.0568,-9.412,4.4309,13.5633,8.0009,1103
-0.7293,-9.4113,0.3702,1.0703,-9.4113,1.6558,6.763,4.2741,1104
-3.9851,-9.7377,-0.3627,1.6919,-9.7377,2.3336,9.1009,5.3561,1105
-7.1929,-9.7891,2.0845,4.9475,-9.7891,3.8716,13.047,7.368,1106
-3.1144,-9.6264,-1.222,1.487,-9.6264,1.9086,10.6406,5.7714,1107
-1.9694,-9.5979,3.6503,5.6685,-9.5979,6.9968,15.5257,10.2889,1108
-8.9359,-9.3378,1.8105,4.8232,-9.3378,5.8717,18.3104,8.0177,1109
-5.142,-9.5737,2.1597,4.8292,-9.5737,8.1431,16.4303,9.5457,1110
-4.1065,-9.8733,1.1212,2.5874,-9.8733,3.4371,12.7634,6.6186,1111
-4.6509,-9.6107,-0.0569,3.3513,-9.6107,2.5698,8.1394,6.4423,1112
-18.0865,-9.4272,18.3402,37.0966,-9.4272,8.2638,26.7223,21.5127,1113
-6.952,-9.1233,4.225,8.8358,-9.1233,5.0083,13.8386,10.6327,1114
-5.0615,-9.7926,3.4434,5.6484,-9.7926,6.845,15.3648,11.2708,1115
-3.697,-9.6864,1.1934,3.8386,-9.6864,2.8171,14.7054,12.0791,1116
-10.4485,-9.2698,0.6777,3.459,-9.2698,4.6156,16.7568,6.8569,1118
-17.034,-9.6997,11.828,18.1837,-9.6997,13.5265,35.0902,17.9399,1119
-12.347,-9.6909,3.9421,13.3097,-9.6909,8.3696,27.3479,13.7008,1120
-1.4576,-9.7544,3.502,3.8741,-9.7544,4.6173,13.4321,8.9119,1121
6.7872,-9.9138,44.3006,26.4607,-9.9138,6.6394,43.9873,38.1446,1122
-9.584,-9.8594,1.7712,8.8118,-9.8594,8.5099,28.6769,23.2863,1123
-35.7192,-9.753,41.9518,56.428,-9.753,24.6103,63.9046,56.0519,1124
-5.7524,-8.9892,7.8637,9.3673,-8.9892,5.5335,30.2915,14.157,1125
-7.4777,-9.4682,5.5251,11.1208,-9.4682,1.6552,15.8311,12.0432,1126
-9.4384,-9.5911,2.0438,7.2726,-9.5911,6.8243,22.9039,11.544,1128
-2.2908,-9.6721,0.1741,1.5621,-9.6721,1.2504,8.3519,4.8684,1129
-3.226,-9.6021,2.392,6.1493,-9.6021,5.7134,18.0664,10.3398,1130
-0.6844,-9.7163,1.3797,1.3295,-9.7163,3.6969,11.9985,6.9805,1131
-5.509,-8.4533,16.4647,17.1624,-8.4533,7.83,25.6551,20.0918,1132
-10.8362,-9.9822,2.8744,13.8865,-9.9822,7.4974,15.7949,13.7707,1133
-3.1508,-9.5625,0.1135,2.2192,-9.5625,1.4439,10.0981,7.1488,1134
-2.0242,-9.574,-0.0102,0.9495,-9.574,1.8126,9.0919,4.9033,1135
-4.5186,-9.6585,4.6948,7.2103,-9.6585,5.9097,16.0393,13.8113,1136
-6.7591,-9.1352,0.4427,2.2821,-9.1352,4.0395,11.2618,6.2974,1138
-5.2906,-9.3289,2.0303,4.0661,-9.3289,6.6914,15.8961,10.0209,1139
-0.8719,-9.9291,0.8287,1.2189,-9.9291,2.479,7.2462,5.3671,1140
-1.0022,-10.0456,-0.1334,0.733,-10.0456,1.8412,4.9906,3.7281,1141
-6.3463,-9.4153,7.3482,12.2598,-9.4153,4.0641,23.6127,20.6036,1142
-13.9838,-8.6323,-1.7709,7.9056,-8.6323,3.9838,21.5387,17.0597,1143
-0.8093,-8.6774,6.83,5.8747,-8.6774,2.0285,18.6144,13.5807,1144
-21.978,-8.9041,16.1589,29.8971,-8.9041,19.9882,87.3341,60.0067,1145
-21.9943,-10.3999,55.0945,63.7548,-10.3999,17.9035,96.3634,63.6776,1146
-18.2072,-9.4528,11.8022,27.9889,-9.4528,8.6905,54.1248,43.5642,1147
-40.5082,-9.7106,26.0571,39.6751,-9.7106,19.1765,82.1941,36.8346,1148
1.035,-9.8436,7.0864,4.1734,-9.8436,2.1451,33.604,19.7018,1149
-2.9812,-9.7316,1.6699,2.615,-9.7316,4.1463,38.3052,30.1072,1160
-6.2552,-9.7876,0.6616,3.5929,-9.7876,3.1282,47.4299,25.2229,1161
-0.3007,-9.688,0.3273,0.5677,-9.688,1.4739,28.1013,26.6913,1162
-6.9801,-9.7205,-2.655,2.9432,-9.7205,1.2531,5.9276,4.1639,1163
-4.2903,-9.6742,3.797,3.4196,-9.6742,2.8078,6.9245,4.6967,1164
-0.8227,-9.7294,0.8579,1.4282,-9.7294,2.7678,6.5109,2.8398,1165
0.5374,-9.7039,1.7442,0.8519,-9.7039,0.8583,3.9584,2.7483,1166
-0.3432,-9.7298,0.6057,0.7389,-9.7298,3.1641,5.0816,3.22,1167
-0.1961,-9.7201,0.0138,0.1303,-9.7201,0.2674,1.8784,1.8308,1168
0.2911,-9.7386,0.6971,0.2539,-9.7386,0.2153,2.9053,2.6585,1169
0.1099,-9.7397,0.602,0.2766,-9.7397,0.3018,3.3648,3.0131,1170
0.0624,-9.7484,0.0873,0.0169,-9.7484,0.0785,1.9617,1.8646,1171
-0.5062,-9.7407,0.055,0.2234,-9.7407,0.8759,3.518,2.0452,1173
0.2531,-9.7361,0.5479,0.1902,-9.7361,0.149,2.9349,2.6284,1174
-0.0161,-9.7379,0.1734,0.095,-9.7379,0.2919,2.3006,2.1505,1175
-2.237,-9.7276,-0.2016,1.0804,-9.7276,2.276,4.3386,2.6527,1176
-0.1596,-9.7365,1.1587,0.9136,-9.7365,1.2158,5.2264,3.9055,1177
0.0109,-9.723,0.2302,0.1667,-9.723,0.3711,2.2395,1.9734,1178
0.6424,-9.7382,0.8497,0.1246,-9.7382,0.1392,3.1069,2.9662,1179
-0.0839,-9.7324,0.3914,0.2818,-9.7324,0.6349,2.7328,2.047,1180
0.3476,-9.7361,0.5077,0.1063,-9.7361,0.2324,2.6338,2.277,1181
-15.5721,-9.6768,-2.2055,4.1209,-9.6768,2.6354,8.1062,2.6289,1183
-0.6601,-9.6099,0.1237,0.4108,-9.6099,0.2634,1.9819,1.8686,1184
0.2158,-9.5963,0.8092,0.3305,-9.5963,0.2093,2.0662,1.9171,1185
3.1107,-9.6294,7.2011,2.2134,-9.6294,1.7164,7.7447,5.7882,1186
-9.7892,-9.7044,-2.2648,4.316,-9.7044,4.2073,6.7712,4.7555,1187
2.0971,-9.6367,4.3455,1.3744,-9.6367,0.9528,4.5284,3.6386,1188
0.0217,-9.6743,0.2592,0.2431,-9.6743,0.2346,1.992,1.8018,1189
0.4678,-9.6843,1.4341,0.8757,-9.6843,0.8074,3.2725,2.1428,1190
-0.0021,-9.6633,0.8864,0.9383,-9.6633,0.7386,2.6184,1.9592,1191
-0.0682,-9.7276,0.9215,0.7133,-9.7276,1.2888,4.093,2.5079,1192
0.3413,-9.7085,1.4965,0.8076,-9.7085,1.1133,4.5134,2.5976,1194
-0.5373,-9.7326,0.4311,0.9877,-9.7326,1.7769,4.9571,2.13,1195
-0.1678,-9.712,0.5878,0.564,-9.712,0.8198,2.7029,1.9753,1196
0.311,-9.7276,0.804,0.3325,-9.7276,0.4927,3.3311,3.2576,1197
0.008,-9.7331,0.7172,0.8124,-9.7331,1.1285,4.5009,3.3332,1198
0.2594,-9.7482,2.0823,1.1536,-9.7482,0.2349,9.9967,8.958,1199
-13.3929,-9.7771,-1.8555,3.4793,-9.7771,2.3319,22.5252,14.9879,1200
-1.3137,-9.7414,0.1837,1.0898,-9.7414,3.2552,23.1375,17.2008,1201
-1.2038,-9.7387,0.9005,1.4887,-9.7387,2.4763,19.8067,9.2665,1203
-3.2989,-9.8541,1.0054,2.8053,-9.8541,4.2681,13.4419,7.108,1204
-1.7002,-9.1588,-0.1109,1.2811,-9.1588,1.1944,12.0552,9.8132,1205
-6.376,-9.8461,17.4406,14.4326,-9.8461,2.0905,27.6894,23.7647,1206
-2.8424,-9.5654,12.4462,10.4589,-9.5654,2.2941,30.6041,18.3896,1207
-22.2628,-10.0938,-9.1102,10.7958,-10.0938,4.5072,27.0535,18.532,1208
-38.7444,-10.8808,6.2086,26.4011,-10.8808,20.2496,93.4326,85.4674,1209
-4.7494,-9.9137,11.8011,10.1212,-9.9137,6.6797,31.4861,19.7836,1210
-19.8424,-9.7873,4.5859,12.454,-9.7873,10.9931,37.4489,21.8601,1211
-3.6888,-9.7642,15.1255,13.5555,-9.7642,11.6459,28.5459,22.2804,1212
-4.209,-9.844,19.7832,17.5268,-9.844,18.5983,43.4137,27.7825,1213
-9.8447,-9.6003,2.1201,6.374,-9.6003,7.9548,30.6819,22.3555,1214
-5.8234,-9.9222,0.1591,2.644,-9.9222,3.7917,15.5584,8.3233,1215
-5.5314,-9.7858,-0.3471,2.7795,-9.7858,3.4012,18.3511,15.8858,1216
-0.0272,-9.9066,2.4751,1.899,-9.9066,2.6374,48.9588,46.874,1217
-2.0439,-9.7644,0.154,1.7999,-9.7644,1.6284,45.4707,42.7603,1218
8.2147,-9.7353,24.3735,13.1821,-9.7353,2.7696,33.8887,21.5765,1219
0.1694,-9.0788,3.827,4.9791,-9.0788,3.8631,14.994,13.6172,1220
-18.6398,-9.7142,15.4586,24.9899,-9.7142,5.3052,31.5187,22.0335,1221
-16.6299,-9.7129,-3.9415,6.8056,-9.7129,4.7337,24.2153,19.3363,1222
-23.7418,-9.903,19.039,25.2458,-9.903,18.3491,43.0562,28.7175,1223
-25.1949,-9.6681,11.2846,24.6196,-9.6681,17.2954,47.0182,25.1195,1224
-3.0641,-9.6169,1.7683,4.1802,-9.6169,4.7876,19.7764,14.0078,1225
-1.1818,-9.474,0.1219,2.2252,-9.474,1.7442,10.8386,7.1483,1226
-4.3692,-9.5469,1.7075,2.8635,-9.5469,2.8614,9.7707,6.5292,1227
-9.5004,-10.1426,35.8753,26.267,-10.1426,3.9892,35.7893,31.1986,1228
-10.244,-9.9202,11.9199,18.8037,-9.9202,6.7471,21.8728,18.3544,1229
-8.7791,-9.7943,0.6124,5.523,-9.7943,2.2306,16.8428,12.3848,1230
0.2549,-10.2723,1.4091,1.2555,-10.2723,1.3526,10.6417,10.0189,1231
-16.2716,-9.7864,1.4029,7.0762,-9.7864,7.0399,23.0372,12.7252,1233
-3.978,-9.8551,1.7649,5.3581,-9.8551,6.2526,14.7692,10.799,1234
-12.8322,-10.5863,3.0476,12.6334,-10.5863,7.1839,26.9641,21.6434,1235
1.6154,-9.799,4.7027,2.5407,-9.799,1.434,13.8518,11.771,1236
-5.617,-9.0429,2.5358,5.6263,-9.0429,2.4667,16.9583,12.2148,1237
-0.5646,-9.9796,0.016,0.4712,-9.9796,0.9812,12.6825,7.3535,1238
-1.5815,-10.3626,0.3492,0.9738,-10.3626,1.2108,7.1181,3.7992,1239
-3.8585,-9.8596,2.7872,5.9909,-9.8596,6.8663,26.1298,16.5708,1240
-4.5535,-9.8417,-0.8804,2.2558,-9.8417,5.1324,22.9796,18.946,1241
-12.0977,-9.7802,1.0349,3.9671,-9.7802,5.3238,32.2753,8.8579,1243
-15.6392,-9.7862,0.9699,6.6779,-9.7862,7.223,39.5471,27.2081,1244
-7.0276,-9.7489,4.0371,6.0943,-9.7489,8.3922,29.3827,18.9493,1245
-3.8721,-9.5632,6.1556,8.4342,-9.5632,3.0702,33.9143,30.4922,1246
0.6488,-9.5323,15.1996,10.4939,-9.5323,3.0694,37.0548,20.5192,1247
-6.0912,-9.6342,0.1456,4.0163,-9.6342,5.1325,18.1342,12.591,1248
-5.0545,-9.9805,1.4575,5.5231,-9.9805,4.7918,35.9321,32.1942,1249
-1.2321,-9.7984,2.0267,2.7796,-9.7984,2.6398,36.5788,30.6341,1250
-3.542,-9.6432,0.4972,2.2713,-9.6432,4.3159,35.1144,29.6165,1251
-7.2079,-9.523,1.568,9.0341,-9.523,2.9136,13.3468,6.2566,1253
-9.2918,-9.8396,20.9192,26.8475,-9.8396,12.5452,49.1181,27.9573,1254
-11.3467,-9.103,43.1847,50.8319,-9.103,16.1302,67.6084,64.9817,1255
-22.3472,-9.6071,10.1834,15.3293,-9.6071,3.6335,30.6967,23.9104,1256
-4.1989,-9.578,7.9928,10.1477,-9.578,4.4761,24.7247,21.5746,1257
-2.3056,-9.8103,2.6898,9.2151,-9.8103,4.1451,15.4287,6.251,1258
-4.8803,-9.7329,0.9338,3.5291,-9.7329,4.0515,13.1461,11.2593,1259
-1.3451,-9.8266,22.9788,13.4594,-9.8266,2.0692,29.9933,24.0288,1260
-8.7089,-9.6557,-0.9829,3.2805,-9.6557,2.9855,20.6831,10.7109,1261
-6.7408,-9.8519,1.1427,4.4221,-9.8519,6.9997,15.8003,12.2742,1263
-22.4674,-9.9989,15.2828,25.0713,-9.9989,14.5703,43.53,38.1657,1264
-19.5703,-9.7098,10.9883,24.2291,-9.7098,15.5885,53.2061,22.5928,1266
-13.6238,-9.6678,14.4234,22.037,-9.6678,20.5076,38.0541,26.8375,1267
-17.6149,-9.0853,14.4243,27.2084,-9.0853,11.605,41.3439,24.8697,1268
-2.4323,-9.9213,0.0,1.9913,-9.9213,3.8902,12.7277,9.4951,1269
-3.3926,-9.8817,0.731,4.3219,-9.8817,4.5043,17.5514,12.2662,1270
-7.3025,-9.7107,7.8572,14.3318,-9.7107,11.7135,26.7768,21.2593,1271
-5.8745,-9.6116,4.4921,6.7722,-9.6116,8.961,28.574,21.8977,1273
-1.0349,-9.6478,3.4258,3.63,-9.6478,3.4068,15.2551,11.7618,1274
-4.9026,-9.4373,4.4496,9.8762,-9.4373,1.196,19.5252,14.5898,1275
-0.753,-9.6915,5.3164,9.6394,-9.6915,7.94,20.5196,17.3037,1276
0.0967,-9.7045,7.8769,8.311,-9.7045,6.1384,22.9495,13.9295,1277
-1.4695,-9.7211,0.09,1.058,-9.7211,1.5989,13.8387,10.895,1278
-40.574,-9.7711,-9.3738,14.0976,-9.7711,5.1582,27.5208,14.0067,1279
-33.7205,-9.7527,1.3019,9.9625,-9.7527,4.4698,53.1454,23.0898,1280
-5.8461,-9.6966,4.6709,12.2341,-9.6966,4.5842,28.403,8.8815,1281
-6.0193,-9.8519,3.9138,7.6836,-9.8519,5.3597,51.7219,25.2872,1283
-8.4369,-9.7857,8.2377,15.463,-9.7857,3.0321,31.4065,28.4131,1284
-20.0383,-9.3164,7.4073,14.2678,-9.3164,9.0033,46.2812,37.0708,1285
-4.1113,-9.8893,10.5433,8.7308,-9.8893,10.4851,24.5674,17.9219,1286
-8.3379,-9.3039,10.5322,14.4119,-9.3039,7.6893,44.3811,38.5262,1287
-20.2099,-9.8111,8.3522,17.6626,-9.8111,7.0047,26.8601,23.1782,1288
-83.9882,-9.8002,1.7924,23.2846,-9.8002,9.9814,93.4795,60.6604,1289
-21.22,-9.8199,-0.8656,9.2485,-9.8199,8.5724,64.6974,55.0746,1290
-13.8468,-9.7362,-0.6897,7.133,-9.7362,6.9775,14.2428,7.9175,1292
-3.2965,-9.7519,1.6016,2.2525,-9.7519,2.5078,8.2272,4.8321,1293
-4.7413,-9.7493,0.4367,2.6178,-9.7493,3.1629,9.459,4.7378,1294
-17.4247,-9.7142,-4.4985,4.4148,-9.7142,1.9771,10.2097,6.8773,1295
-11.5959,-9.6737,-0.9951,6.3537,-9.6737,4.4331,7.1726,3.5459,1296
-23.7989,-9.674,0.779,15.601,-9.674,10.2935,22.4267,6.9689,1298
0.0618,-9.7275,0.7082,0.3849,-9.7275,0.5511,3.0245,2.3589,1299
-0.6439,-9.7355,-0.2558,0.2373,-9.7355,0.5484,2.3134,2.0494,1300
-2.0931,-9.733,-0.7123,0.6124,-9.733,1.0461,4.7757,2.7167,1301
-7.0808,-9.7148,-1.4159,2.3925,-9.7148,2.805,5.6225,2.7734,1302
-0.4226,-9.7329,0.0976,0.2615,-9.7329,0.4684,2.0812,1.9398,1303
-0.9793,-9.7339,-0.6417,0.1609,-9.7339,0.2843,2.5617,2.1716,1304
-0.5266,-9.7349,-0.3174,0.1368,-9.7349,0.2626,2.1196,1.9821,1305
-0.5215,-9.7371,-0.3929,0.1333,-9.7371,0.2416,2.1599,2.0463,1306
-0.8591,-9.7374,-0.6024,0.2111,-9.7374,0.4249,2.5708,2.2669,1308
-0.3931,-9.7371,-0.2345,0.0573,-9.7371,0.1406,2.0612,1.9438,1309
-0.3945,-9.7396,-0.3177,0.0356,-9.7396,0.0928,2.1273,2.032,1310
0.302,-9.7418,1.4717,0.76,-9.7418,2.369,7.3636,4.3649,1311
-4.2227,-9.7336,-0.069,1.902,-9.7336,5.2788,8.0988,5.2771,1312
-23.0678,-9.7038,-6.4367,6.2223,-9.7038,1.8579,13.6524,8.8149,1313
-23.3054,-9.669,1.9249,9.9095,-9.669,5.7783,10.7361,5.7516,1314
-90.2845,-9.6622,-0.4653,23.739,-9.6622,11.1658,24.5166,11.3394,1315
-58.117,-9.6631,-4.0546,14.1663,-9.6631,7.734,36.4037,28.851,1316
-5.3368,-9.7037,1.9311,6.4235,-9.7037,3.454,30.2693,28.1877,1317
-7.5597,-9.7549,0.0135,4.6131,-9.7549,3.8803,18.014,10.5693,1318
-15.5551,-9.7159,-0.5595,6.0646,-9.7159,8.276,21.0603,16.8075,1319
-1.1431,-9.7298,0.007,0.559,-9.7298,1.3797,12.5066,11.18,1320
-10.6357,-9.7451,0.4001,6.8471,-9.7451,7.5214,20.7558,6.9562,1321
-104.0214,-9.6495,-6.6702,34.6024,-9.6495,19.3541,63.8686,22.3013,1322
-1.8184,-9.6716,1.4788,4.1555,-9.6716,2.6823,5.7725,2.3959,1323
-2.8326,-10.2189,-0.19,1.1915,-10.2189,2.3841,7.9151,4.029,1324
-3.4418,-9.779,-0.178,2.2133,-9.779,2.6307,7.8939,3.695,1325
-6.134,-9.6911,6.613,10.3676,-9.6911,5.8651,21.2965,7.7653,1326
-0.1096,-9.6964,5.5327,5.1982,-9.6964,3.8778,11.4629,4.9726,1327
-24.4723,-9.6739,-0.1346,12.9078,-9.6739,11.0304,40.7851,8.8975,1328
-48.6857,-9.506,-2.0451,10.6924,-9.506,4.506,13.7166,2.4563,1329
