AYGX_min,AZ_mean,AYGX_mean,AYGX_std,AZ_mean.1,GX_std,Gnorm_max,Gnorm_median,timestamp
-3.7937,-9.8426,0.5361,2.5688,-9.8426,2.1763,23.9233,12.74,3883
-158.3348,-9.5831,-25.8181,46.3615,-9.5831,13.5876,45.962,19.4559,3884
-527.6984,-7.8417,-54.2167,189.2746,-7.8417,32.5079,73.4015,42.44,3885
-8.7045,-8.1127,0.5399,6.7496,-8.1127,1.2306,2.8028,2.5714,3886
-10.0314,-8.0413,0.7025,7.8723,-8.0413,1.3922,3.5683,2.9625,3887
