AYGX_min,AZ_mean,AYGX_mean,AYGX_std,AZ_mean,GX_std,Gnorm_max,Gnorm_median,timestamp
-0.4842,-9.9501,-0.2555,0.1239,-9.9501,0.1059,2.1927,2.0649,2
-0.5273,-9.9498,-0.3318,0.1367,-9.9498,0.1168,2.1536,2.0492,3
-0.4907,-9.9514,-0.2863,0.1404,-9.9514,0.1199,2.2183,2.0615,4
-0.9642,-9.9487,-0.3489,0.1708,-9.9487,0.1399,2.0984,2.0544,5
-0.695,-9.9481,-0.2591,0.2848,-9.9481,0.2302,2.2475,2.0695,6
-0.7543,-9.9506,-0.2764,0.1606,-9.9506,0.1334,2.1143,2.0674,7
-0.43,-9.9489,-0.3137,0.0721,-9.9489,0.0594,2.0942,2.0578,8
-0.3095,-9.9497,-0.2733,0.0217,-9.9497,0.0181,2.0875,2.0558,9
-0.2941,-9.951,-0.2512,0.0327,-9.951,0.0274,2.0766,2.0618,10
-0.3951,-9.9491,-0.2856,0.0748,-9.9491,0.0632,2.1049,2.0615,11
-0.3307,-9.9495,-0.2867,0.0191,-9.9495,0.0167,2.0847,2.06,12
-0.3198,-9.9489,-0.2707,0.0283,-9.9489,0.0243,2.0946,2.065,13
-0.3449,-9.9484,-0.2843,0.0395,-9.9484,0.0325,2.0687,2.0494,14
-9.3937,-10.0045,-1.5838,3.512,-10.0045,2.9017,6.7438,2.1502,15
-4.5825,-9.9586,-0.1179,2.1135,-9.9586,1.7754,4.9089,2.6023,16
-2.3625,-9.9573,-0.2006,1.508,-9.9573,1.297,4.4678,2.1064,17
-0.4866,-9.9528,-0.239,0.1492,-9.9528,0.1205,2.1207,2.0727,18
-1.2576,-9.9556,-0.2416,0.4238,-9.9556,0.358,2.3786,2.1082,19
-442.8952,-9.7305,4.6318,129.8883,-9.7305,26.2834,81.8701,3.1011,20
-214.0638,-9.7434,-32.3553,41.6156,-9.7434,6.9278,30.4673,13.5376,21
-90.9368,-9.413,6.1194,44.3655,-9.413,12.1807,19.6676,13.1981,22
-22.9826,-9.6309,8.6312,15.4083,-9.6309,7.0014,43.1275,29.3218,23
-1.4541,-9.9936,23.2503,20.4202,-9.9936,7.5458,30.1651,12.6262,24
-0.8944,-9.7743,-0.0376,0.5702,-9.7743,2.7115,6.9152,3.4244,25
-54.9406,-10.1694,-9.4456,22.7714,-10.1694,14.2797,24.9098,18.8547,26
-13.0147,-9.8824,-1.9798,5.0383,-9.8824,3.4598,16.4873,6.3154,27
-13.6981,-9.8946,-0.1235,8.6999,-9.8946,6.2522,11.6974,6.7957,28
-3.7051,-9.9639,4.7137,2.3206,-9.9639,2.6626,8.9094,5.4701,29
-2.1041,-10.0044,0.0736,1.5234,-10.0044,1.0941,8.9128,7.3069,30
-8.2022,-9.9677,-3.3445,5.0792,-9.9677,4.6066,8.4857,5.2196,31
-0.2437,-10.0114,0.3059,0.7708,-10.0114,1.709,7.7694,4.7349,32
-0.5352,-10.0126,-0.3764,0.0747,-10.0126,0.1338,2.6928,2.5166,33
-0.4933,-9.9989,-0.0641,0.2908,-9.9989,0.5019,2.2181,2.0932,34
0.3874,-10.0051,1.0009,0.3192,-10.0051,0.5763,3.7303,3.4135,35
0.0151,-10.0155,0.1681,0.1058,-10.0155,0.4404,2.3869,2.0259,36
-2.0622,-10.0043,-1.3144,0.569,-10.0043,0.7363,5.9569,5.0748,37
-0.7518,-9.9962,1.4702,1.896,-9.9962,2.1692,5.137,2.5345,38
-1.8183,-10.0107,-0.7494,0.7407,-10.0107,1.4631,4.0311,2.3338,39
0.3371,-10.016,0.888,0.2734,-10.016,0.2219,4.2056,3.9165,40
-0.0568,-10.0188,-0.0151,0.0283,-10.0188,0.2606,2.1495,2.0904,41
-0.0332,-10.0176,0.0062,0.0346,-10.0176,0.4198,2.4448,2.2193,42
-0.0135,-10.0171,-0.0002,0.0099,-10.0171,0.2281,2.0881,2.0724,43
-0.0846,-10.0174,0.0136,0.0619,-10.0174,0.317,2.4051,2.1815,45
-0.0838,-10.0191,-0.021,0.0531,-10.0191,0.2843,2.2699,2.2114,46
-0.1998,-10.0109,-0.1021,0.0607,-10.0109,0.1736,2.182,2.0955,47
-0.0329,-10.0196,0.109,0.0729,-10.0196,0.2193,2.4037,2.284,48
-0.0143,-10.0155,0.0325,0.0294,-10.0155,0.1848,2.2156,2.1034,49
-0.6351,-10.021,-0.2529,0.2406,-10.021,0.4307,2.5473,2.335,50
-0.1006,-10.0222,0.077,0.1861,-10.0222,0.8637,3.1225,2.0843,51
-0.5181,-10.0168,-0.1087,0.2328,-10.0168,0.9534,2.7534,2.3336,52
-0.5027,-10.0156,-0.0531,0.3346,-10.0156,0.458,3.3784,3.0156,53
-0.0571,-10.0217,0.0123,0.0355,-10.0217,0.2888,2.2165,2.065,54
-0.4807,-10.0173,-0.139,0.1853,-10.0173,0.4259,3.0324,2.6695,55
-14.9207,-10.0014,-0.1578,5.6192,-10.0014,6.181,19.5214,2.3959,57
-0.2102,-10.0138,-0.0578,0.0942,-10.0138,0.4936,2.4363,2.0629,58
-0.1902,-10.0094,-0.0141,0.1256,-10.0094,0.5576,2.2565,2.1113,59
-0.0205,-10.0189,0.1006,0.1436,-10.0189,0.4195,2.3715,2.1366,60
-0.1186,-10.0233,-0.0333,0.0481,-10.0233,0.3318,2.2562,2.1334,61
-0.251,-10.0173,-0.0582,0.0879,-10.0173,0.3396,2.2881,2.1363,62
-0.0102,-10.0108,0.0852,0.093,-10.0108,0.4242,2.3714,2.1895,63
-0.1791,-10.0203,-0.0076,0.0586,-10.0203,0.5336,2.494,2.108,65
-0.3925,-10.0181,-0.0092,0.1494,-10.0181,1.0371,2.8715,2.1875,66
-0.0308,-10.0159,0.0111,0.0329,-10.0159,0.2321,2.2008,2.0665,67
-0.0396,-10.0182,0.0016,0.0353,-10.0182,0.3642,2.1634,2.0954,68
-0.0569,-10.02,0.0042,0.0357,-10.02,0.3631,2.1431,2.0514,69
-0.0374,-10.0238,-0.009,0.0163,-10.0238,0.1303,2.1446,2.079,70
-0.03,-10.0174,0.0273,0.0764,-10.0174,0.3798,2.1726,2.0746,71
-0.7004,-10.0174,-0.1905,0.2044,-10.0174,0.3222,2.9838,2.6154,72
-0.3595,-10.0107,-0.0378,0.2076,-10.0107,0.7014,2.3199,2.0796,73
0.0109,-10.0,1.0312,0.7679,-10.0,0.9336,3.8647,2.4842,74
-0.5376,-10.0198,-0.0345,0.2518,-10.0198,1.5259,3.0219,2.366,75
-2.5667,-10.0019,0.5466,2.0995,-10.0019,3.9102,8.5776,4.0167,77
-0.0181,-10.0183,0.0622,0.0379,-10.0183,0.2018,2.349,2.2313,78
-0.5936,-10.0146,-0.2926,0.2415,-10.0146,0.7327,2.7669,2.1415,79
-0.0357,-10.0143,-0.0154,0.0248,-10.0143,0.086,2.0722,2.0429,81
0.016,-10.019,0.2587,0.1566,-10.019,0.1597,3.913,3.7645,82
-0.6515,-10.015,-0.5373,0.088,-10.015,0.2702,2.7343,2.3162,83
0.4444,-10.011,0.586,0.0816,-10.011,0.3441,2.7998,2.4709,84
-10.5406,-9.9759,-1.9191,5.6873,-9.9759,7.5276,10.9801,8.0421,85
-7.8488,-9.9956,-1.7741,3.7584,-9.9956,5.4138,9.2157,5.7245,86
-5.4262,-9.9486,-2.1142,3.2332,-9.9486,2.5297,4.936,3.155,87
-0.8272,-9.995,1.0833,1.5731,-9.995,2.3426,5.2013,2.7983,88
-0.9576,-9.9817,0.0212,0.8502,-9.9817,0.8846,2.549,2.1529,89
0.5312,-10.0112,0.7431,0.1245,-10.0112,0.1082,3.0131,2.8871,90
0.1712,-10.0161,0.2039,0.0358,-10.0161,0.0736,2.4745,2.3731,91
-4.4343,-10.0071,-2.1346,1.0634,-10.0071,0.5265,6.7468,5.7208,92
0.6291,-9.9982,3.1719,1.2514,-9.9982,1.1495,6.8005,6.4827,93
-2.4459,-10.0114,-1.0759,0.7084,-10.0114,0.3646,6.5811,5.9874,94
0.094,-10.0008,0.5269,0.3035,-10.0008,0.5165,2.5858,2.3422,95
-0.5159,-10.0031,-0.1082,0.2765,-10.0031,0.5287,2.2722,2.1094,96
0.219,-9.9996,0.3137,0.0589,-9.9996,0.0891,2.1388,2.0892,97
0.4064,-10.0079,0.5719,0.1243,-10.0079,0.2279,2.658,2.4714,98
0.2082,-10.0108,0.215,0.0045,-10.0108,0.0183,2.1193,2.0936,99
-0.089,-10.0174,0.0655,0.1108,-10.0174,0.5115,2.1633,2.097,100
-3.3841,-9.996,-0.0183,2.2277,-9.996,2.5845,4.311,3.1887,101
0.1257,-10.0056,0.7124,0.4017,-10.0056,0.7219,3.1556,2.7811,102
-0.6149,-10.0207,-0.3176,0.2312,-10.0207,0.5982,2.4875,2.3342,103
-0.1588,-10.0179,0.1913,0.2689,-10.0179,0.9347,2.928,2.162,104
0.1157,-10.0163,0.4073,0.1734,-10.0163,1.0792,4.6722,2.5807,105
-2.5817,-10.0149,-0.7598,0.8862,-10.0149,2.4518,6.1823,2.6721,106
-0.0061,-10.0158,0.1171,0.0888,-10.0158,0.2276,2.1229,2.0525,107
-5.8677,-9.9988,-3.5105,2.049,-9.9988,0.5001,8.6062,8.3995,108
-2.5833,-10.0361,-0.4528,0.911,-10.0361,2.1336,5.2225,2.3286,109
-6.6723,-9.9875,1.1774,3.521,-9.9875,3.134,12.9076,8.8218,110
-6.3611,-10.0709,1.2907,3.4299,-10.0709,1.9873,7.0421,6.7831,111
-10.9444,-9.9763,-0.5075,5.3555,-9.9763,4.0303,10.3736,6.1953,112
-6.4183,-10.1742,0.0736,3.3148,-10.1742,3.315,28.3872,23.616,113
-4.9026,-10.0267,2.7886,5.2065,-10.0267,8.1643,40.3166,23.0057,115
-45.2592,-10.006,-0.6088,17.9308,-10.006,8.7618,31.7314,13.5736,116
-11.1305,-9.9878,1.3991,5.8024,-9.9878,3.1197,22.4095,12.862,117
-1.3319,-10.032,2.0237,3.0389,-10.032,4.0994,11.9572,5.5368,118
-0.2823,-9.8308,9.1432,7.4697,-9.8308,2.3306,26.152,14.9058,119
-10.4003,-10.111,10.0861,15.3646,-10.111,11.2415,32.6341,20.6494,121
-9.5821,-9.9404,-1.0126,3.8266,-9.9404,5.1331,24.9209,16.0479,122
-3.0119,-10.1904,1.6332,3.895,-10.1904,3.3886,23.9995,20.1443,123
-100.4645,-9.8441,-2.3774,39.6265,-9.8441,17.1042,50.2066,28.5181,125
-55.5889,-9.9374,-8.9717,13.7342,-9.9374,6.2741,22.5225,14.1717,126
-13.2648,-9.9332,1.0672,6.2153,-9.9332,3.9941,8.1056,6.8058,127
-7.0271,-9.9234,10.3529,11.6362,-9.9234,5.6764,16.5224,11.7369,128
-9.8574,-9.9606,-4.6875,2.2369,-9.9606,1.8647,9.3064,5.3345,129
0.8198,-9.8706,3.3933,1.9062,-9.8706,1.2671,5.5593,4.3794,130
-17.3993,-9.8706,-1.038,15.7062,-9.8706,7.5601,17.3575,11.07,131
-116.4375,-10.0014,-8.3949,35.2,-10.0014,11.6799,27.5257,11.1416,132
-34.5521,-10.0623,3.8019,18.8992,-10.0623,11.4714,53.3829,17.0178,134
-15.9675,-10.121,8.9098,20.0538,-10.121,8.469,46.0689,33.7257,135
-7.995,-9.9515,0.814,6.8209,-9.9515,2.0026,41.9421,37.5528,136
-0.0,-9.9965,12.7954,15.2319,-9.9965,11.2746,25.7404,18.64,137
-0.3813,-10.022,1.375,1.8367,-10.022,5.0678,22.6959,18.4362,138
-4.1119,-9.9636,3.007,3.4327,-9.9636,6.0705,23.4321,8.07,140
-12.1598,-10.1547,11.937,16.5716,-10.1547,9.5125,25.0185,16.6782,141
-7.105,-10.1246,0.5906,6.58,-10.1246,1.3977,23.062,11.5432,142
0.7271,-9.8933,24.0676,24.3566,-9.8933,15.4684,29.4986,24.7244,143
-10.7534,-10.0009,-1.342,4.4284,-10.0009,2.7486,9.2591,7.4097,144
-5.7877,-9.9841,5.9025,7.8053,-9.9841,10.2002,19.3921,13.047,145
-0.8815,-10.087,0.807,1.9981,-10.087,3.9763,11.1425,4.6369,146
-4.3582,-9.9911,4.2988,5.2672,-9.9911,6.8839,21.6075,10.9573,147
-0.3751,-10.0157,5.1326,4.6136,-10.0157,4.854,21.9651,14.7335,148
-14.8971,-10.0254,2.0306,6.5029,-10.0254,5.8676,19.1741,8.2994,150
-3.0961,-10.0815,2.7863,4.2998,-10.0815,4.4324,17.9288,8.9281,151
-0.5774,-9.9767,6.1008,8.3544,-9.9767,5.8189,13.1005,9.648,152
-9.3832,-9.9473,1.7802,4.4304,-9.9473,4.7559,16.1122,9.6556,153
-1.7071,-9.8645,3.0598,5.9864,-9.8645,6.5544,24.1014,7.4797,154
-1.129,-10.0664,-0.0475,0.6326,-10.0664,1.0483,8.4472,5.4042,155
-3.117,-10.0961,0.0437,2.2181,-10.0961,3.9186,9.1331,6.2892,156
-9.0102,-9.7514,3.1116,7.2757,-9.7514,6.5089,25.3247,12.7456,157
-1.2221,-10.25,3.3386,4.7122,-10.25,3.0677,16.1466,8.6442,158
-10.1734,-10.0364,1.5637,5.0134,-10.0364,5.7261,20.6099,7.299,160
-2.3123,-10.0005,0.5186,3.0588,-10.0005,5.4869,12.4085,8.0073,161
-6.0583,-10.1813,8.306,9.3525,-10.1813,9.9726,21.5149,18.3738,162
-8.7685,-10.126,0.1577,5.2453,-10.126,5.594,14.4778,8.414,163
-0.9422,-10.1126,6.7875,6.7271,-10.1126,3.3784,16.9871,15.4011,164
-0.5523,-10.1279,0.8627,1.389,-10.1279,2.5099,6.435,5.1248,165
-0.6304,-10.2026,4.713,5.8151,-10.2026,4.9885,16.2241,8.1247,166
-2.5643,-9.997,1.4629,2.6499,-9.997,3.8015,12.8413,6.7194,168
-5.7951,-10.0701,13.023,17.4064,-10.0701,5.9836,31.3814,18.0835,169
-13.52,-10.0385,8.2807,15.3438,-10.0385,13.645,42.4916,18.047,170
-5.0308,-9.9946,4.8356,11.5177,-9.9946,11.1696,43.3419,11.0688,171
-0.4638,-10.1552,1.8052,2.5633,-10.1552,3.0118,14.2369,6.99,172
-8.1495,-9.9949,14.8568,17.5012,-9.9949,5.4046,20.3392,17.53,173
0.3247,-9.9804,7.918,4.7724,-9.9804,4.9014,17.8431,15.606,174
-9.2592,-9.9892,0.4243,5.3756,-9.9892,5.4783,19.7937,11.3769,175
-3.6086,-9.977,4.3779,7.2452,-9.977,6.9525,20.1532,10.4526,176
-1.2277,-10.0267,3.4343,4.1401,-10.0267,5.9729,15.2252,9.0837,177
-7.2039,-10.0543,7.3145,11.5669,-10.0543,9.469,29.3032,12.1835,178
-8.8147,-9.974,0.8775,3.283,-9.974,5.7841,21.5464,7.7619,179
-11.2849,-10.0941,8.6607,12.6395,-10.0941,11.9675,27.9463,19.1876,180
-4.3275,-9.9938,3.3017,8.4598,-9.9938,6.5058,19.5782,8.3034,181
-1.6832,-10.0882,2.9633,3.743,-10.0882,7.0731,19.4292,9.4211,182
-1.8033,-9.8551,4.9998,12.2029,-9.8551,7.0993,16.1726,14.657,183
-11.8905,-10.0729,2.6188,6.2738,-10.0729,6.392,20.4937,12.1122,184
-8.1186,-10.008,1.5274,3.8605,-10.008,3.9392,11.6915,7.0911,185
0.0272,-9.8759,1.304,1.3635,-9.8759,3.0589,8.7199,4.5353,186
-1.8741,-9.9557,1.2861,2.3763,-9.9557,3.5769,14.3726,6.8674,187
-0.1741,-10.1007,0.3122,0.4627,-10.1007,1.6367,5.4078,4.2017,188
-0.4834,-10.0016,2.7917,3.3333,-10.0016,3.9783,10.9506,9.1909,189
-4.339,-10.1347,11.1981,14.3612,-10.1347,8.2025,47.3755,20.4564,190
-266.2326,-9.0837,-35.4843,73.8664,-9.0837,19.5305,62.6008,26.2132,191
-71.9827,-9.8358,13.8324,56.1938,-9.8358,12.1282,54.7851,34.9804,192
-78.4829,-9.8473,-53.345,21.8683,-9.8473,11.3804,37.2694,25.9194,193
-36.5845,-9.8987,-8.6552,22.0092,-9.8987,16.9258,25.7982,18.34,194
-33.7054,-9.9682,-2.523,12.7789,-9.9682,15.6086,28.2072,15.9888,195
-45.5189,-9.8941,-2.534,22.9811,-9.8941,10.7845,25.2348,16.428,196
-36.984,-9.8685,-1.4816,20.9529,-9.8685,11.0791,26.973,13.6949,197
-63.6384,-9.8386,-7.3247,25.79,-9.8386,13.1995,26.2881,16.5839,198
-8.596,-9.881,3.7303,8.2468,-9.881,5.9822,9.9265,6.7385,199
-11.1979,-9.957,-4.7783,5.1026,-9.957,3.4437,7.8203,3.4827,200
-6.8046,-9.9662,-3.2644,2.0042,-9.9662,1.8348,6.4065,3.8968,201
-1.7569,-9.9491,-0.5472,1.1047,-9.9491,0.9456,2.4686,2.2635,202
-1.2892,-9.9343,-0.2792,1.2135,-9.9343,0.8404,2.3933,2.1427,203
-1.6854,-9.9815,0.2812,0.8565,-9.9815,0.8562,2.765,2.1267,205
-1.8034,-9.9844,-0.8506,0.6645,-9.9844,0.7142,2.815,2.2517,206
0.1278,-9.9828,0.4651,0.155,-9.9828,0.1679,2.1661,2.1278,207
-0.6448,-9.987,-0.4218,0.2044,-9.987,0.2459,2.169,2.0981,208
-0.3877,-9.9871,-0.0245,0.2517,-9.9871,0.2896,2.0913,2.0312,209
-0.3934,-9.9875,-0.3282,0.0474,-9.9875,0.0538,2.0932,2.0547,210
-0.8528,-9.9808,-0.5366,0.176,-9.9808,0.195,2.237,2.0995,211
-0.7921,-9.9752,-0.6382,0.1898,-9.9752,0.1812,2.1791,2.1428,212
-2.3566,-9.9786,-0.2728,1.7355,-9.9786,3.3216,11.7276,7.478,213
-5.8474,-9.9923,-4.2968,0.8359,-9.9923,0.9204,6.907,5.8826,214
-2.4523,-9.9726,0.1768,1.1156,-9.9726,1.2726,3.5826,2.6045,215
-3.0226,-9.9653,-0.5734,1.3534,-9.9653,1.2362,3.1716,2.4186,216
-3.4016,-9.973,1.9673,3.8062,-9.973,3.35,7.6069,3.2616,217
-0.9449,-9.9954,-0.2448,0.5171,-9.9954,0.8305,2.6589,2.2546,218
-0.1662,-9.9966,-0.0825,0.0483,-9.9966,0.0653,2.1076,2.0809,219
0.3703,-10.0023,0.4053,0.033,-10.0023,0.0556,2.433,2.3454,220
-2.006,-9.9933,-1.1165,0.4318,-9.9933,0.4145,2.8146,2.2619,221
-0.0546,-10.0034,0.6053,0.389,-10.0034,0.5989,2.6623,2.47,222
-0.2278,-10.0067,-0.1821,0.044,-10.0067,0.076,2.1683,2.1139,223
-3.3759,-10.0013,-0.9611,1.0315,-10.0013,1.3597,4.3115,2.291,225
-45.7304,-9.9777,-1.1102,18.3156,-9.9777,10.7243,27.7675,6.3963,226
-16.31,-9.8814,-2.5462,6.2713,-9.8814,3.7707,9.7541,4.392,227
-3.6824,-10.0312,-0.2282,2.2362,-10.0312,3.2661,7.3507,4.3768,228
-6.446,-9.9677,-2.9688,2.8459,-9.9677,2.6895,5.7847,4.81,229
-0.3631,-10.0223,0.4897,0.6916,-10.0223,1.4374,4.4287,3.5489,230
-0.5664,-10.0196,-0.1208,0.2183,-10.0196,0.9587,2.7153,2.1625,231
-0.2894,-10.023,-0.0481,0.1828,-10.023,1.2445,2.7304,2.3717,232
-0.0203,-10.0211,0.0034,0.0232,-10.0211,0.3443,2.1479,2.0797,233
-9.3371,-10.0151,-0.3504,2.9051,-10.0151,3.8141,12.9906,7.256,235
-45.7384,-9.8537,6.0325,26.2102,-9.8537,15.2313,31.055,19.2023,236
-3.5588,-10.4138,1.8939,4.4916,-10.4138,7.6936,31.4316,24.2234,237
-45.9413,-9.9392,-3.6002,26.2054,-9.9392,17.3345,27.6354,16.3012,238
-122.5885,-9.8695,-32.5366,44.0696,-9.8695,12.7602,37.5705,15.5333,239
-24.2289,-10.1325,4.0605,26.7995,-10.1325,10.0182,28.3103,22.673,240
-57.3275,-10.4361,-1.3507,25.118,-10.4361,9.3826,49.4379,18.6689,241
-14.4718,-9.8898,0.0096,6.3275,-9.8898,6.4138,22.2684,9.8914,242
-4.0331,-10.1334,1.8801,3.1679,-10.1334,4.7196,20.4682,10.3075,243
-4.8445,-9.9559,0.4838,2.2078,-9.9559,3.2297,19.3446,9.1218,245
-3.2672,-9.2727,3.4166,7.4911,-9.2727,8.2167,46.9074,14.9791,246
-1.2633,-9.7967,2.0975,3.6764,-9.7967,4.6573,8.7912,6.5564,247
-9.9908,-10.3417,8.3419,15.5503,-10.3417,5.9243,28.6456,16.3614,248
1.3827,-10.2777,12.1209,10.0523,-10.2777,8.365,27.2172,18.1478,249
-2.6803,-10.2286,1.6567,3.1387,-10.2286,1.3992,10.4704,7.3374,250
0.9376,-9.7994,6.0799,3.807,-9.7994,3.2442,16.2274,12.2301,251
-10.7749,-10.0248,3.7883,7.9517,-10.0248,9.018,24.9279,14.3091,252
-1.3098,-10.3771,0.3656,1.636,-10.3771,3.7318,12.5542,10.6784,254
-20.8657,-10.0055,2.1298,10.0598,-10.0055,9.9475,26.018,10.2349,255
-3.5211,-10.1129,30.1088,38.1773,-10.1129,17.3322,61.4595,24.5748,256
-0.3479,-10.1951,10.4601,12.2699,-10.1951,4.6882,17.3429,15.2664,257
-0.7646,-10.0599,5.4327,7.9277,-10.0599,6.928,21.9994,9.7758,258
-3.1431,-10.1427,5.2324,7.6305,-10.1427,7.3606,30.0771,14.3768,260
-0.5287,-9.9948,1.3415,3.0384,-9.9948,4.4776,10.2441,8.7025,261
-3.2379,-10.5636,8.5376,12.738,-10.5636,6.9849,18.135,11.0802,262
-8.3599,-10.0086,1.2374,4.8078,-10.0086,6.294,21.2613,8.4888,263
-0.3676,-10.299,2.8973,2.6029,-10.299,2.0144,10.7235,8.0724,264
-5.383,-10.0521,6.4161,6.7608,-10.0521,8.0295,27.3975,13.6441,265
-5.7666,-9.9598,3.093,5.449,-9.9598,6.2485,18.31,10.2758,266
-2.1308,-10.2085,1.4802,2.3698,-10.2085,2.847,17.1454,10.8056,267
-7.5725,-10.0313,4.0548,9.2841,-10.0313,3.0122,13.8162,11.292,268
-1.188,-10.0518,1.6955,3.4607,-10.0518,2.4765,9.5136,5.0458,269
-1.3696,-9.7496,10.1582,9.0433,-9.7496,3.8984,25.9653,18.206,270
-4.9517,-10.0916,-0.7263,2.5359,-10.0916,1.8391,9.2769,7.7076,271
-19.5543,-10.1252,0.7156,10.0462,-10.1252,5.3589,16.6248,14.2333,272
-2.816,-9.9503,6.0268,10.4058,-9.9503,6.5926,21.2676,12.2291,273
0.1761,-9.6897,11.1351,12.1297,-9.6897,10.1845,22.1559,19.1921,274
-1.9898,-10.0685,2.3943,2.9939,-10.0685,6.9836,17.3149,10.299,275
-5.6363,-9.9977,6.3663,10.0514,-9.9977,9.3206,20.9216,15.3493,276
-3.7312,-9.8614,11.4178,12.8029,-9.8614,5.0423,24.7115,20.7389,277
-2.196,-9.9834,1.0289,1.8543,-9.9834,4.5539,13.0322,11.2656,278
-1.1773,-9.9762,1.4464,2.805,-9.9762,0.9528,11.7305,9.5351,279
-4.4225,-10.0209,1.6697,3.6389,-10.0209,4.1243,19.7036,8.9303,280
-7.1281,-10.4354,-1.2882,2.6148,-10.4354,1.7367,13.8761,10.492,281
-9.248,-10.101,3.2514,6.9711,-10.101,12.2083,27.7939,18.5301,282
1.0425,-10.1853,3.8462,3.796,-10.1853,6.7026,16.8566,12.4309,283
-3.9322,-9.9235,0.5485,3.4034,-9.9235,4.4038,20.6118,10.5204,284
-5.6404,-10.1976,2.4278,5.3606,-10.1976,7.4516,24.7565,8.1552,285
-2.9483,-9.9781,5.7538,15.5609,-9.9781,8.1696,23.5054,9.3671,286
0.5876,-10.1669,20.1904,11.6817,-10.1669,13.6974,38.1698,24.5114,287
-1.5633,-10.0085,2.3707,3.1894,-10.0085,5.4076,14.6351,12.9026,288
0.2204,-9.7517,7.7396,7.4475,-9.7517,4.5892,20.3606,14.7157,289
-12.7004,-9.6691,10.6877,18.6427,-9.6691,6.91,29.1789,22.3177,290
-0.903,-10.4265,2.9097,3.8791,-10.4265,8.2266,24.7728,20.9682,291
-55.9034,-6.8718,4.0772,40.2798,-6.8718,15.5156,61.6102,29.0483,292
-0.2173,-9.9443,32.7099,41.1398,-9.9443,17.9387,36.5136,25.855,293
-10.2251,-9.8704,3.3297,8.3532,-9.8704,8.2362,36.235,14.0559,295
-90.8737,-9.3691,21.4823,52.5425,-9.3691,20.8882,75.472,31.735,296
-15.8231,-9.9803,33.2728,47.289,-9.9803,22.501,56.1332,41.6045,297
-11.4176,-10.0102,-1.8902,9.1983,-10.0102,2.4082,14.6188,11.3365,298
0.1949,-10.0831,9.0505,18.3214,-10.0831,9.4192,21.3015,14.1577,299
-18.7629,-9.841,8.6775,22.5182,-9.841,8.237,21.7301,15.9725,300
-21.8864,-9.4151,7.4699,18.2492,-9.4151,12.3352,36.5861,22.3862,302
-23.1268,-8.6937,-2.3957,9.2781,-8.6937,7.7935,32.7154,11.7524,303
-6.0387,-10.0048,3.4754,11.4512,-10.0048,7.9088,34.2397,6.448,305
-17.4036,-10.0436,6.7965,11.6038,-10.0436,12.9842,29.9479,19.8918,306
-3.2919,-10.1181,18.3407,14.6043,-10.1181,6.8535,30.8393,24.8176,307
-23.0087,-10.8603,13.332,21.9026,-10.8603,8.8159,27.0844,19.4809,308
-0.8483,-10.086,7.1889,8.1325,-10.086,3.147,42.3577,27.9238,309
-2.7826,-10.1659,1.9797,5.3797,-10.1659,2.3029,12.3154,7.8567,310
-1.9131,-10.1422,6.7159,6.0152,-10.1422,2.6041,14.4244,11.3095,311
-4.1032,-10.0532,5.8621,7.2871,-10.0532,7.6263,34.5211,18.2611,312
-11.0663,-10.0263,4.5964,9.2516,-10.0263,8.1862,31.5426,22.2369,314
-5.4737,-10.0748,7.5022,8.8794,-10.0748,6.513,41.6919,27.225,315
-8.0414,-10.0259,0.6693,6.7166,-10.0259,4.2632,33.8711,32.0594,316
-8.6004,-10.1485,5.0943,10.2657,-10.1485,6.7695,37.5113,11.532,317
-0.8936,-10.0666,0.0795,0.8131,-10.0666,0.9397,6.3948,4.2489,318
-5.0768,-10.0484,3.1859,5.6169,-10.0484,9.0807,39.0461,22.8286,320
-0.4705,-9.9583,-0.0777,0.3066,-9.9583,2.3039,17.4765,8.262,321
-6.2711,-10.0999,1.7403,5.4776,-10.0999,1.2972,13.2671,11.0711,322
-0.6197,-9.9659,1.1593,1.3066,-9.9659,4.1265,10.6837,7.6291,323
-11.4971,-10.0417,8.4486,16.6712,-10.0417,10.252,34.5129,20.1511,324
-1.1078,-9.791,0.8473,1.87,-9.791,3.4326,15.3604,10.5373,325
-2.7001,-10.4305,0.6785,2.1374,-10.4305,4.4049,22.293,13.5015,326
-2.6597,-9.9284,0.8668,2.2275,-9.9284,2.2848,17.8891,5.9941,327
0.135,-10.0562,8.9898,7.4402,-10.0562,8.1535,25.4966,15.4287,328
-3.356,-10.026,3.013,5.1105,-10.026,7.3756,22.3887,10.0364,330
-0.261,-10.036,0.611,0.9241,-10.036,2.3746,8.1291,6.3831,331
-0.2024,-9.9189,6.1636,6.7865,-9.9189,9.5318,21.1185,16.4147,332
-4.887,-9.9992,1.243,3.4187,-9.9992,5.0305,12.0809,7.3178,334
-8.0003,-10.0082,-0.9901,3.8946,-10.0082,3.6287,6.476,3.4583,335
-18.3387,-9.9764,-0.3976,10.3087,-9.9764,9.5098,22.0283,8.159,337
-1.6071,-10.0645,2.0946,2.373,-10.0645,1.925,9.4318,7.0981,338
-13.4421,-10.103,-5.3443,6.469,-10.103,5.5153,11.8056,7.4247,340
-37.6391,-9.8032,-15.9807,13.8353,-9.8032,5.404,18.9552,14.6248,341
-0.0432,-9.9885,3.3921,3.188,-9.9885,3.2193,8.6534,6.399,342
-25.7902,-9.7203,-2.6554,11.9904,-9.7203,8.2425,23.4209,11.7012,343
-43.9961,-10.3744,-5.1621,19.3707,-10.3744,7.0975,21.1123,12.0943,344
-14.1437,-9.9597,10.3207,19.6291,-9.9597,10.0327,53.3359,29.9162,345
-4.396,-9.9231,3.8115,4.9961,-9.9231,7.0819,41.4761,11.3256,346
-2.1921,-10.2428,8.819,8.5495,-10.2428,9.6057,26.8788,16.5911,347
-8.9571,-9.1896,0.0054,7.1515,-9.1896,6.1864,30.5878,18.9552,348
-63.6818,-10.2851,3.5706,33.2407,-10.2851,6.3048,38.1044,31.7865,349
-4.7362,-10.1941,1.0598,5.9996,-10.1941,6.4273,18.8904,17.1072,350
-20.3931,-10.2298,-4.917,10.5392,-10.2298,7.9837,28.3386,9.4333,351
-1.8327,-10.0661,30.8308,37.0961,-10.0661,16.2673,47.4999,33.2579,352
-13.3919,-9.8269,6.6855,14.3566,-9.8269,8.5776,27.7771,16.8146,353
-4.2732,-10.085,1.0272,4.3304,-10.085,4.0494,15.4977,6.4749,354
-8.5096,-10.048,9.7045,13.223,-10.048,12.9489,34.1489,21.5853,355
-12.6004,-10.1724,4.3551,8.5743,-10.1724,9.7963,28.5274,14.5469,356
-2.8979,-9.9002,-0.3852,1.0807,-9.9002,1.0524,5.0269,3.3494,357
-2.1477,-10.0349,1.9521,4.2299,-10.0349,4.6799,9.8346,6.7814,358
-3.5208,-9.9888,-0.2533,2.0165,-9.9888,3.4367,6.0701,4.2916,359
-19.2561,-9.9699,-3.5766,11.0508,-9.9699,7.1971,18.9037,12.3914,360
-0.131,-9.9988,1.9208,1.6284,-9.9988,1.9357,6.8557,3.4064,361
-1.6605,-10.0151,-0.4558,0.7143,-10.0151,1.2625,3.4778,2.8907,362
-3.9257,-10.0448,0.0213,2.0303,-10.0448,2.8387,5.7462,3.1205,363
-1.5072,-10.0281,0.7495,1.7226,-10.0281,1.2052,5.8569,2.9485,364
-0.8661,-10.015,-0.4376,0.2893,-10.015,0.4761,2.6506,2.1933,365
-3.0225,-9.9967,-0.8751,1.2075,-9.9967,1.2287,3.54,2.6414,366
-0.7276,-10.0145,0.3833,0.7692,-10.0145,1.9772,5.2096,2.3098,367
-1.2773,-10.0094,-0.6827,0.4192,-10.0094,0.5446,3.2857,2.7446,368
-1.7644,-10.0016,-0.0062,1.2209,-10.0016,2.1175,3.5565,2.7794,369
-19.0879,-9.9417,-8.3872,6.2469,-9.9417,3.057,11.4915,9.769,370
2.3,-9.8984,6.114,2.7947,-9.8984,2.2051,8.8089,4.573,371
-3.2942,-9.99,3.0627,3.3257,-9.99,2.6806,8.3909,6.4347,372
-4.5157,-9.9949,-2.1008,1.4251,-9.9949,1.1343,4.9728,3.7656,373
-9.8234,-9.9656,-5.0727,3.4658,-9.9656,1.6906,6.554,5.0762,374
-2.7513,-9.9757,-0.4788,1.0612,-9.9757,1.4454,3.3256,2.2904,375
-26.1639,-9.9234,2.8135,17.1588,-9.9234,8.7409,37.7309,12.9128,376
-317.1475,-10.1744,16.4175,138.8909,-10.1744,27.4238,116.8592,57.2013,377
-14.412,-9.9618,11.1746,14.3819,-9.9618,15.6615,72.0799,26.2753,379
-10.9321,-10.054,4.3718,8.5244,-10.054,6.4526,35.9537,10.5608,380
-3.7085,-9.9623,10.3467,13.3056,-9.9623,11.4899,39.2778,14.1636,381
-55.4074,-9.8843,-1.8553,19.3818,-9.8843,8.3441,39.1282,17.0494,382
-4.3885,-10.1136,9.7453,15.7488,-10.1136,11.1166,50.4196,13.8197,384
-7.1254,-9.9664,2.5722,5.665,-9.9664,6.0716,23.5258,13.3649,385
-1.0924,-9.8831,3.204,5.5241,-9.8831,5.5319,21.163,6.2249,386
-2.9919,-10.1163,2.7482,5.2161,-10.1163,4.7442,20.7675,11.077,387
-1.7237,-10.1951,7.9797,9.0284,-10.1951,5.2754,20.3147,15.7564,388
-26.2646,-9.9798,3.9011,9.9897,-9.9798,8.2146,26.7171,13.7725,390
-2.4773,-10.09,6.406,7.9172,-10.09,10.1028,27.2547,15.4917,391
-0.6634,-9.9199,0.5535,1.0923,-9.9199,2.8222,12.4807,6.8248,392
-4.036,-9.2737,4.3038,7.4474,-9.2737,5.9666,20.896,12.0446,393
-4.3853,-9.8415,0.7102,2.4833,-9.8415,3.3064,10.0935,5.3472,394
-10.7335,-10.2281,0.991,8.2482,-10.2281,5.1583,26.1345,13.5482,395
-6.4772,-10.1051,0.3302,4.7541,-10.1051,8.351,36.6136,25.8326,396
-4.91,-9.86,7.2687,8.2995,-9.86,12.4649,27.6572,17.5786,397
0.5378,-10.2006,4.0836,3.2523,-10.2006,8.6491,17.4419,13.9746,398
-14.7265,-10.0022,14.2109,22.9996,-10.0022,17.5137,38.4938,25.0188,400
-8.8107,-10.0608,11.2546,15.1779,-10.0608,11.4814,39.1591,16.0477,401
-30.5989,-10.2356,3.3974,19.8564,-10.2356,4.4828,21.11,11.7572,402
-11.0717,-9.9248,11.8159,19.7648,-9.9248,2.7767,24.2066,20.8816,403
-1.1478,-9.6408,0.1963,0.9399,-9.6408,2.3795,7.4952,4.8447,404
-19.669,-10.2388,3.0975,9.294,-10.2388,7.4784,29.712,12.1402,405
-6.0918,-10.0995,4.8,10.6552,-10.0995,6.9732,20.287,14.8943,406
-2.3208,-9.9624,2.2613,3.8914,-9.9624,5.6827,13.4441,9.4133,407
-46.9399,-9.1952,-0.4615,12.2174,-9.1952,6.355,46.415,11.1647,409
-3.7883,-9.9548,5.7934,9.922,-9.9548,7.783,32.7193,14.8571,410
-0.0979,-9.9324,19.0845,20.9987,-9.9324,9.903,31.4428,20.9771,411
-1.7198,-10.0178,2.6052,2.7522,-10.0178,5.0662,16.0315,10.3984,412
-2.3991,-10.0175,1.8002,2.8832,-10.0175,2.5136,10.2483,7.2202,413
-8.4235,-10.1932,3.225,6.5309,-10.1932,5.9555,26.0394,12.2276,415
-4.6867,-9.8701,4.5363,8.3861,-9.8701,10.6513,24.6718,17.3678,416
-0.6834,-10.5161,9.3036,9.7377,-10.5161,8.8739,27.2223,21.6388,417
-31.5404,-10.1198,21.2297,41.3169,-10.1198,9.2514,44.5905,34.3628,418
-0.5554,-10.0679,1.0152,1.1628,-10.0679,3.7938,9.159,7.0471,419
-0.814,-10.1228,0.6624,0.8501,-10.1228,1.5861,8.4507,6.4659,420
-3.6939,-10.0413,1.5387,3.4858,-10.0413,3.6613,16.8743,10.057,421
-1.2287,-10.0129,5.606,5.6654,-10.0129,10.1144,25.7079,19.7041,422
-0.9052,-9.9794,3.9609,4.0999,-9.9794,2.0228,13.188,10.0177,423
-9.2125,-10.0813,8.6525,13.8215,-10.0813,12.0057,46.6497,23.0632,425
-2.4317,-10.1527,1.0503,2.5788,-10.1527,2.6605,11.3378,6.7518,427
-7.1818,-10.3271,-1.974,2.9757,-10.3271,4.9113,47.9959,36.4734,428
-4.2813,-10.4166,7.2724,8.5925,-10.4166,5.5348,21.5341,14.3936,429
-6.0461,-9.9773,7.871,9.4378,-9.9773,4.2381,23.1212,18.3518,430
-13.1316,-9.9538,4.1066,9.8268,-9.9538,4.0623,44.5579,10.8238,431
-33.4312,-9.9386,-2.2823,9.2758,-9.9386,7.4121,26.5734,7.9501,432
-9.6848,-9.8449,3.3651,6.9478,-9.8449,9.063,38.1514,9.8655,433
-6.8675,-9.9495,-0.5169,4.0665,-9.9495,4.8063,25.4802,16.6458,434
-2.0617,-10.0582,2.7954,4.1566,-10.0582,5.4597,10.2176,5.2273,435
-5.9029,-9.98,7.8572,12.1228,-9.98,5.778,19.5992,14.1651,436
-20.6513,-10.0129,-0.5987,6.814,-10.0129,4.6818,23.7468,14.9206,437
-5.4356,-10.0202,5.383,7.625,-10.0202,8.3245,34.3039,12.5077,438
-3.7405,-8.47,3.6171,4.0738,-8.47,1.1682,17.9727,9.5081,439
-6.8136,-9.9738,0.9386,3.8667,-9.9738,4.0419,16.6128,12.3678,440
-29.8208,-9.8183,-0.6797,6.8494,-9.8183,6.0182,49.1944,10.6446,441
-12.2403,-9.9009,-0.2835,6.0181,-9.9009,3.6308,32.158,19.6926,442
-16.6798,-9.9802,-1.0803,6.8372,-9.9802,1.7675,44.1983,38.9217,443
5.3225,-9.8872,9.0204,4.5332,-9.8872,3.5291,24.9746,16.6099,444
-0.4846,-9.8775,1.1621,1.3787,-9.8775,2.1798,25.5681,21.515,445
-2.4093,-10.2159,-0.1734,1.2385,-10.2159,1.6379,33.187,29.0032,446
-6.8411,-10.015,1.7269,5.1221,-10.015,4.3475,23.532,11.2602,447
-0.7102,-10.0371,0.9904,1.84,-10.0371,2.8224,17.2419,11.4285,448
-2.0079,-10.122,9.3755,7.9481,-10.122,3.8089,24.4902,17.3425,449
-2.5602,-10.0208,5.3059,11.0076,-10.0208,6.3909,32.5711,10.3508,450
-2.7637,-10.1335,3.831,6.0534,-10.1335,7.1174,25.6367,11.6237,451
-7.7458,-9.9236,8.5349,10.2438,-9.9236,9.9867,27.5704,17.5879,452
-0.3022,-9.8662,2.6635,2.9286,-9.8662,3.6588,13.7737,10.1981,453
-1.6652,-10.0036,1.9529,4.0325,-10.0036,5.2517,14.8927,9.2972,454
-2.0709,-9.9845,-0.5474,0.9777,-9.9845,3.0974,11.9412,9.5083,455
-1.1424,-10.088,0.0917,0.6302,-10.088,1.3388,5.6796,3.2487,456
-2.5026,-10.036,0.2024,1.0252,-10.036,1.4006,8.3317,5.3185,457
-2.2944,-10.0202,1.5828,2.3686,-10.0202,2.056,14.0211,11.8024,458
-1.3353,-10.1436,2.4069,2.9323,-10.1436,3.6638,21.1883,11.6261,459
-4.1017,-10.0816,1.4179,2.9132,-10.0816,3.3265,13.5736,7.8086,460
-4.2978,-8.9875,3.4142,7.5533,-8.9875,6.0783,56.0833,11.2634,461
-19.0091,-9.4744,4.2147,11.8349,-9.4744,7.9444,30.8061,17.8292,462
-16.493,-9.7939,6.2632,16.9525,-9.7939,8.2768,41.1754,18.1831,464
-5.7139,-9.9078,0.815,3.2966,-9.9078,4.3343,16.1802,8.8227,465
-4.327,-10.3779,2.348,6.0804,-10.3779,4.7056,16.8581,12.4671,466
-2.1709,-10.056,1.641,2.5724,-10.056,3.4936,14.9376,9.4835,467
-4.7367,-10.1754,18.8087,20.652,-10.1754,15.8786,45.9453,20.0309,469
-21.0254,-9.9631,13.1604,23.8086,-9.9631,17.2131,41.152,20.1442,470
-0.8755,-10.1657,20.1559,17.9446,-10.1657,10.475,39.6387,35.0144,471
-3.0559,-9.9561,1.3027,3.2749,-9.9561,4.873,12.0657,8.7926,472
-26.2671,-9.991,2.8763,13.7337,-9.991,11.9,30.0217,18.1443,474
-1.9173,-10.012,2.2774,5.0481,-10.012,5.0774,21.7711,10.6949,475
-7.9623,-10.3327,5.9049,11.6142,-10.3327,3.5479,27.1555,19.932,476
-4.1523,-9.9799,3.622,7.5731,-9.9799,7.0947,21.2589,11.1031,477
-8.7657,-10.0192,8.2248,11.4443,-10.0192,9.8156,26.4784,16.0911,479
-2.4776,-9.8889,5.7986,7.2953,-9.8889,9.1153,19.3609,13.73,480
-2.3505,-10.1554,4.6074,7.0001,-10.1554,8.0149,15.304,13.7545,481
-2.5833,-9.9503,2.8862,5.5673,-9.9503,5.3257,15.1666,7.5457,482
-10.8587,-10.1394,3.235,8.2463,-10.1394,8.4065,21.3982,15.001,484
-2.9348,-9.0113,0.9876,2.5486,-9.0113,5.2668,33.1256,14.7128,485
-36.739,-9.861,1.9484,15.4998,-9.861,8.2775,34.3088,18.0759,486
-9.1751,-10.005,10.8528,21.1458,-10.005,11.773,31.9234,21.976,487
-7.0572,-9.9795,3.214,4.932,-9.9795,7.2279,21.4846,11.2719,489
-12.1933,-10.0968,0.3192,5.4435,-10.0968,5.5807,18.3621,9.6362,490
-13.634,-10.1101,0.9075,3.3673,-10.1101,3.0014,21.4525,7.6671,491
-4.8269,-10.0535,8.134,12.2856,-10.0535,15.2781,30.9801,18.07,492
-5.9676,-10.004,0.8051,3.3788,-10.004,5.8584,23.4433,10.1069,494
-14.851,-10.0579,5.4413,9.483,-10.0579,6.6781,24.4281,15.5012,495
-2.4358,-10.4139,1.0955,4.0299,-10.4139,7.8905,16.4958,14.6489,496
-9.6319,-10.0015,8.2783,13.7566,-10.0015,12.3789,28.49,15.6987,497
-30.0031,-10.3251,5.7496,10.3758,-10.3251,6.1171,24.1705,12.7903,499
-3.1187,-9.8658,6.4076,7.5412,-9.8658,8.4831,22.4135,16.7391,500
-0.3277,-10.0299,20.5494,16.656,-10.0299,12.2355,29.0567,16.239,501
-3.5164,-10.0976,1.2773,2.2261,-10.0976,3.0748,21.7684,8.0447,502
-0.2693,-10.0164,7.4884,8.0783,-10.0164,9.6212,24.4542,14.863,504
-6.811,-10.1141,0.4159,2.78,-10.1141,3.9809,13.0024,9.5303,505
1.2059,-9.8041,13.085,9.4416,-9.8041,3.79,33.5476,26.661,506
-7.8084,-10.079,2.6026,10.5659,-10.079,12.3493,34.3588,18.341,507
-4.6639,-10.0162,10.841,11.661,-10.0162,10.8003,40.8391,20.6977,509
-11.196,-10.0484,-0.0895,3.9575,-10.0484,5.0258,29.5039,7.3501,510
-2.5293,-10.0403,2.4144,3.8422,-10.0403,1.7502,9.9362,7.0431,511
-8.1699,-10.1502,1.9518,5.2479,-10.1502,6.6583,20.7121,14.8944,513
-5.4166,-10.0363,6.8,8.6885,-10.0363,8.3948,24.1607,11.765,514
-1.741,-9.942,0.3246,1.1949,-9.942,2.9552,12.3413,8.5693,515
-3.3152,-10.0026,1.8822,4.944,-10.0026,1.6418,13.7954,7.0807,516
-2.8726,-9.9818,6.4555,6.7979,-9.9818,0.5266,19.4549,16.6593,517
-10.8698,-9.9894,0.9081,4.0994,-9.9894,2.5817,19.2726,13.0712,518
-29.5994,-10.2181,-2.3514,8.6761,-10.2181,4.9215,74.1486,46.5224,519
-4.0658,-10.1608,17.2715,12.3923,-10.1608,4.8706,61.8388,31.7733,520
-17.724,-10.5219,6.9499,18.8305,-10.5219,9.2025,99.6446,89.7396,521
-1.3494,-9.7802,24.7712,27.8742,-9.7802,7.5127,70.9159,27.7281,522
-4.9178,-9.6791,7.8685,13.254,-9.6791,9.0008,29.9216,17.377,523
-6.385,-9.9936,0.7753,4.4907,-9.9936,3.3007,10.7312,8.6736,524
-8.4243,-10.0906,0.9733,2.7779,-10.0906,3.4083,13.7038,6.3539,525
-6.3425,-10.0759,11.9695,15.4139,-10.0759,13.8994,30.3641,18.3288,526
-2.7514,-10.0641,-0.7501,0.9449,-10.0641,2.5452,17.7469,13.6406,527
-1.3808,-10.5023,3.3866,4.445,-10.5023,3.1632,18.2988,12.9398,528
0.1684,-10.1444,3.3654,1.965,-10.1444,3.1259,12.8557,10.3067,529
-10.4168,-10.1183,58.1764,55.5802,-10.1183,8.8948,45.6446,36.4294,530
-1.6331,-10.0762,1.9852,2.7885,-10.0762,2.9917,33.3274,23.4905,531
-17.3202,-9.977,2.9124,7.6412,-9.977,9.3569,27.6063,18.5657,532
-11.9222,-10.346,7.2874,14.3724,-10.346,8.0053,22.9685,15.9959,533
-3.1548,-9.8268,0.4121,2.5657,-9.8268,2.6082,10.28,7.0271,534
-11.6288,-10.0047,6.9867,10.4029,-10.0047,14.2968,32.0519,20.0436,535
-7.6452,-10.0499,7.7018,11.746,-10.0499,11.8042,37.4804,19.6863,536
-10.0713,-10.0478,3.8058,13.7674,-10.0478,3.8438,21.521,18.3992,537
-0.3031,-9.8609,6.2,5.5255,-9.8609,6.8424,18.4423,10.6914,538
-2.4344,-10.1017,0.7124,2.0658,-10.1017,5.0307,13.5871,9.1672,539
-7.2487,-10.3131,1.8432,6.7839,-10.3131,5.2523,31.7475,27.3135,540
-1.2168,-9.8614,5.0067,6.2434,-9.8614,3.6347,15.2171,11.1124,541
-4.0377,-9.9957,1.6786,3.8526,-9.9957,6.4925,18.6753,9.4096,542
-2.5239,-10.0036,5.0868,5.6605,-10.0036,3.9283,23.4083,11.4044,543
-0.5607,-10.4227,3.8799,5.7215,-10.4227,6.224,25.119,19.4632,544
-12.7789,-10.0208,0.4639,8.3434,-10.0208,6.2019,25.3048,12.3177,545
-2.3809,-10.0643,4.57,8.1511,-10.0643,4.199,35.1639,13.6697,546
-29.094,-9.9538,-1.8657,13.8759,-9.9538,8.706,30.2737,26.3407,547
-12.666,-9.9758,-4.8812,5.6739,-9.9758,5.3116,16.7589,11.2505,548
-7.472,-9.958,-3.3107,3.3455,-9.958,1.6985,9.7387,8.271,549
-0.9468,-10.0382,1.2063,1.546,-10.0382,1.9747,3.7356,3.1202,550
-6.7981,-9.8987,1.3356,5.8911,-9.8987,4.6089,7.7744,4.721,551
-8.5189,-9.9093,-1.3706,3.8364,-9.9093,2.4229,11.0502,2.6875,552
-21.2262,-10.0751,2.6408,13.6873,-10.0751,4.9855,40.3791,21.7059,553
-37.5432,-10.0915,6.503,18.1443,-10.0915,12.0533,52.9122,29.5612,555
-1.4231,-10.0167,2.7021,4.4416,-10.0167,4.9077,15.0795,8.7386,556
-9.2751,-10.0454,-2.209,4.3657,-10.0454,2.9352,12.0292,6.3625,557
-10.3614,-9.9932,-3.5641,5.639,-9.9932,3.5455,11.4554,9.1711,558
-39.9634,-9.8633,-20.5393,18.8716,-9.8633,7.1582,26.7189,23.0429,559
-31.0696,-9.9404,-1.1382,11.8343,-9.9404,7.9399,23.568,7.6705,561
-20.7266,-9.9956,-2.3522,7.4705,-9.9956,4.9843,27.7685,15.9845,562
-25.1919,-10.07,4.1343,16.1429,-10.07,6.7145,34.152,20.7303,564
-1.9067,-10.2889,14.4368,18.0707,-10.2889,4.9065,23.0188,11.1535,565
-0.848,-9.7496,7.4271,5.9685,-9.7496,3.1615,20.6225,18.0517,566
-46.0312,-10.0151,5.625,25.4094,-10.0151,8.4953,33.4973,17.8986,567
-17.7387,-10.0058,3.803,12.0882,-10.0058,5.2143,21.2094,17.4963,568
-23.3986,-9.9321,6.8927,15.0123,-9.9321,10.9609,27.5491,20.8155,570
-12.7266,-9.5971,6.4157,15.0479,-9.5971,7.9264,30.5832,11.9777,571
-3.1111,-10.1144,3.5764,4.5797,-10.1144,6.3049,21.9898,13.7918,572
-4.1307,-10.4815,4.1211,5.7142,-10.4815,6.9593,16.7699,13.4412,574
-3.1558,-10.3124,5.8637,5.4587,-10.3124,9.0467,29.1571,25.3786,575
-4.6562,-10.1173,-0.4783,2.9271,-10.1173,4.1056,14.9771,10.5807,576
-40.9739,-10.0293,3.0028,16.742,-10.0293,11.4059,31.5126,14.7231,577
-129.3782,-9.646,-25.9429,61.2727,-9.646,12.9793,24.7967,13.6246,578
-15.8523,-9.9887,31.7356,65.0799,-9.9887,20.3878,96.0966,14.5427,580
-47.9845,-9.8215,3.2995,22.616,-9.8215,12.9165,26.2865,18.3915,581
-10.0732,-10.0941,2.2436,6.4594,-10.0941,3.9301,14.9098,9.3839,582
-9.7606,-10.346,13.4254,22.5849,-10.346,14.3591,37.9448,29.9733,583
-0.5287,-10.1766,72.1622,71.0418,-10.1766,21.2092,58.2066,38.4863,584
-2.3853,-10.9322,43.0719,29.9845,-10.9322,22.1158,46.9285,37.0795,585
-21.0984,-9.8813,18.8536,31.0123,-9.8813,7.8252,34.5464,22.5972,586
-12.8439,-9.9513,8.8674,14.7461,-9.9513,14.4463,28.4129,20.809,587
-1.391,-9.5885,-0.0198,1.019,-9.5885,1.8177,7.58,3.1125,588
-51.021,-9.8452,16.6077,32.799,-9.8452,13.8852,59.6429,17.3876,590
3.5698,-10.1874,50.3809,31.6109,-10.1874,21.1868,44.9746,33.3336,591
-5.2688,-10.1819,4.3481,7.3527,-10.1819,6.3348,17.8038,12.8246,592
1.1199,-10.2119,8.4296,5.3646,-10.2119,10.4509,20.5244,18.2686,593
-4.3858,-10.3952,0.7361,3.4102,-10.3952,2.0762,8.0489,5.5237,594
-2.5305,-10.0123,-0.1803,1.6215,-10.0123,2.2469,10.7842,7.2245,595
-13.0065,-10.0264,5.7326,14.9182,-10.0264,7.9051,23.2093,9.7763,597
-14.8255,-10.1467,11.3057,25.935,-10.1467,12.115,38.0978,16.8105,599
-10.6722,-9.9936,15.9574,20.546,-9.9936,14.0153,39.1096,20.2585,600
-2.7547,-9.8417,9.4529,11.0522,-9.8417,13.7176,19.2162,14.8868,601
-5.4639,-10.1277,42.1756,61.9541,-10.1277,20.4492,57.5167,19.7275,602
-14.0431,-9.8424,18.1156,25.1296,-9.8424,13.9384,36.7908,20.5805,603
-5.5407,-10.3729,3.0041,9.8397,-10.3729,7.1759,19.1647,5.4999,604
3.2898,-10.2164,32.3042,34.1827,-10.2164,9.7471,30.575,27.2235,605
-12.0885,-10.2177,10.9971,17.7187,-10.2177,12.9575,35.3395,14.7448,606
-3.6592,-9.7439,13.3333,13.7704,-9.7439,4.0601,23.9387,20.3013,607
-9.4064,-10.2429,28.5363,28.6751,-10.2429,19.9773,42.9822,31.0334,608
-0.4318,-9.9977,0.1071,0.4584,-9.9977,1.0774,10.7842,7.0609,609
-59.3409,-10.0096,-13.2985,41.6511,-10.0096,2.6522,33.6816,27.3347,610
-1763.2802,0.001,-184.4421,508.52,0.001,70.6034,197.6627,72.6191,611
-558.5105,-0.2944,-98.91,191.1729,-0.2944,18.9594,54.5239,18.7686,612
-28.6278,0.9582,-0.8126,14.8225,0.9582,1.5506,6.9441,2.0245,613
-3.314,0.9747,-2.9282,0.2126,0.9747,0.0218,2.0299,2.0132,614
-3.6958,0.9779,-2.9781,0.5082,0.9779,0.0521,2.0371,2.0081,615
-3.5086,0.8221,3.021,10.2836,0.8221,1.1289,5.5142,2.0444,616
-8.8219,0.9933,-3.1593,2.2075,0.9933,0.2237,2.2569,2.0218,617
-3.6506,0.9788,-3.0529,0.373,0.9788,0.0391,2.0339,2.0203,618
-3.2393,0.988,-3.0091,0.1155,0.988,0.0119,2.0326,2.0185,619
-3.2539,0.9886,-3.033,0.1325,0.9886,0.0136,2.0334,2.0151,620
-3.4899,0.9875,-2.9689,0.1775,0.9875,0.0182,2.0328,2.0139,621
-3.7575,0.987,-3.1205,0.3201,0.987,0.0328,2.0224,2.0082,624
521.0106,-2.6024,740.8801,131.6221,-2.6024,8.0071,83.5714,69.8866,625
193.3287,-7.6132,352.5831,113.4447,-7.6132,9.205,73.4478,51.827,626
11.3845,-9.6551,29.2553,16.1504,-9.6551,3.585,15.8135,13.4811,627
-45.2554,-9.5739,-19.7413,23.5794,-9.5739,5.7592,18.4453,16.1221,628
-2.963,-9.7297,8.3398,9.3059,-9.7297,3.8342,27.3247,26.8906,629
-24.235,-9.912,-2.1154,9.4927,-9.912,5.6452,17.4014,10.1709,630
0.1052,-9.9971,2.2526,1.3741,-9.9971,1.4926,10.0873,9.5637,631
-20.431,-9.8447,7.9115,17.3938,-9.8447,6.9018,36.6006,16.6767,632
-81.4759,-9.816,-40.0712,27.7992,-9.816,10.8435,36.4797,27.6531,633
-46.0675,-9.5577,-16.1471,20.1052,-9.5577,5.8803,14.2654,4.6894,634
-56.6955,-9.3937,18.3405,43.7717,-9.3937,15.0173,72.7077,7.0989,636
-22.9924,-9.9432,1.2804,7.8364,-9.9432,5.0326,13.9244,6.1336,637
-6.6143,-10.0026,1.3894,3.3347,-10.0026,4.1997,13.0129,4.9315,638
-6.824,-9.9145,-0.0523,3.6994,-9.9145,4.4639,19.9537,16.4113,639
0.4756,-9.9699,8.8942,10.2734,-9.9699,3.9608,38.6493,15.7351,640
-7.2274,-9.9866,2.3935,6.4047,-9.9866,6.6689,17.9583,14.3879,641
-1.7328,-10.0218,2.7422,5.0853,-10.0218,4.8505,21.3357,7.535,642
-2.4442,-10.006,1.4081,2.0328,-10.006,1.1376,12.1461,8.7354,643
-8.6979,-9.9688,5.3897,7.3434,-9.9688,7.706,33.7074,15.6326,645
-5.9791,-10.0307,1.9313,7.6579,-10.0307,6.3658,28.6291,26.9047,646
-2.4884,-10.0654,3.5659,3.5206,-10.0654,1.5023,11.6742,10.7538,647
-0.3858,-10.0553,5.711,9.1174,-10.0553,7.7184,29.8114,4.2476,648
-20.9235,-9.9706,3.6937,19.6278,-9.9706,4.7865,42.6813,20.5374,649
-2.8252,-9.974,4.2244,7.257,-9.974,2.9622,19.1425,14.3733,650
1.7461,-9.9014,7.0688,2.6297,-9.9014,1.0492,12.738,11.1614,651
-3.0244,-10.0693,4.8364,5.2027,-10.0693,7.3755,27.1342,12.4599,652
-2.3578,-10.0372,1.7047,3.2876,-10.0372,2.2266,18.1247,15.8447,653
-5.3379,-10.0009,5.4901,6.1754,-10.0009,9.4408,28.6795,17.2108,655
-2.044,-10.0739,2.145,3.2857,-10.0739,5.5481,18.0358,10.9131,656
-1.1689,-9.9517,8.4664,7.2537,-9.9517,5.9433,25.0068,16.3327,657
1.9693,-9.9514,8.4925,3.3662,-9.9514,1.2681,15.915,10.8525,658
-79.9642,-9.6805,-9.4095,34.2657,-9.6805,13.7745,30.3321,13.1516,659
-60.6908,-9.6914,-1.406,31.4578,-9.6914,11.756,23.9328,11.6277,661
-133.6583,-10.0126,-12.3922,39.6393,-10.0126,13.3448,27.5194,15.084,662
-17.9274,-10.2719,-2.7784,5.6504,-10.2719,3.375,31.3837,21.1247,663
-3.1912,-10.238,7.4371,14.5716,-10.238,8.6095,26.1821,23.4596,664
-1.1081,-9.9413,0.8834,1.7556,-9.9413,2.9376,7.7354,3.9997,665
-5.2094,-10.3721,5.0139,6.7257,-10.3721,10.9541,26.082,16.8385,666
-15.2143,-9.8269,7.4861,15.2539,-9.8269,10.5809,23.9991,12.9343,667
-2.2276,-10.0248,13.5045,16.2308,-10.0248,9.2214,30.0077,25.9698,668
-16.9025,-10.0663,11.0747,21.2392,-10.0663,12.4799,43.8288,11.75,670
-8.689,-9.8302,0.2338,2.6246,-9.8302,2.5904,8.3064,6.331,671
-2.7396,-10.0592,0.2593,1.3091,-10.0592,3.3428,14.7657,6.5185,672
-2.9135,-10.1461,0.5675,1.4895,-10.1461,4.3301,15.3159,7.0747,673
-0.5154,-9.9963,2.1922,2.1937,-9.9963,1.3644,10.6982,7.461,674
0.0479,-9.9124,2.4871,2.7477,-9.9124,4.5922,15.8213,12.127,675
-7.7561,-10.4705,1.3001,5.9139,-10.4705,8.9705,28.7318,16.1878,676
-7.1475,-10.0862,6.6078,13.2534,-10.0862,9.1107,34.8433,14.9483,677
-3.5808,-9.7257,3.1673,7.0882,-9.7257,2.0565,24.0565,17.8631,678
-10.2848,-10.0318,14.1265,24.5884,-10.0318,14.4834,47.6118,20.1407,680
-4.1246,-10.1413,6.8281,9.2383,-10.1413,11.2483,36.4045,15.3293,681
-6.0837,-9.7107,7.4868,17.4015,-9.7107,5.0216,19.381,15.9173,682
-2.1216,-10.2702,0.0036,1.4072,-10.2702,1.2587,12.5541,11.1909,683
-3.2133,-9.9446,0.515,2.9054,-9.9446,5.5718,18.4894,14.3441,685
-6.0809,-10.0337,5.4967,10.3557,-10.0337,10.1357,27.5763,13.5208,686
-1.336,-10.0777,4.2585,4.0166,-10.0777,5.6383,15.7372,11.0533,687
-1.0189,-10.2796,6.0614,5.868,-10.2796,5.1643,23.1759,10.7614,688
-2.7811,-9.3413,6.4757,5.8346,-9.3413,1.2359,14.378,11.6116,689
-16.002,-10.0686,12.3574,18.1642,-10.0686,12.2113,40.0638,19.5829,690
-5.1181,-9.9859,3.3457,5.774,-9.9859,6.5147,23.0055,10.6744,691
-3.1621,-10.0956,2.7564,6.5004,-10.0956,9.1203,25.8288,16.763,692
-19.259,-10.0012,8.2573,15.1647,-10.0012,13.9991,30.8719,24.0439,693
-2.0081,-10.1147,2.3941,4.4809,-10.1147,7.9665,28.4413,23.1886,694
-6.3005,-10.0197,2.8825,5.5374,-10.0197,6.697,27.3108,17.1657,695
-0.6076,-10.1299,3.7063,4.036,-10.1299,4.8997,31.2498,23.2337,696
-0.4184,-10.0798,1.157,2.1951,-10.0798,3.2209,16.4312,12.2948,697
-30.1049,-9.9363,-7.6008,11.6833,-9.9363,5.3877,17.1073,7.6682,698
-60.1216,-9.7651,1.6132,29.0088,-9.7651,11.8812,19.3788,14.5953,699
-8.151,-9.9684,4.26,6.751,-9.9684,2.8036,14.8805,11.1327,700
-13.0624,-9.947,0.174,6.0057,-9.947,4.8606,9.8374,4.8806,701
-2.8246,-9.9741,-0.2452,1.6836,-9.9741,3.8833,7.3317,3.7642,702
-6.2534,-9.9108,-3.073,2.4577,-9.9108,1.658,5.4256,2.747,703
-0.8563,-9.9507,0.2587,0.6267,-9.9507,0.4885,2.4361,2.1559,704
-3.109,-9.9138,-1.7157,0.9097,-9.9138,0.6116,2.9846,2.4285,705
-0.8648,-9.8016,7.8254,12.6225,-9.8016,4.3017,17.9382,7.795,706
-18.9068,-10.0322,4.1854,15.1904,-10.0322,9.9775,31.4839,19.6748,707
-30.5194,-9.9861,13.0464,22.7307,-9.9861,13.2415,45.2543,31.4749,708
-1.7936,-9.9953,1.113,1.9891,-9.9953,2.0776,14.4164,7.3046,709
-3.8672,-10.0292,2.5107,3.0465,-10.0292,5.0972,21.2919,8.7043,710
-6.2373,-10.1113,1.4324,5.5481,-10.1113,8.309,22.4772,15.3573,711
-9.3267,-10.0611,5.0172,7.0149,-10.0611,7.326,29.4113,16.7144,712
-0.6535,-10.6436,9.693,13.4396,-10.6436,6.1281,31.555,18.3244,713
-3.0102,-9.9503,17.6633,22.3682,-9.9503,12.2818,38.492,24.6893,714
-4.3549,-9.7379,5.6802,6.8097,-9.7379,7.1357,27.5537,12.788,715
-1.2354,-10.0872,0.0759,0.7217,-10.0872,2.16,7.0709,4.9884,716
-31.6973,-10.1914,7.2354,15.6458,-10.1914,11.3914,22.4268,14.4712,717
0.7903,-9.7886,9.2501,5.1732,-9.7886,7.813,17.4679,15.4002,718
-11.0938,-9.9037,3.9384,5.2144,-9.9037,4.4883,19.8038,11.0593,720
-3.2642,-10.1219,9.0514,15.0181,-10.1219,10.9551,27.093,8.7619,721
0.4399,-9.8844,5.4607,3.4419,-9.8844,4.5006,22.9313,6.661,722
-4.4942,-9.9586,15.8383,15.344,-9.9586,10.6832,23.5119,18.2214,723
-8.9276,-9.9474,6.4549,12.4879,-9.9474,10.285,26.4191,19.1846,724
-5.6223,-10.0123,-0.7881,2.8473,-10.0123,3.112,7.8848,6.0582,725
-20.6026,-10.0398,13.4448,34.2255,-10.0398,7.2102,25.9793,16.8157,726
-3.0703,-10.0446,6.2559,7.5444,-10.0446,9.5374,37.549,16.3224,727
-12.4426,-9.8971,6.7687,13.6563,-9.8971,9.3407,25.7296,13.9217,729
-4.2163,-10.0348,23.1316,24.756,-10.0348,19.0955,30.3578,26.0458,730
-12.7512,-10.4229,1.7597,11.0266,-10.4229,6.4056,23.8987,9.7009,731
-8.8799,-10.0634,36.6292,32.5768,-10.0634,17.2573,42.5248,29.4385,732
-3.1521,-10.0133,8.2253,9.3504,-10.0133,4.9628,26.1956,12.1964,733
-4.7066,-9.8618,5.6195,10.9203,-9.8618,7.2304,26.8004,10.9029,735
-10.6454,-10.1786,10.4546,19.6583,-10.1786,11.5587,33.9279,8.2189,736
-5.1606,-9.5771,8.9753,14.1334,-9.5771,14.694,24.8134,19.9255,737
-2.7288,-10.0044,0.923,4.6653,-10.0044,5.3092,10.5362,8.9999,738
-2.2631,-9.9287,1.3189,2.4352,-9.9287,1.7161,10.7836,5.7703,739
-0.9424,-9.9883,-0.0652,0.4898,-9.9883,1.2978,5.4109,4.4907,740
-11.9594,-9.6487,13.91,23.4479,-9.6487,5.0167,20.5469,16.0117,741
-3.6772,-10.0554,8.3254,20.486,-10.0554,9.7248,26.5576,11.388,742
0.272,-9.9334,9.8738,5.8121,-9.9334,9.422,19.8423,15.4169,743
-4.501,-9.8373,13.4996,18.7665,-9.8373,12.4861,31.9551,17.8902,745
-5.6392,-10.0273,17.2333,22.7304,-10.0273,15.175,39.3859,21.1883,746
-3.388,-10.0593,7.3062,7.5004,-10.0593,4.1622,17.0564,14.219,747
-9.1741,-10.0989,0.4106,6.9907,-10.0989,5.6837,24.0892,14.0915,748
-4.816,-10.0079,4.3857,6.67,-10.0079,7.3032,20.3948,9.1265,749
-7.8386,-9.9778,7.1344,9.9076,-9.9778,10.7974,26.4908,13.6022,751
-5.1666,-10.0766,2.2403,5.0937,-10.0766,4.6456,26.5947,7.6042,752
-2.9467,-10.0103,2.3109,5.2529,-10.0103,7.0418,16.5772,11.0319,753
-3.3335,-9.9058,8.5751,12.15,-9.9058,5.7259,19.5051,13.956,754
-0.6586,-10.0269,1.6011,2.1333,-10.0269,4.7202,14.1136,7.3773,755
-2.5807,-10.0126,1.6786,4.6768,-10.0126,5.3037,13.658,7.8891,756
-0.2486,-10.1373,4.9334,4.5907,-10.1373,4.7656,20.8091,12.4754,757
-11.4491,-10.3392,7.6342,14.2429,-10.3392,7.6552,48.0336,36.4153,758
-3.8193,-9.9939,-0.4242,2.5613,-9.9939,2.1608,36.9101,33.2795,759
-2.5896,-10.4518,2.492,4.1873,-10.4518,4.294,60.1557,51.5169,760
12.4031,-10.0021,37.8215,19.3655,-10.0021,3.4764,38.3735,27.7772,761
-0.5931,-10.0451,6.3168,5.1909,-10.0451,7.7361,24.627,16.1408,762
-4.6416,-9.5885,2.7241,6.5438,-9.5885,2.6412,27.3621,21.8001,763
-16.8971,-10.1068,2.4138,6.414,-10.1068,7.5561,41.7747,28.6277,765
-3.0571,-9.8793,2.8691,3.7822,-9.8793,2.0483,14.7556,10.3335,766
-2.6436,-9.2999,0.0719,1.8051,-9.2999,0.837,25.8943,19.9443,767
-1.4886,-10.0731,0.8324,1.4842,-10.0731,1.4623,14.7464,9.7707,768
-4.6667,-9.9804,1.6655,3.9034,-9.9804,2.773,18.0903,15.9229,769
-0.9616,-10.1294,0.6096,1.3303,-10.1294,1.0749,11.4933,9.6053,771
-0.1948,-10.1081,0.447,0.5775,-10.1081,1.1503,10.7139,9.218,772
-8.2008,-9.8191,0.8089,4.6494,-9.8191,4.1846,18.8958,13.2099,773
-7.4566,-10.0553,3.9104,8.5863,-10.0553,6.0558,19.8972,14.3822,774
-16.8071,-10.2325,16.7191,19.4397,-10.2325,15.4138,59.0715,23.4824,775
-1.7466,-10.1614,8.3622,9.0691,-10.1614,7.0934,23.2364,14.2147,776
-7.6483,-9.5742,-1.0068,3.5184,-9.5742,2.7195,7.3184,6.6839,777
-1.369,-10.1658,8.9549,6.3485,-10.1658,5.8324,15.8466,14.3867,778
-6.109,-9.8392,5.5931,13.4762,-9.8392,6.2023,21.6565,8.0058,779
-0.8956,-9.7356,1.9638,2.7078,-9.7356,6.0071,18.4929,14.604,780
-4.5695,-10.4164,8.092,12.952,-10.4164,10.6801,27.5413,15.4965,781
-6.5777,-10.3956,3.297,8.1275,-10.3956,2.5599,16.7201,13.3582,782
-17.8051,-10.0979,-0.5556,6.9014,-10.0979,2.9422,21.2037,7.5626,783
-13.1082,-10.1365,7.0863,11.7579,-10.1365,3.6509,26.1088,15.7023,784
-4.4281,-10.1221,2.3796,5.4622,-10.1221,6.2357,18.4534,10.0893,785
-3.2482,-10.0455,0.9351,1.9817,-10.0455,3.098,14.0994,7.8244,786
-2.4817,-9.7104,0.9084,2.8659,-9.7104,4.0042,13.7497,6.223,787
-3.7325,-9.9709,-0.2983,1.4831,-9.9709,1.19,6.3313,5.0494,788
-4.7514,-9.7267,4.1704,8.0585,-9.7267,9.2049,19.1152,13.4084,789
-0.3253,-9.4574,4.2084,4.1584,-9.4574,6.8054,14.7041,11.5942,790
3.2796,-9.7,15.3661,11.8089,-9.7,5.7817,30.8919,27.4559,791
-5.517,-9.8981,1.4762,4.6094,-9.8981,4.6327,18.3745,9.5882,792
-1.5275,-9.7773,0.458,0.9994,-9.7773,2.4055,7.5165,6.5156,793
-6.3982,-9.9437,3.0969,4.6874,-9.9437,6.9354,21.0381,10.5431,794
-4.8404,-9.9838,4.1894,6.3775,-9.9838,7.8804,17.1759,13.0676,795
-3.2094,-9.9497,4.5913,5.5232,-9.9497,6.0846,27.1023,13.2445,796
-1.8843,-10.075,2.0939,3.7839,-10.075,5.0644,17.7176,8.8188,797
-1.2356,-9.9001,2.8531,5.3663,-9.9001,3.1356,13.9865,11.9712,798
-2.6265,-9.793,11.7107,10.3181,-9.793,12.3682,33.7973,18.2767,799
-14.9118,-10.336,5.3387,9.3179,-10.336,10.3518,22.3224,14.1437,800
-1.6152,-9.5224,4.0749,4.2663,-9.5224,7.9515,20.6437,17.091,801
-8.2293,-9.9089,0.2624,3.0627,-9.9089,3.6698,11.0392,6.5218,802
-7.6523,-10.1828,4.7788,9.5992,-10.1828,8.9674,24.0361,13.2512,804
-2.3946,-9.9865,1.928,2.3975,-9.9865,5.3334,12.6111,8.9331,805
-5.4376,-10.0483,-1.0614,2.4567,-10.0483,3.5094,11.1029,6.8329,806
-12.9859,-10.1176,1.9682,6.0169,-10.1176,9.0057,19.8033,14.458,807
-2.9478,-9.6409,2.2208,4.5507,-9.6409,4.8551,15.4323,11.2908,808
-8.4921,-9.9561,2.3543,5.1046,-9.9561,7.6053,17.4465,12.2719,810
-1.055,-10.049,2.4274,4.0596,-10.049,4.9282,20.8692,9.6094,811
-0.9427,-9.7246,0.4145,0.9197,-9.7246,3.0543,11.4794,8.5691,812
-4.9917,-9.9818,2.1332,3.2012,-9.9818,4.8429,15.5973,9.5159,813
-3.2648,-10.0091,2.3384,5.1138,-10.0091,4.4637,17.447,9.8798,814
-5.1358,-10.0343,1.544,4.0775,-10.0343,6.0963,14.5525,8.2232,815
-13.5303,-10.4196,1.9142,8.8106,-10.4196,6.4383,18.3345,14.9274,816
-7.1209,-9.9462,3.369,7.001,-9.9462,7.036,25.7971,11.5692,817
-6.5467,-9.4527,5.0233,10.402,-9.4527,6.8603,16.9094,15.0429,818
-7.1978,-10.0822,5.4764,9.8065,-10.0822,9.5129,20.2174,13.3973,820
-2.3368,-10.0466,2.4133,5.1624,-10.0466,5.736,22.8077,9.9742,821
-2.6514,-9.8716,0.1757,1.7959,-9.8716,2.621,17.2298,7.1663,822
-0.1964,-10.1027,0.7049,0.9251,-10.1027,2.6097,9.9877,7.9512,823
-1.6955,-10.6736,0.5219,2.9406,-10.6736,3.5237,14.5789,10.1996,824
-14.5981,-9.5114,3.6691,12.0923,-9.5114,2.6991,17.8274,12.2176,825
-2.1426,-9.1006,32.6336,31.4947,-9.1006,9.4025,33.4848,28.5892,826
-11.4086,-9.8633,7.6078,15.2382,-9.8633,16.0614,33.5568,26.5767,827
-4.5412,-10.5071,7.9525,10.3836,-10.5071,8.5725,40.9098,28.3371,828
-4.8071,-10.0332,1.0263,3.0263,-10.0332,4.7096,16.5559,8.8461,830
-10.86,-9.9695,2.1467,5.6184,-9.9695,5.7499,23.3708,11.0733,831
-15.3747,-9.8491,14.5466,17.0877,-9.8491,2.8222,26.0837,21.4481,832
-3.1403,-9.9353,1.0926,3.4716,-9.9353,1.9008,14.1252,7.534,833
-4.0119,-9.9817,1.7287,3.5506,-9.9817,1.4173,9.6751,7.8829,834
-3.1845,-9.8603,21.9419,21.0654,-9.8603,10.0034,37.003,30.6494,835
-3.3894,-10.7945,4.5825,8.064,-10.7945,6.1191,20.6631,17.2416,836
-11.1781,-9.7639,2.154,6.6524,-9.7639,9.0401,24.2825,11.3753,837
-9.1501,-9.975,11.4628,16.5079,-9.975,12.0434,41.6629,17.3459,839
-4.3351,-10.3096,19.4505,20.9206,-10.3096,13.1512,38.1198,18.9315,840
-3.3134,-10.1869,4.5812,8.022,-10.1869,5.0561,17.0137,12.2389,841
-2.0921,-10.0883,9.7203,13.9106,-10.0883,13.7216,38.3606,17.3952,842
-3.9387,-9.7766,0.3756,2.6333,-9.7766,5.3425,18.8452,8.4233,844
-0.5249,-9.4564,5.1076,4.7557,-9.4564,5.6112,21.5093,13.5813,845
-12.9478,-9.9779,50.9675,71.5015,-9.9779,12.4467,55.0035,40.789,846
-3.6741,-9.9753,14.98,18.661,-9.9753,16.024,38.7647,23.779,847
-3.3444,-10.1244,1.4139,4.2171,-10.1244,4.1255,13.5135,11.6361,848
-11.3042,-10.0925,9.2353,12.0952,-10.0925,15.1444,41.8079,18.3017,850
-94.6077,-9.7225,72.6031,89.0981,-9.7225,28.0299,79.0947,49.9896,851
-48.1465,-9.9707,40.3773,65.5952,-9.9707,8.5113,45.5614,38.4135,852
-8.9373,-9.8349,0.6,4.6296,-9.8349,6.1035,11.2797,10.0513,853
-0.1375,-10.3063,3.9423,3.7356,-10.3063,6.8526,20.0091,12.1783,854
-5.6405,-10.2291,13.6679,16.0115,-10.2291,14.7206,45.2037,26.9736,855
0.1548,-10.5928,11.314,8.8747,-10.5928,11.7474,36.1996,29.1248,857
-8.1459,-10.1618,3.1064,8.5576,-10.1618,6.8112,17.5495,12.912,858
-4.3877,-9.8242,14.5002,15.8846,-9.8242,12.912,32.3659,24.0824,859
-2.7785,-10.1192,0.7228,2.592,-10.1192,3.6042,18.6939,7.779,860
-0.2385,-9.8943,4.3562,4.8554,-9.8943,1.3889,17.4318,15.0881,861
-5.262,-10.4075,0.192,3.1221,-10.4075,5.8132,29.7581,23.2398,862
-4.38,-9.9246,3.9037,5.448,-9.9246,3.2787,28.2433,13.6018,863
-1.9123,-9.9982,2.3471,3.6426,-9.9982,3.6604,15.5478,9.0362,864
-8.9201,-10.0028,12.8751,15.1656,-10.0028,14.2547,56.8604,22.0468,865
-24.8225,-10.2146,12.2065,24.6717,-10.2146,11.3785,54.0635,21.1794,866
-0.8692,-10.1149,3.3409,4.4469,-10.1149,7.7758,52.1181,38.9003,867
-4.6719,-10.4643,1.7699,3.6905,-10.4643,4.734,30.1353,25.6641,868
-4.2955,-10.3244,0.9011,4.3918,-10.3244,1.2248,40.6686,36.1956,869
-6.8546,-10.0064,0.8788,4.6646,-10.0064,1.557,25.7125,15.8844,870
-9.9847,-10.0407,5.2466,8.7091,-10.0407,9.3657,40.7113,33.0329,871
-12.568,-9.9547,6.3132,10.6895,-9.9547,10.6488,33.3715,17.7657,872
-4.5338,-9.7688,2.3983,4.2145,-9.7688,3.3554,11.1857,9.2982,873
-3.4402,-9.9885,7.4509,8.3499,-9.9885,1.9396,17.8716,9.0637,874
-2.381,-9.78,1.9393,5.6782,-9.78,4.2227,21.4599,17.9637,875
-5.0857,-10.0628,7.3882,11.9474,-10.0628,12.4502,28.8242,22.6716,876
-5.7588,-10.0622,11.9475,15.3688,-10.0622,16.8714,33.4768,26.059,877
-8.774,-10.0059,2.7009,6.8294,-10.0059,1.9195,14.7611,12.0878,878
-3.0708,-9.9504,0.4274,1.728,-9.9504,2.0874,12.1407,9.7789,879
-1.3116,-9.8836,0.4053,1.0432,-9.8836,2.1427,12.4636,4.808,880
-1.25,-9.7444,-0.3873,0.6751,-9.7444,4.0001,13.9162,5.7197,881
-2.2536,-9.7641,1.8847,4.1206,-9.7641,4.6217,17.0647,6.8093,882
-2.4044,-9.9473,1.6716,2.9719,-9.9473,7.7122,17.5224,13.9013,883
-3.6898,-9.9077,4.7447,6.3314,-9.9077,8.3671,22.6586,18.7818,884
-8.3647,-10.1469,3.3296,7.4873,-10.1469,10.6522,26.6104,16.8865,885
-11.7377,-9.7934,3.2062,7.6134,-9.7934,8.3215,28.7127,15.0248,886
-0.5758,-10.03,3.1374,3.3404,-10.03,7.3557,16.6951,9.9646,887
-1.8256,-9.7989,6.1984,5.4763,-9.7989,9.7897,21.6368,13.5768,888
-1.7114,-10.0417,15.2034,17.1585,-10.0417,15.4749,38.7219,32.4607,889
-0.7319,-9.2482,4.9812,5.2082,-9.2482,4.6736,19.6019,13.1852,890
-1.9628,-10.1354,2.3283,2.6038,-10.1354,7.6194,17.7409,12.1118,891
-18.2341,-9.9946,13.5546,25.2006,-9.9946,11.5289,39.8648,21.7063,892
-1.5271,-10.0261,0.127,1.1718,-10.0261,3.6201,10.1635,9.3196,893
-6.4812,-10.0759,3.0584,6.4231,-10.0759,7.8573,20.0646,10.6673,895
-10.4843,-9.6878,1.9076,5.3017,-9.6878,5.2916,18.0892,9.8783,896
-5.3844,-10.0812,4.8424,8.8372,-10.0812,9.9109,18.358,14.4185,897
-8.1595,-9.8748,1.9167,4.588,-9.8748,1.5102,11.6669,10.4649,898
-12.8461,-10.1183,4.244,9.9532,-10.1183,6.1442,25.9374,9.907,899
-8.2288,-10.0174,4.2977,6.8704,-10.0174,7.8055,26.0016,10.272,901
-6.9609,-10.0775,7.7534,11.1687,-10.0775,9.9806,27.6449,13.993,902
-2.9736,-9.3927,12.0291,11.3064,-9.3927,15.6717,38.238,23.0923,903
-9.5247,-10.0291,2.9605,9.2876,-10.0291,8.3502,25.7104,11.8838,905
-4.8403,-9.7409,-0.2912,2.7715,-9.7409,0.8063,10.1451,7.0509,906
0.1419,-9.916,10.7258,6.7154,-9.916,1.7004,19.638,17.5977,907
0.2789,-9.86,3.4913,2.3932,-9.86,4.0584,12.4526,9.3626,908
-0.9644,-10.0113,1.4145,2.4502,-10.0113,4.4232,12.37,10.1962,909
-0.2352,-9.4443,0.8239,1.0744,-9.4443,2.1044,10.0552,7.1133,910
-4.1428,-9.6314,11.9222,15.5372,-9.6314,9.7731,24.1563,18.7793,911
-8.3502,-10.0416,1.7991,3.8196,-10.0416,3.9527,17.9163,7.8148,912
-6.3779,-9.9817,1.7097,4.8326,-9.9817,6.073,21.2366,8.474,914
-10.9985,-10.0342,0.9116,5.3825,-10.0342,6.6602,18.6829,8.0362,915
-9.1776,-9.9354,5.383,11.9951,-9.9354,10.0427,34.4817,13.5546,916
-18.5838,-10.1342,2.6277,12.2605,-10.1342,7.4677,23.9991,12.8613,917
-1.0095,-10.8254,5.1116,5.2866,-10.8254,5.1301,31.6461,22.9358,918
-9.1645,-9.83,2.5038,6.1961,-9.83,7.0,19.8423,10.8273,920
-11.2861,-10.0633,2.6417,6.4646,-10.0633,8.4272,19.6566,15.7303,921
-5.4378,-9.754,7.4448,9.001,-9.754,3.5592,24.486,16.728,922
-1.2731,-9.0413,2.393,4.0255,-9.0413,7.5862,22.055,19.3287,923
-9.456,-10.3057,3.528,7.4367,-10.3057,1.1917,14.2412,11.4133,924
-4.1649,-9.8468,-0.9036,1.5224,-9.8468,1.3395,10.3643,5.2927,925
-3.3754,-10.0547,1.7673,4.4329,-10.0547,5.9894,24.5414,11.9226,926
-15.5154,-10.0556,6.957,14.826,-10.0556,10.1336,35.8306,13.7586,927
-5.471,-10.3109,9.7115,11.9174,-10.3109,16.3003,33.3562,24.6792,928
-5.2548,-10.0224,10.9377,18.7422,-10.0224,12.2646,42.1465,14.557,930
-7.2723,-10.0545,6.6104,13.2991,-10.0545,8.6698,19.0076,10.7162,931
-0.9608,-10.1525,-0.4269,0.3912,-10.1525,0.5536,6.4654,3.993,932
2.7295,-10.064,28.9062,21.9678,-10.064,16.8661,32.1435,25.1453,933
-8.127,-9.9731,2.9922,8.0278,-9.9731,5.3942,16.8908,9.596,934
-0.9512,-10.0852,8.5176,5.4511,-10.0852,9.2875,22.824,17.8022,935
-12.1735,-9.9849,13.4646,17.1301,-9.9849,3.3854,30.0425,17.8898,936
-7.9288,-9.8299,4.1081,7.8146,-9.8299,11.756,28.565,22.0169,937
-1.0034,-10.1729,1.2887,2.9126,-10.1729,3.1732,10.3502,6.5741,938
-2.2735,-10.3018,1.0136,2.5032,-10.3018,4.1352,9.6051,6.542,939
-3.4329,-10.1748,1.1186,2.1191,-10.1748,4.0294,10.1692,7.2176,940
-3.3769,-10.0593,0.6141,2.3102,-10.0593,3.3882,9.4298,7.0972,942
-1.483,-9.971,0.6308,1.3127,-9.971,3.49,9.6532,5.4808,943
-0.5185,-10.1735,0.135,0.6007,-10.1735,1.6749,5.9893,4.5244,944
-1.6267,-10.1806,6.2771,6.1519,-10.1806,5.0524,17.984,15.6705,945
-0.1115,-9.919,1.2129,1.8461,-9.919,3.0747,8.0692,5.4536,946
-0.6834,-10.0292,0.8872,1.0515,-10.0292,2.9022,8.8424,6.304,947
-6.903,-10.1377,0.0298,3.775,-10.1377,3.7141,16.0303,10.1132,948
-1.5089,-9.8735,1.1689,3.1421,-9.8735,3.7846,13.4606,11.9941,949
-0.9791,-9.8798,2.6726,4.8407,-9.8798,5.0985,15.2361,13.1811,950
0.2658,-10.0878,2.1555,1.9535,-10.0878,7.1795,17.7748,15.7914,951
-2.0975,-10.0199,1.0381,1.8906,-10.0199,3.644,11.0807,9.3391,952
-1.9939,-9.9314,1.2834,2.8594,-9.9314,4.7934,12.3028,8.6969,953
2.0259,-10.4593,7.3501,6.2736,-10.4593,2.3071,15.7565,13.8073,954
-0.9219,-9.8053,12.296,13.0765,-9.8053,5.8636,26.8962,24.0417,955
-10.8774,-10.0715,1.4273,7.9992,-10.0715,4.2887,13.4688,10.6728,956
-11.3305,-10.1294,7.4217,12.1469,-10.1294,10.5116,22.2,18.3807,957
-3.4567,-10.0777,1.1673,2.8254,-10.0777,1.9018,8.8934,6.3063,958
-1.6408,-9.8284,0.7492,1.6868,-9.8284,4.4462,9.1533,7.9114,959
-0.134,-9.9474,1.8448,1.7824,-9.9474,3.8901,19.9643,15.2132,960
-12.7005,-10.5823,4.4849,11.5376,-10.5823,11.8192,75.0235,51.2216,961
-29.6567,-9.9973,8.0667,18.5929,-9.9973,7.4636,46.732,20.8192,962
-3.8332,-10.034,0.4536,1.9795,-10.034,2.7362,28.3744,24.6779,963
-20.1068,-10.0073,-2.7701,8.1672,-10.0073,5.0387,35.224,20.2612,964
-53.1286,-9.9696,6.9638,27.8201,-9.9696,10.4553,36.4094,28.4628,965
-92.6454,-9.4818,7.0763,63.0348,-9.4818,15.6193,28.6948,21.9997,966
-17.3817,-9.9866,3.497,13.3584,-9.9866,3.4718,19.9099,17.6162,967
-12.0652,-9.9189,-2.6485,3.8222,-9.9189,2.2553,9.4607,7.8358,968
7.2223,-9.9478,14.1243,4.3297,-9.9478,3.0617,14.2902,11.5435,969
-12.0278,-10.0328,3.2352,6.6291,-10.0328,5.6035,39.7804,29.3985,970
-3.4022,-10.0129,-1.0818,1.3506,-10.0129,2.9394,43.777,38.3985,971
-17.9498,-9.9181,0.1626,6.8825,-9.9181,7.252,43.142,31.7036,972
-40.3548,-9.8901,-5.0017,12.8847,-9.8901,5.9233,26.1113,8.0458,974
-24.8794,-9.8199,-7.3686,10.5291,-9.8199,5.032,18.0209,6.122,975
-11.4617,-9.6808,-0.0522,3.6943,-9.6808,1.3765,20.6083,16.1066,976
-16.3468,-9.8258,3.2503,11.9447,-9.8258,5.8357,22.4547,14.7447,977
-0.4554,-9.8877,4.6145,4.3255,-9.8877,2.6303,16.8112,12.7789,979
-16.2662,-9.8316,-2.862,10.1025,-9.8316,5.0526,8.9768,5.4664,980
8.4369,-9.8762,11.8858,2.0735,-9.8762,0.3685,8.2564,7.9618,981
-1.8796,-9.9365,-0.3034,1.114,-9.9365,0.8971,2.581,2.1315,982
-2.7541,-9.9139,-0.1042,1.7298,-9.9139,1.2739,2.9412,2.3465,984
-8.9347,-9.8366,1.7579,8.2231,-9.8366,4.626,7.0045,5.1094,985
5.5159,-9.9079,7.0299,0.9485,-9.9079,0.2898,5.8295,5.5882,986
-3.6083,-9.9437,-1.9402,1.2368,-9.9437,1.0036,3.6891,2.7819,987
-4.2838,-9.8985,-0.8268,1.1328,-9.8985,0.7164,3.4578,2.0837,989
-4.6081,-9.8663,3.3313,6.2571,-9.8663,3.5664,9.3703,3.4143,990
2.2695,-9.9347,2.8644,0.4348,-9.9347,0.4875,3.7084,3.0448,991
-35.3322,-9.8357,-17.6698,14.2119,-9.8357,6.3101,15.6247,14.2859,992
-15.8169,-9.7957,-5.5011,8.1993,-9.7957,2.962,13.6226,12.0108,993
-92.3909,-9.6498,0.8596,40.8815,-9.6498,16.71,46.8419,29.1239,994
-34.859,-9.6443,-3.7911,20.969,-9.6443,6.5064,34.4201,30.7369,995
-16.912,-9.544,12.7874,23.918,-9.544,8.3736,22.817,5.8887,996
2.5957,-9.8768,15.0036,11.7478,-9.8768,5.5905,22.4122,20.2006,997
-27.3499,-9.859,-19.3057,5.4988,-9.859,2.8891,26.9311,21.6149,998
5.4206,-9.8909,8.9432,3.8781,-9.8909,2.8814,13.0723,11.9451,999
1.376,-9.961,4.4514,2.3932,-9.961,1.3473,12.3514,11.5492,1000
-4.8712,-9.9914,-1.9391,1.5675,-9.9914,2.3749,7.6129,4.2506,1001
-22.7967,-9.707,-14.4371,5.1751,-9.707,2.1173,9.167,7.057,1002
-6.357,-9.6085,1.27,10.2609,-9.6085,3.075,6.566,3.1175,1003
-11.424,-9.5051,-1.3556,9.8443,-9.5051,3.7376,7.1039,4.2517,1004
-28.6136,-9.7775,9.3378,12.0909,-9.7775,5.9382,15.8733,9.3926,1006
-41.0491,-10.0751,-1.6181,15.9251,-10.0751,13.7141,55.8288,12.0616,1007
-57.8932,-10.0416,-10.0289,27.0577,-10.0416,10.6607,29.466,19.4384,1008
-7.9193,-10.0111,0.3374,3.4429,-10.0111,4.9655,21.0764,15.6676,1009
-6.5739,-10.0358,3.0853,6.0411,-10.0358,7.0757,40.0012,10.6287,1011
-14.6516,-10.0929,4.9532,10.1276,-10.0929,7.1133,36.4722,18.0116,1012
-3.2522,-9.9815,6.4374,9.569,-9.9815,7.3643,27.1292,16.3398,1013
-5.6816,-10.0517,3.2191,4.8695,-10.0517,7.3623,27.2212,14.561,1015
-3.2952,-10.1132,1.5785,3.0207,-10.1132,2.1851,12.5688,8.6213,1016
-5.2613,-10.1941,-0.4976,3.0661,-10.1941,2.68,28.9792,23.3024,1017
-0.9616,-10.0381,0.6397,1.5894,-10.0381,1.4169,19.5876,17.9722,1018
-38.1313,-9.9758,-5.0408,13.6094,-9.9758,10.1071,36.0273,8.2767,1019
-25.8535,-10.0408,-1.678,27.6363,-10.0408,9.6906,47.0781,35.3521,1020
-2.6085,-9.9889,4.7214,7.0708,-9.9889,3.522,23.03,14.488,1021
-7.1489,-10.065,1.8072,5.5231,-10.065,4.8822,34.265,16.7593,1022
-1.78,-10.0688,2.6342,3.3587,-10.0688,4.1512,27.5563,11.6575,1023
-6.7602,-10.0605,4.6429,6.48,-10.0605,7.3016,40.4314,14.4464,1025
-6.5068,-10.111,-0.705,2.4555,-10.111,3.2107,28.8299,18.4214,1026
-1.6163,-9.58,13.4535,12.163,-9.58,10.21,26.0209,17.6949,1028
-3.7955,-9.8947,7.5709,8.3274,-9.8947,10.1596,32.5319,24.6882,1029
-0.8545,-10.3083,9.8599,14.0491,-10.3083,6.4617,28.0146,19.4008,1030
-17.3507,-10.3658,7.953,12.88,-10.3658,9.8162,26.4208,23.7933,1031
-7.5794,-10.2408,8.7194,12.1742,-10.2408,4.6537,25.5333,21.1813,1032
-5.13,-9.9922,7.3841,10.1305,-9.9922,7.415,17.7832,13.0938,1033
-15.4345,-9.9788,1.4173,7.518,-9.9788,8.0206,20.0391,13.3899,1034
-8.3315,-10.0075,-0.593,2.7654,-10.0075,3.6655,13.1619,6.3517,1035
-4.1295,-9.9244,2.5764,4.2553,-9.9244,7.4995,16.2919,11.8077,1036
-4.5186,-10.1339,5.7331,7.7752,-10.1339,11.4567,32.9802,27.3985,1037
-17.1932,-9.9791,12.1224,21.4082,-9.9791,10.4154,35.3433,17.4146,1038
-3.9076,-10.0915,5.9045,10.1206,-10.0915,7.9403,23.1424,14.0203,1039
-12.0228,-10.0127,1.6157,5.5814,-10.0127,6.2017,16.8439,10.2913,1040
-1.0114,-9.699,2.3903,2.541,-9.699,7.359,24.5006,24.0669,1041
-8.0289,-9.9813,1.0377,5.7488,-9.9813,7.3726,17.9643,12.3304,1042
-0.9771,-10.022,2.3589,3.4833,-10.022,3.7805,11.5129,7.2739,1043
-3.8015,-10.0588,7.597,9.5033,-10.0588,10.1302,25.0498,16.411,1044
-4.9012,-10.0367,4.4071,7.7378,-10.0367,8.6775,27.2445,11.0446,1045
-2.0133,-9.8231,0.4093,1.8523,-9.8231,2.1,12.1487,9.3936,1046
-7.0341,-10.0267,0.8454,3.076,-10.0267,4.2091,17.785,11.1303,1047
-12.4933,-9.9953,-0.9167,6.3343,-9.9953,2.4127,14.0555,11.47,1048
-5.4223,-9.9688,-1.0365,2.1309,-9.9688,1.9251,14.5015,11.4627,1049
-26.9735,-9.8952,-8.3653,12.8479,-9.8952,11.9874,19.3684,12.1985,1050
-8.3838,-9.7714,1.4964,7.6431,-9.7714,3.6593,21.0503,5.8289,1051
-123.4068,-9.7126,-10.9505,41.5365,-9.7126,14.5132,38.9207,20.6941,1052
-2.6955,-9.4206,21.9086,16.8971,-9.4206,4.2946,22.6649,17.8411,1053
-109.9251,-10.0722,-20.7508,42.0373,-10.0722,8.4051,45.4086,27.989,1054
-17.2948,-10.0636,4.5598,18.4695,-10.0636,12.5705,57.9145,45.9591,1055
-6.4383,-10.1119,4.4446,7.5673,-10.1119,9.7558,25.4964,18.8243,1056
-6.15,-9.968,5.4678,8.7924,-9.968,10.1559,26.6695,18.6757,1057
0.1859,-9.8461,4.1807,3.533,-9.8461,3.5722,24.3529,12.0191,1058
-21.0827,-10.5817,5.1569,10.5495,-10.5817,8.7099,74.5647,44.3853,1061
-27.3982,-9.8556,7.3406,24.431,-9.8556,5.0374,76.387,52.4485,1062
-14.0097,-10.2863,6.5426,26.539,-10.2863,8.9601,58.7286,51.3547,1063
-2.7033,-9.8466,63.5871,72.8723,-9.8466,8.2114,74.6583,65.5643,1064
-22.9267,-10.0047,5.194,19.6606,-10.0047,5.412,32.9285,25.376,1065
-12.7344,-10.0132,-0.3171,10.7546,-10.0132,5.5529,24.2073,17.1405,1066
-25.7703,-10.0032,0.5551,14.5983,-10.0032,4.463,44.3483,22.1302,1067
-58.4299,-9.7459,-5.3714,40.7966,-9.7459,11.1177,31.1647,14.3556,1068
-263.4553,-10.0189,-22.5189,55.9653,-10.0189,21.11,72.6522,26.1229,1070
-80.254,-10.0879,8.9472,35.0042,-10.0879,18.6755,39.1585,29.8119,1071
-27.6541,-9.2119,-2.8179,22.2068,-9.2119,9.5218,21.3582,12.6951,1072
-14.8169,-10.1247,12.3011,17.6837,-10.1247,11.923,25.8045,19.8668,1073
-201.6659,-9.0257,51.2164,140.8187,-9.0257,31.4865,99.6149,41.0873,1075
-18.1674,-9.7998,12.4929,42.9092,-9.7998,14.7807,50.4081,14.5621,1076
-7.3463,-9.9224,3.0562,7.8046,-9.9224,6.3165,18.4776,9.1657,1077
-28.7254,-9.9985,2.1755,13.11,-9.9985,7.6784,35.2151,17.4614,1079
-71.7257,-9.9961,-1.8984,16.4935,-9.9961,8.893,29.639,17.339,1080
-14.4826,-9.9196,19.7315,24.255,-9.9196,15.8497,38.5968,25.6141,1081
-5.1232,-10.0959,11.523,15.3184,-10.0959,14.8198,28.9869,22.0415,1082
-7.0477,-9.7792,5.553,9.0549,-9.7792,10.2768,30.0458,13.5855,1084
-12.2465,-9.9315,0.6335,7.3352,-9.9315,4.1579,15.6707,8.0729,1085
-9.0181,-9.866,3.8228,7.1221,-9.866,7.1502,15.281,9.3204,1086
-2.3906,-10.1311,3.6441,6.0522,-10.1311,6.2398,20.816,10.066,1087
-6.0447,-9.8962,0.6928,3.3662,-9.8962,3.3076,19.5074,9.0126,1089
-2.3042,-9.847,5.7395,6.6219,-9.847,9.716,23.9848,15.4364,1090
-2.0772,-10.2132,1.2695,2.891,-10.2132,3.3428,20.3027,15.9807,1091
-0.7082,-10.0588,0.8908,1.3995,-10.0588,2.6803,16.0429,8.1813,1092
-8.3784,-10.0086,0.676,3.2008,-10.0086,4.7646,19.691,11.5603,1094
-3.9692,-9.9704,1.5523,4.1448,-9.9704,5.2882,14.4835,8.1985,1095
-3.6016,-10.0555,0.2621,1.8594,-10.0555,3.0784,9.0117,5.9208,1096
-2.8261,-9.9981,0.278,1.4737,-9.9981,2.9649,12.0261,5.03,1097
-0.8994,-9.9564,0.9942,1.4956,-9.9564,1.5259,7.2698,4.6377,1098
-2.4905,-9.5548,0.283,1.4907,-9.5548,2.5493,18.2154,9.3152,1100
-21.25,-9.9843,4.2399,17.4917,-9.9843,7.5388,28.2695,17.7505,1101
-28.9835,-9.4701,3.272,24.414,-9.4701,5.809,27.5153,21.1688,1102
-0.9813,-9.6209,1.9975,1.8179,-9.6209,4.5475,14.785,12.6117,1103
-2.48,-9.6519,0.2988,1.416,-9.6519,1.9051,8.6661,6.4979,1104
-0.7843,-9.8178,1.8218,3.3802,-9.8178,5.8381,21.9098,20.8888,1105
-12.4989,-9.9647,-0.1961,7.4709,-9.9647,6.1107,33.8687,29.5913,1106
-5.4773,-10.09,0.3333,2.5988,-10.09,5.3131,18.6041,12.5648,1107
-8.2137,-10.1388,6.051,11.9263,-10.1388,9.9774,27.3417,16.9068,1109
-4.6813,-9.8169,0.1199,2.0002,-9.8169,2.9958,19.7266,7.808,1110
-7.0725,-10.1782,2.2855,8.3131,-10.1782,1.5775,17.5528,15.1652,1111
-4.4382,-9.9817,8.6223,14.0533,-9.9817,8.7708,34.6251,10.5678,1112
-2.4895,-9.9629,0.8954,2.514,-9.9629,4.9197,14.9631,7.6588,1114
-2.9023,-10.0091,0.5315,1.5227,-10.0091,4.2635,8.6212,6.5084,1115
-2.7492,-10.1413,0.012,1.1414,-10.1413,2.8681,7.5919,4.5498,1116
-1.2217,-10.0109,0.0913,0.6895,-10.0109,2.0879,11.4248,8.3259,1117
-1.4933,-10.0111,1.9723,3.0857,-10.0111,4.1494,14.425,9.3744,1118
-8.1097,-10.1314,0.6119,3.4297,-10.1314,1.0853,13.193,8.7476,1119
-9.8335,-9.9533,7.9143,12.9682,-9.9533,12.3844,30.0671,17.5169,1120
-5.0857,-9.9222,5.4186,6.7906,-9.9222,6.7418,17.6963,14.825,1121
-13.0976,-9.9487,4.2511,10.8067,-9.9487,0.6795,14.6888,10.7754,1122
-4.6181,-10.009,0.2932,1.842,-10.009,5.0999,11.036,7.2894,1123
-0.7572,-10.1177,1.3621,2.4992,-10.1177,2.8267,11.5897,9.5025,1124
-2.9699,-10.0987,0.8426,1.7443,-10.0987,4.5308,14.8191,9.5753,1125
-1.6748,-10.0159,1.1531,2.393,-10.0159,4.8521,12.5537,7.1599,1126
-0.095,-9.9993,0.6087,0.8789,-9.9993,1.1238,6.2828,4.225,1127
-0.5295,-10.0276,0.0329,0.3801,-10.0276,0.3772,4.1967,2.522,1128
-0.7418,-9.88,0.795,1.3488,-9.88,3.3554,9.1127,6.9053,1129
-3.3193,-10.0072,2.9518,5.4518,-10.0072,2.0999,21.9825,10.648,1130
-2.7054,-10.0299,1.204,4.2119,-10.0299,5.0942,20.2904,6.0061,1131
-38.472,-9.9445,-13.7987,17.9644,-9.9445,8.7803,20.4742,10.6435,1132
-13.367,-10.0037,-2.2021,4.8739,-10.0037,6.0788,11.6231,6.565,1133
-7.1386,-9.9364,0.0203,4.6824,-9.9364,3.8007,12.8813,9.8953,1134
-1.8767,-9.9961,-0.8264,0.6294,-9.9961,0.569,16.1578,14.4339,1135
-9.1832,-9.955,7.1498,7.3766,-9.955,3.6735,25.8132,21.8134,1136
-4.8351,-9.9939,0.4118,2.7312,-9.9939,5.9003,17.0249,10.1892,1137
-8.4354,-10.0188,-5.685,3.0036,-10.0188,1.2599,35.2898,33.4221,1138
-6.3167,-10.0137,-4.4625,1.7582,-10.0137,1.4633,20.042,16.797,1139
-47.937,-9.8562,-18.6578,15.1176,-9.8562,2.7218,18.8519,15.6608,1140
-44.603,-9.8389,12.0971,38.9727,-9.8389,14.6019,70.9562,13.21,1141
-3.962,-9.8925,0.8629,3.1561,-9.8925,2.9145,5.5336,3.2762,1142
-22.2335,-9.9831,-6.8604,7.6407,-9.9831,4.7347,41.4218,38.1366,1143
-1.5149,-9.9517,-0.7612,0.3857,-9.9517,0.3449,17.9347,15.0104,1144
0.175,-9.9974,1.7001,1.7327,-9.9974,2.1568,12.6346,11.7539,1145
-0.93,-10.0086,-0.3931,0.3824,-10.0086,1.4047,11.9232,11.7774,1146
-9.4979,-9.9677,1.5094,4.0287,-9.9677,3.2347,7.8355,5.9229,1147
-0.2347,-10.0187,0.6391,0.5741,-10.0187,1.033,3.6981,3.4171,1148
1.2346,-9.9986,2.9471,1.082,-9.9986,1.3585,7.8786,7.0672,1149
-1.6037,-10.0181,-0.7056,0.7327,-10.0181,0.9445,3.6532,2.8242,1150
-0.3815,-10.0216,-0.0975,0.1303,-10.0216,0.6836,2.4254,2.1813,1152
-0.1567,-10.0243,-0.0068,0.063,-10.0243,0.4128,2.182,2.0586,1153
-0.6178,-10.0173,-0.2427,0.3292,-10.0173,0.6961,3.3727,2.9016,1154
-4.9801,-10.0092,-1.9439,1.8482,-10.0092,2.8299,7.2168,4.6988,1155
-8.421,-10.0138,-4.0022,4.2475,-10.0138,3.736,8.0534,5.0674,1156
-34.6806,-9.84,-5.6224,8.8797,-9.84,7.7498,44.4969,40.6728,1157
-0.6048,-9.8975,5.0418,4.4611,-9.8975,3.3711,13.6933,12.3971,1158
-22.248,-9.6482,-8.5613,8.666,-9.6482,1.1195,19.4971,8.9723,1160
-4.4939,-10.0019,-0.9349,1.9344,-10.0019,4.2653,7.6394,3.3588,1161
-7.1568,-9.9823,-4.4596,1.7306,-9.9823,1.6183,6.7206,4.2969,1162
-0.1448,-9.7736,0.1654,0.274,-9.7736,0.2782,3.1709,1.3906,1163
-1.7514,-9.9151,-0.7472,1.1552,-9.9151,1.0211,2.7914,2.2896,1164
-11.7024,-9.9104,-9.3021,1.7891,-9.9104,1.0227,8.1437,7.5663,1165
2.3076,-9.953,6.1484,2.5209,-9.953,0.6649,8.4242,7.876,1166
-1.0518,-10.0021,0.3024,1.1789,-10.0021,2.8739,7.2192,3.0212,1167
-0.3987,-10.0016,-0.1438,0.115,-10.0016,0.3801,2.329,2.1353,1169
-0.3039,-9.9981,-0.0071,0.2543,-9.9981,0.8387,2.3994,2.1183,1170
-0.1988,-9.9943,-0.1376,0.0453,-9.9943,0.1087,2.0417,2.0082,1171
-4.5072,-9.9781,-1.6434,1.6299,-9.9781,1.8654,5.4987,2.9458,1172
-1.789,-9.9792,0.6815,1.4296,-9.9792,1.3104,9.2748,3.174,1174
-8.047,-9.9468,-0.8284,3.6373,-9.9468,3.8445,11.0082,7.6814,1175
-8.4941,-10.0876,4.0327,5.5323,-10.0876,3.0105,19.1214,10.4908,1176
-9.8832,-9.9988,-2.0344,4.2242,-9.9988,4.8502,13.4284,12.43,1177
-6.8273,-9.9959,-2.1449,2.2241,-9.9959,3.3053,10.6646,4.3295,1178
-10.9307,-10.0042,2.216,7.3265,-10.0042,6.6874,17.7221,5.759,1180
-0.9003,-9.9808,0.8176,1.3467,-9.9808,2.6373,15.964,5.8363,1181
-2.4102,-9.9967,1.6504,1.8098,-9.9967,2.1913,9.5122,5.9466,1182
-0.0698,-10.0181,-0.0364,0.019,-10.0181,0.0548,1.977,1.9331,1183
-0.192,-10.021,-0.076,0.0843,-10.021,0.2606,2.0997,2.0023,1184
-0.2708,-10.0069,-0.1822,0.0744,-10.0069,0.2882,3.6837,2.3623,1185
-3.9871,-10.0314,-0.686,2.116,-10.0314,2.526,5.7301,3.2767,1186
-4.9226,-10.0138,-1.7506,1.9681,-10.0138,3.203,6.1848,4.2814,1187
-9.0865,-10.0266,-0.9099,3.3298,-10.0266,2.3052,5.8346,2.2645,1188
-42.3018,-10.018,-1.6254,15.9409,-10.018,12.4667,46.9835,12.7221,1190
-8.7549,-10.0442,-1.3867,3.7902,-10.0442,5.2054,9.5115,6.5465,1191
-0.4007,-10.0017,0.6402,0.5329,-10.0017,0.8601,3.6982,2.3665,1192
-16.6328,-9.9521,-9.3024,4.184,-9.9521,1.3888,16.4502,14.7455,1193
-14.8643,-9.669,-1.2615,6.4035,-9.669,2.1564,8.9775,6.5713,1194
-0.2043,-10.1968,6.9919,8.435,-10.1968,3.5717,11.0217,7.0924,1195
-11.301,-9.9754,0.2446,5.1498,-9.9754,1.196,9.656,8.7927,1196
-10.5895,-10.018,-0.3223,2.3989,-10.018,2.0775,7.1386,2.8573,1197
-5.5258,-10.0015,-0.469,2.4363,-10.0015,2.4893,5.4666,2.7886,1199
-2.0373,-10.0322,0.0108,0.9991,-10.0322,1.4933,6.0273,2.3982,1200
-0.3567,-10.0253,-0.0782,0.1361,-10.0253,0.5727,2.3682,2.0739,1201
