AYGX_min,AZ_mean,AYGX_mean,AYGX_std,AZ_mean.1,GX_std,Gnorm_max,Gnorm_median,timestamp
-68.4249,-8.9269,-6.3786,37.9112,-8.9269,9.7078,47.0466,20.6673,155
-129.6066,-8.2713,-35.5943,59.2199,-8.2713,17.8856,46.7023,28.7511,156
-412.392,-7.6308,21.7792,172.1854,-7.6308,32.5864,124.6669,59.3508,157
-96.5814,-8.5927,5.9874,49.4971,-8.5927,8.62,35.0457,15.0377,159
-47.864,-9.6078,6.9327,28.2686,-9.6078,13.9308,39.2735,11.8607,160
