AYGX_min,AZ_mean,AYGX_mean,AYGX_std,AZ_mean.1,GX_std,Gnorm_max,Gnorm_median,timestamp
-0.9842,-9.5528,5.6429,6.5217,-9.5528,2.5596,15.5218,13.2042,193
-16.7756,-9.798,-3.2105,5.7361,-9.798,7.5741,23.5639,13.2029,194
-329.1415,-8.3703,-184.2471,105.5584,-8.3703,17.3996,54.7646,25.6908,195
10.0361,-9.2986,33.9326,33.7098,-9.2986,12.5636,44.8518,27.7011,196
4.2548,-9.6969,12.2426,4.6758,-9.6969,1.3924,9.2308,7.8499,197
