AYGX_min,AZ_mean,AYGX_mean,AYGX_std,AZ_mean,GX_std,Gnorm_max,Gnorm_median,timestamp
-0.1305,-9.8999,-0.098,0.0105,-9.8999,0.0231,1.7895,1.7621,0
-0.5584,-9.9052,-0.1422,0.1396,-9.9052,0.346,2.5473,1.7738,1
-0.6415,-9.8904,-0.1243,0.2721,-9.8904,0.5483,2.7954,1.905,2
-0.7813,-9.9011,-0.1287,0.275,-9.9011,0.566,2.5842,1.9183,3
-0.9715,-9.8932,0.0433,0.4986,-9.8932,1.2214,4.3948,2.0117,5
-0.1707,-9.9026,-0.0646,0.1053,-9.9026,0.2197,2.5532,1.761,6
-0.393,-9.8969,-0.1265,0.0912,-9.8969,0.2119,2.0341,1.7578,7
-2.5617,-9.9128,-0.1699,0.9426,-9.9128,1.8501,9.2444,2.4765,8
-2.1317,-9.8863,-0.0556,0.78,-9.8863,1.2085,3.7597,2.4884,9
-1.4174,-9.895,-0.2035,0.4307,-9.895,0.7458,2.9535,1.9546,10
-1.0762,-9.8918,-0.1174,0.2602,-9.8918,0.4588,2.5387,1.7794,11
-7.1828,-9.8494,-0.7059,2.4859,-9.8494,2.7201,9.7304,3.4591,13
-7.5394,-10.105,9.1073,32.5593,-10.105,6.2617,33.5375,2.0984,14
-7.7615,-9.6964,4.2851,14.7947,-9.6964,6.2875,53.0206,10.1349,15
-16.9109,-9.8534,-5.5951,7.6125,-9.8534,4.3477,19.3279,15.3836,16
-6.1945,-9.8854,-3.3091,2.295,-9.8854,1.6644,6.7419,5.2962,19
0.7291,-9.882,1.8296,0.6531,-9.882,0.8335,4.1656,3.1275,20
-0.2479,-9.9018,0.0173,0.1821,-9.9018,1.3106,3.1132,2.0447,22
-85.6488,-9.7678,-16.702,25.0485,-9.7678,7.9333,27.0332,9.1033,23
-36.9835,-9.7875,10.3586,28.0929,-9.7875,7.5029,52.4107,35.9388,24
-12.297,-9.935,1.1252,5.0551,-9.935,2.6891,53.7178,24.3511,25
-14.156,-9.8815,0.2754,5.25,-9.8815,4.7392,18.3679,9.5163,26
-15.2016,-9.8916,0.8652,6.6131,-9.8916,6.0868,15.85,5.399,27
-21.8913,-9.8939,-1.8546,6.242,-9.8939,6.2369,13.5093,2.9283,28
-0.2447,-9.9019,0.8025,0.7906,-9.9019,1.4583,3.7981,2.5536,29
-0.7438,-9.9035,-0.2587,0.2104,-9.9035,0.503,2.3433,1.9458,30
-0.3821,-9.9055,-0.0216,0.1839,-9.9055,0.5587,2.0617,1.8261,32
0.0728,-9.9104,0.1073,0.0284,-9.9104,0.0993,1.8459,1.8074,33
-0.2777,-9.9136,-0.1034,0.0808,-9.9136,0.2026,1.8264,1.744,34
-0.2175,-9.91,-0.0239,0.1556,-9.91,0.5858,1.9918,1.8254,35
0.1935,-9.9058,0.3127,0.0969,-9.9058,0.4962,2.6265,2.0112,36
-0.3218,-9.9167,0.006,0.183,-9.9167,0.6923,2.0776,1.8687,37
-0.0519,-9.914,-0.0146,0.0199,-9.914,0.131,1.9005,1.7983,38
-0.1475,-9.9109,-0.0356,0.0508,-9.9109,0.2859,1.8481,1.7848,39
-0.0668,-9.9146,-0.0147,0.0219,-9.9146,0.2296,1.8885,1.7592,41
-0.1183,-9.9134,-0.019,0.0468,-9.9134,0.6344,2.141,1.8301,42
-0.2008,-9.913,-0.0464,0.0876,-9.913,0.6041,2.1728,1.8711,43
-10.4579,-9.8921,-1.3544,6.0883,-9.8921,2.6752,13.6662,12.5227,44
-3.6283,-9.8933,3.7517,5.2961,-9.8933,5.3415,40.4342,17.196,45
-7.147,-9.8383,-0.5158,4.3975,-9.8383,2.2241,33.5464,27.5975,47
-2.3974,-9.9899,0.2906,1.5456,-9.9899,2.4524,66.8142,51.6252,48
-6.3429,-10.0607,1.2591,3.3295,-10.0607,4.4558,62.9824,52.4238,49
0.9058,-9.8775,12.7454,6.9425,-9.8775,1.8302,44.5024,26.0883,50
-0.0022,-9.6593,3.0712,2.5944,-9.6593,3.9909,18.3784,14.6272,51
-1.4736,-9.7418,21.2541,19.062,-9.7418,3.2951,35.2861,30.9713,52
-5.0811,-9.8005,0.7425,6.1328,-9.8005,6.8784,40.0146,14.5637,53
0.2622,-9.6337,5.9059,4.2809,-9.6337,5.2409,12.6406,11.4904,54
-0.517,-9.9497,0.9052,1.7058,-9.9497,3.3603,15.4648,9.8553,55
-0.2614,-10.0814,0.841,1.2067,-10.0814,3.5672,21.8062,18.8744,56
-8.9133,-9.7077,0.0187,4.0463,-9.7077,1.9453,13.0547,11.1747,57
-3.1247,-10.1038,2.6921,5.2585,-10.1038,5.4561,23.6646,19.7642,58
-3.3067,-9.9742,0.6898,2.2657,-9.9742,0.7831,13.928,9.8705,59
-3.448,-10.0266,1.9761,3.3188,-10.0266,4.4793,19.4832,9.9485,60
-9.2464,-9.9783,1.538,5.861,-9.9783,5.0647,67.2461,14.157,62
-4.501,-10.5713,3.8863,6.4459,-10.5713,3.3743,70.4277,66.7931,63
-10.5249,-10.1878,7.7007,17.5681,-10.1878,8.4057,82.8419,75.6077,64
-7.858,-9.902,5.2561,11.8949,-9.902,8.9123,24.8032,11.1144,65
-5.0739,-9.8509,3.2324,4.4193,-9.8509,11.07,30.2718,22.4979,67
4.1157,-10.3718,12.8907,6.1722,-10.3718,7.2742,39.5627,31.7896,68
-2.6972,-9.8626,-0.0998,3.0263,-9.8626,2.7772,14.492,10.1648,69
-1.0621,-9.8818,0.5537,1.8455,-9.8818,4.6671,13.2905,6.582,70
-3.2128,-9.9435,1.5493,2.9747,-9.9435,6.5989,22.9337,10.0365,72
-3.1095,-9.646,-0.0274,2.147,-9.646,0.7706,16.9082,15.3492,73
-4.0606,-10.3774,0.0644,2.7148,-10.3774,2.8459,40.4993,31.3346,74
-26.3277,-9.7815,3.9488,13.7724,-9.7815,4.0857,77.378,48.1907,75
-3.8879,-9.8809,0.8477,2.5276,-9.8809,4.8059,15.6599,11.8258,77
-0.2178,-9.9283,1.0984,1.1443,-9.9283,0.782,15.0698,12.5778,79
-4.4917,-9.8937,-0.0396,2.2974,-9.8937,3.6531,25.6541,17.2368,80
-0.8535,-9.8889,2.9057,2.0654,-9.8889,0.4485,13.0036,10.9386,81
-2.1346,-10.0267,2.2475,2.8632,-10.0267,4.8909,31.9872,19.9409,82
-4.8352,-9.8527,3.7687,6.2599,-9.8527,7.0308,26.2842,9.5609,83
-0.5107,-8.0388,0.6114,1.1425,-8.0388,3.9772,13.3116,11.8255,84
-2.7531,-10.1651,3.1312,4.9176,-10.1651,3.8993,26.7857,25.5477,85
-14.0923,-10.1297,-2.5201,6.1909,-10.1297,2.46,32.2075,30.6665,86
-7.1491,-9.9261,3.0541,4.362,-9.9261,7.538,35.3586,20.697,88
-21.3713,-9.8943,8.9142,11.5947,-9.8943,11.6139,38.9967,16.1955,89
-1.7364,-10.0218,1.0811,2.3888,-10.0218,4.0996,14.8538,10.5867,90
-12.2173,-10.063,6.0908,10.2315,-10.063,3.0145,35.5325,21.9692,91
-3.5811,-9.6071,2.8647,4.6784,-9.6071,4.7348,32.3344,30.2392,92
-0.3246,-9.7386,0.6364,0.811,-9.7386,1.2286,21.6862,19.188,93
-0.2671,-9.8899,9.0141,9.9624,-9.8899,6.9615,33.4269,19.1532,94
-6.3759,-9.8746,0.9631,4.7903,-9.8746,3.0001,14.5522,9.841,95
-12.271,-9.789,-0.1738,3.6412,-9.789,6.0599,27.1453,13.7745,97
-2.0635,-9.9671,0.0168,1.5366,-9.9671,4.018,12.0908,7.5574,98
-10.1559,-9.7975,5.7085,7.7934,-9.7975,4.7958,30.851,25.0764,99
0.2562,-10.0631,5.0585,4.2112,-10.0631,3.3616,39.8401,38.3778,101
-20.2571,-10.0255,1.2857,7.6394,-10.0255,4.2422,39.3479,32.072,102
-4.607,-10.0975,2.1566,5.44,-10.0975,1.5191,24.163,17.504,104
-21.3248,-9.5695,-0.3232,12.248,-9.5695,9.2095,38.7457,21.0771,105
-264.3461,-9.6467,-38.9996,85.0756,-9.6467,32.1894,100.0574,36.8595,106
-20.0543,-9.907,5.3047,17.7604,-9.907,10.3995,39.7961,32.0102,107
-60.7978,-9.8306,-7.4964,21.5616,-9.8306,9.4068,25.3115,9.4137,108
-13.5124,-9.7565,7.301,9.2541,-9.7565,5.0709,24.3789,16.0049,110
-23.4604,-9.8349,-0.3059,5.1063,-9.8349,5.2297,27.3257,11.14,112
-11.9681,-9.8704,1.1734,4.4979,-9.8704,6.1973,36.2395,18.6783,113
-2.8721,-9.9579,3.5265,5.6942,-9.9579,5.3042,30.4605,15.5094,114
-6.2858,-9.8332,-0.0344,2.8362,-9.8332,2.6131,20.698,15.4425,115
-5.8998,-9.9439,1.9142,4.9665,-9.9439,5.3827,25.6633,11.4357,117
-4.0102,-10.0028,1.9674,4.0008,-10.0028,4.2825,24.0626,16.5224,118
3.9131,-9.8105,6.885,1.7334,-9.8105,1.7612,17.2202,12.8159,119
-11.403,-9.6575,5.5311,11.1985,-9.6575,2.5069,35.1505,18.8839,120
-0.9085,-9.9291,0.6678,0.9291,-9.9291,0.948,14.0857,9.5881,121
-5.6275,-10.1435,-0.2743,1.3183,-10.1435,1.9897,13.285,5.8367,123
-3.1122,-10.031,-0.8566,1.2545,-10.031,1.145,12.189,8.8151,124
-10.6283,-9.8698,-0.4865,4.4874,-9.8698,2.6775,9.8555,8.0934,125
-1.7656,-9.9689,1.9398,2.3941,-9.9689,2.1016,22.5817,15.772,126
-1.6518,-9.8031,-0.5573,0.8802,-9.8031,1.43,24.0088,20.919,127
-1.7404,-9.8334,2.7812,3.559,-9.8334,2.5366,9.7507,8.2433,128
-2.4912,-9.9489,0.9508,2.3054,-9.9489,3.29,17.406,8.737,129
-4.9063,-9.9152,-0.0182,1.9639,-9.9152,4.4263,20.1572,7.7838,130
-2.9252,-9.9392,5.884,6.6453,-9.9392,2.1913,16.9031,13.9385,131
-7.6638,-9.9942,0.9477,3.6698,-9.9942,5.3676,16.662,9.7837,133
-0.6492,-10.2977,0.0488,0.4601,-10.2977,1.1325,3.547,2.4332,135
-1.1218,-10.3685,0.057,0.9547,-10.3685,0.9614,9.4371,5.9397,136
-9.519,-9.8928,-3.4503,3.4309,-9.8928,3.5902,15.2302,8.3634,137
1.0076,-10.0102,9.4007,6.5329,-10.0102,5.1176,26.1663,17.4883,138
-3.0646,-9.906,1.6795,3.5351,-9.906,4.4052,18.9162,13.1971,139
-5.4409,-10.2555,8.9351,8.0993,-10.2555,12.8024,38.7522,28.7127,140
-3.0142,-10.139,3.7046,5.4972,-10.139,7.7878,39.1493,36.8649,141
-5.2095,-10.0349,6.5965,10.0246,-10.0349,6.4779,41.171,19.7197,142
-0.9776,-9.9143,2.8988,4.207,-9.9143,4.984,29.9324,11.0059,143
-10.9173,-10.0214,0.9344,6.9764,-10.0214,4.4504,15.6655,14.3624,144
-3.004,-9.8518,-0.0816,1.022,-9.8518,3.4686,7.1107,5.4426,145
-2.3269,-9.9031,0.53,1.5593,-9.9031,2.9874,20.214,6.7721,146
-5.1661,-9.6943,0.6604,2.5133,-9.6943,3.9601,11.6669,7.9586,147
-3.1845,-9.4629,1.229,7.7746,-9.4629,4.906,53.8876,9.529,148
-34.9683,-8.3388,0.7599,19.1193,-8.3388,11.036,86.0813,19.8338,149
-12.5622,-9.4704,6.8308,14.1812,-9.4704,5.3514,34.9568,14.8319,150
-69.3531,-9.9348,3.4552,23.4346,-9.9348,9.5031,41.8096,10.0986,152
-5.3837,-9.8827,1.3285,3.7522,-9.8827,5.5676,20.3352,13.6469,153
-6.501,-10.1518,-1.7668,3.28,-10.1518,5.9791,29.382,21.0382,154
-14.6682,-10.0993,11.4231,13.4876,-10.0993,3.8306,40.4808,30.5142,155
-28.6842,-9.9438,11.1843,17.8723,-9.9438,17.3639,52.5463,32.1399,157
-19.9202,-9.8796,-2.6812,8.3278,-9.8796,8.7401,30.4796,24.1298,158
-32.0765,-9.7845,-21.9302,9.7841,-9.7845,7.27,32.9138,19.8067,159
-22.7866,-9.8784,-4.0813,6.0459,-9.8784,7.0047,19.5984,7.8862,160
-3.4492,-9.9154,-0.1852,0.742,-9.9154,1.9887,7.5782,1.9702,162
0.0697,-9.9238,0.1058,0.0223,-9.9238,0.1264,2.0406,1.9707,163
0.016,-9.9174,0.0294,0.0078,-9.9174,0.0408,1.8582,1.8369,164
-0.9477,-9.9152,-0.2065,0.3652,-9.9152,1.6355,4.3925,3.0845,165
-2.5756,-9.9481,-0.4604,1.4033,-9.9481,2.4548,4.1968,3.6356,166
-1.0422,-9.9142,-0.0762,0.3639,-9.9142,0.9703,4.0399,2.1646,168
-0.8414,-9.9146,0.2174,0.448,-9.9146,1.1225,3.3535,1.8829,170
-0.4129,-9.9128,-0.1876,0.124,-9.9128,0.2374,1.9627,1.8024,172
0.068,-9.9118,0.1751,0.0894,-9.9118,0.2635,2.0566,1.9215,173
-0.4873,-9.9215,0.0188,0.2773,-9.9215,1.5972,3.5659,2.2921,174
-3.5416,-9.9156,-0.5891,1.1954,-9.9156,0.6968,5.9715,4.263,175
-0.4002,-9.872,0.2196,0.6574,-9.872,1.4291,6.2392,3.7533,176
-2.8015,-9.9284,-0.9832,1.1228,-9.9284,1.8122,7.5239,5.8842,177
0.7277,-9.8911,1.7073,0.8813,-9.8911,0.8695,4.0119,3.395,178
-0.0929,-9.9099,0.4651,0.3196,-9.9099,0.6809,2.8226,2.4501,179
-0.3229,-9.9134,0.1678,0.1952,-9.9134,0.7529,4.9017,3.7901,180
-1.7518,-9.9334,-0.3236,0.621,-9.9334,1.0005,5.1004,3.7875,181
-7.3384,-9.9225,0.0932,1.9709,-9.9225,5.0353,22.6865,14.6823,182
-5.0527,-9.8676,8.7977,12.5928,-9.8676,1.2403,28.1595,13.6251,183
-5.192,-9.9149,0.1078,4.4907,-9.9149,3.1046,32.7146,29.9872,184
-11.9113,-10.015,4.2143,9.4617,-10.015,7.0137,31.9647,20.1906,185
-36.8299,-9.9584,12.7828,28.5494,-9.9584,15.111,59.3117,24.6812,187
-5.2163,-9.9338,15.0325,19.9308,-9.9338,14.508,55.3153,29.3175,188
3.79,-9.8423,26.417,18.9867,-9.8423,4.2531,33.6697,22.2147,189
-23.458,-9.982,1.4797,8.0238,-9.982,6.9886,29.5687,18.3907,190
-7.8994,-9.9103,2.1163,5.2159,-9.9103,8.4636,35.1161,18.6285,192
-12.5829,-9.9153,2.6608,6.9952,-9.9153,3.7602,23.7926,12.3368,193
-5.7203,-10.3663,3.8954,10.0505,-10.3663,5.3062,23.8551,19.5237,194
-17.4793,-9.744,5.2612,10.3384,-9.744,5.265,31.2927,17.9112,195
-8.8554,-9.7095,-0.3044,3.707,-9.7095,6.836,16.3331,10.2812,197
-3.2157,-9.99,3.1068,4.292,-9.99,6.5739,18.1761,11.3686,198
-5.8151,-9.5866,-0.704,3.5301,-9.5866,2.8722,12.569,8.5762,199
-1.954,-10.0496,-0.0085,1.4928,-10.0496,3.2042,10.5534,6.8162,200
-0.92,-9.8353,-0.1683,0.435,-9.8353,1.0326,7.9365,5.972,201
-1.9074,-9.9158,2.0128,5.2267,-9.9158,4.412,19.6796,6.4622,203
-1.6949,-9.7718,0.2161,1.9084,-9.7718,2.5699,9.566,5.4864,204
-8.238,-9.8763,-0.7205,4.5242,-9.8763,3.8296,18.7033,11.1163,205
-0.3055,-9.9175,2.8011,2.4205,-9.9175,4.769,10.7219,5.8093,206
-4.1561,-10.3052,4.8436,7.2255,-10.3052,3.692,20.4992,17.3327,208
-2.6996,-9.6023,0.3037,2.2174,-9.6023,5.9883,14.652,13.6909,209
-12.4424,-9.4576,2.2641,7.7784,-9.4576,6.5504,22.0725,9.8558,210
-16.2672,-9.791,-1.3069,9.3716,-9.791,3.9716,14.0592,10.9944,211
-20.2324,-10.0638,8.1528,19.7304,-10.0638,11.3948,39.1124,15.1811,212
-9.8648,-9.8801,1.1112,4.9316,-9.8801,5.2538,22.885,9.4174,213
-3.101,-9.9694,0.4103,2.3505,-9.9694,2.358,12.4665,7.2134,214
-7.8772,-9.847,2.1981,5.7147,-9.847,4.0171,13.7824,10.6872,215
-1.6958,-9.7642,3.7016,4.3416,-9.7642,2.7451,18.3465,14.784,216
-27.4449,-6.6694,-6.3303,17.8916,-6.6694,8.2995,60.2537,35.3295,217
-39.2575,-9.7348,1.0156,18.9802,-9.7348,12.3518,64.3322,35.9948,218
-26.7749,-10.2036,20.6912,39.6279,-10.2036,19.7549,77.1471,45.845,219
1.2008,-9.5674,6.9213,3.5488,-9.5674,5.8262,34.5162,8.8486,220
-27.2078,-9.7586,-4.5245,12.4666,-9.7586,9.3578,48.1597,15.4775,221
-69.3829,-9.9771,-20.0977,31.7828,-9.9771,9.6117,25.0511,11.1383,222
-29.9177,-9.9884,1.6412,15.2054,-9.9884,6.5975,13.11,8.3783,223
-40.0314,-9.8884,-11.6699,16.9889,-9.8884,12.9841,36.3364,21.1485,224
-138.9941,-8.8629,-0.8088,73.1315,-8.8629,18.8708,75.0861,40.4398,225
-20.9703,-9.5666,10.1273,17.3152,-9.5666,14.275,45.6318,22.4126,227
-9.3313,-10.12,2.8091,6.0929,-10.12,6.4013,20.4536,9.9209,228
-4.69,-9.8286,3.0208,6.124,-9.8286,6.7019,17.7632,11.3439,229
-15.3498,-9.9303,0.5634,4.1224,-9.9303,5.3276,12.8376,7.8759,230
-4.1426,-10.0544,3.1239,6.2424,-10.0544,5.5138,31.6663,11.6824,232
-9.6815,-10.1275,-1.4552,3.3613,-10.1275,5.3849,18.4444,6.9194,233
-2.9675,-9.3541,3.6599,5.5709,-9.3541,5.0695,13.3872,12.3894,234
-11.1125,-9.9056,0.5465,4.1103,-9.9056,3.8594,16.6581,12.7075,235
-6.3855,-9.8065,2.8458,5.2702,-9.8065,6.4491,29.7993,12.2363,237
-25.4962,-9.3456,0.2604,15.1627,-9.3456,10.3766,34.5587,24.5936,238
-9.1982,-9.2208,6.3726,10.0796,-9.2208,5.6358,20.6598,14.7667,239
-8.5487,-10.0862,0.9417,3.7931,-10.0862,5.2372,14.3783,7.305,240
-3.8372,-10.0511,1.4132,4.0652,-10.0511,2.1642,11.8387,8.7574,241
-14.8925,-9.7406,3.4518,8.5786,-9.7406,9.4341,17.8422,12.4932,243
-1.6967,-9.9111,1.7495,3.856,-9.9111,4.147,13.6781,10.0341,244
-8.0997,-9.6623,0.757,4.7291,-9.6623,0.7627,13.7201,10.0956,245
-6.0323,-9.5227,1.0505,5.6407,-9.5227,4.9929,15.7748,8.8865,246
-10.2995,-10.5564,1.4211,9.9552,-10.5564,5.9676,23.8078,17.2614,247
-2.4696,-10.105,1.2827,4.8104,-10.105,3.1398,11.4035,8.2101,248
-0.7943,-10.1937,0.9516,1.3042,-10.1937,0.9682,11.9078,8.3861,249
-2.2977,-9.8893,7.9329,8.18,-9.8893,7.8068,18.9166,12.8437,250
-10.995,-9.7688,0.7836,6.7958,-9.7688,2.3443,15.1682,9.6121,251
-7.6339,-9.1905,-1.6077,3.1133,-9.1905,3.1538,12.9081,5.7126,252
-3.5673,-9.8364,1.8802,3.1839,-9.8364,2.7259,22.4057,7.1556,253
-2.9408,-9.7475,1.5407,3.1375,-9.7475,5.7344,13.579,7.4991,254
-1.8047,-9.0886,0.122,0.8597,-9.0886,1.2266,10.3024,8.5586,255
-0.9723,-9.8835,1.2355,1.524,-9.8835,3.8834,18.1546,16.1672,256
1.419,-9.9123,36.2094,34.2628,-9.9123,15.1242,30.4744,25.8918,257
-17.5911,-9.7524,10.7261,26.0986,-9.7524,4.3316,26.9889,23.7288,258
-2.225,-9.9845,13.7864,11.9045,-9.9845,4.3237,25.3958,17.7715,259
-3.6147,-10.1196,-0.8415,1.3501,-10.1196,1.7491,16.0522,10.4898,260
-49.9649,-6.831,-3.47,20.0684,-6.831,5.6151,57.3814,17.2251,261
-22.9756,-10.0908,1.331,7.0039,-10.0908,5.4881,26.4304,14.4779,263
-7.8147,-9.8915,9.4852,11.3562,-9.8915,10.7591,50.6938,29.9247,264
6.1605,-10.4634,22.6022,8.4548,-10.4634,3.443,42.5868,28.7497,265
-12.2644,-9.7561,-5.9619,5.2229,-9.7561,3.0337,18.1495,10.9651,266
-3.2543,-9.8321,-1.3582,1.6407,-9.8321,5.0414,30.6658,27.434,267
-5.1881,-9.9621,-1.8034,2.5883,-9.9621,3.011,16.2351,15.1538,268
-8.0104,-9.71,3.395,7.8305,-9.71,2.2322,27.4686,21.052,269
-4.7684,-9.8979,2.2951,4.1236,-9.8979,5.1836,26.159,14.4287,270
-3.34,-9.8789,-0.1886,0.981,-9.8789,2.2956,11.1249,4.3568,272
-2.3754,-10.0118,2.4231,3.4206,-10.0118,7.7142,19.7091,11.4726,273
-2.2708,-9.6829,0.3043,2.2747,-9.6829,2.4762,16.8515,13.3128,274
-0.5125,-9.9354,1.2119,2.2795,-9.9354,2.4629,15.9742,6.4774,275
-1.5444,-9.9787,-0.0165,0.6157,-9.9787,1.7035,30.3278,6.6852,277
-2.8848,-9.8832,0.186,1.3686,-9.8832,3.5086,33.9265,25.7361,279
-3.0215,-9.8349,1.6629,4.3236,-9.8349,2.6423,14.9213,8.93,280
-7.3359,-9.9302,10.4562,15.9771,-9.9302,7.612,45.3836,34.9973,282
-17.8988,-9.6933,6.6402,14.2884,-9.6933,8.1958,29.4129,13.6211,283
-34.3321,-10.1497,-1.0778,10.3863,-10.1497,6.4075,27.5121,15.8253,284
-35.429,-9.845,15.9594,53.1198,-9.845,14.9245,40.9591,24.3566,285
-65.6073,-9.9803,-18.2438,21.4158,-9.9803,11.176,24.5008,10.6686,286
-9.3051,-9.9021,-0.681,5.6092,-9.9021,4.6272,10.5987,9.2124,287
-30.0405,-9.7656,-3.6838,10.4862,-9.7656,7.7188,21.5252,9.6997,288
-21.7739,-8.5202,1.6026,10.1662,-8.5202,11.1082,32.1027,18.4333,289
-34.4607,-5.3616,14.8786,57.8459,-5.3616,13.5038,86.821,30.8682,290
-36.8922,-9.8219,-5.1481,15.7282,-9.8219,8.2932,18.4611,12.3182,291
-4.8501,-6.7275,1.5043,4.3802,-6.7275,3.8502,25.4307,11.511,292
-4.5557,-9.784,3.0112,4.7791,-9.784,7.2619,20.4148,16.5972,293
-2.0698,-10.2957,12.7027,14.38,-10.2957,7.4415,25.6608,24.1284,294
-14.9556,-9.494,3.9809,17.065,-9.494,9.0805,52.3282,10.4458,295
-5.8533,-9.9898,1.5564,3.7144,-9.9898,5.051,17.6673,11.7271,297
-2.8713,-10.0258,0.0705,1.3476,-10.0258,3.3422,15.2975,11.8602,298
-0.3966,-9.651,0.295,0.5707,-9.651,2.3373,10.5664,6.8946,299
-1.0698,-9.9008,0.0086,0.9108,-9.9008,2.424,9.7493,5.1155,300
-26.8252,-8.5889,-0.9409,5.6063,-8.5889,5.1078,35.048,10.3386,302
-8.4624,-10.0029,3.1459,11.1753,-10.0029,9.4342,18.1099,12.4394,303
-6.8854,-9.7484,-0.8,2.7,-9.7484,4.3267,15.4094,11.3538,304
-1.8627,-9.9603,0.0737,0.6588,-9.9603,1.7535,20.6717,6.7217,305
-11.5504,-8.9316,0.9019,5.3276,-8.9316,6.7167,28.6425,9.929,307
-24.525,-8.3377,1.441,11.4072,-8.3377,7.1679,24.608,12.761,308
-3.0813,-9.3656,0.5126,4.0561,-9.3656,2.9789,16.1911,11.4924,309
-9.7165,-9.5624,12.0619,23.6762,-9.5624,14.3835,31.7449,22.3448,310
-13.6029,-9.6209,4.9154,10.0647,-9.6209,9.2162,30.2554,13.7355,312
-0.4702,-10.4587,2.3792,3.1487,-10.4587,2.4872,12.3319,8.5944,313
-13.9814,-7.9693,5.0734,9.727,-7.9693,4.4529,20.8646,17.9896,315
-20.8615,-9.8226,1.1393,11.2316,-9.8226,3.865,17.42,10.5817,316
-0.8264,-9.9083,0.7716,1.0539,-9.9083,3.5061,10.2957,5.8426,317
-44.2419,-8.2299,4.0875,28.5127,-8.2299,13.8703,42.869,19.0386,318
-15.2948,-7.0899,3.1047,11.9461,-7.0899,7.4789,46.3421,18.1526,319
-5.7072,-9.4299,4.6394,9.6939,-9.4299,7.3885,21.2114,14.825,320
-14.6651,-10.3219,-3.4591,8.2069,-10.3219,5.2065,25.5402,13.2421,321
-23.8725,-7.1098,0.5319,9.4199,-7.1098,7.5053,40.3953,11.7697,322
-20.2865,-5.7304,7.9296,15.3624,-5.7304,14.7108,38.8502,22.4973,323
-8.297,-8.2625,-1.509,3.7899,-8.2625,4.3664,16.2748,10.127,324
-26.6029,-8.4647,-1.6394,7.7362,-8.4647,5.8246,48.4965,11.2399,325
-37.7971,-9.1424,0.4576,13.9417,-9.1424,9.3397,31.2235,15.3989,327
-8.8379,-9.98,0.6677,6.5785,-9.98,8.1863,20.864,17.4684,328
-12.2974,-9.812,1.7405,12.0937,-9.812,6.0064,20.2878,12.8446,329
-18.8134,-10.121,7.5309,19.3765,-10.121,18.4201,65.848,23.6523,330
-13.9389,-8.1206,4.3921,11.3607,-8.1206,9.4599,63.8961,16.7083,332
-27.2449,-9.4672,0.0527,11.9421,-9.4672,9.1615,19.7881,15.6048,333
-15.1007,-10.2825,7.4424,14.4905,-10.2825,14.2939,31.6189,22.2297,334
-9.0583,-9.8785,1.0404,5.9958,-9.8785,3.4805,15.3916,11.1307,335
-13.9215,-9.9641,1.377,6.738,-9.9641,8.1457,21.6362,11.1952,337
-6.5664,-9.7711,0.2557,3.0432,-9.7711,4.8005,13.4113,8.1532,338
-0.2332,-10.6133,3.8064,3.4118,-10.6133,4.0329,17.2618,13.8273,339
-5.0035,-9.8483,3.452,5.4245,-9.8483,8.7811,16.6952,10.6194,340
-6.1799,-9.8748,1.8993,5.3868,-9.8748,5.9377,20.5064,11.5181,342
-19.7853,-9.5385,-3.2302,7.176,-9.5385,5.3752,37.9895,17.035,343
-3.7969,-10.2082,17.9845,21.8766,-10.2082,8.2822,20.3721,17.822,344
-2.9981,-10.0114,19.0047,24.8898,-10.0114,17.6946,41.5054,18.7934,345
-11.8114,-9.9169,10.1437,17.1163,-9.9169,10.3528,30.2013,15.2709,347
-10.1,-9.6461,3.1696,8.767,-9.6461,6.8235,14.823,9.7922,348
-14.4412,-9.9822,1.37,5.9335,-9.9822,7.932,23.6773,11.2512,350
-1.9497,-9.4208,0.8939,2.5082,-9.4208,3.7786,12.9183,7.4545,351
-23.8127,-9.9927,-0.2879,7.8792,-9.9927,5.6859,17.3394,8.9986,352
-16.6439,-9.9083,-0.5202,4.6359,-9.9083,5.059,11.1109,6.7163,353
0.0125,-9.3362,5.0902,4.7382,-9.3362,6.8345,14.7532,9.5266,354
-5.4002,-8.561,1.7024,6.883,-8.561,7.7573,22.652,11.975,355
-13.5019,-9.9504,-5.3626,6.5268,-9.9504,8.8302,23.7639,13.7382,356
-12.9014,-9.5424,5.5219,12.222,-9.5424,9.7401,24.908,13.8395,357
-7.5151,-10.0071,0.3815,3.8301,-10.0071,6.4865,17.5621,9.9253,358
-0.2196,-9.786,1.4988,1.891,-9.786,2.2163,8.146,5.6108,359
-5.2159,-9.7717,0.6726,3.4981,-9.7717,5.768,21.297,10.3919,360
-6.4547,-9.8931,1.1137,4.4818,-9.8931,7.578,19.1846,10.7889,362
-6.6185,-10.1134,0.7919,3.2105,-10.1134,3.7259,23.8522,9.1108,363
-0.6079,-10.0527,1.0075,1.2195,-10.0527,2.1324,11.4518,8.3432,364
-25.9222,-9.7763,8.5395,20.6624,-9.7763,11.5438,29.7321,16.8524,365
-11.8504,-9.5064,-2.6675,5.8661,-9.5064,6.8689,20.1988,13.4777,366
-3.5605,-10.0122,0.3169,2.4026,-10.0122,3.7142,17.6337,8.906,368
-9.4943,-9.4321,1.2108,4.0925,-9.4321,3.6134,26.1704,9.3774,369
-1.1002,-9.7491,1.043,1.6178,-9.7491,2.3291,8.8586,5.7857,370
-0.2453,-9.8681,0.971,1.8972,-9.8681,2.6555,13.5564,5.2551,371
-0.4243,-10.4388,0.0221,0.2411,-10.4388,1.0756,15.5223,5.9126,372
-4.5977,-9.2752,3.8282,7.4996,-9.2752,3.5643,15.9512,11.0899,373
-1.3013,-10.2703,8.739,10.1387,-10.2703,6.9622,21.1145,16.6554,374
-7.2831,-9.9551,0.6194,6.0946,-9.9551,3.7111,25.2533,8.3428,375
-5.3572,-9.9198,0.6983,6.6256,-9.9198,4.2341,17.9949,9.8883,376
-7.1631,-9.9921,0.1901,2.8655,-9.9921,6.0202,19.2449,11.8266,378
-4.6868,-9.9161,2.284,3.3957,-9.9161,4.7335,47.0174,16.7041,379
-0.3832,-9.7577,6.0831,9.8042,-9.7577,5.0709,19.5774,16.2436,380
-13.0574,-9.7792,9.8085,11.5654,-9.7792,12.1561,21.5774,15.1479,381
-23.1649,-10.0371,1.8499,9.8937,-10.0371,7.6187,20.0828,8.5247,382
-20.8947,-10.0325,-0.6436,11.146,-10.0325,8.5468,25.0727,15.4608,383
-11.9491,-9.539,-2.2869,4.4436,-9.539,3.7108,11.6293,6.2479,384
-7.0214,-10.1016,2.3706,7.6646,-10.1016,7.4374,17.8234,12.2296,385
-13.4461,-9.5732,0.6053,6.9939,-9.5732,7.7157,16.9913,10.9021,387
0.6186,-10.8646,7.1392,5.0013,-10.8646,10.094,22.4604,17.0074,388
-1.7822,-9.9327,1.5837,3.54,-9.9327,4.3767,19.0456,9.8152,389
-15.5431,-9.2408,2.6954,18.7746,-9.2408,10.9303,19.3289,13.4959,390
-7.1973,-9.7954,1.3042,5.8183,-9.7954,7.7891,25.409,15.6615,392
-4.3723,-9.4663,0.6392,3.2705,-9.4663,5.6124,15.9597,10.5277,393
-4.8281,-10.0504,-1.5199,1.8908,-10.0504,5.3072,16.5481,7.2233,395
-4.4941,-9.9163,2.3203,4.1458,-9.9163,5.974,15.8006,9.3408,397
-14.486,-9.8578,0.8395,5.4106,-9.8578,5.853,14.4174,10.916,398
-2.5855,-10.1367,0.8982,2.8166,-10.1367,2.4117,11.2388,7.8841,399
-8.4715,-9.8827,-0.5499,3.2039,-9.8827,4.1475,9.2957,6.1844,400
-5.0128,-9.859,0.6537,2.5615,-9.859,5.1603,14.867,6.2785,402
-13.1337,-9.9261,-0.9816,4.1893,-9.9261,5.3145,14.5218,7.0686,403
-7.0119,-10.1423,13.2513,20.4592,-10.1423,10.3055,25.5717,20.2758,404
-8.6217,-8.7342,3.4963,11.6163,-8.7342,8.2891,32.3141,12.7938,405
-3.0932,-10.1791,5.8369,5.8522,-10.1791,5.9867,13.6321,11.071,406
-2.2072,-9.8891,1.0246,4.1247,-9.8891,6.9231,18.7436,5.9589,408
-3.4536,-9.9091,0.8322,2.7498,-9.9091,4.6224,12.1586,8.5507,409
-6.7127,-10.0264,-0.2328,2.794,-10.0264,2.9211,9.2743,6.1344,410
-2.6512,-10.1994,-0.2468,1.7942,-10.1994,2.1987,10.4625,7.4158,411
-4.0966,-9.8964,-0.1698,2.1188,-9.8964,4.3494,11.2155,9.252,412
-1.2548,-9.8711,1.1117,1.7922,-9.8711,2.26,11.8355,10.4483,413
-3.1152,-9.8689,-0.1127,1.2884,-9.8689,2.0109,8.2649,6.607,414
-1.5062,-9.867,0.2557,0.9247,-9.867,1.6983,6.2222,5.3911,415
-1.5646,-9.9844,0.2574,0.9564,-9.9844,1.6074,5.8232,3.9565,416
-1.5414,-10.0845,0.2866,1.0728,-10.0845,2.524,15.3832,14.4091,418
-0.2407,-10.1131,0.3338,0.3946,-10.1131,2.3298,5.8571,3.8813,419
-0.0128,-10.0744,6.1514,5.2165,-10.0744,4.9032,29.6129,27.4426,420
-0.6693,-9.8414,1.031,1.1083,-9.8414,1.6233,9.9173,9.1573,421
-0.3027,-10.0345,-0.0529,0.1226,-10.0345,0.8661,4.6494,3.6731,422
-0.7672,-10.0149,1.5065,1.8547,-10.0149,2.2032,13.7106,8.0934,424
-0.4263,-9.8706,1.0099,1.1562,-9.8706,1.7371,6.5339,5.1619,425
-0.4229,-9.9503,0.0795,0.2072,-9.9503,0.7251,10.5218,6.5674,426
-3.4486,-9.9086,-2.0488,0.7895,-9.9086,0.7911,18.665,17.5275,427
-10.417,-9.8897,0.3792,7.1581,-9.8897,9.5276,24.3746,18.7855,428
-54.5682,-9.6121,-24.3382,22.5939,-9.6121,8.6203,23.0892,10.1792,429
-6.3262,-9.661,1.6381,4.6989,-9.661,2.1161,5.4503,3.7898,430
-32.9543,-9.5999,-15.0836,12.4959,-9.5999,4.4206,12.8752,6.2568,431
-1.6642,-9.7664,0.9654,1.7579,-9.7664,1.1911,2.7915,2.3368,432
-4.951,-9.8916,3.458,3.9003,-9.8916,2.7482,24.7529,22.7342,433
-3.6124,-10.0059,-0.7669,1.363,-10.0059,2.7847,23.9652,17.6601,434
-6.2615,-9.8868,-1.6294,2.3086,-9.8868,2.1333,5.9187,3.3126,435
-3.833,-9.9024,-0.7554,1.711,-9.9024,2.9109,5.0633,3.3511,436
-2.5359,-9.8797,-0.8273,1.0716,-9.8797,1.7863,4.6848,2.7486,437
0.496,-9.8984,1.0612,0.295,-9.8984,0.6035,3.1983,2.3955,438
-0.8539,-9.9211,-0.4037,0.3144,-9.9211,1.1104,2.4638,2.206,439
-21.9925,-9.7465,-10.9801,11.3898,-9.7465,5.9454,12.5846,7.5887,440
-49.4239,-9.9065,6.2319,17.2483,-9.9065,12.874,50.7318,19.0411,442
-22.5248,-9.9139,-1.3468,7.6045,-9.9139,4.9652,20.3604,11.0439,443
-2.8354,-9.7901,1.4455,3.4216,-9.7901,3.8624,22.0835,11.3836,444
-7.5314,-9.9325,-1.1008,2.6194,-9.9325,2.3987,9.3674,6.3473,445
-10.7689,-9.8667,5.9911,12.4685,-9.8667,13.7699,35.4677,19.0597,447
-5.7028,-10.1656,2.0134,8.2578,-10.1656,7.3399,18.9413,11.934,448
-1.8333,-9.7585,7.1368,6.9267,-9.7585,13.2379,22.2849,17.0116,449
-3.3781,-9.9487,0.1077,1.8305,-9.9487,4.0303,10.6841,6.2193,450
-3.405,-10.0137,0.8566,2.2144,-10.0137,3.2615,17.8905,12.7811,451
-7.1746,-9.8864,2.0749,5.9732,-9.8864,9.7168,27.0352,14.4531,453
0.01,-10.765,2.0329,2.2282,-10.765,3.883,12.0374,9.8846,454
-2.0309,-9.8314,0.1469,1.1056,-9.8314,2.1132,9.6214,7.8106,455
-2.2752,-10.1236,1.4839,3.313,-10.1236,3.9168,12.4101,7.7911,456
-5.3658,-9.8936,0.6947,3.2968,-9.8936,4.492,10.8324,7.7269,457
-1.3203,-9.9351,0.342,1.323,-9.9351,3.8341,12.93,3.3156,459
-1.5888,-9.8068,0.1026,1.2446,-9.8068,2.4241,7.0791,3.3552,460
-1.3715,-10.0005,0.4691,1.1347,-10.0005,0.658,10.5398,7.5637,461
-5.8092,-10.3814,0.566,3.5798,-10.3814,2.0965,18.9156,8.794,462
-9.5504,-10.008,1.3431,5.2619,-10.008,5.4939,24.4099,14.6458,463
-4.6534,-10.0087,13.066,13.7842,-10.0087,7.0955,28.2069,24.4023,464
-2.2977,-9.8535,1.8444,4.3061,-9.8535,3.4453,14.2591,9.8894,465
-2.2692,-10.0237,1.5533,3.0613,-10.0237,6.9755,21.8967,18.8081,466
-8.4156,-9.9122,-1.2242,3.5671,-9.9122,6.4887,28.4387,18.0971,467
-10.8944,-10.1718,4.8742,8.404,-10.1718,6.5427,20.9566,17.8016,468
-1.5753,-9.9648,0.4388,1.2865,-9.9648,1.7189,7.7486,5.6661,469
-4.1544,-9.9756,0.3047,1.6829,-9.9756,4.3256,12.3534,7.4279,470
-0.9697,-9.9084,5.115,5.6023,-9.9084,6.5278,24.0882,11.2359,472
-6.0209,-9.9183,7.8975,9.3541,-9.9183,9.0304,41.9045,13.7496,473
-4.7895,-9.925,1.7943,3.2236,-9.925,8.3464,23.4941,16.1761,474
-0.7308,-9.8646,0.7997,1.4084,-9.8646,2.1722,9.0319,6.0977,475
-1.3806,-9.8624,1.3698,3.0398,-9.8624,2.1237,12.1156,10.8816,476
-9.1397,-9.9313,-0.5099,3.778,-9.9313,4.7427,17.569,8.5864,477
-12.8136,-9.9987,0.9624,8.719,-9.9987,9.7205,50.3614,25.5921,478
-34.5414,-9.7567,9.1568,22.389,-9.7567,4.112,51.5492,29.5265,479
-34.4378,-9.9999,6.5566,28.7821,-9.9999,9.3357,49.965,20.1113,480
-108.8105,-9.5455,-17.0739,32.6453,-9.5455,20.4614,45.6286,25.6415,482
-127.3151,-9.7206,-38.9231,44.3815,-9.7206,34.3354,69.5652,35.2814,483
-9.4401,-10.2945,26.6795,29.2401,-10.2945,13.0049,41.6011,33.4755,484
-85.8723,-9.5718,-3.58,30.0143,-9.5718,8.188,41.5505,19.9482,485
-15.1937,-9.8096,3.8867,8.541,-9.8096,10.7178,28.0494,16.1074,487
-3.8248,-9.8146,0.5126,3.2872,-9.8146,1.3705,7.438,4.8515,488
-5.7369,-10.0163,-1.4183,1.9184,-10.0163,2.2655,16.199,9.0639,489
-1.8883,-9.9711,2.2724,2.8395,-9.9711,4.7341,24.503,16.8277,490
-10.1192,-9.9033,2.175,6.2162,-9.9033,7.4209,32.772,14.164,492
-1.838,-9.9093,0.6365,1.4746,-9.9093,0.8981,17.9349,14.3638,493
-6.2264,-9.906,-0.9223,2.6618,-9.906,3.3885,10.0633,6.0813,494
-25.6555,-9.7658,-0.6236,12.9997,-9.7658,7.1376,13.8367,4.8441,496
-0.7497,-9.9223,1.5284,1.8109,-9.9223,1.7018,6.4352,2.5024,497
-8.1408,-9.8772,-2.4558,2.8037,-9.8772,2.5499,7.0506,4.8516,498
-1.3073,-9.8681,-0.1579,0.5949,-9.8681,1.3033,37.7348,13.1606,499
-20.2746,-9.9439,5.4531,12.1875,-9.9439,5.3414,57.0382,48.2316,500
-7.4254,-9.9237,1.0498,6.2466,-9.9237,1.6764,32.0583,29.576,501
-19.3245,-9.6225,17.463,33.0583,-9.6225,15.1385,61.0131,49.77,502
-1.068,-10.0833,4.2407,4.9774,-10.0833,6.6245,25.3564,20.4353,503
-8.6092,-9.8898,-3.3848,3.8872,-9.8898,4.2037,8.9949,6.1149,504
-57.3966,-9.2134,-1.6192,27.8796,-9.2134,16.1877,52.0935,37.4446,505
-244.672,-9.8765,-7.0819,63.2371,-9.8765,18.1193,48.8273,18.8679,506
-18.8517,-9.8658,1.8386,9.0337,-9.8658,6.5363,35.8212,13.9603,508
-13.0125,-10.0106,-1.2762,7.1979,-10.0106,10.2352,29.9992,13.9299,509
-9.2887,-9.8053,2.0266,8.9406,-9.8053,3.151,20.3285,16.6444,510
-19.4893,-9.9937,-0.1186,11.0582,-9.9937,10.2578,28.8078,18.1744,511
-2.2411,-9.8759,1.2082,2.53,-9.8759,2.6711,9.9047,5.9245,512
-4.6987,-10.0686,-0.1397,4.5412,-10.0686,3.2902,10.9451,6.7065,513
-3.8287,-9.7604,-0.1433,1.6138,-9.7604,1.9553,8.627,5.2694,514
-12.1784,-9.8512,5.6109,9.758,-9.8512,12.3842,33.6965,22.4185,515
-10.2622,-9.8952,0.1768,3.3206,-9.8952,4.5104,18.1466,7.0455,517
-4.427,-9.8329,1.0787,2.9205,-9.8329,4.221,25.1776,9.7484,518
-0.176,-10.0148,2.5597,2.8468,-10.0148,2.4114,18.442,15.0381,519
-2.7403,-9.8055,2.8775,3.2039,-9.8055,4.5228,17.6993,8.0027,520
-15.2047,-9.9997,0.8123,4.9497,-9.9997,9.3639,31.934,21.963,522
-4.9809,-9.5074,0.7809,3.9923,-9.5074,3.297,20.6968,9.8292,523
-3.2047,-9.6565,0.3,2.6158,-9.6565,1.6471,10.4132,8.0928,524
-21.3658,-9.4308,0.5358,8.8948,-9.4308,8.0004,40.4694,19.6894,525
-13.408,-9.9367,2.8273,6.6657,-9.9367,5.4476,59.017,25.649,527
-6.7271,-9.8432,-1.1011,2.6446,-9.8432,2.2662,22.0333,19.2402,528
-26.1971,-9.6025,0.3485,8.8198,-9.6025,7.6299,55.4159,31.7922,530
0.186,-9.9808,13.1259,12.6807,-9.9808,3.677,28.9306,23.8253,532
-0.7489,-9.8824,3.0983,2.9781,-9.8824,6.5497,14.15,11.8479,533
-1.8215,-9.8733,-0.0597,0.8002,-9.8733,1.8676,12.8322,6.5606,534
-0.0811,-9.8251,0.054,0.1012,-9.8251,0.7731,12.8055,5.3388,535
-6.2895,-10.2404,5.4654,8.3162,-10.2404,1.9303,31.7659,24.9195,536
-0.5668,-9.9974,10.3114,8.3188,-9.9974,3.9722,23.466,16.9709,537
-5.8312,-10.0478,1.0617,4.2311,-10.0478,5.9976,21.7624,12.5451,538
-6.3227,-9.8714,0.5844,5.822,-9.8714,0.8525,14.939,10.9826,539
-18.003,-9.3638,3.7107,17.666,-9.3638,6.2005,24.2034,8.5093,540
-5.7082,-9.5076,7.7476,13.3435,-9.5076,4.5403,18.3463,14.3141,541
-4.6746,-9.9735,1.7384,4.1699,-9.9735,4.0171,19.0998,14.0675,542
-3.6535,-10.022,0.2558,2.3194,-10.022,2.6235,10.3237,6.573,543
-0.9217,-9.776,0.3235,0.8934,-9.776,3.512,10.6421,7.0629,544
-0.0697,-10.2211,0.1893,0.2716,-10.2211,1.0568,5.0029,3.2589,545
-6.0003,-10.2061,0.6961,3.889,-10.2061,2.7486,12.1857,7.5838,546
-5.4671,-10.0612,-1.61,1.8657,-10.0612,2.541,13.0454,7.275,547
-5.0577,-9.8354,-1.2181,2.0917,-9.8354,2.366,11.0379,7.4945,548
-5.0549,-10.2456,0.5616,4.4558,-10.2456,4.786,20.5445,10.3857,549
-4.69,-10.1503,0.2418,3.2463,-10.1503,4.8894,11.3511,8.1109,550
-3.1225,-9.8337,0.3837,1.6129,-9.8337,2.8197,11.4528,5.7662,552
-11.2311,-9.9595,0.1289,2.9571,-9.9595,4.7598,15.5398,7.3625,553
-0.6313,-10.2066,4.1532,4.4192,-10.2066,4.6166,17.0463,11.7804,554
-3.2459,-9.9325,6.2401,10.4161,-9.9325,8.8083,21.2612,15.0504,555
-8.1849,-9.3423,0.6737,3.6172,-9.3423,4.5817,25.4232,8.837,557
-9.2323,-8.4436,-0.5997,5.2946,-8.4436,3.0893,13.9673,9.9015,558
-4.7578,-9.8844,0.2697,2.2997,-9.8844,2.0086,6.5976,3.518,559
-3.094,-9.9323,1.1107,3.0879,-9.9323,5.8142,14.7005,9.8575,560
-9.6226,-9.8867,3.1651,7.0008,-9.8867,8.4667,25.1652,13.7006,562
-20.8093,-9.8786,4.8791,9.0893,-9.8786,10.4649,27.0678,17.9413,563
-8.4784,-10.3108,2.9941,7.2414,-10.3108,4.0581,17.7776,15.5806,564
-9.2015,-9.8196,3.5948,7.3928,-9.8196,5.7707,24.2202,13.0993,565
-5.6594,-10.2107,9.1854,11.0706,-10.2107,11.2505,35.7289,25.6419,567
-4.2242,-9.0497,0.7484,2.7001,-9.0497,4.4124,31.4578,20.7256,568
-19.1267,-9.8013,-2.6377,8.7855,-9.8013,4.9675,27.8896,14.6963,569
-15.3191,-10.1172,7.4841,13.5764,-10.1172,4.3676,61.4893,31.1127,570
-9.1696,-10.2803,-4.101,3.4731,-10.2803,3.6634,33.0382,20.857,571
-17.3112,-9.9957,-2.9402,6.4705,-9.9957,9.2406,26.7744,16.5324,572
-103.5957,-10.0515,-19.1495,34.6864,-10.0515,21.6002,54.9429,27.2546,573
-77.774,-9.7177,-11.3712,49.4986,-9.7177,21.5558,54.4095,30.0025,574
-68.565,-9.8564,8.0145,35.4235,-9.8564,17.5814,41.7508,30.8238,575
-6.9842,-9.7688,2.1342,6.5548,-9.7688,3.2119,30.0843,15.6813,576
-2.1146,-9.8156,0.0255,1.356,-9.8156,2.974,12.452,5.783,577
-10.7254,-9.9065,0.6682,4.1518,-9.9065,3.8105,20.4398,12.306,578
-14.7747,-9.9738,17.6094,36.033,-9.9738,14.6726,59.5454,19.8829,579
3.2191,-10.0413,43.692,28.5993,-10.0413,3.1221,38.604,29.9886,580
-108.4464,-8.8357,-23.9009,41.0155,-8.8357,18.2603,78.895,56.7931,581
-29.1279,-10.5398,-1.9658,11.7509,-10.5398,5.8063,30.5342,15.125,582
-21.4981,-10.3113,-5.9054,9.0004,-10.3113,5.4869,23.8915,20.6667,583
-37.0996,-10.0441,26.3187,41.8965,-10.0441,19.7525,45.6793,32.9864,584
-25.5774,-10.0605,32.7681,42.0674,-10.0605,24.5415,43.1371,32.0296,585
-6.3926,-9.8829,6.7239,8.6957,-9.8829,4.5836,24.5332,22.9956,586
-8.244,-10.0394,7.2302,11.3734,-10.0394,11.2604,41.8717,22.1214,588
-32.1258,-9.9238,4.1645,12.6957,-9.9238,11.1981,38.0214,13.176,589
-8.8283,-9.8447,-0.4983,3.3449,-9.8447,5.4746,16.1278,8.3864,590
-6.8588,-10.1121,-0.5858,3.5641,-10.1121,5.5178,13.0378,10.0224,591
-8.5173,-10.2595,1.566,5.8459,-10.2595,4.9201,19.5079,12.5197,592
-43.3831,-10.3074,1.0235,31.858,-10.3074,20.1255,72.926,41.0505,593
-35.6727,-9.7428,-4.2418,18.2948,-9.7428,7.4456,22.6,11.5731,594
-17.0719,-9.9613,10.1468,23.0085,-9.9613,16.5896,45.2292,29.352,595
-8.9458,-9.8,0.3508,3.9999,-9.8,6.3556,18.076,9.5443,597
0.2125,-10.0885,1.0979,0.8109,-10.0885,2.1252,13.3294,8.6544,598
-1.9979,-10.1384,-0.2244,0.7949,-10.1384,1.9753,4.9143,2.7715,599
-7.1263,-9.9362,1.603,3.1113,-9.9362,5.2034,16.4714,9.6246,600
-9.985,-10.1781,-0.2893,3.389,-10.1781,3.2349,17.4105,9.1593,602
-2.4139,-9.9799,1.3461,2.2343,-9.9799,3.7272,12.1298,7.3818,603
-15.0301,-9.8935,-1.1694,6.0399,-9.8935,4.0456,19.1746,10.7713,604
-14.0239,-9.9264,-2.0303,5.4714,-9.9264,8.8507,21.2723,11.0395,605
-10.6249,-9.3882,-4.5138,4.2296,-9.3882,5.7795,35.8435,15.1423,606
-13.346,-9.9284,-0.9006,6.5347,-9.9284,6.6838,22.8576,9.2281,607
-7.4792,-9.8639,0.1883,4.0021,-9.8639,3.7515,16.7105,8.1839,608
-22.4732,-9.9526,-4.5322,12.5904,-9.9526,5.7509,22.3726,13.9811,609
-18.0287,-9.8216,2.2271,8.6434,-9.8216,6.054,13.2551,10.6135,610
-20.8535,-9.7368,-7.1799,8.3979,-9.7368,5.5073,17.6654,9.607,611
-26.2647,-9.647,-5.2264,8.1472,-9.647,6.7922,18.1044,8.068,612
-13.2302,-10.1333,-2.3195,4.8645,-10.1333,3.1077,20.0253,8.905,613
-3.416,-9.9033,2.9631,5.0757,-9.9033,4.7426,18.9977,15.5095,614
-21.5434,-9.8277,0.396,9.1496,-9.8277,6.6223,21.2757,13.4516,615
-44.056,-6.9148,-18.2874,19.0709,-6.9148,11.3585,30.9581,24.6726,616
-21.4739,-9.762,0.8601,12.2661,-9.762,9.9354,27.3707,13.846,618
-11.3258,-9.6529,-0.0859,4.5597,-9.6529,5.2935,24.8411,10.8042,619
-11.4307,-9.7009,14.8787,20.4927,-9.7009,7.9065,29.9989,20.7594,620
-20.5509,-9.6915,15.9904,32.9994,-9.6915,4.1877,27.0302,21.1022,621
-6.1119,-10.0673,2.8122,5.3878,-10.0673,5.7569,14.0534,9.2167,622
-0.5123,-9.2795,1.0707,1.2493,-9.2795,3.3293,10.6286,8.1939,623
-5.3576,-8.7666,2.4317,5.9379,-8.7666,6.4643,25.3329,19.8502,624
-29.54,-9.606,-3.4491,8.8532,-9.606,5.9172,15.6338,11.4684,625
-14.7757,-9.4868,0.7804,7.8781,-9.4868,8.553,34.168,14.7035,627
-2.2653,-10.0564,1.0535,2.2363,-10.0564,3.2036,12.7346,8.8668,628
-4.5548,-8.9334,-1.2717,2.2575,-8.9334,3.1767,22.6544,11.9169,629
-7.7491,-10.1351,-0.2751,5.6565,-10.1351,7.7493,31.4655,12.2789,630
-39.71,-9.7493,3.3182,13.6301,-9.7493,10.9937,36.0316,15.0253,632
-11.2951,-9.9238,1.3793,8.9155,-9.9238,9.6393,20.4016,16.3489,633
-3.7026,-10.0379,0.7408,2.7776,-10.0379,2.6866,15.8943,8.3404,634
-15.4124,-9.7074,-2.0588,5.4119,-9.7074,4.916,18.6166,9.9449,635
-4.8952,-9.8366,1.292,3.9463,-9.8366,4.386,18.5871,10.6004,637
-43.1899,-9.4064,-3.3931,11.4061,-9.4064,7.6712,29.7916,12.8067,639
-3.3779,-9.9905,-1.3756,1.708,-9.9905,1.1103,16.3021,13.217,640
-0.1808,-9.6919,4.5778,3.827,-9.6919,10.4276,20.0831,12.6323,641
-12.5063,-9.674,1.8087,5.5892,-9.674,5.7568,26.4235,13.863,642
-6.4535,-9.9693,-0.56,2.5574,-9.9693,7.3646,16.4268,9.6028,643
-1.1084,-9.6627,3.1617,2.7255,-9.6627,4.5422,20.141,13.6505,644
-9.2404,-9.8385,-0.8214,4.5768,-9.8385,4.645,15.2187,8.777,645
-15.4641,-9.9234,0.6252,4.9642,-9.9234,3.9063,29.0972,13.7422,647
-44.7262,-10.0021,6.9577,27.9832,-10.0021,7.9988,65.4918,21.3516,648
-0.0656,-10.0514,5.2569,6.3162,-10.0514,5.1042,22.6489,15.0871,649
-18.7167,-9.6983,32.5493,49.8193,-9.6983,23.3667,82.85,24.4106,650
-6.1688,-9.9297,10.4441,12.8653,-9.9297,4.1454,41.7507,17.0116,651
-9.457,-9.9822,19.5707,20.939,-9.9822,21.4523,46.49,31.6536,652
-9.3054,-9.9938,9.1324,15.2112,-9.9938,10.9937,37.4127,21.1395,653
-3.5813,-9.7853,1.9358,4.7961,-9.7853,3.9198,21.9337,11.5132,654
-1.4332,-10.043,3.6828,4.9529,-10.043,3.7079,16.4796,9.872,655
-2.6878,-9.9621,1.3879,2.4776,-9.9621,4.3062,13.6243,7.638,657
-6.951,-9.9451,3.5718,5.8432,-9.9451,8.3712,18.0019,13.2825,658
-3.0346,-10.1009,3.9309,4.8736,-10.1009,3.8677,15.9692,7.8138,659
-4.9676,-9.9409,3.5497,6.8449,-9.9409,5.501,13.9667,7.3989,660
-1.2271,-9.8566,2.4333,3.8749,-9.8566,2.2829,15.201,5.6494,661
-1.581,-9.885,2.449,3.3553,-9.885,4.6157,20.9446,9.3071,663
-26.6609,-9.9362,2.9012,13.2214,-9.9362,8.8753,32.8209,16.7472,664
-0.8048,-9.951,2.4599,2.1507,-9.951,3.6034,16.5987,9.6323,665
-0.1321,-9.8857,28.1775,24.5435,-9.8857,3.1289,43.5928,22.0771,666
-0.4209,-9.794,17.6916,13.6765,-9.794,4.6354,37.9405,20.7068,667
-0.364,-9.9234,3.6122,3.839,-9.9234,4.9607,21.1481,6.0694,668
-9.3214,-10.1734,-2.7524,3.3799,-10.1734,2.9505,28.9903,26.0563,669
-1.191,-10.0495,13.9039,11.4396,-10.0495,8.9831,36.0107,22.2961,670
-14.686,-9.9733,-0.4203,5.2739,-9.9733,8.1729,30.3629,14.5955,672
-17.1907,-9.9922,-0.886,5.9907,-9.9922,9.0111,27.7071,17.7676,674
-2.1765,-9.9208,-0.115,1.1206,-9.9208,2.0968,11.5211,9.8919,675
-5.572,-9.9055,0.2684,3.8023,-9.9055,3.2908,23.3134,11.9787,677
-7.7445,-9.4508,-2.0883,4.2556,-9.4508,1.1501,13.9612,11.9441,678
0.3863,-8.8463,14.726,13.1515,-8.8463,9.201,40.6408,22.1571,679
-7.8086,-10.4518,0.9887,5.7693,-10.4518,5.7518,19.852,14.0621,680
-32.995,-9.8878,4.5691,27.4601,-9.8878,16.7283,50.8855,17.5413,681
-26.2943,-9.9798,5.5983,22.0894,-9.9798,12.9687,39.735,24.1474,682
-21.678,-10.0528,14.7015,29.2597,-10.0528,18.2265,46.2196,35.0677,683
3.1007,-9.8646,18.231,10.8824,-9.8646,5.6233,37.199,17.4433,684
-28.2387,-10.2291,13.5226,34.7127,-10.2291,30.5967,70.2499,51.6083,685
-19.2131,-9.8307,7.4892,16.7289,-9.8307,12.3934,48.44,17.3947,687
-8.9429,-10.1089,-1.2375,7.3418,-10.1089,9.5794,41.5129,30.445,688
-2.8848,-10.0323,0.4962,2.6171,-10.0323,4.0285,15.3059,10.287,689
-9.6629,-9.9529,4.0526,7.0968,-9.9529,11.4189,23.5053,14.9618,693
-2.6674,-9.9112,1.8779,3.1651,-9.9112,5.5734,15.8217,7.5811,694
-1.2792,-9.7748,0.0665,0.643,-9.7748,1.6906,18.7662,7.264,695
-3.0937,-10.0273,-0.9708,1.2217,-10.0273,2.5588,6.184,3.9055,696
-6.0494,-9.7824,1.5288,3.9089,-9.7824,7.0663,14.9411,9.7475,698
0.5255,-9.6351,5.7618,3.4007,-9.6351,4.9557,19.7835,16.3012,699
-1.3368,-10.1129,2.1558,2.5021,-10.1129,2.7108,15.3583,12.42,700
-3.2439,-9.9301,3.2014,4.3669,-9.9301,3.4449,17.3651,12.6582,701
-2.8724,-9.6332,2.3832,7.0098,-9.6332,5.0434,20.4259,15.7467,702
-13.8637,-9.5058,-0.4344,6.9731,-9.5058,8.177,18.5114,13.0509,703
-7.9709,-9.8623,3.3195,5.132,-9.8623,8.036,26.8723,14.9424,704
-14.0087,-9.3546,1.758,10.3408,-9.3546,6.9439,15.5088,7.7563,705
-11.9732,-9.9985,-1.39,5.4016,-9.9985,3.651,11.5323,9.8267,706
-4.9753,-9.8451,2.1621,4.8813,-9.8451,9.4709,18.1175,11.6532,708
-1.0777,-9.8913,0.555,1.2008,-9.8913,1.7839,8.177,4.6536,710
-1.0215,-9.8303,0.5517,1.3202,-9.8303,2.2769,10.6577,6.1968,711
-1.3046,-10.0523,-0.4356,0.5445,-10.0523,0.6512,6.034,5.04,712
-0.5917,-9.7539,0.9718,1.6751,-9.7539,1.9156,8.2124,5.5671,713
-1.8598,-9.7127,-0.2054,0.894,-9.7127,0.4021,6.0258,5.0294,714
-0.404,-9.7908,0.461,0.5738,-9.7908,2.3093,6.7116,4.2566,715
-0.6219,-9.6591,0.8426,1.2643,-9.6591,1.5693,7.3166,5.733,716
-1.4953,-9.8624,-0.0406,0.5605,-9.8624,1.086,5.7168,3.1858,717
-1.2617,-9.8694,0.395,0.8306,-9.8694,1.3315,6.8376,4.7792,718
-0.7179,-9.9655,0.2015,0.6494,-9.9655,1.8872,7.1606,5.6574,719
-0.6638,-9.9753,-0.0854,0.2299,-9.9753,1.1056,5.9843,3.4668,720
-2.29,-9.8245,0.223,1.004,-9.8245,4.0118,7.914,4.8915,722
-2.523,-9.9747,1.0008,1.7404,-9.9747,6.0813,10.2942,7.4549,723
-0.776,-9.7915,0.2137,0.5685,-9.7915,2.4958,7.7569,3.5072,724
-0.5374,-9.8532,-0.1748,0.23,-9.8532,0.8833,3.9276,1.7161,725
-3.1043,-9.9252,1.5001,2.0726,-9.9252,9.0116,14.3384,11.6305,727
-3.5205,-9.5083,0.7539,2.5162,-9.5083,2.9149,24.2185,10.4646,728
-1.7612,-9.7984,0.1082,1.2561,-9.7984,0.6382,10.6114,7.4535,729
-2.5908,-9.8645,1.0017,1.8358,-9.8645,1.0334,11.3532,9.9505,730
-0.6062,-9.8214,2.1799,3.0937,-9.8214,5.8539,18.4512,17.5083,732
-1.839,-9.9813,5.1692,6.3486,-9.9813,10.8627,21.7956,14.9033,733
-1.0382,-9.893,0.562,2.1207,-9.893,2.6746,9.6214,5.7344,734
-0.1884,-10.0155,0.1466,0.3729,-10.0155,1.0731,5.9222,4.514,735
-2.0184,-9.7754,-0.1722,0.8438,-9.7754,1.2442,7.8321,5.2848,736
-1.2833,-9.9425,0.2898,0.7876,-9.9425,2.3713,10.2889,4.8411,738
-0.5271,-9.8539,0.0263,0.2519,-9.8539,0.7002,3.9194,2.6904,739
-0.5673,-9.8653,0.4061,0.4413,-9.8653,1.8654,9.7194,7.4313,740
-0.7683,-9.8951,0.0798,0.5639,-9.8951,1.322,7.9893,5.2123,741
-0.8898,-9.8358,0.2077,1.0238,-9.8358,0.9584,8.4739,5.141,742
-0.5706,-10.6077,6.3915,5.1036,-10.6077,4.2993,38.968,24.6979,743
4.6678,-9.6415,22.0242,13.8051,-9.6415,2.6384,25.9992,20.6313,744
1.4178,-9.8,14.6084,9.6704,-9.8,4.4558,28.6159,21.4355,745
-16.4608,-10.073,15.5011,17.7632,-10.073,13.7429,61.9436,29.0317,747
-16.9104,-9.9654,6.2215,12.2301,-9.9654,13.7933,38.1551,23.6514,748
-4.1985,-9.9738,-1.298,2.3304,-9.9738,3.8603,29.3865,27.4871,749
-11.9297,-10.0279,5.5298,10.266,-10.0279,11.0161,26.2677,15.6645,750
-2.5334,-9.7553,11.4019,12.7813,-9.7553,6.7374,16.1131,13.9351,751
-2.2868,-9.8307,1.8329,3.4258,-9.8307,1.7573,7.221,5.7996,752
-0.7954,-10.0666,0.8667,1.5179,-10.0666,2.7097,9.0092,4.7544,753
-2.0117,-9.9259,1.204,3.2688,-9.9259,5.5714,14.555,7.9249,754
-1.4335,-9.8873,2.3732,3.1658,-9.8873,3.0585,20.06,13.0436,755
-0.4594,-10.1789,2.3947,4.2625,-10.1789,6.524,17.8765,15.5408,756
-2.3685,-9.8905,-0.2477,1.8589,-9.8905,3.9567,19.9784,15.4505,757
-0.6557,-9.9747,1.0825,1.1974,-9.9747,3.5157,12.0934,9.1001,758
-1.7415,-10.095,-0.526,0.6825,-10.095,1.0695,7.6092,4.4676,759
-1.7056,-9.9026,-0.3154,0.8199,-9.9026,1.6546,4.3153,2.7841,760
-0.6374,-9.9181,0.3181,0.5576,-9.9181,3.1187,13.7231,6.5348,762
-3.7938,-9.8961,0.3779,1.667,-9.8961,4.0068,19.8494,13.5643,763
-0.0285,-9.9422,0.9023,0.6634,-9.9422,0.5354,8.0287,4.5022,764
-1.961,-9.9078,0.0149,0.7919,-9.9078,1.4975,6.9582,3.1028,765
-8.0665,-9.9289,0.612,2.9993,-9.9289,5.0441,27.1027,10.8195,767
-4.2633,-9.9705,1.2372,3.09,-9.9705,5.9488,30.1388,15.3285,768
-0.8454,-10.0312,-0.0544,0.6865,-10.0312,1.626,18.3592,15.3512,769
-6.7026,-9.8952,-0.4338,3.9612,-9.8952,4.3509,9.7468,6.9285,770
-16.332,-9.8541,-2.4533,5.1801,-9.8541,4.5599,13.0305,5.9805,772
1.1657,-9.8455,3.364,0.8194,-9.8455,0.8052,4.0504,3.7244,773
-5.2247,-9.8925,-2.3169,1.4608,-9.8925,1.2616,5.8776,3.5428,774
-4.6854,-9.9025,1.9757,3.9157,-9.9025,4.1999,8.6535,4.7102,775
-1.78,-9.8975,0.7327,1.7767,-9.8975,2.7517,5.4995,2.772,776
-6.4588,-9.8944,-0.5521,2.0465,-9.8944,3.1312,6.7744,3.1224,778
-1.2047,-9.8789,-0.5443,0.8082,-9.8789,1.1271,2.5129,2.1302,779
-1.1528,-9.9158,0.213,1.0461,-9.9158,3.3008,8.2277,5.2752,780
-4.255,-9.9113,-0.8192,1.7587,-9.9113,1.5239,17.0948,12.996,781
-8.2894,-10.191,-1.8181,4.401,-10.191,5.0381,45.3892,42.0533,783
-1.2297,-9.9538,0.1768,0.8205,-9.9538,0.8034,13.1401,10.9852,784
-3.0798,-10.1304,0.0012,1.6583,-10.1304,3.7658,13.1854,8.7517,785
-0.07,-9.9053,0.5061,0.4784,-9.9053,1.8242,13.0288,10.9159,786
-1.5792,-9.6149,0.6341,1.6845,-9.6149,5.7913,24.6416,18.188,787
-2.6873,-9.9866,-0.4979,0.7563,-9.9866,3.9284,37.1752,25.6999,788
-4.8686,-9.9265,3.0716,5.8554,-9.9265,6.9236,35.6371,24.7185,789
-3.3906,-9.9081,-0.6215,1.3941,-9.9081,2.0163,7.7537,4.9505,790
-0.9876,-9.9741,-0.2653,0.5627,-9.9741,1.219,23.0698,15.6402,791
-2.9768,-9.9119,0.2907,1.9901,-9.9119,2.859,11.522,7.6406,792
-13.4817,-9.8488,-3.7336,5.4011,-9.8488,3.7421,11.4473,7.4427,793
-6.3539,-9.8775,2.097,2.3019,-9.8775,3.6768,15.4876,5.7982,794
-29.0416,-9.9477,3.1157,10.1823,-9.9477,4.6411,29.3912,22.273,795
-13.1465,-9.9366,-3.5515,5.9447,-9.9366,3.3682,26.124,17.2189,796
-44.0714,-9.881,-15.9712,20.3772,-9.881,6.0823,44.6479,35.9401,797
-64.4857,-9.8088,-11.1901,31.1293,-9.8088,7.0041,25.1151,16.813,798
-7.9696,-9.9474,-2.2159,4.8502,-9.9474,6.5972,40.2014,31.9344,799
-15.6422,-9.9965,-4.7731,6.0534,-9.9965,7.7005,29.9519,14.912,800
-7.1566,-9.9215,1.1177,4.0792,-9.9215,5.7731,19.5616,6.9964,802
-13.4616,-10.042,4.0186,7.6462,-10.042,6.995,20.7991,14.4123,803
-10.0772,-9.4896,6.1404,12.8556,-9.4896,3.1373,22.3712,15.0019,804
-6.5223,-10.075,-0.4045,2.5426,-10.075,3.7139,16.2728,12.0342,805
-13.7094,-9.8963,1.0312,4.388,-9.8963,7.6623,25.3405,11.2017,807
-18.1044,-9.8105,-0.7286,9.226,-9.8105,12.9138,32.6111,22.1443,808
-1.6538,-10.2251,2.6424,3.7249,-10.2251,5.5385,27.0088,19.5839,809
-6.2404,-9.975,6.2984,10.1689,-9.975,9.453,36.7355,15.9194,810
-25.0738,-10.0672,1.436,7.4471,-10.0672,7.4423,33.165,15.2876,812
-1.7362,-9.9979,1.6979,2.1493,-9.9979,0.5,8.5583,5.7437,813
-4.5005,-9.7322,-0.7027,2.9303,-9.7322,8.0604,24.3248,17.0674,814
-5.2991,-9.9209,8.6562,10.8748,-9.9209,8.4264,26.3832,18.5488,815
-15.0998,-9.8633,1.1761,6.7481,-9.8633,5.2955,24.0136,10.794,817
-21.7536,-9.834,-0.2352,12.2782,-9.834,5.2938,19.5367,11.2524,819
-12.5472,-9.6705,-5.8607,4.2251,-9.6705,6.0811,19.4301,9.4932,820
-13.7734,-9.9908,-0.321,9.0144,-9.9908,5.0338,26.6775,24.0196,821
-5.202,-9.7184,9.6333,15.4523,-9.7184,16.3936,45.3432,31.0989,822
-2.7559,-10.0529,2.7708,4.7634,-10.0529,4.5372,21.261,11.188,825
-1.7246,-10.0275,0.7596,2.1664,-10.0275,4.1196,18.0068,7.4947,826
-9.9574,-10.0621,-3.2182,3.5008,-10.0621,5.2091,30.407,23.584,827
-19.8284,-9.8055,1.547,8.7539,-9.8055,6.8463,28.225,6.8045,828
-63.0365,-9.8623,-10.5796,22.2879,-9.8623,7.1573,51.1311,16.4062,829
-44.2037,-9.7375,2.8477,30.9095,-9.7375,11.8749,25.052,18.2013,830
-5.391,-9.6231,-2.0588,2.2053,-9.6231,2.2987,23.1455,16.8708,831
-17.2933,-9.9347,12.2208,18.9735,-9.9347,2.3027,27.8328,22.9696,832
-6.7461,-9.9698,1.3591,7.6722,-9.9698,2.6788,17.8166,15.1317,833
-6.5281,-9.7055,-0.9596,2.5386,-9.7055,2.1978,22.3249,17.94,834
-11.5259,-9.924,-1.5412,4.2465,-9.924,8.5678,21.6378,12.1201,835
-16.1081,-9.9107,1.0355,8.0697,-9.9107,11.3552,27.3982,19.2348,837
-26.1826,-9.793,0.283,11.3532,-9.793,12.1175,26.1723,16.3091,838
-6.372,-10.0575,-1.2713,2.2326,-10.0575,8.3566,21.8254,11.5861,839
-8.1064,-9.8797,-0.9542,2.5399,-9.8797,3.2883,10.4808,4.4085,840
-4.5069,-9.851,3.3589,5.6326,-9.851,6.176,19.951,11.2825,842
-5.8749,-9.8859,2.4703,4.8884,-9.8859,5.2279,24.7114,11.1277,843
-6.2837,-10.0179,0.7974,5.6572,-10.0179,5.3895,21.454,15.4222,844
-66.2847,-9.925,26.6106,53.7181,-9.925,15.178,70.3908,40.3221,845
-15.0066,-9.912,17.9687,32.6574,-9.912,17.1931,69.529,13.621,847
-3.8084,-9.8535,7.8384,10.187,-9.8535,6.6819,22.879,17.4287,848
-2.3775,-9.6945,8.1838,9.1962,-9.6945,7.7684,42.7787,31.7451,849
-7.4732,-9.8658,-1.0846,4.8517,-9.8658,3.4903,16.1269,12.6927,850
-11.9616,-9.8845,3.9567,10.7613,-9.8845,8.1245,26.2874,14.7585,852
-1.7734,-9.5857,5.5708,6.399,-9.5857,6.5863,30.4533,14.5323,853
-17.527,-9.9713,-1.0723,10.447,-9.9713,5.179,24.4816,22.7669,855
-19.0283,-10.0682,1.4512,13.1532,-10.0682,5.8966,27.2081,21.0575,856
-7.0239,-9.9151,-2.0473,2.7205,-9.9151,2.9213,18.3947,6.3375,857
-2.9826,-9.7967,34.6293,25.3856,-9.7967,20.6511,54.0272,29.7825,858
-5.2585,-9.9084,8.3882,10.7413,-9.9084,8.6304,22.7081,14.5313,859
-2.0724,-10.0406,-0.564,0.721,-10.0406,0.9111,14.5255,10.0608,860
-22.599,-9.8819,-0.0897,15.7202,-9.8819,3.1519,23.5325,15.2862,861
-53.4857,-10.2799,14.425,37.5115,-10.2799,20.4162,65.1397,31.5948,862
-6.4347,-9.7919,19.3129,31.793,-9.7919,12.2099,54.4203,50.2672,863
-16.4569,-9.8953,4.3431,11.2821,-9.8953,4.7772,40.873,18.9552,864
0.0126,-9.6805,15.2257,10.2768,-9.6805,9.6854,30.4552,16.3567,865
-8.1832,-9.8804,0.0829,2.5224,-9.8804,5.4829,23.1636,7.5813,867
-27.4718,-9.8732,-2.8062,7.6708,-9.8732,5.3126,35.5336,12.3219,868
-4.3987,-9.8643,4.9712,7.2721,-9.8643,7.5085,34.2812,24.3127,869
-5.01,-10.1188,6.1193,7.9349,-10.1188,13.7649,38.9921,22.2607,870
-7.5727,-10.0817,-1.8966,3.1011,-10.0817,4.7804,29.1497,15.9686,871
-6.8894,-9.9856,1.6976,3.2193,-9.9856,6.8608,24.6994,14.4765,873
-2.0871,-9.9543,0.6158,1.8157,-9.9543,3.9402,11.5141,6.3462,874
0.4541,-9.8283,2.0815,1.1457,-9.8283,1.8824,11.6468,9.687,875
-1.6124,-10.0654,-0.1532,0.6174,-10.0654,0.9208,4.2343,3.1322,876
-4.7322,-10.1436,0.926,3.7392,-10.1436,4.531,16.2996,10.2632,877
-1.9793,-10.1676,0.1358,1.4554,-10.1676,1.8957,31.5552,29.6144,878
-3.016,-9.8607,-0.1357,1.2341,-9.8607,0.5815,45.513,42.0985,879
-10.7106,-9.9549,3.8164,6.8169,-9.9549,8.9134,62.9023,47.4627,880
-30.1748,-9.8227,37.4619,47.1707,-9.8227,29.9163,57.5033,36.8043,882
-12.3064,-9.8724,17.5042,26.6361,-9.8724,13.0961,27.6104,24.3237,883
-1.0088,-10.1377,3.1182,4.4192,-10.1377,4.5119,19.5199,12.1874,884
-2.2315,-9.8751,4.6005,6.3855,-9.8751,8.2686,23.9187,18.9188,885
-4.0307,-9.766,2.7183,7.9184,-9.766,9.7408,31.3494,8.8115,887
-4.2971,-9.9605,1.8591,4.7185,-9.9605,6.7327,17.135,14.1669,888
-2.0028,-9.8478,-0.3284,0.9576,-9.8478,1.8039,9.546,8.4278,889
-10.2722,-10.0828,6.913,12.3024,-10.0828,11.9646,18.1308,14.6135,891
-20.4665,-9.723,-0.1024,6.254,-9.723,6.4567,23.4867,8.9536,893
-4.7672,-9.9753,0.4982,2.4829,-9.9753,4.9525,14.4524,8.3349,894
-2.9811,-10.1372,-0.3582,0.9472,-10.1372,2.6649,12.4626,9.8762,895
-7.9352,-9.9465,0.5139,4.5034,-9.9465,4.9,22.6464,16.8083,896
-6.3202,-9.8588,-0.9431,2.9832,-9.8588,2.7491,13.8807,8.3728,897
-14.7538,-9.8684,5.5033,11.0147,-9.8684,8.879,26.6996,14.668,898
-2.5088,-9.8572,4.4669,6.3229,-9.8572,6.3201,32.8471,30.0363,899
-12.4673,-10.2221,-2.2341,4.8789,-10.2221,3.0623,33.0062,22.7526,900
-9.3064,-9.8644,0.9533,4.8241,-9.8644,5.6593,50.1159,25.2744,902
-110.1726,-9.2077,-3.3839,26.2738,-9.2077,8.8792,94.2611,29.2985,903
-10.2437,-10.14,0.7022,8.0928,-10.14,9.0583,37.9449,29.5117,904
-29.089,-9.8515,8.1086,28.8901,-9.8515,17.4921,44.4952,31.4919,905
-6.2916,-10.578,-0.7108,4.7929,-10.578,10.9162,35.8021,29.7688,906
-20.4024,-9.8519,20.1635,36.3981,-9.8519,24.9261,63.7312,28.5639,908
-20.2071,-9.9118,10.1973,19.9646,-9.9118,11.3052,32.8911,15.728,909
-52.4003,-10.025,-2.3655,23.2056,-10.025,10.6453,31.3869,19.0201,910
-10.4898,-9.9438,9.0983,13.4638,-9.9438,5.649,26.277,22.7258,911
0.4918,-10.0406,11.4503,6.9057,-10.0406,2.3349,25.4971,23.6861,912
-3.2732,-9.9125,-0.6046,1.8967,-9.9125,3.8748,9.8882,8.4714,913
-1.4236,-9.7562,1.3702,1.6052,-9.7562,1.0888,8.3232,5.1517,914
-2.2874,-9.6653,0.0809,1.193,-9.6653,1.5227,8.5403,4.2844,915
-0.9632,-9.8498,0.427,1.2924,-9.8498,2.724,9.0817,7.1337,917
-0.6581,-9.9445,0.3294,1.2897,-9.9445,2.9518,10.6814,7.7862,918
-0.41,-9.9559,0.1717,0.2958,-9.9559,0.2029,4.9798,3.0803,919
-0.9993,-9.8507,0.211,0.7261,-9.8507,0.9458,11.024,4.4328,920
-2.1916,-9.8817,0.279,0.8584,-9.8817,2.4631,12.1771,5.0335,922
-2.3943,-10.1253,0.0614,1.4851,-10.1253,2.1284,8.2931,5.9399,923
-1.0981,-9.9598,5.2037,3.4758,-9.9598,1.207,17.0773,12.05,924
-2.6463,-9.9728,0.7766,2.1398,-9.9728,3.0747,23.1975,15.4353,925
-0.7994,-9.9684,3.9871,5.0878,-9.9684,8.3003,17.8908,14.6912,927
-1.3075,-9.9822,0.1056,0.9847,-9.9822,2.5263,10.5434,5.068,928
-1.2896,-10.0108,1.5724,2.6554,-10.0108,2.4454,15.2598,6.7789,929
-8.0036,-10.0145,-1.1784,3.0505,-10.0145,2.179,12.303,4.9874,930
-0.3654,-9.9319,0.2025,0.7118,-9.9319,0.6068,12.9056,8.1638,931
-9.8787,-9.939,3.1749,6.5045,-9.939,4.1467,20.836,11.3022,932
-7.4222,-9.9245,0.5432,4.1637,-9.9245,7.1561,27.1046,15.8996,933
-5.0169,-9.7839,7.0954,7.7987,-9.7839,1.8555,23.8239,21.4917,934
-2.6973,-9.9807,0.9038,2.2556,-9.9807,5.7933,20.4809,15.3286,935
-6.7597,-9.8151,4.07,5.3343,-9.8151,8.9959,26.5034,18.0525,937
-6.4817,-9.9826,0.6301,4.194,-9.9826,6.2658,29.1955,12.5317,938
-3.4792,-9.9078,-0.0895,1.3985,-9.9078,1.7919,11.0651,5.1686,939
-0.6749,-9.9419,2.7722,1.9384,-9.9419,6.8226,19.5854,14.201,940
-2.5148,-9.9993,0.2702,1.7819,-9.9993,3.4346,14.4271,10.6628,941
-7.818,-9.8614,6.4871,9.7486,-9.8614,10.842,50.16,19.1787,943
-4.4654,-9.9362,-0.6631,1.2158,-9.9362,1.5764,9.8554,5.8325,944
-1.1921,-9.9,-0.5311,0.4176,-9.9,1.2759,8.4135,7.056,945
-1.6866,-9.988,0.6068,1.5286,-9.988,1.6126,8.8742,7.5705,946
-0.9403,-9.8971,0.064,0.3786,-9.8971,1.9852,9.3879,7.2607,947
-0.5216,-10.0926,0.3106,0.5943,-10.0926,0.4316,9.7694,8.179,948
-3.9098,-9.7943,-0.4702,2.5956,-9.7943,4.6177,9.8266,6.7599,949
-10.7929,-9.9896,6.6103,12.8679,-9.9896,6.4038,33.0668,23.8475,950
-5.8389,-9.7625,6.7514,11.4145,-9.7625,3.8557,43.303,40.1172,951
-19.3525,-9.7347,2.0975,10.1153,-9.7347,6.1401,38.8222,18.0082,952
-11.3993,-9.8841,11.7364,16.4662,-9.8841,24.6647,53.2558,28.5715,953
-5.223,-9.9923,17.5724,17.6517,-9.9923,16.9426,37.8015,31.3683,954
-1.4775,-9.8854,0.4856,1.3963,-9.8854,2.2207,9.8323,6.4676,955
-11.6557,-10.0557,-0.6144,4.8643,-10.0557,3.6441,12.9485,8.1538,956
-21.1579,-9.6174,16.8045,28.6145,-9.6174,5.8933,28.9919,24.4344,957
-2.0927,-9.9676,0.1296,1.9391,-9.9676,4.9328,11.533,7.5257,958
-2.0255,-9.7032,4.5685,4.5556,-9.7032,3.2923,18.4406,13.515,959
-4.9543,-9.8962,2.9384,4.8827,-9.8962,8.2834,19.9798,8.7388,960
-4.0751,-9.8627,1.6162,4.4956,-9.8627,5.6426,25.769,9.8161,962
-2.1671,-9.9332,2.5515,4.5183,-9.9332,8.5384,16.5607,11.467,963
-0.1859,-9.6045,2.4951,2.7055,-9.6045,5.4644,13.2366,10.4047,964
-5.9259,-9.8008,1.8696,5.4515,-9.8008,3.271,12.3979,10.5115,965
-2.1957,-9.9292,0.9809,1.925,-9.9292,4.5953,16.1279,10.3087,967
-0.2241,-9.9483,0.9684,0.8873,-9.9483,3.2816,15.1853,12.2986,968
-1.5938,-9.8671,-0.1605,0.8689,-9.8671,3.5361,8.1042,5.851,969
-6.1209,-9.6799,0.4224,2.4207,-9.6799,3.3975,12.5685,7.4624,970
-3.5868,-9.7571,-0.6309,1.7123,-9.7571,3.2906,10.6405,7.5681,971
-11.5686,-9.9271,6.218,7.6365,-9.9271,4.3749,26.723,19.8378,972
-2.9969,-9.9194,0.3479,1.4388,-9.9194,3.5739,11.5883,6.4568,973
-24.3307,-9.8904,-0.5654,5.9995,-9.8904,7.0759,21.655,12.2718,974
-2.0595,-9.7965,5.8376,5.9872,-9.7965,10.9486,33.1698,12.2488,975
-158.9948,-10.2179,-24.097,67.428,-10.2179,17.7842,35.0754,25.5816,976
-330.9136,-9.8103,-99.8393,142.9659,-9.8103,35.3917,70.329,44.413,977
-63.3642,-9.7871,-12.0206,30.8732,-9.7871,12.1298,29.1295,23.0754,978
-2.879,-9.8728,3.8188,6.3363,-9.8728,5.768,14.4614,13.4195,979
-9.2839,-9.8462,0.4162,3.6418,-9.8462,2.1608,10.4371,7.2082,980
-3.636,-9.8742,3.028,5.4749,-9.8742,5.806,20.9389,6.9929,982
-4.5872,-9.9501,1.9091,4.4745,-9.9501,4.0925,27.2697,6.5441,983
-4.1248,-9.5197,-1.1771,2.0041,-9.5197,3.3536,11.716,9.3146,984
-18.1971,-10.1901,-0.2586,7.9931,-10.1901,8.1714,23.4415,15.2695,985
-9.3358,-10.0309,4.2409,7.8159,-10.0309,11.1384,26.8337,16.7945,987
-2.1712,-10.0578,11.5298,8.9293,-10.0578,10.5811,18.5818,16.6465,988
-5.8833,-9.8413,-2.4002,2.0316,-9.8413,3.5957,20.1939,16.0232,989
-6.3197,-9.9713,2.3655,6.7948,-9.9713,4.1691,15.5754,11.9234,990
-4.0947,-9.8432,0.721,4.1466,-9.8432,9.0665,15.1731,12.8545,991
-5.2287,-10.0051,0.5475,2.3204,-10.0051,4.1772,26.3229,8.3104,993
-1.8827,-9.1659,0.2211,2.575,-9.1659,3.485,20.7892,4.6239,994
-3.47,-8.0834,-1.6966,1.3192,-8.0834,1.9425,16.6791,8.1353,995
-1.8391,-9.9916,0.8187,1.8541,-9.9916,1.4188,6.4421,4.1991,996
-4.606,-9.6305,0.0681,3.1465,-9.6305,1.7681,18.4261,6.9961,997
-3.253,-9.5618,-0.3853,1.959,-9.5618,1.0451,19.7884,5.6253,999
-0.6536,-9.2207,0.0526,0.6079,-9.2207,1.5083,8.336,5.0985,1000
-5.6202,-9.4417,0.1063,1.9956,-9.4417,1.7501,18.353,9.6388,1001
-3.9262,-10.0364,0.1679,1.7033,-10.0364,4.2919,14.4677,7.7845,1002
-1.6372,-9.8512,0.7516,2.0273,-9.8512,5.1103,11.1128,7.1553,1003
-1.7206,-9.9016,0.8673,1.4725,-9.9016,3.2919,9.4395,8.5397,1004
-2.5334,-9.9363,0.919,2.6926,-9.9363,4.5111,12.2427,10.3479,1005
-1.0038,-9.8513,1.0407,1.4989,-9.8513,2.2567,11.1868,10.1248,1006
-2.7266,-9.8665,1.2056,1.9353,-9.8665,3.1758,10.3503,9.2107,1007
-1.1998,-9.9877,0.2074,0.5837,-9.9877,2.6588,7.9275,5.0585,1008
-0.2803,-9.798,0.0473,0.2395,-9.798,1.1405,5.7405,4.7045,1009
-2.9175,-10.1769,0.2963,1.2912,-10.1769,1.7097,10.2446,7.5342,1010
-3.3054,-9.9212,-0.3328,1.8982,-9.9212,1.6123,11.3366,7.7235,1011
-0.4562,-10.13,-0.045,0.2744,-10.13,2.3277,8.0329,6.7122,1012
-5.6155,-9.8672,0.3939,1.8397,-9.8672,4.2868,16.3323,7.9455,1013
-0.1102,-9.9575,1.5768,1.0205,-9.9575,3.1196,12.4623,9.665,1014
-4.7759,-10.0674,0.8235,3.8416,-10.0674,3.799,21.6663,13.4246,1015
-9.6227,-10.0203,0.8547,5.2922,-10.0203,5.9287,29.0885,14.5092,1017
-9.8659,-10.1017,-0.1034,3.7004,-10.1017,3.8528,25.9097,11.1234,1018
-9.7916,-9.6671,0.7036,9.1904,-9.6671,7.014,20.992,12.7592,1019
-11.2515,-10.051,0.0156,4.43,-10.051,4.9734,38.2302,12.1152,1020
-5.4522,-10.1748,-1.2098,2.7827,-10.1748,1.9872,10.8002,9.5452,1021
-7.0836,-10.1298,0.3229,3.1156,-10.1298,7.2606,34.6951,20.3317,1023
-5.2795,-10.069,8.4272,10.0421,-10.069,5.7291,33.1013,26.0433,1024
-2.9791,-9.9522,-0.1916,1.3997,-9.9522,3.2115,12.7165,5.424,1025
-2.8252,-9.9495,-0.3719,1.1582,-9.9495,1.6963,9.3401,5.4044,1026
-0.2066,-9.8281,2.4231,1.7716,-9.8281,2.2221,26.4012,13.5397,1027
-9.3719,-9.9144,-2.4542,5.0754,-9.9144,4.3741,23.5969,16.3277,1028
2.1223,-9.8791,45.7593,30.9456,-9.8791,2.7193,86.6285,68.1343,1029
-1.1948,-9.8752,6.5498,9.2607,-9.8752,7.0393,22.7259,13.9131,1030
-37.4308,-9.8599,-6.9381,15.3934,-9.8599,8.5047,16.2826,7.4455,1031
-116.8484,-9.7488,-1.1302,35.0287,-9.7488,14.3418,52.9658,26.7791,1033
-8.4959,-9.9507,0.5403,5.3825,-9.9507,3.8979,36.4331,27.5561,1035
-47.5962,-9.7666,-1.7141,29.2536,-9.7666,4.9069,27.1729,21.6772,1036
-3.4827,-9.5677,19.5975,27.7272,-9.5677,6.8344,46.963,38.5624,1037
-3.3957,-9.724,9.2368,15.4912,-9.724,5.2011,27.3238,8.9357,1038
1.3004,-9.7047,9.7021,7.5891,-9.7047,0.847,16.6654,15.9206,1039
-12.9265,-9.8148,4.5567,12.7599,-9.8148,9.3807,34.118,15.0516,1040
-13.7465,-10.1674,3.3754,8.1588,-10.1674,10.5463,39.8467,36.6055,1041
-0.8175,-9.8455,0.7722,2.0651,-9.8455,4.2586,17.4225,6.0417,1042
-0.9796,-9.9517,0.2278,0.8717,-9.9517,1.7136,8.1864,6.598,1043
-3.1756,-9.9471,-0.1601,1.0689,-9.9471,1.6368,6.429,4.4976,1044
-4.4932,-9.9511,-0.5674,1.9436,-9.9511,3.7539,11.4947,7.0847,1045
-4.652,-10.0133,3.6063,5.4976,-10.0133,3.2568,15.7401,12.0145,1046
-8.1595,-9.9345,-0.8881,3.2668,-9.9345,1.8266,16.2205,12.9242,1047
-1.793,-9.6477,8.7364,6.7117,-9.6477,2.5776,15.9211,11.5067,1048
-1.4727,-9.8408,6.0388,4.9087,-9.8408,3.2802,15.3125,13.2044,1049
-11.6287,-9.8695,0.2401,5.7972,-9.8695,3.176,14.625,11.0383,1050
-8.3127,-9.9316,3.2603,8.25,-9.9316,8.6024,28.2358,10.6629,1052
-4.6446,-9.6413,2.2687,4.9403,-9.6413,6.594,16.5793,11.5463,1053
-0.4777,-10.1036,0.6131,0.8528,-10.1036,1.278,6.049,3.3905,1054
-1.835,-9.8905,3.3991,4.2588,-9.8905,4.3577,16.0154,12.7414,1055
-1.6435,-10.2537,-0.5559,0.6623,-10.2537,1.6096,9.2854,5.632,1056
-2.1048,-9.7193,0.2366,1.1927,-9.7193,2.7722,19.9627,8.2989,1057
-2.85,-9.764,0.5346,1.3398,-9.764,3.5555,13.334,8.6737,1058
-1.5733,-10.082,0.353,1.267,-10.082,0.7659,13.7826,8.5164,1059
-16.3744,-9.8104,-0.7823,12.6367,-9.8104,10.2857,37.1632,19.3621,1060
-18.2387,-9.9795,16.8543,31.5393,-9.9795,19.6548,50.5072,32.9947,1062
-12.8652,-10.0396,10.6779,13.4247,-10.0396,1.4835,38.2914,23.712,1063
-1.3391,-10.1078,0.85,2.0661,-10.1078,2.5096,13.0254,11.6599,1064
-4.5877,-10.0642,0.3498,1.9367,-10.0642,3.2764,11.8735,10.2359,1065
-11.6411,-10.0001,1.3158,4.741,-10.0001,5.4986,20.2231,7.6029,1067
-9.4157,-9.1216,-0.8843,4.1983,-9.1216,4.3339,16.0139,12.4195,1068
-12.6898,-9.4347,5.465,12.9713,-9.4347,11.1641,28.4902,15.4434,1069
-4.991,-9.8383,0.6753,2.331,-9.8383,5.7532,13.7596,9.4884,1071
-1.7668,-10.2286,0.0066,0.9925,-10.2286,1.0214,13.6451,4.9855,1072
-1.1489,-9.8422,0.3153,0.6113,-9.8422,1.9147,9.5606,4.054,1073
-1.013,-10.0595,0.0942,0.7292,-10.0595,2.7608,7.9953,4.3389,1074
-0.4384,-10.2518,0.1332,0.3673,-10.2518,2.0669,11.3143,7.7237,1075
0.0046,-9.4989,1.4916,1.1929,-9.4989,2.9283,19.876,7.1934,1076
-0.3293,-9.7717,0.0058,0.3483,-9.7717,1.3671,10.22,4.4183,1077
-0.8341,-10.2173,1.401,2.3449,-10.2173,2.1044,12.7114,7.5365,1078
-0.2789,-10.5002,1.0451,1.288,-10.5002,3.7986,20.8539,16.8201,1079
-10.5884,-9.9476,-0.5023,4.3618,-9.9476,4.9053,14.3792,8.7986,1080
-2.8952,-10.3437,2.3905,4.7928,-10.3437,5.6228,22.8499,16.1464,1081
-7.3786,-9.3326,1.8851,5.9423,-9.3326,6.458,23.8747,12.0113,1083
-34.9678,-9.3794,1.5115,9.2238,-9.3794,8.0123,34.0072,15.3169,1084
-1.3677,-10.2205,0.2874,0.897,-10.2205,1.8514,14.5743,6.1774,1085
-0.9717,-9.0393,0.198,1.0007,-9.0393,0.8649,8.3733,4.2628,1086
-3.8916,-9.682,4.8349,11.6876,-9.682,9.3814,25.409,21.5627,1087
-1.7542,-9.8233,-0.0815,1.3518,-9.8233,3.1977,15.6629,11.1272,1088
-1.5822,-10.1156,0.096,1.1099,-10.1156,0.9907,12.6363,8.3895,1089
-2.326,-10.0849,0.8091,1.6496,-10.0849,3.0756,12.975,8.3139,1090
-2.9848,-9.8539,0.5315,1.7017,-9.8539,4.3382,10.544,6.6109,1092
-1.2853,-9.9864,0.2197,0.6968,-9.9864,1.0028,5.745,4.9039,1093
-0.6517,-9.9198,0.0107,0.3826,-9.9198,0.6298,6.5415,4.9319,1094
-3.619,-9.8737,1.1579,2.9305,-9.8737,1.9599,21.3989,10.4496,1095
-3.798,-9.976,7.5301,11.828,-9.976,9.6349,65.121,44.8221,1097
-10.0046,-9.9692,-0.4004,3.2457,-9.9692,3.7426,23.3253,20.6903,1098
-9.138,-9.9374,2.1711,6.4431,-9.9374,1.831,15.7659,14.18,1099
-5.8345,-9.8686,0.6339,4.108,-9.8686,2.8225,31.0789,12.1147,1100
-8.272,-10.0063,3.5694,7.7371,-10.0063,10.1872,26.2619,13.3893,1102
-0.3198,-9.9355,0.811,0.9782,-9.9355,3.1563,15.5833,5.9796,1103
-18.2961,-9.9163,-5.522,7.6799,-9.9163,3.1408,20.1078,18.0614,1104
-1.9076,-9.8652,15.8068,22.9229,-9.8652,10.5031,45.9629,8.3676,1105
-8.4936,-10.0622,6.7191,9.6545,-10.0622,2.2774,18.0548,16.2116,1107
-4.5883,-10.108,0.0617,2.369,-10.108,3.2396,16.6352,9.9806,1108
-5.1405,-9.8361,0.8438,3.465,-9.8361,6.5237,24.4332,10.9395,1109
-3.0394,-10.023,1.3803,2.3363,-10.023,1.2473,11.5194,10.252,1110
-1.7413,-10.069,0.2661,1.6286,-10.069,2.6203,15.4105,12.8422,1111
-0.4047,-9.5179,0.6924,0.8113,-9.5179,2.0363,11.2552,8.3555,1112
-0.5795,-9.836,3.3143,2.8124,-9.836,1.8599,18.9024,15.1178,1113
-1.0644,-9.8591,0.4063,0.683,-9.8591,1.0421,9.1123,6.6076,1114
-0.9163,-9.8989,0.4471,1.0261,-9.8989,2.4588,9.7974,6.4573,1115
-0.0441,-9.8751,0.2649,0.282,-9.8751,1.3328,10.7186,10.0195,1116
-9.4228,-9.9052,0.1805,3.4855,-9.9052,4.9419,18.4293,12.4302,1117
-6.8376,-9.9269,1.2286,3.7074,-9.9269,3.6734,22.7131,8.1872,1118
-4.3706,-9.8734,1.3127,3.0055,-9.8734,6.127,18.9729,12.1467,1119
3.0836,-10.1706,15.1054,7.4682,-10.1706,2.5858,27.0929,16.4711,1120
-3.6325,-9.6836,4.6302,6.4895,-9.6836,4.2625,20.3583,14.3109,1121
-9.1794,-9.9505,0.4288,6.5575,-9.9505,3.5128,18.1349,14.3941,1122
-0.0302,-10.1526,6.3967,8.0672,-10.1526,4.9188,16.9297,12.0997,1123
21.8421,-9.9605,29.4901,6.3473,-9.9605,1.6907,30.8785,25.1224,1124
-8.045,-9.8829,1.0602,8.3921,-9.8829,8.9643,24.0624,10.0444,1125
-4.372,-9.8164,3.6392,5.6652,-9.8164,9.8982,24.5946,11.0721,1127
-1.9161,-9.9266,0.9832,1.7524,-9.9266,5.0393,18.6057,8.8862,1128
-0.1579,-10.1292,0.1516,0.3281,-10.1292,1.9643,13.4359,10.6255,1129
-2.9833,-9.6385,1.8659,4.9186,-9.6385,7.5234,22.3921,18.4671,1130
-3.5842,-9.9796,1.7085,4.5453,-9.9796,2.7794,21.1746,9.8756,1131
-4.2849,-9.9436,1.2272,2.5198,-9.9436,3.7116,15.3436,8.191,1132
-1.7487,-9.9382,0.5728,1.3125,-9.9382,2.924,8.5008,7.3458,1133
-0.9578,-9.9046,0.5735,1.0958,-9.9046,0.7766,19.294,7.3484,1134
-0.9086,-9.8987,0.5094,1.0326,-9.8987,2.3862,12.0819,6.0526,1135
-2.9464,-9.934,1.2766,3.3358,-9.934,6.8267,23.613,11.9502,1137
-11.8675,-9.8573,5.5537,11.6759,-9.8573,7.3029,29.615,16.5817,1138
-2.9819,-9.6364,8.7344,8.4104,-9.6364,4.5173,25.583,14.896,1139
-24.7905,-8.2778,13.6973,30.3316,-8.2778,14.2151,53.6508,30.0228,1140
-38.5976,-9.9343,9.4917,29.0577,-9.9343,9.4541,46.6691,22.523,1142
-27.3267,-9.971,13.7256,37.1477,-9.971,18.8733,51.8815,34.3044,1143
-17.598,-9.7156,13.0076,13.9854,-9.7156,13.1808,28.1844,17.7806,1144
-14.1073,-9.9729,0.4367,8.112,-9.9729,6.6456,23.4963,14.4824,1145
-1.9942,-9.9198,0.0916,1.3454,-9.9198,0.9655,12.9566,7.3348,1146
-5.7115,-9.7882,0.4884,3.446,-9.7882,6.093,12.4235,8.9908,1147
-1.6937,-9.8416,0.9317,1.8971,-9.8416,4.2705,16.0953,8.7032,1148
-1.5338,-10.3012,0.1043,1.2021,-10.3012,1.6408,10.1492,6.6052,1149
-1.2311,-10.0247,-0.2032,0.5051,-10.0247,1.1926,7.7744,3.8923,1150
-0.4328,-9.5302,0.8391,2.4642,-9.5302,2.0354,21.9518,8.0686,1151
-32.6968,-5.8191,-1.7039,12.268,-5.8191,9.5297,44.822,23.74,1152
-13.1626,-9.9549,1.051,7.2508,-9.9549,7.0231,28.9052,15.2495,1153
-1.6137,-10.1081,4.0316,4.8038,-10.1081,4.0005,17.4584,10.6048,1154
-2.5496,-10.0723,3.5548,4.3413,-10.0723,7.6988,24.9226,20.6363,1155
-3.1348,-9.8395,-0.5878,1.537,-9.8395,1.9905,16.7683,10.5276,1156
-6.832,-9.5946,0.3496,2.7569,-9.5946,2.5196,30.5771,8.9046,1158
-8.1115,-9.975,0.2342,4.0223,-9.975,2.9299,26.1314,15.2357,1159
-0.7524,-9.7808,0.6873,1.1281,-9.7808,0.501,7.8912,4.2435,1160
-0.1658,-9.8799,0.0683,0.1837,-9.8799,1.352,9.068,3.4433,1161
-0.2631,-9.9206,3.143,3.184,-9.9206,2.8534,27.8271,18.0787,1162
-2.0641,-9.9383,1.4838,2.6469,-9.9383,2.0547,22.5004,15.4029,1163
-1.8957,-10.4765,0.3525,1.3516,-10.4765,2.9371,31.2639,16.5205,1164
-4.475,-9.863,0.6283,2.4587,-9.863,1.3072,14.1444,10.3373,1165
-4.5969,-10.1542,4.1389,7.4981,-10.1542,10.7877,48.3248,38.4333,1167
-59.5741,-9.2863,2.0005,18.863,-9.2863,6.5442,46.0742,22.8346,1168
-49.6716,-10.1267,-5.9302,28.5056,-10.1267,9.5762,24.067,13.2071,1169
-4.7336,-10.0923,14.391,19.6186,-10.0923,12.0162,38.3558,35.6811,1170
-10.8482,-9.9594,4.416,8.14,-9.9594,12.4118,29.7594,22.371,1172
-7.0004,-10.1916,-0.2595,4.1898,-10.1916,2.8563,31.8276,19.3257,1173
-2.8949,-9.8688,2.9892,5.6341,-9.8688,2.147,44.8644,37.3335,1174
-17.0348,-10.0346,34.9469,36.605,-10.0346,14.9292,89.1207,71.5931,1175
-31.7979,-9.8196,3.6012,14.1738,-9.8196,10.8184,94.2008,59.5756,1177
-35.8681,-9.7066,11.3222,28.5759,-9.7066,19.1113,49.6173,29.8248,1179
-12.1652,-9.8509,-3.0989,4.0947,-9.8509,4.725,20.9187,19.876,1180
-9.5108,-10.1815,0.5022,4.3338,-10.1815,7.5073,36.789,20.9138,1181
-11.3575,-9.9664,13.5357,24.9798,-9.9664,9.7868,53.6026,28.4386,1182
-14.8963,-10.1174,2.1843,5.9552,-10.1174,6.5915,26.1375,10.2619,1183
-7.9274,-9.8587,-0.7742,7.2816,-9.8587,6.3047,19.4336,9.2697,1184
-4.2732,-9.8663,19.7864,13.3366,-9.8663,3.4331,38.9668,21.2672,1185
-4.4794,-9.8874,-0.7945,1.84,-9.8874,3.67,13.9618,10.6295,1186
-2.2998,-9.876,0.9655,2.4705,-9.876,2.3669,22.7429,8.6498,1187
-3.362,-9.9891,-0.0609,1.8562,-9.9891,4.5461,16.0423,7.6204,1188
-6.6203,-9.9653,4.6981,5.194,-9.9653,6.7459,21.7134,11.8889,1189
-9.8185,-10.1743,0.7472,6.7152,-10.1743,8.6042,34.9731,22.512,1190
-11.4674,-10.0508,8.312,11.4922,-10.0508,12.6384,30.3495,21.1085,1191
-18.0414,-10.0798,2.1958,10.1119,-10.0798,4.9574,22.2127,13.9806,1192
-13.5825,-9.0516,-0.4812,6.8081,-9.0516,4.0843,19.6249,16.8922,1193
-6.8494,-9.9061,0.4683,3.6531,-9.9061,2.9878,11.1136,8.2021,1194
-20.871,-9.5412,4.9149,18.8181,-9.5412,6.9725,38.1601,20.5535,1195
-16.2834,-10.1024,0.5899,10.5147,-10.1024,3.6171,16.7296,12.8573,1196
-10.1461,-9.961,2.6807,5.0977,-9.961,5.4261,22.5673,10.1507,1198
-25.9005,-9.664,-0.2657,7.9968,-9.664,7.7918,28.0879,9.2384,1199
-2.1331,-9.7554,8.0147,10.2661,-9.7554,9.8118,21.5181,17.1539,1200
-1.6862,-10.568,1.4245,2.2056,-10.568,2.6258,11.7905,9.1637,1201
-4.564,-9.8593,1.3198,6.8802,-9.8593,4.9258,16.4887,11.2431,1202
-3.4011,-9.72,1.2967,3.6563,-9.72,2.1675,10.6062,9.5046,1203
0.0845,-10.0083,4.079,3.8257,-10.0083,2.3955,12.6343,8.2603,1204
-2.5711,-10.5409,2.3516,5.8408,-10.5409,5.3358,44.5738,37.4686,1205
-12.0291,-9.7184,18.3257,32.7647,-9.7184,17.4143,64.2981,26.3584,1207
-7.791,-9.8678,3.2115,8.4216,-9.8678,2.736,17.5869,12.0305,1208
-10.5895,-9.6299,-1.3003,4.1855,-9.6299,3.8773,20.7969,17.0413,1209
-51.1494,-10.2274,-6.1883,19.2233,-10.2274,8.795,42.9082,30.8594,1210
-8.8436,-9.8673,1.1563,4.0088,-9.8673,6.6507,23.0373,12.2471,1212
-24.4756,-9.1116,12.9452,18.2846,-9.1116,3.9666,19.7267,17.523,1216
-8.8257,-9.8958,2.121,6.3188,-9.8958,6.7056,27.2331,11.4637,1217
-2.678,-9.9718,4.3916,7.2538,-9.9718,6.7171,46.3707,9.5681,1218
-6.6589,-10.3478,-1.4197,2.6028,-10.3478,1.9364,26.3892,18.2456,1219
-1.1422,-10.1573,0.375,1.533,-10.1573,2.5234,16.4419,10.1329,1220
-0.0473,-9.9702,0.6538,0.9154,-9.9702,1.016,9.4769,3.8795,1221
-7.8551,-9.914,1.1844,4.4966,-9.914,6.4003,13.7074,9.1259,1222
-7.3728,-9.9717,5.9169,10.2577,-9.9717,11.1632,34.1965,18.4549,1223
-0.7587,-9.6533,5.3901,6.7525,-9.6533,4.7308,17.1971,11.171,1224
-1.691,-9.9412,0.8722,1.6535,-9.9412,3.2446,16.5685,6.2219,1225
-6.5955,-9.6896,0.7943,3.7417,-9.6896,6.2496,22.4832,12.5384,1227
-5.6028,-10.0221,1.6926,3.1719,-10.0221,5.9071,17.4875,10.2918,1228
-0.6492,-9.5439,1.4409,2.2998,-9.5439,4.2685,13.0792,8.4983,1229
-5.1036,-9.8424,0.7129,2.6582,-9.8424,2.4792,12.5304,6.8745,1230
-0.9284,-9.9658,-0.0595,0.5446,-9.9658,1.652,7.0737,5.8991,1231
-6.4101,-9.829,1.3698,3.4569,-9.829,6.8978,17.1036,9.9152,1233
-3.0495,-9.9703,-0.3466,0.8804,-9.9703,1.3429,12.4918,6.6153,1234
-0.6887,-9.8805,0.0446,0.4276,-9.8805,1.5144,8.1164,2.9314,1235
-1.0486,-10.0295,-0.4954,0.3686,-10.0295,1.7779,11.1974,4.3756,1236
-0.3322,-10.0137,0.122,0.2798,-10.0137,1.1467,4.8421,2.3827,1237
-0.128,-9.9289,0.1736,0.2046,-9.9289,0.7718,9.8066,6.5612,1238
-2.6803,-9.9351,-0.5415,0.9643,-9.9351,1.7036,8.889,4.4174,1239
-3.081,-9.9069,-0.3579,1.0912,-9.9069,2.6941,5.7817,4.1462,1240
-9.5802,-9.9518,-0.0841,3.4273,-9.9518,6.9213,39.5662,19.7843,1242
-3.0623,-10.0152,-0.8828,1.1531,-10.0152,3.1981,14.0696,5.7137,1243
-1.9461,-9.9384,0.7272,3.8259,-9.9384,6.602,33.4635,30.7208,1244
-1.6897,-9.9818,0.8677,1.9105,-9.9818,2.501,22.3709,10.4179,1245
-0.0854,-9.9422,1.1572,1.3812,-9.9422,2.6591,11.1631,9.983,1246
-28.9101,-9.9526,0.2719,8.0263,-9.9526,7.864,31.7693,15.8021,1248
-2.79,-9.8751,0.1859,2.0307,-9.8751,2.4436,18.2345,13.5661,1249
-0.2326,-9.8213,0.5851,0.641,-9.8213,0.7622,15.3017,10.3283,1251
-1.274,-9.7754,0.0145,0.8348,-9.7754,1.4616,14.0044,10.9274,1252
-2.0067,-9.6895,-0.4748,0.8872,-9.6895,2.242,20.2247,16.0636,1253
-12.0876,-9.7801,-2.9134,5.324,-9.7801,2.4094,12.6814,11.8193,1254
-15.9915,-9.8066,8.9756,16.0243,-9.8066,3.1555,51.5717,22.5182,1255
-16.7913,-7.1677,6.2773,17.8898,-7.1677,2.3937,45.7492,36.005,1256
-6.3829,-9.8265,7.7898,10.0732,-9.8265,12.0825,50.9492,29.6964,1257
-0.014,-10.0981,11.7157,12.0078,-10.0981,13.4774,47.1607,33.7176,1258
-7.4243,-9.9278,8.0611,11.3102,-9.9278,11.9694,34.6599,22.3045,1259
-2.3488,-10.1039,2.7576,2.5059,-10.1039,7.6768,41.6583,27.3838,1260
-3.9768,-9.9531,5.9853,5.8879,-9.9531,4.0054,41.2792,19.265,1261
-4.1504,-9.8948,2.5189,3.3391,-9.8948,1.2692,30.2864,13.9696,1262
-2.1534,-9.862,0.857,2.5586,-9.862,5.8241,27.5806,14.743,1263
-5.0835,-10.13,0.9055,3.8042,-10.13,4.1719,12.1364,6.181,1264
-8.8605,-9.8618,0.1026,4.412,-9.8618,1.5256,20.1104,15.3864,1265
-3.8973,-9.9061,3.3888,5.8614,-9.9061,7.2619,36.7185,9.1981,1267
-2.532,-9.9184,0.3028,1.2117,-9.9184,1.6955,13.8363,3.7992,1268
-2.5554,-9.915,0.0766,2.2074,-9.915,0.7528,8.3309,7.9691,1269
-0.5585,-9.9982,0.0727,0.408,-9.9982,1.1146,13.0938,10.4406,1270
-2.7441,-9.9416,0.2189,1.3289,-9.9416,1.3907,6.8316,5.82,1271
-10.4253,-10.0385,1.0089,4.5143,-10.0385,4.5932,23.8896,11.0221,1273
-1.4357,-9.7967,0.8476,1.5804,-9.7967,1.7058,19.1951,12.9176,1274
-0.1273,-9.8846,0.831,0.8144,-9.8846,2.0005,16.4799,13.5771,1275
-13.6915,-10.0844,0.8121,14.0174,-10.0844,3.4895,36.8107,24.6445,1276
-1.4487,-9.6057,1.1883,2.2708,-9.6057,3.1001,15.6315,13.9816,1277
-0.3609,-10.0254,2.4244,3.2265,-10.0254,3.2809,10.4902,9.7902,1278
-1.4833,-10.589,2.5231,4.6001,-10.589,11.8801,36.9079,22.5359,1279
-7.9351,-10.2621,7.3474,10.7175,-10.2621,3.8372,28.4917,23.2843,1280
-0.7101,-10.153,5.162,5.1973,-10.153,3.1721,15.3763,9.5107,1281
-11.2632,-9.9402,1.1873,4.1369,-9.9402,7.4664,21.4952,11.1074,1283
-11.3173,-9.0898,-1.2353,3.9317,-9.0898,3.0367,22.5795,8.4645,1284
-3.4842,-10.525,1.8802,2.9341,-10.525,4.0733,13.795,10.249,1285
-1.1612,-10.1342,2.1778,3.4626,-10.1342,4.4136,18.5153,14.496,1287
-0.2046,-10.2842,10.7646,8.0618,-10.2842,6.8717,26.9929,20.1697,1288
-5.3868,-10.1276,1.1698,4.0319,-10.1276,3.4248,18.5873,15.3346,1289
-14.7103,-9.9834,-1.2438,5.614,-9.9834,4.0882,20.0564,16.4914,1290
-2.3813,-10.071,7.0906,8.4986,-10.071,4.5346,19.3865,17.1228,1291
-6.0563,-9.8944,5.7459,11.3353,-9.8944,6.8289,19.6984,16.7273,1292
-7.595,-9.9667,4.4016,7.6869,-9.9667,7.3306,24.8144,14.0514,1293
-0.46,-9.699,3.5146,3.4632,-9.699,5.8107,17.5086,12.2949,1294
-18.0842,-9.9321,7.279,19.1393,-9.9321,9.0359,33.5748,21.4298,1295
-12.665,-9.9205,11.4481,16.4733,-9.9205,5.8734,30.8358,21.9313,1296
-8.0941,-9.8749,0.3752,3.5341,-9.8749,4.9324,14.851,10.1842,1297
-3.0099,-9.3264,0.7279,2.1875,-9.3264,4.7627,40.0044,11.3179,1298
-3.7929,-9.7557,-0.3555,1.3145,-9.7557,3.015,9.8644,5.9217,1299
-3.772,-9.9601,0.3305,2.1194,-9.9601,5.3138,37.4569,14.0743,1300
-2.9506,-9.7693,0.9039,2.6606,-9.7693,3.4758,11.3951,7.4663,1302
-1.7435,-9.9711,0.5195,1.3573,-9.9711,4.3191,19.6505,8.6167,1303
-5.2132,-9.8563,4.2705,4.9224,-9.8563,0.9863,16.0773,8.3769,1304
-13.8955,-9.946,2.2475,7.296,-9.946,8.0532,24.4226,19.6484,1305
-6.5906,-9.8752,1.7968,3.8156,-9.8752,6.4129,26.1998,9.8429,1307
-2.8439,-9.8954,2.9089,5.3366,-9.8954,6.3142,22.4571,13.6903,1308
-6.1882,-9.9585,2.1801,3.9259,-9.9585,3.6983,18.4505,13.4069,1309
-7.3418,-9.9641,2.8427,5.4858,-9.9641,4.7084,21.6431,17.2299,1310
-0.2646,-9.9744,0.4322,0.7079,-9.9744,2.0037,18.216,17.2967,1311
-1.322,-9.9488,0.4011,1.1032,-9.9488,2.37,10.729,5.7216,1312
-2.7548,-9.873,0.111,1.5187,-9.873,4.0244,10.6463,6.679,1313
-1.1473,-9.9517,0.7418,1.658,-9.9517,1.1491,10.9085,8.4378,1314
-0.9654,-9.9732,1.818,1.6543,-9.9732,1.533,12.2914,9.1649,1315
-10.6635,-9.943,0.1492,2.1213,-9.943,3.1309,17.4844,8.4198,1317
-2.0929,-9.9644,3.0565,3.0276,-9.9644,4.1809,24.105,14.6125,1318
0.0189,-10.137,2.0165,1.8865,-10.137,7.3072,34.0358,32.1258,1319
-1.1398,-10.0261,14.0854,8.9647,-10.0261,3.9235,32.5022,24.9308,1320
-5.4833,-9.783,8.6464,14.3692,-9.783,16.2637,34.5805,20.1624,1322
-0.3716,-10.1162,24.3681,15.5614,-10.1162,15.2927,64.9889,45.3366,1323
-5.4701,-10.0983,8.2354,14.5806,-10.0983,14.7022,70.2952,57.6527,1324
-2.103,-10.1232,13.3779,19.7468,-10.1232,10.5775,57.7522,52.472,1325
7.9672,-9.9392,43.9824,22.3263,-9.9392,6.1944,53.59,44.846,1326
10.0687,-9.8545,58.2721,36.8021,-9.8545,6.1331,57.3785,54.4147,1327
-6.2695,-9.8493,18.3711,18.8803,-9.8493,9.4549,51.0837,25.4251,1328
-1.9394,-9.9939,2.24,3.2109,-9.9939,4.0483,29.7885,22.1399,1329
-0.2237,-9.9084,5.8836,4.2839,-9.9084,9.0979,23.0712,19.74,1330
-0.9294,-10.0521,-0.3106,0.5064,-10.0521,3.381,24.4456,22.822,1331
-2.5201,-9.9936,11.6973,12.0212,-9.9936,6.1056,47.3292,42.4415,1332
4.15,-9.828,26.1112,21.0378,-9.828,2.7181,30.9439,28.088,1333
-3.709,-9.9301,0.0954,2.6901,-9.9301,3.3321,29.5207,24.3294,1334
-0.1975,-10.7528,5.813,5.5368,-10.7528,5.5251,69.8625,56.56,1335
-7.522,-10.4896,0.0376,4.6749,-10.4896,3.8503,50.9695,48.172,1337
-8.3207,-9.9793,-0.4428,3.3293,-9.9793,3.8475,21.5009,16.4437,1338
-4.9437,-9.9357,1.0265,2.0731,-9.9357,4.6771,18.198,13.1763,1339
-3.1048,-9.9064,4.3159,5.7273,-9.9064,3.4841,22.4458,20.151,1340
-7.2171,-10.0916,4.5487,9.7652,-10.0916,8.7113,41.3448,20.1832,1342
-17.7579,-10.0843,-0.1478,9.2686,-10.0843,5.3005,32.2405,13.6554,1343
-6.1644,-10.2947,14.6745,18.4261,-10.2947,11.4753,50.2491,42.7096,1344
-6.6662,-9.6282,-0.1813,3.2601,-9.6282,4.0065,19.7576,13.3156,1345
-21.8431,-10.0552,1.8773,10.7395,-10.0552,11.9273,28.6145,19.6577,1347
-2.8664,-10.1379,47.9898,28.8293,-10.1379,27.9435,65.4954,51.1075,1348
-4.7963,-9.7913,0.2105,3.4436,-9.7913,4.6846,20.4707,10.8058,1349
-21.2471,-10.3944,5.5711,16.3866,-10.3944,13.4975,44.6978,18.718,1350
-0.9105,-9.8197,0.631,0.7553,-9.8197,1.411,13.0215,11.9297,1351
-13.5193,-9.9886,-1.1611,6.4212,-9.9886,6.0094,32.1897,9.3018,1353
10.6307,-9.7968,19.917,7.8605,-9.7968,1.5952,33.1283,27.6761,1354
-33.7865,-10.0861,-6.5736,9.5181,-10.0861,8.4843,91.1477,75.7757,1355
-19.494,-9.9241,42.3128,62.2451,-9.9241,18.5621,84.4575,67.1389,1356
-1.4421,-9.8455,16.8793,22.5949,-9.8455,6.6369,76.6583,64.7257,1357
4.0161,-9.9143,19.0429,19.258,-9.9143,4.0265,28.2775,22.1038,1359
-20.973,-9.9769,11.1785,19.5567,-9.9769,4.0585,49.2343,43.7715,1360
-20.1134,-10.0811,8.3971,17.4036,-10.0811,11.8335,47.1757,38.4498,1361
-8.67,-9.8332,14.2764,20.2162,-9.8332,11.9719,24.7011,18.7931,1362
-4.2314,-9.913,1.3048,2.7131,-9.913,3.9406,20.0457,11.7627,1363
-4.4622,-10.1234,5.0709,7.4205,-10.1234,8.0451,33.699,21.9162,1364
-4.2371,-10.4978,-0.1952,3.5708,-10.4978,5.3753,38.1709,28.2568,1365
-3.5226,-10.1331,4.4828,4.9409,-10.1331,2.6435,23.4454,14.9469,1366
-13.8916,-9.2206,-3.6169,5.949,-9.2206,8.7371,32.3232,28.8027,1367
-0.678,-10.5711,2.2204,3.3291,-10.5711,8.4459,45.6196,39.3107,1368
-5.928,-10.4444,-1.9672,2.8406,-10.4444,4.2954,37.26,36.56,1369
-8.6683,-10.3364,12.3909,18.9944,-10.3364,21.7969,51.1362,37.7915,1370
20.3689,-9.8598,55.6414,16.2707,-9.8598,4.6185,42.4833,40.7553,1371
-2.5786,-10.126,5.8713,7.5076,-10.126,7.7037,39.7391,35.7351,1372
-12.8419,-9.9672,7.9398,8.7787,-9.9672,8.1618,33.0183,22.3952,1373
-8.5256,-9.9221,1.1403,6.4124,-9.9221,4.6362,33.2176,30.2305,1374
-3.8283,-9.9334,3.5524,4.5625,-9.9334,4.0934,23.2484,15.8374,1375
-5.4898,-9.8843,0.394,5.3258,-9.8843,5.6968,36.1627,8.6624,1377
-13.1653,-9.8899,-0.7409,6.4555,-9.8899,6.932,16.6771,7.3805,1378
-3.0402,-9.8659,0.1735,1.5923,-9.8659,1.1537,4.4013,4.0506,1379
-2.5064,-9.8834,0.7279,2.5822,-9.8834,2.4774,6.0403,2.5301,1380
-20.8339,-9.8465,-1.7394,5.4216,-9.8465,4.003,12.7814,3.0149,1382
-0.0693,-9.8632,0.1843,0.208,-9.8632,0.204,1.7814,1.6677,1383
0.0695,-9.8638,0.8827,0.4187,-9.8638,0.4747,2.1831,1.9822,1384
-0.9239,-9.8771,-0.0478,0.683,-9.8771,0.7711,1.9411,1.8086,1385
-3.9689,-9.8803,-0.6465,1.7499,-9.8803,1.8631,4.1332,2.161,1387
-3.9572,-9.8381,0.8498,3.8994,-9.8381,4.1471,9.9246,6.1834,1388
-1.1453,-10.022,0.9264,0.9658,-10.022,0.6168,14.8077,13.6592,1389
-4.42,-9.6136,0.6397,2.7802,-9.6136,3.0293,13.2032,5.5944,1390
-0.0427,-9.9966,0.7669,0.8022,-9.9966,2.7463,21.2536,19.689,1391
-14.6162,-10.0566,6.2077,12.873,-10.0566,9.906,44.5648,13.8845,1393
-14.5793,-9.8406,5.4658,10.5496,-9.8406,5.7565,48.9437,35.0055,1395
4.3276,-9.936,20.0891,10.8134,-9.936,4.5779,41.77,16.3615,1396
-0.309,-10.1002,2.3468,2.1796,-10.1002,2.5983,36.0752,32.4139,1397
-2.9487,-9.8213,0.105,3.2445,-9.8213,1.0494,19.3389,14.1211,1398
-13.7952,-9.9039,-1.1578,4.1714,-9.9039,4.0273,10.7059,3.5901,1399
-1.0165,-9.8586,2.2609,2.1368,-9.8586,1.3618,6.3889,5.2268,1400
-0.101,-9.884,0.5236,0.3731,-9.884,0.4241,2.5963,2.2601,1401
-2.5492,-9.9035,-0.7995,0.8796,-9.9035,1.556,3.8648,2.7703,1402
-8.2453,-9.8697,-2.9157,2.6227,-9.8697,1.8007,5.8596,2.5031,1403
0.0289,-9.866,1.4162,0.9708,-9.866,1.0149,3.2237,2.2265,1404
-5.8079,-9.8268,2.8785,7.2355,-9.8268,7.3757,17.0019,5.5411,1405
-5.6686,-9.63,0.0468,2.5583,-9.63,1.9732,15.6452,13.2553,1406
-1.4619,-9.8582,-0.1703,0.7264,-9.8582,1.6082,12.9627,7.2404,1407
-13.1284,-9.9535,4.4181,13.7583,-9.9535,11.7679,38.0334,13.0869,1408
21.8149,-9.8718,34.1141,11.3641,-9.8718,6.9204,37.0437,34.0692,1409
-8.1585,-10.024,3.7172,5.1313,-10.024,1.0114,23.1725,16.5754,1410
-5.5693,-9.9276,3.6327,5.7951,-9.9276,6.9919,31.1343,12.2708,1412
-1.7374,-9.7868,1.3708,2.1725,-9.7868,2.1936,13.9055,8.2294,1413
-0.1752,-9.8229,1.3087,2.4145,-9.8229,1.5114,9.1796,4.5305,1414
-5.8335,-10.0442,-0.2228,2.9996,-10.0442,5.7335,14.3605,7.9754,1415
-4.7104,-9.9094,0.1016,2.2857,-9.9094,3.7025,14.8803,8.9229,1417
-1.0992,-9.9166,3.064,4.589,-9.9166,5.7847,13.7771,11.17,1418
-5.9613,-9.566,3.413,7.1935,-9.566,11.3603,22.1853,14.058,1419
-7.6981,-9.335,3.5043,7.7298,-9.335,7.0601,27.6567,14.8551,1420
-11.3362,-10.0501,1.4019,4.0583,-10.0501,4.0722,14.1362,8.8647,1422
-3.1153,-9.5889,0.8247,2.0887,-9.5889,2.3088,9.5796,7.2789,1423
-23.5729,-10.3205,11.2981,21.5997,-10.3205,3.2293,26.5129,24.8391,1424
-52.1595,-8.9773,2.6917,28.9457,-8.9773,3.5042,34.0727,20.6772,1425
-120.1976,-9.359,-1.7405,30.2122,-9.359,12.1733,67.747,25.7777,1427
-11.4263,-9.9007,3.5452,8.8221,-9.9007,8.7613,25.769,18.5045,1428
-5.2536,-9.814,1.3446,6.3387,-9.814,6.0625,15.9681,8.9572,1429
-2.1411,-10.0369,2.1087,3.4873,-10.0369,3.8596,16.3457,7.4957,1431
-4.1961,-9.9603,0.215,2.4289,-9.9603,4.8261,12.0578,8.219,1432
-11.8132,-10.1158,-0.7946,5.2419,-10.1158,4.9508,18.8283,8.3444,1433
-6.6169,-9.3337,0.2736,3.7944,-9.3337,3.3221,14.1285,8.6801,1434
-5.233,-9.948,-0.34,2.0272,-9.948,3.9145,10.4486,8.4925,1435
-3.5956,-9.488,-0.2807,2.3285,-9.488,2.0603,9.4686,4.3909,1436
-2.0762,-9.8747,1.2654,2.5152,-9.8747,4.6017,37.1191,32.324,1437
-2.3607,-9.8909,2.2406,3.8988,-9.8909,4.3591,22.3765,8.1098,1438
-13.6537,-9.9154,-1.6131,3.9196,-9.9154,1.981,17.6111,9.5539,1439
-22.8343,-9.7155,-11.2368,6.7038,-9.7155,3.6833,15.8142,10.6147,1440
22.0011,-9.4881,35.4553,7.6127,-9.4881,4.1143,36.1983,24.1635,1441
-76.3401,-9.9477,8.04,30.9378,-9.9477,5.5054,85.7631,69.173,1442
