AYGX_min,AZ_mean,AYGX_mean,AYGX_std,AZ_mean,GX_std,Gnorm_max,Gnorm_median,timestamp
0.1919,-9.568,0.2137,0.0176,-9.568,0.0089,3.4751,3.4699,29
0.1742,-9.5671,0.2228,0.0234,-9.5671,0.0117,3.4907,3.4738,30
0.1981,-9.5689,0.2373,0.0203,-9.5689,0.0101,3.4761,3.4616,31
0.2133,-9.566,0.2385,0.0128,-9.566,0.0064,3.4889,3.4786,32
0.2043,-9.5684,0.2307,0.0206,-9.5684,0.0104,3.4881,3.4564,33
0.1888,-9.5676,0.2128,0.0201,-9.5676,0.01,3.4769,3.4708,34
-0.0174,-9.5686,0.2315,0.0865,-9.5686,0.0412,3.4899,3.4717,35
0.1307,-9.5676,0.2251,0.0617,-9.5676,0.031,3.4829,3.4622,36
0.1557,-9.5679,0.2327,0.0407,-9.5679,0.0204,3.4829,3.4638,37
0.2124,-9.5678,0.2432,0.0161,-9.5678,0.008,3.4873,3.4578,39
0.1862,-9.5682,0.2349,0.0255,-9.5682,0.0127,3.5088,3.4686,40
0.2426,-9.5685,0.2616,0.0173,-9.5685,0.0086,3.4899,3.4642,41
0.186,-9.5683,0.2299,0.0216,-9.5683,0.0108,3.503,3.472,42
0.196,-9.5692,0.2453,0.0247,-9.5692,0.0124,3.4864,3.4656,43
0.1408,-9.5677,0.2274,0.0539,-9.5677,0.0269,3.4821,3.4683,44
0.1769,-9.5689,0.2324,0.039,-9.5689,0.0196,3.489,3.4642,45
0.1769,-9.5683,0.2384,0.0455,-9.5683,0.0229,3.4839,3.4656,46
0.1892,-9.5694,0.2233,0.0244,-9.5694,0.0122,3.4906,3.4695,47
-0.0557,-9.5696,0.2524,0.1645,-9.5696,0.0845,3.5289,3.4725,48
-2.3892,-9.5911,0.5881,2.2925,-9.5911,1.2112,4.1022,3.7897,49
-1.8805,-9.5667,0.0867,1.3035,-9.5667,0.6511,3.6651,3.5131,50
-0.3286,-9.5665,0.222,0.4552,-9.5665,0.2289,3.5186,3.4688,51
-0.1503,-9.5695,0.2084,0.2046,-9.5695,0.1025,3.4871,3.4617,52
0.0506,-9.5683,0.2546,0.1265,-9.5683,0.0633,3.4819,3.4583,53
0.1319,-9.5683,0.2293,0.0728,-9.5683,0.0363,3.4839,3.4636,54
0.1774,-9.5689,0.2368,0.0313,-9.5689,0.0157,3.5047,3.4712,55
0.1802,-9.5692,0.2186,0.0226,-9.5692,0.0113,3.4882,3.472,56
0.2159,-9.5698,0.2505,0.0351,-9.5698,0.0177,3.4864,3.4651,57
0.1709,-9.5693,0.2461,0.0575,-9.5693,0.0287,3.4898,3.4791,58
0.1652,-9.5685,0.2316,0.0389,-9.5685,0.0195,3.5011,3.4717,59
0.1919,-9.5675,0.2263,0.0254,-9.5675,0.0127,3.4935,3.472,60
0.2045,-9.5689,0.23,0.0239,-9.5689,0.0119,3.4725,3.4677,61
0.186,-9.5691,0.2332,0.0249,-9.5691,0.0125,3.4915,3.4686,62
0.1864,-9.5687,0.2355,0.0236,-9.5687,0.0117,3.4976,3.472,63
0.1893,-9.569,0.2311,0.0242,-9.569,0.012,3.4985,3.4587,64
0.2104,-9.5683,0.2334,0.0135,-9.5683,0.0068,3.482,3.466,65
0.1955,-9.5685,0.2302,0.0232,-9.5685,0.0116,3.4898,3.4708,66
0.1861,-9.5686,0.2339,0.0255,-9.5686,0.0127,3.4985,3.4642,67
0.1924,-9.5699,0.2296,0.0231,-9.5699,0.0115,3.4846,3.4738,68
0.1744,-9.5688,0.2315,0.0243,-9.5688,0.0121,3.4984,3.4686,69
0.1954,-9.569,0.233,0.0257,-9.569,0.0127,3.4968,3.479,70
0.0752,-9.5693,0.2396,0.0984,-9.5693,0.0493,3.4943,3.4762,71
0.063,-9.5695,0.2289,0.0977,-9.5695,0.049,3.5041,3.4743,72
0.1523,-9.5687,0.2352,0.0574,-9.5687,0.0286,3.4822,3.4742,73
0.1565,-9.5697,0.2435,0.0524,-9.5697,0.0263,3.5063,3.4882,75
0.1353,-9.5694,0.2293,0.0449,-9.5694,0.0225,3.5125,3.4877,76
0.1647,-9.5701,0.2324,0.0416,-9.5701,0.0208,3.4961,3.4846,77
0.1947,-9.5689,0.234,0.0263,-9.5689,0.0131,3.5071,3.476,78
0.2123,-9.5686,0.2303,0.0182,-9.5686,0.0091,3.5046,3.4786,79
0.2133,-9.5694,0.2369,0.0131,-9.5694,0.0065,3.5046,3.4786,80
0.2136,-9.5687,0.2371,0.0124,-9.5687,0.0062,3.4906,3.4777,81
0.1744,-9.5689,0.2348,0.0206,-9.5689,0.0103,3.4976,3.4791,82
0.1804,-9.5683,0.2458,0.0278,-9.5683,0.0139,3.4942,3.4595,83
0.2099,-9.5689,0.2454,0.0207,-9.5689,0.0102,3.4742,3.4638,84
0.1408,-9.569,0.2349,0.059,-9.569,0.0295,3.4937,3.4652,85
0.1593,-9.5695,0.2412,0.0581,-9.5695,0.0291,3.4742,3.4614,86
0.1686,-9.569,0.2346,0.0433,-9.569,0.0217,3.4976,3.4781,87
0.1652,-9.568,0.2346,0.0409,-9.568,0.0205,3.4787,3.4638,88
0.1625,-9.5687,0.2365,0.0337,-9.5687,0.0169,3.4829,3.4682,89
0.1864,-9.5687,0.2357,0.0296,-9.5687,0.0148,3.5071,3.4686,90
0.1566,-9.5688,0.2385,0.0457,-9.5688,0.0229,3.4916,3.4656,91
0.2104,-9.5693,0.2449,0.0234,-9.5693,0.0118,3.4742,3.4586,92
0.1806,-9.5688,0.2342,0.0344,-9.5688,0.0172,3.4794,3.4638,93
0.1958,-9.5706,0.2433,0.0367,-9.5706,0.0183,3.4829,3.4643,94
0.1775,-9.5691,0.239,0.0369,-9.5691,0.0185,3.4839,3.4647,95
0.186,-9.5705,0.2312,0.033,-9.5705,0.0165,3.482,3.453,96
0.2017,-9.5682,0.2484,0.0383,-9.5682,0.0193,3.4734,3.4564,97
-1.9914,-9.572,0.2706,1.0847,-9.572,0.5499,3.695,3.4755,98
-5.9282,-9.5776,0.1113,2.365,-9.5776,1.1788,4.2944,3.563,99
-4.1111,-9.564,0.2677,2.2345,-9.564,1.1249,4.6375,3.5306,100
-1.1228,-9.5663,0.1859,0.9055,-9.5663,0.4535,3.6077,3.4755,101
-4.7939,-9.572,0.3281,2.638,-9.572,1.3349,4.6682,3.5349,102
-0.734,-9.5686,0.2013,0.4501,-9.5686,0.2237,3.5064,3.4714,103
-0.5272,-9.5654,0.1006,0.3691,-9.5654,0.1834,3.52,3.4645,104
-0.4704,-9.5656,0.2027,0.303,-9.5656,0.15,3.4984,3.4599,105
-0.9023,-9.5666,0.0475,0.6022,-9.5666,0.296,3.5002,3.4711,106
-0.0688,-9.5629,0.6653,0.7435,-9.5629,0.3756,3.539,3.4846,107
-0.5319,-9.5659,0.1547,0.6817,-9.5659,0.3399,3.5794,3.5139,108
-0.2999,-9.561,0.2095,0.2631,-9.561,0.1286,3.4653,3.4437,109
-0.3328,-9.5632,0.232,0.3473,-9.5632,0.1713,3.4811,3.4516,110
-0.1593,-9.565,0.1458,0.248,-9.565,0.1225,3.483,3.4445,111
-0.1993,-9.5646,0.2323,0.2536,-9.5646,0.125,3.4986,3.4643,112
0.1014,-9.5671,0.328,0.1564,-9.5671,0.0776,3.4991,3.4565,113
-0.1688,-9.5663,0.1902,0.1626,-9.5663,0.0808,3.4701,3.449,114
-0.2417,-9.5651,0.1822,0.1707,-9.5651,0.0843,3.4639,3.4491,115
-0.422,-9.5648,0.0515,0.3279,-9.5648,0.1606,3.4892,3.4469,116
-0.2918,-9.5633,0.0125,0.3217,-9.5633,0.1573,3.4987,3.466,117
-11.2821,-9.5429,-3.641,5.769,-9.5429,2.6655,5.8071,4.3616,118
-3.9188,-9.5624,0.2415,1.9058,-9.5624,0.933,3.9911,3.5746,119
-0.379,-9.5679,0.4529,0.6942,-9.5679,0.3457,3.5616,3.4779,120
-0.4896,-9.5612,0.1007,0.4319,-9.5612,0.2109,3.4827,3.4484,121
-4.2308,-9.5685,0.1489,2.0084,-9.5685,0.9825,4.0653,3.5264,122
-2.148,-9.5637,-0.1497,1.0559,-9.5637,0.5093,3.5885,3.4938,123
-5.7305,-9.5511,-0.2509,1.7829,-9.5511,0.7889,4.0929,3.4699,124
-1.6194,-9.5623,1.8802,2.2295,-9.5623,1.1535,4.9025,3.7564,126
-3.3278,-9.5868,0.3238,3.2695,-9.5868,1.7073,4.8018,3.7024,127
-11.8129,-9.5459,-1.3275,7.0303,-9.5459,2.7589,5.7055,4.0314,128
-8.7451,-9.5473,-0.0853,5.9594,-9.5473,2.8635,6.013,4.3756,129
-6.9167,-9.5481,-0.1055,3.2341,-9.5481,1.5742,5.5485,3.5679,130
-3.4192,-9.5576,0.846,2.6621,-9.5576,1.3066,4.2402,3.6719,131
-0.5501,-9.5511,0.4449,0.7464,-9.5511,0.3596,3.5811,3.4704,132
-1.0492,-9.5497,0.2116,0.541,-9.5497,0.257,3.5158,3.4623,133
-0.1581,-9.548,0.1845,0.1954,-9.548,0.0929,3.4882,3.4552,134
-2.0809,-9.5508,0.1709,1.0467,-9.5508,0.4965,3.6073,3.4754,135
-0.6716,-9.5482,0.7927,0.7843,-9.5482,0.3818,3.5889,3.4384,136
-0.6436,-9.549,0.6286,1.1178,-9.549,0.5524,3.7232,3.5103,137
-2.8544,-9.512,-0.1432,1.3664,-9.512,0.6819,3.9698,3.5098,138
-1.0116,-9.6109,0.6931,1.0609,-9.6109,0.6257,4.194,3.4879,139
-1.7951,-9.5499,0.2414,1.2726,-9.5499,0.6482,4.0832,3.4828,140
-1.2566,-9.5455,0.0887,0.8445,-9.5455,0.399,3.5893,3.4569,141
-0.1949,-9.5455,0.3194,0.2367,-9.5455,0.1125,3.525,3.461,142
-0.3442,-9.5458,0.1141,0.2463,-9.5458,0.1156,3.4879,3.4578,143
-0.2984,-9.5444,0.2321,0.2476,-9.5444,0.1161,3.4977,3.451,144
0.0026,-9.5443,0.2647,0.1432,-9.5443,0.0676,3.4663,3.4523,145
-0.1354,-9.5443,0.1904,0.2401,-9.5443,0.1142,3.4638,3.4506,146
0.1173,-9.5431,0.263,0.126,-9.5431,0.0598,3.4994,3.4544,147
-0.0333,-9.542,0.188,0.1765,-9.542,0.0826,3.4728,3.4533,148
-0.0429,-9.5443,0.231,0.1254,-9.5443,0.0592,3.48,3.4554,149
-0.8004,-9.5444,0.1668,0.4576,-9.5444,0.2122,3.4591,3.4186,150
-0.2547,-9.5501,0.4312,0.2902,-9.5501,0.1385,3.4835,3.4501,152
-0.0514,-9.5494,0.1831,0.1812,-9.5494,0.0866,3.4605,3.4379,153
-0.2118,-9.5486,0.2112,0.2469,-9.5486,0.1174,3.4968,3.4345,154
-2.5246,-9.5487,-0.0353,1.1729,-9.5487,0.5478,3.6078,3.4811,155
-0.9002,-9.5381,0.5764,1.1735,-9.5381,0.5566,3.6714,3.507,156
-6.6316,-9.5548,0.7191,3.7667,-9.5548,1.7896,4.8537,3.7961,158
-28.922,-9.5469,0.1405,13.5987,-9.5469,5.3475,13.5942,4.7476,159
-94.3516,-9.6007,-12.8887,31.1013,-9.6007,9.63,19.0062,7.9784,160
-93.1645,-9.4395,-5.9311,50.4395,-9.4395,16.5307,29.0306,16.5556,161
-13.9191,-9.5316,-0.2525,5.2191,-9.5316,2.5331,9.2242,4.0576,162
-3.6687,-9.5416,-0.0694,2.0847,-9.5416,0.9601,3.9698,3.5238,163
-0.4602,-9.5443,0.3437,0.4311,-9.5443,0.204,3.5238,3.4465,164
-0.0979,-9.5435,0.2447,0.2327,-9.5435,0.1096,3.4624,3.4457,165
-0.0873,-9.5453,0.154,0.2066,-9.5453,0.0982,3.4688,3.4467,166
-0.0138,-9.5436,0.2046,0.1486,-9.5436,0.0701,3.4716,3.4493,167
0.0192,-9.5389,0.8278,0.8474,-9.5389,0.3441,3.6945,3.4485,168
-2.5475,-9.5473,0.0358,1.4036,-9.5473,0.6621,3.6757,3.4817,169
-2.0027,-9.5518,0.4293,2.1237,-9.5518,1.0189,3.8106,3.5223,170
-17.2059,-9.5502,-0.2299,7.4809,-9.5502,3.5026,8.4102,3.7442,171
-15.0031,-9.555,-0.261,6.8556,-9.555,3.2878,7.2875,4.3392,172
-3.9174,-9.5221,-0.7169,2.2767,-9.5221,1.0486,3.7591,3.5701,173
-2.4402,-9.5499,0.3497,1.3173,-9.5499,0.6261,3.7992,3.4568,174
-3.7993,-9.5428,-0.1437,2.5603,-9.5428,1.2039,4.1317,3.5758,175
-2.0148,-9.5478,0.1084,1.5861,-9.5478,0.7418,3.5976,3.4998,177
-0.2622,-9.5464,0.3255,0.4241,-9.5464,0.2021,3.5002,3.4397,178
0.0855,-9.5468,0.2664,0.1353,-9.5468,0.0643,3.4649,3.4368,179
0.1145,-9.5466,0.2659,0.0861,-9.5466,0.0409,3.4673,3.4297,180
0.1869,-9.5476,0.2683,0.055,-9.5476,0.026,3.4666,3.4323,181
0.172,-9.5481,0.2706,0.0529,-9.5481,0.0249,3.456,3.4328,182
0.1343,-9.5467,0.264,0.0747,-9.5467,0.0354,3.4512,3.4333,183
0.1423,-9.5472,0.2788,0.0678,-9.5472,0.0322,3.4443,3.4287,184
0.0891,-9.5483,0.2685,0.0836,-9.5483,0.0397,3.4684,3.4362,185
0.2135,-9.548,0.2695,0.0394,-9.548,0.0188,3.4596,3.4392,186
0.0983,-9.5465,0.2508,0.1109,-9.5465,0.0526,3.4496,3.4377,187
0.1618,-9.5471,0.2479,0.0659,-9.5471,0.0314,3.4587,3.4367,188
0.1526,-9.5448,0.2336,0.0612,-9.5448,0.0291,3.4486,3.435,189
0.1715,-9.5469,0.2621,0.0415,-9.5469,0.0196,3.4744,3.4314,190
0.197,-9.5477,0.2735,0.0408,-9.5477,0.0192,3.451,3.4397,191
0.1968,-9.5474,0.2489,0.0337,-9.5474,0.016,3.4587,3.4383,192
0.1849,-9.5468,0.2494,0.0459,-9.5468,0.0217,3.4606,3.4414,193
0.1938,-9.5471,0.271,0.0407,-9.5471,0.0193,3.4511,3.4337,194
0.2602,-9.5482,0.2848,0.0264,-9.5482,0.0126,3.4465,3.4406,195
0.2386,-9.5461,0.2808,0.0314,-9.5461,0.0149,3.4647,3.4307,196
0.1813,-9.545,0.2459,0.0483,-9.545,0.023,3.4396,3.4309,197
0.2348,-9.5474,0.2688,0.0286,-9.5474,0.0136,3.4414,3.4357,198
0.2345,-9.5469,0.2563,0.0246,-9.5469,0.0116,3.45,3.4409,199
0.105,-9.5473,0.2695,0.0872,-9.5473,0.0414,3.456,3.4329,200
0.1404,-9.5474,0.2435,0.0709,-9.5474,0.0336,3.4684,3.4346,201
0.1718,-9.5477,0.2597,0.0404,-9.5477,0.0192,3.4578,3.425,202
0.2223,-9.5465,0.2621,0.0246,-9.5465,0.0117,3.4587,3.4327,203
0.2315,-9.5478,0.2593,0.0169,-9.5478,0.0079,3.4423,3.42,204
0.2126,-9.5474,0.2699,0.0254,-9.5474,0.012,3.4578,3.4309,205
0.219,-9.5468,0.2608,0.0267,-9.5468,0.0126,3.456,3.428,206
0.203,-9.5477,0.2734,0.0479,-9.5477,0.0228,3.4423,3.4405,207
