AYGX_min,AZ_mean,AYGX_mean,AYGX_std,AZ_mean,GX_std,Gnorm_max,Gnorm_median,timestamp
0.2167,-9.8625,0.2284,0.0059,-9.8625,0.014,1.3672,1.3334,0
0.1692,-9.8617,0.223,0.027,-9.8617,0.0555,1.4332,1.3456,2
0.0528,-9.8608,0.2231,0.0925,-9.8608,0.2822,2.6601,1.3622,3
-86.0277,-9.5355,-19.7327,36.144,-9.5355,10.9823,86.8112,19.1223,5
-79.5004,-9.5691,33.2075,65.7085,-9.5691,16.5351,104.0384,14.3718,6
-27.686,-9.8119,-2.0351,9.1128,-9.8119,5.7186,14.989,4.4712,8
-2.2311,-9.8527,-0.0529,1.1774,-9.8527,2.6768,6.9403,1.2722,9
-1.1649,-9.8646,0.1618,0.9796,-9.8646,3.1012,6.1044,2.0843,10
-0.9698,-9.8628,-0.4004,0.3922,-9.8628,0.971,4.6313,3.4614,11
-2.6955,-9.8255,-0.1252,1.8968,-9.8255,3.3546,5.02,3.1724,12
-1.3191,-9.8829,0.6464,1.3386,-9.8829,0.6963,5.968,5.1194,14
-1.0153,-9.8746,-0.5314,0.3597,-9.8746,0.5464,3.0285,2.102,15
-0.2019,-9.8811,-0.0025,0.0862,-9.8811,0.7018,1.8381,0.936,16
-0.1812,-9.8767,0.343,0.5185,-9.8767,1.3805,4.2142,1.2252,17
-51.3098,-9.6971,-22.0931,19.8322,-9.6971,3.5823,22.7838,17.9154,18
-28.8586,-9.6119,16.4762,19.288,-9.6119,7.1096,18.5757,12.0916,19
-6.5146,-9.7727,-2.5964,2.2182,-9.7727,2.7258,9.3781,4.0443,20
-2.0169,-9.8117,3.8057,5.2719,-9.8117,3.0697,23.9758,21.9962,21
-7.5633,-9.7223,-4.3223,2.5069,-9.7223,1.4922,7.3532,4.7137,22
-3.4597,-9.707,-2.7541,0.7318,-9.707,0.384,2.3143,1.992,23
-3.1561,-9.6623,1.5079,2.4948,-9.6623,1.1618,2.4842,1.1923,24
-5.2561,-9.7517,0.1755,2.7568,-9.7517,1.7471,6.5901,2.4862,25
-2.0816,-9.7239,-0.6529,0.6631,-9.7239,0.3606,1.1041,0.5467,26
-6.431,-9.798,7.0469,6.945,-9.798,3.8824,20.6319,12.4697,27
-9.0101,-9.8211,-0.9738,4.1672,-9.8211,2.766,17.3651,13.0912,28
-10.1623,-9.9251,-6.0069,3.2855,-9.9251,2.5089,32.9633,27.9444,29
-6.4296,-10.3562,0.3131,2.4059,-10.3562,3.2499,17.0262,12.757,30
-11.8272,-9.5804,1.6441,5.1302,-9.5804,5.8724,21.7797,14.5546,31
-2.6767,-10.1521,2.2305,3.7338,-10.1521,5.6355,38.1511,25.0664,32
-13.2306,-9.9201,2.475,6.4432,-9.9201,7.9407,35.0484,21.6265,33
-2.0472,-9.6843,2.5265,5.1905,-9.6843,4.0531,22.4715,6.4493,34
-3.0922,-9.9988,-0.2034,1.6461,-9.9988,1.4363,13.7735,5.1551,35
-2.1776,-9.3714,0.8903,2.0829,-9.3714,2.3129,12.0211,9.1606,36
-7.0164,-9.7885,0.4938,4.8305,-9.7885,2.8767,13.9828,11.7281,37
-2.0878,-9.9072,1.1267,2.6348,-9.9072,4.5704,15.6967,6.3455,38
-6.3219,-9.8021,1.6439,5.5706,-9.8021,5.931,25.0817,10.9812,39
-7.5682,-9.6987,3.5141,6.3934,-9.6987,6.8377,19.4235,13.3655,40
-1.504,-9.8368,-0.2594,1.2239,-9.8368,1.8971,9.0693,7.068,41
-0.9647,-9.8801,0.1064,0.9445,-9.8801,1.2345,10.0105,7.9996,42
-0.7668,-9.8364,1.0778,1.5955,-9.8364,3.9923,9.8846,6.6406,43
-2.6258,-9.931,2.1078,2.8897,-9.931,4.728,14.6036,8.2027,44
-1.6628,-9.923,2.711,4.4521,-9.923,5.0331,18.4613,8.1462,45
0.2508,-9.8261,7.0138,4.4182,-9.8261,4.3822,13.4821,10.8372,46
-2.2437,-9.7848,4.1972,5.5867,-9.7848,3.9488,13.3208,10.0516,47
-2.8039,-9.8444,3.7549,5.2909,-9.8444,6.1342,14.2492,9.0277,48
-2.5133,-9.9295,0.1853,1.7911,-9.9295,4.2694,14.0207,9.0065,49
-10.0167,-9.6887,1.5629,8.0374,-9.6887,4.1118,12.6069,8.7407,50
-8.9782,-9.9087,11.6196,16.2943,-9.9087,3.7805,28.657,12.1449,52
-0.0532,-9.9223,0.5773,0.4588,-9.9223,2.4874,5.559,5.2359,53
-7.7049,-9.673,-1.1296,5.1895,-9.673,6.6071,22.3124,14.9067,54
-3.5512,-9.9414,1.754,3.0934,-9.9414,4.6922,17.5019,9.4778,55
-3.7465,-9.8511,0.3589,2.3999,-9.8511,5.1764,15.5012,6.1541,56
-6.1025,-9.8994,-1.1528,2.1481,-9.8994,2.5443,7.9536,3.2153,57
-3.0731,-10.1328,1.2681,4.0548,-10.1328,2.3971,7.3466,6.0719,58
-1.9522,-9.7096,-0.1763,0.8582,-9.7096,2.0458,6.773,2.8871,59
-3.3721,-9.9623,-0.1702,1.4154,-9.9623,3.9519,11.9764,5.7962,60
-13.2413,-9.6329,7.6517,14.9528,-9.6329,9.2797,38.9333,20.2076,61
-3.5269,-10.162,-0.858,1.3967,-10.162,0.887,39.8648,18.6212,62
-1.9948,-10.0477,4.5825,4.8159,-10.0477,6.6116,50.4789,33.0142,63
-10.7412,-9.8398,2.0003,6.0829,-9.8398,2.3782,20.0968,12.4176,64
-2.8784,-9.8388,-0.2681,1.0534,-9.8388,2.3788,17.5154,10.8209,65
-0.2958,-9.7214,4.5935,4.2483,-9.7214,6.3596,27.4414,17.6892,67
-3.0836,-9.5557,2.7304,4.303,-9.5557,5.6911,23.7911,8.7477,68
-9.1114,-9.7951,4.0429,9.4794,-9.7951,7.9771,22.9764,16.2919,69
-33.2657,-9.85,-4.679,10.4174,-9.85,4.0676,17.0833,9.5905,71
-6.379,-9.8346,3.0142,8.9535,-9.8346,9.9118,44.5698,25.3313,72
-49.0015,-9.5839,-12.6509,23.9013,-9.5839,10.144,37.0739,33.4261,73
-5.2563,-9.6281,14.3376,16.1285,-9.6281,6.782,36.8986,12.8686,74
-1.4457,-9.8283,2.352,2.4815,-9.8283,2.9479,7.3006,3.4805,75
-9.2979,-9.8372,-3.2976,3.0092,-9.8372,3.3653,12.6498,7.6659,76
-4.56,-9.8285,0.5261,4.4242,-9.8285,4.9651,14.5638,9.7901,77
-0.4511,-9.853,0.1103,0.5096,-9.853,1.5349,4.7713,2.0517,78
0.0074,-9.8552,0.1617,0.2025,-9.8552,1.3076,4.1199,0.9274,79
-1.4759,-9.8506,-0.5365,0.4635,-9.8506,0.4426,5.6321,5.0894,80
0.148,-9.8482,0.6209,0.2909,-9.8482,0.5177,2.1598,1.7617,81
-22.705,-9.7498,-18.1528,4.5735,-9.7498,1.821,14.7134,13.6116,82
-10.6421,-9.6536,17.8468,15.3817,-9.6536,7.875,18.8807,13.8873,83
-51.9261,-9.6481,-19.9305,15.7298,-9.6481,5.9214,22.4586,12.1697,84
-13.5489,-9.5831,-0.8158,9.3593,-9.5831,3.6086,8.9359,7.7498,85
5.3884,-9.6877,6.34,0.848,-9.6877,0.4504,4.6149,4.1962,86
6.5603,-9.7814,9.8826,1.7936,-9.7814,0.9311,8.1776,7.7621,87
-1.6371,-9.85,-1.2326,0.3604,-9.85,0.3332,2.4557,2.1124,88
-1.879,-9.8676,-1.056,0.5226,-9.8676,0.4822,3.2892,2.7604,90
-0.6285,-9.8659,-0.5438,0.0543,-9.8659,0.1285,1.5923,1.4787,91
-0.9075,-9.8622,-0.7491,0.137,-9.8622,0.3452,2.094,1.8984,92
-9.8473,-9.824,-7.2267,1.7099,-9.824,0.3398,8.3736,8.1835,94
-8.2924,-9.5345,42.8506,22.0017,-9.5345,7.2521,70.1326,58.7938,95
-12.5403,-9.8653,-1.9937,7.0972,-9.8653,4.6931,14.6982,11.6589,96
-8.1887,-9.8423,1.0929,3.0722,-9.8423,4.3627,9.2024,5.6166,98
-11.2163,-9.8438,-5.9166,4.051,-9.8438,1.0413,12.4104,10.9077,99
-1.7373,-9.7921,7.3043,10.8683,-9.7921,5.4217,17.8241,2.2764,100
-6.9267,-9.8751,1.2511,5.5855,-9.8751,3.6853,10.0692,6.4428,101
-0.2336,-9.8745,2.3513,1.6525,-9.8745,0.8419,8.6412,7.4415,102
-8.1361,-9.8243,-1.595,3.5379,-9.8243,3.4555,6.4533,2.7661,103
-6.7024,-9.8366,-1.504,1.9171,-9.8366,2.1174,6.0798,1.7352,104
-5.999,-9.821,-2.5633,1.7203,-9.821,1.4262,4.6995,3.0866,105
-5.6377,-9.8065,-1.4573,2.1933,-9.8065,1.6146,4.2299,1.0403,106
-0.001,-9.8391,2.8154,1.7062,-9.8391,1.2181,6.3177,5.61,107
1.201,-9.8265,4.2096,2.7004,-9.8265,2.003,7.88,5.2199,108
-0.4908,-9.8644,-0.1749,0.2351,-9.8644,0.7179,1.3934,0.8622,109
-4.9594,-9.8655,-0.5676,1.3506,-9.8655,2.6125,8.6756,1.5041,110
-7.3849,-9.8245,-4.1596,2.0577,-9.8245,1.9301,8.17,4.6021,111
-8.0594,-9.8086,-3.2558,5.6619,-9.8086,3.0394,20.5373,18.4568,112
-3.6688,-9.7388,0.57,3.6841,-9.7388,1.965,9.9058,6.1716,113
-5.8187,-9.8573,-1.7689,3.2295,-9.8573,4.6569,6.8032,4.3578,114
-1.3447,-9.7539,-0.221,0.7361,-9.7539,0.4663,1.3779,0.9757,115
-2.7616,-9.7594,-1.6929,0.7568,-9.7594,0.4617,1.6634,1.3456,116
-3.1006,-9.7485,-2.6418,0.3615,-9.7485,0.1434,2.2737,2.0855,117
-6.1934,-9.7905,-1.9049,2.9056,-9.7905,2.3119,5.0512,2.7618,118
-6.7428,-9.7549,-2.7651,3.2077,-9.7549,1.9678,4.3245,2.3437,119
-7.943,-9.7654,1.7243,9.0852,-9.7654,6.2128,10.1694,4.5801,120
-12.5235,-9.8706,-2.5493,4.6317,-9.8706,4.5196,11.7522,5.4949,121
-11.4238,-9.7159,-5.9778,6.3432,-9.7159,3.4513,5.8153,4.75,122
3.201,-9.7729,4.8042,1.4594,-9.7729,0.7894,4.708,3.6275,123
-1.9689,-9.8538,-0.7609,0.7721,-9.8538,2.5256,5.0991,4.174,125
-1.0643,-9.8559,-0.3553,0.5588,-9.8559,1.001,2.3194,1.9062,126
-2.7804,-9.862,-0.8125,1.1243,-9.862,1.9817,4.6802,2.7217,127
-1.8774,-9.8489,-1.7483,0.1596,-9.8489,0.0683,2.7302,2.5289,128
-11.2829,-9.7456,-5.8001,3.5608,-9.7456,1.8469,7.2996,5.3565,130
-0.8697,-9.7837,0.8243,1.3094,-9.7837,0.9992,2.2214,1.0657,131
-1.7515,-9.8139,-1.2638,0.3052,-9.8139,0.2567,1.7559,1.3872,132
-2.337,-9.8026,-1.7767,0.3701,-9.8026,0.305,2.0738,1.7542,133
-1.8858,-9.8021,-1.1767,0.4377,-9.8021,0.346,1.6578,1.1236,134
-3.1385,-9.8008,-1.3326,1.1426,-9.8008,0.9643,2.6449,1.3279,135
-2.3004,-9.7924,-1.6052,0.4714,-9.7924,0.3274,1.8824,1.2642,137
-5.1383,-9.7939,-2.4282,1.1261,-9.7939,0.7472,3.5837,2.0129,138
-4.3032,-9.793,-0.9735,2.1217,-9.793,1.7238,3.3134,1.7638,139
-4.4414,-9.7879,-3.2086,0.9314,-9.7879,0.5681,3.2332,2.7167,140
-5.8743,-9.7651,-2.7831,1.8075,-9.7651,1.1795,3.705,2.046,141
-1.0736,-9.7816,-0.8121,0.2472,-9.7816,0.1722,1.1929,0.9901,142
-2.6044,-9.7829,-1.4395,0.5239,-9.7829,0.3503,2.0478,1.255,143
-1.8941,-9.785,-1.3126,0.3026,-9.785,0.2059,1.5853,1.1959,144
-1.9054,-9.7854,-1.327,0.5039,-9.7854,0.3576,1.646,1.3051,145
-1.7827,-9.7939,-1.3805,0.2494,-9.7939,0.1659,1.4988,1.3249,146
-1.5712,-9.7895,-1.3765,0.1609,-9.7895,0.1259,1.6002,1.3637,147
-1.7207,-9.7994,-0.0899,0.787,-9.7994,0.634,1.5835,0.8467,148
-2.2104,-9.8084,-1.2249,0.4708,-9.8084,0.3791,2.0137,1.2721,149
-1.8679,-9.8071,-1.465,0.3417,-9.8071,0.2693,1.7636,1.5622,150
-2.1695,-9.8038,-1.3197,0.6467,-9.8038,0.5234,1.9724,1.4624,151
0.3061,-9.8148,0.5885,0.1817,-9.8148,0.1645,0.9967,0.955,152
-2.9032,-9.8296,-1.4358,0.6993,-9.8296,0.7029,2.993,1.5955,153
-2.9059,-9.8172,-1.511,0.9005,-9.8172,0.8464,2.8019,1.5913,154
-13.6799,-9.7915,-4.4364,3.546,-9.7915,2.3644,10.0887,4.109,155
-4.9687,-9.8249,2.4964,5.0487,-9.8249,3.5708,29.214,19.4516,156
-7.5311,-9.6741,1.203,7.3817,-9.6741,8.8926,24.7985,12.4834,157
-5.627,-9.8695,1.0049,3.4567,-9.8695,7.3608,31.7584,18.6285,158
-1.7876,-9.8982,0.7918,2.3345,-9.8982,3.2719,16.4334,13.3807,159
-6.6226,-9.9299,-1.2805,2.6433,-9.9299,3.1357,27.6002,24.9486,160
-0.3367,-9.8398,1.3445,1.6851,-9.8398,1.9911,11.146,6.0996,161
0.3021,-9.9584,1.9887,1.4023,-9.9584,1.0096,6.5615,4.7594,162
-2.5636,-9.7921,2.7142,3.9186,-9.7921,6.8413,27.6247,10.4876,163
-2.705,-9.859,0.7977,1.7987,-9.859,2.0898,9.9808,5.7805,164
-1.3287,-9.861,0.531,1.144,-9.861,2.1644,12.4341,9.4198,165
-0.2955,-9.9445,1.1052,1.2912,-9.9445,1.4586,8.8004,6.1876,166
-2.4343,-9.8137,2.6298,3.9997,-9.8137,3.4604,15.226,10.2515,167
-2.6061,-9.9615,0.6184,1.5851,-9.9615,2.7861,15.3666,6.1497,168
-0.776,-10.0923,1.0222,1.1224,-10.0923,3.6405,11.7804,5.6837,169
-3.3836,-9.672,0.305,1.8546,-9.672,3.3125,12.4068,6.4529,170
-0.3609,-9.9625,0.6735,0.7906,-9.9625,2.0935,10.4198,9.7683,172
-2.2734,-9.9116,2.0428,3.74,-9.9116,4.4694,19.2333,12.842,173
-7.0537,-9.8462,1.2459,4.65,-9.8462,8.7837,19.3894,16.4382,174
-3.9529,-9.8136,5.239,5.4901,-9.8136,7.631,25.2441,14.9469,175
-1.9191,-10.0636,0.352,1.4478,-10.0636,1.1022,17.3177,10.5582,177
-1.7215,-9.8468,2.525,2.9295,-9.8468,4.0728,16.334,9.8171,178
-3.9953,-9.8971,1.4998,3.9644,-9.8971,2.5022,16.3375,12.4364,179
-0.5828,-9.7876,2.5822,3.9426,-9.7876,3.33,13.8899,11.6715,180
-3.5572,-9.9498,-0.7416,1.6659,-9.9498,4.8152,17.4293,6.8221,182
-3.2819,-9.7826,2.2601,4.3293,-9.7826,5.1959,20.3847,9.0761,183
0.0888,-9.9607,0.7792,0.6745,-9.9607,2.6718,15.4185,9.6886,184
-0.7164,-9.7746,1.1678,2.0965,-9.7746,4.3042,16.2139,9.7707,185
-1.3742,-9.8452,4.8439,6.9347,-9.8452,7.3422,16.8709,13.7825,187
-3.4153,-9.8293,-0.3516,1.314,-9.8293,2.6912,11.4433,6.3637,189
-8.7979,-9.954,-2.0797,3.0877,-9.954,4.3389,20.6772,6.6273,190
-0.9405,-9.8874,0.101,0.9776,-9.8874,2.018,6.8064,4.3906,191
-2.0455,-9.9448,0.2267,1.6598,-9.9448,2.9528,8.2634,5.3404,192
-6.2591,-9.8308,2.2367,4.2895,-9.8308,3.335,31.1365,10.1904,193
-3.1167,-9.9232,3.3242,6.1192,-9.9232,5.5931,21.9584,12.1434,194
-0.346,-9.8473,0.1595,0.2892,-9.8473,1.2236,7.9499,5.4292,195
-5.4914,-9.8635,20.0722,16.0602,-9.8635,6.1697,39.1314,30.3459,196
-0.3922,-9.7867,0.9238,1.3127,-9.7867,1.516,39.5453,34.4928,197
-21.2643,-10.0293,-0.9427,11.2558,-10.0293,7.0091,38.3406,31.5837,199
-0.6879,-9.846,0.0497,0.3912,-9.846,1.1687,14.3573,5.0852,200
-0.7038,-9.8713,0.2658,0.9637,-9.8713,1.993,8.351,3.4281,201
-0.6313,-9.7924,1.6182,2.5886,-9.7924,2.2836,21.2299,19.3506,202
-0.9823,-9.9047,1.3927,1.2329,-9.9047,1.5691,13.6338,8.2413,203
-2.7849,-9.8704,-0.0019,1.3902,-9.8704,2.3725,14.9961,12.9707,204
-0.6624,-9.8696,0.0216,0.4742,-9.8696,1.5193,10.4981,8.0019,205
-2.7056,-9.7973,-0.4864,0.8199,-9.7973,3.9883,40.3396,23.8659,206
0.5819,-9.7954,4.101,4.3299,-9.7954,2.6996,22.3573,14.4391,207
-32.3972,-9.7967,-11.298,10.2467,-9.7967,4.2959,18.4309,11.4612,208
-7.9794,-9.7227,-0.0325,5.1686,-9.7227,2.9547,4.244,3.1787,209
-2.4255,-9.7961,0.7511,2.2973,-9.7961,1.8098,3.5523,1.7517,210
-3.9598,-9.7915,-3.0849,0.8629,-9.7915,0.6063,3.0525,2.534,211
-1.2815,-9.7878,-1.0976,0.1289,-9.7878,0.0889,1.2422,1.1308,212
-1.5357,-9.7912,-1.3248,0.1128,-9.7912,0.0791,1.4226,1.2627,213
-2.6542,-9.7909,-1.9205,0.539,-9.7909,0.3706,2.1201,1.5614,214
-1.9546,-9.7922,-1.2572,0.5514,-9.7922,0.4085,1.6913,1.2328,215
-2.6595,-9.7947,-1.6431,0.4884,-9.7947,0.3882,2.2276,1.4041,216
-1.4788,-9.7891,-1.2934,0.1138,-9.7891,0.0741,1.363,1.2458,217
-2.566,-9.7953,-1.3833,0.4704,-9.7953,0.3387,1.9451,1.3019,218
-2.1048,-9.7947,-1.5084,0.2649,-9.7947,0.1741,1.7847,1.3787,219
-1.397,-9.7958,-1.201,0.1548,-9.7958,0.1145,1.3126,1.2219,220
-1.7999,-9.7986,-1.336,0.2443,-9.7986,0.1779,1.6503,1.2992,222
-5.0454,-9.8054,1.336,4.2116,-9.8054,3.6011,8.6613,6.1609,223
-1.0699,-9.8588,0.8454,1.2102,-9.8588,2.278,7.1184,5.694,224
-0.5778,-9.8513,1.026,1.7793,-9.8513,2.3734,21.339,6.3344,225
-5.4595,-9.9028,2.9074,5.2379,-9.9028,6.5336,33.016,14.4968,226
0.4481,-9.8556,1.3374,0.8682,-9.8556,0.515,7.9814,5.4546,227
-1.6436,-9.8843,2.669,3.8746,-9.8843,5.9932,24.2369,15.1324,228
-0.0481,-9.8811,1.5671,1.5658,-9.8811,3.9223,11.7286,7.3016,229
0.0816,-9.8618,0.7955,0.6689,-9.8618,0.8827,7.0616,4.8162,230
-0.7881,-9.8673,-0.2621,0.4204,-9.8673,1.2752,16.8067,15.1133,231
1.8515,-9.8117,5.6796,2.3982,-9.8117,1.5426,24.8476,19.7915,232
-2.7316,-9.9499,1.7884,3.204,-9.9499,5.1689,27.0136,14.1877,233
-3.457,-9.8428,1.9963,3.3936,-9.8428,4.3564,19.6133,8.2841,234
-0.318,-9.8332,0.3115,0.4451,-9.8332,1.4372,10.8084,9.7387,235
-0.5291,-9.8785,4.7998,6.5636,-9.8785,5.4545,21.5879,7.6676,236
-2.0197,-9.9245,0.5606,1.1463,-9.9245,3.2279,12.023,6.0242,238
-0.7208,-9.7976,-0.2142,0.2785,-9.7976,0.613,2.3382,1.6905,239
-0.5233,-9.9959,2.0564,2.6102,-9.9959,5.6598,21.9698,17.8753,242
-1.6377,-9.8644,2.4855,3.306,-9.8644,4.6052,17.3467,8.695,243
-0.8691,-9.8746,0.2689,0.6311,-9.8746,3.045,7.9861,4.2837,244
-0.2144,-9.8646,2.1143,2.0221,-9.8646,3.2114,11.0713,8.353,247
-0.5977,-9.8939,2.6747,2.7037,-9.8939,4.4742,15.6661,11.648,248
-1.7004,-9.8318,-0.1056,0.5636,-9.8318,1.6049,6.7878,2.9107,249
-0.8163,-9.8807,0.3425,0.6507,-9.8807,1.4418,4.8804,2.867,250
-0.5173,-9.8413,0.5154,0.9068,-9.8413,1.6868,11.5718,6.239,251
-1.6335,-9.9204,1.2219,1.9469,-9.9204,3.9359,24.0652,6.5789,254
-0.7647,-9.9684,0.6706,1.2461,-9.9684,0.5415,5.3819,3.4665,255
-0.037,-9.817,0.0086,0.0368,-9.817,0.1136,3.1343,1.3375,256
-0.0042,-9.9071,0.5614,0.608,-9.9071,1.7302,9.1132,7.4414,257
-0.3255,-10.0392,-0.0241,0.1893,-10.0392,0.4175,12.1905,11.0347,258
-0.466,-9.9016,0.4987,0.9409,-9.9016,2.5446,9.8591,6.6196,259
-3.0293,-9.9511,0.5457,1.8247,-9.9511,2.8344,11.3236,8.4973,260
-6.5566,-9.8864,-4.5409,1.7064,-9.8864,1.0051,13.8275,11.7161,261
-0.9017,-9.8306,0.1184,0.8442,-9.8306,3.1027,13.1495,8.3758,263
-11.7419,-9.872,-0.5036,4.4451,-9.872,7.0188,21.0391,10.5938,264
-1.2404,-9.9078,-0.3259,0.5328,-9.9078,3.842,28.2137,19.4951,265
-0.2148,-10.0383,0.2191,0.3842,-10.0383,0.9899,7.8978,4.5568,266
0.5946,-9.6434,2.3339,1.2635,-9.6434,2.3797,16.4194,13.8378,267
-3.3045,-9.9058,11.7602,7.4201,-9.9058,1.9373,28.8421,20.893,268
-4.4279,-9.8457,-1.1691,2.1002,-9.8457,1.7483,18.0234,13.6815,269
-0.9889,-9.9422,0.0249,1.0243,-9.9422,1.6623,13.6415,5.5706,270
-1.4403,-9.8553,0.5098,1.0919,-9.8553,2.3326,8.0304,4.862,272
-0.8464,-9.8766,1.8866,2.5522,-9.8766,4.754,15.0507,9.8727,273
-1.0073,-9.7953,-0.1547,0.4543,-9.7953,0.7592,9.9095,9.103,274
-0.1766,-9.8058,1.4273,2.0353,-9.8058,2.8,15.302,10.3081,275
-0.2203,-9.797,0.2829,0.6321,-9.797,1.6053,12.3211,7.7796,277
-3.6653,-9.776,0.0611,1.4823,-9.776,3.9419,37.707,7.5641,278
-2.5844,-10.2637,0.0149,1.2398,-10.2637,1.8538,30.4557,27.5159,279
-3.8109,-9.8496,2.9262,6.3241,-9.8496,4.656,38.6058,28.5141,280
4.5122,-9.7858,19.0658,10.6711,-9.7858,4.0561,46.2141,25.8504,282
-4.9746,-9.8839,2.0614,5.0626,-9.8839,7.0008,21.9257,8.3866,283
-0.1515,-9.7756,0.1457,0.2991,-9.7756,0.6174,4.5225,3.9389,284
-0.2685,-9.9259,0.643,0.8235,-9.9259,2.3415,7.2062,5.0996,285
-0.6341,-9.8157,0.9249,1.3479,-9.8157,1.4642,6.4122,6.2013,287
-0.1695,-9.8777,0.8569,1.3595,-9.8777,3.2782,8.603,6.0545,288
-1.3163,-10.2197,-0.25,0.6542,-10.2197,0.6371,8.6066,5.7857,290
-0.3491,-10.2652,4.6252,4.4131,-10.2652,6.9252,18.8493,15.5629,291
-1.7213,-9.8152,-0.2374,1.0867,-9.8152,2.5643,9.401,4.8609,292
-0.5598,-9.9617,0.7192,1.0818,-9.9617,4.9609,13.9966,8.8699,293
0.2821,-9.7587,5.6225,3.3052,-9.7587,7.2939,14.5036,10.8558,294
-2.0394,-9.8059,2.1546,2.0108,-9.8059,5.3064,15.4367,8.9153,295
-0.596,-9.9251,0.0561,0.6468,-9.9251,2.8036,13.1279,9.7176,296
-0.9234,-9.9503,-0.0026,0.5201,-9.9503,1.7019,14.1315,8.9249,297
-1.9523,-9.8752,0.7722,1.7625,-9.8752,4.3821,18.4325,7.242,299
-0.971,-9.8815,1.7561,1.7673,-9.8815,2.1571,10.4411,8.5927,300
0.3476,-9.8364,3.9394,3.8244,-9.8364,1.8731,19.3104,14.2199,301
-1.7012,-9.8872,-0.7308,0.7029,-9.8872,2.561,7.4868,5.5033,302
-0.5437,-9.9321,0.9571,1.1934,-9.9321,4.3112,8.859,6.3558,303
-0.1025,-9.7349,4.9083,5.3535,-9.7349,7.5179,18.1617,10.7121,304
-0.22,-9.9057,0.8715,0.6599,-9.9057,2.7677,6.2618,5.4759,305
-0.0261,-9.9945,1.9949,2.0193,-9.9945,3.094,14.847,5.7145,307
-0.7169,-9.8085,1.0078,1.7258,-9.8085,2.1342,9.1912,5.3175,309
-0.0759,-9.9142,0.1192,0.1421,-9.9142,0.9635,2.5209,1.6805,310
0.4192,-9.8954,0.7077,0.3153,-9.8954,0.6331,4.3278,4.0498,312
-2.5642,-9.8906,0.2648,1.6816,-9.8906,2.5954,9.8964,4.4238,313
-2.966,-9.6395,3.0037,4.0774,-9.6395,4.2909,27.6156,18.3798,314
-10.9667,-9.7302,4.5091,6.6455,-9.7302,3.9627,27.4445,19.4217,316
-2.3705,-10.0556,0.1552,1.8793,-10.0556,1.4735,13.9517,12.6104,318
-1.853,-9.9691,1.6451,3.0852,-9.9691,3.2977,13.1464,5.1033,319
-0.9011,-9.8301,0.7708,1.4063,-9.8301,4.1571,18.0436,7.7647,320
-1.0051,-9.8402,1.5321,2.388,-9.8402,1.8333,8.0492,5.7498,321
-1.5313,-9.972,-0.3083,1.0945,-9.972,2.0274,9.6766,6.4912,322
1.9617,-9.8915,4.6864,1.9153,-9.8915,1.3843,12.5553,7.8513,323
-0.3107,-9.924,2.0397,1.8686,-9.924,1.4012,9.1956,7.9361,324
-0.5497,-9.8937,1.6879,1.3606,-9.8937,0.4545,8.7732,6.5867,325
-0.4345,-9.9256,-0.0707,0.3336,-9.9256,1.2183,6.4906,5.4307,326
-0.1794,-9.9282,-0.0391,0.0988,-9.9282,0.4103,5.4383,4.3508,327
-2.1477,-9.9034,1.9825,3.4504,-9.9034,2.1479,7.4212,6.2154,328
-1.2842,-9.8529,1.1472,2.2249,-9.8529,4.3581,15.2112,11.0454,329
0.7465,-9.8881,1.4397,0.5496,-9.8881,1.3536,8.4151,6.4463,330
-1.7749,-9.7189,0.2235,1.2943,-9.7189,0.4437,8.6298,6.0156,331
-2.6617,-9.8467,11.9035,12.6297,-9.8467,6.8297,54.7933,51.0574,332
-0.0075,-10.0371,0.5809,0.5607,-10.0371,1.5353,23.0151,15.1063,333
-0.0761,-9.9364,0.7652,0.8927,-9.9364,1.626,22.1908,20.7875,334
-0.4614,-9.8061,1.1477,1.7569,-9.8061,3.3754,31.7751,8.6887,335
-1.23,-9.8387,0.0208,0.7799,-9.8387,2.371,12.2073,7.6092,337
-1.8699,-9.9019,0.239,0.9206,-9.9019,2.7878,23.8453,15.6195,338
0.0236,-9.8224,0.8551,0.711,-9.8224,0.2215,15.8532,15.0005,339
-1.0528,-9.8303,0.4506,1.3265,-9.8303,4.4871,12.1167,9.2784,340
-1.3588,-9.8227,4.264,5.3475,-9.8227,3.8549,21.5015,5.9879,342
-1.1906,-9.8573,3.0047,4.9686,-9.8573,5.6511,23.2672,11.063,343
-1.2221,-9.7761,-0.5012,0.4984,-9.7761,1.3451,11.3296,8.8269,344
-3.6267,-9.9021,1.3613,2.4598,-9.9021,4.6649,17.8263,9.9559,345
-16.0981,-9.8715,-3.4159,5.8029,-9.8715,2.4978,18.7366,16.2449,347
-6.4333,-9.8401,-0.8216,2.9523,-9.8401,2.9361,5.6737,2.6896,348
-0.84,-9.8565,-0.6907,0.1538,-9.8565,0.1793,1.3452,1.2988,349
-0.6175,-9.8611,0.5915,0.6232,-9.8611,0.9548,2.3747,1.3196,350
-1.6865,-9.8666,-1.2775,0.3162,-9.8666,0.3689,2.9282,2.7069,351
-0.9709,-9.8671,-0.8381,0.1036,-9.8671,0.1431,1.7565,1.5075,353
-1.4149,-9.8635,-0.8848,0.2748,-9.8635,0.3855,2.2115,1.6191,354
-0.4598,-9.8623,-0.2645,0.1807,-9.8623,0.2639,0.9317,0.789,355
-1.5913,-9.8651,-1.0091,0.3693,-9.8651,0.7134,2.6706,1.6914,357
-0.694,-9.8645,-0.3862,0.2705,-9.8645,0.5086,1.5505,1.0639,359
-1.1552,-9.8665,-0.6839,0.3396,-9.8665,0.5831,2.2064,1.3862,361
-0.8348,-9.8709,-0.6189,0.2002,-9.8709,0.3292,1.8718,1.7238,362
-0.6591,-9.8674,-0.1074,0.3429,-9.8674,0.5776,1.2756,0.8688,363
-1.3081,-9.8674,-0.9983,0.2565,-9.8674,0.3988,2.7323,2.1404,364
-1.1738,-9.8651,-0.591,0.3324,-9.8651,0.5142,2.0317,1.118,365
-0.3183,-9.8704,-0.1807,0.0722,-9.8704,0.2101,1.2273,0.9108,366
-1.3643,-9.8728,-0.623,0.8571,-9.8728,1.4322,2.3861,2.1801,367
-8.3854,-9.8607,-3.4268,2.6777,-9.8607,2.0094,8.7877,7.1596,368
-0.6842,-9.8352,4.1315,2.5246,-9.8352,2.584,17.8992,11.6121,369
-3.8238,-9.7639,-0.1727,1.2483,-9.7639,1.6712,12.39,5.8736,370
-3.2054,-10.096,0.2001,1.9769,-10.096,2.4408,14.6064,13.2418,371
-1.0552,-9.8169,0.6483,1.5095,-9.8169,2.4025,15.1669,12.7974,372
-0.2556,-9.8903,0.942,1.349,-9.8903,1.9539,16.7097,13.1467,373
-2.7124,-9.8899,-0.1508,1.0512,-9.8899,3.2488,20.9471,16.5139,375
-3.1899,-9.8544,3.3344,3.6533,-9.8544,6.5917,21.4386,13.455,377
-0.9578,-9.8881,0.2756,0.7283,-9.8881,2.3058,12.9107,7.4225,378
-0.3279,-9.8737,0.0391,0.1805,-9.8737,0.8698,6.7944,5.0488,379
-0.8453,-9.8676,2.3331,3.2836,-9.8676,1.7741,17.2985,12.6088,380
0.2237,-9.8601,0.7109,0.6115,-9.8601,0.8191,5.1775,4.5713,382
-0.8411,-9.8815,1.1118,1.1065,-9.8815,4.1434,16.4105,9.821,383
-0.0566,-9.8588,0.0285,0.0687,-9.8588,0.7197,11.0507,7.8293,384
-1.203,-9.8583,0.3342,1.0051,-9.8583,1.9492,17.7142,14.6335,385
0.3355,-9.8735,1.0441,0.6419,-9.8735,1.2143,8.995,5.2487,387
-1.0675,-9.8687,1.3007,1.373,-9.8687,2.8105,16.2519,8.8708,388
-0.088,-9.8702,0.6338,0.7453,-9.8702,1.5958,5.0391,4.0756,389
-1.1112,-9.8836,1.0007,1.6139,-9.8836,2.9421,10.9747,8.5693,390
-0.5346,-9.8803,0.0933,0.3685,-9.8803,1.6197,8.0512,5.0495,392
-0.9371,-9.8845,0.4343,0.7868,-9.8845,2.084,9.4195,6.0064,393
0.0103,-9.8787,0.6053,0.7943,-9.8787,1.3744,7.4652,5.3609,394
-0.1156,-9.8739,0.3761,0.2669,-9.8739,0.6755,4.1578,2.6739,395
-0.1873,-9.8646,0.0386,0.1845,-9.8646,0.9377,4.9806,3.4384,397
-0.2037,-9.872,0.3441,0.4084,-9.872,1.2725,6.4676,3.0567,398
-0.1542,-9.8799,-0.0124,0.0683,-9.8799,0.5803,3.0346,2.218,399
0.1999,-9.8528,0.4825,0.1742,-9.8528,0.2632,5.3719,3.109,400
0.0743,-9.8362,0.213,0.1321,-9.8362,0.1652,1.8122,1.5816,402
-0.2352,-9.8789,0.0144,0.135,-9.8789,0.8411,7.4768,3.4985,403
0.4745,-9.7982,0.8399,0.2876,-9.7982,0.4585,6.7423,6.1336,404
-0.4238,-9.8919,-0.0798,0.1653,-9.8919,1.0497,13.4622,2.833,405
-0.4782,-9.8769,0.9197,0.7361,-9.8769,0.8367,12.9684,9.2081,407
-0.6217,-9.905,0.0093,0.2832,-9.905,1.0369,17.0529,6.4466,408
-0.2474,-9.5713,0.0163,0.1806,-9.5713,0.4346,15.8101,14.6165,409
-0.5475,-9.8218,1.7591,2.5111,-9.8218,2.0056,13.4585,6.0313,410
-2.1754,-10.0979,-0.8468,0.7693,-10.0979,0.5735,8.0687,5.2884,412
-0.2955,-9.9487,0.6781,1.0357,-9.9487,1.9442,23.1364,16.7016,413
0.2407,-9.9581,2.9862,1.9525,-9.9581,1.169,12.232,11.6754,414
-3.4536,-9.9494,10.4829,13.2278,-9.9494,6.6537,32.3218,24.4043,415
-1.2057,-9.7577,-0.3493,0.4704,-9.7577,1.9889,9.3377,5.9272,417
-11.7723,-9.8313,-0.6919,3.126,-9.8313,2.3763,13.8237,5.5981,418
-1.9421,-9.903,1.1297,2.1625,-9.903,3.3718,11.8462,5.6496,419
-0.0361,-9.907,0.679,0.5976,-9.907,1.2132,7.0723,5.8286,420
0.032,-9.8566,1.0501,1.0986,-9.8566,1.411,8.5153,6.0632,421
-2.4896,-9.8183,0.2088,1.7613,-9.8183,0.68,7.6153,4.6822,422
0.0262,-10.1982,0.6056,0.5147,-10.1982,0.8557,6.8965,4.1127,423
-0.2941,-9.8412,0.9386,1.1837,-9.8412,3.6283,8.9916,7.3429,424
-1.5893,-9.9482,-0.0359,0.8763,-9.9482,1.6373,11.1295,9.2352,425
-0.5292,-9.5803,0.1458,1.113,-9.5803,2.7249,12.7538,6.9888,426
-0.2237,-9.7342,2.5438,2.8342,-9.7342,3.5574,13.1996,9.2577,427
-2.2283,-9.9023,0.7683,1.3342,-9.9023,3.7505,11.3953,7.2852,428
-0.0296,-10.1145,2.3761,1.4105,-10.1145,3.4999,11.1012,10.6927,429
-0.9834,-9.9725,1.0873,1.4363,-9.9725,4.6018,13.5396,8.1401,430
-1.9368,-9.8097,0.3401,1.4691,-9.8097,2.8869,10.1113,5.819,432
-2.7052,-9.9589,0.1093,2.1147,-9.9589,1.066,10.0369,8.0075,433
-2.1246,-9.8139,-0.243,1.2791,-9.8139,1.523,13.0774,12.7057,434
-0.3372,-9.8549,0.0936,0.192,-9.8549,0.4653,6.6563,3.845,435
-0.024,-10.0219,5.4999,6.3845,-10.0219,5.8746,22.3096,19.7135,436
-5.0722,-9.8863,1.7668,3.4872,-9.8863,6.5938,27.9529,13.709,438
-2.423,-9.9964,1.1491,3.2556,-9.9964,1.4158,12.1414,11.6663,439
-5.0496,-9.8424,-0.6468,2.3404,-9.8424,1.3529,7.5565,5.6917,440
-0.3731,-9.8491,0.2992,0.3872,-9.8491,1.1323,5.7949,4.6846,442
-2.2145,-9.9251,0.766,1.2801,-9.9251,4.3204,21.8151,15.3175,443
1.2799,-9.8477,4.874,2.1776,-9.8477,2.2179,12.5619,11.2163,444
-0.2693,-9.8878,1.1737,1.5676,-9.8878,2.9784,7.633,5.7625,445
-0.5347,-9.8876,0.3231,0.6582,-9.8876,2.2255,4.6751,3.7882,447
-1.3174,-9.993,0.3388,0.8188,-9.993,2.6617,11.9096,3.2523,448
0.0059,-9.94,2.8421,2.4098,-9.94,2.6865,15.6773,12.4547,449
0.1035,-9.7808,0.9685,0.7343,-9.7808,0.6805,7.4382,5.4306,450
-0.2488,-9.9018,0.5416,0.7227,-9.9018,2.4062,12.5598,10.8027,452
-2.1809,-9.8822,0.2502,0.8115,-9.8822,2.3519,7.5572,4.4189,453
1.0028,-9.5976,2.6457,1.24,-9.5976,1.1133,11.3931,8.8765,454
-2.0692,-10.1591,1.1334,1.7826,-10.1591,0.8851,24.5272,7.0857,455
-3.7663,-9.4514,0.0136,1.4178,-9.4514,3.1755,13.953,8.0607,457
-18.986,-9.6952,0.6634,4.4509,-9.6952,7.5476,30.4573,12.684,458
-0.7459,-9.8395,1.0917,1.1494,-9.8395,2.1164,16.5268,10.2658,459
-1.2412,-9.7743,-0.0692,0.4455,-9.7743,1.3467,7.8564,4.2607,460
-3.2477,-9.6772,-0.001,1.0939,-9.6772,1.8437,6.7891,3.0619,462
-4.6851,-9.8959,0.069,1.7129,-9.8959,4.1494,12.8195,8.4241,463
-0.8386,-10.2799,0.5587,0.9729,-10.2799,0.7966,9.7253,5.9579,464
-0.6943,-9.8674,1.6012,2.8594,-9.8674,3.4651,17.3873,7.5507,465
-0.5126,-9.9291,0.1736,0.3519,-9.9291,1.2155,9.5357,4.0892,467
-1.8384,-9.9308,1.2939,2.3484,-9.9308,5.0574,24.0131,9.3793,468
-2.6009,-9.6622,2.3011,2.4115,-9.6622,0.7613,27.4768,19.3362,469
-0.5618,-9.8391,1.038,1.2917,-9.8391,2.8056,11.8027,7.0995,471
-0.1271,-9.8981,0.028,0.0772,-9.8981,0.64,5.9042,3.6274,472
-0.4809,-9.9833,1.5635,2.8275,-9.9833,4.7791,11.1002,8.4342,473
-0.1689,-9.9208,0.3215,0.3515,-9.9208,1.5152,7.9697,3.8028,474
-1.8119,-9.7623,-0.0219,1.2929,-9.7623,2.4683,10.0954,6.4416,475
-0.5991,-9.9083,1.2512,2.032,-9.9083,2.9071,8.7329,6.1019,477
-1.5036,-9.8776,0.3446,1.0702,-9.8776,3.3702,9.8409,6.6418,478
-0.6573,-9.9679,1.2577,1.8323,-9.9679,4.5969,16.9274,10.3384,479
-6.1389,-9.7249,6.1804,8.6444,-9.7249,1.8194,19.5685,16.066,480
-0.8306,-10.0116,0.0446,0.4207,-10.0116,1.2952,12.363,6.0696,481
-0.9525,-9.8256,0.5663,1.1577,-9.8256,2.5602,11.5177,5.8238,483
-1.4417,-9.7272,-0.2322,0.8508,-9.7272,2.9129,11.4893,9.6996,484
-0.4807,-9.8139,0.3643,0.6703,-9.8139,1.4258,15.0503,10.8159,485
0.4189,-10.3578,8.406,6.8785,-10.3578,5.7044,21.669,14.1262,487
-1.952,-9.8745,0.4269,1.1688,-9.8745,2.9793,10.4492,6.1092,488
-2.5665,-9.9926,1.1541,3.5669,-9.9926,1.3907,34.9536,6.6611,489
-9.9826,-9.7523,-0.09,2.9548,-9.7523,4.2679,39.0435,12.0664,490
-6.7761,-9.9414,5.0441,9.4208,-9.9414,4.5782,23.3439,14.806,492
-2.0792,-9.8703,0.356,1.3889,-9.8703,3.4408,19.5627,9.2008,493
1.3549,-9.9001,4.0252,1.8916,-9.9001,0.7257,19.5383,13.5659,494
-0.2005,-9.7886,1.9031,1.4418,-9.7886,1.7802,10.6153,8.0064,495
-0.9458,-9.8603,-0.0072,0.323,-9.8603,1.287,10.1975,5.0059,497
-1.4652,-9.8974,0.4921,0.8682,-9.8974,1.7099,11.0959,5.7618,498
-0.5987,-9.7888,-0.1267,0.2723,-9.7888,1.3961,6.3907,2.9931,499
-1.8804,-9.9067,1.6035,2.3491,-9.9067,3.9874,10.5683,8.4438,500
-0.6442,-9.9055,0.5103,0.7891,-9.9055,1.1375,7.4135,4.7834,502
-4.6062,-9.8979,0.1953,1.6393,-9.8979,2.3875,23.9834,6.3288,503
0.4126,-9.7799,0.9703,0.3421,-9.7799,0.9448,9.96,8.3167,504
-0.5924,-9.8112,1.3797,1.3742,-9.8112,0.7232,9.6841,5.7754,505
-0.4702,-9.9437,0.0828,0.3043,-9.9437,0.79,13.581,7.1479,507
-2.4529,-9.8262,0.3717,1.0396,-9.8262,2.8797,18.3743,5.7595,508
-0.3102,-9.7376,0.0091,0.1495,-9.7376,0.8613,5.5126,3.6128,509
-2.1557,-9.9736,0.5297,1.1848,-9.9736,2.1364,8.8317,6.337,510
-0.5603,-9.9049,0.0958,0.5129,-9.9049,3.0149,11.3892,5.753,512
-1.7646,-9.8464,0.3705,0.948,-9.8464,2.488,11.5198,6.0362,513
0.7555,-9.9,2.9755,1.831,-9.9,0.7852,13.8744,11.9423,514
-3.4419,-9.8646,2.0373,4.1844,-9.8646,4.2468,29.7409,12.6402,515
-1.4227,-9.8462,0.7604,1.9236,-9.8462,1.4749,11.0697,8.4656,517
-1.9316,-9.8635,0.8029,1.1956,-9.8635,3.3181,16.1369,7.7644,518
-2.1525,-9.9458,0.1776,1.3086,-9.9458,1.0831,6.607,4.216,519
-1.0067,-9.8821,0.415,0.7434,-9.8821,2.5428,8.4375,5.3164,520
-0.1295,-9.8776,2.4784,2.1636,-9.8776,6.8116,16.1431,10.3619,522
-2.5092,-9.8704,1.1302,1.7551,-9.8704,3.2126,11.3432,5.4689,523
0.8026,-9.8874,3.5231,2.1543,-9.8874,1.3077,8.6581,7.7923,524
-0.4232,-9.8503,0.3736,0.6296,-9.8503,2.3055,6.3821,5.0176,526
-0.0699,-9.9116,0.5711,0.5273,-9.9116,2.8243,7.653,5.1573,527
-0.344,-9.8415,0.0674,0.1628,-9.8415,0.7034,5.0472,2.0292,528
-2.5107,-9.8933,0.1682,1.0985,-9.8933,2.2319,9.8472,3.9897,529
-0.9523,-9.8599,2.2811,3.3396,-9.8599,4.1318,12.3528,9.9761,530
-0.7957,-9.9492,3.4089,3.0694,-9.9492,1.4365,15.0976,11.45,531
-0.1762,-9.8883,0.0314,0.1115,-9.8883,0.6354,2.5645,1.3351,532
-0.3751,-9.9092,1.2827,1.6008,-9.9092,2.1318,9.5981,5.9948,533
-0.4797,-9.7846,0.0009,0.234,-9.7846,1.1411,5.9439,5.2609,534
-0.0424,-9.8218,1.2579,1.5242,-9.8218,1.4222,6.4512,4.0448,535
-1.3322,-9.7206,1.0767,2.3703,-9.7206,1.8578,8.003,4.9572,536
-20.3663,-9.8276,4.7566,10.8411,-9.8276,5.0571,26.4368,19.832,537
-6.3969,-9.8518,6.4371,9.4111,-9.8518,8.1631,38.3994,11.531,538
-4.6311,-9.8976,3.2051,5.83,-9.8976,6.2539,22.243,12.0486,539
-1.8597,-9.9506,1.5667,1.7268,-9.9506,2.0191,16.2793,8.1388,540
0.0689,-9.8104,1.0186,1.132,-9.8104,2.2908,5.1162,3.1912,541
-1.78,-9.8864,0.5611,1.0701,-9.8864,2.2422,12.6168,5.3164,543
-0.5942,-9.9298,1.2423,1.4641,-9.9298,3.4315,13.6141,6.489,544
-6.6267,-9.9161,6.5497,9.2902,-9.9161,5.7827,33.1231,21.1317,545
-0.0539,-9.8793,5.505,3.6291,-9.8793,7.2332,16.953,12.934,547
-4.0815,-9.9258,1.6074,2.9352,-9.9258,4.0526,33.7714,14.4764,548
-0.4566,-9.8572,1.7995,1.5271,-9.8572,1.5729,20.5561,13.8887,549
-42.45,-9.8466,-4.0557,15.9229,-9.8466,11.9751,46.1745,20.9282,550
0.049,-9.6629,5.1027,3.423,-9.6629,3.2405,37.2351,28.6553,552
-50.8942,-9.795,-4.5287,19.0781,-9.795,9.4713,31.5854,12.7097,553
-3.0074,-9.6544,6.9505,11.1965,-9.6544,6.4126,37.9771,10.3163,554
-14.8751,-9.7961,-2.5641,4.3995,-9.7961,6.4519,15.9595,6.087,555
-29.7491,-9.8512,-0.4465,14.9673,-9.8512,10.8901,21.891,17.0468,557
-17.9887,-9.8603,-1.3372,7.5418,-9.8603,7.8004,32.9032,17.8777,558
-31.8833,-9.8318,4.9007,14.2815,-9.8318,9.159,52.7909,18.2857,559
-9.2342,-9.8554,-2.3111,6.5708,-9.8554,6.6296,18.4916,11.0686,560
-13.928,-9.8074,1.0539,8.1771,-9.8074,7.5379,26.0956,10.7221,562
-1.806,-9.8773,2.1406,3.0045,-9.8773,5.6734,32.0932,22.2016,563
-3.9825,-9.839,3.303,5.2477,-9.839,4.487,28.3838,21.4157,564
-3.6484,-9.9646,0.4814,3.1762,-9.9646,3.5327,21.9199,16.2507,565
-0.5026,-9.633,2.1287,2.7568,-9.633,1.2709,13.6285,8.6369,567
-8.8191,-9.8076,3.3587,7.3999,-9.8076,6.4518,26.2092,9.9181,568
-6.1374,-9.6759,2.2658,3.418,-9.6759,5.8867,18.9353,11.713,569
-1.4637,-9.8304,1.3299,1.872,-9.8304,3.5412,18.0178,7.8294,570
-3.0257,-9.8364,6.4698,6.4098,-9.8364,7.198,21.9414,10.9892,572
-23.9047,-8.9933,3.2287,9.3389,-8.9933,8.9632,36.0023,12.0879,573
-5.8917,-9.9353,4.8308,5.6946,-9.9353,5.9288,32.0648,21.8941,574
-5.3545,-9.8599,0.4331,2.7792,-9.8599,4.2633,24.0647,10.4581,575
-7.6585,-10.0567,3.2022,9.44,-10.0567,6.8363,21.7188,13.2751,577
-12.0732,-9.8391,10.0469,16.3257,-9.8391,9.8867,39.0553,12.8553,578
-11.0234,-10.4043,-4.2609,3.5716,-10.4043,4.9153,25.7407,10.595,579
-6.9653,-9.8796,4.2766,7.4878,-9.8796,8.5275,34.313,20.5883,580
0.6261,-9.9899,9.9259,8.9486,-9.9899,7.5918,25.9012,18.0027,582
-5.817,-9.8429,3.673,5.288,-9.8429,7.0777,20.7805,13.6169,583
-1.0984,-10.0993,4.9712,5.198,-10.0993,3.7736,21.8454,14.4456,584
-41.0312,-9.6982,5.1953,16.7055,-9.6982,5.9321,28.7157,15.0966,586
-29.6207,-9.8016,-14.7612,13.1567,-9.8016,7.3091,20.8299,8.5466,587
-3.7317,-9.8197,-0.0561,2.3269,-9.8197,2.4321,3.8877,2.2734,588
-1.5858,-9.8523,0.5224,1.3074,-9.8523,2.6179,5.4359,2.0525,589
-19.0512,-9.8165,-2.5142,7.1346,-9.8165,6.5839,13.3574,5.633,590
0.5348,-9.8321,1.0334,0.8315,-9.8321,2.1097,8.1653,4.4877,591
-5.2166,-9.8551,0.0447,1.8366,-9.8551,3.4517,6.8044,3.385,593
-12.8015,-9.8584,-1.4974,3.997,-9.8584,4.8975,10.9534,3.8323,594
-1.2755,-9.8317,-0.0929,1.269,-9.8317,1.9572,3.6184,2.3218,595
-21.8917,-9.8382,-4.444,7.0178,-9.8382,3.8099,11.3138,6.3786,596
-2.875,-9.8261,-2.2069,0.4363,-9.8261,0.9045,5.2445,3.3839,597
-1.022,-9.8273,1.5267,2.0069,-9.8273,2.5186,9.5407,2.3808,598
-192.7062,-9.2988,-73.9003,93.8532,-9.2988,13.9352,49.9861,31.0739,599
-2.6718,-9.2089,26.9914,15.8176,-9.2089,5.2183,68.682,61.4814,600
-31.278,-9.4029,1.9503,16.2285,-9.4029,5.1472,72.4596,63.9997,601
-39.956,-9.8243,-16.0253,18.1463,-9.8243,7.3802,41.6344,39.6729,602
-42.0065,-9.5573,-30.0473,9.2243,-9.5573,2.293,50.0388,48.092,603
-21.2483,-9.6439,16.6784,28.9258,-9.6439,9.2255,32.754,20.5612,604
-6.787,-9.8997,3.4499,6.0216,-9.8997,10.8684,36.261,20.3553,606
-0.8918,-10.0524,1.2861,3.2347,-10.0524,4.8415,16.5709,12.5189,607
-2.0319,-10.1164,-0.4907,0.6746,-10.1164,1.2601,14.1305,3.3664,608
-1.5854,-9.7853,-0.0568,0.977,-9.7853,1.1976,9.4115,6.872,609
-20.2091,-9.8257,-2.9892,9.2571,-9.8257,3.5093,15.3435,8.4361,610
-25.6051,-9.8823,-6.6512,9.2889,-9.8823,4.3834,13.7411,9.3043,612
-24.3448,-9.7246,9.0354,18.65,-9.7246,10.8788,29.6219,10.6265,613
-16.3707,-10.1762,-0.8583,9.1385,-10.1762,9.8626,28.5295,9.8536,614
-262.1774,-8.99,27.3048,196.05,-8.99,41.1383,83.0269,34.1193,615
-299.9199,-9.5563,-117.7246,113.3851,-9.5563,24.0324,69.5033,22.4573,617
-22.2663,-9.6346,11.0105,25.7395,-9.6346,10.3623,30.1164,10.8339,618
-3.0181,-9.9475,2.2807,4.6966,-9.9475,4.7726,20.858,12.989,619
0.0468,-9.7207,4.3917,4.1658,-9.7207,3.5263,17.4703,9.3028,620
-1.8271,-9.8924,1.0895,1.4863,-9.8924,1.9482,14.1182,6.5858,621
-8.8471,-9.9213,0.2647,5.8911,-9.9213,4.2828,17.2896,13.0491,622
-9.8622,-9.8349,1.0153,4.7839,-9.8349,6.5556,25.9053,10.1351,623
-3.7054,-9.9353,4.8929,7.3698,-9.9353,8.2034,27.2438,12.737,624
-4.9416,-9.9377,0.8263,2.9952,-9.9377,5.0814,18.1256,9.1744,625
-5.5273,-10.1603,2.0796,4.3974,-10.1603,5.8176,21.7639,12.8405,626
-5.432,-9.8747,1.0208,4.1673,-9.8747,4.4335,20.9494,9.2089,628
-0.8916,-10.0482,0.1883,0.8689,-10.0482,2.0459,26.9271,23.6941,629
-5.2347,-9.3273,-0.1916,3.4546,-9.3273,4.9822,14.6398,8.2274,630
-2.4503,-9.9935,-0.3959,0.9851,-9.9935,2.2976,8.2903,4.7695,632
-2.927,-10.0157,0.9291,2.3256,-10.0157,4.1074,17.966,10.0374,633
-2.8231,-10.2303,-0.4076,1.1286,-10.2303,1.7834,16.351,14.5227,634
-1.4105,-9.897,-0.0531,0.7103,-9.897,1.2805,11.9145,4.1794,635
-1.5294,-9.7951,0.3195,1.5382,-9.7951,2.6346,18.8841,11.1344,637
-3.3131,-10.0258,2.1908,3.3973,-10.0258,4.2705,23.8587,14.3609,638
-3.7126,-9.9835,1.9076,3.4425,-9.9835,1.7875,36.9337,32.6721,639
-12.1861,-8.3518,-1.0666,6.2145,-8.3518,3.2046,52.6934,24.8959,640
-4.1879,-8.4727,6.1723,11.5389,-8.4727,3.7329,13.0983,8.0621,642
-2.541,-9.8277,0.2335,1.9281,-9.8277,4.4555,29.3176,24.3884,643
-2.6499,-9.8609,0.651,1.8835,-9.8609,4.6818,12.4737,9.8318,644
-1.187,-9.7504,2.4632,3.0491,-9.7504,2.4737,9.7163,8.5634,645
0.5942,-10.0252,3.0798,1.9051,-10.0252,2.0596,14.5288,9.9192,646
-0.6706,-9.9436,2.2294,4.1805,-9.9436,5.7228,16.6806,12.7615,647
-1.3788,-9.8771,0.3839,1.2739,-9.8771,3.6734,13.538,6.4003,649
-0.7898,-9.8954,-0.3109,0.2658,-9.8954,1.1925,7.7908,4.1887,650
-0.176,-9.7077,0.1813,0.3239,-9.7077,0.5158,4.3004,3.0363,651
-3.3333,-9.7813,-0.2962,1.6951,-9.7813,1.4446,9.1858,4.8795,652
-0.2031,-9.8421,0.0162,0.1316,-9.8421,1.4626,7.0311,3.3762,653
-0.2014,-9.8801,0.8199,0.56,-9.8801,0.8323,6.1531,4.4608,654
-0.3542,-9.9302,-0.0719,0.1373,-9.9302,0.293,4.6651,3.2184,655
0.2696,-9.9476,1.9815,1.0197,-9.9476,0.8392,8.2538,5.5702,656
-0.846,-9.8583,0.1981,0.809,-9.8583,2.444,10.3804,6.6857,658
-1.5303,-9.8783,0.5266,0.9432,-9.8783,1.1512,10.4896,6.5491,659
-14.3341,-9.868,-1.6704,4.0523,-9.868,2.7854,8.5922,4.3054,660
-7.075,-9.8456,-3.9298,1.9057,-9.8456,1.8278,7.9431,4.1002,662
-5.6644,-9.8396,-0.7778,2.8173,-9.8396,2.9663,5.0703,3.1654,663
-0.334,-9.837,0.2469,0.2835,-9.837,0.2878,1.2808,1.0589,664
-1.1525,-9.8451,-0.4935,0.4374,-9.8451,0.4826,1.6823,0.974,665
-2.2575,-9.8481,-1.7532,0.3399,-9.8481,0.2334,2.6876,2.4462,667
-4.0487,-9.8472,-1.7518,0.9816,-9.8472,0.965,3.9882,1.8708,668
-5.9737,-9.8238,-4.7877,0.7903,-9.8238,0.3269,4.5988,4.3658,669
0.0878,-9.8369,2.2513,0.8728,-9.8369,0.8865,4.0396,3.2968,670
-6.226,-9.8595,-1.1457,2.6308,-9.8595,3.5883,6.5998,3.2955,672
-3.2032,-9.8675,-0.6467,1.2271,-9.8675,2.1555,5.3937,2.0079,673
-3.1214,-9.8372,-2.7204,0.1892,-9.8372,0.2598,3.8702,3.2187,674
-0.7925,-9.8248,0.0277,0.5939,-9.8248,0.5906,1.3318,0.99,675
-0.0521,-9.8513,0.708,0.3312,-9.8513,0.4372,1.5419,1.2954,677
-2.1135,-9.8631,-0.4433,0.8684,-9.8631,1.3924,3.0589,1.4672,678
-0.2838,-9.8716,-0.1876,0.044,-9.8716,0.1951,1.1072,0.8448,679
-1.5155,-9.8818,-0.1649,0.508,-9.8818,2.4314,6.367,1.4527,680
-1.5894,-9.8657,-0.9228,0.3592,-9.8657,0.4722,2.3755,1.6061,681
-0.0889,-9.8639,0.0473,0.0995,-9.8639,0.2138,0.9318,0.7955,682
-0.0199,-9.8755,0.1262,0.1137,-9.8755,0.4061,1.1545,0.8535,683
-3.7291,-9.8637,-1.298,1.4339,-9.8637,2.0213,5.9705,1.2693,685
-2.0178,-9.8643,-0.9854,0.5113,-9.8643,0.9141,3.4048,1.6291,686
-0.5023,-9.8612,-0.0682,0.2786,-9.8612,0.4182,1.0437,0.8152,687
-2.1055,-9.861,-1.1628,0.6043,-9.861,1.035,4.2811,3.2424,688
-8.623,-9.8696,-0.0614,2.8201,-9.8696,4.4193,14.7244,7.7828,689
-4.6,-9.9056,0.3103,2.2994,-9.9056,1.6319,19.7815,16.4789,690
-1.8301,-9.8939,-0.0629,1.1912,-9.8939,2.183,6.2978,4.1813,692
-3.927,-9.867,0.7589,2.061,-9.867,4.5993,25.3635,12.4639,693
-5.3947,-9.8987,4.1928,6.0733,-9.8987,2.469,18.3197,10.8916,694
-1.7612,-9.8469,1.3904,2.2039,-9.8469,2.128,29.1771,12.5425,695
-3.4527,-9.8541,-0.0643,2.04,-9.8541,4.1722,17.8778,14.1472,697
-5.8463,-10.0141,0.6278,2.6132,-10.0141,4.3495,35.9431,17.7993,698
-0.2184,-9.9079,0.8097,1.2815,-9.9079,2.8217,11.1193,3.9708,699
-0.4611,-9.8079,0.1121,0.3732,-9.8079,2.2471,8.3199,4.1741,700
-4.7779,-9.8659,-1.0621,1.8622,-9.8659,2.0137,18.9494,10.7114,702
-1.2124,-9.6303,1.4907,2.4393,-9.6303,3.1608,25.6328,17.4168,703
-3.5174,-10.0318,-0.2591,1.448,-10.0318,3.7088,43.9953,19.2803,704
-9.0518,-9.8452,0.9597,4.6364,-9.8452,2.3879,46.6582,31.3303,705
4.3449,-9.7107,9.6992,3.9423,-9.7107,2.6822,32.6294,20.7642,706
-14.1972,-9.864,3.9305,9.8409,-9.864,6.6378,24.1697,18.2784,707
-1.6343,-9.705,1.9115,3.0746,-9.705,4.3262,35.6441,15.3173,708
-1.397,-9.8622,1.1591,1.7798,-9.8622,3.8065,20.1612,8.1231,709
-1.2331,-9.9022,0.6548,1.2588,-9.9022,4.002,13.1406,8.8381,710
-2.3207,-9.8259,2.2149,3.3198,-9.8259,1.1254,15.7027,13.574,711
-1.4759,-9.9102,2.0662,3.1253,-9.9102,5.2739,19.9157,8.8957,713
-2.5465,-9.8908,1.439,3.5349,-9.8908,3.14,21.9325,19.1122,714
-0.0057,-9.9076,2.325,2.602,-9.9076,4.2353,11.1409,7.1343,715
-0.0424,-9.9034,6.0307,4.2206,-9.9034,4.2429,21.8627,20.2147,716
-0.807,-10.1076,0.2442,0.8086,-10.1076,1.7235,21.8845,20.4109,717
-12.7728,-9.5378,0.5488,2.8816,-9.5378,2.3917,22.2747,4.8358,718
-12.8646,-9.8208,-0.9211,3.8809,-9.8208,2.1278,30.6026,8.3269,719
-4.4982,-9.8656,0.9077,2.4006,-9.8656,6.6774,26.5648,9.3266,720
-1.92,-9.8491,1.5413,1.987,-9.8491,1.5433,9.4747,6.3062,722
-10.0359,-9.9089,9.9717,15.5834,-9.9089,16.4296,48.7926,21.4956,723
-0.0184,-9.8276,4.444,5.0266,-9.8276,1.8214,19.4092,16.621,724
-10.9698,-9.8653,1.8169,5.8044,-9.8653,4.7863,14.6379,11.7098,725
-0.4406,-9.8975,0.1501,0.3251,-9.8975,1.4108,14.3655,12.9109,727
-3.7184,-9.9213,1.3952,2.8158,-9.9213,8.96,35.0791,14.8123,728
-0.7856,-9.6792,0.5368,1.0396,-9.6792,1.4333,12.2831,9.3438,729
-3.6371,-9.926,1.2781,3.9745,-9.926,1.6808,22.5177,7.2872,730
-1.6763,-9.8129,-0.6101,0.8209,-9.8129,3.613,21.2232,12.739,732
-9.7092,-9.8928,1.6674,6.1319,-9.8928,9.9659,26.7834,9.8162,733
-1.0179,-9.855,1.8563,2.6166,-9.855,5.6649,20.6984,17.3588,734
-8.9438,-9.8438,-0.6778,4.2033,-9.8438,6.2783,16.8202,9.7172,735
-6.0021,-9.9316,0.6123,3.3629,-9.9316,4.2837,13.7869,7.4346,737
-1.3925,-9.9119,0.4842,1.0096,-9.9119,4.3715,9.9394,5.9479,738
-0.1482,-9.9332,0.1059,0.2167,-9.9332,0.8186,2.9064,1.7809,739
-5.9893,-10.0782,-0.4317,2.4652,-10.0782,3.3194,19.736,8.5634,740
-1.257,-9.8746,0.4327,0.9239,-9.8746,1.6544,11.3703,7.6327,742
-5.2767,-9.8215,0.3114,2.0461,-9.8215,5.1668,23.5536,3.2844,743
-0.6862,-10.0143,-0.2128,0.3915,-10.0143,2.25,5.9691,3.3615,744
-2.4628,-9.9758,3.0669,5.7017,-9.9758,5.5231,32.0094,16.7565,745
-3.8205,-9.9915,1.7301,4.1713,-9.9915,4.0277,37.4008,23.0142,747
-8.6587,-9.8558,1.0013,3.8185,-9.8558,5.0707,62.3135,37.9937,748
-13.4745,-10.3524,-3.4953,6.1658,-10.3524,4.5176,55.6095,43.347,749
-9.0153,-9.885,2.1924,5.091,-9.885,6.4647,31.9586,19.5979,750
-6.0568,-9.8744,1.6938,3.9742,-9.8744,4.0855,20.1294,10.6339,752
-3.7281,-9.9044,1.6561,3.5375,-9.9044,6.4929,20.9721,10.7246,753
-2.3752,-9.6273,1.6831,3.3046,-9.6273,4.3594,14.3433,7.1289,754
-2.5185,-9.8197,1.7424,3.1177,-9.8197,2.8174,13.4732,11.0038,755
-1.5362,-9.739,0.5812,1.0694,-9.739,3.0225,9.6948,6.4706,757
-19.7429,-9.9918,1.6117,9.5501,-9.9918,6.78,41.9863,18.0232,758
-1.4486,-9.9461,-0.1294,0.8382,-9.9461,1.2365,23.2768,20.3192,760
-2.5146,-10.6997,1.3859,2.5866,-10.6997,4.7933,35.4716,25.3521,761
-5.4057,-9.7063,-0.2577,2.652,-9.7063,5.2493,21.8573,17.3678,762
-8.0517,-9.8433,-0.5232,2.3622,-9.8433,2.8402,28.1806,20.802,763
-2.9853,-9.968,0.541,2.9196,-9.968,6.2531,30.5778,23.2505,764
-0.5527,-10.3053,0.3065,0.6627,-10.3053,1.7543,39.9165,34.3988,765
-4.3277,-10.1489,-0.1035,3.3779,-10.1489,1.0858,27.0704,22.5765,766
-2.7841,-9.8229,1.3365,2.9262,-9.8229,2.3109,12.0804,11.3445,767
-0.043,-9.8368,8.0506,6.7649,-9.8368,13.1203,25.647,16.8732,768
-0.2243,-9.9005,1.4642,1.9242,-9.9005,4.4671,17.5274,7.3433,769
-0.1825,-9.8322,0.5401,0.4521,-9.8322,2.1656,5.5597,3.2313,770
-0.3192,-9.7708,0.734,0.8828,-9.7708,2.593,6.5504,5.5334,772
-0.8787,-9.868,0.6346,0.8219,-9.868,3.2362,10.4784,6.6879,773
-1.1345,-9.9444,0.6126,1.1973,-9.9444,1.8524,10.6514,8.8899,774
-2.1437,-9.8707,1.8153,3.0523,-9.8707,4.9432,15.4959,10.4572,775
-0.0408,-9.8479,1.3918,1.3107,-9.8479,3.2192,12.9341,9.0006,777
-12.7051,-9.9125,-1.0482,3.6281,-9.9125,4.0864,13.254,4.363,778
-3.2758,-9.8401,0.3747,2.0842,-9.8401,2.2409,5.2327,1.9761,779
-6.1036,-9.8631,-0.758,3.4052,-9.8631,3.5875,10.451,7.2517,780
-13.544,-9.7693,-4.5173,9.868,-9.7693,5.0093,8.5837,5.2927,782
-126.4837,-9.7578,-5.9679,25.9297,-9.7578,11.7404,27.0811,7.7046,783
-16.1057,-9.7149,-4.5075,8.9273,-9.7149,4.8055,7.8437,3.8341,784
-5.9993,-9.7355,-2.0918,3.0278,-9.7355,1.7028,3.3791,1.9689,785
-3.1023,-9.7395,-1.9701,0.6165,-9.7395,0.3533,1.8268,1.5418,787
-2.6902,-9.7394,-2.0493,0.142,-9.7394,0.0754,1.7151,1.4281,788
-2.145,-9.7408,-2.0169,0.0751,-9.7408,0.0416,1.4863,1.4285,789
-2.0787,-9.7403,-2.0162,0.0381,-9.7403,0.0215,1.4484,1.4194,790
-2.1004,-9.7413,-2.0115,0.0603,-9.7413,0.0335,1.4588,1.4247,791
-2.1037,-9.7405,-2.0022,0.0711,-9.7405,0.0386,1.4606,1.4095,792
-2.1548,-9.7405,-2.0337,0.0903,-9.7405,0.0484,1.48,1.4369,794
-3.3363,-9.7394,-2.0018,0.5955,-9.7394,0.3204,2.0222,1.3696,795
-3.425,-9.7384,-1.8899,1.0258,-9.7384,0.5687,2.0595,1.335,796
-4.083,-9.7384,-2.4135,0.7809,-9.7384,0.4074,2.344,1.5696,797
-6.1454,-9.7261,-1.533,2.7305,-9.7261,1.3743,3.2052,1.0973,798
-4.7517,-9.742,-2.2942,1.9275,-9.742,1.0669,2.8397,1.5465,799
-5.3494,-9.7363,-2.0676,1.8587,-9.7363,0.9911,2.892,1.2919,800
-3.111,-9.7392,-2.0511,0.6677,-9.7392,0.3614,1.9114,1.4179,802
-2.6199,-9.7408,-2.0116,0.2917,-9.7408,0.1589,1.6846,1.4095,803
-2.2977,-9.7399,-2.0171,0.1969,-9.7399,0.1089,1.5423,1.426,804
-2.2061,-9.7405,-2.0121,0.1098,-9.7405,0.0594,1.512,1.4239,805
-2.1725,-9.74,-2.0452,0.0913,-9.74,0.0489,1.4965,1.4444,807
-2.1066,-9.7404,-2.0371,0.0375,-9.7404,0.0215,1.476,1.4314,808
-2.114,-9.7405,-2.0209,0.0593,-9.7405,0.0325,1.4707,1.417,809
-2.2392,-9.7405,-2.0457,0.093,-9.7405,0.0514,1.538,1.4322,810
-2.0518,-9.7402,-2.0044,0.0362,-9.7402,0.0197,1.435,1.4141,812
-2.1074,-9.7397,-2.0221,0.0477,-9.7397,0.0261,1.4606,1.4229,813
-2.0964,-9.7395,-2.0239,0.0539,-9.7395,0.0319,1.4535,1.4183,814
-2.0893,-9.7401,-2.0044,0.0592,-9.7401,0.0307,1.4399,1.409,816
-2.0901,-9.7406,-2.0099,0.0479,-9.7406,0.0261,1.4592,1.4146,817
-2.1263,-9.7401,-2.0162,0.0537,-9.7401,0.0305,1.4844,1.4194,818
-2.0779,-9.7416,-2.0191,0.0334,-9.7416,0.0174,1.4493,1.4257,819
-2.3457,-9.7401,-2.0501,0.1911,-9.7401,0.1022,1.5672,1.4172,820
-7.4574,-9.7414,-1.9826,3.0804,-9.7414,1.5833,3.3469,2.0761,822
-2.9417,-9.739,-2.0117,0.413,-9.739,0.2323,1.8963,1.3782,823
-8.078,-9.7413,-2.4016,2.9615,-9.7413,1.6159,4.136,1.7003,824
-7.5287,-9.7393,-2.6091,3.5068,-9.7393,1.8666,3.7719,1.7222,825
-4.6144,-9.7431,-2.2648,1.7504,-9.7431,0.9554,2.4901,1.6432,826
-3.4096,-9.7473,-2.3452,0.5832,-9.7473,0.2808,1.9635,1.5329,827
-4.9488,-9.7345,-2.96,1.7416,-9.7345,0.9454,2.9806,2.1812,828
-5.573,-9.7318,-1.7897,2.2837,-9.7318,1.203,3.309,1.349,829
-5.43,-9.7381,-2.3568,1.4578,-9.7381,0.7836,3.3151,1.763,830
-5.6079,-9.7377,-2.0001,1.1534,-9.7377,0.5682,2.8555,1.4056,831
-3.5258,-9.7344,-2.14,1.2319,-9.7344,0.7276,2.1721,1.6897,832
-3.0107,-9.7398,-2.0546,0.6866,-9.7398,0.3695,1.8489,1.4392,833
-2.4983,-9.741,-2.0139,0.3852,-9.741,0.2082,1.6461,1.4186,834
-2.3462,-9.7396,-2.0226,0.2222,-9.7396,0.1204,1.5575,1.4229,835
-2.3029,-9.7413,-2.051,0.1912,-9.7413,0.1025,1.5482,1.4541,837
-4.7451,-9.7744,0.2901,3.7395,-9.7744,2.8541,8.4216,2.35,838
-1.0578,-9.7644,8.6111,6.7375,-9.7644,1.351,13.2112,10.9008,839
-0.3329,-9.8749,0.1236,0.2817,-9.8749,0.883,2.3028,1.4178,840
0.472,-9.7096,1.199,0.4839,-9.7096,1.123,5.4895,3.3283,841
0.0822,-9.8895,1.8558,2.366,-9.8895,2.7941,7.9629,1.3576,843
-21.5625,-9.8382,-3.7958,5.4388,-9.8382,4.3429,15.5364,5.2993,844
-4.1665,-9.8361,-2.8689,0.9174,-9.8361,0.7059,3.4788,2.7382,845
-1.5307,-9.9211,-0.2766,0.679,-9.9211,2.3142,5.0907,3.2499,846
-5.5215,-9.8285,-1.7718,2.2939,-9.8285,2.8949,6.8221,5.364,847
-0.1137,-9.8274,6.1023,3.2166,-9.8274,4.5541,13.112,7.6017,848
-47.9933,-9.7528,-17.8375,17.6851,-9.7528,3.6651,20.7033,14.8923,849
-40.3696,-9.9018,-10.2495,20.5625,-9.9018,13.1002,55.0109,8.8773,850
1.8065,-9.2447,5.6205,3.3417,-9.2447,2.546,52.8631,45.9351,852
-109.1767,-9.4414,-14.0155,35.2749,-9.4414,13.7192,37.0822,21.8077,853
8.556,-9.5862,13.1585,2.5226,-9.5862,1.3237,27.6532,25.7053,854
0.1442,-9.7216,2.4723,1.7148,-9.7216,1.4801,23.4835,14.1712,855
-1.9857,-9.938,0.211,1.9877,-9.938,4.8014,10.5898,5.3631,856
-3.6306,-9.8325,1.621,3.1013,-9.8325,3.1734,11.0712,7.1686,857
-0.8227,-9.8512,0.4754,1.2845,-9.8512,3.924,15.6803,14.1397,858
-4.2213,-9.8411,-0.8063,1.8591,-9.8411,3.3274,16.6055,15.6073,860
-8.0038,-9.8368,-0.6727,3.2008,-9.8368,6.0653,27.4993,8.9376,861
-2.0016,-9.9123,1.0991,2.6622,-9.9123,2.7807,9.6333,4.9553,862
-0.8249,-9.8066,0.4333,0.9294,-9.8066,0.692,10.7004,8.2421,863
-0.5699,-9.8526,0.2731,0.9126,-9.8526,2.4982,6.9056,5.6518,864
-3.4542,-9.8441,-0.0671,1.8346,-9.8441,3.4776,6.9015,4.0858,865
-3.2004,-10.0073,-0.8268,1.7937,-10.0073,4.1113,7.3451,5.2198,867
-12.734,-9.8521,-1.6693,3.2499,-9.8521,4.1298,12.4345,5.4841,868
-6.1675,-9.8937,-3.8996,1.1777,-9.8937,1.1248,7.9555,7.353,869
-2.82,-9.8191,-0.8529,1.1439,-9.8191,4.2311,10.1296,2.5685,870
-1.4583,-9.9014,-0.0667,1.4765,-9.9014,4.4864,8.0191,3.7895,872
0.7888,-9.9184,1.9457,1.0939,-9.9184,1.7854,7.0649,6.2669,873
-6.176,-9.8657,-3.862,1.3705,-9.8657,0.7096,13.1955,11.7593,875
-3.3849,-9.9087,-1.7323,0.6751,-9.9087,0.4915,7.8617,5.3244,876
-7.296,-9.845,-2.6297,3.0175,-9.845,3.8991,9.9497,5.2777,877
-7.3337,-9.9021,-3.6113,2.0339,-9.9021,1.545,10.035,8.5944,878
-2.2921,-9.8458,2.3241,4.5921,-9.8458,4.8589,14.1198,4.0364,879
-0.8629,-9.904,-0.077,0.7368,-9.904,1.1277,4.3531,3.6453,880
-0.5828,-9.8955,2.1437,1.7417,-9.8955,2.8666,12.6752,9.4129,881
-3.8039,-9.8049,-2.1097,0.8758,-9.8049,0.6338,3.3902,2.4856,882
-16.5951,-9.7464,-10.5619,4.8733,-9.7464,2.3421,11.5403,8.9145,883
-0.044,-9.6654,3.9213,2.2782,-9.6654,1.2476,3.396,2.2784,884
-2.492,-9.8177,1.0645,2.1863,-9.8177,2.2943,3.5879,3.0558,885
-5.5082,-9.816,-1.5577,2.0249,-9.816,1.6186,4.1743,1.6369,886
-5.4723,-9.8137,-2.1698,1.9368,-9.8137,1.64,4.6099,2.2471,887
-2.2023,-9.8116,-0.3073,0.8426,-9.8116,0.6731,1.789,0.9255,888
-1.3388,-9.8277,-0.3754,0.4504,-9.8277,0.3924,1.403,0.6647,889
-22.4388,-9.7567,-13.0712,8.1844,-9.7567,3.6491,13.3088,11.6494,890
-95.4237,-9.5667,16.755,45.3469,-9.5667,12.1801,31.7857,17.0145,892
-4.9495,-9.6999,1.8889,6.6591,-9.6999,4.6349,22.2241,4.626,893
-3.7874,-9.9643,0.1261,2.4484,-9.9643,3.4552,11.2129,10.0207,894
-14.1592,-9.8191,-2.7847,4.425,-9.8191,2.772,9.5835,2.969,895
-19.0037,-9.7336,1.4599,12.5565,-9.7336,6.4169,19.0864,12.5517,897
-12.7377,-9.8686,-1.2057,3.7871,-9.8686,5.9576,12.6894,7.7442,898
-6.2825,-9.8287,0.5897,4.7434,-9.8287,2.0738,11.4607,8.0359,899
-24.8863,-9.8039,0.1965,11.2092,-9.8039,7.5157,18.3932,6.1464,900
-26.3553,-9.7948,-3.7561,9.2292,-9.7948,3.5577,12.8472,1.1866,901
0.1473,-10.075,3.2547,2.0257,-10.075,2.2824,15.1255,5.7165,902
1.5292,-9.997,3.3,1.4025,-9.997,0.9823,5.0824,3.8995,904
-37.3399,-9.8526,-1.0172,7.3825,-9.8526,5.6005,27.2726,10.7593,906
-3.0621,-9.8861,2.4982,2.8159,-9.8861,4.4995,31.0714,30.1992,907
2.5664,-10.1807,4.5738,1.4858,-10.1807,1.1305,18.213,10.7616,908
-2.9317,-9.904,1.6968,4.208,-9.904,6.0854,22.5857,16.6204,909
-13.7718,-9.8678,-3.0301,4.8364,-9.8678,2.287,12.3424,8.1371,910
-13.8993,-9.8333,-3.0237,4.6442,-9.8333,5.4144,13.0137,4.7309,912
-24.6461,-9.6933,-8.2351,8.6958,-9.6933,4.1284,12.4364,3.1072,913
1.7712,-9.6373,5.657,4.5768,-9.6373,1.7804,6.4247,2.2966,914
-10.597,-9.7502,-2.9287,2.947,-9.7502,1.842,6.0637,1.8304,915
-12.8668,-9.6705,-4.671,6.0261,-9.6705,2.9375,6.5237,1.7388,917
-24.0189,-9.7718,-0.4951,7.0453,-9.7718,5.5994,14.8696,5.1356,918
-14.5954,-9.7692,-9.3632,4.3075,-9.7692,2.5791,11.6007,9.3957,919
-2.7277,-9.8898,2.9848,6.7346,-9.8898,4.835,33.1444,28.0457,920
-2.6506,-9.8623,1.6104,2.6037,-9.8623,4.2606,10.5536,8.0953,922
-21.0307,-9.8657,0.2507,7.3382,-9.8657,8.5144,22.3289,12.6115,923
-27.7956,-9.7611,-9.0599,10.2241,-9.7611,5.7736,19.9053,13.4447,924
-179.1691,-9.2747,-20.7245,49.7916,-9.2747,17.5094,64.2674,21.1874,925
-59.402,-9.338,-4.1443,30.7338,-9.338,9.372,21.8328,8.985,927
-14.5808,-9.5515,-6.7483,4.5015,-9.5515,1.9293,9.1909,3.8937,928
-8.1629,-9.5061,-6.764,0.7352,-9.5061,0.2906,3.5489,2.8431,929
-3.7176,-9.4777,-3.3401,0.334,-9.4777,0.1307,1.7243,1.6193,931
-3.1525,-9.4619,-2.9427,0.1747,-9.4619,0.065,1.4912,1.4249,932
-3.523,-9.4866,0.2064,2.4725,-9.4866,1.0227,1.8638,1.2553,933
-14.426,-9.4869,-5.939,4.34,-9.4869,1.672,5.5878,2.0217,934
-2.5616,-9.4584,3.7985,5.6106,-9.4584,1.9756,4.5539,1.3177,935
-12.9673,-9.6506,-9.3888,3.3294,-9.6506,1.3166,7.1882,6.6032,936
-11.0229,-9.5646,-4.915,3.5681,-9.5646,1.6741,5.0401,2.2393,937
-24.8757,-9.4676,4.1633,23.1709,-9.4676,8.9363,14.5551,9.328,938
-22.0184,-9.585,-7.977,7.106,-9.585,3.1055,10.8707,6.7399,939
-7.7582,-9.7473,2.746,6.0892,-9.7473,3.8377,8.1189,5.8862,940
-85.74,-9.3275,-31.3721,42.179,-9.3275,9.8114,21.225,6.3408,941
-16.4332,-9.4221,4.5552,10.5045,-9.4221,3.5841,8.5769,5.7617,943
15.7666,-9.5707,21.4182,2.5268,-9.5707,0.7412,10.8179,9.855,944
-13.7081,-9.6685,11.1828,10.0542,-9.6685,4.9255,11.7969,6.8733,945
-8.9976,-9.8175,-1.2353,3.6707,-9.8175,3.3065,6.1663,3.5216,947
-2.6716,-9.841,-0.9237,1.3709,-9.841,1.7838,3.4555,1.9772,948
-4.9727,-9.8598,-3.2372,1.6061,-9.8598,0.9403,4.6515,3.7516,949
-2.5765,-9.8557,-1.022,1.0376,-9.8557,5.3849,11.7024,4.646,950
-2.1876,-9.8621,-0.1442,0.6893,-9.8621,2.2384,5.6141,1.2924,952
-0.4583,-9.8737,-0.0617,0.2102,-9.8737,1.5298,3.0941,1.6559,953
-2.8186,-9.8624,-1.1856,0.8293,-9.8624,0.5216,5.2175,4.4396,954
0.4158,-9.854,0.6856,0.1779,-9.854,0.2613,1.8841,1.4108,955
-9.2036,-9.8502,-4.2716,3.1438,-9.8502,1.9806,8.681,7.8566,956
-1.8781,-9.7166,1.9703,3.3482,-9.7166,1.832,3.5988,1.3336,957
-1.814,-9.7934,2.0678,3.3899,-9.7934,2.6544,5.1879,4.1661,959
-3.7362,-9.7573,2.3276,4.1949,-9.7573,3.0173,10.1079,1.7921,960
1.6677,-9.8102,2.4575,0.7951,-9.8102,1.3014,5.2169,2.1755,961
3.0854,-9.8284,3.9922,0.4732,-9.8284,0.2101,5.0105,4.7578,962
-4.9869,-9.8099,-3.5002,0.8573,-9.8099,0.5691,4.7625,3.5848,963
-3.9878,-9.7939,-1.1228,2.2474,-9.7939,1.6596,4.4884,3.5732,964
-37.2953,-9.6374,-18.6193,13.2814,-9.6374,4.6259,18.3203,11.3037,965
-13.7692,-9.3738,-11.4092,2.0774,-9.3738,0.6763,16.3582,14.9051,966
-5.1249,-9.3635,1.5386,6.432,-9.3635,2.1232,23.9764,23.4457,967
4.1625,-9.4236,23.068,16.0979,-9.4236,4.1743,42.2227,37.3345,968
-47.1417,-9.2436,-20.4398,10.4998,-9.2436,2.6712,57.8545,49.3805,970
-37.721,-9.0818,16.2494,58.5628,-9.0818,13.4941,68.2846,24.2713,971
-73.8994,-8.8173,0.1802,25.6956,-8.8173,9.8828,44.9522,13.0806,972
-8.5075,-9.6269,1.582,6.5348,-9.6269,4.2226,13.9171,7.3749,973
5.6935,-9.85,11.9465,5.5971,-9.85,1.5178,11.7363,8.3253,974
-13.4743,-9.7484,-2.8737,6.0442,-9.7484,4.9854,15.6234,9.3575,975
-1.8126,-9.7954,3.5222,3.1907,-9.7954,6.8102,13.5266,9.8775,977
-25.825,-9.8283,-0.595,12.1241,-9.8283,10.259,28.4689,11.7674,978
-3.256,-9.9267,1.6086,3.0077,-9.9267,3.8865,14.6429,4.9784,979
2.9344,-9.7999,4.646,1.6889,-9.7999,0.817,7.9733,6.7519,980
-11.3401,-9.6951,-5.0736,3.1333,-9.6951,1.7134,13.7733,9.6076,982
-97.5042,-9.1368,-1.1762,40.5163,-9.1368,11.7658,35.9336,13.0317,983
-1.9827,-9.588,24.4625,22.3073,-9.588,6.5993,18.8869,11.9389,984
3.2957,-9.7634,6.5742,2.285,-9.7634,2.4431,10.9579,5.0802,985
0.4931,-9.7956,3.6022,4.3297,-9.7956,3.2003,9.4755,5.5796,987
-15.0226,-9.8116,-2.7527,4.5358,-9.8116,4.1904,11.5785,4.1382,988
-0.0374,-9.8149,1.9788,1.6313,-9.8149,1.3287,4.0535,2.9625,989
-5.2253,-9.5376,2.4367,8.526,-9.5376,4.7455,13.1163,5.2084,991
-45.1244,-10.0728,-3.7914,17.1215,-10.0728,3.6389,21.0284,4.5825,992
-5.2072,-9.8584,-1.404,2.0856,-9.8584,2.4362,7.5473,3.7395,993
-57.4692,-9.7779,-2.1095,24.4611,-9.7779,7.6628,23.3471,13.8727,994
-30.1444,-9.5481,0.5653,18.4818,-9.5481,9.4389,38.3524,10.4954,995
-4.2828,-9.8173,22.8002,18.7781,-9.8173,10.3713,28.699,12.8038,996
1.8282,-9.8717,12.844,10.8529,-9.8717,6.3058,26.8908,13.8646,997
-4.8473,-9.7435,-1.9645,2.2225,-9.7435,1.4404,9.7564,6.7819,998
-7.5507,-9.8617,-0.5589,5.5313,-9.8617,5.9224,14.1173,6.9996,999
-1.8569,-9.8536,1.118,1.8205,-9.8536,2.3304,10.6195,6.9281,1000
-0.6695,-9.6947,0.6327,1.1477,-9.6947,1.5045,10.0072,6.2322,1001
-3.2515,-9.7807,2.974,3.9001,-9.7807,2.9704,10.4233,4.7294,1003
0.5433,-9.7127,2.3419,2.2819,-9.7127,2.1201,6.8724,5.1475,1004
-1.0276,-9.9124,0.4158,1.1902,-9.9124,2.2109,7.5825,5.3359,1005
-4.1985,-9.8704,2.1763,3.8991,-9.8704,5.9635,16.0176,9.1508,1006
-14.7372,-9.7654,0.8717,5.5644,-9.7654,4.3479,21.11,5.6635,1008
-8.2578,-9.8692,0.9138,6.6648,-9.8692,6.6723,20.8082,14.7479,1009
-1.5971,-9.8439,13.9172,7.7205,-9.8439,4.3486,14.6691,10.5169,1010
-9.3734,-9.7653,-2.7679,4.1788,-9.7653,3.8163,10.376,4.2251,1012
-122.5681,-8.6573,-3.4797,28.3853,-8.6573,10.362,65.0917,12.689,1013
-139.1436,-7.5294,-12.612,46.5809,-7.5294,12.6828,73.6325,30.3257,1014
-24.4501,-9.0773,8.4414,28.185,-9.0773,6.6568,18.2214,5.9619,1015
-99.4816,-9.5101,36.8733,54.2446,-9.5101,8.425,41.6773,20.4875,1017
-27.2438,-9.8478,1.2568,7.306,-9.8478,6.1398,41.5767,12.2253,1018
-15.7221,-9.8543,-5.0163,6.2251,-9.8543,3.3336,13.4612,9.4766,1019
-21.0637,-9.8695,-0.312,8.5715,-9.8695,4.1234,22.3115,14.8098,1020
-13.9765,-9.9501,-0.0556,5.251,-9.9501,5.7649,28.9758,21.4291,1022
-14.6799,-9.9073,1.1913,5.0109,-9.9073,7.9362,27.837,12.8506,1023
-2.4237,-9.9164,-1.0201,1.037,-9.9164,1.3068,12.4291,8.1537,1024
-3.9922,-9.8798,0.6164,2.4538,-9.8798,1.7811,7.1776,5.082,1025
-8.5575,-9.9367,-0.0857,5.2482,-9.9367,6.4164,20.1701,12.9566,1027
-8.5107,-9.8613,5.7545,10.8367,-9.8613,9.7815,35.2105,11.3854,1028
-5.2064,-9.9242,2.0804,5.481,-9.9242,3.5251,21.9938,7.6212,1029
-26.6818,-9.8472,0.5453,11.9014,-9.8472,8.2712,24.0918,14.1977,1030
-5.974,-9.9224,3.39,6.6812,-9.9224,11.632,22.912,16.5001,1032
-27.1137,-9.928,1.5873,12.4617,-9.928,9.1502,26.1322,14.9062,1033
-7.5715,-9.7464,-0.3895,4.4532,-9.7464,4.2259,16.5844,11.2146,1034
-6.7668,-9.8354,0.7095,3.2352,-9.8354,3.1581,14.7367,6.9936,1035
-1.4635,-9.9195,3.6842,5.979,-9.9195,2.8438,10.2038,7.1835,1037
-21.8489,-9.9196,2.905,8.0356,-9.9196,5.6078,22.7472,8.2873,1038
-5.5957,-9.8847,1.2721,5.113,-9.8847,5.9721,18.6618,10.9466,1039
-8.4222,-9.901,5.4487,11.6668,-9.901,4.9385,22.4589,12.6476,1040
-12.1514,-9.8403,5.4816,9.6201,-9.8403,10.1278,27.6334,13.803,1042
-2.7418,-9.8825,1.6147,2.8507,-9.8825,4.6933,13.5699,7.127,1043
-0.8787,-9.8857,0.7699,1.2381,-9.8857,0.6124,5.668,3.8868,1044
-13.11,-9.9284,-0.4916,6.9863,-9.9284,5.3342,24.3206,13.9085,1045
-2.972,-9.7869,4.4338,8.0971,-9.7869,6.6362,19.469,17.2019,1047
-2.149,-9.9294,4.0769,5.825,-9.9294,5.7738,19.0226,15.8635,1048
-5.5646,-9.9314,2.8692,5.5424,-9.9314,6.5664,23.7269,11.9657,1049
-2.6477,-10.0111,2.11,4.1637,-10.0111,6.0659,21.4419,17.911,1050
0.6494,-9.9624,4.6022,2.5975,-9.9624,5.9541,21.2019,15.1286,1051
-4.4722,-9.8308,2.9228,6.4013,-9.8308,5.2384,19.1047,13.8071,1052
-0.6505,-9.9829,3.9339,6.6138,-9.9829,8.347,35.9944,12.2746,1053
-7.3428,-9.8519,0.372,3.3707,-9.8519,3.7508,17.4138,5.6712,1054
-1.4203,-9.9724,0.6354,1.3556,-9.9724,3.4897,20.3184,10.6776,1055
-1.004,-9.9025,0.556,1.5247,-9.9025,2.3919,9.497,8.6117,1056
-6.7174,-9.8996,0.9428,3.4283,-9.8996,4.1236,25.5337,12.6894,1058
-7.1159,-9.8533,1.0058,3.1507,-9.8533,3.9414,42.1093,28.1061,1059
-14.4311,-9.8426,-0.2975,7.6946,-9.8426,7.039,21.8213,10.994,1060
-10.7656,-9.7875,0.035,4.1839,-9.7875,5.5336,31.3233,25.2042,1062
-16.8475,-9.8705,1.7287,9.7264,-9.8705,7.721,25.5133,12.2435,1063
-0.0384,-9.9256,11.1292,10.9655,-9.9256,4.7818,28.7164,11.901,1064
-8.5548,-9.7388,1.8273,7.6794,-9.7388,1.7675,23.7967,16.3713,1065
-13.8175,-9.7883,0.4678,5.7514,-9.7883,4.9267,21.7233,11.9843,1067
-11.3355,-9.886,2.0574,4.9007,-9.886,5.589,48.8093,17.1532,1068
-2.4435,-9.7723,0.1417,1.5528,-9.7723,3.7804,10.6689,7.4228,1069
-1.9628,-9.8874,0.9114,1.6926,-9.8874,1.4305,32.3105,24.8858,1070
-0.794,-9.9349,0.278,0.8996,-9.9349,1.6668,9.7974,5.7743,1072
-4.3547,-9.8538,0.03,1.4642,-9.8538,2.8024,22.8426,8.4223,1073
-1.5464,-9.9359,0.4503,1.1391,-9.9359,1.4483,4.4151,2.1723,1074
-0.5097,-9.8462,0.0627,0.3831,-9.8462,0.5885,1.2175,0.994,1075
0.8891,-9.8332,1.3804,0.5183,-9.8332,0.4591,2.5944,2.2021,1077
-11.3708,-9.7798,-0.41,4.4825,-9.7798,3.7026,7.0453,3.3944,1078
1.5845,-9.7935,4.6187,2.3429,-9.7935,1.364,5.8962,4.9572,1079
-1.3661,-9.8118,0.4836,0.8449,-9.8118,0.9253,2.3462,1.4011,1080
-1.5521,-9.8598,1.8115,2.1355,-9.8598,2.7405,7.9495,3.8434,1082
-32.7725,-9.8465,7.4547,21.7305,-9.8465,14.4185,66.4543,28.5043,1083
-14.9231,-9.9567,-1.2548,8.9152,-9.9567,1.4405,21.5876,15.3921,1084
-8.2806,-9.9109,-3.17,2.9957,-9.9109,5.221,14.3937,10.1539,1085
-3.3327,-10.0104,5.6306,8.087,-10.0104,4.9685,59.9477,39.8651,1087
-19.2878,-9.8583,-1.6307,9.292,-9.8583,9.3062,42.6075,21.1508,1088
-4.8136,-9.9756,1.0713,3.0464,-9.9756,3.1085,53.4366,36.6683,1089
-21.791,-10.1275,8.926,18.0175,-10.1275,9.8304,57.6601,37.7941,1090
-20.8595,-10.4648,11.6748,19.7091,-10.4648,20.4557,64.7762,35.4003,1092
-29.2688,-9.905,-1.362,13.3997,-9.905,11.2002,40.8516,19.9531,1093
-16.5494,-9.7935,-3.0271,7.923,-9.7935,4.7679,19.0326,14.8083,1094
-3.4151,-10.0466,2.314,3.919,-10.0466,8.8816,20.6406,12.6076,1095
-9.8221,-10.0156,3.9904,9.9496,-10.0156,3.6868,12.9572,9.4793,1097
-15.2732,-9.8542,0.1301,5.0911,-9.8542,6.0193,19.9282,8.7498,1098
-2.7924,-10.0068,5.3969,5.2522,-10.0068,2.0279,23.6448,18.7363,1099
-8.6563,-10.0228,0.163,6.8929,-10.0228,8.3753,28.9488,18.4971,1100
-11.229,-10.0356,4.5463,10.6518,-10.0356,4.9951,23.7198,18.8072,1102
-8.4951,-9.8892,1.9677,4.5647,-9.8892,5.6654,23.6965,10.1605,1103
-5.2196,-9.8642,7.7745,10.3895,-9.8642,15.1692,30.6845,25.7922,1104
-4.2237,-10.1181,-1.0217,2.9254,-10.1181,5.4187,34.4535,30.2402,1105
-3.7912,-9.8722,3.3117,3.6249,-9.8722,4.5141,16.8213,11.1718,1106
-19.4107,-9.8776,-0.5799,10.9015,-9.8776,9.0601,25.4191,15.8841,1107
-5.5002,-9.9101,-1.9695,1.7418,-9.9101,3.1581,13.7693,4.6177,1109
-14.4951,-9.9086,-1.6621,7.13,-9.9086,4.175,15.4754,10.761,1110
-2.5744,-10.0365,-0.8613,1.0619,-10.0365,1.5905,17.2386,12.2421,1111
-9.1595,-9.8383,1.6657,6.5382,-9.8383,4.8523,29.6583,20.9144,1112
-4.0949,-9.8462,4.1918,9.008,-9.8462,7.0005,21.2655,15.0564,1113
-7.0633,-9.8512,0.0902,3.2167,-9.8512,6.6252,14.5415,9.0647,1114
-8.445,-9.8592,-2.4675,2.9269,-9.8592,1.316,9.5992,7.5362,1115
-0.9452,-10.1192,3.1346,2.9413,-10.1192,4.5103,16.8401,11.3392,1116
-12.3471,-9.9285,5.6646,9.6884,-9.9285,12.6156,28.6403,23.6376,1118
-4.4853,-9.9057,6.777,8.4888,-9.9057,2.6906,36.5802,30.0306,1119
-3.304,-9.8374,3.0063,5.1674,-9.8374,4.156,21.3079,19.3262,1120
0.3717,-9.867,5.5598,4.0678,-9.867,2.9918,23.9891,12.0595,1122
-4.3264,-9.9783,0.8208,3.2438,-9.9783,8.5726,46.6729,25.3432,1123
-3.2325,-9.7235,10.177,7.8547,-9.7235,4.3147,42.809,16.1735,1124
-19.4785,-9.8079,-5.8821,10.7976,-9.8079,8.0714,15.519,9.8065,1125
-14.8263,-9.799,0.7338,10.6721,-9.799,3.8925,22.2771,14.3128,1127
-62.8061,-9.6314,2.9696,34.0505,-9.6314,16.5625,30.5945,20.3786,1128
-8.3705,-9.8328,-2.3126,4.2586,-9.8328,4.1797,6.3721,4.046,1129
-4.0355,-9.8479,-1.3871,1.5194,-9.8479,1.5511,3.7317,1.7643,1130
-2.421,-9.8481,-1.1281,0.9677,-9.8481,1.0217,2.5421,1.5807,1132
-1.6624,-9.8489,-0.9685,0.36,-9.8489,0.3833,1.9818,1.4034,1133
-1.2116,-9.8474,-0.9788,0.1852,-9.8474,0.1924,1.6016,1.4186,1134
-1.1311,-9.8489,-0.9823,0.0887,-9.8489,0.093,1.5489,1.4047,1135
-1.0304,-9.8484,-0.9774,0.0395,-9.8484,0.0418,1.4655,1.4146,1137
-1.0578,-9.8481,-0.985,0.0318,-9.8481,0.032,1.4708,1.4085,1138
-1.0287,-9.8477,-0.9878,0.0293,-9.8477,0.0318,1.4436,1.4128,1139
-1.0243,-9.8486,-0.9749,0.0284,-9.8486,0.03,1.4381,1.4034,1140
-0.9788,-9.8484,-0.9043,0.0672,-9.8484,0.0762,1.4029,1.3647,1142
-1.1034,-9.8487,-0.9927,0.0413,-9.8487,0.0468,1.5436,1.416,1143
-1.0324,-9.8486,-0.9636,0.0495,-9.8486,0.0515,1.4502,1.3963,1144
-1.0145,-9.8479,-0.9843,0.023,-9.8479,0.0239,1.4484,1.4218,1145
-1.0197,-9.8495,-0.9788,0.0299,-9.8495,0.0312,1.457,1.4136,1146
-1.008,-9.8484,-0.9717,0.0165,-9.8484,0.0184,1.4314,1.4034,1148
-1.0059,-9.8471,-0.9767,0.0167,-9.8471,0.018,1.4314,1.412,1149
-0.9902,-9.8489,-0.971,0.0182,-9.8489,0.0155,1.418,1.4015,1150
-0.9957,-9.8497,-0.9699,0.0196,-9.8497,0.0217,1.4371,1.4048,1151
-1.0095,-9.8477,-0.9854,0.0178,-9.8477,0.0199,1.4436,1.4137,1152
-1.0269,-9.8475,-0.9716,0.0322,-9.8475,0.0314,1.4503,1.3954,1153
-1.0531,-9.8476,-0.9787,0.0514,-9.8476,0.0545,1.4698,1.4125,1154
-1.0071,-9.8488,-0.9695,0.0258,-9.8488,0.0276,1.4436,1.3967,1155
-1.0086,-9.8476,-0.9659,0.0286,-9.8476,0.0295,1.4436,1.399,1157
-6.0274,-9.8469,-1.2896,1.354,-9.8469,1.3423,4.5203,1.4751,1158
-5.5919,-9.818,-1.434,2.5638,-9.818,1.7079,3.0871,2.0998,1159
-6.5534,-9.8506,-1.7657,3.2022,-9.8506,3.5481,5.4512,3.6737,1160
-2.2223,-9.8392,-1.0415,0.6762,-9.8392,0.4774,2.0834,1.7757,1162
-2.6961,-9.8463,-0.9977,1.1199,-9.8463,1.0537,2.7702,1.1616,1163
-1.6477,-9.8437,-1.0115,0.4786,-9.8437,0.4983,1.9269,1.4079,1164
-19.6855,-9.5123,3.3441,17.6893,-9.5123,8.4011,19.1388,5.5414,1165
-12.6999,-9.8497,-1.4422,5.0787,-9.8497,6.1038,19.1042,6.9458,1166
-10.8876,-9.8225,2.6886,6.779,-9.8225,5.479,9.3643,6.6058,1167
-51.1473,-9.8608,-15.0251,18.3827,-9.8608,1.2693,27.0924,23.9596,1168
-40.6133,-9.6155,-20.3507,16.6251,-9.6155,5.6361,37.6364,34.7273,1169
-20.3609,-9.5519,-14.6201,3.8623,-9.5519,0.8448,8.8518,7.8469,1170
7.5926,-9.4352,32.8335,15.8229,-9.4352,2.9326,38.9815,32.3196,1171
-3.9204,-9.8648,4.3232,6.0468,-9.8648,3.1191,44.1128,39.8029,1172
-11.2587,-9.7342,-1.9921,6.7157,-9.7342,1.4133,29.4943,26.0045,1173
-7.1961,-9.6637,-0.2565,3.5115,-9.6637,2.5066,65.5388,56.9318,1174
-12.9351,-9.863,1.8254,6.8538,-9.863,6.0775,46.5279,12.1869,1176
-28.4488,-9.8731,-0.3645,13.0888,-9.8731,1.988,28.0746,16.9617,1177
-0.8656,-9.7701,13.4606,9.6167,-9.7701,9.6004,29.6305,18.735,1178
-0.9571,-9.863,2.0122,2.5789,-9.863,5.0899,16.8066,12.7593,1179
-10.778,-9.871,-0.2772,4.221,-9.871,4.7689,11.958,8.6198,1180
-2.3444,-9.9019,-0.2088,0.9254,-9.9019,1.6556,10.5089,6.0431,1182
-19.408,-9.8285,1.6246,8.5304,-9.8285,5.4591,21.8857,6.9287,1183
-0.6833,-9.8378,-0.0233,0.3908,-9.8378,2.2189,6.4349,4.9623,1184
-2.3762,-9.831,-0.3093,0.973,-9.831,2.3194,6.915,5.4561,1185
-4.4074,-9.8996,0.9859,3.1867,-9.8996,8.1943,15.9117,9.5842,1187
-10.038,-9.866,1.0484,4.4829,-9.866,6.1388,16.0241,7.198,1188
-1.7895,-9.8078,1.1272,2.4607,-9.8078,4.3287,15.3906,6.2966,1189
-3.6031,-9.8853,0.4789,2.0886,-9.8853,4.1191,11.27,5.8401,1190
-13.5285,-9.9314,-0.5453,4.6942,-9.9314,4.0474,18.2492,8.1728,1192
-1.2683,-9.8902,0.4991,1.1751,-9.8902,2.0495,7.056,3.905,1193
-0.1065,-9.7776,0.4404,0.4135,-9.7776,1.3348,6.0448,4.9136,1194
-3.1031,-10.0036,2.9325,5.2262,-10.0036,4.5591,16.1084,14.7446,1195
-5.403,-10.0531,3.4608,4.8069,-10.0531,2.4774,22.8555,16.159,1197
-28.3923,-9.9895,-2.5929,6.6916,-9.9895,7.3081,52.3225,31.1766,1198
6.6033,-9.3605,17.2364,8.633,-9.3605,8.4783,49.8203,23.9976,1199
-4.6107,-10.1358,6.7962,9.727,-10.1358,6.9523,41.0988,33.6639,1200
-5.0125,-10.3781,4.2027,7.1356,-10.3781,4.8764,17.3573,15.0463,1202
-28.0299,-9.8826,2.0637,8.7695,-9.8826,7.3975,26.3035,17.4356,1203
-2.2245,-10.0544,-0.3991,1.0195,-10.0544,3.9561,17.7375,16.3329,1204
-19.0838,-10.1824,-2.3986,6.7407,-10.1824,3.8497,33.2483,26.369,1205
-7.4038,-8.3975,3.36,8.2546,-8.3975,2.8176,28.7736,21.7358,1207
-3.4368,-9.8906,1.0557,2.7155,-9.8906,4.6481,23.0007,6.8363,1208
-1.7417,-9.8643,0.2719,1.2164,-9.8643,2.1544,11.1007,4.8203,1209
-5.4344,-9.867,0.8177,3.3534,-9.867,2.0274,16.6811,8.4621,1210
-2.534,-9.9606,6.4659,7.5469,-9.9606,5.6784,33.9216,16.8578,1212
-14.5374,-9.3237,7.7897,11.9905,-9.3237,14.6933,38.0156,23.7994,1213
-9.0444,-9.8026,0.2241,5.4896,-9.8026,0.9504,13.7472,12.3513,1214
-1.8169,-10.0226,7.1167,6.6517,-10.0226,7.5357,37.1245,24.7758,1215
-0.6029,-9.8152,-0.2052,0.3069,-9.8152,2.0104,15.3557,9.4993,1217
-6.9751,-9.8762,-0.1632,3.0939,-9.8762,5.4458,21.0366,10.2994,1218
-8.1187,-9.9287,0.8802,4.4539,-9.9287,5.5298,15.3341,9.5177,1220
-1.6928,-10.001,0.1965,1.4612,-10.001,4.1205,13.5797,8.6097,1221
-1.9039,-10.0218,0.0855,0.9119,-10.0218,1.7348,11.1924,5.6019,1222
-2.0313,-9.7302,-0.1066,1.2687,-9.7302,3.4146,9.5012,6.2158,1223
-10.3175,-9.8404,2.4422,6.8533,-9.8404,7.6292,24.1103,10.3324,1224
-8.2216,-9.9783,1.9677,6.1098,-9.9783,7.1937,18.419,13.7401,1225
-9.1375,-9.9441,0.2897,3.6636,-9.9441,3.5203,10.7816,7.9797,1226
-8.2869,-9.6985,-1.8925,3.0388,-9.6985,2.7772,11.3155,9.4793,1227
-1.6655,-10.1312,1.7555,2.895,-10.1312,3.6448,18.2362,16.0882,1229
-0.2605,-9.817,1.0658,1.4225,-9.817,1.41,11.7812,10.492,1230
-14.3645,-9.8251,0.2478,5.2924,-9.8251,4.7024,16.6279,7.4765,1232
-7.3367,-9.8432,0.3564,2.6186,-9.8432,3.5532,16.2379,6.588,1233
-2.2028,-9.8785,-0.3725,1.0466,-9.8785,1.9883,5.0751,3.1144,1234
-1.6323,-9.8315,0.0165,0.7068,-9.8315,1.3704,8.2,4.9029,1235
-0.3209,-9.8387,0.1365,0.2985,-9.8387,1.8364,4.7408,3.8572,1236
-0.8638,-9.8361,0.4889,1.126,-9.8361,3.4767,10.8722,7.143,1238
-0.485,-10.0667,0.1119,0.4823,-10.0667,1.8355,9.3637,5.5874,1239
-0.1879,-9.9792,2.9642,3.0218,-9.9792,5.9136,29.4829,25.0939,1240
-0.9139,-9.909,0.9246,1.3514,-9.909,4.1423,20.3234,16.4254,1242
-5.9534,-10.2571,2.2155,6.5892,-10.2571,8.145,52.62,31.6397,1243
-2.1469,-9.6967,4.1424,5.8333,-9.6967,2.5518,25.0198,17.4566,1244
-0.6938,-9.9616,0.5813,0.8782,-9.9616,1.7233,11.3549,8.3824,1245
-171.2305,-9.6318,-40.9195,50.7575,-9.6318,14.8077,61.5254,24.306,1247
-109.7947,-8.7966,0.4799,66.3519,-8.7966,16.3778,71.4622,13.1872,1248
12.6094,-9.2815,32.9844,14.5699,-9.2815,5.6896,23.9286,13.3189,1249
-32.8577,-9.6185,0.2307,16.3051,-9.6185,6.1286,11.2234,7.1249,1250
-8.9207,-9.539,0.8044,4.9795,-9.539,2.1607,8.6907,3.4203,1252
-25.9759,-9.4304,6.263,18.1926,-9.4304,8.0776,35.5573,4.1617,1253
-1.3508,-9.5701,18.3069,14.7268,-9.5701,5.1452,21.5449,12.3038,1254
-19.47,-9.654,-6.1942,5.5776,-9.654,3.8588,10.0819,6.2835,1255
-9.5313,-9.5546,0.328,7.5971,-9.5546,4.2457,11.3599,8.6299,1256
-14.0444,-9.8027,0.3359,8.7802,-9.8027,5.8337,13.3832,8.2571,1258
-12.5859,-9.9,0.8587,3.6111,-9.9,5.7096,35.5938,22.4518,1259
-14.0363,-10.1833,-0.6019,9.2119,-10.1833,5.7505,37.4316,21.6435,1260
-4.4199,-10.1663,0.1213,2.7472,-10.1663,2.3447,33.9437,31.478,1261
-8.103,-9.9394,7.2757,10.1968,-9.9394,3.3387,27.5666,15.3617,1262
-2.1441,-9.8529,0.6585,2.4824,-9.8529,1.8907,9.6846,8.327,1263
-0.2583,-9.5658,-0.0549,0.1177,-9.5658,0.6148,4.2796,3.0231,1264
-4.4997,-9.9666,-0.2824,1.2835,-9.9666,2.4074,18.2327,7.6332,1265
-4.5121,-9.9078,0.1909,2.4157,-9.9078,4.3618,22.0186,14.3516,1267
-11.9695,-9.8442,-3.101,4.03,-9.8442,3.5181,21.3105,7.9095,1268
-40.1457,-9.6272,-14.611,15.7231,-9.6272,7.3621,19.8997,8.0021,1269
-44.8798,-9.5689,0.062,15.8978,-9.5689,6.119,22.1784,8.4169,1270
-5.1858,-9.6386,-1.0114,2.1062,-9.6386,1.5149,4.1286,2.2406,1272
-42.9239,-9.6496,4.6313,15.4125,-9.6496,6.8145,29.5683,7.3734,1273
-2.1375,-9.8825,-1.2555,0.4756,-9.8825,0.5001,3.2366,2.9625,1274
1.1092,-9.5814,10.9036,11.3677,-9.5814,5.6595,20.7374,10.2254,1275
-8.1843,-9.903,-0.5671,3.2083,-9.903,3.5301,6.6755,2.64,1277
-5.3231,-9.9128,-0.3121,2.3451,-9.9128,4.4095,16.1172,7.3126,1278
-26.3943,-9.6107,-3.4206,11.7854,-9.6107,9.2676,35.0949,18.2653,1279
-5.0587,-9.8858,-1.232,1.7579,-9.8858,4.3779,14.0035,4.2912,1280
-26.0909,-9.7733,1.7429,16.3456,-9.7733,8.4479,24.4073,17.2823,1281
-10.1218,-9.9776,1.6507,7.7314,-9.9776,2.528,25.9366,25.1564,1282
-9.0698,-9.457,2.6888,9.4682,-9.457,1.2008,31.6398,18.0683,1283
-9.9399,-9.421,-1.5385,3.4608,-9.421,1.6098,25.3365,20.5797,1284
-4.0396,-10.0215,2.4917,6.1753,-10.0215,6.7434,47.4882,31.7566,1285
-10.7252,-10.0379,3.0859,6.911,-10.0379,8.1046,40.9463,26.8947,1286
-4.6638,-9.6982,5.5558,5.7401,-9.6982,4.407,27.1514,11.3384,1287
-2.5458,-10.0313,3.2479,5.7276,-10.0313,4.4731,26.5216,23.3747,1288
-0.0479,-10.0292,1.7329,1.1948,-10.0292,1.0587,8.7196,7.3363,1289
-2.6307,-9.7795,0.508,1.8374,-9.7795,1.1265,10.7657,8.4647,1290
-0.0565,-9.8955,0.7839,0.7151,-9.8955,1.4123,21.9862,20.5206,1291
-77.5436,-9.8062,-7.1959,23.8889,-9.8062,17.1417,40.0973,32.0058,1292
-142.6315,-9.1955,-43.9317,29.8599,-9.1955,5.8793,30.0489,12.9369,1293
-86.0112,-8.9454,35.7841,86.0632,-8.9454,24.3565,100.2722,46.3987,1294
9.6846,-9.6,32.8988,15.2606,-9.6,4.9084,21.7263,17.1885,1295
-3.6494,-9.8491,1.5901,3.0017,-9.8491,3.7648,19.6506,7.4226,1297
-21.9269,-9.8777,2.0204,9.062,-9.8777,8.1311,55.8869,37.1483,1298
-13.8229,-9.2647,-1.4043,5.8918,-9.2647,5.3362,23.5343,11.4726,1299
-13.5647,-9.4069,-2.0773,4.5589,-9.4069,3.6945,30.176,12.0246,1300
-6.4504,-9.616,0.8786,4.3779,-9.616,5.6306,23.0641,12.1228,1302
-12.5807,-9.6126,3.3022,7.7905,-9.6126,11.4172,33.3574,17.3267,1303
-0.6958,-9.5915,15.0924,13.1067,-9.5915,1.854,26.978,25.6202,1304
-2.853,-10.2749,1.585,3.3121,-10.2749,6.4317,61.2347,53.4791,1305
-8.0385,-9.9329,5.0388,11.1294,-9.9329,7.4058,52.6888,42.7278,1307
-19.5857,-9.9152,-1.1102,7.2827,-9.9152,7.3498,33.9323,14.9195,1308
-2.2447,-9.7696,7.2853,14.3575,-9.7696,11.9047,35.0286,19.0476,1309
-34.7389,-9.438,8.3994,28.2714,-9.438,12.5876,45.5473,14.9334,1310
-12.5625,-9.1528,-2.3118,5.6344,-9.1528,2.5839,23.0506,7.8628,1312
-1.5038,-10.4753,2.0989,6.0309,-10.4753,3.5746,10.1834,5.6299,1313
-25.4328,-9.8016,-2.9283,9.1321,-9.8016,6.5207,32.1388,15.1917,1314
-7.1934,-9.7848,0.6737,3.255,-9.7848,4.0874,18.8008,7.4354,1315
-5.2275,-8.6073,2.4701,4.0279,-8.6073,3.5472,22.1321,9.425,1317
-13.9523,-9.7386,3.8639,15.3217,-9.7386,8.2023,28.9764,13.1656,1318
-0.8082,-9.7325,2.3214,3.591,-9.7325,4.9074,16.5137,12.3646,1319
-15.0759,-9.654,-2.2836,4.4914,-9.654,3.5007,38.7375,18.461,1320
-12.2803,-9.7813,6.9898,15.3341,-9.7813,7.7547,50.6854,21.214,1322
-10.2832,-9.7429,0.2165,4.5446,-9.7429,3.554,18.8174,10.8884,1323
-2.1621,-8.7924,0.6892,1.8978,-8.7924,2.1134,16.3543,10.8203,1324
-6.3992,-8.1424,-0.6561,2.0719,-8.1424,2.374,39.8325,11.2993,1325
-22.1145,-10.3872,6.1742,16.6011,-10.3872,8.8767,33.8806,16.8228,1327
-14.6347,-10.0368,0.7813,7.71,-10.0368,9.0566,42.7128,26.0382,1328
-8.7685,-9.5661,-0.617,4.8229,-9.5661,6.1513,27.5157,17.3866,1329
-7.2689,-9.856,0.2679,3.8729,-9.856,1.7845,12.9172,7.5674,1330
-6.0074,-9.0934,-1.1178,2.2252,-9.0934,4.9942,19.2845,14.4602,1332
-29.0452,-9.989,-0.1125,7.3975,-9.989,7.3677,34.1489,14.32,1333
-3.1477,-9.5254,3.8594,4.5964,-9.5254,2.9874,26.4251,20.7024,1334
-2.7604,-9.8541,3.4416,5.5003,-9.8541,5.3372,26.3644,15.2132,1336
-7.1499,-10.1479,-2.1428,2.9042,-10.1479,2.9508,21.6012,16.3087,1337
-5.5832,-9.8618,-0.6207,3.276,-9.8618,4.4043,14.8693,8.8865,1338
-8.2343,-9.9251,-0.302,3.8832,-9.9251,6.037,21.9602,12.3696,1339
-26.965,-9.7893,1.4337,14.7649,-9.7893,6.9229,25.5321,21.8823,1340
-3.5936,-9.7401,1.6908,4.4773,-9.7401,2.9426,17.6397,11.7361,1341
-398.2319,-9.8521,-56.0769,115.4677,-9.8521,18.4612,68.5678,31.285,1342
-126.6636,-9.5964,19.3805,56.4575,-9.5964,14.7364,100.5434,19.9647,1343
-11.6711,-10.0299,1.1007,3.932,-10.0299,3.131,39.4721,34.9904,1344
-8.682,-9.8321,-0.4193,3.4384,-9.8321,4.5804,18.2572,4.8025,1345
-1.1615,-9.8691,0.5994,1.0087,-9.8691,1.2007,2.9384,1.8977,1346
-3.468,-9.8315,0.0439,1.4719,-9.8315,1.8423,4.2731,1.5592,1348
0.3455,-9.8372,1.3023,0.8885,-9.8372,0.9443,3.5554,2.1522,1349
0.3086,-9.844,1.3083,0.708,-9.844,0.7722,3.3073,2.3847,1350
-0.3684,-9.8414,0.4329,0.4529,-9.8414,0.64,2.2414,1.2214,1352
-4.1901,-9.8228,-0.32,1.5439,-9.8228,1.4211,3.6697,1.0898,1353
3.5726,-9.7851,5.1183,0.7394,-9.7851,0.5247,5.3408,4.8112,1354
1.2556,-9.8331,1.7395,0.3734,-9.8331,0.4605,3.0989,1.9891,1355
1.1328,-9.8245,2.8703,1.3111,-9.8245,0.4325,5.1853,4.8001,1357
-6.741,-9.8361,1.0712,3.2346,-9.8361,4.31,29.2396,13.9704,1358
-19.4779,-10.0194,-0.3054,9.4056,-10.0194,6.999,64.9074,39.8724,1359
-4.0547,-9.8544,0.6285,2.4314,-9.8544,2.5582,45.4392,28.242,1360
-10.7365,-10.71,4.8219,13.0653,-10.71,12.3649,70.004,40.406,1362
-18.4777,-9.7647,6.8277,20.9834,-9.7647,12.5272,50.8997,18.7752,1363
-15.3267,-9.965,-2.6923,5.7987,-9.965,3.739,20.297,16.572,1364
-5.9982,-9.9777,0.1916,2.7104,-9.9777,1.913,19.1952,10.8977,1365
-20.2495,-9.9443,2.3969,12.6843,-9.9443,5.7956,23.1946,18.9518,1367
-10.0101,-9.7002,-0.0437,5.1659,-9.7002,4.2923,27.909,15.4124,1368
-21.7373,-9.8655,1.3709,11.1315,-9.8655,11.3154,37.4611,23.353,1369
-9.3926,-9.8112,0.1346,4.3903,-9.8112,2.6018,16.0886,13.0945,1370
-9.0575,-10.284,0.9666,6.1976,-10.284,7.551,36.5251,18.9787,1372
-9.6186,-9.7994,1.0067,4.4102,-9.7994,4.6362,18.8331,9.5089,1373
-5.1545,-10.3205,3.7318,5.7155,-10.3205,8.8244,27.0123,15.0689,1374
-14.6458,-9.836,2.0674,8.5138,-9.836,4.5136,22.7565,13.467,1375
-16.1707,-10.0307,5.7995,13.1026,-10.0307,10.2042,36.5972,24.4732,1377
-14.9196,-9.5614,0.5887,5.2245,-9.5614,5.2579,24.2666,10.2379,1378
-0.0333,-9.9635,3.729,5.3078,-9.9635,3.6097,17.9355,13.2764,1379
-7.8439,-9.9142,0.1235,3.8333,-9.9142,5.1556,15.224,11.3566,1380
-32.423,-10.0794,0.6902,14.1452,-10.0794,2.9591,25.665,13.3567,1382
-44.3561,-9.2965,-5.2795,12.6013,-9.2965,8.4083,47.2667,14.0066,1383
-11.2106,-10.4645,-0.4547,4.9121,-10.4645,8.6592,22.773,13.9226,1384
-18.1438,-9.619,-3.828,6.1226,-9.619,6.1996,24.019,10.9961,1385
-8.1518,-9.9024,2.6025,7.4803,-9.9024,4.5981,24.5988,13.2765,1387
-31.3829,-9.4422,0.3813,12.749,-9.4422,8.9914,28.24,17.9004,1388
-6.7387,-10.1136,3.3829,7.2051,-10.1136,7.2916,25.5696,16.3165,1389
-7.4882,-9.1856,0.681,4.2725,-9.1856,5.8601,19.2425,12.0761,1390
-3.4606,-9.5671,11.6895,9.7745,-9.5671,4.7645,21.4539,18.8545,1392
-16.5192,-9.8361,12.2207,23.766,-9.8361,16.6819,41.3831,27.5554,1393
-14.0708,-9.7805,-0.4591,7.1037,-9.7805,8.5056,33.0246,12.4094,1394
-9.6942,-9.3546,5.2911,7.449,-9.3546,3.8858,23.5837,15.6342,1395
-1.8524,-9.784,-0.3466,1.5673,-9.784,4.1537,14.5786,9.4231,1396
-16.7432,-9.6903,0.7735,9.0412,-9.6903,2.6826,23.6223,15.0016,1397
-8.7131,-9.5306,1.8651,6.8933,-9.5306,5.6366,18.713,13.7698,1398
-3.9079,-9.5573,2.6541,5.6829,-9.5573,5.2982,16.4445,10.7477,1399
-12.6845,-9.7799,3.4679,9.9457,-9.7799,8.2416,30.544,21.3652,1400
-5.3955,-9.8765,0.2298,2.66,-9.8765,1.371,16.304,11.2413,1401
-7.5473,-9.9003,7.2436,11.2133,-9.9003,8.7668,23.9751,21.8609,1402
-19.2035,-9.7758,1.728,8.7022,-9.7758,6.6641,31.3559,19.3928,1403
-2.2942,-10.2612,-0.5599,1.2794,-10.2612,1.851,39.3097,36.1971,1404
-5.069,-10.2522,5.5093,8.2273,-10.2522,7.3561,44.8662,29.9463,1405
-19.6772,-9.8114,3.1287,11.2819,-9.8114,9.7974,26.8033,11.131,1406
-15.6497,-9.884,2.8813,8.5153,-9.884,7.8739,26.1599,11.8229,1408
0.943,-10.1905,4.5089,2.5167,-10.1905,3.5982,14.2786,11.1509,1409
-0.5161,-9.8552,0.995,1.304,-9.8552,2.4189,15.1682,7.4518,1410
-0.4503,-9.9215,2.9485,2.5336,-9.9215,4.0224,11.8328,8.2656,1412
-12.26,-9.6434,1.8882,5.6461,-9.6434,5.5378,29.1434,6.5794,1413
-28.3506,-8.2842,1.4561,15.6072,-8.2842,9.4016,25.9865,20.0103,1414
-4.6338,-9.8705,1.844,4.5383,-9.8705,5.5439,14.4609,9.4562,1415
-10.9284,-10.1213,-0.1447,5.6803,-10.1213,4.4177,9.6323,7.0235,1417
-1.1886,-9.7646,2.5321,3.1198,-9.7646,4.2052,16.3468,7.5784,1418
-2.6739,-9.9139,1.2543,1.95,-9.9139,1.1991,11.3122,6.7056,1419
-1.6635,-9.7306,1.3472,3.5967,-9.7306,3.407,11.8683,8.0696,1420
-4.5811,-9.7966,0.2505,2.5313,-9.7966,4.7191,11.9313,7.9304,1422
-1.6406,-9.8433,0.4178,1.7486,-9.8433,4.2949,11.2681,5.5837,1423
-1.1627,-9.9394,0.4331,1.1152,-9.9394,0.8274,7.926,6.1164,1424
-7.0672,-9.878,0.5901,3.8558,-9.878,6.9486,15.3879,12.1346,1425
-12.3522,-9.8318,1.6618,7.7044,-9.8318,5.7618,20.4572,11.8923,1427
-16.0331,-9.9759,0.9327,10.1851,-9.9759,2.0113,21.9624,14.19,1428
-8.1366,-10.0835,0.4286,3.7526,-10.0835,4.2299,35.975,25.3237,1429
-4.4592,-10.2289,0.7379,2.6328,-10.2289,3.6786,35.9474,24.8329,1430
-27.3969,-9.8278,10.3712,24.3329,-9.8278,17.5819,35.7093,28.7516,1432
-11.5874,-9.9184,0.9363,4.5518,-9.9184,5.4084,18.6589,8.0368,1433
-3.4435,-9.8381,0.0018,1.6438,-9.8381,3.2677,7.6183,5.9924,1434
-2.129,-9.9255,-0.0142,1.2246,-9.9255,1.6638,8.1006,3.8305,1435
-7.5435,-9.6689,3.7497,6.4566,-9.6689,1.6149,17.7077,12.4336,1437
-8.8616,-9.9813,5.3549,11.4499,-9.9813,12.2424,35.2369,19.7981,1438
-3.8337,-9.9327,9.4058,11.1173,-9.9327,11.5717,34.6523,28.162,1439
-3.3263,-10.0688,7.2451,9.4218,-10.0688,8.1693,26.8197,22.2705,1440
-0.369,-9.6039,10.2635,11.8953,-9.6039,12.0379,28.9674,19.5646,1442
-6.7702,-9.9098,3.112,6.2123,-9.9098,7.5165,22.8563,12.3488,1443
-4.9595,-9.7981,0.5166,2.6125,-9.7981,1.0469,10.0638,6.5965,1444
-2.4492,-9.8363,5.551,6.4977,-9.8363,8.8246,18.4115,13.7565,1445
-2.9993,-9.8242,-0.3089,1.9114,-9.8242,2.834,10.5103,7.2456,1447
-7.3831,-9.8755,0.9841,3.4734,-9.8755,4.0403,15.358,7.3657,1448
-1.6507,-9.8423,0.2811,0.8443,-9.8423,2.5723,9.4685,7.4674,1449
-8.9881,-9.8808,5.2287,11.7431,-9.8808,7.1621,19.5368,13.719,1451
-8.7764,-9.9611,-1.763,4.1079,-9.9611,8.2826,13.7539,11.3118,1452
-2.3503,-9.8085,4.2185,5.5228,-9.8085,9.0909,15.8539,12.4307,1453
-5.9388,-10.0704,6.2608,11.9462,-10.0704,9.1375,26.5321,18.9392,1454
-9.5354,-9.8042,2.2527,4.2411,-9.8042,5.7386,24.4027,9.1022,1458
-4.1698,-10.0797,1.6665,4.6479,-10.0797,8.7324,28.5078,22.6512,1459
-3.9956,-9.9478,3.0927,5.069,-9.9478,6.7755,15.2269,10.4452,1460
-1.4591,-10.0334,1.2012,1.9468,-10.0334,3.6361,8.1462,5.9667,1461
-1.3121,-9.8312,-0.3755,0.4321,-9.8312,1.4805,7.0574,5.8243,1462
-0.5508,-9.9227,1.0645,2.247,-9.9227,4.5198,10.5901,7.624,1463
-1.6153,-9.9241,1.1927,1.6759,-9.9241,0.6004,6.5797,5.0928,1464
-4.4203,-9.8372,0.9973,2.3128,-9.8372,2.6719,14.6824,11.2515,1465
-1.4143,-10.3667,0.5228,1.6615,-10.3667,5.8469,22.8571,22.1003,1467
-1.2434,-10.036,0.6482,1.1583,-10.036,3.8932,10.772,9.0338,1468
-1.1772,-9.8495,0.2649,1.2745,-9.8495,3.596,12.8358,8.325,1469
-1.5416,-9.8653,0.0141,0.9449,-9.8653,1.0928,4.9798,4.4792,1470
-2.0914,-9.9208,0.1604,1.0417,-9.9208,0.6145,7.6062,5.4613,1472
-11.424,-9.8946,2.034,6.9109,-9.8946,4.8956,28.3859,11.0714,1473
-12.9237,-9.8382,-3.877,3.4948,-9.8382,2.6274,10.8412,5.3835,1474
-43.07,-9.7693,-18.7606,11.4538,-9.7693,2.5642,16.4938,11.4176,1475
4.7049,-9.7525,10.3854,3.6759,-9.7525,1.3311,8.9561,7.5778,1477
-11.9404,-9.8586,-0.8653,4.625,-9.8586,3.1786,13.4967,6.876,1478
-18.9758,-9.767,-11.8652,4.6507,-9.767,2.1877,10.9114,8.6809,1479
0.7843,-9.7501,10.9066,12.211,-9.7501,6.1097,18.7757,12.8539,1480
-12.6659,-9.7617,-0.0238,8.4077,-9.7617,6.7963,20.4352,7.9792,1481
-5.0304,-9.4983,2.4371,5.3332,-9.4983,4.2715,21.4247,9.0462,1483
-5.505,-9.8611,1.067,2.7396,-9.8611,3.574,8.2667,4.4594,1484
-17.042,-9.7691,-9.5074,7.806,-9.7691,1.823,12.5563,10.1607,1485
-33.5684,-9.6344,-20.4981,11.1058,-9.6344,2.9838,18.8136,14.7144,1486
-24.6853,-9.5709,2.4787,15.624,-9.5709,10.4329,28.9151,13.4781,1489
-39.2015,-9.5272,-4.6209,13.4883,-9.5272,8.115,31.1398,19.5395,1490
-46.5892,-9.6223,4.9676,23.2412,-9.6223,10.4283,18.9125,10.9417,1492
-8.0863,-9.8731,4.6545,8.8005,-9.8731,7.2492,22.511,13.5607,1493
-18.4962,-9.873,0.4208,8.0012,-9.873,7.7399,21.0446,13.9518,1494
-16.448,-9.8578,2.9173,9.3895,-9.8578,3.223,53.1241,38.919,1495
-23.3638,-9.8248,8.3991,17.4512,-9.8248,2.5826,47.1367,27.7066,1497
-2.3258,-9.8411,2.5682,3.6513,-9.8411,8.8107,28.7935,15.0967,1498
-1.4153,-9.792,-0.1975,0.5357,-9.792,1.1532,8.973,6.0886,1499
-15.2609,-9.9194,-2.0435,4.1457,-9.9194,3.6028,28.2769,19.4019,1500
-5.0571,-9.9169,8.5541,8.9757,-9.9169,3.7149,29.2134,18.5297,1502
-22.2573,-9.881,2.1844,9.3274,-9.881,8.4558,25.1903,15.5772,1503
-1.6521,-9.7821,1.2691,2.367,-9.7821,1.5733,14.101,10.9453,1504
-21.9763,-9.8445,-0.1229,9.8903,-9.8445,3.7087,39.1233,16.5959,1505
-11.8479,-9.9733,5.4995,16.1076,-9.9733,7.165,51.9121,40.7284,1507
-3.9438,-9.8363,0.6659,2.3608,-9.8363,5.4326,18.2952,12.3388,1508
-1.5551,-9.9144,0.1869,1.2628,-9.9144,3.9889,23.8609,3.3956,1509
-7.4454,-9.896,0.1195,3.4635,-9.896,7.0192,20.8315,7.9612,1510
-3.4821,-9.837,3.384,4.4526,-9.837,0.6051,17.894,13.417,1511
-7.0587,-9.8358,5.3964,6.9909,-9.8358,12.2386,23.0777,19.067,1512
-6.9407,-9.8632,4.5527,7.3697,-9.8632,9.6449,24.0383,15.7423,1513
-6.073,-9.9767,-0.1896,2.3619,-9.9767,3.4283,14.7744,6.0919,1514
-11.5472,-8.3247,-3.4978,9.6169,-8.3247,4.4986,21.5924,17.8929,1515
-0.2994,-9.2745,1.8728,1.3185,-9.2745,3.481,15.5432,9.1856,1516
0.4295,-9.4914,11.2217,9.8608,-9.4914,2.8462,25.6065,18.2278,1517
-4.7363,-9.7126,2.2116,5.6559,-9.7126,6.1996,23.9714,11.9676,1518
-16.6651,-9.9748,-0.4941,6.7506,-9.9748,3.5998,16.8644,10.8224,1519
-3.131,-9.8835,-0.8388,1.0995,-9.8835,2.4645,9.7459,5.9855,1520
-3.1434,-9.916,-0.2698,2.942,-9.916,2.2441,11.5132,9.9287,1521
-3.6187,-9.9061,2.7843,5.1756,-9.9061,8.0669,20.3635,14.032,1523
-3.1872,-9.9004,-0.8753,1.6696,-9.9004,1.2931,9.7146,5.1176,1524
-2.1151,-9.7447,-0.2096,1.0644,-9.7447,3.8885,10.1858,6.3399,1525
-5.1122,-9.6231,-0.5326,3.5971,-9.6231,4.756,14.428,9.3521,1527
-33.1295,-9.8969,-1.9588,8.3149,-9.8969,5.9556,24.2373,9.4155,1528
-14.6714,-10.8708,-3.2723,6.8985,-10.8708,7.5862,23.032,13.7092,1529
-2.9464,-9.8757,-0.369,1.1673,-9.8757,1.6661,8.1051,3.2518,1530
-1.2593,-9.9409,-0.2802,0.576,-9.9409,1.2407,4.6986,2.752,1532
-16.9735,-9.5571,-0.6078,3.8576,-9.5571,1.9569,20.7296,5.3574,1533
-4.3171,-10.0087,-1.2071,1.7725,-10.0087,3.6206,14.3504,9.7332,1534
-1.4177,-9.9371,11.9675,11.1182,-9.9371,4.2572,28.8646,25.1474,1535
-3.2904,-10.0036,-0.7117,1.6606,-10.0036,2.0523,38.5889,26.7445,1537
-48.729,-9.6985,-0.3533,12.5046,-9.6985,6.5267,67.9342,6.0737,1538
-16.5477,-9.8344,-1.523,4.6216,-9.8344,3.7102,10.3545,2.776,1539
-17.4076,-9.8096,-5.9198,6.428,-9.8096,3.7248,25.8718,16.7905,1540
-7.8117,-9.7077,2.0338,4.6679,-9.7077,3.1931,11.6931,6.0283,1542
-3.0317,-9.8086,3.6915,4.0523,-9.8086,3.2344,10.6755,3.9271,1543
-1.2996,-9.8527,0.5387,1.3542,-9.8527,2.1966,3.6313,2.0031,1544
-6.3053,-9.8637,-1.6226,2.4471,-9.8637,3.0322,7.0835,3.7136,1545
-3.7453,-9.8529,2.3712,4.1862,-9.8529,4.937,10.7508,4.7646,1547
-3.0095,-9.8366,0.2934,1.5923,-9.8366,1.859,3.4964,1.9116,1548
-3.7499,-9.8658,0.0597,1.4817,-9.8658,2.8676,5.2537,3.3835,1549
-1.8434,-9.8136,0.0098,1.2015,-9.8136,1.0998,1.8344,1.1446,1550
3.3421,-9.8367,3.6808,0.2363,-9.8367,0.4536,4.6414,3.9304,1551
-3.8647,-9.8923,-1.176,1.2953,-9.8923,2.8506,7.31,4.3067,1552
-7.8818,-9.8203,-3.1861,2.1006,-9.8203,2.9609,11.6101,5.67,1554
0.23,-9.8204,1.8357,1.1963,-9.8204,1.0454,3.3167,1.8381,1555
0.8992,-9.8325,1.5208,0.5131,-9.8325,0.523,2.8695,1.9023,1556
0.427,-9.8136,1.3287,0.5282,-9.8136,0.4608,2.0801,1.7397,1557
-0.1951,-9.8389,0.1636,0.3202,-9.8389,0.4858,1.83,0.8237,1558
2.174,-9.8248,2.6644,0.5183,-9.8248,0.4681,3.8304,2.7099,1559
0.0516,-9.856,0.9604,0.72,-9.856,1.1506,3.4114,1.8249,1560
-0.0095,-9.8527,0.4662,0.3039,-9.8527,0.5153,1.6857,1.2396,1562
-2.4197,-9.5222,0.9591,1.8017,-9.5222,2.7893,20.7919,7.1483,1563
-21.175,-9.1083,-2.3732,8.7281,-9.1083,5.9335,50.1941,10.915,1564
-2.0218,-9.92,-0.1432,0.7911,-9.92,1.6136,15.7623,9.64,1565
-2.2137,-9.9006,2.4687,3.5206,-9.9006,4.5295,26.6876,13.9518,1567
-1.4103,-9.8537,1.1602,2.4501,-9.8537,3.2718,14.1937,8.2367,1568
-0.9372,-9.8278,-0.1108,0.3499,-9.8278,1.7235,10.2119,9.1266,1569
-0.5612,-9.7416,0.0707,0.3463,-9.7416,1.0624,12.5772,7.7586,1570
-3.0926,-9.958,0.0877,1.5474,-9.958,1.2635,9.8646,8.7763,1571
-4.6101,-9.8578,-0.6839,1.4362,-9.8578,1.9065,10.0583,6.0729,1572
-5.7911,-9.8354,-0.2258,1.7179,-9.8354,3.2679,12.5753,7.1864,1573
-12.218,-10.0417,4.278,12.0556,-10.0417,2.7551,44.459,19.2282,1574
-6.6169,-9.0135,12.5214,14.2404,-9.0135,2.8751,47.9429,44.1807,1575
-9.8845,-9.8138,1.0905,6.3116,-9.8138,6.7603,37.6215,26.7806,1576
-26.221,-9.7415,-0.7464,6.7497,-9.7415,6.8429,55.527,12.4278,1578
-2.5389,-9.3564,3.9433,5.3289,-9.3564,3.0575,23.0473,15.565,1579
-4.1108,-9.9028,2.879,5.3354,-9.9028,10.0164,30.4058,19.9298,1580
-5.7435,-10.2823,8.7035,11.902,-10.2823,10.6251,48.8363,33.9172,1581
-14.2838,-9.5263,2.1798,6.0058,-9.5263,8.5265,28.3215,13.9242,1583
-0.0368,-10.2727,3.7354,3.0172,-10.2727,5.2732,32.1681,25.9584,1584
-13.7759,-9.9959,2.4919,10.2762,-9.9959,2.8567,35.6189,14.5841,1585
-2.1323,-10.0915,6.4545,6.496,-10.0915,2.003,53.2985,44.4798,1587
-14.8874,-9.9138,1.1472,4.571,-9.9138,3.3204,44.5297,27.1723,1588
-0.0475,-9.905,1.4189,0.8574,-9.905,0.733,16.0883,13.8921,1589
-8.1099,-9.7882,-2.7828,3.8421,-9.7882,2.7704,6.5824,4.5998,1590
-19.9957,-9.7951,0.2901,9.8066,-9.7951,6.2219,11.9043,7.0397,1592
-31.2428,-9.8168,1.2206,15.5119,-9.8168,10.7578,25.0418,7.1613,1593
-26.1596,-9.8788,-4.5348,9.7006,-9.8788,4.8057,26.8121,23.4224,1594
-12.7664,-9.8551,-0.4416,4.6621,-9.8551,3.5881,8.3324,3.0265,1595
-19.85,-9.8222,-7.6113,5.7755,-9.8222,1.228,10.7608,8.0087,1596
-0.5753,-9.8463,2.3323,1.3199,-9.8463,0.3581,4.9672,4.1631,1598
-5.7232,-9.8649,-0.3679,2.7674,-9.8649,3.5258,8.9762,3.0707,1599
-15.3472,-9.8131,-1.6603,10.5023,-9.8131,4.5507,15.962,10.9203,1600
-14.306,-9.88,-1.846,5.0825,-9.88,3.2889,6.8721,2.6078,1601
-14.8754,-9.8575,-0.2813,6.7095,-9.8575,5.6953,11.5246,4.6517,1602
-14.0012,-9.8951,-3.1969,4.8034,-9.8951,4.4212,10.1746,3.1618,1603
-1.7374,-9.8684,-0.4008,0.621,-9.8684,2.4464,6.7431,2.69,1604
-0.4406,-9.8766,-0.1135,0.1786,-9.8766,0.679,3.0343,1.5811,1605
-2.4144,-9.8443,-0.0824,1.2098,-9.8443,2.4467,4.2913,2.7942,1606
-0.4886,-9.8769,-0.0439,0.16,-9.8769,0.3009,2.4845,1.7522,1607
-0.6654,-9.8641,-0.1286,0.3043,-9.8641,0.6452,2.8162,1.8503,1609
-1.6956,-9.8729,-0.1641,0.4286,-9.8729,1.4065,4.4198,1.6294,1610
-1.3786,-9.8418,-0.0706,0.806,-9.8418,2.59,5.6983,1.7205,1611
-14.2532,-9.8637,-1.5808,5.86,-9.8637,3.6157,7.7945,3.4186,1612
-1.0817,-9.8905,-0.4377,0.4617,-9.8905,0.7422,3.0305,1.8647,1613
-0.5631,-9.859,-0.227,0.1726,-9.859,0.5448,3.316,1.8194,1614
-0.2501,-9.875,-0.2052,0.0291,-9.875,0.07,1.493,1.4032,1615
-0.2191,-9.8736,-0.2038,0.0077,-9.8736,0.0147,1.4381,1.4107,1617
-0.2113,-9.8728,-0.2004,0.0042,-9.8728,0.0149,1.4332,1.4017,1618
-0.2035,-9.8709,-0.1999,0.0028,-9.8709,0.0154,1.418,1.3979,1619
-0.2177,-9.8724,-0.2034,0.0074,-9.8724,0.0192,1.4266,1.4053,1620
-0.2125,-9.8745,-0.2048,0.0048,-9.8745,0.0179,1.4332,1.4087,1621
-0.2041,-9.8741,-0.1998,0.0037,-9.8741,0.0166,1.4203,1.401,1622
-0.2092,-9.8715,-0.2014,0.0054,-9.8715,0.0224,1.4457,1.3937,1623
-0.2073,-9.8737,-0.2018,0.0038,-9.8737,0.0127,1.4118,1.397,1625
-0.2049,-9.8721,-0.1987,0.004,-9.8721,0.0142,1.4267,1.4013,1626
-2.081,-9.8691,-0.2775,0.6466,-9.8691,1.4756,3.6151,1.9834,1627
-2.4224,-9.8576,-0.4601,0.6914,-9.8576,1.4851,3.6572,1.8337,1628
-0.3477,-9.8727,-0.2156,0.0677,-9.8727,0.1538,1.515,1.376,1629
-0.2234,-9.872,-0.2105,0.0093,-9.872,0.0182,1.4106,1.4061,1630
-0.2168,-9.8728,-0.211,0.0047,-9.8728,0.0155,1.4278,1.3994,1631
-0.2122,-9.872,-0.2075,0.0045,-9.872,0.0121,1.4219,1.4044,1632
-0.2217,-9.8717,-0.2112,0.0049,-9.8717,0.0143,1.4333,1.404,1633
-0.2175,-9.8728,-0.209,0.0056,-9.8728,0.018,1.4287,1.4009,1634
-0.2168,-9.8696,-0.2052,0.0055,-9.8696,0.0145,1.4076,1.3872,1635
-0.217,-9.872,-0.2081,0.0054,-9.872,0.0166,1.4267,1.395,1637
-0.2245,-9.8721,-0.21,0.0072,-9.8721,0.019,1.4352,1.4038,1638
-0.221,-9.8725,-0.2088,0.0068,-9.8725,0.0209,1.4227,1.3985,1639
-0.2288,-9.8729,-0.21,0.0098,-9.8729,0.02,1.426,1.4076,1640
-0.2248,-9.8705,-0.2119,0.007,-9.8705,0.0066,1.4307,1.4172,1641
-0.2184,-9.8726,-0.2104,0.0056,-9.8726,0.0106,1.4182,1.4026,1642
-0.2189,-9.8725,-0.2106,0.0067,-9.8725,0.0159,1.4314,1.4076,1643
-0.2106,-9.8716,-0.2043,0.0042,-9.8716,0.0139,1.4179,1.3895,1644
-0.2133,-9.8722,-0.2047,0.0038,-9.8722,0.0127,1.4338,1.3991,1646
-0.2141,-9.8723,-0.2074,0.0055,-9.8723,0.0147,1.4038,1.3904,1647
-0.214,-9.8727,-0.2081,0.0035,-9.8727,0.0139,1.4058,1.3946,1648
-0.2147,-9.8721,-0.2098,0.0036,-9.8721,0.0119,1.4143,1.4005,1649
-0.2165,-9.8714,-0.2114,0.0031,-9.8714,0.017,1.4203,1.4058,1650
-0.2165,-9.8725,-0.2121,0.0024,-9.8725,0.0073,1.4056,1.4005,1651
-0.2135,-9.8712,-0.2084,0.0033,-9.8712,0.0103,1.425,1.4069,1653
-0.2147,-9.8727,-0.2082,0.0042,-9.8727,0.0087,1.4248,1.4044,1654
-0.2163,-9.872,-0.2075,0.0042,-9.872,0.0136,1.4289,1.403,1656
-0.221,-9.8736,-0.2137,0.0055,-9.8736,0.0103,1.4079,1.3992,1657
-0.2181,-9.8714,-0.2124,0.0049,-9.8714,0.0081,1.4077,1.3874,1658
-0.2161,-9.872,-0.2106,0.0033,-9.872,0.0084,1.3925,1.3858,1659
-0.216,-9.8725,-0.2088,0.004,-9.8725,0.0134,1.4161,1.3983,1660
-0.2211,-9.8714,-0.2115,0.0082,-9.8714,0.0277,1.4363,1.3988,1661
-0.2104,-9.8722,-0.2047,0.0031,-9.8722,0.0113,1.4143,1.4016,1662
-0.2112,-9.872,-0.2077,0.0025,-9.872,0.011,1.4157,1.4106,1663
-0.21,-9.8714,-0.2061,0.0028,-9.8714,0.0081,1.4203,1.4022,1665
-0.2148,-9.8722,-0.2068,0.0045,-9.8722,0.0132,1.4357,1.4026,1666
-0.2205,-9.8725,-0.214,0.0043,-9.8725,0.014,1.4398,1.4163,1668
-0.2194,-9.872,-0.2146,0.0033,-9.872,0.0126,1.4297,1.3971,1669
-0.2148,-9.8719,-0.21,0.0041,-9.8719,0.0112,1.4291,1.399,1670
-0.0933,-9.8437,0.1546,0.3174,-9.8437,1.4798,5.9558,3.013,1671
-0.3156,-9.8956,0.8452,2.0314,-9.8956,2.6659,5.7653,2.3525,1672
-0.6073,-9.8745,-0.0626,0.3421,-9.8745,0.8574,3.1711,1.5562,1673
-0.8748,-9.8746,0.0245,0.5978,-9.8746,1.1001,4.1572,2.2068,1675
-7.8165,-9.8751,-0.3281,1.5828,-9.8751,1.9223,5.627,1.8974,1676
-1.2175,-9.8799,-0.2421,0.3711,-9.8799,0.556,2.9105,1.596,1677
-1.5741,-9.8461,-0.2244,0.7047,-9.8461,1.6396,4.434,2.5633,1678
-0.2302,-9.8752,-0.1617,0.0491,-9.8752,0.1012,1.4913,1.4097,1679
-0.1648,-9.8714,-0.1547,0.0098,-9.8714,0.0167,1.4143,1.4001,1680
-0.1574,-9.8735,-0.1516,0.0047,-9.8735,0.0162,1.4057,1.3895,1682
-0.149,-9.8727,-0.1473,0.0016,-9.8727,0.009,1.401,1.3922,1683
-0.1565,-9.8713,-0.1477,0.0042,-9.8713,0.0191,1.4295,1.4088,1684
-0.1522,-9.8719,-0.1483,0.0024,-9.8719,0.0148,1.4161,1.3959,1685
-0.1547,-9.8724,-0.1487,0.0033,-9.8724,0.0146,1.4265,1.401,1686
-0.1561,-9.8723,-0.1518,0.0033,-9.8723,0.0132,1.4228,1.3936,1687
-0.1632,-9.8715,-0.1528,0.0051,-9.8715,0.0148,1.4315,1.3971,1688
-0.155,-9.8707,-0.1498,0.003,-9.8707,0.0063,1.4134,1.4,1689
-0.1564,-9.8714,-0.1495,0.004,-9.8714,0.0147,1.4335,1.4121,1690
-0.1573,-9.8713,-0.1505,0.0055,-9.8713,0.0174,1.4331,1.4205,1691
-0.1601,-9.872,-0.1514,0.0036,-9.872,0.0168,1.4466,1.4084,1693
-0.1626,-9.8722,-0.1523,0.0061,-9.8722,0.0089,1.4309,1.4172,1694
-0.1666,-9.8721,-0.1556,0.0049,-9.8721,0.0126,1.4385,1.4129,1695
-0.1584,-9.8727,-0.152,0.005,-9.8727,0.0102,1.421,1.4063,1696
-0.1588,-9.8711,-0.1538,0.0038,-9.8711,0.0147,1.4317,1.4151,1697
-0.1719,-9.8719,-0.1527,0.0105,-9.8719,0.0176,1.4143,1.3983,1698
-0.1736,-9.8715,-0.1498,0.0082,-9.8715,0.0208,1.4331,1.3971,1700
-0.1682,-9.8724,-0.1559,0.0054,-9.8724,0.0162,1.4265,1.3973,1701
-0.4433,-9.8692,-0.1589,0.175,-9.8692,0.4617,2.0078,1.5235,1702
-5.8638,-9.8362,-0.3807,2.8784,-9.8362,3.6295,9.824,4.5065,1703
-0.1714,-9.873,-0.1232,0.0225,-9.873,0.0447,1.5072,1.4179,1704
