AYGX_min,AZ_mean,AYGX_mean,AYGX_std,AZ_mean.1,GX_std,Gnorm_max,Gnorm_median,timestamp
-15.7934,-9.6026,-5.9765,6.0773,-9.6026,0.9165,23.5824,18.5123,1254
-6.0752,-9.6639,0.162,3.1361,-9.6639,2.8385,46.3167,40.7958,1256
-2446.0245,-5.748,-234.0698,490.6455,-5.748,39.3887,143.9278,63.8576,1257
-376.413,0.2854,-44.4004,110.8613,0.2854,9.287,35.6727,3.4026,1258
-0.6664,0.2538,0.1996,0.5585,0.2538,0.0569,3.3694,3.3386,1259
