AYGX_min,AZ_mean,AYGX_mean,AYGX_std,AZ_mean,GX_std,Gnorm_max,Gnorm_median,timestamp
-0.1839,-9.8074,0.404,0.6252,-9.8074,1.4151,4.2606,3.0087,185
-0.5915,-9.8106,-0.4087,0.1383,-9.8106,0.1664,2.9226,2.825,186
0.0517,-9.8048,0.3605,0.2517,-9.8048,0.2941,3.4389,3.2456,187
-0.6236,-9.8022,-0.0333,0.3756,-9.8022,1.3712,5.3015,3.7201,188
-2.0504,-9.7588,-0.2467,0.6917,-9.7588,3.8743,19.639,14.4466,189
-3.2981,-9.7469,0.1047,1.7721,-9.7469,7.2897,21.5206,12.6632,190
-2.5729,-9.9016,1.9993,2.6205,-9.9016,5.5006,23.0268,17.6591,191
-4.7508,-9.3638,0.9139,2.9101,-9.3638,3.8002,29.5418,13.6858,192
-2.4228,-9.8382,0.4029,1.4803,-9.8382,3.8489,26.5071,17.3159,193
-5.1654,-9.9539,0.5729,2.9235,-9.9539,5.3795,30.6563,24.4719,194
-2.6213,-9.9752,0.6731,2.1899,-9.9752,5.1954,18.2312,7.6208,195
-4.5739,-9.8037,-1.4316,1.3994,-9.8037,1.6139,6.7074,3.999,196
-0.4926,-9.7828,-0.1177,0.1612,-9.7828,0.2142,2.8036,2.7476,197
-0.2971,-9.7879,-0.1625,0.1046,-9.7879,0.1637,2.7463,2.7174,198
-0.565,-9.7891,-0.2034,0.137,-9.7891,0.2191,2.8892,2.7293,199
-0.4404,-9.7895,-0.1434,0.1268,-9.7895,0.3056,3.0647,2.7537,200
-3.1324,-9.7367,0.9534,3.3396,-9.7367,4.0767,8.8127,3.7335,201
-1.1876,-9.7469,1.7729,3.0002,-9.7469,2.8217,13.6789,8.3152,202
-5.909,-9.4532,-1.8042,3.365,-9.4532,2.8049,14.1663,12.0235,203
-2.6192,-9.7794,0.0713,1.897,-9.7794,1.0984,12.3666,10.3722,204
-0.6224,-9.7681,0.5949,1.0289,-9.7681,1.9877,12.3991,5.148,205
-1.5029,-9.6886,0.0116,0.5198,-9.6886,1.1573,12.7749,5.0969,206
-0.7662,-9.9828,0.0221,0.5011,-9.9828,0.743,7.1785,6.0119,207
-1.0295,-9.8223,0.4538,0.9618,-9.8223,0.3509,13.2952,10.2403,208
-11.1118,-9.7256,-1.0739,2.2816,-9.7256,2.4259,40.0315,31.8957,209
-6.52,-10.0666,0.6428,2.5889,-10.0666,1.8774,46.5256,30.3268,210
-7.0217,-9.5326,0.7236,3.363,-9.5326,3.3042,26.5681,8.0699,211
-0.5128,-10.0904,0.0586,0.3053,-10.0904,0.6036,8.3567,6.1659,212
-2.3374,-10.0512,-0.498,0.8249,-10.0512,1.7852,19.9,18.7348,213
-0.913,-9.7854,-0.1668,0.3937,-9.7854,0.7689,29.0317,27.5828,214
-0.3188,-9.7216,0.1636,0.4338,-9.7216,0.9098,12.7048,4.5619,215
-0.4806,-9.9916,-0.0044,0.2977,-9.9916,0.3658,9.9852,8.8649,216
-0.559,-9.8354,0.0472,0.2513,-9.8354,1.4097,8.6005,6.4028,217
-1.9133,-9.5681,0.9901,1.6388,-9.5681,1.3904,19.1522,6.9914,218
-4.0805,-9.8193,-0.4012,1.3224,-9.8193,1.797,19.5667,5.6846,219
-4.3116,-9.8271,0.0255,1.5758,-9.8271,1.6247,11.2783,8.1824,220
-1.6789,-9.6748,-0.5739,0.7412,-9.6748,1.2268,9.7579,8.037,221
-0.9791,-9.7848,-0.1102,0.447,-9.7848,0.983,9.7917,6.8874,222
-1.6207,-9.7206,0.6304,1.253,-9.7206,1.1017,10.189,8.5823,223
-3.078,-9.8845,-0.1776,1.9378,-9.8845,0.4321,12.7863,11.3555,224
-0.5598,-9.8401,0.2735,0.5466,-9.8401,0.8589,13.6155,8.9275,225
-1.9625,-9.5059,-0.1069,0.9362,-9.5059,1.0923,7.681,4.558,226
-1.5306,-9.7734,0.0302,0.7288,-9.7734,1.4767,18.3083,4.3804,227
-2.0626,-9.7438,-0.3193,0.8844,-9.7438,1.6053,17.0281,6.8918,228
-2.4444,-9.8502,-0.2809,1.2087,-9.8502,2.0145,22.232,13.4847,229
-6.1515,-9.8675,-0.7648,2.0233,-9.8675,3.4652,41.629,24.969,230
-2.8342,-8.5888,1.8154,3.8656,-8.5888,4.1609,34.5613,31.8623,231
-70.748,-9.5819,-13.4216,24.8721,-9.5819,2.6914,21.1374,12.8441,232
0.033,-9.8771,1.0066,1.2591,-9.8771,1.0459,15.3976,11.721,233
-0.1753,-9.7956,0.4038,0.566,-9.7956,0.7022,21.6724,17.0377,234
-2.2577,-9.7627,0.3173,1.3196,-9.7627,2.3033,10.5841,6.0153,235
-2.1502,-9.7718,-0.0086,0.7973,-9.7718,1.7968,9.4796,5.9313,236
-0.3522,-9.8239,0.1054,0.2743,-9.8239,0.4528,9.0133,3.9347,237
-0.4791,-9.9311,-0.0044,0.2258,-9.9311,0.891,5.4634,3.4089,238
-2.3881,-9.8642,0.2443,1.4384,-9.8642,2.6244,11.5943,7.4799,239
-0.7742,-9.7672,0.0676,0.3558,-9.7672,0.7835,5.5437,3.6124,240
-1.0657,-9.8416,0.1617,0.5111,-9.8416,1.4588,11.2,5.2321,241
-1.7973,-9.7579,-0.3676,0.7231,-9.7579,1.3185,10.3757,4.5061,242
-0.3226,-9.9062,0.8955,0.9521,-9.9062,0.6167,15.5847,14.139,243
-6.6297,-9.6752,1.3517,6.9154,-9.6752,2.7194,30.5228,21.7809,244
-1.1406,-9.8196,0.1572,1.11,-9.8196,1.6379,9.8541,4.6494,245
-5.0557,-8.9757,0.1724,1.8533,-8.9757,2.8648,23.0487,8.8509,246
-2.566,-9.8324,0.4843,1.4619,-9.8324,3.4137,12.0332,7.7394,247
-1.0731,-9.7241,2.0044,3.0986,-9.7241,3.1215,12.6455,10.0717,248
-4.4567,-9.9352,0.3449,1.7433,-9.9352,4.673,19.0968,7.4993,249
-1.3324,-9.6565,0.0864,0.7715,-9.6565,1.7429,12.6613,4.3498,250
-1.7574,-9.8881,0.0582,0.99,-9.8881,2.0761,11.8081,5.2773,251
-0.7129,-9.7939,0.1281,0.5006,-9.7939,1.4546,6.7495,4.2623,252
-0.2092,-9.469,0.0864,0.2038,-9.469,1.0869,7.9403,4.6684,253
-1.1428,-9.4541,-0.0863,0.6074,-9.4541,0.8864,4.9509,2.8899,254
-1.286,-9.8672,0.0592,0.6592,-9.8672,1.4886,6.8254,4.6377,255
-0.9244,-9.7731,-0.0119,0.2689,-9.7731,0.7088,6.3123,2.8915,256
-0.6953,-9.9173,-0.0537,0.4799,-9.9173,2.0118,6.9584,4.2411,257
-0.4055,-9.6361,0.3401,0.7635,-9.6361,1.7056,7.7053,6.3299,258
-2.7058,-9.7724,-0.1098,0.9347,-9.7724,1.4966,10.8118,4.6792,259
-13.9166,-9.7521,-0.1325,3.6488,-9.7521,2.2019,32.8053,14.6777,260
-5.7764,-10.0038,0.7692,4.2131,-10.0038,2.2076,34.5273,25.7101,261
-7.3269,-9.9779,0.4178,3.3499,-9.9779,5.5623,46.6937,38.6273,262
-7.7155,-10.2573,1.5409,5.7932,-10.2573,2.8754,37.7727,31.9298,263
-2.9509,-9.1397,2.7395,4.1238,-9.1397,1.3698,16.9738,11.551,264
-2.1299,-9.4379,0.3611,1.6747,-9.4379,3.1328,14.4861,6.6162,265
-12.7157,-9.5139,-0.0349,5.6234,-9.5139,5.414,28.6208,9.9214,266
-4.8292,-8.9791,0.0898,1.744,-8.9791,3.7126,34.9039,9.775,267
-1.6903,-9.4916,0.0131,1.4593,-9.4916,1.6469,28.7471,9.035,268
-5.46,-9.2511,0.5801,3.9814,-9.2511,4.2057,41.2374,10.8632,269
-18.4277,-9.8465,-0.6442,4.3585,-9.8465,4.1861,21.9833,6.5998,270
-3.1408,-9.8025,0.0731,1.779,-9.8025,3.8972,10.1816,5.1413,271
-2.4278,-9.8432,0.0026,1.0158,-9.8432,2.0814,19.8163,4.7501,272
-2.6098,-9.905,0.2578,1.8709,-9.905,1.3089,5.6529,4.0219,273
-0.6882,-9.9288,0.4197,0.6713,-9.9288,3.101,10.7624,6.1653,274
-0.5916,-9.7693,0.8349,1.1159,-9.7693,3.742,10.7067,4.8875,275
-2.6344,-9.8583,-0.1677,1.8712,-9.8583,1.83,9.5826,5.5468,276
-3.9997,-8.918,1.8558,4.5896,-8.918,6.3157,24.5298,9.9533,277
-1.7991,-9.7878,1.8617,2.4937,-9.7878,4.9889,19.0293,7.3898,278
-2.3059,-9.6726,0.6635,2.1715,-9.6726,3.6081,14.8518,7.0682,279
-1.7789,-9.6358,0.4894,1.3938,-9.6358,3.4343,7.4546,5.998,280
-1.1503,-9.8434,0.1811,0.6373,-9.8434,1.226,7.6178,5.6456,281
-0.7438,-9.8409,0.0107,0.6636,-9.8409,1.1423,7.5672,4.4148,282
-0.3622,-9.2125,1.3572,1.7856,-9.2125,4.3486,8.328,5.5164,283
-1.5934,-9.8623,-0.026,1.0284,-9.8623,1.5038,12.609,7.9369,284
-1.5005,-9.6944,0.5852,1.2,-9.6944,3.2028,9.5198,5.7039,285
-0.55,-10.2497,0.5203,1.0913,-10.2497,2.6484,6.3233,4.6314,286
-1.5324,-9.9517,0.8975,1.7177,-9.9517,3.399,11.2185,5.7162,287
-1.2754,-9.717,0.737,2.0113,-9.717,4.317,11.5414,6.6226,288
-8.2356,-9.6415,-0.104,2.2681,-9.6415,2.4058,28.1146,5.3263,289
-38.3321,-9.9001,0.1286,12.4109,-9.9001,7.938,18.9003,10.4929,290
-4.5981,-9.6142,0.39,2.2285,-9.6142,3.4927,15.1937,8.1871,291
-1.1406,-9.8022,0.7095,1.2268,-9.8022,3.2744,9.0825,6.5063,292
-3.1625,-9.7686,0.7774,2.716,-9.7686,3.1849,11.9211,7.7531,293
-4.0254,-9.8628,0.6178,2.184,-9.8628,3.8228,8.6338,6.5241,294
-2.6852,-9.783,1.0335,1.5091,-9.783,4.1663,9.3022,5.7299,295
-0.5104,-9.8531,1.0926,1.1828,-9.8531,3.6765,9.2447,6.6073,296
-2.935,-9.794,0.4942,1.5024,-9.794,3.3085,9.1004,5.2564,297
-0.9862,-9.7991,0.4615,1.9536,-9.7991,2.7571,19.6145,6.9427,298
-1.9982,-9.8181,0.1348,0.7676,-9.8181,3.1515,9.7299,5.3986,299
-0.7334,-9.887,0.4716,1.0505,-9.887,2.853,6.8916,4.5535,300
-1.8898,-9.619,0.0051,0.8311,-9.619,1.8334,8.0927,3.3127,301
-0.1646,-9.914,0.578,0.7491,-9.914,2.1071,5.8807,3.218,302
-0.403,-9.7381,1.4115,1.4601,-9.7381,3.2554,7.7893,4.7932,303
-0.2278,-9.7436,0.3757,0.3424,-9.7436,1.8671,7.623,3.1899,304
-1.4407,-9.6884,0.4118,1.0712,-9.6884,1.6138,8.9539,4.6431,305
-0.8598,-9.7168,1.3649,1.8008,-9.7168,2.2719,6.8968,6.2628,306
-1.5598,-9.9152,0.8601,1.6007,-9.9152,3.5834,10.0105,6.4505,307
-1.217,-9.7841,-0.0538,0.3133,-9.7841,1.1204,7.0584,3.5902,308
-0.1695,-9.7993,0.0554,0.2069,-9.7993,1.37,6.3074,3.9682,309
-1.8801,-9.8825,-0.0875,0.9165,-9.8825,1.4643,6.9144,4.8647,310
-3.1793,-9.7512,1.093,2.3404,-9.7512,3.4704,16.0272,8.5677,311
-4.5984,-9.4327,0.5421,2.7605,-9.4327,3.1167,15.3673,8.5589,312
-0.537,-9.5457,1.1084,1.4758,-9.5457,1.5204,6.5454,5.0504,313
-2.5163,-9.7801,1.9659,3.2773,-9.7801,2.8135,19.9121,10.7158,314
-4.2202,-9.6482,1.1032,4.5394,-9.6482,5.676,21.4192,11.7494,315
-2.9951,-10.4563,-0.2085,1.2526,-10.4563,2.6972,13.2834,8.4104,316
-4.7951,-9.754,0.5874,1.9412,-9.754,2.8774,12.7467,5.5777,317
-2.1417,-9.9193,0.4508,1.8979,-9.9193,3.0488,8.3514,4.6981,318
-0.8759,-9.5426,0.2918,0.8229,-9.5426,1.8585,20.5661,4.0797,319
-1.3349,-9.8579,0.5804,1.1833,-9.8579,3.4057,10.2577,5.3583,320
-1.0513,-9.9578,0.7291,2.1556,-9.9578,3.239,9.0854,5.6324,321
-0.6085,-9.4826,0.16,0.7823,-9.4826,1.759,12.27,4.6178,322
-1.0929,-9.9424,-0.0357,0.6198,-9.9424,0.9033,10.0756,4.7257,323
-1.1864,-9.7896,0.993,1.5873,-9.7896,2.0158,10.5424,6.9929,324
-2.9603,-9.8284,0.9432,2.7633,-9.8284,4.8244,12.7111,9.0751,325
-1.2661,-10.108,1.2753,2.5097,-10.108,4.3196,14.0965,11.815,326
-1.9304,-9.7856,0.7829,1.5085,-9.7856,3.8453,10.051,6.8166,327
-1.5991,-9.7086,0.3178,0.8998,-9.7086,2.4523,14.4372,5.0119,328
-2.7493,-9.602,0.6382,2.3083,-9.602,3.4609,10.8038,6.1366,329
-0.5286,-9.6463,0.0238,0.3222,-9.6463,1.4974,7.1852,3.6095,330
-0.8163,-9.803,0.2458,0.6629,-9.803,3.1501,8.5295,5.4186,331
-0.2931,-9.952,0.7825,1.0906,-9.952,1.8648,5.9515,4.6438,332
-0.2108,-9.8763,-0.0113,0.13,-9.8763,0.5133,3.6358,2.5807,333
-0.5479,-9.7918,0.0421,0.3182,-9.7918,1.3496,7.0986,4.9613,334
-0.5694,-9.8918,0.377,0.9714,-9.8918,1.871,10.1977,7.1215,335
-0.3346,-9.8443,0.1972,0.3037,-9.8443,2.0155,9.1939,7.224,336
-0.3657,-9.8328,0.0435,0.2475,-9.8328,1.7126,8.5102,6.6197,337
-1.7692,-9.7439,0.446,1.1057,-9.7439,2.7451,9.992,5.7182,338
-3.0818,-9.808,0.9742,2.2932,-9.808,3.9933,10.8389,5.9017,339
-6.8718,-9.776,0.2593,2.7395,-9.776,2.2035,19.5494,8.4581,340
-2.0406,-9.9068,1.3131,3.912,-9.9068,3.8059,14.9087,9.9851,341
-2.6614,-8.1961,9.1915,15.5371,-8.1961,10.7898,26.5131,23.6513,342
-3.2361,-9.7987,10.7225,11.6763,-9.7987,3.6602,16.3309,15.5649,343
0.1092,-9.792,0.7627,0.4724,-9.792,1.1015,8.3533,6.4164,344
-2.3185,-9.6884,-0.0658,1.3811,-9.6884,4.4841,12.9453,6.4339,345
-2.4792,-9.6042,-0.3116,1.3952,-9.6042,1.8808,20.1036,10.7833,346
-8.0754,-9.5703,-0.0462,4.0161,-9.5703,4.6519,32.6067,10.0386,347
-11.7725,-9.3345,-0.5022,3.594,-9.3345,3.6581,21.2351,7.1654,348
-3.1283,-9.7286,0.0188,1.5553,-9.7286,3.321,10.7614,6.4669,349
-2.1898,-10.1673,-0.529,1.0071,-10.1673,1.7691,8.8517,5.685,350
-3.7802,-10.1348,1.9275,2.7429,-10.1348,2.0346,10.8486,9.2263,351
-1.0308,-9.5191,0.1254,0.9614,-9.5191,1.8973,8.7395,3.8723,352
-1.0704,-10.099,0.286,1.1089,-10.099,1.6813,10.1309,5.6656,353
-1.0231,-9.972,0.2724,0.8059,-9.972,1.3336,9.1627,5.6137,354
-5.5201,-9.9433,0.2501,1.8798,-9.9433,3.364,9.7608,5.4987,355
-2.5314,-9.7952,0.8219,1.9533,-9.7952,5.9243,12.6158,9.878,356
-2.8881,-9.4556,0.6536,1.5141,-9.4556,3.4254,13.2726,7.8332,357
-1.146,-9.7384,0.7133,1.271,-9.7384,3.5909,12.7569,6.2478,358
-1.1534,-9.9428,0.3039,0.9787,-9.9428,2.8372,12.947,4.9047,359
-0.5801,-9.8103,1.1546,1.3765,-9.8103,2.492,8.5999,6.9315,360
-1.0705,-9.7055,0.1327,0.5943,-9.7055,1.2615,7.6498,4.189,361
0.1318,-9.4568,1.3502,1.5354,-9.4568,3.7425,10.2629,5.8297,362
-0.9497,-9.803,0.612,1.7477,-9.803,3.0112,9.3463,4.8677,363
-2.6138,-9.8393,1.0979,2.5769,-9.8393,1.191,9.7923,7.9207,364
-7.3855,-9.8023,0.7799,2.2833,-9.8023,4.1071,15.4876,6.5713,365
-1.617,-9.7078,0.0996,1.256,-9.7078,2.2789,8.1161,5.516,366
-1.2529,-9.8242,0.0582,0.4404,-9.8242,1.7918,7.7571,4.0598,367
-10.3829,-9.7376,-0.2555,2.3976,-9.7376,2.5206,15.7595,6.1272,368
-2.5912,-9.7421,-0.1092,1.1413,-9.7421,1.4413,16.8231,5.5869,369
-2.3723,-10.1148,0.2034,1.7608,-10.1148,1.8887,10.9371,8.7711,370
-3.1534,-9.8329,0.2827,1.2891,-9.8329,2.4567,15.8781,11.2949,371
-0.1459,-10.4445,0.5081,0.7443,-10.4445,1.0064,14.5456,12.3788,373
-7.3867,-8.8493,3.4753,7.6261,-8.8493,1.7233,21.6446,16.28,374
-1.9986,-9.9186,0.5884,1.8804,-9.9186,1.2886,14.1104,10.5084,375
-2.507,-9.838,0.5616,2.5162,-9.838,3.268,30.7099,15.3477,376
-5.1055,-10.2117,1.4623,3.2993,-10.2117,2.1598,24.3638,15.2602,377
-6.4643,-9.8416,3.0151,4.0515,-9.8416,3.7796,26.6132,20.0378,378
-0.5656,-9.8417,0.0129,0.2996,-9.8417,1.4263,11.076,9.0861,379
-5.5013,-9.8312,0.3104,2.5855,-9.8312,3.8503,24.1072,16.761,380
-1.3951,-9.6259,1.3191,2.1213,-9.6259,2.1703,17.5484,8.0757,381
-4.6691,-9.8151,-0.7121,1.6858,-9.8151,0.7902,21.3513,18.9784,382
-1.1366,-10.1143,0.4782,1.1158,-10.1143,2.4928,9.7675,3.9545,383
-2.2351,-9.4103,0.562,1.9757,-9.4103,1.8595,8.6645,6.8582,384
-2.5101,-9.659,-0.444,1.5244,-9.659,2.5623,9.4547,5.4223,385
-1.1118,-9.7663,0.416,0.914,-9.7663,3.3719,9.2517,5.0059,386
-3.1728,-9.8547,0.6351,1.9649,-9.8547,3.5337,14.5125,5.6017,388
-1.7,-9.8777,0.1796,0.8772,-9.8777,2.5843,7.8803,6.4807,389
-3.8785,-9.8249,-0.047,1.4339,-9.8249,2.0169,7.093,5.153,390
-1.3108,-9.65,0.0772,0.9089,-9.65,1.0114,7.1762,5.8378,391
-0.845,-9.7487,0.1424,0.6329,-9.7487,1.1122,8.0114,5.0706,392
-0.2562,-9.7145,0.2609,0.3372,-9.7145,0.7135,4.7792,4.0731,393
-0.0412,-9.7624,-0.0034,0.026,-9.7624,0.3891,4.3204,3.5767,394
-0.4176,-9.8038,-0.0449,0.2674,-9.8038,0.8708,7.1035,5.0676,395
-2.2192,-9.891,0.5837,1.8835,-9.891,3.2471,10.3268,6.0053,396
-1.22,-9.7177,0.6585,1.3477,-9.7177,1.5081,6.9916,5.8766,397
-1.0572,-9.7409,0.4312,0.89,-9.7409,1.4023,9.0874,4.0086,398
-1.776,-9.6748,0.3783,1.1381,-9.6748,3.1027,10.7589,4.9884,399
-3.5039,-9.2071,1.2915,4.296,-9.2071,5.8729,34.2974,12.9809,400
-1.0809,-9.632,1.5234,1.9002,-9.632,4.2011,11.4755,6.7203,401
-1.5946,-9.5899,0.1466,1.2511,-9.5899,1.3501,11.2218,3.1825,402
-0.5654,-10.1981,-0.14,0.296,-10.1981,0.9936,10.1786,1.9117,403
-3.3882,-9.7806,-0.1284,1.6499,-9.7806,1.6214,25.0693,13.6232,404
-1.819,-9.2733,3.3783,4.5138,-9.2733,2.9927,16.6623,10.7088,405
-2.25,-10.018,-0.1292,0.856,-10.018,2.249,13.4162,5.0483,406
-1.0181,-9.7205,-0.0837,0.6978,-9.7205,0.573,5.4956,4.9283,407
-5.06,-9.9396,-0.721,3.0552,-9.9396,1.3047,21.3825,18.398,408
-7.8947,-9.8053,0.3336,3.4046,-9.8053,3.8633,20.0124,8.1359,409
-5.6011,-9.7793,1.3815,4.4754,-9.7793,6.5522,16.1236,12.4052,410
-0.6923,-9.7279,1.0739,1.7934,-9.7279,2.2318,8.7005,6.4081,411
-0.1934,-9.741,0.2476,0.5309,-9.741,1.9826,8.6735,4.6492,412
-0.8784,-9.8905,0.0509,0.7434,-9.8905,2.4447,8.2871,6.4461,413
-1.0573,-9.5369,0.016,0.4331,-9.5369,1.1512,4.1883,2.9165,414
-0.5806,-9.827,0.0972,0.3441,-9.827,1.0647,6.3867,3.2748,415
-2.8953,-9.8018,0.3894,1.4854,-9.8018,4.2943,10.4603,6.2026,416
0.015,-9.7884,0.8436,0.6219,-9.7884,3.0376,6.2249,4.3103,417
-2.2051,-9.9475,0.7041,1.5409,-9.9475,2.5772,8.1095,6.3647,418
-2.142,-9.7784,0.445,1.329,-9.7784,3.032,10.7333,6.2857,419
-0.7216,-9.8239,-0.0116,0.3614,-9.8239,1.1625,7.5359,5.0457,420
-1.9887,-9.3537,-0.1884,0.6021,-9.3537,1.1355,12.4251,3.9733,421
-1.3692,-10.0215,0.1028,1.2236,-10.0215,1.2576,8.5691,5.2776,422
-0.1369,-9.1392,0.1082,0.2958,-9.1392,1.2256,5.0425,3.9171,423
-0.7647,-9.952,0.3566,0.6798,-9.952,1.8592,6.5177,4.7255,424
-1.3354,-9.8346,-0.1411,0.3411,-9.8346,0.9511,10.7017,3.3035,425
-0.1694,-9.8328,0.0013,0.0853,-9.8328,0.464,5.6977,2.7342,426
-0.0836,-9.8583,0.0166,0.0768,-9.8583,0.4682,5.8659,2.8419,427
-0.3515,-9.8439,-0.0086,0.1585,-9.8439,0.6269,6.1726,3.4069,428
-0.1555,-9.8053,0.0101,0.0804,-9.8053,0.2776,6.0244,4.4798,429
-0.5213,-9.8097,0.0623,0.2325,-9.8097,0.9099,5.8275,4.4477,430
-0.6875,-9.8439,-0.1501,0.252,-9.8439,0.8005,4.9616,3.8768,431
-2.6845,-9.8411,-0.5963,0.7382,-9.8411,0.9732,4.9113,3.8586,432
-0.8942,-9.8085,-0.2662,0.3099,-9.8085,0.5015,3.6703,2.7036,433
-0.3525,-9.811,-0.2831,0.0526,-9.811,0.1176,2.8843,2.7998,434
-0.4066,-9.8078,-0.3073,0.0899,-9.8078,0.1731,2.885,2.8441,435
-0.3129,-9.8076,-0.2082,0.0375,-9.8076,0.0728,2.83,2.7726,436
-0.3959,-9.8075,-0.2949,0.0611,-9.8075,0.127,2.8501,2.8105,437
-0.3064,-9.8032,-0.2374,0.0531,-9.8032,0.1044,2.819,2.7694,438
-0.5235,-9.8069,-0.3986,0.1322,-9.8069,0.2926,2.9259,2.868,439
-0.1954,-9.8076,-0.0779,0.0634,-9.8076,0.1469,2.791,2.7415,440
-0.3182,-9.8086,-0.2801,0.0393,-9.8086,0.0703,2.8529,2.82,441
-0.2898,-9.8063,-0.2294,0.0346,-9.8063,0.0678,2.8126,2.7892,442
-0.2612,-9.807,-0.2277,0.024,-9.807,0.0497,2.8058,2.7757,443
-0.2377,-9.8079,-0.2185,0.0142,-9.8079,0.0273,2.7947,2.7661,444
-0.9242,-9.8077,-0.5077,0.2112,-9.8077,0.3773,3.2205,2.8834,445
0.0458,-9.7752,1.1662,0.8209,-9.7752,1.2966,4.8144,3.2753,446
-0.9358,-9.777,-0.1687,0.3177,-9.777,1.025,12.3093,10.7742,447
-1.8001,-9.82,-0.3561,0.7894,-9.82,1.4929,9.7398,8.4696,448
-2.5871,-9.6329,3.5506,6.5819,-9.6329,7.5684,23.078,15.099,449
-3.9091,-9.8077,0.5946,1.8743,-9.8077,3.7811,12.38,6.7111,450
-0.289,-9.7075,0.1896,0.3519,-9.7075,1.7415,7.4961,4.1459,451
-2.5899,-9.8246,0.0273,0.738,-9.8246,1.6912,12.3726,4.0333,453
-0.7947,-9.791,0.0431,0.4144,-9.791,0.9843,6.2767,3.6708,454
-0.0599,-9.8421,0.287,0.4531,-9.8421,1.612,6.3345,4.6258,455
-0.4518,-9.7292,-0.1007,0.3194,-9.7292,0.5815,3.4659,2.8551,456
-0.4254,-9.8388,0.0248,0.37,-9.8388,0.7941,5.0021,3.7906,457
-0.2906,-9.9656,-0.0201,0.1939,-9.9656,0.5458,4.2888,2.8656,458
-3.5736,-9.8123,-0.2383,1.0909,-9.8123,1.5786,11.6184,4.2564,459
-2.1574,-9.7622,-0.2654,0.6989,-9.7622,1.4346,5.1558,3.3989,460
-0.9532,-9.9439,0.0274,0.3615,-9.9439,0.5746,6.8571,3.064,461
-0.2967,-9.8225,-0.0142,0.1395,-9.8225,1.0048,5.9768,3.7815,462
-0.2186,-9.9141,0.0528,0.1277,-9.9141,1.228,5.4378,3.3142,463
-0.8099,-9.8326,0.1076,0.3922,-9.8326,1.4387,7.0467,4.5263,464
-0.5519,-9.7474,1.0938,0.8354,-9.7474,1.2822,7.6991,7.1071,465
-0.0897,-9.839,0.0629,0.1267,-9.839,0.632,4.8077,4.278,466
-0.2443,-9.8395,-0.0315,0.1559,-9.8395,0.6549,4.2304,3.3999,467
-0.2185,-9.8644,0.3901,0.5695,-9.8644,0.5301,4.9924,4.3904,468
-0.3672,-9.8278,0.2201,0.3187,-9.8278,2.0474,8.8191,6.7475,469
-0.1159,-9.8343,0.0284,0.0791,-9.8343,0.544,4.4231,3.5508,470
-0.0042,-9.8214,0.0276,0.0267,-9.8214,0.1231,3.8377,2.706,471
-0.3919,-9.8199,0.0023,0.2533,-9.8199,1.0222,8.0702,5.7191,472
-1.0767,-9.8221,0.2387,0.6153,-9.8221,0.5157,9.2478,5.2452,473
-1.679,-9.8612,-0.4688,0.5658,-9.8612,1.0341,8.1805,3.9255,474
-1.2958,-9.7873,-0.1108,1.0747,-9.7873,1.9466,5.4331,3.5775,475
-0.4135,-9.8142,-0.1971,0.1535,-9.8142,0.4461,3.0554,2.9005,476
-0.1702,-9.8125,-0.1129,0.0371,-9.8125,0.1342,2.8208,2.7751,477
-0.1928,-9.8133,-0.156,0.0182,-9.8133,0.0385,2.8103,2.8013,478
-0.1937,-9.8109,-0.1589,0.0178,-9.8109,0.0468,2.8358,2.7991,479
-0.2062,-9.8113,-0.1359,0.0423,-9.8113,0.1369,2.8484,2.7816,480
-0.086,-9.8092,-0.0675,0.0142,-9.8092,0.0741,2.8296,2.7642,481
-0.258,-9.8114,-0.2257,0.0346,-9.8114,0.1108,2.8438,2.8247,482
-0.1687,-9.8107,-0.1337,0.0235,-9.8107,0.0745,2.839,2.79,483
-0.1752,-9.8107,-0.1449,0.0119,-9.8107,0.0297,2.8181,2.801,484
-0.1164,-9.8128,-0.0942,0.0155,-9.8128,0.0435,2.7655,2.7487,485
-0.1246,-9.8126,-0.1118,0.0103,-9.8126,0.0365,2.7962,2.776,486
-0.2445,-9.811,-0.2205,0.0266,-9.811,0.1005,2.8506,2.8209,487
-0.1394,-9.8109,-0.0845,0.0325,-9.8109,0.1188,2.7928,2.7652,488
-0.2256,-9.8114,-0.1886,0.0288,-9.8114,0.0754,2.8386,2.8039,489
-0.2145,-9.8097,-0.1452,0.065,-9.8097,0.1995,2.8334,2.7939,490
-0.3483,-9.812,-0.1903,0.1019,-9.812,0.3019,2.9375,2.7948,491
-0.3169,-9.8082,-0.2157,0.0722,-9.8082,0.1884,2.8593,2.7901,492
-0.1587,-9.81,-0.128,0.0186,-9.81,0.0607,2.8241,2.8053,493
-0.1368,-9.8107,-0.0678,0.0272,-9.8107,0.1071,2.7887,2.7508,495
-0.285,-9.811,-0.2363,0.0416,-9.811,0.0941,2.8944,2.8529,496
-0.2569,-9.8088,-0.1913,0.0371,-9.8088,0.0909,2.8742,2.8267,497
-0.1171,-9.8109,-0.0838,0.0252,-9.8109,0.0825,2.8206,2.7711,498
-0.2633,-9.8107,-0.1674,0.0777,-9.8107,0.2317,2.8942,2.8208,499
-0.2414,-9.8115,-0.1055,0.0659,-9.8115,0.2304,2.8784,2.7702,500
-0.2605,-9.8107,-0.2355,0.0296,-9.8107,0.1199,2.9112,2.8496,501
-0.3035,-9.7952,-0.1362,0.102,-9.7952,0.2574,2.9623,2.8327,502
-2.1751,-9.7995,-0.1104,0.9312,-9.7995,2.5132,6.2288,4.0017,503
-4.8979,-9.7756,-0.2492,2.362,-9.7756,1.2706,12.1811,6.8822,504
-1.2101,-9.7128,0.165,1.1893,-9.7128,2.1642,13.7482,12.0548,505
-1.5704,-9.6328,0.1619,1.2048,-9.6328,1.9805,8.2915,4.7492,506
-0.3886,-9.7447,-0.1287,0.1656,-9.7447,0.8783,6.7041,5.1814,507
-3.2844,-9.9713,-0.2771,1.4618,-9.9713,1.0438,8.9781,7.9886,508
-1.407,-9.8517,0.3832,1.1348,-9.8517,3.411,12.9208,5.4346,509
-0.7447,-9.8838,0.2602,0.7503,-9.8838,3.1166,17.2416,15.3041,510
-1.4717,-9.7036,2.899,2.9433,-9.7036,0.6673,16.9339,14.3846,511
-12.5627,-9.1913,-1.827,5.2769,-9.1913,6.0103,29.7989,9.6792,512
-16.1002,-9.3612,6.0845,10.3986,-9.3612,13.877,36.4436,26.2222,513
-9.5844,-10.1193,7.4421,11.1207,-10.1193,4.5083,43.304,23.7639,514
-3.9445,-9.541,0.1031,2.514,-9.541,0.8926,11.2108,7.3682,515
-2.3376,-9.9102,1.0266,1.9988,-9.9102,4.3836,12.9537,6.4191,516
-2.1536,-9.4498,0.1271,2.038,-9.4498,1.9095,9.6124,6.2247,517
-0.0122,-9.8569,0.8501,0.8761,-9.8569,2.632,6.5402,5.9776,518
-3.1236,-9.921,1.3073,2.1627,-9.921,4.2153,11.0308,7.1442,519
-2.1734,-9.5783,0.8064,1.7362,-9.5783,2.8105,13.9386,5.5387,520
-4.2927,-9.186,-0.33,1.4045,-9.186,2.2266,20.7845,4.9036,521
-2.0918,-9.8951,1.1999,2.2926,-9.8951,3.842,11.7188,7.346,522
-1.5271,-9.8638,1.352,3.1379,-9.8638,4.2769,13.1484,7.4732,523
-0.8322,-9.9009,0.0183,0.5964,-9.9009,1.7156,9.0191,4.0559,524
-1.9836,-8.6836,0.4367,1.4481,-8.6836,2.2179,12.7082,7.1188,525
-1.2499,-9.6571,0.1937,0.9597,-9.6571,0.453,12.3329,4.564,526
-0.8758,-9.7068,0.7286,1.0855,-9.7068,3.504,10.6506,6.3181,527
-3.0376,-10.1494,0.1615,2.3583,-10.1494,2.8203,10.0376,4.8903,528
-3.3049,-9.5884,0.544,1.9967,-9.5884,4.1566,14.9289,7.9326,529
-3.5701,-9.7074,0.4159,2.089,-9.7074,3.1977,13.0937,6.8845,530
-1.8854,-9.9918,0.1759,1.1326,-9.9918,2.7548,9.5959,6.1271,531
-1.6044,-9.8543,1.212,2.7821,-9.8543,4.5239,12.8059,7.2255,532
-3.4248,-9.6668,0.0515,1.1277,-9.6668,2.4711,12.4406,5.159,533
-0.6779,-10.0233,0.1221,0.6781,-10.0233,0.6222,7.0133,4.5883,534
-1.0236,-9.8849,-0.1971,0.6007,-9.8849,0.981,5.2425,4.2584,535
-1.3193,-9.7312,0.1018,0.8854,-9.7312,0.9147,8.8322,3.7954,536
-1.8548,-9.8193,0.0204,0.6166,-9.8193,1.3385,9.6749,4.041,537
-2.3948,-9.868,0.0823,0.7978,-9.868,2.0896,9.5587,5.2219,538
-1.7042,-9.8052,0.0992,0.6831,-9.8052,1.5153,8.4769,4.7967,539
-1.0422,-9.8283,0.0318,0.6447,-9.8283,1.2179,10.0093,4.8473,540
-0.3824,-9.8372,-0.0066,0.1859,-9.8372,0.7681,7.2547,3.6049,541
-0.5691,-9.9109,-0.0301,0.1959,-9.9109,0.6474,6.1329,3.4464,542
-0.8347,-9.8505,-0.0428,0.2956,-9.8505,0.8824,6.5263,3.3996,543
-0.2156,-9.8523,0.2316,0.2432,-9.8523,0.938,5.3922,3.9942,544
-0.291,-9.751,-0.0218,0.1414,-9.751,0.4492,6.5433,3.5866,545
-0.393,-9.8781,-0.0455,0.2014,-9.8781,0.4206,6.0646,4.715,546
-1.6974,-10.1993,-0.2591,0.785,-10.1993,1.1549,8.085,6.9052,547
-4.9879,-9.8529,-2.0505,1.6684,-9.8529,1.3887,6.8857,4.9611,548
-4.1853,-9.7901,-0.8039,1.9937,-9.7901,2.2166,4.5577,3.5927,549
-1.1527,-9.7934,0.7039,0.9733,-9.7934,1.2361,3.9974,3.2365,550
-1.5677,-9.7931,0.0389,0.8018,-9.7931,0.9957,3.3309,2.9694,551
-0.5199,-9.7891,-0.0092,0.4079,-9.7891,0.7636,3.1892,2.863,552
-0.7984,-9.795,0.1363,0.8267,-9.795,1.1397,3.358,2.7918,553
-0.9501,-9.8251,-0.7965,0.0914,-9.8251,0.1492,3.3377,3.1282,554
-2.2418,-9.7805,1.0075,1.9203,-9.7805,3.8826,19.5159,10.9196,555
-1.1444,-9.6963,2.9562,4.0002,-9.6963,6.6124,15.7537,9.3052,556
-5.2009,-9.8584,1.4613,2.4622,-9.8584,5.105,17.1469,10.6495,557
-0.8955,-9.7133,1.5301,2.2857,-9.7133,5.6463,13.0628,8.9284,558
-12.8394,-9.7005,3.1823,7.2714,-9.7005,10.6064,21.5135,14.1833,559
-1.7676,-10.0031,0.7468,1.5966,-10.0031,1.7021,16.4654,11.8918,560
-6.985,-9.6663,0.5483,4.8335,-9.6663,1.3263,13.5978,10.9455,561
-5.6202,-9.8678,-0.7704,2.301,-9.8678,3.2622,14.0109,8.5882,562
-1.3055,-9.8483,0.2665,1.2205,-9.8483,1.8393,11.2043,5.1834,563
0.0098,-8.3449,4.348,5.0635,-8.3449,6.4805,26.2279,13.464,564
-8.5697,-9.4037,0.7922,4.778,-9.4037,2.6713,26.8003,11.4089,565
-0.8244,-9.9633,0.2125,0.956,-9.9633,2.6317,9.6648,7.4975,566
-3.1199,-9.8251,2.0605,3.2265,-9.8251,7.3131,21.0211,13.1065,567
-3.2862,-9.8702,0.2091,1.612,-9.8702,3.5723,14.0587,9.0264,568
-2.0932,-9.754,0.8999,1.7935,-9.754,2.9672,9.6351,5.7212,569
-3.2493,-9.8861,-0.1773,1.654,-9.8861,2.0185,10.3603,5.9235,570
-0.5052,-10.0078,0.2021,0.7477,-10.0078,1.919,6.0908,4.7265,571
-0.9542,-9.7594,1.3567,3.3106,-9.7594,4.2453,11.1529,7.8472,572
-1.6532,-9.8137,1.0414,1.873,-9.8137,1.5702,12.4427,5.723,573
-0.9496,-9.9785,-0.1549,0.3728,-9.9785,1.2504,6.6609,3.6139,574
-1.1059,-9.8686,0.1804,0.6975,-9.8686,2.9557,6.5259,5.2424,575
-0.8649,-9.7796,0.1916,0.5154,-9.7796,1.476,8.6345,5.9899,576
-0.5863,-9.819,0.0422,0.3376,-9.819,1.0361,6.665,4.5892,577
-1.5569,-9.7698,0.6094,1.1872,-9.7698,2.8647,20.0098,8.9874,578
-1.5136,-9.8602,0.1945,1.0364,-9.8602,2.2809,10.2038,6.1981,579
-1.0692,-9.8127,0.196,0.783,-9.8127,1.0081,9.6514,5.8175,580
-2.4326,-9.9311,-0.0921,1.2512,-9.9311,1.4781,8.5235,5.0369,581
-1.4422,-9.7268,0.059,0.9867,-9.7268,1.5834,12.5455,11.4143,582
-1.1323,-9.9357,-0.018,0.5434,-9.9357,1.1018,5.9474,4.2994,583
-2.401,-9.7716,0.1181,1.3021,-9.7716,4.2474,9.0572,6.8856,584
-2.162,-9.7883,0.4644,1.799,-9.7883,4.6317,16.9321,11.9555,585
-3.209,-9.7942,0.0974,1.3108,-9.7942,2.7928,14.4564,7.7719,586
-5.3998,-9.8073,-0.2046,2.7711,-9.8073,1.2208,13.2055,9.9541,587
-13.8451,-9.6804,0.4302,5.3419,-9.6804,4.4232,35.7775,29.7911,588
-27.5986,-9.3531,0.7039,7.2702,-9.3531,6.4235,30.6099,19.8537,589
-5.1806,-9.9364,-0.3838,2.0247,-9.9364,3.1983,30.7005,22.2889,590
-0.8531,-9.9811,0.5484,1.4371,-9.9811,1.076,22.9241,19.3694,591
-2.1441,-9.8621,0.7038,2.0923,-9.8621,1.3817,18.132,11.6298,592
-1.1089,-9.7441,0.6673,1.1133,-9.7441,4.1589,10.209,6.7731,593
-0.9259,-9.7505,0.2862,0.8517,-9.7505,2.535,6.9216,4.7272,594
-0.865,-9.9118,0.4409,1.1478,-9.9118,3.4411,10.02,5.7918,595
-1.7225,-9.7543,-0.0301,0.8095,-9.7543,1.6377,7.2368,5.2553,596
-1.2258,-9.7946,0.1588,0.6108,-9.7946,2.2296,6.6246,4.7249,597
-1.1223,-9.8159,0.9159,1.6115,-9.8159,3.668,9.2308,6.033,598
-2.6972,-9.7771,0.7834,2.1316,-9.7771,3.2197,10.4448,5.1617,599
-1.2436,-9.8311,0.2871,0.7787,-9.8311,2.5923,7.2197,4.4358,600
-0.7333,-9.5864,0.2491,0.6708,-9.5864,1.2708,5.6541,3.0578,601
-0.8344,-9.8213,0.0453,0.4043,-9.8213,1.5573,6.5972,3.3217,602
-0.9922,-9.7823,0.0244,0.6636,-9.7823,3.0271,8.2424,5.5256,603
-0.2918,-9.7821,0.9196,0.9899,-9.7821,1.7701,6.3283,5.5411,604
-1.0215,-9.7646,0.8515,1.4167,-9.7646,3.4377,8.7521,7.2505,605
-0.1658,-9.7102,0.4725,0.5393,-9.7102,1.4941,6.8174,4.1234,606
-1.6058,-9.9778,-0.0351,0.7754,-9.9778,1.3399,6.2267,4.0828,607
-1.6351,-9.7643,0.1831,0.7759,-9.7643,2.2385,9.2386,3.7222,608
-0.5851,-9.8776,0.1479,0.6163,-9.8776,1.7844,7.2285,4.0236,609
-0.6107,-9.7181,0.6294,0.9174,-9.7181,2.5401,7.3483,4.829,610
-1.418,-10.1665,0.4596,1.3455,-10.1665,1.1295,12.3251,5.4575,611
-3.5024,-9.7522,0.4267,1.3402,-9.7522,3.5653,7.6774,5.8191,612
-1.4193,-9.779,0.3886,0.7548,-9.779,2.7035,6.5763,4.3403,613
-1.0438,-9.8388,0.3742,0.9406,-9.8388,2.6752,6.4278,4.5067,614
-0.9778,-9.8034,0.4842,1.185,-9.8034,3.9385,9.7495,5.3269,615
-0.5785,-9.8914,0.1938,0.5381,-9.8914,2.0655,6.9036,5.6911,616
-1.4777,-9.7292,0.6777,1.3146,-9.7292,3.2531,8.8058,5.3301,617
-2.6466,-9.799,0.254,1.019,-9.799,2.244,7.9662,4.3971,618
-1.6341,-9.8817,0.4041,1.0889,-9.8817,2.5314,9.061,4.0543,619
-2.5768,-9.8269,0.2563,1.2635,-9.8269,2.3565,7.9721,4.2136,620
-0.2225,-9.6319,0.1582,0.2946,-9.6319,1.7396,7.508,4.3876,621
-1.1061,-9.8652,0.8585,1.644,-9.8652,4.3113,9.1552,6.4208,622
-1.0508,-9.7572,0.3935,1.0916,-9.7572,2.4662,9.3789,4.7325,623
-0.3519,-9.843,0.2796,0.6021,-9.843,1.5753,8.8777,3.99,624
0.0186,-9.8933,1.6576,1.7116,-9.8933,3.2807,12.2665,6.7508,625
-0.7935,-10.0046,0.0325,0.5859,-10.0046,1.1454,6.8127,4.4528,626
-0.7096,-9.5746,0.103,0.5526,-9.5746,0.8641,7.05,3.6005,627
-0.8548,-9.7616,0.3383,0.6546,-9.7616,2.4339,7.0563,4.4983,628
-0.5952,-9.7847,-0.0563,0.3643,-9.7847,0.9402,6.9988,4.5383,629
-0.6116,-9.7875,0.1816,0.3905,-9.7875,1.5796,9.6179,5.4933,630
-2.3548,-9.3353,-0.0889,1.2554,-9.3353,3.9073,19.3252,8.3131,631
-4.0072,-9.7455,1.1277,3.0243,-9.7455,6.1798,18.0731,14.9712,632
-4.0444,-10.0302,2.2006,5.2008,-10.0302,4.8029,21.4849,11.212,633
-0.8299,-9.831,0.734,1.3021,-9.831,3.9608,13.1433,6.413,634
-0.8773,-9.8457,1.7402,2.284,-9.8457,1.6764,8.393,7.4665,635
-0.7967,-9.8039,0.2752,1.1866,-9.8039,2.5411,6.5314,4.6805,636
-0.7562,-9.8966,0.154,0.7115,-9.8966,0.8287,6.3536,4.2868,637
-0.3774,-9.8117,0.0776,0.2171,-9.8117,1.368,5.9518,4.081,638
-0.1668,-9.8695,-0.0161,0.1262,-9.8695,0.8166,5.0527,3.9515,639
-0.7217,-9.831,0.0915,0.422,-9.831,2.1294,10.8134,4.7494,640
-0.6612,-9.8225,0.2316,0.6185,-9.8225,0.9709,16.6194,10.301,641
-0.7509,-9.7915,0.5651,0.7361,-9.7915,0.715,17.4197,17.3466,642
-0.7642,-9.8264,0.5141,0.9615,-9.8264,1.3292,9.8374,7.695,643
-0.4753,-9.9222,-0.0548,0.2448,-9.9222,1.0948,16.9943,12.7503,644
-0.1353,-9.8279,-0.0002,0.1098,-9.8279,0.5419,8.1662,7.4814,645
-2.8989,-9.8502,-0.6663,0.9697,-9.8502,1.1369,4.9833,3.6436,646
-0.7411,-9.8202,-0.0368,0.2991,-9.8202,0.6514,3.3781,3.012,647
-0.6736,-9.8095,-0.4256,0.2091,-9.8095,0.4531,3.1052,3.0258,648
-0.6074,-9.8047,-0.2595,0.2278,-9.8047,0.4643,2.9743,2.769,649
-0.2429,-9.8074,-0.1989,0.0404,-9.8074,0.085,2.822,2.7819,650
-0.2016,-9.8053,-0.1746,0.0132,-9.8053,0.0223,2.8038,2.7613,651
-0.304,-9.807,-0.2439,0.0249,-9.807,0.0527,2.8756,2.794,652
-3.048,-9.7796,0.1048,1.6259,-9.7796,2.0757,7.1566,5.289,653
-0.1538,-9.6951,0.2049,0.2228,-9.6951,1.3371,9.2543,8.3761,654
-1.5309,-9.7579,-0.0878,0.6036,-9.7579,2.6947,11.783,6.475,655
-3.1118,-9.7761,-0.6902,1.3922,-9.7761,1.7137,13.5786,10.1707,656
-3.1226,-9.8311,-0.0376,0.9863,-9.8311,2.4295,8.3178,5.3192,657
-5.0517,-9.7853,1.1,2.9235,-9.7853,4.4526,16.094,8.9496,658
-2.2764,-9.968,0.2972,1.3496,-9.968,2.7429,11.2683,6.1241,659
-1.0782,-9.5112,1.9101,2.3047,-9.5112,2.5733,10.2839,9.1815,660
-1.7301,-9.6869,0.3794,1.4934,-9.6869,1.3697,6.4595,3.3751,661
-3.738,-9.5723,0.0967,1.7629,-9.5723,1.5903,8.5154,6.6773,662
-1.6318,-9.5402,-0.1285,1.0957,-9.5402,0.9054,8.7254,4.0747,663
-0.4827,-9.7808,0.3472,0.7304,-9.7808,2.0205,9.3314,5.5099,664
-3.2677,-9.8365,1.6795,2.5641,-9.8365,4.846,11.5634,7.8731,665
-1.3528,-10.4921,-0.0757,0.7037,-10.4921,2.845,8.4221,5.1422,666
-2.9002,-9.8005,0.3611,1.4037,-9.8005,3.126,9.9106,6.0239,667
-2.1763,-9.4725,1.6853,2.4756,-9.4725,4.8818,17.9679,9.5659,668
-11.0525,-10.1629,1.1419,3.9676,-10.1629,5.4029,25.9165,10.0704,669
-1.5986,-9.2915,0.7092,2.0121,-9.2915,2.49,11.1756,7.9591,670
-6.7005,-9.3948,4.8569,8.8139,-9.3948,2.3551,16.3581,14.0791,671
-1.3758,-10.161,0.7329,1.5158,-10.161,0.9574,7.3565,6.0982,672
-2.5996,-10.1063,4.0887,5.9329,-10.1063,2.3075,15.4538,11.2833,673
-0.1345,-9.7834,2.6337,2.8359,-9.7834,2.2629,11.5433,7.8519,674
-3.4993,-9.9238,0.8779,2.4059,-9.9238,4.3175,11.0832,6.4986,676
-1.4763,-9.6336,0.8421,1.5277,-9.6336,2.377,9.6513,5.3014,677
-1.5192,-9.8231,0.9723,1.6539,-9.8231,3.7661,9.8296,6.3383,678
-4.338,-9.7461,0.4614,2.0982,-9.7461,4.2782,12.2997,5.5403,679
-3.1386,-9.412,0.6192,1.6259,-9.412,2.5175,13.5394,5.691,680
-2.3137,-10.6489,1.5964,2.5647,-10.6489,5.9586,23.3099,11.3551,681
-2.3306,-8.8329,-0.2659,0.9603,-8.8329,1.4787,12.0891,6.3532,682
-0.4211,-9.5107,0.2583,0.6308,-9.5107,3.0857,8.2584,5.932,683
-1.1753,-9.9215,2.4235,2.3318,-9.9215,3.3602,14.5736,8.8641,684
-4.0199,-9.8986,-0.0344,1.7303,-9.8986,2.1285,14.1333,5.4926,685
-1.1134,-9.9282,2.0934,3.3047,-9.9282,3.9666,18.0493,10.025,686
-0.6433,-9.7814,1.1346,2.3284,-9.7814,3.1216,9.2329,6.5966,687
-1.2673,-9.8649,0.6435,1.3002,-9.8649,3.5324,10.6025,6.5361,688
-4.4285,-9.814,0.6183,2.025,-9.814,2.7303,10.6636,7.1722,689
-1.4994,-9.8022,0.6549,1.1692,-9.8022,3.3991,10.6923,5.3881,690
-0.8283,-9.7729,0.3758,1.2326,-9.7729,1.3483,8.356,5.4371,691
0.0026,-9.5613,0.9287,0.7215,-9.5613,3.551,8.2716,5.7483,692
-2.6897,-9.5543,-0.0546,1.5082,-9.5543,2.5485,19.5242,6.514,693
-0.9646,-9.9513,0.9611,1.9467,-9.9513,2.0885,11.8449,9.4008,694
-3.5793,-9.4126,0.9421,3.0297,-9.4126,4.3686,14.3881,9.4557,695
-3.625,-9.8319,1.2343,2.8255,-9.8319,4.0775,12.3368,8.1357,696
-0.6707,-9.8471,0.5183,1.2423,-9.8471,1.447,12.0887,3.9078,697
-4.5851,-9.7766,1.0842,1.7076,-9.7766,4.4362,13.1322,7.0685,698
-2.3757,-9.6763,1.1326,2.4338,-9.6763,4.0718,11.8409,6.9057,699
-3.197,-9.8112,0.1862,1.4191,-9.8112,2.152,20.9168,7.2972,700
-2.628,-10.0446,1.5924,2.6867,-10.0446,4.0035,12.9175,7.9143,701
-3.27,-9.69,0.331,1.8546,-9.69,2.0323,5.6294,4.7447,702
-0.4791,-10.3403,0.3514,0.9938,-10.3403,1.5908,17.129,4.3005,703
-2.777,-9.2732,-0.2271,1.655,-9.2732,3.1535,12.1921,7.6166,704
-8.5616,-9.9328,1.1787,5.8923,-9.9328,3.2453,20.9883,12.6294,705
-2.1597,-9.9509,0.1457,1.421,-9.9509,2.5967,13.2095,6.0899,706
-2.0938,-9.766,-0.1991,1.2332,-9.766,3.2552,10.3092,6.1737,707
-2.7358,-9.6416,1.211,3.451,-9.6416,5.6657,14.63,9.7696,708
-3.0695,-10.0512,0.4667,2.9346,-10.0512,2.9661,19.1894,13.1588,709
-7.9957,-10.1073,1.9716,5.243,-10.1073,11.8629,32.5162,26.4043,710
4.1213,-9.4603,20.6695,13.9839,-9.4603,3.8131,30.3661,27.7572,711
-4.3886,-10.1158,-0.6543,3.0802,-10.1158,1.2992,18.1462,15.9092,712
-0.5337,-9.6876,1.4306,1.468,-9.6876,3.8863,10.23,5.9431,713
-2.1021,-9.9842,0.4126,1.3314,-9.9842,2.1905,5.6173,4.5917,714
-1.2664,-9.7394,0.4761,1.3157,-9.7394,2.3586,5.1388,4.413,715
-1.4611,-9.7917,0.2415,0.8427,-9.7917,2.268,6.8339,3.7611,716
-3.6264,-9.8718,0.5301,1.5683,-9.8718,2.6049,10.4326,5.0481,717
-0.7514,-9.9435,0.128,0.3977,-9.9435,1.5551,6.066,4.4829,718
-1.0477,-9.8232,-0.0216,0.4278,-9.8232,1.2692,6.7754,4.1072,719
-1.9684,-9.8304,0.1531,0.7079,-9.8304,2.0028,6.839,4.4555,720
-0.7976,-9.809,-0.0815,0.299,-9.809,0.708,5.0289,3.5326,721
