AYGX_min,AZ_mean,AYGX_mean,AYGX_std,AZ_mean,GX_std,Gnorm_max,Gnorm_median,timestamp
0.0622,-10.0274,0.0674,0.0029,-10.0274,0.0113,1.0095,0.9905,1
0.0592,-10.0273,0.0687,0.0032,-10.0273,0.0134,1.0188,0.9929,2
0.0582,-10.0276,0.0663,0.003,-10.0276,0.0121,1.0224,0.9913,3
0.0632,-10.0276,0.0694,0.0032,-10.0276,0.0122,1.0437,1.0049,4
0.0643,-10.0275,0.0681,0.0019,-10.0275,0.008,1.0095,0.9947,5
0.0637,-10.0276,0.0705,0.0036,-10.0276,0.0143,1.0351,1.001,6
0.0591,-10.0271,0.0683,0.0038,-10.0271,0.0154,1.0223,0.9881,7
0.0586,-10.0274,0.0679,0.003,-10.0274,0.0125,1.0207,0.9956,8
0.0043,-10.0255,0.0656,0.0286,-10.0255,0.1129,1.18,1.0109,9
0.0023,-10.0288,0.0788,0.0727,-10.0288,0.2346,1.2732,1.024,10
-0.0398,-10.0342,0.0495,0.059,-10.0342,0.1734,1.2095,0.984,11
-30.3907,-9.9953,2.7201,12.2982,-9.9953,8.9138,30.6819,1.1741,12
-227.1758,-9.8285,-23.3499,48.936,-9.8285,19.6103,97.0359,7.8792,14
-107.1817,-10.0514,-5.0771,50.817,-10.0514,13.5363,71.8989,6.6268,15
-133.4057,-9.9423,-3.3358,36.1615,-9.9423,13.7262,97.2848,17.9185,16
-40.6058,-9.9346,-0.5372,8.9527,-9.9346,3.4836,24.3144,21.4687,17
-18.1497,-9.9147,2.0977,7.3745,-9.9147,4.0261,20.664,17.7859,18
-6.2673,-9.9422,2.3932,5.6851,-9.9422,4.3344,8.8892,4.184,19
-2.5608,-9.9604,0.5175,1.6508,-9.9604,1.3778,2.7365,1.6844,20
-1.6552,-9.962,1.1956,0.9683,-9.962,0.809,2.6684,1.4629,21
-1.5671,-9.9701,0.0537,0.8621,-9.9701,0.7999,1.7123,1.2276,22
0.4219,-9.97,0.8588,0.3116,-9.97,0.2829,1.6301,1.1809,23
-0.2365,-10.0055,1.4807,2.3506,-10.0055,5.2211,11.3202,3.5404,24
-32.9539,-9.8527,-9.8713,13.6429,-9.8527,8.0375,17.3579,7.5746,25
-15.3917,-9.8693,-7.9864,4.5443,-9.8693,1.7382,8.4917,4.6854,26
-54.3468,-10.0148,4.7275,22.1547,-10.0148,5.0315,31.2445,17.1192,27
-4.175,-10.2364,11.4258,11.7419,-10.2364,4.0759,41.9583,20.3889,28
-11.0851,-9.979,9.96,11.6665,-9.979,2.563,60.0427,47.5258,29
-4.2386,-10.8401,2.5869,6.6115,-10.8401,2.6775,10.0491,8.5066,30
-22.1461,-9.8137,-0.9109,7.4634,-9.8137,3.2764,23.1737,7.4329,31
-16.0116,-9.8053,0.1142,9.3125,-9.8053,3.7361,41.7682,14.4073,32
-34.9088,-9.71,6.4857,24.8722,-9.71,12.3858,68.2406,49.9765,34
-19.7183,-9.9536,-0.4411,7.503,-9.9536,5.6882,26.501,9.9521,35
0.0269,-9.9301,6.8081,4.1775,-9.9301,5.2253,13.2466,9.5809,36
-14.8542,-7.3551,-1.7638,6.5921,-7.3551,1.2111,16.2652,11.208,37
-1.9358,-10.3541,0.7038,2.6915,-10.3541,2.3296,19.9435,13.2547,38
-7.2064,-5.4542,0.1425,4.5996,-5.4542,2.9557,20.6451,13.2211,39
-1.0881,-9.9802,-0.0299,0.7448,-9.9802,2.6036,11.159,6.457,40
-9.8154,-7.5425,-0.5303,3.459,-7.5425,4.3148,27.9877,8.1409,41
0.1324,-10.152,4.7185,5.4441,-10.152,3.2253,13.832,12.1355,42
-5.9366,-9.681,-0.0031,3.3056,-9.681,6.1309,16.4903,11.6481,43
-6.6292,-10.0395,-0.3875,3.2458,-10.0395,3.7206,20.448,7.481,44
-0.8496,-10.197,0.1125,0.8749,-10.197,2.1155,8.6781,7.1941,45
-2.9129,-10.6248,-0.0247,3.1506,-10.6248,3.1547,11.2059,9.203,46
0.0486,-9.5954,9.0481,7.9905,-9.5954,5.7293,19.4504,10.0824,47
-2.3745,-9.8634,2.7087,3.2702,-9.8634,2.3598,18.3832,10.0692,48
-1.1385,-9.9882,1.1634,2.8324,-9.9882,1.8008,14.5004,6.2166,49
-8.1058,-10.5007,1.4599,4.8131,-10.5007,4.8456,13.178,9.0183,50
-9.4143,-10.1767,1.7748,6.8917,-10.1767,6.3899,21.9265,9.2765,51
-3.0886,-10.026,1.9372,3.253,-10.026,0.6922,15.8278,8.3298,52
-9.415,-9.999,1.1865,5.7018,-9.999,5.0388,14.9757,7.7278,54
-5.8371,-9.7788,4.6761,9.4022,-9.7788,7.3324,18.819,13.4281,55
-18.3357,-10.6672,-6.1906,7.8128,-10.6672,5.0716,23.4929,12.5257,56
-47.1823,-9.0625,3.8761,24.5921,-9.0625,5.4888,31.3469,23.013,57
-3.236,-10.1675,-1.1251,1.807,-10.1675,3.7551,7.0311,4.3597,58
-4.933,-9.8826,-0.4339,2.0673,-9.8826,4.1021,6.4538,5.2591,60
-4.5001,-10.427,0.5755,3.5755,-10.427,7.7422,20.6837,9.6942,61
-8.6063,-9.7254,-2.9009,2.6217,-9.7254,1.9153,12.9769,6.8754,62
-3.312,-9.9539,1.4423,3.2198,-9.9539,5.7807,14.6076,10.3174,63
-5.5742,-9.599,-0.6567,3.2032,-9.599,3.3434,8.0206,6.6603,64
-8.5969,-9.8762,0.6485,6.4638,-9.8762,3.6432,9.9091,8.2628,65
-1.4642,-10.1552,0.0139,1.3948,-10.1552,1.216,7.0978,4.9076,66
-1.2254,-9.9176,-0.0479,0.8139,-9.9176,1.143,9.0011,7.163,67
-0.4146,-9.846,-0.0141,0.2392,-9.846,0.898,7.6385,1.5898,68
-0.6352,-10.3007,2.1692,1.5196,-10.3007,1.3771,11.1742,8.8312,69
-3.5036,-10.0907,-0.6718,1.2049,-10.0907,0.7136,11.8874,9.0113,70
-4.291,-10.0563,0.9508,2.3675,-10.0563,0.9554,32.4533,15.0984,71
-0.7053,-9.9028,0.1705,0.9155,-9.9028,0.9767,10.1844,8.6781,72
-4.9958,-9.9576,-1.5248,1.7198,-9.9576,2.3654,16.0989,12.3803,73
-3.4661,-10.1507,-0.8873,1.928,-10.1507,4.1783,33.2,31.4603,75
-0.8061,-9.8249,2.5969,2.205,-9.8249,0.9356,21.9227,10.6409,76
-2.1622,-10.1944,3.2068,4.3379,-10.1944,1.5372,14.6466,8.6574,77
-19.7539,-10.1468,1.8205,10.7199,-10.1468,1.6716,22.0485,14.9156,78
-7.8278,-9.5873,-2.863,2.8094,-9.5873,2.3646,17.4482,8.9414,79
-19.4124,-8.9296,-1.7502,7.1486,-8.9296,4.2175,15.9837,10.1142,80
-14.6624,-10.1204,0.8367,8.3838,-10.1204,7.8493,17.2985,13.6678,81
-5.5882,-9.9336,-1.4441,1.9864,-9.9336,3.0534,13.3902,6.3546,82
0.2427,-8.6691,7.955,8.1192,-8.6691,7.6551,19.6425,16.5346,83
-4.5977,-9.9738,0.8722,4.0907,-9.9738,4.1159,12.618,4.5156,84
-20.2555,-8.2362,-1.1133,6.6346,-8.2362,5.7982,31.7876,11.8179,85
-3.3112,-7.6456,1.4844,4.5426,-7.6456,3.7067,21.4683,10.0799,86
0.7079,-10.0758,2.7815,1.3265,-10.0758,1.7136,8.87,8.5468,87
-1.964,-10.0628,-0.0828,1.1017,-10.0628,1.4192,12.2165,7.6666,88
-11.3577,-9.3168,29.4721,44.7462,-9.3168,17.7994,60.2576,46.4858,89
-17.4316,-10.9618,-2.3944,7.537,-10.9618,2.0496,18.6402,13.4192,90
-8.4446,-9.4951,0.8564,5.7799,-9.4951,8.124,34.5797,13.3798,91
-4.4369,-10.0786,0.5922,2.1186,-10.0786,3.8723,17.6207,8.3277,93
-35.6895,-9.3233,-3.9987,10.5663,-9.3233,4.9761,31.827,17.3954,94
-1.8995,-9.8128,0.4947,2.6214,-9.8128,2.945,15.2989,5.2482,95
-3.4196,-10.0189,1.5954,4.7627,-10.0189,3.8185,16.183,10.7072,96
-6.163,-9.875,-2.3834,2.1799,-9.875,1.6043,7.5864,4.6449,97
-15.6646,-10.0038,0.7294,8.4543,-10.0038,5.5672,14.0976,7.6252,98
-10.4678,-9.9916,-1.2001,5.366,-9.9916,3.7118,16.6821,8.5474,99
-20.7813,-10.202,3.9189,14.0701,-10.202,3.2762,19.725,13.1126,100
-11.3021,-10.4014,5.5985,11.2213,-10.4014,9.8121,24.3192,17.0338,101
-15.7534,-10.0756,-0.5375,7.0555,-10.0756,4.2113,18.9046,7.2226,102
-7.8096,-9.955,0.963,6.7848,-9.955,3.4313,10.9217,9.185,103
-3.6826,-9.9926,0.5865,1.99,-9.9926,3.5393,9.8661,7.9304,104
-15.3765,-9.2072,1.8401,6.1599,-9.2072,4.0328,32.2026,8.797,105
-5.5775,-9.6316,4.0437,8.7543,-9.6316,5.7635,16.7469,10.3222,106
-6.272,-10.2102,15.1011,16.5894,-10.2102,5.3703,26.0463,22.9383,107
-25.5422,-10.2128,-5.1638,15.2796,-10.2128,11.0828,25.6692,16.7437,108
-7.0832,-10.4556,-1.4525,3.0524,-10.4556,3.7885,17.9936,7.3657,109
-1.2787,-9.9374,3.9657,5.5673,-9.9374,1.8175,13.5971,7.7972,110
-5.3965,-9.9769,0.8261,4.2321,-9.9769,3.1778,13.5474,9.9347,111
-0.7211,-10.2699,-0.1163,0.4456,-10.2699,0.8177,10.7709,8.8448,112
-8.4752,-9.2624,0.377,5.4195,-9.2624,4.2742,49.3449,14.259,113
-37.452,-10.2168,-2.9535,14.0031,-10.2168,7.9022,42.8828,17.8944,114
-13.9335,-9.7758,2.5193,9.111,-9.7758,3.3501,31.5279,12.5525,115
-14.1642,-10.2348,-0.3384,5.9455,-10.2348,6.7386,19.6371,12.4759,116
-13.0053,-9.8983,8.2195,13.0385,-9.8983,9.6316,31.0672,18.0179,117
-3.2468,-9.9616,-0.7154,1.6999,-9.9616,3.8195,20.36,16.5917,118
-2.5393,-10.079,7.763,8.1779,-10.079,2.8161,14.4747,12.1556,119
-16.9341,-9.4348,-3.9284,7.5553,-9.4348,3.121,10.3313,6.8412,120
-5.7293,-10.0228,-0.2723,2.837,-10.0228,2.2917,12.3007,6.4171,121
-8.9198,-10.1779,-0.7324,4.1803,-10.1779,2.9255,12.2299,8.7961,122
-30.1881,-10.0462,0.2635,9.4591,-10.0462,5.5187,21.592,8.9678,124
-18.8776,-9.9681,1.645,11.6474,-9.9681,1.3563,19.1041,8.5972,125
-6.1019,-10.6747,2.3193,5.463,-10.6747,4.3902,18.0041,12.9666,126
-12.3363,-10.1549,1.8981,6.6542,-10.1549,3.6802,15.2949,9.9463,127
-5.0484,-9.6498,0.9729,3.5563,-9.6498,2.2659,19.1028,10.5871,128
-7.3154,-10.1251,-0.8824,4.5794,-10.1251,1.7554,8.5138,7.8381,129
-8.0922,-10.1378,0.9577,6.2484,-10.1378,2.3583,9.6423,6.1053,130
-17.5509,-10.1493,-0.9964,8.5012,-10.1493,2.5626,13.025,8.4963,131
-4.2727,-9.8897,0.4184,3.7965,-9.8897,3.8835,11.1136,6.0959,132
-12.42,-9.978,-0.3443,2.8318,-9.978,2.7017,15.6229,5.6984,134
-5.0277,-10.1847,-0.058,2.1201,-10.1847,2.785,9.0923,4.8005,135
-5.4219,-9.8258,-1.0013,3.1173,-9.8258,1.7665,12.7211,9.8988,136
-17.7798,-9.7469,6.2735,14.828,-9.7469,3.2125,21.9973,17.7816,137
-5.5097,-10.4358,0.398,4.4489,-10.4358,7.8521,30.1088,24.4686,138
-8.7776,-9.9121,2.0674,5.2915,-9.9121,8.0905,17.8913,12.8978,140
-3.5524,-9.8866,-0.0225,3.086,-9.8866,2.8801,7.137,3.747,141
-6.576,-10.1922,2.8159,4.6806,-10.1922,0.5585,19.5825,14.3464,144
-39.7338,-10.7902,-9.7153,18.4224,-10.7902,9.1061,84.3364,54.6126,145
-6.6245,-10.9478,-1.3891,2.6376,-10.9478,2.5754,27.0926,14.5198,146
-1.9138,-10.0352,0.0196,1.4257,-10.0352,3.0398,15.4538,11.6124,147
-7.0431,-10.0037,-1.2608,2.7091,-10.0037,3.5921,7.8777,4.6583,148
-0.2453,-10.0486,0.2998,0.4183,-10.0486,1.8877,3.9614,1.4778,149
-7.8795,-10.0684,4.7181,16.2639,-10.0684,11.6935,44.6809,12.1898,150
-37.7326,-10.0757,0.0441,14.3213,-10.0757,6.4496,34.6814,16.1531,151
-0.0948,-9.8558,4.7262,4.7403,-9.8558,3.0578,34.2877,20.4574,152
-39.8942,-10.0323,-5.7902,14.0644,-10.0323,4.3977,54.9914,45.9019,153
-2.3213,-9.9202,21.4225,20.9743,-9.9202,5.5094,80.5973,36.2947,154
-2.3426,-9.9599,6.8049,7.0195,-9.9599,4.8331,32.5696,11.1201,155
-2.6433,-10.2228,-0.3739,1.0074,-10.2228,1.727,9.803,8.2609,156
-3.3313,-11.3491,0.161,2.1741,-11.3491,3.1053,34.7865,17.5861,157
-60.2177,-9.6062,-0.8869,25.721,-9.6062,9.8187,39.7991,33.507,158
-22.0115,-10.1499,14.2126,26.5164,-10.1499,9.2806,91.6617,66.1458,159
-6.1454,-10.127,15.5438,21.0362,-10.127,6.1851,27.0737,21.4922,160
-14.5066,-9.9272,0.2648,7.1546,-9.9272,2.5871,39.6879,30.4729,161
-0.0053,-9.7959,9.2498,7.407,-9.7959,7.1375,29.8375,8.3064,162
-55.5746,-10.8253,-14.4196,22.7138,-10.8253,9.2514,64.0121,56.4122,163
-22.4573,-10.4776,-7.5578,16.9994,-10.4776,10.6538,53.0461,39.993,164
-0.2478,-10.5547,1.3699,1.6264,-10.5547,1.8601,31.0522,25.0626,165
-22.1491,-9.663,11.1266,20.9926,-9.663,6.9065,53.2096,26.1975,166
-22.5441,-8.246,1.1363,27.4646,-8.246,5.3561,37.5212,27.4927,167
-8.3506,-8.2528,0.8368,5.3283,-8.2528,5.9925,18.8961,11.9471,168
-16.9749,-9.5142,1.0858,5.8069,-9.5142,4.0225,36.8781,8.4877,169
-11.2753,-9.9409,8.5364,16.2711,-9.9409,12.9069,29.5716,16.9968,170
-5.1904,-10.0389,2.2423,4.424,-10.0389,4.0797,20.7522,12.2128,171
-0.0021,-10.0593,2.9608,2.612,-10.0593,2.7854,20.5889,13.959,172
-12.7678,-9.8063,-1.8599,4.35,-9.8063,2.5986,18.72,10.2707,173
-37.552,-8.358,-16.6275,14.0328,-8.358,5.7142,44.4114,30.4022,174
-14.1695,-10.0124,9.4875,14.6749,-10.0124,12.0307,41.2132,13.4147,175
-13.2942,-10.1041,1.6789,5.6849,-10.1041,8.4612,29.5568,21.2409,176
-1.8064,-9.8147,0.1111,2.2952,-9.8147,4.803,17.2606,9.3451,177
-12.4849,-10.1698,-1.8801,5.2111,-10.1698,8.8917,24.7272,20.0497,179
-27.6083,-9.8713,3.8052,13.9294,-9.8713,5.381,28.196,12.4555,180
6.5493,-8.8804,14.7722,10.1218,-8.8804,5.5166,29.5206,23.6317,181
-1.7479,-10.0717,-0.5386,0.9471,-10.0717,1.209,6.1483,3.5714,182
-0.1291,-10.2551,9.7768,9.766,-10.2551,1.9009,20.32,19.3721,183
-0.6002,-10.6458,3.6121,4.8465,-10.6458,4.0117,25.046,8.5591,184
-12.5482,-8.6522,-2.798,6.1194,-8.6522,2.7182,19.7736,8.1924,185
-4.429,-9.9973,3.5829,7.0379,-9.9973,8.3142,23.3821,11.845,186
-1.6708,-9.927,-0.3667,0.656,-9.927,1.7458,5.423,4.6728,187
-2.2775,-10.0611,0.6467,1.9199,-10.0611,3.2836,26.4245,4.013,189
-13.6862,-10.2726,0.8034,5.0102,-10.2726,4.7071,21.5949,11.5514,190
-4.8842,-10.1671,1.2306,4.604,-10.1671,1.3435,40.852,38.7014,191
-0.6479,-10.0204,0.0034,0.4745,-10.0204,0.85,7.702,1.6615,192
-0.2028,-10.0216,0.0614,0.1557,-10.0216,0.3719,1.256,0.96,193
0.1545,-10.0386,0.4999,0.3044,-10.0386,0.7014,2.6951,1.8136,194
-2.1007,-10.0197,-0.3224,1.0001,-10.0197,2.6384,4.2675,3.0077,195
-3.9766,-10.0341,-0.1654,1.22,-10.0341,1.7133,7.1743,1.8652,196
-12.9917,-10.1299,7.5414,14.7141,-10.1299,10.3829,55.5448,28.2329,197
-2.1967,-10.0588,6.8231,6.9198,-10.0588,2.3256,30.1798,10.5376,199
-7.4194,-9.3309,3.4483,8.1744,-9.3309,5.5792,23.1173,9.8918,200
-17.3209,-9.6843,6.0481,21.2522,-9.6843,13.1623,33.244,18.4458,201
-10.0504,-9.8085,-2.2049,3.6377,-9.8085,3.5013,22.727,11.7573,202
-2.3555,-9.6419,4.0731,6.7225,-9.6419,1.9518,18.2574,15.8041,203
-4.8259,-10.1076,0.5809,2.8957,-10.1076,3.6868,13.8725,6.0193,204
-6.4276,-9.8062,0.2736,3.7759,-9.8062,6.0675,12.3472,7.9948,206
-1.5513,-9.77,3.2159,4.3409,-9.77,3.8244,14.5391,11.5079,207
-5.2952,-10.0808,0.5086,2.3621,-10.0808,3.197,37.7495,7.0148,208
-19.816,-9.7353,10.1662,25.0475,-9.7353,4.4164,36.6449,33.9941,210
-7.5266,-9.556,-0.0471,3.8542,-9.556,1.5663,12.1638,6.6406,211
-28.534,-9.9777,-2.0013,12.9937,-9.9777,2.3932,20.6965,16.1502,212
-3.0902,-10.0828,2.9509,6.223,-10.0828,6.9515,16.712,10.8084,213
-6.7381,-9.4478,8.9425,12.3532,-9.4478,2.3304,21.455,13.2556,214
-8.4229,-9.8971,-0.7906,2.4975,-9.8971,2.5095,10.9711,7.1934,215
-4.1693,-9.9261,-0.4369,2.1591,-9.9261,4.8652,12.6284,9.7713,216
-3.4147,-10.0301,-0.2086,1.856,-10.0301,3.5685,12.1931,7.3294,217
-1.9839,-9.9131,-0.3417,0.8594,-9.9131,1.9946,5.1308,4.6875,218
-4.1897,-10.2851,-0.0368,2.0643,-10.2851,3.6043,9.8792,7.7682,219
-5.3482,-10.0016,0.2532,2.3711,-10.0016,2.6637,13.9493,6.1902,220
-11.5651,-9.4758,0.4393,5.095,-9.4758,3.797,25.5534,9.975,221
-3.8511,-9.564,1.5361,3.5849,-9.564,3.5094,13.2168,6.3684,222
-4.1413,-10.221,2.3095,4.3351,-10.221,2.3664,16.5597,10.4157,223
-1.5477,-10.3601,6.6275,4.9542,-10.3601,2.5901,12.9094,9.9142,224
-3.0306,-10.1818,-0.3873,1.3385,-10.1818,3.8991,12.8145,11.6381,225
-4.5676,-10.003,-1.2878,1.5923,-10.003,2.8482,9.7199,7.4109,226
-3.1656,-10.1341,-0.048,1.6641,-10.1341,1.823,11.8152,6.3688,227
-10.1418,-10.0638,-0.0616,3.5868,-10.0638,6.3353,17.2903,9.3902,228
-10.413,-10.5876,0.3952,3.8865,-10.5876,4.5728,13.1143,7.0688,229
-5.2843,-9.9821,-1.3386,2.2146,-9.9821,3.6928,11.5326,3.954,230
-0.9978,-10.1545,-0.282,0.4881,-10.1545,1.0982,3.3093,2.6901,231
-1.943,-10.1068,0.0774,1.5981,-10.1068,2.8785,11.6811,6.913,232
-2.7462,-10.2106,-0.6554,0.9663,-10.2106,1.1429,8.3664,5.776,233
-2.4766,-9.9667,0.2802,1.5493,-9.9667,3.6718,16.9727,10.5393,234
-4.9257,-10.1212,0.1175,2.1691,-10.1212,4.6629,16.1567,13.5439,235
-5.387,-9.0977,-1.2675,1.8115,-9.0977,1.5713,23.3432,7.4742,236
-7.0147,-10.0887,-0.559,2.0178,-10.0887,3.416,10.9972,5.3875,238
-3.2585,-10.0523,0.455,2.241,-10.0523,4.8967,10.3363,6.068,239
-2.2601,-9.6272,-0.813,1.2856,-9.6272,3.0331,6.4423,4.2323,240
-0.461,-10.3494,2.0192,3.1038,-10.3494,1.051,7.0233,5.6487,241
-3.6096,-10.2803,-0.3683,1.6748,-10.2803,2.072,8.6049,3.2267,242
-2.0275,-9.6864,-0.3159,0.8154,-9.6864,2.1197,8.6502,5.0838,243
-10.3194,-10.375,-0.3428,5.1027,-10.375,2.5907,12.65,9.9865,244
-2.4525,-9.8427,-0.3715,1.2874,-9.8427,2.6381,6.4321,4.9902,245
-14.159,-10.0664,-0.1674,8.3512,-10.0664,4.6087,11.6871,8.3092,246
-6.4742,-10.1024,5.7555,10.4972,-10.1024,10.8492,21.6054,13.508,248
-3.0422,-9.8659,2.7341,4.5967,-9.8659,5.6961,15.3104,13.0679,249
-17.3286,-9.9463,-2.2301,6.5675,-9.9463,2.363,8.5888,5.4678,250
-4.4944,-9.1668,-0.7151,1.8824,-9.1668,4.244,15.6216,9.6486,251
-20.0244,-10.3087,3.184,14.3428,-10.3087,3.3064,21.2653,19.8944,252
0.7846,-9.7387,5.6246,2.9034,-9.7387,2.1644,11.124,8.1864,253
-1.4635,-9.7053,-0.2944,0.8259,-9.7053,2.3473,8.2072,5.0929,254
-33.1371,-9.4789,0.0098,16.3193,-9.4789,6.9744,22.1875,16.2425,255
-10.3264,-9.9842,0.0433,5.2869,-9.9842,5.9575,22.6105,10.999,256
-8.3929,-10.0393,1.1219,4.5054,-10.0393,5.0022,14.8814,5.9842,258
-2.159,-9.9978,0.4737,1.3862,-9.9978,1.0315,9.8303,6.6788,259
-7.3895,-9.9774,-0.2429,4.6965,-9.9774,4.1629,16.4243,9.4876,261
-0.5996,-10.3675,6.3833,6.8915,-10.3675,1.5485,13.9829,12.3579,262
-3.659,-9.6182,0.7445,2.0264,-9.6182,1.7444,12.6373,6.7351,263
-3.4546,-9.8894,-0.4212,1.3673,-9.8894,2.1905,8.6978,6.0165,264
-1.3152,-10.0988,0.0212,1.105,-10.0988,1.0581,6.4846,4.4189,265
-3.9438,-10.0682,-0.3759,2.3019,-10.0682,5.7168,12.4481,8.8361,266
-6.9924,-9.9392,0.0363,3.4068,-9.9392,5.094,16.2396,7.9147,268
-6.4999,-10.1006,-0.39,2.1376,-10.1006,3.3333,10.1745,5.9977,270
-3.4945,-9.862,-0.3736,1.9516,-9.862,2.3715,9.9227,7.2121,271
-7.1497,-9.9814,0.2335,4.1414,-9.9814,1.9578,8.2604,7.7018,272
-5.6292,-10.7941,-0.3151,2.4116,-10.7941,4.7536,16.1158,8.1985,273
-5.2479,-10.1636,1.2838,3.4276,-10.1636,4.2783,11.4547,8.4795,275
-9.9786,-9.9655,-0.3085,4.3315,-9.9655,3.7141,11.3277,5.1324,276
-10.0975,-10.2043,1.8867,11.7363,-10.2043,7.2434,35.4043,20.1164,277
-10.6711,-9.3567,3.2458,12.0213,-9.3567,3.957,21.3973,16.2539,278
-11.2028,-10.0125,1.5843,5.2124,-10.0125,2.4637,26.6459,11.7579,280
-6.6451,-9.9009,-0.6775,3.7975,-9.9009,3.5499,10.418,5.8363,281
-1.9001,-9.543,3.7754,4.2616,-9.543,1.771,13.8852,8.9081,282
-4.274,-9.9227,9.0277,10.1468,-9.9227,2.7241,18.0648,15.2775,283
-1.4907,-9.886,20.4216,12.9691,-9.886,3.6174,30.1778,27.4421,284
-2.8261,-10.0223,0.0408,1.9447,-10.0223,3.6228,16.8694,14.8372,285
-5.8229,-10.1354,1.2153,3.4733,-10.1354,5.3915,11.0913,8.0643,286
-1.885,-10.0517,0.9938,1.5571,-10.0517,4.081,11.5801,8.4411,287
-0.55,-10.1138,1.062,1.7849,-10.1138,2.8615,10.1184,6.7618,288
-10.2897,-9.6972,-0.5818,2.4106,-9.6972,2.2244,14.7031,5.8341,289
-5.4135,-9.7253,2.3989,4.9229,-9.7253,1.1397,24.3726,11.0839,290
-5.1946,-9.0452,16.3212,20.5435,-9.0452,7.8852,51.473,44.6267,291
-1.5911,-10.6321,1.7022,2.4089,-10.6321,5.4767,30.1802,18.2274,292
-2.8957,-10.5234,-0.8027,1.7526,-10.5234,3.5048,19.3632,12.8175,293
-0.4695,-9.8067,3.8265,3.4698,-9.8067,1.7849,24.279,15.1576,294
-4.343,-10.2969,3.0775,4.9823,-10.2969,5.5086,16.2645,14.1876,295
-48.2225,-10.3317,38.1096,58.9838,-10.3317,18.1216,54.7322,41.1994,296
-6.0886,-10.1454,7.4279,8.3249,-10.1454,11.8409,23.3258,19.3336,297
-3.9609,-9.9157,5.0412,5.2827,-9.9157,1.4283,17.9286,15.3856,299
-18.6249,-9.911,7.3083,12.4203,-9.911,1.0967,16.5836,12.9017,300
-6.0044,-10.202,-0.3892,2.4978,-10.202,3.7083,16.5333,5.4457,301
-6.5233,-10.0655,1.2541,6.0593,-10.0655,1.1462,13.0512,11.5316,302
-5.1362,-10.0235,4.7949,9.8273,-10.0235,3.5366,19.1139,16.5437,303
-4.1307,-8.5087,0.3491,4.3243,-8.5087,2.5941,33.7155,15.7793,304
-6.9862,-10.3575,-0.2382,3.4996,-10.3575,3.8483,18.1611,17.3398,305
-6.515,-7.7359,0.0269,3.1915,-7.7359,4.5428,46.9251,10.4869,306
-4.8893,-10.0405,-0.504,2.5618,-10.0405,5.2627,13.9785,8.3175,308
-2.7511,-10.0921,0.3538,1.7606,-10.0921,2.3425,8.7448,4.2825,309
-1.3682,-9.7854,-0.2446,0.6772,-9.7854,1.3898,5.0397,3.1305,310
-0.2358,-9.6228,0.2446,0.4884,-9.6228,1.5115,6.5462,5.6218,311
-1.8318,-9.6295,-0.2191,0.9081,-9.6295,1.4965,12.0146,7.899,312
-0.9251,-9.9115,-0.0973,0.4182,-9.9115,0.876,8.3666,5.7149,313
-2.0053,-10.1518,0.6447,1.8976,-10.1518,0.8905,7.6294,5.8257,314
-4.1878,-10.1645,-0.1046,2.47,-10.1645,0.9394,8.4014,6.4838,315
-17.2279,-10.1702,1.6838,6.9262,-10.1702,6.9881,21.1496,12.9947,316
-14.7596,-10.108,1.3664,6.4453,-10.108,9.2853,17.8287,14.1707,318
-6.1185,-10.0484,-0.0725,2.2944,-10.0484,2.7811,11.9044,5.4836,319
-3.8917,-10.0414,0.4815,2.2871,-10.0414,3.0254,11.0612,6.5705,320
-14.3951,-10.141,0.6638,7.3794,-10.141,6.547,31.9828,13.0482,321
-3.0452,-9.6459,9.8295,11.9573,-9.6459,10.8544,23.6887,20.2524,322
-9.679,-10.5728,0.4984,6.4159,-10.5728,3.5866,22.6252,16.9937,323
-1.9352,-10.108,1.7035,3.0187,-10.108,5.4752,25.1301,21.0813,324
-7.3673,-9.3037,-0.0019,4.362,-9.3037,3.158,15.843,12.1081,325
-0.516,-10.0884,1.7999,2.8827,-10.0884,2.6866,10.8018,7.3716,326
-11.0463,-10.0716,2.3233,9.1449,-10.0716,5.9297,21.9994,10.9058,328
-23.7187,-10.1573,15.6904,23.3553,-10.1573,4.0628,31.922,24.5166,329
-11.767,-10.0192,0.5352,9.9111,-10.0192,3.3778,24.5806,19.6575,330
-4.0879,-9.8925,-1.7922,1.456,-9.8925,2.5234,14.0842,12.3141,331
-6.9646,-9.7622,-0.5994,4.8192,-9.7622,3.904,17.1662,14.3432,332
-3.9128,-10.0946,2.5606,3.4587,-10.0946,2.0189,9.0879,7.1027,333
-5.8975,-10.193,0.1662,2.3602,-10.193,3.2103,9.4772,7.5687,334
-1.2169,-10.3214,-0.0037,0.5332,-10.3214,0.94,10.9752,4.3297,335
-11.3849,-10.2557,0.0254,7.7008,-10.2557,4.6096,18.1972,9.2695,336
-11.1858,-9.9748,0.4122,4.1881,-9.9748,5.899,16.8822,9.7299,338
-11.3993,-9.9893,-0.8574,4.5968,-9.9893,4.1736,18.0864,7.0138,339
3.3227,-10.2608,12.3405,7.7965,-10.2608,1.9922,21.3057,14.2328,340
-0.2815,-9.8428,0.362,0.8853,-9.8428,1.5741,9.9616,5.7086,341
0.6752,-10.2844,3.593,1.7748,-10.2844,3.034,13.6628,10.1626,342
-0.8282,-9.7204,3.8352,3.661,-9.7204,5.4748,13.5123,9.8599,343
-2.5214,-10.0773,1.5259,3.4476,-10.0773,1.8827,10.5063,8.6396,344
-4.9346,-9.9929,0.3716,3.9352,-9.9929,6.8405,13.97,8.2576,346
-1.0653,-9.6455,0.1096,0.7559,-9.6455,1.5621,7.5114,3.8307,347
-2.006,-10.1219,0.9944,2.3506,-10.1219,4.643,9.8057,5.1641,348
-5.5868,-9.8399,0.9616,4.0459,-9.8399,5.6914,13.843,9.1866,349
-1.073,-10.714,1.4917,2.2708,-10.714,3.3081,16.5022,8.9979,350
-6.6377,-10.216,-0.9463,2.5082,-10.216,2.3692,10.5735,6.8628,351
-2.203,-9.9399,0.7647,2.4249,-9.9399,1.3255,11.6426,7.387,352
-5.0633,-9.8491,0.4785,3.238,-9.8491,1.7401,9.6667,8.8283,353
-0.809,-10.3833,0.538,1.4752,-10.3833,3.689,12.1382,5.4496,354
-1.603,-10.3398,0.8891,1.9942,-10.3398,2.8788,8.8827,3.8202,355
-9.5268,-10.0911,1.74,4.9704,-10.0911,6.6131,14.0987,9.4889,356
-0.224,-10.2671,3.6216,4.0641,-10.2671,3.3703,11.4292,9.3724,357
-5.985,-9.4947,-0.208,3.1125,-9.4947,4.0616,10.5157,6.6558,358
-15.1682,-10.0336,2.9265,9.9764,-10.0336,7.0513,20.5623,12.3821,359
-7.9091,-9.9519,2.476,8.2161,-9.9519,6.7745,21.3994,9.4524,360
-22.2373,-10.3265,-0.4734,9.5788,-10.3265,5.2822,15.1245,5.8435,361
-7.5133,-10.1218,-1.0266,2.6782,-10.1218,2.97,11.4001,7.3727,362
-0.8884,-9.5286,-0.2371,0.4059,-9.5286,0.9458,5.1825,3.3754,363
-0.3761,-10.1455,0.525,0.9827,-10.1455,2.3394,6.6456,5.4565,364
-15.0045,-10.215,0.5339,8.5193,-10.215,2.041,12.1561,9.8818,365
-10.537,-9.1402,0.0443,4.8038,-9.1402,2.3314,17.0783,11.0257,366
-8.1006,-9.4716,-2.0619,3.6947,-9.4716,2.8125,15.8114,8.443,367
-18.9197,-9.8486,3.1623,9.3267,-9.8486,3.6533,19.2764,13.8451,368
-6.4098,-9.4855,-0.8106,1.9562,-9.4855,3.3221,13.673,7.9946,369
-14.2795,-10.3367,-4.0059,5.2391,-10.3367,4.2715,15.6353,9.1658,370
-3.5747,-9.9678,0.8287,2.5644,-9.9678,1.7045,9.3963,6.6768,371
-1.4194,-10.233,-0.1073,0.8552,-10.233,0.6922,11.0775,5.9037,372
-1.9192,-10.3696,0.9859,2.2088,-10.3696,3.402,11.1325,8.2351,373
-3.9901,-10.0134,1.2955,3.3931,-10.0134,3.2704,11.38,9.3659,374
-5.0887,-9.9804,0.3235,2.4999,-9.9804,1.9307,7.6039,4.434,375
-6.8038,-10.4515,-1.0517,2.6785,-10.4515,3.0238,9.2021,6.2018,376
-1.5877,-10.1954,0.0874,1.1108,-10.1954,1.8932,10.2441,4.7538,377
-15.6893,-10.1431,-0.4175,5.1313,-10.1431,2.5502,19.7549,5.7359,378
-11.5351,-9.5548,3.186,7.2301,-9.5548,4.6539,27.528,12.2839,379
-9.7167,-9.6966,2.7113,6.6695,-9.6966,4.4135,18.613,10.4963,380
-11.6204,-10.1264,0.18,6.4038,-10.1264,4.0188,16.1462,8.8182,381
-12.9379,-9.9927,-2.9559,4.7571,-9.9927,3.8727,16.9844,10.7474,382
-4.6273,-9.623,28.1348,29.5862,-9.623,2.0473,36.5132,35.7027,383
-24.3361,-9.5914,17.0751,28.6614,-9.5914,2.4281,33.7145,31.9723,384
0.6513,-9.6568,4.8477,4.8247,-9.6568,1.9966,16.2072,10.8125,385
-7.1619,-10.3152,-0.5116,2.0141,-10.3152,1.8506,13.3479,5.8659,386
-3.8925,-10.0429,0.5036,2.1348,-10.0429,3.5409,28.6613,7.5914,389
-1.0736,-10.067,1.4536,2.1742,-10.067,2.6414,12.3058,7.6732,390
-0.3203,-9.9838,0.7135,0.8536,-9.9838,1.3901,9.8579,5.8547,391
-6.1325,-9.8735,-0.2396,3.4663,-9.8735,1.5314,12.7648,11.0565,392
-3.7787,-10.0455,-0.2047,2.1683,-10.0455,2.504,27.9661,12.4403,393
-39.1965,-10.1183,-9.9556,16.6487,-10.1183,11.0741,51.3264,37.5783,394
-29.0948,-9.9712,-5.2623,12.8285,-9.9712,6.1029,22.408,17.3511,395
-39.8766,-10.0627,-5.692,13.7058,-10.0627,14.2224,33.7358,21.5068,396
-83.3175,-9.9506,-1.1657,22.5939,-9.9506,14.5281,80.9929,18.7418,399
-38.6928,-9.9798,-2.2749,16.5695,-9.9798,13.1928,19.5509,12.9391,400
-3.8356,-10.0769,2.6184,6.5021,-10.0769,6.4343,13.9979,8.4022,401
-7.1311,-9.9882,-0.8735,3.9587,-9.9882,6.9934,10.3268,7.0221,402
-7.6169,-9.9081,1.49,4.9266,-9.9081,2.2671,24.0694,10.289,403
-2.8659,-10.1991,0.2508,1.0983,-10.1991,2.5493,16.481,11.6077,404
-21.3717,-10.2258,3.3312,14.2002,-10.2258,8.7859,40.4823,20.6812,406
-14.0265,-9.9335,6.5538,11.6482,-9.9335,10.4822,37.6192,16.4378,407
-10.3549,-10.8356,0.4451,8.1741,-10.8356,2.8811,12.3374,9.3772,408
-3.1225,-10.105,-0.1114,3.0574,-10.105,2.0107,11.4717,7.5334,409
1.187,-10.2724,12.2345,6.3261,-10.2724,2.722,32.9123,24.2623,410
-8.7396,-9.9901,0.3619,4.9569,-9.9901,7.2731,16.8217,14.7983,411
-6.4592,-10.1459,0.507,2.5877,-10.1459,5.0765,14.4162,8.3628,413
-12.5958,-10.1505,10.7172,19.2717,-10.1505,13.2016,28.6795,23.0837,414
0.7354,-10.1404,3.6402,2.5457,-10.1404,4.2428,16.9627,15.9586,415
-1.5999,-10.2182,0.2408,1.2633,-10.2182,0.6951,11.6771,3.5919,416
-1.2032,-10.2264,-0.2945,0.5144,-10.2264,0.3368,4.6089,2.893,417
-0.4524,-9.5523,-0.0538,0.3182,-9.5523,1.1365,6.1849,3.0366,418
-0.917,-10.1282,-0.0154,0.7065,-10.1282,2.1179,8.4737,5.6849,419
-0.35,-9.8791,-0.0715,0.2274,-9.8791,0.2756,5.3178,4.6562,420
-18.0849,-10.0973,0.3866,6.1716,-10.0973,1.3651,26.6308,17.2742,421
-3.2585,-10.0698,0.5947,2.1771,-10.0698,2.1982,33.6728,31.4928,422
-4.3639,-10.4384,-1.0553,1.9277,-10.4384,1.0187,28.4646,19.6066,424
-23.0758,-10.1513,18.0683,22.3762,-10.1513,14.5751,60.0422,42.8266,425
-9.5333,-10.1585,4.1084,9.3413,-10.1585,7.3805,66.8603,50.2146,426
-2.9261,-10.1531,0.2897,2.1143,-10.1531,2.4661,33.6468,28.2165,427
-8.8767,-9.6604,-2.2521,5.18,-9.6604,2.4663,35.4077,31.1245,428
-10.4407,-10.27,-1.2335,4.6604,-10.27,3.5082,26.1978,20.2235,429
-19.7818,-9.1911,-1.4756,7.8894,-9.1911,3.7767,18.2244,13.3966,430
-9.6454,-10.5371,0.5486,5.0568,-10.5371,5.1394,64.601,60.1341,431
-10.4939,-9.8858,31.3807,29.0928,-9.8858,5.507,70.9196,52.1575,432
-37.0136,-10.0043,-5.7139,30.2555,-10.0043,1.7876,27.303,24.2789,433
-14.8621,-10.0074,2.9325,11.1266,-10.0074,9.2925,27.6116,15.2495,434
-10.3129,-10.0561,1.1148,6.2341,-10.0561,6.1321,17.4654,12.0354,435
-8.0058,-10.1006,0.6104,4.6913,-10.1006,6.9732,19.5881,12.6125,436
-13.1652,-10.0051,-0.3612,5.2994,-10.0051,7.6349,17.2075,12.734,437
-4.7471,-10.0843,1.0234,3.093,-10.0843,3.6932,15.2427,7.8997,438
-2.9625,-9.901,-0.637,1.0126,-9.901,1.9579,8.2253,5.9446,439
-7.4196,-10.1638,1.1544,5.0898,-10.1638,6.2535,18.218,11.8872,441
-2.1009,-9.1946,-0.6691,1.1135,-9.1946,2.1028,11.763,8.3584,442
-2.667,-10.0643,-0.0064,1.3166,-10.0643,2.063,17.5132,4.0287,444
-7.6235,-10.024,0.1985,2.9737,-10.024,5.1703,19.0822,10.2778,445
-5.1252,-10.2661,-1.101,3.2751,-10.2661,6.8728,20.4184,17.0349,446
-6.3901,-10.009,1.5723,5.418,-10.009,6.1614,14.2724,12.3876,447
-4.9908,-9.9829,-0.1831,4.1689,-9.9829,5.9743,15.6339,10.6686,448
0.1514,-9.9828,1.3674,0.7887,-9.9828,1.2546,8.1463,6.2976,449
-5.9616,-9.9409,1.5898,4.0781,-9.9409,5.4048,13.3389,10.9789,450
-6.28,-10.0841,0.0171,3.4158,-10.0841,5.877,12.603,8.8432,451
-6.164,-10.0413,-1.5494,2.5238,-10.0413,2.4391,14.3912,11.8296,452
-8.082,-10.0392,0.2222,2.8022,-10.0392,3.7599,14.6326,7.255,454
-2.2025,-10.0999,0.1027,1.6861,-10.0999,1.1411,11.2504,7.2101,455
-8.9515,-10.5534,-0.7538,4.7593,-10.5534,4.7399,16.327,7.9396,456
-2.5896,-10.1181,-0.7354,1.2382,-10.1181,2.8519,15.0068,9.1093,457
-5.3365,-9.9335,-1.4535,2.5995,-9.9335,3.0388,12.3702,6.8189,458
-8.2138,-10.0718,-1.7131,4.3592,-10.0718,3.1347,12.2476,6.1946,459
-4.2454,-9.9393,-0.45,3.2189,-9.9393,2.7344,13.3363,9.9687,460
-2.7709,-10.0203,-0.0514,1.6783,-10.0203,2.9137,9.7139,6.4009,461
-10.9594,-10.0364,1.5366,6.6582,-10.0364,7.2186,28.6985,10.0088,463
-5.5276,-10.0935,1.0649,3.8751,-10.0935,4.5249,10.3632,7.7114,464
-1.9452,-10.0688,2.1018,3.0541,-10.0688,1.9048,15.7233,12.812,465
-1.9618,-10.1525,0.0424,1.5607,-10.1525,2.453,7.9308,6.8323,466
-4.1417,-9.7498,0.2829,2.7087,-9.7498,4.159,12.2397,9.4121,467
-5.3109,-9.9829,-0.7048,2.3845,-9.9829,2.232,9.9701,8.5735,468
-1.8063,-9.9782,-0.5319,0.9426,-9.9782,1.8735,10.7545,5.74,469
-5.7188,-10.0834,-1.0585,2.6497,-10.0834,4.201,13.4217,6.9066,470
-2.5307,-10.0341,0.4314,2.0567,-10.0341,3.13,11.3762,8.5543,471
-0.5262,-10.2846,1.6679,2.2459,-10.2846,4.114,11.8376,10.6025,472
-10.3893,-9.9089,0.4273,4.3252,-9.9089,6.4173,19.2101,10.7745,474
-0.7641,-9.8717,0.8677,1.4812,-9.8717,5.1344,14.0626,8.9276,475
-2.8792,-9.948,0.0969,1.6963,-9.948,1.846,9.3503,6.5891,476
-1.967,-9.9432,-0.0961,1.7804,-9.9432,1.6715,6.211,4.9741,477
-1.6172,-9.9342,-0.4151,0.6364,-9.9342,2.2355,7.5982,5.1138,478
-1.4174,-9.9389,0.2202,1.6536,-9.9389,2.0114,8.9258,6.8703,479
-3.1007,-10.1021,0.0059,1.5014,-10.1021,3.522,9.2335,7.172,480
-1.0828,-10.0702,1.4882,1.4095,-10.0702,4.2239,8.4885,6.6601,481
-1.0964,-9.9023,0.4628,0.9113,-9.9023,0.8082,6.4477,4.2841,482
-2.9646,-10.0239,0.3794,1.4226,-10.0239,3.5956,14.871,7.552,484
-1.662,-10.0546,-0.3783,0.5885,-10.0546,1.463,11.0792,7.5742,485
-0.9916,-10.016,-0.0666,0.8305,-10.016,1.0963,13.1592,10.5043,486
-4.6559,-10.0967,-0.6466,1.8867,-10.0967,2.3835,6.9185,3.8265,487
-0.5426,-10.2267,-0.15,0.3472,-10.2267,1.1295,8.4195,6.2779,488
-10.8088,-9.1082,-0.9924,6.3344,-9.1082,5.6854,27.0727,19.8624,489
-20.6543,-10.5028,-7.6595,10.7934,-10.5028,8.2423,72.1598,63.9299,490
-20.8405,-9.9515,-1.6501,9.7347,-9.9515,5.8203,33.3286,22.2701,491
-7.2736,-9.9782,6.0944,10.5392,-9.9782,1.9858,17.6211,14.3323,492
-11.6728,-9.8585,13.3927,23.3518,-9.8585,10.26,33.2996,20.59,495
-26.9421,-8.0275,35.374,59.8037,-8.0275,12.8057,51.7725,41.3751,496
-4.6745,-9.4217,10.3604,12.171,-9.4217,4.3724,29.0974,21.4639,497
-4.3284,-10.0933,-0.1278,2.226,-10.0933,3.2144,14.4299,7.7952,498
-5.6448,-10.6776,-0.2735,3.9009,-10.6776,4.3239,19.1635,11.4987,499
-4.9977,-9.5266,4.5464,11.1391,-9.5266,5.0945,31.9981,23.346,500
-36.9687,-10.3934,-1.2997,12.0799,-10.3934,7.5758,44.7503,20.3665,501
7.0605,-9.8359,71.0458,56.5223,-9.8359,7.0672,49.1262,39.4407,502
-6.6354,-10.4517,10.6296,16.1683,-10.4517,13.5722,48.7161,30.831,503
-2.3161,-9.8623,1.6016,3.256,-9.8623,5.3557,23.6626,10.9064,504
-3.1505,-10.0038,0.9468,3.2446,-10.0038,2.9778,19.5385,17.421,505
-2.3035,-10.286,2.3893,4.3277,-10.286,1.0516,19.9594,14.5926,506
-6.7758,-10.1855,0.1902,3.4475,-10.1855,1.9799,26.1309,17.0688,507
0.7675,-9.9953,25.3627,17.1208,-9.9953,4.4549,28.5576,24.2276,508
-19.3479,-10.0142,3.9126,15.9554,-10.0142,9.2515,32.6075,20.2941,509
-11.6771,-9.8924,8.2618,16.767,-9.8924,4.4525,21.5216,16.9652,510
-0.7127,-10.0761,0.1175,0.6973,-10.0761,2.2904,9.6436,5.7952,511
-2.5191,-10.2218,-0.2254,1.6997,-10.2218,1.1843,8.3242,4.162,512
-7.7354,-10.0796,0.934,5.6247,-10.0796,4.3145,19.4587,7.2068,514
-21.542,-10.2308,8.0699,19.6187,-10.2308,17.9968,46.8695,33.8662,515
-13.4725,-10.2296,8.9723,16.6322,-10.2296,8.0334,29.9288,24.4245,516
-10.0077,-9.6509,0.3971,6.7154,-9.6509,4.4104,27.8031,20.1425,517
-9.3181,-9.8269,2.3168,5.7799,-9.8269,5.4625,18.9042,16.5387,518
-3.8035,-10.2215,0.4245,3.0312,-10.2215,3.9397,12.6453,9.0235,519
-2.0518,-10.1211,-0.2827,1.0525,-10.1211,4.8372,9.6364,7.1404,520
-6.7032,-9.6089,-0.2374,2.5621,-9.6089,2.3416,11.8776,5.0882,521
-3.415,-9.8009,-0.1189,2.1588,-9.8009,3.9997,12.3006,6.5976,523
-6.0522,-10.0531,-0.8252,2.0438,-10.0531,2.8217,10.892,6.6409,524
-1.0348,-10.262,0.219,0.8737,-10.262,1.0859,11.642,8.3065,525
-0.3176,-9.8122,2.4451,1.9128,-9.8122,2.3656,9.7963,8.2219,526
-0.3833,-10.6706,0.6854,1.3081,-10.6706,1.2285,11.235,5.6522,527
-33.1737,-10.5974,-8.5894,16.5118,-10.5974,8.3294,49.6375,20.602,528
-109.5017,-9.5654,11.1661,92.5083,-9.5654,11.1098,50.319,41.6253,529
-41.0027,-9.7682,-8.1938,16.2906,-9.7682,4.0859,22.2534,14.5024,530
-0.7587,-10.2034,11.0641,9.8926,-10.2034,4.7171,48.2839,21.4707,531
8.21,-9.6512,17.185,5.6771,-9.6512,1.9852,56.372,36.289,532
-3.5968,-9.8348,1.0704,2.5439,-9.8348,3.4521,28.0393,15.6341,534
-2.6902,-10.0705,0.8797,1.849,-10.0705,3.7055,13.0768,4.24,535
-1.0837,-9.9855,1.8905,2.9222,-9.9855,3.3671,14.0963,11.9079,536
-3.5408,-10.2084,-0.3676,1.542,-10.2084,1.6672,37.6369,32.4005,537
-250.696,-8.814,16.7504,140.1927,-8.814,35.9701,129.2523,29.0513,538
-142.0668,-10.9758,-28.5738,100.8906,-10.9758,18.3162,99.4516,63.9871,539
-59.7526,-10.0224,-4.2816,14.4071,-10.0224,8.2787,56.4499,11.0617,541
-27.7197,-10.0663,-2.6493,10.235,-10.0663,5.5368,45.2793,13.9086,542
-17.3053,-9.8551,-1.4775,5.8625,-9.8551,5.1374,24.6259,13.8845,543
-18.4391,-9.825,-3.5381,6.0963,-9.825,2.6846,9.2816,5.3655,544
-3.6624,-9.9052,2.0341,6.0933,-9.9052,3.3426,10.1448,5.8118,545
-1.2977,-10.0815,1.1439,2.0598,-10.0815,3.5057,41.1733,34.5314,546
8.6988,-9.8891,19.194,9.109,-9.8891,3.4472,32.9477,31.3596,547
-17.8608,-9.7835,-5.3536,4.7879,-9.7835,3.5451,29.983,22.0237,549
-19.8662,-10.2548,-3.6925,8.1713,-10.2548,4.18,17.0575,7.4325,550
-8.8061,-10.3278,-0.7076,5.8994,-10.3278,3.7415,17.7094,9.2952,551
-7.3617,-9.4885,2.6731,6.57,-9.4885,3.8144,9.8699,5.7185,552
-4.1031,-9.7032,4.6684,5.274,-9.7032,4.0642,12.4597,9.3867,553
-1.5611,-9.5843,7.095,4.5663,-9.5843,4.4689,11.2451,9.1269,554
-5.7105,-9.9368,16.1359,11.8816,-9.9368,6.0394,16.0693,13.7587,555
-17.1068,-9.9559,-4.6401,5.5854,-9.9559,3.0726,18.9769,16.1539,556
-15.1584,-9.8017,-6.7803,4.257,-9.8017,3.4476,19.3446,11.3245,557
-30.6025,-9.8362,0.3018,17.3392,-9.8362,8.0658,71.8563,7.7201,559
-69.4993,-9.4476,-7.2017,16.6297,-9.4476,10.6448,59.4846,21.5247,561
-74.8616,-9.205,-0.6498,50.9515,-9.205,14.3222,69.6201,38.0967,562
-16.8648,-9.8856,2.1049,9.2409,-9.8856,4.9306,16.3413,4.8705,563
-13.4477,-10.0226,2.633,9.6538,-10.0226,6.7146,32.1559,17.127,564
-30.6144,-10.1342,1.347,12.2186,-10.1342,7.2355,56.8705,23.7374,566
-10.5005,-10.1908,3.9726,9.9866,-10.1908,2.3256,22.7234,12.9335,567
-5.4941,-10.2302,3.0754,6.498,-10.2302,5.7569,22.5837,15.0823,568
-15.0204,-10.7607,-1.3849,9.9719,-10.7607,1.798,12.6132,10.4146,569
-2.4367,-9.4247,2.9542,7.7618,-9.4247,5.7511,15.6744,12.3558,570
-16.7725,-9.983,-0.845,5.1059,-9.983,3.5759,14.2665,8.195,571
-2.0157,-10.0524,0.7414,1.7608,-10.0524,1.4133,11.3581,5.5307,572
-6.1324,-9.9687,0.4834,2.9547,-9.9687,5.4062,15.7164,10.0511,574
-13.3271,-9.9654,3.8969,6.6271,-9.9654,7.57,23.0215,12.3848,575
-11.2464,-9.9423,-3.1247,5.8497,-9.9423,0.9061,15.0796,7.9095,576
-2.7401,-9.7497,1.52,2.9262,-9.7497,4.1171,15.5591,7.2886,577
-7.6348,-10.3297,0.9593,5.1459,-10.3297,2.5597,11.7938,7.6306,578
-0.9798,-9.7205,-0.177,0.424,-9.7205,1.6651,17.8427,11.5638,579
-2.4908,-10.0331,0.2639,1.5743,-10.0331,1.691,12.229,3.4655,580
-4.8729,-9.9426,-0.4436,1.7119,-9.9426,2.1212,9.3252,4.8709,581
-6.5238,-10.3447,-1.234,3.6377,-10.3447,1.1293,9.6019,5.0449,582
-0.6416,-9.9553,6.2274,5.0223,-9.9553,0.9951,23.8705,19.3286,583
-0.5866,-10.0707,0.1081,0.3999,-10.0707,1.1459,9.1704,4.7486,584
-0.6832,-10.0459,0.3798,1.0042,-10.0459,1.6761,9.962,5.381,585
-3.5024,-10.0085,-0.0956,1.8465,-10.0085,3.3057,6.6382,2.9487,586
-0.5473,-10.0135,0.3629,1.1405,-10.0135,0.6466,3.9275,2.356,587
-0.091,-10.0209,-0.0261,0.0637,-10.0209,0.1689,1.0199,0.8019,588
0.157,-10.0336,0.2791,0.1219,-10.0336,0.1957,1.8196,1.6369,589
-0.348,-10.0264,-0.2976,0.0576,-10.0264,0.0715,1.3924,1.2952,590
-0.3069,-10.0151,-0.1122,0.1368,-10.0151,0.3123,0.9661,0.8346,591
-0.4798,-9.9757,-0.0971,0.343,-9.9757,0.6485,2.0134,0.9374,592
-6.1694,-9.9911,0.2753,1.8937,-9.9911,1.7159,10.1922,2.8968,594
-3.3257,-9.9948,1.2319,3.7984,-9.9948,2.764,21.7692,10.4136,595
-5.2256,-10.3801,2.3405,7.2944,-10.3801,2.7447,26.9234,24.0837,596
-1.1319,-10.1453,5.2453,7.9221,-10.1453,7.4202,24.9441,18.484,597
-7.3015,-10.0734,0.5034,4.0158,-10.0734,4.6604,21.0793,16.74,598
-13.8146,-10.1576,-0.9616,6.1022,-10.1576,4.6715,14.2651,8.3074,599
-9.1405,-10.129,2.4988,7.2064,-10.129,3.3727,13.9125,9.7323,600
-35.0562,-10.0845,0.9016,15.0825,-10.0845,7.6851,32.7657,11.199,601
-8.4709,-9.8081,-0.6948,2.8361,-9.8081,4.1521,14.0739,7.1508,603
-12.0757,-10.1156,0.7804,5.1153,-10.1156,5.8612,15.0938,11.3449,604
-6.3229,-10.0836,4.7838,10.3363,-10.0836,2.2321,18.7229,13.9844,605
-6.7123,-9.777,-1.0529,3.2864,-9.777,1.6341,14.5936,8.6459,606
0.0691,-9.9684,3.1913,2.9033,-9.9684,3.7813,11.1611,7.4936,607
-9.8906,-9.3856,2.6017,8.9397,-9.3856,4.0576,14.8854,12.0985,608
-6.4585,-9.8031,-2.1149,3.0531,-9.8031,1.7987,10.3227,7.937,609
-4.0467,-9.2205,0.1471,2.0644,-9.2205,7.2763,18.2761,9.9169,610
-4.681,-9.2949,-0.9356,2.1899,-9.2949,3.3328,15.9612,9.3566,611
-0.0072,-10.2606,0.6578,0.6163,-10.2606,1.8921,7.0393,5.0561,612
-11.365,-9.8854,2.5693,5.4832,-9.8854,6.8042,22.7817,11.2876,614
-9.088,-9.7732,0.0118,3.8013,-9.7732,4.1662,18.8385,8.9612,615
-2.8432,-10.6008,-0.3021,1.9801,-10.6008,1.7806,11.8569,7.1735,616
-0.0687,-9.9346,2.223,2.1055,-9.9346,3.5165,10.9538,7.6717,617
-1.8839,-10.1395,-0.3178,0.7406,-10.1395,0.82,6.1207,3.7399,618
-2.0856,-10.0508,0.0986,1.8079,-10.0508,0.647,15.7596,12.5174,619
-15.4305,-10.1129,0.0159,8.2075,-10.1129,5.3062,29.6947,12.5826,620
-4.3884,-9.9103,4.7791,5.4633,-9.9103,6.0267,28.0133,11.2868,621
-7.8141,-8.7585,-0.3921,2.6328,-8.7585,2.169,40.3569,10.2979,623
-3.5523,-9.8545,-0.8381,1.8213,-9.8545,0.789,17.5722,16.074,624
-2.2533,-9.9517,0.0941,1.7755,-9.9517,3.4035,11.8911,9.8415,625
-4.3593,-9.2189,-0.566,2.6453,-9.2189,2.4307,11.6474,7.488,626
-3.963,-9.9316,-0.0489,1.7186,-9.9316,3.107,11.1501,8.8655,627
-10.8531,-9.1438,-1.8218,3.2703,-9.1438,3.5709,15.8722,8.1645,628
-1.0735,-10.0653,-0.0296,0.8021,-10.0653,1.4506,8.3641,5.3684,629
-0.3343,-9.9389,0.2637,0.7754,-9.9389,1.386,5.8612,4.4425,630
-6.6467,-10.1949,-0.2867,2.2031,-10.1949,2.9613,14.932,7.9983,631
-4.3705,-9.9408,0.4885,2.3325,-9.9408,2.8829,14.3525,6.1712,633
-2.5085,-10.079,-0.0695,2.0819,-10.079,1.3886,9.1595,4.9616,634
-0.6455,-9.7047,0.63,1.541,-9.7047,2.2816,12.9494,6.0937,635
-3.1242,-9.7769,0.0049,1.833,-9.7769,2.0152,8.553,4.8893,636
-6.913,-10.073,0.2662,3.1453,-10.073,1.8708,9.5924,7.5468,637
-1.7736,-10.2988,-0.2084,1.2742,-10.2988,2.1331,10.3626,8.3398,638
-4.9726,-10.9248,-0.306,2.0641,-10.9248,1.6802,13.3067,6.5416,639
-3.3968,-9.9838,-0.1701,1.8616,-9.9838,1.798,12.9376,6.5533,640
-3.4114,-10.1594,-1.1193,1.6259,-10.1594,2.8598,8.9572,4.457,641
-1.8203,-10.0773,-0.2987,0.6404,-10.0773,1.1822,11.0718,3.8912,642
-7.8915,-9.7656,0.728,3.6071,-9.7656,4.435,14.0536,7.683,644
-9.9049,-9.7505,1.5487,5.8114,-9.7505,7.4195,18.947,13.9894,645
-4.2096,-9.9079,-1.1277,1.6685,-9.9079,1.0622,9.2888,6.6759,646
-10.3587,-9.6435,0.6829,6.4812,-9.6435,1.4904,15.4657,10.7258,647
-6.2256,-10.6368,0.1418,3.3593,-10.6368,1.8763,9.4589,5.7849,648
-1.8252,-9.8629,0.8155,2.2436,-9.8629,3.721,10.1531,5.0542,650
-9.0782,-9.6081,-0.5522,3.5886,-9.6081,3.74,13.9756,6.7299,651
-4.6996,-9.5805,-0.8678,2.1003,-9.5805,2.2635,12.5068,10.7925,652
-3.0862,-9.7392,1.8733,3.5069,-9.7392,1.4704,12.4009,8.0817,653
-6.3714,-9.9146,-0.1348,2.708,-9.9146,3.1154,11.7899,7.8294,654
-8.2034,-9.9736,-0.7968,2.4565,-9.9736,2.694,12.5555,6.8242,655
-11.2403,-9.7034,-0.6205,5.9857,-9.7034,4.0711,11.7118,7.152,656
-1.3487,-10.0688,-0.5029,0.669,-10.0688,1.6207,11.8845,3.6188,657
-3.6108,-9.7825,-1.3631,1.6335,-9.7825,2.9616,9.8499,8.4021,658
-1.4816,-10.0775,0.023,1.0339,-10.0775,1.3256,10.6216,5.7066,659
-3.2485,-10.0502,0.7936,2.174,-10.0502,4.5999,9.1087,6.9261,660
-6.3561,-9.9749,-0.3184,2.5264,-9.9749,3.4303,13.5712,7.0509,661
-0.3339,-9.544,0.6541,0.9348,-9.544,2.1616,6.9656,4.3218,662
-3.7931,-10.0647,0.2044,2.3408,-10.0647,2.5091,8.7295,6.1079,663
-5.3283,-10.0974,1.5251,4.4174,-10.0974,3.3126,40.5865,8.8672,664
-3.6955,-9.9002,1.427,4.0371,-9.9002,0.845,41.5595,35.2974,665
-3.2487,-10.0582,-0.372,2.2007,-10.0582,0.8617,26.4942,24.7553,666
-1.6287,-9.9386,3.9442,5.8508,-9.9386,3.9312,29.7442,16.3641,667
1.0047,-9.5926,3.0621,2.2735,-9.5926,1.4365,14.8625,11.1678,668
-4.0067,-9.9618,7.8925,10.5638,-9.9618,2.7422,19.1582,14.7556,669
-5.7124,-9.1041,7.4354,8.9115,-9.1041,3.6106,32.2703,21.5859,670
-1.4479,-10.0431,1.9489,4.0551,-10.0431,5.5312,17.3625,10.9936,671
-5.6443,-9.6905,1.0752,4.1371,-9.6905,4.3565,18.6038,7.9947,673
-5.5945,-10.1043,1.3452,3.9014,-10.1043,3.6842,19.0477,8.5833,674
-0.0849,-9.865,0.5526,0.6404,-9.865,1.5694,9.3993,7.001,675
-2.5439,-9.6745,0.5073,1.9454,-9.6745,1.142,9.3276,6.2699,676
-2.9203,-9.8965,-0.027,1.5125,-9.8965,2.1308,12.6583,11.053,677
-5.9234,-9.6651,0.1755,1.8581,-9.6651,1.6854,13.3927,9.9733,678
-1.9502,-12.6807,0.0036,1.0363,-12.6807,1.4385,45.6766,16.0822,679
-1.9594,-9.4763,41.4709,31.3486,-9.4763,20.0113,57.3263,41.9849,680
-14.063,-10.0115,1.4591,9.7452,-10.0115,8.1366,30.2138,15.6734,681
-0.2148,-10.6512,1.6193,1.3675,-10.6512,1.1034,7.6635,5.6646,682
-5.0155,-9.9237,0.396,2.6298,-9.9237,2.8984,16.3571,7.146,683
-7.7839,-9.052,2.4604,6.2505,-9.052,5.7709,19.5772,10.1725,684
-6.4161,-9.8373,-1.6627,2.4438,-9.8373,3.5259,16.5388,5.9892,685
-17.2469,-9.8623,-0.7167,8.4863,-9.8623,4.8099,18.7311,11.239,686
-10.6918,-9.3444,-1.9454,5.2373,-9.3444,3.7764,11.0543,7.2815,687
-23.5006,-10.1113,-3.0015,9.2041,-10.1113,4.7162,14.8389,7.7698,688
-15.541,-9.8819,0.1362,9.9587,-9.8819,5.8718,23.1343,15.4916,689
-0.2131,-10.4528,5.4775,6.3133,-10.4528,3.9766,19.1838,16.3593,690
-0.4682,-9.9104,0.2436,0.4661,-9.9104,2.0107,7.9461,4.4806,691
-1.2249,-9.9807,0.9989,2.2724,-9.9807,3.2517,24.5477,22.5506,692
-20.6345,-9.856,9.8473,17.4229,-9.856,10.499,49.8948,16.9617,694
-67.3773,-9.7452,-8.3345,24.7111,-9.7452,9.2568,52.4671,40.6469,695
-12.2869,-10.6641,-2.2943,6.7423,-10.6641,9.8104,30.9018,20.6584,696
-14.4945,-10.509,-4.3147,8.0204,-10.509,3.4034,17.1115,11.0159,697
-2.497,-10.4236,0.1617,2.0439,-10.4236,2.8317,13.2955,9.421,698
-15.4034,-9.2114,-0.9596,7.2956,-9.2114,2.7236,18.1723,10.2888,699
-14.9487,-10.2024,-0.8326,8.0059,-10.2024,2.4886,17.0999,15.9755,700
-3.1702,-9.8866,0.0241,2.2737,-9.8866,2.913,10.3587,5.412,701
-7.2037,-9.6988,-0.8767,2.8754,-9.6988,4.3657,20.4618,7.2383,703
-3.2691,-9.2226,0.4953,3.5191,-9.2226,2.0434,13.8836,11.619,704
-1.5204,-10.4538,1.7382,4.2137,-10.4538,4.094,17.0281,13.1198,705
-7.7058,-8.8142,-1.8495,3.3851,-8.8142,1.4179,13.9995,8.8073,706
-3.39,-10.2132,3.1388,5.3193,-10.2132,2.8341,13.9924,12.7381,707
-4.5307,-9.6812,1.6932,3.9042,-9.6812,0.8872,13.8653,8.6891,708
-5.0788,-10.2726,-0.3988,3.1449,-10.2726,3.968,10.6112,6.1927,709
-4.9137,-10.3492,0.4233,3.1232,-10.3492,3.7414,13.5806,7.8159,710
-5.7247,-10.0661,1.6984,4.7071,-10.0661,3.6394,19.9161,11.5492,711
-93.2085,-9.9737,-4.4353,20.0362,-9.9737,11.3916,46.5121,32.2668,713
-10.2014,-9.9775,-1.5532,3.8487,-9.9775,4.7557,16.007,10.6697,714
-10.6112,-9.7879,-3.8199,4.3953,-9.7879,2.1011,19.0373,8.5706,715
-58.6819,-9.4542,-19.4845,21.2841,-9.4542,5.9391,38.6909,34.945,716
-10.9208,-9.2926,6.4978,8.4167,-9.2926,3.0603,37.3993,29.4115,717
-9.7337,-9.6792,8.9019,10.3849,-9.6792,4.6059,27.417,25.7164,718
-20.2444,-9.9987,-4.0985,9.5151,-9.9987,9.7133,26.5881,22.4372,719
-5.864,-10.2699,-0.4523,3.3966,-10.2699,1.523,14.4683,9.3878,720
-13.6547,-9.7353,-3.4363,5.4259,-9.7353,4.8159,23.6115,20.2252,721
0.8573,-9.5927,5.5369,4.1269,-9.5927,3.288,23.4954,16.3241,722
-72.0985,-9.7158,2.0347,29.2277,-9.7158,13.1478,83.2599,10.8038,724
-5.1485,-10.0049,-1.5948,1.5481,-10.0049,1.3713,5.1545,2.7746,725
-1.7309,-9.9916,-0.1656,0.9814,-9.9916,1.0266,1.9652,1.2167,726
-5.9152,-9.9773,-3.3135,1.8445,-9.9773,1.2028,5.0477,3.7907,727
-22.0892,-9.9329,-4.504,4.8735,-9.9329,2.2396,37.4936,6.4344,728
-25.0562,-9.6006,-7.8305,8.8222,-9.6006,4.7908,42.2936,32.8762,730
22.0945,-10.225,41.0573,14.5441,-10.225,4.3896,57.3991,39.3418,731
5.5592,-10.3118,11.166,5.8784,-10.3118,3.0986,16.9031,13.7466,732
-52.4036,-9.9593,0.2774,47.6961,-9.9593,8.7638,30.3408,28.2369,733
-33.5327,-10.3092,-1.7642,12.6381,-10.3092,9.6172,75.0346,65.5543,734
-14.7738,-10.2542,0.1715,5.6676,-10.2542,7.0286,32.4472,13.405,735
-5.6651,-10.4757,0.2394,3.6157,-10.4757,3.6198,38.1225,21.8674,736
-12.1263,-10.7664,-1.1104,4.7616,-10.7664,6.8579,66.9523,56.8334,737
-8.9662,-10.1705,-3.0631,5.6445,-10.1705,1.5715,28.3452,25.0458,738
0.8228,-10.028,2.5152,1.4442,-10.028,2.1181,21.7453,18.3176,739
-2.5991,-10.3563,1.4389,2.8413,-10.3563,2.6747,10.8613,6.7189,740
-5.7475,-10.2414,0.3714,2.8212,-10.2414,2.323,17.0208,10.4573,741
-1.7651,-10.0648,1.7752,3.1,-10.0648,2.6839,20.3702,17.6188,742
-43.3879,-9.8282,-9.2148,20.0774,-9.8282,9.8769,36.9851,34.1944,744
-58.3823,-9.764,15.6619,79.5608,-9.764,24.9588,127.613,9.8119,745
0.7035,-9.9466,14.3034,9.2951,-9.9466,5.1753,14.7228,8.9769,746
-0.1662,-10.0147,0.5444,0.9284,-10.0147,0.7969,3.2313,2.1323,747
-17.5217,-9.9511,-8.964,5.8168,-9.9511,4.7062,48.0823,31.7396,748
-22.0665,-9.9262,2.127,11.7713,-9.9262,5.6867,18.8502,6.4197,749
-12.4882,-10.0848,-0.6206,5.2997,-10.0848,3.6937,11.5365,2.7974,750
-10.9059,-10.0214,-0.7549,3.0591,-10.0214,1.7925,5.7064,2.8159,751
-2.0016,-10.0242,-0.0612,0.4376,-10.0242,0.8959,4.533,0.8496,752
