AYGX_min,AZ_mean,AYGX_mean,AYGX_std,AZ_mean,GX_std,Gnorm_max,Gnorm_median,timestamp
-0.708,-9.6151,-0.6307,0.0494,-9.6151,0.0196,2.3828,2.358,0
-0.7343,-9.6143,-0.653,0.0391,-9.6143,0.0156,2.3929,2.3652,1
-0.7291,-9.615,-0.6513,0.0513,-9.615,0.0206,2.3875,2.3674,3
-0.7646,-9.6148,-0.6609,0.05,-9.6148,0.0198,2.3869,2.3735,4
-0.7162,-9.6151,-0.6504,0.0271,-9.6151,0.0107,2.3924,2.374,5
-0.7336,-9.6146,-0.6584,0.0438,-9.6146,0.0174,2.3904,2.3735,6
-0.7742,-9.6149,-0.6702,0.0457,-9.6149,0.0181,2.3887,2.3683,7
-0.8376,-9.6146,-0.67,0.0565,-9.6146,0.0224,2.4027,2.3672,8
-0.7049,-9.615,-0.6463,0.0551,-9.615,0.0218,2.3685,2.3527,9
-0.7044,-9.6146,-0.6512,0.0269,-9.6146,0.0107,2.3816,2.3572,10
-0.7343,-9.6133,-0.6679,0.0469,-9.6133,0.0187,2.3875,2.374,11
-64.5151,-9.6393,-1.2123,30.3101,-9.6393,12.0556,33.3306,10.705,13
-35.7542,-9.6053,-13.8872,11.4231,-9.6053,4.9788,14.2615,9.0405,14
15.8401,-9.4428,38.6379,12.8362,-9.4428,3.7747,16.4971,15.477,16
-6.5749,-9.8798,-0.3227,3.5341,-9.8798,4.7191,14.44,11.7226,17
-1.9074,-9.8445,6.4857,6.9978,-9.8445,1.511,20.2749,19.0157,18
-12.239,-9.9552,-1.8509,4.7593,-9.9552,3.8952,42.399,39.0568,19
-6.3199,-9.9522,2.7867,7.7383,-9.9522,2.0518,44.4913,42.2217,20
-14.345,-9.9242,-3.2376,4.4449,-9.9242,3.3941,47.0094,39.6395,21
-10.3053,-9.8256,-7.0705,2.4457,-9.8256,1.4387,49.0406,47.8529,22
-3.9838,-9.8942,-0.649,1.5949,-9.8942,2.0956,26.8993,18.0931,23
-1.9425,-9.9037,0.7638,1.8625,-9.9037,1.8757,6.9961,4.8618,24
-2.2438,-9.9194,0.6397,1.6082,-9.9194,2.8758,15.2888,6.8163,25
-1.026,-10.0194,4.4315,4.466,-10.0194,4.7215,20.6624,12.1052,26
-5.6673,-10.0619,1.223,2.8531,-10.0619,4.625,37.4909,19.5239,27
-2.4283,-9.8994,21.0346,21.0005,-9.8994,1.8944,43.1385,35.9027,28
-11.7098,-9.8639,-1.3081,4.6774,-9.8639,2.1601,9.2354,5.3699,29
4.3588,-9.8247,15.181,9.4003,-9.8247,3.1195,36.0109,18.3188,30
-7.1036,-9.9617,1.2409,4.9628,-9.9617,4.9287,18.7811,11.3194,31
-4.6893,-9.8394,-0.5665,1.2045,-9.8394,2.327,18.181,7.684,33
-3.4357,-9.9253,1.7117,2.8102,-9.9253,3.4279,33.7034,19.1817,34
-3.1721,-9.7403,-0.4598,1.8342,-9.7403,1.0784,37.8662,35.7989,35
-6.4373,-10.331,0.1521,4.553,-10.331,2.0401,52.2478,48.1422,36
-0.5776,-9.9558,0.1668,0.6085,-9.9558,1.8066,21.0037,19.6103,37
-2.179,-9.9329,1.6336,3.8796,-9.9329,1.3415,19.1672,14.1142,38
-0.5471,-9.8563,1.1891,1.7098,-9.8563,1.781,10.2521,4.6877,39
-2.3564,-9.8863,-0.1149,0.7263,-9.8863,1.0443,6.1959,4.2132,40
-1.26,-10.0035,0.5806,0.9671,-10.0035,4.3439,14.2393,10.2036,41
-2.7846,-10.2806,0.989,2.6538,-10.2806,3.4646,32.334,5.8754,43
-34.3068,-9.1975,-5.9286,14.0278,-9.1975,6.8461,45.4696,18.0613,44
-4.6598,-10.2598,2.4071,4.8386,-10.2598,4.1979,49.718,34.8583,45
-2.4071,-9.6915,0.7907,2.2059,-9.6915,0.4387,20.6105,15.5948,46
-4.7592,-9.9248,0.2227,2.7101,-9.9248,0.7254,26.4946,19.4013,47
-7.4182,-9.997,-2.985,3.2583,-9.997,2.2627,40.1878,36.2376,48
-8.42,-9.9191,9.4893,10.7814,-9.9191,2.7761,83.3855,71.5861,49
-1.2769,-10.2042,-0.0688,0.7273,-10.2042,1.5585,57.583,46.3548,50
-5.5499,-9.9549,0.372,2.724,-9.9549,1.6788,51.9568,43.025,51
-13.2882,-9.9187,1.0227,5.6254,-9.9187,6.8156,34.0135,14.7346,53
2.0231,-9.8136,6.9987,3.5593,-9.8136,0.6497,20.0001,13.6445,54
-5.0647,-9.7641,0.7759,5.155,-9.7641,1.1489,54.8508,51.0538,55
-0.8432,-9.9585,6.89,8.4363,-9.9585,4.792,58.2221,45.2443,56
-10.0752,-9.8869,-1.4215,4.9638,-9.8869,5.0442,13.544,9.0318,57
-41.4826,-9.8141,-1.6422,19.9412,-9.8141,13.1636,25.3468,11.9255,59
-23.4838,-9.876,-6.3037,12.4955,-9.876,7.2056,22.3139,16.0943,60
-7.0033,-10.0029,-2.9732,2.3154,-10.0029,4.4151,20.6731,16.3613,61
-7.8621,-9.921,-0.0907,4.8398,-9.921,7.9547,13.4816,9.8502,62
-12.0879,-9.8871,-0.314,5.6304,-9.8871,3.571,9.3994,5.9238,63
-65.093,-9.6706,-32.5963,23.8838,-9.6706,8.278,30.6894,21.1785,64
-56.5895,-9.7379,0.1933,28.7156,-9.7379,13.5767,29.1084,16.9053,65
-7.6036,-9.9037,2.5146,6.6313,-9.9037,4.9372,16.4628,14.91,66
-10.384,-9.8648,-1.1032,2.9934,-9.8648,3.016,8.7947,2.7254,68
-1.0392,-9.854,1.8859,4.0381,-9.854,3.0024,10.6964,2.471,69
3.2397,-9.8792,11.9731,4.0425,-9.8792,4.7024,25.7516,16.7016,70
-0.9468,-9.7382,2.8745,2.1156,-9.7382,1.7947,6.8239,4.8663,71
-145.5623,-9.5901,-60.9033,63.1905,-9.5901,13.4512,38.612,35.0382,72
-5.4444,-9.8053,-2.0026,2.767,-9.8053,1.924,4.4047,3.002,73
-2591.1814,-2.1148,-245.9876,653.6161,-2.1148,77.8191,244.0845,77.7094,74
-19.2868,0.8942,2.7507,20.6034,0.8942,4.4265,12.5862,2.8259,75
-3.2433,0.8209,-2.6139,0.3602,0.8209,0.0363,2.3846,2.359,77
-2.9115,0.8222,-2.6323,0.212,0.8222,0.0214,2.3788,2.3593,78
-2.8823,0.825,-2.668,0.1188,0.825,0.0121,2.4042,2.3671,79
-2.7912,0.8248,-2.6334,0.0906,0.8248,0.0093,2.3853,2.3593,80
-2.8804,0.8249,-2.6865,0.1011,0.8249,0.0103,2.3702,2.3601,81
-2.9255,0.8236,-2.5243,0.1819,0.8236,0.0185,2.38,2.3534,82
-2.9097,0.8237,-2.5782,0.1409,0.8237,0.0143,2.3909,2.3603,83
-2.6444,0.825,-2.5866,0.0913,0.825,0.0093,2.3658,2.3498,84
-2.7919,0.8242,-2.6114,0.1203,0.8242,0.0122,2.3837,2.3452,85
-2.8652,0.8232,-2.6259,0.1524,0.8232,0.0155,2.3842,2.359,86
-2.8792,0.8225,-2.6073,0.1484,0.8225,0.0151,2.3788,2.3559,87
-3.7551,0.9176,3.6879,13.5226,0.9176,1.3819,5.0538,2.3542,88
85.4562,-1.1834,254.9584,87.5471,-1.1834,8.4754,49.1992,34.7219,89
88.9337,-6.1657,247.0847,81.1245,-6.1657,8.8093,51.4397,35.7563,90
-59.1315,-9.1949,65.9436,112.0461,-9.1949,10.0082,58.0568,39.5575,91
-79.3055,-9.5483,-11.8537,28.1955,-9.5483,9.806,29.3366,7.228,92
-7.8457,-9.5851,9.3418,11.4438,-9.5851,5.2231,13.5782,5.5525,93
