AYGX_min,AZ_mean,AYGX_mean,AYGX_std,AZ_mean,GX_std,Gnorm_max,Gnorm_median,timestamp
-2.2426,-9.5499,-0.7507,0.8371,-9.5499,0.3531,1.2681,1.0537,2
-1.8357,-9.5486,-0.8929,0.5887,-9.5486,0.2461,1.2014,1.0463,3
-1.8829,-9.5506,-0.7659,0.6886,-9.5506,0.292,1.1819,1.0482,4
-2.2579,-9.5487,-0.8677,0.6724,-9.5487,0.2774,1.2779,1.0499,5
-1.9956,-9.5513,-0.8872,0.7421,-9.5513,0.3156,1.2506,1.065,6
-1.5984,-9.5514,-0.9073,0.5407,-9.5514,0.2237,1.1533,1.0283,7
-2.1177,-9.5527,-1.1707,0.656,-9.5527,0.2683,1.2565,1.0632,8
-1.8054,-9.5514,-0.6656,0.8944,-9.5514,0.3854,1.2206,1.0781,9
-2.6886,-9.5591,-0.7487,1.3938,-9.5591,0.5915,1.425,1.1468,10
-2.1126,-9.5431,-1.2801,0.8159,-9.5431,0.34,1.3385,1.0735,11
-0.5757,-9.8159,-0.3392,0.2087,-9.8159,0.3425,1.3796,1.2046,168
-0.8734,-9.8127,-0.2511,0.4484,-9.8127,0.681,1.8641,1.1486,170
-0.1171,-9.8167,0.007,0.1048,-9.8167,0.187,1.0178,0.9762,171
-0.1024,-9.8168,-0.0741,0.0223,-9.8168,0.0399,1.0184,0.9923,172
-0.2489,-9.8189,-0.1106,0.0493,-9.8189,0.0843,1.0843,0.9954,173
-0.3813,-9.8194,-0.3217,0.0427,-9.8194,0.0856,1.2284,1.1652,174
-0.1802,-9.8183,-0.0144,0.0709,-9.8183,0.1506,1.0888,0.9912,175
-0.2183,-9.8179,-0.174,0.0303,-9.8179,0.0538,1.0782,1.0446,176
-0.2528,-9.8171,-0.1881,0.0363,-9.8171,0.0734,1.1191,1.0523,177
-40.9688,-9.7463,-10.296,10.2293,-9.7463,4.1346,20.3218,8.233,178
-37.0528,-9.5769,-4.8027,11.689,-9.5769,4.9784,19.7932,2.5138,180
-0.1346,-9.5916,0.0907,0.1649,-9.5916,0.074,0.975,0.9507,181
-0.5191,-9.5991,-0.4223,0.0594,-9.5991,0.0265,0.9751,0.9679,182
0.4018,-9.6244,0.855,0.2812,-9.6244,0.1349,1.1818,1.1301,183
-2.042,-9.5731,1.08,3.8212,-9.5731,1.5833,3.4738,1.3718,184
10.0237,-9.3851,22.9659,7.9931,-9.3851,2.9748,14.2115,10.935,185
-7.9288,-9.8027,-0.4435,3.5918,-9.8027,2.2751,10.0413,6.2412,186
-73.7775,-9.6806,-22.6295,25.8091,-9.6806,12.9782,25.4551,20.1429,187
-3.9739,-9.689,-0.9254,1.6868,-9.689,0.9269,2.0752,1.2863,188
-1.5717,-9.6873,-0.6204,0.5429,-9.6873,0.3029,1.2952,1.0585,189
-0.9708,-9.687,-0.6319,0.2688,-9.687,0.1502,1.1019,1.0437,190
-0.9059,-9.6857,-0.6812,0.1776,-9.6857,0.0992,1.1071,1.0632,191
-6.9155,-9.7135,4.8627,9.8921,-9.7135,6.8329,17.9394,3.8031,193
-44.5154,-9.5832,-25.998,12.9492,-9.5832,3.2008,20.0752,18.4314,194
0.9562,-9.5482,13.8736,11.5696,-9.5482,5.6054,18.7974,11.727,195
-81.3242,-9.6564,-21.9453,30.3911,-9.6564,7.5159,22.361,15.0367,196
-11.3262,-9.6581,11.593,19.6388,-9.6581,8.0253,23.5889,7.5923,197
-19.1726,-9.9445,-4.7192,14.7476,-9.9445,7.3823,28.2602,14.7156,198
-18.0356,-9.8502,-1.1952,8.3232,-9.8502,8.316,42.4684,22.1216,200
-27.1222,-9.8484,-1.9418,10.9582,-9.8484,3.9883,23.6155,19.9545,201
-6.1402,-9.9638,14.852,18.1462,-9.9638,5.1013,40.9022,35.0757,202
-4.6629,-8.9008,2.5938,5.7104,-8.9008,2.1201,29.6255,12.9325,203
-3.9486,-9.8606,-0.4917,1.8708,-9.8606,2.3685,10.3785,4.0058,204
-20.6128,-9.9724,-5.5787,9.1433,-9.9724,5.9334,21.8103,15.0826,205
-7.4956,-10.2077,2.359,7.9727,-10.2077,10.8544,35.1858,30.3133,206
-4.7421,-9.2358,0.718,2.6801,-9.2358,5.6195,34.371,10.7678,207
-2.4948,-10.0661,2.031,3.2614,-10.0661,3.4529,17.5803,11.1169,208
-17.3865,-9.8909,-0.5943,4.1868,-9.8909,5.0185,16.9559,7.6474,210
-1.1648,-9.5343,-0.0364,0.5227,-9.5343,0.6005,6.8273,4.4983,211
-2.1461,-9.6782,-0.3721,1.0367,-9.6782,2.4527,8.9409,3.5072,212
-4.0717,-9.8447,0.8959,4.2829,-9.8447,5.4752,14.0583,10.9164,213
0.0686,-9.9336,1.7931,1.8334,-9.9336,2.9299,11.3704,9.1424,214
-5.7864,-9.8071,0.2012,2.8428,-9.8071,1.2957,18.7713,15.6579,215
-2.718,-9.4871,1.0629,2.2902,-9.4871,3.1962,9.8812,5.698,216
-2.2251,-9.8271,0.0069,1.2469,-9.8271,1.8523,13.2076,7.1438,217
-5.7894,-9.8513,-1.27,2.316,-9.8513,2.356,13.5721,7.8077,218
-19.175,-9.7695,0.7806,7.3478,-9.7695,7.1636,24.381,10.4757,220
-16.157,-9.737,-1.1166,4.8373,-9.737,6.3816,24.4922,11.114,221
-12.2555,-9.8749,-1.6126,3.5172,-9.8749,4.1443,10.6962,7.5305,222
-5.638,-9.7461,-1.0925,1.894,-9.7461,2.1261,8.2378,3.9682,223
-8.4665,-9.839,0.0596,3.8905,-9.839,5.3954,12.2441,6.7601,225
-3.2523,-10.0791,0.8137,2.9102,-10.0791,4.584,11.5522,8.9197,226
-4.9285,-9.8756,-0.4217,2.3229,-9.8756,4.4145,12.6749,7.3791,228
-9.5863,-9.6829,-0.8235,5.723,-9.6829,2.574,15.2491,13.718,229
-5.8551,-9.8248,-0.6362,3.1078,-9.8248,4.1185,14.9172,8.9473,230
-6.455,-9.7997,-1.4514,2.3211,-9.7997,3.5988,10.3248,4.2582,231
-1.8255,-9.9827,0.6995,1.3279,-9.9827,2.4135,7.4827,6.0603,232
-9.3745,-9.6596,-3.1505,4.9841,-9.6596,5.3976,22.8165,20.8548,233
-4.8395,-9.4786,-1.5899,2.7982,-9.4786,2.9538,10.0986,6.2148,234
-4.0462,-9.8865,1.0882,5.178,-9.8865,2.6289,20.273,14.9864,235
-0.9675,-9.8082,-0.1232,0.4612,-9.8082,1.1671,5.7208,4.28,236
-4.5224,-9.8601,-1.2286,1.9846,-9.8601,1.5245,7.8995,6.358,237
-9.0161,-9.7444,-1.2891,2.5657,-9.7444,3.782,12.9006,5.6689,238
-1.1503,-9.8737,0.8512,1.1935,-9.8737,1.8468,7.2667,4.5841,239
-7.7514,-9.5435,-0.84,2.6776,-9.5435,2.8723,16.7843,4.621,240
-7.4486,-9.851,-0.9796,2.2363,-9.851,2.7621,11.3597,4.2564,241
-6.2048,-9.7894,0.0069,3.3587,-9.7894,4.5508,10.7082,7.491,242
-6.9128,-9.8498,0.2331,3.7347,-9.8498,6.0527,17.7114,8.6559,243
-2.398,-9.6515,-0.0525,2.7227,-9.6515,4.7331,12.9116,5.1881,244
-5.4969,-9.8465,0.1516,2.9385,-9.8465,1.9123,13.2042,7.7729,245
-1.0832,-9.9013,0.4829,1.324,-9.9013,2.5884,7.5369,5.2791,246
-1.5473,-9.7078,0.875,1.5945,-9.7078,2.9217,11.5015,7.7646,247
-2.462,-9.6389,-0.101,0.8195,-9.6389,1.3252,14.3927,6.3272,248
-8.8185,-10.2526,2.0804,6.5452,-10.2526,3.1536,19.6566,13.0777,249
-2.8414,-9.8075,0.4999,1.9958,-9.8075,3.1413,15.3058,9.9997,250
-1.7239,-9.8527,0.887,1.7031,-9.8527,4.0084,16.9294,13.3499,251
-3.3096,-9.8441,0.9493,2.1035,-9.8441,4.7888,20.0659,9.2622,252
-2.4231,-9.2262,-0.1809,0.8909,-9.2262,1.8399,15.6187,5.448,253
-2.5213,-7.8944,-0.3826,1.3858,-7.8944,1.7047,23.3927,8.8359,254
-1.0451,-9.8606,0.0894,0.6843,-9.8606,1.5176,11.9013,10.2406,255
-3.027,-9.968,-0.3965,1.68,-9.968,4.1345,17.1364,13.4074,256
-2.1508,-9.7735,-0.023,1.5313,-9.7735,2.8319,14.5851,11.4975,257
-1.0631,-9.817,6.4785,5.2584,-9.817,1.276,13.1116,10.1193,258
-2.5282,-9.6265,-0.5574,1.2644,-9.6265,1.8182,15.4989,11.5859,259
-5.5048,-9.7778,-0.6039,2.5833,-9.7778,1.4028,8.7431,6.5011,260
-14.9537,-9.5492,1.2446,6.7897,-9.5492,7.9408,23.5497,10.2136,261
-19.9962,-9.939,-2.493,8.019,-9.939,3.3095,19.5926,10.299,262
-10.806,-10.0346,-3.2632,4.6079,-10.0346,5.2045,25.6809,20.3451,263
-6.5015,-9.6646,2.6728,5.4365,-9.6646,2.704,14.6955,12.8384,264
-3.9388,-10.0073,2.5114,4.2145,-10.0073,4.6349,22.2805,14.6915,265
-20.5533,-9.8813,-3.1033,8.0654,-9.8813,2.9094,18.7619,16.6364,266
-3.453,-9.7674,-0.9088,1.3949,-9.7674,1.9482,5.05,3.5082,267
-4.8509,-9.8278,0.1127,3.4318,-9.8278,5.8356,12.8844,10.6856,268
-9.0968,-9.9873,0.4711,4.4015,-9.9873,2.3175,12.5728,8.6299,269
-1.8081,-9.842,0.2964,1.0608,-9.842,2.9332,10.7824,5.5734,270
-1.9602,-9.8435,0.1545,1.2783,-9.8435,2.4017,7.8722,3.5092,271
0.0112,-9.8412,1.2854,1.5256,-9.8412,3.9646,9.3302,3.816,272
-8.7451,-9.7633,-1.4105,4.7961,-9.7633,2.2632,8.6303,6.7403,273
-12.6662,-9.9471,-0.6352,7.0256,-9.9471,2.842,12.6423,9.478,274
-0.8923,-9.9161,2.0248,2.4867,-9.9161,2.2803,16.223,11.2966,275
-0.2645,-9.6393,0.4335,0.8039,-9.6393,1.4944,9.6955,4.3823,276
-2.6274,-9.7256,-0.3039,1.5515,-9.7256,3.299,14.3557,11.5868,277
-7.4153,-9.8227,-2.6144,3.6052,-9.8227,2.1441,9.8721,8.3354,278
-1.9546,-9.8643,0.1234,1.5667,-9.8643,3.9175,12.4847,5.8205,279
-3.1841,-9.6088,0.1283,1.7771,-9.6088,4.2186,11.2468,6.9123,280
-4.6467,-9.8659,-0.1592,2.9048,-9.8659,3.1754,9.4028,4.6957,281
-1.9201,-9.707,1.0486,1.7116,-9.707,1.7124,13.6831,5.6066,282
-6.0076,-9.9475,-0.1852,2.2346,-9.9475,4.4548,17.6771,6.0432,283
-5.1377,-10.362,1.6121,2.9997,-10.362,2.5832,20.6936,9.0235,284
-2.2065,-9.7197,-0.1672,1.0465,-9.7197,1.6807,12.467,4.2436,285
-0.7,-9.7645,-0.0865,0.417,-9.7645,1.3794,13.2669,3.3295,286
-2.8244,-9.9012,0.7698,2.5088,-9.9012,1.7229,9.4017,7.5849,287
-2.0955,-9.8409,-0.0742,1.2564,-9.8409,1.5204,7.9595,3.2498,288
-6.0673,-9.6626,0.1168,3.8809,-9.6626,4.6964,12.1467,8.6553,289
-20.6672,-9.9747,6.0192,14.6993,-9.9747,12.7452,42.2921,26.5021,290
-14.9266,-9.6946,8.5234,19.4875,-9.6946,6.0411,41.9889,21.474,291
-7.6133,-9.8777,1.3492,4.8726,-9.8777,4.0551,24.4078,15.3877,292
-3.6294,-9.6849,0.3507,2.6388,-9.6849,4.4276,12.0513,5.0956,293
-0.4329,-9.6944,0.0133,0.234,-9.6944,0.8659,5.6115,1.8428,294
-4.6688,-9.7411,1.1657,5.2299,-9.7411,1.4047,12.6793,11.2503,295
-1.9594,-9.7731,1.0124,2.5433,-9.7731,3.9313,10.0689,5.4437,296
-3.3814,-10.1292,-0.7728,1.1316,-10.1292,2.4134,8.785,7.2766,297
-6.7563,-9.7277,0.3776,2.6369,-9.7277,3.6723,10.9048,8.1269,298
-0.7699,-10.0406,2.2273,3.3529,-10.0406,2.9218,13.7389,7.4426,299
-2.3265,-9.8494,0.4799,1.556,-9.8494,3.0175,10.473,6.7945,300
-5.7818,-9.8518,-0.2086,2.365,-9.8518,3.4289,12.2239,6.896,301
-5.1678,-9.7992,0.2999,3.332,-9.7992,6.344,17.1024,12.1106,302
-0.4741,-9.7338,0.255,0.6802,-9.7338,2.1117,4.9129,3.1541,303
-14.3412,-10.1862,0.089,13.5459,-10.1862,1.9512,22.5388,19.987,304
-8.9028,-9.9019,1.5865,4.3785,-9.9019,4.8803,20.0133,13.0574,305
-4.0381,-9.8926,1.5917,3.3698,-9.8926,3.6873,16.3866,11.6597,306
-1.0673,-9.8576,0.508,1.0326,-9.8576,1.3127,7.6241,4.7045,307
-5.0278,-9.795,0.0461,2.2328,-9.795,4.9926,10.8657,7.3758,308
-0.6057,-9.7667,0.3498,1.1317,-9.7667,2.3802,8.5483,7.7611,309
-7.2517,-9.7803,0.9747,4.5325,-9.7803,4.8843,22.8934,7.5487,310
-1.2984,-9.8288,1.2408,2.126,-9.8288,5.1484,14.8783,10.3195,311
-10.1856,-9.8728,0.4346,3.3846,-9.8728,6.1175,12.172,8.7952,312
-0.4713,-9.7736,0.3364,0.5902,-9.7736,2.6646,14.9882,10.955,313
-2.1241,-9.8012,1.2059,2.2471,-9.8012,3.828,9.1613,7.7732,314
-4.792,-9.667,-1.5168,1.8619,-9.667,3.4054,14.5834,11.0105,315
-2.7792,-9.8117,-0.0801,2.0923,-9.8117,2.8627,9.2866,6.819,316
-2.7241,-9.7852,1.7467,2.9823,-9.7852,2.7732,8.445,7.8128,317
-7.4233,-9.9103,0.7718,4.6514,-9.9103,5.0326,17.9338,8.7254,318
-2.4378,-9.7433,1.7059,2.8863,-9.7433,5.1304,13.53,8.5805,319
-3.3215,-9.8458,-0.2205,1.7895,-9.8458,4.5865,10.7597,7.2894,320
-4.2072,-9.8318,0.6021,3.0752,-9.8318,3.5528,16.0404,6.8003,321
-2.9695,-9.7446,-0.7543,1.354,-9.7446,2.0722,6.5376,3.7789,322
-2.9885,-9.8443,-0.2762,1.0535,-9.8443,2.1847,7.9007,4.4155,323
-0.6629,-9.8129,0.2867,1.0998,-9.8129,2.0807,8.4253,5.3496,324
-1.32,-9.7422,0.454,0.9868,-9.7422,2.1902,8.3998,7.0582,325
-3.3134,-9.9632,-0.4036,1.6756,-9.9632,1.022,8.2775,5.8126,326
-0.5487,-9.8619,-0.1241,0.3087,-9.8619,1.1172,6.7483,3.597,327
-6.4113,-9.7726,12.0494,11.2325,-9.7726,14.3691,30.4388,23.21,328
-8.1688,-9.9636,1.5563,5.7618,-9.9636,3.4392,14.0692,11.2979,329
-0.9119,-9.8016,1.2029,2.553,-9.8016,3.2363,9.9746,6.5016,330
-2.5609,-9.7746,-0.0999,0.9345,-9.7746,1.9608,9.3276,5.3125,331
-5.1408,-9.922,-0.0447,2.284,-9.922,4.1912,13.0406,10.4126,332
-1.4269,-9.7157,0.0352,1.0634,-9.7157,2.5063,9.2243,4.8,333
-0.3005,-9.8463,0.8907,1.0567,-9.8463,2.1598,10.2217,6.0232,334
-4.065,-9.3316,0.1341,2.9727,-9.3316,1.4207,8.5276,7.8958,335
-1.2614,-9.5119,0.3209,1.183,-9.5119,2.4603,10.1928,6.8245,336
-2.7073,-9.9724,3.2555,4.6777,-9.9724,4.2995,24.4093,13.9512,337
-8.5579,-10.0073,4.6996,8.6499,-10.0073,5.2418,19.7757,15.3457,338
-0.7542,-9.9628,0.2059,0.8525,-9.9628,2.2758,11.9889,7.6884,339
-6.7926,-9.8657,0.2457,2.8816,-9.8657,4.3581,12.392,7.515,340
-6.099,-9.8136,0.096,2.3311,-9.8136,3.1997,9.6635,4.4095,341
-2.0344,-9.7491,0.261,1.0011,-9.7491,2.8391,8.3755,5.1843,342
-2.2628,-9.8509,0.7406,1.418,-9.8509,3.2703,10.822,5.5934,343
-9.2219,-9.8893,0.8195,5.6954,-9.8893,6.1831,18.0863,13.8362,344
-5.4232,-9.6712,-0.1905,3.4012,-9.6712,2.1393,9.142,7.0527,345
-0.8522,-9.89,0.3907,1.2227,-9.89,1.639,8.3258,4.4872,346
-6.6728,-9.8961,0.8216,4.3401,-9.8961,4.0229,13.0997,7.2988,347
-1.1417,-9.8457,1.0684,2.4176,-9.8457,2.3803,11.964,8.3933,348
-2.4892,-9.7925,0.7225,4.6318,-9.7925,0.7239,13.0356,11.8121,349
-8.1477,-10.0411,0.7769,3.1648,-10.0411,3.8443,10.4591,6.7978,350
-7.9985,-9.7813,5.0061,5.8887,-9.7813,9.0093,27.6588,14.4778,351
-5.5299,-10.085,-1.3621,2.5669,-10.085,1.8043,15.595,9.031,352
-2.2441,-10.0253,-0.1779,0.9669,-10.0253,1.3036,8.915,3.4197,353
-0.3512,-9.8757,0.0043,0.2615,-9.8757,0.7126,5.2793,2.6907,354
-0.4547,-9.9205,0.4928,1.3677,-9.9205,1.7541,8.8969,4.602,355
-0.3247,-9.7951,1.6831,1.5885,-9.7951,1.2219,15.617,10.602,356
-1.6898,-9.6894,1.06,2.7465,-9.6894,3.3419,10.9292,8.4516,357
-6.9746,-9.8448,-0.4995,2.0505,-9.8448,3.3995,9.099,4.8692,358
-18.7556,-9.7725,-8.9478,6.556,-9.7725,0.9767,12.0398,11.3916,359
-0.5952,-9.6991,4.2199,3.083,-9.6991,2.1407,7.0912,2.7736,360
-3.3099,-9.7614,-0.0231,3.001,-9.7614,3.616,8.6027,3.0485,361
2.5636,-9.7609,2.6849,0.11,-9.7609,0.151,3.0733,2.9505,362
-0.2606,-9.7752,0.0206,0.1567,-9.7752,0.1723,1.0685,0.9633,363
1.0081,-9.7868,1.2693,0.1848,-9.7868,0.2251,2.227,2.0638,364
0.1986,-9.7874,0.6013,0.3205,-9.7874,0.3845,1.7521,1.2538,365
-0.1275,-9.8045,0.0814,0.1463,-9.8045,0.3242,1.2146,1.0467,366
-1.9057,-9.7919,-1.0551,0.4701,-9.7919,0.4396,2.1861,1.6668,367
-0.4997,-9.7964,0.2722,0.3782,-9.7964,0.6054,1.7003,1.232,368
-0.2646,-9.8034,0.2815,0.3334,-9.8034,0.6143,2.0248,1.1202,370
-0.1339,-9.8013,0.1622,0.156,-9.8013,0.2794,1.2498,1.0559,371
0.0179,-9.8035,0.1324,0.0563,-9.8035,0.0988,1.046,1.0147,372
-0.0619,-9.7994,0.8176,0.5392,-9.7994,0.8318,2.3927,1.9966,373
-0.2271,-9.7798,-0.0187,0.1172,-9.7798,0.1426,1.0606,0.9411,374
0.7321,-9.7866,1.0158,0.1806,-9.7866,0.1929,1.9301,1.8089,375
-1.6871,-9.7909,-1.0278,0.4514,-9.7909,0.4651,2.2504,1.7869,376
-0.3884,-9.7943,-0.0088,0.3199,-9.7943,0.445,1.2905,1.0109,377
-1.527,-9.7883,-0.5823,0.481,-9.7883,0.6947,2.0618,1.3544,378
-2.2099,-9.782,0.404,1.0155,-9.782,1.0948,3.3389,1.5763,380
-6.0825,-9.754,-0.0041,3.2444,-9.754,3.0282,4.3872,3.3769,381
-1.0424,-9.7911,1.4578,1.5221,-9.7911,2.1793,4.6575,3.3484,382
-1.0677,-9.8134,0.2063,0.7099,-9.8134,0.9424,2.2493,1.5242,383
-1.4504,-9.8205,2.8278,2.5761,-9.8205,6.0333,37.1652,14.665,384
-2.0001,-9.8009,1.7482,4.458,-9.8009,3.6811,20.0105,8.7434,385
-5.7691,-9.77,0.1546,3.7807,-9.77,5.6105,10.9885,9.2791,386
-2.4271,-9.7651,-0.4693,1.8452,-9.7651,3.3861,29.0456,27.8658,387
-2.4152,-9.8112,2.0669,3.0331,-9.8112,1.8262,29.0034,23.5445,388
-8.1512,-9.8968,0.2129,3.0336,-9.8968,5.5329,29.5142,18.5527,390
-5.4383,-9.8231,0.3074,2.7942,-9.8231,3.2702,14.3806,8.9467,391
-0.766,-9.9241,0.0447,0.6874,-9.9241,1.4309,6.4639,3.4051,392
-3.5829,-9.5058,-1.2609,1.4465,-9.5058,3.0896,7.8042,5.8326,393
-0.9018,-9.8513,0.7033,1.2031,-9.8513,2.0645,5.0627,4.0452,394
-0.6064,-9.9038,-0.0468,0.2467,-9.9038,0.9631,3.1708,1.6713,395
-0.7799,-9.8672,-0.0422,0.3586,-9.8672,1.0627,5.7865,4.9975,396
-2.5263,-9.9513,0.0709,1.4927,-9.9513,4.0332,8.6676,7.2649,397
-2.824,-9.8885,1.5171,2.293,-9.8885,1.5776,11.6076,8.8407,398
-3.3948,-9.6897,-0.6734,2.0524,-9.6897,1.9434,10.4088,6.92,399
-2.928,-9.8208,0.4144,1.3274,-9.8208,2.7094,8.404,5.552,400
-1.919,-9.8126,1.8275,3.4513,-9.8126,2.9513,12.987,5.5116,401
-1.843,-9.8783,-0.4475,0.863,-9.8783,0.4486,5.7045,5.2736,402
-3.2132,-9.7707,0.0435,1.6411,-9.7707,1.5758,6.6213,4.4691,403
-1.2158,-9.8685,0.4205,1.1366,-9.8685,1.0979,5.1668,4.5455,404
-3.2997,-9.8527,0.1054,1.178,-9.8527,1.9901,5.3697,2.7385,405
-7.678,-9.8435,0.1807,2.6347,-9.8435,2.4339,11.677,3.9091,406
-2.527,-9.9184,0.1241,2.0934,-9.9184,2.4269,9.1243,6.2696,407
-0.2284,-9.8269,0.2766,0.6185,-9.8269,3.1641,9.5504,5.0506,408
-2.0636,-9.8636,0.0935,0.9849,-9.8636,2.3262,15.5412,3.5867,410
-3.6453,-9.1216,0.0528,2.0003,-9.1216,3.3553,21.0055,7.0475,411
-1.4901,-10.1902,-0.2984,0.595,-10.1902,1.9504,6.4172,4.7495,412
-4.032,-9.5734,0.2973,1.9214,-9.5734,2.7008,8.3372,5.7259,413
-4.3031,-10.2602,-0.4142,2.3876,-10.2602,1.6441,6.9851,5.1127,414
-6.6838,-10.0788,-1.3686,4.0736,-10.0788,3.4564,27.8819,8.2862,415
-2.5329,-9.7819,0.1759,1.4023,-9.7819,2.8349,6.2728,4.0983,416
-3.1131,-9.8858,0.2789,1.9676,-9.8858,2.5265,9.8045,4.2022,417
0.7564,-10.0088,5.0514,3.7942,-10.0088,2.2211,12.9723,9.7178,418
-2.5535,-9.8467,-0.3067,0.9177,-9.8467,2.3467,7.0728,4.9111,420
-1.4122,-9.7747,0.278,0.8367,-9.7747,1.8343,6.4384,3.3111,421
-2.3352,-9.9233,-0.5886,0.9423,-9.9233,0.8155,4.526,3.6328,422
-7.3117,-9.5457,-0.2623,4.7461,-9.5457,0.9118,10.3457,9.3956,423
-4.3521,-9.8345,2.029,3.0013,-9.8345,1.5396,13.8832,12.8218,424
-0.0148,-9.7718,0.9688,0.7965,-9.7718,1.7056,7.617,4.8905,425
-1.2462,-9.8008,-0.1788,0.7878,-9.8008,0.5096,6.6046,3.6098,426
-1.8119,-9.8654,-0.3023,0.7792,-9.8654,1.6499,8.2751,6.2305,427
-1.7104,-9.8633,-0.0533,0.7425,-9.8633,2.1695,5.1332,3.8198,428
-0.6164,-9.8201,-0.0447,0.3005,-9.8201,1.1635,4.9091,2.6866,430
-3.2256,-9.6948,-0.6494,1.2432,-9.6948,0.7643,3.9132,2.8667,431
-0.7249,-10.775,0.9403,2.4391,-10.775,2.5551,18.2447,10.1055,432
-2.0586,-10.0808,2.3153,3.8649,-10.0808,3.4215,13.0476,9.5515,433
-1.9548,-9.9931,-0.288,1.0624,-9.9931,0.915,8.2883,4.5382,434
-0.5955,-8.9419,0.3453,0.6107,-8.9419,1.1441,5.9915,5.063,435
-2.3837,-10.0514,-0.679,1.0867,-10.0514,0.9808,5.3406,4.0107,436
-0.4936,-9.7308,0.1174,0.4199,-9.7308,0.7015,4.253,2.6889,437
-0.6621,-9.7791,-0.1497,0.265,-9.7791,0.8148,4.1285,3.4297,438
-1.4931,-9.8082,0.3727,1.0191,-9.8082,2.7044,10.3382,5.8094,440
-5.2218,-9.8414,0.6443,3.5707,-9.8414,2.8126,20.3664,14.707,441
-2.2944,-9.9995,-0.433,1.2233,-9.9995,1.1081,20.8569,19.743,442
-6.5593,-10.0386,-1.607,3.7834,-10.0386,0.8889,26.7343,23.3909,443
-2.632,-9.8127,4.1772,6.2048,-9.8127,8.2212,25.7547,8.2505,444
-1.7286,-9.5455,-0.4331,0.6391,-9.5455,1.1527,15.136,13.0484,445
-3.9266,-9.9892,-1.1688,2.5549,-9.9892,0.67,30.554,20.0617,446
-11.9638,-9.829,-2.1563,4.6288,-9.829,2.7997,11.5271,7.1749,447
-1.9349,-9.7484,-0.2365,0.9353,-9.7484,1.3815,3.9358,2.1787,448
-9.6812,-9.6915,10.8149,11.5849,-9.6915,9.3785,34.1266,12.5789,450
-17.7626,-9.8359,7.3527,15.41,-9.8359,7.7669,31.8963,17.8991,451
-9.705,-9.8583,4.1058,9.2834,-9.8583,4.5976,15.2551,7.505,452
-2.3334,-9.8968,6.2363,6.5061,-9.8968,5.4905,23.1515,16.5715,453
-0.4019,-9.7804,2.8309,3.6451,-9.7804,6.5777,23.7548,21.892,454
-2.3964,-9.338,-0.3601,0.9255,-9.338,0.9644,14.7494,11.3834,455
-2.2332,-10.0168,2.4941,4.9187,-10.0168,2.5324,12.6747,9.2726,456
-2.4768,-9.8936,0.0882,1.1569,-9.8936,2.1053,7.364,4.4024,457
-2.5763,-9.7757,-0.0968,1.0353,-9.7757,2.4113,9.667,4.6312,458
-1.9848,-9.6826,0.2124,1.164,-9.6826,2.8694,17.978,4.9901,460
-4.2534,-9.7992,0.6284,2.7504,-9.7992,5.1235,18.1413,10.7637,461
-3.6189,-9.8683,-0.4187,1.8518,-9.8683,1.5726,10.9168,6.0407,462
-10.0281,-9.8017,-0.1029,3.3175,-9.8017,3.4681,12.3039,7.7214,463
-3.1053,-9.6886,0.9662,2.3655,-9.6886,2.6824,12.6997,8.8183,464
-0.4156,-9.9255,0.4144,0.5662,-9.9255,0.9337,7.2468,2.7306,465
-0.502,-9.7772,0.0776,0.3925,-9.7772,1.0981,12.1984,8.0753,466
-3.21,-9.8883,0.0087,1.7646,-9.8883,3.2914,15.4542,9.412,467
-0.48,-10.0271,3.3526,3.5306,-10.0271,4.9109,32.2109,28.7371,468
-6.7252,-9.8589,1.2528,3.8662,-9.8589,8.2823,56.2238,20.7225,470
-8.9105,-9.7994,1.3749,5.0807,-9.7994,4.4652,23.415,9.6833,471
-1.5186,-9.7111,0.5258,1.5035,-9.7111,3.2315,9.2494,6.7594,472
-2.0191,-10.1036,-0.3088,1.2347,-10.1036,1.2568,8.3556,5.4961,473
-0.739,-9.8621,0.9622,1.1533,-9.8621,1.096,8.6114,5.049,474
-3.9839,-9.7608,0.3834,3.0612,-9.7608,1.491,11.9002,7.67,475
-9.0717,-9.4556,-3.0101,3.3172,-9.4556,1.6477,21.1938,18.9495,476
-0.645,-10.3252,1.0876,1.5383,-10.3252,3.7506,38.4025,33.2651,477
-5.5488,-10.0753,-0.0983,4.9618,-10.0753,4.921,31.0165,27.9688,478
-8.6782,-10.1144,3.5415,6.5995,-10.1144,9.1046,48.0515,25.9089,480
-9.9787,-10.3094,-0.775,4.678,-10.3094,4.238,31.7418,26.7671,481
-4.5653,-9.7293,1.1955,4.1797,-9.7293,1.0722,13.8701,12.4827,482
-1.6654,-9.5129,-0.261,1.0824,-9.5129,1.232,12.8826,12.1464,483
-6.3356,-9.6587,0.02,3.6771,-9.6587,1.5057,23.2833,15.4131,484
-5.9108,-9.7406,-0.6598,2.7881,-9.7406,2.576,22.745,21.3179,485
-2.4893,-10.1153,0.5315,1.7552,-10.1153,2.0906,34.4662,33.8667,486
-4.5755,-9.7963,1.7992,4.3433,-9.7963,4.7996,26.4069,22.6989,487
-0.212,-9.7049,0.9067,1.219,-9.7049,1.7433,11.4684,7.9899,488
-6.2254,-9.7286,0.136,2.0115,-9.7286,3.807,16.4061,6.5817,490
-1.9642,-9.8496,-0.1945,0.9616,-9.8496,1.5094,10.7076,5.9222,491
-5.8188,-9.7283,-0.7721,2.561,-9.7283,2.2546,11.0387,9.6641,492
-0.8274,-9.6932,0.402,1.073,-9.6932,1.1249,6.7321,5.3493,493
0.0,-10.2075,5.2706,3.8207,-10.2075,1.1595,39.195,19.914,494
-1.7394,-10.1603,0.5458,1.8128,-10.1603,3.0504,46.9232,42.5968,495
-0.9632,-10.4511,-0.2835,0.4877,-10.4511,1.305,35.707,33.5445,496
-12.3279,-9.7971,0.3689,4.7866,-9.7971,3.3566,28.7373,16.6777,497
-5.9523,-9.8463,0.9976,4.192,-9.8463,1.1481,12.7882,7.6351,498
-200.0002,-9.8265,-12.0285,32.3758,-9.8265,10.0696,36.781,11.4572,500
-52.2916,-9.192,-11.12,16.7048,-9.192,4.1942,12.0178,2.398,501
3.6633,-9.225,5.1655,1.1406,-9.225,0.3353,2.2169,1.8315,502
-4.9884,-9.2559,-2.3966,3.0112,-9.2559,0.8636,1.938,1.6806,503
-2.8637,-9.3237,-2.4482,0.3975,-9.3237,0.1216,1.3351,1.2719,504
-1.9377,-9.2877,-0.1262,1.4071,-9.2877,0.4341,1.7569,1.3307,505
17.0577,-9.3066,24.7191,5.559,-9.3066,1.4622,10.0615,7.6568,506
-20.0855,-9.5783,-0.1569,14.0112,-9.5783,6.6467,22.5188,16.5766,507
-81.1611,-9.3649,-6.9548,57.1766,-9.3649,17.9122,55.4694,47.44,508
-23.0961,-9.7153,0.2889,11.8591,-9.7153,7.75,35.5799,11.9013,510
-7.4639,-9.7558,-2.5333,4.3113,-9.7558,3.0561,8.0253,5.9414,511
-9.9293,-10.1297,-0.6825,7.1755,-10.1297,4.5998,7.2244,4.7586,512
-7.6828,-9.8435,-4.2585,3.7559,-9.8435,2.7849,7.4307,6.3567,513
-16.6881,-9.529,-10.417,3.851,-9.529,2.769,12.1464,9.828,514
-4.0687,-10.0746,-0.6975,3.1104,-10.0746,2.0556,10.2111,7.3769,515
-4.5766,-9.7073,-0.4554,2.6789,-9.7073,4.0482,10.5244,8.9032,516
-522.0975,-7.3378,-369.3718,119.4794,-7.3378,11.1357,157.0994,149.3489,517
-97.5919,-7.8233,8.9196,54.907,-7.8233,8.4708,93.6061,88.7945,518
-18.396,-9.8634,10.2463,23.1908,-9.8634,5.9681,26.8553,23.4417,520
-0.5789,-9.8205,0.3518,0.6693,-9.8205,1.1738,4.5612,4.2412,521
-0.326,-9.8255,0.0362,0.1532,-9.8255,0.7695,2.6595,1.482,522
-0.1061,-9.8282,-0.0313,0.0342,-9.8282,0.4924,1.9194,1.1084,523
-0.4315,-9.8285,-0.3197,0.1072,-9.8285,0.5786,2.289,1.7452,524
-11.3891,-9.8149,-0.4295,5.9935,-9.8149,7.795,13.2044,7.0343,525
-2.167,-9.8122,-0.2334,1.3994,-9.8122,2.9418,6.2888,3.3665,526
-1.8775,-9.822,-0.079,0.7064,-9.822,2.8044,12.6787,3.2549,527
-4.5139,-9.8279,2.3928,8.244,-9.8279,5.5475,17.7452,1.8474,528
-2.4118,-9.7223,0.4621,2.8103,-9.7223,1.3327,17.8731,2.088,530
-0.4174,-9.8275,0.1009,0.2071,-9.8275,0.6611,3.0182,1.1298,531
