AYGX_min,AZ_mean,AYGX_mean,AYGX_std,AZ_mean.1,GX_std,Gnorm_max,Gnorm_median,timestamp
-4.4502,-9.8095,-1.6365,1.603,-9.8095,2.7611,9.7929,6.9549,11
-42.9598,-9.7546,-8.2963,12.5591,-9.7546,6.0497,20.8269,8.3283,12
-454.4858,-9.7721,-58.8063,106.6875,-9.7721,12.2827,82.7623,14.325,13
-376.8387,-7.6166,-205.8696,111.5904,-7.6166,9.5268,131.4487,105.7327,14
-213.9469,-8.3341,-58.7986,76.9111,-8.3341,15.1592,74.8848,52.8346,15
