AYGX_min,AZ_mean,AYGX_mean,AYGX_std,AZ_mean.1,GX_std,Gnorm_max,Gnorm_median,timestamp
-1.8903,-9.7931,-1.6413,0.1154,-9.7931,0.0614,1.4314,1.336,750
-15.3906,-9.7902,4.6848,9.3722,-9.7902,12.3255,65.879,6.1611,751
-375.5697,-8.657,-122.4178,134.5299,-8.657,33.1538,150.6448,128.2999,752
-123.7985,-9.62,20.3385,71.6048,-9.62,20.1156,116.0832,63.3453,753
-24.0038,-9.5935,-19.0456,3.7713,-9.5935,1.6722,12.8091,10.0436,754
