AYGX_min,AZ_mean,AYGX_mean,AYGX_std,AZ_mean.1,GX_std,Gnorm_max,Gnorm_median,timestamp
-3.6196,-9.7201,2.6395,3.3391,-9.7201,1.6751,11.2909,2.9505,439
-2.6929,-9.7322,9.2823,13.1741,-9.7322,5.5559,28.6221,5.7201,440
-257.816,-9.0833,32.6306,149.9727,-9.0833,27.5761,129.2362,109.6615,441
-47.5773,-9.8724,1.0784,17.1857,-9.8724,10.7109,31.1203,14.79,442
-3.3274,-9.7517,0.5491,1.9393,-9.7517,2.27,15.2067,11.9708,443
