AYGX_min,AZ_mean,AYGX_mean,AYGX_std,AZ_mean.1,GX_std,Gnorm_max,Gnorm_median,timestamp
-43.0154,-9.8301,-1.854,13.1965,-9.8301,6.9096,28.7207,8.319,915
-6.3229,-9.8253,-2.4065,2.7334,-9.8253,2.3007,7.1488,4.7333,916
-274.4277,-9.502,-41.235,68.7662,-9.502,17.685,93.8089,48.1407,918
-5.1135,-9.7563,18.2368,25.872,-9.7563,9.036,24.6085,9.7321,919
-5.6737,-9.8935,-0.1097,1.5107,-9.8935,1.7159,4.244,1.0987,920
