AYGX_min,AZ_mean,AYGX_mean,AYGX_std,AZ_mean,GX_std,Gnorm_max,Gnorm_median,timestamp
-0.3941,-9.9573,-0.3041,0.05,-9.9573,0.1154,1.8776,1.7467,0
-0.369,-9.958,-0.3037,0.0291,-9.958,0.068,1.8326,1.7425,1
-0.5588,-9.9573,-0.3166,0.1001,-9.9573,0.2155,2.1506,1.7459,3
-0.5529,-9.9562,-0.2957,0.1246,-9.9562,0.304,2.1562,1.6801,4
-0.5261,-9.9591,-0.2962,0.0879,-9.9591,0.1897,2.1225,1.7037,5
-55.6284,-9.8337,-4.5204,20.8237,-9.8337,11.9313,24.9516,11.0604,6
-14.7668,-9.9053,-7.1595,5.2412,-9.9053,4.1847,8.9653,6.7948,7
-71.1588,-9.9324,-6.1328,24.1037,-9.9324,11.9587,65.4487,7.8089,8
-112.7731,-9.8367,-21.9618,35.0181,-9.8367,16.5424,78.3381,15.1798,9
-147.8624,-9.1165,-11.5089,52.5139,-9.1165,20.5455,65.1105,16.3456,10
-19.6114,-9.8663,4.4289,12.5936,-9.8663,5.4396,16.3187,4.2481,11
-35.3105,-9.8964,-3.3417,18.7616,-9.8964,6.7498,44.337,9.1014,12
-14.0575,-9.8893,-1.0745,4.2736,-9.8893,4.6386,10.0599,3.3697,13
-15.8655,-9.8858,3.6694,11.5128,-9.8858,9.451,26.1456,2.4601,14
-304.4092,-9.8429,-30.5353,73.9798,-9.8429,16.9842,39.3752,16.8224,15
-9.0165,-9.9222,-1.2512,3.9433,-9.9222,3.3805,5.7144,3.103,16
-3.2631,-9.9084,-1.2217,1.5562,-9.9084,1.3251,2.9505,1.6774,17
-2.1253,-9.9076,-1.2621,0.5612,-9.9076,0.4599,2.1593,1.7315,18
-1.761,-9.9062,-1.2685,0.3013,-9.9062,0.2451,1.987,1.727,19
-4.3917,-9.8985,-1.3807,0.7856,-9.8985,0.4608,2.9345,1.7504,20
-4.9187,-9.9328,-0.9183,1.7982,-9.9328,1.2637,3.7642,1.6785,21
-2.1447,-9.907,-1.3202,0.6163,-9.907,0.518,2.1992,1.8086,22
-1.0111,-9.9033,-0.1085,0.6779,-9.9033,0.6231,1.0935,0.83,23
-1.6168,-9.9061,-1.3036,0.2734,-9.9061,0.2231,1.9579,1.7626,24
-1.4893,-9.9068,-1.2662,0.1458,-9.9068,0.1194,1.8509,1.7482,25
-1.3887,-9.9067,-1.2676,0.0877,-9.9067,0.0722,1.8044,1.7558,26
-1.3294,-9.9059,-1.2665,0.042,-9.9059,0.0344,1.7777,1.7361,28
-1.2927,-9.9064,-1.2593,0.018,-9.9064,0.0159,1.7737,1.7409,29
-1.2764,-9.9067,-1.2486,0.0185,-9.9067,0.0194,1.7489,1.7296,30
-1.2817,-9.9056,-1.2583,0.013,-9.9056,0.0121,1.7448,1.7352,31
-1.2607,-9.9065,-1.2471,0.0104,-9.9065,0.0098,1.754,1.7335,32
-1.2841,-9.9048,-1.2586,0.0172,-9.9048,0.0169,1.7584,1.737,33
-1.2782,-9.9059,-1.2599,0.016,-9.9059,0.0162,1.7515,1.7382,34
-1.2692,-9.906,-1.2539,0.0084,-9.906,0.0073,1.7628,1.7403,35
-1.2744,-9.9063,-1.253,0.0146,-9.9063,0.0129,1.7429,1.7297,36
-1.2656,-9.9069,-1.253,0.0101,-9.9069,0.0094,1.7489,1.7348,37
-1.2834,-9.9059,-1.2627,0.0114,-9.9059,0.0107,1.7566,1.739,38
-1.2837,-9.9063,-1.2603,0.0132,-9.9063,0.0131,1.754,1.7397,39
-1.2934,-9.9054,-1.2323,0.0821,-9.9054,0.0999,1.7914,1.7585,40
-1.9616,-9.9259,0.1203,1.827,-9.9259,1.8679,2.9828,1.9221,41
-3.2549,-9.915,-1.2161,1.2632,-9.915,1.1299,2.9321,1.8347,42
-2.3156,-9.9091,-1.1401,0.8023,-9.9091,0.684,2.4007,1.6756,43
-2.3796,-9.9128,-1.1003,0.8183,-9.9128,0.763,2.4562,1.6881,44
-2.4091,-9.91,-1.2864,0.7642,-9.91,0.6565,2.4045,1.8315,45
-2.6644,-9.9185,-1.2243,0.7813,-9.9185,0.7002,2.421,1.6419,46
-1.693,-9.922,-1.1315,0.3393,-9.922,0.2288,1.8922,1.6511,48
-35.4297,-9.8512,2.2878,11.2009,-9.8512,15.1275,38.134,7.3692,49
-87.8658,-9.6214,-61.6021,19.9407,-9.6214,8.7603,37.832,21.8746,50
-60.9631,-9.8703,8.8321,38.872,-9.8703,5.8216,24.9734,20.56,51
-1.1571,-9.935,3.5123,3.3195,-9.935,3.2437,6.9714,5.2461,52
-16.5662,-9.9134,-2.5967,8.9513,-9.9134,5.0815,9.0985,4.3759,53
-11.3474,-9.8551,-9.5473,2.0158,-9.8551,0.8394,7.8772,6.6192,54
1.6835,-9.8999,7.1089,4.7508,-9.8999,2.4581,10.6427,6.1176,55
-4.4904,-9.9728,0.1205,1.8443,-9.9728,2.2566,4.307,2.498,56
-1.4244,-9.9852,0.1157,1.0047,-9.9852,1.7437,3.3099,2.729,58
-28.2384,-9.9234,-4.6047,8.8945,-9.9234,8.6314,17.9413,10.3782,59
-38.4354,-9.6162,-23.9546,5.9399,-9.6162,1.7298,14.6637,12.4193,60
-4.3496,-9.8412,9.8243,7.088,-9.8412,5.7252,50.9193,35.2082,61
-1.8401,-9.9486,0.854,1.5926,-9.9486,2.2712,30.907,25.394,62
-4.6654,-10.0588,-0.5057,2.1302,-10.0588,1.9101,18.2172,11.1849,64
-0.8571,-9.9425,1.1543,1.3121,-9.9425,1.5826,14.1147,9.7638,65
-0.4007,-10.0726,3.2231,4.2267,-10.0726,2.044,37.5128,29.6391,66
-1.9222,-9.9668,0.0695,1.3893,-9.9668,2.5074,32.1922,11.8505,67
-9.2966,-9.9686,2.549,7.0869,-9.9686,3.5727,33.9024,18.3573,68
-2.7834,-9.9287,0.554,2.461,-9.9287,3.5028,19.5014,9.398,69
-4.2034,-10.1132,0.917,3.2209,-10.1132,3.8889,26.2543,11.1101,70
-0.3771,-10.3669,2.3685,2.597,-10.3669,3.3169,25.5185,20.0315,71
-16.7329,-9.8855,2.648,16.3994,-9.8855,1.534,27.2736,13.3056,72
-0.0511,-9.8366,6.599,7.6048,-9.8366,3.9796,32.9446,9.5642,73
-3.7876,-9.9961,21.2273,16.7492,-9.9961,1.5258,46.1569,40.1389,75
-25.4089,-10.4224,5.4098,20.1079,-10.4224,6.8383,57.4758,47.3212,76
-1.8129,-10.0039,0.7034,1.814,-10.0039,1.7985,22.0059,14.1224,77
-7.7213,-9.8845,-0.1845,3.7404,-9.8845,3.9402,11.2894,7.0389,78
-11.0978,-8.5102,-3.4183,4.2951,-8.5102,3.1729,31.6873,23.06,79
-27.6906,-9.9629,-2.0852,16.3011,-9.9629,4.5798,40.6735,23.866,80
-26.379,-10.1733,0.1906,11.8682,-10.1733,2.7334,23.6569,20.5547,81
-1.3818,-9.7558,4.5984,6.1271,-9.7558,4.3173,18.2229,11.3463,82
-15.7469,-10.2126,2.2211,9.1362,-10.2126,11.1386,26.5164,19.7078,84
-50.1038,-9.9052,0.9669,38.8391,-9.9052,4.499,32.0159,25.4568,85
-3.0562,-9.2592,12.083,19.88,-9.2592,6.6107,22.3967,18.8109,86
-1.9512,-9.8155,1.319,2.5317,-9.8155,3.6742,15.33,10.8028,87
-0.1709,-9.5627,12.0149,13.7425,-9.5627,3.5638,20.4472,18.5614,88
-19.6586,-9.6403,-1.9254,8.9034,-9.6403,5.2863,34.5599,28.623,89
-7.0476,-10.0002,0.5316,5.0035,-10.0002,2.4019,21.0164,17.5403,90
-2.1209,-10.0242,0.004,1.162,-10.0242,2.1569,12.4162,8.3584,91
-10.417,-9.7988,-0.659,5.717,-9.7988,2.9819,19.4736,10.4159,93
-12.3086,-9.6715,2.105,9.2556,-9.6715,6.5957,27.1453,16.4756,94
-36.8068,-9.8788,5.5463,21.2198,-9.8788,10.3344,55.9056,30.9232,95
-35.8461,-10.4898,8.6418,19.9841,-10.4898,7.4662,40.7237,22.6541,96
-16.6013,-9.3977,30.7598,35.0875,-9.3977,11.3165,65.6255,53.3549,97
-24.7485,-10.0653,-0.77,13.5549,-10.0653,7.0925,25.6747,17.5541,98
-8.9931,-10.1204,1.2111,5.7825,-10.1204,3.6048,26.2559,15.7331,99
-2.2836,-9.8814,0.6828,1.7074,-9.8814,3.8551,17.4514,8.3945,100
-3.9443,-9.9517,0.9292,1.8344,-9.9517,1.5068,22.4672,12.6784,102
-41.8178,-9.9415,-1.5068,11.8998,-9.9415,5.5674,22.6693,9.825,103
-37.4329,-9.8962,-17.3059,18.3084,-9.8962,5.0932,35.0585,26.5846,104
2.6575,-9.7793,20.9634,15.4906,-9.7793,5.063,41.1927,23.8935,105
-0.2596,-9.7611,8.5048,8.4524,-9.7611,3.9348,20.451,9.2566,106
-1.0507,-10.0075,4.0419,4.1645,-10.0075,0.713,18.5845,13.006,107
0.0087,-10.0318,3.5697,4.5642,-10.0318,3.4397,16.3647,14.8006,108
-1.2217,-10.1914,1.7567,2.6296,-10.1914,3.4486,14.5456,7.8733,109
-20.7753,-9.9115,-1.2931,7.6467,-9.9115,6.9629,22.6922,15.832,110
-4.2118,-10.018,11.2152,10.5403,-10.018,1.6095,29.7721,19.382,111
-14.6914,-10.3934,11.6128,19.3394,-10.3934,10.6991,40.67,27.9049,113
-27.5349,-10.1134,21.8385,37.2236,-10.1134,24.2887,78.8158,44.4937,114
-13.0041,-10.0644,3.3188,13.145,-10.0644,4.5684,20.5212,16.5627,115
-30.2212,-10.6584,37.1631,58.6538,-10.6584,24.997,105.0137,71.2331,116
-31.8632,-9.9139,5.7985,22.5032,-9.9139,2.0845,28.7132,19.8606,117
-5.3865,-10.5072,-1.2203,2.0098,-10.5072,3.3692,63.7403,54.2791,118
-16.3987,-9.8488,8.2376,14.1695,-9.8488,2.8946,43.1813,25.8249,119
-6.4276,-10.0509,2.7546,5.0806,-10.0509,5.3699,36.2685,30.5171,120
-0.4103,-10.0526,4.7513,3.5669,-10.0526,2.065,39.2501,33.5643,121
-55.9102,-8.9676,5.5851,32.3446,-8.9676,8.639,49.1983,13.3974,123
-11.3047,-9.5865,0.628,6.8163,-9.5865,7.7899,26.7861,16.9131,124
-31.6308,-10.0036,7.4582,24.3497,-10.0036,9.0145,58.0649,39.7973,125
-32.9531,-10.0512,5.5339,27.0559,-10.0512,12.5522,81.3818,54.9339,126
-8.516,-9.985,-2.7518,3.2849,-9.985,2.2041,13.1046,8.334,127
-2.4599,-9.8032,0.7821,2.9241,-9.8032,5.617,16.0441,14.1897,128
-5.5811,-9.9104,-0.8628,2.0581,-9.9104,5.3835,16.5935,12.7421,129
-3.5634,-9.9409,0.5714,2.4147,-9.9409,5.722,16.9209,8.6813,130
-5.0712,-9.8539,-3.4904,1.3694,-9.8539,0.7538,11.2326,8.6108,131
-1.6473,-10.0111,-0.0915,0.8068,-10.0111,2.7858,8.7284,7.7527,132
-0.3463,-9.971,0.1199,0.577,-9.971,1.5464,7.9306,3.3424,133
-3.6775,-10.0168,3.1155,5.1998,-10.0168,10.3694,24.9759,18.2783,134
-1.9734,-9.969,0.489,1.6752,-9.969,4.8579,17.0916,8.2868,135
-1.3234,-9.9296,0.8187,1.5624,-9.9296,0.4975,12.6154,9.3894,136
-4.8196,-9.9412,-1.6536,3.2882,-9.9412,2.7716,15.2998,12.4912,137
-4.7839,-9.9912,-0.0838,4.4515,-9.9912,6.4134,26.0059,17.299,138
-5.2096,-10.1018,-0.2638,2.9988,-10.1018,5.8036,18.1441,16.3669,139
-3.772,-9.9535,0.4361,2.4271,-9.9535,6.0472,18.1593,9.5971,140
-0.4027,-9.9925,0.6557,0.8238,-9.9925,0.641,5.5275,4.5304,141
-18.5975,-9.9021,-2.4554,9.9111,-9.9021,1.4174,11.3183,10.384,142
-51.9942,-9.9569,-7.0469,15.3969,-9.9569,8.6995,35.1021,12.2011,143
-37.6821,-9.9969,-5.5829,15.7725,-9.9969,13.5612,48.7615,19.3652,144
-77.0481,-9.9406,-0.8044,28.2723,-9.9406,17.8825,41.487,25.9338,145
-9.275,-9.7445,-1.2553,4.1675,-9.7445,3.2364,13.4983,11.7747,146
-1.4035,-9.8823,3.7065,3.7232,-9.8823,6.992,20.8136,13.9953,147
-3.9334,-9.7922,-0.0436,3.1085,-9.7922,2.165,9.3094,7.097,148
-0.3421,-10.0539,0.7035,0.9092,-10.0539,1.9711,10.4816,6.0178,149
-25.8578,-9.9246,21.5534,51.2601,-9.9246,22.5643,46.2984,26.7334,150
-31.1355,-9.911,8.4623,29.7059,-9.911,7.8475,31.7142,25.962,152
-24.3952,-9.9725,4.3028,13.5939,-9.9725,11.1475,37.2716,17.4761,153
-11.6834,-9.7809,-1.2293,5.6615,-9.7809,4.5788,24.6263,18.7769,154
-16.0496,-10.2513,-3.6826,9.9123,-10.2513,2.5122,22.9363,20.8365,155
-9.5813,-10.1228,-0.3603,4.0788,-10.1228,7.0359,18.0203,11.3645,156
-14.6358,-9.9193,-2.5837,4.8364,-9.9193,4.8366,21.7348,11.7188,158
-2.817,-9.9017,-0.2305,2.0238,-9.9017,5.1459,15.684,13.8275,159
-32.9149,-9.9424,-2.9603,9.019,-9.9424,10.4255,32.1508,12.2492,160
-20.8582,-9.9585,47.9214,42.9965,-9.9585,7.8438,63.9054,53.4508,161
-56.0289,-9.9271,0.4849,24.9971,-9.9271,5.2984,53.4707,47.7754,163
-53.0266,-9.9041,-0.1441,13.9458,-9.9041,8.8507,32.7696,19.4462,164
-56.9731,-9.9349,0.6462,20.7064,-9.9349,11.4031,36.9077,29.3281,165
-3.8511,-10.0475,0.6116,2.3909,-10.0475,1.6621,8.2333,7.4146,166
-15.8854,-9.9095,0.4027,12.8332,-9.9095,2.9905,22.4615,17.299,167
-9.6243,-10.1371,12.011,24.1523,-10.1371,6.8327,40.5524,33.2531,168
-22.2062,-10.0473,-1.8855,17.1635,-10.0473,12.241,37.9007,27.1852,169
-15.8498,-10.1305,9.6199,18.2243,-10.1305,6.7311,35.0498,24.7979,170
-8.206,-10.1871,10.2974,11.8383,-10.1871,1.5176,20.0381,15.2879,172
-21.4769,-9.8925,5.3872,15.5825,-9.8925,13.4932,38.7724,24.0218,173
-8.6922,-9.9444,8.0134,9.3814,-9.9444,2.7001,20.4785,15.4741,174
-5.283,-9.2736,3.5294,7.8598,-9.2736,2.627,27.9254,15.4331,175
-12.6054,-10.2321,-2.3179,6.0157,-10.2321,8.6582,46.6658,25.5991,176
-7.5373,-9.9519,1.4393,5.8606,-9.9519,4.4778,21.9633,14.2148,177
-3.363,-9.6975,8.7025,11.2067,-9.6975,9.6367,26.6101,11.8457,178
-8.5249,-9.9663,6.9272,11.5854,-9.9663,8.9508,26.8207,15.4801,179
-13.9599,-10.1775,-1.8985,7.2644,-10.1775,11.5624,28.9579,20.5803,180
-17.2398,-9.8778,2.9126,13.7819,-9.8778,2.9658,28.5332,26.1189,182
-8.639,-9.517,0.8078,4.9033,-9.517,6.989,16.0269,11.7742,183
-4.4977,-9.2078,0.8646,5.2376,-9.2078,6.068,24.7961,10.5804,184
-8.6597,-7.7957,0.1199,7.0957,-7.7957,1.3645,19.2397,14.8174,185
-6.8573,-8.2322,1.5754,5.9933,-8.2322,3.0094,22.7339,17.0235,186
-5.1904,-8.0276,0.7398,4.66,-8.0276,5.4278,18.2607,16.2975,187
-9.5057,-9.1501,-3.8689,6.2877,-9.1501,6.2556,18.7487,13.9037,188
-9.7083,-9.3538,-0.9662,4.3908,-9.3538,2.4965,12.6341,9.0981,189
-14.6261,-9.8133,-0.6266,5.5333,-9.8133,5.3813,29.142,9.2017,190
-3.2519,-9.7951,7.1791,10.4771,-9.7951,4.5958,28.0154,18.5391,191
-9.1257,-10.1631,-0.2274,4.2797,-10.1631,3.3079,16.6916,7.449,193
-22.7128,-9.3179,0.2351,10.4776,-9.3179,9.1334,28.9585,20.2088,194
-8.7347,-9.6787,-0.3664,4.0343,-9.6787,4.9345,18.3074,11.9851,195
-10.4703,-9.0792,-2.1407,3.8912,-9.0792,2.5922,18.4937,13.6778,196
-9.7281,-9.3348,6.3142,10.5004,-9.3348,3.3553,20.7987,15.9445,197
-11.3488,-8.6559,21.8711,34.2072,-8.6559,8.2354,37.2746,31.1315,198
-12.6295,-7.9965,0.3866,7.8003,-7.9965,4.9859,33.1689,28.8533,199
-12.0361,-9.2346,7.9823,13.7843,-9.2346,9.0266,33.3709,21.1646,200
-16.502,-8.4727,8.4806,16.8497,-8.4727,13.0295,34.5639,27.7236,201
-28.9989,-8.4825,0.8967,7.8402,-8.4825,6.779,31.6887,12.0332,203
-4.3796,-9.3296,0.5076,2.4395,-9.3296,4.1101,11.1536,8.6566,204
0.3994,-8.348,3.9077,2.8224,-8.348,3.0397,15.4262,11.9742,205
-7.0059,-9.2597,-0.8253,4.0192,-9.2597,2.7866,18.5823,11.2801,206
-9.8391,-8.8629,3.0972,8.0827,-8.8629,6.6454,21.531,18.9276,207
-3.3452,-8.7003,3.8254,4.1515,-8.7003,4.1568,17.2387,11.6266,208
-15.7697,-9.5218,-2.4533,8.0848,-9.5218,4.2745,23.2682,14.2048,209
-36.4766,-9.6772,-0.1863,12.2095,-9.6772,7.2057,36.8977,12.3281,210
-17.2156,-8.9799,5.5789,14.1973,-8.9799,2.6043,30.1953,26.6351,211
-15.1401,-9.3949,7.2232,12.0577,-9.3949,8.1365,45.1977,28.9628,213
-22.7527,-8.823,2.4909,8.8372,-8.823,8.0302,21.9882,14.7849,214
-2.1757,-9.4913,5.2018,6.4542,-9.4913,8.1294,31.2245,15.1843,215
-14.75,-9.5785,4.2495,12.0404,-9.5785,5.7511,50.1037,25.7038,216
-9.8441,-9.5125,0.7211,6.1018,-9.5125,3.8581,50.7489,40.3021,217
-11.2936,-8.9642,-0.2424,5.5174,-8.9642,9.0574,47.5434,38.4648,218
-4.915,-9.4401,-0.3659,3.3334,-9.4401,1.8514,20.3996,15.9448,219
-33.9455,-9.6728,25.637,30.9993,-9.6728,5.564,48.5847,33.761,220
-12.2984,-10.5398,0.4062,7.3913,-10.5398,6.8105,75.6129,60.2063,221
-6.8289,-9.7408,22.5324,24.7117,-9.7408,20.0413,42.2467,26.0393,223
-38.7337,-10.0254,-1.7189,11.4855,-10.0254,9.1121,49.4949,21.7998,224
-16.0707,-9.9419,4.658,15.4855,-9.9419,3.1443,40.6097,25.312,225
-4.6059,-10.0737,-0.7143,1.7371,-10.0737,2.2747,12.3784,6.3189,226
-2.9365,-9.7077,3.8899,5.3099,-9.7077,1.6979,17.5984,14.1308,227
-4.1273,-9.9068,-0.3004,1.9885,-9.9068,2.4988,10.5275,7.5274,228
-4.7491,-10.0967,-0.4,3.5712,-10.0967,2.1999,10.1711,8.3356,229
-4.5551,-9.9421,4.6203,6.1133,-9.9421,11.1337,26.4463,20.0556,230
-4.3085,-9.8789,1.4605,4.4796,-9.8789,6.4721,12.2883,10.228,232
-13.9126,-9.9311,2.3633,7.1662,-9.9311,8.6463,21.629,14.8559,233
-5.179,-9.7273,1.5829,7.7762,-9.7273,7.7161,20.1422,16.5414,234
-0.7657,-10.5341,1.264,2.6232,-10.5341,3.3431,20.9205,14.0223,235
-5.7446,-10.1251,1.1568,4.3329,-10.1251,6.6346,25.2925,12.6507,236
-4.2501,-10.0512,2.2192,5.5205,-10.0512,5.9992,15.9838,10.8398,238
-5.7421,-9.9907,0.4373,2.4168,-9.9907,1.1552,11.2963,7.0825,239
1.2975,-9.9237,7.9385,4.2262,-9.9237,1.8953,27.6363,15.9009,240
-3.5551,-9.9614,-0.0841,1.9666,-9.9614,2.4199,14.7881,11.378,242
-9.3158,-10.203,-2.3988,4.3681,-10.203,0.4845,13.199,11.0301,243
-107.3839,-10.1234,13.3418,47.0521,-10.1234,20.501,53.4837,30.1257,244
-115.6812,-9.1264,-0.6369,42.703,-9.1264,9.9481,58.6438,30.1031,245
-19.6764,-10.0198,8.8111,15.2607,-10.0198,14.575,40.3619,22.3553,246
-4.5516,-9.8977,-2.1736,1.6689,-9.8977,3.2807,20.471,16.2679,247
-16.6418,-10.1554,0.9338,8.7788,-10.1554,8.3321,24.6814,12.9749,248
-6.427,-9.7222,-1.1933,3.3947,-9.7222,2.7887,17.9089,16.1756,249
-3.9917,-9.7413,-0.0915,2.528,-9.7413,2.5644,15.2738,7.357,250
-7.6827,-9.367,1.4421,4.2052,-9.367,7.5751,18.0591,10.8438,251
-10.3548,-9.9278,1.818,6.4107,-9.9278,8.777,24.3106,15.8306,253
-24.4,-10.013,6.9815,22.4775,-10.013,14.7833,57.1147,22.1531,254
-13.073,-10.1438,19.2274,21.029,-10.1438,5.2926,53.972,28.6923,255
-4.4244,-10.1316,-1.7038,1.5709,-10.1316,2.5732,13.8774,7.3989,256
-12.4848,-10.185,-0.1352,17.5851,-10.185,8.0637,38.5772,35.3172,257
-6.2009,-10.4317,-1.3862,3.2451,-10.4317,1.4199,11.7529,6.8995,258
-6.0362,-10.3228,0.8556,5.1015,-10.3228,2.2072,10.6328,8.4841,259
-1.9114,-9.7737,-0.3205,0.736,-9.7737,1.781,13.71,7.9925,260
-2.7401,-10.0757,0.6048,2.9729,-10.0757,1.5348,13.4022,9.3041,261
-1.913,-9.9721,0.3956,2.2786,-9.9721,4.4885,14.7944,6.9752,263
-10.6776,-9.9565,1.1862,4.5968,-9.9565,5.8405,22.4568,9.4557,264
-8.3606,-10.0487,0.9567,3.9939,-10.0487,6.5534,14.8233,10.605,265
-8.3002,-10.1135,-2.0724,3.2194,-10.1135,4.8259,15.8857,12.4599,266
-11.4822,-10.6148,10.3023,19.4916,-10.6148,1.8691,25.7754,18.8381,267
-22.5232,-9.9017,-5.5314,8.537,-9.9017,5.0251,25.1764,14.6356,268
-0.2744,-9.869,2.02,3.3128,-9.869,3.8857,19.6145,9.0519,269
-3.4569,-10.0259,0.1247,1.9788,-10.0259,5.2617,17.9459,9.265,270
-3.059,-9.8763,0.4646,1.6768,-9.8763,4.5532,11.6378,7.4297,272
-7.3776,-10.0155,0.0886,2.6105,-10.0155,2.7851,13.1083,4.9568,273
-8.4328,-9.9446,-0.0361,4.5788,-9.9446,5.36,16.8333,9.2626,274
-2.984,-9.9691,3.4051,4.0656,-9.9691,3.9406,19.1056,15.5306,275
-43.754,-10.126,1.6609,24.9416,-10.126,18.3505,43.2665,34.5993,277
-23.9098,-9.9336,-1.1381,9.1396,-9.9336,3.5429,16.3004,10.8608,279
-3.8801,-10.2019,-0.4054,2.4038,-10.2019,3.9873,16.1452,7.7598,280
-6.6629,-9.7679,-0.8475,3.6834,-9.7679,1.6653,14.8423,7.7122,281
-5.3671,-9.9997,1.7366,4.9426,-9.9997,6.7563,16.5503,12.1909,283
-36.076,-9.8706,1.19,10.8119,-9.8706,7.4489,24.5616,11.5208,284
-4.0068,-10.0133,28.4258,26.5863,-10.0133,9.0951,33.4723,27.5688,285
-2.2726,-10.0538,0.6856,1.7331,-10.0538,2.6168,10.0749,7.6424,286
-4.5713,-9.7672,1.8917,5.4057,-9.7672,5.6657,22.9967,16.2699,287
-11.3428,-9.1766,-0.6727,4.6527,-9.1766,4.7081,18.7556,11.2803,288
-9.3393,-9.1657,-1.4827,5.166,-9.1657,2.535,17.0107,13.3115,289
-12.7827,-10.2007,0.0448,5.1595,-10.2007,5.3935,16.0329,10.4536,290
-2.0458,-10.0202,5.1299,8.2434,-10.0202,8.0761,19.9365,15.9258,291
-13.0785,-10.2949,-2.2526,6.6047,-10.2949,2.3376,14.7839,11.1461,293
-9.7365,-9.9318,1.3529,4.8405,-9.9318,8.7699,26.6521,13.1387,294
-4.989,-9.6616,1.0986,3.8804,-9.6616,7.9257,16.3589,15.3001,295
-10.711,-10.0914,-1.2039,4.4648,-10.0914,8.5729,22.4154,10.8617,296
-10.6573,-10.0668,-0.142,4.0339,-10.0668,5.7325,20.5843,12.7014,297
-13.1432,-9.4908,1.2518,11.2953,-9.4908,3.78,22.4474,18.6489,298
-1.5169,-10.224,3.2592,2.6757,-10.224,1.1954,20.0639,15.518,299
-29.3526,-10.1145,6.2584,14.3396,-10.1145,7.3267,31.8377,27.8616,300
-14.7154,-9.8894,-3.4962,5.7484,-9.8894,6.1244,23.8445,10.7879,302
-14.2021,-9.7778,5.2004,12.3488,-9.7778,2.9867,33.7896,24.7361,303
-20.4972,-9.6459,-0.5812,9.0395,-9.6459,8.4264,22.1653,16.805,304
-18.3249,-9.9886,4.4541,12.3073,-9.9886,3.4862,35.3105,10.5404,305
-6.3476,-9.1481,8.7823,15.7047,-9.1481,4.74,35.1357,19.2399,306
0.5703,-9.4714,3.5433,2.1769,-9.4714,6.3767,17.4785,12.5593,307
-9.3465,-10.162,-3.2468,3.2806,-10.162,4.0595,11.5494,6.2469,308
-7.8907,-9.9964,-1.9622,3.8819,-9.9964,2.6172,18.3641,13.5755,309
-7.6687,-9.76,-0.5323,4.8836,-9.76,7.2674,19.1628,12.7196,310
-11.0722,-10.0393,-1.182,3.2964,-10.0393,4.686,16.254,8.716,311
-4.6524,-10.0711,-0.2519,3.9336,-10.0711,5.1203,15.5188,8.1605,312
-17.7532,-10.0806,1.245,8.5963,-10.0806,6.3358,21.3853,12.8963,313
-17.2366,-10.162,0.1237,9.3836,-10.162,9.2604,23.1742,14.9123,314
-9.3492,-9.8305,-0.493,3.3945,-9.8305,5.6497,16.3718,11.5331,315
-5.168,-9.9187,-0.7561,2.8407,-9.9187,2.7861,18.5954,15.499,316
-24.1026,-9.6539,-8.0493,8.075,-9.6539,4.4748,26.4743,21.8973,317
-11.4087,-9.8411,-5.5457,6.4909,-9.8411,7.9612,29.9818,26.5327,318
-20.3216,-9.613,-4.1153,6.6871,-9.613,2.5439,15.5253,12.8706,319
-9.827,-9.9239,0.0779,4.5865,-9.9239,7.2445,21.807,13.8789,320
-11.0024,-9.8779,5.459,17.9266,-9.8779,3.1416,26.9975,24.184,321
-2.3812,-10.4447,1.531,3.1668,-10.4447,6.4426,23.2668,13.6639,323
-4.5027,-9.9819,3.5999,7.3562,-9.9819,8.7487,26.4238,7.7996,324
0.1838,-9.788,3.501,2.127,-9.788,3.7409,17.9822,11.1623,325
-3.5768,-10.1092,-0.6531,1.3241,-10.1092,2.4172,10.655,8.0717,326
-1.6355,-10.2145,1.9177,2.7307,-10.2145,2.5929,16.85,13.6179,327
-13.029,-10.3927,3.526,10.0498,-10.3927,5.1901,46.7176,38.8297,328
-18.3436,-9.7367,-6.4733,6.8788,-9.7367,2.4193,43.4288,39.8249,329
-10.862,-9.8868,-0.5716,7.6672,-9.8868,2.1867,15.0547,10.055,330
-4.1601,-10.2674,0.0971,3.1074,-10.2674,3.5642,26.1967,21.0725,331
-9.1624,-9.9996,0.4832,5.946,-9.9996,6.2171,25.568,15.1991,333
-14.4006,-10.016,2.4,10.6345,-10.016,9.2437,37.0648,21.6681,334
-9.003,-10.0504,6.6558,20.6531,-10.0504,1.8575,24.2232,21.4597,335
-23.2655,-9.3578,2.5365,12.1271,-9.3578,10.0732,56.1866,27.7666,337
-7.2168,-9.8973,1.4029,3.9863,-9.8973,3.2222,21.195,10.8768,339
-11.3068,-10.1619,5.2961,10.9913,-10.1619,8.9374,32.2039,28.9895,340
-0.5567,-9.7606,0.1846,0.5943,-9.7606,0.7066,23.1818,18.8252,341
-23.3957,-9.7787,0.0235,11.2618,-9.7787,8.3169,43.8063,19.5994,343
-16.4308,-9.969,-0.3344,6.6221,-9.969,9.2837,33.3864,12.6059,344
-0.8116,-9.9107,2.0062,2.6783,-9.9107,5.0867,16.8614,10.272,345
-11.0053,-9.897,-0.2566,6.9067,-9.897,3.3667,15.5991,11.7437,346
-7.9243,-9.8189,-0.1575,4.1854,-9.8189,4.2317,13.9464,10.6303,347
-4.9569,-10.0919,-0.5795,4.3326,-10.0919,5.5684,18.2955,8.9158,348
-11.8822,-9.9508,-4.5739,4.46,-9.9508,5.5091,18.4853,11.8363,349
-13.11,-9.9694,-2.7135,4.0028,-9.9694,4.4868,13.9091,8.6604,350
-14.182,-9.9682,-1.0061,9.8492,-9.9682,10.0763,34.1013,30.3228,351
-20.0511,-9.7696,-1.802,8.6864,-9.7696,7.0047,32.7421,21.4443,353
-14.8293,-9.9029,0.2069,5.7806,-9.9029,7.8064,30.8501,12.6134,354
-8.8607,-9.28,-2.4716,4.1493,-9.28,3.9692,14.7698,8.5884,355
-24.9716,-9.8811,-1.0496,8.5334,-9.8811,4.9453,20.5017,11.8077,356
-12.5063,-10.1434,-0.7958,8.2575,-10.1434,2.5182,22.1332,18.6928,357
-10.0964,-10.136,-2.2073,6.3041,-10.136,5.6452,28.905,25.3938,358
-6.6378,-9.9839,-2.2127,3.2307,-9.9839,4.3705,18.1996,10.6987,359
-10.6391,-10.1111,-1.6914,3.7404,-10.1111,3.55,16.0527,12.5072,360
-6.2991,-9.6419,-2.1801,2.6045,-9.6419,1.6643,9.9486,8.178,362
-11.3621,-9.8984,0.3508,6.5844,-9.8984,5.5776,24.9967,10.6355,363
-15.7325,-9.9742,-0.8502,8.2151,-9.9742,10.3033,27.4324,17.5137,364
-13.0784,-9.9549,-1.9639,4.2248,-9.9549,7.2349,19.223,11.0194,365
-11.3248,-9.8292,-6.4296,3.5095,-9.8292,2.7542,19.6617,16.9983,366
-18.5113,-9.8639,-0.7232,12.0431,-9.8639,3.5616,27.5563,23.6202,367
-11.016,-9.6119,-2.396,6.4449,-9.6119,3.4868,25.0236,21.4001,368
-37.0818,-10.2124,-11.7126,15.7773,-10.2124,2.9243,25.9979,22.101,369
-20.3266,-9.8935,-1.8638,7.9227,-9.8935,8.1339,23.15,15.3838,370
-8.2931,-9.9936,3.7264,8.7965,-9.9936,6.0987,28.8333,21.6598,371
-24.9103,-10.2449,8.2735,27.6245,-10.2449,5.83,50.221,47.3738,372
-16.1681,-9.9276,1.0177,10.4055,-9.9276,11.3614,29.8936,14.9353,374
-25.3759,-9.8243,-1.7839,8.042,-9.8243,8.557,29.9116,13.6097,375
-29.0061,-9.3269,-4.8098,12.8971,-9.3269,5.9266,19.9574,15.9799,376
-4.1589,-10.0346,-0.3069,2.657,-10.0346,6.883,20.2958,14.0737,377
-4.3254,-10.1763,8.4332,9.5825,-10.1763,9.0053,25.9452,16.6207,378
-3.9035,-10.0297,-1.322,1.7652,-10.0297,1.2745,13.9785,11.9321,379
-18.733,-10.0043,-2.8716,7.4373,-10.0043,14.3438,31.797,20.8192,380
-23.6961,-10.0591,1.7522,12.2391,-10.0591,13.8268,34.5096,28.5264,381
-11.2714,-10.0371,-0.7602,3.9091,-10.0371,5.1941,29.4041,5.5322,383
-1.427,-9.9479,3.3668,4.6322,-9.9479,2.9346,32.4716,10.1721,384
-17.2698,-9.8383,26.2938,40.6884,-9.8383,6.5933,73.6045,50.2591,385
-43.942,-10.7754,-0.2184,35.1414,-10.7754,8.667,102.082,92.7603,386
-4.298,-10.5681,19.6711,20.0387,-10.5681,9.7309,57.6826,46.8998,387
-3.8922,-9.9406,6.5853,8.5336,-9.9406,2.9518,20.0334,15.5509,388
-24.2358,-10.0062,-5.5998,9.7793,-10.0062,3.801,16.0259,10.9846,389
-6.5958,-9.8645,-0.7287,2.9026,-9.8645,1.1094,17.2098,13.5178,390
-14.426,-10.1502,-0.6689,6.4334,-10.1502,2.8207,20.0401,14.5057,392
-10.185,-10.0839,11.8069,14.264,-10.0839,15.1522,63.4589,38.8137,393
-0.0231,-10.4486,17.2492,12.724,-10.4486,6.1969,50.0368,40.2137,394
-7.4307,-9.8815,-4.0617,2.8302,-9.8815,2.2213,23.6023,17.8622,395
-16.6233,-9.783,-0.6766,5.7514,-9.783,3.4796,30.6095,7.6696,397
-54.3364,-10.2494,12.4137,52.9318,-10.2494,16.5513,128.3739,86.2747,398
-26.7146,-10.0094,-10.9555,9.9899,-10.0094,2.7643,21.0007,16.4291,399
-22.6667,-9.5208,-6.3539,10.955,-9.5208,3.7439,15.6856,8.8677,401
-37.4253,-9.7345,-5.7853,11.953,-9.7345,5.56,42.9679,25.6901,402
