AYGX_min,AZ_mean,AYGX_mean,AYGX_std,AZ_mean,GX_std,Gnorm_max,Gnorm_median,timestamp
0.0788,-9.7765,0.0835,0.0028,-9.7765,0.0104,1.3891,1.3777,0
0.0792,-9.7769,0.084,0.0032,-9.7769,0.0133,1.4037,1.3748,1
-9.3333,-9.7672,0.644,4.016,-9.7672,4.391,13.5503,1.4231,2
-9.886,-9.7887,-1.3575,5.5353,-9.7887,9.1744,36.7798,12.1897,3
-7.3705,-9.712,-3.0086,2.7999,-9.712,3.7868,32.5844,21.9962,4
-35.5424,-9.7348,-8.3726,11.8455,-9.7348,4.8244,25.8245,19.9907,5
-29.8395,-9.4163,-0.1311,15.4156,-9.4163,4.6141,27.9652,10.8189,6
-102.8651,-9.044,-13.0891,31.5118,-9.044,13.0147,57.4866,28.6441,7
-266.5697,-8.5667,-17.9279,93.6101,-8.5667,17.9942,61.2776,30.3526,8
-121.4406,-9.0964,2.4245,37.2239,-9.0964,15.5448,58.5494,22.4056,9
-62.3969,-8.2864,1.9722,31.3555,-8.2864,12.4985,49.7345,19.4867,10
-9.3856,-9.5239,6.0612,9.0463,-9.5239,3.5619,33.0153,14.045,11
-26.0443,-9.609,-11.5335,11.4173,-9.609,3.405,17.1886,13.9909,12
-13.6184,-9.799,-4.926,4.1851,-9.799,1.3082,20.5662,16.9258,13
-101.2356,-9.8571,-17.7373,47.3518,-9.8571,12.8006,47.3973,30.633,14
-42.3026,-8.9968,-12.5644,20.8098,-8.9968,12.7914,66.7352,39.1671,15
-101.4725,-9.9327,1.3267,53.6543,-9.9327,14.505,59.7868,50.05,16
-4.5226,-9.7437,1.3342,4.0728,-9.7437,2.6668,22.9763,11.6246,17
-3.9764,-9.7607,4.1921,5.5294,-9.7607,6.3176,26.7101,17.9258,18
0.0195,-9.8499,1.9638,2.3756,-9.8499,3.8634,24.3203,20.2106,19
-0.2663,-9.8785,0.6005,1.0536,-9.8785,1.9248,9.7268,4.5002,20
-10.4283,-9.8098,1.6135,8.8606,-9.8098,6.4972,26.1337,18.6176,21
-2.2572,-9.662,12.3347,12.4807,-9.662,7.7974,19.1131,16.2393,22
-8.25,-9.8365,0.3153,6.5611,-9.8365,7.9594,27.7003,13.2721,23
-10.7118,-9.8079,-0.4589,3.0689,-9.8079,4.6801,15.3317,6.9957,24
-2.001,-9.7148,0.3685,2.1645,-9.7148,4.7645,14.5199,7.9359,25
-5.3328,-9.7215,0.1029,3.1823,-9.7215,3.9596,12.503,8.2401,26
-3.9548,-9.5873,0.9547,3.2935,-9.5873,2.1192,13.2477,8.6374,27
-4.3493,-9.8655,0.0539,1.7767,-9.8655,3.406,14.7919,7.6468,28
-4.1922,-9.8067,-0.1825,1.3415,-9.8067,2.8763,16.4365,7.3212,29
-2.9805,-9.6821,1.2679,2.851,-9.6821,2.1358,10.6758,6.0219,30
-0.2788,-9.835,0.3841,0.6088,-9.835,1.1758,5.0164,4.3112,31
-3.9576,-9.6486,0.3105,2.3841,-9.6486,3.5838,11.4261,5.6599,32
-3.3497,-9.9215,1.3636,4.9293,-9.9215,3.0332,17.8602,12.8156,33
-12.3027,-9.7334,-1.6701,4.9018,-9.7334,3.5047,16.0502,7.9063,34
-0.2007,-9.6441,1.4076,1.428,-9.6441,4.2973,13.3158,7.3836,35
-10.0495,-9.7669,-1.3917,3.9154,-9.7669,4.6071,10.9582,6.1312,36
-10.7801,-9.8836,-0.9215,4.3578,-9.8836,2.2147,8.6888,7.2132,37
-11.5957,-9.8264,1.5899,9.1329,-9.8264,8.4814,25.6724,13.5833,38
-6.789,-9.8632,1.7585,5.1811,-9.8632,5.1794,20.9697,11.1952,39
-10.0816,-9.2634,-0.7542,3.3874,-9.2634,3.4605,24.4645,9.7029,40
-0.0984,-9.7887,3.4567,6.1941,-9.7887,2.1909,11.1386,7.7929,41
-19.1614,-9.9044,8.0342,26.6052,-9.9044,5.0377,40.8245,28.9497,42
-17.017,-8.7493,0.9815,14.3318,-8.7493,3.9697,30.1528,23.6253,43
-1.1006,-9.766,1.7182,2.7176,-9.766,4.4406,14.1977,5.1713,44
-1.1415,-9.9261,0.2842,0.8961,-9.9261,0.7671,5.6886,3.3648,45
-0.9769,-9.6982,1.4139,2.4462,-9.6982,3.7382,15.5168,7.5552,46
-0.5958,-9.7157,0.5592,1.0563,-9.7157,1.9064,10.4304,6.4055,47
-0.8276,-10.3116,0.8877,2.4356,-10.3116,3.078,14.2848,5.3553,48
-5.3773,-9.8125,1.0844,2.952,-9.8125,6.2579,13.2112,8.5093,49
-0.6035,-9.6772,-0.0825,0.2544,-9.6772,0.7083,6.8157,3.6469,50
-0.7382,-9.8721,-0.0947,0.3499,-9.8721,0.4869,4.132,2.7376,51
-8.7871,-9.7531,-2.2366,4.1158,-9.7531,2.3955,8.9323,6.5269,52
-1.7475,-9.8476,0.6138,1.3857,-9.8476,3.7594,11.1445,6.5436,53
-0.6972,-9.8218,0.6242,1.2505,-9.8218,1.5094,7.5029,5.0759,54
-0.1962,-9.7063,0.2391,0.2516,-9.7063,0.8562,7.9643,3.9446,55
-7.0223,-9.5171,0.0929,2.2532,-9.5171,2.9881,15.596,7.9191,56
-19.0384,-10.1216,-2.8155,7.9972,-10.1216,6.1853,25.5876,9.9829,57
-13.4125,-9.4574,4.1959,8.2848,-9.4574,2.4683,29.1156,17.7566,58
-9.1257,-9.587,1.9615,6.3396,-9.587,3.5934,22.9744,10.9137,59
-12.3059,-9.4348,3.8943,10.5755,-9.4348,3.6241,24.5987,21.9823,60
-15.5407,-9.8909,0.775,5.6357,-9.8909,3.7165,27.4684,16.116,61
-4.1867,-9.7468,-0.3419,1.7989,-9.7468,2.8003,10.5334,5.6958,62
-6.508,-9.103,0.7,3.0517,-9.103,0.9191,16.3818,9.7729,63
-0.5716,-9.8107,1.4728,2.2269,-9.8107,2.1606,5.9978,4.5932,64
-4.0553,-9.7633,1.252,5.1828,-9.7633,3.3674,14.4884,9.1691,65
-1.9526,-9.7123,0.0089,1.4372,-9.7123,2.891,10.0079,3.709,66
-5.598,-10.186,-1.8395,1.9633,-10.186,2.7705,13.7034,11.2023,67
-5.0507,-9.5671,-0.2733,1.9629,-9.5671,2.6839,13.7911,6.5984,68
-4.1623,-9.9251,1.0704,2.5999,-9.9251,3.4093,13.3826,5.9523,69
-1.3089,-9.806,1.0097,1.4245,-9.806,2.912,6.763,5.1213,70
-2.613,-9.8626,0.8488,2.8669,-9.8626,2.8555,8.4726,6.1032,71
-0.2457,-9.7055,0.888,0.8642,-9.7055,3.9798,13.5181,11.2018,72
-4.9729,-9.7521,7.4917,7.7514,-9.7521,5.2488,20.5666,16.2155,73
-4.0392,-10.0874,0.0513,2.4521,-10.0874,1.5212,9.9309,7.1285,74
-2.2721,-9.587,0.6174,1.6522,-9.587,2.4048,11.374,5.8681,75
-2.4489,-9.7982,1.0451,2.4054,-9.7982,5.2212,12.8912,7.8608,76
-0.9,-9.946,0.2424,1.241,-9.946,0.899,6.3906,5.024,77
-0.5883,-9.8795,0.367,0.8212,-9.8795,1.2143,6.0495,3.8599,78
-1.8173,-9.6977,0.2507,0.6847,-9.6977,2.1684,6.6548,4.2088,79
-0.0866,-9.8013,-0.0356,0.0389,-9.8013,0.388,6.4334,3.3448,80
-0.3185,-9.8442,-0.0262,0.3006,-9.8442,0.5426,4.2453,2.5112,81
-0.2746,-9.6949,-0.006,0.1652,-9.6949,0.7335,4.4054,3.6371,82
-0.4791,-9.5343,-0.0132,0.3917,-9.5343,1.8397,6.7698,5.5096,83
-4.3651,-9.81,0.725,2.8478,-9.81,5.7438,16.2051,11.1413,84
-2.1027,-9.8226,2.1348,2.6025,-9.8226,3.6481,15.0389,13.3583,85
-0.2398,-9.7922,0.2894,0.411,-9.7922,1.4347,6.3991,3.7469,86
-0.4977,-9.7796,-0.126,0.2035,-9.7796,0.703,5.779,4.742,87
-0.4121,-9.8051,0.6254,0.7773,-9.8051,2.6606,14.9576,10.8318,88
-1.4908,-9.7819,0.4209,0.7952,-9.7819,1.5647,23.8162,10.9356,89
-5.0081,-9.8359,-1.5175,2.2692,-9.8359,1.6752,12.8793,8.8529,91
-3.8802,-9.6978,0.2123,3.5481,-9.6978,2.9849,11.5741,5.7638,92
-4.2046,-8.8798,-2.2361,1.5339,-8.8798,1.4615,18.1218,12.1482,93
-3.4989,-9.9608,-0.016,2.129,-9.9608,3.9966,21.3384,14.9973,94
0.2012,-9.8722,1.855,1.1761,-9.8722,1.1152,8.4525,6.7367,95
-8.6332,-9.338,-1.6642,2.8884,-9.338,3.9123,16.636,10.1025,96
-40.8282,-9.2257,-0.7908,27.5821,-9.2257,5.3963,39.9856,26.8771,97
-6.9682,-9.7495,0.3869,4.1426,-9.7495,2.8851,26.0169,10.499,98
-7.8929,-9.7567,0.9278,3.8482,-9.7567,4.3926,16.0625,6.258,99
-10.6876,-9.8238,0.331,3.6358,-9.8238,3.6866,12.3587,6.6003,100
-2.7621,-9.7294,0.04,1.9409,-9.7294,2.3419,7.4444,6.5681,101
-4.3268,-9.4677,-1.0597,2.178,-9.4677,1.6714,10.2642,6.8535,102
-4.7028,-9.8074,-1.4931,1.5481,-9.8074,2.3695,9.5701,6.811,103
-0.8733,-9.6366,1.0838,2.0246,-9.6366,2.2132,10.4362,6.4191,104
-1.9353,-9.515,0.231,1.5727,-9.515,2.5697,9.4878,8.2546,105
-2.3435,-9.8465,-0.2853,0.9751,-9.8465,2.259,9.7991,4.7833,106
-1.4708,-10.1288,1.1471,2.4813,-10.1288,2.754,13.2023,10.8165,107
-2.5256,-9.6354,0.7579,1.857,-9.6354,2.7905,9.5242,5.5023,108
-2.2543,-9.7914,2.0405,3.1957,-9.7914,3.869,17.1834,8.7631,109
-7.0046,-9.6741,3.7686,8.2442,-9.6741,10.4656,27.9291,23.7854,110
-1.4339,-10.101,-0.2629,0.789,-10.101,2.2037,16.9456,7.3138,111
0.0536,-9.7338,0.9499,0.8114,-9.7338,0.6149,7.4844,7.0179,112
-0.8152,-9.8664,2.0434,2.4384,-9.8664,4.5077,22.9528,19.3853,113
-3.2754,-10.4086,1.5329,4.0961,-10.4086,1.7344,12.4161,8.2282,114
-7.8746,-10.1092,0.2508,6.8872,-10.1092,3.3926,12.9998,9.1184,115
-13.8623,-9.2773,1.0881,7.9769,-9.2773,2.6351,18.8627,13.9325,116
-2.6473,-9.5578,1.1306,2.2854,-9.5578,1.1597,10.5278,9.1088,117
-1.4172,-9.5947,0.3907,1.458,-9.5947,3.7068,8.3403,6.6136,118
-3.2314,-9.8805,0.1474,1.1633,-9.8805,2.6655,9.4362,5.2903,119
-2.1481,-9.8467,1.7795,2.3766,-9.8467,2.1666,10.2413,7.7811,120
-1.2369,-9.8025,-0.2297,0.5589,-9.8025,0.8386,7.8794,3.8354,121
-0.5535,-9.7951,0.4462,0.9346,-9.7951,1.8101,4.1179,3.461,122
-0.4199,-9.6458,1.1192,1.5908,-9.6458,2.1576,9.1793,7.609,123
-0.1636,-9.673,2.3516,2.4881,-9.673,2.8172,11.3226,9.4282,124
-2.7157,-9.8114,2.3826,2.8178,-9.8114,4.751,15.1253,10.5562,125
-1.5231,-9.8139,0.3359,1.3963,-9.8139,3.718,9.3273,5.3515,126
-0.9805,-9.9057,-0.2119,0.4396,-9.9057,2.1559,9.8476,7.2132,127
-1.1341,-9.7096,0.5831,1.8692,-9.7096,3.1887,13.4125,6.352,128
-0.5955,-9.7864,0.403,1.0265,-9.7864,2.5853,8.4172,4.7835,129
-1.1054,-9.5374,1.62,2.1659,-9.5374,1.965,6.8489,5.4969,130
-0.5678,-9.8635,0.2126,0.5734,-9.8635,1.3114,4.4883,2.3977,131
-2.878,-10.0838,-0.2582,2.176,-10.0838,1.948,11.6068,6.0434,132
-0.6192,-9.9337,-0.2737,0.2147,-9.9337,0.709,5.8824,2.9832,133
-0.4475,-9.8854,1.2312,1.5508,-9.8854,1.2915,7.3515,4.4026,134
-0.411,-9.5929,0.1568,0.4729,-9.5929,0.8004,5.1827,3.8363,135
-0.1158,-9.7874,0.2314,0.3271,-9.7874,0.9957,4.5297,2.9837,136
-0.4339,-9.8108,0.0264,0.2615,-9.8108,0.8383,4.0946,2.2053,137
-0.4081,-9.7924,0.0251,0.2091,-9.7924,0.9268,6.3533,3.5595,138
-1.2126,-9.8207,0.2894,0.5731,-9.8207,1.7332,26.681,8.2726,139
-0.0532,-9.7029,4.1826,3.7584,-9.7029,1.9312,28.4609,27.1422,140
-1.2539,-9.846,0.9065,2.0298,-9.846,0.5795,13.0014,11.4495,141
-11.5288,-9.8001,-2.1753,3.8977,-9.8001,3.7524,25.3394,18.7027,142
-12.6856,-9.7258,1.3768,5.8966,-9.7258,5.4008,10.0349,7.6913,143
-1.8705,-9.7969,0.0212,1.1593,-9.7969,2.2525,8.2064,5.9612,144
-0.4962,-9.7205,0.5807,0.8074,-9.7205,1.0637,6.6047,4.031,145
3.8266,-9.9,11.9772,3.4774,-9.9,2.4356,31.2639,16.5477,146
-1.3478,-9.7852,-0.2247,0.6601,-9.7852,1.6904,17.3118,15.7551,147
-2.0439,-10.1598,1.299,4.2939,-10.1598,1.4239,12.3501,4.5252,148
-6.0227,-9.8699,0.7151,6.7126,-9.8699,6.5058,22.7437,16.1462,149
-18.7625,-9.856,-0.6637,12.9437,-9.856,3.5399,38.1541,29.1719,150
-1.1411,-9.7545,1.2145,1.6646,-9.7545,3.3358,12.256,8.2236,151
-1.2069,-9.9959,0.0666,0.7987,-9.9959,0.7359,13.2307,9.5185,152
-1.6793,-9.8042,0.7849,2.0713,-9.8042,3.6285,15.5598,10.5471,153
-3.3556,-9.7383,-0.1713,1.2737,-9.7383,2.4703,8.5251,5.5375,154
-2.8184,-10.1005,-0.8537,1.0454,-10.1005,2.866,14.2755,5.9957,155
-5.2583,-9.9833,-0.195,2.4854,-9.9833,3.805,20.8446,19.0899,156
-10.0567,-10.5656,3.5844,9.3305,-10.5656,10.3806,65.7759,59.6351,157
-12.6862,-10.405,-0.3085,5.6932,-10.405,0.809,27.9657,26.2604,158
-0.9986,-9.9027,5.3591,3.9167,-9.9027,2.554,16.8473,12.5899,159
-1.7483,-9.7179,-0.2024,0.8833,-9.7179,1.0385,15.4144,10.366,160
-1.6506,-9.6945,1.4187,2.3805,-9.6945,5.261,17.8859,8.8761,161
-0.6313,-9.8089,0.1985,0.6683,-9.8089,1.5377,8.9413,5.9658,162
-7.3951,-9.7421,1.8323,5.0626,-9.7421,7.3247,20.471,11.6138,163
-9.0604,-9.9392,0.5753,2.9162,-9.9392,5.0865,13.2375,8.2546,164
-1.4672,-9.6037,0.2632,0.8248,-9.6037,1.4252,6.1471,3.6929,165
-1.106,-9.8988,0.5903,1.005,-9.8988,2.1837,14.0663,4.0117,166
-1.1669,-9.8858,0.0943,0.8576,-9.8858,1.1721,9.4652,6.9748,167
-1.6722,-9.7369,-0.2304,1.3387,-9.7369,0.7078,12.0303,6.742,168
-0.7879,-9.8972,0.5382,1.177,-9.8972,1.3813,5.3663,3.2644,169
-3.1862,-10.0633,-0.4301,2.3811,-10.0633,4.8952,14.2232,8.9178,170
-3.8012,-9.8699,2.2848,4.1667,-9.8699,8.1586,20.3279,12.808,171
-1.4071,-9.5666,-0.167,0.8795,-9.5666,0.9427,10.0221,9.2739,172
-1.2349,-9.8245,0.2263,0.7232,-9.8245,1.7253,6.5187,4.037,173
-0.8387,-9.8513,0.0428,0.3852,-9.8513,1.1882,10.1633,4.2118,174
-1.2154,-9.8049,-0.0338,0.732,-9.8049,0.7008,7.3611,4.3515,175
-2.4267,-9.8594,-0.0062,1.4268,-9.8594,1.8436,11.7298,9.9462,176
2.2187,-10.1194,7.9213,5.4084,-10.1194,1.4695,14.92,14.2093,177
-7.9194,-9.6585,3.4362,8.3376,-9.6585,1.9777,16.1631,13.6061,178
-3.4144,-9.584,-0.7391,1.1783,-9.584,2.0742,9.2528,5.5882,179
-3.5625,-9.8282,1.5651,3.8888,-9.8282,2.0264,32.3048,21.7576,180
-79.5153,-8.6792,63.7798,106.7491,-8.6792,30.1694,100.0981,67.9761,181
-51.6211,-9.9328,0.4564,20.3745,-9.9328,2.2546,51.3655,28.5325,182
-7.1375,-9.8223,0.732,3.7607,-9.8223,8.2738,27.4174,16.8356,183
-1.7448,-9.5167,1.4607,2.8626,-9.5167,3.6491,13.5532,8.0689,184
-1.7978,-9.8908,0.5332,1.122,-9.8908,1.351,10.7193,5.9524,185
-0.546,-9.4435,1.4404,1.5249,-9.4435,0.3977,11.314,7.083,186
-1.5342,-10.1848,0.9982,2.0114,-10.1848,1.646,14.3771,7.5265,187
-1.1723,-9.9824,3.0096,3.6218,-9.9824,4.2668,18.3117,12.8395,188
-0.2536,-9.9279,2.0516,2.1689,-9.9279,2.8145,14.2767,11.6454,189
-0.3751,-9.54,0.3055,0.4649,-9.54,0.6313,9.3196,7.3948,190
-6.9854,-9.8019,5.9109,9.8809,-9.8019,7.9046,32.3679,18.838,191
-6.7165,-10.0386,4.2437,9.6371,-10.0386,4.5463,40.2012,39.1222,192
-2.9762,-9.6648,-0.3164,1.6645,-9.6648,0.9585,10.9806,5.6963,193
-3.6648,-9.7707,0.3716,2.1064,-9.7707,3.6884,20.5945,12.9243,194
-5.4398,-9.6753,-0.4006,3.0246,-9.6753,1.4438,22.181,19.6228,195
-0.8242,-9.7696,0.4231,0.695,-9.7696,0.87,10.5793,4.0635,196
-1.2986,-9.7116,-0.2026,0.9758,-9.7116,2.3661,13.7121,12.6278,197
-1.2103,-9.6369,0.2057,1.1326,-9.6369,1.4132,10.8014,6.6941,198
-6.4312,-9.855,1.0579,5.211,-9.855,1.3493,18.4509,15.0624,199
-2.8529,-10.0931,7.7809,9.9337,-10.0931,2.2733,27.5676,16.584,200
-3.9681,-9.7621,0.5244,1.9856,-9.7621,2.1774,15.5227,9.3279,201
-1.4059,-9.6671,0.1572,0.7708,-9.6671,1.9784,7.7323,6.395,202
-0.8759,-9.7372,0.2394,0.6757,-9.7372,2.5539,8.3205,5.5718,203
-1.2826,-9.6827,0.2609,0.7882,-9.6827,2.1969,7.6101,5.1582,204
-2.0655,-9.7643,0.0198,0.8894,-9.7643,1.7416,8.8597,5.103,205
-1.0177,-9.7276,0.8622,1.1603,-9.7276,1.4195,13.3712,7.3433,206
-0.3153,-9.6674,0.2195,0.4851,-9.6674,0.7126,6.427,4.9553,207
-0.0763,-9.9715,-0.0024,0.0851,-9.9715,0.392,7.1504,3.8079,208
-0.59,-9.9362,0.887,1.0819,-9.9362,2.4908,13.9599,11.3386,209
-0.3258,-9.6759,0.6736,1.0119,-9.6759,2.1229,10.2198,8.2193,210
-2.0498,-9.851,0.1034,1.0722,-9.851,3.3513,15.7977,6.94,211
-1.9771,-9.7943,1.2832,1.9557,-9.7943,0.6552,12.5727,8.8945,212
-1.381,-9.6823,0.1345,0.5659,-9.6823,2.1683,9.9366,3.5864,213
-0.4255,-9.7876,0.6804,0.793,-9.7876,2.5686,12.665,7.4237,214
-1.1231,-9.7263,0.1278,0.7273,-9.7263,1.2286,10.2568,5.6991,215
-1.2421,-9.6173,0.0311,0.8079,-9.6173,2.2428,14.3443,11.8818,216
-0.0253,-9.6196,1.2446,1.5407,-9.6196,1.2862,6.3366,5.4575,217
0.0509,-9.6942,0.4965,0.4434,-9.6942,1.0206,8.5127,4.2478,218
-0.6267,-10.0274,0.0997,0.4446,-10.0274,0.6222,6.6528,4.8323,219
-0.6102,-9.5735,2.8651,2.7361,-9.5735,1.4278,12.0645,10.6488,220
-1.7905,-9.5496,1.5499,2.6752,-9.5496,4.5576,21.5995,12.8074,221
-3.8277,-10.1922,0.4798,2.7626,-10.1922,1.6466,23.4874,13.228,222
-1.6586,-9.726,2.3982,3.2582,-9.726,3.3148,15.7806,14.4041,223
-2.7984,-9.679,0.8941,2.4087,-9.679,3.5289,18.2121,6.6453,224
-1.503,-9.7299,0.2194,0.9354,-9.7299,0.6648,11.7225,6.194,225
-0.7857,-9.7981,-0.1312,0.3266,-9.7981,0.6232,15.9109,14.8242,226
0.1421,-9.6631,3.0027,1.7135,-9.6631,0.6006,9.7027,7.9313,227
1.4931,-9.8687,8.9096,5.6826,-9.8687,1.4484,24.6288,17.1585,228
-11.1849,-9.9294,3.248,10.3465,-9.9294,8.6354,35.0036,26.0753,229
12.3417,-10.2661,31.4754,12.385,-10.2661,4.7062,37.0655,32.3093,230
-7.529,-10.2239,17.8084,19.8305,-10.2239,15.909,58.8098,41.0679,231
-6.2829,-9.5772,12.3697,16.8084,-9.5772,2.9074,49.4623,43.613,232
-4.6893,-9.8382,0.8431,2.5369,-9.8382,4.7686,14.5698,7.6381,233
-5.0975,-9.9243,0.7459,3.0095,-9.9243,5.4751,16.6925,9.3613,234
-3.6489,-9.1192,-0.0902,2.8885,-9.1192,1.0135,9.3024,8.0368,235
-0.0836,-9.6921,0.6075,0.6457,-9.6921,0.8052,17.1832,9.7544,236
-19.4118,-9.9852,-3.6345,8.6976,-9.9852,2.8443,14.8696,13.5903,237
-0.3136,-9.7986,2.3213,2.1474,-9.7986,4.0516,10.2722,6.1943,238
-0.5761,-10.0588,2.6536,4.1803,-10.0588,4.3098,11.8841,8.9454,239
-0.0318,-9.7624,0.1865,0.1566,-9.7624,0.9191,13.9883,6.5573,240
-1.9479,-9.9026,0.1687,1.1575,-9.9026,1.3237,21.215,12.5829,241
-0.0805,-9.5309,0.2798,0.2538,-9.5309,0.5405,18.4546,16.4713,242
-0.2977,-9.7345,0.1497,0.3484,-9.7345,0.5443,12.7278,11.3179,245
-0.9603,-9.7552,0.1954,0.7087,-9.7552,1.9832,10.9068,9.8388,246
0.6131,-9.5778,2.4263,1.8523,-9.5778,0.8472,12.2808,10.0303,247
-7.5303,-9.6496,-1.3576,2.6521,-9.6496,2.6067,17.9516,12.9135,248
-0.3685,-9.5797,3.1122,3.9734,-9.5797,5.2115,14.2961,12.2911,249
-5.0296,-9.8139,-1.0926,2.4739,-9.8139,3.6882,16.5082,11.4828,250
-1.0705,-9.9872,6.3307,9.5282,-9.9872,6.5123,37.6542,32.9081,251
-0.1691,-9.7268,6.9047,10.4824,-9.7268,6.0345,19.454,17.8067,252
-7.5583,-9.8552,15.0649,18.6093,-9.8552,9.5366,56.1327,33.0977,253
-3.387,-9.7128,0.7222,2.5629,-9.7128,1.2418,29.5146,13.5735,254
-0.0273,-9.7711,0.5898,0.5021,-9.7711,3.0628,12.5033,11.2352,255
-2.6102,-9.7622,0.9787,1.8312,-9.7622,2.0926,14.403,6.5951,256
-19.646,-9.7108,-6.4867,5.9225,-9.7108,3.3506,11.0273,6.6535,257
-1.496,-9.6645,1.0545,1.673,-9.6645,1.114,2.9386,2.0794,258
1.4417,-9.7028,2.7797,0.6222,-9.7028,0.3406,3.0603,2.5751,259
0.7213,-9.7286,0.9927,0.1765,-9.7286,0.1666,1.6936,1.5335,260
0.2189,-9.7205,0.3875,0.15,-9.7205,0.1358,1.3979,1.2901,261
0.8072,-9.7391,0.9261,0.0603,-9.7391,0.0819,1.6482,1.5834,262
0.2867,-9.7432,0.3701,0.0506,-9.7432,0.0597,1.3438,1.3006,263
0.2826,-9.7452,0.3733,0.0532,-9.7452,0.0616,1.341,1.3106,264
-1.1379,-9.7444,-0.1412,0.4917,-9.7444,0.5082,1.8939,1.298,265
0.4979,-9.7498,0.8659,0.2265,-9.7498,0.3122,2.3486,1.8336,266
-2.8617,-9.8211,-0.7062,1.3093,-9.8211,2.0231,4.2711,3.087,267
-0.7955,-9.7165,-0.2234,0.3984,-9.7165,0.3997,3.366,2.2065,268
-0.8416,-9.7526,1.1576,1.4166,-9.7526,1.6487,4.5079,2.2318,269
-0.7682,-9.7629,0.4713,0.8973,-9.7629,1.1622,3.8384,3.3149,270
-8.9252,-9.7386,-3.5931,2.5768,-9.7386,2.0402,7.9493,4.1713,271
0.3296,-9.7279,2.3159,1.8075,-9.7279,1.5157,5.6891,2.4577,272
1.1573,-9.7449,1.5881,0.2846,-9.7449,0.3478,2.6992,2.5629,273
-104.6059,-9.8946,-12.5315,37.2675,-9.8946,4.8821,37.5831,25.4395,274
-9.516,-9.6219,10.4233,10.1351,-9.6219,5.6751,12.9821,8.1843,275
-26.894,-9.3523,-1.463,7.7111,-9.3523,4.2324,50.4283,9.2456,276
-6.7441,-9.8154,14.9187,11.3878,-9.8154,5.8156,58.2381,22.8624,277
-3.8685,-10.1179,0.4385,1.5779,-10.1179,5.3242,75.8345,65.6173,278
-4.3274,-10.1471,0.2808,1.6,-10.1471,2.3955,54.4322,49.8954,279
-0.9058,-10.3535,0.1801,1.0018,-10.3535,4.7678,49.6029,47.8667,280
-4.9899,-9.738,-0.5432,1.5557,-9.738,5.4698,30.4119,27.0704,281
-1.6993,-9.8123,42.4832,23.3404,-9.8123,9.2927,41.8017,39.0768,282
-0.306,-10.0161,0.1366,0.2753,-10.0161,1.5139,27.4965,26.7604,283
-0.609,-9.7324,3.1676,2.1055,-9.7324,1.7539,16.9902,15.6807,284
-1.8102,-9.7182,2.3863,2.6697,-9.7182,2.6782,32.0592,24.4888,285
-0.3587,-9.7052,6.7236,5.6204,-9.7052,9.5701,25.3993,14.627,286
-4.7984,-9.3227,0.0774,2.5679,-9.3227,4.3568,14.6856,10.7119,287
-9.8835,-9.8604,0.1214,2.4295,-9.8604,1.7957,14.6713,5.7734,288
-4.6791,-9.8809,0.4021,2.4764,-9.8809,3.379,11.9682,6.8817,289
-0.9743,-9.8915,3.4146,4.0764,-9.8915,1.8637,12.4618,9.524,290
-0.127,-9.8816,0.0132,0.1206,-9.8816,0.3101,3.9782,2.8553,291
-0.7557,-9.7871,1.2065,2.0063,-9.7871,2.0426,10.1506,7.9044,292
-0.1597,-9.7835,0.2728,0.2973,-9.7835,0.5352,5.8039,3.2757,293
-0.9084,-9.696,0.0075,0.4444,-9.696,1.0115,4.6054,1.7405,294
-4.0545,-9.6614,8.3954,9.8603,-9.6614,6.0015,19.3629,13.8823,295
-33.7713,-9.9073,0.1443,17.9239,-9.9073,10.3295,25.5985,13.8028,296
-1.8782,-9.8538,0.5551,2.463,-9.8538,2.1499,9.7862,7.4391,297
-12.2585,-9.799,-1.1941,3.9746,-9.799,2.594,11.3382,6.2643,298
-2.5748,-9.8622,3.3199,7.3441,-9.8622,7.0029,16.7477,11.9226,299
-19.6534,-9.4685,1.521,12.7001,-9.4685,6.9195,16.1268,12.4934,300
-19.7748,-9.9254,-1.4217,10.4403,-9.9254,3.8681,17.9574,10.5801,301
-8.7211,-10.0226,-0.1221,3.8749,-10.0226,3.7164,7.4951,4.2266,302
-14.0143,-9.7429,-2.0996,4.9569,-9.7429,6.1917,12.7707,10.3807,303
-0.3907,-10.2059,0.7043,0.8081,-10.2059,2.7221,8.3336,6.831,304
-0.1064,-9.7869,2.5788,2.5629,-9.7869,4.5415,13.5962,12.0728,305
-1.9255,-9.9633,1.1195,1.7318,-9.9633,5.4496,23.8393,15.3142,306
-2.3026,-9.7837,0.2268,1.6946,-9.7837,0.4099,12.5927,9.6247,307
-11.715,-9.818,2.0341,7.2205,-9.818,3.7735,43.1318,22.6973,308
-5.4907,-9.7341,0.6029,3.0831,-9.7341,1.9246,19.9426,11.5195,309
-0.3136,-9.8654,0.871,1.0185,-9.8654,3.3836,32.1409,21.1086,310
-1.0697,-9.7955,0.3209,0.774,-9.7955,1.0478,21.2094,15.4262,311
-0.9092,-9.8327,1.4677,2.1023,-9.8327,4.8047,22.5976,13.9711,312
-0.4331,-9.8404,0.4005,0.8676,-9.8404,1.7493,8.0932,5.0931,313
-0.8302,-9.8109,0.207,1.0561,-9.8109,0.7775,6.3653,3.7986,314
2.4851,-9.7189,5.1003,2.5947,-9.7189,1.7637,16.8216,8.8674,315
-2.5662,-9.641,0.2643,1.196,-9.641,3.4515,11.9698,7.0826,316
-0.6942,-9.5681,0.4518,1.2223,-9.5681,3.8359,10.5305,7.8688,317
-1.3605,-9.5578,-0.12,0.5607,-9.5578,2.6057,9.5023,4.5824,318
-0.8767,-9.9064,-0.0086,0.4737,-9.9064,2.4945,8.2824,4.7704,319
-1.8432,-9.8588,0.4342,1.3035,-9.8588,0.5635,8.8745,7.0201,320
-1.4746,-9.7094,-0.3827,0.536,-9.7094,1.0059,4.8981,3.4736,321
-2.5569,-10.1232,0.0344,1.3389,-10.1232,2.7645,13.1445,11.0199,322
-0.2415,-10.0395,0.3165,0.6387,-10.0395,1.5684,8.0697,3.1714,323
-1.9485,-9.6684,0.0217,1.1018,-9.6684,2.4012,13.3784,7.3903,324
-0.7639,-9.7196,0.3712,1.0613,-9.7196,3.0847,20.8494,8.0205,325
-0.5531,-9.6607,0.4642,0.8401,-9.6607,1.966,18.8514,4.409,326
-1.396,-9.8314,-0.0999,0.6833,-9.8314,0.5953,14.5634,4.9219,327
-0.5604,-9.8455,0.3547,0.5918,-9.8455,1.9035,8.8219,5.1274,328
-1.4317,-9.7882,0.1273,1.2167,-9.7882,2.6915,9.4841,5.0571,329
-2.3827,-9.5552,0.7224,2.2179,-9.5552,1.713,16.809,13.6354,330
-4.5676,-10.0561,-1.1508,2.0332,-10.0561,0.7684,14.1262,7.3134,331
-0.5164,-9.6552,1.3195,1.5712,-9.6552,2.4745,6.592,5.5888,332
-1.7271,-9.4833,1.5661,1.6099,-9.4833,3.4376,9.9484,6.8162,333
-0.2745,-10.0081,0.386,0.6807,-10.0081,1.8008,8.2203,5.6067,334
-1.8463,-9.8654,1.2741,2.303,-9.8654,4.729,14.2583,11.9293,335
-2.0595,-9.7859,0.0234,1.4562,-9.7859,2.9339,9.8674,7.921,336
-1.7785,-10.3423,-0.3226,0.8043,-10.3423,1.3387,8.6955,4.5056,337
-0.8777,-9.8226,0.3761,0.8807,-9.8226,2.5058,11.6683,5.5481,338
-8.6241,-9.2698,-0.1908,2.3171,-9.2698,2.4045,12.5645,6.2177,339
-2.2202,-9.8021,0.3835,1.4232,-9.8021,3.2426,15.8038,8.0131,340
-2.765,-9.919,0.6566,1.5733,-9.919,1.0052,7.7708,7.1596,341
-1.1372,-9.7385,-0.2886,0.5184,-9.7385,0.7766,7.9264,6.9124,342
-0.4051,-9.485,-0.0358,0.3751,-9.485,1.5547,7.2443,5.2429,343
-0.4586,-9.7937,0.1084,0.3,-9.7937,1.3435,4.446,2.4028,344
-0.2315,-9.5442,-0.0025,0.1413,-9.5442,0.4641,6.0004,3.9329,345
-2.0218,-9.736,-0.0304,0.5767,-9.736,1.3626,5.854,3.8666,346
-1.6997,-10.0007,-0.2001,0.9749,-10.0007,1.5213,7.0049,5.2965,347
-2.0904,-9.869,0.9156,2.0038,-9.869,2.2977,13.1988,8.3776,348
-5.3152,-9.598,0.29,1.773,-9.598,2.498,19.0362,9.6911,349
-5.1746,-9.6666,-0.4655,2.3067,-9.6666,1.8727,12.3201,10.2036,350
0.0956,-9.7877,1.1726,0.7139,-9.7877,0.7891,24.1101,16.2975,351
-0.1875,-8.8665,0.9885,0.8411,-8.8665,1.2678,16.2629,13.4264,352
-0.539,-9.7104,1.1263,1.4855,-9.7104,2.8706,16.5074,15.3626,353
-1.1357,-9.5889,-0.2142,0.4783,-9.5889,1.2564,12.1095,9.9864,354
-0.2806,-9.9273,1.006,0.9116,-9.9273,1.4323,7.8234,5.1358,355
-0.7345,-9.7013,0.9586,1.6642,-9.7013,3.5671,10.7208,7.5807,356
-0.4807,-9.8359,0.824,1.1019,-9.8359,3.3098,9.3502,8.9733,357
-3.2878,-9.8818,1.5915,2.494,-9.8818,2.4549,13.3296,10.5021,358
-3.4117,-9.8569,0.5656,1.9906,-9.8569,1.4149,19.6622,14.116,359
-1.5794,-9.5062,-0.2253,0.8398,-9.5062,1.2631,22.4405,16.0858,360
-0.8115,-10.0148,-0.1122,0.4544,-10.0148,1.0505,12.7646,10.7436,361
-0.2135,-9.7807,0.0637,0.2112,-9.7807,0.9264,7.2371,5.7671,362
-0.0272,-9.675,0.2806,0.3378,-9.675,0.7426,8.0233,5.5535,363
-3.1806,-9.7646,0.0126,1.2927,-9.7646,2.1699,7.3049,4.221,364
-0.1089,-9.8891,-0.0071,0.0823,-9.8891,0.2573,5.0228,4.04,365
-7.7824,-9.757,-0.395,2.3789,-9.757,2.8783,12.3296,6.0551,366
-82.5981,-9.5048,-33.5245,29.4952,-9.5048,5.4782,27.1122,17.0548,367
4.1724,-9.5832,20.1638,8.5502,-9.5832,2.6819,17.9819,14.1111,368
-8.1494,-9.7494,-1.7489,3.6107,-9.7494,2.6692,11.9639,5.7309,369
-16.9258,-9.7374,0.0534,6.6484,-9.7374,4.8843,14.2019,9.8906,370
-6.7002,-9.7357,-2.0842,3.1715,-9.7357,2.6796,6.6591,3.1521,371
-0.7973,-9.8115,1.1223,2.0781,-9.8115,1.253,3.6603,2.4735,372
-1.6215,-9.732,-0.4091,0.7192,-9.732,1.0154,3.9288,2.3915,373
-0.9089,-9.7419,-0.1261,0.2706,-9.7419,0.3212,1.7587,1.2555,374
-0.1546,-9.7368,0.0264,0.1069,-9.7368,0.1438,1.2885,1.1736,375
-0.4181,-9.7488,-0.2894,0.1015,-9.7488,0.1558,1.3611,1.3169,376
-0.2193,-9.7458,-0.1541,0.0419,-9.7458,0.0582,1.2427,1.2231,377
-0.4913,-9.7487,-0.2559,0.1995,-9.7487,0.3024,1.4109,1.3097,378
-0.4928,-9.7464,-0.342,0.0936,-9.7464,0.1293,1.3707,1.2775,379
-0.165,-9.7447,-0.0873,0.0347,-9.7447,0.049,1.2464,1.2254,380
-1.2417,-9.7485,-0.4323,0.3945,-9.7485,0.5613,2.343,1.2808,381
-1.6013,-9.7272,-1.0109,0.4056,-9.7272,0.4851,2.4421,1.7979,382
-0.8562,-9.7294,0.8303,1.0333,-9.7294,0.9372,2.7065,1.5913,383
-3.2515,-9.7716,-1.3873,1.4808,-9.7716,1.8009,3.8729,3.0945,384
-6.8432,-9.7262,1.4074,2.3578,-9.7262,1.9709,4.0873,2.7914,385
0.0792,-9.7537,0.2667,0.1676,-9.7537,0.2696,1.5559,1.3764,386
-0.2654,-9.7497,-0.1432,0.0941,-9.7497,0.1642,1.2806,1.2024,387
-0.3857,-9.7558,-0.296,0.0655,-9.7558,0.0809,1.3923,1.3257,388
-0.5055,-9.7472,-0.3197,0.1193,-9.7472,0.1619,1.4866,1.3344,389
-0.4886,-9.7734,0.509,0.7596,-9.7734,1.0505,3.2743,2.2123,390
-1.3024,-9.747,0.7142,1.2701,-9.747,2.2516,19.0946,13.1829,391
-3.358,-9.6383,3.6494,5.1466,-9.6383,3.6123,34.143,14.4901,392
-7.8796,-9.8168,0.051,2.6267,-9.8168,3.336,31.6436,23.8061,393
-3.5731,-9.9579,1.3833,4.0682,-9.9579,4.5227,38.6986,24.8732,394
-8.3054,-9.8967,1.062,4.5633,-9.8967,2.8281,28.1439,27.6568,395
-3.6066,-10.4409,23.228,20.0027,-10.4409,7.9317,77.2171,67.2564,396
-14.3734,-9.6547,-3.673,12.5812,-9.6547,5.1314,52.7968,49.1246,397
-5.6122,-9.5912,-1.6686,2.5478,-9.5912,1.1045,9.0996,8.1421,398
-8.0009,-9.2227,5.6881,11.407,-9.2227,1.6873,27.0257,14.8857,399
-6.7114,-9.791,-0.6524,3.7962,-9.791,1.1025,12.8924,12.1174,400
-3.8572,-9.856,1.4701,3.5219,-9.856,4.5895,38.393,28.9401,401
-0.0652,-9.6451,0.6952,0.5982,-9.6451,1.5881,12.2307,6.3685,402
-6.4215,-9.877,1.8285,4.7635,-9.877,5.5018,21.5472,11.1178,403
-2.4501,-9.8244,1.5813,2.2754,-9.8244,2.5604,13.6506,9.1513,404
-0.4335,-9.7969,-0.0667,0.4194,-9.7969,1.2565,13.5834,11.0146,405
-0.8507,-9.5553,-0.1245,0.3211,-9.5553,0.8575,7.467,2.9874,406
-0.7186,-9.5231,0.0626,0.4537,-9.5231,0.6434,7.8568,3.9518,407
-0.2633,-9.806,0.0143,0.1799,-9.806,0.4632,10.1212,8.3055,408
-9.8643,-8.1071,6.4933,11.9565,-8.1071,3.6175,44.5891,20.768,409
-2.1154,-9.5737,-0.2413,1.5412,-9.5737,3.5234,60.4605,55.1219,410
-2.6229,-9.8072,0.3808,1.3804,-9.8072,2.8599,27.0118,16.2212,411
-1.6222,-10.0144,0.0199,0.7423,-10.0144,3.6879,20.2903,18.434,412
-1.5905,-9.8022,1.5782,2.6943,-9.8022,2.0358,12.4058,9.4927,413
-0.2723,-9.899,1.623,2.7384,-9.899,3.0994,9.9292,7.0479,414
-0.4859,-9.2048,1.8966,1.4554,-9.2048,1.0174,10.9658,9.0455,416
-0.0605,-9.6038,0.56,0.5444,-9.6038,1.2187,13.6742,10.2754,417
-1.678,-9.6754,0.4596,1.0879,-9.6754,1.6844,8.2289,7.0404,418
-0.8878,-9.7386,-0.1322,0.3189,-9.7386,0.8635,5.7081,3.6694,420
-3.3844,-9.8056,0.7278,2.0218,-9.8056,3.4478,10.0777,7.4188,421
-0.7489,-9.844,-0.3181,0.3005,-9.844,1.5917,8.6037,6.8456,422
-0.8901,-9.8114,2.2162,2.6815,-9.8114,6.3037,12.9732,10.8423,423
-0.2995,-9.7428,0.0193,0.1602,-9.7428,1.1012,6.0198,3.2228,424
-0.7091,-10.012,0.5274,0.7835,-10.012,0.4081,6.3624,5.4816,425
-0.5778,-9.7297,0.1591,0.349,-9.7297,0.6881,10.7906,7.3267,426
-2.1365,-9.9891,-0.2398,0.7579,-9.9891,1.0839,8.8768,6.2407,427
-0.3413,-10.0426,0.0508,0.1776,-10.0426,0.7465,6.7217,3.1789,428
-0.3047,-9.9847,0.4315,0.6874,-9.9847,0.8125,8.097,5.767,429
-1.5306,-9.8377,-0.283,1.1834,-9.8377,1.382,6.9302,4.8811,430
-3.1288,-9.8933,2.5153,4.1909,-9.8933,4.4169,62.6604,28.4815,431
-1.7287,-9.5621,-0.3419,0.6576,-9.5621,0.9717,54.6212,49.3177,432
-0.7781,-9.6835,10.3076,9.2863,-9.6835,3.5426,59.5854,31.4789,433
-31.0522,-9.8991,13.5112,31.8534,-9.8991,9.6814,97.7739,66.9023,434
-17.1047,-9.732,-5.3303,5.2525,-9.732,4.5172,16.5411,7.1496,435
0.8045,-9.7243,1.9215,0.822,-9.7243,0.4924,5.3412,4.9262,436
-29.6709,-9.8194,-2.3146,20.0397,-9.8194,6.8297,11.6218,5.9278,437
-5.5907,-9.7104,0.7788,3.114,-9.7104,2.0766,14.7252,11.0333,438
-38.0011,-9.5562,-20.1697,15.0408,-9.5562,6.4763,22.0639,14.4922,439
5.9894,-9.6575,14.907,7.6125,-9.6575,3.7623,14.0087,8.5378,440
-10.4002,-9.7725,-1.22,2.8122,-9.7725,1.8923,6.3528,2.6073,441
0.1881,-9.7474,1.1073,0.7128,-9.7474,1.4692,10.4228,7.6011,442
-0.4363,-9.7827,0.4852,0.5721,-9.7827,0.9954,11.3114,5.7863,443
-1.3553,-9.7825,0.0455,0.4506,-9.7825,1.0108,9.6994,1.7078,444
0.0276,-9.7779,0.0516,0.0132,-9.7779,0.0742,1.3106,1.2602,445
