AYGX_min,AZ_mean,AYGX_mean,AYGX_std,AZ_mean,GX_std,Gnorm_max,Gnorm_median,timestamp
0.0436,-9.7624,0.1067,0.0391,-9.7624,0.1429,1.0632,0.7288,2
0.0446,-9.7606,0.1064,0.0449,-9.7606,0.1751,1.2283,0.731,3
0.0767,-9.76,0.1055,0.0162,-9.76,0.0756,0.8865,0.7557,4
-0.1185,-9.763,0.1231,0.1305,-9.763,0.6515,2.169,0.9014,5
-70.1496,-9.3573,-13.6453,30.348,-9.3573,8.9987,36.1553,14.9342,6
-36.3778,-9.5906,3.3352,16.5826,-9.5906,8.0526,54.1079,33.2421,7
-64.9999,-9.5899,-6.5621,18.1812,-9.5899,8.1838,16.4212,8.1086,8
-2.45,-9.663,7.5746,5.1664,-9.663,3.7811,12.3399,5.264,9
-8.066,-9.6398,-1.0143,3.867,-9.6398,6.9871,13.5129,5.1589,10
-10.0176,-9.706,-0.2629,4.4838,-9.706,6.2162,12.3669,5.0659,11
-3.1234,-9.7652,-0.4869,1.0339,-9.7652,1.5668,4.6849,1.9876,12
-23.3892,-9.7277,-4.1192,7.1072,-9.7277,5.407,11.5582,5.2758,13
-2.518,-9.7139,-0.7901,1.2685,-9.7139,1.1393,2.2118,1.2615,14
-2.4604,-9.7111,-0.7937,0.756,-9.7111,0.6738,2.156,0.8648,15
-2.7388,-9.7028,-1.1628,0.7519,-9.7028,0.613,2.2376,0.9043,16
-1.2064,-9.7041,-0.3755,0.398,-9.7041,0.3239,1.3835,0.6109,17
-1.0226,-9.7061,-0.6991,0.2333,-9.7061,0.1971,0.9719,0.8171,18
-1.5791,-9.7048,-0.9302,0.3181,-9.7048,0.2538,1.3431,0.8604,19
-3.1114,-9.7026,-0.976,0.8939,-9.7026,0.7056,2.3107,0.8959,20
-1.8548,-9.7003,0.071,1.5011,-9.7003,1.2476,2.4385,1.146,21
-2.1196,-9.7151,-0.217,0.6921,-9.7151,0.7287,2.3051,0.5835,22
-3.2943,-9.7164,-1.0157,1.0679,-9.7164,0.8307,2.6295,0.7164,23
-3.139,-9.7057,-0.9649,1.526,-9.7057,1.1245,2.4557,0.6843,24
-4.6594,-9.7434,-0.4999,2.3721,-9.7434,2.8434,5.192,3.2502,25
-1.4941,-9.7369,-0.8122,0.4839,-9.7369,0.5552,1.7569,1.2798,26
-0.6861,-9.734,-0.3211,0.2216,-9.734,0.2486,0.8798,0.6142,27
-0.5827,-9.7372,0.0619,0.6177,-9.7372,0.6984,2.2098,0.6663,28
-1.4109,-9.7474,0.2327,0.8265,-9.7474,1.074,2.4092,1.3696,29
-1.1905,-9.752,-0.6225,0.2784,-9.752,0.4046,1.6907,1.2292,30
-0.8393,-9.745,-0.333,0.4006,-9.745,1.7696,7.4359,1.0205,31
-25.974,-9.8638,-3.5009,13.1545,-9.8638,14.3603,108.8308,20.5371,32
-65.8755,-9.5854,-3.7991,25.9227,-9.5854,13.2884,107.1813,38.0127,33
-18.1005,-9.6197,3.0577,20.402,-9.6197,8.5025,28.3199,13.1279,34
-26.334,-9.7791,-0.1649,10.7081,-9.7791,5.8049,26.2534,9.227,36
-18.6309,-9.7812,0.8398,6.9859,-9.7812,7.6051,40.543,24.7055,37
-4.9666,-9.7592,2.1724,3.3134,-9.7592,2.0883,29.9366,25.4333,38
-3.7236,-9.8274,0.7167,1.7233,-9.8274,3.5189,16.7509,7.8862,39
-5.2135,-9.8041,0.1336,1.9955,-9.8041,2.5785,10.4486,6.5902,40
-3.4316,-9.6849,0.3242,1.2243,-9.6849,2.0499,18.0452,5.8163,41
-1.378,-9.6577,-0.0659,0.5676,-9.6577,1.2906,7.0542,4.2052,42
-1.8994,-9.7492,0.7448,1.6458,-9.7492,1.7386,9.7295,7.6499,43
-0.3355,-9.9459,1.2263,1.0578,-9.9459,1.5237,16.8795,12.9302,44
-0.7435,-9.2982,0.6027,0.9245,-9.2982,0.6792,9.8765,5.8792,45
-0.0604,-10.1414,5.5376,6.8639,-10.1414,9.6159,63.8349,55.0744,46
-3.6707,-10.2992,-0.6167,1.5849,-10.2992,2.2018,36.4923,34.7642,47
-4.8031,-9.4105,1.1387,4.2699,-9.4105,1.7109,16.6145,13.7001,48
-4.2252,-10.1787,-1.8837,1.9477,-10.1787,2.9107,26.0531,21.1478,51
-2.285,-8.7326,1.3299,4.0563,-8.7326,7.6061,37.7553,23.3703,52
-6.4623,-9.8709,-0.8874,3.9419,-9.8709,1.7803,29.7514,23.8508,53
5.9885,-9.3406,13.7257,4.8636,-9.3406,0.9415,27.993,19.8165,54
4.2404,-9.7396,8.5232,3.6154,-9.7396,3.1711,20.9638,16.3034,55
-2.0308,-9.7202,2.7099,3.6056,-9.7202,3.9146,16.7758,10.8884,56
-0.6198,-9.6316,2.3783,2.9343,-9.6316,1.3151,12.527,8.2532,57
-1.3533,-9.4849,-0.5423,0.5,-9.4849,2.9374,9.2397,7.0783,61
-4.018,-9.0296,0.2112,3.239,-9.0296,0.8401,17.6588,10.9254,62
-9.1619,-9.8351,-1.324,4.5642,-9.8351,1.0304,12.2161,9.9886,63
-1.3841,-9.922,-0.0412,1.2589,-9.922,2.316,8.8996,5.565,64
-2.3024,-9.6845,-0.992,0.8759,-9.6845,1.622,13.255,9.581,65
-0.8499,-10.0643,5.4072,5.942,-10.0643,4.5776,17.4267,13.683,66
-1.9291,-9.7462,-0.4738,1.2685,-9.7462,2.7008,11.073,6.4533,67
-6.0971,-9.7314,4.5798,6.8966,-9.7314,3.0748,16.3427,15.116,68
0.9809,-10.3754,4.4824,3.5657,-10.3754,1.9687,19.7986,18.0842,69
-9.216,-10.0774,3.3825,7.6451,-10.0774,5.8974,26.2694,17.3863,70
-0.8619,-9.2488,0.8637,1.2955,-9.2488,4.609,18.8827,10.8161,71
-0.1844,-9.8685,1.032,1.8058,-9.8685,3.2288,10.9374,8.4054,72
-2.417,-9.7449,-0.4624,1.297,-9.7449,2.2503,9.7968,4.1634,73
-3.08,-9.8958,0.0402,2.0549,-9.8958,2.8525,12.0033,7.3269,74
-3.6387,-9.9555,-0.9008,2.0325,-9.9555,1.0466,8.575,6.774,75
-1.2151,-9.8663,-0.1195,0.7379,-9.8663,1.3644,9.2789,6.6509,76
-8.5454,-9.6751,11.9534,15.0987,-9.6751,8.6098,25.8191,21.6659,77
-2.012,-9.8336,4.2965,6.4444,-9.8336,4.5999,29.8673,22.0045,78
-2.4861,-9.5592,0.418,2.349,-9.5592,1.6426,9.0978,6.5631,79
-3.5654,-9.6296,1.9747,4.8918,-9.6296,4.6325,15.8618,12.881,80
-18.6072,-10.21,0.6572,13.2699,-10.21,9.8546,27.4416,19.8654,81
-4.038,-8.9835,3.7189,5.2237,-8.9835,8.5173,19.2171,16.1379,82
-7.6088,-9.8794,-2.6678,3.1067,-9.8794,1.089,11.482,9.2085,83
-1.0832,-9.9202,0.2361,0.7018,-9.9202,1.5109,11.7808,5.7858,84
-0.6335,-9.809,2.3745,2.1803,-9.809,3.4589,13.5244,10.3045,85
-1.6231,-9.7805,2.3985,2.9406,-9.7805,2.2924,21.1176,11.2611,86
-5.2625,-9.8752,-1.4556,2.6708,-9.8752,1.6434,7.5242,5.3441,87
-7.2338,-9.6884,2.3981,5.2239,-9.6884,6.0805,19.2917,13.8395,88
-0.5714,-9.8049,1.2644,1.2026,-9.8049,0.7914,8.4408,6.4341,89
-2.2886,-9.8066,0.1069,1.7977,-9.8066,4.7706,16.7355,12.4955,90
-1.2387,-9.7014,0.8182,1.4287,-9.7014,3.4715,14.844,9.0145,91
-6.0885,-9.8627,-2.7728,2.4301,-9.8627,1.7859,10.2603,7.5728,92
-6.0985,-9.7874,1.5353,3.7217,-9.7874,1.642,11.8222,7.5431,93
-0.3846,-9.1226,0.9056,1.276,-9.1226,2.096,9.0597,6.0545,94
-5.8635,-9.559,-1.0368,2.6739,-9.559,2.4295,11.3221,7.1311,95
-7.962,-9.6636,2.5836,6.7356,-9.6636,4.9266,23.4265,12.7608,96
-0.4095,-9.8239,1.8916,1.811,-9.8239,4.4192,8.024,6.1705,97
-0.1671,-9.5557,2.3411,2.9985,-9.5557,2.8252,11.5223,6.4571,98
-3.6807,-9.7813,2.6526,4.3804,-9.7813,5.161,22.3403,8.4635,99
-2.2479,-9.5676,-0.5495,0.8875,-9.5676,0.9286,8.7637,4.1723,100
-2.2025,-9.9823,1.5502,2.767,-9.9823,5.5059,13.8332,7.4655,101
-4.5105,-9.8463,0.3562,3.1506,-9.8463,7.6613,22.7357,9.86,102
-0.6462,-9.867,0.2638,0.6663,-9.867,0.5584,9.2165,6.778,103
-0.0776,-9.882,0.372,0.6267,-9.882,1.5058,6.0075,4.5391,104
-2.3089,-9.7598,-0.3297,0.8378,-9.7598,0.931,9.528,8.2722,105
-0.4645,-9.5124,0.6456,0.8277,-9.5124,0.7599,15.2221,11.8309,106
-3.8026,-9.7158,0.3277,2.7224,-9.7158,2.602,15.0751,10.4928,108
-0.6277,-9.8511,0.4819,0.8335,-9.8511,1.9093,7.9655,4.0409,109
-5.5979,-9.7222,1.3008,2.884,-9.7222,4.8835,17.5707,8.0007,110
-5.1834,-9.3056,0.6311,4.5559,-9.3056,2.71,16.5603,14.7788,111
-3.2909,-9.6846,-0.4364,1.3068,-9.6846,3.1147,15.4556,10.3305,112
-3.9603,-9.7341,0.3803,2.7885,-9.7341,3.1479,11.7131,8.3194,113
-4.9936,-9.874,1.1505,2.6027,-9.874,5.0184,14.6604,8.9408,114
-2.177,-9.9955,3.6204,3.2577,-9.9955,1.9133,12.5481,10.6494,115
-0.5582,-9.5663,3.2919,2.9697,-9.5663,6.2353,17.2953,15.168,116
-4.5952,-9.611,-1.9117,1.6034,-9.611,3.6822,12.1189,10.9464,117
-18.8425,-9.8374,-3.7455,6.8546,-9.8374,5.5757,13.5455,7.9095,118
-11.8577,-9.745,-1.3843,6.8918,-9.745,8.0935,19.7392,15.5554,119
-3.2536,-9.5518,-0.9775,2.687,-9.5518,2.0398,10.1074,8.4368,120
-2.2012,-9.912,14.667,9.3724,-9.912,5.7206,25.1656,21.9657,121
-7.0583,-9.7913,-1.7554,3.433,-9.7913,1.7769,18.6136,9.2307,122
-6.9026,-9.8973,-2.7458,4.1098,-9.8973,1.3679,14.525,9.5671,123
-5.4153,-9.7905,-2.5466,2.78,-9.7905,1.1135,7.4288,7.1065,124
-0.3994,-9.9087,1.9411,2.0445,-9.9087,3.7566,26.5065,25.3838,125
2.5007,-9.6944,21.7038,11.2059,-9.6944,1.2067,28.1923,21.9013,126
-2.8434,-9.8644,0.2099,1.4073,-9.8644,1.5923,20.4978,17.2375,127
-6.2296,-9.0363,4.7148,7.0051,-9.0363,1.8056,14.2201,11.6996,128
-0.2529,-9.3926,0.9031,1.0885,-9.3926,1.8137,7.3139,6.5389,129
-1.4946,-9.7523,-0.388,0.663,-9.7523,1.9917,7.3294,4.9718,130
-8.9656,-9.6683,-0.296,8.0578,-9.6683,2.5474,25.025,23.7357,131
-3.8758,-10.4615,-0.3085,2.6323,-10.4615,5.7119,28.6736,25.3167,132
-1.6387,-9.6826,2.8429,3.0091,-9.6826,5.9737,19.2467,16.4446,133
-4.0563,-9.2994,1.0536,3.4032,-9.2994,1.2868,12.4773,10.3906,134
-0.49,-9.8486,0.479,0.6549,-9.8486,1.201,11.5562,3.8104,135
-2.7098,-9.1079,0.1045,1.9656,-9.1079,2.225,16.7814,6.7944,136
-6.7185,-9.8335,-0.5123,3.9347,-9.8335,2.3742,11.72,7.4218,137
-0.9075,-9.4678,2.2383,2.8163,-9.4678,2.8021,14.256,10.2977,138
-5.2854,-9.7566,0.7723,3.5021,-9.7566,2.6814,13.6014,10.9372,139
-0.8839,-9.4558,0.6113,1.2149,-9.4558,3.7091,7.1447,6.78,140
-3.8575,-9.4926,-0.4339,2.1105,-9.4926,1.8557,7.9863,5.8028,141
-1.3987,-9.7291,-0.6313,0.7433,-9.7291,1.169,6.2087,5.1028,142
-2.7424,-9.3037,-0.1837,1.4861,-9.3037,0.9323,8.0279,6.3927,143
-0.9422,-9.8898,-0.1506,0.5362,-9.8898,1.6573,9.196,7.6609,144
-0.4559,-9.6271,1.2372,1.389,-9.6271,1.9817,8.6377,5.3469,145
-2.6249,-9.8387,-0.3852,1.0078,-9.8387,1.7982,11.6082,8.4357,146
-0.3884,-9.5422,0.6178,1.1318,-9.5422,3.8399,8.2553,5.9608,147
-14.3616,-10.1884,41.1032,38.3677,-10.1884,15.2379,48.7328,32.246,148
-30.1633,-10.1615,-12.5759,13.1627,-10.1615,6.0777,37.684,34.0116,149
-10.092,-9.7083,17.211,19.9997,-9.7083,9.7897,54.1515,50.7709,150
9.8317,-9.1846,31.3745,22.5972,-9.1846,5.8058,44.0428,42.0455,151
-16.5696,-9.7069,24.821,31.5785,-9.7069,11.6457,45.951,38.8023,152
-0.733,-10.1072,1.5884,2.0181,-10.1072,3.8329,23.7972,21.6151,153
4.1688,-10.3623,42.0422,31.6844,-10.3623,12.1906,45.859,43.9025,154
-8.3892,-10.2146,2.1526,7.861,-10.2146,9.7592,32.1317,28.2835,155
-1.9423,-9.8448,4.9442,5.4203,-9.8448,5.7606,25.742,16.7189,156
-3.763,-10.1802,-0.6375,1.8057,-10.1802,1.3697,10.5598,7.8655,157
-0.2332,-9.8201,0.2657,0.4332,-9.8201,2.1192,11.705,10.2817,158
-0.7786,-9.9336,0.3793,0.7913,-9.9336,4.2704,9.3287,7.4234,159
-0.9942,-9.0358,0.2445,0.843,-9.0358,1.2861,10.6337,6.4748,160
0.6729,-9.8728,4.8134,2.9285,-9.8728,1.5848,12.8997,8.6673,161
-0.7978,-10.1133,-0.0423,0.5974,-10.1133,1.0625,8.9195,3.7186,162
-0.8867,-9.8736,0.8745,2.0583,-9.8736,2.214,11.4877,3.0862,163
0.2114,-9.7584,1.1953,0.7866,-9.7584,0.4605,7.0991,5.3604,164
-0.1832,-9.6796,0.6469,0.9196,-9.6796,1.4994,22.8175,10.4379,165
-1.1052,-9.9025,-0.0018,0.656,-9.9025,1.7197,17.586,15.0112,166
-1.7079,-9.7734,1.5228,2.1991,-9.7734,1.8245,11.6125,5.982,167
-1.1572,-9.5908,0.4257,1.2615,-9.5908,3.6336,8.2618,6.1194,168
-2.8312,-9.7671,0.3439,1.704,-9.7671,4.543,9.7433,8.6343,169
-2.2322,-9.7321,0.2461,1.7375,-9.7321,2.7155,10.4368,5.0115,170
-0.5499,-10.0391,-0.0192,0.436,-10.0391,2.8932,11.6222,5.5366,171
-2.6816,-10.4849,14.6898,14.9225,-10.4849,10.6869,34.7606,30.8962,172
1.8095,-10.0924,4.6923,2.8148,-10.0924,2.594,38.3415,31.7504,173
15.8966,-10.0489,40.2745,15.788,-10.0489,6.4792,38.8194,37.5563,174
-0.2967,-10.1802,5.47,3.7053,-10.1802,3.8655,19.0461,12.7105,175
-2.1783,-10.0708,-0.039,1.1903,-10.0708,1.562,6.7561,3.8385,176
-1.8509,-9.4597,-0.5781,0.9512,-9.4597,1.2796,10.7235,5.38,177
-1.581,-9.8627,0.3789,1.7993,-9.8627,6.983,21.601,9.2424,180
-4.6652,-10.1747,2.2422,4.3267,-10.1747,2.2127,16.9282,13.9598,181
-2.913,-10.1151,0.3788,2.1851,-10.1151,1.3424,10.965,10.3115,182
-4.6562,-9.829,1.4353,3.8025,-9.829,0.8383,17.6784,14.3079,183
-15.9478,-9.7828,-2.3588,5.7019,-9.7828,2.5882,20.4941,12.5881,184
-9.1584,-9.7141,2.0714,5.3294,-9.7141,4.1522,18.0968,12.0613,185
-3.2184,-9.9828,2.925,5.1335,-9.9828,1.6109,14.5614,10.8479,186
-1.9917,-9.807,1.5052,2.5309,-9.807,1.4782,14.6561,9.0842,187
1.635,-10.0446,4.8541,2.9175,-10.0446,0.9499,15.1926,11.4397,188
-2.6725,-9.5419,-0.0671,1.9452,-9.5419,1.8258,9.9001,4.8746,189
-3.7581,-10.1379,0.585,3.083,-10.1379,1.2565,8.3795,7.6252,190
-0.9863,-9.9855,0.227,0.9824,-9.9855,2.5921,11.0305,5.403,191
-0.7311,-9.824,1.0733,2.3056,-9.824,2.2339,11.0894,7.0775,192
-0.8805,-9.4569,8.1446,5.9943,-9.4569,0.9986,18.5687,16.1772,193
-11.1069,-9.7982,2.7558,6.7115,-9.7982,1.6864,17.2015,13.0217,194
-6.1101,-9.8025,-0.6688,3.2257,-9.8025,4.5042,16.9961,15.018,195
-0.1625,-9.8344,1.8309,1.8273,-9.8344,1.9183,7.6266,6.0219,196
-13.7797,-9.8043,-1.412,5.638,-9.8043,6.7558,23.8019,8.4924,197
-0.4671,-9.6319,0.8261,1.4387,-9.6319,2.7142,7.5304,5.9295,198
-2.0249,-9.5252,0.477,2.1656,-9.5252,3.0327,8.0351,5.9623,199
-1.7253,-9.9948,-0.2081,0.7436,-9.9948,1.2842,8.1763,5.0987,200
-1.9615,-9.6884,0.7687,1.9854,-9.6884,1.7581,7.9913,5.517,201
-7.652,-9.3816,-1.1428,4.4556,-9.3816,1.4966,13.4602,7.6624,202
-5.8638,-9.6149,1.447,3.7476,-9.6149,1.7158,11.1277,9.6555,203
-1.6251,-9.8349,0.0759,1.0389,-9.8349,0.9076,8.3798,4.7749,204
-10.1159,-9.2178,-1.6681,8.2075,-9.2178,5.5387,23.4645,20.0822,205
-1.4889,-10.3703,-0.1467,1.0441,-10.3703,1.805,9.9994,7.4935,206
-2.2287,-9.6727,-0.1238,1.6596,-9.6727,2.5938,9.0191,5.1277,207
-4.8897,-9.8361,-0.4721,2.5726,-9.8361,4.1827,11.2761,6.7331,208
-1.1303,-9.4741,0.5649,1.191,-9.4741,1.705,9.1393,4.1816,209
-0.3603,-9.7456,1.2859,1.6866,-9.7456,1.35,9.1208,5.8918,210
-5.5864,-9.3978,-0.3292,2.944,-9.3978,2.87,9.5326,5.7296,211
-4.0435,-9.4322,-1.5807,1.8895,-9.4322,1.0179,12.4103,5.5096,212
-2.701,-9.8911,-0.0355,0.9636,-9.8911,2.1268,6.1501,3.7223,213
-2.731,-9.8993,-0.4746,1.353,-9.8993,1.9542,10.5802,8.4009,214
-1.2561,-9.9037,0.3124,0.8028,-9.9037,0.97,9.1441,5.7981,215
-5.7827,-9.8728,-0.2029,2.3706,-9.8728,3.8978,10.9206,7.6257,216
-4.316,-9.4461,4.6387,8.3399,-9.4461,2.1766,15.7511,14.6292,217
-3.4195,-8.6617,1.2213,2.6094,-8.6617,3.3851,11.678,6.0878,218
-6.2554,-9.7335,-0.4871,2.8143,-9.7335,1.264,16.7423,9.083,219
0.1564,-9.7966,1.9516,1.5543,-9.7966,4.4337,14.6409,10.8289,220
-4.5209,-9.1922,1.9556,5.8633,-9.1922,5.9682,14.7139,12.6406,221
-7.7212,-9.4167,-1.7178,4.6282,-9.4167,5.0371,16.7162,12.4055,222
-6.3499,-8.9402,0.6111,4.6659,-8.9402,1.17,7.8994,6.3847,223
-2.7152,-9.6796,0.1817,1.62,-9.6796,2.0394,12.8554,5.2212,224
-2.1449,-10.042,-0.4,1.1331,-10.042,1.9341,9.904,4.6343,225
-4.7382,-9.4863,0.2983,2.6919,-9.4863,2.5179,9.9017,6.254,226
-5.3167,-8.9285,2.6454,6.0366,-8.9285,4.9681,15.3625,12.5167,227
-3.2309,-9.8342,-1.0754,1.2741,-9.8342,1.1274,14.6106,9.2638,228
-4.7954,-9.6376,2.1416,5.3953,-9.6376,3.6515,21.497,19.3296,229
-2.6579,-9.7144,2.0229,3.8656,-9.7144,4.4764,21.8064,17.2177,231
-5.4468,-9.3485,0.5867,2.3817,-9.3485,5.6991,18.3737,7.6223,232
-2.2786,-10.164,0.2737,2.1786,-10.164,2.3434,12.0196,10.6271,233
-3.9887,-9.5275,0.2755,1.8773,-9.5275,3.1544,9.6221,7.7099,234
-0.9462,-9.5967,1.2823,1.2439,-9.5967,1.6228,8.8634,7.9954,235
-0.8624,-10.1851,-0.0261,0.7071,-10.1851,1.7469,7.9062,4.9888,236
-1.7156,-10.0577,1.8468,2.1247,-10.0577,7.1252,16.434,8.9984,237
-3.5956,-9.783,1.1087,2.2017,-9.783,2.8225,6.4177,4.831,238
-5.8863,-10.1297,3.5914,6.7396,-10.1297,2.1795,15.4371,11.2684,239
-4.4562,-10.4315,4.0241,7.7079,-10.4315,6.7699,18.8187,13.7341,240
-16.9387,-10.0165,2.6899,11.2226,-10.0165,1.8976,11.9721,10.7044,241
-4.5034,-9.7638,1.6296,4.5476,-9.7638,1.5481,10.888,7.0679,242
-10.7983,-9.4093,2.067,7.1419,-9.4093,1.1775,16.9337,15.3332,243
-10.4168,-9.9485,-0.7765,6.5866,-9.9485,3.4902,11.6484,10.1348,244
-10.8964,-10.3438,3.2056,7.0874,-10.3438,1.4268,20.9629,18.8207,245
-19.1254,-9.7947,4.03,12.9896,-9.7947,6.3265,25.7194,17.2493,246
-5.6899,-9.9465,1.5973,7.4655,-9.9465,3.9607,17.6689,13.6111,247
-3.4104,-9.7669,10.8436,9.1348,-9.7669,4.7248,21.9957,15.3477,248
-2.3409,-9.9071,-0.2195,1.53,-9.9071,2.525,15.2964,9.6008,249
-0.3021,-10.5241,2.3058,3.3349,-10.5241,1.7295,16.7577,8.7294,250
-2.1493,-9.6949,-0.3984,1.1639,-9.6949,2.3847,8.8986,4.1255,251
-0.0454,-9.5032,1.4217,1.341,-9.5032,4.5857,11.8243,7.1763,252
-1.8874,-9.8084,0.1703,1.2115,-9.8084,1.897,7.321,6.0054,253
-7.2401,-9.6877,1.2834,6.2935,-9.6877,9.6309,20.4542,12.0694,254
-5.5413,-10.3563,-0.177,4.2957,-10.3563,5.9945,19.6832,13.1238,255
-1.5414,-9.6563,-0.233,1.303,-9.6563,1.5957,9.6957,7.0771,256
-7.518,-9.7448,2.0492,5.8796,-9.7448,5.8149,22.6095,11.7653,257
-10.2575,-9.4934,1.0906,7.6491,-9.4934,1.9831,14.0725,10.9465,258
-10.027,-9.517,-1.8206,6.3606,-9.517,3.9367,12.5767,11.3047,259
-6.3268,-10.2263,1.9564,4.8342,-10.2263,3.3561,11.8694,7.7587,260
-25.3954,-9.4016,0.9363,15.6504,-9.4016,2.0652,14.7844,12.0409,261
-2.1935,-9.1606,0.3414,1.5367,-9.1606,2.3088,12.9948,9.5072,262
-9.6604,-9.6978,0.966,4.3676,-9.6978,8.9371,14.4651,13.0563,264
-6.347,-9.7674,1.5922,3.7974,-9.7674,5.606,19.5049,9.2866,266
-23.3733,-9.642,0.4634,9.6437,-9.642,8.3549,22.2769,15.9138,267
-12.8704,-10.3736,-3.1455,5.0592,-10.3736,3.5956,22.4042,20.6227,268
-6.1553,-9.9328,0.5952,2.5583,-9.9328,2.9119,12.867,8.5559,270
-8.431,-9.8137,-0.085,2.5057,-9.8137,2.3928,15.5348,8.2191,271
-1.9495,-9.7974,1.3401,2.331,-9.7974,1.1614,21.2929,14.4749,272
-4.4902,-10.0646,0.077,2.4552,-10.0646,2.4843,24.9442,14.5389,274
-2.6294,-9.1782,-0.573,1.204,-9.1782,1.5575,19.0866,14.8734,275
-1.2173,-9.5948,0.1518,1.4446,-9.5948,0.6615,17.5923,13.3312,276
-2.1661,-9.5042,1.2776,3.3089,-9.5042,1.9663,15.7901,11.4665,277
-0.2679,-9.7557,-0.0608,0.1589,-9.7557,1.0151,6.221,3.2502,278
-1.1776,-9.7962,0.0709,0.842,-9.7962,1.3317,5.5393,5.0436,279
-0.6403,-9.7595,0.8009,1.5045,-9.7595,2.0333,14.228,8.7367,280
-2.2115,-9.866,0.4021,2.119,-9.866,2.5722,9.1724,7.5027,281
-4.4589,-9.9629,-1.7963,2.083,-9.9629,2.8767,24.6977,21.1499,282
-6.2581,-9.9804,-1.749,2.391,-9.9804,1.9611,7.6827,5.4172,283
-2.8128,-9.8767,-0.2684,1.0839,-9.8767,3.7449,10.9945,9.4422,284
-21.4925,-10.0593,-2.1233,14.5745,-10.0593,11.6453,36.2504,28.5199,285
-4.0392,-9.6864,0.595,3.0699,-9.6864,0.8687,12.226,8.4435,286
-0.5824,-9.893,0.9425,1.806,-9.893,3.8197,16.6213,13.1266,287
-13.0883,-9.5412,3.3515,10.0003,-9.5412,3.3385,22.5542,14.2881,288
-5.499,-10.1495,0.875,4.0642,-10.1495,2.7094,11.3112,8.4567,289
-3.2915,-10.0333,-0.5363,2.0911,-10.0333,1.5397,8.087,6.3879,290
-1.0626,-9.915,-0.173,0.493,-9.915,0.788,4.6588,2.3527,291
-2.0496,-9.9276,-0.0155,1.3088,-9.9276,2.4635,13.8367,9.1486,292
-0.2075,-9.8194,8.103,5.0231,-9.8194,6.8543,14.7913,9.51,293
0.9309,-9.7043,3.5208,1.9739,-9.7043,1.0102,12.1197,9.9513,294
-2.6358,-9.8982,0.1839,1.1744,-9.8982,2.5153,8.9499,4.9156,295
-4.2502,-9.3044,-0.5169,2.1863,-9.3044,1.3206,8.0451,5.6943,296
-1.3214,-9.218,0.3905,1.3032,-9.218,1.4646,9.5071,4.4796,297
-0.1227,-10.5373,2.2792,1.8128,-10.5373,1.5393,10.8699,8.207,298
0.2193,-9.4763,7.3076,7.3596,-9.4763,4.4716,17.0265,14.0574,299
-3.696,-9.4834,0.0449,1.8327,-9.4834,2.1628,13.4072,12.0481,300
-3.9332,-9.1717,1.9284,5.2854,-9.1717,4.9404,19.9644,10.2983,301
-9.6594,-9.4506,3.3532,7.4107,-9.4506,1.7233,10.6337,10.1284,302
-4.3182,-9.3949,-0.1273,2.3126,-9.3949,2.6522,7.68,4.5275,303
-0.2663,-10.298,1.3571,2.1372,-10.298,1.8637,12.0063,6.0116,305
-3.8516,-10.1015,-0.1536,1.9115,-10.1015,3.3798,10.019,6.9008,306
-6.0666,-9.79,0.1165,2.9056,-9.79,2.1352,9.9802,8.0932,307
-6.2059,-9.8647,0.5567,3.6393,-9.8647,4.2877,16.9816,9.1512,308
-1.529,-10.0081,1.5602,2.7181,-10.0081,3.7438,15.5631,9.8186,309
-12.4142,-9.9392,1.0845,4.5578,-9.9392,7.2484,16.5534,10.4456,311
-5.3847,-9.7575,1.7333,3.7452,-9.7575,7.3084,15.8103,12.0179,312
-2.9711,-8.9976,0.6064,2.5991,-8.9976,1.2937,18.0294,5.5982,313
-2.1664,-9.779,2.3578,3.7327,-9.779,2.1373,10.5722,9.1224,314
-0.3934,-9.9633,0.0491,0.3676,-9.9633,0.8218,9.4501,5.1535,315
-6.1151,-9.657,0.8426,3.2133,-9.657,2.1225,12.9656,8.9172,316
-0.4819,-10.2009,0.2157,0.5796,-10.2009,1.5155,9.9774,8.7567,317
-4.7762,-9.3883,4.5989,5.4529,-9.3883,1.9683,15.3155,12.6309,318
-2.27,-9.1938,0.4626,1.8294,-9.1938,2.795,11.4288,10.2354,319
-5.1229,-9.8466,-0.6179,2.1427,-9.8466,1.8271,17.1238,6.8056,320
-1.2699,-9.2592,0.211,0.9869,-9.2592,1.2619,10.8893,9.4362,321
-5.5297,-9.4818,0.782,3.4737,-9.4818,1.6143,9.1133,7.2289,322
-4.5125,-9.1124,0.6057,3.5855,-9.1124,4.2516,16.0763,8.6844,323
-1.4335,-9.7391,7.3573,6.8899,-9.7391,7.4485,19.6387,16.4263,324
-2.2092,-9.9306,-0.4571,0.8515,-9.9306,1.7265,9.4487,6.4174,325
-1.3303,-9.8728,0.0918,0.936,-9.8728,2.3584,8.5281,5.4005,326
-1.1892,-10.0999,0.0142,1.093,-10.0999,2.0249,8.0546,7.0414,327
-6.5184,-9.8502,1.3106,5.4496,-9.8502,7.0327,21.398,8.3905,328
-1.7985,-9.7972,-0.3278,1.1699,-9.7972,1.6983,15.601,12.9265,329
-2.9548,-8.8817,-0.1241,1.6095,-8.8817,0.5024,8.2882,5.8139,330
-3.3479,-9.4681,0.2686,1.9536,-9.4681,3.2081,9.7276,5.8332,331
-0.7897,-9.8758,-0.1983,0.3407,-9.8758,1.1645,11.5324,8.1336,332
-1.1202,-9.7384,-0.0194,0.6178,-9.7384,1.593,11.3284,3.868,333
-10.7296,-9.6011,-0.2492,3.6578,-9.6011,5.0648,16.4008,7.4861,334
-1.2734,-9.8869,0.5283,1.6742,-9.8869,2.5874,9.7525,5.1901,335
-9.4454,-9.7734,-0.8019,4.3961,-9.7734,5.0273,14.4988,11.9364,336
-4.2114,-10.2602,0.2185,2.4905,-10.2602,2.8606,19.3843,6.6814,337
-1.0834,-9.3967,1.3135,2.3983,-9.3967,2.4148,8.2345,6.1206,338
-1.2499,-10.0607,-0.2306,0.57,-10.0607,1.1837,9.1943,4.289,339
-1.5597,-9.8072,7.7801,12.5171,-9.8072,3.5264,17.6006,15.2259,340
-0.8227,-9.2722,0.3692,0.7304,-9.2722,1.4657,9.5359,6.0395,341
-1.062,-10.5065,0.3744,0.9293,-10.5065,2.9999,9.5848,6.5212,342
-2.5783,-10.2342,0.5273,2.3276,-10.2342,0.9063,7.0312,5.5924,343
-1.8256,-9.4001,0.6215,1.815,-9.4001,2.0166,14.6252,7.8666,344
-7.3732,-9.4325,-0.3058,2.7567,-9.4325,3.9712,18.4372,9.969,345
-2.1221,-9.3739,-0.2473,1.019,-9.3739,1.6068,8.9442,5.8693,346
-2.979,-9.8877,1.6731,3.6971,-9.8877,5.7342,14.6647,10.2558,347
-1.5741,-9.7655,0.0186,1.6782,-9.7655,2.1618,9.2628,6.6915,348
-6.4994,-8.5943,-0.1998,3.4183,-8.5943,1.8747,11.833,5.474,349
-3.8344,-10.1237,-1.0594,2.0436,-10.1237,3.8557,11.2579,7.1981,350
-2.1522,-9.8565,1.3787,2.7551,-9.8565,5.1433,13.4721,9.9562,351
-9.7462,-9.3305,1.9269,7.4568,-9.3305,5.0145,22.402,12.6458,352
-5.3203,-9.5598,-0.7776,2.5783,-9.5598,1.9252,8.2407,6.2822,353
-4.2997,-9.9704,-0.5281,1.6141,-9.9704,2.9192,6.9269,5.7737,354
-3.6334,-9.0974,1.3643,3.2601,-9.0974,3.9948,14.9969,10.9318,355
-2.4727,-9.5319,0.6246,3.9292,-9.5319,2.5025,9.7756,8.2892,356
-5.2769,-9.7718,0.0497,4.1028,-9.7718,5.6976,10.9948,6.8197,357
-0.0056,-10.0064,1.6496,1.8088,-10.0064,3.3331,8.9377,5.6417,358
-1.7264,-10.2187,11.0771,13.2716,-10.2187,11.5927,32.4688,29.8498,359
-3.5336,-9.7593,2.7723,5.1307,-9.7593,3.7315,18.7717,10.5309,360
-3.3787,-9.6195,0.9361,3.6408,-9.6195,5.4322,13.6862,7.9625,361
-1.9297,-9.879,0.3673,1.8316,-9.879,1.8803,13.0642,7.7759,362
-2.629,-9.3818,-1.1115,0.9984,-9.3818,1.137,6.3678,5.3646,363
-0.6947,-9.9095,-0.1992,0.4077,-9.9095,1.2527,6.1866,4.0249,364
-1.3967,-9.9095,1.4325,1.6095,-9.9095,4.9467,9.3724,7.2053,365
-1.125,-10.2454,1.5489,2.0749,-10.2454,2.1342,8.5478,5.3991,366
-4.8079,-9.7816,1.6313,5.3917,-9.7816,2.6462,16.5826,10.1458,367
-1.2477,-9.4783,-0.4263,0.5621,-9.4783,1.647,9.9305,6.4405,368
-0.1669,-9.3219,4.5844,4.8523,-9.3219,6.1558,20.841,12.4693,369
-2.2802,-10.267,-0.0328,1.285,-10.267,2.1406,7.1502,3.9797,370
-5.4807,-9.6693,-0.903,2.8972,-9.6693,2.9403,15.6724,9.9531,371
-19.4571,-9.4219,-0.6555,5.0989,-9.4219,3.3896,16.293,11.7402,372
-2.1567,-9.6724,-0.4374,1.0706,-9.6724,1.1565,10.5827,8.0697,373
-15.3713,-10.1256,0.3898,8.3517,-10.1256,3.0378,16.6076,10.0156,374
-2.3144,-9.2338,0.5726,1.386,-9.2338,1.3789,11.4865,6.487,375
-3.2122,-10.0848,-0.2833,2.5698,-10.0848,4.9656,10.6787,5.3494,376
-8.342,-9.6683,-0.5783,2.9611,-9.6683,5.5329,15.1284,7.9229,377
-7.2763,-9.5462,0.679,4.8643,-9.5462,3.6779,11.6131,8.0365,378
-7.463,-9.5451,5.5237,10.1209,-9.5451,1.6382,26.1095,17.7886,379
-6.6833,-9.6604,0.142,4.3721,-9.6604,5.8308,21.3694,18.0451,380
-1.8066,-9.8917,0.777,1.3772,-9.8917,2.9797,8.0346,6.0917,381
-2.3113,-9.7845,4.2619,3.625,-9.7845,1.3008,17.6701,9.2209,382
-0.9609,-9.5339,-0.1353,0.5987,-9.5339,2.2947,7.1653,6.3843,383
-4.0113,-9.4154,-0.5786,2.535,-9.4154,2.2551,10.7958,4.8846,384
-0.3847,-9.5355,1.2021,1.3444,-9.5355,1.1778,12.0596,5.1316,385
-0.0094,-9.4783,0.3428,0.5066,-9.4783,1.3347,4.9906,2.1411,386
-4.4025,-9.7351,-0.1161,2.7262,-9.7351,1.265,10.7341,8.6454,387
-0.95,-9.7809,0.1338,0.926,-9.7809,0.659,7.4171,5.1043,388
-5.1499,-9.8899,1.7695,4.5951,-9.8899,7.6935,16.05,10.9389,390
-2.9864,-10.1401,-0.3099,1.9479,-10.1401,3.6027,12.0009,8.3018,391
-4.201,-9.8227,-0.9364,2.0939,-9.8227,3.3878,9.117,8.4851,392
-1.9754,-9.779,1.674,2.8072,-9.779,5.245,11.2714,8.5243,393
-3.0975,-10.355,-0.7476,1.7493,-10.355,1.9577,10.1249,7.3929,394
-0.9588,-9.6899,0.4014,1.0575,-9.6899,2.3492,10.375,5.1803,395
-0.4953,-10.1979,2.9497,3.4654,-10.1979,3.4722,12.1282,8.0285,396
-1.1954,-9.7939,0.2764,0.7371,-9.7939,1.024,7.4052,4.1108,397
-0.4481,-9.7812,0.0288,0.1917,-9.7812,0.8624,4.7283,3.2549,398
-1.0363,-9.7808,0.3068,1.086,-9.7808,2.8467,9.1794,3.8452,399
-9.1338,-9.7405,-0.0591,3.9666,-9.7405,6.168,19.1627,11.4152,400
-13.4063,-9.778,5.5561,12.5362,-9.778,14.6751,47.0012,23.8868,401
-22.7256,-9.7964,8.7467,22.4535,-9.7964,15.9336,41.546,30.7166,402
-52.9093,-9.7399,1.42,23.0419,-9.7399,15.1997,36.8635,17.0497,403
-9.0471,-9.8457,1.9635,9.1714,-9.8457,6.0589,23.2502,13.2273,404
-13.9703,-9.4443,-5.9597,8.3564,-9.4443,2.8131,20.9947,18.2686,405
-3.1057,-9.7795,0.3845,1.6901,-9.7795,2.8179,12.2454,5.4323,406
-5.3826,-9.8098,3.8682,5.5832,-9.8098,9.6292,20.5186,13.3566,407
-8.7567,-9.9749,3.8086,7.9693,-9.9749,3.3687,25.5216,16.9613,408
-4.3098,-9.6325,-0.0367,2.1455,-9.6325,3.3515,12.3882,7.5163,409
-2.594,-9.7524,0.4043,1.7213,-9.7524,3.6451,12.71,7.6824,410
-7.6527,-9.7004,-0.0968,2.6533,-9.7004,5.3264,17.3094,8.3213,411
-22.0633,-8.1639,0.5237,11.9492,-8.1639,6.6169,34.145,11.1466,412
-5.4771,-9.8332,2.5472,4.8208,-9.8332,6.0776,14.1819,9.8302,413
-2.9365,-9.6962,0.951,2.7126,-9.6962,3.3706,19.6489,9.576,414
-0.3861,-9.6916,-0.0404,0.3199,-9.6916,1.289,3.9541,3.0517,415
-0.7246,-10.147,0.8886,1.469,-10.147,0.9095,11.0575,7.4275,416
-1.6722,-9.6263,0.7508,1.3411,-9.6263,2.7405,7.6885,6.0697,417
-1.588,-10.0874,0.1965,0.9365,-10.0874,2.2743,12.717,7.1895,418
-0.7849,-9.6417,0.2515,0.6621,-9.6417,0.8943,8.6546,5.2299,419
-15.4088,-9.7485,-0.9307,9.9063,-9.7485,5.0408,16.5523,11.3437,420
-17.2153,-9.8171,-2.4081,9.8327,-9.8171,11.2409,20.559,13.4555,421
-4.8054,-9.8733,1.104,5.7048,-9.8733,3.8665,18.8814,14.1806,422
-1.5283,-9.6161,-0.1269,0.8696,-9.6161,0.483,14.9871,5.1913,423
-14.9872,-8.6144,-2.0012,5.9186,-8.6144,3.7784,17.8522,5.2872,424
-9.0269,-9.7489,-2.0196,3.3759,-9.7489,3.1463,25.6614,22.152,425
-28.5984,-9.0272,1.5691,11.9338,-9.0272,5.2428,27.9399,15.1517,426
-17.2997,-9.5667,4.2747,12.294,-9.5667,9.0246,29.5492,14.3222,429
-6.7592,-9.7122,-0.8218,2.3349,-9.7122,2.0122,10.6835,6.1302,430
-4.7527,-9.6834,5.4959,6.0761,-9.6834,1.1395,19.3837,13.1562,431
-4.319,-10.0841,-1.3147,1.7913,-10.0841,1.2601,9.0532,5.9418,432
-1.7101,-9.9982,0.607,2.2943,-9.9982,1.5337,7.5374,5.2881,433
-2.7217,-9.9458,1.3823,4.0677,-9.9458,6.3993,12.7868,7.7397,434
-5.7665,-9.762,-2.4822,2.863,-9.762,2.224,11.7265,8.135,435
-7.7193,-9.7291,2.0744,7.5158,-9.7291,3.6801,23.7483,12.4644,436
-1.1933,-10.3377,1.3099,1.7114,-10.3377,1.1104,10.306,7.0892,437
-18.1669,-9.294,-0.8479,6.2318,-9.294,5.2386,23.8637,8.8383,439
-8.5163,-9.4798,3.0026,8.7564,-9.4798,5.4938,18.153,12.8457,440
-6.6962,-9.8946,2.3039,5.3872,-9.8946,6.2963,16.1904,11.5308,441
-14.589,-10.0243,5.0548,13.1683,-10.0243,4.984,23.9512,19.6698,442
-0.8726,-9.7176,0.4256,1.242,-9.7176,1.4984,8.4963,4.8218,443
-0.3818,-9.7729,2.2023,1.8909,-9.7729,2.7751,12.9681,9.5889,444
-8.1864,-9.1957,23.0068,23.268,-9.1957,5.517,25.5334,21.0097,445
-0.1703,-9.0348,8.6776,12.9551,-9.0348,8.7686,23.5832,16.5455,446
-6.0882,-9.8561,0.5207,3.7083,-9.8561,5.1045,16.5027,10.8728,447
-2.0661,-9.7224,-0.2967,0.981,-9.7224,2.772,11.2091,5.4598,449
-7.0913,-9.5748,0.6373,2.9951,-9.5748,3.9409,17.5643,6.1285,450
-1.8887,-10.2244,2.4196,3.1277,-10.2244,4.5692,18.4391,11.4525,451
-3.8527,-10.1709,1.5236,6.5734,-10.1709,5.1884,20.5483,11.6833,452
-3.2074,-9.711,-0.3999,2.1715,-9.711,3.8183,14.5636,11.0547,453
-1.9966,-9.7021,0.4064,1.4358,-9.7021,1.927,12.1917,4.6806,454
-6.2029,-9.581,2.4614,6.028,-9.581,2.9968,14.7064,10.3008,455
-9.1614,-9.6975,-0.166,5.6831,-9.6975,2.9861,24.8747,10.5506,456
-2.0089,-9.7983,1.2151,2.3362,-9.7983,4.5272,10.956,6.3262,457
-0.8234,-9.7677,0.3044,0.6276,-9.7677,2.6118,7.5703,5.0156,459
-1.4792,-9.5307,0.2011,0.8057,-9.5307,2.0022,10.5114,9.5583,460
-2.5805,-9.9091,-0.1623,1.812,-9.9091,1.5354,17.517,13.4748,461
-0.3354,-9.7004,0.2626,0.3601,-9.7004,1.3774,5.4108,3.747,462
-3.8075,-9.8146,-0.1502,1.6668,-9.8146,2.9612,15.3691,12.7325,463
-2.5999,-9.9798,1.8022,2.9879,-9.9798,1.6819,12.1383,7.4287,464
1.7538,-9.6265,4.5658,2.3907,-9.6265,0.4551,15.8447,9.1388,465
-3.6589,-9.9672,-0.2454,2.1909,-9.9672,3.4824,19.3515,11.6099,466
-2.0758,-9.7064,1.5161,2.9186,-9.7064,4.7461,18.8533,12.7118,467
-6.0687,-9.7588,0.5343,3.1206,-9.7588,4.9955,16.9746,6.3956,469
-8.7834,-9.1464,8.299,12.5199,-9.1464,11.3702,28.9138,20.6239,470
-2.6156,-9.3322,0.2321,2.1789,-9.3322,2.7607,17.0557,4.6977,471
-1.6563,-9.9545,-0.2161,1.0703,-9.9545,1.0246,8.9041,6.3135,472
-4.4531,-9.5914,1.7113,4.0407,-9.5914,1.9317,8.3859,6.7056,473
-2.3203,-9.5972,-0.6805,1.0205,-9.5972,4.8129,11.98,9.4425,474
-1.1174,-9.4254,0.2737,1.1079,-9.4254,1.2083,8.7252,3.4285,475
-6.8455,-9.8035,1.4711,7.7444,-9.8035,3.5616,18.771,13.6359,476
-2.5068,-9.7284,0.6357,1.8627,-9.7284,2.9103,8.0568,4.5622,477
-3.0831,-9.7848,2.3877,4.5242,-9.7848,5.3819,16.4162,6.4724,479
-0.9739,-9.8187,1.9161,2.6083,-9.8187,2.2768,7.3295,5.4742,480
-1.3587,-8.2365,0.7605,1.585,-8.2365,2.3802,23.0112,5.3324,481
-0.8713,-9.7651,-0.161,0.4295,-9.7651,1.0101,5.9337,3.8349,482
-3.5471,-9.6901,-0.4442,1.4815,-9.6901,1.8009,16.3085,7.3707,483
-7.6638,-9.9177,0.8984,5.3907,-9.9177,2.2084,17.3432,9.5614,484
-1.4722,-8.819,0.333,2.2555,-8.819,1.2158,14.1032,8.1996,485
-2.6728,-9.8323,-0.6735,1.5003,-9.8323,2.3011,7.8125,3.8935,486
-1.8233,-9.7526,0.5856,1.814,-9.7526,2.4542,6.6812,5.2039,487
-6.7175,-9.7643,0.5377,1.9784,-9.7643,3.6841,10.1683,4.9083,489
-2.0288,-9.9704,1.0288,1.8389,-9.9704,3.8679,8.5667,4.8529,490
-1.4726,-9.7867,-0.0771,0.7893,-9.7867,0.9714,9.0223,3.8554,491
-1.8334,-10.0034,0.2136,1.3906,-10.0034,3.4631,13.5465,7.9563,492
-1.0352,-9.0676,0.1451,0.8155,-9.0676,1.7354,7.6696,6.7481,493
-1.0989,-9.8022,-0.0945,0.4957,-9.8022,1.1129,8.5302,5.8572,494
-2.9339,-9.514,0.6497,2.0687,-9.514,4.5879,11.083,6.134,495
-5.0467,-9.7838,2.5112,5.9569,-9.7838,4.6535,17.0606,10.0291,496
-3.1928,-9.8415,-0.2402,1.5111,-9.8415,3.3371,9.5613,5.9714,497
-9.6481,-9.6626,0.7837,4.2306,-9.6626,4.8988,12.5632,6.6053,499
-1.3532,-10.4544,0.8855,1.6802,-10.4544,3.9741,12.5518,7.3214,500
-3.2993,-9.6808,7.7352,7.3512,-9.6808,2.8298,15.5965,13.2105,501
-0.567,-10.0564,1.5554,3.1265,-10.0564,3.8542,8.4956,6.3209,502
-3.2218,-9.5383,-0.018,1.7081,-9.5383,4.2758,10.7992,7.8021,503
-0.5893,-9.7078,0.0453,0.2905,-9.7078,0.4327,4.183,2.0033,504
-1.4832,-9.5283,0.0635,0.6725,-9.5283,1.6947,5.5811,3.8563,505
-0.8117,-9.4238,0.2297,0.6859,-9.4238,0.9535,7.2298,4.1481,506
-2.1791,-9.8489,1.1284,1.9356,-9.8489,2.0296,17.7491,9.1686,507
-18.929,-9.9778,1.4709,7.3669,-9.9778,7.7367,19.2125,12.0022,509
-3.6777,-9.6617,0.9273,3.2248,-9.6617,2.1521,9.2066,7.867,510
-2.5602,-9.1693,-0.0205,1.222,-9.1693,2.1359,7.7703,4.9204,511
-2.0435,-10.3797,0.5298,2.047,-10.3797,1.4832,18.1107,8.202,512
-0.378,-9.3896,0.1292,0.4072,-9.3896,2.033,8.0932,5.8297,513
-2.5449,-9.6034,0.0334,0.8607,-9.6034,2.618,6.8206,3.6072,514
-6.7926,-10.1771,3.6025,8.0322,-10.1771,3.2792,22.7156,17.3676,515
-0.0923,-9.9886,0.194,0.2606,-9.9886,0.8365,9.0018,6.221,516
-3.6845,-9.7826,1.7761,2.7728,-9.7826,2.6828,19.4326,14.1421,517
-26.0516,-9.1961,0.5472,8.5682,-9.1961,6.1346,39.3066,24.9736,519
-16.0597,-9.1716,1.2504,15.3354,-9.1716,6.0001,55.7252,27.3556,520
-9.7999,-8.8454,1.5136,7.2387,-8.8454,3.3993,35.0775,21.7098,521
-0.9762,-9.8913,2.9664,4.5268,-9.8913,5.0789,12.7945,9.6163,522
-9.4397,-9.2404,-1.901,3.2887,-9.2404,2.9772,8.9831,6.4577,523
-3.3062,-10.4072,-0.6824,2.4204,-10.4072,3.6623,17.7084,12.313,524
-0.7274,-10.0049,-0.208,0.5147,-10.0049,1.3581,8.5968,5.9986,525
-3.8969,-9.8695,0.3634,1.6841,-9.8695,3.069,11.363,6.5303,526
-1.6072,-10.2952,0.6273,1.6545,-10.2952,2.74,32.9635,9.2283,527
-17.783,-9.7073,0.0209,4.5545,-9.7073,6.0271,24.3108,9.4602,529
-6.8269,-9.6662,1.9072,4.4776,-9.6662,4.0913,23.9438,8.4084,530
-8.8436,-9.8628,-0.8126,3.931,-9.8628,1.6938,10.2558,6.6956,531
0.0294,-10.0244,3.5486,2.4063,-10.0244,4.7504,16.4427,13.785,534
-2.377,-9.3478,3.0616,4.2962,-9.3478,3.1232,13.0564,10.0524,535
-9.1632,-9.6267,2.0322,6.2491,-9.6267,2.6749,18.0782,13.3861,536
-7.1371,-9.7396,-0.9333,2.2672,-9.7396,4.3651,15.3009,8.2131,537
-4.0116,-10.1263,3.1102,7.357,-10.1263,7.5516,20.3362,11.1572,539
-6.446,-9.92,1.2037,2.9384,-9.92,4.0897,15.1982,7.8908,540
-0.2007,-9.6785,1.3391,1.2836,-9.6785,3.6334,15.69,9.0682,541
-1.9436,-9.5664,2.3169,3.3754,-9.5664,3.0475,16.0805,6.0062,542
-6.6526,-9.4937,1.4069,6.3346,-9.4937,2.2647,17.4295,12.2484,543
-0.2403,-10.0339,1.9077,2.3235,-10.0339,3.7551,21.8957,18.5477,544
-10.2198,-9.5727,1.6258,6.507,-9.5727,4.787,33.342,23.1293,545
-0.4962,-9.8013,2.4594,3.4564,-9.8013,3.0996,16.1893,6.1351,546
-2.0827,-10.04,0.6376,2.0387,-10.04,6.6377,22.7062,18.037,547
-26.229,-10.0149,1.8776,7.7447,-10.0149,9.4496,29.7709,13.816,549
-13.6178,-9.5063,0.9473,5.1467,-9.5063,6.5234,31.2577,9.8015,550
2.1834,-9.7662,14.4229,7.6456,-9.7662,7.6009,25.0948,20.8728,551
-36.1366,-9.5962,10.472,24.671,-9.5962,12.9055,37.8033,24.5623,552
-4.0731,-9.7916,2.2794,3.5509,-9.7916,1.324,14.1372,12.2112,553
-4.7449,-9.6569,4.4816,7.7066,-9.6569,5.1482,18.8747,15.6074,554
-7.0897,-9.743,3.8683,9.8693,-9.743,10.3359,29.5221,14.8379,555
-5.0274,-9.8559,-0.6723,2.1815,-9.8559,1.7922,17.2406,7.8497,556
-4.5847,-9.4677,-1.5538,1.7964,-9.4677,3.2045,20.2453,8.7815,557
-10.2883,-9.5274,-1.5622,4.2898,-9.5274,2.2552,17.6537,8.4237,558
-1.8489,-10.21,0.5877,1.9131,-10.21,1.3404,10.1104,6.7781,559
-4.7311,-9.7558,0.1802,4.252,-9.7558,2.9613,17.6561,14.9178,560
-2.838,-9.6391,-0.9571,1.0536,-9.6391,1.6508,11.6658,8.9707,561
-1.3284,-9.8071,0.2225,1.2662,-9.8071,2.3801,9.705,4.9856,562
-8.2472,-9.8821,2.2748,6.2928,-9.8821,6.5831,21.1738,13.8951,563
-3.7926,-9.8212,0.7967,2.1995,-9.8212,2.9495,13.434,7.7975,564
-11.3962,-9.1753,0.8057,4.6408,-9.1753,5.7553,18.349,10.4303,565
-0.4101,-10.6386,0.4773,0.7091,-10.6386,1.6888,18.4704,9.0268,566
-4.3455,-10.2523,-0.7997,2.2526,-10.2523,3.2169,16.5089,10.7433,567
-15.9962,-9.3854,2.4544,13.9031,-9.3854,4.1176,43.8079,13.7092,568
-8.7799,-9.7337,-1.4672,2.634,-9.7337,4.6814,17.4506,8.3721,569
-3.2546,-9.6518,1.7966,2.6704,-9.6518,1.6973,16.1094,7.6542,570
-0.5978,-9.9659,0.8329,1.468,-9.9659,4.1708,17.0114,9.2673,571
-7.9135,-9.4641,-0.5156,3.018,-9.4641,4.0512,15.679,8.9365,572
-2.612,-9.8704,-0.0269,1.1414,-9.8704,1.9938,9.9561,4.5166,574
-11.5626,-9.6829,2.8137,6.8113,-9.6829,6.2958,24.9018,9.8591,575
-3.7245,-9.8743,50.9889,34.1895,-9.8743,6.8305,43.9891,37.0135,576
-2.9606,-9.649,6.984,8.7539,-9.649,3.7152,17.1545,14.1365,577
-5.5245,-9.944,-0.5196,2.7601,-9.944,2.6123,10.0639,5.6184,578
-3.9336,-9.8419,1.6926,3.334,-9.8419,4.1679,11.8217,6.7995,579
-4.5977,-9.7287,1.0882,2.4455,-9.7287,1.6007,12.9507,7.849,580
-4.6278,-9.6581,0.5953,4.0923,-9.6581,7.5556,17.0684,10.9171,582
-1.6628,-9.9597,7.0441,7.1461,-9.9597,3.6262,16.2236,12.7999,583
-8.2914,-9.6628,0.1917,4.4742,-9.6628,4.3767,14.5881,7.9633,584
-9.1918,-9.9287,1.5756,4.3801,-9.9287,4.6064,13.6859,8.5859,585
-4.9002,-9.6052,0.3408,2.4941,-9.6052,4.1697,11.5287,6.7307,586
0.0281,-9.7358,0.8801,0.9411,-9.7358,1.9002,4.3654,3.346,587
-3.6158,-10.1634,-0.1764,2.4022,-10.1634,1.9611,12.2052,9.8851,588
-4.5997,-8.3597,-0.5027,2.8765,-8.3597,1.6026,21.51,7.7273,589
-1.1306,-9.2599,0.0628,0.7028,-9.2599,2.1037,13.7301,8.5797,590
-8.7701,-9.3084,-0.7093,4.224,-9.3084,1.1414,12.9985,8.0045,591
-9.0975,-9.6539,0.7704,4.877,-9.6539,6.4339,23.1316,8.8297,594
-2.5218,-10.1199,4.6012,5.8019,-10.1199,3.3435,15.8901,12.3285,595
-4.2015,-9.7651,-0.8406,1.4327,-9.7651,1.7672,11.8035,9.551,596
-2.9013,-9.3468,-0.9352,1.1956,-9.3468,1.5888,6.5849,4.2664,597
-6.3926,-9.8744,1.9927,5.3919,-9.8744,2.2514,13.1022,10.3451,598
-9.2729,-10.1858,-0.5009,6.017,-10.1858,3.5317,28.5773,25.6207,599
-3.9518,-9.3944,0.2865,2.8076,-9.3944,1.1629,12.523,7.7699,600
-7.9524,-10.142,6.2616,12.3977,-10.142,8.7743,29.0665,24.3966,601
-5.5905,-9.7382,0.1881,2.8821,-9.7382,6.4737,14.3175,9.5181,602
-2.7427,-9.6179,0.6288,1.7371,-9.6179,5.8176,18.1716,8.6642,604
-3.0347,-8.9292,0.9079,3.4758,-8.9292,1.4611,21.4817,13.2795,605
-4.4082,-10.2316,-1.2136,2.3258,-10.2316,4.4501,10.1571,8.188,607
-8.013,-8.6667,-0.0051,3.5715,-8.6667,5.8369,20.6995,9.4346,608
-3.6739,-9.8115,-0.4378,1.3685,-9.8115,1.4517,11.8144,6.5687,609
-5.8546,-8.9137,0.9516,3.4902,-8.9137,5.4841,13.9098,11.8645,610
-8.9474,-9.2073,-1.4277,3.76,-9.2073,0.9115,9.5571,8.307,611
-3.9998,-9.8228,2.0334,3.4227,-9.8228,5.1552,18.5135,9.9367,612
-6.6691,-9.8339,3.8394,5.8538,-9.8339,7.5348,21.4418,10.6111,614
-9.3122,-9.6379,-0.6843,5.7364,-9.6379,7.4791,24.1479,10.5598,615
-1.2822,-9.5811,0.1213,0.6288,-9.5811,0.8056,6.4206,3.7181,616
-4.3409,-10.0393,0.2731,2.7974,-10.0393,1.8127,9.9819,6.2112,617
-8.5165,-9.9975,-0.0069,4.1309,-9.9975,3.6633,16.3233,8.7632,618
-3.5796,-9.7102,31.8423,28.8228,-9.7102,15.8265,38.4713,29.8734,619
-4.8761,-9.3748,-0.8774,1.6852,-9.3748,2.1107,11.9959,7.1126,620
-15.3355,-10.0649,-0.5744,7.7012,-10.0649,5.6542,18.7516,11.6595,621
-3.6828,-9.6423,2.4657,5.8647,-9.6423,6.3082,16.7066,10.8057,622
-8.3254,-9.6709,-0.9273,3.0206,-9.6709,5.3311,16.6715,8.0409,624
-3.4809,-9.3051,1.8342,4.1168,-9.3051,3.3723,16.3967,11.7588,625
-0.5327,-6.6787,0.1468,0.4388,-6.6787,0.9244,10.0391,5.5578,626
-2.4161,-9.7575,0.3877,1.6267,-9.7575,1.5626,19.9045,6.8603,627
-6.5696,-9.8218,0.6176,3.7517,-9.8218,4.7244,22.7023,10.5908,629
-0.6164,-9.9535,0.111,0.5096,-9.9535,1.1233,12.7797,8.6034,630
-2.8474,-9.5901,-0.6963,1.3141,-9.5901,1.1012,5.3918,4.3032,631
-1.6312,-9.8505,0.5507,1.743,-9.8505,2.3031,12.4969,7.7543,632
-4.1497,-9.756,0.2914,2.5891,-9.756,4.3688,20.1098,6.2229,634
-83.8931,-8.7949,-1.2491,58.935,-8.7949,12.8567,88.7343,54.3938,635
-5.9886,-10.0229,-1.0493,2.2352,-10.0229,5.431,45.9009,38.2292,636
-5.8947,-9.6627,4.3141,8.9053,-9.6627,3.8199,25.1132,16.1054,637
-8.0406,-9.7001,2.6231,6.865,-9.7001,6.3837,34.33,16.2747,639
-9.7852,-9.0762,-2.2973,3.846,-9.0762,3.0658,20.3881,16.3577,640
-6.6952,-9.6822,12.1777,18.7104,-9.6822,5.5192,23.3461,19.9397,641
-8.9909,-10.0107,1.1391,6.3479,-10.0107,7.3741,23.6263,14.8009,642
-9.4471,-9.3867,-0.2051,3.551,-9.3867,3.4208,22.8214,9.4537,644
-1.3864,-9.7699,0.0648,0.8335,-9.7699,1.0197,8.8152,5.989,645
-3.2306,-10.2663,-0.2276,1.3502,-10.2663,2.1668,12.959,8.4792,646
-7.0171,-9.8425,1.0066,4.2268,-9.8425,7.2768,15.85,12.2603,647
-1.3814,-9.7685,0.9308,2.3091,-9.7685,3.5621,9.2208,6.1624,649
-1.9724,-9.902,-0.4709,1.1948,-9.902,3.4178,12.0823,10.3902,650
-1.9581,-9.8287,-0.2591,0.9886,-9.8287,1.2735,5.1585,4.1673,651
-5.7605,-10.0326,-0.8813,2.9288,-10.0326,3.7732,13.9308,8.4491,652
-6.1908,-9.7374,-0.3534,3.4243,-9.7374,3.8027,13.3954,6.6483,654
-8.7578,-10.0775,0.3534,6.6672,-10.0775,1.0313,15.9867,12.3911,655
-1.4683,-9.452,1.9262,3.2686,-9.452,2.6283,7.385,6.3018,656
-4.0735,-9.7217,-0.6794,1.1762,-9.7217,2.7363,10.348,5.6302,657
-6.0643,-9.9721,2.1093,4.8816,-9.9721,4.4075,23.6216,12.8903,659
-2.9613,-9.9059,1.1607,2.1387,-9.9059,4.364,21.4344,9.1313,661
-3.0013,-9.3639,8.2563,7.5571,-9.3639,10.5711,24.7618,14.8076,662
-9.4012,-9.6433,-0.393,4.4916,-9.6433,5.8826,16.5209,13.4443,663
-3.2652,-9.5845,0.4766,2.0525,-9.5845,1.5765,6.8847,5.4469,664
-2.6805,-9.6899,1.2109,2.2846,-9.6899,6.8168,13.2228,11.4212,665
-1.3594,-9.1621,4.124,5.6408,-9.1621,3.7898,17.4965,11.2567,666
-12.0828,-7.749,1.3136,11.1619,-7.749,2.1532,24.2767,12.7984,667
-16.1985,-10.1197,1.1516,8.814,-10.1197,5.2365,31.3694,18.3904,668
-12.0747,-9.662,-4.5783,6.5739,-9.662,2.1318,15.2958,10.9932,669
-4.9057,-10.2652,-1.8748,2.1813,-10.2652,3.452,17.6555,12.1262,670
-14.1781,-8.8053,-0.9316,5.7282,-8.8053,5.0472,26.4151,23.304,671
-0.7137,-9.7975,1.8688,1.952,-9.7975,4.7976,12.1356,5.9324,672
-20.0977,-9.6851,-1.6322,8.4863,-9.6851,7.2285,25.4511,19.6726,673
-0.7967,-9.6671,0.3585,1.0911,-9.6671,1.2324,6.0799,4.3304,674
-1.8107,-9.5872,0.8214,1.6519,-9.5872,2.9469,5.8864,4.1005,675
-3.8221,-9.7834,0.7731,2.2847,-9.7834,2.1327,8.5567,6.075,676
-3.6683,-9.83,0.2773,1.604,-9.83,3.9522,10.2364,7.2989,678
-4.5075,-9.818,-0.0512,2.3511,-9.818,2.3575,8.2456,6.062,679
-5.3617,-9.977,-0.3641,3.4218,-9.977,3.8398,13.6768,10.1371,680
-5.9176,-9.6125,0.9409,4.0448,-9.6125,2.5498,10.213,9.4275,681
-3.1795,-9.7913,0.7976,2.3617,-9.7913,4.2204,11.9194,7.1717,682
-2.4615,-9.5691,1.1037,2.3455,-9.5691,3.133,10.3563,6.7724,683
-17.5205,-9.7261,-0.6454,4.9053,-9.7261,7.6509,26.2959,7.5617,684
-28.7748,-9.8374,0.6695,11.653,-9.8374,11.3454,25.1238,15.7319,685
-2.7011,-9.7079,2.0531,3.6649,-9.7079,3.8449,14.1,5.9045,686
-4.7805,-9.7784,2.1833,3.0419,-9.7784,5.9503,12.684,9.2646,687
-8.9473,-9.7809,-0.5508,1.9415,-9.7809,3.6471,10.6951,5.1907,689
-4.7986,-9.8165,0.592,2.5658,-9.8165,4.9565,14.3302,6.3274,690
-7.382,-9.7859,-1.6277,2.8543,-9.7859,1.9951,8.3836,6.5834,691
-1.0778,-8.4397,-0.3561,0.5634,-8.4397,1.3545,14.7797,9.329,692
-3.4882,-9.7783,4.2827,7.2989,-9.7783,6.4207,14.5491,12.3582,693
-5.0805,-9.7387,-0.7299,1.541,-9.7387,3.046,9.7752,5.043,694
-2.3893,-10.0683,-0.298,0.8748,-10.0683,2.0587,11.5893,8.4212,695
-3.1419,-9.8032,-0.9171,1.4408,-9.8032,2.3509,6.0039,4.9613,696
-0.9529,-9.8087,1.0156,2.0445,-9.8087,2.6035,13.414,8.2816,697
-5.1122,-9.8765,-0.284,2.2663,-9.8765,6.0628,15.1918,9.7843,699
-9.2082,-9.7763,-1.1626,2.4172,-9.7763,4.1022,12.2419,8.6704,700
-2.6868,-9.9115,0.4713,1.9056,-9.9115,2.4591,10.6116,5.9398,701
-18.074,-9.805,-0.2751,6.6716,-9.805,4.3897,16.9045,7.3772,702
-4.8276,-10.3592,3.5663,6.4415,-10.3592,1.746,14.1196,9.627,703
-5.5831,-9.9483,-0.0996,2.3537,-9.9483,3.8876,11.9663,5.2427,704
-5.4555,-9.7823,-0.3076,1.4809,-9.7823,2.4701,7.7288,5.4549,705
-1.0032,-9.577,0.4919,0.9997,-9.577,1.3912,5.1066,4.0417,706
-0.9187,-9.4694,2.7014,3.8432,-9.4694,5.5503,13.534,6.734,707
-6.5271,-9.5407,-2.122,3.1736,-9.5407,2.6952,14.7408,8.3489,708
-6.2264,-9.5936,-0.8807,2.7666,-9.5936,2.8385,12.0995,6.7993,709
-4.1152,-9.7321,-0.5363,1.3685,-9.7321,1.8739,12.2573,4.6858,710
-8.4707,-9.8151,1.0834,4.3591,-9.8151,1.7468,10.5734,5.7908,711
-1.5209,-9.7651,1.2154,2.4819,-9.7651,4.0393,10.508,7.6305,712
-6.0674,-9.8088,0.6914,2.8967,-9.8088,2.3844,9.2089,4.3305,714
-1.655,-9.8297,0.0902,0.8741,-9.8297,2.3499,8.3113,2.9635,715
-1.1836,-9.7191,0.4425,1.5561,-9.7191,1.5327,9.0768,7.4794,716
-1.2656,-9.7649,0.1488,1.0234,-9.7649,2.5613,7.2085,5.7492,717
-0.1473,-9.7046,0.0922,0.3447,-9.7046,0.7751,5.2485,1.8293,718
-6.18,-9.7407,3.5584,7.1493,-9.7407,3.3887,16.9664,12.7461,719
-6.354,-9.7842,6.8859,8.3735,-9.7842,10.5477,30.0893,13.8953,720
-2.4026,-9.6106,-0.2322,1.3184,-9.6106,3.6361,10.1315,7.1669,721
-4.4635,-9.9007,0.5581,2.8405,-9.9007,1.0051,7.9049,6.2839,722
-1.8351,-10.2401,-0.1123,0.8779,-10.2401,0.8832,7.8863,4.7674,723
-4.4355,-9.6579,-0.2663,2.058,-9.6579,1.8782,6.5955,4.4488,724
-7.3965,-9.6452,2.2438,7.3682,-9.6452,1.7733,13.7676,11.4647,725
-3.3996,-9.9762,0.9611,5.1971,-9.9762,1.6606,14.6968,8.5117,726
-6.7329,-9.877,-0.7062,1.8632,-9.877,1.6399,8.8139,3.4089,727
-3.3544,-9.6072,0.9201,4.1736,-9.6072,1.1456,13.821,8.7263,728
-5.3358,-9.9441,-0.629,2.4203,-9.9441,2.7417,16.4276,4.7715,729
-14.7667,-8.6144,-0.7189,5.0462,-8.6144,4.0711,17.5483,9.3784,730
-4.4297,-9.57,-1.2059,2.2842,-9.57,1.6795,8.6945,5.4628,731
-2.9944,-10.1407,1.484,4.1792,-10.1407,1.8788,13.0437,8.7907,732
-4.2991,-9.6511,1.1531,3.3262,-9.6511,2.328,14.5189,7.5833,733
-1.9813,-9.8079,-0.071,1.5637,-9.8079,4.2571,16.6634,10.5756,734
-0.7787,-9.2646,2.3474,2.6368,-9.2646,6.9702,19.1804,13.8833,735
-2.3767,-10.0178,4.5231,3.4822,-10.0178,1.8882,13.954,12.884,736
-3.2563,-9.842,1.3833,3.0829,-9.842,6.2708,15.9046,9.5097,737
-9.4656,-9.6184,0.3522,4.8104,-9.6184,1.961,21.8633,11.4978,738
-4.918,-9.7534,0.7905,3.5524,-9.7534,3.1582,15.986,8.7912,739
-9.6437,-9.788,2.1082,6.6061,-9.788,5.9177,24.3818,11.1871,740
-7.3391,-9.3039,-0.6465,3.7583,-9.3039,2.7479,12.6361,7.1857,741
-0.8756,-10.0312,0.6981,1.3662,-10.0312,1.6664,14.1307,11.3098,742
-3.0894,-9.7611,-0.1696,1.8814,-9.7611,4.87,8.4879,6.5307,743
-2.0935,-9.9722,-0.2072,1.0827,-9.9722,1.3542,12.3658,8.3846,744
-0.3167,-9.7782,0.0922,0.4465,-9.7782,3.171,8.1607,6.5198,745
-3.4161,-9.7896,1.2796,3.8989,-9.7896,8.3395,20.6596,10.2583,746
-1.3889,-9.8224,0.0326,0.8241,-9.8224,1.1573,10.6404,7.7077,748
-25.721,-9.6064,0.453,5.0635,-9.6064,6.0176,28.3532,8.859,749
-11.0309,-9.9689,4.5491,7.5758,-9.9689,8.6261,18.286,12.5505,750
-0.8975,-9.4706,-0.0987,0.5038,-9.4706,0.8142,5.6749,3.0547,751
-2.1344,-10.0343,5.226,5.9409,-10.0343,8.5657,19.1824,12.8928,752
-3.3089,-9.7699,1.3616,2.2464,-9.7699,1.1208,9.8979,6.5433,753
-7.6567,-9.729,-0.3163,3.0562,-9.729,4.1531,12.1539,6.5531,754
-3.0044,-9.5344,-0.0886,1.4625,-9.5344,1.5481,10.3951,4.2601,755
-0.5025,-9.9956,2.7296,3.3349,-9.9956,5.9027,16.6769,15.7284,756
-0.9092,-9.5164,2.7313,2.3351,-9.5164,1.7014,12.8428,9.9457,757
-1.9489,-9.9156,3.0216,5.425,-9.9156,4.5925,17.2122,10.8663,759
-5.5863,-9.7171,3.1029,5.5354,-9.7171,2.7264,15.4522,13.2332,760
-1.2401,-9.7915,1.3583,1.6087,-9.7915,5.6321,24.647,11.674,761
-3.0805,-10.0648,-0.2689,2.1069,-10.0648,1.5343,10.6585,7.8449,762
-0.8145,-9.6185,1.6903,1.7063,-9.6185,2.3879,16.1045,10.2908,763
-5.4146,-9.7585,-0.1241,3.3884,-9.7585,1.109,14.298,11.375,764
-2.9564,-9.9734,0.5846,4.031,-9.9734,2.9365,12.9783,9.3713,765
-2.1503,-10.3676,-0.0999,0.8582,-10.3676,1.2291,13.5601,10.7351,766
-7.2208,-9.7116,0.1803,4.3749,-9.7116,5.8355,28.9699,16.3155,767
-14.4123,-9.8828,2.8372,8.1954,-9.8828,6.0157,23.5116,12.9946,769
-1.9009,-9.9879,1.0302,4.1023,-9.9879,4.3828,14.1501,10.4354,770
-1.7305,-9.8241,1.8116,3.179,-9.8241,2.1004,7.4373,6.5518,771
-0.2966,-9.4264,3.9797,4.2193,-9.4264,6.6412,17.7812,9.2457,772
-0.1986,-9.8921,1.2861,0.653,-9.8921,3.1585,13.6791,12.2635,773
-1.2806,-10.0212,0.8613,1.7144,-10.0212,2.4408,16.4806,11.4203,774
-4.6596,-10.257,1.2823,5.0574,-10.257,2.0612,14.9353,12.264,775
-4.2055,-9.4923,1.5454,3.5784,-9.4923,2.0926,13.229,12.3261,776
-34.417,-8.3341,0.1783,13.7627,-8.3341,6.8484,24.2757,12.9496,777
-15.7873,-9.8676,1.422,6.6455,-9.8676,7.4886,31.377,16.3258,779
-1.2732,-9.8995,1.1467,1.6697,-9.8995,2.27,23.6874,16.8114,780
-0.4812,-9.7858,0.5764,0.627,-9.7858,2.6186,13.9578,12.3958,781
-0.9503,-9.3091,6.1865,7.4944,-9.3091,3.4157,12.0315,11.1871,782
-5.2844,-9.8676,4.0083,6.9082,-9.8676,3.6083,23.714,11.3992,783
-1.2822,-9.9864,1.6444,1.9766,-9.9864,1.0863,9.0431,5.2668,784
-6.9716,-9.8077,-1.6458,4.3969,-9.8077,5.9386,17.8281,10.3249,785
-0.7375,-9.4537,0.149,0.9066,-9.4537,3.0359,14.5529,4.4549,786
-3.7053,-9.6698,1.2404,2.5853,-9.6698,5.4004,13.7078,9.2427,787
-4.8408,-9.8033,0.4693,2.3411,-9.8033,3.1792,12.1437,5.6584,789
-1.645,-9.7893,0.6866,1.3923,-9.7893,2.7417,8.7951,5.9459,790
-1.6565,-10.2065,-0.0996,1.6403,-10.2065,3.2501,14.8834,11.4404,791
-2.8687,-9.8093,0.5882,1.9471,-9.8093,3.6655,8.4747,6.2791,792
-3.7618,-9.903,0.8926,3.4257,-9.903,0.6188,14.8736,12.4683,793
-1.6597,-9.7769,1.0122,3.0285,-9.7769,3.7843,13.8635,7.6338,794
-2.5285,-9.8482,-0.1979,1.2229,-9.8482,2.1341,11.2958,7.7715,795
-2.5764,-9.7976,1.2638,2.819,-9.7976,3.8348,8.803,6.0506,796
-8.9341,-9.766,-0.5226,3.1936,-9.766,4.1592,9.6087,5.9623,797
-2.2746,-9.7727,0.5111,1.4514,-9.7727,3.0191,11.6583,5.9357,799
-1.3093,-9.932,0.3868,1.0485,-9.932,2.2085,11.5661,7.5778,800
-3.9146,-9.5231,-0.1418,2.8598,-9.5231,1.3533,14.1247,9.1919,801
-25.3163,-9.458,-6.0536,9.1833,-9.458,4.5605,30.6916,15.8192,802
-5.0687,-9.7398,0.1308,4.762,-9.7398,2.0278,8.3345,6.9274,803
-8.428,-9.995,-0.6975,6.2287,-9.995,0.9891,12.2818,10.3014,804
-6.2713,-10.161,-0.4891,4.141,-10.161,3.2886,11.5053,7.4451,805
-3.7539,-9.2244,0.0216,1.7315,-9.2244,2.4402,13.592,6.8297,806
-9.4491,-10.1387,0.7885,7.3492,-10.1387,8.1038,37.8239,19.6808,807
-7.0737,-9.7793,0.1798,2.7885,-9.7793,3.5149,13.3912,6.5435,809
-11.1372,-9.9222,0.8655,10.4503,-9.9222,4.0355,17.915,11.6368,810
-12.3914,-9.954,3.2283,8.2727,-9.954,5.3607,17.6676,13.9723,811
-5.2497,-10.8219,-0.2078,3.1831,-10.8219,1.5773,9.9397,8.4923,812
-13.4807,-9.8571,-2.4226,7.7531,-9.8571,4.3045,17.8838,14.1859,813
-6.4696,-9.5023,2.9313,6.4712,-9.5023,3.9227,19.6687,11.8765,814
-3.614,-9.5414,-0.7502,1.9021,-9.5414,3.9855,10.502,6.7175,815
-4.1466,-9.4999,0.0144,2.2679,-9.4999,2.7254,10.3917,7.2717,816
-7.9395,-9.4904,0.7176,3.6125,-9.4904,2.6224,18.178,13.3554,817
-9.1461,-9.7857,1.3613,5.9668,-9.7857,4.6461,26.9539,12.4278,819
-2.7968,-10.0745,0.0529,1.8508,-10.0745,4.6398,32.4902,27.5671,820
-10.3346,-9.4841,42.8471,32.0532,-9.4841,2.2597,38.0875,31.0551,821
-2.9605,-9.9622,2.7998,3.672,-9.9622,3.0676,17.3531,12.3327,822
-1.5801,-9.6397,6.0417,6.1909,-9.6397,4.4334,17.8939,14.806,823
-1.7374,-9.7896,0.122,1.2106,-9.7896,2.0409,7.4815,4.6425,824
-2.8008,-9.9948,1.3155,3.4454,-9.9948,3.4362,17.7362,14.3529,825
-1.4424,-9.9025,-0.2168,1.0906,-9.9025,3.6897,14.6795,13.5174,826
-2.9758,-9.7728,-0.8256,1.2147,-9.7728,2.5366,5.8454,3.9444,827
-9.1576,-9.8244,3.9937,7.0932,-9.8244,9.721,25.1704,15.1366,829
-4.2284,-9.778,1.2575,3.1224,-9.778,5.801,12.7732,7.8507,830
-1.9271,-9.8164,1.951,2.8507,-9.8164,1.5166,8.8389,6.7621,831
-5.1218,-9.9335,-1.0635,2.5974,-9.9335,4.7032,14.6027,12.4588,832
0.4514,-9.9667,6.1915,5.142,-9.9667,2.9464,15.3691,10.9622,833
-5.8934,-8.9775,5.6209,10.965,-8.9775,3.3031,23.8455,21.3842,834
-0.3791,-8.0847,0.4681,0.8825,-8.0847,3.739,27.5724,14.0651,835
-0.2339,-9.5412,0.8264,0.7221,-9.5412,3.3721,11.7176,5.8544,836
-2.6334,-9.9299,-0.5525,1.0596,-9.9299,2.7035,11.7142,7.6937,837
-13.4437,-9.6452,1.9062,8.6265,-9.6452,8.0994,31.6041,12.4453,839
-8.1304,-10.1766,0.3778,4.7096,-10.1766,1.6266,7.4777,6.704,840
-0.2518,-10.1036,-0.0515,0.1691,-10.1036,0.6272,10.5238,9.9889,841
-3.8421,-9.1856,3.146,6.7586,-9.1856,3.3651,23.8611,20.6705,842
-7.9789,-9.8139,-1.3057,4.0139,-9.8139,6.7574,18.8772,11.5123,843
-6.6451,-9.8466,2.4858,7.482,-9.8466,3.1347,25.6702,17.9165,844
-4.1839,-10.2864,0.9533,3.8999,-10.2864,5.294,25.8946,21.4605,845
-3.2233,-8.9118,0.1888,2.4441,-8.9118,3.0711,27.7521,18.7253,846
-5.8327,-9.9769,0.2974,3.7502,-9.9769,2.9357,18.3836,12.9942,847
-2.535,-9.7772,2.022,3.8463,-9.7772,6.1324,23.2881,9.916,849
-3.2881,-9.809,1.0295,2.2753,-9.809,2.0311,10.1232,6.7103,850
-0.1942,-9.9313,1.574,1.6448,-9.9313,5.4698,10.7033,9.6029,851
-1.0746,-9.716,0.2917,0.9667,-9.716,1.3457,6.6839,5.5791,852
-0.3165,-9.7913,3.1572,3.2136,-9.7913,5.738,15.2092,13.5656,853
-0.5403,-9.5831,0.2703,0.5159,-9.5831,2.0401,5.8719,3.6681,854
-0.274,-9.6682,0.7332,0.6233,-9.6682,2.2775,8.97,5.7992,855
-2.3683,-9.8003,0.0202,1.9571,-9.8003,3.6992,6.7644,5.2479,856
-3.3254,-9.8685,1.3131,2.6195,-9.8685,5.988,17.835,14.4815,857
-3.113,-9.508,0.1224,2.1625,-9.508,1.5529,13.991,8.6402,858
-4.4457,-9.7867,-0.5137,1.499,-9.7867,2.4576,8.1588,3.9172,859
-2.4575,-9.6795,1.3371,3.0332,-9.6795,6.2096,17.8492,10.7225,860
-1.1699,-10.0331,0.2612,0.9768,-10.0331,1.1608,11.9766,5.6006,861
-3.5405,-9.7722,1.7978,3.5454,-9.7722,5.693,20.7489,18.4745,862
-1.929,-9.9586,1.301,2.255,-9.9586,1.2288,7.9875,5.3416,863
-1.3705,-9.5996,0.0343,1.1487,-9.5996,1.6977,9.6869,6.1039,864
-5.6123,-7.9403,0.6788,3.144,-7.9403,6.1845,36.4943,22.5482,865
-2.2581,-10.2527,-0.3953,0.8938,-10.2527,1.8245,12.4431,6.864,866
-3.729,-9.5987,-0.5423,1.4294,-9.5987,2.8419,11.6694,7.3924,867
-4.8388,-9.4405,0.4309,5.0546,-9.4405,4.8985,27.8776,12.0791,869
-1.7331,-9.8505,0.6707,1.2648,-9.8505,2.6209,10.3811,4.7706,870
-13.1458,-6.9682,-0.2327,5.6215,-6.9682,4.9618,27.9443,11.8698,871
-3.2853,-9.666,0.9066,4.0515,-9.666,2.1891,9.8103,6.5751,872
-1.9855,-9.5671,5.012,5.1858,-9.5671,2.4187,21.9813,17.2856,873
-7.0725,-10.1576,-0.8676,2.4803,-10.1576,4.3366,16.6359,11.2286,874
-1.6055,-10.1285,-0.0883,0.9794,-10.1285,1.9315,18.1979,10.2099,875
-1.7702,-9.6204,0.62,1.3836,-9.6204,1.1837,13.9655,8.7786,876
-2.2843,-9.6876,0.1236,1.4568,-9.6876,2.9624,10.7018,5.5108,877
-0.6305,-9.8835,0.4634,0.716,-9.8835,2.2671,8.1473,5.6258,879
-6.0158,-9.7874,2.7996,4.7141,-9.7874,0.9242,14.0226,10.6193,880
-0.747,-9.8243,1.8479,2.0816,-9.8243,1.345,19.5705,15.5496,881
-4.205,-9.9236,0.5765,1.6637,-9.9236,0.9839,14.0965,8.2599,882
-1.1635,-9.7855,2.2051,2.3814,-9.7855,3.0147,18.2868,12.1062,883
-10.907,-10.0249,0.9715,6.977,-10.0249,3.0196,24.6926,13.11,884
-2.059,-9.8547,5.0037,7.1639,-9.8547,4.8368,21.4235,9.8825,885
-0.9287,-9.7567,0.6466,1.0736,-9.7567,1.6413,11.5434,9.3342,886
-0.1299,-9.7169,2.5733,2.0851,-9.7169,3.069,18.1034,7.4748,887
3.8637,-9.5521,5.9102,2.4274,-9.5521,1.4272,15.1801,14.7136,888
-7.1022,-9.4068,-1.5704,5.0735,-9.4068,2.1276,12.5772,10.3564,889
-5.3747,-9.5967,-0.1831,2.6487,-9.5967,4.3364,12.9239,8.5852,890
-1.7303,-9.8082,1.122,2.1324,-9.8082,1.3308,13.1388,9.6358,891
-18.4585,-9.6618,-2.9197,5.4049,-9.6618,4.6587,17.1123,8.5665,892
-2.0004,-9.8045,0.4917,1.7545,-9.8045,2.2589,8.6139,4.3744,893
-7.1011,-9.6147,1.306,3.8661,-9.6147,3.9731,16.0494,11.1148,894
-3.1294,-9.8987,0.1659,1.504,-9.8987,2.4031,13.7255,5.4092,895
-0.7006,-9.5783,3.063,3.4145,-9.5783,2.6673,8.5565,6.5082,896
-1.8862,-9.9502,0.953,3.3041,-9.9502,4.0209,20.3161,12.827,897
-2.2015,-9.7634,1.453,2.8022,-9.7634,6.1816,10.2069,6.8052,898
-2.6312,-9.6986,1.0079,2.685,-9.6986,1.4652,19.1948,14.111,899
-8.9174,-9.9878,1.3057,4.8026,-9.9878,4.731,23.2712,8.5263,900
-2.4551,-9.5416,0.7241,1.7707,-9.5416,2.2139,15.5747,5.4146,902
-0.2615,-10.0609,1.2719,1.0567,-10.0609,4.0144,11.4447,9.555,903
-9.6681,-9.6265,2.552,6.7195,-9.6265,9.4917,28.3051,15.1231,904
-14.0751,-10.0388,-1.1923,6.4723,-10.0388,8.1456,21.2889,10.0546,905
-2.9632,-10.2906,1.3651,4.2304,-10.2906,5.1796,17.1902,14.3966,906
-5.0151,-9.9899,0.3144,3.8764,-9.9899,5.7149,14.268,10.0595,907
-1.6569,-9.1812,6.473,6.9511,-9.1812,5.0902,22.9115,16.3168,908
-5.6672,-9.8563,-1.2875,4.1576,-9.8563,2.4087,13.1126,9.1835,909
-15.1049,-9.2694,7.8787,15.1481,-9.2694,1.6814,30.2981,19.6735,910
-7.927,-9.9212,-0.8988,3.6512,-9.9212,2.1778,9.548,7.0865,911
-8.8249,-9.2865,1.6674,7.1128,-9.2865,4.108,23.1123,15.4456,912
-8.2654,-9.7757,3.3751,7.4752,-9.7757,7.6386,32.083,11.626,914
-2.7717,-10.0902,0.7844,3.049,-10.0902,2.2972,12.2207,8.0156,915
-4.0722,-10.134,-0.9364,1.8218,-10.134,3.2571,10.6048,4.8765,916
-5.6935,-9.6053,0.4006,3.9577,-9.6053,4.1214,17.6468,10.2448,918
-4.4457,-9.8756,0.6051,3.2312,-9.8756,5.6595,16.1039,6.8766,919
-2.443,-9.7994,1.849,3.5953,-9.7994,1.7341,12.047,10.2817,920
-1.6242,-10.2158,2.7999,4.6339,-10.2158,3.4838,13.8763,11.307,921
-1.9178,-9.9104,2.0893,2.9978,-9.9104,5.0323,13.6334,7.211,922
-6.5654,-9.7009,1.4397,4.0421,-9.7009,6.9045,18.3652,8.9065,924
-3.3466,-9.9313,-0.8092,1.2721,-9.9313,2.7126,10.1227,6.4481,925
-0.1769,-9.8514,8.3058,7.2898,-9.8514,5.2716,17.0507,12.8338,926
-0.0627,-10.0122,2.049,2.308,-10.0122,2.9848,9.0713,6.3868,927
-2.1851,-10.1308,-0.3478,1.4374,-10.1308,0.6502,9.2542,5.1014,928
-6.9516,-9.5479,0.605,4.6971,-9.5479,3.6787,19.7468,12.8886,929
-5.9876,-9.7375,4.7424,8.1449,-9.7375,4.0282,17.0405,11.3361,930
-1.2829,-9.7675,2.1301,3.3449,-9.7675,3.8987,11.5245,8.8804,931
-1.641,-9.6809,1.8081,2.7062,-9.6809,6.2029,14.0351,9.4,932
-6.4465,-9.8063,1.0032,3.4269,-9.8063,6.1187,19.9612,6.6601,934
-4.5792,-9.59,-0.6371,3.3797,-9.59,3.161,12.5429,10.4318,935
-2.9541,-9.366,-0.5896,1.1207,-9.366,2.4856,10.9167,5.1752,936
-0.2841,-9.8754,0.1282,0.3114,-9.8754,1.9328,12.5703,11.1456,937
-0.3083,-9.8446,0.3634,0.5037,-9.8446,1.6058,13.9692,11.3605,938
-1.7766,-9.6825,1.3618,2.1428,-9.6825,1.5127,17.4213,15.0806,939
-3.0907,-9.4961,1.6452,3.0068,-9.4961,1.9484,16.3425,10.8753,940
-0.4886,-9.2536,0.5976,1.5801,-9.2536,1.9844,6.7388,5.2157,941
-11.1795,-9.9257,7.0512,15.0017,-9.9257,11.1858,30.4726,13.3426,942
-7.9538,-9.6922,0.4947,4.7355,-9.6922,5.2017,13.9285,6.275,944
-1.5766,-9.892,-0.3824,0.5744,-9.892,0.8666,5.9435,3.3609,945
-3.8948,-10.0102,2.6964,5.3442,-10.0102,2.9737,13.2909,9.0819,946
-9.4095,-8.8934,-2.5301,4.1541,-8.8934,7.9037,47.0897,24.4269,947
-8.9825,-9.6537,-1.3805,4.6178,-9.6537,3.3061,18.6539,16.6867,948
-4.8776,-9.9132,2.9178,7.3538,-9.9132,6.4045,19.1291,13.9492,949
-8.3662,-9.6237,-2.3242,3.2477,-9.6237,4.0567,12.7459,7.9146,950
-1.084,-7.9536,8.7205,7.7294,-7.9536,5.5715,33.7446,23.7556,951
-8.8284,-10.026,2.2907,7.5281,-10.026,11.2825,27.8812,18.5396,952
-9.5347,-9.8133,2.4992,6.6207,-9.8133,5.9356,19.3226,7.8757,954
-1.24,-9.7085,0.9236,1.659,-9.7085,3.5318,9.6079,7.387,955
-14.3167,-8.8315,-2.3767,5.1688,-8.8315,2.7134,16.083,13.1524,956
-3.3354,-9.8633,1.5307,3.8683,-9.8633,6.3434,13.1011,12.3152,957
-3.9148,-9.8503,-0.0651,2.4828,-9.8503,2.4145,13.7906,9.4722,958
-3.7325,-9.9127,0.327,2.428,-9.9127,4.065,16.1393,13.5197,959
-0.7597,-9.6225,0.8516,1.6592,-9.6225,3.5067,9.7151,6.0712,960
-4.5165,-9.8666,0.5301,4.3648,-9.8666,6.1057,17.1197,14.2546,961
-16.5595,-9.7404,1.4341,9.9656,-9.7404,9.5945,25.3766,13.8473,962
-4.52,-9.7931,2.7841,4.9364,-9.7931,7.2488,25.0534,11.5574,964
0.4025,-9.8525,10.9512,10.1838,-9.8525,8.8014,23.3742,20.5302,965
-4.2339,-9.5972,-0.5975,1.7242,-9.5972,2.7639,9.2439,5.7756,966
-2.5096,-9.5646,-0.3295,1.397,-9.5646,2.946,6.7218,3.1781,967
-4.5869,-9.8415,-0.3085,1.8597,-9.8415,1.6373,7.1885,4.9128,968
-9.2409,-9.3158,36.4868,34.5168,-9.3158,5.1328,30.8063,28.7946,969
-11.9733,-9.5281,13.9851,17.0021,-9.5281,2.3195,31.9729,28.6014,970
-4.1453,-9.3519,3.4808,3.4953,-9.3519,4.2039,15.0444,11.3784,971
-3.5245,-9.6911,0.6774,2.4923,-9.6911,1.9393,11.3113,6.3754,972
-6.1959,-9.7911,2.1395,4.7692,-9.7911,6.2414,20.1603,9.5729,974
-10.9218,-9.6869,-1.0924,5.4039,-9.6869,0.9167,14.8067,13.6084,975
-0.0215,-9.8709,8.6824,10.7485,-9.8709,11.1767,22.3676,20.7291,976
-3.1461,-9.3182,0.4224,2.3189,-9.3182,3.3558,14.3221,6.387,977
-1.1623,-9.7768,8.2587,10.813,-9.7768,11.1518,27.2135,19.3846,978
-0.3146,-9.8971,15.8265,17.1223,-9.8971,7.3422,22.7389,20.7536,979
-2.3918,-9.8042,3.0925,3.9483,-9.8042,5.5067,17.0298,12.7611,980
-6.3052,-9.7107,5.9931,13.1668,-9.7107,10.1455,25.1642,22.4476,981
-3.6929,-9.7402,9.757,10.6653,-9.7402,9.3561,36.4689,18.1035,982
-18.0123,-9.823,4.948,12.7176,-9.823,12.2515,33.1264,9.245,984
-4.6636,-9.9229,4.5446,5.765,-9.9229,2.739,34.1269,23.9848,985
-3.577,-9.9212,-0.3707,2.072,-9.9212,4.3202,9.1008,7.3636,986
-1.3615,-9.9555,1.0806,2.6999,-9.9555,1.5715,12.0975,9.0788,987
-15.3156,-9.8677,2.4347,10.0548,-9.8677,10.1095,33.4427,30.7818,988
-1.3853,-9.7916,0.5211,1.5665,-9.7916,2.2502,18.447,9.1745,989
-6.9273,-9.7738,0.3448,3.717,-9.7738,1.2114,14.3614,13.727,990
-0.2472,-9.6447,0.4627,0.9462,-9.6447,2.1747,6.7458,5.1236,991
-6.9848,-9.8345,0.0139,3.8481,-9.8345,7.0552,23.2962,11.3888,992
-3.2259,-9.6169,3.2814,5.1836,-9.6169,8.0071,15.4084,11.9232,994
-0.7079,-9.607,1.7893,2.1547,-9.607,4.4351,14.4603,12.6489,995
1.0094,-9.7934,5.4771,3.4583,-9.7934,3.6027,19.347,14.642,996
-2.3898,-9.8434,-0.1925,1.1124,-9.8434,1.8093,6.5081,4.2546,997
-1.3005,-9.8801,0.6797,2.3386,-9.8801,2.4438,14.1987,13.261,998
-0.7594,-9.8535,0.9099,1.1382,-9.8535,1.5819,7.1024,5.9805,999
-1.1967,-9.8288,0.7831,1.3231,-9.8288,3.2371,10.7379,8.5,1000
-3.8368,-9.5268,0.7326,2.0539,-9.5268,3.3135,9.6915,5.5906,1001
-0.812,-9.8296,-0.0787,0.4952,-9.8296,2.8099,7.725,6.2983,1002
-2.6885,-9.6511,3.962,6.8494,-9.6511,7.4892,16.3981,8.2355,1004
-9.8034,-9.6925,-2.5045,4.0476,-9.6925,2.9,23.2396,9.3681,1005
-0.5834,-9.5368,2.3077,2.7278,-9.5368,1.0876,8.4862,6.9977,1006
-3.3003,-10.1631,1.1098,4.5044,-10.1631,3.1781,13.36,11.9347,1007
-4.5819,-9.2897,1.9115,3.3942,-9.2897,3.9449,12.1163,10.2122,1008
-2.2373,-9.9832,0.8626,2.4943,-9.9832,2.3744,9.8393,7.981,1009
-4.2708,-9.2349,0.4595,2.4516,-9.2349,1.1991,15.5118,7.6561,1010
-3.9874,-10.2038,0.5689,4.7503,-10.2038,3.2041,19.2603,16.74,1011
-10.7142,-9.7896,-0.392,3.2226,-9.7896,2.3708,18.9789,10.8302,1012
-6.1132,-9.7482,1.2568,4.3675,-9.7482,6.6244,15.4859,8.311,1014
-3.7274,-9.7754,2.459,4.0147,-9.7754,2.6637,12.842,9.2584,1015
-10.4325,-9.6505,0.7717,5.0866,-9.6505,1.8445,12.6778,10.9017,1016
-2.1654,-9.8453,0.5584,1.8586,-9.8453,3.4179,16.754,10.3556,1017
-5.2798,-9.4965,0.7863,4.767,-9.4965,2.4986,14.4708,12.2576,1018
-0.1671,-9.7054,2.0627,1.8714,-9.7054,4.5356,14.4456,13.7683,1019
-3.4598,-10.9292,0.5328,3.9448,-10.9292,7.7293,22.8838,19.6585,1020
-3.1359,-9.7485,-0.97,1.2194,-9.7485,3.6459,26.856,21.4065,1021
-19.3691,-9.7449,-0.9513,6.0282,-9.7449,6.1736,25.4346,8.7544,1022
-7.7326,-9.789,1.0927,3.4985,-9.789,6.4597,24.3821,9.9535,1024
-6.806,-9.851,0.6847,3.8604,-9.851,6.1918,11.5763,7.1936,1025
-4.28,-9.7724,0.5487,2.3284,-9.7724,1.0729,11.8708,9.7966,1027
-1.0246,-9.8967,0.2999,0.899,-9.8967,2.057,17.0935,16.1938,1028
-0.5659,-9.8163,1.3815,1.1879,-9.8163,0.6273,8.0592,6.1772,1029
0.8223,-9.8762,2.3445,1.1353,-9.8762,0.3156,13.6298,8.5226,1030
-0.0152,-9.8111,0.1144,0.1942,-9.8111,0.4224,4.2996,3.8082,1031
-4.9722,-9.7532,0.572,2.3279,-9.7532,1.4029,9.3814,6.5145,1032
-14.1657,-9.6964,4.285,7.3681,-9.6964,10.4362,22.8785,15.2711,1034
-5.237,-9.7371,1.7993,3.8348,-9.7371,6.8603,21.4895,13.8146,1035
-4.9566,-9.8412,1.2796,3.945,-9.8412,4.769,19.0534,8.8712,1036
-1.5404,-9.8652,0.3142,1.8029,-9.8652,3.3541,10.9173,6.3525,1037
-5.2432,-9.6904,-0.5566,3.9613,-9.6904,7.2461,22.7025,15.0517,1038
-9.3523,-9.8722,4.3043,7.8059,-9.8722,15.778,36.6746,21.9691,1039
-2.4423,-9.7068,5.7134,8.1001,-9.7068,9.1016,26.5643,12.3254,1040
-4.3102,-9.8529,-0.5738,1.8083,-9.8529,2.4341,9.117,4.1993,1041
-0.5784,-9.855,1.5549,2.2969,-9.855,3.6274,12.3146,7.551,1042
-2.8987,-9.7819,0.5813,2.3515,-9.7819,4.4154,10.8558,7.5403,1044
-6.8696,-9.8065,0.982,5.9635,-9.8065,7.9617,21.2366,13.8097,1045
2.5306,-9.6447,7.6631,6.5315,-9.6447,1.1593,19.8559,13.6426,1046
-5.9269,-9.702,1.7556,4.1432,-9.702,8.4943,14.3263,10.2197,1047
-11.0525,-9.7795,0.9984,10.0083,-9.7795,2.5126,14.8076,12.5433,1048
-6.1029,-9.7197,5.9325,8.4663,-9.7197,10.9184,27.1498,15.3369,1049
-14.6181,-9.8135,0.0419,4.7978,-9.8135,6.9401,15.6229,7.6832,1050
-1.5223,-9.9131,5.471,4.9447,-9.9131,5.908,17.494,14.4849,1051
-7.1004,-9.6102,-0.1352,4.6001,-9.6102,6.2729,12.3131,7.4199,1052
-11.6497,-9.6698,0.8794,6.4507,-9.6698,2.2249,13.2238,12.1069,1053
-11.0593,-9.7158,0.1781,6.6065,-9.7158,3.7784,13.8758,10.4883,1054
1.4446,-9.5761,14.8887,8.5422,-9.5761,3.9259,23.9798,19.8118,1055
-0.5039,-9.8269,6.7917,5.4445,-9.8269,3.7254,12.4548,9.4216,1056
-2.9504,-9.7776,4.5554,6.3719,-9.7776,2.6633,19.8022,12.53,1057
-3.5026,-9.9238,-0.8872,1.3037,-9.9238,2.6047,13.6199,11.1448,1058
-1.1193,-9.8101,8.6016,9.5387,-9.8101,13.1223,28.9729,22.9299,1059
-2.129,-9.6832,0.4117,1.1184,-9.6832,4.7944,10.8151,6.3443,1060
-0.5588,-9.5708,-0.0189,0.4115,-9.5708,1.644,4.1958,3.1389,1061
-0.6278,-10.1858,3.8272,4.1062,-10.1858,7.2341,25.9038,18.7327,1062
-4.5708,-9.479,0.7636,2.4757,-9.479,1.9179,9.2451,5.4598,1063
-2.3706,-9.7564,-0.0933,0.9588,-9.7564,3.0527,7.0011,4.5424,1064
-14.7287,-9.6788,-0.6316,4.3934,-9.6788,6.2901,19.8014,11.9114,1065
-1.4749,-9.5613,2.4561,3.0324,-9.5613,5.9483,12.5358,9.1461,1066
-2.08,-9.729,-0.6325,1.4354,-9.729,5.4862,10.6601,8.5885,1068
-0.2352,-9.8287,-0.0657,0.1028,-9.8287,0.5535,4.8005,2.6733,1069
-5.0027,-9.7696,-0.2047,2.3219,-9.7696,2.7919,9.6277,4.7107,1070
-1.1251,-9.8521,1.4547,2.6659,-9.8521,1.7782,9.7244,4.2128,1071
-6.2148,-9.7964,-0.4325,3.8515,-9.7964,2.1258,9.0388,7.896,1072
-8.7,-9.7217,-2.3556,4.9688,-9.7217,0.9915,12.0132,10.7867,1073
-1.7302,-9.5915,2.9341,5.0023,-9.5915,2.0362,15.107,12.3141,1074
-1.6377,-9.7779,-0.6297,1.1078,-9.7779,1.7527,10.4785,9.0097,1075
-1.3023,-9.791,0.2468,0.7193,-9.791,1.2899,10.784,10.2323,1076
-2.8359,-9.7104,0.1576,1.5212,-9.7104,0.8335,5.5699,3.4381,1077
-8.6623,-9.7457,0.8687,3.2739,-9.7457,5.1116,12.9653,6.7558,1079
-2.6285,-9.6588,-0.658,1.084,-9.6588,4.2872,9.1314,7.2727,1080
-1.0879,-9.466,0.9254,1.2448,-9.466,3.7672,9.156,6.3137,1081
-13.1587,-8.8995,-0.2947,7.164,-8.8995,3.3763,14.5748,10.7038,1082
-6.1097,-10.0705,-0.5386,4.0924,-10.0705,1.0382,9.1176,8.0215,1083
-2.0091,-9.068,-0.5018,0.9072,-9.068,2.7,13.2568,5.8363,1084
0.0796,-9.8038,4.4591,3.9323,-9.8038,2.3324,12.7092,11.214,1085
-8.9527,-10.4626,3.7896,7.5671,-10.4626,4.4107,18.5178,15.6642,1086
-2.0609,-9.7318,-0.3614,0.7092,-9.7318,2.5009,12.7251,9.782,1087
-21.0379,-9.9075,1.8826,8.6619,-9.9075,7.6698,23.1062,9.6936,1089
0.7382,-9.4423,2.3381,1.3392,-9.4423,0.7462,6.0816,5.1146,1090
0.5303,-9.8539,1.5178,0.7625,-9.8539,0.9352,7.1571,6.1354,1091
-13.0517,-9.8471,2.4856,11.4136,-9.8471,4.6122,22.2854,20.2378,1092
-3.5313,-9.9819,0.0453,3.6894,-9.9819,1.3858,11.2608,9.9575,1093
-4.1431,-9.7289,-0.1848,2.8894,-9.7289,3.2866,10.4128,6.1928,1094
-2.797,-10.2418,6.1619,7.6271,-10.2418,5.7168,19.1956,13.7674,1095
-2.676,-9.6548,-0.3576,1.2742,-9.6548,2.9419,8.0907,5.2423,1096
-4.8865,-9.7974,0.6018,2.9873,-9.7974,3.1597,12.4826,5.2639,1097
-6.0224,-9.754,0.935,4.0834,-9.754,5.6832,14.2278,8.4637,1099
-9.6461,-9.6823,2.2621,5.8458,-9.6823,7.4813,18.0061,12.5039,1100
-9.4404,-9.2531,-0.368,4.2302,-9.2531,1.2808,11.333,6.8132,1101
-2.471,-9.7223,-0.3461,1.8142,-9.7223,2.0017,10.3877,6.6407,1102
-0.5725,-9.7583,0.5504,0.879,-9.7583,1.2924,7.3426,4.5378,1103
-2.2509,-9.5472,-0.8222,1.0436,-9.5472,1.2775,6.0788,4.9981,1104
-1.2946,-9.8575,-0.1053,0.5689,-9.8575,0.7658,8.6188,6.716,1105
-0.4116,-9.744,0.5253,0.9501,-9.744,1.7826,5.0078,2.782,1106
-11.6006,-9.7583,-2.5026,4.3427,-9.7583,10.3887,24.6974,21.7815,1107
-7.6394,-9.8199,0.4057,4.3542,-9.8199,6.2201,20.7945,11.3311,1109
-4.4287,-8.8958,-1.2197,2.3796,-8.8958,4.2637,13.5824,9.5274,1110
-0.544,-10.0988,0.7152,2.013,-10.0988,3.401,8.8264,7.4653,1111
-0.1466,-9.9994,4.2548,2.639,-9.9994,2.0036,11.3753,10.495,1112
-7.8416,-10.0783,5.9782,9.6549,-10.0783,7.4234,28.1857,15.7222,1113
-2.7689,-9.9365,1.6064,3.4917,-9.9365,2.0621,8.4383,5.87,1114
-1.1183,-9.5735,0.2767,0.811,-9.5735,0.6907,11.0023,7.3398,1115
-2.1518,-9.6273,-0.4698,0.8009,-9.6273,1.505,7.1443,3.2983,1116
-5.3288,-9.7822,2.9389,5.6292,-9.7822,7.5367,15.2858,12.1832,1117
-5.6875,-9.8438,1.4618,4.4015,-9.8438,8.6702,24.2066,13.3905,1119
-2.8176,-9.6375,2.8955,3.5504,-9.6375,8.9018,20.1487,13.7456,1120
-1.095,-9.9229,0.1544,1.0254,-9.9229,2.802,8.0029,5.2844,1121
-0.6884,-9.6363,2.6418,3.5287,-9.6363,5.9713,13.6702,8.2151,1122
-6.7327,-9.8364,-0.8975,3.9365,-9.8364,7.0948,20.7294,12.6208,1123
-8.3574,-9.8142,-1.0925,3.1112,-9.8142,1.6904,16.4326,14.8569,1124
-6.3579,-9.8339,-2.3714,2.1015,-9.8339,1.3282,11.1642,10.3239,1125
-3.0002,-9.8391,1.0505,2.4161,-9.8391,3.0688,10.9587,8.7699,1126
-8.1901,-9.7678,1.9009,5.6762,-9.7678,5.7162,17.6977,10.1694,1127
-11.8551,-9.7708,3.1256,8.2284,-9.7708,11.6656,21.7227,16.6832,1129
-0.3801,-9.904,-0.0377,0.2166,-9.904,1.5766,6.1144,4.896,1130
-0.3382,-9.6857,1.6662,2.7121,-9.6857,3.8789,9.2629,6.3558,1131
-4.9938,-9.8227,9.6885,9.7396,-9.8227,0.8665,16.4117,14.376,1132
-1.9503,-10.1015,0.2669,1.2828,-10.1015,1.8621,8.1026,5.7618,1133
-1.6641,-10.1388,3.7432,4.6889,-10.1388,2.7408,10.3134,7.1551,1134
-2.3571,-9.612,-1.2356,0.9307,-9.612,0.3049,5.6773,4.1036,1135
-2.4002,-9.961,-0.3717,1.228,-9.961,1.5585,9.4612,8.8633,1136
-1.0752,-9.5996,2.3282,2.8413,-9.5996,3.2186,14.1458,7.0902,1137
-8.2154,-9.8219,3.9899,8.9512,-9.8219,9.1929,26.0245,11.8862,1139
-1.5338,-9.7345,5.5642,8.5132,-9.7345,9.0134,31.1936,26.745,1140
-5.0989,-10.29,-0.1416,4.1478,-10.29,1.616,24.0966,22.0629,1141
-14.4151,-9.8337,2.5731,13.5061,-9.8337,1.7383,16.7887,14.9377,1142
-0.0511,-9.9319,11.5761,12.7582,-9.9319,8.0957,29.4983,26.3246,1143
-0.2233,-9.8951,0.4108,0.6328,-9.8951,1.3782,7.3937,4.8639,1144
-1.4003,-9.7287,-0.4905,0.6196,-9.7287,1.1081,7.0208,3.1105,1145
-0.1314,-9.9061,1.4962,1.71,-9.9061,1.5185,7.5291,5.9881,1146
-2.8109,-9.7244,0.0077,1.7799,-9.7244,3.9928,19.1976,13.2054,1147
-10.4687,-9.8536,1.3725,6.0257,-9.8536,9.3045,32.016,16.9843,1149
-4.5389,-10.5649,0.1544,2.6158,-10.5649,3.5576,24.7101,19.7585,1150
-19.6219,-9.851,10.3838,14.09,-9.851,3.1234,21.4451,19.137,1151
-11.4352,-9.1199,-1.5233,5.8339,-9.1199,1.9663,9.9223,7.958,1152
-3.8281,-9.7937,-1.0988,2.0266,-9.7937,2.1149,16.2476,12.5059,1153
-1.6272,-9.8817,-0.4289,1.0585,-9.8817,3.8538,8.4032,4.7784,1154
-0.4859,-9.752,4.741,5.5836,-9.752,4.8558,14.1891,8.8762,1155
-4.0207,-9.9433,0.2909,2.8911,-9.9433,1.9197,9.0357,7.5355,1156
-10.0058,-9.7285,-0.4291,4.5658,-9.7285,3.2887,19.437,13.8001,1157
-1.5034,-9.655,4.1045,6.8791,-9.655,7.0436,14.6385,9.9791,1158
-2.9228,-9.8619,-0.043,2.1893,-9.8619,3.9019,10.3765,5.7674,1159
-2.7582,-9.6644,1.3882,3.3918,-9.6644,3.3646,9.2322,4.4789,1160
-3.1193,-9.9199,1.6221,3.4803,-9.9199,5.671,11.6637,10.1777,1161
-0.3865,-9.9298,-0.1052,0.1703,-9.9298,1.3096,4.5859,3.61,1162
-0.7315,-9.8595,-0.0564,0.7459,-9.8595,1.7529,7.7159,5.6107,1163
-0.4366,-10.1134,1.9799,2.5116,-10.1134,3.9969,10.0443,4.3142,1164
-4.2217,-8.6027,-0.6856,1.6954,-8.6027,2.0654,14.8658,6.7412,1165
-6.8988,-9.6609,-0.2546,4.6337,-9.6609,2.2555,12.0569,6.046,1166
-5.6959,-9.9301,-0.0669,1.963,-9.9301,2.7014,15.6584,5.9833,1167
-9.8552,-9.8862,0.0662,3.7264,-9.8862,4.4934,24.1539,10.4573,1169
-4.3531,-9.6429,0.1699,3.056,-9.6429,4.0467,10.9206,6.0321,1170
-6.2595,-9.1668,-0.8526,3.8258,-9.1668,3.9994,9.6966,7.6719,1171
-14.5414,-9.3588,-3.8689,7.2923,-9.3588,1.7457,14.0552,8.1767,1172
1.058,-10.0142,3.3017,3.3514,-10.0142,1.9319,12.6179,9.2667,1173
-0.9834,-9.36,0.3552,1.2346,-9.36,3.34,8.2149,6.7471,1174
-11.0353,-9.5046,0.8896,7.2324,-9.5046,4.4432,16.8461,11.7506,1175
-2.7092,-9.8312,-0.1339,1.7362,-9.8312,1.5994,17.4471,16.1716,1176
-5.3189,-10.1185,0.7706,4.0459,-10.1185,2.6545,11.8096,9.2705,1177
-10.0065,-9.7999,0.1773,2.7629,-9.7999,5.0592,13.3134,6.117,1179
-7.0617,-9.6542,1.1263,4.8539,-9.6542,4.7454,14.8068,7.9622,1180
-13.6523,-9.8242,-1.2311,5.7652,-9.8242,7.4614,18.9273,12.774,1181
-2.8428,-9.7545,1.722,3.3642,-9.7545,3.0747,14.2856,11.2677,1182
-2.3681,-9.8875,1.0641,2.4898,-9.8875,3.5433,9.7377,6.9582,1183
-4.931,-9.5921,-0.9005,2.0915,-9.5921,1.1686,10.0408,6.5897,1184
-0.4335,-9.6137,0.1125,0.5187,-9.6137,1.6138,10.9582,6.2461,1185
-2.3666,-9.4507,-0.1347,1.1652,-9.4507,1.3295,8.5457,4.0302,1186
-8.9063,-9.6671,-1.5759,2.8526,-9.6671,4.8117,18.2206,8.8931,1187
-6.0605,-9.8497,9.8565,12.6276,-9.8497,7.1952,35.5418,25.6337,1189
-0.9271,-9.9014,1.0625,1.3567,-9.9014,2.3378,10.7991,7.6784,1190
-2.2501,-9.6264,0.6996,3.3079,-9.6264,5.4488,18.4998,14.1732,1191
-4.7703,-9.658,1.2256,2.4065,-9.658,2.6584,17.0204,7.2594,1192
-1.149,-9.8352,1.1563,2.2529,-9.8352,5.5085,18.6962,13.1846,1193
-21.4044,-9.7692,-1.1669,8.2042,-9.7692,5.5778,15.9895,8.4904,1194
-2.3884,-9.9006,0.2879,1.6768,-9.9006,4.0525,10.9221,9.7569,1195
-5.5141,-9.7207,-1.8047,2.6848,-9.7207,3.2552,9.6882,6.6365,1196
-4.0223,-9.6355,1.9895,3.52,-9.6355,2.3748,10.2383,7.8679,1197
-9.1575,-9.8669,0.5134,4.9893,-9.8669,8.0238,18.1219,11.3141,1199
-7.1319,-9.7017,0.0709,2.5204,-9.7017,4.302,10.876,7.2941,1200
-6.3373,-9.9014,1.2332,6.1526,-9.9014,4.8047,15.4095,11.5013,1201
-2.9296,-9.9117,7.7124,8.8611,-9.9117,4.5636,23.7673,17.4005,1202
-1.2971,-9.41,0.148,1.417,-9.41,4.5587,8.5658,4.903,1203
-3.6547,-9.4274,-0.8881,1.4586,-9.4274,2.3864,13.8512,8.1471,1204
0.0002,-11.2596,3.3431,3.6645,-11.2596,4.031,10.6413,9.0032,1205
-2.2415,-9.7919,1.2578,3.5229,-9.7919,0.8453,10.5451,9.2696,1206
-3.2566,-9.7247,1.0582,2.4788,-9.7247,5.4217,10.2024,8.3069,1207
-11.5583,-9.6899,1.4132,5.3437,-9.6899,8.9091,17.7561,12.4443,1208
-3.8994,-9.8626,0.2854,2.9029,-9.8626,1.5106,10.7811,10.4957,1209
-0.564,-10.6816,4.1329,5.9932,-10.6816,6.3558,22.4948,17.1719,1213
1.032,-10.4042,11.8424,10.017,-10.4042,7.2243,37.2359,32.6294,1214
-2.8589,-10.1808,-0.0934,1.5441,-10.1808,3.0979,28.971,23.3875,1215
-0.505,-10.2143,0.3189,0.6358,-10.2143,1.3319,26.4319,22.836,1216
-7.6775,-9.6603,2.8204,5.567,-9.6603,6.5043,23.8193,13.634,1217
-0.7861,-9.7014,0.795,1.651,-9.7014,3.2982,7.6513,5.8171,1218
-1.8058,-9.6714,0.2215,1.3102,-9.6714,2.975,7.1457,4.5476,1220
-3.2807,-9.9527,-1.0939,1.3842,-9.9527,2.4752,7.5458,4.9627,1221
-6.6584,-9.7951,-0.6733,2.4754,-9.7951,4.4162,9.5701,5.4759,1222
-3.311,-9.9194,0.1663,2.0099,-9.9194,4.6448,13.0632,10.6546,1223
-5.0629,-9.3095,-0.728,2.4072,-9.3095,1.7585,15.2923,6.2952,1224
-4.9081,-10.0735,-0.7841,2.1241,-10.0735,2.3574,7.4427,6.1462,1225
-0.3395,-9.7639,0.516,0.847,-9.7639,2.9396,14.7413,6.2219,1226
-0.3556,-9.2924,2.1519,2.6195,-9.2924,3.5955,12.7514,10.4042,1227
-4.8447,-9.8731,0.6541,3.1154,-9.8731,6.0651,17.7326,6.4397,1229
0.6756,-9.6279,3.136,1.8708,-9.6279,1.4658,7.5766,5.6074,1230
-1.7387,-10.4332,1.789,3.0981,-10.4332,3.0454,17.1271,10.3843,1231
-1.9318,-9.9548,0.2339,1.5,-9.9548,3.7779,9.3068,7.3258,1232
-1.6321,-9.6649,-0.1644,1.192,-9.6649,3.0063,6.8661,4.518,1233
-0.4913,-9.9677,3.4903,3.3108,-9.9677,1.8194,9.7343,8.7604,1234
-1.4155,-9.2578,0.5771,1.6238,-9.2578,1.7053,9.9362,5.3456,1235
-5.8136,-9.7001,2.4398,5.4944,-9.7001,2.808,12.1735,10.2569,1236
-0.6113,-9.7746,-0.1762,0.1939,-9.7746,0.8153,3.3851,2.1564,1237
-20.9548,-9.6783,1.3141,5.9374,-9.6783,6.6825,16.5321,7.1555,1239
-5.8377,-10.0894,-0.3142,3.4549,-10.0894,2.5079,11.3646,6.4862,1240
-3.6063,-9.6202,-1.0312,1.6139,-9.6202,1.9392,12.1228,7.1288,1241
-1.6288,-9.8473,0.2268,1.0643,-9.8473,3.166,6.9494,4.4768,1242
-1.6878,-9.7874,-0.1852,0.7578,-9.7874,1.4684,7.7579,5.2605,1243
-0.9378,-9.6416,1.4485,2.2942,-9.6416,5.3681,11.7354,7.5008,1244
-3.1321,-9.8906,-1.4143,1.1858,-9.8906,1.9123,6.5246,4.697,1245
-0.859,-10.046,0.2104,1.2076,-10.046,3.738,9.9123,8.5945,1246
-11.0468,-9.7413,0.8693,4.7328,-9.7413,6.2832,14.9344,7.4564,1249
-2.0237,-9.8822,-0.1369,0.8501,-9.8822,2.2784,11.1873,6.8063,1250
-2.9448,-9.655,-0.9359,1.1815,-9.655,2.0454,11.0683,9.6295,1251
-1.8594,-9.5018,2.1583,4.6557,-9.5018,6.1051,15.7668,11.7719,1252
-7.9229,-9.5828,-0.074,4.0718,-9.5828,5.3565,11.2026,8.7184,1253
-0.437,-9.9535,0.9874,1.2847,-9.9535,1.7285,7.6464,3.7004,1254
-0.1348,-9.8459,0.2019,0.2924,-9.8459,3.1316,9.7668,5.4312,1255
-1.8787,-9.7312,-0.1961,0.8582,-9.7312,3.2376,9.0462,5.5003,1256
-5.679,-9.8303,-1.2407,1.8636,-9.8303,1.8137,22.1874,7.2496,1257
-10.9127,-9.7573,-0.1784,3.7632,-9.7573,4.9569,11.7683,7.5843,1259
-1.4564,-9.919,-0.1283,0.6346,-9.919,2.1105,5.9803,3.1459,1260
-0.4386,-9.7225,0.5088,1.1702,-9.7225,4.7662,9.5227,5.0735,1261
-2.425,-10.1709,0.2126,2.0197,-10.1709,2.244,18.4639,11.5995,1262
-12.8259,-9.0815,5.2416,7.8422,-9.0815,0.8983,22.1417,15.1241,1263
-5.0666,-9.8077,-0.6793,2.7476,-9.8077,2.6598,13.0001,9.4283,1264
-0.5225,-9.7082,0.3834,0.5071,-9.7082,0.612,7.4954,6.1088,1265
-4.0663,-9.8515,2.6948,5.4673,-9.8515,5.3693,20.0916,19.2113,1266
-4.1611,-9.2089,-0.2703,3.2521,-9.2089,4.5093,15.7305,11.0169,1267
-10.3823,-9.7732,0.2133,4.1369,-9.7732,5.5215,22.1786,8.1256,1269
-2.3589,-9.3559,-0.4772,1.1465,-9.3559,1.9869,13.3743,5.9483,1270
-4.5677,-9.4157,0.1536,3.9001,-9.4157,4.7975,15.7443,9.4953,1271
-2.6443,-9.8845,0.7775,2.3619,-9.8845,3.9653,12.4449,9.1323,1272
-7.7832,-9.7893,-0.4936,8.6351,-9.7893,5.7645,20.8965,17.231,1273
-5.267,-10.0808,-0.4899,2.2987,-10.0808,2.5508,10.748,6.5382,1274
-2.1286,-9.8041,0.9562,2.9741,-9.8041,2.3264,9.7023,7.8076,1275
-0.3611,-9.8527,1.742,2.572,-9.8527,2.2064,8.8384,6.8485,1276
-4.6641,-9.8481,0.4262,2.7688,-9.8481,1.9649,9.5553,7.0214,1277
-15.1944,-10.0648,0.69,5.8101,-10.0648,5.8222,15.0249,11.4203,1278
-10.8096,-9.8957,0.9534,5.8691,-9.8957,6.1792,15.6113,8.6578,1279
-15.3238,-9.6867,1.4563,6.6922,-9.6867,6.8596,22.0882,11.4439,1280
-2.4137,-9.6813,1.3354,2.4933,-9.6813,1.8885,10.3191,6.6866,1281
-1.5582,-10.0126,4.5038,5.6962,-10.0126,3.5533,17.2714,12.4643,1282
-1.3944,-9.7588,1.2321,2.1528,-9.7588,3.0881,13.6751,10.4668,1283
-4.9359,-9.6268,-1.1405,1.8075,-9.6268,2.2666,6.4074,3.3151,1284
-4.7428,-9.3661,-0.2834,2.4482,-9.3661,6.2126,18.6326,14.1121,1285
-7.1415,-10.0312,-0.2027,3.2401,-10.0312,2.8948,13.3614,9.3166,1286
-5.2325,-9.7661,-0.4893,1.7081,-9.7661,5.8413,16.0771,8.0816,1287
-6.7109,-9.7159,-0.4101,2.0171,-9.7159,5.03,13.4184,7.7815,1289
-1.5901,-9.9131,1.3969,2.6754,-9.9131,5.2595,11.5127,8.6856,1290
-2.4939,-10.378,1.8111,3.3455,-10.378,7.1419,18.2692,9.6068,1291
-19.5501,-9.9833,1.587,10.3994,-9.9833,3.9759,23.5347,10.3792,1292
-1.1733,-9.4686,-0.6164,0.5592,-9.4686,2.9428,10.8531,7.1465,1293
-4.4642,-9.8001,-0.104,2.6499,-9.8001,2.3952,12.8954,10.5109,1294
-2.44,-9.861,-0.0691,1.7355,-9.861,3.9421,10.3549,8.8143,1295
-1.1742,-9.6402,0.0368,1.2054,-9.6402,4.8862,17.0103,9.892,1296
-6.3405,-10.0697,3.0398,5.7059,-10.0697,6.5171,23.6039,16.0527,1297
-9.308,-9.7537,1.321,4.5081,-9.7537,8.5958,22.1816,14.1155,1299
-4.892,-9.6199,-0.4519,1.8449,-9.6199,1.7817,10.4023,8.5721,1300
-5.1406,-10.0323,0.3293,3.8688,-10.0323,3.1233,14.3959,7.7853,1301
-5.6133,-10.0543,-0.6911,2.2978,-10.0543,1.3154,15.3737,9.7562,1302
-8.8452,-10.1108,5.0355,8.8491,-10.1108,2.7107,27.6543,25.9782,1303
-18.5366,-9.339,2.902,10.2089,-9.339,2.5152,29.3435,19.7349,1304
-1.0422,-10.0183,0.7942,1.1902,-10.0183,1.4026,19.8765,12.5238,1305
-5.3565,-9.6451,1.1824,3.9305,-9.6451,5.8961,13.3376,10.0912,1306
-11.8292,-9.814,0.5459,4.3217,-9.814,3.396,14.1601,9.3347,1307
-11.6987,-9.7932,4.1938,9.6064,-9.7932,11.828,34.488,12.8443,1309
-8.7454,-9.393,-1.1509,5.3535,-9.393,4.3215,20.9236,9.7053,1310
-6.247,-9.9277,1.2887,4.5686,-9.9277,1.2527,13.701,8.8376,1311
-1.6493,-9.6471,-0.7971,0.6376,-9.6471,1.7283,8.9829,5.6033,1312
-5.6506,-10.1909,2.2096,4.7543,-10.1909,3.3027,17.7166,11.7008,1313
-1.4623,-10.3977,4.7124,7.9071,-10.3977,4.1526,13.1286,10.4578,1314
-9.8451,-9.6037,5.5695,11.1994,-9.6037,1.6425,16.476,15.2641,1315
-7.1829,-9.676,-1.547,6.0476,-9.676,1.218,11.2375,9.1777,1316
-3.998,-9.5787,3.6605,6.8393,-9.5787,7.1782,12.5476,9.4727,1317
-1.0677,-9.9094,1.3274,2.6971,-9.9094,5.3138,13.947,5.555,1319
-7.7852,-9.5103,0.7925,4.2428,-9.5103,9.1769,19.6842,14.6306,1320
-1.352,-9.6411,8.343,7.4377,-9.6411,2.3463,15.9121,14.6586,1321
-11.0654,-9.5684,1.1311,7.5084,-9.5684,8.6435,27.6068,21.1655,1322
-1.2784,-9.2115,1.7689,3.4209,-9.2115,5.5416,16.9206,8.7971,1323
-1.3644,-8.1941,3.4884,3.9697,-8.1941,1.1738,33.3764,20.5687,1324
-5.1484,-9.6115,0.5967,2.7569,-9.6115,5.0875,12.2503,8.203,1325
-16.4985,-9.7647,4.9209,10.9833,-9.7647,2.0078,27.4458,17.0364,1326
-3.4644,-9.8944,0.1381,1.9435,-9.8944,2.6162,17.1291,13.6456,1327
-12.4782,-9.4436,3.4444,7.6895,-9.4436,10.5127,24.416,13.7657,1329
-15.7508,-9.749,0.4604,6.447,-9.749,4.2392,13.7832,8.6071,1330
-11.4013,-9.8126,-1.574,4.0117,-9.8126,3.4534,11.5318,2.8438,1331
-3.4823,-9.137,0.8004,2.2728,-9.137,1.4934,11.4368,9.205,1332
-1.1898,-9.7309,0.1035,1.0675,-9.7309,3.6511,8.4899,6.9686,1333
-2.8077,-9.9349,1.8134,2.9314,-9.9349,3.9832,16.1887,11.1258,1334
-3.2017,-9.5623,0.3677,2.5583,-9.5623,3.1762,7.5867,6.572,1335
-2.9771,-9.565,-0.5882,1.0189,-9.565,1.9574,10.8496,7.409,1336
-3.5653,-9.6234,1.4247,3.4344,-9.6234,6.5942,19.9993,10.7017,1337
-0.5853,-9.6674,0.9247,0.9014,-9.6674,1.429,7.6664,3.837,1338
-3.0365,-9.8895,0.365,3.026,-9.8895,5.4445,18.6426,8.1797,1339
-5.7942,-9.6648,1.5218,3.0905,-9.6648,5.6165,18.7069,8.3723,1340
-7.3538,-9.953,-0.8438,2.5597,-9.953,3.7236,12.7948,9.358,1341
-2.8531,-9.7924,9.338,10.5393,-9.7924,4.789,17.7711,15.0872,1342
-0.098,-10.2187,1.9768,2.3737,-10.2187,3.2155,17.9152,12.4754,1343
-9.8493,-9.597,7.7367,12.0927,-9.597,2.7159,18.9351,13.2685,1344
-0.9591,-9.671,6.4159,6.3354,-9.671,6.9209,17.7539,13.7152,1345
-3.6718,-10.0355,0.8156,2.8495,-10.0355,1.3304,20.7252,11.6315,1346
-0.677,-9.6772,4.5096,8.7931,-9.6772,7.5214,19.0301,7.0711,1347
-5.1112,-9.8016,-0.1078,1.6916,-9.8016,3.1652,13.4587,6.0276,1348
-13.0621,-9.7838,1.557,9.3898,-9.7838,9.5921,21.5535,8.056,1349
-15.342,-9.7199,3.7224,8.1732,-9.7199,2.9361,26.0302,14.7367,1350
-2.5012,-9.7601,4.8743,6.2274,-9.7601,5.9336,24.1982,20.4551,1351
-1.7758,-9.8939,0.113,0.8638,-9.8939,1.9388,20.9547,11.6371,1352
-1.1523,-9.9413,0.0094,0.7002,-9.9413,1.983,7.4291,5.1785,1353
-0.7443,-9.92,1.0677,1.2783,-9.92,3.1391,9.7877,5.6278,1354
-1.0086,-9.4198,2.3018,3.155,-9.4198,2.3416,9.1833,7.0622,1355
-2.2243,-9.3578,4.8027,4.7419,-9.3578,2.3008,15.0033,13.1062,1356
-9.8419,-9.7076,0.8418,6.3736,-9.7076,2.085,14.3864,11.0911,1357
-4.5412,-8.7731,0.8891,2.8465,-8.7731,4.552,21.303,10.8354,1359
-16.6119,-8.6746,2.4445,13.4754,-8.6746,6.2895,41.8219,19.408,1360
-15.8341,-9.6303,-3.262,7.7247,-9.6303,2.6849,20.4143,13.1175,1361
-0.5181,-9.7676,3.8213,3.4016,-9.7676,1.7542,14.0841,9.8643,1362
-7.342,-9.9707,-3.4853,3.0137,-9.9707,6.3578,14.3305,10.6294,1363
-26.6822,-9.6976,3.4196,17.7351,-9.6976,8.2655,28.1782,18.005,1364
-20.0452,-10.2179,19.4289,33.2112,-10.2179,19.9267,46.9991,38.1898,1365
-3.2254,-9.2834,1.5699,3.2295,-9.2834,4.8083,14.9784,11.8662,1366
-2.7949,-9.7149,0.0881,2.1584,-9.7149,4.4764,13.1958,8.7217,1367
-3.1395,-9.8571,-0.7802,1.0899,-9.8571,2.3686,11.9478,4.8948,1368
-0.3061,-9.7439,-0.0611,0.1727,-9.7439,0.9753,5.4727,3.4431,1370
-0.3923,-10.1923,1.9771,2.9209,-10.1923,5.7574,13.7363,11.6581,1371
-5.2912,-9.7603,0.1814,3.5274,-9.7603,4.691,14.5763,10.8768,1372
-9.933,-9.8419,1.6996,7.8746,-9.8419,6.7556,21.5401,13.9753,1373
-3.615,-9.5641,-0.262,1.3205,-9.5641,2.1166,17.296,10.2648,1374
-2.7388,-9.7005,1.5887,3.3626,-9.7005,4.7591,12.7027,8.9229,1375
-6.1146,-9.7876,-1.4482,2.4746,-9.7876,4.904,17.6135,7.0188,1376
-0.8982,-9.594,1.2588,2.0153,-9.594,5.1053,16.3621,13.8612,1377
-1.8287,-10.1584,1.1761,1.7514,-10.1584,2.192,8.5419,6.5491,1378
-7.1235,-10.138,0.7151,7.1315,-10.138,1.4107,18.6094,15.1717,1379
-6.0946,-10.0265,-0.7927,3.7027,-10.0265,1.8196,18.8561,12.95,1380
-3.5997,-9.7918,-0.5477,1.3902,-9.7918,2.41,8.3788,6.0911,1381
-2.5371,-9.5909,-0.3411,1.1713,-9.5909,3.9591,9.5733,6.4029,1382
-3.2765,-9.8242,-0.9026,1.5576,-9.8242,1.7974,10.5462,6.4048,1383
-5.5283,-9.8354,-0.7479,2.0645,-9.8354,3.1391,7.2997,5.1743,1384
-5.7944,-9.7518,0.4128,3.8945,-9.7518,6.3464,17.6756,9.5639,1385
-5.7822,-9.9775,-0.7791,3.2828,-9.9775,3.9542,10.0651,6.0887,1386
-2.0964,-9.9912,-0.4381,0.982,-9.9912,1.6917,7.2979,4.2065,1387
-1.2226,-9.8507,0.328,0.9554,-9.8507,4.0195,10.4957,6.1726,1388
-0.6541,-10.1222,1.5993,2.0431,-10.1222,2.7817,8.8015,8.1432,1389
-3.6177,-9.7712,0.1415,1.6298,-9.7712,3.6793,7.012,5.3094,1390
-3.172,-9.5113,-0.5222,1.894,-9.5113,1.8483,21.2351,11.5797,1391
-0.6383,-9.7418,0.405,0.7131,-9.7418,2.1948,9.549,5.2818,1392
-5.2513,-9.6543,2.133,3.6979,-9.6543,7.5772,19.3744,10.1626,1394
-7.4215,-9.662,0.5056,5.2267,-9.662,1.7611,11.6681,8.833,1395
-0.7617,-9.6678,0.2084,0.9184,-9.6678,3.3535,12.7771,7.116,1396
0.107,-9.3497,0.6508,0.642,-9.3497,2.7911,11.6922,8.949,1397
-5.8248,-9.8067,1.5875,3.2588,-9.8067,4.8584,14.4214,7.5854,1399
-1.4694,-9.675,-0.0059,0.8548,-9.675,1.2637,4.8939,4.2554,1400
-0.3184,-9.7013,0.9692,1.0425,-9.7013,1.7181,7.8035,6.3568,1401
-11.8867,-8.6799,-1.0184,5.342,-8.6799,4.7708,14.8353,13.1151,1402
-9.1916,-9.7053,1.2538,6.4742,-9.7053,7.5458,23.9558,12.545,1404
-1.9322,-9.7828,0.936,1.6682,-9.7828,4.1212,11.8245,8.1877,1405
-0.7987,-9.9487,-0.2172,0.2574,-9.9487,0.6246,5.5985,3.2003,1406
-2.6382,-10.0947,-0.9551,1.3046,-10.0947,2.2443,11.4388,4.1572,1407
-2.5126,-9.5862,-0.4293,1.2856,-9.5862,1.7932,7.4427,6.2829,1408
-4.7797,-9.7674,-1.1595,1.9515,-9.7674,3.2845,12.4155,5.8863,1409
-5.7649,-9.6588,0.3461,3.054,-9.6588,1.2541,18.6228,11.8496,1410
-0.7142,-9.8048,0.8553,1.7881,-9.8048,2.8765,11.8237,6.2686,1411
-3.5783,-9.257,1.3782,2.3028,-9.257,6.2795,21.1742,11.1542,1412
-2.0857,-9.7727,0.9009,1.6771,-9.7727,5.6262,12.7649,7.5925,1414
-0.2462,-9.629,0.3806,0.7922,-9.629,1.8504,8.9984,8.2562,1415
-2.8765,-9.8898,-0.3908,1.7334,-9.8898,1.3806,10.9317,6.4058,1416
-6.3678,-10.1695,2.2261,4.8644,-10.1695,0.931,30.9649,22.5914,1417
-0.7941,-8.4753,-0.073,0.4429,-8.4753,1.8754,13.2613,11.9617,1418
-21.0593,-9.8136,4.728,15.6797,-9.8136,3.2109,23.9244,21.9512,1419
-49.409,-10.2578,4.8443,31.694,-10.2578,7.5352,81.5767,58.2302,1420
-9.4779,-10.639,-1.908,5.5899,-10.639,3.3713,26.4143,16.9742,1421
-9.9446,-10.477,28.563,30.7025,-10.477,22.9835,94.0086,62.7421,1422
-11.9778,-9.767,3.3967,8.3942,-9.767,15.1166,38.27,24.1501,1424
-5.8572,-9.7465,-0.7742,3.0685,-9.7465,2.4128,17.2645,13.3667,1425
-1.8311,-10.1994,1.1215,2.7266,-10.1994,3.3948,14.7459,11.444,1426
-1.3191,-10.0686,-0.1206,0.629,-10.0686,1.4196,8.9545,3.7754,1427
-4.6143,-8.9278,2.792,6.4442,-8.9278,1.4313,11.1208,9.698,1428
-1.408,-9.9226,0.6279,1.978,-9.9226,0.9916,9.4921,5.0451,1429
-5.9462,-9.7567,3.8763,5.7737,-9.7567,5.3126,15.9888,13.8578,1430
-0.55,-9.4745,3.9403,2.893,-9.4745,1.7053,16.0917,12.2029,1431
-3.2638,-9.9606,0.4909,2.6262,-9.9606,1.4309,11.7994,9.1532,1432
-7.009,-9.692,-0.3257,2.3521,-9.692,4.5697,25.8757,7.4758,1434
1.0671,-9.7331,5.2371,3.2476,-9.7331,2.1053,21.4951,14.9043,1435
-11.104,-10.5143,-4.688,3.9044,-10.5143,2.3044,48.8286,41.1923,1436
-1.4074,-9.7145,1.6724,2.5819,-9.7145,3.872,32.3503,23.2307,1437
-0.9016,-9.9694,0.7711,2.2292,-9.9694,4.0282,32.2116,28.1839,1438
-2.2265,-9.3676,0.4734,3.4427,-9.3676,5.6131,24.2805,13.1482,1439
-3.5001,-8.9992,-0.9542,1.4127,-8.9992,2.3638,22.7467,6.6083,1440
-10.9086,-10.2863,-0.8159,4.8151,-10.2863,3.0853,15.0061,12.6586,1441
-28.3234,-9.8592,36.63,44.8,-9.8592,21.9337,51.6903,35.9112,1442
-10.1529,-9.7737,3.6157,14.1572,-9.7737,8.9982,29.7453,11.6849,1444
-0.5452,-9.4582,0.3628,0.9921,-9.4582,2.1254,34.9432,10.8958,1445
-3.994,-8.4511,-0.3039,1.9526,-8.4511,2.2952,40.3121,22.5758,1446
-3.118,-9.7724,-0.0123,1.6938,-9.7724,3.0706,8.8239,4.4346,1447
-18.8962,-10.2545,-2.8155,8.4212,-10.2545,1.1352,14.73,9.5624,1448
-18.2453,-10.0027,-3.4219,9.2175,-10.0027,11.7926,32.7858,22.6517,1449
-1.6494,-9.7705,-0.1883,1.1905,-9.7705,2.7386,6.7285,4.5572,1450
-7.9388,-9.6098,0.2166,5.71,-9.6098,5.5554,20.9505,16.9548,1451
-7.479,-9.1361,-0.1429,3.5527,-9.1361,3.4132,30.3401,7.6601,1452
-6.7556,-9.7237,0.6156,4.3336,-9.7237,6.208,17.2399,7.991,1454
-2.4546,-9.9724,-0.7186,1.5737,-9.9724,3.1619,9.4472,6.5887,1455
-7.1958,-9.5949,1.4115,4.4434,-9.5949,2.0463,10.0236,6.3367,1456
-6.5776,-9.884,-0.3679,2.8612,-9.884,2.2728,8.8891,5.7024,1457
-4.477,-9.6852,1.758,3.2047,-9.6852,7.3016,16.8843,12.9645,1459
-9.1018,-9.8183,-0.6564,3.0934,-9.8183,4.4773,13.2766,8.1859,1460
-0.337,-9.2694,0.6924,1.1749,-9.2694,2.6779,14.8624,10.5103,1461
-5.8455,-9.8532,-1.0825,2.3144,-9.8532,5.236,15.0463,9.1121,1462
-15.4285,-9.7255,-1.1482,4.6153,-9.7255,5.514,16.3568,6.8662,1464
-1.5674,-10.1433,1.2909,2.0844,-10.1433,2.9042,8.9809,7.4092,1465
-10.5173,-9.9191,-2.6416,4.116,-9.9191,3.4867,8.753,7.2567,1466
-1.062,-9.8199,0.4677,1.4369,-9.8199,5.508,13.6281,5.3981,1467
-3.2314,-9.5544,-1.476,1.3184,-9.5544,1.8853,9.9697,7.5422,1468
-15.7062,-7.8353,-1.9132,5.974,-7.8353,1.9477,43.9568,25.6228,1469
-9.2037,-9.9525,-1.353,4.9994,-9.9525,1.7292,12.4536,8.379,1470
-6.9747,-10.0372,10.5741,13.6433,-10.0372,4.4157,22.9335,17.6866,1471
-4.5534,-9.8424,2.5617,4.1064,-9.8424,4.3089,16.2582,8.876,1472
-6.1086,-9.547,0.4666,2.1836,-9.547,3.556,17.3956,6.8965,1474
-7.5671,-9.9535,-0.9301,3.5032,-9.9535,6.3969,14.8591,8.8284,1475
-2.4121,-9.5325,4.5947,4.4653,-9.5325,1.4215,11.8911,9.5977,1476
-4.098,-9.822,1.3314,3.3319,-9.822,5.4119,13.8823,11.7597,1477
-17.4444,-9.6309,-1.5866,8.7822,-9.6309,2.6096,16.9223,14.3371,1478
-3.8462,-9.7531,0.824,3.4676,-9.7531,7.0192,12.9928,10.8064,1479
-1.0134,-10.1824,0.2792,1.4158,-10.1824,1.8866,9.4085,7.1909,1480
-4.6154,-10.5161,-0.3745,2.8399,-10.5161,3.7208,15.605,4.8518,1481
-4.8422,-9.9779,-0.1799,3.0562,-9.9779,5.632,15.163,12.3357,1482
-5.3668,-9.5898,0.7734,3.5859,-9.5898,4.0974,24.8498,8.1029,1484
-2.5891,-9.7767,-0.1612,1.6153,-9.7767,4.1725,10.1167,6.5779,1485
-1.8343,-9.7312,-0.0717,1.0573,-9.7312,2.2068,11.1522,8.0305,1486
-2.3914,-9.7832,-0.8555,1.0399,-9.7832,2.6123,5.5448,4.1244,1487
-5.2038,-9.9622,-2.0506,2.0335,-9.9622,1.1011,13.2129,10.9876,1488
-2.9717,-9.2907,0.14,2.6428,-9.2907,1.9664,29.4198,28.682,1489
-4.8088,-9.8188,7.2141,9.873,-9.8188,6.2156,40.38,22.8713,1490
1.3631,-9.8833,5.7665,2.7199,-9.8833,3.5367,18.7785,11.2808,1491
-8.5993,-9.6332,0.7349,5.6305,-9.6332,1.796,17.0151,15.6849,1492
-12.5104,-9.7745,-0.291,5.4403,-9.7745,7.0999,33.7085,19.7452,1494
-6.9746,-9.8028,3.9427,5.4699,-9.8028,1.8302,28.2089,20.5243,1495
-1.8286,-9.4565,5.2584,8.9271,-9.4565,6.9001,14.0402,11.8963,1496
-0.496,-9.6027,6.2751,4.8626,-9.6027,1.3643,14.1704,11.8619,1497
-2.707,-9.5736,-0.4884,2.1462,-9.5736,3.1693,13.6357,11.5368,1498
-2.8914,-9.5405,-0.0088,1.3761,-9.5405,1.5878,7.9041,4.0882,1499
-1.3944,-9.7019,0.5624,1.4966,-9.7019,4.294,7.1935,6.2504,1500
-2.6744,-9.5265,-0.4691,1.67,-9.5265,1.4749,5.6216,3.5104,1501
-0.2673,-10.1871,10.0522,7.179,-10.1871,4.0575,21.0386,20.0745,1502
-6.1543,-9.6385,3.162,5.4902,-9.6385,9.4335,19.6189,9.7961,1504
-5.6328,-9.6729,0.816,4.2829,-9.6729,3.1835,13.3834,7.661,1505
-1.5281,-9.9874,0.3394,1.6841,-9.9874,2.8086,10.6425,7.8564,1506
-1.6944,-9.9439,0.8831,2.2592,-9.9439,1.7816,12.213,10.1737,1507
-0.9027,-9.5316,-0.1852,0.4987,-9.5316,1.3619,5.1577,4.7254,1508
-2.1187,-9.8175,0.7649,2.5761,-9.8175,3.0967,9.7169,9.1013,1509
-6.7947,-8.1048,0.4289,3.9,-8.1048,4.6867,17.1811,7.6061,1510
-5.0183,-9.7048,1.1536,4.0907,-9.7048,0.8932,14.2149,8.2069,1511
-0.99,-9.6726,0.8344,1.2458,-9.6726,2.6388,10.4235,8.1941,1512
-3.7131,-9.7496,-0.2408,1.3826,-9.7496,2.1634,7.7732,4.8924,1513
-0.9351,-9.7045,0.2797,0.703,-9.7045,1.4648,7.3028,4.1886,1514
-9.4323,-9.8547,1.6802,7.8924,-9.8547,5.2427,17.1905,13.6674,1515
0.3802,-9.7383,9.3716,6.642,-9.7383,3.7222,24.6078,22.1818,1516
-2.7456,-10.1579,0.1242,1.2773,-10.1579,1.8305,10.919,6.2784,1517
0.0248,-9.5263,1.756,1.4373,-9.5263,1.7031,6.8593,5.2086,1518
-2.8885,-9.888,0.4181,3.3486,-9.888,3.2013,18.1088,9.3568,1519
-7.6454,-9.5325,2.6401,5.4666,-9.5325,5.4481,29.2054,13.2158,1520
-2.9747,-8.7651,-0.6102,1.9301,-8.7651,6.505,15.694,11.9953,1521
-7.0781,-8.9182,1.5334,5.0264,-8.9182,2.4099,25.9458,11.6783,1522
-1.0525,-8.6488,0.7635,1.5149,-8.6488,1.8261,17.3865,6.4901,1523
-4.3172,-9.6958,0.3823,1.6772,-9.6958,4.0791,14.258,7.3575,1524
-16.1118,-9.5814,0.5764,4.8096,-9.5814,2.511,27.2515,8.6652,1525
-7.2093,-9.5837,0.4774,4.2547,-9.5837,1.5176,15.4366,11.3164,1526
-2.727,-9.6096,0.3682,1.593,-9.6096,2.1724,11.5646,6.1426,1527
-0.0287,-9.4394,0.6189,0.8437,-9.4394,2.4755,8.516,6.7421,1528
-1.6725,-9.7974,-0.284,0.7512,-9.7974,1.4065,5.0104,4.3864,1529
-2.218,-9.9385,0.4826,2.0094,-9.9385,3.0309,12.443,6.8492,1530
-1.7471,-9.7624,-0.4432,0.7933,-9.7624,0.7696,4.6865,4.1737,1531
-0.9947,-9.7627,0.5153,1.4041,-9.7627,3.1676,10.3238,5.1714,1532
-1.4043,-9.7818,0.8428,2.3925,-9.7818,3.8301,10.9454,7.5793,1535
-0.466,-9.5221,0.4393,0.9417,-9.5221,1.206,9.8527,3.5392,1536
-1.8593,-9.7034,2.0445,2.1728,-9.7034,5.9605,10.8109,7.9456,1537
-3.6994,-10.0112,1.0545,2.7763,-10.0112,5.6599,18.0136,10.2022,1538
-11.4681,-9.5918,-2.9782,4.7246,-9.5918,2.6267,11.0631,4.3985,1539
-7.2972,-9.7723,-0.9636,2.5339,-9.7723,5.982,14.0297,6.8873,1540
0.3705,-9.7652,1.3267,0.6476,-9.7652,3.8393,13.9019,9.9164,1541
-5.9192,-9.8623,0.6527,2.8987,-9.8623,5.116,14.3301,8.2203,1542
-1.8019,-9.758,0.2912,1.2203,-9.758,5.3324,17.9609,4.7434,1543
-8.6408,-9.581,2.371,5.5013,-9.581,7.5528,33.1999,10.8518,1544
-5.0663,-9.7119,-0.5056,2.9675,-9.7119,4.9804,11.2247,7.1236,1545
-14.2023,-9.749,-1.5652,6.1407,-9.749,6.6061,14.6333,10.8686,1546
-14.7752,-9.7998,-2.8481,6.0644,-9.7998,3.0597,12.0814,8.7241,1548
-1.7648,-10.1969,3.4912,4.4238,-10.1969,5.5037,17.6375,14.5757,1549
-5.7563,-10.0222,-1.335,2.5777,-10.0222,3.7274,11.3922,4.1184,1550
-6.1641,-9.9974,1.1961,3.8611,-9.9974,3.8868,8.3331,6.9521,1551
-0.8801,-9.604,0.8904,1.7557,-9.604,2.2584,9.9351,4.9381,1552
-0.2257,-9.9116,1.0915,1.3403,-9.9116,3.0512,9.9278,8.4897,1553
-1.697,-9.6953,0.2613,0.9032,-9.6953,3.5465,7.9743,4.4572,1554
0.4469,-9.9622,3.3259,3.7701,-9.9622,7.1248,21.2572,17.45,1555
-1.0406,-10.1331,-0.0396,0.7106,-10.1331,1.9038,5.0446,4.2705,1556
-1.7972,-9.8928,-0.1969,0.818,-9.8928,1.2099,8.5062,4.3024,1557
-2.7231,-9.8392,0.2077,1.3321,-9.8392,3.1088,9.7255,4.9484,1559
-3.2269,-9.5858,0.7629,1.7863,-9.5858,3.0974,13.9131,7.062,1560
0.2819,-9.8594,0.8375,0.8349,-9.8594,1.1645,15.1239,9.5343,1561
-0.7152,-9.7236,-0.1633,0.316,-9.7236,0.8006,10.1376,7.4688,1562
-0.1319,-9.7518,0.1274,0.2255,-9.7518,1.3023,14.5323,13.0434,1563
-1.3678,-9.7641,0.6219,1.3651,-9.7641,1.0652,12.3273,6.769,1564
-2.5558,-9.7557,-0.707,0.709,-9.7557,1.4163,3.7347,1.925,1566
-0.1107,-9.7403,0.6765,0.5669,-9.7403,2.3798,7.0182,3.5384,1567
-3.8167,-9.9519,-0.8521,1.4143,-9.9519,3.8553,38.1001,31.2023,1568
-6.9756,-9.6281,2.0559,6.8852,-9.6281,5.2348,25.1614,13.2039,1569
-1.2365,-9.5588,6.5778,7.0178,-9.5588,6.3472,32.8063,26.3824,1570
-5.0652,-9.7101,24.7581,30.0685,-9.7101,7.8814,47.3308,42.3874,1571
-16.0496,-9.8479,18.8658,29.4386,-9.8479,12.4056,42.1523,31.8385,1572
-5.738,-9.7792,1.4997,4.9748,-9.7792,5.6769,34.3291,12.8032,1574
-7.062,-10.0995,-0.9169,3.6338,-10.0995,3.7964,41.4008,30.3559,1575
-2.1387,-9.7529,1.9259,3.0892,-9.7529,0.8411,39.8067,29.9611,1576
-6.5181,-9.2385,-0.8138,4.2403,-9.2385,4.533,33.4456,22.0531,1577
-3.4539,-9.9568,2.5355,5.5366,-9.9568,4.3829,28.0825,13.9534,1579
-25.9524,-9.7855,11.5266,22.4287,-9.7855,14.5905,39.2261,31.7301,1580
-5.9473,-9.9644,3.0776,6.5441,-9.9644,2.096,28.3548,26.1455,1581
-0.848,-9.6215,0.4666,0.9441,-9.6215,2.6635,28.2908,20.8694,1582
-6.8614,-9.9258,1.4345,4.2101,-9.9258,4.093,32.7434,14.2489,1584
-11.5504,-9.5039,1.9864,5.9348,-9.5039,1.5507,31.1024,27.853,1585
-2.5569,-10.0139,0.0929,3.4014,-10.0139,3.4619,13.2931,6.5035,1586
-3.9653,-9.7191,16.0073,19.8273,-9.7191,6.7475,43.9394,38.1414,1587
-15.5344,-9.6861,-5.6735,6.4439,-9.6861,4.0388,10.6521,7.1391,1588
-69.4603,-9.3069,-6.5069,32.9635,-9.3069,11.165,53.0946,29.2506,1590
11.1202,-9.6319,19.7949,8.6803,-9.6319,1.5047,35.5054,31.449,1591
-0.0713,-9.601,4.306,3.7439,-9.601,5.2056,13.5846,7.0289,1592
-54.9171,-9.7108,-17.3012,20.4118,-9.7108,12.0021,24.4283,6.2832,1593
-0.2961,-9.7391,6.8084,4.6575,-9.7391,4.5482,24.1914,7.3323,1594
-4.9376,-9.7336,-1.0287,1.7248,-9.7336,2.6496,19.1523,2.8836,1595
-3.2666,-9.7587,-0.1076,1.309,-9.7587,2.6687,6.6027,1.9381,1596
-0.7304,-9.7648,-0.0395,0.1663,-9.7648,0.4194,1.9809,0.8028,1597
