AYGX_min,AZ_mean,AYGX_mean,AYGX_std,AZ_mean.1,GX_std,Gnorm_max,Gnorm_median,timestamp
-1.5625,-10.2104,0.5308,1.8514,-10.2104,1.9981,14.7491,12.2944,514
-8.6446,-8.933,-0.2005,4.7544,-8.933,2.4689,19.9921,8.2398,515
-54.0306,-5.9862,6.6933,29.3235,-5.9862,14.1598,45.0709,25.4847,517
-11.4229,-10.0183,-0.5135,4.7084,-10.0183,6.8035,19.2381,10.7678,518
-7.618,-10.022,0.5566,4.4478,-10.022,1.0573,16.7633,11.588,519
