AYGX_min,AZ_mean,AYGX_mean,AYGX_std,AZ_mean,GX_std,Gnorm_max,Gnorm_median,timestamp
-1.7663,-9.5348,-1.5716,0.114,-9.5348,0.0579,4.4278,4.3823,0
-1.8299,-9.5357,-1.5929,0.1234,-9.5357,0.0616,4.4538,4.41,1
-15.3247,-9.542,-2.0427,7.8926,-9.542,10.4455,22.8747,7.454,27
-34.0372,-9.6873,-4.7881,12.2262,-9.6873,4.2467,16.5166,8.8613,28
-41.1907,-9.5578,-6.9249,28.7865,-9.5578,12.4385,33.9105,17.8563,29
-7.0536,-9.6543,3.7828,4.8218,-9.6543,2.7154,10.4795,7.2949,30
-4.4763,-9.6925,0.2728,1.9602,-9.6925,1.9178,8.3383,6.439,31
-4.2496,-9.6806,-0.222,1.4992,-9.6806,2.4523,9.4699,6.9019,32
-18.2826,-9.6031,0.19,5.812,-9.6031,1.9462,32.0996,10.0651,33
-3.6109,-9.1811,2.636,5.9012,-9.1811,6.0749,61.4771,12.6544,34
-15.3691,-9.6232,-2.4031,5.9034,-9.6232,4.1285,16.5489,11.9011,35
-3.4473,-9.6958,-0.4239,1.9408,-9.6958,1.886,23.872,21.3927,36
-1.1147,-9.8981,-0.1264,0.6868,-9.8981,1.4338,31.9761,30.0826,37
-11.9505,-10.0343,3.2547,8.571,-10.0343,0.9705,33.3681,29.4125,38
-4.1086,-9.6866,-0.9589,1.6778,-9.6866,1.8642,21.5515,19.4808,39
-4.1192,-9.6916,7.6433,10.8354,-9.6916,2.6862,31.2658,28.6218,40
-0.3888,-9.7213,1.5074,1.6141,-9.7213,1.9601,13.283,8.3253,41
-4.3279,-10.2802,-0.3887,2.1209,-10.2802,2.1212,8.9136,5.1775,42
-10.1467,-9.6236,0.8627,3.6714,-9.6236,2.9033,15.1996,6.7421,44
-7.9919,-9.4122,-0.5853,5.072,-9.4122,1.5497,13.768,10.8128,45
-2.9645,-10.2128,0.7835,2.0529,-10.2128,1.8588,12.9214,6.4616,46
-1.6903,-9.5523,0.0752,1.2738,-9.5523,2.9267,11.1875,7.5225,47
-3.0973,-10.0546,-0.5347,1.9,-10.0546,1.6613,19.1569,7.0591,48
-2.3168,-9.7426,-0.2962,1.0878,-9.7426,1.4374,9.5867,7.6013,49
-5.8088,-6.5152,-0.2025,3.5421,-6.5152,13.8583,159.1544,11.4241,53
-3.7129,-9.5646,-0.4606,1.5693,-9.5646,1.6644,15.4016,9.3965,54
-0.5794,-9.7105,-0.1261,0.2652,-9.7105,0.8013,7.9492,4.1279,56
-19.9225,-7.3719,-1.9015,7.3694,-7.3719,3.6822,49.3384,11.0899,57
-8.7809,-9.836,-1.2541,5.9854,-9.836,4.8247,12.1893,9.0914,58
-18.2163,-9.3163,-1.0443,7.5684,-9.3163,3.3268,32.6048,9.725,59
-2.3893,-9.8927,2.4832,3.6069,-9.8927,0.878,11.5611,7.3367,60
-5.2241,-9.7331,-1.214,3.2064,-9.7331,0.6092,19.7494,11.0214,61
-1.5904,-9.7318,-0.4829,0.7385,-9.7318,1.0364,11.8639,11.2165,62
-1.6688,-9.777,-0.5193,0.555,-9.777,0.9754,7.2019,4.969,63
-2.6584,-10.0218,-1.4346,0.9446,-10.0218,0.8977,21.1074,16.9522,64
-1.9434,-9.8372,-0.1854,0.9637,-9.8372,1.376,24.8315,23.3678,65
-8.3466,-9.713,-0.2099,3.3501,-9.713,3.6424,14.5629,9.0875,66
-4.6379,-9.7266,0.9503,3.4355,-9.7266,1.4635,10.9499,9.1399,67
0.3159,-9.7358,1.9981,1.6612,-9.7358,1.4607,6.5737,5.3567,68
-1.6418,-9.6266,0.6482,1.7993,-9.6266,2.0517,12.7782,10.1845,69
-4.7688,-9.5752,-1.047,2.1643,-9.5752,1.7002,9.5911,8.5495,70
-5.7194,-9.6317,-0.7567,2.0366,-9.6317,1.8592,21.7995,20.8063,71
-4.303,-9.3849,0.4851,2.9091,-9.3849,2.8451,12.5093,7.1064,72
-14.9337,-9.4832,0.9845,8.041,-9.4832,6.421,17.2172,13.0767,73
-14.6541,-10.0707,2.1067,9.6902,-10.0707,5.927,19.7266,17.0239,74
-6.4586,-10.0631,-0.9706,2.4476,-10.0631,2.3143,20.6497,6.9647,75
-1.7054,-9.6264,0.9369,1.926,-9.6264,1.6262,10.3255,7.0575,76
-2.0592,-9.4917,-0.5203,0.9102,-9.4917,1.3012,9.8848,6.3544,77
-2.7794,-9.3548,-0.313,2.2948,-9.3548,4.0527,11.322,8.3893,78
-4.6424,-9.6297,-1.0134,1.9675,-9.6297,1.3191,9.5565,6.9639,79
-0.028,-9.6185,0.183,0.2222,-9.6185,0.4287,6.7253,4.3961,80
-8.5919,-9.7283,-0.7016,2.3489,-9.7283,1.976,12.3816,5.7102,81
-2.7171,-9.832,-0.0002,0.894,-9.832,1.6261,9.8642,5.7768,82
-2.4762,-9.6049,-0.3023,0.7167,-9.6049,1.1899,10.9239,5.3224,83
-0.9591,-10.076,-0.1852,0.4466,-10.076,0.9886,6.6252,4.5317,84
-3.5408,-9.5192,-0.1864,1.2234,-9.5192,2.2373,11.9923,5.804,85
-2.8954,-9.632,0.1678,1.9135,-9.632,2.6151,14.2635,5.7594,86
-6.1148,-9.5525,-0.4541,2.3048,-9.5525,3.2558,13.971,6.4616,87
-9.1681,-9.9028,0.3807,2.9262,-9.9028,3.5417,14.7288,7.4264,88
-3.3606,-9.7124,0.2159,1.9687,-9.7124,3.6882,12.7616,7.7957,89
-2.753,-9.3784,-0.1907,0.9852,-9.3784,1.6335,13.6635,5.6451,90
-0.0131,-9.7899,0.8719,0.819,-9.7899,1.0233,9.7675,7.1484,91
-1.16,-9.7243,-0.1426,0.3576,-9.7243,1.3171,13.8282,4.7835,92
-1.8722,-9.7392,0.1473,1.0706,-9.7392,1.2237,12.6739,4.2226,93
-3.091,-9.9004,-0.1079,2.3184,-9.9004,1.4664,6.6151,5.5154,94
-5.8057,-9.7117,-0.5259,2.1318,-9.7117,4.3974,11.8015,8.5184,95
-2.5556,-9.8158,0.8952,1.9201,-9.8158,2.415,10.7602,7.3967,96
-7.2136,-9.2318,-1.0219,2.695,-9.2318,1.5995,11.4073,6.2853,97
-3.4915,-9.8877,-0.7493,1.6475,-9.8877,1.4348,13.1682,7.0347,98
-1.2211,-10.0705,0.0465,0.9837,-10.0705,1.9424,6.9806,6.1633,99
-3.0696,-9.4139,-0.4938,1.8315,-9.4139,1.0603,11.8164,5.4733,100
-1.4426,-9.7804,-0.019,0.6407,-9.7804,0.9584,13.0392,4.716,101
-2.7423,-9.7824,-0.4547,0.9108,-9.7824,1.3177,14.5963,6.1098,102
-5.7693,-9.9684,-0.3158,1.7829,-9.9684,2.5027,11.7797,5.8956,103
-4.2755,-9.7504,-1.0674,1.7035,-9.7504,1.9866,13.5881,4.1304,104
-0.8772,-9.7228,0.0486,0.6156,-9.7228,1.1632,11.1221,5.274,105
-5.7193,-9.7747,-1.0415,1.4068,-9.7747,1.6794,14.701,6.3202,106
-2.6716,-9.1332,-0.5071,0.9422,-9.1332,1.4043,10.0858,6.7305,107
-0.8444,-9.6222,-0.2469,0.8582,-9.6222,1.228,9.2588,5.4754,108
-3.2732,-10.1353,-0.6574,1.4274,-10.1353,1.7747,12.9515,3.911,109
-4.3329,-10.0366,-0.6976,1.6469,-10.0366,1.5814,11.043,6.0789,110
-5.586,-10.1843,-0.4184,2.273,-10.1843,1.9964,11.5562,6.1535,111
-2.1524,-9.7609,-0.351,0.8105,-9.7609,1.8845,13.4178,5.924,112
-5.1988,-9.3543,-0.6141,1.9099,-9.3543,2.5995,12.6402,6.9455,113
-3.9131,-9.8731,-0.2585,1.2446,-9.8731,1.6208,11.6886,6.4818,115
-8.8939,-9.7622,2.534,4.4727,-9.7622,4.9195,14.7681,10.3809,116
-2.9458,-9.3365,-0.1921,1.4254,-9.3365,1.9545,19.4194,8.0381,117
-9.1114,-7.9096,-1.3076,4.3441,-7.9096,2.1826,16.4903,8.641,118
-0.9821,-9.8395,0.1813,0.8351,-9.8395,1.7303,14.4992,12.9818,119
-0.61,-9.6424,-0.3255,0.2298,-9.6424,1.3674,4.9384,3.6462,120
-0.6562,-9.702,0.1968,0.8085,-9.702,1.1779,12.4298,11.2063,121
-1.7465,-9.6288,2.0715,2.2676,-9.6288,2.7453,17.0721,12.3814,122
-2.2353,-9.8788,-1.1559,1.118,-9.8788,1.9262,17.4663,13.6373,123
-4.9653,-9.4634,-0.552,2.0446,-9.4634,2.1673,31.2624,17.7425,125
-13.8447,-9.6871,1.2079,8.3714,-9.6871,6.8615,37.5162,17.4077,126
-15.5958,-9.8418,-1.8611,5.3639,-9.8418,2.7338,14.9336,9.2148,127
-5.7291,-9.7621,0.2299,3.0101,-9.7621,1.7714,12.3835,8.3567,128
-2.0545,-9.6082,-0.2327,0.785,-9.6082,0.5198,16.3814,14.948,129
-2.507,-9.7996,1.2381,2.5852,-9.7996,1.7157,15.5196,13.8662,130
-7.884,-9.5802,-1.8373,4.682,-9.5802,0.8128,34.1896,28.7834,131
-9.8934,-9.715,1.3754,3.9742,-9.715,5.2769,21.5139,11.9422,132
-0.3273,-9.6483,0.2708,0.4548,-9.6483,1.6872,6.9464,6.0968,133
-4.509,-9.7111,0.6648,3.4959,-9.7111,6.2271,18.3418,10.6296,135
-10.5872,-9.7181,0.124,5.2335,-9.7181,7.5595,18.0122,12.402,136
-6.2006,-9.7327,1.6358,5.1844,-9.7327,5.5823,11.0931,9.141,137
-5.8361,-9.6798,-1.7357,2.3587,-9.6798,3.2865,9.9268,7.2293,138
-5.2024,-9.6587,0.2235,2.8948,-9.6587,2.7123,14.5927,9.6125,139
-2.0163,-9.7093,-0.533,0.8012,-9.7093,2.583,8.3182,5.9673,140
-1.9057,-9.9438,-0.7987,0.9328,-9.9438,0.8138,9.0035,4.945,141
-0.6689,-9.7619,0.5594,0.8274,-9.7619,2.3455,9.8939,6.8904,142
-1.854,-9.7363,-0.138,0.708,-9.7363,2.2805,9.0112,5.6841,144
-1.2691,-9.6679,-0.0535,0.4366,-9.6679,1.3974,7.4123,4.7299,145
-1.5297,-9.7596,-0.4636,0.4148,-9.7596,0.9526,6.7758,4.9384,146
-0.9084,-9.7248,0.1555,0.4171,-9.7248,1.6093,7.712,6.1161,147
-3.9123,-9.7266,-0.0589,1.1052,-9.7266,3.4614,14.2284,6.2058,148
-4.6326,-9.7497,-0.0608,1.2165,-9.7497,2.2978,10.8159,5.2261,150
-1.4695,-9.7006,-0.0159,0.8326,-9.7006,2.0588,14.4503,8.3542,151
-2.8766,-9.7769,0.1648,1.9618,-9.7769,0.9385,12.588,10.6125,152
-0.6835,-9.7907,0.5626,0.6904,-9.7907,1.1915,8.311,6.168,153
-3.4963,-9.4646,-1.3917,1.8444,-9.4646,1.1588,9.784,8.3681,154
0.0185,-9.6554,0.5702,0.6526,-9.6554,0.9529,8.0888,5.7316,155
-0.5959,-9.7405,-0.3114,0.3224,-9.7405,0.8201,6.6785,6.0111,156
-1.903,-9.755,-0.411,0.5886,-9.755,1.3144,15.8756,9.7303,157
0.0498,-9.7989,0.5624,0.6244,-9.7989,1.4244,19.5691,18.5633,158
-0.5369,-9.693,2.2879,1.5909,-9.693,2.6292,14.4988,7.974,160
-3.3579,-9.7196,-0.2772,1.2949,-9.7196,2.3247,7.1029,4.7896,161
-1.3413,-9.7022,0.1488,0.7844,-9.7022,1.7251,6.8948,5.5231,163
-1.7042,-9.6846,-0.141,0.7583,-9.6846,1.6634,7.7756,5.365,164
-3.4251,-9.7168,-0.3363,1.3814,-9.7168,1.5125,12.0258,9.1865,165
-4.4438,-9.7339,0.4199,2.9801,-9.7339,3.6522,15.3955,6.4541,166
-3.422,-9.7013,-1.44,1.8007,-9.7013,0.8519,19.2313,17.5001,167
-5.1813,-9.7128,-0.3944,1.6675,-9.7128,3.4514,21.1307,17.8391,168
-9.2004,-9.712,-1.1013,4.6211,-9.712,2.5295,10.9936,9.739,169
-14.9073,-9.6666,-2.7239,6.4247,-9.6666,6.6226,28.5921,19.5142,170
0.0378,-9.5244,4.1629,2.3463,-9.5244,1.5072,12.695,7.493,171
-28.5149,-9.4837,1.1109,21.305,-9.4837,10.4691,16.314,10.9628,172
-9.3326,-9.6662,1.0375,6.3296,-9.6662,7.415,14.6322,7.7948,173
2.5543,-9.6541,3.5906,0.4955,-9.6541,0.5389,6.0517,5.6196,174
-7.5919,-9.7076,-1.032,2.3135,-9.7076,2.8028,26.5495,22.5203,175
-3.7088,-9.6855,-0.0572,1.8683,-9.6855,3.1168,12.7499,8.5928,176
-7.5122,-9.6574,-3.7293,2.2032,-9.6574,1.1619,11.0542,9.5977,177
-3.33,-9.6371,1.1123,3.895,-9.6371,3.7053,16.6891,9.4681,178
-5.6352,-9.8069,1.8468,3.9656,-9.8069,6.4603,30.6359,14.3898,180
-27.4921,-9.7688,-1.1698,6.7336,-9.7688,5.3074,20.6103,12.7242,181
-8.9673,-9.67,-0.5167,2.9468,-9.67,3.4475,11.3594,7.5071,182
-0.1671,-9.4492,0.9159,0.8356,-9.4492,1.6455,11.0341,8.4225,183
-1.2582,-9.8023,-0.4129,0.397,-9.8023,0.6905,5.422,3.7942,184
-0.7302,-9.7257,0.2528,0.4842,-9.7257,1.6615,9.1771,5.9317,185
-3.5571,-9.7178,-0.1204,0.7337,-9.7178,1.2588,7.6884,5.809,186
-1.8803,-9.6503,-0.3851,0.9529,-9.6503,0.8925,7.5929,7.0663,187
0.09,-9.9137,0.3062,0.4047,-9.9137,0.66,7.2745,5.0931,188
-2.6393,-9.7095,-0.4103,1.0688,-9.7095,2.1481,15.5851,11.4766,189
-1.0683,-9.6586,0.0945,1.1454,-9.6586,0.6567,7.3476,6.0087,190
-2.9037,-9.7136,-0.4109,1.5187,-9.7136,1.18,18.4722,17.3475,191
-7.2594,-9.6931,-0.3643,2.6226,-9.6931,3.5026,21.3369,11.7073,192
-2.0761,-9.7511,0.257,1.4691,-9.7511,1.735,8.3052,3.9144,193
-7.4664,-9.725,-0.8323,3.7881,-9.725,2.1704,19.8253,16.3045,194
-8.3335,-9.7034,-0.3984,4.8181,-9.7034,6.782,15.1056,11.9923,195
-7.3848,-9.6868,-0.4368,3.2008,-9.6868,6.7939,16.5672,10.1383,196
-0.6908,-9.7449,0.3785,0.7017,-9.7449,3.147,10.3295,8.5415,197
-3.7843,-9.6809,-0.077,1.7679,-9.6809,2.9141,11.3943,9.2446,198
-0.1165,-9.6494,2.4753,2.7571,-9.6494,2.9581,11.596,9.5429,199
-6.0356,-9.6468,-0.7015,3.3981,-9.6468,4.1166,13.9025,12.0075,200
-10.6471,-9.6483,-0.0325,5.3854,-9.6483,6.7335,16.0134,14.0544,201
-4.5407,-9.6926,0.375,2.3104,-9.6926,3.723,13.1345,7.934,202
-11.3679,-9.4572,-5.1153,4.0117,-9.4572,2.0748,10.2874,7.8342,203
-6.7628,-9.7497,0.1763,3.2523,-9.7497,1.6691,8.9234,8.1876,204
-4.3014,-9.7132,-1.222,1.7993,-9.7132,4.8915,11.3048,9.9737,205
-7.5245,-9.7286,-0.1994,4.0719,-9.7286,4.7011,16.3356,8.0322,206
-0.6076,-9.7479,1.5795,1.7967,-9.7479,2.6739,10.7672,8.6095,207
-13.1918,-9.8037,1.1692,6.3379,-9.8037,7.6881,15.3404,10.9009,208
0.0015,-9.6643,2.2358,2.6225,-9.6643,2.7784,8.971,6.7771,209
-1.9544,-9.5454,4.488,4.1006,-9.5454,4.7389,16.1548,13.4337,210
-9.3593,-9.7296,-1.7234,3.3869,-9.7296,4.7301,13.9553,7.6696,211
-6.8555,-9.7246,1.1443,6.093,-9.7246,6.5653,17.3792,11.022,212
-8.1854,-9.8803,2.3765,6.457,-9.8803,4.2122,19.2046,14.7611,213
-10.1212,-9.339,0.1036,3.932,-9.339,5.6408,15.2521,9.9838,215
-9.2964,-9.5866,-0.818,3.3241,-9.5866,3.6581,24.8725,9.0482,216
-11.2254,-9.7694,-0.7052,5.1904,-9.7694,1.9139,11.118,8.2929,217
-10.3742,-9.6895,-0.5073,6.3791,-9.6895,4.3124,16.0417,10.2823,218
-8.2667,-9.9855,-0.7275,4.6436,-9.9855,3.8438,17.9211,11.238,219
-4.4935,-9.6766,0.2669,3.3863,-9.6766,1.1416,11.3627,8.7023,220
-1.8889,-9.894,2.5306,5.0616,-9.894,4.2216,14.1781,12.6182,221
-9.6368,-9.6625,1.124,5.2222,-9.6625,6.2718,17.0893,11.2067,222
-2.2682,-9.7264,0.1611,1.5898,-9.7264,2.8585,15.8618,7.927,223
-5.2863,-9.6229,-0.3899,1.0973,-9.6229,1.8811,16.7496,5.69,225
-1.6383,-9.7126,0.8195,1.1145,-9.7126,2.9659,10.7513,6.9899,226
-2.9772,-9.7832,0.0944,1.4643,-9.7832,2.0897,20.2894,6.5274,227
-6.0655,-9.4962,-0.9132,2.5649,-9.4962,2.1311,11.8743,8.285,228
-0.2488,-9.2446,0.074,0.3215,-9.2446,1.3699,8.9954,5.1633,229
-0.7215,-9.8723,0.3606,0.9823,-9.8723,1.063,9.2239,5.7998,230
-7.8269,-9.7629,-0.519,3.9215,-9.7629,1.5785,9.1893,8.2836,231
-6.0509,-9.6642,0.8165,3.1747,-9.6642,5.7631,14.8807,10.0074,232
-2.5631,-9.5385,2.3052,4.3523,-9.5385,5.4773,15.1203,12.7132,233
-7.2884,-9.7162,1.1437,3.6233,-9.7162,4.1152,11.4065,7.7291,235
-3.1309,-9.7588,-0.1627,1.1178,-9.7588,2.8224,10.3344,6.3641,236
-0.7704,-9.7869,1.4242,1.4215,-9.7869,1.1201,10.2194,5.9798,237
-0.8799,-9.9282,0.4811,1.5967,-9.9282,3.1685,8.9073,7.561,238
-2.671,-9.9421,-0.8926,1.147,-9.9421,0.7351,7.4051,5.0135,239
-11.6423,-9.7113,-3.0225,4.5243,-9.7113,2.9169,11.7192,6.5454,240
-5.8104,-9.9566,-1.5274,1.9022,-9.9566,1.5069,10.1957,6.3876,241
-10.3099,-9.8516,0.8321,5.0353,-9.8516,4.039,11.5103,8.7821,242
-3.5004,-9.4692,-0.1731,2.277,-9.4692,4.5794,9.1623,8.1146,243
-2.6114,-9.7674,0.1606,1.3942,-9.7674,3.1067,10.9864,5.9639,245
-1.3172,-9.6967,0.0174,0.8469,-9.6967,1.8633,11.8948,5.8916,246
-6.3446,-9.6385,-2.6721,2.2046,-9.6385,5.0061,10.2497,8.2534,247
-2.944,-9.6699,-0.5745,1.1682,-9.6699,2.7913,8.9761,6.1704,248
-11.4481,-9.7138,1.1162,3.5675,-9.7138,5.8005,16.349,10.2028,250
-4.5788,-9.6106,3.2907,6.0151,-9.6106,7.7546,17.4244,11.3889,251
-7.1307,-9.7869,1.8029,4.446,-9.7869,7.3041,16.9098,11.0209,252
-8.3127,-9.6296,0.7129,5.301,-9.6296,7.1944,16.8355,12.0888,253
-9.9866,-9.612,0.4674,5.4001,-9.612,6.0339,15.8356,8.4285,255
-7.4453,-9.8219,4.0291,6.3905,-9.8219,7.8952,15.5856,11.2625,256
-7.2228,-9.8296,1.8431,6.7374,-9.8296,2.1613,11.9299,11.3197,257
-4.2477,-9.6638,1.0048,3.9112,-9.6638,5.6911,13.3037,10.6158,258
-3.9621,-9.7315,1.0083,2.9485,-9.7315,4.2734,9.4241,8.3845,259
-11.2062,-9.7317,-0.4563,6.8754,-9.7317,4.8063,13.1421,8.6382,260
-0.6099,-9.6343,0.8651,1.1123,-9.6343,2.4755,8.9434,8.1924,261
-2.8633,-9.7228,0.0109,0.8323,-9.7228,2.4877,7.6174,5.3183,262
-0.4646,-9.6241,0.0904,0.3005,-9.6241,1.1089,7.0581,5.0728,263
-3.0745,-9.7289,1.9459,3.3824,-9.7289,6.9743,14.3913,9.7091,265
-9.1159,-9.7085,0.977,3.1363,-9.7085,7.2613,18.0364,11.6781,266
-0.3796,-9.778,0.3554,0.6183,-9.778,1.8114,7.8547,5.3194,267
-0.1101,-9.8304,-0.0378,0.0576,-9.8304,0.3189,6.3207,5.1104,268
-1.6099,-9.7543,-0.6694,0.6156,-9.7543,1.0404,9.6406,5.9911,270
-1.7875,-9.7338,-0.0187,1.2486,-9.7338,2.5837,6.6342,4.8507,271
-1.3726,-9.6968,0.9692,1.6794,-9.6968,3.1721,14.8489,7.6606,272
-1.156,-9.7982,1.1673,1.9353,-9.7982,5.2296,11.0393,7.6035,273
-1.7311,-9.7332,-0.399,0.7104,-9.7332,2.4775,7.4658,6.7784,274
-1.6736,-9.7459,0.0225,0.9558,-9.7459,2.8907,10.8444,6.5966,275
-1.8342,-9.6793,0.1372,0.9711,-9.6793,2.9649,10.3786,5.7632,276
-9.298,-9.7958,0.9755,3.9591,-9.7958,4.1343,10.5836,7.3139,277
-3.7781,-10.013,-1.1884,1.6823,-10.013,2.8789,10.9579,6.1392,278
-3.4886,-9.7161,1.3087,6.6228,-9.7161,8.7845,30.1437,27.4087,279
-7.7513,-9.9072,0.5415,4.4796,-9.9072,1.4916,11.0618,9.245,280
-1.1724,-9.4971,1.0611,1.3867,-9.4971,1.1811,13.7663,9.7946,281
-13.8405,-9.3562,-0.3731,4.763,-9.3562,2.8517,20.5807,10.3793,282
-11.2273,-9.865,-0.3141,4.6438,-9.865,5.1072,17.0377,7.6341,283
-5.5523,-9.7447,-0.9791,1.6034,-9.7447,2.8403,14.4023,7.4814,284
-3.7223,-9.7147,-0.2034,1.9294,-9.7147,3.5505,11.8397,8.6474,285
-2.9669,-9.664,-0.0623,1.8182,-9.664,2.7029,9.4827,6.9309,286
-9.5587,-9.8016,-0.9965,3.4472,-9.8016,2.2611,11.5673,6.4779,287
-3.8779,-9.8169,-1.0522,1.6966,-9.8169,2.3375,10.8839,8.8943,288
-3.2323,-9.733,0.3744,3.1904,-9.733,0.9441,18.3154,10.5691,289
-10.8426,-9.7875,-1.9629,4.671,-9.7875,2.0721,14.7226,7.8759,290
-6.0576,-9.7149,2.3506,4.2388,-9.7149,6.3914,16.1442,10.8512,291
-2.6144,-9.6794,-0.7063,1.3584,-9.6794,4.1927,12.3014,8.4414,292
-7.5103,-9.5085,-1.5177,2.5988,-9.5085,4.2982,9.5832,8.3665,293
-1.4197,-9.6766,2.511,2.4094,-9.6766,3.5845,14.4235,9.8965,294
-6.397,-9.9014,2.44,6.3865,-9.9014,3.1946,15.7695,12.9078,295
-3.2662,-9.7333,1.2619,2.5787,-9.7333,3.6426,10.1558,7.8902,296
-9.6505,-9.5626,0.8275,2.8778,-9.5626,4.8768,22.0025,9.7092,297
-1.7629,-9.6534,1.2947,1.5517,-9.6534,4.7154,10.2952,7.9321,298
-2.1514,-9.7209,0.09,0.7841,-9.7209,1.9589,9.5305,4.949,299
-0.6912,-9.6922,0.5914,0.7694,-9.6922,1.1091,11.076,7.5861,300
-4.0912,-9.8052,-0.3119,2.1945,-9.8052,4.829,17.4529,7.6643,301
-4.5949,-9.5689,3.0154,6.7091,-9.5689,3.5002,17.4565,16.5652,302
-2.5826,-9.564,-0.9736,1.0481,-9.564,0.9262,8.1709,5.6438,303
-11.7667,-9.5306,-2.455,4.666,-9.5306,4.4904,11.0192,6.0914,304
-2.2462,-9.5868,5.2912,5.5014,-9.5868,4.7997,23.1285,13.3889,305
-10.3082,-9.7844,-1.9096,4.3014,-9.7844,1.4024,10.9544,8.0991,306
-2.2541,-9.6834,0.3418,1.4274,-9.6834,2.7989,8.5082,6.0436,307
-3.9999,-9.7035,-1.1476,1.3347,-9.7035,0.2574,8.1707,6.2644,308
-3.6075,-9.7412,1.7131,2.8485,-9.7412,5.0625,12.9441,8.057,310
-0.3443,-9.8089,0.4043,0.7277,-9.8089,1.5267,6.4601,5.9632,311
-2.2281,-9.7483,-0.6959,1.0514,-9.7483,2.1718,6.3226,5.0388,312
-1.4796,-9.6951,-0.4935,0.6775,-9.6951,0.5362,5.9883,5.2999,313
0.0666,-9.703,0.2414,0.1048,-9.703,0.2115,4.5158,4.3648,314
0.2626,-9.7033,0.3069,0.0318,-9.7033,0.1113,4.449,4.3972,315
0.2815,-9.7029,0.3802,0.0567,-9.7029,0.102,4.3889,4.3594,316
0.1913,-9.7044,0.3137,0.0721,-9.7044,0.1737,4.4075,4.33,317
0.2809,-9.7039,0.3611,0.0491,-9.7039,0.0965,4.3717,4.3334,318
-0.5209,-9.6991,0.3812,0.3692,-9.6991,0.4499,4.9529,4.4912,320
-0.0812,-9.7084,0.0915,0.1264,-9.7084,0.5488,4.7415,4.3235,321
-0.0088,-9.7107,0.1518,0.1155,-9.7107,0.3311,4.4095,4.3098,322
0.1201,-9.7056,0.1821,0.0481,-9.7056,0.1512,4.3815,4.334,323
-0.415,-9.71,0.2031,0.4516,-9.71,0.4404,4.879,4.57,324
0.1837,-9.7086,0.2551,0.0524,-9.7086,0.2341,4.497,4.4165,325
0.1468,-9.7098,0.167,0.0183,-9.7098,0.0905,4.4385,4.3923,326
0.0414,-9.7032,0.1359,0.0713,-9.7032,0.2297,4.5132,4.3126,327
-3.6389,-9.69,0.0153,1.1887,-9.69,1.5339,7.2758,4.9083,328
0.028,-9.6773,0.5985,0.3723,-9.6773,0.4178,6.2142,4.8481,329
-3.3282,-9.6899,0.2013,2.1341,-9.6899,5.0932,31.2786,12.2993,331
-16.4407,-9.5724,-0.7918,5.8235,-9.5724,3.0285,32.567,14.177,332
-6.7581,-9.4615,6.0025,8.3649,-9.4615,2.946,18.101,12.5313,333
-7.6297,-7.1599,1.087,8.3756,-7.1599,3.7298,37.8763,10.8658,334
-8.5888,-9.9079,6.6941,12.9608,-9.9079,6.7644,22.5951,8.7096,335
-6.8785,-9.87,-1.4015,2.5265,-9.87,3.0443,13.3692,10.2091,336
-11.5362,-9.7317,-0.2992,4.8187,-9.7317,6.0095,17.286,10.2733,337
-6.371,-9.5994,-0.2723,3.1038,-9.5994,5.3433,12.8284,8.7097,338
-4.8564,-9.7135,0.1554,2.3392,-9.7135,3.5453,14.2399,6.2149,340
-4.6385,-9.7006,-0.5272,1.5705,-9.7006,2.7519,10.3836,6.7293,341
-4.7186,-9.7359,-0.6458,1.9052,-9.7359,0.9489,6.8003,5.669,342
-5.7115,-9.7084,0.9735,3.9541,-9.7084,7.3824,17.3977,12.1714,343
-1.0133,-9.7758,1.889,2.6578,-9.7758,5.3585,14.4916,9.5638,344
-4.595,-9.9826,-1.514,1.591,-9.9826,1.9304,11.4198,8.7073,345
-0.6115,-7.763,1.5417,2.1276,-7.763,1.9577,27.2388,7.2885,346
-17.5204,-9.4736,2.8,11.1726,-9.4736,10.484,23.0523,18.1041,347
-25.9623,-9.4818,-0.211,9.0185,-9.4818,7.9499,22.5565,11.0278,349
-18.6996,-9.6162,-1.6338,7.8361,-9.6162,5.2234,31.1577,9.5901,350
-5.1563,-9.8744,-0.9543,3.4923,-9.8744,1.957,12.4263,8.9004,351
-6.2718,-9.6612,-0.8912,2.1501,-9.6612,4.0974,10.8536,7.4536,352
-18.651,-9.7119,-0.7667,5.9683,-9.7119,5.6442,16.3685,10.4792,354
-2.6926,-9.7258,0.2723,1.34,-9.7258,2.1207,9.8445,5.9349,355
-1.8006,-9.774,-0.7044,1.0224,-9.774,0.9498,7.6604,5.2495,356
-1.7149,-9.6932,0.0857,0.7786,-9.6932,1.7846,9.1446,5.7999,357
-2.3999,-9.7889,-0.7997,0.9563,-9.7889,0.8576,8.0784,5.2433,358
-4.3547,-9.7056,-0.4375,1.7936,-9.7056,3.2712,13.9474,7.6352,360
-2.0387,-9.7348,0.7206,1.8528,-9.7348,3.3627,14.7575,5.7935,361
-5.3582,-9.6577,-1.6801,2.4605,-9.6577,1.0343,12.1145,8.3819,362
-1.2783,-9.714,-0.3683,0.9787,-9.714,1.396,8.2811,6.0455,363
-1.1072,-9.7088,0.1509,1.098,-9.7088,1.3121,7.91,4.9089,364
-3.1801,-9.7187,0.3165,3.0218,-9.7187,2.3466,9.4131,7.0724,365
-4.8315,-9.714,-0.9628,2.7731,-9.714,1.2179,16.4774,14.0125,366
-9.365,-9.7229,0.1264,4.1826,-9.7229,4.896,15.9805,9.8656,367
-0.1509,-9.6686,2.1465,1.6926,-9.6686,2.4398,16.8391,9.5249,368
-3.7036,-9.7175,-0.3008,0.975,-9.7175,2.2109,8.4051,5.3887,370
-0.2512,-9.7371,1.5546,1.4938,-9.7371,1.2717,8.0483,7.2678,372
-9.465,-9.6389,0.6014,8.936,-9.6389,2.3419,18.2896,14.9031,373
-10.3924,-9.6009,-1.2396,5.6014,-9.6009,3.1439,15.5862,9.6207,374
-3.9985,-9.4151,-1.1174,1.6592,-9.4151,1.7133,8.9733,6.4232,375
-3.636,-9.5088,-0.0475,2.5403,-9.5088,1.5684,41.5741,7.3592,376
-7.4694,-9.6133,0.1934,3.6683,-9.6133,1.7752,13.9045,10.2233,377
-11.6104,-9.7897,-0.8787,5.6236,-9.7897,2.5985,20.6653,12.1514,378
-23.9376,-9.6335,-2.4305,6.5881,-9.6335,3.7924,34.9163,6.5054,379
-31.1436,-9.7785,-3.0863,6.9862,-9.7785,4.1464,11.6055,5.9925,380
-5.691,-9.7104,-0.3917,4.5317,-9.7104,2.2173,12.0429,10.3352,381
-1.6691,-9.7426,0.3099,0.7192,-9.7426,1.2076,8.0323,5.5136,382
-1.605,-9.8175,-0.6295,0.538,-9.8175,0.8429,11.9986,8.7477,383
-3.7242,-9.8453,-0.8665,1.8729,-9.8453,1.1757,10.3861,7.1744,384
-4.2337,-9.6767,0.0552,2.72,-9.6767,2.8068,9.2704,7.4,385
-29.8894,-7.7987,-2.8856,9.6615,-7.7987,5.2393,51.7558,8.4628,386
-116.6562,-8.7321,-5.0379,24.6575,-8.7321,7.5491,29.2041,11.9556,387
-11.8265,-9.4512,1.406,4.1709,-9.4512,6.8082,23.4127,12.9639,388
-46.6289,-9.5804,-4.5032,13.0146,-9.5804,6.1323,33.021,10.9492,389
-8.4395,-9.713,-1.5541,2.2849,-9.713,3.1969,11.3734,4.2025,390
-2.438,-9.6825,-0.3594,1.4554,-9.6825,0.7572,10.9449,6.4489,391
-5.5529,-9.735,-0.7313,2.5802,-9.735,3.5084,11.5609,7.6729,392
-4.1822,-9.6903,-1.0975,1.9334,-9.6903,2.3834,6.3681,5.0193,393
-2.2648,-9.7233,0.183,0.8135,-9.7233,1.7107,9.899,7.4329,395
-2.623,-9.6867,-0.1057,1.3898,-9.6867,2.1029,10.0945,7.9596,396
-0.3639,-9.7729,0.9508,0.9817,-9.7729,1.5411,7.5129,5.21,397
-1.3084,-9.833,0.0577,1.3048,-9.833,1.2718,6.3865,4.1361,398
-4.3654,-9.6775,1.4347,5.3555,-9.6775,3.5752,21.544,12.0446,399
-22.6051,-9.6482,-3.2635,12.6019,-9.6482,4.0723,19.7379,10.7595,400
-9.6414,-9.9909,-2.4536,3.3911,-9.9909,5.4088,16.571,10.7562,401
-10.5468,-9.7641,3.9603,10.7625,-9.7641,7.2956,25.7881,14.514,402
-0.2954,-9.6811,1.7295,2.1199,-9.6811,4.9822,13.3492,8.4084,403
-10.8013,-9.7454,-1.116,3.5893,-9.7454,2.6244,16.2006,9.0406,404
-8.7926,-9.7369,-1.5616,3.5905,-9.7369,4.0908,16.0779,8.7892,405
-2.8128,-9.7203,1.9202,4.1047,-9.7203,5.4351,13.5995,9.2296,406
-20.9293,-9.7014,-1.7461,6.9369,-9.7014,4.7075,18.6853,9.1003,407
-2.9597,-9.6125,0.1675,1.7383,-9.6125,3.0157,8.8865,7.5626,408
-0.7791,-9.6513,-0.1603,0.5303,-9.6513,1.4606,9.1799,6.1502,409
-0.8137,-9.672,0.4001,0.8644,-9.672,1.6942,12.3761,5.8315,410
-2.7375,-9.6438,-0.1173,0.9747,-9.6438,2.0,12.6427,7.5919,411
-34.7964,-7.825,-2.0067,14.1255,-7.825,5.2054,48.1959,14.2974,412
-33.2417,-9.3501,-3.0281,13.6603,-9.3501,8.6916,48.4629,14.5564,413
-8.2745,-9.5863,2.8849,7.9575,-9.5863,5.0512,17.822,11.1947,414
-9.9013,-9.1739,3.3935,7.0686,-9.1739,8.3332,18.2272,13.6685,415
-0.4753,-9.7195,3.7759,2.9184,-9.7195,7.8846,20.7177,13.3739,416
-14.3558,-9.8329,0.9293,7.0081,-9.8329,6.1181,22.2497,9.9222,417
-8.4069,-9.6437,-0.6954,4.4388,-9.6437,3.0595,13.1763,11.6166,418
-15.2359,-8.9382,0.3775,5.0009,-8.9382,3.528,21.1072,7.1735,420
-5.9747,-9.6278,-0.2737,1.6224,-9.6278,2.6371,14.5371,6.3591,421
-11.9464,-8.8675,-1.1222,3.5487,-8.8675,2.0364,21.3067,7.092,422
-1.733,-9.4368,0.141,1.0419,-9.4368,1.7401,9.5787,7.6548,423
-1.2058,-9.8392,0.1669,0.817,-9.8392,1.3199,12.119,6.1358,424
-6.3881,-9.8708,-0.0885,3.2338,-9.8708,1.6844,12.9284,6.9093,425
-1.1772,-9.5146,1.4946,2.2208,-9.5146,0.9722,9.2497,7.1611,426
-5.6132,-9.6711,0.0839,3.665,-9.6711,3.9917,18.6745,9.6251,427
-5.4807,-8.9893,-0.8147,2.5586,-8.9893,1.8279,10.9137,6.4376,428
-0.6736,-9.7715,0.1485,0.8966,-9.7715,1.444,13.6455,7.8496,430
-3.6566,-9.7971,0.1009,1.8116,-9.7971,3.2053,27.9982,18.7379,431
-6.0422,-9.1608,-2.4967,2.2304,-9.1608,1.6628,12.646,12.4073,432
-5.1143,-9.7152,-1.1804,1.9436,-9.7152,2.0908,9.5263,7.8285,433
-8.243,-9.7191,-1.7894,4.8076,-9.7191,0.5496,8.8825,6.9542,434
0.4016,-9.5833,1.3549,0.8835,-9.5833,0.332,20.8826,16.587,435
-0.9389,-10.0458,2.9469,4.5713,-10.0458,1.934,18.4237,7.8562,436
-2.0308,-9.6912,0.4602,1.4453,-9.6912,2.3322,14.4764,8.6201,437
-8.3513,-9.7185,-0.1582,2.2616,-9.7185,2.2053,12.2885,8.4465,439
-4.5448,-9.7445,-0.0363,1.9198,-9.7445,3.5678,7.5979,5.755,440
-1.121,-9.7286,-0.2395,0.5461,-9.7286,1.4038,4.8172,4.5944,441
-1.4013,-9.7024,0.1693,0.962,-9.7024,1.7962,16.3979,4.9201,442
-8.6629,-9.8045,0.2898,4.9668,-9.8045,1.5904,19.0922,10.8955,443
-9.0109,-9.6311,-0.3702,3.0215,-9.6311,4.0668,13.8966,9.0552,445
-2.6303,-9.6492,0.5347,1.3576,-9.6492,2.2562,9.3256,6.2633,446
-1.7342,-9.8917,2.2286,2.9696,-9.8917,1.8759,15.8549,11.5586,447
-17.723,-9.6769,2.8098,10.9645,-9.6769,8.1283,31.3807,24.6481,448
-8.1855,-9.9332,-0.7071,4.4118,-9.9332,1.237,19.5014,8.105,449
-7.1372,-9.6712,-0.4364,2.9314,-9.6712,2.2367,14.6279,10.2953,450
-2.0644,-9.4379,-0.2734,0.8637,-9.4379,2.2263,5.639,2.8518,451
-5.1697,-9.7343,1.3543,2.977,-9.7343,4.9451,14.6614,9.923,452
-2.7786,-9.6525,-0.4792,1.0905,-9.6525,2.0403,11.3792,10.1439,453
-0.5475,-9.7303,-0.0056,0.464,-9.7303,1.4133,5.5592,4.3233,455
0.1329,-9.7124,0.2552,0.0696,-9.7124,0.2225,4.6143,4.4156,456
0.2691,-9.7093,0.334,0.0504,-9.7093,0.1243,4.6821,4.6074,457
-0.1407,-9.7184,-0.0413,0.0759,-9.7184,0.2126,4.5776,4.4669,458
-0.0255,-9.7174,0.023,0.0297,-9.7174,0.1406,4.4044,4.3618,459
-0.0508,-9.7172,-0.0102,0.0196,-9.7172,0.0583,4.3262,4.2992,460
-0.0037,-9.7168,0.0135,0.0085,-9.7168,0.054,4.3393,4.316,461
0.025,-9.7179,0.0567,0.0162,-9.7179,0.1293,4.3935,4.3546,462
-0.0027,-9.7186,0.051,0.0386,-9.7186,0.1233,4.4617,4.3721,463
-0.1088,-9.718,-0.0227,0.0245,-9.718,0.1141,4.4244,4.3457,465
-0.0893,-9.7185,-0.0258,0.035,-9.7185,0.2218,4.4319,4.3734,466
-0.5492,-9.7197,0.0767,0.3657,-9.7197,1.014,6.1718,4.3498,467
-0.1998,-9.721,0.0205,0.182,-9.721,0.4853,5.4838,5.1953,468
-0.3259,-9.7107,0.047,0.2262,-9.7107,1.1098,4.4964,4.3556,469
-27.0872,-10.5269,4.7405,17.336,-10.5269,10.2381,42.9349,20.6786,470
-0.4395,-9.7487,10.3258,8.0485,-9.7487,8.6587,56.6003,38.5155,471
-38.5902,-9.687,-2.8404,11.118,-9.687,5.4172,20.3911,6.4653,472
-14.0581,-9.6545,-0.7451,5.141,-9.6545,4.056,29.4282,19.8541,473
-23.7883,-9.7619,-1.4733,5.5595,-9.7619,3.9039,34.3053,21.4369,475
-2.1619,-9.7395,1.3212,2.5062,-9.7395,3.1169,15.4698,6.3265,476
-9.1424,-9.551,-1.3882,6.2295,-9.551,1.7728,23.5461,19.2402,478
-5.2468,-9.7591,1.0657,3.9139,-9.7591,2.1769,14.2485,10.8911,479
-12.8304,-8.9109,-1.4111,10.3004,-8.9109,3.3928,23.1524,12.5643,480
-13.5982,-9.8391,-3.8262,6.5702,-9.8391,2.7316,18.6593,14.6593,481
-4.662,-9.7862,-0.9114,1.665,-9.7862,1.5303,20.1979,16.8713,482
-11.887,-9.6424,5.2389,10.1171,-9.6424,3.0366,23.7125,11.1932,483
-4.73,-9.4114,0.134,3.0513,-9.4114,1.0847,17.07,11.4838,484
-3.2743,-9.6976,-0.2234,0.8962,-9.6976,2.2897,10.6757,6.7715,485
-1.4663,-9.7295,0.1886,0.9079,-9.7295,2.2042,8.8013,5.7138,486
-0.9681,-9.7366,-0.3297,0.4604,-9.7366,0.8106,7.9031,6.2673,487
-2.217,-9.6733,-0.8212,0.7206,-9.6733,3.0622,8.5149,6.9114,488
-2.3917,-8.9123,-0.0333,2.4821,-8.9123,2.3714,21.5809,10.1238,489
-1.3794,-9.5318,0.2321,1.554,-9.5318,1.2254,11.0103,6.614,490
-0.3292,-9.982,0.4918,0.7206,-9.982,1.5693,6.2414,5.3509,491
-4.3476,-9.6774,-0.5894,1.3616,-9.6774,2.766,8.381,6.0148,492
-3.2566,-9.6139,-0.4479,1.7186,-9.6139,2.5627,17.0126,8.8514,493
-2.2128,-9.4684,0.2463,1.7664,-9.4684,3.6462,15.7335,11.8107,494
-4.879,-8.8334,1.8813,4.4799,-8.8334,2.7011,27.8592,10.6233,495
-2.6948,-10.0724,-0.876,1.1117,-10.0724,2.2979,13.8675,11.2527,496
-6.2984,-9.7545,-1.0791,1.7544,-9.7545,1.8309,12.1387,10.0769,497
-1.5708,-9.5458,-0.8057,0.48,-9.5458,0.7195,7.8132,5.644,498
-1.2065,-9.5304,-0.2632,0.577,-9.5304,1.2059,7.6467,3.7578,499
-9.9887,-9.7133,-0.3203,2.3843,-9.7133,2.5388,15.5735,6.2418,500
-2.7263,-9.7956,-0.3818,0.974,-9.7956,2.2592,9.0893,6.2364,501
0.1396,-8.4841,1.1084,0.7146,-8.4841,0.5581,11.4779,5.8936,502
-22.972,-9.4962,-3.2705,11.5961,-9.4962,3.1623,17.927,13.7822,503
-0.436,-9.5999,1.7919,1.5635,-9.5999,0.6593,10.3032,7.9251,504
-1.112,-9.7046,0.7001,1.4462,-9.7046,2.444,13.9816,10.6673,505
-6.5241,-9.6273,6.4847,7.4459,-9.6273,1.8321,20.8208,17.0641,506
-10.4249,-9.7307,0.2409,3.7674,-9.7307,3.5433,13.5447,9.0294,507
-3.4689,-9.7028,-0.1438,1.7018,-9.7028,1.5596,12.5017,5.7438,508
-4.4627,-9.6429,-0.5058,1.9648,-9.6429,2.5439,10.8422,7.7143,509
-2.2525,-9.6489,0.655,1.8486,-9.6489,2.9455,11.7224,7.5879,510
-2.9792,-9.6049,-0.8673,1.14,-9.6049,0.8821,7.0709,6.1562,511
-8.5443,-9.6571,1.3885,5.5195,-9.6571,5.4452,23.1478,6.4002,512
-1.2741,-9.5476,0.4908,1.3389,-9.5476,3.5488,10.6408,7.7392,513
-13.825,-9.7101,-6.1639,5.8397,-9.7101,1.4989,14.9852,11.3435,514
-5.3032,-9.6971,2.0378,4.8317,-9.6971,3.9974,9.8299,7.0974,515
-9.0941,-9.211,1.8232,8.0019,-9.211,5.5567,19.5158,12.0741,516
-3.3729,-11.3019,-0.947,1.4565,-11.3019,1.4372,10.8998,6.9961,517
-16.8629,-9.8575,-0.9128,8.9458,-9.8575,6.3396,15.1114,13.522,518
-4.3534,-9.6466,1.8296,4.8325,-9.6466,4.28,17.1484,7.7105,519
-5.0658,-10.0639,-0.3496,2.6433,-10.0639,1.1448,12.1914,8.3988,520
-0.5911,-9.2547,0.792,1.763,-9.2547,2.217,13.122,7.5617,521
-11.9305,-9.5184,-2.1695,3.1765,-9.5184,3.0625,13.9576,8.3878,522
-1.8325,-9.0917,0.649,1.7215,-9.0917,2.1822,10.5444,5.8188,523
-7.1885,-9.7519,0.0787,2.835,-9.7519,4.0129,14.9916,5.9234,524
-5.4474,-9.7798,-0.4314,1.682,-9.7798,2.2288,12.4986,5.6229,525
-1.4849,-9.5754,0.0134,0.8881,-9.5754,1.8957,10.3293,4.3911,526
-2.1406,-9.8282,0.2063,1.0223,-9.8282,2.0605,10.3619,6.1549,527
-0.9952,-9.5154,0.1548,0.6351,-9.5154,1.4935,7.3453,4.188,528
-5.583,-9.8283,1.1321,2.5243,-9.8283,5.043,16.0677,7.9185,530
-6.9496,-9.7552,-0.9332,2.4863,-9.7552,4.3192,13.6421,8.5812,531
2.5415,-9.7963,4.5024,1.574,-9.7963,0.562,12.9073,9.7114,532
-2.4508,-9.5887,-0.6967,0.7737,-9.5887,0.7925,5.6989,2.9394,533
-1.3952,-9.2651,-0.5796,0.7748,-9.2651,2.6011,8.7058,6.0534,534
-7.6683,-9.6316,4.7582,7.1033,-9.6316,1.7129,16.492,13.1657,535
-5.0754,-9.6587,0.5819,5.1079,-9.6587,3.6312,10.6962,9.4302,536
-11.9692,-9.7915,-0.5136,4.2497,-9.7915,4.5143,17.3312,6.8631,537
-9.5625,-9.5644,-0.1118,3.7039,-9.5644,4.4647,11.0107,7.6281,538
-10.2231,-9.5778,0.8093,5.9111,-9.5778,7.995,21.0114,12.5376,540
-12.0488,-9.6499,1.0429,7.3269,-9.6499,6.5378,29.9858,11.948,541
-19.3647,-9.7268,1.5858,11.5451,-9.7268,4.8359,20.5158,9.4067,542
-9.6326,-9.7051,-1.6286,3.3597,-9.7051,4.1814,12.6052,7.6276,543
-1.3206,-9.6929,5.6584,4.8548,-9.6929,7.9253,18.4934,13.1222,544
-5.4674,-9.8362,-0.233,3.7681,-9.8362,2.8109,10.0011,8.8784,545
-0.4711,-9.7775,0.4214,0.72,-9.7775,0.8699,7.8766,5.2532,546
-0.881,-9.8265,0.2419,0.6796,-9.8265,1.2637,9.4423,4.6952,547
-10.2174,-9.8263,-1.035,3.8002,-9.8263,3.0436,15.5619,6.7603,549
-27.6215,-9.5671,1.7936,12.843,-9.5671,9.8002,19.7856,14.4956,550
-5.7587,-9.7161,1.4873,4.4509,-9.7161,3.5022,14.0129,9.8924,551
-10.9986,-9.8053,-0.3926,4.4469,-9.8053,5.8718,17.5071,7.8964,552
-0.6118,-9.619,0.8892,1.6993,-9.619,1.9755,9.0336,5.3621,553
-7.2353,-9.6395,1.8661,5.5985,-9.6395,6.2134,16.6422,11.1078,555
-5.9241,-9.7515,-0.0897,3.1121,-9.7515,2.6922,17.6142,9.409,556
0.3682,-9.6464,5.151,6.8854,-9.6464,5.6054,16.9978,9.2561,557
-2.6938,-9.8519,-0.7,1.3974,-9.8519,2.09,10.6184,7.2992,558
-2.2228,-9.8443,0.9152,2.2773,-9.8443,1.3578,9.4813,8.5094,559
-1.8067,-9.3094,5.9221,5.3915,-9.3094,6.6332,15.7923,11.9275,560
-4.4764,-9.9035,-1.0329,2.2774,-9.9035,4.2066,10.2728,6.627,561
-5.4776,-9.7272,0.2401,3.6589,-9.7272,3.7681,11.1635,7.3251,562
-8.5183,-9.7514,0.9725,3.8158,-9.7514,5.3175,12.4916,7.9721,564
-7.3483,-9.8653,-1.0435,2.2406,-9.8653,3.3077,13.4509,8.8319,565
-1.9026,-9.8373,0.4108,1.8478,-9.8373,4.1726,15.832,6.1587,566
-13.8388,-9.6695,-0.0478,3.9271,-9.6695,3.6837,13.7809,7.5657,567
-4.6572,-9.7583,0.6289,2.2208,-9.7583,3.6725,13.0725,6.3246,569
-6.7165,-9.7989,-0.3768,1.9599,-9.7989,2.1455,9.7461,5.9628,570
-17.7733,-9.6731,-3.1006,8.4024,-9.6731,5.1081,20.0622,16.0137,571
-8.3199,-9.6026,0.9316,3.8296,-9.6026,6.0373,17.7314,10.4444,572
-10.3849,-9.4872,-0.2465,4.5787,-9.4872,2.2671,15.1197,6.0584,573
-11.2585,-9.6339,0.5425,3.911,-9.6339,4.16,16.7432,9.05,575
-1.0648,-9.7604,1.4626,2.2577,-9.7604,2.9949,13.3241,9.7442,576
-10.2604,-9.7597,-1.0072,3.7905,-9.7597,2.7553,13.376,11.5799,577
-5.5976,-9.7166,-0.0528,3.4775,-9.7166,3.4845,8.7627,5.4657,578
-15.0335,-10.1541,-2.3388,7.6383,-10.1541,5.4796,16.1684,8.9342,579
-20.029,-9.2868,-1.3085,8.077,-9.2868,1.7616,14.8068,9.1399,580
-14.7207,-9.5967,-2.1886,7.346,-9.5967,5.7241,15.6357,13.9839,581
-3.0364,-9.8043,0.5511,2.2244,-9.8043,3.8009,15.9668,7.8935,582
-3.2668,-9.7945,0.4324,1.7038,-9.7945,3.7814,10.3874,6.8405,584
-0.8392,-9.925,1.154,1.0546,-9.925,0.9078,10.0175,6.7582,585
-2.3646,-9.7407,-0.4792,0.8461,-9.7407,1.2923,8.6662,5.6264,586
-3.6181,-9.72,-0.1083,1.6797,-9.72,2.4686,10.3008,8.3344,587
-0.0379,-9.7585,0.2383,0.2439,-9.7585,0.5437,9.6568,7.8697,588
-0.1103,-9.6526,0.07,0.1179,-9.6526,0.5023,6.4215,4.7538,589
-0.7012,-9.8364,-0.2585,0.3413,-9.8364,0.6152,5.7605,5.0286,590
-0.7868,-9.7203,-0.2595,0.3263,-9.7203,0.8271,5.0418,4.5808,591
-2.0434,-9.7489,-0.2576,0.7378,-9.7489,1.6888,10.5156,7.6639,592
-0.5661,-9.7038,-0.1029,0.3006,-9.7038,1.3633,5.0539,4.4898,593
-2.4272,-9.7185,-0.1255,0.78,-9.7185,2.346,7.6863,4.9503,594
-1.0736,-9.6966,-0.0255,0.6367,-9.6966,2.2246,9.36,5.1837,595
-3.4324,-9.8914,-0.8969,1.4037,-9.8914,1.8045,11.8049,9.5725,596
-3.7568,-9.7047,0.3822,1.7453,-9.7047,3.2891,10.2443,7.2509,597
-5.3728,-9.7055,-0.6455,1.518,-9.7055,3.0106,9.0954,6.8549,598
-3.8608,-9.7094,0.1862,1.902,-9.7094,2.773,7.7161,6.1567,599
-3.9244,-9.7152,-0.3703,1.0627,-9.7152,1.9964,6.2623,4.4288,600
-0.4248,-9.7028,0.3255,0.5922,-9.7028,1.5576,5.0643,4.7467,601
-3.9139,-9.6734,0.8165,3.6814,-9.6734,4.2435,10.2737,5.9411,602
-0.3936,-9.7418,0.6562,0.6832,-9.7418,1.1269,5.9241,5.1094,603
-0.0768,-9.72,0.3198,0.2164,-9.72,0.4116,4.3829,4.2993,604
-0.022,-9.7033,0.0221,0.0311,-9.7033,0.0831,4.353,4.3046,605
0.1441,-9.6981,0.2445,0.0483,-9.6981,0.0964,4.3558,4.2931,606
0.2471,-9.6976,0.342,0.0599,-9.6976,0.1138,4.3618,4.3021,607
0.4049,-9.6972,0.4345,0.0309,-9.6972,0.0397,4.341,4.3321,608
0.4169,-9.7148,0.934,0.3156,-9.7148,0.2821,5.4433,5.0907,609
-2.3454,-9.6859,-0.4087,1.104,-9.6859,2.2658,7.0115,5.6047,610
-2.3966,-9.8242,-0.3181,1.2501,-9.8242,0.5349,6.544,5.5783,611
-3.944,-9.6919,-0.3547,1.3242,-9.6919,1.9305,11.353,6.1992,612
-2.834,-9.6845,0.2621,1.7124,-9.6845,2.9121,12.5248,8.4996,613
-1.7922,-9.6827,0.1428,1.1053,-9.6827,1.9504,14.9168,6.4553,614
-0.5562,-9.7647,0.1881,0.7405,-9.7647,1.1908,11.9698,4.91,615
-17.598,-9.7691,-0.5905,7.2443,-9.7691,8.7143,28.4541,16.9639,616
-3.9521,-9.7355,1.7908,3.8484,-9.7355,3.3116,15.284,7.6076,617
-3.1775,-9.7437,-0.2366,1.8721,-9.7437,3.3785,14.2552,12.4619,618
-13.0164,-9.6238,-2.8997,5.0616,-9.6238,1.7177,10.9297,8.41,619
-11.8856,-9.3713,-0.1738,4.3145,-9.3713,4.2261,16.4229,8.4573,620
-15.1431,-8.993,-1.4629,7.1861,-8.993,4.8087,26.4776,9.6976,621
-20.2832,-9.5601,-0.3989,11.5648,-9.5601,7.8615,22.1496,11.4335,622
-5.5042,-9.7366,1.3389,5.3244,-9.7366,2.8178,19.6927,10.6611,623
-3.6278,-10.2674,-1.1148,1.6424,-10.2674,2.4219,11.5947,9.2592,624
-0.3162,-9.7384,0.1664,0.3765,-9.7384,0.9644,12.7729,9.5955,625
-1.1929,-9.6799,-0.4613,0.5475,-9.6799,0.6858,10.6745,4.2101,626
-7.684,-9.7455,-0.6893,3.0294,-9.7455,5.4438,14.0026,7.9769,627
-14.192,-9.6627,-1.1699,3.3435,-9.6627,5.0807,13.1291,7.3885,628
-4.5731,-9.695,0.1299,1.4238,-9.695,2.3133,19.4911,6.9885,630
-6.8746,-9.5106,-0.8377,2.7873,-9.5106,4.4291,18.7472,9.9276,631
-8.3508,-9.4936,-0.227,3.0394,-9.4936,4.7795,23.417,8.8816,632
-4.5293,-9.6288,-1.0355,2.8123,-9.6288,3.3615,13.0817,10.36,633
-9.2922,-9.398,0.7916,6.7049,-9.398,6.2172,16.8352,9.7383,634
-4.588,-9.7915,0.4033,3.3875,-9.7915,2.5326,12.3743,10.5512,635
-0.1476,-9.2265,1.5845,1.9266,-9.2265,4.0749,13.9229,10.4091,636
-4.9937,-9.7767,-0.7905,1.6589,-9.7767,2.7717,11.8058,7.2408,637
-3.657,-9.6143,-1.4565,1.8089,-9.6143,1.4372,11.5225,7.1902,638
-7.4015,-9.7582,0.8647,3.9347,-9.7582,4.3388,19.6463,10.7795,640
-5.9867,-9.7079,0.4826,3.9005,-9.7079,6.5941,18.6097,11.1009,641
-9.5943,-9.6723,-2.2125,3.8542,-9.6723,6.3542,14.9272,8.8728,642
0.2239,-9.7504,1.2999,0.9465,-9.7504,4.3332,11.9777,9.6171,643
-6.9104,-9.7077,1.5955,5.7763,-9.7077,6.547,18.6016,9.5561,644
-5.6546,-9.6163,4.3001,5.4388,-9.6163,5.827,15.8523,11.4129,645
-4.7358,-9.5727,7.9115,9.6207,-9.5727,6.3753,22.6159,17.025,646
-1.721,-9.697,0.397,1.602,-9.697,1.6843,12.8134,6.3345,647
-0.1234,-9.6371,3.7436,2.8393,-9.6371,1.9368,10.1637,8.6456,648
-5.5866,-9.5196,0.1822,4.0239,-9.5196,5.6618,12.8983,9.8944,650
-3.0041,-10.0099,2.9439,6.2137,-10.0099,6.4631,14.8446,9.7444,651
-1.2978,-9.6291,-0.1263,0.9876,-9.6291,3.5284,9.5365,8.0757,652
-3.8932,-9.4661,0.9176,4.4261,-9.4661,5.0896,13.4555,8.9608,653
-3.4148,-9.705,-0.8806,1.2858,-9.705,1.2814,10.7836,7.0264,654
-1.7893,-10.1043,0.045,1.432,-10.1043,0.7354,9.8375,5.6131,655
-2.5389,-9.727,-0.0189,1.228,-9.727,1.7061,9.7522,6.9783,656
-19.371,-9.6512,-0.1046,6.6498,-9.6512,6.0451,14.2452,10.9037,657
-9.2637,-9.6748,-0.2516,4.3188,-9.6748,2.8583,13.2634,11.1645,658
-13.7175,-9.45,0.7252,5.4469,-9.45,10.345,21.1687,15.3775,660
0.4545,-9.8675,6.6678,3.9267,-9.8675,6.5308,23.1394,16.7652,661
-5.6697,-9.4491,-0.742,3.7443,-9.4491,5.0242,14.5366,11.2914,662
-5.0384,-9.5176,0.6839,3.3402,-9.5176,2.6928,12.4769,8.1057,663
-9.0282,-9.7812,2.8864,6.1957,-9.7812,2.8596,15.3261,12.1311,664
-3.2872,-9.6147,0.9639,2.2027,-9.6147,3.6706,15.2482,12.3918,665
-2.4587,-9.6324,0.0494,1.6369,-9.6324,1.8874,7.0322,6.3145,666
-5.5749,-9.8532,2.9992,4.5556,-9.8532,7.9505,19.4552,12.3787,667
-0.7507,-9.5214,5.478,6.6887,-9.5214,7.0406,16.5372,12.6037,668
-9.3181,-9.8317,0.615,5.1823,-9.8317,6.6795,15.2098,11.4995,670
-0.7236,-9.8524,1.4852,2.9811,-9.8524,2.2174,12.018,9.1241,671
-0.463,-9.6796,5.0737,5.8915,-9.6796,7.4423,13.9684,11.5844,672
-0.5912,-9.4648,1.955,1.9111,-9.4648,6.1438,13.2368,9.8838,673
-0.1517,-9.7425,-0.005,0.1589,-9.7425,0.6062,7.9049,6.2886,674
-1.9397,-9.9255,0.129,0.9443,-9.9255,2.5742,12.1462,6.252,675
-0.1901,-9.7977,0.9131,1.2694,-9.7977,1.8065,10.3947,6.903,676
-0.6244,-9.7064,0.4231,0.833,-9.7064,1.5893,14.3177,8.0868,677
-3.3537,-9.7328,-0.5182,1.5501,-9.7328,1.9822,15.4587,7.683,679
-7.8904,-9.7201,-0.3193,2.9689,-9.7201,4.7697,14.6853,8.9378,680
-3.8856,-9.717,-1.2049,1.8369,-9.717,2.6738,9.7882,8.645,681
-8.7842,-9.6336,-0.9725,2.8783,-9.6336,3.9634,11.8116,5.9739,682
-5.1754,-9.7762,0.8387,5.4149,-9.7762,3.7791,13.0511,8.1774,683
-5.7237,-9.7886,0.6716,2.7615,-9.7886,5.0824,14.0441,9.7102,685
-15.2409,-9.7343,1.4617,4.5071,-9.7343,5.8393,17.3125,9.4826,687
-5.6675,-9.7538,0.333,3.0325,-9.7538,4.6487,17.2837,7.6148,688
-5.829,-9.8557,-1.0093,2.2911,-9.8557,1.0412,6.4313,4.1124,689
-2.0813,-9.6716,-0.4091,0.9562,-9.6716,2.2722,10.5994,7.1213,691
-0.433,-9.7655,0.3576,0.8076,-9.7655,1.1194,7.5601,5.251,692
-2.2165,-9.7405,-0.5125,1.1049,-9.7405,0.8984,8.5745,6.2953,693
-0.0948,-9.5893,1.5278,1.2014,-9.5893,1.9999,8.9087,8.1743,694
-1.5149,-9.7805,1.13,0.9851,-9.7805,1.4027,9.0221,6.8419,695
-4.9922,-9.6853,0.3571,3.1283,-9.6853,3.868,12.2174,8.5477,696
-2.8076,-9.8006,3.5587,4.5649,-9.8006,6.5504,17.7421,13.3137,697
-1.2878,-9.7319,2.6675,2.7896,-9.7319,3.4044,13.9134,9.4271,698
-1.2519,-9.6795,1.6772,4.1656,-9.6795,2.5715,15.7526,9.5046,699
-3.5225,-9.6501,0.5144,2.4445,-9.6501,4.3546,19.1116,13.973,700
-0.8726,-9.8972,0.3246,0.6405,-9.8972,1.2576,10.0506,7.0386,701
-1.2431,-9.7206,-0.1329,0.313,-9.7206,1.0785,10.2101,5.1679,702
-0.9949,-9.9178,1.4872,1.8465,-9.9178,2.0692,9.3294,7.5459,703
-4.3983,-9.6949,0.1568,1.7695,-9.6949,3.2364,12.2018,7.917,704
-3.8699,-9.5718,-1.0453,1.6628,-9.5718,1.3893,10.0579,8.3095,705
-1.1671,-9.746,-0.038,0.4256,-9.746,1.2699,8.4023,5.617,706
-1.8769,-9.747,0.8778,1.2174,-9.747,1.962,17.0651,9.0953,707
-2.682,-9.8433,-0.1153,1.6805,-9.8433,1.0135,18.5228,16.0557,708
-16.1041,-9.7243,-1.0078,4.312,-9.7243,4.0234,17.2594,7.9831,709
-7.2461,-9.6964,0.5499,6.7641,-9.6964,4.3973,12.9847,8.6742,710
-29.0915,-9.699,4.2033,15.6763,-9.699,8.3185,43.4207,23.5256,711
-6.9099,-9.7304,0.1706,3.4096,-9.7304,3.6444,23.6863,11.5605,712
-5.3215,-9.7099,-0.8354,2.5312,-9.7099,2.3402,10.0934,7.9668,713
-0.5723,-9.7024,0.8695,0.6698,-9.7024,1.0267,5.2792,4.4632,714
-14.4438,-9.672,-2.5846,5.3182,-9.672,5.5366,12.2969,5.9762,715
-14.4874,-9.5784,-3.2954,6.3257,-9.5784,3.0784,8.4485,4.9059,716
-3.2633,-9.7016,0.1964,1.3378,-9.7016,3.3569,10.7669,5.5498,717
-0.1189,-9.7099,0.7975,0.8575,-9.7099,2.1036,7.0979,4.8259,718
0.3793,-9.6542,1.5033,1.0824,-9.6542,0.7254,4.8784,4.68,719
-0.1137,-9.6811,0.8273,0.621,-9.6811,0.8851,5.4137,4.3984,720
-0.0925,-9.7066,0.406,0.2494,-9.7066,0.5637,4.893,4.3835,721
-0.2231,-9.7182,0.1208,0.2191,-9.7182,0.6171,4.4366,4.3014,722
-1.2529,-9.7019,-0.5676,0.5808,-9.7019,0.7955,4.6025,4.3771,723
1.0734,-9.7004,1.6133,0.4449,-9.7004,0.5736,6.2279,5.9667,724
-2.7131,-9.6868,0.2867,2.0755,-9.6868,2.3392,8.0883,6.1805,725
-1.1101,-9.7442,-0.3907,0.6307,-9.7442,1.1061,5.6454,5.0983,726
-3.2524,-9.6796,-0.357,1.1785,-9.6796,1.272,6.796,4.7888,727
-2.8214,-9.6753,0.0959,1.3308,-9.6753,2.8251,16.2597,7.8053,728
-3.8558,-9.7338,-0.2699,1.3879,-9.7338,2.2398,6.6613,5.0533,729
-6.1101,-9.725,-0.3213,1.9117,-9.725,2.5812,7.9822,4.7352,730
0.2259,-9.6761,0.4734,0.2909,-9.6761,0.3205,4.8594,4.4688,731
-0.0104,-9.7075,0.1065,0.0556,-9.7075,0.1438,4.3168,4.265,732
0.1003,-9.7018,0.2257,0.0653,-9.7018,0.1552,4.3432,4.2957,734
0.3065,-9.6994,0.4263,0.0676,-9.6994,0.1577,4.3697,4.3432,735
0.4495,-9.7031,0.4992,0.0333,-9.7031,0.0681,4.4521,4.4197,736
0.2226,-9.7033,0.2838,0.0316,-9.7033,0.0759,4.3638,4.3153,737
0.1523,-9.7004,0.2758,0.0956,-9.7004,0.2147,4.4089,4.3241,739
0.0808,-9.6968,0.4228,0.2327,-9.6968,0.4458,4.5244,4.32,740
0.6047,-9.6984,0.6543,0.04,-9.6984,0.0519,4.4779,4.4529,741
0.2627,-9.7013,0.3939,0.0764,-9.7013,0.1678,4.4254,4.3413,742
0.3131,-9.7027,0.3841,0.0582,-9.7027,0.1198,4.4106,4.3509,743
0.1642,-9.7035,0.2785,0.0727,-9.7035,0.198,4.3847,4.2853,745
0.2422,-9.7007,0.3702,0.085,-9.7007,0.1765,4.4111,4.313,746
0.4371,-9.6977,0.4758,0.0308,-9.6977,0.0391,4.4031,4.3706,747
0.2614,-9.7017,0.303,0.0328,-9.7017,0.0865,4.356,4.2987,748
0.344,-9.7011,0.3815,0.0208,-9.7011,0.0551,4.3629,4.3502,749
0.3388,-9.6985,0.5909,0.1412,-9.6985,0.2604,4.4532,4.4035,750
-2.5459,-9.6686,0.5036,1.1697,-9.6686,3.4105,12.0337,8.0233,751
-12.953,-9.7147,-0.101,6.7471,-9.7147,3.7254,25.1526,11.8677,752
-9.9235,-9.6683,0.2194,6.0184,-9.6683,2.6691,21.8032,13.9581,753
-3.1258,-9.6838,0.4552,2.3247,-9.6838,3.5745,14.3727,7.956,755
-1.1831,-9.6751,-0.3918,0.5345,-9.6751,0.8299,10.1947,7.1256,756
-4.6661,-9.7847,-1.92,1.9306,-9.7847,1.3461,20.5536,18.1183,757
-1.6088,-9.7143,-0.6143,0.5184,-9.7143,1.3764,8.4854,6.3665,758
-2.1307,-9.7431,-0.1793,0.6,-9.7431,1.2136,6.7291,5.1908,759
-7.0239,-9.6885,-0.6445,1.8465,-9.6885,1.8498,12.5483,5.0775,760
-4.4293,-9.6799,-0.2448,2.0869,-9.6799,3.2905,18.7458,8.2005,762
-8.0679,-9.7116,3.0721,6.6934,-9.7116,6.6267,18.5906,11.0798,763
-8.4409,-9.5967,-1.5913,3.3771,-9.5967,6.1284,16.7513,8.2199,764
-17.5239,-9.8185,0.0877,6.7407,-9.8185,3.5194,13.5228,7.1871,765
-1.7073,-9.8633,7.077,8.4621,-9.8633,5.3242,24.7272,18.7351,766
-14.2482,-9.5085,-1.6658,3.8863,-9.5085,2.2945,24.1246,11.0448,767
-6.0986,-9.2334,-1.8877,2.2303,-9.2334,3.7341,38.7464,15.8459,768
-2.8904,-9.5466,-0.4078,1.8879,-9.5466,3.8519,27.5393,8.1738,770
-15.0529,-9.6528,-1.5553,4.5316,-9.6528,4.0192,15.9447,10.4381,771
-2.3231,-9.5805,-0.0773,1.0777,-9.5805,2.0028,15.2565,6.1107,772
-10.5552,-9.7033,0.667,7.2673,-9.7033,4.7595,22.4291,7.7701,774
-46.7455,-9.5549,-3.374,16.2883,-9.5549,9.304,25.9693,16.134,775
-25.3945,-9.6097,3.3767,13.8297,-9.6097,4.58,18.3046,14.0141,776
-13.5035,-9.7123,1.0152,7.3896,-9.7123,7.567,21.4383,11.3206,777
-12.7194,-9.6302,-1.0638,5.0861,-9.6302,4.6492,18.6288,17.4641,778
-8.6621,-9.4605,2.0114,7.0202,-9.4605,6.9271,21.5174,10.925,780
-3.9834,-9.7049,0.4715,2.8457,-9.7049,6.6588,21.5179,8.3684,781
-6.8683,-9.3579,3.9074,13.7959,-9.3579,10.0625,19.0103,15.4296,782
-2.8401,-9.6573,0.1523,1.9063,-9.6573,1.6371,8.7754,6.7144,783
-4.5442,-9.5266,-0.9309,2.4038,-9.5266,4.6569,17.9163,9.8471,784
-6.6241,-10.0151,-2.7731,2.985,-10.0151,3.1312,12.9993,10.5525,785
-1.5765,-9.8829,-0.4325,0.8997,-9.8829,1.9244,10.9003,8.3864,786
-7.741,-9.708,-0.1154,3.558,-9.708,5.734,16.4359,8.9548,787
-3.5663,-9.9831,0.6111,2.6996,-9.9831,3.4802,14.323,7.1357,788
-5.6835,-9.6447,-0.6514,1.7175,-9.6447,2.6256,11.4834,6.0021,790
-11.8981,-9.8996,1.1366,6.7617,-9.8996,1.7917,13.353,11.5592,791
-8.8474,-9.3878,-0.6698,5.1295,-9.3878,5.6839,22.9183,19.6081,793
-11.0011,-9.8367,-0.6372,8.3817,-9.8367,3.5306,17.2161,11.3975,794
-0.209,-9.8312,5.0468,6.1213,-9.8312,6.2912,15.1186,10.8949,795
-3.9425,-9.7897,4.1081,4.5121,-9.7897,2.2287,11.0972,9.1342,796
-13.6483,-8.7503,-0.3685,7.1073,-8.7503,4.9682,21.5216,11.3409,797
-6.4213,-9.714,-1.3509,2.8858,-9.714,1.091,8.7969,5.1233,798
-4.3082,-9.9774,-0.634,1.6584,-9.9774,2.4791,8.5023,7.27,799
-14.2886,-9.2194,-0.0066,5.7592,-9.2194,6.7689,16.6689,10.2704,800
-9.4359,-9.6396,-0.8715,4.2145,-9.6396,5.8822,18.1278,10.7884,801
-9.3047,-9.3512,3.4667,7.0306,-9.3512,9.5449,19.8092,12.9311,802
-10.5824,-10.0189,1.0082,5.3474,-10.0189,8.2288,22.3161,12.1698,803
-5.02,-9.6437,0.2398,3.4645,-9.6437,2.767,11.0302,7.5476,804
-9.1894,-10.0292,-0.0721,8.2495,-10.0292,2.7179,24.9042,14.8709,805
-5.8618,-9.2179,-0.486,2.4002,-9.2179,4.9913,12.3989,8.8707,806
-4.2818,-9.3257,1.2518,3.6007,-9.3257,5.6932,21.3925,10.4399,807
-1.7883,-9.5053,1.6186,2.2437,-9.5053,2.7292,14.1989,10.7347,808
-2.9219,-9.7371,0.5326,2.0821,-9.7371,4.3076,10.9532,8.1328,809
-5.8239,-9.6574,1.147,2.9729,-9.6574,4.8433,13.7268,8.4227,810
-8.8995,-9.7774,2.0844,5.9224,-9.7774,7.7284,15.988,12.4235,811
-2.1313,-9.643,2.3237,3.0342,-9.643,6.8653,13.2642,10.1824,812
-3.9573,-10.4656,-0.5325,1.654,-10.4656,2.3512,9.6733,8.006,813
-0.8802,-9.8603,0.9068,1.6919,-9.8603,3.1989,9.2421,7.9324,814
-3.0947,-9.7749,0.1988,3.2517,-9.7749,1.5358,10.8811,9.8158,815
-4.2618,-9.5598,1.6537,4.4184,-9.5598,4.7533,12.6355,11.3795,816
-8.6463,-9.7368,-0.1068,5.0369,-9.7368,7.4863,18.4672,11.7638,817
-7.9588,-9.5375,1.2152,5.5356,-9.5375,1.9117,18.037,13.48,818
-15.0727,-9.6397,-4.035,6.0967,-9.6397,3.0007,19.4138,17.8178,819
-3.5325,-9.6671,0.2075,2.2776,-9.6671,1.9696,9.0621,6.9729,820
-14.5498,-9.5572,9.9673,12.4877,-9.5572,15.9516,32.1876,26.701,821
-1.961,-9.7187,1.0414,1.7559,-9.7187,2.7468,12.699,9.6478,822
-4.5043,-9.9325,0.9454,3.6777,-9.9325,0.7427,9.7184,8.7244,823
-10.2587,-9.7727,0.1077,4.2766,-9.7727,6.8065,16.7508,9.7171,824
-4.8985,-9.8694,-0.6652,3.2765,-9.8694,2.4525,11.3588,7.7425,825
-1.1926,-9.7723,0.7988,1.4537,-9.7723,4.7861,10.242,9.0701,826
-8.9944,-9.742,1.8751,5.5191,-9.742,7.4007,15.7938,11.0973,827
-2.1403,-9.484,-0.1382,1.6185,-9.484,1.853,8.8849,5.6084,828
-1.0567,-9.6982,0.1131,0.8456,-9.6982,1.9204,8.1422,5.6777,829
-5.7961,-9.636,1.0384,4.1964,-9.636,3.8352,13.2652,10.0708,830
-12.9806,-9.8822,0.0657,6.5707,-9.8822,7.9888,21.253,12.6725,831
-1.9293,-9.8767,0.1693,1.2555,-9.8767,1.4345,8.0078,6.238,832
-0.8069,-9.6917,-0.2979,0.4352,-9.6917,1.0872,7.3571,4.5477,833
-2.4769,-9.7422,-0.3763,0.8918,-9.7422,1.9324,7.3613,4.9743,834
-3.4308,-9.7944,0.3646,2.8436,-9.7944,1.6186,9.1075,8.2855,835
-4.7314,-9.9056,-1.3864,2.042,-9.9056,2.7963,13.8003,9.0435,836
-5.8014,-9.782,-1.512,2.1748,-9.782,1.6413,10.4275,6.4993,837
-1.1375,-9.6794,0.4639,1.4182,-9.6794,2.0299,14.2505,11.443,838
-0.8775,-9.628,-0.0186,0.5599,-9.628,1.1222,10.9642,8.9246,839
-1.492,-9.7203,-0.1996,0.6553,-9.7203,0.9627,10.343,5.3391,840
-1.8358,-9.7336,-0.0293,0.5408,-9.7336,1.4384,7.8063,5.7789,841
-0.4403,-9.7343,-0.1345,0.2378,-9.7343,0.6841,5.7011,3.509,842
-8.1156,-9.5152,-1.2182,3.6501,-9.5152,2.6756,12.7276,9.6228,843
-10.0162,-9.9845,-2.6988,4.0308,-9.9845,4.0076,23.1878,8.1336,844
-0.7719,-9.1564,1.404,1.7721,-9.1564,2.8482,15.8686,9.4832,845
-11.3549,-9.6218,-1.3548,4.5355,-9.6218,5.7442,16.3469,8.7774,846
-22.7938,-9.2444,-2.6923,6.1617,-9.2444,5.3495,22.9577,12.8799,847
-4.0943,-9.6954,1.78,4.4715,-9.6954,2.657,13.6323,10.0223,848
-14.2065,-9.6735,-1.1872,4.2509,-9.6735,3.0708,11.4978,6.4693,849
-7.974,-9.7107,-0.7508,3.4621,-9.7107,3.9862,13.8788,6.8022,850
-8.2449,-9.7112,-0.4088,3.3598,-9.7112,3.9259,11.5217,8.2296,851
-9.8867,-9.5619,-1.992,3.3332,-9.5619,1.645,9.148,4.8852,852
-7.2745,-9.6834,-1.4201,3.8244,-9.6834,3.443,9.8551,6.5837,853
-3.9201,-9.6534,-0.7193,1.6286,-9.6534,1.6169,8.5953,5.0368,854
-0.3676,-9.796,0.1456,0.5114,-9.796,0.864,8.8185,5.1658,855
-7.0798,-9.6995,-2.0341,3.5342,-9.6995,5.0992,16.0521,9.8598,856
-12.214,-9.714,-0.9464,4.6779,-9.714,3.6295,13.9969,7.5667,857
-2.7086,-9.7426,1.6768,3.8903,-9.7426,4.0215,8.4835,7.573,858
-9.5712,-9.7675,-0.5142,2.5373,-9.7675,3.3206,10.1819,6.1903,860
-6.9179,-9.6303,-0.8636,2.8819,-9.6303,6.1232,13.4101,7.912,861
0.0282,-9.7719,0.9171,0.9129,-9.7719,2.7843,11.4776,9.6939,862
-7.2043,-9.7203,-0.6093,3.2322,-9.7203,4.6298,12.642,8.8594,863
-4.1606,-9.7302,0.0442,1.7628,-9.7302,3.4644,11.0645,7.0092,865
-5.5632,-9.6525,1.06,3.179,-9.6525,4.8014,12.7115,7.8339,866
-12.1676,-9.7443,-0.8969,3.1825,-9.7443,3.559,13.9416,7.5333,867
-3.6871,-9.6745,0.4572,4.5459,-9.6745,5.3286,17.9243,12.1761,868
-8.872,-9.7179,-0.2714,2.446,-9.7179,4.0459,14.8189,7.009,870
-9.8985,-9.7107,1.2646,4.3448,-9.7107,6.4703,13.4157,10.4376,871
-8.9601,-9.7439,0.6185,4.9605,-9.7439,6.0392,18.1215,11.0608,872
-1.4,-9.2459,2.6578,3.8156,-9.2459,2.9021,16.7342,12.0577,873
-1.7302,-9.6629,0.3191,1.9172,-9.6629,2.2998,12.5816,9.1373,874
-0.626,-9.7511,0.323,0.7003,-9.7511,1.9385,7.6936,5.5781,875
-0.7037,-9.5305,2.4236,2.7546,-9.5305,1.9833,9.9329,8.1597,876
-2.6276,-9.6898,-0.3847,0.8229,-9.6898,1.9205,9.8229,5.6031,877
-1.8216,-9.6843,0.2521,0.7049,-9.6843,1.8643,11.2602,7.8067,879
-0.8348,-9.717,-0.204,0.2656,-9.717,0.5438,6.8931,5.0605,880
-0.3278,-9.7074,0.2693,0.3638,-9.7074,0.8405,7.7498,5.4714,881
-2.1235,-9.7228,-0.2394,0.9676,-9.7228,2.4689,14.5411,7.4618,882
-2.6543,-9.738,0.2121,1.2153,-9.738,3.1057,14.6197,12.2314,884
-3.0988,-9.7032,-0.3739,0.8912,-9.7032,2.3063,10.4334,5.0657,885
-1.8026,-9.6658,-0.2441,0.6681,-9.6658,1.4001,7.7974,4.4777,886
-4.7274,-9.7053,-0.8274,1.4086,-9.7053,2.5854,17.5645,8.1384,887
-7.6881,-9.6866,0.386,2.8317,-9.6866,4.3205,16.6988,10.853,889
-6.5586,-9.9449,1.8895,5.2627,-9.9449,1.6388,16.1487,9.3922,890
-2.6737,-9.7992,-0.426,0.9899,-9.7992,1.8303,14.9208,7.6121,891
-6.9254,-9.7322,-0.3302,2.4362,-9.7322,2.327,9.9753,6.2383,892
-7.8199,-9.7803,-0.6574,3.2576,-9.7803,3.7611,14.147,8.8217,894
-5.9228,-9.6137,-0.4621,1.8388,-9.6137,2.8974,15.4269,5.9523,895
-1.1764,-9.8383,6.5522,7.8301,-9.8383,4.7013,15.2058,11.6052,896
-7.8092,-9.5025,3.7268,9.1922,-9.5025,9.3837,23.8665,12.1903,897
-21.6103,-9.4924,3.9356,9.4686,-9.4924,6.058,21.3306,14.6713,898
-6.9691,-9.5004,-0.425,3.4075,-9.5004,5.654,20.6149,17.6147,899
-43.6373,-8.2949,-0.1918,12.9931,-8.2949,9.8392,33.3275,17.5002,900
-13.9241,-9.7566,1.6728,7.7933,-9.7566,8.8861,19.87,14.1413,901
-39.7985,-9.3142,2.3851,13.6479,-9.3142,7.737,21.131,18.6075,902
-16.5738,-10.062,-0.8828,9.0522,-10.062,2.9245,25.3456,10.0342,903
-7.6273,-9.5202,0.9768,5.3738,-9.5202,6.2249,19.1549,10.6475,904
-5.4115,-9.7535,-0.9326,1.8624,-9.7535,3.5605,13.8638,6.4435,905
-5.84,-9.7356,0.8698,4.0033,-9.7356,5.3107,13.7208,8.274,906
-5.3169,-9.7356,1.6292,4.1063,-9.7356,6.937,16.6059,11.103,907
-6.1564,-9.7016,-0.8438,2.989,-9.7016,4.8346,14.5312,9.6809,908
-6.0294,-9.7099,-0.3991,2.6631,-9.7099,4.2559,13.211,7.8997,909
-8.1445,-9.7301,1.951,4.3266,-9.7301,7.2305,14.9124,11.46,910
-6.3316,-9.1392,1.0746,3.9777,-9.1392,4.6304,24.9424,11.459,911
-0.5318,-9.962,3.833,3.4862,-9.962,6.8922,13.6223,12.0062,912
-3.5877,-9.6696,0.0319,2.4613,-9.6696,3.8321,14.0309,5.7078,913
-3.2724,-9.719,-1.2809,1.5442,-9.719,1.6169,10.1585,7.7818,914
-4.9994,-9.6925,-0.7445,3.4452,-9.6925,4.7668,12.429,8.0914,915
-3.3886,-9.5539,2.7734,5.1052,-9.5539,0.7647,11.9503,10.408,916
-34.4607,-9.6075,0.6677,11.3536,-9.6075,8.4466,23.3134,16.5232,917
-13.5218,-9.8206,-2.7173,5.3823,-9.8206,4.9959,12.0751,7.5671,918
-5.8552,-9.6541,1.0416,4.1548,-9.6541,6.7317,16.5035,9.9649,919
-6.5043,-9.7138,-1.1842,2.6756,-9.7138,3.9193,13.6433,8.3226,920
-1.7407,-9.8046,0.4423,2.2407,-9.8046,5.0506,14.0747,9.5059,921
-20.8894,-9.2828,0.0625,7.0292,-9.2828,5.9347,30.1021,9.9649,922
-16.3346,-9.8908,4.7253,10.1833,-9.8908,3.0565,15.8262,13.2615,923
-7.2599,-9.5621,0.1406,4.3367,-9.5621,5.7162,14.2775,8.5791,925
-13.0951,-9.7261,-0.3595,4.0806,-9.7261,4.3711,14.7924,8.5434,926
-6.4691,-9.7869,-1.382,2.2912,-9.7869,4.0327,9.9726,7.1853,927
-1.5479,-9.7313,0.3364,1.3115,-9.7313,1.3531,9.1544,7.892,928
-3.6156,-9.5756,0.8151,2.8219,-9.5756,3.1454,12.85,8.7707,929
-6.2811,-9.8418,-1.8413,2.7269,-9.8418,3.2343,26.9222,8.5638,930
-1.4805,-9.6668,1.3708,2.6445,-9.6668,1.851,14.5421,10.7777,931
-18.2197,-9.6916,0.1446,4.8904,-9.6916,6.4597,15.9748,9.5756,932
-4.5525,-9.8186,0.4481,2.3537,-9.8186,5.1792,13.0834,7.5702,933
-6.6098,-9.8054,0.2778,4.7886,-9.8054,7.3472,16.9621,10.6273,934
-11.0262,-9.7084,1.5052,5.6178,-9.7084,7.8588,16.6703,12.7884,936
-1.7085,-9.7062,-0.2097,1.1497,-9.7062,1.9908,11.7914,9.4985,937
-5.2362,-9.7237,0.5237,4.1559,-9.7237,6.5711,16.2116,11.3427,938
-4.7739,-9.6312,-1.0319,3.371,-9.6312,5.6632,11.9204,7.6345,939
-3.2923,-9.6152,5.5566,5.8945,-9.6152,2.4022,14.5297,11.029,940
-7.1157,-10.2103,0.1348,6.5004,-10.2103,3.6042,13.1286,11.428,941
-25.1025,-9.7649,3.3211,13.5922,-9.7649,10.2376,24.8546,13.0593,942
-44.5699,-9.5597,1.4649,11.4299,-9.5597,6.8557,22.3535,9.697,944
-14.9785,-9.8588,0.4177,5.7509,-9.8588,5.7916,16.2679,8.8827,945
-5.61,-9.7057,-1.3189,3.5259,-9.7057,0.5631,11.908,7.8796,946
-5.4766,-9.7174,1.9075,4.5997,-9.7174,7.062,15.4667,8.6502,947
-1.115,-9.8347,0.6012,1.2578,-9.8347,2.412,12.9755,6.4563,948
-7.9996,-9.2512,0.4459,4.6921,-9.2512,6.1109,23.2513,14.0478,950
-14.4342,-9.5585,0.9921,4.8316,-9.5585,6.9949,15.4315,11.1204,951
-0.8132,-9.7053,3.6626,5.2612,-9.7053,6.0976,14.3852,12.8443,952
-0.9262,-9.8339,0.1245,0.5814,-9.8339,1.8739,8.7873,5.3811,953
-2.3658,-9.73,-0.0831,1.0244,-9.73,1.8922,7.8599,6.0646,954
-2.4585,-9.7192,-0.7297,0.9368,-9.7192,1.4491,8.8632,7.0125,955
-1.4975,-9.6917,-0.1914,0.5694,-9.6917,1.2726,6.8444,5.324,956
-1.0159,-9.7515,-0.2166,0.4108,-9.7515,1.0394,7.3059,4.3554,957
-0.0291,-9.6263,0.257,0.2144,-9.6263,0.3194,7.5569,4.4226,958
-1.8423,-9.7082,-0.418,0.5608,-9.7082,0.9609,7.2524,5.914,960
-3.3796,-9.7192,0.3634,1.6067,-9.7192,3.76,10.5029,6.6437,961
-7.3224,-9.6883,0.0117,2.5815,-9.6883,5.5432,13.5116,8.9874,963
-5.8582,-9.6413,0.3769,3.6467,-9.6413,7.8604,19.338,10.3629,964
-3.5576,-9.5361,0.4697,2.4118,-9.5361,7.4463,18.0709,13.6098,965
-0.8589,-10.0406,0.018,0.7478,-10.0406,1.7574,10.9185,5.2422,966
-8.6112,-9.6164,0.8839,4.4369,-9.6164,6.1103,21.2118,11.289,967
-8.2141,-9.8227,2.6438,6.3079,-9.8227,4.7617,16.2191,15.6267,968
-4.7391,-9.7385,0.2787,2.3976,-9.7385,2.9342,9.685,6.6379,970
-3.0021,-9.7224,-0.3104,1.1331,-9.7224,1.8784,7.75,5.353,971
-5.4119,-9.5352,-1.0925,2.0291,-9.5352,1.1997,8.0439,6.3447,972
-0.0087,-9.9061,0.719,0.4633,-9.9061,0.5211,7.4922,4.8022,973
-1.7653,-9.7482,-0.2656,1.3623,-9.7482,1.3658,8.2427,7.8236,974
-0.3851,-9.5654,0.2395,0.5077,-9.5654,1.1888,6.7645,5.1277,975
-2.5906,-9.6828,-0.9015,1.1626,-9.6828,1.5256,6.7807,4.9841,976
-4.4008,-9.7169,3.4904,4.8154,-9.7169,5.313,18.2092,11.3892,977
-3.7309,-9.4632,0.4867,2.9805,-9.4632,1.2794,10.5132,9.3376,978
-3.4752,-9.7462,0.2143,1.4329,-9.7462,3.0055,14.1238,8.2177,980
-4.6251,-9.7055,-0.476,1.3873,-9.7055,2.9171,14.4362,7.4143,981
-1.7739,-9.7218,-0.5339,0.675,-9.7218,0.9757,6.6201,4.8827,982
-0.0129,-9.7552,0.4203,0.2406,-9.7552,0.5228,7.7829,6.1034,983
-0.3727,-9.78,0.0287,0.3713,-9.78,0.9172,7.2655,5.3045,984
-0.0343,-9.8438,0.0938,0.1318,-9.8438,1.0165,6.6869,5.733,985
-3.7588,-9.6942,-0.2705,1.4279,-9.6942,3.1274,22.3207,18.5899,986
-4.2375,-9.672,1.1718,2.9371,-9.672,6.2256,19.757,13.7884,987
-3.6456,-9.7069,-1.1139,1.8046,-9.7069,1.404,9.2071,8.4013,988
-2.7826,-9.7277,-0.0561,0.7613,-9.7277,2.1722,14.8524,5.897,990
-3.6094,-9.712,-0.527,1.0733,-9.712,2.3005,11.1259,6.0886,991
-0.8217,-9.714,1.571,1.6903,-9.714,4.407,20.2186,15.0957,992
-0.6474,-9.5362,0.0435,0.5474,-9.5362,1.2591,6.6287,6.039,993
-15.8431,-9.5749,-2.6267,7.0308,-9.5749,1.4706,12.5859,9.4913,994
-8.7524,-9.4054,-1.6226,4.5763,-9.4054,2.6527,11.3598,10.1109,995
-12.097,-9.9957,0.3936,8.3933,-9.9957,4.787,18.27,14.9601,996
-7.8931,-9.6749,-0.5288,2.1249,-9.6749,2.8331,10.8158,6.9316,997
-3.9241,-9.3843,-0.3499,1.7195,-9.3843,1.1695,8.2376,7.0675,998
-3.4529,-9.7432,0.3652,1.3735,-9.7432,2.748,8.0905,5.702,1000
-33.0831,-9.7036,-1.2225,7.1843,-9.7036,4.5327,22.5338,8.2674,1001
-2.7504,-9.8647,-0.2555,2.06,-9.8647,1.7083,7.3761,5.8149,1002
-4.6505,-9.7792,-1.8348,3.1799,-9.7792,1.545,13.358,10.4975,1003
-2.4578,-9.8296,0.9096,1.7597,-9.8296,0.9805,18.0335,14.9369,1004
-1.5741,-9.7063,0.0169,0.817,-9.7063,1.6659,10.7396,5.9934,1005
-2.0847,-9.6667,-0.4711,1.3688,-9.6667,1.2598,9.7081,7.4178,1006
-3.8435,-9.7416,-0.5329,1.3427,-9.7416,2.6685,11.1103,7.999,1007
-1.9953,-9.7213,0.1922,1.5573,-9.7213,1.6657,21.6217,18.8847,1008
-7.4463,-9.7576,-0.7215,2.0265,-9.7576,1.9241,48.9506,43.2919,1009
-2.0995,-9.7969,-0.3481,0.8061,-9.7969,1.2693,42.8931,39.7082,1010
-8.636,-9.6963,-1.2456,4.1037,-9.6963,5.0632,40.8993,32.8555,1011
-6.7328,-9.8057,-0.465,2.1809,-9.8057,3.943,26.6789,15.111,1012
-1.6725,-9.5698,-0.5097,0.9415,-9.5698,1.1205,8.5662,5.6101,1013
-3.5386,-9.705,0.7807,2.3209,-9.705,3.4332,13.8561,8.8429,1014
-7.1603,-9.706,-0.586,3.457,-9.706,4.5459,18.4613,11.1875,1015
2.8179,-9.733,6.2102,2.7666,-9.733,2.4603,14.8756,11.4607,1016
-1.2042,-9.9476,1.2061,3.5493,-9.9476,5.1934,10.7736,9.1176,1017
-19.6686,-9.8814,1.1583,11.8125,-9.8814,1.3772,20.6082,17.8993,1018
-2.5591,-9.7203,1.2281,3.3462,-9.7203,2.9138,26.7296,24.0465,1019
-4.9957,-10.1229,-0.6647,2.5712,-10.1229,1.2749,23.0786,21.2661,1020
-1.8741,-9.7344,0.1188,0.9253,-9.7344,2.7453,12.329,7.7477,1021
-5.5336,-9.7548,0.0597,2.5335,-9.7548,3.6681,14.0334,7.8642,1022
-0.6638,-9.4669,2.9651,2.453,-9.4669,1.4297,12.1254,7.83,1023
-2.1968,-7.7561,1.1349,2.2986,-7.7561,1.2482,39.8917,27.5037,1024
-2.1153,-9.6608,3.9637,6.5523,-9.6608,4.9574,23.7608,11.4049,1025
-24.3613,-9.9521,0.7721,13.8604,-9.9521,12.0849,37.7121,23.883,1026
-33.6682,-9.2676,-0.8715,22.3075,-9.2676,2.3257,32.7601,26.5463,1027
-0.9071,-10.0582,5.4847,5.8305,-10.0582,5.3134,24.4138,20.6098,1028
-4.6986,-9.8167,2.0181,5.0822,-9.8167,2.135,15.5037,8.3582,1029
-4.3184,-9.7263,0.0303,2.2745,-9.7263,4.4136,13.4315,9.5083,1030
-3.9501,-10.0724,1.5108,2.9684,-10.0724,3.4177,12.0295,7.9636,1031
-4.1625,-9.6565,-0.3255,1.1475,-9.6565,2.5089,15.083,5.8024,1032
-6.1464,-10.1822,2.0591,6.5207,-10.1822,7.9721,22.7311,15.6246,1033
-7.0178,-10.0928,4.0645,6.8329,-10.0928,6.6812,36.8217,14.2781,1034
-7.6925,-9.5117,-0.4623,3.179,-9.5117,4.7364,16.2296,7.6542,1035
-2.801,-9.5759,0.1595,2.8658,-9.5759,0.7512,9.9945,6.9178,1036
-10.4204,-9.7497,-1.8788,3.6261,-9.7497,3.2704,11.5918,9.5025,1037
-1.4346,-9.6017,-0.1109,0.6325,-9.6017,1.3146,17.9443,7.3333,1038
-4.8584,-9.3116,0.5204,3.4308,-9.3116,2.1485,11.187,9.524,1039
-9.7531,-10.1098,11.5619,19.5517,-10.1098,3.2226,30.6742,26.4833,1040
-4.1757,-9.4026,-1.5375,1.7468,-9.4026,2.2981,12.547,6.5107,1041
-7.5474,-9.7767,-0.4372,2.6617,-9.7767,6.3628,11.3632,8.7565,1042
-4.6862,-9.7654,-0.6158,3.1618,-9.7654,1.6311,12.9266,8.106,1043
-5.8759,-9.7288,-0.1443,3.3241,-9.7288,5.7886,15.8961,9.3567,1045
-6.8575,-9.8496,2.0033,3.5042,-9.8496,5.5719,14.1773,8.5514,1046
-4.4873,-9.5222,-0.4864,2.0349,-9.5222,2.1341,10.3379,7.597,1047
-0.3208,-9.7241,0.5263,0.7433,-9.7241,0.9799,8.911,6.1951,1048
-1.9642,-9.9041,-0.4766,0.7461,-9.9041,1.2309,8.2106,5.4566,1049
-0.1529,-9.7317,0.5396,0.4689,-9.7317,1.3153,8.6586,6.5019,1050
-0.8325,-9.7582,-0.29,0.3477,-9.7582,0.6054,12.2679,6.6249,1051
-5.4772,-9.7468,-0.0451,1.4495,-9.7468,2.5377,9.5593,5.2838,1052
-1.5142,-9.7333,0.4711,1.2243,-9.7333,2.4983,11.7846,6.7244,1054
-9.9923,-9.6771,-0.7002,3.482,-9.6771,5.4441,14.9982,9.412,1055
-6.5174,-9.6176,-0.2743,2.8364,-9.6176,3.5377,10.5149,8.0264,1056
-3.852,-9.7331,-0.3284,1.212,-9.7331,1.9901,10.431,6.2666,1057
-9.9172,-9.6261,1.0858,6.2988,-9.6261,8.3221,21.4473,8.5434,1059
-11.2211,-9.6623,1.0226,7.9375,-9.6623,7.9051,23.8636,14.7848,1060
-10.7289,-9.4032,-3.2787,3.6472,-9.4032,4.5577,17.7118,11.8982,1061
-5.1694,-9.6819,2.5822,6.0626,-9.6819,8.8056,17.4417,13.4576,1062
-5.3136,-9.6409,-0.0436,2.8771,-9.6409,4.6336,10.2573,7.9986,1063
-2.2576,-9.7142,0.8458,2.3052,-9.7142,4.4502,11.118,7.7107,1064
-4.0922,-9.7529,1.9235,3.8849,-9.7529,6.8155,14.5927,11.255,1065
-1.6698,-9.6928,0.8738,1.9649,-9.6928,4.0213,10.522,7.8899,1066
-4.5856,-9.5858,1.4646,4.5319,-9.5858,5.0978,16.5444,14.6304,1067
-2.2773,-9.6297,-0.0842,1.047,-9.6297,1.8856,9.6446,7.1424,1068
-2.1627,-9.61,0.2187,1.1237,-9.61,4.8112,13.3664,8.01,1069
-3.8044,-10.5472,0.2655,2.457,-10.5472,2.5442,15.1086,7.8579,1070
-0.0471,-9.4711,2.7934,3.5057,-9.4711,3.4574,13.4209,9.7071,1071
-3.6588,-9.6961,3.5142,4.3389,-9.6961,6.807,16.8645,11.442,1072
-0.0368,-9.726,0.9721,1.4758,-9.726,4.421,10.9047,8.6786,1073
-2.5113,-9.6654,0.3452,1.7508,-9.6654,3.2503,18.8806,6.8042,1075
-4.5664,-9.7259,-0.3427,1.6875,-9.7259,3.2304,9.0377,6.2399,1076
-4.6264,-9.6619,-0.7995,1.8636,-9.6619,2.1862,8.1721,6.6141,1077
-2.8978,-10.1206,-0.8993,1.1605,-10.1206,2.4558,8.4934,5.6893,1078
-1.0973,-10.1663,0.0085,0.9765,-10.1663,3.43,12.5155,6.498,1079
-6.8352,-9.6524,-0.6955,2.8351,-9.6524,2.8198,11.0528,6.9941,1080
-1.012,-9.0945,0.4483,1.0029,-9.0945,1.1128,12.3377,7.2889,1081
-1.7136,-9.512,3.0313,7.202,-9.512,4.2604,16.8168,6.3818,1082
-0.7459,-9.8318,-0.2609,0.3131,-9.8318,1.1763,7.086,5.1544,1084
-1.6028,-9.8281,1.3357,1.5237,-9.8281,0.6459,8.4774,7.238,1085
-0.52,-10.0042,6.6081,5.2124,-10.0042,7.0231,22.3282,15.7027,1086
-5.184,-9.4008,-0.0039,2.5996,-9.4008,3.1899,18.0026,7.5979,1087
-4.8493,-9.1704,-0.5215,1.6396,-9.1704,1.8754,18.991,5.328,1089
-2.3338,-9.6461,-0.0779,1.182,-9.6461,2.3241,15.5944,6.9405,1090
-0.8745,-9.7744,-0.4342,0.3745,-9.7744,0.7359,6.0421,4.721,1091
-1.5749,-9.6814,-0.2866,0.5341,-9.6814,1.3924,9.8864,5.8544,1092
-1.181,-9.6458,-0.513,0.4108,-9.6458,0.7124,7.5965,5.7943,1093
-1.5844,-9.4992,0.187,1.1211,-9.4992,1.6592,11.7584,6.1729,1095
-4.9162,-9.7798,-0.5932,3.3215,-9.7798,2.4741,25.4095,22.3194,1096
-2.033,-10.7227,0.191,1.1112,-10.7227,1.1187,18.1376,11.0349,1097
-3.6842,-9.5251,0.9215,4.1238,-9.5251,3.1193,15.1232,10.4514,1098
-4.9267,-9.6901,3.6759,9.1092,-9.6901,4.4282,34.7341,31.1225,1099
-4.0357,-9.697,-0.8964,2.6275,-9.697,1.5021,13.7486,8.8835,1100
-2.8414,-9.4103,1.4918,2.6999,-9.4103,3.1626,11.4489,6.9556,1101
-5.4628,-9.5243,0.5101,3.0323,-9.5243,3.6502,11.9432,9.7164,1102
-4.3021,-9.6687,2.8457,6.3671,-9.6687,4.5455,18.0695,10.5107,1104
-26.0235,-9.2739,-0.9454,9.2688,-9.2739,7.5255,31.5045,19.68,1105
-18.0232,-9.7563,-1.3599,5.1701,-9.7563,5.4289,16.0798,9.8113,1106
-12.6652,-9.5422,1.0529,6.012,-9.5422,8.0743,24.1186,11.6534,1107
-8.5267,-9.5836,-1.1317,3.3996,-9.5836,6.0797,16.6083,10.4497,1108
-8.597,-9.7249,0.9615,4.7942,-9.7249,5.907,14.3997,9.4614,1109
-10.58,-9.7411,-0.8713,4.6276,-9.7411,5.3369,14.0238,7.8199,1110
-2.6402,-9.6055,0.9283,2.9641,-9.6055,3.7074,14.2454,8.4589,1111
-5.5234,-9.8218,-0.7249,1.9034,-9.8218,4.0125,13.6579,7.6622,1112
-9.9268,-9.7017,1.7233,7.2019,-9.7017,8.0401,19.0007,12.6702,1113
-3.2132,-9.6355,0.9407,2.9298,-9.6355,4.9304,19.007,9.3802,1114
-5.5477,-9.4681,-0.5737,3.1408,-9.4681,1.6775,12.8633,8.6586,1115
-3.1007,-9.6304,-1.326,1.6019,-9.6304,2.0541,11.2338,7.8068,1116
-9.6119,-9.6915,-0.1692,4.9963,-9.6915,6.2991,17.2526,10.4679,1117
-1.1384,-9.3543,1.2491,1.786,-9.3543,4.0751,10.5254,7.6596,1118
-10.1216,-9.6906,-0.3837,3.7465,-9.6906,5.1745,18.6908,9.9591,1119
-8.1905,-9.7078,-1.1053,3.2995,-9.7078,2.6784,11.5861,8.4174,1120
-0.5587,-9.6371,0.1771,0.6569,-9.6371,1.1707,10.8202,7.0073,1121
-3.6817,-9.769,0.3608,1.9933,-9.769,5.7934,14.0687,8.4573,1122
-2.0917,-9.4366,0.0914,1.7929,-9.4366,4.0342,9.8919,7.0781,1123
-7.2442,-10.2194,-0.4686,4.1068,-10.2194,2.6505,9.1181,6.9763,1124
-3.4951,-9.6364,0.4095,1.4876,-9.6364,3.6197,10.4074,7.6405,1125
-1.5673,-9.7707,-0.0219,0.5991,-9.7707,1.9818,6.5281,4.8284,1126
-1.7989,-9.7401,-0.1901,0.9848,-9.7401,2.1948,10.1071,6.3695,1127
-1.4916,-9.8428,-0.2358,0.9007,-9.8428,0.5305,6.466,5.6405,1128
-0.4614,-9.7091,0.2281,0.4815,-9.7091,0.7179,5.1726,4.4112,1129
-1.514,-9.8332,-0.1809,0.794,-9.8332,0.9191,9.0197,8.1727,1130
-0.314,-9.7111,1.1668,1.3692,-9.7111,1.2673,12.7518,11.7172,1131
-2.1459,-9.7293,-0.055,1.4219,-9.7293,2.4169,23.7929,8.4321,1132
-3.5036,-9.7328,-1.229,1.4391,-9.7328,0.7328,12.8755,11.2492,1133
-4.5951,-9.7565,-0.8554,2.605,-9.7565,0.8905,31.4264,25.5127,1134
-9.6938,-9.8172,2.5077,4.9073,-9.8172,3.0488,52.3006,44.2229,1135
-3.0102,-9.7584,5.5672,5.797,-9.7584,7.5109,40.1641,16.054,1136
-3.6014,-9.4022,0.0538,3.1389,-9.4022,1.4992,10.4712,6.1576,1137
-2.9185,-9.5109,0.6518,1.8714,-9.5109,1.3552,18.6963,16.1823,1138
1.1532,-9.8321,2.9468,1.3652,-9.8321,0.6047,8.6623,6.99,1139
-4.4761,-9.7134,-1.474,1.617,-9.7134,2.5538,40.5928,39.8206,1140
-4.7612,-9.7074,-1.3356,2.7444,-9.7074,2.1596,15.9277,9.2944,1141
-5.9939,-9.5645,-0.6521,2.7042,-9.5645,3.6481,23.8783,18.9852,1142
-3.3837,-9.8163,-0.1914,2.1446,-9.8163,2.7151,20.2419,16.0022,1143
-7.9398,-9.7678,-1.7632,3.5811,-9.7678,5.0986,22.1355,10.6906,1144
-5.1614,-9.6637,-0.9936,1.7622,-9.6637,3.0623,10.3611,6.319,1145
-7.0721,-9.6485,-0.9113,1.8735,-9.6485,3.1989,11.9064,8.2599,1146
-5.3545,-9.665,1.2234,2.883,-9.665,4.7698,12.9474,7.0113,1147
-3.2682,-9.6661,-0.2313,1.8241,-9.6661,1.3809,8.9414,7.7205,1148
0.1008,-9.7341,0.5078,0.2885,-9.7341,0.8052,6.9552,3.5933,1149
-1.1495,-9.6833,-0.4491,0.5952,-9.6833,1.205,8.2344,5.9613,1150
-1.7042,-9.6716,-0.4484,0.5812,-9.6716,0.7089,6.9936,5.6727,1151
-1.4407,-9.7,-0.2939,0.6621,-9.7,1.3882,8.9814,6.5058,1152
-0.49,-9.7715,0.1574,0.5084,-9.7715,1.3576,6.2863,5.421,1153
-5.1941,-9.7104,0.3027,3.277,-9.7104,4.1727,16.1203,11.2889,1155
-16.8415,-9.6976,-1.0932,5.4697,-9.6976,3.6037,13.5029,8.4862,1156
-11.6796,-9.6606,-2.2419,4.9527,-9.6606,3.8927,9.2172,6.4865,1157
-11.4734,-9.6193,-0.2643,5.2213,-9.6193,4.1392,7.8911,6.3879,1158
-5.6528,-9.6043,-1.3947,2.3048,-9.6043,1.2981,5.1381,4.2122,1159
4.1958,-9.6405,10.4793,3.7822,-9.6405,3.1741,12.3201,8.4644,1160
-7.7127,-9.6465,-4.0391,2.5683,-9.6465,2.3524,11.6264,9.0514,1161
-5.0301,-9.5707,1.4521,3.8608,-9.5707,2.4545,7.4946,5.7021,1162
-17.6217,-9.5607,-3.9214,7.0797,-9.5607,4.4605,14.9791,8.3008,1163
-29.4049,-9.6255,3.4847,12.2202,-9.6255,6.5264,62.0528,13.2033,1165
-120.2383,-9.5517,-8.6238,54.6533,-9.5517,22.0556,102.9842,44.7953,1166
-11.1069,-9.5128,1.1867,11.2917,-9.5128,6.2447,17.2798,11.98,1167
-29.3943,-9.6437,-0.6785,16.8153,-9.6437,8.0226,22.0836,16.3142,1168
-8.2553,-9.6413,0.4009,7.3006,-9.6413,4.8173,10.0839,5.8196,1169
-9.3913,-9.6503,-3.5278,4.5487,-9.6503,3.2356,13.4447,7.8764,1170
-2.2125,-9.6114,-1.1236,0.8991,-9.6114,0.5602,4.5567,4.3797,1171
-1.903,-9.6104,-1.0862,0.4081,-9.6104,0.2582,4.6502,4.3424,1172
-1.3834,-9.6094,-1.1762,0.202,-9.6094,0.1268,4.4021,4.3627,1173
-1.6214,-9.6101,-1.2404,0.2211,-9.6101,0.1379,4.4133,4.3288,1175
-1.3569,-9.6107,-1.2219,0.0649,-9.6107,0.04,4.3794,4.336,1176
-1.2732,-9.6088,-1.2242,0.0326,-9.6088,0.0201,4.329,4.3033,1177
-1.2508,-9.6068,-1.2141,0.0303,-9.6068,0.0183,4.3728,4.3512,1178
-1.2568,-9.6109,-1.2254,0.0237,-9.6109,0.0154,4.3447,4.318,1179
-1.2368,-9.6086,-1.2086,0.0252,-9.6086,0.0168,4.346,4.3228,1180
-1.2391,-9.6097,-1.2253,0.0137,-9.6097,0.009,4.3791,4.3425,1181
-1.2578,-9.6094,-1.231,0.0206,-9.6094,0.0126,4.3564,4.3184,1182
-1.254,-9.6078,-1.2133,0.0246,-9.6078,0.0163,4.3475,4.322,1183
-1.2387,-9.6099,-1.2199,0.0177,-9.6099,0.0106,4.364,4.315,1184
