AYGX_min,AZ_mean,AYGX_mean,AYGX_std,AZ_mean.1,GX_std,Gnorm_max,Gnorm_median,timestamp
2.1657,-9.6547,8.5501,6.0243,-9.6547,3.6444,12.7689,8.6059,1206
-162.5459,-9.5467,-21.4312,37.2863,-9.5467,8.2679,37.7493,14.7149,1207
-701.015,-7.1334,-145.4496,278.8309,-7.1334,36.595,76.0584,43.1176,1208
-26.6544,-7.3317,6.6803,14.9227,-7.3317,2.0345,4.4148,3.2766,1209
-86.2727,-7.4074,13.0966,40.9895,-7.4074,6.1462,14.6212,7.8251,1211
