AYGX_min,AZ_mean,AYGX_mean,AYGX_std,AZ_mean.1,GX_std,Gnorm_max,Gnorm_median,timestamp
-7.0063,-9.7766,-3.9291,1.8214,-9.7766,1.6099,5.6738,4.4807,1469
-138.3415,-8.8029,-12.2729,36.4836,-8.8029,13.6821,55.4491,46.7615,1470
-636.8142,-5.9455,-92.5112,210.9909,-5.9455,39.9824,159.8359,66.686,1471
-51.6507,-8.3759,-1.0453,31.2705,-8.3759,12.636,27.4642,13.8905,1472
-32.3059,-8.9206,20.9082,17.4382,-8.9206,6.1619,34.0931,21.0004,1474
