AYGX_min,AZ_mean,AYGX_mean,AYGX_std,AZ_mean.1,GX_std,Gnorm_max,Gnorm_median,timestamp
-25.8858,-9.7256,-2.4599,15.6484,-9.7256,12.1011,23.6966,8.172,8
-52.5193,-9.7012,-17.0269,16.3085,-9.7012,9.1259,26.8578,11.2471,9
-520.0015,-8.9535,-212.3937,140.8316,-8.9535,28.2591,162.0272,107.8086,10
-61.9715,-6.5445,-10.8556,19.8277,-6.5445,26.6661,136.7548,27.9054,11
-105.5597,-8.5794,-80.6122,27.8185,-8.5794,7.7367,60.8404,58.484,13
