AYGX_min,AZ_mean,AYGX_mean,AYGX_std,AZ_mean.1,GX_std,Gnorm_max,Gnorm_median,timestamp
-1.2907,-9.7815,-0.0133,0.3668,-9.7815,0.673,1.9306,0.7827,1
-0.1959,-9.8038,0.0448,0.1159,-9.8038,0.3759,1.4194,0.7734,2
-716.3681,-9.0223,-7.0826,200.7023,-9.0223,23.9519,69.1924,12.3516,3
-18.0746,-9.6536,-8.469,5.1816,-9.6536,5.4904,17.6606,13.6467,4
-6.6054,-9.6374,-0.2562,4.0781,-9.6374,2.1827,4.8999,2.4469,5
