AYGX_min,AZ_mean,AYGX_mean,AYGX_std,AZ_mean.1,GX_std,Gnorm_max,Gnorm_median,timestamp
-16.5984,-9.812,-2.9448,8.532,-9.812,6.1531,30.9867,13.1435,492
-56.6687,-9.563,4.09,19.2452,-9.563,11.7076,50.9674,22.6763,493
-323.1507,-9.1418,-197.7962,128.9547,-9.1418,7.7234,106.7658,101.0727,495
-179.0834,-7.1496,-76.9445,58.3067,-7.1496,6.5199,123.5792,111.4173,496
-171.0868,-9.2106,30.3946,81.8537,-9.2106,18.2876,84.445,33.4961,497
