AYGX_min,AZ_mean,AYGX_mean,AYGX_std,AZ_mean.1,GX_std,Gnorm_max,Gnorm_median,timestamp
-34.8717,-9.6147,1.5251,12.6874,-9.6147,10.948,18.9828,9.0931,5
-320.8973,-9.5622,-80.6857,91.704,-9.5622,12.5204,78.4655,16.4944,6
-1112.9151,-7.1008,-190.1562,232.6419,-7.1008,25.2773,119.4322,95.7342,7
-15.4825,-9.234,34.94,45.3887,-9.234,8.8909,80.193,45.9064,8
-26.9175,-9.4837,-5.8754,14.702,-9.4837,6.0213,29.9244,18.1491,9
