AYGX_min,AZ_mean,AYGX_mean,AYGX_std,AZ_mean,GX_std,Gnorm_max,Gnorm_median,timestamp
-0.0539,-9.9089,-0.0249,0.0131,-9.9089,0.0868,1.6928,1.6649,0
-0.0484,-9.9082,-0.0277,0.0121,-9.9082,0.061,1.7107,1.6615,1
-0.7794,-9.9023,-0.0309,0.2128,-9.9023,0.7356,2.7308,1.6828,2
-86.776,-9.7238,-23.8867,37.0636,-9.7238,12.0195,31.9883,19.0619,3
-42.9294,-9.438,-9.4523,14.827,-9.438,4.5652,12.6458,5.9923,4
-43.8413,-9.1514,-18.262,12.8184,-9.1514,3.7447,11.7556,6.0119,5
-74.2464,-9.5765,37.6133,41.3403,-9.5765,14.7675,75.6013,33.4627,6
-1.3183,-9.9409,0.0161,1.1237,-9.9409,2.1238,4.8649,2.9515,7
-4.5814,-9.9198,-0.3782,1.2742,-9.9198,2.7375,7.7858,2.3932,8
-11.2688,-9.8845,-3.1452,4.5418,-9.8845,3.9787,9.0411,2.5607,9
-6.4115,-9.9003,1.1367,4.6035,-9.9003,3.8538,7.2853,4.2894,10
-23.27,-9.8314,-2.3112,8.0966,-9.8314,4.2151,8.6543,6.5447,11
-1.4045,-9.8059,6.1352,6.6105,-9.8059,4.3484,10.2897,8.5538,13
-280.163,-8.2758,-5.2081,59.8962,-8.2758,17.6142,91.5595,27.4669,14
-40.7496,-9.7089,-17.1394,15.0655,-9.7089,4.8044,30.8171,15.7269,15
-22.8109,-7.6372,6.826,20.1601,-7.6372,10.392,58.8449,40.698,16
-2.483,-10.1174,0.4007,1.7917,-10.1174,1.5631,4.546,2.7294,17
-0.0965,-9.9181,0.3738,0.3961,-9.9181,0.8302,2.3405,1.6488,18
-64.041,-9.945,-8.8317,20.4016,-9.945,9.5744,37.448,25.2544,19
-48.7567,-9.7659,-11.8504,18.5987,-9.7659,6.4093,15.1237,5.4493,20
-118.1794,-9.8708,-11.2873,38.3298,-9.8708,8.1417,27.8358,12.7206,22
-116.3677,-9.5674,-8.6612,45.2919,-9.5674,17.37,37.7787,18.1151,23
-96.0522,-9.7018,-11.8446,30.8036,-9.7018,13.1179,28.4588,12.7323,24
-31.8566,-9.6774,19.672,40.9335,-9.6774,13.1293,36.4163,16.0083,25
-60.7481,-9.8529,-10.9675,20.6035,-9.8529,9.0653,31.1663,12.619,26
2.9523,-9.8143,23.5551,22.8029,-9.8143,8.508,48.9771,31.3185,28
-59.0463,-9.7954,-3.015,13.25,-9.7954,6.8847,34.1923,14.282,29
-94.3469,-9.1254,3.5179,47.8331,-9.1254,15.9413,97.1998,25.5324,30
-43.1018,-9.8937,-1.7564,23.2989,-9.8937,3.8653,30.8837,23.8989,31
-9.868,-10.0415,1.1995,8.7116,-10.0415,4.9039,65.4678,14.3841,33
-6.7351,-9.9012,66.175,68.4914,-9.9012,20.0808,76.5126,46.9399,34
-4.4821,-9.7918,24.0413,19.3149,-9.7918,4.2376,57.547,51.0358,35
-15.0993,-9.9333,64.1674,71.306,-9.9333,27.3252,84.9108,67.7543,36
-10.1368,-10.259,2.1099,10.3432,-10.259,6.8513,73.6772,47.99,38
-28.9772,-10.1058,1.7911,7.4778,-10.1058,7.4437,42.4258,15.8603,39
-8.8631,-9.5838,5.6417,11.1478,-9.5838,11.0982,43.7044,26.6241,40
-1.4094,-10.2186,3.6517,3.9558,-10.2186,7.0225,89.5234,68.977,41
-10.6933,-9.8367,0.5877,10.0536,-9.8367,4.1505,17.4531,15.5068,42
-1.4871,-9.9203,-0.3228,0.854,-9.9203,1.3913,27.7822,25.7001,43
-30.7777,-9.8587,-2.6316,13.9037,-9.8587,9.7787,20.2961,11.2975,44
-0.6871,-9.931,0.32,0.6385,-9.931,1.3784,3.7245,2.0527,46
-10.922,-9.8979,-0.182,4.4598,-9.8979,4.4259,11.0847,2.6205,47
-3.7778,-9.9232,-1.0392,2.7103,-9.9232,2.6459,11.5384,8.3906,48
1.9879,-9.8957,5.3917,2.0636,-9.8957,2.5052,9.5695,6.1505,49
-0.3476,-9.9185,-0.0472,0.1707,-9.9185,0.7418,2.1712,1.7379,50
-3.7382,-9.9277,-1.7933,1.266,-9.9277,1.4031,4.7604,2.6481,51
-2.3094,-9.9361,-0.5915,1.1118,-9.9361,1.2979,4.5135,2.7172,52
-1.8929,-9.9088,-0.4933,0.6835,-9.9088,1.3409,5.0964,2.9681,54
-4.1657,-9.9427,0.0099,1.1125,-9.9427,1.8186,4.7957,2.2707,55
-0.3755,-9.9223,0.0199,0.2001,-9.9223,0.8708,3.1307,2.4834,56
-16.7282,-9.8808,-8.88,6.0467,-9.8808,1.6432,10.5232,8.8761,57
-11.7796,-9.9338,4.4881,9.7979,-9.9338,2.0119,17.819,15.8328,58
-13.4368,-9.8266,13.164,16.5962,-9.8266,6.0773,24.2065,18.9322,59
-19.1946,-9.7563,-1.5659,6.2127,-9.7563,3.9916,14.2847,10.0101,60
-6.3359,-9.9003,0.4702,3.1032,-9.9003,5.2003,17.296,13.1513,61
-2.2263,-10.1815,1.1789,2.6917,-10.1815,1.5012,22.0806,18.1093,63
-9.5395,-10.0675,-0.8648,4.9069,-10.0675,4.6474,76.1753,52.9957,64
-12.4755,-10.9173,-1.5586,4.8293,-10.9173,2.8586,99.9652,85.8909,65
-10.1501,-10.1327,13.781,14.0574,-10.1327,6.2582,119.2436,104.4823,66
-30.8636,-10.2871,5.5588,21.5963,-10.2871,4.0527,25.4276,20.7419,67
-10.987,-9.6088,-1.1223,5.0127,-9.6088,3.1548,27.4219,21.4806,68
-1.3567,-9.8253,5.0803,8.347,-9.8253,1.9482,16.8365,10.7589,69
-27.2482,-7.44,-4.3084,15.9564,-7.44,6.5772,109.6971,40.1406,70
-38.7129,-10.0909,10.5249,30.309,-10.0909,7.2261,53.1521,37.0528,71
-7.8474,-10.1438,6.8471,12.5014,-10.1438,9.4661,40.4429,32.1088,73
-0.9816,-10.0751,15.7246,9.2046,-10.0751,5.2512,32.5338,22.2653,74
-28.7623,-10.3694,-10.7654,10.7823,-10.3694,15.429,40.3933,25.3491,75
-16.9453,-9.7345,-4.6851,7.6543,-9.7345,12.4718,28.2914,17.6601,76
-20.537,-10.5376,24.5685,33.4567,-10.5376,2.3412,29.9232,26.6662,77
-23.7679,-9.7005,-1.0103,19.8355,-9.7005,17.6067,42.5464,28.3846,78
-41.6072,-10.1548,-12.8751,20.2938,-10.1548,5.4178,33.4097,24.4736,79
-35.7153,-9.5027,-18.2172,11.3245,-9.5027,1.9257,25.0529,20.2605,80
-8.2744,-10.0067,2.6716,11.3448,-10.0067,7.8255,22.737,8.6516,81
-3.2024,-9.9745,1.1766,3.9336,-9.9745,6.2309,13.108,8.0139,83
-9.8194,-9.7135,2.0082,6.5164,-9.7135,12.9983,39.9437,31.6488,84
-36.7591,-10.6442,2.6705,22.9438,-10.6442,15.7303,43.5403,28.7208,85
-2.9192,-10.8437,4.9089,7.2853,-10.8437,17.1199,37.7704,28.8822,86
-3.9001,-9.8338,10.5945,12.7676,-9.8338,14.9898,29.5623,27.1404,87
-15.999,-9.7451,4.4461,14.7551,-9.7451,9.1048,35.0048,33.3184,88
-25.2641,-10.2567,-2.8211,14.1377,-10.2567,6.1473,26.3337,12.9773,89
-5.1697,-10.1755,-1.212,3.295,-10.1755,5.4417,21.6501,13.6553,90
-9.0372,-9.8624,14.503,21.8567,-9.8624,20.7554,49.3875,32.1765,91
-44.1536,-10.1022,4.6983,20.0378,-10.1022,13.9396,22.0819,19.3039,93
-24.9829,-9.9518,10.9182,14.3963,-9.9518,20.7072,46.7405,28.6156,94
-23.3557,-9.9332,18.2125,25.8761,-9.9332,26.8712,49.4055,38.9989,95
-19.8531,-10.1528,-3.9041,7.781,-10.1528,8.5334,24.3413,14.3686,96
-8.6386,-9.8632,6.7793,11.5586,-9.8632,11.1074,40.1401,32.855,97
-35.9806,-9.8538,0.4397,23.7373,-9.8538,1.36,31.2855,26.3493,98
-18.8976,-9.5834,2.5914,11.5301,-9.5834,3.5981,18.6412,15.1745,99
-11.0166,-10.1041,1.8878,11.6004,-10.1041,11.2171,27.4174,12.1283,100
-11.2647,-10.1173,3.6511,10.9833,-10.1173,7.2599,25.1657,19.0291,101
-12.4769,-9.9766,6.8788,12.8833,-9.9766,11.1224,32.9519,22.6428,104
-11.6962,-10.0796,-2.9331,4.6096,-10.0796,3.3866,11.983,8.1699,105
-0.4896,-9.4308,0.8829,1.0045,-9.4308,2.1503,18.8265,17.1209,106
-7.8579,-9.9735,-1.6754,4.4206,-9.9735,8.3839,30.636,18.0769,107
6.0516,-10.0476,14.9652,5.6991,-10.0476,3.7811,27.5894,17.0566,108
-0.6312,-9.9007,3.1741,2.7852,-9.9007,1.6228,20.0286,12.1789,109
-0.1816,-9.8577,0.1838,0.2454,-9.8577,0.7264,13.756,11.3745,110
-1.4102,-9.9192,0.4155,1.3093,-9.9192,4.4657,21.0343,8.2513,111
-1.4178,-9.9593,0.2852,1.2521,-9.9593,3.0435,38.0225,26.0305,113
-3.1962,-9.9753,1.5623,2.8889,-9.9753,3.8065,38.6732,19.4276,114
-6.8653,-9.9073,0.7358,5.531,-9.9073,0.9257,28.3917,25.808,115
-2.1986,-9.9172,-0.6477,0.8129,-9.9172,0.6322,7.9504,5.3287,116
-1.8017,-9.7684,-0.1292,1.2204,-9.7684,3.1776,19.2638,11.3346,117
-1.2925,-9.9924,0.6255,0.966,-9.9924,2.1616,24.4087,7.6029,118
-2.4408,-9.9354,-0.4368,1.846,-9.9354,0.7607,29.2314,28.3412,119
-16.6491,-9.9289,-1.6937,5.6919,-9.9289,2.5818,24.0657,17.1793,121
-3.3255,-9.8789,1.531,2.7318,-9.8789,2.3284,7.5082,2.7541,122
-2.9364,-9.8973,-1.5211,0.7942,-9.8973,0.8387,3.4025,2.4714,123
-0.7245,-9.8976,0.1967,0.8525,-9.8976,1.1773,2.7502,1.5796,124
-0.6221,-9.8793,-0.4318,0.179,-9.8793,0.1938,2.2897,1.9826,125
-7.5237,-9.8873,-2.7928,3.1991,-9.8873,2.9107,6.885,4.3674,126
-54.2296,-9.6822,-14.263,19.9053,-9.6822,5.6094,34.1408,23.3909,128
-33.8361,-9.968,4.7413,15.0205,-9.968,10.3485,80.6458,23.4659,129
-7.5037,-9.7709,-0.7751,3.4154,-9.7709,6.3172,17.4432,9.4886,130
-0.8302,-10.1498,-0.3592,0.3203,-10.1498,1.0794,21.7808,19.0912,131
-2.9479,-9.8296,0.7674,1.9085,-9.8296,2.3319,10.5675,8.1519,132
-0.0,-10.0352,1.1286,1.153,-10.0352,0.9792,5.2306,3.9208,133
-0.0489,-9.9325,1.1608,1.4744,-9.9325,2.8284,22.405,16.4256,134
-1.4054,-9.9858,0.5715,1.3479,-9.9858,1.5445,22.5308,17.3233,135
-0.6414,-9.9196,0.2517,0.7541,-9.9196,2.4197,12.2571,9.8282,136
-1.8939,-9.9971,-0.0507,1.8576,-9.9971,1.1401,10.8173,9.0329,138
-5.7093,-9.9269,3.0896,3.3751,-9.9269,10.9038,42.2232,18.3979,139
-6.6144,-9.9648,-1.7222,4.1789,-9.9648,2.7059,29.9972,26.9177,140
0.1876,-10.0021,2.8919,3.1051,-10.0021,3.9913,27.4564,25.6573,141
-2.8082,-9.9635,3.0184,3.9532,-9.9635,1.0369,11.275,9.8274,142
-7.4212,-9.957,-0.928,3.1576,-9.957,2.6664,18.3856,12.0466,143
-0.6547,-9.9382,0.3744,1.0631,-9.9382,4.6792,17.2862,8.51,144
-2.3437,-10.0745,6.4801,6.9521,-10.0745,9.2264,28.3228,24.4141,145
-4.778,-9.9716,5.724,9.1959,-9.9716,11.6513,41.8181,24.5578,146
-4.6724,-9.9058,1.9671,5.438,-9.9058,5.5389,17.1065,13.2282,148
-6.2336,-10.2131,0.3697,3.5615,-10.2131,3.6161,11.4947,9.1152,149
-12.2142,-10.1159,-2.663,4.1308,-10.1159,5.1599,15.0398,11.5417,150
-0.2083,-10.2859,3.4074,3.6609,-10.2859,2.589,12.3264,10.1841,151
-5.4007,-10.2009,1.1685,4.3111,-10.2009,6.4982,17.2758,9.6631,153
-0.7656,-9.8574,0.5617,1.5037,-9.8574,4.7637,15.3126,14.1854,154
-2.4523,-10.0276,-0.6502,0.9778,-10.0276,1.5233,8.966,6.8214,155
-6.1344,-9.9901,0.8388,3.979,-9.9901,4.7837,19.5516,14.6253,156
-4.3897,-10.0274,4.958,7.8199,-10.0274,10.0357,41.5716,37.1383,158
-2.0804,-9.9385,0.83,1.5527,-9.9385,1.3144,18.6452,8.1971,159
-10.2869,-9.9522,0.3546,4.0414,-9.9522,5.7069,20.4896,9.6094,160
-0.438,-9.9488,0.0013,0.1978,-9.9488,0.6605,2.3315,2.0233,161
-0.2904,-9.9438,-0.0816,0.1173,-9.9438,0.744,2.3827,1.657,162
-0.8415,-9.9311,-0.2815,0.3147,-9.9311,0.5931,2.1784,1.8372,163
0.1301,-9.9375,0.6195,0.378,-9.9375,0.6888,3.2131,2.3751,164
-4.725,-9.9052,-0.8972,1.7303,-9.9052,1.9553,4.1835,2.318,165
-0.5507,-9.9369,0.0961,0.5898,-9.9369,1.4543,3.8939,1.8048,166
-0.68,-9.9363,-0.2426,0.2004,-9.9363,0.6942,2.6607,1.745,168
-0.2818,-9.9363,-0.0182,0.1392,-9.9363,0.418,1.8256,1.6585,169
0.0381,-9.941,0.0971,0.0565,-9.941,0.1713,1.9578,1.6668,170
-0.5044,-9.9364,-0.3089,0.1701,-9.9364,0.2935,2.3376,2.1574,171
-0.0881,-9.9319,-0.0241,0.0486,-9.9319,0.1818,1.702,1.6041,172
-0.0692,-9.9379,-0.0265,0.028,-9.9379,0.1132,1.6982,1.5742,173
-0.3275,-9.9367,-0.2878,0.0345,-9.9367,0.0486,1.9033,1.8672,174
0.0222,-9.935,0.0332,0.0066,-9.935,0.0199,1.6311,1.6058,175
-2.6412,-9.9348,-1.0515,1.173,-9.9348,2.5557,5.93,4.0641,176
-3.0721,-9.8933,-2.1844,0.7168,-9.8933,0.7586,3.7153,2.6042,177
-11.6931,-9.8949,-0.353,4.6306,-9.8949,4.4806,8.5836,4.2814,179
-0.6066,-9.9324,-0.0011,0.3805,-9.9324,0.992,2.0992,1.847,180
0.0344,-9.9218,0.4648,0.2466,-9.9218,0.691,2.3738,1.9802,181
-12.6589,-9.9197,-0.4048,4.9605,-9.9197,5.3864,8.4862,6.3902,182
-5.2883,-9.9375,-1.152,2.5839,-9.9375,2.3189,6.7637,3.8072,183
-1.1035,-9.9714,1.2841,3.9548,-9.9714,2.2765,9.838,2.4686,184
-18.7885,-9.9278,-2.6306,8.9708,-9.9278,6.0084,15.8702,9.9521,185
-25.5279,-9.9738,-2.6609,7.2111,-9.9738,5.1601,15.2647,8.5316,186
-12.5524,-9.9539,0.0314,8.0328,-9.9539,2.9959,10.7236,6.2864,187
-16.4606,-10.0026,-4.5278,6.2686,-10.0026,4.2314,24.3668,21.8073,188
-7.4816,-9.8543,0.8027,4.1959,-9.8543,4.5699,15.2665,8.4241,189
-21.4901,-9.9399,-0.3328,8.9635,-9.9399,8.3154,27.1898,16.5619,190
-5.6084,-9.9729,15.4647,21.8561,-9.9729,4.6024,29.0507,23.2166,191
-1.1377,-10.0071,1.8659,3.099,-10.0071,4.3663,21.3717,17.5955,192
-17.1758,-10.0834,6.6479,20.4497,-10.0834,7.0855,22.1582,20.4905,193
-18.0178,-9.9984,-0.3439,8.6787,-9.9984,6.0793,14.8318,8.7356,194
-21.6051,-9.9238,-7.6317,10.0754,-9.9238,5.2427,20.2654,15.2086,195
-28.5319,-10.17,26.7996,43.7132,-10.17,26.2004,47.0329,31.3862,196
-32.458,-10.1225,-5.5965,11.5145,-10.1225,9.4418,14.7448,11.1974,197
-9.9231,-10.073,0.9979,8.7782,-10.073,7.8273,17.5453,5.9864,198
-80.6219,-9.6341,-4.8707,27.0096,-9.6341,15.1473,25.5261,18.3448,199
-73.9743,-10.1587,0.5204,17.4003,-10.1587,6.9738,22.0772,10.5966,200
-18.4247,-9.8736,2.0786,12.6176,-9.8736,11.2998,26.5546,20.3706,201
-8.1186,-9.8389,0.1256,6.7764,-9.8389,3.6535,25.9678,11.4153,202
-20.6948,-10.2306,-5.3885,8.5308,-10.2306,15.157,34.4672,28.3792,203
-12.8367,-9.6928,-0.9317,4.8932,-9.6928,5.1544,9.525,6.8014,204
-1.0146,-9.8507,9.6898,7.2652,-9.8507,6.5742,18.8918,15.6944,205
-37.6372,-9.5095,0.3757,13.4876,-9.5095,8.839,19.4563,12.7342,206
-13.2217,-9.9687,-0.8326,5.7025,-9.9687,6.8078,23.7151,14.1913,207
-17.2397,-9.7321,12.8751,30.9465,-9.7321,14.3014,42.6373,12.2727,208
-27.724,-9.9896,12.1291,29.8104,-9.9896,20.3447,61.0351,19.4216,209
-5.808,-10.0298,6.8398,7.3473,-10.0298,13.7852,30.0668,17.2355,210
-24.5865,-9.8705,6.8636,21.2189,-9.8705,5.9709,31.2457,21.8135,211
-1.007,-9.9035,2.6002,2.5154,-9.9035,2.1139,12.8236,6.702,212
-23.8738,-10.3704,-4.1456,9.7013,-10.3704,1.8359,12.4234,8.8233,214
-4.4749,-9.6592,4.8515,4.275,-9.6592,3.1491,16.2842,12.1185,215
-13.274,-10.0161,3.9738,13.336,-10.0161,13.3996,35.9745,24.2967,216
-12.1674,-9.6426,-1.7931,7.5591,-9.6426,6.0454,26.8982,21.8341,217
-4.2338,-9.9469,1.1351,4.0471,-9.9469,3.3395,10.0735,5.9827,218
-68.2227,-10.0319,-0.1922,18.5957,-10.0319,12.2921,33.7482,14.7658,219
-33.8216,-9.8802,10.4289,23.8142,-9.8802,13.9702,40.4898,21.5062,220
3.2774,-9.7575,18.2838,8.5557,-9.7575,6.6486,26.2642,22.3408,221
-3.7893,-9.9416,1.3581,4.375,-9.9416,3.8334,12.8386,11.7251,222
-4.0172,-9.9131,4.0158,5.364,-9.9131,5.9123,26.1085,23.3594,223
0.104,-10.0307,10.7319,7.8679,-10.0307,8.7921,33.2937,23.6798,224
-51.8132,-9.7514,26.1978,56.4122,-9.7514,19.8769,64.4398,41.5876,225
-1.1911,-10.3293,10.0838,7.336,-10.3293,12.0613,33.3365,25.1119,226
-7.6059,-10.0476,-1.4909,3.6667,-10.0476,4.9409,20.8374,12.7431,228
-11.1387,-9.8639,7.8483,15.1463,-9.8639,15.0324,39.0853,19.6601,229
-5.2063,-9.1652,2.4877,4.9789,-9.1652,5.4724,21.6216,17.7303,230
-68.5489,-9.489,11.6787,44.1635,-9.489,5.8339,52.0643,49.7685,231
-17.0911,-10.0562,-0.9674,12.0811,-10.0562,7.2994,23.8674,18.8983,232
-5.3455,-9.5559,11.2099,17.734,-9.5559,15.1082,28.5179,21.8535,233
-3.5814,-10.2414,-0.1792,2.5152,-10.2414,4.1979,14.8596,11.1484,234
-12.1345,-9.9144,0.3302,7.244,-9.9144,5.4175,11.1599,7.0548,235
-6.96,-10.0371,1.0711,3.6068,-10.0371,1.8622,10.0515,7.4758,236
-0.8559,-9.9903,0.0185,0.7436,-9.9903,1.0477,5.6634,4.1249,238
-19.7296,-10.0774,3.9843,11.5218,-10.0774,12.2242,43.8302,18.2555,239
-11.288,-9.8936,7.6598,16.8152,-9.8936,4.6271,23.1219,19.5955,240
-9.4395,-9.9783,-0.6715,4.0145,-9.9783,5.313,14.4627,7.593,241
-15.4974,-10.194,-4.7993,8.8911,-10.194,11.8117,33.3482,18.174,242
-28.7856,-10.1785,1.3382,19.5485,-10.1785,10.9221,33.4169,17.9811,243
-3.4754,-10.155,0.979,3.0612,-10.155,5.0593,22.7062,16.2747,244
3.6892,-9.8917,25.6416,17.1063,-9.8917,2.4893,31.9599,30.5655,245
-2.188,-9.8708,0.3774,1.9683,-9.8708,3.9045,16.465,9.4129,246
-2.0452,-9.9297,0.4555,1.8161,-9.9297,1.0209,8.1176,6.0842,248
-17.1595,-9.8124,7.1707,17.1376,-9.8124,15.2312,36.441,20.5922,249
-15.3334,-9.8287,-2.1822,5.4556,-9.8287,2.131,11.2834,8.133,250
-12.8375,-9.6919,5.2943,12.5194,-9.6919,14.6631,37.8842,27.7161,251
-16.3816,-9.7926,-7.0327,5.6668,-9.7926,9.6912,30.9563,20.0287,252
-0.0054,-9.824,2.0344,1.5894,-9.824,3.7636,11.8108,8.1563,253
-28.96,-10.3516,3.7204,16.5842,-10.3516,1.4906,20.3765,16.6049,254
-2.7109,-10.1733,20.1115,18.4496,-10.1733,9.904,39.6823,35.2332,255
-4.4602,-9.8057,2.9636,7.2635,-9.8057,9.2072,27.6832,11.4062,256
-31.9937,-9.6951,2.693,21.3601,-9.6951,11.5461,26.4889,24.4022,258
-19.1535,-10.0049,0.7537,9.3017,-10.0049,11.4848,38.5289,14.1051,259
-10.8039,-9.8964,-1.5678,4.6252,-9.8964,4.5328,15.4341,10.1625,260
-1.6175,-10.043,0.0797,1.5268,-10.043,1.8551,12.5436,10.6853,261
-17.0834,-9.6779,-3.1644,8.6861,-9.6779,4.6241,15.14,9.7655,262
-7.5792,-10.1089,9.343,7.9405,-10.1089,2.4445,20.3677,17.1191,263
-1.0828,-9.9375,3.4176,4.8306,-9.9375,2.0751,18.6753,17.1487,264
-5.9407,-10.1392,18.972,27.3135,-10.1392,10.1014,38.2369,19.3365,265
-12.1345,-9.9075,-2.4326,5.2776,-9.9075,7.5729,28.0771,12.4674,266
2.5012,-10.3993,12.4859,6.529,-10.3993,2.5281,18.0368,16.4618,268
-62.7544,-10.027,6.2389,25.9575,-10.027,14.2436,35.3217,19.4322,269
-44.5392,-9.8385,1.9528,31.4184,-9.8385,4.9433,34.7027,30.9534,270
-5.0407,-9.7535,7.5427,16.2934,-9.7535,8.8099,20.7609,12.2847,271
-10.951,-9.8359,1.4403,7.6416,-9.8359,12.0258,27.1851,22.5231,273
-8.723,-10.0834,1.3518,4.3119,-10.0834,5.9913,25.4283,9.5562,274
-0.6617,-9.8274,1.8055,2.4082,-9.8274,1.8952,8.1464,6.9553,275
-12.8791,-9.974,5.5739,10.5262,-9.974,15.5432,34.5032,18.3557,276
-25.5565,-10.1763,6.3403,20.1828,-10.1763,14.8487,32.9766,25.7146,278
-10.556,-9.9829,12.1088,24.0627,-9.9829,13.4816,46.5186,20.0741,279
-21.5369,-9.7886,15.5635,25.0122,-9.7886,5.1958,33.193,22.6094,280
-1.7626,-9.8971,5.8766,5.6245,-9.8971,12.4683,19.4732,17.1548,281
4.616,-9.8056,16.9951,10.4802,-9.8056,1.6224,27.7716,22.3542,282
-3.1322,-10.0462,2.8527,4.6211,-10.0462,2.3363,14.3607,11.7816,283
-0.4794,-9.9421,0.6776,1.5938,-9.9421,3.1519,7.4384,6.3004,284
-0.1612,-9.9182,0.3336,0.2566,-9.9182,0.339,4.1737,3.4697,285
-3.8387,-9.946,2.1884,3.3945,-9.946,2.286,14.9816,12.4273,286
5.6634,-9.5158,28.5619,18.5554,-9.5158,25.1777,50.5832,27.1515,289
0.8412,-9.7234,13.0199,12.288,-9.7234,8.4095,28.9666,21.9897,290
1.6623,-9.8322,28.3068,26.0935,-9.8322,4.8898,30.741,27.9538,291
-0.3764,-9.7016,22.7471,24.3117,-9.7016,8.6313,33.4144,23.9303,292
-13.2091,-9.4794,4.0166,12.5704,-9.4794,11.7467,25.6363,19.428,293
-4.735,-9.9589,1.1959,3.8003,-9.9589,3.1832,16.2454,15.1955,294
-18.7193,-10.3997,14.5423,32.3376,-10.3997,4.4436,37.1964,32.1909,295
-2.821,-9.8547,0.1923,1.7637,-9.8547,2.3007,10.9743,8.4482,296
-2.3051,-9.6186,1.155,2.6513,-9.6186,2.5411,12.1058,10.2517,297
-34.711,-9.9455,8.6698,21.3787,-9.9455,16.0976,47.1755,22.2193,299
-2.7596,-10.3292,1.2385,3.4072,-10.3292,5.6321,20.8762,17.7049,300
-21.5487,-9.759,21.5877,33.1191,-9.759,5.8009,43.1118,28.8811,301
-23.7824,-9.8593,5.073,14.4141,-9.8593,10.6075,24.1254,18.4314,302
-14.3053,-9.5045,-2.3528,5.4952,-9.5045,5.175,13.1721,9.3766,303
-19.261,-9.657,13.9065,33.4299,-9.657,14.9431,54.6642,15.1071,304
2.7797,-9.9395,22.2577,13.3269,-9.9395,10.3107,45.1092,28.2181,305
-40.7716,-8.0645,-1.4661,11.9507,-8.0645,6.4625,55.7797,11.1019,306
-21.7625,-9.2096,-0.369,9.1977,-9.2096,3.1831,19.9892,10.5737,307
-21.0976,-9.8891,5.2555,16.6821,-9.8891,12.7518,37.6204,19.6872,309
-13.2006,-9.9749,2.4113,12.1726,-9.9749,14.4889,33.2728,22.955,310
-10.4043,-9.8984,0.6267,5.4263,-9.8984,8.9635,29.0031,18.9245,311
-12.8271,-9.8831,13.4745,15.7283,-9.8831,5.5479,30.7225,25.482,312
-23.5713,-10.0037,2.1545,17.2475,-10.0037,6.3374,26.0257,19.4971,313
-65.9892,-9.7519,-12.7496,31.7068,-9.7519,6.113,37.8454,32.0866,314
-24.1364,-10.0053,10.3811,22.7515,-10.0053,4.881,26.1171,18.382,315
-10.2259,-9.8957,1.3351,7.6913,-9.8957,7.6518,18.3585,11.204,316
-18.5041,-9.6616,-3.2405,6.8764,-9.6616,5.929,11.416,9.2007,317
-15.866,-9.9219,-0.4796,8.2901,-9.9219,6.9151,16.5712,8.1917,319
-12.6416,-10.0413,3.2417,8.9987,-10.0413,10.4932,18.8095,13.9385,320
-12.1487,-10.0656,6.2405,12.4378,-10.0656,9.9527,22.6279,14.9417,321
-2.0929,-10.1923,-0.0248,1.7426,-10.1923,2.9494,6.6471,5.4136,322
-35.3934,-9.8991,8.7168,26.3733,-9.8991,5.5289,28.261,23.9316,323
-5.4018,-10.1783,5.7679,9.895,-10.1783,11.3964,34.1293,32.0678,324
-24.2845,-10.3953,-2.7407,11.9231,-10.3953,6.7589,37.4,32.9554,325
-58.3538,-9.3011,-3.6484,18.0887,-9.3011,5.5902,46.169,13.0871,326
-0.1382,-10.7339,10.2417,12.2679,-10.7339,8.6547,25.9213,22.3636,327
-0.2906,-9.7074,17.3352,16.0912,-9.7074,8.7901,41.3657,23.6253,328
-14.8296,-10.0594,-1.3949,6.1483,-10.0594,9.3531,34.164,22.6905,329
-28.867,-9.6493,-0.5236,10.8635,-9.6493,7.9694,20.0436,11.2861,330
-12.2933,-10.0385,0.2206,9.6599,-10.0385,7.7312,17.8356,13.6305,331
-6.3593,-9.6627,1.7121,6.6114,-9.6627,2.3215,17.2293,13.3127,332
-23.7584,-9.976,1.3779,13.0342,-9.976,5.085,21.4431,17.4669,333
-6.8793,-8.3786,4.0917,7.8881,-8.3786,8.9929,33.9786,32.2416,334
-10.311,-10.0273,0.4741,5.9309,-10.0273,3.4327,27.5248,21.0394,335
-10.522,-9.998,9.8259,14.6636,-9.998,5.4196,33.7108,29.0747,336
-8.7493,-9.6655,42.2671,36.9269,-9.6655,11.9397,64.441,39.7626,337
-3.0449,-9.9128,5.0936,8.5811,-9.9128,6.488,28.9786,19.4516,338
-16.2003,-9.9604,3.0086,9.7756,-9.9604,12.0945,43.2399,26.4304,339
-19.2766,-10.041,20.6555,26.3912,-10.041,3.1039,39.7631,30.6719,340
-21.8903,-10.2763,-0.2826,11.8092,-10.2763,3.9238,68.858,61.1946,341
-0.0304,-9.8091,11.3464,11.6385,-9.8091,4.4922,25.4551,16.4593,342
-16.5898,-10.2643,3.5762,11.6571,-10.2643,3.9497,28.0269,22.7951,343
-24.6313,-9.927,-2.3418,16.5614,-9.927,2.5828,37.3902,26.3913,344
-12.7517,-10.0196,4.0463,8.782,-10.0196,3.2801,37.2973,21.0051,345
-1.765,-10.0702,4.1424,4.0277,-10.0702,1.1203,21.7585,13.4235,346
-8.0786,-9.9523,-0.017,5.8608,-9.9523,2.5502,16.5111,10.8716,348
-91.0964,-9.8778,-8.5876,23.5102,-9.8778,11.3737,29.3462,7.7944,349
-5.4892,-9.7256,14.1429,11.6643,-9.7256,5.8536,13.354,10.4092,350
-12.1817,-9.7494,-7.6049,3.4223,-9.7494,1.9518,6.8723,4.5239,351
1.1567,-9.9079,2.0688,0.7294,-9.9079,0.9364,4.4211,3.9195,352
0.5096,-9.9197,8.0851,4.3463,-9.9197,5.0488,15.3066,9.9055,353
-1.8983,-9.9168,-0.507,0.7514,-9.9168,1.2554,4.4719,4.1794,354
-0.4096,-9.9301,-0.0381,0.2448,-9.9301,0.4511,1.4654,1.308,355
-101.4973,-9.703,-16.2112,37.1764,-9.703,14.8588,24.4472,15.2208,356
-20.4728,-9.7964,-11.5151,6.7296,-9.7964,3.346,13.3617,9.5336,358
-82.476,-9.7602,5.5284,27.2732,-9.7602,12.0203,30.8932,10.4938,359
-6.412,-9.9137,2.6658,5.735,-9.9137,4.6689,9.551,4.7446,360
-0.0205,-9.924,0.6703,0.4248,-9.924,0.4974,2.4965,1.8501,361
-0.8717,-9.9227,-0.4041,0.4587,-9.9227,0.5834,1.8035,1.7333,362
-2.6209,-9.9197,0.3697,2.2492,-9.9197,2.5068,5.4349,2.5845,363
-3.3695,-9.9186,3.4397,6.4097,-9.9186,5.4867,11.0254,7.4634,364
-17.9086,-9.8779,-4.226,7.8825,-9.8779,4.4198,9.3305,4.417,365
-4.2117,-9.9033,-0.3341,2.2617,-9.9033,2.2764,4.1409,2.5397,366
-1.1028,-9.9241,0.1768,1.029,-9.9241,1.2232,2.2891,1.8512,368
-0.4038,-9.914,0.2095,0.4061,-9.914,0.4698,1.8541,1.6363,369
0.2402,-9.9159,0.2585,0.0106,-9.9159,0.0127,1.6263,1.6059,398
0.2483,-9.9155,0.2645,0.0101,-9.9155,0.0124,1.6254,1.6106,399
0.2381,-9.9166,0.2625,0.01,-9.9166,0.0116,1.619,1.6049,400
0.2382,-9.9159,0.2636,0.0097,-9.9159,0.0111,1.6226,1.6034,401
0.2267,-9.916,0.2576,0.0122,-9.916,0.0142,1.6254,1.6017,402
-2.209,-9.9179,3.9361,6.3738,-9.9179,4.4056,15.3662,1.7137,403
-56.2324,-9.9291,-4.3053,13.6772,-9.9291,9.3325,22.9191,13.2623,404
-16.1619,-9.8767,-1.3803,5.8749,-9.8767,4.7405,29.0828,14.2889,405
-12.5796,-9.9199,-0.7008,5.2957,-9.9199,6.8375,39.0811,29.0256,406
-13.5493,-9.9615,-1.4966,4.7076,-9.9615,5.1392,62.2778,46.4889,407
-16.3424,-10.1599,-0.7709,6.2522,-10.1599,6.1009,74.3894,35.9683,409
-65.2788,-10.0277,-4.9473,25.6844,-10.0277,6.3384,19.3434,7.0782,410
11.7677,-9.9829,19.947,6.4432,-9.9829,3.3151,25.4522,21.015,411
-3.4451,-10.1937,-1.0299,1.2758,-10.1937,2.5935,57.6788,46.3367,412
-9.4778,-9.8224,-0.5082,3.1728,-9.8224,3.1407,6.3076,4.3331,413
-11.8522,-9.828,-0.3849,9.923,-9.828,8.6198,14.7582,7.1201,415
-21.9474,-9.9478,-6.2538,9.2792,-9.9478,9.4343,25.0192,16.6036,416
-2.9697,-9.9333,-0.2453,2.3639,-9.9333,1.9284,14.2051,12.7774,417
-6.7436,-10.0016,2.355,4.7846,-10.0016,2.8297,47.2076,15.6119,418
-93.507,-9.4858,-30.0708,53.2538,-9.4858,16.9614,27.0022,23.0339,419
35.4777,-8.9154,110.239,64.6363,-8.9154,5.4718,75.3568,65.3146,421
-103.9433,-9.9054,-5.5511,26.2572,-9.9054,10.1812,54.9275,15.2213,422
-12.7194,-9.7667,-4.1598,6.0662,-9.7667,4.8248,12.8705,10.5165,423
-6.0476,-9.8349,-0.2541,3.7986,-9.8349,2.934,22.4695,13.3239,424
-1.0276,-9.9301,1.7671,2.771,-9.9301,4.0638,17.6906,13.655,425
-9.1409,-9.9484,-3.0501,3.3576,-9.9484,3.7321,13.0565,7.3238,426
-23.5537,-9.8327,0.9933,14.8828,-9.8327,2.3676,31.9074,27.2093,427
-27.7221,-10.0247,2.3821,17.5282,-10.0247,6.7032,43.5008,23.6348,428
-21.5122,-10.092,28.5697,29.1291,-10.092,9.7644,80.757,73.3582,429
-61.1642,-10.2818,27.6422,53.0222,-10.2818,18.1566,75.7897,46.9338,431
-17.8995,-10.0369,6.942,17.6986,-10.0369,15.3769,40.5383,18.5693,432
1.1558,-9.7733,10.241,5.3854,-9.7733,2.1274,37.9713,25.5394,433
-8.3304,-10.1189,11.2542,12.9554,-10.1189,11.9957,21.1212,19.482,434
-6.9721,-10.1162,2.3235,9.5697,-10.1162,3.0587,16.8693,9.842,435
-0.4324,-9.5818,24.8186,19.4687,-9.5818,12.0619,71.7634,64.4141,436
-2.3387,-9.885,13.7883,13.0104,-9.885,7.9491,30.3464,20.6284,437
-21.2445,-9.7859,3.0559,17.863,-9.7859,9.6278,35.3126,26.5197,438
-24.4442,-9.9483,12.3415,29.3138,-9.9483,8.9659,33.2715,21.7007,439
-37.0004,-9.8337,3.3531,22.1758,-9.8337,3.879,33.8854,22.7494,441
-23.7668,-9.8159,28.6714,48.8406,-9.8159,24.4337,79.9204,28.0896,442
-29.6243,-10.1053,-0.4384,15.6611,-10.1053,14.9647,35.2733,14.2928,443
-5.7057,-10.1331,14.499,19.0731,-10.1331,8.7231,34.319,22.4472,444
-29.6273,-10.2414,14.5178,37.3404,-10.2414,10.911,41.6307,30.9277,445
0.2623,-10.3511,17.2927,13.0402,-10.3511,16.1047,40.1142,33.1539,446
-7.7222,-9.7713,-1.951,3.5322,-9.7713,9.483,32.1399,27.3687,447
-73.2452,-9.8683,-9.778,45.1444,-9.8683,19.1736,41.3571,29.3832,448
-13.8284,-10.2286,8.2366,16.4563,-10.2286,15.121,34.9261,20.0816,449
-0.8603,-10.0839,7.8074,8.3974,-10.0839,7.0479,25.2497,19.4752,451
-2.8106,-10.0447,4.1688,6.2091,-10.0447,5.5306,13.9884,10.9941,452
-55.241,-9.9987,5.314,26.9092,-9.9987,16.879,65.2739,41.5665,453
-20.123,-10.0061,6.7684,18.6282,-10.0061,10.9518,42.6428,30.4849,454
6.7112,-8.636,295.2145,219.4976,-8.636,24.384,143.3219,89.8335,455
-2.0573,-9.8315,17.7826,13.6713,-9.8315,3.2607,29.1903,23.2064,456
-4.0437,-10.1015,-0.2919,2.2599,-10.1015,3.9058,11.2178,8.8617,457
-7.3852,-9.7925,13.91,18.7229,-9.7925,16.9636,41.4084,25.6554,458
-12.1433,-9.8581,-0.5964,11.2552,-9.8581,12.9932,19.3404,15.0798,459
-6.6403,-9.6903,21.0089,22.2286,-9.6903,14.6216,56.2453,35.3804,461
-22.7664,-9.9778,14.5691,19.2443,-9.9778,15.0495,36.76,19.8215,462
-12.2762,-9.9841,3.0005,11.7972,-9.9841,2.013,13.6366,11.5046,463
-10.6311,-9.5712,-0.1435,8.56,-9.5712,1.8966,35.0851,28.3771,464
-42.7951,-9.5173,-1.7295,20.7225,-9.5173,6.7645,31.6818,23.917,465
-26.9635,-9.4936,-1.7673,12.1018,-9.4936,6.3511,21.1909,14.1116,466
-12.9852,-9.917,1.1293,7.902,-9.917,5.4301,9.9296,7.8826,467
-20.0975,-9.9318,-3.2919,9.4708,-9.9318,8.035,19.5168,15.3942,468
18.4118,-9.1111,88.0726,60.7948,-9.1111,9.7281,71.3335,68.7488,469
-30.7602,-10.8679,-1.8419,11.6524,-10.8679,9.8676,63.4221,36.8722,470
-0.9997,-10.0076,-0.1378,0.6292,-10.0076,3.2734,8.2364,4.5832,471
-14.6644,-10.0651,8.5807,17.4791,-10.0651,2.8096,27.0258,25.0435,472
-9.9472,-10.0812,1.7925,9.5132,-10.0812,10.9371,25.3682,18.9813,473
-3.3524,-10.1191,34.4179,30.4775,-10.1191,14.8489,52.8138,46.4011,474
-0.9577,-10.2915,0.6066,1.1576,-10.2915,4.171,8.3936,5.2396,475
-7.2005,-9.8512,3.3372,8.0432,-9.8512,8.391,31.1054,14.1959,476
-37.8181,-9.928,-7.8256,16.377,-9.928,15.4086,26.9996,20.2197,477
-33.3268,-10.026,22.3129,34.4422,-10.026,6.6351,49.1652,38.0305,478
-14.764,-9.9887,7.9876,11.2297,-9.9887,10.8626,25.6674,14.3704,479
-12.3253,-9.8932,19.8313,34.676,-9.8932,11.7669,37.7989,29.4486,480
-37.0026,-9.8852,0.1284,13.403,-9.8852,13.1,20.602,16.9417,481
-9.7362,-9.953,2.3563,5.6348,-9.953,10.3365,27.0319,11.4814,482
-11.6763,-10.1525,0.5255,8.8346,-10.1525,4.6239,16.0428,12.1736,483
-21.8196,-9.8397,-3.1024,11.2234,-9.8397,3.1542,16.4651,14.196,484
0.4408,-9.747,8.4642,5.8617,-9.747,8.5017,29.7715,25.3693,485
-24.667,-9.7733,-8.1231,10.448,-9.7733,10.3027,22.5973,15.1276,486
-24.5293,-9.9032,6.9224,27.2824,-9.9032,16.3678,38.2793,34.7117,487
-37.2379,-9.8843,11.6965,20.7242,-9.8843,20.9046,38.5737,24.4317,488
-23.5243,-9.7842,-7.064,9.8511,-9.7842,7.8475,16.8893,9.2838,490
-28.809,-9.9161,4.9283,14.6148,-9.9161,19.8855,41.9842,26.4355,491
-13.7689,-9.9142,0.113,4.24,-9.9142,7.6267,27.4904,20.1562,492
-11.9089,-10.3562,-2.397,5.2748,-10.3562,4.8611,32.9386,31.8609,493
-28.0064,-10.2268,16.2912,26.2441,-10.2268,3.3024,63.3658,52.3614,494
-3.7817,-9.6802,11.4417,8.01,-9.6802,2.4847,44.7456,30.9219,495
-2.2086,-10.3319,-0.2086,0.8716,-10.3319,1.2705,25.1541,19.53,496
-17.2987,-9.7021,78.0305,69.7064,-9.7021,11.4718,63.0544,39.1687,497
-21.7647,-9.9296,2.8273,12.5949,-9.9296,11.1095,34.205,17.4689,498
-2.739,-10.1082,11.0793,12.0208,-10.1082,14.0062,26.9597,21.6204,499
-37.1953,-9.8848,1.6313,19.9688,-9.8848,18.5089,37.1136,20.4588,501
-19.7127,-9.9754,3.8545,14.4093,-9.9754,9.4774,28.617,13.9676,502
-7.1364,-9.766,5.1334,11.1873,-9.766,5.0436,26.8893,23.2328,503
-1.248,-10.0537,0.1348,0.896,-10.0537,1.3694,6.0453,4.2518,504
-7.5273,-10.0865,-1.0761,5.7574,-10.0865,1.6571,17.7976,12.0024,505
-8.1916,-10.0714,1.9705,8.9662,-10.0714,4.6718,17.8128,15.0498,506
-10.1193,-9.7891,-2.3409,4.5762,-9.7891,3.3017,9.0971,5.5601,507
-8.9945,-10.0934,2.8488,13.6188,-10.0934,8.1379,34.6727,25.5409,508
-10.3789,-9.8686,8.999,12.038,-9.8686,15.3256,32.6969,18.3802,509
-21.2863,-10.0199,-0.8108,8.7502,-10.0199,8.289,26.6646,13.8147,511
-22.0827,-9.8564,5.3164,18.0337,-9.8564,14.552,29.9607,19.7374,512
-29.8097,-10.0497,-6.0262,12.5677,-10.0497,3.5038,14.8677,12.4036,513
-21.0642,-9.6007,8.246,26.9797,-9.6007,9.1565,19.0988,14.7552,514
-7.9041,-10.151,1.9767,6.6615,-10.151,7.6647,16.3304,14.1137,515
-2.3491,-9.9415,-0.3777,1.6731,-9.9415,3.4101,9.7919,6.2911,516
-15.0541,-9.8099,1.3711,14.3768,-9.8099,8.373,30.4151,18.85,517
-23.8014,-9.9233,-0.8515,7.5286,-9.9233,7.0803,12.9945,10.0692,518
-32.2853,-9.9948,-1.9842,13.927,-9.9948,11.7158,36.3794,21.5642,519
-15.7207,-9.8816,2.092,12.8852,-9.8816,10.2365,29.7836,12.9365,521
-17.5743,-9.9638,13.0561,23.6512,-9.9638,18.7503,38.3379,25.4916,522
-5.7761,-9.9888,14.7632,16.1749,-9.9888,16.6488,31.0425,21.7761,523
-2.5747,-9.8779,4.7451,6.3347,-9.8779,5.3878,14.4139,11.9702,524
-0.6483,-10.0966,5.5718,5.185,-10.0966,6.9266,22.7638,19.7282,525
-4.2052,-10.1246,3.164,5.6529,-10.1246,6.4476,20.1934,13.9526,526
-4.3001,-9.7807,3.1495,8.8995,-9.7807,4.593,16.0435,9.7684,527
-8.2988,-10.0732,3.9917,11.8016,-10.0732,13.3887,33.5169,21.7699,528
-2.5857,-9.8744,12.1343,14.1284,-9.8744,2.0194,17.2372,15.6732,529
-11.7592,-9.8932,3.6558,11.2878,-9.8932,14.1451,41.111,12.4374,531
-27.0528,-10.0063,-0.0519,12.6143,-10.0063,8.6294,38.4379,13.5091,532
-8.6449,-9.9319,-1.7902,4.6174,-9.9319,6.6079,19.7325,18.789,533
-18.1277,-10.1119,2.7588,16.8854,-10.1119,4.6648,29.9643,23.1308,534
-4.9656,-9.9867,1.9429,4.2687,-9.9867,4.1798,16.5215,12.9226,535
2.5188,-9.7101,35.9635,24.3935,-9.7101,10.9917,36.8695,28.7067,536
-13.7425,-9.9203,11.5201,17.6146,-9.9203,8.4833,36.8876,24.566,537
-25.646,-9.963,-5.7781,9.5239,-9.963,8.0555,20.7244,10.5791,538
-2.1777,-10.0852,6.4903,6.7005,-10.0852,4.9818,20.575,16.4915,539
-48.8209,-10.613,7.3116,22.2739,-10.613,15.2472,58.8277,41.1764,541
-7.6163,-9.7738,14.0249,27.7152,-9.7738,13.1278,52.3336,22.4371,542
-6.5704,-10.8988,6.824,15.4052,-10.8988,3.6013,32.0338,25.5281,543
-4.1804,-10.3172,-0.2783,4.13,-10.3172,4.2762,25.4391,17.8921,544
-7.2935,-9.9893,-2.7874,2.3803,-9.9893,5.7978,21.4044,15.9728,545
-16.0842,-9.8238,6.2099,17.8449,-9.8238,1.8984,15.2111,13.3566,546
-3.9447,-10.1421,1.8493,3.4412,-10.1421,4.0699,27.9109,24.3262,547
-27.699,-9.9593,-1.1611,8.5625,-9.9593,3.4248,20.2476,14.235,548
-7.6938,-9.8108,-0.9405,4.0302,-9.8108,3.2921,19.099,18.0526,549
-17.3622,-10.0397,2.151,12.1103,-10.0397,8.9656,32.3598,15.265,551
-6.8138,-9.9205,1.7191,7.0014,-9.9205,6.7353,21.4157,9.9254,552
-15.7435,-10.2151,1.1553,10.3663,-10.2151,10.0907,26.1569,17.844,553
-9.8498,-9.9939,4.0695,12.1772,-9.9939,2.531,21.7624,19.9455,554
0.7802,-10.0891,4.8547,2.9831,-10.0891,2.8599,18.8673,12.7012,555
-13.2881,-10.045,-2.1491,6.7333,-10.045,4.5943,19.1362,12.8572,556
-8.1769,-9.6736,12.0302,14.0055,-9.6736,5.21,39.2725,18.1279,557
-6.5399,-9.9615,12.335,13.5274,-9.9615,13.1401,31.5461,20.2644,558
-2.5711,-9.7023,7.2111,9.277,-9.7023,11.1011,26.0275,18.2735,559
-7.0755,-9.9471,3.8844,6.756,-9.9471,8.1777,22.3454,14.0678,561
-1.7798,-10.0902,2.0389,4.0342,-10.0902,5.4679,16.502,8.2529,562
-3.0836,-9.8349,4.854,5.5637,-9.8349,7.3825,33.8923,23.1231,563
-27.9865,-10.9636,-0.0938,13.136,-10.9636,6.6738,25.5728,13.5033,564
-25.0493,-9.5955,-1.4384,11.3279,-9.5955,9.3928,20.8816,8.6036,565
-2.0588,-9.7582,2.395,4.05,-9.7582,4.6746,11.433,7.0047,566
-18.8743,-9.8802,-5.5088,7.901,-9.8802,6.7475,33.6006,28.6145,567
-37.5501,-10.1155,10.8636,28.3208,-10.1155,16.3586,53.9286,35.5709,568
-34.1809,-9.9976,0.7507,17.7276,-9.9976,14.1623,43.4666,25.593,569
-7.0685,-9.9398,2.6315,8.7184,-9.9398,9.6109,28.6689,17.4038,571
-2.4575,-9.8412,1.7618,4.794,-9.8412,5.527,19.5189,8.7855,572
-40.0125,-9.9637,-6.3029,11.4365,-9.9637,9.0774,32.4071,24.7949,573
0.4021,-9.9708,10.9765,7.8428,-9.9708,3.4412,22.0131,16.1056,574
-12.6627,-10.443,2.5838,10.4221,-10.443,13.8333,70.1601,64.7674,575
-4.7184,-10.1573,3.6535,8.8975,-10.1573,11.1724,38.894,31.3266,576
-3.9113,-9.8956,11.0581,12.5438,-9.8956,14.0374,49.9431,42.1082,577
-56.8799,-9.7007,9.1518,32.0156,-9.7007,3.0286,57.0092,36.2105,578
-28.9759,-10.5045,-7.1536,13.2736,-10.5045,13.0905,62.2547,46.2091,579
-9.1445,-10.1034,25.5391,32.0633,-10.1034,23.8747,61.1959,43.4619,581
-17.7744,-9.9011,9.7665,14.7377,-9.9011,16.8334,44.0817,27.9986,582
-23.7027,-9.954,0.7456,12.4819,-9.954,12.9491,43.2425,23.4052,583
9.396,-9.5169,38.5672,19.8374,-9.5169,6.3676,37.5971,30.1195,584
12.1329,-10.1924,34.8989,11.6087,-10.1924,6.2407,40.0489,35.2692,585
-22.6671,-11.1506,16.6981,29.3804,-11.1506,21.8003,85.1266,81.3644,586
0.5469,-9.9379,2.4701,1.954,-9.9379,2.9264,42.2824,23.2127,587
-1.1259,-10.5316,4.9947,4.5978,-10.5316,16.0036,56.8921,54.4602,588
-8.8866,-10.1498,33.6965,23.9473,-10.1498,26.412,64.7439,52.1947,589
-22.5024,-10.2684,5.1264,16.788,-10.2684,16.8085,63.0342,40.455,591
-28.2122,-9.8969,2.1281,13.4642,-9.8969,18.9549,50.6007,35.7342,592
2.0347,-9.9187,9.0974,8.0666,-9.9187,6.9161,28.7614,21.1161,593
-11.3779,-10.0066,-0.0204,7.1745,-10.0066,1.3396,36.3126,24.7127,594
-11.8546,-10.3675,4.4347,9.2902,-10.3675,4.708,40.5026,27.8286,595
-3.897,-10.1508,0.3529,2.3094,-10.1508,5.432,7.3205,6.6105,596
-4.3571,-10.5141,2.9536,4.0786,-10.5141,5.2518,37.5105,35.101,597
-11.7812,-10.0297,-0.3575,7.2727,-10.0297,2.5025,20.4866,17.1703,598
-27.2025,-10.4066,32.0227,41.0912,-10.4066,24.9901,68.2844,49.929,599
-42.6747,-10.2797,2.5836,22.396,-10.2797,11.9538,59.2391,29.2159,600
-10.9055,-10.222,-2.4057,4.2577,-10.222,7.5838,43.5048,41.0932,601
-2.8342,-10.0505,12.5047,11.1079,-10.0505,2.8638,22.1828,19.3484,602
-21.4444,-9.7291,-9.1642,8.2945,-9.7291,4.2555,14.2932,9.746,603
-24.4835,-10.2366,8.1437,22.0158,-10.2366,3.4689,34.033,21.4819,604
-24.7935,-9.867,-2.4546,17.127,-9.867,2.1799,16.8982,12.4193,605
-6.6348,-10.0243,3.0717,7.6494,-10.0243,6.595,37.6132,35.9428,606
-18.897,-10.1812,6.5916,12.6044,-10.1812,12.851,39.3696,23.0024,607
-8.6959,-9.9618,2.0484,8.688,-9.9618,7.1729,19.7317,12.7136,608
-7.0699,-9.9215,10.5785,16.3955,-9.9215,5.2431,38.8349,18.0073,610
-44.5273,-9.8787,-1.3416,32.4467,-9.8787,17.0082,27.1316,22.4302,611
-4.9027,-9.8768,1.1489,4.951,-9.8768,4.5187,19.9833,15.2611,612
-0.0333,-10.077,9.3871,11.7254,-10.077,7.5303,31.0028,29.0059,613
-3.5797,-9.9607,5.6531,9.6659,-9.9607,5.916,37.1312,33.3191,614
-3.304,-9.9187,1.7752,2.9686,-9.9187,2.7326,19.3507,15.7286,615
-4.011,-9.718,3.0157,6.4464,-9.718,8.2277,27.6844,15.6958,616
-0.1721,-10.0044,2.1718,2.02,-10.0044,5.2317,15.2862,11.2688,617
-13.7822,-9.9698,12.7632,27.1319,-9.9698,9.1799,82.0465,59.6951,618
0.3859,-10.0229,2.0653,2.0905,-10.0229,1.4467,20.5701,18.3166,619
-24.0391,-9.8732,4.9814,18.5021,-9.8732,16.1514,59.9876,26.8107,621
-19.403,-9.9049,-0.2303,8.549,-9.9049,4.1864,45.0151,28.3589,622
-21.1524,-10.2392,-8.1812,7.7154,-10.2392,3.4642,42.883,37.1843,623
2.2152,-10.1165,6.8107,4.4802,-10.1165,3.2147,41.7326,22.5051,624
-5.3675,-10.2129,-2.1672,1.8225,-10.2129,4.0413,33.3126,25.4685,625
-10.7167,-9.9339,6.108,11.9783,-9.9339,9.4338,52.5657,30.6374,626
-0.8294,-9.8469,0.9608,1.4514,-9.8469,2.2948,13.1669,11.4359,627
-25.1109,-10.0478,1.6893,11.6254,-10.0478,11.8759,33.5582,29.0472,628
-9.2479,-9.6902,0.3796,8.3584,-9.6902,11.5707,31.8163,18.4938,629
-11.6579,-10.0918,2.1152,4.5719,-10.0918,4.9967,26.627,15.0686,631
-29.4655,-9.9458,4.8439,19.0856,-9.9458,13.2046,36.1557,14.2518,632
-13.7754,-9.992,13.0893,16.535,-9.992,17.1923,32.4473,27.0816,633
-10.252,-9.9116,5.7434,11.0878,-9.9116,11.5925,28.3737,23.1786,634
-13.6243,-10.0755,2.3354,8.0376,-10.0755,2.1071,11.7459,9.9081,635
-1.9015,-9.8296,2.396,2.3165,-9.8296,3.9135,23.6482,13.6781,636
-5.2879,-9.8648,4.8504,5.3934,-9.8648,2.0269,13.4287,8.6222,637
-16.7486,-9.8145,4.9052,11.7318,-9.8145,5.1649,23.0516,13.5768,638
-5.2506,-10.0774,-0.163,4.2179,-10.0774,1.3346,11.2358,10.0995,639
-17.2207,-9.9129,0.9418,6.1359,-9.9129,6.3818,18.677,7.5365,641
-25.3055,-10.0168,7.3463,15.5962,-10.0168,12.1951,28.3857,22.8758,642
-12.2437,-9.8588,3.4328,10.7311,-9.8588,7.885,36.8543,17.8213,643
-22.54,-9.3636,-0.8696,10.2145,-9.3636,5.8802,24.5369,14.0458,644
-118.0997,-9.8384,12.056,57.9704,-9.8384,16.3057,61.9775,37.4771,645
-0.8473,-9.898,5.3478,8.4544,-9.898,6.0337,14.1368,11.9213,646
-7.3578,-9.8535,-1.2263,4.472,-9.8535,5.3157,21.0277,16.4851,647
-3.868,-10.0852,4.4998,8.0778,-10.0852,8.7776,27.7509,16.9831,648
-1.7976,-9.9731,-0.3642,0.7149,-9.9731,1.4923,10.7265,4.0656,649
-3.8473,-9.8698,10.6844,20.4962,-9.8698,12.373,44.2282,23.3892,651
-6.2126,-10.3356,2.9288,6.0685,-10.3356,5.7378,62.0175,45.239,652
0.2904,-9.759,2.4315,1.4193,-9.759,1.1787,32.691,25.7799,653
-12.0357,-9.8686,-2.9261,5.7144,-9.8686,2.7011,31.0599,29.3243,654
-0.9421,-9.9816,-0.1174,0.9947,-9.9816,1.4023,5.7568,3.5506,655
-24.7869,-9.8643,19.8524,33.677,-9.8643,5.1985,49.8155,22.7487,656
-11.5868,-10.2296,-0.9511,5.2733,-10.2296,6.4649,37.3186,22.7,657
-7.2643,-10.2546,-0.492,2.6616,-10.2546,2.8665,21.6466,7.5324,658
-5.5393,-9.9494,-0.3033,1.6531,-9.9494,2.3767,8.1114,3.7463,659
-53.7502,-9.7134,-23.5503,22.2558,-9.7134,7.7718,26.5901,20.3422,661
-3.5809,-9.7388,9.828,7.3899,-9.7388,4.1365,20.808,13.6497,662
-11.6347,-9.8041,-7.0914,2.8904,-9.8041,2.0782,24.7141,23.1332,663
-8.6255,-9.5766,5.3882,7.6808,-9.5766,2.9155,9.7025,8.887,664
-11.824,-9.5146,-6.1419,6.5272,-9.5146,2.1662,5.9714,5.5209,665
-6.0768,-9.92,-3.29,1.867,-9.92,3.6928,23.7046,22.4621,666
-3.8623,-9.9703,-1.7724,1.1269,-9.9703,0.8856,19.2041,18.5519,667
-29.0472,-9.8961,-4.1748,9.5347,-9.8961,3.0524,18.9415,18.391,668
-2.5022,-9.923,-0.0932,1.8809,-9.923,6.2352,8.171,6.4748,669
-5.9496,-9.9075,1.6614,4.5196,-9.9075,5.2867,10.4663,3.8735,671
-47.0369,-9.8617,-6.9189,13.3003,-9.8617,8.326,21.738,9.3086,672
5.4466,-9.8263,22.3622,13.2498,-9.8263,4.0859,23.8058,18.9676,673
-36.4502,-9.9403,6.9,28.4936,-9.9403,13.5922,35.3424,21.305,674
0.2917,-9.8979,5.6821,3.6319,-9.8979,0.4387,15.5582,14.4626,675
-4.4451,-9.8895,2.9317,5.1476,-9.8895,3.8435,7.7092,3.9342,676
-20.608,-10.2819,1.547,10.1305,-10.2819,9.8695,23.5812,10.8339,677
-33.1824,-9.9597,-2.8767,10.235,-9.9597,7.0116,12.68,7.6273,678
-3.3379,-9.94,-1.4568,1.0376,-9.94,1.8288,6.7631,3.6218,679
-23.0171,-9.9298,-4.5492,7.6369,-9.9298,5.8461,27.4812,5.6585,681
-2.4899,-9.9473,-0.1974,0.617,-9.9473,0.9183,5.5577,1.7043,682
