AYGX_min,AZ_mean,AYGX_mean,AYGX_std,AZ_mean,GX_std,Gnorm_max,Gnorm_median,timestamp
0.017,-9.7535,0.0222,0.0031,-9.7535,0.0174,0.8558,0.8145,0
0.0011,-9.7538,0.0238,0.0106,-9.7538,0.1508,0.9434,0.8102,1
-293.2638,-9.6328,-13.3271,81.2493,-9.6328,19.9091,47.0816,10.7095,2
-8.8316,-9.7199,-1.216,3.2031,-9.7199,3.2979,8.4649,2.0651,4
-3.2769,-9.7238,-0.8256,1.2649,-9.7238,1.387,3.1628,0.987,6
-1.8466,-9.7173,-0.3737,0.6471,-9.7173,0.7113,1.8227,0.8573,7
-0.8807,-9.7264,-0.3986,0.2678,-9.7264,0.3253,1.1209,0.8484,8
-0.9494,-9.7245,-0.6936,0.2037,-9.7245,0.2344,1.2354,1.0687,9
-4.5297,-9.7202,-2.3045,1.4558,-9.7202,1.372,4.3092,2.8216,10
-4.7063,-9.6484,-1.8694,1.5793,-9.6484,1.1029,3.7028,1.6002,11
-13.756,-9.6213,-9.0323,3.4247,-9.6213,0.9964,6.5983,5.197,13
-11.8045,-9.56,-2.5166,4.3281,-9.56,2.1928,5.233,1.8613,14
-11.4212,-9.5016,-4.1945,3.539,-9.5016,1.4899,5.0672,1.5532,15
-7.7687,-9.5051,4.0077,11.1928,-9.5051,4.3337,13.1134,1.9235,16
-0.6738,-9.5912,8.0983,8.2752,-9.5912,5.9016,17.8668,11.5201,17
-0.0978,-9.731,1.0505,0.692,-9.731,0.9935,2.7607,1.9326,18
-30.4286,-9.5886,-12.447,10.1562,-9.5886,5.4737,21.4261,14.6626,19
-34.4078,-9.2933,14.3577,46.7149,-9.2933,11.3562,70.7062,9.1316,20
-1.2927,-9.691,13.5412,8.4514,-9.691,2.697,14.8332,11.0091,21
-15.1886,-9.7325,-3.7701,6.1561,-9.7325,3.7361,8.0904,3.7784,22
-0.7653,-9.706,1.3568,1.4956,-9.706,1.4445,3.9389,1.2193,23
-5.6863,-9.7149,-1.3787,1.7407,-9.7149,1.5194,4.7655,1.3074,24
-0.7422,-9.7095,0.3653,1.0411,-9.7095,1.2879,2.5111,1.0078,25
2.336,-9.7262,3.7725,0.8236,-9.7262,1.0179,6.9482,5.2925,26
-46.0119,-9.6012,-29.7078,11.1246,-9.6012,2.7726,20.6586,19.7124,27
-27.2087,-9.741,4.7042,15.1126,-9.741,6.044,13.6436,8.5398,28
-44.8766,-9.5807,-34.9204,10.511,-9.5807,1.5323,19.6741,18.0841,29
-7.7188,-9.4803,-6.3495,1.0695,-9.4803,0.4712,3.1397,2.9086,30
2.5519,-9.6029,5.5103,2.3304,-9.6029,1.1247,4.3694,3.4492,31
-5.7177,-9.6591,-0.8079,3.8319,-9.6591,3.1074,4.5194,3.1024,33
-28.3698,-9.3409,-3.5282,21.3704,-9.3409,7.2054,13.5754,6.438,34
-6.5774,-9.6649,0.2913,5.8707,-9.6649,10.0289,26.9848,15.5815,35
-1.8173,-9.6977,0.1909,1.2432,-9.6977,2.7633,13.5344,12.2873,36
-4.4243,-9.9758,6.0131,9.804,-9.9758,6.4586,20.1339,14.7015,37
-26.5578,-9.6282,-13.098,9.4114,-9.6282,5.4438,29.1587,27.2749,38
-38.5227,-9.6719,-8.8196,24.6622,-9.6719,5.8657,38.9798,31.3227,39
-36.9287,-9.6257,-7.6402,16.3077,-9.6257,8.6966,24.8992,9.6497,40
-21.2211,-9.6824,-8.5713,9.1914,-9.6824,7.7329,19.6007,11.7811,41
-66.6087,-9.7853,-11.5844,33.2296,-9.7853,6.0884,37.1113,29.5635,42
-27.7107,-9.6987,-8.3746,12.2245,-9.6987,5.978,18.3944,14.9345,44
-30.8585,-9.6961,-5.1236,11.162,-9.6961,7.8254,23.9624,11.7884,45
-6.5708,-9.7125,-0.3685,3.2781,-9.7125,3.5435,6.4022,3.4555,46
-0.8715,-9.7282,0.1077,0.4767,-9.7282,0.6122,1.2415,0.6846,47
0.3201,-9.7233,0.8502,0.3781,-9.7233,0.457,1.5258,1.0893,48
-0.8203,-9.7217,-0.167,0.5687,-9.7217,0.6326,1.0634,0.7314,49
-0.4442,-9.7317,-0.3745,0.0463,-9.7317,0.0618,0.7998,0.723,50
-0.5469,-9.733,-0.4938,0.0341,-9.733,0.0379,0.8767,0.8388,51
-0.7936,-9.7327,-0.4493,0.2604,-9.7327,0.3225,1.1028,0.7994,52
-0.6177,-9.7308,-0.5031,0.06,-9.7308,0.0667,0.9069,0.7924,53
-0.9236,-9.7322,-0.6708,0.1679,-9.7322,0.2188,1.307,1.0068,54
-0.4975,-9.7342,-0.4246,0.0523,-9.7342,0.0623,0.8126,0.7797,55
-0.631,-9.7342,-0.5783,0.0367,-9.7342,0.0432,0.9858,0.9218,56
-0.5216,-9.7353,-0.4824,0.031,-9.7353,0.0386,0.8674,0.8241,57
-0.4876,-9.7334,-0.4714,0.0224,-9.7334,0.0275,0.8293,0.8147,58
-0.5126,-9.733,-0.4747,0.0264,-9.733,0.0332,0.8499,0.819,59
-0.5083,-9.7343,-0.3707,0.0764,-9.7343,0.0943,0.8467,0.7072,60
-0.7334,-9.7356,-0.5952,0.1001,-9.7356,0.1263,1.1078,0.9688,61
-1.518,-9.7374,-0.479,0.4219,-9.7374,0.5857,1.8698,0.9925,63
-1.4252,-9.7334,-0.6182,0.2795,-9.7334,0.2831,1.5965,0.8336,64
-0.5618,-9.731,-0.4638,0.0753,-9.731,0.0937,0.8201,0.7093,65
-0.7948,-9.7331,-0.619,0.1094,-9.7331,0.1351,1.1072,0.9973,66
-0.6027,-9.7315,-0.5503,0.0466,-9.7315,0.0513,0.9338,0.8912,67
-0.7889,-9.7324,-0.6528,0.11,-9.7324,0.1409,1.1452,0.9871,68
-0.6716,-9.7332,-0.6174,0.0544,-9.7332,0.0606,1.0193,0.9658,69
-0.7989,-9.7331,-0.5405,0.123,-9.7331,0.151,1.1376,0.8294,70
0.7782,-9.7305,1.7164,0.5496,-9.7305,0.9965,3.4742,2.7153,71
-3.5806,-9.7369,-1.9463,0.9978,-9.7369,1.28,7.8486,6.304,72
-2.979,-9.7185,1.7786,4.9432,-9.7185,3.9315,26.8597,18.4001,74
-7.6302,-9.6315,-1.8988,3.2478,-9.6315,1.4586,5.0679,2.8377,75
-11.6328,-9.6116,0.4083,4.0191,-9.6116,2.056,6.9223,3.8263,76
-1.8163,-9.6183,1.8252,3.1449,-9.6183,1.9465,6.1312,3.063,77
-28.8872,-9.6292,1.4827,15.9959,-9.6292,9.8104,28.4955,13.8773,78
-21.3358,-9.7555,1.8336,9.002,-9.7555,6.4091,21.2687,9.6561,79
-38.6977,-9.6406,-2.825,24.2193,-9.6406,13.4447,22.2669,11.347,81
-42.845,-9.4429,-0.8855,15.4492,-9.4429,7.7792,37.5206,12.2303,82
-126.3494,-9.1635,0.8699,36.811,-9.1635,11.1112,74.0508,18.5771,83
-7.0262,-9.6728,0.0718,3.7037,-9.6728,3.7512,34.9655,25.9606,84
-0.6158,-9.7895,1.5887,2.018,-9.7895,3.8784,48.4739,42.432,85
-3.0395,-9.8157,0.6377,1.4414,-9.8157,3.2099,36.1791,33.4246,86
-1.3564,-9.7801,3.1168,5.2257,-9.7801,4.7205,27.6095,9.1782,88
-2.0221,-9.7724,0.0719,0.8413,-9.7724,2.1895,15.2773,4.7589,89
-67.5355,-9.7651,-7.1072,18.3632,-9.7651,8.9376,25.2746,8.3782,90
-2.6258,-9.6887,6.6943,8.3577,-9.6887,2.5357,14.3923,11.7089,91
-10.3455,-9.7394,1.0136,5.7995,-9.7394,4.4945,10.327,5.5375,92
-12.9159,-9.6944,-7.589,4.0415,-9.6944,1.2886,9.8881,7.7209,93
4.0952,-9.65,6.1872,2.1023,-9.65,1.4014,6.9493,4.5208,94
3.6449,-9.7348,4.8383,0.8386,-9.7348,0.6087,6.7222,5.818,95
-0.733,-9.7445,0.5277,1.3607,-9.7445,1.9584,4.7075,1.204,96
-0.8011,-9.7478,0.1108,0.5955,-9.7478,1.072,1.9628,1.1264,98
-11.3755,-9.7571,-0.0257,5.0149,-9.7571,4.1088,13.6683,4.7073,99
-0.7653,-9.7584,-0.5752,0.0938,-9.7584,1.0795,4.6127,2.3396,100
-3.6586,-9.7422,-2.7328,0.7179,-9.7422,0.5323,3.8845,3.3312,101
-16.9846,-9.643,-13.4118,2.821,-9.643,1.8325,10.3866,7.1974,102
-1.3152,-9.7197,9.9994,11.2765,-9.7197,5.5873,24.0613,9.9569,103
-3.3498,-9.7088,4.5704,8.0494,-9.7088,4.3622,36.4112,30.2485,104
-20.5675,-9.766,-2.3636,10.0934,-9.766,2.4587,15.545,10.7503,105
-6.0959,-9.789,0.9896,3.3743,-9.789,3.3372,23.4422,9.4833,106
-4.5904,-9.7606,1.3522,3.0651,-9.7606,3.6679,18.6304,6.9973,107
-0.6194,-9.8135,0.3543,0.7205,-9.8135,2.1861,10.5646,6.552,108
-0.1202,-9.7608,1.269,1.4859,-9.7608,0.9064,10.2603,2.4296,109
-0.8633,-9.8563,-0.0691,0.5355,-9.8563,1.833,17.8815,14.6692,110
-0.5149,-9.7927,0.9139,1.1727,-9.7927,2.7787,11.9426,8.0323,111
-10.44,-9.7665,1.5071,4.2603,-9.7665,6.4031,34.8193,10.429,113
-1.3217,-9.7937,1.5214,2.6753,-9.7937,3.1139,16.6713,6.8008,114
-0.3515,-9.7234,1.1042,1.4442,-9.7234,2.4872,11.1787,7.4445,115
-1.4513,-9.983,0.1827,1.438,-9.983,1.7973,9.3362,7.7035,116
-3.8439,-9.7818,-0.0509,2.6832,-9.7818,2.8212,8.7747,7.1764,117
-0.3486,-9.8256,0.9473,0.9331,-9.8256,2.1384,5.1685,4.0172,118
-2.2486,-10.0742,0.7102,2.0222,-10.0742,3.3362,10.8454,7.3772,119
-1.0218,-9.8763,0.0301,1.0282,-9.8763,1.2359,6.6212,3.7975,120
-0.5862,-9.6756,0.4789,0.7845,-9.6756,1.9557,6.1934,4.2374,121
-1.6185,-9.7411,-0.1509,0.8725,-9.7411,1.5044,9.2916,3.8522,122
-1.1371,-9.809,0.0639,0.9404,-9.809,1.4091,7.3419,6.2035,123
-0.1009,-9.9238,2.1097,1.7821,-9.9238,4.75,13.3372,11.5352,125
-0.9159,-9.56,2.2582,2.1622,-9.56,1.5108,15.6329,13.4387,126
-2.4433,-9.9226,0.8833,2.7021,-9.9226,6.0308,18.9622,6.2873,127
-0.4917,-9.5567,-0.1715,0.2102,-9.5567,0.7996,6.9143,4.6117,128
-0.8253,-9.7206,0.4572,0.7508,-9.7206,1.3734,5.6769,4.1896,129
-1.8826,-9.593,-0.035,0.8621,-9.593,1.5029,7.0361,5.4612,130
-0.8391,-9.7303,0.0873,0.3306,-9.7303,0.6099,4.1195,2.6974,131
-0.3683,-9.7452,-0.0247,0.236,-9.7452,0.7395,5.3426,3.2037,132
-0.8446,-9.7896,0.3991,0.9484,-9.7896,2.3824,10.8564,5.542,133
-0.9491,-9.7888,0.1961,0.707,-9.7888,1.2492,6.843,3.7392,134
-0.8295,-9.7787,0.1752,0.6874,-9.7787,0.8641,8.5186,5.537,135
-0.1079,-9.757,0.3355,0.3937,-9.757,1.4267,6.4366,2.5945,136
-0.735,-10.0098,0.26,0.5013,-10.0098,2.1117,7.271,5.6454,137
-0.1135,-9.8896,0.3794,0.3816,-9.8896,0.7451,4.4923,2.7748,138
-0.942,-9.7456,0.1654,0.4933,-9.7456,1.0676,7.5531,3.5907,139
-0.1781,-9.758,0.0001,0.1368,-9.758,0.9823,4.0807,2.2171,140
-0.4405,-9.6879,0.0309,0.2186,-9.6879,0.7789,5.6698,4.1516,141
-0.6529,-9.8717,-0.1452,0.2898,-9.8717,0.7271,4.3414,2.7772,142
-0.2988,-9.7882,0.0759,0.1673,-9.7882,0.4385,5.2223,2.0949,143
-4.1313,-9.7835,0.5695,2.7881,-9.7835,1.9827,19.5947,11.8867,144
-6.2931,-9.7632,-2.0817,2.4454,-9.7632,1.4801,6.2341,5.3187,145
-0.0835,-9.7664,0.772,1.3099,-9.7664,1.9215,5.1738,2.36,146
-2.2232,-9.7618,-0.4137,1.066,-9.7618,2.1674,4.0909,2.3074,147
-1.792,-9.7553,-0.5137,0.6193,-9.7553,0.919,3.0184,0.7816,148
-0.7601,-9.7601,-0.3865,0.2097,-9.7601,0.4608,1.7325,0.8268,149
-0.7663,-9.7453,-0.377,0.2477,-9.7453,0.3313,1.135,0.7289,150
-0.6512,-9.7534,-0.5236,0.0784,-9.7534,0.1098,1.1735,0.9895,151
-0.675,-9.7528,-0.4528,0.1504,-9.7528,0.2272,1.1599,0.7683,152
-0.5849,-9.7517,-0.4998,0.0627,-9.7517,0.096,1.0712,0.9498,153
0.0362,-9.7589,0.3713,0.2462,-9.7589,0.4938,3.5221,0.9859,154
-11.5821,-9.7498,-0.6247,4.2348,-9.7498,4.7174,18.4249,8.7455,155
-11.2062,-9.7583,3.3255,6.8585,-9.7583,5.9222,26.588,10.1483,156
-2.8017,-9.5378,4.3764,5.5768,-9.5378,4.3444,12.3016,9.5152,158
-0.0676,-9.414,2.127,1.5919,-9.414,2.5051,12.0964,10.4374,159
-3.1043,-9.7231,0.841,2.1997,-9.7231,5.1769,18.8751,7.9337,160
-4.2904,-9.7179,1.0796,3.4037,-9.7179,3.7553,15.3654,13.8122,161
-8.4127,-9.5494,1.614,4.3246,-9.5494,6.7221,16.5458,12.2228,163
-5.7013,-9.7856,0.3766,3.3877,-9.7856,5.4203,19.5734,8.3274,164
-2.8238,-9.7664,0.3686,2.4061,-9.7664,6.301,15.5774,6.4301,165
-0.9237,-9.342,0.1322,0.9054,-9.342,2.4735,8.5367,6.3149,166
-1.8045,-9.9274,-0.316,0.6956,-9.9274,1.1629,14.7123,3.9937,168
-3.8741,-9.8856,-0.7618,1.9979,-9.8856,2.9295,9.1946,4.8073,169
-2.7621,-9.7971,-0.6837,1.096,-9.7971,2.7859,9.0313,5.631,170
-1.6758,-9.7389,-0.2922,0.927,-9.7389,1.5272,6.3332,3.3298,171
-1.7504,-9.7711,-0.0088,0.6829,-9.7711,2.3902,7.7146,3.8321,173
-2.7366,-9.8082,0.2191,1.4537,-9.8082,2.1641,13.5046,6.076,174
-2.3556,-9.6914,1.3776,2.3317,-9.6914,4.4563,12.4091,6.7683,175
-2.4215,-9.3536,0.7922,2.2502,-9.3536,3.908,17.3614,6.7309,176
-1.1945,-9.6187,1.0059,1.7203,-9.6187,1.3905,16.6098,8.232,177
-0.6971,-9.7111,-0.1264,0.3758,-9.7111,0.9787,4.9388,3.2043,178
-0.3771,-9.6679,0.692,0.9233,-9.6679,1.5479,7.3918,4.4922,179
-3.2234,-9.757,5.0128,7.2439,-9.757,5.5558,14.922,10.0041,180
-2.4105,-9.7715,-0.1829,1.2829,-9.7715,1.8311,6.1342,5.2977,181
0.0532,-9.4664,7.258,5.7312,-9.4664,7.2788,17.0427,14.4507,182
-6.7076,-9.606,0.3869,4.2423,-9.606,2.7546,14.9421,13.1158,183
-9.4989,-9.7118,0.1475,3.1715,-9.7118,6.4676,16.0311,9.9077,184
-11.0362,-10.0273,0.2323,4.8565,-10.0273,12.1363,29.1927,14.6026,185
-5.2495,-9.6937,3.1809,6.1701,-9.6937,3.7196,11.9504,9.2392,186
-2.9065,-9.9619,-1.4786,1.0065,-9.9619,2.7686,14.2189,9.5832,187
-0.7578,-9.8727,0.0092,0.7064,-9.8727,2.416,11.6225,4.4467,188
-1.9161,-9.6436,2.8413,4.4485,-9.6436,4.3625,14.8352,10.9083,189
-10.546,-9.7427,1.6653,5.3799,-9.7427,5.4737,21.3917,9.5986,191
-3.5824,-10.1485,-0.3041,1.2798,-10.1485,3.4278,20.0321,4.8659,193
-62.704,-7.4962,-5.2178,27.3119,-7.4962,6.7285,34.6063,19.9035,194
2.6672,-9.8375,26.5433,19.0355,-9.8375,2.5427,30.1928,28.8558,195
-0.7796,-9.5975,2.0606,2.5007,-9.5975,0.8225,15.2774,10.8429,196
-2.5463,-9.3794,0.8975,2.8288,-9.3794,3.0005,9.1645,7.6864,197
-2.8164,-9.997,1.5165,3.7906,-9.997,2.3076,16.4728,10.1629,198
-5.3558,-9.8187,-0.8744,1.8865,-9.8187,1.6414,11.0206,9.5304,199
-0.9501,-9.7712,1.6475,2.3682,-9.7712,4.0111,11.3843,5.9501,200
-0.9189,-9.5856,1.6092,1.5119,-9.5856,1.0412,16.2497,12.542,201
-5.0475,-9.869,-0.9595,1.6221,-9.869,6.0694,12.2489,8.5217,203
-2.6229,-9.7946,0.5347,1.6241,-9.7946,2.2553,11.4943,6.0278,204
-2.1517,-9.4489,1.2479,2.4989,-9.4489,3.7474,13.6264,9.8446,205
-7.0652,-10.0429,5.3798,8.3071,-10.0429,2.4295,18.1338,13.8835,206
-1.2541,-9.2953,6.2284,4.6899,-9.2953,5.8073,19.235,15.5184,207
-3.2964,-9.7586,-0.8122,1.1377,-9.7586,1.5648,4.6959,1.5528,208
-0.0407,-9.7529,0.2022,0.1892,-9.7529,0.649,8.2997,4.9414,209
-5.2164,-9.4226,0.5353,2.7479,-9.4226,2.9461,21.8619,6.957,210
-10.1093,-8.0655,0.089,7.5257,-8.0655,2.295,19.3128,11.1471,211
-9.7805,-9.9096,2.1873,5.4317,-9.9096,9.822,28.0242,14.0264,213
-7.6466,-9.3104,2.4067,6.8223,-9.3104,6.7567,25.9082,11.3748,214
-0.0156,-9.0288,2.4556,1.7703,-9.0288,3.2723,11.925,7.2667,215
-6.5498,-9.656,2.1167,5.5159,-9.656,4.3686,17.7711,12.026,216
-9.303,-9.643,0.5773,8.246,-9.643,2.1289,13.9924,10.5673,217
-0.0868,-9.5174,4.7495,5.3016,-9.5174,5.1786,19.623,13.2494,218
-2.21,-7.8507,-0.0867,0.9128,-7.8507,2.115,14.8694,9.9346,219
-2.459,-9.686,1.752,2.4062,-9.686,2.447,13.0469,7.0244,220
-6.0383,-9.803,-0.9426,3.3781,-9.803,2.6709,16.3317,11.147,221
-2.3646,-9.4229,2.5929,4.6601,-9.4229,6.0379,18.3698,9.6077,223
-4.6568,-9.4564,2.2044,3.8102,-9.4564,7.5534,20.9847,11.9792,224
-2.4317,-9.8132,-0.2501,1.3915,-9.8132,3.3153,11.8795,7.8089,225
-3.1378,-9.8775,-0.1534,2.3909,-9.8775,2.3638,19.9333,11.6606,226
-2.3089,-10.1683,0.3014,1.7357,-10.1683,2.599,10.1013,7.2001,227
-2.3316,-10.0724,-0.4821,0.8599,-10.0724,1.3931,6.601,5.036,228
-1.8012,-9.9385,0.8632,2.0243,-9.9385,1.6783,10.3178,4.9942,229
-0.5111,-9.8628,0.2576,0.8529,-9.8628,1.6671,9.5633,4.2875,230
-2.5788,-9.8831,-0.1316,1.442,-9.8831,1.1442,10.5445,6.7237,231
-1.169,-9.746,0.149,0.6945,-9.746,1.8058,6.9804,2.8475,233
-4.6305,-9.7779,0.0753,1.2263,-9.7779,2.0697,13.328,5.6165,234
-1.2622,-9.7405,0.2463,0.9617,-9.7405,1.5474,13.795,6.4073,235
-5.2846,-9.756,-0.9688,2.3483,-9.756,3.3578,6.8611,3.2914,236
-3.6861,-9.763,-0.7321,1.5271,-9.763,3.6976,6.8407,4.4247,237
-5.557,-9.7361,-1.1314,1.6419,-9.7361,1.8445,5.5775,1.6768,238
-0.974,-9.7323,-0.3459,0.5095,-9.7323,0.9695,1.8886,1.2559,239
-0.2757,-9.7358,-0.0472,0.1829,-9.7358,0.2582,0.6386,0.5739,240
-0.5728,-9.7416,-0.309,0.206,-9.7416,0.3053,0.9757,0.7122,241
-0.928,-9.7451,-0.2732,0.4088,-9.7451,0.7004,1.8902,0.8009,243
-2.7112,-9.7542,-1.6114,0.9941,-9.7542,1.3136,4.659,3.8272,244
1.9223,-9.7278,2.314,0.325,-9.7278,0.6903,4.1681,3.1076,245
-1.447,-9.7511,-0.5045,0.4629,-9.7511,0.6394,2.5229,1.6039,246
-0.3184,-9.7546,-0.1419,0.0944,-9.7546,0.271,1.0769,0.6957,247
-0.6479,-9.7534,-0.4925,0.1619,-9.7534,0.4221,1.5672,1.4412,248
-0.3485,-9.7544,-0.2096,0.0855,-9.7544,0.2386,1.0601,0.7779,249
-0.819,-9.7485,-0.5508,0.217,-9.7485,0.4152,1.6423,1.0488,250
-0.169,-9.7493,-0.1152,0.026,-9.7493,0.0626,0.6288,0.5742,251
-0.5029,-9.7509,-0.4567,0.025,-9.7509,0.0331,1.0686,1.0231,253
-0.5365,-9.7501,-0.3579,0.0922,-9.7501,0.175,1.1294,0.8071,254
-0.5527,-9.748,-0.5304,0.0249,-9.748,0.0528,1.1179,1.0918,255
-0.1686,-9.7507,-0.1531,0.0107,-9.7507,0.019,0.5987,0.5826,256
-0.4419,-9.7526,-0.3718,0.0504,-9.7526,0.1014,1.0174,0.9234,257
-0.0888,-9.7496,0.0049,0.0529,-9.7496,0.1032,0.5605,0.4793,258
-0.7044,-9.7541,-0.4355,0.242,-9.7541,0.5426,1.7608,1.343,259
-0.782,-9.7473,-0.1019,0.4041,-9.7473,0.6611,1.392,0.6826,260
-0.1237,-9.752,-0.0347,0.0613,-9.752,0.137,0.5993,0.5387,261
-0.5853,-9.749,-0.5453,0.0278,-9.749,0.045,1.22,1.1116,263
-0.7306,-9.7481,-0.5194,0.1528,-9.7481,0.2371,1.2827,1.0777,264
-0.3532,-9.7456,-0.2861,0.0441,-9.7456,0.0697,0.8238,0.6711,265
-0.4337,-9.7456,-0.3204,0.0606,-9.7456,0.1034,0.846,0.7214,266
-0.3645,-9.7472,-0.2968,0.0632,-9.7472,0.1082,0.7854,0.737,267
-0.4409,-9.749,-0.4005,0.0344,-9.749,0.0492,0.9335,0.8852,268
0.316,-9.7359,0.9229,0.5806,-9.7359,0.8026,3.3846,1.5027,269
-7.5177,-9.8337,3.1827,7.4327,-9.8337,5.4185,16.7978,9.9978,270
-2.3788,-9.6562,0.3229,1.653,-9.6562,1.9918,13.9616,7.0952,271
-9.2128,-9.7671,0.3338,3.9623,-9.7671,6.9903,25.1699,11.0425,273
-1.8869,-9.9984,6.9954,8.5955,-9.9984,3.2876,24.164,17.767,274
-2.6551,-9.7379,-0.7771,0.8641,-9.7379,3.6821,21.3382,8.0768,275
-3.4975,-9.6109,0.5146,2.2704,-9.6109,1.0327,8.2288,6.0726,276
-2.5186,-9.8173,2.1614,3.3029,-9.8173,1.4028,9.8723,9.0714,277
-1.4028,-9.6431,-0.2466,0.5748,-9.6431,1.582,10.3387,4.6098,278
1.0712,-9.8415,6.7277,6.8531,-9.8415,2.747,18.0155,15.7018,279
0.0125,-9.7299,5.9279,4.5935,-9.7299,5.6618,13.7376,9.5398,280
-12.5882,-9.8371,-0.5142,5.8014,-9.8371,2.8616,14.6985,5.96,281
-5.8917,-9.788,0.2246,2.3298,-9.788,5.2238,14.9653,7.9536,283
-2.2042,-9.8088,0.4287,1.7491,-9.8088,3.811,13.7101,8.1755,284
-7.5266,-9.6737,-0.1181,3.7568,-9.6737,6.8995,21.5008,10.2257,285
-2.585,-9.8629,0.1003,1.1233,-9.8629,1.8258,7.9503,4.3036,286
-1.9007,-9.7942,-0.4422,0.7858,-9.7942,1.8416,8.8935,7.2221,287
-2.4237,-9.88,-0.1358,1.2886,-9.88,3.7219,12.8736,8.0282,288
-4.3663,-9.8802,-1.0162,2.3894,-9.8802,5.1261,14.1915,13.0286,289
-1.0252,-9.6775,0.598,0.9347,-9.6775,2.9582,9.7545,4.7948,290
-2.1075,-9.6873,0.2,1.0122,-9.6873,4.406,10.9289,8.2918,291
-8.1652,-9.939,2.0474,5.3903,-9.939,6.4281,21.0742,11.8121,292
-3.8002,-9.6698,2.117,3.9765,-9.6698,9.047,19.4069,12.6629,293
-3.7947,-9.855,0.6427,2.4685,-9.855,3.5329,22.1125,10.146,294
-3.4162,-9.5245,0.0857,1.5526,-9.5245,3.4955,10.5204,7.3935,295
-1.4873,-9.6063,0.369,1.5297,-9.6063,2.0529,8.0587,6.6268,296
-1.6521,-9.7201,0.1395,0.853,-9.7201,2.5946,7.4635,4.533,297
-3.1242,-9.3799,1.3459,4.452,-9.3799,2.5519,21.1974,9.9409,298
-1.1006,-9.8824,-0.2264,0.4032,-9.8824,1.0164,9.9224,4.7318,299
-0.4675,-6.399,0.5814,1.0721,-6.399,1.6265,14.5155,6.848,300
-5.4366,-9.9336,0.602,2.4881,-9.9336,5.2222,17.1278,9.8191,301
-0.6165,-10.1117,0.7815,0.9716,-10.1117,1.7903,14.8205,7.3104,302
-15.7717,-8.2702,2.2733,7.2942,-8.2702,8.7623,48.4092,13.5659,304
-5.6372,-9.5311,1.8527,3.3627,-9.5311,7.9421,29.147,14.1224,305
-3.5423,-9.5205,3.4851,4.5561,-9.5205,8.0282,26.057,13.3594,306
-5.6636,-9.7834,-0.4018,2.845,-9.7834,0.9451,10.6915,6.1472,307
-0.4289,-9.1046,0.841,0.9471,-9.1046,1.92,9.9686,5.9011,308
-0.645,-9.3556,0.2734,0.9524,-9.3556,1.6691,10.9911,5.1491,309
-1.1009,-9.386,0.5245,1.3131,-9.386,0.6987,9.7976,4.3049,310
-1.9079,-9.6066,0.1237,1.2257,-9.6066,3.2927,11.0382,4.1302,311
-6.6884,-9.5623,-0.2713,2.6796,-9.5623,1.6604,9.1496,6.0598,312
-7.8331,-9.1246,2.2775,5.809,-9.1246,7.5234,18.1104,10.8671,313
-4.3905,-9.1743,-0.2075,1.8719,-9.1743,2.6641,29.4093,8.6813,314
-2.7362,-7.7605,0.9708,3.0142,-7.7605,2.843,12.1426,6.5314,315
-2.3033,-9.7193,-0.5439,1.0946,-9.7193,2.6209,12.9816,8.7177,316
-0.3468,-8.2186,0.0616,0.3754,-8.2186,1.3964,17.1049,8.6147,317
-2.2903,-9.4736,-0.374,1.1845,-9.4736,3.1117,10.9214,4.2666,318
-0.7052,-9.7697,-0.0196,0.4052,-9.7697,1.0442,6.6443,4.2224,319
-5.4454,-9.4437,-1.4624,2.2176,-9.4437,3.3759,9.2534,5.4882,320
-26.014,-9.5927,-1.9953,8.9843,-9.5927,5.324,16.2192,4.7507,321
-0.9458,-9.742,0.0958,0.4,-9.742,1.0427,12.0896,9.8087,323
-1.0992,-9.7736,0.0583,0.5034,-9.7736,1.3522,6.5211,2.8954,324
-0.7956,-9.5674,0.9775,0.9777,-9.5674,0.4276,6.5524,5.1617,325
-1.8144,-9.6706,-0.241,0.9288,-9.6706,1.1949,15.2787,10.2567,326
-16.9141,-9.6719,-6.312,5.1498,-9.6719,2.9652,16.4798,8.0191,327
-7.9102,-9.4884,3.7962,9.2382,-9.4884,3.584,6.4353,2.7984,328
-6.9682,-9.711,-0.3884,4.2857,-9.711,4.719,7.6327,3.9498,329
1.6057,-9.7206,3.4554,1.5003,-9.7206,1.0512,5.3716,4.4557,331
0.1692,-9.7437,0.6942,0.3355,-9.7437,0.6355,2.1579,1.8032,332
0.1874,-9.7418,0.4051,0.1646,-9.7418,0.2782,1.0934,0.8868,333
0.398,-9.7355,0.4832,0.068,-9.7355,0.1024,0.9725,0.8533,334
0.3626,-9.7391,0.3898,0.0197,-9.7391,0.0316,0.779,0.7686,335
-0.2199,-9.7385,0.3012,0.276,-9.7385,0.4432,1.1358,0.7653,336
0.1171,-9.7398,0.5299,0.4085,-9.7398,0.6388,1.9366,0.6813,337
0.2121,-9.7389,0.2752,0.0746,-9.7389,0.0981,0.8003,0.6317,338
-0.4331,-9.734,0.2901,0.3008,-9.734,0.4283,1.501,0.69,339
0.6798,-9.7354,1.0755,0.3118,-9.7354,0.4744,2.4242,1.5883,340
-1.7788,-9.7101,-0.9364,0.7888,-9.7101,0.8131,1.9991,1.1307,341
0.4714,-9.7194,0.7415,0.1345,-9.7194,0.1756,1.1554,1.0495,342
1.3731,-9.7332,1.7668,0.2775,-9.7332,0.2526,2.9085,2.6511,343
0.1177,-9.7425,0.1369,0.0126,-9.7425,0.0217,0.5503,0.5298,344
0.2588,-9.7362,0.5952,0.1261,-9.7362,0.1692,1.1677,1.0557,345
0.0848,-9.7357,0.1396,0.0395,-9.7357,0.0541,0.6792,0.5242,346
-0.2514,-9.7287,0.3673,0.3509,-9.7287,0.4553,1.4977,0.7124,348
0.018,-9.7288,0.4751,0.1801,-9.7288,0.2236,1.0698,0.799,349
-0.6115,-9.7142,-0.403,0.2071,-9.7142,0.2335,0.8261,0.7199,350
1.6111,-9.7208,1.8053,0.1179,-9.7208,0.062,2.2637,2.2408,351
0.2078,-9.7271,0.3424,0.1107,-9.7271,0.1387,0.8185,0.6384,353
0.3966,-9.7272,0.5314,0.0595,-9.7272,0.0748,0.9015,0.8408,354
0.5251,-9.7259,0.5507,0.0176,-9.7259,0.024,0.9088,0.8397,355
0.5076,-9.7267,0.5255,0.0125,-9.7267,0.0147,0.8489,0.8346,356
-0.869,-9.7257,0.4375,0.3166,-9.7257,0.4365,1.5303,0.8389,358
-4.4675,-9.7216,-2.1202,1.1017,-9.7216,0.4557,3.3638,2.0723,359
-27.5376,-9.7308,3.8175,17.4232,-9.7308,6.7487,27.5208,12.2752,360
-7.204,-9.814,3.758,12.0455,-9.814,6.3823,15.7943,13.9556,361
-0.7744,-9.7957,0.3712,1.0054,-9.7957,2.3098,6.944,4.8231,362
-5.7054,-9.5251,9.0176,8.3882,-9.5251,1.7244,25.7311,16.5,363
-1.022,-9.4011,0.601,1.0302,-9.4011,1.8979,15.464,10.194,364
-5.6404,-9.641,-0.3701,3.0933,-9.641,3.5302,15.176,9.8337,365
-1.9894,-9.446,-0.4019,0.9517,-9.446,1.8052,15.9621,9.7793,366
-2.743,-9.725,0.5493,2.0248,-9.725,2.7688,12.4248,3.7932,368
-3.2612,-9.9281,1.4244,3.3524,-9.9281,5.924,20.615,12.5472,369
-0.9085,-9.5116,1.0214,2.1127,-9.5116,2.0485,8.3843,4.6954,370
-0.2376,-9.8511,0.4341,0.5859,-9.8511,1.7592,6.6627,6.0019,371
-1.0947,-9.9795,-0.2772,0.5598,-9.9795,0.7219,7.0094,4.6705,372
-0.4849,-9.7246,1.6414,1.6154,-9.7246,1.9153,8.9669,7.8605,373
-0.3499,-9.6267,-0.0148,0.2167,-9.6267,0.6691,8.5132,3.1149,374
-1.0617,-10.0408,0.0214,0.4494,-10.0408,1.1765,11.2769,3.7294,375
-0.0241,-9.8844,0.3974,0.4643,-9.8844,0.9641,8.573,3.6184,376
-0.0725,-9.6811,-0.0137,0.0424,-9.6811,0.3314,5.278,3.3617,378
-1.145,-9.7545,0.2287,0.4804,-9.7545,1.5768,7.0793,3.5905,379
-2.5736,-9.856,1.169,2.2594,-9.856,3.838,13.5308,5.6491,380
-0.9633,-9.8263,-0.1078,0.3738,-9.8263,0.5538,5.6435,4.5483,381
-0.6012,-9.7448,1.524,1.4096,-9.7448,0.5931,7.8648,5.9734,382
-6.0039,-9.8119,0.3155,2.677,-9.8119,0.4328,11.3408,9.1098,383
-1.0776,-9.5406,2.1004,2.6838,-9.5406,3.541,33.1955,31.5897,384
-1.6473,-9.7109,0.6067,1.9305,-9.7109,1.5219,13.5783,10.8314,385
-1.066,-10.0765,0.9375,2.1815,-10.0765,1.5098,19.4898,12.3439,386
-5.1236,-9.8207,-0.1293,1.6912,-9.8207,3.4997,10.2112,7.5754,388
-8.3674,-9.6669,2.185,5.8528,-9.6669,4.2409,11.2078,2.6028,389
-1.1099,-9.7054,0.1931,1.0308,-9.7054,1.0249,1.8639,0.971,390
-1.17,-9.6686,2.5343,2.1208,-9.6686,1.7208,3.7324,2.7256,391
0.872,-9.6945,1.3543,0.597,-9.6945,0.4576,2.24,1.1662,392
0.0792,-9.7051,0.7538,0.424,-9.7051,0.4367,1.3493,0.9766,393
0.6427,-9.7115,0.9341,0.16,-9.7115,0.1793,1.2906,1.1512,394
0.5263,-9.7121,0.6083,0.0759,-9.7121,0.0808,0.9251,0.7963,395
0.4665,-9.7122,0.534,0.0568,-9.7122,0.0605,0.8503,0.7482,396
0.2919,-9.7128,0.6028,0.1319,-9.7128,0.1463,1.1114,0.8126,398
0.623,-9.7129,0.7172,0.0715,-9.7129,0.0745,0.989,0.9498,399
0.5569,-9.7122,0.5926,0.0307,-9.7122,0.034,0.8761,0.7863,400
0.2582,-9.7135,0.5773,0.2745,-9.7135,0.3045,1.1829,0.7037,401
0.4502,-9.7084,0.5843,0.0999,-9.7084,0.1064,0.8895,0.809,402
0.6453,-9.7091,0.7065,0.0466,-9.7091,0.0536,0.9508,0.8816,403
-1.0219,-9.7147,0.2002,0.5937,-9.7147,0.6946,1.3093,0.7961,404
-0.0263,-9.7068,0.8487,0.8389,-9.7068,0.9219,2.4233,0.7743,405
1.0623,-9.7032,1.2135,0.1156,-9.7032,0.128,1.4951,1.3686,406
0.3674,-9.7129,0.8198,0.3782,-9.7129,0.4165,1.836,0.8979,408
0.5539,-9.7158,0.6427,0.0786,-9.7158,0.0919,1.013,0.8541,409
0.5351,-9.7158,0.5704,0.0335,-9.7158,0.0368,0.8538,0.7972,410
0.5591,-9.7158,0.5828,0.0209,-9.7158,0.0222,0.8665,0.8116,411
0.5397,-9.7176,0.5771,0.0241,-9.7176,0.0275,0.8519,0.8219,412
0.5118,-9.7163,0.5753,0.0323,-9.7163,0.0371,0.8606,0.8205,414
0.5318,-9.715,0.5969,0.0382,-9.715,0.0429,0.9111,0.8235,415
0.4981,-9.715,0.543,0.0289,-9.715,0.033,0.8105,0.7783,416
0.5224,-9.7134,0.5789,0.0425,-9.7134,0.047,0.8805,0.8055,418
0.5172,-9.7149,0.5867,0.0285,-9.7149,0.032,0.8858,0.818,419
0.6128,-9.7145,0.6325,0.0138,-9.7145,0.018,0.8807,0.8558,420
0.5869,-9.7151,0.6244,0.023,-9.7151,0.0286,0.8762,0.8522,421
-7.9814,-9.7101,3.2817,5.5928,-9.7101,3.9665,11.9163,9.1412,422
-6.4926,-9.6144,0.14,3.6063,-9.6144,4.6741,18.6139,7.2735,423
-2.1512,-10.1762,1.7061,2.9872,-10.1762,4.2078,20.0703,17.8146,424
-9.4963,-9.7452,1.9338,5.9797,-9.7452,3.894,19.6233,11.4634,425
-0.9514,-10.1223,2.2002,4.7154,-10.1223,5.8992,20.4778,11.1154,426
-7.5176,-10.1328,0.4824,3.8647,-10.1328,2.5807,12.0333,9.0025,428
-9.347,-9.4676,0.5428,3.0874,-9.4676,3.8601,31.1635,7.8468,429
-0.8438,-9.432,0.3576,0.8861,-9.432,1.1196,13.6975,6.8335,430
-1.6489,-9.6831,0.285,1.3614,-9.6831,2.8487,14.2923,8.261,431
-1.9232,-9.7449,2.5427,2.6636,-9.7449,1.8321,15.4436,10.554,432
-1.2247,-9.9472,-0.39,0.5019,-9.9472,1.3098,8.4655,5.8496,433
-1.0618,-10.1102,0.9129,1.166,-10.1102,2.2155,13.5474,7.6318,434
-6.6537,-9.9379,-1.186,3.1637,-9.9379,3.1755,20.5028,8.4193,435
-14.2259,-8.9726,-0.8224,5.9982,-8.9726,2.6576,45.8287,6.6198,436
-9.7927,-9.5698,0.1119,3.243,-9.5698,3.5957,23.332,5.9429,438
-0.1644,-9.7207,0.294,0.5634,-9.7207,1.504,7.0639,2.7696,439
-1.4991,-9.7542,0.4287,1.3157,-9.7542,2.1214,7.7116,6.4806,440
-18.1738,-1.1111,26.5944,51.6906,-1.1111,16.38,66.6132,30.2545,441
-1.854,-9.4982,0.5228,2.2254,-9.4982,5.6526,22.7148,19.4254,442
0.2221,-9.5341,4.6137,3.6819,-9.5341,5.6303,14.9751,10.505,443
-1.4132,-10.4719,-0.4155,0.8302,-10.4719,2.2435,10.6392,7.3945,444
-2.529,-9.7338,-0.7366,1.2059,-9.7338,5.2184,13.3929,8.374,445
-3.5862,-9.8071,-0.6852,1.4298,-9.8071,2.6885,11.0492,6.1065,446
-6.7152,-9.0011,0.7652,3.0177,-9.0011,5.1064,38.4593,7.709,448
-2.9443,-9.6611,0.9793,2.4976,-9.6611,5.8479,17.6406,9.5698,449
-2.9184,-9.9464,-0.5732,1.2043,-9.9464,2.6979,25.2769,10.17,450
-15.3469,-8.2241,1.9752,7.8613,-8.2241,2.5876,21.1756,16.4292,451
-3.1583,-9.5998,3.0147,6.507,-9.5998,2.1819,20.3898,17.7697,452
-21.9038,-4.6456,1.0794,12.6996,-4.6456,3.7334,39.2655,20.5348,453
-9.763,-9.7271,0.6842,6.6762,-9.7271,3.8198,13.8937,11.953,454
-10.0507,-9.6654,-1.7261,6.5406,-9.6654,3.2197,17.9037,14.8801,455
-3.6423,-9.8641,0.1002,2.688,-9.8641,5.4082,14.8528,9.8467,456
-2.7933,-9.6116,-0.4587,1.4252,-9.6116,4.0831,8.995,7.7203,458
-7.2768,-9.6211,-0.0753,3.4874,-9.6211,4.0531,17.2043,12.5517,459
-5.6112,-9.7889,0.3961,2.7373,-9.7889,5.4785,18.2204,9.0989,460
-2.4782,-10.0796,0.0863,1.7704,-10.0796,1.6589,16.5323,11.2216,461
-0.8039,-9.7562,0.1428,1.0086,-9.7562,3.4802,22.695,16.1666,462
-4.9471,-9.6173,-0.9231,2.4504,-9.6173,3.2894,26.3503,25.6118,463
1.4462,-9.777,5.5517,2.4914,-9.777,2.0526,11.5858,10.7389,464
-2.4227,-9.7831,0.2994,2.1789,-9.7831,3.8974,15.3846,13.4357,465
-4.5239,-9.7356,0.1266,2.404,-9.7356,2.836,12.3076,10.9478,466
-3.8548,-9.7919,-0.2708,1.084,-9.7919,2.65,14.9155,6.3769,468
-3.6373,-9.8193,0.2991,2.1786,-9.8193,3.2203,19.8898,10.1138,469
-4.0243,-9.815,-0.4857,1.6119,-9.815,4.0056,20.8884,12.1328,470
-0.817,-9.2525,0.1994,0.7996,-9.2525,2.4597,10.3698,8.2037,471
-2.2084,-9.8262,-1.0099,0.9543,-9.8262,0.7603,4.7026,4.1676,472
-4.1032,-9.8196,-0.5239,1.5853,-9.8196,1.8366,10.6571,7.0986,473
-0.9413,-9.9745,0.4138,0.9485,-9.9745,1.8891,9.2284,6.0709,474
-2.3326,-9.6826,0.9935,2.001,-9.6826,3.9504,12.2284,6.4536,475
-2.8007,-9.4151,1.0517,3.6595,-9.4151,3.2396,26.7406,15.3422,476
-1.977,-9.5388,-0.195,0.9504,-9.5388,0.7419,19.1155,16.713,477
-5.1917,-10.0636,0.8655,3.2888,-10.0636,1.0729,18.9442,8.9294,478
-3.0311,-8.8795,0.6545,2.7425,-8.8795,4.2154,28.0815,9.3558,479
-5.7379,-9.5507,-0.4776,2.7557,-9.5507,4.5042,28.1436,10.0534,480
-6.5996,-9.8784,1.3533,5.3864,-9.8784,4.7194,14.1916,12.1969,481
-2.8604,-10.1959,0.913,2.9286,-10.1959,2.6387,13.5829,8.5988,482
-3.8345,-9.7605,-0.0939,1.3906,-9.7605,2.7998,9.4445,5.2635,483
-3.6985,-9.8922,0.7079,4.1396,-9.8922,4.4778,15.9383,8.2739,484
-8.6398,-9.6361,1.5879,5.9118,-9.6361,6.1214,21.0753,11.801,485
-4.2523,-9.8677,-0.5088,2.1506,-9.8677,3.1938,12.8639,4.8965,486
-0.8472,-9.5858,-0.2576,0.3693,-9.5858,0.8802,8.4401,7.3917,487
-4.9151,-9.6809,-0.3084,1.6991,-9.6809,2.9711,6.5096,3.5344,489
-1.1864,-9.7809,0.3107,1.3522,-9.7809,4.3846,8.5813,4.088,490
-0.7087,-9.6496,-0.1425,0.3498,-9.6496,1.7446,10.2535,6.1206,491
-0.7765,-9.8124,-0.023,0.4423,-9.8124,0.7061,7.986,4.7442,492
-1.8951,-9.7067,0.7644,1.6577,-9.7067,1.5157,15.1882,6.7166,493
-3.1371,-9.5034,-0.4971,1.0942,-9.5034,2.2538,11.613,10.1473,494
-0.4256,-9.9026,0.215,0.3483,-9.9026,2.0079,14.0038,4.0907,495
-0.5541,-9.7362,-0.0599,0.3192,-9.7362,1.7343,6.2245,3.7514,496
-2.3455,-9.8042,-0.2264,0.7285,-9.8042,1.9634,5.4718,4.2057,498
-0.5787,-9.86,0.0719,0.4711,-9.86,2.5464,5.9632,4.4813,499
-2.154,-9.7517,-0.3674,0.8141,-9.7517,3.7223,11.7344,3.7879,500
-0.5887,-9.7865,0.4185,0.9059,-9.7865,3.7344,9.0849,8.1967,501
-0.1986,-9.6542,-0.0268,0.0801,-9.6542,0.3615,3.5385,3.0396,502
-9.1726,-9.781,1.7656,6.2959,-9.781,5.3897,20.506,14.4995,503
-1.976,-9.6997,0.6048,1.8763,-9.6997,2.1948,8.5032,4.8249,504
-4.2105,-10.0434,-0.038,1.4927,-10.0434,2.3152,11.9007,5.5174,505
0.0587,-9.9276,1.059,0.8245,-9.9276,1.5411,6.1933,4.6086,506
-2.225,-8.884,0.0357,1.4215,-8.884,1.3827,16.3065,11.5827,508
-5.5488,-9.4424,2.3162,3.9331,-9.4424,6.4258,29.1185,17.928,509
-17.3698,-6.8904,-0.9427,7.4939,-6.8904,6.5058,41.3883,22.7025,510
-16.432,-9.3071,10.4187,16.2776,-9.3071,3.4548,21.5258,16.6085,511
-4.9561,-10.0078,-1.3918,2.8033,-10.0078,2.9458,29.2817,12.9726,512
-1.7489,-9.8972,0.6367,1.5635,-9.8972,1.884,10.705,6.0466,513
-0.2156,-9.7295,1.2534,1.3442,-9.7295,1.2221,8.0299,5.1556,514
-4.0434,-9.6925,-0.8324,1.6273,-9.6925,1.7679,10.8886,5.2278,515
-1.8362,-9.6327,2.1769,3.4927,-9.6327,7.3989,19.2627,12.1402,516
-2.6026,-9.7168,0.2749,1.757,-9.7168,4.5129,13.6708,5.719,518
-1.5582,-9.8243,0.3241,1.3632,-9.8243,1.9163,16.1776,7.6905,519
-3.1567,-9.6198,-0.6131,1.1055,-9.6198,1.3812,9.2616,4.4588,520
-1.571,-9.8718,-0.3641,1.0288,-9.8718,1.6558,7.8803,5.6189,521
-3.5331,-9.1458,-0.3083,1.6911,-9.1458,1.6336,8.4555,5.3329,522
-0.2041,-10.0986,2.9125,3.3419,-10.0986,3.3512,12.5813,9.3532,523
-0.0734,-9.827,3.2034,2.5386,-9.827,6.7706,14.7856,12.7519,524
-0.5983,-9.6734,0.3377,0.7621,-9.6734,2.1125,9.0949,3.4114,525
-2.1826,-9.0531,-0.0716,1.1981,-9.0531,1.9668,10.7941,5.9517,526
-2.3505,-9.637,0.4039,1.8363,-9.637,3.8361,10.9569,5.7814,528
-1.0584,-9.8219,0.4955,1.1177,-9.8219,2.7299,12.1417,8.0174,529
0.8269,-9.4094,6.6787,5.8336,-9.4094,5.2751,22.8285,13.1775,530
-7.2055,-9.8789,-1.0139,3.3221,-9.8789,6.22,15.58,9.2186,531
-0.717,-9.9365,3.2923,3.7444,-9.9365,2.4044,9.9622,9.253,532
-3.279,-9.8235,1.02,3.0312,-9.8235,4.1589,12.3916,6.3709,534
-5.6925,-9.695,0.3033,3.7308,-9.695,4.7023,12.5842,9.0568,535
-4.6606,-10.2918,0.2124,2.6199,-10.2918,1.5958,20.8396,11.5674,536
-2.6449,-9.478,-0.0729,1.2759,-9.478,3.5113,15.9068,7.5297,538
-0.9363,-9.7565,0.2345,0.7564,-9.7565,2.4894,12.4798,5.2098,539
-0.3843,-9.7121,-0.0374,0.1537,-9.7121,0.5125,6.1038,2.5534,540
-0.1444,-9.9779,-0.02,0.1379,-9.9779,1.0648,3.317,1.3734,541
-2.3166,-9.8739,0.2806,1.9668,-9.8739,2.5671,21.1233,8.6597,542
-0.9467,-9.4315,0.5997,2.3286,-9.4315,2.3852,13.8231,10.1883,543
-1.0963,-9.7516,-0.0657,0.4567,-9.7516,0.7781,9.9523,4.9119,544
-0.2515,-9.8822,0.1033,0.2477,-9.8822,0.6093,12.7688,4.8889,545
-0.7783,-9.7942,-0.2275,0.334,-9.7942,1.7048,9.918,3.7216,546
-0.6064,-9.8787,1.9306,2.1967,-9.8787,2.6849,13.4766,9.1901,548
-2.5588,-9.7637,0.3399,1.3119,-9.7637,2.5131,14.2567,5.2842,549
-1.1928,-9.8135,0.1448,0.7315,-9.8135,2.1926,7.032,5.1854,550
-1.2536,-9.8072,0.3583,0.7928,-9.8072,2.2031,6.2141,5.2898,551
-0.1225,-9.6344,1.0577,0.9706,-9.6344,1.507,8.2532,4.674,552
-0.1255,-9.5679,-0.0164,0.0809,-9.5679,0.5314,7.3927,4.558,553
-1.3902,-9.9606,0.0461,0.7905,-9.9606,1.7772,8.3092,4.9434,554
-1.1635,-9.7228,0.7272,1.8929,-9.7228,2.6491,17.7664,6.5267,555
-0.1115,-9.3436,2.0759,2.4849,-9.3436,3.3881,12.427,7.593,556
-36.9945,-8.8837,2.33,11.0167,-8.8837,7.7542,55.2004,15.8065,558
-5.21,-9.1458,-0.6828,3.8475,-9.1458,5.5594,16.2243,11.8707,559
-104.9814,-8.268,-2.2217,33.4307,-8.268,12.6808,61.8636,32.0203,560
-2.1577,-10.316,1.842,3.1783,-10.316,1.7356,17.3404,11.9314,561
1.2209,-9.8056,6.399,4.5586,-9.8056,1.3465,12.3763,9.689,562
-11.3859,-9.816,0.9949,6.986,-9.816,2.3782,22.9393,20.5652,563
-2.9284,-9.468,-0.7906,1.921,-9.468,1.1655,10.3298,4.2553,564
-7.4924,-9.6472,0.4314,3.4486,-9.6472,4.0941,12.6922,8.0172,565
-1.7472,-8.4961,0.4917,1.3907,-8.4961,3.7358,19.8781,14.2542,566
-1.2984,-9.5078,5.428,8.876,-9.5078,6.0354,20.3671,13.5104,568
-3.2279,-9.5422,0.2839,1.4673,-9.5422,2.9524,16.0603,6.9927,569
-2.6692,-9.4531,0.0337,2.19,-9.4531,1.7759,12.279,6.3902,570
-4.0802,-9.7011,1.078,3.4282,-9.7011,1.8564,10.4059,5.7576,571
-4.967,-9.3863,-1.5762,1.7586,-9.3863,4.1255,17.8988,10.8389,572
-2.0637,-9.7652,1.979,3.0614,-9.7652,5.4553,19.945,11.9589,573
-4.2073,-9.2447,1.2111,4.1899,-9.2447,3.8028,17.5723,12.8299,574
-1.1396,-9.6135,0.4609,1.2125,-9.6135,2.3362,7.1554,4.4248,575
-0.3595,-9.7113,0.0029,0.1892,-9.7113,0.9038,9.2258,3.1765,576
-1.1941,-9.7907,0.6456,1.3028,-9.7907,0.9644,6.7963,5.2972,578
-2.7216,-9.5531,2.005,3.5973,-9.5531,5.0343,23.1348,8.8542,579
-12.6264,-9.4776,-0.4889,7.2111,-9.4776,6.1902,16.1176,11.9623,580
-4.6699,-8.4631,-0.3557,2.6739,-8.4631,3.9841,27.8312,14.1998,581
-3.8912,-9.8171,-0.1598,1.9493,-9.8171,2.7163,7.4017,4.3379,582
-2.0022,-9.5345,0.0641,2.1571,-9.5345,3.5676,11.1923,7.5532,583
-1.3142,-9.0281,0.9067,1.7582,-9.0281,2.5114,11.9492,7.9397,584
-5.7102,-9.7541,0.5405,3.1391,-9.7541,2.3654,11.2797,5.0578,585
-0.8429,-9.2044,0.3546,0.7516,-9.2044,2.0312,14.6301,8.9103,586
-0.3247,-9.6948,0.0601,0.2316,-9.6948,0.7996,9.4165,2.6196,588
-4.9916,-9.492,0.3864,1.9845,-9.492,3.0619,18.5705,4.8813,589
-0.9002,-10.1945,0.152,0.5581,-10.1945,1.238,6.0956,3.3074,590
-0.3954,-10.056,0.4633,1.0116,-10.056,0.9184,7.671,4.0912,591
-4.7402,-9.9183,0.2142,2.2484,-9.9183,2.9653,11.8708,8.6367,592
-1.1389,-9.6892,1.0441,2.8266,-9.6892,2.9235,12.0125,4.3392,593
-6.2313,-10.302,3.3857,5.1636,-10.302,3.0761,31.8319,23.7596,594
-2.5278,-9.4765,1.1173,3.8136,-9.4765,1.7529,35.0742,29.7583,595
-7.2603,-9.5783,1.7583,7.3036,-9.5783,4.3099,34.3438,14.537,596
-6.8111,-9.6393,2.4443,6.988,-9.6393,6.0008,33.6526,12.9748,598
-39.8484,-9.3675,2.822,16.1508,-9.3675,8.9847,61.771,37.9116,599
-10.0222,-9.6111,1.9479,7.561,-9.6111,2.9081,40.0763,34.4295,600
-2.4159,-10.4078,-0.4728,1.2958,-10.4078,1.9502,19.4969,13.5141,601
-0.2253,-9.6897,0.2706,0.324,-9.6897,1.1987,10.6745,7.3299,602
-0.8936,-9.7405,0.5921,1.3699,-9.7405,2.6118,24.5088,17.876,603
-1.8264,-9.7169,0.0124,1.1673,-9.7169,2.24,13.1584,8.5124,604
-0.5816,-9.731,-0.064,0.3039,-9.731,1.1098,6.5181,4.6555,605
-1.7045,-9.6927,0.5884,1.3726,-9.6927,3.5161,14.4306,6.99,606
-3.4934,-9.7737,-0.448,1.9238,-9.7737,6.9573,19.567,8.2979,608
-2.6515,-9.6678,0.2301,1.6441,-9.6678,3.5594,13.2334,7.2708,609
-4.5702,-9.9552,0.2895,3.4883,-9.9552,2.6065,11.1894,9.8566,610
-1.269,-9.9225,-0.182,0.8349,-9.9225,1.1012,6.4821,3.7964,611
-6.7716,-9.4924,0.008,3.2387,-9.4924,1.7849,8.3704,7.8733,612
-0.3914,-9.5874,0.412,0.4821,-9.5874,0.8384,4.4855,3.3118,613
-0.3954,-9.9493,-0.0028,0.2192,-9.9493,0.5136,3.115,1.8842,614
-0.5191,-9.5752,0.786,0.9803,-9.5752,1.7681,11.2585,7.786,615
-0.6656,-9.7425,0.1744,0.729,-9.7425,1.1549,10.5264,6.8447,616
-1.6781,-9.6937,0.5726,2.3138,-9.6937,1.2063,10.7318,9.0945,617
-11.011,-9.7182,0.6912,3.1752,-9.7182,5.3562,22.9417,9.7038,619
-18.8739,-9.9972,9.6538,18.0078,-9.9972,13.5896,56.1405,32.9232,620
-10.6039,-9.1687,19.8808,49.472,-9.1687,5.631,63.0315,30.0835,621
-31.0328,-9.8502,4.0091,22.813,-9.8502,4.8115,27.8828,17.3327,622
-5.1159,-9.7098,-1.211,2.6625,-9.7098,1.9703,15.6362,13.5776,623
-4.2219,-10.0859,-1.149,1.7726,-10.0859,5.7206,44.5528,36.5064,624
-2.254,-9.9164,1.9679,2.4384,-9.9164,2.4886,20.9278,18.5025,625
-0.9599,-9.7816,2.0087,2.591,-9.7816,6.625,19.0099,14.4521,626
-2.3723,-9.8975,-0.0654,1.9462,-9.8975,0.5394,13.8809,11.5486,628
-1.4899,-9.6558,-0.0833,0.4986,-9.6558,0.8565,9.7539,8.2802,629
-5.766,-9.6436,4.4684,9.1935,-9.6436,7.8292,21.4752,13.0655,630
-3.375,-9.9967,0.1537,2.7532,-9.9967,2.712,33.5713,29.0314,631
-1.9002,-9.7531,0.0934,1.5528,-9.7531,2.0678,26.0753,25.2941,632
-4.7558,-9.8462,3.7096,8.6459,-9.8462,3.9979,16.8286,14.808,633
-9.3,-9.4448,1.091,7.7909,-9.4448,5.3325,29.3426,16.8425,634
-3.8485,-10.1257,0.3269,1.8573,-10.1257,2.4644,32.2914,19.323,635
-10.9918,-9.5301,3.1643,6.8359,-9.5301,6.7665,19.8051,9.7637,636
-3.588,-9.1105,0.0498,1.6673,-9.1105,2.1032,10.7546,6.6881,637
-0.7308,-9.2701,6.2005,6.6749,-9.2701,6.5193,20.4523,16.9766,638
-17.1829,-9.587,-2.0635,5.4031,-9.587,2.7616,17.0368,7.3256,639
-2.8103,-9.7027,0.1435,1.5713,-9.7027,2.5285,15.3988,13.0094,640
-0.583,-8.729,-0.0414,0.2934,-8.729,1.0564,31.4782,5.4207,641
-2.932,-9.8428,1.9662,2.8948,-9.8428,3.9514,16.7077,12.5588,642
-1.6021,-9.7977,-0.1284,0.6681,-9.7977,0.9246,8.2235,4.5121,643
-1.8631,-9.7166,1.4592,2.0151,-9.7166,2.2357,16.846,8.9605,644
-2.2891,-9.7632,0.1021,0.8441,-9.7632,2.1342,11.8493,7.7156,645
-2.0486,-9.7855,0.2747,0.9746,-9.7855,3.0697,9.7731,6.4589,646
-1.0079,-9.8016,1.8336,1.8604,-9.8016,0.7377,7.9208,6.7985,647
0.0861,-9.9573,0.9934,0.55,-9.9573,0.6739,10.9293,8.1398,648
-3.3953,-9.6104,0.5,1.692,-9.6104,3.8536,17.4137,10.3712,649
-0.4103,-9.7988,0.0944,0.3862,-9.7988,0.7397,12.4892,10.023,650
-3.0712,-9.7424,0.4143,2.6925,-9.7424,3.8728,12.133,6.5462,651
-0.3263,-9.986,-0.0443,0.166,-9.986,0.5982,4.4463,2.5424,652
-0.4687,-9.7624,0.213,0.3817,-9.7624,1.084,8.4617,7.3275,653
-1.3308,-9.8042,-0.1631,0.4721,-9.8042,1.833,11.5924,4.1989,654
-0.827,-9.692,1.6178,1.9481,-9.692,2.6932,12.0637,4.4959,655
-1.8783,-9.654,1.0077,2.219,-9.654,3.3954,20.4298,15.1485,656
-2.2925,-9.7496,-0.4488,1.0233,-9.7496,2.3883,9.3016,5.2327,657
-3.1433,-9.7145,0.0872,2.1986,-9.7145,4.8114,10.4686,4.6223,658
-21.9561,-9.3858,0.7959,10.8389,-9.3858,5.8724,50.7258,18.1144,659
-13.9644,-9.4932,10.2468,15.0194,-9.4932,10.0061,31.3657,17.6707,660
-8.0714,-9.6824,3.1014,8.569,-9.6824,7.0579,22.6595,14.311,661
-16.3255,-9.156,-2.801,8.3716,-9.156,14.3647,41.1192,25.3161,662
-1.7636,-9.9696,3.6618,4.1386,-9.9696,8.9836,25.1569,16.027,663
-5.9291,-10.3047,2.3283,6.9672,-10.3047,7.1005,23.9317,19.2922,664
-4.67,-10.0438,-1.0324,1.9762,-10.0438,3.6489,16.3559,11.7521,665
-1.7185,-9.92,1.0014,1.7847,-9.92,3.4851,19.7395,6.7411,666
-2.9326,-9.8146,-0.0345,1.0269,-9.8146,2.0455,8.6536,5.896,668
-3.773,-9.8872,1.1004,2.2726,-9.8872,3.4234,11.6045,5.7414,669
-2.3152,-9.8788,-0.0806,1.5133,-9.8788,2.8008,9.2561,7.7663,670
-4.0715,-10.0006,-0.4862,2.2715,-10.0006,1.9925,9.7474,8.1535,671
-1.2487,-10.139,-0.174,0.7126,-10.139,1.0953,8.7847,4.4128,672
-1.088,-10.2962,0.3452,0.8156,-10.2962,1.0236,8.0435,4.5452,673
-2.8908,-9.7419,0.1481,1.5106,-9.7419,0.8501,7.678,3.7808,674
-4.1776,-9.7406,4.8438,5.7417,-9.7406,7.1558,17.613,11.2282,675
-2.2502,-9.9397,-1.0978,0.6259,-9.9397,1.691,14.4688,12.0279,676
-3.8155,-9.7117,-0.075,2.246,-9.7117,6.3877,17.577,7.7542,678
-4.3163,-9.5431,-0.0783,1.7849,-9.5431,5.268,15.5541,8.4936,679
-1.1905,-9.5218,0.2446,0.8945,-9.5218,0.9514,7.4574,5.17,680
-4.8579,-9.5358,1.7423,3.7666,-9.5358,0.8174,12.9227,8.6947,681
-0.4175,-9.9609,-0.082,0.2121,-9.9609,0.7325,2.7875,1.7031,682
-8.3721,-9.8861,-0.6074,3.8012,-9.8861,1.4155,10.3903,4.8411,683
-1.3328,-9.7342,0.7044,2.3507,-9.7342,1.7485,14.7444,10.818,684
-4.1955,-9.7507,0.8419,2.5148,-9.7507,2.3331,10.2451,5.8753,685
-0.2548,-9.8579,-0.0201,0.1946,-9.8579,0.7684,5.8469,4.8665,686
-0.7574,-9.7666,0.5613,1.2686,-9.7666,3.9,12.2128,5.7273,688
-0.9269,-9.6524,1.7928,2.4858,-9.6524,3.2691,12.7327,8.2504,689
-0.8845,-9.6921,0.0802,0.5506,-9.6921,1.4725,10.0481,4.3374,690
-0.3752,-9.9262,-0.1343,0.1228,-9.9262,0.9067,6.0949,2.88,691
-0.4144,-10.202,0.4,0.5991,-10.202,1.9399,7.0123,6.256,692
0.0206,-9.6731,0.8093,0.5105,-9.6731,1.5463,8.1429,5.3656,693
-0.3985,-9.7577,0.0682,0.3985,-9.7577,0.8143,5.0134,4.0205,694
-2.4366,-9.708,0.6796,1.7204,-9.708,5.0659,21.7447,15.7484,695
-1.0393,-9.9113,0.4037,0.9586,-9.9113,0.6117,6.189,3.9686,696
-0.6644,-9.875,1.0882,1.1163,-9.875,0.4608,10.6628,8.673,698
-1.8055,-9.7293,0.8539,1.5657,-9.7293,4.7706,16.2561,8.3902,699
1.3501,-9.072,9.8967,6.7397,-9.072,2.2925,29.4644,20.4364,700
-12.9694,-9.7269,1.78,10.0544,-9.7269,5.592,32.4085,30.592,701
-14.2211,-9.3284,1.3848,7.3482,-9.3284,2.1239,41.7775,33.6913,702
-8.56,-9.5304,1.3615,7.3958,-9.5304,2.6048,31.9398,28.1123,703
-4.4396,-10.0827,0.0946,3.0591,-10.0827,2.0918,13.3977,9.8839,704
-4.8136,-9.8788,-0.916,2.0625,-9.8788,5.6057,14.9391,9.1313,705
-0.0518,-9.3994,0.6604,0.6382,-9.3994,0.9555,8.6196,5.1284,706
-2.1252,-9.7674,1.0553,1.7649,-9.7674,3.6302,8.605,6.8235,708
-4.5001,-9.707,0.6311,3.3186,-9.707,4.5838,16.8301,8.4762,709
-0.3457,-9.9423,1.1225,1.5778,-9.9423,1.6705,10.1023,5.6451,710
-0.7761,-9.5688,-0.1106,0.3942,-9.5688,0.6468,7.1973,3.9639,711
-3.1055,-9.6574,0.4726,2.4428,-9.6574,3.7374,18.0361,12.7597,712
-1.0879,-9.6827,0.5153,0.8625,-9.6827,1.4145,10.0364,8.4492,714
-0.7748,-9.6764,0.0539,0.342,-9.6764,1.4878,8.2976,3.4669,715
-1.7039,-9.6125,0.247,0.9965,-9.6125,2.244,9.3766,5.9965,716
-3.861,-9.7689,0.9955,2.1397,-9.7689,6.1195,22.3443,11.5496,718
-1.9585,-9.7529,0.6824,2.5308,-9.7529,1.7546,14.6992,8.7701,719
-7.1316,-9.4216,0.2072,3.0237,-9.4216,1.7724,9.325,7.7395,720
-3.1425,-10.2547,-0.746,1.5019,-10.2547,2.4008,12.1112,11.3422,721
-4.8364,-9.6073,-1.4484,2.2556,-9.6073,0.6591,11.7432,9.7923,722
-3.5451,-10.0247,-0.2765,2.1993,-10.0247,2.7312,11.0926,9.0568,723
-2.6324,-9.7205,-0.3145,1.0604,-9.7205,1.721,7.635,3.4338,724
-0.0372,-9.8987,0.1348,0.154,-9.8987,0.5306,10.2871,6.9287,725
-2.9998,-9.5629,0.797,2.4169,-9.5629,0.9064,13.0232,8.697,726
-2.9457,-9.9485,0.2337,1.1099,-9.9485,2.4512,6.3635,4.7431,728
-6.3333,-9.596,1.4075,4.1535,-9.596,6.6161,35.307,12.8359,729
-1.162,-9.7349,-0.3353,0.5431,-9.7349,0.8887,13.5569,5.3085,730
-1.9171,-9.7741,-0.8006,0.7888,-9.7741,1.2764,4.6266,3.5031,731
-7.431,-9.7426,-4.687,1.9798,-9.7426,0.4573,8.6843,7.8676,732
1.3163,-9.6971,4.697,1.8063,-9.6971,0.9128,6.3303,4.9099,733
-0.3583,-9.7257,0.7396,1.3062,-9.7257,1.825,4.5439,2.1225,734
-2.0497,-9.744,-0.8374,0.632,-9.744,1.2083,4.3142,2.3107,735
-0.479,-9.7368,0.0427,0.3156,-9.7368,0.4628,0.8157,0.6639,736
-0.6939,-9.7529,-0.174,0.348,-9.7529,0.9891,1.7843,0.9065,738
-0.5577,-9.7505,-0.1071,0.2188,-9.7505,0.5437,1.5194,0.637,739
-1.6445,-9.7531,-0.5142,0.5183,-9.7531,0.8067,2.6496,1.5474,740
-0.8164,-9.7489,-0.5353,0.1773,-9.7489,0.2402,1.6287,1.2394,741
0.0127,-9.744,0.614,0.6089,-9.744,1.1098,2.8793,2.0586,742
-2.6827,-9.7462,-1.3531,0.9598,-9.7462,0.5892,5.2364,4.9444,743
-0.2962,-9.7279,0.7632,0.9133,-9.7279,0.8672,2.4327,0.8902,744
-2.622,-9.8133,0.5638,1.6881,-9.8133,4.1113,15.0846,6.5544,745
-2.0885,-9.6851,1.0061,3.5689,-9.6851,4.3125,25.5163,16.6451,746
-7.576,-9.8651,1.6149,5.9658,-9.8651,6.156,16.2933,8.0054,748
-15.3818,-9.258,1.5531,8.5459,-9.258,6.1073,42.6359,13.3775,749
-1.6769,-10.3068,1.0177,3.4483,-10.3068,5.3075,28.4307,23.2509,750
-1.7778,-9.1295,-0.509,0.7111,-9.1295,1.8041,25.8307,12.8822,751
3.7868,-9.4511,15.4406,10.64,-9.4511,2.3807,33.3514,29.3243,752
-1.7954,-9.8136,-0.5326,0.5577,-9.8136,0.5735,5.1776,3.0173,753
-1.0446,-8.9568,0.8914,1.9013,-8.9568,4.0358,20.7153,11.7829,754
-1.2715,-9.8604,0.1871,0.9491,-9.8604,4.2809,14.2351,6.1708,755
-5.1455,-9.4434,-1.0317,1.8949,-9.4434,5.2912,11.9136,6.857,756
-4.1706,-9.7928,-0.4207,1.8436,-9.7928,6.8078,16.3573,9.3849,758
-2.5134,-9.7153,0.2313,1.1576,-9.7153,3.5275,11.5888,5.5151,759
-0.2519,-9.8077,0.7041,0.6361,-9.8077,1.162,6.5405,4.4874,760
-0.5897,-9.9054,0.4402,0.758,-9.9054,2.2909,8.5488,7.0581,761
-0.7581,-9.9912,0.8738,1.7283,-9.9912,1.0416,12.9048,10.3342,762
-1.6639,-9.7891,1.0609,2.5193,-9.7891,2.3913,8.6424,7.218,763
-2.736,-9.7008,2.769,4.9312,-9.7008,3.106,17.8303,14.7488,764
-0.5693,-9.9513,1.651,2.8719,-9.9513,3.2935,11.8401,9.266,765
-3.1112,-9.7572,-0.0308,1.4957,-9.7572,3.122,11.5601,6.4805,766
-1.6387,-10.188,-0.2551,0.7156,-10.188,1.2884,10.5468,6.8011,768
-1.8919,-9.7421,0.0935,0.8108,-9.7421,2.4606,9.666,3.9929,769
-0.4425,-9.8126,-0.062,0.2125,-9.8126,0.9399,7.1754,3.8827,770
-0.6598,-9.8394,-0.1591,0.3605,-9.8394,0.6014,8.99,3.8213,771
-0.3457,-9.6904,2.6483,1.9746,-9.6904,1.2624,14.1256,13.0813,772
-1.2894,-9.9062,-0.2761,0.9241,-9.9062,1.5957,12.0721,3.0811,773
-0.4656,-9.7536,0.1087,0.2872,-9.7536,1.5347,15.3371,13.5146,774
-0.3707,-9.8905,0.2883,0.4738,-9.8905,1.3656,16.2972,14.3114,775
-3.2582,-9.4757,0.8555,2.4393,-9.4757,1.2956,19.6621,6.653,776
-3.8206,-9.3801,1.8993,3.4358,-9.3801,1.6081,20.7179,12.9881,778
-4.6562,-9.699,0.8737,4.1563,-9.699,4.4893,49.3867,11.5456,779
-13.1443,-8.0656,-1.3295,4.077,-8.0656,5.6983,36.2592,16.2607,780
-1.1863,-9.6114,0.0181,1.5808,-9.6114,3.4539,9.4038,6.2274,781
-1.313,-8.6251,3.4934,2.9826,-8.6251,2.4104,13.8668,8.9671,782
-7.5526,-8.1319,3.3829,11.4293,-8.1319,5.8898,44.5706,14.9013,783
-5.1752,-9.8913,-2.8174,1.6952,-9.8913,5.0807,27.5067,21.9179,784
2.4386,-9.78,5.8331,3.2451,-9.78,2.5861,26.5994,19.7807,785
-9.5769,-9.6021,2.9967,9.6324,-9.6021,3.6327,27.7543,14.18,786
-2.1644,-9.4662,1.4589,2.699,-9.4662,3.2657,18.4559,10.9273,787
-3.6301,-9.72,7.6461,10.0452,-9.72,10.227,29.8211,11.3156,789
-0.6555,-9.7579,2.0139,1.9417,-9.7579,6.4541,17.6476,9.0043,790
-0.6715,-10.081,2.9251,3.3042,-10.081,2.5572,12.045,7.1866,791
-2.1167,-9.9226,-0.3546,1.0611,-9.9226,3.5149,17.3176,12.1169,792
-2.5877,-9.6619,-0.3071,1.9906,-9.6619,2.3908,10.3857,8.2535,793
-1.0333,-9.4088,3.2705,3.5185,-9.4088,1.9574,14.0665,10.8029,794
-1.1838,-9.5976,4.0117,3.5397,-9.5976,2.056,17.3105,12.8588,795
-1.7696,-10.0934,0.1959,1.1876,-10.0934,1.5161,9.2136,5.067,796
-0.3981,-9.738,1.1138,1.2171,-9.738,0.656,12.1458,11.2994,798
-8.8432,-9.4253,1.2901,3.4757,-9.4253,6.622,30.2223,14.5993,799
-5.059,-9.4914,3.4471,6.6993,-9.4914,3.4899,24.0763,11.7005,800
-1.4995,-9.925,3.4626,5.199,-9.925,3.6691,19.7546,6.6215,801
-0.5501,-9.6523,1.1937,1.4115,-9.6523,3.3769,10.1806,8.8835,802
-1.0616,-9.6643,3.3237,5.417,-9.6643,5.3508,16.6538,11.0205,803
-4.0838,-9.645,0.4198,2.5801,-9.645,1.3319,10.6017,8.2061,804
0.8758,-9.4656,9.3974,5.9848,-9.4656,3.6152,26.3512,17.2328,805
-8.6386,-9.6468,0.9018,6.3775,-9.6468,4.482,28.5252,10.9783,806
-0.9125,-9.9474,0.1796,0.5769,-9.9474,1.3576,9.3404,3.5742,807
-5.1584,-9.6198,0.9321,2.5302,-9.6198,3.8583,15.9238,7.2274,808
-1.1851,-9.7628,0.7791,1.0989,-9.7628,3.267,15.2281,7.7608,809
-1.2993,-9.7574,-0.0891,0.4107,-9.7574,0.7805,10.1125,6.0963,810
-0.0181,-9.8495,0.5834,0.5504,-9.8495,1.0587,8.5209,7.5849,811
-33.103,-9.6442,-10.9172,9.4507,-9.6442,3.9612,20.3154,13.8561,812
6.7239,-9.5067,15.4109,5.3339,-9.5067,2.5588,12.8432,9.5708,813
-27.9054,-9.4063,-9.1743,11.6778,-9.4063,4.746,10.6637,4.7032,814
-2.3912,-9.4932,6.8603,6.5378,-9.4932,3.0955,9.2313,3.2856,815
-1.7943,-9.5136,3.3795,2.7916,-9.5136,1.4538,3.7551,2.1205,816
1.264,-9.5576,2.0703,0.6362,-9.5576,0.3581,1.8239,1.2875,817
0.6888,-9.5621,0.8442,0.1284,-9.5621,0.0855,0.7522,0.6651,818
0.9342,-9.5622,1.3696,0.3015,-9.5622,0.1766,1.123,0.9131,819
1.1076,-9.5638,1.9694,0.4472,-9.5638,0.2793,1.4459,1.3579,820
-1.518,-9.6666,6.898,6.1189,-9.6666,3.1582,13.0833,7.4274,821
-11.8645,-10.3836,3.5333,8.2633,-10.3836,2.106,16.9184,14.8906,822
-3.6438,-9.6316,-0.1167,2.7214,-9.6316,0.7923,13.4406,10.4779,823
-4.1739,-9.6261,1.1119,3.3196,-9.6261,4.9159,22.0107,11.8443,824
-0.1492,-9.7903,1.3336,1.5337,-9.7903,1.2764,7.9268,7.0758,825
-6.3896,-8.8415,0.7304,4.1672,-8.8415,3.0407,19.802,15.8248,826
-0.9136,-9.8824,2.0781,3.0758,-9.8824,1.4012,13.9299,9.0025,827
-2.4469,-9.8102,1.3723,3.3298,-9.8102,2.2015,17.1813,15.0127,828
-2.347,-9.5935,0.2657,1.5386,-9.5935,4.0481,9.5766,7.1485,829
-0.5912,-9.7857,0.451,0.5923,-9.7857,2.2646,9.1888,4.8636,830
-3.2723,-9.5593,1.2233,2.7619,-9.5593,3.1444,13.1707,6.2174,831
-10.9314,-9.7362,-0.5605,4.0993,-9.7362,5.965,17.1789,11.3568,833
-10.0826,-9.7548,0.0211,4.6396,-9.7548,6.8698,15.9715,10.9793,834
-6.5891,-9.7196,0.2889,2.8417,-9.7196,5.0119,19.4241,7.9447,835
-1.1516,-9.5514,0.838,1.4758,-9.5514,2.5746,9.9868,7.2315,836
-0.4139,-10.107,0.3147,0.5283,-10.107,1.6422,8.9254,4.7297,837
-0.2417,-9.8215,0.5622,0.7398,-9.8215,1.9478,9.2823,5.0766,838
-0.5518,-9.5475,-0.1475,0.2856,-9.5475,1.4004,6.2874,3.4729,839
-0.3454,-9.6951,0.3549,0.5553,-9.6951,1.2267,9.4328,3.4141,840
-0.5125,-10.034,0.0116,0.324,-10.034,0.7534,5.9928,4.9735,841
-0.8684,-9.8794,0.3056,0.6617,-9.8794,1.6285,12.2947,9.358,843
-1.9408,-9.782,0.0724,0.5801,-9.782,1.8003,8.7904,4.419,844
-0.3245,-9.7499,0.5447,0.6981,-9.7499,2.0993,8.3258,5.8647,845
-8.8512,-9.4663,0.2078,5.1662,-9.4663,2.1523,22.1482,21.1593,846
-6.0342,-10.2267,-0.8814,3.2775,-10.2267,4.656,19.1524,17.176,847
-2.42,-9.737,-0.6289,1.1457,-9.737,2.9937,9.0484,4.8926,848
-0.7615,-10.3367,1.1443,1.2556,-10.3367,3.9005,30.0082,28.9187,849
-2.3626,-9.9086,2.9509,5.4968,-9.9086,8.1302,50.7033,47.1464,850
-3.3259,-9.8638,0.4839,2.526,-9.8638,3.985,28.8561,24.7941,851
-8.8371,-9.5265,6.2379,13.1889,-9.5265,15.6195,59.7446,32.0179,853
-3.9892,-9.9622,0.6971,1.9467,-9.9622,1.9867,24.5866,16.0632,854
-0.0121,-9.7504,1.4816,1.5005,-9.7504,3.737,11.9873,7.084,855
-8.0183,-9.4994,-0.8441,3.9758,-9.4994,2.4,19.5546,9.5681,856
-0.6039,-9.9373,0.5745,1.1254,-9.9373,1.1052,7.3641,6.0638,857
-1.73,-10.0465,0.9205,1.9339,-10.0465,2.4345,12.159,8.3253,858
-11.7307,-9.6903,1.6095,6.6859,-9.6903,7.2054,37.7474,34.8922,859
-12.0606,-9.9612,2.807,6.1782,-9.9612,5.1037,42.7601,28.8108,860
-1.7231,-9.2935,-0.5857,0.6538,-9.2935,1.8012,6.4281,4.9221,861
-2.3002,-9.7905,-0.4589,1.1964,-9.7905,2.7928,8.4605,5.1231,863
-1.0285,-9.7774,0.4068,1.1697,-9.7774,2.5394,12.5694,6.0294,864
-0.1991,-9.6265,0.5427,0.8433,-9.6265,1.38,9.4501,8.0052,865
-1.7622,-9.8629,-0.0336,0.7427,-9.8629,1.4822,4.3699,2.7895,866
-0.0982,-9.8969,0.0769,0.1917,-9.8969,1.0737,9.3018,8.3559,867
-0.0372,-9.8399,0.0227,0.0545,-9.8399,0.38,5.5825,1.4663,868
-2.6869,-10.0197,1.6848,3.3712,-10.0197,1.5114,15.0598,12.9853,869
-1.4138,-10.168,-0.278,0.5733,-10.168,1.278,34.1394,29.6727,870
-1.6061,-9.8989,3.0859,3.8983,-9.8989,2.2291,29.7984,16.9165,871
-14.7487,-9.1236,4.2222,15.9455,-9.1236,2.1481,22.8127,19.5512,873
-26.2045,-9.6853,1.2449,8.1125,-9.6853,7.8328,28.7945,15.7532,874
-2.6942,-9.8153,2.585,4.9798,-9.8153,4.1059,24.8543,9.2331,875
-6.004,-9.7221,7.7504,9.2179,-9.7221,6.9746,28.3854,21.6275,876
-1.1271,-10.0238,2.378,3.4717,-10.0238,2.8798,17.7835,15.5425,877
-5.7583,-9.53,2.5966,6.2166,-9.53,1.0447,15.0975,14.0505,878
-1.6782,-9.7891,0.1655,1.6529,-9.7891,0.7201,20.4859,17.6792,879
-0.8784,-9.9163,0.2404,0.833,-9.9163,2.8238,12.282,5.9236,880
-0.5666,-10.1156,2.1437,3.3683,-10.1156,3.6471,10.7941,8.9763,881
-8.507,-9.7093,1.5556,4.7775,-9.7093,5.3282,26.6016,13.0119,883
-10.3167,-9.8433,-1.9336,7.2112,-9.8433,1.9531,18.2854,17.2775,884
-3.2923,-9.9716,-0.0186,1.9418,-9.9716,1.2363,16.9247,14.5696,885
-1.6144,-9.9176,2.7827,3.7637,-9.9176,4.2324,24.3033,20.5187,886
-4.3248,-9.7021,13.264,15.3924,-9.7021,5.1246,25.7492,18.8865,887
-4.2206,-9.9967,0.9968,3.5988,-9.9967,1.3842,7.0123,6.4162,888
-0.8985,-9.7278,-0.0519,0.5003,-9.7278,1.0787,3.2862,2.9,889
-0.8575,-9.9859,4.3656,3.27,-9.9859,2.1246,31.0536,17.9599,890
-2.1222,-9.8504,0.1437,1.245,-9.8504,2.2172,33.2643,31.9436,891
-2.7877,-9.7517,0.5023,1.6085,-9.7517,3.65,12.7782,8.2799,893
-7.7904,-9.7723,0.7373,4.1365,-9.7723,6.5345,29.0569,17.5367,894
-3.9561,-9.8766,1.4777,3.5232,-9.8766,5.129,27.9974,22.1309,895
-2.7181,-10.4939,-0.1507,2.5189,-10.4939,1.2225,13.6264,6.5968,896
-0.4804,-9.9879,0.396,1.3768,-9.9879,1.9557,10.9537,10.0437,897
-1.2953,-10.0165,0.493,1.0185,-10.0165,1.9056,15.7069,7.5076,898
-2.6556,-9.7784,0.3591,2.0356,-9.7784,5.6958,20.3768,8.6543,899
-5.5805,-9.9048,1.0768,3.9383,-9.9048,7.5675,24.0749,15.7805,900
-4.6469,-9.8843,-0.797,2.4954,-9.8843,3.2003,13.8444,12.4475,901
-0.1579,-9.8058,0.761,1.3639,-9.8058,2.329,10.6607,5.2145,903
-5.7768,-9.6595,0.1881,2.4566,-9.6595,6.0286,15.2404,8.5649,904
-1.9237,-9.8046,-0.2464,0.7466,-9.8046,1.4793,9.5202,3.8922,905
-0.624,-9.9508,-0.2452,0.3131,-9.9508,0.9078,9.4986,4.2163,906
-0.1166,-9.9217,1.4925,1.2514,-9.9217,3.1438,11.9899,4.1269,907
-4.7447,-9.7326,-0.4178,2.9075,-9.7326,0.9327,13.7428,9.2101,908
-2.2619,-9.9388,0.0738,1.2296,-9.9388,2.7652,11.9011,10.3607,909
-2.7059,-9.7702,0.1485,1.3623,-9.7702,2.8454,11.9561,8.9524,910
-0.1994,-9.9657,0.2682,0.4583,-9.9657,0.8212,6.1951,3.8413,911
-0.1363,-9.3414,0.5224,0.9422,-9.3414,1.3845,9.7766,5.8796,913
-3.1114,-9.7754,0.9834,2.1183,-9.7754,5.4551,23.421,13.1518,914
-5.0224,-9.9938,-0.1682,2.1236,-9.9938,4.999,14.6009,12.6056,915
1.2681,-10.0324,8.2952,5.1591,-10.0324,2.6364,22.5231,15.829,916
0.0196,-9.8879,0.1808,0.2516,-9.8879,0.7927,8.6262,5.8268,917
-2.8593,-9.7842,-0.6372,1.597,-9.7842,1.9315,8.7282,8.0228,918
-2.5667,-9.7108,-0.1028,1.5618,-9.7108,3.3159,10.5936,6.3544,919
-1.4539,-9.7245,1.0542,1.8621,-9.7245,5.7467,28.0884,11.7979,920
-2.3668,-10.1055,0.6759,1.5852,-10.1055,2.5796,13.2905,8.7861,921
-6.3769,-9.5696,5.9588,8.2666,-9.5696,10.3521,35.2612,21.1581,923
-3.4838,-9.3376,0.2291,1.3036,-9.3376,2.8161,13.7921,5.7811,924
-0.4329,-9.7595,0.0755,0.2947,-9.7595,0.5604,9.9558,7.4918,925
-15.6749,-9.3336,-1.0078,8.9582,-9.3336,4.2254,22.9116,16.3177,926
-17.2224,-7.0079,3.6327,11.2421,-7.0079,4.9323,21.7897,14.5562,927
-5.0635,-9.7172,-0.3205,3.3302,-9.7172,2.3878,12.2283,11.2714,928
-1.7616,-9.7976,-0.1588,0.964,-9.7976,3.0943,10.8565,8.3802,929
-0.3695,-9.6733,0.4771,1.0211,-9.6733,1.1108,13.661,10.7144,930
-3.2705,-9.5389,-0.3497,1.962,-9.5389,4.9013,13.5668,8.9573,931
0.0141,-10.052,0.3649,0.2972,-10.052,0.896,10.4229,4.4324,933
-1.9979,-9.77,5.1473,5.9473,-9.77,4.1029,13.0154,9.8654,934
-6.6491,-10.0663,-0.4852,3.184,-10.0663,5.4701,31.3896,21.9022,935
-5.6807,-9.7157,0.4973,4.7184,-9.7157,3.8412,19.724,9.9893,936
-2.8638,-9.3484,-0.3377,1.348,-9.3484,2.3637,11.2669,8.0454,937
-2.8264,-9.4461,-0.2873,1.6367,-9.4461,3.5086,11.305,8.1824,938
-2.6668,-9.2425,-0.4479,1.3722,-9.2425,0.6246,8.8916,6.2029,939
-2.97,-9.9024,-1.5943,1.2056,-9.9024,0.938,15.8145,9.8472,940
-10.799,-10.1441,0.4135,4.5203,-10.1441,4.168,18.9066,11.9552,941
-0.0671,-9.5978,1.4638,1.1019,-9.5978,1.6912,9.7789,7.2986,942
-7.1928,-9.7917,-0.4101,2.6275,-9.7917,5.2923,12.5196,7.6185,944
-0.0188,-9.3528,1.2518,0.9859,-9.3528,1.3075,10.9939,7.2134,945
-0.0267,-9.6859,0.282,0.5248,-9.6859,1.0932,10.7209,8.9656,946
-0.5174,-9.3813,0.224,0.4789,-9.3813,1.4844,8.0724,3.4611,947
-3.0424,-9.3917,0.4201,1.7622,-9.3917,1.486,10.7421,7.431,948
-1.0474,-9.9675,1.3057,1.4571,-9.9675,1.4723,11.3754,4.8919,949
-1.9697,-9.7676,0.3155,1.0714,-9.7676,3.0182,9.6796,7.2362,950
-1.2691,-9.8547,0.2839,0.856,-9.8547,2.3441,7.5361,4.7966,951
-0.0493,-9.6149,2.2697,3.0084,-9.6149,2.682,11.5665,8.3505,952
-18.1781,-8.9533,1.8462,12.5915,-8.9533,7.8697,46.2171,20.2668,953
-17.1081,-9.2708,0.33,6.6855,-9.2708,5.1624,60.0201,14.419,955
-4.5653,-9.8072,0.2219,2.7554,-9.8072,2.3181,8.6988,4.4604,956
-13.6419,-9.2606,5.7309,14.3654,-9.2606,2.7326,22.065,17.4708,957
-1.2828,-10.0961,2.8035,3.6825,-10.0961,4.3937,21.6962,16.8887,958
-11.2781,-8.2668,-0.7753,7.3122,-8.2668,3.2327,26.6859,11.9817,959
-9.4854,-9.1923,-1.1578,4.5278,-9.1923,5.9522,21.5952,14.0286,960
-1.3149,-9.8381,0.0857,0.7686,-9.8381,2.3226,6.7199,4.629,961
-2.3157,-9.5841,-1.132,0.9185,-9.5841,3.8512,11.5559,4.8298,962
-0.8009,-9.8136,0.9303,1.1278,-9.8136,3.6366,10.6609,5.6165,963
-2.0085,-9.7375,0.4261,1.1095,-9.7375,2.2394,10.128,6.4562,964
-1.3464,-9.7916,0.8197,1.0314,-9.7916,1.9812,11.8602,7.9944,965
-0.06,-9.6537,0.2439,0.1957,-9.6537,1.4612,4.9305,2.8548,966
-0.832,-9.7662,-0.2679,0.2966,-9.7662,0.4876,3.4684,2.4501,967
-0.3324,-9.6913,0.9299,1.3583,-9.6913,2.5473,7.2263,4.191,968
-1.0815,-9.8362,1.0285,1.9628,-9.8362,1.7622,13.1161,11.5972,969
-0.9711,-9.6422,0.0418,0.5274,-9.6422,0.4948,5.1678,3.701,970
-1.6954,-9.8562,0.4832,1.3963,-9.8562,2.6863,12.9572,6.1621,971
-1.2772,-9.8913,3.2588,4.0086,-9.8913,2.1995,13.9393,6.7931,972
-0.9379,-9.7696,1.0568,2.3413,-9.7696,4.1908,15.2468,11.4778,973
-1.2252,-9.7802,0.1146,0.8197,-9.7802,2.2505,11.6209,8.4486,974
-0.4233,-9.8956,0.284,0.683,-9.8956,1.835,15.7469,15.3046,975
-0.821,-9.7263,-0.1076,0.3765,-9.7263,1.8642,6.814,3.4088,976
-1.9837,-9.6745,20.0143,16.7981,-9.6745,3.0195,28.421,20.5346,977
-0.6757,-9.5412,8.5591,7.6391,-9.5412,1.4939,40.3587,34.8675,978
-0.7409,-9.7326,0.4515,1.1569,-9.7326,1.4913,11.6774,11.1177,979
-0.8259,-9.7446,0.181,0.5019,-9.7446,1.3981,12.0213,9.1696,980
-2.2568,-9.8547,2.6035,3.3535,-9.8547,2.4516,13.5012,12.2727,981
-0.6457,-9.6041,15.3711,10.021,-9.6041,6.1449,46.4891,32.0036,982
-9.3428,-9.7581,6.3946,14.216,-9.7581,1.812,35.4557,26.6793,983
-3.9348,-9.8072,4.7973,9.5068,-9.8072,9.4381,35.076,25.23,984
-0.4791,-9.8642,-0.0684,0.3512,-9.8642,1.3304,12.4957,3.796,985
-2.5597,-10.0398,1.5905,3.8738,-10.0398,4.206,18.3,13.9847,986
-2.3556,-9.6498,-0.4422,0.9038,-9.6498,2.5064,10.9227,9.542,987
-1.3338,-8.9055,-0.2036,0.5416,-8.9055,1.3915,10.1544,9.0165,988
-1.7814,-9.4963,0.365,1.1522,-9.4963,1.7543,6.4049,2.4367,989
-0.756,-9.6165,0.153,0.6145,-9.6165,1.0886,9.8592,5.0497,990
-0.1976,-9.9163,-0.0265,0.0934,-9.9163,0.3665,5.2213,2.0327,991
-0.6026,-10.0124,0.4393,0.6016,-10.0124,1.992,10.1456,6.765,993
-4.6012,-9.5462,0.3439,2.1865,-9.5462,3.4054,18.7767,9.7726,994
-3.2129,-9.2206,0.1498,1.8056,-9.2206,2.4702,14.2579,7.6219,995
-1.8483,-9.4187,0.76,2.0553,-9.4187,2.6139,15.0826,6.7112,996
-3.5463,-9.7307,0.2505,2.7415,-9.7307,2.0205,17.7019,13.7717,997
-0.0868,-9.6961,0.7504,0.6421,-9.6961,1.5137,16.2827,13.8914,998
-3.7443,-9.752,-0.6231,1.3789,-9.752,1.5078,10.4674,7.8269,999
0.3869,-9.7703,0.6417,0.1314,-9.7703,0.2329,2.2596,1.4921,1000
-5.2585,-9.7206,-2.7241,1.3568,-9.7206,0.5902,4.6015,3.5377,1002
-1.0473,-9.7158,1.1227,1.5586,-9.7158,1.4716,4.2201,0.9807,1003
-0.2069,-9.7206,1.0713,1.493,-9.7206,1.3884,3.889,1.0137,1004
-1.3669,-9.7409,1.2,1.4423,-9.7409,3.7784,9.3038,5.6119,1005
-3.3015,-9.7639,1.0378,2.6496,-9.7639,3.4273,10.317,6.7427,1006
-9.6113,-9.7311,-0.2864,4.001,-9.7311,4.4324,8.5344,4.0573,1008
-0.3691,-9.7182,0.5867,0.5524,-9.7182,0.7134,2.0355,1.3806,1009
0.1574,-9.7458,1.8741,1.0678,-9.7458,1.6451,5.9451,4.5506,1010
-3.6103,-9.5477,1.4828,2.1828,-9.5477,3.7582,26.0451,17.7655,1011
-6.4047,-9.8155,0.0766,2.7879,-9.8155,5.3152,38.522,16.0445,1013
-1.3999,-9.7878,0.5248,1.326,-9.7878,2.5366,16.5602,13.8653,1014
-8.5071,-9.6293,3.3289,9.641,-9.6293,9.6299,35.8058,13.6661,1015
-9.2546,-9.8694,-1.2374,7.1015,-9.8694,8.1898,39.2931,28.3187,1016
-7.2906,-9.3645,-0.7147,4.1719,-9.3645,1.9706,11.6949,7.6538,1017
-2.5795,-9.7267,-0.6175,1.0848,-9.7267,2.4326,8.4745,6.8421,1018
-0.5008,-9.7409,0.0312,0.2618,-9.7409,1.2149,5.9279,3.936,1019
-0.2362,-9.7822,0.791,0.9898,-9.7822,2.3388,14.1272,6.5867,1020
-1.2311,-9.9499,0.1144,0.5983,-9.9499,2.1666,7.4208,4.538,1021
-1.888,-9.6827,-0.2065,0.7132,-9.6827,1.3228,8.851,5.7201,1023
-7.9507,-9.835,0.2711,2.3846,-9.835,4.9162,14.3717,9.0342,1024
-4.1094,-9.7554,0.2614,1.723,-9.7554,3.2357,14.0445,8.4882,1025
-1.3376,-9.6376,-0.1053,0.4926,-9.6376,2.501,10.9425,5.2222,1026
-1.2102,-9.6394,0.3532,0.9168,-9.6394,0.2457,8.2171,7.1303,1027
-0.2771,-9.697,0.0304,0.3334,-9.697,1.3392,5.5855,3.2285,1028
-2.4579,-9.7977,1.3841,2.9935,-9.7977,2.6061,12.3217,9.7542,1029
-5.0035,-9.9988,-0.1595,2.1309,-9.9988,3.0506,22.0678,6.8243,1030
0.5478,-10.0163,3.7576,3.5502,-10.0163,4.5562,17.298,14.893,1031
-3.8366,-9.8753,-0.3322,2.6534,-9.8753,1.0352,15.6253,13.1036,1033
-1.9332,-9.7915,0.2172,1.2708,-9.7915,3.6043,11.0467,6.2993,1034
-1.1503,-9.7197,0.6492,1.2521,-9.7197,3.6593,9.6158,7.1144,1035
-1.8497,-9.7654,0.5048,1.2783,-9.7654,1.0762,7.2508,6.3359,1036
-6.682,-9.859,2.8008,8.0551,-9.859,3.0457,17.4868,12.9623,1037
-1.3184,-9.7814,1.425,2.3945,-9.7814,3.9932,13.9536,12.3668,1038
-1.366,-9.6255,-0.1278,0.8689,-9.6255,3.0189,8.6681,7.7168,1039
-0.3994,-9.7941,0.1561,0.3881,-9.7941,1.3056,8.124,3.0282,1040
-2.3624,-9.7645,0.1627,1.4297,-9.7645,0.3122,6.4515,5.5427,1041
-1.2816,-9.7082,0.6587,1.2185,-9.7082,2.7279,12.1353,5.863,1043
-2.8977,-9.7651,-0.0277,0.9538,-9.7651,3.5047,10.7118,4.0394,1044
-0.2202,-10.0121,0.44,0.6079,-10.0121,1.3812,4.936,2.2005,1045
-0.9859,-9.5382,0.0968,1.3504,-9.5382,3.1127,8.162,6.4725,1046
-0.8063,-9.8568,-0.27,0.3519,-9.8568,1.2738,7.1247,5.2878,1047
-0.1292,-9.5647,1.894,2.2097,-9.5647,1.8601,8.0783,6.5469,1048
-0.6432,-9.7922,-0.0241,0.3048,-9.7922,0.7931,7.6399,3.4928,1049
-1.1192,-9.7317,0.2517,0.5775,-9.7317,0.7365,4.3882,3.298,1050
-0.7427,-9.7896,-0.1339,0.3157,-9.7896,1.7596,5.3275,3.7022,1051
-2.754,-9.8116,0.15,1.0093,-9.8116,2.9613,15.3543,5.6514,1053
-1.572,-9.9543,2.8085,2.9322,-9.9543,3.268,14.5757,13.6907,1054
-1.7344,-9.8728,-0.8161,0.6733,-9.8728,2.4022,10.173,8.2256,1055
-2.2547,-9.7871,-0.0727,1.1785,-9.7871,2.9438,17.7881,7.4467,1056
-1.3593,-9.5512,-0.0331,0.918,-9.5512,1.8537,14.052,11.6588,1057
-4.1517,-9.7942,0.7708,2.1371,-9.7942,0.9088,10.7858,8.7054,1058
-4.6223,-9.6402,-0.5068,1.7929,-9.6402,2.2052,7.7659,5.2447,1059
-0.102,-9.7197,0.2799,0.301,-9.7197,1.3896,6.042,4.4119,1060
-0.8749,-10.0293,1.9828,1.7082,-10.0293,0.9062,9.4238,8.0405,1061
-2.9996,-9.7938,1.2084,2.3923,-9.7938,6.3367,13.4714,7.9595,1063
-0.4096,-9.9031,0.0622,0.2868,-9.9031,0.3443,6.1179,5.4918,1064
-0.4988,-9.9999,0.1209,0.5338,-9.9999,0.4598,12.2204,9.963,1065
-0.8292,-9.8536,3.3285,2.7543,-9.8536,1.5622,14.2455,12.4003,1066
-4.3247,-9.7866,2.8324,4.6139,-9.7866,3.2998,14.2529,12.9509,1067
-0.3836,-9.7455,0.7886,1.9823,-9.7455,3.0638,29.5281,20.8824,1068
-4.5241,-9.9681,-0.3599,2.1218,-9.9681,2.1855,15.784,10.1801,1069
-4.3091,-8.8213,0.9468,5.2106,-8.8213,5.3516,38.1983,20.1617,1070
-5.2754,-9.5176,-0.5319,2.7066,-9.5176,2.5177,20.2657,16.8105,1071
-4.1093,-9.6919,0.0155,3.0998,-9.6919,1.6457,15.5369,8.4707,1073
-8.3808,-9.2918,0.4425,4.0596,-9.2918,5.1421,45.7813,13.0887,1074
-30.6604,-9.5705,-2.2557,7.0154,-9.5705,4.0303,18.0973,8.3679,1075
-2.5158,-9.7886,0.2077,1.5015,-9.7886,2.1664,14.2268,11.1976,1076
-2.1557,-9.6763,-0.6919,0.7067,-9.6763,2.2482,5.8311,4.0654,1077
-0.3037,-9.8663,2.06,2.2398,-9.8663,1.1927,11.8412,10.5392,1078
-0.7698,-10.1577,-0.1663,0.3238,-10.1577,1.4673,4.8493,3.3811,1079
-2.3163,-9.7913,0.7875,1.9008,-9.7913,5.5447,13.2751,8.279,1080
-0.9639,-9.7237,-0.0327,0.6562,-9.7237,1.4966,8.0216,6.3871,1081
-3.2954,-9.7022,-0.9515,1.7318,-9.7022,1.6554,11.3592,9.973,1083
-5.1135,-9.8613,0.4939,4.2652,-9.8613,4.1895,18.7998,7.5161,1084
-11.5393,-9.7193,0.471,3.5896,-9.7193,6.7079,15.7704,10.2308,1085
-2.3559,-9.7909,-0.8502,1.3711,-9.7909,1.3619,9.0971,8.3198,1086
0.2862,-9.3261,2.2812,1.7215,-9.3261,2.7666,14.6667,7.6091,1087
-0.883,-9.6504,-0.0113,0.4995,-9.6504,1.4483,5.9216,4.7768,1088
-1.1478,-9.6059,0.1842,1.2859,-9.6059,0.5987,12.2829,9.5538,1089
-0.4634,-8.7494,-0.0599,0.1879,-8.7494,0.3943,21.0868,12.6231,1090
-1.7621,-9.9502,4.2667,5.4891,-9.9502,3.5115,30.2971,21.7978,1091
-14.5997,-9.6908,4.1765,7.1725,-9.6908,13.2478,36.6663,16.7476,1093
-4.7429,-9.74,-0.1948,1.578,-9.74,5.1829,18.3277,8.2447,1094
-2.3364,-9.8276,2.0151,2.7051,-9.8276,6.6053,20.6315,14.0233,1095
-4.8718,-9.9919,0.5072,2.9421,-9.9919,6.1044,15.374,13.4909,1096
-3.4733,-9.7699,-0.8289,1.749,-9.7699,1.7498,9.6317,6.4739,1097
-1.2639,-9.4323,0.9649,1.9258,-9.4323,6.0682,11.9188,8.1548,1098
-1.631,-9.7898,0.6843,2.0479,-9.7898,3.1469,13.1093,8.7638,1099
-6.2387,-9.6797,-0.6163,2.3717,-9.6797,4.8506,11.0535,6.6874,1100
-1.7265,-9.8341,0.4178,1.0041,-9.8341,3.1548,6.0532,4.5415,1101
-0.3488,-9.8327,0.3293,0.5049,-9.8327,1.9041,7.3842,3.5515,1103
-1.1436,-9.733,0.8932,1.5846,-9.733,5.0384,14.2703,6.6528,1104
-0.6872,-9.806,0.806,1.5112,-9.806,2.5054,13.6348,12.2807,1105
-0.5165,-9.7785,-0.074,0.1796,-9.7785,0.7918,4.2582,2.5108,1106
-0.4888,-9.5638,0.1104,0.4723,-9.5638,0.2771,6.8187,4.9499,1107
-0.3087,-9.6951,0.024,0.2361,-9.6951,0.4395,2.836,1.3667,1108
-0.9537,-9.884,-0.1288,0.7933,-9.884,0.7687,6.706,5.3831,1109
-1.5435,-9.834,0.9431,2.379,-9.834,1.9948,9.7062,7.3021,1110
-2.1612,-9.673,0.9211,1.6418,-9.673,2.4602,15.0307,7.4409,1111
-17.2923,-9.0353,13.5131,22.625,-9.0353,11.326,44.4855,18.9885,1114
-17.3401,-9.5419,1.5005,12.5811,-9.5419,7.0433,26.8029,16.3295,1115
-35.031,-9.7151,-1.0441,10.6596,-9.7151,4.5045,24.2663,9.7627,1116
-5.5717,-9.6218,-0.2096,4.2426,-9.6218,0.247,12.4318,9.8982,1117
-1.583,-10.1602,1.3054,2.0147,-10.1602,2.5987,12.1599,5.8443,1118
-1.0664,-9.4721,0.9082,1.8009,-9.4721,1.2129,13.6893,9.253,1119
-0.8849,-9.7538,-0.0585,0.58,-9.7538,0.8785,9.3944,5.4831,1120
-1.7092,-9.5454,-0.0042,0.6307,-9.5454,1.6212,11.9572,5.4256,1121
-3.7489,-9.3332,-0.6553,2.5177,-9.3332,1.453,19.4148,15.8548,1122
1.2359,-9.7035,5.3282,3.8138,-9.7035,2.2753,17.1018,13.3458,1123
-18.7273,-9.7435,9.0883,22.3418,-9.7435,16.3523,62.998,44.8824,1124
-0.9771,-9.5753,1.6612,1.9136,-9.5753,4.7607,15.8894,10.0908,1125
-1.8049,-10.3055,-0.2018,0.765,-10.3055,1.405,21.4581,5.5026,1126
-4.751,-9.8693,-0.6611,3.5511,-9.8693,3.6542,25.6065,20.3968,1127
-1.266,-9.2688,2.1881,2.3485,-9.2688,1.7178,12.3542,9.7032,1128
-4.5003,-9.6924,0.8694,2.2881,-9.6924,4.4113,18.8593,7.6517,1129
-4.0538,-9.6003,11.6332,15.8653,-9.6003,8.2818,37.7811,20.5865,1130
-8.2487,-9.5042,-0.0264,4.3461,-9.5042,7.5716,16.3807,9.5713,1131
-4.3762,-8.3005,1.3544,5.7215,-8.3005,3.5672,24.4534,13.1628,1132
-3.6415,-9.6703,0.1244,2.0973,-9.6703,2.8945,16.9817,6.5207,1133
-0.9388,-9.7926,0.4,0.9844,-9.7926,3.1781,8.1747,4.2589,1134
-0.4852,-9.7839,0.0745,0.344,-9.7839,1.6691,6.3282,3.0329,1135
-1.0497,-9.722,0.1658,0.4975,-9.722,2.3638,16.8387,3.6261,1136
-4.4204,-10.0277,0.5043,2.2145,-10.0277,1.7134,13.014,7.2719,1137
-5.853,-9.2626,2.605,8.3518,-9.2626,7.2775,28.6485,24.7524,1138
-4.9135,-10.9045,6.4935,10.5136,-10.9045,6.8476,22.3008,16.5629,1139
-19.9932,-9.4298,-4.1058,9.8742,-9.4298,2.0745,21.0469,14.9186,1140
-6.5338,-9.876,2.603,3.9907,-9.876,6.2749,23.7089,11.7172,1141
-0.7853,-10.1422,1.2384,2.5361,-10.1422,2.7028,11.6862,8.8853,1143
-3.1254,-9.1645,0.7859,2.1689,-9.1645,5.1923,10.8324,8.0035,1144
-2.344,-9.3728,1.2239,2.8448,-9.3728,3.2107,12.6365,6.9894,1145
-5.8625,-9.9717,0.2574,4.6566,-9.9717,3.156,14.9912,10.4757,1146
-10.3821,-9.426,1.973,7.2444,-9.426,3.9937,20.6068,12.0824,1147
-5.6233,-9.6099,-2.2317,1.8595,-9.6099,1.6741,10.0239,8.2947,1148
-1.097,-9.0242,3.079,3.3472,-9.0242,6.0881,9.7117,8.0283,1149
-7.0797,-9.6796,1.9438,5.3574,-9.6796,6.6475,13.0108,9.36,1150
-6.2593,-9.7421,0.7156,2.9641,-9.7421,4.4813,11.1203,7.8638,1151
-0.7303,-9.7031,1.869,3.3031,-9.7031,4.363,12.4895,9.4204,1153
-3.983,-9.9858,-0.9985,1.8579,-9.9858,1.611,6.9668,4.0696,1154
-0.5293,-9.5761,0.3771,0.9982,-9.5761,1.8531,8.9354,3.7651,1155
-0.1226,-9.7572,0.704,0.7556,-9.7572,2.6076,9.6771,7.1239,1156
-0.0921,-9.759,0.3346,0.4446,-9.759,1.785,6.7597,5.8069,1157
-4.4747,-9.656,-1.2382,1.9144,-9.656,2.2143,13.5095,7.5205,1158
-1.4389,-9.6295,0.0693,0.5812,-9.6295,1.4539,8.5373,3.7995,1159
-0.728,-9.8484,0.2909,0.6282,-9.8484,0.5054,6.3726,2.9742,1160
-0.5477,-9.7548,0.518,0.6781,-9.7548,1.3995,7.5563,5.3648,1161
-0.0752,-9.8084,-0.0074,0.05,-9.8084,0.2886,5.4305,4.3855,1163
-2.631,-9.882,-0.0794,1.3067,-9.882,1.3156,8.4119,4.5456,1164
-4.714,-9.5014,1.5492,5.0214,-9.5014,1.0306,11.0959,8.611,1165
0.858,-9.3269,2.839,1.0189,-9.3269,1.5809,28.0989,20.1467,1166
-3.2525,-9.8689,3.4137,4.5305,-9.8689,0.9363,15.7219,11.5854,1167
-4.7171,-9.6969,-0.8514,1.7237,-9.6969,2.6188,21.1312,11.4009,1168
-0.8387,-9.6904,2.8039,2.9133,-9.6904,2.9963,18.0162,15.3634,1169
-2.0495,-9.7738,0.9602,1.9178,-9.7738,4.0236,16.1474,8.601,1170
-18.1693,-10.5981,-2.5513,6.9595,-10.5981,7.5187,25.9551,15.6102,1171
-5.158,-9.9319,4.0412,8.0222,-9.9319,8.4605,21.175,15.4551,1173
-3.1743,-9.8203,0.5817,2.1146,-9.8203,3.516,14.0862,7.1774,1174
-5.9979,-9.5891,1.2163,3.5103,-9.5891,2.5643,18.4247,7.7131,1175
-8.0388,-9.753,5.0186,9.3443,-9.753,2.2441,17.3827,15.6528,1176
-0.0392,-9.3225,7.4681,3.953,-9.3225,3.6298,21.3758,15.4832,1177
-7.6319,-9.8053,3.6484,7.609,-9.8053,2.1719,17.0695,14.2906,1178
-0.1122,-9.6387,0.4736,0.8403,-9.6387,1.1958,4.1758,2.7322,1179
-2.0067,-9.7085,1.5138,2.7002,-9.7085,5.1342,13.2115,8.6677,1180
-7.8421,-9.8321,-0.0302,4.5358,-9.8321,1.725,10.1723,7.7019,1181
-2.7752,-9.7837,0.3941,2.064,-9.7837,3.5564,14.537,5.8204,1183
-1.8409,-9.8215,2.4734,2.5648,-9.8215,5.7954,11.7781,8.4236,1184
-0.4691,-9.7612,5.8184,4.842,-9.7612,6.8714,19.6115,16.5391,1185
-3.5328,-9.4734,0.327,2.113,-9.4734,2.7265,13.4241,8.8499,1186
-0.5852,-9.5648,1.7382,1.7907,-9.5648,2.6341,10.5031,8.1008,1187
-7.2766,-9.9363,-2.3659,2.8638,-9.9363,0.5568,6.3157,5.7048,1188
0.0955,-9.8598,2.8542,2.3832,-9.8598,6.892,10.1507,8.9887,1189
-5.0358,-9.7444,1.8479,3.8158,-9.7444,7.8746,24.4069,11.0006,1190
-0.1037,-9.7687,1.9593,3.4107,-9.7687,6.4349,16.7024,15.8646,1191
-0.5641,-9.8278,2.8861,3.7457,-9.8278,6.9338,18.1423,9.6012,1193
-2.8914,-9.69,0.5254,2.6121,-9.69,3.2951,12.8639,6.2827,1194
-2.0214,-9.8233,-0.1691,1.1364,-9.8233,2.6007,7.6018,5.6817,1195
-0.5933,-9.76,0.563,1.3491,-9.76,2.45,11.617,9.5793,1196
-3.8977,-9.7425,1.0493,3.0083,-9.7425,3.6042,12.5929,7.5069,1197
-2.767,-9.9507,-0.0446,1.7692,-9.9507,2.2709,18.2165,11.314,1198
-0.4271,-9.7254,0.3271,0.5955,-9.7254,0.8108,5.6672,4.0053,1199
-2.921,-9.744,1.4866,2.5877,-9.744,5.3839,25.2147,18.4869,1200
-10.7915,-9.7393,0.4269,3.8107,-9.7393,5.2405,15.2993,5.8776,1201
-21.1241,-9.3767,-0.7716,8.203,-9.3767,5.7262,18.5716,12.8524,1203
-8.1926,-9.6276,0.8272,3.9624,-9.6276,8.0494,21.6164,12.701,1204
-0.3196,-10.0485,0.1302,0.3768,-10.0485,1.1769,7.4025,4.4735,1205
-50.8127,-10.0287,-5.6828,20.2307,-10.0287,6.7676,22.1101,10.7223,1206
-4.0164,-9.7735,3.333,7.0015,-9.7735,0.7206,24.3529,18.6474,1207
5.7136,-9.6508,21.4299,11.1547,-9.6508,3.4813,37.99,24.8408,1208
-2.0011,-9.8152,-0.5463,1.09,-9.8152,4.3273,23.977,16.1537,1209
-3.2589,-9.6806,-0.0397,1.4548,-9.6806,2.1563,17.7778,8.367,1210
-1.2222,-9.4667,0.4738,1.4356,-9.4667,1.6922,9.1567,3.9327,1211
-1.9504,-9.4342,0.5229,1.8593,-9.4342,3.1215,19.4074,9.073,1213
-6.1529,-9.8325,1.9768,6.2658,-9.8325,6.798,20.9034,12.2139,1214
-1.2824,-9.5736,2.038,2.679,-9.5736,1.8859,14.1527,7.0558,1215
-0.0285,-9.567,2.2679,2.4753,-9.567,2.6136,9.0229,7.2285,1216
-1.4972,-9.7706,0.1536,0.8568,-9.7706,1.8285,11.1146,6.5697,1217
0.2864,-9.87,1.8311,1.4376,-9.87,2.7602,12.2476,8.3542,1218
-1.5218,-9.6707,0.9325,2.9304,-9.6707,2.519,15.0344,14.5506,1219
-4.951,-9.7373,0.0787,2.8335,-9.7373,5.1656,17.2647,8.3689,1220
-3.2238,-9.9271,0.4918,2.0865,-9.9271,3.1396,18.9141,9.7789,1221
-1.1207,-9.8399,0.3048,0.7961,-9.8399,2.6463,9.5008,5.7391,1223
-0.0291,-9.8959,0.2581,0.2857,-9.8959,1.3832,5.1611,4.6411,1224
-0.1461,-9.7966,0.0814,0.1273,-9.7966,0.5342,2.4163,1.5635,1225
-2.3741,-9.505,-0.233,1.2049,-9.505,3.2396,10.8883,10.1549,1226
4.8772,-9.8556,11.3669,4.1292,-9.8556,1.1393,25.1728,20.6947,1227
-1.226,-9.7463,-0.0192,0.7071,-9.7463,1.7578,11.2114,6.3932,1228
-0.0883,-9.4666,0.0909,0.1873,-9.4666,0.6547,5.8106,1.5235,1229
-0.847,-9.7663,0.9627,1.3689,-9.7663,4.0748,15.1804,13.0804,1230
-2.7789,-9.7452,-0.5078,1.1926,-9.7452,3.0768,12.2891,6.2948,1231
-3.3891,-9.712,4.2385,5.3847,-9.712,0.9941,16.3595,12.247,1233
-10.0174,-9.7612,1.5372,5.5643,-9.7612,5.9466,24.431,12.7607,1234
-2.8035,-9.9819,-0.5277,1.4875,-9.9819,1.5915,10.0364,9.3444,1235
-1.1142,-9.7342,0.1725,0.8513,-9.7342,2.8895,5.9662,3.6837,1236
-1.3539,-9.6724,-0.6601,0.4116,-9.6724,2.4549,8.2772,5.4836,1237
0.6188,-9.6746,3.0564,2.4655,-9.6746,3.098,15.0087,12.4362,1238
-0.7218,-9.9349,0.5972,1.7012,-9.9349,2.6186,12.2341,9.993,1239
-2.9056,-10.0712,-0.3424,1.2351,-10.0712,2.6876,7.1473,6.1249,1240
-1.1172,-9.7913,0.5493,0.875,-9.7913,3.4382,12.5906,5.1965,1241
-0.9859,-9.7163,0.0803,0.7293,-9.7163,2.8716,7.5897,4.9187,1243
-2.4109,-9.6973,0.6683,2.6269,-9.6973,5.2381,18.0987,9.152,1244
-2.54,-9.8508,-0.478,0.8106,-9.8508,2.0065,9.4735,3.248,1245
-0.9587,-9.4686,2.6309,3.8977,-9.4686,5.9818,13.7765,11.6412,1246
-0.7383,-9.7212,0.6658,1.0436,-9.7212,2.298,7.4363,4.4826,1247
-0.9604,-9.734,2.4554,2.3301,-9.734,1.3663,14.2938,7.857,1248
-0.5957,-9.5655,0.5762,1.3172,-9.5655,3.2948,8.0751,7.0425,1249
-0.4918,-9.981,0.3539,0.6219,-9.981,1.1783,6.2562,5.3425,1250
-1.4264,-9.7003,0.8361,2.2432,-9.7003,4.6104,13.6316,11.0558,1251
-2.5043,-9.7141,2.5614,3.5827,-9.7141,3.4819,21.9711,6.8805,1253
-2.9171,-9.7438,0.1498,1.1497,-9.7438,3.4237,12.9827,5.2642,1254
-2.7045,-9.8039,0.5775,1.2197,-9.8039,3.7148,12.8966,7.0853,1255
-1.4719,-9.8406,1.8685,2.2032,-9.8406,1.5677,9.1802,7.2753,1256
-0.2069,-9.5325,0.4526,0.5288,-9.5325,4.2727,10.7757,7.4177,1257
-1.041,-9.978,-0.3592,0.5222,-9.978,1.4524,5.5496,3.2435,1258
-3.1308,-9.7715,-0.7499,1.2316,-9.7715,1.7355,5.5988,3.9436,1259
-3.3087,-10.1824,1.0234,2.1814,-10.1824,4.5519,8.7932,7.1147,1260
-1.0786,-9.5644,2.5131,2.4732,-9.5644,3.4158,18.5573,10.0937,1261
-14.5975,-9.7637,5.1206,10.0403,-9.7637,9.5164,31.879,12.5446,1263
-4.1342,-9.9806,3.5641,6.6219,-9.9806,7.2172,26.4685,11.8072,1264
-32.0219,-9.6111,-9.3361,14.5129,-9.6111,8.6231,33.8294,26.275,1265
-65.0832,-8.5664,-2.2945,29.0016,-8.5664,10.7458,43.9737,24.2147,1266
-10.9769,-9.8623,-0.0978,6.7525,-9.8623,1.2103,36.0005,28.2665,1267
2.4678,-9.5207,8.8295,4.428,-9.5207,0.8894,26.2713,18.5508,1268
-0.898,-9.7738,0.9257,1.7478,-9.7738,1.8898,11.1126,8.7092,1269
-0.1432,-9.6541,3.2475,3.1957,-9.6541,1.6496,15.7323,10.5812,1270
-6.8129,-9.7965,-1.0711,2.706,-9.7965,7.2226,22.243,16.0845,1271
-2.4862,-9.6689,0.3986,2.6557,-9.6689,5.6671,21.9064,19.6308,1272
-0.8413,-9.9032,0.4348,0.8639,-9.9032,2.5874,13.7406,11.4709,1274
-7.1991,-9.1618,0.2171,3.3225,-9.1618,3.5363,25.6,4.0205,1275
-16.6425,-9.3086,1.6572,10.3407,-9.3086,2.8016,19.6106,13.8474,1276
-1.3342,-9.8837,0.6241,1.3987,-9.8837,4.0904,10.5965,7.7604,1277
-2.3271,-10.2658,0.0948,1.8034,-10.2658,4.584,29.3438,22.775,1278
-1.4258,-9.678,0.6711,2.3123,-9.678,2.3093,15.6235,8.3745,1279
-2.7358,-9.8703,1.9302,3.2243,-9.8703,1.1736,28.4164,20.6697,1280
-0.074,-9.7359,2.1964,2.0387,-9.7359,4.2949,16.0486,9.5329,1281
0.1482,-9.7717,1.112,1.0307,-9.7717,4.1153,10.3575,6.9498,1283
-2.1748,-9.8475,0.3437,1.5909,-9.8475,3.2693,13.0372,8.1957,1284
-0.3993,-9.7231,0.4464,0.5986,-9.7231,1.111,10.2645,7.4762,1285
-0.3157,-9.7884,0.016,0.235,-9.7884,0.8052,8.2585,4.357,1286
-2.1332,-8.4729,0.4356,2.507,-8.4729,1.3614,23.8116,7.093,1287
-2.0947,-9.9311,4.2267,4.8129,-9.9311,4.5841,44.7845,41.7144,1288
-1.9411,-9.7501,0.1251,0.9445,-9.7501,1.7436,19.8496,2.979,1289
-0.1061,-9.7725,-0.0024,0.0522,-9.7725,1.5159,4.2451,0.9759,1290
-2.0855,-9.7594,-0.3078,0.6182,-9.7594,0.6077,2.522,0.8671,1291
-0.6218,-9.7636,-0.293,0.2339,-9.7636,0.5714,1.6529,0.7495,1293
-0.6078,-9.7685,-0.2851,0.2248,-9.7685,0.7792,2.2633,1.2854,1294
0.0216,-9.7647,0.0619,0.0377,-9.7647,0.0764,0.6086,0.5415,1295
-0.5447,-9.7653,-0.4476,0.0717,-9.7653,0.1081,1.3789,1.2825,1296
-0.3595,-9.7623,-0.2019,0.1294,-9.7623,0.3587,1.0917,0.862,1298
-0.5541,-9.7641,-0.5081,0.0324,-9.7641,0.0347,1.3237,1.2754,1299
-0.3237,-9.7625,-0.2224,0.0772,-9.7625,0.1735,0.9279,0.7405,1300
-0.4762,-9.7641,-0.4146,0.036,-9.7641,0.052,1.1069,1.0056,1301
-0.371,-9.7632,-0.2215,0.0714,-9.7632,0.1709,0.9151,0.6859,1302
-0.4482,-9.7604,-0.4071,0.0333,-9.7604,0.0774,0.9994,0.9306,1303
-0.171,-9.7589,-0.1076,0.0347,-9.7589,0.0938,0.7417,0.5596,1304
-0.4262,-9.7614,-0.39,0.048,-9.7614,0.0753,0.9677,0.9381,1305
-0.5637,-9.7571,-0.4354,0.0897,-9.7571,0.1588,1.115,0.849,1306
-0.5702,-9.7597,-0.5336,0.0364,-9.7597,0.0669,1.2447,1.1536,1308
-0.7466,-9.7583,-0.3523,0.2789,-9.7583,0.5112,1.3389,0.8374,1309
-0.4984,-9.7569,-0.4793,0.0167,-9.7569,0.026,0.9787,0.9398,1310
-0.4775,-9.7572,-0.4319,0.0575,-9.7572,0.0898,0.9446,0.9012,1311
-0.4294,-9.7567,-0.3565,0.0364,-9.7567,0.0551,0.8497,0.7562,1312
-0.7372,-9.7552,-0.7063,0.0336,-9.7552,0.0261,1.2493,1.234,1313
-0.7307,-9.7565,-0.2027,0.2722,-9.7565,0.4722,1.4522,0.6485,1315
-0.919,-9.7555,-0.7589,0.0904,-9.7555,0.1388,1.614,1.3572,1316
-0.8024,-9.7491,-0.6848,0.1206,-9.7491,0.2096,1.304,1.1139,1318
-0.858,-9.7552,-0.3637,0.2173,-9.7552,0.3214,1.2189,0.7531,1319
-0.6616,-9.7547,-0.5431,0.0839,-9.7547,0.1297,1.2068,1.015,1320
-0.4525,-9.7518,-0.3739,0.0452,-9.7518,0.053,0.779,0.7236,1321
-0.757,-9.7544,-0.5993,0.0858,-9.7544,0.105,1.229,1.0202,1322
-0.3632,-9.7541,-0.3281,0.0239,-9.7541,0.0364,0.7248,0.6894,1323
-0.5755,-9.7499,-0.4846,0.0845,-9.7499,0.1286,0.9951,0.8905,1324
-0.5132,-9.7529,-0.4583,0.0277,-9.7529,0.0407,0.9084,0.8325,1325
-0.6797,-9.7517,-0.59,0.0488,-9.7517,0.0585,1.0704,0.976,1326
-0.4253,-9.7502,-0.374,0.0248,-9.7502,0.0421,0.7866,0.7113,1327
-0.7243,-9.7498,-0.565,0.0925,-9.7498,0.1188,1.1505,0.8986,1329
-6.4891,-9.7449,-0.7314,1.5601,-9.7449,1.8092,8.6891,0.9553,1330
-13.9457,-9.8004,-0.7827,5.4689,-9.8004,1.3231,34.0699,17.5559,1331
-11.2095,-10.0566,1.0851,7.3707,-10.0566,2.796,22.705,15.9523,1332
1.7896,-9.9592,7.1719,4.9213,-9.9592,2.1304,23.7555,15.2467,1333
-10.0723,-10.1314,14.8926,15.4553,-10.1314,3.0863,33.5978,25.6746,1334
-4.8388,-9.7251,1.0807,3.2105,-9.7251,7.1729,43.4624,23.386,1335
-0.1106,-10.0539,0.6489,0.7244,-10.0539,1.9159,36.2178,35.8679,1336
-1.1999,-9.7253,2.4249,2.928,-9.7253,3.1902,29.7874,24.7392,1338
-5.6063,-9.7377,0.7794,2.3314,-9.7377,5.8914,31.3533,10.9658,1339
-0.2543,-9.8702,2.0538,2.1261,-9.8702,2.1579,10.0578,6.6603,1340
-1.1072,-9.6578,0.4612,1.1573,-9.6578,2.7722,8.7535,5.6064,1341
-0.2786,-9.8664,0.5764,0.7409,-9.8664,1.8356,7.1419,5.5594,1343
-1.6012,-9.7579,1.4076,2.0181,-9.7579,4.826,15.8763,8.6529,1344
-2.2129,-9.7776,1.3883,2.4507,-9.7776,5.4506,13.609,9.1486,1345
-1.2478,-9.8711,-0.0507,0.9366,-9.8711,3.1436,26.4,23.4097,1346
-0.8096,-9.776,0.5,0.856,-9.776,1.7059,11.8112,6.8975,1348
-6.1724,-9.7738,-1.0597,2.2497,-9.7738,2.8231,10.5094,5.1379,1349
-7.4155,-9.7217,-4.7783,2.1186,-9.7217,0.7243,6.9676,6.0985,1350
-0.0122,-9.7463,0.265,0.2568,-9.7463,0.356,1.2662,0.5069,1351
-0.7192,-9.7513,-0.5571,0.1767,-9.7513,0.2525,1.1047,0.9352,1352
-2.8394,-9.7706,-0.0675,1.1887,-9.7706,2.5478,26.634,11.5166,1353
-18.6362,-9.7924,5.1329,14.5634,-9.7924,1.2079,39.6843,32.3936,1354
-11.4653,-9.7632,0.3871,4.8659,-9.7632,3.705,13.7432,8.7919,1356
-21.9534,-9.7581,-2.4985,8.5452,-9.7581,6.7719,24.3057,14.8794,1357
-23.6098,-9.6254,-7.4073,9.3959,-9.6254,4.8182,15.2384,8.3867,1358
-26.6723,-9.5504,-5.8077,11.3103,-9.5504,5.0046,10.991,5.2918,1359
-11.8253,-9.5877,2.695,9.9766,-9.5877,5.3091,13.1894,7.5541,1360
-28.4268,-9.712,-1.0694,13.0745,-9.712,6.9837,29.2045,14.7217,1361
-4.0621,-9.7558,1.7751,3.0023,-9.7558,4.727,31.0765,22.4758,1363
-9.7923,-9.7466,4.4625,11.593,-9.7466,9.7928,65.0445,7.6339,1364
-0.4619,-9.742,-0.0211,0.2532,-9.742,0.9054,2.3087,1.7212,1365
-0.3005,-9.861,0.698,0.7852,-9.861,3.2614,18.5974,9.2735,1366
-14.1126,-10.4303,0.4443,8.0389,-10.4303,2.5605,22.1757,18.0134,1367
-1.3309,-9.8237,0.5031,1.6729,-9.8237,3.1287,34.4557,31.7619,1368
-2.1864,-9.7848,-0.1712,1.0922,-9.7848,1.1885,39.9658,33.5203,1369
-2.9234,-9.756,0.3426,1.7277,-9.756,3.2048,51.5691,42.2175,1370
-1.3986,-9.7319,1.7446,2.6811,-9.7319,4.3589,32.7488,23.3492,1372
-6.0372,-9.7396,3.1677,6.7773,-9.7396,8.4183,33.0393,6.8151,1373
-6.6745,-9.8109,1.4521,4.3721,-9.8109,5.9826,50.3255,9.8873,1375
-0.5337,-9.788,-0.1072,0.2508,-9.788,0.3137,6.5481,5.8669,1376
0.0202,-9.7872,6.9735,3.4525,-9.7872,1.8166,23.364,19.6761,1378
-3.6024,-9.7548,1.2038,2.5632,-9.7548,2.5502,55.3265,37.869,1379
-7.9162,-9.6858,1.6296,4.3991,-9.6858,4.5175,49.8693,35.009,1380
-3.807,-8.1961,1.7924,5.9059,-8.1961,2.0312,41.6893,38.1328,1381
-26.4556,-10.0825,-0.892,7.3816,-10.0825,4.3637,63.0643,40.4951,1382
-2.5942,-9.6295,3.7692,3.4722,-9.6295,1.8546,41.7973,34.3759,1383
-1.8834,-9.7935,-0.3468,0.8904,-9.7935,0.9004,7.9879,6.1169,1384
-49.6012,-9.697,-2.1961,15.5804,-9.697,13.1083,29.5725,9.0636,1386
-59.8118,-9.527,-7.4879,17.3445,-9.527,6.8232,20.1954,5.8206,1387
4.7459,-9.6664,5.2777,0.264,-9.6664,0.2974,4.2422,3.6372,1388
-3.6261,-9.6836,-2.5983,1.0042,-9.6836,0.6555,2.6558,2.1161,1389
-1.7367,-9.6776,0.6216,1.2818,-9.6776,1.0891,6.2571,3.2344,1390
-7.3184,-9.63,-3.7232,2.2732,-9.63,1.3833,4.5681,2.5186,1391
-2.4564,-9.6766,-1.8642,0.7392,-9.6766,0.4798,1.7432,1.5253,1393
-17.3536,-9.6955,-1.0139,7.0434,-9.6955,5.7583,20.4179,7.4812,1394
-33.9807,-9.6515,-11.9148,13.338,-9.6515,6.5684,35.6725,7.3934,1395
-43.5362,-9.53,7.6123,25.1461,-9.53,9.8797,43.4577,22.385,1396
-6.9181,-9.7253,3.8388,5.9194,-9.7253,4.3528,9.1685,5.1445,1397
-39.5016,-9.7035,-0.8999,13.7177,-9.7035,6.7214,31.0805,17.8628,1398
-30.2882,-9.6863,-3.9413,17.0701,-9.6863,9.1928,30.481,18.8582,1399
-61.441,-9.7511,-10.0853,18.027,-9.7511,11.4605,23.9718,9.4391,1400
-7.4798,-9.5375,2.7368,7.5037,-9.5375,5.0634,15.6005,5.9792,1401
-31.3962,-9.5987,-18.3739,11.7793,-9.5987,2.1772,15.0641,11.7827,1402
-8.0074,-9.3606,5.9371,15.4948,-9.3606,3.7032,8.0355,2.3637,1404
-102.8667,-9.4736,-15.0508,36.9857,-9.4736,12.972,24.695,13.1099,1405
-6.3266,-9.5954,-1.2831,2.2482,-9.5954,1.0784,2.4784,0.9679,1406
-27.2578,-9.5297,-6.7266,8.4261,-9.5297,7.2347,20.5656,3.8901,1407
7.1799,-9.4744,30.3658,20.4223,-9.4744,4.2176,29.8713,22.6699,1408
-1.5295,-9.7556,-0.8455,0.4351,-9.7556,0.508,2.7397,2.0885,1409
-1.4375,-9.7652,0.1187,1.1014,-9.7652,1.5701,3.7255,0.6341,1410
-6.7629,-9.7832,-0.218,3.1731,-9.7832,4.6033,7.1569,4.1967,1411
-1.0654,-9.7567,0.5843,1.2428,-9.7567,3.0723,7.6831,1.6013,1412
-23.8366,-9.6317,-5.2512,11.3867,-9.6317,8.3377,29.4006,11.0237,1413
-1.0422,-9.6789,-0.387,0.5216,-9.6789,0.4091,1.3947,1.0202,1414
-80.8795,-9.1721,-47.0034,27.6236,-9.1721,9.7162,27.6574,20.3077,1415
-68.1363,-9.6237,2.4772,18.3455,-9.6237,8.506,45.0011,14.2466,1417
-15.3312,-9.6209,-9.0877,4.5864,-9.6209,1.744,19.9248,16.3099,1418
-5.4684,-9.7867,-1.1857,2.0333,-9.7867,1.0629,16.551,12.6981,1419
10.9291,-9.5397,17.6612,4.8922,-9.5397,2.0326,19.0162,15.4056,1420
-48.5885,-9.5452,-24.3685,11.9673,-9.5452,4.8362,41.6574,32.6061,1421
2.1272,-9.604,7.1532,3.6604,-9.604,2.4004,12.3524,9.2432,1422
-5.8883,-9.6868,-0.9349,2.6216,-9.6868,2.892,10.2656,6.5354,1423
-16.5095,-9.7362,-2.3018,5.6201,-9.7362,5.4766,15.6885,12.7409,1424
-25.4387,-9.8292,-12.6875,7.4073,-9.8292,2.6706,13.623,9.3636,1425
-1.1523,-9.634,4.3538,3.5251,-9.634,2.2681,38.262,25.2575,1426
3.1408,-9.7534,3.9592,0.7925,-9.7534,0.8709,22.3462,21.167,1427
-5.3356,-9.67,-4.4635,0.7394,-9.67,0.4614,8.629,6.5189,1428
-7.1844,-9.7777,-3.2636,2.8792,-9.7777,2.1854,6.4701,4.3615,1429
-6.3958,-9.8159,-2.8509,2.5966,-9.8159,1.9474,5.0451,3.2897,1430
-1.7788,-9.7397,-0.1724,1.2347,-9.7397,1.908,3.8672,1.7859,1431
-238.4024,-9.5131,-24.5603,98.3288,-9.5131,18.7926,39.5578,34.3361,1432
-17.6891,-9.7649,-0.2646,5.3308,-9.7649,4.7714,15.0705,5.5385,1434
-0.6281,-9.7655,0.1508,0.4027,-9.7655,0.9425,4.7006,0.9914,1435
0.0711,-9.7695,0.0973,0.0174,-9.7695,0.0903,1.1222,0.8083,1436
0.0928,-9.769,0.0992,0.0064,-9.769,0.0384,0.8901,0.8032,1437
-5.1781,-9.7719,0.228,3.3602,-9.7719,3.1755,9.8869,6.4328,1438
0.0062,-9.7738,0.0505,0.0342,-9.7738,0.2921,1.5492,0.9566,1439
0.051,-9.7678,0.0628,0.0084,-9.7678,0.0689,0.9242,0.8373,1440
0.0577,-9.7691,0.0642,0.0033,-9.7691,0.0269,0.8506,0.8089,1441
0.061,-9.7674,0.0647,0.002,-9.7674,0.0123,0.8307,0.8182,1442
0.0636,-9.7684,0.065,0.0009,-9.7684,0.0122,0.8303,0.8168,1443
0.0615,-9.7694,0.0645,0.0018,-9.7694,0.0156,0.8279,0.8101,1444
-0.0063,-9.7661,0.0664,0.0665,-9.7661,0.3342,1.1583,0.967,1445
-1.0077,-9.7646,0.2233,0.7259,-9.7646,1.5085,6.3493,2.0847,1446
0.018,-9.7658,0.117,0.0379,-9.7658,0.1705,1.5374,0.7795,1447
0.0537,-9.7951,0.2764,0.4105,-9.7951,1.0489,4.9767,0.8446,1448
-0.3538,-9.7715,0.1732,0.4326,-9.7715,1.5941,6.3202,1.4591,1449
0.0517,-9.7674,0.128,0.068,-9.7674,0.2348,1.7851,0.8247,1450
0.1104,-9.7681,0.1154,0.004,-9.7681,0.0183,0.8746,0.8109,1451
0.1123,-9.7683,0.1155,0.0027,-9.7683,0.0104,0.8242,0.8115,1452
0.1137,-9.7667,0.1164,0.0025,-9.7667,0.0135,0.8391,0.8154,1453
0.1099,-9.7666,0.1144,0.0023,-9.7666,0.0132,0.8279,0.8105,1454
0.1113,-9.7667,0.1146,0.0019,-9.7667,0.0094,0.8268,0.8095,1455
0.1115,-9.7671,0.1156,0.0018,-9.7671,0.0111,0.8307,0.818,1456
0.1131,-9.7674,0.1149,0.0018,-9.7674,0.0096,0.8254,0.8114,1457
0.1091,-9.7682,0.1136,0.0039,-9.7682,0.0127,0.8279,0.8087,1458
0.1101,-9.7667,0.1147,0.0024,-9.7667,0.0117,0.8279,0.8114,1459
0.1108,-9.7671,0.1159,0.0023,-9.7671,0.0092,0.8268,0.813,1460
0.1115,-9.7676,0.1155,0.0021,-9.7676,0.0097,0.823,0.8058,1461
0.1141,-9.7654,0.1165,0.0021,-9.7654,0.0055,0.8231,0.815,1462
0.1112,-9.7667,0.1164,0.0024,-9.7667,0.0106,0.8316,0.81,1463
0.1099,-9.7668,0.1158,0.0021,-9.7668,0.0115,0.8478,0.8105,1464
