AYGX_min,AZ_mean,AYGX_mean,AYGX_std,AZ_mean.1,GX_std,Gnorm_max,Gnorm_median,timestamp
-165.774,-9.3989,-6.0244,32.723,-9.3989,7.128,32.6577,10.8747,384
-59.8671,-10.0151,-14.2735,46.0206,-10.0151,5.1799,41.4391,27.7665,385
-2304.6919,1.2979,-284.868,653.1644,1.2979,82.3252,213.1115,121.1094,386
-52.6479,-1.79,28.2908,104.7436,-1.79,8.6387,57.1977,5.4787,388
-57.2554,-1.5196,-10.6138,18.6992,-1.5196,1.9827,6.8228,1.9379,389
