AYGX_min,AZ_mean,AYGX_mean,AYGX_std,AZ_mean,GX_std,Gnorm_max,Gnorm_median,timestamp
-0.0301,-9.734,0.031,0.0331,-9.734,0.3735,2.0395,1.7821,0
-0.006,-9.7339,0.0471,0.0577,-9.7339,0.3785,2.6037,1.7807,1
0.0216,-9.7343,0.0358,0.0063,-9.7343,0.0816,1.8572,1.7832,2
0.032,-9.734,0.0365,0.0024,-9.734,0.0202,1.807,1.7791,3
0.0357,-9.7336,0.0379,0.0017,-9.7336,0.0151,1.8091,1.7853,4
0.0315,-9.7335,0.0376,0.0019,-9.7335,0.0249,1.8236,1.7838,5
0.0365,-9.7337,0.0386,0.0013,-9.7337,0.0132,1.8023,1.7871,6
0.0091,-9.7342,0.0372,0.0081,-9.7342,0.1142,1.8288,1.7762,7
-0.0131,-9.7335,0.0482,0.043,-9.7335,0.3466,2.1702,1.8598,8
0.0035,-9.7338,0.0338,0.0151,-9.7338,0.1149,1.9737,1.8033,9
-0.1441,-9.7284,0.0294,0.0576,-9.7284,0.583,2.5835,1.8902,10
-0.7262,-9.7404,0.1227,0.6932,-9.7404,0.96,6.0635,1.7589,11
-0.6954,-9.7249,0.0153,0.381,-9.7249,1.4183,5.9727,2.8668,12
-0.1504,-9.7352,0.0417,0.137,-9.7352,0.7926,2.9931,1.7946,13
0.032,-9.7291,0.0538,0.0165,-9.7291,0.09,1.886,1.8214,14
-0.035,-9.7299,0.0416,0.0578,-9.7299,0.4367,2.2815,1.468,15
-0.0319,-9.7348,0.0296,0.0357,-9.7348,0.4808,2.2365,1.8144,17
-0.1223,-9.7355,0.0478,0.0834,-9.7355,0.3115,3.8,1.8104,18
-17.4224,-9.7303,0.1774,6.4704,-9.7303,6.7462,19.1843,1.9395,19
-43.7446,-9.6428,-8.6684,12.6584,-9.6428,4.6356,17.5016,2.895,20
-0.2917,-9.7141,1.6434,1.6302,-9.7141,2.4135,6.4202,2.9534,22
-20.7412,-9.6317,1.9982,8.3456,-9.6317,5.1916,11.2612,3.3341,23
-2.9801,-9.6416,0.0891,1.4372,-9.6416,1.0047,2.6573,1.9022,24
-0.626,-9.6358,0.5005,0.5027,-9.6358,0.3461,1.8758,1.7738,25
-0.4152,-9.6294,0.4331,0.6474,-9.6294,0.4256,1.9701,1.7544,26
0.3873,-9.6276,0.6638,0.1469,-9.6276,0.1001,1.8237,1.7463,27
0.3031,-9.6306,1.1033,0.4789,-9.6306,0.3239,2.1001,1.8315,29
-0.5197,-9.63,0.7604,0.7077,-9.63,0.4765,2.2489,1.7924,30
-0.149,-9.6324,0.6682,0.5533,-9.6324,0.3801,1.9798,1.7811,31
-0.7253,-9.6409,0.5295,0.727,-9.6409,0.5126,2.0177,1.8126,33
-0.1572,-9.6322,1.2367,0.9165,-9.6322,0.6584,2.722,1.8688,34
-0.7413,-9.6391,1.1075,1.1388,-9.6391,0.791,2.4822,1.9056,35
0.1878,-9.6363,0.7786,0.462,-9.6363,0.3171,1.9716,1.7851,37
-0.8009,-9.6388,0.7495,0.7703,-9.6388,0.5332,2.2293,1.77,38
-0.4527,-9.6365,0.7336,0.9026,-9.6365,0.6323,2.0984,1.7971,39
0.7521,-9.6399,1.0768,0.1735,-9.6399,0.1185,1.9269,1.8608,40
0.1347,-9.6457,0.7695,0.3875,-9.6457,0.2756,1.8819,1.828,41
-0.6626,-9.6377,-0.2484,0.3539,-9.6377,0.2399,1.7868,1.741,42
0.4799,-9.6415,0.9333,0.4101,-9.6415,0.2983,2.0225,1.7943,43
-0.7073,-9.6435,-0.1978,0.4682,-9.6435,0.333,1.8053,1.7378,44
0.2538,-9.6581,1.6535,1.2163,-9.6581,0.9173,3.1077,1.9414,46
-1.6387,-9.6371,-0.4771,1.2808,-9.6371,0.8451,2.0784,1.9604,47
-2.0622,-9.6436,-0.4987,1.3797,-9.6436,0.9757,2.1879,1.9732,48
1.0101,-9.6701,1.4373,0.3135,-9.6701,0.2787,2.2198,2.1053,49
-3.1097,-9.6584,-1.1895,1.9399,-9.6584,1.4126,3.8998,2.3774,50
-6.2293,-9.66,-3.1408,2.6319,-9.66,1.9998,10.8513,7.8884,52
-10.1878,-9.5292,1.8929,5.4691,-9.5292,2.4407,11.8593,5.6714,53
-39.9215,-9.3826,-13.7319,16.7173,-9.3826,4.9385,21.3196,16.742,54
-68.834,-9.4579,-5.1629,18.5093,-9.4579,7.9046,26.3607,2.9744,55
-98.7296,-9.4207,-1.6673,34.6181,-9.4207,9.848,28.6802,22.7203,57
-14.7446,-9.7102,1.1915,6.1161,-9.7102,4.6075,45.1327,9.3711,58
-0.8755,-9.7324,-0.1822,0.3402,-9.7324,2.6912,4.8707,2.7984,59
0.1372,-9.7339,1.0364,0.8498,-9.7339,1.3404,4.7632,3.8754,60
-0.8876,-9.7319,-0.486,0.2633,-9.7319,0.4709,2.5119,2.1504,62
-1.6413,-9.7288,0.9653,1.2454,-9.7288,2.0353,7.0324,3.0393,63
-1.068,-9.7391,0.0053,0.6014,-9.7391,2.5708,6.2684,2.3365,64
-0.204,-9.7366,0.0141,0.1517,-9.7366,0.8053,2.3775,1.8403,65
-2.6851,-9.756,-0.3683,1.7787,-9.756,1.5558,5.7079,3.7506,66
-1.6634,-9.7341,0.0663,0.8027,-9.7341,1.2247,4.364,2.3287,68
-2.6785,-9.7124,-0.2098,1.8551,-9.7124,2.1829,6.3755,3.9534,69
-1.5011,-9.7209,-0.6005,0.4908,-9.7209,1.2862,3.8111,2.5476,70
-0.02,-9.7367,0.0865,0.0861,-9.7367,0.57,2.1222,1.7909,71
-1.3941,-9.7478,-0.1826,0.3416,-9.7478,1.1105,4.4554,2.0931,72
-0.121,-9.7459,-0.0332,0.0475,-9.7459,0.2608,1.7977,1.7211,73
-0.6025,-9.7326,-0.059,0.3538,-9.7326,1.1,2.2657,2.0151,74
-1.2681,-9.7379,-0.1731,0.5376,-9.7379,1.293,3.8751,2.1332,75
-6.5991,-9.7316,-0.299,2.179,-9.7316,3.8062,8.0238,3.7336,76
-0.5246,-9.7443,-0.158,0.2928,-9.7443,0.7692,2.3802,2.0409,77
-2.5054,-9.7354,-1.1945,1.2729,-9.7354,1.8566,6.5501,5.8068,78
0.4703,-9.7329,0.6731,0.1252,-9.7329,0.633,3.8061,3.4034,79
-9.4405,-9.6946,-6.1154,2.3952,-9.6946,0.4948,9.7491,9.1783,80
-1.2137,-9.5884,6.6627,7.0545,-9.5884,3.3758,7.5305,4.2382,81
-3.9424,-9.7362,0.7371,1.9512,-9.7362,3.2452,8.6209,3.9553,82
-1.8475,-9.7368,0.0763,0.6096,-9.7368,1.655,3.6836,2.1346,83
-3.4803,-9.7198,0.8422,2.7835,-9.7198,1.5002,7.4474,5.9612,84
-0.4851,-9.6774,0.8886,0.9098,-9.6774,3.3184,20.8296,9.297,87
-1.753,-9.7512,1.2232,1.9006,-9.7512,3.607,16.8937,10.8631,88
-3.0664,-9.7742,-0.0458,2.3026,-9.7742,1.0618,20.7745,18.4178,89
-0.5241,-9.6692,0.1382,0.4081,-9.6692,1.2008,8.6954,5.4412,90
-1.7289,-9.5899,0.0603,0.5574,-9.5899,1.6704,7.0871,3.9053,92
-0.8983,-9.9858,0.0069,0.488,-9.9858,1.7178,14.6441,7.6573,93
-10.572,-8.9516,2.6036,5.2857,-8.9516,5.8913,54.5496,14.6826,94
-5.6274,-9.6567,0.0692,2.9931,-9.6567,2.5429,10.1884,6.2057,95
-0.4451,-9.6948,0.4196,0.9635,-9.6948,1.5595,13.8051,10.3243,97
-53.6877,-9.7234,14.3036,38.9618,-9.7234,18.3862,101.1792,22.0018,98
-27.8423,-10.0169,9.3986,29.9549,-10.0169,17.2779,38.155,32.5361,99
-269.1567,-8.156,17.8452,160.609,-8.156,35.1685,138.2257,55.09,100
-199.9696,-9.5474,-4.1429,73.2638,-9.5474,27.6421,49.3709,27.7422,102
-19.526,-9.6398,-6.1494,7.6593,-9.6398,4.5982,14.6277,6.8928,103
1.5635,-9.5893,2.4691,0.7661,-9.5893,0.3708,2.8575,2.3286,104
0.2699,-9.6855,2.9352,2.193,-9.6855,2.4848,7.5796,5.0826,105
-32.8345,-9.7072,-2.6466,12.2893,-9.7072,9.3467,17.1538,8.3289,107
-12.1111,-9.7185,0.3788,3.7901,-9.7185,4.2303,12.9296,5.4041,108
-0.5952,-9.7255,0.3946,0.8254,-9.7255,1.1159,3.6213,2.4084,109
-0.5973,-9.7274,-0.1395,0.1884,-9.7274,0.5904,2.349,1.8642,110
0.084,-9.719,0.18,0.0771,-9.719,0.1956,2.0151,1.8524,112
-0.751,-9.7326,-0.0528,0.2678,-9.7326,0.741,2.3278,1.7632,113
-1.1275,-9.7357,-0.257,0.334,-9.7357,0.9417,3.1824,1.9226,114
-2.4001,-9.722,-1.2393,0.5594,-9.722,0.9371,4.1252,3.1336,115
-0.7488,-9.7207,-0.4839,0.2204,-9.7207,0.3699,2.0643,1.8865,117
-1.2197,-9.7128,-0.4653,0.3999,-9.7128,0.5584,2.3275,1.7901,118
-0.6475,-9.712,-0.452,0.2598,-9.712,0.3698,1.9361,1.7951,119
-0.8199,-9.7126,-0.6127,0.1926,-9.7126,0.2755,2.0023,1.898,120
-0.548,-9.7129,-0.4278,0.1089,-9.7129,0.1466,1.8547,1.7972,122
-2.1922,-9.7105,-0.3544,0.9793,-9.7105,0.9568,4.825,1.7988,123
-0.1287,-9.7013,2.6169,3.0585,-9.7013,3.6124,10.1982,7.7905,124
-3.6316,-9.7505,-0.0063,1.4103,-9.7505,3.3051,28.8645,18.1602,125
-0.0884,-9.809,1.3653,1.317,-9.809,2.0286,16.6522,6.6196,126
-2.7009,-9.8149,-1.0261,1.3234,-9.8149,2.1157,23.2912,20.314,128
-4.8254,-9.6989,2.2057,5.9451,-9.6989,6.4745,23.9177,10.3075,129
-3.2543,-9.9457,0.688,2.8503,-9.9457,4.3564,18.9385,17.0822,130
-3.6373,-9.4741,-0.0698,2.2429,-9.4741,1.6363,18.6459,7.0281,131
-1.653,-9.8312,-0.3088,0.9055,-9.8312,1.342,5.932,3.6984,132
-0.8683,-9.4908,-0.2345,0.3223,-9.4908,0.6622,9.5779,6.9956,133
-3.5884,-9.9816,-1.0079,1.3051,-9.9816,2.8896,15.5243,10.3485,134
-1.8836,-9.7085,0.1185,0.846,-9.7085,0.8207,5.0281,3.7697,135
-1.2785,-9.6358,-0.1082,0.5982,-9.6358,1.2419,7.0495,4.9428,137
-5.1736,-9.7572,0.8128,2.1795,-9.7572,3.773,15.8112,6.996,138
-0.5406,-9.7347,-0.0541,0.3356,-9.7347,0.6429,2.172,1.9005,139
-2.343,-9.6889,-0.054,1.6293,-9.6889,4.5695,16.5184,9.3464,140
-3.2544,-9.7942,0.5582,1.9512,-9.7942,1.9525,17.3835,8.6196,142
-3.3455,-9.9717,0.3677,1.864,-9.9717,2.8903,22.8591,6.4692,143
-8.2678,-9.7327,2.0439,6.1206,-9.7327,2.1606,17.2248,14.3605,144
-4.1568,-9.8667,0.863,3.1657,-9.8667,3.0187,17.3247,7.9276,145
-1.1016,-9.6183,-0.1631,0.748,-9.6183,2.0126,10.2431,5.39,147
-3.9479,-9.8169,-0.0566,2.2466,-9.8169,4.5865,15.114,9.0002,148
-1.7099,-9.7214,-0.2991,0.7758,-9.7214,1.7369,13.3665,6.9018,149
-5.3458,-9.773,-0.7308,1.7683,-9.773,2.6848,10.7275,8.3142,150
-4.1244,-9.9675,-2.0087,1.5907,-9.9675,1.8299,14.3402,7.4252,152
-2.9286,-9.6515,-0.0033,2.2324,-9.6515,5.477,14.2077,7.3199,153
-0.3213,-9.7381,0.0,0.1898,-9.7381,1.133,7.3864,3.5894,154
-0.3083,-9.671,0.2742,0.4032,-9.671,2.3001,7.6578,4.3015,155
-0.9885,-9.6884,0.3094,0.8863,-9.6884,0.9392,7.2777,6.0119,157
-1.0395,-9.7283,-0.032,0.2854,-9.7283,0.9605,6.9344,2.9023,158
-0.4692,-9.8049,0.1241,0.3822,-9.8049,0.9679,5.4331,3.604,159
-4.1498,-9.629,-0.4582,1.3465,-9.629,1.3696,14.9106,2.903,160
-2.313,-9.8025,-0.4326,0.8754,-9.8025,1.1627,5.8034,3.3445,162
-1.3482,-9.7995,0.1879,0.6002,-9.7995,2.0522,13.3717,4.2514,163
-0.4562,-9.5933,-0.2878,0.1246,-9.5933,0.9578,6.9021,3.9448,164
-3.4138,-9.7203,1.6264,3.826,-9.7203,3.1507,19.5863,12.8033,165
-8.4176,-9.8714,1.3067,4.4428,-9.8714,7.4109,32.3809,26.3302,166
-6.2274,-9.7765,-0.3128,2.8856,-9.7765,3.8758,22.2172,9.4339,168
-2.7498,-9.5284,1.6716,3.5656,-9.5284,1.5829,17.0837,16.0424,169
-3.0843,-9.4139,-0.5844,1.3747,-9.4139,2.8055,14.1799,9.7714,170
-6.3848,-9.8047,0.38,2.7066,-9.8047,1.8517,10.1531,5.1766,171
-6.3761,-9.8025,-0.5469,3.4895,-9.8025,1.1517,10.5982,9.7246,172
-6.9037,-9.6189,-0.9524,2.8452,-9.6189,6.1855,12.8326,7.0719,173
-4.6345,-9.8318,-1.4122,1.619,-9.8318,3.0147,8.7738,5.0108,174
-9.974,-9.1477,-1.2867,2.9758,-9.1477,5.2875,25.9394,9.6084,175
-1.2466,-10.0041,-0.3711,0.6395,-10.0041,1.2349,6.5704,5.3191,176
-1.2855,-9.7107,0.6373,1.2309,-9.7107,3.7288,12.9794,6.2729,178
-1.381,-9.8324,0.0376,0.6886,-9.8324,1.066,6.203,3.5848,179
-0.3211,-9.0281,0.1324,0.4235,-9.0281,0.6218,15.7956,3.9718,180
-1.3033,-9.7843,0.4896,1.2628,-9.7843,1.8896,11.0674,8.0318,181
-0.5633,-9.6031,2.9275,3.4489,-9.6031,3.1993,14.5331,10.2958,182
-1.5299,-9.6489,1.3962,2.6362,-9.6489,5.1265,16.6453,7.5864,183
-9.1622,-9.8031,0.9965,4.0845,-9.8031,3.4342,16.5061,11.2852,184
-5.3097,-9.8343,-1.3105,2.8183,-9.8343,1.2397,12.497,8.8906,185
-4.4591,-9.8512,0.5872,3.5186,-9.8512,4.699,13.2839,8.6007,186
-14.935,-9.245,-2.2244,5.882,-9.245,5.6451,21.0176,10.1947,187
-6.4022,-9.7819,-0.2527,2.4654,-9.7819,4.0598,12.683,5.998,188
-0.9468,-9.9047,-0.3696,0.4098,-9.9047,0.9702,6.2639,5.0368,189
-12.7438,-9.8212,1.2895,6.0652,-9.8212,7.0043,18.9564,12.829,190
-1.7069,-9.8411,0.4264,1.9103,-9.8411,2.9637,14.9077,11.7997,192
-19.4931,-9.7181,0.9076,7.2677,-9.7181,8.1649,29.7467,9.6056,193
-2.4336,-9.4282,0.6781,2.4476,-9.4282,1.9306,14.4194,12.1298,194
-10.0649,-9.0345,-1.6198,2.931,-9.0345,5.4278,15.611,7.8956,195
-5.1682,-9.9441,-0.9006,2.1148,-9.9441,3.454,11.7096,6.6696,197
-10.6396,-9.876,-0.1902,2.7195,-9.876,4.5989,14.6938,8.5399,198
-0.3385,-9.2457,1.5892,2.0439,-9.2457,2.6336,11.0278,8.2765,199
-1.9002,-9.5028,0.0868,1.0347,-9.5028,1.7163,15.0621,5.431,200
-0.0695,-9.9106,0.2097,0.3134,-9.9106,1.167,4.9125,3.1201,202
-4.2849,-9.7696,0.8495,2.5531,-9.7696,5.2414,17.4584,8.6004,203
-4.2724,-9.7151,0.6114,3.5008,-9.7151,2.6609,11.0203,9.3621,204
-3.4907,-9.789,0.3556,1.3682,-9.789,1.9812,9.5956,6.748,205
-7.2792,-8.6533,0.8127,6.0283,-8.6533,1.5358,18.262,13.0951,207
-9.9467,-9.8276,0.0682,3.8402,-9.8276,6.1652,19.9794,13.5212,208
-11.3012,-7.4865,2.8231,7.4607,-7.4865,0.8657,22.1098,16.6606,209
-2.3376,-9.729,0.234,1.3598,-9.729,2.8948,16.627,7.0752,210
-8.5923,-9.7353,0.2611,4.1596,-9.7353,4.9993,15.2853,8.7655,212
-4.0174,-9.7925,0.3242,1.9378,-9.7925,3.4337,9.7148,5.9084,213
-2.9055,-9.7208,-0.0962,1.5322,-9.7208,2.8862,8.438,4.7705,214
-0.4126,-9.765,0.4162,0.8471,-9.765,2.191,8.4005,6.7903,215
-4.3837,-9.5271,0.2498,2.1964,-9.5271,1.6698,7.7228,5.6647,217
-0.2084,-10.0042,0.1155,0.298,-10.0042,1.276,7.4226,3.1136,218
0.0632,-9.7929,0.6754,0.8072,-9.7929,1.471,8.7281,6.1797,219
-4.0899,-9.3988,0.1376,2.7731,-9.3988,3.3161,17.2994,10.4421,220
-16.1311,-10.1287,1.2561,5.9777,-10.1287,5.8683,17.1348,10.5776,222
-9.1222,-9.6843,-0.2677,5.0124,-9.6843,8.7803,28.1884,12.3112,223
-2.8954,-9.6862,-1.1446,1.5636,-9.6862,3.2194,10.7716,7.1815,224
-4.5231,-9.7956,1.327,3.1347,-9.7956,5.3035,18.4411,11.5975,225
-2.0478,-9.5765,-0.2638,0.7452,-9.5765,1.1783,9.1051,3.3817,227
-3.2621,-9.969,2.4185,4.2261,-9.969,2.1189,14.0828,9.8746,228
-0.7484,-9.3097,1.0146,1.7751,-9.3097,4.0736,11.1159,8.7928,229
-0.2819,-10.2779,0.8617,1.2449,-10.2779,3.08,11.9737,6.6427,230
-1.6926,-9.5862,-0.0914,0.7993,-9.5862,2.7734,10.9586,5.7743,232
-6.4655,-9.6135,0.4223,3.0401,-9.6135,7.2756,15.6701,10.8549,233
-7.2661,-9.8063,-0.5475,2.701,-9.8063,7.2457,14.6589,8.8361,234
-2.6953,-9.6402,0.7998,2.2423,-9.6402,2.6264,15.6125,8.4707,235
-5.5975,-7.8295,1.1344,4.6244,-7.8295,1.8589,21.1559,12.8562,237
-6.8746,-9.7171,0.4358,3.1285,-9.7171,5.1825,18.4647,7.4024,238
-0.959,-9.5584,0.1104,1.0853,-9.5584,2.302,14.1495,7.4967,239
-0.2588,-9.8222,0.0984,0.2767,-9.8222,1.6903,7.516,5.9206,240
-1.1681,-9.8445,-0.0931,0.8308,-9.8445,0.5664,4.6827,3.8007,242
-2.129,-9.7697,0.25,1.1193,-9.7697,3.0426,9.1676,5.5136,243
-0.8706,-9.5846,-0.0027,0.6793,-9.5846,1.1002,7.2308,6.4484,244
-1.1735,-9.8686,0.443,1.0363,-9.8686,2.9567,9.4551,5.8554,245
-2.0971,-9.3152,1.6176,2.9166,-9.3152,3.1916,14.6438,12.5324,247
-11.0933,-9.7025,0.1915,4.8169,-9.7025,4.9189,37.3308,7.8029,248
-12.6564,-9.9566,0.6305,8.1818,-9.9566,4.221,16.1123,13.8374,249
-6.4746,-9.1689,-0.5086,2.0569,-9.1689,4.1526,15.4172,8.5556,250
-9.4189,-9.8209,-0.4182,5.1199,-9.8209,8.6796,14.4286,11.4442,252
-19.384,-9.605,-0.7158,5.5564,-9.605,6.6755,22.9459,9.5684,253
-1.1919,-9.4611,-0.0179,0.7125,-9.4611,1.8226,9.7584,3.734,254
-0.6576,-9.7098,0.638,1.2281,-9.7098,2.6031,13.1117,5.5184,255
-1.9269,-9.7057,0.1602,0.7979,-9.7057,1.2754,7.6152,5.145,257
-13.9714,-8.1871,0.1211,3.3919,-8.1871,4.2928,62.817,9.0167,258
-7.6111,-8.7267,-0.1888,3.5617,-8.7267,2.0212,23.7441,14.343,259
-15.2146,-9.3638,-2.262,5.1346,-9.3638,3.8014,29.8016,10.1277,260
-4.7547,-9.4176,1.1844,3.5471,-9.4176,5.1382,19.8013,8.8371,262
-10.1079,-9.1273,-0.4044,2.9278,-9.1273,4.4029,18.651,10.8942,263
-2.3481,-9.8226,-0.27,0.9133,-9.8226,1.2464,15.4506,5.1134,264
-4.6977,-9.8527,12.4479,11.8809,-9.8527,14.7997,44.4941,27.5747,265
-6.4802,-9.6444,-1.0134,3.9271,-9.6444,3.9895,46.059,19.1933,266
-2.081,-9.3726,0.3723,1.7138,-9.3726,3.8591,17.6549,9.9195,267
-6.4284,-9.7194,-0.6836,3.4457,-9.7194,6.0763,16.5934,7.7797,268
-5.6634,-9.6663,-0.6782,3.0876,-9.6663,2.9291,13.1933,10.2834,269
-5.5427,-9.7425,0.2031,2.6895,-9.7425,3.621,16.7814,8.2278,270
-7.4001,-9.4835,1.4104,4.4083,-9.4835,3.6384,18.3451,11.7732,272
-12.4923,-9.765,-0.6795,4.2074,-9.765,6.9732,22.8075,14.5001,273
-11.789,-9.9959,-2.046,4.9159,-9.9959,4.772,15.3773,8.167,274
-11.4139,-8.2247,1.7498,7.1704,-8.2247,8.5891,34.7698,14.2224,275
-3.8631,-10.281,1.0938,2.7866,-10.281,2.2397,10.652,7.8311,276
-2.104,-9.9809,-0.3423,1.1292,-9.9809,2.0515,9.9888,6.7314,277
-2.3774,-9.7593,0.2176,1.2759,-9.7593,2.8313,10.5794,6.8293,278
-1.6213,-9.8611,0.1454,0.9879,-9.8611,2.5704,9.8555,6.1239,279
-2.4898,-9.4379,-0.2147,1.451,-9.4379,1.4947,7.5867,3.5458,280
-4.9863,-9.4832,0.3344,4.3682,-9.4832,6.3723,16.346,13.0583,281
-1.9977,-9.5445,0.2833,2.2186,-9.5445,2.6361,16.6727,13.8264,282
-13.191,-9.6424,1.1286,7.4576,-9.6424,11.3873,27.9837,18.6661,283
-11.1487,-9.4498,2.9168,5.7796,-9.4498,3.758,20.3491,13.9924,284
-4.3504,-9.6707,1.2349,2.941,-9.6707,1.4456,15.6035,11.3799,285
-3.8322,-9.0865,1.2307,3.3766,-9.0865,1.066,10.1721,8.8345,286
-1.9633,-9.4535,0.4152,1.506,-9.4535,2.8575,7.83,6.3298,287
-2.0538,-9.6672,0.2055,0.9847,-9.6672,2.017,14.1355,5.3186,288
-8.5957,-9.4978,0.4832,3.4766,-9.4978,5.6536,22.012,11.9887,289
-7.4901,-9.8611,0.4378,3.9195,-9.8611,1.7889,33.0089,14.8517,290
-0.3738,-9.9973,4.6459,4.228,-9.9973,2.9846,20.3186,15.4968,291
-7.8109,-7.6533,-1.1624,3.3774,-7.6533,2.5511,14.3337,8.0514,292
-24.4197,-9.6557,0.9218,10.1417,-9.6557,5.405,30.4252,19.0745,293
-11.2768,-9.338,0.2651,6.1659,-9.338,9.4047,27.0597,14.7869,294
-2.0219,-9.6921,-0.4804,0.6872,-9.6921,0.9078,14.4626,6.6108,296
-4.2186,-9.5185,-1.3452,1.4528,-9.5185,2.4489,5.7947,4.7716,297
-6.0594,-9.6112,-0.5973,2.8917,-9.6112,7.6999,21.4784,11.0774,298
-4.1257,-9.4639,-1.3592,1.4097,-9.4639,4.7955,14.5249,8.571,299
-4.7304,-9.6319,0.1932,2.2628,-9.6319,3.6211,13.8638,8.4326,300
-0.9451,-9.9141,5.3402,5.1215,-9.9141,4.5806,22.8012,18.027,302
-10.4062,-9.7097,-0.2431,4.2943,-9.7097,4.9897,13.3832,7.3024,303
-3.8224,-9.4986,-1.6562,2.4223,-9.4986,3.0739,13.6405,8.7823,304
-2.2632,-9.8113,0.6338,3.9034,-9.8113,4.1396,12.3976,7.9645,305
-4.8289,-10.0517,0.5356,4.4425,-10.0517,6.601,27.7831,14.6915,307
-3.7259,-9.7213,0.1926,1.3474,-9.7213,3.1055,16.2125,6.3188,308
-1.9534,-9.7861,0.0871,0.9073,-9.7861,1.5914,11.0076,5.8712,309
-2.0843,-9.5057,1.3299,2.0091,-9.5057,3.146,12.2422,6.8053,310
-12.1528,-6.4489,-0.4503,5.9625,-6.4489,3.3419,30.7005,15.2474,312
-1.351,-9.2786,-0.1331,0.6857,-9.2786,1.6848,14.7712,12.338,313
-2.5138,-9.8141,-1.1109,0.9201,-9.8141,1.4249,10.2464,8.7687,314
-2.9692,-9.6881,1.374,3.8626,-9.6881,2.1496,26.2082,7.3123,315
-4.7191,-9.9321,-0.0842,2.63,-9.9321,1.9485,10.6638,6.0204,317
-6.251,-9.8014,-0.1128,2.6359,-9.8014,4.296,15.0663,7.8227,318
-1.5067,-10.0794,0.0597,1.2244,-10.0794,2.6365,16.787,11.8495,319
-1.4232,-9.6848,-0.1553,0.4794,-9.6848,1.0543,8.0514,4.2367,320
-3.8819,-9.635,-0.3002,1.0752,-9.635,1.4884,7.6209,4.2868,322
-0.6994,-9.6621,0.1304,0.4574,-9.6621,2.1056,7.3653,3.4498,323
-4.4555,-9.8877,0.6612,2.4414,-9.8877,1.7762,10.4357,8.9727,324
-2.2918,-9.6898,-0.1327,1.1259,-9.6898,2.4028,7.4205,4.6655,325
-1.2987,-9.6013,0.1788,0.829,-9.6013,1.5638,12.5576,8.9001,327
-2.631,-9.7292,-0.0497,0.8838,-9.7292,1.9591,11.7646,5.3481,328
-0.8195,-9.6165,0.2033,0.5431,-9.6165,0.6124,6.2016,4.8936,329
-2.7983,-9.7615,-0.0832,1.085,-9.7615,2.2488,28.7488,11.618,330
-12.2175,-9.8864,-0.4774,5.3238,-9.8864,4.7943,24.1727,11.3277,332
-11.1536,-9.9471,3.402,8.1928,-9.9471,5.5211,30.9139,22.4519,333
-28.573,-9.7826,0.347,9.4165,-9.7826,4.3243,72.451,32.6263,334
-0.8737,-9.7564,-0.157,0.2743,-9.7564,0.5471,18.7173,9.4234,335
-4.1561,-9.7578,-1.1576,1.3321,-9.7578,1.1527,6.4727,4.3286,337
-2.9196,-9.7322,-0.3202,1.3573,-9.7322,2.9777,5.6209,3.3128,338
-0.4479,-9.7257,-0.167,0.2726,-9.7257,0.388,1.8358,1.7318,339
-0.2607,-9.7348,-0.0577,0.1853,-9.7348,0.6185,1.992,1.7034,340
-0.0809,-9.7368,-0.0578,0.0182,-9.7368,0.0494,1.6793,1.6547,342
-0.5094,-9.7378,0.0082,0.2827,-9.7378,1.1512,3.2174,1.9899,343
-0.2897,-9.7437,-0.1504,0.0894,-9.7437,0.284,2.5016,2.3216,344
-0.5195,-9.7367,-0.205,0.1778,-9.7367,0.5003,2.7587,1.9584,345
-2.038,-9.764,-0.6471,0.9283,-9.764,2.2743,6.1687,3.1373,347
-8.5766,-9.7224,-0.4406,3.3999,-9.7224,4.2027,7.0412,4.1472,348
-7.7886,-9.654,-1.8756,4.163,-9.654,2.9702,5.5693,3.6149,349
1.8547,-9.699,2.2333,0.1932,-9.699,0.2031,3.1018,2.7198,350
-0.0756,-9.7158,0.3662,0.3136,-9.7158,0.4328,2.3015,1.7034,352
0.314,-9.7232,0.5739,0.1366,-9.7232,0.1956,2.1331,1.8172,353
0.0578,-9.7258,0.2559,0.0936,-9.7258,0.1486,1.7045,1.6711,354
0.1547,-9.7249,0.2841,0.0933,-9.7249,0.1372,1.7367,1.6866,355
0.2961,-9.7248,0.4097,0.0819,-9.7248,0.1432,1.9973,1.7405,357
-9.4406,-9.8394,1.7447,5.6681,-9.8394,6.5722,43.0394,11.407,358
-3.8438,-9.6516,2.9537,4.8462,-9.6516,2.9398,14.686,8.6322,359
-2.4737,-9.6722,-0.0594,0.9868,-9.6722,1.8995,11.3476,6.4836,360
-2.0135,-9.6585,-0.3899,0.7407,-9.6585,1.8086,6.9406,5.4828,362
-7.0273,-9.6867,0.0698,1.3591,-9.6867,2.5323,41.3065,9.1043,363
-4.2605,-8.9095,-1.3112,2.0018,-8.9095,2.7516,21.8811,18.5632,364
-2.3628,-9.8514,1.2639,4.3092,-9.8514,2.1458,46.6074,44.6761,365
-16.725,-10.2003,-1.8896,10.3219,-10.2003,4.0407,38.317,32.8019,367
-29.8792,-8.913,4.6718,19.6131,-8.913,12.4303,48.4023,18.0568,368
-0.624,-10.2715,1.7489,2.8387,-10.2715,6.9557,17.9137,15.3449,369
-17.5864,-8.7781,-0.322,8.5868,-8.7781,8.9371,22.8356,14.9961,370
-34.3374,-8.1765,2.8367,25.8568,-8.1765,13.557,46.7154,19.4227,372
-10.3979,-7.7807,0.9702,6.0433,-7.7807,9.9663,32.0542,18.6589,373
-2.6164,-9.9371,1.9574,2.3991,-9.9371,5.3496,20.3128,15.7721,374
-3.4018,-9.5596,0.4051,1.607,-9.5596,3.947,14.4931,7.4831,375
-1.5735,-9.6787,3.9249,4.8876,-9.6787,3.0257,13.1388,8.4893,377
-15.8673,-8.9129,0.4015,6.2764,-8.9129,7.8791,25.5578,11.9558,378
-11.8719,-7.9234,-2.228,4.667,-7.9234,1.5952,21.6606,13.6308,379
-10.0957,-6.201,-0.837,6.2304,-6.201,8.0534,23.555,13.7497,380
-4.7885,-9.1475,-0.2741,2.9846,-9.1475,3.595,21.5826,7.5791,382
-15.2428,-8.3437,-0.3409,4.4191,-8.3437,5.4401,27.676,11.8349,383
-6.1808,-10.2179,-1.2002,3.1473,-10.2179,4.0272,11.7291,10.6473,384
-5.0094,-9.9094,-1.1855,1.6728,-9.9094,6.0756,14.2927,10.0038,385
-3.3407,-9.7902,-0.5334,1.3666,-9.7902,2.1828,11.5595,6.7803,387
-15.059,-9.6334,-0.5629,2.9116,-9.6334,4.8355,16.2047,9.9254,388
-3.2576,-9.5947,-0.9716,1.6279,-9.5947,3.3565,8.9558,3.8463,389
-11.2156,-9.939,-0.6115,4.4232,-9.939,3.8392,15.156,7.2532,390
-4.1932,-9.8854,-0.2826,1.693,-9.8854,4.082,11.9827,7.2149,392
-7.1766,-9.8449,0.3684,2.8871,-9.8449,5.2995,14.6527,8.0115,393
-6.5784,-9.7276,-1.4485,2.8177,-9.7276,7.5678,15.2991,8.8073,394
-3.8788,-9.8406,-0.3297,1.0686,-9.8406,1.8009,6.9378,4.9883,395
-1.5118,-9.7243,0.5248,1.3644,-9.7243,2.3191,9.44,7.2965,397
-3.511,-9.8334,-0.1485,1.2757,-9.8334,4.735,15.1362,9.2035,398
-3.593,-9.9325,0.1337,2.1309,-9.9325,1.1474,7.7924,6.3731,399
-1.8015,-9.702,1.5791,2.1444,-9.702,0.8503,12.6372,10.8233,400
-3.3952,-10.1118,0.085,2.0026,-10.1118,2.7421,33.0464,21.4534,401
-3.1838,-9.8528,0.4685,2.9669,-9.8528,2.2768,27.7562,25.8803,402
-1.8848,-9.8567,0.0122,0.6123,-9.8567,2.0592,10.6421,6.6343,403
-0.6856,-9.703,0.5965,0.8594,-9.703,3.6758,14.6243,8.0161,404
-0.3234,-9.9745,0.5422,0.7847,-9.9745,1.957,7.6426,4.7993,405
-0.1235,-9.8009,0.018,0.0726,-9.8009,0.9721,15.5974,14.2726,406
-1.6511,-9.7963,-0.2073,0.6783,-9.7963,0.9896,17.8226,13.2949,407
-7.945,-9.7216,0.7835,4.9672,-9.7216,0.4474,21.2625,18.7177,409
-0.0054,-9.3671,2.816,3.0156,-9.3671,2.2686,28.1848,9.7732,410
-18.3661,-9.4157,2.8589,8.948,-9.4157,6.5833,26.2458,17.0303,412
-37.2528,-8.5825,4.8407,20.6203,-8.5825,11.5576,42.7428,26.0382,413
-60.4089,-9.6492,3.0373,16.3029,-9.6492,14.0945,36.0776,22.0524,414
-11.8813,-9.5602,4.737,10.1759,-9.5602,6.7407,31.9831,19.1601,415
-1.9118,-10.5923,0.0472,1.8028,-10.5923,3.7774,23.8793,21.6487,416
-4.4175,-9.0691,1.7343,7.3163,-9.0691,7.2001,23.0037,13.7056,417
-7.4361,-8.9859,0.4084,3.2161,-8.9859,6.4561,21.0969,11.0421,418
-4.5024,-9.8732,-0.4015,2.5522,-9.8732,2.7627,12.4607,7.1659,419
-6.2455,-9.7234,0.0104,2.328,-9.7234,1.51,21.2053,9.3798,420
-7.6693,-9.3736,-0.9717,2.9755,-9.3736,2.3323,19.9672,11.4583,422
-10.3176,-9.6384,0.1054,4.1638,-9.6384,5.9717,20.6551,12.6695,423
-6.8443,-9.6626,0.4645,4.7974,-9.6626,4.7781,19.9724,9.9805,424
-2.2632,-9.6609,0.7416,2.3341,-9.6609,1.8097,13.5782,6.2472,425
-1.0705,-9.507,0.3886,0.8558,-9.507,1.2438,10.5457,5.4412,427
-3.2215,-9.5935,-0.0593,1.1684,-9.5935,2.8346,20.5844,6.7196,428
-7.2399,-9.5655,3.671,5.7004,-9.5655,2.6336,23.036,17.7258,429
-7.1693,-9.4147,-1.0861,3.287,-9.4147,7.0192,20.9568,11.9401,430
-0.4685,-10.0662,0.156,0.4694,-10.0662,1.4295,10.8564,5.178,432
-12.8659,-9.0404,2.1931,6.8486,-9.0404,6.6706,40.2292,12.6689,433
-1.8124,-10.1327,0.0013,0.9768,-10.1327,2.1335,16.5302,9.3467,434
-4.4083,-9.6798,-0.3581,2.3006,-9.6798,3.7541,20.5179,13.2808,435
-7.4663,-9.4806,1.981,5.2691,-9.4806,6.9942,23.5351,17.965,437
-9.4754,-9.3631,1.4747,5.6089,-9.3631,8.3692,34.9879,12.513,438
-2.9807,-10.0389,1.0684,2.0882,-10.0389,5.6469,25.7165,23.5204,439
-4.5987,-9.9811,-0.8398,1.4401,-9.9811,1.2227,19.3393,6.2539,440
-18.4639,-9.8019,-1.0446,6.6873,-9.8019,4.8592,19.7941,12.7737,442
-12.9368,-9.3542,1.5104,6.5689,-9.3542,8.0371,24.2212,11.4682,443
-1.3539,-7.6536,-0.1636,0.8697,-7.6536,0.8597,27.2117,11.5767,444
-3.6655,-9.7569,0.6285,1.9727,-9.7569,3.4353,14.5632,8.9697,445
-1.543,-10.1056,2.3716,2.8515,-10.1056,2.706,17.6176,11.8268,447
-3.2062,-9.9453,-0.0216,1.071,-9.9453,2.2453,27.3187,5.6704,448
-1.238,-9.6148,1.4259,3.2971,-9.6148,2.5512,14.9137,10.61,449
-3.0721,-9.7297,1.3965,3.3965,-9.7297,3.3162,13.6068,8.5993,450
-2.9961,-9.9462,0.0523,1.7387,-9.9462,1.3197,11.4072,8.4727,452
-4.6641,-9.7281,0.8767,3.3103,-9.7281,4.444,24.5699,16.8238,453
-5.4554,-9.7496,0.9746,3.1856,-9.7496,5.547,20.0659,12.1582,454
-3.5131,-9.9275,0.6896,2.269,-9.9275,3.7964,39.4473,35.3839,455
-0.8506,-9.5118,1.5852,1.4272,-9.5118,0.785,12.5683,8.5902,457
-7.2099,-9.8002,1.8584,4.1087,-9.8002,8.4752,27.1706,17.5946,458
-1.0838,-9.8426,1.4855,2.6765,-9.8426,2.8197,11.6037,9.3395,459
-1.0864,-9.6238,0.0471,0.5712,-9.6238,0.7865,9.6898,5.0844,460
-2.3626,-9.7461,0.1704,2.0464,-9.7461,2.0039,16.2528,15.72,462
-9.3123,-9.8412,4.9449,7.932,-9.8412,12.2774,32.9219,23.2498,463
-14.2097,-9.6554,-0.7799,5.7688,-9.6554,4.1484,15.7819,13.868,464
-2.8565,-9.7211,1.0631,2.3757,-9.7211,5.667,14.9714,12.9542,465
-2.6877,-9.6021,-0.2602,1.0088,-9.6021,1.2381,4.518,2.5009,467
-2.0394,-9.7662,-0.0441,0.8671,-9.7662,3.1554,10.4441,6.9357,468
-5.0047,-9.869,0.2765,3.2984,-9.869,0.7925,12.8325,10.1272,469
-9.8815,-10.1222,1.5917,4.4867,-10.1222,7.3796,61.0567,51.419,470
-3.5393,-9.6935,-0.7382,1.3699,-9.6935,0.4678,34.7309,30.6677,472
-7.7634,-9.7709,5.0703,6.7587,-9.7709,8.9061,42.9548,22.2932,473
-3.1749,-9.8088,-0.0362,1.6872,-9.8088,3.9615,41.2705,23.2647,474
-15.3501,-9.7987,1.34,8.5989,-9.7987,4.0969,67.4782,56.5304,475
-0.8758,-9.7394,0.2382,0.94,-9.7394,2.0177,13.1849,5.1191,477
-8.4929,-9.7005,-0.9169,3.519,-9.7005,3.5618,8.0769,3.1011,478
-0.7355,-9.7194,-0.4258,0.1481,-9.7194,0.1962,1.8539,1.7265,479
-0.4765,-9.7199,-0.2589,0.2038,-9.7199,0.3614,1.784,1.7114,480
-0.1214,-9.7219,-0.0534,0.0388,-9.7219,0.0749,1.7268,1.6538,482
-0.7837,-9.7225,-0.3045,0.345,-9.7225,0.6108,2.0617,1.6552,483
-0.382,-9.7231,0.0896,0.3766,-9.7231,0.6708,2.0594,1.7038,484
-0.5923,-9.7314,-0.3315,0.1989,-9.7314,0.543,2.2562,2.0173,485
-0.5217,-9.7234,-0.2253,0.1333,-9.7234,0.2684,1.9195,1.6605,487
-0.6289,-9.7231,-0.3889,0.0986,-9.7231,0.2332,2.0575,1.7614,488
-0.2242,-9.7219,-0.1751,0.0413,-9.7219,0.0794,1.6621,1.6464,489
-1.0412,-9.7205,-0.6227,0.2664,-9.7205,0.4328,2.4228,2.0764,490
-1.2555,-9.7114,-0.2431,0.6163,-9.7114,0.8543,2.3061,1.752,492
-0.4517,-9.7109,0.1171,0.3874,-9.7109,0.5793,1.9182,1.7126,493
-0.9423,-9.7152,-0.5058,0.3169,-9.7152,0.4449,2.1083,1.8841,494
-1.3649,-9.7096,0.4074,1.2628,-9.7096,1.612,3.4662,2.0933,495
-0.8711,-9.7239,-0.489,0.2145,-9.7239,0.2959,2.0525,1.971,496
-0.5135,-9.7282,-0.393,0.0858,-9.7282,0.1625,1.8854,1.8069,497
-1.503,-9.725,-0.8208,0.4941,-9.725,0.4842,3.2328,2.7376,498
0.0875,-9.7352,0.3669,0.1555,-9.7352,0.2171,2.8154,2.571,499
-0.1843,-9.7359,-0.0139,0.111,-9.7359,0.8051,2.2785,1.8384,501
-0.1339,-9.7347,-0.0346,0.0635,-9.7347,0.3216,2.2498,1.9162,502
-0.3013,-9.7345,-0.0154,0.2294,-9.7345,0.2023,2.4584,2.2697,503
-0.0176,-9.739,0.0572,0.0819,-9.739,0.6818,2.0537,1.7472,504
-0.2452,-9.7286,0.0942,0.197,-9.7286,1.196,2.9266,1.9641,505
-1.2421,-9.5844,0.198,0.6322,-9.5844,1.0707,16.1862,9.2058,506
-3.1331,-9.5443,0.8557,2.6256,-9.5443,5.9919,29.5434,13.4029,507
-6.9128,-9.5741,1.3924,3.9247,-9.5741,5.1723,22.6644,9.7896,509
-0.7299,-9.5542,0.6821,0.9399,-9.5542,1.9178,12.4208,9.4031,510
-0.021,-10.0419,0.259,0.4107,-10.0419,1.4487,10.568,7.3905,511
-0.092,-10.3796,0.6109,0.9332,-10.3796,1.7119,14.1874,10.3338,512
-1.5513,-9.9103,1.4598,2.86,-9.9103,3.5178,44.5276,40.3108,513
-4.2576,-9.7858,1.0297,3.3029,-9.7858,1.9256,23.1268,15.8985,515
-16.6944,-9.9195,-2.8004,7.6118,-9.9195,2.2829,49.2276,45.0354,516
-1.5273,-9.7361,-0.2305,0.744,-9.7361,1.3442,19.7493,16.0936,517
-1.9731,-9.7358,0.2081,0.8604,-9.7358,1.9387,9.8699,6.3748,518
-1.1804,-9.7872,0.1518,0.5649,-9.7872,0.9425,6.1716,4.111,519
-0.2367,-9.7526,-0.0508,0.1121,-9.7526,0.5689,9.5209,8.1421,520
-1.1158,-9.7473,0.0116,0.5162,-9.7473,0.5033,12.2798,10.4839,521
-1.8002,-9.85,0.4506,1.1429,-9.85,2.9646,33.8084,28.7768,522
-14.9839,-9.7099,0.6886,4.6193,-9.7099,8.304,26.4915,15.3882,523
-0.9416,-9.8034,3.1304,4.1736,-9.8034,3.2795,15.2167,12.8632,524
-5.2572,-9.725,-0.6594,1.858,-9.725,2.2313,14.6622,9.8742,525
-2.41,-9.8129,-0.4488,1.1117,-9.8129,2.3874,9.0785,5.769,527
-3.7634,-9.7812,-0.1484,2.2805,-9.7812,4.885,22.0244,8.0767,528
-2.4143,-9.2215,-1.2959,1.2329,-9.2215,3.0653,12.816,8.1809,529
-4.0691,-8.9123,0.0223,2.3295,-8.9123,4.3263,18.382,9.3201,530
-6.537,-9.817,-0.3377,3.017,-9.817,5.2518,16.4432,11.0072,532
-9.0292,-9.2992,-0.7886,3.6542,-9.2992,6.8459,20.7684,12.1943,533
-8.8227,-10.0593,0.0677,3.4445,-10.0593,3.8742,18.9233,7.3686,534
-1.0202,-9.5908,0.4338,1.0438,-9.5908,2.1732,8.0408,5.6306,535
-2.0498,-9.6778,1.099,2.2871,-9.6778,3.5026,11.3466,9.6086,537
-0.3242,-9.5546,5.1217,5.7153,-9.5546,2.9547,14.421,12.8306,538
-5.0033,-9.4311,-0.4071,2.324,-9.4311,3.4472,23.2013,17.5617,539
-14.9249,-9.6955,1.2896,9.6424,-9.6955,6.3331,22.6027,16.4792,540
-0.4179,-9.6724,-0.076,0.1826,-9.6724,1.179,7.8944,5.1149,542
-7.3278,-9.6204,0.3045,3.1849,-9.6204,6.5035,22.8247,7.9391,543
-0.8421,-9.485,0.2662,0.9141,-9.485,2.4124,11.9868,5.5931,544
-6.2143,-9.541,0.1916,2.7694,-9.541,4.4153,11.386,7.4991,545
-1.7152,-9.5365,-0.2561,0.6835,-9.5365,1.6371,13.3705,10.5287,547
-0.7727,-9.7429,0.0408,0.421,-9.7429,1.6869,12.0379,5.9813,548
-3.1204,-9.6763,-1.1587,1.4049,-9.6763,2.9978,21.1327,7.67,549
-1.8387,-9.7709,-0.3408,0.7335,-9.7709,1.8246,10.3454,8.0425,550
-2.0531,-9.7635,-0.188,0.9756,-9.7635,1.0392,19.3639,13.0159,552
-2.9347,-9.731,-0.3979,0.8506,-9.731,2.0461,6.7471,5.2482,553
-2.3501,-9.7382,-0.5968,1.0227,-9.7382,1.2987,2.9849,1.644,554
-0.6689,-9.7334,-0.2381,0.242,-9.7334,0.5658,2.2368,1.7519,555
-0.7647,-9.702,-0.2747,0.305,-9.702,0.5776,2.2284,1.8857,557
-1.9511,-9.6973,0.9957,1.8269,-9.6973,4.2104,28.662,10.2802,558
-0.016,-9.5188,1.4127,0.7824,-9.5188,1.0858,19.877,15.1823,559
-3.5533,-9.8303,-0.5595,1.3225,-9.8303,1.2961,18.5758,9.5342,560
-1.647,-9.5343,0.8733,1.649,-9.5343,2.7006,22.6252,13.0001,562
-13.3675,-9.5893,0.1646,3.5724,-9.5893,4.9489,35.4715,12.098,563
-0.6923,-9.7161,0.3574,0.6115,-9.7161,1.8507,11.4658,6.4975,564
-7.435,-9.8717,-1.4803,3.6293,-9.8717,8.4696,24.8063,9.7075,565
-2.4401,-9.9171,0.7568,3.1306,-9.9171,4.5937,16.6734,9.0022,567
-2.1236,-9.7702,-0.4399,1.1204,-9.7702,3.7822,14.5085,7.6926,568
-3.2856,-9.7549,-0.9432,1.689,-9.7549,2.8811,11.5534,9.941,569
-14.5465,-9.5078,0.3801,6.1684,-9.5078,4.3595,19.5097,12.9911,570
-1.7498,-8.5691,-0.4322,0.9886,-8.5691,5.4301,17.3194,14.5415,572
-2.2689,-9.5124,7.6707,11.8765,-9.5124,7.9108,32.2446,18.1985,573
-10.0395,-9.6253,0.2722,3.4527,-9.6253,5.6176,20.7376,9.5419,574
-2.5775,-9.8158,0.1304,1.7357,-9.8158,5.7976,14.24,11.1409,575
-7.4868,-9.6426,-0.5307,3.5405,-9.6426,7.3104,22.5293,17.994,576
-7.4936,-9.5088,0.4352,3.5181,-9.5088,3.6361,27.219,9.1485,578
-6.9125,-9.6835,-2.1769,2.9076,-9.6835,2.5071,19.5729,15.5386,579
-3.8594,-9.8241,-0.8286,1.31,-9.8241,2.6748,18.9347,7.1865,580
-1.1496,-9.8965,-0.0315,0.5755,-9.8965,0.8825,12.3677,5.2551,582
-5.2449,-9.7063,-1.3875,1.6007,-9.7063,1.7687,7.3718,4.7999,583
-1.9689,-9.6867,-1.2056,0.3764,-9.6867,0.4073,2.7429,2.0638,584
-0.5988,-9.6696,-0.0737,0.1881,-9.6696,0.1883,1.7506,1.6204,585
-1.4063,-9.6592,0.0378,0.8542,-9.6592,0.7622,2.0068,1.7562,587
-2.2882,-9.6794,-0.3832,0.7641,-9.6794,0.7832,2.627,1.7164,588
2.6393,-9.6705,3.0716,0.4017,-9.6705,0.5647,4.6844,3.5912,589
-2.1637,-9.4538,-0.007,0.9092,-9.4538,1.9988,16.4504,6.5889,590
-6.2533,-9.4108,0.5267,3.4973,-9.4108,3.4928,35.0042,11.6686,592
-59.697,-9.0388,-0.809,10.5704,-9.0388,6.9584,55.5581,14.2798,593
-0.123,-9.5534,0.6716,0.6732,-9.5534,1.1775,11.0516,7.5363,594
-4.7595,-10.0817,0.4681,2.7761,-10.0817,5.2229,16.0505,11.0096,595
-8.0261,-9.4797,-0.1115,3.242,-9.4797,5.607,21.5807,11.6864,597
-7.1705,-9.6052,0.6062,3.2246,-9.6052,5.145,21.8801,8.1781,598
-12.1408,-9.8065,-0.6347,6.3702,-9.8065,3.1878,16.7133,13.5221,599
-9.7862,-9.6485,0.6958,5.0852,-9.6485,8.2819,23.8081,16.33,600
-15.7308,-10.0918,3.4944,12.8586,-10.0918,11.9851,26.9827,22.3873,602
-6.8927,-9.6981,-0.2582,2.7303,-9.6981,4.6245,17.3845,7.4651,603
-3.3003,-9.5318,0.1335,1.3707,-9.5318,4.1815,9.2241,5.8483,604
-2.6681,-10.0564,-0.155,1.8149,-10.0564,4.6194,12.3484,6.978,605
-8.3034,-9.1059,-0.1419,3.3943,-9.1059,4.7609,14.9214,7.3051,607
-11.4658,-9.615,0.8648,4.8083,-9.615,4.1964,17.7911,8.9286,608
-0.8821,-9.9189,0.2452,1.0017,-9.9189,2.1748,7.5343,5.9064,609
-2.2428,-9.4123,-0.0175,1.497,-9.4123,1.5636,10.3995,4.7089,610
-2.7188,-9.5647,0.001,2.3775,-9.5647,0.6938,9.4869,7.6068,612
-2.3098,-9.5684,0.0888,1.3948,-9.5684,1.8864,13.2337,5.2911,613
-1.7929,-10.0161,-0.2439,0.9619,-10.0161,1.9533,7.5063,3.7894,614
-0.6662,-9.7055,0.105,0.323,-9.7055,1.2164,15.8322,4.2425,615
-6.3689,-9.8003,-0.4846,2.4087,-9.8003,2.9214,17.0049,6.9237,617
-71.5082,-8.8476,-0.3032,12.7105,-8.8476,4.6228,76.5131,15.8098,618
-7.0707,-9.6939,5.0763,13.6412,-9.6939,8.0371,42.541,36.2195,619
-9.8564,-8.9491,-3.0218,4.6198,-8.9491,6.6218,21.1962,11.6005,620
-43.0972,-8.1151,-4.1754,17.3339,-8.1151,4.4055,46.6718,17.9908,622
-13.4137,-9.6665,0.1867,4.7966,-9.6665,6.5295,28.7865,12.0136,623
-3.2222,-9.4804,-0.0211,1.8726,-9.4804,2.0765,8.8809,6.663,624
-3.2859,-9.9765,-0.0128,1.3924,-9.9765,1.4797,11.4385,8.726,625
-9.9362,-9.8549,5.1108,8.3582,-9.8549,11.2606,51.9057,23.2845,628
-0.4805,-9.9405,0.2005,0.4869,-9.9405,0.9613,16.4929,14.1036,629
-0.2844,-9.6954,1.4266,1.3084,-9.6954,0.6709,29.2871,22.2829,630
-2.2062,-9.9177,-0.2905,0.8716,-9.9177,2.0274,6.7136,3.6511,631
-9.5111,-9.7494,2.6559,6.4358,-9.7494,9.7124,18.8452,14.0399,632
-7.3973,-9.5813,-0.5788,2.7785,-9.5813,8.1452,20.1589,9.7728,634
-2.5213,-9.7047,0.3621,1.9765,-9.7047,5.1303,13.659,8.0583,635
-1.0969,-9.4871,2.1179,2.6781,-9.4871,1.8796,10.1379,8.1368,636
-6.3598,-9.0175,1.8109,4.2815,-9.0175,2.5678,13.7991,10.4839,637
-2.9106,-9.734,0.5499,1.7354,-9.734,3.1142,10.012,5.6288,638
-2.1648,-9.5518,-0.5642,1.1475,-9.5518,4.6307,13.7937,10.4878,639
-1.1833,-9.7699,0.31,0.9236,-9.7699,1.0439,13.4148,10.0756,640
-7.344,-9.6685,-0.3596,3.5929,-9.6685,7.7713,19.6059,12.8589,642
-9.6357,-9.8442,0.4684,3.5378,-9.8442,6.723,19.1869,11.0655,643
-1.7276,-9.4863,0.6056,1.3465,-9.4863,2.438,12.5665,7.7386,644
-6.4727,-9.6313,0.7012,2.7742,-9.6313,3.3087,14.7941,9.4019,645
-1.0076,-9.7501,0.258,0.8938,-9.7501,2.9382,24.2473,21.926,647
-0.8586,-9.4709,-0.1295,0.5836,-9.4709,1.881,11.5819,8.3421,648
-19.3688,-9.6485,-0.757,8.3699,-9.6485,2.2624,36.2431,23.7767,649
-1.9315,-9.8304,0.5793,1.6262,-9.8304,3.1453,17.4795,10.2891,650
-35.6925,-9.2698,-5.108,15.2424,-9.2698,10.4569,49.8876,20.8918,652
-15.163,-9.4138,2.451,7.0882,-9.4138,8.7363,40.3232,17.5391,653
-10.9213,-9.6835,3.3238,6.7696,-9.6835,6.0592,25.4194,17.3537,654
-7.0376,-10.2364,1.0207,4.1947,-10.2364,8.9567,21.5695,13.9058,655
-8.6066,-9.633,1.6413,5.6732,-9.633,7.7196,17.9616,13.9028,657
-12.1251,-9.7726,1.8022,5.7913,-9.7726,7.2335,23.3901,10.9817,658
-0.6707,-9.6126,0.6553,1.5072,-9.6126,1.4696,7.9513,4.3675,659
-3.698,-9.7806,0.8644,2.1535,-9.7806,1.1775,11.6585,7.4126,660
-4.7422,-10.024,-0.6559,1.8604,-10.024,1.2384,11.7189,10.2877,662
-2.3796,-9.7934,0.3868,1.4235,-9.7934,3.4961,10.0198,6.1193,663
-1.3335,-9.7599,-0.0185,0.6893,-9.7599,0.6777,8.82,3.8165,664
-5.0372,-9.7321,4.6235,7.9167,-9.7321,4.6001,19.7261,13.755,665
-3.8574,-9.9148,4.0934,5.0872,-9.9148,7.8039,29.2388,21.9571,667
-3.417,-9.7691,-0.0537,1.3791,-9.7691,3.0924,20.4783,9.7975,668
-11.5648,-9.8476,0.1019,4.3813,-9.8476,1.4862,14.9206,11.3922,669
-3.2077,-9.8338,-0.1332,1.08,-9.8338,2.3705,6.9752,5.4063,670
-1.5802,-9.8095,0.501,1.0025,-9.8095,2.2721,13.9175,7.5882,672
-5.2343,-9.8306,0.219,2.2883,-9.8306,6.1621,18.6193,10.3812,673
-1.8803,-9.533,1.6579,3.162,-9.533,5.1365,18.8863,13.1878,674
-1.1377,-9.7463,0.2665,0.6975,-9.7463,2.4805,13.722,9.8567,675
-0.7617,-9.8215,2.7041,3.3155,-9.8215,3.9251,22.369,15.3004,677
-6.2116,-9.7092,0.4345,2.9097,-9.7092,5.5891,21.2214,11.6066,678
-4.9118,-10.0419,2.5356,7.4127,-10.0419,2.6939,18.5226,16.1033,679
-3.1916,-9.5552,0.7914,1.6497,-9.5552,0.9231,15.6767,9.6149,680
-4.6996,-9.4913,-0.191,3.1341,-9.4913,1.3437,8.253,6.8092,682
-3.3467,-9.8669,0.2344,1.2193,-9.8669,2.7985,13.4895,7.3418,683
-3.1819,-8.8803,-0.5502,1.4376,-8.8803,2.9354,26.2948,23.4583,684
-1.7034,-9.7317,-0.1231,0.8003,-9.7317,1.6753,12.3852,4.548,685
-0.4314,-9.664,0.4878,1.2178,-9.664,1.6231,7.9355,4.428,687
-6.4357,-9.7294,-1.3463,2.0386,-9.7294,2.5157,7.569,5.3799,688
0.4866,-9.7326,0.9852,0.2712,-9.7326,0.1489,2.9824,2.8564,689
-1.139,-9.7263,-0.4222,0.3952,-9.7263,0.7637,2.4973,1.8608,690
0.0606,-9.7207,0.6419,0.6581,-9.7207,2.1875,7.0201,2.0973,692
-28.3138,-9.7825,-0.453,8.062,-9.7825,4.8737,26.5376,18.2761,693
-7.6306,-9.7189,2.4304,5.7835,-9.7189,6.806,24.169,13.0747,694
-2.9096,-9.8928,2.0754,3.5638,-9.8928,5.9466,23.0559,14.5326,695
-10.553,-9.7735,-1.3057,5.4422,-9.7735,6.7762,18.2248,14.6199,697
-2.236,-9.6119,-0.3499,1.487,-9.6119,3.6858,10.871,7.3042,698
-10.0676,-9.1519,2.2889,8.2103,-9.1519,3.3568,19.8187,15.6833,699
-9.3584,-9.8476,0.1777,3.1973,-9.8476,2.8413,21.9925,8.9873,700
-4.805,-9.7921,-0.2455,2.0119,-9.7921,3.6413,20.3228,9.603,702
-11.705,-9.7799,0.4828,4.0223,-9.7799,5.6404,25.6582,9.923,703
-5.2679,-9.1585,-0.619,2.2655,-9.1585,3.0493,14.9197,9.7454,704
-5.8859,-9.4723,2.6165,6.3937,-9.4723,9.9033,19.3739,15.7504,705
-2.1339,-9.6054,0.3221,1.4141,-9.6054,4.1706,18.2113,16.6708,707
-4.4008,-9.2245,0.6223,3.4047,-9.2245,5.6644,22.0635,11.8785,708
-2.6791,-9.68,-0.9101,1.064,-9.68,4.7175,19.5308,15.0237,709
-3.3596,-9.6395,-0.2763,1.1473,-9.6395,2.2021,12.7314,7.1613,710
-2.4081,-9.8059,-0.2032,0.6802,-9.8059,1.3709,5.0395,2.5751,712
-4.8019,-9.6456,0.6582,2.7097,-9.6456,4.2556,18.6045,7.2782,713
-3.223,-9.8215,0.0328,1.0886,-9.8215,1.8574,22.7333,5.7286,714
-1.6383,-9.7126,0.2425,1.2198,-9.7126,1.3342,7.5748,5.0965,715
-1.4382,-9.7343,0.0511,0.7647,-9.7343,2.306,11.3277,6.0354,717
-4.4306,-9.6039,-1.7215,1.621,-9.6039,1.2461,6.5879,5.2694,719
-2.2532,-9.5486,-0.3117,1.1149,-9.5486,7.2428,16.2541,9.262,720
-4.4018,-9.4849,4.156,6.9341,-9.4849,6.8317,32.9733,29.4674,722
-8.2356,-9.4489,0.2368,2.5382,-9.4489,3.8096,21.7958,11.1438,723
-3.6386,-9.7754,0.376,1.7598,-9.7754,4.204,26.082,10.6825,724
-2.0195,-9.5787,0.087,0.9274,-9.5787,2.1272,8.1825,4.8665,725
-12.3973,-9.702,-0.9543,3.6591,-9.702,1.9307,21.6685,10.5091,726
-0.9433,-9.6195,0.2274,0.69,-9.6195,1.9623,9.7812,4.8458,727
-30.4739,-10.1259,2.8862,9.9206,-10.1259,7.7403,41.048,18.9809,728
-13.1555,-9.6929,1.9308,4.7701,-9.6929,4.879,54.9216,39.3241,729
-8.5777,-9.9287,0.414,6.723,-9.9287,4.3082,57.0488,52.5722,730
-10.6536,-10.5081,2.5211,11.4155,-10.5081,7.6684,21.5998,17.2154,731
-30.771,-9.7388,-0.297,8.5178,-9.7388,8.5546,26.0263,16.4397,732
-7.5988,-9.2927,0.9169,4.5046,-9.2927,4.2042,35.5941,10.5982,733
-5.1633,-9.8326,-0.4313,2.1503,-9.8326,3.3584,12.7257,9.2005,734
-0.7707,-9.7077,-0.0632,0.6544,-9.7077,1.5487,8.7164,3.7981,735
-0.0083,-9.7801,0.4945,0.5519,-9.7801,1.8992,5.8697,4.7021,736
-1.8777,-9.7391,0.2864,1.1098,-9.7391,1.914,8.1224,5.8752,737
-0.9077,-9.6396,0.2134,0.8391,-9.6396,1.0633,11.2831,5.5071,738
-4.3141,-9.8252,0.2509,2.4216,-9.8252,3.6607,19.0558,7.7993,739
-3.5799,-9.851,1.127,2.8584,-9.851,1.6989,8.5311,7.7992,740
-5.6213,-9.6831,-1.425,2.2891,-9.6831,1.9368,11.9692,7.9417,741
-6.8281,-9.6501,-0.1095,2.8465,-9.6501,2.8249,6.3402,3.1972,742
-3.2171,-9.6921,0.6184,2.5032,-9.6921,2.7477,10.8128,2.697,743
-13.5022,-9.7428,-0.632,2.9826,-9.7428,2.2461,20.0324,7.1332,744
-15.915,-9.6954,2.0011,12.4992,-9.6954,2.3743,27.4632,24.6865,745
-20.4987,-10.301,-0.5502,10.5738,-10.301,7.8804,44.1372,38.0891,747
-11.7029,-9.6431,0.4594,4.7534,-9.6431,5.1897,19.1242,8.7985,748
-5.7817,-9.6026,1.606,4.1468,-9.6026,7.567,22.5252,11.2165,749
-2.3328,-9.8379,-0.1251,1.2804,-9.8379,3.9881,13.2679,7.7276,750
-1.262,-9.6043,-0.3772,0.8318,-9.6043,2.8148,9.1303,5.4681,752
-4.7463,-10.156,0.2034,2.237,-10.156,7.1589,20.3258,13.2089,753
-5.2898,-9.9794,1.149,3.5214,-9.9794,5.1112,15.1973,8.6758,754
-0.4089,-9.6659,1.5921,2.4308,-9.6659,2.4387,13.3822,4.806,755
-1.9196,-9.8815,-0.101,0.7582,-9.8815,1.5115,8.6989,6.2019,757
-0.9835,-9.7804,0.3558,1.2877,-9.7804,2.4784,10.9824,5.3863,758
-0.1738,-9.7161,0.065,0.1946,-9.7161,0.7101,5.0892,4.3991,759
-0.5766,-9.9085,0.6182,1.0376,-9.9085,1.0268,8.5939,7.5606,760
-1.1561,-9.6072,-0.1705,0.5443,-9.6072,1.2561,7.8214,5.2496,762
-1.2144,-9.7324,0.1209,0.5442,-9.7324,2.1038,21.7092,9.0143,763
-2.693,-9.7666,-0.3577,0.989,-9.7666,1.341,25.3436,22.4742,764
-6.6009,-10.0155,0.0453,3.661,-10.0155,3.5898,44.4697,30.0319,765
-3.56,-9.7096,1.1558,2.8416,-9.7096,4.4607,25.6198,17.4589,767
-5.778,-9.7443,1.5202,4.5344,-9.7443,8.0062,29.7577,9.8502,768
-0.2803,-9.6614,0.138,0.3154,-9.6614,0.9487,10.3772,9.4999,769
-3.3297,-8.9338,0.4878,2.1957,-8.9338,3.6135,16.6204,6.2773,770
-7.2644,-9.844,0.0724,2.3923,-9.844,3.725,14.8481,8.5042,772
-4.8272,-9.7108,-0.0991,1.7918,-9.7108,3.2874,13.6951,7.4377,773
-3.9284,-9.8857,-1.1844,2.1909,-9.8857,1.1215,9.0197,7.3964,774
-4.5501,-9.6128,0.7709,1.9847,-9.6128,3.6791,7.7735,6.1379,775
-3.6625,-9.7823,-0.2725,1.8965,-9.7823,6.0948,12.1512,9.2997,777
-4.5005,-9.7216,-0.1945,1.7865,-9.7216,3.921,13.1795,6.1635,778
-0.2733,-9.8062,1.1387,1.5718,-9.8062,2.2068,8.2555,4.7582,779
-2.1178,-9.6529,0.4446,0.9694,-9.6529,0.9231,9.1728,5.6972,780
0.0323,-9.26,2.7918,3.2995,-9.26,4.3731,25.5401,18.7945,782
-9.2051,-9.6698,-0.2627,2.9458,-9.6698,5.021,29.6676,9.6117,783
-5.2496,-9.735,0.789,3.6876,-9.735,8.5429,14.2882,12.3488,784
-2.0787,-9.732,0.1834,2.1392,-9.732,4.4811,14.2959,10.3293,785
-7.4477,-9.8315,0.1038,2.3731,-9.8315,3.6273,14.0522,6.4942,787
-6.5614,-9.6744,-0.059,1.8658,-9.6744,3.344,18.9728,6.9434,788
-3.7183,-9.681,0.44,1.4199,-9.681,3.6654,15.6362,7.1324,789
-18.0202,-9.5562,-0.754,3.7416,-9.5562,2.8063,19.1166,7.7298,790
-18.1017,-9.5771,-1.2834,5.2866,-9.5771,4.1428,17.4479,7.9042,792
-3.7124,-9.7323,0.7956,2.2316,-9.7323,3.6975,12.9228,6.816,793
-2.4444,-9.3614,0.5605,2.0174,-9.3614,1.5981,14.8775,7.4891,794
-7.8889,-9.7147,-0.64,2.9193,-9.7147,2.4941,10.1756,8.2343,795
-7.1456,-9.9412,-1.0569,4.2902,-9.9412,4.1199,14.8301,11.8863,797
-16.4087,-9.797,0.1866,6.8757,-9.797,5.5578,30.9325,11.1757,798
-1.1189,-9.3859,-0.1436,0.5331,-9.3859,0.9819,14.7862,9.3491,799
-2.7384,-9.7178,1.156,2.3262,-9.7178,5.3086,11.6844,8.3897,800
-3.6044,-10.009,-0.732,1.5213,-10.009,2.3412,11.3994,6.7638,802
-0.494,-9.3393,1.7862,2.9809,-9.3393,1.157,16.4314,11.6986,803
-1.5121,-8.9978,-0.2308,0.578,-8.9978,1.3656,38.1925,29.6921,804
-42.9078,-9.905,-7.7712,17.4021,-9.905,14.0914,36.643,17.9369,805
-6.3575,-9.8838,0.8584,4.6998,-9.8838,6.0972,28.8762,14.8546,807
-9.1371,-9.6704,-0.6583,3.0576,-9.6704,6.4986,18.2954,10.3907,808
-3.8358,-9.8824,0.2624,2.6054,-9.8824,6.3702,15.2976,10.8774,809
-4.1968,-9.9201,-0.7351,1.1146,-9.9201,2.0496,16.8687,6.8374,810
-5.0639,-9.4696,1.3785,4.1178,-9.4696,6.8697,15.3409,8.6505,812
-6.5292,-9.6685,-0.1709,1.6856,-9.6685,2.7218,12.616,6.4927,813
-2.456,-9.7521,1.8169,4.4122,-9.7521,6.8807,16.1575,8.9133,814
-6.5237,-9.7217,2.4115,5.6098,-9.7217,6.3511,23.0556,13.4314,815
-3.1106,-9.4755,0.4438,1.8767,-9.4755,1.8056,11.5575,7.7595,817
-4.1967,-9.7749,0.4556,1.648,-9.7749,4.8347,17.8201,7.0471,818
-3.1011,-9.8682,-0.5283,1.3905,-9.8682,1.8355,7.9471,2.705,819
-0.9578,-9.6737,0.7378,1.2751,-9.6737,3.7265,12.0766,7.5078,820
-0.7352,-9.6862,0.4288,0.7868,-9.6862,1.7796,6.6554,5.0341,822
-22.7498,-9.5844,-0.216,7.3983,-9.5844,5.1287,46.4442,10.0625,823
-14.5327,-8.0758,-0.1219,8.724,-8.0758,2.1493,29.6172,21.4946,824
-9.6476,-9.7446,-1.1403,2.7784,-9.7446,2.5001,17.6432,5.072,825
-6.5755,-10.3654,2.6438,5.4546,-10.3654,8.0814,25.7743,10.7368,827
-9.7625,-9.5712,-0.914,2.9649,-9.5712,5.2141,16.633,7.2177,828
-3.8346,-9.7164,0.9166,3.1103,-9.7164,5.6814,16.2503,9.9045,829
-5.8711,-9.5192,-1.0818,2.3703,-9.5192,3.3666,13.2565,10.4252,830
-0.9838,-9.832,0.1255,0.5314,-9.832,1.8481,10.2128,5.1069,831
-14.5429,-10.3183,-4.9327,4.9674,-10.3183,6.3032,24.5744,17.6259,832
-2.8956,-9.6955,0.4762,3.3136,-9.6955,6.0024,16.9575,8.4941,833
-0.3703,-9.6649,0.6222,1.2552,-9.6649,1.9133,10.8048,5.3006,834
-2.2353,-9.8122,-0.3026,0.9744,-9.8122,1.695,6.4097,2.9046,835
-1.1187,-9.714,0.0222,0.7477,-9.714,1.0125,8.6111,4.4033,836
-3.6181,-9.734,0.2608,1.6744,-9.734,4.2933,10.073,6.2941,837
-1.27,-9.7532,0.3784,0.718,-9.7532,2.0737,7.4042,4.124,838
-1.4018,-9.7522,0.7722,1.0617,-9.7522,2.0694,9.5669,5.9758,839
-0.0137,-9.5428,1.52,1.2195,-9.5428,4.0402,10.9639,8.9954,840
-1.7763,-9.9688,0.2384,1.2798,-9.9688,2.2293,7.1969,4.2334,841
-5.4455,-9.7199,-0.3874,3.0291,-9.7199,6.53,17.2566,9.8544,842
-5.2219,-9.7086,0.0403,2.6204,-9.7086,5.5308,14.9466,9.3495,843
-3.9854,-9.7134,-0.2626,1.4263,-9.7134,1.9095,8.361,4.9971,844
-3.5687,-9.8299,-0.4697,1.1533,-9.8299,3.7167,10.5093,7.6897,845
-2.5649,-9.6333,1.4004,2.862,-9.6333,5.4029,14.9645,12.1687,846
-6.7082,-8.6709,-2.3448,1.8741,-8.6709,1.4998,34.7331,23.5509,847
-5.1977,-9.764,0.0649,1.4805,-9.764,3.1311,33.0496,6.578,848
-0.5791,-9.8213,0.1176,0.4606,-9.8213,1.5836,10.1802,8.5143,849
-0.4512,-9.7386,0.2059,0.4692,-9.7386,1.9444,7.5351,3.3189,850
-0.388,-9.7378,0.093,0.3222,-9.7378,0.6126,5.3522,4.2586,852
-2.0759,-9.7094,0.6687,1.8971,-9.7094,3.7615,15.7784,9.0725,853
-1.8362,-9.7771,0.3564,1.08,-9.7771,0.6147,15.4592,7.6031,854
-1.5926,-9.8083,0.3545,1.2114,-9.8083,0.983,25.6403,17.8714,855
-0.5283,-10.0666,0.2377,0.5179,-10.0666,1.7158,39.9425,28.5924,857
-8.5084,-9.8682,0.2718,2.3809,-9.8682,2.7415,31.7184,24.1162,858
-1.2666,-9.5576,-0.0331,0.6557,-9.5576,2.3606,9.6644,5.485,859
-1.5276,-9.7129,1.0767,2.106,-9.7129,0.8335,15.6613,11.8991,860
-0.3165,-9.6574,1.3028,0.8407,-9.6574,1.5208,13.3584,5.3929,862
-1.3972,-9.7233,0.8336,2.7669,-9.7233,3.39,18.5156,11.9154,863
-0.1076,-9.7669,0.3242,0.2759,-9.7669,0.3946,17.4496,14.5605,864
-0.5062,-9.6361,-0.0616,0.2415,-9.6361,1.441,10.395,9.5338,865
-2.62,-9.6825,-0.7357,1.3072,-9.6825,0.6342,10.9571,9.9341,867
-11.0752,-9.8457,0.342,4.6187,-9.8457,5.9941,55.5333,22.3484,868
-3.4527,-9.762,1.9108,3.0403,-9.762,4.7787,33.0231,23.342,869
-1.0843,-10.0592,2.95,4.8076,-10.0592,4.8011,14.8393,8.4834,870
-8.4941,-9.4627,1.7475,7.2672,-9.4627,9.0937,45.4153,12.8774,871
-4.8558,-9.7228,-0.2416,1.5846,-9.7228,3.8502,23.0058,12.088,872
-3.8226,-9.4813,1.4173,3.6755,-9.4813,7.8187,14.9836,10.13,873
-9.1155,-9.6386,-0.373,2.6428,-9.6386,5.7937,11.8056,8.9074,874
-3.9251,-9.8092,0.6788,2.2039,-9.8092,5.7698,15.3536,8.5233,875
-1.3003,-9.565,0.1356,1.1341,-9.565,2.0237,19.4403,11.1493,877
-2.6914,-9.7859,0.4294,1.4179,-9.7859,3.6672,19.9089,8.7767,878
-2.2295,-9.6632,0.5337,1.4034,-9.6632,2.9266,12.6566,5.4296,879
-1.5765,-9.636,1.3257,1.5576,-9.636,3.6677,10.9588,6.2465,880
-4.3022,-9.749,-0.3745,1.6309,-9.749,1.2996,6.1712,3.1764,882
-4.1333,-9.5449,0.0007,1.4457,-9.5449,2.6026,16.8611,8.2651,883
-0.2004,-9.685,0.0224,0.2025,-9.685,0.7654,7.7766,5.9011,884
-0.7943,-9.7925,0.2923,0.6918,-9.7925,0.9349,12.4324,6.5529,885
-0.2722,-9.7795,0.1765,0.4745,-9.7795,1.4256,7.0575,4.3194,887
-0.8376,-9.7135,0.2396,0.7431,-9.7135,1.2957,10.6248,6.5088,888
-1.3213,-9.7136,0.3604,1.0083,-9.7136,2.4079,5.5913,3.2398,889
-0.1999,-9.681,1.0083,0.9581,-9.681,2.4922,12.2208,6.3099,890
-3.0013,-9.7117,0.5084,1.8434,-9.7117,3.9242,45.3264,9.9167,903
-12.7108,-9.8279,-0.1528,6.733,-9.8279,8.1182,52.7839,18.7684,904
-6.5672,-9.6915,3.7935,8.7426,-9.6915,8.0389,54.2059,12.7572,905
-1.8688,-9.8663,1.5205,1.8236,-9.8663,4.3127,30.0201,14.6087,906
-2.1783,-9.6945,-0.5187,1.216,-9.6945,0.9474,11.5474,9.5724,907
-23.4306,-8.8092,8.0722,16.7793,-8.8092,1.888,39.2857,30.9796,908
-5.7331,-10.0384,-0.8925,4.0843,-10.0384,0.7321,18.5974,16.1106,909
-5.0708,-9.8304,1.7234,4.3214,-9.8304,1.6661,41.3156,32.4523,910
-2.7646,-9.3093,0.3941,1.7123,-9.3093,1.435,8.455,5.5428,911
-1.2,-9.2793,1.7591,1.8965,-9.2793,2.506,14.4741,11.015,912
-4.1116,-9.732,0.5168,2.6297,-9.732,3.5311,18.8828,10.5767,913
-0.1449,-9.7678,0.1574,0.4923,-9.7678,1.2326,6.8358,4.4736,915
-1.8728,-9.7101,0.6021,1.1855,-9.7101,1.744,11.6822,6.781,916
-2.2732,-9.6952,1.3951,3.2298,-9.6952,4.6986,18.5039,10.7248,917
-1.7024,-9.8345,0.173,1.1646,-9.8345,2.1869,11.1314,5.6293,918
-4.2525,-9.6316,0.3364,1.2975,-9.6316,3.1459,15.7486,8.6497,920
-5.1284,-9.6678,0.5041,2.264,-9.6678,3.1471,13.8722,7.8105,921
-1.5783,-9.6925,0.7929,1.463,-9.6925,3.8042,13.861,9.079,922
-2.794,-9.5746,0.1592,1.3189,-9.5746,3.8507,22.8949,8.2696,923
-10.623,-10.0179,2.3412,4.2376,-10.0179,7.9705,24.3813,20.1449,925
-1.8291,-9.7982,0.2827,1.2892,-9.7982,1.392,10.5211,8.1018,926
-1.167,-9.6715,0.0851,0.492,-9.6715,1.6489,12.476,3.92,927
-0.8266,-9.8812,0.1326,0.6774,-9.8812,1.0105,8.4751,5.6674,928
-0.4917,-9.6063,0.3469,0.6853,-9.6063,0.8506,5.1046,3.7805,929
-1.6403,-9.8776,0.1067,1.1741,-9.8776,1.2444,11.7984,7.2724,931
-1.5568,-9.7754,0.073,0.6329,-9.7754,2.7813,12.2317,5.5945,932
-2.1165,-9.9758,0.3653,1.3382,-9.9758,2.6541,11.4852,9.712,933
-0.3412,-9.4605,0.3731,0.4913,-9.4605,0.8264,9.9281,8.1201,934
-0.2481,-9.7724,0.274,0.2956,-9.7724,0.4452,5.483,4.6342,935
-3.2586,-9.8118,-0.7633,1.2108,-9.8118,2.3962,8.4755,5.6352,936
-0.6772,-9.8811,-0.0671,0.6252,-9.8811,0.5926,10.8929,6.0176,937
-2.2187,-9.816,0.1135,1.0882,-9.816,1.1314,8.3118,4.406,938
-2.74,-9.6163,0.4946,1.8592,-9.6163,4.8937,18.4222,11.5594,940
-3.8072,-9.9714,0.9732,2.6173,-9.9714,5.3309,19.3526,12.2809,941
-1.1918,-9.8232,0.1322,0.9919,-9.8232,1.1266,16.2379,14.4814,942
-8.7915,-9.6834,-0.1251,2.072,-9.6834,3.0866,14.6533,7.3461,943
-2.5029,-10.0765,-0.1115,1.1771,-10.0765,2.2216,13.0625,8.0857,944
0.2698,-9.4295,4.5893,2.9886,-9.4295,0.4373,14.4477,10.207,946
-3.4353,-9.7319,0.2772,1.7103,-9.7319,3.2909,12.2581,6.7595,947
-0.1811,-9.9985,0.8648,0.8527,-9.9985,1.3262,16.5875,11.9285,948
-4.6164,-9.3146,1.7253,3.6368,-9.3146,1.4302,11.9835,10.4622,949
-3.9686,-9.7687,0.377,2.3716,-9.7687,2.4973,10.091,8.262,950
-1.093,-9.4806,-0.0051,0.7534,-9.4806,0.9743,11.3359,6.3699,951
-0.4693,-9.758,0.1835,0.5793,-9.758,0.8915,7.6003,6.6773,952
-0.8901,-10.0436,0.0006,0.4479,-10.0436,1.3272,11.9512,5.6761,953
-0.6067,-9.7721,0.0387,0.2606,-9.7721,0.7779,4.7659,2.5386,955
-0.4512,-9.7093,-0.0478,0.171,-9.7093,0.9201,9.8742,2.7422,956
-0.0731,-9.7317,0.5195,0.4606,-9.7317,0.5811,9.0335,5.2636,957
-1.9726,-9.6703,0.2918,1.5534,-9.6703,1.0921,12.0116,9.2914,958
-3.0049,-9.6555,0.7288,2.3794,-9.6555,2.6967,35.9059,26.986,960
-5.4011,-9.813,0.1806,1.7407,-9.813,3.1577,48.4711,29.2546,961
-2.9993,-9.4671,0.3889,2.0897,-9.4671,5.4732,21.7123,7.0871,962
-3.2477,-10.0599,-0.2871,1.7346,-10.0599,2.5177,14.4844,7.1838,963
-0.8689,-9.9301,0.2382,0.84,-9.9301,0.73,7.0895,4.537,964
-1.1172,-9.405,-0.111,0.6688,-9.405,0.7994,16.1959,2.3808,966
-1.9469,-9.874,0.2598,0.9582,-9.874,3.3856,13.7673,6.6086,967
-0.0935,-9.6923,0.265,0.4522,-9.6923,1.2638,6.6123,3.0915,968
-0.0482,-9.5158,0.1601,0.364,-9.5158,0.7989,6.5955,4.1149,969
-3.3399,-9.6838,0.0209,1.5753,-9.6838,0.9654,12.7855,6.3923,970
-0.1202,-9.8384,0.336,0.4638,-9.8384,1.0702,10.0237,8.6386,971
-2.7457,-9.8091,0.1319,1.4669,-9.8091,2.3641,14.3518,9.1935,973
-1.8607,-9.6593,0.7524,1.652,-9.6593,2.9647,12.5125,10.3199,974
-5.9959,-9.6021,-0.2532,3.4832,-9.6021,4.8313,18.9161,13.1091,976
-9.0785,-9.4162,-0.9937,3.02,-9.4162,2.7078,21.8162,6.4484,977
-3.3417,-9.7072,0.452,2.5848,-9.7072,5.1618,12.1588,9.2433,978
-6.3346,-9.7917,-1.5852,2.7011,-9.7917,2.5093,10.6932,8.6853,979
-4.8588,-9.7188,-0.3173,3.1664,-9.7188,1.4866,11.8023,9.1788,980
-3.67,-10.086,-1.8623,1.4547,-10.086,3.7899,17.8474,14.0368,981
-8.2226,-9.9677,-1.702,3.4784,-9.9677,4.0719,11.3879,5.7553,982
-10.7456,-9.6936,-0.2149,3.402,-9.6936,4.499,11.1396,6.7434,983
-10.9529,-10.2098,1.024,6.1663,-10.2098,3.6102,22.0516,15.4445,984
-10.753,-10.0735,-1.0851,3.9417,-10.0735,6.1229,16.7356,6.6165,985
-2.0743,-9.7718,0.0676,1.1277,-9.7718,2.5002,9.1917,5.6381,987
-3.8309,-9.8275,-0.1145,1.6267,-9.8275,2.1824,9.6983,6.9676,988
-1.035,-9.5271,1.2036,1.7669,-9.5271,3.4252,12.262,7.3308,989
-4.0848,-9.6709,-0.6699,2.9534,-9.6709,2.3619,15.8016,4.2645,990
-1.8016,-9.6413,-1.5915,0.2075,-9.6413,0.3662,2.9904,2.6812,991
-1.2551,-9.6621,0.3583,0.721,-9.6621,1.1073,3.0449,1.9341,993
0.132,-9.6674,0.2389,0.0638,-9.6674,0.1387,1.8782,1.7663,994
-0.7626,-9.6758,-0.4172,0.1981,-9.6758,0.4581,2.5309,2.2339,995
-0.2913,-9.6681,0.1494,0.2256,-9.6681,0.7579,2.2921,1.9591,996
-0.3961,-9.6739,-0.1319,0.1424,-9.6739,0.745,2.1228,1.9624,997
-0.2484,-9.67,-0.1127,0.0743,-9.67,0.3062,1.8558,1.6474,998
-0.2237,-9.6711,-0.1668,0.0456,-9.6711,0.121,1.8172,1.8013,999
0.0159,-9.6763,0.1708,0.0834,-9.6763,0.0907,2.0645,2.0181,1000
-0.1813,-9.6747,-0.1283,0.0232,-9.6747,0.0463,1.8454,1.8012,1001
-0.1038,-9.6729,-0.0279,0.0453,-9.6729,0.2956,1.6866,1.6221,1002
-0.23,-9.6712,-0.1101,0.0583,-9.6712,0.2695,1.8042,1.6919,1003
-0.0291,-9.6701,-0.0135,0.019,-9.6701,0.1024,1.6268,1.6023,1004
-0.2129,-9.6715,-0.1431,0.0553,-9.6715,0.1312,1.9174,1.8409,1005
-0.1515,-9.671,-0.1046,0.0224,-9.671,0.0812,1.7005,1.6702,1006
-0.1823,-9.6719,-0.1188,0.0423,-9.6719,0.2026,1.7874,1.6438,1007
-0.1382,-9.6725,-0.0928,0.0218,-9.6725,0.0839,1.6546,1.6396,1008
-0.1503,-9.6705,-0.1391,0.0073,-9.6705,0.0202,1.7072,1.6893,1009
-0.1528,-9.6694,-0.1304,0.0117,-9.6694,0.0403,1.7078,1.6814,1010
-0.2297,-9.6706,-0.0914,0.0695,-9.6706,0.2144,1.7356,1.6099,1011
-0.1584,-9.6719,-0.1053,0.0233,-9.6719,0.0975,1.7098,1.6483,1012
-0.1203,-9.6717,-0.0967,0.0148,-9.6717,0.0466,1.6557,1.6294,1013
-0.9096,-9.6646,-0.2776,0.2795,-9.6646,0.5272,2.4351,1.7433,1015
-2.1178,-9.6867,0.317,1.315,-9.6867,2.0801,12.97,8.7234,1016
-0.5725,-9.4025,0.5631,1.2679,-9.4025,0.9736,8.4973,6.6682,1017
-2.0125,-9.6638,0.9305,1.9605,-9.6638,3.5389,17.1048,11.3644,1018
-7.2888,-9.7482,-0.0249,3.5465,-9.7482,5.8598,26.1938,16.5679,1019
-2.8979,-9.6986,-0.6837,1.2064,-9.6986,1.9829,5.2627,4.092,1021
-7.5679,-9.6632,-0.181,2.5884,-9.6632,5.4892,17.6061,8.2139,1022
-14.4843,-9.8323,1.9425,7.1165,-9.8323,10.0526,27.8281,15.0864,1023
-3.1086,-9.8531,0.0675,1.7411,-9.8531,4.0251,15.3712,9.062,1024
-1.104,-10.0305,0.7055,1.0894,-10.0305,1.7327,9.1444,4.559,1025
-4.4338,-10.0232,0.1606,2.252,-10.0232,1.8991,11.798,9.1859,1026
-0.6423,-9.5889,-0.1894,0.4295,-9.5889,1.4029,6.7013,3.7655,1027
-6.9861,-9.7165,0.5662,3.7126,-9.7165,5.6403,16.8158,6.6589,1028
-7.1665,-9.568,-0.1703,4.5718,-9.568,2.3944,18.5271,13.9886,1029
-2.2251,-9.698,0.7248,1.6381,-9.698,5.1773,14.5883,7.8456,1032
-2.6531,-9.8011,0.389,1.9502,-9.8011,2.671,13.0176,9.9927,1033
-2.26,-9.3134,-0.0705,1.2444,-9.3134,1.6594,8.9696,4.4388,1035
-10.3294,-9.8084,0.3254,6.1816,-9.8084,6.5806,48.7532,24.8732,1036
-1.4206,-9.9778,-0.0094,1.0825,-9.9778,1.5181,22.8846,9.8488,1037
-5.4736,-9.7083,1.5116,3.7793,-9.7083,3.5163,30.3184,26.5673,1038
-3.907,-9.566,-1.5113,1.5211,-9.566,1.3912,20.7961,17.3298,1039
-14.734,-9.7531,3.2495,8.8102,-9.7531,4.2282,29.38,19.3373,1041
-7.5358,-9.7255,-0.4323,2.7005,-9.7255,5.6361,15.1182,8.7334,1042
-7.2443,-9.6601,-0.1683,4.3401,-9.6601,6.3389,19.5108,11.0002,1043
-3.0863,-9.5028,0.0755,2.0862,-9.5028,1.4202,7.0846,6.6891,1044
-6.7129,-9.9571,1.4885,7.8656,-9.9571,7.1357,26.9019,22.5325,1045
-2.8624,-9.7557,-1.0187,1.1991,-9.7557,2.1295,8.1728,4.5947,1046
-3.3145,-9.6172,1.7476,4.4486,-9.6172,5.4936,16.1118,10.1133,1047
-4.2039,-9.8128,-0.3755,1.459,-9.8128,4.4015,15.9141,5.595,1048
-7.5044,-9.6184,-0.9911,2.8426,-9.6184,3.3827,13.6045,8.4077,1049
-4.901,-9.7073,-0.7262,1.8169,-9.7073,3.1493,12.6037,4.5661,1051
-3.7701,-9.7148,0.3754,1.8174,-9.7148,4.5642,12.9376,5.5945,1052
-1.5846,-9.4344,-0.0638,1.245,-9.4344,3.2799,6.9378,4.0308,1053
-1.0433,-9.6935,0.8721,1.3261,-9.6935,2.5167,5.2049,3.8528,1054
-1.0285,-9.9392,0.1543,0.6117,-9.9392,1.5546,9.333,5.1256,1055
-2.7418,-9.7358,0.7746,4.7729,-9.7358,5.8803,16.6498,11.0388,1057
-3.9481,-9.9695,-0.1881,1.9651,-9.9695,3.1048,15.7685,4.8892,1058
-2.2032,-9.5952,0.5984,2.4895,-9.5952,2.9401,15.2359,7.2358,1060
-9.9378,-9.7749,-1.2048,2.6051,-9.7749,3.5972,14.2163,6.3886,1061
-3.7635,-9.9772,2.1285,4.4687,-9.9772,4.8719,18.3105,8.7593,1063
-3.5737,-9.5794,0.5707,2.6084,-9.5794,4.5848,11.5782,5.5783,1064
-2.9324,-9.5745,1.7446,3.4663,-9.5745,6.362,19.7644,12.0243,1066
-6.105,-9.4852,3.3456,5.6928,-9.4852,4.5432,17.0108,12.1095,1067
-6.9508,-9.6963,-0.0076,4.4776,-9.6963,1.216,15.6114,10.822,1068
-0.3467,-9.4422,1.7867,4.1957,-9.4422,4.3064,14.5752,5.181,1069
-2.6322,-10.0973,0.331,1.7596,-10.0973,3.8953,16.7371,13.6278,1070
-0.9513,-9.4758,0.2668,0.6075,-9.4758,2.1903,6.4693,5.547,1071
-0.0605,-9.8042,0.2246,0.2035,-9.8042,2.4072,8.1612,4.8879,1072
-0.2468,-9.761,0.1214,0.3601,-9.761,1.5499,6.6881,3.9628,1073
-1.2699,-9.7744,-0.1648,0.5374,-9.7744,1.1199,6.1431,4.9678,1074
-5.2543,-9.7922,-1.2143,1.9382,-9.7922,4.0854,9.5704,6.7301,1076
-8.8569,-9.6244,2.2456,7.1382,-9.6244,8.6871,32.2672,16.7667,1077
-11.586,-9.7335,6.4796,14.2328,-9.7335,2.6224,28.6394,23.3025,1078
-4.6108,-8.3047,1.6464,3.1354,-8.3047,1.1948,16.9755,12.4244,1079
-2.0168,-10.0272,0.0845,0.9263,-10.0272,1.1894,9.167,4.8141,1080
-8.6398,-9.6608,1.0332,3.6889,-9.6608,6.496,22.5144,10.9187,1082
-4.3333,-9.7626,1.4308,2.66,-9.7626,6.4629,18.5438,17.0939,1083
-0.2069,-9.7353,0.1967,0.3506,-9.7353,1.855,8.3769,6.9923,1084
0.069,-9.7657,1.5921,1.1854,-9.7657,3.3565,16.7347,13.6053,1085
-5.365,-9.7381,-0.1874,3.3105,-9.7381,5.548,12.2188,9.5816,1086
0.0563,-9.5439,1.4975,1.3606,-9.5439,6.1681,12.1085,8.5802,1088
-1.5791,-9.8243,0.1917,1.8316,-9.8243,2.886,11.6228,7.5748,1089
-1.5093,-9.6795,1.4434,3.1292,-9.6795,4.3434,17.2321,8.9425,1090
-0.6801,-9.9148,0.5451,1.0097,-9.9148,3.2496,9.2502,7.0704,1091
-1.8157,-9.7512,0.6547,1.5239,-9.7512,2.1024,9.7857,7.6721,1092
-1.7864,-9.8658,-0.0376,0.99,-9.8658,2.5136,12.0305,9.1058,1093
-2.1209,-9.5951,0.5791,1.3008,-9.5951,1.6707,10.4095,5.8683,1094
-2.3144,-9.7494,-0.08,1.2001,-9.7494,2.0906,12.9737,7.3656,1096
-0.5814,-9.7716,0.8635,1.4824,-9.7716,1.2759,22.403,18.7108,1097
-2.1669,-9.7904,1.3136,2.2992,-9.7904,3.3378,41.519,34.761,1098
-2.7203,-10.2144,1.8573,2.1445,-10.2144,2.1161,43.2744,35.5902,1099
-1.1871,-9.8597,2.0797,3.1067,-9.8597,2.8161,29.6446,12.2903,1101
-0.8195,-9.9399,0.5158,0.9271,-9.9399,1.1805,5.3296,4.2587,1102
-4.4094,-9.5781,0.8417,3.5089,-9.5781,5.2302,20.3151,13.2211,1103
-0.1981,-9.704,1.7586,1.3018,-9.704,1.3725,8.0078,7.3432,1104
-5.818,-9.4995,0.0075,3.3247,-9.4995,6.535,13.193,7.2971,1106
-9.048,-9.7313,3.262,7.5425,-9.7313,7.8309,25.9312,11.9978,1107
-4.2437,-9.731,-0.5041,1.4015,-9.731,2.6483,8.7447,5.4423,1108
-1.7582,-9.8495,1.0268,1.4675,-9.8495,2.582,12.0797,6.8577,1109
-0.5534,-9.6046,1.4804,2.4665,-9.6046,4.5889,13.2886,6.8718,1110
-1.3261,-9.3061,0.0086,0.6112,-9.3061,1.0394,18.1511,3.6278,1112
-0.7219,-9.8234,0.0479,0.9135,-9.8234,1.5205,22.4961,6.9315,1113
-0.9798,-9.7339,-0.1498,0.4364,-9.7339,0.8912,9.4305,7.0734,1114
-1.8616,-9.7788,-0.3728,0.8888,-9.7788,2.0345,9.2597,5.5976,1115
-1.2203,-9.7945,-0.4859,0.5657,-9.7945,1.6038,20.604,17.6053,1116
-4.3012,-9.7649,0.723,4.5989,-9.7649,3.7134,28.1266,23.7862,1117
-1.2092,-10.0098,1.1113,1.5272,-10.0098,3.1995,37.726,26.8283,1118
-0.3761,-9.9268,0.6147,0.6829,-9.9268,1.3855,25.6095,24.2328,1119
-3.4357,-9.7439,-0.0804,3.1022,-9.7439,1.8524,12.1575,8.9199,1120
0.8014,-9.4373,6.5321,4.208,-9.4373,1.3073,29.866,21.3222,1121
-4.2314,-9.7996,1.2375,4.432,-9.7996,3.6986,23.2527,16.8916,1122
-6.3711,-9.6191,-1.671,2.8192,-9.6191,1.0411,11.4872,8.606,1123
-1.2945,-10.2012,1.5498,2.1315,-10.2012,2.1227,16.0324,13.2164,1124
-8.5484,-9.7666,-2.2248,3.5209,-9.7666,1.8846,17.2228,13.3338,1125
-2.5428,-9.8355,-0.2929,1.0957,-9.8355,1.2392,6.9428,3.8054,1126
-0.9826,-10.0713,0.002,0.7205,-10.0713,1.6509,10.0893,5.0516,1127
-12.6538,-9.7403,-2.3776,3.5355,-9.7403,5.4852,14.1253,6.9241,1128
-1.6415,-9.6413,1.0426,2.5538,-9.6413,4.1427,11.3541,9.3646,1129
-1.409,-9.3778,0.3627,1.5882,-9.3778,0.5496,5.0749,4.6968,1131
-1.9628,-9.8324,-0.1983,0.6657,-9.8324,1.8327,10.8433,3.533,1132
-2.8047,-9.5204,-1.3765,1.1764,-9.5204,1.0153,14.0395,7.7955,1133
-4.5367,-9.9726,-0.9132,1.6025,-9.9726,1.2977,4.7747,2.8198,1134
-0.4309,-9.7032,0.7529,1.2421,-9.7032,2.0942,9.4524,5.2339,1135
-2.8993,-9.8224,-0.2232,1.8185,-9.8224,1.2021,10.5459,6.4563,1136
-0.3086,-9.6877,0.6962,0.9821,-9.6877,0.9909,9.973,8.2342,1137
-0.6569,-9.6883,0.1271,0.5112,-9.6883,2.6913,5.4824,4.4219,1138
-0.4213,-9.8068,0.4248,0.4783,-9.8068,0.6818,6.8943,5.7004,1139
-2.031,-9.712,-0.0692,0.7378,-9.712,1.3329,8.6287,3.6616,1141
-1.8596,-9.8592,0.4357,1.6653,-9.8592,3.2862,12.2651,7.5189,1142
-0.0542,-9.719,0.0509,0.152,-9.719,0.3972,4.3643,2.481,1143
-0.9242,-9.7079,-0.0124,0.5016,-9.7079,0.9815,11.5498,8.0928,1144
-1.4017,-9.7999,-0.2787,0.8137,-9.7999,1.0213,6.3291,4.9447,1145
0.2353,-9.7308,1.0518,0.6319,-9.7308,0.8727,3.4963,3.1164,1147
-1.9436,-9.728,-0.8456,0.6086,-9.728,0.7171,3.2067,2.2829,1148
0.1287,-9.7313,0.3065,0.1466,-9.7313,0.2874,2.1338,1.8908,1149
-0.2878,-9.7306,-0.1872,0.0484,-9.7306,0.0992,1.6918,1.6504,1150
-0.9264,-9.7218,-0.8466,0.0674,-9.7218,0.0493,2.282,2.2076,1151
-0.2566,-9.7295,0.2144,0.233,-9.7295,0.4269,1.8108,1.7133,1152
-0.2933,-9.7285,-0.1607,0.0885,-9.7285,0.2057,1.8216,1.6144,1153
-0.4692,-9.7321,-0.2772,0.1483,-9.7321,0.3445,1.9563,1.7519,1154
-0.2169,-9.7307,-0.0705,0.0816,-9.7307,0.206,1.6979,1.6191,1156
-0.2573,-9.7314,-0.1908,0.0448,-9.7314,0.117,1.7663,1.6686,1157
-0.2563,-9.7327,-0.2085,0.0519,-9.7327,0.1287,1.7553,1.7173,1159
-0.702,-9.7338,-0.151,0.2618,-9.7338,0.685,2.1791,1.6815,1160
-0.0792,-9.7365,-0.0271,0.0527,-9.7365,0.1813,1.6278,1.6009,1161
-0.0663,-9.7258,0.0335,0.077,-9.7258,0.266,2.8769,2.6449,1162
-1.0383,-9.7166,-0.0182,0.5406,-9.7166,3.6831,13.3743,5.1521,1163
0.419,-9.0582,1.2337,0.7818,-9.0582,1.512,17.7123,6.728,1164
-1.0456,-9.84,0.1732,0.6816,-9.84,0.9571,6.8534,5.7452,1165
-3.6901,-9.5392,-0.6735,1.4218,-9.5392,2.1314,6.5623,6.004,1166
-2.9174,-9.4812,0.0078,1.7423,-9.4812,2.408,16.2939,14.4255,1167
-8.0256,-10.2725,-1.8779,3.6623,-10.2725,5.3133,26.5932,12.2361,1168
-2.9464,-9.551,0.641,2.0191,-9.551,1.2163,11.435,9.8093,1169
-0.6088,-9.6494,0.4443,0.7361,-9.6494,0.9469,11.5597,7.6032,1170
-0.6447,-9.7138,2.2874,2.2136,-9.7138,1.2804,13.5944,10.5173,1171
-1.4627,-9.934,0.2342,0.9965,-9.934,0.8726,7.4647,4.3469,1172
-1.7554,-9.3804,-0.3026,1.2635,-9.3804,1.7707,10.6293,4.741,1173
-0.7757,-8.9685,-0.2507,0.3385,-8.9685,1.3561,14.1725,8.8176,1174
-0.3752,-9.6805,0.1539,0.7481,-9.6805,1.8046,11.2769,8.3373,1175
-1.7075,-8.8004,0.1957,1.022,-8.8004,2.0214,10.9515,5.8691,1176
-1.866,-7.6973,-0.164,0.8009,-7.6973,1.9634,27.2059,12.457,1177
-2.0196,-8.8098,0.3612,2.4079,-8.8098,3.671,25.1296,14.2927,1178
-0.3648,-9.7996,0.2385,0.7209,-9.7996,1.0964,6.7928,3.1134,1180
-1.5826,-9.7825,0.2698,1.1011,-9.7825,2.7263,16.4497,7.8791,1181
-20.7217,-8.9753,-0.1347,5.8517,-8.9753,5.9045,22.4679,10.6922,1182
-22.7672,-7.5862,1.7291,18.1053,-7.5862,5.7096,22.7195,10.3386,1183
-3.8267,-9.8559,2.5145,5.5002,-9.8559,4.568,23.4879,13.4329,1184
-4.7993,-9.8679,-0.6145,1.3006,-9.8679,2.7952,9.1589,5.4075,1186
-15.2448,-9.7375,-1.0769,3.387,-9.7375,4.6381,13.157,8.399,1187
-13.4993,-9.6644,-0.4142,5.154,-9.6644,8.4291,16.0671,12.3958,1188
-6.0302,-9.7114,0.8034,2.8892,-9.7114,4.1814,13.1529,8.5649,1189
-2.9643,-9.7685,0.091,1.2758,-9.7685,2.2875,10.8274,5.3459,1190
-1.9682,-9.6811,0.0825,0.6727,-9.6811,2.0232,9.7969,4.1326,1191
-1.9809,-9.79,0.0612,0.7923,-9.79,1.6006,11.0312,5.2661,1192
-1.3889,-9.7638,0.2503,0.7138,-9.7638,1.3535,7.7787,4.4701,1193
-0.4616,-9.4999,-0.015,0.338,-9.4999,0.6093,7.8452,3.5473,1194
-0.6312,-9.7359,0.2334,0.7583,-9.7359,2.3472,11.4758,8.7815,1196
-2.0998,-9.7262,0.5711,1.4476,-9.7262,2.8275,10.7489,7.9976,1197
-0.7569,-9.6615,-0.0029,0.337,-9.6615,1.3817,10.8699,3.3482,1198
-0.8025,-9.5743,-0.1237,0.3772,-9.5743,1.0578,9.2331,5.0763,1199
-4.7941,-9.6548,0.1213,1.4927,-9.6548,1.9468,23.3917,14.8737,1201
-6.6919,-9.5954,0.0365,3.7327,-9.5954,1.5821,31.3561,25.814,1202
-2.4473,-9.4258,1.3241,3.0217,-9.4258,3.9004,41.0538,33.4268,1203
-2.5305,-9.2568,0.5622,3.0579,-9.2568,3.1438,21.6424,10.149,1204
-0.293,-9.6127,0.6269,1.0694,-9.6127,1.9691,21.3565,19.4747,1205
-3.7147,-9.8133,0.4068,3.2699,-9.8133,4.0925,20.6579,9.4196,1207
-16.0496,-9.9234,2.8924,10.1732,-9.9234,2.7363,37.9966,26.9143,1208
-16.4799,-10.2212,1.7939,10.0707,-10.2212,6.9057,61.854,56.7293,1209
-3.0562,-9.9807,-0.8016,1.465,-9.9807,2.5292,33.9362,28.6618,1210
-3.56,-9.7556,1.8951,6.2352,-9.7556,7.3062,25.6295,11.9963,1211
-3.5007,-10.0236,-0.7954,1.3823,-10.0236,2.9571,9.605,6.5835,1212
-7.1956,-9.8013,0.3642,4.3935,-9.8013,5.4473,18.7004,9.4444,1213
-3.9842,-9.8095,-0.2564,2.6345,-9.8095,4.4066,10.5634,7.606,1214
-1.2667,-9.6543,-0.4896,0.6559,-9.6543,0.9781,9.9325,6.1636,1215
0.0417,-9.6055,1.2593,1.0039,-9.6055,2.0349,5.9785,5.4377,1217
-0.7731,-9.9268,-0.0569,0.5608,-9.9268,1.2314,6.6254,3.1516,1218
-1.9565,-9.6767,0.1286,1.1291,-9.6767,0.7049,5.7221,4.2604,1219
-0.1341,-9.8791,0.7722,1.1964,-9.8791,2.2348,7.7788,5.3934,1220
-0.588,-9.7877,0.3074,0.8565,-9.7877,0.6439,7.6723,7.2101,1221
-0.1105,-9.7601,0.053,0.2231,-9.7601,0.4824,8.5572,7.69,1222
-0.6739,-9.7384,-0.1067,0.3191,-9.7384,1.205,13.5114,8.6081,1223
-1.1527,-9.7843,-0.0758,0.6905,-9.7843,1.5238,18.218,14.7168,1224
-1.5936,-9.7487,0.0274,0.86,-9.7487,2.5476,18.5762,7.0896,1225
-2.1846,-9.7488,-0.4982,0.6968,-9.7488,1.7128,9.8316,6.438,1226
-10.4875,-9.767,-1.2925,2.9366,-9.767,2.8832,18.736,9.969,1227
-4.8791,-9.6564,-2.4152,2.1757,-9.6564,2.4035,5.1851,4.2275,1228
-7.5349,-9.698,1.0392,2.5105,-9.698,3.751,15.6639,6.3545,1229
-3.025,-9.7532,0.0473,1.4458,-9.7532,2.0886,10.4298,3.9259,1231
-2.9045,-9.7496,0.2375,1.3816,-9.7496,3.2785,14.5877,4.9292,1232
-4.2006,-9.5578,-0.0689,2.536,-9.5578,1.9296,8.5755,7.7706,1233
-0.9745,-9.8195,-0.1172,0.3755,-9.8195,1.0917,6.3914,5.3227,1234
-1.1517,-9.6852,0.546,1.0453,-9.6852,0.4832,6.7213,4.822,1235
-0.6393,-9.6157,0.0296,0.3157,-9.6157,0.8488,3.7701,2.4295,1236
-2.5825,-9.8586,-0.5263,0.8819,-9.8586,1.8589,7.7641,5.0419,1237
-5.3568,-9.7927,-0.1967,3.3624,-9.7927,4.718,15.186,9.4563,1238
-4.0467,-9.7434,0.703,2.2981,-9.7434,5.599,14.1769,6.9011,1240
-1.612,-9.7242,0.1928,0.8914,-9.7242,2.1271,13.1261,3.9626,1241
-0.854,-9.9653,0.0561,0.6154,-9.9653,1.8125,7.5389,5.5641,1242
-1.1057,-9.847,0.0725,0.5251,-9.847,1.9806,6.1278,4.5483,1243
-0.3799,-9.9146,-0.0332,0.2939,-9.9146,1.3952,4.1493,3.5914,1244
-2.0503,-9.6456,0.7935,1.6144,-9.6456,1.0176,8.5445,8.0689,1246
-8.389,-9.021,0.422,3.6418,-9.021,5.3356,27.4695,9.2123,1247
-0.5807,-9.5928,6.2021,5.8486,-9.5928,4.1023,13.0771,10.34,1248
-0.6082,-10.058,0.3194,0.671,-10.058,3.005,10.7036,7.5201,1249
-0.6819,-9.7804,0.1177,0.4677,-9.7804,1.1321,4.0558,3.3832,1250
-3.1407,-9.6664,0.1829,1.5731,-9.6664,2.987,8.302,4.3727,1251
-0.6564,-9.6465,-0.125,0.5196,-9.6465,1.8613,4.4033,3.2846,1252
-2.1782,-9.6367,0.1695,1.4326,-9.6367,2.3686,10.6638,5.9113,1253
-0.1263,-9.8658,0.2307,0.438,-9.8658,1.3686,4.636,3.2375,1255
-1.6901,-9.7993,0.2,0.8394,-9.7993,1.9914,8.308,3.8573,1256
-0.8665,-9.7305,0.0657,0.4621,-9.7305,1.3087,4.4699,3.7998,1257
-0.219,-9.7658,0.1891,0.2422,-9.7658,0.9929,9.2213,6.1876,1258
-0.8844,-9.7305,0.7466,1.1586,-9.7305,0.4712,10.6136,8.8203,1259
-2.4825,-9.7506,-0.8273,1.0566,-9.7506,1.2162,9.287,7.8901,1261
-1.8808,-9.7312,-0.4645,0.5955,-9.7312,1.543,4.8554,2.2793,1262
-2.0383,-9.729,-0.4081,0.694,-9.729,1.0569,3.2471,1.6797,1263
-0.0313,-9.7285,0.0779,0.0552,-9.7285,0.1354,1.6584,1.6292,1264
-0.0521,-9.736,-0.0136,0.0304,-9.736,0.1013,1.6036,1.5901,1265
-0.5418,-9.7346,-0.2801,0.1888,-9.7346,0.4124,2.0289,1.7119,1266
0.0156,-9.7337,0.0685,0.0403,-9.7337,0.1799,1.678,1.6497,1267
-0.1797,-9.7337,-0.0466,0.1059,-9.7337,0.3081,1.6658,1.6205,1268
-0.1751,-9.742,-0.1079,0.0522,-9.742,0.2199,1.7463,1.6188,1269
-0.426,-9.7353,-0.1115,0.113,-9.7353,0.3426,2.0807,1.6308,1271
-3.0173,-9.7321,0.0206,1.146,-9.7321,2.7963,7.6446,3.9036,1272
-0.0355,-9.7506,0.1862,0.1173,-9.7506,0.3114,2.5714,2.0951,1273
0.0919,-9.7542,0.174,0.0726,-9.7542,0.2576,2.3328,1.858,1274
-0.4031,-9.7538,0.0131,0.3402,-9.7538,0.7901,4.1843,3.1919,1275
-0.1716,-9.7228,0.4886,0.459,-9.7228,0.6049,3.9234,3.6363,1276
-2.1602,-9.7325,-0.3797,1.1303,-9.7325,1.5885,3.47,2.1078,1277
-0.3183,-9.7433,-0.1435,0.0993,-9.7433,0.2462,2.0509,1.8362,1278
0.0027,-9.7393,0.0289,0.0125,-9.7393,0.0748,1.7014,1.6471,1279
-1.081,-9.7444,-0.5396,0.3192,-9.7444,0.184,2.568,2.3733,1281
-1.023,-9.7209,0.1331,0.5886,-9.7209,1.2347,6.0732,2.5351,1282
-3.4819,-9.5723,-1.2626,1.276,-9.5723,0.977,12.3196,9.2812,1283
-1.1403,-9.2531,2.7273,2.047,-9.2531,1.5525,16.1639,15.2194,1284
-4.7031,-9.7376,-1.1604,2.1123,-9.7376,2.1171,8.8485,6.7824,1285
0.0088,-9.83,1.9494,1.9878,-9.83,4.0871,10.9293,9.4982,1286
-9.9129,-9.7233,3.9156,9.7316,-9.7233,2.6624,21.0346,17.2445,1287
-1.6612,-9.7155,0.4378,1.1723,-9.7155,2.4927,9.646,6.9095,1288
-0.9641,-9.6021,-0.0053,0.7669,-9.6021,1.7286,12.5653,10.6641,1289
-1.9735,-9.9019,-0.2188,0.6594,-9.9019,1.6603,6.5,3.8955,1291
-4.1164,-9.8523,-0.746,1.5872,-9.8523,3.7478,11.4266,7.0162,1292
-0.7318,-9.3436,0.119,0.5889,-9.3436,1.2205,8.9542,4.3237,1293
-0.6419,-9.027,-0.0597,0.4577,-9.027,1.1338,11.8404,5.3776,1294
-2.642,-10.1547,-0.3779,1.4989,-10.1547,2.7043,17.55,8.1745,1295
-2.1051,-10.1334,-0.3935,0.915,-10.1334,1.6595,8.0401,4.8233,1296
-3.0708,-9.2443,-0.0381,1.4362,-9.2443,0.8735,10.3207,5.5836,1297
-3.4771,-8.6457,0.2549,2.0479,-8.6457,3.0171,25.7634,8.5895,1298
-1.4589,-9.7649,4.485,4.1864,-9.7649,5.1587,11.1081,8.8668,1299
-11.3484,-9.8266,-0.4411,4.5779,-9.8266,4.3392,15.6,8.4027,1301
-7.0076,-9.8744,-0.6794,3.2228,-9.8744,5.3464,13.9548,8.3103,1302
-3.4939,-9.7591,2.1463,4.3438,-9.7591,4.398,16.0541,7.4479,1303
-0.9218,-10.184,0.488,1.2893,-10.184,2.2131,6.7709,5.3923,1304
-1.2079,-9.6957,0.1021,0.9623,-9.6957,1.1726,7.2329,5.1387,1305
-1.4625,-9.7071,-0.2318,0.8259,-9.7071,0.9244,6.3411,4.3445,1306
-0.2298,-9.9287,0.1455,0.4252,-9.9287,1.1057,5.0753,3.2771,1307
-0.9618,-9.9638,1.1756,2.677,-9.9638,3.2335,13.2744,10.4273,1308
-1.6185,-9.6921,0.2684,1.2635,-9.6921,1.1397,9.5949,8.4161,1309
-0.9053,-9.8419,0.1903,0.5977,-9.8419,1.1785,6.0978,5.385,1310
-1.208,-9.7639,0.0321,0.3582,-9.7639,1.4878,6.4995,3.1048,1312
-1.5568,-9.9606,-0.416,0.6858,-9.9606,1.7978,6.9336,3.4069,1313
-0.0831,-9.8173,0.0191,0.071,-9.8173,0.4133,4.4329,3.5755,1314
-1.4433,-9.8152,0.6545,1.3229,-9.8152,2.6733,11.2724,8.2555,1315
-1.0194,-9.7624,-0.0576,0.6077,-9.7624,1.0552,6.6126,4.2768,1316
-2.7937,-9.7501,-1.046,1.2026,-9.7501,2.1973,5.4677,4.0802,1317
-1.9261,-9.726,-0.3367,0.5956,-9.726,0.9674,3.3146,1.7357,1319
-0.3381,-9.7304,-0.2463,0.068,-9.7304,0.1475,1.7076,1.6535,1320
-0.1988,-9.7343,-0.1207,0.0393,-9.7343,0.1168,1.6934,1.61,1321
-0.5394,-9.7321,-0.3032,0.1303,-9.7321,0.2462,1.8831,1.6933,1322
-0.5249,-9.7301,-0.2894,0.1378,-9.7301,0.2674,1.8271,1.6943,1323
-0.2881,-9.7242,0.0743,0.2312,-9.7242,0.4637,1.7661,1.6352,1324
-0.3103,-9.734,-0.1872,0.0812,-9.734,0.1894,1.7388,1.6599,1325
-0.3818,-9.7313,-0.1192,0.0896,-9.7313,0.1923,1.7181,1.6085,1327
-0.131,-9.733,0.0575,0.0627,-9.733,0.1778,1.9372,1.6931,1328
-0.3744,-9.7325,-0.3053,0.0556,-9.7325,0.1168,1.7638,1.7372,1329
-0.2836,-9.7321,-0.1583,0.0725,-9.7321,0.1499,1.6778,1.6103,1330
-0.4054,-9.7332,-0.3592,0.0424,-9.7332,0.0901,1.8836,1.7743,1331
-0.2153,-9.7299,-0.142,0.0344,-9.7299,0.0633,1.6527,1.6024,1332
-0.3873,-9.7335,-0.2644,0.0583,-9.7335,0.1394,1.7675,1.6665,1333
-0.4402,-9.7294,-0.3905,0.038,-9.7294,0.0712,1.7939,1.7319,1334
-0.338,-9.7283,-0.2432,0.0804,-9.7283,0.1551,1.6907,1.603,1335
-0.4083,-9.7284,-0.2928,0.0385,-9.7284,0.066,1.7384,1.6634,1336
-0.3978,-9.7283,-0.3712,0.0196,-9.7283,0.0231,1.7391,1.7119,1337
-0.3913,-9.7275,-0.32,0.0567,-9.7275,0.1007,1.7399,1.6843,1338
-0.4991,-9.728,-0.3877,0.0675,-9.728,0.0955,1.7752,1.7136,1339
-0.2138,-9.7278,-0.1542,0.0411,-9.7278,0.0693,1.6352,1.6014,1340
-0.172,-9.7298,-0.0643,0.0707,-9.7298,0.1568,1.6208,1.6064,1341
-0.2631,-9.7316,-0.1767,0.0485,-9.7316,0.118,1.7013,1.6139,1342
-0.316,-9.7325,-0.2505,0.0419,-9.7325,0.0936,1.7097,1.6516,1343
-0.2488,-9.7323,-0.222,0.0182,-9.7323,0.0389,1.659,1.6376,1344
-0.1597,-9.7314,-0.0892,0.0505,-9.7314,0.1023,1.6681,1.6014,1345
-0.2054,-9.7321,-0.196,0.0059,-9.7321,0.0113,1.645,1.6243,1346
-0.31,-9.7314,-0.2976,0.0108,-9.7314,0.0182,1.707,1.6982,1347
-0.1925,-9.7332,0.0681,0.1982,-9.7332,0.6424,1.988,1.7054,1348
-0.5764,-9.715,0.1441,0.5008,-9.715,1.5303,6.9576,3.3855,1349
-0.3547,-9.7269,0.0236,0.1676,-9.7269,1.5017,4.4537,3.0846,1350
-1.3075,-9.7036,0.2967,0.9679,-9.7036,2.6431,7.7072,6.3409,1351
-2.6903,-9.6896,0.9493,2.2092,-9.6896,4.2062,11.0095,7.9671,1352
-4.652,-9.6522,0.3954,2.6955,-9.6522,4.8845,24.6332,7.4269,1353
-27.3791,-9.7873,3.3707,17.1299,-9.7873,10.8471,24.0751,16.4699,1354
-7.9036,-9.4079,13.33,18.0509,-9.4079,9.5441,36.1001,21.3124,1355
-3.6265,-9.1673,1.0118,2.3067,-9.1673,2.0915,14.7244,9.2152,1356
-4.9254,-9.7251,0.5953,5.3943,-9.7251,2.7104,15.7091,6.4981,1357
-9.7191,-9.7782,-0.0864,6.0656,-9.7782,8.5565,29.0965,15.4168,1358
-10.383,-9.7185,0.3766,4.3191,-9.7185,2.9172,12.0933,8.4628,1360
-12.0296,-9.7925,-0.3082,4.1971,-9.7925,7.14,20.7386,10.4739,1361
-13.6144,-9.6759,0.1807,5.216,-9.6759,5.6541,18.4578,7.3447,1362
-6.0517,-9.7756,-0.1687,2.9837,-9.7756,5.2699,19.103,6.6125,1363
-2.4016,-9.701,-0.1745,1.3132,-9.701,2.76,7.1521,5.1204,1365
-3.3055,-9.8037,0.2203,1.7008,-9.8037,2.8793,9.9605,6.9972,1366
-0.7183,-9.6909,0.5651,1.1302,-9.6909,2.0388,6.4638,5.1514,1367
-2.6936,-9.8056,-0.9087,1.3304,-9.8056,2.5336,9.7106,5.2895,1368
-1.9164,-9.663,0.6121,1.6092,-9.663,1.9447,8.3978,7.8193,1370
-1.3947,-9.7851,0.9158,1.7785,-9.7851,4.0586,11.9959,6.7279,1371
-0.3824,-9.6642,0.6448,0.7647,-9.6642,1.0533,7.3777,6.5617,1372
-0.3501,-9.7647,0.2237,0.3946,-9.7647,1.3034,5.8547,3.0593,1373
-0.5445,-9.7722,0.2899,0.5347,-9.7722,0.6401,5.1451,4.2324,1375
-4.8942,-9.7265,-0.6173,1.1314,-9.7265,1.5859,5.7284,1.9183,1376
-0.8745,-9.7159,-0.6518,0.1603,-9.7159,0.3491,2.3118,2.0342,1377
-1.502,-9.7025,-0.3907,0.5649,-9.7025,0.7503,2.3492,1.7862,1378
0.1786,-9.7061,0.4579,0.27,-9.7061,0.306,2.4975,2.0882,1380
-1.0378,-9.7088,-0.4293,0.2684,-9.7088,0.4197,2.1432,1.7164,1381
-0.4544,-9.7127,-0.216,0.1396,-9.7127,0.2401,1.7582,1.6233,1382
-0.3993,-9.7103,-0.3143,0.0563,-9.7103,0.0943,1.7255,1.6562,1383
-0.1514,-9.7123,-0.0449,0.0647,-9.7123,0.1098,1.6581,1.5812,1384
-0.7265,-9.7114,-0.6112,0.0828,-9.7114,0.1275,1.9812,1.8856,1386
-0.5161,-9.7095,-0.3795,0.0752,-9.7095,0.1281,1.7548,1.7054,1387
-0.5515,-9.7042,-0.4823,0.0537,-9.7042,0.0802,1.761,1.7064,1388
-0.7173,-9.7054,-0.2878,0.2791,-9.7054,0.3619,1.8474,1.6249,1389
-0.6201,-9.7058,-0.3641,0.1643,-9.7058,0.2225,1.7909,1.6311,1390
-1.173,-9.7042,-0.9191,0.1421,-9.7042,0.161,2.2272,2.039,1391
-0.3975,-9.7034,-0.3118,0.0707,-9.7034,0.0678,1.6613,1.5953,1392
-0.7715,-9.7003,-0.5535,0.1434,-9.7003,0.1785,1.8333,1.7739,1393
-0.5283,-9.6949,-0.4669,0.0533,-9.6949,0.0708,1.6998,1.6695,1394
-0.6273,-9.7003,-0.1594,0.4501,-9.7003,0.6553,1.8112,1.702,1396
-0.692,-9.6983,-0.2813,0.1628,-9.6983,0.2083,1.7871,1.6021,1397
-0.5584,-9.7008,-0.5217,0.0329,-9.7008,0.0377,1.7414,1.7245,1398
-0.2964,-9.6983,-0.1221,0.1329,-9.6983,0.1711,1.6201,1.6001,1399
-0.5911,-9.698,-0.4593,0.0695,-9.698,0.051,1.7175,1.6929,1400
-0.0329,-9.701,0.0901,0.0775,-9.701,0.1156,1.7443,1.6486,1401
-0.7361,-9.704,-0.431,0.3035,-9.704,0.433,1.8719,1.6802,1402
-0.4253,-9.7079,-0.3122,0.0783,-9.7079,0.1273,1.7047,1.636,1403
-0.3598,-9.7073,-0.3213,0.03,-9.7073,0.0444,1.6755,1.6591,1404
-0.5003,-9.7065,-0.4549,0.0325,-9.7065,0.0463,1.7509,1.7078,1405
-0.4154,-9.7038,-0.3557,0.0304,-9.7038,0.0368,1.6527,1.6379,1406
-0.3782,-9.7025,-0.36,0.0213,-9.7025,0.0264,1.6801,1.6548,1407
-0.4268,-9.703,-0.3868,0.0189,-9.703,0.0192,1.7066,1.6638,1408
-2.0145,-9.7145,0.535,1.294,-9.7145,1.9101,23.5851,8.5449,1410
-1.5001,-9.7042,-0.0499,0.7088,-9.7042,1.0088,7.7268,6.2774,1411
-1.5132,-9.7,0.4002,0.9291,-9.7,1.8985,17.2729,9.5399,1412
-1.4341,-9.7157,0.5358,2.0516,-9.7157,2.6202,12.2817,9.5473,1413
-0.7492,-9.7719,1.9252,2.9987,-9.7719,3.9588,11.0888,10.0299,1414
-4.9531,-9.8043,-0.874,1.884,-9.8043,2.6875,7.8881,4.7322,1416
-6.2968,-9.5842,-0.7627,1.5732,-9.5842,3.2344,18.454,6.2014,1417
-6.8663,-10.0033,-0.8332,2.3108,-10.0033,2.3986,23.4371,8.3647,1418
-3.9301,-9.2677,-0.0278,2.4703,-9.2677,3.9727,12.4687,5.517,1419
-8.5881,-9.7368,0.6093,4.6133,-9.7368,7.578,21.366,11.8214,1420
-5.863,-9.7492,0.53,3.3707,-9.7492,7.2984,16.6202,10.4889,1421
-5.7365,-9.7607,-1.2739,2.287,-9.7607,3.4044,12.5925,10.65,1422
-4.1312,-9.6447,0.679,3.8205,-9.6447,4.9116,14.0272,9.2665,1423
-2.9439,-9.848,0.3207,2.6226,-9.848,3.4006,14.8582,10.7814,1424
-10.8747,-9.7586,-0.3379,4.1918,-9.7586,5.245,19.9068,7.0728,1426
-14.586,-9.7162,-1.7901,4.1963,-9.7162,4.1775,12.5899,7.289,1427
-8.9413,-9.678,-0.9017,3.0089,-9.678,3.4273,10.4969,6.6351,1428
-15.2178,-9.3494,6.2001,15.0066,-9.3494,14.3492,35.9783,23.8007,1431
-16.1574,-10.0985,1.2139,6.2835,-10.0985,5.1278,25.822,21.3611,1432
-5.1533,-9.7665,1.9465,5.3173,-9.7665,10.9052,29.6463,9.8994,1433
-0.8959,-9.7994,3.191,4.1068,-9.7994,6.2237,14.9578,9.4605,1434
-8.0898,-9.7871,0.0873,5.6489,-9.7871,2.617,16.2922,9.5808,1435
-5.1708,-9.7415,0.0185,2.7464,-9.7415,4.391,13.7438,7.6322,1436
-3.814,-9.6899,-0.767,1.3488,-9.6899,1.9938,8.356,3.9372,1437
-9.3303,-9.587,-2.1168,4.963,-9.587,6.9215,11.2852,8.4411,1438
-1.6435,-9.7339,0.6109,1.7534,-9.7339,8.22,16.4607,13.0828,1439
-2.4756,-9.4965,-0.142,1.3089,-9.4965,3.405,7.8943,4.7336,1440
-11.6851,-10.0146,0.6893,6.8709,-10.0146,9.7082,19.1641,14.8284,1441
-5.5252,-9.6633,0.875,3.5226,-9.6633,4.8347,15.0455,9.905,1442
-12.5754,-9.6833,-0.5289,3.6176,-9.6833,7.489,18.4874,9.9031,1443
-1.4225,-9.7733,1.734,2.2828,-9.7733,4.5261,13.9146,8.404,1444
-0.6285,-9.6824,0.2884,1.0339,-9.6824,0.9857,10.9457,9.8106,1445
-3.7097,-9.5675,0.6852,2.6418,-9.5675,1.6937,22.3947,18.882,1446
-4.698,-9.5723,1.1702,4.87,-9.5723,1.7783,31.466,18.252,1447
-10.051,-9.7591,1.5321,5.6733,-9.7591,6.2531,34.8321,19.3875,1448
-7.0049,-9.744,-2.148,4.0006,-9.744,2.3568,24.7767,19.8924,1449
-26.7622,-9.7725,0.2284,11.5998,-9.7725,8.6076,35.0049,14.3608,1451
-7.0191,-9.6633,-0.5483,2.5174,-9.6633,3.2956,19.3255,10.3779,1452
-4.098,-9.8041,-1.0434,1.4044,-9.8041,3.0378,14.9061,9.2345,1453
-2.0239,-9.7203,-0.0111,1.5046,-9.7203,3.3339,20.0961,8.3782,1454
-2.2825,-10.1242,2.0732,2.7032,-10.1242,4.9612,20.2752,12.9029,1455
-3.555,-9.7037,0.458,1.8646,-9.7037,3.5222,8.1051,5.5369,1456
-2.4441,-9.6891,-0.625,0.8475,-9.6891,2.1787,6.6157,4.636,1457
-2.0575,-9.716,0.3039,2.0773,-9.716,3.6876,10.591,4.7703,1458
-0.385,-9.5774,-0.0558,0.3293,-9.5774,1.0013,5.5966,2.3976,1459
-2.177,-9.2973,0.5363,1.9057,-9.2973,2.5464,11.4021,7.1654,1460
-6.3985,-9.636,0.3836,6.8523,-9.636,5.8795,19.7646,10.9465,1461
-1.9888,-9.8562,-0.465,0.9305,-9.8562,1.6064,10.9759,5.5796,1462
-19.6735,-9.0714,-1.5034,5.8844,-9.0714,5.028,23.4824,13.6937,1463
-13.1384,-9.1419,-2.7285,5.4774,-9.1419,3.6089,17.9879,15.7019,1464
-2.0504,-9.6687,-0.9069,1.0213,-9.6687,4.5649,11.8016,5.0507,1466
-10.0205,-9.7246,0.4678,4.5163,-9.7246,7.6673,20.8976,11.3255,1467
-3.2108,-9.6701,0.4195,2.1002,-9.6701,1.1486,15.8544,12.2287,1468
-1.6974,-9.8338,-0.207,0.8163,-9.8338,2.0073,6.7203,6.192,1469
-4.7602,-9.9753,0.1366,3.2858,-9.9753,4.1559,15.6552,13.4554,1470
-4.3976,-9.6653,0.0218,2.4427,-9.6653,2.5985,12.6046,10.4469,1471
-3.1935,-9.7494,0.0258,2.3917,-9.7494,4.9427,18.2546,6.5342,1473
-3.3235,-9.7643,0.3807,2.678,-9.7643,2.6679,14.0036,8.3836,1474
-13.184,-9.7363,1.0157,5.2392,-9.7363,7.0707,21.1546,11.7113,1476
-12.2241,-9.7325,0.3057,3.4449,-9.7325,6.003,16.2864,8.5707,1477
-3.6921,-9.641,-0.0953,1.5039,-9.641,1.5264,13.5796,6.3853,1478
-6.795,-9.6639,-1.6019,2.3315,-9.6639,3.2792,9.0979,6.6433,1479
-5.9753,-9.6025,2.4211,5.4539,-9.6025,7.0132,17.7515,10.5686,1480
-8.5368,-9.4314,0.6944,5.4858,-9.4314,8.1138,36.3103,14.4436,1481
-9.4683,-9.8771,11.8424,16.2076,-9.8771,1.2552,23.5899,18.5092,1482
-7.8662,-9.2476,0.8768,5.0456,-9.2476,5.0973,23.2721,10.9322,1483
-0.7632,-9.6416,3.1536,3.1751,-9.6416,1.1473,15.4366,12.7931,1484
-9.2163,-9.4134,-0.5116,3.5323,-9.4134,4.6546,23.4201,18.0628,1486
-25.7323,-9.7972,-1.6046,5.9786,-9.7972,5.1032,36.3918,17.8048,1487
-5.6879,-9.8858,-0.0186,3.0358,-9.8858,3.684,30.2386,27.8943,1488
-36.4192,-9.8293,0.3194,21.4748,-9.8293,14.7604,38.9521,27.3085,1489
-23.1036,-9.9257,-2.2917,9.7294,-9.9257,7.1016,22.4604,11.3977,1491
-2.2624,-9.6668,-0.7155,0.7843,-9.6668,1.2261,6.7608,4.176,1492
-9.526,-9.7448,-0.1664,4.4467,-9.7448,6.8668,15.8869,8.84,1493
-7.9743,-9.4347,-1.7317,3.2578,-9.4347,3.8277,15.1439,7.7187,1494
-10.994,-9.7352,-0.7455,4.1594,-9.7352,7.6862,14.5658,10.5651,1496
-6.1906,-9.7418,0.4502,2.3187,-9.7418,5.6836,16.7365,7.1434,1497
-12.8719,-9.7178,-0.5779,4.275,-9.7178,4.5421,16.5435,7.1466,1498
-2.5495,-9.8838,0.1615,1.9975,-9.8838,1.2119,12.7995,9.0062,1499
-1.5792,-9.6773,1.173,1.9657,-9.6773,3.4638,8.242,6.9828,1500
-8.1065,-9.793,-0.584,2.5861,-9.793,6.5401,18.29,11.3175,1501
-0.8938,-9.7099,0.9681,2.1433,-9.7099,5.1236,13.1078,10.1027,1502
-2.3,-9.6956,-0.1887,1.22,-9.6956,3.4297,8.163,4.6455,1503
-1.3759,-9.644,0.4454,1.2098,-9.644,2.3316,10.5646,6.3595,1504
-0.2984,-9.843,0.5576,0.4903,-9.843,0.6695,5.2373,3.3177,1506
-1.2447,-9.6767,0.2859,1.0903,-9.6767,2.925,18.0114,6.4433,1507
-4.6066,-9.7163,-0.6552,2.0404,-9.7163,1.697,8.2416,5.6597,1508
-0.263,-9.8282,2.1697,1.1144,-9.8282,0.8187,26.8826,18.4625,1509
-3.5775,-9.5667,-0.6638,1.8471,-9.5667,2.1711,26.3425,25.4954,1510
-8.0596,-9.0986,-0.9326,3.8698,-9.0986,4.6081,25.9231,19.2417,1511
-10.7718,-7.4313,-0.2833,5.1015,-7.4313,2.8929,31.5294,13.3326,1512
-1.3209,-9.4027,0.3657,0.7722,-9.4027,1.7501,25.0825,17.3368,1513
-0.4774,-9.6379,0.0336,0.2967,-9.6379,1.4798,14.1126,11.4598,1515
-3.0125,-9.789,1.0008,2.2812,-9.789,5.441,20.7813,13.5763,1516
-1.1895,-9.7587,0.4479,1.1306,-9.7587,0.8044,17.1373,7.9839,1517
-0.5103,-9.7555,-0.1438,0.2984,-9.7555,0.5955,7.6579,3.7084,1518
-0.8333,-9.7427,-0.4854,0.2654,-9.7427,0.3742,2.9448,2.6839,1520
-11.4969,-9.694,-1.0014,3.8021,-9.694,3.68,9.208,2.7751,1521
0.0144,-9.7155,0.2089,0.2044,-9.7155,0.325,1.9692,1.593,1522
-0.301,-9.715,-0.1204,0.1566,-9.715,0.2181,1.6211,1.5925,1523
-0.1579,-9.7164,0.1283,0.167,-9.7164,0.2527,1.9148,1.7764,1524
-2.4275,-9.7106,1.5575,3.5333,-9.7106,5.1023,18.936,11.8585,1526
-3.2754,-9.7773,0.467,1.5032,-9.7773,3.4173,18.8887,9.7563,1527
-1.7059,-9.7333,-0.1214,1.3196,-9.7333,3.5901,9.5494,4.8542,1528
-1.8422,-9.7971,0.4566,0.9989,-9.7971,2.3597,11.2398,5.7417,1529
-1.0212,-9.6843,0.1382,0.7698,-9.6843,1.8453,6.8318,4.3309,1530
-3.4678,-9.7335,0.1077,1.7533,-9.7335,5.7904,15.8119,7.5645,1532
-8.199,-9.6939,0.2161,2.8783,-9.6939,3.5231,14.3897,6.3185,1533
-1.1234,-10.052,0.7587,2.2375,-10.052,2.0364,12.0114,6.9951,1534
-2.9955,-9.6928,-0.1867,1.8348,-9.6928,4.8442,18.0596,15.8862,1535
-0.9502,-9.6724,0.1238,0.5553,-9.6724,1.5538,8.7842,5.6138,1536
-3.8842,-8.2217,-0.1473,2.125,-8.2217,0.9555,20.0719,7.657,1537
-0.519,-9.6193,0.0347,0.2858,-9.6193,0.8402,5.0891,3.0916,1538
-2.0568,-9.1326,0.0651,1.5358,-9.1326,1.5935,12.1227,7.3691,1539
-0.5566,-9.6779,0.9089,0.9575,-9.6779,3.238,12.5067,8.0867,1540
-2.3246,-9.7327,-0.0862,1.0949,-9.7327,1.3936,9.689,4.5884,1541
-0.5317,-9.7768,0.0917,0.6215,-9.7768,1.7464,5.9803,3.0995,1542
-1.3557,-9.662,0.0842,0.5818,-9.662,2.1394,7.2334,3.7094,1543
-2.1271,-9.5553,0.1618,1.2523,-9.5553,1.2899,7.6446,5.9189,1544
-3.2436,-9.4073,0.0962,1.7449,-9.4073,2.4707,9.9614,5.8024,1545
-0.4431,-9.657,-0.0428,0.199,-9.657,0.8587,3.8475,3.6223,1546
-0.6688,-9.7882,0.1515,0.7962,-9.7882,0.6139,5.2889,3.2238,1547
-1.9351,-9.7921,0.1948,1.0058,-9.7921,0.7027,6.2137,4.3757,1548
-0.7671,-9.6537,-0.0686,0.3329,-9.6537,0.9764,7.4906,5.193,1549
-0.1805,-9.5606,-0.0237,0.0891,-9.5606,0.6355,3.4699,1.9226,1550
-3.4998,-9.9454,0.3397,2.134,-9.9454,2.6298,10.8412,9.5102,1551
-7.3814,-9.4121,0.1611,2.9919,-9.4121,3.0512,31.306,9.6896,1552
-1.0342,-9.7644,0.0388,0.4734,-9.7644,1.2107,6.3262,4.1309,1553
-2.2488,-9.5873,0.5118,1.8112,-9.5873,1.0377,7.2045,5.3591,1554
-2.2848,-9.804,0.2672,1.4855,-9.804,1.005,8.3368,7.1058,1555
-1.1076,-9.613,0.8626,1.4191,-9.613,0.5434,8.7808,6.7128,1556
-0.9181,-9.9181,0.0506,0.775,-9.9181,1.2417,4.9409,3.794,1557
-5.5571,-9.7586,0.8583,3.8033,-9.7586,3.812,16.5043,13.0416,1558
-0.5879,-9.7127,1.3959,1.4935,-9.7127,0.9421,8.9559,7.0162,1559
-3.1203,-9.899,-0.151,2.0649,-9.899,3.6775,13.7987,6.2827,1560
-0.2089,-9.7191,-0.0798,0.1124,-9.7191,1.534,5.5364,4.2209,1561
-3.4652,-9.5648,0.7852,2.1787,-9.5648,2.1275,13.9966,7.2367,1562
-7.1253,-9.6439,-0.1438,2.1669,-9.6439,4.1058,15.923,6.5038,1563
-2.0078,-9.4432,0.433,1.25,-9.4432,3.001,10.5031,4.4611,1564
-3.5271,-9.5984,-0.1459,1.678,-9.5984,1.7232,12.3871,5.8263,1565
-8.9113,-9.5302,0.1502,3.9045,-9.5302,5.9593,34.8311,15.6714,1566
-0.3399,-9.5341,0.0224,0.2675,-9.5341,1.2209,12.5875,6.301,1567
-5.7004,-9.7209,-0.1451,2.707,-9.7209,3.4761,24.0126,9.7172,1568
-1.406,-9.4886,1.2541,2.2985,-9.4886,1.699,10.0339,8.0604,1569
-2.5093,-9.4435,0.6168,1.7217,-9.4435,3.7299,24.89,18.1885,1571
-8.9835,-9.6212,0.1698,3.04,-9.6212,3.9023,17.5462,11.5177,1572
-2.0138,-9.9458,0.9876,2.2204,-9.9458,2.7624,10.9721,5.8074,1573
-7.3178,-9.4657,-1.8812,4.2204,-9.4657,5.0772,24.2726,9.0693,1574
4.3612,-9.69,9.4569,5.8242,-9.69,3.0019,27.2711,23.1601,1575
-3.0192,-9.636,4.2392,6.7835,-9.636,6.9144,20.5668,13.639,1576
-2.0306,-9.8655,0.8588,2.1496,-9.8655,1.7897,11.4276,9.2718,1577
-2.192,-9.682,0.4137,1.6654,-9.682,3.5176,10.9568,7.2203,1578
-8.8349,-9.8041,2.6671,6.9838,-9.8041,10.0575,23.5843,14.1131,1580
-13.5741,-9.6737,1.2149,5.4303,-9.6737,7.9052,23.7695,13.2078,1581
-5.2954,-9.6674,0.3515,3.081,-9.6674,5.167,15.0252,6.7131,1582
-1.0747,-9.7567,1.2465,2.0349,-9.7567,2.4134,10.8647,6.2561,1583
-6.0616,-9.6984,-1.5493,2.8603,-9.6984,2.0791,11.478,7.7114,1584
-1.0089,-9.6674,-0.3073,0.3381,-9.6674,1.2016,5.9878,3.43,1586
-4.5524,-9.6773,-0.0533,1.5793,-9.6773,4.8719,18.4592,9.6004,1587
0.0325,-9.6426,1.0299,0.8022,-9.6426,2.5855,11.5756,5.6889,1588
-0.0716,-9.3924,0.4418,0.6314,-9.3924,1.6377,5.4745,3.3418,1589
-1.9608,-9.5539,-0.3212,1.0582,-9.5539,1.3367,7.068,5.7391,1590
-0.7109,-9.6453,0.471,0.7577,-9.6453,2.3422,10.68,6.8793,1591
-1.0008,-9.8302,-0.2483,0.4075,-9.8302,0.9206,21.7008,19.3527,1592
-9.1173,-9.3923,7.958,12.0755,-9.3923,11.4913,33.3716,23.7967,1593
-16.275,-9.9574,0.1669,6.71,-9.9574,8.59,35.114,19.9288,1595
-7.8844,-9.3258,7.7075,10.2302,-9.3258,2.7235,35.0123,14.6988,1596
-5.8305,-9.6491,1.489,5.7606,-9.6491,7.0678,25.6471,11.4815,1597
-3.7409,-9.4892,1.8741,4.1478,-9.4892,4.5236,15.8693,11.5996,1598
-1.5064,-9.4475,0.3874,1.1572,-9.4475,3.0423,19.652,7.664,1599
-2.7289,-9.7564,0.114,1.6383,-9.7564,4.8885,17.3409,8.9637,1601
-1.29,-9.7537,0.9135,1.7761,-9.7537,2.6957,14.0857,8.1619,1602
-9.307,-9.9796,-0.5372,2.626,-9.9796,3.2727,14.0055,7.9724,1603
4.2331,-10.0012,8.8525,2.8235,-10.0012,2.8195,22.268,15.8632,1604
-2.6691,-9.5299,-0.8317,1.3432,-9.5299,1.9215,13.5336,9.8573,1605
-0.6584,-9.7046,0.4667,0.6546,-9.7046,0.6565,6.7083,6.1179,1606
-8.5079,-9.8124,7.8536,11.4406,-9.8124,1.8283,33.1203,27.1638,1607
-0.5527,-9.9098,0.2985,0.5336,-9.9098,1.7789,8.5147,6.2169,1608
-0.6146,-9.8658,0.5805,0.7525,-9.8658,0.4477,7.3917,6.4741,1609
-1.5177,-9.7077,-0.2387,0.6689,-9.7077,1.7677,8.2266,4.3247,1611
-6.9851,-9.7945,0.8265,2.4627,-9.7945,2.3625,17.4458,9.1142,1612
-11.7255,-9.7312,-2.242,6.2861,-9.7312,3.5239,33.0266,28.2281,1613
-2.5655,-9.9099,2.4868,2.87,-9.9099,1.8737,23.8968,10.1994,1614
-2.2665,-9.4738,-0.5655,0.8683,-9.4738,1.0577,17.5881,13.3205,1615
-16.4102,-9.4629,-3.3402,6.6109,-9.4629,4.7628,33.9356,18.1176,1616
-2.0647,-9.7608,-0.559,1.007,-9.7608,2.2875,16.4218,7.4349,1617
-17.1666,-9.7076,0.8127,7.3526,-9.7076,2.3535,31.729,9.9148,1618
-0.0217,-9.7561,1.05,0.6075,-9.7561,1.1148,36.3816,32.8991,1619
0.866,-9.6583,2.749,1.1511,-9.6583,0.9215,26.4647,22.4243,1621
-0.8037,-9.7364,0.0549,0.4374,-9.7364,1.5955,9.6561,4.4919,1622
-1.0999,-9.7373,0.1975,0.5387,-9.7373,1.7812,9.0854,5.6595,1623
-0.2041,-9.7366,0.0199,0.1528,-9.7366,0.393,8.1991,5.766,1624
-0.5914,-9.675,-0.0581,0.2724,-9.675,0.7654,9.5817,5.9768,1625
-0.7545,-9.7833,-0.0439,0.3923,-9.7833,0.6257,9.0786,8.2769,1626
0.002,-9.7132,0.4421,0.3592,-9.7132,0.8541,12.2825,10.0684,1627
-18.7276,-9.737,-1.6589,5.4345,-9.737,5.5603,20.2327,12.9923,1628
-25.1592,-9.7105,-4.4102,10.6284,-9.7105,6.3123,21.6685,10.1504,1629
-0.7201,-9.7282,0.7825,1.7719,-9.7282,3.6054,13.4868,6.7247,1630
-2.2167,-9.754,0.5807,1.4866,-9.754,4.3161,15.9736,11.2598,1632
-0.4156,-9.7168,0.0532,0.228,-9.7168,1.688,5.2198,2.7016,1633
-1.8351,-9.9927,-0.8826,0.614,-9.9927,2.5441,15.1493,13.6588,1634
-0.6287,-9.622,-0.1965,0.2902,-9.622,0.5598,3.9535,2.137,1635
-1.0009,-9.6571,0.6422,1.2704,-9.6571,1.0664,9.1478,6.7271,1636
0.1689,-9.732,2.4434,1.39,-9.732,0.3532,9.2364,7.6441,1637
-1.4044,-9.7517,-0.0922,0.6001,-9.7517,0.8335,5.7958,3.7293,1638
-0.1225,-9.6988,-0.019,0.0509,-9.6988,0.2886,6.7442,5.0166,1639
-2.0338,-9.7652,0.1945,0.9223,-9.7652,2.9627,28.827,18.1189,1641
-1.6824,-9.8095,0.1059,0.9184,-9.8095,0.7559,20.9422,18.0066,1642
-2.8536,-9.7613,0.0846,1.2283,-9.7613,1.1664,30.4798,26.3489,1643
-4.3867,-9.7802,-0.2671,2.3156,-9.7802,0.8665,15.482,12.5184,1644
-0.5805,-9.934,0.756,1.1521,-9.934,0.5356,23.105,14.0504,1645
-5.5522,-9.7091,0.2455,2.2694,-9.7091,3.1533,29.1635,11.3358,1647
-0.7449,-9.7303,0.1156,0.281,-9.7303,1.0095,5.9576,3.428,1648
-0.9875,-9.625,0.1553,0.6674,-9.625,0.407,7.7544,3.0009,1649
-1.112,-9.6817,0.0951,0.7402,-9.6817,1.0523,5.7889,4.9323,1650
1.2504,-9.7545,5.8568,2.5417,-9.7545,2.7174,27.2827,16.004,1651
-4.6162,-9.7261,1.8167,4.5248,-9.7261,2.8458,26.5113,18.6663,1652
-5.6455,-9.8111,-1.0014,2.3431,-9.8111,4.0688,33.9525,15.9243,1653
-1.7337,-9.7139,-0.7529,0.6902,-9.7139,1.0446,7.9255,3.3544,1654
-3.0248,-9.8805,0.6578,3.4041,-9.8805,2.8263,44.5984,40.3242,1655
-4.2823,-9.7999,2.1188,3.837,-9.7999,1.9646,27.2939,19.4004,1656
-8.0782,-9.7427,0.1678,4.0621,-9.7427,4.3479,53.2443,43.9815,1657
-2.4888,-9.6574,2.1826,5.2392,-9.6574,4.2742,26.3649,20.9962,1658
-4.1424,-9.8936,2.4844,5.555,-9.8936,1.5443,15.159,11.1826,1659
-0.3912,-9.3011,0.8578,1.0139,-9.3011,0.9368,6.4937,5.6666,1660
-0.7721,-10.0541,0.0079,0.529,-10.0541,2.4302,9.1574,4.7022,1661
-1.2023,-9.6492,-0.0626,0.8358,-9.6492,0.8792,5.0628,3.1448,1662
-3.7732,-9.8254,3.108,5.3688,-9.8254,3.7019,19.3854,12.3263,1663
-9.6066,-9.6868,12.6416,12.182,-9.6868,1.4732,37.7212,31.1741,1664
-3.5465,-9.698,3.1403,3.5699,-9.698,2.4003,15.7826,9.7224,1665
-2.1119,-9.8399,0.4288,1.5861,-9.8399,2.7061,14.6562,11.7883,1666
-2.2681,-9.6001,1.7794,2.8879,-9.6001,2.5684,15.8821,10.1439,1667
-5.2874,-9.7343,1.7086,4.882,-9.7343,3.4732,26.4593,14.2974,1668
-0.3283,-9.7802,0.9001,0.9342,-9.7802,1.7588,44.3374,35.1691,1669
-3.8918,-9.8205,-0.7584,2.0493,-9.8205,2.7487,55.9842,47.7281,1670
0.0889,-9.5929,8.1355,4.5915,-9.5929,4.5388,40.5273,24.9842,1671
-7.9452,-9.7037,0.5117,3.5718,-9.7037,2.3166,18.1971,11.1218,1672
-1.6932,-9.7536,-0.0438,0.7933,-9.7536,0.8273,11.1368,5.6251,1673
-6.5399,-9.7315,-2.9667,2.2409,-9.7315,3.8509,19.7871,7.4378,1674
-0.9744,-9.7954,0.7268,1.5367,-9.7954,2.2854,19.2047,17.5366,1676
-4.4175,-9.7883,0.6601,2.3142,-9.7883,3.45,28.8421,16.8041,1677
-0.6168,-9.745,0.1037,0.4968,-9.745,1.6279,33.8589,28.3217,1678
-2.3554,-9.848,1.0586,2.959,-9.848,0.9628,19.9393,17.7976,1679
-5.8605,-9.7246,3.499,4.8459,-9.7246,3.1829,33.2934,12.3716,1680
-1.0737,-9.9014,-0.5307,0.3742,-9.9014,1.8082,40.3495,35.8728,1681
-0.3833,-9.7941,0.5221,0.4841,-9.7941,0.8025,23.5443,17.7107,1682
-7.8235,-9.5403,0.6304,2.7534,-9.5403,1.8369,27.9874,22.3994,1683
-2.3386,-10.0257,-0.2371,1.1357,-10.0257,2.5766,35.6524,31.9338,1684
-0.3793,-9.8032,4.6325,5.3406,-9.8032,5.6635,30.9533,9.1859,1686
-7.4027,-9.7733,0.815,3.43,-9.7733,6.1347,49.1111,13.0697,1687
-9.8853,-9.0137,2.7443,5.9594,-9.0137,2.372,31.0454,10.5901,1688
-4.7699,-9.6883,-1.4282,1.6021,-9.6883,4.0364,21.1805,8.5891,1689
-3.1536,-9.6368,-0.7314,1.4054,-9.6368,5.7308,18.6484,13.5809,1690
-5.4747,-9.5242,-1.8668,1.9383,-9.5242,4.6446,16.9985,6.8126,1691
-0.7134,-9.7199,0.1525,0.7053,-9.7199,3.4624,18.2213,15.4644,1692
-2.0324,-9.8271,1.9306,2.9307,-9.8271,6.2886,38.4858,21.6393,1693
-8.8491,-9.8621,-0.5535,3.5261,-9.8621,2.3172,27.9178,22.9397,1695
-62.6159,-9.4483,2.3028,26.4452,-9.4483,13.2841,26.8099,11.9703,1696
-14.7772,-9.4755,-10.4979,3.9552,-9.4755,1.9798,14.3408,8.2048,1697
-11.5227,-9.4272,18.3431,15.4206,-9.4272,5.7448,36.0221,28.7246,1698
-17.347,-9.7988,3.5463,8.7912,-9.7988,3.9691,22.6329,10.1417,1699
-28.2933,-9.0948,-6.171,17.5557,-9.0948,6.6205,52.897,12.2081,1701
-27.9093,-9.428,-0.9711,14.295,-9.428,4.8967,25.89,16.2797,1702
-6.7883,-9.0669,11.3667,19.8315,-9.0669,5.3283,20.9683,18.3341,1703
-18.5957,-9.4044,-10.8842,7.7985,-9.4044,3.2817,31.2597,29.3665,1704
-39.2514,-9.2322,-25.6541,8.0393,-9.2322,2.0423,31.0748,27.4668,1705
-114.6676,-8.7554,-58.94,35.8314,-8.7554,7.0361,50.4418,37.9145,1706
22.6814,-8.8281,35.9061,8.3986,-8.8281,3.0031,40.9157,27.2665,1708
-2.8568,-9.5843,8.4005,8.4139,-9.5843,4.9501,17.1058,11.3106,1709
-3.39,-9.7182,1.391,2.1492,-9.7182,2.4898,5.7964,3.7747,1710
-15.4634,-9.6937,2.0862,12.0491,-9.6937,3.6827,16.5795,11.6287,1711
-0.6449,-9.7445,-0.1471,0.2916,-9.7445,1.596,14.0074,2.9588,1712
-0.1502,-9.7374,-0.0612,0.0338,-9.7374,0.1514,1.7031,1.634,1713
