timestamp,AX_mean,AX_min,AX_max,AX_median,AX_std,AX_meandiff,AX_mediandiff,AX_extremum,AX_delta,AY_mean,AY_min,AY_max,AY_median,AY_std,AY_meandiff,AY_mediandiff,AY_extremum,AY_delta,AZ_mean,AZ_min,AZ_max,AZ_median,AZ_std,AZ_meandiff,AZ_mediandiff,AZ_extremum,AZ_delta,GX_mean,GX_min,GX_max,GX_median,GX_std,GX_meandiff,GX_mediandiff,GX_extremum,GX_delta,GY_mean,GY_min,GY_max,GY_median,GY_std,GY_meandiff,GY_mediandiff,GY_extremum,GY_delta,GZ_mean,GZ_min,GZ_max,GZ_median,GZ_std,GZ_meandiff,GZ_mediandiff,GZ_extremum,GZ_delta,AYGX_mean,AYGX_min,AYGX_max,AYGX_median,AYGX_std,AYGX_meandiff,AYGX_mediandiff,AYGX_extremum,AYGX_delta,Anorm_mean,Anorm_min,Anorm_max,Anorm_median,Anorm_std,Anorm_meandiff,Anorm_mediandiff,Anorm_extremum,Anorm_delta,Gnorm_mean,Gnorm_min,Gnorm_max,Gnorm_median,Gnorm_std,Gnorm_meandiff,Gnorm_mediandiff,Gnorm_extremum,Gnorm_delta
0,0.2158,-0.061,0.4752,0.2267,0.1413,-0.0075,-0.026,0.4752,0.5361,0.1188,-0.216,0.5116,0.0978,0.1646,-0.1068,-0.0919,0.5116,0.7277,-9.7611,-9.8317,-9.6856,-9.7662,0.0318,-0.006,0.0142,9.8317,0.1462,-0.4971,-2.3891,1.1713,-0.3095,1.1005,1.6395,1.5089,2.3891,3.5604,3.2491,3.0975,3.395,3.2375,0.0963,-0.1341,-0.0875,3.395,0.2975,0.7429,0.2386,1.2356,0.7287,0.2775,-0.484,-0.4372,1.2356,0.997,-0.0382,-0.5574,0.4397,-0.021,0.209,0.0278,0.0261,0.5574,0.9971,9.7665,9.6857,9.8326,9.7731,0.0325,0.0062,-0.0141,9.8326,0.1469,3.5396,3.1573,4.1297,3.443,0.2833,-0.1635,-0.0347,4.1297,0.9724
1,0.2083,-0.1817,0.6057,0.2007,0.2009,-0.0422,-0.0339,0.6057,0.7874,0.012,-0.3297,0.3674,0.006,0.1722,-0.1731,-0.1436,0.3674,0.6971,-9.767,-9.8582,-9.7141,-9.7519,0.0417,0.0126,0.0037,9.8582,0.1441,1.1424,0.0363,2.0811,1.1994,0.5022,-0.7872,-1.3446,2.0811,2.0448,3.115,2.8438,3.3688,3.15,0.153,0.0707,0.0656,3.3688,0.525,0.2589,-0.4682,0.7618,0.2915,0.3432,0.3437,0.3169,0.7618,1.23,-0.0104,-0.5193,0.2757,0.0051,0.188,-0.0801,-0.0103,0.5193,0.795,9.7727,9.7143,9.88,9.759,0.044,-0.0132,-0.0089,9.88,0.1657,3.3761,2.9206,3.7909,3.4082,0.2407,0.0756,-0.0159,3.7909,0.8703
2,0.1662,-0.0036,0.3007,0.1668,0.0852,0.037,0.0608,0.3007,0.3043,-0.1611,-0.6648,0.1412,-0.1376,0.1994,0.0747,0.0464,0.6648,0.8061,-9.7544,-9.9307,-9.6089,-9.7482,0.0841,-0.0081,-0.0014,9.9307,0.3218,0.3553,-0.8798,2.4726,-0.1452,1.1553,-0.3041,0.1463,2.4726,3.3524,3.1857,2.9663,3.3425,3.2156,0.113,0.0471,0.0044,3.3425,0.3762,0.6025,0.0796,0.9479,0.6084,0.1943,-0.0147,-0.0511,0.9479,0.8683,-0.0905,-1.0262,0.2666,-0.0052,0.3078,0.0663,-0.0006,1.0262,1.2928,9.7594,9.6131,9.9407,9.7501,0.0859,0.0081,0.0014,9.9407,0.3276,3.4517,3.038,3.9774,3.3923,0.24,-0.0763,-0.0387,3.9774,0.9394
3,0.2032,0.0315,0.4513,0.2276,0.1014,-0.0365,-0.0588,0.4513,0.4198,-0.0864,-0.4961,0.3309,-0.0913,0.205,0.0103,0.05,0.4961,0.827,-9.7624,-9.9364,-9.6253,-9.7497,0.0718,0.0005,0.0018,9.9364,0.3111,0.0512,-1.0955,1.5436,0.0011,0.7287,-0.2933,-0.0375,1.5436,2.6391,3.2328,3.115,3.395,3.22,0.0691,0.0121,0.035,3.395,0.28,0.5879,-0.0104,1.3421,0.5573,0.3141,-0.0404,-0.1061,1.3421,1.3525,-0.0242,-0.3815,0.2862,-0.0058,0.1545,0.0154,-0.0029,0.3815,0.6677,9.7675,9.6284,9.9419,9.7515,0.0734,-0.0009,0.0014,9.9419,0.3135,3.3754,3.1563,3.6814,3.3536,0.1268,0.007,-0.0168,3.6814,0.5251
4,0.1667,-0.0923,0.4381,0.1688,0.139,0.0247,0.0199,0.4381,0.5304,-0.0761,-0.4476,0.3243,-0.0413,0.1988,0.0712,0.0323,0.4476,0.7719,-9.762,-9.8882,-9.6662,-9.7479,0.0624,0.0004,-0.0168,9.8882,0.222,-0.2422,-1.5688,0.7274,-0.0364,0.7008,0.58,0.1082,1.5688,2.2962,3.2449,3.0713,3.43,3.255,0.0928,-0.0006,-0.0088,3.43,0.3587,0.5475,0.0631,1.2423,0.4513,0.3155,-0.9278,-0.1903,1.2423,1.1792,-0.0089,-0.441,0.5726,-0.0087,0.1882,-0.0723,-0.0154,0.5726,1.0136,9.7666,9.6716,9.8992,9.7529,0.0647,0.0008,0.0128,9.8992,0.2276,3.3825,3.1699,3.6953,3.3368,0.1541,0.2208,0.1346,3.6953,0.5254
5,0.1914,0.0386,0.4359,0.1887,0.1057,0.0086,0.036,0.4359,0.3973,-0.0049,-0.5894,0.5625,-0.009,0.2621,0.0823,-0.0796,0.5894,1.1519,-9.7616,-9.9595,-9.601,-9.7647,0.0764,0.0159,0.0348,9.9595,0.3585,0.3378,-0.6665,1.7792,0.0718,0.8184,-3.9845,-4.2735,1.7792,2.4457,3.2443,2.9925,3.4388,3.2463,0.0933,0.0343,0.0131,3.4388,0.4462,-0.3804,-3.0694,1.4313,0.2609,1.3348,1.1692,0.4232,3.0694,4.5007,-0.0812,-0.6657,0.3815,-0.0242,0.2456,-1.0165,-0.1869,0.6657,1.0472,9.7674,9.6077,9.9655,9.7656,0.0771,0.0066,0.0003,9.9655,0.3579,3.6033,3.1701,4.6445,3.4715,0.4196,2.0019,1.9405,4.6445,1.4744
6,0.2,-1.4672,1.0405,0.2247,0.4382,0.0106,0.2277,1.4672,2.5077,0.0774,-0.7714,1.5954,-0.0886,0.5785,0.5264,0.9362,1.5954,2.3667,-9.7457,-10.3091,-9.2234,-9.7299,0.2308,0.0026,-0.0212,10.3091,1.0857,-3.6467,-8.5195,2.2191,-4.2018,3.0295,0.0728,0.8132,8.5195,10.7386,3.2786,2.8875,3.8588,3.2594,0.2624,0.317,0.105,3.8588,0.9713,0.7888,-1.485,2.2107,0.6842,0.8991,-0.493,-0.4961,2.2107,3.6957,-1.0977,-11.9891,4.421,-0.2111,3.5399,-1.8053,-0.8797,11.9891,16.4101,9.774,9.2474,10.3487,9.7659,0.2313,0.1055,0.0753,10.3487,1.1014,5.6052,3.2082,9.2068,5.4119,1.7423,2.4346,2.4292,9.2068,5.9986
7,0.2106,-2.6088,1.5511,0.4523,1.0517,0.9178,0.7948,2.6088,4.1599,0.6038,-1.9023,2.7132,0.8476,1.1225,0.4933,0.4799,2.7132,4.6155,-9.7432,-11.039,-8.5976,-9.751,0.4364,0.0676,0.1014,11.039,2.4413,-3.5739,-14.3119,10.0962,-3.3886,7.0277,10.2221,10.1694,14.3119,24.4081,3.5956,2.6075,6.0113,3.3644,0.8767,-0.1242,-0.0919,6.0113,3.4038,0.2958,-3.9708,4.3175,0.1881,1.9595,-3.5002,-4.2695,4.3175,8.2883,-2.903,-33.0493,17.1572,-1.0908,9.7601,4.3473,2.9056,33.0493,50.2065,9.8795,8.7231,11.0397,9.8413,0.4469,0.1499,0.1474,11.0397,2.3166,8.0398,3.0784,14.6993,7.8411,3.6868,4.4443,2.4795,14.6993,11.6209
8,1.1284,-1.0179,2.5799,1.2472,1.0384,-0.1826,-0.2559,2.5799,3.5978,1.0971,-2.6575,5.3809,1.3276,1.9337,-0.4826,-0.9607,5.3809,8.0384,-9.6756,-10.8478,-8.4792,-9.6496,0.5202,-0.1194,-0.083,10.8478,2.3686,6.6482,-12.6394,24.3632,6.7809,10.2099,-4.3415,-4.0867,24.3632,37.0027,3.4714,1.7062,6.4925,3.2725,1.3308,0.2591,0.2406,6.4925,4.7863,-3.2044,-10.6975,8.9013,-4.0814,5.455,16.7556,20.1177,10.6975,19.5987,1.4443,-58.186,36.9145,1.8149,22.0587,7.0356,1.543,58.186,95.1005,10.0294,8.8307,11.4627,9.9887,0.6435,0.0828,0.1329,11.4627,2.632,12.4841,3.9224,26.7358,10.3207,6.5468,9.9475,9.992,26.7358,22.8134
9,0.9458,-0.7668,2.7581,0.9913,0.8807,-0.0287,-0.2709,2.7581,3.5248,0.6145,-4.2481,4.8998,0.3668,2.1275,-0.9436,-0.4368,4.8998,9.1479,-9.7951,-10.92,-9.0166,-9.7326,0.4351,0.0491,-0.001,10.92,1.9035,2.3067,-8.1969,10.0676,2.6942,5.7207,-0.8262,-2.6546,10.0676,18.2645,3.7305,1.1987,6.4575,3.5131,1.6079,-0.4036,-0.3544,6.4575,5.2588,13.5512,-19.1692,41.4639,16.0363,19.714,-1.336,-4.6717,41.4639,60.6331,8.4799,-10.5254,46.8844,3.3579,13.3011,-7.3346,-3.2202,46.8844,57.4098,10.1122,9.1206,11.2222,10.1217,0.4991,-0.2551,-0.3015,11.2222,2.1016,22.4316,7.2,41.9981,20.3127,10.5659,-8.3815,-7.4608,41.9981,34.7982
10,0.9171,0.2874,2.1312,0.7204,0.4625,0.088,0.3241,2.1312,1.8438,-0.3291,-2.2081,1.28,-0.07,1.0282,0.4235,0.2073,2.2081,3.4881,-9.7459,-10.39,-9.1566,-9.7336,0.2972,-0.0113,0.0701,10.39,1.2334,1.4805,-5.5527,8.7359,0.0396,3.9272,-6.2924,-6.1969,8.7359,14.2886,3.3269,0.4287,6.4225,3.1588,1.482,1.3159,1.225,6.4225,5.9938,12.2152,1.4509,31.1628,11.3646,8.3626,-8.1281,-11.7085,31.1628,29.7119,1.1453,-3.4002,10.1559,0.1377,2.9448,-1.2247,-0.4455,10.1559,13.5562,9.8571,9.3138,10.6308,9.8202,0.2885,-0.0242,-0.0785,10.6308,1.3169,14.0501,3.9146,31.5359,12.8519,7.1606,-2.7196,-3.7424,31.5359,27.6214
11,1.0051,0.0677,1.7358,1.0444,0.4259,-0.1737,0.1149,1.7358,1.6681,0.0945,-1.1142,1.0951,0.1373,0.5196,-0.6486,-0.2687,1.1142,2.2093,-9.7572,-11.7744,-8.7688,-9.6635,0.7018,0.1964,0.2758,11.7744,3.0056,-4.8119,-9.1914,0.5132,-6.1573,3.2376,0.93,2.2184,9.1914,9.7046,4.6429,0.6563,8.7413,4.3838,2.7188,-2.3345,-0.2144,8.7413,8.085,4.0871,-5.5513,20.2836,-0.344,9.524,-12.0174,-3.3942,20.2836,25.8348,-0.0794,-8.8199,8.7115,-0.3078,3.8505,2.09,0.6193,8.8199,17.5314,9.8329,8.8752,11.7746,9.7417,0.6796,-0.1164,-0.0957,11.7746,2.8995,11.3305,4.7384,23.3066,9.1095,6.24,0.5102,-1.1301,23.3066,18.5682
12,0.8314,-1.6081,1.9515,1.1593,0.9601,-0.3224,-0.6201,1.9515,3.5596,-0.5541,-2.6809,0.8102,-0.1314,1.0519,0.6309,0.009,2.6809,3.4911,-9.5609,-11.8977,-6.5706,-9.3878,1.3839,-0.1704,-0.3052,11.8977,5.3271,-3.8819,-7.8386,-0.2795,-3.9389,2.4607,10.0774,10.4567,7.8386,7.5591,2.3084,-8.8638,11.375,4.1694,6.4372,1.2584,-0.7919,11.375,20.2388,-7.9303,-30.3021,0.549,-3.7382,8.5511,10.5224,11.9035,30.3021,30.851,2.0105,-3.3782,13.3212,0.3115,4.1609,8.5556,6.3954,13.3212,16.6994,9.7165,6.7829,11.9253,9.646,1.3447,0.268,0.1548,11.9253,5.1424,11.8407,4.4247,31.0974,7.9793,7.7398,9.8812,13.6173,31.0974,26.6727
13,0.5091,-2.0428,2.4413,0.5392,0.9066,-0.0538,-0.1535,2.4413,4.4842,0.0767,-2.5797,3.8921,-0.1224,1.9982,0.3374,0.2765,3.8921,6.4718,-9.7312,-11.8997,-7.0266,-9.693,1.3708,-0.3795,-0.624,11.8997,4.8731,6.1955,-10.428,23.053,6.5178,10.0553,-3.8989,-2.9916,23.053,33.481,3.5667,-0.7788,10.8412,3.3775,2.8756,3.2528,4.7775,10.8412,11.62,2.5921,-31.8806,26.8171,8.1653,19.1453,33.4314,27.8602,31.8806,58.6977,10.5662,-22.6058,62.0266,6.707,20.8186,-10.541,-6.7614,62.0266,84.6324,9.9844,7.2522,12.0886,9.8007,1.3273,0.182,0.5712,12.0886,4.8364,21.7219,8.4335,34.2186,21.5966,6.626,15.7602,16.1376,34.2186,25.7851
14,0.4553,-0.2874,1.3001,0.3858,0.6394,-0.0605,-0.0341,1.3001,1.5875,0.4142,-0.3279,1.5738,0.1541,0.6545,-0.1704,-0.0796,1.5738,1.9017,-10.1108,-11.0963,-8.9223,-10.317,0.8356,0.1504,0.3002,11.0963,2.174,2.2966,-8.9756,12.0327,3.5262,7.1068,-2.6971,-3.3133,12.0327,21.0083,6.8195,1.2337,11.13,8.155,3.8502,-1.9031,-2.5594,11.13,9.8963,36.0235,32.2846,38.9193,36.0255,2.6918,-20.1584,-21.7403,38.9193,6.6347,0.0252,-9.4477,6.3402,-0.0544,4.6207,2.4613,1.1939,9.4477,15.7879,10.1665,9.0149,11.1001,10.3719,0.8233,-0.1352,-0.2906,11.1001,2.0852,37.4821,32.9304,40.7936,37.7342,3.0364,-10.0667,-9.5057,40.7936,7.8632
16,0.3342,-0.4905,1.3997,0.3176,0.4889,-0.2811,-0.2819,1.3997,1.8902,0.0735,-2.0005,2.2051,-0.0051,1.1782,0.5818,0.5924,2.2051,4.2056,-9.8099,-11.3715,-8.2948,-9.7166,0.8568,-0.0654,-0.3581,11.3715,3.0766,-3.0977,-14.613,8.7277,-3.1004,7.5578,12.0336,12.1584,14.613,23.3407,3.0133,-0.9888,7.2888,3.0363,2.0068,0.0481,0.0175,7.2888,8.2775,-4.2933,-22.4157,22.1636,-7.4551,15.6968,-3.6895,-1.1409,22.4157,44.5793,4.9478,-10.1659,26.3536,2.3334,9.4932,0.6096,2.954,26.3536,36.5195,9.8961,8.5252,11.3804,9.7908,0.8437,0.0163,0.3003,11.3804,2.8552,17.3488,5.3073,23.6444,18.7228,5.674,-4.086,-6.2495,23.6444,18.3372
17,0.0531,-0.637,0.6807,0.0357,0.4505,-0.4529,-0.4155,0.6807,1.3177,0.6553,0.0981,1.3231,0.5873,0.3837,-0.6197,-0.5709,1.3231,1.2249,-9.8753,-10.583,-9.163,-10.0747,0.5424,0.2319,0.5861,10.583,1.42,8.9359,7.563,10.4835,9.058,1.2285,-11.0105,-11.2844,10.4835,2.9205,3.0614,1.4875,4.1737,3.0537,1.0323,-1.5619,-1.6275,4.1737,2.6863,-7.9829,-16.7017,0.9727,-8.596,6.7469,8.2586,9.2391,16.7017,17.6744,5.5574,1.0005,10.0065,5.2874,2.8354,-5.6336,-5.2835,10.0065,9.0061,9.9124,9.2318,10.6844,10.091,0.548,-0.2548,-0.5967,10.6844,1.4526,13.2628,8.0834,19.4556,12.4733,4.6759,-9.9245,-9.1534,19.4556,11.3722
18,-0.3998,-0.8501,-0.0341,-0.3799,0.3213,0.4876,0.3603,0.8501,0.816,0.0356,-0.3465,0.2699,0.0165,0.2036,-0.1727,-0.1876,0.3465,0.6164,-9.6434,-10.6943,-8.9223,-9.4886,0.5866,-0.2194,-0.2929,10.6943,1.7721,-2.0746,-3.0016,-0.1733,-2.2265,0.853,-3.3335,-3.2511,3.0016,2.8283,1.4995,-0.7962,4.1825,1.4263,1.7593,3.5711,4.3575,4.1825,4.9788,0.2757,-1.7831,1.9106,0.643,1.3355,-10.5854,-10.5546,1.9106,3.6937,-0.0762,-0.6245,0.7861,0.0039,0.4651,0.8026,0.9195,0.7861,1.4107,9.6576,8.9227,10.7309,9.4943,0.5997,0.2208,0.3002,10.7309,1.8082,3.3383,2.3932,4.3335,3.3199,0.6674,9.7179,8.5829,4.3335,1.9403
19,0.0879,-0.7309,0.8975,-0.0196,0.4933,-0.0682,0.3477,0.8975,1.6283,-0.1371,-0.4422,0.2944,-0.1711,0.2519,-0.0085,0.0416,0.4422,0.7366,-9.8629,-11.1205,-8.2456,-9.7815,0.939,-0.0925,0.242,11.1205,2.875,-5.4081,-6.1676,-4.4265,-5.4776,0.5997,4.3103,3.7177,6.1676,1.7411,5.0706,1.365,8.2513,5.7838,2.6098,4.4161,3.0494,8.2513,6.8863,-10.3096,-14.6848,-6.6449,-9.9116,2.9655,-19.382,-21.685,14.6848,8.0398,0.7265,-1.5808,2.1794,0.9234,1.3443,-0.3471,-0.4893,2.1794,3.7602,9.8784,8.2642,11.1245,9.7945,0.9315,0.1764,-0.19,11.1245,2.8604,13.0562,10.5674,16.8812,11.9028,2.3303,19.1825,21.729,16.8812,6.3138
20,0.0196,-2.8519,2.0051,0.3281,1.1124,-0.1196,-0.4301,2.8519,4.8569,-0.1456,-2.7078,1.113,-0.1296,0.7902,0.2616,0.205,2.7078,3.8208,-9.9553,-18.9967,-5.0957,-9.5395,2.543,-0.074,-0.2664,18.9967,13.9011,-1.0977,-11.6955,11.1014,-1.7599,5.4852,6.6852,6.3531,11.6955,22.797,9.4867,-0.3675,22.9338,8.8331,6.4085,-2.2395,-3.7712,22.9338,23.3012,-29.6916,-36.0699,-19.0358,-31.5966,5.5863,3.1827,3.8345,36.0699,17.0341,0.3793,-12.7443,4.6402,0.4341,3.4097,-1.2467,-0.8419,12.7443,17.3844,10.0548,5.8131,19.1905,9.6045,2.5062,0.1319,0.3499,19.1905,13.3774,32.2388,22.9684,41.7467,33.6317,5.7585,-3.4287,-5.1505,41.7467,18.7783
21,-0.1,-3.6662,2.8154,-0.102,1.7997,0.7457,0.7406,3.6662,6.4817,0.1159,-0.9078,1.4194,0.0754,0.716,-0.1107,-0.362,1.4194,2.3272,-10.0294,-11.5071,-9.2255,-9.8059,0.8232,0.2719,0.0964,11.5071,2.2815,5.5874,-0.2691,13.9246,4.5932,4.2014,4.609,6.661,13.9246,14.1937,7.2472,2.6425,25.48,5.0619,7.6142,-2.8197,1.2162,25.48,22.8375,-26.5089,-35.6413,-18.2804,-27.7621,6.7992,4.8365,3.6659,35.6413,17.361,-0.8674,-12.6406,5.794,-0.4078,5.3888,1.5058,-2.2027,12.6406,18.4346,10.1867,9.2403,11.8812,9.9544,0.9061,-0.3601,-0.1554,11.8812,2.6409,28.81,19.1164,42.8906,28.4812,8.4899,-3.3923,-1.7764,42.8906,23.7743
22,0.6458,-0.4088,1.4836,0.6385,0.4567,0.3051,0.4427,1.4836,1.8924,0.0052,-0.9916,1.4266,-0.2866,0.8699,0.1607,0.4264,1.4266,2.4182,-9.7575,-11.445,-8.3699,-9.7095,0.8813,0.0957,0.708,11.445,3.0751,10.1964,4.1668,13.214,11.2541,2.8352,-9.5502,-13.4483,13.214,9.0472,4.4275,-6.8775,9.5637,6.2781,4.7352,1.5703,-2.6775,9.5637,16.4412,-21.6724,-32.566,-1.4157,-24.0962,9.4233,23.5213,27.0773,32.566,31.1503,0.6384,-10.0642,16.6467,-2.6105,8.9492,0.0856,1.1731,16.6467,26.7109,9.8266,8.4474,11.4588,9.799,0.8615,0.1791,-0.6423,11.4588,3.0114,25.4177,11.0382,35.6038,26.7048,7.9336,-8.5314,-11.9922,35.6038,24.5657
23,0.9508,-5.7214,3.4647,1.0813,2.1738,-0.1452,-0.228,5.7214,9.1861,0.1659,-1.1059,1.864,0.1397,0.8225,0.0011,-0.0257,1.864,2.9699,-9.6618,-19.7793,-3.5149,-9.0015,3.2926,-0.4316,-1.1261,19.7793,16.2643,0.6462,-14.4486,18.8298,-2.1942,10.5331,3.7952,6.7757,18.8298,33.2783,5.9978,-6.895,29.6013,3.6006,10.1026,-1.9378,0.4375,29.6013,36.4963,1.8489,-14.7554,17.8824,2.9811,9.6176,-10.2662,-11.6668,17.8824,32.6378,0.724,-10.9115,22.4754,-1.4374,8.2499,-0.3958,1.3764,22.4754,33.3869,10.0057,5.0508,20.2713,9.1567,3.1871,0.1517,0.9871,20.2713,15.2204,16.8863,7.6243,34.1483,14.7126,7.0357,-6.1237,-4.2386,34.1483,26.524
24,0.8057,-0.17,1.876,0.8532,0.7083,0.1612,0.4632,1.876,2.046,0.167,-0.1711,0.7097,0.114,0.3123,-0.5835,-0.4994,0.7097,0.8809,-10.0934,-13.7247,-6.6178,-10.1276,2.0251,0.9575,1.1078,13.7247,7.1069,4.4413,0.2307,7.5778,4.5815,2.1958,0.0121,0.3194,7.5778,7.3472,4.06,1.505,7.2362,4.0381,1.8662,-2.0628,-4.6812,7.2362,5.7312,-8.4173,-11.5466,-3.8518,-8.6857,2.7635,-9.0849,-8.5127,11.5466,7.6947,0.3282,-0.88,2.2598,-0.061,1.0818,-8.0392,-2.1113,2.2598,3.1398,10.1574,6.6922,13.744,10.1439,1.9983,-0.0664,-0.8577,13.744,7.0518,10.7626,7.7191,13.8688,10.474,2.432,11.2754,9.6242,13.8688,6.1497
26,1.1281,-2.3263,3.4831,1.7795,2.1455,-0.0722,-0.3445,3.4831,5.8094,-0.9999,-5.3677,2.9005,-0.8847,2.356,0.1118,-0.2368,5.3677,8.2682,-8.1785,-20.4441,1.5358,-7.912,7.4235,-1.0055,-1.1824,20.4441,21.9798,4.4656,-17.1043,27.4567,5.2204,15.3808,-0.95,-0.969,27.4567,44.561,-0.0656,-16.8438,18.5587,-5.3244,14.0729,2.3565,5.1975,18.5587,35.4025,-26.5871,-45.2337,-6.633,-25.7112,13.5988,5.154,4.0675,45.2337,38.6007,-15.7503,-147.3804,48.2551,-4.2835,58.3585,6.8549,1.9321,147.3804,195.6355,10.0246,3.2733,20.6349,8.4285,5.4272,0.2382,1.0639,20.6349,17.3617,33.3133,18.9953,51.3013,29.7223,13.4861,-7.6213,-5.5476,51.3013,32.306
28,0.9838,-0.7357,2.2466,1.0906,1.2284,-0.6734,-0.7065,2.2466,2.9823,-0.7764,-2.1656,3.3188,-1.3584,1.9108,0.1658,0.6301,3.3188,5.4844,-10.1896,-12.2809,-7.924,-10.2768,1.5358,0.4208,0.2574,12.2809,4.3569,2.5657,-6.0381,8.403,3.2825,4.9641,-7.5207,-8.6867,8.403,14.4412,4.6473,2.0213,6.0113,5.0706,1.3139,-1.4055,-2.0125,6.0113,3.99,-16.2791,-26.8411,-2.9135,-17.5761,8.8948,14.5638,17.1054,26.8411,23.9276,-2.0404,-10.9141,8.166,-0.4192,7.9437,3.3349,0.8631,10.9141,19.0801,10.501,8.506,12.4096,10.5562,1.3968,-0.6809,-0.5043,12.4096,3.9036,18.0707,7.0024,28.1471,18.6271,8.2072,-9.1046,-9.2411,28.1471,21.1448
29,0.3104,-0.527,0.7917,0.3841,0.4703,0.7765,0.7682,0.7917,1.3188,-0.6107,-1.3751,0.4249,-0.7283,0.6159,1.6749,1.4242,1.3751,1.8,-9.7688,-12.1429,-7.2189,-10.0194,1.5423,0.3193,0.2945,12.1429,4.924,-4.9551,-11.0021,2.4519,-5.4042,5.0626,-2.1339,-2.2564,11.0021,13.454,3.2419,-1.3563,6.5188,3.0581,2.4718,-1.4175,-0.385,6.5188,7.875,-1.7153,-9.3473,4.1587,-0.4707,4.7872,16.7222,16.7857,9.3473,13.506,1.2945,-4.6281,7.9335,0.4439,4.5857,-11.4156,-5.4745,7.9335,12.5615,9.8201,7.3248,12.2461,10.0519,1.5389,-0.0668,-0.1628,12.2461,4.9213,8.9661,5.3254,12.1259,9.3861,2.4932,8.3523,9.1761,12.1259,6.8004
30,1.087,-0.5837,3.9688,1.1524,1.5913,-0.4674,-0.7003,3.9688,4.5526,1.0642,0.2962,2.4672,0.696,0.862,-0.8207,-0.5855,2.4672,2.171,-9.4495,-13.3392,-5.5396,-9.7249,2.3548,-0.3275,-0.4516,13.3392,7.7995,-7.089,-12.2007,1.56,-7.6606,4.5411,6.0482,7.4572,12.2007,13.7607,1.8244,-3.1937,5.1888,2.6731,3.0722,1.139,-0.3544,5.1888,8.3825,15.0069,8.1238,19.0845,16.315,3.7128,-12.2879,-14.3254,19.0845,10.9607,-10.1211,-30.1022,0.4621,-5.0306,11.1491,8.2637,5.0849,30.1022,30.5643,9.7532,6.0059,13.58,9.8891,2.1909,0.304,0.5594,13.58,7.5741,17.3184,9.7649,21.736,18.5622,4.4373,-7.1677,-8.9253,21.736,11.9711
31,0.6196,-1.9062,3.9881,0.452,1.6139,-0.2548,-0.2842,3.9881,5.8943,0.2435,-2.8418,2.8137,0.1104,1.4661,-1.3874,-1.3521,2.8418,5.6556,-9.777,-13.9013,-4.187,-10.1766,2.5746,-0.1384,0.3172,13.9013,9.7143,-1.0408,-10.2371,5.5543,-0.2034,4.3407,3.9046,4.1873,10.2371,15.7914,2.9633,-2.205,10.15,2.3188,3.3123,0.4164,0.875,10.15,12.355,2.719,-11.861,18.2437,1.9896,8.5297,-18.5153,-18.7148,18.2437,30.1047,-1.8574,-18.5852,5.2323,0.0542,6.0179,-0.1949,-2.4963,18.5852,23.8176,10.0573,4.848,13.9188,10.4485,2.4587,0.0622,-0.5058,13.9188,9.0707,10.1507,4.5723,19.0781,9.6369,3.614,6.8411,7.7613,19.0781,14.5058
32,0.3647,-0.9306,2.0285,0.1679,1.1585,-0.0528,0.2157,2.0285,2.9591,-1.1439,-2.478,1.3225,-1.2417,1.2791,1.2681,1.4909,2.478,3.8005,-9.9154,-11.2168,-8.7043,-9.8593,0.9493,0.0749,-0.0423,11.2168,2.5125,2.8638,-2.1317,5.4197,3.9839,2.6361,-5.0246,-6.0997,5.4197,7.5514,3.3797,0.8575,6.23,3.1937,1.8553,-0.1684,-0.1706,6.23,5.3725,-15.7963,-23.7551,-3.3837,-16.7252,7.0432,17.0253,17.3219,23.7551,20.3713,-2.0523,-9.3921,7.1675,-2.442,5.0993,0.6885,2.4176,9.3921,16.5595,10.1195,9.1251,11.6452,9.9427,0.9237,-0.165,0.0966,11.6452,2.5202,16.9918,7.4032,24.1349,17.3982,6.1339,-4.4883,-6.1577,24.1349,16.7317
33,0.3119,-1.1939,2.5076,0.3836,0.8379,0.3272,0.4146,2.5076,3.7015,0.1241,-2.9603,1.5295,0.2492,1.1691,0.0066,0.0969,2.9603,4.4899,-9.8405,-11.84,-6.3577,-9.9016,1.1269,0.0651,0.3563,11.84,5.4823,-2.1608,-9.5225,8.258,-2.1157,4.9309,4.1425,2.915,9.5225,17.7805,3.2112,-1.505,6.2563,3.0231,2.1162,0.3292,0.525,6.2563,7.7612,1.229,-19.2933,20.9106,0.5966,12.2834,-1.2568,0.2755,20.9106,40.2039,-1.3639,-13.1748,6.1586,-0.0244,4.6019,-0.1081,0.3961,13.1748,19.3334,9.9545,7.0034,11.9587,10.0392,1.0493,-0.0443,-0.304,11.9587,4.9554,12.5035,3.0178,22.3755,11.2405,5.8092,-1.9206,-0.4008,22.3755,19.3577
34,0.6391,-1.7685,2.1206,0.7982,1.0581,-0.6092,-0.6149,2.1206,3.8891,0.1308,-2.4146,1.511,0.3462,1.1015,-0.4805,-0.6801,2.4146,3.9256,-9.7754,-15.438,-7.5747,-9.5454,1.8296,-1.5022,-0.7045,15.438,7.8633,1.9818,-3.7521,12.5942,0.7993,4.7767,-0.3417,0.2078,12.5942,16.3463,3.5405,-4.3313,9.5812,3.5481,3.4918,0.1509,1.2469,9.5812,13.9125,-0.0278,-14.926,17.0069,0.8721,9.3075,1.3565,-1.5372,17.0069,31.9329,-1.4719,-21.8528,6.0227,0.3717,7.2023,0.1281,-0.6263,21.8528,27.8755,9.9102,7.877,15.6975,9.7353,1.8316,1.4718,0.5468,15.6975,7.8205,10.583,1.5179,17.2951,10.8396,4.685,-4.022,-4.1638,17.2951,15.7772
35,0.0299,-3.3671,1.53,0.1833,1.5544,0.4298,0.2233,3.3671,4.897,-0.3498,-1.6259,0.599,-0.3339,0.7788,-0.3589,-0.6574,1.6259,2.2249,-11.2775,-21.8897,-7.6341,-10.2499,4.407,1.5157,0.1909,21.8897,14.2556,1.6401,0.4668,4.1028,1.0071,1.4012,2.3889,3.0346,4.1028,3.636,3.6914,-1.8375,8.96,4.795,3.4697,-0.7569,-1.7413,8.96,10.7975,1.3287,-3.6725,13.1532,-0.665,5.8455,-14.9613,-13.509,13.1532,16.8257,-1.3438,-5.7618,0.5515,-0.2546,2.3947,-2.7781,-2.6641,5.7618,6.3133,11.382,7.8089,22.1496,10.2821,4.4586,-1.3986,-0.1503,22.1496,14.3407,6.561,1.3845,13.944,6.6758,4.4318,8.1185,9.0313,13.944,12.5595
36,0.4597,-0.3963,1.2941,0.4067,0.6343,0.2935,0.1004,1.2941,1.6904,-0.7087,-3.1638,2.3691,-0.9913,1.9221,1.4935,2.198,3.1638,5.5329,-9.7619,-10.5499,-8.2806,-10.059,0.7239,0.2712,0.4068,10.5499,2.2694,4.029,0.9773,6.9316,4.0417,1.9507,-12.7187,-13.35,6.9316,5.9542,2.9345,1.3475,4.2962,3.0537,1.1421,1.1091,2.4063,4.2962,2.9487,-13.6326,-22.4201,-3.0366,-14.174,7.2619,19.0417,22.2452,22.4201,19.3834,-4.1219,-21.93,11.9575,-2.9187,10.6264,-4.3478,-8.408,21.93,33.8875,9.9834,8.622,10.8568,10.1318,0.6613,-0.2722,-0.3896,10.8568,2.2348,14.6795,3.4629,23.2956,15.7072,7.2362,-0.5752,-2.1927,23.2956,19.8326
37,0.7532,-0.7726,2.4615,0.5071,1.2259,-0.2331,0.4415,2.4615,3.2341,0.7848,-1.195,2.2991,1.2067,1.2194,-0.9563,-1.5619,2.2991,3.4941,-9.4907,-14.0754,-6.4887,-9.6522,2.7514,0.3284,0.0003,14.0754,7.5867,-8.6897,-10.927,-4.5234,-9.3083,2.1212,4.5661,5.8663,10.927,6.4036,4.0436,-4.2525,9.5025,5.46,4.5062,0.1028,-6.755,9.5025,13.755,5.4091,-8.3245,12.7967,8.0711,8.2109,-3.7321,-7.3063,12.7967,21.1212,-8.4697,-22.67,9.6128,-11.3267,11.5213,7.1211,11.7531,22.67,32.2828,9.7112,6.7497,14.0871,9.7422,2.6592,0.2324,0.0578,14.0871,7.3374,14.1043,11.8935,16.9559,13.5145,1.8156,-0.1568,-0.0553,16.9559,5.0624
38,0.5201,-3.6738,2.4511,0.9486,1.8065,0.5813,0.4247,3.6738,6.1248,-0.1714,-0.9,1.7803,-0.3552,0.8615,-0.2639,-0.5948,1.7803,2.6803,-9.1623,-20.0292,2.0403,-9.6519,6.4981,-0.862,-0.9561,20.0292,22.0695,-4.1236,-9.7578,0.6227,-3.4419,3.6041,12.9007,11.9474,9.7578,10.3805,4.1464,-7.0962,26.9325,-1.295,12.8689,0.9778,6.2781,26.9325,34.0288,1.677,-11.8244,13.6329,0.7648,9.3229,-8.4461,-8.3887,13.6329,25.4573,-1.3486,-17.3715,4.3053,0.4264,6.6407,-3.0681,-7.0051,17.3715,21.6768,9.9436,3.3137,20.3694,9.8,5.4326,0.2457,0.9676,20.3694,17.0557,13.9476,1.9132,29.4205,13.4592,9.2458,-1.0943,-0.9516,29.4205,27.5073
39,1.1014,-1.0622,2.1454,1.3733,1.0536,-0.2663,-0.3512,2.1454,3.2075,-0.4353,-1.438,1.1866,-0.95,1.0071,0.8281,1.5942,1.438,2.6246,-10.0242,-11.546,-7.4117,-10.608,1.6706,0.3387,0.8084,11.546,4.1344,8.7771,3.9403,14.3562,8.5055,3.8134,-7.0777,-6.2091,14.3562,10.4159,5.1242,1.5312,9.6775,4.9831,2.8311,-1.3486,-1.9206,9.6775,8.1463,-6.7692,-9.2992,-1.6078,-7.6239,2.7103,0.1578,-1.0817,9.2992,7.6914,-4.4167,-14.5147,9.592,-6.5787,9.0013,2.3475,5.7174,14.5147,24.1067,10.1893,7.5038,11.7852,10.7676,1.6445,-0.1969,-0.5612,11.7852,4.2814,12.8533,7.3451,17.5347,12.5075,3.3931,3.6234,3.8402,17.5347,10.1896
40,0.8351,-1.0883,2.7943,1.0221,1.2267,-0.4301,-1.0935,2.7943,3.8826,0.3928,-2.5414,3.7066,0.6442,2.0337,-0.3742,-0.7411,3.7066,6.248,-9.6856,-12.274,-8.0015,-9.7996,1.1328,-0.0496,-0.0496,12.274,4.2725,1.6993,-5.3903,7.1261,2.2964,3.2253,-6.6715,-8.7246,7.1261,12.5164,3.7756,0.3412,10.7887,3.0625,2.9513,0.076,0.5863,10.7887,10.4475,-6.6114,-24.3322,15.7583,-8.7056,15.9163,2.6183,6.0902,24.3322,40.0905,-2.0692,-13.2659,8.4559,-0.8613,6.443,-12.1421,-6.2349,13.2659,21.7219,9.9924,8.2693,12.3236,10.2064,1.1801,0.0394,-0.1792,12.3236,4.0543,16.4766,6.5947,24.7518,16.3477,6.9119,3.7798,2.7495,24.7518,18.157
41,0.405,-1.8404,3.3328,-0.0713,1.6989,-0.1036,-0.1311,3.3328,5.1732,0.0186,-2.8149,2.9448,-0.0969,1.7005,-0.2028,0.1526,2.9448,5.7597,-9.7352,-11.6397,-7.1751,-9.8491,1.2991,0.3422,0.2799,11.6397,4.4646,-4.9722,-17.2729,21.3772,-6.4282,11.7305,5.9199,7.8218,21.3772,38.6502,3.8516,-0.4462,8.5312,3.6488,2.3291,1.3098,0.6781,8.5312,8.9775,-3.9931,-37.1747,22.5886,-2.6154,18.3376,10.1884,10.6837,37.1747,59.7633,-14.2113,-60.1752,8.2788,-7.0962,20.143,9.5906,4.7097,60.1752,68.4541,10.0318,7.7428,11.8613,10.0272,1.1774,0.6413,-0.3857,11.8613,4.1185,20.2565,6.9037,43.7233,19.0972,10.0408,-2.1125,-0.1407,43.7233,36.8196
42,0.3015,-0.8873,3.6598,-0.2024,1.5017,0.1478,0.489,3.6598,4.5471,-0.1842,-2.9747,2.2889,0.0557,1.8789,-0.0349,0.1837,2.9747,5.2636,-9.393,-18.0828,3.6979,-9.5692,6.1011,-0.4324,-0.4854,18.0828,21.7807,0.9477,-5.9333,11.0747,1.3935,5.3623,1.2801,2.7256,11.0747,17.008,5.1614,-3.1588,16.765,4.3269,6.3371,-1.6472,-0.2975,16.765,19.9238,6.1953,-16.9364,25.8443,8.0683,17.1062,-9.871,-5.4052,25.8443,42.7807,-4.6206,-13.5808,1.9948,-2.3865,5.7303,11.9549,3.3687,13.5808,15.5756,10.6731,5.2059,18.0892,9.6415,3.7142,-0.6216,0.5332,18.0892,12.8833,18.1439,7.9593,26.7041,18.9565,7.7872,-2.7911,-7.015,26.7041,18.7448
43,0.4492,-1.4888,2.4796,0.2866,0.8476,-0.0562,0.0105,2.4796,3.9685,-0.2191,-5.6436,1.7246,0.2394,1.8872,0.222,-0.1951,5.6436,7.3682,-9.8254,-13.9358,-3.8549,-10.0546,1.8048,0.0971,0.336,13.9358,10.0809,2.2277,-12.2963,10.8999,4.1191,5.8308,-4.4526,-6.8122,12.2963,23.1963,3.5142,-2.3538,9.1438,4.0294,3.036,-0.2589,-0.525,9.1438,11.4975,-3.6757,-41.0416,11.9642,2.6632,16.8779,5.8233,-1.1531,41.0416,53.0058,7.3343,-5.7651,69.3957,0.9823,17.0067,-8.0521,-1.4823,69.3957,75.1607,10.0515,4.5837,13.9395,10.1747,1.7633,-0.2517,-0.4179,13.9395,9.3558,15.3528,5.1514,41.404,11.9415,10.6903,-8.5246,-5.0485,41.404,36.2526
44,0.393,-1.2029,2.3837,0.2971,0.9045,0.2753,0.5586,2.3837,3.5866,0.0029,-1.0394,0.9287,0.0443,0.5493,-0.0305,-0.1314,1.0394,1.9682,-9.7283,-14.607,-5.4248,-9.7186,2.4363,-0.0465,-0.196,14.607,9.1822,-2.2248,-4.5386,1.792,-2.6931,1.7927,0.4399,0.5094,4.5386,6.3307,3.2554,-3.15,8.9163,3.5044,3.0102,0.319,0.3981,8.9163,12.0663,2.1475,-4.6563,9.345,1.5101,4.865,-4.0252,-3.1389,9.345,14.0013,-0.7178,-4.0356,1.2942,-0.5,1.3913,0.7895,0.4951,4.0356,5.3297,9.7998,5.4953,14.6278,9.7568,2.3999,0.0265,0.2168,14.6278,9.1325,6.8282,1.1269,12.9662,6.893,2.8857,-1.8331,-1.809,12.9662,11.8392
45,0.6683,-0.2139,1.4326,0.8557,0.5992,-0.0983,-0.6431,1.4326,1.6465,-0.0276,-0.812,0.8563,-0.0871,0.5466,0.1863,0.105,0.8563,1.6684,-9.7748,-10.7659,-8.4467,-9.9146,0.8536,0.5596,1.3673,10.7659,2.3192,-1.7849,-3.7433,0.5203,-2.1837,1.8935,2.8632,3.213,3.7433,4.2636,3.5744,0.91,5.1975,3.9025,1.6463,-1.5367,-0.8006,5.1975,4.2875,-1.8776,-3.062,-0.3548,-1.6288,0.9519,5.9337,5.5157,3.062,2.7072,0.0717,-2.0518,3.0397,-0.0049,1.4554,0.2289,-0.0063,3.0397,5.0915,9.8263,8.5379,10.8262,9.9735,0.8624,-0.3572,-1.3889,10.8262,2.2884,4.9951,3.5478,6.2742,5.0841,0.9785,1.9411,1.0712,6.2742,2.7265
46,0.5701,-2.1321,2.8428,0.2126,1.8937,-0.1125,0.3782,2.8428,4.9749,0.1587,-0.4745,0.8156,0.018,0.4322,-0.2187,-0.1711,0.8156,1.2902,-9.2152,-15.046,-3.9261,-8.5473,3.6021,-0.4084,-1.1884,15.046,11.1198,1.0783,-1.8418,4.8753,1.0293,2.0058,2.2264,3.0564,4.8753,6.7171,2.0377,-6.1862,11.6725,3.1019,5.7909,0.0908,-0.98,11.6725,17.8588,4.0561,3.055,5.5796,3.8869,0.8558,-4.1682,-4.0683,5.5796,2.5246,0.3006,-0.4033,2.0223,-0.0112,0.8027,-0.1049,-0.0784,2.0223,2.4256,9.4691,4.66,15.1261,8.5847,3.4245,0.1845,1.1637,15.1261,10.4661,6.9362,4.7609,13.6215,6.1553,2.8604,-1.9307,-0.7158,13.6215,8.8606
47,0.4576,-0.3063,1.1722,0.5908,0.5363,0.034,-0.3793,1.1722,1.4784,-0.06,-0.2759,0.6164,-0.1532,0.2983,0.3103,0.444,0.6164,0.8922,-9.6236,-11.4863,-8.2366,-9.7356,1.1757,-0.2785,-0.3708,11.4863,3.2497,3.3046,-1.3121,6.9188,4.0857,2.9909,-1.0966,-0.9644,6.9188,8.2309,2.1284,-0.1575,5.6,2.1219,1.9499,0.9341,1.1244,5.6,5.7575,-0.1121,-2.8808,3.203,-0.1814,2.0939,5.0232,5.8523,3.203,6.0838,0.1957,-0.8297,3.0018,-0.0896,1.2046,0.826,1.1166,3.0018,3.8315,9.6536,8.3196,11.5053,9.7483,1.1582,0.2798,0.3937,11.5053,3.1857,5.0055,1.627,7.7604,5.4395,2.484,2.1667,1.5119,7.7604,6.1334
48,0.4916,-0.0477,1.2307,0.2115,0.4911,-0.3502,-0.3399,1.2307,1.2784,0.2503,-0.2112,0.5918,0.2908,0.2951,-0.328,-0.3237,0.5918,0.8031,-9.9021,-10.5897,-8.9219,-10.1064,0.6946,0.5077,1.3013,10.5897,1.6678,2.208,-3.1367,5.8415,3.1213,3.0189,-3.7187,-4.4198,5.8415,8.9782,3.0625,1.1462,4.2,3.2462,1.0018,-1.3628,-3.4125,4.2,3.0538,4.911,0.5394,7.7517,5.6709,2.4667,-2.6581,-3.5273,7.7517,7.2123,1.0217,-0.3247,2.6112,1.027,1.2001,-0.8224,-0.8106,2.6112,2.9359,9.9334,9.0087,10.5987,10.142,0.6705,-0.4434,-1.0878,10.5987,1.59,7.1722,5.592,9.1097,6.9513,1.1256,-1.7831,-1.6755,9.1097,3.5177
49,0.1414,-1.3937,2.7651,-0.1284,1.3538,0.1296,0.2868,2.7651,4.1588,-0.0777,-0.5469,0.243,-0.0329,0.3145,-0.4035,-0.3249,0.5469,0.7899,-9.3945,-13.7772,-6.559,-8.8051,2.6142,-0.3018,-0.7995,13.7772,7.2181,-1.5107,-4.3846,2.4075,-1.2984,2.2788,-8.3729,-10.3618,4.3846,6.792,1.6997,-4.7863,11.655,-0.1662,5.0225,1.6827,4.2831,11.655,16.4413,2.253,0.1075,4.2882,2.1436,1.4187,-1.9054,-3.6497,4.2882,4.1806,0.1993,-1.0653,1.4327,0.2164,0.7276,5.2667,4.0799,1.4327,2.498,9.49,6.5774,13.8501,9.0543,2.5947,0.3115,0.5938,13.8501,7.2726,5.3891,0.8509,12.0081,5.2759,3.3092,10.3309,8.9349,12.0081,11.1572
50,0.271,-2.439,3.1054,0.1584,1.2815,0.0638,-0.062,3.1054,5.5445,-0.4812,-1.5002,0.3142,-0.3578,0.5536,-0.0118,-0.1478,1.5002,1.8144,-9.6963,-13.3705,-6.1874,-9.6046,1.8076,-0.248,-0.0811,13.3705,7.1831,-9.8835,-14.7509,-2.0476,-11.6603,4.4992,14.3896,15.6538,14.7509,12.7032,3.3824,-4.5325,8.715,4.1169,3.3234,0.4545,-0.4113,8.715,13.2475,0.3476,-13.0033,22.7483,-1.5061,11.6423,-13.7676,-12.4471,22.7483,35.7516,5.466,-4.5898,19.1274,4.2962,6.9476,-5.9848,-5.2378,19.1274,23.7171,9.8015,6.1969,13.4709,9.6481,1.8311,0.1973,0.0819,13.4709,7.274,15.72,11.2727,25.6865,14.2108,4.4461,-0.4931,2.0809,25.6865,14.4138
51,0.3347,-0.4643,1.3203,0.0964,0.6672,-0.2776,-0.0693,1.3203,1.7847,-0.493,-1.2674,0.4973,-0.5057,0.5525,0.466,0.5541,1.2674,1.7647,-9.9443,-11.8048,-8.1636,-9.6857,1.3261,0.1219,-0.3017,11.8048,3.6412,4.506,-1.439,10.2674,3.9936,4.8098,-2.2753,-0.7519,10.2674,11.7064,3.8369,2.7212,5.6175,3.7056,1.0059,-0.3325,0.2625,5.6175,2.8963,-13.4199,-16.9145,-7.2549,-13.9532,3.2496,16.3799,14.4952,16.9145,9.6596,-0.5188,-4.4545,4.7138,-0.9416,2.6765,2.4546,2.3967,4.7138,9.1683,9.9988,8.3663,11.8535,9.7299,1.2933,-0.1294,0.2812,11.8535,3.4873,15.2269,8.1825,19.2182,16.2916,3.9468,-6.2536,-8.8196,19.2182,11.0357
52,0.0571,-2.4471,1.0115,0.0271,0.67,-0.2326,-0.2368,2.4471,3.4586,-0.0271,-1.2686,1.3889,0.0485,0.7323,-0.1715,-0.3007,1.3889,2.6575,-9.8224,-11.3907,-7.9357,-9.9874,0.7908,0.4194,0.3485,11.3907,3.455,2.2307,-4.0318,7.4526,3.2416,4.1701,-1.9512,-3.0593,7.4526,11.4845,3.5044,0.0437,6.09,3.9681,1.4196,-1.1469,-0.7,6.09,6.0463,2.96,-6.3685,15.5792,0.542,7.0992,3.3587,6.2033,15.5792,21.9477,1.9358,-1.7696,9.3701,1.4551,2.7684,-2.329,-1.4847,9.3701,11.1397,9.8693,8.0564,11.6566,10.0112,0.8062,-0.4237,-0.3169,11.6566,3.6002,8.9733,4.5811,16.2169,7.4721,3.596,0.2815,0.6767,16.2169,11.6358
53,-0.1755,-0.9239,0.5481,-0.2097,0.4231,-0.3566,-0.0136,0.9239,1.4721,-0.1986,-1.8658,1.3309,-0.2522,0.766,-0.1157,-0.2008,1.8658,3.1967,-9.403,-12.6581,-2.8262,-9.6389,1.756,-0.5401,-0.0894,12.6581,9.8319,0.2795,-5.7486,4.5308,0.1823,2.9824,-0.0737,0.0527,5.7486,10.2794,2.3575,-5.3725,5.74,3.2681,2.8739,1.8473,-0.1137,5.74,11.1125,6.3187,-5.8182,15.0181,6.7453,5.9365,-0.8562,-2.6708,15.0181,20.8363,-0.3932,-6.8378,2.5581,-0.0296,2.3217,0.2899,-0.0445,6.8378,9.3958,9.4456,2.879,12.6874,9.6943,1.7571,1.3023,0.1152,12.6874,9.8085,9.2548,3.8296,15.5523,8.1488,3.2713,1.7903,0.8673,15.5523,11.7227
54,-0.5321,-5.6765,4.6068,-0.2233,1.8669,-0.5226,-0.7079,5.6765,10.2833,-0.3143,-2.0956,1.7982,-0.453,1.0429,-0.2321,0.0975,2.0956,3.8939,-9.9431,-20.1153,7.494,-9.7283,4.9528,0.209,-0.0093,20.1153,27.6092,0.2058,-6.6814,9.8062,0.2351,3.7085,-3.4107,-1.0873,9.8062,16.4877,4.2047,-15.0062,33.3725,3.1544,9.5118,-0.887,0.315,33.3725,48.3788,5.4625,-1.8179,20.9623,4.0745,5.8986,0.5997,3.4448,20.9623,22.7802,-0.1033,-11.331,10.9955,-0.0741,4.2184,4.3562,0.3474,11.331,22.3265,10.7479,5.2297,20.2232,9.8094,3.4904,-0.9008,0.1055,20.2232,14.9935,11.0452,2.2975,33.6862,9.0161,7.8491,-0.1871,0.8609,33.6862,31.3886
55,-1.0548,-2.1687,-0.1115,-0.9312,0.4545,0.189,0.0513,2.1687,2.0572,-0.5464,-2.3541,0.4572,-0.3555,0.8239,1.3171,1.0008,2.3541,2.8113,-9.7341,-12.5988,-7.4769,-9.7376,0.9327,-0.1111,-0.0627,12.5988,5.1218,-3.2048,-11.3271,3.2122,-0.8522,5.4784,9.7903,8.3486,11.3271,14.5393,3.3177,-0.735,4.83,3.4694,1.058,0.7882,0.4506,4.83,5.565,6.0621,-13.8168,15.7319,7.5193,7.4508,-19.4538,-23.4733,15.7319,29.5488,4.2529,-2.6277,25.3591,0.2734,8.0756,2.1157,4.8488,25.3591,27.9867,9.8471,7.4917,12.7866,9.9149,0.958,0.0998,0.0177,12.7866,5.2949,10.858,3.1249,19.1512,9.877,4.9168,7.3902,8.3888,19.1512,16.0264
56,-0.8658,-1.143,-0.2755,-0.8799,0.2743,1.356,1.331,1.143,0.8675,0.7708,-0.6559,2.1567,0.6454,0.8285,-1.3122,-1.1211,2.1567,2.8125,-9.8451,-11.4581,-8.8481,-9.8003,0.7586,0.021,-0.1107,11.4581,2.6101,6.5855,2.1077,8.371,7.4964,2.1983,-4.8756,-5.2152,8.371,6.2632,4.1059,2.6775,6.4662,3.92,1.1785,3.0778,3.5481,6.4662,3.7888,-13.3916,-27.4794,5.7271,-15.954,12.9949,-11.7161,-10.9687,27.4794,33.2065,6.3687,-1.3824,17.8397,5.1221,6.1381,-4.4143,-3.1896,17.8397,19.2221,9.947,8.9604,11.5292,9.9326,0.7549,-0.0075,0.0477,11.5292,2.5688,18.2483,9.1828,27.8122,18.2657,8.2647,8.1091,10.0967,27.8122,18.6295
57,0.4903,-0.1789,1.5731,0.4511,0.5257,0.341,0.3615,1.5731,1.752,-0.5414,-2.2943,1.3189,-0.4757,1.28,1.5103,1.5466,2.2943,3.6132,-9.8241,-10.955,-7.685,-9.911,0.9619,-0.1007,0.3183,10.955,3.27,1.7099,-1.8379,5.0103,2.2812,2.8962,4.9281,4.3629,5.0103,6.8481,7.1838,4.06,9.3013,7.4681,2.1107,-1.6778,-2.4194,9.3013,5.2413,-25.1077,-29.9059,-14.8647,-26.9228,5.1877,52.0605,57.4712,29.9059,15.0412,1.9543,-1.4415,5.5949,1.9325,2.5283,7.9379,5.112,5.5949,7.0364,9.9395,7.9029,10.9592,9.9803,0.9186,0.1227,-0.1498,10.9592,3.0563,26.3574,15.5184,30.9114,28.3625,5.3455,3.1281,3.309,30.9114,15.393
58,0.8312,0.4169,1.3638,0.8126,0.2876,-0.1299,-0.073,1.3638,0.9468,0.9689,-0.9216,2.2883,1.0709,1.0581,-1.0693,-1.6507,2.2883,3.2099,-9.9248,-11.2867,-9.3207,-9.5927,0.6846,0.0454,-0.2425,11.2867,1.966,6.638,2.0952,12.3644,6.6441,4.1658,-6.0535,-5.9532,12.3644,10.2692,5.5059,3.045,8.6362,5.0488,2.387,4.305,4.8781,8.6362,5.5913,26.9528,5.7041,39.7331,30.5484,12.7546,16.8809,12.7202,39.7331,34.0289,9.8922,-2.148,28.2938,7.0445,10.9077,-10.8991,-7.9268,28.2938,30.4418,10.0621,9.5077,11.3395,9.8305,0.629,-0.0701,0.1792,11.3395,1.8318,29.4855,14.0881,40.7147,31.6714,10.3621,15.4557,12.6828,40.7147,26.6266
59,0.7014,0.3168,1.1899,0.7396,0.3013,-0.0447,-0.1805,1.1899,0.8732,-0.1004,-1.5708,2.0107,-0.5799,1.3783,0.3029,1.2779,2.0107,3.5815,-9.8794,-10.1068,-9.6869,-9.8352,0.1553,-0.1428,-0.294,10.1068,0.4199,0.5845,-1.378,2.22,0.691,1.2714,-4.0026,-3.0205,2.22,3.5981,9.8109,9.2575,10.0888,9.9269,0.2772,1.453,1.9469,10.0888,0.8313,43.8336,38.4007,48.8013,43.2686,3.456,-1.5787,3.1498,48.8013,10.4006,-1.0069,-3.1618,0.9631,-0.8822,1.2259,5.9404,2.8503,3.1618,4.1249,9.992,9.735,10.2504,10.0097,0.1765,0.1552,0.2266,10.2504,0.5155,44.9412,39.6295,49.8598,44.3543,3.4152,-0.3215,4.2122,49.8598,10.2303
60,0.6566,-0.5701,2.0704,0.5591,0.686,0.3552,0.2237,2.0704,2.6405,0.2025,-2.7664,1.8287,0.698,1.2678,-0.7445,-1.3129,2.7664,4.5952,-10.0223,-11.3374,-7.7458,-10.1292,0.6794,0.4107,0.669,11.3374,3.5917,-3.4181,-13.3299,6.6268,-2.3296,6.2611,-3.0638,-3.7093,13.3299,19.9567,11.2639,6.3263,15.2863,11.8738,2.7868,-8.1249,-8.89,15.2863,8.96,42.255,10.4559,57.6345,46.4184,14.2338,-41.6926,-44.8294,57.6345,47.1785,4.9335,-3.6967,30.2995,1.9681,8.961,-2.2247,1.9117,30.2995,33.9963,10.1472,8.2035,11.4336,10.2363,0.6401,-0.3147,-0.5585,11.4336,3.2301,44.6197,15.9643,59.4205,48.5665,13.4172,-32.8745,-36.7678,59.4205,43.4562
61,1.0119,-0.0662,2.2619,0.7828,0.7076,-0.1834,0.2036,2.2619,2.3281,-0.542,-3.4798,1.6672,-0.6149,1.5983,0.1563,0.7642,3.4798,5.1469,-9.6116,-12.2214,-8.0702,-9.4603,1.1379,-0.1488,-0.1878,12.2214,4.1512,-6.4819,-11.006,-2.5812,-6.0388,2.4135,6.3664,6.021,11.006,8.4248,3.1391,-0.4637,5.6438,2.9838,1.6034,0.7042,0.8663,5.6438,6.1075,0.5624,-14.0685,19.7951,1.589,10.4834,-6.8489,-6.0132,19.7951,33.8636,2.7089,-10.5539,17.4602,3.8798,9.0208,-0.1303,-3.7223,17.4602,28.0141,9.8325,8.1546,12.2774,9.6778,1.0828,0.0452,0.0357,12.2774,4.1228,11.7452,4.6129,23.1384,11.7986,5.1782,3.9194,1.7822,23.1384,18.5256
62,0.8285,-0.1292,1.5135,0.9864,0.4886,0.0832,-0.1116,1.5135,1.6427,-0.3857,-3.0022,1.1561,0.1493,1.1124,0.3043,-0.2151,3.0022,4.1584,-9.7603,-11.8591,-8.6666,-9.648,0.8037,-0.0066,-0.1901,11.8591,3.1925,-0.1155,-8.9822,8.9328,-0.0179,5.5937,1.5157,2.8007,8.9822,17.915,3.8433,1.6537,6.1687,3.85,1.1148,-0.4807,-0.7656,6.1687,4.515,-6.2865,-28.1199,14.7352,-4.4242,14.771,11.5445,8.2958,28.1199,42.8551,2.5786,-7.1456,16.0948,0.1576,6.5451,-3.6913,0.0369,16.0948,23.2404,9.8777,8.7407,12.0074,9.7135,0.7707,-0.0368,0.1888,12.0074,3.2667,15.6646,5.3691,28.3593,13.5808,7.2107,-0.3601,2.664,28.3593,22.9902
63,0.9117,-0.1675,2.0384,0.8748,0.5148,0.1415,0.2564,2.0384,2.206,-0.0814,-1.2082,0.9018,-0.0658,0.5519,-0.6377,-0.7441,1.2082,2.11,-9.767,-12.2921,-8.1479,-9.8381,0.8935,-0.0537,0.011,12.2921,4.1442,1.4002,-18.1139,14.6382,2.7828,10.1655,-8.0423,-12.3784,18.1139,32.7521,3.3626,1.6275,5.9588,3.0844,1.2633,1.0048,1.7063,5.9588,4.3313,5.258,-12.8519,22.0286,3.8716,12.1737,-14.871,-14.6316,22.0286,34.8805,-1.1127,-10.4151,5.2935,0.1945,4.3189,6.1195,1.283,10.4151,15.7086,9.8408,8.3299,12.3341,9.9023,0.8547,0.088,0.0405,12.3341,4.0043,15.3045,3.237,26.5208,16.2448,7.1704,0.9571,-0.3318,26.5208,23.2838
64,1.0532,0.0288,1.7254,1.1312,0.5197,-0.69,-0.8301,1.7254,1.6965,-0.7191,-1.5038,0.0126,-0.8099,0.5312,0.8129,0.8426,1.5038,1.5164,-9.8206,-11.0103,-9.1084,-9.8271,0.5781,0.0987,0.1554,11.0103,1.9018,-6.642,-14.1601,5.6497,-9.5956,7.7683,9.9663,12.6829,14.1601,19.8098,4.3673,2.8438,5.1188,4.7906,0.8683,-1.5597,-2.2488,5.1188,2.275,-9.613,-18.7466,2.9834,-10.76,8.3825,17.2045,18.3567,18.7466,21.73,5.0068,-6.2072,19.0749,1.4774,8.9335,-4.3176,-1.4114,19.0749,25.2821,9.9289,9.2718,11.0103,9.9428,0.5498,-0.1805,-0.2587,11.0103,1.7385,16.2615,12.9821,20.2375,15.913,2.6419,-6.9613,-7.1405,20.2375,7.2553
65,0.3632,-0.3919,1.2821,0.3011,0.5792,0.1786,0.3146,1.2821,1.674,0.0938,-0.2172,0.4285,0.0326,0.2488,0.0889,0.3444,0.4285,0.6457,-9.7219,-11.5237,-7.5852,-9.6717,1.2368,-0.1627,-0.1801,11.5237,3.9385,3.3243,-0.6796,7.5975,3.0873,3.3845,0.8657,0.6785,7.5975,8.2771,2.8077,0.5075,5.9062,2.5419,1.7879,1.2589,1.6669,5.9062,5.3988,7.5915,6.8904,8.4235,7.5968,0.5102,4.7284,6.5037,8.4235,1.5331,0.6891,-0.4336,3.1394,0.066,1.2596,1.8649,1.8925,3.1394,3.5729,9.7483,7.6078,11.5329,9.6842,1.2252,0.1687,0.2072,11.5329,3.9251,9.3003,7.0949,12.2245,8.7725,1.8873,6.0135,6.6391,12.2245,5.1296
66,0.5418,-0.1235,0.9688,0.6157,0.3749,-0.859,-0.9911,0.9688,1.0923,0.1827,-0.7253,0.5499,0.377,0.4344,-0.0935,-0.1783,0.7253,1.2752,-9.8846,-11.3622,-8.2635,-9.8518,0.9045,0.0388,-0.0291,11.3622,3.0987,4.19,-5.1487,13.2904,3.7658,6.4462,-0.737,-0.1349,13.2904,18.439,4.0666,1.6888,5.7925,4.2088,1.3187,-0.9067,-1.0959,5.7925,4.1037,12.3199,5.6582,15.2319,14.1005,3.526,-7.0079,-8.0334,15.2319,9.5736,2.554,0.0355,7.3089,1.9585,2.3308,-1.2503,-0.9589,7.3089,7.2734,9.917,8.3208,11.3633,9.8914,0.8874,-0.0141,0.0585,11.3633,3.0425,15.3138,14.417,15.5589,15.4116,0.3695,-5.5064,-5.5389,15.5589,1.1419
68,-1.1763,-1.6409,-0.1973,-1.3665,0.4876,0.3506,0.6188,1.6409,1.4436,-0.0044,-0.3393,0.3477,0.0203,0.2203,-0.2436,-0.2965,0.3477,0.687,-9.8071,-10.6603,-8.0534,-9.91,0.8362,0.0281,0.1903,10.6603,2.6068,2.7161,-0.1884,4.9294,3.4959,2.2525,-2.1074,-2.4668,4.9294,5.1178,2.2531,0.98,3.9812,2.0169,1.0017,1.5061,1.6406,3.9812,3.0012,-1.6959,-2.8209,-0.2869,-1.9664,0.8968,-3.8234,-4.168,2.8209,2.534,0.0533,-1.5625,0.9371,0.0406,0.7532,-0.0323,-0.177,1.5625,2.4996,9.8889,8.063,10.6843,10.0083,0.8513,-0.0549,-0.1909,10.6843,2.6213,4.301,1.6796,6.3941,4.3338,1.8052,2.9119,2.9372,6.3941,4.7145
69,-0.8257,-1.7242,0.2127,-0.7477,0.6103,1.1765,1.2164,1.7242,1.9369,-0.248,-0.5296,0.0257,-0.2762,0.2015,0.0293,0.2205,0.5296,0.5553,-9.779,-10.994,-9.1168,-9.7196,0.6209,0.1173,0.1925,10.994,1.8772,0.6086,-3.0923,3.464,1.0291,2.4376,-4.4808,-5.3927,3.464,6.5563,3.7592,2.3362,5.4075,3.6575,1.117,0.0763,0.3238,5.4075,3.0713,-5.5192,-6.9236,-3.1442,-6.1344,1.4141,11.0599,12.9931,6.9236,3.7794,0.021,-0.9558,1.6376,-0.1363,0.7569,3.432,1.6439,1.6376,2.5935,9.834,9.13,11.0938,9.8175,0.6433,-0.1246,-0.2676,11.0938,1.9638,7.2129,5.3276,8.4161,7.271,1.0578,6.8447,6.4718,8.4161,3.0885
70,0.3508,-1.5235,1.1863,0.4687,0.6253,0.1637,-0.048,1.5235,2.7097,-0.2188,-1.3428,0.6469,-0.0557,0.6161,0.2734,-0.1215,1.3428,1.9897,-9.6617,-12.0814,-8.0363,-9.5271,0.9943,-0.2295,-0.3527,12.0814,4.0451,-3.8721,-12.9757,5.4024,-4.3636,6.5277,11.8493,13.1299,12.9757,18.3781,3.8355,-1.6888,7.8225,3.9813,2.047,-3.0026,-3.0013,7.8225,9.5113,5.5406,-14.0595,18.9206,6.8587,10.7567,-12.2028,-16.6356,18.9206,32.9801,3.453,-1.1974,16.1233,1.5076,5.1043,-2.6123,-2.9195,16.1233,17.3207,9.7095,8.0634,12.0831,9.5498,0.9876,0.2277,0.3767,12.0831,4.0196,14.0576,7.3737,21.4023,13.7428,4.4506,-1.2635,-1.0423,21.4023,14.0286
71,0.5145,-0.3632,1.4891,0.4206,0.6159,0.0316,0.2831,1.4891,1.8523,0.0546,-0.4943,1.0502,-0.1771,0.528,0.0281,0.1379,1.0502,1.5445,-9.8912,-11.0329,-8.1739,-9.8799,0.8429,-0.04,0.0024,11.0329,2.859,7.9772,0.5682,13.1924,8.7663,3.8438,-1.411,-3.6737,13.1924,12.6242,0.8329,-3.1763,4.8125,0.98,2.2528,4.031,3.9813,4.8125,7.9888,-6.6622,-12.4419,5.4435,-9.7769,6.4532,21.0044,23.9127,12.4419,17.8855,0.8407,-4.2087,11.0756,-1.4119,4.6883,0.5902,1.2691,11.0756,15.2843,9.9372,8.3136,11.0523,9.9265,0.8262,0.0362,-0.0303,11.0523,2.7387,12.7941,9.6854,15.1798,12.7004,1.6892,4.0335,3.2799,15.1798,5.4945
72,0.5461,-0.4271,1.1518,0.7037,0.4855,0.2121,0.2963,1.1518,1.5789,0.0827,-0.5966,1.724,-0.0392,0.5818,-0.3001,-0.3821,1.724,2.3206,-9.9312,-11.5444,-8.8496,-9.8775,0.6864,0.1208,0.2435,11.5444,2.6948,6.5661,3.5892,11.6509,5.0926,2.9483,-3.6396,-2.3094,11.6509,8.0617,4.8639,1.4262,7.9188,4.9612,1.6094,1.773,2.6338,7.9188,6.4925,14.3422,10.6098,22.5058,14.1358,2.8574,2.015,0.9114,22.5058,11.8961,1.4309,-2.847,15.3686,-0.1428,4.93,-1.1303,-0.046,15.3686,18.2156,9.9734,8.9018,11.5646,9.8962,0.6898,-0.0159,-0.1283,11.5646,2.6629,16.8276,13.6413,24.8965,15.9804,2.835,1.8698,1.2021,24.8965,11.2552
73,0.7582,-2.2252,2.2481,1.0,1.0374,-0.1997,-0.4306,2.2481,4.4733,-0.2174,-2.165,2.3308,-0.4213,1.1242,0.2334,0.1738,2.3308,4.4959,-9.8105,-13.3588,-6.6784,-9.6341,1.4368,-0.0645,-0.1774,13.3588,6.6804,2.9265,-3.88,9.5128,2.7832,4.2449,-2.9783,-2.6387,9.5128,13.3928,6.6369,-0.35,12.4775,7.595,3.4767,1.1123,-0.2931,12.4775,12.8275,16.3572,8.1299,30.8113,15.0473,6.9735,5.8423,6.0461,30.8113,22.6814,0.3006,-7.066,7.6864,-0.1888,4.0209,-1.2631,-0.2676,7.6864,14.7524,9.9575,6.8941,13.5456,9.7679,1.4217,-0.0414,0.0776,13.5456,6.6516,18.6974,8.3105,32.9179,17.1825,6.9307,4.9833,5.7598,32.9179,24.6074
74,0.5585,-0.0038,1.0376,0.5695,0.3091,-0.0284,-0.0698,1.0376,1.0414,0.016,-0.757,1.1178,-0.2474,0.6696,0.2467,0.5359,1.1178,1.8748,-9.8749,-11.7391,-7.7375,-9.8115,1.3613,-0.294,0.0027,11.7391,4.0017,-0.0517,-3.8328,2.7914,0.1446,2.2326,-0.7071,1.4252,3.8328,6.6242,7.7492,6.3875,9.8175,7.3019,1.2972,3.3534,3.0056,9.8175,3.43,22.1995,17.3838,31.1998,21.0934,4.7315,6.4668,7.8301,31.1998,13.816,-0.9624,-4.2844,0.2908,-0.4565,1.5747,0.4639,-0.0538,4.2844,4.5752,9.9161,7.7859,11.8098,9.8455,1.3502,0.3465,0.0075,11.8098,4.0239,23.6807,18.6181,32.1501,22.9422,4.4746,7.7061,9.5949,32.1501,13.532
75,0.5301,-1.2013,2.6787,0.4997,1.2131,0.1256,0.0606,2.6787,3.88,0.2627,-0.4524,1.1106,0.2884,0.4385,-0.124,-0.0851,1.1106,1.563,-10.1689,-14.9084,-7.1271,-9.8088,2.3114,0.1768,-0.0045,14.9084,7.7813,-0.7589,-9.6242,4.8557,1.5698,5.5397,-4.4884,-5.4392,9.6242,14.4799,11.1027,5.3637,19.8363,10.3075,4.5064,-1.6237,-1.0916,19.8363,14.4725,28.6663,19.6116,34.4165,28.9235,5.3976,-2.947,-2.4857,34.4165,14.8048,-0.4985,-3.2079,3.6336,-0.5102,2.2006,0.5809,0.1446,3.6336,6.8415,10.2626,7.1625,14.9635,9.853,2.2847,-0.1631,0.018,14.9635,7.8011,31.3868,22.3688,37.9692,32.5372,5.9122,-1.7677,-1.7666,37.9692,15.6004
77,0.7813,-0.9797,2.9493,0.6208,1.1616,-0.3821,-0.5447,2.9493,3.929,0.0148,-1.4458,0.8132,0.1182,0.6437,0.3421,0.2726,1.4458,2.259,-9.8154,-11.6086,-8.1855,-9.8178,0.943,0.0392,-0.3559,11.6086,3.4231,-9.7357,-20.0858,2.3648,-9.3085,8.7046,7.5901,7.4218,20.0858,22.4506,7.8553,-0.805,14.5075,8.1244,4.1376,-3.1817,-4.3312,14.5075,15.3125,22.7723,6.8219,29.5185,23.9521,5.3984,-13.44,-11.4172,29.5185,22.6966,0.6632,-14.6999,27.134,-0.2211,10.5154,-4.2869,0.3753,27.134,41.8338,9.9364,8.5517,11.6707,9.889,0.8684,-0.0259,0.3529,11.6707,3.119,27.8514,20.1005,32.433,29.004,3.8327,-14.1007,-15.1142,32.433,12.3324
78,0.3992,-0.82,1.8462,0.0762,1.0,0.7274,1.1944,1.8462,2.6662,0.3569,-1.4613,2.6737,0.3908,1.3249,-1.6382,-1.8685,2.6737,4.135,-9.7762,-12.8096,-6.5413,-10.1738,2.8703,0.0717,-0.2682,12.8096,6.2684,-2.1456,-9.106,6.132,-1.8867,4.678,6.8665,5.5426,9.106,15.238,4.6736,1.7413,8.6538,3.7931,2.5707,-0.362,0.9494,8.6538,6.9125,9.3323,-5.5844,20.3354,12.5349,10.9195,-19.627,-22.72,20.3354,25.9198,-3.6237,-24.3466,2.2286,0.1542,9.105,-5.0378,-3.7583,24.3466,26.5752,9.9105,6.5551,13.1351,10.2419,2.8806,0.073,0.3202,13.1351,6.5799,13.7507,2.4544,22.9304,13.8898,7.8352,-0.7621,-0.3491,22.9304,20.476
79,1.1266,-1.0971,2.5042,1.2705,1.1382,-0.5997,-0.7677,2.5042,3.6013,-1.2813,-3.2817,0.2436,-1.4778,1.1761,1.2289,1.061,3.2817,3.5252,-9.7045,-12.5639,-6.6599,-10.442,2.225,-0.0723,0.7552,12.5639,5.904,4.7209,1.3566,9.5938,3.6559,3.374,-2.9998,0.4955,9.5938,8.2372,4.3116,-2.0913,7.9625,4.7425,3.1264,0.3336,-0.315,7.9625,10.0538,-10.2948,-17.4223,0.3098,-10.1851,5.868,-0.5346,-1.2013,17.4223,17.7322,-8.6614,-31.4838,0.9311,-3.6041,11.3394,-1.7625,-5.4851,31.4838,32.4149,9.9836,6.9709,12.7143,10.5621,2.1624,0.0394,-0.7535,12.7143,5.7434,12.9887,4.0793,19.0956,13.5408,5.5339,8.7749,7.1156,19.0956,15.0164
80,0.5269,-1.5145,3.0119,0.5029,1.1445,-0.0352,-0.0842,3.0119,4.5265,-0.0525,-2.42,4.3486,-0.4168,1.7062,0.8579,1.1024,4.3486,6.7686,-9.7767,-13.0998,-4.8887,-9.6868,2.2655,0.1438,0.0235,13.0998,8.2111,1.7211,-17.7775,20.9194,4.1514,13.5403,0.209,-0.8306,20.9194,38.6969,4.6452,-2.6163,10.4738,4.4275,3.5426,-0.7591,-0.7131,10.4738,13.09,-10.8293,-30.4624,18.8326,-11.3863,13.7486,11.4369,12.2599,30.4624,49.295,-10.4239,-74.6715,19.1323,-9.0892,19.5079,6.3623,5.6492,74.6715,93.8038,10.023,5.5575,13.1821,9.8086,2.1348,0.1397,0.1626,13.1821,7.6246,21.7636,12.3212,34.8288,20.6563,6.2165,-3.7938,-3.1291,34.8288,22.5075
82,0.4564,-2.7693,4.0657,0.3344,2.4063,-0.1476,0.1604,4.0657,6.835,1.6633,0.4548,2.8454,1.788,0.7988,-1.8138,-2.0879,2.8454,2.3906,-9.4891,-16.631,-0.5114,-9.6398,5.9198,-0.1108,0.1633,16.631,16.1196,2.139,-3.3082,5.5045,2.4902,2.9052,-2.7007,-3.6367,5.5045,8.8127,3.127,-6.23,12.81,3.0013,5.8604,0.1549,0.14,12.81,19.04,12.0445,2.0008,18.0098,13.1334,5.3454,-7.312,-10.6552,18.0098,16.009,2.3007,-9.4134,10.1582,2.2093,5.8635,-2.1054,-3.1716,10.1582,19.5716,10.3023,2.7609,16.6959,10.1339,5.1457,-0.5309,-0.3799,16.6959,13.935,14.176,6.4435,21.6161,14.3981,4.8875,-4.2661,-5.8272,21.6161,15.1726
83,0.3088,-1.8222,2.6681,0.4948,1.193,0.0827,-0.0962,2.6681,4.4903,-0.1505,-2.3087,2.4768,-0.2998,1.3787,-0.0465,0.1765,2.4768,4.7855,-9.6,-11.9828,-6.6879,-9.4765,1.2951,-0.1684,-0.4881,11.9828,5.2949,-0.5617,-9.1781,6.7294,-1.1465,4.0968,3.8129,4.3427,9.1781,15.9075,3.282,-2.1175,10.9025,3.1413,2.409,0.3157,0.5425,10.9025,13.02,4.7325,-6.3628,18.9231,2.4782,8.615,-11.6668,-7.3993,18.9231,25.2859,0.1953,-7.3012,17.7054,-0.9623,6.367,-3.4994,0.7212,17.7054,25.0066,9.7714,6.7021,12.0467,9.754,1.2878,0.1043,0.2508,12.0467,5.3446,9.91,2.7682,19.2899,8.5708,5.41,1.8497,3.2124,19.2899,16.5218
84,0.3915,-1.0358,2.0168,0.3986,0.8536,-0.3093,-0.219,2.0168,3.0526,-0.197,-2.4906,1.3261,-0.1233,1.0922,1.1731,0.999,2.4906,3.8167,-9.7684,-12.0898,-7.3436,-9.9646,1.2168,-0.3707,-0.1668,12.0898,4.7462,3.2512,-7.3428,17.5473,3.1962,7.7925,-2.1133,-2.7926,17.5473,24.8901,3.5977,1.82,7.245,3.6838,1.1771,0.2589,-0.2844,7.245,5.425,-6.9343,-19.6488,1.6183,-4.921,6.6611,26.7121,25.6094,19.6488,21.2671,-3.3041,-38.6188,8.6885,-0.2411,11.4839,5.863,3.1196,38.6188,47.3073,9.8758,7.434,12.1261,10.0048,1.184,0.4602,0.5444,12.1261,4.6921,11.7596,3.8075,22.0804,11.7832,6.0737,8.7609,9.5015,22.0804,18.2729
85,0.0822,-1.4881,2.3901,0.1796,1.2367,0.0414,-0.3849,2.3901,3.8782,0.9762,-1.7043,2.922,0.8758,1.4054,-2.0289,-1.87,2.922,4.6263,-10.1391,-11.3276,-9.0928,-10.1315,0.8641,-0.0806,0.0868,11.3276,2.2348,1.1379,-1.6166,6.3346,0.4037,2.9338,-2.4929,-1.9365,6.3346,7.9512,3.8566,1.05,7.21,3.3994,1.9148,-3.1489,0.1313,7.21,6.16,19.7779,11.0845,26.3759,20.6883,5.5463,-26.7181,-27.8543,26.3759,15.2913,2.5589,-1.2107,8.7436,2.8785,3.275,-2.2248,-2.1763,8.7436,9.9543,10.336,9.1232,11.5514,10.5492,0.8602,0.6818,0.1722,11.5514,2.4282,20.5205,13.125,26.7565,21.2848,5.2258,-8.1392,-9.494,26.7565,13.6315
86,0.1236,-4.7972,7.0552,-0.2052,4.0473,0.3187,0.5507,7.0552,11.8523,-1.0528,-1.958,-0.2035,-0.9943,0.5461,1.0943,0.8988,1.958,1.7545,-10.2197,-18.4677,-5.5186,-10.0447,3.7978,0.4525,0.6676,18.4677,12.9491,-1.355,-5.4952,2.0512,-1.5329,2.8257,-2.5381,-3.0708,5.4952,7.5465,0.7077,-17.1063,14.1225,3.5306,9.7444,2.1777,-1.3781,17.1063,31.2288,-6.9403,-15.6267,1.3771,-7.1659,5.3869,2.9372,4.2036,15.6267,17.0037,0.3341,-4.0163,3.5302,0.7022,2.5242,0.1876,0.924,4.0163,7.5466,11.0178,6.8384,19.0804,10.7214,3.6077,-1.1086,-1.1478,19.0804,12.2419,12.3814,7.9074,17.4473,11.7908,3.8048,-5.4427,-5.3738,17.4473,9.5399
87,0.4422,-1.2906,2.4462,0.3454,1.3447,-0.198,-0.0925,2.4462,3.7368,0.0416,-0.9204,1.4051,-0.0954,0.8537,-0.8992,-0.88,1.4051,2.3254,-9.7672,-13.5919,-6.5042,-9.3771,2.1519,0.3423,-0.1275,13.5919,7.0877,-3.8931,-5.3075,0.7075,-4.6037,1.9193,-6.8345,-6.3618,5.3075,6.015,2.8853,-0.9975,7.805,2.1525,2.9345,0.3041,-0.0569,7.805,8.8025,-4.0031,-9.1461,-1.1265,-2.9624,2.8325,4.925,4.8343,9.1461,8.0196,0.5217,-5.2144,4.2056,1.6262,3.2367,8.7818,8.9797,5.2144,9.4201,9.9092,6.9573,13.624,9.5736,2.0497,-0.4113,-0.0308,13.624,6.6666,6.9386,1.6627,11.7868,6.417,3.2319,7.2281,6.5882,11.7868,10.1241
88,0.2442,-0.6935,1.1974,0.2529,0.6201,-0.1163,-0.3708,1.1974,1.8909,-0.8576,-1.5571,-0.149,-0.9754,0.5087,0.6263,0.9676,1.5571,1.4081,-9.4249,-10.7597,-8.1391,-9.5046,0.781,-0.4643,-0.7763,10.7597,2.6206,-10.7275,-13.7344,-7.3843,-10.9655,2.3156,11.3302,11.7008,13.7344,6.3501,3.1894,0.49,7.8663,2.0956,2.9881,0.1684,1.2775,7.8663,7.3762,0.9219,-9.9183,14.0259,1.8719,8.8741,-3.834,-3.8127,14.0259,23.9442,9.3036,2.0465,15.4748,10.6059,5.8494,-9.5178,-10.616,15.4748,13.4283,9.4979,8.2331,10.7783,9.5429,0.7639,0.4396,0.7501,10.7783,2.5452,14.1668,10.8973,18.9044,13.0051,2.7908,-9.1542,-7.6021,18.9044,8.0072
89,0.1279,-0.5716,1.0576,-0.1179,0.6444,-0.6485,-0.1236,1.0576,1.6292,-0.2313,-1.4176,0.5416,-0.0078,0.7144,-0.132,-0.4811,1.4176,1.9592,-9.8892,-12.0198,-7.6939,-10.2809,1.4567,0.479,1.3206,12.0198,4.326,0.6027,-0.8205,1.7188,0.7353,0.9109,-1.8551,-3.7582,1.7188,2.5394,3.3578,1.1463,5.1538,3.3731,1.4159,-0.1816,-0.5644,5.1538,4.0075,-2.9121,-6.2561,-0.2062,-1.9407,2.4221,12.115,13.3778,6.2561,6.0498,-0.2142,-1.6738,0.7056,-0.0101,0.8818,2.1787,2.3557,1.6738,2.3794,9.9375,7.7664,12.0363,10.293,1.4259,-0.4665,-1.2814,12.0363,4.2699,5.0126,2.232,7.2248,5.4031,1.7256,5.8546,6.8165,7.2248,4.9928
90,-0.5206,-1.7019,0.2815,-0.2415,0.6632,-0.1777,-0.2655,1.7019,1.9833,-0.3633,-1.1537,0.6714,-0.4889,0.5728,0.3801,0.5505,1.1537,1.8252,-9.4102,-15.559,-4.1184,-8.9603,3.2666,-0.4085,-0.83,15.559,11.4406,-1.2525,-4.7065,4.5332,-3.0228,3.7629,1.388,3.6809,4.7065,9.2397,3.1763,0.35,6.3613,2.8088,2.1118,-0.0545,0.5031,6.3613,6.0113,9.2028,1.3004,12.5482,11.437,4.2419,-5.4948,-7.7727,12.5482,11.2478,1.9644,-0.057,3.8341,2.3456,1.4392,-1.4592,-2.1521,3.8341,3.891,9.4711,4.1734,15.5924,9.0116,3.2537,0.4157,0.8314,15.5924,11.419,10.8672,4.5037,14.089,12.2195,3.4293,-3.1507,-4.4857,14.089,9.5853
91,-0.6983,-2.5551,0.9882,-0.5071,0.8158,0.094,-0.0374,2.5551,3.5433,0.0168,-0.9808,1.4464,0.0616,0.5318,-0.7257,-0.6882,1.4464,2.4272,-9.8187,-17.7059,-5.7098,-9.7903,2.3371,0.2601,0.7444,17.7059,11.9962,0.1355,-4.7763,3.9023,0.658,2.4636,-2.8763,-3.2143,4.7763,8.6787,3.1217,-6.1075,17.1938,3.3119,5.1386,0.5653,2.2225,17.1938,23.3013,3.708,-3.8434,8.824,3.6643,4.0656,-1.7757,-1.889,8.824,12.6675,0.5052,-1.7444,4.6846,0.1935,1.2771,1.3165,1.6006,4.6846,6.429,9.8868,5.9014,17.8896,9.8429,2.3502,-0.2112,-0.6582,17.8896,11.9882,7.7165,3.6606,17.4849,7.7338,3.3958,1.009,0.1556,17.4849,13.8243
92,-0.6042,-3.0855,1.6405,-0.5444,1.3451,0.394,0.2414,3.0855,4.726,-0.709,-1.271,-0.3082,-0.6265,0.3533,0.5297,0.3731,1.271,0.9628,-9.5586,-14.0265,-6.8857,-9.0459,2.1312,-0.2221,-0.84,14.0265,7.1407,-2.7408,-6.0403,0.4589,-2.5563,2.4142,1.6036,1.2454,6.0403,6.4992,3.687,-2.8612,12.4513,5.5344,5.3176,-0.3052,-2.3319,12.4513,15.3125,1.9324,-4.3485,9.3313,1.7754,5.4614,0.1719,1.4262,9.3313,13.6798,1.8217,-0.3526,4.9128,1.7941,1.7218,-1.1525,-1.3662,4.9128,5.2655,9.6755,7.0113,14.4101,9.1847,2.213,0.1415,0.7244,14.4101,7.3988,8.7254,6.3128,12.791,7.8894,2.3048,-2.0961,-1.7001,12.791,6.4781
93,-0.2102,-1.1185,1.1993,-0.303,0.6255,0.3462,0.6208,1.1993,2.3179,-0.1792,-1.1657,1.1202,-0.2534,0.5095,0.0159,0.0874,1.1657,2.2859,-9.7807,-10.7653,-8.6801,-9.8859,0.5466,0.0014,0.279,10.7653,2.0852,-1.1372,-4.3285,2.013,-1.3109,1.8127,-3.0233,-0.5852,4.3285,6.3415,3.3819,1.4437,5.7662,3.2025,1.0811,-0.2181,-0.0088,5.7662,4.3225,2.1043,-5.7059,9.2507,3.2016,5.2287,-2.0156,-2.7037,9.2507,14.9566,0.6691,-0.2481,4.0563,0.4279,1.0036,-0.1267,-0.5176,4.0563,4.3044,9.8171,8.7688,10.773,9.9091,0.5358,0.0573,-0.2497,10.773,2.0042,6.6294,2.7815,10.0759,6.1893,1.9829,1.9911,2.412,10.0759,7.2943
94,0.136,-3.5578,2.2257,0.3178,1.0029,0.3784,-0.2756,3.5578,5.7835,-0.1633,-2.1776,1.359,-0.1661,0.8973,-0.0518,0.2382,2.1776,3.5366,-9.7793,-17.1537,-5.1884,-9.6069,2.2849,0.0903,-0.3414,17.1537,11.9653,-4.1604,-12.3735,1.0477,-1.8961,4.3665,-1.877,-5.5071,12.3735,13.4212,3.1638,-8.1375,11.5325,3.1938,3.762,1.5951,-0.7394,11.5325,19.67,0.0887,-9.4046,8.6999,0.498,5.4847,-21.5319,-23.0435,9.4046,18.1045,0.5424,-10.8653,19.0181,-0.0897,6.255,2.1544,-0.1849,19.0181,29.8834,9.8744,5.2956,17.524,9.6594,2.2661,0.0189,0.4123,17.524,12.2285,8.6205,3.6438,14.8784,8.6013,3.7995,15.2854,16.5674,14.8784,11.2346
95,0.5143,-1.446,3.441,0.0422,1.6437,-0.2111,0.2388,3.441,4.8869,-0.2151,-1.4984,1.2734,0.0721,1.0834,1.1566,1.0496,1.4984,2.7718,-9.689,-11.2996,-7.6601,-9.9483,1.1332,-0.0208,0.1343,11.2996,3.6395,-6.0375,-9.2573,-1.4617,-7.4031,3.1585,19.6241,21.4108,9.2573,7.7956,4.7589,-2.3625,17.325,2.4544,6.9157,-0.677,1.8287,17.325,19.6875,-21.4433,-25.8097,-11.8097,-22.5456,4.4863,-4.7533,-5.0568,25.8097,14.0,2.6968,-9.9282,13.8713,-0.2746,8.405,10.7355,15.9874,13.8713,23.7995,9.8933,8.398,11.307,10.0717,0.9711,-0.1135,-0.2315,11.307,2.9089,23.9059,15.6303,28.188,25.1687,4.2235,6.5101,6.0963,28.188,12.5577
96,0.3032,0.047,0.7332,0.281,0.2078,-0.5825,-0.6046,0.7332,0.6863,0.9415,-0.2932,1.4613,1.1217,0.6188,-1.3167,-1.736,1.4613,1.7545,-9.7098,-9.9494,-9.1908,-9.814,0.2403,0.0622,0.2881,9.9494,0.7587,13.5866,11.4739,15.3246,14.0077,1.2729,-10.1283,-11.0448,15.3246,3.8506,4.0819,1.3212,6.3612,4.2831,1.7248,-1.167,-1.4131,6.3612,5.04,-26.1966,-38.3274,-9.3729,-27.6024,10.6209,28.6765,28.4042,38.3274,28.9545,13.4323,-3.3644,21.3028,15.7128,8.9011,-13.5573,-16.5367,21.3028,24.6672,9.7797,9.3242,9.9548,9.8402,0.2098,-0.0974,-0.2906,9.9548,0.6306,30.4161,17.0371,40.3992,31.265,8.6261,-23.9813,-25.3804,40.3992,23.3621
97,-0.2793,-0.5549,0.118,-0.3236,0.2539,0.52,0.5053,0.5549,0.6729,-0.3751,-1.1639,0.5374,-0.6143,0.6755,0.2774,0.3698,1.1639,1.7013,-9.6476,-10.1051,-9.3346,-9.5259,0.2778,-0.2984,-0.37,10.1051,0.7704,3.4583,0.7023,8.1344,2.9629,2.4828,-3.3968,-3.2266,8.1344,7.4321,2.9148,2.2138,3.9112,2.87,0.5824,4.1584,4.0994,3.9112,1.6975,2.4799,-1.3015,9.5173,0.8018,3.9471,23.6935,25.0038,9.5173,10.8188,-0.125,-2.53,2.7941,-0.8238,2.1153,-0.3259,0.5114,2.7941,5.3241,9.6824,9.3828,10.1584,9.5496,0.2838,0.3002,0.393,10.1584,0.7756,6.4347,3.7446,10.3136,5.8846,2.2736,20.6996,20.6875,10.3136,6.569
98,0.2407,-0.1933,0.7746,0.1817,0.3907,-0.0177,-0.0171,0.7746,0.9679,-0.0978,-1.1412,1.3117,-0.2445,0.7685,-1.2062,-1.1154,1.3117,2.4529,-9.946,-10.5441,-9.2383,-9.8959,0.5281,0.3761,0.2948,10.5441,1.3058,0.0615,-0.9228,1.2644,-0.2637,0.9666,-13.3014,-13.2549,1.2644,2.1872,7.0733,6.125,8.2775,6.9694,0.9339,-1.1189,-0.7262,8.2775,2.1525,26.1734,23.5876,29.4443,25.8057,1.9034,-11.6008,-8.1753,29.4443,5.8568,-0.4509,-1.3119,0.3347,-0.3125,0.5444,17.379,18.9235,1.3119,1.6465,9.9826,9.3349,10.5491,9.9426,0.5171,-0.2849,-0.3044,10.5491,1.2142,27.1343,24.3873,30.6118,26.572,2.0167,-4.355,-3.348,30.6118,6.2245
99,0.2231,-0.0336,0.6968,0.1645,0.2672,0.017,0.0749,0.6968,0.7303,-1.3039,-2.1609,0.0993,-1.3599,0.851,1.0929,1.0299,2.1609,2.2602,-9.57,-10.0876,-9.1286,-9.6011,0.3331,-0.1816,-0.1687,10.0876,0.959,-13.2399,-14.0817,-11.0747,-13.5187,0.9509,13.7312,13.7163,14.0817,3.007,5.9544,3.2113,7.1575,6.2431,1.3837,-1.4545,-2.9838,7.1575,3.9463,14.5725,-6.8483,28.3287,17.6303,12.7565,-33.4998,-34.9776,28.3287,35.177,16.928,-1.3988,29.9668,18.611,10.8951,-15.8055,-17.5208,29.9668,31.3656,9.6977,9.3842,10.2206,9.6382,0.3075,0.1565,0.1615,10.2206,0.8364,22.7793,13.4112,32.4351,23.2241,7.4883,-2.1249,-4.7071,32.4351,19.0239
100,0.2401,-2.483,3.0942,0.2394,0.9403,-0.0326,-0.2174,3.0942,5.5773,-0.2111,-2.0328,1.7527,-0.33,0.9079,0.437,0.4132,2.0328,3.7855,-9.7516,-16.0597,-5.1814,-9.7698,1.9646,-0.0302,0.2491,16.0597,10.8784,0.4913,-5.7698,7.065,0.1976,3.6938,3.0608,2.9662,7.065,12.8349,4.4999,-2.1875,16.3188,3.2594,3.7614,-2.8827,-0.5031,16.3188,18.5062,-18.9273,-37.7316,-5.3113,-17.3473,10.5537,9.8015,8.802,37.7316,32.4204,1.1225,-4.721,4.7608,1.0902,2.2036,0.633,-0.7781,4.7608,9.4818,9.8542,5.539,16.252,9.7998,1.8926,0.0699,-0.2167,16.252,10.713,20.6543,7.8533,38.1314,18.517,9.4546,-8.332,-8.3725,38.1314,30.2781
101,0.2075,-2.461,2.9757,0.022,1.2851,0.1186,0.2852,2.9757,5.4368,0.2259,-1.0951,1.8281,0.0832,1.0064,-0.0959,0.1936,1.8281,2.9232,-9.7818,-14.2093,-6.3259,-9.5207,1.9862,0.0197,-0.2327,14.2093,7.8833,3.5521,0.7259,8.8085,3.1638,2.5522,-1.149,-1.0041,8.8085,8.0827,1.6171,-9.5375,6.9912,2.7562,4.5762,1.8326,0.4331,9.5375,16.5288,-9.1258,-28.353,4.1711,-8.5453,9.7021,14.3535,15.2132,28.353,32.5241,1.7555,-4.0842,9.0725,0.3122,4.1843,-1.0768,-0.2484,9.0725,13.1567,9.9241,6.5597,14.248,9.5831,1.9282,-0.1272,0.1969,14.248,7.6882,12.3224,3.0308,29.6916,10.1445,8.0438,-3.9708,-1.9052,29.6916,26.6607
102,0.3262,-0.085,0.9431,0.3072,0.2651,-0.4573,-0.5042,0.9431,1.0281,0.13,-1.4984,1.0071,0.2768,0.7166,0.0165,-0.237,1.4984,2.5055,-9.7621,-10.072,-9.36,-9.7534,0.1965,-0.0877,-0.0959,10.072,0.7121,2.4031,-2.0287,6.6795,2.1597,2.4459,-5.9973,-6.2345,6.6795,8.7082,3.4497,2.0037,5.5037,3.1894,1.0405,2.3479,2.5506,5.5037,3.5,5.2277,-3.4047,12.4038,6.668,5.2304,23.7507,22.0627,12.4038,15.8085,0.6787,-3.1932,5.2984,0.0638,2.2369,-0.0072,0.2835,5.2984,8.4916,9.797,9.4077,10.1048,9.78,0.2007,0.0774,0.0857,10.1048,0.6971,8.3515,2.6265,13.7052,8.2393,2.933,21.8355,21.4941,13.7052,11.0786
103,-0.1311,-0.7564,0.5808,-0.197,0.3713,0.2073,0.1234,0.7564,1.3372,0.1465,-0.5541,1.4416,0.0398,0.575,-1.815,-1.7596,1.4416,1.9957,-9.8498,-10.7018,-9.4799,-9.8494,0.2498,0.1915,0.2223,10.7018,1.2219,-3.5942,-10.8684,4.5706,-4.0748,4.4247,-4.68,-4.5978,10.8684,15.439,5.7975,4.69,6.86,5.74,0.7084,-1.9683,-1.8681,6.86,2.17,28.9784,17.5999,37.1807,28.7306,4.6249,-35.6625,-36.4977,37.1807,19.5808,0.6715,-6.0432,5.4471,0.3472,2.6784,13.0728,13.5386,6.0432,11.4904,9.8744,9.5011,10.766,9.8657,0.2591,-0.0404,-0.1091,10.766,1.2649,30.1871,21.1336,37.7988,29.7334,3.9357,-12.799,-13.1287,37.7988,16.6652
104,0.0762,-0.7344,1.1011,-0.0736,0.722,0.1844,0.3717,1.1011,1.8355,-1.6684,-2.4631,-0.8049,-1.7198,0.4712,2.0506,2.3616,2.4631,1.6582,-9.6582,-10.1002,-9.3081,-9.6271,0.3362,0.0567,0.0019,10.1002,0.7921,-8.2743,-9.8774,-5.9687,-8.6727,1.3725,9.9963,10.1435,9.8774,3.9087,3.8292,2.59,4.69,3.8719,0.6892,1.1397,0.9975,4.69,2.1,-6.6841,-27.2384,14.7568,-7.7671,15.3344,-0.2996,0.9835,27.2384,41.9952,13.7443,7.9499,21.7384,13.8858,4.5944,-13.7953,-13.4496,21.7384,13.7885,9.8339,9.4616,10.4126,9.7565,0.362,-0.1744,-0.0863,10.4126,0.951,17.3881,10.1821,28.1613,16.6047,6.1663,-8.3866,-7.473,28.1613,17.9792
105,0.2606,-0.0797,0.4518,0.2981,0.1895,0.2317,0.2056,0.4518,0.5315,0.3822,-1.2477,1.3279,0.6418,0.9969,-0.1857,-0.6179,1.3279,2.5756,-9.6016,-10.2964,-9.186,-9.6251,0.3391,-0.0488,0.018,10.2964,1.1104,1.7221,0.0824,3.7292,1.4708,1.2864,3.7663,3.7647,3.7292,3.6469,4.9689,3.43,6.6238,4.8694,1.1083,-3.7658,-3.8413,6.6238,3.1938,-6.9837,-9.8978,-4.458,-6.7836,1.8904,-12.8959,-13.7228,9.8978,5.4398,-0.051,-3.3069,2.1204,0.4362,2.1162,1.0911,-0.4483,3.3069,5.4273,9.6595,9.2317,10.3241,9.6702,0.3385,0.0233,-0.0002,10.3241,1.0924,9.0015,7.4076,10.8331,9.1317,1.0955,11.8019,12.0464,10.8331,3.4255
106,0.4922,0.0891,1.1606,0.5036,0.3584,-1.0991,-1.0932,1.1606,1.0715,0.1965,-0.3351,0.8833,0.0239,0.5172,0.5564,0.8587,0.8833,1.2184,-9.6503,-9.8871,-9.523,-9.6071,0.1243,-0.0854,-0.0857,9.8871,0.3641,5.4883,4.3199,6.9708,5.2355,1.0843,-10.7107,-11.088,6.9708,2.6508,1.2031,-0.6563,3.7538,1.0281,1.597,2.2994,2.5681,3.7538,4.41,-19.8796,-23.2102,-15.1538,-20.5064,3.2306,22.9672,22.2347,23.2102,8.0564,1.0401,-1.5904,5.0566,-0.0121,2.7753,-4.2675,-1.8111,5.0566,6.6471,9.6828,9.5644,9.9221,9.67,0.1212,0.1699,0.1586,9.9221,0.3576,20.8034,16.7702,23.6166,21.178,2.7004,-13.0094,-13.9458,23.6166,6.8464
107,-0.6068,-2.0335,2.0566,-0.5896,0.9266,1.4843,1.1294,2.0566,4.0901,0.7529,-0.6313,2.0011,0.8827,0.7392,0.1054,0.0003,2.0011,2.6324,-9.7358,-10.2342,-9.4433,-9.6928,0.2043,0.0398,-0.0702,10.2342,0.7909,-5.2224,-10.8524,0.9659,-5.8525,3.1209,5.7009,5.3116,10.8524,11.8183,3.5025,2.0825,4.8825,3.5963,0.6865,-0.4088,-0.42,4.8825,2.8,3.0875,-0.1277,11.7507,1.7283,3.4662,-2.407,-1.4873,11.7507,11.8784,-3.2274,-17.415,5.1417,-1.8233,5.1886,3.7536,1.0866,17.415,22.5566,9.8527,9.5188,10.3285,9.8287,0.2035,0.0329,0.0478,10.3285,0.8097,7.794,3.5466,15.0576,7.2322,3.1812,-1.892,-1.5735,15.0576,11.511
108,0.8775,-0.8019,3.3519,0.5398,1.2027,0.6243,0.8037,3.3519,4.1538,0.8583,-1.1166,2.542,0.883,0.9869,-0.5149,-0.561,2.542,3.6587,-9.6959,-10.4639,-8.955,-9.763,0.39,-0.0578,-0.072,10.4639,1.5089,0.4785,-6.6062,11.1682,-0.5409,5.5049,5.7932,7.3512,11.1682,17.7745,3.0937,1.575,5.11,3.1762,0.9152,-0.0271,-0.0963,5.11,3.535,0.6805,-1.5093,4.0521,0.2411,1.5896,1.1248,0.5552,4.0521,5.5614,0.5262,-7.9682,14.4138,-0.7366,6.1518,1.3613,2.3642,14.4138,22.382,9.8856,9.0997,10.9161,9.8765,0.4675,0.0161,0.0701,10.9161,1.8164,5.9021,3.0687,11.9078,5.6587,2.7311,2.1525,2.2172,11.9078,8.8391
109,1.5018,0.6719,2.372,1.3435,0.5318,-0.9157,-0.9132,2.372,1.7001,0.3434,-0.7307,1.3961,0.3219,0.5124,0.1164,0.2857,1.3961,2.1267,-9.7537,-10.8794,-8.8087,-9.835,0.5286,0.0431,0.0578,10.8794,2.0706,6.2717,0.5807,9.4108,6.8103,2.0238,-10.8862,-12.3891,9.4108,8.8301,3.0665,1.6275,4.5062,3.08,0.6152,1.2472,1.0194,4.5062,2.8788,1.8053,-1.5658,11.9452,0.7963,3.3902,15.3226,16.8864,11.9452,13.5111,1.8875,-5.7328,8.3532,1.6275,3.2929,-4.2734,-4.7687,8.3532,14.086,9.9016,8.8582,10.9124,9.9466,0.5186,-0.1281,-0.1274,10.9124,2.0542,8.0546,5.1156,12.374,7.8759,1.6041,10.2585,11.0931,12.374,7.2583
110,0.5861,-0.8407,1.4904,0.4303,0.811,-0.4371,0.204,1.4904,2.3312,0.4598,-0.018,0.7552,0.6077,0.3009,-1.4321,-1.5948,0.7552,0.7731,-9.7106,-10.6234,-8.982,-9.7772,0.5648,-1.2353,0.7881,10.6234,1.6414,-4.6145,-5.7272,-0.6721,-5.5788,1.8045,6.827,4.8441,5.7272,5.0551,4.3138,3.5963,5.985,4.0994,0.8584,6.6686,4.3662,5.985,2.3887,17.1279,13.9283,19.0347,17.6827,1.9964,-61.3289,-59.5346,19.0347,5.1065,-2.3859,-4.2509,0.1025,-3.1412,1.7753,-0.3026,2.4914,4.2509,4.3534,9.7736,9.0084,10.638,9.8192,0.5478,1.387,-0.744,10.638,1.6296,18.3131,14.4184,20.6442,18.969,2.3609,28.7726,24.146,20.6442,6.2259
111,0.1489,-2.8796,1.8215,0.6343,1.8426,0.5121,0.0592,2.8796,4.7011,-0.9723,-2.0478,0.0473,-0.9871,0.6565,2.1207,2.2698,2.0478,2.095,-10.946,-19.3977,-6.2828,-8.9891,4.9707,1.2998,-0.3352,19.3977,13.1149,2.2125,-3.7765,16.3463,-0.7347,7.3655,2.3726,5.1452,16.3463,20.1229,10.9823,-2.555,31.0975,8.4656,13.2004,-5.8034,-2.45,31.0975,33.6525,-44.201,-57.1735,-33.9958,-41.8519,8.247,68.8344,67.9221,57.1735,23.1777,-2.6885,-15.7487,4.0509,-0.6497,7.4193,7.6909,4.842,15.7487,19.7996,11.1606,6.6745,19.6104,9.0753,4.9211,-1.3496,0.4681,19.6104,12.9359,47.0857,34.3144,67.1049,43.115,11.7897,-21.2132,-16.1272,67.1049,32.7905
112,0.661,-1.3908,1.991,0.6934,1.0965,-0.0938,-0.2479,1.991,3.3818,1.1484,0.0359,1.9347,1.2827,0.633,-1.0667,-0.7531,1.9347,1.8988,-9.6461,-12.4644,-8.605,-9.3243,1.2102,0.024,-0.3638,12.4644,3.8593,4.5851,2.6473,7.8341,4.4105,1.7598,-5.8546,-6.0403,7.8341,5.1868,5.1789,0.3762,7.665,6.0156,2.6944,-2.6488,-4.0162,7.665,7.2888,24.6334,14.6383,34.2084,26.0702,6.6064,-16.2144,-15.2543,34.2084,19.5701,5.0024,0.161,11.8314,4.1923,3.5039,0.1773,-0.295,11.8314,11.6704,9.811,8.7477,12.5922,9.5434,1.1864,0.0824,0.2526,12.5922,3.8445,25.8726,16.8746,35.096,26.9878,6.0955,-1.7812,-4.1981,35.096,18.2214
113,0.5672,-2.5581,3.5617,0.4456,1.3456,-0.4486,-0.0372,3.5617,6.1198,0.0817,-4.2547,1.9915,0.5296,1.4968,-1.3982,-1.6504,4.2547,6.2462,-9.6222,-14.2432,-3.4854,-9.688,2.3332,-0.095,0.3193,14.2432,10.7578,-1.2695,-17.1435,13.051,-1.6298,10.1234,-11.1801,-10.6894,17.1435,30.1945,2.5301,-7.2012,12.2063,1.9994,4.1591,4.8702,6.8206,12.2063,19.4075,8.419,-22.5393,38.759,10.8159,22.3252,4.2627,2.9808,38.759,61.2983,5.1798,-15.7033,32.9501,3.8973,11.578,11.2055,9.1709,32.9501,48.6535,9.8934,5.5676,14.3012,9.796,2.0812,0.0931,-0.1722,14.3012,8.7336,24.0913,7.2187,42.4314,22.7897,9.8302,-0.4821,1.2246,42.4314,35.2127
114,0.1186,-3.632,2.1196,0.4084,1.8217,-0.5991,-0.862,3.632,5.7515,-1.3165,-2.2243,-0.7372,-1.1208,0.5791,1.6357,1.4329,2.2243,1.487,-9.7172,-17.4601,-3.746,-9.3688,3.9942,-0.0935,-0.314,17.4601,13.7141,-12.4496,-15.2281,-10.7362,-12.3191,1.363,16.2123,15.327,15.2281,4.4919,7.4003,-9.4237,21.42,8.82,8.9928,-3.6984,-5.7225,21.42,30.8438,12.6817,-6.0163,34.4323,13.7967,14.4509,-9.1927,-8.0872,34.4323,40.4486,16.3852,9.173,29.1289,13.0682,7.6875,-14.3229,-12.6201,29.1289,19.956,9.9865,4.4776,17.8682,9.6238,3.9421,-0.1439,0.077,17.8682,13.3907,23.6092,13.9596,36.1963,24.0144,8.835,-11.0381,-12.552,36.1963,22.2367
115,-0.4806,-1.5713,0.0323,-0.4536,0.3752,0.2349,0.236,1.5713,1.6036,0.3192,-0.6876,1.2902,0.3121,0.4376,-0.5571,-0.8055,1.2902,1.9777,-9.8106,-11.8426,-8.9003,-9.6828,0.6204,0.0616,0.0249,11.8426,2.9423,3.7627,-4.3587,11.0,3.0079,4.5816,-5.1113,-4.0218,11.0,15.3587,3.7019,1.0938,8.26,3.0975,2.1346,-0.6941,-0.4025,8.26,7.1662,3.4889,-22.1976,17.9911,5.7095,11.1455,1.391,-3.2303,22.1976,40.1887,2.0623,-1.9307,11.378,0.4481,3.7107,-1.2763,-0.0589,11.378,13.3087,9.8426,8.922,11.9632,9.7008,0.64,-0.0635,-0.0324,11.9632,3.0412,12.5711,5.1749,24.8803,11.4624,5.2012,-5.5348,-7.3227,24.8803,19.7055
116,-0.2457,-0.9591,0.442,-0.2176,0.4186,0.5898,0.3836,0.9591,1.4011,-0.2379,-1.1394,1.0113,-0.4934,0.5848,0.1086,0.6265,1.1394,2.1507,-9.7491,-10.9113,-9.2151,-9.6579,0.5113,-0.0572,-0.236,10.9113,1.6963,-1.3487,-4.657,2.1607,-1.0139,2.0857,0.1714,1.4932,4.657,6.8177,3.0078,1.3388,6.0638,2.695,1.376,0.2019,0.4156,6.0638,4.725,4.88,-2.2857,17.5362,2.4792,6.5322,-1.8297,-2.7147,17.5362,19.8219,0.786,-1.2826,3.1738,0.3892,1.2738,1.6435,-0.4595,3.1738,4.4564,9.7791,9.2457,11.0125,9.6684,0.527,0.1654,0.2425,11.0125,1.7668,7.0363,1.7517,19.1305,4.1396,5.7528,2.7098,3.1067,19.1305,17.3788
117,0.3441,-0.3905,2.4662,0.1661,0.6125,0.7349,0.9778,2.4662,2.8568,-0.1293,-4.521,2.633,0.1331,1.5224,0.4462,0.3255,4.521,7.154,-9.8063,-11.3461,-7.9735,-9.8939,0.5887,0.2534,0.3805,11.3461,3.3726,-1.1773,-20.7486,3.2162,0.4793,5.3597,0.1276,-0.9186,20.7486,23.9648,3.2097,1.5138,6.195,3.1106,1.0934,0.5512,0.91,6.195,4.6812,3.0503,-7.9592,22.6807,-0.2355,9.2072,-27.5588,-27.8014,22.6807,30.6398,2.4295,-16.886,68.1107,-0.0703,14.4897,6.1008,0.7403,68.1107,84.9968,9.9445,8.9945,12.2616,9.9109,0.5906,0.0646,0.1497,12.2616,3.2671,9.7461,2.5009,24.3914,7.2464,6.161,18.1403,22.2086,24.3914,21.8905
118,1.079,-1.9619,2.9862,1.1438,1.3024,-0.1866,-0.0197,2.9862,4.9481,0.3169,-3.8615,6.1678,0.4587,2.584,-0.5384,-0.5245,6.1678,10.0294,-9.5529,-12.1159,-7.5794,-9.5134,1.0814,-0.1251,-0.1326,12.1159,4.5364,-1.0497,-13.5248,19.266,-0.4393,9.507,-0.2741,-3.3524,19.266,32.7908,3.7609,-2.1438,9.9488,4.0206,3.0331,0.6716,0.3587,9.9488,12.0925,-24.5086,-37.9065,4.3987,-28.037,11.3609,22.6184,25.058,37.9065,42.3053,8.5303,-20.7888,68.9433,0.67,25.9706,0.1438,5.4678,68.9433,89.7321,10.0091,8.2799,12.2839,10.0606,1.171,-0.156,-0.3024,12.2839,4.004,27.8864,10.4558,38.7685,29.455,7.4921,-6.1942,-7.2756,38.7685,28.3127
119,0.8924,-1.1163,1.7471,1.1241,0.836,0.0107,-0.0919,1.7471,2.8634,-0.2215,-3.4307,2.1333,-0.0658,1.4414,-1.7391,-1.7312,3.4307,5.564,-9.678,-11.8952,-8.1318,-9.646,0.8416,0.0611,0.1443,11.8952,3.7635,-1.3238,-18.8133,17.4772,-3.7917,12.6265,-10.1869,-8.0408,18.8133,36.2905,4.4324,1.8725,6.9388,4.3794,1.5103,-0.1427,0.4156,6.9388,5.0663,-1.8902,-24.2829,24.2341,-2.979,18.4547,14.7252,16.1731,24.2829,48.517,8.6741,-9.7047,37.2701,6.1378,14.021,14.1947,17.1317,37.2701,46.9748,9.8532,8.231,11.948,9.7581,0.8588,0.0192,0.1224,11.948,3.717,21.6922,11.4037,29.4751,22.1794,5.1962,-0.1394,-3.569,29.4751,18.0714
120,0.9031,0.2864,1.3527,1.0322,0.3932,-0.0197,-0.0366,1.3527,1.0663,-1.9606,-2.6438,-1.502,-1.797,0.419,1.8436,1.5936,2.6438,1.1418,-9.6169,-10.4093,-8.8234,-9.5017,0.5179,-0.1403,-0.2399,10.4093,1.5859,-11.5107,-13.831,-6.9154,-11.8324,2.4044,11.6546,12.1432,13.831,6.9156,4.2897,2.1175,6.1775,4.795,1.556,1.0752,1.0587,6.1775,4.06,12.835,-7.9918,34.0535,13.1942,14.972,-3.4502,-2.6,34.0535,42.0454,22.8689,11.5456,33.0284,23.2695,7.621,-11.9061,-13.6192,33.0284,21.4827,9.8724,9.024,10.6035,9.8806,0.4829,0.0395,0.0255,10.6035,1.5795,21.5528,14.242,35.1845,18.6104,7.8869,-7.1566,-4.4711,35.1845,20.9425
121,0.8834,0.3452,1.5499,0.9957,0.4522,0.0317,-0.0784,1.5499,1.2047,-0.117,-2.3859,2.2093,-0.2035,1.5297,1.0999,1.1627,2.3859,4.5952,-9.7572,-10.441,-8.7695,-9.7416,0.4894,-0.0084,-0.0486,10.441,1.6715,0.1439,-11.5356,10.1363,0.3108,8.9096,2.5677,1.3401,11.5356,21.6719,5.3648,3.0362,6.6675,5.8538,1.5082,-1.8561,-2.2925,6.6675,3.6313,9.3847,-0.5774,14.8607,10.5941,5.1665,7.1369,7.6164,14.8607,15.4381,10.9627,-1.1946,27.5224,9.6504,10.7711,-5.4716,-8.0015,27.5224,28.717,9.9118,9.0147,10.4648,9.9061,0.4636,0.0306,0.0027,10.4648,1.4501,14.3962,10.4801,17.5021,14.1393,2.2502,3.7902,4.9814,17.5021,7.0221
122,0.9151,-0.0592,2.4043,0.9173,0.6881,-0.1774,0.0009,2.4043,2.4636,0.9829,-0.8653,2.8586,0.9593,1.1535,-0.2635,-0.2397,2.8586,3.7239,-9.7656,-10.9857,-8.7187,-9.7902,0.668,-0.1875,-0.1895,10.9857,2.267,2.7117,-2.8445,9.581,1.6509,3.6138,0.2016,2.821,9.581,12.4256,3.5088,1.0237,5.8713,3.5612,1.3783,0.2002,0.1925,5.8713,4.8475,16.5216,-1.7767,25.0414,18.2105,7.9997,-4.9905,-7.2216,25.0414,26.8181,5.4912,-0.5419,21.2247,1.6488,7.7514,-4.4379,0.0247,21.2247,21.7667,9.9424,8.7857,11.0199,9.9088,0.6765,0.0859,0.1359,11.0199,2.2342,18.1863,7.9494,25.4994,19.1207,6.1885,-4.51,-5.8864,25.4994,17.5499
123,0.7377,-0.0442,1.2385,0.9182,0.52,-0.5874,-0.7565,1.2385,1.2827,0.7194,-0.2621,1.4434,0.7196,0.505,-0.2066,0.0242,1.4434,1.7055,-9.9531,-10.4731,-9.4924,-9.9797,0.3917,0.3545,0.4351,10.4731,0.9807,2.9133,-3.9871,6.9302,4.4719,3.7988,0.3759,-0.9473,6.9302,10.9174,3.7089,1.8812,6.195,3.7538,1.669,-0.1991,-0.5775,6.195,4.3138,11.5311,0.3456,23.7267,10.9889,8.2496,-32.0341,-33.1661,23.7267,23.3811,1.0533,-5.7549,6.7391,1.6735,3.8717,1.6078,0.7325,6.7391,12.4939,10.0283,9.5773,10.6376,10.0447,0.4184,-0.3649,-0.456,10.6376,1.0603,13.6764,5.7329,24.8441,13.2344,6.9921,8.032,10.235,24.8441,19.1112
124,0.1503,-0.3936,1.3431,0.1617,0.5677,0.4059,0.3037,1.3431,1.7367,0.5128,-1.143,1.581,0.7438,0.8236,-0.1273,-0.5688,1.581,2.724,-9.5986,-10.959,-7.9866,-9.5446,1.0006,-0.2313,-0.2286,10.959,2.9724,3.2892,-0.6867,6.9274,3.5246,2.9589,-1.1632,-3.0141,6.9274,7.6141,3.5098,1.3562,5.3112,3.1762,1.3539,0.1838,0.4638,5.3112,3.955,-20.503,-34.0583,-2.3695,-22.1772,11.7518,28.9491,32.4713,34.0583,31.6889,2.6611,-0.1374,5.8812,2.406,2.4526,0.7034,-2.2177,5.8812,6.0186,9.6635,8.2516,10.9875,9.5886,0.949,0.2147,0.1973,10.9875,2.7359,21.7084,5.8158,34.4259,23.4693,10.8161,-9.163,-9.14,34.4259,28.6101
125,0.5562,0.0225,1.5416,0.4654,0.3894,-0.4269,-0.2151,1.5416,1.5191,0.3856,-0.3076,1.7264,0.175,0.5595,-0.4749,-0.2971,1.7264,2.034,-9.8299,-12.5368,-7.0644,-9.7732,1.0775,0.0178,-0.0759,12.5368,5.4724,2.126,-6.2486,13.4755,0.5106,6.4691,-4.3544,-2.5732,13.4755,19.7242,3.6936,1.8638,5.5825,3.64,1.0638,-0.4692,-0.4287,5.5825,3.7188,8.446,-4.7754,17.5218,10.2941,7.1196,-4.3084,-4.5982,17.5218,22.2972,3.3645,-1.5271,23.2643,0.1883,6.8103,-2.9171,0.0789,23.2643,24.7914,9.8781,7.2363,12.5571,9.7859,1.0545,-0.0338,0.0863,12.5571,5.3208,12.5454,3.5715,17.8784,14.3293,4.778,-6.178,-7.2039,17.8784,14.3069
126,0.1294,-1.4245,0.8465,0.2503,0.6856,0.1577,0.0596,1.4245,2.2711,-0.0893,-0.7977,0.4751,-0.1221,0.4805,0.0482,0.0206,0.7977,1.2728,-9.8121,-10.2872,-9.219,-9.8491,0.3523,0.165,0.0719,10.2872,1.0682,-2.2284,-3.9062,-0.5339,-2.0626,1.0833,3.8984,3.8378,3.9062,3.3723,3.2244,1.96,4.585,3.2113,0.8802,0.3201,-0.3763,4.585,2.625,4.1377,-1.5077,6.8395,5.6958,3.2226,-1.5586,-2.8732,6.8395,8.3472,0.4475,-0.7785,2.7793,0.2672,1.1586,0.049,-0.2006,2.7793,3.5578,9.8443,9.2605,10.2918,9.8722,0.3586,0.1889,-0.0789,10.2918,1.0314,6.3674,2.824,7.7132,7.1254,1.7664,2.7719,1.4275,7.7132,4.8891
128,0.4448,-2.8994,5.0149,0.3696,1.6497,0.043,0.1513,5.0149,7.9144,0.0071,-1.1872,2.5217,-0.0808,0.6609,0.8614,0.7408,2.5217,3.7089,-9.4821,-22.0949,5.9805,-9.7053,4.9434,-0.9907,-0.3817,22.0949,28.0754,5.5684,-2.8004,15.0543,5.613,4.0286,-0.8598,-0.5005,15.0543,17.8547,3.8647,-12.7138,32.9875,2.4587,8.4439,7.6755,7.5994,32.9875,45.7012,1.0204,-9.7709,14.7106,-0.0505,7.2349,33.3376,33.5474,14.7106,24.4815,0.5454,-6.9489,16.9998,-0.1339,4.2324,2.0917,2.2546,16.9998,23.9487,10.2222,5.0133,22.1767,9.7144,3.5833,0.3352,0.5436,22.1767,17.1633,11.9112,5.22,33.6261,9.9804,6.5227,25.1155,25.3696,33.6261,28.4061
129,0.4878,-0.4239,1.3701,0.5209,0.6774,-0.1363,-0.1292,1.3701,1.794,0.8685,0.2172,2.0849,0.66,0.6597,-1.1962,-1.1911,2.0849,1.8676,-10.4728,-11.4603,-10.0129,-10.087,0.6061,0.4979,0.4906,11.4603,1.4473,4.7086,-2.2943,10.1889,5.1124,4.3849,-11.4154,-11.5986,10.1889,12.4833,11.5402,3.185,19.11,10.0581,5.2671,-2.6786,-0.7131,19.11,15.925,34.358,26.4668,47.2934,33.4969,7.076,-11.3085,-8.7743,47.2934,20.8266,2.6371,-3.4022,9.2982,2.1206,3.7403,-1.635,-0.6037,9.2982,12.7003,10.5574,10.0273,11.5491,10.258,0.6014,-0.4951,-0.5819,11.5491,1.5217,37.0268,28.5385,50.2177,35.35,7.5402,-10.983,-5.9275,50.2177,21.6792
130,0.3515,-1.7656,1.7109,0.3917,0.747,0.1824,0.1936,1.7656,3.4764,-0.3277,-2.4864,1.6265,-0.5311,0.9833,0.2078,0.3378,2.4864,4.1129,-9.9749,-13.9823,-5.9658,-9.5965,1.8846,0.1937,-0.3098,13.9823,8.0165,-6.7069,-15.4487,0.595,-6.4862,4.442,-1.2329,-2.1725,15.4487,16.0438,8.8616,-1.9775,13.3788,9.345,3.6244,-3.2747,-4.4756,13.3788,15.3563,23.0495,5.8629,38.4812,24.7226,9.6293,-10.4117,-9.6291,38.4812,32.6183,1.0021,-18.8776,20.9455,1.5169,8.7874,-0.1775,-0.1551,20.9455,39.8231,10.0623,6.244,13.9979,9.6762,1.8682,-0.2459,0.2474,13.9979,7.7539,26.0438,6.1876,40.5745,29.4225,10.0538,-8.3655,-10.1656,40.5745,34.387
131,0.5339,-0.3495,1.338,0.5853,0.4255,0.0308,-0.0859,1.338,1.6875,-0.1199,-0.7079,0.9102,-0.1933,0.434,0.0962,0.1128,0.9102,1.6181,-9.7812,-11.343,-7.3913,-9.9063,0.9826,-0.0016,-0.1028,11.343,3.9517,-7.9398,-12.6177,-1.362,-8.6586,3.6386,0.7743,1.3765,12.6177,11.2557,5.5869,-0.035,10.01,4.8694,2.5913,-0.7755,-0.1028,10.01,10.045,12.6378,-5.5651,24.9391,15.0936,9.8748,-4.5035,-5.3561,24.9391,30.5042,0.8246,-4.8963,6.3718,1.3619,2.8538,-0.5979,-0.8149,6.3718,11.2682,9.8164,7.5123,11.3608,9.9236,0.9639,0.0138,0.0994,11.3608,3.8485,17.6782,4.7179,28.1919,19.2569,7.5079,-4.5128,-5.2913,28.1919,23.474
133,0.5956,-0.1698,1.9435,0.4134,0.6548,-0.2358,-0.0155,1.9435,2.1133,0.0725,-0.3405,0.4674,0.0323,0.3125,0.9429,1.0583,0.4674,0.8079,-9.7845,-12.7386,-5.6292,-10.1119,2.0569,-0.0325,0.1926,12.7386,7.1094,-6.3912,-10.7363,-4.3548,-5.9056,2.159,11.249,12.4414,10.7363,6.3815,4.0359,0.63,6.895,4.6638,1.9683,-0.1652,-1.1594,6.895,6.265,3.6308,0.0273,6.1457,4.3814,1.9272,-0.592,0.592,6.1457,6.1185,-0.3712,-3.1727,2.0515,-0.2678,1.8914,4.6959,1.8173,3.1727,5.2242,9.8439,5.965,12.7431,10.1225,1.9584,0.0601,-0.1277,12.7431,6.7782,8.6526,4.4002,13.1901,8.6742,2.6554,3.9515,3.7148,13.1901,8.7899
134,0.3598,-0.5938,1.0299,0.3979,0.5132,-0.1031,0.2992,1.0299,1.6237,1.0154,0.0186,1.6283,1.0906,0.6319,-0.4486,-0.4892,1.6283,1.6097,-9.817,-10.5297,-8.5482,-9.9193,0.588,-0.3399,-0.1563,10.5297,1.9815,4.8578,-2.7516,9.9952,6.5358,5.4643,0.6934,-2.0297,9.9952,12.7468,3.8708,2.0125,6.0988,3.5044,1.5561,-5.9325,-8.0456,6.0988,4.0863,3.0388,-13.3823,15.7922,4.9734,10.321,-9.6294,-10.6243,15.7922,29.1745,4.3247,-2.7868,16.1074,1.5495,7.1919,-1.342,1.5396,16.1074,18.8942,9.904,8.6101,10.672,9.9948,0.6113,0.379,0.2929,10.672,2.0619,12.6041,7.8074,17.2903,12.389,3.4487,-0.1713,-0.1671,17.2903,9.4829
135,0.2568,-2.3853,1.6728,0.6971,1.4374,0.4159,-0.0175,2.3853,4.0581,0.5668,-0.4356,1.216,0.6014,0.5666,-0.7049,-0.6681,1.216,1.6516,-10.1569,-15.4374,-5.5695,-10.0756,3.1395,0.3483,0.3182,15.4374,9.868,5.5512,2.4595,9.9517,4.5061,3.2544,-9.1254,-10.8657,9.9517,7.4921,-2.0617,-8.6188,9.695,-4.5413,6.1655,6.3209,8.505,9.695,18.3138,-6.5906,-21.4302,4.673,-5.6509,9.1229,12.5685,12.9753,21.4302,26.1032,2.9827,-1.0715,9.4841,3.0891,3.0549,-1.479,-2.3772,9.4841,10.5556,10.283,5.5746,15.5222,10.2877,3.1206,-0.3794,-0.5043,15.5222,9.9476,12.4328,4.063,22.5259,12.2219,6.7002,7.3641,8.1142,22.5259,18.4629
136,0.6727,-2.4549,2.1293,0.6796,0.9409,-0.066,-0.0851,2.4549,4.5842,-0.138,-1.4637,1.1735,-0.0667,0.7052,1.0024,1.0673,1.4637,2.6372,-9.8085,-12.268,-7.1367,-9.7574,1.4196,0.0282,-0.0657,12.268,5.1313,-3.5743,-14.8575,12.2704,-6.3597,10.0354,10.576,16.202,14.8575,27.1279,4.2592,-1.47,12.1625,3.9638,2.6316,-0.5175,0.5425,12.1625,13.6325,5.978,-19.777,28.3129,7.3244,16.4426,8.8084,8.7262,28.3129,48.0899,1.5037,-15.1,11.6133,0.7119,6.3954,5.6156,7.3252,15.1,26.7132,9.9036,7.2749,12.3169,9.7834,1.3926,-0.047,0.0893,12.3169,5.042,19.7969,10.6441,31.7074,20.3361,6.3025,-1.2436,-0.1867,31.7074,21.0633
137,0.6067,0.1046,1.085,0.5945,0.3407,-0.0847,-0.0765,1.085,0.9804,0.8644,-0.158,1.66,1.0005,0.5834,-0.7905,-0.9311,1.66,1.818,-9.7803,-10.4283,-9.1558,-9.8231,0.4357,-0.0278,0.1923,10.4283,1.2725,7.0017,-2.7684,11.2548,9.8423,5.3033,-15.1364,-20.6019,11.2548,14.0232,3.7417,1.225,6.475,4.5062,1.954,0.0082,-0.7787,6.475,5.25,14.7864,1.582,25.7758,16.0506,8.7453,-3.1263,-3.2576,25.7758,24.1938,7.1193,-2.3707,17.5827,8.0371,7.71,-7.2853,-8.1927,17.5827,19.9533,9.8566,9.2266,10.5255,9.8727,0.4564,-0.0054,-0.1837,10.5255,1.2988,18.5532,10.2709,26.3733,20.1494,6.0766,-2.821,-5.0626,26.3733,16.1025
138,0.5221,-0.71,1.8602,0.5179,0.605,-0.0506,-0.1125,1.8602,2.5702,0.0739,-0.7378,0.7235,0.0694,0.4443,0.2473,0.3154,0.7378,1.4613,-9.8082,-13.4871,-7.8532,-9.6308,1.472,0.1283,-0.2422,13.4871,5.6339,-8.1347,-12.7458,-1.2293,-10.7596,4.7907,9.0805,13.0566,12.7458,11.5165,3.7499,-0.98,7.1925,3.7275,2.3139,-1.4071,-1.3388,7.1925,8.1725,11.6601,1.9555,16.2727,12.793,3.9735,-9.6311,-11.94,16.2727,14.3172,-0.1659,-9.2213,8.5043,-0.1556,4.5557,1.3467,1.1275,9.2213,17.7256,9.8512,7.9109,13.5089,9.6889,1.4573,-0.0752,0.2648,13.5089,5.598,15.7323,9.9851,20.3588,15.0868,3.2701,-7.1122,-6.7117,20.3588,10.3737
139,0.4715,-1.6168,2.4726,0.4055,1.0977,-0.0064,-0.0212,2.4726,4.0894,0.3213,-0.8779,1.2579,0.3848,0.5792,-0.2751,-0.2774,1.2579,2.1357,-9.6799,-13.4949,-4.4224,-9.873,2.3162,0.0198,0.3212,13.4949,9.0724,0.9459,-5.275,6.9429,2.297,3.7122,-8.7017,-9.2256,6.9429,12.2179,2.3428,-6.335,9.7563,2.3888,4.3778,3.5339,3.92,9.7563,16.0913,2.0289,-11.7439,11.1304,0.853,6.4461,-2.9798,-1.8505,11.7439,22.8743,1.1807,-3.6838,5.6636,0.972,2.2063,-1.728,-1.6635,5.6636,9.3474,9.7761,4.4924,13.5458,9.9537,2.3004,-0.0826,-0.3896,13.5458,9.0534,8.6201,3.3923,14.613,8.3751,2.8138,1.8954,2.5324,14.613,11.2207
140,0.4651,-0.1641,1.4284,0.3843,0.5628,-0.1858,-0.1587,1.4284,1.5925,0.0462,-0.584,0.6559,0.1074,0.4281,0.3371,0.2744,0.6559,1.2399,-9.6601,-11.492,-7.4212,-9.5517,1.2176,-0.5469,-0.2361,11.492,4.0709,-7.7559,-12.432,-3.5659,-6.9286,3.2892,12.2588,11.4052,12.432,8.8661,5.8767,1.89,10.43,6.3088,2.8379,-1.3016,-1.3169,10.43,8.54,-0.9509,-3.0044,0.9407,-0.9975,1.276,-7.2291,-6.9225,3.0044,3.9451,-0.5473,-5.2969,4.3825,-0.6915,3.5596,2.2913,1.9085,5.2969,9.6794,9.6934,7.4337,11.5119,9.5641,1.2225,0.555,0.2465,11.5119,4.0782,10.5155,7.1517,12.7894,10.9075,1.8381,0.2553,0.8545,12.7894,5.6377
141,0.2793,-0.5291,1.1738,0.2256,0.7078,-0.3495,0.3291,1.1738,1.7029,0.3833,0.012,0.9072,0.3818,0.3215,-0.0454,-0.1879,0.9072,0.8952,-10.207,-13.3682,-6.8504,-9.7878,2.075,0.4496,0.0364,13.3682,6.5178,4.5029,0.6613,7.3771,4.4766,2.3817,1.5103,1.2604,7.3771,6.7157,4.5752,0.7,8.2512,4.9919,3.21,-5.0695,-7.0613,8.2512,7.5512,-8.18,-14.9401,-3.7787,-7.9199,3.8659,16.7797,16.901,14.9401,11.1614,1.7441,0.025,5.0304,1.2169,1.8967,0.4228,-0.4109,5.0304,5.0054,10.2485,6.9372,13.3795,9.8105,2.0489,-0.3361,0.02,13.3795,6.4424,10.7708,4.373,16.033,11.7621,4.6802,2.1067,0.2352,16.033,11.66
142,-0.0702,-4.3927,1.351,0.5548,1.9085,-0.0574,-0.6671,4.3927,5.7438,0.3379,-0.1604,1.1872,0.1939,0.4506,-0.4656,-0.2753,1.1872,1.3476,-9.7574,-11.6636,-7.608,-9.7514,1.4968,0.3183,0.2242,11.6636,4.0556,6.0131,2.1899,9.8946,5.737,2.8083,-7.1224,-6.7121,9.8946,7.7048,-0.4944,-12.4775,11.025,-2.0694,7.5529,-0.3587,1.2556,12.4775,23.5025,8.5997,5.4145,11.1359,8.9811,1.7251,-9.2445,-9.4845,11.1359,5.7215,2.1669,-1.2086,11.7473,0.806,4.1933,-1.9921,-0.6884,11.7473,12.956,9.9123,7.6275,12.4668,9.8305,1.655,-0.4495,-0.2857,12.4668,4.8392,12.8775,10.8515,16.6569,11.9973,2.1239,-9.3662,-8.2732,16.6569,5.8055
143,-0.1276,-0.82,1.0985,-0.1124,0.6145,0.1598,0.0803,1.0985,1.9185,-0.1277,-0.6756,0.158,-0.0814,0.2657,-0.5262,-0.4033,0.6756,0.8336,-9.4391,-10.9819,-7.4005,-9.5272,1.0338,-0.2203,0.0104,10.9819,3.5814,-1.1093,-1.9954,-0.628,-0.9751,0.4461,-5.6746,-5.4455,1.9954,1.3674,-0.8531,-5.5038,3.7363,-0.8138,3.2759,4.1027,3.7975,5.5038,9.24,-0.6448,-2.965,1.731,-0.5034,1.5359,-8.3286,-7.5057,2.965,4.696,0.1748,-0.1756,0.9558,0.1177,0.3524,3.8683,3.1696,0.9558,1.1314,9.4629,7.4834,11.0109,9.5449,1.0204,0.2435,0.0927,11.0109,3.5275,3.5113,1.6023,5.6603,3.7241,1.383,9.8169,8.7162,5.6603,4.058
144,0.0322,-0.5459,0.8539,-0.0321,0.4395,-1.1874,-1.106,0.8539,1.3998,-0.6539,-1.5487,0.0784,-0.4847,0.5727,0.3111,0.1287,1.5487,1.6271,-9.6594,-11.4492,-8.3308,-9.5167,0.9365,-0.125,-0.2452,11.4492,3.1184,-6.7838,-11.2075,-1.9245,-6.4206,3.0523,3.5012,2.5003,11.2075,9.283,3.2495,1.12,6.4313,2.9838,1.5157,-0.9776,-0.7088,6.4313,5.3113,-8.9735,-17.7955,-0.936,-8.0091,6.7549,3.8251,6.0581,17.7955,16.8595,4.0431,-0.6636,10.2823,3.2873,3.7738,-3.1682,-2.8971,10.2823,10.9459,9.7064,8.3823,11.4496,9.6375,0.9216,0.1733,0.2254,11.4496,3.0673,13.3282,9.7929,17.9343,12.4403,3.3037,-2.265,-4.3734,17.9343,8.1413
145,-1.1552,-2.1379,-0.2205,-1.1381,0.4995,-0.6183,-0.7382,2.1379,1.9173,-0.3428,-1.3722,0.4075,-0.3561,0.4561,0.837,1.0011,1.3722,1.7797,-9.7844,-10.9347,-8.8428,-9.7619,0.5464,0.0168,-0.0503,10.9347,2.0919,-3.2827,-6.681,1.6569,-3.9202,2.4644,3.7165,5.004,6.681,8.3378,2.272,0.0263,5.2938,2.275,1.3507,1.5999,1.4,5.2938,5.2675,-5.1483,-25.0562,7.4949,-1.951,11.0518,-4.5404,-6.8561,25.0562,32.5511,0.8749,-2.2309,4.5992,0.3901,1.8511,-0.6496,0.1652,4.5992,6.8301,9.8797,8.9112,11.008,9.8629,0.5632,0.0927,0.1527,11.008,2.0968,11.0632,3.9509,25.1616,8.0669,6.8477,1.4988,1.5309,25.1616,21.2106
146,-1.7735,-2.8602,-0.8302,-1.8763,0.6441,2.3092,2.4271,2.8602,2.03,0.4942,-0.3447,1.5122,0.6451,0.5255,-0.029,-0.1655,1.5122,1.8569,-9.7676,-10.1913,-9.2862,-9.8122,0.2306,0.0441,0.0399,10.1913,0.9051,0.4339,-5.091,2.7649,1.0838,2.062,-1.752,-2.1471,5.091,7.856,3.8719,2.0562,6.6588,3.675,1.2019,0.0197,-0.1006,6.6588,4.6025,-9.6887,-25.3251,3.6284,-8.807,10.8748,10.4088,9.4305,25.3251,28.9535,0.2252,-3.8569,1.5023,0.5554,1.082,-0.8873,-0.6298,3.8569,5.3592,9.9724,9.454,10.482,10.0157,0.2518,-0.1917,-0.2148,10.482,1.028,12.562,2.917,25.4387,9.5978,8.5489,-7.9923,-5.0537,25.4387,22.5217
147,0.5357,-0.3737,1.1962,0.5508,0.5234,-0.2041,-0.2172,1.1962,1.5699,0.4652,-0.3142,1.2537,0.4796,0.6537,0.9921,1.0056,1.2537,1.5678,-9.7236,-9.9413,-9.44,-9.7723,0.181,0.059,0.1113,9.9413,0.5013,-1.3182,-4.0545,0.9511,-1.0633,1.8879,1.0678,0.9788,4.0545,5.0056,3.8916,2.9575,5.04,3.5744,0.826,-0.668,-0.3719,5.04,2.0825,0.72,-0.2517,1.7825,0.6235,0.6854,-0.1699,-0.074,1.7825,2.0342,-0.662,-4.421,0.8128,-0.0745,1.7394,0.2891,-0.0224,4.421,5.2338,9.7807,9.486,10.0295,9.8009,0.1927,-0.0003,-0.0171,10.0295,0.5435,4.5697,3.4705,5.6814,4.5441,0.8583,-1.2375,-1.2365,5.6814,2.2109
148,0.3316,0.2279,0.4192,0.3336,0.0507,-0.0063,0.0101,0.4192,0.1913,1.4572,1.1472,1.6277,1.4853,0.1277,0.0469,0.015,1.6277,0.4805,-9.6646,-9.7035,-9.6375,-9.661,0.0189,0.0087,0.0026,9.7035,0.066,-0.2504,-1.4797,0.4048,-0.0845,0.5429,0.1523,-0.1065,1.4797,1.8846,3.2236,3.1325,3.395,3.2025,0.0718,0.0048,0.0044,3.395,0.2625,0.5501,0.0549,1.0332,0.5495,0.2737,0.0301,0.0559,1.0332,0.9783,-0.3729,-2.3802,0.5678,-0.0969,0.7974,0.2226,-0.187,2.3802,2.948,9.7804,9.7163,9.8386,9.7837,0.0256,-0.0014,0.0018,9.8386,0.1223,3.3322,3.2069,3.709,3.3076,0.1209,0.0172,0.0486,3.709,0.5021
149,0.3253,0.1514,0.5131,0.3437,0.1079,,,0.5131,0.3617,1.5042,1.2668,1.8036,1.5002,0.1166,,,1.8036,0.5368,-9.6559,-9.6923,-9.5817,-9.6584,0.0282,,,9.6923,0.1106,-0.0981,-1.0028,1.0485,-0.191,0.6415,,,1.0485,2.0513,3.2284,3.1238,3.36,3.2069,0.0576,,,3.36,0.2363,0.5802,0.0828,0.9616,0.6054,0.2389,,,0.9616,0.8788,-0.1503,-1.571,1.5723,-0.2839,0.9566,,,1.5723,3.1433,9.779,9.6996,9.8154,9.7855,0.031,,,9.8154,0.1158,3.3494,3.2535,3.4815,3.3562,0.0668,,,3.4815,0.2279
