AYGX_min,AZ_mean,AYGX_mean,AYGX_std,AZ_mean.1,GX_std,Gnorm_max,Gnorm_median,timestamp
-0.1608,-10.0292,-0.0299,0.0849,-10.0292,0.4332,8.1456,4.8028,1255
-0.7745,-9.7202,-0.0497,0.2631,-9.7202,1.1845,7.9701,3.3704,1256
-3645.1572,-7.1451,-164.5478,536.1843,-7.1451,68.3512,249.4769,7.2246,1258
-546.4356,2.1189,-31.4583,275.7102,2.1189,37.1165,104.269,37.9949,1259
-39.7015,0.7082,47.6172,127.6131,0.7082,13.2846,59.0713,3.3256,1260
