AYGX_min,AZ_mean,AYGX_mean,AYGX_std,AZ_mean.1,GX_std,Gnorm_max,Gnorm_median,timestamp
-23.0126,-9.9609,-4.0498,13.1882,-9.9609,5.0946,34.1271,30.0624,109
-354.2506,-8.3814,38.3308,379.0849,-8.3814,47.5449,224.7585,61.4822,110
-1701.6256,1.847,-84.2706,386.1292,1.847,69.5857,354.4369,14.5357,112
0.1132,0.6563,7.4337,3.1233,0.6563,0.3232,1.4055,1.3026,113
8.8043,0.6603,9.0175,0.138,0.6603,0.0149,1.3255,1.3106,114
