AYGX_min,AZ_mean,AYGX_mean,AYGX_std,AZ_mean,GX_std,Gnorm_max,Gnorm_median,timestamp
-0.2085,-9.8845,-0.1789,0.0194,-9.8845,0.0749,2.654,2.5711,0
-0.2281,-9.8845,-0.19,0.0108,-9.8845,0.0378,2.6857,2.5823,1
-0.2503,-9.8844,-0.1894,0.0338,-9.8844,0.1154,2.6811,2.5764,2
-0.2128,-9.8843,-0.182,0.0168,-9.8843,0.0598,2.6115,2.5607,3
-84.8904,-9.8126,-4.8983,28.6937,-9.8126,14.4827,34.8453,3.1328,4
-73.9018,-9.5932,-12.06,28.0359,-9.5932,9.4656,26.5018,6.5111,5
-1.4895,-9.6214,0.777,1.7249,-9.6214,0.8512,4.2848,2.4722,6
-3.7072,-9.6181,1.5223,2.4574,-9.6181,1.0683,3.3825,2.4989,7
-3.2641,-9.6154,1.3388,2.5496,-9.6154,1.1085,3.8682,2.8292,9
-5.0864,-9.5901,1.3102,3.8523,-9.5901,1.5731,4.0738,2.5079,10
-1.1081,-9.608,1.1291,1.6817,-9.608,0.728,3.2168,2.7243,11
-8.2304,-9.6002,0.1866,5.4257,-9.6002,2.285,4.1574,3.3703,12
1.2085,-9.5812,2.6983,1.1227,-9.5812,0.4625,3.103,2.679,13
-4.0598,-9.5648,-0.0441,2.3554,-9.5648,0.9738,3.0304,2.5865,14
0.8512,-9.559,4.5802,2.2533,-9.559,0.9095,4.5243,2.9906,15
-4.2777,-9.5862,-3.0552,0.9827,-9.5862,0.3771,3.1566,2.8434,16
-5.6859,-9.5291,13.0182,14.9813,-9.5291,6.331,16.9665,4.4606,18
-11.1942,-9.7456,-0.38,7.3109,-9.7456,4.6871,10.0648,5.2618,19
-9.1512,-9.7128,-6.8086,1.5249,-9.7128,0.7246,5.4315,4.6507,20
-7.1105,-9.6062,1.0369,4.2603,-9.6062,1.6021,3.8758,2.9319,21
-6.0961,-9.5556,-3.1831,2.707,-9.5556,1.0462,3.5025,3.0454,22
0.6199,-9.5424,1.0271,0.2417,-9.5424,0.0933,2.597,2.4591,23
-5.5442,-9.4914,2.1589,4.9181,-9.4914,1.7579,3.5966,2.9699,24
-4.8889,-9.5068,9.1224,8.1269,-9.5068,2.8899,7.1812,4.9068,25
-22.1404,-9.6832,6.8664,14.9895,-9.6832,9.3341,25.1408,8.6304,27
-39.4259,-9.8997,-25.9288,12.1032,-9.8997,4.6983,34.0263,25.8895,28
-297.8631,-8.2886,-42.2882,95.3263,-8.2886,30.2454,149.5708,125.6987,29
-3.0469,-8.6148,-0.2762,1.8844,-8.6148,3.9629,13.0701,7.9784,30
-6.8203,-9.8375,6.2036,6.3996,-9.8375,3.7365,9.2036,6.2515,31
-71.5147,-9.8584,-8.6237,28.5196,-9.8584,13.8321,31.8008,20.2624,32
-13.9577,-9.9233,4.0789,10.4193,-9.9233,3.1623,22.8065,18.3524,33
-13.3723,-9.8219,3.6396,5.8315,-9.8219,4.1477,15.7043,12.1145,34
-0.6032,-9.8994,1.2244,2.106,-9.8994,3.2738,16.4591,3.6816,36
-2.4388,-9.8769,-1.156,0.9424,-9.8769,2.7155,7.6597,5.1364,37
-37.1682,-9.7123,-9.8285,28.7397,-9.7123,12.3938,22.3706,15.9783,38
-8.4948,-9.8713,-3.1707,2.9817,-9.8713,3.2851,5.5557,4.0239,39
-15.7446,-9.9116,-0.7033,7.3679,-9.9116,6.8797,23.4765,11.8744,40
-14.0075,-9.9281,-0.6126,5.6845,-9.9281,5.9884,41.0666,13.0702,42
-12.1233,-10.0782,2.2813,9.6838,-10.0782,7.3014,62.1956,46.258,43
-5.9766,-9.9909,8.4737,16.6642,-9.9909,8.3988,41.4589,27.012,44
-4.0368,-10.1488,30.8964,24.5098,-10.1488,4.4144,31.8246,29.9876,45
-15.8905,-9.6749,-3.3377,12.3869,-9.6749,2.5199,20.4764,18.196,46
-11.86,-9.6554,34.5214,39.2804,-9.6554,13.8927,55.8786,49.7798,47
-0.15,-9.6747,3.3641,3.9863,-9.6747,5.86,10.407,7.3848,48
-18.912,-7.5968,11.783,17.0099,-7.5968,14.6424,31.4937,18.8841,49
-5.9287,-9.9613,0.336,2.7905,-9.9613,4.9426,21.8345,5.3825,50
-2.0522,-10.0916,0.442,1.3178,-10.0916,1.3363,7.4802,6.5751,51
-29.3096,-9.3739,5.417,21.203,-9.3739,10.2462,34.6281,14.2621,53
-6.3091,-10.0102,5.0355,8.4236,-10.0102,8.0541,22.7729,11.4349,54
-4.7036,-9.3793,4.5693,6.4594,-9.3793,4.7559,22.1834,16.4769,55
-3.7649,-10.6324,4.7257,5.0465,-10.6324,7.6041,36.8974,34.2181,56
36.4863,-10.065,65.5722,14.809,-10.065,7.0273,48.7732,43.9598,57
-9.0385,-10.0009,21.1208,22.7844,-10.0009,21.5531,58.0079,29.8255,59
-6.8592,-10.4653,0.6267,3.2488,-10.4653,5.7391,39.2786,26.4878,60
-11.9998,-10.1442,6.0454,17.714,-10.1442,9.6023,61.3769,30.8599,62
-1.8272,-9.8819,0.1923,1.2832,-9.8819,1.7059,9.4468,7.52,63
-0.3498,-9.9431,0.3207,0.5212,-9.9431,0.8189,5.4567,4.3918,64
-0.1073,-9.983,5.0048,4.9719,-9.983,7.2692,38.4393,19.8819,65
-11.9018,-9.871,-3.1334,3.8297,-9.871,3.3627,20.1246,17.0387,66
-0.8711,-9.8628,3.1017,4.2814,-9.8628,3.8731,16.7813,9.6454,67
-17.1284,-10.2206,38.0939,55.206,-10.2206,12.081,42.7659,27.9112,68
-16.7951,-9.816,5.8294,11.0945,-9.816,10.4995,50.8114,25.4838,70
-23.6459,-9.712,6.7987,24.6506,-9.712,9.706,28.8923,17.5927,71
-53.2793,-9.8684,3.4237,19.8583,-9.8684,10.8602,32.0082,17.0089,73
-65.7827,-9.75,4.8565,35.0944,-9.75,18.6105,57.7515,19.7352,74
-44.8729,-10.2654,13.8148,37.1792,-10.2654,2.843,31.4688,27.1972,76
-19.5633,-9.8065,-4.1925,7.134,-9.8065,5.8153,29.5742,23.8759,77
-6.8496,-9.3536,5.6317,15.5541,-9.3536,5.9938,21.7191,14.9656,78
-45.0471,-9.9941,-7.6261,21.9834,-9.9941,13.2225,35.9361,17.3411,79
-70.6509,-9.7293,-2.554,28.2519,-9.7293,13.0875,38.0601,18.6444,80
-50.4478,-5.463,23.5165,36.0928,-5.463,17.4953,61.9312,39.8116,81
-34.8853,-9.9405,-10.0475,12.0709,-9.9405,6.4689,15.1645,9.6268,82
-142.2391,-10.1391,1.3737,56.1534,-10.1391,11.8501,36.5419,15.9046,83
-87.4241,-9.7414,4.961,62.0091,-9.7414,18.0323,37.9351,20.7276,84
-42.0948,-9.9543,36.3967,74.3765,-9.9543,25.8738,45.2387,33.446,85
-2.4079,-10.1656,19.1217,16.5129,-10.1656,11.3057,32.2466,26.0555,86
-10.3674,-10.145,1.8202,11.9565,-10.145,2.255,12.5351,8.6088,87
-38.9394,-9.4328,34.9942,47.7655,-9.4328,15.2469,47.763,36.3918,88
-14.5223,-10.1183,3.5591,13.7865,-10.1183,3.5571,17.9979,12.7976,89
-11.1933,-10.2209,1.5689,7.1627,-10.2209,6.0604,19.7857,11.245,90
-5.3593,-9.6624,4.5097,7.7493,-9.6624,9.6368,22.185,13.1773,91
-25.1363,-10.0305,10.3226,19.136,-10.0305,13.9527,37.2385,20.7189,92
-22.4112,-9.9856,8.5931,21.8643,-9.9856,13.7633,44.9906,12.3449,93
-11.3635,-10.2593,-2.6603,4.6882,-10.2593,7.9268,16.8729,15.0878,94
-225.4605,-10.1474,98.0417,242.2309,-10.1474,33.8232,69.2533,42.6221,95
-28.8188,-10.3132,-4.3249,10.3679,-10.3132,4.1981,13.4455,10.8744,96
-5.1821,-10.4318,5.8935,9.9099,-10.4318,8.3344,17.7636,10.5414,97
-3.1374,-9.53,0.1489,2.3624,-9.53,4.613,15.4057,11.5244,98
-0.879,-9.8734,2.2538,2.7101,-9.8734,2.178,14.0467,8.1204,99
-32.0544,-9.7222,29.167,39.9488,-9.7222,15.2208,47.7916,27.3271,100
-2.1511,-9.8921,38.1423,34.2315,-9.8921,15.5391,34.5166,23.9526,101
-16.4981,-9.9902,7.4868,19.3537,-9.9902,13.0064,25.4714,17.5359,102
-23.9273,-9.7144,2.5717,16.0661,-9.7144,7.8164,24.2135,14.3502,103
-62.7864,-10.1069,-9.0523,32.9446,-10.1069,5.8107,22.7649,16.7189,104
-26.9797,-9.8088,1.0924,17.1284,-9.8088,9.8944,26.204,15.1633,105
-69.8333,-9.503,-6.1672,19.41,-9.503,9.8329,51.4493,11.2128,106
-168.3914,-9.6899,-33.8873,64.2752,-9.6899,18.1573,59.0721,30.0523,107
-15.4245,-9.7586,-1.6512,7.7498,-9.7586,3.771,20.5369,12.7754,108
0.0448,-9.9953,7.0789,5.5415,-9.9953,4.4922,21.6666,9.2886,109
-120.1189,-9.9676,3.2105,48.9592,-9.9676,17.2421,45.4687,23.2025,110
-0.3562,-9.6563,8.7841,8.243,-9.6563,7.98,23.2701,18.1134,111
-20.5212,-9.7006,1.8021,9.8289,-9.7006,8.6189,24.7585,13.3737,112
-4.3969,-10.007,0.3498,2.6045,-10.007,6.4278,17.1221,11.7088,113
-5.3952,-9.608,0.5058,2.516,-9.608,3.9314,26.418,9.4521,114
-1.1916,-9.6958,1.0898,2.0397,-9.6958,2.7054,9.7715,5.1598,115
-14.5919,-10.126,1.8266,14.2329,-10.126,7.7731,36.4874,28.8253,116
-79.1851,-10.052,32.195,82.1088,-10.052,30.4425,85.0696,66.5722,117
-45.1889,-9.7287,9.081,22.6223,-9.7287,5.6753,47.3336,35.1878,118
-15.4539,-9.8052,-1.8015,6.6277,-9.8052,6.0909,26.3647,15.373,119
-6.0408,-9.9659,1.3427,5.2514,-9.9659,10.6165,30.5925,12.8937,120
-3.0389,-9.7055,0.5202,2.4743,-9.7055,8.1252,23.5342,10.5977,121
-1.7918,-9.7105,2.5958,3.2932,-9.7105,5.9224,12.6898,6.6341,122
-5.3279,-9.839,1.3793,2.5524,-9.839,6.9728,18.8192,8.6418,123
-22.2761,-9.9785,-3.4894,8.8308,-9.9785,7.5635,25.0906,15.9985,124
-8.687,-9.9323,0.8208,5.4246,-9.9323,5.851,32.5856,17.0646,125
-1.5931,-10.0351,4.0431,5.8654,-10.0351,4.4487,23.0449,16.1314,126
-16.8377,-10.106,4.5814,15.5093,-10.106,9.3736,29.1139,19.5931,127
-4.354,-9.8907,1.7833,3.5663,-9.8907,5.5397,15.6755,13.0908,128
-5.5026,-10.1519,10.442,15.2808,-10.1519,11.8643,35.3946,22.6646,129
-12.2088,-10.2822,8.1325,13.6521,-10.2822,6.9677,59.4574,32.2498,130
-10.6979,-11.4002,6.4865,14.0441,-11.4002,12.1603,74.1518,67.2919,131
-61.8065,-9.9627,4.9726,28.0551,-9.9627,17.5932,65.5393,46.6743,133
-13.9627,-9.8674,0.023,6.5515,-9.8674,8.9528,28.7492,14.6407,134
-67.527,-9.8043,-4.2474,21.7998,-9.8043,7.3039,45.2144,31.6983,135
-2.2805,-9.3643,16.7305,26.8573,-9.3643,9.9235,33.6582,21.4805,136
-26.9751,-9.6673,1.1129,13.9393,-9.6673,4.2772,42.8186,24.0599,137
-46.8351,-10.3318,14.9114,35.3023,-10.3318,14.7243,67.9445,49.5131,138
-33.9994,-10.1249,2.3828,17.1434,-10.1249,7.5695,32.3788,18.7948,139
-15.7881,-9.9265,19.7043,23.9137,-9.9265,10.9766,46.0323,19.7171,140
-4.9307,-9.4949,17.0854,24.949,-9.4949,8.0229,30.5208,18.4887,141
-226.2382,-9.6865,-16.6363,67.1833,-9.6865,14.742,40.542,20.9654,143
-11.4328,-9.9374,-3.3088,4.6911,-9.9374,7.9401,24.0962,10.6242,144
-1.3372,-10.1787,1.8573,2.6027,-10.1787,1.9467,37.8281,31.8695,145
19.5837,-10.174,54.7858,36.3714,-10.174,10.3208,58.397,46.5407,146
-32.9609,-9.976,4.2044,29.8655,-9.976,3.797,23.5716,17.2306,147
-63.8623,-9.7434,-7.516,34.0883,-9.7434,4.0627,28.4953,21.8829,148
-4.0481,-9.63,16.7433,30.1689,-9.63,7.9451,27.3225,18.4479,149
-33.8061,-10.1502,-5.2729,10.5467,-10.1502,9.5807,48.3001,20.1105,150
-78.197,-9.4548,3.8897,42.9032,-9.4548,4.7419,91.2958,31.9287,151
1.2385,-10.0139,28.6814,27.9941,-10.0139,1.9172,30.3249,25.8377,153
-5.0033,-9.7176,6.6416,11.0518,-9.7176,8.2437,43.3688,26.2174,154
-0.4884,-10.3201,4.2747,3.5221,-10.3201,4.866,59.1331,50.855,155
-6.4182,-10.0007,4.5433,7.2832,-10.0007,9.3981,27.9336,18.4265,156
-4.3825,-9.8558,0.538,4.4231,-9.8558,3.6188,19.6534,17.0268,157
-26.7125,-9.9282,-3.6077,10.4257,-9.9282,16.5819,48.1434,18.3831,158
1.3575,-10.0058,9.31,7.8377,-10.0058,6.1706,25.8947,21.7546,159
-3.7896,-9.8407,2.1175,3.2765,-9.8407,3.3273,15.8176,8.6677,160
-18.2543,-10.0395,-1.0536,8.3631,-10.0395,1.462,12.8791,11.5893,161
-42.6444,-10.0005,5.3137,31.8413,-10.0005,14.665,57.3608,32.3877,163
-12.0557,-9.8349,6.0769,14.0873,-9.8349,10.8204,29.5828,13.4922,164
2.3556,-10.133,11.4835,5.2427,-10.133,5.2551,20.899,15.1499,165
-1.922,-9.6596,2.5802,3.6085,-9.6596,2.6085,12.1722,9.0845,166
-2.5173,-10.0331,5.4441,7.1711,-10.0331,3.5041,22.5823,14.3597,167
-156.4215,-10.0319,48.253,147.4044,-10.0319,16.9911,98.8391,60.6453,168
-15.2524,-10.1141,-1.7492,10.3824,-10.1141,2.0731,35.8699,30.1329,169
-3.0522,-9.8145,3.4872,5.2788,-9.8145,4.3924,24.6555,9.0399,170
-0.355,-9.7862,0.1492,0.3154,-9.7862,1.3243,14.7867,12.9824,171
-16.4881,-10.1744,4.9617,15.9479,-10.1744,14.9752,63.2219,42.0325,173
-5.6959,-10.0508,2.3501,5.6991,-10.0508,6.559,42.1207,19.2115,174
-2.6811,-9.8157,0.5571,4.0905,-9.8157,3.1433,28.8696,23.323,175
-3.3262,-10.2459,0.471,2.794,-10.2459,4.7752,9.617,7.3445,176
-8.4616,-9.8177,2.2474,7.0985,-9.8177,2.7909,22.2908,19.4914,177
-4.7162,-9.9926,2.5541,4.6257,-9.9926,6.9211,26.5119,13.1031,179
-5.0506,-9.9389,1.1539,4.2671,-9.9389,7.7509,40.2626,25.8163,180
-13.6974,-9.954,-1.3522,10.6368,-9.954,1.641,44.419,39.5901,181
-5.5415,-9.8978,0.0766,1.48,-9.8978,2.5945,11.2054,7.3106,183
-0.8594,-9.8875,0.1343,0.4901,-9.8875,1.3613,6.4972,4.2232,184
-0.2809,-9.839,1.436,0.9786,-9.839,0.7275,10.2219,6.1783,185
-6.7619,-10.0632,0.1325,7.952,-10.0632,4.8448,34.3069,28.0443,186
0.1144,-10.0482,3.5341,2.9763,-10.0482,3.3619,28.0959,11.869,187
-1.5895,-9.8433,0.6243,1.7823,-9.8433,1.9484,10.3591,4.9891,188
-1.251,-10.0078,2.2317,2.812,-10.0078,0.7447,17.3544,14.3255,189
-8.6783,-9.8499,6.1861,8.8928,-9.8499,7.1613,35.7725,26.0146,190
-0.3813,-10.265,0.5561,0.9886,-10.265,2.2788,25.0687,19.3083,191
-10.0809,-9.899,-0.3187,2.3376,-9.899,2.6693,16.7933,6.8665,193
-4.7634,-9.8882,1.3651,3.1032,-9.8882,3.0175,17.1923,11.1049,194
-0.0903,-9.9321,1.3575,1.0107,-9.9321,2.6719,11.7343,9.5113,195
-1.4139,-10.075,0.0437,1.0595,-10.075,1.2107,13.2085,9.0886,196
-11.1286,-9.9138,1.8589,10.0965,-9.9138,1.1007,17.8877,9.8612,197
-1.3103,-9.9597,0.0599,0.7652,-9.9597,2.8842,9.7758,9.1119,198
-1.1765,-10.0167,0.6238,1.2887,-10.0167,2.1491,11.6769,9.2842,199
-22.6067,-9.8604,10.8219,18.151,-9.8604,11.3557,34.7958,19.4088,200
-6.0671,-10.3283,51.4176,54.4822,-10.3283,11.0708,53.8841,43.8287,201
-12.018,-9.7213,6.6026,16.8994,-9.7213,11.491,48.7596,15.1151,203
-35.7683,-7.5904,-5.304,14.9678,-7.5904,7.9881,75.0931,53.2746,204
-0.5843,-10.4625,46.5228,49.1055,-10.4625,18.754,64.3616,53.6672,205
-2.2829,-9.7002,3.6817,5.7643,-9.7002,1.8455,14.4185,10.2442,206
-5.2034,-9.9684,-0.9775,3.7939,-9.9684,2.2713,22.88,18.1741,207
-13.4768,-9.6099,34.4785,36.6571,-9.6099,5.203,77.5458,66.6739,208
-6.6806,-9.9399,2.8035,10.697,-9.9399,6.2924,57.1559,30.4184,209
-46.2567,-10.03,4.6488,26.2907,-10.03,16.3224,53.0375,38.054,210
-0.9498,-10.0286,2.4822,3.2374,-10.0286,7.4811,12.3586,9.646,211
-13.4442,-9.901,0.9737,5.2809,-9.901,7.1352,29.5312,12.0664,213
-15.5311,-9.7994,10.0048,27.3171,-9.7994,15.9846,43.8836,21.9678,214
-10.4417,-9.4361,4.3895,16.2781,-9.4361,6.7786,52.4606,31.0422,215
-33.9437,-9.8587,1.8816,24.7422,-9.8587,2.3993,31.2366,20.3549,216
-5.2872,-10.0263,9.8645,11.1122,-10.0263,3.8471,24.3899,20.4028,217
-6.0296,-9.855,-0.9297,2.6568,-9.855,5.0505,10.6518,8.2155,218
0.5636,-10.1786,2.0517,1.3113,-10.1786,0.9607,65.5372,64.2443,219
-33.1034,-10.3674,6.8836,17.8492,-10.3674,11.7528,96.7446,52.8834,220
-14.2985,-9.7065,1.4459,11.0872,-9.7065,1.6951,35.1146,32.9351,221
-28.9751,-9.655,4.9785,18.9945,-9.655,18.3269,59.7029,34.1118,223
16.157,-9.965,44.4889,16.2173,-9.965,7.3965,57.271,37.3029,224
-13.5993,-8.9557,15.8864,19.883,-8.9557,2.4466,56.5798,36.5594,225
-9.8381,-9.945,0.0123,6.3838,-9.945,3.3151,30.3691,28.5222,226
-2.9579,-9.9076,0.0707,2.2772,-9.9076,0.4582,12.8254,9.5348,227
-16.4846,-9.8865,2.9911,8.6671,-9.8865,5.8011,45.2055,11.4489,229
-6.4396,-9.7315,-1.0716,3.6888,-9.7315,1.0037,14.0267,10.5017,230
-29.9766,-9.8642,-2.7066,8.7541,-9.8642,5.3318,13.0083,6.9457,232
-46.9079,-9.7508,-7.2702,10.9272,-9.7508,4.1015,15.2673,3.6054,233
-0.9066,-9.7766,0.473,1.163,-9.7766,0.7611,2.8567,2.4965,234
-1.2341,-9.7779,-0.4289,0.6008,-9.7779,0.3942,2.5266,2.4271,235
-0.5892,-9.8531,1.9872,2.6847,-9.8531,2.6935,5.9696,4.2785,236
-5.5883,-9.8878,-2.1848,1.9942,-9.8878,1.5738,5.2292,4.1181,237
-20.732,-9.8369,-2.7874,8.3255,-9.8369,7.3481,21.5693,11.1677,239
-3.8118,-9.7153,4.725,5.963,-9.7153,3.4873,18.1732,16.6294,240
-15.6376,-9.8618,-1.2355,4.7434,-9.8618,3.0668,9.1824,2.992,241
-12.9825,-9.8881,-1.4475,3.1117,-9.8881,3.9538,9.8085,4.5674,243
-0.7137,-9.8669,-0.2371,0.3561,-9.8669,0.5023,2.8348,2.6099,244
-8.0729,-9.7963,-3.5815,3.1265,-9.7963,2.2593,6.9976,3.4207,245
-6.9173,-9.7133,-3.4626,2.7966,-9.7133,1.4617,4.6403,3.4878,246
-3.3836,-9.6701,-2.3008,0.84,-9.6701,0.3934,2.8828,2.6883,247
-0.1759,-9.7099,1.1515,0.7178,-9.7099,0.3914,2.6385,2.4561,248
-1.4416,-9.7725,2.3463,3.7902,-9.7725,2.6658,6.5764,2.5727,250
-3.2349,-9.8067,-1.5468,0.9912,-9.8067,0.7501,3.4327,2.7867,251
-2.49,-9.8165,-0.0554,0.8268,-9.8165,0.8512,4.2154,2.4329,253
-24.9364,-9.7973,0.7294,7.8873,-9.7973,6.096,22.793,10.8136,254
-41.2849,-9.9458,-4.9978,10.8301,-9.9458,5.2435,32.1816,19.6421,255
-29.5104,-9.8464,-2.6374,10.8999,-9.8464,8.3805,31.819,28.7501,256
-6.6103,-10.1147,0.2374,5.7095,-10.1147,7.9211,61.3372,51.2742,257
-0.773,-9.8101,5.6015,6.0642,-9.8101,6.9085,40.4611,26.4992,258
-11.0312,-9.9416,2.4072,7.3748,-9.9416,1.6461,68.8832,59.1084,259
-2.0411,-9.9474,0.2154,1.6753,-9.9474,3.1063,21.6261,20.4715,260
-101.2381,-9.7557,-19.0147,27.4764,-9.7557,7.3438,27.5606,15.7158,261
-59.8329,-9.5344,-32.4233,18.8279,-9.5344,4.9968,16.6351,12.1784,262
-16.7479,-9.7591,8.3487,14.8571,-9.7591,6.2941,16.5447,7.3986,263
-3.3139,-9.8664,0.7344,2.0516,-9.8664,2.9683,6.9422,4.3715,264
-1.7222,-9.8811,0.1462,1.377,-9.8811,2.4675,4.6001,3.6757,265
-2.2762,-9.889,-1.1141,0.719,-9.889,0.6196,4.5581,4.0151,266
-0.6448,-9.9024,0.2116,0.8901,-9.9024,1.0048,4.2743,3.3033,267
-0.2797,-9.8894,-0.0943,0.1177,-9.8894,0.453,2.9542,2.7436,268
-0.5278,-9.889,-0.4005,0.1202,-9.889,0.2041,2.9843,2.8908,269
-0.6407,-9.8857,-0.2345,0.3548,-9.8857,0.8065,2.8427,2.586,270
0.1435,-9.8875,0.3144,0.1949,-9.8875,0.4876,2.8916,2.7049,271
-0.4149,-9.8917,0.065,0.3737,-9.8917,0.8723,3.2906,2.6761,272
-0.7426,-9.8926,-0.0885,0.2402,-9.8926,0.7474,3.0351,2.5227,273
-0.5613,-9.8934,-0.0458,0.3041,-9.8934,1.039,3.6921,2.7254,274
-0.0071,-9.8965,0.1106,0.1431,-9.8965,0.7103,3.0833,2.5385,275
-0.2659,-9.8913,-0.096,0.105,-9.8913,0.3914,2.6724,2.4544,276
0.0035,-9.8994,0.823,1.1427,-9.8994,2.5255,7.3138,2.615,277
-17.4101,-9.8455,-0.47,7.1035,-9.8455,6.7577,12.8971,6.7191,278
-4.7924,-9.8697,4.9918,9.5358,-9.8697,4.4694,14.979,12.7089,279
-256.4361,-8.1128,-47.3354,62.9472,-8.1128,31.003,135.0527,70.8368,280
-72.7811,-9.8301,6.7342,29.3869,-9.8301,11.2374,47.9527,39.8106,281
-3.7513,-10.0604,4.2887,6.0646,-10.0604,1.3822,44.5216,38.3452,283
-6.4226,-9.9377,3.0734,5.8367,-9.9377,5.2846,43.3172,35.0057,284
-4.8453,-9.8454,-1.4119,1.9843,-9.8454,2.7642,25.1333,14.4997,285
-2.7477,-9.8415,0.2035,1.8982,-9.8415,1.8455,6.1254,4.5873,286
-18.9753,-9.8656,-4.356,6.6872,-9.8656,5.5372,12.9432,4.5855,287
-17.6566,-9.8694,-2.4461,6.1317,-9.8694,3.887,15.1792,7.7117,288
-8.8394,-9.9209,13.6618,18.2415,-9.9209,4.3109,31.8328,24.2379,289
-35.1676,-10.0841,32.5795,50.6494,-10.0841,15.2682,81.2261,54.7374,290
0.3357,-9.8474,5.1338,4.2591,-9.8474,1.4088,22.7821,10.4676,291
-21.1815,-9.8634,-7.4849,7.0975,-9.8634,6.5441,24.181,16.1274,292
-9.6423,-9.4058,0.5684,5.9129,-9.4058,3.9959,33.5009,22.0751,293
-10.165,-9.7995,1.7967,5.4905,-9.7995,6.3055,19.9565,13.4939,294
-8.1681,-10.3202,14.1415,13.1754,-10.3202,8.208,51.1605,28.3303,295
-4.0751,-9.7439,-1.2497,2.0801,-9.7439,3.9081,23.9572,19.3558,296
-2.0378,-9.6672,1.2947,2.7645,-9.6672,1.6385,17.9623,13.547,297
-30.0287,-9.7782,-1.2041,10.7767,-9.7782,7.3199,21.1139,5.367,298
-3.9497,-9.8028,-1.0605,1.938,-9.8028,2.3635,5.9229,3.8222,299
-10.6026,-9.6712,-4.4984,4.1224,-9.6712,3.685,10.0141,9.6223,300
-10.8325,-9.9744,3.3391,6.6114,-9.9744,4.2049,41.5342,30.9199,301
-6.6265,-9.7125,0.3035,3.6441,-9.7125,4.6468,33.4193,13.2758,302
-9.9641,-9.795,5.7479,10.2788,-9.795,5.1829,28.7459,16.2781,303
0.11,-9.7445,1.7018,1.163,-9.7445,1.3536,13.476,7.496,304
-31.2393,-9.8866,-3.0252,9.458,-9.8866,4.7332,15.2056,5.5952,305
-56.2466,-9.7472,-6.3751,22.9684,-9.7472,7.4511,16.7936,10.1231,306
-39.1241,-9.8241,3.6413,19.4076,-9.8241,5.3342,35.3955,22.3335,307
-68.8561,-9.894,8.0295,41.3473,-9.894,15.1441,43.7815,22.7539,308
1.2755,-10.2659,25.1725,19.1364,-10.2659,9.616,80.4673,54.9203,309
-189.2544,-9.9339,-23.2962,80.9717,-9.9339,16.443,96.3769,75.2547,310
-35.3107,-9.9411,24.0657,43.4566,-9.9411,18.7464,49.064,40.7617,311
-14.5774,-9.913,7.0086,14.1186,-9.913,6.0212,46.7509,31.6953,312
-6.8333,-9.9543,1.1472,4.9406,-9.9543,3.2768,23.4939,19.6154,313
-18.8833,-9.8767,-2.0306,8.6682,-9.8767,7.3387,13.7447,8.1659,314
-13.86,-9.8594,1.2297,5.2974,-9.8594,3.5832,14.6544,5.12,316
-57.3211,-9.8974,-3.129,15.6301,-9.8974,7.0508,39.3197,22.0753,317
-23.8154,-9.8923,3.4299,21.0115,-9.8923,7.4485,42.4853,23.4381,318
-11.1159,-9.9761,1.5532,10.5825,-9.9761,4.3737,15.1367,12.0415,319
-4.2215,-9.8526,3.7405,3.6992,-9.8526,3.5498,29.5262,16.1164,320
-7.0565,-9.8055,0.841,9.5101,-9.8055,0.8726,15.246,8.6012,321
-76.6958,-9.9848,14.145,53.9636,-9.9848,14.9539,71.5282,32.2677,323
-42.2158,-9.9689,11.0102,29.0743,-9.9689,12.7666,34.5905,19.0671,324
-6.7978,-9.7457,7.1624,10.0295,-9.7457,7.3786,19.3959,15.6082,325
-2.5952,-9.8233,1.0749,2.7529,-9.8233,2.2155,8.0349,5.1133,326
-1.8876,-9.7325,-0.2209,1.1087,-9.7325,3.7457,17.9489,14.3905,327
-4.6143,-9.8899,-0.6644,2.4442,-9.8899,1.9162,11.0208,9.0008,328
-44.1286,-9.8147,-11.0166,21.2938,-9.8147,9.1329,22.0754,15.287,329
-10.0679,-9.7955,9.5812,11.8666,-9.7955,6.5001,19.5222,6.0726,331
-1.7736,-9.8916,-0.0369,1.1425,-9.8916,2.0541,6.843,4.3258,332
-0.2213,-9.8878,-0.0334,0.1181,-9.8878,0.2138,12.2456,8.3452,333
-15.5897,-9.7665,-2.3106,6.1943,-9.7665,3.4464,18.5426,8.2348,334
-12.4593,-9.8407,3.2432,10.1858,-9.8407,6.7725,19.5989,11.8542,335
-24.7608,-9.8785,4.3577,18.9185,-9.8785,10.3433,52.7194,22.1642,337
-20.9646,-10.1276,-2.5904,6.634,-10.1276,6.6954,48.3889,23.028,338
-18.8898,-10.0075,13.1272,16.4922,-10.0075,3.0014,54.4508,43.5723,339
-7.4605,-9.8794,0.679,6.5977,-9.8794,5.6029,11.591,8.3806,340
-15.6816,-9.8706,2.6258,12.2192,-9.8706,4.4953,12.5302,11.1831,341
-48.2111,-9.8857,1.3595,19.9874,-9.8857,7.6225,41.8721,16.141,343
-22.0404,-9.8859,16.2272,32.4084,-9.8859,12.5779,51.8359,28.3133,344
-29.5588,-9.9249,-6.2741,12.2294,-9.9249,1.7697,48.1677,36.6834,345
-41.286,-9.9302,1.1682,35.2713,-9.9302,7.1885,33.4762,17.6712,346
-15.4954,-9.8968,-0.7546,7.1476,-9.8968,3.6916,12.2489,4.1193,347
-30.5129,-10.3622,10.9719,30.5164,-10.3622,12.2753,48.2423,23.6937,348
-84.2686,-10.1916,-3.1976,50.7002,-10.1916,18.6274,65.0247,43.4517,349
-28.6265,-10.024,5.5189,14.2734,-10.024,7.1132,21.0759,16.1634,350
-115.7871,-10.1035,-8.2668,69.2268,-10.1035,13.8447,36.7371,23.3566,351
-57.8853,-10.1447,-4.6717,23.7195,-10.1447,11.6216,38.2903,15.437,353
-84.5835,-9.6439,13.259,43.9653,-9.6439,11.9947,36.5841,16.8115,354
-12.6905,-9.9529,-1.6386,7.2482,-9.9529,5.2092,19.7343,10.9654,355
-5.5365,-9.9157,-1.042,3.5041,-9.9157,4.6941,19.0286,13.1542,356
-0.8209,-10.2802,4.2685,4.838,-10.2802,1.318,19.8063,10.3361,357
-3.1043,-9.2557,30.2444,32.2117,-9.2557,17.5485,31.4766,28.0728,358
-10.6428,-9.907,19.5136,29.598,-9.907,13.5323,46.3495,17.5731,359
-1.3163,-9.9019,0.5872,0.9597,-9.9019,2.48,9.4391,6.0284,360
-1.0237,-9.6264,2.5123,3.2813,-9.6264,3.3706,13.471,11.4518,361
-115.3332,-9.8261,-5.3196,19.3857,-9.8261,4.8547,20.0647,8.2289,363
-63.7895,-9.8749,-5.3824,21.7983,-9.8749,9.6778,18.1231,7.6124,364
0.7835,-9.8398,1.9062,0.7567,-9.8398,0.8076,5.3385,4.4777,365
-12.9534,-9.8087,-10.3808,2.0928,-9.8087,2.0375,10.3855,7.5978,366
0.4115,-9.8222,1.7267,1.5631,-9.8222,1.0738,4.0925,2.7353,367
-1.3603,-9.9338,0.4388,1.3798,-9.9338,4.1677,7.0194,5.0457,368
7.9543,-9.8388,11.232,2.5984,-9.8388,2.658,15.8731,13.9284,369
-39.6029,-9.874,-0.4485,12.1753,-9.874,5.8806,20.991,6.2441,370
-15.5069,-9.8382,-1.4282,7.0779,-9.8382,5.203,26.8462,16.4133,371
-20.7249,-9.8894,-0.3044,10.6102,-9.8894,6.434,31.611,11.1915,373
-16.4763,-9.9919,-4.7932,6.5725,-9.9919,7.9595,25.9837,23.0464,374
-14.6463,-10.0922,6.4272,13.5925,-10.0922,5.1007,36.5222,28.9958,375
-32.0389,-9.9503,14.832,33.0018,-9.9503,6.6034,31.698,23.3803,376
-41.6463,-10.2592,-7.3551,20.74,-10.2592,5.5477,48.4795,33.1985,377
-68.4732,-9.8694,-3.7741,18.0172,-9.8694,11.9037,56.6186,20.7384,379
-48.1107,-9.86,26.2678,55.8538,-9.86,8.9467,60.3966,33.7093,380
-26.5808,-9.691,-7.5573,12.448,-9.691,5.61,28.9622,14.3604,381
-19.1224,-9.8917,4.5487,8.8999,-9.8917,9.3801,25.0788,12.3313,383
-13.1517,-9.9176,0.5173,7.8401,-9.9176,11.7973,24.6273,15.2507,384
-0.7745,-9.9331,2.9723,3.2485,-9.9331,6.2139,15.5661,9.4982,385
-6.2251,-10.6225,14.3552,22.8521,-10.6225,5.6297,37.7454,33.8592,386
-39.0088,-9.9293,2.9943,21.7877,-9.9293,1.3009,28.8867,27.6743,387
-10.3367,-9.5912,2.4079,8.8259,-9.5912,4.7138,24.9544,7.6881,388
-24.5364,-9.9107,-2.2871,15.1127,-9.9107,3.4027,28.221,26.8527,389
-10.5976,-9.7977,2.7438,8.3243,-9.7977,4.5202,20.0129,12.9656,390
-16.7439,-9.9643,6.1082,14.5823,-9.9643,12.9149,44.3923,17.018,392
-50.0935,-10.1678,25.2962,56.3798,-10.1678,16.56,72.3774,45.4758,393
1.7447,-9.8207,4.5726,2.9338,-9.8207,2.369,15.6205,11.0459,394
-37.9418,-9.7964,22.5893,35.7062,-9.7964,1.4496,40.6469,24.9002,395
-19.5232,-9.5985,36.1422,26.3639,-9.5985,5.837,60.2565,57.3145,396
-1.6286,-9.9478,1.8105,3.872,-9.9478,3.3597,10.7448,7.0118,397
-13.141,-10.2739,6.5765,15.9949,-10.2739,10.1252,39.7834,28.9025,398
-17.8649,-10.0575,10.312,16.6152,-10.0575,12.0946,48.7451,18.6959,399
-0.3122,-9.5855,2.9138,2.631,-9.5855,3.7028,20.7074,17.6228,400
-1.549,-9.713,2.563,5.534,-9.713,1.8605,13.284,6.8993,401
-19.8038,-10.0347,4.8141,11.717,-10.0347,10.1361,31.8014,15.6452,403
-11.1226,-10.1597,-1.3843,6.2798,-10.1597,4.4453,39.1602,33.9479,404
-72.7082,-7.3194,-10.1382,28.6823,-7.3194,6.9504,57.1097,38.3951,405
-136.1177,-10.0631,-32.1455,54.5657,-10.0631,11.7804,90.4504,64.3456,406
-2.0596,-9.6444,1.9938,3.664,-9.6444,5.3693,10.6304,5.941,407
-15.2706,-9.6868,-4.3195,6.84,-9.6868,2.8553,12.9507,9.1617,408
-10.4489,-9.6683,2.3231,7.2126,-9.6683,5.7873,45.2485,22.3702,410
-19.5421,-9.7913,3.0597,11.8254,-9.7913,11.8398,34.7853,26.1845,411
-11.0641,-10.0567,-1.3173,5.9809,-10.0567,8.4767,21.1493,15.2777,412
-11.3958,-9.9228,4.6302,11.0778,-9.9228,9.4696,33.3291,18.4958,413
-14.8611,-9.948,11.8302,20.0083,-9.948,16.8139,50.4126,25.6147,414
-12.5643,-9.841,-2.0741,5.3936,-9.841,6.5483,21.2748,14.0076,415
-0.1939,-9.9209,6.7914,6.2434,-9.9209,6.8882,14.767,11.621,416
-16.5644,-10.3226,8.8087,15.6145,-10.3226,9.392,28.9187,22.4394,417
-13.5321,-10.0304,11.316,23.1338,-10.0304,3.1841,22.3395,18.4593,418
-52.1165,-9.7577,17.709,45.3103,-9.7577,11.3982,42.6589,25.746,419
-24.9979,-7.2141,-12.6246,7.4726,-7.2141,13.9773,30.517,22.2301,421
-4.4953,-9.6412,4.8645,6.2627,-9.6412,6.2002,40.8681,24.4035,422
-52.7819,-9.9471,6.5921,23.9107,-9.9471,9.294,52.5229,23.1312,423
-46.8731,-8.5907,3.2371,21.0956,-8.5907,10.4354,101.3626,50.1423,424
-20.0297,-7.8024,36.9815,44.1884,-7.8024,15.3991,86.2826,53.011,425
-24.522,-9.9895,-2.6088,9.2359,-9.9895,3.4952,37.3135,15.5404,426
-6.7027,-9.3708,9.3734,11.7738,-9.3708,8.4873,58.3348,28.278,427
-27.5566,-9.959,17.7416,50.9291,-9.959,9.4332,47.6959,41.7077,428
-8.8091,-9.9715,19.3389,18.8998,-9.9715,8.5773,42.9712,20.7736,429
-8.5362,-9.845,12.4523,12.238,-9.845,13.9335,26.5097,21.3383,430
-3.6461,-9.6502,1.5123,3.636,-9.6502,4.193,23.0855,13.9259,431
-6.8472,-9.9571,2.844,4.1333,-9.9571,3.6242,23.993,16.9278,432
-10.4194,-9.5674,0.6684,6.4422,-9.5674,2.077,20.8524,15.8226,433
-23.9178,-10.0191,29.9981,40.5475,-10.0191,17.1458,47.9903,33.3121,434
1.7787,-8.7979,15.759,10.3065,-8.7979,3.5434,33.8484,31.0436,435
-0.6239,-9.77,9.6784,6.9906,-9.77,5.5345,24.3121,23.1408,436
-43.4076,-9.587,3.6872,24.3976,-9.587,10.7414,48.3933,27.3784,437
-3.2886,-8.2866,-0.327,1.8441,-8.2866,2.5452,28.5319,19.8989,438
-4.5382,-9.6729,8.6884,7.9838,-9.6729,4.9321,32.3985,11.2449,439
-6.6757,-9.9482,0.3693,3.5913,-9.9482,4.6483,13.1288,7.4596,440
-14.2199,-9.2889,-3.1839,7.1706,-9.2889,3.3024,18.8502,15.2339,441
1.7943,-10.1584,8.8964,4.4144,-10.1584,5.2673,27.7792,20.4184,442
-171.8982,-9.6772,-1.1589,94.2051,-9.6772,13.0731,116.6182,92.1462,444
-22.302,-10.106,-4.2419,16.7564,-10.106,3.0715,23.6315,21.4984,445
-11.1709,-9.6087,0.729,11.5731,-9.6087,6.1626,16.0052,11.2952,446
0.5957,-9.7564,8.4424,7.681,-9.7564,4.4541,26.4877,13.3853,447
-11.9114,-9.282,-0.9797,4.5889,-9.282,6.6314,24.859,14.1139,448
-30.1946,-9.9195,19.0263,25.9073,-9.9195,14.7322,55.9985,24.3286,449
-9.6685,-9.6555,4.4831,6.81,-9.6555,7.1767,25.9006,19.8761,450
0.061,-9.8797,23.7845,13.0199,-9.8797,7.1999,38.8484,31.6582,451
-12.6795,-10.0623,1.7276,7.3478,-10.0623,4.7441,29.0147,11.7374,452
-11.3819,-10.14,9.5388,16.9697,-10.14,13.6632,47.8901,22.2109,453
-4.6084,-9.6569,10.6143,12.9134,-9.6569,10.5829,29.9698,21.168,454
-8.0402,-9.863,7.8161,13.354,-9.863,6.6795,26.7337,21.2962,455
-27.6381,-10.5564,-1.1025,12.7604,-10.5564,3.1161,28.0499,15.4378,456
-15.9692,-10.2893,-3.3459,6.9735,-10.2893,3.3809,15.5337,11.3327,457
-0.3867,-10.0733,3.6892,2.7227,-10.0733,6.8439,14.5538,11.6322,458
1.2688,-9.8626,3.254,1.7634,-9.8626,2.7464,15.7458,11.9907,459
-19.6301,-9.7635,-0.0182,9.0494,-9.7635,4.683,31.3254,15.002,460
-6.7038,-10.2397,1.4297,5.3339,-10.2397,2.3422,41.4521,32.6959,461
-93.1099,-10.0277,-4.1004,31.0154,-10.0277,12.6386,117.4632,61.3422,462
-28.0317,-9.8998,-4.1115,11.0851,-9.8998,7.4483,82.2666,59.7184,463
-9.7352,-9.8656,24.9426,22.9163,-9.8656,9.6862,53.0499,27.162,464
-20.3648,-9.4454,-1.8635,9.5057,-9.4454,3.0348,33.4364,17.1454,465
-81.1046,-9.5773,-13.0573,41.704,-9.5773,3.8255,26.8213,22.9635,466
-138.992,-10.645,5.7436,85.6441,-10.645,15.3908,57.8888,38.5716,467
-9.7733,-9.657,-0.8115,6.661,-9.657,2.289,22.151,13.7961,468
-48.6047,-8.3043,31.3012,64.1503,-8.3043,16.315,59.0599,37.9032,469
-125.409,-10.0975,5.8286,48.614,-10.0975,18.5441,48.4565,26.5032,470
-2.4337,-9.6403,4.4977,6.5849,-9.6403,10.1386,19.9794,12.9627,471
-81.2284,-8.9202,-5.5821,26.8049,-8.9202,11.1259,52.813,23.4322,473
-33.2646,-9.3858,3.6254,23.887,-9.3858,10.811,37.8386,17.1851,474
9.6639,-10.029,49.3788,31.2161,-10.029,8.1771,52.2035,44.3368,475
-48.034,-6.8935,-17.065,21.9896,-6.8935,11.4447,35.2331,26.4874,476
-61.8628,-9.6405,10.3166,42.0568,-9.6405,9.5836,35.6861,30.4139,477
-0.4836,-8.7578,16.6569,14.5045,-8.7578,8.3353,53.5643,37.3375,478
-11.034,-9.8505,-1.8149,5.7094,-9.8505,8.5599,20.0575,12.5812,479
-11.3863,-9.5383,-1.7107,4.2532,-9.5383,4.3307,27.5333,9.4459,480
-19.9441,-7.757,-7.3303,6.8504,-7.757,2.9932,32.8909,19.6539,482
-9.5371,-9.302,-1.6281,4.9395,-9.302,4.7118,11.3315,7.1497,483
-6.6953,-10.0418,2.0391,3.9092,-10.0418,6.8774,24.9566,18.3552,484
-48.2283,-9.9447,2.8915,24.3715,-9.9447,3.6937,51.1687,31.4223,485
-140.9614,-9.5268,83.078,237.7046,-9.5268,25.9024,147.8592,73.1934,486
-1.0494,-9.98,6.0519,6.4431,-9.98,2.7441,68.2281,60.7056,487
2.0184,-10.0766,13.4781,7.3231,-10.0766,1.7683,39.0556,27.533,488
-12.0467,-10.1308,24.3069,18.0538,-10.1308,3.0927,40.0205,26.9504,489
-8.4843,-9.923,2.0362,4.8919,-9.923,3.6771,35.5643,24.1104,490
-10.6131,-9.8335,4.1858,11.5815,-9.8335,8.4473,55.4802,43.9167,491
-36.9876,-9.8926,3.4077,13.2563,-9.8926,11.6381,50.7228,23.6129,493
-28.6904,-9.9081,-0.6098,17.5486,-9.9081,10.3677,45.0589,16.9084,494
-16.1813,-10.0146,4.4127,11.5424,-10.0146,8.1066,26.2276,21.3657,495
-2.2787,-9.525,167.617,163.681,-9.525,44.1683,124.6349,87.7017,496
-26.129,-10.0381,27.1568,34.8325,-10.0381,17.3875,33.2513,27.9447,497
-72.8758,-10.0192,-1.1955,21.7161,-10.0192,5.7193,25.1532,18.1216,498
-10.741,-10.0887,5.6204,9.671,-10.0887,9.9131,29.124,22.8554,499
-8.7524,-10.0452,2.8757,8.2118,-10.0452,5.7196,43.7648,20.0461,500
-19.9759,-9.9576,-1.0978,6.2961,-9.9576,13.0462,51.773,20.9491,503
-33.6939,-9.8798,-2.4113,10.5338,-9.8798,14.6915,37.6996,20.3351,504
-16.5139,-9.0956,0.1743,6.5266,-9.0956,10.503,32.7239,13.7782,505
-4.9377,-9.8286,0.0647,2.8355,-9.8286,3.7185,21.722,9.8186,506
-0.625,-10.5732,0.2956,0.8309,-10.5732,2.41,16.8864,11.9064,507
-6.1756,-9.997,1.0534,5.7579,-9.997,9.0565,17.7696,11.8832,508
-5.6121,-10.2485,0.7576,4.0886,-10.2485,3.2376,14.7304,12.2801,509
-5.8125,-9.8009,0.8508,3.1014,-9.8009,5.3408,16.9014,11.3294,510
-16.6597,-9.8776,1.1382,6.0848,-9.8776,5.7035,25.4771,10.5305,512
-11.717,-9.4652,8.3668,13.8429,-9.4652,6.629,32.4453,26.8243,513
-15.8757,-9.8063,7.9112,16.9167,-9.8063,5.6759,28.1484,19.3262,514
-49.9942,-8.8836,-2.73,26.8008,-8.8836,11.9542,55.5356,42.8356,515
-44.6481,-9.466,-22.8418,16.7259,-9.466,6.5407,32.2242,22.0944,516
-2.1492,-9.9598,0.9471,2.9356,-9.9598,5.6474,18.3112,9.7338,517
-153.7779,-7.7342,-39.4196,51.0269,-7.7342,11.9583,83.4709,40.0086,518
-33.2114,-9.8866,-1.1105,13.657,-9.8866,8.2894,18.5585,5.84,519
-6.1723,-9.828,-0.2964,2.483,-9.828,2.7771,6.57,3.9582,520
-39.5916,-9.8657,-4.1408,10.1959,-9.8657,5.8069,18.9049,5.698,522
-16.8104,-9.8672,-1.2889,4.7397,-9.8672,2.1774,9.7444,7.2888,523
-2.1252,-9.8713,0.7893,2.2116,-9.8713,3.1154,7.962,4.186,524
-3.3987,-9.8779,-1.0481,1.2569,-9.8779,1.573,7.0207,3.4463,525
-2.0672,-9.8727,-0.4938,0.821,-9.8727,0.9919,3.2705,2.6364,526
-43.5782,-9.8769,3.8823,21.2009,-9.8769,8.0911,29.5444,13.4812,527
-7.3975,-9.8628,-1.3058,4.6004,-9.8628,3.9896,21.8284,11.4676,528
-23.4011,-10.1437,2.8026,22.6855,-10.1437,6.8821,45.312,34.2418,529
-16.3294,-10.4362,5.5156,12.8812,-10.4362,10.4611,38.8897,26.5858,530
-4.2543,-9.1858,0.5597,2.258,-9.1858,1.3049,22.061,17.8694,531
-12.1204,-9.8675,4.3128,8.5709,-9.8675,6.1157,47.2625,17.5193,533
26.4796,-9.522,64.1692,26.6023,-9.522,7.3,52.4011,45.9761,534
-0.174,-10.2933,1.6214,1.6165,-10.2933,4.7959,19.8816,16.0397,535
-1.5617,-10.4005,0.3465,1.1933,-10.4005,2.552,11.5642,8.5246,536
-14.3447,-9.5797,28.2528,35.1954,-9.5797,7.8022,45.2696,28.7449,537
-5.6493,-10.182,2.1921,10.0328,-10.182,8.0629,17.291,9.7754,538
-18.2194,-9.9306,25.5243,37.2775,-9.9306,8.7691,41.1581,27.5895,539
-19.8058,-9.9242,1.1442,11.7557,-9.9242,7.588,26.6788,16.5302,540
-31.0922,-9.6699,0.749,17.8634,-9.6699,3.9578,31.079,22.7433,541
-34.9996,-10.141,18.5426,31.6616,-10.141,24.8185,60.0584,33.3889,543
-33.9987,-9.2651,2.6333,17.1362,-9.2651,10.1532,18.5289,10.5174,544
-0.9396,-9.7944,1.1199,1.5046,-9.7944,3.2881,9.6899,7.1988,545
-4.5313,-9.9545,0.2507,2.7434,-9.9545,3.0167,12.4857,9.3996,546
-1.4547,-9.5212,0.0018,0.7495,-9.5212,2.1353,7.2897,5.3624,547
-16.2192,-9.0946,3.8292,17.0058,-9.0946,9.0315,54.7443,23.1339,548
-29.3423,-8.4567,2.7818,22.6197,-8.4567,14.5225,46.4127,23.4052,549
-29.5453,-9.6523,-1.4544,16.3847,-9.6523,9.0136,19.546,11.5836,550
-4.689,-9.8344,0.3505,3.8574,-9.8344,4.1699,14.6476,9.052,551
-15.6887,-10.0714,12.2141,19.8276,-10.0714,17.7851,48.5537,23.1131,553
-29.1147,-7.5567,20.2439,24.5264,-7.5567,11.8466,51.1203,36.2139,554
-4.7883,-9.822,12.7191,18.4571,-9.822,11.4007,27.3118,20.4506,555
-20.3704,-9.6768,-6.3321,7.6435,-9.6768,6.7365,20.6225,9.3448,556
-21.5577,-9.8952,0.6676,10.4579,-9.8952,13.0683,24.8085,14.1352,558
-5.4325,-9.5796,11.2506,11.4198,-9.5796,13.3427,27.5531,16.4685,559
-13.4408,-10.0118,-0.594,6.1772,-10.0118,3.6395,28.8866,9.5537,560
-7.9401,-9.7266,5.7286,8.9949,-9.7266,6.1771,30.3696,20.3281,561
-26.3684,-9.9485,1.6149,16.0415,-9.9485,15.0036,40.2424,13.6621,563
-1.8141,-9.6574,-0.0838,1.1603,-9.6574,3.0207,11.7694,4.785,564
-1.3332,-10.2938,0.1934,0.9963,-10.2938,2.1463,8.8295,6.355,565
0.5376,-9.9628,5.1037,2.5708,-9.9628,2.1801,13.4207,11.1783,566
-0.7789,-9.8529,12.3843,7.1637,-9.8529,4.5978,32.0839,25.9238,567
-8.7783,-9.9811,0.7603,3.9834,-9.9811,3.8405,57.0654,43.1411,568
-22.8928,-10.1507,-0.453,7.6152,-10.1507,3.6711,90.6218,62.8415,569
-7.8412,-9.5855,1.3833,7.1438,-9.5855,4.3457,100.053,91.8951,570
-5.6648,-9.9004,2.7491,6.716,-9.9004,2.7158,18.9762,12.5128,571
-15.6295,-9.9715,10.4172,17.4754,-9.9715,6.937,64.0122,32.8888,573
-15.3873,-9.8903,2.6083,5.838,-9.8903,8.7636,29.89,20.0521,574
-5.5741,-10.0175,3.9358,4.508,-10.0175,6.8241,18.0857,12.1665,575
-0.9564,-9.76,13.7165,12.3057,-9.76,12.4043,36.5598,23.2665,576
-9.2848,-10.0891,-2.4962,5.1352,-10.0891,9.1101,26.6223,17.322,577
-0.0148,-9.7924,7.0476,6.6251,-9.7924,4.9672,26.5883,8.7221,578
-9.8449,-9.8623,-2.4819,5.3377,-9.8623,4.7965,19.9298,8.2194,579
-15.4277,-9.8592,4.2662,7.5942,-9.8592,9.499,30.4318,23.5133,580
-6.4302,-9.9126,-1.6221,4.0468,-9.9126,9.9181,32.6439,30.6791,581
-9.9038,-10.0729,5.4216,9.6113,-10.0729,7.3589,41.3223,28.8298,582
-4.7996,-9.7576,6.9743,10.7717,-9.7576,5.175,24.2748,17.3625,583
-0.715,-9.9897,1.5298,2.7599,-9.9897,2.6985,16.7256,14.2119,584
-19.0829,-9.4212,41.3774,53.2652,-9.4212,3.3481,65.3948,44.3595,585
-13.9434,-9.9909,-0.1658,5.7234,-9.9909,8.7539,36.3438,9.103,586
-12.4904,-9.9988,1.3932,8.4856,-9.9988,3.4091,14.726,11.7652,587
-20.6155,-9.8742,-0.6327,7.5409,-9.8742,3.1659,29.926,8.0044,588
-3.909,-10.0976,5.5527,8.1901,-10.0976,9.5423,29.9412,14.5655,589
-9.5217,-9.9676,5.7113,14.7218,-9.9676,12.5447,36.3316,15.4102,590
-0.0519,-9.9228,1.1936,0.95,-9.9228,2.6619,9.0149,6.3222,591
-12.1156,-9.466,4.5061,9.9542,-9.466,10.4493,32.5726,25.0556,592
-135.7038,-9.6689,24.3509,81.6926,-9.6689,26.2933,127.1516,23.1372,593
-1.7213,-9.9158,15.0078,13.6582,-9.9158,11.9038,33.2315,26.7234,594
-1.8223,-9.6543,8.4533,9.2502,-9.6543,4.1144,17.1388,14.9703,595
-4.7926,-9.5288,4.6996,8.1263,-9.5288,11.917,29.5769,19.2988,596
-0.9157,-9.8463,2.2171,2.6174,-9.8463,3.0069,11.1165,9.7546,597
-13.3953,-9.7364,-3.3553,7.2899,-9.7364,3.9413,15.851,9.0635,598
-11.9783,-9.5711,29.0141,39.7781,-9.5711,11.7418,57.015,47.579,599
-22.7113,-9.9774,6.5331,22.4201,-9.9774,12.5293,45.5924,15.6458,600
-29.1595,-9.9974,-0.6631,16.7476,-9.9974,11.3886,41.8066,26.5309,601
-23.3985,-9.3162,1.4528,11.4187,-9.3162,13.1856,33.0966,20.7189,602
-4.1706,-9.9728,2.4778,6.255,-9.9728,8.7032,20.5338,14.8099,603
-5.7035,-9.9485,0.4584,3.4597,-9.9485,1.6117,13.488,12.5958,604
-0.8978,-9.7979,1.1581,1.4437,-9.7979,1.9302,10.2707,8.2557,605
-0.2277,-9.8188,1.184,1.3188,-9.8188,1.8019,10.0158,6.404,606
-6.7974,-10.024,-1.1499,2.5003,-10.024,1.7589,11.6448,6.0702,607
-0.6592,-9.9037,1.1819,1.7136,-9.9037,2.3231,11.8125,7.4991,608
-2.6039,-9.7223,3.1229,3.7856,-9.7223,2.5096,11.8013,10.2584,609
-12.8307,-10.0062,9.9407,17.593,-10.0062,12.7234,41.0485,26.3315,610
-1.8679,-9.9794,0.1285,1.0371,-9.9794,3.323,23.9706,21.6239,611
-2.2385,-9.8191,0.2666,1.1927,-9.8191,2.1318,6.6585,5.7859,612
-31.0205,-9.9558,2.6844,10.5491,-9.9558,5.828,53.79,25.5862,613
-7.8952,-10.1055,-0.8532,3.1879,-10.1055,4.471,50.3835,37.7856,614
-1.6422,-10.2901,-0.1105,0.7426,-10.2901,2.3434,43.9297,38.0577,615
21.6623,-8.9448,42.645,10.3518,-8.9448,4.3823,74.5293,42.366,616
-6.1081,-9.8111,2.7912,5.0579,-9.8111,2.4371,18.9484,14.1355,617
-3.977,-9.8886,0.2269,2.0122,-9.8886,2.5884,23.0388,4.6719,618
-2.2529,-9.8991,2.7712,6.0226,-9.8991,2.5598,34.0947,30.824,619
-35.3386,-10.2873,-0.6838,9.2795,-10.2873,5.9422,93.5494,72.522,620
-14.9322,-9.7912,9.8519,21.87,-9.7912,11.02,81.6678,48.5729,621
-10.7739,-9.7574,-3.495,3.9936,-9.7574,5.9059,20.3578,12.7843,622
-10.3797,-9.6574,2.5523,13.8142,-9.6574,3.1246,19.9316,10.875,623
-19.835,-10.0405,49.9912,33.1153,-10.0405,5.8339,56.7904,39.4222,624
-7.666,-9.8367,9.0799,12.0431,-9.8367,14.4406,34.7843,21.6194,625
-4.3411,-9.2069,0.5545,2.5549,-9.2069,4.1183,15.8089,11.7536,626
-2.5149,-10.0492,6.5397,9.599,-10.0492,7.1835,20.8654,19.3488,627
-1.9961,-10.0804,18.1733,18.9398,-10.0804,14.5812,52.0154,33.7009,628
-14.7303,-9.771,3.8748,10.7908,-9.771,6.3051,28.8592,20.1932,629
-1.7639,-10.3594,1.3959,4.4389,-10.3594,4.563,24.4462,23.2548,630
-4.4943,-10.5183,4.1635,6.7,-10.5183,11.2678,43.9305,36.4472,631
-5.99,-9.8424,3.0462,6.0832,-9.8424,4.726,25.4799,14.7756,632
-7.5167,-9.823,0.3498,4.995,-9.823,11.263,33.6512,15.7277,633
-24.0561,-9.6979,7.1544,25.7878,-9.6979,8.7419,43.5674,41.0236,634
-27.486,-9.9971,0.3249,12.7103,-9.9971,9.9133,33.5635,26.7918,635
-11.9823,-9.8326,11.4725,17.6661,-9.8326,4.242,29.6723,26.1048,636
-8.2761,-10.4147,0.6157,3.3416,-10.4147,5.046,100.3817,68.2222,638
-66.1116,-10.4072,79.8091,109.2174,-10.4072,27.2286,145.6425,78.4639,639
-53.2681,-8.7233,53.3057,77.4413,-8.7233,14.4701,122.1684,93.5605,640
-14.9201,-10.8133,44.0128,28.6483,-10.8133,6.3006,59.8696,32.1703,641
-6.2962,-9.0778,27.3237,31.9345,-9.0778,7.3568,29.2029,17.2949,642
-30.6463,-8.0764,27.7046,59.1102,-8.0764,7.1631,67.0884,37.8639,643
0.7299,-9.7414,10.2016,8.0436,-9.7414,6.5691,27.0872,19.4185,644
-2.6367,-9.9544,0.4372,1.7852,-9.9544,3.4965,9.2355,5.5836,645
0.1504,-9.7543,7.3744,6.5703,-9.7543,2.2111,19.3143,17.9445,646
-67.9539,-9.8599,1.5176,21.1996,-9.8599,24.124,59.8028,28.6477,648
-8.0059,-8.5858,6.5654,10.8712,-8.5858,7.1761,21.6723,18.4905,649
-2.8141,-9.0256,0.1656,2.6176,-9.0256,1.7575,10.9031,7.8935,650
-0.3423,-10.1541,0.3286,0.5082,-10.1541,2.0806,8.824,5.4806,651
-13.4862,-10.1306,8.2742,14.5655,-10.1306,5.4402,23.2814,17.2896,652
-26.8341,-8.6392,-7.116,10.2633,-8.6392,6.4857,14.8865,10.8304,653
-6.1278,-9.2019,2.8574,4.7266,-9.2019,12.2043,24.6621,11.9746,654
-27.4788,-10.082,1.5685,8.0708,-10.082,7.3829,55.0041,28.1082,655
-18.9792,-11.544,0.1354,12.9132,-11.544,12.3574,53.5172,44.4115,656
-7.3212,-10.0138,8.8828,14.6897,-10.0138,11.2335,36.4086,20.3805,658
-20.2512,-9.7717,-0.0319,8.376,-9.7717,11.1628,42.516,19.4138,659
-22.7726,-9.8056,4.4933,23.5941,-9.8056,9.2751,34.6636,13.8783,660
-10.1529,-9.9736,12.6999,17.1011,-9.9736,3.6476,21.8801,16.0431,661
-5.3394,-10.0119,8.4673,11.5976,-10.0119,7.3337,22.3368,18.6041,662
-15.9932,-9.8547,-0.2562,7.4968,-9.8547,7.5402,19.7475,14.4318,663
-19.8666,-9.956,-9.8406,5.6065,-9.956,0.9033,16.5493,13.9112,664
-8.2539,-9.8877,-0.3192,2.5599,-9.8877,4.7204,16.3697,4.444,666
-1.4326,-9.8924,0.8241,1.8435,-9.8924,1.3663,7.6372,5.1035,667
-0.514,-9.8897,-0.1988,0.1865,-9.8897,0.516,2.9439,2.5614,668
-5.1212,-9.857,-1.3414,2.1066,-9.857,2.2769,5.433,2.6991,669
-3.5936,-9.887,-0.1729,2.4829,-9.887,3.5914,7.5409,4.2082,670
-0.5261,-9.9347,0.1477,0.6492,-9.9347,1.5409,5.0925,3.275,671
-36.461,-9.8988,1.2758,13.0415,-9.8988,7.5385,30.1106,19.153,673
-4.9297,-9.9305,8.604,14.0165,-9.9305,9.324,46.4801,15.5006,674
-0.1136,-9.7786,8.9525,11.3479,-9.7786,7.0243,39.4389,8.9285,675
-1.4465,-9.637,-0.0262,1.0643,-9.637,1.9531,23.0621,18.7858,676
-3.1053,-9.9294,4.3667,11.7802,-9.9294,6.3892,19.4077,10.4935,677
-21.9763,-9.8538,2.0465,11.2131,-9.8538,4.8727,28.7767,13.9655,678
-19.8914,-10.1022,5.5923,13.6862,-10.1022,7.1124,20.461,14.8324,679
-5.837,-9.7988,8.0804,14.5625,-9.7988,5.0965,26.0204,17.5356,680
-1.3879,-9.8451,1.1243,2.0717,-9.8451,1.5055,6.871,4.0809,681
-31.6899,-9.8949,1.5404,9.5543,-9.8949,7.1848,31.5478,12.6353,683
-3.9088,-9.898,-0.1988,4.0976,-9.898,3.8064,12.428,9.2152,684
-6.9561,-9.8686,-2.8585,3.3895,-9.8686,3.5651,11.5591,7.4427,685
-7.0029,-9.5794,-2.7197,3.5947,-9.5794,2.2786,11.848,9.4091,686
-6.7087,-9.6079,9.5516,10.9095,-9.6079,1.7906,38.4708,25.7509,687
-13.2981,-10.262,7.4606,18.8731,-10.262,6.6921,25.1431,15.8178,688
-7.3154,-10.0304,4.1509,8.6028,-10.0304,5.1251,19.2904,14.0729,689
-51.9081,-9.8848,13.1391,26.7448,-9.8848,10.7682,37.0275,23.1971,690
-3.0458,-10.0183,0.297,3.4815,-10.0183,3.5698,19.8088,11.2431,691
-29.8398,-9.9198,4.9958,12.1086,-9.9198,9.2124,26.864,15.443,693
-17.7082,-9.7543,2.4916,10.3986,-9.7543,4.7844,18.4895,14.5277,694
-0.2276,-10.0274,2.5895,3.2912,-10.0274,4.3943,17.1328,11.6606,695
-2.9765,-10.301,1.8037,4.5179,-10.301,4.5877,12.8637,11.2955,696
-37.3058,-9.8964,4.8818,32.0822,-9.8964,3.6221,28.0989,25.4757,697
-14.8213,-10.0868,-0.6294,6.3776,-10.0868,4.4202,16.2228,10.4653,698
-27.8483,-9.9433,5.2913,21.6756,-9.9433,9.2791,30.226,26.2311,699
-86.3673,-10.0365,2.5211,31.4637,-10.0365,9.5048,61.0957,18.9969,700
-3.8219,-9.971,16.5519,11.3225,-9.971,2.5765,22.5701,19.6724,701
-13.1889,-9.8835,4.0717,6.8783,-9.8835,6.4543,20.7446,10.8076,703
-0.8086,-9.8419,-0.06,0.4191,-9.8419,1.9097,11.5533,9.0242,704
-2.029,-9.9035,1.7399,3.7417,-9.9035,2.1379,10.5346,7.629,705
-17.854,-9.7139,-5.2617,7.2325,-9.7139,3.0171,17.8737,10.687,706
-7.7749,-10.9564,1.3356,5.1939,-10.9564,1.8318,39.5422,31.9603,707
-5.094,-9.6947,3.2323,7.9129,-9.6947,8.9458,27.4254,23.6244,708
-9.4078,-9.4023,-1.181,5.1438,-9.4023,3.5266,22.7007,11.2722,709
-72.2806,-9.2296,10.2147,45.992,-9.2296,14.8839,55.2275,31.1321,710
-12.2004,-9.0963,26.9483,29.5268,-9.0963,5.947,61.1238,34.4017,711
-31.6736,-9.9869,31.7586,52.9457,-9.9869,28.2357,97.5684,46.4559,713
-10.3361,-9.8144,14.704,18.7265,-9.8144,1.232,23.6639,21.727,714
-106.5473,-10.0292,0.4522,48.2364,-10.0292,6.7568,60.7709,55.3194,715
-65.2234,-9.9102,2.496,38.0835,-9.9102,7.8379,52.0581,46.8809,716
-3.6285,-10.2302,3.3939,4.5257,-10.2302,1.4776,22.526,17.9565,717
-5.7936,-9.9424,6.0171,9.3681,-9.9424,7.5276,46.5549,11.9112,719
-42.4167,-9.9324,7.7612,31.9941,-9.9324,7.7533,31.7169,26.379,720
-0.7278,-10.7133,1.6231,2.2902,-10.7133,5.173,44.033,37.2686,721
-2.4999,-9.9151,11.6093,16.9564,-9.9151,14.1615,55.8542,24.1238,723
-34.2565,-9.8015,-10.4095,11.5455,-9.8015,3.2944,14.8359,10.8133,724
-25.123,-9.6785,-1.1315,17.812,-9.6785,7.3984,9.39,7.7853,725
-0.3819,-9.8893,0.2867,0.5799,-9.8893,2.8534,5.4516,3.1611,726
-8.0862,-9.8538,-3.0435,4.1166,-9.8538,2.7214,11.864,9.8685,728
-50.3452,-9.7105,4.0173,30.2343,-9.7105,16.1018,24.852,17.8974,729
-2.9827,-9.7687,2.9402,2.988,-9.7687,2.3051,19.3436,18.1144,730
-1.377,-10.0332,-0.2365,0.6852,-10.0332,0.6748,19.3092,17.8303,731
-3.5565,-9.8059,2.7013,3.646,-9.8059,2.0154,25.6973,19.298,732
-21.1361,-9.5886,-10.3539,7.4918,-9.5886,3.5904,44.4887,42.651,734
-19.2149,-9.746,-7.026,7.8195,-9.746,4.4349,42.4845,41.0657,735
-111.9959,-9.538,-39.8131,41.7486,-9.538,13.8849,57.8168,39.0606,736
-19.3777,-9.2074,-7.1587,10.0044,-9.2074,2.8838,18.0601,16.364,737
18.1179,-9.4221,22.2247,3.6584,-9.4221,0.8501,9.2081,8.4189,738
-155.292,-9.7232,-10.3182,65.7546,-9.7232,29.2703,85.3877,42.6837,739
-72.9978,-9.1811,9.3069,30.6632,-9.1811,17.6277,66.81,10.8308,740
-10.807,-9.8735,-3.8146,3.1811,-9.8735,2.2701,7.6616,4.206,741
-0.6064,-9.8739,-0.3541,0.2248,-9.8739,0.4268,2.5797,1.8725,742
-0.2024,-9.8966,0.0904,0.2937,-9.8966,0.6641,3.5556,3.04,744
-40.0508,-9.9605,-7.4779,15.0278,-9.9605,5.7586,35.0898,22.742,745
-16.0866,-9.5368,0.6154,13.4335,-9.5368,3.1219,13.3981,11.2364,746
-5.6489,-9.8737,2.0323,3.4234,-9.8737,3.0645,10.8116,8.8788,747
-12.8347,-9.8858,2.2806,8.3012,-9.8858,5.2993,12.4736,5.3519,748
-5.841,-9.9824,-1.274,2.4511,-9.9824,3.7017,17.4518,6.1361,749
-1.0122,-9.8902,-0.1354,0.2922,-9.8902,1.0543,3.4599,2.6725,750
