AYGX_min,AZ_mean,AYGX_mean,AYGX_std,AZ_mean,GX_std,Gnorm_max,Gnorm_median,timestamp
-1.3749,-9.6804,3.6961,4.3835,-9.6804,2.8472,6.734,5.9308,342
-8.209,-9.7268,1.502,4.9574,-9.7268,3.823,12.2255,7.4137,343
-1.8642,-9.7525,2.503,3.7163,-9.7525,5.3034,8.5021,6.6196,344
0.1674,-9.7201,13.4425,5.9293,-9.7201,2.5976,17.8529,16.0161,345
-10.8799,-9.8258,-5.045,2.795,-9.8258,3.3961,17.7711,9.0396,347
-34.3766,-9.711,3.5178,12.909,-9.711,8.6216,19.0975,9.0355,348
5.7382,-9.7489,11.6633,2.957,-9.7489,2.5998,18.6638,15.9474,349
-29.7325,-9.7292,-3.508,10.4687,-9.7292,8.3733,19.168,8.255,350
-5.9749,-9.7145,-2.2162,3.2221,-9.7145,6.5928,13.5534,8.923,352
-19.1024,-9.7655,0.7333,8.9607,-9.7655,9.46,23.4216,13.301,353
-8.8746,-9.6131,-5.9001,2.3813,-9.6131,2.3745,13.9965,11.0369,354
-30.9551,-9.6884,-8.1588,16.2024,-9.6884,9.305,17.9397,15.2965,355
-27.3692,-9.6129,-17.1189,11.1827,-9.6129,2.6148,14.9399,12.6862,357
-5.7827,-9.5943,6.8988,7.1613,-9.5943,4.5086,15.9341,8.2016,358
-5.314,-9.7891,-3.163,1.4697,-9.7891,1.3138,9.8222,5.6984,359
-19.5147,-9.6737,-5.5388,10.0044,-9.6737,9.753,18.4591,12.9237,360
-0.5748,-9.666,12.9633,7.2063,-9.666,4.4742,17.5374,15.1767,362
-2.7399,-9.7496,1.7402,3.3854,-9.7496,3.5948,9.9601,5.0652,363
-4.0251,-9.7202,-0.8347,1.9407,-9.7202,3.9974,8.2894,5.3314,364
-9.6851,-9.7358,1.9746,9.4342,-9.7358,7.6331,18.0676,4.5044,365
-10.6966,-9.7166,-3.7008,6.2814,-9.7166,5.5773,20.8861,10.3297,367
-3.5885,-9.7311,-0.6543,1.1469,-9.7311,2.8868,8.9184,3.1592,368
-6.7992,-9.7443,0.2721,6.1738,-9.7443,3.548,8.9189,6.358,369
-5.5385,-9.7395,-2.268,3.8118,-9.7395,2.9324,6.4223,4.9774,370
-6.6242,-9.7791,-3.3994,2.8844,-9.7791,1.5343,8.1875,7.2558,372
-11.6071,-9.7157,-0.3095,8.1457,-9.7157,6.7365,15.2206,8.8187,373
-2.4072,-9.6558,1.4588,2.7579,-9.6558,1.7958,4.1376,3.2194,374
-24.4079,-9.6818,-5.1211,8.0223,-9.6818,5.5732,15.7516,6.1556,375
-1.8649,-9.6988,-0.8496,0.8664,-9.6988,1.0543,12.2101,11.8417,377
-40.8392,-9.6946,-3.8956,11.3114,-9.6946,7.7231,22.3478,7.7233,378
-41.1373,-9.4662,-18.2351,12.8441,-9.4662,4.5093,15.1478,10.3277,379
-0.8609,-9.3945,12.3034,10.6379,-9.3945,3.917,14.1986,7.4737,380
1.076,-9.5023,9.4543,7.4998,-9.5023,3.1986,9.7075,7.1941,382
-5.5904,-9.5876,1.7052,4.3483,-9.5876,2.3174,8.0072,3.8706,384
-9.9124,-9.6872,3.7732,9.6133,-9.6872,5.9166,14.7285,6.1483,385
-0.1877,-9.7169,2.7864,2.0707,-9.7169,2.7118,12.5755,5.4766,387
-8.1947,-9.7389,-1.8032,2.7545,-9.7389,3.402,9.3827,7.2073,388
-6.9912,-9.7387,6.5898,6.9791,-9.7387,5.0934,12.8388,11.1145,389
-6.8936,-9.6634,1.4698,10.9678,-9.6634,6.4192,17.216,8.9998,390
-9.8345,-9.7433,-3.5631,4.4225,-9.7433,3.4321,12.384,9.453,392
-0.4341,-9.7424,1.5377,1.3548,-9.7424,1.6465,5.0694,3.4514,393
-30.0801,-9.6796,-13.793,9.5372,-9.6796,4.4645,17.7338,12.297,394
-13.3616,-9.6395,-0.2387,5.599,-9.6395,3.1413,10.7735,5.379,395
-4.9819,-9.6686,3.4737,6.7265,-9.6686,5.2868,10.2414,3.9852,397
-7.598,-9.6918,-0.7746,3.1299,-9.6918,2.9533,12.695,7.8216,398
-4.5225,-9.7395,2.968,3.476,-9.7395,5.6587,14.8673,9.4311,399
4.2938,-9.6559,9.4291,3.3917,-9.6559,1.785,11.9824,9.9962,400
-5.8909,-9.6868,-3.5871,1.8435,-9.6868,1.2753,6.6254,4.5555,402
-15.6189,-9.6525,-1.6463,8.4179,-9.6525,5.7092,12.8411,5.709,403
-2.9345,-9.7079,1.7183,5.3975,-9.7079,3.6758,15.1598,11.7226,404
-4.4062,-9.6893,0.2751,2.255,-9.6893,2.0234,7.1925,4.298,405
-25.8276,-9.6223,-7.4726,9.328,-9.6223,4.4617,12.2096,8.4709,407
0.5257,-9.6527,4.4145,3.9021,-9.6527,2.4323,10.3514,3.8975,408
-3.8952,-9.7026,0.4717,1.6586,-9.7026,2.4778,6.3056,2.5344,409
-2.3245,-9.7119,0.3591,1.6188,-9.7119,2.5485,4.8519,3.0376,410
-0.4646,-9.7177,-0.1775,0.2128,-9.7177,0.3614,2.11,2.0697,412
-0.6325,-9.7204,0.2356,0.418,-9.7204,0.8301,2.6167,2.0682,413
-1.0141,-9.7177,-0.5434,0.4942,-9.7177,0.7452,2.6312,2.4867,414
-4.1283,-9.7211,-0.8055,1.497,-9.7211,2.07,4.869,2.0432,415
-48.9272,-9.4956,-5.8823,18.1602,-9.4956,6.8495,18.5818,3.8859,417
-27.2425,-9.6411,6.3925,18.3414,-9.6411,7.5207,46.593,17.9283,418
-17.5239,-9.7352,-4.4558,6.5915,-9.7352,4.858,38.6075,35.9118,419
-15.0732,-9.6882,1.4154,12.1485,-9.6882,6.4103,30.8797,26.8324,420
-12.8028,-10.1119,1.9,7.2223,-10.1119,7.0455,58.6811,44.7371,422
-28.0729,-9.7554,-0.0081,14.6432,-9.7554,5.3274,76.301,68.0079,423
-4.4597,-9.7171,2.6414,4.6733,-9.7171,5.6592,18.8017,8.8926,424
-13.2947,-9.7759,-7.6058,4.038,-9.7759,0.9029,25.8521,23.5398,425
-15.2494,-9.983,-0.0645,8.1618,-9.983,7.266,60.0075,19.0196,426
-102.7732,-9.7622,-4.914,34.8375,-9.7622,9.6801,50.6313,39.5147,427
-37.0452,-9.5748,16.4371,36.6802,-9.5748,7.9057,33.3103,21.4988,428
-24.2418,-9.7532,-3.1407,5.9114,-9.7532,5.2713,16.1109,10.5699,429
-9.339,-9.7211,-3.3058,2.7261,-9.7211,2.6032,17.9975,13.5209,430
-4.2507,-9.699,-0.1918,2.3714,-9.699,2.0079,17.3002,13.5908,431
-20.0326,-9.7239,-9.7517,7.9296,-9.7239,4.7895,26.6003,21.6548,432
-31.2545,-9.6283,-6.8449,9.3889,-9.6283,3.7326,25.0771,19.5535,433
-1.5161,-9.4732,7.1426,8.9114,-9.4732,4.2593,14.1653,7.9315,434
-9.8252,-9.5909,-4.3975,5.0454,-9.5909,1.9477,7.7273,6.5328,435
-21.5576,-9.5799,-10.4621,7.8834,-9.5799,5.1054,17.1877,12.3844,436
-1.2549,-9.6019,7.8502,5.3353,-9.6019,3.8021,10.4815,8.4386,437
-4.667,-9.6025,4.9117,4.723,-9.6025,3.6198,9.4364,6.5178,438
-13.8103,-9.6492,-5.2439,4.459,-9.6492,3.171,9.9691,5.596,439
-1.909,-9.6612,5.7988,8.2667,-9.6612,4.8788,11.8498,4.0256,440
-3.4725,-9.6402,1.3482,3.2924,-9.6402,2.9935,5.7835,4.0487,441
-2.1999,-9.6457,-0.9651,1.6088,-9.6457,1.4089,3.0025,2.6888,442
-25.5549,-9.6176,-1.5966,7.3622,-9.6176,5.0109,13.1569,3.5874,443
-6.2156,-9.6175,1.2304,3.8084,-9.6175,3.5829,7.9667,4.4413,444
-3.0358,-9.6356,-0.4687,1.5633,-9.6356,1.3323,4.6125,3.6387,445
-6.5915,-10.1073,-0.7902,3.1307,-10.1073,6.1208,13.0436,10.7686,447
-5.5027,-9.6047,3.9543,6.3518,-9.6047,3.3181,10.9597,5.9078,448
-2.4715,-9.5889,4.4497,5.264,-9.5889,3.7739,16.666,14.0542,449
-5.0228,-9.6271,-1.9666,2.9528,-9.6271,2.3685,12.8042,11.2835,450
-6.6764,-9.6204,-5.0904,1.1782,-9.6204,0.6487,9.6001,8.8169,451
-12.8236,-9.676,-1.1401,9.9466,-9.676,5.6049,11.3587,6.4663,452
-14.6688,-9.7409,-2.7174,5.7161,-9.7409,4.6008,14.346,7.5608,453
-20.3244,-9.9287,-3.9317,8.371,-9.9287,5.3621,25.6122,19.1993,454
5.0466,-9.7218,15.2834,4.8728,-9.7218,3.9533,19.7158,17.9156,455
-27.2813,-9.4961,-14.1576,7.1739,-9.4961,3.9627,16.7207,13.6234,456
-54.6173,-9.3864,-14.2305,25.7621,-9.3864,7.9461,15.5716,9.8026,457
-5.0936,-9.7785,0.0323,2.6035,-9.7785,2.5238,9.9418,7.6348,459
-13.3442,-9.6143,3.1435,11.3583,-9.6143,6.157,13.9706,6.8737,460
0.9224,-9.6295,7.0736,4.7307,-9.6295,2.596,9.2165,7.6441,461
-17.5945,-9.7005,-4.1009,5.3849,-9.7005,2.9451,18.3445,8.0824,463
-7.5106,-9.5408,9.5301,17.5836,-9.5408,3.052,25.3536,23.7616,464
-3.4184,-9.6993,3.3844,4.3258,-9.6993,3.0413,11.5327,9.8299,465
-3.7462,-9.921,11.1102,11.0986,-9.921,5.7346,13.66,7.4083,466
-11.689,-9.6394,1.0958,7.0414,-9.6394,4.7528,12.2413,5.2269,468
-6.5298,-9.6497,2.3619,5.7192,-9.6497,4.9046,13.3344,6.7026,469
-6.8579,-9.6729,0.5504,2.9788,-9.6729,3.831,19.7938,13.0668,470
0.2527,-9.6036,1.4077,0.8428,-9.6036,1.9608,8.4707,4.565,471
-36.7144,-9.7211,-0.4776,9.3302,-9.7211,6.5727,18.4074,8.2705,473
-7.6818,-9.7254,-4.3674,2.163,-9.7254,1.6451,9.0744,6.1637,474
-8.7083,-9.9277,-2.9223,2.7688,-9.9277,2.8574,9.6567,5.122,475
-1.6132,-9.653,1.5184,2.4524,-9.653,2.9524,12.131,5.5494,476
-7.3561,-9.718,0.8375,6.7863,-9.718,4.3073,12.7249,6.3767,478
-2.6668,-9.6039,4.7774,5.7647,-9.6039,4.3753,11.0832,7.2845,479
-8.5025,-9.6141,-6.5716,1.9567,-9.6141,2.2507,14.5532,11.6652,480
-16.3548,-9.7259,-8.5747,4.7831,-9.7259,3.3376,12.281,6.6392,481
-17.2074,-9.6465,-2.4256,6.0144,-9.6465,4.4701,11.0996,5.0854,483
3.3011,-9.6339,6.1066,2.2886,-9.6339,2.0338,7.9056,3.9359,484
-5.0644,-9.5361,-3.4321,1.5509,-9.5361,1.0096,4.2616,3.4285,485
-14.1495,-9.8706,-4.0735,4.789,-9.8706,4.9214,14.0439,10.5414,487
-11.5418,-9.7435,-1.993,4.7735,-9.7435,4.0525,16.5791,6.4504,488
-6.7911,-9.6923,4.6824,5.3808,-9.6923,1.8324,18.2089,16.3829,489
-0.1985,-9.8996,2.0877,2.6993,-9.8996,4.258,19.8524,18.0275,490
-4.008,-9.7937,1.1371,3.9906,-9.7937,3.475,16.5432,13.1495,492
-28.5889,-9.6624,-3.419,11.2293,-9.6624,5.8443,13.9502,6.9891,493
-8.0415,-9.5665,11.7695,11.3671,-9.5665,5.6456,13.8923,9.0853,494
-21.4037,-9.6389,-7.8537,8.1794,-9.6389,3.8845,14.9735,10.3519,495
-0.3621,-9.6688,19.137,12.5749,-9.6688,6.2747,17.2835,12.1631,497
-44.5841,-9.5356,5.2196,20.589,-9.5356,7.02,16.1877,8.887,498
-28.5845,-9.5243,-9.0263,13.4753,-9.5243,5.6613,12.0212,9.4402,499
-3.5045,-9.7298,2.0763,3.0169,-9.7298,1.7847,9.4327,4.1423,500
3.0532,-9.8218,15.4531,6.2876,-9.8218,0.8518,13.9916,12.9592,502
-3.3966,-9.4823,-1.6668,1.1448,-9.4823,1.3225,10.1036,6.9602,503
-5.0445,-9.7267,1.5588,3.2705,-9.7267,2.9985,9.7565,4.3307,504
-8.9532,-9.8022,-0.7751,3.7777,-9.8022,7.0614,12.8166,9.5684,505
-0.618,-9.6296,4.6892,6.0444,-9.6296,3.8043,11.2416,6.6334,507
-13.3551,-9.7923,-0.986,4.3619,-9.7923,3.2405,8.1918,4.3828,508
-3.6195,-9.443,3.8809,5.3178,-9.443,3.4993,8.3271,5.9957,509
-29.0782,-9.7316,-4.0094,9.6399,-9.7316,6.7581,14.6238,9.1292,510
-8.0015,-9.8476,-0.6616,2.7988,-9.8476,3.426,17.0424,10.7784,512
-15.7713,-9.3511,1.0407,7.0718,-9.3511,3.7301,27.4398,6.9222,513
-8.9191,-9.5588,-4.792,3.7745,-9.5588,2.1695,7.5079,5.197,514
-12.0594,-9.7038,-4.5745,5.8761,-9.7038,5.1178,14.5659,10.0779,515
-1.3684,-9.8234,2.0451,3.054,-9.8234,2.0369,10.7455,9.5129,517
-3.5791,-9.7329,4.0883,5.0384,-9.7329,3.9489,11.9046,6.6202,518
-3.7866,-9.8079,-0.5065,1.2852,-9.8079,2.1819,8.5221,6.0499,519
-3.3113,-9.7694,1.7835,2.0547,-9.7694,2.1223,10.4495,9.264,520
0.0208,-9.7096,0.7672,0.5219,-9.7096,0.4369,4.5247,3.289,522
-2.4833,-9.7846,0.5114,1.8097,-9.7846,1.7751,6.6651,5.8003,523
-1.7752,-9.8531,0.2871,1.0917,-9.8531,0.347,15.3416,7.2846,524
-4.5127,-9.4948,6.3636,7.0168,-9.4948,4.4949,16.6615,11.0296,525
-1.1028,-9.5829,3.0129,2.7059,-9.5829,3.2903,9.8654,8.149,527
-18.6571,-9.6938,3.9334,11.5128,-9.6938,6.8396,21.2135,12.0378,528
-13.8821,-9.8972,-3.9316,7.3282,-9.8972,6.3526,16.5835,14.5537,529
-7.9196,-9.7052,-3.4607,3.0263,-9.7052,2.7829,10.97,7.4508,530
-1.0812,-9.8058,3.0338,3.2536,-9.8058,3.0601,7.194,3.9185,532
-11.1725,-9.7199,1.5364,7.3631,-9.7199,5.6045,11.2982,7.4608,533
-2.414,-9.9623,0.3362,1.9728,-9.9623,2.2873,12.3919,8.7789,534
-27.9741,-9.7884,2.0774,18.2247,-9.7884,9.2412,23.2676,5.2273,535
-24.1901,-9.7632,-1.8422,11.1361,-9.7632,8.7977,14.1286,9.0465,537
-56.6228,-9.7256,3.5243,24.091,-9.7256,13.6326,29.9929,20.1461,538
-15.0846,-9.9544,-3.5803,6.0162,-9.9544,2.7446,36.4117,33.9374,539
-2.594,-9.9663,1.7671,2.5532,-9.9663,3.9758,13.0069,9.1309,540
-3.5208,-9.7626,0.0786,1.4212,-9.7626,2.5279,22.7534,16.9741,542
-16.1355,-9.611,1.7625,10.624,-9.611,10.3338,47.362,22.7011,543
-4.0926,-9.953,0.2191,2.0574,-9.953,2.8202,14.4541,11.9244,544
-9.1008,-10.2774,1.6611,5.9984,-10.2774,2.3503,35.3127,18.5291,545
-10.6814,-9.7534,-1.6254,4.1291,-9.7534,3.9864,17.134,8.9612,547
-14.1416,-9.7488,1.0227,6.6491,-9.7488,7.1306,29.4134,14.4327,548
0.8597,-9.8301,6.6194,3.3412,-9.8301,1.7791,28.7082,18.8033,549
-3.5487,-10.0578,3.6003,4.0805,-10.0578,4.7425,30.6509,17.684,550
-5.46,-9.7334,5.1324,8.4501,-9.7334,5.6203,25.7273,16.9396,552
-3.397,-9.8251,0.8434,1.4639,-9.8251,4.4146,18.6949,11.052,553
-5.3351,-9.4865,1.4145,3.0603,-9.4865,0.6647,8.9636,6.8383,554
-1.1596,-9.8104,1.4625,1.7678,-9.8104,3.4075,11.0366,8.106,555
-1.0316,-9.9024,0.2173,0.7048,-9.9024,1.1955,6.7209,5.8938,557
-1.9186,-9.8376,0.0744,0.973,-9.8376,3.9977,13.9187,7.6356,558
-0.7232,-9.9769,0.1365,0.6587,-9.9769,0.541,10.7462,4.5668,559
-5.0672,-9.4659,-0.7013,1.5817,-9.4659,2.146,32.1933,9.4719,560
-1.7322,-9.8487,0.437,1.8285,-9.8487,1.0232,19.3606,9.4379,562
-6.1023,-9.2391,-0.5147,3.4233,-9.2391,2.932,21.9144,12.6711,563
-3.5791,-9.7791,-0.3,1.4322,-9.7791,2.3168,15.3142,5.2426,564
-2.9262,-9.484,0.2145,2.287,-9.484,3.0791,12.5732,6.6974,565
-17.0573,-9.5964,-3.8278,6.7615,-9.5964,6.409,16.9521,10.5944,567
-34.9736,-10.4139,2.0495,12.1098,-10.4139,11.5005,33.8035,25.1242,568
-11.6463,-9.8657,1.1312,5.0933,-9.8657,7.9375,20.282,10.6301,569
-5.7854,-9.7737,1.8452,7.4038,-9.7737,9.6553,26.2408,15.8963,570
-8.1134,-9.8158,4.3828,6.7057,-9.8158,6.9574,28.4697,15.9334,572
-1.6926,-9.7678,0.6136,1.6502,-9.7678,3.7754,17.5309,5.6025,573
-0.6566,-9.8448,0.2999,0.9545,-9.8448,1.2696,5.847,2.9131,574
-17.0311,-9.7361,0.786,8.9085,-9.7361,7.7138,18.4457,12.7696,575
-1.0314,-9.9405,11.4416,16.8046,-9.9405,7.7497,21.5612,19.831,577
-7.2268,-9.8007,8.246,9.0822,-9.8007,4.9414,23.8535,15.6832,578
-8.5414,-9.8049,4.1551,12.0489,-9.8049,5.1072,22.8237,21.3007,579
-8.0833,-9.8048,2.0824,6.3774,-9.8048,8.5396,29.5664,13.6486,580
-4.0203,-10.0457,0.6759,4.6241,-10.0457,8.6707,27.0279,13.6029,582
-6.4141,-9.8107,2.5492,5.12,-9.8107,8.2052,20.3394,11.5453,583
-5.4036,-9.9352,-0.6284,3.3688,-9.9352,4.1101,13.9872,11.7274,584
-20.8919,-9.8943,-2.1909,11.866,-9.8943,10.2322,21.397,12.7286,585
-4.908,-9.8803,-0.2979,2.1722,-9.8803,2.2816,9.2764,7.8636,587
-10.0167,-9.9362,0.9059,6.0876,-9.9362,3.7804,18.4016,15.2972,588
-3.6008,-9.6458,2.8676,7.761,-9.6458,7.2554,32.8666,19.4254,589
-28.8906,-9.8293,3.5737,13.9984,-9.8293,6.2072,21.5677,17.3766,590
-19.2101,-9.6923,7.6613,15.4207,-9.6923,7.1914,26.344,18.5117,592
-5.9394,-9.8393,0.7143,4.2196,-9.8393,6.2878,17.1968,8.6073,593
-4.7764,-9.7077,7.9888,10.4664,-9.7077,2.7237,16.365,15.0437,594
-10.1143,-9.8898,1.3758,5.0962,-9.8898,6.881,17.5782,13.7593,595
-22.5541,-9.7755,-1.6804,7.1586,-9.7755,5.5703,18.9782,7.1421,597
-12.1122,-9.9174,2.2584,6.3937,-9.9174,8.4434,24.2827,9.8609,598
-0.3259,-9.949,5.3652,4.8831,-9.949,11.3264,33.6635,25.6268,599
-7.5213,-9.7948,-0.9322,6.9462,-9.7948,6.8054,15.5138,11.4905,600
-11.5382,-9.9388,-2.3964,4.8666,-9.9388,11.5282,26.7185,19.2967,602
-25.874,-9.8646,9.6934,21.6596,-9.8646,13.8115,44.3585,18.3719,603
-11.3065,-10.0693,-2.4526,9.5028,-10.0693,3.4752,18.8891,13.571,604
-1.4252,-9.838,4.3562,5.5614,-9.838,6.4117,15.8126,10.4735,605
-59.1176,-9.9829,35.3646,86.3896,-9.9829,28.4005,69.7861,38.901,607
-10.7774,-9.8543,4.7214,9.1691,-9.8543,11.5778,24.1423,16.6657,608
-32.7734,-9.6607,-6.832,18.8984,-9.6607,8.944,23.3224,15.8508,609
-2.1588,-9.9522,8.6578,10.5715,-9.9522,12.9824,32.7859,21.1111,610
-5.6278,-10.0977,-0.9726,2.2742,-10.0977,3.1164,12.8536,9.4388,612
-22.8011,-9.8813,10.71,21.798,-9.8813,12.2677,34.7349,15.7827,613
-3.6619,-9.711,-0.6889,1.6134,-9.711,1.9575,18.2374,13.3956,614
-9.215,-9.8353,-1.8449,3.0186,-9.8353,6.6776,16.4216,8.2352,615
-4.7923,-9.8248,6.5387,11.5792,-9.8248,3.6562,20.8333,18.5632,617
-9.2907,-9.848,0.8342,5.3338,-9.848,6.4719,24.477,8.8186,618
-8.0894,-9.7402,-2.0859,2.7504,-9.7402,3.6632,14.8231,7.3457,619
-0.3837,-9.804,7.0336,6.1854,-9.804,10.837,21.1622,18.358,620
-18.5289,-10.002,-6.1977,6.5008,-10.002,8.116,24.4154,17.3219,622
-9.887,-8.9813,5.1656,10.7619,-8.9813,10.2002,30.3202,18.6265,623
-9.274,-9.7856,-0.7236,2.9397,-9.7856,2.8672,16.1024,8.1332,624
-12.4696,-9.8848,2.9111,8.4394,-9.8848,6.6586,24.8596,14.2274,625
-3.9675,-9.4257,1.0005,2.4186,-9.4257,2.6537,21.2462,12.7255,627
-5.378,-9.8344,4.29,4.9662,-9.8344,7.4333,22.4172,12.2671,628
-2.7475,-10.0355,-0.0077,2.0204,-10.0355,4.8428,16.4726,14.7964,629
-8.3992,-9.8891,-1.7705,4.0955,-9.8891,10.2118,27.9017,20.9345,630
-7.1591,-9.6991,5.3448,12.1657,-9.6991,7.0039,21.5129,11.0311,632
-9.3764,-9.8705,23.677,33.5549,-9.8705,23.7795,66.1342,25.347,633
-11.5137,-10.0818,17.8244,35.429,-10.0818,15.3834,45.2304,42.3312,634
-4.034,-9.7969,17.4074,20.9254,-9.7969,13.2485,43.3591,28.4686,635
-13.0205,-9.71,3.4946,12.5143,-9.71,2.6327,13.5471,12.549,637
-9.6106,-9.7253,6.9818,10.6363,-9.7253,4.2908,36.6186,25.7638,638
-1.5572,-9.9671,14.2834,16.4585,-9.9671,14.2471,44.38,22.5587,639
-5.7973,-9.6678,21.0461,14.9118,-9.6678,6.1739,43.5648,38.9869,640
-2.8094,-9.8941,5.1777,5.8332,-9.8941,3.2547,21.4007,9.0755,641
-11.1212,-9.8582,-0.1106,5.3163,-9.8582,5.8571,12.1636,7.7006,642
-8.718,-9.6116,8.0457,8.2352,-9.6116,0.7859,19.6563,14.7839,644
-9.8552,-9.957,-1.3873,4.0674,-9.957,5.7468,17.4127,11.5706,645
-5.4474,-9.7084,2.0057,4.2603,-9.7084,6.8007,15.978,12.0932,646
-7.7343,-9.919,0.901,3.3885,-9.919,6.9255,15.8622,12.3289,647
-4.3625,-9.8941,0.8207,2.3353,-9.8941,5.6069,16.2998,12.5673,648
-3.491,-9.7573,1.7671,2.6918,-9.7573,5.6795,12.9326,9.8531,649
-2.7222,-9.8368,1.3474,4.5375,-9.8368,8.0304,17.4133,6.7811,650
-5.2651,-9.8523,2.7253,5.0256,-9.8523,1.9264,29.4851,17.3048,651
-11.2345,-9.8946,-2.1266,6.0869,-9.8946,5.2269,24.1196,17.9558,652
-2.9009,-9.817,0.9122,2.731,-9.817,3.2388,15.5419,10.31,653
-2.7808,-9.8957,-0.2644,1.2642,-9.8957,2.5729,18.4085,12.066,654
-2.0638,-9.6851,1.1941,3.3465,-9.6851,2.7293,13.6712,12.1802,655
-2.2588,-10.0569,0.5648,1.831,-10.0569,2.9393,27.0553,18.3528,656
-5.5472,-9.6222,1.9472,5.5407,-9.6222,4.0457,42.8719,35.931,657
-11.0151,-10.0729,2.0457,5.9235,-10.0729,10.8825,46.0077,36.301,658
-2.3149,-9.6602,8.2388,9.6202,-9.6602,7.6623,34.3397,16.7155,659
-3.0031,-9.6887,6.7867,4.6618,-9.6887,3.278,18.3369,14.0702,660
-2.0519,-9.477,3.1121,3.5639,-9.477,5.5349,24.8459,20.0042,661
-1.7116,-10.003,2.591,3.9669,-10.003,4.5623,18.126,14.3867,662
-22.7947,-9.9005,8.1142,17.2037,-9.9005,10.3322,33.2697,25.71,663
-4.485,-9.8905,1.0876,3.25,-9.8905,4.0405,32.801,24.4061,664
-12.6234,-9.7785,5.3693,11.9286,-9.7785,4.4363,29.8823,25.4328,665
-8.6864,-9.9575,-0.9384,3.7892,-9.9575,3.5408,13.657,10.8573,666
-28.3335,-9.8987,4.3354,12.025,-9.8987,10.4026,27.4193,13.3236,668
-7.4915,-9.7567,-1.4671,3.0371,-9.7567,1.3331,8.6916,3.5217,669
-5.0971,-10.1912,-2.2903,1.8971,-10.1912,7.0001,37.142,35.2243,670
-3.7823,-9.9969,1.0205,4.6518,-9.9969,4.5504,35.9464,29.3111,671
-6.0346,-9.9018,0.2526,3.9843,-9.9018,7.7698,18.498,10.368,673
2.6905,-9.9953,7.0884,2.7656,-9.9953,1.0824,20.4907,14.5213,674
-15.4176,-10.1044,12.01,20.9846,-10.1044,8.1629,28.8539,26.9104,675
-6.0848,-9.9817,0.8194,6.106,-9.9817,3.9275,20.9906,19.2451,676
-21.6181,-9.3443,0.5939,7.9342,-9.3443,7.04,45.7391,22.8095,677
-17.2776,-9.8712,-1.8152,5.0575,-9.8712,4.5451,30.8274,20.3691,678
-13.4219,-9.8286,2.4591,9.0945,-9.8286,6.0202,34.7265,13.976,679
-0.5489,-9.8731,19.149,14.1664,-9.8731,2.9465,21.5299,19.6024,680
-2.0774,-9.9936,0.6553,2.8739,-9.9936,3.6293,16.8039,10.0251,681
-7.6159,-9.8343,3.9414,8.5025,-9.8343,11.7736,28.8513,17.9681,683
-6.8405,-9.7442,0.5064,3.7145,-9.7442,5.0848,19.093,8.8475,684
-20.8755,-8.5298,1.2131,12.7036,-8.5298,9.623,25.5339,17.2996,685
-14.3286,-10.2973,-2.5494,6.0781,-10.2973,10.3893,27.4563,9.0673,687
-15.7104,-9.8584,12.0193,29.8967,-9.8584,17.0128,42.2567,12.7725,688
0.0099,-9.75,0.8148,0.6263,-9.75,4.5359,10.5586,4.7893,689
-2.5969,-9.8907,0.4179,1.6392,-9.8907,3.6979,9.993,8.2786,690
9.2192,-9.9801,18.3283,8.4219,-9.9801,2.6266,25.7473,21.5058,691
-11.0556,-9.9586,1.8519,5.9667,-9.9586,12.4605,34.3647,21.1965,693
-14.3679,-9.9865,2.6737,11.2513,-9.9865,6.4026,35.873,31.9995,694
-3.5606,-9.8481,1.0393,2.2558,-9.8481,1.817,11.5838,9.2355,695
-2.9299,-10.2684,0.7082,2.3805,-10.2684,2.8847,17.9205,12.5198,696
-4.7301,-9.6398,13.6319,14.7517,-9.6398,3.1746,16.7939,16.0671,698
-15.6992,-9.9054,-2.5804,7.8461,-9.9054,10.967,18.9599,16.4976,699
-0.0671,-10.3188,2.9759,2.3031,-10.3188,5.5607,11.9155,8.7031,700
-21.1464,-10.0555,-3.5996,9.299,-10.0555,9.106,28.0049,23.9471,701
-15.1781,-9.8992,-0.6347,6.2529,-9.8992,8.0455,21.9571,10.5293,703
-0.5684,-9.8267,0.6004,0.942,-9.8267,5.9191,10.4755,7.5454,704
-1.7144,-9.6164,0.2349,1.5965,-9.6164,6.6694,11.3582,10.3766,705
-2.5457,-9.6376,2.2927,5.5568,-9.6376,3.5643,15.1159,10.7289,707
-10.6639,-9.8632,-0.8775,3.2646,-9.8632,6.0849,15.5337,8.2278,708
-6.8072,-9.8721,-2.0803,2.5255,-9.8721,5.3994,17.0461,9.0346,709
-11.6321,-9.3316,2.4867,5.2277,-9.3316,7.7836,31.3944,20.1705,710
-19.3491,-10.0566,-5.1272,8.3373,-10.0566,5.7301,23.3839,8.3401,712
-16.6661,-9.8062,0.213,4.608,-9.8062,9.185,24.0765,10.9609,713
-3.4817,-10.0836,-0.3393,2.3294,-10.0836,1.5026,14.1524,11.5053,714
-14.4996,-9.8565,5.3164,9.1305,-9.8565,10.6548,27.6589,15.2745,715
-14.8661,-10.0595,-2.7529,5.9158,-10.0595,3.8234,15.4418,6.0337,717
-15.6656,-9.7988,1.3844,6.1463,-9.7988,9.5692,22.2182,13.078,718
-12.9558,-10.2525,0.16,7.0564,-10.2525,8.4508,18.3284,15.0336,719
-6.7755,-9.7722,7.8853,12.798,-9.7722,13.7576,26.576,16.9978,720
-0.5311,-10.0362,1.2939,2.6171,-10.0362,2.0512,24.4821,18.0575,722
-17.4338,-9.8691,0.2147,5.3908,-9.8691,5.1444,20.5876,13.1205,723
-6.7924,-9.8356,-0.7736,3.3156,-9.8356,3.5174,22.3849,19.5425,724
-3.9478,-9.9423,1.6861,3.5274,-9.9423,2.138,14.124,12.2891,725
-4.971,-9.6804,0.5024,2.9203,-9.6804,9.7898,22.3203,14.0687,727
-2.7241,-9.8972,0.2125,1.9084,-9.8972,4.8747,15.7911,12.7564,728
-1.1556,-10.4114,-0.367,0.4578,-10.4114,1.2768,19.3885,12.6367,729
-6.6079,-9.7367,12.9706,15.8009,-9.7367,6.4827,58.3002,26.1253,730
-16.3491,-9.828,-2.4498,5.8373,-9.828,8.3971,25.0931,12.1487,732
-5.952,-9.816,1.3256,3.4483,-9.816,4.6394,16.1901,10.0821,733
-6.0037,-9.7947,1.1702,3.2383,-9.7947,2.5428,21.1734,16.2287,734
-8.8037,-9.8043,4.7054,8.1274,-9.8043,6.7902,20.2997,17.4527,735
-0.7982,-9.7746,5.1281,4.8007,-9.7746,8.5994,27.4061,10.663,737
-8.1313,-9.8875,2.4741,8.0306,-9.8875,8.9051,28.2577,9.4227,738
-0.9585,-9.4442,2.4481,2.2614,-9.4442,0.9626,12.3424,9.896,739
-6.3269,-10.1074,8.8187,11.5045,-10.1074,10.7713,37.8346,26.5973,740
-25.4998,-9.7354,-2.5637,11.9431,-9.7354,6.821,18.9302,10.8093,742
-19.432,-9.9243,11.875,19.0188,-9.9243,17.213,50.4511,36.1454,743
-43.0795,-9.9728,4.5539,25.8445,-9.9728,18.0742,65.4772,38.1886,745
-4.0402,-10.0374,-0.2918,1.7584,-10.0374,2.3491,37.0732,31.3973,747
-19.5105,-9.6394,4.7352,9.7599,-9.6394,12.2141,36.7604,19.2502,748
-0.2876,-9.7286,0.2968,0.4362,-9.7286,1.2418,4.4296,3.0657,749
-3.417,-9.767,6.6768,5.3751,-9.767,2.4111,33.1538,17.513,750
-10.8681,-9.6544,-4.2532,6.0066,-9.6544,4.6957,26.0453,19.4743,752
-13.3148,-9.8583,11.4763,13.6075,-9.8583,11.3462,45.6591,20.6456,753
-1.0665,-9.8526,2.7145,2.9922,-9.8526,3.3998,13.8724,8.8717,754
-24.536,-9.4923,0.5267,9.7512,-9.4923,4.3259,20.0693,15.8325,755
-1.8608,-9.6969,6.437,6.936,-9.6969,3.7311,47.2819,40.7912,757
-8.9414,-9.983,0.9149,4.6114,-9.983,7.1648,26.6721,16.0202,758
-7.7302,-9.805,-3.0158,3.5464,-9.805,3.6183,11.7376,6.7281,759
-14.9001,-9.8676,2.3454,9.4774,-9.8676,13.5141,51.6398,27.7701,760
-16.8526,-9.8003,10.0473,19.3515,-9.8003,4.1426,33.1367,23.0259,762
-16.1775,-9.9595,6.545,18.2137,-9.9595,2.1779,35.2824,23.8334,763
-8.8507,-9.8792,4.2296,7.9206,-9.8792,1.0975,29.6972,24.7655,764
-10.285,-9.5786,-0.9932,6.7725,-9.5786,3.5208,21.4255,8.3572,765
-11.8449,-10.0903,7.4513,11.2489,-10.0903,13.1595,44.8912,39.135,767
-20.0392,-9.8661,7.8923,11.5955,-9.8661,13.2182,45.701,20.2186,768
-27.435,-9.8386,-0.5361,9.2145,-9.8386,9.3803,23.4125,10.9584,769
-8.3146,-9.9542,0.385,4.5657,-9.9542,6.4088,23.239,19.1438,770
-1.9592,-9.903,1.5577,2.2997,-9.903,1.7033,18.784,8.0098,772
-6.8611,-9.8046,6.4078,8.3556,-9.8046,11.7364,26.3767,17.7038,773
-1.1875,-9.9405,-0.162,0.6309,-9.9405,3.6935,16.1405,13.8641,774
-0.9314,-9.7784,3.8794,4.338,-9.7784,6.4654,11.6462,6.9848,775
-0.9935,-9.7252,0.2204,0.7872,-9.7252,1.6722,7.9885,5.1852,777
-14.6569,-9.8992,1.1519,7.1189,-9.8992,9.9264,42.4585,17.745,778
-13.3314,-9.8608,5.9521,9.9743,-9.8608,6.4375,31.4997,19.6922,779
-9.6148,-9.8415,-2.2679,3.1664,-9.8415,4.7331,13.3527,5.274,780
-1.0454,-10.4396,6.8739,9.4821,-10.4396,5.2227,29.897,22.0601,782
-10.3839,-9.7534,3.4919,8.301,-9.7534,10.9719,32.2572,15.1263,783
-4.3769,-9.8658,3.1355,7.2433,-9.8658,6.7508,32.3265,29.8632,784
-7.1043,-9.9537,1.2737,4.3064,-9.9537,4.0694,26.4584,11.2053,785
0.6046,-9.8048,5.6808,4.3787,-9.8048,4.9374,24.3898,19.8249,787
-28.9793,-9.8739,12.0122,21.7572,-9.8739,22.4921,65.0171,27.0624,788
-3.5753,-9.8277,-0.0127,2.5136,-9.8277,2.4484,11.9371,9.062,789
-0.0331,-9.711,8.7033,6.3463,-9.711,6.7431,27.4607,22.6178,790
-34.4053,-9.6709,-1.9886,13.6352,-9.6709,3.5043,21.2884,11.4719,792
-1.8067,-9.8683,3.5745,4.1213,-9.8683,9.9328,28.2794,15.5921,793
-0.5307,-9.8773,0.1712,0.742,-9.8773,2.3116,8.1773,7.4434,794
-5.4004,-9.9506,2.1786,4.3447,-9.9506,8.0551,30.2315,23.5809,795
-22.3097,-9.9287,0.5095,10.8957,-9.9287,7.7992,36.3732,19.6209,797
-9.6308,-9.7967,-0.3321,2.6689,-9.7967,7.1251,21.899,9.948,798
-12.3028,-9.9242,1.3073,6.0942,-9.9242,7.4147,20.6171,18.0073,799
-5.6515,-9.7445,1.7763,4.3293,-9.7445,4.1806,21.5141,14.8368,800
-2.4694,-9.8517,3.062,3.0422,-9.8517,2.274,16.5393,9.9308,802
5.1374,-9.9762,10.3086,4.3369,-9.9762,3.4902,34.1529,21.8734,803
-11.3208,-9.7931,5.4545,12.2033,-9.7931,6.9641,37.4348,14.5069,804
-6.5004,-10.0042,5.1539,10.3809,-10.0042,8.8484,40.6673,19.9987,805
0.4749,-9.5622,4.0011,3.5773,-9.5622,4.0125,20.1835,17.688,807
-11.1247,-9.8108,0.5355,4.8543,-9.8108,7.6962,20.8993,14.0678,808
-1.2103,-9.3657,1.9414,1.4472,-9.3657,0.7236,15.3468,12.3468,809
-3.3467,-9.9036,5.9593,6.9754,-9.9036,6.4011,26.4979,19.6492,810
1.984,-9.8069,10.2036,5.949,-9.8069,3.4096,23.0036,14.8008,812
-2.6482,-9.8407,3.3736,4.3327,-9.8407,9.3652,26.583,13.3811,813
-0.5357,-9.9613,0.9416,0.935,-9.9613,1.7591,9.7606,8.564,814
-1.6115,-9.8531,1.3526,3.1721,-9.8531,4.8282,11.8717,9.0194,815
-1.3076,-9.8145,0.8639,1.6998,-9.8145,2.1351,7.2342,5.9294,817
-20.9109,-9.7991,3.073,7.9946,-9.7991,11.1193,31.7297,18.6517,818
-0.9352,-9.8129,7.4712,6.5188,-9.8129,6.4402,20.6767,14.9448,819
-0.833,-10.0055,1.8358,2.1111,-10.0055,6.3771,16.3372,15.2289,820
0.7217,-9.8528,3.6266,3.0052,-9.8528,1.1665,11.5046,8.165,822
2.4717,-9.8516,8.8126,5.6439,-9.8516,6.9808,33.9503,31.6514,823
-4.5828,-9.9607,1.3311,3.9145,-9.9607,1.1239,10.3464,8.5335,824
-7.4025,-9.8686,1.3324,4.9365,-9.8686,7.3774,21.7103,14.2432,825
-1.2898,-9.8756,-0.1035,1.2333,-9.8756,2.4198,8.811,7.0207,827
-5.213,-9.8403,-0.2742,3.3859,-9.8403,3.2115,12.8831,10.7641,829
-4.7739,-9.8246,4.835,12.5212,-9.8246,5.0909,25.1039,24.3018,830
-3.9694,-9.8356,2.821,5.3437,-9.8356,3.7466,36.1864,25.4185,831
-2.7142,-9.8272,-0.882,1.5424,-9.8272,1.0059,7.8373,5.0237,832
-1.9822,-9.8512,3.2933,3.1216,-9.8512,6.1015,28.4932,23.0982,833
-2.3371,-9.767,-0.0261,1.1302,-9.767,2.9554,17.9157,10.8637,834
-9.8062,-10.0753,1.8124,7.1426,-10.0753,6.3395,28.6749,15.8943,835
-8.1061,-10.1507,5.7077,12.9061,-10.1507,14.9559,59.88,55.1316,836
-10.1346,-9.8499,-0.8166,6.2647,-9.8499,3.9322,38.3923,30.8914,837
-4.3588,-9.88,2.538,3.529,-9.88,9.2346,32.7576,19.448,838
-0.6333,-9.847,0.8269,1.1547,-9.847,2.3124,11.883,6.0025,839
-1.1272,-9.6686,2.8803,3.6797,-9.6686,5.001,21.1728,16.1987,840
-4.5435,-9.83,3.9927,5.9892,-9.83,1.7091,24.1089,15.2693,841
-0.0696,-9.5,8.0615,8.3634,-9.5,13.8137,26.2753,22.0967,842
-18.633,-9.9619,-2.1184,4.846,-9.9619,4.1106,19.6449,8.9938,843
-0.3587,-9.6013,1.2292,1.8009,-9.6013,3.6369,18.8968,6.2442,844
-7.3045,-10.1367,-1.7385,4.6463,-10.1367,4.2325,12.9161,6.8437,845
-5.7158,-9.9568,1.9548,5.9373,-9.9568,6.239,21.542,12.6844,846
-7.7208,-9.6539,-0.9969,3.6247,-9.6539,1.9624,13.0106,10.8022,847
-5.003,-9.8698,-0.8153,1.8389,-9.8698,3.9638,14.0194,9.3006,848
-2.1834,-9.7999,-0.1213,1.041,-9.7999,2.4653,6.6346,4.1916,849
-0.7598,-9.9154,0.8441,1.2196,-9.9154,1.5176,8.0575,5.5271,850
-5.4034,-9.9041,-1.1247,1.9343,-9.9041,2.9326,18.0095,8.6296,851
-47.1275,-9.8855,-5.8405,18.7868,-9.8855,12.8171,23.6327,13.3864,852
-30.7735,-9.9263,2.7497,12.0582,-9.9263,5.6859,42.4382,12.4771,853
-11.3071,-9.7955,-2.0454,3.5236,-9.7955,3.9676,11.1713,8.4139,854
-0.1129,-9.9678,7.1078,9.4698,-9.9678,5.4782,29.1492,24.1614,855
-7.5264,-9.7328,-2.5412,2.7266,-9.7328,4.8593,21.829,18.6212,856
-2.9849,-9.7812,1.8414,2.9972,-9.7812,3.7234,17.9508,12.6039,857
-12.2149,-9.8032,-1.7576,3.6248,-9.8032,6.5813,28.3802,11.5293,858
-5.9277,-9.7459,2.9723,5.5758,-9.7459,3.108,28.2024,11.8488,859
-4.2692,-9.7852,6.5327,6.6187,-9.7852,2.1226,15.5856,14.1202,860
-5.5135,-9.54,0.5551,2.9275,-9.54,1.235,14.6412,7.7245,862
-4.0163,-9.9808,0.631,2.3378,-9.9808,6.5924,32.3789,28.3189,863
-5.5679,-9.7186,0.1694,3.3378,-9.7186,2.249,30.1002,27.8421,864
14.8238,-9.6531,37.9652,16.0405,-9.6531,2.2977,48.8559,38.2209,865
-3.5968,-9.7969,1.588,3.5098,-9.7969,3.3625,34.3781,32.0257,866
-5.8173,-9.8478,0.417,3.2528,-9.8478,3.0005,23.2289,8.5232,867
-2.3096,-9.8446,0.8918,1.9973,-9.8446,2.203,23.2038,13.1899,868
-2.0207,-9.8385,2.286,3.7734,-9.8385,4.0634,26.6701,9.7568,869
-0.822,-9.8892,1.3168,1.6102,-9.8892,3.8016,38.7567,37.5882,870
-1.2312,-9.9606,0.7762,1.1486,-9.9606,1.8199,9.4137,8.961,871
-431.495,-7.8389,-40.881,165.6125,-7.8389,24.7119,93.712,62.197,872
-8.3407,-9.8419,-1.7572,3.057,-9.8419,3.1157,12.4914,6.8069,874
-64.7872,-9.5086,-13.5208,33.9083,-9.5086,8.9196,15.5015,6.5933,875
-57.5839,-9.4858,5.9291,61.3778,-9.4858,5.9978,46.7182,43.2163,876
-0.9685,-9.9042,13.4069,11.2467,-9.9042,5.4755,18.0957,13.1668,878
-30.8759,-9.7984,-3.6579,13.0234,-9.7984,10.9517,15.5022,11.2274,879
-6.2213,-9.8305,-0.4884,3.7001,-9.8305,4.986,9.0715,5.6239,880
-9.1504,-9.9482,-1.6764,3.6595,-9.9482,3.6174,7.609,3.9199,881
-23.1221,-9.7889,-0.9394,7.7706,-9.7889,6.1524,30.7882,6.745,883
-0.4197,-9.8353,0.0732,0.3106,-9.8353,1.2823,4.1103,2.1873,884
-0.1456,-9.8326,-0.0318,0.0714,-9.8326,0.8129,2.1564,2.017,885
-0.1023,-9.8355,-0.0413,0.0393,-9.8355,0.2637,2.1304,2.0293,886
-32.0954,-9.8498,-1.486,9.6831,-9.8498,4.6343,32.3714,2.7625,888
-8.02,-9.7929,-0.709,1.973,-9.7929,2.0063,8.6866,2.3168,889
-6.743,-9.7704,-1.8696,2.4693,-9.7704,3.4666,8.2843,4.8507,890
-4.0632,-9.8392,-0.1982,0.9607,-9.8392,0.9431,4.5425,2.0696,891
