timestamp,AX_mean,AX_min,AX_max,AX_median,AX_std,AX_meandiff,AX_mediandiff,AX_extremum,AX_delta,AY_mean,AY_min,AY_max,AY_median,AY_std,AY_meandiff,AY_mediandiff,AY_extremum,AY_delta,AZ_mean,AZ_min,AZ_max,AZ_median,AZ_std,AZ_meandiff,AZ_mediandiff,AZ_extremum,AZ_delta,GX_mean,GX_min,GX_max,GX_median,GX_std,GX_meandiff,GX_mediandiff,GX_extremum,GX_delta,GY_mean,GY_min,GY_max,GY_median,GY_std,GY_meandiff,GY_mediandiff,GY_extremum,GY_delta,GZ_mean,GZ_min,GZ_max,GZ_median,GZ_std,GZ_meandiff,GZ_mediandiff,GZ_extremum,GZ_delta,AYGX_mean,AYGX_min,AYGX_max,AYGX_median,AYGX_std,AYGX_meandiff,AYGX_mediandiff,AYGX_extremum,AYGX_delta,Anorm_mean,Anorm_min,Anorm_max,Anorm_median,Anorm_std,Anorm_meandiff,Anorm_mediandiff,Anorm_extremum,Anorm_delta,Gnorm_mean,Gnorm_min,Gnorm_max,Gnorm_median,Gnorm_std,Gnorm_meandiff,Gnorm_mediandiff,Gnorm_extremum,Gnorm_delta
0,0.3651,0.077,0.6465,0.35,0.1571,0.0711,0.1584,0.6465,0.5695,1.3984,1.049,1.8401,1.309,0.2542,0.2909,0.1661,1.8401,0.7911,-9.6713,-9.7922,-9.5704,-9.6618,0.0653,0.0146,-0.0097,9.7922,0.2217,0.234,-1.4139,1.7883,0.2284,1.0073,4.4299,0.8126,1.7883,3.2022,3.2388,3.0188,3.43,3.2419,0.0949,-0.1272,-0.14,3.43,0.4112,0.5842,-0.0939,1.2006,0.5491,0.3381,0.1294,0.1781,1.2006,1.2945,0.2541,-2.2469,2.1938,0.3487,1.4307,9.6954,1.0286,2.2469,4.4407,9.7832,9.6645,9.8841,9.7799,0.0541,0.0446,0.0175,9.8841,0.2196,3.458,3.1883,3.8041,3.4626,0.1534,3.5148,0.0704,3.8041,0.6158
1,0.4362,0.127,0.6969,0.5084,0.1611,-0.0725,-0.1521,0.6969,0.5699,1.6893,1.1394,3.0746,1.4751,0.5345,-2.8983,-2.8056,3.0746,1.9353,-9.6567,-9.7914,-9.5058,-9.6715,0.0737,0.045,0.0418,9.7914,0.2856,4.6639,-1.1001,27.6985,1.041,8.323,-2.9614,6.6336,27.6985,28.7986,3.1116,2.5987,3.5175,3.1019,0.2125,0.0337,-0.0787,3.5175,0.9188,0.7136,-0.3124,2.0148,0.7272,0.6086,1.7608,1.6066,2.0148,2.3272,9.9495,-1.6359,48.4123,1.3773,17.2586,-14.4776,-9.5486,48.4123,50.0482,9.8278,9.6369,10.1098,9.7974,0.1244,-0.087,-0.0895,10.1098,0.4729,6.9728,3.1365,27.893,3.533,7.2349,11.3779,15.0023,27.893,24.7566
2,0.3637,-0.1391,0.7214,0.3563,0.2284,0.4129,0.3631,0.7214,0.8605,-1.209,-2.572,0.6361,-1.3306,0.9414,3.2622,3.042,2.572,3.2081,-9.6117,-10.088,-8.5475,-9.6297,0.2996,0.0627,0.0514,10.088,1.5405,1.7024,-28.9343,30.4867,7.6746,20.3341,-10.6378,-12.8406,30.4867,59.421,3.1453,2.345,4.0075,3.0231,0.501,-2.4682,-2.835,4.0075,1.6625,2.4744,-0.0698,6.2768,2.3338,1.5347,12.2599,12.5579,6.2768,6.3466,-4.5281,-35.0798,33.7854,-8.1713,20.4126,-14.6106,-1.6624,35.0798,68.8652,9.7409,8.9138,10.4247,9.708,0.295,0.1588,0.0926,10.4247,1.5109,18.3507,3.0147,30.6385,18.5353,9.2483,2.3888,1.7178,30.6385,27.6238
3,0.7767,-1.3111,2.7335,0.7194,0.9402,-0.1746,-0.3135,2.7335,4.0446,2.0532,0.8001,4.6933,1.7115,1.0888,-0.1888,-0.4271,4.6933,3.8933,-9.549,-10.3482,-8.7399,-9.5783,0.3949,-0.0182,-0.0245,10.3482,1.6083,-8.9353,-29.2533,3.7461,-5.166,11.4371,10.5798,7.6688,29.2533,32.9993,0.6771,-1.505,3.7538,0.1881,1.7758,0.6305,1.0784,3.7538,5.2588,14.7343,7.1465,23.0724,14.8917,5.1679,6.5452,9.9498,23.0724,15.9259,-19.1387,-95.7801,7.3509,-9.8337,25.3732,19.3278,7.4993,95.7801,103.1309,9.8997,9.3681,10.7437,9.8006,0.3807,0.0203,0.0253,10.7437,1.3756,20.7395,14.0766,30.5619,20.2532,4.7571,5.7275,9.0401,30.5619,16.4853
5,0.4274,-1.1453,2.1356,0.0925,0.942,-0.9169,-0.4264,2.1356,3.2809,1.6756,-0.5457,4.9656,0.8572,1.7999,-1.2124,-0.5027,4.9656,5.5114,-9.5855,-10.1615,-9.0538,-9.6273,0.2979,-0.3355,-0.2561,10.1615,1.1078,12.2243,-6.7284,33.7619,10.1716,10.9652,-5.1089,-3.6115,33.7619,40.4903,1.9381,-2.38,6.0113,2.345,2.7915,7.3719,5.4906,6.0113,8.3913,27.8246,9.6047,37.9951,34.7912,10.9291,19.1989,7.5205,37.9951,28.3903,19.5169,-15.8002,127.2383,5.1648,37.0949,-17.1426,-3.276,127.2383,143.0385,9.9403,9.4527,10.9474,9.8511,0.3626,0.0517,0.0977,10.9474,1.4946,32.1946,10.3951,43.1201,38.3334,11.5908,16.5029,5.891,43.1201,32.725
6,-0.4895,-1.7181,0.323,-0.334,0.6303,-0.7957,-0.8975,1.7181,2.0411,0.4632,-0.9754,1.8533,0.3546,0.7877,-0.5845,-0.4063,1.8533,2.8287,-9.921,-10.3984,-9.6062,-9.8834,0.2154,0.1091,0.0463,10.3984,0.7921,7.1155,-0.7559,15.1184,6.5602,3.6781,-15.0323,-13.9251,15.1184,15.8743,9.31,5.145,16.2575,7.8356,3.7979,2.9841,5.1975,16.2575,11.1125,47.0236,33.4587,80.0872,42.3116,13.3817,36.6875,42.4159,80.0872,46.6285,2.3744,-11.9384,19.4197,1.8889,6.6594,-0.6356,-1.5403,19.4197,31.358,9.992,9.6787,10.5384,9.9488,0.2549,-0.0748,-0.0019,10.5384,0.8598,48.6975,34.4827,81.7242,44.2244,13.5343,36.4009,41.8259,81.7242,47.2415
7,-1.2852,-2.1954,-0.3717,-1.2314,0.4546,1.1771,0.9268,2.1954,1.8237,-0.1213,-1.1711,0.9311,-0.0518,0.4816,-0.5887,-0.7097,1.1711,2.1022,-9.8118,-10.2836,-8.9779,-9.8371,0.3002,0.0349,0.0233,10.2836,1.3057,-7.9169,-14.805,-3.1763,-7.365,3.0088,-1.6779,-1.9349,14.805,11.6287,12.2941,5.5563,18.0425,13.0331,3.9081,-8.6956,-9.695,18.0425,12.4862,83.7111,71.0537,95.0708,84.7275,5.966,-37.345,-41.0566,95.0708,24.0171,1.7388,-4.1321,14.8953,0.3486,4.9835,5.9636,7.7118,14.8953,19.0274,9.9172,9.0659,10.3707,9.9469,0.3154,-0.077,-0.0895,10.3707,1.3048,85.0984,72.792,97.0947,86.0503,6.2235,-37.6066,-41.2738,97.0947,24.3027
8,-0.1081,-0.3748,0.6297,-0.3047,0.3886,0.7376,0.9146,0.6297,1.0045,-0.71,-1.8048,0.3052,-0.7615,0.8303,0.8737,0.912,1.8048,2.11,-9.7769,-9.8764,-9.6471,-9.8138,0.0857,0.0075,0.0543,9.8764,0.2292,-9.5948,-13.2974,-6.0174,-9.2999,2.5586,10.1826,9.5721,13.2974,7.2799,3.5984,2.7913,4.7775,3.3381,0.7561,-0.461,-0.2144,4.7775,1.9863,46.3661,30.8263,67.1005,43.671,14.1795,-49.2227,-46.518,67.1005,36.2742,7.7024,-2.2275,18.5094,8.0604,8.3221,-7.7589,-8.106,18.5094,20.7369,9.8402,9.6689,10.0042,9.8574,0.1353,-0.0003,0.0034,10.0042,0.3353,47.4918,31.5657,68.572,44.7765,14.4025,-40.8273,-39.551,68.572,37.0063
9,0.6295,-0.4651,1.8977,0.6099,0.8376,0.0288,-0.0436,1.8977,2.3628,0.1637,-0.7594,1.2273,0.1505,0.5579,0.1256,-0.2103,1.2273,1.9867,-9.7695,-10.2407,-9.3259,-9.7596,0.2227,0.0446,0.0056,10.2407,0.9149,0.5878,-0.2173,2.6405,0.2722,0.8369,1.7065,2.6974,2.6405,2.8578,3.1374,2.6687,3.7188,3.1238,0.3087,0.3549,0.3369,3.7188,1.05,-2.8566,-12.242,4.3577,-2.847,5.958,-1.4035,-1.6619,12.242,16.5997,-0.0564,-1.4598,1.3458,-0.0457,0.5526,0.0895,0.027,1.4598,2.8056,9.8399,9.5241,10.3167,9.8608,0.2009,-0.0574,-0.0831,10.3167,0.7926,6.6645,3.2081,12.6026,5.2255,2.9136,0.553,1.2731,12.6026,9.3945
10,0.6583,0.2031,1.4128,0.5664,0.3633,0.6123,1.0206,1.4128,1.2098,0.2893,-0.5051,1.9736,-0.0598,0.7891,0.5327,1.227,1.9736,2.4786,-9.7248,-11.4072,-8.5744,-9.7539,0.8124,0.0311,-0.0017,11.4072,2.8328,2.2943,-3.5034,6.601,2.9696,4.0797,2.2604,2.0263,6.601,10.1044,3.4923,2.1087,4.7688,3.4606,0.847,0.5266,0.3937,4.7688,2.66,-4.2601,-7.8968,-0.8801,-4.509,2.4811,-0.0307,1.3311,7.8968,7.0167,0.033,-5.1567,4.899,-0.0186,3.0429,2.6705,0.7847,5.1567,10.0557,9.7825,8.6912,11.6081,9.7776,0.8483,0.1657,0.1711,11.6081,2.9168,7.2176,4.5226,10.2433,6.4986,2.1627,5.6664,4.0157,10.2433,5.7207
11,1.2706,-0.7106,2.2149,1.5869,0.8911,-0.2704,-0.7007,2.2149,2.9255,0.822,-1.2782,3.1859,1.1672,1.4358,0.4773,0.126,3.1859,4.4641,-9.6937,-10.6259,-8.5991,-9.7556,0.5743,-0.6213,-0.5422,10.6259,2.0268,4.5547,-0.7821,10.8053,4.9958,2.7851,5.5498,6.1493,10.8053,11.5873,4.019,2.765,5.9412,3.8544,0.8368,3.4426,4.76,5.9412,3.1762,-4.2908,-24.516,11.0973,-3.1779,11.9599,34.6612,35.0527,24.516,35.6134,2.7036,-13.8113,18.6324,0.7661,8.8608,9.5614,10.8448,18.6324,32.4438,9.9482,8.8515,10.8213,9.9487,0.5442,0.5187,0.5224,10.8213,1.9698,12.884,6.3769,24.8596,10.5143,5.7818,21.9219,24.454,24.8596,18.4827
12,1.0002,0.2969,2.1017,0.8863,0.6493,-0.3178,-0.3496,2.1017,1.8048,1.2993,0.9401,1.6504,1.2932,0.2565,-0.8276,-0.1242,1.6504,0.7103,-10.315,-10.843,-9.4513,-10.2978,0.4434,0.3756,0.4519,10.843,1.3918,10.1045,-0.6379,18.9753,11.1451,7.5893,6.3934,11.7954,18.9753,19.6132,7.4616,0.4112,12.4338,8.6144,4.4743,1.2717,1.8506,12.4338,12.0225,30.3704,11.7588,47.5945,31.8748,12.9229,-58.3216,-63.7083,47.5945,35.8357,12.265,-1.0527,25.8096,11.6109,9.7466,30.3182,27.6701,25.8096,26.8624,10.467,9.7893,10.977,10.4711,0.3843,-0.2608,-0.3817,10.977,1.1876,34.8058,22.3271,49.196,34.9683,9.7235,18.9663,12.2714,49.196,26.8688
13,0.6824,-0.6362,2.2563,0.5367,0.7883,0.0218,0.2128,2.2563,2.8924,0.4717,-2.8257,3.2009,1.169,1.9926,-0.9088,-1.7022,3.2009,6.0266,-9.9394,-13.6459,-6.8584,-9.8459,1.5896,0.2903,0.0779,13.6459,6.7875,16.4979,-27.2994,38.9826,22.9406,21.5512,-22.852,-32.6297,38.9826,66.282,8.7332,-6.0725,19.6175,10.465,7.7241,-3.7242,-3.9944,19.6175,25.69,-27.9512,-82.4915,38.1083,-31.8335,41.0299,28.9571,30.9248,82.4915,120.5998,42.5832,-24.8535,120.6917,39.2809,39.7978,-38.5502,-34.486,120.6917,145.5452,10.2061,7.237,13.7999,10.0894,1.4934,-0.3697,-0.2829,13.7999,6.5629,53.7721,33.8467,87.7043,47.2397,19.216,-32.8408,-27.8495,87.7043,53.8577
14,0.7042,-2.1197,4.0512,0.7495,1.1818,-0.2119,-0.2319,4.0512,6.1709,-0.4371,-2.0005,2.171,-0.5332,0.7965,0.8358,1.0095,2.171,4.1715,-9.6491,-19.0137,-3.5808,-9.768,3.3012,-0.0795,-0.4777,19.0137,15.4329,-6.354,-13.3574,8.3502,-9.6891,6.9469,15.5464,19.0609,13.3574,21.7076,5.009,-12.25,19.6525,6.4706,7.1477,-2.4863,-2.9531,19.6525,31.9025,1.0058,-21.1926,36.5435,-0.9087,18.7172,3.5037,3.9675,36.5435,57.7361,4.033,-8.4347,13.0806,4.795,5.7309,-0.4538,-1.6416,13.0806,21.5152,9.8364,4.0067,19.2358,9.8065,3.1365,-0.0141,0.6271,19.2358,15.2291,20.9313,10.6671,37.4583,19.3902,7.8663,-8.6511,-6.3337,37.4583,26.7912
15,0.4923,-0.8788,2.1407,0.5176,0.9958,0.0953,0.0818,2.1407,3.0195,0.3987,-0.3435,1.6576,0.4763,0.5467,-0.3362,-0.4572,1.6576,2.0011,-9.7286,-12.8094,-5.6795,-10.2458,2.0089,-0.2359,0.7521,12.8094,7.1299,9.1923,4.5171,13.1873,9.3718,2.6303,-4.8902,-6.4962,13.1873,8.6702,2.5227,-5.5563,7.5775,3.5175,3.7193,1.1545,0.0,7.5775,13.1338,4.5095,-2.8318,16.25,3.0588,5.6061,-0.4737,1.0322,16.25,19.0818,3.5791,-3.266,15.308,3.1533,5.1883,-1.936,-2.7801,15.308,18.574,9.8223,5.9167,12.8103,10.4336,1.9494,0.1689,-0.9008,12.8103,6.8936,12.2803,7.8301,18.3633,13.0565,3.1517,-3.7691,-4.0471,18.3633,10.5331
16,0.5876,0.1908,0.9176,0.5994,0.2342,-0.0757,-0.0791,0.9176,0.7268,0.0625,-0.4147,0.6989,0.0191,0.3834,-0.4318,-0.3641,0.6989,1.1136,-9.9645,-12.5026,-8.8776,-9.4937,1.2302,0.174,-0.3309,12.5026,3.6249,4.3021,-0.3405,11.7362,2.8756,4.4229,-11.2609,-6.8477,11.7362,12.0767,3.6772,0.4375,7.4988,3.5175,2.8205,0.3347,-0.1181,7.4988,7.0613,4.0358,1.0082,6.8696,4.091,2.1704,-10.0041,-10.8603,6.8696,5.8614,1.6432,-0.4856,8.2029,0.3732,3.0971,3.5585,1.7438,8.2029,8.6886,9.9913,8.9161,12.5328,9.5328,1.2264,-0.0423,0.4896,12.5328,3.6167,8.5112,5.0519,12.2707,9.0094,2.1585,5.594,6.7806,12.2707,7.2187
17,0.5119,-2.1292,2.8082,0.5204,1.3968,-0.129,-0.1566,2.8082,4.9374,-0.3693,-1.5995,0.6445,-0.345,0.6487,0.4705,0.4279,1.5995,2.244,-9.7905,-13.6499,-5.112,-9.8245,2.1559,0.0215,0.5845,13.6499,8.5379,-6.9588,-19.4211,0.5221,-3.9721,6.9502,-0.7296,-7.7301,19.4211,19.9432,4.0119,-3.0363,11.8213,3.3994,4.6746,-1.0613,-0.7219,11.8213,14.8575,-5.9683,-16.3031,12.8187,-6.7693,8.4989,3.2091,4.6856,16.3031,29.1219,5.2016,-0.6568,25.6958,2.1171,7.2644,-5.2158,-1.7696,25.6958,26.3526,9.949,5.8702,13.751,10.0223,2.0266,-0.1088,-0.7712,13.751,7.8808,14.1051,3.568,23.1869,15.79,6.0817,-1.7646,-3.7307,23.1869,19.6189
18,0.3829,-1.7965,2.1215,0.3638,0.9698,-1.2821,-1.2853,2.1215,3.918,0.1012,-0.8791,1.1849,0.0829,0.5316,-0.3872,-0.6816,1.1849,2.0639,-9.7689,-13.5389,-6.9897,-9.24,1.526,-0.4548,-1.0988,13.5389,6.5492,-7.6884,-18.3038,5.7505,-11.7022,8.9354,5.906,16.1001,18.3038,24.0542,2.9506,-1.4787,7.0788,2.6775,2.3956,8.0252,7.9625,7.0788,8.5575,-2.7592,-13.9801,4.1232,-2.0837,4.4465,-29.0375,-28.5833,13.9801,18.1033,-0.0141,-16.8698,15.0765,0.3475,6.704,4.0267,4.0164,16.8698,31.9464,9.8402,7.3206,13.6578,9.2512,1.5024,0.5255,1.1455,13.6578,6.3372,12.3406,4.3827,22.1777,12.0593,5.0151,23.3551,21.3344,22.1777,17.795
19,-0.8991,-1.9751,0.6883,-0.9215,0.6315,0.5702,0.0169,1.9751,2.6634,-0.286,-2.487,2.3386,-0.5987,1.3444,0.4679,0.4327,2.487,4.8256,-10.2238,-14.3418,-6.2481,-10.3388,1.7954,0.1486,0.5707,14.3418,8.0938,-1.7824,-17.5449,12.1524,4.3979,10.8107,6.0476,2.1474,17.5449,29.6973,10.9758,6.7025,16.1438,10.64,2.4031,4.1956,4.8125,16.1438,9.4412,-31.7967,-47.9528,-17.7735,-30.667,9.6864,20.0007,19.0539,47.9528,30.1793,4.0126,-18.8564,24.4271,4.3639,10.6577,-0.9605,-4.1677,24.4271,43.2835,10.3657,6.253,14.4859,10.3967,1.8192,0.3326,0.9464,14.4859,8.233,35.6957,22.9111,50.6111,33.3937,8.4204,-11.2268,-9.6822,50.6111,27.7
20,-0.3289,-6.1655,5.2757,-0.9045,3.3281,1.0861,1.696,6.1655,11.4412,0.1819,-0.9652,2.3314,-0.1661,1.179,-0.0262,0.1598,2.3314,3.2966,-10.0752,-18.0557,-0.5135,-9.7681,5.2635,0.1716,-0.4847,18.0557,17.5423,4.2653,-9.1175,14.2381,6.5453,9.1747,-0.617,-6.0078,14.2381,23.3556,15.1714,-11.13,38.4125,15.4525,14.3259,-5.7864,-5.2675,38.4125,49.5425,-11.7961,-17.032,-7.5339,-11.6131,2.8035,-14.9716,-15.6396,17.032,9.4982,3.0521,-13.7431,29.0651,0.1962,13.9459,4.2151,3.0623,29.0651,42.8082,10.6983,1.3296,18.1198,11.3431,5.0536,-0.6957,-1.0072,18.1198,16.7902,24.4688,15.3835,39.1657,23.7115,7.4755,8.521,10.2916,39.1657,23.7822
21,0.7572,-1.4765,1.7652,0.7915,0.6531,-0.0444,-0.1747,1.7652,3.2417,0.1557,-1.3901,1.7797,-0.0063,0.9202,-0.0196,0.0293,1.7797,3.1698,-9.9036,-11.2636,-5.9326,-10.2529,1.2941,0.2992,0.1545,11.2636,5.3311,3.6483,-19.5825,26.4101,0.5375,15.4891,-0.8425,0.6774,26.4101,45.9926,9.385,0.455,18.13,10.185,5.6832,-2.7568,-3.4038,18.13,17.675,-26.7677,-49.6226,-2.4361,-27.2527,14.7794,11.7652,10.0167,49.6226,47.1865,7.2672,-8.2039,27.128,3.2585,10.1184,-4.2281,-1.9231,27.128,35.3319,10.0026,6.2425,11.2943,10.3358,1.2328,-0.1721,-0.1526,11.2943,5.0519,32.9898,7.8623,57.2718,34.003,14.4705,-8.9626,-9.2974,57.2718,49.4095
23,0.6684,-2.7595,6.3908,0.4422,1.9149,-0.1143,-0.1074,6.3908,9.1503,0.1164,-1.7946,1.5487,0.0524,0.9671,0.0257,0.1798,1.7946,3.3433,-9.3052,-16.0069,0.0363,-9.9439,4.3844,-0.2067,-0.2295,16.0069,16.0431,1.9632,-14.9943,18.1216,1.8924,9.5474,2.138,1.3123,18.1216,33.1159,3.8715,-16.2225,21.4988,3.3775,7.9582,-1.8448,-1.9075,21.4988,37.7212,-3.2373,-16.4322,15.195,-7.2193,9.1946,3.4056,8.0591,16.4322,31.6271,-1.189,-17.4341,22.2888,-0.5877,8.9289,0.6197,0.5823,22.2888,39.7229,9.6584,2.0833,16.3383,10.0305,4.164,0.0495,0.2044,16.3383,14.2551,15.0647,7.2833,25.4939,15.4082,5.788,-2.2373,-3.194,25.4939,18.2106
24,0.5541,-1.862,2.9761,0.3348,1.2552,-0.1674,-0.0597,2.9761,4.838,0.1421,-1.1376,1.3985,0.2322,0.6045,-0.0871,-0.1661,1.3985,2.5361,-9.512,-16.4233,0.3724,-10.1734,3.421,-0.0038,0.4711,16.4233,16.7957,4.1012,-5.9064,17.0863,3.2047,7.1502,-4.821,-4.3373,17.0863,22.9927,2.0267,-9.9488,14.9362,1.47,6.3857,3.6575,3.5831,14.9362,24.885,0.1683,-16.0154,12.8782,0.8398,9.6393,3.818,4.2379,16.0154,28.8936,-0.5692,-17.3641,11.0183,-0.0053,5.7398,0.4486,0.0987,17.3641,28.3824,9.7079,1.8253,16.4555,10.235,3.1712,-0.094,-0.3411,16.4555,14.6303,12.8274,1.9469,23.4629,12.2142,5.9152,-3.098,-3.2448,23.4629,21.516
25,0.3867,-1.1891,3.0076,0.275,1.3591,0.1873,0.2244,3.0076,4.1966,0.0551,-0.4829,0.4895,0.0661,0.3041,-0.1909,-0.2056,0.4895,0.9724,-9.5158,-10.4006,-7.9822,-9.7023,0.8761,-0.3032,-0.0673,10.4006,2.4184,-0.7198,-5.285,4.7677,-1.1326,3.7641,-3.5233,-4.0624,5.285,10.0527,5.6842,-0.0962,16.2488,5.0531,5.3878,-2.4172,-2.2138,16.2488,16.345,3.9863,-2.7701,8.4097,5.0777,4.3086,0.9199,2.3084,8.4097,11.1798,-0.1206,-2.3024,0.7158,0.0934,0.9755,-0.2747,-0.6788,2.3024,3.0182,9.6139,8.1256,10.4071,9.8939,0.8587,0.2503,-0.1073,10.4071,2.2816,9.7294,6.9428,16.6346,8.9694,3.0422,-0.6216,0.7491,16.6346,9.6917
26,0.574,-0.1051,1.5733,0.4994,0.5225,-0.1838,-0.1329,1.5733,1.6785,-0.1358,-0.9455,0.5284,-0.1394,0.5612,0.2124,0.4015,0.9455,1.4739,-9.819,-10.7745,-8.8856,-9.7695,0.5946,-0.0338,0.0429,10.7745,1.8889,-4.2431,-7.002,1.1725,-5.195,2.7519,7.3269,11.0562,7.002,8.1744,3.267,2.4063,4.9263,2.8394,0.9871,1.289,1.6362,4.9263,2.52,4.9062,-5.502,10.0837,7.3862,5.9708,-14.2221,-16.8587,10.0837,15.5857,-0.3953,-3.1575,2.5338,-0.5855,2.1965,8.7227,7.6972,3.1575,5.6913,9.8642,9.0393,10.7972,9.7866,0.5679,0.051,0.0477,10.7972,1.7579,9.1078,4.9917,12.4349,9.7185,3.1113,9.4698,9.9883,12.4349,7.4432
27,0.3902,-0.2214,1.2501,0.3666,0.3826,-0.0497,0.2125,1.2501,1.4714,0.0766,-1.9867,1.3877,0.2621,0.9946,0.3077,-0.0536,1.9867,3.3744,-9.8529,-11.4893,-8.2258,-9.7266,1.0057,0.4428,0.0995,11.4893,3.2635,3.0838,-18.4723,14.4527,5.8612,10.1065,2.8812,0.7372,18.4723,32.925,4.556,1.295,7.6213,4.4756,1.754,-1.1621,-0.6037,7.6213,6.3263,-9.3159,-28.8032,9.1034,-9.4725,14.4224,12.7801,15.1318,28.8032,37.9066,8.3274,-3.1877,28.6962,7.1117,9.8864,-5.4151,-6.1591,28.6962,31.8839,9.9153,8.2735,11.4936,9.8343,1.0003,-0.4275,-0.1204,11.4936,3.2202,18.5776,8.4009,30.5603,19.7069,8.3632,-6.5433,-8.4189,30.5603,22.1594
28,0.3405,-2.0458,1.6372,0.579,1.1299,0.3739,0.0456,2.0458,3.6829,0.3843,-0.0856,1.2603,0.2085,0.4196,-0.235,0.1502,1.2603,1.3458,-9.4101,-14.932,-3.7811,-9.6271,3.1564,-0.2207,0.076,14.932,11.1509,5.965,-2.5203,13.383,6.5984,5.8497,-13.922,-15.1175,13.383,15.9033,3.3939,-7.0525,9.3888,3.8719,5.0892,0.9045,0.875,9.3888,16.4413,3.4642,-7.9343,10.7353,5.6592,6.9631,7.2302,6.0082,10.7353,18.6696,2.9124,-0.7183,12.181,0.9526,4.6489,-4.6394,-2.9946,12.181,12.8994,9.4878,3.8256,15.0723,9.7139,3.1685,0.2386,-0.1391,15.0723,11.2467,12.0343,8.2708,18.1716,11.2879,3.2608,2.4685,3.3765,18.1716,9.9008
29,0.7143,-1.4219,2.2771,0.6246,1.1167,-0.5554,-0.5711,2.2771,3.6989,0.1493,-0.6774,0.5254,0.3587,0.4475,0.6506,0.5239,0.6774,1.2028,-9.6308,-13.3131,-5.3438,-9.5511,2.235,-0.2355,0.3304,13.3131,7.9693,-7.957,-11.2849,-2.092,-8.5191,3.3202,8.2888,9.2202,11.2849,9.1929,4.2984,0.0438,7.4025,4.7469,2.4236,-1.5192,-2.4938,7.4025,7.3588,10.6943,6.1173,12.7676,11.6674,2.2702,-5.8376,-6.0861,12.7676,6.6503,-1.727,-5.9291,2.7765,-2.042,3.4187,1.5974,2.0183,5.9291,8.7056,9.7264,5.48,13.4059,9.5748,2.2218,0.3311,-0.23,13.4059,7.926,14.5028,10.5171,17.5686,14.6645,2.4196,-8.4739,-8.6784,17.5686,7.0516
30,0.1589,-1.7498,2.7155,0.0535,1.6941,0.2949,0.2073,2.7155,4.4652,0.7999,-0.2358,1.5176,0.8827,0.6268,-0.4841,-0.5817,1.5176,1.7533,-9.8662,-16.38,-5.5668,-9.2207,3.3046,0.1577,-0.2949,16.38,10.8132,0.3318,-1.282,1.626,0.7011,1.0022,12.2174,13.6988,1.626,2.908,2.7792,-0.2363,7.0612,2.2531,2.7127,0.8339,1.1856,7.0612,7.2975,4.8568,2.8742,6.1936,5.5813,1.3809,-5.6376,-4.2885,6.1936,3.3194,-0.1296,-1.9195,0.7554,-0.0237,0.891,3.9986,3.4917,1.9195,2.6749,10.0574,5.7445,16.4799,9.3449,3.2542,-0.2221,0.2229,16.4799,10.7354,6.0289,2.9859,9.0714,5.9861,2.1542,11.4135,10.9271,9.0714,6.0855
31,0.4538,-2.1077,4.8196,0.2608,1.38,-0.0608,0.3124,4.8196,6.9273,0.3158,-1.3404,2.0071,0.301,0.6444,-0.298,-0.3151,2.0071,3.3475,-9.7085,-18.7572,-5.7472,-9.5156,2.7362,0.0297,-0.3981,18.7572,13.01,12.5492,-4.8258,20.4252,14.3999,5.6098,-16.7667,-16.9727,20.4252,25.251,3.6131,-8.5838,15.33,3.4387,6.0637,-0.5626,-1.365,15.33,23.9138,-0.7808,-28.4501,18.7006,1.2928,10.6533,3.9002,1.3353,28.4501,47.1507,3.869,-21.4155,31.4511,3.468,9.3748,-3.925,-3.2833,31.4511,52.8666,9.8353,5.88,18.9076,9.5677,2.7472,-0.0946,0.373,18.9076,13.0276,17.4424,7.1049,35.1755,16.9132,6.5816,-0.6552,-0.85,35.1755,28.0706
32,0.393,-1.0027,1.9142,0.5732,0.8467,0.0721,-0.2004,1.9142,2.9168,0.0179,-1.1902,1.0233,-0.0141,0.5785,0.0894,0.1511,1.1902,2.2135,-9.6788,-11.6422,-7.0562,-9.9137,1.2026,-0.1435,0.3513,11.6422,4.586,-4.2175,-21.9886,11.6658,-2.5729,11.4187,5.0343,3.1401,21.9886,33.6544,3.0505,-3.3862,10.5438,2.0738,4.3336,-0.1556,0.6344,10.5438,13.93,3.1194,-16.4123,20.713,2.6281,12.4459,-1.6514,2.0009,20.713,37.1253,-0.056,-14.2681,13.4415,0.1847,6.0785,0.5194,0.233,14.2681,27.7096,9.7407,7.1325,11.7078,9.9407,1.1854,0.1362,-0.3084,11.7078,4.5753,16.7872,4.3219,25.9324,16.0632,6.959,-3.7452,-2.9643,25.9324,21.6105
33,0.4651,-1.0479,1.9961,0.3728,0.8415,0.109,0.3556,1.9961,3.044,0.1073,-0.6164,1.1376,0.137,0.4154,-0.2485,-0.2615,1.1376,1.7539,-9.8223,-13.1489,-8.1838,-9.5624,1.2153,-0.181,-0.5961,13.1489,4.9651,0.8168,-14.2966,14.9809,0.5672,8.7293,1.6447,2.2071,14.9809,29.2774,2.8949,-4.5413,11.1738,2.7081,3.5682,2.9282,4.6856,11.1738,15.715,1.468,-14.6505,12.5974,4.629,9.4921,-3.4495,-6.4319,14.6505,27.2479,0.4634,-6.4986,4.9648,0.4177,2.8427,0.0934,0.2356,6.4986,11.4634,9.8769,8.2081,13.1506,9.6323,1.2151,0.2697,0.594,13.1506,4.9426,13.042,7.3663,18.6695,13.0989,3.7129,-4.8645,-4.5807,18.6695,11.3032
34,0.5741,-1.8592,2.4262,0.7284,1.453,-0.2398,-0.4847,2.4262,4.2854,-0.1412,-1.0592,0.395,-0.1245,0.5327,0.5425,0.5155,1.0592,1.4541,-10.0033,-14.5989,-6.5476,-10.1584,3.1014,0.2492,0.8254,14.5989,8.0513,2.4615,-1.155,5.542,2.7744,2.7141,0.0925,-0.4593,5.542,6.697,5.8231,-3.7713,11.1038,7.3938,5.4045,-2.6994,-4.7731,11.1038,14.875,-1.9815,-5.3483,1.7461,-1.8029,2.8623,6.4484,8.4153,5.3483,7.0944,0.5567,-0.9385,1.9545,0.6533,1.0072,1.8181,0.535,1.9545,2.893,10.1466,6.7239,14.6605,10.2263,3.019,-0.2919,-0.8101,14.6605,7.9366,8.1776,2.4224,13.1451,8.5182,4.3019,1.9732,1.1838,13.1451,10.7227
35,0.3344,-1.5915,2.5643,0.2437,1.3705,0.4581,0.4794,2.5643,4.1558,0.4013,-0.4602,1.3901,0.3911,0.5109,-0.7278,-0.523,1.3901,1.8503,-9.7542,-12.5669,-8.3104,-9.333,1.6381,0.2604,-0.3526,12.5669,4.2565,2.554,-3.9606,9.6842,2.315,5.0607,-12.7134,-14.0327,9.6842,13.6448,3.1238,-1.68,13.65,2.6206,4.8,2.065,1.8069,13.65,15.33,4.4669,-5.8898,10.2272,6.6124,6.3024,-2.0845,-3.93,10.2272,16.117,2.3749,-0.8462,10.9338,1.1884,3.9659,-0.2784,0.6217,10.9338,11.7801,9.8547,8.3288,12.8371,9.4162,1.6975,-0.1227,0.4617,12.8371,4.5084,10.1507,7.0202,17.7425,9.7021,3.4676,3.5582,3.9189,17.7425,10.7223
36,0.7924,-1.5495,3.1831,0.7231,1.7873,-0.3078,-0.3081,3.1831,4.7326,-0.3265,-1.7958,0.8378,-0.1319,0.8257,0.3319,0.1619,1.7958,2.6336,-9.4938,-11.6508,-6.1074,-9.6857,1.7526,-0.2285,-0.0843,11.6508,5.5433,-10.1593,-13.6899,-2.7759,-11.7177,4.0828,12.8282,13.5425,13.6899,10.914,5.1888,-0.945,13.2475,4.4275,4.3828,-1.453,-0.5469,13.2475,14.1925,2.3824,-5.1489,12.6221,2.6824,6.5057,-5.7315,-6.2624,12.6221,17.771,2.0965,-7.6014,11.3248,1.8101,6.1919,-2.4069,-1.8706,11.3248,18.9261,9.732,6.9134,11.813,9.8779,1.5978,0.0321,-0.0892,11.813,4.8995,13.7089,7.2837,19.0499,13.621,4.3166,-6.1485,-6.4868,19.0499,11.7662
37,0.4846,-0.5842,1.4569,0.415,0.7335,-0.0172,0.1613,1.4569,2.0411,0.0054,-0.4901,0.5242,0.0299,0.3127,0.2297,0.1945,0.5242,1.0143,-9.7223,-11.6036,-7.4618,-9.7699,0.8745,-0.1621,-0.0485,11.6036,4.1418,2.6689,-2.5276,8.8346,1.8247,3.7136,1.2298,2.9471,8.8346,11.3622,3.7357,1.8812,5.9238,3.8806,1.074,-0.3626,-0.4375,5.9238,4.0425,-3.3492,-9.796,5.5657,-3.58,4.6807,-2.7401,-4.1253,9.796,15.3616,-0.3104,-3.0134,2.0273,-0.0605,1.2661,1.071,0.6474,3.0134,5.0407,9.7641,7.4618,11.6971,9.7888,0.8851,0.1593,0.0529,11.6971,4.2353,7.5604,3.2862,12.6838,7.1341,3.2143,1.603,3.136,12.6838,9.3976
38,0.4674,-0.5142,1.5184,0.5763,0.6746,-0.2653,-0.0322,1.5184,2.0325,0.2351,-0.1113,0.7319,0.2244,0.2616,-0.2514,-0.415,0.7319,0.8432,-9.8844,-11.4666,-8.2945,-9.8184,0.9991,0.1001,-0.1728,11.4666,3.1721,3.8987,-2.2707,7.4075,4.7719,3.3163,-6.2607,-7.8113,7.4075,9.6782,3.3731,0.7612,5.985,3.4431,1.9305,-1.0216,-0.14,5.985,5.2238,-6.0893,-11.3937,2.8107,-7.7053,5.3619,8.262,10.6284,11.3937,14.2044,0.7606,-0.8245,4.3542,0.5868,1.6425,-0.1004,0.0133,4.3542,5.1787,9.9234,8.4331,11.505,9.8416,0.9758,0.1528,0.2586,11.505,3.0719,9.1633,1.5898,14.0202,10.2702,4.5014,-2.3903,-3.312,14.0202,12.4304
39,0.2022,-2.2924,2.5137,0.5441,1.7295,0.4372,0.1013,2.5137,4.8061,-0.0163,-0.7923,0.982,-0.1906,0.6935,-0.0262,0.2127,0.982,1.7743,-9.7843,-15.6325,-1.4322,-9.9912,4.0317,-0.0811,0.2672,15.6325,14.2003,-2.362,-7.3827,4.9091,-3.0394,4.4638,0.1437,-1.3938,7.3827,12.2918,2.3516,-2.7825,5.845,3.3031,3.0661,0.9362,0.1181,5.845,8.6275,2.1727,-3.3283,5.7125,2.9231,3.2337,1.9829,1.3747,5.7125,9.0407,0.6602,-3.8895,4.3118,0.6001,2.8398,-0.6278,-0.8575,4.3118,8.2013,10.0762,2.9385,15.7188,10.1003,3.6258,-0.1468,-0.3488,15.7188,12.7803,6.7731,1.6256,9.5543,6.9581,2.3337,2.3225,2.2912,9.5543,7.9287
40,0.6394,-1.2723,2.4422,0.6454,0.7905,-0.0045,-0.2409,2.4422,3.7146,-0.0425,-1.0053,0.602,0.0221,0.4527,0.1784,0.0108,1.0053,1.6073,-9.8654,-14.2135,-7.4022,-9.724,1.2643,0.8434,-0.4777,14.2135,6.8113,-2.2183,-8.9237,9.0189,-4.4332,4.9101,6.897,9.5706,9.0189,17.9426,3.2877,-5.7837,6.5275,3.4213,2.3023,-0.1552,-0.2231,6.5275,12.3113,4.1556,-6.2759,15.7118,4.2978,5.5076,-7.0877,-6.986,15.7118,21.9876,0.0324,-3.48,6.4403,-0.2574,2.3722,1.0143,0.7975,6.4403,9.9203,9.9295,7.5015,14.2665,9.7515,1.2395,-0.4662,0.9229,14.2665,6.765,9.0956,4.2174,16.3118,9.2493,2.8462,0.1255,0.6449,16.3118,12.0944
41,0.6349,-3.4957,4.492,0.4044,2.4137,-0.1079,0.3707,4.492,7.9877,0.1359,-0.8827,1.1711,0.0329,0.7464,-0.0152,0.1523,1.1711,2.0537,-9.022,-14.7568,-1.4058,-10.2017,4.9023,-0.6341,0.3627,14.7568,13.351,4.6787,-1.5839,9.3207,5.1373,3.9121,-2.1432,-1.2809,9.3207,10.9046,3.1325,-6.44,11.9263,3.1981,6.4221,0.0171,0.4769,11.9263,18.3662,-2.9321,-5.042,-1.1865,-2.6882,1.282,2.8363,1.5917,5.042,3.8555,1.0467,-7.6784,10.9153,0.5401,5.2283,1.0752,1.2564,10.9153,18.5938,9.4633,1.786,14.8071,10.6744,4.6448,0.2465,-0.8003,14.8071,13.0211,9.2211,3.0361,12.0893,9.8942,2.6594,-0.6167,-1.809,12.0893,9.0532
42,0.5271,-0.7403,1.8353,0.7751,0.6967,-0.0055,-0.2902,1.8353,2.5756,0.1207,-0.9048,0.9802,0.1852,0.5178,-0.0675,-0.2097,0.9802,1.885,-9.6561,-11.875,-7.7999,-9.839,1.158,-0.0937,0.1189,11.875,4.075,2.5355,-7.0999,11.0889,3.8564,5.8678,-2.3492,-3.0989,11.0889,18.1888,3.1496,-0.0525,6.2213,3.675,1.7982,-0.284,-0.5644,6.2213,6.2738,-0.0957,-11.4613,8.3654,-1.0964,5.3007,3.3696,2.8741,11.4613,19.8267,2.1219,-2.4819,7.7239,1.7966,2.5696,-1.2394,-1.1404,7.7239,10.2059,9.7098,7.802,11.8758,9.8741,1.1462,0.0794,-0.1449,11.8758,4.0738,8.6044,4.9382,13.8398,8.0852,2.3613,-0.3229,-0.0955,13.8398,8.9016
43,0.5216,-0.2181,1.6784,0.485,0.5263,0.0123,0.01,1.6784,1.8965,0.0532,-0.5559,1.2585,-0.0245,0.447,-0.1447,-0.035,1.2585,1.8144,-9.7497,-12.018,-6.8638,-9.7201,1.2515,0.1856,0.0234,12.018,5.1542,0.1863,-8.4432,8.4077,0.7575,5.3181,1.8065,1.3939,8.4432,16.8509,2.8656,-2.1787,9.135,3.1106,2.7924,-1.6472,-1.5138,9.135,11.3138,3.2739,-3.6182,12.3397,1.7776,4.7549,0.0098,1.5842,12.3397,15.9579,0.8825,-3.2785,8.6174,0.6562,2.2888,-1.0003,-0.7599,8.6174,11.8959,9.7892,6.915,12.03,9.7292,1.2351,-0.1874,-0.0252,12.03,5.115,8.2816,4.6053,13.2521,7.9897,2.6292,-4.0674,-3.7474,13.2521,8.6468
44,0.5339,0.0853,1.1745,0.495,0.3944,-0.1611,-0.1272,1.1745,1.0892,-0.0915,-1.058,0.8551,-0.0595,0.5777,-0.2473,-0.3842,1.058,1.9131,-9.5641,-10.4399,-8.6607,-9.6967,0.6564,-0.247,0.0753,10.4399,1.7792,1.9928,0.0862,3.8305,2.1514,1.2321,-3.2032,-3.5288,3.8305,3.7443,1.2184,-0.4375,2.4938,1.5969,1.0271,3.0844,2.6994,2.4938,2.9312,3.2837,1.3686,5.6702,3.3618,1.5247,-13.1254,-14.2954,5.6702,4.3016,-0.1178,-1.4792,1.9544,-0.1037,1.0707,3.2754,2.8665,1.9544,3.4336,9.6017,8.6999,10.5405,9.704,0.6573,0.2348,-0.0591,10.5405,1.8406,4.2141,1.766,6.8455,4.2423,1.7775,9.5699,8.701,6.8455,5.0796
45,0.3728,0.0496,0.8334,0.3678,0.2784,-0.027,-0.0447,0.8334,0.7838,-0.3388,-0.754,0.3812,-0.4437,0.4284,0.9944,1.07,0.754,1.1352,-9.8111,-11.7365,-7.9284,-9.6214,1.3162,0.1685,-0.1966,11.7365,3.8081,-1.2104,-12.5246,10.7725,-1.3774,8.2781,7.0516,8.0699,12.5246,23.2971,4.3028,2.24,6.5275,4.2963,1.4188,-0.8269,-0.8619,6.5275,4.2875,-9.8418,-14.4645,-1.6151,-10.9336,4.5028,5.0218,7.6867,14.4645,12.8494,3.1575,-1.9489,9.4435,2.7628,3.8614,1.0346,1.8397,9.4435,11.3924,9.8365,7.9812,11.7693,9.6448,1.3085,-0.1222,0.1882,11.7693,3.7881,13.784,11.0045,18.5716,12.9433,2.6844,-1.5719,-2.9109,18.5716,7.5671
46,0.3459,-0.7652,1.4523,0.3231,0.7501,0.1623,-0.0036,1.4523,2.2175,0.6556,0.1622,1.6079,0.6262,0.4522,-0.8077,-0.8704,1.6079,1.4458,-9.6426,-15.1489,-6.0479,-9.8179,2.8302,-1.1724,-0.8226,15.1489,9.101,5.8412,-1.8449,11.5275,6.6925,4.9358,-8.7517,-11.812,11.5275,13.3725,3.4759,-0.665,8.6188,3.4344,2.7292,1.8058,1.645,8.6188,9.2838,-4.82,-20.1371,5.8227,-3.2468,9.971,15.9563,16.7497,20.1371,25.9599,4.1921,-0.4968,8.8159,4.6025,3.7745,-3.019,-3.1962,8.8159,9.3127,9.7143,6.2472,15.1712,9.8331,2.7963,1.1772,0.8286,15.1712,8.924,12.2121,6.1417,22.1774,10.0325,6.3359,2.2457,4.8992,22.1774,16.0357
47,0.5082,-0.3498,2.9058,0.3195,1.0547,-0.2191,-0.0255,2.9058,3.2556,-0.1521,-0.8521,0.7211,-0.2442,0.5289,-0.2712,-0.181,0.8521,1.5732,-10.815,-14.2167,-7.8608,-10.6405,2.0188,1.2066,1.0994,14.2167,6.3558,-2.9105,-6.3216,7.3159,-5.1194,4.9786,-2.2093,-1.5631,7.3159,13.6375,5.2817,-2.1438,11.7512,5.0794,4.1001,-2.3461,-2.0213,11.7512,13.895,11.1363,2.6842,16.5817,13.5028,5.284,-13.8515,-16.5075,16.5817,13.8974,1.1732,-2.5961,5.0657,1.4063,2.6567,1.5866,-0.0185,5.0657,7.6618,10.8915,7.922,14.2232,10.6617,1.9728,-1.2578,-1.0887,14.2232,6.3013,14.4578,9.2847,19.3794,14.9316,3.7316,-4.2346,-5.1311,19.3794,10.0947
48,0.2891,-0.1928,0.8194,0.294,0.2866,-0.335,-0.1225,0.8194,1.0122,-0.4232,-1.2459,0.1334,-0.4252,0.4204,0.438,0.4009,1.2459,1.3793,-9.6084,-10.72,-8.2602,-9.5411,0.7917,-0.1049,-0.4776,10.72,2.4598,-5.1199,-12.3509,4.5868,-6.6826,6.0407,8.9675,9.5718,12.3509,16.9377,2.9356,1.5138,4.0425,3.0581,0.7145,-0.362,-0.4463,4.0425,2.5288,-2.7152,-10.9636,6.0637,-3.0047,6.3069,4.4197,5.0933,10.9636,17.0272,2.7598,-1.6482,11.3139,1.3878,4.2832,-3.0627,-1.4246,11.3139,12.9621,9.6337,8.2644,10.7291,9.5731,0.7942,0.111,0.4701,10.7291,2.4647,10.2232,7.2934,14.119,9.8006,2.3589,-4.6892,-5.394,14.119,6.8256
49,-0.0459,-1.1857,0.6959,0.1715,0.7184,-0.2887,-0.3908,1.1857,1.8816,0.0148,-0.5523,0.5182,-0.0242,0.4182,-0.3467,-0.2983,0.5523,1.0706,-9.7133,-10.3428,-8.8393,-10.0188,0.6197,-0.1716,0.1369,10.3428,1.5035,3.8476,0.7332,7.8277,2.8892,2.8304,-12.2173,-12.5393,7.8277,7.0944,2.5736,0.6475,3.6838,2.6119,0.9773,1.4472,1.6406,3.6838,3.0362,1.7045,-0.1676,3.2639,2.0886,1.5863,-7.853,-6.8071,3.2639,3.4315,-0.3028,-4.1689,2.274,-0.0368,1.9016,1.9475,1.9195,4.1689,6.4429,9.7446,8.8576,10.3747,10.0432,0.6179,0.1718,-0.1491,10.3747,1.5171,5.5341,3.5075,8.7181,4.4065,2.0714,9.441,10.3203,8.7181,5.2106
50,-0.3345,-1.6817,0.5861,-0.2193,0.5791,-0.242,-0.3113,1.6817,2.2679,-0.3319,-0.9581,0.4829,-0.3225,0.3392,0.303,-0.2421,0.9581,1.441,-9.8849,-12.0309,-7.3462,-9.8819,1.1041,0.1482,0.2883,12.0309,4.6847,-8.3696,-15.0305,6.1954,-9.6501,5.6826,30.9254,33.6114,15.0305,21.226,4.0208,-1.155,8.365,4.2525,2.1101,0.7644,0.6081,8.365,9.52,-6.1485,-22.7469,10.2807,-4.7185,8.7641,-16.7694,-20.3922,22.7469,33.0276,1.6447,-6.0931,8.9211,1.8828,3.3323,3.5951,-9.0279,8.9211,15.0142,9.9164,7.3577,12.1347,9.894,1.119,-0.0943,-0.2663,12.1347,4.7771,14.975,10.7762,24.4073,14.7269,3.0773,18.6941,19.6478,24.4073,13.631
51,-0.5766,-1.4436,0.0789,-0.5305,0.5891,-0.2004,-0.3288,1.4436,1.5226,-0.0289,-1.0239,1.7288,-0.5646,1.0631,-0.2585,0.3716,1.7288,2.7527,-9.7368,-11.275,-8.4679,-9.5935,0.9489,-0.3871,-0.6937,11.275,2.8071,22.5558,9.6268,31.8727,23.9613,8.32,-27.6085,-29.7588,31.8727,22.2459,4.7852,0.4025,7.315,4.8606,2.4614,9.9199,9.9269,7.315,6.9125,-22.9179,-26.9267,-11.32,-25.1107,5.3652,59.1904,62.4719,26.9267,15.6067,5.2397,-19.9747,55.1017,-7.1452,28.4687,-2.08,7.9402,55.1017,75.0764,9.8221,8.6913,11.3248,9.6278,0.9228,0.4973,0.8509,11.3248,2.6335,33.6691,27.0649,38.7824,34.3746,4.0482,6.453,7.2942,38.7824,11.7175
52,-0.7769,-3.98,2.3558,-0.8593,1.5944,1.6055,1.7751,3.98,6.3358,-0.2874,-1.7043,1.1855,-0.193,0.8376,0.3216,0.1628,1.7043,2.8897,-10.1238,-17.4067,-4.6875,-10.2872,2.7051,0.1901,0.268,17.4067,12.7192,-5.0527,-13.4478,5.8333,-5.7974,4.9649,-3.1039,-1.9022,13.4478,19.2811,14.705,4.795,21.4813,14.7875,4.0847,-6.7487,-6.1775,21.4813,16.6863,36.2724,10.6518,49.8415,37.3612,12.0461,-9.4758,-11.99,49.8415,39.1896,3.1598,-7.0372,19.0376,0.7951,6.4939,4.0977,3.307,19.0376,26.0748,10.3194,5.2927,17.4086,10.4787,2.668,-0.2471,-0.397,17.4086,12.1159,40.1221,14.3145,52.6166,41.6689,11.4902,-7.7154,-11.3514,52.6166,38.302
53,0.8285,-2.6877,2.5597,0.9158,1.1812,0.8357,0.2115,2.6877,5.2474,0.0342,-1.6085,1.9209,-0.0302,0.8579,-0.388,-0.4219,1.9209,3.5294,-9.9338,-12.9748,-6.2018,-10.0192,1.4626,0.2992,-0.2792,12.9748,6.773,-8.1567,-31.4028,9.9612,-7.6997,13.7842,18.149,19.5985,31.4028,41.364,7.9563,-2.8,17.8238,8.61,5.2316,-5.3597,-5.6656,17.8238,20.6238,26.7967,3.1939,51.8021,25.3713,16.1182,-35.8687,-34.5332,51.8021,48.6082,7.2574,-4.382,50.5122,4.1021,13.795,-9.8565,-2.4239,50.5122,54.8942,10.0722,6.5012,13.2582,10.0817,1.4484,0.0097,0.5288,13.2582,6.757,32.4067,9.7387,59.583,30.3174,16.3118,-15.8346,-12.9286,59.583,49.8443
54,1.6642,-1.402,4.6125,1.1273,2.3524,-1.3195,-0.7354,4.6125,6.0145,-0.3538,-2.1836,1.563,-0.4521,1.2518,-0.5098,-0.5457,2.1836,3.7466,-9.6346,-15.2373,-5.5022,-10.2984,3.2064,-0.0349,0.7714,15.2373,9.7351,9.9923,-3.8683,18.3817,11.8989,7.6087,-6.2424,-6.9961,18.3817,22.25,2.5966,-4.515,10.2288,2.9444,5.2508,1.8944,1.3125,10.2288,14.7438,-9.072,-15.9631,-1.6412,-9.1619,4.9403,18.134,17.6337,15.9631,14.3219,-2.5991,-25.8935,22.5341,1.6782,15.1941,-3.1048,-6.9003,25.8935,48.4275,10.0819,5.5623,15.7145,10.6105,3.2573,-0.2572,-0.952,15.7145,10.1522,16.5721,8.6253,19.701,17.3889,3.4461,-4.8372,-5.8415,19.701,11.0756
55,0.3447,-1.3787,2.2789,0.3919,1.2291,0.045,-0.0454,2.2789,3.6576,-0.8636,-1.8994,1.1813,-0.9978,0.9271,0.3826,0.4424,1.8994,3.0806,-9.6695,-10.9642,-8.2648,-9.527,0.9598,-0.0173,-0.0525,10.9642,2.6994,3.7499,-3.4355,7.6895,4.9028,3.9128,-5.8189,-6.6585,7.6895,11.125,4.4909,1.3037,8.0238,4.2569,2.0878,-0.2869,-0.4331,8.0238,6.72,9.0619,4.0379,16.3009,8.4718,4.0651,-1.7497,-1.7644,16.3009,12.263,-5.7039,-14.605,-0.1084,-5.2221,4.5254,2.9511,2.5186,14.605,14.4966,9.8247,8.5943,11.0462,9.6585,0.9065,-0.0285,-0.0038,11.0462,2.4519,11.7349,7.3014,18.2713,11.5474,3.4328,0.6925,0.2418,18.2713,10.9699
57,0.4347,-1.388,2.0434,0.3011,0.7681,0.3027,0.4719,2.0434,3.4314,-0.0984,-1.3093,0.8186,-0.1131,0.6309,-0.0089,-0.1385,1.3093,2.1279,-9.704,-12.8257,-6.4477,-9.6319,1.3601,-0.0855,-0.0632,12.8257,6.378,-7.8879,-13.2332,1.2072,-8.4142,4.421,20.1871,20.1201,13.2332,14.4404,3.9171,0.1313,7.9013,3.3906,2.0951,-0.031,0.6825,7.9013,7.77,5.5625,-7.8176,15.9188,4.943,7.9982,-9.3911,-7.9533,15.9188,23.7365,0.1983,-10.3816,10.7133,-0.1848,5.7683,-1.1661,-2.8953,10.7133,21.0949,9.7677,6.6841,12.9174,9.6509,1.3232,0.1595,0.2438,12.9174,6.2333,13.1199,7.0344,21.3888,12.031,4.638,0.6602,1.8114,21.3888,14.3544
58,0.7374,-1.7078,2.0855,0.7731,1.1502,-0.7042,-0.5966,2.0855,3.7934,-0.1073,-1.6211,1.3698,-0.2516,0.9654,0.2913,0.351,1.6211,2.9909,-9.7896,-12.8081,-7.2689,-9.6951,1.8087,-0.0572,-0.2511,12.8081,5.5391,12.2992,7.1858,15.975,11.7059,3.206,-6.9887,-5.1569,15.975,8.7892,3.8861,-0.5163,6.5362,4.0731,2.2423,-0.6705,-0.9975,6.5362,7.0525,-3.8285,-7.6418,-0.6994,-3.0103,2.9479,-0.0573,-2.6916,7.6418,6.9424,-0.9679,-17.261,13.3738,-3.0801,10.338,2.3465,3.1162,17.261,30.6348,9.9272,7.458,12.8453,9.8947,1.7492,-0.0542,0.1051,12.8453,5.3873,13.7801,7.3219,18.017,13.8424,3.7241,-2.1601,-2.8832,18.017,10.6951
59,0.0333,-0.6807,0.5509,0.1765,0.4708,-0.292,-0.3617,0.6807,1.2315,0.1839,-0.7402,1.2956,0.0993,0.5766,-0.062,-0.0121,1.2956,2.0358,-9.8468,-10.1597,-9.3346,-9.9462,0.2988,-0.0156,0.0785,10.1597,0.8252,5.3105,-2.0186,8.0265,6.5489,3.2734,-0.682,-0.7434,8.0265,10.0451,3.2156,0.7437,4.8037,3.0756,1.4202,0.5453,0.4441,4.8037,4.06,-3.8859,-14.35,9.8833,-5.7019,9.3548,1.0379,2.2537,14.35,24.2333,1.3787,-3.9267,9.8917,0.0361,4.0524,0.0283,0.3469,9.8917,13.8184,9.873,9.3508,10.1751,9.9997,0.3054,0.0225,-0.0913,10.1751,0.8243,11.62,8.6553,15.5012,10.9592,2.6899,-1.5432,-0.6671,15.5012,6.846
61,-0.5507,-1.6296,0.7238,-0.5469,0.6367,-0.1749,0.0939,1.6296,2.3534,0.0598,-0.5739,0.6229,0.0751,0.3375,0.0368,-0.0308,0.6229,1.1968,-9.878,-12.0824,-8.2937,-9.7893,0.9138,0.1601,0.4397,12.0824,3.7888,3.9465,-2.3771,9.9493,5.0621,4.7629,-2.9454,-4.3675,9.9493,12.3264,4.3062,2.415,8.9512,3.9638,1.6463,-2.623,-2.0781,8.9512,6.5363,-1.81,-9.6791,7.8517,-1.1945,4.8797,10.4031,9.7687,9.6791,17.5308,1.4353,-0.5324,5.1871,0.7298,1.7335,-1.3333,-0.7899,5.1871,5.7195,9.9179,8.3057,12.1304,9.8171,0.9237,-0.0556,-0.4651,12.1304,3.8247,8.5336,2.58,13.7436,9.6251,3.531,1.8522,0.2085,13.7436,11.1636
62,-0.7256,-3.9213,1.9654,-0.453,1.7129,0.8344,0.6423,3.9213,5.8866,0.0966,-0.0718,0.3237,0.0443,0.1409,-0.1916,-0.1388,0.3237,0.3955,-9.7179,-13.5043,-6.4335,-9.3496,2.6443,-0.1676,-0.2957,13.5043,7.0708,1.0011,-1.4914,4.6004,0.6946,2.4108,4.8473,4.7989,4.6004,6.0918,1.6833,-5.5913,11.8038,1.8856,5.6809,1.7511,0.8619,11.8038,17.395,8.5931,7.8376,9.1078,8.5742,0.3762,-0.1214,-1.2815,9.1078,1.2702,0.102,-0.331,1.4893,-0.0601,0.5737,0.7428,-0.1146,1.4893,1.8203,9.8623,6.6282,13.6489,9.352,2.7069,0.0831,0.3439,13.6489,7.0206,10.3857,8.9047,14.8663,9.8336,1.9308,2.5802,4.3456,14.8663,5.9616
63,0.1088,-1.4535,1.9065,0.1893,0.8512,0.4021,0.3151,1.9065,3.36,-0.0949,-1.1202,1.1956,-0.0945,0.59,0.4533,0.4718,1.1956,2.3158,-9.8856,-13.1746,-6.8971,-9.6453,1.539,-0.2713,-0.0891,13.1746,6.2775,5.8484,1.6466,11.3988,5.4934,3.2026,2.6116,3.0957,11.3988,9.7521,3.4344,-4.5763,14.105,2.7475,4.3932,5.6215,4.1344,14.105,18.6812,8.4718,-1.6201,19.1647,7.2926,7.7704,14.9468,22.6363,19.1647,20.7848,0.8448,-2.7937,10.0477,-0.1746,3.3881,1.7065,1.7571,10.0477,12.8414,9.9454,7.1984,13.2005,9.6959,1.4913,0.2873,0.1154,13.2005,6.0022,12.966,3.3198,20.1158,14.1792,6.1156,14.7663,18.1294,20.1158,16.796
64,0.5109,-0.7704,1.9349,0.5044,0.833,-0.6281,-0.2747,1.9349,2.7053,0.3584,-0.7085,1.4362,0.3773,0.5994,-1.2965,-1.1741,1.4362,2.1447,-10.1569,-14.559,-6.5806,-9.7344,1.8585,-0.9112,-0.9465,14.559,7.9784,8.46,-0.8434,16.7525,8.5891,4.3267,-14.9021,-15.2398,16.7525,17.5959,9.0559,2.625,18.8037,6.8819,4.9867,-4.297,0.9056,18.8037,16.1787,23.4186,3.6152,34.3516,29.929,10.9008,1.561,-7.213,34.3516,30.7364,2.5513,-10.2373,14.2564,1.5825,5.4721,3.9196,3.1988,14.2564,24.4938,10.2328,6.891,14.5688,9.8112,1.8162,1.0802,0.9783,14.5688,7.6778,27.7323,7.7994,37.8631,32.3086,9.6139,0.2208,-6.0925,37.8631,30.0637
65,-0.1172,-3.1581,1.5327,0.2297,1.5068,0.8382,0.0331,3.1581,4.6907,-0.9381,-1.7222,-0.3016,-0.7968,0.5108,0.5924,0.397,1.7222,1.4206,-11.0681,-22.8157,-0.7267,-10.681,7.0087,0.9698,-0.11,22.8157,22.089,-6.4422,-9.5492,-2.5106,-6.6507,2.2033,-4.0737,-4.253,9.5492,7.0386,4.7589,-14.805,14.4638,7.7875,9.8688,6.5745,4.5194,14.805,29.2688,24.9796,17.3107,37.2288,22.716,7.7389,3.4946,7.3954,37.2288,19.9181,6.4708,1.61,13.7784,4.7813,4.8618,-2.5658,-0.9272,13.7784,12.1684,11.313,1.8229,22.8405,10.7895,6.8126,-1.0992,0.0073,22.8405,21.0175,27.9531,18.2199,40.5426,26.2161,7.4548,4.6727,8.4705,40.5426,22.3227
66,0.7209,-0.3659,2.1547,0.2628,1.0196,-0.1866,0.2965,2.1547,2.5206,-0.3457,-0.7498,0.1454,-0.3997,0.3411,0.2256,0.2391,0.7498,0.8952,-10.0983,-14.0155,-5.0467,-10.7909,2.7856,0.0676,0.5964,14.0155,8.9688,-10.5159,-13.1988,-5.1194,-10.9037,2.6497,9.7052,8.5137,13.1988,8.0794,11.3334,4.97,13.7988,12.3069,2.8375,-3.4672,-4.4013,13.7988,8.8288,28.4742,20.2382,34.0976,30.1114,5.3578,-10.1079,-12.3236,34.0976,13.8594,3.905,-1.8493,9.1019,3.8541,3.8066,-0.6926,-1.2044,9.1019,10.9511,10.2138,5.4277,14.0231,10.7968,2.6392,-0.1131,-0.5736,14.0231,8.5954,32.6258,24.7731,37.7001,34.6866,5.202,-11.3171,-14.3268,37.7001,12.927
67,0.5343,-1.3945,1.8613,0.5593,0.8272,0.0084,-0.1519,1.8613,3.2558,-0.1202,-1.3153,1.0131,-0.1607,0.6309,0.3214,0.2941,1.3153,2.3284,-10.0307,-16.315,-5.7019,-10.1945,2.0874,0.0523,-0.3603,16.315,10.6132,-0.8107,-9.6064,10.6105,-2.39,6.6306,-1.512,-0.4976,10.6105,20.217,7.8663,2.03,13.755,7.9056,3.2255,-0.4648,-0.35,13.755,11.725,18.3664,7.3609,30.5804,17.7877,7.4416,-0.0287,1.9478,30.5804,23.2195,3.2124,-0.157,10.223,2.6497,2.7872,-2.4286,-2.6432,10.223,10.3799,10.1007,5.8528,16.3685,10.2232,2.07,-0.0058,0.541,16.3685,10.5157,21.3086,9.9381,33.5245,20.3598,7.306,0.9338,4.2315,33.5245,23.5864
68,0.5428,-1.2627,2.799,0.4074,1.2062,-0.4702,-0.7208,2.799,4.0617,0.2012,-1.3674,1.0813,0.1334,0.5223,-0.4585,-0.4198,1.3674,2.4487,-9.9784,-13.8307,-5.0057,-10.5548,2.7455,0.3056,1.1447,13.8307,8.825,-2.3227,-13.1061,9.942,-2.8876,8.2779,-11.5676,-11.4963,13.1061,23.0481,7.4015,-4.6025,16.9575,7.5556,5.4132,-4.0889,-3.045,16.9575,21.56,18.3377,6.6083,27.7601,19.7356,7.2767,-19.3238,-25.611,27.7601,21.1518,0.7838,-12.2039,13.1596,0.0065,5.1523,3.6736,3.6614,13.1596,25.3634,10.095,5.2605,13.8548,10.7641,2.6798,-0.2677,-1.2402,13.8548,8.5943,22.2424,8.6675,31.3653,24.5914,6.969,-2.502,-5.6309,31.3653,22.6978
69,0.0726,-2.5574,3.1602,-0.3133,1.6205,-0.0604,0.2964,3.1602,5.7176,-0.2573,-1.648,1.0388,-0.2863,0.5953,-0.249,-0.2896,1.648,2.6869,-9.6729,-16.9249,-3.8221,-9.4101,2.5771,0.1049,-0.3051,16.9249,13.1029,-13.8903,-23.5265,-4.1706,-14.3839,6.2799,13.2258,13.9774,23.5265,19.3559,3.3125,-15.2862,19.285,4.5106,8.905,1.6892,3.4781,19.285,34.5712,-0.9861,-12.1153,15.4827,-5.8754,10.5972,-16.8421,-13.3762,15.4827,27.5981,4.4574,-9.0934,21.3682,3.6678,7.2626,-3.1014,-1.6468,21.3682,30.4616,9.8273,3.9006,17.0176,9.5239,2.5622,-0.2155,0.2114,17.0176,13.117,19.7405,10.201,30.3083,18.9604,6.2325,1.5501,2.9576,30.3083,20.1073
70,0.0122,-0.9223,0.9049,-0.017,0.6437,0.3979,0.3972,0.9223,1.8272,-0.5063,-0.9706,0.4165,-0.576,0.4197,0.8323,0.801,0.9706,1.3871,-9.568,-12.1787,-6.293,-9.7153,1.9902,-0.1546,-0.0869,12.1787,5.8857,-0.6646,-8.7181,7.4015,-0.4065,6.8349,7.0649,7.7207,8.7181,16.1197,5.0017,-9.7213,11.9788,7.9888,7.7266,-1.5511,-4.0119,11.9788,21.7,-17.8283,-24.5333,-9.2575,-19.2516,6.2513,12.0219,12.967,24.5333,15.2758,1.356,-5.1626,7.2536,2.021,4.1038,3.3364,-1.3382,7.2536,12.4162,9.6118,6.4139,12.2206,9.7353,1.9708,0.2151,0.3483,12.2206,5.8067,21.2905,15.6614,25.9934,21.918,4.45,-8.1068,-8.881,25.9934,10.3319
71,0.41,-1.3184,3.1245,0.3802,1.0975,0.3357,0.7741,3.1245,4.4429,0.326,-0.9449,2.2279,0.225,0.7191,-0.6363,-0.573,2.2279,3.1728,-9.7226,-14.7827,-4.2778,-9.8022,2.2931,0.4507,0.1089,14.7827,10.5049,6.4003,-2.5675,16.745,7.3142,6.4107,-7.5373,-8.3603,16.745,19.3124,3.4506,-4.0775,10.3688,3.9769,4.2399,-0.6747,-1.7237,10.3688,14.4462,-5.8064,-18.4624,11.9071,-6.2846,8.6713,9.5037,9.4639,18.4624,30.3695,4.6924,-11.8205,36.006,0.6828,10.0416,-4.3607,-0.3002,36.006,47.8265,9.8269,4.4637,14.8151,10.0836,2.2693,-0.4894,-0.3802,14.8151,10.3514,13.1837,2.9448,23.6554,13.0369,6.6188,-7.0265,-7.0835,23.6554,20.7106
72,0.7458,-0.6324,1.4112,1.1543,0.7645,-0.4217,-0.6493,1.4112,2.0436,-0.3103,-0.6744,0.0275,-0.348,0.2483,0.359,0.4602,0.6744,0.7019,-9.2719,-12.3641,-5.5272,-9.6933,2.1825,-0.51,-0.1612,12.3641,6.8368,-1.137,-2.1395,-0.0589,-1.046,0.6523,1.0632,1.0657,2.1395,2.0806,2.7759,0.5075,6.09,2.2531,1.9753,-0.0436,0.5512,6.09,5.5825,3.6974,-2.2295,10.0706,3.1793,4.4325,-7.2226,-9.8925,10.0706,12.3001,0.3317,-0.0397,0.7798,0.3826,0.2594,2.7859,2.9281,0.7798,0.8195,9.3374,5.5675,12.4518,9.7035,2.1821,0.5624,0.1884,12.4518,6.8843,6.1573,2.2961,10.0835,5.9535,2.56,5.0934,5.3342,10.0835,7.7875
73,0.3241,-3.249,3.3018,0.5051,1.3524,0.0602,-0.1619,3.3018,6.5508,0.0487,-1.5182,1.1478,0.1122,0.7455,0.1183,-0.1897,1.5182,2.6659,-9.7819,-11.7869,-8.3285,-9.8545,0.8237,-0.0191,0.0655,11.7869,3.4584,-0.0738,-10.141,9.6902,0.0197,6.7047,2.7012,4.4825,10.141,19.8312,2.7324,-9.3713,7.2188,2.8044,2.9873,0.9361,1.0238,9.3713,16.59,-3.5253,-13.0664,8.6516,-6.7132,8.0114,2.2296,6.0929,13.0664,21.7181,3.1176,-7.3022,12.6749,3.3106,4.4759,1.3842,0.8654,12.6749,19.9771,9.8998,8.4916,12.2468,9.8918,0.8726,-0.0367,-0.0729,12.2468,3.7553,11.2506,7.3586,17.2007,11.2877,2.6673,1.5457,1.1493,17.2007,9.8421
74,0.3843,-0.6919,2.3073,0.3432,0.7934,0.1258,0.2538,2.3073,2.9993,0.1671,-0.7761,1.3566,-0.0775,0.6736,0.0845,0.2723,1.3566,2.1327,-9.801,-12.4577,-5.6346,-9.789,1.3298,0.6596,0.5453,12.4577,6.8231,2.6275,-9.9108,14.4687,4.5022,8.948,0.3433,-2.619,14.4687,24.3795,3.6684,0.3937,6.3175,3.8281,1.5942,-0.338,-0.4025,6.3175,5.9238,-1.2957,-14.9444,10.7788,-0.6202,8.6625,6.6893,6.5367,14.9444,25.7233,4.5018,-6.0916,17.5568,4.176,5.7047,-2.4821,-4.0934,17.5568,23.6484,9.8631,5.7093,12.4656,9.8189,1.327,-0.1795,-0.4781,12.4656,6.7563,12.7963,8.6102,19.3059,12.437,3.1272,-3.0284,-3.1643,19.3059,10.6958
75,0.5101,-3.7902,3.8647,0.597,1.5299,-0.1647,-0.1704,3.8647,7.6549,0.2516,-0.6253,1.1675,0.1948,0.5847,-0.5772,-0.1771,1.1675,1.7928,-9.1414,-16.656,2.3124,-9.2437,3.7989,-0.7549,-0.6599,16.656,18.9684,2.9708,-1.959,8.9153,1.8832,3.4582,-4.5235,-3.2465,8.9153,10.8743,3.3305,-13.405,17.815,3.4256,6.0455,2.1842,2.03,17.815,31.22,5.3936,-2.8695,13.5041,5.9164,5.037,-27.6729,-28.9392,13.5041,16.3736,2.0197,-0.9921,10.4086,0.0826,3.4063,5.7041,1.4167,10.4086,11.4007,9.6836,4.6059,16.7281,9.3409,2.5638,0.2916,0.7468,16.7281,12.1222,9.7679,2.8229,21.232,9.2727,4.9378,16.2493,16.4529,21.232,18.4091
76,0.3454,-0.9536,1.9619,0.4266,0.8862,-0.8706,0.3163,1.9619,2.9155,-0.3257,-1.8611,0.3393,0.0177,0.8532,0.5798,0.3486,1.8611,2.2004,-9.8963,-11.2962,-8.0536,-9.9036,1.0676,2.6306,5.4919,11.2962,3.2426,-1.5527,-17.986,12.7271,-1.3633,12.2711,6.2897,7.0771,17.986,30.7131,5.5147,3.2813,8.05,5.4556,2.0169,-17.3819,-12.95,8.05,4.7688,-22.2793,-27.7344,-14.8494,-23.0227,4.3032,21.8475,22.0947,27.7344,12.885,7.7238,0.5014,26.8644,1.4993,11.8201,-5.0689,2.049,26.8644,26.363,9.9752,8.0627,11.3422,10.0877,1.0579,-0.1082,-1.1181,11.3422,3.2795,26.0172,23.5584,29.1421,25.7257,2.0874,-6.4315,-11.383,29.1421,5.5837
77,-0.5252,-12.1548,5.6948,0.743,5.5164,2.4728,1.2897,12.1548,17.8496,0.2541,-2.9526,3.0609,0.3662,1.924,0.1898,0.1071,3.0609,6.0134,-7.2657,-17.8606,2.8876,-4.4117,7.8772,-2.2058,-4.8282,17.8606,20.7482,4.737,-5.2519,12.543,5.7137,6.4121,-0.8797,-1.0043,12.543,17.7949,-11.8672,-43.54,7.8138,-7.4944,18.1734,15.2348,9.03,43.54,51.3538,-0.4318,-9.2411,10.0869,-0.9281,6.3002,5.2122,6.2595,10.0869,19.3281,2.6549,-9.0628,12.9638,3.5484,7.8653,-3.8662,-4.7693,12.9638,22.0266,9.867,2.5187,18.9776,8.9696,6.7557,0.0231,0.6831,18.9776,16.4589,19.5857,4.9997,43.8579,14.3427,12.6288,-10.7867,-5.3661,43.8579,38.8582
78,1.9476,-0.4451,4.274,2.0327,1.4221,-1.6832,-1.6316,4.274,4.7191,0.4439,-1.1968,2.2267,0.4733,1.2904,-0.0378,0.0766,2.2267,3.4235,-9.4716,-13.3048,-4.9289,-9.2399,2.7992,0.3332,-0.1943,13.3048,8.3759,3.8573,-3.2998,7.8355,4.7094,3.5855,3.5065,2.9992,7.8355,11.1353,3.3677,-2.8613,11.725,1.5356,4.9232,-0.5338,1.1025,11.725,14.5863,4.7804,1.2254,6.6415,5.3315,1.8945,-5.2837,-5.2576,6.6415,5.4161,-1.2113,-8.0976,6.7914,-1.221,5.522,3.9425,3.671,8.0976,14.889,9.8902,5.4659,13.4582,9.6527,2.6117,-0.6944,-0.1999,13.4582,7.9924,8.799,5.7043,14.5358,8.9766,2.8777,2.4735,1.6255,14.5358,8.8315
79,0.2644,-0.9427,1.5669,0.4011,0.8157,0.2278,0.0847,1.5669,2.5095,0.406,-0.292,0.9317,0.5499,0.4242,-0.5553,-0.7064,0.9317,1.2237,-9.1383,-14.0688,-4.478,-9.4342,2.8168,-0.6222,-0.2642,14.0688,9.5908,7.3638,1.1328,11.5993,7.7086,3.8584,-15.6236,-17.0752,11.5993,10.4665,2.8339,-0.0875,8.0762,2.6381,2.4536,0.8345,0.56,8.0762,8.1638,-0.5033,-11.0987,9.7862,0.0739,7.8984,0.8817,1.8067,11.0987,20.8849,2.7312,-3.3623,6.8748,2.4501,3.6872,-0.9179,-0.6733,6.8748,10.2371,9.1958,4.5169,14.1311,9.4528,2.8008,0.6089,0.2561,14.1311,9.6142,11.2725,7.3163,16.2586,10.602,3.0839,-0.3846,0.4256,16.2586,8.9422
80,0.4922,-0.5356,1.5549,0.4858,0.7812,0.2293,0.0959,1.5549,2.0905,-0.1493,-0.4249,0.3507,-0.1565,0.2433,0.1297,0.2648,0.4249,0.7755,-9.7606,-11.3137,-8.5164,-9.6984,0.9523,0.7648,-0.0793,11.3137,2.7973,-8.2598,-11.5521,-1.3389,-9.3666,3.5918,9.4156,11.3741,11.5521,10.2133,3.6684,2.0475,5.8188,3.1981,1.34,0.5976,0.63,5.8188,3.7713,0.3784,-9.0015,6.0041,1.8806,5.5674,0.2995,-2.9372,9.0015,15.0056,1.8134,-0.4695,4.2982,1.7768,1.6338,-7.1756,-1.3157,4.2982,4.7677,9.8047,8.5889,11.385,9.7089,0.9453,0.0629,0.2056,11.385,2.7961,10.8879,8.5132,13.2352,11.0276,1.93,9.175,8.3479,13.2352,4.722
81,0.7215,-4.4636,5.5923,0.5816,2.3217,-0.3493,-0.9042,5.5923,10.0559,-0.0196,-3.4786,2.9795,0.1083,1.3236,0.226,0.2783,3.4786,6.458,-8.9958,-13.0414,5.1865,-9.7777,3.5205,-0.0429,0.155,13.0414,18.2279,1.1558,-21.0522,23.3631,2.0076,13.1905,-1.4036,-6.198,23.3631,44.4153,4.266,-13.5975,32.7162,3.8281,8.3737,-0.7961,-0.8094,32.7162,46.3138,0.6779,-18.4915,27.7397,-1.0566,15.1218,-3.5274,1.0878,27.7397,46.2312,-5.3622,-81.2699,18.1311,0.4611,20.7642,1.4204,-3.3218,81.2699,99.401,9.8676,6.191,13.4874,9.9145,1.7092,0.6299,0.9381,13.4874,7.2963,20.0629,3.3448,35.3917,19.3755,8.5801,-2.998,-3.9961,35.3917,32.0469
82,0.3722,-5.487,10.0278,-0.3226,3.9995,-0.308,0.4392,10.0278,15.5148,0.2064,-2.6635,2.5265,0.3866,1.4723,-0.1688,-0.7022,2.6635,5.19,-9.0387,-13.7339,3.5942,-9.6227,4.3023,-0.7815,-0.0238,13.7339,17.3281,-0.2478,-13.5392,15.8269,-4.1904,11.1109,-1.0852,4.3483,15.8269,29.3661,3.4699,-16.6075,31.5175,3.0188,11.1645,0.2798,0.3544,31.5175,48.125,-2.8495,-23.5187,11.0858,0.0312,11.0969,8.9352,4.5284,23.5187,34.6044,-3.9418,-36.5671,29.0286,-2.8607,16.1144,8.4857,6.2142,36.5671,65.5957,10.4975,6.3378,14.1982,10.8526,2.543,-0.5776,-1.1551,14.1982,7.8604,17.0649,5.1744,40.2562,15.3794,9.0655,-1.8203,1.9264,40.2562,35.0819
83,0.0642,-1.8774,2.1977,0.1166,0.9262,-0.0265,-0.05,2.1977,4.0751,0.0376,-1.046,1.6121,-0.3157,0.8495,-0.0607,0.2845,1.6121,2.6581,-9.8202,-17.2884,-1.2857,-9.6465,2.9136,0.2636,0.2939,17.2884,16.0027,-1.333,-18.7989,17.2935,0.1579,11.3264,-0.7928,-1.8892,18.7989,36.0923,3.7497,-0.7,13.4138,3.3731,3.2101,-0.7824,-0.455,13.4138,14.1138,6.0856,-8.2176,17.587,4.5596,9.1187,-10.248,-7.6468,17.587,25.8047,4.544,-14.619,25.1678,3.3535,9.6152,-5.4195,-3.8267,25.1678,39.7868,9.9199,1.7508,17.3259,9.6975,2.8319,-0.3343,-0.3236,17.3259,15.5752,15.2446,5.2986,25.1347,17.3058,5.8663,-9.1333,-11.4312,25.1347,19.836
84,0.0377,-0.5546,0.5132,0.0666,0.3707,0.7087,-0.1595,0.5546,1.0678,-0.0231,-1.0556,0.8162,-0.0311,0.678,-0.3013,0.0551,1.0556,1.8718,-9.5565,-11.5268,-8.0978,-9.3526,1.1802,0.3575,-0.144,11.5268,3.4291,-2.1258,-5.5225,0.3005,-1.7314,2.0237,-2.2209,-4.6446,5.5225,5.823,2.9673,0.525,5.2325,2.9181,1.9179,1.6373,2.2138,5.2325,4.7075,-4.1624,-9.1852,-1.3818,-3.0872,2.8241,1.7382,-0.6531,9.1852,7.8034,-0.8756,-3.7475,1.3879,-0.4732,1.8565,4.5376,1.1474,3.7475,5.1354,9.5856,8.1851,11.5354,9.3738,1.1647,0.8868,0.2258,11.5354,3.3502,6.1113,3.0746,10.4986,5.8746,2.8449,5.0649,4.7982,10.4986,7.4239
85,0.7463,-1.4662,4.1973,-0.0929,1.939,-1.0408,0.2894,4.1973,5.6635,-0.3244,-1.3781,0.2238,0.0239,0.6585,0.5217,0.1062,1.3781,1.6019,-9.199,-19.8574,1.2011,-9.4965,7.544,-0.2234,-0.7543,19.8574,21.0585,-4.3467,-11.2052,6.0295,-6.376,6.3612,8.6687,10.2521,11.2052,17.2347,4.6047,-5.3988,14.3762,5.1319,5.5376,-4.5697,-5.6656,14.3762,19.775,-2.4242,-7.5435,6.3715,-3.7402,5.0717,0.846,1.9267,7.5435,13.915,3.662,-1.2061,12.4738,0.6742,5.4119,-2.9382,-0.838,12.4738,13.6798,10.4724,3.0311,19.9115,9.5997,5.7651,-0.9112,0.7354,19.9115,16.8804,11.1762,8.4272,16.416,10.6728,2.5772,-0.6539,0.5234,16.416,7.9888
86,-0.2945,-3.8057,1.2902,0.1965,1.6688,0.3826,-0.0483,3.8057,5.0959,0.1973,-1.0885,1.6408,0.1302,0.9307,-0.3911,-0.3985,1.6408,2.7293,-9.4224,-16.6911,-1.4975,-10.2509,5.1376,0.114,0.3761,16.6911,15.1936,4.322,0.8732,8.1849,3.8761,2.4329,-8.7107,-7.928,8.1849,7.3117,0.035,-16.0125,14.7962,-0.5338,10.7429,3.3578,4.0819,16.0125,30.8088,-1.5782,-4.5961,1.4473,-1.8135,2.1843,3.2184,1.8778,4.5961,6.0434,0.7238,-8.9094,12.4152,-0.1638,6.1149,2.4986,2.3261,12.4152,21.3246,9.5611,1.5699,17.1628,10.335,5.2134,-0.0964,-0.4238,17.1628,15.5929,10.5223,4.549,16.7936,11.1962,4.8745,2.0448,1.3395,16.7936,12.2446
87,0.0881,-2.2369,3.3207,0.1482,1.2297,0.2699,0.1933,3.3207,5.5577,-0.1937,-1.0245,0.7121,-0.2684,0.5287,0.0076,-0.1212,1.0245,1.7366,-9.3084,-16.9683,-2.6696,-9.8748,3.8417,-0.2653,0.0972,16.9683,14.2987,-4.3886,-13.441,8.5633,-4.0519,6.7249,-0.1206,-0.2783,13.441,22.0043,3.3928,-6.1075,11.4013,3.5481,4.7597,-1.0303,-1.0413,11.4013,17.5088,1.6402,-8.5544,13.1368,0.0643,8.4968,-8.8693,-7.9582,13.1368,21.6912,3.2224,-1.5066,10.8348,2.1624,3.7521,-1.0369,-0.7807,10.8348,12.3413,9.4647,4.1072,16.9711,9.9112,3.6698,0.1352,-0.1049,16.9711,12.8639,12.5672,8.8475,16.7413,12.5357,2.7026,-1.5212,-1.5767,16.7413,7.8939
88,0.3581,-0.2935,0.9227,0.3415,0.4235,-0.0326,0.0355,0.9227,1.2162,-0.1861,-0.754,0.6032,-0.3896,0.4587,0.2897,0.3644,0.754,1.3572,-9.5737,-10.1779,-8.7332,-9.7776,0.5902,-0.2027,0.1903,10.1779,1.4448,-4.5093,-12.7626,4.1713,-4.3303,6.0435,12.739,13.7788,12.7626,16.9339,2.3625,1.0763,3.4825,2.5069,0.8752,2.4905,2.8,3.4825,2.4063,-7.2291,-13.5509,-0.1146,-7.8939,4.1595,-1.4346,-0.853,13.5509,13.4363,2.1855,-0.9134,8.2389,1.3816,3.2605,-0.7453,-1.4668,8.2389,9.1523,9.6,8.7468,10.189,9.8063,0.5901,0.2169,-0.1879,10.189,1.4422,11.0459,8.2375,14.5375,10.959,2.1188,2.4827,3.4269,14.5375,6.3
89,0.3255,-0.6858,1.1264,0.377,0.7415,-0.1178,-0.1906,1.1264,1.8122,0.1036,-0.2651,1.0161,-0.0251,0.4235,-0.0381,0.0503,1.0161,1.2812,-9.7764,-11.6805,-8.2028,-9.5873,1.1249,-0.0558,-0.1197,11.6805,3.4777,8.2298,2.1747,12.0041,9.4485,3.915,-9.6395,-10.8802,12.0041,9.8293,4.853,0.315,8.26,5.3069,3.3248,-0.8906,-1.6712,8.26,7.945,-8.6636,-11.0348,-5.7923,-8.7468,1.7022,12.2598,12.8963,11.0348,5.2426,1.4401,-2.8432,12.1973,-0.0852,4.9077,-0.8711,0.3065,12.1973,15.0406,9.8169,8.3373,11.6806,9.6183,1.1054,0.0334,0.0918,11.6806,3.3433,13.5286,8.9418,16.8788,14.3858,3.1956,-6.1292,-6.2989,16.8788,7.937
90,0.2077,-1.0757,1.0038,0.1864,0.4682,-0.0465,0.1836,1.0757,2.0795,0.0655,-0.3967,0.6989,0.0251,0.3037,0.2499,0.3444,0.6989,1.0957,-9.8323,-11.3621,-8.5862,-9.707,0.7936,0.1641,0.0964,11.3621,2.7759,-1.4097,-7.7495,5.558,-1.4316,3.9203,3.1199,2.9945,7.7495,13.3075,3.9624,1.0763,8.1812,3.6356,2.0026,-1.4719,-1.1594,8.1812,7.105,3.5962,-3.2659,8.8406,4.1495,3.2493,-4.5949,-5.3642,8.8406,12.1065,0.569,-0.8398,3.2361,0.2213,0.953,-0.2962,-0.0103,3.2361,4.0759,9.8504,8.6356,11.3693,9.7101,0.7875,-0.1445,-0.0772,11.3693,2.7337,7.3995,3.7017,10.3044,8.0869,2.2001,-3.2223,-3.7709,10.3044,6.6027
91,0.1612,-1.195,0.915,0.3701,0.7583,0.2163,-0.0564,1.195,2.11,0.3154,-0.1616,0.7301,0.3695,0.345,-0.2017,-0.2038,0.7301,0.8916,-9.6682,-10.8034,-8.2234,-9.6106,0.8442,-0.1118,0.1104,10.8034,2.58,1.7102,-0.8325,4.3238,1.5628,1.874,-3.0609,-4.9124,4.3238,5.1562,2.4905,-0.5688,5.0488,2.4763,1.6721,1.1488,1.435,5.0488,5.6175,-0.9987,-2.9807,2.3384,-1.2147,1.7422,1.8493,1.2029,2.9807,5.3191,0.2727,-0.5919,0.9894,0.2111,0.5426,0.1603,-0.2617,0.9894,1.5813,9.7058,8.2423,10.8382,9.633,0.8461,0.1121,-0.1028,10.8382,2.596,4.1772,2.6511,5.9218,4.316,0.9863,2.2412,2.3349,5.9218,3.2707
92,0.3775,-0.4932,2.5585,0.3137,0.6143,-0.2012,-0.1621,2.5585,3.0517,0.1137,-0.6971,0.7277,0.1658,0.4052,-0.2078,-0.2636,0.7277,1.4248,-9.78,-12.311,-7.6074,-9.5002,1.3328,0.2728,-0.2393,12.311,4.7036,-1.3507,-6.4399,6.0569,-3.3496,4.2447,6.2515,6.6427,6.4399,12.4968,3.6393,0.6913,6.5625,3.9113,1.4366,-1.4026,-0.8313,6.5625,5.8713,0.8506,-4.2356,6.6158,-0.0118,2.958,-8.4961,-8.1427,6.6158,10.8514,0.4331,-1.8132,3.1356,-0.0506,1.5404,0.1643,0.0359,3.1356,4.9488,9.818,7.6367,12.3125,9.5302,1.3048,-0.2902,0.2275,12.3125,4.6758,6.4184,3.1553,8.5115,6.6509,1.5242,4.5655,4.2476,8.5115,5.3561
93,0.1763,-0.5007,1.1744,0.1516,0.4836,0.0235,0.3504,1.1744,1.6751,-0.0941,-0.5003,0.3967,-0.0978,0.2885,0.6733,0.7477,0.5003,0.897,-9.5071,-11.517,-6.1408,-9.7396,1.5005,-0.2724,0.0595,11.517,5.3762,4.9008,-3.2624,13.9019,3.2931,5.8488,12.9988,14.853,13.9019,17.1643,2.2367,-5.9675,4.5325,3.08,2.5757,-0.8061,-2.065,5.9675,10.5,-7.6455,-9.673,-4.5461,-8.1544,1.8741,29.4215,29.4003,9.673,5.1269,0.5974,-2.954,4.887,-0.0147,2.0388,8.7775,12.2152,4.887,7.8411,9.5278,6.2563,11.5261,9.7577,1.4804,0.4742,0.0342,11.5261,5.2698,10.9839,6.0621,15.9524,10.8986,2.9955,18.1527,18.3939,15.9524,9.8903
94,0.1998,-2.7583,2.5294,0.502,1.9142,-0.5095,-1.0987,2.7583,5.2877,0.5792,-0.8833,1.3739,0.6499,0.8021,-0.2783,-0.2178,1.3739,2.2572,-9.7795,-14.4002,-5.2037,-9.6801,3.203,-0.9752,-1.3674,14.4002,9.1966,17.8996,12.2396,22.3694,18.1461,3.5507,-12.5586,-12.9164,22.3694,10.1298,1.4306,-9.5988,11.9525,1.015,6.417,12.7783,12.7094,11.9525,21.5513,21.776,18.1416,27.505,21.2458,3.2052,9.185,8.22,27.505,9.3634,9.3749,-16.4466,27.0693,12.2005,14.3205,-7.7494,-9.9331,27.0693,43.516,10.002,5.7128,14.6646,9.7919,3.1572,0.8118,1.2814,14.6646,8.9518,29.1366,26.6401,32.3913,29.2925,2.0698,5.4549,4.4696,32.3913,5.7512
95,-0.3097,-1.4293,1.2848,-0.5966,0.9352,0.5226,0.2554,1.4293,2.7141,0.3009,-0.5691,1.2034,0.4321,0.5221,-0.6197,-0.7172,1.2034,1.7725,-10.7547,-12.4735,-6.6428,-11.0475,1.876,0.9505,1.0209,12.4735,5.8307,5.341,4.5691,6.4935,5.2297,0.615,-15.811,-15.8184,6.4935,1.9244,14.2089,11.4975,18.41,13.7244,2.5061,-5.2161,-5.1275,18.41,6.9125,30.961,25.4013,38.4021,29.4659,4.8581,-8.1081,-6.7716,38.4021,13.0008,1.6255,-2.8017,5.9882,2.2674,2.6296,1.2492,0.5363,5.9882,8.7899,10.8138,6.7823,12.5556,11.0733,1.8507,-0.8634,-1.025,12.5556,5.7733,34.5915,28.3923,40.7168,33.7621,4.6486,-7.714,-6.7136,40.7168,12.3245
96,0.2129,-1.0034,2.8642,-0.3413,1.3725,0.5407,1.3738,2.8642,3.8676,-0.3189,-1.1328,0.4123,-0.2851,0.5706,0.0681,0.1113,1.1328,1.5451,-9.8042,-14.6394,-5.2456,-10.0266,2.8458,0.0898,0.2082,14.6394,9.3938,-10.47,-13.5015,-8.2962,-10.5887,1.6231,-3.9537,-6.0601,13.5015,5.2053,8.9928,3.29,13.475,8.5969,3.2835,-6.1163,-5.9019,13.475,10.185,22.853,18.1488,27.7189,22.6942,3.3169,-19.9335,-14.183,27.7189,9.5701,2.8747,-5.5667,12.5464,2.8037,6.1258,0.3705,-0.404,12.5464,18.1132,9.9504,6.083,14.676,10.0483,2.6787,-0.1492,-0.1587,14.676,8.593,26.8775,21.5952,32.4339,27.0485,3.6591,-7.6366,-6.8363,32.4339,10.8387
97,0.7536,-1.0477,2.0586,1.0326,0.8385,-0.1281,-0.45,2.0586,3.1064,-0.2508,-1.3871,0.4147,-0.1738,0.5525,0.1206,-0.1128,1.3871,1.8018,-9.7144,-13.1768,-7.3765,-9.8184,1.4575,0.5564,0.4307,13.1768,5.8003,-14.4237,-18.6458,-6.3406,-16.6488,4.3786,17.3165,20.0798,18.6458,12.3052,2.8766,-3.7887,9.1963,2.695,3.6054,3.1183,3.57,9.1963,12.985,2.9195,-13.436,15.4365,8.5113,11.4429,-24.9418,-31.7613,15.4365,28.8725,3.2453,-6.9343,25.7167,2.3997,9.251,-0.5867,0.4607,25.7167,32.651,9.8011,7.6696,13.1798,9.8896,1.4139,-0.5629,-0.4401,13.1798,5.5102,19.2408,14.5398,22.6768,20.2122,2.8374,5.2415,4.673,22.6768,8.137
98,0.6255,-0.8199,2.3156,0.5825,0.9353,0.1416,0.1537,2.3156,3.1356,-0.1302,-0.7001,0.5469,-0.2866,0.5066,0.6504,0.7914,0.7001,1.2471,-9.1579,-11.1269,-6.7678,-9.3877,1.5685,-0.6382,-0.3719,11.1269,4.359,2.8929,-9.3145,14.7107,3.431,8.0118,9.5417,9.4059,14.7107,24.0252,5.9948,0.28,11.9963,6.265,3.6927,-1.435,-3.045,11.9963,11.7163,-22.0223,-24.092,-16.2845,-23.25,2.756,30.5234,31.5517,24.092,7.8075,2.6585,-2.3965,6.5215,2.8604,3.2457,3.2984,2.8082,6.5215,8.9179,9.2383,6.8374,11.1413,9.4495,1.539,0.8057,0.4001,11.1413,4.3038,24.4824,21.2478,28.2296,24.8852,2.3039,-7.1257,-8.1175,28.2296,6.9818
99,0.7671,-1.3043,4.1152,0.7362,1.594,-0.2844,-0.2031,4.1152,5.4195,0.5202,0.2298,1.0987,0.5048,0.2794,-0.1792,-0.1897,1.0987,0.8689,-9.7961,-14.3231,-4.8667,-9.7596,3.4764,-0.0389,-0.0354,14.3231,9.4564,12.4345,8.9551,16.0525,12.8369,2.8148,-8.8742,-8.3379,16.0525,7.0974,4.5598,-3.6225,13.5275,3.22,5.5785,-0.8936,0.5863,13.5275,17.15,8.5011,1.9557,15.0478,8.3016,5.5428,3.152,1.9294,15.0478,13.0921,5.9569,3.4939,10.7008,5.6686,2.343,-4.2821,-5.2098,10.7008,7.2069,10.044,6.3776,14.3509,9.8496,3.1725,-0.1442,-0.0068,14.3509,7.9732,17.3566,12.9695,21.94,16.7677,2.922,-2.6208,-4.9873,21.94,8.9706
100,0.4827,-0.9948,1.6424,0.5331,0.6721,-0.2463,-0.2004,1.6424,2.6373,0.341,-0.7019,1.7474,0.3151,0.6663,-0.4841,-0.0877,1.7474,2.4493,-9.835,-13.2209,-5.0182,-9.795,1.4377,0.0072,0.2141,13.2209,8.2027,3.5603,-8.2697,11.4548,4.499,4.9937,-19.367,-20.3231,11.4548,19.7245,3.6662,-0.07,7.1925,3.8063,2.0949,1.9939,2.4456,7.1925,7.2625,11.6531,-3.7904,29.3959,10.2311,9.1237,3.7275,5.2896,29.3959,33.1863,1.6749,-4.735,14.1714,0.4588,4.1464,-0.4731,-3.8327,14.1714,18.9063,9.8999,5.2131,13.2336,9.8427,1.4124,-0.0325,-0.2425,13.2336,8.0206,14.7359,5.3047,29.9498,11.7804,7.4247,8.5055,12.9511,29.9498,24.6451
101,0.2364,-0.6483,0.8071,0.3327,0.5282,0.3927,0.5278,0.8071,1.4554,-0.1431,-1.2626,0.4997,0.2274,0.703,0.4063,-0.1604,1.2626,1.7623,-9.8278,-11.5813,-8.6235,-9.5809,1.2009,0.1015,-1.1281,11.5813,2.9578,-15.8067,-19.5767,-9.9753,-15.8241,3.1631,18.8518,19.5194,19.5767,9.6014,5.6602,2.695,7.7788,6.2519,1.7446,-1.7906,-1.0106,7.7788,5.0838,15.3807,9.5823,22.4459,15.5206,4.702,-18.9287,-17.8817,22.4459,12.8636,1.2018,-9.5146,17.8909,-3.3739,10.3509,3.0846,4.4929,17.8909,27.4056,9.8673,8.6868,11.5912,9.6003,1.1882,0.0788,1.2754,11.5912,2.9044,23.2414,18.0927,26.4624,24.7315,3.2166,-7.3438,-10.232,26.4624,8.3696
102,0.6291,-3.0131,3.2087,0.8604,1.5729,-0.0581,-0.3911,3.2087,6.2218,0.2632,-0.8318,2.0334,0.067,0.7109,-0.3229,-0.2268,2.0334,2.8652,-9.7263,-13.3319,-4.3975,-10.709,3.0649,-0.2882,0.8192,13.3319,8.9344,3.0451,-11.8578,17.0936,3.6953,9.359,-5.11,-5.3687,17.0936,28.9514,3.8695,-8.8288,10.71,5.2413,5.7129,0.9397,-0.3631,10.71,19.5388,-3.548,-18.4415,10.7236,-2.3611,11.1395,-6.7843,-7.9195,18.4415,29.1651,4.2864,-6.47,25.5213,1.119,7.9363,-3.4522,-0.093,25.5213,31.9913,9.9462,4.9439,13.6166,10.8756,2.8912,0.1732,-0.9383,13.6166,8.6727,15.8976,9.3519,24.0188,14.4996,4.4473,-2.4185,-0.8051,24.0188,14.6669
103,0.571,-1.8084,2.2576,0.4693,1.1566,0.1144,0.2154,2.2576,4.066,-0.0597,-0.8964,1.0173,-0.1598,0.472,0.9982,1.0218,1.0173,1.9137,-10.0145,-14.2996,-5.2743,-9.8897,2.0369,0.2393,0.1325,14.2996,9.0253,-2.0649,-12.0583,7.6191,-1.6734,5.6007,20.2412,19.8154,12.0583,19.6774,4.8092,-0.0963,12.0313,4.8781,3.0886,-2.9433,-1.9819,12.0313,12.1275,-10.3323,-15.3517,-1.0491,-10.2806,4.2026,4.2509,3.8325,15.3517,14.3027,0.8342,-7.6234,8.3178,1.026,2.7468,16.7505,14.4337,8.3178,15.9412,10.1193,5.7201,14.3621,9.9374,1.9624,-0.1159,-0.1294,14.3621,8.642,13.4791,7.7766,17.6589,13.6944,2.9938,7.786,8.3821,17.6589,9.8824
104,0.6855,-1.3177,3.5665,0.6847,1.5629,-0.1637,-0.1036,3.5665,4.8842,0.9385,-0.1131,2.0406,0.862,0.7048,-0.7915,-0.8719,2.0406,2.1537,-9.7752,-13.1611,-6.2911,-9.7572,2.012,0.2893,0.24,13.1611,6.87,18.1763,13.2229,22.8628,18.142,3.8587,-21.7789,-22.3653,22.8628,9.6399,1.8659,-2.0738,6.37,2.8962,3.2261,1.447,0.0044,6.37,8.4438,-6.0814,-16.4697,7.8431,-6.448,8.6718,4.103,6.5207,16.4697,24.3127,17.5846,-1.5325,38.5888,15.4596,14.0691,-18.3623,-15.7554,38.5888,40.1214,10.0035,7.2774,13.3834,9.8079,1.8359,-0.429,-0.2554,13.3834,6.1061,21.2652,15.9282,24.2567,22.0765,2.74,-12.9693,-13.8739,24.2567,8.3285
105,0.5217,-1.2214,2.135,0.5811,1.0741,-1.4179,-1.4427,2.135,3.3564,0.1469,-0.6301,1.137,-0.0099,0.595,-0.6089,-0.5618,1.137,1.7671,-9.4858,-10.7548,-7.9045,-9.5172,1.0797,-0.1366,-0.0561,10.7548,2.8503,-3.6027,-8.6329,3.7433,-4.2233,3.7932,-3.9526,-4.0697,8.6329,12.3762,3.313,-1.6187,8.575,2.9006,4.1446,0.3872,0.2997,8.575,10.1938,-1.9784,-10.766,1.375,0.0727,4.491,-7.821,-8.339,10.766,12.141,-0.7777,-4.3584,2.3116,-0.2958,2.2761,6.3897,5.9058,4.3584,6.6701,9.5744,8.1971,10.8452,9.5526,1.0387,0.2676,0.135,10.8452,2.6481,8.2958,4.2118,11.4073,8.2026,2.2211,7.2288,6.7272,11.4073,7.1956
107,-2.3141,-3.0832,-1.6157,-2.3042,0.5419,1.0689,1.5744,3.0832,1.4675,-1.0709,-1.3728,-0.678,-1.1334,0.2746,1.2565,1.1492,1.3728,0.6948,-9.7589,-11.7748,-8.3138,-9.6295,1.389,0.0056,-0.0191,11.7748,3.4609,-11.5079,-14.2087,-6.8516,-12.3628,2.454,7.3535,8.3948,14.2087,7.3571,4.0873,-0.77,9.1875,3.5,3.4471,-0.0674,0.3587,9.1875,9.9575,-17.6203,-31.1376,-5.6588,-16.6053,8.9037,27.0177,23.1248,31.1376,25.4788,12.0017,8.7934,16.5605,11.5158,3.1209,-9.5208,-10.8364,16.5605,7.7671,10.1096,8.7303,12.1771,9.8226,1.329,-0.0933,0.1555,12.1771,3.4468,22.7533,15.782,31.9947,21.6571,5.5482,-9.4703,-9.9374,31.9947,16.2127
108,-1.2452,-4.0247,1.1664,-0.7298,1.5583,1.8798,1.1621,4.0247,5.191,0.1856,-1.7767,2.426,0.0159,1.1902,0.9557,1.0882,2.426,4.2026,-9.7533,-10.6259,-9.1627,-9.6486,0.3945,0.0715,-0.0818,10.6259,1.4632,-4.1545,-13.6006,10.247,-3.968,6.2618,1.0667,0.6586,13.6006,23.8476,4.0199,1.1463,7.6125,3.8588,1.8212,-0.8765,-1.0325,7.6125,6.4663,9.3974,-1.3051,24.8933,6.5194,8.4716,-8.6841,-5.7523,24.8933,26.1983,2.4809,-25.3601,17.9726,0.6795,9.5414,-6.3293,-2.8078,25.3601,43.3328,10.0163,9.2,11.2271,9.9782,0.4792,-0.2165,-0.1652,11.2271,2.0271,13.2831,4.7377,25.6625,11.7196,7.5635,-7.967,-7.3472,25.6625,20.9249
109,0.6347,0.1643,2.5018,0.4323,0.5507,-0.0259,-0.0007,2.5018,2.3375,1.1414,0.0359,2.1621,1.1041,0.5853,-0.1802,-0.1638,2.1621,2.1262,-9.6818,-9.8825,-9.3481,-9.7304,0.1531,-0.0269,-0.0029,9.8825,0.5344,-3.0878,-8.038,1.2471,-3.3094,3.3519,2.2403,2.3396,8.038,9.2851,3.1434,1.925,6.7813,2.8263,1.1629,-0.0003,0.1728,6.7813,4.8563,0.7133,-1.4788,2.3822,0.7672,1.0769,-0.0591,-0.0573,2.3822,3.861,-3.8484,-13.5192,1.5962,-2.1283,4.9188,2.4389,1.4471,13.5192,15.1154,9.7998,9.4176,10.2324,9.8129,0.1934,0.0024,-0.0185,10.2324,0.8148,5.316,3.2745,9.6697,4.3724,2.2035,-0.7889,-0.3506,9.6697,6.3953
111,0.5828,-0.3039,2.4144,0.4309,0.5985,-0.1492,0.0108,2.4144,2.7183,0.781,0.1658,1.4212,0.7764,0.2573,-0.0034,0.0476,1.4212,1.2555,-9.7355,-9.9896,-9.5896,-9.7362,0.0665,0.002,0.0006,9.9896,0.4001,1.3928,-0.4038,3.4479,1.3697,1.3782,-1.6215,-1.5575,3.4479,3.8517,3.1429,2.7387,3.8238,3.1719,0.2549,0.0767,0.0569,3.8238,1.085,0.595,-0.3061,1.4871,0.6525,0.3999,-0.0867,-0.1206,1.4871,1.7932,1.0295,-0.3521,3.0694,0.766,1.1025,-1.2211,-0.8607,3.0694,3.4215,9.8045,9.6734,10.2804,9.776,0.1203,-0.0283,0.0051,10.2804,0.607,3.7383,3.0065,4.7795,3.6712,0.4992,-0.3707,-0.3204,4.7795,1.773
112,0.4336,-0.0407,0.7211,0.4417,0.1348,0.0706,0.0502,0.7211,0.7618,0.7777,0.4219,0.9862,0.824,0.1532,-0.0241,-0.0865,0.9862,0.5643,-9.7336,-9.8271,-9.6188,-9.7356,0.0363,0.0083,0.0104,9.8271,0.2083,-0.2287,-1.6164,1.1115,-0.1878,0.8252,1.3227,1.2343,1.6164,2.7279,3.2197,2.9925,3.36,3.2288,0.0695,0.0014,-0.0219,3.36,0.3675,0.5083,0.1271,0.7277,0.5319,0.1635,-0.0271,-0.0599,0.7277,0.6006,-0.1916,-1.4451,0.8523,-0.0948,0.6543,1.0148,0.8986,1.4451,2.2974,9.7763,9.6541,9.8752,9.7811,0.0388,-0.0082,-0.014,9.8752,0.2211,3.3676,3.0342,3.6316,3.3507,0.1533,0.0769,0.0829,3.6316,0.5975
113,0.5042,0.4599,0.571,0.4919,0.0374,,,0.571,0.111,0.7536,0.6547,0.9826,0.7375,0.1098,,,0.9826,0.3279,-9.7253,-9.7818,-9.6747,-9.7252,0.0395,,,9.7818,0.1071,1.094,0.8836,1.3277,1.0465,0.1546,,,1.3277,0.4441,3.2211,3.185,3.2813,3.2069,0.0375,,,3.2813,0.0962,0.4813,0.0727,0.7825,0.4719,0.2201,,,0.7825,0.7098,0.8232,0.579,1.0774,0.8038,0.1531,,,1.0774,0.4984,9.7681,9.7091,9.8252,9.7671,0.0395,,,9.8252,0.1162,3.4444,3.3508,3.549,3.4336,0.0706,,,3.549,0.1982
