AYGX_min,AZ_mean,AYGX_mean,AYGX_std,AZ_mean,GX_std,Gnorm_max,Gnorm_median,timestamp
-0.4516,-9.879,-0.3461,0.042,-9.879,0.0556,1.3172,1.2517,0
-0.5515,-9.8779,-0.3523,0.1115,-9.8779,0.1596,1.4797,1.2576,1
-0.3858,-9.8783,-0.36,0.0101,-9.8783,0.0136,1.2808,1.2524,2
-0.3991,-9.8795,-0.3607,0.0112,-9.8795,0.0162,1.2843,1.2508,4
-0.3733,-9.8786,-0.357,0.0097,-9.8786,0.0132,1.2707,1.2476,5
-0.361,-9.8794,-0.3468,0.0099,-9.8794,0.0144,1.2458,1.2259,6
-0.8036,-9.8749,-0.4032,0.2696,-9.8749,0.3657,1.553,1.2666,7
-0.3907,-9.8803,-0.3581,0.0219,-9.8803,0.0189,1.2659,1.2407,8
-0.3654,-9.8807,-0.3235,0.0575,-9.8807,0.0654,1.4887,1.2376,9
-2.4385,-9.881,-0.6179,0.5842,-9.881,0.5642,2.1545,1.2793,10
-0.8147,-9.8837,-0.0863,0.4775,-9.8837,0.6932,3.3354,1.6062,11
-0.8335,-9.8837,4.1915,9.8697,-9.8837,4.7892,15.8276,1.396,12
-65.4738,-9.6955,-20.6737,31.2347,-9.6955,10.0953,20.7388,7.1392,13
-0.1532,-9.8306,5.8821,2.7904,-9.8306,2.4551,8.2149,6.2426,14
-2.1678,-9.8952,0.91,1.5758,-9.8952,2.4981,7.256,4.9324,15
-0.6128,-9.9024,-0.0375,0.2957,-9.9024,1.2168,3.2689,1.9051,16
-11.2916,-9.8953,-1.4056,2.8714,-9.8953,3.1867,8.5903,3.6923,17
-3.3485,-9.888,0.7151,1.5741,-9.888,1.94,4.4299,1.6046,18
-1.347,-9.8874,0.7367,1.0085,-9.8874,1.2734,3.4531,2.1234,19
-3.8793,-9.909,-0.7031,1.6085,-9.909,3.342,6.0686,3.4539,20
-0.2535,-9.8904,0.4322,0.5913,-9.8904,1.574,6.1125,3.1944,21
-2.0788,-9.9021,-0.6755,0.8526,-9.9021,1.6923,4.5227,3.6227,22
-2.6119,-9.8949,0.7483,2.7345,-9.8949,2.7109,9.5043,5.7786,23
-13.492,-9.8959,-1.872,4.1505,-9.8959,2.723,11.6936,5.5153,24
-11.9283,-9.8467,-5.4089,3.8966,-9.8467,2.8115,9.8427,6.6268,25
-1.7765,-9.9029,4.1039,4.3761,-9.9029,2.9614,8.7822,5.1325,26
-17.6919,-9.7309,-7.8177,6.0762,-9.7309,2.7515,13.356,12.3806,27
-88.0357,-9.4305,-55.306,20.6404,-9.4305,4.0189,26.8033,23.2143,28
-10.3868,-9.8098,-2.9836,5.0584,-9.8098,3.0231,30.6227,24.448,29
-35.9447,-9.4792,-4.4177,17.2086,-9.4792,6.6967,24.4805,17.6271,30
-50.8568,-9.3427,1.1165,30.9685,-9.3427,8.8565,29.4855,9.5729,31
-28.7453,-9.6753,26.768,32.2668,-9.6753,7.723,41.5326,26.6537,32
-34.0245,-9.8742,3.7995,19.0296,-9.8742,5.9982,27.1995,15.4249,33
-27.0457,-9.8487,-1.5835,8.307,-9.8487,6.2582,18.0803,8.5344,34
-4.2392,-9.9009,0.9154,3.6182,-9.9009,3.3948,8.7214,3.2414,35
-2.4551,-9.9123,-0.4481,0.6464,-9.9123,0.9935,3.9137,1.7071,36
-0.208,-9.9102,0.3762,0.4072,-9.9102,1.5637,4.4242,2.2889,37
-1.3485,-9.8887,0.4759,1.1617,-9.8887,1.9415,3.6565,1.8314,38
-11.0327,-9.8848,-1.4331,6.9483,-9.8848,5.9453,11.2651,5.4055,39
-1.4499,-9.9032,-0.1478,0.7757,-9.9032,2.1632,5.1846,2.3871,40
-8.4197,-9.9474,-3.3406,2.8728,-9.9474,0.8076,8.1836,6.9787,41
-9.458,-9.8883,-1.807,4.1714,-9.8883,5.3676,9.8198,4.1272,43
-14.982,-9.8414,0.7712,5.3591,-9.8414,4.4087,7.3039,4.2544,44
-5.9211,-9.8858,2.5847,6.4259,-9.8858,3.1489,11.6473,8.8425,45
-3.9462,-9.9115,-0.1491,2.0749,-9.9115,2.0992,6.5114,5.0891,46
-1.4787,-9.9101,0.7939,1.9353,-9.9101,2.4672,6.7723,0.8544,47
-1.7143,-9.915,-0.6184,1.482,-9.915,3.3292,5.4237,3.5158,48
-3.334,-9.9006,-0.9431,1.2244,-9.9006,2.5761,5.365,2.0105,49
-4.0106,-9.9049,-0.0724,1.5264,-9.9049,2.8856,6.5434,1.926,50
-3.4342,-9.9185,-0.5058,1.9863,-9.9185,2.6594,5.1032,3.4099,51
-0.9422,-9.9118,-0.0176,0.4817,-9.9118,2.3196,4.0815,2.6502,53
-4.6923,-9.9038,0.2651,2.1262,-9.9038,3.2947,5.9451,3.3996,54
-0.3581,-9.9094,-0.0169,0.1398,-9.9094,1.1828,2.7675,1.4098,55
-18.7361,-9.8303,-13.868,4.5997,-9.8303,2.032,14.9138,11.9232,56
-7.6608,-9.7981,6.2445,10.0588,-9.7981,5.458,19.7096,4.7883,57
-10.5017,-9.8954,5.4661,8.5074,-9.8954,6.1489,27.4661,12.5458,58
-2.5971,-9.8884,0.6715,2.0717,-9.8884,2.028,20.215,5.5042,59
-16.9223,-9.9037,4.5688,11.4215,-9.9037,6.3664,26.7722,13.7024,61
-11.0509,-9.9981,-0.8902,3.5526,-9.9981,2.4425,22.6787,17.7165,62
-0.2886,-10.4997,1.5499,2.4564,-10.4997,2.3094,13.6882,10.7076,63
-6.2798,-10.1237,0.4646,4.4913,-10.1237,7.2207,39.09,31.4982,64
-5.9078,-9.9378,5.8859,10.3829,-9.9378,7.0606,52.0902,29.1968,65
-28.5631,-10.1072,-6.0928,18.7471,-10.1072,1.7849,44.5523,36.9328,66
-1.8671,-9.8694,9.7597,9.2412,-9.8694,9.7802,29.0105,22.0039,68
-9.2842,-10.0182,1.9681,8.2876,-10.0182,7.4835,47.4165,20.0186,69
-8.1258,-9.9192,-1.1977,2.7542,-9.9192,2.166,32.0191,24.332,70
-7.3213,-10.1656,2.3787,7.1007,-10.1656,6.5493,30.9494,22.4742,71
-3.4867,-8.405,-1.1422,1.5617,-8.405,2.9257,18.8829,16.1534,72
-1.8722,-9.976,2.4475,2.6125,-9.976,2.6393,14.4777,7.1316,73
-8.8475,-9.8211,9.5137,16.7458,-9.8211,6.4892,42.7493,40.9108,74
-9.6397,-9.9646,14.8803,18.8693,-9.9646,15.7689,56.308,24.9936,75
-17.9019,-9.9409,-0.3605,10.2553,-9.9409,2.2098,12.8057,9.1545,77
-13.7796,-10.0069,0.1685,7.7347,-10.0069,6.426,15.632,8.8036,78
-11.3473,-9.8612,8.0184,15.7215,-9.8612,6.9155,24.7645,19.9969,79
-20.0359,-9.8475,0.3024,7.9136,-9.8475,5.0784,31.1808,9.457,80
-7.5967,-9.8041,4.0661,7.8338,-9.8041,7.7051,28.6396,14.7402,81
-3.0902,-10.0481,0.2808,2.8763,-10.0481,3.0945,17.2997,11.1708,82
-0.9575,-9.5577,4.7713,6.0485,-9.5577,5.776,19.0508,16.0795,83
-2.5254,-9.8548,1.5906,3.189,-9.8548,3.7913,14.8679,11.9568,84
-5.3011,-9.6527,1.2985,3.6728,-9.6527,2.6199,9.0154,6.0975,85
-5.3907,-9.9273,0.0502,3.6112,-9.9273,4.862,14.7146,7.8595,86
-20.3565,-10.1151,-1.6032,11.9531,-10.1151,11.3042,32.074,18.7212,87
-2.3895,-9.9156,1.49,2.5721,-9.9156,4.1627,12.3386,8.6933,88
-3.3893,-9.7896,1.544,4.5533,-9.7896,3.0496,11.9867,8.4952,89
-1.9774,-9.9796,0.3304,1.3087,-9.9796,3.2388,13.5228,9.2388,90
-1.0431,-10.3644,-0.1169,0.5616,-10.3644,0.8148,7.7092,6.3509,91
-3.7974,-10.1093,0.5547,2.7531,-10.1093,6.4506,28.0773,23.4826,92
-0.2246,-9.8741,1.5312,1.3388,-9.8741,0.4259,21.0005,19.0853,93
-1.9712,-10.0373,4.4833,3.8553,-10.0373,1.9168,13.9393,10.3995,94
1.7049,-9.9581,7.1453,4.094,-9.9581,1.1456,22.6848,16.8675,95
-5.906,-9.8482,4.2694,7.7352,-9.8482,6.7127,19.4092,9.1611,96
-18.8819,-9.7167,-0.3739,10.8186,-9.7167,5.19,32.293,27.1362,98
-4.9663,-9.8129,11.444,13.1329,-9.8129,12.5462,40.6962,20.1837,99
-10.6347,-9.9474,7.1181,8.3347,-9.9474,6.864,32.1598,12.4682,100
-10.2969,-9.878,1.5416,5.929,-9.878,6.2602,34.5393,16.2153,101
-14.8722,-10.0744,-1.0428,14.1478,-10.0744,8.9276,28.764,19.9001,102
-3.4307,-9.8173,1.4078,3.0742,-9.8173,3.6195,14.5173,10.5979,103
-11.2111,-9.8655,0.6434,7.3805,-9.8655,5.6538,21.1586,12.266,104
-2.5554,-9.1663,2.0257,2.6722,-9.1663,1.307,13.0586,7.0563,105
-3.7595,-10.0113,1.6967,2.3198,-10.0113,3.6336,12.8869,7.699,106
-4.2049,-9.6121,3.0116,5.1644,-9.6121,3.6699,23.9048,12.2539,107
-0.6892,-9.8842,14.9157,14.5308,-9.8842,5.5502,21.4256,19.1078,109
-1.8115,-9.8938,2.3715,3.2403,-9.8938,4.6333,23.8208,11.2354,110
-10.3273,-9.8791,0.5702,5.5158,-9.8791,4.1246,13.9303,10.3059,111
-21.6976,-9.6029,6.7775,15.8349,-9.6029,9.8179,31.095,18.9766,112
-14.3176,-9.7784,4.3856,10.5524,-9.7784,7.4221,24.7154,14.1269,113
-6.1457,-9.6843,4.5553,6.0275,-9.6843,5.463,37.5399,12.5312,114
-16.089,-9.2642,12.5099,26.6418,-9.2642,5.0733,37.7762,24.5125,115
-13.9562,-9.9907,10.5671,18.7083,-9.9907,11.2192,33.0085,21.0359,116
-0.8495,-9.8202,14.372,10.3018,-9.8202,8.369,21.0883,14.6665,117
-20.6001,-9.7593,-1.6988,9.8016,-9.7593,8.5103,43.8859,18.0606,118
-21.1453,-9.7353,1.4487,10.1781,-9.7353,3.2565,30.8591,13.0533,119
-14.8935,-9.6664,-4.8631,5.7004,-9.6664,6.4515,20.4494,13.3628,120
-6.1703,-10.0323,3.8054,9.3363,-10.0323,2.3784,22.5934,19.3461,121
-0.0665,-10.103,3.1119,2.7862,-10.103,6.1871,20.0058,15.6245,122
-3.6142,-9.6901,2.3434,4.9146,-9.6901,3.2807,18.9375,14.2156,123
-9.8226,-9.7115,6.9052,13.5663,-9.7115,10.0097,26.7759,17.3252,124
-28.0603,-9.7758,-0.0038,9.5673,-9.7758,4.7798,23.7823,12.979,125
-6.4035,-9.6151,1.4857,5.6382,-9.6151,3.4763,25.2484,21.6149,126
-2.309,-9.6553,-0.1836,1.6537,-9.6553,3.4974,17.3153,5.1915,127
-1.8309,-9.5061,0.4223,1.1064,-9.5061,1.9158,14.3495,4.802,129
-3.3753,-10.0164,1.3743,4.1211,-10.0164,4.5991,14.5352,9.7692,130
-0.8607,-9.9932,1.1479,0.9784,-9.9932,1.3393,12.315,7.0237,131
-1.7915,-9.6132,-0.1301,1.7529,-9.6132,2.5705,16.2027,8.9063,132
-0.9257,-9.7615,0.0173,0.4852,-9.7615,1.2796,4.1426,3.7442,133
-1.5633,-9.1156,0.0979,1.0926,-9.1156,1.1114,13.8282,4.3253,134
-13.8358,-8.1901,0.0024,5.1285,-8.1901,3.7744,29.7613,10.3659,135
-6.1304,-10.0538,1.4027,5.0151,-10.0538,2.3624,13.9157,9.8998,136
-7.4837,-9.7836,-0.6259,3.1099,-9.7836,2.6612,13.1652,9.3594,137
-2.0396,-9.2458,0.1347,0.7991,-9.2458,1.5818,11.6731,5.0092,139
-1.9213,-9.1546,0.3992,1.2293,-9.1546,2.1968,13.603,5.3635,140
-1.1937,-9.424,0.8998,1.195,-9.424,1.2238,10.8553,6.6448,141
-1.362,-9.6482,-0.3228,0.695,-9.6482,1.095,8.8404,4.2965,142
-3.9465,-8.8952,-0.2221,1.674,-8.8952,3.3151,14.0201,7.0318,143
-4.2526,-10.1243,0.8312,4.7528,-10.1243,2.9643,17.0822,16.3704,144
-5.7026,-9.7018,-0.1033,2.2314,-9.7018,2.9283,20.0948,11.2488,145
-4.8883,-9.1374,-0.7968,2.8785,-9.1374,2.4188,19.9757,10.0997,146
-11.1092,-9.5212,1.1237,4.2179,-9.5212,5.1687,20.9513,11.8241,147
-3.5864,-9.7402,4.1144,6.8611,-9.7402,5.6481,14.4528,13.0029,148
-6.0299,-9.8913,0.3385,2.9908,-9.8913,2.4817,20.1038,6.2462,149
-0.895,-9.8962,0.4411,0.9414,-9.8962,2.6397,9.825,6.293,150
-1.494,-9.9787,0.5955,1.947,-9.9787,0.9941,8.6085,7.1061,151
-0.0597,-9.7912,1.1781,1.0234,-9.7912,2.1159,8.7034,6.1673,152
-0.4332,-9.958,0.2966,0.7023,-9.958,1.0714,8.7504,5.626,153
-0.2584,-9.9693,0.3099,0.5032,-9.9693,1.5714,8.3796,4.7132,154
-2.5592,-9.9352,-0.1827,1.0279,-9.9352,1.8282,7.9963,4.161,155
-5.7436,-9.9312,-0.3695,2.5915,-9.9312,3.0304,8.2114,4.3743,156
-14.2532,-9.8921,-1.7271,4.6767,-9.8921,4.8254,12.0646,4.6553,157
-7.1358,-9.8757,-1.0217,2.2834,-9.8757,1.9993,5.7613,2.0635,158
-2.2736,-9.8711,-1.0882,0.6055,-9.8711,0.6269,2.5744,1.6328,159
-2.8951,-9.8547,-1.2416,1.0155,-9.8547,0.8528,2.5944,1.412,160
-9.6435,-9.8479,-5.5117,2.7618,-9.8479,1.2462,6.3467,5.4573,161
-15.528,-9.8643,-0.6839,4.3936,-9.8643,3.9074,9.6005,4.1824,162
-9.2161,-9.9445,-0.054,4.0265,-9.9445,3.4596,10.099,7.1209,163
-1.0922,-9.9919,1.3188,2.1148,-9.9919,4.6562,10.7453,7.4253,164
-3.4603,-9.8858,0.6954,2.0542,-9.8858,2.8251,11.8076,5.4839,165
-1.1765,-9.9469,0.9706,1.57,-9.9469,0.7089,7.3943,4.7615,166
-7.8077,-10.0056,1.1809,6.8248,-10.0056,4.9086,10.9206,5.0171,168
-27.8619,-9.8673,2.1659,9.3647,-9.8673,7.9005,22.644,9.1932,169
-67.8534,-10.1133,10.099,33.5487,-10.1133,13.7418,60.1594,29.5574,170
-8.236,-10.0552,-0.5571,4.9638,-10.0552,4.5249,20.9199,17.3273,171
-7.595,-9.8428,12.0189,25.2312,-9.8428,6.3606,16.207,12.3805,172
-2.7576,-9.5308,2.9313,6.5614,-9.5308,3.8108,12.3773,10.907,173
-7.1973,-9.6148,4.284,8.256,-9.6148,5.7449,23.4388,12.0756,174
-11.5559,-9.9791,2.7176,6.4779,-9.9791,5.0113,18.005,10.6078,175
-4.8128,-9.7585,10.0945,8.4014,-9.7585,4.109,17.5967,14.5282,176
-7.5278,-9.8372,3.1416,6.324,-9.8372,5.5902,13.0767,9.1864,178
-4.3671,-9.8052,0.6106,2.7051,-9.8052,4.0537,11.7934,7.738,179
-1.0835,-9.8608,0.7276,1.7111,-9.8608,3.4374,9.6251,4.624,180
-0.7509,-9.7156,1.4009,1.7828,-9.7156,1.7577,9.0209,5.31,181
-5.4115,-10.1255,0.7729,4.1305,-10.1255,5.2584,19.7538,7.1018,182
-0.8131,-9.8166,2.3735,2.8276,-9.8166,2.9779,10.7501,8.1746,183
-1.2289,-9.7832,0.0249,0.7323,-9.7832,1.8666,8.2832,5.078,184
-6.104,-9.8925,-0.1788,1.7098,-9.8925,2.6413,11.7724,5.5345,185
-2.2919,-9.9069,0.6387,1.8263,-9.9069,3.1348,10.5663,5.8186,186
-1.8459,-10.0034,1.2223,3.2152,-10.0034,3.7469,11.8827,7.0475,188
0.3865,-10.0235,3.5658,2.4422,-10.0235,2.8091,9.9851,8.6426,189
-0.4611,-10.173,0.3723,0.9087,-10.173,2.5703,11.1961,8.7301,190
-0.531,-9.8929,-0.041,0.2471,-9.8929,0.4793,4.3941,3.2155,191
-1.0007,-9.9103,1.3905,1.8884,-9.9103,3.4778,16.5156,9.585,193
-10.2296,-9.9815,0.0025,6.2161,-9.9815,3.1949,12.7174,9.912,195
-9.0853,-9.6708,2.7114,8.1851,-9.6708,5.5485,29.2714,15.3083,196
-0.232,-9.9669,0.3041,0.3275,-9.9669,1.9439,12.3719,4.7581,197
-17.1354,-9.6536,3.8083,8.7097,-9.6536,10.1463,21.6647,12.5293,198
-6.1227,-10.0233,5.2083,11.2705,-10.0233,4.5369,18.8269,10.9376,199
-1.3497,-9.6263,0.0742,0.8084,-9.6263,2.3082,10.1464,3.9071,200
-0.2749,-9.9021,0.6785,0.9241,-9.9021,2.615,10.7793,4.1564,201
-0.8971,-9.9868,0.6601,1.5497,-9.9868,1.1272,7.8097,4.5199,202
-0.4672,-10.0988,0.3136,0.4667,-10.0988,1.8377,26.2772,9.5867,203
-3.9369,-10.5279,0.4021,2.1623,-10.5279,3.7957,19.9515,8.8426,204
-1.1786,-9.8511,0.2123,0.6359,-9.8511,1.1179,6.7136,4.4503,205
-0.4564,-9.8443,0.8918,1.2399,-9.8443,4.1422,15.1028,7.2597,206
-1.6689,-10.2423,0.3314,2.3617,-10.2423,2.2872,12.8005,4.2581,207
-2.9288,-10.0452,2.7157,6.7133,-10.0452,6.3327,15.2946,7.9539,208
-0.8961,-9.8663,1.441,1.9859,-9.8663,1.9722,9.2514,5.5169,209
-4.1079,-9.889,1.5142,3.0116,-9.889,5.0413,11.0283,9.4786,210
-1.4306,-9.8872,-0.1381,0.6219,-9.8872,0.782,17.1746,11.0546,211
-0.298,-9.8595,0.4725,0.8473,-9.8595,1.7184,11.4414,8.6827,212
-6.7467,-9.912,-0.3552,2.1496,-9.912,2.2044,7.7281,4.8959,213
-9.3838,-9.8801,-1.6792,3.3218,-9.8801,3.2693,8.1734,2.2169,214
-1.5354,-9.8795,-0.62,0.5688,-9.8795,0.581,2.5541,1.3908,215
-0.2487,-9.9006,0.5102,0.5891,-9.9006,0.9409,2.6458,1.5713,216
-1.1075,-9.9038,-0.382,0.3414,-9.9038,0.6601,2.1956,1.2899,217
-1.8966,-9.8969,-0.6021,0.7267,-9.8969,1.1648,3.0245,1.3295,218
-20.9508,-9.8926,-1.5797,7.7952,-9.8926,5.9908,12.7534,3.4527,219
-17.4654,-9.8703,-7.4879,5.529,-9.8703,2.2821,7.9501,6.2359,220
-19.778,-9.7173,12.5076,25.1042,-9.7173,10.5098,24.8815,12.7302,221
-9.9862,-9.88,7.177,10.7736,-9.88,7.4372,40.3748,16.1523,224
-1.488,-9.5127,8.7757,9.1234,-9.5127,9.9505,35.6531,16.5953,225
-9.4816,-7.9338,11.5447,20.4156,-7.9338,7.3375,32.2058,28.3925,226
-5.2082,-10.2388,0.7011,3.9288,-10.2388,2.3796,16.653,9.3617,227
-2.1109,-9.2745,8.3296,10.4765,-9.2745,4.1428,20.279,18.984,228
-6.2021,-10.1992,12.0097,15.2641,-10.1992,10.2887,27.4212,22.6843,229
-15.1379,-9.9729,5.8091,8.8694,-9.9729,6.789,29.3335,13.5332,230
5.4418,-8.7476,14.0064,8.4039,-8.7476,6.0777,26.9564,20.353,231
-10.2927,-10.3458,-2.1587,4.369,-10.3458,3.8294,19.2559,7.1418,232
-6.8914,-10.0299,9.161,16.4143,-10.0299,7.3216,19.1294,13.2473,233
-19.0832,-9.8058,-0.6023,6.5909,-9.8058,6.5029,22.8866,12.9149,234
-6.4588,-9.988,7.6684,6.61,-9.988,4.1307,20.462,13.7776,235
-2.5593,-10.2774,3.0573,6.2519,-10.2774,5.7077,17.5206,14.0264,236
-9.1611,-9.7633,-3.7825,3.1588,-9.7633,4.0384,15.9244,12.3274,237
-15.1195,-10.4503,-4.7826,7.6746,-10.4503,5.3009,13.2951,10.0398,238
-0.0281,-10.0735,3.529,3.7517,-10.0735,2.2346,8.8663,6.2137,239
-34.2311,-9.6323,0.4072,11.7009,-9.6323,6.0592,19.2725,13.4708,240
-4.859,-9.8877,7.8762,14.9422,-9.8877,4.2147,32.5103,23.511,241
-22.6086,-9.8089,-2.6191,7.1621,-9.8089,6.7734,22.7747,16.3465,242
-0.7981,-10.1146,3.0561,3.1448,-10.1146,6.0015,19.2635,15.6139,243
-2.8293,-9.9389,5.6084,10.45,-9.9389,9.3707,31.7828,14.4172,244
-18.3666,-9.9962,4.8411,11.0568,-9.9962,7.6205,25.3061,15.1357,245
-9.6708,-9.8364,3.3978,10.3186,-9.8364,8.5193,25.0033,15.7412,246
-2.8152,-9.9099,3.5757,6.2978,-9.9099,5.0711,15.3706,10.0114,247
-4.6003,-9.4763,0.5162,2.2762,-9.4763,3.7101,22.7557,10.3859,248
-20.7135,-9.6835,2.6284,12.4771,-9.6835,8.7858,25.6769,15.866,249
-23.0882,-9.8727,8.5311,23.778,-9.8727,13.8089,39.9948,20.1029,250
-6.8258,-9.5392,0.7982,12.2196,-9.5392,5.3315,19.8811,11.5671,251
-46.0971,-9.8201,31.2987,69.4264,-9.8201,10.9361,28.6894,16.3012,252
-13.8646,-10.0227,-1.6598,7.43,-10.0227,6.3767,30.1607,9.1571,253
-5.311,-9.436,3.7782,8.7731,-9.436,5.4511,23.5451,9.7095,254
-12.11,-9.8086,12.4116,17.1712,-9.8086,10.3817,27.8175,15.534,255
-2.3095,-9.8329,0.4565,2.0367,-9.8329,2.663,10.5282,5.5436,256
-0.9372,-10.101,16.3009,24.4703,-10.101,17.1232,31.5708,28.8196,257
-32.404,-9.8269,2.9963,21.5808,-9.8269,7.1129,28.9608,21.9146,258
-7.6457,-9.671,-2.3251,3.3029,-9.671,2.8919,19.6218,9.2529,259
-1.2383,-9.8488,9.2664,12.2729,-9.8488,7.8757,22.8967,17.0767,260
-1.4071,-9.2914,1.3552,1.7305,-9.2914,2.9205,20.4043,13.0171,261
-5.2282,-9.9655,2.9499,4.5615,-9.9655,6.7965,20.7191,14.9834,263
-6.8927,-9.9375,3.2151,8.0614,-9.9375,6.9448,23.153,9.5897,264
-15.6643,-9.9692,7.0804,13.6663,-9.9692,8.0554,24.7611,13.3971,265
0.0949,-9.8929,5.5441,3.5759,-9.8929,2.3992,20.8672,13.8038,266
-0.0705,-9.9651,5.6434,2.7923,-9.9651,4.5363,17.9075,13.2797,267
-7.8931,-10.1052,-2.5037,4.061,-10.1052,4.6912,14.8378,10.9671,268
-2.8232,-9.9974,-0.1781,1.7989,-9.9974,2.9337,18.2123,16.8736,269
-8.4757,-9.5671,1.6975,3.9623,-9.5671,6.3525,18.5161,8.4631,270
-1.3568,-9.8066,1.1617,1.4569,-9.8066,3.2794,13.8234,9.2919,271
-11.6767,-9.9461,13.4027,18.2413,-9.9461,7.8861,28.3447,19.8322,273
-20.4739,-10.0331,1.5903,9.4077,-10.0331,7.0612,22.3334,13.2156,274
-4.8041,-10.3888,6.7772,8.7858,-10.3888,8.3148,24.631,18.789,275
-5.5627,-9.7294,-1.3911,3.6425,-9.7294,4.2133,15.4125,11.155,276
-3.615,-10.4133,0.2552,2.6955,-10.4133,5.9118,16.851,11.2106,277
0.1258,-9.88,2.3138,2.327,-9.88,3.2117,21.5631,19.483,278
-1.4409,-9.5789,-0.221,0.6553,-9.5789,1.9815,16.1577,14.4645,279
-2.006,-9.9569,0.2308,1.4604,-9.9569,1.5958,10.1977,6.9388,280
-5.3125,-9.8017,-1.6592,2.261,-9.8017,1.4934,14.3939,10.2023,281
-4.7356,-9.9864,19.2636,18.4893,-9.9864,12.8813,61.2712,30.5732,283
-16.0635,-9.837,2.7655,7.5432,-9.837,3.8701,26.6802,19.4768,284
-1.6875,-10.3192,7.7193,7.5976,-10.3192,4.4104,26.4433,19.1039,285
-0.851,-10.0353,3.176,3.5027,-10.0353,3.8072,19.2313,17.063,286
-0.1023,-10.1513,4.3518,3.7563,-10.1513,2.7971,27.4511,15.6879,287
-8.4028,-9.9827,0.4868,5.7359,-9.9827,1.2627,40.4937,37.6242,288
-3.5355,-9.9331,8.7496,7.4141,-9.9331,8.7958,30.9749,21.4916,289
-25.6271,-9.8207,0.2563,7.057,-9.8207,2.7295,43.3917,29.921,290
-4.8144,-10.2141,9.1701,9.1681,-10.2141,4.0422,23.351,21.6728,291
-5.2041,-9.9918,4.1286,9.1274,-9.9918,7.577,30.0516,14.3484,293
-2.4039,-9.9145,3.2726,5.9332,-9.9145,5.1484,27.288,11.6305,294
-3.8235,-9.8712,5.7895,6.6881,-9.8712,8.1777,19.0184,14.2856,295
-7.7129,-9.7199,-0.4066,4.3275,-9.7199,3.7756,16.8452,9.9389,296
-1.7269,-10.7593,-0.0116,0.8003,-10.7593,0.7355,13.2582,7.1384,297
-5.2951,-9.4954,-1.2922,1.8137,-9.4954,2.9897,10.4577,6.3861,298
-1.4605,-9.6921,9.3443,8.7786,-9.6921,4.6183,15.0076,13.3174,299
-2.519,-9.7984,0.8746,2.7224,-9.7984,2.9793,15.5699,6.5011,301
-2.5501,-10.1322,4.0547,6.6397,-10.1322,7.7911,19.9234,15.652,302
-4.3051,-9.3534,2.5078,4.1398,-9.3534,2.6444,16.7441,10.0361,303
-2.5554,-9.8853,-0.2893,1.2802,-9.8853,2.5429,10.5649,6.9122,305
-2.032,-10.0998,2.2155,4.7879,-10.0998,4.3095,15.0182,9.1669,306
-1.4674,-9.8499,0.3279,0.9601,-9.8499,3.0262,9.41,6.3395,307
-0.5596,-9.7302,0.2324,0.5561,-9.7302,3.1335,10.2464,8.8251,308
-0.3676,-9.9428,0.7758,0.7491,-9.9428,1.2199,7.5627,6.5711,309
-0.6646,-10.4473,-0.0234,0.5387,-10.4473,1.491,14.7326,4.6197,310
-1.811,-10.2109,1.4459,2.196,-10.2109,3.9193,11.4188,7.946,311
-8.1996,-9.0073,2.3124,7.6305,-9.0073,3.7532,18.4672,17.215,312
-1.5402,-9.98,-0.4105,0.6492,-9.98,1.5586,9.0093,6.3204,313
-0.0031,-9.8444,0.3858,0.3363,-9.8444,2.3034,8.9238,7.5289,314
-1.5126,-9.9564,1.8283,3.165,-9.9564,3.8674,15.3648,8.3209,315
-0.8104,-10.1052,0.2489,0.9358,-10.1052,1.0931,9.2869,5.3984,316
-2.3146,-9.9398,0.6341,1.3663,-9.9398,3.2798,9.9207,6.2197,317
-0.2135,-9.8125,1.3709,1.0748,-9.8125,3.1318,7.5133,6.1408,318
-2.2159,-9.8375,1.2399,2.7401,-9.8375,3.5004,11.6289,7.6882,319
-1.8265,-10.195,1.1279,2.7956,-10.195,1.7196,12.4464,9.9794,320
-0.8076,-9.8935,0.4134,0.8146,-9.8935,1.5884,9.0189,5.1494,321
-2.7641,-8.9638,1.7946,4.2184,-8.9638,5.5861,19.8723,15.4966,322
-0.2056,-9.8731,1.4902,1.4828,-9.8731,2.7368,6.6606,5.5891,323
-2.6544,-9.8446,-0.4313,1.3083,-9.8446,1.8856,15.2601,6.5486,324
-3.8201,-9.7842,0.1898,2.2456,-9.7842,2.9695,11.9565,7.4558,325
-1.0942,-9.9141,-0.1875,0.4416,-9.9141,1.3655,16.418,11.4441,326
-0.5803,-9.9837,0.0434,0.3246,-9.9837,0.9877,12.47,7.6715,327
-1.3577,-9.8263,-0.2499,0.7475,-9.8263,1.6339,13.0762,12.7146,328
-3.4761,-9.8843,1.2239,3.6472,-9.8843,3.9711,12.785,8.4315,329
-0.6019,-9.9817,1.7947,2.3081,-9.9817,0.8426,23.1887,17.0666,330
-1.3517,-9.9363,0.6569,1.4937,-9.9363,3.1584,9.6042,7.5994,331
-0.7592,-9.9368,-0.1313,0.3685,-9.9368,0.4313,5.0519,4.0433,332
-1.0816,-9.9915,0.7028,0.938,-9.9915,0.889,8.3916,6.2228,333
-0.3046,-9.9253,-0.0379,0.1143,-9.9253,0.5202,2.6823,1.5576,334
-0.8725,-10.04,0.3238,0.6021,-10.04,2.4248,9.2451,7.054,335
-0.7273,-10.0107,0.0238,0.297,-10.0107,0.7728,6.7624,3.1061,336
-0.9811,-9.8339,0.081,0.4645,-9.8339,0.8235,5.7759,2.6247,337
-1.3024,-9.9161,-0.0848,1.0063,-9.9161,0.4612,6.8228,5.6835,338
-0.49,-10.1071,1.5881,1.5931,-10.1071,2.565,20.8149,9.7917,339
-2.3135,-9.8364,2.7323,3.1614,-9.8364,1.4829,11.7915,10.1249,340
-5.4125,-9.9362,-0.4917,1.5348,-9.9362,2.2941,13.6343,4.7012,341
-4.2215,-9.9282,-1.4243,2.7354,-9.9282,3.3361,16.3088,15.1478,342
-1.9555,-9.8794,-0.7587,1.0754,-9.8794,1.4488,3.9053,2.7775,343
-6.2025,-9.883,1.4304,3.413,-9.883,3.9024,14.2052,7.4211,344
-0.7405,-9.9334,-0.0124,0.5032,-9.9334,1.591,10.4153,8.4807,345
-2.8819,-9.9468,-0.1885,2.1802,-9.9468,1.3124,12.7507,10.4096,346
-5.8883,-9.8296,-3.7368,1.666,-9.8296,0.834,4.854,4.0929,347
-1.1033,-9.859,1.4273,2.4962,-9.859,2.2997,5.367,1.4082,348
-17.394,-9.8541,-2.1686,8.5833,-9.8541,5.694,9.1089,5.9987,349
-2.3197,-9.8223,2.3276,1.6087,-9.8223,1.2175,5.2791,3.9019,350
-1.1436,-9.857,-0.7132,0.3375,-9.857,0.2458,2.2343,1.582,351
-1.3481,-9.8561,-0.0438,1.1483,-9.8561,1.0175,2.2433,1.4705,352
-0.5725,-9.8796,1.4459,3.2654,-9.8796,2.035,5.6203,2.7289,353
-60.7432,-9.7234,-14.7154,18.8289,-9.7234,5.5698,21.9082,7.6165,354
-44.8994,-9.5513,-8.2642,23.1797,-9.5513,8.0168,13.4127,7.9543,355
-54.0087,-9.7708,-13.5766,25.1827,-9.7708,7.7708,33.5953,15.791,356
-7.0631,-9.8257,-0.5088,3.2965,-9.8257,4.0293,21.0395,11.1843,357
0.1726,-9.8949,13.0594,12.1064,-9.8949,6.3789,18.3005,8.2707,358
2.9641,-9.7953,8.1549,4.6397,-9.7953,3.7055,45.9737,42.3579,359
-7.2006,-9.9043,3.7704,5.9225,-9.9043,7.2437,29.2894,12.7497,360
-0.1365,-10.4226,7.4215,5.7903,-10.4226,9.2176,30.4071,21.8817,361
-2.662,-9.7394,16.6365,16.2236,-9.7394,4.2733,20.9459,18.4444,362
-0.6564,-9.9419,0.4996,0.6654,-9.9419,2.7149,9.3466,6.7325,363
-18.6933,-9.9653,-0.5764,4.8734,-9.9653,3.7985,14.722,4.4709,364
-4.077,-9.9255,1.297,3.0107,-9.9255,6.4794,14.6419,9.7463,365
-1.1709,-10.1181,0.8552,1.1179,-10.1181,2.2679,9.2842,8.1752,366
-4.3059,-9.8749,1.9411,3.5119,-9.8749,3.1452,11.4546,9.874,367
-0.1249,-9.9209,0.9457,0.5883,-9.9209,1.1609,4.9913,3.8038,368
-0.1433,-9.9627,0.1231,0.3022,-9.9627,0.6551,6.8151,5.2642,369
-4.2579,-9.9395,-0.2749,1.4696,-9.9395,2.7826,7.2053,5.5026,370
-20.4087,-9.8598,-5.9413,5.619,-9.8598,2.7441,11.4351,6.967,371
-5.8031,-9.7337,1.8515,5.3043,-9.7337,2.7253,4.2256,2.5919,373
-1.2839,-9.8108,0.8008,1.0747,-9.8108,0.7713,1.9264,1.3046,374
-5.8485,-9.7973,-1.9905,2.5319,-9.7973,1.6913,3.6279,2.3463,375
-2.6528,-9.7689,0.1431,1.8314,-9.7689,1.1982,2.2765,1.7578,376
-1.1253,-9.7707,0.7172,1.1772,-9.7707,0.6009,1.609,1.1414,377
-0.5394,-9.7507,0.7185,0.7851,-9.7507,0.4531,1.577,1.0962,378
2.7511,-9.7456,4.4187,1.0057,-9.7456,0.596,3.253,2.8901,379
-6.0166,-9.7735,-1.6379,2.4117,-9.7735,1.4349,3.0094,1.9194,380
0.5528,-9.7548,1.753,0.9009,-9.7548,0.5433,1.9281,1.4853,381
-0.1748,-9.7566,1.6787,0.8432,-9.7566,0.4887,1.8488,1.2875,383
-1.8935,-9.7683,-0.1183,1.0236,-9.7683,0.6171,1.549,1.0937,384
1.2314,-9.7753,1.577,0.2564,-9.7753,0.1506,1.6425,1.4216,385
0.798,-9.7827,0.9566,0.136,-9.7827,0.0955,1.4128,1.1777,386
-1.1685,-9.7853,0.4035,1.1399,-9.7853,0.7021,1.599,1.2022,387
1.1232,-9.7819,2.0365,0.418,-9.7819,0.3,1.8094,1.6876,388
-3.8283,-9.8242,0.1682,2.142,-9.8242,2.4985,5.3871,1.7759,389
-9.0685,-9.752,-2.1438,3.0561,-9.752,1.7482,4.9439,1.7041,390
-6.4807,-9.7247,-3.6224,2.8517,-9.7247,1.4309,3.3511,2.6408,391
-3.4435,-9.6919,-0.8269,1.4975,-9.6919,0.7254,2.2752,1.6873,393
0.4125,-9.6969,2.0323,1.5067,-9.6969,0.7252,2.7255,1.3467,394
-0.5246,-9.7117,1.5608,1.003,-9.7117,0.5095,1.7036,1.5557,395
1.2964,-9.7247,1.8937,0.5381,-9.7247,0.3136,1.6926,1.4372,396
1.3984,-9.7255,1.741,0.1839,-9.7255,0.1206,1.5372,1.406,397
0.0531,-9.7226,0.5938,0.3705,-9.7226,0.1941,1.5198,1.2655,398
1.0476,-9.7304,1.3805,0.2869,-9.7304,0.1536,1.5204,1.3341,399
-0.2057,-9.7329,0.9794,0.7917,-9.7329,0.4351,1.7626,1.279,400
-1.6081,-9.74,-0.996,0.6667,-9.74,0.3693,2.1932,1.4484,401
-0.6418,-9.7199,0.4064,0.6784,-9.7199,0.36,1.6191,1.2839,403
-1.8008,-9.7566,1.4679,1.5222,-9.7566,0.9125,2.3134,1.8667,404
-1.9562,-9.7586,-0.6319,0.8186,-9.7586,0.4708,1.5879,1.0575,405
1.496,-9.758,1.7416,0.1663,-9.758,0.0986,1.6426,1.5219,406
-0.3079,-9.7713,0.2515,0.4718,-9.7713,0.2937,1.2919,1.1258,407
1.1034,-9.767,1.2926,0.0943,-9.767,0.0506,1.3575,1.3096,408
0.5812,-9.7668,0.6742,0.0692,-9.7668,0.0443,1.1724,1.104,409
0.5018,-9.7656,0.7293,0.143,-9.7656,0.0864,1.2362,1.1432,410
0.6428,-9.7643,0.9107,0.1699,-9.7643,0.1004,1.2677,1.2123,412
0.8103,-9.7687,0.8676,0.0534,-9.7687,0.0342,1.2198,1.1509,413
0.7023,-9.7685,0.7822,0.0672,-9.7685,0.0373,1.2328,1.1595,414
0.9156,-9.7712,1.0783,0.0792,-9.7712,0.0473,1.2727,1.2388,415
0.7934,-9.773,0.8707,0.0645,-9.773,0.0411,1.2839,1.2167,416
0.6306,-9.7738,0.7162,0.0588,-9.7738,0.0362,1.2146,1.1513,417
0.8227,-9.7702,0.9694,0.0968,-9.7702,0.057,1.3078,1.2017,418
0.8319,-9.7712,0.8767,0.0403,-9.7712,0.027,1.219,1.1977,419
0.1202,-9.7652,0.4825,0.2405,-9.7652,0.1441,1.182,1.1231,420
-2.5968,-9.7574,-0.1379,1.8422,-9.7574,1.1103,6.126,2.6793,421
2.3012,-9.7745,2.7611,0.3628,-9.7745,0.148,2.3436,1.8395,422
0.1425,-9.7908,0.4523,0.2947,-9.7908,0.1954,1.2633,1.2025,423
-0.2776,-9.8011,0.6407,0.6046,-9.8011,0.4148,1.4101,1.2628,424
-0.0124,-9.7957,0.8118,0.71,-9.7957,0.4714,1.8614,1.1459,425
0.3929,-9.8015,1.4758,0.763,-9.8015,0.5401,1.9677,1.3629,426
-0.7737,-9.7967,0.1174,0.709,-9.7967,0.4739,1.372,1.2984,427
-0.3051,-9.808,0.8973,0.8016,-9.808,0.5768,1.811,1.0928,428
-1.312,-9.7889,-0.6457,0.7256,-9.7889,0.4533,1.4698,1.337,429
0.555,-9.8211,2.4856,1.5758,-9.8211,1.1177,3.5517,2.5429,430
-0.3915,-9.8135,0.4275,0.6676,-9.8135,0.4799,1.5072,1.2259,431
0.7019,-9.8188,1.0248,0.1904,-9.8188,0.144,1.4272,1.2941,432
1.5866,-9.825,1.7592,0.1506,-9.825,0.1366,1.9324,1.6957,433
-1.9232,-9.8253,5.999,5.3308,-9.8253,4.0764,11.6111,10.4528,434
-8.4464,-9.8613,-2.3191,3.2874,-9.8613,3.1385,8.3371,6.4225,435
0.5501,-9.8691,2.8741,1.8086,-9.8691,1.5008,5.6924,3.5901,436
-2.3506,-9.8809,-0.3844,0.7488,-9.8809,0.9934,3.0023,1.1663,437
-2.4077,-9.8521,-1.2552,0.9925,-9.8521,0.9236,2.4087,1.4177,438
-3.5007,-9.8575,0.0043,2.1146,-9.8575,2.0298,3.149,2.1849,439
-3.4044,-9.8196,-1.1938,1.0764,-9.8196,0.6719,2.2109,1.4606,440
-1.8395,-9.8316,-0.2268,0.9481,-9.8316,0.7489,1.6681,1.2351,441
-0.5151,-9.8339,0.5274,0.6908,-9.8339,0.5708,1.8091,1.1803,443
-0.6962,-9.8191,0.3027,0.5301,-9.8191,0.3926,1.2918,1.1768,444
0.6339,-9.8199,0.795,0.1068,-9.8199,0.0788,1.3131,1.2317,445
-0.0069,-9.8195,0.3684,0.2497,-9.8195,0.1898,1.2538,1.1306,446
0.2267,-9.8183,0.462,0.1684,-9.8183,0.1223,1.2078,1.1357,447
0.4548,-9.8229,0.8136,0.2109,-9.8229,0.1562,1.3506,1.2815,448
0.333,-9.8166,0.5532,0.1595,-9.8166,0.1179,1.2428,1.1443,449
0.528,-9.8194,0.7185,0.1031,-9.8194,0.073,1.2083,1.1844,450
0.2204,-9.821,0.6402,0.1874,-9.821,0.1403,1.2989,1.1736,451
0.3435,-9.8208,0.5624,0.1129,-9.8208,0.0863,1.2166,1.1494,453
0.2961,-9.8204,0.4921,0.1052,-9.8204,0.0793,1.197,1.1535,454
0.5663,-9.8184,0.6486,0.0658,-9.8184,0.05,1.191,1.1574,455
0.3599,-9.8184,0.555,0.0964,-9.8184,0.0809,1.3427,1.2434,456
-0.1777,-9.8161,0.2108,0.323,-9.8161,0.2316,1.2029,1.1243,457
0.7116,-9.8217,0.8612,0.1097,-9.8217,0.0808,1.3049,1.2665,458
0.1761,-9.8202,0.2856,0.1037,-9.8202,0.0789,1.1296,1.1077,459
0.4762,-9.8106,0.6741,0.0968,-9.8106,0.0708,1.2342,1.1826,460
0.827,-9.812,1.0244,0.1454,-9.812,0.1129,1.4347,1.3176,461
0.1434,-9.8081,0.3794,0.1618,-9.8081,0.1175,1.2118,1.0766,462
0.6161,-9.8139,0.7979,0.1586,-9.8139,0.1212,1.3151,1.1601,463
0.5555,-9.8222,0.6201,0.0727,-9.8222,0.0612,1.2929,1.1946,464
0.3343,-9.8212,0.7268,0.2323,-9.8212,0.1696,1.3313,1.1728,465
0.4297,-9.8184,0.6165,0.1342,-9.8184,0.0984,1.1934,1.1244,466
0.3454,-9.8251,0.6175,0.1719,-9.8251,0.1338,1.3126,1.145,467
0.3599,-9.8252,0.4251,0.0516,-9.8252,0.0396,1.1808,1.1331,468
0.3171,-9.8222,0.4715,0.1106,-9.8222,0.0872,1.1978,1.141,469
0.4753,-9.8228,0.6684,0.0973,-9.8228,0.0726,1.2827,1.1724,470
0.4638,-9.8244,0.5226,0.049,-9.8244,0.0378,1.1851,1.15,471
0.4184,-9.8211,0.5803,0.0918,-9.8211,0.0723,1.205,1.1644,473
0.4623,-9.8231,0.681,0.2005,-9.8231,0.1535,1.3637,1.1852,474
0.4178,-9.8272,0.4957,0.0749,-9.8272,0.0615,1.1909,1.111,475
0.6354,-9.8249,0.713,0.0621,-9.8249,0.0444,1.3048,1.2247,476
0.503,-9.8248,0.6116,0.0558,-9.8248,0.0433,1.2284,1.1784,477
0.3356,-9.824,0.4219,0.0563,-9.824,0.0434,1.1688,1.1025,478
0.4577,-9.8233,0.5482,0.0731,-9.8233,0.058,1.2445,1.1518,479
0.3447,-9.8246,0.5752,0.116,-9.8246,0.0892,1.2508,1.1543,480
0.7401,-9.8261,0.8565,0.0617,-9.8261,0.0471,1.3444,1.2711,481
0.5926,-9.826,0.7853,0.1309,-9.826,0.1037,1.3315,1.2359,482
0.4964,-9.8235,0.544,0.0312,-9.8235,0.0244,1.198,1.1437,483
0.5681,-9.8151,1.3081,0.7113,-9.8151,0.4631,1.9126,1.1683,484
-0.6939,-9.844,0.0755,0.4893,-9.844,0.4807,1.4327,1.0848,485
-0.959,-9.8386,-0.1832,0.5574,-9.8386,0.4629,1.351,1.1377,486
0.0745,-9.8395,0.4873,0.3493,-9.8395,0.3116,1.4153,1.1411,487
0.5798,-9.8399,1.1541,0.2482,-9.8399,0.1962,1.6083,1.4997,488
-0.2709,-9.8316,1.1691,1.0857,-9.8316,0.8782,2.5387,1.1975,489
-0.8728,-9.8402,0.4395,0.9157,-9.8402,0.8048,2.2818,1.1833,490
-0.549,-9.8366,0.0099,0.3822,-9.8366,0.299,1.3407,1.0726,491
-0.9426,-9.8313,-0.3112,0.5209,-9.8313,0.4083,1.1202,0.9364,493
0.1517,-9.8464,0.9322,0.427,-9.8464,0.3737,2.0323,1.359,494
-0.1171,-9.8502,-0.0244,0.0858,-9.8502,0.0816,0.9899,0.7847,495
1.0714,-9.8309,1.6729,0.6617,-9.8309,0.462,2.5865,1.7132,496
-0.6116,-9.8553,-0.3852,0.1662,-9.8553,0.1517,1.599,1.4305,497
-0.898,-9.8602,1.1841,1.3261,-9.8602,1.3006,3.2105,1.6713,499
-1.1969,-9.8534,0.2344,0.6827,-9.8534,0.6412,1.8022,1.1815,500
0.6881,-9.8571,0.7527,0.0609,-9.8571,0.0563,1.387,1.2719,502
0.043,-9.8567,0.1637,0.0778,-9.8567,0.0739,1.1381,1.037,503
-0.1999,-9.8527,0.4218,0.3806,-9.8527,0.3614,1.5634,1.1402,504
-0.2452,-9.8503,-0.0822,0.0942,-9.8503,0.0847,1.212,1.1559,505
0.1558,-9.8441,0.2272,0.0854,-9.8441,0.0746,1.1166,1.0725,507
0.1753,-9.8491,0.294,0.0762,-9.8491,0.0783,1.2223,1.0723,508
0.1629,-9.8407,0.4891,0.1958,-9.8407,0.1627,1.3066,1.1346,509
-2.4284,-9.857,0.4873,1.8675,-9.857,1.8302,3.8779,1.7449,510
-6.5449,-9.837,-3.6895,2.0639,-9.837,1.3488,4.8429,3.897,511
-10.3206,-9.7346,-3.9235,4.0277,-9.7346,2.0961,6.0146,3.7572,513
1.4312,-9.7765,8.5592,4.9148,-9.7765,2.9744,32.0911,24.0499,514
-3.6731,-9.9515,2.3235,4.7207,-9.9515,3.7396,18.0174,11.9371,515
-10.8437,-9.8684,-0.9682,5.1376,-9.8684,1.82,24.0016,17.7424,516
-3.7012,-10.0229,-0.5144,1.7666,-10.0229,3.0858,16.3623,11.4015,519
-3.516,-9.9424,3.5866,6.4844,-9.9424,4.7133,14.034,8.8176,520
-1.035,-9.7683,0.5019,1.4229,-9.7683,2.5882,12.3864,5.9066,521
-1.9467,-10.1164,1.5798,2.5605,-10.1164,1.5765,8.7817,5.7407,522
-1.9065,-10.1806,0.2913,1.5005,-10.1806,3.6648,10.0841,6.0976,523
-12.2481,-9.8878,-0.9864,3.4688,-9.8878,5.7761,19.5536,4.7749,524
-1.2891,-9.9104,0.2861,1.301,-9.9104,2.7828,8.725,4.8407,525
-3.3522,-10.0595,0.7836,2.0198,-10.0595,5.1469,11.9851,9.215,526
-3.0628,-9.662,0.1976,1.5863,-9.662,3.6647,23.9863,8.0394,527
-0.8872,-10.1115,1.4769,2.0749,-10.1115,2.2896,9.9708,9.087,528
-4.0175,-9.9988,0.5894,2.3143,-9.9988,0.216,10.2622,7.3176,529
-0.7573,-9.9975,1.3955,1.0957,-9.9975,1.5678,11.5611,9.6268,530
-0.8557,-9.8907,0.1495,0.6285,-9.8907,1.8294,6.4521,4.6864,531
-1.4396,-9.8738,0.2841,0.7415,-9.8738,0.5942,5.7685,4.51,533
-1.4642,-9.9037,0.6828,1.1097,-9.9037,4.0209,12.7016,5.5757,534
-1.1263,-9.9474,0.1635,0.5596,-9.9474,1.309,4.8047,3.5054,535
-0.5734,-9.7649,-0.0152,0.2499,-9.7649,0.9175,2.7983,2.3085,536
-0.0108,-10.1536,0.4239,0.28,-10.1536,0.3918,6.0529,4.3924,537
-0.1468,-9.8317,-0.0275,0.1036,-9.8317,0.5797,4.6028,3.513,538
-0.2103,-9.9471,-0.02,0.1003,-9.9471,0.6751,3.0275,2.4277,539
-2.5987,-9.8519,0.1234,0.9919,-9.8519,2.5202,12.0725,5.1698,540
-2.9913,-10.3,0.5192,1.5634,-10.3,1.0507,9.2205,6.6618,541
-0.848,-9.9781,0.1092,0.5165,-9.9781,2.2203,5.7669,3.3683,543
-1.0769,-9.9322,0.1509,0.621,-9.9322,2.6648,7.372,5.5987,544
-0.498,-9.7973,-0.0073,0.3177,-9.7973,0.2319,3.4615,2.2249,545
-0.3958,-9.5714,-0.0935,0.1443,-9.5714,0.508,5.6602,1.5296,546
-1.1638,-9.8025,-0.0933,0.4719,-9.8025,2.4212,9.6753,8.6727,547
-0.21,-9.7849,0.0268,0.1095,-9.7849,1.1383,7.7267,5.5886,548
-0.6943,-10.1048,-0.1186,0.3114,-10.1048,0.8948,3.7013,2.5465,549
-0.7064,-9.9554,-0.0028,0.3664,-9.9554,1.4171,4.5813,3.1886,550
-0.489,-9.9216,0.0053,0.2858,-9.9216,0.4881,4.1839,2.6817,551
-1.0534,-9.9169,0.0107,0.3788,-9.9169,1.5142,7.1626,2.924,553
-0.9352,-9.9392,-0.12,0.3956,-9.9392,1.1477,3.8148,2.6224,554
-0.1428,-9.9965,0.0067,0.1314,-9.9965,0.5214,1.7501,1.4832,555
-0.1086,-10.0172,0.034,0.1174,-10.0172,0.5118,6.0776,4.1477,556
-1.6215,-9.7877,2.0118,2.4593,-9.7877,1.9418,12.4451,8.1949,558
-1.6484,-9.9728,1.3372,2.606,-9.9728,3.2951,18.0551,12.3391,559
-3.562,-9.9188,0.161,2.2231,-9.9188,3.1635,14.4013,7.7802,560
-0.3864,-9.8587,0.3263,0.581,-9.8587,1.2606,9.3277,5.3488,561
-2.2224,-10.2111,1.9945,3.2997,-10.2111,1.6144,12.7928,9.1085,563
-94.1315,-10.0544,-4.5735,16.1735,-10.0544,5.6574,59.0272,33.455,564
-21.4161,-9.7721,1.2186,7.1752,-9.7721,2.9646,35.5736,11.6439,565
-13.4229,-9.8484,-0.9486,4.7051,-9.8484,5.3412,16.0137,11.9733,566
-12.5446,-9.8895,-0.3859,3.3082,-9.8895,5.101,44.1098,21.8215,567
-2.0836,-9.9414,0.0966,1.3221,-9.9414,2.2853,45.3563,43.0993,568
-0.3539,-9.7947,7.9281,5.9644,-9.7947,2.8603,44.4379,41.9275,569
-6.5281,-9.8935,1.6361,6.2611,-9.8935,3.2639,26.4809,20.3986,570
-5.0272,-9.9565,-0.3282,2.946,-9.9565,1.06,29.8734,23.088,571
-7.2505,-10.0151,6.4196,11.1752,-10.0151,2.6185,21.688,18.986,573
-30.4742,-9.2604,3.4158,13.7219,-9.2604,14.2025,67.5372,25.1935,574
-2.5681,-9.9824,-0.3688,1.234,-9.9824,1.9725,13.8266,11.1475,575
0.3134,-9.7279,4.4063,3.4788,-9.7279,1.1318,10.4688,9.4706,576
-0.4011,-9.9405,2.9006,1.8117,-9.9405,1.3427,13.7594,11.6242,577
-0.6999,-9.6321,-0.155,0.4609,-9.6321,1.6775,5.3277,3.0806,578
-0.446,-9.8534,0.5457,0.8894,-9.8534,2.2933,6.0559,4.9261,579
-3.4851,-9.8734,2.6588,4.0696,-9.8734,6.5727,16.5783,11.3979,580
-4.7482,-10.2734,-1.8852,1.7945,-10.2734,6.5371,25.5853,6.4031,581
-4.9769,-9.8425,1.8307,5.1499,-9.8425,3.4492,14.1962,7.3528,583
-11.8514,-9.8754,2.106,7.3883,-9.8754,7.706,20.3181,8.7503,584
-1.1386,-9.6769,0.5122,1.3218,-9.6769,4.0204,7.6032,5.9785,585
0.0312,-9.6596,0.9188,0.751,-9.6596,2.1024,11.6921,7.9622,586
-0.2495,-10.0,0.7409,0.5961,-10.0,0.5652,6.1893,4.676,588
-2.0972,-10.1301,-0.2354,1.4553,-10.1301,1.6415,9.1833,5.774,589
0.3725,-10.0302,0.5949,0.1673,-10.0302,0.8628,5.0644,4.0356,590
-1.928,-9.916,0.4668,1.1406,-9.916,4.5642,9.2582,6.2242,591
-0.094,-9.9994,0.5487,0.4767,-9.9994,0.6027,4.9768,3.5812,593
-0.8086,-9.9927,0.6715,1.0191,-9.9927,0.3813,6.1736,4.4805,594
-0.8089,-9.8625,0.0288,0.4098,-9.8625,1.3671,7.8195,3.5261,595
-1.1914,-10.0777,0.0349,1.0674,-10.0777,2.3556,9.1108,4.9708,596
-27.7817,-10.127,1.6379,14.1754,-10.127,4.7785,38.5836,22.6927,597
-1.5457,-9.5208,0.2126,1.6576,-9.5208,2.2813,9.6793,5.7945,598
-3.747,-11.7728,-0.0113,2.7995,-11.7728,2.2342,36.5245,18.5369,599
-1.578,-10.0356,-0.2533,0.6638,-10.0356,1.7579,9.1162,8.6641,600
-0.7007,-9.6609,1.4603,2.3426,-9.6609,3.5684,11.3803,8.2313,601
-1.3805,-9.5674,-0.4716,0.6495,-9.5674,2.0368,11.2676,8.6502,602
-13.5291,-9.5402,-3.4758,5.7138,-9.5402,2.7083,18.2572,12.1045,603
-2.6857,-10.4463,2.6487,4.035,-10.4463,2.4832,13.1956,11.2674,604
-0.1015,-10.0022,0.1023,0.2602,-10.0022,1.0678,6.5104,5.5263,605
-0.5933,-10.1368,-0.1062,0.3155,-10.1368,0.5773,7.2515,4.0074,606
-0.6019,-10.1084,0.673,1.0931,-10.1084,2.9755,6.9718,5.5638,607
-4.1456,-9.9183,-0.4704,1.5505,-9.9183,1.762,12.7096,10.5232,608
-1.0057,-9.8764,0.0782,0.6372,-9.8764,2.4253,9.3274,6.0938,609
-0.7949,-9.8357,0.6759,0.8158,-9.8357,1.7087,8.1369,7.5762,610
-1.2836,-9.9283,-0.0998,0.49,-9.9283,1.5551,7.5487,4.7489,611
-1.9057,-9.8636,-0.1124,0.7252,-9.8636,2.124,9.7431,7.3135,612
-1.5801,-10.1852,1.5336,1.848,-10.1852,1.1454,8.3563,7.4841,614
-1.8504,-10.0152,0.3216,1.2087,-10.0152,0.2912,11.1943,8.7931,615
1.6125,-10.0329,5.4648,4.1821,-10.0329,2.6055,18.2805,10.1344,616
-10.0291,-9.8669,-2.7313,6.2296,-9.8669,6.9338,12.3662,7.0802,617
-6.0407,-9.8781,2.2406,7.939,-9.8781,4.3771,20.4247,17.2724,618
-9.9883,-10.3085,-1.8236,3.6496,-10.3085,4.205,12.524,9.1801,619
-9.6715,-9.4027,1.103,5.5022,-9.4027,4.7253,18.7178,11.1846,620
-3.4471,-9.9063,1.5759,3.1561,-9.9063,4.4979,10.5452,8.0597,621
-3.209,-10.056,1.3764,2.9623,-10.056,3.1845,8.963,6.7897,623
-2.1222,-9.7739,2.173,3.1594,-9.7739,5.4058,12.2836,9.2465,625
-3.1482,-9.9506,1.9119,4.7888,-9.9506,4.9754,10.8446,9.1464,626
-0.298,-10.1588,0.4393,0.7068,-10.1588,0.9123,6.4739,4.1459,627
-1.878,-10.0094,0.5071,1.7918,-10.0094,2.5079,9.136,6.9614,628
-1.6299,-9.9368,0.7823,2.2175,-9.9368,1.4602,7.0694,5.2475,629
-0.3533,-9.962,0.4715,0.5359,-9.962,1.5891,7.6386,4.2578,630
-0.3709,-9.7564,0.0769,0.5328,-9.7564,3.0528,10.7358,8.9225,631
-1.172,-9.9367,0.2835,0.8444,-9.9367,1.3641,9.147,4.2653,633
-0.6623,-9.7746,0.974,1.0366,-9.7746,0.5481,9.1327,5.3982,634
-0.5397,-9.9819,-0.0046,0.203,-9.9819,0.8662,3.6387,2.1158,635
-0.4275,-9.7494,0.0739,0.507,-9.7494,0.8459,4.4613,3.5509,636
-0.48,-10.044,0.7076,0.6623,-10.044,1.8279,11.9403,10.0487,637
-2.3523,-9.8489,0.8569,2.0445,-9.8489,1.3448,9.3409,7.9244,638
-4.6326,-9.8415,0.702,2.978,-9.8415,0.9359,10.32,9.3017,639
-2.0775,-9.9843,0.3867,1.005,-9.9843,2.1632,22.0736,5.5717,640
-4.2232,-10.0076,1.7396,3.5412,-10.0076,9.0743,14.7671,11.1731,641
-1.7125,-9.911,0.9507,2.095,-9.911,3.863,17.2851,8.7637,643
-0.1734,-9.8768,-0.001,0.062,-9.8768,0.5246,5.4732,2.3899,644
-0.0396,-9.9856,0.0704,0.1777,-9.9856,0.7848,3.5949,2.4861,645
-0.1989,-9.8464,-0.0181,0.1576,-9.8464,1.2281,4.1951,3.355,646
-0.1978,-9.8531,-0.0121,0.1517,-9.8531,0.4613,3.2818,2.5084,647
-0.0926,-10.0015,0.0503,0.1194,-10.0015,0.4007,5.8205,4.2843,648
-0.3043,-9.796,0.1222,0.3492,-9.796,0.5885,3.6337,2.6125,649
-2.8854,-9.8458,0.4275,1.2827,-9.8458,4.0705,11.5766,7.527,650
-0.9634,-10.2516,0.2064,0.9646,-10.2516,1.7078,5.5267,3.8897,651
-2.0479,-9.9776,0.3476,1.0175,-9.9776,3.2341,8.6695,5.5377,653
-0.5298,-9.895,0.3314,0.6733,-9.895,2.3593,12.856,5.3538,654
-0.6297,-9.8639,0.6092,1.189,-9.8639,0.8431,5.1301,4.3597,655
-4.7551,-9.7068,-0.7576,3.9665,-9.7068,5.569,18.5714,14.2638,656
-4.9812,-9.9176,47.3414,29.8999,-9.9176,6.841,60.8185,54.5955,657
-1.4669,-9.7663,3.1934,5.0015,-9.7663,1.9977,10.4037,8.4048,658
-0.5009,-10.2951,4.6341,5.0849,-10.2951,2.7464,15.4118,9.6886,659
-4.3308,-9.8885,0.9232,2.3005,-9.8885,5.0299,13.299,10.0659,660
-0.0465,-9.8807,5.7456,5.0685,-9.8807,4.1325,14.0249,9.9274,661
-1.8585,-9.8796,0.2474,0.8899,-9.8796,2.8135,7.9251,4.2535,663
-1.7579,-9.8796,0.6943,1.4212,-9.8796,4.1683,7.4864,5.7214,664
-0.1189,-9.827,0.6096,0.7064,-9.827,0.96,4.8335,3.7442,665
-0.0871,-9.834,-0.0177,0.0606,-9.834,0.4665,11.384,4.5886,666
-2.4415,-9.9103,-0.6037,1.2077,-9.9103,2.0796,6.1222,4.3522,667
-2.0087,-9.9757,2.9046,3.5683,-9.9757,3.6114,10.8428,9.5111,668
-2.9797,-10.0678,7.314,6.2824,-10.0678,9.9012,34.7559,27.885,669
-1.2252,-9.9571,4.2065,4.3182,-9.9571,5.6835,17.0977,11.7819,670
-1.3403,-9.7594,-0.3831,0.8004,-9.7594,1.8923,8.1573,5.2409,671
-2.307,-10.0141,0.1686,1.4115,-10.0141,2.624,14.197,3.5216,673
-3.4911,-9.8347,0.9253,2.1121,-9.8347,4.1768,12.0446,6.7741,674
-3.1948,-9.3,-0.4006,1.2375,-9.3,0.758,11.3785,4.2529,675
-4.7334,-9.9315,0.7844,2.3174,-9.9315,5.5614,11.5511,8.2656,676
-0.653,-9.8603,0.5006,1.121,-9.8603,1.548,9.5711,5.6943,677
-1.1758,-9.8795,0.1522,0.8559,-9.8795,2.7272,5.7426,3.941,678
-1.0356,-10.0174,0.1818,0.568,-10.0174,2.2841,11.7524,5.2622,680
-2.2372,-9.9283,-0.072,0.654,-9.9283,1.5793,7.396,6.1214,681
-3.005,-10.115,-0.6015,1.2475,-10.115,0.6736,16.8813,15.5677,683
-14.4807,-10.142,8.7275,18.0642,-10.142,10.3939,59.6078,45.5503,684
-2.6623,-10.0046,1.5892,4.3174,-10.0046,4.4765,30.6934,29.6405,685
-9.6767,-10.7442,-2.1008,4.2977,-10.7442,4.8841,60.7672,51.5654,686
-16.3749,-10.0476,-2.7025,6.7436,-10.0476,2.4495,78.7087,74.3249,687
-6.7801,-10.1785,3.0782,5.2145,-10.1785,3.67,27.4005,8.588,688
-6.5153,-9.8285,0.7222,4.9046,-9.8285,2.4603,15.9623,13.7529,689
-2.9085,-9.4582,3.1699,3.7072,-9.4582,5.4368,36.0623,10.8359,690
-1.3195,-9.6618,2.5123,3.5763,-9.6618,5.7885,15.8273,14.4278,691
-0.1431,-10.2506,1.9805,2.6842,-10.2506,1.9593,15.6396,9.4658,693
-4.3425,-9.8711,2.34,5.0162,-9.8711,7.1096,25.4149,9.0585,694
-1.8139,-10.0341,1.3954,2.8179,-10.0341,4.7671,12.6222,10.8045,695
-1.2922,-10.1483,0.2504,0.8671,-10.1483,2.3699,4.6944,4.0653,696
-5.0941,-9.9167,1.3332,3.3818,-9.9167,0.8587,11.0672,10.3115,698
-1.7997,-10.0308,-0.2417,0.9518,-10.0308,1.3351,11.6007,10.643,699
-4.7538,-9.7039,1.7061,5.9056,-9.7039,4.4182,20.2035,18.6627,700
-6.3451,-10.0422,2.0543,4.5913,-10.0422,3.5329,19.1551,15.0149,701
-1.5104,-10.1203,0.2445,1.2459,-10.1203,2.6531,17.0195,16.3133,702
-1.1836,-10.25,-0.2013,0.5547,-10.25,1.6557,6.8998,3.4376,703
-1.3717,-9.8771,0.987,1.5594,-9.8771,3.0367,11.078,5.2198,704
-2.4633,-9.9146,-0.0782,0.9351,-9.9146,1.4302,7.272,3.7085,705
-0.4455,-9.9839,0.5176,0.8296,-9.9839,2.6877,12.5886,5.3899,706
-1.2823,-9.8703,0.6761,1.4072,-9.8703,1.3494,11.2596,5.2501,707
-0.6517,-9.887,0.2916,0.6038,-9.887,1.0916,13.1335,11.5213,708
-1.0155,-10.2608,0.582,1.0371,-10.2608,0.5546,7.2228,5.9946,709
-0.0613,-9.8393,1.3251,1.0356,-9.8393,0.4733,9.8261,7.1539,710
-1.9895,-9.9179,0.2658,1.6052,-9.9179,1.9774,13.2853,3.4115,711
-0.1457,-9.9995,1.135,0.7192,-9.9995,1.3332,11.9485,8.9717,712
-2.3062,-9.8411,2.0171,2.7377,-9.8411,1.0844,41.0238,20.0616,713
-1.3177,-9.8906,0.6547,1.3132,-9.8906,2.3122,14.3935,10.4621,714
-3.4395,-9.8809,0.6289,1.6009,-9.8809,3.571,23.0707,14.5908,715
-0.2241,-10.052,0.0371,0.2023,-10.052,0.8973,21.9205,20.6908,716
-2.4051,-9.9758,-0.0885,1.3786,-9.9758,2.0683,10.7084,8.2152,717
-2.5237,-9.8504,0.8286,2.1529,-9.8504,1.0654,30.6705,27.4099,718
-2.4953,-9.9213,-0.1746,1.0956,-9.9213,0.5547,14.2889,7.5866,719
-2.068,-9.8939,-0.0714,0.7637,-9.8939,2.1151,22.229,18.2513,720
-1.5438,-9.9118,2.5055,3.0044,-9.9118,5.1287,36.0705,16.8351,723
-9.1592,-9.9211,0.5659,4.9347,-9.9211,1.1185,37.193,28.6111,724
0.8522,-9.8693,3.9357,2.4178,-9.8693,2.3331,20.7848,13.8425,725
-4.0089,-9.9332,0.0349,2.2642,-9.9332,2.3827,28.3609,16.7638,726
-0.888,-9.4635,-0.4269,0.3617,-9.4635,1.6374,14.5466,13.0641,727
-92.5438,-9.7821,-3.5609,25.9701,-9.7821,9.1246,38.7967,16.377,729
-81.1179,-9.5965,-15.0851,26.2999,-9.5965,9.8454,29.6738,11.8957,730
-18.7309,-9.5347,23.4476,22.3371,-9.5347,6.5869,26.3798,17.7814,731
-18.3846,-9.916,6.1658,15.0919,-9.916,1.7362,21.8032,18.7109,732
-15.4967,-9.7637,-6.8535,5.8477,-9.7637,2.3489,52.5352,32.6095,733
1.1915,-9.7361,13.431,8.9814,-9.7361,1.9889,39.4746,29.3035,734
-8.8934,-9.9193,1.3882,7.4894,-9.9193,3.6079,11.9531,10.9748,735
-13.9358,-9.8679,5.4169,7.8382,-9.8679,3.9814,34.2985,19.6842,736
-1.9165,-10.356,2.2991,3.3251,-10.356,3.9108,32.6401,29.0871,737
-23.908,-9.8663,3.6409,8.7641,-9.8663,6.0411,28.6381,10.8823,739
-2.1219,-10.2556,5.2264,6.3824,-10.2556,5.1786,32.7407,23.9391,740
-1.1524,-9.6305,1.0989,2.1389,-9.6305,2.0166,11.977,7.2868,741
-0.9863,-9.9547,0.5879,1.4112,-9.9547,0.7187,8.9384,5.0061,742
-0.7281,-9.8798,0.7323,1.3223,-9.8798,1.2014,5.5204,4.1311,743
-0.0837,-10.0653,1.0926,0.8582,-10.0653,1.0572,6.8493,5.1212,744
-6.8418,-9.7582,0.5042,2.9903,-9.7582,1.7911,20.9743,13.2015,745
-3.1129,-9.8607,2.3952,4.628,-9.8607,1.6,19.6651,12.1362,746
1.0048,-9.8709,5.7147,2.8284,-9.8709,0.7013,16.4782,12.7752,748
-30.3052,-9.9275,3.0457,15.1106,-9.9275,5.9941,74.9581,40.0604,749
0.6844,-9.8279,6.9188,4.7947,-9.8279,3.6059,18.9886,10.9607,750
-1.7684,-9.8464,3.3772,4.3695,-9.8464,1.2009,38.2165,34.7967,751
-2.3017,-9.8447,32.0628,37.1755,-9.8447,7.9634,49.6832,45.6656,752
-4.1568,-9.751,-0.9105,1.5446,-9.751,1.6157,15.6695,14.2652,753
13.2984,-10.1079,18.7489,4.7026,-10.1079,1.7176,20.2034,18.7574,754
-19.664,-9.8324,1.2388,6.9261,-9.8324,3.5751,19.024,10.3993,755
-4.5407,-10.142,1.5615,4.1493,-10.142,3.7464,28.0107,19.3004,756
-5.8738,-9.8382,0.7347,3.5301,-9.8382,3.6516,12.8726,11.5447,758
-5.0154,-9.9729,1.2549,2.3849,-9.9729,4.7604,15.1893,7.1295,759
-3.8819,-9.9332,0.2754,2.3832,-9.9332,3.351,13.5142,7.7445,760
-1.2596,-9.6392,-0.3168,0.5763,-9.6392,1.7975,15.6628,8.8348,761
-2.897,-9.8071,-0.6373,1.3132,-9.8071,3.3012,8.6122,7.427,762
-1.0803,-9.8688,0.0905,0.5813,-9.8688,1.0202,10.4094,7.2459,763
-1.4251,-9.9838,0.0254,0.8924,-9.9838,2.6061,13.4535,10.8149,764
-9.1994,-9.9687,4.1292,9.8286,-9.9687,3.1614,23.8779,14.2519,765
-1.0558,-10.2134,3.8874,4.6345,-10.2134,7.4572,39.8144,37.1242,766
-3.0785,-9.947,0.7336,1.4997,-9.947,3.9206,13.3331,9.0154,768
-2.2597,-9.9004,0.3317,1.1282,-9.9004,3.0603,14.3214,5.5194,769
-3.7443,-9.9044,1.5194,4.4742,-9.9044,1.9756,18.821,15.6375,770
-3.9851,-9.8229,1.5998,6.2818,-9.8229,4.7052,19.9124,15.098,771
-1.5716,-10.044,-0.5159,0.5437,-10.044,2.4685,20.6792,18.3617,772
-2.4459,-9.8899,-0.19,1.1983,-9.8899,2.1243,17.3034,12.9707,773
-6.8932,-9.8462,-0.0317,6.137,-9.8462,2.8297,20.0559,17.3387,774
-0.4536,-9.9487,4.146,4.9338,-9.9487,6.0763,19.9662,15.5406,775
-0.8443,-9.9769,8.9981,6.8023,-9.9769,3.1265,13.2351,11.13,776
-5.1308,-9.5179,1.2745,5.9832,-9.5179,4.0498,20.5951,8.1028,778
-5.4277,-9.6512,-0.5553,3.1934,-9.6512,1.3176,6.6137,4.9819,779
-5.1999,-9.689,-0.3847,3.3184,-9.689,0.8101,11.643,9.4606,780
-2.8745,-10.1863,2.8946,5.6378,-10.1863,4.5842,30.3903,28.606,781
-42.3089,-9.9521,1.3871,17.1547,-9.9521,10.2945,33.186,20.0413,782
-1.4275,-10.1,0.9924,1.3025,-10.1,1.9554,12.8569,5.7496,783
-6.1296,-9.8354,0.4189,2.3164,-9.8354,1.2664,12.6002,5.5732,784
-15.2723,-10.0709,5.1233,7.4499,-10.0709,8.6651,30.3798,15.9476,785
-2.9964,-9.8792,6.2543,6.0647,-9.8792,3.2689,17.9174,12.9714,786
-3.9651,-10.1163,11.1765,8.58,-10.1163,1.1934,23.1088,18.2178,788
-12.3753,-9.9041,8.1713,11.5147,-9.9041,7.5458,27.2553,14.692,789
-2.655,-9.8995,2.3171,4.6166,-9.8995,5.0031,14.9193,7.4381,790
0.07,-10.0163,1.3268,1.0472,-10.0163,2.2354,7.9665,7.8011,791
0.021,-9.8085,0.8374,0.8337,-9.8085,2.1707,12.8761,8.5553,792
-0.8123,-9.7519,0.2561,0.9393,-9.7519,1.3158,14.6936,7.2914,793
-0.2706,-10.2216,-0.0674,0.1543,-10.2216,1.0489,6.498,4.4442,794
-1.1405,-9.8562,0.7934,1.6371,-9.8562,3.1529,13.0891,9.7455,795
-4.6013,-9.8355,6.0898,7.8971,-9.8355,3.9436,19.0632,13.747,796
-2.9717,-9.8966,2.9164,4.7905,-9.8966,9.1103,17.6321,13.0034,798
-3.34,-9.8999,1.2436,3.3244,-9.8999,4.3974,14.3415,10.4636,799
-2.0347,-9.925,0.5452,1.2658,-9.925,3.3027,11.9716,8.1101,800
-0.3576,-9.4553,3.6698,2.2423,-9.4553,1.309,14.0935,11.9,801
-0.2541,-9.8626,-0.02,0.1802,-9.8626,1.0506,4.4499,2.7529,802
-0.5653,-9.7573,2.3004,2.1482,-9.7573,1.5651,20.7867,9.7717,803
-0.9936,-9.7967,-0.4887,0.3492,-9.7967,0.9558,17.0016,8.6259,804
-8.132,-9.7042,-0.7132,2.7478,-9.7042,3.5196,16.0102,4.1208,805
-5.1827,-9.9082,-1.239,1.503,-9.9082,2.1839,8.3227,2.4254,807
-81.8637,-9.8744,-2.0583,13.9371,-9.8744,8.5928,47.9156,12.9901,808
-70.327,-9.8453,-0.2968,24.8387,-9.8453,13.4525,42.1829,15.3115,809
-15.6148,-9.8986,4.3697,12.367,-9.8986,9.1938,24.5324,11.8592,810
-26.5948,-9.898,-0.9369,11.0194,-9.898,8.8384,22.2637,11.4983,812
-13.0112,-9.8152,-0.6187,6.3781,-9.8152,3.6729,12.1405,9.4582,813
-6.2073,-9.8864,3.2882,11.6719,-9.8864,5.4343,44.6057,26.2493,814
-13.0012,-10.0953,9.9277,14.3003,-10.0953,9.4315,42.6465,19.0313,815
-5.3661,-9.9016,8.3745,13.8935,-9.9016,5.8943,27.863,14.6655,816
-2.3714,-9.9079,2.1164,5.7275,-9.9079,3.8461,28.7505,25.1846,817
5.195,-9.4807,30.8161,26.2376,-9.4807,3.6091,72.0061,50.3086,818
2.5241,-9.9056,6.7097,2.2845,-9.9056,0.7892,16.5753,11.7009,819
-6.296,-9.9979,6.19,9.2628,-9.9979,2.1839,17.7841,10.799,820
-6.6669,-9.9021,0.8581,3.0592,-9.9021,3.6586,28.8733,8.6997,821
-1.2161,-10.011,0.99,1.2436,-10.011,3.7356,7.7868,7.08,822
-1.9498,-10.1486,-0.0784,1.0077,-10.1486,2.6123,18.2974,17.1661,823
-2.2973,-9.8664,2.1396,2.83,-9.8664,6.8852,19.0069,12.6714,824
-9.5903,-10.0081,1.6719,6.0187,-10.0081,6.31,19.5265,14.2791,825
-10.6599,-9.9141,-1.5212,3.5775,-9.9141,4.7245,21.8519,11.4418,826
-5.7622,-9.8084,0.6044,3.3968,-9.8084,5.4642,19.5438,11.3164,827
-0.5541,-9.8529,2.1694,2.5785,-9.8529,4.3502,13.238,7.8642,828
-6.3382,-10.0699,-0.6492,3.9214,-10.0699,1.2256,17.6215,13.6159,829
-9.1455,-10.05,-1.6215,4.5993,-10.05,2.0601,16.9499,13.7577,830
-0.7171,-9.7887,0.6346,1.0264,-9.7887,2.4807,13.72,8.127,831
-1.1629,-10.0274,2.9595,3.0844,-10.0274,1.2782,23.7642,16.9576,832
-1.9442,-9.8482,4.1133,4.3164,-9.8482,2.6297,25.846,14.389,833
-3.0449,-9.9345,2.2985,4.7118,-9.9345,5.4751,23.7342,17.9346,834
-9.0826,-9.938,-0.4052,4.2169,-9.938,4.4389,22.3341,14.9005,835
-56.8176,-9.8164,-12.2448,19.0291,-9.8164,6.0449,20.6804,6.6389,836
-6.4268,-9.8303,5.6799,6.1957,-9.8303,2.6239,13.9659,10.8991,837
-19.4933,-9.8016,-8.1977,14.2093,-9.8016,7.1835,11.9171,7.7134,838
-9.4625,-9.8794,-0.7398,4.8245,-9.8794,1.2008,10.3975,8.1909,839
-282.7129,-8.0202,-213.4125,56.3788,-8.0202,8.7034,135.07,127.4251,840
-10.2081,-9.6935,9.602,11.0317,-9.6935,4.9173,23.7557,9.1938,841
-32.8036,-9.7431,-4.9765,13.8019,-9.7431,5.7914,11.4097,4.2733,842
-31.0376,-9.6128,-16.5017,10.7561,-9.6128,3.0718,13.4832,10.186,843
2.1668,-9.7587,12.4589,12.6818,-9.7587,6.1503,20.1278,3.2409,844
-10.2825,-9.9248,-0.5748,3.6836,-9.9248,5.4636,25.1364,4.2851,845
-14.0887,-9.7447,-4.8511,6.6669,-9.7447,2.9488,31.1668,26.5911,846
