AYGX_min,AZ_mean,AYGX_mean,AYGX_std,AZ_mean.1,GX_std,Gnorm_max,Gnorm_median,timestamp
-149.0738,-9.7152,-21.4657,47.8644,-9.7152,15.4513,66.2343,2.4959,422
-66.1499,-9.7899,24.0245,90.2361,-9.7899,23.7059,47.6682,33.589,423
-533.9709,-9.5674,-17.6082,148.2171,-9.5674,30.9695,73.7656,34.2416,424
-39.2222,-9.8282,-0.1872,13.0935,-9.8282,6.8387,17.792,4.0524,425
-15.9518,-9.8666,-0.0794,3.882,-9.8666,2.6772,11.055,2.034,427
