AYGX_min,AZ_mean,AYGX_mean,AYGX_std,AZ_mean,GX_std,Gnorm_max,Gnorm_median,timestamp
-2.8951,-9.8645,-0.9697,1.0269,-9.8645,0.7583,2.7465,2.1206,0
-3.6717,-9.8659,-0.0961,2.7906,-9.8659,1.783,4.9198,2.2604,1
-6.913,-9.9176,3.5624,8.704,-9.9176,5.3956,16.529,6.5441,2
-16.1062,-9.8174,-4.4864,5.6634,-9.8174,6.2789,33.1326,16.7629,3
-35.0702,-9.8932,-5.6919,15.3387,-9.8932,9.9567,30.323,26.6921,4
-67.3385,-9.8689,-8.195,17.147,-9.8689,8.9245,20.6335,11.1502,5
-28.2432,-10.142,-5.216,10.9273,-10.142,8.6881,81.1646,63.7863,6
-3.6964,-9.8875,2.1601,4.8321,-9.8875,2.4259,70.1884,17.8517,7
-3.8882,-10.1326,4.4117,8.8014,-10.1326,8.5889,46.8611,42.8417,8
-2.3786,-10.1125,-0.5857,0.7583,-10.1125,2.1451,35.8786,28.6333,9
-3.5893,-10.1864,3.6706,6.208,-10.1864,8.8606,47.565,39.0169,10
8.0984,-9.8802,14.5139,3.7362,-9.8802,3.5529,36.7352,34.953,11
-14.127,-7.9609,-2.7583,8.4153,-7.9609,3.6463,58.8128,50.6554,12
0.0349,-10.3313,1.722,1.4624,-10.3313,2.0673,18.6448,14.3655,14
-8.7233,-9.9841,0.6772,3.579,-9.9841,5.3772,24.6953,16.8758,16
-0.6079,-10.0472,0.3643,0.5116,-10.0472,0.7456,8.1463,5.1409,17
-15.6724,-10.0371,0.443,14.2788,-10.0371,5.6406,25.91,21.3458,18
-8.6733,-10.0492,-1.6453,5.2985,-10.0492,2.4672,43.9356,30.6146,19
-7.1237,-9.9933,11.2273,15.1287,-9.9933,11.9451,41.8086,30.573,20
-14.7822,-10.4116,2.3609,12.0139,-10.4116,1.9369,37.6706,33.8754,21
7.8743,-11.4258,46.7607,38.9663,-11.4258,14.8985,65.8121,64.5935,22
-20.058,-10.7812,37.7923,69.0466,-10.7812,22.9107,81.7718,74.4147,23
-34.1887,-9.8537,-2.0973,21.9958,-9.8537,4.1157,39.903,32.5903,24
-17.3616,-9.9651,0.5875,4.2615,-9.9651,4.5491,26.3713,14.0055,26
-2.57,-10.2517,0.0725,2.0077,-10.2517,1.3448,9.5941,8.4728,27
-22.0612,-9.9653,-2.8509,8.3678,-9.9653,2.8905,13.7521,9.1175,28
-3.861,-9.8178,0.2389,2.2869,-9.8178,1.9828,8.5632,6.9315,29
-0.297,-9.9114,0.1452,0.2217,-9.9114,1.1044,10.6989,7.0652,30
-35.3286,-9.7948,0.8704,18.1661,-9.7948,3.2318,24.1818,16.7631,32
-4.0996,-10.171,2.029,4.456,-10.171,6.6923,22.5314,11.0806,33
-9.7085,-9.9246,-0.4355,2.5095,-9.9246,2.2061,20.1563,6.7829,34
-4.938,-6.5443,2.5342,6.2112,-6.5443,3.9346,41.3997,10.8888,35
-2.474,-9.8096,1.04,2.8806,-9.8096,1.9338,13.5365,11.0893,36
-22.6764,-10.0062,0.4918,11.3328,-10.0062,3.7063,26.1778,14.2101,37
-0.8156,-9.8436,1.1579,1.8653,-9.8436,1.499,6.9763,4.5738,38
-56.1777,-8.5797,-3.9732,24.5901,-8.5797,7.0649,47.2318,39.6438,39
-7.2964,-9.878,-0.4877,1.7874,-9.878,3.0979,8.2756,5.7258,40
-25.2718,-9.7623,-4.8422,11.0938,-9.7623,4.615,22.8036,13.7362,42
-60.239,-9.7576,6.4279,17.3416,-9.7576,18.057,54.8346,32.2028,43
-29.1766,-8.3087,-4.9952,17.0473,-8.3087,4.9194,41.7708,19.5908,44
-33.8023,-10.096,8.706,37.6255,-10.096,7.1301,26.8646,23.5182,45
-7.2451,-10.1178,13.3865,15.0616,-10.1178,11.9388,27.2402,20.904,46
-26.8576,-10.0218,-3.9559,10.5727,-10.0218,3.8839,21.6194,18.8352,47
-3.6787,-10.1484,14.0849,21.2112,-10.1484,9.2107,29.4663,15.8008,48
-14.4841,-9.3432,-2.0733,7.4207,-9.3432,3.8407,19.9474,14.0668,49
-12.6652,-10.2084,0.6305,6.8068,-10.2084,4.3181,16.134,9.83,50
-15.2302,-10.3344,-4.3253,8.3658,-10.3344,1.7172,34.3257,14.7059,52
-6.2402,-9.3052,-0.0416,2.9687,-9.3052,4.3791,13.645,7.8649,53
-9.1572,-8.4226,3.027,12.6472,-8.4226,8.2125,32.658,18.8818,54
-2.3784,-10.0274,5.7286,4.5804,-10.0274,1.9819,15.1682,12.5411,55
-11.2519,-10.0133,-1.2677,4.8068,-10.0133,3.3192,9.6697,6.7767,56
-8.9549,-9.8874,-1.095,4.1958,-9.8874,7.2898,16.5687,8.7757,58
2.4944,-9.7616,6.3038,3.3666,-9.7616,1.1633,13.4803,11.6668,59
-26.0267,-9.8369,0.1436,15.3929,-9.8369,11.9109,29.5095,15.5985,60
-25.5177,-10.1764,-3.3095,16.2508,-10.1764,3.1363,18.6993,13.3908,62
-18.0846,-8.4471,-1.2493,9.2568,-8.4471,9.0921,52.6731,15.5622,63
-10.457,-4.8753,1.1575,7.2729,-4.8753,6.187,48.9771,21.2172,64
-23.8797,-9.3133,-5.9258,10.6565,-9.3133,8.1533,16.8984,10.0694,65
-19.2366,-10.2679,-0.4872,8.9456,-10.2679,3.1522,15.0801,8.818,66
-0.8218,-9.1948,2.0746,3.8066,-9.1948,4.0992,11.7521,5.8518,67
-38.4359,-9.4973,-4.1318,17.113,-9.4973,3.5111,18.2122,10.3477,68
-4.7457,-9.9804,0.4839,3.5927,-9.9804,0.7318,7.2162,4.8095,69
-1.9589,-9.8548,-0.1668,0.8321,-9.8548,1.7751,7.1747,3.2182,70
-6.8792,-9.7484,-0.0513,2.6721,-9.7484,4.3439,11.1871,8.7091,72
-9.7516,-9.9996,0.0062,3.9853,-9.9996,5.1427,15.0802,5.7308,73
-19.7889,-7.7051,-3.9177,8.044,-7.7051,4.112,25.6777,15.4667,74
-14.5502,-10.2204,5.4532,10.6463,-10.2204,11.5315,24.3021,17.3987,75
-1.9223,-10.0313,1.3493,2.6926,-10.0313,3.345,14.2797,6.579,76
-0.4562,-10.228,0.5475,1.0299,-10.228,1.3182,13.4963,7.455,77
0.1968,-10.1678,8.2497,4.6949,-10.1678,10.1471,38.8696,31.8083,78
-7.6282,-9.698,0.531,5.3861,-9.698,5.5288,30.7006,12.4743,79
-8.4082,-9.7223,0.536,5.14,-9.7223,5.4398,17.0487,7.3344,80
-8.4373,-10.2592,1.8319,9.3879,-10.2592,5.7346,15.285,12.0212,82
-19.2351,-8.8798,-1.2185,5.8523,-8.8798,7.7029,28.9932,11.47,83
-17.0662,-9.7906,-1.1487,6.8079,-9.7906,4.3844,12.3573,9.9677,84
-15.1031,-9.5906,0.8911,6.7652,-9.5906,2.7368,17.0841,13.1904,85
-18.5883,-10.2453,-10.0154,6.1218,-10.2453,8.7148,31.5648,20.2575,86
-9.2029,-10.6189,-0.3989,4.068,-10.6189,2.9706,7.4349,6.767,87
-11.0374,-9.8961,4.7589,10.3452,-9.8961,2.1192,14.8644,12.7132,88
-17.3113,-9.7965,0.4342,7.8188,-9.7965,6.3043,16.9228,10.5031,89
-16.978,-10.3196,-2.6375,9.1576,-10.3196,4.7224,10.8615,8.3114,90
-33.0177,-10.1781,4.5826,21.6464,-10.1781,16.9687,37.4296,28.7494,92
-28.0836,-9.8323,14.2857,34.3142,-9.8323,18.7779,55.1412,14.6446,93
-37.9257,-10.9298,-1.2624,15.547,-10.9298,13.4231,41.7614,17.819,94
4.4042,-8.6478,51.6479,32.6376,-8.6478,9.8613,38.4702,34.333,95
-1.2496,-9.8851,-0.2057,0.711,-9.8851,1.2377,7.7666,3.9037,96
-1.4826,-10.0528,22.8333,22.0535,-10.0528,5.3501,21.2572,19.4299,97
-1.8777,-10.2328,0.8176,1.7446,-10.2328,5.6743,11.9126,5.8512,98
-1.44,-10.0406,0.6002,1.1452,-10.0406,2.1479,8.9088,4.0787,100
-0.2222,-9.8442,0.3567,0.5375,-9.8442,1.7983,7.7399,4.7087,101
-6.3688,-10.0259,-0.7156,3.867,-10.0259,4.761,13.0008,8.2778,102
-9.9936,-9.7016,0.7606,7.0858,-9.7016,5.8807,20.3069,13.0478,103
-9.1554,-9.9196,0.0777,3.3961,-9.9196,4.298,10.8084,6.439,104
-2.5648,-9.9078,0.1355,1.2726,-9.9078,2.7555,6.4351,4.2475,105
-1.2235,-9.741,-0.0233,0.9743,-9.741,2.3447,10.6745,6.9697,106
-3.1701,-10.0605,1.7724,3.4158,-10.0605,2.2019,12.3202,8.7819,107
-2.6123,-9.8852,13.586,10.906,-9.8852,2.5328,18.8295,17.6517,108
-3.2598,-9.9927,1.4152,2.8463,-9.9927,3.5018,12.2529,10.9678,109
-1.0171,-9.927,1.2837,2.4071,-9.927,2.7255,9.6048,6.2809,110
-1.5475,-10.0799,0.0777,0.8676,-10.0799,0.8712,9.7943,5.1821,111
-1.1432,-10.0319,0.81,1.555,-10.0319,3.8398,9.5956,6.886,112
-1.3318,-10.0162,1.3779,2.3143,-10.0162,3.8659,9.5383,5.8888,113
-3.3765,-9.977,0.082,1.7134,-9.977,2.7713,10.4658,6.2833,114
-3.8784,-9.3988,-0.3361,1.7867,-9.3988,4.0101,14.1392,8.7687,115
-16.3925,-10.066,-0.2306,7.2978,-10.066,2.0608,23.3007,11.0756,116
-3.1534,-9.9523,-0.2431,1.2427,-9.9523,2.2288,9.8173,5.4286,117
-2.9695,-10.1008,0.1046,1.3573,-10.1008,2.4123,13.35,5.7379,118
-3.0999,-9.9321,-0.3999,1.069,-9.9321,2.1128,7.244,4.0106,119
-4.8626,-9.9032,0.0609,1.8785,-9.9032,4.5659,9.8845,4.8083,120
-6.3164,-9.6447,-0.5494,5.9727,-9.6447,2.9957,13.3593,12.107,121
-4.954,-9.7951,1.4392,3.2594,-9.7951,4.347,16.7016,7.7974,123
-3.5347,-10.5602,1.1659,2.2942,-10.5602,0.7871,9.0787,4.9874,124
-1.9397,-8.8806,1.3209,3.2678,-8.8806,2.089,30.0221,11.1765,125
-3.0005,-9.9309,-0.5088,1.4398,-9.9309,1.7861,5.9559,4.4935,126
-1.5554,-10.1514,0.1856,1.0993,-10.1514,1.3599,7.1353,4.8458,127
-0.9395,-9.9793,-0.247,0.4135,-9.9793,0.5165,6.2731,2.5559,128
-5.3066,-9.8096,-1.7601,1.8152,-9.8096,1.9244,6.5319,5.5942,129
-32.559,-9.559,0.6397,12.9998,-9.559,3.6066,22.5109,13.3094,130
-3.4269,-9.9722,0.2837,2.9348,-9.9722,5.9875,20.4109,16.6652,131
-32.3422,-10.0013,4.8884,12.6123,-10.0013,15.1079,48.2665,24.4228,133
-4.219,-9.2797,2.0589,5.7659,-9.2797,3.9978,22.9675,14.7958,134
-12.3285,-9.4141,-2.5481,5.3593,-9.4141,4.2771,17.4502,13.8246,135
-19.9857,-10.1502,-5.7203,8.0636,-10.1502,15.2252,35.8759,17.1739,136
-1.0399,-10.4096,4.7354,7.61,-10.4096,7.5873,26.767,24.7746,137
-14.5166,-9.7975,-2.2579,6.9854,-9.7975,1.4178,23.4937,14.5932,138
-5.0394,-8.612,-0.3753,1.9786,-8.612,2.0245,10.7161,9.031,139
-2.2911,-9.9792,1.1069,2.1047,-9.9792,4.8047,11.957,6.9039,140
-0.6413,-10.0243,2.8671,4.0376,-10.0243,6.636,15.3512,8.6504,142
-56.2905,-9.7719,-0.015,15.385,-9.7719,14.8221,33.6532,22.2637,143
-8.9506,-6.2961,3.2116,6.0596,-6.2961,5.943,21.6521,14.2437,144
-8.2759,-10.1161,-2.54,2.7875,-10.1161,2.6573,11.2012,7.3863,145
-14.9065,-9.7603,-4.2557,6.0071,-9.7603,3.7465,19.4757,18.7334,146
-2.8927,-9.73,-0.1364,1.4278,-9.73,2.131,7.6876,6.0692,147
-0.9985,-10.0185,0.6775,1.256,-10.0185,1.0049,7.1869,4.9129,148
-2.6983,-10.0702,-1.1392,0.7961,-10.0702,1.1961,6.8845,5.0874,149
-5.7142,-9.9714,1.6949,6.8778,-9.9714,4.5957,22.8608,13.4119,150
-2.1423,-9.9822,-0.4288,0.8445,-9.9822,1.2527,7.7865,4.6754,151
-14.6899,-9.5482,0.0119,6.9246,-9.5482,10.5673,27.6095,12.7668,153
-1.4912,-10.3853,1.5139,3.0814,-10.3853,4.317,9.2126,5.9098,154
-2.0923,-9.9335,1.2636,2.357,-9.9335,4.7662,10.0139,6.1342,155
-4.4117,-10.1527,-0.2052,2.576,-10.1527,1.7478,9.9663,6.2345,156
-15.6459,-9.8944,-0.1076,7.2981,-9.8944,4.7467,13.4913,10.803,157
0.5932,-10.1112,8.6873,8.5043,-10.1112,3.0507,15.2894,12.7968,158
-2.3277,-10.0337,-0.6161,1.0555,-10.0337,2.0942,8.3148,7.7087,159
-4.2937,-9.7148,0.4145,1.5302,-9.7148,4.3873,13.4154,5.3832,160
-8.3353,-9.8369,2.127,4.2538,-9.8369,4.2967,17.8971,13.9336,162
-5.7468,-9.8834,0.6524,2.8668,-9.8834,4.4688,11.175,6.6147,163
-2.4592,-10.2299,1.0672,2.651,-10.2299,5.8523,21.7835,19.6045,164
-1.2757,-9.9721,48.1753,35.1677,-9.9721,4.8945,37.4784,31.1238,165
-1.7182,-9.7433,0.0989,1.4725,-9.7433,3.1898,12.1361,5.4957,166
-1.0242,-9.7116,0.5731,1.5121,-9.7116,3.5615,10.3212,5.8406,167
-0.841,-9.8408,-0.3002,0.4784,-9.8408,1.5461,9.0634,5.201,168
-0.5097,-9.7815,0.3019,0.7017,-9.7815,1.9794,4.8937,3.3567,169
-3.7805,-10.2978,0.5963,2.6873,-10.2978,1.6755,14.3787,6.14,170
-2.503,-9.7439,1.4757,1.9329,-9.7439,3.7432,9.7719,5.4995,172
-5.5187,-9.9012,0.0527,2.789,-9.9012,5.6543,15.1282,8.8407,173
-1.443,-10.3351,-0.1961,0.6412,-10.3351,0.9077,13.7425,5.9245,174
-11.1269,-10.0027,-2.4273,6.0828,-10.0027,6.3178,20.2437,11.5512,175
-20.2008,-9.8021,-2.3387,9.8968,-9.8021,2.5811,18.5638,15.3464,176
-4.359,-9.8119,-0.1578,2.3805,-9.8119,4.4799,16.3469,8.243,178
-2.2917,-10.35,0.9935,2.8374,-10.35,4.0399,15.4572,7.4982,179
-10.4634,-10.2813,4.8588,12.8072,-10.2813,8.385,22.8299,11.4377,180
-12.1644,-9.0696,5.8414,17.1426,-9.0696,3.5628,29.3642,23.1353,182
-10.1553,-9.8735,1.5411,6.6443,-9.8735,7.4524,26.6239,10.5292,183
-1.0088,-9.6844,9.7593,8.5243,-9.6844,11.4425,19.9088,17.7971,184
-4.3103,-10.399,-1.2222,2.1798,-10.399,2.6418,12.677,8.8839,185
-2.8666,-9.9128,-0.2634,1.5824,-9.9128,5.3998,13.6914,8.9118,186
-2.7117,-10.3795,0.5287,3.5213,-10.3795,6.5257,14.3756,8.8992,187
-4.3322,-9.9336,-0.8151,1.8016,-9.9336,3.9074,7.9214,5.7004,188
-5.5774,-11.1168,-0.0428,3.1412,-11.1168,3.834,17.1203,12.7965,189
-6.3015,-9.8612,-1.4001,1.6712,-9.8612,4.1925,10.679,6.3698,190
-0.5874,-10.1244,2.873,5.0068,-10.1244,5.6938,13.5713,8.6431,192
-18.1396,-10.0093,-0.6593,4.4057,-10.0093,6.2129,14.9081,9.8979,193
-1.8079,-9.94,-0.4141,0.9073,-9.94,1.7107,8.9037,4.5204,194
-3.4533,-9.7591,-0.2224,1.7703,-9.7591,2.6203,7.5343,4.3992,195
-0.2389,-9.9264,1.8839,1.9607,-9.9264,1.0461,9.0393,6.7103,196
-4.4095,-10.2842,1.09,2.8627,-10.2842,2.5002,8.7673,5.7926,197
-0.3233,-9.7208,0.1706,0.6423,-9.7208,0.8259,4.0961,2.5716,198
-0.7233,-10.0193,-0.0579,0.2981,-10.0193,0.9494,4.7582,2.6945,199
-0.9166,-10.1216,0.3319,0.8942,-10.1216,2.8378,6.8883,4.5482,200
-0.6966,-9.9014,0.2176,0.4278,-9.9014,1.3291,9.6531,8.0779,202
-8.23,-9.9227,-0.0117,2.8607,-9.9227,4.8115,12.2973,5.4963,203
-1.8486,-10.1933,0.3957,1.3399,-10.1933,3.0293,8.2444,5.2609,204
-3.0268,-9.8328,-0.0366,1.5156,-9.8328,3.0293,6.956,4.9363,205
-2.3036,-9.9469,-0.3524,0.8586,-9.9469,2.6136,6.9933,4.8345,206
-1.4615,-9.9019,0.8275,1.1842,-9.9019,0.7165,5.7598,4.7559,207
-2.2103,-9.9152,-0.4958,1.3385,-9.9152,1.891,6.6615,2.886,208
-1.8752,-9.8297,0.1273,1.0152,-9.8297,1.647,5.8565,3.5642,209
-0.8552,-9.6246,0.2136,0.6014,-9.6246,2.9389,9.0465,4.0182,210
-1.4634,-10.1384,0.3646,0.7679,-10.1384,2.1776,5.8234,4.1031,212
-4.7012,-9.9156,0.1262,1.6171,-9.9156,3.3167,8.7363,5.2241,213
-0.3995,-9.9832,0.467,0.57,-9.9832,1.883,6.4952,3.9977,214
-3.3905,-9.6626,-0.2133,1.6723,-9.6626,3.2994,11.6658,5.1151,215
-2.4128,-9.9468,-0.4188,1.2594,-9.9468,2.7566,12.1426,9.7511,216
-6.4121,-10.1231,-0.6719,3.0299,-10.1231,4.0036,11.0801,6.3741,217
-1.0345,-9.8626,1.8428,3.1094,-9.8626,3.3973,10.6509,8.4406,218
-2.3467,-10.1624,-0.9407,1.5429,-10.1624,2.2527,8.6775,6.1698,219
-1.5823,-9.8792,0.3169,1.1314,-9.8792,3.2208,8.7453,4.6481,220
-2.7873,-9.7103,-0.4781,0.8545,-9.7103,1.8555,9.5928,5.5606,222
-9.0926,-10.0677,-0.3843,2.9921,-10.0677,6.658,16.4405,7.977,223
-1.6489,-9.0425,0.0889,1.2729,-9.0425,3.4767,17.7608,10.4946,224
-2.5787,-9.7889,0.5317,3.5774,-9.7889,2.473,13.7189,12.0494,225
-0.7689,-10.4527,0.1771,0.7563,-10.4527,2.39,5.4575,3.8803,226
-2.7372,-9.8216,-0.0829,2.1061,-9.8216,0.7407,14.3636,11.2052,227
-5.2532,-9.792,1.2771,4.87,-9.792,1.5597,14.1614,10.3647,228
-15.6201,-10.1078,1.2372,7.6681,-10.1078,8.4132,23.2611,18.4137,230
-2.5713,-9.9642,9.1581,8.7956,-9.9642,21.1899,38.2607,26.2066,232
-11.576,-10.0063,1.1934,5.2347,-10.0063,7.7272,19.6401,13.8577,233
-2.4109,-9.4447,-1.0332,1.2909,-9.4447,2.4873,16.9513,11.1162,234
-1.9868,-10.364,1.4875,3.7852,-10.364,3.6361,9.3174,6.6694,236
-9.017,-9.801,1.4115,7.1761,-9.801,5.2824,22.841,17.9125,238
-4.0058,-10.0082,0.9326,2.519,-10.0082,3.7874,12.1352,7.1045,239
-13.7043,-9.9703,1.9126,11.051,-9.9703,9.2705,23.6572,14.8378,240
2.2266,-10.0701,11.1811,5.2834,-10.0701,2.9487,34.2834,25.3514,241
-5.4731,-10.1836,0.1697,4.6224,-10.1836,0.9952,10.5668,8.8296,242
-7.3925,-10.1064,2.7689,5.8423,-10.1064,7.0817,37.2259,31.1168,243
-9.7127,-9.9371,-0.4471,3.4256,-9.9371,6.4951,24.809,6.9598,244
2.448,-10.1336,20.2121,11.9923,-10.1336,6.3246,29.5102,23.3979,245
0.1662,-9.7629,6.9787,3.8486,-9.7629,2.5157,17.7919,10.5923,246
-3.4883,-10.0393,0.5528,2.1058,-10.0393,1.7682,10.9659,8.0685,247
-0.7879,-9.9428,0.705,0.7755,-9.9428,0.9278,12.2554,11.2583,248
-0.532,-9.7723,0.3679,0.6494,-9.7723,1.4751,8.535,5.4025,249
-0.5429,-10.0519,-0.0128,0.1782,-10.0519,0.4864,5.758,3.0103,250
-0.2061,-9.9802,0.5261,0.3816,-9.9802,1.1439,6.0415,4.7067,251
-1.198,-9.9756,-0.344,0.426,-9.9756,0.6506,3.6684,2.6057,252
-6.8682,-9.9409,-2.5445,2.0972,-9.9409,1.1565,6.9691,4.5474,253
-2.3054,-9.9143,-1.104,0.9897,-9.9143,1.0706,5.3869,3.1145,254
0.2602,-9.9264,0.4791,0.2427,-9.9264,0.3699,2.2728,1.8437,255
-0.3881,-9.9247,0.0909,0.4181,-9.9247,0.5984,1.9784,1.7374,256
-1.0918,-9.9298,-0.6861,0.2275,-9.9298,0.266,2.2092,2.0692,257
-0.0003,-9.9383,0.1757,0.1061,-9.9383,0.2178,1.9697,1.9117,258
-0.0082,-9.9387,0.2108,0.1756,-9.9387,0.4572,2.3397,1.9375,259
-0.2851,-9.9456,-0.0678,0.1428,-9.9456,0.5408,2.033,1.7937,260
-0.3884,-9.9515,-0.2021,0.1416,-9.9515,0.3683,2.1003,2.0235,261
-0.5447,-9.9373,-0.4202,0.0954,-9.9373,0.3074,2.3454,2.1018,263
-0.2759,-9.9426,-0.1549,0.1862,-9.9426,0.5039,3.0427,1.8712,264
-1.7767,-9.9592,-0.8131,0.4671,-9.9592,0.3829,3.1698,2.4247,265
-0.0456,-9.9512,0.0701,0.0784,-9.9512,0.2574,1.9619,1.6937,266
-0.4192,-9.9421,-0.2938,0.0662,-9.9421,0.1515,1.9519,1.8603,267
-0.4467,-9.9483,-0.3073,0.0913,-9.9483,0.2411,2.2528,2.0336,268
-0.416,-9.9442,-0.2671,0.1042,-9.9442,0.178,1.9796,1.8353,269
-0.4519,-9.9524,-0.1488,0.1348,-9.9524,0.3215,2.0059,1.7833,270
-0.4239,-9.9428,-0.2792,0.0981,-9.9428,0.1615,1.972,1.9341,271
-1.4379,-9.9474,-0.3306,0.3345,-9.9474,0.5601,2.6423,1.9133,273
-0.118,-9.9513,-0.0686,0.0295,-9.9513,0.0654,1.7899,1.7,274
-0.2383,-9.9424,-0.1995,0.0265,-9.9424,0.0563,1.8425,1.798,275
-0.2858,-9.945,-0.2273,0.0537,-9.945,0.1673,1.953,1.8859,276
-0.1767,-9.9415,-0.0988,0.0705,-9.9415,0.1794,1.8672,1.7241,277
-0.4979,-9.9362,-0.2598,0.1425,-9.9362,0.2462,1.9484,1.8475,278
-0.8875,-9.9219,-0.4844,0.2042,-9.9219,0.4012,2.4559,2.0401,279
-0.5228,-9.9385,-0.3466,0.1372,-9.9385,0.2979,2.135,1.852,280
-0.4506,-9.9557,-0.352,0.0725,-9.9557,0.1138,1.9346,1.8886,281
-5.3433,-9.9482,-0.2022,1.1932,-9.9482,2.2809,5.7534,3.2609,283
0.0221,-9.943,0.3971,0.2535,-9.943,0.413,2.2828,1.8332,284
-1.6793,-9.9341,-0.9723,0.4097,-9.9341,0.479,2.8618,2.1765,285
0.2037,-9.9407,0.3408,0.0889,-9.9407,0.1441,1.9425,1.8786,286
-0.3766,-9.9402,-0.2965,0.0555,-9.9402,0.1238,1.9067,1.8398,287
-0.1939,-9.9441,-0.1668,0.024,-9.9441,0.0398,1.807,1.7483,288
0.2789,-9.9271,0.9547,0.5842,-9.9271,1.0783,4.1073,3.1982,289
-3.4434,-9.9073,5.0883,7.3901,-9.9073,5.274,26.4746,15.8608,290
-22.1737,-10.3011,57.5206,72.8702,-10.3011,8.3835,87.6243,68.1108,291
-9.0147,-9.8651,0.5984,5.2813,-9.8651,9.8853,25.9591,18.6127,293
-5.4448,-9.5841,-2.4282,2.0047,-9.5841,5.936,25.625,21.1486,294
-3.6709,-10.1524,-0.0862,1.567,-10.1524,3.7033,10.6258,5.5245,295
-12.7757,-10.4286,2.8631,9.7635,-10.4286,11.9729,36.3653,29.5048,296
-4.3257,-9.8692,0.824,2.9793,-9.8692,1.3968,20.7561,12.4866,298
-2.2856,-10.2271,1.4327,2.6915,-10.2271,5.969,17.9412,11.3753,299
-5.2123,-10.1065,0.0133,1.835,-10.1065,2.8536,14.5817,6.9088,300
-10.1822,-9.6415,-0.602,4.0756,-9.6415,3.6425,12.2727,9.1226,302
-17.384,-9.8621,0.5793,6.6861,-9.8621,8.1522,28.5103,11.4081,303
-7.1221,-10.0809,3.2038,6.1274,-10.0809,2.0634,24.5984,21.1175,304
-1.695,-10.6957,2.0643,2.6778,-10.6957,6.4411,50.2185,46.929,305
-0.4217,-9.9514,0.2738,0.5042,-9.9514,1.5921,18.7993,17.0714,306
0.9856,-10.5041,8.2979,5.4093,-10.5041,3.4831,23.0537,14.1859,307
-1.5552,-9.5945,-0.3813,0.7508,-9.5945,4.7298,14.6841,11.9067,308
-11.4036,-10.1176,21.093,37.0133,-10.1176,13.4073,51.7141,43.7287,309
-8.1518,-9.9645,0.6676,3.3546,-9.9645,4.5344,40.5927,32.3731,310
-6.5172,-9.953,-1.3869,2.0762,-9.953,2.4071,8.6167,4.7054,312
-3.1375,-9.9596,-0.4794,0.9045,-9.9596,1.6112,4.537,2.0581,313
-0.984,-9.9721,0.1039,0.5749,-9.9721,1.8985,4.4533,2.3095,314
-3.8121,-9.9603,-2.2344,1.2582,-9.9603,0.8303,4.1256,3.4208,315
-0.6301,-9.9225,-0.4417,0.1733,-9.9225,0.1713,1.8158,1.7235,316
-0.9012,-9.9269,-0.734,0.1612,-9.9269,0.2162,2.06,1.9029,317
0.8974,-9.9312,1.0855,0.0944,-9.9312,0.1271,2.3442,2.2851,318
-0.6723,-9.9591,-0.0409,0.3947,-9.9591,0.8149,2.3761,1.9324,319
-1.352,-9.9528,-0.1302,0.4842,-9.9528,0.7182,2.6913,1.7261,320
-1.4521,-9.9491,-0.3096,0.503,-9.9491,0.8697,3.6173,1.7933,321
-5.1613,-9.987,-2.8033,1.0096,-9.987,0.9158,7.0725,6.2195,322
-0.7873,-9.9534,-0.1147,0.6988,-9.9534,1.5617,4.0138,2.1815,324
-0.5245,-9.9532,-0.3484,0.0841,-9.9532,0.1471,1.961,1.8271,325
-0.4002,-9.9514,-0.3144,0.0413,-9.9514,0.0575,1.8333,1.7938,326
-0.377,-9.9525,-0.2883,0.0422,-9.9525,0.0891,1.8252,1.8,327
-0.4063,-9.9537,-0.3742,0.0166,-9.9537,0.0264,1.867,1.8322,328
-0.423,-9.9506,-0.3627,0.0354,-9.9506,0.0597,1.8631,1.8257,329
-0.3295,-9.9432,0.379,0.6357,-9.9432,1.5091,6.2416,3.1386,330
-5.5055,-9.9783,-1.5639,2.0478,-9.9783,1.3323,19.3468,11.3059,331
-18.0713,-9.9474,1.9412,12.7416,-9.9474,5.8694,23.5312,14.025,332
-37.341,-10.4294,15.2402,49.0613,-10.4294,13.4497,104.8023,90.5229,333
-18.1912,-9.9398,13.5174,15.7481,-9.9398,14.0774,66.6961,22.7913,335
-0.5152,-9.8547,6.3213,5.9151,-9.8547,2.6612,33.9583,13.203,336
-5.2522,-9.9766,-2.3921,1.9368,-9.9766,4.6088,17.0778,16.2094,337
-7.4855,-9.5098,0.6528,4.7409,-9.5098,4.0472,12.2021,10.7631,338
-5.0872,-9.8965,-1.8683,2.7297,-9.8965,1.6381,11.0184,8.4086,339
-1.4826,-9.9034,-0.0383,0.9363,-9.9034,3.2594,11.8512,5.9329,340
-2.0525,-9.9383,1.4865,3.2514,-9.9383,6.5445,12.3405,8.0417,342
-1.8806,-10.0661,0.7411,1.7002,-10.0661,4.9698,11.4776,7.6353,343
-0.9648,-9.9046,2.9893,3.6118,-9.9046,1.9364,9.2878,7.5508,344
-3.8956,-10.1886,-0.8749,1.516,-10.1886,2.5799,13.0683,10.1831,345
-2.009,-8.4281,0.1417,2.0394,-8.4281,3.5385,20.2087,8.9288,346
-9.1817,-7.5501,1.5697,6.9911,-7.5501,5.9373,19.2114,16.0536,347
-0.6144,-9.6751,0.6135,1.189,-9.6751,1.5881,6.7861,4.6121,348
-6.1926,-9.7604,0.1692,3.2413,-9.7604,4.6486,23.0861,7.6459,349
-5.2626,-9.5995,-0.7289,3.2948,-9.5995,7.393,14.7013,11.4244,350
-17.0664,-9.6514,2.5092,9.0843,-9.6514,10.5116,34.1017,16.4749,352
-13.7959,-7.3822,1.1733,6.2063,-7.3822,6.4069,30.5612,11.7553,353
-6.1806,-10.4724,-0.3375,3.7002,-10.4724,3.755,17.1176,8.8464,354
-2.312,-9.1744,0.655,1.7637,-9.1744,3.3686,12.9006,9.313,355
42.6555,-9.7428,88.2452,48.2037,-9.7428,4.9875,50.19,45.7476,356
-74.7821,-8.518,13.5742,36.5296,-8.518,32.1336,50.4532,41.1055,357
-11.4108,-9.1324,2.0771,6.7865,-9.1324,11.8179,40.5925,14.8832,358
-10.057,-9.945,0.0096,6.8246,-9.945,2.8264,21.0546,11.0461,359
-7.5042,-6.3983,4.1114,9.3032,-6.3983,7.3542,26.0152,20.1561,360
-8.2023,-9.7043,0.6531,4.3079,-9.7043,3.6769,44.1126,9.4864,362
-19.3915,-10.1062,2.6323,9.2082,-10.1062,7.0333,29.6691,20.763,363
-0.398,-9.9351,3.3604,4.1161,-9.9351,4.0499,18.5519,11.4015,364
-0.7496,-9.9082,0.5271,1.3682,-9.9082,2.228,10.4826,9.2681,365
-0.6195,-9.6829,0.9796,1.2144,-9.6829,2.0399,5.4601,3.9301,366
-21.014,-9.9034,-0.1062,12.0286,-9.9034,1.3215,24.02,21.0724,367
-5.6529,-10.0967,15.2101,16.4269,-10.0967,12.9825,33.5649,29.1193,368
-4.4308,-10.2705,15.1849,27.3877,-10.2705,11.3908,35.2274,16.5214,369
-2.9911,-9.9951,-0.8341,1.5214,-9.9951,2.6843,12.0184,9.8319,370
-9.7574,-9.9029,-0.0471,2.1117,-9.9029,3.7831,11.1443,5.6395,372
-2.9422,-10.1922,-0.5088,1.0985,-10.1922,3.0292,10.8536,4.4491,373
-1.7001,-10.2488,-0.2034,0.9723,-10.2488,1.8991,5.3991,3.9627,374
-1.4492,-10.0672,-0.2155,0.5481,-10.0672,1.6292,6.331,4.4948,375
-8.9157,-10.1936,-1.6598,3.3567,-10.1936,4.6872,15.5054,5.9632,376
-0.8886,-9.8657,4.0417,3.8514,-9.8657,3.7735,16.155,12.4367,377
-1.187,-9.9489,0.5338,1.1621,-9.9489,1.7236,10.152,7.1726,378
-5.6672,-10.1669,-1.1853,2.2012,-10.1669,3.2627,11.792,5.8825,379
-2.0506,-9.8141,-0.1162,1.6196,-9.8141,2.5875,6.9475,4.637,380
-2.3358,-10.034,0.1694,1.1524,-10.034,3.6365,10.6017,5.7496,382
-2.2875,-10.246,-0.4185,1.4818,-10.246,1.2264,7.2427,4.9462,383
-2.5545,-9.9462,-0.1139,1.9528,-9.9462,1.9857,7.2975,5.3048,384
-2.9389,-10.1427,-0.3642,1.3247,-10.1427,1.9594,7.1333,3.8875,385
-0.0056,-10.0769,1.577,1.3593,-10.0769,0.5293,7.4238,6.2786,386
-2.2327,-9.6364,-0.2326,0.9705,-9.6364,2.31,13.0303,11.2062,387
-0.8209,-9.9295,-0.1109,0.405,-9.9295,1.5773,6.9355,3.8303,388
-4.819,-9.9968,0.3266,2.8947,-9.9968,4.4022,15.4753,10.2979,389
-0.6952,-9.8885,5.6125,5.1213,-9.8885,2.8262,18.5344,12.2931,390
-101.6081,-9.6567,43.9855,65.9011,-9.6567,33.2181,90.515,50.5125,392
-70.3654,-10.5371,-3.3887,30.0713,-10.5371,13.0788,43.7143,34.5598,393
-8.3559,-10.272,3.8513,11.906,-10.272,6.0427,25.9198,23.1334,394
-0.1145,-10.3145,0.5853,0.9356,-10.3145,1.7059,15.0521,11.0231,396
-4.2333,-7.6397,-1.477,1.8573,-7.6397,1.9606,27.3274,7.3933,397
-7.4723,-9.0254,-1.5696,2.9826,-9.0254,3.5948,9.3782,5.0716,398
-14.4409,-11.0091,-2.737,9.9056,-11.0091,2.5521,23.9567,15.7047,399
-24.977,-9.7587,3.7091,10.0573,-9.7587,4.6,19.8988,17.088,400
-4.578,-9.8054,0.3368,3.2203,-9.8054,3.2343,14.2298,9.4266,401
-2.3775,-9.9873,0.0124,1.1736,-9.9873,1.0492,9.7468,5.4667,402
-7.2314,-9.9552,7.9084,12.2305,-9.9552,11.6952,24.3138,21.0034,403
-9.8007,-9.9928,-2.7431,4.6807,-9.9928,5.6523,18.1457,10.165,404
-1.9266,-10.1687,-0.3397,0.8369,-10.1687,2.3197,9.6089,5.312,405
-0.4299,-10.0789,0.6279,0.6712,-10.0789,2.1819,5.8979,5.3794,406
-3.1144,-10.1067,0.0865,1.8257,-10.1067,2.3045,5.577,3.9991,407
-0.7032,-10.0599,-0.1059,0.4771,-10.0599,2.3294,7.6553,5.5878,408
-0.9622,-10.1629,-0.3604,0.4123,-10.1629,1.5932,4.8103,2.4747,409
-3.8004,-9.8015,0.3523,2.0529,-9.8015,2.6322,13.9528,10.4898,410
-7.1743,-10.21,-0.5764,3.9083,-10.21,2.913,12.0508,10.3596,411
-4.0349,-9.7424,-0.1933,1.3444,-9.7424,2.4904,17.0242,7.6088,412
-15.8457,-9.9787,-1.5471,4.9523,-9.9787,5.2113,13.4296,8.9263,413
-4.2929,-10.0511,1.3283,5.7934,-10.0511,8.9413,24.548,12.2864,414
-3.5084,-10.1372,0.0635,3.1764,-10.1372,1.8995,12.6326,9.47,415
-9.1023,-10.0226,5.3243,12.1689,-10.0226,4.4833,25.1679,24.1958,416
-6.4422,-9.5973,1.9302,3.7143,-9.5973,4.0266,28.1644,11.1282,417
-6.9718,-9.8585,-0.29,4.2189,-9.8585,2.3719,13.5008,7.9603,418
-2.7475,-10.0283,1.398,3.2696,-10.0283,3.4564,13.8429,7.302,419
-7.4551,-10.1106,-0.7361,2.4307,-10.1106,4.3991,18.6629,4.5003,420
-10.6442,-10.3598,-1.6176,3.7482,-10.3598,3.9294,14.7603,8.5516,421
-11.2745,-9.9366,2.9026,8.4407,-9.9366,2.0321,16.3732,11.9278,422
-8.7343,-10.0132,7.9523,15.4622,-10.0132,7.6379,26.6733,16.0544,423
-2.7518,-10.2006,4.7475,6.2158,-10.2006,8.4157,24.402,21.19,424
-8.846,-10.069,-1.6095,3.2592,-10.069,2.9747,8.3891,5.7518,425
-0.5676,-9.7947,-0.1388,0.3572,-9.7947,1.2901,10.1944,3.0834,426
-2.7185,-9.8308,-0.2191,1.1453,-9.8308,3.0591,8.5077,3.4778,427
-0.7406,-9.8794,-0.002,0.4154,-9.8794,1.4924,11.6399,8.3185,428
0.0256,-10.3197,1.3588,1.5852,-10.3197,4.4839,15.5087,13.5854,429
-5.3395,-8.3544,1.3068,5.6463,-8.3544,8.2325,23.3724,16.3704,430
-7.9111,-10.2664,2.2565,6.2173,-10.2664,7.8591,21.8661,13.1517,432
-10.3073,-10.0319,0.8253,3.84,-10.0319,5.3197,19.9321,11.1313,433
-2.5813,-7.7257,2.9433,4.3865,-7.7257,2.5786,29.2895,13.8929,434
-0.7761,-9.8958,0.4756,0.8487,-9.8958,1.9066,7.3564,5.7016,435
-4.9213,-9.7293,17.1076,22.6455,-9.7293,12.19,26.9695,23.1133,436
-9.4004,-9.4819,0.1003,6.9825,-9.4819,4.141,16.5221,12.0764,437
-1.9469,-6.3761,7.752,9.4343,-6.3761,11.2365,32.7095,15.8314,438
-1.867,-9.9967,0.4743,1.509,-9.9967,3.9419,12.6289,6.9928,439
-2.3153,-10.0621,0.2796,2.9867,-10.0621,5.4243,22.9914,12.5052,440
-2.4279,-10.0349,0.3395,2.6843,-10.0349,3.184,13.471,7.5041,442
-1.5529,-9.9427,3.2966,3.872,-9.9427,3.6126,16.5889,13.4393,443
-4.2736,-10.6077,1.8497,6.934,-10.6077,3.7236,22.8311,13.3208,444
-5.8871,-10.1736,-0.7059,3.3348,-10.1736,1.6402,7.7942,6.1255,445
-4.6646,-9.7126,8.9207,10.5358,-9.7126,6.307,29.7512,24.6637,446
-16.7228,-9.5685,0.2678,11.3035,-9.5685,14.7835,44.0662,31.0569,447
-11.1864,-8.0635,14.2443,15.9054,-8.0635,2.7492,40.4704,34.0296,448
-14.3745,-9.0289,7.909,20.1576,-9.0289,10.8108,28.5706,15.8139,449
-4.4027,-9.9749,-0.3109,2.5171,-9.9749,1.7121,7.7855,5.8516,450
-2.4993,-9.9189,0.4774,1.7897,-9.9189,3.4648,9.7625,5.1591,452
-2.0152,-9.8501,-0.2031,0.5268,-9.8501,1.2378,12.815,4.6074,453
-22.5633,-9.106,-2.9319,8.2311,-9.106,2.9062,17.2508,11.9503,454
-8.9213,-3.9641,-2.1098,4.6292,-3.9641,5.4873,38.4711,14.4564,455
-13.5018,-9.7285,-2.2284,6.0674,-9.7285,1.9737,19.2145,18.0743,456
-2.9151,-9.7878,-0.6177,1.4261,-9.7878,2.463,9.4435,7.2797,457
-2.6085,-9.7365,-0.4481,0.9855,-9.7365,2.4884,4.9913,4.1678,458
-1.2092,-10.1797,0.4068,1.2479,-10.1797,1.453,7.1429,4.404,459
-2.1061,-9.9889,-0.0494,0.8184,-9.9889,2.1311,6.3721,4.1091,460
-11.9831,-9.2032,0.9202,8.8948,-9.2032,11.576,27.8789,12.6639,462
-84.6384,-8.6894,38.6531,55.8629,-8.6894,38.163,84.0458,52.3592,463
-25.1084,-10.3501,-0.005,10.0364,-10.3501,12.7329,33.839,26.2722,464
-16.2926,-9.1436,-0.4474,8.3567,-9.1436,8.0357,37.6397,15.1085,465
-1.3956,-9.9722,0.0796,1.0403,-9.9722,5.4299,16.5842,9.7117,466
-4.0985,-9.9857,-1.3762,2.0874,-9.9857,4.9495,17.8236,12.1927,467
-2.9938,-9.2866,0.5339,1.8865,-9.2866,1.9488,12.3793,8.0631,468
-11.2722,-10.0543,-1.3625,3.9954,-10.0543,4.9566,11.2113,7.4706,469
0.0799,-8.5117,2.9526,4.1658,-8.5117,4.0111,9.662,8.2756,470
-11.6247,-10.0778,1.0455,4.4402,-10.0778,8.2615,18.8984,11.9967,472
-6.1752,-10.1321,-0.8315,1.602,-10.1321,2.7134,19.0259,6.6336,473
-2.1801,-9.5799,-0.5412,1.5986,-9.5799,4.2574,13.0184,9.5166,474
-2.955,-7.9747,-0.3255,1.4311,-7.9747,1.5129,19.0883,3.6817,475
-1.085,-9.9597,0.2128,1.2854,-9.9597,2.3459,11.2876,7.4775,476
-5.8767,-9.996,-0.5052,1.6052,-9.996,1.5257,11.6915,6.4888,477
-1.3485,-9.8703,2.0455,2.6651,-9.8703,4.0118,11.7607,10.7287,478
-16.0667,-6.4528,1.8477,7.8398,-6.4528,6.7879,63.9443,21.3033,479
-7.2309,-9.6657,-1.0452,4.9053,-9.6657,7.7635,16.4874,15.5713,480
-3.4537,-9.6552,1.0706,2.5353,-9.6552,3.7364,21.909,7.4025,482
-5.1784,-10.0197,0.0357,3.4664,-10.0197,2.4399,15.272,8.8271,483
-0.9048,-9.1153,0.3578,0.8604,-9.1153,1.5183,13.5773,7.7315,484
-4.6167,-8.2606,-0.1395,2.6927,-8.2606,7.979,19.8725,15.6469,485
-5.9263,-10.1359,1.3919,5.2874,-10.1359,2.7582,18.3782,10.6673,486
-0.8944,-10.0467,0.6474,1.112,-10.0467,1.4898,7.3398,7.0405,487
-1.5708,-7.0806,1.1612,2.2996,-7.0806,1.5585,31.2422,9.6198,488
-6.8542,-9.2923,0.0195,4.359,-9.2923,3.1505,25.2891,10.4815,489
-5.4118,-9.276,3.7215,5.5741,-9.276,2.2801,18.5859,14.9718,490
-0.7573,-9.6135,0.6124,1.1984,-9.6135,1.8514,10.6943,5.1594,492
-2.6089,-10.0254,0.3763,1.6349,-10.0254,0.5036,6.7611,5.1399,493
-1.8512,-9.9525,-0.1757,0.8885,-9.9525,0.6869,11.9063,4.5564,494
-0.9548,-10.0369,0.146,0.6835,-10.0369,0.507,8.1417,6.7496,495
-1.2987,-9.9987,0.8207,1.4612,-9.9987,1.9273,18.4798,11.1069,496
-2.9583,-9.9728,0.4246,2.7237,-9.9728,3.1081,19.7242,6.4253,497
-2.3206,-9.9077,-0.4649,1.4113,-9.9077,1.566,15.378,12.2216,498
-5.1169,-9.9212,-0.0269,1.9139,-9.9212,2.285,4.9519,2.9548,500
-2.7519,-9.9472,0.35,2.1949,-9.9472,3.6979,9.1504,6.6609,501
-0.1746,-9.9653,0.1868,0.3077,-9.9653,1.6644,5.1341,3.9259,502
-0.0653,-9.9652,-0.0117,0.0344,-9.9652,0.3378,1.8127,1.623,503
-0.868,-9.9533,-0.2692,0.2636,-9.9533,0.7988,4.4732,2.7195,504
-2.0062,-9.9626,-1.381,0.5629,-9.9626,0.2102,7.944,7.4825,505
-0.3736,-9.9605,0.0224,0.3605,-9.9605,0.8803,2.9477,1.768,507
-0.3733,-9.9521,-0.0818,0.1332,-9.9521,0.3826,2.1038,1.8043,508
-0.8967,-9.9502,-0.4578,0.3801,-9.9502,0.424,2.8563,2.5927,509
-1.9746,-9.9402,-0.5223,0.9593,-9.9402,1.2319,3.938,2.5075,510
-0.0321,-9.9502,-0.0179,0.0132,-9.9502,0.0842,2.4659,2.1706,511
-0.1921,-9.9559,0.1726,0.3396,-9.9559,0.4303,13.6024,7.0835,512
-0.5328,-9.9032,-0.0339,0.3591,-9.9032,0.4187,29.0434,27.8013,513
5.7985,-9.9671,22.7206,11.6297,-9.9671,2.8666,53.1761,31.5827,514
27.8582,-9.8492,35.3639,6.1788,-9.8492,2.3036,61.1433,48.1914,515
-46.0644,-10.1596,4.0451,17.6012,-10.1596,14.7123,49.3559,28.5942,517
-7.4213,-9.9212,-0.563,3.8949,-9.9212,5.4712,33.1988,18.6603,518
-2.0426,-10.7907,0.3259,1.167,-10.7907,2.7921,35.8125,34.3367,519
0.1201,-10.3372,19.7788,14.2981,-10.3372,3.9413,27.9871,22.7969,520
-0.2988,-9.743,9.1893,12.0817,-9.743,9.2814,34.0453,26.3348,521
1.9336,-10.3309,6.5628,4.1012,-10.3309,10.8526,32.4064,25.4586,522
-4.1194,-10.2877,-0.9092,2.253,-10.2877,0.8557,8.7957,7.7798,523
-3.4114,-9.8693,-0.5468,1.3059,-9.8693,3.8194,16.6245,6.7256,524
-1.0203,-10.026,0.9513,1.2997,-10.026,0.4636,7.4756,6.2085,525
-14.1029,-9.6581,0.1705,5.0309,-9.6581,5.7475,30.6248,15.9892,527
-5.5646,-8.3604,0.5936,6.4469,-8.3604,2.5117,25.8115,18.57,529
-3.1701,-9.6793,-1.3957,1.3312,-9.6793,1.3517,23.6919,17.4134,530
-7.1161,-10.0496,0.9742,4.7319,-10.0496,2.1652,29.6595,26.1346,531
-25.2233,-5.1149,2.8661,23.5533,-5.1149,7.4174,53.9297,31.6934,532
-6.0057,-10.6562,3.9722,7.9948,-10.6562,9.9017,28.7474,21.9368,533
-44.8616,-7.2628,34.5398,103.3161,-7.2628,28.8843,76.0539,49.0763,534
-7.5991,-9.5076,2.9133,10.6416,-9.5076,8.4533,24.3823,13.3369,535
-8.7811,-10.01,-0.0443,3.7624,-10.01,7.3947,19.878,8.8198,537
-2.5385,-9.9488,-0.0575,0.9744,-9.9488,3.3354,10.9125,5.4055,538
-2.6996,-9.9453,-0.2597,1.0639,-9.9453,2.2183,13.5256,4.7584,539
-1.2905,-10.0388,-0.6587,0.4692,-10.0388,0.9421,7.7581,4.1748,540
-3.3973,-9.2129,-0.4139,1.0608,-9.2129,2.0985,13.8038,6.0536,541
-7.0431,-8.6995,0.1717,3.8628,-8.6995,3.1892,24.7533,7.7099,542
-1.9045,-9.8176,-0.131,1.0246,-9.8176,1.6148,12.7972,9.2063,543
-7.3176,-9.3345,0.7335,4.1037,-9.3345,5.9272,19.8995,11.2013,544
-1.6498,-10.0435,0.139,1.4293,-10.0435,3.0637,12.1961,7.3652,545
-2.7507,-9.2074,0.4334,2.5608,-9.2074,6.2457,18.2836,11.8278,547
-47.3223,-5.7427,3.0199,18.1369,-5.7427,16.153,36.9211,22.4042,548
-5.3642,-7.8265,5.1145,9.2147,-7.8265,11.5795,23.8327,18.6585,549
-12.1548,-4.684,2.9484,9.0001,-4.684,13.0481,27.2312,19.7882,550
-14.9693,-9.4305,0.5022,10.217,-9.4305,2.8371,20.1741,18.7638,551
-1.0776,-9.5064,0.5379,1.9771,-9.5064,0.7951,13.9065,9.5217,552
-6.481,-8.5865,3.3316,6.3576,-8.5865,4.7556,20.5416,14.4688,553
-2.2191,-9.6219,3.2842,5.7621,-9.6219,7.6037,20.5028,10.6289,554
-5.5656,-9.5582,0.1555,2.4527,-9.5582,2.1473,15.4058,7.4837,555
-12.0423,-9.8085,-0.1889,5.401,-9.8085,8.3034,19.2368,13.3452,556
-3.4223,-10.1437,-0.5015,1.4469,-10.1437,3.05,5.7041,3.6954,557
-3.0958,-9.9121,-0.4855,1.0304,-9.9121,2.2604,9.2298,4.758,558
-3.2208,-10.0894,1.6133,3.4394,-10.0894,2.5646,11.3967,8.7821,559
-1.9482,-9.5829,0.3317,1.3245,-9.5829,2.3099,9.1446,6.3226,560
-3.9424,-9.4828,0.1775,2.1012,-9.4828,2.0992,10.702,6.6746,561
-0.6809,-10.7435,0.1455,0.5918,-10.7435,2.7252,18.9999,9.8472,562
-32.2889,-7.3789,10.7876,23.748,-7.3789,8.8123,38.7272,34.7517,563
-15.9507,-10.0554,8.1027,15.4722,-10.0554,8.8025,37.4158,29.5218,564
-9.0618,-9.0664,1.301,3.9328,-9.0664,2.8171,14.6656,10.2166,565
-3.6915,-10.0774,0.0783,1.3662,-10.0774,2.8317,8.6646,4.9656,567
-11.4914,-10.2108,7.0182,12.6287,-10.2108,9.8782,26.184,23.1285,568
-3.5195,-10.3846,1.1288,3.9478,-10.3846,8.2104,28.3073,26.5095,569
-9.8055,-10.147,3.551,7.049,-10.147,7.9822,16.2258,11.5067,572
-4.7038,-10.015,-0.1911,3.5026,-10.015,1.0748,21.0977,19.5298,573
-0.2997,-10.2889,5.4886,4.2158,-10.2889,0.6157,26.9056,25.8115,574
-8.6204,-9.4887,0.0157,4.4475,-9.4887,8.2504,23.0501,14.9005,575
-8.9879,-9.9228,2.164,6.7427,-9.9228,8.3733,35.1433,24.336,577
-0.9695,-9.9206,0.2733,0.983,-9.9206,2.9078,12.8328,4.7533,578
-1.5998,-9.922,0.1229,0.9049,-9.922,1.9813,5.169,3.334,579
-18.8562,-9.9447,0.2854,12.6431,-9.9447,4.6452,20.9813,16.5586,580
-2.1757,-9.6407,2.554,4.3705,-9.6407,2.0065,10.724,7.9432,581
-0.6394,-9.9032,-0.1147,0.2644,-9.9032,1.8044,3.9792,3.7106,582
-0.5875,-9.6316,0.2789,0.7928,-9.6316,4.4623,16.5549,6.9004,583
2.1761,-9.7958,9.6539,5.5696,-9.7958,6.9123,23.2389,17.4744,584
-3.1064,-9.9853,-0.3984,1.2709,-9.9853,4.5761,11.7617,6.1278,585
-4.5344,-9.9994,0.7684,2.4524,-9.9994,4.7931,13.3912,6.6538,587
-12.4875,-9.2964,3.4234,5.5555,-9.2964,9.4116,22.3467,14.8639,588
-0.6645,-9.7585,0.1235,0.4966,-9.7585,1.4075,4.6623,3.3329,589
-1.2856,-9.7767,0.7141,1.183,-9.7767,0.9643,9.4302,6.4243,590
-2.3777,-9.5634,0.4606,1.7661,-9.5634,0.8779,13.6872,6.931,591
-0.3765,-9.4848,-0.0232,0.2072,-9.4848,1.3167,6.5151,4.4534,592
-1.3579,-9.9053,-0.1763,0.5251,-9.9053,0.8818,8.5122,6.0455,593
-2.87,-10.1399,0.0088,1.1971,-10.1399,2.1904,11.2792,6.6669,594
-6.4948,-9.9768,1.8507,6.7754,-9.9768,1.5167,24.7053,12.1096,595
-12.1004,-9.9701,3.9402,10.4317,-9.9701,8.457,38.2753,24.0502,597
-4.6793,-9.9455,0.2656,2.035,-9.9455,3.2198,37.778,28.8314,598
-3.7703,-10.2314,1.8233,2.7306,-10.2314,1.5104,29.9421,27.4624,599
-7.0586,-9.9965,-0.222,2.7421,-9.9965,5.4323,21.9474,12.7322,600
-3.7351,-10.0742,2.1962,5.0566,-10.0742,2.0809,24.1743,16.2236,601
-16.681,-10.1373,-1.7695,9.5405,-10.1373,2.8418,18.2855,14.6304,602
-0.5514,-8.8881,1.5121,3.4451,-8.8881,2.811,22.2345,13.1225,603
-2.7663,-10.0589,0.5857,2.218,-10.0589,5.3804,19.4258,13.8746,604
-9.2623,-9.7735,0.1424,8.2156,-9.7735,4.5874,25.8215,20.7776,605
-1.2951,-10.1487,2.9362,2.8445,-10.1487,6.698,16.875,10.0312,607
-3.1182,-9.9682,-0.0271,2.5887,-9.9682,2.6065,10.1119,8.2799,608
-6.7915,-10.1921,-2.6193,3.1314,-10.1921,3.2905,12.5054,11.2663,609
-10.2499,-8.261,3.6473,12.4519,-8.261,8.5685,38.8744,30.6084,610
-4.0693,-9.8034,-1.7232,1.6835,-9.8034,1.3448,7.273,4.6553,611
-2.2737,-10.0538,-0.0213,1.0564,-10.0538,3.7479,13.3159,11.1256,612
-2.8298,-9.7994,3.0064,3.9378,-9.7994,1.8036,27.1067,21.6966,613
-3.2495,-9.3664,0.2142,2.1494,-9.3664,2.214,14.1432,6.7331,614
-0.385,-10.1357,1.4708,1.3662,-10.1357,1.4338,12.8789,5.9373,615
-6.6433,-9.9661,0.0184,2.5691,-9.9661,6.2827,16.8448,9.6637,617
-6.8286,-9.8619,1.2795,5.7342,-9.8619,9.7789,16.1731,13.1609,618
-0.8997,-10.0917,1.2631,1.7909,-10.0917,1.5958,9.8287,6.2886,619
-1.9465,-9.5111,1.3009,2.4414,-9.5111,4.2162,10.8568,8.3191,620
-2.9149,-9.9451,-0.1049,1.3303,-9.9451,3.8534,7.5209,5.0765,621
-2.8108,-10.2113,-0.723,1.0221,-10.2113,1.0338,7.3696,5.2787,622
0.1501,-9.9048,4.6963,2.9809,-9.9048,11.5687,25.0166,11.1702,623
-8.7289,-10.0737,4.1861,8.6695,-10.0737,13.7331,23.6227,18.346,624
-2.1222,-10.1412,-0.253,1.2526,-10.1412,2.6142,8.6243,6.0716,625
-6.4931,-10.0554,-0.366,2.4795,-10.0554,6.3823,13.7973,8.0612,627
-3.4023,-9.7205,-0.3327,1.271,-9.7205,5.7271,10.6172,8.5276,628
-1.8696,-9.9433,-0.2627,0.9712,-9.9433,1.451,7.4988,5.7017,629
-3.5959,-9.4868,-0.8624,1.7253,-9.4868,4.7493,11.0666,7.0516,630
-2.1257,-9.5303,-0.1849,0.9919,-9.5303,1.5434,5.8627,4.1585,631
-0.0219,-9.9569,0.4443,0.5532,-9.9569,2.334,10.4882,5.1537,632
-0.1422,-9.7285,0.0516,0.1302,-9.7285,0.7202,4.7157,3.8827,633
-1.4703,-10.0578,0.1166,1.0769,-10.0578,2.6253,7.6006,4.358,634
-1.9478,-9.9488,-0.1955,1.3161,-9.9488,3.2797,12.6138,7.5314,635
-4.2145,-9.9921,0.5404,1.3336,-9.9921,5.4066,14.3415,5.7846,637
-0.6935,-9.9136,0.1358,0.5452,-9.9136,1.3078,9.3121,5.9292,639
-1.6399,-10.3236,-0.0443,0.7993,-10.3236,1.4125,7.8799,3.9633,640
-5.6975,-10.0939,1.7082,2.8925,-10.0939,1.4103,21.3916,11.2936,641
-28.8235,-9.8834,-3.9239,9.705,-9.8834,6.1726,14.4228,5.36,642
-12.5496,-9.877,0.9874,4.0788,-9.877,2.8925,7.7846,2.6693,644
0.3465,-9.8958,0.6788,0.3029,-9.8958,0.2893,1.982,1.7023,645
0.2627,-9.8912,0.4006,0.0846,-9.8912,0.0748,1.6802,1.6595,646
0.7144,-9.8939,1.0431,0.1446,-9.8939,0.1221,1.9405,1.8872,647
0.658,-9.8987,0.794,0.1296,-9.8987,0.1299,1.9367,1.7918,648
0.6945,-9.9042,1.56,0.8112,-9.9042,0.7863,4.2598,1.9693,649
0.1465,-9.9425,0.6932,0.2682,-9.9425,0.43,2.4548,2.091,652
0.057,-9.9434,0.1895,0.0899,-9.9434,0.1679,1.7597,1.6741,653
0.1624,-9.9434,0.3547,0.1137,-9.9434,0.2138,1.8421,1.759,654
0.2679,-9.9454,0.3119,0.0338,-9.9454,0.056,1.7621,1.7162,655
0.124,-9.9432,0.1607,0.0286,-9.9432,0.049,1.6756,1.6286,656
-0.0921,-9.9308,0.2757,0.2589,-9.9308,0.3418,1.8711,1.6668,657
0.3505,-9.938,0.4541,0.0786,-9.938,0.1138,1.823,1.7419,658
0.2943,-9.9335,0.3285,0.0288,-9.9335,0.04,1.7322,1.6891,659
-2.8012,-9.8942,-0.3936,1.3803,-9.8942,1.4321,3.7436,2.3544,660
-1.8596,-9.8897,-0.3257,0.8828,-9.8897,2.7525,11.1048,6.7588,661
-3.8964,-10.211,-0.0832,2.9876,-10.211,0.5565,16.1391,15.0571,662
-10.7084,-9.674,-3.1203,5.3955,-9.674,3.0303,20.7302,19.0813,663
-0.8493,-9.8468,2.2154,2.9325,-9.8468,5.4022,22.6844,13.4663,664
-7.9923,-10.1331,-2.0811,2.8444,-10.1331,4.2579,13.7506,7.7433,665
-1.3941,-9.8082,-0.462,0.6536,-9.8082,0.501,7.6401,5.0963,666
-4.6422,-10.0544,-1.0982,2.7629,-10.0544,4.6651,9.6724,7.3646,667
-7.5912,-10.2703,-0.2,4.1158,-10.2703,1.9263,14.7197,12.0005,668
0.0098,-10.3864,2.3167,2.5765,-10.3864,1.3328,9.4126,7.6713,669
-0.618,-10.0882,0.4362,1.0936,-10.0882,3.4264,10.6386,6.7032,670
-1.2978,-9.9479,0.426,1.1336,-9.9479,2.4838,6.2522,3.549,672
-1.6279,-9.9738,0.6802,1.2715,-9.9738,3.527,6.5891,4.5761,673
-0.8176,-9.8551,0.0651,0.6978,-9.8551,1.6046,4.4369,3.1744,674
-0.5646,-9.8113,0.8529,1.4761,-9.8113,3.9187,8.7724,5.8387,675
-0.0076,-9.891,0.4357,0.5969,-9.891,1.8124,5.6524,4.7343,676
-1.6616,-9.8936,-0.2191,0.7944,-9.8936,1.7929,7.5355,5.1981,677
-0.4785,-10.0094,0.9803,0.9956,-10.0094,3.0211,5.0403,3.1849,678
-0.5405,-9.7513,-0.0413,0.3467,-9.7513,0.7361,7.4906,5.5946,679
-0.413,-10.0015,0.3929,0.4352,-10.0015,1.2496,5.4428,4.3269,680
-4.0155,-10.0531,-0.0672,1.7797,-10.0531,3.3835,9.7568,5.8369,682
-0.0034,-9.972,5.4134,5.9291,-9.972,8.9804,22.0852,15.1866,683
-1.0906,-10.2106,-0.3095,0.4049,-10.2106,2.4433,10.1845,9.7769,684
-0.2199,-9.9923,-0.0318,0.0973,-9.9923,0.7123,4.4514,4.0373,685
-0.3182,-9.9468,-0.1136,0.1501,-9.9468,0.4441,2.4698,1.98,686
-0.3967,-10.0896,0.3154,0.5824,-10.0896,0.4864,5.2241,3.9875,687
-0.2668,-9.8738,0.239,0.4664,-9.8738,1.5819,4.8133,3.9711,688
-2.5627,-9.9706,0.6774,2.1352,-9.9706,1.4863,9.8522,6.9361,689
-6.621,-10.0792,-0.1437,2.9224,-10.0792,3.1403,15.626,8.5069,690
-2.2722,-10.0615,0.4105,1.3673,-10.0615,4.5986,31.0962,10.7779,692
-9.9489,-9.9571,9.1905,14.9251,-9.9571,10.3246,33.7966,26.6003,693
-7.8938,-10.1584,-0.8709,5.2048,-10.1584,6.0371,27.7625,23.9691,694
-11.0221,-10.7504,8.0233,19.6288,-10.7504,13.2293,68.9943,66.3926,695
-5.2498,-9.86,1.3003,4.6234,-9.86,3.8203,37.2077,35.5938,696
-4.0892,-9.9951,-1.7499,1.52,-9.9951,0.672,11.4703,8.7158,697
-3.7071,-9.9444,-0.157,1.5984,-9.9444,2.1067,4.4464,2.9118,698
-4.0951,-9.9575,-0.4098,1.3729,-9.9575,1.684,8.2017,1.7455,700
-0.1302,-9.96,0.1824,0.1718,-9.96,0.6252,2.1782,1.7463,701
-0.1211,-9.9689,0.0136,0.0709,-9.9689,0.6822,1.8731,1.7698,702
-0.5501,-9.9659,-0.1407,0.1841,-9.9659,0.7647,2.595,1.7664,703
-0.0327,-9.9619,0.0199,0.0442,-9.9619,0.2619,1.8564,1.7169,704
-0.0382,-9.9664,-0.0128,0.0138,-9.9664,0.0802,1.7978,1.6798,705
-0.0192,-9.9684,-0.007,0.0087,-9.9684,0.1173,1.6483,1.6168,706
-0.0314,-9.9656,-0.0018,0.0133,-9.9656,0.1398,1.7974,1.6669,708
-0.0265,-9.9663,0.003,0.0167,-9.9663,0.2135,1.8472,1.6798,709
-0.0381,-9.9651,-0.0014,0.0257,-9.9651,0.2002,1.9221,1.8328,710
-0.0002,-9.9643,0.0155,0.01,-9.9643,0.0528,1.7038,1.6871,711
-0.0124,-9.9684,0.0024,0.0118,-9.9684,0.0601,1.7057,1.6798,712
-0.0242,-9.9643,-0.0034,0.015,-9.9643,0.0917,1.737,1.6838,713
0.0114,-9.9668,0.0304,0.0092,-9.9668,0.1021,1.8097,1.7238,714
-0.0358,-9.9641,0.0065,0.028,-9.9641,0.1512,1.9582,1.7325,715
-0.686,-9.9648,-0.0209,0.2152,-9.9648,0.696,3.197,1.6979,717
-0.2764,-9.966,-0.0281,0.0802,-9.966,0.6217,2.3438,1.7311,718
-0.1856,-9.9665,-0.0281,0.0464,-9.9665,0.4113,2.0519,1.6838,719
-0.0319,-9.965,-0.002,0.0139,-9.965,0.098,1.7782,1.68,720
-0.1136,-9.9629,-0.0305,0.0696,-9.9629,0.4583,2.2584,1.726,721
-4.4121,-9.9983,-0.1744,2.3071,-9.9983,4.7033,28.2941,17.3255,722
-3.8146,-9.9797,0.8748,2.3764,-9.9797,3.559,18.7638,13.5075,723
-7.5544,-9.9546,-0.6915,1.8024,-9.9546,1.9473,15.2129,2.3006,725
-0.219,-9.9641,-0.0162,0.0964,-9.9641,0.5646,1.8953,1.6872,726
-0.1227,-9.9638,-0.0297,0.0436,-9.9638,0.49,1.9344,1.6998,727
-0.1039,-9.9641,-0.073,0.0183,-9.9641,0.0235,1.8569,1.8244,728
-0.164,-9.9642,-0.0666,0.0482,-9.9642,0.194,1.8921,1.6515,729
0.0141,-9.9686,0.051,0.0447,-9.9686,0.2589,1.8658,1.6908,730
-0.5261,-9.9532,0.3683,0.6019,-9.9532,1.508,19.5917,8.4896,732
-6.1826,-9.9465,-0.2632,2.3449,-9.9465,2.4455,8.0646,6.8469,733
-10.8952,-9.9247,-2.9853,6.428,-9.9247,4.7003,8.9073,4.99,734
-0.8806,-9.9379,0.9938,2.33,-9.9379,4.3196,7.8256,4.3133,735
-32.1971,-9.6897,-3.756,14.1029,-9.6897,4.5365,9.4096,3.9556,737
5.208,-9.7946,10.3268,4.3426,-9.7946,2.4057,10.5583,6.5325,738
-1.251,-9.9192,0.6385,1.6053,-9.9192,1.921,4.7752,1.9301,739
-3.5961,-9.9106,-2.2196,0.9176,-9.9106,1.0272,4.2829,2.9657,740
-5.2485,-9.8671,-1.0275,2.7506,-9.8671,2.6705,6.0288,2.7758,742
-3.3306,-9.886,0.2227,2.6927,-9.886,2.2149,3.9226,2.7383,743
-2.5618,-9.9094,-0.2585,1.5392,-9.9094,1.7917,3.2534,2.1971,744
1.8478,-9.9435,5.3665,1.9106,-9.9435,0.5242,8.1438,7.8896,745
-8.4106,-9.9599,-2.3869,2.2529,-9.9599,1.133,7.2673,4.425,746
-8.7562,-9.9628,-1.5522,3.42,-9.9628,6.314,12.7365,3.8305,747
-83.1553,-9.9184,-4.2872,24.106,-9.9184,13.4477,38.51,19.2916,748
-2.3869,-10.0002,0.638,2.1343,-10.0002,1.9466,18.5595,2.2828,749
0.0028,-9.9673,0.0415,0.0237,-9.9673,0.0826,1.7523,1.6768,750
