timestamp,AX_mean,AX_min,AX_max,AX_median,AX_std,AX_meandiff,AX_mediandiff,AX_extremum,AX_delta,AY_mean,AY_min,AY_max,AY_median,AY_std,AY_meandiff,AY_mediandiff,AY_extremum,AY_delta,AZ_mean,AZ_min,AZ_max,AZ_median,AZ_std,AZ_meandiff,AZ_mediandiff,AZ_extremum,AZ_delta,GX_mean,GX_min,GX_max,GX_median,GX_std,GX_meandiff,GX_mediandiff,GX_extremum,GX_delta,GY_mean,GY_min,GY_max,GY_median,GY_std,GY_meandiff,GY_mediandiff,GY_extremum,GY_delta,GZ_mean,GZ_min,GZ_max,GZ_median,GZ_std,GZ_meandiff,GZ_mediandiff,GZ_extremum,GZ_delta,AYGX_mean,AYGX_min,AYGX_max,AYGX_median,AYGX_std,AYGX_meandiff,AYGX_mediandiff,AYGX_extremum,AYGX_delta,Anorm_mean,Anorm_min,Anorm_max,Anorm_median,Anorm_std,Anorm_meandiff,Anorm_mediandiff,Anorm_extremum,Anorm_delta,Gnorm_mean,Gnorm_min,Gnorm_max,Gnorm_median,Gnorm_std,Gnorm_meandiff,Gnorm_mediandiff,Gnorm_extremum,Gnorm_delta
0,0.2121,0.205,0.2265,0.2117,0.0036,-0.0033,0.007,0.2265,0.0214,0.1546,0.1227,0.1783,0.1547,0.0078,-0.0012,0.0093,0.1783,0.0557,-9.7023,-9.7116,-9.6824,-9.7025,0.0044,-0.0025,0.0013,9.7116,0.0293,-0.1879,-0.2207,-0.1592,-0.1892,0.0103,0.0067,0.0158,0.2207,0.0615,2.4512,2.4238,2.485,2.45,0.012,-0.0194,-0.0219,2.485,0.0613,0.2383,0.21,0.261,0.24,0.0114,-0.0013,-0.0037,0.261,0.051,-0.0291,-0.0371,-0.0206,-0.0292,0.0025,0.0007,0.0014,0.0371,0.0165,9.7059,9.6858,9.7152,9.7059,0.0044,0.0029,-0.0011,9.7152,0.0295,2.4699,2.4422,2.5031,2.4693,0.0119,-0.0183,-0.0245,2.5031,0.0609
1,0.2088,0.0058,0.4498,0.2187,0.0809,0.0008,-0.0128,0.4498,0.444,0.1534,-0.0461,0.3148,0.164,0.072,0.0014,-0.0108,0.3148,0.3608,-9.7048,-9.8171,-9.5811,-9.7012,0.0535,0.0025,0.0006,9.8171,0.236,-0.1813,-0.3903,-0.0391,-0.1734,0.0615,-0.0098,-0.0248,0.3903,0.3512,2.4318,2.3625,2.5113,2.4281,0.0309,0.0256,0.0306,2.5113,0.1488,0.237,0.0899,0.396,0.2362,0.0657,-0.0027,0.0045,0.396,0.3061,-0.0284,-0.0988,0.0095,-0.0278,0.0203,-0.0027,0.0016,0.0988,0.1083,9.7089,9.5811,9.8184,9.7048,0.0545,-0.0028,-0.0013,9.8184,0.2372,2.4517,2.3801,2.5214,2.4448,0.0304,0.0257,0.0315,2.5214,0.1412
2,0.2097,0.1307,0.2822,0.2059,0.0326,-0.0001,0.0016,0.2822,0.1515,0.1548,0.0646,0.2471,0.1532,0.0461,0.004,-0.0024,0.2471,0.1825,-9.7024,-9.7469,-9.6675,-9.7006,0.0197,-0.0009,-0.0173,9.7469,0.0794,-0.191,-0.3783,-0.0227,-0.1982,0.0803,-0.0079,0.0315,0.3783,0.3557,2.4574,2.38,2.5375,2.4588,0.0378,-0.0084,0.0044,2.5375,0.1575,0.2343,0.156,0.2744,0.2407,0.0301,0.0027,-0.0119,0.2744,0.1184,-0.0312,-0.0687,-0.0028,-0.0262,0.0185,-0.0129,-0.0057,0.0687,0.0659,9.706,9.6707,9.75,9.7035,0.0196,0.0022,0.0175,9.75,0.0793,2.4774,2.4155,2.559,2.4763,0.0353,0.0046,0.0035,2.559,0.1436
3,0.2095,0.0473,0.375,0.2075,0.08,0.0013,0.007,0.375,0.3277,0.1588,-0.1065,0.465,0.1508,0.1498,-0.0072,0.0027,0.465,0.5715,-9.7032,-9.9271,-9.4296,-9.7179,0.1121,-0.0009,0.0106,9.9271,0.4975,-0.1989,-0.9471,0.2265,-0.1667,0.2632,0.0063,-0.0225,0.9471,1.1735,2.449,2.3275,2.5462,2.4631,0.0649,-0.0027,-0.0131,2.5462,0.2188,0.237,0.0555,0.3958,0.2288,0.0697,0.0046,0.0112,0.3958,0.3402,-0.0441,-0.2862,0.0076,-0.0319,0.063,0.0127,0.0048,0.2862,0.2938,9.7082,9.4317,9.9313,9.721,0.1127,-0.0004,-0.0104,9.9313,0.4995,2.482,2.339,2.7217,2.4799,0.0933,-0.0145,-0.0142,2.7217,0.3827
4,0.2109,0.1242,0.2995,0.2144,0.0434,-0.0028,-0.0159,0.2995,0.1753,0.1515,0.0126,0.2836,0.1535,0.0603,0.0002,0.0138,0.2836,0.2711,-9.7041,-9.9038,-9.4206,-9.7073,0.0869,0.0124,0.0033,9.9038,0.4832,-0.1926,-0.3723,0.0314,-0.1892,0.0873,-0.0639,-0.0038,0.3723,0.4037,2.4463,2.4063,2.485,2.45,0.0184,0.039,0.0044,2.485,0.0787,0.2415,0.1516,0.3135,0.24,0.0394,0.0821,0.0157,0.3135,0.1619,-0.0314,-0.1047,0.0048,-0.0271,0.0232,-0.0246,-0.0029,0.1047,0.1096,9.7078,9.4221,9.9108,9.7105,0.088,0.0105,-0.0022,9.9108,0.4887,2.4675,2.42,2.5208,2.4657,0.0218,0.2003,0.065,2.5208,0.1008
5,0.2081,-1.1165,2.2783,0.1985,0.6045,0.0042,0.0076,2.2783,3.3948,0.1517,-0.5194,1.0029,0.1673,0.2974,0.0092,0.0012,1.0029,1.5224,-9.6917,-10.8735,-8.7964,-9.704,0.3737,-0.0069,0.0011,10.8735,2.0771,-0.2565,-1.1392,0.4866,-0.193,0.3941,0.0347,0.0049,1.1392,1.6258,2.4853,2.2575,3.0188,2.4544,0.1641,-0.0165,-0.0022,3.0188,0.7612,0.3237,-2.2915,2.4951,0.2557,0.876,-0.0448,-0.009,2.4951,4.7866,-0.056,-0.4083,0.3486,-0.03,0.1443,0.0122,-0.0004,0.4083,0.7569,9.7183,8.881,10.9476,9.7084,0.3548,-0.0043,-0.0015,10.9476,2.0666,2.6678,2.3739,3.7664,2.5307,0.386,-0.0972,-0.03,3.7664,1.3926
7,0.2165,0.0959,0.3674,0.2137,0.0463,-0.0852,-0.0627,0.3674,0.2715,0.1701,-0.003,0.295,0.1696,0.0531,-0.1303,-0.0841,0.295,0.298,-9.7056,-9.9356,-9.5387,-9.7018,0.0564,-0.0185,-0.0084,9.9356,0.3969,-0.1871,-0.434,0.1215,-0.1832,0.0933,-0.3445,-0.096,0.434,0.5554,2.4523,2.4238,2.4938,2.45,0.0137,0.1727,0.1619,2.4938,0.07,0.2342,-0.0856,0.4334,0.2377,0.0771,-1.9891,-1.8591,0.4334,0.519,-0.0316,-0.1076,0.0116,-0.0308,0.0202,0.0694,0.0354,0.1076,0.1192,9.7098,9.5453,9.9463,9.7054,0.0575,0.0213,0.0092,9.9463,0.401,2.4734,2.4454,2.5171,2.4707,0.0148,1.696,1.1413,2.5171,0.0717
8,0.1312,-0.0704,0.367,0.151,0.127,0.1756,0.2828,0.367,0.4374,0.0399,-0.4769,0.8049,0.0856,0.3298,-0.8338,-0.8976,0.8049,1.2818,-9.7242,-9.9686,-9.6186,-9.7102,0.0912,0.0234,-0.2233,9.9686,0.35,-0.5316,-4.5612,4.2577,-0.2792,2.608,5.3341,4.9713,4.5612,8.8189,2.625,2.415,2.9488,2.6119,0.1558,0.035,0.1575,2.9488,0.5337,-1.7549,-5.5061,0.3044,-1.6214,1.9144,-0.5528,-0.2244,5.5061,5.8104,0.0378,-2.9693,1.9826,0.0046,1.1805,-1.5913,-1.5093,2.9693,4.9519,9.7311,9.622,10.0078,9.7146,0.0967,0.0205,0.2688,10.0078,0.3857,4.1695,2.436,7.5591,3.6121,1.6982,6.9336,5.9755,7.5591,5.1231
9,0.3068,-0.2733,0.7324,0.4339,0.3696,-0.0604,-0.2911,0.7324,1.0056,-0.7939,-1.4093,-0.0969,-0.812,0.4213,1.4722,0.7034,1.4093,1.3123,-9.7008,-10.5674,-8.8478,-9.9335,0.6694,0.1586,0.4163,10.5674,1.7196,4.8025,-8.3428,20.5907,4.6921,10.9279,-21.1719,-20.7318,20.5907,28.9335,2.66,2.1875,2.9662,2.7694,0.281,-0.0509,-0.2756,2.9662,0.7788,-2.3077,-10.7389,3.8596,-1.8458,5.3561,-1.2788,-1.8823,10.7389,14.5984,-1.5534,-11.8003,7.125,-1.5047,6.5836,-20.4616,-0.2571,11.8003,18.9252,9.7516,8.8995,10.6617,9.9834,0.6783,0.0002,-0.2869,10.6617,1.7621,11.1031,2.9121,23.3256,9.5876,6.9158,8.3254,7.5846,23.3256,20.4135
10,0.2464,-0.1406,0.7375,0.1427,0.2605,0.4506,0.5761,0.7375,0.8782,0.6782,-1.6582,3.6485,-0.1086,1.9313,2.2769,3.264,3.6485,5.3067,-9.5422,-10.139,-9.1475,-9.5172,0.2584,0.0421,0.0007,10.139,0.9915,-16.3694,-35.0719,2.1729,-16.0397,13.6044,21.1653,21.282,35.0719,37.2447,2.6091,2.03,3.4388,2.4938,0.4579,0.729,0.8881,3.4388,1.4087,-3.5865,-9.7899,2.4479,-3.7281,4.1916,-1.008,-0.9629,9.7899,12.2377,-22.0151,-95.4209,27.3771,-1.7619,38.2553,33.5444,18.8204,95.4209,122.798,9.7518,9.2874,10.2039,9.6966,0.324,0.2319,0.2835,10.2039,0.9165,19.4285,7.0499,35.1698,17.1722,10.3456,-9.496,-8.3732,35.1698,28.1199
11,0.697,0.5109,0.8852,0.7188,0.1614,-0.8497,-0.6404,0.8852,0.3743,2.9551,2.1238,3.4032,3.1554,0.4827,-3.7675,-3.466,3.4032,1.2794,-9.5001,-9.5991,-9.3657,-9.5164,0.0805,-0.1622,-0.196,9.5991,0.2334,4.7959,-7.4609,15.01,5.2423,8.1501,2.2672,0.5502,15.01,22.4709,3.3381,2.8613,3.8237,3.3819,0.3823,-0.7717,-1.015,3.8237,0.9625,-4.5945,-6.089,-2.5333,-4.691,1.1023,-0.8019,-0.4615,6.089,3.5557,11.5293,-24.0737,31.8776,17.0585,21.5867,-17.0014,-18.8812,31.8776,55.9512,9.9837,9.6574,10.1896,9.9801,0.1781,-0.0541,-0.1953,10.1896,0.5323,9.9325,5.475,16.6253,8.799,4.2643,-0.115,-0.3137,16.6253,11.1503
12,-0.1527,-2.9218,0.6396,0.0785,0.8248,0.049,0.4254,2.9218,3.5614,-0.8124,-7.765,1.4272,-0.3106,2.0994,3.6523,5.0769,7.765,9.1922,-9.6623,-10.1927,-8.6105,-9.7124,0.333,0.0471,0.0791,10.1927,1.5823,7.063,-1.4258,19.9084,5.7925,4.8701,-28.2878,-33.3157,19.9084,21.3342,2.5664,1.8725,4.0337,2.3669,0.5315,-1.3119,-1.7981,4.0337,2.1612,-5.3964,-9.1456,-3.0074,-5.1525,1.7377,4.6951,5.0874,9.1456,6.1383,-5.4721,-97.2614,12.9442,-1.8227,21.9392,-22.6662,10.3961,97.2614,110.2057,9.9296,9.1588,12.1527,9.7848,0.6801,1.1838,1.3712,12.1527,2.9939,9.8175,6.4246,21.3194,8.4853,3.9749,19.7892,21.632,21.3194,14.8947
13,-0.1037,-2.6033,1.2993,0.5038,1.4996,0.4582,-0.0948,2.6033,3.9026,2.8399,-5.716,7.5525,4.7663,5.0314,-6.2619,-9.0387,7.5525,13.2685,-9.6153,-9.9865,-9.1516,-9.6333,0.3272,0.8775,0.9576,9.9865,0.8348,-21.2248,-46.7172,25.3206,-27.5232,26.1004,-5.6718,-4.6365,46.7172,72.0377,1.2545,-0.3325,4.025,0.5688,1.691,0.8633,1.4175,4.025,4.3575,-0.7013,-6.5903,3.3531,-0.0651,3.1441,1.6259,1.4092,6.5903,9.9434,-28.1382,-245.4829,121.1838,8.5734,154.388,61.2047,2.9784,245.4829,366.6667,11.1135,9.1988,12.5703,11.156,1.1863,-1.2537,-1.547,12.5703,3.3716,29.6067,7.5744,46.7717,30.1173,14.4709,12.3406,7.358,46.7717,39.1973
14,0.3545,-0.3933,1.1986,0.409,0.3897,-0.2089,-0.2228,1.1986,1.5919,-3.422,-8.5495,1.7749,-4.2723,3.2294,10.0108,11.0562,8.5495,10.3244,-8.7378,-9.2518,-8.4592,-8.6757,0.2007,0.7801,0.7591,9.2518,0.7927,-26.8966,-71.351,37.2264,-32.1597,41.164,7.459,26.9662,71.351,108.5774,2.1179,1.3388,3.535,1.9863,0.6892,0.5475,0.8181,3.535,2.1962,0.9246,-3.2872,4.059,1.3441,2.1889,-2.3833,-4.363,4.059,7.3462,33.0664,-275.1618,299.0821,11.5518,154.5891,-137.3574,-40.4733,299.0821,574.2439,9.8598,8.5563,12.0589,9.609,1.0943,0.6494,0.7337,12.0589,3.5026,41.9473,3.7113,71.3706,37.4754,24.9822,-15.0183,-20.4747,71.3706,67.6593
15,0.1456,-0.8725,1.2225,0.1862,0.5344,0.036,0.0116,1.2225,2.095,6.5887,2.5026,9.6847,6.7839,1.9203,-3.7324,-4.1613,9.6847,7.1821,-7.9577,-13.3425,-5.5459,-7.9166,1.3615,-0.8289,-0.9019,13.3425,7.7967,-19.4376,-64.9077,31.7299,-5.1935,30.1712,24.5572,3.701,64.9077,96.6376,2.6654,-3.5962,7.6563,2.8044,2.26,-0.0818,-0.4069,7.6563,11.2525,-1.4587,-5.9999,9.4494,-3.0189,3.7235,2.9231,3.8116,9.4494,15.4493,-104.2909,-532.8617,287.8506,-28.9215,194.4655,115.0926,27.1616,532.8617,820.7123,10.5092,8.6774,14.0632,10.3427,1.412,-0.9434,-0.9189,14.0632,5.3857,26.929,2.87,65.0735,17.0006,24.034,4.1578,12.8493,65.0735,62.2035
16,0.1816,-0.2181,0.7763,0.1978,0.2886,0.1772,0.0703,0.7763,0.9945,2.8563,-0.3399,7.8517,2.6225,2.5261,2.2062,2.4858,7.8517,8.1916,-8.7866,-9.4645,-7.6817,-8.8185,0.4942,0.1459,0.2019,9.4645,1.7828,5.1196,-33.9352,56.891,-1.4925,34.301,-1.0385,6.3634,56.891,90.8261,2.5836,1.82,3.8675,2.3975,0.6375,-0.038,0.1575,3.8675,2.0475,1.4645,-2.6294,7.0584,0.7927,2.337,-1.2793,-1.1824,7.0584,9.6878,10.8017,-153.5186,333.4677,-1.7599,150.3071,8.5219,23.4862,333.4677,486.9863,9.5658,8.7337,11.1547,9.4238,0.5968,0.4858,0.5827,11.1547,2.421,31.0868,3.7376,57.0138,29.8499,14.6225,-23.8912,-23.3358,57.0138,53.2763
17,0.3588,-0.1291,1.3511,0.2681,0.4073,0.7985,0.8297,1.3511,1.4802,5.0625,3.4289,6.8003,5.1083,0.783,-2.891,-2.4275,6.8003,3.3714,-8.6407,-10.2385,-7.4381,-8.6166,0.5334,-0.6141,-0.3851,10.2385,2.8005,4.0811,-14.0488,18.778,4.8709,6.5469,24.0678,23.1322,18.778,32.8268,2.5456,2.1087,3.0625,2.555,0.2299,-0.2373,-0.7525,3.0625,0.9537,0.1852,-2.7934,8.1287,-0.3896,2.4227,22.0864,11.1051,8.1287,10.9221,19.3235,-89.7106,91.4913,21.7264,37.2545,44.3724,46.1874,91.4913,181.2019,10.0516,8.5252,11.7847,10.0065,0.6512,-0.1252,-0.2216,11.7847,3.2595,7.1956,2.3786,20.5748,6.5141,4.3628,32.7305,31.2605,20.5748,18.1962
18,1.1573,-2.9382,4.1966,1.0978,1.7463,0.0374,0.3203,4.1966,7.1348,2.1715,-1.7103,4.6604,2.6809,2.0202,-1.9029,-2.3865,4.6604,6.3707,-9.2548,-10.8437,-8.2634,-9.0016,0.7474,-0.2548,-0.7001,10.8437,2.5804,28.1489,12.6055,38.6626,28.0032,7.4533,-34.9376,-33.157,38.6626,26.0571,2.3083,-1.2863,6.7025,1.8025,1.9302,0.732,4.5413,6.7025,7.9888,22.2716,4.525,53.2681,10.7155,18.9395,15.6224,34.999,53.2681,48.7431,63.696,-30.0243,143.9727,67.9138,52.706,-63.8106,-69.7702,143.9727,173.997,9.9263,8.4652,11.5537,9.7848,0.7686,0.0437,0.1729,11.5537,3.0885,39.926,22.6353,58.8966,37.7746,10.2758,0.5466,8.76,58.8966,36.2613
19,1.1947,-3.7902,4.4103,1.4181,2.0206,-1.0012,-1.0352,4.4103,8.2004,0.2686,-2.3404,2.7287,0.2944,1.2981,-0.04,-0.2854,2.7287,5.0691,-9.5096,-20.6604,-0.2841,-9.7017,3.6746,-0.1555,0.2642,20.6604,20.3763,-6.7887,-24.7839,8.7943,-5.1538,8.7966,8.3861,5.0664,24.7839,33.5782,3.0403,-22.2688,8.82,6.3438,7.1082,2.383,-0.875,22.2688,31.0888,37.894,5.5095,61.5598,45.7145,18.1385,-37.8035,-48.1568,61.5598,56.0502,-0.1146,-24.4457,41.7856,-1.8565,16.7259,3.4625,5.4468,41.7856,66.2313,9.9701,2.3403,21.0054,9.9577,3.3914,-0.1001,-0.3179,21.0054,18.6651,40.4727,6.5769,64.3763,46.5346,17.444,-25.2228,-30.5139,64.3763,57.7994
20,0.1935,-3.0,2.6822,0.3829,1.4407,-0.082,-0.2634,3.0,5.6822,0.2286,-2.1411,2.952,0.009,1.3946,-0.2832,-0.1483,2.952,5.0931,-9.6651,-14.1764,-6.0743,-9.4375,2.2815,-0.0584,-0.1222,14.1764,8.1021,1.5973,-9.949,13.8601,-0.0874,7.7622,-2.7611,-1.8847,13.8601,23.8091,5.4233,-3.0012,18.5938,5.4688,5.3581,-0.1967,0.2691,18.5938,21.595,0.0905,-14.8285,17.9117,-2.4423,11.3763,-15.6043,-16.3862,17.9117,32.7403,3.3479,-23.9439,25.7904,3.5904,10.6041,-0.6106,-1.5376,25.7904,49.7343,9.87,6.3667,14.2519,9.6398,2.2706,-0.0149,0.0316,14.2519,7.8852,15.2498,7.2325,20.6578,16.0208,3.1261,9.025,10.2278,20.6578,13.4253
22,0.0296,-1.2277,1.6499,-0.144,0.6982,-0.7489,-0.5042,1.6499,2.8776,-0.3378,-1.8473,1.5529,-0.2875,0.743,0.5928,1.3458,1.8473,3.4002,-9.7818,-11.9272,-6.6933,-9.6819,1.0301,1.548,0.6241,11.9272,5.2339,-3.9249,-12.141,9.0457,-3.8569,5.5562,7.6975,5.6405,12.141,21.1867,5.03,-5.8275,20.1512,6.0069,5.7745,10.2643,8.5837,20.1512,25.9788,-31.118,-56.9665,5.7113,-35.2148,18.572,-8.6149,-6.2434,56.9665,62.6778,2.1266,-5.0329,18.7154,0.5151,5.2933,-0.3982,1.845,18.7154,23.7483,9.8402,6.7022,11.9924,9.703,1.019,-0.8126,-0.0461,11.9924,5.2902,33.2998,1.5007,61.099,36.4764,17.5006,12.5713,11.8011,61.099,59.5983
23,-0.7194,-5.9488,5.279,-0.6482,2.5053,0.9616,1.1466,5.9488,11.2278,0.255,-4.8429,2.9903,1.0583,1.8663,-0.0776,-0.6355,4.8429,7.8332,-8.2338,-17.5862,-1.7079,-9.0578,4.4084,-0.6976,0.3312,17.5862,15.8783,3.7726,-9.5896,22.4957,1.7837,10.2796,6.689,9.3288,22.4957,32.0854,15.2943,-18.5588,61.3813,14.5906,15.8971,-11.0633,-11.7162,61.3813,79.94,-39.7329,-59.389,-17.8484,-41.4582,12.0147,34.4974,33.645,59.389,41.5407,1.7284,-68.6778,36.4055,2.3601,22.6024,-1.8045,-0.9154,68.6778,105.0833,9.0276,2.6128,18.2808,9.6568,3.9375,1.5682,0.0785,18.2808,15.6679,45.8711,20.4164,73.0263,48.2775,14.6075,-25.2039,-28.3195,73.0263,52.6099
24,0.2423,-4.5525,4.4804,0.4985,2.5474,0.648,0.6669,4.5525,9.0329,0.1774,-3.0262,3.749,0.4228,1.4957,-0.319,-0.5122,3.749,6.7752,-8.9314,-22.5636,10.1341,-8.7267,7.2101,-0.6896,-1.0887,22.5636,32.6977,10.4616,1.3292,18.5243,11.1125,4.8635,-18.3454,-20.0086,18.5243,17.1952,4.231,-11.5763,33.9325,2.8744,10.1268,-2.0676,-1.6144,33.9325,45.5088,-5.2355,-24.5875,15.7166,-7.8131,14.798,22.7884,25.217,24.5875,40.3041,-0.0761,-42.1908,34.1096,1.4447,16.4634,2.0564,-0.8229,42.1908,76.3004,10.5959,3.4593,23.0184,9.7353,5.1856,-0.6991,0.1679,23.0184,19.5591,20.6672,6.6581,44.275,19.958,7.8081,-0.241,-0.347,44.275,37.6169
25,0.8903,-3.3421,4.7735,1.1653,1.9603,0.0019,-0.1758,4.7735,8.1155,-0.1416,-2.0101,1.2363,-0.0895,0.9078,0.2342,0.2331,2.0101,3.2464,-9.621,-11.2317,-7.2773,-9.8154,1.1031,-0.2212,-0.0476,11.2317,3.9544,-7.8838,-12.7551,-0.0785,-8.8961,3.9313,11.779,12.009,12.7551,12.6765,2.1634,-2.1525,13.93,1.26,4.1734,2.9504,3.3819,13.93,16.0825,17.5528,8.2395,24.2182,17.4039,4.9808,-41.6499,-37.9745,24.2182,15.9787,1.9802,-12.3528,13.4658,0.6218,6.4679,1.4554,-1.5394,13.4658,25.8186,9.8968,7.9029,11.4258,9.9033,1.0047,0.1161,0.2253,11.4258,3.5229,20.4262,15.045,26.2571,19.611,3.545,6.6075,5.0332,26.2571,11.2121
26,0.8922,-0.4685,2.1723,0.9896,0.7882,-0.1818,-0.455,2.1723,2.6408,0.0927,-1.9017,2.7928,0.1436,1.4067,-0.1575,-0.2241,2.7928,4.6945,-9.8423,-12.2381,-7.317,-9.863,1.2843,-0.2171,0.0304,12.2381,4.921,3.8952,-8.6108,18.8664,3.1129,10.4596,-11.7564,-6.8452,18.8664,27.4772,5.1138,-0.5512,11.2788,4.6419,3.5733,5.8684,6.0506,11.2788,11.83,-24.0971,-42.155,-11.4416,-20.5706,9.2255,-4.9714,-16.54,42.155,30.7134,3.4356,-15.0687,46.3814,-0.9176,16.8278,5.0005,4.1828,46.3814,61.4501,10.0129,7.7798,12.2416,10.1286,1.2225,0.162,-0.2093,12.2416,4.4618,27.0337,14.3304,45.7951,24.6442,9.5498,10.829,14.5146,45.7951,31.4647
27,0.7105,-0.6081,2.1088,0.5346,0.7094,0.3453,0.6576,2.1088,2.7168,-0.0649,-1.7845,2.3326,-0.0805,1.1277,0.2275,0.1502,2.3326,4.1171,-10.0594,-14.2936,-5.9009,-9.8326,1.4793,0.2982,0.2277,14.2936,8.3926,-7.8612,-26.2981,11.5575,-3.7323,13.0095,16.0414,14.4507,26.2981,37.8556,10.9823,4.7513,17.15,10.6925,3.0928,-2.8302,-3.6619,17.15,12.3988,-29.0685,-48.7998,4.7384,-37.1106,18.0725,-0.5791,16.4683,48.7998,53.5382,8.4361,-11.1576,45.2103,3.2652,14.8171,-7.1394,-3.4205,45.2103,56.3679,10.1748,6.2404,14.3054,9.9193,1.4365,-0.2938,-0.157,14.3054,8.065,37.8628,18.4734,51.5186,39.1588,9.1091,-5.4998,-15.0543,51.5186,33.0452
28,1.0557,-0.7364,2.0237,1.1922,0.6645,-0.1368,-0.5177,2.0237,2.7601,0.1626,-1.2608,1.718,0.0697,0.8961,-0.1814,-0.0589,1.718,2.9789,-9.7612,-10.9765,-8.3388,-9.6049,0.7403,-0.3247,-0.8442,10.9765,2.6377,8.1802,-1.6981,19.0214,10.7185,7.8923,-9.7674,-13.9038,19.0214,20.7195,8.1521,3.9375,13.475,7.0306,3.0353,-0.5472,-0.2231,13.475,9.5375,-29.6476,-54.099,-14.8456,-20.6423,14.8891,-2.5491,-12.1203,54.099,39.2534,1.2966,-21.3096,25.1187,-0.1554,12.7746,0.0892,1.4749,25.1187,46.4283,9.881,8.5635,11.0043,9.7623,0.7263,0.2779,0.7241,11.0043,2.4409,32.363,16.0302,58.4935,24.1045,16.0204,1.6945,9.57,58.4935,42.4633
29,0.9189,0.5017,1.6883,0.6745,0.5049,0.3814,0.6204,1.6883,1.1866,-0.0188,-0.7504,0.9521,0.0108,0.5644,0.1938,-0.3782,0.9521,1.7025,-10.0859,-11.3959,-8.4311,-10.449,1.1081,0.4181,0.831,11.3959,2.9648,-1.5872,-10.3554,10.8553,-3.1853,7.7491,1.0884,2.4006,10.8553,21.2107,7.6048,4.9875,12.0225,6.8075,2.4685,-5.7925,-5.0181,12.0225,7.035,-32.1967,-43.7549,-19.513,-32.7626,9.58,34.1523,34.1452,43.7549,24.2419,1.3859,-3.4454,6.6912,1.3196,3.5275,-1.7053,-1.4411,6.6912,10.1366,10.1589,8.6022,11.4085,10.4864,1.0382,-0.3082,-0.6907,11.4085,2.8062,34.0574,22.931,45.9176,33.6745,9.2736,-29.0613,-28.9218,45.9176,22.9866
30,1.3003,0.4011,2.712,1.2949,0.6644,0.3215,0.1289,2.712,2.3109,0.175,-1.2405,2.6139,-0.3674,1.2349,-0.0607,-0.0051,2.6139,3.8544,-9.6678,-10.6245,-8.8128,-9.618,0.5712,0.124,0.0696,10.6245,1.8117,-0.4988,-5.5076,4.1936,-0.7847,2.921,2.7895,4.5936,5.5076,9.7013,1.8123,-1.505,4.1912,1.7894,1.4154,-0.4096,-0.2625,4.1912,5.6963,1.9556,-3.6359,9.0873,1.3825,3.632,-0.8848,-0.1469,9.0873,12.7232,-0.3194,-4.2283,4.9211,-0.1215,2.548,-1.5797,-1.9642,4.9211,9.1494,9.8508,9.0712,10.7245,9.7957,0.5658,-0.0127,0.1247,10.7245,1.6533,4.9961,2.1058,10.069,4.7527,2.225,3.4588,3.7788,10.069,7.9632
31,1.6217,-0.3997,3.735,1.4238,1.4299,-0.2749,-0.2912,3.735,4.1347,0.1143,-1.4488,2.5486,-0.3725,1.1149,-0.2195,0.8641,2.5486,3.9974,-9.5439,-11.5492,-8.2458,-9.5485,0.8948,-0.1079,-0.2756,11.5492,3.3034,2.2908,-8.5763,10.3537,3.8089,5.8637,-4.4285,-4.7108,10.3537,18.93,1.4027,-1.9775,4.4012,1.5269,2.1287,0.6737,0.4462,4.4012,6.3788,1.0708,-8.601,12.3244,1.2357,6.5047,-8.6278,-5.312,12.3244,20.9254,-1.8991,-14.9999,7.1779,-2.0857,5.9059,3.3937,2.4201,14.9999,22.1778,9.838,8.5204,11.8333,9.9204,0.9087,0.1048,0.2291,11.8333,3.313,8.4549,2.5238,13.4816,8.5315,3.7276,4.109,0.747,13.4816,10.9578
32,1.3469,-1.1301,3.7608,1.1326,1.3463,-0.4285,-0.2386,3.7608,4.8909,-0.1052,-2.9837,1.3985,0.4916,1.3449,0.3202,-0.2795,2.9837,4.3822,-9.6517,-12.5403,-5.1776,-9.8241,1.9491,0.0061,0.3141,12.5403,7.3627,-2.1377,-9.8308,5.2572,-0.902,5.0919,8.6725,7.0739,9.8308,15.088,2.0764,-5.4075,9.38,1.9731,3.5065,1.3939,1.5488,9.38,14.7875,-7.5569,-30.5423,7.5269,-4.0763,10.718,3.4815,0.1527,30.5423,38.0691,1.4946,-10.3304,17.021,0.3344,6.3557,1.7803,-0.2669,17.021,27.3514,9.9429,5.3774,12.5887,10.1494,1.84,-0.0672,-0.329,12.5887,7.2114,12.5639,5.2015,30.7036,9.2785,7.587,0.389,5.1135,30.7036,25.5021
33,0.9183,-2.9487,2.9817,0.894,1.3089,0.1677,0.0651,2.9817,5.9305,0.215,-1.7396,1.7354,0.2121,0.9246,-0.3571,-0.2783,1.7396,3.475,-9.6456,-15.9889,-2.9977,-9.51,3.2714,0.0018,-0.3546,15.9889,12.9912,6.5347,-2.7016,13.7002,6.1719,5.2732,-10.0168,-7.8766,13.7002,16.4018,3.4704,-2.7388,8.68,3.5219,3.1111,-0.8964,-1.2469,8.68,11.4188,-4.0755,-17.8492,18.1511,-3.9237,9.6744,14.0393,13.3406,18.1511,36.0003,3.2749,-7.2391,20.5137,0.0675,7.2787,-3.149,-0.0739,20.5137,27.7528,9.8757,4.1688,16.0189,9.8204,3.0863,-0.0652,0.1008,16.0189,11.8501,12.9529,4.0348,21.2122,14.392,5.5498,-0.4463,-2.7364,21.2122,17.1773
34,1.086,-0.5533,3.9323,0.9591,1.0377,-0.4027,-0.3871,3.9323,4.4856,-0.1421,-0.9341,0.7013,-0.0661,0.4022,-0.1877,-0.248,0.9341,1.6355,-9.6439,-14.4457,-4.9473,-9.8645,3.129,-0.7434,-0.4744,14.4457,9.4984,-3.4821,-15.0789,3.1759,-1.7047,5.7691,-1.4364,-5.8916,15.0789,18.2548,2.574,-4.1562,13.37,2.275,3.6457,2.6253,3.045,13.37,17.5262,9.9639,3.8376,19.4486,9.4169,4.6317,-19.581,-19.7996,19.4486,15.6111,0.1259,-6.7585,9.142,-0.0064,2.7151,4.444,2.2975,9.142,15.9005,9.8105,5.3221,14.4627,9.9212,2.983,0.6804,0.4984,14.4627,9.1407,12.5066,5.1123,21.7924,11.6556,5.2888,5.2178,4.8765,21.7924,16.6801
35,0.6833,-1.0938,2.9715,0.572,1.1828,0.2637,0.2953,2.9715,4.0653,-0.3298,-1.2441,0.4129,-0.3142,0.4987,0.2909,0.2008,1.2441,1.657,-10.3873,-14.2379,-6.228,-10.3389,1.9945,0.3623,0.4899,14.2379,8.0098,-4.9185,-15.2615,10.1539,-7.5963,9.5092,6.8042,9.0144,15.2615,25.4154,5.1993,0.6913,9.24,5.32,3.079,0.6892,0.8356,9.24,8.5487,-9.6171,-22.83,6.8258,-10.3827,10.8462,12.3752,12.8169,22.83,29.6558,4.5699,-1.0909,15.7322,2.291,5.5321,1.4732,-0.0443,15.7322,16.8231,10.4909,6.3513,14.2804,10.4196,1.9651,-0.3032,-0.4591,14.2804,7.9291,17.7243,8.264,24.9203,16.5321,5.3073,5.1825,5.5038,24.9203,16.6563
37,1.2107,-1.6648,5.2109,1.1625,1.3331,-0.2228,-0.2226,5.2109,6.8757,0.2519,-0.8653,1.7994,0.0874,0.6996,-0.4669,-0.3088,1.7994,2.6647,-9.6626,-15.426,-5.0581,-9.3592,2.1775,-0.1388,-0.6311,15.426,10.368,8.6898,-18.7387,29.1911,10.4326,13.492,-8.9545,-15.983,29.1911,47.9297,6.5777,-2.3975,16.3887,6.9913,4.5965,-1.7783,-1.3169,16.3887,18.7862,15.1334,-21.3466,44.599,15.2511,18.5111,-0.076,1.304,44.599,65.9456,7.5162,-18.5738,51.1734,2.2023,14.7752,-5.2811,-0.7263,51.1734,69.7473,9.8845,5.8965,15.5491,9.5013,2.0326,0.0562,0.6228,15.5491,9.6526,28.0894,10.7063,47.4407,27.5397,9.6875,-6.1732,-6.3512,47.4407,36.7344
38,0.9879,-1.29,2.958,0.9399,1.2303,0.314,0.327,2.958,4.248,-0.215,-1.1292,0.5434,-0.2214,0.446,0.6451,0.4192,1.1292,1.6726,-9.8014,-12.115,-6.849,-9.9903,1.3586,-0.3152,-0.415,12.115,5.266,-0.2646,-14.5749,18.9677,-5.5505,13.1285,-4.36,2.1788,18.9677,33.5426,4.7994,-2.0913,9.9138,5.6744,3.4381,1.1353,-1.4831,9.9138,12.005,15.0574,-1.8237,29.982,16.5551,10.7082,2.5481,0.5157,29.982,31.8057,2.2351,-4.7272,16.0268,1.4761,5.4128,-3.0758,-1.854,16.0268,20.754,9.9407,7.0958,12.2652,10.1241,1.3096,0.3325,0.4306,12.2652,5.1694,21.9162,7.9186,33.8304,21.1885,7.2792,-2.2311,-1.7664,33.8304,25.9118
39,1.3019,-0.5744,2.4538,1.2669,0.9625,-0.3338,-0.4701,2.4538,3.0282,0.4301,-0.362,1.3135,0.1978,0.715,-0.3615,0.0512,1.3135,1.6755,-10.1166,-11.2849,-8.309,-10.4053,1.1762,0.4703,0.9399,11.2849,2.9759,-4.6246,-11.8263,-0.5318,-3.3717,3.6792,-2.0255,-6.772,11.8263,11.2945,5.9347,1.96,14.1313,4.1913,4.175,-3.6482,-2.0694,14.1313,12.1713,17.6055,10.8126,22.9281,17.0708,4.4586,-1.4486,3.8124,22.9281,12.1154,-0.8407,-4.5578,2.0523,-0.3779,2.3344,0.8058,1.1507,4.5578,6.6101,10.2733,8.356,11.4263,10.5548,1.1485,-0.4354,-1.0576,11.4263,3.0702,19.6852,11.745,26.8311,19.4221,5.1872,-0.7465,4.2484,26.8311,15.0861
40,0.9681,-0.5776,4.1354,0.7968,1.2339,-0.3688,-0.2572,4.1354,4.7131,0.0686,-1.049,0.9293,0.2489,0.6202,-0.0513,-0.1698,1.049,1.9783,-9.6463,-13.8502,-4.0817,-9.4654,2.1921,0.1449,-0.0739,13.8502,9.7685,-6.6501,-13.4215,5.6938,-10.1437,6.6453,1.0089,3.503,13.4215,19.1152,2.2865,-3.7713,6.8688,2.1219,3.3986,-1.156,-1.3628,6.8688,10.64,16.1568,2.8896,26.0917,20.8832,8.491,-6.4219,-9.4196,26.0917,23.2021,-0.0349,-9.349,11.8571,0.7727,5.628,0.225,-0.3792,11.8571,21.2061,9.8378,5.3772,13.8934,9.4971,1.9333,-0.1968,0.085,13.8934,8.5162,18.9386,5.1755,29.7221,23.6705,8.7418,-6.0212,-9.399,29.7221,24.5466
42,0.2305,-3.034,3.0075,0.2824,1.1897,-1.1901,-1.0506,3.034,6.0415,-0.0341,-0.6995,0.8216,-0.0907,0.3709,0.222,0.3124,0.8216,1.5212,-9.3565,-11.6976,-5.7827,-9.6132,1.41,-0.3639,-0.2102,11.6976,5.9149,-4.6323,-14.5556,0.5135,-3.1377,4.3794,15.0217,14.2324,14.5556,15.0691,-0.0254,-4.83,5.3725,-0.6037,2.6254,6.472,7.6125,5.3725,10.2025,3.313,-1.7173,14.7727,2.044,4.0265,-4.6257,-4.073,14.7727,16.49,0.4151,-2.767,10.069,0.0142,2.3966,1.6823,1.4389,10.069,12.8361,9.4443,5.946,11.7857,9.667,1.3764,0.3393,0.1839,11.7857,5.8396,6.8963,0.5104,20.1879,4.8725,5.1646,5.7282,8.4629,20.1879,19.6775
43,-0.9595,-2.038,-0.0923,-0.7682,0.6281,1.0569,1.1138,2.038,1.9456,0.188,-0.0748,0.4949,0.2217,0.2158,0.7514,0.7271,0.4949,0.5697,-9.7205,-13.7831,-5.9961,-9.8235,2.5645,-1.1794,-1.2684,13.7831,7.787,10.3894,5.8213,13.4319,11.0947,2.8518,-8.7441,-7.2802,13.4319,7.6107,6.4466,2.94,9.2925,7.0088,2.1787,11.7578,11.6069,9.2925,6.3525,-1.3127,-2.9945,2.3823,-2.029,1.8163,62.9842,66.2277,2.9945,5.3769,2.0974,-0.6822,6.5359,1.4532,2.7073,2.6191,0.8131,6.5359,7.2181,9.7836,6.055,13.933,9.8509,2.5891,1.2089,1.3739,13.933,7.878,12.6244,8.2311,15.6538,13.3354,2.6187,53.1671,54.3099,15.6538,7.4227
44,0.0974,-1.5024,1.1623,0.3456,0.9715,0.9667,1.0014,1.5024,2.6648,0.9394,0.2023,1.6857,0.9488,0.609,-1.1267,-1.2229,1.6857,1.4835,-10.8999,-12.1625,-8.6538,-11.0918,1.0555,1.4585,1.8066,12.1625,3.5087,1.6452,-19.1774,17.8915,3.8145,13.7665,-15.1196,-16.3806,19.1774,37.0689,18.2044,10.1062,22.1375,18.6156,4.0448,-15.1156,-14.3806,22.1375,12.0313,61.6715,40.762,77.5831,64.1986,15.2175,-43.7092,-46.9329,77.5831,36.8211,4.7165,-6.2757,19.7052,2.2663,10.4147,-1.3789,0.7395,19.7052,25.9809,10.9926,8.7293,12.2461,11.2248,1.0625,-1.1967,-1.7681,12.2461,3.5168,65.7916,45.6484,82.8072,67.6454,14.8024,-41.4904,-43.2037,82.8072,37.1588
45,1.0641,-2.1762,4.3208,1.347,1.631,-0.5482,-0.4995,4.3208,6.497,-0.1873,-1.8437,1.6785,-0.2741,1.1705,0.2127,0.213,1.8437,3.5222,-9.4414,-18.4224,-3.4938,-9.2853,4.8663,-0.4267,-0.235,18.4224,14.9286,-13.4744,-23.1997,-0.9568,-12.5661,6.411,11.5726,12.6106,23.1997,22.2429,3.0888,-10.115,11.5238,4.235,5.787,3.4084,2.5091,11.5238,21.6388,17.9623,0.7061,29.9135,17.2657,8.0475,1.9072,1.6605,29.9135,29.2074,3.3376,-26.0125,30.3365,3.0058,16.3603,2.1735,0.1776,30.3365,56.349,9.7959,4.4038,18.4576,9.4567,4.6563,0.3189,0.229,18.4576,14.0537,24.3012,10.6049,35.9025,24.4417,7.5784,1.9535,1.9834,35.9025,25.2975
47,-0.0323,-2.4836,2.1391,0.3479,1.3104,0.0737,-0.4561,2.4836,4.6227,0.2381,-1.6271,1.672,0.152,1.0813,-0.1987,-0.1762,1.672,3.299,-10.2948,-16.7149,-4.3356,-9.7553,3.2501,0.5586,-0.0063,16.7149,12.3793,9.6708,-7.0517,19.1032,12.6551,8.2188,-14.3315,-16.8517,19.1032,26.1549,9.9055,4.7425,15.5838,9.2531,3.5532,-6.4035,-5.6569,15.5838,10.8413,21.7768,8.7689,36.3652,20.5866,11.0571,-8.6366,-6.2806,36.3652,27.5962,7.6846,-11.0583,29.8674,3.3611,14.1845,-7.3438,-3.1476,29.8674,40.9257,10.4337,4.5067,16.7984,9.9146,3.231,-0.6215,-0.1174,16.7984,12.2916,28.2082,18.4017,40.0217,28.4085,7.9968,-12.7894,-12.5322,40.0217,21.62
48,0.0414,-1.5142,2.5513,-0.1081,1.0209,0.2426,0.0195,2.5513,4.0655,0.0394,-1.1154,1.2465,-0.0242,0.5429,-0.6842,-0.6768,1.2465,2.3619,-9.7362,-13.9467,-4.1439,-9.7615,2.384,0.4102,0.3418,13.9467,9.8028,-4.6607,-18.5542,3.2507,-4.1966,6.1781,-14.4438,-15.6102,18.5542,21.8049,3.502,-1.015,10.01,3.5963,2.881,-1.8953,-2.5637,10.01,11.025,13.1402,3.6774,20.1662,14.306,4.9777,-10.4748,-11.3224,20.1662,16.4888,0.3408,-7.1778,6.2709,0.2134,3.0118,11.8149,14.2798,7.1778,13.4487,9.8123,4.1871,13.9705,9.7972,2.3404,-0.3825,-0.3229,13.9705,9.7833,15.4188,3.8022,24.62,15.8764,6.2381,5.6618,5.1775,24.62,20.8178
49,0.284,-0.7726,2.5407,-0.0886,1.1235,-0.2617,0.3813,2.5407,3.3133,-0.6449,-1.5253,0.5092,-0.701,0.6643,1.0103,0.9787,1.5253,2.0346,-9.326,-11.8191,-7.2842,-9.4197,1.7646,-0.7999,-0.1277,11.8191,4.5349,-19.1045,-21.7454,-16.01,-19.8068,2.2748,19.6194,20.6092,21.7454,5.7354,1.6067,-0.945,7.0613,1.0325,2.5955,1.038,1.9469,7.0613,8.0063,2.6654,-9.2902,13.7375,2.9836,8.6435,-3.0233,-2.8782,13.7375,23.0277,12.1557,-8.3755,25.9724,14.4932,11.313,-11.2124,-13.7186,25.9724,34.3479,9.4298,7.363,11.9203,9.4743,1.7777,0.7699,0.2186,11.9203,4.5574,21.0807,17.2594,24.3108,21.0539,2.633,-15.0995,-14.7802,24.3108,7.0514
50,0.0223,-1.7341,1.4057,0.2927,1.1194,0.2053,-0.1887,1.7341,3.1398,0.3655,-0.2729,1.0059,0.2777,0.4588,-0.1345,-0.1924,1.0059,1.2788,-10.1259,-16.1408,-6.6742,-9.5474,3.0961,1.1182,-0.2749,16.1408,9.4665,0.5149,-4.9289,5.0585,0.8024,3.705,1.7025,1.7517,5.0585,9.9874,2.6447,-0.5687,5.3025,2.9794,2.2201,1.6636,0.5644,5.3025,5.8712,-0.3579,-6.9362,5.3247,0.1054,4.2639,-2.2219,-2.6585,6.9362,12.2609,0.9433,-0.5397,3.3383,0.7746,1.1353,-0.6435,-0.7369,3.3383,3.878,10.1997,6.6837,16.1411,9.6929,3.0802,-1.1087,0.3206,16.1411,9.4575,5.9812,2.6859,9.4157,6.2737,2.0961,0.8287,-0.0661,9.4157,6.7298
51,0.2276,-1.6207,2.0771,0.104,1.1499,-0.0407,-0.089,2.0771,3.6977,0.231,-0.7103,1.1011,0.0853,0.5598,-0.6182,-0.5344,1.1011,1.8114,-9.0077,-11.3674,-5.0115,-9.8223,2.525,-0.6196,-0.4021,11.3674,6.3559,2.2175,-0.1337,4.2578,2.5541,1.3998,-12.3307,-12.6849,4.2578,4.3916,4.3083,-1.6713,11.5763,3.5438,4.5323,-0.4375,0.49,11.5763,13.2475,-2.5798,-5.2459,0.3825,-2.5531,1.8447,-7.1577,-6.9298,5.2459,5.6284,0.2998,-2.2163,2.6484,0.0378,1.4236,3.2585,4.3728,2.6484,4.8648,9.091,5.0673,11.4497,10.0135,2.5314,0.6243,0.2188,11.4497,6.3825,6.8099,4.1025,11.771,6.2076,2.7099,8.1936,9.17,11.771,7.6684
52,0.1869,-1.0798,2.1465,0.015,0.9635,0.133,0.2457,2.1465,3.2263,-0.3872,-0.8862,0.2705,-0.4491,0.3592,0.7247,0.8922,0.8862,1.1567,-9.6273,-16.0481,-4.7679,-10.2245,3.5716,0.0147,0.1223,16.0481,11.2802,-10.1132,-11.8053,-8.2734,-10.1308,1.3834,13.699,11.2679,11.8053,3.5318,3.8708,-0.4987,6.3263,4.0338,2.1248,2.6462,0.3237,6.3263,6.825,-9.7375,-15.7407,-4.7135,-9.4829,3.5009,22.7907,25.2363,15.7407,11.0272,3.5583,-3.1931,8.1678,4.4105,3.4087,10.5679,-4.0873,8.1678,11.3609,9.7153,5.0152,16.094,10.2323,3.4756,0.5469,1.0749,16.094,11.0787,15.0035,11.4275,17.9469,15.3776,1.949,11.2225,13.3192,17.9469,6.5195
53,0.3199,-4.1308,8.6189,0.2607,2.9741,-0.388,-0.2797,8.6189,12.7497,0.3375,-3.46,2.9448,0.4431,1.4827,-0.7182,-0.8195,3.46,6.4048,-9.6126,-17.8616,-1.0759,-10.1022,4.795,0.9134,1.5242,17.8616,16.7857,3.5858,-21.2604,31.133,1.1371,16.8887,-12.4317,-9.5997,31.133,52.3934,6.517,-16.0125,32.7688,4.3575,11.8469,-8.6796,-5.5256,32.7688,48.7813,13.0532,-15.6145,27.5834,15.7534,11.879,-22.8222,-22.8647,27.5834,43.1979,14.1262,-17.3882,88.0644,0.3232,28.7497,-4.124,4.6849,88.0644,105.4526,10.2622,2.7063,18.2168,11.3072,4.5467,-1.2663,-2.4352,18.2168,15.5105,26.226,8.5416,45.1958,28.6968,8.9597,-4.7003,-6.3504,45.1958,36.6543
54,-0.0681,-3.1222,2.0809,-0.019,1.2861,0.3668,-0.0403,3.1222,5.2031,-0.3807,-2.9172,3.247,-0.3764,1.5339,1.0825,1.0813,3.247,6.1642,-8.6992,-16.7466,-1.7409,-8.5779,3.5294,-1.0782,-0.9864,16.7466,15.0058,-8.8459,-24.5032,10.888,-8.4626,10.3349,22.8906,21.7513,24.5032,35.3912,-2.1626,-17.8238,20.5975,-1.1681,8.8845,15.6775,9.4412,20.5975,38.4212,-9.769,-36.3279,10.6945,-7.1113,13.3194,4.628,10.3539,36.3279,47.0223,10.0022,-18.2958,59.4983,5.0081,18.5661,-1.9398,-1.1541,59.4983,77.7941,8.9959,2.9168,16.9176,8.872,3.3407,1.7788,1.3163,16.9176,14.0007,21.5257,7.7952,36.3697,22.3464,8.1702,7.129,-1.8593,36.3697,28.5746
55,0.2987,-5.2848,9.2352,-0.0593,3.5574,-0.5933,-0.432,9.2352,14.52,0.7018,-0.7307,2.3075,0.7049,0.9695,-0.8313,-0.6957,2.3075,3.0381,-9.7774,-17.2123,0.8011,-9.5644,4.3423,0.0927,0.3857,17.2123,18.0134,14.0448,-2.7751,27.22,13.2887,9.3566,-24.6124,-23.9557,27.22,29.9951,13.5149,-2.3538,62.6675,8.2731,17.0943,-12.1434,-7.8706,62.6675,65.0213,-5.1409,-33.396,19.6878,3.2426,18.992,2.641,-5.8402,33.396,53.0837,8.0624,-14.3588,46.4688,3.854,16.0787,-6.8474,-3.9823,46.4688,60.8276,10.7747,5.6437,17.6686,10.1883,3.3478,-1.0086,-0.9669,17.6686,12.0248,28.6548,13.3886,73.4609,20.4871,17.2641,-17.1463,-9.0656,73.4609,60.0723
56,-0.2946,-1.7905,1.723,-0.4913,1.1974,0.8911,0.9141,1.7905,3.5136,-0.1295,-0.8916,0.301,0.0093,0.443,-0.182,-0.14,0.8916,1.1926,-9.6847,-11.9415,-7.6906,-9.1787,1.4303,-0.5877,-1.187,11.9415,4.2509,-10.5676,-11.3235,-9.3498,-10.667,0.6489,9.4625,10.6007,11.3235,1.9737,1.3716,-3.5262,6.7288,0.4025,3.7166,11.8056,12.2106,6.7288,10.255,-2.5,-3.6188,-0.7487,-2.5976,0.8852,-30.9676,-31.1208,3.6188,2.8701,1.215,-3.2249,8.3366,-0.1283,4.4537,0.1535,1.0159,8.3366,11.5615,9.7661,7.9315,11.9538,9.2214,1.4085,0.6331,1.1838,11.9538,4.0223,11.5085,10.533,12.9293,11.4215,0.7563,25.3831,25.3424,12.9293,2.3964
57,0.5965,-0.8972,2.997,0.4227,1.0263,0.5248,0.7697,2.997,3.8942,-0.3114,-3.0447,1.3452,-0.1308,1.0496,1.0453,0.6672,3.0447,4.3899,-10.2724,-12.831,-7.4592,-10.3656,1.5107,0.6137,0.4766,12.831,5.3719,-1.1051,-12.52,10.189,-0.0663,6.6305,26.5423,25.7395,12.52,22.7089,13.1771,1.4525,25.0687,12.6131,6.1203,-5.4993,-4.515,25.0687,23.6162,-33.4676,-52.8297,-15.8707,-33.7184,10.6444,32.9992,38.0386,52.8297,36.9591,1.3685,-4.1702,9.4889,0.8876,3.6589,28.3384,11.0703,9.4889,13.6591,10.3992,7.873,12.9164,10.4052,1.4747,-0.5184,-0.3659,12.9164,5.0434,36.8916,18.8474,56.0727,36.7639,11.216,4.1812,5.102,56.0727,37.2253
58,1.1213,-1.0062,3.4801,1.1924,1.1731,0.1667,0.329,3.4801,4.4863,0.7339,-0.6948,2.5037,0.5365,0.8963,-0.647,-0.342,2.5037,3.1985,-9.6588,-14.023,-5.6424,-9.8891,2.106,-0.1569,0.1848,14.023,8.3806,25.4372,-6.419,47.5203,25.6732,16.5642,-29.099,-33.6848,47.5203,53.9393,7.6778,-1.9163,16.1612,8.0981,4.7174,-1.3264,-1.5925,16.1612,18.0775,-0.4684,-37.5706,34.5866,4.3202,27.7016,21.6956,17.5728,37.5706,72.1572,29.7069,-8.868,115.6343,11.9579,36.5397,-29.7219,-12.5039,115.6343,124.5023,9.8808,6.2345,14.0711,10.0394,1.9924,0.1486,0.0505,14.0711,7.8366,41.0728,32.2106,51.2869,41.8659,6.6348,-17.233,-17.1422,51.2869,19.0763
59,1.288,-0.9216,3.1943,1.5214,1.3717,-0.1818,-0.6063,3.1943,4.1158,0.0869,-1.295,1.222,0.1945,0.8117,-0.2424,-0.2184,1.295,2.5169,-9.8156,-12.0992,-7.6791,-9.7042,1.2324,0.0915,0.1655,12.0992,4.4201,-3.6618,-9.9822,10.0474,-8.0117,7.4505,-2.8627,2.6528,10.0474,20.0296,6.3514,1.9863,10.0275,6.5056,2.1039,-3.1346,-2.7344,10.0275,8.0413,21.2272,9.1407,32.243,21.893,8.9381,-6.4165,-7.7696,32.243,23.1024,-0.015,-11.0161,9.5706,-0.546,6.0178,1.1878,0.7721,11.0161,20.5867,10.0294,8.3236,12.1689,10.0898,1.1451,-0.1262,-0.3006,12.1689,3.8454,23.8398,11.377,34.5676,24.7237,8.4599,-5.8655,-7.8377,34.5676,23.1906
60,1.1062,-1.2338,3.2166,0.9151,1.3211,-0.1128,0.1607,3.2166,4.4503,-0.1555,-1.444,0.6457,-0.0239,0.5435,0.1867,-0.0084,1.444,2.0896,-9.7241,-13.2912,-7.3373,-9.5387,1.5725,0.214,-0.3204,13.2912,5.9539,-6.5245,-17.7598,7.3614,-5.3589,6.9731,-19.4788,-21.0795,17.7598,25.1212,3.2168,-3.9987,9.4238,3.7713,3.6819,-0.2297,-0.1006,9.4238,13.4225,14.8107,6.9032,29.8903,14.1234,5.5934,-2.5007,-0.8094,29.8903,22.9871,1.1728,-7.8147,9.8217,0.2261,4.4663,-3.1824,0.62,9.8217,17.6364,9.9032,7.6461,13.3199,9.7893,1.4695,-0.269,0.1551,13.3199,5.6738,17.9743,9.651,33.452,16.886,6.3805,11.4052,12.4258,33.452,23.801
61,0.9934,-0.8004,2.4767,1.0758,0.9563,-0.0063,-0.1016,2.4767,3.2772,0.0311,-1.216,0.9539,-0.0323,0.6555,0.017,0.0245,1.216,2.1698,-9.5101,-11.3575,-7.0784,-9.8592,1.4865,-0.1147,0.4934,11.3575,4.2791,-26.0033,-28.6608,-21.4632,-26.4384,2.399,31.9463,32.026,28.6608,7.1977,2.987,-0.6912,6.9738,3.6706,2.8133,0.2552,-0.28,6.9738,7.665,12.31,3.9307,18.8506,13.314,4.646,-14.9655,-15.5877,18.8506,14.9199,-2.0096,-25.9373,26.0986,0.8461,16.0703,2.1651,-1.1829,26.0986,52.0359,9.6342,7.2885,11.3656,9.9444,1.4025,0.0876,-0.4479,11.3656,4.0772,29.3794,25.8516,32.9202,29.3118,2.2234,-20.4877,-22.1515,32.9202,7.0686
62,0.9872,0.0888,2.3614,0.9742,0.573,-0.0498,-0.372,2.3614,2.2727,0.0481,-1.5379,1.2591,-0.0078,0.7266,-0.0306,0.0829,1.5379,2.797,-9.6248,-12.1821,-7.2414,-9.3658,1.2468,0.0116,-0.2679,12.1821,4.9407,5.943,-1.3848,15.8803,5.5876,5.2481,-7.2975,-7.3379,15.8803,17.2651,3.2422,-1.2863,9.3538,3.3906,2.6007,-0.136,0.1663,9.3538,10.64,-2.6556,-11.2678,3.686,-2.2736,3.7015,7.0584,8.4056,11.2678,14.9538,0.1555,-13.0775,11.9033,-0.3368,5.6611,0.6928,0.7988,13.0775,24.9807,9.7218,7.3403,12.2683,9.4965,1.2134,0.0302,0.2332,12.2683,4.928,8.8917,3.0746,17.0811,7.1603,4.5485,1.9245,3.7296,17.0811,14.0065
63,0.9374,-1.4404,3.0696,0.6022,0.9986,-0.2337,-0.0903,3.0696,4.51,0.0176,-1.1274,1.1998,0.0751,0.6353,0.1661,0.1466,1.1998,2.3272,-9.6133,-14.7707,-5.3488,-9.6337,2.2016,-0.1618,-0.0815,14.7707,9.422,-1.3545,-10.398,11.5768,-1.7503,6.3451,-5.711,-5.376,11.5768,21.9748,3.1063,-6.0638,9.6338,3.5569,3.5692,-1.6319,-2.87,9.6338,15.6975,4.4028,-8.5738,14.5869,6.132,7.1701,0.5479,-1.1972,14.5869,23.1607,0.8482,-7.5725,12.6741,0.462,3.8891,-2.3373,-1.6328,12.6741,20.2465,9.752,5.9975,14.8564,9.7297,2.0898,0.0708,0.0196,14.8564,8.859,10.8162,2.1051,18.2675,10.8898,3.8525,-1.5246,-1.3077,18.2675,16.1624
64,0.7037,0.0937,1.4816,0.5119,0.4928,-0.0547,-0.0225,1.4816,1.3878,0.1836,-0.3752,0.7666,0.2217,0.3513,0.2719,0.9048,0.7666,1.1418,-9.775,-12.0687,-8.0753,-9.7152,1.2291,0.1121,0.1572,12.0687,3.9934,-7.0656,-9.8022,-3.8221,-7.1263,1.9517,1.0033,-0.5986,9.8022,5.9801,1.4744,-2.1175,7.2188,0.6869,3.0676,-0.6836,0.7175,7.2188,9.3362,4.9507,1.8161,7.9235,4.9348,2.1364,9.6089,11.7946,7.9235,6.1074,-1.4891,-5.9495,2.4115,-1.1708,2.6268,3.5539,0.126,5.9495,8.3611,9.8228,8.1922,12.0708,9.7493,1.1878,0.0103,-0.0691,12.0708,3.8786,9.2917,4.6792,12.2893,9.5821,2.5816,8.2318,9.0746,12.2893,7.61
65,0.649,-0.641,2.3515,0.4895,0.979,-0.037,0.3104,2.3515,2.9925,0.4555,-2.2021,1.505,1.1265,1.3251,0.1462,-0.5344,2.2021,3.7071,-9.6629,-12.5179,-7.0623,-9.558,1.8201,0.1605,0.3201,12.5179,5.4556,-6.0623,-13.3041,5.2699,-7.7249,6.9365,12.0642,14.1355,13.3041,18.574,0.7908,-4.83,4.97,1.4044,3.1578,-0.2641,-0.4156,4.97,9.8,14.5596,0.4205,23.2631,16.7294,7.5872,-8.876,-12.2889,23.2631,22.8426,2.0647,-11.0287,27.0648,-1.0449,12.4153,2.7097,1.7145,27.0648,38.0935,9.8332,7.5689,12.6243,9.6802,1.7183,-0.181,-0.3732,12.6243,5.0554,17.5235,7.1608,27.2557,18.6567,7.0493,-7.5156,-9.648,27.2557,20.0949
66,0.6121,-1.2146,1.8026,0.7999,0.9474,-0.3406,-0.8025,1.8026,3.0172,0.6018,-1.1106,1.9999,0.5921,1.0347,-1.1222,-0.7722,1.9999,3.1105,-9.5024,-16.0236,-5.1483,-9.2379,2.8613,-0.6923,-1.2815,16.0236,10.8753,6.0019,-0.8581,12.7882,6.4105,4.0229,-6.3261,-7.231,12.7882,13.6462,0.5266,-7.0,5.8362,0.9887,4.0344,5.9407,7.2756,7.0,12.8363,5.6836,-0.6262,21.6624,4.4405,6.1402,19.9211,20.3551,21.6624,22.2885,4.7745,-8.0693,22.2852,0.6697,9.5724,-3.4723,-0.012,22.2852,30.3545,9.6522,5.5667,16.1936,9.307,2.8075,0.6438,1.2807,16.1936,10.6268,10.0079,1.8993,23.8937,9.0087,6.0417,17.2909,17.5188,23.8937,21.9944
67,0.2715,-0.439,1.3534,-0.0026,0.6621,0.2903,0.5697,1.3534,1.7924,-0.5204,-2.2135,0.6792,-0.1801,0.9546,0.2642,-0.1475,2.2135,2.8927,-10.1947,-12.8709,-5.7694,-10.5194,2.0378,0.4351,0.6271,12.8709,7.1015,-0.3242,-6.4634,7.3912,-0.8204,4.8207,-2.5948,4.2435,7.3912,13.8546,6.4673,-3.7888,11.1038,8.2644,5.2023,-2.7089,-3.885,11.1038,14.8925,25.6048,13.337,34.8475,24.7956,7.3038,-19.8118,-15.5659,34.8475,21.5104,1.3021,-3.1383,5.0201,0.6577,2.7121,12.0448,2.7385,5.0201,8.1584,10.2959,6.3259,12.8733,10.5877,1.8776,-0.3695,-0.5883,12.8733,6.5474,27.2989,15.7308,36.5608,26.5275,7.0102,-6.8222,-7.043,36.5608,20.8301
68,0.5618,-0.9217,2.9645,0.5671,0.8937,-0.0656,-0.7743,2.9645,3.8862,-0.2562,-2.5516,2.3033,-0.3276,1.3585,0.6153,1.2887,2.5516,4.8549,-9.7596,-13.6321,-6.5265,-9.8922,1.9284,0.8745,0.0066,13.6321,7.1056,-2.919,-35.2677,17.7252,3.423,15.7899,0.1487,-6.1413,35.2677,52.9929,3.7585,-2.9488,11.55,4.3794,3.3929,-2.1452,-2.9356,11.55,14.4988,5.793,-21.3858,27.8337,9.2297,14.6098,8.1678,3.4308,27.8337,49.2195,13.3469,-6.7462,53.6253,3.3962,18.4744,-10.9049,-3.5562,53.6253,60.3714,9.9264,6.933,13.6367,9.9994,1.8287,0.0881,0.2847,13.6367,6.7037,20.4766,6.7275,43.2149,19.4845,9.8321,-3.3431,-3.5143,43.2149,36.4875
69,0.4962,-2.5734,5.4094,-0.2072,2.4907,0.0314,0.7633,5.4094,7.9828,0.359,-3.624,3.3284,0.961,1.7598,-0.6704,-1.473,3.624,6.9523,-8.8851,-18.3551,1.9665,-9.8856,5.6459,-0.9041,0.0989,18.3551,20.3216,-2.7702,-11.2381,7.2876,-2.7183,5.3551,-2.6143,-5.2564,11.2381,18.5257,1.6133,-9.0387,13.0288,1.4438,7.2247,1.2053,0.9713,13.0288,22.0675,13.9608,-1.8896,28.404,12.6605,8.8576,-13.6425,-11.2625,28.404,30.2936,2.442,-13.4272,28.7037,-0.16,11.1409,-2.6774,-0.9346,28.7037,42.1308,10.0145,2.7316,18.657,10.2841,4.3368,-0.1772,-0.4798,18.657,15.9254,17.1335,5.1513,32.9932,15.9702,8.0661,-7.6703,-6.3972,32.9932,27.8419
70,0.5276,-0.2866,1.3499,0.556,0.5462,-0.1497,-0.1255,1.3499,1.6365,-0.3113,-0.9479,0.5553,-0.5119,0.5702,0.0825,0.5072,0.9479,1.5032,-9.7892,-11.3375,-8.728,-9.7867,0.8195,0.0303,0.3054,11.3375,2.6095,-5.3846,-11.0465,5.2051,-7.9747,6.1751,-2.2577,-0.3734,11.0465,16.2516,2.8186,0.4725,5.8713,2.415,2.1571,0.3134,0.5644,5.8713,5.3988,0.3183,-8.6117,6.0706,1.398,5.0333,9.4614,7.6167,8.6117,14.6823,-0.2354,-5.1292,5.8793,-1.0946,4.2485,3.9839,1.6173,5.8793,11.0085,9.8373,8.7561,11.3522,9.8043,0.8033,0.0454,-0.2617,11.3522,2.5961,9.4632,5.6944,12.965,9.5731,2.8468,5.0618,5.5157,12.965,7.2706
71,0.3779,-1.5248,2.2299,0.4306,0.9975,0.0369,0.0334,2.2299,3.7547,-0.2288,-1.572,1.7803,-0.0048,0.9847,0.2088,0.3064,1.7803,3.3523,-9.7589,-17.1085,-4.4279,-9.4814,3.4364,0.0306,-0.5794,17.1085,12.6806,-7.6422,-11.9463,-0.3208,-8.3481,3.6339,9.2023,9.4773,11.9463,11.6254,3.132,-7.0962,10.3512,2.9794,5.6022,-0.581,-0.6956,10.3512,17.4475,9.7797,0.949,21.631,9.0146,6.534,-12.6635,-12.4838,21.631,20.682,3.7485,-11.2057,18.7798,0.5227,8.4455,1.4364,2.5598,18.7798,29.9856,9.8827,4.5577,17.2683,9.5426,3.3743,-0.0761,0.5622,17.2683,12.7106,14.525,6.345,24.2583,15.0887,6.0845,-3.5283,-5.3897,24.2583,17.9134
72,0.4148,-0.9545,1.5588,0.464,0.6749,-0.0689,-0.2194,1.5588,2.5133,-0.02,-1.7444,1.3698,0.3016,0.9251,0.0754,-0.2115,1.7444,3.1141,-9.7283,-12.0298,-6.9247,-10.0607,1.5201,0.0644,-0.1014,12.0298,5.1051,1.5601,-8.8441,16.1098,1.1292,7.9875,-1.5202,1.6593,16.1098,24.9539,2.551,-1.6188,7.0788,2.2838,2.6368,-0.1161,0.3762,7.0788,8.6975,-2.8838,-17.7625,10.3247,-3.4692,7.8723,4.2458,5.4212,17.7625,28.0871,5.1849,-2.8397,22.0666,3.0826,6.5004,-4.2818,-1.7867,22.0666,24.9063,9.8067,7.073,12.1451,10.1048,1.4846,-0.088,0.0732,12.1451,5.0721,10.9967,5.0436,22.3167,9.699,4.9546,-2.3602,-1.6553,22.3167,17.2732
73,0.3459,-1.0323,1.5909,0.2446,0.6704,-0.0171,0.1095,1.5909,2.6232,0.0554,-1.0358,1.2686,0.0901,0.6234,-0.1589,-0.2322,1.2686,2.3045,-9.6639,-12.989,-6.356,-10.1621,1.9495,-0.1142,0.3452,12.989,6.6329,0.0399,-12.7873,7.3153,2.7885,6.9854,-2.16,-6.038,12.7873,20.1026,2.4349,-2.7213,7.0788,2.66,2.6159,0.6758,0.5469,7.0788,9.8,1.362,-8.1232,10.4257,1.952,4.8006,-4.4396,-3.7946,10.4257,18.5488,0.9031,-5.6584,7.3908,1.2959,3.4366,0.1967,-0.6307,7.3908,13.0493,9.7187,6.4504,13.0915,10.178,1.9137,0.1165,-0.358,13.0915,6.6411,8.6365,3.146,16.8806,8.0437,3.0345,1.7883,2.6261,16.8806,13.7346
74,0.3288,-1.1454,2.0612,0.3541,0.754,-0.2161,-0.3711,2.0612,3.2066,-0.1035,-1.3506,1.5002,-0.1421,0.6633,0.043,0.0437,1.5002,2.8508,-9.7781,-13.1291,-7.0618,-9.8169,1.3288,0.0629,0.1151,13.1291,6.0673,-2.1202,-12.1881,13.9347,-3.2495,8.1063,1.2754,2.9023,13.9347,26.1228,3.1106,-1.8462,6.6413,3.2069,2.4384,-0.5099,-0.5338,6.6413,8.4875,-3.0776,-11.7891,5.255,-1.8426,5.4213,0.4872,0.0205,11.7891,17.0442,1.0998,-14.0233,14.6642,0.6651,5.473,-0.5591,-0.0801,14.6642,28.6875,9.8352,7.086,13.1761,9.8201,1.3165,-0.0807,-0.0872,13.1761,6.0901,10.4248,2.0073,18.0232,10.6697,3.5515,-3.7483,-4.7522,18.0232,16.016
75,0.1126,-0.9296,1.4555,-0.0169,0.5974,-0.0642,0.0374,1.4555,2.385,-0.0605,-1.572,1.0616,-0.0984,0.6225,0.2329,0.1328,1.572,2.6336,-9.7152,-12.3141,-7.8133,-9.7018,1.3694,0.1309,0.0849,12.3141,4.5008,-0.8448,-7.4236,4.3885,-0.3471,4.0007,2.7432,2.3214,7.4236,11.8121,2.6008,-0.6825,4.9875,2.6731,1.6179,-0.7326,-0.8356,4.9875,5.67,-2.5904,-11.9278,3.6617,-1.8221,4.5204,0.8569,0.7966,11.9278,15.5895,0.5407,-3.8775,6.2932,0.5851,2.2601,-0.0341,-0.5862,6.2932,10.1707,9.7545,7.8273,12.4181,9.7329,1.3571,-0.149,-0.0936,12.4181,4.5908,6.6766,1.4376,12.3882,5.9175,2.73,-3.0576,-2.1744,12.3882,10.9506
76,0.0484,-0.7742,0.7247,0.0205,0.4511,0.0136,-0.2547,0.7742,1.4989,0.1724,-0.3088,1.0849,0.0344,0.432,0.0674,0.1293,1.0849,1.3937,-9.5843,-11.6759,-7.4059,-9.6169,1.0796,-0.1286,-0.1216,11.6759,4.27,1.8984,-0.7572,3.8167,1.9742,1.3895,-0.6073,-0.4965,3.8167,4.5739,1.8681,-0.14,3.71,1.8375,1.1226,0.6743,1.2338,3.71,3.85,-1.7335,-4.5869,1.0659,-1.0255,1.7456,3.4083,2.2414,4.5869,5.6528,0.5066,-0.8941,3.6527,-0.0012,1.2331,-0.9245,0.1267,3.6527,4.5468,9.6055,7.447,11.6763,9.6392,1.0754,0.1932,0.1614,11.6763,4.2293,3.6189,1.0146,5.8573,3.7431,1.7437,2.5246,2.0442,5.8573,4.8427
77,0.0621,-2.0136,2.0633,-0.2342,1.0945,0.4797,0.7665,2.0633,4.0769,0.2398,-0.8222,1.4882,0.1637,0.5663,-0.0617,0.0667,1.4882,2.3105,-9.7129,-13.8026,-6.2663,-9.7385,1.7881,-0.0333,0.3002,13.8026,7.5363,1.2912,-4.1888,6.971,1.4778,3.6909,3.6194,0.6451,6.971,11.1598,2.5424,-2.6687,5.9588,3.0712,2.3898,0.8038,0.245,5.9588,8.6275,1.6748,-3.3941,8.7279,1.216,3.713,-0.6653,2.2539,8.7279,12.1221,-0.4178,-6.234,5.7859,0.1255,2.7912,8.666,-0.14,6.234,12.0199,9.7987,6.4307,13.8151,9.8006,1.7307,0.0337,-0.2477,13.8151,7.3844,6.1435,2.7297,9.693,5.7873,2.1275,10.702,12.528,9.693,6.9634
78,0.5418,-0.4317,1.7023,0.5323,0.4952,0.0189,0.1273,1.7023,2.134,0.1781,-1.821,2.2554,0.2304,1.0442,-0.5263,-0.4991,2.2554,4.0764,-9.7461,-13.4443,-7.1669,-9.4383,1.4664,0.2236,0.0273,13.4443,6.2775,4.9105,-13.8954,25.1114,2.1229,12.7935,-7.5433,-5.8276,25.1114,39.0068,3.3462,-0.1838,6.4575,3.3162,1.7301,0.9648,-0.3281,6.4575,6.6413,1.0094,-22.5524,16.693,3.4699,12.3207,1.5767,-1.732,22.5524,39.2454,8.2481,-6.9473,56.6365,-0.0145,16.5203,-1.0431,5.562,56.6365,63.5838,9.8323,7.2763,13.457,9.5529,1.4383,-0.0984,-0.0519,13.457,6.1807,16.8455,2.6154,26.4023,18.3153,7.8185,-5.2969,-7.5889,26.4023,23.787
79,0.5607,-1.3991,2.781,0.6596,1.0054,-0.1035,-0.359,2.781,4.1801,-0.3482,-2.3661,1.1956,-0.2687,1.1856,0.2425,0.1535,2.3661,3.5617,-9.5225,-12.6201,-2.6602,-9.411,2.4183,0.0383,0.4814,12.6201,9.96,-2.6328,-14.0196,7.3682,-3.7047,7.7268,10.9788,12.8126,14.0196,21.3878,4.311,-0.84,20.1425,2.9881,5.6885,-1.2376,0.5381,20.1425,20.9825,2.5861,-7.7274,12.6979,1.7379,5.9507,2.7553,4.1558,12.6979,20.4253,7.205,0.0263,21.7441,5.5475,6.0155,-5.1843,-4.6859,21.7441,21.7178,9.734,4.5176,12.7012,9.501,2.0941,-0.1587,-0.4936,12.7012,8.1836,11.5486,4.402,22.3693,10.7264,4.423,0.2426,2.4421,22.3693,17.9673
80,0.4571,-0.3092,1.5252,0.3006,0.5964,-0.1593,0.1108,1.5252,1.8345,-0.1057,-1.6845,1.3309,-0.1152,1.1514,-0.0701,0.0168,1.6845,3.0154,-9.4842,-11.4834,-7.9623,-8.9295,1.4123,-0.3044,-1.1373,11.4834,3.5211,8.346,-0.5217,15.0879,9.1079,5.2739,-13.4735,-13.2151,15.0879,15.6096,3.0734,-1.8812,7.3675,3.5262,2.8392,-0.4255,-1.0631,7.3675,9.2488,5.3415,-1.1729,10.027,5.8936,3.8203,-9.2254,-10.9767,10.027,11.2,2.0207,-12.6611,18.832,0.8616,11.1181,0.7671,-0.5039,18.832,31.4931,9.5752,8.1385,11.5203,9.0075,1.3943,0.2672,1.0912,11.5203,3.3817,11.7912,6.5891,16.8315,13.1686,3.8191,-3.2009,-5.4231,16.8315,10.2424
81,0.2978,-1.234,1.1961,0.4114,0.5334,-0.0699,-0.1598,1.234,2.4301,-0.1758,-1.6151,1.4266,-0.0984,0.804,0.2365,0.1815,1.6151,3.0417,-9.7886,-11.4109,-7.8732,-10.0668,0.9639,0.0364,0.1234,11.4109,3.5377,-5.1275,-13.9349,1.3728,-4.1072,5.1082,1.9314,0.8444,13.9349,15.3077,2.648,-0.6125,4.9963,2.4631,1.368,0.0224,-0.0525,4.9963,5.6088,-3.884,-8.4119,5.5655,-5.0831,3.4504,-3.66,-3.3227,8.4119,13.9775,2.7878,-5.5711,22.5064,0.3577,7.0521,-0.3009,0.7403,22.5064,28.0775,9.8424,7.9643,11.4171,10.0986,0.939,-0.0411,-0.0873,11.4171,3.4528,8.5903,3.6854,15.8623,7.7454,3.6553,2.1325,2.7696,15.8623,12.177
83,0.158,-0.4536,0.7579,0.0919,0.4312,-0.1097,0.2295,0.7579,1.2115,0.2972,-0.5386,1.8575,0.2645,0.8101,-0.5137,-0.6918,1.8575,2.396,-9.7158,-12.0866,-7.6626,-9.82,1.8139,0.4546,-0.3262,12.0866,4.4239,-1.2647,-6.3403,5.8351,-2.4185,5.1459,-2.5263,-1.3958,6.3403,12.1754,2.6928,0.455,5.6438,2.3581,1.6504,0.7924,1.7675,5.6438,5.1888,-11.204,-16.6669,-6.1307,-11.7284,4.3106,3.8952,6.9447,16.6669,10.5362,2.1859,-3.7033,10.8384,1.8382,4.138,2.5089,1.5897,10.8384,14.5417,9.7603,7.6766,12.1084,9.9241,1.8091,0.182,0.3256,12.1084,4.4318,12.8552,8.8478,17.6617,13.2846,3.5354,1.1922,0.0009,17.6617,8.8139
84,0.0483,-4.0842,4.0275,0.3214,1.8203,-0.1344,-0.5152,4.0842,8.1117,-0.2166,-2.8544,2.1058,-0.4273,1.4209,0.5069,0.5508,2.8544,4.9602,-9.2613,-19.4657,3.5391,-10.1462,4.4528,-0.2156,0.8684,19.4657,23.0048,-3.7909,-14.4107,9.1318,-3.8142,6.4711,13.284,13.0448,14.4107,23.5425,3.4852,-8.3038,16.5375,4.1256,5.7705,-0.4099,-1.1725,16.5375,24.8413,-7.3088,-32.788,6.073,-4.7837,9.7703,-1.4327,-0.3524,32.788,38.861,4.6948,-16.3168,29.2338,3.4279,9.6353,0.6525,-2.7452,29.2338,45.5506,9.9423,2.9775,19.5411,10.2497,3.4074,-0.2293,-0.9196,19.5411,16.5636,14.0474,3.2777,33.7998,13.2855,6.9674,1.8303,-0.6208,33.7998,30.5221
85,-0.0862,-2.6074,3.3275,-0.1939,1.2268,,,3.3275,5.9349,0.2904,-2.1052,2.5043,0.1236,1.3868,,,2.5043,4.6096,-9.4768,-14.2432,-1.9744,-9.2778,2.2725,,,14.2432,12.2688,9.4931,4.9675,14.6505,9.2306,3.31,,,14.6505,9.6829,3.0753,-1.0588,10.7975,2.9531,2.6668,,,10.7975,11.8563,-8.7415,-37.6677,6.3739,-5.1361,12.3875,,,37.6677,44.0416,5.3473,-13.7798,33.9885,0.6828,15.1208,,,33.9885,47.7683,9.7129,4.3272,14.4655,9.3301,1.9941,,,14.4655,10.1383,15.8777,5.6604,39.6983,12.6647,9.6105,,,39.6983,34.0379
