AYGX_min,AZ_mean,AYGX_mean,AYGX_std,AZ_mean,GX_std,Gnorm_max,Gnorm_median,timestamp
-0.0871,-9.865,-0.0822,0.0024,-9.865,0.0179,2.8041,2.697,1
-0.1007,-9.8649,-0.0835,0.0051,-9.8649,0.0236,2.7214,2.6909,2
-1.7136,-9.8625,-0.1694,0.4091,-9.8625,1.1113,5.5077,3.0528,4
-1.6758,-9.8564,-0.1918,0.3278,-9.8564,1.1455,5.6875,2.8046,5
-0.3969,-9.8793,0.2552,0.5417,-9.8793,2.5182,10.9759,2.7816,6
0.0442,-9.862,0.0762,0.0197,-9.862,0.0611,2.7367,2.6951,7
0.0312,-9.864,0.0836,0.0357,-9.864,0.0946,2.9431,2.7031,8
0.0166,-9.8608,0.0807,0.0792,-9.8608,0.2456,2.8875,2.7483,9
-2.4945,-9.8726,-0.9179,1.0703,-9.8726,2.9191,6.643,3.0888,10
-0.2292,-9.8609,-0.0932,0.0837,-9.8609,0.2611,3.6482,2.7142,11
-0.1612,-9.8656,-0.1436,0.016,-9.8656,0.0274,2.721,2.7113,12
-0.6725,-9.8665,-0.192,0.1652,-9.8665,0.4794,3.2496,2.7376,14
-0.2353,-9.8631,-0.1717,0.042,-9.8631,0.081,2.7609,2.688,15
-0.1974,-9.8644,-0.1794,0.0141,-9.8644,0.0282,2.7335,2.6992,16
-0.5258,-9.8678,0.033,0.9511,-9.8678,0.6192,4.7845,2.7128,17
-375.7505,-9.6268,-34.7699,134.0039,-9.6268,20.1636,47.9204,12.3026,18
-69.259,-9.5276,-22.3187,29.6921,-9.5276,6.4784,18.4393,7.3333,19
-6.9228,-9.6649,3.9065,7.222,-9.6649,3.2357,17.4603,12.4793,20
-3.6038,-9.7955,3.8,9.1493,-9.7955,5.9267,14.2501,4.0097,21
-3.5212,-9.8459,0.0198,2.0936,-9.8459,3.2765,6.9745,4.4489,23
-8.0554,-9.8525,-1.2346,3.676,-9.8525,4.7876,12.5329,4.6878,24
-41.3777,-9.806,-9.7537,10.4,-9.806,4.7716,15.9245,9.1257,25
-4.4943,-9.7743,5.6351,7.5986,-9.7743,4.9018,9.7621,5.1496,26
-2.5607,-9.7815,-0.1501,0.8739,-9.7815,0.5649,2.9354,2.5245,27
-3.4744,-9.8016,-0.6388,1.4445,-9.8016,1.2221,3.8351,2.773,29
-6.6363,-9.801,-3.0769,1.9249,-9.801,1.4193,5.3957,3.3142,30
-0.2585,-9.7882,0.4419,0.5405,-9.7882,0.4131,2.5703,2.5253,31
-3.0089,-9.7792,-2.245,0.7065,-9.7792,0.5084,3.3492,2.9975,32
-0.9773,-9.7911,-0.7795,0.1742,-9.7911,0.1375,2.6549,2.5729,33
-3.3909,-9.7891,-2.4237,0.4729,-9.7891,0.3739,3.6034,3.0801,34
-2.8955,-9.7659,-2.3688,0.4493,-9.7659,0.3136,3.1813,3.0394,35
-2.0457,-9.7678,-0.8385,0.5728,-9.7678,0.3468,2.9055,2.5556,36
-0.8524,-9.7778,-0.6757,0.1264,-9.7778,0.0851,2.5959,2.562,37
-1.6608,-9.7782,-1.3093,0.3447,-9.7782,0.2511,2.8043,2.7123,38
-2.3613,-9.7753,-1.915,0.2857,-9.7753,0.1574,2.9964,2.8918,40
-3.4652,-9.771,-1.3066,1.182,-9.771,0.798,3.4281,2.6915,41
-2.9644,-9.7676,-1.8443,0.9664,-9.7676,0.6383,3.1622,2.8781,42
-3.1013,-9.7873,-0.6624,1.4396,-9.7873,1.0674,3.3976,2.623,43
-4.5091,-9.7932,-2.4586,1.284,-9.7932,0.9794,4.2957,3.2464,44
-0.977,-9.7689,0.0283,0.6576,-9.7689,0.4326,2.6004,2.5097,45
-2.6637,-9.7627,-1.4761,1.3036,-9.7627,0.8355,3.0963,2.8684,46
-10.7773,-9.7863,-4.7644,4.3191,-9.7863,2.7879,7.1503,4.8133,47
-8.8588,-9.7835,-1.0694,5.6724,-9.7835,3.365,7.4039,4.0254,49
-3.8543,-9.7868,-0.1916,1.8437,-9.7868,1.2949,3.6763,2.6379,50
0.435,-9.8085,0.5833,0.1447,-9.8085,0.1361,2.5559,2.5217,51
-2.1354,-9.8063,-1.7909,0.3063,-9.8063,0.2084,3.09,2.9492,52
-2.0676,-9.7875,-1.202,0.6241,-9.7875,0.4489,2.9093,2.7474,53
-0.6845,-9.8038,-0.196,0.3172,-9.8038,0.2599,2.5732,2.5071,54
-3.8088,-9.811,-3.2615,0.5042,-9.811,0.2085,3.9644,3.856,55
-2.0574,-9.7795,-1.9409,0.0987,-9.7795,0.0719,2.9227,2.9,56
-4.0583,-9.7713,-2.1748,1.3578,-9.7713,0.908,3.7397,2.9041,57
-0.906,-9.7589,-0.4292,0.2935,-9.7589,0.1831,2.5645,2.5047,58
-3.5891,-9.7959,-2.9394,0.5089,-9.7959,0.3209,3.6934,3.4429,60
-3.3538,-9.7437,-2.2991,1.2407,-9.7437,0.7455,3.2241,3.0475,61
-1.8432,-9.7792,-1.1851,0.3749,-9.7792,0.26,2.8204,2.6347,62
-1.6349,-9.7709,-1.3563,0.2376,-9.7709,0.1746,2.7671,2.6876,63
-3.927,-9.7793,-1.1001,1.6284,-9.7793,1.3336,4.1216,2.5397,64
-1.3076,-9.8131,0.9248,1.3567,-9.8131,1.2745,4.0184,2.7485,65
-10.7383,-9.7806,0.2903,7.0551,-9.7806,4.7848,7.4479,5.3867,66
-2.0023,-9.852,-0.486,1.0482,-9.852,3.1807,6.7224,3.6684,67
-10.7699,-9.7907,-1.8775,6.3329,-9.7907,4.4343,9.9516,4.615,69
0.18,-9.7829,1.0054,0.4995,-9.7829,0.3303,2.8017,2.6675,70
-2.9863,-9.7879,-2.3512,0.3094,-9.7879,0.2338,3.3464,3.1433,72
-0.4806,-9.7596,0.8343,0.6513,-9.7596,0.4036,2.6143,2.5956,73
-51.3209,-9.7154,-30.9316,15.7496,-9.7154,6.0777,21.3553,14.5391,74
-40.1267,-9.823,8.7643,28.9967,-9.823,16.3989,58.5131,31.0499,75
-27.7459,-9.8344,-1.9261,16.2975,-9.8344,11.8191,29.73,9.771,76
-7.7011,-9.8526,2.8939,9.2434,-9.8526,5.1659,10.1113,4.5816,77
-32.2396,-9.7447,-0.8038,8.0774,-9.7447,3.6454,13.1312,2.9332,79
-3.2902,-9.8216,-1.2649,1.3681,-9.8216,0.9338,3.5309,2.8407,80
-4.2511,-9.8416,-0.4139,2.2982,-9.8416,3.55,5.8053,4.1452,81
-68.9044,-9.6233,-43.7257,23.9038,-9.6233,8.5698,24.261,16.5297,82
-38.3949,-9.7441,-8.1871,17.4738,-9.7441,7.5345,45.0478,34.2621,83
-43.5087,-9.581,-24.819,9.2986,-9.581,4.4169,39.6215,36.6345,84
-2.5271,-9.3377,9.9333,7.4167,-9.3377,2.3593,9.574,7.8487,85
-16.3699,-9.5965,19.2498,25.7804,-9.5965,10.5118,68.114,55.1008,86
-1.1346,-9.8841,19.0051,23.3723,-9.8841,14.4108,66.5014,39.1084,87
-7.8387,-9.8765,2.946,7.7572,-9.8765,6.4333,70.9792,36.1343,89
-1.0344,-9.8456,2.3351,2.1161,-9.8456,0.598,15.4598,9.4527,90
-0.5982,-9.7948,1.1508,1.0072,-9.7948,0.4785,15.1264,7.9756,91
-2.8916,-9.8893,0.2879,1.7055,-9.8893,1.5372,8.3625,6.5661,92
-1.2603,-9.8333,0.3358,1.0286,-9.8333,0.4479,9.5814,7.0582,93
0.1518,-9.9752,4.5938,3.1607,-9.9752,0.9583,37.2161,25.2987,94
-6.6929,-9.8968,11.6188,11.4162,-9.8968,2.6321,43.8314,42.2416,95
-2.0165,-9.9114,1.9814,3.3711,-9.9114,3.0662,38.0337,26.9406,96
-0.0776,-10.0855,1.3292,1.2981,-10.0855,1.8585,45.9887,43.2621,97
-5.7586,-9.5837,2.003,4.4132,-9.5837,3.3379,36.4456,14.727,99
-0.9587,-9.8771,1.1627,1.7605,-9.8771,0.9732,22.4083,17.0378,100
-1.5471,-9.7623,-0.3444,1.036,-9.7623,1.7016,9.2393,6.8149,101
-5.385,-9.7361,1.2332,4.1821,-9.7361,3.0522,24.3082,14.0128,102
-0.479,-9.5899,1.367,1.5166,-9.5899,1.8634,10.1892,9.0735,103
-1.1057,-9.8334,-0.1119,0.7607,-9.8334,1.715,15.1687,8.7686,104
2.7033,-9.9877,7.1073,4.4441,-9.9877,1.403,17.746,10.6203,105
-1.9407,-9.9418,1.4526,1.6467,-9.9418,1.1084,13.7428,8.0018,106
-0.2685,-9.8042,0.9713,0.7608,-9.8042,0.9694,12.7416,7.4503,107
-6.7096,-9.8611,1.1808,3.043,-9.8611,5.7473,19.0259,11.7687,109
-1.2991,-10.0043,0.2935,1.156,-10.0043,1.848,22.7892,9.5897,110
3.4255,-9.9862,13.0772,6.6857,-9.9862,1.4302,20.0078,17.1712,111
0.9291,-9.7981,9.5241,6.3975,-9.7981,2.0868,18.3329,11.8764,112
-5.0867,-9.334,0.3499,2.8512,-9.334,2.6925,14.2558,9.3047,113
-2.4043,-9.2901,-0.2724,1.7413,-9.2901,0.4995,11.3691,5.3271,114
-2.9061,-10.2754,-0.2089,1.3944,-10.2754,0.9751,8.3558,6.634,115
-4.1172,-9.7189,1.2798,2.7557,-9.7189,4.0058,23.5987,13.3843,116
-1.3135,-9.8348,0.7779,1.9262,-9.8348,1.2512,12.3844,10.8812,117
-7.2459,-10.1845,1.3952,4.2271,-10.1845,7.0863,36.6634,26.7444,119
-0.4995,-9.8512,2.143,2.4353,-9.8512,1.9709,27.3093,22.637,120
-2.5182,-9.8604,-0.3379,1.2488,-9.8604,1.4165,12.4478,9.9556,121
-1.4798,-9.9311,0.0359,1.0542,-9.9311,0.9414,17.3646,13.5239,122
11.0544,-9.9224,23.9564,10.1141,-9.9224,0.8374,36.8923,27.4135,123
9.4382,-10.0706,15.2518,4.5889,-10.0706,1.7357,43.9097,33.0884,124
0.2503,-9.8176,4.142,3.3002,-9.8176,2.6281,23.4555,19.958,125
-1.0241,-9.8367,0.8669,1.017,-9.8367,2.0434,36.3231,29.9432,126
-2.2496,-9.67,-0.0559,1.0795,-9.67,0.4477,28.4341,27.2428,127
-6.1494,-9.7061,1.3889,3.752,-9.7061,5.3231,43.1721,16.2154,129
-2.574,-9.694,2.7114,5.5971,-9.694,4.7151,32.2657,14.2111,130
-2.1393,-9.8173,5.9849,6.5507,-9.8173,4.5853,20.8391,15.6588,131
-1.6015,-8.9836,-0.396,0.5959,-8.9836,2.0166,27.3621,12.5414,132
-10.7832,-9.7226,2.1723,4.7393,-9.7226,7.573,16.7131,14.1311,133
-15.5904,-9.4481,-3.5568,9.3824,-9.4481,2.0715,32.0777,27.7817,134
-4.6268,-9.8291,2.8578,6.3279,-9.8291,1.0746,54.0312,48.9291,135
-14.7075,-10.0749,1.9599,10.8574,-10.0749,2.161,35.6421,24.9809,136
-46.5915,-9.8456,-1.5752,24.9336,-9.8456,10.1984,29.7999,16.5198,137
-37.6003,-10.0307,-5.835,15.5323,-10.0307,6.3365,49.024,15.9576,139
-94.9831,-10.1428,0.6768,49.4322,-10.1428,12.7243,44.8846,24.4128,140
-10.3689,-10.2492,-2.6545,4.4218,-10.2492,6.3444,14.509,9.8066,141
-4.78,-10.0195,18.0606,20.1057,-10.0195,5.7368,23.7734,22.424,142
-4.3168,-9.6096,-0.5099,2.254,-9.6096,1.347,15.3459,11.7684,143
-0.1298,-9.9484,1.7881,2.2293,-9.9484,1.4475,11.8456,6.3168,144
0.8229,-9.7486,7.4732,5.7837,-9.7486,1.5727,17.5387,16.7016,145
-0.2735,-10.0822,0.067,0.2093,-10.0822,1.7847,7.9581,5.2465,146
-2.3932,-9.8513,2.8762,3.7765,-9.8513,3.9425,21.4202,19.6361,147
-2.7806,-9.9443,1.7883,3.9322,-9.9443,1.8274,24.3591,22.4006,148
1.092,-9.89,22.0931,10.2769,-9.89,6.43,45.9777,31.3198,149
-6.4313,-9.9127,12.4134,13.3041,-9.9127,6.2952,43.8318,34.2422,150
-0.7816,-10.2306,5.0009,5.154,-10.2306,5.5401,33.3237,30.2029,151
0.0298,-10.2787,5.3655,6.5468,-10.2787,5.375,45.3884,43.9737,152
1.0163,-9.9245,10.3841,8.4689,-9.9245,4.0205,25.5825,24.5524,153
0.6855,-9.8946,2.0106,0.9278,-9.8946,1.2261,18.0045,12.0722,154
-0.3636,-9.959,0.3454,0.5607,-9.959,1.3353,15.4507,10.5268,155
-1.6432,-9.8053,-0.5473,0.7405,-9.8053,1.1795,9.105,8.0953,156
-0.4645,-9.9169,1.0186,1.1728,-9.9169,2.0073,19.4222,11.5874,157
-1.2285,-9.9046,0.1819,0.9037,-9.9046,1.399,19.432,7.4958,159
-3.604,-9.8575,0.4729,1.4285,-9.8575,2.3591,16.0827,6.2996,160
-0.1887,-9.9011,0.9751,0.9039,-9.9011,1.9795,13.7929,9.3699,161
-1.6389,-9.9499,1.2523,2.3393,-9.9499,2.3744,11.905,9.7272,162
-0.027,-9.8511,0.1125,0.1833,-9.8511,0.525,5.4218,4.2122,163
-1.1178,-9.7983,0.1403,0.618,-9.7983,0.8059,7.8591,4.0328,164
-0.6623,-9.9092,0.2935,0.5875,-9.9092,2.0218,12.5508,7.2699,165
-2.7672,-9.8854,0.3306,1.8541,-9.8854,2.1879,16.7028,14.1916,166
0.0456,-9.9072,0.6186,0.3986,-9.9072,0.6379,9.8473,3.8246,167
-2.0928,-9.8437,0.6582,1.8744,-9.8437,1.9438,21.328,8.597,169
-3.1564,-9.945,2.7947,3.4254,-9.945,4.2012,27.5724,15.8834,170
-4.949,-9.9819,1.6959,3.5345,-9.9819,1.2259,16.7116,11.4286,171
-0.9859,-9.7174,0.3699,1.0715,-9.7174,2.2178,10.6712,8.6575,172
-2.7935,-9.8956,-0.38,1.0666,-9.8956,1.6703,8.1526,4.9754,173
-0.1755,-9.7974,0.6234,0.6639,-9.7974,3.7057,18.8063,16.1284,174
-0.5676,-10.0533,0.1352,0.5223,-10.0533,0.5917,7.1544,4.7509,175
-1.7122,-9.851,1.2337,1.6246,-9.851,3.268,12.828,9.3537,176
-0.1352,-10.083,2.4192,1.9093,-10.083,3.0383,18.7058,15.6316,177
-5.8699,-9.8615,1.0051,3.1828,-9.8615,5.3532,15.7991,8.0092,179
-2.419,-9.6358,3.0622,3.1886,-9.6358,2.3845,11.7088,10.3882,180
-1.1885,-10.0281,-0.0776,0.6226,-10.0281,1.9167,9.1925,5.7353,181
4.8803,-9.9448,6.5503,1.2698,-9.9448,1.2992,18.4104,12.8021,182
-2.4361,-9.9507,0.2682,1.9294,-9.9507,1.8158,30.0488,24.8878,183
-3.5958,-9.8515,9.2517,11.5262,-9.8515,5.0502,43.5041,30.8341,184
-0.5139,-9.8854,-0.0097,0.3195,-9.8854,0.624,17.1521,15.3425,185
-6.0846,-9.7716,2.8978,6.9163,-9.7716,2.7627,21.4341,18.5708,186
-0.4476,-9.6683,6.0396,6.9198,-9.6683,4.9764,19.4273,14.5043,187
-4.7895,-10.093,0.0678,1.4331,-10.093,4.1897,43.1899,36.4298,189
0.9128,-9.9819,2.4482,1.1745,-9.9819,0.4823,34.6624,33.2727,190
-0.0111,-9.9559,2.1725,3.0521,-9.9559,4.9162,22.6137,20.6245,192
-5.6992,-9.9188,5.3669,8.5573,-9.9188,8.0151,29.0014,18.8501,193
-1.777,-9.8756,3.161,3.6021,-9.8756,1.6327,11.7831,7.469,194
-0.5899,-10.1453,-0.0876,0.2865,-10.1453,0.6905,13.3888,9.7914,195
-1.8667,-9.8871,0.3622,1.2682,-9.8871,3.2571,15.3003,9.0939,196
-0.0235,-9.9388,3.9427,3.9087,-9.9388,3.5863,19.659,16.4741,197
-1.1564,-9.7671,0.1562,0.8535,-9.7671,0.4139,6.0419,4.48,199
-0.8763,-9.7698,1.8932,2.4549,-9.7698,2.5908,12.351,10.7338,200
-3.4461,-9.9789,4.451,4.9877,-9.9789,7.1669,35.5001,21.0207,201
4.0693,-9.8797,11.385,5.5567,-9.8797,2.3318,29.5979,25.5385,202
0.6554,-9.914,5.1081,2.8922,-9.914,1.8022,21.5538,15.0481,203
-2.5624,-10.032,-1.0179,1.0144,-10.032,1.5955,12.4848,7.8935,204
-0.2971,-9.9513,0.4057,0.5486,-9.9513,1.6715,6.1529,3.6714,205
-0.3237,-9.8432,0.9059,0.9726,-9.8432,2.0277,11.0322,6.3589,206
-1.4068,-9.7498,1.4038,3.1021,-9.7498,3.844,10.8594,9.4543,207
-7.6536,-9.8625,0.6675,2.971,-9.8625,5.0613,23.0742,6.8618,209
-0.1807,-9.8805,0.0783,0.13,-9.8805,0.6829,6.1778,3.936,210
-1.4882,-9.756,0.1807,0.9104,-9.756,1.0168,7.8745,4.6801,211
-7.1955,-9.9406,5.6693,7.7082,-9.9406,0.7764,17.1118,10.1694,212
-0.7162,-9.6304,0.5013,1.0804,-9.6304,0.6644,7.4024,5.8409,213
-0.449,-10.0465,4.6938,4.0367,-10.0465,4.8401,25.8512,15.8449,214
-0.4222,-10.1829,0.0143,0.3423,-10.1829,0.4625,6.8831,5.262,215
-0.4458,-9.9719,1.6594,1.7672,-9.9719,3.1878,23.3427,14.2797,216
-1.0112,-9.7676,1.067,2.003,-9.7676,2.4554,12.0503,9.6609,217
-2.363,-9.8794,1.7482,3.5408,-9.8794,3.9676,14.8385,10.0591,219
-3.6512,-9.8761,0.0602,1.6687,-9.8761,1.095,10.6921,5.6533,220
-1.5771,-10.0827,8.7496,12.873,-10.0827,4.1244,19.3401,13.9776,221
-4.3218,-9.8129,-1.6044,1.9335,-9.8129,0.477,16.4032,10.1679,222
-1.1075,-9.8049,1.9608,2.8989,-9.8049,2.2958,17.4051,15.8276,223
-1.1847,-9.7781,4.992,4.5543,-9.7781,6.0129,21.4262,18.3396,224
-5.2198,-10.2664,-1.4881,2.2237,-10.2664,1.944,15.6019,13.199,225
1.2006,-9.8739,8.75,5.8683,-9.8739,2.3012,20.0877,13.6772,226
-2.4515,-9.6725,0.3006,1.6665,-9.6725,2.6436,11.1673,5.2944,227
-3.8471,-9.8598,2.4381,4.749,-9.8598,7.6846,25.3926,11.9489,229
-0.6839,-10.0171,10.0537,11.0529,-10.0171,12.3514,31.3797,28.7907,230
-1.6953,-9.8427,1.7391,2.5853,-9.8427,2.7785,13.5045,9.9183,231
-0.8522,-9.7076,2.9974,3.1899,-9.7076,3.1114,9.9013,8.584,232
-1.3348,-9.9236,1.4623,2.2468,-9.9236,2.0226,16.2151,11.6438,233
-0.2027,-9.7259,1.0395,1.2136,-9.7259,2.9424,11.8496,10.7049,234
-0.159,-10.0086,1.6802,1.6688,-10.0086,2.8054,28.0921,26.3177,235
-2.1602,-9.919,-0.7474,1.5282,-9.919,1.3451,11.7915,8.2447,236
-5.7867,-9.8726,4.8112,7.9851,-9.8726,2.6542,25.5582,14.6411,237
-4.2391,-9.9143,0.0972,1.9334,-9.9143,0.578,19.8721,16.1324,238
-3.3792,-9.9791,1.2276,3.1851,-9.9791,3.9026,18.218,15.0315,239
-1.4559,-9.8876,1.999,1.8472,-9.8876,4.2917,20.6894,12.7307,240
-4.1813,-9.8407,2.9723,4.7019,-9.8407,3.9499,20.8927,18.5347,241
-1.503,-9.7389,1.7481,2.1965,-9.7389,0.8114,19.4048,11.9768,242
-0.3899,-9.8131,0.0525,0.2105,-9.8131,0.785,5.3692,3.6005,243
-0.9665,-9.7277,1.1246,1.4415,-9.7277,2.3462,9.0687,6.687,244
-2.2878,-9.7957,1.3591,2.0701,-9.7957,0.6312,8.2401,6.7705,245
-6.1181,-9.9937,1.0474,4.9318,-9.9937,2.3182,14.6734,12.7798,246
-4.7532,-9.9604,3.221,5.9659,-9.9604,3.8636,23.3304,11.3836,247
-0.4305,-9.895,2.4912,2.4523,-9.895,1.4884,11.2173,9.0865,248
-2.2595,-9.8841,0.9715,1.8628,-9.8841,2.0755,7.1169,4.6927,249
-8.029,-9.8792,8.4707,13.9656,-9.8792,10.0618,30.4298,16.6358,250
-3.1212,-9.8809,4.838,5.6435,-9.8809,2.9353,13.063,11.0424,251
-10.5814,-9.9177,3.612,7.8458,-9.9177,4.5613,35.3052,16.3089,252
-11.8649,-9.8269,6.908,11.8387,-9.8269,8.915,30.0335,16.9033,253
1.441,-9.8025,5.6314,4.0046,-9.8025,2.767,14.5218,10.048,254
-4.5793,-10.0938,3.5004,6.1464,-10.0938,2.9008,19.3043,16.1561,255
-1.3876,-9.9355,2.7568,2.8561,-9.9355,6.9454,28.069,14.7603,256
-1.8599,-9.98,1.4255,2.693,-9.98,2.4647,14.1244,8.3598,257
-0.596,-9.9399,0.2929,0.5525,-9.9399,1.3552,10.3387,4.997,259
-0.4624,-9.8586,1.0888,1.884,-9.8586,2.2206,17.1831,5.3669,260
-0.7069,-9.8268,0.2104,0.6467,-9.8268,2.2738,15.8299,15.3651,261
-0.1954,-9.8091,0.6962,0.8824,-9.8091,2.3014,13.9555,12.0082,262
-0.5832,-9.8875,0.3111,0.7946,-9.8875,2.4568,10.2565,9.235,263
-0.861,-9.824,0.1424,0.467,-9.824,1.0147,10.359,8.0022,264
1.1164,-9.8165,9.6611,6.2821,-9.8165,2.9468,19.1765,11.7872,265
-1.2231,-9.8308,6.3296,9.4307,-9.8308,5.1995,23.7691,9.413,266
-5.5798,-9.9371,-1.1886,2.8448,-9.9371,0.8593,23.2022,19.5787,267
-21.1832,-9.8768,0.9127,5.5885,-9.8768,4.746,22.0516,10.1218,269
-0.2848,-10.0513,0.9405,0.8524,-10.0513,1.1254,12.4756,7.7978,270
10.4781,-9.822,13.3414,2.0754,-9.822,1.6378,22.598,21.4025,271
-0.8186,-9.8779,3.8502,3.2491,-9.8779,1.5554,25.1577,16.8272,272
0.1591,-9.824,4.9296,4.6199,-9.824,4.3481,21.9172,15.5738,273
-3.4522,-9.809,0.438,2.8686,-9.809,2.0357,13.2364,8.6254,274
-3.2964,-9.7991,-0.404,1.2969,-9.7991,1.7515,29.2725,26.8222,275
-3.9508,-10.1207,4.5762,5.8776,-10.1207,11.6349,34.6789,25.9928,276
-0.5899,-9.5624,7.3737,6.6068,-9.5624,2.7538,21.4333,13.7337,277
-3.0268,-9.8661,0.2713,1.2936,-9.8661,2.5805,12.199,7.5994,279
-0.1343,-9.9898,-0.0111,0.1425,-9.9898,0.7942,4.743,2.2445,280
-1.1868,-10.0878,0.289,0.8313,-10.0878,1.5159,8.227,5.3724,281
-0.4141,-9.8791,0.1929,0.5198,-9.8791,1.5941,7.1014,4.8904,282
-3.4914,-9.943,0.6445,3.1519,-9.943,2.1072,12.2098,9.1527,283
-0.6205,-9.7468,1.1284,1.232,-9.7468,2.633,10.6918,8.173,284
-0.5047,-9.9222,-0.0363,0.2146,-9.9222,1.1681,3.8937,3.2004,285
-0.0386,-9.7716,1.6856,1.538,-9.7716,4.7656,14.7927,9.9908,286
0.057,-10.1002,2.7738,2.7313,-10.1002,2.7557,21.6278,14.9146,287
-2.8784,-9.8652,2.5206,3.8626,-9.8652,7.0425,21.8881,12.4964,289
-2.7863,-10.1045,-0.1557,1.7965,-10.1045,1.7999,23.7748,21.2534,290
-0.579,-9.932,0.2581,0.6671,-9.932,2.1402,18.692,16.7217,291
-0.0327,-9.7046,2.082,1.977,-9.7046,2.3689,12.8278,11.8983,292
-1.318,-9.925,1.3348,2.3562,-9.925,2.0463,11.609,8.8055,293
-0.3215,-9.8725,1.5974,1.8039,-9.8725,1.5337,12.9357,5.8669,294
-3.4346,-9.9255,3.1761,5.5058,-9.9255,8.9054,28.9792,27.5527,295
-0.7232,-9.8849,0.9589,1.754,-9.8849,2.4789,22.4366,13.7269,296
-1.4535,-9.644,-0.1869,1.3155,-9.644,0.5915,9.1923,7.789,297
-3.7156,-9.8063,0.4366,1.1721,-9.8063,3.4658,14.2775,6.7426,299
-0.7402,-10.6274,-0.1756,0.4093,-10.6274,2.3427,6.6858,4.3949,300
-0.7563,-10.0602,4.7705,5.5729,-10.0602,4.3003,16.9921,15.5081,301
-1.5905,-9.695,0.6861,1.3922,-9.695,0.6933,16.1543,10.2584,302
-0.3606,-9.7952,1.6816,2.9793,-9.7952,2.5388,7.818,6.682,303
-2.3009,-9.9953,2.034,4.4265,-9.9953,2.4731,11.158,9.5165,304
-1.6866,-10.0975,0.7774,1.2398,-10.0975,1.2581,8.279,6.0568,305
-2.9477,-10.0519,4.4897,4.592,-10.0519,9.0797,34.0216,20.7268,306
-1.402,-9.6943,0.5815,1.428,-9.6943,0.9636,6.761,4.4408,307
-18.9382,-7.907,5.5954,13.7703,-7.907,10.5602,70.6643,22.3346,309
-24.6786,-5.7937,-3.4081,14.5304,-5.7937,8.7915,33.2927,19.9902,310
-22.8235,-10.3884,-1.388,14.4389,-10.3884,5.5787,26.5112,12.7606,311
-2.0855,-9.7601,0.9547,1.5654,-9.7601,3.3853,9.8172,6.4314,312
-8.4648,-9.797,-0.0189,4.8913,-9.797,4.6713,12.2128,6.8446,313
-3.633,-9.8452,0.5417,2.7143,-9.8452,1.2676,11.434,9.9273,314
0.0522,-9.9712,4.7278,3.8426,-9.9712,3.4063,13.2502,10.1059,315
-8.4189,-9.6792,3.3907,9.6427,-9.6792,6.4951,24.9688,13.695,316
-2.5315,-9.8344,0.1245,1.8438,-9.8344,1.4801,27.1152,25.778,317
3.7687,-10.0231,12.6463,6.8632,-10.0231,3.2394,40.3454,36.0624,319
-1.5039,-9.8634,-0.2534,0.7323,-9.8634,3.5254,9.6117,4.7814,320
-3.1515,-9.8209,0.5133,1.7993,-9.8209,3.1357,18.0939,9.2235,321
-1.1891,-10.1511,0.062,0.6124,-10.1511,1.6259,9.0683,6.5376,322
-14.5813,-10.0011,10.2465,21.9616,-10.0011,6.5234,35.9418,20.8187,323
-0.1859,-9.9436,1.624,1.653,-9.9436,1.4945,16.2156,10.6759,324
-4.1775,-9.9082,-0.6004,1.5989,-9.9082,0.9088,28.418,21.1355,325
-4.1017,-9.9696,6.7034,6.9164,-9.9696,1.0717,21.85,20.1111,326
-12.8143,-9.3593,9.3087,20.3273,-9.3593,5.0878,33.3523,15.2022,327
-3.5012,-9.8753,0.3523,1.4083,-9.8753,1.3959,16.5001,7.8511,329
-1.8838,-9.854,-0.0796,0.5483,-9.854,1.4037,6.0912,3.0776,330
-1.9625,-9.8221,-0.3729,0.7027,-9.8221,0.95,4.7624,2.6755,331
-2.7549,-9.8135,-0.4272,1.0621,-9.8135,1.1636,6.6824,4.1161,332
-2.0417,-10.0031,0.2291,1.4324,-10.0031,0.9618,7.6553,5.5378,333
-2.0092,-9.9871,2.7545,3.3729,-9.9871,1.9922,14.3378,12.4427,334
-3.8206,-10.0299,0.2,2.0698,-10.0299,0.8428,8.1567,4.8334,335
-0.1036,-9.9771,3.4137,3.1041,-9.9771,1.995,12.8108,11.7902,336
-3.1931,-9.9746,3.0297,6.0479,-9.9746,5.8267,14.9481,14.2708,337
-1.3333,-9.9679,0.7548,2.1926,-9.9679,0.327,6.5219,4.7956,338
-1.3141,-9.8088,0.3069,0.875,-9.8088,1.7971,12.3742,4.0471,339
-1.9355,-9.8721,0.229,1.0813,-9.8721,2.0693,10.3877,6.9216,340
-4.1576,-9.5847,2.5803,4.7098,-9.5847,0.865,12.5181,9.4791,341
-0.8257,-9.8351,2.1076,2.0105,-9.8351,0.7426,28.8845,22.9784,342
-58.8772,-9.4998,0.5153,29.4782,-9.4998,12.5639,35.8157,27.7086,343
-15.5881,-10.4542,-3.647,6.1584,-10.4542,1.4945,20.6938,14.0753,344
-10.0093,-9.7528,0.7363,4.2646,-9.7528,4.2713,40.1582,19.1379,345
-6.737,-10.0078,-0.423,4.8197,-10.0078,3.1017,18.6273,13.1898,346
-3.6093,-9.9168,2.5017,2.8724,-9.9168,3.5628,21.415,6.6734,347
-14.5447,-9.989,-4.1147,5.0671,-9.989,2.8394,19.107,12.5652,348
-13.4124,-9.8096,-4.6332,6.0511,-9.8096,4.1172,18.6775,14.3921,349
-64.4874,-9.9132,-10.7614,24.057,-9.9132,13.9692,34.5309,20.6819,351
-28.6195,-9.886,-5.4477,20.334,-9.886,8.4896,32.6337,19.7306,352
-21.4727,-9.9331,2.8782,12.3232,-9.9331,10.6309,33.2356,18.0355,354
-0.074,-9.7957,9.7133,6.457,-9.7957,4.5023,23.3455,11.9333,355
-4.1956,-9.9967,1.2002,3.5884,-9.9967,5.9287,17.2215,10.6304,356
-3.6564,-9.8524,1.0561,2.4167,-9.8524,2.902,13.2535,8.6219,357
-0.8036,-9.7398,1.3229,1.9105,-9.7398,4.5365,14.6469,6.1212,358
-1.321,-9.9012,2.5303,3.3129,-9.9012,1.2254,12.8199,8.4784,359
-6.6986,-9.7945,1.3692,4.2959,-9.7945,4.1715,17.2485,12.3322,360
-5.0256,-10.0123,5.4506,8.3476,-10.0123,5.3896,19.8433,18.4502,361
-4.0967,-9.2518,-0.9391,1.7449,-9.2518,3.0483,19.8732,9.7419,362
-5.7271,-9.4888,0.6142,3.7463,-9.4888,4.844,20.8686,8.3565,364
-2.83,-10.0934,0.1638,1.9566,-10.0934,1.531,11.6188,8.0101,365
-0.2686,-9.906,2.6034,2.1766,-9.906,5.6857,12.991,7.8762,366
1.2149,-10.0182,3.8837,2.2769,-10.0182,2.2722,12.8791,11.253,367
-0.8255,-9.955,0.9619,1.3853,-9.955,2.5102,10.0959,7.2792,368
-0.4976,-9.7185,0.0222,0.3289,-9.7185,0.8405,6.3703,4.2756,369
-1.1289,-9.8071,-0.15,0.4913,-9.8071,1.9581,8.0719,6.5156,370
-1.5299,-9.7435,-0.144,0.6934,-9.7435,1.5184,9.9586,4.9948,371
-5.9245,-9.6768,1.4993,3.3639,-9.6768,4.4964,21.562,9.9225,372
-2.5552,-9.8861,-0.0298,0.8658,-9.8861,2.4641,17.0415,4.8647,374
-1.388,-9.814,0.519,1.3413,-9.814,1.584,10.8344,6.0829,375
-3.5977,-9.8505,-0.2279,1.3551,-9.8505,2.9789,10.2513,6.6959,376
-3.9878,-9.5863,0.6473,3.2783,-9.5863,1.6611,9.8471,5.2953,377
-4.5516,-9.8727,4.1483,5.5368,-9.8727,6.2954,16.3317,14.4029,378
-1.2163,-9.4058,-0.304,0.6193,-9.4058,1.8173,7.0281,3.9502,379
-4.0071,-9.8193,2.3403,4.9741,-9.8193,2.4382,13.8833,13.2557,380
-1.9608,-9.8214,1.0546,1.764,-9.8214,4.3756,9.9924,7.4652,381
-2.183,-9.7966,-0.2968,0.8992,-9.7966,0.9212,5.3528,3.8305,382
-0.6534,-9.9137,0.1525,0.5939,-9.9137,2.0905,8.6703,5.0357,384
-1.3288,-9.896,-0.1045,1.0879,-9.896,2.7065,14.7216,8.7793,385
-0.0592,-10.1437,0.936,1.0475,-10.1437,1.8529,13.4023,12.1198,386
-3.7911,-9.8576,-0.397,1.9614,-9.8576,1.6864,11.01,10.0928,387
-0.1069,-9.7872,3.4784,2.4971,-9.7872,1.2444,13.2591,11.714,388
-0.4891,-9.9989,0.2584,0.6465,-9.9989,3.5967,24.9392,23.1509,389
0.308,-10.0874,4.7443,3.6992,-10.0874,4.7816,33.86,28.1983,390
-1.9399,-9.9464,10.6326,5.8198,-9.9464,13.7996,45.8038,27.8662,391
1.8345,-10.1023,8.7049,4.8545,-10.1023,1.0351,23.3976,17.2571,392
4.2696,-9.8396,19.2745,9.0161,-9.8396,17.5244,29.2245,21.3886,394
-1.3213,-9.7384,2.6027,4.8057,-9.7384,3.0821,10.5123,8.2303,395
-1.9768,-9.8613,-0.4271,0.6774,-9.8613,0.7238,4.1484,3.4602,396
-0.6493,-9.8674,0.5675,0.8537,-9.8674,0.8577,9.8898,8.1672,397
-1.8883,-9.8569,1.7292,2.4757,-9.8569,1.7365,9.0198,7.1362,398
-0.3174,-9.9556,2.16,2.9048,-9.9556,4.807,19.5783,18.0822,399
-7.6723,-9.9638,7.9249,13.5907,-9.9638,3.2337,20.8247,17.6563,400
-7.0932,-9.8745,0.7983,3.858,-9.8745,3.9033,12.1338,9.0377,401
-0.2435,-9.8387,1.6948,1.5908,-9.8387,1.7728,9.6169,8.6379,402
-0.843,-9.6941,0.3931,0.7524,-9.6941,1.4138,8.3276,4.9275,404
-0.4779,-9.8326,0.5057,0.5432,-9.8326,1.9085,9.0564,7.0486,405
-1.753,-9.8562,0.6571,2.0509,-9.8562,0.5044,7.2082,3.9839,406
-0.5814,-9.7762,0.4719,0.9109,-9.7762,1.0352,5.9341,4.5612,407
-2.7081,-9.8875,0.8754,2.2601,-9.8875,2.5473,7.4537,4.5171,408
-0.5341,-9.8034,-0.0871,0.265,-9.8034,0.8962,5.8732,4.1581,409
-3.2136,-9.9269,-0.4264,1.2512,-9.9269,1.5627,6.6459,5.1268,410
-1.2443,-9.8121,0.8808,1.4626,-9.8121,1.6587,11.4425,10.4272,411
-2.8162,-9.8162,1.6933,2.9931,-9.8162,3.0276,11.8682,9.1659,412
-0.2681,-9.9293,0.5301,0.5994,-9.9293,2.1274,8.6131,5.8772,414
0.0159,-9.8094,1.1908,1.2287,-9.8094,4.4573,16.5577,15.0578,415
-2.5538,-9.8219,0.1876,1.4791,-9.8219,0.8272,9.6377,8.1824,416
-0.0943,-10.0456,0.0772,0.1509,-10.0456,0.4654,4.1997,3.4054,417
-1.4714,-9.9667,4.4866,4.2654,-9.9667,2.1656,11.7292,11.0846,418
-0.013,-9.7919,3.5053,3.4547,-9.7919,3.5704,14.7871,13.6275,419
-0.7924,-9.9326,0.6408,1.1304,-9.9326,2.3673,9.9666,5.8113,420
-0.9332,-9.9205,0.1627,0.5743,-9.9205,1.6597,9.5216,5.325,421
-1.8522,-9.8466,0.1572,0.7135,-9.8466,1.8721,8.7222,5.5402,422
-0.7403,-9.9006,0.6031,1.1045,-9.9006,2.4449,9.3957,6.2118,423
-0.002,-10.168,1.6915,1.4596,-10.168,2.3798,25.3664,20.4061,424
-1.0281,-9.912,-0.0137,0.4936,-9.912,2.0865,8.8572,5.316,425
-1.79,-9.8694,3.2107,3.3193,-9.8694,8.6068,20.4766,13.5649,426
-4.1648,-9.8832,1.2707,3.5323,-9.8832,5.1266,18.3034,10.4231,427
13.502,-10.3563,19.8211,3.7771,-10.3563,3.6311,42.9789,27.6842,428
-16.1373,-10.3596,2.7466,12.8298,-10.3596,10.6898,67.7632,57.9901,429
-0.5121,-9.6437,1.1611,1.3701,-9.6437,1.3079,8.8287,5.6099,430
-2.6579,-9.4609,0.7441,1.9091,-9.4609,0.7226,14.5921,6.6995,431
-15.4538,-9.8269,-4.6738,5.6142,-9.8269,6.4436,21.8281,8.0007,432
-87.393,-9.3126,-47.2199,33.7255,-9.3126,11.0678,27.2659,21.036,433
-11.6259,-9.7164,14.9661,26.3649,-9.7164,11.749,31.9223,12.5656,434
-24.3463,-9.8189,-0.3354,9.2788,-9.8189,7.4129,15.5691,4.9751,435
-18.6608,-9.7097,-13.1284,4.9284,-9.7097,2.9081,11.1583,7.9846,436
-14.4579,-9.6213,-7.9933,5.4101,-9.6213,2.2348,6.7818,5.0501,437
-0.0077,-9.578,3.3885,2.439,-9.578,1.1017,3.8256,2.7881,438
-20.0748,-9.7982,-9.6504,9.0739,-9.7982,10.1433,23.41,12.6879,439
-55.0166,-9.6737,-19.9258,18.7608,-9.6737,5.6622,19.4672,14.4008,440
-30.059,-9.7245,15.1998,25.7932,-9.7245,11.0224,31.2208,11.6766,441
-33.2091,-9.7828,9.5654,22.4633,-9.7828,11.8632,28.9287,20.2917,442
-7.9873,-10.0688,2.3747,8.8307,-10.0688,5.5459,29.1527,18.1562,444
-2.0056,-9.77,2.5175,4.4847,-9.77,1.761,18.6829,7.768,445
-27.6648,-9.7696,-5.2071,12.7325,-9.7696,2.0621,24.9149,21.4907,446
-4.7582,-9.9814,16.4611,20.4484,-9.9814,9.5224,39.998,22.8654,447
0.0051,-9.8375,1.9746,3.4229,-9.8375,4.5819,14.1583,13.0895,448
-3.1394,-9.3804,0.9868,3.7746,-9.3804,3.5665,15.8697,14.2006,449
-0.0687,-9.9642,2.6363,2.7763,-9.9642,2.7545,11.5728,10.992,450
-0.4327,-9.8757,0.8755,1.2877,-9.8757,2.5107,10.1797,4.8789,451
-1.47,-9.9128,-0.1925,0.6049,-9.9128,1.0499,7.3388,4.7229,452
-0.5108,-9.903,-0.0567,0.4191,-9.903,1.6479,9.2557,5.6945,453
-6.273,-9.6379,-1.5438,2.7796,-9.6379,2.1542,7.3354,4.1139,454
-0.3298,-9.856,1.1684,1.0913,-9.856,0.4673,9.128,5.4281,455
0.0015,-9.999,0.3257,0.2418,-9.999,1.6571,5.5884,3.9928,456
-1.5235,-9.5585,2.3235,4.1004,-9.5585,1.2083,13.8978,9.8959,457
-0.0301,-9.7141,1.5188,1.3066,-9.7141,1.8451,11.4586,10.5328,458
1.9186,-9.9245,3.6953,1.5407,-9.9245,1.6456,10.2303,8.4742,459
0.6323,-9.7356,2.4395,1.9772,-9.7356,1.6145,10.8217,8.0111,460
-3.0201,-10.0622,0.2644,1.3289,-10.0622,4.1227,11.8608,8.818,461
-2.5233,-9.9634,-0.6674,1.2047,-9.9634,1.5623,9.2961,3.5514,462
-0.2234,-9.6769,2.7262,3.2819,-9.6769,4.8429,13.9193,7.4925,464
-1.9147,-9.9049,1.0541,2.3694,-9.9049,1.3504,15.3033,9.5225,465
-1.7669,-10.0524,2.3595,2.8356,-10.0524,1.3088,12.8116,11.6831,466
1.588,-10.1215,6.4644,4.072,-10.1215,3.7936,15.7056,12.7254,467
-0.7592,-9.8206,0.5394,1.0069,-9.8206,2.5495,12.9085,6.6966,468
-1.6586,-9.6295,1.6607,1.6361,-9.6295,0.4153,16.2138,8.5911,469
-8.2143,-9.867,-0.8445,2.4419,-9.867,3.4087,11.1844,5.3358,470
-20.837,-9.6881,2.2142,20.4063,-9.6881,9.6415,42.3083,24.1208,471
-37.1146,-10.1777,-7.4232,22.375,-10.1777,4.6258,23.6679,12.9336,472
-49.5915,-9.3959,-5.5,34.7693,-9.3959,3.4415,28.1911,17.8418,473
-19.6642,-9.4356,-2.5483,13.5239,-9.4356,7.876,23.3861,10.4839,474
-6.7685,-9.6506,6.0088,12.7463,-9.6506,8.8425,30.0813,20.4674,475
-2.0165,-10.0761,2.3077,3.8007,-10.0761,3.9881,13.2273,10.8067,476
-0.3349,-9.5933,2.6229,2.623,-9.5933,3.7437,12.0277,9.036,477
-2.2082,-10.1488,0.2486,1.23,-10.1488,2.028,9.8077,4.197,478
-0.6898,-9.9815,0.6255,1.2134,-9.9815,1.4919,5.4809,4.5688,479
-2.9367,-9.8655,0.6043,2.5534,-9.8655,3.1576,9.0761,3.4351,480
0.1867,-9.939,7.8519,6.1975,-9.939,7.8143,20.3873,13.2864,481
-0.8597,-9.7075,3.0956,3.8867,-9.7075,5.0743,14.8238,10.4152,482
-1.6965,-9.7475,-0.1771,1.0824,-9.7475,1.1602,8.5016,6.4761,483
-8.8395,-9.7322,3.1427,10.2528,-9.7322,2.7285,16.0635,13.4069,484
-0.7326,-9.9283,1.4834,1.6223,-9.9283,3.1707,10.426,8.855,485
-3.959,-10.0549,-0.1827,1.8518,-10.0549,2.3421,9.9029,6.0048,486
-8.7329,-8.825,-1.331,4.038,-8.825,2.5144,7.2751,5.8557,487
-6.559,-10.0115,5.123,11.6781,-10.0115,5.8387,20.9804,18.8463,488
-2.5287,-9.6036,0.2507,1.6155,-9.6036,2.132,14.3959,8.449,489
-0.6117,-9.9374,0.4839,0.9852,-9.9374,2.3663,11.236,8.829,490
-15.0789,-9.6411,-1.215,4.8371,-9.6411,3.5731,23.8524,7.9089,491
-6.3757,-10.0356,2.5375,4.4524,-10.0356,7.9167,36.5388,11.1296,492
-7.4202,-9.5385,1.8833,5.3456,-9.5385,3.845,16.6036,11.2223,493
-3.1254,-10.0588,0.2156,2.5923,-10.0588,0.6196,9.7916,7.4923,494
-1.8486,-9.9405,-0.5033,0.7828,-9.9405,2.2195,7.1833,6.2015,495
-3.7855,-9.7339,-0.7343,1.5898,-9.7339,1.2226,12.5809,11.7433,496
-0.3309,-9.921,0.3332,0.4535,-9.921,1.1439,9.8445,7.2289,497
-1.7711,-9.7058,-0.5332,0.757,-9.7058,0.6268,6.465,5.3841,498
-2.7456,-9.8451,0.3626,0.9399,-9.8451,3.1359,10.7338,5.6598,499
0.02,-10.1701,1.1406,0.8467,-10.1701,2.1607,9.7774,5.328,500
-1.1892,-10.3401,-0.142,0.7065,-10.3401,2.9032,11.0737,9.3114,501
-2.5276,-9.9216,-0.3577,0.7761,-9.9216,1.2939,7.4488,5.2612,502
-0.9758,-9.9263,0.1631,0.82,-9.9263,1.5301,7.4857,5.9299,503
-1.0165,-9.8034,-0.2486,0.822,-9.8034,1.8413,13.794,11.8447,504
-1.9492,-9.6843,1.2116,3.1741,-9.6843,2.476,14.3537,8.5756,505
-0.1226,-9.7622,0.5515,0.8261,-9.7622,1.9555,9.6144,5.974,506
-1.364,-9.7857,3.1065,3.2899,-9.7857,6.5567,23.9687,13.309,507
-15.3715,-10.2543,2.8178,13.233,-10.2543,3.8934,25.1137,16.313,508
-44.9054,-9.7529,-1.5471,22.3629,-9.7529,9.9468,39.2268,18.0279,509
-9.2475,-10.1021,9.3301,19.2316,-10.1021,4.7765,22.6522,14.5434,510
-24.3527,-9.2491,-1.2177,12.8978,-9.2491,8.6674,23.0413,18.4947,511
-16.5075,-9.136,-3.2964,8.245,-9.136,6.7814,17.913,9.6224,512
-49.2519,-9.9332,-8.2354,21.9494,-9.9332,14.6905,32.3045,19.7583,513
-10.235,-7.9876,4.5784,12.8313,-7.9876,9.71,30.53,19.769,514
-2.1533,-9.9295,5.6016,6.9339,-9.9295,6.0066,20.3331,12.88,515
-0.8911,-9.0964,6.873,6.4825,-9.0964,7.5899,18.9234,11.956,516
-4.2137,-10.1271,0.337,2.2177,-10.1271,5.214,14.1521,10.1301,517
-1.18,-9.9305,-0.1754,0.5192,-9.9305,1.758,13.0392,5.9372,518
-0.3323,-9.6534,-0.0765,0.1555,-9.6534,0.5389,4.4365,1.3679,519
-0.2376,-9.7222,0.494,0.437,-9.7222,1.1084,7.4002,5.5056,520
-1.357,-9.9468,-0.6235,0.5135,-9.9468,2.6455,9.0977,6.2458,521
-1.296,-10.0597,4.9616,3.8307,-10.0597,2.3039,16.415,13.238,522
-1.2025,-9.7926,1.1116,1.7717,-9.7926,3.8218,11.4956,6.9811,523
-0.8578,-9.9341,-0.1675,0.3329,-9.9341,0.9348,5.5681,4.8066,524
-4.6926,-9.9222,-0.1857,4.0254,-9.9222,1.6153,17.3945,14.5049,525
-0.3543,-9.9286,1.1781,1.498,-9.9286,6.3576,21.3815,19.7124,526
-0.6526,-9.9505,2.3213,3.1775,-9.9505,3.9297,22.0746,19.8695,527
10.6687,-9.9255,21.9445,8.378,-9.9255,22.5559,37.3094,23.6602,529
-4.7531,-10.103,5.4343,11.6953,-10.103,5.9349,44.7295,42.601,530
-0.8106,-10.2173,4.5705,6.8037,-10.2173,8.4429,49.131,48.4779,531
-1.2659,-10.1346,0.1103,0.8916,-10.1346,4.9482,30.9255,29.1295,532
-0.7526,-10.1222,1.9108,3.1363,-10.1222,6.031,29.945,28.7715,533
-4.0064,-9.9568,0.5878,4.9675,-9.9568,5.0139,31.736,30.2181,534
-1.8724,-9.9824,6.826,8.5028,-9.9824,8.4183,44.2411,42.5823,535
1.3654,-9.6673,10.5294,5.2936,-9.6673,2.8171,31.7286,21.991,536
2.471,-9.7307,15.393,8.1573,-9.7307,2.6675,33.447,26.2337,537
2.4297,-9.8466,15.0639,6.6544,-9.8466,2.0917,25.9165,22.4731,538
3.5615,-9.9692,15.7995,8.1415,-9.9692,5.6944,24.19,19.1491,539
-0.1206,-9.7471,0.9643,1.1046,-9.7471,2.286,8.0692,3.368,540
-1.059,-10.0048,1.003,1.4265,-10.0048,1.8767,7.7863,6.0067,541
-1.4395,-9.9238,0.9677,2.4703,-9.9238,1.0482,8.8282,7.6383,542
-0.1596,-9.7996,2.5621,3.1641,-9.7996,3.1929,15.2944,12.8994,543
-2.1162,-9.6792,0.7868,1.2649,-9.6792,1.3942,8.4484,7.552,544
-3.8856,-9.8404,1.1652,2.9654,-9.8404,0.9347,11.1512,10.8017,545
-0.0365,-10.0002,2.2691,2.3991,-10.0002,2.6511,14.1513,8.063,546
-1.4223,-10.0043,0.2058,0.8643,-10.0043,0.4044,7.7328,6.1264,547
0.0101,-9.9191,1.3243,1.3654,-9.9191,1.9233,12.9912,6.8912,548
-1.0959,-9.8292,2.3189,2.276,-9.8292,3.8029,14.9876,12.331,549
-0.6134,-9.9206,1.1157,1.9901,-9.9206,3.0439,13.5144,12.2826,550
2.4878,-9.7771,3.3473,0.9379,-9.7771,0.3296,9.2836,8.1674,551
0.8413,-9.7388,5.0016,3.8033,-9.7388,0.8825,16.4144,11.2974,552
-3.5331,-9.9299,1.8426,3.1102,-9.9299,2.3497,17.2503,9.9405,553
1.1396,-9.8264,3.9838,1.6837,-9.8264,1.1949,17.7844,13.5651,554
-2.2069,-9.8728,-0.665,0.9502,-9.8728,1.9879,10.6558,5.7223,555
-1.5024,-9.9076,0.4123,1.67,-9.9076,0.9647,9.569,6.7591,556
-1.6694,-9.8762,2.2518,3.963,-9.8762,4.2211,20.0929,17.504,557
-3.4478,-9.8832,5.619,10.0301,-9.8832,4.0543,25.4584,21.3443,558
-4.3037,-9.9781,0.9091,2.6369,-9.9781,3.4901,16.5912,14.5211,559
-8.3579,-9.9309,-1.8703,2.8049,-9.9309,3.4573,12.5131,5.4543,560
0.0428,-9.6622,6.0894,3.5353,-9.6622,2.2748,16.3024,13.9906,561
-13.5165,-9.8699,-2.4137,6.6219,-9.8699,6.2638,20.3226,9.7486,562
-6.7771,-9.9162,-1.1781,3.6467,-9.9162,2.2933,20.8456,18.5029,563
-2.3669,-9.9244,0.8957,2.0955,-9.9244,1.8847,8.5626,5.4738,564
-1.0893,-9.9541,1.2582,1.9738,-9.9541,2.8301,16.2606,13.8325,565
-0.162,-9.9176,5.4251,6.6858,-9.9176,1.9549,15.5499,13.957,566
-1.5084,-9.731,1.3102,1.8077,-9.731,1.0639,9.5029,8.1893,567
-1.4216,-10.0491,-0.0997,0.607,-10.0491,1.0883,5.47,5.0815,568
-0.3546,-9.7744,0.3723,0.585,-9.7744,1.8336,4.9991,3.8768,569
-1.7991,-9.7754,-0.2402,0.7264,-9.7754,1.4868,8.0875,5.5244,570
-0.6137,-9.9226,0.1759,0.5618,-9.9226,1.3348,7.8798,5.2426,571
-1.4242,-10.1496,-0.1659,0.5359,-10.1496,1.5094,9.4744,7.3086,572
-2.0079,-9.9188,0.3638,2.29,-9.9188,3.9663,20.1426,14.6141,573
-1.1979,-9.9537,0.255,0.7599,-9.9537,2.3167,13.1652,4.9333,574
-0.8499,-9.8244,0.6671,1.1188,-9.8244,0.8903,12.8899,9.1923,575
-4.0081,-9.6835,-0.8384,1.4684,-9.6835,2.7199,10.8969,4.5085,576
-1.4579,-9.8145,1.7659,2.6875,-9.8145,0.4506,15.0517,9.7906,577
-8.8229,-9.9054,-2.1609,6.689,-9.9054,1.1536,11.6421,10.2928,578
-3.8807,-9.9595,1.0194,1.9906,-9.9595,5.4362,22.2313,9.9074,579
5.6113,-9.7793,7.489,2.4033,-9.7793,1.0518,19.4968,16.3359,580
-0.5154,-9.802,2.472,1.5363,-9.802,1.3738,17.1884,14.7099,581
-0.6256,-9.8397,1.726,1.4751,-9.8397,1.6164,10.8451,8.9316,582
0.0041,-9.8774,4.4206,4.0292,-9.8774,4.7449,19.9144,14.6328,583
-2.0887,-9.9337,0.2804,1.1988,-9.9337,1.524,9.3932,5.7418,584
-2.7854,-9.7155,-0.4306,1.0151,-9.7155,1.2355,10.0744,5.9101,585
-0.5705,-10.1842,0.3188,0.8209,-10.1842,1.8464,19.4727,15.563,586
-0.7051,-10.0674,0.0265,0.527,-10.0674,1.3509,7.4468,5.8761,587
-2.2318,-9.7774,0.0462,1.5811,-9.7774,3.0018,8.0243,4.9193,589
0.1421,-9.7703,2.3898,2.2013,-9.7703,1.7851,14.2506,8.3752,590
-0.5434,-9.8327,0.0912,0.4239,-9.8327,1.0995,6.6107,5.4157,591
-0.6141,-10.1788,-0.1693,0.3264,-10.1788,0.8575,11.1576,8.5831,592
-0.2842,-9.824,1.6844,2.8461,-9.824,2.5708,8.9368,5.8259,593
-2.4452,-10.0763,-1.5488,0.496,-10.0763,1.4414,10.8049,9.7891,594
-1.5336,-10.2544,0.5922,1.5691,-10.2544,4.82,35.8635,34.1686,595
-6.7088,-10.6436,10.6957,14.3726,-10.6436,10.9928,48.8571,45.9953,596
-4.1335,-9.7822,1.0589,2.9815,-9.7822,0.9412,14.8819,13.9722,597
-4.0353,-9.4342,-0.5957,1.6738,-9.4342,1.2508,16.2319,15.3975,598
-1.3831,-9.6168,-0.3108,0.5256,-9.6168,1.013,7.0271,3.9927,599
-0.5387,-10.0262,2.739,1.9766,-10.0262,4.839,24.6312,20.5683,600
-0.6039,-9.9262,0.6245,1.1536,-9.9262,2.7948,14.748,10.3066,601
-1.8991,-9.3418,-0.1405,1.205,-9.3418,1.1076,7.6223,4.9958,602
-5.8652,-9.7914,-1.5449,2.3625,-9.7914,3.6444,8.9219,8.1008,603
-0.8227,-10.1346,0.0069,0.6835,-10.1346,1.5684,9.3188,4.9888,604
0.6377,-9.6625,11.176,8.4511,-9.6625,3.2357,30.9739,25.0001,605
-1.4216,-9.8075,0.5449,1.6636,-9.8075,1.4279,9.1361,7.8888,606
-0.39,-10.2242,0.4859,0.6147,-10.2242,0.8505,12.7319,8.7924,607
1.7754,-10.1268,4.065,1.8321,-10.1268,2.5234,20.5769,13.2032,608
-4.3351,-9.7217,0.7657,3.6264,-9.7217,2.0617,12.9749,11.5321,609
-0.8856,-10.0342,1.5159,1.8153,-10.0342,3.2442,6.4814,5.7411,610
-1.3185,-9.3173,2.8986,2.5284,-9.3173,0.8111,17.5596,8.6047,611
-0.9249,-9.7014,0.3011,1.006,-9.7014,2.7242,6.331,4.2962,612
-5.3258,-9.9623,4.155,5.1762,-9.9623,8.9512,20.3981,14.1467,613
-0.7503,-9.8761,2.5171,2.6844,-9.8761,4.532,16.0311,15.0875,614
-0.5745,-9.1912,1.2028,1.8892,-9.1912,3.3164,9.7126,5.7386,615
-4.9147,-9.3735,-0.5787,2.2948,-9.3735,4.1177,15.7502,7.313,616
-4.2453,-10.1393,5.5422,7.9831,-10.1393,2.7511,21.9272,20.11,617
-2.9013,-9.8032,4.0664,5.7206,-9.8032,4.9278,17.3142,12.9907,618
-1.2949,-10.1429,2.4334,2.9165,-10.1429,2.6034,14.0209,11.1473,619
-3.8282,-9.8195,1.6541,3.7951,-9.8195,7.0692,21.4685,17.7156,621
-3.9771,-9.929,-0.9623,2.375,-9.929,6.76,33.4892,19.4811,624
-8.1667,-9.9404,1.0984,9.1831,-9.9404,4.2845,29.6855,25.934,625
-6.4699,-10.0268,2.468,4.1282,-10.0268,7.6168,22.132,13.7276,626
-1.7448,-9.6865,0.7084,1.6175,-9.6865,1.3273,9.2249,7.8468,627
-4.5245,-9.8143,4.3434,8.3856,-9.8143,6.3713,21.4785,9.5885,628
-3.5588,-9.7395,0.1992,2.4224,-9.7395,4.2222,13.0551,9.6573,629
-8.0214,-9.8621,3.3145,7.4367,-9.8621,4.6305,19.3512,10.5727,630
-12.1369,-9.9032,2.2568,6.9156,-9.9032,8.996,28.577,15.4316,632
-9.8235,-9.9311,4.054,11.1427,-9.9311,6.5785,23.7952,19.3311,633
-2.1077,-9.8503,3.0137,4.0197,-9.8503,1.9571,14.2252,9.3852,634
-5.42,-9.9128,3.1618,6.518,-9.9128,6.6951,25.186,13.3289,636
-0.7274,-9.8411,-0.0617,0.3583,-9.8411,2.6706,13.6502,12.9355,637
-13.3495,-10.0074,0.3174,7.1513,-10.0074,0.9046,10.2933,9.7089,638
-12.4245,-9.9914,4.4742,15.4137,-9.9914,7.9585,21.5006,7.9073,639
-6.383,-9.8949,-0.1522,3.163,-9.8949,3.9879,14.1926,7.587,641
-2.9058,-9.8496,3.4402,5.6403,-9.8496,3.6341,17.5275,9.1078,642
-0.9951,-9.9344,2.4395,2.7462,-9.9344,1.9843,11.0293,8.1554,643
-1.7746,-10.0447,0.9489,1.3363,-10.0447,3.296,24.2639,11.4295,644
-9.206,-9.8531,6.6255,9.3399,-9.8531,12.2067,31.2627,21.8461,646
-46.7433,-9.8724,2.7973,15.6357,-9.8724,10.5468,27.3709,19.1329,647
-8.7958,-10.2869,-1.2766,4.3468,-10.2869,5.4721,27.56,24.1208,648
-1.4107,-9.934,1.6144,2.8391,-9.934,4.4434,11.9562,9.4902,649
-2.0562,-9.9975,-0.4746,1.1165,-9.9975,2.397,13.1208,6.6831,651
-1.9617,-9.8642,0.9183,1.4476,-9.8642,2.7512,15.4367,6.7514,652
-3.9756,-9.8254,1.2744,4.1218,-9.8254,2.153,10.6585,8.5492,653
-0.793,-9.8989,0.391,0.9411,-9.8989,2.2546,10.9028,8.163,654
-1.4354,-9.7996,1.5516,2.4513,-9.7996,4.2084,17.4907,8.451,656
-3.4743,-9.9184,2.3997,3.0034,-9.9184,4.1507,17.3473,10.3703,657
-2.4445,-9.9494,0.2925,2.6612,-9.9494,5.0896,12.6369,12.1985,658
-1.3399,-9.9823,-0.0381,0.5416,-9.9823,1.3966,5.2966,4.0228,659
-11.5572,-9.9301,5.869,11.2507,-9.9301,5.5275,22.3049,15.077,661
-15.3491,-9.9,-1.363,10.4943,-9.9,6.5052,14.3204,11.8531,662
-3.6072,-9.9334,-0.6499,2.226,-9.9334,1.1119,7.2853,5.2226,663
-6.2623,-9.7821,4.2062,6.695,-9.7821,3.4527,23.9956,8.6243,664
-1.3594,-9.8098,1.7712,2.3081,-9.8098,1.7294,13.6197,12.0322,665
-7.6745,-9.8818,1.266,3.6226,-9.8818,6.6114,19.0132,12.2724,666
-4.7733,-9.8918,1.8815,3.6375,-9.8918,6.3013,16.424,9.8898,667
-1.5991,-9.9116,0.0296,0.762,-9.9116,0.7973,6.4364,5.4502,668
2.0525,-9.8218,8.058,3.9482,-9.8218,2.0532,14.216,11.826,669
-0.9212,-9.9097,0.0572,0.763,-9.9097,0.671,8.3464,6.1728,670
-3.1583,-9.7911,-0.8012,1.0575,-9.7911,0.966,9.4081,5.9266,671
-6.9653,-9.77,-1.6578,3.058,-9.77,5.1885,20.5315,14.3392,672
-2.8787,-10.0934,0.6357,1.8431,-10.0934,3.8362,12.0761,8.8814,673
-1.2483,-9.8614,1.7815,2.1827,-9.8614,4.3501,19.0635,11.1754,676
-9.6283,-9.8592,2.804,5.5855,-9.8592,7.635,20.5856,10.2212,677
-3.6844,-9.8973,3.1378,4.314,-9.8973,8.0533,17.1617,12.0316,678
-1.1416,-9.8435,0.0022,0.3777,-9.8435,2.3412,11.9218,9.8382,679
-20.9636,-9.8643,-5.6712,7.9493,-9.8643,2.5693,14.2121,10.8196,680
-6.001,-9.7652,5.0815,9.8591,-9.7652,6.4249,21.0766,16.5691,681
-20.3541,-10.0309,23.5208,39.2865,-10.0309,10.7151,34.8918,28.8131,682
-8.2333,-9.7244,1.6655,3.9235,-9.7244,3.5985,20.0167,8.0033,683
-3.0789,-9.8144,2.5235,4.5687,-9.8144,3.0421,12.5332,7.8028,684
-7.4985,-9.9297,3.4107,6.6798,-9.9297,5.8771,16.2391,9.8143,685
-2.6435,-9.8494,1.5746,2.2392,-9.8494,4.3551,19.7958,8.4712,686
-5.5415,-9.8996,4.9545,9.7433,-9.8996,9.375,19.4816,17.5191,687
-0.6723,-9.9731,5.7816,4.666,-9.9731,2.2676,16.7474,15.3671,688
-1.555,-9.8557,3.6259,6.7805,-9.8557,6.4267,20.7115,17.0162,689
-3.9053,-9.9147,1.0624,3.8207,-9.9147,2.185,12.5849,11.2089,691
-6.8856,-9.8863,1.7885,3.9526,-9.8863,5.6448,16.686,8.6792,692
-19.0135,-9.9173,10.956,28.2747,-9.9173,13.1469,40.1955,27.2625,693
-6.5757,-9.9492,1.7413,5.053,-9.9492,7.6228,33.6449,27.2369,694
-5.1483,-9.9166,2.1657,4.8228,-9.9166,6.4833,33.5594,14.3005,696
-3.7809,-9.8574,0.4073,2.1095,-9.8574,3.6174,14.8781,6.3152,697
-4.9016,-9.8717,2.2543,3.9096,-9.8717,4.4238,16.9724,9.0436,698
-1.7939,-9.7906,2.2028,4.7714,-9.7906,5.2448,14.555,7.7082,699
-0.5419,-9.8864,0.4144,0.4326,-9.8864,1.5018,7.8548,4.1061,701
-2.9329,-9.9188,-0.0188,1.4512,-9.9188,1.8028,13.587,7.8809,702
-0.5223,-9.9015,0.8765,1.1496,-9.9015,3.7741,12.905,7.9709,703
-0.6336,-9.8952,0.4528,0.5687,-9.8952,2.2191,8.3392,4.4877,704
0.0937,-9.8925,0.56,0.318,-9.8925,0.3427,6.3285,4.1548,706
-2.4319,-9.9209,1.8256,1.8891,-9.9209,5.2947,16.4056,8.0573,707
-1.5995,-10.0653,4.3623,3.6137,-10.0653,2.0337,13.4124,11.9656,708
-3.0412,-10.0523,1.7915,5.5959,-10.0523,4.6244,10.6043,6.6646,709
-1.6305,-10.0774,2.0818,2.8456,-10.0774,6.4266,20.545,9.5239,711
-5.7995,-9.7507,1.0514,4.9137,-9.7507,4.6717,17.4873,10.3,712
-0.0202,-9.241,1.68,1.6873,-9.241,2.9719,9.8049,8.2528,713
-1.4497,-9.6771,-0.0901,0.6517,-9.6771,2.6739,10.9727,6.8873,714
-0.9027,-10.0359,2.4512,3.6285,-10.0359,3.8682,12.8079,10.7547,715
-2.1204,-9.8529,6.0939,8.4147,-9.8529,5.2284,15.4272,11.8004,716
-1.5739,-9.8545,1.5203,2.3409,-9.8545,6.1727,13.7866,9.6609,717
-7.1054,-9.8248,0.596,3.7602,-9.8248,2.901,9.7051,8.5076,718
-2.4834,-9.8089,0.3476,1.101,-9.8089,1.9434,7.6187,4.4629,719
-2.8184,-9.8587,1.8557,4.4613,-9.8587,4.4094,13.6421,11.1125,720
-9.7182,-9.8495,1.2118,3.3136,-9.8495,6.6093,16.848,10.0725,722
-2.088,-9.7225,-0.3245,0.7578,-9.7225,1.9017,7.6713,4.3998,723
-2.69,-9.8034,0.6962,1.9271,-9.8034,1.6974,9.2408,6.9637,724
-4.7994,-9.8177,0.3105,2.1195,-9.8177,3.8051,12.6005,9.0525,726
-3.4803,-9.6696,-0.4612,1.7781,-9.6696,3.3403,11.4625,7.5895,727
-18.5548,-9.9847,-5.6141,6.193,-9.9847,4.3508,24.7773,13.9351,728
-2.1844,-9.7039,0.5651,1.3927,-9.7039,2.816,14.3708,4.6078,729
-8.8425,-9.7732,1.8119,6.6175,-9.7732,3.6953,14.1208,9.6403,731
-6.6044,-9.9189,0.2479,2.7548,-9.9189,4.6896,12.7832,9.2954,732
-4.1307,-9.6969,1.3956,3.4818,-9.6969,4.9128,14.2455,9.4409,733
-6.6829,-9.9496,1.2681,4.1008,-9.9496,5.5245,18.9423,10.2956,734
-13.1693,-9.8992,-0.7799,6.9441,-9.8992,7.0287,25.8246,10.1396,735
-7.2537,-9.8138,0.3041,5.2258,-9.8138,1.9478,11.4702,8.455,736
-2.9163,-10.1148,0.5139,2.5825,-10.1148,5.9084,18.468,14.5756,737
0.0983,-9.5972,5.5523,3.9294,-9.5972,6.3296,24.7229,19.074,738
-1.7905,-9.478,0.4293,1.342,-9.478,2.2933,20.0376,9.2156,739
-4.5124,-9.551,0.006,2.1463,-9.551,1.0679,10.9272,8.4248,740
-4.9244,-9.6954,1.6974,6.6602,-9.6954,5.1063,14.1308,11.3037,741
-0.9503,-9.995,1.6385,1.8733,-9.995,4.4476,15.1574,8.281,742
-1.3601,-9.9179,2.1572,2.229,-9.9179,6.3212,16.7117,9.8174,743
-2.356,-9.8114,0.7062,1.253,-9.8114,3.6122,10.7806,6.4939,744
-0.7631,-9.9587,0.3888,0.6412,-9.9587,3.6999,10.0813,6.2981,745
-2.8274,-9.6642,0.3435,2.0292,-9.6642,1.0956,9.7169,7.1252,746
-1.611,-9.9017,-0.2346,0.8793,-9.9017,3.2368,13.4961,11.089,747
-4.2174,-9.9938,0.8376,2.7627,-9.9938,3.2903,11.7658,8.3392,748
-3.1077,-10.0145,1.4227,2.8376,-10.0145,4.9533,12.9678,8.3366,749
-0.8213,-9.7514,0.6263,1.4198,-9.7514,0.9869,8.0235,4.6094,750
-1.5519,-9.7305,2.3985,2.1869,-9.7305,1.324,9.4721,7.334,751
-2.5424,-9.9605,0.7085,2.6382,-9.9605,3.8179,15.1624,9.2419,752
-1.1463,-9.8275,1.602,3.5696,-9.8275,2.6491,14.2219,7.2047,753
-8.9324,-9.7498,2.4415,5.9418,-9.7498,3.6879,18.7148,15.2811,754
-6.074,-9.8468,1.8645,5.5868,-9.8468,4.0519,14.3113,9.1558,755
-0.2108,-9.9697,4.0525,3.3354,-9.9697,1.891,12.6162,9.2351,756
-2.3822,-10.0707,1.2902,2.951,-10.0707,1.9579,11.076,7.9369,757
-3.9609,-9.9036,0.974,3.4155,-9.9036,5.0762,12.5252,9.0159,758
-3.0866,-9.899,1.2462,2.354,-9.899,3.9782,10.0502,6.7806,759
-0.6884,-9.701,0.5203,0.7843,-9.701,2.0027,13.679,6.2176,760
-7.3892,-9.8464,1.8609,5.0649,-9.8464,6.084,16.3703,12.4619,761
-2.1996,-9.7178,0.8309,1.6927,-9.7178,2.7364,17.1512,7.4029,762
-9.2327,-9.9718,0.138,5.9347,-9.9718,2.7464,18.4935,16.8593,763
-12.7634,-9.7825,4.9225,8.2633,-9.7825,3.3779,23.399,16.4715,764
-3.1108,-10.3699,-0.6952,1.3312,-10.3699,3.5739,37.6351,28.9628,765
-5.0652,-9.9841,-0.1847,3.2231,-9.9841,2.5958,12.2222,10.1599,766
-2.1554,-9.9901,2.7156,3.6519,-9.9901,3.9661,19.1434,11.7543,768
-1.2219,-10.0739,3.1018,3.6101,-10.0739,5.4335,20.2411,10.28,769
-0.0555,-9.7516,4.1416,3.8604,-9.7516,4.9974,21.438,20.9495,770
-7.7114,-9.9022,1.2033,3.9384,-9.9022,3.6683,17.4337,9.2109,771
-6.0615,-9.8418,1.2116,3.9222,-9.8418,3.3284,27.2494,9.4407,772
-1.766,-9.8356,7.0346,7.2399,-9.8356,3.1891,20.0518,16.9534,773
-3.7885,-10.0407,3.045,3.622,-10.0407,4.6872,23.5832,14.8033,774
-4.5733,-9.8094,1.5513,2.3733,-9.8094,4.4213,11.4673,7.1549,775
-1.4229,-9.9221,1.0639,1.9623,-9.9221,4.6767,13.3834,6.9542,776
-1.1496,-9.5773,1.1632,1.7896,-9.5773,0.8005,9.5238,6.444,777
-2.7124,-9.8063,0.2096,1.8858,-9.8063,1.629,11.1394,7.1361,778
-4.4003,-9.9592,1.7002,4.8328,-9.9592,4.9757,18.7549,14.5017,779
-7.542,-9.9426,0.9158,5.8978,-9.9426,3.685,14.1198,12.7064,780
-2.9258,-9.7455,0.6406,1.8724,-9.7455,4.3201,13.966,9.8511,781
-3.7438,-9.629,1.2502,2.9665,-9.629,4.3112,17.9438,9.7659,782
-4.7095,-9.8766,1.6411,4.058,-9.8766,2.5151,15.2468,10.5757,783
-1.8702,-9.952,-0.0923,0.9836,-9.952,2.102,11.3367,4.2254,784
-0.3734,-9.9489,0.4836,0.7374,-9.9489,2.1952,10.3415,5.432,786
-0.915,-9.871,0.1302,0.6637,-9.871,1.7502,14.6479,9.5844,787
-0.3422,-9.7791,0.0374,0.2015,-9.7791,1.4808,5.3317,3.3421,788
-4.4731,-9.966,-0.691,1.4334,-9.966,3.214,23.533,16.8433,789
-2.4094,-9.8769,0.8576,2.5393,-9.8769,2.1866,15.7179,13.7438,791
-0.1794,-9.979,1.5497,1.2439,-9.979,4.4919,9.1949,7.332,792
-2.5145,-9.9248,1.7369,4.1654,-9.9248,1.3959,18.7849,16.9582,793
-1.0779,-9.8129,0.026,0.4783,-9.8129,1.1184,8.5433,3.275,794
-9.739,-9.4746,0.0033,6.0999,-9.4746,1.6213,15.2844,10.0775,795
-9.6947,-9.8219,6.5613,13.2022,-9.8219,10.5262,34.3423,28.7685,796
-3.3567,-10.0343,8.402,9.4259,-10.0343,8.1451,33.6985,29.1164,797
-2.5461,-10.1336,11.3409,10.3815,-10.1336,3.4947,27.3442,12.5818,798
-0.066,-9.7633,1.1314,1.0339,-9.7633,1.8514,7.7145,6.2826,799
-2.2282,-9.7508,0.821,2.6618,-9.7508,3.9484,12.4135,6.5611,801
-0.1659,-10.1166,0.0075,0.1168,-10.1166,0.8952,8.274,2.8781,802
-7.974,-10.0549,1.1729,4.63,-10.0549,3.9973,20.0793,7.4721,804
-4.7402,-9.6752,-0.292,1.4815,-9.6752,3.5834,13.048,5.3997,806
-1.3933,-9.9721,-0.3691,0.6159,-9.9721,1.0459,9.0261,6.3389,807
-1.0585,-9.8281,-0.2581,0.4595,-9.8281,1.1092,8.3964,6.1595,808
-5.4786,-10.0338,-0.7226,2.4216,-10.0338,2.062,10.0344,8.4586,809
-3.6392,-9.6796,4.0314,4.152,-9.6796,6.6417,16.3241,11.5663,811
-18.3581,-9.9558,0.596,5.9397,-9.9558,6.1938,32.8925,10.5578,812
-0.6173,-9.9251,4.336,3.6378,-9.9251,1.8039,8.7414,7.8597,813
-1.5889,-9.7365,1.4325,1.7039,-9.7365,2.2635,25.6004,9.8784,814
-11.2105,-10.0005,3.9757,9.2803,-10.0005,8.0673,42.7017,27.1213,816
-0.5485,-9.6779,0.1588,0.5686,-9.6779,2.2919,29.2056,23.717,817
-0.8617,-10.2516,10.5093,8.0882,-10.2516,6.9535,45.1915,33.8498,818
-4.4907,-9.9318,-0.8882,1.7426,-9.9318,1.1978,12.2896,10.0218,819
-1.1299,-9.9484,1.3081,2.3048,-9.9484,3.4394,14.7375,7.0402,821
-0.8809,-9.4013,0.5264,1.2382,-9.4013,1.2457,11.9637,3.6706,822
-3.797,-9.9603,-0.2447,2.0743,-9.9603,1.1687,15.7206,12.0626,823
-3.8685,-9.8397,-0.2385,1.4496,-9.8397,2.6115,13.1991,8.045,824
-12.7751,-9.806,2.9718,6.8212,-9.806,7.8257,19.6213,15.0057,826
-22.8103,-9.9541,-0.4145,8.3386,-9.9541,5.4241,30.9798,23.5084,827
7.5969,-9.9615,13.9941,7.6787,-9.9615,4.1829,29.924,22.86,828
-2.5353,-9.8734,-0.1669,0.9137,-9.8734,1.7549,11.4805,7.7281,829
-19.9399,-9.979,8.8781,11.6211,-9.979,5.9287,27.6994,16.8287,831
-41.1643,-9.9285,-8.8736,22.8188,-9.9285,5.4199,25.807,15.3763,832
-27.768,-9.9684,-7.3647,9.7561,-9.9684,4.7785,27.3717,17.8958,833
-3.2098,-9.9639,3.1491,3.8384,-9.9639,3.208,24.3601,13.1855,834
-6.204,-9.9736,10.8187,11.1988,-9.9736,3.9368,26.0653,20.6699,836
-15.3965,-9.9028,5.7228,8.417,-9.9028,7.7605,35.6032,24.5167,837
0.1307,-10.1798,9.529,6.2051,-10.1798,2.205,30.4008,27.0464,838
-3.8331,-10.0998,7.6109,8.3899,-10.0998,1.6692,29.2443,24.0022,839
-2.1764,-9.7109,5.4112,5.7078,-9.7109,6.0047,24.3493,20.6295,841
-2.4459,-10.1915,1.1711,1.9328,-10.1915,2.9238,24.5478,12.7635,842
-2.3309,-9.7297,1.8402,2.7757,-9.7297,0.9482,14.9166,9.2806,843
-1.8187,-9.878,0.7413,1.4924,-9.878,4.4241,14.8611,6.693,844
-4.0069,-10.1072,2.6006,4.5576,-10.1072,2.8949,20.8269,18.3866,846
-4.594,-9.8072,0.8957,2.6302,-9.8072,4.0435,13.8115,8.189,847
-1.5313,-10.1923,3.6702,3.5824,-10.1923,1.4291,15.3651,11.4484,848
-2.9153,-9.9187,1.6926,3.9822,-9.9187,3.0222,14.6063,12.0862,849
-1.2848,-10.2238,1.3645,1.4308,-10.2238,0.6559,15.9665,11.5883,851
-7.8646,-9.7684,1.1635,3.1412,-9.7684,7.5828,20.873,10.6544,852
-1.0491,-9.9012,1.073,1.9539,-9.9012,2.8593,12.0499,9.2559,853
-7.0215,-10.1647,-0.2822,1.9673,-10.1647,2.8895,10.8931,4.2019,854
-2.0831,-9.6649,3.8663,5.9379,-9.6649,2.8951,18.2148,14.6875,855
-4.8104,-9.9039,11.3305,14.2629,-9.9039,8.7239,30.6615,27.6375,856
-1.5344,-10.054,-0.1741,0.7566,-10.054,1.3939,27.9274,19.8518,857
-1.1663,-10.4277,1.8347,1.9037,-10.4277,2.4597,25.6665,21.7982,858
-5.1086,-9.8496,3.7709,6.7003,-9.8496,8.6664,36.178,28.9509,859
-16.4387,-9.6169,-1.4263,4.5691,-9.6169,3.9437,14.6116,8.2271,861
-2.5372,-9.9349,14.9421,24.8102,-9.9349,10.2441,46.3438,22.9012,862
-5.4567,-9.3478,4.6596,8.2858,-9.3478,4.4043,24.987,13.5834,863
-3.8332,-9.8966,0.3823,2.5683,-9.8966,2.8272,10.4151,7.7581,864
-6.5168,-9.7864,-0.0587,3.5554,-9.7864,6.3286,20.7695,8.4276,866
-4.1009,-9.9261,-0.9008,1.6437,-9.9261,2.434,12.0823,7.7095,867
-1.5208,-9.7788,1.4637,4.0787,-9.7788,3.2704,13.4155,8.6175,868
-1.8766,-9.8615,1.034,2.2214,-9.8615,3.1575,14.5925,10.2498,869
-8.177,-9.7903,-0.521,2.5237,-9.7903,3.8799,14.0915,6.8094,871
-5.7961,-9.8989,-0.3554,1.9783,-9.8989,3.1468,11.8509,5.5141,872
-7.7858,-9.7512,-1.2259,2.8266,-9.7512,2.9155,9.6228,7.1164,873
-12.0236,-9.7573,-1.6342,6.4996,-9.7573,2.6123,16.4359,11.8572,874
-4.4855,-9.7226,1.134,3.5129,-9.7226,5.8259,23.1258,8.3488,876
-10.5047,-9.946,1.7168,4.0374,-9.946,5.48,19.7256,14.6223,877
-2.8871,-9.3161,5.5319,7.0311,-9.3161,4.8032,24.1118,21.9649,878
-0.6236,-9.8485,1.5901,2.9638,-9.8485,3.3069,15.4658,10.4954,879
-3.1705,-9.8597,0.7144,2.0847,-9.8597,1.8894,9.1848,5.7351,880
-3.3919,-9.8633,0.4762,2.0762,-9.8633,2.7426,11.3305,9.0775,881
-1.0524,-9.8889,-0.0425,0.5165,-9.8889,1.4819,9.4529,5.3858,882
-0.3971,-9.9943,-0.0085,0.1766,-9.9943,0.964,8.2296,6.8352,883
-4.5511,-9.9058,2.0133,3.6259,-9.9058,1.5254,13.862,10.6148,884
-3.2778,-9.8844,-0.2244,1.7766,-9.8844,1.9177,22.0283,19.582,885
-6.0601,-9.9634,0.1389,3.1409,-9.9634,3.2487,16.1964,13.2314,886
-2.2372,-9.9595,-0.2503,0.8955,-9.9595,0.7385,8.5235,4.3927,887
-0.9185,-9.6201,-0.0604,0.4387,-9.6201,0.6984,5.5688,4.7493,888
-3.9046,-9.9557,2.3074,4.519,-9.9557,5.8682,21.932,10.1393,889
0.1689,-10.0844,2.0098,2.1153,-10.0844,2.1178,9.983,7.0565,890
-2.2223,-10.0419,0.0104,1.4424,-10.0419,1.5636,11.4754,8.616,891
-1.2221,-9.9377,12.936,17.3178,-9.9377,2.6416,22.9656,22.3076,892
-1.5771,-9.6326,1.3759,1.5263,-9.6326,0.7306,10.6658,7.1058,893
0.0416,-10.1534,2.8847,1.5561,-10.1534,2.3609,19.1343,12.0919,894
-1.606,-10.1126,1.156,1.6115,-10.1126,4.0027,22.7606,18.2192,895
-1.1894,-9.7043,1.5964,2.0901,-9.7043,5.5023,14.88,10.4762,896
-0.752,-9.9232,0.0789,0.4753,-9.9232,1.3534,4.5337,3.0678,897
-1.09,-9.7581,0.8081,1.7124,-9.7581,3.6435,15.9657,5.0857,899
-0.6063,-10.0371,0.8958,1.4635,-10.0371,2.3533,14.6818,5.987,900
-3.1288,-9.5663,0.2853,1.8261,-9.5663,1.239,11.4079,7.9694,901
-11.2447,-9.8993,2.2232,6.7409,-9.8993,4.5789,17.7906,14.1737,903
-1.1879,-10.5419,0.1849,1.4937,-10.5419,2.5358,9.2351,5.727,904
-1.4791,-10.1258,-0.3576,0.5127,-10.1258,1.162,8.2124,6.7416,905
-1.1185,-9.2648,-0.0351,0.7064,-9.2648,1.1605,11.4991,10.494,906
-8.853,-9.8648,6.0632,12.2811,-9.8648,3.7051,19.5348,15.6244,907
-13.3734,-9.8324,0.1738,4.1211,-9.8324,4.7988,15.1526,7.2303,908
-8.5415,-9.7257,0.0664,3.2825,-9.7257,1.5175,11.4576,6.5192,909
-5.6851,-9.7162,3.1775,6.0796,-9.7162,7.4328,17.3812,13.2752,911
-2.5125,-10.3807,-0.1114,1.3765,-10.3807,1.9024,16.1933,12.7155,912
-1.1128,-10.291,3.5127,6.0931,-10.291,5.304,16.6889,14.4589,913
-4.5933,-9.9517,1.1516,4.5893,-9.9517,2.8343,14.8569,10.4719,914
-0.7879,-9.6496,4.1609,4.4359,-9.6496,4.0318,12.9663,10.698,915
-1.2139,-9.6701,-0.3984,0.4609,-9.6701,2.1424,10.0044,5.271,916
-1.2926,-9.8532,-0.0115,0.672,-9.8532,1.6395,4.616,2.8114,917
-0.0387,-9.9744,8.4653,5.3668,-9.9744,2.0973,19.1827,12.1958,918
-3.6337,-9.4838,3.3755,6.7558,-9.4838,5.1471,28.6753,11.2221,919
-0.7863,-9.5645,0.6392,0.7867,-9.5645,1.1416,12.1356,8.3697,920
-0.8164,-9.1496,-0.0496,0.3402,-9.1496,1.335,21.6271,8.3396,921
-3.1273,-9.8479,2.2951,4.8471,-9.8479,1.4159,12.658,10.011,922
-1.7668,-9.8203,2.0477,3.4167,-9.8203,2.0467,10.2121,9.1545,923
-3.3086,-9.8712,0.3614,2.253,-9.8712,2.7214,16.6238,9.0504,924
-1.9417,-9.8662,1.0018,2.1982,-9.8662,4.0697,12.2095,7.9064,926
-2.0903,-9.8509,1.1545,1.634,-9.8509,3.9336,14.4814,8.5716,927
-0.6842,-10.5422,3.0955,1.9131,-10.5422,1.6771,12.7385,11.0393,928
-1.7937,-9.9319,1.9519,2.2954,-9.9319,5.0643,17.1534,9.0784,930
-2.7049,-9.7415,0.085,1.1273,-9.7415,2.7658,13.1564,7.9428,931
-1.3801,-9.8156,0.2305,1.1767,-9.8156,2.7672,10.1471,6.0324,932
1.018,-9.919,7.0599,4.9125,-9.919,1.2859,14.2479,11.9862,933
-3.6877,-9.8957,0.0181,2.071,-9.8957,3.0371,10.3868,7.2025,934
-3.151,-9.9815,1.497,4.3528,-9.9815,1.3195,10.6196,6.1571,935
-3.6199,-9.5685,-0.6437,2.3841,-9.5685,0.4648,14.7228,10.4276,936
-8.1792,-9.7672,1.7896,4.8005,-9.7672,3.2393,20.2351,8.871,937
-3.2236,-9.4524,0.4864,2.3274,-9.4524,1.1311,10.2089,7.2661,938
-4.0131,-9.8036,0.4053,2.2483,-9.8036,2.5573,13.9487,9.3761,939
-1.5965,-10.0859,-0.4765,0.8173,-10.0859,1.426,10.4307,7.5981,940
-11.0667,-9.7635,3.7345,6.7177,-9.7635,9.4922,26.9909,17.3675,942
-1.6067,-10.1016,5.1477,4.3941,-10.1016,6.6602,29.0508,26.3323,943
-3.8326,-9.8016,2.1291,4.1163,-9.8016,4.1968,28.3146,15.4031,944
-4.067,-10.2595,-0.3925,2.3972,-10.2595,1.8177,13.8274,7.9783,946
-11.4946,-9.8735,5.8848,10.5018,-9.8735,8.8857,24.5719,21.7543,947
-7.7579,-10.0179,-0.3024,3.7134,-10.0179,4.6223,16.3376,13.883,948
-1.7117,-9.8532,0.1883,0.9237,-9.8532,0.9348,14.4288,7.2624,949
-2.2498,-9.8788,1.6512,3.5145,-9.8788,5.2566,23.8563,11.6384,951
-0.4913,-10.0779,1.5815,2.2488,-10.0779,1.8478,16.8774,10.3986,952
-2.7645,-10.1541,-0.1474,1.4568,-10.1541,0.9233,7.8395,6.0385,953
-7.3809,-9.9357,4.4802,6.4488,-9.9357,4.0633,24.9302,20.5914,954
-3.1088,-9.7017,4.5242,6.8715,-9.7017,8.202,22.0916,16.8716,955
-1.2258,-9.8285,1.2583,2.4506,-9.8285,3.6153,17.1365,6.1069,956
-0.9779,-9.7197,0.156,0.9237,-9.7197,1.7046,8.1173,4.0332,957
-1.0052,-9.9296,0.1448,0.8255,-9.9296,1.7589,6.4073,4.1806,958
-0.768,-9.4257,1.1486,1.2825,-9.4257,1.5401,10.641,6.7439,959
-4.1327,-9.9134,0.8143,2.6295,-9.9134,1.2082,11.6995,9.8579,960
-6.4732,-9.9699,-0.4328,2.8262,-9.9699,3.0406,12.2021,5.9578,961
-2.5328,-9.4062,0.8952,2.4968,-9.4062,2.7194,10.2741,5.6946,962
-0.7764,-9.3338,0.2366,0.5974,-9.3338,2.2602,12.3292,9.2719,963
0.1676,-10.0276,3.4923,3.0107,-10.0276,0.5543,14.968,11.2925,964
-1.4812,-9.6593,0.0695,0.8976,-9.6593,1.6083,10.2681,4.2141,965
-1.6536,-9.9406,-0.4378,0.7373,-9.9406,2.2221,9.5911,6.0617,966
-4.3477,-9.8412,-1.0784,2.1295,-9.8412,1.1811,12.1379,7.6212,967
-2.7855,-9.4875,0.5818,2.4594,-9.4875,1.3976,14.8288,7.7337,968
-2.3923,-10.0315,0.3126,2.8797,-10.0315,1.5639,11.4215,9.2614,969
-0.2361,-10.61,3.8552,2.9569,-10.61,6.2976,19.9125,13.0672,970
-0.7496,-9.9033,0.1207,1.0665,-9.9033,1.4055,14.9056,3.0234,971
-1.9037,-10.2198,-0.0647,1.0885,-10.2198,1.9071,9.3054,5.1121,972
-2.3471,-9.3885,3.2487,4.1127,-9.3885,2.5888,19.8059,16.2373,973
-1.7457,-9.2172,0.9257,1.6148,-9.2172,2.2389,11.5556,8.4883,974
-1.834,-9.906,1.1613,2.5054,-9.906,4.5388,11.9575,10.0534,975
-4.8469,-9.8872,1.7241,3.0384,-9.8872,3.0692,15.0952,11.8388,976
-0.7059,-9.6042,1.4298,1.9354,-9.6042,2.4663,9.4411,7.0259,977
-0.673,-9.6236,0.7661,0.9407,-9.6236,2.3764,8.859,5.8754,978
-2.217,-9.9444,1.4395,2.9166,-9.9444,3.5289,11.3422,8.8666,979
-2.1184,-9.8447,2.7613,2.8979,-9.8447,4.5494,17.6718,11.7179,980
-3.0422,-9.6403,0.6027,2.2769,-9.6403,2.6742,18.5643,7.8904,981
-4.2569,-10.2926,-0.6915,1.8249,-10.2926,1.4963,7.9888,6.0007,982
-3.0615,-9.2634,4.5444,6.8619,-9.2634,3.9387,15.6213,13.313,983
-0.1062,-10.1645,2.7493,2.8358,-10.1645,3.9732,14.6415,11.7634,984
-2.6839,-9.5556,3.619,4.1522,-9.5556,4.9012,21.0186,12.0818,985
-7.7871,-9.5954,2.0532,4.1922,-9.5954,6.8376,17.751,11.879,986
-4.0848,-9.8568,-0.9374,1.5798,-9.8568,1.7568,11.7471,3.9924,987
-1.0569,-9.2798,-0.0538,0.8097,-9.2798,2.1523,8.01,3.9007,988
-10.5323,-9.823,-0.0483,5.9861,-9.823,6.834,24.4126,10.1361,989
-3.5039,-10.2755,0.5186,2.2811,-10.2755,1.8051,9.1939,6.5886,990
-2.307,-10.1424,0.6462,1.9616,-10.1424,2.8792,17.737,12.329,991
-0.3792,-9.4564,9.9835,10.9322,-9.4564,7.1399,22.6241,16.6658,992
-4.1629,-10.3986,0.234,2.6596,-10.3986,1.5475,20.1502,14.1438,993
-2.8092,-9.4749,0.4377,3.2877,-9.4749,5.0109,22.7375,18.5485,994
-7.972,-10.0216,-1.6491,3.3472,-10.0216,3.9878,18.2089,12.5062,995
-10.0989,-9.2859,-0.6567,5.2379,-9.2859,4.108,14.9955,12.2167,996
-3.4435,-9.4426,10.7891,12.6683,-9.4426,5.2083,17.7245,14.0318,997
-0.1262,-9.1352,1.0143,1.4225,-9.1352,1.9428,13.2542,6.6208,998
-5.9515,-9.7204,0.0364,2.7408,-9.7204,3.1724,8.6096,6.5152,999
-1.504,-9.8402,-0.1887,0.8562,-9.8402,2.1717,6.2904,4.5306,1000
-2.438,-9.8873,1.0187,2.4479,-9.8873,4.662,17.4799,14.9595,1001
-0.7004,-9.8131,0.037,0.5342,-9.8131,1.4847,10.275,5.658,1002
-2.9194,-9.8722,2.2373,3.3532,-9.8722,0.5177,12.3864,10.5633,1003
-0.6872,-9.7333,0.3047,0.8342,-9.7333,0.9634,15.8449,12.7331,1004
-0.4926,-9.8883,0.078,0.3459,-9.8883,0.8089,6.1919,3.9152,1005
-3.3899,-9.9846,0.2029,1.2258,-9.9846,1.3555,10.5104,6.2261,1007
2.8227,-10.0652,7.5542,4.3675,-10.0652,1.3001,22.096,16.2565,1008
-1.9676,-9.9548,0.1276,1.5233,-9.9548,2.803,14.9399,7.4631,1009
-1.3668,-10.0219,0.1369,0.903,-10.0219,0.7609,12.6545,8.3084,1010
-1.542,-9.8768,0.7037,1.7165,-9.8768,2.3241,14.0381,7.5971,1011
-12.3651,-9.8714,1.3518,7.0043,-9.8714,7.3306,35.6648,19.9844,1012
-1.9812,-9.8567,0.8847,1.9431,-9.8567,3.056,20.4533,12.5879,1013
-3.9963,-9.9042,3.1302,5.0279,-9.9042,6.2514,25.165,18.9066,1014
-4.8675,-9.8448,0.6965,2.444,-9.8448,3.1999,19.0567,5.3981,1015
-2.3376,-9.8417,-0.0696,1.4806,-9.8417,1.9908,13.1599,5.9673,1016
-8.5251,-9.9224,2.9216,5.4842,-9.9224,3.8103,20.9226,10.4145,1017
-8.2833,-9.9154,1.4072,5.4891,-9.9154,4.2373,22.116,9.7571,1018
-9.2384,-9.8521,-1.5941,3.755,-9.8521,9.2214,20.7599,11.5014,1019
-8.6353,-9.8162,3.5447,6.542,-9.8162,7.8683,22.1652,12.7923,1020
-6.364,-9.4108,0.0296,2.542,-9.4108,3.1803,22.7663,7.8061,1021
-20.3465,-9.8078,1.1619,8.1286,-9.8078,7.6381,16.3426,14.6458,1022
-2.4245,-9.7979,-0.4898,1.7051,-9.7979,1.9912,10.5629,4.4815,1023
-10.0116,-9.7495,-2.1783,3.0301,-9.7495,4.3209,16.6622,9.5489,1024
-3.6683,-9.8149,0.5669,1.9854,-9.8149,4.5562,20.9699,12.9382,1025
-2.3805,-9.9681,2.0729,3.6645,-9.9681,4.5463,20.2617,19.259,1027
-9.7686,-9.9469,5.7401,9.4772,-9.9469,11.3815,33.956,23.4934,1028
-4.2555,-9.7768,1.0071,4.003,-9.7768,1.1051,23.1943,17.6675,1029
-4.2946,-9.9594,13.4408,16.0103,-9.9594,8.797,55.7913,51.7189,1030
-4.6478,-9.9286,-0.7244,2.8605,-9.9286,6.0796,40.2741,35.6784,1031
0.6155,-10.1727,4.7749,3.3927,-10.1727,4.4352,33.9347,27.235,1032
13.1434,-10.0642,26.2,12.4564,-10.0642,7.6643,41.0481,30.6753,1033
2.694,-9.8201,9.1588,4.9044,-9.8201,4.0979,24.8206,14.2953,1034
-8.981,-10.0773,1.2615,10.5965,-10.0773,10.0243,37.8801,34.2936,1035
9.0724,-9.9973,17.3187,7.3709,-9.9973,5.3513,35.2703,29.7161,1037
-5.6844,-9.8178,4.2191,6.8287,-9.8178,9.8723,31.9245,15.3528,1038
-3.201,-9.9607,11.0614,7.8362,-9.9607,1.6342,26.7586,19.7102,1039
-2.6911,-9.9608,-0.0414,2.0048,-9.9608,3.0853,11.1263,7.3793,1040
-12.9054,-9.672,-0.2817,7.21,-9.672,4.373,16.9506,10.1669,1041
-6.2328,-9.5296,-2.9106,2.3864,-9.5296,1.7567,17.1365,15.5288,1042
5.4363,-10.0128,10.0532,3.9281,-10.0128,1.3869,22.9762,17.9356,1043
-2.2937,-9.8434,-0.6405,1.2619,-9.8434,1.2861,6.3174,3.6414,1044
-5.3103,-9.8206,5.0065,6.044,-9.8206,6.0664,18.8378,10.5145,1045
-3.4116,-9.8641,4.9811,8.7558,-9.8641,7.1425,42.8299,12.4442,1047
-105.9315,-8.722,-5.2701,31.3679,-8.722,7.0302,32.2408,18.423,1048
0.8998,-9.9053,18.4655,10.6911,-9.9053,3.9828,40.9084,25.7456,1049
1.7714,-9.5413,6.0248,3.1418,-9.5413,2.3783,18.6922,15.49,1050
-6.3569,-9.8195,3.733,10.4976,-9.8195,5.1755,22.2611,13.8125,1051
-2.3469,-10.0334,-0.596,1.0052,-10.0334,1.7068,9.4583,6.5254,1052
-10.6971,-9.9298,-3.9471,6.4079,-9.9298,5.2176,27.7029,16.2657,1053
-125.3284,-10.2182,4.5445,109.1233,-10.2182,8.3951,50.364,37.1439,1054
-87.7975,-9.9691,-6.8408,38.631,-9.9691,10.4332,23.1224,13.1214,1055
-38.9673,-9.5078,5.8636,28.3014,-9.5078,12.0665,26.12,18.8363,1056
-91.6058,-10.0164,-17.7199,47.3116,-10.0164,14.7888,34.5786,23.5235,1057
-169.1567,-9.5783,-10.5528,36.9409,-9.5783,8.9663,33.5071,16.4024,1058
-122.2261,-8.8588,-14.253,51.2153,-8.8588,21.8544,41.3759,26.6655,1059
-150.4142,-9.3381,-6.9226,84.3634,-9.3381,11.8582,52.0231,29.2628,1060
-174.437,-9.9663,-32.336,75.5992,-9.9663,20.0213,33.8564,24.897,1061
-50.3321,-9.5816,-17.4334,21.5529,-9.5816,6.2499,20.3522,10.0819,1062
-38.3419,-9.2692,-12.5157,17.5107,-9.2692,5.4094,23.5972,14.9183,1063
-22.126,-8.4427,-1.3453,15.3181,-8.4427,11.7684,23.4018,14.5516,1064
-101.3953,-8.8226,15.3789,53.0919,-8.8226,17.2163,53.9254,37.4446,1065
-53.3691,-6.1308,-8.3589,22.9454,-6.1308,7.1245,50.9119,30.1285,1066
-118.8871,-9.4148,-9.6025,53.3332,-9.4148,17.8918,45.1277,32.0237,1067
-85.473,-9.6158,-8.8171,42.3287,-9.6158,9.9653,20.7655,14.8385,1068
-31.1887,-9.6536,-2.4654,14.6783,-9.6536,10.9163,42.1612,17.8427,1069
-35.8494,-10.1907,10.8184,32.5352,-10.1907,12.0915,36.9737,26.4348,1070
-47.0803,-10.6675,3.5261,26.8821,-10.6675,9.3039,32.668,21.8736,1071
-22.5309,-9.683,5.9276,23.5029,-9.683,10.8932,34.3793,19.8175,1072
-4.3738,-9.888,3.5697,7.1946,-9.888,4.0743,11.1915,6.2428,1073
-50.9127,-9.7489,-11.1339,21.0191,-9.7489,8.4562,26.9865,21.1049,1074
-31.3638,-8.2972,-1.7344,15.0694,-8.2972,10.6181,26.2677,16.7892,1075
-19.514,-9.937,14.7382,25.5782,-9.937,16.7894,41.6402,27.3592,1076
-58.2918,-9.9258,-5.5701,12.7884,-9.9258,7.65,31.0286,13.5438,1077
-25.1624,-10.0033,-5.3255,8.3183,-10.0033,4.5263,18.6516,10.8751,1078
-23.5176,-9.9234,-6.816,9.202,-9.9234,4.7582,20.2351,11.2245,1079
-35.8518,-10.2811,-6.6479,17.3312,-10.2811,3.3497,26.3564,19.4165,1080
-43.9139,-9.8595,-13.1233,19.2331,-9.8595,7.4222,31.0891,23.6535,1081
-53.9633,-9.5576,-4.4536,21.3121,-9.5576,9.1285,30.7077,17.1476,1082
-13.1332,-9.6002,12.5228,16.3659,-9.6002,7.6261,32.4013,25.0515,1083
-14.4022,-9.8937,-3.1275,4.9688,-9.8937,5.7151,19.8938,9.9169,1084
-29.5166,-9.997,-0.7739,13.9501,-9.997,7.53,36.96,19.9025,1085
-67.565,-9.802,-7.5501,27.4302,-9.802,9.7202,28.4579,10.165,1087
-27.7695,-9.8812,-0.7646,11.6289,-9.8812,11.4635,33.9693,15.8432,1088
-17.9185,-9.4028,-0.6525,17.0184,-9.4028,5.5772,35.9249,28.9085,1089
-21.8941,-10.2213,-6.5632,10.8228,-10.2213,5.8915,27.3775,20.3669,1090
-19.577,-9.7111,-1.4591,9.8919,-9.7111,8.5499,19.7519,12.7919,1091
-20.1802,-10.0741,-6.7437,8.946,-10.0741,3.1367,22.9467,19.0585,1092
-21.7308,-10.21,-2.8775,9.3206,-10.21,5.6734,21.2528,17.0661,1093
-8.078,-9.757,1.0627,4.6581,-9.757,5.2144,23.8337,10.9437,1094
-1.4739,-9.4072,-0.2651,0.872,-9.4072,1.1277,14.4548,9.3124,1095
-3.6368,-9.7819,0.9231,2.443,-9.7819,4.3514,16.6969,7.9564,1097
-9.8496,-9.6083,9.4007,19.0916,-9.6083,9.6524,24.1256,18.4592,1098
-2.7177,-9.4412,3.7046,5.2907,-9.4412,5.2577,20.746,13.0713,1099
-6.3974,-8.7055,0.6187,3.884,-8.7055,0.9348,21.5062,7.6124,1100
7.1757,-9.7142,17.2254,6.4596,-9.7142,2.09,31.7263,18.8884,1101
-2.6236,-10.1338,-0.4301,0.9176,-10.1338,2.2383,19.5508,16.7831,1102
-87.537,-9.4511,-42.6789,25.7854,-9.4511,8.1292,26.9319,21.9744,1103
-24.6711,-9.2691,-7.733,13.912,-9.2691,3.8121,6.7825,3.1013,1104
-41.3245,-9.7683,10.6058,27.748,-9.7683,10.3822,31.3159,4.5513,1106
0.6029,-9.8493,1.0033,0.3209,-9.8493,0.4677,3.3106,2.8873,1107
-0.4588,-9.8442,0.1062,0.3825,-9.8442,0.5564,2.5945,2.4675,1108
-0.2144,-9.8458,0.0052,0.1443,-9.8458,0.2108,2.6247,2.5169,1109
-0.8818,-9.8346,-0.5441,0.2674,-9.8346,0.331,2.5485,2.4541,1110
-3.312,-9.7852,-0.0822,1.1857,-9.7852,0.9722,7.7467,2.775,1112
2.4514,-9.773,2.9389,0.297,-9.773,0.3049,3.5256,3.2797,1113
2.0045,-9.7807,2.3372,0.2974,-9.7807,0.2079,3.3016,3.0452,1114
0.4919,-9.7901,0.7004,0.1476,-9.7901,0.1441,2.5538,2.4828,1115
0.0723,-9.7946,0.6192,0.3982,-9.7946,0.3686,2.7129,2.4743,1116
-0.1958,-9.7543,2.4945,2.4945,-9.7543,1.4265,4.5013,2.6856,1117
-3.3199,-9.8146,-1.4308,1.3432,-9.8146,1.2952,3.5211,2.6831,1118
-37.2578,-10.1851,-5.0084,9.281,-10.1851,5.3552,19.0641,3.1988,1119
-80.7291,-6.2141,-8.4337,30.5124,-6.2141,7.3081,36.549,29.0577,1120
-5.8188,-9.8602,-0.229,1.5494,-9.8602,3.2544,9.5595,3.3174,1122
0.401,-9.8627,0.5451,0.075,-9.8627,0.128,2.9712,2.8315,1123
0.2666,-9.8664,0.3553,0.0664,-9.8664,0.2414,2.958,2.7635,1124
0.4218,-9.8655,0.5206,0.071,-9.8655,0.1207,3.0865,3.0182,1125
0.1734,-9.867,0.2596,0.0477,-9.867,0.0929,2.7594,2.6383,1126
-0.2985,-9.8596,0.2919,0.4074,-9.8596,1.102,3.4573,2.4789,1127
-29.2789,-9.7294,-8.8948,10.7756,-9.7294,4.9587,13.8957,8.6967,1128
-1.6915,-9.8172,5.992,6.303,-9.8172,4.4,13.2496,10.0771,1129
-17.7733,-9.784,-3.1159,8.9198,-9.784,6.0731,11.1768,6.8438,1130
-4.1395,-9.8135,-0.7718,2.1081,-9.8135,2.3303,6.932,2.9895,1132
-2.6918,-9.7604,-0.4746,1.4392,-9.7604,0.8839,2.9971,2.7321,1133
-14.6442,-9.8226,10.242,10.8964,-9.8226,4.4508,18.8818,15.7279,1134
-47.3668,-9.5631,-11.9923,18.545,-9.5631,4.4904,15.5529,12.1108,1135
-58.6509,-9.8151,21.7747,44.2639,-9.8151,9.2734,28.9532,26.701,1136
-30.5238,-9.9181,-9.0888,13.93,-9.9181,3.2918,15.3715,9.6812,1137
-53.556,-9.6578,-14.942,26.9237,-9.6578,16.4416,30.2293,21.5332,1138
-22.3833,-9.7148,7.694,15.0578,-9.7148,8.992,38.6235,21.9934,1139
-17.0933,-9.8114,-0.5952,5.6422,-9.8114,4.3535,20.2034,9.0111,1140
-2.08,-9.8603,0.1773,1.4507,-9.8603,2.636,10.8224,4.3911,1142
-1.2759,-9.8903,0.3419,0.9165,-9.8903,2.7688,8.6553,6.2412,1143
-0.876,-9.7397,0.342,0.7042,-9.7397,0.7658,8.5131,6.8131,1144
0.1185,-10.1431,2.4403,1.7786,-10.1431,4.3479,16.4061,15.6824,1145
-3.4467,-9.4811,3.0416,4.9176,-9.4811,3.3639,11.326,10.0645,1146
-2.677,-9.9682,-0.055,1.8434,-9.9682,1.2282,9.1912,6.7959,1147
-0.552,-9.1667,0.6893,1.0443,-9.1667,2.1309,12.7776,9.6461,1148
-1.1203,-10.0978,6.1502,4.386,-10.0978,2.2076,16.5544,10.7456,1149
-1.5404,-9.956,2.0682,2.8889,-9.956,5.786,17.4735,16.0255,1150
-2.7055,-9.652,-0.2374,1.7452,-9.652,2.2302,15.7208,8.2515,1151
-8.4349,-9.7683,-0.6807,2.8031,-9.7683,2.8168,19.6821,12.5572,1152
-0.7849,-9.8853,0.4703,1.0578,-9.8853,2.3501,14.4273,10.3795,1153
-1.3386,-9.8029,4.8809,4.6113,-9.8029,1.4676,10.7842,9.0969,1154
-1.0781,-9.9702,-0.2446,0.7322,-9.9702,0.7511,8.3696,6.4399,1155
-0.9988,-9.8961,-0.3715,0.3434,-9.8961,0.4443,11.3199,8.5239,1156
-21.1312,-9.794,-4.0005,11.8656,-9.794,7.6304,17.1191,12.6198,1157
-12.871,-9.975,1.0989,8.1781,-9.975,5.0904,22.7788,14.9349,1158
2.0314,-9.8538,5.8588,2.378,-9.8538,2.3987,16.8214,9.8009,1159
-2.0046,-9.8537,0.1486,1.67,-9.8537,1.3324,14.7585,7.4373,1160
-1.3501,-9.8819,2.2289,2.1448,-9.8819,2.6435,18.8328,10.7823,1162
-7.6645,-9.9094,2.2595,5.3417,-9.9094,5.0001,22.9186,13.1232,1163
0.075,-9.8587,1.5092,1.3685,-9.8587,2.002,11.8333,5.6458,1164
-1.0753,-9.8714,0.8128,0.9205,-9.8714,3.8239,8.512,4.1251,1165
-1.4792,-9.8413,-0.5593,0.4441,-9.8413,0.6144,4.9806,4.4043,1166
-0.0,-9.807,2.8141,2.7417,-9.807,2.4907,11.5778,10.323,1167
-3.667,-10.07,-1.2213,1.5175,-10.07,3.1587,19.3627,16.7859,1168
-1.4452,-9.7788,3.6526,5.5398,-9.7788,5.649,26.2189,22.644,1169
-1.0144,-9.8676,-0.1525,0.5125,-9.8676,1.6577,8.3812,6.833,1170
-2.0671,-9.8521,0.1107,1.1845,-9.8521,3.0391,14.0277,7.1373,1172
-0.8639,-9.7676,0.6532,1.4531,-9.7676,0.8388,11.6942,10.1064,1173
-1.8636,-9.8782,2.9739,3.2401,-9.8782,1.6416,10.8448,5.5015,1174
-0.0065,-9.6984,0.7798,0.6855,-9.6984,2.3833,8.0417,6.0003,1175
-1.8163,-9.8243,-0.5891,0.7968,-9.8243,0.8085,6.7906,5.6622,1176
-1.0597,-9.9346,0.61,1.2388,-9.9346,1.4571,11.0143,9.2192,1177
-0.3842,-9.8744,2.7489,2.7891,-9.8744,0.6966,9.4556,8.3596,1178
-6.1416,-9.8374,2.4033,6.1715,-9.8374,4.4512,18.6666,10.186,1179
-0.5247,-10.0618,0.5248,0.8354,-10.0618,2.8939,12.2552,11.3148,1180
-2.0197,-9.9012,0.1695,0.9842,-9.9012,2.8865,9.6033,4.7259,1182
-0.795,-9.7376,-0.0667,0.3904,-9.7376,1.2868,4.9548,4.2642,1183
-0.6706,-10.1699,-0.0284,0.2975,-10.1699,1.4253,9.0994,6.6309,1184
-0.4669,-9.4383,1.6529,2.5613,-9.4383,3.8064,19.0013,13.4127,1185
-5.7952,-9.9792,0.3759,2.3721,-9.9792,7.4808,20.0444,14.3912,1187
-3.5877,-9.9054,6.4086,7.3959,-9.9054,13.9645,25.9953,20.3117,1188
-1.5233,-9.9184,4.4263,4.5642,-9.9184,5.5408,17.5444,15.9954,1189
-2.2168,-9.8276,0.278,1.9827,-9.8276,3.5305,19.1882,16.2476,1190
-3.809,-9.8901,1.7169,2.7173,-9.8901,6.636,22.1329,9.7711,1192
-1.8038,-9.834,-0.0349,1.0484,-9.834,0.84,6.2731,4.7993,1193
-0.9003,-9.758,-0.1812,0.5627,-9.758,1.9085,12.1523,5.3679,1194
-0.4564,-10.1715,-0.131,0.2291,-10.1715,0.3312,8.4683,3.7011,1195
-1.8411,-9.9361,0.105,1.5381,-9.9361,1.4421,9.1327,6.2756,1196
-0.1017,-9.7794,3.2145,1.6747,-9.7794,0.5672,12.1232,9.3961,1197
-4.2167,-9.9977,1.1438,3.4019,-9.9977,0.796,13.1879,7.4541,1198
-3.0155,-9.8227,9.9134,7.3736,-9.8227,2.5655,25.8581,20.9269,1199
-1.707,-9.8795,0.8303,2.2701,-9.8795,2.9698,19.6585,18.7803,1200
-8.6279,-9.8863,0.5733,3.9744,-9.8863,4.4611,36.1975,14.0559,1202
-1.0664,-10.1777,-0.2365,0.4383,-10.1777,1.4057,24.616,12.3906,1203
-0.3972,-9.9638,-0.0044,0.1921,-9.9638,0.8802,5.9794,4.0981,1204
-0.2333,-10.0092,0.0939,0.2072,-10.0092,1.4189,9.019,8.3936,1205
-3.1236,-10.0543,0.8718,2.4336,-10.0543,4.3738,30.9156,27.4628,1206
-2.1082,-9.7433,-0.3861,1.2857,-9.7433,1.809,24.0184,21.4017,1207
-0.2941,-9.6736,0.2792,0.5067,-9.6736,1.1144,30.1584,28.7005,1208
-1.0792,-9.9294,1.1957,1.6845,-9.9294,3.7958,19.5035,16.7535,1209
-0.6748,-9.8338,3.8775,2.8861,-9.8338,2.485,14.9469,10.2129,1210
-2.5593,-9.9416,1.8324,4.4096,-9.9416,5.5582,23.763,17.2356,1212
-2.2268,-9.9283,2.3115,3.5023,-9.9283,3.2038,15.5182,12.048,1213
-8.9005,-9.8949,1.1751,2.6786,-9.8949,18.4494,85.1334,9.25,1228
-1.0061,-9.8726,1.3067,2.599,-9.8726,4.0662,16.7671,10.8958,1235
-4.0827,-9.9329,1.4194,2.6966,-9.9329,4.6967,20.7938,12.3598,1236
-1.5102,-9.848,6.0271,5.9447,-9.848,10.1726,20.9279,15.5756,1237
-3.871,-10.0196,0.9665,3.1876,-10.0196,4.406,18.3714,13.7279,1238
-2.4593,-9.7338,0.3532,2.3541,-9.7338,2.9222,12.068,5.4558,1239
-0.7843,-9.8776,0.207,0.8525,-9.8776,0.8279,4.9525,4.1408,1240
-0.5463,-10.0153,0.2042,0.4688,-10.0153,0.9918,12.5333,10.2987,1241
-0.5388,-9.9842,0.6268,0.8584,-9.9842,1.6242,6.9112,4.5897,1242
-0.3674,-10.194,1.7983,2.5095,-10.194,4.842,23.0851,19.662,1243
-0.9046,-9.9007,2.8492,4.2977,-9.9007,3.7925,11.3595,9.8551,1244
-4.3256,-9.7235,0.6923,4.0025,-9.7235,1.7272,16.3497,12.3384,1245
-0.7247,-9.7499,1.0993,0.9388,-9.7499,1.0541,13.822,8.8815,1246
-0.678,-9.8906,-0.1064,0.2992,-9.8906,0.4715,4.5762,3.1862,1247
-2.5668,-9.8262,1.3627,2.0712,-9.8262,4.0318,18.1085,11.1353,1248
-1.1629,-10.1097,0.8366,1.5095,-10.1097,3.3148,20.6239,14.8911,1249
-2.1638,-9.8604,1.1045,2.0064,-9.8604,3.3964,22.9131,12.3012,1250
-6.1795,-9.8436,1.6063,5.1387,-9.8436,5.1398,22.2159,17.3827,1251
-6.0555,-9.9191,5.9258,6.4158,-9.9191,9.0578,33.2984,18.9524,1252
-7.7221,-9.8905,-1.3828,3.7564,-9.8905,1.4757,10.043,8.6835,1254
-41.627,-9.7783,-9.127,14.9765,-9.7783,6.45,25.4409,12.778,1255
-94.5172,-9.3682,-35.8452,32.5532,-9.3682,8.1321,30.5515,15.6636,1256
-58.5882,-9.1534,32.3054,41.9329,-9.1534,10.5469,43.3371,20.8266,1257
-41.536,-6.9278,38.2138,67.9927,-6.9278,22.1632,61.8655,51.3458,1258
