AYGX_min,AZ_mean,AYGX_mean,AYGX_std,AZ_mean,GX_std,Gnorm_max,Gnorm_median,timestamp
-0.0101,-9.8447,-0.0081,0.0013,-9.8447,0.012,1.9927,1.97,1
-0.0102,-9.8442,-0.0083,0.001,-9.8442,0.0097,1.9944,1.9651,2
-0.0105,-9.8443,-0.0087,0.0009,-9.8443,0.0076,1.9873,1.9639,3
-0.0112,-9.8449,-0.0083,0.0012,-9.8449,0.011,1.9923,1.9719,5
-0.0249,-9.8268,-0.0104,0.0103,-9.8268,0.4283,3.0976,1.9748,6
-0.1245,-9.8578,-0.0219,0.0491,-9.8578,0.8516,4.4622,2.0356,7
-0.083,-9.8682,0.0408,0.106,-9.8682,1.205,4.1455,2.0855,8
-0.9879,-9.7148,0.1678,0.7191,-9.7148,2.3466,7.3938,3.0468,9
-0.1263,-9.8443,-0.0362,0.0414,-9.8443,0.3469,2.3207,1.9498,10
-0.0432,-9.8373,-0.02,0.0165,-9.8373,0.2944,2.3971,2.03,11
-0.0068,-9.8439,-0.0017,0.0029,-9.8439,0.0678,1.9952,1.9639,12
-0.0846,-9.8335,-0.0385,0.0362,-9.8335,0.6102,2.7843,2.2521,13
-0.0064,-9.8439,-0.0053,0.0011,-9.8439,0.013,1.985,1.9644,14
-0.0078,-9.8451,-0.0057,0.0012,-9.8451,0.0132,1.989,1.9665,15
-0.0073,-9.845,-0.0056,0.001,-9.845,0.0116,1.9892,1.9661,16
-0.0066,-9.8437,-0.0055,0.0011,-9.8437,0.0137,1.9966,1.9655,17
-0.274,-9.8841,-0.002,0.0806,-9.8841,0.8049,3.4415,1.971,18
-143.7418,-9.4605,-29.4709,42.3538,-9.4605,17.6069,54.0109,29.0446,19
-6.4084,-11.1528,0.7427,6.7822,-11.1528,2.2307,29.1322,6.7943,20
-69.7279,-9.9462,2.3589,41.5571,-9.9462,14.8114,52.2061,36.6477,21
-100.9877,-8.0826,78.6381,188.0144,-8.0826,35.0819,106.8204,11.8206,22
-161.7572,-9.1264,-44.0556,101.5029,-9.1264,37.4005,111.9097,34.8984,24
-141.339,-9.0358,49.025,125.5545,-9.0358,20.4636,80.3747,15.2332,25
-8.342,-9.7285,-0.0604,5.8226,-9.7285,3.8681,12.6081,5.1532,26
-10.9485,-9.8886,1.7041,6.8434,-9.8886,5.3972,27.9266,17.1988,27
-5.5274,-9.7788,1.276,4.1219,-9.7788,2.1715,28.9343,16.9787,28
-1.9163,-9.7793,3.5471,3.2753,-9.7793,4.4651,22.9104,10.2316,29
-0.3506,-9.9071,1.0177,1.7839,-9.9071,1.8289,12.6433,7.8841,30
-0.5688,-9.9245,0.0884,0.802,-9.9245,1.862,18.2032,13.6299,31
0.4362,-10.084,9.8245,5.2417,-10.084,4.2157,43.4412,26.1152,32
-2.7786,-9.8384,1.0929,2.1912,-9.8384,1.5043,42.5014,27.1663,34
-10.2824,-9.7416,1.8136,4.595,-9.7416,8.4505,46.8034,32.0175,35
-0.2387,-10.0353,2.1616,2.213,-10.0353,4.86,15.8742,9.7425,36
-4.9082,-10.3765,2.2005,6.2235,-10.3765,3.6215,13.6246,10.1611,37
-5.5222,-9.7549,-2.6109,2.6566,-9.7549,2.4207,16.9752,14.9214,38
-2.1807,-9.7474,-0.6639,0.7818,-9.7474,2.3328,11.9674,9.7607,39
-7.1852,-9.8844,-1.295,3.1162,-9.8844,4.9161,15.6758,12.2848,40
-12.0064,-9.99,-1.2548,4.4398,-9.99,4.6084,19.4465,9.0091,41
-2.7322,-9.8213,0.4146,1.641,-9.8213,3.7186,14.0109,8.4879,42
-2.8835,-9.7659,2.5516,4.709,-9.7659,4.126,14.1591,8.0375,44
-3.6032,-9.854,-0.6832,1.3237,-9.854,3.9024,20.4182,8.7966,45
-1.6277,-9.6381,0.1607,1.3672,-9.6381,2.4523,8.8616,4.8304,46
-2.6538,-10.3433,-0.1026,1.7931,-10.3433,4.2771,11.4565,9.8746,47
-0.8531,-9.5532,0.7865,1.0596,-9.5532,2.9485,12.4565,11.678,48
-0.4025,-9.1562,1.9541,1.3473,-9.1562,2.2865,12.4662,8.9791,49
-1.4302,-9.7879,0.2426,0.9369,-9.7879,3.2997,10.3714,8.3601,50
-0.5408,-9.7525,0.8984,1.2003,-9.7525,2.3805,10.1905,7.9362,51
-5.3808,-10.0249,0.9515,2.3735,-10.0249,1.5284,12.9931,5.6688,52
-1.8368,-9.9641,-0.1138,0.9518,-9.9641,2.5596,11.7522,6.4194,54
-2.4131,-9.8228,-0.0328,0.8363,-9.8228,2.2964,10.5915,5.2102,55
-0.2048,-9.7241,0.4933,0.6971,-9.7241,0.8469,11.3371,4.1395,56
-2.0618,-10.1961,-0.4137,0.7823,-10.1961,1.4864,5.8982,5.4648,57
-1.0433,-9.4381,0.2959,1.1965,-9.4381,1.9205,11.0936,5.083,58
-0.8848,-9.7092,0.6987,1.392,-9.7092,3.7014,12.3512,8.6508,59
-5.5478,-9.4439,0.3481,2.1869,-9.4439,3.0176,12.0623,6.9851,61
-1.1495,-9.8304,0.5939,1.1703,-9.8304,1.8862,10.738,4.0731,64
-11.2417,-9.6715,-0.68,3.0756,-9.6715,5.0038,20.9425,10.283,65
-1.362,-9.7274,-0.2115,0.599,-9.7274,1.2836,14.6426,13.4412,66
-2.8135,-9.8449,1.8783,4.4439,-9.8449,6.1395,16.0479,11.6234,68
-1.1204,-9.9379,-0.0714,0.7144,-9.9379,0.761,10.406,6.6952,69
-1.3699,-10.0217,-0.6143,0.641,-10.0217,0.7922,9.8009,5.0173,71
-4.055,-9.5605,-0.3196,1.5279,-9.5605,3.6829,14.2846,4.5844,72
-0.7052,-9.6584,0.0969,0.6262,-9.6584,1.3667,8.9811,5.0563,73
-2.6371,-9.7454,-0.2418,1.5772,-9.7454,1.6808,11.1135,9.4894,74
-1.1418,-9.8777,-0.1555,0.7395,-9.8777,1.3511,7.1513,3.9282,75
-2.1229,-9.7554,-0.1868,0.6092,-9.7554,1.7825,9.3566,5.147,76
-1.1303,-10.018,-0.0769,0.4809,-10.018,1.7572,6.1206,4.0483,77
-2.0949,-9.6897,-0.0432,1.3136,-9.6897,2.2101,12.1875,6.2322,78
-3.7603,-9.9368,0.7529,1.4641,-9.9368,1.7965,11.6635,6.0229,79
-0.9202,-9.7309,0.0908,0.6651,-9.7309,2.4378,14.9603,7.6668,80
-4.9839,-9.935,-2.3092,1.8811,-9.935,1.6177,14.2545,11.5424,81
-3.6797,-9.9116,-0.7937,1.5548,-9.9116,4.7528,21.0844,14.8181,82
-3.7324,-9.6813,0.5314,1.9173,-9.6813,3.7631,14.7541,12.39,84
-4.3285,-9.6452,1.0452,2.1706,-9.6452,2.8245,14.9347,8.6821,85
-1.3788,-10.0076,0.4311,1.1048,-10.0076,1.1717,16.3514,6.0792,86
-1.7859,-10.2966,-0.1496,1.6209,-10.2966,1.7351,17.5475,7.9516,87
-1.2318,-9.9957,0.8565,1.4085,-9.9957,0.699,7.9901,6.2837,88
-0.3151,-9.8818,0.4382,0.7545,-9.8818,1.3972,9.4232,4.942,89
-13.9378,-9.6138,-0.3063,3.5956,-9.6138,2.7804,16.0627,9.4482,90
-6.4019,-9.5147,-1.9649,3.5788,-9.5147,0.8287,9.9772,8.4066,91
-8.1739,-9.7775,2.4217,5.7605,-9.7775,5.9185,36.8818,30.4712,92
-1.7689,-9.7997,4.4766,5.3297,-9.7997,4.4133,29.4252,22.6395,93
-6.8924,-8.4998,-0.3559,2.8082,-8.4998,2.622,25.8164,11.9764,94
-20.6897,-9.386,1.5811,8.7894,-9.386,3.0898,23.2862,11.5182,95
-3.77,-9.4132,1.0186,3.482,-9.4132,5.5985,18.4405,11.7382,96
-34.4722,-9.5313,0.2728,15.738,-9.5313,4.8983,38.3529,21.6414,97
-6.1869,-10.1226,-0.6102,3.3081,-10.1226,2.151,22.3094,20.2501,98
-6.6944,-9.9032,2.9115,5.2499,-9.9032,2.7743,16.2599,12.9681,99
-5.264,-9.7852,0.5032,3.0452,-9.7852,2.5643,19.686,12.6441,100
-7.8039,-10.0203,-1.5014,4.136,-10.0203,2.003,16.2146,12.5966,101
-2.4076,-9.8746,1.3898,3.0257,-9.8746,4.3278,12.3631,9.9697,102
-2.971,-9.662,-1.0528,1.1941,-9.662,2.2306,15.5968,8.1777,103
-4.2136,-9.7188,-1.3964,1.4108,-9.7188,3.2431,12.0502,8.8774,104
-2.5292,-9.8585,-0.207,1.5263,-9.8585,4.8176,11.3326,5.7889,105
-2.1186,-9.7364,-0.2063,1.1597,-9.7364,2.4699,12.9785,5.9078,106
-7.5785,-9.682,-1.0637,2.0691,-9.682,2.3014,13.6657,8.3266,107
-5.0376,-9.916,-0.0351,1.514,-9.916,4.4534,16.0482,5.9751,108
-1.5521,-9.785,-0.1724,0.8629,-9.785,2.4592,13.416,4.6462,109
-1.8576,-9.9298,-0.558,0.6293,-9.9298,2.3948,10.4094,6.6594,110
-1.0997,-9.9684,0.1659,1.0125,-9.9684,1.6248,8.2027,6.0899,111
-1.6793,-9.8936,-0.0973,0.6754,-9.8936,2.916,14.1205,8.5454,112
1.4763,-9.8287,3.3996,1.6556,-9.8287,1.5916,13.1982,10.7585,113
-1.7919,-9.935,-0.6906,0.5963,-9.935,1.1502,6.2201,3.9537,114
-3.0562,-9.8013,-0.402,1.0071,-9.8013,2.1331,12.4628,5.8528,115
-6.4732,-9.4911,0.4543,3.9705,-9.4911,6.1083,24.7864,14.1143,116
-2.0083,-10.0209,2.6389,3.7649,-10.0209,1.6269,16.2652,8.7059,117
-0.6666,-9.8159,1.4364,2.6291,-9.8159,2.4984,8.4615,6.2676,118
-3.2513,-9.8135,-1.7626,1.2396,-9.8135,3.2327,19.5831,7.6919,119
-1.8705,-9.856,-0.2873,1.0154,-9.856,3.5903,8.6846,4.9172,120
-1.6656,-9.9166,-1.0105,0.6317,-9.9166,0.5996,9.955,9.1354,121
-2.7498,-9.7848,-0.5212,1.0178,-9.7848,4.0262,11.3725,7.1319,122
-1.6964,-9.8537,-0.2686,0.8455,-9.8537,1.6496,5.5583,3.6324,123
-3.9675,-9.894,-0.6743,1.2092,-9.894,3.9748,12.641,5.8337,124
-1.4186,-9.7862,0.1911,0.5791,-9.7862,1.8077,6.9529,4.1673,125
-5.4164,-9.8481,-0.5171,1.613,-9.8481,3.0642,11.9125,5.0115,126
-5.7409,-9.8531,0.2812,1.889,-9.8531,5.9908,15.0635,9.7878,127
-3.0327,-9.7439,-0.6714,1.2602,-9.7439,1.7654,6.7651,3.8643,128
-5.5047,-10.0484,-2.2655,2.0208,-10.0484,4.1291,11.7809,7.8604,129
-5.4663,-9.8837,-2.2158,2.6126,-9.8837,2.1958,11.9684,8.2623,130
-8.7127,-10.1605,-2.7152,3.506,-10.1605,6.2643,15.5023,10.3253,131
-1.0304,-9.7462,-0.105,0.4502,-9.7462,1.9482,6.8878,3.7356,132
-4.2909,-9.8671,-0.6648,1.1477,-9.8671,3.0969,10.571,3.9075,134
-2.249,-9.8623,-0.056,1.058,-9.8623,2.8195,9.3652,4.8708,135
-3.3253,-9.7205,0.5776,1.5236,-9.7205,2.7599,8.6006,4.5728,136
-1.5933,-9.8991,0.083,0.96,-9.8991,2.0756,10.173,4.3461,138
-1.9851,-9.871,0.2029,0.8282,-9.871,3.3312,9.2958,6.5407,139
0.3258,-9.7737,1.1258,0.4924,-9.7737,0.4536,6.1929,5.3365,140
-3.6939,-9.9378,-1.166,2.4736,-9.9378,0.6645,7.1232,5.8548,141
-3.4387,-9.8432,4.8114,6.2309,-9.8432,2.1276,42.272,30.3582,142
-1.2751,-9.8169,3.1973,4.575,-9.8169,2.4099,16.2186,13.4795,143
-2.7018,-9.8834,2.0935,2.8926,-9.8834,5.8991,47.8232,14.2944,145
-1.9055,-9.856,1.884,3.813,-9.856,5.4505,29.9379,19.3278,146
-0.2508,-9.7626,0.4941,1.0674,-9.7626,1.726,17.4772,17.119,147
-5.8086,-9.8657,6.8486,7.0168,-9.8657,4.2037,33.9348,23.0098,148
-4.7803,-9.8263,0.8132,2.7928,-9.8263,4.1368,17.7847,13.6654,149
-3.9742,-9.8437,-1.578,1.7836,-9.8437,2.533,13.2095,6.6734,150
-0.3028,-9.8418,0.7602,0.7606,-9.8418,1.8669,16.6562,15.397,151
-0.8162,-9.9026,0.752,0.8818,-9.9026,2.2554,18.5014,8.2819,152
-5.6401,-9.8433,-1.3481,1.9562,-9.8433,2.1075,6.9069,4.3549,153
-0.0712,-9.8256,0.1339,0.1144,-9.8256,0.2747,2.9613,1.9682,155
-0.3763,-9.8265,-0.1446,0.0908,-9.8265,0.209,2.0745,1.953,156
-0.0708,-9.8219,0.0249,0.072,-9.8219,0.1474,1.9651,1.9247,157
0.0034,-9.8256,0.0628,0.041,-9.8256,0.095,1.94,1.9265,158
-0.0537,-9.8246,-0.0123,0.0348,-9.8246,0.0768,1.9437,1.9321,159
0.0015,-9.8245,0.0172,0.0153,-9.8245,0.0324,1.9422,1.9294,160
0.0769,-9.826,0.0806,0.0042,-9.826,0.0118,1.9495,1.9316,161
-0.0148,-9.8244,0.0142,0.0147,-9.8244,0.0331,1.9362,1.9199,162
-0.0419,-9.8225,0.0774,0.095,-9.8225,0.2031,2.0029,1.9818,163
-0.119,-9.828,0.0334,0.103,-9.828,0.2574,2.0327,1.9345,165
0.0107,-9.8285,0.0383,0.0168,-9.8285,0.0452,1.9618,1.9262,166
0.0252,-9.8318,0.2153,0.1585,-9.8318,0.4547,2.4636,2.1158,167
-0.203,-9.801,2.1944,1.255,-9.801,1.8988,16.3485,12.9904,168
-9.4845,-9.8234,-0.1611,3.0515,-9.8234,3.5272,24.1815,8.0688,169
-5.7772,-9.6242,3.9308,9.0012,-9.6242,2.6003,17.794,9.8128,170
1.8313,-9.8821,6.0309,2.9463,-9.8821,0.6336,12.7192,8.06,171
-9.2638,-9.8138,1.5243,6.0436,-9.8138,2.8521,16.8926,14.4435,172
-3.4269,-9.8413,5.2657,5.7437,-9.8413,3.3523,24.2191,22.5749,174
-7.9092,-9.7844,0.661,2.9397,-9.7844,6.6576,16.954,10.2589,175
-4.6017,-9.8193,-1.1274,2.125,-9.8193,4.8765,18.6586,11.1965,176
-1.0275,-7.1409,1.0124,2.067,-7.1409,2.1681,23.7039,12.2529,177
-3.1991,-10.0633,-0.2682,1.963,-10.0633,2.5558,8.6954,7.9041,178
-1.3594,-9.8329,0.4583,1.35,-9.8329,1.0533,7.9441,5.1528,179
-1.18,-9.9955,0.4986,1.2204,-9.9955,2.2696,8.5225,7.653,180
-1.1046,-9.805,0.1114,1.2644,-9.805,0.8144,5.9416,3.2731,181
-1.902,-9.8897,0.4018,1.637,-9.8897,2.2341,10.0756,4.9057,182
-1.706,-9.7901,0.1242,0.9621,-9.7901,2.3287,5.927,3.0185,184
-2.7717,-9.8332,0.3317,1.378,-9.8332,3.0625,10.2847,4.3362,185
-0.3708,-9.9081,0.6338,1.2175,-9.9081,2.2228,6.2433,5.2848,186
-0.1426,-9.7901,4.9004,3.2264,-9.7901,4.7253,20.4732,15.4474,187
-0.3795,-9.8496,0.7111,1.0825,-9.8496,0.7688,5.3653,4.877,188
-2.5436,-9.7148,-0.5411,1.5597,-9.7148,0.9672,11.4713,10.5526,189
-9.3115,-9.75,-3.594,4.6696,-9.75,0.7658,10.1796,7.7246,190
-1.7997,-10.2899,0.0217,1.0788,-10.2899,2.2736,6.4918,5.041,191
-2.8323,-9.872,1.9314,2.1806,-9.872,3.5786,11.3885,7.4767,192
-5.6644,-9.8285,-0.3307,2.7171,-9.8285,3.3217,14.2482,8.0673,194
-7.1295,-9.8653,-1.0784,2.3361,-9.8653,3.8996,20.7099,6.4038,195
-2.5637,-9.856,-0.4122,0.9993,-9.856,1.3437,8.1858,6.9587,196
-2.8001,-9.7537,1.1682,3.3735,-9.7537,2.7819,10.7387,8.4428,197
-0.4299,-9.8197,1.5968,1.8709,-9.8197,1.7098,9.5888,6.263,198
0.2859,-9.8224,4.559,4.4431,-9.8224,1.6342,13.442,10.8002,199
-1.4481,-9.7941,-0.1538,0.6433,-9.7941,1.3016,8.1063,5.4205,200
-2.1707,-9.7146,-0.3957,1.2516,-9.7146,2.7952,7.5234,4.414,201
-1.8508,-9.8327,0.1846,1.1214,-9.8327,3.2201,9.3951,5.8875,202
-2.4696,-9.8426,0.7111,2.0103,-9.8426,3.0957,9.1957,6.7052,204
-4.3852,-9.8309,-0.5086,1.7406,-9.8309,4.8617,11.9604,6.1187,205
-1.6427,-9.8002,0.7549,1.7756,-9.8002,2.7074,6.4181,4.0015,206
-1.2164,-9.7951,-0.3874,0.4346,-9.7951,1.8555,5.1386,2.8528,207
-0.8136,-9.9595,0.284,0.5265,-9.9595,2.1095,10.2215,7.5559,208
-1.8143,-9.8705,-0.3312,1.0985,-9.8705,0.2478,8.507,4.4177,209
-3.6229,-9.8822,-0.091,1.3696,-9.8822,2.8226,9.1492,4.7781,210
-2.1768,-9.9085,-0.8906,0.8162,-9.9085,1.8054,11.3491,8.3705,211
-3.3994,-9.9344,-0.0308,2.3397,-9.9344,6.1478,12.4808,8.1598,212
-1.87,-9.8258,-0.5934,0.6288,-9.8258,2.7378,7.4721,4.235,214
-17.9755,-9.8033,-1.4574,4.6215,-9.8033,5.9019,16.951,7.0296,215
-4.3188,-9.7839,-0.7748,1.5921,-9.7839,3.5889,11.4624,7.6873,216
-4.2363,-9.7803,-0.2859,1.6793,-9.7803,3.5288,11.828,5.7866,218
-4.4363,-9.865,-0.1464,1.6592,-9.865,4.29,13.2589,4.5455,219
-2.0289,-9.7719,-0.2126,0.8794,-9.7719,2.7388,9.1143,5.5102,220
-4.4636,-9.8175,-2.147,1.5271,-9.8175,1.6279,10.1179,7.95,221
-3.089,-9.8391,-0.5172,0.9576,-9.8391,2.3192,7.5588,3.5094,222
-0.9146,-9.8769,0.4802,0.8246,-9.8769,1.936,6.6213,4.223,224
-3.2548,-9.8317,-0.3149,1.4536,-9.8317,3.3062,8.4981,6.0522,225
-0.9257,-9.8345,-0.0038,0.3628,-9.8345,1.1632,4.2998,3.4147,226
-0.5256,-9.8255,0.0341,0.5084,-9.8255,1.0104,6.933,2.6109,227
-0.5336,-9.8571,3.5539,3.0813,-9.8571,5.1075,15.4015,13.0324,228
-0.147,-9.8059,0.8442,0.7102,-9.8059,0.841,10.3579,3.8637,229
-1.0725,-9.9092,-0.3658,0.5432,-9.9092,1.0166,10.6075,9.4669,230
-0.7361,-10.1549,-0.1292,0.4335,-10.1549,1.2217,5.1352,3.6518,231
-2.5374,-9.8149,-0.4878,0.7993,-9.8149,1.9541,5.6879,4.1019,232
-3.7049,-9.7296,-0.1447,1.6365,-9.7296,3.3111,8.8286,6.124,234
-1.0136,-9.8155,0.4415,0.8947,-9.8155,1.9822,7.9687,5.042,235
-2.3081,-9.9073,-0.2745,1.1153,-9.9073,3.6059,13.1758,5.6388,236
-1.4466,-9.6853,1.091,1.5684,-9.6853,3.6418,9.7299,6.6619,237
-1.7822,-9.8288,-0.1975,1.1018,-9.8288,2.5244,8.6602,6.8269,238
-1.6856,-9.8745,0.2248,1.5028,-9.8745,0.6866,8.1392,6.3024,239
1.088,-9.7751,3.3379,1.479,-9.7751,1.3468,8.5891,7.2217,240
-1.4792,-9.9068,-0.6846,0.5287,-9.9068,1.3967,12.0085,7.8092,241
-5.068,-9.8172,-0.3334,1.6587,-9.8172,3.3946,14.6427,9.7515,242
-0.8176,-9.8994,0.5638,0.8304,-9.8994,1.6073,7.9998,4.9531,244
-2.4436,-9.8588,0.4934,1.3058,-9.8588,2.9949,8.3976,5.814,245
-49.1193,-9.7792,-9.0749,12.2831,-9.7792,5.5224,17.4066,11.2365,246
-7.9825,-9.6056,-2.5158,4.1075,-9.6056,1.8347,4.7782,2.7717,247
-1.7806,-9.7995,2.7958,3.6436,-9.7995,2.4718,8.9841,8.1373,248
-13.7793,-9.7642,-1.1208,5.9507,-9.7642,5.087,10.2115,4.1477,249
-1.7093,-9.777,-1.1102,0.6214,-9.777,0.6258,2.5169,2.2638,250
-4.3955,-9.7778,-2.359,1.3872,-9.7778,1.6533,5.8081,3.4449,251
-2.0583,-9.7333,-0.5554,1.2406,-9.7333,0.9411,2.4761,2.1428,252
-0.8233,-9.7277,-0.3231,0.5579,-9.7277,0.3761,2.1302,1.9818,254
-62.7699,-9.698,4.3613,25.8718,-9.698,7.9395,25.236,6.8855,255
-2.9881,-9.7871,-0.9772,1.7093,-9.7871,1.3209,2.8973,2.4295,256
0.057,-9.7693,5.0514,3.903,-9.7693,2.7484,6.9526,3.673,257
-1.1342,-9.802,0.8341,1.0455,-9.802,0.9467,3.6779,2.7912,258
-0.1127,-9.7649,1.1055,0.8751,-9.7649,0.753,2.7784,2.3342,259
0.3332,-9.7739,2.0683,1.24,-9.7739,1.4581,4.6984,2.8064,260
0.2547,-9.8048,0.4193,0.1447,-9.8048,0.2513,2.3375,1.9973,261
-0.3428,-9.7995,0.0253,0.2211,-9.7995,0.3395,1.9772,1.9395,262
-0.0816,-9.8012,0.0204,0.0599,-9.8012,0.0996,1.9121,1.9037,263
-0.0651,-9.7989,0.0321,0.0397,-9.7989,0.0618,1.9319,1.906,265
-0.0369,-9.799,0.1193,0.1248,-9.799,0.203,2.0872,1.9104,266
0.1209,-9.8033,0.201,0.0597,-9.8033,0.0987,1.9447,1.9289,267
-0.5387,-9.791,-0.3296,0.1522,-9.791,0.1996,2.1321,2.0005,268
0.0714,-9.8014,0.1013,0.022,-9.8014,0.0369,1.9244,1.913,269
-0.0524,-9.8004,-0.0177,0.0181,-9.8004,0.0301,1.927,1.893,270
0.0777,-9.7999,0.0975,0.0155,-9.7999,0.0261,1.9252,1.9105,271
-0.0405,-9.7991,-0.0135,0.0244,-9.7991,0.0389,1.9182,1.9075,272
0.0319,-9.7991,0.0481,0.0105,-9.7991,0.0173,1.9341,1.9031,274
-0.0154,-9.7996,0.0436,0.0317,-9.7996,0.0512,1.9278,1.9036,275
-0.0478,-9.8006,0.0139,0.0411,-9.8006,0.0665,1.9369,1.9032,276
0.0569,-9.7997,0.0721,0.0199,-9.7997,0.0329,1.9257,1.9127,277
-0.0412,-9.7998,0.0012,0.0201,-9.7998,0.0324,1.9393,1.8997,278
-0.0539,-9.7976,0.0312,0.1112,-9.7976,0.1633,1.9822,1.8914,279
-0.0052,-9.7993,0.0604,0.0589,-9.7993,0.1027,1.9869,1.9,280
0.0153,-9.7792,0.2398,0.2611,-9.7792,0.4038,2.6422,1.9367,281
-5.355,-9.8184,3.757,4.9151,-9.8184,6.161,44.6286,35.2221,282
0.3343,-9.7926,1.8869,1.3364,-9.7926,0.871,26.3192,20.6039,283
-1.5003,-9.7767,0.8053,1.8385,-9.7767,2.2101,4.6496,2.8784,284
-0.2972,-9.7856,1.5254,1.9634,-9.7856,1.4046,3.5889,2.4388,285
-1.8513,-9.7902,-0.2229,0.7633,-9.7902,1.1299,3.4141,2.1928,287
-0.3114,-9.7941,-0.0701,0.1576,-9.7941,0.3168,2.0073,1.9238,288
0.2477,-9.7947,0.3285,0.0607,-9.7947,0.1336,2.1391,2.0187,289
-0.1084,-9.7936,-0.0482,0.0492,-9.7936,0.1,1.9648,1.894,290
-0.0143,-9.7936,0.022,0.0189,-9.7936,0.0382,1.9593,1.9037,291
0.0327,-9.7944,0.078,0.018,-9.7944,0.0373,1.9482,1.9106,292
-0.0389,-9.795,0.0042,0.0198,-9.795,0.0406,1.929,1.9036,294
-0.0539,-9.7957,0.0492,0.0546,-9.7957,0.1142,1.9712,1.9065,295
-0.0286,-9.7948,0.0112,0.0237,-9.7948,0.0489,1.9156,1.9015,296
-0.0408,-9.7929,0.0077,0.0403,-9.7929,0.0859,1.9019,1.8877,297
-0.0443,-9.7961,-0.0029,0.023,-9.7961,0.0481,1.93,1.9046,298
0.0522,-9.7941,0.0716,0.0106,-9.7941,0.0216,1.9457,1.9073,299
-0.0802,-9.793,-0.0449,0.0324,-9.793,0.0671,1.93,1.8986,300
-0.4316,-9.7935,0.1137,0.2683,-9.7935,0.5397,2.4363,1.9254,301
-0.1684,-9.7973,-0.0349,0.1028,-9.7973,0.2249,2.0243,1.9385,302
-0.0282,-9.7945,-0.0114,0.0104,-9.7945,0.0213,1.9054,1.8895,303
-4.6491,-9.7737,-1.5225,2.159,-9.7737,1.9551,4.9146,4.2771,304
-1.2194,-9.7709,1.4662,2.4539,-9.7709,3.6835,26.5354,16.9841,305
-6.9858,-9.8238,1.0082,3.9492,-9.8238,5.5799,19.9601,12.3831,306
-4.5614,-9.7549,0.1443,1.7049,-9.7549,2.2384,17.992,7.293,307
0.4379,-9.7665,3.3233,1.5459,-9.7665,1.0378,15.6277,9.6966,308
-0.0485,-9.8638,0.5302,0.5914,-9.8638,1.8731,18.5705,16.9493,309
-1.1655,-9.8313,0.7889,1.2478,-9.8313,2.2932,10.9919,10.5923,310
-0.9595,-9.9434,2.1572,2.7645,-9.9434,1.7376,19.0261,18.279,311
-1.8213,-9.8941,0.2425,1.4479,-9.8941,2.5777,8.5472,4.313,312
-5.9265,-9.8688,-0.9188,2.1776,-9.8688,4.7414,16.3554,8.7395,314
-4.9425,-9.7706,-0.208,2.2458,-9.7706,4.8442,14.9665,6.9104,315
-1.664,-9.8338,-0.056,0.9342,-9.8338,3.5835,11.1206,3.9942,316
-2.4341,-9.8864,3.8686,3.2692,-9.8864,1.1057,12.2896,10.0368,317
-1.7674,-9.8503,0.1022,1.0961,-9.8503,0.9708,17.0127,11.3209,318
-5.1582,-9.2593,-1.7721,2.4154,-9.2593,3.3477,16.8944,13.3411,319
-7.0502,-10.2977,-0.9275,5.2929,-10.2977,4.0992,16.2197,12.2044,320
-2.793,-9.9055,0.0096,1.4769,-9.9055,3.62,10.8593,7.0383,321
-5.4621,-9.7958,-1.8687,1.766,-9.7958,2.7625,12.4066,9.1258,322
-4.5303,-9.6596,-1.2987,2.4963,-9.6596,2.0626,10.4028,6.8369,324
-11.2461,-9.6463,0.0317,3.2741,-9.6463,7.0798,22.2649,9.5726,325
-4.3583,-9.5831,-0.5728,1.7275,-9.5831,4.5251,19.6155,6.9409,326
-4.0743,-9.6229,1.1371,3.7781,-9.6229,2.4086,16.4753,11.7932,328
-8.3912,-9.8438,-0.4865,2.3131,-9.8438,5.1053,18.7115,7.7358,329
-5.6859,-9.8725,2.4004,4.8795,-9.8725,6.4758,22.1167,15.2901,330
-6.4519,-9.6095,0.3623,3.9573,-9.6095,1.7431,20.6202,8.9787,331
-9.4237,-10.6242,-2.3436,3.0901,-10.6242,3.5522,13.5965,9.8315,332
-2.0303,-9.8463,2.1506,3.1667,-9.8463,2.2496,10.1905,6.451,334
-5.4977,-9.7642,-0.3523,2.097,-9.7642,4.5052,13.0643,6.0461,335
-3.5218,-9.7981,-0.6753,1.1912,-9.7981,2.7295,7.3589,5.2733,336
-2.968,-9.7283,-0.6406,1.0068,-9.7283,4.6201,13.0713,6.8204,337
-4.748,-9.8239,-0.9777,1.6979,-9.8239,2.6734,10.3401,6.1549,338
-1.8823,-9.1246,0.222,1.7034,-9.1246,3.5155,8.9484,7.2976,339
-3.9905,-10.1842,-1.8516,1.6282,-10.1842,4.8605,15.8618,8.2291,340
-8.6995,-9.7868,-1.2208,3.8007,-9.7868,2.6449,19.1398,12.8547,341
-6.3638,-9.8468,0.3635,4.9273,-9.8468,5.6916,14.8912,12.2499,342
-0.3233,-9.9527,0.9222,1.3685,-9.9527,2.3575,7.0321,5.0195,344
-4.8327,-9.8593,-0.3532,2.2157,-9.8593,5.9548,15.4045,7.9699,345
-0.6112,-9.7571,1.0112,1.5851,-9.7571,2.267,10.6061,8.215,346
-4.4943,-9.6684,-2.0335,1.6495,-9.6684,1.7627,11.9703,6.7794,347
-0.8646,-10.0543,0.0463,0.7218,-10.0543,3.0733,7.602,6.1861,348
-4.0122,-9.8597,-0.945,1.5367,-9.8597,1.7117,10.153,7.4867,349
-5.7192,-9.2423,-1.4289,3.0005,-9.2423,1.8403,11.9881,7.144,350
-6.1133,-9.3471,-0.3203,2.6935,-9.3471,2.4785,14.9031,8.2145,351
-4.3916,-9.9411,-2.0563,1.7173,-9.9411,3.5779,11.7124,8.2444,352
-2.8839,-10.2073,-0.6001,1.6564,-10.2073,3.6108,12.456,10.6549,354
-10.5851,-9.6325,1.3346,4.59,-9.6325,6.0444,29.6491,11.519,355
-9.1856,-9.6895,-0.4019,4.315,-9.6895,6.205,12.4571,8.503,356
-4.6613,-9.7058,-0.9483,2.5834,-9.7058,2.0979,11.9478,9.6528,358
-2.3876,-9.9557,-0.1895,1.049,-9.9557,1.5544,10.0908,5.4762,359
-2.0158,-10.0573,-0.5768,1.0389,-10.0573,2.4422,10.3314,5.8426,360
-3.2919,-9.7914,-0.6507,1.1468,-9.7914,1.422,8.727,4.3848,361
-1.0512,-9.618,1.0875,1.756,-9.618,3.7391,11.7801,8.9529,362
-3.4365,-9.7847,-0.9806,1.2861,-9.7847,2.6028,10.807,6.2355,364
-4.0934,-9.8121,-0.1313,1.8017,-9.8121,3.5209,11.2478,6.9168,365
-2.0584,-9.7792,0.4947,1.2845,-9.7792,2.6136,11.8551,4.8983,366
-0.3529,-9.8101,0.5775,0.9847,-9.8101,2.5352,8.5043,6.874,367
-1.618,-9.7949,1.3806,1.9786,-9.7949,3.0004,18.1517,15.5481,368
-3.3255,-9.7387,0.1135,1.6182,-9.7387,1.7121,8.803,6.7178,369
0.1596,-9.9455,3.5326,2.4601,-9.9455,1.1468,12.542,10.6744,370
-12.235,-9.7909,-0.7174,3.3382,-9.7909,3.7734,18.7559,6.077,371
-4.0975,-10.0186,-0.3707,1.934,-10.0186,1.9566,11.8975,7.1904,372
-7.7878,-9.8198,-0.8568,3.008,-9.8198,3.8781,18.9315,8.3556,374
-1.6923,-9.8347,0.9262,1.9508,-9.8347,3.6054,28.5109,10.8629,375
-4.7681,-9.9629,-1.0171,3.0007,-9.9629,0.3451,13.7957,5.7093,376
-1.3063,-9.7735,0.0894,0.7143,-9.7735,1.5064,12.3381,8.4544,377
-4.2361,-9.8177,-0.4529,1.5779,-9.8177,3.8136,19.1218,10.6211,379
-3.548,-9.6432,0.9808,4.0162,-9.6432,3.3773,21.4757,11.2732,380
-4.0416,-9.9651,0.1604,2.1306,-9.9651,4.6556,17.1518,7.9361,381
-1.6788,-9.7294,1.0388,2.3666,-9.7294,1.067,10.1997,6.9915,382
-8.1526,-9.6687,-1.5554,4.1681,-9.6687,2.4208,20.3803,13.0,384
-7.4838,-9.8505,-0.2105,2.9104,-9.8505,6.6064,18.2853,11.713,385
-7.5341,-9.5807,-1.5919,4.3602,-9.5807,2.6304,18.5611,7.2132,387
-6.6307,-9.7051,-2.614,4.1807,-9.7051,2.3011,14.4613,7.8103,388
0.1396,-10.03,4.6612,4.5412,-10.03,3.0199,10.2602,7.2531,389
-9.8433,-9.9442,-1.057,5.5282,-9.9442,6.1232,16.4476,8.6654,390
-12.8373,-9.7838,-3.8391,4.1539,-9.7838,3.9079,10.9226,8.3333,391
-4.7988,-9.8756,-0.9424,2.1934,-9.8756,4.4469,12.7059,5.8231,392
-9.0592,-9.7131,-3.7295,4.5535,-9.7131,3.3977,13.0847,9.4324,393
-7.0215,-9.5125,-0.365,3.5239,-9.5125,6.1494,20.417,9.6443,394
-17.354,-9.8903,2.3674,7.9748,-9.8903,8.927,23.115,15.4409,395
-23.8335,-9.8193,-0.5531,6.1138,-9.8193,8.3368,27.284,13.893,396
-21.5737,-9.8934,-1.3456,6.6999,-9.8934,9.6445,27.0364,14.0668,397
-3.011,-9.7486,1.4887,3.0694,-9.7486,6.4799,14.0997,11.6611,398
-12.1393,-9.8066,-1.3603,5.4601,-9.8066,4.139,19.9112,8.7227,399
-2.5168,-10.405,-0.5994,1.0573,-10.405,2.6083,10.4724,6.1801,400
-3.378,-9.6821,-1.0136,2.0667,-9.6821,3.153,6.9773,4.2008,401
-6.7782,-9.8094,0.4836,3.8484,-9.8094,6.857,16.3775,8.9971,402
-7.3601,-10.0291,-1.7102,2.8058,-10.0291,3.9744,13.2516,6.1705,403
-5.9416,-9.9545,3.3817,5.8429,-9.9545,3.8964,12.7439,5.7909,404
-7.0858,-9.7193,-1.4686,2.1772,-9.7193,4.6594,16.2789,8.8977,405
-6.7144,-9.7947,0.7216,3.275,-9.7947,6.9916,17.1843,9.7847,406
-3.5654,-9.8708,0.3151,1.6785,-9.8708,6.545,14.6928,7.1933,407
-13.6648,-9.6935,-0.8519,4.2468,-9.6935,6.1762,14.3599,9.0832,408
-7.7757,-9.831,-1.9455,3.6507,-9.831,4.3155,14.2522,8.1824,409
-5.3507,-10.2161,0.8035,3.0923,-10.2161,4.6357,20.1383,13.7136,410
-11.3256,-9.6374,-4.8657,3.8907,-9.6374,2.5833,14.7377,12.0774,411
-9.3375,-9.833,-1.547,2.6146,-9.833,4.3862,12.7979,6.8194,412
-0.3074,-9.5525,2.1077,2.957,-9.5525,1.997,12.6534,5.7807,413
-22.7265,-9.3117,-5.885,10.6638,-9.3117,4.8925,19.6397,16.6041,414
-12.1312,-9.1703,-0.1605,3.2021,-9.1703,3.6046,13.5362,7.2512,415
-5.9262,-9.6708,-1.0019,3.1554,-9.6708,6.9041,19.0488,10.562,416
-8.2037,-9.4642,-4.2222,2.7498,-9.4642,3.0681,16.9316,13.7631,417
-17.5711,-9.745,-5.505,7.5188,-9.745,5.0018,18.1342,9.9408,418
-3.1531,-9.7134,0.5205,3.3542,-9.7134,3.7246,13.6819,6.5848,419
-3.4641,-9.8069,-0.1528,1.6339,-9.8069,4.1121,18.7973,6.4152,420
-3.2283,-10.0143,-0.7703,1.214,-10.0143,1.7655,7.1831,4.7008,421
-4.6343,-9.8221,1.2948,2.4627,-9.8221,4.1907,9.6177,6.575,422
-2.5518,-8.9902,0.7537,3.4404,-8.9902,4.773,22.3995,13.5323,423
-7.3435,-9.62,2.0256,4.7488,-9.62,6.9805,18.2859,9.6686,425
-5.4306,-9.6514,0.6113,1.9855,-9.6514,2.0538,11.5117,6.2812,426
-6.3814,-10.0252,-1.4905,2.1834,-10.0252,3.7669,12.3388,8.0167,427
-2.1684,-9.8521,-0.3649,1.1458,-9.8521,1.4048,6.969,5.9334,428
-2.9707,-10.0769,1.8449,2.6007,-10.0769,3.0351,12.4521,7.6196,429
-4.0511,-10.0614,-0.8078,2.2256,-10.0614,1.6762,8.692,7.8142,430
-1.949,-9.9274,-0.6086,0.9049,-9.9274,1.7171,6.4188,3.9887,431
-0.7499,-9.654,0.5982,1.1168,-9.654,1.639,11.305,5.3603,432
-1.1774,-9.7023,-0.4161,0.4079,-9.7023,1.2578,9.8308,5.6286,433
-3.1467,-9.8644,0.6369,2.1066,-9.8644,3.4146,13.7318,8.5906,434
-2.7095,-9.7029,-0.1872,1.6304,-9.7029,1.2562,7.8154,6.8134,435
-5.1888,-9.837,-0.8561,1.5087,-9.837,3.365,10.7842,5.4346,436
-0.1351,-9.8692,0.4413,0.4557,-9.8692,1.0215,13.2256,10.0571,437
-0.3546,-9.7411,0.1561,0.4627,-9.7411,2.5738,9.9074,7.0894,438
-4.6063,-9.8203,-1.3729,1.8235,-9.8203,2.6768,13.534,10.3989,439
-2.2019,-9.8779,-1.2229,0.6703,-9.8779,0.7669,6.119,3.4269,440
-0.8666,-9.8898,-0.0988,0.45,-9.8898,0.8159,7.4587,6.0215,441
-1.4586,-9.9476,0.0345,0.955,-9.9476,3.2428,7.7976,5.8247,442
-2.467,-9.8616,-0.2693,0.6367,-9.8616,1.9648,6.4319,3.6,443
-10.5574,-9.8657,-0.4884,3.271,-9.8657,5.9212,14.0718,8.5075,445
-1.6223,-9.9289,0.0543,0.6153,-9.9289,2.2885,7.7948,5.5656,446
-1.4683,-9.7193,0.1184,1.1766,-9.7193,3.4036,6.8879,5.6825,447
-1.5776,-9.889,-0.4266,0.674,-9.889,1.3321,9.1031,7.6645,448
-3.2271,-9.7511,-0.5016,1.6525,-9.7511,2.0198,12.5124,6.821,449
-1.89,-9.7043,-0.6408,0.7638,-9.7043,1.6054,7.2605,4.7421,450
-1.6914,-9.6776,1.3187,1.8017,-9.6776,1.8236,8.9988,6.1225,451
-0.9615,-9.951,0.1691,0.6549,-9.951,2.5186,8.7334,6.461,452
-0.7886,-9.8675,0.0071,0.4415,-9.8675,2.3733,5.4733,2.4415,453
-4.9263,-9.849,-0.3043,1.5009,-9.849,3.5728,11.4585,6.5461,455
-1.6582,-10.0471,0.6259,1.4363,-10.0471,3.1108,10.5634,5.1527,456
-2.7792,-9.9164,0.1869,1.1502,-9.9164,2.8596,9.1202,6.7361,457
-3.6715,-9.8428,0.4711,4.0152,-9.8428,4.7839,19.2565,7.4317,459
-4.0705,-9.9575,-0.2173,1.9701,-9.9575,4.3184,15.197,8.4214,460
-2.524,-8.4624,-0.3314,1.1676,-8.4624,1.3872,16.9591,9.0026,461
-4.6872,-9.8468,0.3215,3.4909,-9.8468,5.7091,16.6799,10.8732,462
-4.305,-9.882,-0.1604,2.8474,-9.882,0.6486,8.5597,6.7169,463
-3.1092,-9.6906,0.2599,1.4881,-9.6906,3.4374,10.9506,5.0463,465
-5.8675,-9.8534,-0.9713,2.2791,-9.8534,2.7736,14.5271,8.5081,466
-1.0249,-10.0969,0.0005,0.6682,-10.0969,1.4239,10.7856,5.7,467
-0.8295,-10.4452,1.4819,1.5433,-10.4452,2.3416,7.2212,5.266,468
-1.573,-9.5851,-0.0809,0.8161,-9.5851,1.3874,13.2889,9.0886,469
-2.5641,-10.1512,-0.1597,1.2814,-10.1512,1.4802,17.5241,12.8061,470
-3.0279,-9.2129,-0.3263,1.9418,-9.2129,1.3882,14.0596,5.976,471
-4.4448,-9.6087,-0.3442,2.6154,-9.6087,3.4584,17.042,8.0901,472
-3.3722,-9.823,-0.373,1.7616,-9.823,2.7689,10.3232,6.5758,473
-3.8202,-9.9162,0.3573,2.2761,-9.9162,4.1476,21.3865,7.376,475
-2.4122,-9.7221,0.2118,1.9151,-9.7221,2.9064,11.7209,9.6317,476
-1.6409,-10.0554,6.0633,5.4794,-10.0554,2.4963,16.0857,12.5604,477
-2.3211,-9.5597,-0.084,1.8519,-9.5597,3.2497,16.4341,13.3025,478
-11.2976,-8.0064,9.4207,12.9798,-8.0064,3.1739,31.365,15.493,479
-2.5447,-8.7114,0.5824,1.7199,-8.7114,1.1005,26.2291,8.4253,480
-0.8575,-9.9007,0.0285,0.7272,-9.9007,1.6052,8.3399,4.463,481
-4.4369,-9.9067,-0.0896,1.8203,-9.9067,4.8493,12.4916,8.0223,482
-6.5832,-9.8293,0.2759,2.9802,-9.8293,2.4551,11.9825,9.0908,483
-2.031,-9.8364,2.4152,3.4036,-9.8364,7.2221,15.3316,9.2418,485
-2.8093,-9.8987,1.8621,3.3298,-9.8987,6.7937,17.7905,13.5522,486
0.0253,-9.538,1.2906,1.403,-9.538,3.4167,10.7797,9.8902,487
-3.9431,-9.9031,0.0711,1.7899,-9.9031,2.7436,11.0891,6.3334,488
-3.8592,-9.7318,-0.7543,1.4512,-9.7318,2.4954,8.9876,4.0835,489
-2.6921,-9.7323,1.0639,3.4041,-9.7323,3.1549,8.442,7.4394,490
-1.8303,-9.8681,-0.2876,1.2999,-9.8681,0.4084,6.524,5.5202,491
-1.0684,-9.7855,2.5617,3.4386,-9.7855,3.9847,13.4347,11.293,492
-2.9747,-9.8954,0.0496,1.6054,-9.8954,4.037,16.0755,10.3125,494
-0.5024,-9.8149,1.5365,1.6224,-9.8149,2.759,10.7116,6.4262,495
-1.0822,-10.0125,1.0083,1.4422,-10.0125,2.638,18.3805,16.819,496
-2.4042,-9.9097,0.2417,1.2274,-9.9097,2.5263,17.158,6.5204,497
-2.5396,-9.9874,4.518,5.3501,-9.9874,3.9241,13.4948,12.1804,498
-1.1235,-10.0723,0.475,1.8145,-10.0723,2.6224,32.2882,27.2099,499
-5.5288,-9.6088,-1.234,1.875,-9.6088,1.2086,35.2988,20.792,500
-0.2574,-9.7321,0.3018,0.4782,-9.7321,0.9486,15.1484,13.8784,501
-5.3143,-9.6894,2.2556,3.9354,-9.6894,5.4565,16.2851,12.2706,502
-9.6375,-9.7695,-0.7864,3.5372,-9.7695,4.3231,22.5551,7.2575,504
-10.695,-9.7585,0.4811,3.4454,-9.7585,5.0467,20.1234,10.2587,505
-0.6068,-9.7978,0.0799,0.5662,-9.7978,0.7673,5.6195,3.6207,506
-5.5638,-9.7973,2.312,7.2438,-9.7973,5.4914,13.5815,10.2942,507
-1.0056,-9.6754,-0.1346,0.4558,-9.6754,1.3,5.6447,4.8354,508
-0.1214,-9.8197,0.5606,0.522,-9.8197,1.9808,7.0525,5.7782,509
-1.2808,-9.8074,-0.0103,0.9389,-9.8074,1.6853,3.6787,3.3845,510
-3.2756,-9.7782,-1.0194,1.2431,-9.7782,1.8511,6.8048,3.8373,511
-1.2365,-9.9059,-0.0018,0.5004,-9.9059,1.3975,12.1183,5.0589,512
1.5191,-10.0249,1.8372,0.3086,-10.0249,0.2441,7.0393,5.0492,514
-2.7457,-9.8576,-0.105,1.0536,-9.8576,2.3856,22.8821,10.1012,515
-2.7214,-9.8412,0.631,1.1798,-9.8412,2.0668,19.5277,11.9788,516
1.8012,-9.8863,3.2181,0.8041,-9.8863,1.425,11.1333,8.9019,517
-2.6283,-9.8775,-0.2284,1.0322,-9.8775,4.0653,11.2834,8.6598,518
-1.1558,-9.7573,2.3571,2.7056,-9.7573,3.0983,12.6273,8.446,519
-2.0848,-9.9218,0.3023,1.8497,-9.9218,2.4272,16.5857,7.6828,520
-2.7998,-9.8185,-0.3703,1.5105,-9.8185,0.8169,15.1385,9.6787,521
-3.7169,-9.8343,0.3577,2.4466,-9.8343,5.2319,12.3133,8.6377,522
-5.6575,-10.0282,-0.4009,2.2704,-10.0282,6.0018,18.1976,6.0824,524
-15.9163,-8.6778,-0.9501,4.8215,-8.6778,4.0171,35.241,7.4819,525
-1.5471,-9.9933,-0.3792,0.6581,-9.9933,2.2387,8.2129,5.3931,526
-5.4722,-9.7939,1.1096,4.4161,-9.7939,4.7436,21.8652,12.9334,528
-7.0712,-9.5936,1.098,4.8368,-9.5936,5.3714,18.3277,12.4598,529
-3.4757,-9.9278,-0.68,1.5248,-9.9278,1.1617,10.7482,9.2991,530
-1.466,-9.8141,-0.4381,0.7281,-9.8141,0.2557,7.8587,6.5772,531
-2.0643,-9.8225,0.1836,0.8435,-9.8225,1.1837,10.6212,5.8739,532
-3.8805,-9.7626,0.2689,3.2038,-9.7626,0.881,10.8584,8.1679,534
-1.3535,-9.7348,1.0727,2.6121,-9.7348,2.2121,14.4658,4.4687,535
-0.2155,-9.9687,0.7454,0.8867,-9.9687,1.6212,12.1705,4.5621,536
-1.8252,-9.9031,0.9703,2.5689,-9.9031,1.3154,10.1878,9.4732,537
-1.0301,-10.0305,0.1567,0.9081,-10.0305,1.4054,8.7683,7.8786,538
-1.6527,-9.8705,-0.2149,0.606,-9.8705,1.1414,7.9079,4.7685,539
-6.0535,-9.4075,0.5734,5.6227,-9.4075,1.8876,10.3151,8.7997,540
-0.7059,-9.5329,1.8774,2.0187,-9.5329,1.5845,9.5203,7.5728,541
-7.1126,-9.1547,0.0979,3.4574,-9.1547,3.5816,15.6271,11.4849,542
-1.3217,-9.9309,0.5715,1.6629,-9.9309,3.1313,11.8113,9.8839,544
-4.3587,-9.4392,0.4827,2.4336,-9.4392,4.3897,16.6719,7.1375,545
-0.7874,-9.9975,0.3609,0.8984,-9.9975,1.3354,6.8637,3.6632,546
-0.3419,-9.5059,-0.0472,0.1662,-9.5059,0.5487,4.0518,2.1053,547
-0.758,-9.4024,0.0664,0.3252,-9.4024,0.8973,20.2462,3.5218,548
-2.5607,-9.9553,-0.7931,1.1043,-9.9553,1.2615,8.2485,3.7186,549
-1.4387,-10.0731,-0.2291,0.5263,-10.0731,1.0464,11.8559,4.7714,550
-3.4818,-10.6156,-0.0046,2.7784,-10.6156,2.7524,24.8725,9.9355,551
-6.4916,-9.2321,-0.775,1.9399,-9.2321,1.8293,18.4371,3.7225,552
-3.9068,-9.4405,-0.4876,2.1914,-9.4405,2.6874,11.4376,6.0651,553
-2.0025,-9.6526,-0.0722,0.4754,-9.6526,0.9042,15.1354,2.8605,554
-4.8016,-9.7321,0.2447,1.6652,-9.7321,2.3267,14.0313,5.1415,555
-5.1223,-9.5707,-0.1019,1.6642,-9.5707,1.8964,19.0118,5.3892,556
-1.088,-9.9091,-0.5061,0.467,-9.9091,0.3901,5.3033,3.4228,557
-3.1513,-10.1097,-0.6422,1.576,-10.1097,1.4639,13.8506,6.8021,558
-1.6232,-10.4527,0.9299,2.1325,-10.4527,2.1809,9.833,5.6917,559
-0.8962,-9.9265,-0.4161,0.4366,-9.9265,0.9298,6.0981,4.6137,560
-0.8068,-9.8732,-0.153,0.3239,-9.8732,1.0591,11.8066,10.6678,561
-1.7902,-9.68,0.7315,1.0476,-9.68,1.0559,14.8741,7.0323,562
-1.8429,-9.888,-0.2978,0.8403,-9.888,2.3197,16.7133,12.341,564
-2.8563,-9.8625,0.5324,1.9044,-9.8625,4.1707,18.6797,7.984,565
-0.6846,-10.0749,0.1663,0.4125,-10.0749,0.8226,9.3713,7.091,566
-4.1699,-9.2347,0.2664,3.3045,-9.2347,2.6927,18.1113,10.1208,567
-0.7899,-9.6867,0.1214,0.5527,-9.6867,1.2023,20.5576,6.9584,568
-5.8459,-8.0101,1.0048,3.5155,-8.0101,2.7317,22.7308,10.6168,569
-2.0851,-10.07,-0.8065,1.3085,-10.07,1.2694,10.9259,7.5859,570
-0.4584,-9.7262,-0.0298,0.2507,-9.7262,1.3571,13.935,9.692,571
-0.3123,-9.9188,-0.027,0.2453,-9.9188,0.7059,6.9156,4.9239,572
-0.417,-9.8815,0.0002,0.1668,-9.8815,0.4907,9.1664,5.3044,574
-22.3245,-9.8176,-2.8222,5.173,-9.8176,3.4729,30.3992,14.9168,575
-8.4782,-9.8384,-1.1215,2.8121,-9.8384,4.1936,27.2593,13.5632,576
-3.0316,-9.8909,0.6301,2.3226,-9.8909,2.6017,37.7477,29.7664,578
-14.1293,-9.8209,-3.1346,4.4077,-9.8209,3.7815,9.855,6.0551,579
-1.3616,-9.8069,0.9426,1.4697,-9.8069,1.8402,6.2478,3.1292,581
-6.2489,-9.8122,-0.1862,1.7418,-9.8122,2.9672,20.082,5.6062,582
-1.1573,-9.837,2.4196,2.3371,-9.837,1.9469,21.1599,20.5901,583
-9.3847,-9.909,1.5296,7.7345,-9.909,2.7554,17.8009,12.7823,584
1.1208,-10.0737,7.0833,3.6096,-10.0737,1.8724,16.7376,9.1361,585
0.0766,-9.8147,1.616,1.233,-9.8147,1.5502,12.7305,8.6749,586
-4.1858,-9.9176,0.2392,2.5687,-9.9176,0.9358,9.3602,5.4973,587
-3.0319,-9.7462,-0.1036,2.0018,-9.7462,2.2552,12.1004,9.8359,589
-8.051,-9.8344,0.0133,2.4455,-9.8344,3.9966,11.8603,7.3745,590
-3.2315,-9.8564,0.366,1.5594,-9.8564,3.0381,11.425,7.5447,591
-0.8193,-8.729,0.1336,0.7042,-8.729,2.2575,5.5676,4.4522,592
-1.4684,-9.6043,-0.3352,0.6806,-9.6043,3.4993,6.8358,6.0296,593
-0.4373,-9.8533,1.9738,2.5172,-9.8533,2.0642,7.6913,5.736,594
-0.198,-9.8925,-0.0599,0.0898,-9.8925,0.5764,2.5462,2.097,595
-1.6752,-9.5941,1.7904,1.7668,-9.5941,1.9241,19.8665,14.774,596
