AYGX_min,AZ_mean,AYGX_mean,AYGX_std,AZ_mean.1,GX_std,Gnorm_max,Gnorm_median,timestamp
-1.9259,-9.8058,1.9222,5.497,-9.8058,4.2402,18.5575,8.4149,134
-4.1042,-9.5916,5.6582,6.4033,-9.5916,7.9415,25.3748,13.8892,135
-346.1911,-7.5501,-2.0866,69.1755,-7.5501,13.0245,90.9626,18.6935,137
-14.5427,-10.2427,-3.5047,9.0817,-10.2427,3.5336,25.6393,21.1995,138
-11.4802,-9.995,-1.1724,5.3255,-9.995,2.0065,26.8673,21.3321,139
