AYGX_min,AZ_mean,AYGX_mean,AYGX_std,AZ_mean,GX_std,Gnorm_max,Gnorm_median,timestamp
0.3895,-9.8578,0.3998,0.0046,-9.8578,0.0107,2.8028,2.7893,0
0.3898,-9.8593,0.3998,0.0052,-9.8593,0.0105,2.8053,2.7823,1
0.2518,-9.8592,0.4322,0.0879,-9.8592,0.1372,3.023,2.7966,2
-136.2581,-9.6856,-16.2583,44.5433,-9.6856,15.7272,35.0459,18.6597,3
-1.4289,-9.7206,2.2603,3.1117,-9.7206,1.7068,7.643,3.1962,4
-1.6623,-9.7443,-1.3509,0.1543,-9.7443,0.0913,2.8045,2.7467,5
-1.5769,-9.7479,-1.453,0.0815,-9.7479,0.0498,2.811,2.7693,7
-1.5775,-9.7508,-1.2153,0.2695,-9.7508,0.162,2.7921,2.7194,8
-2.0018,-9.7541,-1.3818,0.3333,-9.7541,0.2032,2.8899,2.7762,9
-1.8155,-9.7556,-1.4808,0.2319,-9.7556,0.1399,2.9042,2.7819,10
-2.1285,-9.7568,-1.4311,0.3578,-9.7568,0.2118,2.8976,2.7762,11
-2.1984,-9.7567,-1.5086,0.3954,-9.7567,0.2302,2.9164,2.789,12
-1.677,-9.7534,-1.5007,0.1705,-9.7534,0.0972,2.8415,2.792,13
-2.1719,-9.7568,-1.4291,0.3622,-9.7568,0.2169,2.9858,2.7766,15
-2.1575,-9.7605,-1.1432,0.6535,-9.7605,0.4086,3.0011,2.724,16
-1.8674,-9.7644,-1.3475,0.2119,-9.7644,0.1486,2.9349,2.7601,17
-1.5592,-9.7623,-1.1413,0.3716,-9.7623,0.2416,2.8284,2.7334,18
-3.9662,-9.7652,-2.6753,0.937,-9.7652,0.5596,3.6283,3.195,19
-2.1911,-9.7662,-1.1976,0.7867,-9.7662,0.511,2.9472,2.7451,20
-2.362,-9.7661,-1.3525,0.3998,-9.7661,0.255,3.0593,2.7498,21
-2.5074,-9.7663,-1.8626,0.5192,-9.7663,0.3151,3.0795,2.8671,22
-1.7626,-9.7672,-1.31,0.2165,-9.7672,0.1374,2.8862,2.7521,23
-1.6985,-9.7679,-1.399,0.2521,-9.7679,0.1604,2.8494,2.7949,24
-1.7651,-9.7674,-1.3729,0.2894,-9.7674,0.1931,2.8592,2.7931,25
-4.1473,-9.7698,-2.4705,1.129,-9.7698,0.6721,3.719,3.1684,26
-310.4321,-9.0099,2.2126,142.9652,-9.0099,30.8997,104.822,37.0201,27
-199.5899,-9.0297,-37.2667,67.3226,-9.0297,14.0763,80.0568,39.6481,28
-106.1249,-8.8152,-2.6359,68.1563,-8.8152,14.9447,57.9121,35.617,29
-65.9311,-9.2037,-34.0849,15.8553,-9.2037,3.0203,21.53,9.0686,30
-9.2711,-9.7119,13.3148,21.7792,-9.7119,9.5483,24.6325,8.137,31
-7.1721,-9.8324,2.5421,4.3398,-9.8324,4.883,38.1439,21.9589,32
-0.9958,-9.8255,1.0981,1.7648,-9.8255,3.7645,8.47,5.6924,33
0.0167,-9.8912,5.2637,4.0934,-9.8912,3.6941,23.0587,17.1547,34
-3.8642,-9.9299,4.0864,5.7769,-9.9299,4.1256,20.8906,8.7697,35
-3.3953,-9.9687,3.7735,7.0395,-9.9687,3.482,15.0997,8.1429,36
-4.9279,-9.9267,1.963,5.7759,-9.9267,5.6223,20.2807,8.9913,38
-2.2293,-9.7696,0.5038,1.4579,-9.7696,1.6672,9.5394,8.1938,39
-2.8308,-9.8797,0.1901,3.2079,-9.8797,1.9624,10.6441,7.2495,40
-3.5197,-9.9062,0.1473,1.2115,-9.9062,2.7389,8.9199,4.9567,42
-0.8922,-9.9717,-0.0367,0.4981,-9.9717,1.0883,7.2916,6.8454,43
-0.7905,-10.0588,-0.0071,0.376,-10.0588,0.9621,9.2297,4.1494,44
-20.1717,-9.9676,6.6751,10.0461,-9.9676,12.2997,59.5401,43.3032,45
-14.0454,-8.7849,7.3415,17.0335,-8.7849,3.9878,44.011,30.3197,46
-40.0413,-9.3542,0.2005,11.8308,-9.3542,10.348,48.6907,16.9921,48
-4.6145,-9.8278,-2.2097,2.2045,-9.8278,6.1041,24.2937,20.7285,49
-3.6334,-9.3502,0.1195,2.6951,-9.3502,3.5328,13.4902,10.6606,50
-5.8128,-9.8776,-1.1769,2.6861,-9.8776,2.0198,15.4117,9.1868,51
-9.3471,-10.2724,4.1674,10.7667,-10.2724,6.0958,30.2823,24.885,52
-11.5781,-10.058,-2.1093,7.9409,-10.058,4.6019,20.6248,16.6833,53
-1.205,-9.7415,0.647,1.3259,-9.7415,2.5171,11.6651,9.7827,54
-6.2767,-9.7387,4.1523,6.2515,-9.7387,11.646,25.3479,16.9062,55
-2.8572,-9.8336,-0.4151,1.1213,-9.8336,2.0203,12.7796,8.1808,56
-11.6684,-9.8343,2.5829,8.1149,-9.8343,10.9431,26.4642,16.4691,58
-0.7869,-9.724,2.5198,2.5472,-9.724,3.4479,18.9295,14.1906,59
-11.2691,-9.8513,-0.4797,7.4557,-9.8513,2.0994,18.9873,11.5646,60
-6.9623,-10.1834,-2.5123,2.6718,-10.1834,5.9249,12.6655,7.8778,61
-5.0393,-9.9712,-0.5479,2.6952,-9.9712,6.1455,20.6889,11.927,62
-0.8853,-8.9001,2.8779,3.4152,-8.9001,7.7041,25.7165,19.5367,63
-7.298,-10.3454,-0.7043,3.6618,-10.3454,6.0859,25.5162,17.5519,64
-6.3895,-9.7759,-0.5446,3.2809,-9.7759,2.6369,14.491,7.5518,65
-0.6902,-9.9548,1.2349,2.4629,-9.9548,2.4385,15.1654,14.0549,66
-13.6938,-9.8318,0.9083,5.8499,-9.8318,5.3325,15.6531,6.9904,68
-8.7847,-9.889,0.6043,4.247,-9.889,3.4644,11.9419,6.2678,69
-4.3293,-10.4108,0.1131,2.1024,-10.4108,3.2453,13.7291,8.0098,70
-3.9716,-9.5163,4.8385,7.3177,-9.5163,1.2086,19.2272,14.4984,71
-0.6241,-9.9991,-0.0748,0.2506,-9.9991,0.828,8.8898,4.1752,72
-0.9846,-9.9052,-0.0259,0.9932,-9.9052,2.1874,5.9638,4.3457,73
-1.8544,-9.9894,-0.2881,0.8159,-9.9894,1.6256,7.9948,3.7317,74
-7.0655,-9.7137,-0.3185,2.1816,-9.7137,3.009,19.3877,7.0374,75
-0.7636,-9.2418,1.6959,3.1332,-9.2418,2.8763,23.1384,10.7784,76
-20.6914,-8.6883,-0.6374,4.8273,-8.6883,3.1317,39.67,6.4794,78
-1.8049,-9.6592,0.5784,1.2692,-9.6592,3.6389,30.7398,7.457,79
-4.9967,-10.0775,0.3018,2.2214,-10.0775,1.5528,18.5514,6.4175,80
-1.9151,-10.3143,1.946,4.4757,-10.3143,6.375,16.4979,15.3022,81
-0.5336,-10.1181,1.9001,1.9708,-10.1181,1.0523,9.6762,6.8194,82
-6.2533,-8.9542,-1.2501,2.8252,-8.9542,2.6252,15.6306,8.1971,83
-1.1692,-10.5991,0.0475,1.299,-10.5991,1.6363,13.2185,3.9863,84
-8.8426,-9.0614,-0.4423,2.54,-9.0614,2.3449,30.7575,5.9479,85
-1.4261,-9.1531,0.035,1.4985,-9.1531,1.4415,18.9413,5.5337,86
-16.5581,-8.3749,0.1966,4.6839,-8.3749,4.2067,37.5811,7.7415,88
-2.8356,-9.3888,0.2226,1.3214,-9.3888,3.3325,22.75,7.6308,89
-9.6761,-8.9739,-1.0058,4.3085,-8.9739,2.5813,18.8453,9.7096,90
-3.0115,-9.9074,0.1893,1.77,-9.9074,2.2761,16.3024,5.1895,91
-3.7363,-9.8561,-1.1775,1.5572,-9.8561,0.7822,10.8269,9.6234,92
-5.2384,-10.3424,0.3085,3.2219,-10.3424,3.8984,28.2791,21.6137,93
-2.845,-9.8401,0.3031,1.9333,-9.8401,3.0241,17.5607,7.7697,94
-15.8374,-9.8857,-0.5344,5.9448,-9.8857,4.4021,20.0615,12.5985,95
-0.7691,-9.8604,1.5095,1.7463,-9.8604,1.9969,10.0074,5.776,96
-6.6107,-9.7423,0.3936,2.9447,-9.7423,3.284,20.2146,8.8301,98
-3.3324,-10.1267,0.2182,2.5199,-10.1267,3.5819,16.0915,7.3246,99
-0.5742,-9.8064,0.0364,0.2861,-9.8064,0.9679,9.2552,6.177,100
-1.6919,-9.8831,0.0813,0.5383,-9.8831,2.0068,18.5487,7.0216,101
-1.8761,-9.8083,1.0483,2.7437,-9.8083,2.9911,18.6155,5.5433,102
-7.5725,-9.9358,-0.4285,2.3905,-9.9358,1.9571,19.8944,7.3605,103
-12.5179,-10.0495,7.3946,12.9412,-10.0495,11.6256,41.9637,35.1493,104
-29.846,-9.8182,6.8826,15.394,-9.8182,8.988,37.7868,20.8442,105
-11.5958,-9.8826,-1.0638,4.0711,-9.8826,3.5151,20.6781,10.5217,106
-7.7642,-10.2699,7.7069,12.0396,-10.2699,3.5097,22.3657,16.5866,107
-38.2725,-8.6145,2.6409,16.044,-8.6145,7.7484,37.0286,17.7556,108
-13.3747,-8.3235,-2.4348,9.2049,-8.3235,4.905,35.2108,21.3263,109
-6.0309,-10.0322,8.8814,9.9355,-10.0322,2.6771,16.4283,14.7515,110
-7.0634,-9.869,2.2326,4.727,-9.869,6.0931,23.9019,15.0704,111
-2.5361,-9.8537,1.6534,3.5908,-9.8537,4.3992,14.7859,8.7746,112
-2.1705,-10.1215,0.3902,1.742,-10.1215,2.0294,14.5507,12.1383,113
-1.6737,-8.5409,-0.2206,0.8842,-8.5409,1.8983,9.4079,5.6639,114
-1.4766,-9.8512,0.5564,2.2303,-9.8512,4.962,12.523,9.0326,115
-3.1049,-9.7861,0.3976,2.0163,-9.7861,1.8005,12.5139,7.127,116
-7.5402,-7.4445,0.0667,5.2267,-7.4445,3.4108,22.1393,9.7742,117
-1.6332,-9.6014,0.1233,1.4826,-9.6014,3.128,9.6181,7.0184,119
-3.173,-9.9908,-0.5667,1.7737,-9.9908,1.9205,10.944,5.6914,120
-0.8844,-10.1723,0.1367,0.8365,-10.1723,1.1797,12.2551,10.616,121
-6.6041,-9.492,-0.1413,3.0686,-9.492,1.6436,19.5204,17.4952,122
-3.5793,-8.9727,0.0591,1.6859,-8.9727,2.644,21.975,18.1869,123
-3.4883,-10.0657,0.0551,1.9724,-10.0657,2.762,17.6396,13.0942,124
-1.8529,-9.839,2.4556,2.9625,-9.839,3.4814,22.0818,9.0862,125
-12.6657,-10.0024,-2.1269,5.3708,-10.0024,4.4511,24.2145,17.0,126
-41.0955,-9.7001,0.7984,14.6601,-9.7001,10.5471,37.8733,16.4274,128
-9.7712,-9.8214,-1.3594,4.754,-9.8214,10.0894,25.0019,13.317,129
-3.8707,-9.8181,0.1019,2.2406,-9.8181,2.3772,12.6496,9.3644,130
-3.5891,-9.9376,1.0041,3.5989,-9.9376,7.3501,15.8682,11.3317,131
-1.5068,-10.395,0.2476,1.4883,-10.395,1.6727,14.0611,7.3758,132
-2.3637,-9.7094,0.9425,2.302,-9.7094,4.0521,13.0688,6.9869,133
-3.6046,-9.7928,-0.9813,1.6132,-9.7928,0.6949,8.8078,6.3976,134
-3.0326,-9.8508,0.4689,1.7109,-9.8508,4.5507,9.3169,5.667,135
-0.7265,-9.8539,1.2536,1.8606,-9.8539,1.0955,11.0019,7.5466,136
-5.1749,-9.8895,1.3577,3.6285,-9.8895,5.0996,16.6643,4.9618,138
-1.402,-9.9348,-0.0064,0.8453,-9.9348,0.9344,7.6866,4.1744,139
-0.699,-9.8639,-0.0199,0.4134,-9.8639,0.7499,8.732,3.8499,140
-1.003,-9.9247,-0.0224,0.8313,-9.9247,2.4538,11.2785,8.4833,141
-2.1415,-10.1138,0.0146,2.0866,-10.1138,3.7294,10.0116,7.9971,142
-3.2295,-9.1594,4.1925,5.5573,-9.1594,1.5694,15.5519,13.5211,143
-8.717,-9.4142,0.4062,4.943,-9.4142,4.7843,33.588,18.685,144
-6.4196,-9.5498,2.8959,4.4906,-9.5498,9.9727,17.9055,13.5302,145
-3.9924,-9.5212,2.2251,4.9577,-9.5212,2.8926,16.4904,12.2247,146
-3.7898,-9.7839,1.9171,3.4292,-9.7839,7.1873,15.0782,13.6135,147
-4.675,-9.751,0.3963,1.8626,-9.751,2.5506,15.1857,6.6304,148
-0.9987,-9.9686,-0.1934,0.578,-9.9686,1.908,8.3292,2.6862,149
-2.28,-10.3519,0.3961,1.4112,-10.3519,2.1427,15.8914,4.5067,150
-1.6272,-9.8437,0.3488,1.1194,-9.8437,2.5562,9.818,4.7793,151
-1.3155,-10.0912,0.1754,1.0391,-10.0912,1.5423,13.1617,6.1476,152
-0.0574,-10.001,0.1719,0.2255,-10.001,1.6419,10.7504,6.4157,153
-1.4245,-9.8433,0.5176,1.2346,-9.8433,0.6145,8.0266,7.0837,154
-18.8959,-10.2151,13.9903,19.7986,-10.2151,18.3314,66.739,29.4198,155
-46.7815,-8.9985,12.6524,48.6662,-8.9985,7.618,47.1332,34.0125,156
-12.537,-10.3594,-0.0651,4.8866,-10.3594,9.3535,27.9205,20.2366,157
-8.6602,-9.9626,0.933,3.4525,-9.9626,8.288,13.2813,10.2612,158
-15.7228,-9.8282,0.617,5.036,-9.8282,8.1348,24.2579,11.1683,159
-2.0009,-9.7185,-0.5745,0.8971,-9.7185,1.933,9.1467,4.5891,160
-2.7434,-9.7039,-0.1249,1.9054,-9.7039,3.8554,11.7097,7.2597,161
-2.2918,-10.0802,0.5507,1.6174,-10.0802,3.9734,11.3703,9.2355,162
-0.4934,-9.7727,1.4351,0.974,-9.7727,1.5056,8.4475,7.7183,163
-0.837,-9.6189,1.007,1.6591,-9.6189,2.1761,8.8553,6.3254,164
-1.3476,-9.7621,-0.1008,0.4705,-9.7621,1.2067,12.1248,4.5633,165
-0.8362,-9.8123,0.2882,0.7237,-9.8123,0.4928,8.8219,4.9436,166
-0.7166,-9.7171,0.1527,0.6048,-9.7171,1.4968,8.9739,7.053,167
-1.753,-9.8279,0.5011,1.1544,-9.8279,3.6327,8.9736,6.0059,168
-0.913,-9.9234,0.063,0.737,-9.9234,2.0872,6.8969,5.6834,169
-2.2999,-9.9948,-0.965,0.6883,-9.9948,1.1114,7.4899,5.2274,170
-0.592,-9.6667,-0.0497,0.2801,-9.6667,0.8219,7.1891,5.1488,171
-1.2082,-9.9873,0.4493,1.1507,-9.9873,0.6113,5.5914,4.112,172
-0.9692,-9.9493,0.2205,0.9646,-9.9493,1.5827,8.3381,5.1173,173
-0.5066,-9.9022,1.2484,1.5877,-9.9022,1.5147,14.459,7.9528,174
-57.629,-10.2159,13.2274,24.2495,-10.2159,14.7516,93.5363,69.423,175
-15.5806,-9.898,-2.7329,9.1787,-9.898,4.438,48.7868,37.3908,176
-5.5907,-10.1967,-2.1993,2.4468,-10.1967,0.5348,25.3095,24.0851,177
-17.2443,-9.7457,0.3806,8.3046,-9.7457,3.9352,22.454,13.9001,178
-27.4765,-9.7839,5.8586,15.8318,-9.7839,12.1769,29.5594,21.9629,179
-27.9383,-9.6332,-4.3818,16.6353,-9.6332,8.2706,42.6049,35.8765,180
-4.3149,-10.5461,0.2676,3.2888,-10.5461,2.9465,14.3448,9.7916,181
-1.7266,-9.7446,0.4387,2.1272,-9.7446,4.0261,14.0125,9.7523,182
-3.2024,-9.8119,0.9568,3.8846,-9.8119,2.2199,11.7943,9.5446,183
-0.3593,-9.45,3.8505,4.6874,-9.45,6.9648,16.9587,13.0543,184
-7.1883,-9.9852,0.5381,3.4312,-9.9852,5.3186,15.5806,7.467,185
-10.317,-9.7711,-1.6082,4.8514,-9.7711,4.4775,17.9846,13.236,186
-6.5251,-9.5601,3.1148,5.5601,-9.5601,2.8539,21.9446,11.1484,187
-3.8836,-9.8272,0.4401,1.8481,-9.8272,5.3883,12.8933,8.165,188
-2.2816,-9.936,2.9533,6.1504,-9.936,9.2732,22.6467,9.4136,189
-6.8263,-9.7858,0.6113,2.9637,-9.7858,4.427,17.4856,13.1801,190
-1.3784,-10.1242,2.5113,2.9582,-10.1242,4.7475,13.9011,9.5117,191
-3.9177,-10.0195,0.0342,2.3693,-10.0195,5.3464,15.8142,11.6521,192
-6.9278,-9.7534,-1.0476,3.624,-9.7534,4.0088,16.926,8.5842,193
-1.9214,-10.1451,0.6088,2.1193,-10.1451,0.7259,12.1909,6.3403,194
-0.7916,-10.2861,-0.0794,0.6057,-10.2861,1.5699,17.6331,12.9167,195
-3.2583,-9.8351,1.1932,2.2233,-9.8351,1.9835,12.2797,9.895,196
-0.5544,-10.2535,-0.0711,0.3957,-10.2535,1.0428,10.2227,7.1427,197
-6.0115,-9.0726,-0.3875,2.7641,-9.0726,5.7554,26.0023,9.3904,198
-6.668,-8.765,0.6031,2.8387,-8.765,2.5817,43.1395,7.3757,199
-19.4503,-10.0475,8.4915,24.2688,-10.0475,8.8658,29.9737,18.8958,200
-12.7715,-9.3815,8.1044,14.7135,-9.3815,5.4059,37.1082,19.6104,201
-1.5703,-10.0368,3.1479,4.1678,-10.0368,5.5454,23.0575,20.2741,202
-5.1805,-10.0505,0.2537,3.0855,-10.0505,5.2722,14.9466,10.7464,203
-0.4509,-9.5747,0.4346,1.5156,-9.5747,1.0571,6.5523,5.4976,204
-3.0772,-9.5651,0.5783,2.0263,-9.5651,0.8805,8.0044,6.8121,205
-3.3879,-10.0245,0.6177,2.1337,-10.0245,4.2378,12.8839,8.9142,206
-2.6456,-9.8006,0.1902,1.5306,-9.8006,2.4812,13.2294,5.7804,209
-1.8443,-9.8654,0.5946,1.5667,-9.8654,3.8634,12.4822,7.49,210
-2.6835,-10.0095,2.1038,2.8855,-10.0095,7.9997,16.9963,11.3055,211
-3.8103,-10.2412,-0.2657,2.0816,-10.2412,0.4238,8.2969,7.112,212
-3.6745,-9.8389,3.6282,6.8268,-9.8389,5.748,19.7606,12.6898,213
-2.7786,-10.204,1.2319,2.6856,-10.204,5.5681,15.7134,12.9443,214
-6.9973,-9.8789,0.1524,2.7742,-9.8789,4.7759,12.6289,8.1527,215
-0.764,-9.615,0.1916,0.5949,-9.615,2.8161,12.392,7.3685,216
-2.4276,-9.9406,0.0396,1.097,-9.9406,2.6869,11.9348,6.4537,218
-1.804,-9.5961,-0.4451,0.8353,-9.5961,2.7413,11.706,5.6321,219
-6.2333,-9.844,-0.8891,3.5319,-9.844,1.3447,13.6335,6.7357,220
-3.1,-9.664,0.6193,1.9895,-9.664,3.4126,14.0178,7.261,222
-3.8919,-9.9773,3.0584,4.864,-9.9773,7.2519,15.8831,12.8947,223
-1.6154,-9.837,1.9524,3.7127,-9.837,4.9738,13.306,10.6018,224
-2.5312,-9.8223,0.5543,1.7422,-9.8223,4.1624,11.5647,5.1306,225
-1.8168,-10.3175,-0.0411,1.2754,-10.3175,4.8764,12.9951,10.4276,226
-6.0906,-9.9204,0.3627,1.8747,-9.9204,3.8984,11.3747,6.2985,228
-1.9415,-9.8362,-0.5612,0.7996,-9.8362,2.4397,15.4012,11.7682,229
-0.3384,-10.0151,0.6755,0.7312,-10.0151,1.7593,13.9094,11.1985,230
-8.7372,-8.742,3.4805,9.0467,-8.742,2.7666,30.9355,13.7272,231
-5.1358,-9.8622,5.1065,6.587,-9.8622,0.9194,30.2125,20.9941,232
-0.4366,-9.721,2.7135,4.3062,-9.721,2.8539,15.7537,13.7695,233
-0.2746,-9.9817,2.8005,2.0071,-9.9817,0.7062,19.1468,14.3237,234
-3.3502,-9.8602,-0.9047,0.8792,-9.8602,1.3081,17.9429,6.9544,235
-1.4581,-9.8708,-0.3432,0.6008,-9.8708,1.3432,4.066,3.1216,236
-0.8358,-9.8718,-0.3737,0.3659,-9.8718,0.9687,3.3965,3.0518,238
-0.6121,-9.8742,-0.1727,0.2447,-9.8742,0.7224,2.9561,2.8158,239
-1.1593,-9.8775,-0.8299,0.2141,-9.8775,0.5521,3.5946,3.3569,240
-2.0237,-9.8716,-0.4398,0.5778,-9.8716,1.0426,4.1032,2.9701,241
-0.8925,-9.8695,-0.4526,0.2639,-9.8695,0.4373,3.1933,2.8164,242
-0.2553,-9.8734,-0.1028,0.0722,-9.8734,0.5245,3.0857,2.6721,243
-0.7977,-9.8669,-0.3888,0.2502,-9.8669,0.5114,3.2735,2.7359,244
-0.4726,-9.8737,-0.2746,0.1193,-9.8737,0.3808,2.9983,2.8181,245
-0.0805,-9.8725,-0.0647,0.0113,-9.8725,0.0531,2.6304,2.6013,246
-0.3287,-9.8727,-0.23,0.0612,-9.8727,0.2003,3.108,2.9854,247
-0.2403,-9.8751,-0.191,0.037,-9.8751,0.076,2.7286,2.7053,248
-0.2631,-9.8741,-0.2292,0.0232,-9.8741,0.061,2.8256,2.7872,249
-0.1999,-9.8732,-0.0813,0.04,-9.8732,0.1307,2.6755,2.6352,250
-0.321,-9.8752,-0.1762,0.0884,-9.8752,0.3576,3.0313,2.8352,251
-0.4479,-9.8746,-0.3122,0.0816,-9.8746,0.1935,3.0456,2.8927,252
-0.3292,-9.8742,-0.3025,0.0278,-9.8742,0.1093,2.8281,2.8002,253
-0.199,-9.875,-0.1664,0.0229,-9.875,0.0688,2.7085,2.6549,254
-0.4628,-9.8749,-0.2895,0.0893,-9.8749,0.2487,3.0198,2.8332,255
-0.4303,-9.8733,-0.3223,0.0671,-9.8733,0.1947,2.9109,2.7643,256
-0.2029,-9.8705,-0.1935,0.0097,-9.8705,0.0343,2.7337,2.7121,257
-0.1974,-9.8755,-0.1816,0.0121,-9.8755,0.0233,2.7773,2.7461,258
-0.3482,-9.873,-0.2593,0.0485,-9.873,0.13,2.8506,2.7669,259
-1.2653,-9.8739,-0.2884,0.2208,-9.8739,0.5025,3.6413,2.8131,261
-1.7546,-9.8815,0.8507,1.887,-9.8815,2.0411,7.0142,5.9778,262
-19.5728,-9.923,-3.2821,7.2541,-9.923,4.2498,27.5698,23.1652,263
-4.8083,-9.7103,1.56,5.0419,-9.7103,6.1067,22.7086,17.4339,264
-5.819,-9.7239,3.6768,6.6658,-9.7239,6.4905,23.5393,14.3835,265
0.8599,-10.23,4.8243,3.7698,-10.23,1.0933,20.331,17.4666,266
-1.9656,-10.0715,1.6609,4.1621,-10.0715,4.008,30.3286,11.5586,268
-10.4881,-9.7954,2.3477,9.1304,-9.7954,10.8107,19.7888,13.9401,269
-13.2831,-9.9301,-0.6709,5.7148,-9.9301,3.6563,16.7495,11.5681,270
-0.6907,-9.876,-0.1546,0.3333,-9.876,0.9789,6.583,4.8315,271
-3.7929,-9.8358,0.0408,2.9571,-9.8358,5.1587,16.9141,7.0082,272
-0.1584,-9.7237,1.0942,0.6426,-9.7237,1.5251,8.8253,5.1106,273
-3.9081,-9.9788,2.5437,7.1025,-9.9788,8.9008,19.774,14.065,274
-7.7007,-9.9377,1.9358,5.8092,-9.9377,8.2998,22.602,12.5089,275
-0.8133,-10.3466,0.4745,1.2005,-10.3466,3.4596,13.3969,8.1536,276
-3.1941,-9.9536,-0.043,0.8531,-9.9536,1.4111,7.4548,4.8262,278
-4.4877,-9.9746,1.1603,3.3418,-9.9746,2.6349,15.3028,6.979,279
-1.4445,-9.7306,4.5216,6.1565,-9.7306,2.6245,19.8591,11.4907,280
-15.3153,-9.4846,-2.2967,6.8207,-9.4846,2.6771,22.6268,19.9324,281
-6.3985,-9.9051,-0.531,2.7758,-9.9051,5.6689,17.8031,10.52,282
-3.9958,-9.6128,-1.0604,2.0281,-9.6128,3.3899,9.9731,8.2624,283
-0.4973,-9.9636,2.0517,2.1132,-9.9636,3.6589,11.0294,8.9003,284
-2.4263,-10.0795,0.8772,2.6223,-10.0795,6.6341,19.0768,14.9786,285
-2.47,-9.9726,1.9948,4.6559,-9.9726,4.3839,13.7375,6.1738,286
-5.006,-9.7416,-0.3772,2.0937,-9.7416,5.6963,17.3391,8.0309,287
-3.1358,-9.9687,0.6382,2.0291,-9.9687,3.6012,9.4705,5.7012,288
-7.4609,-9.8714,-0.4857,3.3475,-9.8714,4.1,13.6938,7.5908,289
-1.6533,-10.1146,0.2672,1.6044,-10.1146,1.3591,9.0336,6.5612,290
-2.9981,-10.0988,0.4124,2.0586,-10.0988,0.8244,10.7772,5.4434,291
-1.1529,-10.0233,0.6844,1.2104,-10.0233,2.2805,12.6225,5.7599,292
-1.1188,-10.0113,-0.3096,0.4602,-10.0113,1.7159,5.4415,3.6776,293
-0.9736,-10.1752,-0.2462,0.5052,-10.1752,4.3712,10.646,8.6031,294
-2.4288,-10.0558,-0.1217,0.7121,-10.0558,2.2084,11.664,4.7435,295
-4.0995,-9.8934,0.147,1.7949,-9.8934,3.0635,11.0285,7.1625,296
-0.0018,-9.9601,0.0613,0.0527,-9.9601,0.5865,5.9865,2.8182,297
-2.8498,-9.8272,-0.4216,0.9201,-9.8272,0.7055,9.6607,6.5825,298
-3.4444,-9.8432,1.0914,2.5148,-9.8432,4.0629,15.4222,7.1177,299
-7.723,-9.7545,-0.4503,3.4702,-9.7545,2.051,8.0966,6.4779,300
-4.8959,-10.0702,-0.7933,2.1495,-10.0702,3.4193,9.3712,5.1365,301
-0.3985,-9.7795,0.1742,0.4649,-9.7795,1.0732,6.6868,5.0738,302
-0.875,-9.6995,-0.0127,0.5132,-9.6995,0.9557,5.2839,3.0031,303
-3.4306,-9.8191,0.2995,1.5484,-9.8191,3.4002,9.4997,5.8715,304
-1.517,-9.8492,0.6029,1.2475,-9.8492,1.2249,14.5257,8.6856,305
-0.142,-10.0882,0.4935,0.612,-10.0882,2.0003,17.0242,14.8501,306
-2.0571,-9.8404,0.8819,1.7751,-9.8404,4.8668,15.4627,8.1789,308
-0.8426,-9.836,-0.1918,0.3629,-9.836,1.4853,15.0226,12.7032,309
-0.8926,-9.7963,1.0044,1.3675,-9.7963,1.0753,10.4338,7.336,310
-1.0325,-9.8121,-0.3447,0.6754,-9.8121,0.8131,21.9537,20.8252,311
-3.2505,-9.8558,-0.1432,1.3436,-9.8558,2.8426,7.6482,5.4573,312
-1.1734,-9.8979,0.7986,1.4617,-9.8979,1.4838,6.142,5.3926,313
-1.4899,-9.8522,0.2848,0.8364,-9.8522,1.2571,4.2202,2.9502,315
0.2369,-9.8515,0.743,0.315,-9.8515,0.435,3.1189,2.7796,316
1.0518,-9.8599,1.2459,0.137,-9.8599,0.1146,3.5842,3.4827,317
0.2992,-9.865,0.4356,0.0796,-9.865,0.1535,2.7815,2.7428,318
0.423,-9.8654,0.6054,0.1092,-9.8654,0.1934,2.9889,2.8531,319
0.321,-9.8644,0.408,0.042,-9.8644,0.0877,2.7669,2.7058,320
0.3815,-9.8645,0.4381,0.0498,-9.8645,0.109,2.7808,2.6888,321
0.3729,-9.8644,0.5278,0.0839,-9.8644,0.1625,2.9875,2.7802,323
0.4263,-9.8637,0.4521,0.0251,-9.8637,0.0451,2.7513,2.7223,324
0.452,-9.8641,0.4936,0.025,-9.8641,0.0374,2.7955,2.7688,325
0.4326,-9.8648,0.4716,0.0255,-9.8648,0.0384,2.7817,2.7497,326
0.4843,-9.8669,0.5251,0.0472,-9.8669,0.0944,2.8512,2.7786,327
0.3663,-9.8644,0.3835,0.012,-9.8644,0.0208,2.6865,2.6781,328
0.4801,-9.8648,0.4989,0.0112,-9.8648,0.0132,2.7626,2.7522,329
0.3523,-9.8648,0.426,0.042,-9.8648,0.0939,2.7812,2.6976,330
0.3778,-9.8618,0.4582,0.0573,-9.8618,0.0967,2.7653,2.7209,331
0.3225,-9.8629,0.4436,0.0857,-9.8629,0.1637,2.7655,2.6984,332
-0.2256,-9.8637,0.5243,0.3801,-9.8637,0.7356,3.7436,2.7528,334
-1.1922,-9.8617,0.3855,0.6927,-9.8617,1.2069,4.0337,3.0399,335
0.0865,-9.8565,0.9178,0.6094,-9.8565,1.2967,5.5351,3.2864,336
-0.2283,-9.8645,3.1472,3.0047,-9.8645,4.5729,15.0136,7.781,337
-5.7729,-9.8989,-0.526,2.7235,-9.8989,2.2305,22.4523,7.0628,338
-14.4676,-9.7354,-0.9722,5.2082,-9.7354,5.1832,16.9536,8.2436,339
-3.3756,-9.8392,0.3016,1.9839,-9.8392,5.1925,17.1022,9.8881,340
0.0404,-9.7473,1.9373,2.1772,-9.7473,2.6275,11.4113,8.079,341
-15.7117,-9.1601,0.5917,4.8356,-9.1601,4.8478,36.0556,13.6374,342
-6.1134,-9.745,0.7534,3.104,-9.745,5.1263,17.2794,10.6718,343
-4.7607,-9.8669,1.6656,4.1582,-9.8669,6.7703,16.5872,11.9296,344
-1.71,-10.1361,0.1093,1.9801,-10.1361,1.5776,7.7127,4.3429,345
-0.6261,-9.779,0.4772,0.6942,-9.779,0.5081,9.6805,6.3234,346
-0.4899,-9.7507,-0.0605,0.2086,-9.7507,0.8233,5.8277,3.06,347
-5.2899,-9.7745,0.541,2.7233,-9.7745,0.959,9.5352,7.9062,348
-4.5825,-9.5938,0.779,3.7975,-9.5938,4.5681,15.1379,13.8133,349
-4.0247,-9.8689,0.1598,3.0712,-9.8689,5.2731,16.73,8.5862,350
-1.2685,-9.8456,3.8743,4.8092,-9.8456,2.5549,17.8348,10.6873,351
-10.7855,-9.8568,0.4804,3.2809,-9.8568,4.7324,19.078,8.5222,353
-6.6763,-9.796,0.0152,2.9542,-9.796,3.0317,12.3648,7.037,354
-0.6848,-9.5289,0.6505,1.3239,-9.5289,0.6305,11.0297,9.4211,355
-6.1147,-10.0847,0.0003,3.9132,-10.0847,3.1102,12.0855,8.2745,356
-2.6974,-9.9897,5.1236,7.8964,-9.9897,6.9056,20.5643,14.7866,357
-0.2825,-9.7518,2.369,2.7201,-9.7518,4.0307,11.5086,9.7892,358
-0.1893,-9.8843,0.1353,0.2477,-9.8843,0.6215,4.9988,4.2016,359
-1.6899,-9.9328,1.0873,2.2974,-9.9328,4.2969,11.2867,8.1702,360
-3.342,-10.1202,-0.1126,1.7291,-10.1202,0.9687,8.4606,6.565,361
-1.9093,-9.8928,0.1257,0.9598,-9.8928,2.4836,8.7461,4.888,363
-0.4369,-9.7641,0.1038,0.2714,-9.7641,1.0854,6.6777,4.0501,364
-1.5841,-9.7711,-0.0036,0.6423,-9.7711,0.8321,9.6777,3.8656,365
-4.9151,-9.8683,0.1313,2.4348,-9.8683,1.3352,9.0349,6.0523,366
-27.8144,-7.4384,-1.2908,11.592,-7.4384,4.3627,26.1811,16.5397,367
-4.1746,-9.945,-0.3229,2.0246,-9.945,0.6898,5.5956,4.5046,368
-7.5605,-8.9664,0.2737,4.4852,-8.9664,3.3931,17.523,9.9652,369
-2.3323,-9.9602,0.6624,2.0741,-9.9602,2.3557,12.3834,9.0838,370
-30.5893,-8.9383,-5.3139,12.5294,-8.9383,6.9844,22.6924,18.392,371
-2.8215,-9.9534,-0.8994,1.4665,-9.9534,2.3947,15.2631,5.0095,372
-12.5974,-9.747,0.8926,5.5931,-9.747,3.9284,12.7508,8.8256,373
-3.4903,-9.8222,0.2201,1.7241,-9.8222,2.4315,12.1745,5.7877,374
-3.2114,-9.9464,0.5771,2.8087,-9.9464,2.0092,15.8015,7.9416,375
-1.7837,-10.1135,-0.1765,1.3629,-10.1135,3.9615,16.0124,11.8411,376
-0.9505,-9.708,0.7254,1.1085,-9.708,1.5476,10.9577,6.2095,377
-0.482,-9.8902,2.1152,1.8108,-9.8902,1.612,11.0428,8.4835,378
-0.3479,-10.2375,-0.0086,0.2975,-10.2375,0.589,6.507,3.5966,379
-1.0387,-9.9175,0.0592,0.5843,-9.9175,2.2477,10.4562,5.7781,380
-7.8152,-10.1452,6.4961,11.3803,-10.1452,4.118,38.1948,23.1341,381
-0.2837,-9.8026,12.0286,12.7087,-9.8026,7.3065,56.0448,52.641,382
-16.5999,-10.4556,17.5405,28.1797,-10.4556,12.5801,69.7011,47.7643,383
-18.9224,-9.8778,11.0582,18.3379,-9.8778,8.0407,54.8988,28.7515,384
-2.2154,-9.8214,2.0624,3.0903,-9.8214,5.5444,19.8185,15.6014,385
-4.3726,-9.8533,-1.0674,2.6337,-9.8533,6.5047,18.8162,11.4899,386
-4.334,-9.9999,2.1328,6.41,-9.9999,7.0625,22.8637,14.1048,387
-2.7603,-9.4583,0.9389,4.1288,-9.4583,1.9297,12.209,7.2169,388
-4.3528,-9.856,0.1579,3.5615,-9.856,2.3044,11.9548,6.2278,389
-2.1281,-9.8167,1.4518,2.9483,-9.8167,4.1103,17.4879,14.3167,390
-1.1049,-9.7843,0.1863,0.8029,-9.7843,1.2907,12.6077,10.3847,391
-13.7284,-9.8697,2.0357,7.1237,-9.8697,7.964,23.7499,15.7193,393
-8.4395,-9.9419,6.128,12.1965,-9.9419,12.7774,33.736,30.1013,394
2.0144,-10.5882,18.9405,9.856,-10.5882,9.6792,40.0771,33.8719,395
-2.4883,-10.1068,0.3981,1.5451,-10.1068,1.091,8.8035,6.5725,396
-1.8917,-9.3753,0.7387,2.258,-9.3753,5.6877,15.4317,10.1522,397
-0.3376,-9.9739,0.5388,1.0953,-9.9739,1.176,6.7035,5.717,398
-0.8455,-10.126,-0.0152,0.7406,-10.126,2.9394,13.8702,7.2618,399
-1.635,-9.8585,2.0964,3.2481,-9.8585,5.5753,12.6173,7.8347,400
-49.487,-9.7474,2.7839,11.9224,-9.7474,8.9014,52.28,22.0851,403
-14.1439,-10.1501,9.907,19.1624,-10.1501,7.138,35.4843,16.4768,404
-3.5211,-10.3172,-0.6445,1.217,-10.3172,3.0814,23.4111,20.6722,405
-5.9109,-9.8681,8.296,14.8161,-9.8681,2.6809,37.1785,24.1561,406
-0.7948,-9.7905,0.7363,0.9398,-9.7905,3.3911,11.3187,8.288,407
-0.7178,-9.7323,0.081,0.6919,-9.7323,2.1622,6.1597,3.92,408
-1.2748,-9.4683,-0.3996,0.6724,-9.4683,1.306,9.271,6.56,409
-6.3461,-9.8494,-0.1752,1.7673,-9.8494,2.7701,11.5157,5.8039,410
-3.8336,-9.7843,0.5213,2.5496,-9.7843,1.1231,12.2688,7.6861,411
-1.467,-9.8626,0.0688,0.6857,-9.8626,2.0912,8.8,4.052,413
-4.5529,-9.8116,-0.1061,1.4766,-9.8116,3.272,9.674,6.0166,414
-0.0281,-9.8029,0.5968,0.6073,-9.8029,1.9197,12.1715,9.6701,415
-0.6919,-9.861,2.3131,1.7139,-9.861,0.582,9.9278,8.5659,416
-1.7951,-9.6591,0.5442,1.7183,-9.6591,1.1198,7.0872,5.3409,417
-1.5748,-9.7788,0.1085,1.2779,-9.7788,0.7627,10.0051,8.6101,418
-0.4307,-9.8198,-0.1649,0.1977,-9.8198,0.5156,13.2822,9.7749,419
-3.7566,-9.9693,2.6923,3.6805,-9.9693,5.7156,25.9621,16.8945,420
-9.8465,-10.0254,5.2435,7.7525,-10.0254,2.1515,21.8456,16.2693,421
-4.173,-9.9193,-0.5867,1.1337,-9.9193,1.518,12.0495,4.6783,423
-0.6969,-9.9044,0.5432,0.8935,-9.9044,0.7766,6.017,5.087,424
-1.3677,-9.9,4.6162,3.9657,-9.9,1.4826,22.6185,17.2251,425
-9.7681,-9.9463,-3.048,4.0533,-9.9463,2.3714,15.2088,6.9689,426
-2.6191,-9.8927,0.8049,2.8792,-9.8927,1.7247,12.9991,11.066,427
-5.2148,-9.1075,3.8352,9.7981,-9.1075,3.6842,36.6829,14.5534,428
-9.1799,-9.7268,-1.1606,4.2686,-9.7268,3.736,14.0147,8.1139,429
