AYGX_min,AZ_mean,AYGX_mean,AYGX_std,AZ_mean,GX_std,Gnorm_max,Gnorm_median,timestamp
-0.3257,-10.0118,-0.0614,0.253,-10.0118,0.5679,1.782,1.3724,363
-0.2572,-10.0095,-0.161,0.0619,-10.0095,0.1534,1.4551,1.4121,364
-0.5208,-10.0092,-0.295,0.0796,-10.0092,0.1519,1.7365,1.5272,365
-0.4116,-10.0127,-0.1002,0.275,-10.0127,0.6524,1.6269,1.4532,366
-0.8703,-10.0118,-0.1271,0.2728,-10.0118,0.646,2.4075,1.3224,367
-0.1311,-10.0126,-0.115,0.0228,-10.0126,0.0254,1.3761,1.3601,368
-0.1986,-10.0144,-0.1223,0.0453,-10.0144,0.1356,1.4232,1.3533,369
-0.1304,-10.0147,-0.0982,0.0232,-10.0147,0.0738,1.3689,1.3483,370
-0.2377,-10.0156,-0.171,0.0322,-10.0156,0.1243,1.4982,1.3938,371
-0.0859,-10.0169,-0.0681,0.018,-10.0169,0.0613,1.3665,1.3093,372
-0.1184,-10.0149,-0.1006,0.0147,-10.0149,0.0434,1.4444,1.3695,373
-0.069,-10.0186,-0.0297,0.0282,-10.0186,0.1919,1.4023,1.2881,374
-0.1253,-10.0159,-0.0706,0.0235,-10.0159,0.0932,1.4197,1.3153,375
-0.2668,-10.0156,-0.1444,0.0592,-10.0156,0.2148,1.6542,1.4581,377
-4.752,-10.0087,-1.3937,1.68,-10.0087,1.73,6.9902,4.0976,378
-8.1322,-9.9708,-3.9464,3.859,-9.9708,3.6515,7.4903,4.8551,379
-1.3283,-9.9568,0.2689,1.0714,-9.9568,0.996,2.6872,1.7641,380
-1.144,-10.0384,0.4207,0.8397,-10.0384,0.9478,3.8977,2.7413,381
-0.3539,-9.9787,0.2349,0.3944,-9.9787,0.3776,1.4898,1.3341,382
-1.4854,-9.9942,-0.5372,0.7394,-9.9942,0.8081,2.0895,1.4873,383
-1.3258,-9.9931,-0.8627,0.3941,-9.9931,0.489,2.0554,1.9004,384
-0.8339,-9.9892,-0.719,0.0578,-9.9892,0.065,1.72,1.6032,385
-7.2232,-9.9513,0.4864,4.3596,-9.9513,4.0916,6.448,4.4634,387
-1.4403,-9.9708,0.5676,1.4417,-9.9708,1.5423,4.8279,1.7436,388
-0.3897,-9.9775,0.2935,0.3374,-9.9775,0.432,1.5574,1.3108,389
-0.5964,-9.9863,0.6356,0.6501,-9.9863,0.824,2.6471,2.0809,391
-1.1838,-9.9791,-0.1611,0.7289,-9.9791,0.9221,3.0188,2.402,392
-1.7203,-9.9945,-0.7106,0.6208,-9.9945,0.8598,2.5396,1.6513,393
-0.2111,-9.9891,-0.0174,0.1347,-9.9891,0.1883,1.4029,1.2968,394
-5.8966,-9.9658,-2.6703,1.6982,-9.9658,1.6452,5.1268,3.9479,395
5.8348,-9.9665,7.6788,0.9387,-9.9665,1.5459,8.5297,7.595,396
-6.6272,-9.9931,-1.3503,2.0168,-9.9931,1.7804,6.9485,4.5458,397
-4.04,-9.9988,1.8422,4.4233,-9.9988,3.7101,13.5104,8.1758,398
-1.2197,-10.0326,-0.5265,0.4949,-10.0326,0.5777,8.4412,6.6462,399
-7.757,-9.9994,-0.699,4.4803,-9.9994,1.551,8.4197,5.8034,400
-0.113,-10.0163,0.2479,0.1722,-10.0163,0.5562,2.0591,1.5274,401
-0.7616,-10.0172,-0.6188,0.1188,-10.0172,0.1572,2.6479,2.4807,402
0.0599,-10.0131,0.123,0.0297,-10.0131,0.103,1.4102,1.3523,403
0.0522,-10.0122,0.1098,0.0396,-10.0122,0.1094,1.9168,1.4286,404
-9.5854,-9.9954,-2.5447,3.9388,-9.9954,3.5624,10.4991,7.2499,405
-2.26,-10.0128,0.4344,1.6403,-10.0128,2.8329,6.9967,4.598,407
-2.0462,-10.0255,0.0979,0.8456,-10.0255,2.8632,4.732,2.821,408
-7.6091,-9.9969,0.1254,3.1601,-9.9969,5.7476,10.5474,5.4086,409
-5.1205,-9.9827,-1.5438,2.2771,-9.9827,1.9844,6.0895,4.1983,410
-1.305,-10.0061,0.0561,0.4953,-10.0061,0.4541,3.2688,2.2957,411
-3.2549,-10.0337,-0.1795,1.9189,-10.0337,1.8418,6.6314,5.1376,412
-0.2748,-10.0138,0.0262,0.175,-10.0138,0.4936,1.4844,1.3923,413
-0.2617,-10.0168,-0.2077,0.0414,-10.0168,0.1455,1.6733,1.5972,414
-0.1158,-10.0134,-0.0475,0.0554,-10.0134,0.1976,1.3789,1.2977,415
-0.1893,-10.0171,-0.1217,0.0329,-10.0171,0.1144,1.4637,1.3447,416
-0.196,-10.0203,-0.1419,0.0383,-10.0203,0.145,1.567,1.3942,417
-0.9494,-10.0143,-0.2023,0.2878,-10.0143,1.4074,4.1282,1.5848,419
-0.0994,-10.0138,-0.0063,0.0459,-10.0138,0.1448,1.3533,1.2747,420
-0.263,-10.0157,-0.1667,0.0577,-10.0157,0.1854,1.5067,1.375,421
-0.2357,-10.0143,-0.1464,0.0526,-10.0143,0.1288,1.3789,1.2712,422
-0.183,-10.0129,-0.1513,0.0307,-10.0129,0.0966,1.3967,1.374,423
-0.4414,-10.0114,-0.3903,0.0455,-10.0114,0.1464,1.682,1.6047,424
-0.2355,-10.0137,-0.2146,0.0096,-10.0137,0.0184,1.3905,1.3699,425
-0.0656,-10.0149,0.0671,0.0995,-10.0149,0.2993,1.5364,1.3086,427
-0.6025,-10.0144,-0.2879,0.1993,-10.0144,0.5443,1.983,1.6191,428
-0.3096,-10.0142,-0.0816,0.1266,-10.0142,0.402,1.6125,1.2802,429
-0.3806,-10.0169,-0.2787,0.0689,-10.0169,0.0903,1.7582,1.6176,430
-0.1799,-10.0124,-0.153,0.0216,-10.0124,0.0723,1.4159,1.3511,431
-0.2363,-10.0118,-0.187,0.0335,-10.0118,0.0938,1.4267,1.3699,432
-0.3167,-10.0128,-0.1276,0.1301,-10.0128,0.4306,1.5923,1.3556,433
-0.2215,-10.0113,-0.1363,0.0543,-10.0113,0.1546,1.4355,1.3274,434
-0.3965,-10.0118,-0.2991,0.0538,-10.0118,0.1276,1.5411,1.4752,435
-0.641,-10.0129,-0.2556,0.2234,-10.0129,0.5832,2.0192,1.553,437
-0.3278,-10.0126,-0.0942,0.1622,-10.0126,0.4468,1.6555,1.3848,438
-0.1959,-10.0138,-0.1065,0.0425,-10.0138,0.0894,1.4173,1.3341,439
-0.3557,-10.0117,-0.1857,0.1344,-10.0117,0.3249,1.4881,1.3548,440
-0.375,-10.0117,-0.2525,0.0673,-10.0117,0.133,1.5997,1.5286,441
-0.0429,-10.009,0.0181,0.0421,-10.009,0.1166,1.2986,1.2851,442
-0.2594,-10.0111,-0.1915,0.0387,-10.0111,0.0739,1.3883,1.3686,443
-0.2001,-10.0101,-0.1703,0.0176,-10.0101,0.0355,1.3589,1.3411,444
-0.2541,-10.0113,-0.2327,0.018,-10.0113,0.0369,1.4623,1.4065,445
-0.2851,-10.0101,-0.2187,0.0258,-10.0101,0.056,1.4531,1.3779,447
-0.1672,-10.0111,-0.066,0.0612,-10.0111,0.1576,1.3374,1.2797,448
-0.1783,-10.0164,-0.114,0.044,-10.0164,0.135,1.4615,1.3409,449
-0.2047,-10.013,-0.1637,0.0252,-10.013,0.0436,1.5826,1.5175,450
-0.425,-10.0114,-0.3333,0.0628,-10.0114,0.158,1.6182,1.4889,451
-0.2702,-10.0132,-0.1455,0.1001,-10.0132,0.2452,1.5481,1.29,452
-0.2227,-10.0125,-0.1872,0.0289,-10.0125,0.0589,1.3884,1.366,453
-0.0408,-10.01,0.027,0.0433,-10.01,0.1438,1.6018,1.2881,454
-0.4208,-10.0176,-0.0582,0.1565,-10.0176,0.7314,1.8942,1.3453,455
-10.0844,-10.0024,0.5464,2.832,-10.0024,4.395,9.5147,3.2092,457
-2.6492,-10.0074,-0.617,0.9695,-10.0074,1.7858,3.8753,2.0623,458
-1.3645,-10.0047,-0.5569,0.6033,-10.0047,0.9298,2.6838,1.7781,459
-0.077,-10.0133,0.0702,0.1266,-10.0133,0.4156,1.6095,1.3665,460
-0.54,-10.0116,-0.3474,0.1109,-10.0116,0.2621,1.7256,1.5448,461
-0.3028,-10.01,-0.2557,0.0329,-10.01,0.0714,1.4438,1.3935,462
-0.314,-10.011,-0.2718,0.0333,-10.011,0.0486,1.5112,1.4508,464
-0.3863,-10.0111,-0.2996,0.0551,-10.0111,0.0988,1.6643,1.5446,465
-0.0973,-10.0172,-0.0534,0.0308,-10.0172,0.0887,1.3513,1.2518,466
-0.4623,-10.0102,-0.1696,0.1175,-10.0102,0.2736,1.6242,1.3079,467
-0.6435,-10.0091,-0.2124,0.1889,-10.0091,0.3648,1.869,1.3088,468
-0.2376,-10.0094,-0.1932,0.026,-10.0094,0.0535,1.3894,1.3346,469
-0.227,-10.0097,-0.1605,0.0497,-10.0097,0.1159,1.3721,1.2969,470
-0.4408,-10.0085,-0.363,0.0622,-10.0085,0.1426,1.562,1.4593,471
-0.4867,-10.0062,-0.2672,0.1496,-10.0062,0.2786,1.5532,1.3007,472
-0.3457,-10.0058,-0.3164,0.0321,-10.0058,0.058,1.4398,1.4225,473
-0.2135,-10.0079,-0.131,0.0458,-10.0079,0.0974,1.3194,1.3069,474
-1.1662,-10.004,-0.8309,0.1577,-10.004,0.2506,2.1449,1.8868,475
-0.1587,-10.0072,0.2816,0.2055,-10.0072,0.4834,1.898,1.4067,477
-3.9734,-10.013,-1.0314,1.3985,-10.013,2.5534,6.5916,2.0002,478
-2.708,-9.9953,-1.7829,0.5552,-9.9953,0.4629,6.4469,5.5819,479
-0.9941,-9.988,0.4957,0.9054,-9.988,1.1947,3.7394,3.3169,480
-5.3855,-9.9012,2.5268,4.5598,-9.9012,4.2152,17.3944,11.2821,481
-2.7999,-10.2165,-0.4902,1.3303,-10.2165,4.8381,28.7644,23.0093,482
-2.0333,-9.901,-0.2303,1.4263,-9.901,2.8766,7.7593,6.4036,483
-2.6746,-10.0025,7.9505,7.8495,-10.0025,5.3239,34.641,27.3368,484
-2.1204,-10.3638,1.2892,3.0644,-10.3638,6.3192,42.1982,38.3784,485
-4.3696,-10.0352,1.1685,2.7182,-10.0352,5.3266,27.014,9.3823,487
-8.3103,-10.0125,1.2723,5.3973,-10.0125,9.3753,22.9443,14.9333,488
-0.0323,-9.4491,11.7776,7.9912,-9.4491,6.0208,20.3484,16.8588,489
-3.5911,-10.0333,-0.9562,1.5753,-10.0333,3.3233,13.8653,8.3239,490
-6.6586,-10.1498,0.5093,4.2806,-10.1498,5.0395,16.6367,9.3136,491
-0.0126,-10.2025,8.2317,6.4576,-10.2025,5.2145,15.9756,13.6722,492
-6.0206,-10.0176,-0.7962,1.9627,-10.0176,5.793,17.4933,14.3714,493
-4.5441,-10.0862,2.3858,4.9257,-10.0862,3.7757,16.5954,12.5896,494
-7.4077,-9.9082,-1.0303,2.8305,-9.9082,4.3614,15.0552,5.6152,495
-7.1655,-9.9875,3.0351,5.934,-9.9875,8.5615,23.2703,13.1388,497
-2.1224,-10.1601,1.363,3.5465,-10.1601,6.4923,19.6459,8.3654,498
-0.3752,-9.8926,2.3531,1.8648,-9.8926,1.3723,17.9887,11.3015,500
-0.1321,-10.1045,3.1244,2.4386,-10.1045,1.2589,15.3227,10.9727,501
-16.2258,-9.968,0.2332,11.0706,-9.968,4.6457,19.6487,17.1277,502
-4.3461,-10.1397,-1.1135,1.7608,-10.1397,1.3566,12.2373,7.3702,503
-3.788,-9.8452,2.3407,3.9329,-9.8452,5.2093,16.3859,12.6833,504
-2.1865,-10.0769,1.1894,2.2247,-10.0769,2.7036,12.0937,8.0246,505
-1.9406,-9.9104,-0.1192,1.1181,-9.9104,1.4213,10.9894,5.2182,506
-16.8091,-10.0487,2.6773,9.8912,-10.0487,8.2768,22.529,15.5747,507
-10.6768,-9.9026,0.2435,4.2035,-9.9026,4.4997,18.746,6.9576,508
-1.7284,-9.992,0.0402,1.1777,-9.992,1.9419,10.4526,7.7804,509
-1.3873,-9.8377,0.7037,1.065,-9.8377,4.1605,11.5465,10.0249,510
-1.6887,-10.0507,0.4378,1.5634,-10.0507,3.0594,10.0029,6.6539,511
0.2659,-10.2285,3.0193,2.0633,-10.2285,4.0355,12.6217,10.408,512
-6.4325,-9.9299,-0.3298,3.1396,-9.9299,5.2229,14.3227,10.257,513
-1.5625,-10.2104,0.5308,1.8514,-10.2104,1.9981,14.7491,12.2944,514
-8.6446,-8.933,-0.2005,4.7544,-8.933,2.4689,19.9921,8.2398,515
-54.0306,-5.9862,6.6933,29.3235,-5.9862,14.1598,45.0709,25.4847,517
-11.4229,-10.0183,-0.5135,4.7084,-10.0183,6.8035,19.2381,10.7678,518
-7.618,-10.022,0.5566,4.4478,-10.022,1.0573,16.7633,11.588,519
-2.2674,-10.343,0.6453,2.5498,-10.343,4.2034,15.2019,12.2145,520
0.2856,-10.3496,4.9219,6.955,-10.3496,6.5828,20.3075,15.9044,521
-3.6906,-9.2898,-0.0935,1.6892,-9.2898,3.8902,22.3681,6.3778,522
-1.7672,-9.3545,7.2608,9.174,-9.3545,8.8585,21.8997,18.1656,523
-7.4778,-9.4545,3.434,7.7653,-9.4545,6.6572,31.3567,18.2357,524
-2.3704,-10.0926,2.1576,2.5539,-10.0926,2.6831,14.8056,9.2552,525
-4.0581,-9.9687,6.7197,10.147,-9.9687,8.4043,26.5385,14.0374,527
-8.2642,-9.9089,1.1731,5.8425,-9.9089,4.5613,17.1296,11.6625,528
-10.6734,-10.0605,1.4824,7.9384,-10.0605,8.8167,24.6622,19.2147,529
-5.4392,-9.3923,1.541,5.1238,-9.3923,3.8487,14.9176,12.2944,530
-10.5043,-10.1232,-0.9574,3.6864,-10.1232,2.7202,11.7783,7.367,531
-15.0434,-9.7644,-0.6687,5.8058,-9.7644,5.3971,19.8811,8.5416,533
-10.3827,-10.0314,0.3839,5.0688,-10.0314,5.949,21.3575,9.6689,534
-0.2255,-10.0724,5.1064,9.0995,-10.0724,4.7239,24.6952,21.0487,536
-2.0589,-9.2441,-0.7439,0.9335,-9.2441,2.7941,17.64,8.331,537
-3.7042,-9.9728,1.111,3.6482,-9.9728,2.6906,11.9044,7.2863,538
-8.157,-9.7048,1.9886,7.6936,-9.7048,5.5301,21.0303,16.0653,539
-2.4982,-9.7516,1.2895,3.4279,-9.7516,4.1961,15.4429,5.0141,540
-1.7296,-9.9776,1.8681,2.6851,-9.9776,4.0795,8.8535,7.4759,541
-7.2812,-9.6311,1.3575,5.5803,-9.6311,6.8657,16.1579,14.4976,542
-7.53,-10.2941,-2.7943,3.7684,-10.2941,3.9089,16.0291,9.2545,543
-8.5254,-10.3784,-1.144,4.4185,-10.3784,6.1452,45.1927,21.987,544
-9.3583,-10.0034,0.2095,6.6333,-10.0034,6.56,18.2762,7.6738,545
-2.7068,-10.1275,3.3774,8.0171,-10.1275,13.9137,26.0415,22.5913,546
-11.1308,-10.0645,-0.5486,3.2477,-10.0645,3.7485,13.4323,5.3708,547
-3.8959,-10.1746,2.9147,6.1282,-10.1746,3.185,15.3487,10.3572,548
-1.4414,-9.7648,1.6232,2.9723,-9.7648,4.9644,16.2205,14.6068,549
-1.775,-9.8068,5.805,4.691,-9.8068,4.0542,19.182,14.3034,550
0.1453,-9.3626,5.4989,6.4817,-9.3626,6.2545,19.4591,17.0856,551
-0.3581,-9.9379,-0.0665,0.2359,-9.9379,0.941,3.7698,2.2475,552
-14.0296,-9.8971,1.5664,6.4615,-9.8971,2.8648,19.1747,9.6508,553
-6.2489,-10.3254,-0.4983,4.5509,-10.3254,2.5649,11.9105,7.5092,554
-1.9178,-10.034,1.3604,2.3965,-10.034,4.751,14.6329,6.5906,555
-14.8437,-10.1199,1.4802,8.5029,-10.1199,10.2465,26.2226,14.095,557
-4.4286,-10.1445,2.2018,3.8706,-10.1445,3.4798,18.2676,7.1148,558
-3.4336,-10.2323,-0.2355,2.3002,-10.2323,2.112,10.4233,6.6798,559
-1.4712,-10.136,0.7036,1.7908,-10.136,2.8077,9.2246,7.0145,560
-5.1998,-9.4322,-1.1085,2.6055,-9.4322,2.7012,9.2996,7.3731,561
-6.3735,-10.047,-0.1305,3.7756,-10.047,2.5415,10.7087,7.5967,562
-1.8949,-10.1221,0.3784,1.6824,-10.1221,2.5732,12.9985,6.1582,563
-2.1068,-10.0429,1.5522,3.7471,-10.0429,4.2181,15.6119,7.5603,564
-2.7762,-10.0445,3.8834,4.3411,-10.0445,3.118,14.0314,10.3937,565
-8.9445,-10.0804,3.0506,5.8446,-10.0804,8.1583,22.747,12.8463,567
-7.986,-10.0092,4.1252,6.3915,-10.0092,7.8865,27.0522,11.4707,568
-5.7538,-10.2152,-2.1423,2.25,-10.2152,4.2122,12.3885,7.3544,569
-0.8388,-10.038,0.3506,1.0534,-10.038,1.9477,5.2349,3.5661,570
-0.5002,-10.199,1.6415,1.5886,-10.199,3.252,9.1991,5.5684,571
-1.4185,-9.8826,1.858,3.3898,-9.8826,3.6678,19.024,8.4834,573
-1.9583,-10.027,0.9296,2.4995,-10.027,4.7812,13.6115,7.0554,574
-2.2688,-9.665,1.9397,2.6096,-9.665,2.9437,15.1706,7.748,575
-2.7087,-10.3013,3.7139,6.6781,-10.3013,5.033,17.7312,12.6325,576
-14.4975,-9.9955,5.2281,11.7363,-9.9955,9.8372,29.6874,15.371,577
-19.5504,-10.0062,-0.295,6.0369,-10.0062,5.3654,23.118,9.9685,578
-1.162,-9.9617,1.945,3.7743,-9.9617,2.6684,10.1671,8.6363,579
-5.2895,-9.8177,1.3555,3.4244,-9.8177,4.6735,13.9174,9.0587,580
-11.7131,-9.8959,-3.0518,5.3103,-9.8959,4.2704,13.9026,9.0577,581
-4.3181,-9.6008,0.6751,3.4141,-9.6008,4.6457,16.9574,8.9887,582
-0.9951,-10.4715,2.7617,3.5109,-10.4715,4.8224,15.4294,13.1322,583
-0.9136,-9.8457,-0.0817,0.4129,-9.8457,1.0613,6.596,3.2782,584
-1.7218,-9.872,2.4317,3.6761,-9.872,3.6112,20.8672,9.1938,585
-0.1202,-9.9319,0.0653,0.1254,-9.9319,0.8068,8.0283,4.7634,586
-1.5493,-10.0608,0.0379,0.9322,-10.0608,0.9714,7.2857,4.1641,587
-1.7104,-10.0123,0.6369,1.3867,-10.0123,3.2475,11.0668,7.0377,588
-1.4959,-10.0462,-0.0793,0.9459,-10.0462,1.318,7.0936,4.1374,589
-1.8258,-9.799,0.6798,1.2314,-9.799,1.361,8.9189,5.1577,590
-1.5173,-9.8029,0.5956,2.1625,-9.8029,1.8941,11.1403,7.0692,591
-0.744,-10.2695,0.0706,0.7801,-10.2695,1.265,8.3649,6.7577,592
-0.151,-9.944,0.0262,0.0993,-9.944,0.5195,11.1301,3.1365,593
-0.7884,-9.848,-0.0703,0.5289,-9.848,1.2182,6.9951,4.5524,594
-4.099,-10.1618,0.5082,2.2603,-10.1618,2.4833,12.4801,8.4192,595
-2.5234,-10.019,0.626,1.3518,-10.019,2.7882,23.8233,10.6394,597
-3.8705,-10.0339,-2.1496,1.5915,-10.0339,0.914,6.4153,6.0388,598
-2.2815,-9.9761,-0.3197,1.779,-9.9761,2.2934,3.3834,2.8792,599
-0.0594,-10.0012,2.1266,2.1427,-10.0012,0.8868,6.7876,6.0467,600
-5.7362,-9.988,-3.0827,1.8818,-9.988,1.9905,5.7974,3.2166,601
-1.2237,-10.0066,-0.14,0.6985,-10.0066,2.497,4.191,2.4473,602
-2.9104,-10.0006,-1.2883,0.9609,-10.0006,0.8778,3.32,1.8547,603
-4.4953,-9.9995,-0.89,1.7057,-9.9995,2.1705,4.8574,1.914,604
-0.761,-9.9818,-0.6454,0.0588,-9.9818,0.0566,1.6318,1.5524,605
-0.4231,-9.9945,-0.3522,0.0507,-9.9945,0.0569,1.349,1.3241,607
-0.427,-9.9925,0.0963,0.4233,-9.9925,0.6307,1.7038,1.3249,608
-0.5548,-10.0012,-0.2442,0.2475,-10.0012,0.434,1.4874,1.3809,609
-0.3476,-10.0006,-0.3043,0.0338,-10.0006,0.0516,1.3714,1.3387,610
-0.3581,-10.0011,-0.3107,0.0424,-10.0011,0.0623,1.4236,1.3686,611
-0.6149,-9.9992,-0.4933,0.0802,-9.9992,0.1287,1.4843,1.4275,612
-0.2436,-10.0043,-0.0933,0.1129,-10.0043,0.2116,1.3143,1.2818,613
-0.4169,-10.0039,-0.2426,0.1236,-10.0039,0.2142,1.4518,1.3257,614
-1.1603,-10.0108,-0.1802,0.4051,-10.0108,0.8016,1.9485,1.4071,615
-0.383,-10.0104,-0.22,0.0777,-10.0104,0.1604,1.467,1.3603,617
-0.3964,-10.0109,-0.2417,0.0746,-10.0109,0.1397,1.4889,1.3865,618
-0.4555,-10.0095,-0.3064,0.0905,-10.0095,0.1776,1.5639,1.4635,619
-0.7687,-10.0066,-0.6169,0.0883,-10.0066,0.1386,1.8886,1.7907,620
-0.4509,-10.0057,-0.3363,0.0527,-10.0057,0.1004,1.4888,1.4127,621
-0.4243,-10.0036,-0.3249,0.0781,-10.0036,0.1303,1.4281,1.4066,622
-0.5325,-10.0016,-0.4958,0.029,-10.0016,0.0389,1.5451,1.5155,623
-2.5118,-9.99,-1.8235,0.5849,-9.99,0.6983,3.1441,2.3586,624
-0.8114,-9.9937,-0.025,0.3685,-9.9937,0.4455,1.4496,1.3553,625
-1.6462,-9.9928,-1.3867,0.2318,-9.9928,0.2615,2.339,2.2241,626
-0.6544,-9.9909,-0.588,0.0715,-9.9909,0.0843,1.5135,1.467,627
-0.4925,-9.9983,-0.232,0.2643,-9.9983,0.4,1.4594,1.3823,629
-0.6139,-9.9983,-0.2878,0.2045,-9.9983,0.3159,1.5195,1.35,630
-0.3513,-9.9984,-0.2039,0.082,-9.9984,0.1196,1.3768,1.3219,631
-0.3982,-10.001,-0.2541,0.0608,-10.001,0.0914,1.3886,1.3172,632
-0.5829,-9.9993,-0.4917,0.0615,-9.9993,0.0905,1.5473,1.4798,633
-0.4161,-10.0002,-0.372,0.0418,-10.0002,0.0533,1.4385,1.3816,634
-4.2613,-9.9799,-3.0169,0.9315,-9.9799,0.8656,4.5209,3.7048,635
0.1635,-9.9802,0.5476,0.1984,-9.9802,0.2449,1.6223,1.4661,637
0.0989,-9.9962,0.5038,0.3291,-9.9962,0.608,2.4247,1.4381,638
-0.5741,-10.014,-0.0727,0.4176,-10.014,1.2995,2.2153,1.6883,639
-1.2017,-9.9939,-0.5793,0.3794,-9.9939,0.4482,1.9513,1.4337,640
-0.2588,-9.9936,0.1694,0.4432,-9.9936,0.6436,2.1631,1.2184,641
-0.5752,-10.0033,-0.3281,0.2342,-10.0033,0.4179,1.6161,1.4013,642
0.2493,-10.011,0.2681,0.0137,-10.011,0.0522,1.4402,1.4224,643
-0.1977,-10.0129,-0.0479,0.0595,-10.0129,0.1463,1.4436,1.252,645
-0.237,-10.0139,-0.1379,0.0569,-10.0139,0.1857,1.4628,1.3587,646
-0.2857,-10.0138,-0.1873,0.0399,-10.0138,0.1032,1.506,1.4142,647
-1.0134,-10.012,-0.466,0.3273,-10.012,0.7058,2.6205,1.9428,648
-0.6359,-10.0088,-0.4822,0.1276,-10.0088,0.2177,1.9028,1.6527,649
-0.4727,-10.0003,-0.3728,0.0539,-10.0003,0.0775,1.4199,1.373,650
-0.2687,-10.005,-0.1332,0.0756,-10.005,0.1319,1.34,1.2878,651
-0.3829,-10.0063,-0.2998,0.0387,-10.0063,0.0643,1.4125,1.3748,652
-0.3456,-10.0067,-0.2153,0.0862,-10.0067,0.1481,1.3836,1.312,653
-0.2849,-10.0069,-0.2667,0.0172,-10.0069,0.0272,1.367,1.3562,654
-3.8791,-10.0004,-2.3409,0.8364,-10.0004,0.9367,6.3241,4.214,655
2.754,-9.998,3.7723,0.5599,-9.998,0.2479,5.4348,5.1983,656
-3.7271,-10.0349,0.2834,2.3833,-10.0349,4.5049,24.3397,11.3703,657
-7.9645,-10.0253,0.9087,4.7594,-10.0253,2.1707,32.5568,5.6904,658
-2.6066,-9.9497,0.6156,1.9725,-9.9497,0.4715,14.2344,9.8847,659
1.3549,-9.8,4.5424,2.1115,-9.8,0.8387,12.8361,7.9005,660
-0.2046,-10.2201,17.5529,13.9099,-10.2201,3.2886,23.0643,20.7009,661
-17.1911,-10.0793,0.748,9.0394,-10.0793,3.4256,17.0342,12.8888,662
-4.0751,-10.1325,1.6492,3.7027,-10.1325,6.2361,23.5429,11.7673,663
-2.0647,-10.0643,0.0364,1.8531,-10.0643,3.7518,11.9462,4.1877,664
-12.1363,-9.8948,15.3396,19.0608,-9.8948,11.6486,34.4493,25.9336,665
-5.8555,-10.1144,1.1134,4.0105,-10.1144,5.5197,15.2576,10.3261,667
-5.0855,-10.0348,0.058,2.0318,-10.0348,4.4394,24.4955,10.99,668
-12.8037,-10.0048,1.3519,7.2759,-10.0048,7.3464,22.1447,13.5329,669
-1.497,-9.8114,0.0365,1.4334,-9.8114,1.4147,7.7736,4.084,670
-4.1365,-9.9145,0.6837,2.985,-9.9145,1.419,14.9262,9.0444,671
-0.9536,-10.0305,0.8663,2.033,-10.0305,4.9386,14.6618,12.2437,672
-1.6717,-9.9944,0.0335,0.9464,-9.9944,1.4285,6.5751,4.8729,673
-2.7153,-9.9905,0.5791,1.43,-9.9905,3.1578,8.9847,5.8638,674
-1.1552,-9.8543,3.1549,2.7477,-9.8543,8.3642,20.0733,12.1144,675
-1.6197,-10.039,0.2251,0.8333,-10.039,2.5994,9.42,4.2976,677
-3.1687,-10.0428,0.3447,1.6805,-10.0428,2.4813,11.5533,6.6016,678
-3.0292,-9.9523,0.7597,2.1914,-9.9523,1.2249,10.3879,7.1328,679
-0.6998,-9.7507,0.0808,0.6365,-9.7507,1.6321,6.7491,5.1189,681
-0.6582,-9.8535,-0.166,0.3942,-9.8535,0.3281,4.7904,3.2283,682
-0.873,-10.2564,0.2719,0.9493,-10.2564,1.1049,8.8862,7.0807,683
-0.6632,-9.8387,-0.209,0.4758,-9.8387,0.3986,4.2725,3.1019,684
-1.4636,-10.3285,0.1259,1.0154,-10.3285,2.8048,8.9083,5.566,685
-2.4114,-10.2681,0.0331,1.4038,-10.2681,0.6978,8.7597,5.1565,686
-1.5988,-10.0758,1.1082,1.9605,-10.0758,3.3106,19.0195,7.371,687
-15.1881,-9.5595,1.3519,7.4249,-9.5595,8.3604,21.2492,13.6472,688
0.0338,-9.8424,2.1408,1.7552,-9.8424,2.2003,20.2595,13.2363,689
-2.3047,-9.7577,0.3631,1.4936,-9.7577,1.6886,8.775,7.2451,690
-0.4596,-9.8287,-0.0252,0.2369,-9.8287,0.7772,8.0069,6.1139,691
-4.5032,-10.4072,-0.6803,1.8578,-10.4072,1.661,8.0894,6.2454,692
-0.9668,-10.0654,0.3738,1.0549,-10.0654,2.8955,11.4614,8.2341,693
-1.5593,-9.8441,0.1907,1.0459,-9.8441,1.0889,8.096,4.031,694
-0.8189,-10.044,0.6635,1.0645,-10.044,2.8459,9.3419,5.4346,695
-3.7687,-9.621,2.2282,5.6997,-9.621,5.2931,29.0913,13.4918,697
-8.2902,-9.8508,2.818,6.7148,-9.8508,8.5898,27.4242,16.9417,698
-10.4775,-10.231,4.1031,7.1292,-10.231,2.6151,24.4502,14.0955,699
-2.0142,-10.3098,1.526,3.2442,-10.3098,5.2124,18.1458,13.1038,700
-1.2826,-9.8185,1.2447,1.615,-9.8185,3.1763,7.1188,6.2642,701
-1.9416,-9.5222,-0.1447,0.6384,-9.5222,1.4344,11.9135,3.3804,703
-3.2293,-10.0476,-0.0343,0.9783,-10.0476,2.8554,7.6527,3.9039,704
-1.861,-10.0416,1.5721,2.4998,-10.0416,5.4543,15.1877,9.8645,705
-7.3632,-9.9931,0.4539,3.8855,-9.9931,8.3953,16.801,11.7147,707
-11.3155,-10.1326,2.762,6.8314,-10.1326,8.6179,20.3381,12.1154,708
-2.8166,-10.0345,1.9441,3.5218,-10.0345,5.2151,16.8538,13.0782,709
-1.9769,-10.0776,-0.6185,0.7118,-10.0776,1.2963,5.3695,2.6904,710
-0.5636,-10.0611,0.3336,0.8862,-10.0611,2.7021,6.9156,6.1935,711
-4.107,-10.0741,1.2565,3.4553,-10.0741,3.3193,12.8263,9.3745,712
-1.5374,-9.9689,-0.041,0.673,-9.9689,1.5539,5.3329,2.6809,713
-4.2479,-10.0669,0.8348,3.1003,-10.0669,6.0427,13.7352,6.6017,714
-1.0931,-10.1304,0.19,0.6115,-10.1304,1.5605,8.5437,5.2909,716
-4.0978,-9.8032,0.9097,3.9517,-9.8032,1.2492,7.0774,5.317,717
-3.4229,-10.0766,0.364,1.9294,-10.0766,3.6186,14.0174,9.1721,718
-0.8868,-10.0513,0.7101,1.4141,-10.0513,2.4765,13.3275,7.7274,719
4.8341,-10.1815,7.8416,2.0862,-10.1815,1.4935,14.0179,12.1211,720
-1.0249,-10.1256,-0.1319,0.6143,-10.1256,1.2848,4.101,2.8838,721
-4.6058,-10.1527,0.9852,4.9458,-10.1527,3.5156,14.3485,6.1947,722
-1.0863,-10.2183,2.0038,2.591,-10.2183,1.108,10.3424,8.3259,723
-0.6856,-10.3505,10.3201,10.5916,-10.3505,6.9516,24.3627,15.9971,724
-6.5047,-10.1436,0.213,2.6694,-10.1436,3.8864,10.3805,8.53,725
-13.9896,-10.374,-2.8134,5.0957,-10.374,2.6313,10.6118,3.5262,726
-5.5569,-9.9977,2.6456,6.2763,-9.9977,8.4647,19.0351,10.9816,727
-6.281,-10.0253,-0.2321,2.2964,-10.0253,3.6617,10.5242,5.679,728
-5.2274,-10.1658,1.4672,5.7333,-10.1658,5.5014,16.4333,9.2458,729
-13.9064,-9.8253,-2.0093,8.0939,-9.8253,3.248,15.1745,10.5217,730
-2.6052,-9.6558,1.1174,2.3414,-9.6558,5.0351,16.1441,11.3361,731
-3.3189,-10.1357,9.1417,11.3502,-10.1357,4.2791,25.6613,15.8696,732
-29.67,-9.8999,-0.8751,10.7476,-9.8999,4.5772,16.281,10.5889,733
-0.8602,-9.6999,1.4807,1.6513,-9.6999,1.0102,12.8295,10.2115,734
-21.8199,-10.0066,2.305,10.4392,-10.0066,5.9347,24.0018,10.3422,735
-5.5515,-10.1951,2.0459,4.4991,-10.1951,5.1178,21.7012,10.6283,737
-3.9791,-10.0907,0.4426,2.1552,-10.0907,2.293,20.084,7.6077,738
-1.1733,-9.676,0.3485,1.0306,-9.676,2.2655,10.817,6.976,739
-5.8879,-10.2962,0.2686,3.6631,-10.2962,1.029,14.0426,10.8313,740
-6.4368,-10.2575,0.4643,4.1791,-10.2575,5.8781,16.5382,9.7358,741
-0.7103,-10.0734,2.1228,4.3189,-10.0734,5.687,20.4071,18.4719,742
-0.7958,-10.013,2.8276,2.5009,-10.013,3.1959,13.7742,8.9796,743
-2.265,-9.9096,1.5556,2.9138,-9.9096,4.8085,17.4621,9.3647,744
-0.516,-10.0616,5.2471,4.0826,-10.0616,2.9345,12.3701,9.506,745
-11.9927,-9.7851,2.8235,9.6924,-9.7851,6.4132,26.7132,7.1744,747
-2.8886,-10.078,0.0897,1.5102,-10.078,3.9072,10.7708,6.8966,748
-3.0174,-10.2417,-1.0901,1.9279,-10.2417,3.5113,14.0467,5.0567,749
-1.2045,-10.1613,0.037,0.8013,-10.1613,0.7297,5.4492,3.6105,750
-1.6528,-10.3056,0.3055,1.2063,-10.3056,0.7899,10.0302,4.3506,752
-1.352,-9.974,0.2206,0.8668,-9.974,2.5886,9.9259,5.3511,753
-1.8875,-10.2484,1.7904,2.7331,-10.2484,0.9565,10.7364,7.8936,754
-0.3233,-9.9591,0.7128,1.1826,-9.9591,3.3129,9.367,7.0584,755
-0.5225,-9.9641,-0.0301,0.2561,-9.9641,0.9255,9.6463,3.2942,756
-1.5561,-10.1487,0.1159,0.9311,-10.1487,3.1407,8.0048,4.2324,757
-8.6287,-10.1562,0.5575,3.7521,-10.1562,4.6526,20.495,10.0207,758
-2.4572,-10.1063,2.0425,2.4152,-10.1063,2.1115,23.1008,17.1429,759
-0.0542,-9.7881,0.2147,0.1762,-9.7881,0.9812,7.7468,5.4667,760
-0.2251,-9.9658,1.184,1.2076,-9.9658,2.9406,8.5625,7.0879,761
-0.824,-9.8462,1.4905,2.3303,-9.8462,0.7042,8.3698,6.3977,762
-4.5323,-10.1954,5.0091,7.3469,-10.1954,5.7928,26.3242,12.9422,763
-4.1633,-10.1941,0.6526,1.9804,-10.1941,2.527,11.4857,7.888,764
-3.4896,-10.2084,2.4239,4.5793,-10.2084,5.3483,17.6744,7.6251,765
-7.1797,-9.9613,0.3541,2.7027,-9.9613,5.06,15.1535,7.714,767
-7.0929,-10.0597,-0.2514,1.972,-10.0597,1.5596,26.2742,6.4969,768
-5.6946,-9.7987,1.0238,5.6274,-9.7987,2.5189,10.5178,8.1573,769
-0.4533,-10.2636,0.1471,0.5299,-10.2636,1.1534,11.0862,5.4086,770
-0.2168,-10.0052,1.8494,1.84,-10.0052,1.9641,11.1565,8.2437,771
-1.6567,-9.6172,0.2561,1.3374,-9.6172,0.9708,6.7873,5.9868,772
-1.9716,-9.9033,0.621,1.2094,-9.9033,3.892,14.5557,9.2498,773
-0.5729,-9.9649,0.4429,0.784,-9.9649,0.9393,5.0373,2.8685,774
-0.0314,-9.9708,0.9136,1.1964,-9.9708,2.8735,5.9752,4.9266,775
-1.5777,-10.0401,0.221,0.9326,-10.0401,3.0727,8.7356,5.1136,777
-2.0096,-10.0465,1.5515,1.9094,-10.0465,6.4539,13.1216,8.8729,778
-2.0239,-9.914,0.5459,2.3064,-9.914,3.5946,14.0814,8.3637,779
-2.0436,-9.3097,0.9907,2.2464,-9.3097,2.5885,24.7029,15.4117,780
-0.543,-10.0785,0.1776,0.4619,-10.0785,1.7197,6.036,4.0098,781
-1.3453,-9.8323,-0.4355,0.5689,-9.8323,1.1499,4.1703,3.6643,782
-0.4943,-10.1889,0.7152,1.1326,-10.1889,2.153,7.5235,6.1593,783
-2.9912,-10.0024,0.1523,1.3524,-10.0024,1.7175,7.3821,4.326,784
-11.2606,-10.0039,3.0051,9.0706,-10.0039,1.4961,14.9196,13.1118,785
-3.4528,-9.8924,3.978,5.189,-9.8924,5.4033,20.9661,13.5364,787
-3.328,-10.133,0.0458,1.6956,-10.133,3.7846,8.8693,5.3051,788
-1.2893,-10.0992,-0.3167,0.7299,-10.0992,1.3148,13.3853,8.6254,790
-0.9873,-10.3564,0.7853,1.8909,-10.3564,4.2054,10.9298,9.1866,791
-0.2029,-10.0252,0.4759,0.5726,-10.0252,1.9341,16.7261,13.5135,792
-0.357,-9.9656,-0.0689,0.1484,-9.9656,1.0199,3.9673,1.8766,793
-0.9446,-10.0741,1.771,1.5432,-10.0741,4.5384,13.7647,9.0144,794
-3.6429,-10.06,0.4238,1.4451,-10.06,1.4507,9.1914,4.4105,795
-2.9878,-9.9905,0.8934,2.3185,-9.9905,2.8913,11.622,5.2603,796
-2.7383,-10.0247,0.4143,1.9406,-10.0247,3.6676,8.0716,6.8232,797
-7.3248,-9.996,3.5561,8.8501,-9.996,10.5091,21.6891,15.9507,798
-1.2938,-10.0188,0.5885,1.2681,-10.0188,4.3604,13.5567,9.6729,799
-10.6746,-9.8619,2.5575,8.0588,-9.8619,1.8251,12.4556,10.798,800
-2.6984,-9.8985,1.4063,3.2306,-9.8985,3.3088,14.7463,8.1361,801
-2.1497,-9.9748,1.3592,2.3182,-9.9748,4.5607,11.0057,6.9842,803
-1.7589,-10.0129,1.4215,2.756,-10.0129,3.9228,13.9214,8.1309,804
-2.3029,-10.0245,0.1827,1.4262,-10.0245,2.8015,11.1962,3.5426,805
-19.2188,-10.0331,2.5453,12.5672,-10.0331,10.0706,28.2714,12.1088,807
-3.3895,-10.1136,0.4939,1.473,-10.1136,3.3797,11.9664,5.807,808
-1.7424,-9.883,-0.1667,0.8691,-9.883,3.5314,7.6742,5.1145,809
0.1072,-9.9635,0.9216,0.7817,-9.9635,1.4014,8.37,4.8267,810
0.0102,-10.1852,1.6573,1.5758,-10.1852,2.9896,14.5538,12.7799,811
-1.4019,-9.9119,1.9831,2.0903,-9.9119,1.3247,16.8381,14.3043,812
-3.4496,-10.0293,1.1178,2.1,-10.0293,4.1858,10.1715,7.6728,813
-1.3941,-9.9586,0.0784,1.321,-9.9586,2.2505,9.2353,8.9026,814
-1.4145,-10.0192,0.527,1.4765,-10.0192,2.9376,12.6731,8.2227,815
-2.9473,-9.9981,0.0206,0.9127,-9.9981,2.185,7.7578,3.5584,817
-5.6357,-9.9954,0.4414,2.229,-9.9954,3.7333,9.9329,5.028,818
-1.2728,-10.0803,0.532,1.5091,-10.0803,3.087,9.4378,7.9785,819
-1.1853,-10.4752,-0.435,0.5425,-10.4752,1.5725,8.5665,5.4407,820
-1.0542,-9.7639,-0.3347,0.3969,-9.7639,1.2896,8.8168,4.7664,821
0.0046,-10.0316,0.6582,0.7629,-10.0316,2.598,8.5949,7.772,822
-0.8197,-10.2021,1.2911,1.3806,-10.2021,1.8365,8.1616,7.2772,823
-2.8141,-10.0062,0.3968,1.4439,-10.0062,3.1364,13.89,6.0826,825
-4.0362,-10.0722,-0.7288,3.031,-10.0722,3.4254,11.8076,9.8461,826
-4.0471,-9.9213,1.5884,4.9737,-9.9213,3.7464,18.3574,14.8166,827
-1.1589,-9.8781,1.0961,1.6814,-9.8781,2.8956,13.1277,8.0104,828
-0.6785,-9.9464,3.6033,3.3537,-9.9464,3.7339,16.9045,10.8376,829
-0.3644,-9.959,0.8014,1.4527,-9.959,1.7341,10.5959,4.6689,830
-4.1845,-10.342,-0.8918,2.2071,-10.342,1.3986,8.4108,5.9151,831
-4.5225,-9.5843,3.2844,7.1758,-9.5843,4.8254,19.0129,17.588,832
-3.1171,-9.9309,-0.4847,1.4499,-9.9309,1.9424,9.4867,6.7793,833
-15.7765,-9.6766,0.3942,13.5132,-9.6766,9.3811,32.4117,19.9035,834
-3.5772,-10.137,0.1284,1.7945,-10.137,3.1351,11.849,6.4086,835
-2.5121,-10.0315,0.7323,2.0638,-10.0315,1.8219,11.8005,6.8107,836
-4.3606,-10.1247,1.6231,3.2364,-10.1247,3.598,16.2257,8.3283,837
-7.4818,-9.582,-0.8071,2.7876,-9.582,4.6316,18.8159,7.1563,838
-9.1492,-10.0492,2.0232,7.7837,-10.0492,1.7789,12.3455,8.8978,839
-4.0441,-10.0457,0.8661,3.3621,-10.0457,1.6448,9.0491,6.6021,840
-3.145,-9.9066,-0.4514,1.2082,-9.9066,0.7775,8.7417,5.9751,841
-0.6138,-9.6911,0.4165,0.88,-9.6911,1.0458,5.2484,3.8572,842
-3.6839,-9.9622,1.3353,3.6583,-9.9622,3.0449,12.7745,9.2255,843
-8.5581,-10.3405,-1.6723,5.9909,-10.3405,2.9623,14.27,8.107,844
-3.1495,-10.0344,1.6385,5.7778,-10.0344,3.2166,12.9297,5.9655,845
-11.624,-10.0666,0.126,2.711,-10.0666,3.4377,11.8231,6.4677,847
-2.3984,-9.9727,0.1368,1.1065,-9.9727,1.8406,9.5255,4.5582,848
-3.0803,-10.2494,-0.0236,1.4891,-10.2494,0.8563,10.0831,3.9963,849
-2.0509,-9.9032,-0.3939,1.1839,-9.9032,2.4185,6.3674,4.3185,850
-1.2147,-10.1189,-0.1574,0.8305,-10.1189,0.9925,9.3042,6.7363,851
-2.0714,-10.1769,-0.1671,1.2734,-10.1769,1.1101,20.2364,6.4358,852
-2.6227,-10.1371,3.9893,5.5388,-10.1371,3.7361,16.3659,10.1079,853
-0.5788,-9.9184,0.3576,0.7262,-9.9184,1.4667,8.2916,5.8402,854
-3.2338,-10.0177,0.8069,2.4406,-10.0177,2.9491,16.0844,11.9746,855
-5.2634,-10.0248,0.6811,1.6259,-10.0248,2.6345,12.0042,5.1623,857
-10.1246,-10.0271,1.567,4.0645,-10.0271,4.9094,22.0132,13.9794,859
-1.79,-10.056,0.281,1.5138,-10.056,0.6228,5.7648,4.4838,861
-0.3442,-10.1375,1.3927,1.3542,-10.1375,1.5734,13.8803,7.7764,862
-1.6488,-10.0796,-0.3334,0.9695,-10.0796,1.456,11.2336,4.118,863
-2.6768,-10.1068,-0.7348,1.1605,-10.1068,1.1867,12.2568,7.5966,864
-9.6818,-10.0086,-1.6388,4.0996,-10.0086,2.9308,20.414,15.1974,865
-1.2225,-10.2047,8.0281,8.2279,-10.2047,5.3227,37.5794,33.3806,866
-2.5607,-10.0255,-0.0716,1.1755,-10.0255,2.6117,6.4342,4.2541,867
-4.5408,-10.0204,-0.2433,1.1888,-10.0204,1.7609,4.2699,1.8032,868
-5.4985,-10.0063,-0.5099,1.5853,-10.0063,2.0308,3.8797,2.3734,869
-0.7669,-10.0276,0.2327,0.5611,-10.0276,0.9843,3.4408,2.5062,870
-1.5489,-10.0196,-0.4583,0.5122,-10.0196,1.3654,3.5953,2.4718,871
-0.0487,-9.9642,0.1518,0.1859,-9.9642,0.3191,5.2959,3.3174,872
-4.194,-10.0233,-0.9929,2.0244,-10.0233,2.509,5.1847,2.7006,873
-2.5576,-10.0168,-0.2102,0.8727,-10.0168,1.534,3.8425,1.6938,874
-1.8292,-9.9981,-0.5258,0.8388,-9.9981,1.058,2.6681,1.7756,875
-3.3438,-10.0192,0.1553,1.3656,-10.0192,2.747,5.7335,2.9038,877
-1.3816,-10.0086,-0.404,0.4045,-10.0086,0.7583,3.0032,1.8429,878
-2.4498,-10.0104,-0.205,0.9084,-10.0104,1.791,3.5193,1.9065,879
-1.6597,-10.0031,-0.4929,0.5286,-10.0031,0.424,2.8334,2.0958,880
-0.5299,-10.0295,0.0258,0.2332,-10.0295,0.6211,2.6042,1.5914,881
-2.8541,-10.0034,-0.4005,0.9393,-10.0034,0.9499,3.5543,1.9751,882
-0.612,-9.9935,0.4552,1.1776,-9.9935,2.0903,4.1477,1.9305,883
-5.134,-10.03,-0.7303,2.1057,-10.03,1.1987,4.7199,3.0938,884
-1.1737,-10.0238,-0.0363,0.6183,-10.0238,1.432,3.0864,2.0242,885
-3.5053,-10.0193,-0.5631,1.3791,-10.0193,2.32,4.5562,2.4886,886
-2.9806,-10.0183,0.0179,1.2765,-10.0183,1.3165,4.4295,2.0437,887
-1.1737,-10.0058,-0.1677,0.5186,-10.0058,0.8533,2.4756,1.9511,888
-5.3347,-10.0184,-1.2335,2.0028,-10.0184,2.5861,6.1849,2.0618,890
-0.6526,-10.0136,0.156,0.5261,-10.0136,1.5762,3.8916,1.489,891
-2.2475,-10.0192,-0.5661,0.7758,-10.0192,1.4548,4.5443,1.8822,892
-0.7053,-10.008,-0.0409,0.362,-10.008,0.9741,2.293,1.7837,893
-1.8742,-10.0096,-0.4464,0.4138,-10.0096,0.9105,4.102,1.7798,894
-1.2028,-10.0142,-0.0371,0.5262,-10.0142,1.3579,5.2425,2.3143,895
-3.5234,-9.9785,-0.8028,1.7019,-9.9785,1.5878,5.2266,3.743,897
-2.03,-10.028,0.0548,1.4965,-10.028,1.1802,6.4178,5.1541,898
-0.4397,-10.0201,-0.0885,0.2031,-10.0201,0.6949,2.4219,1.4314,899
-0.652,-10.0237,-0.2239,0.2319,-10.0237,0.6181,2.2858,1.541,900
-2.7405,-9.9835,1.2756,3.3678,-9.9835,4.0964,16.814,7.8267,901
-1.7306,-10.0014,2.2704,3.5059,-10.0014,3.4256,21.8424,11.9723,902
-1.8601,-9.999,-0.8008,0.7408,-9.999,1.7223,5.2056,3.3756,903
-1.3686,-10.0533,-0.2488,0.7743,-10.0533,1.6695,5.9836,4.1534,904
-0.4484,-10.0173,1.0967,1.9297,-10.0173,4.3152,15.17,10.9215,905
-4.6985,-10.3404,6.1889,6.1043,-10.3404,2.1562,30.8752,19.5429,907
-6.7021,-9.8307,3.0489,6.8817,-9.8307,5.113,19.8252,14.3539,908
-4.931,-10.3404,2.2179,6.8109,-10.3404,3.3614,29.8596,20.2723,909
-2.0424,-9.8422,6.9279,6.9232,-9.8422,1.0429,22.2575,11.6678,910
-2.7519,-9.3718,0.213,1.9854,-9.3718,1.0298,14.1129,7.4121,911
-9.3736,-10.3264,4.4672,11.7656,-10.3264,2.2688,18.8796,14.5054,912
-3.9384,-10.3244,0.4094,2.0536,-10.3244,2.7191,20.2126,12.0945,913
-3.5533,-9.2242,4.1175,5.4856,-9.2242,2.6839,23.4228,11.9049,914
-1.265,-9.9595,3.5728,4.6318,-9.9595,7.1758,21.2737,11.7627,915
-5.5962,-9.907,1.1621,4.577,-9.907,6.1876,23.4853,9.5807,917
-23.5853,-9.4335,2.291,11.8542,-9.4335,7.8997,33.8639,17.1099,918
-15.6563,-9.8771,-2.6732,6.9844,-9.8771,1.7788,9.1256,7.498,919
-5.5074,-10.2003,1.0978,5.6027,-10.2003,3.5819,23.1362,14.565,920
-14.8597,-9.4725,0.5576,6.2459,-9.4725,4.079,17.0721,9.6867,921
-10.1127,-9.695,-0.6331,2.5973,-9.695,3.3611,18.4798,7.0053,923
-13.3432,-10.0636,-0.742,3.799,-10.0636,3.2346,14.2231,8.2924,924
-5.6203,-10.1033,0.574,4.4979,-10.1033,3.2415,19.4585,10.2163,925
-33.4196,-10.1631,0.0598,13.9412,-10.1631,5.3434,21.0288,12.9315,927
-9.6626,-9.9646,6.3612,13.2645,-9.9646,9.0154,23.4615,17.4519,928
-0.6221,-10.4357,1.0874,2.0029,-10.4357,2.3835,15.6352,12.5959,929
-6.9464,-10.1866,10.3049,10.5365,-10.1866,4.4138,31.6652,15.5889,930
-7.4009,-10.0151,-0.2235,4.4406,-10.0151,5.3059,12.5968,9.6355,931
-7.727,-9.3465,-0.3964,5.7456,-9.3465,4.7629,22.953,19.7504,932
-8.3449,-9.8658,3.0186,5.5074,-9.8658,8.5325,24.4443,14.2678,934
-5.1775,-10.1744,1.6258,3.4986,-10.1744,2.0957,13.3616,10.5297,935
-1.9132,-10.3232,1.1288,2.1235,-10.3232,2.4921,11.113,6.8758,936
-4.9848,-10.0096,0.1221,1.6605,-10.0096,3.3977,10.3389,7.6073,937
-1.6536,-9.9872,0.6226,1.4242,-9.9872,3.4986,14.4059,5.847,938
-6.7479,-9.9931,-0.6283,1.7445,-9.9931,2.4723,11.1009,4.1892,939
-4.2328,-9.9023,0.0808,3.6799,-9.9023,3.1946,14.7359,10.9021,940
-1.2932,-10.1628,1.4013,2.5529,-10.1628,4.3573,16.2505,11.5884,941
-1.1945,-9.9647,0.1631,0.9054,-9.9647,0.9987,7.7732,5.0788,942
0.0328,-9.9919,4.6709,5.1344,-9.9919,5.5441,18.4564,13.6787,943
-2.046,-9.6843,-0.1603,1.1761,-9.6843,2.5781,10.5751,6.3628,944
-5.8432,-10.0492,1.176,5.1512,-10.0492,6.8151,16.6414,11.695,945
-7.1109,-9.7622,1.0457,4.5428,-9.7622,4.7443,15.7009,9.7384,946
-4.9383,-10.2436,0.9593,4.0748,-10.2436,3.7317,23.0384,8.7675,947
-5.4443,-10.0048,0.2478,1.6315,-10.0048,2.5662,8.4323,4.5652,948
-0.3378,-9.9523,0.5297,1.1591,-9.9523,1.1427,8.9971,5.6177,949
-0.6409,-9.9722,1.1223,1.3455,-9.9722,2.2874,9.9343,7.0102,950
-0.2217,-9.9726,1.136,1.0831,-9.9726,2.8844,6.4646,5.0226,951
-0.7603,-9.8109,0.5001,1.0668,-9.8109,0.4548,5.5,4.4329,952
-1.274,-10.1151,1.6115,2.9473,-10.1151,3.1799,15.6707,14.4836,953
-0.0466,-10.0093,0.4023,0.4822,-10.0093,1.1623,8.0605,6.7806,954
-2.0273,-9.9936,0.7055,1.5598,-9.9936,3.3135,12.8378,9.2351,955
-2.5188,-9.8533,0.4036,1.6379,-9.8533,3.5562,17.0192,8.7608,957
-3.0987,-9.9396,0.0894,1.5942,-9.9396,3.4748,10.1524,4.4688,958
-0.9437,-9.9939,0.8362,1.1882,-9.9939,0.8786,9.1772,4.8137,959
-0.5353,-10.0754,0.1118,0.637,-10.0754,0.872,5.3332,3.8927,960
-0.8074,-9.8803,-0.0521,0.442,-9.8803,2.0297,4.2661,3.2954,961
-10.6494,-8.9467,-1.7736,3.6408,-8.9467,3.251,29.9336,4.7202,962
-27.3445,-9.7317,5.3738,21.9253,-9.7317,4.5481,39.7401,33.9717,963
-7.5476,-10.0652,-0.2414,2.2087,-10.0652,2.4369,14.3112,5.5586,964
-1.564,-10.1785,5.2057,4.8513,-10.1785,2.9726,18.6865,12.6705,965
-4.1538,-10.0129,1.7349,4.1992,-10.0129,4.0292,15.3505,8.414,967
-4.1321,-9.9633,0.2865,2.684,-9.9633,3.7566,17.2706,6.6704,968
-2.2954,-9.9223,1.5299,2.7123,-9.9223,2.0611,12.5038,9.7093,970
-0.7606,-9.8112,0.0065,0.3911,-9.8112,0.8171,5.4429,3.395,971
-5.6511,-9.7627,-1.0397,2.0813,-9.7627,1.764,8.6439,3.6021,972
-9.9118,-10.0083,3.4745,7.3142,-10.0083,6.709,22.9353,15.8187,973
-5.4498,-10.0182,-0.2731,3.5715,-10.0182,3.9451,16.8943,12.3619,974
-4.9814,-10.1776,0.9072,3.0717,-10.1776,5.0079,17.9744,7.1469,975
-0.6274,-10.0815,0.6457,1.2068,-10.0815,1.7615,12.8811,6.8962,976
-2.5646,-10.0763,0.3484,1.3322,-10.0763,3.2476,10.9397,5.7146,977
-2.3793,-10.054,1.0152,3.0679,-10.054,3.4282,14.5664,7.4029,978
-1.268,-9.7334,0.0532,0.6776,-9.7334,0.4775,3.9794,2.6832,979
-2.7642,-9.9768,-0.0204,1.6688,-9.9768,2.1392,18.0328,13.6913,980
-17.3815,-10.0427,-1.9891,6.1888,-10.0427,6.202,30.2932,10.085,981
-0.7962,-9.7691,0.9617,0.9808,-9.7691,2.0345,20.1931,6.0501,983
-11.8876,-8.7775,2.0994,9.5184,-8.7775,7.1049,28.7315,15.7794,984
-2.0462,-9.8187,0.2887,1.3185,-9.8187,2.853,15.4962,7.8433,985
-15.6798,-9.8989,0.1353,4.3422,-9.8989,3.7587,41.1427,8.5863,987
-3.4831,-10.1345,1.0302,2.7182,-10.1345,5.2257,16.5178,6.8845,988
-3.4071,-9.9742,-0.1763,1.8879,-9.9742,1.0024,7.0488,3.7328,989
-0.4457,-10.0152,0.2528,0.6275,-10.0152,1.1594,5.2443,3.7886,990
-0.6867,-10.1686,2.0751,2.5279,-10.1686,2.9357,10.9054,7.2422,991
-0.2796,-10.1295,0.2008,0.4569,-10.1295,0.5884,7.1458,4.893,992
-1.3799,-10.213,0.0662,0.758,-10.213,1.5646,19.932,10.2769,993
-2.1534,-10.1382,-0.1365,1.2028,-10.1382,0.9354,11.2778,9.6635,994
-2.2107,-10.1464,-0.3371,1.2092,-10.1464,0.9113,14.8278,7.0494,995
-8.2451,-9.9903,0.3104,4.3233,-9.9903,5.2999,23.6758,20.1701,997
-3.6095,-10.2673,0.4818,2.1851,-10.2673,3.7085,38.0515,30.0551,998
2.0816,-9.991,5.5906,2.5831,-9.991,1.7737,29.2456,16.4532,999
0.613,-9.7017,3.0024,1.5934,-9.7017,1.3904,11.2623,9.9957,1000
-3.3487,-10.2758,1.3398,3.6584,-10.2758,5.118,14.3489,12.6573,1001
-0.5543,-9.8955,0.3315,0.7944,-9.8955,1.5947,8.8176,5.9874,1002
-0.0232,-10.2401,0.344,0.3221,-10.2401,1.5141,7.0627,6.3498,1003
-3.4879,-10.2492,-0.0938,1.5751,-10.2492,1.8217,10.2345,5.3868,1005
-1.994,-10.0052,0.0916,1.3389,-10.0052,1.4475,7.4168,5.1405,1006
-0.532,-9.9911,0.664,0.8449,-9.9911,3.0681,10.9396,8.0924,1007
-3.9146,-9.9855,0.6254,1.961,-9.9855,3.9816,15.6456,5.5653,1008
-0.6235,-9.9813,3.3886,3.1318,-9.9813,7.4821,17.1492,12.5271,1009
-1.6095,-10.1314,-0.1439,0.8031,-10.1314,1.5019,15.5246,8.7898,1010
-2.2887,-10.4915,2.7847,4.0802,-10.4915,2.3779,13.7039,12.1197,1011
-1.5405,-10.2352,0.0743,1.0238,-10.2352,1.684,10.1927,9.6365,1012
1.0141,-10.1875,4.3995,3.6214,-10.1875,2.1357,12.6093,7.9827,1013
-3.0654,-10.1292,-0.3549,1.3881,-10.1292,1.2998,9.1193,7.3372,1014
-3.5599,-10.1951,3.8201,5.854,-10.1951,6.0095,20.0114,16.6673,1015
-7.9258,-10.0153,0.8117,3.5723,-10.0153,4.6886,23.7626,11.1099,1017
-1.4235,-9.9921,0.2872,0.9174,-9.9921,2.013,8.811,5.1836,1018
-5.6643,-10.2062,3.8088,7.5894,-10.2062,2.4026,16.2422,13.8971,1019
-1.274,-10.3363,0.3976,0.9663,-10.3363,2.1655,10.6286,8.2921,1020
-0.8764,-10.0601,2.0567,1.8204,-10.0601,4.9355,12.7364,9.3357,1021
-1.3632,-10.1861,-0.3438,0.6737,-10.1861,1.9632,6.608,5.1142,1022
0.5934,-10.0363,5.9038,4.1717,-10.0363,4.3799,16.3599,12.5516,1023
-1.2297,-9.6319,-0.5606,0.4344,-9.6319,0.8753,9.3133,4.9968,1024
-3.4343,-9.9525,0.9047,3.8546,-9.9525,3.9434,16.8337,10.3723,1025
-6.9465,-10.0534,1.771,4.0857,-10.0534,5.2424,20.246,14.3051,1027
-3.6161,-10.036,1.8174,3.9255,-10.036,4.4535,18.7495,11.4433,1028
-0.1976,-10.1045,1.3942,1.1832,-10.1045,1.963,11.3593,6.9161,1029
-5.4299,-10.2298,2.8967,8.2151,-10.2298,1.9284,22.9454,12.803,1030
-1.3209,-10.0749,0.9702,3.0854,-10.0749,2.8354,10.806,9.1515,1031
-0.2682,-10.071,3.3219,3.0794,-10.071,4.5448,12.6654,11.1862,1032
-3.8496,-10.1414,0.1307,1.4078,-10.1414,2.2697,8.824,4.6223,1033
-3.4177,-10.1158,5.1762,4.563,-10.1158,7.8231,19.4865,15.3227,1034
-3.3685,-10.212,-0.4515,1.6013,-10.212,3.2869,17.8809,12.3178,1035
-8.1769,-10.0245,3.4388,7.2238,-10.0245,7.7493,23.5891,13.3863,1037
-3.2447,-10.0648,0.6657,1.9158,-10.0648,3.8512,12.2201,6.5551,1038
-1.9136,-10.0434,0.0703,1.1013,-10.0434,2.6046,9.4176,5.4858,1039
-0.8076,-10.1191,0.4847,0.9342,-10.1191,3.2194,10.7121,8.2557,1041
-1.0231,-9.6878,0.5734,1.3001,-9.6878,2.5346,12.7024,9.0422,1042
-0.0493,-9.7054,2.247,1.6547,-9.7054,1.5146,17.5423,7.9183,1043
-2.6989,-10.0947,-0.5087,1.0247,-10.0947,1.374,4.7003,2.9053,1044
-1.597,-9.5848,0.6792,1.7724,-9.5848,2.0171,14.5339,7.88,1045
-4.0693,-9.8799,0.5335,2.8318,-9.8799,2.2699,12.773,7.4729,1047
-3.7372,-9.9651,0.3309,2.3608,-9.9651,4.3444,13.3552,6.6451,1048
-1.1914,-10.0338,7.5599,5.6889,-10.0338,2.6037,18.6523,15.3671,1049
-0.8301,-9.889,0.3477,1.1938,-9.889,1.8897,6.5722,2.8505,1050
-7.1354,-10.053,1.5718,4.5367,-10.053,5.5946,28.279,9.9563,1052
-4.0164,-9.9684,0.6365,1.9488,-9.9684,3.5584,11.123,7.365,1053
-1.6454,-9.9412,0.1427,1.1118,-9.9412,2.4452,9.0437,4.4658,1054
-10.5112,-10.2419,-1.1617,3.052,-10.2419,3.1775,10.336,6.2653,1055
-11.5422,-10.1409,1.1664,4.1066,-10.1409,4.9805,25.0442,8.9655,1057
-8.0542,-10.0024,2.4046,4.415,-10.0024,7.6494,16.5466,13.0058,1058
-1.2657,-10.1013,0.2059,1.6867,-10.1013,3.0897,9.8859,7.6481,1059
-5.9128,-10.0435,-1.6267,2.497,-10.0435,3.4027,14.132,6.2372,1060
-2.8086,-10.0201,1.8391,3.2388,-10.0201,1.509,10.8323,6.8861,1061
-3.6787,-10.127,1.3789,3.8974,-10.127,3.0515,9.3498,7.0086,1062
-2.8111,-10.0417,-0.1197,2.0119,-10.0417,1.4848,7.7896,6.095,1063
-0.2143,-9.6758,0.9158,1.1978,-9.6758,2.0672,9.3677,7.0997,1064
-1.1482,-10.0941,1.0218,1.6569,-10.0941,1.6132,13.411,8.5866,1065
-0.744,-10.1311,0.0282,0.3905,-10.1311,0.9981,7.287,6.4815,1067
-2.9149,-10.0133,0.0309,1.1816,-10.0133,2.2561,10.3929,5.9718,1068
-1.5902,-10.0181,-0.3098,0.7671,-10.0181,1.2814,15.4815,8.8052,1069
-2.6469,-10.0016,0.0485,1.1731,-10.0016,3.239,18.427,14.7878,1070
-6.2362,-10.0534,0.0981,3.5944,-10.0534,4.9699,32.3369,20.704,1071
-11.1921,-10.0978,1.2947,8.719,-10.0978,0.7304,18.471,14.9212,1072
-9.0451,-10.0633,0.7032,5.9604,-10.0633,3.1883,15.5399,8.0622,1073
-0.4417,-10.0045,0.5931,1.1544,-10.0045,2.1639,43.2461,33.4378,1074
-8.2598,-10.0363,8.4626,13.3352,-10.0363,2.6915,51.0079,47.3637,1075
-2.3122,-9.9849,-0.5633,0.8541,-9.9849,1.2167,7.7255,6.3847,1077
-2.188,-10.0087,0.3657,1.3608,-10.0087,0.5188,7.2324,3.3733,1078
0.0153,-10.1069,0.767,0.6285,-10.1069,2.1332,27.1071,23.7666,1079
-21.4802,-9.9517,-1.5718,15.4082,-9.9517,2.2319,20.3219,15.9857,1080
2.0916,-10.1746,10.6712,6.2245,-10.1746,5.292,20.0318,18.3029,1081
-8.2585,-10.1874,0.6321,6.4281,-10.1874,4.6632,22.6607,18.8263,1082
-5.9029,-9.9222,-0.5116,2.1261,-9.9222,3.4555,13.8454,5.6307,1083
-5.6749,-9.8797,-1.4469,2.8286,-9.8797,3.3888,9.119,5.6131,1084
-7.7873,-9.9583,1.3284,6.7344,-9.9583,10.0164,19.2157,15.905,1085
-8.1424,-10.0938,-2.1226,3.1681,-10.0938,3.1275,20.4521,13.2931,1086
-3.5052,-10.0441,3.6416,6.0975,-10.0441,7.8686,22.5242,11.8645,1087
-7.5731,-10.0137,2.0524,5.7633,-10.0137,10.0363,18.6863,13.2115,1088
-0.3012,-10.0665,2.2097,2.4413,-10.0665,3.4342,12.5516,8.7068,1089
-4.0319,-9.9608,-0.4161,1.9013,-9.9608,2.7065,6.6843,4.6344,1090
-2.8863,-9.6295,-0.3331,1.1628,-9.6295,1.9332,13.2854,7.5696,1091
-2.1048,-10.2695,2.4149,3.7505,-10.2695,5.7089,25.3685,14.1461,1092
-4.8911,-10.2584,-0.0192,1.8432,-10.2584,1.8596,12.6312,5.8081,1093
-6.678,-10.592,3.7634,7.8031,-10.592,3.861,22.5026,15.5827,1094
-3.2297,-9.9671,2.1619,3.0042,-9.9671,5.041,13.1968,10.036,1095
-9.4365,-10.1508,2.5039,6.423,-10.1508,7.8731,23.1344,13.8217,1097
-10.8779,-10.0558,1.6798,6.1801,-10.0558,5.3249,35.7893,22.0085,1098
-1.6832,-9.8907,0.4851,1.0736,-9.8907,3.3967,11.0173,6.557,1099
-0.1341,-10.3062,18.4572,17.1101,-10.3062,8.0312,26.3026,23.5793,1100
-2.1363,-10.1696,2.3761,4.1586,-10.1696,3.9861,27.1613,23.8192,1101
-1.9816,-9.9494,-0.0378,0.9852,-9.9494,1.1005,9.8735,8.4551,1102
-0.2733,-10.1172,0.3979,0.6328,-10.1172,1.1907,8.4142,5.8646,1103
-0.6714,-10.0246,0.6985,1.1295,-10.0246,0.9518,8.5518,5.2705,1104
-5.2361,-10.029,0.142,3.0939,-10.029,4.6748,23.206,11.6282,1105
-7.3521,-10.0118,0.1546,3.3521,-10.0118,4.2305,24.903,7.2347,1107
-6.845,-10.006,-0.4057,1.9711,-10.006,2.4999,8.0143,5.1405,1108
-0.8296,-9.9926,-0.2473,0.2766,-9.9926,0.9035,3.2298,1.7551,1109
-0.4449,-10.0241,-0.1658,0.2276,-10.0241,0.4979,3.2282,2.0724,1110
-0.0166,-10.002,0.0558,0.0641,-10.002,0.3694,1.7658,1.4115,1111
-2.3292,-10.0261,-0.1327,0.7664,-10.0261,1.5694,5.0006,1.4655,1113
-3.2236,-10.0101,-0.8472,0.9138,-10.0101,1.6019,5.9645,4.4735,1114
-7.5964,-9.9882,-1.4032,2.287,-9.9882,2.2279,7.3913,3.6021,1115
-2.2891,-10.0354,-0.574,0.8444,-10.0354,1.1846,3.6047,2.451,1116
-2.2179,-9.9827,-0.3113,0.7166,-9.9827,0.7617,2.2168,1.4789,1117
-0.7253,-9.9919,-0.0448,0.2359,-9.9919,0.371,1.7539,1.3055,1118
-1.1543,-9.9931,-0.3995,0.2705,-9.9931,0.2907,2.2298,1.4669,1119
-0.516,-10.0072,-0.2492,0.2954,-10.0072,0.4808,2.2973,1.6392,1120
-0.7046,-9.9762,0.2522,0.4816,-9.9762,0.9217,2.1539,1.5186,1121
-3.4712,-9.9864,-1.9196,1.2205,-9.9864,0.8489,7.8382,7.0881,1122
1.594,-10.002,3.4604,1.4105,-10.002,1.1251,8.2924,6.8812,1123
-0.6134,-9.998,1.208,1.8869,-9.998,2.9987,17.7746,11.7558,1124
-3.2997,-9.9128,-0.4321,1.0151,-9.9128,3.0616,15.1666,10.1107,1125
-5.8753,-10.0355,1.0062,3.9414,-10.0355,5.5313,29.4469,16.1371,1127
-5.5902,-10.1397,0.7241,3.5488,-10.1397,3.6609,22.8488,10.1636,1128
-3.4066,-9.8816,-0.8093,1.6212,-9.8816,1.4448,28.4319,21.8104,1129
-2.5637,-9.5854,4.5513,9.1555,-9.5854,5.5197,21.6327,7.9293,1130
-1.7896,-10.0103,0.3306,1.0543,-10.0103,1.2575,9.2994,7.2111,1134
-3.498,-10.1353,2.2874,4.3434,-10.1353,3.7121,14.4705,12.302,1135
-0.5847,-10.0902,1.3351,1.6972,-10.0902,4.0782,12.3864,8.3859,1137
-3.3147,-9.9763,1.3694,2.0659,-9.9763,4.3971,10.7343,8.4291,1138
-0.8971,-10.0151,0.1438,0.8984,-10.0151,2.854,6.136,4.4628,1139
-0.3711,-10.2383,1.263,1.7562,-10.2383,2.454,11.6569,8.1781,1140
-1.8614,-10.0756,1.6006,3.3568,-10.0756,5.6717,16.013,11.6442,1142
-9.5019,-10.0551,1.9227,5.0159,-10.0551,6.0878,21.7871,8.6232,1143
-4.5662,-10.156,-0.3316,1.4086,-10.156,2.2742,7.2718,4.6292,1144
-5.9327,-10.1113,0.2179,2.8496,-10.1113,4.2878,11.192,10.5585,1145
-4.5219,-10.0128,0.2541,3.1053,-10.0128,6.4115,16.9823,8.5543,1147
-3.2033,-10.2933,0.2435,1.2809,-10.2933,3.4766,25.161,22.8753,1148
-0.6296,-10.1248,9.8903,6.7767,-10.1248,2.471,22.3352,21.0512,1150
-2.1953,-9.9432,1.5527,3.5971,-9.9432,4.1086,9.6824,9.0737,1151
-5.1562,-10.2454,-1.2439,2.3766,-10.2454,3.5832,16.1281,6.413,1152
-9.0611,-10.2655,1.033,4.6758,-10.2655,8.3449,18.6946,14.8663,1153
-4.3923,-9.7411,2.1286,4.079,-9.7411,1.5572,15.2666,11.523,1154
-1.8475,-10.0375,0.5579,2.1704,-10.0375,4.5762,14.827,8.4359,1155
-0.6278,-9.9319,5.5354,4.3871,-9.9319,4.6442,20.922,14.5669,1156
-3.6301,-10.0,1.287,2.3025,-10.0,4.752,12.439,8.2337,1157
-0.8388,-10.0262,1.4253,2.0116,-10.0262,2.1296,17.193,12.1794,1158
-4.0915,-10.0121,0.238,4.0552,-10.0121,0.6864,11.6958,7.8881,1159
-0.749,-9.9191,4.0034,3.7538,-9.9191,6.8347,20.7122,18.7885,1160
-2.1772,-9.9841,4.5291,4.2827,-9.9841,1.4472,22.4992,12.2037,1161
-5.0675,-9.8879,2.611,7.7937,-9.8879,3.165,19.6506,17.3342,1162
-0.054,-9.9872,2.239,3.2769,-9.9872,3.3479,18.2634,15.3868,1163
-1.0862,-9.4769,2.5137,3.1106,-9.4769,2.8919,17.2141,12.9591,1164
-2.3643,-10.0735,3.1878,5.933,-10.0735,3.5018,18.3409,9.9318,1165
-6.1544,-9.9256,1.8429,4.1782,-9.9256,5.3909,19.7039,11.7544,1167
-6.5852,-10.0399,0.2078,2.2794,-10.0399,2.5381,11.6925,3.6275,1168
-0.2963,-9.9282,-0.0114,0.1635,-9.9282,0.6586,8.7756,2.6752,1169
-0.9951,-9.873,0.3832,1.3419,-9.873,1.5208,13.2957,10.9644,1170
-10.5857,-10.0049,4.907,6.4284,-10.0049,8.0244,25.2986,10.9966,1172
-3.3286,-9.9889,1.8013,4.3144,-9.9889,4.4694,19.802,7.3865,1173
-0.0209,-9.956,1.9903,2.57,-9.956,3.0762,14.3092,5.312,1174
-1.1248,-10.1166,0.6074,2.1313,-10.1166,2.5144,8.8339,7.5334,1175
-6.3134,-9.9952,0.546,2.4128,-9.9952,4.2987,16.2682,9.0092,1177
-1.1838,-10.006,0.2656,0.9303,-10.006,1.8941,9.814,4.2365,1178
-1.0441,-10.0511,3.9327,3.0378,-10.0511,1.4322,12.7782,10.1073,1179
-2.2361,-10.0181,0.4741,1.2836,-10.0181,3.0548,16.9657,7.1246,1180
0.0173,-10.0201,1.8814,1.7166,-10.0201,1.1065,10.8883,8.0483,1181
-2.0131,-10.0074,0.8847,2.227,-10.0074,2.0954,17.118,4.2477,1182
-5.1954,-10.0082,-1.2877,1.909,-10.0082,1.9712,4.8499,2.168,1183
-2.6892,-9.9941,-0.1308,1.0167,-9.9941,1.4161,3.9042,1.6924,1185
-2.7432,-10.0075,0.4688,2.1396,-10.0075,2.7049,8.0268,2.024,1186
-3.6332,-10.0218,-0.4547,0.9873,-10.0218,1.8731,4.4815,1.8573,1187
-0.5598,-10.0165,-0.0675,0.1915,-10.0165,0.8801,2.0865,1.4115,1188
-1.2663,-10.0073,-0.6306,0.4602,-10.0073,0.7426,3.4312,2.5977,1189
-0.053,-10.0169,0.0572,0.069,-10.0169,0.2883,1.5328,1.338,1190
-0.5988,-10.014,-0.1587,0.2276,-10.014,0.6301,2.0492,1.5358,1192
-0.828,-10.0157,0.0081,0.3919,-10.0157,1.0331,2.7455,1.5634,1193
-0.0132,-10.0138,0.0428,0.0413,-10.0138,0.454,1.7527,1.325,1194
-0.4045,-10.0174,-0.1874,0.129,-10.0174,0.4483,1.9553,1.5948,1195
-0.3009,-10.0184,-0.1077,0.1057,-10.0184,0.5292,1.9751,1.429,1196
-0.3008,-10.0193,-0.0914,0.0924,-10.0193,0.3304,1.4941,1.3466,1197
-0.0631,-10.0216,-0.0186,0.0358,-10.0216,0.2669,1.3672,1.2987,1198
-0.5143,-10.0184,-0.1322,0.1968,-10.0184,0.8838,2.6593,1.7039,1199
-1.0723,-10.0174,-0.2424,0.2617,-10.0174,0.6502,2.7759,1.4882,1200
-0.9767,-10.019,-0.3907,0.3268,-10.019,0.8836,2.6343,1.7719,1202
-0.8166,-10.0152,-0.2253,0.3213,-10.0152,0.8669,2.9191,1.7084,1203
-0.458,-10.0128,-0.0802,0.2645,-10.0128,0.8048,1.8743,1.4634,1204
-0.4316,-10.0298,-0.1701,0.1789,-10.0298,0.8904,2.205,1.6776,1205
-7.4825,-10.0191,-2.4158,2.6383,-10.0191,1.5976,8.1017,4.3319,1206
-1.5401,-10.0095,-0.1489,1.0619,-10.0095,1.2584,2.2763,1.8206,1207
-0.3878,-10.0155,-0.0442,0.1233,-10.0155,0.2626,1.7459,1.3527,1208
-0.4084,-10.0138,-0.1279,0.1612,-10.0138,0.4185,1.712,1.4509,1209
-0.2051,-10.0146,-0.0643,0.1106,-10.0146,0.3473,1.7307,1.1991,1210
-0.1646,-10.0199,-0.0023,0.0637,-10.0199,0.2972,1.7906,1.3631,1212
-0.4741,-10.0202,-0.2265,0.1221,-10.0202,0.2459,1.9126,1.6956,1213
-0.1567,-10.0126,-0.0731,0.0373,-10.0126,0.0909,1.3656,1.329,1214
-0.2226,-10.0184,-0.0949,0.0508,-10.0184,0.1974,1.6556,1.3675,1215
-0.3833,-10.0182,-0.1361,0.1588,-10.0182,0.527,2.0168,1.8855,1216
-1.68,-10.012,-0.1426,0.4911,-10.012,0.9875,11.846,5.8267,1217
-2.9983,-10.0197,0.7701,2.5489,-10.0197,2.7465,21.1447,16.7419,1218
-14.068,-9.9319,-2.0467,4.9852,-9.9319,5.6541,25.3849,7.4152,1219
-15.4248,-10.07,1.2846,5.9353,-10.07,3.2357,23.3629,13.8787,1220
-0.4851,-10.2082,3.2931,4.0774,-10.2082,4.8765,25.5418,11.0695,1222
-1.5098,-9.8659,5.6349,5.5076,-9.8659,2.917,15.1957,12.3464,1224
-1.4507,-10.0284,2.5152,4.7877,-10.0284,3.6655,18.6062,15.9334,1225
-15.801,-9.9242,-2.2142,6.6157,-9.9242,4.088,14.6386,11.7758,1226
-3.1377,-9.2169,1.4892,4.5838,-9.2169,4.195,19.6869,15.785,1227
-2.9079,-10.0349,3.4365,5.3145,-10.0349,6.8771,24.2314,21.4831,1228
-0.7118,-10.1142,-0.0422,0.3334,-10.1142,1.8579,11.1357,5.9749,1229
-2.5753,-10.1354,3.2612,4.6415,-10.1354,9.5388,24.1982,16.5074,1230
-2.9421,-10.1425,3.2847,5.1006,-10.1425,8.3913,26.3908,21.2308,1231
-2.8594,-9.6193,4.6373,8.0271,-9.6193,6.8929,23.0441,15.2943,1232
-8.9601,-9.8933,1.458,5.5914,-9.8933,7.9953,26.0294,13.5148,1233
-14.3746,-9.3916,1.5026,6.8235,-9.3916,7.083,30.0533,12.0405,1234
-11.1859,-9.8519,3.7061,8.732,-9.8519,7.8159,20.7507,12.8954,1235
-3.2967,-9.253,4.7236,4.3564,-9.253,1.9666,20.5189,14.6912,1236
-2.1981,-9.9339,1.0611,2.5727,-9.9339,2.3979,9.4882,6.8724,1237
-3.7824,-9.7347,-0.1243,2.1832,-9.7347,2.5866,19.7786,15.0356,1238
1.9259,-9.857,12.411,7.4014,-9.857,2.9518,35.0102,18.9434,1239
-1.7567,-10.1821,1.7879,2.6629,-10.1821,4.5455,16.4046,8.7375,1240
-3.9379,-10.0123,2.9337,5.8103,-10.0123,6.199,20.2112,11.4448,1242
-6.9786,-10.0561,1.2166,3.3009,-10.0561,6.0304,16.7623,11.56,1243
-1.2532,-9.8613,7.8154,5.0707,-9.8613,2.3943,16.6276,11.3865,1244
-0.7723,-9.9171,1.0035,1.9148,-9.9171,2.8002,13.7148,12.4438,1245
-5.1456,-10.2796,5.506,6.2575,-10.2796,2.5248,15.9349,11.3882,1246
0.0463,-9.8037,8.2635,6.1648,-9.8037,7.0986,20.0197,17.2989,1247
-0.6398,-10.0332,0.9225,1.4461,-10.0332,3.0929,9.655,4.4925,1248
-5.6071,-10.0317,0.3054,2.1054,-10.0317,2.6858,11.0258,7.4104,1249
-2.9195,-10.0785,0.6421,3.6511,-10.0785,1.0157,10.6746,8.9052,1250
-2.7811,-10.0694,1.2352,3.0443,-10.0694,2.7148,10.0089,7.4447,1252
-7.3581,-10.0191,1.0436,3.8937,-10.0191,6.0118,21.4654,10.064,1253
-2.7059,-9.811,5.8124,5.6736,-9.811,8.0961,17.1372,14.2815,1254
-20.4006,-9.7738,-0.1681,8.0503,-9.7738,7.3409,22.268,13.3856,1255
-1.6929,-10.1724,0.9105,2.5792,-10.1724,3.1993,14.6598,14.163,1256
-11.3569,-9.8583,4.2961,10.9972,-9.8583,1.7138,17.3895,13.5491,1258
-1.7626,-9.6611,0.6277,2.0265,-9.6611,2.3948,11.3226,5.982,1259
-2.6677,-9.9224,0.8803,2.337,-9.9224,4.3037,8.4448,6.9873,1260
-0.2839,-9.945,4.6821,4.1504,-9.945,4.1726,15.0467,10.8472,1261
-18.1136,-10.1742,-1.0563,4.6414,-10.1742,4.5804,14.2292,9.2214,1262
-5.5131,-10.0494,-1.6973,4.1305,-10.0494,2.0802,11.3772,9.5142,1263
-16.959,-10.1293,2.919,11.5226,-10.1293,7.0685,26.2548,15.9371,1264
-3.9997,-9.7982,-0.6671,1.4477,-9.7982,2.3953,6.2902,4.6683,1265
-1.6604,-10.0903,3.745,3.3599,-10.0903,0.8804,12.4971,9.4886,1266
2.1077,-9.9599,11.9596,8.5302,-9.9599,2.6065,31.343,13.4503,1267
-5.9662,-10.0959,1.3271,4.6544,-10.0959,1.0846,14.8821,7.5413,1268
-5.1511,-10.0108,-0.6373,1.8147,-10.0108,1.5434,12.9319,8.9701,1269
-10.1724,-9.9463,-2.5907,3.8469,-9.9463,2.93,7.6573,2.7396,1270
-6.2043,-10.0209,-2.2321,2.0047,-10.0209,4.5319,11.1908,3.9145,1271
-13.0202,-9.9744,-0.9589,4.7098,-9.9744,4.2726,8.0068,3.7535,1272
-6.0442,-9.9436,-3.1628,2.0882,-9.9436,1.6365,4.9594,3.2451,1273
-0.0091,-9.9216,1.5317,0.8129,-9.9216,0.5761,2.2844,1.7392,1274
-0.9121,-9.9471,0.5157,1.0232,-9.9471,0.9038,2.1814,1.7401,1275
-3.3114,-9.9363,0.0556,1.7062,-9.9363,1.3786,4.8916,2.0366,1277
-0.6798,-9.9497,2.2345,1.9248,-9.9497,1.6536,4.4846,2.8927,1278
-2.3052,-9.9515,-1.3817,0.5832,-9.9515,0.5205,2.4078,1.8669,1279
0.5828,-9.9205,0.9943,0.2374,-9.9205,0.1629,1.655,1.4782,1280
-1.0779,-9.9264,-0.6671,0.3524,-9.9264,0.2646,1.52,1.3649,1281
1.0331,-9.9222,1.0726,0.0274,-9.9222,0.0265,1.5316,1.5103,1282
0.5007,-9.9344,0.879,0.3495,-9.9344,0.2908,1.7385,1.4177,1283
0.9533,-9.938,1.432,0.4446,-9.938,0.3913,2.0703,1.6862,1284
-2.6226,-9.9841,-0.6765,1.0764,-9.9841,1.1334,2.7395,2.134,1285
-12.2256,-9.9779,-0.424,4.1099,-9.9779,4.1354,9.3637,3.1951,1287
1.1915,-9.9539,1.9998,0.7427,-9.9539,0.6343,3.559,2.2499,1288
1.9737,-9.9742,2.7999,0.7158,-9.9742,0.1463,4.1613,3.547,1289
0.6081,-9.9844,0.8582,0.1907,-9.9844,0.2746,2.03,1.8387,1290
-1.3863,-9.973,-0.9623,0.3509,-9.973,0.4413,2.0016,1.7452,1291
-0.8279,-9.9677,-0.6703,0.1201,-9.9677,0.1494,1.605,1.5326,1292
-3.7525,-9.921,-1.8948,0.9155,-9.921,0.6717,3.1678,2.0177,1294
-3.0881,-9.8746,-0.1742,2.1659,-9.8746,1.3135,2.3474,1.7261,1295
0.5488,-9.8856,0.7477,0.2064,-9.8856,0.1482,1.4844,1.3085,1296
-5.3718,-9.8553,-0.5739,2.9617,-9.8553,1.7132,3.1915,2.5075,1297
0.8157,-9.9458,4.4792,4.0748,-9.9458,3.0811,9.229,3.9437,1299
-10.178,-9.9489,-5.7031,3.048,-9.9489,0.6794,5.8765,4.9469,1300
-4.7582,-9.9334,2.7758,4.0588,-9.9334,3.1547,8.3625,3.9501,1301
-2.6206,-9.9338,-0.5627,2.0176,-9.9338,1.5656,3.849,2.0204,1302
1.957,-9.9412,3.6846,1.3442,-9.9412,0.7321,4.8319,4.2004,1303
1.7762,-9.9468,2.3351,0.6382,-9.9468,0.4099,3.5849,3.2299,1304
-5.685,-9.9651,0.4654,1.9407,-9.9651,1.3745,4.0365,2.3618,1305
-2.3848,-9.9906,1.1585,1.9778,-9.9906,2.613,7.1277,2.726,1307
-7.7283,-9.9704,0.8977,4.5279,-9.9704,4.4288,9.2516,3.9204,1308
-9.8925,-10.017,-0.131,3.7847,-10.017,4.9917,13.7504,9.154,1309
-2.5662,-10.0612,0.0681,1.2147,-10.0612,2.8055,14.8134,10.8594,1310
-1.8745,-9.9422,-0.3045,1.0103,-9.9422,1.8657,18.806,16.3186,1311
-0.513,-10.2908,0.5834,0.8196,-10.2908,0.6132,13.2049,10.8205,1312
-1.4428,-9.9092,1.0594,1.5366,-9.9092,0.9778,17.7928,11.8662,1313
-2.3271,-10.0197,0.1491,1.5554,-10.0197,2.3768,12.7321,9.8427,1314
-6.0158,-10.1327,-0.2981,3.0916,-10.1327,6.0982,38.5126,29.4746,1315
-3.7965,-10.0586,-0.1545,1.9087,-10.0586,4.0279,24.2317,19.4969,1317
-0.5477,-10.3079,-0.1698,0.2378,-10.3079,0.6334,7.4433,4.4725,1318
-0.5895,-10.446,1.6824,2.3741,-10.446,3.5403,20.267,8.4834,1320
-6.8479,-10.0161,1.1823,3.8167,-10.0161,5.074,22.6962,13.5002,1321
-8.9732,-10.2201,-0.854,5.8135,-10.2201,7.9526,29.2373,25.8314,1322
-6.2621,-9.9293,8.6819,9.9524,-9.9293,8.5869,28.9674,18.0292,1323
-5.034,-10.0272,10.5795,12.8724,-10.0272,9.0743,29.0782,22.9611,1324
-6.6863,-9.7306,2.2436,9.0861,-9.7306,8.0986,30.6053,25.9455,1325
-7.1405,-9.98,1.9653,5.5309,-9.98,5.5612,25.1384,7.8126,1327
-5.0074,-9.9942,2.3149,5.259,-9.9942,5.4671,15.0795,10.1766,1328
-1.3701,-9.9774,0.385,0.9572,-9.9774,1.8158,8.7359,5.8077,1329
-8.6117,-10.1356,2.8019,9.2977,-10.1356,5.6808,27.4889,20.0429,1331
-1.484,-10.3333,1.5575,2.8353,-10.3333,3.0276,20.5139,12.0805,1332
-14.5685,-9.8773,3.9745,8.0949,-9.8773,11.1775,29.426,18.4387,1333
-0.9689,-10.1202,5.5626,6.15,-10.1202,4.5441,22.2485,20.3256,1334
-9.2788,-10.0274,5.4896,9.1777,-10.0274,9.0455,24.4628,16.456,1335
-18.3657,-10.0276,1.2486,8.4606,-10.0276,7.494,27.3334,13.1654,1337
-18.3721,-10.01,1.8033,9.7484,-10.01,5.5232,27.4262,13.8186,1338
-7.435,-10.15,-0.0804,5.8853,-10.15,6.8335,28.9935,21.6543,1339
-4.041,-10.2281,1.7461,4.0279,-10.2281,4.6393,19.7621,17.2172,1340
-15.2463,-9.9726,8.8806,13.181,-9.9726,11.6342,31.1075,18.3092,1342
-7.2078,-9.9811,2.0202,5.8624,-9.9811,7.1493,20.4474,11.1778,1343
-1.6137,-10.0423,5.8718,6.1103,-10.0423,8.6434,27.3111,17.7551,1344
-5.9158,-9.9966,1.4528,4.505,-9.9966,8.0919,18.405,14.2039,1345
-6.9868,-9.9782,1.4425,5.1695,-9.9782,5.9971,18.1305,13.4248,1347
-7.1821,-10.1703,6.118,12.9405,-10.1703,5.3296,31.871,28.4544,1348
-5.7832,-10.3755,8.711,11.8871,-10.3755,3.7951,23.6022,18.5209,1349
-3.958,-9.9556,0.4027,2.7709,-9.9556,3.8321,16.1341,10.0072,1350
-11.368,-10.02,-2.1211,6.4274,-10.02,5.3256,19.4646,17.4338,1351
-6.4541,-9.9808,-1.39,2.8228,-9.9808,0.9643,13.4754,8.98,1352
0.1222,-10.0003,2.4812,2.675,-10.0003,3.9529,16.8155,14.7443,1353
-7.0242,-10.0796,1.2458,5.3669,-10.0796,9.0094,27.5227,14.3393,1354
-4.9596,-10.0777,6.4182,7.2158,-10.0777,8.6624,23.2096,15.5414,1355
0.0914,-10.0829,4.6361,3.2441,-10.0829,5.9562,18.813,13.6442,1357
-3.7412,-10.0242,1.1684,1.9885,-10.0242,2.1145,11.313,7.0617,1358
-2.6592,-9.8148,3.9494,4.3549,-9.8148,4.2999,14.0552,9.6234,1359
-1.6684,-10.1693,0.2418,1.1592,-10.1693,1.8791,10.4783,4.6006,1360
-10.1465,-10.1823,-2.0449,6.034,-10.1823,1.7972,17.5555,14.3034,1361
-3.3045,-9.9656,-0.0476,2.3185,-9.9656,1.6741,15.897,9.7837,1362
-3.7027,-9.9324,2.1643,3.5559,-9.9324,1.9886,13.5566,9.8539,1363
-0.8203,-10.0386,1.4307,1.3493,-10.0386,3.5012,9.8701,7.4299,1364
-0.0129,-10.0785,0.7389,0.4079,-10.0785,1.1405,7.4784,5.0267,1365
-1.7171,-10.1151,-0.1521,1.0153,-10.1151,0.7441,4.2289,2.8877,1368
-1.0097,-9.9908,1.3926,2.6569,-9.9908,2.2483,12.0491,7.5875,1369
-0.0389,-9.905,0.0184,0.0742,-9.905,0.4238,4.1029,2.461,1370
-1.7477,-10.0029,1.3582,1.9245,-10.0029,4.3533,13.6614,9.928,1371
-0.5394,-10.0223,1.3114,1.5335,-10.0223,2.4934,15.4546,11.4944,1372
-1.9217,-9.9565,0.35,1.1021,-9.9565,2.9083,8.2013,5.3369,1373
-2.9329,-10.0608,0.1459,1.8852,-10.0608,4.8467,19.9946,16.4665,1374
-2.7118,-10.006,0.7646,2.0598,-10.006,2.8665,15.8289,5.392,1375
-5.2791,-9.788,-0.3867,4.1018,-9.788,3.0415,21.936,20.4393,1376
-1.0917,-9.64,0.0242,0.8443,-9.64,2.0571,9.4986,5.5114,1377
-1.0764,-9.9287,1.1141,1.8143,-9.9287,4.8438,14.6358,6.9657,1378
-1.6645,-10.2809,2.9348,4.2552,-10.2809,4.1273,16.4317,13.358,1379
-0.5651,-10.0257,-0.1724,0.2317,-10.0257,0.7379,8.1616,5.4703,1380
-0.9544,-10.0871,1.8308,2.2145,-10.0871,5.8038,17.5716,15.3858,1381
-0.683,-10.0238,1.0067,1.3895,-10.0238,1.5067,8.0844,7.3398,1382
-2.8817,-10.1237,-0.7869,1.0035,-10.1237,1.879,8.9258,3.1422,1383
-0.7342,-9.9563,2.0001,2.3641,-9.9563,4.9743,15.065,11.1775,1384
-1.3284,-10.1201,1.1696,1.8448,-10.1201,3.9365,11.9252,8.3374,1385
-2.6962,-10.0877,1.8393,2.8041,-10.0877,4.5763,12.9451,7.7687,1387
-4.4043,-10.0051,3.8351,4.8454,-10.0051,8.5319,17.6671,14.1474,1388
-1.1135,-9.8886,-0.1641,0.529,-9.8886,2.4389,7.7496,4.3803,1389
-0.1333,-10.212,1.5552,1.6844,-10.212,0.8859,7.2315,5.4596,1390
-1.0581,-9.9773,0.0102,0.5231,-9.9773,0.9051,6.2745,3.7836,1391
0.6645,-9.8938,5.3946,2.9849,-9.8938,4.0859,17.6991,11.2067,1392
-2.5379,-10.0355,0.609,1.8862,-10.0355,2.6512,8.0446,4.8239,1393
-4.1017,-10.1048,1.2032,3.0663,-10.1048,3.5177,11.8474,8.5454,1394
-3.6439,-10.0258,1.7439,2.9191,-10.0258,6.9357,19.7026,11.6731,1395
-0.5447,-10.1475,-0.065,0.447,-10.1475,1.1758,6.1727,4.4575,1397
-2.0907,-10.0583,-0.3096,0.8688,-10.0583,1.5641,8.0616,4.6919,1398
-2.762,-10.1591,-0.5386,1.0858,-10.1591,2.6642,10.7531,7.3923,1399
-0.8583,-10.1248,0.1396,0.5358,-10.1248,1.2096,4.8182,2.3204,1400
-3.1461,-9.8437,-0.401,1.6221,-9.8437,0.894,5.5434,4.713,1401
-0.7814,-9.9093,0.2375,0.7112,-9.9093,0.7627,7.6842,6.0681,1403
-0.4751,-9.8589,0.731,1.2222,-9.8589,2.9044,8.1778,5.9147,1404
-2.3026,-9.9385,-0.249,0.8072,-9.9385,2.5551,7.3169,3.8237,1405
-1.0543,-9.9036,1.2034,1.8416,-9.9036,1.5153,7.8531,7.5595,1406
-1.0445,-10.081,1.3973,1.7031,-10.081,4.351,12.6177,8.2315,1407
-0.3711,-9.9948,0.4263,0.5616,-9.9948,2.11,8.6762,4.3404,1408
-0.3289,-10.1694,1.1711,1.1294,-10.1694,1.7968,8.8389,7.6266,1409
0.0435,-10.1181,3.6521,2.8665,-10.1181,2.271,17.2618,12.3737,1410
-0.771,-10.0967,0.4897,1.0152,-10.0967,1.5093,8.4934,5.5852,1411
-1.3431,-10.0744,0.1698,1.1949,-10.0744,1.2443,10.8962,4.7077,1412
-2.3136,-9.987,0.8398,1.9093,-9.987,3.6233,12.1972,7.9379,1413
-1.2004,-9.9717,0.3757,1.0828,-9.9717,2.2786,8.6556,4.8764,1414
-3.6157,-10.1271,1.5454,3.7598,-10.1271,3.4416,13.4729,9.993,1415
-14.4738,-10.061,5.3749,10.709,-10.061,11.3534,30.5682,21.4379,1417
-3.6116,-9.9974,0.3986,2.4032,-9.9974,3.4121,13.4004,7.0413,1418
0.0013,-10.1079,4.4007,3.6603,-10.1079,2.6641,14.6482,12.2555,1419
-1.8289,-10.0838,0.4529,1.3323,-10.0838,0.8391,12.5656,10.7384,1420
-1.3582,-10.134,-0.1459,1.0996,-10.134,2.1441,25.9052,24.7017,1421
-6.7154,-10.0042,-2.0878,3.2388,-10.0042,2.8562,13.3084,9.4054,1422
-12.8329,-9.8994,-5.9337,4.9696,-9.8994,1.4099,7.8335,6.2212,1423
-2.1819,-9.9542,-0.6215,0.9379,-9.9542,1.4858,3.4266,1.8168,1425
-0.9821,-9.955,-0.2668,0.6767,-9.955,1.0508,2.6083,1.7638,1426
-1.1686,-9.9399,-0.4663,0.43,-9.9399,0.5935,2.0018,1.6575,1427
-4.4106,-10.0542,-0.2819,2.0745,-10.0542,1.4157,6.7261,5.7668,1428
-17.4007,-9.9632,-1.3665,5.645,-9.9632,3.0942,26.059,18.1499,1429
-49.6346,-9.9633,-2.1929,14.221,-9.9633,7.5948,66.1403,28.1486,1430
-8.6057,-10.21,18.4757,26.8227,-10.21,15.4388,72.7519,54.7913,1432
-5.3522,-10.0837,3.3778,7.1067,-10.0837,7.1435,46.866,36.5202,1433
-3.6323,-10.0304,0.2113,3.0512,-10.0304,1.2777,22.5668,14.6633,1434
-4.3061,-9.9691,2.5818,5.9481,-9.9691,5.4198,42.2457,20.6354,1435
-2.4997,-10.0019,-0.1983,1.5919,-10.0019,2.6242,37.3494,17.9872,1436
-0.6186,-10.1777,1.268,1.4484,-10.1777,1.3471,19.2621,15.3676,1437
-7.7344,-9.923,7.0014,10.4539,-9.923,3.0787,23.8945,14.8603,1439
-5.4686,-10.2307,1.3704,3.1155,-10.2307,2.8913,16.0784,8.8373,1440
1.6155,-10.2247,13.31,8.45,-10.2247,3.9477,36.6617,16.5824,1441
1.1255,-10.0202,3.8366,2.6718,-10.0202,1.0016,15.4286,11.1377,1442
-2.0159,-10.0418,0.0512,0.9553,-10.0418,2.0066,18.2197,7.4454,1443
-0.3641,-9.9296,3.418,2.6033,-9.9296,4.9019,20.1364,12.7158,1444
-3.1239,-9.9792,2.2607,4.4845,-9.9792,1.754,18.3489,13.7277,1445
-3.2173,-10.1003,5.0411,6.4271,-10.1003,4.4811,53.5936,46.2545,1446
-3.1739,-10.0567,0.9376,2.1823,-10.0567,3.075,42.8941,26.5833,1448
-5.586,-10.02,1.7492,3.2277,-10.02,5.1706,22.1246,12.9896,1449
-0.3919,-9.9623,2.0489,2.7271,-9.9623,3.8757,18.6566,12.1388,1450
-12.9387,-10.0379,-0.1015,9.4778,-10.0379,5.0332,26.9077,16.048,1452
-1.3991,-10.0715,3.0257,4.7567,-10.0715,5.5278,24.008,11.4805,1453
-1.5821,-10.1454,3.3484,3.3334,-10.1454,2.2832,12.6098,7.2829,1454
-1.5643,-10.0277,3.0771,2.4468,-10.0277,3.6808,23.116,12.1983,1455
-1.0314,-10.0325,-0.073,0.7304,-10.0325,0.5259,3.2786,2.4981,1456
-1.1138,-9.5083,0.3524,0.9412,-9.5083,2.17,6.2231,4.0489,1457
-1.2284,-9.7726,-0.1688,0.9416,-9.7726,1.4239,8.5801,4.8199,1458
-2.609,-10.3575,-0.9691,1.0047,-10.3575,1.6195,6.1091,5.474,1459
-1.5656,-10.063,-0.1805,0.6114,-10.063,1.0856,4.6399,2.3978,1460
-2.0112,-9.9834,-0.1263,0.7825,-9.9834,2.196,13.6727,6.553,1462
-2.0402,-10.0423,0.8763,2.0101,-10.0423,1.8776,16.976,9.2045,1463
-6.2387,-10.0127,-0.2943,2.8807,-10.0127,2.1673,13.2751,7.3059,1464
-2.9433,-10.063,-0.4096,1.1326,-10.063,1.6076,8.7151,6.4496,1465
-12.3501,-10.0212,2.0422,9.3887,-10.0212,3.4936,21.4139,17.0316,1466
-7.0327,-10.0379,1.0836,6.02,-10.0379,1.5107,13.6609,8.8237,1467
-0.5714,-9.8978,0.2141,0.3814,-9.8978,0.9337,6.7106,3.124,1468
-9.19,-9.9742,-0.8859,2.7361,-9.9742,2.4005,8.4623,3.807,1469
-0.1667,-10.088,1.0896,1.1574,-10.088,2.7318,14.1419,4.6587,1470
-0.993,-10.106,1.6224,1.4441,-10.106,3.542,11.7685,6.9365,1472
-0.6732,-9.9701,0.3102,0.7191,-9.9701,2.7086,8.1231,4.1943,1473
-0.9103,-10.1074,0.0317,0.8548,-10.1074,1.6196,12.4693,5.2828,1475
-0.8487,-9.8883,0.1352,0.5403,-9.8883,1.0106,10.1684,5.7223,1476
-0.4584,-10.3118,1.8792,2.4167,-10.3118,4.0052,26.8201,22.927,1477
-2.1931,-10.0207,2.6571,3.3402,-10.0207,2.9392,21.2834,11.3489,1478
-3.6454,-9.5615,2.2497,4.4006,-9.5615,1.3648,44.7272,39.2707,1479
-3.851,-10.0949,-0.0807,1.6549,-10.0949,3.5341,29.1125,13.915,1480
-3.8159,-9.9973,5.0358,6.8119,-9.9973,6.2659,23.6092,14.3173,1482
-3.8733,-10.0227,3.1577,5.4602,-10.0227,7.5223,19.6206,14.8043,1483
-6.3898,-9.239,1.7052,4.6429,-9.239,2.0436,13.6211,10.1039,1484
-2.4642,-8.2893,0.3389,1.4323,-8.2893,1.8295,17.2892,9.0373,1485
-0.4576,-10.1131,1.3578,1.6811,-10.1131,1.83,9.8121,4.9875,1486
-0.1948,-10.0134,1.1491,1.5447,-10.0134,1.8012,14.4718,4.5193,1487
-46.3969,-9.9332,-15.7581,15.6536,-9.9332,6.0469,30.6508,20.8974,1488
-11.7288,-9.8475,2.8312,10.3679,-9.8475,7.7602,23.4507,11.3835,1489
-23.4609,-9.6611,-12.682,9.0993,-9.6611,3.6301,42.2336,40.0823,1491
-4.5655,-10.0083,-1.5066,1.5555,-10.0083,4.2578,11.0655,10.3439,1492
-8.8486,-10.0177,-0.6217,3.4359,-10.0177,2.7471,5.7381,2.6429,1493
-8.2198,-10.0458,-1.458,3.2706,-10.0458,2.5472,9.4948,8.2566,1494
-4.8762,-10.013,-0.6025,2.115,-10.013,2.7846,6.2652,2.5714,1495
-17.912,-10.0032,-0.2985,2.9665,-10.0032,2.4693,18.5082,1.4255,1497
0.0403,-10.0087,0.2339,0.1058,-10.0087,0.2471,1.6525,1.3693,1498
