AYGX_min,AZ_mean,AYGX_mean,AYGX_std,AZ_mean.1,GX_std,Gnorm_max,Gnorm_median,timestamp
-16.2632,-10.1695,5.9976,15.2292,-10.1695,9.8751,68.4312,60.3957,287
-336.5292,-9.559,-55.3235,98.6709,-9.559,17.3301,62.9819,40.76,288
-991.8749,-7.7935,-231.2676,288.7858,-7.7935,29.3249,98.5586,39.4878,289
-334.7451,-6.0558,-5.8374,208.3277,-6.0558,25.5603,42.7267,26.4608,290
-26.0343,-9.6846,116.019,105.5472,-9.6846,3.1007,55.8507,46.6732,291
