AYGX_min,AZ_mean,AYGX_mean,AYGX_std,AZ_mean,GX_std,Gnorm_max,Gnorm_median,timestamp
-15.8618,-9.8406,-1.2641,7.2194,-9.8406,7.7953,25.79,14.6122,1318
-2.319,-7.6315,2.2253,3.5786,-7.6315,2.2716,31.6459,17.0963,1319
-18.3452,-9.8475,-2.6436,4.6918,-9.8475,4.4536,25.8346,11.703,1320
-22.9497,-10.5022,-4.0088,8.4289,-10.5022,1.5863,17.2057,13.624,1322
-48.408,-9.7642,-4.4811,8.5886,-9.7642,7.456,25.9184,11.6855,1323
-14.4276,-9.9152,-0.4535,5.2382,-9.9152,3.2801,30.2771,7.0849,1324
-10.5996,-9.986,1.7025,4.1512,-9.986,3.6531,17.9367,8.1964,1325
-12.1588,-7.6613,-3.714,5.1715,-7.6613,2.3261,16.861,12.3341,1327
-29.8691,-9.5856,-1.6937,7.5161,-9.5856,6.9476,23.1816,13.5355,1328
-0.2842,-9.2895,7.834,5.1554,-9.2895,4.3698,22.6342,14.6588,1329
-4.9768,-9.9558,-0.0538,2.1965,-9.9558,2.7147,17.464,7.029,1330
-3.7062,-10.1833,1.6888,5.2598,-10.1833,5.3412,20.3055,17.7586,1332
-16.6526,-9.9912,1.7005,6.8305,-9.9912,7.2642,19.1031,14.4005,1333
3.4215,-9.8876,10.2878,6.3941,-9.8876,2.9754,16.6821,14.3966,1334
-18.817,-9.8905,-0.3915,5.6176,-9.8905,4.7668,18.8333,9.4281,1335
-6.799,-10.0569,-1.6739,2.6996,-10.0569,4.2335,13.8147,8.1176,1337
-15.9685,-9.942,5.4404,13.1609,-9.942,10.1083,38.303,16.5911,1338
-12.8619,-9.6956,5.9838,10.5341,-9.6956,11.3748,31.4177,20.412,1340
-7.5757,-8.3163,11.6134,11.9589,-8.3163,11.7782,32.0105,15.3138,1342
-17.5622,-10.0003,-0.8127,8.2182,-10.0003,3.7887,19.9192,15.3824,1343
-16.7063,-9.4777,9.8699,19.3477,-9.4777,6.8403,44.6296,14.7463,1344
-2.776,-9.9981,-1.148,1.6763,-9.9981,4.9937,14.388,9.2266,1345
-5.3769,-9.9968,5.4566,5.1484,-9.9968,7.2274,22.7065,14.7303,1346
0.2038,-9.9139,5.5729,5.7878,-9.9139,2.6088,13.5014,10.2946,1347
-13.3423,-9.6649,-1.3544,4.5425,-9.6649,5.0063,18.7123,6.8254,1348
-7.9365,-10.0794,0.0325,3.2281,-10.0794,4.6875,12.1018,7.6206,1349
-0.5633,-9.8455,1.8762,4.6293,-9.8455,3.1059,10.6956,8.3199,1350
-11.431,-9.7875,-1.3666,7.7839,-9.7875,3.7219,19.9294,14.0183,1351
-27.082,-9.676,-1.6017,8.954,-9.676,8.0369,17.8068,8.4436,1353
-4.2912,-9.9518,-0.0788,2.2943,-9.9518,4.2208,11.49,6.4298,1354
-2.2383,-9.7772,5.8527,4.4155,-9.7772,2.9437,17.0372,12.9646,1355
-0.7764,-9.9875,0.9069,1.0943,-9.9875,4.4095,15.8111,11.6179,1356
-7.4755,-9.8508,3.3455,5.0117,-9.8508,3.9961,15.1765,8.382,1357
-12.3974,-9.9898,0.6753,6.4524,-9.9898,6.5294,21.8112,15.1025,1358
-7.5994,-9.9058,3.0726,7.624,-9.9058,4.8387,17.9639,9.6325,1359
-8.864,-9.9567,1.8173,4.614,-9.9567,4.7571,24.7411,12.0953,1360
-1.546,-10.1045,-0.0411,0.9389,-10.1045,1.6225,5.4246,4.5425,1362
-14.2055,-9.9775,3.0486,10.3132,-9.9775,10.3874,29.4389,13.4986,1363
3.829,-10.0777,8.5667,2.668,-10.0777,3.8115,20.2136,17.0712,1364
-3.5949,-9.9806,0.5803,1.746,-9.9806,2.7107,11.6392,4.6131,1365
-2.1604,-10.0665,1.6608,3.0369,-10.0665,5.1207,13.1155,9.1222,1367
-5.0549,-9.2643,0.3455,2.8985,-9.2643,4.2662,25.4295,11.5225,1368
-7.3689,-10.4971,-0.5136,4.0875,-10.4971,4.1566,17.1784,9.6595,1369
-31.7651,-8.3999,7.1954,27.1912,-8.3999,12.7037,39.635,17.8998,1370
-6.8263,-9.9129,0.4231,4.393,-9.9129,3.0878,20.941,14.5943,1372
-2.6428,-9.8999,13.3886,12.2178,-9.8999,20.5558,38.8233,21.6305,1373
-4.8553,-10.0489,17.663,12.0251,-10.0489,2.8468,39.4029,29.3657,1374
-5.5667,-10.0137,7.3187,11.3308,-10.0137,7.3289,37.074,17.8912,1375
-0.5142,-9.9348,0.1741,0.7411,-9.9348,2.4119,9.1811,7.566,1377
-9.7363,-9.9336,0.3694,2.9584,-9.9336,5.7559,14.4619,8.3692,1378
-13.4573,-9.9905,6.1689,15.215,-9.9905,2.6365,21.0386,18.9481,1379
-5.9806,-9.784,6.3505,11.7318,-9.784,7.1002,30.8031,24.1227,1380
-21.1438,-10.0854,8.1189,31.0519,-10.0854,16.9728,56.6879,38.1229,1382
-11.1082,-9.9066,0.9432,4.3185,-9.9066,7.2063,21.6154,9.943,1383
-11.2812,-9.992,1.212,6.6882,-9.992,5.9311,20.0386,13.4788,1384
-4.6295,-9.9851,1.9231,4.3416,-9.9851,4.8197,17.1636,8.0331,1385
-0.3032,-9.9236,2.0903,2.0338,-9.9236,2.8338,11.9701,8.0927,1387
-12.0804,-9.9791,1.1183,5.0098,-9.9791,7.4413,20.938,9.5045,1388
-2.098,-9.9298,1.2025,2.2085,-9.9298,2.89,10.9927,5.919,1389
-4.3275,-9.5946,3.0296,7.3426,-9.5946,7.4344,18.7028,11.4517,1390
-12.4382,-9.9814,-2.7469,4.6285,-9.9814,3.4899,10.4742,6.8327,1392
-16.6271,-9.8676,1.6563,9.5292,-9.8676,8.5585,30.3329,10.7201,1393
-8.6235,-10.1264,4.9251,6.8254,-10.1264,2.9025,14.2731,12.1192,1394
-18.0073,-9.1805,1.6343,7.814,-9.1805,6.9778,25.3737,12.9305,1395
-9.0684,-10.6295,9.061,10.0297,-10.6295,5.7704,25.8648,14.7629,1397
-23.4354,-9.9636,11.4197,27.2051,-9.9636,17.4178,49.7988,17.533,1398
-30.297,-10.1953,11.1549,23.978,-10.1953,22.641,43.4152,33.9958,1400
-0.3224,-10.0099,15.1758,16.3599,-10.0099,2.6876,33.6089,31.3034,1401
-3.3665,-10.1131,0.9105,2.7299,-10.1131,3.0267,27.0087,15.2249,1402
-12.2541,-10.0374,0.8523,8.8542,-10.0374,5.6805,29.417,19.1641,1403
-20.5714,-9.9132,1.1593,7.0147,-9.9132,6.7596,18.6852,14.2216,1404
-3.1754,-10.3064,3.3968,5.6078,-10.3064,4.6043,15.873,6.94,1405
-3.0526,-9.9515,-0.4841,1.2904,-9.9515,3.2926,12.8697,6.646,1406
-1.6639,-10.0183,5.2925,10.1897,-10.0183,6.9321,26.1364,8.9708,1408
-14.0984,-9.9798,3.4755,12.0484,-9.9798,7.4828,30.1925,13.1278,1409
-2.5235,-10.2792,4.694,8.8772,-10.2792,5.2894,15.0826,13.6413,1410
-6.1945,-9.7019,3.3604,8.4301,-9.7019,9.6212,23.4202,15.0231,1411
-6.8716,-10.1173,8.9276,10.3858,-10.1173,14.7968,29.8486,15.6919,1413
-19.0115,-9.7711,4.8088,13.9001,-9.7711,14.4746,36.507,17.8606,1414
-30.7428,-8.802,3.6833,18.1222,-8.802,11.3293,36.4205,19.8589,1415
-14.8391,-9.9726,16.8022,22.1242,-9.9726,3.5604,28.794,22.2566,1417
-22.4783,-9.2545,5.1593,12.469,-9.2545,9.6152,31.8217,15.1748,1418
-27.0204,-9.9322,-0.5289,10.2551,-9.9322,6.4516,14.9668,9.9948,1419
-2.6588,-10.0084,1.0054,1.8481,-10.0084,3.6099,10.1623,5.6598,1420
-3.4005,-10.025,1.2045,2.9311,-10.025,3.3176,11.0733,7.6323,1422
-4.2122,-9.9484,3.3078,5.7796,-9.9484,7.5241,19.5458,10.0681,1423
-2.9481,-10.2698,0.8276,3.3783,-10.2698,5.3244,15.4342,9.4249,1424
-3.6464,-10.0718,0.1111,1.0825,-10.0718,3.3592,8.9163,3.7247,1425
-0.0981,-9.9358,1.7336,2.1582,-9.9358,3.6405,9.7105,7.1847,1427
-15.2855,-10.0951,1.8638,7.8136,-10.0951,7.9374,21.1586,10.871,1428
-5.9071,-10.2899,-2.2519,2.8082,-10.2899,2.7024,7.896,6.2814,1429
-26.7146,-9.9784,3.1331,12.5662,-9.9784,8.4949,33.0026,16.6593,1430
-5.7789,-10.0515,3.3407,6.0966,-10.0515,6.7844,22.4893,17.3847,1432
-7.28,-9.9473,2.0509,5.4962,-9.9473,4.5671,15.6736,6.6141,1433
-0.57,-9.9263,0.0688,0.4662,-9.9263,0.8332,6.1226,3.1927,1434
-6.6171,-10.0013,-1.1392,1.7945,-10.0013,3.463,11.6557,5.0315,1435
-0.3412,-10.3313,10.4067,9.8893,-10.3313,6.1649,19.5553,15.7362,1437
-4.2497,-9.9289,8.2783,13.5056,-9.9289,7.8235,19.2305,12.8189,1438
-5.2508,-10.7316,14.5475,16.3268,-10.7316,14.2973,39.0962,31.4744,1439
-8.2691,-9.9968,3.5878,9.1746,-9.9968,4.8905,18.4775,12.6903,1440
-13.0735,-10.0081,0.1115,4.842,-10.0081,3.3169,12.499,6.0468,1442
-8.3251,-10.0336,-0.0907,3.4923,-10.0336,4.1792,14.8083,7.2289,1443
-26.6647,-10.1876,8.7733,20.1617,-10.1876,15.5493,44.9635,25.1518,1444
-31.1849,-9.4989,0.4095,16.4239,-9.4989,5.3468,33.3481,18.6296,1445
-14.391,-9.9851,-0.4656,6.8818,-9.9851,6.8007,24.2258,13.8239,1446
-8.6103,-10.1538,1.2094,4.5167,-10.1538,3.9422,14.8213,8.6097,1447
-0.6331,-9.7749,14.8748,12.7888,-9.7749,5.7436,17.9686,15.7657,1449
-23.869,-10.1308,-10.0753,11.7943,-10.1308,4.2724,26.8172,18.0977,1450
-12.7733,-10.0213,-2.4438,5.5096,-10.0213,3.3305,19.401,9.9679,1451
-4.7798,-10.1353,1.857,3.6138,-10.1353,4.4684,18.0033,7.3997,1453
-6.9916,-10.0215,-1.0066,2.9772,-10.0215,3.233,11.1375,6.9472,1454
-3.7115,-10.2285,0.1802,2.6062,-10.2285,2.7101,10.7354,7.856,1455
-9.2216,-9.6712,-0.4206,5.4155,-9.6712,5.1202,18.15,10.8359,1456
-6.8369,-10.0006,3.2975,7.5697,-10.0006,6.8463,20.3645,6.7903,1458
-4.3251,-9.9368,0.2128,2.137,-9.9368,4.1396,11.0058,6.2001,1459
-1.1788,-9.9888,1.9628,3.863,-9.9888,4.3407,11.6616,7.4301,1460
-4.0217,-10.1439,1.4082,3.1653,-10.1439,1.9517,11.5184,10.1767,1461
-6.6723,-9.9441,0.9703,4.0711,-9.9441,7.068,12.4343,7.8438,1463
-4.2079,-9.7878,-0.24,1.9081,-9.7878,3.8345,13.1477,5.3219,1464
-8.128,-9.9304,1.473,3.5999,-9.9304,5.3497,14.5135,9.9877,1465
-4.4343,-9.9733,0.3566,2.7096,-9.9733,2.2092,14.5014,9.1503,1467
-9.5322,-9.9839,2.8629,7.2968,-9.9839,7.626,21.9271,11.4715,1468
-5.6504,-9.9214,-1.0845,3.6509,-9.9214,2.7856,15.3898,10.4773,1469
-3.7434,-9.9763,0.1485,2.0802,-9.9763,2.8841,15.6842,5.4725,1470
-5.4671,-10.2354,-0.9168,2.8016,-10.2354,3.671,10.1742,6.3401,1472
-12.4211,-9.9041,2.1997,6.4601,-9.9041,8.0243,21.0961,10.2846,1473
-1.7119,-10.1658,1.0256,3.7062,-10.1658,1.6472,12.2844,6.9586,1474
-13.2233,-10.053,0.0789,5.2942,-10.053,7.1544,22.2241,10.8723,1475
-5.7517,-9.6711,0.0275,3.2968,-9.6711,3.4878,14.6017,7.0819,1477
-6.1071,-9.9675,2.118,5.9033,-9.9675,7.6318,19.0789,11.876,1478
-5.2478,-10.3884,-0.9965,2.2497,-10.3884,2.0569,9.9897,7.2805,1479
-8.1316,-9.7684,-0.421,4.1409,-9.7684,5.295,12.2212,8.5303,1480
-5.8103,-9.5522,-2.3524,2.6428,-9.5522,6.5975,17.5855,9.6563,1482
-6.9711,-9.9624,0.8153,3.8198,-9.9624,5.8194,25.3064,11.036,1483
-4.4267,-9.5433,-0.5258,2.9971,-9.5433,2.4815,15.0271,8.9024,1484
-3.4134,-9.9598,1.1703,2.6308,-9.9598,2.7239,11.7454,7.0759,1485
-1.8481,-10.243,2.26,3.33,-10.243,2.3813,14.5229,9.9209,1487
-19.6342,-9.7257,5.2299,10.8708,-9.7257,12.0534,36.4677,23.1974,1488
-3.9074,-11.0305,20.9086,34.0155,-11.0305,24.5425,72.776,53.2484,1489
-17.6769,-10.001,2.1394,7.0364,-10.001,5.0754,23.108,11.5616,1490
-5.8805,-10.1677,0.3069,3.1415,-10.1677,6.3101,14.5532,7.7568,1492
-27.3183,-9.746,-1.5546,6.8921,-9.746,6.1559,25.1075,9.618,1493
-20.3104,-9.9744,-4.5068,8.5389,-9.9744,2.5839,11.1587,8.2537,1494
-14.5131,-9.6625,0.0956,8.5362,-9.6625,6.3859,23.7707,7.9332,1495
-13.5101,-10.0804,2.232,8.3464,-10.0804,7.8546,26.572,10.3739,1497
-11.6388,-9.5658,9.9027,11.5329,-9.5658,5.3364,31.1356,19.0853,1498
-9.6637,-9.2032,-0.9872,5.2469,-9.2032,2.9342,12.3482,8.687,1499
-9.1847,-10.0909,3.0879,7.0555,-10.0909,5.2801,17.6036,11.7166,1501
-17.6569,-9.6386,1.3109,7.9851,-9.6386,6.892,20.5485,12.4462,1503
-28.7348,-10.059,-0.4814,10.979,-10.059,6.823,28.2444,8.2043,1504
-5.8391,-9.7528,6.8658,8.5338,-9.7528,16.0928,31.6037,25.1323,1505
-3.8225,-10.0635,2.9252,4.209,-10.0635,3.9177,15.416,9.6043,1506
-29.8813,-9.9143,19.8534,34.328,-9.9143,19.0321,43.5992,21.6683,1507
-7.1917,-9.8642,10.4078,15.2025,-9.8642,11.3937,32.8566,15.4594,1508
-4.3316,-10.1964,11.0753,19.0895,-10.1964,7.7727,38.3364,13.9207,1509
-5.7542,-10.1148,-0.0526,5.5975,-10.1148,3.7044,12.9181,10.3423,1510
-8.2543,-10.4235,2.7724,7.7454,-10.4235,7.1099,16.4938,9.9261,1511
-0.2204,-10.193,19.4936,21.1311,-10.193,7.1839,24.3668,23.3472,1513
-12.2204,-10.0239,14.3958,18.0833,-10.0239,2.5069,21.3347,18.3495,1514
-11.53,-9.9627,1.4229,7.719,-9.9627,7.6601,20.6948,14.0307,1515
-24.7843,-9.7307,3.1741,9.2579,-9.7307,9.9229,26.9024,15.3999,1517
-17.6998,-10.1769,4.3288,11.9691,-10.1769,7.4598,25.0874,12.8138,1518
-18.0208,-9.2106,1.424,12.0946,-9.2106,6.5073,27.3355,17.8246,1519
-17.4804,-10.0073,4.5731,13.6799,-10.0073,6.2557,27.202,17.1469,1520
-22.0653,-9.9315,0.251,7.0944,-9.9315,5.2669,20.6874,10.0206,1522
-3.4221,-10.156,6.6695,9.3585,-10.156,10.8323,21.5255,16.2251,1523
-7.4464,-9.6987,6.5128,10.8627,-9.6987,4.513,17.0714,13.943,1524
-9.9506,-10.0959,5.046,12.5587,-10.0959,11.6534,26.3904,15.8614,1525
-17.9826,-9.9946,2.3262,9.798,-9.9946,7.4672,23.4706,9.495,1527
-7.3539,-9.9416,0.6993,5.732,-9.9416,1.3836,11.4615,9.2226,1528
-0.8058,-10.1937,0.6546,1.3932,-10.1937,3.0738,8.8337,4.6918,1529
-13.1707,-10.1715,2.7209,8.4184,-10.1715,9.4123,30.6232,21.5665,1530
-38.7565,-9.8847,2.8748,10.8133,-9.8847,9.4858,23.5988,13.8963,1532
-7.6735,-10.76,1.3916,6.4885,-10.76,2.4444,16.7862,12.9082,1533
-3.4225,-9.8949,1.3859,2.6122,-9.8949,5.0043,22.8078,8.1946,1534
-12.9331,-9.9807,10.0315,14.579,-9.9807,13.288,37.4773,15.3627,1535
-10.2915,-10.0136,6.2478,9.9636,-10.0136,13.2491,28.8909,17.355,1537
0.0724,-10.175,10.3268,8.5087,-10.175,10.2034,33.1631,28.8899,1538
-12.9904,-9.9439,14.9918,19.0079,-9.9439,2.1521,28.5969,22.6766,1539
-65.0851,-9.3949,24.9766,45.7392,-9.3949,20.11,61.7275,48.1428,1540
-75.0753,-9.9341,3.8389,29.2153,-9.9341,9.7994,62.7229,35.9758,1542
-44.1872,-10.1369,13.2024,25.8461,-10.1369,16.3075,52.1907,27.6962,1543
-5.3897,-12.8328,34.952,44.8613,-12.8328,26.8987,86.1953,69.3215,1544
-40.4963,-10.3326,102.2971,144.104,-10.3326,45.3399,106.0088,68.413,1545
-24.3705,-10.3689,45.4373,56.6245,-10.3689,33.3536,79.9255,60.6432,1547
-12.2956,-10.0491,3.9966,9.2819,-10.0491,12.6904,37.922,19.9541,1548
-5.9694,-10.0163,-0.6553,3.2135,-10.0163,4.111,15.9577,11.6984,1549
-12.327,-9.6121,10.9233,14.0636,-9.6121,11.5207,28.4553,18.9999,1550
-7.7529,-10.0129,2.9729,6.4414,-10.0129,6.2795,26.211,13.9137,1552
-19.2755,-9.7525,2.3433,10.0077,-9.7525,12.2132,28.3408,15.8815,1553
-0.3832,-9.417,15.575,13.1103,-9.417,2.5469,28.5297,20.6012,1554
-20.1546,-10.0933,16.211,26.5741,-10.0933,16.0524,35.8548,24.1535,1555
-7.1754,-9.3777,15.9851,18.079,-9.3777,13.1405,31.7189,21.379,1557
-2.7975,-9.5117,1.394,2.4942,-9.5117,2.4934,19.6887,8.5371,1558
-15.9344,-9.5175,2.8952,7.5341,-9.5175,8.7272,27.846,16.2555,1559
-10.3252,-9.5633,0.3939,6.5653,-9.5633,5.5277,12.8305,8.7828,1560
-2.6571,-9.9148,0.9765,2.6736,-9.9148,4.1243,15.7147,10.1353,1561
-12.479,-8.8804,2.7025,9.2439,-8.8804,9.503,34.4773,24.9103,1562
-1.9178,-10.1059,1.2985,3.0483,-10.1059,5.1594,23.3515,13.9743,1563
-16.2463,-8.4139,7.0621,17.3303,-8.4139,14.1425,38.9284,26.9226,1564
-19.6178,-9.9457,6.6884,15.9449,-9.9457,11.9735,31.4553,15.0147,1565
-8.1593,-9.8777,3.6989,6.051,-9.8777,3.8651,12.1771,10.2344,1566
-13.1933,-9.8929,-0.0316,4.348,-9.8929,5.1878,19.0004,8.6847,1568
-11.8258,-10.48,2.4747,6.7204,-10.48,7.2491,31.0622,18.276,1569
-8.9829,-9.9455,1.6893,5.9865,-9.9455,5.5798,21.1594,9.8892,1570
-0.885,-10.1475,-0.1187,0.637,-10.1475,1.9129,17.5812,8.3897,1571
-17.8746,-9.9573,1.4762,8.5493,-9.9573,10.3684,20.0429,12.8233,1573
-6.2321,-9.9408,0.788,5.4349,-9.9408,4.6393,13.368,7.3081,1574
-4.8908,-10.0311,8.9746,14.5488,-10.0311,11.3751,33.5995,12.2948,1575
-2.0816,-9.7159,0.6004,1.9131,-9.7159,5.0125,12.1986,5.6567,1577
-8.295,-9.9812,0.6595,5.787,-9.9812,6.2498,17.5789,8.4033,1578
-6.1964,-10.0459,0.0157,2.7865,-10.0459,2.1035,9.1342,5.1537,1579
-6.7049,-9.7148,-0.3663,2.0729,-9.7148,3.414,16.0937,4.6479,1580
-2.2578,-9.8783,0.7688,2.3313,-9.8783,2.7413,8.8103,4.8258,1581
-33.5438,-10.0045,9.2835,19.1982,-10.0045,17.4518,42.157,21.0257,1583
0.0398,-10.9624,28.1246,27.6421,-10.9624,11.9877,34.6591,33.0534,1584
-10.0527,-10.029,-0.1379,4.0394,-10.029,5.1072,10.5095,6.4102,1585
-13.5659,-9.863,-1.8293,7.2165,-9.863,3.1699,13.1696,9.9348,1587
-58.4726,-10.0689,1.0564,15.2834,-10.0689,11.4897,33.3719,12.8325,1588
-12.6574,-10.3115,1.3239,6.7175,-10.3115,8.662,21.8782,19.3131,1589
-15.9105,-9.9827,2.823,9.8148,-9.9827,8.7666,18.6011,7.5424,1590
-4.5685,-9.9143,0.9897,3.9771,-9.9143,5.9384,18.1603,10.5193,1592
-14.0487,-9.9686,4.3808,9.3412,-9.9686,10.6072,23.832,13.2719,1593
-2.7427,-9.7955,0.1846,1.8857,-9.7955,1.1727,4.3878,3.3909,1594
-21.276,-9.9611,7.7072,12.163,-9.9611,14.5547,27.8297,19.5587,1595
-9.2166,-10.0462,4.0548,9.409,-10.0462,8.5753,29.0808,20.1537,1597
-6.212,-10.1,0.7361,3.9317,-10.1,6.43,25.5868,12.4693,1598
-7.2232,-9.926,5.6081,16.916,-9.926,6.1151,23.4381,19.5401,1599
-11.8815,-10.2986,7.2242,14.507,-10.2986,20.0735,51.3867,35.4166,1600
27.3144,-9.8752,47.1123,14.8593,-9.8752,8.8114,43.4813,36.052,1602
-946.5788,-10.003,-28.8622,172.8597,-10.003,21.0518,210.8231,30.5014,1603
-1188.3897,-7.6774,22.5732,470.5869,-7.6774,60.2866,195.9874,76.2249,1604
-128.4948,-9.9076,-17.1997,32.3361,-9.9076,10.5681,36.3774,10.4175,1605
-43.271,-9.9816,-7.6617,13.8588,-9.9816,10.6802,57.8301,26.8739,1607
-53.68,-10.071,4.9251,20.0364,-10.071,11.7126,82.8565,26.376,1608
-75.2946,-7.2572,-10.9226,40.6526,-7.2572,11.6486,52.1379,34.9792,1609
-125.5195,-10.0142,-10.252,63.0706,-10.0142,28.5075,86.846,50.6024,1610
-57.7994,-10.3139,37.6133,97.308,-10.3139,30.5345,72.559,55.4685,1612
-157.6801,-9.7769,-6.2766,60.6534,-9.7769,14.1858,61.6198,24.3606,1613
-91.8309,-10.1319,-24.0558,44.2997,-10.1319,14.2605,63.6375,53.5344,1615
-5.9189,-10.1468,7.4509,12.3668,-10.1468,10.4854,32.4896,25.92,1616
-1.252,-9.9898,-0.1804,0.532,-9.9898,1.453,15.2736,13.2808,1617
-3.1219,-9.6696,0.5807,3.8244,-9.6696,4.5084,18.1313,9.2652,1618
-36.8946,-10.027,6.4012,16.1251,-10.027,19.762,52.2953,29.9413,1619
-0.3184,-9.8527,3.6949,6.5594,-9.8527,7.9496,21.6521,17.8033,1620
-8.4125,-10.0646,4.8855,7.2637,-10.0646,12.5472,20.2524,14.9479,1622
-8.7773,-9.919,1.7389,7.4365,-9.919,5.4415,15.4255,9.0302,1623
-2.3495,-9.956,0.8001,1.9877,-9.956,2.621,12.8407,4.9527,1624
-5.0086,-9.7369,-0.1353,2.3059,-9.7369,3.8985,10.8392,8.7513,1625
-7.4481,-9.6325,-2.1082,3.5433,-9.6325,4.4336,9.3406,6.2569,1626
-30.2112,-9.974,6.2192,13.5503,-9.974,9.1708,25.3632,16.9621,1627
-21.159,-9.9855,5.8566,14.257,-9.9855,15.7733,26.4734,21.3983,1628
-6.7669,-10.0589,-0.9733,2.6872,-10.0589,3.0904,11.5338,9.3783,1629
-6.0796,-9.9877,2.3984,5.1764,-9.9877,4.1329,14.2653,7.3585,1630
-20.0623,-10.054,6.7745,21.5518,-10.054,10.9285,28.3225,12.5134,1632
-7.7913,-9.8865,0.6295,7.2872,-9.8865,7.3492,23.9307,8.0368,1633
-6.6196,-9.6545,-1.1912,4.6159,-9.6545,2.4131,13.9218,9.304,1634
-4.7504,-9.9649,0.6093,3.416,-9.9649,4.2259,12.8995,5.7819,1635
-3.7952,-9.9859,9.72,10.0101,-9.9859,5.0593,17.1133,14.3883,1637
-9.2819,-9.7581,17.9274,31.4013,-9.7581,17.2332,41.3949,20.485,1638
-4.5656,-10.151,4.0201,9.5995,-10.151,2.8243,21.048,13.6279,1639
-43.8303,-10.1279,18.2465,33.8004,-10.1279,24.9543,77.959,36.7427,1640
-5.9999,-10.4127,55.9432,66.5364,-10.4127,24.0366,73.5131,53.2794,1642
-11.9606,-10.0202,0.3971,6.8162,-10.0202,5.2565,24.9142,13.5712,1643
-5.031,-10.0167,10.4951,16.4875,-10.0167,13.9012,28.5323,19.2309,1644
-20.3522,-9.7818,5.9594,9.9239,-9.7818,10.0934,23.2336,17.379,1645
-12.9848,-10.2696,5.8788,9.6515,-10.2696,15.806,51.1658,25.869,1647
-11.4382,-9.8157,3.9422,10.9035,-9.8157,8.9979,44.9024,23.2658,1648
-16.8427,-9.9228,-2.3026,7.4491,-9.9228,5.6521,32.7486,8.1028,1649
-0.1123,-9.9381,3.6555,2.8013,-9.9381,1.9479,9.0137,6.4841,1650
-0.3105,-9.9562,-0.012,0.2504,-9.9562,2.611,4.4531,3.2508,1652
-0.4402,-9.9535,0.6975,0.8885,-9.9535,1.7046,5.1628,1.6779,1653
-5.3033,-9.9204,-3.1051,2.0198,-9.9204,1.7885,5.0751,2.9067,1654
-4.5385,-9.9509,0.9411,3.1638,-9.9509,3.2806,10.8842,3.4202,1655
-0.9972,-9.9689,-0.1331,0.4268,-9.9689,1.1178,3.5696,1.5853,1657
-3.5802,-9.9564,0.8475,3.9474,-9.9564,4.3956,13.3822,1.9467,1658
-1.0982,-9.9681,0.2213,0.7898,-9.9681,1.6049,6.524,4.5074,1659
-0.9414,-9.9628,-0.1783,0.5777,-9.9628,1.7644,3.0365,2.2637,1660
-0.1143,-9.9659,-0.0654,0.0318,-9.9659,0.1153,1.4506,1.33,1661
-1.0721,-9.9696,-0.1685,0.3565,-9.9696,1.3235,3.3162,1.7266,1663
-9.764,-9.9428,-1.369,3.3526,-9.9428,3.9434,8.825,3.6336,1664
-5.8062,-9.9178,-1.2751,2.1796,-9.9178,2.047,5.0272,2.2824,1665
-1.3595,-9.9371,3.1331,5.9578,-9.9371,3.1316,14.1491,9.6897,1666
-0.4593,-9.9701,-0.103,0.1798,-9.9701,0.6318,2.7697,2.0459,1667
-0.3323,-9.9685,-0.1918,0.0995,-9.9685,0.3265,1.8904,1.6354,1668
-0.2565,-9.9685,-0.2301,0.024,-9.9685,0.0443,1.7252,1.6773,1670
-0.3152,-9.9681,-0.2433,0.0457,-9.9681,0.1463,1.8395,1.7197,1671
-0.373,-9.9682,-0.3313,0.0344,-9.9682,0.0807,1.9357,1.8945,1672
-2.2296,-9.9691,-0.433,0.6897,-9.9691,1.2819,3.3056,2.2986,1673
-1.9279,-9.9567,-0.9013,0.7922,-9.9567,0.988,5.0185,3.0164,1674
-2.0705,-9.9328,0.9751,2.7029,-9.9328,3.4096,5.6519,2.5279,1675
-8.6756,-9.9518,-1.2548,3.9277,-9.9518,5.4619,12.4076,4.3351,1677
-2.5072,-9.9603,1.6013,3.7422,-9.9603,3.0969,10.2363,5.2771,1678
-2.31,-10.0964,0.1669,1.3229,-10.0964,3.7308,23.8504,16.9442,1679
-0.5286,-9.4471,0.5544,1.0158,-9.4471,3.8154,16.0748,15.6868,1680
-12.7392,-8.3647,-0.418,10.2989,-8.3647,9.4935,31.2607,24.1508,1681
-11.3375,-7.2443,2.0235,6.2633,-7.2443,7.6377,22.6822,13.6286,1683
-1.2575,-6.7598,2.9653,7.3762,-6.7598,9.5209,33.4106,6.5016,1684
-0.1796,-6.8921,0.1042,0.1709,-6.8921,2.3754,18.4948,6.2743,1685
-0.8841,-7.8539,0.1472,0.7274,-7.8539,3.6752,23.8358,22.256,1686
-10.772,-9.6214,3.1674,8.6462,-9.6214,12.0641,33.6496,19.7776,1688
-1.4581,-9.9381,0.0429,0.8595,-9.9381,2.9072,4.22,3.3057,1689
-14.2561,-9.9317,-3.7226,4.7804,-9.9317,4.8729,10.1307,8.7752,1690
-24.5605,-9.7446,-4.5302,10.6446,-9.7446,5.6113,12.912,5.1627,1692
-30.0982,-9.9032,2.3887,11.0752,-9.9032,5.5122,51.7626,17.3972,1693
-13.2618,-9.8578,26.639,33.2887,-9.8578,13.8455,62.979,59.6433,1694
-4.8432,-9.9073,18.7386,13.9528,-9.9073,2.5423,56.997,37.1978,1697
-14.772,-9.8474,13.5957,21.3807,-9.8474,16.3819,37.6925,28.6137,1698
-0.0927,-10.1565,13.7981,10.0687,-10.1565,8.3665,35.3701,30.5155,1699
-27.0725,-8.4688,24.0123,40.3875,-8.4688,18.4186,57.956,43.4469,1700
-8.3418,-10.1226,1.3179,8.9497,-10.1226,1.0295,28.1698,26.2361,1701
-18.2153,-10.0863,9.487,20.085,-10.0863,14.797,53.9485,36.1413,1702
-21.9306,-9.8564,1.2846,8.6782,-9.8564,2.8237,26.3092,16.0532,1703
-4.9473,-10.033,1.4405,4.074,-10.033,4.2009,44.5406,32.5818,1704
-0.6512,-9.978,0.415,0.7148,-9.978,2.246,18.4764,14.5456,1705
-2.3576,-10.0014,-0.0515,1.2284,-10.0014,2.197,20.1377,17.8295,1707
-15.4438,-9.6091,0.1901,5.0107,-9.6091,6.3064,53.9308,27.0284,1708
-3.4836,-9.8219,3.1183,4.4718,-9.8219,2.9178,41.4537,19.1818,1709
-19.2376,-10.1783,4.0483,10.5357,-10.1783,9.6418,68.9089,29.7091,1710
-62.4049,-8.5828,8.9909,47.863,-8.5828,11.4276,64.0691,45.4973,1712
-56.7444,-10.1997,10.2398,37.5566,-10.1997,18.3842,102.5313,26.1921,1713
27.5248,-9.6725,68.5609,28.4487,-9.6725,8.5968,61.0987,34.4644,1714
-8.7987,-10.0596,14.4998,19.0083,-10.0596,16.8371,66.1478,39.8361,1715
-0.2746,-10.6451,1.2573,1.638,-10.6451,3.608,12.7016,9.5517,1717
-16.562,-9.5658,0.911,6.3797,-9.5658,8.8281,33.8949,18.7762,1718
-9.6867,-9.8709,0.6761,4.8867,-9.8709,2.3271,11.2237,8.8743,1719
-9.4938,-8.7034,7.9196,11.5494,-8.7034,11.7586,33.5872,21.7472,1720
-12.0574,-9.5728,1.3446,7.9476,-9.5728,9.4544,33.1781,12.7779,1722
-19.0109,-9.1819,5.2134,10.1382,-9.1819,13.3914,29.7416,16.6963,1723
-1.9285,-10.0945,8.1861,8.6821,-10.0945,4.8277,23.1218,21.032,1724
-5.5662,-8.905,2.0642,4.74,-8.905,5.1103,18.6049,12.2408,1725
-16.7452,-8.3445,0.2101,14.6535,-8.3445,8.8937,54.222,32.8328,1727
-17.7365,-9.6472,2.831,9.0261,-9.6472,3.7249,43.4785,32.6558,1728
-112.1535,-7.3117,1.8604,51.1901,-7.3117,4.4991,47.1289,32.1266,1729
-5.1609,-9.4611,40.5026,37.9278,-9.4611,3.3013,54.6117,36.5042,1730
-2.3447,-9.6189,-0.4212,1.2039,-9.6189,1.554,18.4805,16.2218,1731
-3.5319,-10.1245,13.9761,14.6018,-10.1245,13.7392,48.073,27.432,1732
-9.143,-9.9644,18.0273,26.4435,-9.9644,18.2288,44.4507,30.4855,1733
-32.6535,-10.4272,2.4827,18.4133,-10.4272,20.3012,59.7243,41.1591,1734
-4.998,-9.6227,-0.7495,1.7963,-9.6227,2.2831,18.5283,12.4911,1735
-3.7004,-8.9563,4.4525,7.204,-8.9563,7.9434,50.2926,29.1063,1736
-82.7968,-7.7148,4.1511,28.0941,-7.7148,11.2757,83.6159,19.9911,1738
-31.0802,-8.3932,3.5519,31.1332,-8.3932,19.0641,63.8037,18.5042,1739
-111.1612,-7.0865,-11.8369,40.605,-7.0865,9.689,110.5231,83.6082,1740
-73.1584,-10.5553,-7.2095,34.5086,-10.5553,7.9274,50.4261,47.9236,1741
-45.8979,-9.6014,3.3642,20.5838,-9.6014,13.352,54.1747,18.7886,1743
-9.0761,-9.806,0.2918,4.0338,-9.806,3.1054,22.93,8.5214,1744
-8.3345,-10.1506,-0.603,3.559,-10.1506,4.6242,16.4121,9.1339,1745
-22.9397,-9.5603,2.587,13.4354,-9.5603,11.413,28.4099,16.1236,1747
-24.4909,-9.9086,-1.0123,10.0912,-9.9086,11.0894,48.918,13.5007,1748
-26.6755,-10.5082,36.042,46.08,-10.5082,14.5795,49.7982,39.7885,1749
-11.0724,-9.4842,0.1139,4.1998,-9.4842,3.0277,18.6673,9.7962,1750
-9.7358,-9.8027,0.1182,4.0207,-9.8027,4.6509,16.66,6.9464,1752
-5.5956,-9.6663,-1.6042,2.0344,-9.6663,2.5399,14.02,7.6915,1753
-4.0628,-10.9871,6.724,12.1745,-10.9871,6.0275,42.8091,28.6321,1754
-26.5804,-9.8236,6.302,16.2823,-9.8236,9.7026,35.1071,21.85,1755
-31.0766,-10.2906,7.6184,18.1804,-10.2906,10.2374,42.9564,18.5041,1757
-6.3986,-9.7085,3.8225,8.5586,-9.7085,4.5025,20.3633,12.2125,1758
-4.5683,-9.0514,-1.7124,1.8405,-9.0514,1.5921,14.301,7.3853,1759
-74.1177,-9.7718,4.5224,34.2005,-9.7718,17.3248,35.6366,24.1273,1760
-29.0445,-9.4969,9.3029,21.5747,-9.4969,20.5405,58.879,29.7586,1762
-106.5027,-10.0088,25.0689,66.7057,-10.0088,28.0916,73.5612,47.1062,1763
-10.0885,-8.4255,51.9006,49.076,-8.4255,12.8145,51.6485,35.2329,1764
-20.4434,-10.1326,10.8643,20.3776,-10.1326,14.8566,45.6482,26.7658,1765
-7.1852,-9.9843,6.1034,10.1846,-9.9843,9.9776,36.1268,27.353,1767
-34.1669,-10.0726,1.1656,12.1433,-10.0726,11.0721,61.9631,13.0555,1768
-23.4219,-9.8765,-3.0745,12.4845,-9.8765,8.4413,12.7964,8.4263,1769
-123.9079,-9.7906,-26.4023,36.6892,-9.7906,9.7087,28.6023,11.2091,1770
-82.5319,-9.7738,5.9958,24.326,-9.7738,9.0235,24.5216,10.6774,1772
-2.4835,-9.9251,-0.7571,1.0843,-9.9251,2.553,9.281,5.8601,1773
-45.3713,-9.9058,-11.1667,18.7559,-9.9058,8.5604,35.9561,16.79,1774
-8.8465,-9.8996,4.0334,6.4886,-9.8996,5.498,25.9102,12.4698,1775
-40.1515,-9.899,-7.7822,15.4323,-9.899,8.7818,45.9475,26.4111,1777
-72.0588,-9.9013,-4.7816,17.0842,-9.9013,11.6617,30.1416,12.8346,1778
-71.3143,-9.7114,-13.7176,32.5299,-9.7114,11.2946,32.2393,13.9378,1779
-11.4182,-9.8272,10.6001,9.3469,-9.8272,4.0321,34.2535,14.7245,1780
-10.2514,-10.0187,-4.2837,4.4625,-10.0187,2.7389,21.799,17.8987,1782
-19.8883,-9.9448,-0.0416,5.6506,-9.9448,8.2037,28.3127,18.8486,1783
-1.7017,-10.0063,0.4133,1.6454,-10.0063,2.207,14.5436,8.7501,1784
-9.2885,-9.938,0.2422,3.9658,-9.938,7.1936,12.7631,8.2526,1785
-7.7333,-9.9291,-2.5124,4.8764,-9.9291,3.3589,14.3652,12.2257,1787
-34.1032,-9.9363,-4.2717,11.7651,-9.9363,7.1007,16.165,5.528,1788
-37.2846,-9.8991,-0.6221,8.6945,-9.8991,6.6482,11.7659,7.3107,1789
-0.3391,-10.0353,0.3,0.7482,-10.0353,1.5825,4.3998,3.2245,1790
-30.2191,-9.9886,-15.3493,13.4901,-9.9886,2.612,16.6244,13.8102,1791
-0.4957,-9.9122,9.3051,7.8834,-9.9122,0.9076,14.4384,13.5022,1792
-3.325,-9.9458,-0.2037,1.1046,-9.9458,1.8581,10.0056,4.207,1793
-5.5615,-9.9385,0.7875,5.3196,-9.9385,6.5284,15.8209,3.557,1794
-28.3105,-9.9121,-5.9991,8.1165,-9.9121,7.1721,15.022,11.8751,1795
-11.8629,-9.9883,2.8204,7.6612,-9.9883,3.0865,10.0019,5.6907,1796
-0.4843,-9.944,1.2534,1.0599,-9.944,1.1981,25.3692,18.5118,1797
-4.6742,-9.9465,-0.3669,2.4939,-9.9465,2.5758,9.6511,5.2288,1798
-0.5574,-9.9703,0.3494,0.3355,-9.9703,0.6809,4.3495,2.2327,1799
-15.192,-9.9686,-1.2999,4.4422,-9.9686,3.4454,15.4956,8.7031,1800
-0.2443,-10.0112,0.2263,0.2083,-10.0112,1.0396,4.1047,2.5974,1801
0.247,-9.9205,0.6589,0.3885,-9.9205,1.2335,8.1634,2.4798,1802
0.028,-9.9541,0.5752,0.4667,-9.9541,1.1104,4.8782,2.8895,1803
