trip_id,label
ceg2vj6tu709fko0l7j0,False
ceg6nlin1mf0nq0rsvfg,False
ceg720in1mf0nq0s1020,False
ceg9ttv23k7u8q8iv4g0,False
cegb39n23k7u8q8jf9j0,False
cegg72v23k7u8q8kebtg,False
ceglbjf23k7u8q8l3ah0,False
cegqnhn23k7u8q8mrvd0,True
ceguhj723k7u8q8oee10,False
cegumqn23k7u8q8oh3ng,False
cegv48f23k7u8q8ooahg,False
cegv4kn23k7u8q8oog3g,False
ceh1i5f23k7u8q8pljag,False
ceh2q7f23k7u8q8pvjg0,False
cehb76f23k7u8q8r9sog,False
cehbaon23k7u8q8rarbg,False
cehccdc2hm2cvffcm0p0,False
cehg62f23k7rp9sbbnq0,True
cehjkc6tu704g62jtjjg,False
cehjrtutu704g62k1ulg,False
cehk4butu704g62k6ej0,False
cehkd6mtu704g62karm0,False
cehlcf6tu704g62knuc0,False
cehlilmtu704g62kqdj0,True
ceho716tu704g62lgld0,False
cehsrq6tu704g62m6i2g,False
cei0pdetu70c3v9uf5q0,False
cei3bgk2hm20a1u389r0,False
cei5n3s2hm20a1u4b26g,False
cei5nr42hm20a1u4bebg,True
cei6has2hm20a1u4pj3g,False
cei6im42hm20a1u4qb8g,False
cei6t9c2hm20a1u50pug,False
cei6u042hm20a1u516lg,False
cei70cc2hm20a1u52j2g,False
cei7ces2hm20a1u5a7qg,False
cei7omc2hm20a1u5hbh0,False
ceibb4k2hm20a1u783e0,False
ceimfo42hm20a1u9l400,True
ceioc5c2hm20a1uadgsg,False
ceioqps2hm20a1uakbg0,False
ceiosok2hm20a1ual8p0,False
ceip9vk2hm20a1uarb5g,False
ceipgmk2hm20a1uatsk0,False
ceipj7k2hm20a1uavf0g,False
ceipln42hm20a1ub0hbg,False
ceipric2hm20a1ub2lgg,False
ceirjak2hm20a1ubqg8g,False
ceisb542hm20a1uc68tg,False
ceisrqk2hm20a1ucgq5g,False
ceiv4mk2hm20a1udk97g,False
ceivoqc2hm20a1udrh8g,True
cej09kc2hm20a1ue0jt0,False
cej1ess2hm20a1uea5og,False
cej52d42hm20a1uevieg,False
cejak342hm20a1ufrnpg,False
cejasus2hm20a1ufu2vg,False
cejd0ic2hm20a1ugfmi0,False
cejiv3s2hm20a1uio9a0,False
cejjsac2hm20a1uj12qg,False
cejnh7k2hm20a1ujo3r0,True
cejocus2hm20a1ujsshg,True
cek0vb42hm20a1ul1pl0,False
cek2hv42hm20a1ulesr0,False
cek3v4s2hm20a1ulth7g,False
cek4k942hm20a1um59ug,False
cek4vk42hm20a1um8ur0,False
cek5b9c2hm20a1ume8p0,False
cek5ogk2hm20a1uml6k0,False
cek8pks2hm20a1unv3s0,False
cek9kg42hm20a1uo6b90,False
cekdh1c2hm20a1uouglg,False
cekelg42hm20a1up3ib0,False
cekkkps2hm20a1upu90g,False
cekkn142hm20a1upurq0,False
cekmd2723k7til7n9u3g,False
ceknkl723k7til7nr120,False
cekoss723k7til7oeoc0,True
cekqgcf23k7til7pcnfg,False
cekrciv23k7til7q5b40,False
cekromn23k7til7qfji0,False
cekruh723k7til7qkf5g,False
cekskmf23k7til7r93r0,False
cekt0tf23k7til7rhlj0,False
ceku3pn23k7til7s4rt0,False
cel0e5n23k7til7t1hng,False
cel1r6n23k7til7tcns0,False
cel2lln23k7til7ti98g,False
cel3icn23k7til7tnas0,False
cela5an23k7til7uqlmg,False
celckq723k7til7vmt80,False
celd8v723k7til001d4g,False
celdmcf23k7til0094ng,False
celdmov23k7til009ba0,False
cele5vf23k7til00hkf0,False
cele9vv23k7til00jfa0,False
celfkjf23k7til01cl7g,False
celg8j723k7til01pr20,False
celgf7n23k7til01ui6g,False
celgka723k7til022d8g,False
celhrr723k7til02ue7g,False
celi5k723k7til034rv0,False
celj4sk2hm22a1c453j0,False
celjh8c2hm22a1c4bkqg,False
celli6k2hm22a1c52q8g,False
cem1oif23k7hf6ijbbm0,False
cem3aiv23k7hf6ik7ks0,False
cem3d4723k7hf6ik8pg0,False
cem5j1n23k7hf6illcm0,False
cem747f23k7hf6imr85g,False
cem7rfv23k7hf6in9s6g,False
cem7vff23k7hf6incbmg,False
cem84dv23k7hf6infgeg,False
cem855f23k7hf6infueg,False
cem9ban23k7hf6io0t20,False
cemajbv23k7hf6ioek20,False
cemf5kv23k7hf6ipcqag,False
cemfdon23k7hf6ipf6l0,False
cemh91v23k7hf6ipnn80,False
cemkb3v23k7hf6iqbl60,False
cemncsn23k7hf6irtr0g,False
cemoonf23k7hf6islj00,False
cempoe723k7hf6itc0fg,False
cemr73723k7hf6iul3fg,False
cemracf23k7hf6iuo9f0,False
cemrn5723k7hf6iv4d50,False
cemrq5723k7hf6iv7o30,False
cems7a723k7hf6ivj260,False
cemu0on23k7hf6j0p0o0,False
cemu90n23k7hf6j0tfkg,False
cen01iv23k7hf6j1lhl0,False
cen12tn23k7hf6j20rp0,True
cen295f23k7hf6j2ek90,False
cen57ln23k7hf6j30io0,False
cen85un23k7hf6j3dhu0,False
cen9rtf23k7hf6j3tfr0,False
cenaenv23k7hf6j44eug,False
cenb5gn23k7hf6j4e51g,False
cenbq7n23k7hf6j4o03g,False
cenc52v23k7hf6j4tf60,False
cenca2723k7hf6j50h70,False
cencnqv23k7hf6j5a5og,False
cend1kn23k7hf6j5gjmg,False
cenebhv23k7hf6j6aj8g,False
ceng6pf23k7hf6j7lu10,False
cengpqn23k7hf6j84ug0,False
cenh8cf23k7hf6j8gl10,True
cenhkh723k7g9vg4ap00,True
cenifbv23k7g9vg4s02g,False
cenimtv23k7g9vg507l0,False
cenisjv23k7g9vg530pg,False
cenlacv23k7g9vg63b8g,False
cenljnn23k7g9vg65sdg,False
cenmi7n23k7g9vg6gur0,False
cenmnnv23k7g9vg6ilc0,False
cenmofv23k7g9vg6ium0,False
cennkmf23k7g9vg6qje0,False
cennu9v23k7g9vg6sqk0,True
cennuq723k7g9vg6ssng,False
cenou9f23k7g9vg73930,False
ceo0tlf23k7g9vg929ug,False
ceo1c1n23k7g9vg9aoqg,False
ceo29q723k7g9vg9uh4g,False
ceo2k4723k7g9vga5kl0,False
ceo38r723k7g9vgaklq0,False
ceo3s7n23k7g9vgb3ueg,False
ceo474v23k7g9vgbddf0,False
ceo479n23k7g9vgbdivg,False
ceo47tv23k7g9vgbe940,False
ceo49c723k7g9vgbfqjg,False
ceo4lkf23k7g9vgbqsqg,False
ceo4t5f23k7g9vgc1k60,False
ceo528723k7g9vgc6hf0,False
ceo5asf23k7g9vgceuig,False
ceo5mdf23k7g9vgcplsg,False
ceo62jn23k7g9vgd2ln0,False
ceo6e6723k7g9vgda940,False
ceo6e6n23k7g9vgda9f0,True
ceo6ftn23k7g9vgdbecg,False
ceo73jv23k7g9vgdlep0,False
ceo7qsf23k7g9vge06mg,False
ceo7snn23k7g9vge18k0,False
ceo9gk723k7g9vgeoro0,False
ceobagf23k7g9vgfgtqg,False
ceoc6mv23k7g9vgfqiug,False
ceocfq723k7g9vgftpt0,False
ceocg8723k7g9vgftueg,False
ceod8fv23k7g9vgg7l90,False
ceoeb9n23k7g9vggkt40,True
ceof40f23k7g9vggujs0,False
ceofmtf23k7g9vgh6mr0,False
ceog4bf23k7g9vghb2r0,True
ceogp8f23k7g9vghgih0,False
ceoi1h723k7g9vghnmt0,False
ceoi1hv23k7g9vghnn30,False
ceojk3f23k7g9vgi1ang,False
ceojsiv23k7g9vgi32og,False
ceol39v23k7g9vgiai0g,False
ceom0hn23k7g9vgimfag,False
ceomr1v23k7g9vgj572g,False
ceooe0723k7g9vgk1pfg,False
ceoojkv23k7g9vgk5fo0,False
ceook5f23k7g9vgk5pmg,True
ceookrf23k7g9vgk6850,False
ceoq3ev23k7g9vgl7h4g,False
ceoqu8723k7g9vglsebg,False
ceore1v23k7g9vgm8j7g,False
ceorhq723k7g9vgmb4cg,False
ceorkfn23k7g9vgmcvpg,False
ceorppf23k7g9vgmgh2g,False
ceoscav23k7g9vgmqavg,False
cep855v23k7g9vgpebv0,False
cep8gun23k7g9vgpjrlg,False
cep8qkv23k7g9vgpp69g,False
cep9ibf23k7g9vgq4a6g,False
cep9kmn23k7g9vgq5aug,False
cepal7v23k7g9vgqknl0,False
cepasin23k7g9vgqpnvg,False
ceu6dqha7hhr9jkddda0,True
cf08q3ps1qo65q8ut2d0,True
cf0st324c1ck5b23lra0,False
cf9bcoq42828u48lc6vg,False
cfdfhgq4c1cj7en16p1g,False
cfii036omcnuoqsovbj0,False
cfmhc1hitt77bpa0sf60,False
cft1568rjvcto9f1fd20,False
cg0kit2g99k33m4gtf40,False
cg4thdlhgj8v26qttrhg,False
cg564geqieeb7i7u07q0,False
cg8cake7im6h988q5lbg,False
cg8n4hhqi2798df84470,False
cgc0dg67im6qqmrch1c0,False
cgcpcfuf7jtbk30lcq00,True
cgcucjef7jtbk30n1hqg,False
cgdgpmef7jtbk30s0n0g,False
cge31omf7jtbk310hbu0,False
cge9nus0pqrc12kotul0,False
cgem5ak0pqrc12kp4bc0,False
cgfaq2c0pqr3qdf1itmg,False
cgfd57pqi272ciqhb7b0,False
cgfmlsmf7jtbk31e92jg,False
cgg36cmf7jtbk31gp1f0,True
cgg5ljmf7jtbk31hbepg,False
cggjugmf7jtbk31k6qlg,False
cggqo3rm541g3u8jl2kg,False
cggvdrmrctltk0r9tlfg,False
cgh8jlbm541g3u8n17v0,False
cghavfjm541g3u8nm6pg,False
cghd6vjm541g3u8ocf7g,False
cghhobfdpd7ka9r28uj0,False
cghumfhqi272ciqkeevg,False
cghuqapqi272ciqkerb0,False
cghuqfpqi272ciqkese0,False
cghus8vdpd7n47rfcj9g,False
cghush1qi272ciqkf2u0,False
cghuvchqi272ciqkfbqg,False
cghv0gfdpd7n47rfcsu0,False
cghv0h9qi272ciqkffh0,False
cghv36pqi272ciqkfo00,False
cghv36vdpd7n47rfd3ng,False
cgiroojm541g3u96dhp0,False
cgisnf6hlan2o9oquie0,False
cgj1ocrm541g3u982p10,False
cgjdt63m541g3u9bal7g,True
cgjfmk3m541g3u9c18bg,False
cgjq64rm541g3u9ep4o0,True
cgjtes3m541g3u9fee5g,False
cgk3p9uhlan2o9oum9m0,False
cgk79nuhlan2o9our45g,False
cgk9mb7pe8sdk3bmf53g,False
cgkbt0vpe8sdk3bmg670,False
cgkinbbm541g3u9kpcng,False
cgkoeaehlan2o9p09b40,False
cgkpotvpe8sdk3bmnko0,False
cgkrb6mhlan2o9p0d5eg,False
cgkrmlfpe8sdk3bmolrg,False
cgks887pe8sdk3bmot30,False
cgl6psvpe8sdk3bmstpg,False
cgl71g7pe8sdk3bmt4pg,False
cgl76mvpe8sdk3bmtbb0,False
cgl7amnpe8sdk3bmtgm0,False
cgl7gcehlan2o9p18eog,False
cgmn63vo61i6ggoeb91g,True
cgmo26vo61i6ggoen24g,False
cgmo8dno61i6ggoepk4g,False
cgmrhpvo61i6ggog3gl0,False
cgndgono61ifqmr24ktg,False
cgnk8tvo61i2hp2g90b0,False
cgobg6vo61i2hp2mu2t0,False
cgqi5vfo61i2hp37j06g,False
cgrabe7be75spfm9rktg,True
cgrvv1akvau8srf3s810,True
