AYGX_min,AZ_mean,AYGX_mean,AYGX_std,AZ_mean.1,GX_std,Gnorm_max,Gnorm_median,timestamp
-4.8136,-9.5822,15.6277,15.1786,-9.5822,8.0147,36.8454,7.662,1068
-137.1097,-9.7428,-13.4188,37.3251,-9.7428,9.4014,55.4929,7.514,1069
-196.1686,-7.268,-142.0471,50.6342,-7.268,6.8689,79.17,73.3558,1070
11.6329,-9.4754,28.2905,15.7071,-9.4754,4.8481,28.3905,20.2926,1071
-1.0728,-9.8263,4.8833,4.9654,-9.8263,3.7664,29.1793,14.9973,1073
