AYGX_min,AZ_mean,AYGX_mean,AYGX_std,AZ_mean.1,GX_std,Gnorm_max,Gnorm_median,timestamp
-11.3091,-9.7772,1.3825,6.7853,-9.7772,10.6682,16.5111,11.5295,3890
6.6301,-9.8012,28.2011,19.5564,-9.8012,6.5108,37.5328,21.6595,3891
-525.1855,-6.7966,-120.3694,203.8799,-6.7966,45.2787,160.6881,88.679,3892
-29.0652,-9.6866,18.2386,32.084,-9.6866,12.8172,42.8594,20.6144,3893
-34.587,-9.4897,-1.0493,16.25,-9.4897,6.3701,11.9432,6.6816,3895
