AYGX_min,AZ_mean,AYGX_mean,AYGX_std,AZ_mean,GX_std,Gnorm_max,Gnorm_median,timestamp
-0.2487,-9.7515,-0.1144,0.0869,-9.7515,0.0793,1.0549,1.0334,469
-0.5204,-9.7441,-0.2077,0.2269,-9.7441,0.1947,1.1204,1.0373,470
0.1407,-9.7494,0.3955,0.1887,-9.7494,0.165,1.2005,1.0737,471
0.0504,-9.7524,0.1512,0.0518,-9.7524,0.0476,1.0356,1.0132,472
-0.2184,-9.7571,0.0601,0.1365,-9.7571,0.1314,1.0356,1.0238,473
-0.4432,-9.7473,-0.3697,0.0486,-9.7473,0.0411,1.0986,1.0741,474
-0.3619,-9.7404,0.4499,0.4921,-9.7404,0.417,1.3275,1.1261,475
-0.0016,-9.7473,0.1268,0.129,-9.7473,0.1162,1.0757,1.021,476
0.2983,-9.7533,0.3415,0.0433,-9.7533,0.0399,1.0877,1.0572,477
-0.3693,-9.7607,0.203,0.3051,-9.7607,0.3004,1.1757,1.0624,478
-0.049,-9.7642,0.0782,0.0759,-9.7642,0.0775,1.0515,1.0173,479
-0.479,-9.7695,0.1071,0.3522,-9.7695,0.3804,1.1626,1.0878,480
-0.6633,-9.7643,-0.2596,0.1898,-9.7643,0.1951,1.2222,1.0422,482
0.2095,-9.7665,0.5098,0.1948,-9.7665,0.2208,1.3372,1.1551,483
-0.1577,-9.7781,0.1704,0.212,-9.7781,0.2488,1.0838,1.0245,484
-0.8962,-9.7641,-0.3537,0.2692,-9.7641,0.2648,1.305,1.0833,485
-2.8152,-9.7618,-0.733,1.1242,-9.7618,1.0371,2.6779,1.2748,487
-2.0648,-9.7424,0.9428,1.5073,-9.7424,1.2622,2.4679,1.5891,488
-1.854,-9.751,-1.1405,0.5389,-9.751,0.4751,1.8975,1.4969,489
-0.5509,-9.734,-0.1179,0.2539,-9.734,0.2069,1.1294,1.0223,490
-0.5638,-9.7431,0.3802,0.5331,-9.7431,0.469,1.3342,1.1117,492
-0.7764,-9.7333,0.2546,0.63,-9.7333,0.5092,1.3693,1.1105,493
0.9236,-9.7453,1.169,0.1371,-9.7453,0.0898,1.5018,1.4276,494
-0.8566,-9.7425,-0.324,0.4228,-9.7425,0.3627,1.3245,1.0448,495
0.0175,-9.7527,0.4089,0.2106,-9.7527,0.2023,1.2314,1.0768,497
-1.3441,-9.7649,-0.2434,0.7415,-9.7649,0.7551,1.631,1.2699,498
0.0094,-9.7593,0.3431,0.1877,-9.7593,0.1854,1.2116,1.0834,499
-1.3865,-9.7681,-0.2904,0.5899,-9.7681,0.6377,1.7095,1.0935,500
-1.2693,-9.7642,-0.1025,0.6654,-9.7642,0.6975,1.6853,1.1258,502
-0.9238,-9.7809,-0.039,0.6829,-9.7809,0.8179,1.7904,1.2086,503
-0.5796,-9.7721,-0.1506,0.2435,-9.7721,0.2722,1.1901,1.0298,504
0.0441,-9.7784,0.208,0.0937,-9.7784,0.1139,1.0737,1.038,505
-0.8416,-9.7739,-0.2668,0.274,-9.7739,0.3231,1.4114,1.031,507
0.1219,-9.7748,0.3947,0.1541,-9.7748,0.1733,1.3692,1.1036,508
-1.1464,-9.7823,-0.6212,0.4018,-9.7823,0.4892,1.678,1.2952,509
-1.2098,-9.7595,-0.5779,0.2706,-9.7595,0.2506,1.572,1.1104,510
-1.4105,-9.7616,-0.3019,0.8788,-9.7616,0.8511,1.6766,1.3602,512
-0.9963,-9.7501,-0.0749,0.6292,-9.7501,0.5235,1.3665,1.0997,513
2.8365,-9.7599,9.7905,5.5257,-9.7599,4.983,15.8891,6.7381,514
-1.2128,-9.8163,-0.5979,0.2908,-9.8163,0.5247,3.0497,1.8134,515
-0.489,-9.8134,-0.0045,0.1539,-9.8134,0.3673,1.4282,1.0282,517
-0.0223,-9.811,0.016,0.0196,-9.811,0.0414,1.0588,1.0066,518
-0.098,-9.8113,-0.0461,0.0337,-9.8113,0.0661,1.0268,1.0071,519
0.0195,-9.8138,0.0891,0.0485,-9.8138,0.1165,1.1369,1.0246,520
-1.7902,-9.8112,-0.2188,0.8981,-9.8112,1.9082,3.4649,1.9629,522
-0.5411,-9.8148,0.4414,0.6227,-9.8148,1.2936,2.6402,1.6287,523
-2.3982,-9.8024,0.3922,1.5125,-9.8024,1.981,3.4182,2.2914,524
-12.886,-9.7562,0.6897,7.7929,-9.7562,4.8403,13.6111,2.4599,525
-81.751,-9.8766,-0.3863,16.4048,-9.8766,7.0245,57.6877,14.478,527
-6.5029,-10.0066,0.549,2.5658,-10.0066,3.2932,66.1437,58.7239,528
-3.2329,-9.9456,0.8264,1.9651,-9.9456,0.964,44.6164,42.558,529
-1.4738,-10.1415,3.1004,4.334,-10.1415,5.5089,61.6843,59.4761,530
-19.6079,-9.977,1.9264,7.9318,-9.977,7.8154,48.4118,37.7177,532
-3.976,-9.8702,11.7353,11.2567,-9.8702,3.6991,32.6221,22.2024,533
-6.4625,-9.9654,-0.9289,2.7185,-9.9654,3.2707,33.2267,27.4547,534
-60.0358,-9.4798,-11.73,20.873,-9.4798,13.5339,32.0385,15.3759,535
-12.1012,-9.7553,0.8683,4.3187,-9.7553,8.9565,30.5413,7.8434,537
-0.4501,-9.6315,-0.0392,0.2306,-9.6315,0.574,7.5403,3.1942,538
-1.6599,-9.843,0.0203,1.5177,-9.843,1.4054,11.0337,8.8711,539
-1.1174,-9.8182,1.4146,1.558,-9.8182,1.5932,9.331,6.0388,540
-5.2767,-9.7838,0.0669,1.5685,-9.7838,4.3579,9.024,6.3555,542
-0.41,-9.9851,-0.126,0.1618,-9.9851,0.813,3.6047,2.8904,543
-1.2217,-10.0137,0.0055,0.6962,-10.0137,2.2297,8.8249,5.6002,544
-1.2962,-9.9097,0.3797,0.8616,-9.9097,2.4792,6.388,4.2266,545
-4.0369,-9.8192,0.3424,1.2828,-9.8192,2.0986,9.0893,5.2662,547
-1.4357,-9.7956,0.2087,1.0338,-9.7956,2.9551,8.5945,4.3063,548
-3.0966,-9.9504,5.2148,5.2586,-9.9504,0.3688,17.8956,10.6953,549
-9.8302,-10.0002,1.6179,6.6795,-10.0002,5.617,74.3089,62.3035,550
-18.0847,-10.0016,9.8566,13.8463,-10.0016,14.4929,67.8884,45.1155,552
-22.8429,-9.758,2.4574,9.1492,-9.758,11.8838,35.4618,14.0901,553
-5.0424,-9.8351,-0.4488,1.5918,-9.8351,2.0396,11.5356,5.2641,554
-1.3145,-9.8881,0.3058,1.3354,-9.8881,3.8558,10.0445,5.3199,555
-6.7993,-9.7716,0.0556,2.3097,-9.7716,3.5751,12.1358,6.3005,557
-9.9236,-10.0791,9.9054,12.1552,-10.0791,4.0969,19.0537,17.2093,558
-10.5003,-9.957,4.1531,6.1231,-9.957,5.354,36.3435,22.217,559
-0.0016,-9.9836,0.7703,1.0598,-9.9836,1.4191,29.4726,25.9319,560
-9.5361,-9.8631,2.5402,12.1158,-9.8631,5.8216,42.489,10.2174,562
-2.0376,-9.1204,1.2,2.155,-9.1204,3.032,43.0775,16.3613,563
-12.117,-9.9111,-0.4247,4.9737,-9.9111,5.3263,43.1965,6.4449,564
-2.7207,-8.8355,0.0031,1.5026,-8.8355,2.7446,85.0028,29.9318,565
-6.6514,-9.8734,2.6899,6.9105,-9.8734,9.6109,50.559,31.4837,567
-6.295,-9.798,10.7236,11.8445,-9.798,2.1991,38.0271,35.9715,568
-2.9603,-9.6191,3.905,5.7567,-9.6191,5.6283,24.6631,19.7816,569
-4.9411,-10.7576,-0.8776,2.1101,-10.7576,2.5756,44.9685,42.4215,571
-5.481,-9.896,0.5962,5.1394,-9.896,3.7754,27.2273,16.1254,572
-4.2653,-9.8777,-0.2589,1.4101,-9.8777,2.1741,13.1988,6.9137,573
-0.3761,-10.3374,0.9172,1.4359,-10.3374,2.0346,10.046,6.8474,574
-0.4085,-9.8615,0.1285,0.6384,-9.8615,0.622,5.213,3.4859,575
-0.227,-9.9134,0.032,0.1328,-9.9134,0.527,4.7835,2.6781,576
-57.9308,-9.7275,-2.0514,14.5097,-9.7275,6.0071,75.0893,39.6185,577
-178.0015,-9.8872,-5.6788,37.9851,-9.8872,6.3342,74.783,28.1682,578
-16.695,-9.8109,5.5003,15.3758,-9.8109,11.8545,25.8706,10.9464,579
-67.6314,-9.6567,-19.5954,23.9145,-9.6567,10.4658,29.1763,9.8975,580
-76.9388,-9.9828,36.3496,88.874,-9.9828,23.3796,44.1817,29.4069,581
-79.6466,-9.9198,-7.0494,22.1094,-9.9198,12.3372,43.4221,10.9972,583
-5.6759,-9.2867,6.5145,8.1738,-9.2867,1.8643,10.5134,9.0834,584
-5.9853,-9.8154,-0.898,2.494,-9.8154,3.3262,24.1969,3.7114,585
-21.3678,-9.7526,-0.2525,7.424,-9.7526,4.2317,16.7542,5.2161,587
-18.9628,-9.7688,-3.7685,6.5742,-9.7688,3.144,9.4078,5.1701,588
-1.9536,-9.7113,0.3283,1.0373,-9.7113,0.7332,1.8793,1.4023,589
-10.9473,-9.7541,0.8314,3.5386,-9.7541,2.4239,7.0915,2.163,590
-15.2222,-9.7817,2.8114,10.8435,-9.7817,8.1915,27.2357,5.7832,591
-32.2569,-9.7542,-4.5147,12.6387,-9.7542,10.4637,23.9466,9.4729,592
-66.7153,-9.5501,-7.3416,17.4903,-9.5501,5.1614,15.4257,4.7289,593
-9.6621,-9.6,5.973,9.6632,-9.6,4.2423,7.1639,5.292,594
-20.0744,-9.5364,15.788,40.3559,-9.5364,13.8575,31.4859,6.959,595
-27.0825,-9.9978,1.9042,21.7355,-9.9978,6.3978,28.9505,23.0869,596
-67.7561,-9.9389,-4.8067,25.2829,-9.9389,15.6976,71.2069,7.7379,597
-65.4685,-9.6857,4.3797,34.7796,-9.6857,15.2986,52.5026,6.1034,598
-2.1147,-9.7855,1.4201,2.32,-9.7855,2.4451,5.8196,2.9329,599
-59.3118,-9.8192,-11.1471,17.2706,-9.8192,8.3252,29.2274,8.613,600
-6.0941,-9.8168,-0.3541,2.4897,-9.8168,1.8008,4.8296,2.8326,601
-1.4658,-9.7636,0.5848,1.4655,-9.7636,1.4018,4.4293,1.906,602
-50.4126,-9.9144,-3.7081,17.1331,-9.9144,9.2983,16.0469,9.0364,603
-103.0276,-9.5652,-28.2067,38.665,-9.5652,15.8401,59.952,8.5387,604
-4.5144,-9.6922,1.517,4.1379,-9.6922,2.7623,10.5789,3.5144,605
-15.8048,-9.7099,-1.0658,6.5179,-9.7099,3.7959,12.8224,2.3001,607
-0.8792,-9.7236,-0.0169,0.5326,-9.7236,0.3962,1.5623,1.0954,608
0.1487,-9.7193,0.7995,0.6757,-9.7193,0.4778,1.9644,1.124,609
-6.2376,-9.7139,-0.3018,2.5965,-9.7139,1.7248,4.4057,2.0887,610
-13.1361,-9.6411,20.1575,41.7777,-9.6411,20.3382,62.6041,7.7278,611
-447.1078,-7.8365,-114.3141,149.13,-7.8365,35.3506,111.3321,51.3302,612
-29.2043,-9.7514,-2.5456,9.5795,-9.7514,9.2438,21.1361,3.8532,614
-0.9635,-9.7803,2.725,2.2534,-9.7803,2.3484,5.9334,4.535,615
-2.8632,-9.8384,-0.8931,1.1492,-9.8384,1.591,3.1623,2.3158,616
-17.8045,-9.786,-0.9001,10.0328,-9.786,10.849,16.8722,9.2347,617
-24.6687,-9.8995,-1.4818,14.0745,-9.8995,10.9287,22.5485,11.8368,618
-11.4175,-9.8951,-2.4859,8.7297,-9.8951,2.7776,21.0098,10.3519,619
-15.6974,-9.7818,-3.8103,6.5329,-9.7818,2.0556,15.0454,6.0377,620
-8.7959,-9.779,-0.3775,3.1073,-9.779,3.4713,9.0952,1.9308,622
-0.911,-9.7832,-0.1423,0.3217,-9.7832,0.3696,1.4334,1.0252,623
-5.0265,-9.7742,-1.7033,1.6076,-9.7742,1.8731,7.0061,2.0253,624
-17.6786,-9.7345,-3.312,4.9253,-9.7345,3.5978,22.5967,2.2455,625
-3.9184,-9.6487,-1.4272,1.5476,-9.6487,0.9676,3.8838,1.7697,627
-19.3952,-9.7328,0.7925,14.0801,-9.7328,9.6145,39.0328,3.766,628
-3.8504,-9.7821,0.5137,2.8441,-9.7821,2.0571,4.4038,2.2846,629
-40.3855,-9.6085,-1.6006,11.6254,-9.6085,4.9257,19.9853,4.5879,630
-2.0549,-9.7206,0.1342,0.6305,-9.7206,0.4472,2.6263,1.1736,632
-1.8356,-9.7338,0.8011,2.1921,-9.7338,2.2391,6.9005,1.1233,633
-6.5276,-9.761,5.3419,9.4327,-9.761,5.2243,12.8857,6.3011,634
-11.7212,-9.8232,-1.0372,3.4729,-9.8232,2.661,10.0307,1.7115,635
-0.3538,-9.7872,0.0256,0.2138,-9.7872,0.2557,2.3457,1.1948,637
-0.122,-9.7891,0.0269,0.1035,-9.7891,0.1279,1.3471,0.9981,638
-0.1209,-9.781,-0.0043,0.0718,-9.781,0.0899,1.0676,1.0189,640
-0.1745,-9.7874,0.4074,0.8037,-9.7874,1.031,3.2223,1.0471,642
-6.0781,-9.8002,0.592,2.1279,-9.8002,2.8845,8.8295,3.8691,643
-0.9385,-9.791,-0.1289,0.6007,-9.791,0.8744,2.8538,1.7533,644
-12.2907,-9.7979,0.2054,3.2547,-9.7979,2.8832,23.8896,3.6152,645
-6.7769,-9.7998,-0.4169,2.0236,-9.7998,3.0012,8.6096,2.5936,647
