AYGX_min,AZ_mean,AYGX_mean,AYGX_std,AZ_mean.1,GX_std,Gnorm_max,Gnorm_median,timestamp
-410.1935,-9.7244,-56.6481,104.8113,-9.7244,20.1601,59.4071,42.4614,298
-621.9625,-6.9101,-77.498,206.373,-6.9101,31.1961,88.928,45.2511,299
-912.6387,-1.4487,-343.7922,256.4483,-1.4487,33.3424,159.5018,61.0313,301
-160.327,-2.2514,65.3608,117.5688,-2.2514,44.2645,173.0277,7.3651,302
16.9455,-1.4166,17.3399,0.3467,-1.4166,0.0325,2.0908,2.0476,303
