AYGX_min,AZ_mean,AYGX_mean,AYGX_std,AZ_mean.1,GX_std,Gnorm_max,Gnorm_median,timestamp
-3.0113,-10.2566,-0.2326,1.703,-10.2566,2.3475,36.724,31.3418,4792
-494.5358,-8.461,-98.6935,154.2953,-8.461,32.9093,86.1262,49.8545,4793
-1048.7204,0.4778,-44.1349,372.2774,0.4778,68.9911,195.513,44.9766,4794
-4.9938,1.2084,1.9502,4.5454,1.2084,0.4317,2.1626,1.3313,4796
-0.76,1.1939,0.7151,0.9774,1.1939,0.0992,1.5379,1.4833,4797
