AYGX_min,AZ_mean,AYGX_mean,AYGX_std,AZ_mean.1,GX_std,Gnorm_max,Gnorm_median,timestamp
-64.6662,-9.5116,-15.7014,21.3924,-9.5116,8.4714,22.1118,10.8161,558
-50.3021,-9.3059,9.8175,22.6311,-9.3059,7.8496,35.4027,13.8605,560
-388.5514,-9.2991,-51.5834,98.4138,-9.2991,26.4563,72.3554,28.1873,561
-5.2583,-9.7135,6.418,9.312,-9.7135,4.393,11.6067,9.0145,562
-1.252,-9.6348,5.7958,6.0698,-9.6348,2.1643,12.5309,8.6537,563
