AYGX_min,AZ_mean,AYGX_mean,AYGX_std,AZ_mean,GX_std,Gnorm_max,Gnorm_median,timestamp
-4.7169,-9.4081,-4.5843,0.0876,-9.4081,0.0273,2.6775,2.6525,0
-4.717,-9.4085,-4.6056,0.0537,-9.4085,0.0166,2.6754,2.6511,1
-4.6931,-9.4082,-4.6263,0.0426,-9.4082,0.0132,2.6718,2.6509,2
-4.6811,-9.4086,-4.6137,0.037,-9.4086,0.0118,2.6802,2.6539,3
-4.671,-9.4081,-4.5959,0.0442,-9.4081,0.0141,2.6691,2.6462,4
-4.729,-9.4088,-4.5921,0.0468,-9.4088,0.0152,2.6672,2.6447,5
-4.6802,-9.4089,-4.6057,0.0486,-9.4089,0.0153,2.6735,2.6498,6
-14.0199,-9.3938,-3.1203,7.6012,-9.3938,2.0642,7.2427,2.6606,7
-32.1522,-9.6533,21.2723,39.3425,-9.6533,10.3239,35.0257,19.4289,8
-44.2056,-9.8442,-8.3473,15.5636,-9.8442,6.8473,27.8647,16.1189,9
-265.6578,-9.8949,-63.6426,94.1717,-9.8949,38.9669,133.3608,98.5852,10
-246.4267,-7.6903,-132.2793,71.35,-7.6903,17.8386,114.9588,87.7382,11
-51.91,-8.9299,-10.7273,20.8496,-8.9299,4.997,28.9671,26.7935,12
-49.9156,-8.6787,-5.6811,25.9635,-8.6787,5.284,10.0883,4.1738,13
6.0927,-8.6874,17.8747,9.739,-8.6874,1.782,6.4124,4.6952,14
14.6661,-9.2412,26.9214,10.3863,-9.2412,2.7259,12.2575,9.0625,15
6.5704,-9.4539,13.9389,5.5146,-9.4539,1.8852,7.652,4.9888,16
-22.9603,-9.624,28.1001,18.7063,-9.624,5.3281,28.8402,16.9797,17
-6.9535,-9.9861,2.7912,5.7529,-9.9861,3.202,19.9842,17.6729,18
-5.9079,-9.7839,-0.6571,3.3215,-9.7839,4.4245,9.591,7.8978,19
-12.6905,-10.0106,-0.8578,3.6582,-10.0106,3.5947,16.3708,9.2839,20
-3.2812,-9.9555,0.7219,2.3522,-9.9555,1.9921,19.6952,8.7951,21
-20.463,-10.0539,6.6512,18.9354,-10.0539,4.5388,30.9023,25.8323,22
-1.596,-9.8201,6.0849,7.2729,-9.8201,6.9769,22.8714,15.6342,23
-0.0408,-10.1029,7.1214,4.4685,-10.1029,7.7099,26.3037,23.7231,24
-9.6398,-9.4594,4.5228,11.014,-9.4594,3.2139,26.5465,18.8342,25
-14.3983,-10.28,4.7561,13.0723,-10.28,6.1357,27.5566,24.5653,26
-1.4544,-10.3894,1.2959,1.9971,-10.3894,4.2661,9.6463,5.9523,27
-3.9416,-8.7881,1.9478,3.3874,-8.7881,5.9729,23.0716,16.0699,28
-1.8662,-9.869,1.593,2.2683,-9.869,11.2561,21.7566,17.4645,29
-20.3782,-9.896,8.3924,11.8815,-9.896,18.964,39.5285,30.2645,30
-4.3699,-11.0017,1.231,4.5895,-11.0017,4.706,25.8508,22.6417,31
-9.3504,-9.9514,5.0438,10.0726,-9.9514,10.6283,37.8507,13.5078,32
-8.3853,-9.7949,0.7418,6.2916,-9.7949,7.3634,21.9528,13.7786,33
-5.1067,-9.9309,4.9331,9.4362,-9.9309,9.7496,24.0324,16.5266,34
-40.8182,-9.6185,20.2604,56.5358,-9.6185,27.5506,80.8261,32.3496,35
-6.3211,-9.4177,8.9691,14.0071,-9.4177,7.2545,43.9723,33.644,36
5.0267,-9.7274,28.1973,16.3067,-9.7274,8.9406,32.2347,28.7165,37
-11.939,-9.8467,-0.7964,6.6265,-9.8467,7.7634,23.3585,18.8951,38
-4.3105,-9.9173,0.5791,2.8207,-9.9173,5.5892,17.7389,10.545,39
-1.8244,-9.9263,-0.261,0.7974,-9.9263,1.6707,9.7633,4.2032,41
-2.3794,-9.5685,-0.3933,0.8618,-9.5685,1.2105,6.6798,4.0533,42
-1.8628,-9.8666,-0.1066,1.2139,-9.8666,3.5424,8.1267,7.3954,43
-3.4507,-9.7491,4.8699,4.5507,-9.7491,1.5678,15.9926,11.5118,44
12.5092,-10.4397,19.5966,8.0708,-10.4397,3.9591,31.0362,23.8444,45
-1.7112,-10.3462,1.6121,2.5404,-10.3462,3.5474,12.9201,5.0633,46
-7.8673,-10.1786,-1.1819,3.2973,-10.1786,3.5839,18.9901,14.2213,47
-11.5112,-9.8314,-1.6141,7.5474,-9.8314,2.7068,32.0716,24.6759,48
-7.1584,-9.7975,-0.682,4.7854,-9.7975,2.2062,14.994,13.142,49
-13.5457,-9.7469,-1.4297,3.3473,-9.7469,3.1357,46.0229,20.9633,50
-10.072,-9.5032,2.1229,6.3379,-9.5032,5.0815,32.8837,18.9481,51
-55.5551,-10.3073,-6.7432,19.2595,-10.3073,12.7959,101.5814,40.1554,52
-90.1038,-9.6846,5.391,41.1774,-9.6846,9.7586,58.8459,40.8213,53
0.6471,-9.7241,15.1612,14.2325,-9.7241,2.7505,22.0347,16.7453,54
-25.0134,-9.8431,35.0565,45.9506,-9.8431,5.1387,43.6602,27.5025,55
-7.0637,-10.6066,-0.8837,5.0369,-10.6066,3.4327,72.1524,65.075,56
-21.2566,-9.774,8.9762,20.7718,-9.774,1.6251,25.5256,21.1376,57
-20.3786,-9.9157,-5.1543,9.6933,-9.9157,4.1623,19.5012,16.3598,58
-4.6008,-9.8696,0.7243,3.5348,-9.8696,4.7418,20.4073,16.7482,59
-3.4753,-9.8869,5.9551,6.8381,-9.8869,10.7414,31.2078,19.9602,60
-6.5946,-9.8637,1.5415,4.9032,-9.8637,9.624,30.0927,12.129,61
-8.9556,-9.8526,13.8714,24.8064,-9.8526,18.6985,50.9101,31.9062,62
-6.1957,-9.8605,0.5375,4.0394,-9.8605,3.9366,39.7977,18.4944,63
-17.993,-9.8121,-5.3156,10.5082,-9.8121,9.3472,37.926,33.465,64
-2.6746,-9.8254,3.979,4.8207,-9.8254,12.4931,27.6977,22.3468,65
2.5804,-10.0919,41.8462,29.6705,-10.0919,7.2119,57.2232,44.9149,66
12.0189,-7.8281,84.5571,45.0373,-7.8281,9.7493,55.6989,45.7619,67
-17.286,-9.4514,0.4395,11.431,-9.4514,1.7594,27.4426,22.8103,68
-23.2354,-6.3154,9.0029,30.513,-6.3154,3.8347,61.444,42.9564,69
-13.9461,-9.3775,-0.7946,6.691,-9.3775,5.445,25.5277,14.6918,70
-5.0887,-10.0328,1.8884,4.5979,-10.0328,5.1524,21.9929,12.4567,71
-8.5092,-9.1828,-1.3752,4.0403,-9.1828,4.7894,22.8985,9.0893,72
-12.299,-10.018,3.2493,9.8211,-10.018,11.3743,29.0853,18.0046,73
-1.3827,-9.5102,3.664,5.1929,-9.5102,4.3972,16.2447,11.1986,74
-9.4983,-9.7078,0.6219,7.1744,-9.7078,3.4659,16.0181,12.4824,75
-5.3736,-10.0935,-1.453,3.0465,-10.0935,2.0182,16.293,9.4493,76
-6.1943,-9.6485,-1.0483,3.844,-9.6485,2.7719,15.0423,13.669,77
-11.6131,-10.2029,-2.3712,3.9079,-10.2029,8.0704,36.4686,18.3237,78
-1.3908,-9.4106,11.6442,10.0323,-9.4106,3.7443,27.8728,21.1178,79
-13.5777,-9.8958,2.4137,7.0882,-9.8958,11.9502,19.9742,15.2372,80
-9.7695,-9.7061,5.7888,11.6765,-9.7061,16.2237,43.7614,26.4079,81
-8.1749,-10.4496,1.2022,6.5373,-10.4496,6.2394,29.7872,21.512,82
-8.8183,-10.1409,-2.0296,4.8367,-10.1409,5.3204,40.8722,36.5057,83
0.54,-9.8653,4.0438,4.3477,-9.8653,2.1257,32.9654,16.7507,84
-1.284,-9.7795,1.2754,1.5167,-9.7795,1.6335,10.6611,8.4499,85
-6.7192,-9.6167,4.1834,6.8109,-9.6167,10.8384,23.9849,14.9474,87
2.0968,-10.0152,8.3759,3.3572,-10.0152,4.0735,25.143,19.3402,88
-13.2973,-9.8764,-0.4304,4.0109,-9.8764,3.4372,23.0719,17.813,90
-28.5769,-9.4613,8.5724,32.9278,-9.4613,3.7431,34.46,28.4581,91
3.4093,-9.3521,10.7153,4.7057,-9.3521,4.2606,21.1968,20.0325,93
-11.7079,-7.9761,5.8383,16.1682,-7.9761,12.9984,28.491,21.8908,94
-4.1395,-9.7034,2.1272,4.325,-9.7034,3.7736,20.0362,13.4233,95
0.2532,-8.4172,4.7463,3.3978,-8.4172,1.4989,16.247,13.1788,96
-26.449,-8.0725,-7.3833,14.4486,-8.0725,6.5373,26.2704,22.2892,97
-11.6311,-8.8344,7.7398,14.1514,-8.8344,10.0453,30.3308,27.5923,98
-26.8576,-8.9832,2.4852,21.638,-8.9832,4.483,25.8343,20.3618,99
-24.5376,-9.1149,-0.1219,12.1116,-9.1149,8.0319,32.6334,12.0707,100
-3.1613,-10.5362,10.6225,16.3936,-10.5362,5.5322,30.4429,21.8503,101
-8.7843,-8.4541,-2.6101,3.8653,-8.4541,8.1986,28.6572,13.6869,102
-15.293,-9.874,3.9256,8.5293,-9.874,8.194,24.5339,19.6978,103
-2.5791,-10.1219,1.1808,3.1561,-10.1219,2.5853,23.4644,15.5341,104
-1.8257,-10.1603,1.5672,4.557,-10.1603,5.4498,14.4139,8.962,105
-3.4661,-9.7501,-0.4884,1.4861,-9.7501,4.3551,10.3378,8.8557,106
-0.7,-10.0337,0.3377,0.8779,-10.0337,1.6134,14.8878,4.9317,107
-4.2165,-10.1038,1.2808,3.6573,-10.1038,1.4364,11.1632,9.6052,108
-1.91,-10.7361,0.4788,1.3869,-10.7361,1.2237,10.5566,6.6879,109
-15.7058,-9.843,4.6043,9.2244,-9.843,8.0887,31.0447,17.3695,110
-9.3511,-10.3102,-1.8127,6.7392,-10.3102,4.1771,21.2261,13.6331,111
-10.3746,-9.8771,11.0122,11.9236,-9.8771,11.4312,27.7284,16.539,112
-13.2628,-10.231,-1.151,6.8872,-10.231,5.5415,28.5646,14.8119,113
-7.0342,-9.4922,7.5497,10.287,-9.4922,10.9014,22.3066,17.4042,114
1.2763,-10.0464,17.475,10.9753,-10.0464,5.2694,29.3665,24.2452,115
2.1371,-9.7382,39.1166,29.0449,-9.7382,10.1811,45.677,39.4742,116
-42.6926,-10.3727,-1.8338,29.25,-10.3727,3.8227,36.0692,29.6951,117
-0.3695,-9.6738,4.8502,5.6617,-9.6738,5.2624,26.9322,23.6752,118
-2.5995,-9.0113,67.0286,64.5641,-9.0113,13.7857,57.0521,38.3324,119
-24.6788,-9.407,1.6418,13.4443,-9.407,8.9159,30.3257,17.5682,120
-0.5035,-9.606,2.4974,2.596,-9.606,4.7852,14.0386,8.4782,121
-10.6065,-9.7687,9.9281,14.2769,-9.7687,18.9886,33.0238,29.3313,122
-9.7106,-9.4963,5.2628,8.8661,-9.4963,12.0249,35.8818,18.0797,123
-4.8568,-9.467,7.7057,10.3185,-9.467,5.1847,20.5471,10.1038,124
-28.214,-9.9105,8.1843,25.4107,-9.9105,10.9413,37.9666,27.4626,125
-1.2844,-10.3743,1.3881,2.0882,-10.3743,3.612,12.6153,8.7174,126
-6.9974,-10.2641,0.9907,5.4745,-10.2641,0.9812,9.9856,7.644,127
-0.0618,-10.3678,5.9454,3.6838,-10.3678,2.7218,15.4997,13.4857,128
-6.2262,-9.5486,6.0967,13.0519,-9.5486,4.8834,27.7455,21.7596,129
-9.1828,-9.2802,0.811,4.3255,-9.2802,5.4382,17.6663,11.7225,130
-4.7775,-9.8139,-0.6466,1.9643,-9.8139,1.6396,13.1201,6.6196,131
-2.2503,-10.0015,-0.3142,0.9578,-10.0015,1.6818,10.5414,6.8487,132
-13.0631,-9.4812,10.0727,18.9448,-9.4812,15.3856,41.4462,26.3453,133
-84.5886,-10.6765,20.7085,52.5066,-10.6765,7.9123,34.537,32.6846,134
-34.3206,-10.931,35.9519,58.9257,-10.931,5.3087,43.8733,39.7174,135
3.9957,-9.6838,26.7791,23.2298,-9.6838,5.3845,41.683,21.2185,136
-1.1077,-9.589,11.6749,11.3441,-9.589,12.606,38.6517,32.6246,137
-3.5137,-9.8431,6.7213,7.3095,-9.8431,9.1386,22.8485,17.3232,138
-8.219,-9.8923,2.2696,9.7891,-9.8923,7.9348,25.1486,16.0846,139
-2.0072,-10.1153,0.7702,1.7005,-10.1153,3.7405,12.2898,8.0259,140
-7.4137,-10.1753,2.2727,5.2956,-10.1753,1.5162,15.9781,14.0161,142
-4.4461,-10.0475,-0.5952,2.5046,-10.0475,1.0576,15.9133,7.9979,143
-17.2042,-9.5203,2.7202,9.6709,-9.5203,11.3458,35.0427,18.4612,144
-0.1074,-9.624,15.4986,14.9704,-9.624,8.6253,24.7081,20.7074,145
-11.5708,-10.0225,-3.19,7.3066,-10.0225,5.7353,25.9026,19.6689,146
2.5768,-10.2269,24.7469,15.2014,-10.2269,3.6122,42.4167,32.6079,147
-0.1213,-9.0936,1.0182,1.327,-9.0936,2.5971,21.4359,17.9485,148
-2.4188,-10.3416,0.4453,1.3785,-10.3416,2.0908,22.2412,15.3916,149
-3.5922,-9.9656,0.6237,2.3619,-9.9656,5.0457,19.5896,10.0955,150
-6.2329,-10.177,4.0425,10.1634,-10.177,2.6125,13.9616,10.6077,151
-1.3485,-9.7593,0.5657,1.6175,-9.7593,5.5688,23.6405,22.7393,152
-8.5629,-9.9037,9.6606,10.8398,-9.9037,15.3423,33.4661,25.2458,153
-8.9547,-10.3816,-0.4055,6.224,-10.3816,7.1719,39.6425,38.4912,154
-9.7221,-9.8658,1.8679,6.2534,-9.8658,4.5317,43.1987,32.094,155
-7.7514,-9.9471,0.0226,4.4269,-9.9471,2.4612,13.4621,9.9473,156
-7.0987,-9.82,-0.3919,2.2933,-9.82,2.8756,30.8095,19.6415,157
-3.361,-9.7152,0.9355,2.9314,-9.7152,3.7121,16.8028,14.4964,158
-8.9299,-9.7985,1.0186,4.6973,-9.7985,4.2304,12.4267,7.7112,159
-0.3595,-9.5407,4.2369,4.0155,-9.5407,4.3006,10.772,8.2719,160
-4.0117,-9.698,-0.8923,2.7404,-9.698,3.2451,19.2605,10.9241,161
-3.5965,-9.2235,1.1417,2.5922,-9.2235,1.888,31.9326,16.7225,162
-3.5898,-9.7943,0.6874,2.6746,-9.7943,0.9057,16.8364,12.1258,163
-0.9674,-9.828,2.224,3.3585,-9.828,2.9921,8.6201,7.8672,164
-4.3086,-9.7738,-0.2573,1.3361,-9.7738,2.6712,9.227,6.7665,165
-10.6253,-10.9316,5.1832,10.0861,-10.9316,3.3129,44.5179,34.4297,166
-3.9434,-9.6579,0.8036,2.1926,-9.6579,5.1285,44.451,22.0275,167
-20.3102,-10.2303,-0.3979,9.1968,-10.2303,5.1756,51.0757,38.6549,168
-2.523,-9.0937,1.3975,3.0864,-9.0937,1.9025,45.8703,34.1464,169
-3.0238,-10.9792,3.2395,8.9033,-10.9792,5.6568,72.7556,15.183,170
-9.6013,-9.7706,4.392,11.1279,-9.7706,8.6135,30.4031,14.4672,171
-29.8441,-10.4665,1.9777,19.8704,-10.4665,11.6747,67.9014,21.6511,172
-25.5215,-9.8254,-6.3931,11.0277,-9.8254,5.0329,31.5359,25.7082,173
-9.7015,-10.0791,4.5084,11.2437,-10.0791,2.5441,40.7538,33.2724,174
-33.9318,-9.6996,-0.0866,20.8831,-9.6996,7.3102,30.6131,17.6936,175
-7.4898,-9.5427,-1.3674,3.095,-9.5427,3.5669,9.7327,8.9406,176
0.3212,-9.5992,8.2059,4.7189,-9.5992,1.439,10.2572,8.6701,177
-10.1201,-9.5456,-3.135,3.0267,-9.5456,1.8497,8.3629,4.615,179
-2.0504,-9.4885,4.3505,3.6413,-9.4885,1.6508,7.5611,4.4944,180
-5.8242,-9.5158,0.7041,4.2441,-9.5158,2.3053,5.9812,5.0767,181
-0.2905,-9.3542,4.0443,2.4292,-9.3542,1.2868,4.0158,2.9852,182
-16.5881,-9.4543,-9.1163,5.3135,-9.4543,2.0923,8.9093,5.1416,183
2.699,-9.2157,9.8124,5.3075,-9.2157,2.2567,9.2838,5.5551,184
8.7459,-9.4321,12.386,2.939,-9.4321,1.4044,8.8872,5.9215,185
-6.0761,-9.4913,0.4471,2.9431,-9.4913,2.6057,9.6753,6.0797,186
-9.5646,-9.665,-6.8408,2.1727,-9.665,1.4596,14.4203,11.9769,187
-19.769,-9.6605,0.2202,10.0401,-9.6605,6.1657,15.585,12.354,188
-21.6238,-9.7251,35.0845,32.188,-9.7251,8.7167,65.2354,35.2747,189
-11.5179,-9.7145,13.2343,12.999,-9.7145,2.8802,37.8657,26.5623,190
-0.2877,-9.9457,1.2928,1.6106,-9.9457,2.619,28.4645,23.4314,191
-3.4889,-10.0237,12.6889,10.9597,-10.0237,8.1345,40.1916,28.9329,192
-10.7019,-9.8408,-4.5976,4.0354,-9.8408,4.2588,17.6058,10.6306,193
-1.474,-9.96,3.7723,5.1013,-9.96,1.3582,32.1626,25.9493,194
-10.5558,-9.7738,0.3892,5.2443,-9.7738,8.328,39.0324,31.7828,195
-2.2428,-10.2053,0.061,2.1536,-10.2053,1.5284,29.4521,26.9871,196
-2.014,-10.4055,0.0897,1.9272,-10.4055,0.657,33.0109,30.141,197
-3.5338,-10.0677,0.7218,2.0436,-10.0677,3.0139,19.1643,13.1451,198
-1.9033,-10.2054,-0.0283,0.5634,-10.2054,1.6372,10.9614,8.0873,199
-20.1175,-9.1527,4.0435,12.0005,-9.1527,8.3275,40.2603,19.1762,200
-2.6534,-10.9034,17.3952,18.0344,-10.9034,17.7458,45.8527,31.9821,201
-4.9194,-9.6685,11.1846,11.3529,-9.6685,4.313,29.2386,22.8431,202
-4.0586,-9.527,0.662,2.4617,-9.527,4.6344,25.6821,6.744,203
-1.4707,-9.9773,0.0592,1.0461,-9.9773,0.6395,11.86,5.507,204
-9.4345,-9.9722,0.2932,3.4462,-9.9722,6.2019,11.9494,9.3388,205
-5.5121,-9.8109,-0.1486,2.8398,-9.8109,2.4216,12.9215,9.5892,206
-12.2778,-9.9617,-2.2752,4.0038,-9.9617,7.7139,28.1259,10.0373,207
-13.9183,-10.1972,1.0141,6.3561,-10.1972,9.989,26.9754,19.5839,208
-1.3198,-9.561,6.8142,7.9721,-9.561,6.3908,18.9932,10.2928,209
-0.5624,-10.2279,0.4309,0.8571,-10.2279,1.6684,15.3628,9.6095,210
0.054,-11.1693,1.8614,1.3807,-11.1693,3.4422,28.5593,10.3355,211
-3.4974,-10.3687,1.2886,4.6009,-10.3687,1.6135,23.1089,16.7492,212
-3.9278,-10.944,4.3524,5.9183,-10.944,7.062,40.5529,27.8159,213
-58.6729,-9.7068,7.5723,30.8776,-9.7068,4.4029,46.3761,39.3049,214
-14.4509,-9.7538,9.1368,10.799,-9.7538,14.6805,57.1591,23.5081,215
-25.104,-10.1372,15.6403,31.3795,-10.1372,16.6824,49.6434,33.8397,216
-14.7927,-9.962,6.2573,10.5878,-9.962,8.5441,27.3737,15.4991,217
-7.5388,-9.9083,2.4115,7.375,-9.9083,8.9391,20.1511,14.7426,218
-0.4842,-10.5752,64.5511,41.7849,-10.5752,13.2915,49.3859,41.9098,219
-4.3817,-9.9147,15.631,21.2579,-9.9147,12.1752,38.199,22.4692,220
-1.4907,-9.8784,7.2432,5.863,-9.8784,3.6182,23.2054,21.338,221
-0.4278,-9.9252,4.995,3.5264,-9.9252,2.6129,14.8671,12.8562,222
-3.5006,-9.8812,-1.0286,1.6119,-9.8812,2.8545,6.2913,4.5173,223
-6.0214,-10.0548,-2.2777,3.6132,-10.0548,8.2085,25.4203,20.9762,224
-24.8323,-9.7925,8.6904,15.6799,-9.7925,13.612,28.826,22.0904,225
-5.0239,-9.8977,-1.3433,3.0172,-9.8977,1.4066,9.8142,8.1677,226
-14.1788,-9.8992,2.108,9.2268,-9.8992,5.2632,17.3848,15.5393,227
-9.1482,-9.4488,-0.3476,2.7225,-9.4488,3.3917,19.6352,10.1655,229
-1.6702,-10.4216,-0.4301,1.0286,-10.4216,2.3817,10.3128,7.7722,230
-2.9064,-10.0119,0.6935,1.7191,-10.0119,2.9702,22.6639,17.7659,231
-4.9801,-9.7242,-0.1527,2.7258,-9.7242,0.4764,21.4949,18.3937,232
-1.861,-9.9269,2.4266,2.8471,-9.9269,2.8141,13.516,11.8925,233
-0.9485,-9.9961,-0.1292,0.4094,-9.9961,1.3308,9.4027,5.6106,234
-0.7181,-10.0197,-0.0328,0.3625,-10.0197,0.8798,4.8815,3.4957,235
-1.3361,-9.6993,-0.2273,0.5833,-9.6993,1.0668,6.4793,3.4823,236
-62.9318,-9.5247,19.956,52.1752,-9.5247,14.8251,34.4134,17.8316,237
-21.6598,-9.8355,-4.7406,10.5415,-9.8355,6.5562,14.9171,7.5853,238
-5.4371,-9.8829,2.9773,6.8538,-9.8829,7.1696,13.7076,7.6846,239
-5.6342,-9.8408,-2.5427,2.2888,-9.8408,1.7327,5.8475,3.7876,240
2.6134,-9.8232,5.5462,1.9258,-9.8232,1.2093,6.9483,5.2653,241
-3.1506,-9.9211,-2.0721,0.7819,-9.9211,1.5046,8.9704,6.2286,242
-7.736,-9.8508,-3.9682,2.8908,-9.8508,0.8678,8.7873,7.7589,243
-10.5449,-9.9347,-2.9593,5.0707,-9.9347,1.7259,16.8924,14.4746,244
-124.0412,-9.735,-23.3728,33.8251,-9.735,11.8705,25.7339,19.2269,245
-33.6842,-9.5994,-7.9719,17.2537,-9.5994,6.1604,10.8974,5.08,246
-7.4351,-9.6582,-3.8039,2.4744,-9.6582,1.0162,3.8029,2.7017,248
-5.0655,-9.6612,-3.4357,0.893,-9.6612,0.3652,3.0399,2.6326,249
-4.2559,-9.6603,-3.4439,0.6039,-9.6603,0.2467,2.8218,2.6463,250
-3.7799,-9.6634,-3.3527,0.3431,-9.6634,0.1414,2.7137,2.6174,251
-3.593,-9.66,-3.3843,0.1742,-9.66,0.07,2.6721,2.6189,252
-3.5121,-9.6632,-3.3628,0.1186,-9.6632,0.0471,2.6705,2.631,253
-3.5133,-9.6604,-3.3787,0.066,-9.6604,0.0279,2.6619,2.6228,254
-3.4695,-9.6604,-3.3703,0.0509,-9.6604,0.0206,2.649,2.6251,255
-3.3863,-9.66,-3.3447,0.0266,-9.66,0.0107,2.6244,2.6156,256
-3.461,-9.6619,-3.3626,0.0477,-9.6619,0.0213,2.6408,2.6179,257
-3.4804,-9.6614,-3.3808,0.0523,-9.6614,0.0221,2.6656,2.6247,258
-3.4463,-9.6602,-3.3857,0.047,-9.6602,0.0201,2.6465,2.6182,259
-5.1098,-9.6575,-3.362,0.7434,-9.6575,0.3069,3.1368,2.6124,528
-3.925,-9.6555,-3.3291,0.4033,-9.6555,0.1641,2.763,2.6093,529
-3.7313,-9.6567,-3.3376,0.2491,-9.6567,0.1009,2.72,2.6166,530
-3.5785,-9.6565,-3.3347,0.1508,-9.6565,0.0613,2.6629,2.62,531
-3.5288,-9.6514,-1.0013,7.1078,-9.6514,2.0392,7.5585,2.6272,532
-120.4095,-9.5848,-12.8469,53.7361,-9.5848,5.428,34.9779,28.2591,534
-96.2231,-9.3114,-2.2478,45.0877,-9.3114,11.7841,22.9571,12.8432,535
-16.9688,-9.7213,19.6095,24.8466,-9.7213,10.3656,31.8679,23.7765,536
-13.804,-9.7864,5.4943,9.0763,-9.7864,5.3459,17.0422,14.5724,537
-7.0014,-9.8795,1.0459,5.1586,-9.8795,5.556,14.7968,7.7256,538
-4.769,-9.7983,0.3531,2.5035,-9.7983,1.6002,5.0945,3.2595,539
-51.5201,-9.7095,-0.3391,19.428,-9.7095,9.1853,71.6173,40.7151,540
-26.926,-9.6615,-7.0107,13.0866,-9.6615,4.8784,40.3957,19.0064,541
6.7511,-9.8302,9.4,2.2001,-9.8302,1.3212,9.5347,8.3757,542
-4.5932,-9.8662,0.1027,1.4936,-9.8662,2.0904,6.2747,2.5275,543
-14.3993,-9.9352,-6.5965,5.0545,-9.9352,3.0489,20.7312,7.5169,544
-1.7033,-10.0522,4.7449,5.0187,-10.0522,5.8775,30.1341,21.0605,545
-22.9889,-9.8106,-4.4533,13.4851,-9.8106,9.842,35.324,17.9389,546
-3.8458,-9.8369,23.0321,14.6904,-9.8369,4.3167,36.8114,19.1898,547
-0.0982,-9.9515,1.0968,1.3909,-9.9515,1.1389,30.5658,17.4676,548
-0.4851,-9.834,6.2573,5.3765,-9.834,0.7526,48.221,30.105,549
-5.9957,-9.9481,-1.6186,1.5655,-9.9481,1.948,17.2121,12.3297,550
-7.5833,-10.022,0.549,4.2631,-10.022,6.7488,27.862,10.6834,551
-1.82,-10.2086,5.6639,4.8798,-10.2086,3.6606,40.156,30.9792,552
4.7067,-9.578,19.521,10.0575,-9.578,7.1693,40.1458,21.7843,553
-3.0836,-9.9592,-0.1164,1.716,-9.9592,2.2319,7.7517,5.8187,554
-9.0024,-9.8113,5.4488,9.716,-9.8113,3.9241,41.4977,31.7543,555
-7.675,-9.8982,-0.7779,6.0096,-9.8982,3.6626,16.0838,13.9291,556
-7.3848,-9.7933,-0.1959,2.9757,-9.7933,4.5944,18.7215,11.1878,557
-3.0629,-9.8622,1.8742,3.7024,-9.8622,6.4795,12.056,8.5955,558
-11.4926,-10.0202,-1.9333,5.0361,-10.0202,8.7158,18.7447,13.1909,559
-20.535,-9.8428,7.9539,20.1474,-9.8428,16.4517,45.9127,23.3718,560
-2.6198,-9.9256,-0.1077,1.5913,-9.9256,3.2038,10.4938,6.7077,561
-6.9062,-9.9131,-1.2776,2.1991,-9.9131,3.6639,12.1587,6.9134,562
-26.114,-10.6073,-14.1039,10.2547,-10.6073,17.9092,65.1052,42.9099,563
-18.2336,-10.0916,-3.2659,10.4702,-10.0916,2.317,50.4771,40.6053,564
-16.2123,-9.8458,-5.2288,8.3358,-9.8458,3.4902,33.5169,25.8384,565
-18.3973,-9.5476,-7.1663,8.8817,-9.5476,5.9224,29.5469,16.1684,566
-3.5599,-9.6918,3.2392,5.0214,-9.6918,2.6435,14.0119,10.581,567
-9.1597,-9.9085,2.3705,4.9318,-9.9085,6.6758,19.2439,11.1221,568
-6.3378,-9.8515,1.3264,3.6742,-9.8515,7.3541,21.8573,10.0433,569
-1.729,-9.9649,2.5783,3.2074,-9.9649,4.927,13.7927,9.3276,570
-1.3963,-10.0671,0.0071,0.6796,-10.0671,1.1237,9.2792,6.4928,571
-3.4944,-9.8134,-0.9755,1.2599,-9.8134,2.3261,7.7103,4.7375,572
-5.149,-10.0338,-1.8884,1.6163,-10.0338,3.285,9.6765,4.6905,573
-3.7088,-10.8451,-0.8767,1.7723,-10.8451,2.2325,26.5308,18.1152,574
-3.4678,-10.0577,0.094,2.3604,-10.0577,2.5827,11.4894,6.328,575
-32.5787,-10.1373,1.0559,11.8408,-10.1373,6.2946,34.6402,27.1445,576
-3.7794,-10.2948,-0.6828,1.3661,-10.2948,2.8986,38.7121,25.4587,577
-9.9741,-10.1807,-1.5132,5.3657,-10.1807,9.2791,44.5247,22.0345,579
-5.8237,-9.4985,-0.8844,2.2975,-9.4985,3.6149,24.2372,16.1447,580
-15.4033,-9.8554,1.2759,6.8816,-9.8554,11.7237,30.4696,20.4004,581
-24.4617,-10.0651,-4.4944,13.2213,-10.0651,11.9207,38.3828,26.6651,582
-17.0897,-9.7178,-4.6452,8.7091,-9.7178,3.6014,13.7352,9.6789,584
-0.5384,-9.8659,3.9813,5.2688,-9.8659,3.5364,19.5255,13.0862,585
-18.238,-9.931,-6.4754,5.6648,-9.931,2.5365,20.0862,16.9814,586
-2.227,-9.6986,7.5294,6.7932,-9.6986,5.6951,20.4954,15.2932,587
-6.8754,-9.8962,2.3397,6.3158,-9.8962,7.9304,21.2232,15.6174,588
-4.989,-9.8253,3.719,5.1315,-9.8253,8.7881,23.1742,15.6693,589
-6.5659,-9.9086,2.3863,7.0988,-9.9086,7.3117,24.0784,14.0477,590
-24.8343,-9.9101,-3.2225,9.9835,-9.9101,15.5362,37.4549,24.4208,591
-5.5659,-9.841,2.7389,7.8046,-9.841,8.7776,22.5538,19.1876,592
-3.1496,-9.8963,0.0095,2.19,-9.8963,2.2733,9.4743,7.1734,593
-0.2747,-9.9438,8.5225,5.4992,-9.9438,4.7157,21.333,16.4601,594
-2.3856,-9.7867,-0.0877,0.9592,-9.7867,1.6307,14.9134,7.5398,595
0.4078,-9.8826,4.6661,3.0529,-9.8826,1.6977,14.645,9.7189,596
-3.8699,-9.8383,1.3723,4.4456,-9.8383,2.7302,25.7458,23.1188,597
-12.525,-9.8237,1.0336,5.3191,-9.8237,5.3319,19.6291,11.9738,598
-11.8008,-10.0435,-4.3724,7.1778,-10.0435,2.4794,27.6836,25.0753,599
-1.0269,-10.0868,-0.1204,0.5346,-10.0868,1.0321,18.5991,16.7572,600
-7.8188,-9.7504,7.6329,9.7823,-9.7504,4.8634,38.2458,27.4781,601
-16.9146,-9.6381,-9.1191,5.8124,-9.6381,3.5723,28.6851,25.4249,602
-2.4083,-9.9429,0.8035,2.2647,-9.9429,3.0339,11.6804,6.3894,603
-5.2494,-9.9189,-1.808,2.3595,-9.9189,7.045,34.1682,29.0499,604
-0.7095,-9.9625,10.2971,11.0336,-9.9625,6.7326,25.1504,20.7434,605
-2.4891,-9.9892,-0.7258,1.3798,-9.9892,1.998,18.5852,14.8638,606
-4.3486,-9.8811,-1.3164,2.2716,-9.8811,3.2652,11.5764,9.5824,607
-9.5203,-9.8043,2.4873,5.9712,-9.8043,6.0691,29.21,8.3489,608
-47.2592,-10.0928,28.4334,52.4096,-10.0928,10.567,67.6078,40.6951,609
-1.6554,-9.8395,0.7657,1.5564,-9.8395,2.9461,22.1608,19.3995,610
-1.8002,-9.897,0.2808,2.2651,-9.897,1.0364,18.0142,14.8802,611
-1.545,-9.925,2.9222,2.941,-9.925,4.0659,44.13,29.0342,612
-0.3698,-10.3213,3.6897,4.0045,-10.3213,2.1027,42.2599,33.3021,613
-53.0816,-9.807,1.3884,25.0965,-9.807,3.8782,55.7141,38.7811,614
1.0901,-10.0895,6.2121,4.395,-10.0895,2.113,36.3907,30.1923,615
-0.315,-9.8969,3.5367,2.6034,-9.8969,0.8269,28.1766,24.8375,616
-5.3812,-9.6858,0.604,3.1597,-9.6858,1.2748,43.784,35.1813,617
-3.0828,-10.1096,0.7737,2.3706,-10.1096,3.0183,53.3928,46.1687,618
-1.6142,-9.8441,7.4626,8.1862,-9.8441,8.2004,45.8319,14.3756,619
-0.0033,-9.9247,1.0572,0.9907,-9.9247,1.463,6.2266,5.3547,620
-0.6917,-9.9612,0.6486,1.7025,-9.9612,2.8222,34.8331,21.812,621
-1.4086,-10.0219,-0.063,0.4322,-10.0219,0.9883,9.0893,3.1231,622
-0.7316,-9.3495,-0.0828,0.3106,-9.3495,0.6105,10.8833,5.2038,623
-0.8786,-10.1971,2.779,3.008,-10.1971,2.7058,12.7208,8.123,624
-0.1546,-10.0253,1.1665,0.8558,-10.0253,2.3118,13.2085,11.2017,625
-10.6015,-9.9537,-0.2409,3.4042,-9.9537,2.2565,16.395,7.557,626
-6.9829,-9.8812,-3.3361,2.3233,-9.8812,1.0595,7.7373,5.9863,627
-0.8391,-9.8555,0.2829,0.7995,-9.8555,0.8288,4.1286,2.9651,628
-46.5615,-9.7778,-8.3793,18.5013,-9.7778,8.4766,19.3434,5.7067,629
-32.6882,-9.5581,-24.9622,5.9672,-9.5581,1.7453,10.8314,9.4798,630
-4.9734,-9.8993,0.12,3.433,-9.8993,0.8443,15.5434,13.8409,631
-35.4212,-9.9235,0.122,9.4803,-9.9235,4.7487,20.2847,4.6884,632
-31.4615,-9.9128,-0.0733,16.9242,-9.9128,3.9911,18.6221,14.8939,633
-1.8455,-9.9193,-0.5875,0.7368,-9.9193,1.5026,3.9026,2.4667,634
-0.3766,-9.8438,2.8583,3.5244,-9.8438,2.6318,6.6534,3.1404,635
-5.9818,-9.8403,-0.459,2.8631,-9.8403,2.3941,10.614,3.4206,637
-4.7116,-9.7937,2.4066,1.6587,-9.7937,0.8777,10.1455,2.6928,638
-0.2335,-9.9111,0.3032,0.3172,-9.9111,0.4631,2.9348,2.5634,641
