AYGX_min,AZ_mean,AYGX_mean,AYGX_std,AZ_mean.1,GX_std,Gnorm_max,Gnorm_median,timestamp
-14.5461,-9.8017,2.2037,7.7112,-9.8017,8.3067,28.8605,11.1284,866
-16.3431,-9.7209,-1.7104,6.6808,-9.7209,8.3712,22.6203,11.5393,867
-254.1735,-9.7142,-13.4281,55.3886,-9.7142,17.4584,60.5119,39.3879,868
-13.6897,-9.6861,-1.2804,4.5371,-9.6861,3.4601,12.8643,4.3172,869
-5.9199,-9.7883,-0.2652,2.3659,-9.7883,2.2424,27.2102,2.7806,870
