AYGX_min,AZ_mean,AYGX_mean,AYGX_std,AZ_mean.1,GX_std,Gnorm_max,Gnorm_median,timestamp
-3.0389,-10.1443,3.1138,5.3146,-10.1443,8.0884,31.9395,13.1301,736
-13.5905,-10.8553,-2.2249,5.9289,-10.8553,3.8933,14.1645,9.3734,738
-284.6342,-8.887,6.9411,62.0021,-8.887,15.6335,87.1625,22.7415,739
-30.9477,-10.7856,-0.0251,22.0942,-10.7856,2.7835,28.051,22.1788,740
-7.7029,-9.3902,2.2221,6.1357,-9.3902,2.7482,27.8423,15.6623,741
