AYGX_min,AZ_mean,AYGX_mean,AYGX_std,AZ_mean.1,GX_std,Gnorm_max,Gnorm_median,timestamp
-0.8917,-9.8914,0.2166,1.2153,-9.8914,1.2406,8.7783,7.5271,646
-0.4824,-9.8172,0.4518,1.216,-9.8172,1.3975,9.2143,5.7196,647
-64.8284,-9.6815,-23.1405,17.8344,-9.6815,6.3142,27.9327,16.8803,648
-14.7559,-9.8856,5.0799,7.9972,-9.8856,4.6874,35.7006,32.9555,649
-2.8782,-9.7963,0.6401,1.6218,-9.7963,2.0169,37.0378,36.1071,650
