AYGX_min,AZ_mean,AYGX_mean,AYGX_std,AZ_mean,GX_std,Gnorm_max,Gnorm_median,timestamp
-5.583,-9.9708,3.134,7.0716,-9.9708,6.6453,19.1602,16.6722,432
-8.9402,-9.4444,-0.8509,3.5849,-9.4444,2.4556,25.9046,15.9662,433
-0.8201,-9.849,-0.002,0.5009,-9.849,1.066,5.4616,4.1027,434
-2.8777,-10.0241,-0.5223,1.3193,-10.0241,6.3909,16.1345,7.871,435
-3.4133,-9.6595,0.6961,2.2589,-9.6595,4.7201,12.8037,8.2494,436
-3.2301,-9.8126,-0.1121,1.9627,-9.8126,4.557,8.7612,5.6402,437
-6.1772,-9.5771,2.5788,3.9216,-9.5771,3.2698,15.7207,14.0259,438
-7.7645,-9.5675,1.204,4.1894,-9.5675,3.9974,11.132,9.1509,439
-1.5396,-9.8096,0.3461,1.3132,-9.8096,4.0499,9.5339,5.9448,440
-2.3717,-9.4669,-0.1598,0.9032,-9.4669,1.8099,7.6423,2.7225,441
-1.2962,-9.7459,0.9423,1.8225,-9.7459,1.8318,7.204,4.1643,442
-1.414,-9.6658,-0.1205,0.7796,-9.6658,0.9965,8.7767,4.43,443
-0.941,-9.6107,-0.2672,0.3515,-9.6107,0.7402,7.6767,4.5661,444
-3.7738,-9.6383,0.8988,3.2554,-9.6383,4.2982,11.2445,7.1684,445
-1.0682,-9.3687,1.3008,2.4902,-9.3687,2.5734,9.4078,7.0869,446
-0.3315,-9.9375,0.0037,0.1426,-9.9375,0.6768,5.7595,2.0972,447
-1.0389,-9.6933,0.8029,1.2982,-9.6933,2.9407,11.626,7.011,448
-1.0142,-9.7202,-0.2831,0.5708,-9.7202,0.8765,9.0466,4.277,449
-0.0709,-9.8594,0.7499,0.8807,-9.8594,1.2158,14.9186,12.9817,450
-0.6714,-9.433,1.3489,1.4106,-9.433,0.6141,7.9387,6.4089,451
-0.4916,-10.0457,0.1532,0.6933,-10.0457,1.9076,5.9236,3.8026,452
-1.3845,-9.8538,0.663,1.0039,-9.8538,0.7124,8.2755,4.4399,453
-1.3574,-9.813,1.3937,1.8054,-9.813,3.1863,7.6378,6.3541,454
-0.8137,-9.4991,0.3576,0.8371,-9.4991,2.9624,8.6173,4.1318,455
-0.604,-9.7204,1.8654,2.5825,-9.7204,5.6842,11.7741,7.4736,456
-1.6973,-9.9692,1.0027,1.685,-9.9692,5.2348,13.5042,8.0098,457
-4.1579,-9.952,0.4061,2.1566,-9.952,4.0096,17.3623,10.1783,458
-16.9144,-9.7552,14.019,20.5126,-9.7552,5.4679,29.0104,25.7145,459
-1.1181,-9.8962,3.4585,4.7905,-9.8962,4.7,19.5679,7.3695,460
-0.517,-9.8775,1.4365,1.48,-9.8775,5.5471,13.6681,12.9836,461
-22.7854,-9.6908,-0.938,8.1707,-9.6908,6.3964,43.6056,11.3016,462
-14.1061,-9.5939,-0.1216,4.5297,-9.5939,5.4572,44.2309,10.5206,463
-4.0331,-9.7396,2.3169,5.3461,-9.7396,8.9262,19.783,12.1725,464
-1.252,-10.246,0.3693,1.1821,-10.246,2.1437,9.0155,5.5108,465
-0.0024,-9.7451,0.5679,0.9013,-9.7451,6.4727,13.1868,7.942,466
-1.2517,-9.8859,1.7024,2.3361,-9.8859,6.4336,12.5473,7.5192,467
-0.9761,-9.432,0.2128,0.918,-9.432,3.1072,9.0537,5.2099,468
-0.833,-9.3255,1.1496,2.2069,-9.3255,5.0097,8.5524,5.3755,469
-1.7073,-9.7903,-0.1491,1.0327,-9.7903,2.701,8.0075,3.9472,470
-3.63,-9.8724,0.1556,1.5512,-9.8724,2.9388,11.0792,4.1522,471
-0.4925,-9.7165,1.0334,1.6417,-9.7165,4.0031,8.5308,7.2906,472
-5.9545,-9.4688,1.3734,4.1668,-9.4688,1.8721,18.875,10.2562,473
-0.1472,-9.8743,0.9284,0.848,-9.8743,3.9441,15.335,11.8247,474
-1.9956,-9.7713,0.3791,1.4606,-9.7713,0.735,6.0325,4.7663,475
-0.8353,-9.6895,0.0315,0.5636,-9.6895,0.3757,5.7639,4.3406,476
-15.9752,-9.7442,-1.9097,5.3761,-9.7442,6.2138,15.3538,8.407,477
-16.9133,-9.6368,-8.4905,4.8551,-9.6368,2.7919,10.4292,7.9543,478
-16.2514,-9.6212,-2.488,5.1818,-9.6212,2.7463,5.4911,3.4894,479
-5.1164,-9.7037,6.4864,6.977,-9.7037,4.4447,19.3937,10.6494,480
-45.8369,-9.7088,-2.9121,11.6621,-9.7088,4.2462,45.867,9.9597,481
-10.0667,-9.7462,0.8364,4.7426,-9.7462,6.0486,31.4507,17.1179,482
-2.6384,-9.7703,-0.2758,1.3539,-9.7703,3.274,16.3604,5.9663,483
-5.4247,-9.7589,1.2688,4.9348,-9.7589,5.9147,22.0225,14.5102,484
-1.1699,-9.7797,-0.2275,0.7105,-9.7797,0.9307,6.4803,4.31,485
-0.8913,-9.658,0.6037,0.8298,-9.658,0.9931,8.9552,8.096,486
-3.0067,-9.9481,1.2889,3.9147,-9.9481,1.0694,23.5022,21.3519,487
-2.488,-9.6324,2.9787,6.2874,-9.6324,6.7197,21.347,11.2512,488
-4.7164,-10.0423,3.0671,8.6551,-10.0423,3.0334,33.6395,31.8744,489
-3.5507,-9.687,0.9231,3.6394,-9.687,4.3921,17.1442,13.8717,490
-9.6274,-10.0236,-3.2774,3.7036,-10.0236,2.0116,18.1889,17.0682,491
-24.3922,-9.2989,-5.5582,9.5311,-9.2989,2.1546,17.0748,11.6929,492
-36.9936,-9.8094,-2.7271,14.61,-9.8094,6.4777,25.6562,17.1677,493
-2.3723,-9.7789,2.2052,3.5758,-9.7789,8.1193,20.5287,16.1929,494
-3.7232,-9.5691,0.4686,2.5579,-9.5691,4.6818,12.7911,6.7636,495
-1.6214,-9.7871,1.2466,1.542,-9.7871,6.8197,14.9844,9.3272,496
-2.3681,-9.6276,0.1062,1.545,-9.6276,4.6008,10.7672,6.2165,497
-5.7302,-9.7569,-1.2081,2.7463,-9.7569,2.2757,11.9208,9.9484,498
-1.6839,-9.3863,3.6733,4.8083,-9.3863,6.543,16.3705,12.9877,499
-3.6479,-10.1152,0.3483,2.7463,-10.1152,2.4511,10.4639,7.788,500
-2.6918,-9.512,1.7918,3.1818,-9.512,5.0938,13.4684,9.0085,501
-1.9485,-9.2301,3.411,4.6949,-9.2301,1.4065,9.2808,7.3916,502
-3.4317,-9.8433,-1.139,1.4835,-9.8433,5.4019,11.1718,6.5939,503
-3.3099,-9.5074,1.6764,3.7343,-9.5074,2.8997,15.1044,12.1958,504
-4.1899,-9.5781,-1.2826,1.7325,-9.5781,3.5888,9.4926,6.5778,505
-19.3513,-9.2417,-1.7744,10.7528,-9.2417,4.3999,23.9444,19.1665,506
8.8663,-11.6138,39.8463,26.784,-11.6138,7.6042,57.6045,39.0261,507
-10.1686,-9.7703,0.2951,4.8288,-9.7703,4.2329,13.4444,7.9385,508
-1.2054,-9.0807,-0.1451,0.8905,-9.0807,2.2409,16.5823,9.3402,509
-5.5838,-9.3361,-0.9013,2.6976,-9.3361,2.9548,9.668,5.9192,510
-2.1981,-9.7973,1.1612,1.9177,-9.7973,7.5767,16.3904,13.7261,511
-2.5552,-9.7208,-0.3281,1.046,-9.7208,2.9138,11.0332,3.535,512
-2.6961,-9.6383,0.6941,2.5762,-9.6383,5.1419,11.3995,7.3214,513
-10.9274,-9.7263,-0.1402,3.747,-9.7263,6.459,14.0706,7.9425,514
-3.5347,-10.0876,-0.2521,2.4146,-10.0876,2.0231,11.1633,9.9802,515
-1.9868,-9.8436,-0.1493,1.566,-9.8436,2.4539,10.6116,6.8598,516
-3.4234,-9.0519,4.873,5.6764,-9.0519,4.969,17.0519,12.8358,517
-8.9977,-9.3986,-0.9671,3.5633,-9.3986,7.9622,17.0114,10.2886,518
-2.4021,-9.4706,0.5206,1.3653,-9.4706,1.2966,9.1769,5.0322,519
-2.2011,-7.8432,-0.8286,1.2334,-7.8432,1.2018,31.6025,9.3408,520
-3.2712,-9.7788,2.1924,3.4087,-9.7788,2.4067,42.2973,15.5163,521
-10.2816,-9.7376,1.3127,6.5546,-9.7376,2.2014,14.4741,10.8477,522
-9.9831,-9.7308,-0.723,4.5239,-9.7308,8.1367,16.4293,9.8854,523
-3.2101,-10.0099,-0.1861,2.1345,-10.0099,6.0468,11.3938,8.0819,524
-1.9836,-10.0811,1.9053,2.4658,-10.0811,2.7021,12.2078,9.5942,525
-0.4827,-9.952,1.7516,2.5476,-9.952,5.7957,17.1098,11.3287,526
-6.8429,-9.4291,5.6813,9.3379,-9.4291,3.6946,16.4506,15.016,527
-3.4184,-9.6065,0.6611,2.502,-9.6065,2.4857,13.3318,8.331,528
-8.1441,-9.267,-1.8759,3.3815,-9.267,3.5286,17.6737,7.3326,529
-4.5367,-9.4796,-0.0449,2.2803,-9.4796,3.9903,16.6697,10.1497,530
-3.9378,-9.8178,0.9387,4.0809,-9.8178,3.4463,16.94,14.3683,531
-2.5272,-10.1591,0.74,3.1452,-10.1591,4.1444,11.1937,7.6379,532
-2.0913,-10.0069,7.5656,10.016,-10.0069,10.8995,23.9064,21.0221,533
-4.9795,-9.9569,1.5266,4.5078,-9.9569,4.5268,19.1178,10.0802,534
-4.5016,-9.7065,1.1131,2.2645,-9.7065,6.061,13.2641,9.7568,535
-2.746,-9.9157,0.4936,2.163,-9.9157,2.8898,8.2777,6.0901,536
-4.4224,-9.538,-1.0754,2.3783,-9.538,7.8613,15.1067,7.9473,537
-5.9833,-8.9741,-1.154,2.4519,-8.9741,2.2733,32.5452,10.5208,538
-4.5313,-9.7444,0.6513,3.0991,-9.7444,6.148,14.1892,7.7125,539
-1.7048,-7.4399,-0.42,0.8825,-7.4399,3.9457,28.3335,6.3022,540
-4.3242,-11.994,-0.8126,1.7682,-11.994,3.9123,40.3977,10.4308,541
-2.9862,-9.8462,0.3824,2.8851,-9.8462,4.8853,11.0237,9.3237,542
-4.5219,-9.8797,2.5786,5.7556,-9.8797,6.471,18.0786,10.1498,543
-3.3891,-9.9037,2.4098,3.5058,-9.9037,3.1395,11.0197,10.0417,544
-4.297,-10.0819,0.1379,3.0313,-10.0819,4.664,15.8284,11.1664,545
0.2683,-9.1974,3.7567,4.0703,-9.1974,6.0193,17.3228,14.9523,546
-7.1577,-9.1001,1.2122,4.1704,-9.1001,5.2389,13.5538,6.7652,547
-12.0114,-9.6793,-2.316,4.7903,-9.6793,5.817,17.4582,10.1585,548
-6.1475,-9.7132,0.024,2.126,-9.7132,5.468,12.9389,6.4079,549
0.0052,-9.7042,1.4978,1.4662,-9.7042,4.128,12.5512,5.0683,550
-5.2564,-10.2465,0.9158,3.3627,-10.2465,3.9854,8.3731,6.8008,551
-3.1578,-9.7003,0.5757,2.0279,-9.7003,7.422,13.337,10.3583,552
-1.3127,-9.6944,2.8603,4.2584,-9.6944,6.5733,12.8025,11.4235,553
-1.0979,-9.5116,0.6928,1.3379,-9.5116,2.8371,10.2526,7.1143,554
-3.688,-9.8807,-0.0496,1.8722,-9.8807,1.4549,7.7363,6.1021,555
-0.9129,-9.5342,0.5797,1.1819,-9.5342,3.3266,8.5843,5.5153,556
-3.4344,-9.7913,0.6444,2.7893,-9.7913,1.7333,9.6697,7.7982,557
-0.5038,-9.6388,0.4769,0.698,-9.6388,2.3962,6.1124,4.2312,558
-2.0797,-10.0264,0.1926,1.1602,-10.0264,3.2388,10.9789,5.517,559
-0.4263,-9.8556,0.0653,0.3675,-9.8556,0.7175,6.362,4.2023,560
-0.0232,-9.6906,0.2247,0.3688,-9.6906,1.3622,3.564,2.8366,561
-0.2568,-9.6629,-0.0397,0.155,-9.6629,0.759,8.9615,6.1214,562
-0.2358,-9.7619,-0.0788,0.1033,-9.7619,0.5671,8.0486,6.3033,563
-0.0303,-9.7775,0.2135,0.2106,-9.7775,0.8613,9.0067,7.0867,564
-0.4493,-9.7595,0.0232,0.3443,-9.7595,0.5572,4.8706,4.4018,565
-0.8935,-9.6996,0.0195,0.7514,-9.6996,2.0207,9.3965,3.8435,566
-0.9904,-9.8,-0.0274,0.5648,-9.8,0.706,7.2373,5.8427,567
-0.8194,-9.7459,0.344,0.7548,-9.7459,2.7209,16.4039,9.8813,568
-0.3738,-9.7348,0.2014,0.7009,-9.7348,1.3893,7.0062,6.2864,569
-1.9533,-9.6618,-0.0848,1.8708,-9.6618,2.7355,14.3173,10.1826,570
-4.784,-9.9609,-0.0378,2.4521,-9.9609,4.2323,14.8981,12.7065,571
-37.0179,-9.712,0.3828,13.4005,-9.712,11.1963,34.6901,25.4084,572
-1.6518,-9.9624,1.562,3.305,-9.9624,4.9469,12.4627,5.7687,573
-1.4519,-10.1052,2.5946,2.7238,-10.1052,1.7504,12.1396,8.9783,574
-0.4066,-9.7082,0.5601,1.2087,-9.7082,2.0438,15.9025,13.4522,575
-4.7615,-9.7408,2.641,4.753,-9.7408,2.3544,14.1809,11.6288,576
-15.8058,-9.4756,-7.2441,6.9364,-9.4756,3.3359,21.7644,14.17,577
-11.2138,-9.4368,-0.2545,5.8315,-9.4368,12.4146,22.9903,11.1069,578
-10.8724,-9.7132,-2.2306,3.3613,-9.7132,7.2293,18.5919,8.6597,579
-4.7358,-9.5136,-1.0852,2.6834,-9.5136,3.2335,13.7827,9.0179,580
-4.8998,-9.7358,2.581,6.4338,-9.7358,4.2381,14.9102,8.5258,581
-17.3549,-9.9436,2.5956,13.5507,-9.9436,10.1713,29.6981,17.429,582
-3.5599,-9.6933,4.4111,7.3668,-9.6933,3.3317,19.3952,16.2952,583
-2.9323,-9.8765,-0.0685,1.9436,-9.8765,3.3799,5.9574,4.4745,584
-8.5731,-9.7753,1.1706,7.3943,-9.7753,2.5889,15.2054,13.03,585
-8.3143,-9.9794,-2.1913,2.8555,-9.9794,3.6035,12.7952,7.113,586
-4.4224,-9.1825,-0.8567,1.8473,-9.1825,5.9576,32.9038,10.1147,587
-14.2739,-9.968,2.8168,8.9886,-9.968,12.4804,27.5234,19.0662,588
-10.5762,-9.8685,-1.3736,4.0456,-9.8685,4.1091,10.6374,3.9846,589
-1.4458,-8.5478,0.3046,1.1509,-8.5478,2.2685,13.3259,8.5865,590
-4.2776,-9.8538,-0.3367,2.3138,-9.8538,4.8383,15.136,8.4017,591
-2.4245,-9.7716,2.7009,4.8666,-9.7716,3.3904,18.1193,15.349,592
-2.4,-10.6011,4.3,8.0248,-10.6011,8.5297,18.3434,15.1138,593
-7.5796,-9.5645,-1.3657,3.6637,-9.5645,1.8079,11.2686,7.5506,594
-8.8839,-9.3774,4.3455,9.5608,-9.3774,10.2117,22.6715,13.3442,595
-3.4133,-9.8135,-1.2211,1.7551,-9.8135,5.7566,12.2719,7.7757,596
-1.5162,-9.6183,3.9986,5.5522,-9.6183,4.3343,17.0706,12.5394,597
-6.7255,-9.7668,0.1816,2.7056,-9.7668,7.023,15.1807,9.837,598
-5.3836,-9.7819,3.5992,7.1142,-9.7819,10.364,21.7901,13.2872,599
-5.9602,-9.9577,-0.1009,3.4403,-9.9577,6.7237,18.4082,9.4553,600
-11.6142,-9.513,-1.3165,7.4136,-9.513,4.4557,20.2645,14.6116,601
-9.2038,-10.2778,-1.3689,3.5873,-10.2778,4.1276,8.7232,7.2521,602
-4.3338,-9.9171,1.7968,3.9646,-9.9171,6.8639,17.2131,12.2597,603
-6.0879,-10.265,-0.4527,3.6567,-10.265,2.8655,11.6146,9.422,604
-0.968,-10.3048,0.1625,0.77,-10.3048,2.8216,11.9375,4.343,605
-3.41,-9.4412,-0.6014,1.6147,-9.4412,2.3028,12.5658,6.8363,606
-11.2572,-9.6781,-0.4901,6.4021,-9.6781,6.1703,16.7855,11.2668,607
-23.7531,-9.2078,-0.4485,7.3172,-9.2078,6.1911,52.8716,12.1435,608
-12.897,-9.9197,3.1697,9.4762,-9.9197,6.5415,20.6209,8.0024,609
-27.3764,-9.6529,-3.1217,14.6565,-9.6529,6.1696,33.793,26.5772,610
-2.1217,-9.7451,1.7666,3.1638,-9.7451,4.3911,12.8543,6.3045,611
-9.7195,-9.3351,-1.3147,3.9844,-9.3351,3.1027,9.0308,8.4611,612
-2.4493,-9.9131,-0.4133,0.9824,-9.9131,1.623,8.7886,5.2759,613
-2.9586,-9.7209,-0.3597,1.9123,-9.7209,7.2851,12.7309,8.7513,614
-5.2105,-9.361,-0.181,2.7151,-9.361,2.3136,10.8309,8.577,615
-8.9895,-9.0459,-1.0306,4.2438,-9.0459,3.7224,18.1695,13.4961,616
-1.2072,-9.4705,0.9021,1.9659,-9.4705,5.0089,21.8822,20.0831,617
0.0136,-9.9725,4.5632,3.7628,-9.9725,2.1025,25.3556,20.3429,618
-5.1842,-9.5527,2.4682,5.6722,-9.5527,7.9344,31.4346,7.1018,619
-8.2169,-10.0592,-1.0035,4.8889,-10.0592,2.8613,16.8682,11.181,620
-4.3491,-9.2559,-0.5296,2.1271,-9.2559,5.3529,12.1765,8.5343,621
-2.1747,-9.5828,-0.2735,1.0255,-9.5828,4.2223,11.0615,7.152,622
-4.8908,-8.9831,0.3225,2.7475,-8.9831,5.0701,13.6954,9.8499,623
-1.8037,-9.6303,-0.7031,0.703,-9.6303,0.9323,9.7883,6.873,624
-3.3894,-9.843,0.0979,1.9737,-9.843,4.2642,9.4584,7.5113,625
-0.9289,-10.0514,0.5922,1.0314,-10.0514,2.3712,7.3756,5.6276,626
-0.5782,-9.5727,1.1515,1.2028,-9.5727,2.3698,8.2546,7.0515,627
-3.2663,-10.5474,0.3037,2.9614,-10.5474,1.8153,15.4493,13.8611,628
-2.23,-10.2074,-0.0692,1.453,-10.2074,3.4218,11.4523,9.0004,629
-2.975,-9.7768,-0.136,1.883,-9.7768,6.3817,13.453,7.8972,630
-0.7265,-9.9168,0.6557,1.0264,-9.9168,5.1412,10.1376,6.5262,631
-3.4479,-9.538,-0.4921,1.3724,-9.538,1.2162,29.3397,7.0308,632
-3.3651,-9.6842,2.154,3.272,-9.6842,1.931,21.7695,13.4154,633
-0.2166,-9.3155,0.1923,0.4108,-9.3155,1.1239,11.5001,8.4896,634
-0.4112,-9.7564,0.362,0.4892,-9.7564,1.5795,15.2737,13.3041,635
-2.3285,-9.7708,0.0238,1.5217,-9.7708,0.9867,15.6258,12.4968,636
-0.4943,-9.6512,0.1341,0.4774,-9.6512,0.8784,10.2418,5.6184,637
-0.7479,-9.8014,0.0894,0.5826,-9.8014,0.7741,11.1697,9.2917,638
-0.958,-9.7501,0.2918,0.6396,-9.7501,0.7571,5.804,5.0106,639
-0.3266,-9.8009,0.0677,0.2544,-9.8009,1.2418,11.2318,8.6309,640
0.1801,-9.593,7.8162,6.71,-9.593,4.079,15.8387,12.1435,641
-6.474,-9.9344,-2.1235,3.9247,-9.9344,1.6508,16.2595,11.3825,642
-14.0487,-9.8571,-1.4396,5.4007,-9.8571,7.4605,16.6884,10.3896,643
-5.1762,-9.9716,-0.5422,3.1466,-9.9716,6.7921,14.0084,11.0902,644
-7.8311,-9.4965,11.008,16.2977,-9.4965,2.8206,30.5036,17.5327,645
-5.7314,-9.9729,-1.2534,2.4304,-9.9729,5.8835,21.9207,19.9011,646
-10.1164,-9.9144,-1.4402,3.5378,-9.9144,6.4802,19.7547,7.9369,647
-11.0838,-9.6996,-2.5544,3.9134,-9.6996,7.945,22.1651,8.8701,648
-14.2782,-9.7966,-1.2555,4.251,-9.7966,7.6994,21.2127,9.2743,649
-16.8559,-10.3771,-1.9106,8.9529,-10.3771,9.3693,37.4779,30.7492,650
-19.8883,-9.4592,1.5728,11.4468,-9.4592,13.5659,22.5784,21.211,651
-5.9243,-9.4842,-2.3297,2.1323,-9.4842,3.2825,12.5714,5.0693,652
-9.7275,-9.9719,-2.1898,4.0923,-9.9719,4.3283,12.3774,9.2593,653
-5.1413,-9.7945,-0.6348,2.9904,-9.7945,6.0577,18.8331,10.1362,654
-8.254,-9.4068,-0.6547,5.1728,-9.4068,2.5348,18.2417,10.6582,655
-5.124,-9.7267,-0.4276,1.7021,-9.7267,3.6826,16.835,13.3228,656
-4.3807,-9.8712,0.039,3.2685,-9.8712,3.5926,23.8793,17.4338,657
-9.3908,-9.7289,-0.8107,4.7114,-9.7289,8.7759,19.7192,10.15,658
-7.9065,-9.9018,-1.6907,3.8764,-9.9018,3.8551,16.8138,14.1416,659
-16.6748,-10.4107,0.0426,7.8096,-10.4107,5.4347,18.2731,10.2974,660
-9.8732,-9.7575,-0.9294,4.1084,-9.7575,4.3934,14.6964,4.9249,661
-14.0952,-9.138,-1.8408,5.0075,-9.138,3.848,10.6236,4.0848,662
-2.9019,-9.5374,-0.7239,1.3583,-9.5374,4.7254,11.0767,6.251,663
-7.2785,-9.4556,-2.8134,3.1546,-9.4556,2.7509,13.7288,10.2796,664
-6.3667,-10.0367,-1.4302,3.3122,-10.0367,2.8127,13.5717,9.3633,665
-10.6549,-9.8395,-4.4061,4.5485,-9.8395,4.9866,16.4282,7.5506,666
-4.887,-9.0391,-0.5807,2.8145,-9.0391,6.4565,13.8194,9.3062,667
-3.4061,-9.5049,0.4012,1.6978,-9.5049,1.8766,5.8505,4.9134,668
-4.6725,-9.3037,-0.0674,2.0591,-9.3037,4.2019,17.049,12.7553,669
-5.567,-9.9299,-0.5852,2.4222,-9.9299,1.3718,9.8312,6.5325,670
-11.2022,-9.5897,-0.8039,5.7764,-9.5897,4.2382,15.7993,11.5581,671
-4.8615,-9.7187,0.0522,2.7957,-9.7187,2.1746,21.774,10.1448,672
-6.2956,-9.6592,-0.3323,2.5686,-9.6592,3.8333,8.7595,6.3984,673
-4.4578,-9.7827,-1.0239,1.5504,-9.7827,1.9087,11.4736,4.5359,674
-1.2142,-10.0415,-0.0581,0.8776,-10.0415,3.0184,8.318,4.8522,675
-4.1516,-9.9584,-0.8879,2.694,-9.9584,4.6065,22.7134,19.3957,676
-3.0679,-9.1804,1.7538,4.8782,-9.1804,4.2559,21.2992,19.8859,677
-6.0627,-9.6461,-0.5558,3.2864,-9.6461,4.9702,16.9418,7.6421,678
-23.1051,-9.616,-2.7558,8.7971,-9.616,10.0599,22.4347,13.7786,679
-7.4742,-9.8046,-0.1283,3.9198,-9.8046,6.8257,12.8203,8.0701,680
-10.6136,-10.0792,-1.8075,4.0439,-10.0792,4.2645,13.0834,7.8212,681
-4.9469,-10.0157,0.5058,2.7651,-10.0157,5.6843,17.8309,9.0362,682
-13.6785,-9.7781,-2.4088,4.8931,-9.7781,5.962,13.47,9.8886,683
-8.9044,-9.651,-1.4783,5.781,-9.651,2.6798,16.4055,11.4986,684
-7.5477,-8.9562,-2.8288,4.1276,-8.9562,4.3617,15.862,11.5261,685
-6.1351,-9.468,-0.4094,2.7656,-9.468,4.9113,12.25,5.2866,686
-0.9778,-9.9621,3.43,5.4917,-9.9621,2.8998,17.0502,13.8614,687
-11.4071,-9.6842,-0.9649,4.1305,-9.6842,9.7348,26.9421,17.7867,688
-3.252,-9.2375,-1.3985,1.8826,-9.2375,2.3243,22.675,9.8184,689
-10.7154,-9.3903,-1.1364,5.5428,-9.3903,5.9836,18.6294,14.5002,690
-7.4297,-10.0285,-2.248,3.4365,-10.0285,5.9756,17.2871,10.9783,691
-20.5669,-9.8268,-7.5061,9.9649,-9.8268,12.4378,24.4715,14.4721,692
-5.4224,-9.7818,1.6947,4.3311,-9.7818,4.0946,16.121,13.3721,693
-1.4073,-10.0781,-0.4612,0.6892,-10.0781,2.7894,14.0377,7.5406,694
-14.6375,-9.0485,-5.6224,6.5325,-9.0485,2.7596,18.8516,16.8582,695
-18.1159,-9.5126,0.3881,12.6612,-9.5126,5.6284,24.0441,16.978,696
-5.3225,-10.0682,-0.9015,2.6119,-10.0682,3.1312,13.0026,7.6128,697
-5.9867,-9.4486,-1.2749,2.6966,-9.4486,7.0541,15.4363,7.9086,698
-6.9109,-9.614,-1.3664,2.9087,-9.614,8.0262,14.3995,10.2525,699
-1.5505,-9.709,0.1928,0.8943,-9.709,3.6795,7.4668,4.6912,700
-4.4894,-10.6133,-0.9159,1.8976,-10.6133,4.3371,10.4062,7.0631,701
-13.0928,-9.3614,-2.2877,4.9237,-9.3614,4.0801,16.2114,6.8535,702
-6.3785,-10.2171,-2.784,3.01,-10.2171,2.3354,21.058,12.6753,703
-17.0603,-9.4257,-2.8577,9.6973,-9.4257,3.9414,20.7369,18.974,704
-7.3809,-10.4299,2.3968,5.4119,-10.4299,8.8047,32.1139,26.2516,705
-7.0174,-10.3299,-1.2574,3.4774,-10.3299,4.6813,30.164,19.1919,706
-11.6141,-9.7452,-0.9005,10.9844,-9.7452,9.6313,44.2037,38.3082,707
-18.22,-9.7975,-1.8074,6.6211,-9.7975,8.7499,19.3325,7.3826,709
-15.4064,-9.6519,-1.8634,4.9247,-9.6519,9.4901,20.9087,10.3911,710
-13.6403,-9.7093,-0.6677,8.9458,-9.7093,12.2673,22.0161,14.609,711
-14.7351,-8.151,2.3445,10.8306,-8.151,6.2771,20.9329,8.8937,712
-19.1199,-9.7967,3.9965,10.76,-9.7967,6.6034,20.4977,10.8596,713
-12.4919,-9.987,-0.782,6.2087,-9.987,10.935,34.8196,17.4502,714
-11.6454,-9.6202,-1.2279,4.9154,-9.6202,7.4174,15.7105,9.854,715
-18.9954,-10.0995,0.8235,9.7277,-10.0995,11.8899,19.7327,15.5277,716
-0.3297,-9.9637,8.8164,9.545,-9.9637,7.1906,20.3859,14.8931,717
-18.5346,-9.8655,0.5195,7.0677,-9.8655,10.3476,17.4145,12.2583,718
-9.0484,-10.0794,-1.3992,3.2658,-10.0794,4.3017,11.0417,7.5991,719
-6.4536,-8.9795,1.2558,6.6869,-8.9795,3.1336,22.1766,14.0674,720
-0.3679,-9.4283,5.9233,4.9719,-9.4283,2.6565,14.2451,11.1565,721
-4.7844,-9.7499,-0.1048,3.1347,-9.7499,4.149,12.7494,11.5728,722
-1.7554,-9.5556,-0.6335,0.876,-9.5556,1.4159,6.1104,4.8738,723
-1.0502,-10.0896,1.859,2.6898,-10.0896,1.2386,7.076,6.1427,724
-2.757,-9.7339,-1.4259,1.0628,-9.7339,0.9303,15.4823,11.7016,725
-1.2361,-9.8317,-0.1564,1.0112,-9.8317,2.9056,6.9015,4.1721,726
-2.1754,-9.6327,2.1264,3.8642,-9.6327,4.0583,15.386,12.5962,727
-14.7211,-9.7187,-0.6125,6.0613,-9.7187,4.0946,12.581,8.4302,728
-1.351,-9.7152,1.987,3.0401,-9.7152,5.7166,14.6022,10.9589,729
-2.8326,-9.6418,2.9716,6.5761,-9.6418,8.8004,23.7552,10.6739,730
-2.8608,-9.5522,2.6106,3.7333,-9.5522,6.5951,14.1943,12.5685,731
-1.0163,-9.6521,7.1661,7.6488,-9.6521,6.2832,20.3456,14.2144,732
-10.0564,-9.5146,3.8998,11.9783,-9.5146,6.2825,20.3264,15.9954,733
-10.7376,-10.2694,5.2379,8.8494,-10.2694,5.4353,28.7465,23.3758,734
-5.3451,-9.9008,4.2247,5.017,-9.9008,3.874,17.3194,13.6093,735
-2.7756,-10.2106,0.6264,2.1352,-10.2106,5.0857,11.258,7.7304,736
-7.2686,-9.3081,0.9002,4.4085,-9.3081,7.7016,26.5482,10.4117,738
-3.654,-9.5159,3.6264,3.4,-9.5159,4.5029,17.4547,14.3057,739
-3.6176,-8.8632,2.2139,4.8633,-8.8632,9.7567,16.0448,11.6729,740
-4.6607,-9.8554,-0.2409,5.3893,-9.8554,3.2987,10.8151,8.6692,741
-3.6272,-9.3983,2.418,3.7066,-9.3983,4.9463,10.7692,9.4829,742
-2.4082,-9.2296,0.6302,2.9136,-9.2296,3.4942,14.4016,8.6042,743
-10.5444,-8.9519,2.7039,9.8496,-8.9519,5.4665,22.6812,15.9422,744
-11.5321,-9.5622,-1.1347,7.1103,-9.5622,6.1591,18.0462,11.7372,745
-0.4369,-9.5164,2.796,3.1818,-9.5164,4.0333,14.5395,12.0076,746
-5.4286,-9.0166,-0.1502,2.9587,-9.0166,4.6349,12.3973,6.4781,747
-6.4264,-9.8414,1.6045,6.5147,-9.8414,7.4623,18.3477,14.4942,748
-5.8427,-9.9273,-0.274,2.7819,-9.9273,5.8479,13.2757,7.6147,749
-5.0533,-9.9445,0.3932,2.8522,-9.9445,2.328,9.9386,7.5373,750
-3.9653,-9.5842,-0.0985,2.2129,-9.5842,5.6096,11.5266,7.8999,751
-7.7173,-9.6092,-0.1287,5.5146,-9.6092,2.285,14.0081,11.7872,752
-7.1579,-9.6638,-0.0195,4.1049,-9.6638,6.4532,14.7765,13.349,753
-12.6854,-9.3481,1.0383,6.7898,-9.3481,10.1305,19.3791,11.8672,754
-14.8235,-10.2625,-3.7542,6.6965,-10.2625,7.5731,17.7347,10.7389,755
-8.3842,-9.5955,-1.4395,3.9284,-9.5955,2.0503,12.9658,8.122,756
-14.855,-9.667,-0.8221,3.4337,-9.667,5.8863,13.6545,9.5134,757
-4.3083,-9.5175,9.0014,9.4572,-9.5175,2.7031,19.105,16.6951,758
-2.4701,-9.753,0.0757,2.8555,-9.753,4.9338,18.1925,8.9835,759
-13.2388,-6.805,-2.1216,7.5762,-6.805,6.9258,15.9855,9.7472,760
-6.612,-9.5486,-0.7221,4.7961,-9.5486,3.0104,11.7526,8.8379,761
-6.9084,-9.9658,-0.4371,3.4301,-9.9658,8.1013,15.6068,11.23,762
-1.3652,-9.2848,1.2057,2.0138,-9.2848,4.7722,11.6691,7.7566,763
-5.0023,-9.8037,0.7323,3.382,-9.8037,4.6668,13.2625,10.9657,764
-2.8111,-9.2026,1.5082,2.8261,-9.2026,6.3686,22.8135,14.9524,765
-4.0438,-9.5363,-0.3896,2.9573,-9.5363,1.2755,13.4911,10.7844,766
-7.6598,-9.2012,0.3556,3.2652,-9.2012,8.1184,24.7385,10.865,767
-6.0189,-9.2508,2.4047,4.1918,-9.2508,8.2198,22.6765,13.1322,768
-4.3392,-8.9007,2.9386,4.573,-8.9007,5.0994,24.472,8.1764,769
-1.4733,-8.6582,6.3895,8.9848,-8.6582,4.8226,22.5889,19.2118,770
-2.253,-9.2677,4.8617,8.0339,-9.2677,7.2898,23.7741,20.0423,771
-3.448,-9.4703,-0.2726,1.8,-9.4703,2.3141,6.7241,5.1239,772
-12.7492,-9.6876,-1.9963,3.402,-9.6876,7.3767,18.5592,8.3771,773
-6.9161,-9.7927,-0.5366,4.8122,-9.7927,3.2304,15.7305,12.32,774
-0.8518,-9.6721,0.0609,0.7078,-9.6721,6.3547,12.774,8.2928,775
-3.3505,-9.7632,-0.0591,2.3077,-9.7632,5.0382,18.5986,13.3677,776
-4.8445,-9.6291,-1.5827,1.9099,-9.6291,1.8694,9.5093,7.7783,777
-1.6661,-9.7347,0.0966,1.6901,-9.7347,6.5035,15.8006,8.5621,778
-6.0609,-9.702,0.4504,2.5522,-9.702,6.4956,14.3762,8.1457,779
-3.07,-9.817,1.9102,3.2518,-9.817,7.7981,16.6906,10.2466,780
-5.9485,-9.7955,-0.7478,2.23,-9.7955,5.4624,10.6094,7.7233,781
-2.5331,-9.8813,0.2422,1.705,-9.8813,5.515,13.9511,5.5252,782
-1.7248,-9.5622,-0.3639,0.6661,-9.5622,5.5498,12.0622,6.393,783
-2.5023,-9.4195,0.4071,1.7859,-9.4195,1.9504,11.2811,9.8319,784
-1.4191,-9.6669,0.3187,0.9494,-9.6669,2.8814,6.3551,4.0119,785
-1.5855,-9.6817,0.1013,1.2082,-9.6817,3.4068,13.3297,8.8186,786
-4.4009,-9.6896,-0.7721,1.4993,-9.6896,4.7682,11.2994,5.802,787
-1.0639,-10.1556,-0.1791,0.5728,-10.1556,2.0241,6.5479,4.5495,788
-3.9418,-9.687,1.3629,3.0626,-9.687,3.0707,15.0415,13.0733,789
-1.0952,-10.2399,0.312,1.2285,-10.2399,5.2412,12.9667,8.1174,790
-5.9641,-9.3942,-1.2536,3.8229,-9.3942,3.4349,18.0067,12.6271,791
-0.5914,-9.8902,1.8954,1.9893,-9.8902,3.858,10.2588,7.1053,792
-1.4334,-9.9454,1.4899,2.2563,-9.9454,1.8249,11.183,8.0568,793
-0.6443,-9.1766,0.54,0.8466,-9.1766,0.9358,8.2315,5.4826,794
-0.4579,-9.6628,-0.0998,0.2674,-9.6628,1.3771,7.0024,6.2772,796
-0.4118,-9.9284,-0.0617,0.187,-9.9284,0.8307,3.5587,3.0491,797
-0.0647,-9.7757,0.2256,0.3412,-9.7757,1.4965,7.2384,2.9699,798
-0.113,-9.7355,0.0027,0.0696,-9.7355,0.268,2.1348,1.9526,799
-3.0164,-9.7718,-0.0138,1.1901,-9.7718,1.0622,6.5627,4.3775,800
-2.2318,-9.6989,-1.2279,0.5899,-9.6989,1.1567,4.4542,3.2683,801
-1.0425,-9.7158,0.371,0.9324,-9.7158,1.6451,11.2548,6.2633,802
-2.0851,-9.8014,2.5274,3.4065,-9.8014,3.646,35.7557,33.5961,803
8.0307,-9.7951,12.1667,3.5089,-9.7951,2.1852,39.7536,26.6224,804
-0.7469,-9.6311,0.3658,0.8175,-9.6311,1.9691,26.4215,13.9412,805
-6.8196,-9.7912,-3.4575,2.9847,-9.7912,1.29,28.3011,26.6667,806
-13.2551,-10.0141,5.8817,10.3164,-10.0141,12.9622,31.1948,27.0189,807
-0.905,-9.7397,0.0058,0.2732,-9.7397,1.2272,8.0037,6.0731,808
-0.0733,-9.7963,1.207,1.651,-9.7963,3.4151,18.0589,11.8494,809
-2.0398,-9.784,-0.6384,0.6858,-9.784,1.9913,11.1926,5.9684,810
-0.5436,-9.7303,-0.1216,0.2297,-9.7303,1.1546,10.6494,9.5901,811
-0.1347,-9.7796,0.4249,0.3203,-9.7796,0.7074,16.1747,13.5183,812
-0.713,-9.7392,-0.2019,0.2844,-9.7392,1.0299,19.493,10.7966,813
-0.1215,-9.728,3.1798,3.4506,-9.728,4.9519,22.1664,18.5181,814
-3.3908,-9.7787,0.0821,2.1734,-9.7787,5.3577,15.5313,13.0371,815
-84.1179,-9.643,-14.4539,29.1327,-9.643,12.4819,32.219,14.5307,816
-3.1058,-9.6614,6.7635,7.6821,-9.6614,4.5299,12.2068,5.5599,817
-7.6971,-9.7205,-0.6966,2.7656,-9.7205,3.3406,6.9986,2.6776,818
-3.5799,-9.7237,-1.2568,1.2003,-9.7237,1.5912,5.2196,2.2293,819
-16.3482,-9.7032,-3.6401,5.4672,-9.7032,4.117,9.8468,2.3567,820
0.2555,-9.6339,9.7678,4.9106,-9.6339,3.4542,22.7533,11.9435,821
-16.9083,-9.8348,0.1986,7.732,-9.8348,4.0001,17.0328,13.1491,822
-6.1917,-9.8243,-1.5873,3.952,-9.8243,2.1035,27.7523,20.121,823
-2.5883,-9.916,3.7658,4.4149,-9.916,5.0126,17.2561,7.7107,824
-9.2339,-9.7483,-1.1321,3.7095,-9.7483,1.9079,14.0702,12.2231,825
-5.2618,-9.6042,-1.9223,2.1406,-9.6042,1.4806,9.5539,7.1106,826
-4.0116,-10.7177,-2.136,1.6132,-10.7177,1.5926,11.7274,5.7832,827
-19.2024,-9.5181,1.5169,9.258,-9.5181,9.7858,20.1965,11.4058,828
-10.3332,-9.7799,2.8851,7.1172,-9.7799,8.3209,18.7627,12.4369,829
-0.6672,-9.6886,3.0078,3.6677,-9.6886,7.1889,12.1574,10.0675,830
-6.0738,-9.4909,-0.0923,3.7972,-9.4909,9.4125,20.435,9.8457,831
-9.0567,-9.6071,1.182,6.9986,-9.6071,5.7841,20.2922,18.9812,832
-2.9736,-9.7121,0.6405,2.5723,-9.7121,7.4457,13.5391,8.6107,833
-3.0301,-9.7114,3.3082,6.1383,-9.7114,10.4648,23.4527,11.4329,834
-6.0854,-9.7882,1.643,4.0417,-9.7882,6.9111,18.3032,12.1321,835
2.1365,-9.9512,5.212,3.7737,-9.9512,3.7452,24.3958,18.6186,836
-3.2021,-9.7622,6.3709,8.1743,-9.7622,13.6054,28.7871,17.2763,837
-3.3789,-9.7968,-0.2225,1.8435,-9.7968,7.0256,15.6678,9.6324,838
-1.5768,-9.8824,-0.4074,0.7823,-9.8824,3.1298,6.835,4.9101,839
-10.3971,-9.4961,-0.7105,4.2149,-9.4961,6.8752,18.6469,7.2349,840
-2.4953,-10.0738,-0.622,0.9181,-10.0738,5.4826,12.4741,7.6143,841
-9.922,-9.8068,-1.9825,5.9318,-9.8068,1.8299,17.8466,10.3157,842
-0.9229,-9.9326,0.004,0.6844,-9.9326,1.2713,9.6991,7.3899,843
-9.0926,-9.4613,-0.2629,4.6768,-9.4613,4.8773,21.0021,10.7741,844
-6.9518,-9.5562,-1.0809,3.4847,-9.5562,5.2246,18.1481,13.8599,845
-5.8435,-9.7669,-1.4726,2.174,-9.7669,3.833,9.6635,4.376,846
-4.2698,-9.8728,1.3748,2.4782,-9.8728,2.969,21.4818,12.3115,847
-3.9962,-9.7951,4.6859,6.9516,-9.7951,5.1053,30.3444,26.0732,848
-2.7845,-9.7355,-0.8695,1.46,-9.7355,0.9756,5.9463,3.9842,849
-3.087,-9.801,-0.3319,1.2722,-9.801,3.7364,18.4745,12.6679,850
-1.4031,-9.9175,0.3783,1.9259,-9.9175,7.2674,18.48,13.9188,851
-2.7972,-10.022,5.1749,7.2132,-10.022,8.5411,22.4035,20.7024,852
-3.0752,-10.3073,1.2172,3.7543,-10.3073,11.7687,46.5263,37.8654,853
-3.0805,-9.7781,4.5545,4.002,-9.7781,2.595,24.3031,21.4817,854
-5.0785,-9.8815,-0.5492,2.0717,-9.8815,5.4885,13.0622,7.7483,855
-3.1966,-9.7965,0.8887,2.1852,-9.7965,2.3794,13.4688,8.1959,856
-1.1652,-9.8013,0.3737,0.7919,-9.8013,3.1596,17.186,12.0108,857
-0.3896,-9.8387,-0.0744,0.2141,-9.8387,0.1765,7.385,6.2319,858
-0.3099,-9.6467,0.0802,0.2749,-9.6467,0.3015,3.5998,3.0371,859
-1.1099,-9.8024,-0.264,0.5262,-9.8024,0.7538,14.807,13.8309,860
-3.6657,-9.8729,-0.92,1.9302,-9.8729,3.204,13.0373,6.5132,861
-5.2028,-9.8342,-0.5471,2.6583,-9.8342,1.0979,46.7993,44.1015,862
-12.7667,-9.7537,1.2023,9.9456,-9.7537,4.7233,34.8682,30.5829,863
0.2557,-10.0904,7.0454,6.3826,-10.0904,2.9563,16.4075,13.5585,864
-4.3148,-9.9168,0.1583,4.2367,-9.9168,1.313,14.8303,7.3827,865
-17.4194,-9.6895,-1.9775,5.0791,-9.6895,9.0363,25.794,12.4836,866
-1.4913,-9.7011,-0.5977,0.6545,-9.7011,1.2796,4.4773,3.4322,867
-5.6759,-10.5977,0.259,3.4233,-10.5977,4.2672,33.4494,18.6801,868
-7.9309,-9.6978,-0.5895,4.2466,-9.6978,8.8049,15.2024,10.5813,869
-5.8804,-9.6945,2.6659,7.4403,-9.6945,9.2306,20.328,11.1306,870
-2.7842,-9.8069,0.8615,3.1622,-9.8069,6.8958,17.4549,7.8957,871
-5.7101,-9.7055,0.6494,3.4756,-9.7055,6.0487,11.2793,8.4742,872
-1.4928,-9.6576,2.2962,2.5404,-9.6576,4.6028,10.3027,7.3841,873
-2.453,-9.6893,0.8787,2.4554,-9.6893,2.6024,8.7935,6.6539,874
-6.2891,-9.9309,-0.7763,2.9144,-9.9309,4.6659,9.05,5.6658,875
-9.6741,-9.826,-0.7161,3.3413,-9.826,8.4318,16.7844,10.474,876
-1.1728,-9.8287,3.0514,4.3386,-9.8287,6.753,16.9928,12.3123,877
-0.3202,-9.6339,6.1646,6.5354,-9.6339,4.8171,19.8908,14.2846,878
-0.5088,-9.5704,3.0133,2.8204,-9.5704,5.7836,12.104,10.1032,879
-2.8275,-9.9018,-0.6654,0.9839,-9.9018,5.432,13.6209,10.5378,880
-19.618,-9.8044,-0.6197,7.8649,-9.8044,2.2999,13.8773,10.4599,881
-4.5768,-9.8305,3.8358,5.1388,-9.8305,7.7149,17.5777,11.3746,882
-3.2198,-9.6715,1.3539,4.2692,-9.6715,6.1155,10.8341,8.7888,883
-9.3705,-9.9098,5.2072,9.1869,-9.9098,3.6241,18.0675,16.7547,884
-1.9999,-9.8111,2.1255,3.5388,-9.8111,6.5423,14.3341,9.8681,885
-4.2724,-9.7212,2.2043,4.1703,-9.7212,8.9329,21.727,6.7058,886
-3.9979,-9.7594,0.024,2.5044,-9.7594,4.8469,14.7899,10.3244,887
