AYGX_min,AZ_mean,AYGX_mean,AYGX_std,AZ_mean.1,GX_std,Gnorm_max,Gnorm_median,timestamp
0.0095,-9.9969,0.0122,0.0015,-9.9969,0.0212,0.9931,0.9607,4
0.1135,-9.9969,0.2067,0.1318,-9.9969,0.7153,1.8568,1.3976,5
-407.2914,-9.8992,-32.2543,128.942,-9.8992,25.3316,70.6951,8.0652,6
-231.1483,-9.168,-32.2317,68.4234,-9.168,23.2714,102.0342,59.6187,7
-30.7588,-10.1768,0.8929,9.5251,-10.1768,7.4,12.5423,7.2883,8
