AYGX_min,AZ_mean,AYGX_mean,AYGX_std,AZ_mean,GX_std,Gnorm_max,Gnorm_median,timestamp
-0.0537,-9.7421,-0.0459,0.0027,-9.7421,0.0085,1.6379,1.612,0
-0.0524,-9.7421,-0.0472,0.0026,-9.7421,0.01,1.6442,1.6112,1
-0.052,-9.7417,-0.0474,0.0025,-9.7417,0.009,1.6275,1.6112,3
-0.0533,-9.7416,-0.0469,0.0034,-9.7416,0.0121,1.6297,1.6114,4
-0.0522,-9.7414,-0.0465,0.003,-9.7414,0.0108,1.6362,1.6117,5
-0.0519,-9.7414,-0.0467,0.0026,-9.7414,0.0092,1.6297,1.6116,6
-0.0515,-9.7421,-0.0472,0.0028,-9.7421,0.0101,1.6366,1.6121,7
-0.0522,-9.7413,-0.0477,0.0027,-9.7413,0.0092,1.6373,1.6189,8
-0.0515,-9.7417,-0.046,0.0024,-9.7417,0.0089,1.6288,1.6108,9
-0.0521,-9.7425,-0.0466,0.0031,-9.7425,0.0108,1.63,1.6108,10
-0.1407,-9.7229,0.8289,1.9855,-9.7229,3.0225,12.1002,1.6112,11
-27.1839,-9.6725,-12.9133,11.124,-9.6725,2.0928,19.6258,15.7932,13
-68.9363,-9.3833,-4.2497,37.0093,-9.3833,12.6225,77.8928,32.4292,14
-89.8146,-9.3103,-22.6689,38.8009,-9.3103,11.1073,63.0658,56.2319,16
-45.311,-9.2777,11.3742,18.6735,-9.2777,5.3602,36.6079,17.2928,17
-26.4231,-9.4389,-3.3211,10.8018,-9.4389,4.0965,11.1645,4.8704,18
-152.8506,-9.1444,-52.5564,50.4845,-9.1444,11.7424,31.8415,18.898,19
-40.9339,-8.1711,-15.0078,18.4779,-8.1711,3.4269,7.5687,2.8717,20
26.3986,-8.7634,41.709,15.3835,-8.7634,5.0845,35.2039,9.4951,21
-13.3178,-9.4246,43.5684,40.3739,-9.4246,6.8785,41.8957,38.8294,23
-19.904,-9.7372,-0.6649,6.1079,-9.7372,5.2648,16.2046,9.263,24
-3.2636,-9.7508,-0.0806,2.247,-9.7508,3.0048,9.4592,6.6672,25
-10.8791,-9.5721,-0.3891,5.4596,-9.5721,1.13,19.7333,16.8226,26
-9.7695,-9.7668,-3.1535,3.075,-9.7668,2.7342,28.3131,17.9469,27
-10.6965,-10.0341,16.7492,21.3733,-10.0341,8.3097,40.8183,24.9519,28
-3.842,-9.7784,14.4383,22.1505,-9.7784,7.6138,19.5796,16.7608,29
-0.2778,-9.8854,1.5101,1.5339,-9.8854,3.3897,11.3031,9.0214,30
-1.3431,-9.7292,1.1645,2.0885,-9.7292,3.4584,21.3811,15.0018,31
-4.6037,-9.7404,-0.6174,1.9715,-9.7404,1.1742,11.8617,5.4816,33
-27.926,-9.7419,-3.5148,11.1646,-9.7419,15.3718,55.1802,20.7163,34
-9.9632,-9.4678,1.1498,9.6075,-9.4678,10.9809,19.0297,13.6181,35
-25.727,-9.8336,-8.1998,12.1759,-9.8336,11.619,25.2528,16.772,36
-0.4981,-9.8172,1.0353,1.8162,-9.8172,3.5548,11.621,7.258,37
-7.4985,-9.7209,-1.9792,4.9932,-9.7209,5.5759,22.9908,19.8398,38
-13.2276,-9.6716,-6.6793,4.8264,-9.6716,3.0045,23.3252,20.1515,39
-45.7552,-9.6635,0.7075,19.705,-9.6635,15.1545,31.9843,18.9883,40
-44.4986,-10.5663,-4.2712,28.9008,-10.5663,6.473,49.6675,39.5169,41
-13.4179,-9.4809,6.7709,13.0638,-9.4809,12.3028,30.0848,15.7393,43
-3.2,-9.7827,2.6751,7.3424,-9.7827,5.3951,22.7192,6.9939,44
-0.1274,-9.7948,0.8158,0.8405,-9.7948,1.3366,10.5489,5.3844,45
-24.3562,-9.8605,-4.7658,10.8213,-9.8605,4.5742,19.9489,17.874,46
-20.8486,-9.7265,-2.3236,10.0147,-9.7265,12.5305,22.6684,16.0081,48
-20.7416,-9.7021,0.0906,6.2216,-9.7021,4.7474,19.537,10.2478,50
-24.9976,-9.5601,-4.0907,12.3032,-9.5601,5.8731,22.3906,18.9809,51
-14.1339,-9.9094,-0.1652,8.9703,-9.9094,10.7567,21.4129,11.3854,53
-28.8158,-9.7796,0.3679,8.9498,-9.7796,8.4176,24.5446,10.288,54
-14.7354,-9.7211,2.5224,10.058,-9.7211,6.4813,26.354,23.1672,55
-19.3212,-9.7973,-10.5516,7.9983,-9.7973,4.6987,19.9338,13.7825,56
-17.6955,-9.6885,-7.145,8.4538,-9.6885,5.5738,23.5862,13.6062,57
-2.5153,-9.7371,0.2215,1.6874,-9.7371,2.8588,9.9359,7.0668,58
-1.005,-9.7663,0.1018,0.6378,-9.7663,0.6801,5.0137,3.3204,59
-1.5709,-9.7488,0.3684,1.477,-9.7488,2.8134,14.724,10.9225,60
8.5517,-9.8394,17.7114,5.5177,-9.8394,4.638,24.6304,20.5161,61
-0.4422,-9.9139,0.3079,0.6216,-9.9139,1.6563,16.954,15.8665,63
-4.2459,-9.7143,0.1506,1.952,-9.7143,4.2654,36.7245,20.1867,64
-22.3023,-9.4922,11.5496,21.9426,-9.4922,3.2526,42.5427,35.799,65
-8.9319,-10.0656,4.4607,9.8051,-10.0656,6.4445,24.5182,18.2295,66
-258.1738,-9.0653,-52.0596,75.3096,-9.0653,16.2344,42.3027,24.5341,67
52.7307,-8.9921,77.9739,23.0798,-8.9921,5.1285,31.7222,20.2148,68
-64.3642,-9.0496,-14.8427,34.0315,-9.0496,17.6708,56.4357,51.4603,70
-29.9257,-9.6979,4.1105,13.9482,-9.6979,10.1971,32.5315,14.4801,71
-23.7236,-9.6948,-3.3655,8.7635,-9.6948,8.5814,16.2234,9.9991,72
-44.7994,-9.6217,-6.8151,23.4392,-9.6217,17.449,28.8854,21.8583,73
-32.0756,-9.6935,0.8115,16.4191,-9.6935,12.7548,27.7909,17.9592,74
-30.2343,-9.7656,-12.7839,13.125,-9.7656,10.6345,29.0227,20.3878,76
-63.1452,-9.3062,9.6422,25.5631,-9.3062,8.2079,18.5513,8.8777,77
-1.3678,-9.6713,6.7843,9.1412,-9.6713,4.8829,16.1943,13.4082,78
-0.5442,-9.7682,0.6647,0.8247,-9.7682,1.3999,3.8047,2.5824,79
-1.0914,-9.6956,0.2909,0.821,-9.6956,0.6693,1.9811,1.7439,80
-0.705,-9.6859,-0.3525,0.2072,-9.6859,0.1934,1.6963,1.6193,81
-16.1681,-9.6636,-9.1072,4.6565,-9.6636,1.7873,8.167,7.5571,83
-70.1753,-9.3543,-13.6599,33.8094,-9.3543,20.5686,82.3014,23.8241,84
-1.7696,-9.6737,0.4109,1.6828,-9.6737,1.3055,2.546,1.908,89
-0.3973,-9.6691,0.2687,0.3838,-9.6691,0.3018,1.7368,1.6248,91
-0.2286,-9.672,0.2952,0.4904,-9.672,0.3924,1.8392,1.6014,92
-0.9,-9.6665,-0.5464,0.224,-9.6665,0.1708,1.6631,1.6121,93
-0.4102,-9.6694,0.2495,0.5148,-9.6694,0.4036,1.7725,1.6189,94
-0.0971,-9.6694,0.2217,0.2338,-9.6694,0.1838,1.6874,1.6056,95
0.0274,-9.6698,0.2143,0.114,-9.6698,0.0896,1.6418,1.6055,96
0.0962,-9.6699,0.202,0.073,-9.6699,0.0573,1.6312,1.5942,97
0.1604,-9.6708,0.218,0.0413,-9.6708,0.0325,1.6147,1.5973,98
0.1661,-9.6693,0.2026,0.0351,-9.6693,0.0276,1.6132,1.5991,99
0.172,-9.669,0.2059,0.0168,-9.669,0.0132,1.612,1.5981,100
0.1916,-9.6692,0.2081,0.008,-9.6692,0.0063,1.6199,1.6102,101
0.1868,-9.6681,0.2038,0.0168,-9.6681,0.0133,1.6085,1.5931,102
0.1718,-9.669,0.1999,0.021,-9.669,0.0164,1.61,1.5917,103
0.1761,-9.6684,0.2063,0.0209,-9.6684,0.0163,1.6223,1.6015,105
0.1833,-9.6702,0.2046,0.0182,-9.6702,0.0141,1.6014,1.5832,106
0.1662,-9.6701,0.1952,0.025,-9.6701,0.0195,1.6022,1.5932,107
0.16,-9.6693,0.2061,0.0226,-9.6693,0.0177,1.6197,1.5932,108
0.1624,-9.6703,0.208,0.0188,-9.6703,0.0147,1.6187,1.6,109
0.1723,-9.6697,0.2043,0.0143,-9.6697,0.0112,1.6101,1.5886,110
0.1722,-9.6693,0.2041,0.0136,-9.6693,0.0105,1.6112,1.5925,111
0.1739,-9.6693,0.1999,0.0153,-9.6693,0.0119,1.6096,1.5915,112
0.1871,-9.6685,0.2052,0.0099,-9.6685,0.0076,1.6187,1.5842,113
0.1851,-9.6696,0.2058,0.0165,-9.6696,0.0129,1.6092,1.5841,114
0.1719,-9.6703,0.2012,0.015,-9.6703,0.0116,1.6034,1.5919,115
0.1855,-9.6701,0.21,0.0153,-9.6701,0.0118,1.6027,1.5852,116
0.1877,-9.6696,0.2056,0.0151,-9.6696,0.0118,1.6015,1.5912,117
0.1779,-9.6694,0.1949,0.0142,-9.6694,0.0113,1.6027,1.5994,118
0.1698,-9.6704,0.1978,0.0148,-9.6704,0.0115,1.6169,1.5971,119
0.1815,-9.6686,0.2046,0.0118,-9.6686,0.0092,1.6015,1.584,120
0.1756,-9.6703,0.2031,0.0119,-9.6703,0.0092,1.6101,1.5924,121
0.1782,-9.6697,0.1943,0.0138,-9.6697,0.0108,1.6109,1.5957,122
0.1667,-9.6706,0.1977,0.0211,-9.6706,0.0167,1.6205,1.5904,123
0.1812,-9.6686,0.2022,0.013,-9.6686,0.01,1.6189,1.591,124
0.1759,-9.6696,0.1955,0.0136,-9.6696,0.0107,1.6014,1.576,125
0.1916,-9.6695,0.2148,0.0186,-9.6695,0.0145,1.6134,1.5932,126
0.1856,-9.669,0.1985,0.0082,-9.669,0.0065,1.5928,1.5796,127
0.1952,-9.6702,0.2112,0.0114,-9.6702,0.0089,1.595,1.5924,128
0.1971,-9.6703,0.206,0.0085,-9.6703,0.0066,1.5927,1.5799,129
0.1815,-9.6699,0.2023,0.0117,-9.6699,0.0092,1.6007,1.5802,130
0.1812,-9.6692,0.1967,0.0096,-9.6692,0.0073,1.6102,1.5879,131
0.1757,-9.6684,0.193,0.013,-9.6684,0.0103,1.6014,1.587,132
0.1955,-9.6674,0.2047,0.0067,-9.6674,0.0051,1.6009,1.5884,133
0.1834,-9.6694,0.2071,0.013,-9.6694,0.0101,1.6101,1.5849,134
0.1878,-9.6684,0.2059,0.0096,-9.6684,0.0074,1.6023,1.5884,135
0.1583,-9.6674,0.1904,0.0184,-9.6674,0.0143,1.5919,1.5835,136
0.1661,-9.6678,0.2091,0.0252,-9.6678,0.0196,1.6027,1.591,137
0.176,-9.6699,0.2043,0.0185,-9.6699,0.0144,1.6025,1.5918,138
0.1856,-9.6681,0.1969,0.0062,-9.6681,0.0048,1.5925,1.5754,139
0.1819,-9.6681,0.2145,0.0197,-9.6681,0.0153,1.6018,1.5839,140
0.1871,-9.6683,0.2066,0.0126,-9.6683,0.0098,1.5952,1.5846,141
0.1888,-9.6692,0.2032,0.0116,-9.6692,0.0088,1.6012,1.5711,142
0.1736,-9.6675,0.2011,0.0167,-9.6675,0.0129,1.6101,1.5841,143
0.1718,-9.6688,0.2018,0.0133,-9.6688,0.0103,1.6013,1.5832,144
0.1704,-9.6674,0.2004,0.0175,-9.6674,0.0136,1.595,1.5832,145
0.1849,-9.6683,0.202,0.0118,-9.6683,0.0091,1.6015,1.5832,146
0.1784,-9.6682,0.196,0.0112,-9.6682,0.0088,1.5936,1.5823,147
0.1849,-9.6692,0.2035,0.0143,-9.6692,0.0109,1.5943,1.5792,148
0.1663,-9.6685,0.1926,0.0178,-9.6685,0.0138,1.6023,1.5916,149
0.1813,-9.6688,0.2055,0.0158,-9.6688,0.0122,1.6007,1.5811,150
0.1719,-9.6694,0.2006,0.0157,-9.6694,0.012,1.6091,1.5851,151
0.1624,-9.6702,0.1966,0.0237,-9.6702,0.0185,1.6102,1.5879,152
0.1627,-9.6699,0.1949,0.0146,-9.6699,0.0114,1.6174,1.5924,153
0.1753,-9.6697,0.1969,0.012,-9.6697,0.0093,1.6005,1.583,154
0.166,-9.6697,0.2004,0.0136,-9.6697,0.0106,1.6025,1.5841,155
0.1715,-9.6699,0.1886,0.0087,-9.6699,0.0068,1.6094,1.5873,156
0.1606,-9.6705,0.2006,0.0179,-9.6705,0.0139,1.6091,1.5832,157
0.1815,-9.6701,0.2009,0.0124,-9.6701,0.0097,1.6087,1.5833,158
0.1642,-9.6702,0.2017,0.0157,-9.6702,0.0122,1.6025,1.5844,159
0.172,-9.6704,0.1962,0.0131,-9.6704,0.0102,1.6094,1.5841,160
0.1642,-9.6703,0.1902,0.0136,-9.6703,0.0105,1.6169,1.5824,161
0.1664,-9.6714,0.1969,0.0148,-9.6714,0.0115,1.6094,1.5759,162
0.1699,-9.6707,0.196,0.0151,-9.6707,0.0118,1.5995,1.5756,163
0.1605,-9.6699,0.1956,0.0151,-9.6699,0.0118,1.61,1.5835,164
0.1661,-9.6693,0.1996,0.0149,-9.6693,0.0116,1.5938,1.5772,165
0.1702,-9.67,0.1958,0.0149,-9.67,0.0115,1.6009,1.5904,166
0.1716,-9.6704,0.1987,0.0129,-9.6704,0.01,1.6003,1.5753,167
0.1619,-9.67,0.1893,0.0173,-9.67,0.0133,1.6068,1.5789,168
0.1663,-9.6698,0.1977,0.0125,-9.6698,0.0098,1.6018,1.5837,169
0.1815,-9.6671,0.2064,0.0143,-9.6671,0.0112,1.5998,1.5914,170
0.1774,-9.6696,0.1992,0.0135,-9.6696,0.0104,1.6034,1.5836,171
0.1717,-9.6685,0.1859,0.0127,-9.6685,0.0098,1.5911,1.5743,172
0.1659,-9.669,0.1908,0.0102,-9.669,0.0079,1.5927,1.5745,173
0.1815,-9.6692,0.2006,0.0114,-9.6692,0.0088,1.6101,1.584,174
0.1625,-9.6692,0.197,0.0163,-9.6692,0.0127,1.6018,1.5828,175
0.1701,-9.6689,0.1954,0.012,-9.6689,0.0093,1.6087,1.5835,176
0.1814,-9.6688,0.198,0.011,-9.6688,0.0085,1.6098,1.5836,177
0.1838,-9.6685,0.1971,0.0094,-9.6685,0.0072,1.6021,1.5841,178
0.1644,-9.6711,0.1988,0.018,-9.6711,0.0141,1.6004,1.5834,179
0.1875,-9.6702,0.2044,0.0115,-9.6702,0.0088,1.594,1.5834,180
0.1699,-9.67,0.1953,0.0156,-9.67,0.0122,1.6032,1.5794,181
0.1855,-9.6686,0.2036,0.016,-9.6686,0.0123,1.6004,1.5838,182
0.1723,-9.668,0.196,0.0153,-9.668,0.0118,1.594,1.5822,183
0.1618,-9.6692,0.1918,0.0154,-9.6692,0.012,1.5918,1.5791,184
0.1665,-9.6681,0.1928,0.012,-9.6681,0.0093,1.6023,1.5742,185
0.1718,-9.669,0.1914,0.0107,-9.669,0.0083,1.5919,1.5753,186
0.1818,-9.6688,0.2005,0.0095,-9.6688,0.0073,1.5927,1.5748,187
0.1836,-9.6691,0.2102,0.0141,-9.6691,0.011,1.5766,1.568,188
0.1833,-9.668,0.2043,0.0177,-9.668,0.0141,1.594,1.5753,189
0.1566,-9.6694,0.1887,0.0242,-9.6694,0.019,1.5849,1.5705,190
0.1881,-9.6692,0.2051,0.0106,-9.6692,0.0083,1.5933,1.5794,191
0.1777,-9.6683,0.1976,0.0131,-9.6683,0.01,1.5851,1.575,192
0.1723,-9.6692,0.1982,0.0151,-9.6692,0.0117,1.5995,1.5744,193
0.1643,-9.6694,0.1965,0.0144,-9.6694,0.0112,1.6025,1.5792,194
0.1646,-9.6694,0.194,0.0142,-9.6694,0.0111,1.5931,1.5751,195
0.178,-9.6692,0.1932,0.0129,-9.6692,0.0101,1.5909,1.5748,196
0.1544,-9.6692,0.1915,0.0193,-9.6692,0.015,1.5857,1.567,197
0.1797,-9.671,0.1966,0.0118,-9.671,0.009,1.5742,1.5661,198
0.1663,-9.669,0.1939,0.0175,-9.669,0.0135,1.5938,1.5753,199
0.1918,-9.6687,0.2059,0.0134,-9.6687,0.0105,1.5838,1.5728,200
0.1756,-9.67,0.1948,0.0112,-9.67,0.0087,1.5928,1.5705,201
0.1763,-9.669,0.1935,0.0102,-9.669,0.008,1.5927,1.5745,202
0.155,-9.6703,0.1962,0.0233,-9.6703,0.0181,1.5924,1.5773,203
0.1706,-9.6699,0.1864,0.0142,-9.6699,0.0108,1.5838,1.573,204
0.1456,-9.6696,0.1918,0.0174,-9.6696,0.0137,1.6,1.5743,206
0.167,-9.6693,0.1924,0.0129,-9.6693,0.0101,1.6014,1.5825,207
0.1416,-9.6689,0.196,0.0204,-9.6689,0.0159,1.5909,1.5706,208
0.1698,-9.6696,0.1936,0.0132,-9.6696,0.0102,1.5922,1.5745,209
0.1697,-9.6701,0.1889,0.0142,-9.6701,0.0109,1.5934,1.5645,210
0.1886,-9.67,0.2025,0.0086,-9.67,0.0067,1.6025,1.5791,214
0.1625,-9.6698,0.1936,0.0112,-9.6698,0.0087,1.5922,1.5671,215
0.1567,-9.6698,0.1875,0.0139,-9.6698,0.0108,1.5909,1.5743,216
0.163,-9.6686,0.1934,0.0141,-9.6686,0.0109,1.5918,1.5745,217
0.1662,-9.6689,0.1919,0.0116,-9.6689,0.0089,1.5832,1.5665,218
0.1649,-9.6691,0.1916,0.0114,-9.6691,0.0088,1.5925,1.5746,219
0.1768,-9.6682,0.2034,0.0141,-9.6682,0.011,1.5759,1.5654,220
0.1668,-9.6681,0.1955,0.0189,-9.6681,0.0147,1.5853,1.5701,221
0.1627,-9.6691,0.189,0.0167,-9.6691,0.013,1.5824,1.5699,222
-6.639,-9.6748,-2.7114,1.8668,-9.6748,0.848,3.9819,3.0809,223
-27.7775,-9.7365,0.9478,7.1543,-9.7365,7.953,24.9728,5.8974,225
-1.1141,-9.514,2.3883,2.3148,-9.514,3.2099,10.1103,6.1318,226
-6.0907,-9.78,-0.8274,2.2218,-9.78,2.1753,8.9031,6.5067,227
-16.1261,-9.5548,-4.7507,5.2693,-9.5548,3.373,23.1664,17.228,228
-111.7884,-8.8013,-89.8793,13.1545,-8.8013,3.8798,24.2075,20.9484,229
-16.3793,-8.9663,15.7168,21.118,-8.9663,5.1955,19.9286,6.9243,230
14.0664,-9.7812,27.6009,10.8784,-9.7812,3.659,52.1217,33.4641,231
-0.2283,-9.7919,2.1883,3.0891,-9.7919,3.1256,17.7676,16.1628,232
-21.8389,-9.7459,1.9016,9.3102,-9.7459,6.7192,34.8165,14.3645,234
-1.6529,-9.6665,0.2279,1.1129,-9.6665,1.3337,7.3303,5.3873,235
-5.6753,-10.147,0.0708,3.6996,-10.147,3.6727,46.8317,44.4947,236
-17.1382,-9.6086,-2.5842,12.5394,-9.6086,6.4202,39.3013,32.4686,237
-2.4667,-9.4739,0.3045,1.3308,-9.4739,1.2195,9.1714,5.8404,238
-10.1095,-9.8152,-0.0817,6.1815,-9.8152,2.5853,16.6954,15.0493,239
-4.7115,-9.8035,-0.7713,1.9818,-9.8035,6.016,14.5836,10.1759,240
-2.3374,-9.7813,0.2204,1.4097,-9.7813,3.4407,10.6347,7.2676,241
-1.106,-9.7818,-0.2099,0.4744,-9.7818,1.2422,9.4594,7.1171,242
-2.822,-9.6858,1.4153,3.1887,-9.6858,4.4053,16.5245,7.9282,244
-1.1009,-9.6149,-0.4389,0.4557,-9.6149,2.9903,14.031,11.0988,245
-0.7953,-9.9256,0.0189,0.4245,-9.9256,2.3135,8.7364,6.396,246
-0.958,-9.5781,0.8554,2.3764,-9.5781,3.7558,12.8772,12.1701,247
-0.7247,-10.1191,0.3487,0.8549,-10.1191,0.988,10.0388,5.4733,248
-0.7412,-9.9998,-0.2284,0.3427,-9.9998,1.5484,8.7978,4.8567,249
-0.4319,-9.6239,0.6897,1.7201,-9.6239,3.7853,13.6261,12.1828,251
-2.6878,-9.6054,-1.0982,1.1253,-9.6054,1.866,9.2919,5.9088,252
-19.8271,-9.8518,3.6053,14.8196,-9.8518,11.2635,29.4941,17.7358,254
-6.6337,-9.3715,-1.6447,4.6696,-9.3715,4.428,27.1155,13.3964,255
0.0259,-9.5071,2.8408,2.5404,-9.5071,5.9414,15.1588,5.0637,256
0.1628,-9.6055,1.4842,1.0764,-9.6055,0.7081,14.9217,12.3936,257
-6.2258,-9.7806,-0.052,3.7824,-9.7806,2.1137,18.8971,16.5767,258
-1.0918,-9.5298,0.5934,1.4722,-9.5298,1.0872,9.8918,8.4121,259
-1.5849,-9.4144,0.0222,0.836,-9.4144,1.0664,12.5275,11.3178,260
-11.5059,-9.7014,-0.522,6.9761,-9.7014,5.2832,17.0769,10.5948,261
-6.5966,-9.6804,0.2451,3.4921,-9.6804,6.3412,12.979,8.1835,264
-0.599,-9.9487,2.2046,1.6779,-9.9487,3.328,10.1725,7.4541,265
-0.6665,-9.8625,-0.027,0.2768,-9.8625,0.6627,5.5081,3.1875,266
-2.9619,-9.8766,0.9557,2.1745,-9.8766,1.3327,10.3101,8.7239,267
-1.4872,-9.7098,0.8036,1.8423,-9.7098,1.7441,9.8548,8.4381,268
0.0932,-9.9096,0.9178,0.7826,-9.9096,2.0283,26.6338,21.5023,269
-9.5421,-9.8445,2.3269,9.8264,-9.8445,4.4664,31.0501,26.2276,270
-4.677,-9.9074,2.6208,5.4859,-9.9074,8.3334,30.2854,14.4064,271
-2.8623,-9.7927,12.2429,15.0095,-9.7927,10.543,33.8753,23.5432,273
-24.5647,-9.7512,-0.9547,8.1771,-9.7512,6.9432,22.1091,12.0548,274
-11.2157,-9.8694,-2.1488,4.8976,-9.8694,2.7273,17.207,12.5456,275
-3.5379,-9.65,-0.2364,2.2017,-9.65,3.466,8.0731,5.6263,276
-0.1589,-9.8706,5.4703,8.1659,-9.8706,5.1066,16.9321,14.2424,277
-11.4011,-9.56,-1.2885,5.4866,-9.56,2.4423,16.4481,11.1623,278
-1.2931,-9.8753,1.221,2.4384,-9.8753,1.9289,8.0359,5.4874,279
-7.8784,-9.7508,-0.852,3.0096,-9.7508,3.4844,9.0489,6.6476,280
-0.556,-9.7343,0.67,0.8008,-9.7343,2.9188,8.8919,6.1431,281
-5.3927,-9.7874,2.0704,3.8531,-9.7874,2.15,11.9393,9.9733,283
-4.2752,-9.7429,3.7486,7.7122,-9.7429,7.2897,23.093,13.3527,284
-0.9421,-9.7726,1.4091,2.4187,-9.7726,3.8917,21.937,21.1026,285
-1.0792,-9.9009,-0.2114,0.8212,-9.9009,1.3737,11.515,10.9826,286
-0.2058,-9.7596,1.0048,0.7778,-9.7596,0.9681,11.1293,8.7639,287
-0.1539,-9.7554,0.0178,0.1143,-9.7554,0.3933,14.0126,11.4125,288
-0.8493,-9.7512,4.5594,4.4958,-9.7512,4.1795,18.1839,13.9792,289
-5.8947,-9.7587,-0.1845,1.9307,-9.7587,2.9158,10.5618,3.0322,290
-13.6587,-9.6994,-3.5674,8.8034,-9.6994,7.008,11.2403,7.8081,291
-16.5048,-9.4756,-0.5086,8.4987,-9.4756,3.4117,7.1884,3.3902,292
-5.4309,-9.5665,4.7221,5.9829,-9.5665,2.9703,6.3575,3.7856,294
-0.0816,-9.5651,1.8211,1.0595,-9.5651,0.575,2.3458,1.894,295
-1.0301,-9.5772,-0.5385,0.365,-9.5772,0.186,1.6522,1.6113,296
-3.0346,-9.5576,-0.7801,1.5118,-9.5576,0.7369,2.0881,1.6541,297
0.9468,-9.61,1.3836,0.5076,-9.61,0.2881,1.9252,1.7423,298
-2.4395,-9.5826,-1.4906,0.6626,-9.5826,0.326,2.0015,1.7507,299
3.3196,-9.5941,4.1077,0.5293,-9.5941,0.2194,2.9459,2.8069,300
-2.683,-9.622,-1.1188,1.2475,-9.622,0.7278,2.1553,1.6798,301
-2.4499,-9.6004,-2.025,0.3327,-9.6004,0.1638,1.9872,1.8645,303
-1.3186,-9.5695,-0.1171,0.5295,-9.5695,0.2663,1.6724,1.553,304
-0.195,-9.5573,-0.1387,0.0428,-9.5573,0.0213,1.5521,1.5269,305
1.7664,-9.5682,2.0506,0.259,-9.5682,0.1393,1.9726,1.8689,306
1.6149,-9.599,1.9313,0.2782,-9.599,0.163,2.104,1.9017,307
-0.6922,-9.6058,-0.5882,0.0649,-9.6058,0.0373,1.5904,1.569,308
-4.9434,-9.6194,1.3845,3.8823,-9.6194,2.2601,3.982,2.9467,309
-1.8968,-9.9051,1.7348,4.6051,-9.9051,2.5684,6.707,5.4404,310
-14.167,-9.846,22.2136,30.2804,-9.846,12.6142,63.6158,34.9957,311
2.0877,-9.5727,19.3555,8.9036,-9.5727,4.0941,32.2079,20.1016,313
-15.0315,-9.8024,-0.1071,6.2046,-9.8024,8.2607,23.8244,10.9365,314
-0.5324,-9.7787,-0.1943,0.3849,-9.7787,1.3219,6.5156,5.6631,315
-0.4036,-9.8397,0.2222,0.4836,-9.8397,2.8576,14.9198,13.4522,316
-0.4574,-9.8087,0.0424,0.1907,-9.8087,0.5816,3.6656,3.1258,317
-0.9149,-9.7515,0.1475,0.6253,-9.7515,0.5331,3.9453,2.999,318
-1.0796,-9.6034,13.3977,8.0899,-9.6034,3.5671,21.1702,18.6064,319
-4.5191,-9.7187,-0.891,2.1053,-9.7187,3.0806,14.4905,9.1159,320
-2.0507,-9.7196,1.343,2.2422,-9.7196,3.6907,14.9412,10.5944,321
-4.1522,-9.6822,0.4773,3.69,-9.6822,2.147,11.3295,5.6929,323
-8.3264,-9.7143,1.2604,5.8815,-9.7143,5.3831,12.8858,8.1357,324
-0.9583,-9.7797,1.2281,1.7244,-9.7797,4.5236,10.8519,3.9708,325
-1.6451,-9.8469,0.7817,2.0189,-9.8469,1.7628,8.4531,6.2433,326
-0.5227,-9.6749,0.1131,0.3747,-9.6749,0.6467,3.7629,2.3655,327
-0.3119,-9.5925,0.1031,0.2661,-9.5925,0.5035,5.1017,2.9647,328
-0.6231,-9.6991,0.4873,0.8767,-9.6991,1.6315,6.5576,5.6181,329
-1.4804,-9.8813,1.3644,1.7697,-9.8813,1.2579,9.8887,7.9302,330
-2.0557,-9.8,0.2069,0.9718,-9.8,0.9655,6.6437,5.686,331
-0.4635,-9.7577,0.569,0.7244,-9.7577,0.6594,7.4938,6.7701,333
-1.8509,-9.761,0.0628,0.5217,-9.761,1.3291,10.4457,4.0171,334
-0.2538,-9.7045,0.2689,0.5904,-9.7045,0.583,9.6772,7.5856,335
-0.1772,-10.127,0.174,0.5074,-10.127,1.9224,6.5276,4.1699,336
-0.6599,-9.6819,0.6623,0.7095,-9.6819,1.7731,9.3463,6.0204,337
-0.6448,-9.8162,0.8056,1.2217,-9.8162,2.5859,22.5412,21.3463,338
-2.7969,-9.7598,1.0037,2.351,-9.7598,2.7839,17.5635,9.7904,339
-7.6055,-9.7848,-0.0365,4.0534,-9.7848,4.2959,9.0197,7.1193,340
-7.1052,-9.8248,-1.585,2.6491,-9.8248,2.9027,19.7946,12.2681,341
-20.0156,-9.8816,-2.7756,7.87,-9.8816,2.8279,14.2021,9.3388,343
-12.3304,-9.9823,0.9057,6.1072,-9.9823,7.7686,25.6818,14.1229,344
-13.52,-9.6812,-3.4475,4.849,-9.6812,8.1722,26.8754,13.964,345
-7.3581,-9.9022,-0.6252,3.4833,-9.9022,1.2363,9.4565,5.8697,346
-7.1436,-9.6867,-2.8206,3.7152,-9.6867,2.4945,14.7162,11.5583,347
-8.0993,-9.8764,-1.8823,3.415,-9.8764,1.0277,14.9445,10.8758,348
-13.9769,-9.803,-1.8126,10.6568,-9.803,3.9631,22.962,19.2334,349
-15.0255,-9.6744,-2.7805,5.5826,-9.6744,10.2318,19.7141,15.0803,350
-10.8824,-9.8059,-3.1583,5.175,-9.8059,7.1032,17.3728,12.8002,351
-17.6385,-9.1589,3.7185,27.6327,-9.1589,9.9751,47.1703,44.674,352
-15.1709,-9.9023,-0.859,4.3301,-9.9023,5.8573,19.2473,11.0409,354
-4.6947,-9.0899,0.7715,3.9088,-9.0899,4.6018,15.96,8.2932,355
-1.9367,-9.6448,0.2505,1.1309,-9.6448,1.425,6.8306,5.6832,356
-3.1609,-9.5097,0.7819,3.2432,-9.5097,1.343,10.1541,8.5251,357
0.4077,-9.8837,7.058,7.003,-9.8837,3.8017,14.4917,10.4193,358
-8.4119,-9.8858,-1.2015,3.0858,-9.8858,4.4716,13.6023,8.0248,359
-1.301,-9.7412,0.0656,0.5997,-9.7412,1.5703,11.9986,5.941,364
-0.4088,-9.5722,2.123,2.2621,-9.5722,4.5246,15.5441,14.7639,365
-21.8235,-9.6432,-1.2367,8.2481,-9.6432,4.8249,28.7187,13.7972,369
-11.5542,-9.8043,-0.0522,5.9342,-9.8043,8.6445,22.687,14.5016,370
-5.0773,-9.5248,-2.7254,2.1063,-9.5248,1.8281,9.6902,7.6097,371
-14.9241,-10.0321,-0.4225,5.8036,-10.0321,11.1346,28.2011,15.8399,373
-10.06,-9.7887,-0.4049,5.7532,-9.7887,8.4617,20.4122,10.2426,374
-8.0573,-9.6625,-2.7285,3.1192,-9.6625,5.8674,13.7494,11.2215,375
-7.7945,-9.7118,-2.588,3.4093,-9.7118,6.1629,14.2614,8.323,376
-0.8879,-9.6062,9.7966,10.5517,-9.6062,2.9782,17.0783,15.5519,377
-0.1451,-9.7828,1.2718,1.1901,-9.7828,2.4495,10.4377,8.0864,378
-1.0365,-10.2645,0.3827,1.2311,-10.2645,2.8797,13.8999,9.8215,379
-9.1318,-9.7657,-3.3196,4.2552,-9.7657,6.4553,21.8581,17.4879,380
-0.6963,-9.8139,1.5133,1.4662,-9.8139,2.1836,8.5063,7.7707,381
0.2455,-9.7049,3.4375,3.154,-9.7049,6.0232,14.7789,12.8474,383
-16.3924,-9.7764,0.8253,5.5871,-9.7764,8.5157,17.5608,10.9403,384
-6.4401,-9.5565,-0.1358,6.0441,-9.5565,3.9037,21.1904,18.5857,385
-8.1322,-9.7725,-1.4789,3.3894,-9.7725,4.6426,8.64,6.0,386
-3.6854,-9.5489,-0.0738,2.3087,-9.5489,3.1259,6.5322,5.7798,387
-4.3462,-9.7285,1.8126,4.5953,-9.7285,2.7381,9.5323,6.7279,388
-8.7198,-9.9916,-3.7777,3.7381,-9.9916,1.3183,11.7524,10.7537,389
-3.8186,-9.5358,0.1149,4.3055,-9.5358,8.1826,21.2384,11.4775,390
-9.8726,-9.7207,-0.7758,3.3503,-9.7207,3.6779,19.1073,7.86,391
-1.2202,-9.7369,0.6088,1.1978,-9.7369,4.7299,17.0591,9.4079,394
-3.1737,-9.6776,-0.0501,1.1278,-9.6776,2.491,18.8327,11.251,395
-0.428,-9.9477,-0.0698,0.1952,-9.9477,2.003,5.895,3.6385,396
-14.1614,-9.9189,2.0068,10.4811,-9.9189,3.0576,27.5593,23.6592,397
0.3982,-10.2361,11.8801,12.9487,-10.2361,11.0025,52.6535,20.456,398
-8.9799,-9.8744,-3.9723,4.783,-9.8744,1.6239,26.2129,24.5981,399
-9.5885,-9.7175,-2.7899,3.5461,-9.7175,7.8995,19.3563,13.9367,400
-11.4422,-9.7739,-3.0094,4.8789,-9.7739,4.8827,17.8997,12.8282,401
-9.6391,-9.8173,-2.7783,4.7564,-9.8173,1.3091,17.4952,12.5357,403
-16.1025,-9.7511,-0.6535,7.8503,-9.7511,11.2776,38.7263,18.3113,404
-2.7357,-9.7997,0.4165,1.9271,-9.7997,2.1764,9.6735,7.2256,405
-6.3988,-10.035,-1.615,2.5423,-10.035,3.2347,8.7894,6.5106,406
-18.1115,-9.8358,-4.4529,6.7042,-9.8358,3.6825,21.0726,17.9613,407
-5.6196,-9.7531,-1.6323,1.997,-9.7531,0.6471,9.9946,6.6346,408
-3.0259,-9.6747,-0.6899,1.4114,-9.6747,3.3509,7.5141,6.4309,409
-4.0013,-9.7448,-0.7195,1.3221,-9.7448,2.2597,13.0415,5.5526,410
-0.656,-9.732,0.6816,0.9735,-9.732,1.8818,9.1878,6.4469,411
-0.6049,-9.7208,0.084,0.3115,-9.7208,2.321,11.8955,7.4557,413
-1.2428,-9.7538,0.9624,0.8615,-9.7538,4.1001,19.7924,15.1982,414
-0.1698,-10.0096,0.0994,0.2369,-10.0096,0.581,20.7494,19.0724,415
-0.4443,-9.5699,-0.1921,0.2086,-9.5699,0.7712,21.3324,19.0096,416
-0.5052,-9.6995,-0.0825,0.3737,-9.6995,0.8133,21.7603,20.3394,417
-4.9532,-9.709,-0.8125,2.1832,-9.709,2.3276,18.88,16.2665,418
-2.7462,-9.5225,0.1118,1.5388,-9.5225,1.7771,10.3431,6.9413,419
-3.5714,-9.8529,1.223,2.6836,-9.8529,4.5351,17.7375,12.849,420
-2.692,-9.82,-0.0334,2.1901,-9.82,2.3391,13.7391,10.13,421
-25.405,-9.8251,2.0197,9.6267,-9.8251,8.1846,58.4404,19.5317,424
-12.0361,-9.4869,7.4342,12.2123,-9.4869,2.7435,41.1265,18.7407,425
-1.5853,-9.7467,2.0148,2.7656,-9.7467,3.62,11.1703,7.7583,426
-2.6275,-9.6065,0.5071,2.1765,-9.6065,2.0516,22.1985,17.4064,427
-5.2141,-9.7421,4.8844,8.8709,-9.7421,4.0782,38.4266,14.3139,428
-11.9362,-9.6274,-6.8089,3.4937,-9.6274,4.1668,19.2953,11.382,429
-11.975,-9.3062,4.9361,9.381,-9.3062,2.982,5.0147,3.923,431
-8.5857,-9.6061,-0.2354,4.5223,-9.6061,2.5944,5.6438,2.2809,432
-7.6545,-9.5549,-3.3693,3.2673,-9.5549,1.4889,4.0533,3.0482,433
-18.3111,-9.6424,14.9548,16.5415,-9.6424,7.0967,28.1025,13.7282,434
-8.5342,-9.6827,-3.9773,3.8101,-9.6827,2.7522,15.8203,12.2188,435
-124.0611,-9.2553,10.7203,80.3622,-9.2553,22.5762,44.9621,26.9898,437
-63.4974,-9.4309,-2.3229,18.1704,-9.4309,11.0743,40.3162,13.7431,438
-174.1049,-8.9672,18.2912,91.3812,-8.9672,21.5614,76.5055,35.9037,439
-176.9819,-9.7149,-8.544,79.0534,-9.7149,20.768,57.4726,34.7752,440
-31.8206,-9.5604,-19.9399,13.2036,-9.5604,2.8166,22.7353,15.7722,441
-26.7049,-9.4653,4.1825,14.9163,-9.4653,5.3859,15.7486,12.0248,443
-5.1051,-9.7305,3.2899,5.1206,-9.7305,5.7415,41.2459,17.6498,444
-49.4798,-9.6177,-6.1165,22.5513,-9.6177,4.8801,38.5459,27.8658,445
-3.0252,-10.0033,1.0747,3.5323,-10.0033,7.8325,72.5683,62.4238,446
-1.9787,-9.7327,0.6434,2.0534,-9.7327,2.5696,23.3123,22.0247,447
-0.4377,-9.6024,1.5373,1.8882,-9.6024,1.5867,37.4349,32.994,448
-7.3526,-10.0649,-0.652,3.1681,-10.0649,4.519,49.0682,44.8983,449
-0.714,-9.768,0.5893,1.0518,-9.768,1.0638,23.7679,17.5341,450
-0.2899,-9.5781,1.0699,1.0317,-9.5781,1.153,5.8386,4.6971,451
-2.4474,-9.8965,3.9547,4.6628,-9.8965,1.1192,27.1521,22.7131,453
-5.0179,-9.7344,0.8633,2.6884,-9.7344,7.575,18.5257,12.462,454
-5.8266,-9.5936,-1.5913,2.3633,-9.5936,2.9074,6.7073,5.0044,455
-0.3938,-9.9177,-0.0225,0.1824,-9.9177,0.6228,15.1135,11.7256,456
-0.8083,-9.8126,5.0618,5.0541,-9.8126,5.5752,20.7381,17.0006,457
-4.3658,-9.6832,-0.2396,2.5632,-9.6832,2.3575,13.1187,12.4597,458
-9.6156,-9.1314,-2.673,3.4313,-9.1314,4.8899,13.3392,8.4019,459
-3.8033,-9.7009,-1.2406,1.7773,-9.7009,4.987,21.3598,14.5042,460
-3.0025,-9.6985,-1.3241,0.955,-9.6985,0.9379,6.1863,4.4629,463
-9.3725,-9.6106,-2.4424,4.0409,-9.6106,3.2075,14.3141,12.2997,466
-3.8261,-9.8198,-0.9204,2.4856,-9.8198,4.5009,9.1348,4.3721,467
-6.288,-9.807,-3.2806,2.3827,-9.807,3.515,9.9688,5.6022,468
-11.1659,-9.6089,-0.6505,4.7245,-9.6089,7.7409,14.5007,12.3961,469
-9.7483,-9.7342,26.4618,26.6851,-9.7342,16.2311,30.6258,23.2887,470
-16.2526,-9.7993,12.8978,17.5514,-9.7993,4.3801,23.8174,12.2914,471
-12.0649,-9.8252,2.5431,8.083,-9.8252,9.8448,30.1872,15.6529,473
-12.5086,-9.7538,1.8804,6.0942,-9.7538,6.1986,23.0299,8.4676,474
-0.8344,-9.9817,0.4514,0.6737,-9.9817,2.9438,8.6953,5.4913,475
-0.2088,-9.978,-0.0474,0.1217,-9.978,0.6919,12.8276,4.2606,476
-8.8512,-10.0438,-1.5283,5.2598,-10.0438,1.474,15.6707,7.083,477
-13.3031,-9.7817,-2.0755,7.7007,-9.7817,2.2968,17.2422,16.8615,478
-11.2667,-9.7566,0.6734,7.8869,-9.7566,4.1778,15.865,12.2532,479
-17.9097,-9.7142,-3.8162,7.9899,-9.7142,3.1511,22.3002,11.1437,480
-11.6867,-9.7431,-2.3211,5.3765,-9.7431,6.4649,17.2932,15.0231,481
-8.1343,-9.528,0.3966,5.8277,-9.528,12.6458,30.5274,18.4953,483
-18.4887,-9.7821,-0.478,7.5744,-9.7821,7.9637,33.4819,14.4095,484
-12.7741,-9.7443,-2.6302,7.9515,-9.7443,2.1405,36.5021,32.8716,485
-4.3284,-9.7795,-2.9752,1.3998,-9.7795,0.9721,12.1718,9.19,486
-1.5884,-9.8106,0.8894,1.8111,-9.8106,3.0333,19.2265,14.0765,487
-1.6061,-9.6381,-0.2789,0.5817,-9.6381,1.2599,22.0148,20.498,488
-1.7214,-8.9898,4.7924,5.4627,-8.9898,4.7413,18.3763,13.375,489
-2.5713,-9.8953,4.609,4.3718,-9.8953,3.8987,33.8728,21.0667,490
-1.0123,-10.6128,2.1947,2.0341,-10.6128,2.9232,37.523,33.4017,491
-40.4896,-8.3963,-1.6212,11.1626,-8.3963,6.2523,56.7749,15.0853,493
-21.776,-9.8303,-1.2373,6.4665,-9.8303,5.8249,39.7789,19.2206,494
-11.5601,-9.8751,-4.6455,3.8205,-9.8751,3.1379,13.4293,11.0325,495
-1.3512,-9.7389,-0.4446,0.5935,-9.7389,1.6351,10.6557,4.7365,496
-3.0252,-9.8032,0.5244,3.0493,-9.8032,6.7976,13.8715,7.3977,497
-7.5877,-9.7049,-3.4132,5.0733,-9.7049,1.2172,15.6863,12.5586,498
-6.2795,-9.6828,0.1505,3.3168,-9.6828,5.6309,22.5681,10.0246,499
-11.9002,-9.6448,-2.0328,4.3285,-9.6448,12.1858,23.6596,16.9939,500
-14.6052,-9.8151,-5.8473,6.399,-9.8151,1.6862,20.2359,14.5651,501
-13.5232,-9.667,-5.0651,4.4287,-9.667,8.8465,23.5103,13.7506,503
-17.3586,-9.7345,2.2504,7.5693,-9.7345,9.4518,23.3155,15.2813,504
-5.5205,-9.7545,-1.7895,1.8774,-9.7545,1.8547,8.8384,5.6341,505
-3.3263,-9.7774,-1.282,1.5707,-9.7774,3.2059,21.0057,12.0322,506
-7.2464,-9.5579,-3.3021,2.8305,-9.5579,3.7667,17.883,11.6789,507
-4.1287,-9.5718,-1.8632,1.8133,-9.5718,0.5203,11.8604,6.9008,508
-11.9138,-9.7586,-3.9557,6.9291,-9.7586,2.3997,13.9101,8.6902,509
-4.4685,-9.5968,-1.3148,1.5854,-9.5968,2.4551,15.9718,6.2598,510
-11.3582,-9.5203,1.2618,10.0818,-9.5203,10.4286,26.738,19.5005,511
-7.1168,-9.6373,1.6092,3.9775,-9.6373,7.85,13.8675,11.558,513
-5.417,-9.679,2.6025,3.9581,-9.679,7.1623,26.6566,14.3365,514
-0.6946,-9.8504,2.5959,2.7041,-9.8504,2.043,14.8938,13.6944,515
-0.1087,-9.7988,0.3909,0.3598,-9.7988,0.3606,5.1836,4.7762,516
-2.4675,-9.8512,-0.8063,0.9362,-9.8512,1.6499,16.0438,10.0121,517
-2.1829,-9.7249,6.6478,7.1141,-9.7249,4.5477,16.7787,12.2734,518
-2.1759,-9.7508,-0.6773,0.8376,-9.7508,1.666,8.3176,4.692,519
-11.0174,-9.7906,-0.7535,4.7575,-9.7906,5.2635,19.0342,11.3609,520
-1.1055,-9.8356,4.9046,4.338,-9.8356,4.3191,18.2813,14.8946,521
-3.8008,-9.804,-0.1803,2.2481,-9.804,2.6946,11.4391,7.5039,523
-0.9708,-9.7546,3.7548,4.4315,-9.7546,5.9764,20.4005,9.3038,524
-0.1327,-9.8306,0.075,0.3591,-9.8306,0.8696,6.7955,4.5347,525
-1.0353,-9.7321,1.7327,2.2815,-9.7321,2.9679,9.0335,5.7619,526
-6.4326,-9.7905,-1.2804,2.4374,-9.7905,4.0862,15.0806,7.0979,527
-0.2416,-9.8418,0.2577,0.6258,-9.8418,1.8571,8.8966,2.4628,528
0.0744,-9.7971,2.864,3.4624,-9.7971,4.8815,10.6692,7.9153,529
-1.0708,-9.7769,0.5989,1.074,-9.7769,3.4577,8.4586,4.7478,530
-3.3675,-9.6448,0.3921,2.4073,-9.6448,4.9358,9.4906,6.2234,531
-1.8874,-9.7118,1.3037,2.0506,-9.7118,2.9294,12.0585,9.6453,533
-0.1738,-9.7233,0.4145,0.7208,-9.7233,2.5277,7.5615,4.9346,534
-1.1304,-9.8732,0.4382,1.1019,-9.8732,2.0518,9.519,7.302,535
-0.1598,-9.4732,0.2109,0.4144,-9.4732,1.3449,10.3508,9.6822,536
-0.5892,-9.7352,-0.0173,0.3611,-9.7352,0.5918,5.6305,4.9213,537
-2.0078,-10.0149,0.011,1.0037,-10.0149,1.52,9.7202,7.2346,538
-0.2998,-9.6146,-0.0147,0.146,-9.6146,0.6185,2.3547,1.6084,539
-0.3592,-9.782,0.0157,0.1969,-9.782,0.759,4.7351,4.1504,540
-0.8439,-9.7735,0.5373,1.1472,-9.7735,3.1813,12.5132,9.1213,541
-0.2429,-9.773,0.4353,0.5725,-9.773,2.0508,11.1954,9.3604,542
-0.6887,-9.7526,0.4128,0.6929,-9.7526,2.5248,11.593,7.7491,543
-0.5492,-9.7801,1.5896,1.1866,-9.7801,1.5472,12.09,8.6498,544
-0.7752,-9.7764,0.4144,0.6142,-9.7764,2.5723,7.7714,5.3037,545
-0.3122,-9.7362,0.3932,0.7598,-9.7362,1.7404,6.509,3.7691,546
-1.2115,-9.8182,1.7839,2.5038,-9.8182,3.6282,18.5352,6.1407,547
-2.1153,-9.9657,-0.3404,1.6748,-9.9657,1.5539,25.2043,23.8707,548
-0.4747,-9.8236,0.3437,0.5066,-9.8236,1.2583,38.1076,35.3619,549
-0.1178,-9.6934,0.6185,1.3424,-9.6934,1.3439,24.0854,21.1456,550
-3.1877,-9.761,0.652,1.3199,-9.761,1.804,24.6847,13.0437,551
-5.6349,-9.7216,-1.6333,2.3544,-9.7216,1.8164,9.422,7.4551,552
-118.7078,-9.0723,-5.8253,45.8319,-9.0723,10.1958,24.5644,6.5869,553
8.6543,-9.2601,15.1589,3.7226,-9.2601,1.3062,8.2391,7.0203,554
-9.8375,-9.4723,3.5325,11.4148,-9.4723,4.3325,14.2064,7.0614,555
16.473,-9.5302,27.051,5.5019,-9.5302,1.0506,14.8199,14.1566,556
15.5874,-9.4655,20.1586,3.2117,-9.4655,0.5269,14.513,13.9315,557
-12.4487,-9.8441,-5.0042,4.9728,-9.8441,4.3953,16.8398,13.1783,558
-29.3284,-9.4635,-7.0584,14.3638,-9.4635,9.6114,17.2998,12.6654,559
-30.2631,-9.6691,-1.096,16.4586,-9.6691,12.6463,30.3781,14.7101,560
-21.7053,-9.9315,-1.0759,13.4356,-9.9315,8.41,15.3724,7.7645,561
-1.744,-9.6717,-0.1517,1.5932,-9.6717,2.509,10.9558,8.3344,563
-10.4411,-9.6974,-0.8998,2.8739,-9.6974,2.8138,9.7454,6.7289,564
-0.3502,-9.6978,1.0737,1.2037,-9.6978,1.4612,20.952,3.6304,565
-5.4912,-9.8866,-0.2974,3.483,-9.8866,1.5433,6.9705,5.0003,566
-0.1659,-9.6416,0.108,0.1808,-9.6416,0.6045,3.289,2.4788,567
-0.1172,-9.75,-0.0311,0.0733,-9.75,0.2658,1.6078,1.5429,568
-0.1122,-9.7496,-0.0516,0.0557,-9.7496,0.1834,1.5813,1.5097,569
-0.1268,-9.7483,-0.0376,0.0506,-9.7483,0.1665,1.5316,1.5104,570
-2.8968,-9.6041,0.5409,1.7885,-9.6041,6.2326,19.0553,4.9073,571
-0.0031,-9.7569,0.0489,0.0522,-9.7569,0.6258,3.1443,1.5096,572
-13.8356,-9.7824,-0.1123,4.6619,-9.7824,3.4094,14.26,3.4118,573
-2.1178,-9.7561,-0.2107,0.5472,-9.7561,0.8465,3.9161,1.9246,574
-1.4472,-9.7884,2.0391,5.1594,-9.7884,5.4521,20.1064,1.9268,575
-0.464,-9.7421,-0.056,0.1681,-9.7421,0.349,1.9989,1.5407,576
