AYGX_min,AZ_mean,AYGX_mean,AYGX_std,AZ_mean.1,GX_std,Gnorm_max,Gnorm_median,timestamp
-14.2753,-9.2528,-0.4695,8.2491,-9.2528,2.0393,14.5767,9.44,551
-5.3633,-9.8693,1.5976,4.3563,-9.8693,4.5473,22.5324,7.3503,552
-38.5608,-9.4684,-2.6228,11.8828,-9.4684,6.0341,18.1425,9.6696,553
-5.9112,-9.9142,-0.6866,2.3427,-9.9142,1.5208,11.9964,5.8604,554
-9.9191,-9.9172,-0.5751,3.7891,-9.9172,3.6485,12.3273,7.9052,555
