AYGX_min,AZ_mean,AYGX_mean,AYGX_std,AZ_mean,GX_std,Gnorm_max,Gnorm_median,timestamp
0.0125,-9.8628,0.0311,0.0091,-9.8628,0.0805,1.7486,1.6914,0
0.0052,-9.8629,0.0268,0.013,-9.8629,0.1243,1.7383,1.6819,1
-23.802,-9.8051,-3.5109,8.447,-9.8051,5.7208,14.4415,6.5729,3
-5.3071,-9.8013,2.158,4.722,-9.8013,4.2709,10.1469,5.14,4
-3.3733,-9.8165,-0.7288,1.256,-9.8165,1.2675,3.6429,1.9887,6
-3.1559,-9.833,0.3223,1.5627,-9.833,1.9523,5.2437,2.2184,7
-10.1528,-9.8426,-1.5097,3.5706,-9.8426,3.514,9.3199,2.0664,8
-18.9159,-9.7741,-0.0801,11.1722,-9.7741,9.3543,13.4129,9.3476,9
-0.403,-9.858,0.4152,0.7912,-9.858,2.2386,6.0212,2.3989,10
-5.6156,-9.8574,-1.2969,1.5599,-9.8574,2.3843,9.836,6.984,11
-2.08,-9.7942,-1.0802,0.8802,-9.7942,0.9056,9.9773,6.4991,13
-17.1099,-9.7762,-0.4062,7.1284,-9.7762,5.4789,11.8298,6.7159,14
-2.6516,-9.8066,2.655,5.593,-9.8066,4.4614,10.7967,4.2214,15
-7.7808,-9.8123,-3.653,2.4499,-9.8123,1.8172,5.9992,3.0747,16
0.5102,-9.8093,3.2629,1.5922,-9.8093,1.785,5.6748,4.6478,17
0.763,-9.868,0.8819,0.0909,-9.868,0.0565,3.5836,2.9079,18
-0.3855,-9.8666,0.679,0.6572,-9.8666,0.8139,16.814,16.0802,19
-44.8301,-9.6233,-26.5171,10.2977,-9.6233,2.683,20.0681,15.5109,20
-37.1863,-9.4059,-28.3239,6.4061,-9.4059,1.5158,11.2555,9.5721,21
15.3557,-9.4986,37.8324,13.5498,-9.4986,1.2069,17.7647,15.6001,23
-10.3628,-9.8784,1.8299,6.2845,-9.8784,7.6099,25.2135,15.6767,24
-2.7658,-9.8074,-0.5205,0.959,-9.8074,1.3681,30.8941,28.6176,25
-22.1172,-9.8928,-1.8379,6.1941,-9.8928,4.367,30.2894,16.8919,26
-17.6379,-9.779,-0.6737,6.7253,-9.779,3.0914,42.0638,27.2045,27
-7.8637,-10.0422,0.1973,2.6991,-10.0422,3.7897,41.0946,23.4629,29
-22.1591,-9.8822,-1.3112,9.6189,-9.8822,4.3001,28.0157,10.2835,30
-6.8835,-9.9334,2.0359,4.4278,-9.9334,4.9705,43.3015,23.7099,31
-12.9385,-9.7454,3.2806,10.3062,-9.7454,5.7807,28.3946,15.083,32
-1.3111,-9.8991,7.5873,5.6794,-9.8991,4.3125,28.2225,17.3114,33
-2.9533,-9.8039,5.8878,5.8239,-9.8039,6.4973,17.8928,11.2179,34
-19.6393,-9.8044,-0.0009,6.571,-9.8044,9.7513,30.4062,10.9998,35
-6.8831,-10.8281,6.8596,11.5031,-10.8281,6.6757,61.557,53.1613,36
0.9423,-9.996,3.7838,2.628,-9.996,0.7832,52.7148,42.9368,38
-12.5794,-9.6683,3.9321,10.0692,-9.6683,13.6245,35.1813,16.6404,39
-3.4724,-10.1314,0.6568,3.8157,-10.1314,1.3496,61.2369,53.2074,40
-1.3119,-10.0309,0.7521,1.2769,-10.0309,2.2297,21.1055,11.2562,41
-5.9461,-9.7984,9.482,12.6469,-9.7984,5.7989,39.3299,29.7796,42
0.4666,-9.6807,4.0585,3.9384,-9.6807,2.6969,22.2192,12.1572,43
-22.2517,-9.85,-5.1954,8.0622,-9.85,6.2661,15.0597,11.5606,44
-19.1637,-9.7379,-5.2698,12.0469,-9.7379,7.6095,10.7224,8.5655,45
-4.9763,-9.738,0.6323,2.8036,-9.738,1.8699,4.623,2.136,47
-4.6014,-9.7467,-0.2855,2.5847,-9.7467,1.5747,3.2797,2.1104,48
-2.3387,-9.7619,-1.6392,0.6838,-9.7619,0.4145,2.1889,2.0394,49
-3.405,-9.7595,-2.7639,0.6428,-9.7595,0.3918,2.9425,2.7279,50
-3.241,-9.76,2.0995,2.6822,-9.76,1.9338,3.6703,2.9327,51
-4.9549,-9.7671,-2.8655,2.1265,-9.7671,1.5165,4.1224,3.3801,53
-65.5909,-9.6449,-12.1072,17.3607,-9.6449,6.5299,23.9397,6.0764,54
-6.1865,-9.5391,28.9371,24.5704,-9.5391,8.5643,25.2748,16.991,55
-5.5984,-10.377,-1.897,1.9099,-10.377,3.0329,20.841,11.0907,56
-7.8756,-9.8337,-1.3759,3.2777,-9.8337,3.4275,36.6715,34.8814,57
-6.4922,-9.2693,-1.6453,3.2036,-9.2693,4.0447,26.5784,19.416,58
-4.3265,-10.0106,-0.0034,2.8053,-10.0106,2.4911,36.4772,35.6985,59
-8.1672,-8.8549,-0.0393,5.0155,-8.8549,5.0315,26.6408,15.4936,60
-3.7842,-9.7413,1.4352,2.9255,-9.7413,6.0472,31.3746,27.9707,61
-10.7373,-10.2747,-2.0523,5.4663,-10.2747,5.211,30.2504,28.3192,63
-3.6019,-9.9984,1.6739,3.1797,-9.9984,7.5532,36.7128,26.7008,64
-0.226,-10.2265,3.5694,3.4602,-10.2265,0.8328,23.6504,13.5786,65
-2.9733,-9.3573,3.7155,5.7992,-9.3573,4.0516,53.6004,36.6691,66
1.6881,-9.5727,12.3326,8.7055,-9.5727,4.1633,52.258,49.4334,67
-4.9046,-9.8395,-0.0045,3.3479,-9.8395,0.5586,10.6899,6.5871,68
-6.8863,-9.5833,-0.0606,5.5896,-9.5833,9.2987,19.715,12.6836,69
-24.3638,-9.5088,29.2586,32.3943,-9.5088,3.4796,62.6693,55.5818,70
-14.8155,-10.6599,32.4832,35.6294,-10.6599,15.0323,65.1402,47.8785,71
-8.98,-9.5879,52.2649,33.3173,-9.5879,8.4173,47.9407,33.3285,72
-4.6192,-9.8969,2.541,5.498,-9.8969,6.5557,29.0695,12.4174,74
-9.6058,-9.6036,8.9201,12.9938,-9.6036,5.0501,25.6707,22.297,75
-0.5263,-9.9943,5.9959,6.5621,-9.9943,4.6784,41.6979,32.3347,76
-7.6347,-9.7575,0.4489,6.4631,-9.7575,1.1121,22.9035,21.1098,77
-5.7649,-9.0931,4.9347,8.4283,-9.0931,9.0646,35.7556,19.0948,78
-20.6506,-9.0427,-5.4212,8.1366,-9.0427,8.6082,20.6951,13.2853,79
-9.3645,-10.2566,3.726,8.3088,-10.2566,10.0212,41.7948,36.9461,80
-6.8886,-10.2576,3.8147,7.5454,-10.2576,8.3658,33.6753,22.6936,81
-0.1576,-9.7688,46.1568,41.5199,-9.7688,16.604,43.5113,42.0655,82
-26.0489,-9.4753,0.6284,7.7961,-9.4753,6.4783,29.7998,15.4723,84
-1.4054,-9.9858,4.0584,7.3168,-9.9858,6.3092,17.9451,11.8233,85
10.8623,-10.1767,38.7349,22.4664,-10.1767,9.7863,40.0853,39.1282,86
-11.9031,-9.9278,10.5969,18.8533,-9.9278,16.3484,45.9684,32.8337,87
-2.6471,-10.0542,0.6182,2.4515,-10.0542,2.2089,29.1202,20.35,88
-1.7197,-10.1829,0.4524,1.842,-10.1829,2.2773,23.6849,21.1233,89
-0.4254,-9.7262,6.1735,7.1372,-9.7262,5.7851,33.1047,30.0854,90
-20.6258,-10.1407,2.8497,9.7843,-10.1407,8.814,129.5123,81.0506,91
0.509,-9.6308,20.5596,10.7122,-9.6308,5.1297,92.6974,64.6167,92
-9.3205,-9.8665,0.2123,3.8453,-9.8665,6.0127,51.5903,10.1669,94
-17.2742,-9.7923,-2.9251,5.761,-9.7923,7.9954,36.4979,26.752,95
-4.5649,-10.0309,-1.3274,1.6651,-10.0309,2.3745,38.892,37.0604,96
1.3181,-10.0307,20.1198,17.1422,-10.0307,4.6395,34.1574,28.4719,97
-19.8965,-9.9576,9.486,25.1823,-9.9576,7.6072,38.4871,33.5312,98
2.0862,-10.1674,48.5993,36.6059,-10.1674,2.8999,37.8616,33.5874,99
1.1244,-9.2729,27.2797,16.2981,-9.2729,4.1001,48.5196,40.1158,100
-15.9225,-8.9322,8.8343,17.5117,-8.9322,5.3638,26.4137,21.194,101
-3.3116,-9.9921,0.2893,1.6821,-9.9921,3.5839,12.595,8.9389,102
-4.6695,-10.2877,-0.1465,2.6735,-10.2877,2.2073,8.907,7.8013,103
-7.2543,-9.8222,18.8006,23.9606,-9.8222,23.4229,47.7529,25.6361,104
-9.2655,-9.8044,10.6033,20.6315,-9.8044,12.3264,37.2613,25.4636,105
-1.667,-10.0734,0.411,1.5598,-10.0734,1.9339,16.6196,13.586,106
-1.19,-9.3415,1.2516,2.4616,-9.3415,3.7162,17.7041,14.6688,107
-23.3438,-8.5809,1.9559,9.3755,-8.5809,5.3075,35.0157,11.9521,108
-8.088,-7.6254,1.9243,5.6233,-7.6254,4.2813,30.5248,15.9752,109
-3.4584,-9.3112,4.1199,6.2668,-9.3112,3.0617,29.318,15.1367,110
-24.6218,-10.1651,46.0509,46.3208,-10.1651,23.4949,65.4274,43.016,111
-0.5886,-10.3729,1.9223,1.6715,-10.3729,6.6328,46.0905,43.2417,112
1.0988,-9.8687,8.2809,4.2276,-9.8687,2.6916,26.1405,21.3074,113
-12.0099,-9.9858,-1.6907,3.4374,-9.9858,4.1704,45.2785,20.55,114
-6.3876,-10.0324,10.7937,12.0176,-10.0324,14.0923,56.4028,38.258,115
-6.2897,-10.0415,2.0833,4.7074,-10.0415,6.702,18.1964,13.2059,116
-2.162,-10.0985,3.6023,5.5684,-10.0985,2.3099,32.1823,19.2263,117
0.1712,-10.0052,8.7615,7.4487,-10.0052,2.5573,28.0186,15.5084,118
-3.748,-10.2216,6.6734,8.4929,-10.2216,2.9526,56.9731,53.7737,119
-0.1969,-10.6109,0.6211,1.0137,-10.6109,1.909,90.4498,88.1491,120
-6.9113,-9.8599,5.1886,6.2192,-9.8599,7.0991,76.1902,52.9192,121
-1.1634,-9.6969,-0.0266,1.0367,-9.6969,0.4306,9.0466,6.4607,123
-0.3847,-9.6907,0.6107,1.1585,-9.6907,2.0337,25.4151,11.3703,124
-7.0417,-9.9203,23.932,39.8285,-9.9203,16.9251,68.6196,20.6333,125
-2.2939,-10.7998,98.0917,74.4866,-10.7998,13.159,69.0982,54.3109,126
-10.9293,-9.9495,-0.5167,7.7489,-9.9495,6.0156,28.0084,10.9832,127
-4.345,-9.9094,0.2007,3.3113,-9.9094,4.2928,31.2492,18.5353,128
-5.7208,-9.8694,-1.7735,2.124,-9.8694,3.2639,30.9121,22.8506,129
-16.5252,-9.9029,2.8273,6.9057,-9.9029,4.2947,37.8468,30.41,130
-7.1661,-9.9871,-0.731,3.0102,-9.9871,3.3041,15.4026,13.6651,132
-1.8919,-9.9329,1.7274,2.2996,-9.9329,3.3148,12.9902,8.1627,133
-5.5844,-9.91,1.3608,7.1835,-9.91,6.7916,22.1907,18.5093,134
-10.1579,-6.6861,0.8059,6.4978,-6.6861,5.4803,62.9137,48.0819,135
-34.4055,-9.9412,4.4608,26.4866,-9.9412,10.3429,62.3822,51.3435,136
-16.1605,-10.3318,1.0015,11.211,-10.3318,11.4713,40.3514,29.0234,137
-15.5967,-9.9177,-3.6039,10.8153,-9.9177,3.2278,30.3427,27.8011,138
-1.4377,-9.607,2.2964,3.0844,-9.607,2.4632,48.1418,40.7167,139
-11.9906,-9.9623,1.1631,7.1814,-9.9623,8.149,42.5997,21.5064,140
-0.086,-10.0208,8.9398,6.517,-10.0208,1.2545,32.7151,24.0147,141
-24.1194,-9.8707,-9.4978,11.544,-9.8707,6.7357,15.724,12.1246,143
-4.6921,-9.8909,7.1922,6.1733,-9.8909,6.8201,42.5348,22.6019,144
7.5027,-9.4121,13.3376,3.7718,-9.4121,1.9967,24.2066,22.2931,145
-0.4028,-9.8714,6.6685,6.8285,-9.8714,0.9605,17.5628,16.4314,146
-1.2883,-9.9498,0.2494,0.6751,-9.9498,2.7478,18.7014,7.6628,148
-12.3798,-10.173,3.4038,10.4063,-10.173,8.1622,72.5814,36.7839,149
-11.2977,-10.005,2.7658,8.0775,-10.005,3.122,37.293,23.5866,150
-5.4739,-9.5595,7.8954,5.8124,-9.5595,3.3292,22.6217,17.1261,151
-1.6468,-9.7645,-0.4234,1.0581,-9.7645,0.797,16.8377,13.9801,153
-69.2992,-9.971,10.639,28.6577,-9.971,22.0021,116.893,37.7836,154
-7.2799,-9.7912,2.8138,5.7139,-9.7912,1.4466,31.2158,30.4323,155
4.8306,-10.0524,11.5592,4.395,-10.0524,2.1746,38.4037,26.4557,156
-19.3647,-9.7911,-8.8746,6.6448,-9.7911,1.644,21.5461,19.6927,157
-9.8686,-9.3974,7.1649,20.2881,-9.3974,4.3405,36.3852,35.6314,158
8.614,-9.7903,19.236,8.7091,-9.7903,0.7903,25.9985,23.5513,159
-3.4518,-9.737,18.8941,25.0276,-9.737,14.4483,41.6436,31.0472,160
-2.6331,-9.7415,-0.4446,1.4738,-9.7415,2.5149,11.4165,6.7632,161
-3.962,-9.9194,2.8582,3.8068,-9.9194,5.6854,24.4573,11.072,163
-28.1534,-9.7527,-4.5887,6.6496,-9.7527,5.0187,15.4431,3.9721,164
4.4087,-9.7303,16.6796,8.989,-9.7303,5.5499,18.0499,12.0837,165
-1.6266,-9.8791,0.0914,1.8419,-9.8791,1.2687,5.7892,5.3094,166
-7.8784,-9.7595,-0.1102,5.5719,-9.7595,4.2425,6.5818,4.6523,167
-0.2125,-9.6828,4.9902,3.4769,-9.6828,1.8207,5.9493,4.6514,168
-36.9906,-9.914,-1.4347,16.6502,-9.914,7.679,24.1582,12.0391,169
-19.5034,-9.7821,0.3135,8.9117,-9.7821,5.6397,14.7151,8.0371,170
-16.5412,-9.8979,-4.5167,7.1241,-9.8979,3.2913,37.7996,36.0448,172
-19.2758,-10.0182,4.5667,12.1271,-10.0182,7.9202,63.3031,25.3085,173
-20.3435,-9.8074,8.8822,14.1187,-9.8074,2.9542,51.9582,45.5815,174
-33.2024,-9.9293,6.2761,19.6269,-9.9293,13.5299,51.0036,29.265,175
-19.8298,-9.7751,12.9083,22.2268,-9.7751,13.6635,66.8073,29.0987,176
-12.3196,-9.9515,2.9563,8.7154,-9.9515,6.2815,41.2181,23.835,178
-20.1923,-9.6914,1.5531,7.3449,-9.6914,7.2854,49.2415,29.4209,179
-50.2213,-9.601,0.0136,21.16,-9.601,9.7447,43.2664,28.7759,180
-162.973,-9.9876,-16.4759,62.8323,-9.9876,21.0206,81.8423,44.4483,181
-12.3098,-9.436,2.9322,10.9093,-9.436,3.7691,33.2596,8.2305,182
-9.0385,-10.0215,8.8269,15.5819,-10.0215,3.1164,19.5732,15.8556,183
-16.5305,-9.9567,-4.979,7.337,-9.9567,1.8715,15.0801,10.6515,184
-12.0109,-10.1066,-2.6643,4.6936,-10.1066,5.0163,17.6367,9.3673,185
-1.8861,-10.326,0.0104,1.6738,-10.326,4.3079,15.2584,9.793,186
-12.3285,-8.0683,2.4769,7.112,-8.0683,8.7149,16.7018,12.9336,188
-5.8373,-9.6556,2.9364,6.9426,-9.6556,7.5951,21.8231,10.0193,189
-21.8859,-10.0882,1.7478,10.0153,-10.0882,6.0544,34.168,11.1668,190
-0.7032,-9.837,2.3704,3.7759,-9.837,5.8515,15.1414,9.7814,191
-15.2258,-9.7339,14.8345,23.9986,-9.7339,4.0327,55.3052,50.5794,192
-22.0924,-9.7185,-2.2506,8.072,-9.7185,6.2818,26.2546,16.8802,193
-2.5786,-10.0155,-0.0403,1.5724,-10.0155,1.0117,15.6331,6.0091,194
-7.84,-9.9654,0.245,3.9543,-9.9654,2.9696,16.9829,14.4094,195
-0.6843,-9.8268,4.2676,4.4775,-9.8268,4.7091,20.168,10.8116,196
-0.5887,-10.2774,8.5654,8.4063,-10.2774,5.5747,74.0364,40.6214,198
-337.405,-8.8538,-11.8387,193.4908,-8.8538,38.7806,144.2975,55.6015,199
-0.3516,-9.6952,10.3551,11.0431,-9.6952,5.9293,22.8055,19.6595,200
-29.8957,-9.8102,-1.0767,14.1333,-9.8102,10.7015,62.3768,41.5501,201
-22.7286,-9.6977,-10.5658,7.9087,-9.6977,5.8762,26.3847,17.5975,202
3.494,-9.7523,13.8285,7.9839,-9.7523,7.1162,36.1184,17.1993,203
-20.0431,-9.6966,0.4541,17.3078,-9.6966,3.1319,21.7446,19.9437,204
-25.1314,-9.3346,1.9227,15.9792,-9.3346,9.7408,27.6122,17.6118,205
-11.7016,-9.6163,-4.6084,4.8801,-9.6163,4.1373,9.3028,6.5993,206
-0.946,-8.2561,5.9185,7.8413,-8.2561,6.8876,22.2437,13.7666,208
-43.9203,-9.7317,-0.981,15.0919,-9.7317,9.5093,34.4274,14.5742,209
-4.151,-9.7709,-1.0804,1.4881,-9.7709,1.9108,9.0594,3.7464,210
-44.9675,-9.4532,5.7609,23.4031,-9.4532,13.9295,33.6296,21.8141,211
-1.9484,-9.9728,1.7434,2.8002,-9.9728,3.8174,12.1077,6.2726,212
-3.1806,-9.9732,-0.2978,2.4476,-9.9732,4.9515,12.8771,8.1153,213
-0.0706,-10.0378,1.0235,1.0135,-10.0378,1.4242,9.4406,7.1325,214
-3.6368,-9.9405,0.2147,1.5372,-9.9405,4.1609,11.498,6.2071,215
-2.2022,-9.9524,-0.2646,0.9642,-9.9524,1.9308,20.1269,17.1902,216
-11.0361,-7.4025,0.7279,5.4316,-7.4025,6.3483,49.8741,19.8255,218
-30.9964,-9.372,0.3476,9.7439,-9.372,8.1024,31.8628,15.1731,219
-10.6129,-9.7685,4.9959,10.0497,-9.7685,11.5783,31.8148,22.9114,220
-8.4461,-9.7584,3.0851,5.749,-9.7584,1.926,15.2268,13.0877,221
-2.7983,-9.4936,0.9151,2.2945,-9.4936,3.3718,13.958,10.327,222
-2.6898,-9.4548,-0.199,1.2181,-9.4548,5.3199,17.1076,12.8999,223
-1.5557,-9.9337,0.5177,1.058,-9.9337,2.9776,10.91,8.6501,224
-11.2983,-9.9687,15.0609,15.9781,-9.9687,17.5491,53.8291,21.5157,225
-7.495,-9.8519,-2.3428,3.8874,-9.8519,9.769,35.2514,29.2679,226
-2.6283,-9.5397,11.8465,9.2876,-9.5397,2.7715,24.8006,15.0711,228
-8.7483,-9.9895,3.894,10.3122,-9.9895,4.6598,59.9968,40.9624,229
-1.5772,-9.9578,5.3627,5.4519,-9.9578,1.4283,14.5476,13.234,230
-2.483,-9.8319,5.795,6.9041,-9.8319,1.5143,35.0282,32.1296,231
-9.092,-9.7825,0.0704,5.3593,-9.7825,1.632,13.3699,12.5441,232
-2.2993,-9.5172,19.7837,20.7496,-9.5172,10.3995,58.7521,36.0958,233
-1.7898,-10.1761,0.2705,1.9529,-10.1761,4.2312,28.6802,21.6678,234
-14.5476,-9.7826,1.3881,6.1538,-9.7826,7.3723,23.0662,16.7883,235
-36.0335,-10.0913,-5.6779,22.9288,-10.0913,1.5663,23.2144,19.9152,236
-21.5493,-9.7813,4.5089,14.7396,-9.7813,14.2872,40.5152,30.6088,238
-30.7153,-9.8253,4.1445,14.2947,-9.8253,12.354,41.3706,16.3912,239
-21.5069,-9.8671,0.169,6.2771,-9.8671,3.761,24.7369,12.8421,240
-6.9955,-9.8935,1.821,6.4673,-9.8935,7.8981,33.859,14.0406,241
-3.7298,-10.0838,9.1573,10.5836,-10.0838,6.2784,78.853,21.1619,242
-9.9083,-9.8867,10.9414,23.6124,-9.8867,5.5511,85.0399,63.6855,243
-17.5737,-10.1093,7.2456,15.1524,-10.1093,4.0172,60.9661,52.4846,244
-2.6645,-10.2678,1.5073,2.6928,-10.2678,5.5045,91.5085,82.9739,245
-39.4555,-9.9054,10.5809,24.1541,-9.9054,18.5234,86.1446,52.7397,246
-87.955,-10.0726,1.1765,30.3501,-10.0726,10.3791,110.3754,75.7781,248
-8.1542,-9.8821,2.7464,9.0597,-9.8821,7.7613,50.4669,9.0171,249
-10.6297,-9.8679,1.2673,6.3664,-9.8679,5.3032,24.8854,14.9884,250
-5.599,-9.8806,-0.1796,3.0597,-9.8806,3.8762,27.7429,9.7867,251
-0.3782,-9.8897,-0.0942,0.1356,-9.8897,0.6826,16.1384,11.2648,252
-6.6904,-9.9306,-3.4672,2.4316,-9.9306,4.0596,35.3888,27.9687,253
-2.8398,-9.8297,0.1459,1.7674,-9.8297,1.7899,32.8563,23.5536,254
-0.5581,-9.8454,1.9944,2.5574,-9.8454,3.8103,28.8115,7.9956,255
-1.6612,-9.8784,2.4029,4.7794,-9.8784,4.3712,35.3638,26.7814,256
-3.7029,-9.9169,-1.0127,2.1409,-9.9169,3.0429,62.2706,55.3226,258
-2.2536,-9.9687,1.9815,3.7033,-9.9687,5.3736,92.4064,58.234,259
-2.0992,-9.8954,0.8527,1.5713,-9.8954,1.0149,34.6114,24.4756,260
-0.2421,-9.9707,2.958,1.921,-9.9707,1.5496,18.7842,11.9597,261
-4.4023,-9.8667,2.1296,6.6123,-9.8667,4.1525,39.0262,21.4984,262
-1.0457,-9.986,2.1782,1.9726,-9.986,4.6319,25.742,24.4118,263
-2.2527,-9.9286,0.3746,1.9477,-9.9286,4.4087,27.4973,24.7519,264
-0.0161,-9.8697,2.8487,2.481,-9.8697,2.8008,48.0758,27.9359,265
-6.7932,-9.8171,-0.2399,3.3683,-9.8171,1.7135,69.8414,64.5284,266
-7.8533,-9.9214,0.9748,4.7453,-9.9214,9.6925,34.992,32.2414,268
-10.6247,-9.9593,2.8347,8.9336,-9.9593,5.2595,54.7667,44.5129,269
-1.1036,-10.0105,0.7682,2.3429,-10.0105,2.702,58.7135,54.0245,270
-9.5753,-9.8646,2.1727,4.5491,-9.8646,4.4551,44.7561,22.1085,271
-10.0934,-9.9483,-0.7222,3.5753,-9.9483,6.2453,44.4083,26.4928,272
-5.1175,-9.8413,0.7143,3.5357,-9.8413,2.5242,32.6931,24.3362,273
-8.1684,-9.8556,0.7912,6.2914,-9.8556,1.0479,18.151,16.2027,274
-7.5725,-9.8061,5.9085,11.0531,-9.8061,3.5658,21.2476,11.7175,275
-0.2318,-10.0533,4.7734,4.7082,-10.0533,2.9201,62.2941,48.2361,276
-3.5185,-9.9363,1.3218,3.427,-9.9363,0.8451,73.8902,65.9282,278
-5.336,-9.8655,1.2541,3.1744,-9.8655,4.8697,71.0436,37.1654,279
-0.2181,-9.8909,2.9004,2.3748,-9.8909,1.7131,19.7418,14.7332,280
-0.0,-9.8513,17.7364,10.1117,-9.8513,4.3145,46.6844,43.6018,281
-7.6454,-10.5903,4.9882,9.4649,-10.5903,9.6971,76.3661,53.5788,282
1.7316,-10.3458,11.3146,6.3845,-10.3458,4.3088,39.2596,24.8923,283
-2.4916,-9.897,8.1758,7.7083,-9.897,4.7117,17.6593,13.6827,284
-27.3511,-9.744,3.3889,9.3665,-9.744,12.2519,53.3666,40.2724,285
-6.9934,-9.8607,6.2566,9.6677,-9.8607,7.195,35.7299,12.8394,286
-30.6643,-9.8976,15.7746,36.7879,-9.8976,18.5861,65.0929,29.7556,288
-9.6717,-9.9711,4.4448,14.1892,-9.9711,10.2118,43.0569,22.6317,289
-66.9675,-9.9803,10.7073,30.4235,-9.9803,14.4813,47.2027,32.1042,290
-42.075,-9.8403,47.908,63.9589,-9.8403,23.3649,60.9834,35.4727,291
-26.445,-9.4966,6.7003,22.263,-9.4966,12.0793,41.7221,17.5103,292
-44.1138,-9.9794,-2.5724,12.8401,-9.9794,13.9874,28.0783,18.0681,293
-31.4619,-8.7568,0.9547,20.1486,-8.7568,2.2907,20.159,17.4672,294
-16.9919,-9.8457,-1.4068,5.004,-9.8457,2.5733,12.4842,4.0315,295
-3.5847,-8.4169,7.9933,10.1218,-8.4169,9.9066,27.1121,17.1553,296
-22.2402,-9.6301,-2.1256,8.3314,-9.6301,8.7247,20.229,10.6085,298
-31.3307,-9.3932,10.9265,16.9188,-9.3932,15.4708,48.1834,18.3578,299
-1.3164,-9.8648,1.8486,2.9796,-9.8648,6.7387,20.1832,16.4862,300
-0.7945,-9.9358,0.4652,1.0121,-9.9358,1.8674,9.5245,6.1695,301
0.0234,-9.9256,2.4547,2.1175,-9.9256,1.7707,18.621,14.9488,302
0.5786,-10.3438,43.5635,42.5889,-10.3438,11.7605,42.2069,33.6638,304
-11.0947,-10.0593,3.5648,7.9647,-10.0593,8.1146,68.5514,35.7689,305
-3.3992,-9.9181,-1.1996,1.1832,-9.9181,3.558,40.7137,37.98,306
-3.3173,-9.6228,12.9942,12.6972,-9.6228,8.8055,39.0424,17.8978,308
-61.5954,-9.9407,4.9222,21.5424,-9.9407,17.1468,43.2729,24.1404,309
-35.5157,-9.8195,2.4584,29.4934,-9.8195,8.4782,53.7075,37.6167,310
-18.6233,-9.6573,-3.0767,8.8633,-9.6573,12.9463,25.415,15.4557,311
-21.7559,-9.5528,-3.0124,11.3879,-9.5528,4.72,18.7449,11.5927,312
-30.6429,-9.8698,-0.5132,14.5271,-9.8698,5.7323,30.1306,16.6703,313
0.3775,-9.6759,4.456,3.1651,-9.6759,1.0339,15.3001,13.0236,314
-18.1932,-9.8874,-2.5194,8.8856,-9.8874,9.4234,28.2154,18.4184,315
-0.9559,-9.8287,0.8451,1.163,-9.8287,3.3275,19.6323,6.266,316
-15.4526,-9.7199,3.3204,7.9487,-9.7199,5.6485,21.7029,12.5605,318
-16.5012,-9.7001,1.4636,5.1476,-9.7001,6.1146,34.1568,12.6164,319
-3.4707,-9.6236,2.057,3.7591,-9.6236,1.1573,20.7401,14.217,320
-0.0175,-9.7394,8.4704,7.0662,-9.7394,3.9638,38.901,11.9799,321
-4.9934,-9.9313,-0.157,2.9853,-9.9313,3.9479,18.8249,8.0877,322
8.643,-9.8471,12.7757,2.6984,-9.8471,2.8172,40.8819,24.3127,323
-21.7864,-9.9625,8.2943,15.6889,-9.9625,13.2507,43.3483,26.741,325
-2.5105,-9.8139,0.2461,2.1498,-9.8139,2.1527,23.1853,7.0964,326
-7.0837,-9.9076,8.7312,13.2351,-9.9076,5.0662,41.1432,19.511,328
-47.8724,-9.1729,2.0703,12.4478,-9.1729,8.0859,52.5154,17.4861,329
-17.3893,-10.1281,-3.6196,8.3101,-10.1281,6.0367,14.6476,7.621,330
-5.5232,-10.0577,-1.188,2.4012,-10.0577,3.2816,10.7422,7.9504,331
-6.0516,-9.699,5.5888,13.1197,-9.699,3.2378,17.9038,11.8052,332
-8.4407,-10.0198,-0.8104,6.0497,-10.0198,6.2879,17.6371,13.3847,333
-10.6631,-10.4707,-0.6309,5.7682,-10.4707,3.4013,10.2024,8.3906,334
-4.9584,-10.3871,4.2936,8.3039,-10.3871,7.4805,19.9847,13.2049,335
-14.2027,-9.1974,4.6292,10.8945,-9.1974,7.5938,29.4971,14.1912,336
-67.9409,-7.7741,-7.2,22.7025,-7.7741,11.4711,58.0397,19.4505,338
-26.3357,-9.5046,8.561,21.948,-9.5046,13.8116,37.7573,16.4277,339
-12.3083,-9.8183,0.3155,7.4223,-9.8183,5.7142,19.3328,13.1386,340
-9.2472,-9.863,14.8348,23.6797,-9.863,12.2529,25.9463,21.7383,341
-10.0714,-9.9264,1.4622,7.1518,-9.9264,8.5909,17.4149,11.6067,342
-23.6424,-8.8784,-2.8701,9.2991,-8.8784,6.1363,18.4146,10.2051,343
0.4833,-9.6065,7.8016,7.6376,-9.6065,9.3675,25.3115,20.2395,344
-6.9674,-10.1574,1.0802,5.9577,-10.1574,9.3879,15.6019,12.8107,345
-3.2538,-10.0833,2.4673,3.1,-10.0833,6.5892,13.7298,10.3781,346
-5.0608,-10.1763,-0.3185,3.2942,-10.1763,1.2925,11.1133,9.2728,348
-28.0559,-9.7979,2.4747,13.2871,-9.7979,10.3035,48.3506,20.9338,349
-18.2768,-10.0154,0.5332,13.1965,-10.0154,4.5309,30.3863,13.9377,350
-16.9294,-9.7117,-1.8838,7.0443,-9.7117,4.8709,56.2641,45.2493,351
-112.3113,-7.5025,2.2059,65.3369,-7.5025,11.9764,46.9424,35.8033,352
-58.456,-9.5343,-13.0022,28.6108,-9.5343,8.5516,29.4847,21.1144,353
2.3794,-9.4448,6.8341,3.1231,-9.4448,3.0979,14.1122,11.7428,354
-23.315,-9.5738,6.5744,21.1061,-9.5738,6.73,33.3284,21.8827,355
-3.6345,-10.1505,1.1484,3.9371,-10.1505,2.871,10.5008,6.2046,356
-5.5374,-9.9155,0.9434,3.637,-9.9155,1.7003,10.3061,9.7059,358
-31.4262,-9.9476,1.6122,9.1388,-9.9476,7.6182,44.4925,11.5915,359
2.2862,-9.4443,25.6874,17.7008,-9.4443,8.4349,41.3629,27.3671,360
-1.594,-10.3586,9.4239,11.7548,-10.3586,7.6731,57.9648,43.8126,361
-1.6948,-9.8766,14.3298,11.7356,-9.8766,1.2783,52.205,37.0933,362
-7.9658,-9.7621,-0.0065,3.5959,-9.7621,5.0975,26.0297,17.714,363
-24.6344,-9.5836,17.0551,22.9609,-9.5836,5.3998,45.877,31.3027,364
-0.0811,-10.3826,3.2776,3.4992,-10.3826,3.7161,38.676,34.0874,365
-15.0738,-9.9128,0.1368,5.7286,-9.9128,5.0365,35.6878,27.6215,366
-37.1814,-10.1994,-0.9691,12.6311,-10.1994,10.3519,51.6505,41.9968,367
-1.6593,-10.0926,10.0784,17.8507,-10.0926,10.9371,55.5208,45.9364,368
-17.2305,-9.9529,20.245,31.6109,-9.9529,13.9509,71.0384,28.6102,369
-0.4387,-9.8663,4.1291,3.9776,-9.8663,2.7772,29.8314,16.3444,370
-7.2907,-9.9712,3.0268,5.4925,-9.9712,5.4764,31.8486,17.177,371
-52.8199,-10.1181,6.0372,25.4321,-10.1181,10.7571,62.1061,42.284,372
-24.6031,-9.7955,8.6963,23.5169,-9.7955,12.9952,34.3022,14.5497,373
-19.3551,-10.1179,5.6833,18.0852,-10.1179,10.689,66.9981,37.8331,374
-6.223,-9.8053,12.9081,12.701,-9.8053,10.2888,45.6266,23.9588,375
-25.6966,-9.6938,0.2703,8.5559,-9.6938,7.1191,44.1354,39.3066,376
-33.0777,-9.5847,7.0414,32.8127,-9.5847,8.649,47.763,20.8825,378
-23.1145,-9.7797,-1.4466,12.1024,-9.7797,8.8708,48.0882,12.9176,379
-12.5699,-10.0394,-0.1595,10.2862,-10.0394,5.6423,16.4573,12.1784,380
-11.4693,-9.9228,7.9204,14.9737,-9.9228,5.7458,20.7055,13.8301,381
-72.6029,-9.1501,4.1156,43.7847,-9.1501,13.4331,38.3146,28.3404,382
-23.4893,-10.1042,6.2401,15.1471,-10.1042,12.939,34.5241,23.8676,383
-8.5538,-10.3171,1.6227,7.2615,-10.3171,5.423,15.3365,12.0105,384
-12.908,-9.7485,2.579,11.1201,-9.7485,10.5548,29.9373,22.5304,385
-45.351,-9.3152,-6.4728,20.5926,-9.3152,14.7482,32.0411,20.9799,386
-20.5413,-9.5309,2.9676,9.6031,-9.5309,10.5146,23.3457,13.3263,388
-17.9316,-9.3525,2.2086,9.5784,-9.3525,9.8013,30.9824,15.7123,389
-16.1457,-9.9717,4.0045,9.3386,-9.9717,8.4351,24.4922,17.2228,390
-2.3871,-9.7712,-0.3456,0.8897,-9.7712,2.1256,18.7403,16.5978,391
-14.4116,-10.0438,8.0795,15.9325,-10.0438,5.9614,34.558,29.2802,392
-2.582,-10.0049,-0.0933,1.7731,-10.0049,2.5568,32.6682,25.5612,393
-5.7657,-9.9881,1.7227,6.1811,-9.9881,2.3412,39.4585,33.6036,394
-1.2191,-9.8448,1.5545,4.2106,-9.8448,1.8598,37.9223,11.3047,395
-22.8346,-7.7982,4.7643,14.0145,-7.7982,9.0216,40.2489,23.4725,396
-26.1539,-9.9403,-6.7494,14.5558,-9.9403,2.9028,17.4847,14.2143,397
-0.0962,-10.0885,7.7087,8.3382,-10.0885,5.7557,18.4533,13.1918,398
-10.209,-9.8643,5.2566,11.6136,-9.8643,7.706,41.6365,30.5368,400
-2.0684,-10.02,0.2188,1.6488,-10.02,4.2016,9.2829,7.3347,401
-12.2299,-10.4967,17.5492,26.7216,-10.4967,12.2255,41.3737,29.5319,402
0.2887,-10.2186,10.6734,9.6378,-10.2186,8.0395,17.9858,14.6719,403
-7.5976,-9.4401,1.0147,7.2708,-9.4401,2.4991,12.5047,10.3927,404
-6.2414,-10.136,3.8724,6.3397,-10.136,6.7985,21.2874,10.1665,405
-19.3193,-10.4196,3.197,11.2507,-10.4196,10.5588,26.1514,17.0132,406
-3.9743,-9.746,-0.0507,2.8035,-9.746,1.1059,19.2633,16.1181,407
-2.1644,-10.1358,-0.0729,1.4384,-10.1358,2.2507,33.7884,28.8426,408
-10.4564,-10.1892,-0.5562,3.5432,-10.1892,5.4802,49.234,32.8886,409
-4.4766,-9.7579,8.8736,5.6715,-9.7579,3.2652,46.8893,29.2782,410
-4.1345,-9.9487,-0.9034,1.4568,-9.9487,2.0902,8.6328,6.6547,411
-3.5018,-9.8095,2.7476,4.7261,-9.8095,2.6906,15.9595,10.9977,412
-8.5087,-9.7268,-1.3739,6.651,-9.7268,3.2763,14.2483,11.0995,413
-13.3364,-9.8649,-2.2433,6.8221,-9.8649,3.4104,15.644,12.5663,414
-4.9502,-9.3262,3.2829,6.2085,-9.3262,2.3874,12.3765,7.2844,415
-22.9826,-10.0721,-3.1399,8.0365,-10.0721,4.5381,21.9265,18.6895,416
-68.8704,-9.8535,-1.3803,25.5309,-9.8535,7.0704,36.1739,26.1857,417
-22.1347,-9.8687,6.931,18.313,-9.8687,13.5245,35.8066,19.8079,418
-20.7965,-9.9183,3.0056,9.0786,-9.9183,8.3585,25.1601,18.9638,419
-13.1266,-9.8241,1.3156,8.9542,-9.8241,1.8415,24.0823,22.102,420
-5.0954,-9.9264,4.364,6.1207,-9.9264,8.2709,33.0067,21.7387,421
-15.9312,-8.6843,-5.9747,9.3372,-8.6843,7.3541,31.1071,22.4598,422
-10.6819,-10.0758,3.4133,11.4494,-10.0758,2.4675,20.883,18.6298,423
-48.9729,-6.9069,8.0772,21.7686,-6.9069,15.3911,55.5825,19.2729,424
-40.7313,-9.8176,6.8476,28.7958,-9.8176,23.2432,47.047,24.441,425
-9.1255,-9.7832,3.3747,7.1395,-9.7832,6.613,17.8226,12.7754,426
-8.414,-9.8757,11.4987,14.5612,-9.8757,5.279,33.5599,22.2793,427
-16.5153,-9.8982,-2.8739,6.6829,-9.8982,6.1892,11.8744,8.764,428
-1.0216,-10.1216,2.9792,4.0446,-10.1216,10.2846,24.818,20.0526,429
-10.1247,-9.9595,2.1888,9.6412,-9.9595,4.4101,15.0681,11.9119,431
-3.5715,-9.6741,1.0232,4.2068,-9.6741,3.4714,10.5777,7.981,432
-19.7448,-7.1013,-0.8561,15.5,-7.1013,9.763,53.3787,18.9785,433
-64.2844,-9.9375,-4.2573,15.4352,-9.9375,8.8253,46.5478,21.1231,434
-35.0306,-10.4579,-13.5223,15.9594,-10.4579,6.6632,74.5656,65.1045,435
-15.6608,-6.4333,1.4063,10.7965,-6.4333,6.1969,39.5593,23.0799,436
-12.5797,-10.0518,13.861,23.7507,-10.0518,8.1518,23.1414,6.9575,437
-66.2356,-9.7524,-16.8859,30.5325,-9.7524,3.1541,41.0343,30.9518,438
-26.9865,-10.2973,-6.773,11.0265,-10.2973,10.1628,34.6156,13.8678,439
-24.1173,-9.9735,-1.3106,11.8902,-9.9735,7.4497,27.4498,15.1088,440
-17.1346,-9.8589,-4.864,10.1349,-9.8589,8.7355,21.1351,15.2177,441
-76.1658,-9.9426,17.1432,66.8522,-9.9426,24.8626,63.6263,37.0658,443
-10.39,-9.9158,11.8372,23.538,-9.9158,11.9735,33.4949,15.3155,444
-9.2131,-9.9304,-1.0944,3.5097,-9.9304,3.5873,11.3009,9.4916,445
-12.5015,-6.7922,-0.9559,10.8762,-6.7922,6.5782,59.4251,10.2284,446
-55.9369,-8.4003,-2.9889,16.5517,-8.4003,10.2283,44.6005,18.3471,448
-66.8401,-9.8662,-7.6424,21.3511,-9.8662,15.71,53.1167,20.4179,449
-82.1403,-9.4038,-14.0956,49.6487,-9.4038,20.372,40.9885,27.6244,450
-65.5546,-9.6524,14.5261,36.2621,-9.6524,17.2836,58.8729,14.4333,454
-5.6993,-10.6658,6.3217,9.3484,-10.6658,8.2674,27.869,16.9235,455
-10.7447,-9.7462,16.7152,22.3862,-9.7462,14.9946,42.7628,25.9619,456
-12.7033,-9.6998,5.3334,10.8738,-9.6998,3.2101,27.874,17.2495,457
6.6483,-9.886,14.9101,6.4594,-9.886,1.4021,22.7887,19.0557,458
-7.5517,-10.0279,7.6848,8.1989,-10.0279,11.0213,31.3801,25.4981,459
-16.2278,-9.8206,4.0107,10.836,-9.8206,7.6678,27.8915,11.7235,460
-12.9696,-10.0472,-1.3573,6.4958,-10.0472,2.6445,19.172,15.3917,461
-25.8577,-9.7711,-4.4692,7.7896,-9.7711,4.597,54.8916,40.9176,463
-10.3591,-9.8103,-1.7666,4.8565,-9.8103,5.0116,21.4157,12.7671,464
-2.7322,-9.837,4.3865,4.8866,-9.837,4.5122,14.7801,11.0858,465
-23.2318,-9.6457,-0.3756,10.155,-9.6457,6.3918,27.3175,14.2061,466
-2.7797,-10.4449,-1.0434,1.4507,-10.4449,1.8682,9.8038,8.3283,467
-5.45,-9.8776,13.6145,13.4385,-9.8776,9.8143,44.3658,17.7956,468
0.2267,-9.7922,11.9401,10.3387,-9.7922,9.6529,21.6577,15.2961,469
-11.4219,-9.9146,14.3606,22.2286,-9.9146,13.6224,26.3356,23.7501,470
-15.0901,-10.018,-0.2753,8.2784,-10.018,4.0514,21.3143,17.6478,471
-5.0051,-9.9311,19.8877,26.4766,-9.9311,14.8902,37.7308,24.6751,473
-16.05,-9.9125,0.0159,5.1032,-9.9125,7.0056,23.9474,9.3764,474
-4.9774,-10.2211,0.2403,3.3403,-10.2211,3.5382,16.1814,5.9286,475
-7.2899,-9.9702,-0.027,8.1752,-9.9702,5.1151,20.0133,15.3455,476
0.0538,-9.3654,10.3063,5.2409,-9.3654,9.3239,19.3948,16.9494,477
-20.4982,-10.1912,2.5017,11.0911,-10.1912,11.0217,22.9001,13.3214,478
-1.5451,-9.9122,2.7853,3.3314,-9.9122,4.3254,11.6475,7.5607,479
-4.9735,-9.946,0.5507,3.2316,-9.946,3.5229,12.3981,5.3828,480
-4.8279,-10.3053,1.5954,4.6064,-10.3053,3.5751,13.0151,10.5219,481
-8.0074,-9.9193,0.0995,2.9102,-9.9193,1.599,9.5918,6.2539,483
-8.623,-9.8402,1.6434,6.8896,-9.8402,5.4953,16.0447,8.6405,484
-4.4096,-10.4176,-1.7904,1.8315,-10.4176,2.0721,33.7658,32.8485,485
-3.0129,-9.4496,4.4792,7.1719,-9.4496,3.7427,21.3201,19.0785,486
-1.8264,-9.5792,0.27,1.2653,-9.5792,3.3515,24.2043,18.2067,487
-7.8125,-9.993,2.642,5.1603,-9.993,1.0813,18.8867,16.0409,488
-4.1982,-9.8355,-1.4289,1.8077,-9.8355,3.3653,43.7793,42.2932,489
-19.5299,-9.9425,12.7919,19.781,-9.9425,10.9024,39.5516,29.117,490
-7.1734,-10.3864,0.3401,4.6919,-10.3864,6.4408,38.2779,37.1099,491
-3.1171,-9.7715,5.042,4.7788,-9.7715,1.4385,14.7909,8.8362,493
-22.7711,-9.961,6.0857,13.1133,-9.961,13.7442,61.2445,37.4777,494
-5.5431,-10.0879,4.8859,6.128,-10.0879,1.094,30.8927,24.5091,495
-3.6978,-10.0289,-0.1352,2.6783,-10.0289,1.2485,21.4504,19.7054,496
-14.0145,-9.7179,7.6076,17.1587,-9.7179,2.5301,30.6299,17.4758,497
-11.843,-9.9437,-0.4241,5.9044,-9.9437,5.0895,18.8646,16.5015,498
-23.701,-9.8888,4.1878,18.7289,-9.8888,4.2808,62.8143,41.669,499
-35.9384,-10.0185,2.862,19.0633,-10.0185,7.7991,50.4735,20.7568,500
-9.5964,-10.0886,10.7445,9.5618,-10.0886,6.4871,93.4888,43.6695,502
-16.4413,-9.8637,12.3142,27.9035,-9.8637,16.7101,124.0145,18.4102,503
-9.0956,-9.8861,0.3391,7.118,-9.8861,10.9228,27.7756,22.9123,504
-17.272,-9.8996,-2.4243,8.2977,-9.8996,4.7195,18.6286,8.443,505
-8.0744,-10.0864,-0.6985,3.2947,-10.0864,4.4911,13.4588,8.8698,506
-6.1155,-9.7854,0.3118,2.4986,-9.7854,3.1512,19.6635,10.5126,508
-3.0567,-9.9283,0.7594,2.2469,-9.9283,5.7266,28.0992,14.5121,509
-3.1236,-10.132,0.2937,2.3976,-10.132,1.2596,28.7009,25.8088,510
-6.0107,-10.9424,-0.2714,3.5546,-10.9424,1.3027,33.7534,27.2942,511
-2.7112,-9.9368,0.1893,1.8494,-9.9368,2.284,26.2391,24.4359,512
-14.1092,-9.7333,1.668,8.4594,-9.7333,4.1882,17.6142,15.2751,513
-6.3457,-9.4507,5.643,12.8006,-9.4507,8.3074,24.5038,17.3066,514
-16.9451,-9.7636,4.7039,14.4574,-9.7636,11.283,36.7517,23.1357,515
-7.2838,-10.2795,1.3515,7.8538,-10.2795,8.779,25.1234,14.5545,516
-4.0869,-9.7617,1.9767,5.318,-9.7617,4.5037,13.6736,6.4969,518
-20.0196,-9.7198,2.0962,10.4255,-9.7198,8.0025,20.6135,9.6031,519
-15.5729,-9.8169,-2.1482,9.9033,-9.8169,3.9596,12.9142,9.0244,520
-6.3388,-9.9508,2.2794,6.6517,-9.9508,4.7672,12.6325,10.2017,521
-9.2502,-7.8257,0.0588,9.0241,-7.8257,3.9478,27.349,9.8193,522
0.821,-10.568,18.45,13.8152,-10.568,17.4693,42.7048,33.6951,523
-0.4097,-10.2926,11.5184,8.2525,-10.2926,14.3875,41.8147,29.0107,524
-15.3832,-9.9837,12.1418,26.2557,-9.9837,13.8581,37.1082,31.189,525
-55.4031,-8.1125,-0.4849,20.6274,-8.1125,9.2221,54.2296,18.2589,526
-12.2505,-9.4386,27.4883,43.6097,-9.4386,15.1325,84.4424,42.1263,528
-14.1332,-9.8076,-0.487,5.0356,-9.8076,5.5849,36.0256,10.4656,529
-2.7261,-9.8698,3.81,4.9486,-9.8698,6.4709,21.9025,15.6877,530
-24.1226,-10.0685,1.0074,10.5324,-10.0685,3.3842,46.0341,35.3188,531
-6.841,-9.9893,13.2598,21.9052,-9.9893,9.6071,76.4248,43.8623,532
-43.4195,-9.8783,1.0377,16.5319,-9.8783,10.381,34.8291,16.3276,533
-79.0018,-9.6989,-6.5462,25.0902,-9.6989,12.094,27.7364,9.1039,534
-10.9456,-9.7036,19.0487,15.1327,-9.7036,10.6496,30.5654,16.5227,536
-82.6963,-9.5194,-5.0794,17.7003,-9.5194,5.3236,23.3859,4.072,537
16.3367,-9.4769,36.7022,16.043,-9.4769,5.4376,21.1459,11.6888,538
-16.4964,-9.9053,-5.4204,6.8255,-9.9053,4.4949,12.5019,5.9598,539
-1.6341,-9.8467,-0.0706,1.8472,-9.8467,2.142,6.0773,2.3864,540
0.0097,-9.8503,0.9568,0.8929,-9.8503,1.1426,4.0166,2.6585,541
-0.7837,-9.8555,-0.5102,0.2489,-9.8555,0.4575,2.3599,2.0334,543
0.2914,-9.8463,0.9309,0.3982,-9.8463,0.9267,3.7697,2.8798,544
-2.4309,-9.8715,0.9071,2.3421,-9.8715,3.4552,22.1914,10.8099,545
-1.0008,-9.8283,0.0061,0.8873,-9.8283,1.3752,16.7758,14.033,546
-12.3589,-9.8115,-0.9645,7.8438,-9.8115,2.3683,36.4585,35.7948,547
-2.1322,-9.6884,2.0688,5.0328,-9.6884,3.4084,23.9943,17.243,548
-6.9388,-9.9137,-1.2947,3.2171,-9.9137,5.268,43.5939,27.4046,549
-8.9472,-9.944,0.4706,3.6492,-9.944,1.9884,27.0672,14.661,550
-4.7825,-9.9639,-1.1555,2.7321,-9.9639,1.441,9.0978,5.983,551
-8.4405,-10.116,0.9993,5.6501,-10.116,7.8959,38.9343,28.9859,553
-3.757,-10.1076,1.6722,3.8356,-10.1076,6.8287,46.7432,34.1338,554
-2.1551,-9.9333,2.104,4.569,-9.9333,2.1048,44.8849,43.0297,555
-12.97,-9.451,11.719,17.2626,-9.451,4.6438,23.2466,13.4385,556
-0.7662,-9.651,0.0615,0.5778,-9.651,0.8716,8.8463,8.0191,557
-4.2996,-10.0242,0.0048,1.8156,-10.0242,1.0502,16.7012,14.1734,558
-1.146,-10.7043,1.0136,2.0519,-10.7043,1.8229,29.8044,16.1426,559
-4.2211,-9.7181,1.0608,4.0124,-9.7181,3.1093,20.8628,9.0536,560
-3.3883,-9.5411,-1.474,1.1158,-9.5411,3.9359,20.8836,14.4172,561
-5.6103,-9.6503,16.9278,13.4418,-9.6503,8.4405,37.9776,26.7614,563
-11.1594,-10.0056,5.3386,11.412,-10.0056,13.2815,35.7198,18.7481,564
-6.8354,-9.8013,-0.7175,3.367,-9.8013,5.4108,15.9972,5.7231,565
-18.1229,-9.9454,2.0741,19.058,-9.9454,6.636,34.8523,17.6983,566
-0.7454,-10.348,0.7004,1.2587,-10.348,2.308,23.5863,11.8054,567
-33.3748,-9.9637,4.753,19.9023,-9.9637,12.2816,37.9825,22.693,569
-17.6937,-9.5468,11.3409,25.8232,-9.5468,14.6539,43.3104,32.7483,570
-2.645,-10.0249,0.1488,1.264,-10.0249,1.8867,10.0069,7.4275,571
-6.46,-9.6283,1.0266,5.9456,-9.6283,6.0484,19.128,10.3247,573
-35.1312,-9.8927,-1.4934,9.2433,-9.8927,8.084,24.4138,11.1657,574
-5.2696,-9.931,-0.3435,4.1667,-9.931,1.0442,8.7063,7.0428,575
-15.7905,-9.8282,12.3758,20.967,-9.8282,5.6542,31.4004,28.2761,576
-12.4603,-9.7712,-0.377,7.1262,-9.7712,8.4019,40.0297,37.1007,577
-4.0319,-9.8736,1.5419,5.9477,-9.8736,9.8232,39.7136,21.9972,578
-18.6354,-10.5024,-2.8072,7.3165,-10.5024,9.1354,34.7908,31.2014,579
-13.1909,-10.1662,0.5026,6.4901,-10.1662,10.8395,50.6327,22.8685,580
-44.9679,-10.7274,7.6105,36.8304,-10.7274,20.8056,70.1713,44.1117,581
-5.3598,-10.2762,1.6338,4.6285,-10.2762,6.4648,42.2681,39.8001,583
-22.8432,-9.3665,2.9385,12.8394,-9.3665,7.8666,52.6142,18.4675,584
-19.8259,-10.0006,-3.4104,9.9488,-10.0006,10.9656,44.7631,32.7504,585
-19.3121,-9.9185,4.932,13.4412,-9.9185,7.41,30.5954,25.6481,586
-2.9154,-9.8303,5.2032,5.3212,-9.8303,2.6913,22.0841,12.1848,587
-16.7722,-9.6617,0.5251,14.4442,-9.6617,4.9633,27.9874,25.9254,588
-6.3521,-10.0752,7.1786,9.2045,-10.0752,4.9962,27.0069,18.054,589
-23.6676,-9.6244,-0.1093,9.7314,-9.6244,5.9642,22.1993,11.3428,590
0.4573,-9.6706,19.0219,19.2967,-9.6706,10.3571,30.1521,20.5912,591
-4.5816,-9.8551,3.8537,6.4419,-9.8551,7.5394,20.6925,15.7815,593
-6.3622,-9.6064,2.5803,5.761,-9.6064,6.4108,20.2286,11.0586,594
-10.6355,-9.9337,0.0391,4.6086,-9.9337,2.4555,12.6798,6.8366,595
-2.4536,-9.5828,2.0726,2.8422,-9.5828,1.4347,11.1941,9.2387,596
-0.5621,-10.0804,5.4412,4.7509,-10.0804,7.9496,18.4306,14.1997,597
-4.394,-9.8953,-0.5921,2.7614,-9.8953,4.3563,19.8994,8.9797,598
-1.6209,-10.0868,1.2482,2.7152,-10.0868,2.4938,11.2138,9.0949,599
-1.1607,-10.04,0.3538,0.8572,-10.04,2.0093,8.8214,5.2038,600
-7.5497,-10.0571,-0.9251,4.2836,-10.0571,2.6072,14.0274,10.7539,601
-5.6525,-9.5563,0.5671,4.5705,-9.5563,7.69,15.8602,13.2989,603
-56.0556,-9.9398,7.5251,27.0779,-9.9398,17.0112,55.0562,16.3744,604
-8.1666,-9.6232,-1.6245,2.933,-9.6232,3.1781,24.7826,18.0003,605
-13.3412,-6.1034,-2.932,4.8239,-6.1034,4.8419,32.1925,15.1293,606
-27.1146,-10.1009,-0.5984,15.6541,-10.1009,6.6845,30.4087,24.2047,607
-14.5236,-9.489,4.7734,12.0527,-9.489,5.7055,27.8573,25.0323,608
0.6041,-9.8299,8.9801,6.9641,-9.8299,2.4368,17.1659,12.52,609
-12.9306,-9.6972,0.7523,7.2739,-9.6972,10.3598,26.3412,16.8468,610
-4.3992,-9.5835,9.9446,15.5543,-9.5835,10.6906,28.2623,23.6401,611
-30.1039,-9.8081,9.3623,20.8376,-9.8081,10.7554,37.8293,25.8166,613
-11.0516,-9.5411,6.6687,10.6986,-9.5411,2.9827,23.2596,14.4569,614
-21.6907,-9.8288,6.1949,21.9255,-9.8288,3.5764,37.7375,34.1632,615
-23.2859,-9.8051,-4.4305,8.1791,-9.8051,5.5838,26.5749,18.3455,616
-19.3116,-9.4552,-3.4351,7.8582,-9.4552,6.9597,23.9735,9.4216,617
2.02,-9.5791,25.7454,28.0289,-9.5791,10.8907,33.808,22.0703,618
-7.9103,-10.4399,10.2689,12.3469,-10.4399,13.828,30.1478,26.9896,619
-3.947,-9.8754,0.1766,2.1185,-9.8754,4.914,23.2826,8.5992,620
-4.555,-9.5682,1.624,5.3099,-9.5682,6.3308,16.2822,15.2682,621
-3.8529,-9.8663,1.0745,3.2579,-9.8663,4.2521,23.3351,7.3978,623
-5.7623,-10.1041,2.057,5.0764,-10.1041,6.8144,21.685,12.2254,624
-6.3942,-9.8401,0.4648,4.2135,-9.8401,1.8894,16.0908,12.0975,625
-1.8007,-9.858,4.3059,6.4486,-9.858,1.9755,23.5201,22.0876,626
3.9455,-9.7417,24.4223,14.6313,-9.7417,1.7836,34.3526,33.4775,627
-8.9878,-9.8498,20.5779,18.7886,-9.8498,26.5898,46.14,35.0358,629
-12.1727,-9.473,10.3257,13.4498,-9.473,8.1995,34.0126,21.3259,630
0.5905,-9.9083,4.1452,2.1047,-9.9083,1.7793,16.7267,12.2697,631
-4.5711,-9.8366,0.1057,2.191,-9.8366,3.5417,19.4223,14.9262,633
-7.719,-9.9121,1.5958,5.9114,-9.9121,5.8614,40.2163,13.3049,634
-2.5051,-10.0748,0.3466,1.8848,-10.0748,0.8574,38.2921,33.1118,635
-2.4897,-9.7872,0.2244,1.6626,-9.7872,1.1013,13.8976,10.8836,636
-17.046,-9.8161,-1.9916,8.2955,-9.8161,2.5439,35.3305,30.65,637
-9.1955,-10.0289,-2.0111,5.2213,-10.0289,11.7317,38.7754,35.5739,638
-0.5313,-9.7571,3.1377,2.5105,-9.7571,3.1823,29.179,15.1332,639
-10.1825,-9.7384,4.8044,8.3705,-9.7384,2.1654,26.9922,16.8405,640
0.0609,-9.974,1.7034,1.6479,-9.974,4.4452,8.8764,6.7636,641
-0.9164,-9.8065,0.2924,1.1207,-9.8065,1.6273,10.2044,7.9064,643
-13.1887,-9.7904,1.1368,6.1772,-9.7904,6.9547,23.8904,13.6928,644
-3.1369,-9.9757,0.9074,2.283,-9.9757,5.3768,15.4414,8.3898,645
-8.0552,-9.7632,1.3907,6.9512,-9.7632,7.1625,24.5752,10.3311,646
-3.966,-9.5482,1.6972,6.0925,-9.5482,6.1338,21.7829,20.418,647
6.0919,-9.8765,19.2238,10.0886,-9.8765,5.0389,35.7548,27.0011,648
-6.4706,-9.9235,9.907,12.924,-9.9235,2.1627,19.0837,17.4631,649
-1.8792,-9.5874,1.5081,2.0681,-9.5874,2.9833,11.1232,7.7742,650
-6.8457,-9.4558,-2.1608,2.8879,-9.4558,3.7728,17.3544,9.19,651
-2.2996,-10.0677,0.713,3.3896,-10.0677,1.3555,15.1991,12.936,653
-12.2839,-9.8855,1.0279,8.2841,-9.8855,9.4084,20.8608,13.5591,654
-1.6944,-9.8796,2.476,4.5933,-9.8796,2.5654,11.5681,9.8252,655
-7.5344,-9.7748,-1.9562,2.8297,-9.7748,5.3354,22.7485,14.5168,656
-8.215,-10.0945,-0.206,3.6938,-10.0945,7.2062,17.989,15.7019,657
-13.1331,-9.5732,0.194,7.0852,-9.5732,1.9612,25.6105,21.6798,658
-4.8243,-7.1498,15.0018,16.2143,-7.1498,8.5038,36.2991,32.8949,659
-6.4085,-9.7084,0.7447,3.2559,-9.7084,4.7638,22.2101,13.8456,660
-4.8756,-10.1561,0.1083,3.7437,-10.1561,1.9857,13.9548,10.9429,661
-2.4612,-9.8269,3.1713,6.629,-9.8269,5.9284,18.0987,11.3137,663
-23.3445,-9.7772,0.4061,6.1158,-9.7772,6.2964,16.9507,11.0622,664
-6.2068,-10.0334,2.5416,7.1952,-10.0334,1.4062,14.9621,11.591,665
-13.0932,-10.2952,4.2037,12.945,-10.2952,2.0983,22.4244,20.9824,666
-3.9175,-9.797,0.142,2.8743,-9.797,3.9498,10.1747,6.2021,667
-7.0263,-10.0686,4.2106,13.1961,-10.0686,16.9816,57.0353,39.5061,668
-11.9139,-9.7107,15.4198,25.8335,-9.7107,17.7469,48.9845,29.943,669
-3.8907,-9.8231,7.6904,12.1527,-9.8231,11.3973,29.0205,19.0042,670
-11.5576,-10.311,-3.3253,3.7826,-10.311,3.9031,18.1429,10.2104,671
-1.157,-9.8399,5.2261,6.9416,-9.8399,7.7397,24.3098,15.6098,673
-9.649,-9.89,3.4407,8.8771,-9.89,10.8464,35.6571,14.674,674
-1.2316,-9.8029,12.184,7.4913,-9.8029,2.1959,31.0082,18.9369,675
-0.6418,-9.6742,0.3579,0.6188,-9.6742,0.4776,6.6806,4.7864,676
-4.7538,-9.9267,0.658,3.6895,-9.9267,1.942,13.769,10.6968,677
-1.5956,-9.504,0.2219,1.401,-9.504,2.4267,17.6593,15.0424,678
-0.4435,-10.021,0.6049,1.6262,-10.021,4.2449,11.5465,7.7112,679
-2.7798,-9.9351,2.7189,3.4214,-9.9351,6.7644,19.8714,13.9595,680
-8.4234,-9.5811,-2.5096,3.4179,-9.5811,1.8846,14.0398,10.5084,681
-1.7824,-9.7561,1.7052,1.9138,-9.7561,2.6742,14.2564,11.3296,683
-9.6868,-9.9136,4.4613,11.6569,-9.9136,9.8222,35.7431,18.1511,684
-28.5861,-9.8278,-1.7475,9.9994,-9.8278,4.419,28.9109,17.7723,685
-4.7756,-10.1711,2.0865,4.721,-10.1711,6.059,47.1202,45.3855,686
-5.018,-9.9906,0.9032,5.8378,-9.9906,6.0512,34.4699,27.0183,687
-9.8846,-9.5433,1.5724,5.4825,-9.5433,7.8387,28.5827,20.6124,689
-6.3365,-9.9267,5.0838,9.0526,-9.9267,5.534,27.9574,23.0956,690
-8.6682,-10.0927,-2.1066,3.7517,-10.0927,4.6298,31.9402,28.2819,691
-1.1955,-9.6037,-0.1177,0.6514,-9.6037,1.0572,11.4832,7.3576,693
-16.0928,-9.9093,2.7974,9.9592,-9.9093,9.9475,35.6532,16.0123,694
-0.2757,-10.3692,13.133,11.5388,-10.3692,4.2251,22.4865,19.8389,695
-6.9037,-9.6781,17.0408,16.0617,-9.6781,1.9348,33.4355,29.0438,696
-9.3322,-9.6386,1.5669,6.4073,-9.6386,7.0323,31.4111,20.9186,697
-2.8856,-10.0705,1.7932,3.3437,-10.0705,3.2971,39.4303,32.2644,698
-3.535,-9.904,-0.429,2.1335,-9.904,2.111,28.5547,25.7533,699
-4.0316,-9.2902,0.741,1.9609,-9.2902,2.5785,16.9922,8.3358,700
-0.3686,-9.816,-0.0329,0.1851,-9.816,0.7137,2.8618,1.412,701
-0.5373,-9.9197,-0.0403,0.2987,-9.9197,0.7545,4.1076,2.4111,703
-15.6028,-9.7818,1.4585,6.8645,-9.7818,6.2803,24.8116,10.8673,704
-0.2284,-9.999,1.4527,1.8027,-9.999,1.8111,16.8076,9.7667,705
-4.0929,-9.8834,0.1661,1.9351,-9.8834,2.2794,8.8198,5.0994,706
-0.3219,-10.0919,1.0994,1.5871,-10.0919,1.8955,9.1693,6.1452,707
-0.876,-9.7456,0.067,0.5788,-9.7456,1.1662,11.2878,4.6769,710
-2.5716,-9.7814,0.1533,1.6239,-9.7814,2.3849,11.785,9.258,711
-2.2969,-9.7842,1.2985,3.2574,-9.7842,5.1461,14.4155,7.3644,713
-5.3672,-9.9677,0.1321,1.5414,-9.9677,3.3061,11.4012,5.5987,714
-5.5113,-8.5357,0.251,4.2921,-8.5357,2.5614,18.9525,10.7065,715
-4.3339,-9.4842,2.5618,4.5476,-9.4842,1.7751,18.2574,14.5939,716
-3.4376,-10.0046,0.6743,2.7747,-10.0046,1.0864,7.9524,6.8259,717
-5.3342,-9.9765,0.2189,4.3276,-9.9765,1.5952,12.183,9.4537,718
-11.8392,-10.2986,2.7552,7.9352,-10.2986,4.4731,13.6587,10.2476,719
-3.5987,-9.9005,0.3273,2.2425,-9.9005,3.419,15.5257,9.6613,720
-7.8798,-8.5247,0.8713,8.9598,-8.5247,3.0074,16.9675,12.7168,721
-10.9615,-10.1789,-0.6425,6.3956,-10.1789,2.3898,13.0529,11.2504,723
-9.615,-9.9419,1.2397,4.6933,-9.9419,6.365,27.6745,9.2085,724
-0.6572,-9.9262,1.996,2.5319,-9.9262,3.9309,11.5787,10.1179,725
-11.6404,-10.1124,-0.1025,5.6325,-10.1124,2.2529,14.4945,11.9527,726
-6.119,-8.9798,12.0513,11.3963,-8.9798,3.7643,29.3724,28.2258,727
-15.1891,-9.8103,7.9148,15.3189,-9.8103,4.5658,26.2125,24.6572,728
-2.7022,-9.635,0.8267,3.4162,-9.635,2.5155,13.2797,12.0694,729
-2.4432,-9.8919,0.5256,2.1408,-9.8919,3.4293,10.8958,8.7214,730
-1.0019,-10.0304,1.5161,1.9696,-10.0304,3.3592,12.1553,10.8411,731
-1.8634,-9.7533,1.6168,2.6823,-9.7533,3.4899,13.5956,9.8988,733
-36.5236,-9.7189,3.5492,13.6033,-9.7189,10.9925,32.8947,15.2277,734
-4.2863,-9.6599,4.4097,7.366,-9.6599,8.4033,29.9791,25.9767,735
-8.7054,-9.8327,3.6553,7.289,-9.8327,4.8658,17.7618,12.2774,736
-15.9766,-10.4701,-2.2365,6.932,-10.4701,7.0851,20.1794,9.436,737
-3.0819,-10.672,1.1962,3.3939,-10.672,8.0153,23.7812,21.5424,738
-1.6982,-10.5069,0.3458,1.3662,-10.5069,3.9141,11.1872,9.8627,739
-3.7228,-10.1117,2.2876,4.6708,-10.1117,11.0677,33.8194,20.8442,740
-4.573,-10.1126,3.864,6.7348,-10.1126,7.2277,29.2063,28.0224,741
-1.0648,-9.8919,0.5094,1.1327,-9.8919,3.4449,19.5768,14.4304,743
-7.211,-9.9506,0.1261,3.006,-9.9506,3.6603,20.5801,11.7428,744
-3.3532,-9.8095,-0.4833,1.4392,-9.8095,1.0301,14.6564,7.5804,745
-1.365,-9.8274,0.4967,1.3685,-9.8274,1.1498,8.0628,6.4533,746
-0.0244,-9.8472,0.3323,0.404,-9.8472,0.9037,25.9759,20.3292,747
-4.474,-10.1342,1.6383,3.5526,-10.1342,5.3422,56.1639,51.9253,749
-7.6102,-9.5307,1.6217,4.3545,-9.5307,5.3781,26.9181,22.2948,750
-2.9565,-10.0822,-0.1342,1.2399,-10.0822,1.5768,9.4335,7.5799,751
-21.5986,-9.5533,3.8007,11.9154,-9.5533,3.3683,19.3891,16.2835,753
-21.6397,-9.8895,2.7699,9.1212,-9.8895,7.7288,32.8685,15.3429,754
-15.5171,-9.9588,3.2403,10.2011,-9.9588,6.7703,30.3581,20.4101,755
1.3169,-10.1252,7.7414,4.9588,-10.1252,1.6165,33.54,28.8336,756
-8.4056,-10.2079,1.6471,7.2862,-10.2079,2.6444,39.4968,32.0358,757
-22.8508,-10.1568,7.9934,26.3443,-10.1568,7.2831,25.9497,18.7858,758
-1.3301,-9.7651,0.1212,1.0697,-9.7651,1.8829,5.0695,3.4365,759
-5.3098,-9.9013,3.031,5.1126,-9.9013,7.5626,19.7281,10.4109,760
-11.7911,-9.9546,1.1182,9.4725,-9.9546,1.1355,20.8804,17.9914,761
-1.801,-9.6575,3.0208,3.8043,-9.6575,5.9429,19.6455,9.6647,763
-6.6733,-9.8947,5.1327,6.9995,-9.8947,13.0678,39.9537,22.3052,764
-2.6244,-9.9414,0.3957,1.7918,-9.9414,4.0328,21.4777,20.5779,765
-3.898,-9.9459,-0.6693,1.2598,-9.9459,4.0762,17.8575,13.1748,766
-2.9103,-10.1021,2.335,4.3877,-10.1021,6.4593,27.0547,20.3105,767
0.0837,-9.7033,1.2967,0.9849,-9.7033,0.8505,14.0546,8.9526,768
-2.2262,-9.9119,-0.4957,0.7961,-9.9119,1.7736,22.9704,18.2668,769
-5.5521,-9.8693,0.4989,3.4398,-9.8693,1.6418,21.6598,11.6191,770
-4.1065,-10.3177,-1.0946,1.6377,-10.3177,1.5743,48.8294,40.9694,771
-19.1002,-9.4747,11.7583,22.1278,-9.4747,2.4841,45.7274,42.9214,773
-6.5025,-9.9503,4.6103,6.0853,-9.9503,12.0281,38.5324,20.7044,774
6.906,-9.4909,24.1992,11.3187,-9.4909,2.1074,32.0744,26.8948,775
-5.7673,-10.021,-1.3524,2.2935,-10.021,4.7406,28.363,23.1452,776
-3.0982,-10.0525,2.2695,4.7248,-10.0525,2.1123,18.5069,13.7938,777
-2.0777,-9.8102,0.7877,1.3901,-9.8102,0.4831,6.734,5.8833,778
-2.9427,-9.7046,3.1586,2.9039,-9.7046,1.5966,15.7358,13.3187,779
-9.7479,-9.7485,4.5987,7.7165,-9.7485,2.0023,23.4321,17.7851,780
-0.7794,-9.7455,18.1431,11.2753,-9.7455,6.0136,41.9675,38.6437,781
-27.4099,-9.6083,22.0194,20.8438,-9.6083,4.7164,57.0485,41.3745,783
1.1901,-9.9415,27.6017,31.855,-9.9415,10.7337,36.267,30.8738,784
-3.1763,-10.0281,3.8692,4.092,-10.0281,0.7127,22.2891,19.4972,785
-0.0524,-10.0661,8.1647,7.2066,-10.0661,6.1392,29.9127,27.2019,786
-0.1148,-10.0388,2.3411,2.5726,-10.0388,1.8656,14.0236,11.01,787
-2.1216,-9.8884,9.5618,10.3904,-9.8884,2.5941,20.2169,17.742,788
-1.5645,-9.8209,0.6869,1.2849,-9.8209,1.5415,10.0087,8.0594,789
-6.0667,-9.7615,2.9476,6.0426,-9.7615,7.1999,23.8106,17.6784,790
-25.5763,-10.5301,4.0203,19.4676,-10.5301,3.7818,29.2497,23.1936,791
-4.0561,-10.2406,13.2356,20.7511,-10.2406,5.3892,32.5346,27.4394,793
1.3457,-10.3573,28.742,25.4612,-10.3573,10.3642,40.9623,37.2476,794
-9.4149,-10.9603,15.7954,26.0378,-10.9603,18.6471,49.4112,47.9834,795
0.9667,-9.6959,41.8456,24.3529,-9.6959,9.4341,51.2109,49.2337,796
-1.9704,-9.696,14.103,10.2954,-9.696,5.2266,29.9948,25.8034,797
-1.6504,-9.8452,3.4485,5.7037,-9.8452,3.1175,13.9763,7.2502,798
-18.21,-9.884,26.1152,41.0188,-9.884,21.1288,50.463,33.6932,799
-10.7657,-10.2067,-1.1135,6.8963,-10.2067,12.6024,48.523,31.3432,800
-1.6128,-10.499,8.0143,11.9414,-10.499,13.3455,42.4773,41.83,801
-1.9518,-10.8107,-0.4563,0.8969,-10.8107,0.695,15.4698,4.6285,803
-20.3148,-9.9124,3.1395,10.7827,-9.9124,12.0856,34.4322,22.0393,804
-0.132,-9.9226,16.9766,8.5374,-9.9226,2.0577,21.613,20.4994,805
-13.6087,-9.7247,-1.4105,8.7571,-9.7247,6.2652,26.8835,21.5366,806
-10.5566,-9.0698,3.1326,10.7146,-9.0698,14.6409,34.081,25.5868,807
-63.4419,-9.7305,-6.6348,24.6256,-9.7305,12.7198,42.0575,14.5108,809
-27.3341,-9.9313,0.052,8.4296,-9.9313,6.0598,20.6355,12.9946,810
-12.6871,-10.0247,-1.164,10.7274,-10.0247,2.1694,21.2181,15.6817,811
-1.6069,-9.4488,-0.5142,0.8052,-9.4488,1.8038,11.6827,6.9147,813
-2.9369,-9.7495,0.1939,1.2029,-9.7495,2.4266,17.2987,5.6508,814
-6.2963,-7.9418,-0.0369,4.7637,-7.9418,1.6788,20.6047,13.1336,815
-8.2022,-6.3274,1.3419,4.7175,-6.3274,7.5429,32.8572,16.1101,816
-15.6928,-9.8766,-1.9869,7.2594,-9.8766,4.977,15.7792,12.9156,817
-0.6268,-9.7854,0.8273,1.4462,-9.7854,3.3739,22.8617,7.4732,818
-24.1414,-9.7582,20.603,48.0409,-9.7582,27.1236,72.3115,53.7363,819
-36.0014,-10.1447,77.8656,77.974,-10.1447,33.809,87.1625,66.8679,820
-2.2582,-10.5452,41.3054,56.9351,-10.5452,25.5513,62.5822,60.8347,821
11.6663,-10.248,71.5194,45.5432,-10.248,12.2152,54.1978,45.6884,823
-6.6209,-10.0094,3.3174,8.054,-10.0094,9.1625,30.1985,19.7952,824
-0.3121,-10.0633,6.173,7.9828,-10.0633,5.929,13.7593,12.5245,825
-9.7428,-9.9121,3.0252,5.476,-9.9121,7.4449,20.4147,13.3587,826
-8.2046,-9.988,0.6041,6.2963,-9.988,3.955,27.621,24.4776,827
-8.2504,-9.8751,2.4332,8.2426,-9.8751,1.6975,31.1815,25.955,828
-4.9016,-9.8782,-0.0959,4.7691,-9.8782,0.6579,15.7856,9.4468,829
-15.8415,-10.0251,12.3712,15.517,-10.0251,9.773,65.9957,48.5118,830
-10.7834,-9.8869,-3.1294,4.4729,-9.8869,3.773,35.9558,33.4307,831
-3.7989,-10.1314,1.5074,3.7695,-10.1314,6.5442,34.4049,29.67,833
-10.2357,-9.7581,1.308,6.6099,-9.7581,9.0254,28.6154,11.5366,834
-22.0817,-9.8591,28.8179,41.6277,-9.8591,19.2953,46.1983,37.8631,835
-1.5568,-9.9133,24.426,15.4678,-9.9133,5.4648,32.8414,25.1803,836
-2.771,-10.0051,3.7701,5.7873,-10.0051,4.4287,47.7084,30.5778,837
-8.4427,-10.111,3.1613,10.0124,-10.111,3.6089,48.9356,36.724,838
-17.6548,-9.7981,-0.4914,9.9608,-9.7981,2.7762,24.7579,19.7404,839
-11.6375,-10.3487,2.9644,8.9571,-10.3487,6.938,51.0874,43.908,840
-7.8741,-9.8909,-2.5553,3.4193,-9.8909,5.5991,34.4033,32.8473,841
-3.8365,-10.2749,2.2338,5.738,-10.2749,6.786,35.0244,31.2162,843
-21.5274,-9.9936,8.416,18.0298,-9.9936,12.3822,36.6266,28.0848,844
-25.8853,-10.0113,16.3471,23.6595,-10.0113,7.1584,43.4371,33.1958,845
-22.6761,-9.5744,-2.361,11.1274,-9.5744,6.0047,20.6693,13.9894,846
-12.0336,-9.6817,1.2385,7.6436,-9.6817,8.4454,14.3329,13.2801,847
-17.8796,-9.6131,-1.3928,7.8861,-9.6131,6.0023,21.1245,16.1461,848
-0.4432,-9.7139,5.9272,7.0248,-9.7139,8.0602,16.6548,10.0797,849
-1.2159,-9.6117,5.4222,5.4149,-9.6117,4.2591,16.4018,12.2634,853
-15.3954,-9.8512,1.8608,7.7987,-9.8512,7.9647,24.2028,11.4469,854
-7.7718,-9.7862,6.5719,11.5684,-9.7862,4.1286,18.5187,12.7949,855
-16.7099,-9.5466,-2.7281,7.2847,-9.5466,3.407,27.6037,9.8153,856
-2.7764,-9.7558,11.3108,13.6632,-9.7558,6.4344,20.8186,18.9033,857
-16.0282,-9.2344,-0.6374,9.7858,-9.2344,5.3685,22.044,17.2385,858
-13.1969,-10.0884,0.8797,8.9773,-10.0884,2.2876,19.476,16.2592,859
-12.4221,-10.2689,0.5423,7.8879,-10.2689,3.118,38.033,23.8189,860
1.6638,-10.4543,8.4621,5.4313,-10.4543,1.9397,38.795,36.6112,861
-10.9548,-9.8856,13.6268,16.3083,-9.8856,11.3436,58.7238,27.4489,863
-100.344,-9.7136,11.5467,31.8696,-9.7136,21.1168,89.8969,46.2275,864
-4.9128,-10.3191,1.0824,6.8018,-10.3191,8.0302,41.5353,31.9598,865
9.0945,-10.3881,25.7494,24.0235,-10.3881,8.0814,51.3528,50.0173,866
-23.7256,-10.1036,3.2132,13.2617,-10.1036,6.247,45.9284,36.2833,867
-2.8031,-10.0157,15.1245,10.4211,-10.0157,5.0289,43.0368,40.6155,869
-20.2233,-9.6245,2.7982,15.3828,-9.6245,10.417,78.8767,50.048,870
0.1815,-10.3673,44.9967,23.2553,-10.3673,10.9152,57.881,43.991,871
-7.9421,-9.8892,-1.6302,3.889,-9.8892,3.8129,19.1243,10.0578,873
-19.255,-9.86,3.8599,13.3828,-9.86,10.1488,51.2034,18.0982,874
-8.9663,-9.6353,-1.1746,3.9247,-9.6353,2.6225,11.0955,7.9268,875
-41.3446,-10.0063,32.5527,42.8192,-10.0063,7.7742,41.1145,35.2553,876
-1.0659,-10.7922,41.8924,42.6924,-10.7922,13.6343,56.2614,50.5778,877
-3.2853,-9.2748,8.5965,11.5463,-9.2748,4.1257,26.9658,23.9135,878
-3.6173,-10.2257,-0.0047,3.3853,-10.2257,4.5311,24.5113,9.4344,879
-28.0416,-9.8461,6.4593,22.0233,-9.8461,15.4922,41.5153,20.4446,880
-6.9055,-9.9393,14.2418,21.6035,-9.9393,8.2343,33.7582,28.669,881
-2.4775,-9.9927,7.4072,15.6027,-9.9927,10.9758,34.9087,20.7839,883
-52.9627,-9.9111,16.6843,37.5503,-9.9111,27.8112,72.0922,36.0784,884
12.3194,-9.5742,83.1058,44.7791,-9.5742,17.9923,65.2581,52.6052,885
-50.2723,-8.3419,-4.5341,26.9787,-8.3419,6.1035,27.3161,21.3211,886
-16.4133,-9.9843,4.3767,15.5233,-9.9843,1.275,22.4541,18.4063,887
-30.5563,-9.8346,54.63,60.4983,-9.8346,15.7802,60.7945,54.6441,888
-6.8852,-9.8589,16.0145,16.2759,-9.8589,6.9458,46.7982,42.179,889
-2.9425,-9.7376,9.5942,13.1212,-9.7376,9.8327,32.3331,17.1125,890
-4.6896,-10.0438,5.063,5.6776,-10.0438,2.1652,16.4253,12.8034,891
-3.9049,-9.7456,4.5896,6.3492,-9.7456,5.2362,37.9745,31.5379,893
-11.5483,-9.4195,2.4088,11.3799,-9.4195,6.4866,49.3498,16.4855,894
-1.5447,-9.8694,1.0563,2.099,-9.8694,4.9458,26.4388,16.2505,895
-14.3853,-8.306,5.1931,11.9393,-8.306,11.4488,42.8166,29.5562,896
-14.2957,-9.999,5.8205,26.2278,-9.999,9.2521,54.7831,50.7588,897
-10.026,-9.7505,-1.8088,3.5125,-9.7505,2.6352,15.6326,7.4514,898
-14.3489,-9.8959,9.1167,13.0329,-9.8959,11.2661,41.2856,35.3283,899
-25.0283,-9.9571,36.3063,33.6752,-9.9571,8.4653,54.807,42.2447,900
-4.677,-9.6687,33.232,30.0194,-9.6687,7.4455,50.7923,49.091,901
1.346,-10.2471,31.0288,21.8761,-10.2471,5.1276,37.6134,34.407,903
-7.9031,-9.8948,9.3708,16.4537,-9.8948,11.7344,51.2188,20.6131,904
-8.5736,-9.4911,15.825,14.3014,-9.4911,3.4611,52.1744,36.2037,905
-55.9411,-10.4071,-4.9647,27.5663,-10.4071,6.1467,105.0552,70.8556,906
-12.7612,-9.8565,-1.615,5.2643,-9.8565,1.5344,31.7331,26.2854,907
-4.0308,-9.998,-0.0231,2.1187,-9.998,2.1111,49.0346,38.5188,908
-1.6609,-9.982,5.984,5.9927,-9.982,4.1676,36.5009,18.0572,909
-3.3599,-9.9062,4.8678,8.6202,-9.9062,7.9165,26.3064,18.5733,910
-2.6184,-9.6172,0.1193,1.9466,-9.6172,2.9391,23.8545,6.2645,911
-7.5194,-9.5507,-1.6003,3.4248,-9.5507,5.4521,27.6041,24.9155,913
-28.7424,-9.7739,2.4999,9.1254,-9.7739,10.2231,31.7769,22.7713,914
-5.8889,-10.0006,-1.7656,3.516,-10.0006,2.3449,25.6335,18.1182,915
-11.4188,-5.4538,4.0532,12.4511,-5.4538,10.9107,59.9417,43.5342,916
-15.0284,-9.8927,-4.3891,9.8145,-9.8927,4.6178,21.0295,14.0141,917
-25.5786,-9.645,27.8808,27.4967,-9.645,3.2556,41.0513,40.208,918
71.5206,-9.3787,97.479,17.4984,-9.3787,6.1658,65.892,55.6874,919
-3.0575,-9.7023,13.3411,15.8454,-9.7023,2.6979,33.8728,25.6423,920
-1.0992,-10.3126,0.9897,1.1903,-10.3126,2.9173,50.2533,44.3726,921
-5.5384,-10.2951,4.7562,8.7455,-10.2951,9.033,53.3406,37.6892,923
-3.2681,-10.232,1.8191,3.6788,-10.232,7.3517,53.5,30.5486,924
-0.7669,-9.595,1.1351,1.4197,-9.595,3.7142,17.0541,11.3749,925
-0.7373,-10.1132,17.5717,12.7985,-10.1132,9.2094,43.0267,31.9191,926
-8.8974,-10.0986,32.3188,30.1393,-10.0986,19.4422,58.371,44.3805,927
-7.5957,-10.3077,30.8323,33.1019,-10.3077,25.1623,72.6579,62.0225,929
-9.3178,-10.1398,0.6901,7.4954,-10.1398,9.0228,56.0986,33.4441,930
2.989,-10.1657,15.4693,11.1613,-10.1657,8.9914,39.1186,34.369,931
-3.7929,-10.1101,8.0991,10.3632,-10.1101,13.176,45.8286,39.1309,933
-23.6304,-9.7265,6.8489,12.4661,-9.7265,9.8806,49.5387,18.4591,934
-3.2507,-9.8804,-1.2068,1.5534,-9.8804,1.7722,20.2128,17.8728,935
-0.634,-11.0869,0.6568,2.071,-11.0869,1.9465,25.9709,24.0355,936
-35.2337,-9.0731,8.7938,28.3333,-9.0731,3.8614,35.448,22.895,937
-9.1015,-10.0182,14.4132,12.5249,-10.0182,1.4539,43.3871,35.1223,938
-9.7072,-9.7089,4.7689,9.1377,-9.7089,1.4793,27.7549,21.3862,939
-2.8936,-9.8273,4.2221,5.7304,-9.8273,2.8671,81.558,68.9215,940
-0.864,-10.1125,0.5812,1.4129,-10.1125,3.7415,41.0784,37.7062,941
-1.4136,-9.843,1.952,3.4281,-9.843,2.503,18.4999,10.9234,943
-4.6246,-9.8974,0.4807,2.7991,-9.8974,5.2431,27.2946,7.1352,944
-3.1423,-9.6551,0.0975,2.4292,-9.6551,2.0483,7.7267,4.954,945
-5.7891,-9.8618,3.2618,8.99,-9.8618,2.0968,18.3052,16.2687,946
-7.0592,-9.4973,-2.7453,4.0762,-9.4973,2.4846,26.5506,25.0486,947
-5.8993,-9.9113,16.6147,14.6988,-9.9113,4.3933,38.5924,28.3768,948
-10.0274,-9.8526,5.7801,10.3561,-9.8526,1.6746,27.3586,21.1078,949
-19.4993,-9.8453,2.6789,11.2375,-9.8453,5.812,31.6883,12.8791,950
-1.1049,-9.6453,1.2743,2.8618,-9.6453,1.7202,9.9206,4.1176,951
-1.9024,-10.067,8.4111,9.8441,-10.067,5.9515,24.3494,18.5394,953
-3.5461,-9.7881,0.3651,1.9011,-9.7881,4.5454,14.764,11.7532,954
-2.5593,-10.0386,1.5065,2.0639,-10.0386,1.9754,11.9331,10.7414,955
-8.951,-9.8859,-2.4482,3.9303,-9.8859,0.8937,9.7959,8.4207,956
-7.2858,-9.8747,-1.0091,3.2975,-9.8747,2.4399,49.6974,38.0502,957
-2.6373,-8.7748,1.2012,2.0978,-8.7748,1.0138,34.4555,26.1878,958
-5.5892,-7.8752,2.3837,9.7023,-7.8752,2.602,32.6217,26.2298,959
-5.6797,-10.1443,1.891,6.286,-10.1443,6.1654,23.0891,18.7943,960
-4.8831,-9.7824,4.417,5.8813,-9.7824,1.7366,17.0007,12.386,961
-19.988,-9.8981,2.5361,11.1626,-9.8981,6.667,32.7381,21.8991,963
-3.8543,-9.8829,-0.4259,2.8843,-9.8829,3.3096,35.7911,30.7732,964
-2.4341,-10.0152,0.0344,1.6435,-10.0152,1.9345,51.1637,48.7502,965
-2.4827,-9.4891,3.2304,4.0031,-9.4891,3.2801,25.8267,10.1529,966
0.7141,-9.996,14.9622,12.5562,-9.996,6.5983,25.5465,23.2637,967
-14.742,-10.3476,0.7139,9.4434,-10.3476,1.0942,16.3419,14.8193,968
0.3726,-10.3708,7.4858,6.7653,-10.3708,6.3995,21.3601,15.8819,969
-1.4546,-9.8918,7.2839,7.5286,-9.8918,12.8672,23.2593,18.0459,970
-9.8683,-9.1794,-0.3693,3.5271,-9.1794,1.785,14.3778,6.2152,971
-0.0344,-9.6776,2.1667,2.3084,-9.6776,3.335,16.0193,12.7155,973
-5.0964,-9.9519,1.6981,5.4825,-9.9519,6.3554,25.7418,11.1831,974
-2.9196,-10.5535,0.4049,4.2783,-10.5535,8.0119,38.6809,36.7481,975
-0.1421,-9.8014,1.3937,1.5128,-9.8014,4.4921,19.7368,18.2552,976
-1.487,-10.2769,8.2525,5.9226,-10.2769,3.863,35.4759,28.571,977
-14.8186,-9.9727,7.8017,12.4614,-9.9727,3.6336,24.0888,22.2876,978
1.0016,-9.7913,15.7946,10.1171,-9.7913,6.4344,37.5453,17.5792,979
-15.0042,-9.7892,3.145,9.8352,-9.7892,15.5558,30.9196,21.2625,980
-6.1948,-9.7517,-0.4562,2.6922,-9.7517,4.4275,36.3295,31.8512,981
-20.9586,-10.1706,5.2132,12.6074,-10.1706,11.5831,41.3604,32.1771,983
-17.0785,-9.9456,2.1223,8.9348,-9.9456,8.7083,38.6625,11.92,984
-14.9062,-10.3135,4.791,10.9424,-10.3135,3.8,31.7826,28.3385,985
-2.8365,-10.5827,15.9627,11.3009,-10.5827,9.1735,48.5653,43.993,986
-7.1188,-10.7754,9.1093,12.8539,-10.7754,6.6501,90.6083,76.3755,987
-26.5619,-10.4874,2.4735,12.3042,-10.4874,5.8618,100.8553,91.5099,989
-26.0077,-9.8809,8.5846,16.7561,-9.8809,19.364,65.3903,42.6147,990
-8.234,-9.7016,0.3301,5.7655,-9.7016,0.7944,19.1307,17.2404,991
-2.1275,-9.8909,9.6385,9.4834,-9.8909,6.4537,29.3182,23.0154,993
-3.1135,-9.884,4.1581,6.9918,-9.884,8.1198,64.4343,43.5335,994
-11.1724,-10.0564,0.0457,6.125,-10.0564,4.8898,42.6054,25.3312,995
3.0229,-9.9866,5.7171,1.5261,-9.9866,0.7719,15.4223,10.2181,996
6.2577,-9.9143,8.8168,3.1231,-9.9143,2.2654,18.3386,13.8471,997
-0.3672,-10.0789,3.3063,2.642,-10.0789,3.0632,23.9164,9.4302,998
-0.8241,-9.9112,4.2337,4.344,-9.9112,2.3106,27.9334,26.1203,999
-0.892,-9.9698,-0.1386,0.4349,-9.9698,0.9576,28.7417,25.5099,1000
-0.9385,-9.6986,6.8368,6.2735,-9.6986,5.0525,20.0779,13.6295,1001
-1.3406,-10.0432,0.293,0.7815,-10.0432,1.1873,22.4976,20.6054,1003
-4.5569,-9.8633,-0.3855,1.4667,-9.8633,3.1822,23.6822,10.4424,1004
-2.5717,-9.8769,-0.3868,1.1685,-9.8769,1.8963,12.1568,6.5215,1005
-6.476,-9.846,-0.4871,1.7293,-9.846,2.5843,15.6849,5.172,1006
-27.2643,-9.8855,-1.8582,6.4029,-9.8855,3.0879,18.9376,14.1508,1007
-25.5978,-9.7045,-9.6183,10.8847,-9.7045,6.3494,15.1601,5.275,1008
4.344,-9.7532,5.2144,0.6312,-9.7532,0.3779,4.3337,3.9482,1009
-2.3012,-9.8503,0.0507,1.1136,-9.8503,2.5078,5.535,2.2115,1010
-4.7144,-9.7987,-3.1936,1.382,-9.7987,1.3164,4.4792,3.7643,1011
1.5861,-9.8185,2.146,0.4137,-9.8185,0.4165,3.6204,2.6179,1013
-6.2962,-9.8439,-0.2045,3.1071,-9.8439,4.4818,23.0522,5.997,1014
-6.5967,-9.9088,-0.8844,2.6484,-9.9088,2.8097,28.1626,10.817,1015
-2.1053,-9.8469,5.9426,7.5295,-9.8469,6.6062,27.6798,20.6644,1016
-7.7028,-10.1496,-1.2906,3.7016,-10.1496,1.5265,39.1822,35.8438,1017
-0.6762,-9.9963,0.6976,1.6413,-9.9963,1.1504,30.288,28.5378,1018
-8.5863,-9.5699,24.823,20.3255,-9.5699,0.669,43.2516,34.1982,1019
-9.684,-9.8997,14.9546,14.3498,-9.8997,2.9292,32.4478,24.6451,1020
-9.9076,-10.1888,-1.1938,3.9991,-10.1888,5.7967,38.9609,36.8435,1021
-0.0857,-9.9867,7.9724,8.2623,-9.9867,12.2504,33.4859,29.9741,1023
-1.7636,-9.9057,0.3936,1.0217,-9.9057,3.0768,16.0947,9.3717,1024
-5.531,-9.8098,-1.0493,2.2786,-9.8098,1.3539,14.0648,13.5109,1025
-0.3306,-10.1032,0.3187,0.7191,-10.1032,2.5849,19.8875,18.9417,1026
2.626,-10.4475,15.5871,13.38,-10.4475,6.4043,55.9101,46.0704,1027
-7.6399,-10.3552,-1.961,3.0828,-10.3552,2.2299,55.2062,53.7934,1028
-18.6007,-10.5707,14.5639,30.9426,-10.5707,9.196,102.4034,96.8952,1029
-16.5239,-10.2752,-1.1854,7.0296,-10.2752,3.7874,43.2293,21.0428,1030
-0.6926,-9.6329,0.3674,0.919,-9.6329,1.1499,12.1126,8.6143,1031
-14.7784,-9.8779,0.2162,6.917,-9.8779,2.7788,10.3081,6.0391,1033
-6.9515,-9.8653,0.2227,3.0921,-9.8653,3.5695,23.9502,10.7799,1034
-0.8363,-9.7878,0.3619,1.9371,-9.7878,2.7538,16.7027,15.0151,1035
-5.8415,-9.8513,-0.1223,3.7995,-9.8513,3.619,10.9529,5.4102,1036
-3.953,-9.8938,-0.1776,1.9158,-9.8938,1.4366,13.3347,8.6063,1037
-9.1119,-9.9047,-1.2791,3.5974,-9.9047,1.3727,19.0874,10.6238,1038
-4.4449,-10.1035,-0.5638,1.6369,-10.1035,1.9302,9.7501,4.9933,1039
-0.8368,-10.1427,4.9476,3.7644,-10.1427,2.9415,52.745,30.1731,1040
6.8438,-9.8249,15.5327,6.2981,-9.8249,0.8803,49.8367,37.6992,1041
-1.1068,-10.2884,11.1314,7.4598,-10.2884,5.1648,75.9417,51.2583,1043
-12.546,-10.2479,-1.0445,3.2979,-10.2479,5.955,90.2933,76.6779,1044
-8.5885,-9.9661,8.9111,17.6238,-9.9661,3.549,91.5434,88.9102,1045
-4.3511,-9.8626,0.5207,2.5546,-9.8626,2.0584,18.365,14.4101,1046
1.6069,-9.6152,5.1141,2.1061,-9.6152,0.7675,21.7638,13.983,1047
-4.4537,-9.9937,13.7829,14.953,-9.9937,12.7243,41.0021,31.3699,1048
-40.5943,-9.9736,28.7199,53.684,-9.9736,25.8681,92.4863,34.4688,1050
-22.8329,-9.7938,-9.0351,8.1772,-9.7938,2.2282,11.6201,7.9251,1051
-63.7921,-9.7113,-15.4141,17.7321,-9.7113,4.3616,19.9111,7.5566,1054
-57.6091,-9.2094,-27.9597,15.2266,-9.2094,4.6651,18.2191,8.4366,1055
12.8624,-9.4209,32.3181,17.9079,-9.4209,5.0905,21.5974,12.7794,1056
-30.9209,-9.7582,1.074,21.7736,-9.7582,9.1365,22.7308,6.0307,1057
5.2519,-9.7419,11.0225,4.9176,-9.7419,1.8411,10.056,7.0365,1058
-5.5132,-9.8384,-2.404,2.1477,-9.8384,1.3867,5.6118,4.6915,1059
-2.7403,-9.8747,-0.1545,1.0359,-9.8747,2.7137,5.7879,2.4086,1060
-16.3636,-9.8178,1.3663,8.6031,-9.8178,5.6738,21.6911,15.3088,1061
-1.482,-9.7834,5.0429,5.504,-9.7834,4.5956,10.0564,6.3782,1063
-10.5502,-9.7856,0.494,3.3237,-9.7856,2.3603,6.085,2.3331,1064
-8.0588,-9.7674,3.2324,3.8911,-9.7674,2.3412,5.136,3.5268,1065
-2.7731,-9.7997,-0.0623,1.592,-9.7997,1.3095,2.7169,1.8739,1066
0.8043,-9.7964,1.156,0.3565,-9.7964,0.2995,2.6145,1.7839,1067
-0.8754,-9.8269,6.7729,8.211,-9.8269,6.4709,22.7247,5.2493,1068
-36.193,-9.8071,-22.3173,11.1637,-9.8071,7.1733,23.9726,14.8326,1069
1.4232,-9.823,2.3136,0.6286,-9.823,0.4974,3.3504,3.0625,1070
-0.1845,-9.861,0.7401,0.9263,-9.861,1.6536,3.8162,1.6725,1071
-0.7941,-9.84,1.0662,1.5335,-9.84,2.1141,6.2052,4.7744,1072
-3.4095,-9.8592,-0.4463,1.7608,-9.8592,2.1525,5.5524,2.4409,1073
-1.0744,-9.8649,-0.3726,0.5313,-9.8649,1.0877,2.9612,2.1615,1074
-1.883,-9.8661,0.1035,0.5926,-9.8661,1.709,3.6477,1.9748,1076
-19.4734,-9.8508,-2.8143,4.6432,-9.8508,3.8976,11.5645,2.0675,1077
-22.2832,-9.7173,0.2482,13.0848,-9.7173,7.1843,12.8464,6.6021,1078
-3.2132,-9.8128,4.172,4.4835,-9.8128,3.2197,10.438,4.7542,1079
-1.2049,-9.807,1.6755,1.8288,-9.807,2.0063,5.2468,3.0832,1080
-3.4586,-9.8502,1.3077,2.947,-9.8502,4.3564,8.979,5.4351,1081
-8.0346,-9.9007,-0.4516,5.0301,-9.9007,4.8753,11.4679,7.7586,1083
-4.0407,-9.8891,0.9582,2.2975,-9.8891,4.1332,18.3778,8.2597,1084
-0.792,-9.811,2.236,4.4216,-9.811,2.6081,9.3442,5.5009,1085
-14.6115,-9.8442,8.1414,14.1555,-9.8442,9.2136,41.5369,21.4907,1086
-7.8831,-9.9224,13.4267,19.6492,-9.9224,11.1609,55.2903,29.6058,1087
-0.3457,-9.7389,3.5965,4.217,-9.7389,5.1546,24.749,17.0685,1088
-8.6671,-9.57,2.347,7.6309,-9.57,5.8291,54.033,16.2648,1089
-3.7611,-9.4154,10.9694,11.3193,-9.4154,8.9528,38.4112,19.3607,1090
-15.956,-9.8334,2.3019,7.9578,-9.8334,6.6871,31.7544,17.7839,1091
-0.6115,-9.8154,14.74,14.9671,-9.8154,5.5619,22.5433,17.2934,1093
-8.0447,-9.6888,7.4907,11.0749,-9.6888,10.7023,29.1471,17.487,1094
-28.6552,-9.8435,-4.09,9.7181,-9.8435,6.7011,28.3985,16.69,1095
-10.7627,-10.14,-0.9073,7.2947,-10.14,6.2699,28.2676,20.7142,1096
-0.1628,-9.9243,27.3538,24.1972,-9.9243,13.2993,40.6074,19.1792,1097
-0.6221,-8.8285,21.2016,18.845,-8.8285,11.2053,57.2982,24.8019,1098
-18.1716,-9.6795,0.774,13.377,-9.6795,6.989,18.8659,12.8023,1099
-7.555,-9.9905,4.4077,5.839,-9.9905,3.9128,22.0318,18.6693,1100
-9.8543,-9.8747,4.0672,15.1244,-9.8747,8.6801,39.2637,14.6063,1101
-7.2467,-9.7715,2.7468,6.0959,-9.7715,5.4136,22.0182,9.4042,1103
-17.391,-9.941,2.6548,7.7248,-9.941,6.8079,29.6961,8.8405,1104
-0.3947,-9.8702,1.9038,1.613,-9.8702,4.7082,13.7275,9.7221,1105
-2.3362,-9.7285,0.0217,1.1916,-9.7285,2.8014,14.759,10.7664,1106
-4.3529,-9.5523,14.2724,15.8612,-9.5523,5.4241,39.4716,31.6375,1107
-0.7193,-10.0902,2.1746,2.9774,-10.0902,4.1826,13.3954,6.5727,1108
-3.7515,-9.8492,1.1152,4.6202,-9.8492,3.5121,18.6585,8.1114,1109
-5.5216,-9.9331,1.7613,4.7935,-9.9331,3.2935,17.3938,8.0869,1110
-2.045,-9.8222,0.8315,1.4576,-9.8222,3.7263,15.5397,7.0401,1111
-1.1715,-9.7722,-0.022,0.9498,-9.7722,2.1862,14.3901,11.8246,1113
-14.645,-9.9273,0.4405,7.2652,-9.9273,6.6526,18.9549,7.4214,1114
-10.0203,-10.0181,-3.5301,4.0258,-10.0181,2.5822,22.1935,17.1885,1115
-6.2411,-9.786,-1.4276,2.3412,-9.786,3.0862,31.696,27.036,1116
-1.954,-10.0014,4.6289,5.9147,-10.0014,3.5926,34.1094,24.7443,1117
-15.3406,-10.6891,-1.1413,11.9817,-10.6891,7.228,61.9508,39.4419,1118
-1.9916,-10.1156,2.0597,4.5718,-10.1156,2.9631,21.0973,18.5959,1119
-0.3992,-9.8048,25.8085,25.432,-9.8048,13.9227,32.6392,17.6229,1120
-29.5194,-9.8721,-3.1718,11.0345,-9.8721,5.161,31.145,15.6185,1121
-1.9183,-10.1305,14.5991,14.6826,-10.1305,5.1951,42.6604,21.5432,1123
-10.2287,-9.8532,2.0791,8.4701,-9.8532,9.497,26.4121,13.7091,1124
-5.2456,-9.7955,-0.0692,2.9661,-9.7955,2.2794,7.1232,6.1452,1125
-1.5311,-9.7594,1.5305,3.2547,-9.7594,4.3326,14.2951,8.5389,1126
-5.5843,-10.1261,1.8565,4.9805,-10.1261,3.6937,28.1984,21.3127,1127
-57.4619,-10.458,-17.365,21.8912,-10.458,11.4982,44.5583,23.1003,1128
-1.0424,-9.8685,4.271,5.3286,-9.8685,5.638,25.0546,9.957,1129
-5.2901,-9.7641,2.9992,6.6184,-9.7641,2.3783,14.6198,10.4734,1130
-0.9511,-9.8646,1.6677,3.0769,-9.8646,3.0575,11.3331,8.968,1131
-0.3627,-9.8268,6.3185,10.2442,-9.8268,5.9246,18.8292,10.108,1133
-4.2783,-9.851,1.0505,2.8716,-9.851,2.922,24.6688,5.5461,1134
-1.4902,-9.8323,-0.0194,0.7894,-9.8323,1.841,12.8147,4.1331,1135
-2.5738,-9.872,-0.6181,0.9075,-9.872,1.0818,8.5035,6.5269,1136
-0.5095,-9.7233,0.6438,0.8806,-9.7233,2.5677,12.0173,7.9927,1137
-1.1939,-9.9792,0.8343,1.868,-9.9792,2.2198,28.8787,24.7206,1138
-0.4329,-9.8628,1.7917,1.8721,-9.8628,4.0498,24.1515,12.3468,1139
-3.3569,-9.7847,0.5944,1.7468,-9.7847,3.1319,27.044,19.1357,1140
-3.6715,-10.0946,-0.2887,1.677,-10.0946,0.8535,10.251,8.9121,1141
-1.5589,-9.8698,3.8991,5.3462,-9.8698,6.5995,27.438,16.928,1143
-13.761,-9.8864,0.7006,3.6969,-9.8864,4.6811,30.349,11.4431,1144
-4.8272,-9.9074,2.534,5.8889,-9.9074,1.1087,6.7224,6.2089,1145
-0.7454,-9.7523,0.9247,1.4216,-9.7523,0.9838,28.3136,25.5704,1146
-4.2883,-9.9632,0.8062,3.7629,-9.9632,3.0788,21.3767,20.2663,1147
-18.2766,-9.9658,-1.9921,5.3549,-9.9658,4.6096,46.6874,38.9685,1148
-5.7669,-9.9786,5.3863,13.0136,-9.9786,8.7973,41.831,34.4895,1149
-15.6996,-10.0109,39.2986,46.523,-10.0109,22.0505,56.9766,38.4411,1150
0.4451,-10.0044,12.9514,15.1736,-10.0044,13.6389,42.4309,37.4995,1151
-10.1226,-9.7159,-0.324,5.6988,-9.7159,4.7303,21.2921,15.8421,1153
-23.4437,-10.1325,15.8393,20.567,-10.1325,15.8001,48.6978,24.4978,1154
-13.3801,-9.7474,9.1871,16.6439,-9.7474,4.8911,24.5626,17.8288,1155
-15.1498,-10.2257,3.7087,13.8059,-10.2257,7.2391,23.9574,20.4717,1156
-9.6005,-10.0446,-2.8378,5.0195,-10.0446,4.6163,13.3009,8.0682,1157
-3.381,-10.0105,-0.367,2.1833,-10.0105,3.8922,10.9922,8.2563,1158
-1.8552,-9.8929,1.2792,3.0901,-9.8929,1.696,16.0916,6.8448,1159
-9.6389,-10.2014,5.1521,7.8786,-10.2014,8.7616,30.0303,21.1295,1160
-2.8464,-9.5629,10.4408,10.9238,-9.5629,4.017,24.0228,14.6688,1161
-1.5222,-9.6582,4.0896,3.682,-9.6582,6.1347,17.2422,13.5185,1163
-3.4333,-9.77,0.482,2.2721,-9.77,3.077,12.8361,5.9369,1164
-3.5684,-9.6874,-1.6937,1.5676,-9.6874,1.3177,11.774,9.202,1165
-2.9094,-9.7654,-0.2752,2.6338,-9.7654,0.9525,7.5591,4.7969,1166
-3.2282,-10.0037,-0.7624,1.1159,-10.0037,1.691,19.882,15.5948,1167
-1.1571,-9.9755,1.9877,1.874,-9.9755,2.2865,27.9768,20.4888,1168
-29.7831,-9.9131,9.6174,26.0349,-9.9131,13.9371,54.1607,22.4612,1170
-42.1337,-8.9231,0.6197,28.4877,-8.9231,9.8624,49.0907,15.7613,1171
-33.5211,-9.5696,-7.1765,15.5384,-9.5696,6.8192,21.4032,10.9004,1173
-43.4091,-9.5909,-2.8479,16.3194,-9.5909,6.8701,38.402,20.4198,1175
-1.1155,-9.6512,6.844,12.5938,-9.6512,7.6607,17.9872,13.0067,1176
-5.2069,-10.0533,-2.0268,4.0604,-10.0533,2.3845,14.5183,10.4819,1177
-10.7225,-9.8219,-3.8719,3.4231,-9.8219,1.9164,13.6794,5.751,1178
-7.1013,-10.384,2.1172,7.8228,-10.384,2.4882,27.7775,21.7725,1179
-0.3139,-9.7288,-0.0446,0.3127,-9.7288,0.9663,4.2381,3.0738,1180
-3.1539,-9.9169,0.2154,2.0391,-9.9169,1.3096,8.6195,4.9059,1181
-0.3103,-9.6926,0.7493,1.5138,-9.6926,2.3541,14.9869,5.1356,1183
-9.4004,-9.8457,1.2817,5.4938,-9.8457,5.0779,27.2994,11.3129,1184
-2.8981,-9.9139,0.7746,2.3325,-9.9139,2.7872,23.206,20.5018,1185
-4.6113,-10.1852,1.1888,5.1882,-10.1852,5.5232,56.0219,52.1289,1186
-9.2366,-9.7136,16.9744,22.1087,-9.7136,5.9821,24.5216,17.5348,1187
-6.1996,-10.0712,1.9129,5.844,-10.0712,3.6653,27.5881,21.2467,1188
-9.0148,-9.8653,2.7294,7.8523,-9.8653,5.3435,26.662,15.5244,1189
-0.7921,-10.3582,22.3371,17.9896,-10.3582,15.7159,65.3771,37.2552,1190
-12.8123,-9.9269,-1.8597,5.3132,-9.9269,4.2857,41.9466,22.8054,1191
-16.2548,-9.9946,0.7413,8.6325,-9.9946,5.7861,31.445,16.3547,1193
-21.5019,-9.7917,5.1413,12.8699,-9.7917,12.1129,38.39,16.9589,1194
-7.6062,-9.8981,3.4456,8.7708,-9.8981,7.7241,25.1776,11.0783,1195
-31.516,-9.4926,45.6829,54.0262,-9.4926,21.946,55.2444,34.9584,1196
-45.5464,-6.8341,14.7638,47.7378,-6.8341,21.5464,67.9556,38.3335,1197
-27.5665,-9.3391,-4.1286,9.3833,-9.3391,10.3742,42.8445,19.2054,1198
-3.098,-9.4466,-0.1398,1.789,-9.4466,7.0029,17.7036,9.8433,1199
-8.7395,-10.0145,1.5643,6.2552,-10.0145,10.9189,26.8987,17.7193,1200
-2.9622,-9.71,-0.7227,1.563,-9.71,6.4896,14.3828,11.6206,1201
-21.7726,-9.9311,-3.7849,9.9021,-9.9311,16.6943,43.6705,22.7363,1203
-39.2411,-9.839,13.7344,21.7393,-9.839,16.6375,47.3044,25.819,1204
-1.0631,-10.0294,6.6075,11.9893,-10.0294,6.3194,20.4123,11.0482,1205
-5.728,-9.8613,7.6028,12.1495,-9.8613,2.5242,16.5037,15.1167,1206
-6.4387,-9.6443,48.9974,63.2934,-9.6443,13.4046,63.3014,52.6384,1207
-2.3994,-10.2206,16.6482,15.0771,-10.2206,10.0358,37.9174,33.9341,1208
0.1925,-9.4676,4.9492,2.3891,-9.4676,5.7599,18.1512,14.9566,1209
-1.4493,-9.986,7.0204,9.2386,-9.986,8.0696,23.3853,14.5339,1210
1.5996,-9.9226,33.0017,32.5292,-9.9226,12.102,36.4044,29.4167,1211
-10.7656,-9.9681,10.6709,14.9825,-9.9681,10.3227,25.3271,14.789,1213
-14.7121,-10.0872,16.8159,27.9862,-10.0872,20.068,49.1553,31.3673,1214
-20.132,-10.0457,22.2315,22.3691,-10.0457,4.0194,35.7326,28.7351,1215
-3.8884,-10.2743,6.2825,8.9077,-10.2743,4.2732,26.8842,12.8602,1216
-15.931,-10.5904,-7.9926,4.6397,-10.5904,3.1668,22.5205,12.4935,1217
-0.1483,-10.0675,23.7111,22.7688,-10.0675,7.1102,26.5552,20.169,1218
3.3078,-9.8814,11.7326,8.6421,-9.8814,7.7097,22.5987,18.8117,1219
-7.5527,-8.8312,-0.31,4.2594,-8.8312,4.8589,15.9126,7.7522,1220
-8.6196,-9.9175,18.5101,25.5454,-9.9175,6.6919,31.4936,23.4807,1221
-3.9833,-10.1933,9.1697,14.8216,-10.1933,7.0546,27.7167,18.1291,1223
-19.2163,-10.0216,5.3378,9.5441,-10.0216,7.4742,28.7445,13.0911,1224
-9.4904,-8.3504,-1.0271,6.2179,-8.3504,6.128,13.2797,10.8666,1225
-6.908,-10.1044,7.1497,11.136,-10.1044,7.3588,23.0948,14.895,1226
-7.6603,-9.8392,4.9035,7.9083,-9.8392,6.4376,18.1071,15.5131,1227
-5.2556,-9.8992,4.0516,7.6221,-9.8992,6.7796,24.4771,17.6326,1228
-11.5976,-9.7506,13.6557,24.211,-9.7506,14.9427,34.5079,20.9118,1230
-9.8032,-9.6971,-1.8749,3.9662,-9.6971,6.2362,18.1911,14.7576,1231
-11.5185,-9.7725,1.5658,7.5521,-9.7725,7.8383,15.7045,9.0355,1233
-20.1587,-9.8561,4.9733,12.0307,-9.8561,9.7568,26.6828,12.7911,1234
-3.0554,-10.158,0.4248,2.8954,-10.158,5.9516,16.285,11.7812,1235
-11.9947,-9.9533,3.59,8.9127,-9.9533,7.0504,20.9724,13.8348,1236
-11.7722,-8.615,-0.0965,7.3095,-8.615,6.1848,36.08,16.0622,1237
-24.8304,-8.3223,0.4353,14.9476,-8.3223,2.0785,19.453,15.4464,1238
-7.9553,-9.6342,-0.1466,4.9571,-9.6342,6.216,17.4615,8.5611,1239
-5.5369,-9.808,2.8573,5.4968,-9.808,5.3356,15.068,8.5442,1240
-0.704,-9.6705,0.1012,0.4357,-9.6705,0.5599,9.5073,6.9849,1241
-5.526,-9.9353,1.3553,3.1071,-9.9353,5.7177,17.9618,9.3529,1243
-9.13,-9.9068,1.0961,5.407,-9.9068,6.449,22.8628,9.5913,1244
-3.5452,-9.8498,-0.0269,2.5787,-9.8498,1.3577,9.1373,7.983,1245
0.0419,-10.1319,2.0817,1.7384,-10.1319,3.3079,14.3386,10.8251,1246
-3.4309,-9.8974,2.6242,5.6665,-9.8974,1.8766,20.2135,16.0748,1247
1.0197,-10.2798,15.7403,13.2285,-10.2798,4.1748,60.309,27.5916,1248
-20.0008,-10.0813,6.7915,15.1675,-10.0813,9.4672,76.6283,40.2855,1249
-3.5849,-9.9235,1.377,2.7904,-9.9235,3.67,71.3408,51.4074,1250
-1.2491,-10.1785,9.2801,9.0448,-10.1785,5.6007,26.7327,16.1373,1251
-18.9499,-9.8797,21.2066,28.5288,-9.8797,5.3342,54.8968,30.8137,1253
-2.1442,-10.9461,58.2581,65.6372,-10.9461,23.6502,68.1705,60.8196,1254
-12.2205,-9.6035,-2.2448,4.7683,-9.6035,1.9168,42.2322,27.9422,1255
-19.1563,-9.6821,30.1963,43.6707,-9.6821,16.0431,54.2567,40.0264,1256
-84.542,-10.5355,-13.0184,46.9291,-10.5355,12.341,49.5809,27.0289,1257
-8.8641,-9.8665,0.0158,6.0316,-9.8665,7.7418,24.6423,9.8087,1258
-3.4831,-10.1506,2.94,4.8896,-10.1506,6.3375,16.4754,12.1857,1259
-9.4686,-9.8197,13.05,10.9433,-9.8197,12.0775,28.7532,19.4603,1260
-11.1324,-9.4576,17.3038,33.2885,-9.4576,7.4411,37.4207,11.9566,1261
-8.6387,-9.7313,10.0774,18.7927,-9.7313,9.9257,26.805,18.6177,1263
-5.9861,-9.6881,0.5928,3.7536,-9.6881,2.7802,12.2688,6.1002,1264
-0.8368,-9.9828,5.2239,6.7442,-9.9828,6.8438,19.3218,17.3705,1265
-1.821,-9.7755,0.6641,2.4017,-9.7755,3.2357,15.0894,9.1922,1266
-0.0353,-10.0361,7.8314,9.8612,-10.0361,6.4496,42.8806,38.0578,1267
-21.7026,-10.3222,5.4282,28.8512,-10.3222,3.9851,36.1338,26.7352,1268
-2.9222,-9.9604,-0.67,1.1083,-9.9604,1.0098,28.0616,23.0694,1269
-134.0328,-9.9336,-18.1497,42.7654,-9.9336,6.1856,69.9857,43.394,1270
-0.4965,-9.6858,50.6566,47.6926,-9.6858,11.5593,50.3517,31.916,1271
-16.6706,-9.9131,27.4633,27.1696,-9.9131,13.2509,52.6628,34.4107,1273
-6.7827,-9.9109,4.6834,9.3843,-9.9109,10.768,51.8523,31.288,1274
-7.326,-10.1421,1.5122,5.5751,-10.1421,5.8445,33.8378,16.917,1275
-8.1904,-9.9577,-0.7242,3.2392,-9.9577,5.1146,29.9143,23.6547,1276
-1.7508,-10.0714,23.0027,18.8811,-10.0714,7.9738,30.877,20.6832,1277
-2.458,-9.6911,-0.3465,1.3921,-9.6911,2.4168,15.4111,13.7734,1278
-7.0735,-9.9752,5.6007,12.7512,-9.9752,3.7315,32.5798,30.6075,1279
-7.2882,-10.0218,-0.6422,2.7956,-10.0218,2.9539,40.7789,33.8656,1280
-11.8789,-10.1372,-2.7122,4.0891,-10.1372,3.8008,50.7262,37.5662,1281
-29.9107,-9.8169,-3.0597,17.9019,-9.8169,4.4924,21.4025,13.3678,1283
-22.9512,-9.4919,13.1275,29.8101,-9.4919,13.9381,66.6791,40.0406,1284
-7.0764,-9.4492,0.2322,5.6439,-9.4492,4.2867,38.2234,34.3199,1285
-15.3955,-9.7766,-2.6267,12.2617,-9.7766,4.2269,27.6653,25.9617,1286
-0.8038,-9.2986,8.5127,8.2958,-9.2986,7.7735,41.2683,11.0262,1287
-9.0714,-9.1845,-2.0711,3.3553,-9.1845,2.6849,27.8126,18.6792,1288
-12.8457,-9.6825,10.3765,19.4697,-9.6825,13.3667,35.09,16.9143,1290
-0.9114,-9.76,2.0209,2.9397,-9.76,4.7746,19.4415,13.2571,1291
-15.5528,-9.7801,1.4056,6.5607,-9.7801,4.3526,21.6531,13.9956,1293
-17.7374,-9.9405,1.615,8.7222,-9.9405,8.343,25.9783,14.0884,1294
-6.4202,-10.0635,1.1499,4.5367,-10.0635,4.6849,20.1431,13.7317,1295
-2.7961,-10.0824,-0.1028,1.5462,-10.0824,2.5657,16.8575,12.9899,1296
-1.8793,-10.0426,1.2939,3.0657,-10.0426,4.9888,29.9516,16.3982,1297
-2.2819,-9.6954,2.7756,4.7168,-9.6954,3.0488,35.8134,17.5478,1298
-6.0773,-10.057,3.8816,7.1451,-10.057,2.1846,25.5329,20.3617,1299
-0.3983,-9.8388,6.5933,6.3479,-9.8388,6.157,24.055,11.1163,1300
-0.2748,-9.8437,0.7707,0.8241,-9.8437,1.4699,12.9777,7.6265,1301
-1.8585,-10.0777,1.0406,3.3818,-10.0777,0.845,11.4823,7.2236,1303
-9.7777,-9.9343,3.0877,8.2064,-9.9343,6.9842,36.804,23.5107,1304
-13.6744,-9.9083,12.0345,17.4004,-9.9083,2.5558,34.6844,31.3029,1305
0.3062,-10.1593,3.217,2.5149,-10.1593,6.8168,12.2763,9.7435,1306
-1.4767,-9.8348,-0.0418,0.956,-9.8348,1.6675,13.1697,10.5679,1307
-1.077,-9.2818,1.9639,2.6504,-9.2818,2.633,13.9713,13.158,1308
-7.9383,-9.7481,0.601,2.916,-9.7481,6.7253,19.166,12.3786,1309
-17.1487,-10.1139,7.3041,19.3512,-10.1139,9.9338,33.1269,25.8774,1310
-1.3803,-9.9057,0.5661,1.9484,-9.9057,3.7552,9.2412,5.0683,1311
-11.4631,-9.8036,6.8795,13.8246,-9.8036,11.3853,28.6655,22.5716,1313
-9.8363,-9.8575,0.2863,6.2459,-9.8575,5.179,31.3396,14.5796,1314
-0.0852,-10.0204,2.6624,3.1197,-10.0204,2.0381,20.7373,7.4921,1315
-7.529,-10.1992,1.5405,5.8985,-10.1992,4.229,28.6794,14.5559,1316
-3.5834,-9.8968,-0.1261,1.833,-9.8968,0.8877,10.9624,8.6626,1317
-0.7816,-9.9046,0.8627,1.3219,-9.9046,2.2109,12.429,6.5192,1318
-8.134,-10.0961,-1.7384,3.4226,-10.0961,4.8308,22.6487,6.6287,1319
-0.5578,-9.8624,1.1917,1.2643,-9.8624,2.3908,30.1114,18.9218,1320
-6.3569,-9.7579,-1.3991,3.8596,-9.7579,1.7399,22.6316,20.9078,1321
-41.9479,-9.2451,2.1729,24.9346,-9.2451,12.9734,60.5982,31.0385,1323
-21.8793,-9.8617,8.0834,19.7256,-9.8617,12.1064,47.4111,28.414,1324
-9.1586,-9.848,1.454,4.301,-9.848,7.2062,15.9782,12.3694,1325
-9.3116,-9.9773,19.3248,19.2361,-9.9773,16.6265,57.8274,38.6083,1326
-14.8007,-9.9611,5.8463,11.8586,-9.9611,10.0941,53.0635,34.2936,1327
2.5976,-9.6759,8.9355,5.422,-9.6759,1.8162,16.7532,12.9125,1328
-0.0407,-9.5204,1.8187,1.7633,-9.5204,3.6643,20.3837,17.6578,1329
-16.6149,-10.0824,3.2471,11.1447,-10.0824,8.617,23.4721,18.7865,1330
-4.3484,-9.6329,8.9458,11.3229,-9.6329,9.1441,21.26,14.6537,1331
-26.2628,-8.4133,7.5637,19.0602,-8.4133,15.7948,81.243,27.623,1333
-125.5631,-8.4271,28.0163,80.1456,-8.4271,24.2692,89.5682,36.2215,1334
-65.0723,-9.2885,-0.1561,22.0813,-9.2885,9.6163,40.6746,26.9476,1335
-59.8552,-9.5192,-8.6126,30.6744,-9.5192,13.7427,26.5901,17.0398,1336
-122.0115,-9.6651,-4.6687,52.7035,-9.6651,15.4074,59.4431,15.72,1337
-25.4256,-9.9484,-3.4024,14.7537,-9.9484,7.172,22.1015,15.1557,1338
-19.8249,-10.0187,15.7871,21.3075,-10.0187,5.9564,28.7773,22.2042,1339
-23.7217,-6.4519,3.626,18.517,-6.4519,2.5431,21.6091,12.2487,1340
-42.2217,-10.3908,-8.3171,15.751,-10.3908,9.1423,30.0062,21.4844,1341
-30.9858,-10.0851,-3.5569,9.2433,-10.0851,5.9329,13.8439,9.9689,1343
-26.7325,-9.888,7.5331,16.3874,-9.888,10.9017,37.6257,18.3622,1344
-12.4347,-9.6255,3.0847,9.9897,-9.6255,3.3627,21.8138,9.9832,1345
-10.7929,-9.8917,-0.0651,11.4699,-9.8917,9.8069,24.1291,14.3216,1346
-3.9254,-10.3626,0.168,3.2577,-10.3626,5.4588,20.5523,15.1627,1347
-15.8174,-9.508,-1.3237,7.7964,-9.508,3.8872,18.6734,12.5032,1348
-17.1543,-9.1248,1.012,9.9762,-9.1248,8.728,36.696,16.852,1350
-7.661,-7.638,9.9621,14.6498,-7.638,10.3487,44.8288,19.6754,1351
-28.3116,-8.7616,14.6858,46.5758,-8.7616,14.9362,45.6633,34.9189,1353
-20.8873,-9.9918,4.1912,12.728,-9.9918,8.1511,36.1804,12.8664,1354
-4.1608,-10.0702,-0.1835,3.352,-10.0702,5.5734,20.1891,13.3219,1355
-17.8687,-9.6252,-4.2794,9.5249,-9.6252,4.3412,16.0342,11.1985,1356
-2.2189,-9.6379,2.2636,4.5278,-9.6379,3.8561,13.2966,11.1225,1357
-5.3525,-9.85,0.2194,2.5011,-9.85,2.2373,13.2218,6.5906,1358
-15.8632,-10.0677,3.1659,13.9628,-10.0677,3.4937,20.2184,12.9732,1359
-12.8445,-9.8683,8.1272,20.5688,-9.8683,5.545,35.234,21.0853,1360
-14.6524,-10.8385,7.1211,16.6316,-10.8385,10.4867,52.2331,35.3211,1361
-10.5079,-9.6685,46.583,33.0724,-9.6685,14.4389,43.8883,21.3923,1363
-16.159,-9.9532,3.2433,10.2698,-9.9532,12.5331,30.2817,14.8215,1364
-4.6618,-9.6997,-0.4329,3.3955,-9.6997,3.058,13.8089,9.1289,1365
-7.4486,-10.0014,2.3048,6.4729,-10.0014,7.5077,26.4227,21.2881,1366
-14.5517,-9.7412,-0.0531,7.2422,-9.7412,7.2762,17.7629,12.4601,1367
-15.6999,-9.8047,0.6169,12.1592,-9.8047,4.4694,45.4186,39.5971,1368
-22.5523,-9.7791,2.2979,13.6756,-9.7791,13.4577,39.799,18.5487,1369
-21.9086,-9.7941,5.5316,20.138,-9.7941,3.9725,15.4716,10.4303,1370
-6.4215,-10.1224,2.6032,9.0373,-10.1224,3.3796,62.858,42.38,1371
-8.6997,-11.0346,0.3434,6.1025,-11.0346,4.6444,86.5139,70.0308,1373
-28.6264,-9.9884,16.1056,43.8589,-9.9884,15.5498,59.1311,44.3076,1374
-5.215,-10.1182,2.4342,6.1639,-10.1182,7.8507,24.9698,19.6884,1375
-5.8313,-9.8792,-1.0603,2.7626,-9.8792,5.3677,21.1106,14.3371,1376
-13.9866,-10.4218,9.1825,17.7941,-10.4218,7.442,33.6692,28.9517,1377
-10.6228,-9.7509,18.0513,15.1244,-9.7509,15.6849,44.4483,23.2198,1378
-2.1993,-10.631,0.5773,1.7924,-10.631,4.9847,19.1688,11.3337,1379
-20.1879,-10.1195,-3.9685,9.1158,-10.1195,3.754,14.5778,8.2895,1380
-0.9248,-9.1217,12.6237,13.5791,-9.1217,6.3147,28.9392,22.0139,1381
-27.9024,-10.174,-3.7738,11.5968,-10.174,8.1448,24.8799,12.746,1383
-28.9454,-9.7654,8.0131,15.7395,-9.7654,11.1799,32.5816,17.281,1384
-8.1736,-9.9046,2.9198,10.9085,-9.9046,5.2681,23.443,13.762,1385
-8.0075,-10.4989,6.4175,11.3607,-10.4989,11.0497,23.4105,15.5359,1386
-20.4782,-9.8179,4.0669,17.6919,-9.8179,2.4193,21.249,19.6754,1387
-10.9959,-9.9242,-0.215,6.0622,-9.9242,4.6212,13.3639,8.6518,1388
-3.9559,-10.1072,33.6575,25.865,-10.1072,12.8101,57.9969,50.1082,1389
-48.0746,-8.9827,11.9424,32.5834,-8.9827,17.4524,45.0258,30.5074,1390
-33.7098,-10.0158,-3.372,22.9967,-10.0158,4.0358,33.5596,22.7891,1391
-26.8025,-9.6957,-6.868,10.7097,-9.6957,5.4756,29.2357,21.0406,1393
-18.998,-9.6791,6.6106,25.4447,-9.6791,12.5553,40.0578,16.9658,1394
-1.5691,-11.0819,13.8198,18.2288,-11.0819,14.2582,33.8915,23.3583,1395
-30.7803,-9.399,29.8005,33.0734,-9.399,4.6773,58.686,25.7887,1396
-13.6085,-9.778,12.4699,19.4379,-9.778,9.1412,36.0189,32.1105,1397
-6.1833,-10.5821,5.1973,5.5642,-10.5821,10.8704,26.2978,17.7904,1398
-18.2434,-10.2654,-3.7281,8.6215,-10.2654,3.4067,12.7703,7.8655,1399
-9.416,-9.6766,10.5082,13.9248,-9.6766,9.8371,25.0604,18.7058,1400
-2.355,-9.8059,0.5935,1.4542,-9.8059,2.0721,10.4941,7.6909,1401
-19.8115,-9.854,-1.4398,11.1208,-9.854,14.8479,33.6979,17.4603,1403
-22.8316,-9.9516,10.091,21.5372,-9.9516,12.4508,46.2548,18.031,1404
-3.7785,-10.0593,14.3438,14.79,-10.0593,10.0716,37.5302,23.7523,1405
-7.194,-10.0752,-1.3581,5.1638,-10.0752,4.8356,14.5979,12.6616,1406
-11.6621,-9.2238,26.1889,22.3815,-9.2238,4.4675,53.678,30.1548,1407
0.0576,-9.8762,4.6923,3.8805,-9.8762,3.641,22.7741,19.135,1408
-12.0779,-9.716,-0.2602,4.6493,-9.716,5.8712,21.8941,11.3886,1410
-14.4067,-9.9465,3.773,8.2151,-9.9465,8.947,30.6594,19.734,1411
-31.7806,-9.8505,11.4404,27.1114,-9.8505,12.5469,62.8348,31.865,1413
-27.2995,-10.0041,14.7467,17.5458,-10.0041,15.1045,77.0153,25.4382,1414
-10.9115,-9.9978,-1.7784,5.2599,-9.9978,3.2679,25.3997,22.8016,1415
-2.6298,-9.9469,-0.5183,1.0524,-9.9469,1.8069,7.575,5.0343,1416
-2.0337,-9.5459,0.979,2.8527,-9.5459,2.9991,15.0022,11.8761,1417
-7.0826,-9.7955,-1.0015,3.1632,-9.7955,6.5677,12.2171,9.5186,1418
-0.2475,-9.895,0.9517,1.0288,-9.895,1.9514,11.4824,6.5061,1419
-8.3353,-9.8794,0.082,5.8967,-9.8794,4.3129,26.638,22.1671,1420
-3.5041,-9.8947,0.0526,0.9529,-9.8947,2.9034,11.6291,5.9246,1421
-5.3387,-9.8772,1.3644,4.2853,-9.8772,4.9535,24.9482,17.3009,1423
-0.5344,-10.0745,18.0775,14.6362,-10.0745,5.6198,54.2776,36.1647,1425
-6.1747,-9.7413,-0.5983,6.3229,-9.7413,2.4356,18.5105,15.6701,1426
-1.8564,-9.8897,0.3639,1.4196,-9.8897,2.2041,49.1819,41.634,1427
-14.4986,-9.9458,3.0877,7.4316,-9.9458,9.6694,68.3617,41.6228,1428
-10.3247,-9.9717,0.3546,5.3641,-9.9717,2.9742,45.2238,31.6128,1429
-12.1071,-9.9431,0.3015,5.6702,-9.9431,5.7923,84.7275,65.6601,1430
-10.8146,-9.9518,-0.3693,3.9175,-9.9518,3.6382,83.0518,67.9769,1431
-15.636,-10.1852,13.6246,30.4056,-10.1852,12.8077,108.3214,64.4562,1433
-14.8939,-9.941,7.0316,12.3349,-9.941,12.073,54.5301,34.7249,1434
-7.4766,-9.9003,10.9948,14.273,-9.9003,9.2397,44.695,21.0841,1435
-42.6344,-9.8994,3.7752,19.6078,-9.8994,10.5994,68.1557,45.9519,1436
-80.1262,-9.704,-15.4691,32.2598,-9.704,14.7204,57.0234,33.905,1437
-31.2038,-9.8959,-0.1152,9.0951,-9.8959,8.0178,36.5681,26.9212,1438
-18.0358,-9.9702,-4.1251,6.2904,-9.9702,6.8989,42.1372,22.404,1439
-0.6657,-9.6759,0.9548,2.1271,-9.6759,4.6863,11.6085,8.8179,1440
-58.2654,-9.8811,-5.2202,17.1656,-9.8811,5.7119,33.9137,21.915,1441
-31.5122,-10.3956,2.9486,24.7281,-10.3956,8.7598,65.5188,45.3536,1442
-24.1588,-9.8633,-2.4746,9.9624,-9.8633,7.8715,24.4402,8.7606,1443
-4.5086,-9.8491,-0.1178,2.4408,-9.8491,2.8959,8.2485,4.7255,1444
-43.699,-9.7566,-3.0873,16.7613,-9.7566,8.4238,17.5581,7.5247,1445
-2.9888,-9.8294,3.1138,4.508,-9.8294,3.5346,8.7185,3.9685,1446
-5.4367,-9.8423,1.9116,3.0235,-9.8423,2.4951,9.6365,4.0134,1447
-16.1053,-9.8503,-1.2797,5.1092,-9.8503,4.4181,8.6662,4.1737,1448
-1.9028,-9.8505,0.0033,1.5826,-9.8505,2.504,4.5585,3.0162,1449
-4.0036,-9.8616,2.6538,4.7978,-9.8616,2.6748,11.2389,6.0549,1450
-1.5918,-9.8527,-0.1627,0.7713,-9.8527,2.5168,8.7819,4.8324,1451
-14.1359,-9.7992,-1.0223,5.5704,-9.7992,2.8994,14.212,11.0518,1452
-1.0084,-9.8281,-0.0623,0.759,-9.8281,0.6822,17.5069,16.7925,1453
-0.932,-9.8761,1.616,1.3942,-9.8761,1.5397,10.6281,6.7092,1454
-10.5502,-9.8244,0.0257,7.2994,-9.8244,4.9151,13.7785,6.4635,1455
-4.5806,-9.8584,0.5569,3.4002,-9.8584,4.728,6.588,5.055,1456
0.0056,-9.9244,0.4661,0.33,-9.9244,0.5144,4.2565,3.8142,1457
-0.1732,-9.8759,0.0154,0.1346,-9.8759,0.7917,2.1564,1.6744,1458
-0.0176,-9.8741,0.0185,0.0176,-9.8741,0.0355,1.7079,1.6514,1459
-7.7725,-9.8502,-1.644,2.6882,-9.8502,3.8641,8.3991,3.4016,1460
-3.8468,-9.8712,-0.3631,1.4835,-9.8712,2.2022,5.8065,1.7294,1461
-0.3583,-9.8732,-0.1003,0.1308,-9.8732,0.4056,1.9259,1.6745,1463
-0.2357,-9.8768,-0.0234,0.0772,-9.8768,0.1989,1.8889,1.5936,1464
-24.1339,-9.9744,-3.2158,13.5303,-9.9744,10.0688,40.5318,12.2825,1465
-19.0687,-9.9297,1.196,13.6012,-9.9297,2.0653,13.1079,10.2065,1466
-3.6676,-9.8936,-0.1974,1.6331,-9.8936,2.718,4.3451,2.8179,1467
-0.8637,-9.825,0.2975,0.7428,-9.825,2.015,8.2954,3.3055,1468
-2.2472,-9.8681,0.0092,0.391,-9.8681,0.9848,3.2302,1.767,1470
-0.0421,-9.8812,0.0756,0.1115,-9.8812,0.6244,2.4528,1.9908,1471
-0.7965,-9.8757,0.0831,0.3391,-9.8757,1.0681,2.3252,1.9642,1473
-1.1797,-9.8738,-0.0605,0.2816,-9.8738,1.2607,3.1974,1.7719,1474
0.0745,-9.8731,0.0845,0.0117,-9.8731,0.0385,1.6787,1.62,1475
-0.0243,-9.8726,0.0758,0.0685,-9.8726,0.4116,1.8197,1.7012,1476
0.0741,-9.8735,0.099,0.0293,-9.8735,0.0846,1.7186,1.6274,1477
-0.3613,-9.8719,-0.112,0.1524,-9.8719,0.6766,2.1051,1.7543,1478
-0.1389,-9.8726,0.1668,0.1773,-9.8726,0.8521,2.4137,2.1251,1479
-0.1085,-9.8742,0.0364,0.1103,-9.8742,0.7032,2.0642,1.6565,1480
0.0579,-9.8724,0.121,0.0465,-9.8724,0.3122,1.9353,1.8499,1481
0.0096,-9.874,0.0587,0.0415,-9.874,0.2999,1.7951,1.6377,1483
-2.824,-9.8686,0.0451,0.4951,-9.8686,0.8774,3.2091,1.6462,1484
-0.3523,-9.8743,-0.0051,0.232,-9.8743,1.2602,3.4664,2.5241,1485
-0.1848,-9.8748,-0.0047,0.1873,-9.8748,0.8076,1.9748,1.7363,1486
-0.0077,-9.8737,0.0547,0.0753,-9.8737,0.5823,2.0913,1.8447,1487
-1.3753,-9.8704,-0.1932,0.5268,-9.8704,1.1819,2.6093,1.9488,1488
-0.3927,-9.8716,0.2274,0.3358,-9.8716,1.1367,3.4342,1.6862,1489
-1.0979,-9.8734,-0.2124,0.3684,-9.8734,2.1501,4.6738,2.1038,1490
-0.241,-9.8726,0.2996,0.5347,-9.8726,1.8076,4.225,1.8576,1491
-2.862,-9.8662,-0.322,1.0469,-9.8662,1.3877,3.0213,1.9548,1493
-1.2028,-9.8755,0.0034,0.3028,-9.8755,0.6297,2.8849,1.6714,1494
-0.271,-9.8634,0.1197,0.2269,-9.8634,0.5553,2.5855,2.0856,1495
-1.017,-9.8834,0.1264,0.6316,-9.8834,2.05,4.1143,2.3533,1496
-0.6922,-9.8704,0.0699,0.4012,-9.8704,1.6457,3.1028,2.3615,1497
-0.016,-9.8814,0.0261,0.0427,-9.8814,0.1181,1.8467,1.6848,1498
-0.0207,-9.8733,0.0006,0.0183,-9.8733,0.1168,1.7213,1.635,1499
-0.4459,-9.8781,0.1245,0.3903,-9.8781,1.8596,4.8738,1.7988,1500
-1.113,-9.8811,-0.3245,0.6294,-9.8811,0.5658,3.0365,2.8487,1501
-0.0406,-9.8751,-0.0175,0.012,-9.8751,0.1089,1.6062,1.5617,1502
-0.2413,-9.8722,0.0015,0.2094,-9.8722,0.8528,1.9633,1.7659,1504
-4.5737,-9.8647,-0.0814,1.798,-9.8647,3.6128,7.8515,3.7295,1505
0.0067,-9.8792,0.4725,0.3826,-9.8792,1.1778,3.5671,2.8908,1506
0.0335,-9.8757,0.124,0.0644,-9.8757,0.1797,1.8847,1.8404,1507
0.0374,-9.8738,0.0752,0.025,-9.8738,0.1713,1.7637,1.6953,1508
-0.4003,-9.8693,-0.0342,0.2475,-9.8693,0.9475,2.523,1.879,1509
-5.571,-9.8687,-0.1763,1.6446,-9.8687,1.5738,3.6816,1.814,1510
0.0942,-9.8728,0.1229,0.0148,-9.8728,0.0669,1.703,1.6113,1511
-1.4202,-9.8694,0.0692,0.5412,-9.8694,1.5478,5.9202,2.2837,1513
0.0882,-9.8709,0.1161,0.0091,-9.8709,0.0374,1.6591,1.614,1514
