AYGX_min,AZ_mean,AYGX_mean,AYGX_std,AZ_mean,GX_std,Gnorm_max,Gnorm_median,timestamp
-0.1915,-9.7764,-0.0186,0.0701,-9.7764,0.2314,3.2091,3.1029,0
-0.1085,-9.7746,-0.0266,0.0389,-9.7746,0.1239,3.1764,3.1021,1
-0.1627,-9.7777,-0.0033,0.1025,-9.7777,0.1584,3.6624,3.1303,2
-0.0616,-9.7754,-0.0196,0.013,-9.7754,0.0208,3.1395,3.1087,3
-0.025,-9.7762,-0.0183,0.0037,-9.7762,0.0127,3.116,3.0929,4
-0.0229,-9.7768,-0.0182,0.0027,-9.7768,0.0158,3.1315,3.1008,6
-260.122,-9.4772,9.0026,111.4,-9.4772,16.9387,82.3842,3.1442,7
-285.0028,-9.5908,-41.1419,89.2071,-9.5908,26.4166,97.7873,30.4833,8
-147.0454,-9.3766,12.3053,91.9597,-9.3766,17.3248,124.4367,38.2632,9
-171.9839,-9.5201,-33.345,44.1975,-9.5201,15.9585,107.6848,18.7212,10
-14.039,-9.3288,8.171,15.099,-9.3288,5.3126,19.4254,5.979,11
-48.3591,-9.6441,5.1921,23.958,-9.6441,10.119,38.2189,23.8481,12
-15.742,-9.8275,-4.1549,5.8191,-9.8275,3.4573,28.8748,23.281,13
-78.1732,-9.8352,5.6236,28.8004,-9.8352,10.6687,55.7433,36.6129,14
-34.1997,-9.7101,2.3243,12.4821,-9.7101,8.3131,47.0468,28.5546,15
-18.1301,-9.7925,-1.2473,6.9599,-9.7925,5.5098,19.4711,9.5202,16
-7.4686,-9.7734,3.3874,5.6715,-9.7734,4.4083,29.1593,15.145,17
-3.0116,-9.7058,2.195,5.3986,-9.7058,4.1482,26.9689,15.1737,18
-11.997,-9.7963,2.3506,7.165,-9.7963,4.6131,41.8209,26.5769,19
-5.8913,-9.7972,0.8056,3.1721,-9.7972,4.2437,34.2518,14.125,20
-21.5398,-9.74,-8.6567,8.3369,-9.74,4.063,20.5981,10.9436,21
-12.9959,-9.691,-3.7712,5.9177,-9.691,3.5453,8.5448,4.088,22
-10.6355,-9.6327,-2.174,6.8128,-9.6327,3.8631,9.3448,3.9803,23
-10.0236,-9.6321,-3.9935,2.9887,-9.6321,1.4415,5.5372,3.7698,24
-6.2085,-9.6354,-3.6983,1.973,-9.6354,0.9222,4.3334,3.3963,25
-2.6036,-9.6139,0.9969,2.0693,-9.6139,1.0699,3.2545,2.9161,26
-5.9513,-9.617,-2.3508,2.2435,-9.617,1.0134,3.8924,2.9349,27
-5.9004,-9.6585,-3.4097,1.5141,-9.6585,0.7707,4.4818,3.507,28
-14.2743,-9.6092,-7.1757,4.8367,-9.6092,1.8115,6.2023,4.6276,29
-6.5638,-9.6781,-0.2639,5.4205,-9.6781,3.4673,6.3929,4.9646,30
-10.6893,-9.7544,4.1097,8.665,-9.7544,5.9551,16.3152,11.8468,31
-19.0973,-9.6744,-3.5726,11.8048,-9.6744,6.9999,13.4731,8.6108,32
-97.7924,-9.983,8.8015,37.3588,-9.983,12.0942,74.0495,34.2084,33
-11.3823,-9.7538,3.7856,8.2726,-9.7538,7.449,35.3441,23.1537,34
-0.9806,-9.8748,9.7917,11.0002,-9.8748,7.7859,30.445,21.6384,35
-9.9881,-9.6962,-0.189,4.9533,-9.6962,0.4193,17.544,16.5237,36
-9.178,-9.8321,2.926,7.3389,-9.8321,11.2336,43.7495,16.0644,37
-1.8985,-9.9095,0.6176,1.9343,-9.9095,4.4955,27.6777,23.5374,38
-3.4594,-9.9236,-1.6694,1.188,-9.9236,1.2815,12.1133,10.5659,39
-6.4281,-9.7535,-1.6418,2.6888,-9.7535,1.2465,14.2339,13.2453,40
-15.9565,-9.8635,-1.5973,6.2469,-9.8635,6.1797,21.8788,13.8799,41
-24.0859,-8.592,-2.2642,7.2008,-8.592,6.3101,19.7665,9.0712,42
-29.8807,-9.6414,-0.8401,11.5032,-9.6414,8.6009,28.1404,18.2458,43
-1.0777,-9.6818,0.4068,1.1267,-9.6818,1.0971,10.2536,7.0141,44
-0.6192,-9.5929,3.305,3.1791,-9.5929,3.7934,15.7801,11.7491,45
-2.1358,-9.7195,3.4407,3.8784,-9.7195,1.3859,14.2201,7.333,46
-1.218,-9.7625,0.1676,0.8583,-9.7625,0.8049,7.4766,6.9659,47
-2.1196,-9.9044,3.1228,2.5274,-9.9044,0.9834,9.4815,6.2293,48
-8.9273,-9.7984,-2.1359,2.7381,-9.7984,1.7677,12.7748,10.3572,49
-1.1098,-9.3996,0.3001,1.424,-9.3996,2.879,16.0534,11.3417,50
-6.4979,-9.782,0.2763,3.1657,-9.782,2.158,23.6873,8.8725,51
-5.7425,-9.61,1.1167,4.1811,-9.61,8.9351,29.2918,14.7047,53
-15.7482,-10.1539,1.3056,7.5056,-10.1539,10.8317,30.1007,25.7316,54
-3.8236,-9.6852,0.5143,2.125,-9.6852,3.6698,22.4923,7.9074,55
-2.5493,-9.8594,0.3225,3.1582,-9.8594,2.954,18.5123,14.9508,56
0.0,-9.8097,1.1524,1.3752,-9.8097,4.8321,14.7655,13.0885,57
-2.3407,-9.7059,1.1979,2.3783,-9.7059,8.2562,25.9253,13.1912,58
-1.2378,-9.8602,1.2714,1.6673,-9.8602,2.448,24.0311,20.5468,59
-6.6675,-9.9035,-1.682,2.7616,-9.9035,6.0132,17.2648,10.2258,60
-1.3656,-9.7043,2.6843,3.5356,-9.7043,4.6233,30.6947,12.9064,61
-1.2013,-9.8958,5.245,6.9436,-9.8958,7.6462,25.7249,20.2509,62
-6.9123,-9.8845,0.0166,2.968,-9.8845,4.4433,15.4045,11.8282,63
-10.4906,-9.7681,1.4339,5.9702,-9.7681,8.1914,21.8984,12.8809,64
-3.0503,-9.7834,1.1399,2.774,-9.7834,6.2844,18.1851,12.6197,65
-1.7956,-9.7833,2.7758,3.809,-9.7833,5.5383,14.1977,9.7204,66
-2.8133,-9.7315,0.938,2.6116,-9.7315,4.1032,19.5833,12.6747,67
-10.7524,-9.8131,-2.1612,5.8709,-9.8131,2.4374,15.1545,13.8002,68
-3.8516,-10.0355,0.6485,3.1082,-10.0355,3.5984,13.6518,11.2802,69
0.1658,-9.8018,2.8828,3.3667,-9.8018,4.7559,16.6926,12.8272,70
-2.2038,-9.8757,-0.3908,0.9386,-9.8757,2.6075,9.9495,5.3107,71
-4.4083,-9.7726,1.1595,2.5555,-9.7726,4.6096,15.9715,9.0851,73
-3.631,-9.8674,0.5458,2.5674,-9.8674,3.5178,13.969,7.4067,74
-8.0324,-9.5131,4.0519,10.2733,-9.5131,3.3707,19.9442,18.3202,75
-2.3942,-10.3781,-0.5406,0.8771,-10.3781,1.0072,7.4606,4.617,76
-1.0245,-9.8904,-0.3256,0.386,-9.8904,1.0769,7.6235,3.1201,77
-0.1224,-9.6443,0.2683,0.2382,-9.6443,0.6801,9.9717,5.9319,78
-0.4001,-9.7904,4.345,2.5488,-9.7904,2.6223,13.8055,11.2785,79
-0.8224,-9.4347,-0.0193,0.5566,-9.4347,1.2065,9.1797,6.9676,80
-6.8318,-9.7855,-0.9678,2.9577,-9.7855,5.0953,16.5083,9.1851,81
-5.2648,-7.4036,1.2401,3.9827,-7.4036,2.3932,22.0854,16.3997,82
-3.2739,-9.7769,1.0893,2.3569,-9.7769,4.6098,15.4153,8.8767,83
-2.3654,-9.5581,1.3097,2.7369,-9.5581,5.2586,12.8945,7.9861,84
-2.837,-9.596,-0.4018,1.3539,-9.596,3.0804,15.8254,10.9153,85
-1.3821,-9.1847,0.9016,1.4691,-9.1847,2.8054,23.67,9.8069,86
-2.7285,-9.9583,-1.2893,1.2019,-9.9583,1.04,20.1616,15.4433,87
-1.7343,-8.736,2.0177,2.5023,-8.736,1.0701,18.3138,10.2782,88
-3.1268,-9.6908,-0.9845,0.927,-9.6908,1.7185,22.359,20.5102,89
-0.6252,-9.8073,2.305,1.8076,-9.8073,1.9484,14.1219,10.9523,90
-2.7666,-9.8146,-0.8247,0.7689,-9.8146,1.2623,10.5961,6.7375,91
0.0419,-9.817,1.3321,1.0713,-9.817,1.5927,11.1279,9.5685,92
-3.4498,-9.8096,-1.1809,0.9799,-9.8096,1.1555,7.9013,5.8384,93
-10.0581,-9.8275,-1.4496,3.7946,-9.8275,1.8961,28.7867,20.0193,94
-9.4267,-9.9279,-1.9689,2.5278,-9.9279,4.248,53.6456,32.2926,95
-9.5417,-10.0352,-1.1628,4.5773,-10.0352,2.0036,31.7097,27.8932,96
4.6868,-9.8196,14.5452,6.4751,-9.8196,3.1543,28.7067,15.4863,97
-4.4088,-9.8022,0.3547,3.2487,-9.8022,5.069,14.4893,11.6435,98
-0.3106,-9.6712,3.1545,2.0558,-9.6712,2.8002,15.883,7.8937,99
-4.8564,-9.8338,-1.7376,2.0614,-9.8338,3.0815,8.8107,7.7894,100
-4.7297,-9.8213,0.9688,3.0315,-9.8213,4.9943,18.2022,12.7242,101
-1.6586,-9.7201,-0.2133,1.1108,-9.7201,3.0616,9.7529,7.7198,102
-0.741,-9.7582,0.3772,1.0149,-9.7582,4.0292,11.9055,8.8063,103
-1.0007,-9.7514,1.14,2.3874,-9.7514,3.7059,13.4784,8.1753,104
-5.1653,-9.83,1.1045,3.3213,-9.83,6.8292,18.7366,11.1511,105
-12.2293,-9.8788,1.3834,6.7708,-9.8788,7.3087,16.0123,12.4352,106
-5.7288,-9.6387,-0.9231,3.0955,-9.6387,4.0953,8.8113,6.107,107
-3.8617,-9.7613,-0.8088,2.1859,-9.7613,3.3903,10.6464,8.4313,108
-0.8263,-9.7713,0.3473,1.6485,-9.7713,0.8901,14.8551,6.6024,109
-5.2292,-10.0152,-0.5267,1.9641,-10.0152,3.4941,12.4563,5.6408,110
-6.7413,-9.8051,3.9053,8.2883,-9.8051,7.8596,21.6259,11.6431,111
-0.8403,-10.0019,0.8049,1.0325,-10.0019,1.7056,9.6007,6.372,113
-12.917,-9.6516,1.0262,5.98,-9.6516,8.7684,17.2529,11.806,114
-7.4649,-9.7538,-0.0748,2.4241,-9.7538,4.4571,11.2233,6.2012,115
-7.013,-9.8967,3.0588,5.9297,-9.8967,9.1977,18.86,12.498,116
-4.0497,-9.7062,0.1229,2.4964,-9.7062,3.8016,10.483,8.487,117
-6.5134,-9.8304,3.6629,7.5134,-9.8304,6.9794,16.329,12.6176,118
-1.2274,-9.6372,4.3244,6.6276,-9.6372,4.0378,13.3871,9.8429,119
-0.3421,-9.7733,0.9371,0.6693,-9.7733,0.6441,10.5347,5.4471,120
-9.1744,-9.8295,-0.9813,4.7082,-9.8295,7.0047,18.676,9.833,121
-15.0533,-9.1726,-2.7688,9.9065,-9.1726,4.8256,30.4578,20.2829,123
-8.1972,-9.7906,0.4627,3.3854,-9.7906,7.2327,19.0322,9.4821,124
-3.4558,-9.7758,0.6587,3.274,-9.7758,6.1276,21.3111,10.2514,125
-13.587,-9.7863,0.5961,5.1797,-9.7863,6.8274,14.0892,10.78,126
-1.1029,-9.7639,2.3393,2.7091,-9.7639,2.6255,12.209,7.9399,127
-13.7193,-9.7603,10.3873,14.4174,-9.7603,4.6431,21.0045,16.5959,128
-3.5242,-9.5435,0.5622,2.1168,-9.5435,6.2831,17.2204,7.8772,129
-10.3218,-9.512,-2.8482,4.2913,-9.512,6.696,15.3374,10.6118,130
-18.6302,-9.6995,0.1565,6.0649,-9.6995,7.6706,16.2092,10.7538,131
-11.5264,-9.8299,1.3582,6.1012,-9.8299,6.714,17.8483,12.6735,133
-19.6089,-9.7776,0.1397,8.9212,-9.7776,7.8183,21.4779,14.4141,134
-2.8687,-9.8772,-0.4425,1.4008,-9.8772,2.0017,9.8326,7.0501,135
-9.5334,-9.5565,-2.0262,4.5126,-9.5565,3.9797,13.5519,9.2865,136
-1.4721,-10.3638,0.4503,1.5055,-10.3638,0.648,8.6453,6.4503,137
-3.5028,-9.5886,-0.7552,1.6984,-9.5886,1.9139,12.8943,5.6545,138
-7.8405,-9.3221,-1.59,3.0543,-9.3221,2.5377,16.1604,12.279,139
-8.7313,-9.3952,0.3348,2.9186,-9.3952,2.8617,17.8094,11.7442,140
-5.5263,-8.4104,-0.2423,4.3931,-8.4104,0.5514,18.2058,12.3227,142
-3.7745,-8.8579,1.9159,3.7907,-8.8579,3.2534,11.6909,10.0282,143
-6.0069,-9.1824,1.3566,4.2136,-9.1824,5.2587,29.762,12.7571,144
-7.951,-9.112,0.2257,6.7083,-9.112,2.7868,23.4639,11.2031,145
-4.951,-9.8863,-0.8704,2.4861,-9.8863,1.3123,19.0748,11.9148,146
-2.5854,-9.9211,-0.1883,1.4509,-9.9211,2.5896,14.7064,8.158,147
-4.5686,-10.067,-1.4753,1.9657,-10.067,0.936,12.178,7.598,148
-6.11,-10.2817,-2.1318,2.3054,-10.2817,0.8745,14.8584,13.2155,149
-1.8564,-9.4562,2.3556,5.1073,-9.4562,5.6392,23.214,8.7803,150
-3.7885,-10.0573,-0.413,4.3831,-10.0573,2.0657,12.3172,9.0848,151
-15.0798,-9.7754,0.9455,9.876,-9.7754,5.9393,19.707,7.4214,153
-18.8283,-9.389,2.2475,10.3077,-9.389,3.3504,15.9038,12.8524,154
-2.3297,-9.8581,-0.1027,2.3512,-9.8581,4.7458,15.7134,9.5025,155
-2.5266,-9.8592,-0.6335,1.6573,-9.8592,2.0253,9.0103,5.3909,156
-1.2303,-9.8315,0.5563,1.4039,-9.8315,2.2016,9.2912,8.0249,157
-10.3868,-10.0597,-2.0932,5.8481,-10.0597,4.6536,21.0377,6.7829,158
-1.0015,-9.8683,0.7289,1.2025,-9.8683,1.4468,8.2811,4.6326,159
-8.4573,-9.7033,-0.1149,3.483,-9.7033,3.6488,12.1063,7.8896,160
-1.2691,-9.9567,3.1205,2.8875,-9.9567,5.431,16.909,13.8789,161
-2.4549,-9.8931,1.0966,2.1147,-9.8931,3.3291,11.477,7.7211,163
-4.4607,-9.7374,-0.7585,1.4828,-9.7374,2.3273,11.7442,7.792,164
-0.5918,-9.9139,0.2759,0.6924,-9.9139,3.5484,12.4136,10.4775,165
-0.3812,-9.8863,-0.0887,0.1513,-9.8863,0.6271,6.1756,4.0399,166
-1.9489,-9.6973,-0.0698,1.4189,-9.6973,0.5601,10.6035,8.8043,167
-0.7368,-9.9774,0.73,1.675,-9.9774,1.2404,8.8347,6.4762,168
-17.2548,-8.1767,-1.013,9.6738,-8.1767,6.2839,39.2679,23.7674,169
-5.4791,-9.6427,2.7698,6.104,-9.6427,6.0717,21.6969,13.6199,170
-6.7385,-9.8717,-0.0757,4.5865,-9.8717,3.8202,17.8349,15.6904,171
-1.8056,-9.761,-0.0963,0.9836,-9.761,3.4389,11.0714,7.3905,173
-7.3156,-9.7897,-1.2997,2.6642,-9.7897,2.5527,13.0564,7.4189,174
-2.256,-9.7089,1.8384,3.2987,-9.7089,4.5297,23.333,9.2381,175
-6.0475,-9.7655,-1.7921,2.9476,-9.7655,0.9919,12.1978,9.6765,176
-0.2575,-9.7209,0.8511,0.7442,-9.7209,1.2234,14.1691,8.7751,177
-0.1238,-9.7464,0.0648,0.1778,-9.7464,0.8112,9.288,7.9505,178
-0.2017,-10.1985,0.4127,0.3638,-10.1985,0.4406,14.7027,10.9638,179
-1.8446,-9.7856,0.8623,3.1557,-9.7856,1.0908,14.7434,12.0562,180
-6.3952,-9.6493,-0.9853,2.2456,-9.6493,2.4209,12.6575,8.5418,181
-0.1838,-10.0073,0.1105,0.2084,-10.0073,0.7819,9.7643,3.5842,182
-2.9032,-9.7125,0.7218,2.2045,-9.7125,2.7522,18.983,10.8665,183
-2.1901,-9.8409,-0.008,1.2448,-9.8409,2.7915,11.2418,7.743,184
-0.5425,-9.764,-0.1633,0.2721,-9.764,0.4103,6.399,4.8239,185
-2.8779,-9.8086,2.2016,4.4083,-9.8086,6.0337,18.193,11.5264,186
-7.038,-9.8401,2.9642,8.0884,-9.8401,12.1197,70.8327,22.7892,187
-9.3201,-9.7988,2.8218,5.819,-9.7988,7.6507,27.1176,20.1074,188
4.2424,-9.3673,11.6646,3.5421,-9.3673,2.1912,26.1565,14.1575,189
-3.6608,-9.7965,0.3609,2.1664,-9.7965,2.8237,8.59,6.0005,190
-1.7809,-9.6878,-0.9833,0.68,-9.6878,0.9465,5.8532,4.2361,191
-0.8002,-9.7851,0.087,0.441,-9.7851,0.4591,6.9037,3.7456,192
-2.0919,-9.8278,-0.1903,0.9845,-9.8278,2.8271,14.9188,9.6374,193
-1.5334,-9.7371,5.1622,6.7349,-9.7371,6.4742,19.2733,16.819,194
-8.0677,-9.9072,0.7773,4.5763,-9.9072,4.5025,19.1949,12.364,195
-0.1983,-9.8096,0.4975,0.5807,-9.8096,1.2143,5.9806,4.4856,196
-1.1854,-9.6242,-0.4236,0.38,-9.6242,0.8277,7.9931,4.106,197
-0.6554,-9.8313,-0.2087,0.2109,-9.8313,0.9899,9.0607,8.3545,198
0.0692,-9.6897,0.2647,0.1311,-9.6897,0.2535,6.7353,3.9302,199
-2.1307,-9.8102,-0.2073,1.0152,-9.8102,2.1549,15.4625,9.3022,200
-0.8031,-9.6624,1.8032,1.8992,-9.6624,2.0429,15.3223,14.7806,201
-1.7101,-10.1065,-0.2385,1.4483,-10.1065,0.5169,18.2281,15.5997,202
-7.0019,-9.7952,1.1843,3.3131,-9.7952,5.3307,24.6884,9.3847,203
-6.2894,-9.9378,1.8995,3.2043,-9.9378,4.7285,23.178,10.8473,204
-7.6,-9.8108,-1.3339,3.3809,-9.8108,2.0699,18.1884,14.4066,205
-0.8082,-9.8746,0.1542,0.733,-9.8746,1.6834,25.723,20.4975,206
-4.3623,-9.2665,-0.2756,2.1106,-9.2665,1.3967,23.7685,14.2557,207
-12.9839,-7.4178,-3.0528,8.9311,-7.4178,1.5522,25.9678,12.0712,208
-6.2989,-9.8276,-1.7636,2.5782,-9.8276,3.6271,15.4965,12.2886,209
-5.9408,-9.712,-0.3667,1.6759,-9.712,2.9528,10.4019,5.6599,210
-4.3447,-9.8227,3.2115,6.0598,-9.8227,2.2964,20.5042,13.7915,211
-3.0452,-9.7129,0.7882,2.4206,-9.7129,3.6621,13.8653,5.9851,213
-0.3376,-9.8218,3.7391,4.9926,-9.8218,5.3603,17.9166,15.7986,257
-2.751,-9.7469,-0.4396,1.0294,-9.7469,1.7135,7.8715,5.1619,258
-6.3437,-9.8744,-0.0727,3.1045,-9.8744,5.6155,19.5762,14.415,259
-4.4893,-9.7198,1.2272,3.4874,-9.7198,3.6777,22.2406,10.2331,260
1.7844,-9.7512,6.9711,3.6791,-9.7512,2.1667,19.4373,10.1785,261
-0.3081,-9.6999,7.6471,5.3437,-9.6999,3.203,18.0177,12.1416,262
-2.3678,-9.7345,-0.5432,1.9268,-9.7345,2.6569,10.9356,8.4948,263
-4.6078,-10.1166,3.2814,6.2244,-10.1166,5.8666,26.4914,23.9587,264
-9.8834,-9.8921,-1.3518,6.3231,-9.8921,1.7664,18.5305,13.9881,265
-3.6658,-9.5641,0.7401,2.8507,-9.5641,3.1829,12.1977,9.0271,266
-2.8306,-9.9012,-0.3308,1.379,-9.9012,3.9785,9.9383,8.0802,267
-1.1336,-10.0587,-0.1067,0.6923,-10.0587,2.6438,11.6254,9.9255,268
-5.3192,-9.3142,0.99,7.2778,-9.3142,1.3105,15.1372,11.6253,270
-2.4636,-9.7481,-0.8276,0.9816,-9.7481,1.2327,27.2281,24.8002,271
-0.9643,-9.7504,12.9495,11.2763,-9.7504,1.0352,47.642,36.7675,272
-15.2655,-8.9334,-0.0734,4.0418,-8.9334,3.8178,24.0113,7.3321,273
-6.1665,-9.7659,-0.5756,2.2007,-9.7659,2.9445,12.1607,6.4418,274
-5.0589,-9.8958,3.4345,3.84,-9.8958,1.2063,18.7465,7.8103,275
-14.7947,-9.9032,2.0632,10.5083,-9.9032,11.4876,52.4714,29.6248,276
-25.4311,-9.8845,11.0816,23.822,-9.8845,5.6641,41.7862,29.5464,277
-10.2039,-9.9848,7.8485,12.9395,-9.9848,9.6476,60.9219,48.0504,278
0.0277,-9.6362,4.5392,5.3228,-9.6362,4.3132,11.9735,11.5768,279
-8.8449,-9.7774,2.4231,4.2426,-9.7774,8.0008,27.0608,14.812,281
-1.9869,-9.7746,0.4894,0.9846,-9.7746,2.3113,14.1755,9.7246,282
-1.0494,-9.5053,-0.3258,0.5151,-9.5053,0.6464,9.7486,8.3013,283
-0.2207,-10.0012,0.4641,0.4877,-10.0012,1.1488,18.4727,15.4773,284
-1.7318,-9.789,2.9847,5.749,-9.789,5.084,17.1778,6.5027,285
-6.2891,-9.6752,8.1622,8.8989,-9.6752,0.526,17.8612,13.1733,286
-2.4393,-9.6344,0.3706,2.5618,-9.6344,3.522,16.1103,7.0036,287
-9.153,-9.6282,13.2347,15.0872,-9.6282,9.4172,55.0092,26.1589,288
-18.0119,-9.8918,-6.6193,9.21,-9.8918,3.6301,22.264,15.5393,289
-22.6287,-9.8291,2.5517,13.4207,-9.8291,7.0962,54.2847,19.7293,291
-21.0365,-9.7956,10.1498,19.3875,-9.7956,10.8073,40.2796,23.645,292
-3.9439,-9.7999,-0.6346,1.65,-9.7999,0.9709,16.0265,11.7644,293
-4.757,-9.969,-1.4349,2.3878,-9.969,1.6794,11.9638,10.8176,294
-2.9877,-9.3747,-0.5206,1.5141,-9.3747,3.631,15.6993,10.6918,295
-16.2468,-10.0668,41.5314,40.8837,-10.0668,10.3053,41.5879,33.6976,296
-10.3545,-10.1629,6.6239,10.1657,-10.1629,2.0487,37.7002,28.0838,297
-3.2569,-9.2475,-0.149,1.8148,-9.2475,3.1429,21.2268,8.9259,298
-6.8573,-10.1557,-0.0708,4.3958,-10.1557,7.7967,21.1169,14.9098,299
-28.3451,-9.8046,1.2567,10.1123,-9.8046,7.4002,33.1861,12.8719,301
-5.5826,-9.7011,-0.0748,2.5395,-9.7011,3.594,18.9592,9.1841,302
-4.6241,-9.4172,0.949,3.5592,-9.4172,5.3883,16.3904,9.8778,303
3.2653,-9.811,6.5612,2.3113,-9.811,2.7659,15.3051,11.5983,304
-2.2585,-9.6438,-0.7578,0.9861,-9.6438,1.3673,11.3068,9.258,305
-5.0773,-10.3972,0.0459,2.826,-10.3972,4.1238,13.0349,12.1401,306
-1.3105,-9.7044,0.1694,1.2716,-9.7044,1.3021,7.9167,4.5166,307
-4.7315,-9.9521,0.207,2.3596,-9.9521,5.4477,16.1696,12.9862,308
-1.8893,-10.2554,3.0319,5.1285,-10.2554,6.9386,23.2836,20.6718,309
-6.1769,-9.6526,-0.1492,3.0861,-9.6526,4.4567,16.5475,9.2832,311
-3.0918,-9.8428,-0.0752,1.2917,-9.8428,3.3557,13.2281,7.3138,312
-2.4806,-9.6586,-0.7775,1.4892,-9.6586,1.8114,9.3247,5.6701,313
-4.1265,-9.7528,-0.0714,1.5836,-9.7528,1.0134,11.7135,6.6518,314
-1.9327,-9.5405,-0.4026,1.0436,-9.5405,0.7954,7.7953,4.7654,315
-0.7268,-9.7593,0.3177,0.6232,-9.7593,1.7723,8.9159,5.1154,316
-3.9297,-9.8501,-1.1553,1.6197,-9.8501,2.5054,9.9859,6.7816,317
-1.2736,-9.861,-0.0999,0.7479,-9.861,1.759,6.7194,3.8269,318
-1.7552,-9.7674,22.8253,14.3137,-9.7674,2.1782,25.3039,19.9545,319
-6.7825,-9.757,1.1996,3.9648,-9.757,4.2256,42.6618,14.9102,320
-11.2102,-9.7052,0.2908,5.0106,-9.7052,7.2567,20.5807,9.0547,321
-2.0023,-9.7635,0.2509,1.389,-9.7635,3.2783,14.3409,12.6406,322
-0.4062,-9.9642,0.288,0.7719,-9.9642,0.9694,12.1038,9.8979,323
-5.5868,-9.7824,7.0957,8.8196,-9.7824,2.9705,17.8446,12.185,324
-5.576,-9.5414,0.6678,4.6283,-9.5414,5.7222,18.7169,15.5754,325
-3.2526,-9.6111,1.1324,2.731,-9.6111,2.8128,11.1018,8.8933,326
-1.4075,-9.6134,-0.1318,0.685,-9.6134,1.5873,8.0543,3.5554,327
-0.5847,-9.7119,-0.0354,0.2138,-9.7119,0.9777,9.0864,3.9557,328
-2.9609,-10.2059,-0.6898,1.1407,-10.2059,2.7496,10.809,9.4883,329
-9.0264,-9.7245,3.2005,5.9355,-9.7245,7.1268,25.8641,18.6955,330
-6.1919,-9.6919,1.2372,2.4686,-9.6919,2.8372,12.7055,7.4156,331
-3.4929,-9.7902,0.9755,3.0285,-9.7902,5.5412,14.5393,9.7899,332
-0.6632,-10.0335,0.4087,0.5747,-10.0335,0.7077,6.929,4.6108,333
-2.9345,-9.6798,-0.599,1.912,-9.6798,2.2304,13.6139,11.7576,334
-9.2026,-10.0468,-3.4623,5.2572,-10.0468,1.7036,13.9429,11.1843,335
-3.064,-9.5011,-1.5146,1.1431,-9.5011,2.2014,9.8594,9.0091,336
-3.2008,-9.8128,0.011,2.2754,-9.8128,4.3179,16.4836,12.1416,337
-8.213,-9.5918,-1.128,3.6823,-9.5918,0.9758,11.5763,6.8728,338
-2.8821,-9.6855,0.9689,2.8213,-9.6855,5.51,18.4971,13.0063,340
-2.6719,-9.7007,0.5375,2.5926,-9.7007,3.3119,11.842,5.9147,341
-0.5671,-9.7137,0.5722,0.9834,-9.7137,1.7154,12.1763,8.2639,342
-2.1962,-9.0376,0.1832,1.3347,-9.0376,1.9345,7.7296,4.1592,343
-3.8394,-9.8449,-0.0793,2.0382,-9.8449,1.2907,10.1845,7.8849,344
-0.4345,-9.6232,-0.0257,0.2537,-9.6232,1.3227,5.1674,3.2232,345
-0.7298,-9.5138,-0.2871,0.2842,-9.5138,0.8178,6.5281,3.6317,346
-1.4645,-9.7164,-0.1785,0.4531,-9.7164,1.8602,7.4597,4.7741,347
-0.364,-9.5705,0.2222,0.504,-9.5705,2.1689,7.6016,4.2457,348
-7.8801,-9.6581,-0.5545,4.2194,-9.6581,6.8241,26.334,12.1515,350
-7.9374,-9.9213,1.3679,3.9512,-9.9213,4.6748,20.6576,9.1682,351
-12.6682,-9.6115,0.0078,3.5603,-9.6115,7.3339,21.0074,12.2296,352
-1.2212,-9.8567,0.2166,1.4088,-9.8567,2.9685,7.402,5.2539,353
-1.1768,-9.7864,-0.0102,0.721,-9.7864,1.6372,8.5967,5.4201,354
-2.7621,-9.7523,0.0074,2.1874,-9.7523,1.1938,7.6252,6.7894,355
-1.1497,-9.7575,0.1157,0.8103,-9.7575,1.8492,7.1768,5.4147,356
-1.1838,-9.8414,0.0459,0.5056,-9.8414,1.4145,7.5344,4.0852,357
-1.362,-9.9288,-0.1036,0.7065,-9.9288,1.4803,9.8822,7.9138,358
-4.406,-9.7593,0.1624,1.6988,-9.7593,3.9573,12.7409,6.4214,360
-1.1826,-9.6016,1.2315,2.4187,-9.6016,3.0418,10.6142,7.4828,361
-6.6665,-10.0273,-1.43,3.5655,-10.0273,3.3897,15.8878,14.4407,362
-1.7283,-9.0282,0.2501,1.2873,-9.0282,1.777,7.6682,6.152,363
-0.9867,-9.842,-0.2832,0.3631,-9.842,1.7662,13.5444,6.2532,364
-0.5433,-9.6759,0.6526,1.0048,-9.6759,1.4546,8.9888,5.9412,365
-1.042,-9.6546,1.0765,1.6734,-9.6546,3.3977,15.355,11.8255,366
-0.208,-9.395,0.8593,0.6472,-9.395,3.5822,11.6992,7.8958,367
-2.8562,-9.7635,-0.6101,1.8494,-9.7635,1.0458,9.448,7.3456,368
-3.4748,-9.6674,0.5288,2.6997,-9.6674,3.4516,11.5982,5.6959,370
-1.5781,-9.6176,-0.1796,0.7918,-9.6176,1.484,8.2801,5.0227,371
0.0967,-9.4888,0.5099,0.3602,-9.4888,0.9714,7.7728,4.2773,372
-2.8256,-9.6836,0.9201,2.2058,-9.6836,0.5925,10.7069,8.0901,373
-3.1524,-9.73,-0.0301,1.7085,-9.73,1.8786,9.1858,6.7586,374
-0.5984,-9.7625,-0.0607,0.3007,-9.7625,0.5053,5.6314,3.274,375
-11.0732,-9.7821,-0.768,3.0144,-9.7821,3.19,13.0241,7.6922,376
-1.9054,-9.731,2.1008,2.4495,-9.731,3.7302,10.2333,8.229,377
-11.2729,-9.6668,-0.4825,4.0754,-9.6668,3.0187,17.9303,8.6019,378
-3.5537,-9.9498,1.0389,2.9617,-9.9498,3.6571,17.2958,12.8386,380
-2.9905,-9.7094,0.3378,2.0637,-9.7094,3.6691,12.6933,8.5861,381
-4.8463,-9.9002,-1.272,1.9139,-9.9002,1.768,13.6343,12.0125,382
-2.4356,-9.5114,-0.022,1.4767,-9.5114,3.82,8.8854,5.4007,383
-1.543,-9.8435,2.4821,3.2619,-9.8435,3.5402,17.6479,11.7759,384
-0.1515,-9.8976,0.7575,0.9524,-9.8976,1.3305,8.8733,6.5407,385
-0.2067,-9.2154,4.0551,3.7833,-9.2154,1.5601,16.5664,9.4362,386
-4.7882,-9.7391,-0.3799,2.7246,-9.7391,1.5069,14.7344,10.3576,387
-2.0827,-9.7779,-0.2297,0.7321,-9.7779,2.1026,7.0004,3.9016,388
-0.1707,-10.1202,0.4581,0.6361,-10.1202,2.5544,12.5565,10.5891,389
-1.61,-9.7975,-0.0791,0.7761,-9.7975,2.317,8.9006,6.2556,390
-1.0369,-9.6963,0.0234,0.799,-9.6963,3.3601,12.0464,8.1233,391
-1.4112,-9.8629,-0.1061,0.5635,-9.8629,0.5817,7.3491,4.298,392
-7.0797,-9.7818,2.4614,5.1445,-9.7818,5.1902,19.0544,15.6518,393
-1.0891,-9.8047,-0.5301,0.3781,-9.8047,1.3443,10.3716,9.1969,394
-0.8558,-9.4683,2.5416,2.9352,-9.4683,2.0244,11.9068,8.9173,395
3.3997,-8.489,19.1094,12.0782,-8.489,3.2075,41.53,34.0243,396
-6.8849,-9.8817,8.2176,14.1104,-9.8817,1.0776,34.1533,29.5044,397
-3.2341,-9.7146,1.3602,3.9613,-9.7146,3.7558,12.7146,10.1824,398
-3.5454,-9.8267,0.9068,2.7864,-9.8267,4.1998,17.2601,8.5518,400
-19.3541,-9.8424,7.2926,19.1888,-9.8424,16.7311,40.6984,30.5617,401
-10.3518,-9.1841,23.1449,32.0785,-9.1841,6.2132,33.8,29.6546,402
-2.6771,-9.7459,-0.4955,1.3347,-9.7459,2.3378,11.2799,6.5824,403
-0.804,-10.2916,0.1664,1.2139,-10.2916,2.5627,13.8158,9.7952,404
-5.5422,-9.3159,1.6452,3.5935,-9.3159,2.269,16.0272,10.5639,405
-1.4237,-9.8971,0.2925,1.0569,-9.8971,1.6437,13.3518,8.3585,406
-2.8483,-9.6555,1.4998,3.1272,-9.6555,2.391,13.9995,12.6558,407
-15.8464,-9.8642,1.3263,8.9725,-9.8642,4.8381,19.1989,12.0231,408
-6.8287,-9.7548,0.0384,2.1612,-9.7548,3.7848,16.8667,8.4841,410
-4.162,-9.558,-0.186,1.4824,-9.558,2.661,12.4154,6.364,411
-3.2607,-9.7059,-0.1509,2.0458,-9.7059,3.1579,9.4567,5.286,412
-0.1668,-9.92,0.2421,0.4368,-9.92,1.4314,7.8898,5.8645,413
-0.9364,-9.7975,0.8155,1.1766,-9.7975,1.809,12.3028,9.2441,414
-1.3507,-9.518,3.1378,4.4585,-9.518,4.5118,11.7471,8.8792,415
-0.415,-9.7506,0.3947,0.5722,-9.7506,2.1748,8.8545,7.7455,416
-2.9122,-9.8389,-0.1411,1.3237,-9.8389,2.3395,11.9859,10.7192,417
-4.3323,-9.663,-0.9488,1.8552,-9.663,2.7494,14.0645,7.9066,418
-6.5369,-9.795,1.0159,4.6401,-9.795,6.4125,34.3212,14.1945,420
-14.7065,-9.7538,-1.2982,5.8639,-9.7538,3.3083,23.1314,13.5436,421
-27.6761,-9.9408,7.4607,34.0955,-9.9408,18.2413,59.2522,23.5761,422
-41.2884,-10.0086,26.7837,53.7427,-10.0086,19.3034,46.0966,36.2949,423
-14.6989,-9.8201,7.7582,10.1899,-9.8201,6.0765,37.6384,31.1579,424
-2.4417,-10.0643,-0.3641,1.5173,-10.0643,2.0095,12.5552,11.1314,425
-2.1369,-9.8494,0.0174,1.0671,-9.8494,4.415,12.0327,9.3431,426
-11.3623,-9.9657,2.0612,6.7147,-9.9657,2.2551,19.7372,14.5377,427
-7.3719,-9.8074,6.9835,9.5286,-9.8074,5.5832,21.4001,9.9751,428
-4.5683,-10.0298,5.6417,7.4293,-10.0298,3.6345,14.7596,12.3168,429
-21.7211,-9.6917,33.8271,52.7539,-9.6917,25.9039,56.0001,44.4617,430
-12.633,-9.876,3.4997,9.1062,-9.876,3.8798,31.6067,14.5512,431
-4.6458,-9.4853,-1.1395,3.3243,-9.4853,1.8328,12.0489,9.5537,432
-3.0257,-9.9706,0.1996,2.4258,-9.9706,2.7201,13.4984,9.1222,433
-4.5854,-10.0237,0.0639,3.6909,-10.0237,4.4607,15.227,10.2834,434
-7.3556,-9.8475,-0.6507,4.4926,-9.8475,7.047,19.1109,12.8592,435
-11.7208,-9.8066,0.1476,4.851,-9.8066,3.3456,19.3738,11.0933,436
-4.4351,-9.6358,0.3861,4.3279,-9.6358,3.889,21.4246,17.7121,437
-11.6285,-9.9646,-0.7909,4.6078,-9.9646,7.8175,19.5535,8.9276,438
-4.0084,-9.8144,0.8848,2.4224,-9.8144,4.2954,13.5948,7.5028,440
-12.2312,-9.6984,-0.096,6.2369,-9.6984,6.2231,18.7171,11.7177,441
-0.6004,-9.9342,1.2975,1.2151,-9.9342,1.3227,12.1068,8.141,442
-1.7407,-9.7398,0.1093,1.1787,-9.7398,1.5264,15.742,6.4489,443
-1.348,-9.9249,0.4563,1.7397,-9.9249,2.9829,8.8431,7.8994,444
-0.7306,-10.038,-0.2411,0.4166,-10.038,2.8154,11.8022,9.4328,445
-4.798,-9.5778,1.8483,7.3634,-9.5778,1.2481,15.2661,11.8695,446
0.0,-9.658,1.1912,0.9512,-9.658,1.4278,15.6067,11.3693,447
-6.044,-9.8154,1.7395,5.1412,-9.8154,7.6651,22.1454,12.8652,448
-1.1066,-9.6466,0.1343,0.9626,-9.6466,1.3578,7.3863,5.8272,449
-5.2888,-10.1049,0.6446,4.1306,-10.1049,3.4751,16.416,7.7734,450
-8.3808,-9.7555,1.0328,3.3961,-9.7555,5.2855,13.7104,11.6377,451
-7.8501,-9.7736,1.8989,5.0316,-9.7736,5.1919,22.5362,11.31,452
-2.9894,-9.6937,1.4197,4.3075,-9.6937,4.4916,12.1443,9.9331,453
-5.7671,-9.6674,-0.6702,2.8858,-9.6674,2.3413,14.7772,12.9442,454
-0.8752,-10.1993,-0.1108,0.6007,-10.1993,2.8253,9.919,6.7249,455
-0.5363,-9.6541,0.1116,0.3424,-9.6541,1.0506,6.7635,4.6072,456
-5.3202,-9.9007,-0.5835,3.2076,-9.9007,4.474,18.4017,8.1357,457
-1.8061,-9.6554,1.1136,2.5693,-9.6554,3.3824,13.068,7.4025,458
-8.1144,-9.814,-0.0861,2.1633,-9.814,4.3699,15.2566,7.8727,460
-2.2604,-9.5724,-0.3416,1.2095,-9.5724,0.9966,7.9578,7.2085,461
-6.6678,-9.7148,0.7261,4.8249,-9.7148,5.1518,24.2495,17.9411,462
-11.3749,-9.6856,-2.867,4.6861,-9.6856,2.1069,13.0312,10.9704,463
-6.3996,-9.6509,-0.2964,4.5745,-9.6509,5.9471,22.9339,19.5459,464
-9.3385,-9.4986,25.3508,20.7833,-9.4986,2.379,46.7952,32.1894,465
3.3125,-9.3475,8.9343,4.0951,-9.3475,1.1422,12.4663,9.4717,466
-14.1122,-9.8446,-1.5187,7.8745,-9.8446,4.5711,40.035,30.0832,467
-11.0598,-9.7795,-1.6067,5.2007,-9.7795,4.1552,27.3737,13.4342,468
-12.9636,-9.9487,-0.6224,4.4044,-9.9487,5.2508,19.6026,11.2736,470
-6.1341,-9.8172,-1.2325,2.4096,-9.8172,3.478,15.1513,9.0178,471
-0.8115,-9.8437,3.5391,2.3969,-9.8437,8.4527,17.5948,13.0881,472
-8.8179,-9.9096,-0.0644,6.4244,-9.9096,8.241,30.1129,23.4455,473
-7.3563,-9.8208,2.9056,9.1374,-9.8208,2.5833,16.4494,14.316,474
-1.733,-9.7438,3.0518,4.8482,-9.7438,3.6439,15.092,12.6958,475
-18.1309,-9.7808,-5.8695,8.2894,-9.7808,6.9041,24.374,9.1607,476
-6.6069,-9.7459,1.6554,2.8706,-9.7459,5.1377,15.6978,9.8632,477
-1.7112,-9.4743,4.2256,4.9097,-9.4743,2.1623,14.9879,12.8581,478
-10.5891,-9.7887,0.5738,5.8216,-9.7887,6.5756,21.0003,12.2868,480
-3.1245,-9.9349,1.2821,3.036,-9.9349,5.06,15.578,11.4279,481
-17.0108,-9.6322,-1.3005,5.46,-9.6322,5.7794,17.8487,12.0712,482
-13.1398,-9.7405,0.9532,4.3566,-9.7405,4.0621,15.2446,9.3576,483
-3.9427,-9.8699,-0.3335,2.2119,-9.8699,1.7759,8.6279,5.9763,484
-4.4953,-9.8067,-1.4786,2.1911,-9.8067,3.0226,16.3855,15.0813,485
-10.5061,-10.051,-2.8987,4.2965,-10.051,9.9804,38.8754,28.8184,486
-5.5873,-9.3535,0.5332,3.6343,-9.3535,6.5382,20.0243,10.4713,487
-5.101,-9.7847,-0.2738,2.7442,-9.7847,5.5434,20.4564,12.4864,488
-8.5173,-9.7842,0.9982,3.9442,-9.7842,4.5204,16.6146,9.0976,490
-9.8349,-9.7971,-2.5974,3.9019,-9.7971,7.0009,23.2561,9.1603,491
-3.5258,-9.877,6.3366,7.6202,-9.877,10.0247,22.8568,16.907,492
-3.4317,-9.687,-1.691,1.354,-9.687,4.5505,15.2031,13.2481,493
-4.7574,-9.8402,-1.5432,1.6152,-9.8402,2.5586,10.2374,8.1202,494
-4.3695,-9.9005,1.2798,3.416,-9.9005,3.7866,12.5623,9.4795,495
-1.7391,-9.2694,-0.3716,0.7475,-9.2694,1.1335,7.1075,5.0197,496
-3.9871,-9.7175,1.7634,3.0518,-9.7175,5.0011,13.9237,10.3084,497
-0.5639,-10.0563,0.1748,0.7326,-10.0563,1.2367,8.3914,5.1938,498
-17.9476,-9.8515,-0.2168,5.7208,-9.8515,6.8652,23.8124,12.6003,500
-5.4131,-9.7204,0.6117,3.4996,-9.7204,7.1885,19.7874,10.1728,501
-2.197,-9.6991,-0.4084,0.9341,-9.6991,1.3277,12.0858,7.7411,502
-7.4984,-9.7212,-2.0636,3.002,-9.7212,3.4427,12.5216,9.1569,503
-0.9177,-9.8474,6.4766,6.9708,-9.8474,5.4008,20.8315,18.9681,504
-9.0067,-9.7377,-2.0999,7.0755,-9.7377,2.4687,19.5065,13.8503,505
-4.2498,-9.8566,0.9612,3.7621,-9.8566,2.0821,19.6644,14.0359,506
-1.2048,-9.6721,1.2969,1.8824,-9.6721,6.8861,14.8554,12.3222,507
-3.5786,-9.6622,1.5191,3.8639,-9.6622,1.4379,13.4858,10.4461,508
-0.259,-9.9163,1.1897,1.3578,-9.9163,1.7398,20.2554,7.8022,509
-2.0365,-9.7479,-0.0915,1.1346,-9.7479,2.5449,8.9627,7.9149,510
-0.5868,-9.8247,0.5178,0.701,-9.8247,1.7364,8.7137,6.1012,511
-1.8272,-9.7907,-0.2024,1.2299,-9.7907,1.9379,9.0935,7.9246,512
0.0598,-9.8117,0.3075,0.2299,-9.8117,0.7672,12.5495,7.8479,513
-0.7851,-9.6899,0.3729,1.0942,-9.6899,1.2088,9.2617,3.8593,514
-7.0305,-9.9834,-1.2587,2.9068,-9.9834,2.9829,17.4942,10.2615,515
-2.0158,-9.5961,-0.1316,1.6495,-9.5961,2.1294,11.9095,10.0027,516
-15.4571,-9.7537,4.3149,17.1485,-9.7537,9.45,27.3778,14.805,517
-31.8648,-9.5577,-13.3756,11.4321,-9.5577,1.5284,22.3897,20.7581,518
-47.4713,-9.9399,0.4109,16.9074,-9.9399,15.1409,42.7807,21.3338,520
-14.0487,-9.8047,-0.7251,6.3753,-9.8047,7.898,35.1604,14.842,521
-20.3745,-9.6555,-7.5355,8.5007,-9.6555,3.7508,18.3069,11.4322,522
-19.0218,-9.5505,0.899,11.0443,-9.5505,8.9004,18.6625,14.0393,523
-13.2812,-9.5548,-2.555,5.8944,-9.5548,5.4517,15.6862,10.7315,524
-9.356,-9.5122,0.1156,8.9558,-9.5122,6.2684,35.6971,19.1486,525
-14.4918,-9.9718,3.5884,7.8091,-9.9718,9.2562,32.1136,16.9581,526
-2.3576,-9.9153,1.4926,3.9629,-9.9153,5.2778,29.5062,13.0124,527
-12.069,-9.8064,-1.7693,3.0272,-9.8064,3.9427,24.6183,15.501,528
-9.2725,-9.8179,0.2636,2.4021,-9.8179,3.0741,17.0424,8.6821,529
-1.9971,-9.7273,0.3267,1.1238,-9.7273,2.6756,13.2919,9.509,530
-6.1621,-9.8247,0.781,3.7337,-9.8247,3.3204,15.6368,9.643,531
-2.6612,-9.7904,0.5088,1.7262,-9.7904,3.5921,12.8238,6.6661,532
-1.7886,-9.742,-0.3708,0.9895,-9.742,1.6591,11.4123,6.5407,533
-1.1698,-9.4943,1.7321,2.8657,-9.4943,3.8642,10.3629,9.1358,534
-1.4224,-10.3369,-0.0174,1.0572,-10.3369,0.5239,8.5581,6.2171,535
-2.9634,-9.9744,0.805,2.4374,-9.9744,2.3512,10.0652,8.9522,536
-3.6053,-9.8571,-0.969,1.2753,-9.8571,1.4486,14.419,10.7118,537
-0.4034,-9.7874,1.0321,1.3837,-9.7874,0.7235,20.7879,20.0524,538
-48.2075,-9.7941,-3.6259,13.3335,-9.7941,4.5154,13.2182,8.0474,540
-17.6526,-9.7072,4.8003,11.1293,-9.7072,2.0689,16.0836,14.2917,541
-3.8605,-9.7625,-1.6999,1.3424,-9.7625,2.1423,6.7154,6.0964,542
3.5602,-9.7648,7.2212,2.8158,-9.7648,4.2662,18.4436,11.4622,543
-8.8094,-9.742,1.1692,5.7182,-9.742,5.0603,19.0257,5.6252,544
-21.8226,-9.8346,-1.639,8.8376,-9.8346,5.4897,30.098,25.6187,545
-16.3106,-9.7518,-5.7397,5.4386,-9.7518,2.6691,23.7172,16.1146,546
-14.6083,-9.8799,-0.5922,5.598,-9.8799,3.0625,34.8873,15.3619,547
-4.3788,-9.7169,-1.5599,1.6914,-9.7169,1.3352,19.3017,15.5512,548
-9.1043,-9.7046,0.2063,3.8976,-9.7046,5.9725,21.4922,11.1807,550
-18.7445,-9.7941,-1.1768,6.6774,-9.7941,7.3207,23.0175,13.6526,551
-1.2796,-9.6029,3.4991,5.4559,-9.6029,7.1945,18.2289,15.9536,552
-7.6487,-10.1287,-0.3998,5.6403,-10.1287,2.1757,14.9466,12.4303,553
-7.2388,-9.9451,2.679,6.8788,-9.9451,6.1937,20.4932,16.5839,554
-14.4977,-9.8094,1.8393,8.1657,-9.8094,7.2043,35.5977,19.6935,555
-8.6673,-9.8751,-0.0795,7.539,-9.8751,8.7031,26.4511,19.0622,556
-2.4311,-9.7946,3.1346,4.185,-9.7946,4.413,17.5229,14.4033,557
-6.5645,-9.7935,-1.1149,2.493,-9.7935,1.8925,14.9394,7.6338,558
-6.3937,-9.8599,-1.0891,2.7533,-9.8599,4.3678,17.4608,7.5151,560
-11.5633,-9.8136,2.1664,6.3437,-9.8136,6.9653,22.3234,15.3142,561
-0.6558,-9.6893,0.2453,0.8462,-9.6893,1.518,13.6558,6.0388,562
-5.8588,-10.2275,-1.8939,3.0946,-10.2275,3.1514,14.2147,9.081,563
-16.0892,-9.8381,-4.37,5.3441,-9.8381,4.7819,17.9603,13.8876,564
-8.0598,-9.463,-1.9857,3.0223,-9.463,2.8148,8.414,5.9407,565
-3.1174,-10.0367,-0.4273,1.4708,-10.0367,1.0394,8.3321,5.9319,566
-2.0711,-10.0105,1.1107,1.8965,-10.0105,5.1401,14.7805,7.9835,567
-1.056,-9.7389,0.3975,0.9138,-9.7389,3.8881,10.7939,9.3933,568
-0.4006,-9.7956,0.4034,0.5569,-9.7956,0.5677,6.937,5.4895,569
-0.4708,-9.8556,1.9457,1.6579,-9.8556,5.2442,11.8108,8.8923,570
-3.8952,-9.6795,-2.4374,2.0616,-9.6795,0.3075,8.841,8.5346,571
-2.0032,-9.7499,0.5263,1.6935,-9.7499,0.6113,9.0785,7.8717,572
-1.0333,-9.7061,-0.3788,0.3818,-9.7061,1.5176,4.9346,3.2396,573
-1.4388,-9.7951,0.143,1.0019,-9.7951,3.9574,21.697,18.3542,574
10.2902,-9.9906,21.6043,9.2072,-9.9906,3.7251,25.16,20.6292,575
-7.4387,-9.9132,-3.867,4.3722,-9.9132,2.163,23.5974,21.1554,576
2.0992,-10.1146,7.268,3.3747,-10.1146,1.4417,20.8888,10.1656,577
-12.0178,-9.7582,-2.2296,3.3887,-9.7582,4.6869,14.8115,10.8745,578
-11.5446,-10.0174,-0.7104,3.7034,-10.0174,4.2304,17.0746,11.3341,580
-5.3481,-9.7449,1.1798,3.7255,-9.7449,4.6102,15.725,11.2721,581
-16.6988,-10.0106,-1.2665,7.5662,-10.0106,4.7449,18.865,12.1593,582
-4.0547,-9.7683,1.0022,3.7926,-9.7683,4.363,20.3249,14.1462,583
-1.3128,-8.6536,0.0666,0.9049,-8.6536,1.878,14.0066,4.8309,584
-1.5069,-9.8847,-0.1474,0.6901,-9.8847,1.3032,7.6226,6.5086,585
-2.2183,-9.9206,-0.3272,2.0882,-9.9206,2.0512,9.9993,8.3865,586
-0.1385,-9.6548,0.3977,0.408,-9.6548,1.3505,6.2846,6.002,587
-3.8735,-9.7514,2.6015,5.7745,-9.7514,3.9033,19.4951,15.5165,588
-11.757,-9.8115,-0.1843,5.0093,-9.8115,6.3775,32.0828,15.7623,590
-4.9367,-9.9813,1.5075,4.7617,-9.9813,1.3936,14.9469,13.2913,591
-3.1488,-9.8792,1.0515,3.2409,-9.8792,3.0665,11.893,10.1812,592
-0.4607,-9.9248,1.5542,1.7242,-9.9248,3.7264,14.857,12.4831,593
-11.5337,-9.6436,-1.4373,5.2565,-9.6436,7.2744,18.8369,15.1198,594
-2.3751,-9.6661,0.8368,2.3379,-9.6661,0.6499,8.2987,6.8208,595
-1.7005,-9.9489,-0.4894,0.8392,-9.9489,1.2231,15.7507,6.1341,596
-3.8699,-9.7978,-0.1253,3.125,-9.7978,2.3525,18.5086,15.8683,597
-1.617,-9.7079,1.6259,3.5482,-9.7079,3.3969,12.9487,9.4165,598
-12.7628,-9.6518,-1.4908,8.9674,-9.6518,1.2288,16.3313,15.2141,600
-6.5951,-9.7115,-0.3127,2.4438,-9.7115,3.7047,15.0741,8.698,601
-0.3579,-9.7364,3.134,3.4026,-9.7364,2.7074,16.3849,14.8506,602
-1.9687,-9.7774,4.6626,6.8825,-9.7774,6.6451,16.7494,12.9179,603
-4.8555,-9.8369,0.3861,2.5227,-9.8369,2.1296,13.8301,9.6846,604
0.2056,-9.8144,2.2929,1.557,-9.8144,1.6599,11.1544,8.2182,605
-0.7587,-9.8892,3.8684,4.7423,-9.8892,2.6135,14.3702,12.6817,606
-5.0325,-9.7367,4.4121,7.5534,-9.7367,6.0537,15.4739,12.2924,607
-4.4674,-9.8105,2.9101,4.2188,-9.8105,6.3175,22.7348,12.6814,608
-12.5598,-9.7871,2.4172,6.0737,-9.7871,6.8118,21.6129,12.848,610
-9.6925,-9.823,1.2082,4.0475,-9.823,5.417,21.2625,10.5068,611
-3.57,-9.8405,-1.1932,1.4823,-9.8405,2.4374,11.7066,7.6699,612
-5.1361,-9.8178,-2.1337,2.6126,-9.8178,3.3828,11.1519,8.7981,613
-0.9198,-8.5935,-0.288,0.4803,-8.5935,0.8755,13.7412,5.8539,614
-0.1682,-9.7427,1.4799,1.4929,-9.7427,0.945,9.6464,6.887,615
-7.2788,-9.801,3.2385,4.5603,-9.801,7.6165,23.4839,11.3893,616
-17.3626,-8.6942,-3.5898,8.5278,-8.6942,2.3669,16.0239,12.4533,617
-6.7537,-9.7912,0.7772,4.1835,-9.7912,4.5073,17.7059,10.0045,618
-7.2659,-9.7821,2.0427,5.03,-9.7821,4.8923,13.9611,9.612,620
-5.102,-9.8539,0.266,4.0006,-9.8539,4.19,13.1794,9.2935,621
-5.6454,-9.7556,1.2203,5.1402,-9.7556,3.3824,15.2038,13.4985,622
-1.2323,-9.783,3.1185,4.4776,-9.783,3.364,14.5514,7.7915,623
-14.3452,-9.5723,-0.5141,10.307,-9.5723,1.8475,16.6078,15.0297,624
-0.8352,-9.5726,1.8728,3.3905,-9.5726,3.0549,9.2956,7.6286,625
-17.3484,-9.6013,3.1132,18.0732,-9.6013,4.501,23.575,21.5601,626
-9.6505,-9.7224,-3.7931,4.7264,-9.7224,2.7033,14.3086,9.0037,627
-0.0329,-9.9225,7.4202,5.9182,-9.9225,10.3085,22.6632,14.3353,628
-0.8989,-9.8803,1.5818,1.8592,-9.8803,2.3102,15.4657,11.8161,629
-9.5519,-9.7956,0.8187,3.8573,-9.7956,8.585,18.3861,11.3526,630
-8.0723,-9.8723,-0.1182,5.2285,-9.8723,7.2782,21.4439,8.1675,631
-1.5125,-9.6924,2.3735,4.4964,-9.6924,8.0463,16.6485,15.8781,632
-11.993,-9.8833,2.799,7.9689,-9.8833,9.327,18.5222,10.791,633
-5.4821,-9.7291,-0.4146,2.8517,-9.7291,4.9694,13.7118,11.23,634
-3.9964,-9.8844,1.1813,3.6395,-9.8844,4.6073,12.7289,6.8698,635
-0.957,-9.7736,2.7199,3.3657,-9.7736,5.781,14.8036,9.4705,636
-0.1465,-9.6524,0.4725,0.5962,-9.6524,1.1708,6.147,2.8628,637
-3.1155,-9.9069,0.4101,2.163,-9.9069,1.8807,11.1088,8.4148,638
-3.9591,-9.8606,6.928,7.4227,-9.8606,2.3064,19.5021,13.9711,639
-1.6089,-9.83,0.0607,0.829,-9.83,2.3555,8.4558,5.321,640
-2.4047,-9.7401,0.0994,1.0648,-9.7401,2.6443,10.775,5.7796,641
-0.4245,-9.8954,0.0967,0.3315,-9.8954,1.1957,6.293,2.8317,642
-6.6776,-10.013,2.5551,5.61,-10.013,5.3175,14.9883,13.3901,643
-6.4538,-9.6677,1.9656,5.8793,-9.6677,3.0624,10.8345,6.9622,644
-0.1369,-10.0079,0.5808,0.6213,-10.0079,1.9632,12.2483,11.1264,645
-12.9507,-9.7136,-0.1998,7.063,-9.7136,2.1712,12.9317,10.7693,646
-6.4025,-9.976,-1.0942,3.6343,-9.976,2.5108,17.7313,7.6672,647
-10.8944,-9.7984,1.0768,4.3088,-9.7984,6.8748,19.569,14.6521,648
0.5904,-9.435,9.8813,8.1,-9.435,2.2953,20.689,16.5346,649
-5.2438,-9.9115,-0.422,3.0708,-9.9115,1.4753,17.1534,8.2852,650
-9.5212,-9.8336,0.8898,7.004,-9.8336,4.5479,30.9842,19.2913,651
-4.186,-9.9781,0.8764,3.3837,-9.9781,3.129,31.5337,24.2596,652
-2.0791,-9.509,1.9197,2.7575,-9.509,0.7588,10.6291,8.7242,653
-4.8939,-9.8526,0.7923,3.0718,-9.8526,2.5771,15.0746,11.8231,654
-1.3203,-9.628,1.3143,2.6007,-9.628,0.917,12.5742,9.207,655
-0.5621,-9.7278,2.9749,3.179,-9.7278,1.3211,11.9282,10.9376,656
0.0754,-9.7713,0.9821,0.8375,-9.7713,1.0598,5.9114,4.2334,657
-3.4045,-9.7396,-0.9733,1.4365,-9.7396,2.9725,9.1288,6.9831,658
-0.6167,-9.9754,0.2933,0.5389,-9.9754,1.6748,9.5418,8.6055,659
-4.3673,-9.8943,1.5642,3.3931,-9.8943,5.5108,19.1918,9.2769,660
-4.072,-9.8024,1.3643,3.1338,-9.8024,6.8746,20.104,13.3075,661
-0.2439,-9.6117,1.6913,1.6363,-9.6117,2.6702,17.7942,14.2201,662
-0.8724,-9.8547,2.489,1.8428,-9.8547,0.6139,13.1803,10.766,663
-5.5479,-9.5857,-0.0453,3.2034,-9.5857,1.4187,36.5724,35.1632,664
-19.8218,-8.7742,2.9364,26.1548,-8.7742,1.6976,42.2153,23.9961,665
-20.1724,-9.7524,5.3257,23.9968,-9.7524,10.0654,27.4921,7.0678,666
-1.3931,-9.7123,5.8268,8.7014,-9.7123,4.7832,16.4269,14.7701,667
0.1119,-9.8608,0.7855,0.6287,-9.8608,1.3157,16.8619,9.7009,669
-7.7828,-9.8484,-1.2841,2.7311,-9.8484,4.5318,31.0119,20.0522,670
-36.3149,-9.4443,-3.6205,15.497,-9.4443,7.855,25.5356,7.5051,671
-9.4252,-9.7869,-1.4992,3.3409,-9.7869,1.9262,6.6784,3.5276,672
-1.7913,-9.8684,-0.4786,0.7914,-9.8684,1.0727,13.0716,9.6086,673
-0.7057,-9.7904,-0.1931,0.42,-9.7904,0.8601,4.1971,2.7867,674
-0.6355,-9.7801,-0.5034,0.071,-9.7801,0.0549,3.0218,2.9186,675
