AYGX_min,AZ_mean,AYGX_mean,AYGX_std,AZ_mean.1,GX_std,Gnorm_max,Gnorm_median,timestamp
-0.203,-9.8419,-0.1772,0.0157,-9.8419,0.04,2.304,2.2535,5
-0.5237,-9.797,8.3224,18.6956,-9.797,13.787,42.2896,2.3115,6
-341.387,-9.165,-32.5359,126.705,-9.165,32.133,57.7271,21.2519,7
-49.1455,-9.5171,-15.7944,18.681,-9.5171,8.2643,17.084,8.1075,8
-64.7761,-9.4084,38.6016,44.0173,-9.4084,11.0859,86.0976,70.9808,9
