AYGX_min,AZ_mean,AYGX_mean,AYGX_std,AZ_mean,GX_std,Gnorm_max,Gnorm_median,timestamp
-36.7315,-9.8497,-16.6172,10.568,-9.8497,1.922,20.0723,15.697,5
-1.252,-9.9299,2.2711,3.4444,-9.9299,5.7372,18.521,8.207,6
-2.7381,-9.8693,1.467,2.3222,-9.8693,3.3028,7.6632,5.3797,7
-5.8579,-9.8504,-1.6851,2.3274,-9.8504,2.4968,9.5191,5.6808,8
-0.1167,-9.8551,0.2415,0.5066,-9.8551,0.5879,1.0838,0.9984,14
1.633,-9.9514,5.3078,1.8477,-9.9514,1.8504,37.0689,35.4429,22
-0.8039,-9.7847,0.9932,2.4133,-9.7847,3.0837,39.7123,38.4758,23
-7.765,-9.7114,-3.3471,4.0456,-9.7114,2.0124,4.8097,3.3446,24
-19.9451,-10.1561,-9.3586,5.7561,-10.1561,1.3961,34.3143,31.7187,27
-42.8901,-9.8157,5.2919,19.6871,-9.8157,5.8091,23.692,15.8672,28
-32.0465,-9.8351,-1.8724,12.1603,-9.8351,8.302,14.5323,9.1044,29
-18.1086,-9.7478,-9.5733,7.0553,-9.7478,5.5195,15.6419,7.3256,30
6.4874,-9.7603,8.2861,0.9825,-9.7603,0.4772,6.8688,6.3106,32
-12.5192,-9.85,-0.33,5.2002,-9.85,5.5881,10.6466,4.1797,33
-28.529,-8.9916,-1.7945,11.3493,-8.9916,3.2563,10.8201,4.0561,35
-14.6963,-9.8095,0.0079,6.9321,-9.8095,9.6289,20.1853,13.4345,93
-1.5105,-9.603,2.6105,4.1626,-9.603,4.1206,16.1252,12.9643,100
-7.2991,-10.2304,4.0895,9.1288,-10.2304,3.8195,16.9113,14.5363,104
-10.2377,-8.7273,0.6728,6.64,-8.7273,5.0532,24.5723,14.5512,105
-4.7821,-10.4949,-1.6351,2.7473,-10.4949,1.0267,12.1363,8.5415,107
-12.5157,-10.573,-2.0609,4.9368,-10.573,7.7504,17.4273,12.0414,115
-3.5484,-9.8787,-0.6004,1.5984,-9.8787,2.6742,10.1178,6.3788,118
-3.946,-9.9118,-1.3276,1.9714,-9.9118,6.1397,17.6137,9.293,121
-2.0312,-8.8069,0.6779,2.1462,-8.8069,3.025,13.5306,9.9995,122
-9.5669,-9.8677,-0.6462,2.4076,-9.8677,2.3417,11.4722,4.0372,123
-2.553,-9.9394,0.1984,2.0465,-9.9394,1.8482,9.6261,6.3585,124
-6.8096,-9.7591,-1.3007,2.798,-9.7591,4.4165,10.2582,5.2732,126
-3.4512,-9.8213,0.7518,1.9161,-9.8213,4.3583,10.7298,4.9972,133
-2.2183,-9.8441,0.1595,1.8288,-9.8441,2.9826,7.9009,4.6913,137
-5.5325,-9.3107,-0.6438,2.6256,-9.3107,4.106,12.0023,6.444,138
-8.074,-9.9279,-0.3579,3.6702,-9.9279,5.6046,16.5239,6.6428,139
-1.4248,-10.0234,0.7753,2.1028,-10.0234,3.9288,11.8685,8.0743,140
-3.3667,-9.8863,-0.8181,1.5111,-9.8863,5.1842,9.9665,7.8807,141
-9.4368,-9.6394,-1.7904,4.0508,-9.6394,5.2152,15.3029,8.5643,142
-11.8311,-9.6792,0.0154,8.6522,-9.6792,7.2802,29.2938,24.0386,143
-1.4852,-9.6601,12.1097,15.6545,-9.6601,8.8681,31.9714,19.5609,144
-4.628,-9.5348,-0.4484,3.1137,-9.5348,3.5227,10.008,8.0592,145
-12.7204,-8.554,-3.1477,6.6999,-8.554,4.98,16.4697,9.2755,146
-7.6576,-9.1724,-0.2625,2.8192,-9.1724,1.6851,11.8102,6.5607,147
-21.0165,-8.9978,2.3566,10.7667,-8.9978,10.4017,32.2358,15.9629,148
-15.5885,-9.4991,1.0706,7.9642,-9.4991,6.7824,25.2615,12.1666,149
-3.6443,-7.457,-0.649,1.8179,-7.457,3.2007,10.9366,7.8176,150
-4.8556,-9.5341,4.0523,5.8817,-9.5341,8.1791,17.851,12.2318,151
-33.7011,-9.5347,-3.951,9.0014,-9.5347,9.5343,32.1638,13.0708,153
-12.6763,-9.6617,-0.5972,5.5686,-9.6617,4.8878,24.2804,11.153,154
-5.1008,-9.9893,-0.84,3.2126,-9.9893,2.8754,13.6326,11.764,155
-9.1029,-8.4979,-0.5909,8.1947,-8.4979,7.5461,24.0875,18.9706,157
-24.1097,-9.6097,-0.5759,6.5484,-9.6097,7.8145,21.9378,15.1705,158
-2.7777,-8.8755,0.3889,2.4062,-8.8755,3.4278,21.6657,6.0494,159
-19.6263,-9.9802,-1.7811,9.4803,-9.9802,8.4483,15.858,10.4927,160
-4.258,-9.6503,0.7246,3.7226,-9.6503,3.758,12.7868,6.6737,161
-1.7522,-9.687,-0.7142,0.8505,-9.687,1.855,11.0954,6.6488,162
-9.581,-9.8642,-0.8301,2.7099,-9.8642,3.6351,11.7031,6.4668,163
-10.0085,-9.8093,-1.5954,3.3476,-9.8093,4.6285,14.0088,5.8514,164
-3.1978,-9.9297,0.1961,1.8725,-9.9297,3.2037,13.4176,6.5504,165
-0.7607,-9.8747,0.6107,0.8967,-9.8747,4.1342,8.2295,5.0121,166
-11.534,-9.8232,-1.1873,5.9909,-9.8232,4.6439,15.2736,12.5158,167
-8.685,-9.9005,1.1472,3.8503,-9.9005,7.3148,16.3354,8.6401,168
-4.0854,-9.8881,-0.7695,1.6043,-9.8881,3.0161,13.6239,7.0772,169
0.1297,-9.9183,2.7543,3.1024,-9.9183,5.4499,13.6876,8.2921,170
-3.1783,-9.8125,-0.6895,1.3565,-9.8125,1.4814,5.3605,3.8176,171
-0.0579,-9.6497,0.2746,0.3236,-9.6497,0.7418,8.0577,5.657,172
-3.9882,-9.7857,-0.2277,1.452,-9.7857,3.5699,19.471,6.928,173
-0.3458,-9.9422,0.537,0.7425,-9.9422,0.7886,8.107,5.6611,174
-5.0037,-9.6613,-0.8196,3.3088,-9.6613,1.6862,11.6126,8.8898,176
-13.5144,-8.6324,11.8209,21.2953,-8.6324,15.5246,41.1824,30.6506,177
-18.0001,-9.9318,2.5808,15.1094,-9.9318,2.9097,16.6103,12.7703,178
-13.6754,-9.8831,1.1507,11.6161,-9.8831,9.7943,25.6852,13.6072,180
-1.7289,-9.4149,-0.1726,1.2614,-9.4149,2.2618,15.9002,7.9811,182
-2.9455,-9.8304,-0.1823,1.2218,-9.8304,2.0358,18.4041,8.4312,183
-2.2424,-10.4544,1.6908,2.1664,-10.4544,1.4527,13.4796,10.508,184
-2.3335,-10.0516,-0.3056,0.8919,-10.0516,2.2443,17.2225,10.5265,185
-6.6489,-9.5985,2.6117,4.4075,-9.5985,1.965,19.4042,11.0635,187
-3.4865,-10.0644,0.6467,1.7489,-10.0644,3.0707,33.2985,29.2601,188
-0.7885,-9.7215,0.1123,0.6031,-9.7215,1.0047,22.0229,20.3598,189
-2.3817,-9.9334,2.5496,3.7436,-9.9334,5.3864,33.1797,15.1874,190
-3.3306,-10.071,-0.937,1.8966,-10.071,3.3072,42.4472,40.8527,192
-10.6068,-9.9042,-0.6151,3.1739,-9.9042,3.8906,9.8863,4.835,193
-21.9382,-9.887,1.8596,11.5533,-9.887,9.744,32.4492,12.8862,195
-1.8147,-9.9923,-0.511,0.5679,-9.9923,1.2327,32.763,27.6266,197
-16.4055,-9.7918,3.6734,15.3307,-9.7918,13.2674,39.7647,24.1954,198
-9.8467,-10.0246,-2.4062,5.989,-10.0246,2.011,27.3698,23.0411,199
-4.7417,-9.9026,-0.543,2.1168,-9.9026,6.6567,12.2151,7.7543,200
-8.3806,-9.8771,-1.0124,2.8703,-9.8771,6.6582,13.7089,9.5587,202
-3.555,-9.8671,-0.0719,1.8339,-9.8671,3.7157,11.3697,6.5627,203
-2.089,-10.0534,2.1268,2.6797,-10.0534,2.1545,13.4551,8.951,204
-7.8467,-9.9283,-0.4779,2.6088,-9.9283,5.8468,14.9576,7.5052,205
-2.951,-9.8812,0.5892,1.5369,-9.8812,2.4411,8.8455,6.5841,207
-3.257,-9.9665,0.1142,1.4934,-9.9665,4.1627,10.5625,5.3474,208
-3.2749,-9.8918,0.0605,1.179,-9.8918,1.6995,7.3164,3.8312,209
-2.5935,-9.9516,-0.0202,0.9541,-9.9516,3.2005,8.659,5.6133,210
-2.0246,-9.9229,0.316,1.3258,-9.9229,1.1959,6.9778,5.5215,212
-1.8416,-9.9098,-0.0127,0.6451,-9.9098,2.4901,7.0256,4.1873,213
-0.6125,-9.8229,0.2948,0.7662,-9.8229,1.9914,7.0551,4.2558,214
-0.9967,-9.8844,0.7194,1.1654,-9.8844,2.6472,12.7061,8.4449,215
-7.5709,-10.062,0.8961,4.868,-10.062,2.9366,27.9573,10.7647,216
-7.0256,-9.708,0.2847,5.0109,-9.708,2.4481,33.1541,15.9232,217
-3.7878,-9.8802,14.644,13.8551,-9.8802,15.3681,48.3496,34.33,218
-4.2729,-10.0155,0.4196,1.6068,-10.0155,1.4866,23.1663,6.7295,219
-8.2413,-9.8329,-0.7074,2.1466,-9.8329,4.793,12.705,9.0541,220
-2.2479,-9.943,0.3883,2.0819,-9.943,5.2747,14.7426,11.291,222
-3.8178,-9.9483,0.2833,1.3485,-9.9483,4.4991,20.114,12.8271,223
-3.4699,-9.9722,1.4625,3.2986,-9.9722,0.9152,15.3269,12.9365,224
-9.7286,-9.8728,-0.4004,3.19,-9.8728,3.5246,11.9352,7.2649,225
-5.893,-10.3853,0.1304,3.9404,-10.3853,2.6001,10.7693,9.4598,227
-7.619,-10.0555,-0.1399,3.0561,-10.0555,6.9611,15.5108,9.7179,228
-3.3807,-9.9203,-0.0847,1.6259,-9.9203,2.9583,6.7135,4.7799,229
-4.6445,-9.6315,0.222,2.0331,-9.6315,5.8797,12.6516,8.6192,230
-3.1951,-9.9308,2.0924,3.7352,-9.9308,8.8826,20.0924,11.1344,232
-10.4037,-9.9033,-0.478,3.1255,-9.9033,5.4798,13.1847,7.7021,233
-1.1123,-9.8925,-0.4381,0.5488,-9.8925,1.259,7.3002,5.4455,234
-5.747,-9.8212,0.7593,2.8056,-9.8212,4.7241,12.281,5.9069,235
-5.2867,-9.7309,-0.0158,2.8585,-9.7309,3.7637,11.6179,8.5553,237
-5.9232,-9.7671,0.4696,3.4023,-9.7671,6.2399,21.4219,7.7378,238
-13.7208,-8.0006,-2.8873,5.5427,-8.0006,4.1935,25.1085,17.0059,239
-4.9118,-10.0548,-1.6531,1.8809,-10.0548,5.371,11.6755,7.9033,240
-3.9444,-9.8621,-0.1511,1.3562,-9.8621,2.0564,10.2565,4.4428,242
-8.2923,-9.9249,-0.8444,2.2857,-9.9249,5.1652,15.8283,6.4362,243
-3.2387,-9.8542,0.1116,1.8077,-9.8542,2.8268,7.1739,3.9604,244
-5.5002,-9.8946,0.4398,2.428,-9.8946,4.4352,9.0864,5.2085,245
-1.8662,-9.8497,-0.1847,0.7988,-9.8497,2.4756,6.359,2.9019,247
-4.4205,-9.9341,0.5923,2.2245,-9.9341,2.7637,13.274,4.9821,248
-6.1005,-9.7746,1.8607,5.0788,-9.7746,3.3044,10.9228,9.144,249
-3.3531,-9.9062,-0.3123,1.5093,-9.9062,4.5305,8.1212,5.5873,250
-3.1161,-10.0138,0.4019,1.6477,-10.0138,3.1531,7.9233,4.4792,252
-3.6502,-9.857,-0.1037,1.2418,-9.857,3.2739,8.4702,3.3391,253
-0.6015,-9.8244,1.0836,1.0522,-9.8244,1.1062,4.4049,3.2122,254
-5.8653,-9.9428,0.1504,1.9203,-9.9428,4.1926,9.6293,6.3713,255
-0.8299,-9.8278,0.2794,0.6624,-9.8278,1.3288,6.2269,5.4111,257
-4.2673,-9.7101,0.1687,2.5022,-9.7101,4.2668,13.0751,7.4813,258
-1.9051,-9.9597,1.1061,2.0804,-9.9597,3.3723,10.3094,6.4363,259
-3.076,-9.6973,0.6673,2.7383,-9.6973,3.5472,21.1204,5.7841,260
-3.3936,-10.2761,0.1365,1.7771,-10.2761,3.9307,9.9825,6.4633,262
-14.9268,-9.8819,0.3695,3.9597,-9.8819,5.7585,17.4742,8.1539,263
-1.5861,-10.0412,-0.1109,0.7025,-10.0412,1.4228,12.9264,9.417,264
-6.1018,-9.5753,0.9713,3.599,-9.5753,2.4821,14.5621,8.5868,265
-4.9085,-10.2773,2.8216,5.5301,-10.2773,5.8415,18.3013,12.2855,267
-9.0551,-9.7865,-0.6778,2.9411,-9.7865,5.9469,17.3793,9.3523,268
-9.2037,-10.2227,11.7098,9.765,-10.2227,2.3425,23.5547,18.4194,269
-5.5796,-9.8485,0.039,2.6141,-9.8485,3.2778,12.4864,5.2178,270
-0.9134,-9.5262,0.5071,1.4301,-9.5262,2.07,7.4012,4.9244,272
-10.0447,-9.9258,1.3792,4.805,-9.9258,7.8529,17.4101,10.703,273
-12.7017,-9.8527,1.0656,7.1361,-9.8527,3.4328,15.8534,8.7558,274
-9.273,-10.1034,1.3957,5.1448,-10.1034,4.7659,17.1427,9.5733,275
-56.5079,-7.8506,-12.7724,20.5347,-7.8506,15.1333,37.1035,19.5416,277
-13.1362,-9.814,-1.0761,4.3131,-9.814,7.5481,23.9806,9.4838,278
-4.6965,-9.9047,1.5851,5.2972,-9.9047,2.3645,10.6786,7.9039,279
-1.5652,-9.9712,-0.0233,0.8439,-9.9712,2.1269,7.0072,3.9198,280
-6.6017,-9.3039,-0.6596,3.5196,-9.3039,4.0799,10.588,5.7753,281
-5.4082,-9.7402,0.7108,3.2769,-9.7402,4.5393,12.824,6.9053,283
-5.2027,-9.4992,-0.2159,2.0466,-9.4992,4.3791,33.5991,13.2624,284
-11.2256,-9.946,0.3873,4.4097,-9.946,6.2569,18.3275,8.191,285
-7.357,-9.9066,0.7896,6.1324,-9.9066,18.1001,27.8953,20.4355,287
-7.804,-9.9019,-0.4693,2.7845,-9.9019,4.9994,15.3723,9.8345,288
-2.9623,-10.0772,1.1463,4.3291,-10.0772,3.3738,14.7723,13.2199,289
-6.8573,-10.4089,0.8781,4.8307,-10.4089,8.7536,13.1419,10.3765,290
-0.3192,-10.3263,1.1167,2.6815,-10.3263,3.7777,14.8188,10.2448,292
-4.9152,-9.9019,1.8714,3.5317,-9.9019,3.1798,16.0629,13.8558,293
-6.401,-9.8184,0.6247,2.7315,-9.8184,4.4436,24.3144,13.4847,294
-4.1973,-10.0674,-0.1132,1.4989,-10.0674,1.9959,18.9785,12.2373,295
-13.0072,-9.8763,0.1346,4.8085,-9.8763,3.9813,17.0965,14.0832,296
-11.9391,-9.936,-0.0482,4.6902,-9.936,7.845,15.5672,11.7313,298
-4.907,-9.5102,1.7425,5.5245,-9.5102,1.4466,14.1158,11.5306,299
-7.6299,-9.784,2.3262,5.2622,-9.784,6.2804,25.0165,13.0921,300
-3.2663,-9.5108,1.7136,3.5888,-9.5108,4.1532,21.9949,7.9855,301
-5.3925,-10.0113,0.5346,2.3275,-10.0113,3.8351,19.1665,11.1569,303
-1.522,-9.8471,1.0592,2.4031,-9.8471,4.6151,14.8462,6.7867,304
-16.5194,-10.063,0.7621,10.0243,-10.063,4.2206,23.2706,14.4005,305
-9.9275,-10.1554,7.863,10.2539,-10.1554,2.6755,29.3009,27.5457,306
-7.7497,-9.8538,1.0488,4.3618,-9.8538,2.7893,27.6695,14.2641,307
-5.645,-10.1301,0.1841,3.1901,-10.1301,4.7532,17.6467,12.475,308
-22.1322,-10.0334,-1.1565,8.4538,-10.0334,5.3481,15.8265,10.2435,309
-1.1067,-10.2905,-0.1421,0.518,-10.2905,2.7428,13.1197,10.7663,310
-22.133,-9.8644,-0.2714,9.1014,-9.8644,7.3384,19.22,14.2815,312
-0.9703,-9.9363,3.8677,6.155,-9.9363,8.6817,21.4541,11.1741,313
-2.2341,-10.3639,1.7284,2.2118,-10.3639,6.1233,18.2433,11.6031,314
-1.4299,-10.075,0.2892,1.2055,-10.075,2.2762,12.6388,10.9568,315
-8.4775,-10.0443,-1.2023,3.0884,-10.0443,5.5695,11.1619,6.846,316
-5.5782,-9.8529,-1.4295,2.9202,-9.8529,5.6821,17.4489,9.8191,317
-4.3474,-9.9508,0.3822,2.1574,-9.9508,5.8491,12.8483,7.7685,318
-6.4493,-9.8157,-0.7105,2.4341,-9.8157,2.949,15.2049,8.7957,319
-4.884,-10.2199,-1.2876,1.5561,-10.2199,2.6941,10.1591,5.2956,320
-1.6926,-9.6526,-0.4146,1.1783,-9.6526,1.3492,8.2297,7.1763,321
-3.905,-9.8057,-0.6434,1.3944,-9.8057,2.6413,12.3084,7.0042,322
-3.3995,-9.9432,0.6277,2.9032,-9.9432,7.0001,15.253,7.3366,323
-2.6728,-9.6637,0.6931,2.0582,-9.6637,3.648,8.7987,5.8945,324
-5.486,-9.8351,-0.0173,2.3995,-9.8351,3.7425,11.9,9.6935,325
-0.3417,-9.8469,1.5264,2.244,-9.8469,3.7841,8.2882,3.502,326
-6.8918,-9.8386,0.0138,3.2133,-9.8386,2.5664,9.8989,5.139,327
-5.2735,-10.1981,0.2011,2.4232,-10.1981,2.1946,34.2439,7.8163,328
-0.1764,-10.024,0.306,0.4264,-10.024,0.9816,8.9022,6.5375,329
-1.5287,-9.1455,0.1106,0.925,-9.1455,3.3612,8.9976,5.3619,331
-2.4288,-9.4672,0.0702,1.4565,-9.4672,3.1164,14.648,8.7069,332
-5.1422,-9.622,-0.3138,2.7321,-9.622,4.175,33.7345,6.5253,333
-1.058,-9.8178,-0.3999,0.4281,-9.8178,0.8592,5.4236,4.3463,334
-3.3929,-9.9361,-0.6996,2.1774,-9.9361,2.8874,8.9379,6.1815,335
-1.0735,-9.8655,0.244,0.9064,-9.8655,1.7547,6.996,3.8918,337
-8.4768,-9.8575,0.2695,2.8402,-9.8575,4.4728,15.1809,7.0304,338
-3.6913,-9.703,-0.0706,2.2776,-9.703,3.0734,11.5163,6.6587,339
-2.3846,-9.6658,0.3708,1.9848,-9.6658,3.3365,14.4172,5.9859,340
-3.7767,-9.9558,-0.3521,1.694,-9.9558,2.4882,11.6496,6.2102,342
-6.4139,-9.9344,-0.4201,1.8706,-9.9344,2.754,19.9128,12.3192,343
-7.2543,-9.9288,1.9231,6.4412,-9.9288,9.7925,26.3116,12.3403,344
-8.144,-9.1735,1.6755,5.247,-9.1735,5.223,22.2934,16.3542,345
-7.0479,-9.8963,4.7161,6.83,-9.8963,2.4158,18.8194,15.7996,347
-10.6514,-9.9595,0.7265,5.0111,-9.9595,7.5246,17.7107,12.0747,348
-0.941,-9.3015,0.0286,0.5864,-9.3015,1.6495,19.6072,15.4356,349
-8.0841,-9.8835,0.3424,3.0851,-9.8835,4.0739,10.0442,5.6317,350
-15.0228,-9.6983,-1.5379,5.0318,-9.6983,4.8516,15.9756,10.0649,352
-11.1853,-9.8296,-0.2561,5.3297,-9.8296,7.4687,14.827,8.4686,353
-9.3941,-10.0335,-1.7769,3.436,-10.0335,6.2833,15.7472,12.0702,354
-4.9015,-9.9987,-0.7173,2.1135,-9.9987,4.5631,9.4913,6.5105,355
-1.1042,-9.7328,-0.1197,0.7522,-9.7328,3.2487,6.674,5.0748,357
-5.9833,-9.9297,-0.0882,3.1612,-9.9297,6.1863,15.6724,8.9089,358
-5.3835,-9.8876,-1.6237,2.3792,-9.8876,2.5759,9.6659,6.1327,359
-12.9017,-9.8838,-1.1064,5.007,-9.8838,7.8392,16.0943,8.9051,360
-2.2891,-9.9034,0.034,1.1788,-9.9034,2.6769,14.2731,10.5565,362
-10.1316,-9.2119,0.2055,3.1089,-9.2119,4.3639,39.18,10.7247,363
-11.5113,-9.7308,-3.3503,7.6508,-9.7308,1.8038,18.8457,17.3207,364
-4.038,-9.9364,9.5722,11.4008,-9.9364,10.6758,38.4737,29.9215,365
-0.4092,-10.0824,3.6413,4.4682,-10.0824,4.871,14.6629,13.2861,367
-6.6167,-9.795,-0.1745,3.5816,-9.795,5.2635,29.171,7.5075,368
-2.4415,-9.7401,-0.2713,0.8218,-9.7401,1.5142,6.6056,3.1845,369
-3.959,-9.7154,1.7188,4.3249,-9.7154,6.3865,24.9454,19.0665,370
-1.2153,-10.2548,3.5073,2.9046,-10.2548,4.4715,19.6091,17.6426,372
-12.9989,-10.0699,0.5595,5.2426,-10.0699,8.1314,30.3883,21.9577,373
-5.349,-9.7466,1.0141,4.2424,-9.7466,2.6598,28.0938,20.8397,374
-6.5656,-9.8591,-0.437,3.0532,-9.8591,4.0865,16.2975,10.4017,375
-4.9018,-9.573,2.7654,7.1958,-9.573,5.3172,17.6791,11.764,377
-8.0075,-9.8274,1.9632,5.0549,-9.8274,5.9584,30.0667,9.3361,378
-3.5914,-9.7886,-0.1627,2.0473,-9.7886,4.3457,7.2321,5.2825,379
-5.6563,-9.9262,-0.1849,2.4414,-9.9262,4.4891,11.1908,6.6898,380
-3.5939,-9.875,-0.111,1.7231,-9.875,3.233,7.5253,4.3952,382
-2.925,-9.8921,0.1238,1.9461,-9.8921,4.2677,9.4064,5.7718,383
-1.4168,-9.8852,0.3834,0.949,-9.8852,2.2653,8.7372,6.5268,384
-3.1774,-9.8656,-0.3404,1.1113,-9.8656,1.9612,7.6077,4.5399,385
-3.8825,-9.8484,-0.1733,1.3682,-9.8484,1.5113,7.2117,5.4547,387
-7.7161,-9.7912,0.1812,2.3534,-9.7912,2.8635,11.5895,6.0987,388
-3.7631,-9.8567,0.3222,1.5432,-9.8567,2.9406,6.4384,4.6429,389
-1.6901,-9.9183,0.2021,1.0042,-9.9183,2.4218,7.822,4.9709,390
-1.5519,-9.9087,-0.0158,0.8252,-9.9087,2.7806,6.2994,4.2479,392
-4.5676,-9.9343,0.6193,1.9745,-9.9343,4.4722,12.3504,5.956,393
-10.409,-9.2599,-2.1832,3.6786,-9.2599,5.4074,51.9691,23.2297,394
-13.1182,-9.7935,0.6253,7.6411,-9.7935,9.9506,24.12,12.0569,395
-19.1728,-9.958,-0.8388,5.2225,-9.958,7.7463,21.531,11.5263,397
-1.951,-8.9298,0.3605,1.8994,-8.9298,3.0334,27.0716,7.1312,398
-3.654,-11.992,-0.7028,1.852,-11.992,2.6327,44.7962,20.4021,399
-2.7802,-9.3075,3.1556,5.2357,-9.3075,5.8774,27.894,12.6878,400
-12.4171,-9.6599,2.611,9.263,-9.6599,2.9355,14.7694,11.7046,401
-24.4079,-9.5699,-1.1632,5.6193,-9.5699,7.2592,27.9158,11.8869,403
-15.4907,-10.0808,-0.6135,4.3382,-10.0808,3.6494,17.522,12.2337,404
-16.8502,-9.8137,-1.0902,5.5065,-9.8137,4.3857,23.2061,9.7102,405
-3.4336,-9.506,0.7238,3.173,-9.506,4.3715,10.8738,7.0304,407
-3.5237,-9.7503,1.1282,2.4856,-9.7503,5.0487,18.0933,13.3789,408
-0.7409,-10.0673,-0.0116,0.4704,-10.0673,0.4915,4.5096,3.3271,409
-6.2064,-9.8794,0.3977,4.7756,-9.8794,6.7492,18.8628,8.1908,410
-1.0274,-10.0445,5.9749,6.1643,-10.0445,12.38,26.8442,23.8015,412
-4.3724,-10.0573,2.1246,3.2625,-10.0573,6.6836,35.0099,24.2765,413
-5.8562,-9.8404,5.2922,7.9185,-9.8404,3.7768,27.4431,24.2311,414
-13.2896,-9.8183,0.233,5.3235,-9.8183,5.604,16.2747,11.0418,415
-1.3113,-9.9122,3.0468,3.0525,-9.9122,2.714,24.0579,18.0237,417
-12.2328,-10.0006,0.7229,3.7853,-10.0006,6.1994,22.8917,14.0642,418
-5.0584,-9.8605,2.744,6.073,-9.8605,6.8995,22.6044,17.6211,419
-3.3284,-9.9135,0.3963,2.6349,-9.9135,4.2073,15.1394,9.2896,420
-16.1974,-9.9611,0.4991,11.1796,-9.9611,2.3889,16.4601,14.4229,422
-4.792,-9.8985,0.6982,2.96,-9.8985,6.3532,14.849,9.1208,423
-6.3056,-9.8267,-0.2777,3.3057,-9.8267,4.1936,9.4066,8.7201,424
-2.431,-9.7518,1.7048,2.9316,-9.7518,6.2554,13.642,6.8444,425
-10.3979,-10.0769,-1.8725,4.2755,-10.0769,3.1038,11.6162,9.0752,427
-13.4735,-9.8724,1.0659,4.4582,-9.8724,9.241,27.7348,11.0995,428
-0.6698,-10.0013,1.7563,2.0496,-10.0013,1.3707,15.9424,13.7924,429
-3.6384,-10.0142,-1.4999,1.1653,-10.0142,3.4314,13.8427,9.4653,432
-0.8432,-9.771,0.3737,0.8423,-9.771,2.009,11.1712,8.2776,433
-0.8031,-9.781,2.3178,3.3933,-9.781,3.2101,9.0834,4.0484,434
-6.5585,-9.5581,-0.3193,2.9408,-9.5581,4.0305,18.5401,10.5132,435
-4.7869,-9.9264,-0.6087,3.1997,-9.9264,5.4486,14.9159,5.4298,437
-9.6552,-9.7845,-1.197,2.6091,-9.7845,4.9559,29.3717,8.4424,438
-0.8838,-9.9509,2.0032,2.0604,-9.9509,3.0748,9.9947,7.1104,439
-3.7357,-9.7633,-0.0789,2.2227,-9.7633,4.5526,13.42,8.4717,440
-7.6529,-10.0113,-1.6738,3.9041,-10.0113,3.565,13.6476,6.9402,442
-8.7361,-9.9282,-0.5161,5.0949,-9.9282,6.1012,40.5673,9.7404,443
-4.0287,-9.7588,0.4569,3.268,-9.7588,5.1133,13.1693,7.7352,444
-3.8476,-9.8572,1.2338,2.3548,-9.8572,5.6201,12.5722,6.8412,445
-12.092,-9.9109,-0.3247,4.9775,-9.9109,4.7296,15.2045,8.4018,447
-3.9707,-9.9183,0.8425,2.9922,-9.9183,5.8605,13.8455,7.7365,448
-4.4068,-9.7166,-0.7817,1.4089,-9.7166,3.1249,10.6628,6.7798,449
-13.4349,-9.8561,0.0029,3.5265,-9.8561,3.7004,15.3821,7.0228,450
-0.4962,-10.2435,0.502,0.9304,-10.2435,3.1255,9.202,7.6504,452
-9.6187,-9.8489,-0.5968,3.1221,-9.8489,5.0402,15.2172,9.9155,453
-1.8785,-9.906,-0.4205,0.7909,-9.906,1.7033,12.878,6.7378,454
-8.6277,-9.9002,1.4592,3.6871,-9.9002,7.2436,16.4099,9.3953,455
-3.7242,-9.8527,-0.7311,1.3604,-9.8527,1.8854,8.4859,4.803,457
-5.8203,-9.8461,0.4322,2.7317,-9.8461,6.3438,14.1556,7.1889,458
-13.77,-9.932,-1.0478,4.3248,-9.932,5.4962,11.266,6.5084,459
-7.7794,-9.9506,0.1559,4.5212,-9.9506,3.7492,9.4018,6.0673,460
-3.3541,-9.9651,0.4024,2.0593,-9.9651,3.9942,8.7631,5.515,463
-2.0775,-9.9615,0.1447,1.7198,-9.9615,3.4063,9.0722,6.8124,464
-3.8963,-9.663,2.0385,4.5808,-9.663,6.6131,16.7571,10.6263,465
-0.8616,-10.1341,3.0394,3.4513,-10.1341,2.4453,16.2893,14.1354,466
-2.8575,-9.9601,0.2431,1.8137,-9.9601,4.2217,9.039,5.1045,468
-3.83,-10.0836,-0.5811,1.8936,-10.0836,1.8715,7.8817,4.2,469
-2.8317,-9.9631,1.1354,2.1828,-9.9631,3.3775,12.83,8.5358,470
-2.0192,-9.8569,0.0437,1.5654,-9.8569,1.4958,8.7275,7.0739,472
-3.4415,-9.9013,0.3044,1.7961,-9.9013,3.3447,10.5945,7.3513,473
-1.4263,-9.8584,0.4285,1.2274,-9.8584,3.4323,7.9462,5.3437,474
-2.1494,-10.1759,1.4411,2.1088,-10.1759,1.477,9.1192,7.6606,475
-0.6193,-10.0346,2.5103,2.2915,-10.0346,2.8322,17.2038,11.8527,476
-0.4174,-9.988,0.4795,0.6849,-9.988,1.5492,13.4597,8.722,477
-5.9005,-9.9511,-0.3245,3.0776,-9.9511,3.7839,14.1731,6.0435,478
-1.0912,-9.913,0.1615,1.0101,-9.913,3.2766,6.0872,4.8677,479
-4.16,-9.9332,-0.6809,2.2264,-9.9332,4.8436,7.8334,5.791,480
-5.1502,-10.3,0.1333,2.4051,-10.3,4.9654,42.6109,6.5201,482
-5.9244,-9.4602,0.63,5.1935,-9.4602,11.2171,38.9525,20.9579,483
-25.2159,-9.8292,0.3773,14.3837,-9.8292,11.6174,34.5436,25.396,484
0.1375,-10.2846,4.4634,4.5038,-10.2846,6.1655,17.9656,13.8658,485
-5.2424,-10.057,2.7944,4.5127,-10.057,5.8486,15.9567,12.2622,486
-2.9837,-9.3043,-0.0109,3.3035,-9.3043,3.0984,16.2637,9.8858,487
-19.8785,-10.0805,1.2806,7.5876,-10.0805,7.3815,22.777,13.5297,488
-9.4338,-10.09,12.6974,15.1221,-10.09,9.6435,29.0188,23.3656,489
-0.2485,-10.0295,1.8245,2.1575,-10.0295,1.9885,9.1251,6.3577,490
-4.0582,-10.0021,-0.6652,1.8874,-10.0021,2.9395,10.5985,4.4987,491
-4.6669,-9.9915,-0.2705,2.8296,-9.9915,4.5794,14.9346,8.5908,492
-11.8377,-10.1593,-2.2594,5.5796,-10.1593,5.8783,13.5459,9.1673,493
-5.7029,-9.8934,-0.9938,2.9528,-9.8934,3.7126,9.8482,6.9386,494
-19.2052,-9.8169,-3.4507,6.3893,-9.8169,6.0272,15.3091,8.5214,495
-7.6176,-9.9545,1.667,6.4207,-9.9545,2.7431,13.2045,10.6375,496
-52.7878,-9.8448,-13.0427,26.3262,-9.8448,4.659,33.7158,26.4732,497
-40.581,-8.9406,7.517,23.0233,-8.9406,17.8782,44.5404,24.4302,498
-6.9615,-8.2233,-2.5951,3.1121,-8.2233,3.105,32.013,22.0286,499
-5.5679,-9.4215,-0.2955,4.7031,-9.4215,6.4793,14.6369,9.4398,501
-2.4724,-10.0382,2.5431,3.5584,-10.0382,7.8444,16.3125,10.7439,502
-9.5637,-9.8652,-0.8327,3.3275,-9.8652,3.2297,10.4397,4.9831,503
-2.7488,-9.6097,-0.6375,1.5511,-9.6097,3.6762,13.9169,10.3274,504
-14.9664,-9.9884,1.3898,5.3113,-9.9884,7.1928,28.1117,10.9712,505
-32.2677,-9.6494,-0.6058,21.3905,-9.6494,17.0157,32.8326,26.9414,507
-15.9443,-9.9131,1.5337,7.9389,-9.9131,10.6496,31.9252,12.6541,508
-9.4728,-9.8307,-0.3278,2.9451,-9.8307,6.2931,16.7309,8.5452,509
-2.3382,-9.9187,0.5125,1.5309,-9.9187,2.974,10.154,5.7156,510
-1.9388,-9.6821,1.6711,3.4537,-9.6821,3.2228,10.1229,7.0757,512
-6.2422,-9.767,-0.0325,3.2443,-9.767,5.3641,12.373,7.2728,513
-5.7753,-9.9134,-2.4042,1.9521,-9.9134,0.8984,8.9634,6.6739,514
-7.1599,-9.7296,11.0393,13.178,-9.7296,14.2204,24.9453,19.1047,515
-16.9365,-9.9617,2.1343,10.4955,-9.9617,2.7676,22.7009,19.4321,517
-19.6076,-9.8412,-0.4261,5.895,-9.8412,8.448,26.9926,11.4239,518
-5.4716,-9.9656,-1.3611,2.1735,-9.9656,1.6728,7.0513,4.6946,519
-12.9883,-9.9012,-1.6825,3.2682,-9.9012,4.2445,11.272,5.9759,520
-2.2783,-9.9263,1.0876,2.2727,-9.9263,4.7667,14.8495,9.333,522
-6.7835,-9.7996,-0.7794,2.6308,-9.7996,6.833,15.4826,8.9793,523
-0.5303,-9.8888,1.3823,1.5124,-9.8888,4.3631,8.7103,6.6314,524
-12.4557,-9.8429,-0.5344,4.3225,-9.8429,6.6547,17.0338,12.2512,525
-5.4937,-9.8596,-0.0576,2.0249,-9.8596,3.8952,13.7433,6.7409,528
-7.4492,-10.1205,-1.6857,3.9675,-10.1205,2.5477,17.944,14.9203,529
-6.0004,-9.8908,-0.1256,2.7702,-9.8908,9.1905,18.5106,11.2922,530
-2.6323,-10.0151,0.824,2.8378,-10.0151,8.1313,16.558,11.7833,532
-6.8918,-9.8843,0.5919,3.8436,-9.8843,8.3287,21.4663,9.4031,533
-3.0652,-9.8765,-0.9217,1.5241,-9.8765,4.1802,8.5526,5.1275,534
-7.148,-9.7822,-0.9672,1.8927,-9.7822,4.5101,11.2688,6.124,535
-2.5146,-9.7661,0.0227,1.2156,-9.7661,4.1875,9.2052,5.6182,537
-7.2047,-9.9121,-0.2246,3.4411,-9.9121,8.0543,19.0363,9.6623,538
-5.7157,-9.8947,-1.1761,2.5914,-9.8947,7.3123,16.3805,8.0028,539
-7.2389,-10.1098,-1.0185,2.8013,-10.1098,6.0967,13.1757,6.9382,540
-13.7773,-9.7654,2.2606,7.3961,-9.7654,8.2373,27.2684,12.691,542
-12.9444,-9.7291,-0.833,3.5399,-9.7291,5.237,24.0374,9.2862,543
-4.9695,-9.9726,-0.0087,2.9752,-9.9726,3.1089,10.6009,6.1114,544
-5.025,-9.9177,-0.3325,2.0742,-9.9177,2.9959,15.1916,8.2446,545
-1.3977,-9.8316,0.6394,1.4475,-9.8316,1.3697,9.5135,4.9764,547
-12.2256,-9.9875,2.1612,7.9423,-9.9875,8.014,36.9547,12.9628,548
-2.1555,-9.4806,2.6603,2.1728,-9.4806,0.8598,14.3222,8.0959,549
-9.9871,-9.885,-0.8388,4.8076,-9.885,8.0288,19.9208,8.9499,550
-7.4084,-9.8598,-2.752,3.1672,-9.8598,1.9223,9.582,7.0493,552
-4.7246,-9.7704,-0.4217,2.124,-9.7704,4.6507,11.2304,5.537,553
-3.2945,-10.1091,-0.6709,1.7939,-10.1091,4.1628,7.444,5.9033,554
-2.6066,-9.895,-0.0654,1.1745,-9.895,3.1788,10.6785,4.6812,555
-2.6958,-9.9604,3.7666,6.1212,-9.9604,8.7273,22.39,9.4069,557
-11.2141,-9.937,1.4601,6.013,-9.937,10.2728,36.4753,7.5048,558
-7.0347,-10.0068,-0.1898,2.2674,-10.0068,4.6799,9.3406,5.1259,559
-3.0325,-9.8749,-0.2594,1.4799,-9.8749,3.2193,8.7864,5.4476,560
-11.9454,-9.7423,-0.5247,6.0694,-9.7423,2.6375,11.9434,10.2158,562
-7.3003,-9.9314,-0.0293,3.0144,-9.9314,5.3581,12.5788,7.1352,563
-1.9775,-10.1064,0.0663,1.846,-10.1064,2.1909,6.9043,4.9776,564
-11.1717,-9.9081,-0.254,4.5581,-9.9081,5.3775,15.8292,13.1957,565
-2.0274,-9.8856,4.7203,4.4354,-9.8856,1.138,16.0521,15.047,567
-10.4056,-9.8078,0.1061,3.5072,-9.8078,6.4258,20.1705,7.9936,568
-4.5912,-9.6993,-0.146,3.3192,-9.6993,5.545,8.319,5.5933,569
-3.5772,-9.8685,-0.1995,2.2065,-9.8685,5.1455,10.6807,5.674,570
-9.2264,-9.8066,-1.4064,3.0729,-9.8066,7.4637,12.3565,9.3376,572
-9.1629,-9.887,-0.9276,3.4726,-9.887,6.0138,18.7719,7.4251,573
-6.3309,-9.9463,-1.1073,2.3324,-9.9463,4.7906,13.7468,7.7292,574
-8.6454,-9.9808,0.0506,3.4131,-9.9808,7.5853,18.4408,9.3588,575
-4.1445,-9.8334,1.3045,3.6552,-9.8334,5.5957,16.3552,12.3083,577
-8.7357,-9.9275,-1.2721,3.7609,-9.9275,5.2126,17.5981,8.768,578
-4.6308,-9.7957,0.3747,2.833,-9.7957,4.4576,16.5347,4.9211,579
-4.2652,-9.988,0.4338,1.7923,-9.988,6.1342,11.3859,6.8984,580
-9.3051,-9.8565,-2.8573,4.3114,-9.8565,2.2752,15.1892,10.0041,581
-2.9069,-10.0447,0.7001,2.9768,-10.0447,5.4489,16.9351,7.8641,582
-6.0113,-9.9015,-1.1761,2.1982,-9.9015,5.9852,14.9881,6.437,583
-7.5915,-9.9011,-0.7945,2.473,-9.9011,5.5398,13.1581,5.8913,584
-4.3812,-9.9011,-0.7658,1.341,-9.9011,3.011,8.7878,3.7755,585
-2.0498,-10.0141,2.2732,3.9728,-10.0141,4.4113,14.0347,9.3837,587
-6.3881,-9.9376,-0.5676,1.9305,-9.9376,4.4913,12.525,5.5756,588
-7.4134,-9.8336,-0.934,5.093,-9.8336,1.2729,17.5659,15.1202,589
-1.5876,-9.864,0.4355,0.9868,-9.864,1.7031,6.5157,3.6996,590
-0.2403,-9.9495,2.5829,2.8718,-9.9495,3.4726,11.8106,9.4645,592
-7.9492,-9.8536,-0.7943,2.806,-9.8536,5.9103,17.1387,5.3526,593
-8.699,-9.8828,-0.3368,2.6211,-9.8828,4.2955,11.5121,3.7662,594
-5.4825,-10.0176,-0.9616,1.9299,-10.0176,3.7014,10.5688,5.433,595
-1.993,-9.5202,0.52,2.0957,-9.5202,5.1895,13.602,8.966,597
-8.172,-9.8409,0.2067,5.2097,-9.8409,7.3194,18.8039,9.5755,598
-1.9233,-9.7754,0.1021,1.9674,-9.7754,0.5984,6.263,5.6111,599
-5.7905,-9.921,-0.7508,2.2845,-9.921,4.2323,19.863,3.5359,600
-3.9089,-9.8526,1.0959,3.0674,-9.8526,4.5649,12.9157,7.4464,602
-3.645,-9.8693,-0.0932,1.3208,-9.8693,3.7278,11.9162,4.1659,603
-0.1418,-9.8565,1.0336,1.2524,-9.8565,4.7467,8.5426,4.7279,604
-3.9717,-9.8099,0.1665,2.3224,-9.8099,4.6828,11.1263,6.9325,605
-2.238,-10.1077,-0.4464,1.0078,-10.1077,1.2698,6.317,4.8583,607
-6.4747,-9.7828,-0.1765,2.8211,-9.7828,4.5469,11.7859,5.9501,608
0.0623,-9.938,1.5248,1.5574,-9.938,1.339,11.7509,8.7804,609
-2.1937,-9.8329,-0.106,1.0368,-9.8329,2.0213,10.2995,7.0952,610
-0.5261,-10.0084,0.6677,1.3453,-10.0084,1.8421,7.4072,4.8623,612
-3.8743,-9.9042,0.7029,2.7092,-9.9042,5.4162,12.4432,7.5244,613
-3.2568,-9.903,0.2513,2.0036,-9.903,2.2778,7.2707,2.811,614
-4.0681,-9.8409,-0.2483,1.5077,-9.8409,3.8374,9.8348,5.4293,615
-0.8395,-9.8485,1.505,2.5573,-9.8485,4.8145,9.1631,7.2703,617
-25.513,-9.5176,-0.5975,7.8819,-9.5176,7.3592,35.2113,11.5117,618
-12.312,-10.0664,1.5529,8.7966,-10.0664,3.751,15.7458,11.9466,619
-5.2956,-9.7772,-0.1353,3.9126,-9.7772,4.436,20.4812,7.9608,620
-4.6003,-8.4716,0.3653,2.1455,-8.4716,2.8022,19.8846,4.7657,622
-3.5561,-8.8418,0.5115,3.0799,-8.8418,4.7591,38.0234,7.3068,623
-11.294,-9.5314,-2.1793,4.0301,-9.5314,3.7668,18.0694,8.2266,624
-2.5595,-9.9428,2.0307,5.3091,-9.9428,4.9397,14.6215,9.5189,625
-2.1362,-9.8404,-0.4202,1.3702,-9.8404,2.2895,6.8179,5.7723,627
-4.49,-9.983,1.1817,3.4405,-9.983,1.973,9.4103,7.131,628
-0.4192,-10.289,0.1755,0.5698,-10.289,2.7299,5.3921,3.5417,629
-3.599,-10.0289,-0.4014,1.9114,-10.0289,2.8748,13.0381,5.9383,630
-3.5576,-10.0297,5.7564,6.648,-10.0297,1.8224,18.5934,8.5646,631
-12.5769,-9.8735,2.0076,6.2539,-9.8735,9.7406,24.2845,12.68,633
-4.0818,-10.1301,0.3378,3.3258,-10.1301,5.5273,12.5742,8.4294,635
-0.6726,-10.1461,0.7319,1.7676,-10.1461,2.5731,7.859,6.0806,636
-0.97,-9.6929,0.0243,0.9449,-9.6929,2.3384,6.9061,2.8981,637
-0.6953,-9.5582,0.253,0.7793,-9.5582,1.6516,5.3805,3.2804,638
-1.0109,-10.2962,0.2561,1.0446,-10.2962,1.5902,4.877,2.9948,639
-0.2629,-9.7121,0.7805,0.6177,-9.7121,1.6088,6.84,4.0996,640
-0.0151,-9.778,0.5865,0.5505,-9.778,1.5408,4.5597,4.0158,641
-2.126,-9.9002,0.4055,1.842,-9.9002,2.0224,8.0129,6.7537,642
-3.4337,-9.5659,-0.1993,1.459,-9.5659,4.5069,15.6526,12.1921,643
-8.7647,-9.9377,0.4079,3.4953,-9.9377,3.5635,12.7297,8.8945,644
-17.958,-10.3732,-2.405,7.5858,-10.3732,4.5307,23.6755,18.0613,645
-1.606,-10.2879,6.9811,9.157,-10.2879,6.6374,29.3078,22.9428,646
-2.8914,-9.9059,0.7191,2.4774,-9.9059,3.3056,13.5799,10.4884,647
-8.4634,-9.9349,-0.9703,3.0651,-9.9349,4.5828,11.4311,7.3389,649
-0.7297,-9.6901,-0.2412,0.344,-9.6901,0.4921,9.2539,6.4039,650
-5.6771,-9.4831,-0.6741,2.6138,-9.4831,1.691,9.7822,9.3377,651
-4.9216,-9.8504,-0.9029,2.2176,-9.8504,4.1556,10.8536,5.2692,652
-5.1519,-9.9371,-0.3192,2.3933,-9.9371,6.9131,13.5567,8.659,653
-5.1314,-9.7737,-0.458,2.3409,-9.7737,2.6242,14.0711,5.5748,654
-1.6049,-9.8198,-0.1777,0.909,-9.8198,2.1128,7.5269,4.3386,655
-0.6153,-10.186,1.2006,1.9082,-10.186,4.3867,8.0745,6.6455,656
-2.7852,-10.0027,0.0699,1.8466,-10.0027,4.1975,15.1093,5.4513,657
-8.9829,-8.7259,-0.4546,4.36,-8.7259,4.7961,20.7374,8.9617,658
-2.9547,-9.8618,0.1702,1.6518,-9.8618,4.1728,10.4565,6.198,659
-3.2689,-10.0026,0.676,1.95,-10.0026,3.9756,9.6401,5.1335,660
-4.4534,-9.6476,-0.1159,2.7172,-9.6476,4.9547,10.4566,7.3142,661
-3.0892,-9.8988,0.4697,1.7137,-9.8988,3.3152,11.0373,8.886,662
-12.3629,-9.9378,-0.5038,3.8057,-9.9378,5.5192,15.7819,9.5844,663
-6.3354,-10.2536,0.311,3.1672,-10.2536,5.8484,12.2569,7.967,664
-10.8345,-9.8542,0.4135,6.7171,-9.8542,3.599,16.5185,13.0252,666
-4.407,-10.0595,0.5811,3.8612,-10.0595,2.9857,12.9885,7.8022,667
-8.122,-9.8802,0.5049,3.0811,-9.8802,4.9379,11.5844,6.0192,668
-4.5088,-9.6903,1.4731,4.0022,-9.6903,3.7986,14.4939,7.8293,669
-15.4525,-9.9065,0.6348,5.181,-9.9065,8.1042,17.4963,10.9721,670
-11.7209,-9.9483,0.6328,5.7682,-9.9483,6.4269,13.9316,8.8135,672
-9.7173,-9.9277,0.0676,4.2805,-9.9277,6.991,18.8821,9.2849,673
-1.9155,-9.5893,4.0303,5.6169,-9.5893,7.1857,13.92,12.5816,674
-21.2966,-9.7799,1.2192,8.1565,-9.7799,5.7878,19.6866,9.0318,675
-29.0961,-10.1781,-1.8068,9.1592,-10.1781,5.8967,21.3012,10.2677,677
-18.8434,-9.9579,2.1254,10.8456,-9.9579,8.4998,34.7204,15.6687,678
-19.5921,-8.1945,-5.7995,7.6228,-8.1945,5.8752,29.6912,18.9171,679
-23.6544,-9.5959,4.6461,17.4672,-9.5959,8.9251,40.7566,15.4665,680
-8.9547,-10.0582,-1.792,4.4597,-10.0582,4.021,16.1805,7.7707,682
-29.4562,-9.8881,-0.0944,8.9901,-9.8881,9.0741,39.4606,11.3336,683
-1.7189,-10.2265,1.018,1.4966,-10.2265,2.5679,8.8104,6.0508,684
-5.7269,-9.8806,0.088,2.5235,-9.8806,4.0629,8.5773,6.1256,685
-2.796,-10.0758,0.2887,2.8881,-10.0758,0.5167,7.8844,4.7586,687
-23.491,-9.8831,2.0072,10.6381,-9.8831,9.6155,32.851,16.0897,688
-5.7273,-10.4955,-1.2767,3.1127,-10.4955,2.482,11.742,9.4035,689
-30.6592,-10.0121,7.9524,26.287,-10.0121,11.9538,42.719,33.1152,690
3.9128,-9.3252,18.653,11.7882,-9.3252,5.189,32.706,31.9722,692
-37.4453,-9.8805,3.073,10.5158,-9.8805,9.7074,30.3824,9.3687,693
-2.9176,-9.994,-0.2179,1.2027,-9.994,3.328,11.5314,5.1171,694
-7.5764,-9.8361,0.1646,3.5971,-9.8361,6.4557,11.8,7.6522,695
-2.9603,-9.5287,1.6132,3.1817,-9.5287,1.1949,11.8072,6.8096,697
-10.9609,-9.7238,-0.1643,2.7756,-9.7238,5.1723,13.0367,6.0356,698
-3.6886,-9.7901,0.8816,2.3026,-9.7901,4.3686,12.9265,5.0335,699
-4.3755,-9.8661,-0.823,1.7346,-9.8661,4.0018,9.1924,5.7087,700
-3.1738,-9.9009,-0.0303,1.7314,-9.9009,2.8463,9.1275,5.2474,702
-8.3869,-9.8753,-0.5088,2.8567,-9.8753,5.1204,16.0272,6.3658,703
-9.6896,-9.8685,0.2848,4.2364,-9.8685,4.6353,14.7583,6.0276,704
-3.6312,-9.833,-0.1582,1.7393,-9.833,2.13,12.6377,6.1311,705
-5.337,-9.0835,-1.1715,4.9303,-9.0835,1.558,12.6962,8.0352,707
-6.3392,-9.7371,-0.242,2.384,-9.7371,3.2948,17.4231,5.7997,708
-2.6876,-9.5128,0.5917,2.5378,-9.5128,1.9752,10.4176,8.316,709
-6.8558,-9.6885,0.0855,2.8129,-9.6885,5.5691,13.7791,6.5919,710
-5.112,-9.8825,-0.9824,2.7102,-9.8825,2.0672,9.1201,8.2217,712
-9.814,-9.8219,1.9733,6.1443,-9.8219,6.6552,19.3028,12.5713,713
-8.0714,-9.9065,0.2366,5.7621,-9.9065,5.9338,13.9295,7.9318,714
-6.2232,-9.9343,-0.0794,2.9973,-9.9343,6.3702,14.4029,8.8221,715
-5.796,-9.6715,0.7485,3.1354,-9.6715,4.3226,10.8018,5.178,717
-7.4544,-9.8718,-0.2239,2.8131,-9.8718,4.3479,11.3447,6.3082,718
-1.3706,-10.2701,0.1125,1.0371,-10.2701,3.3751,6.3618,3.1458,720
-7.1522,-9.7917,-2.5483,2.6889,-9.7917,2.0203,10.4376,6.3264,722
-6.1292,-9.8702,0.5641,3.6556,-9.8702,5.8114,13.1962,8.8681,723
-4.6685,-9.8628,-0.937,1.7657,-9.8628,2.4517,15.855,8.7218,725
-14.6022,-9.5123,-2.1662,7.9375,-9.5123,2.2852,13.9732,11.5135,727
-16.2091,-9.0434,1.0398,6.9765,-9.0434,6.425,19.3202,10.7814,728
-5.8921,-9.7777,-1.2803,3.5689,-9.7777,3.5848,11.9783,7.8277,729
-16.981,-9.6933,0.3893,6.4446,-9.6933,9.012,25.801,16.4783,730
-7.5724,-9.7026,1.0674,8.496,-9.7026,3.173,15.2475,10.6517,732
-8.7397,-9.8774,0.9731,4.1182,-9.8774,5.8487,18.4734,9.6338,733
-3.3394,-9.9373,-0.2172,2.0506,-9.9373,2.5068,8.2009,4.7553,734
-7.2172,-9.9062,1.1929,4.7138,-9.9062,5.5869,16.2591,8.085,735
-2.6259,-9.8581,0.5852,2.0837,-9.8581,1.7786,7.0048,4.6816,737
-3.7373,-9.8005,2.0717,4.405,-9.8005,6.8121,22.4355,6.6502,738
8.4737,-10.1717,22.2579,9.2855,-10.1717,6.1109,28.9395,26.5767,739
-13.2489,-9.886,2.171,7.6945,-9.886,7.1108,15.251,10.4508,740
-2.0914,-9.8864,1.5845,2.5005,-9.8864,3.5629,8.988,7.1268,742
-3.6055,-9.7681,-0.477,1.4571,-9.7681,3.9703,14.2097,7.272,743
-1.0722,-9.946,1.7069,2.8681,-9.946,5.1176,13.0562,12.1796,744
-3.0887,-9.846,0.5142,2.0818,-9.846,3.9623,11.1761,7.3649,745
-4.1757,-9.8523,1.1646,2.5364,-9.8523,4.7981,13.6512,9.3292,747
-3.0083,-10.0173,1.5431,2.3853,-10.0173,5.8492,18.9846,7.9157,748
-7.1672,-9.795,-1.9276,2.6898,-9.795,5.6747,14.3373,9.1653,749
-17.6543,-9.7326,-0.5106,5.795,-9.7326,6.4179,22.4246,11.7502,750
-3.3654,-9.7989,0.4264,2.1164,-9.7989,4.1378,12.542,5.9721,752
-9.5376,-9.8828,0.4942,4.9313,-9.8828,5.9035,17.3124,8.2577,753
-7.3518,-8.9097,0.4739,4.4664,-8.9097,6.9977,35.0105,13.0819,754
-7.0142,-9.8689,-0.8274,2.6628,-9.8689,4.9119,12.4222,8.7012,755
-7.0027,-9.873,2.0158,4.4653,-9.873,4.9488,15.1628,9.3188,756
-24.8569,-9.8503,-6.0668,12.8708,-9.8503,9.665,37.67,22.1114,757
-25.7747,-9.6007,15.557,37.4821,-9.6007,15.8736,48.5607,15.8902,758
-21.6915,-9.4549,0.1739,16.3293,-9.4549,15.288,25.7237,15.984,759
-25.3054,-10.1108,13.9175,25.7346,-10.1108,10.3105,36.1032,30.3697,760
-2.8537,-8.59,0.1681,2.2089,-8.59,5.1727,20.6305,17.9663,762
-6.1472,-9.9439,0.9742,3.5401,-9.9439,4.9082,14.021,8.7499,763
-0.9024,-9.1839,2.0905,3.7152,-9.1839,4.4577,14.6301,8.477,764
-8.2366,-9.9603,2.1406,7.6551,-9.9603,10.0858,21.8697,10.3507,765
-8.1419,-10.0199,-1.3551,3.315,-10.0199,3.607,10.3325,6.9992,767
-21.0986,-9.716,-0.7312,4.4595,-9.716,5.3244,28.4863,7.4721,768
-2.9203,-9.8118,-0.2527,1.4767,-9.8118,3.4945,7.38,5.5069,769
-3.5725,-9.8801,0.0538,2.0554,-9.8801,3.6431,11.1323,4.0509,770
-7.2922,-9.8314,-0.0758,3.2411,-9.8314,4.5448,15.0544,7.0774,771
-16.0611,-9.8634,-0.5068,6.0534,-9.8634,6.7755,21.8257,8.481,773
-4.5138,-9.8264,0.8919,2.6815,-9.8264,1.6051,12.3699,4.9261,774
-12.3127,-9.8243,-0.0935,4.0932,-9.8243,7.743,18.8017,9.2033,775
-6.0508,-9.8678,-1.0622,2.0924,-9.8678,5.3759,10.4739,7.4165,777
-7.8233,-9.8576,0.3598,2.65,-9.8576,3.7131,10.2805,5.7612,778
-2.1985,-9.8505,0.1758,1.8337,-9.8505,0.561,6.3419,4.145,779
-1.2999,-9.6911,0.8175,1.799,-9.6911,2.8359,8.9746,4.8888,780
-1.6381,-9.7568,0.0022,0.5991,-9.7568,1.3231,14.6353,4.8744,783
-0.9228,-9.9572,-0.0066,0.5342,-9.9572,0.7768,9.3264,4.0028,784
-2.217,-9.739,-0.1698,1.0231,-9.739,1.7417,11.415,4.3865,785
-3.2949,-9.7674,-0.022,2.1732,-9.7674,0.4159,12.4636,10.5399,787
-2.5681,-9.8324,0.22,1.2221,-9.8324,2.2215,34.5207,24.8598,788
-37.2454,-5.9401,1.1657,18.7349,-5.9401,6.4262,51.7688,34.1347,789
-11.3123,-10.3454,3.0916,15.6685,-10.3454,9.781,50.8522,33.7911,790
-4.6485,-9.8686,2.437,6.7521,-9.8686,5.9666,33.0309,26.2598,792
-30.6737,-9.5644,2.1373,14.9429,-9.5644,9.51,22.5405,4.9396,793
-2.5554,-9.629,-1.4336,0.9707,-9.629,0.4673,1.3945,1.1397,794
-7.6021,-9.5993,-5.3028,1.7119,-9.5993,0.4841,3.2095,2.7888,795
-1.6033,-9.632,-0.0934,1.0893,-9.632,0.5631,1.2198,0.8413,796
-7.4681,-9.5798,-3.1567,2.0668,-9.5798,0.865,3.1508,1.3444,797
-0.4719,-9.5627,2.0057,1.9487,-9.5627,0.8521,2.4181,1.2766,798
-2.5169,-9.602,-0.1362,1.8433,-9.602,0.8607,2.0541,0.9049,799
-1.4352,-9.6062,1.735,1.7512,-9.6062,0.8097,1.8904,1.3246,800
0.782,-9.6327,1.1263,0.2547,-9.6327,0.1485,1.121,1.0198,801
1.2461,-9.6597,2.2396,0.9931,-9.6597,0.5394,2.4012,1.4104,802
-2.6065,-9.6573,-1.0651,0.9919,-9.6573,0.5054,1.4381,0.9343,803
0.3511,-9.6486,0.7747,0.3677,-9.6486,0.1909,0.9448,0.7659,804
-2.093,-9.6724,-0.3483,0.891,-9.6724,0.4626,1.2563,0.825,805
0.7717,-9.6852,3.1476,1.0725,-9.6852,0.6459,2.3744,2.1176,806
-2.5152,-9.7432,-0.4632,1.5286,-9.7432,1.1145,2.0362,1.1117,807
-8.3004,-9.6426,-3.6155,3.6427,-9.6426,1.8086,4.1725,1.5015,808
-6.9964,-9.593,-4.8376,2.0299,-9.593,0.9647,3.2406,2.6892,809
-3.199,-9.6268,0.4126,2.0582,-9.6268,1.0444,1.8341,1.1462,810
-5.0276,-9.501,-4.6696,0.3413,-9.501,0.1409,2.1246,1.9868,811
-3.4206,-9.4854,-2.3855,1.3078,-9.4854,0.5011,1.4959,1.3884,812
-1.3184,-9.5082,2.8555,2.1638,-9.5082,0.8434,2.4244,1.4469,813
-0.7609,-9.546,1.4122,1.5377,-9.546,0.645,1.9201,0.8797,814
0.3355,-9.5753,1.7528,1.0584,-9.5753,0.4644,1.7602,0.9572,815
-2.0505,-9.6371,-1.36,0.8077,-9.6371,0.396,1.3398,1.1228,817
-9.9201,-9.5402,-8.9638,0.8313,-9.5402,0.3864,4.1548,3.9084,818
2.4407,-9.5005,3.0498,0.4599,-9.5005,0.1971,1.5458,1.4703,819
-6.1426,-9.5492,-4.9622,1.2589,-9.5492,0.4812,2.6578,2.4863,820
0.6543,-9.5082,2.9977,1.3138,-9.5082,0.5325,1.8643,1.4999,821
-2.787,-9.5266,-2.5282,0.1847,-9.5266,0.0764,1.3367,1.2301,822
-0.2449,-9.5542,1.6686,1.3168,-9.5542,0.5677,1.6405,0.9791,823
-3.7657,-9.5565,-2.3705,0.7055,-9.5565,0.3232,1.7938,1.1558,824
-4.2562,-9.484,0.151,2.1774,-9.484,0.8094,1.7367,0.8988,825
-1.4519,-9.4902,-0.2105,0.6508,-9.4902,0.2475,0.8684,0.6897,826
-5.025,-9.489,-3.8765,1.2553,-9.489,0.4665,2.074,1.8588,827
3.1948,-9.497,3.5282,0.2291,-9.497,0.0923,1.614,1.5188,828
-2.3798,-9.507,-1.9319,0.4752,-9.507,0.1816,1.1866,1.0428,829
-2.7437,-9.5038,-1.2944,0.8292,-9.5038,0.3094,1.211,0.7359,830
-4.9308,-9.4833,-2.301,2.4812,-9.4833,0.9244,1.991,1.2591,831
-6.871,-9.5059,-3.9442,1.9415,-9.5059,0.7185,2.7517,1.3497,832
-3.351,-9.4772,-1.9217,1.3011,-9.4772,0.4937,1.4671,1.1451,833
-0.8125,-9.4794,-0.355,0.3872,-9.4794,0.147,0.7448,0.6824,835
-7.9395,-9.4502,-3.2249,2.0642,-9.4502,0.7174,2.9004,1.3077,836
-17.853,-9.3261,4.9635,15.0345,-9.3261,4.7909,9.4009,4.7357,837
-18.9309,-9.3179,18.7675,32.5173,-9.3179,10.7136,30.6298,6.5996,838
-3.4198,-9.8412,5.2347,10.3219,-9.8412,9.5792,28.2636,11.7774,839
-6.6542,-9.8566,2.167,4.7979,-9.8566,5.3054,20.5661,11.3745,840
-0.078,-9.829,2.3338,2.3324,-9.829,4.3362,25.7371,7.4542,842
-14.4264,-9.2255,-0.3501,6.4964,-9.2255,7.82,68.1683,24.1785,843
-0.322,-10.1713,10.1858,14.2513,-10.1713,2.7814,17.3297,15.8154,844
-3.1878,-9.9839,-0.3737,1.0311,-9.9839,3.1905,11.1732,7.0508,845
-4.3939,-9.9728,1.9209,3.9255,-9.9728,5.9371,16.6463,13.5215,847
-0.7457,-9.8838,0.8035,1.2929,-9.8838,3.2266,15.9948,12.0377,848
-25.3808,-9.8937,-13.5338,9.5399,-9.8937,3.3101,19.4898,14.6087,849
-7.6859,-9.6467,11.0446,12.0668,-9.6467,4.8977,23.7922,15.4407,850
-24.1224,-9.8104,1.1421,17.3888,-9.8104,4.6563,21.3711,15.5261,852
-18.1642,-9.787,-2.249,8.0747,-9.787,5.4564,14.1465,3.5772,853
-3.7033,-9.7751,-0.5291,2.3024,-9.7751,1.5895,6.0357,3.1422,854
-18.8313,-9.8435,0.7168,5.5297,-9.8435,4.1513,18.8012,5.8086,855
-1.6231,-9.9994,3.6114,3.7246,-9.9994,3.4265,21.1129,10.4214,857
-3.857,-9.6971,-0.6169,1.8872,-9.6971,1.931,15.8296,3.4956,858
-10.7877,-9.4542,-1.0273,4.4787,-9.4542,3.8645,8.9006,5.2747,859
-22.4582,-9.895,-2.18,10.6644,-9.895,5.9777,21.9751,5.9555,860
-50.6827,-9.6615,-7.6174,31.65,-9.6615,12.4587,51.6202,18.7812,862
-67.196,-9.5373,-18.3493,29.6408,-9.5373,11.3388,42.8517,33.3998,863
7.3853,-9.6572,8.6745,1.1616,-9.6572,0.5866,9.9312,9.7382,864
-13.1968,-9.8391,-5.1347,4.6766,-9.8391,4.2863,12.3059,9.6162,865
-1.9496,-9.8137,6.6922,3.7211,-9.8137,2.6587,7.9038,7.0258,867
-0.6245,-9.8648,1.1202,1.1334,-9.8648,1.3908,3.7365,1.4245,868
0.7477,-9.8735,0.8242,0.0488,-9.8735,0.1488,1.7131,1.5685,869
-0.7137,-9.8776,-0.1845,0.3405,-9.8776,0.6984,1.6032,0.9057,870
0.2203,-9.8788,0.334,0.0666,-9.8788,0.1168,1.0748,1.0437,872
-0.4078,-9.875,-0.0187,0.2242,-9.875,0.3968,0.9938,0.689,873
-0.6283,-9.8739,-0.2478,0.2996,-9.8739,0.4842,1.1887,0.851,874
-1.5301,-9.8727,-0.0234,0.8735,-9.8727,1.4823,2.5246,1.5583,875
-17.8945,-9.8063,-8.4133,6.0976,-9.8063,3.079,11.2765,9.6363,877
-7.8159,-9.8075,6.9274,6.1159,-9.8075,4.4357,16.4282,12.7214,878
2.8829,-9.8507,5.0047,1.6819,-9.8507,0.7492,14.0278,13.231,879
-11.7428,-9.849,-2.6306,3.3076,-9.849,1.8826,12.1343,8.2584,880
-40.9795,-9.5697,-27.3919,10.6917,-9.5697,5.366,17.6125,14.4892,882
-35.9239,-9.7044,2.9459,18.0221,-9.7044,11.7107,27.0047,14.4394,883
-6.0109,-9.8178,0.886,3.2487,-9.8178,2.532,31.4833,20.9901,884
-11.9558,-9.8989,3.6363,11.2912,-9.8989,8.3307,19.5725,10.7726,885
-1.5023,-10.1405,9.6143,11.1301,-10.1405,4.9353,46.9349,43.3405,887
-9.6235,-9.8586,0.57,5.2457,-9.8586,8.9912,33.3984,9.5391,888
-2.8877,-9.7543,-0.5061,1.265,-9.7543,1.2949,11.3817,8.0698,889
-2.6456,-9.8186,-0.112,1.2374,-9.8186,2.4454,10.9345,6.6463,890
-4.5586,-9.7012,-0.7378,1.7429,-9.7012,3.1024,6.6079,2.6827,892
-4.6943,-9.9367,-0.388,1.4359,-9.9367,3.2024,9.1337,5.6548,893
-3.7624,-9.8906,0.4144,2.6811,-9.8906,1.3067,7.0828,6.1431,894
-2.497,-9.9088,0.7219,2.1503,-9.9088,6.2858,14.9507,10.5714,895
-2.5772,-9.989,0.0801,1.5342,-9.989,1.1621,6.4588,3.2136,897
-7.2964,-9.9004,1.4019,4.2259,-9.9004,8.2334,24.6342,13.4879,898
-5.8858,-9.6983,2.4169,5.9355,-9.6983,1.2998,22.2929,18.3267,899
-2.983,-9.886,0.3358,1.9983,-9.886,4.8384,13.3809,10.218,900
-1.6532,-9.8888,0.251,1.0031,-9.8888,1.6615,11.6448,7.5471,902
-6.0822,-9.9258,0.7022,2.6102,-9.9258,4.5409,19.1859,9.2074,903
-0.406,-9.9969,0.0998,0.2857,-9.9969,0.467,5.1281,3.6304,904
-0.6015,-9.9385,0.9685,1.4653,-9.9385,3.9672,7.2315,5.4814,905
-0.932,-9.8169,1.56,1.738,-9.8169,3.3619,9.4494,5.8689,907
-5.2236,-9.8814,0.3204,2.2164,-9.8814,4.5428,12.6283,6.2241,908
0.036,-9.9764,1.818,1.3082,-9.9764,4.691,8.9387,7.9448,909
-2.6444,-9.8468,0.0692,1.2076,-9.8468,3.6629,11.2499,5.8925,910
-2.7145,-9.9014,0.3707,1.3936,-9.9014,1.5674,7.2961,4.625,912
-0.665,-9.8888,0.284,0.4591,-9.8888,1.7701,7.7727,3.8904,913
-0.2857,-9.8187,-0.1115,0.1104,-9.8187,0.5051,3.3494,2.6193,914
-0.3409,-9.9071,0.106,0.1863,-9.9071,0.8372,6.3075,3.9811,915
-0.4824,-9.9027,0.3143,1.048,-9.9027,2.9395,8.7306,4.738,916
-4.0739,-9.9134,2.3307,4.2963,-9.9134,8.5384,33.6213,11.0987,918
-3.0656,-9.9056,5.8607,6.4191,-9.9056,4.7026,18.6736,14.397,919
-0.0747,-9.8276,1.4457,1.3791,-9.8276,4.2404,11.2498,6.0908,920
-4.6047,-10.0243,0.3135,2.6669,-10.0243,7.1175,16.904,12.6696,922
-3.4543,-10.0112,0.7629,1.9226,-10.0112,4.2884,13.6896,9.1531,923
-1.2243,-9.751,0.3105,1.2838,-9.751,0.9119,10.13,9.5964,924
-3.3047,-9.8744,-0.1131,1.4488,-9.8744,3.5095,13.9484,10.4832,925
-1.0198,-9.9362,0.7174,1.1902,-9.9362,3.429,11.8523,10.4225,927
-10.3909,-10.0936,1.7588,5.0883,-10.0936,11.3477,32.6845,22.676,928
-4.0869,-9.8156,1.7018,6.4678,-9.8156,3.3069,22.8459,16.6722,929
-6.9457,-10.0239,1.2644,4.9839,-10.0239,12.3512,33.5399,23.8617,930
-5.3133,-10.1476,7.8091,9.5244,-10.1476,4.7639,37.2582,30.3375,932
-33.947,-10.5189,2.8197,13.4864,-10.5189,10.9562,76.7052,35.6275,933
-7.3928,-9.9717,3.2944,5.6429,-9.9717,5.9963,24.8082,18.4356,934
-1.2322,-9.8884,0.5281,1.2816,-9.8884,3.4661,8.6744,3.9756,935
-5.1622,-9.8555,-1.6133,2.2922,-9.8555,1.0718,10.3267,6.5129,936
-2.1047,-9.8708,0.5509,1.3016,-9.8708,4.0251,8.5005,4.1628,938
-0.3096,-9.9919,0.1337,0.2784,-9.9919,0.7109,4.2821,2.423,939
-3.5565,-9.8042,-0.1316,1.0205,-9.8042,2.0091,4.8493,3.506,940
-0.8014,-9.9269,-0.1031,0.4269,-9.9269,1.2765,7.6753,5.4566,942
-3.0256,-9.9851,2.3067,4.6614,-9.9851,7.6711,29.667,8.7041,943
-13.2102,-9.928,-3.6283,5.6013,-9.928,0.9721,27.4346,21.9429,944
-7.4547,-9.848,1.1474,4.418,-9.848,3.6247,26.2275,11.709,945
-1.8739,-9.9899,1.4267,2.9312,-9.9899,3.9202,13.3189,8.7555,946
-2.8237,-9.9577,-0.3157,1.2771,-9.9577,1.237,15.7338,12.2203,947
-4.6497,-9.9135,1.8102,4.9311,-9.9135,6.2345,17.0217,11.4493,948
-3.9072,-9.9208,-0.1377,1.7496,-9.9208,2.1008,10.995,7.2263,949
-4.68,-9.8993,0.2,2.3628,-9.8993,5.1481,10.1935,6.937,950
-1.0211,-9.7724,-0.3049,0.4635,-9.7724,0.7514,7.429,5.1289,952
-4.2372,-9.8278,0.409,2.1357,-9.8278,2.9671,10.6688,4.9447,953
-3.0525,-9.79,0.5364,2.2206,-9.79,1.1109,7.6969,5.9331,954
-1.4527,-9.9483,0.1564,0.9204,-9.9483,2.3578,6.3725,3.2137,955
-0.2536,-9.874,0.7948,0.9204,-9.874,0.9757,4.914,3.676,956
-3.1992,-9.9118,0.4109,1.9142,-9.9118,1.2156,10.834,10.4332,957
-2.7291,-9.8143,0.7489,1.7653,-9.8143,3.0916,6.295,4.2627,958
-4.9627,-9.9623,0.2193,1.571,-9.9623,3.7056,9.8942,4.901,959
-1.4121,-9.8159,-0.143,0.5413,-9.8159,1.9186,5.7332,2.9234,960
-5.7441,-9.8833,0.6196,3.2366,-9.8833,5.1098,12.8194,5.7957,963
-2.806,-9.9889,3.9711,3.6916,-9.9889,2.3373,21.3817,17.1013,964
-5.2859,-9.851,7.6391,9.5751,-9.851,1.4454,29.4738,21.4693,965
-1.6181,-10.0011,0.0723,1.3133,-10.0011,0.821,16.2033,14.5322,966
-4.2594,-9.8062,-0.0363,2.5517,-9.8062,4.5799,10.5098,4.8039,967
-2.4663,-9.8541,0.9001,1.8905,-9.8541,3.5634,8.6866,6.0026,968
-0.3789,-9.9051,0.5598,0.6301,-9.9051,1.637,5.6262,4.6744,969
-0.1939,-9.8898,0.4138,0.7228,-9.8898,2.0594,6.7647,4.8658,970
-3.44,-9.9061,-0.1226,1.6646,-9.9061,1.7632,5.4154,4.7342,971
-1.8958,-9.8942,0.0596,1.2323,-9.8942,2.5524,10.3732,4.0849,973
-4.4529,-9.864,0.3302,1.908,-9.864,3.7304,11.0318,4.3804,974
-1.6481,-10.1853,0.0447,0.9939,-10.1853,1.2111,5.644,3.6979,975
-0.4404,-9.8785,0.9495,0.9841,-9.8785,1.0895,6.3145,4.4006,976
-2.2439,-9.785,0.6731,1.169,-9.785,3.5197,8.1464,4.2703,977
-5.6852,-9.9812,-0.1209,1.968,-9.9812,3.6781,9.6861,5.1618,978
-4.9313,-9.9304,2.0096,4.2261,-9.9304,8.161,14.7035,12.8894,979
-0.163,-9.7928,0.8519,1.1669,-9.7928,2.4021,5.4583,2.2509,980
-5.2536,-9.9404,-0.8585,3.025,-9.9404,2.4415,10.1873,8.7854,981
-1.3093,-9.9166,0.0273,1.03,-9.9166,2.4881,7.3826,4.8559,982
-2.97,-9.897,0.3077,1.7309,-9.897,3.7771,6.567,3.5465,983
-3.4166,-9.8301,-0.2504,1.4779,-9.8301,3.4534,6.1656,4.3904,984
-2.3734,-9.6925,0.0437,1.4461,-9.6925,3.816,8.119,3.0403,985
-2.6088,-9.7526,-0.6513,0.9388,-9.7526,1.3826,4.9945,3.3182,986
-2.3314,-9.9112,-0.4104,0.9516,-9.9112,2.0288,7.3569,3.5698,987
-3.5474,-10.046,-0.2815,1.5743,-10.046,2.5124,8.9187,5.9535,988
-5.7038,-9.9539,-0.0333,1.9115,-9.9539,4.4458,10.1571,6.3529,989
-4.7469,-9.9581,0.4105,3.5202,-9.9581,5.4051,15.7605,11.0294,990
-1.7493,-9.7507,-0.182,0.7964,-9.7507,1.7233,4.5,3.0215,991
-3.2938,-9.8983,-0.4327,1.3416,-9.8983,3.4602,7.7288,5.2217,992
-4.2169,-9.8659,0.9707,2.2297,-9.8659,3.6817,14.3502,8.1865,993
-2.5982,-9.9051,0.4246,0.9715,-9.9051,2.1682,6.9153,4.0505,994
-0.2565,-10.0629,0.1456,0.2664,-10.0629,1.8362,4.6994,3.3512,996
-0.4773,-9.8084,0.0435,0.4059,-9.8084,1.1248,3.5465,2.6603,997
-1.4392,-9.8613,0.3256,1.015,-9.8613,2.2414,7.5728,3.5558,998
-0.0994,-9.9223,0.4335,0.3849,-9.9223,1.9548,7.1341,5.5931,999
-9.8073,-10.0922,-2.0291,4.9097,-10.0922,4.8759,26.6845,23.3355,1002
-4.6526,-9.9945,2.1785,3.4322,-9.9945,3.5998,23.5152,13.1286,1003
-0.193,-9.6032,0.7054,1.0973,-9.6032,1.8529,8.2029,4.5539,1004
-12.7355,-8.7759,6.0372,14.1337,-8.7759,10.8769,52.971,24.9313,1005
-32.7375,-8.2229,6.2817,15.1659,-8.2229,6.7104,61.6012,23.4362,1007
-6.8302,-9.8314,1.4298,4.1601,-9.8314,4.7599,43.5324,16.4442,1008
-6.4468,-9.9115,-0.6751,2.3691,-9.9115,3.1258,37.3055,33.8035,1009
-1.756,-9.974,0.4411,1.5264,-9.974,1.5102,21.2514,16.6292,1010
-0.4217,-9.8576,1.3859,1.0508,-9.8576,1.7724,13.6817,6.2273,1012
-1.0871,-9.9014,0.0337,0.4934,-9.9014,1.8446,24.407,13.8553,1013
-0.5417,-9.8336,-0.1465,0.1799,-9.8336,0.9822,25.2035,20.6357,1014
-4.1982,-9.9294,0.0708,2.0662,-9.9294,2.508,29.9205,22.8551,1015
-1.1913,-9.8645,0.3688,0.6269,-9.8645,1.5222,8.6463,3.3941,1017
-3.9534,-9.8846,0.5131,2.4658,-9.8846,4.4671,34.3812,14.7566,1018
-0.9391,-9.8705,0.0773,0.6786,-9.8705,1.1854,7.7733,4.4392,1019
-1.9523,-9.8493,0.2248,1.3574,-9.8493,2.8699,12.6204,7.6651,1020
-3.9269,-9.9153,0.7358,1.7437,-9.9153,1.2964,33.6231,26.2706,1022
-5.1122,-9.8943,2.5949,4.7636,-9.8943,5.7069,58.9753,34.362,1023
-2.0867,-9.924,-0.3529,0.8036,-9.924,0.6668,9.0849,6.8884,1024
-1.3318,-9.9239,0.2016,1.0093,-9.9239,2.2544,34.9513,25.9155,1025
-0.3428,-9.7107,1.1401,1.1511,-9.7107,1.8292,33.3584,22.6965,1027
-2.7375,-9.7135,-0.0415,0.8568,-9.7135,2.1487,14.983,7.3653,1028
0.6346,-10.2776,1.2463,0.4899,-10.2776,1.0549,9.7228,6.5031,1029
-4.3002,-9.8593,0.0776,2.7103,-9.8593,7.1971,17.1659,13.2838,1030
-1.7028,-9.498,0.3795,1.9196,-9.498,1.5099,10.1709,9.6879,1032
-4.1946,-9.8432,0.1483,1.4666,-9.8432,3.3567,10.3494,5.7818,1033
-5.6549,-9.8708,3.0001,5.6236,-9.8708,1.5645,15.2905,13.7673,1034
-2.8424,-10.0199,-0.2456,1.4273,-10.0199,2.5824,28.0308,18.935,1035
-3.3162,-9.4327,2.7733,4.1914,-9.4327,0.6921,26.7548,21.9407,1037
-16.4992,-9.8081,-0.2775,3.6756,-9.8081,4.9634,32.7221,20.3691,1038
-3.6302,-9.0899,3.5078,4.2864,-9.0899,2.6945,26.8156,19.4525,1039
-10.5693,-9.6824,0.5991,5.0195,-9.6824,3.519,22.6469,15.0667,1040
-5.9035,-9.876,1.0914,3.535,-9.876,4.0034,17.8958,12.5794,1042
-14.9884,-9.9166,-0.1675,3.7137,-9.9166,5.1676,27.9963,17.7845,1043
-25.9764,-8.6313,-0.6388,11.5771,-8.6313,2.0275,40.6102,24.7432,1044
-5.8086,-9.9119,1.6124,4.765,-9.9119,6.4794,27.4952,18.8022,1045
-4.8331,-9.942,-0.77,1.8663,-9.942,2.5932,16.3451,9.2139,1047
-9.8124,-9.8289,-0.3566,3.2946,-9.8289,3.9815,23.7487,11.6431,1048
-1.2144,-9.5757,-0.0011,0.6591,-9.5757,1.9744,17.2741,7.259,1049
-4.2561,-9.9141,0.2141,1.3966,-9.9141,2.3076,12.6431,7.4816,1050
-7.2209,-9.8331,-0.4631,2.1248,-9.8331,3.284,24.8133,9.8242,1052
-2.1526,-9.5273,0.7621,1.5744,-9.5273,2.3084,13.1067,7.5475,1053
-1.1966,-10.0,0.8275,1.9236,-10.0,3.7903,12.2223,7.4376,1054
-2.6599,-9.5943,-0.4742,1.0564,-9.5943,2.1838,8.1957,7.5473,1055
-1.6508,-9.8426,-0.2564,0.8351,-9.8426,1.032,7.3372,4.4157,1057
-2.9588,-9.7891,0.4519,2.2153,-9.7891,4.9745,21.5524,11.2534,1058
-1.5969,-10.0021,1.3874,2.0946,-10.0021,0.9068,11.9957,9.748,1059
-2.3805,-9.9077,-0.0387,1.0397,-9.9077,3.2852,15.2217,7.5602,1060
-0.2797,-9.9198,0.1202,0.208,-9.9198,1.5704,13.3169,6.7099,1062
-11.4821,-9.9763,2.4111,6.5034,-9.9763,8.4932,40.5101,17.2361,1063
-0.4122,-9.9396,0.7798,1.5135,-9.9396,2.6013,15.0255,13.5144,1064
-2.7514,-10.1473,0.2532,1.2203,-10.1473,0.9732,11.59,8.9748,1065
-3.5925,-9.8375,2.8927,3.7078,-9.8375,6.5615,21.8196,14.8955,1067
-3.2527,-9.8154,0.3977,1.2082,-9.8154,2.4812,12.8192,6.1679,1068
-1.5876,-9.9195,-0.3743,0.776,-9.9195,1.3539,6.839,3.6306,1069
-2.4898,-9.8614,0.588,1.5174,-9.8614,2.7002,14.9529,5.8816,1070
-4.3897,-9.8707,-0.4604,1.696,-9.8707,0.9135,5.8247,4.0834,1072
-264.8176,-9.3267,-13.8057,47.0296,-9.3267,9.7006,42.5056,7.7008,1073
-23.0531,-9.4259,7.3941,20.1736,-9.4259,6.4287,11.1203,6.5316,1074
-16.7435,-9.7714,4.9733,14.0633,-9.7714,9.5862,57.1659,23.7863,1075
-43.3525,-9.8212,-7.3668,22.0518,-9.8212,6.0032,46.7149,43.2942,1077
-11.2651,-9.9074,1.0186,5.0537,-9.9074,6.9133,17.3474,11.5243,1078
-17.5381,-9.541,5.7407,11.9135,-9.541,3.3802,23.0625,18.0546,1079
-20.4779,-9.8763,2.5347,8.0312,-9.8763,9.2651,20.4307,8.9948,1080
-15.6623,-9.7306,-2.5794,5.264,-9.7306,2.6027,15.2556,9.6456,1082
-14.3273,-9.9989,0.0391,3.6922,-9.9989,5.581,14.3511,7.4656,1083
-5.0745,-9.498,-0.4195,3.2132,-9.498,2.8237,12.4147,6.1446,1084
-8.3768,-9.1308,0.1786,4.0585,-9.1308,5.5351,16.7617,9.3086,1085
-2.012,-9.8377,0.5368,1.2007,-9.8377,2.9133,6.0563,3.3754,1087
-4.4191,-9.8428,0.8224,2.9055,-9.8428,3.4848,11.1279,6.345,1088
-1.0752,-9.7261,1.3139,2.0916,-9.7261,3.8891,9.4503,6.7335,1089
-28.8667,-9.8297,-0.3719,11.7503,-9.8297,7.8715,26.8328,10.977,1090
-8.1073,-10.106,0.5864,4.8034,-10.106,3.0639,14.2079,8.5168,1092
-15.2076,-9.7091,-0.4911,4.7407,-9.7091,4.7572,19.1251,7.8607,1093
-1.5811,-9.6208,1.3319,1.8358,-9.6208,1.0061,8.103,5.7613,1094
-5.846,-9.9192,-0.4497,3.489,-9.9192,3.0788,11.9878,7.8208,1095
-0.8552,-9.9939,2.5744,3.6067,-9.9939,6.2578,14.629,11.5639,1097
-5.6871,-9.9194,1.0261,3.1638,-9.9194,5.338,12.8966,7.2559,1098
-6.1932,-9.913,1.0936,4.6785,-9.913,1.4836,11.9192,8.2097,1099
-1.4946,-9.9507,1.0295,2.0347,-9.9507,3.4837,8.5264,5.2776,1100
-5.208,-9.8585,-0.7929,2.5035,-9.8585,1.2349,7.192,5.9123,1102
-4.886,-9.7433,0.3878,2.192,-9.7433,3.8276,15.8086,6.0311,1103
-2.2214,-10.407,0.0521,1.8959,-10.407,1.4601,12.0844,5.4488,1104
-9.6346,-9.9224,-0.4561,4.3103,-9.9224,5.8636,13.0409,7.0033,1105
-1.6574,-9.8053,1.2968,2.4646,-9.8053,3.6838,11.9569,6.8311,1107
-0.7572,-9.8192,0.8066,1.3805,-9.8192,4.3813,13.3674,9.5263,1108
-6.7996,-10.3346,2.5297,4.5644,-10.3346,2.6481,15.5777,9.762,1109
-5.9326,-9.833,1.1562,4.8119,-9.833,5.1384,14.1588,6.5164,1110
-1.0009,-9.7195,0.1596,0.7264,-9.7195,2.4096,22.4567,18.4302,1112
-10.1312,-9.8974,-0.4189,2.5997,-9.8974,3.2554,17.3937,5.2841,1113
-3.9139,-9.8495,-1.2563,1.418,-9.8495,1.5431,3.815,2.3316,1114
-0.416,-9.8345,-0.1969,0.0894,-9.8345,0.103,0.8169,0.7085,1115
-0.1441,-9.8296,0.2208,0.1992,-9.8296,0.231,0.8765,0.7598,1117
-0.0342,-9.8347,0.1414,0.1239,-9.8347,0.1413,0.7831,0.6735,1118
0.2325,-9.8391,0.4424,0.1229,-9.8391,0.1408,0.9804,0.8809,1119
-0.4389,-9.8396,-0.0734,0.2999,-9.8396,0.375,0.8352,0.7513,1120
-0.3294,-9.8386,-0.2589,0.0477,-9.8386,0.0543,0.7623,0.7083,1122
-0.5023,-9.8366,-0.0552,0.2415,-9.8366,0.2878,0.8415,0.7093,1123
0.0862,-9.8387,0.1881,0.0994,-9.8387,0.1273,0.7794,0.6874,1124
-0.2593,-9.8379,-0.1282,0.0796,-9.8379,0.0978,0.7199,0.6741,1125
-0.0461,-9.8416,0.0739,0.0813,-9.8416,0.1024,0.7053,0.6813,1126
-0.5937,-9.8363,-0.3287,0.2038,-9.8363,0.2432,0.9777,0.7686,1128
-0.7522,-9.8353,-0.5161,0.1311,-9.8353,0.1646,1.1753,0.9103,1129
-0.0232,-9.8404,0.4611,0.234,-9.8404,0.3032,1.3987,1.0013,1130
-1.0157,-9.842,-0.5569,0.2321,-9.842,0.3151,1.5187,0.9261,1131
-0.7555,-9.8296,-0.385,0.263,-9.8296,0.3059,1.2296,0.8085,1132
-0.8746,-9.8258,-0.7963,0.0649,-9.8258,0.0513,1.1378,1.0661,1133
-0.3983,-9.8273,0.2777,0.3467,-9.8273,0.3692,1.3263,0.7606,1135
-0.6857,-9.8335,-0.3458,0.2481,-9.8335,0.2847,1.0388,0.7825,1136
-0.2544,-9.8333,-0.1286,0.1129,-9.8333,0.1253,0.7342,0.7003,1137
-1.5096,-9.8282,-0.1311,0.7528,-9.8282,0.8598,2.9424,1.2051,1138
-0.3577,-9.8425,0.4498,0.5926,-9.8425,0.7687,2.0382,1.0196,1139
-0.1182,-9.8338,0.2233,0.1746,-9.8338,0.2102,1.3036,0.9791,1140
-3.4019,-9.8393,-1.844,1.1518,-9.8393,1.0716,3.9289,2.7369,1141
-12.317,-9.8551,2.6569,7.5326,-9.8551,6.3184,41.3263,9.8872,1143
-1.4961,-9.7418,0.8755,1.4427,-9.7418,3.7426,31.2796,21.1978,1144
-1.7331,-10.142,0.3924,1.0652,-10.142,2.8122,12.7408,7.0972,1145
-9.8657,-9.5716,0.7326,4.7781,-9.5716,3.7716,16.7188,6.8946,1146
-5.0142,-10.0765,1.0281,2.6477,-10.0765,3.8525,22.0901,17.7019,1147
-2.1962,-9.6767,0.1061,1.7972,-9.6767,3.4833,16.1563,14.0595,1148
-4.0917,-9.8651,0.5099,2.0002,-9.8651,4.2784,18.2642,11.0144,1149
-4.1318,-10.0144,-0.2426,2.2798,-10.0144,2.5549,17.3014,16.5922,1150
-1.2278,-9.7316,0.1649,1.063,-9.7316,1.6566,10.9575,9.5661,1151
-1.5911,-9.924,1.0807,2.2889,-9.924,1.3628,15.3877,4.9557,1152
-7.6287,-9.6776,0.9666,6.0877,-9.6776,2.0787,16.3412,8.5515,1153
-4.9751,-9.7712,0.1249,2.2396,-9.7712,3.8883,29.645,15.9496,1154
-3.2973,-10.0552,0.5958,1.9634,-10.0552,3.0308,20.9771,12.2551,1155
-4.1118,-10.3713,2.7983,3.8206,-10.3713,1.5612,20.231,11.7535,1156
-7.1356,-9.8497,2.2496,4.3681,-9.8497,2.3472,23.7953,14.724,1157
-3.8422,-9.8323,0.1167,1.5014,-9.8323,3.5891,9.1703,4.9914,1158
-1.7237,-9.9518,0.9075,2.0873,-9.9518,3.7522,12.7246,6.9456,1159
-5.1734,-9.8789,-1.426,1.9856,-9.8789,2.6938,10.0388,6.3524,1160
-18.0481,-9.6115,-1.2768,7.3319,-9.6115,3.8347,20.0327,15.6785,1162
-9.9555,-9.7709,0.9511,5.5039,-9.7709,7.5778,33.1679,7.7782,1163
-3.5844,-9.4319,-0.2383,1.4751,-9.4319,1.6787,7.7588,4.3643,1164
-5.2772,-10.3402,1.3357,4.3728,-10.3402,7.6207,14.4145,12.7687,1167
-4.416,-9.8924,-0.1134,2.3322,-9.8924,3.9056,13.8576,6.6632,1168
-0.7267,-9.7221,1.5421,2.3842,-9.7221,4.1955,11.7116,9.3841,1169
-5.5668,-9.8845,-0.6514,4.2299,-9.8845,8.2321,17.4057,13.1455,1170
-2.6576,-9.8882,1.4295,3.4681,-9.8882,1.6244,7.4156,6.6565,1172
-7.378,-9.7974,0.1288,3.6614,-9.7974,6.9855,19.0391,8.507,1173
-13.3724,-10.1096,-1.4544,3.4799,-10.1096,7.013,18.4832,8.891,1174
-5.0925,-9.8927,-0.5866,2.0595,-9.8927,2.8703,9.1215,5.3312,1175
-1.8644,-10.0069,0.8395,2.183,-10.0069,3.6773,8.4427,5.6464,1177
-7.2918,-9.8334,-0.3028,2.7947,-9.8334,5.0085,14.8496,5.302,1178
-4.4663,-10.0943,-1.1814,2.0398,-10.0943,1.1693,13.1299,10.916,1179
-3.0746,-9.9703,1.1752,2.3311,-9.9703,4.5617,16.7984,10.0301,1180
-6.5025,-9.9867,0.428,4.1853,-9.9867,10.5617,25.1981,15.7078,1182
-12.221,-9.6956,0.707,5.8675,-9.6956,7.8675,19.8428,8.7897,1183
-10.76,-9.7897,0.5101,4.3793,-9.7897,6.7682,16.6966,8.4073,1184
-3.4791,-9.7854,1.8903,3.8215,-9.7854,6.2505,16.3187,9.5933,1185
-4.0503,-9.8795,-0.7215,1.7125,-9.8795,2.2997,11.6015,7.5032,1187
-31.4957,-9.7479,0.7242,8.0767,-9.7479,6.8759,22.9578,9.9414,1188
-2.4574,-10.3145,1.829,4.0827,-10.3145,4.9844,9.0875,6.9552,1189
-8.5776,-9.9031,1.7116,4.0039,-9.9031,5.3077,12.5593,8.0341,1190
-6.3906,-9.45,-3.0709,3.1185,-9.45,2.6747,10.0023,6.0026,1192
-19.5007,-9.8616,1.1669,9.1747,-9.8616,9.1043,25.4712,12.6574,1193
-5.1035,-10.02,9.0063,6.463,-10.02,4.7057,21.7465,18.4078,1194
-8.0546,-9.9973,1.202,4.5313,-9.9973,4.2039,15.9642,8.7401,1195
-3.3688,-9.8903,0.9826,3.0132,-9.8903,2.4398,12.3709,8.8702,1197
-24.7473,-9.5722,-1.1825,8.1674,-9.5722,6.4969,22.7597,11.2803,1198
-10.0381,-9.5374,5.3792,8.4215,-9.5374,9.9485,29.3377,19.3072,1199
-9.9381,-9.9159,0.6403,7.4455,-9.9159,8.284,24.0217,11.885,1200
-9.736,-9.9604,1.8645,6.2737,-9.9604,5.7618,22.6229,6.5753,1203
-16.4475,-9.4793,-0.3085,14.2677,-9.4793,1.9304,14.45,11.8121,1204
-24.9376,-10.1291,7.058,16.2031,-10.1291,7.8411,28.2391,16.9239,1205
-15.515,-9.661,6.3794,15.578,-9.661,6.2771,31.3932,21.457,1207
-10.2205,-9.6571,0.6202,4.915,-9.6571,4.9554,26.2439,6.7634,1208
-23.7369,-10.0697,7.3507,14.3892,-10.0697,10.8592,24.7362,18.4409,1209
-5.8861,-9.8704,-0.046,3.3835,-9.8704,5.9673,16.5404,6.0635,1210
-30.4126,-9.6225,0.1595,18.1213,-9.6225,8.2829,28.8272,18.6367,1212
-17.9719,-9.3569,-0.391,5.6769,-9.3569,6.2745,19.9189,9.4007,1213
-0.7373,-9.9488,1.1102,1.6595,-9.9488,2.409,7.9183,6.1973,1214
-5.4297,-9.699,1.8783,5.3615,-9.699,7.5468,17.2268,8.9299,1215
-18.1233,-9.9637,1.3475,6.4866,-9.9637,9.3837,16.2713,12.8848,1217
-8.1146,-9.8553,-0.5543,2.9115,-9.8553,6.3017,15.7242,7.0014,1218
-22.5664,-9.9129,9.2732,21.174,-9.9129,14.8474,34.2453,22.6833,1219
-3.4146,-9.8955,4.0369,6.5393,-9.8955,7.3386,19.9289,13.6096,1220
-3.0954,-10.011,0.5325,2.3972,-10.011,3.2353,10.8282,6.9525,1221
-6.519,-9.4619,0.9546,3.4737,-9.4619,5.9588,23.0864,12.8305,1223
-34.9978,-9.3096,3.9643,12.1355,-9.3096,9.866,27.6044,15.798,1224
-5.1024,-9.1493,1.0248,3.4907,-9.1493,1.5935,9.6343,5.4043,1225
-0.4164,-9.7499,0.0877,0.3515,-9.7499,0.9906,5.83,3.1309,1226
-8.1128,-9.2347,0.3919,4.7917,-9.2347,3.9508,17.094,8.9705,1227
-4.4416,-9.8007,7.2049,8.4144,-9.8007,3.7871,19.5574,16.1911,1228
-8.3186,-9.9733,-1.6889,3.1775,-9.9733,5.9008,11.8507,6.8123,1229
-2.9421,-9.8865,-0.2219,1.4606,-9.8865,2.5657,7.9832,5.4616,1230
-6.0316,-10.0728,-0.7249,6.4583,-10.0728,2.1482,14.2703,11.9372,1232
-6.3424,-9.3544,2.3708,6.221,-9.3544,3.0096,11.2474,9.2322,1233
-8.5136,-9.7174,1.5911,5.7485,-9.7174,4.1941,16.9273,10.624,1234
-14.3858,-8.9299,-0.0391,6.5057,-8.9299,3.8753,21.6228,9.1879,1235
-8.9467,-9.7944,0.2239,4.1004,-9.7944,4.5218,10.4608,8.0037,1237
-32.3827,-9.76,-0.8569,9.3005,-9.76,6.5313,22.6694,9.8755,1238
-26.8477,-9.7991,3.7595,22.8318,-9.7991,6.8793,29.2107,18.7795,1239
-10.6171,-9.8869,2.4931,7.9677,-9.8869,8.8065,17.6702,12.5657,1240
-6.3846,-10.1744,0.623,4.175,-10.1744,5.0134,14.7553,11.5589,1242
-20.9179,-9.8825,5.5957,13.9077,-9.8825,9.3572,25.4018,14.0461,1243
-3.6728,-10.146,-0.4417,1.5001,-10.146,1.7374,5.3977,3.2483,1244
-14.1529,-9.6959,-0.8513,4.9777,-9.6959,6.7166,13.9537,9.4398,1245
-6.3442,-9.1978,-1.5651,4.5687,-9.1978,3.6216,16.3019,7.7363,1247
-27.3089,-9.7928,9.624,18.3212,-9.7928,13.7787,33.3455,26.4581,1248
1.7455,-10.1708,22.4783,13.8462,-10.1708,4.7609,35.2471,31.7526,1249
-9.4355,-8.9094,-0.4147,4.2919,-8.9094,3.7278,33.7404,11.7849,1250
-9.159,-9.4313,-1.0193,4.7316,-9.4313,5.6409,16.7411,11.0257,1252
-23.0302,-9.8819,-2.0684,8.27,-9.8819,8.2746,37.128,13.227,1253
-7.0794,-9.7156,1.1223,7.6396,-9.7156,5.0861,17.5549,6.0538,1254
-6.9016,-10.1174,0.9869,2.5356,-10.1174,2.5294,16.3173,7.05,1255
-7.9347,-9.5411,-0.0893,2.143,-9.5411,3.0644,12.5994,6.3423,1256
-0.6034,-10.6897,1.1706,1.3861,-10.6897,2.0366,23.4797,10.8298,1257
-70.6776,-8.5679,0.4483,16.8829,-8.5679,7.1912,37.5789,19.2308,1258
-8.2896,-9.2538,0.3341,3.7491,-9.2538,3.9942,22.5903,10.4439,1259
-19.1552,-9.915,-0.8043,4.5693,-9.915,3.9244,18.0935,12.1134,1260
-6.9515,-9.6694,1.0132,5.1523,-9.6694,3.4946,20.8035,11.1524,1262
-4.267,-9.7646,1.0006,2.746,-9.7646,5.0901,10.1322,6.8255,1263
-3.3606,-9.8134,1.0783,2.7013,-9.8134,2.8439,11.9022,5.0126,1264
-12.6721,-8.0436,2.8805,14.1274,-8.0436,6.1922,81.5357,21.7011,1265
-15.5934,-9.7125,3.3342,9.4335,-9.7125,3.1354,27.7577,13.4693,1267
-9.2178,-9.8577,-0.5316,3.1886,-9.8577,3.9052,25.814,8.0052,1268
-2.7432,-9.9386,-0.86,1.0389,-9.9386,4.2885,9.1883,5.7927,1269
-10.935,-9.7865,5.6216,9.2541,-9.7865,10.9706,25.4663,14.4106,1270
-10.8611,-9.6722,-0.1558,5.6092,-9.6722,7.789,31.8261,20.158,1272
-11.351,-9.715,0.5712,4.7985,-9.715,5.3741,19.2857,10.2256,1273
-6.6591,-10.0126,0.2621,5.7911,-10.0126,1.7742,11.6698,7.5056,1274
-7.3262,-9.5093,1.8377,5.3086,-9.5093,5.9417,24.108,10.7674,1275
-1.6564,-9.818,0.0194,0.4922,-9.818,1.1441,5.5308,3.9023,1277
-1.5682,-9.9604,0.4572,1.3889,-9.9604,3.284,28.7253,6.8901,1278
-1.8204,-9.9607,-0.2985,0.6574,-9.9607,0.5914,5.0244,3.8208,1279
-4.0568,-9.8451,2.5092,5.4171,-9.8451,7.3177,21.9385,15.0815,1280
-1.5367,-9.6933,0.4941,1.7004,-9.6933,0.8998,9.0432,6.0637,1281
-1.4581,-9.9951,0.5971,1.5912,-9.9951,4.6047,25.8219,22.3704,1283
-12.8083,-9.9096,0.3314,5.8027,-9.9096,5.644,27.2671,14.1276,1284
-12.0999,-9.795,-3.2827,5.0255,-9.795,2.3889,34.8934,32.0951,1285
-1.1354,-10.1018,-0.5017,0.6536,-10.1018,2.8741,41.9354,38.9663,1286
-5.3815,-9.8601,8.9178,14.1187,-9.8601,2.1338,35.6957,27.2303,1287
-4.2237,-9.8758,9.3982,14.5235,-9.8758,4.4905,24.1506,19.4454,1288
-1.2457,-9.9303,-0.0579,1.3906,-9.9303,1.0169,11.2745,9.8963,1289
-5.8127,-10.1108,0.4575,4.4322,-10.1108,2.1839,12.2374,10.0151,1290
-0.907,-10.0836,-0.3437,0.4411,-10.0836,1.3465,6.5179,5.3885,1292
-1.875,-9.8612,0.4696,1.9738,-9.8612,3.0185,11.9554,5.9889,1293
-11.0591,-9.8173,0.9637,5.661,-9.8173,6.1886,18.3187,12.5454,1294
-22.8902,-9.7275,-0.6667,7.8637,-9.7275,4.7518,21.9117,11.3013,1295
-8.1272,-9.5263,-4.0681,3.5992,-9.5263,2.7455,15.8977,8.6516,1296
-8.8404,-9.8328,3.7483,6.4813,-9.8328,5.137,21.1899,10.9542,1297
-4.9688,-9.7825,0.1018,1.911,-9.7825,3.0436,9.1297,5.4431,1298
-4.185,-9.9278,-0.0654,2.0125,-9.9278,3.6075,16.1487,7.1813,1299
-1.77,-10.1533,0.9048,2.7692,-10.1533,2.021,12.4583,8.1506,1300
-9.3667,-8.8386,0.3421,7.7664,-8.8386,2.8087,32.4251,28.4596,1301
-20.8771,-11.2197,-4.3616,10.0159,-11.2197,7.0266,67.169,49.6327,1302
-68.108,-10.2241,3.453,22.6344,-10.2241,5.0028,49.8137,35.8765,1303
-17.6696,-9.7295,-0.5463,8.5733,-9.7295,4.4078,20.2167,12.6369,1304
-0.6142,-10.3086,9.7323,11.9084,-10.3086,9.2077,26.3686,23.2604,1305
-2.9816,-9.9245,-0.6694,1.2199,-9.9245,1.5647,7.4665,3.548,1306
-4.1327,-9.763,0.1692,2.2112,-9.763,1.7694,8.8702,6.7299,1307
-4.4003,-9.877,0.2608,2.0577,-9.877,2.9006,18.2031,8.2194,1308
-3.8402,-9.8846,0.6553,1.9356,-9.8846,3.0516,10.9439,6.5017,1309
-5.4176,-9.9644,-0.1237,3.5565,-9.9644,2.883,14.9733,10.7768,1310
-1.0372,-9.8164,0.3648,1.4571,-9.8164,2.8697,16.8555,12.1982,1311
-1.3035,-9.6839,0.7452,1.7815,-9.6839,2.7726,9.9949,6.3722,1312
-1.748,-9.9901,0.7375,1.4296,-9.9901,1.5074,9.4166,7.647,1313
-5.3722,-9.8796,-0.9339,2.6659,-9.8796,3.2706,13.2275,6.6997,1314
-32.8933,-9.7558,-20.0089,9.8491,-9.7558,4.6307,19.58,15.6098,1316
-50.504,-9.7255,-20.0802,28.0287,-9.7255,12.4154,38.8541,23.4021,1317
-6.1531,-9.7992,3.2958,6.5315,-9.7992,4.0195,24.4646,5.1022,1318
-21.0276,-9.8953,-0.4099,5.8083,-9.8953,4.1568,27.5752,25.1697,1319
-61.9067,-9.5485,-40.8722,22.349,-9.5485,2.643,50.5571,49.6595,1321
-35.2301,-9.5239,6.1995,20.1083,-9.5239,7.8838,48.0629,34.4648,1322
-32.9151,-9.5691,-2.9455,9.3592,-9.5691,3.0048,9.6102,1.6871,1323
-2.7307,-9.5083,-2.1782,0.4468,-9.5083,0.1568,1.1806,1.0453,1324
4.1541,-9.5559,8.0707,2.5828,-9.5559,0.942,4.3388,3.4281,1327
-4.1426,-9.7254,2.1521,4.782,-9.7254,2.6329,7.0687,3.379,1328
-0.8762,-9.7439,5.9277,4.3366,-9.7439,2.346,6.0604,3.3647,1329
-0.1246,-9.8787,0.6674,0.951,-9.8787,2.6562,7.9923,5.3677,1330
-3.1615,-9.896,-0.9822,1.0147,-9.896,2.7026,10.3493,3.8328,1331
-13.4905,-9.7869,1.3364,8.815,-9.7869,4.0114,7.1727,4.3548,1332
-12.8642,-10.0288,-7.8886,2.7737,-10.0288,1.2724,12.0054,11.0907,1333
0.1236,-9.7768,4.8874,4.8723,-9.7768,3.0906,11.3471,7.0873,1335
-6.5944,-9.8577,-0.8681,2.007,-9.8577,2.5231,7.2812,1.9608,1337
-5.3962,-9.2047,-0.1301,3.009,-9.2047,3.063,16.4442,6.0117,1338
-0.137,-9.8634,0.1515,0.2624,-9.8634,0.6086,2.0406,1.5387,1339
-21.0085,-9.8819,-1.8665,5.7162,-9.8819,3.5475,16.9082,1.6325,1340
-0.2415,-9.874,0.0001,0.1184,-9.874,0.4127,1.2181,0.961,1341
-4.0969,-9.98,-1.3711,1.9871,-9.98,3.534,8.2802,2.6903,1342
