AYGX_min,AZ_mean,AYGX_mean,AYGX_std,AZ_mean.1,GX_std,Gnorm_max,Gnorm_median,timestamp
-39.336,-9.7502,0.6951,15.9776,-9.7502,3.2936,28.7408,16.8809,32
-24.5354,-9.8662,1.1357,9.4763,-9.8662,5.3988,13.4914,8.5542,33
-60.3335,-9.9459,-10.6792,20.8748,-9.9459,10.4248,24.385,18.2761,34
-6.2123,-9.618,-2.1345,2.9513,-9.618,2.5935,11.5268,9.4403,35
-4.023,-9.5761,3.806,7.5094,-9.5761,7.1951,27.4765,13.7847,36
