AYGX_min,AZ_mean,AYGX_mean,AYGX_std,AZ_mean.1,GX_std,Gnorm_max,Gnorm_median,timestamp
-156.0919,-10.3036,-36.7334,66.6097,-10.3036,17.3952,75.9687,57.0939,354
-50.7994,-10.2199,-11.0768,40.2658,-10.2199,29.5079,70.225,36.8098,355
-308.661,-9.2758,-22.2338,86.1195,-9.2758,34.0986,87.6279,28.9072,357
-236.7762,-9.898,-66.245,78.7018,-9.898,37.2979,85.9376,42.9405,358
-188.9981,-9.3015,-29.5208,81.2353,-9.3015,31.6294,64.5456,29.8194,359
