timestamp,AX_mean,AX_min,AX_max,AX_median,AX_std,AX_meandiff,AX_mediandiff,AX_extremum,AX_delta,AY_mean,AY_min,AY_max,AY_median,AY_std,AY_meandiff,AY_mediandiff,AY_extremum,AY_delta,AZ_mean,AZ_min,AZ_max,AZ_median,AZ_std,AZ_meandiff,AZ_mediandiff,AZ_extremum,AZ_delta,GX_mean,GX_min,GX_max,GX_median,GX_std,GX_meandiff,GX_mediandiff,GX_extremum,GX_delta,GY_mean,GY_min,GY_max,GY_median,GY_std,GY_meandiff,GY_mediandiff,GY_extremum,GY_delta,GZ_mean,GZ_min,GZ_max,GZ_median,GZ_std,GZ_meandiff,GZ_mediandiff,GZ_extremum,GZ_delta,AYGX_mean,AYGX_min,AYGX_max,AYGX_median,AYGX_std,AYGX_meandiff,AYGX_mediandiff,AYGX_extremum,AYGX_delta,Anorm_mean,Anorm_min,Anorm_max,Anorm_median,Anorm_std,Anorm_meandiff,Anorm_mediandiff,Anorm_extremum,Anorm_delta,Gnorm_mean,Gnorm_min,Gnorm_max,Gnorm_median,Gnorm_std,Gnorm_meandiff,Gnorm_mediandiff,Gnorm_extremum,Gnorm_delta
0,0.4166,0.4121,0.4242,0.4161,0.0025,0.0017,0.0018,0.4242,0.0121,-0.2777,-0.2872,-0.2681,-0.2774,0.0042,-0.0001,0.0,0.2872,0.0191,-9.7888,-9.7949,-9.7849,-9.7882,0.0025,-0.0009,-0.0012,9.7949,0.0101,-0.5447,-0.5688,-0.5178,-0.5448,0.0138,0.0014,0.0015,0.5688,0.051,-1.8523,-1.8812,-1.8288,-1.8506,0.015,-0.0049,-0.0088,1.8812,0.0525,0.0944,0.0747,0.1227,0.0957,0.0115,-0.0035,-0.006,0.1227,0.048,0.1513,0.1416,0.1594,0.1505,0.0049,-0.0003,0.0039,0.1594,0.0179,9.8016,9.7983,9.8078,9.801,0.0024,0.001,0.001,9.8078,0.0095,1.9331,1.9064,1.9645,1.9349,0.0142,0.0042,0.004,1.9645,0.0581
1,0.4183,0.406,0.4331,0.4179,0.006,-0.0017,-0.0005,0.4331,0.0271,-0.2778,-0.3064,-0.2507,-0.2774,0.0134,-0.0014,-0.0006,0.3064,0.0557,-9.7897,-9.7947,-9.7858,-9.7894,0.0022,0.0003,0.0002,9.7947,0.0089,-0.5433,-0.5718,-0.5058,-0.5433,0.0202,-0.0007,-0.0142,0.5718,0.066,-1.8572,-1.89,-1.8288,-1.8594,0.0188,-0.0093,-0.0044,1.89,0.0613,0.0908,0.0837,0.1032,0.0897,0.0054,-0.0023,0.0007,0.1032,0.0195,0.151,0.1268,0.1637,0.1544,0.0097,-0.0001,0.0013,0.1637,0.0368,9.8026,9.8,9.8087,9.8021,0.0022,-0.0002,-0.0003,9.8087,0.0088,1.9373,1.914,1.9607,1.9389,0.0142,0.0102,0.0078,1.9607,0.0467
2,0.4166,0.364,0.4924,0.4175,0.0286,0.0003,-0.0002,0.4924,0.1284,-0.2792,-0.3584,-0.213,-0.278,0.034,0.0002,-0.006,0.3584,0.1454,-9.7895,-9.8392,-9.7411,-9.7892,0.0206,-0.0,-0.0004,9.8392,0.0981,-0.544,-0.6438,-0.3497,-0.5575,0.0715,-0.0078,-0.0218,0.6438,0.2941,-1.8664,-1.9075,-1.8288,-1.8638,0.0217,0.0054,0.0,1.9075,0.0788,0.0885,0.0551,0.1258,0.0904,0.0188,-0.002,-0.0052,0.1258,0.0706,0.1509,0.1063,0.1792,0.1557,0.0212,0.0019,0.0038,0.1792,0.0728,9.8024,9.7579,9.8487,9.8017,0.0192,0.0,0.0012,9.8487,0.0909,1.9475,1.9164,1.9789,1.9467,0.019,-0.0026,0.0008,1.9789,0.0624
3,0.4169,0.3825,0.4472,0.4173,0.0154,0.0011,-0.0019,0.4472,0.0647,-0.279,-0.3734,-0.1957,-0.2839,0.0429,0.0075,0.0078,0.3734,0.1777,-9.7895,-9.8141,-9.7629,-9.7896,0.0132,-0.0014,0.0008,9.8141,0.0512,-0.5518,-0.6618,-0.3632,-0.5793,0.0822,-0.0013,-0.009,0.6618,0.2986,-1.8611,-1.8988,-1.8113,-1.8638,0.0211,0.0131,0.0175,1.8988,0.0875,0.0866,0.0492,0.1288,0.0852,0.0183,0.0087,0.0076,0.1288,0.0796,0.1528,0.0931,0.1933,0.1595,0.0266,-0.0041,-0.0102,0.1933,0.1001,9.8025,9.7782,9.8249,9.803,0.0122,0.0013,-0.0012,9.8249,0.0467,1.9449,1.9093,1.9814,1.9475,0.0159,-0.0105,-0.0069,1.9814,0.0721
4,0.418,0.3409,0.4868,0.4155,0.0328,-0.0018,-0.0011,0.4868,0.1459,-0.2714,-0.3752,-0.1711,-0.2762,0.0481,-0.0058,-0.0033,0.3752,0.2041,-9.7909,-9.8461,-9.7228,-9.7888,0.0245,0.0013,-0.0033,9.8461,0.1232,-0.5531,-0.6858,-0.3332,-0.5883,0.1104,0.0046,0.0278,0.6858,0.3526,-1.8479,-1.9075,-1.82,-1.8462,0.0216,-0.0151,-0.0175,1.9075,0.0875,0.0952,0.0567,0.1451,0.0928,0.0216,-0.0141,-0.0122,0.1451,0.0885,0.1488,0.0902,0.2081,0.1493,0.0354,0.0019,0.0027,0.2081,0.1179,9.8037,9.7419,9.855,9.8018,0.0226,-0.0012,0.0029,9.855,0.1131,1.9344,1.8737,1.9828,1.9406,0.0275,0.0107,0.0034,1.9828,0.1091
5,0.4161,0.3848,0.4641,0.4144,0.02,0.0005,0.0022,0.4641,0.0793,-0.2773,-0.3866,-0.2065,-0.2795,0.0468,0.0004,0.0006,0.3866,0.1801,-9.7896,-9.8068,-9.7623,-9.7921,0.0133,-0.0008,0.0016,9.8068,0.0445,-0.5485,-0.6618,-0.4037,-0.5605,0.0638,0.0056,0.0067,0.6618,0.2581,-1.8631,-1.925,-1.82,-1.8638,0.0221,0.0044,0.0088,1.925,0.105,0.0811,0.0192,0.1258,0.0807,0.0246,0.0116,0.0098,0.1258,0.1066,0.1506,0.113,0.1919,0.152,0.0221,-0.0009,-0.0016,0.1919,0.0789,9.8025,9.778,9.8182,9.8048,0.0122,0.0007,-0.0017,9.8182,0.0402,1.945,1.9066,1.9816,1.944,0.0167,-0.0054,-0.0065,1.9816,0.0751
6,0.4166,0.3869,0.4462,0.4166,0.0153,0.0003,0.0,0.4462,0.0594,-0.2769,-0.392,-0.155,-0.2789,0.0402,0.0029,0.0051,0.392,0.237,-9.7904,-9.8361,-9.7553,-9.7906,0.0168,0.0004,0.0003,9.8361,0.0808,-0.5429,-0.6889,-0.3482,-0.5538,0.0602,-0.0107,0.0015,0.6889,0.3407,-1.8587,-1.89,-1.8375,-1.855,0.0143,-0.003,-0.0088,1.89,0.0525,0.0927,0.0237,0.1272,0.0904,0.0239,-0.0103,-0.0083,0.1272,0.1036,0.1497,0.0877,0.1979,0.1503,0.0237,0.002,0.0015,0.1979,0.1102,9.8032,9.7702,9.846,9.8031,0.0156,-0.0005,-0.0002,9.846,0.0759,1.9396,1.9046,1.9829,1.9375,0.0175,0.0045,0.0083,1.9829,0.0782
7,0.4169,0.412,0.4233,0.4166,0.0026,-0.0006,-0.0,0.4233,0.0113,-0.274,-0.2872,-0.2681,-0.2738,0.0043,-0.0017,-0.0012,0.2872,0.0191,-9.79,-9.7944,-9.7836,-9.7903,0.0031,0.0007,0.0009,9.7944,0.0108,-0.5536,-0.5703,-0.5223,-0.5523,0.0119,0.0095,0.0075,0.5703,0.048,-1.8617,-1.8812,-1.8375,-1.8638,0.01,-0.0049,0.0,1.8812,0.0437,0.0824,0.0657,0.1047,0.0822,0.0085,0.0071,0.0083,0.1047,0.039,0.1517,0.14,0.1616,0.1518,0.0044,-0.0017,-0.0018,0.1616,0.0216,9.8027,9.7965,9.8071,9.8029,0.0031,-0.0007,-0.0007,9.8071,0.0106,1.9441,1.9207,1.9626,1.9458,0.0115,0.0024,0.0009,1.9626,0.0419
8,0.4162,0.4113,0.4196,0.4166,0.0023,0.0012,0.0009,0.4196,0.0083,-0.2757,-0.2813,-0.2723,-0.275,0.0027,0.0003,-0.0003,0.2813,0.009,-9.7893,-9.7932,-9.7861,-9.7894,0.002,-0.0003,-0.0001,9.7932,0.0071,-0.5442,-0.5673,-0.5133,-0.5448,0.0123,0.0003,0.0026,0.5673,0.054,-1.8667,-1.8812,-1.8462,-1.8638,0.008,-0.0013,-0.0022,1.8812,0.035,0.0894,0.0642,0.1062,0.0905,0.0099,-0.0033,-0.0053,0.1062,0.042,0.15,0.1404,0.1558,0.15,0.0038,-0.0002,-0.0009,0.1558,0.0155,9.802,9.7989,9.8057,9.8022,0.002,0.0003,0.0001,9.8057,0.0069,1.9465,1.9234,1.9642,1.9467,0.0088,0.001,0.0009,1.9642,0.0408
10,0.4187,0.4157,0.4213,0.4185,0.0018,-0.0022,-0.0012,0.4213,0.0056,-0.2752,-0.2771,-0.2735,-0.2756,0.0014,-0.0001,0.0006,0.2771,0.0036,-9.7898,-9.7945,-9.7858,-9.7895,0.0034,0.0016,0.0011,9.7945,0.0087,-0.5436,-0.5673,-0.5313,-0.5395,0.0131,0.0036,-0.003,0.5673,0.036,-1.8692,-1.8812,-1.8638,-1.8681,0.0065,-0.0033,0.0,1.8812,0.0175,0.0829,0.0687,0.1032,0.0799,0.012,0.0047,0.0098,0.1032,0.0345,0.1496,0.146,0.1565,0.1482,0.0041,-0.0009,0.0002,0.1565,0.0105,9.8026,9.7984,9.8074,9.8023,0.0034,-0.0017,-0.0011,9.8074,0.0089,1.9485,1.9392,1.9594,1.9484,0.0077,0.0023,-0.0011,1.9594,0.0202
11,0.4165,0.4118,0.4195,0.4173,0.0024,0.0063,0.0056,0.4195,0.0077,-0.2753,-0.2783,-0.2729,-0.275,0.0018,0.0174,-0.0162,0.2783,0.0054,-9.7882,-9.7904,-9.7854,-9.7884,0.0016,-0.0033,0.0018,9.7904,0.005,-0.5401,-0.5478,-0.5298,-0.5425,0.0062,-0.0599,-0.0833,0.5478,0.018,-1.8725,-1.89,-1.8638,-1.8681,0.0105,0.0126,0.0088,1.89,0.0262,0.0876,0.0717,0.1032,0.0897,0.0123,0.0221,0.018,0.1032,0.0315,0.1487,0.1458,0.1521,0.1484,0.0022,-0.0,0.0027,0.1521,0.0063,9.801,9.7981,9.8033,9.8011,0.0017,0.0035,-0.002,9.8033,0.0052,1.9508,1.9402,1.9678,1.9473,0.011,0.0104,0.0115,1.9678,0.0277
12,0.4229,0.3569,0.4747,0.4229,0.0352,-0.0003,-0.0128,0.4747,0.1178,-0.258,-0.392,-0.1418,-0.2911,0.0855,-0.0067,0.0341,0.392,0.2501,-9.7915,-9.8631,-9.7409,-9.7866,0.0315,0.0007,0.0102,9.8631,0.1222,-0.5999,-0.7984,-0.4038,-0.6258,0.1186,0.1118,0.1411,0.7984,0.3947,-1.8599,-1.925,-1.8025,-1.8594,0.0334,-0.0191,-0.0131,1.925,0.1225,0.1097,0.0521,0.1736,0.1077,0.0361,-0.0087,0.0046,0.1736,0.1214,0.1487,0.0923,0.2081,0.1511,0.0407,-0.023,-0.026,0.2081,0.1158,9.8044,9.7561,9.8717,9.7991,0.0301,-0.0005,-0.0097,9.8717,0.1156,1.9613,1.9281,1.9849,1.9588,0.0146,-0.0129,-0.0067,1.9849,0.0568
13,0.4225,0.2827,0.5183,0.4101,0.0655,-0.0004,0.0166,0.5183,0.2356,-0.2646,-0.4009,-0.1143,-0.257,0.0713,0.0062,0.0051,0.4009,0.2866,-9.7908,-9.8608,-9.7312,-9.7764,0.0418,0.0002,-0.0134,9.8608,0.1295,-0.4881,-0.6844,-0.3077,-0.4847,0.1131,-0.087,-0.0901,0.6844,0.3767,-1.8791,-1.9338,-1.8375,-1.8725,0.0354,0.0292,0.0175,1.9338,0.0962,0.101,-0.0258,0.2262,0.1123,0.0685,0.0004,-0.0121,0.2262,0.252,0.1256,0.0715,0.1857,0.1251,0.0345,0.022,0.0185,0.1857,0.1142,9.804,9.7481,9.8655,9.7894,0.0397,-0.0008,0.0133,9.8655,0.1174,1.9483,1.9037,2.012,1.9521,0.0307,-0.0062,-0.0049,2.012,0.1083
14,0.4221,0.3533,0.4947,0.4266,0.0336,-0.004,-0.009,0.4947,0.1413,-0.2584,-0.3507,-0.2088,-0.2519,0.0353,0.0016,0.0003,0.3507,0.1418,-9.7906,-9.9566,-9.6209,-9.7898,0.0551,-0.0028,-0.0172,9.9566,0.3356,-0.5752,-0.8134,-0.4413,-0.5748,0.0886,0.0415,0.0157,0.8134,0.3721,-1.8499,-1.8988,-1.7762,-1.855,0.0279,-0.0259,-0.0219,1.8988,0.1225,0.1014,0.0597,0.1738,0.1002,0.0284,-0.0074,-0.012,0.1738,0.114,0.1477,0.0922,0.2121,0.1436,0.0244,-0.0111,-0.0062,0.2121,0.12,9.8032,9.6378,9.967,9.8027,0.0535,0.0026,0.0159,9.967,0.3292,1.9421,1.8979,1.9743,1.9471,0.0194,0.0113,0.0024,1.9743,0.0764
15,0.4181,0.3651,0.465,0.4177,0.0405,0.003,0.0015,0.465,0.0999,-0.2568,-0.2926,-0.231,-0.2516,0.0195,-0.001,-0.006,0.2926,0.0616,-9.7934,-9.8327,-9.7471,-9.807,0.0321,0.002,0.0136,9.8327,0.0856,-0.5337,-0.5898,-0.4562,-0.559,0.0602,-0.0189,0.0045,0.5898,0.1336,-1.8758,-1.8988,-1.855,-1.8769,0.0132,0.0153,0.0131,1.8988,0.0437,0.094,0.0567,0.1467,0.0882,0.0292,-0.0025,-0.0,0.1467,0.09,0.1366,0.1153,0.1537,0.1374,0.014,0.0059,0.0016,0.1537,0.0383,9.8058,9.7625,9.8426,9.8186,0.0302,-0.0019,-0.0128,9.8426,0.08,1.9535,1.9308,1.9843,1.9496,0.0197,-0.0104,-0.009,1.9843,0.0535
16,0.4211,0.4024,0.4416,0.4192,0.0123,0.0006,0.0045,0.4416,0.0392,-0.2578,-0.2753,-0.24,-0.2576,0.0126,0.0047,0.0153,0.2753,0.0353,-9.7914,-9.8056,-9.7753,-9.7934,0.0105,-0.0012,-0.0134,9.8056,0.0303,-0.5527,-0.5733,-0.5208,-0.5545,0.0202,-0.0195,-0.0315,0.5733,0.0525,-1.8605,-1.8812,-1.8462,-1.8638,0.0132,0.0142,0.0219,1.8812,0.035,0.0916,0.0792,0.1047,0.0882,0.0094,0.0049,0.003,0.1047,0.0255,0.1425,0.1314,0.1574,0.1389,0.0092,0.0005,0.0038,0.1574,0.0259,9.8039,9.7881,9.8175,9.8058,0.0101,0.0012,0.0128,9.8175,0.0294,1.9431,1.9234,1.9681,1.9406,0.0142,-0.0061,-0.0048,1.9681,0.0447
17,0.4217,0.3856,0.4658,0.4237,0.0234,-0.0109,0.0022,0.4658,0.0802,-0.2531,-0.3172,-0.2088,-0.2424,0.0387,-0.0721,-0.1152,0.3172,0.1083,-9.7926,-9.8241,-9.7508,-9.8068,0.0296,0.0066,0.0437,9.8241,0.0733,-0.5722,-0.6798,-0.4382,-0.5861,0.0815,0.2345,0.31,0.6798,0.2416,-1.8462,-1.8812,-1.8288,-1.8419,0.0204,-0.0295,-0.0437,1.8812,0.0525,0.0964,0.0732,0.1392,0.0912,0.0206,-0.4116,-0.326,0.1392,0.066,0.1429,0.1163,0.1683,0.1427,0.0173,-0.0584,-0.0969,0.1683,0.052,9.8051,9.766,9.8343,9.8186,0.028,-0.0019,-0.0415,9.8343,0.0682,1.9369,1.9234,1.9624,1.9358,0.0123,0.144,0.0474,1.9624,0.039
18,0.4108,0.0931,0.5803,0.4259,0.1219,-0.3745,-0.2797,0.5803,0.4872,-0.3252,-0.736,0.0868,-0.3575,0.2222,2.671,3.0657,0.736,0.8228,-9.786,-9.9644,-9.6829,-9.7631,0.0814,0.1702,0.2217,9.9644,0.2814,-0.3376,-2.3438,0.6534,-0.2761,0.6851,3.757,8.6777,2.3438,2.9972,-1.8758,-2.1613,-1.5138,-1.8856,0.1435,-2.6853,-3.4694,2.1613,0.6475,-0.3152,-1.2247,0.2053,-0.2349,0.4626,20.4615,10.026,1.2247,1.43,0.0846,-0.2987,0.8471,0.0458,0.2514,4.2454,12.7108,0.8471,1.1458,9.8031,9.7042,9.9721,9.7771,0.0801,0.167,0.2684,9.9721,0.2679,2.081,1.8695,2.8008,1.9832,0.2559,35.5476,35.6014,2.8008,0.9313
19,0.0363,-0.9881,0.6276,0.1462,0.4233,0.1988,0.0609,0.9881,1.6157,2.3459,-0.2914,3.989,2.7081,1.1753,-1.2156,-1.4691,3.989,4.2804,-9.6158,-11.0855,-8.368,-9.5414,0.6072,-0.1003,-0.0685,11.0855,2.7174,3.4193,-42.6845,27.1285,8.4016,19.9145,-4.3766,-8.2023,42.6845,69.813,-4.5611,-11.8738,5.2675,-5.355,5.7654,-2.9494,-2.1437,11.8738,17.1413,20.1463,-21.867,64.0255,9.7912,31.0036,19.6768,30.1855,64.0255,85.8925,4.33,-158.238,81.932,12.7566,58.7427,-6.4741,-10.558,158.238,240.17,9.9701,8.378,11.1696,10.0455,0.6606,-0.1059,-0.267,11.1696,2.7916,37.6286,5.0333,65.0029,37.5845,19.3497,4.7879,4.8814,65.0029,59.9696
20,0.2351,-0.9439,1.6536,0.2071,0.7407,0.2166,0.0759,1.6536,2.5975,1.1303,-1.0311,2.9184,1.239,1.0478,0.2939,-0.2085,2.9184,3.9495,-9.716,-10.9217,-8.8459,-9.61,0.5557,0.022,-0.0269,10.9217,2.0758,-0.9573,-19.9366,16.1706,0.1993,12.0311,-3.4009,-2.8241,19.9366,36.1072,-7.5105,-10.1413,-4.5325,-7.4988,1.3938,5.0715,5.3769,10.1413,5.6088,39.8231,22.8242,62.0367,39.9767,11.1584,-35.7283,-39.0955,62.0367,39.2125,-2.1441,-50.097,22.3469,2.1986,19.8028,-4.6088,-3.0616,50.097,72.444,9.8642,8.965,11.0712,9.7784,0.5704,0.061,0.2101,11.0712,2.1062,42.4165,25.6341,62.833,42.466,10.4406,-32.9332,-37.555,62.833,37.199
21,0.4517,-0.6964,2.3926,0.2831,0.9336,-0.1549,0.0537,2.3926,3.089,1.4241,-1.2608,4.7915,1.0305,1.2422,0.8237,1.0825,4.7915,6.0523,-9.6941,-10.4545,-8.5751,-9.6369,0.4379,0.0486,0.0352,10.4545,1.8794,-4.3582,-28.7403,5.4002,-2.6249,9.0282,-4.1668,-7.5986,28.7403,34.1405,-2.4391,-5.0575,-1.6625,-2.1219,0.9217,0.77,0.5469,5.0575,3.395,4.0948,-2.5911,41.1668,0.8812,9.7351,-2.8333,0.0593,41.1668,43.758,-6.753,-84.3983,22.9247,-0.863,20.23,-12.6288,-19.0465,84.3983,107.3231,9.9252,8.9797,10.8071,9.9885,0.4522,0.0053,-0.1236,10.8071,1.8274,9.4833,2.3196,45.258,4.911,11.261,-0.4422,5.5205,45.258,42.9384
22,0.2968,0.0501,0.4442,0.3368,0.1324,-0.2992,-0.2447,0.4442,0.3941,2.2479,1.1466,3.5169,2.113,0.6919,-0.0524,0.0937,3.5169,2.3703,-9.6455,-10.0593,-9.3578,-9.6017,0.2171,0.1567,0.1141,10.0593,0.7015,-8.525,-11.6051,-1.0805,-10.2235,3.7053,9.4066,11.8761,11.6051,10.5246,-1.6691,-2.0125,-1.3475,-1.575,0.2451,-2.6425,-2.8569,2.0125,0.665,1.2615,-0.9707,4.0953,0.9405,1.6907,8.5371,9.8764,4.0953,5.066,-19.3818,-36.1806,-2.0801,-19.9095,10.7605,22.086,23.2977,36.1806,34.1004,9.9305,9.7314,10.3077,9.8648,0.2047,-0.1778,-0.0909,10.3077,0.5762,9.0411,1.8674,11.7234,10.4315,3.36,2.2771,1.6164,11.7234,9.856
23,-0.0023,-0.5293,0.3432,0.0921,0.3557,0.2299,0.1147,0.5293,0.8725,2.1954,1.6103,2.7868,2.2066,0.4059,0.0533,0.1762,2.7868,1.1765,-9.4888,-9.6625,-9.3135,-9.4876,0.1379,-0.0098,0.0286,9.6625,0.349,0.8816,-3.3295,4.9601,1.6527,3.4948,7.5716,6.3503,4.9601,8.2896,-4.3116,-4.8125,-3.535,-4.4319,0.4605,-1.423,-1.1025,4.8125,1.2775,9.7986,6.2367,12.3319,10.8169,2.391,8.2167,6.9141,12.3319,6.0953,2.7042,-7.3948,12.9857,3.3882,8.14,16.3114,16.1162,12.9857,20.3805,9.7528,9.5726,9.9272,9.774,0.114,0.0195,0.0237,9.9272,0.3546,11.3182,8.7175,13.4494,12.0479,1.898,9.5226,8.1484,13.4494,4.7319
24,0.2276,0.1422,0.4005,0.2067,0.0909,-0.3017,-0.2929,0.4005,0.2583,2.2487,1.3686,2.7575,2.3829,0.4343,-1.5288,-1.5969,2.7575,1.3889,-9.4986,-9.689,-9.3701,-9.459,0.1279,-0.149,-0.1694,9.689,0.3189,8.4532,7.8374,10.2794,8.003,0.8297,3.206,4.516,10.2794,2.4421,-5.7345,-6.6325,-5.1363,-5.5344,0.5549,3.4377,3.22,6.6325,1.4962,18.0153,11.4847,23.2165,17.731,4.1621,-8.5764,-8.5079,23.2165,11.7318,19.0157,10.8891,24.4761,19.5044,4.058,-9.9126,-8.211,24.4761,13.587,9.7723,9.4752,10.0048,9.7976,0.1538,-0.0884,-0.1551,10.0048,0.5296,20.8408,16.2464,25.4225,20.1963,3.4779,-5.0323,-4.4577,25.4225,9.1761
25,-0.0741,-0.6264,0.3163,-0.0862,0.2884,-0.2867,-0.2483,0.6264,0.9426,0.72,0.1711,1.1956,0.786,0.3634,-0.6602,-0.3363,1.1956,1.0245,-9.6476,-10.7307,-8.3024,-9.6283,0.765,-0.1127,-0.1948,10.7307,2.4283,11.6592,5.6239,15.8745,12.519,3.3537,-8.0979,-9.0342,15.8745,10.2506,-2.2969,-2.9313,-1.7675,-2.3144,0.3671,0.5677,0.56,2.9313,1.1637,9.4389,5.4306,14.9347,9.2231,3.403,7.2347,7.1606,14.9347,9.504,9.1031,0.9625,13.9819,11.2934,5.2033,-9.6728,-10.6097,13.9819,13.0194,9.6839,8.3293,10.7783,9.6425,0.7719,0.1865,0.2345,10.7783,2.449,15.8085,14.9878,16.9311,15.7386,0.7491,1.8334,1.6282,16.9311,1.9433
26,-0.3608,-2.1141,2.0707,-0.3345,1.0876,-0.0174,-0.0429,2.1141,4.1848,0.0598,-2.0113,1.5499,0.4497,0.9998,1.0478,1.1092,2.0113,3.5611,-9.7603,-10.1213,-9.1866,-9.8232,0.2955,0.0758,0.1954,10.1213,0.9347,3.5614,-3.7101,11.2151,3.4848,3.8951,-13.4867,-13.0208,11.2151,14.9252,-1.7292,-2.1088,-1.2512,-1.7544,0.2424,0.1152,0.1094,2.1088,0.8575,16.6736,10.6082,27.0882,16.3837,4.3778,-19.432,-18.8459,27.0882,16.4801,-0.5697,-14.4426,5.2006,0.6837,5.2644,-9.6805,-11.4854,14.4426,19.6432,9.8704,9.3241,10.5014,9.877,0.3266,0.036,0.0365,10.5014,1.1772,17.6419,12.4647,27.407,17.3668,3.9588,-6.0104,-6.7576,27.407,14.9423
27,-0.3782,-2.226,1.5336,-0.3774,0.9483,0.139,0.1175,2.226,3.7597,1.1076,-1.5906,3.2057,1.5589,1.4821,0.5359,0.3661,3.2057,4.7963,-9.6845,-10.4508,-8.696,-9.6278,0.4319,0.0397,0.0044,10.4508,1.7547,-9.9253,-17.1582,-2.7489,-9.536,4.0408,3.7282,3.5475,17.1582,14.4093,-1.614,-2.6425,0.0088,-1.645,0.5546,-0.1817,-0.1575,2.6425,2.6512,-2.7584,-12.1583,4.7571,-2.4623,4.9285,3.1353,3.1876,12.1583,16.9153,-10.2502,-50.1734,22.2931,-10.8017,17.1469,2.3793,2.8648,50.1734,72.4665,9.9064,9.0661,10.8123,9.9135,0.4185,-0.0239,-0.0104,10.8123,1.7462,11.6315,5.9127,17.393,10.6092,3.6338,-3.3676,-2.9081,17.393,11.4803
29,-0.1002,-0.4205,0.2638,-0.1423,0.2365,-0.1231,-0.0813,0.4205,0.6843,2.1794,1.4721,2.5636,2.291,0.3848,-1.1499,-1.3413,2.5636,1.0915,-9.6051,-9.678,-9.5349,-9.6189,0.0478,-0.1047,-0.0991,9.678,0.1431,-2.4689,-4.2615,-0.978,-2.4409,1.1195,7.121,8.1901,4.2615,3.2835,-1.9775,-2.065,-1.925,-1.96,0.051,0.0612,0.0569,2.065,0.14,3.5121,1.9616,4.3379,3.9128,0.9023,-2.174,-2.654,4.3379,2.3763,-5.4917,-9.7185,-2.3982,-5.0722,2.9276,10.844,10.2698,9.7185,7.3202,9.8585,9.7277,9.9521,9.8927,0.09,-0.0857,-0.118,9.9521,0.2244,4.8962,4.3756,5.6067,4.7931,0.4523,0.5312,1.5064,5.6067,1.2311
30,-0.2233,-0.2705,-0.1589,-0.2236,0.035,0.0836,-0.0555,0.2705,0.1116,1.0295,0.608,1.566,0.9497,0.3672,1.3846,0.2884,1.566,0.9581,-9.7097,-9.8273,-9.5907,-9.718,0.0985,0.2879,0.2832,9.8273,0.2365,4.6522,0.0757,7.1813,5.7492,2.6526,-15.4649,-17.3487,7.1813,7.1056,-1.9163,-1.995,-1.8288,-1.9031,0.0567,0.2209,0.21,1.995,0.1663,1.3381,0.9523,1.9127,1.2588,0.3243,-1.7906,-2.0401,1.9127,0.9604,5.3523,0.0637,10.0646,5.1976,4.0903,-39.5978,-7.7041,10.0646,10.0008,9.7728,9.6569,9.9039,9.7746,0.0952,0.3351,-0.1658,9.9039,0.247,5.4274,2.2456,7.4966,6.2995,2.1112,7.4547,5.7795,7.4966,5.251
31,-0.1397,-0.7637,0.596,-0.279,0.5464,0.0297,0.1402,0.7637,1.3597,2.4141,-0.3674,7.7692,1.2381,3.0367,1.3649,2.7967,7.7692,8.1366,-9.4218,-9.6472,-9.2267,-9.4348,0.1434,0.388,0.4027,9.6472,0.4204,-10.8128,-24.9544,4.6824,-11.5995,11.2353,31.1777,30.0136,24.9544,29.6367,-1.6953,-1.8113,-1.61,-1.6931,0.076,-0.0405,-0.0306,1.8113,0.2013,-0.4525,-4.1377,3.0528,-0.7813,2.2747,0.7935,0.8629,4.1377,7.1905,-34.2455,-133.1516,6.66,-2.5065,54.1208,106.7021,67.9088,133.1516,139.8116,10.1079,9.4344,12.0907,9.6088,0.9539,-0.2653,0.2729,12.0907,2.6563,12.8821,2.3923,25.0408,12.079,8.8822,7.574,6.4221,25.0408,22.6485
32,-0.11,-0.2232,0.0607,-0.1388,0.0876,0.0987,0.116,0.2232,0.2839,3.7791,1.2914,5.1804,4.0348,1.017,-1.6424,-1.9996,5.1804,3.8891,-9.0338,-9.4059,-8.7494,-9.0321,0.1938,-0.4974,-0.5017,9.4059,0.6564,20.365,10.8135,28.9326,18.4141,6.1643,-26.5034,-25.1157,28.9326,18.1191,-1.7358,-1.8288,-1.645,-1.7238,0.0545,-0.0973,-0.105,1.8288,0.1837,0.341,-0.3598,1.8325,0.0816,0.6653,0.1446,0.5712,1.8325,2.1924,72.4566,34.2363,101.0258,65.4023,18.489,-85.6026,-78.9278,101.0258,66.7894,9.8427,9.4947,10.17,9.8817,0.1988,-0.0716,-0.1263,10.17,0.6753,20.456,10.9404,29.0035,18.5011,6.1495,-14.004,-11.5015,29.0035,18.0631
33,-0.0113,-0.0749,0.0696,-0.0228,0.0532,-0.0558,-0.04,0.0749,0.1445,2.1367,1.7892,2.6282,2.0352,0.2715,0.6862,0.8608,2.6282,0.839,-9.5312,-9.57,-9.4829,-9.5338,0.0301,0.1442,0.149,9.57,0.087,-6.1384,-7.8336,-3.9677,-6.7015,1.4702,3.957,4.5196,7.8336,3.8659,-1.8331,-1.89,-1.7762,-1.8287,0.0353,-0.0055,-0.0088,1.89,0.1137,0.4855,-0.5087,1.0114,0.6528,0.4954,-0.4398,-0.6086,1.0114,1.5201,-13.146,-16.9919,-7.9325,-13.5255,3.5641,6.9696,7.1606,16.9919,9.0594,9.7711,9.6978,9.8967,9.7553,0.0602,0.0322,0.0534,9.8967,0.1989,6.4521,4.3482,8.0627,6.9996,1.4158,-3.5889,-4.1398,8.0627,3.7145
34,-0.0671,-0.097,-0.0421,-0.0628,0.0194,-0.0356,-0.0462,0.097,0.0549,2.8229,2.6007,2.9394,2.896,0.1377,0.1494,0.0628,2.9394,0.3387,-9.387,-9.4289,-9.3513,-9.3848,0.0271,0.0249,0.0168,9.4289,0.0776,-2.1814,-2.593,-1.5486,-2.1819,0.3397,2.2316,2.3702,2.593,1.0444,-1.8386,-1.8638,-1.8112,-1.8375,0.0184,-0.0285,-0.035,1.8638,0.0525,0.0457,-0.1187,0.2387,0.0443,0.1158,0.0249,0.0287,0.2387,0.3574,-6.1764,-7.5799,-4.0654,-6.3649,1.1004,6.3893,6.9185,7.5799,3.5145,9.8033,9.7453,9.8668,9.8087,0.0405,0.0211,0.0158,9.8668,0.1215,2.8632,2.4175,3.1904,2.8597,0.2534,-0.7058,-0.8502,3.1904,0.7729
35,-0.1028,-0.1456,-0.0391,-0.1091,0.0314,-0.0159,0.0125,0.1456,0.1065,2.9723,2.6408,3.3002,2.9588,0.1691,-0.4238,-0.4883,3.3002,0.6594,-9.3621,-9.3915,-9.3112,-9.3681,0.0209,-0.0596,-0.0622,9.3915,0.0804,0.0502,-1.7091,3.2232,0.1883,1.1686,5.0209,5.0473,3.2232,4.9323,-1.8671,-1.8988,-1.8113,-1.8725,0.0195,0.0515,0.0569,1.8988,0.0875,0.0706,-0.197,0.4168,0.0729,0.1502,-0.0286,-0.0177,0.4168,0.6138,0.2128,-5.0299,10.6373,0.5536,3.6237,12.963,13.6971,10.6373,15.6672,9.8245,9.7345,9.9517,9.8245,0.0537,-0.0556,-0.0798,9.9517,0.2172,2.1573,1.8246,3.7325,2.0095,0.4264,3.2472,3.5345,3.7325,1.9079
36,-0.1187,-0.206,-0.0651,-0.0965,0.0526,-0.026,-0.0599,0.206,0.141,2.5485,1.9562,3.2422,2.4705,0.422,0.5431,0.6933,3.2422,1.286,-9.4218,-9.4527,-9.3772,-9.4303,0.0293,0.0393,0.0743,9.4527,0.0755,5.0711,2.8827,6.4483,5.2355,1.2399,0.8054,-1.7773,6.4483,3.5656,-1.8156,-1.8375,-1.7938,-1.8156,0.014,0.0029,0.0044,1.8375,0.0438,0.042,-0.1985,0.1882,0.0552,0.1326,-0.1158,-0.1427,0.1985,0.3867,13.1759,5.6391,17.7886,14.2507,4.3664,3.4705,-2.2711,17.7886,12.1495,9.7689,9.6519,9.9221,9.7447,0.0857,0.1154,0.141,9.9221,0.2702,5.4046,3.3999,6.7079,5.544,1.1544,1.8278,-1.2231,6.7079,3.308
37,-0.1447,-0.2331,-0.0716,-0.1564,0.0456,0.0854,0.0864,0.2331,0.1615,3.0915,2.3362,3.524,3.1638,0.3046,-3.2746,-3.6739,3.524,1.1878,-9.3824,-9.568,-9.3232,-9.356,0.0652,-0.3222,-0.3708,9.568,0.2448,5.8765,-3.5936,19.9312,3.4583,7.2231,9.299,14.2073,19.9312,23.5247,-1.8127,-1.8988,-1.7063,-1.8113,0.0518,0.2012,0.2362,1.8988,0.1925,-0.0738,-0.628,0.7224,-0.0874,0.3901,0.1389,0.0006,0.7224,1.3504,16.6464,-12.4209,48.1716,11.9796,19.6471,-14.2635,-16.3128,48.1716,60.5925,9.8842,9.7279,9.9961,9.8858,0.0764,-0.1318,-0.1209,9.9961,0.2681,7.2323,1.8146,20.0142,4.3209,6.1006,8.1401,13.4576,20.0142,18.1996
38,-0.0593,-0.1997,0.0664,-0.07,0.0743,-0.0219,-0.0131,0.1997,0.2662,-0.1831,-1.669,1.6247,-0.5101,0.9625,-0.5281,-0.158,1.669,3.2936,-9.7046,-9.9434,-9.4356,-9.7268,0.1187,-0.0526,-0.0148,9.9434,0.5078,15.1755,4.6197,24.2967,17.6656,8.1754,-16.2086,-18.6488,24.2967,19.677,-1.6115,-1.9513,-1.3738,-1.575,0.1652,-0.2906,-0.3281,1.9513,0.5775,0.0651,-1.7287,1.7807,-0.0868,1.179,-0.5417,-0.5277,1.7807,3.5094,2.3829,-26.24,36.8084,-4.3332,16.7165,-1.5893,4.8079,36.8084,63.0483,9.7524,9.45,9.9628,9.7649,0.1182,0.0341,0.0236,9.9628,0.5129,15.3724,4.9976,24.3553,17.7785,8.0432,-12.8579,-15.34,24.3553,19.3577
39,-0.0812,-0.2082,0.0317,-0.0831,0.0893,0.0627,0.058,0.2082,0.2398,-0.7111,-1.1059,-0.4213,-0.6681,0.2484,0.0295,0.0084,1.1059,0.6846,-9.7572,-9.8738,-9.6505,-9.7416,0.1041,-0.0103,-0.0264,9.8738,0.2233,-1.0331,-2.6766,0.4263,-0.9832,1.2842,-1.4364,-1.4899,2.6766,3.1029,-1.902,-1.9688,-1.8025,-1.9031,0.0584,0.0153,0.0219,1.9688,0.1663,-0.4765,-1.196,0.2819,-0.6145,0.5005,0.4474,0.532,1.196,1.4779,0.7936,-0.3459,2.6696,0.4747,1.0995,0.8953,1.1754,2.6696,3.0155,9.7866,9.6845,9.889,9.7885,0.1007,0.005,0.0017,9.889,0.2045,2.5145,1.9461,3.3826,2.4385,0.5392,0.598,0.6679,3.3826,1.4365
40,-0.0185,-0.052,0.038,-0.0252,0.0329,-0.1,-0.1185,0.052,0.09,-0.6816,-0.8132,-0.6062,-0.6597,0.0714,0.5272,0.4778,0.8132,0.207,-9.7675,-9.7879,-9.7343,-9.7679,0.0166,-0.0262,-0.0212,9.7879,0.0536,-2.4694,-2.6832,-2.2539,-2.4731,0.1604,-0.7118,-0.6138,2.6832,0.4293,-1.8867,-1.925,-1.855,-1.8812,0.0209,-0.0164,-0.0175,1.925,0.07,-0.0291,-0.1515,0.273,-0.0826,0.1511,0.1759,0.2269,0.273,0.4245,1.6889,1.4167,2.0536,1.6501,0.2559,-1.1629,-1.03,2.0536,0.6369,9.7916,9.7644,9.8218,9.7902,0.0172,0.0045,0.0017,9.8218,0.0574,3.1125,2.9371,3.2747,3.1064,0.1256,0.6191,0.5228,3.2747,0.3375
41,-0.1185,-0.1659,0.0166,-0.1436,0.0606,-0.0949,-0.0923,0.1659,0.1825,-0.1544,-0.2268,-0.0174,-0.1819,0.0741,0.0279,0.1661,0.2268,0.2094,-9.7937,-9.8113,-9.7748,-9.7891,0.0121,0.0077,-0.0002,9.8113,0.0365,-3.1812,-4.3367,-2.0771,-3.0869,0.715,0.8657,0.6183,4.3367,2.2596,-1.9031,-1.9338,-1.8725,-1.8988,0.0193,-0.047,-0.0569,1.9338,0.0613,0.1467,-0.1048,0.4159,0.1444,0.2083,1.2839,1.1588,0.4159,0.5206,0.5259,0.036,0.8706,0.6201,0.2906,0.0302,-0.4363,0.8706,0.8345,9.7961,9.7784,9.814,9.7919,0.0119,-0.0017,0.0094,9.814,0.0356,3.7316,2.8273,4.7459,3.6292,0.6086,-0.0031,-0.1335,4.7459,1.9186
42,-0.2134,-0.3812,0.1632,-0.236,0.1553,0.1392,0.163,0.3812,0.5444,-0.1265,-0.5858,0.2693,-0.0159,0.2883,-0.3191,-0.4611,0.5858,0.8551,-9.7861,-9.8248,-9.7432,-9.7894,0.0221,0.0091,0.0134,9.8248,0.0816,-2.3155,-4.5762,2.062,-2.4685,1.8285,-3.6551,-4.3282,4.5762,6.6382,-1.9502,-2.0825,-1.8025,-1.9556,0.0759,0.023,0.0044,2.0825,0.28,1.4306,0.8834,2.0556,1.3032,0.3618,0.447,0.5986,2.0556,1.1723,0.5561,-0.2438,2.012,0.1838,0.7567,1.6029,2.2498,2.012,2.2558,9.7944,9.7555,9.8322,9.8013,0.0226,-0.002,-0.0153,9.8322,0.0767,3.7285,2.8023,5.1492,3.4957,0.781,2.8764,3.8302,5.1492,2.3469
43,-0.0742,-0.1231,-0.0249,-0.073,0.0304,-0.0153,-0.0125,0.1231,0.0982,-0.4456,-0.8055,0.0664,-0.4769,0.3314,1.1803,1.195,0.8055,0.8719,-9.777,-9.8129,-9.7412,-9.776,0.024,-0.0143,-0.0149,9.8129,0.0717,-5.9706,-7.7969,-2.4712,-6.7967,2.0017,4.637,5.291,7.7969,5.3257,-1.9272,-2.0037,-1.8288,-1.9512,0.069,0.0602,0.0744,2.0037,0.175,1.8776,1.802,1.9685,1.9018,0.0598,-1.9261,-1.9922,1.9685,0.1664,2.159,-0.4933,3.6774,2.4335,1.4498,-3.1488,-3.6844,3.6774,4.1707,9.7923,9.7494,9.8348,9.786,0.028,0.0274,0.0265,9.8348,0.0854,6.6049,3.6162,8.2692,7.3259,1.7812,-3.6153,-4.6044,8.2692,4.6529
44,-0.0895,-0.145,-0.0475,-0.0855,0.0289,0.0411,0.0146,0.145,0.0975,0.7347,0.5834,0.915,0.7181,0.0999,-1.6435,-1.5056,0.915,0.3315,-9.7913,-9.8785,-9.7202,-9.7909,0.0682,0.0732,0.0606,9.8785,0.1583,-1.3336,-4.4283,1.9989,-1.5057,2.2921,6.5296,6.3648,4.4283,6.4272,-1.867,-1.9425,-1.7675,-1.8769,0.0516,-0.0671,0.1225,1.9425,0.175,-0.0485,-0.2347,0.1452,-0.0904,0.1483,-1.131,-1.2837,0.2347,0.3799,-0.9898,-3.1137,1.1663,-1.2508,1.5546,-2.1709,3.1049,3.1137,4.28,9.8197,9.7483,9.9108,9.8125,0.0669,-0.0129,-0.0474,9.9108,0.1624,2.9896,1.8603,4.8361,2.7215,1.0405,6.2761,5.165,4.8361,2.9758
45,-0.0484,-0.2197,0.2303,-0.0709,0.1093,-0.0529,-0.0759,0.2303,0.4499,-0.9088,-2.5947,0.465,-0.7875,0.9667,0.0502,-0.0063,2.5947,3.0597,-9.7181,-9.8098,-9.523,-9.7303,0.0669,-0.0297,0.0325,9.8098,0.2868,5.1959,-8.6225,16.7527,4.859,8.8815,-5.881,-5.5113,16.7527,25.3752,-1.9341,-2.6512,-1.645,-1.7544,0.3436,-0.5126,-0.7612,2.6512,1.0062,-1.1795,-3.547,0.6542,-1.3741,1.1752,-2.278,-2.2275,3.547,4.2012,-3.1607,-29.223,12.7917,1.854,11.4324,3.6048,-1.3164,29.223,42.0147,9.8068,9.6792,10.0985,9.7651,0.1048,-0.0152,0.0057,10.0985,0.4192,9.2658,2.0152,16.9743,7.8865,4.9504,-4.8348,-3.1945,16.9743,14.9591
46,-0.1013,-0.2129,0.1982,-0.1468,0.1357,-0.0584,-0.0059,0.2129,0.4111,-0.8586,-1.4266,-0.453,-0.7938,0.3246,2.3283,2.1336,1.4266,0.9736,-9.7478,-10.0931,-9.6347,-9.6978,0.1561,0.0415,-0.0075,10.0931,0.4584,-0.6851,-2.361,1.0059,-0.6522,1.1366,-5.4802,-10.4992,2.361,3.3669,-2.4467,-2.6775,-2.0912,-2.5156,0.2341,0.4339,0.5031,2.6775,0.5862,-3.4575,-4.757,-1.5664,-3.6016,0.9767,6.2508,6.3615,4.757,3.1906,0.4441,-1.435,1.9399,0.5377,1.0772,-7.3488,-11.1729,1.9399,3.3749,9.7916,9.6527,10.1079,9.7709,0.1533,0.0428,0.0506,10.1079,0.4552,4.4309,2.6433,5.3399,4.692,0.9501,6.8772,7.5171,5.3399,2.6966
47,-0.1596,-0.6003,0.3276,-0.1527,0.2369,0.0776,0.1081,0.6003,0.9279,1.4697,0.5272,2.6121,1.3398,0.5314,-1.7733,-1.5801,2.6121,2.0849,-9.7063,-9.7961,-9.6322,-9.7053,0.0478,-0.0422,-0.0346,9.7961,0.1639,-6.1653,-18.2237,8.3455,-11.1515,10.0721,15.189,24.0298,18.2237,26.5692,-2.0129,-2.1525,-1.82,-2.0125,0.0893,0.2373,0.2319,2.1525,0.3325,2.7934,-0.9105,5.6111,2.7599,2.18,-1.082,-1.4655,5.6111,6.5216,-6.9046,-24.3623,14.3374,-10.6352,13.6887,6.4727,11.3536,24.3623,38.6997,9.8344,9.6856,10.1437,9.8214,0.0992,-0.0504,-0.0426,10.1437,0.4581,11.3081,2.4262,19.0298,12.2091,4.9806,-0.8435,1.0776,19.0298,16.6036
48,-0.082,-0.2725,0.1069,-0.0446,0.1018,-0.0791,-0.1468,0.2725,0.3795,-0.3037,-1.7013,1.1202,-0.2403,0.7808,-0.4987,-0.6511,1.7013,2.8215,-9.7485,-9.8797,-9.6513,-9.7399,0.0608,-0.013,-0.0284,9.8797,0.2284,9.0237,-3.7087,13.7553,12.8783,6.4694,-6.3802,-9.994,13.7553,17.4639,-1.7755,-2.1,-1.5225,-1.7806,0.1797,-0.1867,-0.1794,2.1,0.5775,1.7113,-0.24,3.7564,1.2945,1.4157,-3.3755,-3.2369,3.7564,3.9964,-0.432,-12.6496,13.9498,0.7184,7.2594,-1.6041,-3.0578,13.9498,26.5995,9.7839,9.698,9.9383,9.7789,0.0661,0.0132,0.0137,9.9383,0.2403,10.4647,1.7854,14.0079,13.2868,4.5751,-6.5932,-9.4956,14.0079,12.2225
49,-0.1612,-0.2645,0.005,-0.1913,0.0969,0.0482,0.1048,0.2645,0.2695,-0.8024,-0.9299,-0.5236,-0.8913,0.1502,0.1584,0.2106,0.9299,0.4063,-9.7615,-9.892,-9.6646,-9.7684,0.0756,-0.0026,0.0054,9.892,0.2274,2.6434,-0.1977,4.4029,2.8843,1.6129,-1.1967,-1.0635,4.4029,4.6006,-1.9622,-2.0213,-1.8988,-1.96,0.0379,0.0077,0.0263,2.0213,0.1225,-1.6642,-2.5708,-0.6394,-1.9424,0.6617,0.5774,0.7935,2.5708,1.9314,-2.036,-3.5721,0.1763,-2.3394,1.2631,0.9673,1.0039,3.5721,3.7483,9.7972,9.6917,9.934,9.7925,0.0795,-0.0097,-0.0104,9.934,0.2423,3.8715,2.0711,5.4654,3.7911,1.2094,-0.9758,-0.9401,5.4654,3.3943
50,-0.113,-0.2553,-0.0005,-0.0865,0.0927,0.0886,0.0738,0.2553,0.2549,-0.644,-0.8204,-0.4356,-0.6807,0.1503,0.068,0.1532,0.8204,0.3848,-9.7641,-9.8264,-9.7011,-9.763,0.0499,0.0062,0.0065,9.8264,0.1253,1.4467,-0.8906,2.4857,1.8208,1.2054,-4.1279,-4.8952,2.4857,3.3763,-1.9545,-2.0475,-1.8813,-1.9338,0.0665,-0.0306,-0.0612,2.0475,0.1662,-1.0868,-1.5724,-0.4697,-1.149,0.3512,0.6753,0.5573,1.5724,1.1027,-1.0687,-1.9233,0.4237,-1.3355,0.8866,2.9003,2.9624,1.9233,2.347,9.7874,9.7367,9.8523,9.7822,0.0458,-0.0102,-0.0046,9.8523,0.1156,2.8957,2.5299,3.3553,2.851,0.325,0.7537,0.8663,3.3553,0.8254
51,-0.0244,-0.0811,0.021,-0.0127,0.0389,-0.0589,-0.0599,0.0811,0.1022,-0.576,-0.8725,-0.2334,-0.5275,0.2205,-0.1779,-0.237,0.8725,0.6391,-9.7579,-9.8051,-9.7187,-9.7565,0.0317,0.0056,0.0179,9.8051,0.0865,-2.6811,-4.2966,0.0595,-3.0744,1.5914,2.0516,2.5002,4.2966,4.3561,-1.9852,-2.0212,-1.925,-1.995,0.0329,0.0109,0.0219,2.0212,0.0963,-0.4116,-1.4751,0.7417,-0.5917,0.7916,-0.3904,-0.2514,1.4751,2.2168,1.8316,-0.0139,3.6485,1.627,1.3993,-1.3575,-1.188,3.6485,3.6623,9.7772,9.7309,9.8185,9.7776,0.0276,0.0048,-0.0115,9.8185,0.0876,3.6494,2.4959,4.7561,3.7174,0.9231,-1.394,-1.4945,4.7561,2.2602
52,-0.0833,-0.164,-0.0439,-0.0726,0.0376,0.0705,0.0486,0.164,0.1201,-0.7538,-0.8204,-0.6421,-0.7645,0.0622,0.0963,0.1466,0.8204,0.1783,-9.7524,-9.8169,-9.6971,-9.7386,0.0443,0.0001,-0.0084,9.8169,0.1198,-0.6296,-1.0859,-0.1568,-0.5742,0.3223,0.8893,0.809,1.0859,0.9292,-1.9742,-2.0125,-1.9338,-1.9731,0.0299,0.1116,0.1269,2.0125,0.0788,-0.8019,-1.2681,-0.3847,-0.843,0.2773,0.6543,0.8962,1.2681,0.8834,0.4741,0.1079,0.7975,0.439,0.2382,-0.7966,-0.6154,0.7975,0.6897,9.782,9.7331,9.848,9.7661,0.0448,-0.006,0.0121,9.848,0.1149,2.2554,2.1515,2.4314,2.2228,0.1016,0.3123,0.3498,2.4314,0.2799
53,-0.0129,-0.1354,0.1437,-0.0241,0.0998,-0.1576,-0.1642,0.1437,0.279,-0.6575,-1.0167,-0.4817,-0.6179,0.1597,-1.0437,-0.903,1.0167,0.535,-9.7523,-9.8571,-9.6889,-9.747,0.0573,0.0977,0.0675,9.8571,0.1681,0.2597,-2.322,2.6762,0.2348,1.7888,-2.356,-4.3859,2.6762,4.9982,-1.8627,-1.9513,-1.8113,-1.8462,0.0469,-0.5591,-0.6212,1.9513,0.14,-0.1476,-1.0627,0.8914,0.0532,0.7764,-2.2391,-2.6602,1.0627,1.9541,-0.3226,-2.7209,1.3659,-0.1764,1.3241,2.3084,5.4969,2.7209,4.0868,9.776,9.7077,9.88,9.7782,0.0576,0.0504,0.0109,9.88,0.1723,2.5677,1.8671,3.4612,2.5727,0.5804,4.2897,2.9369,3.4612,1.5941
54,-0.1705,-0.466,0.2876,-0.1882,0.179,-0.0177,0.0323,0.466,0.7536,-1.7012,-3.4474,-0.9257,-1.5209,0.6487,0.9263,0.71,3.4474,2.5217,-9.6545,-9.9565,-9.2184,-9.6795,0.1539,-0.0918,-0.0712,9.9565,0.738,-2.0963,-10.2325,11.945,-4.1511,6.1352,-6.0957,-4.2271,11.945,22.1775,-2.4217,-2.7475,-1.9075,-2.4675,0.2281,0.7341,0.805,2.7475,0.84,-2.3868,-5.3497,0.9452,-2.607,1.5096,5.8377,6.5844,5.3497,6.2949,1.9859,-26.8264,18.5155,5.3205,11.8847,4.4017,1.865,26.8264,45.3419,9.8264,9.5868,10.2832,9.7892,0.1897,-0.0379,-0.004,10.2832,0.6964,6.8574,3.9484,13.1492,5.5096,2.7679,2.2497,3.8388,13.1492,9.2007
55,-0.1882,-0.3774,-0.0769,-0.1559,0.0991,0.1302,0.1046,0.3774,0.3005,-0.7749,-1.3273,-0.1538,-0.8108,0.4342,0.0822,0.1804,1.3273,1.1735,-9.7463,-9.8373,-9.6313,-9.7508,0.0505,-0.025,-0.0229,9.8373,0.206,-8.192,-10.9123,-5.1633,-8.3782,1.9885,6.7536,5.7585,10.9123,5.749,-1.6877,-1.89,-1.5925,-1.6625,0.0881,-0.1269,-0.175,1.89,0.2975,3.4509,1.095,4.5189,3.9774,1.1061,-2.532,-2.6769,4.5189,3.4239,6.3875,0.9295,11.0332,7.1855,3.5656,-5.6288,-5.8414,11.0332,10.1036,9.7884,9.7255,9.8837,9.7851,0.046,0.0105,0.012,9.8837,0.1582,9.1071,5.8389,11.9214,9.3483,2.01,-5.3688,-5.5643,11.9214,6.0825
56,-0.0581,-0.2198,0.0613,-0.0513,0.0841,-0.0255,-0.0432,0.2198,0.2811,-0.6927,-1.0227,-0.4159,-0.6304,0.2319,0.8439,0.7627,1.0227,0.6068,-9.7713,-9.8436,-9.6717,-9.7736,0.0437,-0.03,-0.0411,9.8436,0.172,-1.4384,-4.4755,3.4488,-2.6198,2.7997,4.0502,5.8152,4.4755,7.9244,-1.8145,-1.9862,-1.61,-1.8375,0.1314,-0.2013,-0.175,1.9862,0.3762,0.919,-1.0073,2.1216,1.3005,1.0286,-4.4588,-4.9187,2.1216,3.1289,0.7587,-2.8636,3.2147,1.3441,1.8955,-0.8339,-1.4471,3.2147,6.0784,9.7989,9.7099,9.8659,9.7971,0.0412,0.0063,0.0208,9.8659,0.1561,3.7382,2.2126,4.983,3.784,0.7918,1.7662,1.241,4.983,2.7704
57,-0.0836,-0.1777,0.0525,-0.0946,0.0823,-0.1214,-0.1437,0.1777,0.2302,0.1512,-0.146,0.4536,0.1322,0.2184,0.0008,-0.0299,0.4536,0.5996,-9.8013,-9.8692,-9.7208,-9.8148,0.0528,-0.0012,0.0229,9.8692,0.1485,2.6118,-2.8079,5.9345,3.1954,3.0846,0.4023,-0.524,5.9345,8.7424,-2.0158,-2.065,-1.9338,-2.0125,0.0421,0.1663,0.1663,2.065,0.1313,-3.5398,-4.5973,-1.9526,-3.6181,0.8067,2.4416,2.3657,4.5973,2.6447,-0.0753,-0.8665,0.662,-0.103,0.581,0.5265,0.5537,0.8665,1.5285,9.8052,9.7221,9.8798,9.8179,0.0537,0.0045,-0.0219,9.8798,0.1577,5.5044,3.7685,7.5556,5.025,1.5165,-1.6973,-1.4981,7.5556,3.7871
58,-0.205,-0.3503,0.1315,-0.2383,0.1638,0.1796,0.2271,0.3503,0.4818,0.152,-0.1699,0.6373,0.1023,0.2481,-0.1545,-0.1496,0.6373,0.8073,-9.8025,-9.9097,-9.7113,-9.7918,0.077,0.2302,-0.0136,9.9097,0.1985,3.0141,2.0232,4.6415,2.6714,0.9977,-2.3539,-2.5718,4.6415,2.6184,-1.8495,-1.8988,-1.8025,-1.8463,0.0362,-0.0405,-0.035,1.8988,0.0962,-1.0982,-2.5601,0.1966,-1.2524,0.9585,1.435,1.7366,2.5601,2.7567,0.4512,-0.3667,1.3913,0.4507,0.5819,-0.1474,-0.2874,1.3913,1.758,9.8097,9.7178,9.929,9.796,0.0791,-0.2261,0.0145,9.929,0.2112,3.8072,2.761,5.6218,3.5269,1.0104,-1.0197,-1.1524,5.6218,2.8608
59,-0.0254,-0.6913,0.6473,-0.0112,0.3669,-0.3488,-0.3917,0.6913,1.3386,-0.0025,-0.3399,0.5499,-0.0473,0.305,2.5096,2.043,0.5499,0.8898,-9.5723,-9.9873,-7.9997,-9.8054,0.6481,0.23,0.3129,9.9873,1.9875,0.6602,-1.359,4.6034,0.0996,2.0821,-24.0759,-23.1988,4.6034,5.9624,-1.89,-2.0038,-1.785,-1.8813,0.0744,0.4091,0.5644,2.0038,0.2188,0.3367,-1.5622,1.4802,0.4841,1.0041,-1.3821,-1.687,1.5622,3.0425,0.3038,-0.0139,1.2203,0.1633,0.3961,-59.9113,-45.4305,1.2203,1.2342,9.5836,8.0447,9.9876,9.8105,0.6335,0.1723,-0.0918,9.9876,1.9429,2.7875,1.9805,5.2094,2.3745,1.0857,20.7378,20.7801,5.2094,3.2289
60,-0.3741,-1.0237,0.1386,-0.4028,0.3599,0.2283,0.2457,1.0237,1.1623,2.5071,1.2405,4.3163,1.9957,1.1738,0.1661,0.4177,4.3163,3.0758,-9.3423,-9.7847,-8.085,-9.4926,0.5337,-0.0885,0.043,9.7847,1.6997,-23.4157,-24.866,-22.5397,-23.0992,0.921,23.5455,23.9771,24.866,2.3263,-1.4809,-2.3187,-1.19,-1.3169,0.3847,-0.408,-0.4113,2.3187,1.1288,-1.0454,-2.734,1.9231,-1.2029,1.4205,1.3199,1.1179,2.734,4.6572,-59.6075,-106.8133,-28.0167,-45.2673,30.4968,57.8479,47.279,106.8133,78.7966,9.7559,9.2221,10.1896,9.7187,0.3296,0.0993,0.0853,10.1896,0.9675,23.5253,22.6296,24.9497,23.1545,0.9427,-17.8373,-17.2555,24.9497,2.3201
61,-0.1458,-0.6378,0.5554,-0.1571,0.3916,0.0089,-0.0098,0.6378,1.1932,2.6732,1.5367,4.0536,2.4134,1.0142,0.0197,0.243,4.0536,2.5169,-9.4308,-9.588,-9.2464,-9.4496,0.1188,0.0016,0.0216,9.588,0.3416,0.1298,-8.3124,6.7391,0.8779,5.7464,-0.5431,-1.2635,8.3124,15.0515,-1.8889,-2.5812,-1.4613,-1.7281,0.4413,0.0459,-0.1006,2.5812,1.12,0.2745,-2.0756,3.182,-0.085,2.1762,-0.2281,0.0472,3.182,5.2576,-1.7596,-31.8997,17.861,2.0117,16.8154,0.1533,-3.1234,31.8997,49.7607,9.8551,9.6463,10.0964,9.8039,0.1845,-0.0344,0.0062,10.0964,0.45,5.688,2.2801,9.2674,5.899,2.2715,-2.5993,-2.7442,9.2674,6.9872
62,-0.1369,-0.2782,0.091,-0.1669,0.1331,-0.0005,0.0255,0.2782,0.3691,2.6928,2.0394,3.39,2.6563,0.5349,-0.0093,0.0296,3.39,1.3506,-9.4292,-9.5365,-9.3187,-9.4279,0.08,-0.0034,-0.007,9.5365,0.2178,-0.4133,-3.872,3.1577,-0.3856,2.7162,-0.0917,-0.1344,3.872,7.0297,-1.843,-2.0475,-1.6363,-1.8288,0.1516,-0.0087,-0.0088,2.0475,0.4112,0.0464,-0.5832,0.7359,-0.0378,0.5374,0.0316,0.1387,0.7359,1.3191,-1.6063,-11.2146,7.6301,-1.1117,7.4658,0.1025,-0.5013,11.2146,18.8447,9.8207,9.7331,9.9274,9.8101,0.0723,-0.0087,0.0008,9.9274,0.1944,3.0887,1.8669,4.4415,3.1548,0.9307,-0.7097,-0.9072,4.4415,2.5746
63,-0.1374,-0.2269,-0.0555,-0.1414,0.0724,-0.0025,-0.0164,0.2269,0.1713,2.6836,2.2925,3.0525,2.686,0.2954,0.0033,0.0153,3.0525,0.76,-9.4326,-9.4856,-9.3722,-9.435,0.0435,0.0005,0.0064,9.4856,0.1134,-0.505,-2.4673,1.4543,-0.52,1.5489,-0.0527,-0.0225,2.4673,3.9216,-1.8517,-1.9862,-1.7325,-1.8375,0.099,-0.0098,-0.0175,1.9862,0.2537,0.0781,-0.3307,0.4366,0.101,0.3124,0.0113,-0.0687,0.4366,0.7673,-1.5039,-6.7859,3.8449,-1.613,4.2228,-0.0403,0.0641,6.7859,10.6307,9.812,9.7613,9.8607,9.811,0.0383,-0.0019,-0.0019,9.8607,0.0994,2.3789,1.8125,3.1974,2.2475,0.5058,-0.2646,-0.2687,3.1974,1.3849
64,-0.1399,-0.2852,-0.0105,-0.1578,0.0769,-0.0074,0.0044,0.2852,0.2747,2.6868,2.3847,2.9926,2.7012,0.1734,0.0151,-0.0524,2.9926,0.608,-9.4321,-9.493,-9.3865,-9.4286,0.0314,0.0038,-0.0108,9.493,0.1065,-0.5577,-1.7887,0.6066,-0.5425,0.8213,-0.0349,0.0029,1.7887,2.3953,-1.8616,-1.9425,-1.7762,-1.855,0.0521,0.0033,-0.0088,1.9425,0.1662,0.0894,-0.5205,0.8034,0.0323,0.3412,-0.0524,0.0121,0.8034,1.3239,-1.5442,-4.8767,1.6664,-1.5489,2.241,-0.0985,0.0877,4.8767,6.5431,9.8101,9.7657,9.8622,9.809,0.0243,-0.0002,0.0017,9.8622,0.0966,2.1143,1.8336,2.6278,1.9789,0.2793,-0.0657,-0.0194,2.6278,0.7942
65,-0.1473,-0.2221,-0.0566,-0.1534,0.0605,0.0122,0.0229,0.2221,0.1654,2.702,2.5905,2.9053,2.6489,0.1265,-0.018,0.0548,2.9053,0.3148,-9.4284,-9.4514,-9.3912,-9.4394,0.0226,-0.0042,0.0144,9.4514,0.0601,-0.5926,-1.5201,0.2388,-0.5396,0.6713,0.1203,0.0467,1.5201,1.7589,-1.8583,-1.9075,-1.7938,-1.8638,0.0394,0.0186,0.0263,1.9075,0.1137,0.037,-0.2626,0.3808,0.0444,0.2272,-0.0324,-0.0221,0.3808,0.6434,-1.6427,-4.279,0.6229,-1.4612,1.8672,0.3546,0.1508,4.279,4.902,9.8099,9.7912,9.8314,9.8107,0.0172,-0.0014,-0.0025,9.8314,0.0402,2.0486,1.826,2.4392,1.9594,0.2387,-0.0916,-0.0465,2.4392,0.6132
66,-0.1351,-0.1778,-0.0888,-0.1305,0.0276,-0.0012,-0.0167,0.1778,0.0891,2.6839,2.5157,2.8119,2.7036,0.1114,-0.0114,-0.0416,2.8119,0.2962,-9.4326,-9.4615,-9.413,-9.425,0.0199,-0.0035,-0.0058,9.4615,0.0486,-0.4723,-1.1151,0.2011,-0.4929,0.5174,0.0659,0.102,1.1151,1.3162,-1.8397,-1.8988,-1.7938,-1.8375,0.0343,0.0077,-0.0,1.8988,0.105,0.0046,-0.1185,0.1569,0.0223,0.0988,-0.0714,-0.0826,0.1569,0.2753,-1.2881,-3.0747,0.5227,-1.3104,1.4088,0.2022,0.2703,3.0747,3.5974,9.8085,9.7806,9.8266,9.8082,0.0145,-0.0002,0.0031,9.8266,0.046,1.957,1.8061,2.2075,1.9129,0.1572,-0.0689,-0.0316,2.2075,0.4014
67,-0.1363,-0.1898,-0.063,-0.1472,0.0422,-0.0056,-0.0124,0.1898,0.1269,2.6725,2.618,2.7497,2.662,0.0506,0.0149,0.0326,2.7497,0.1317,-9.436,-9.4745,-9.4222,-9.4308,0.017,0.0022,0.0055,9.4745,0.0523,-0.4064,-0.5731,-0.2777,-0.3909,0.1183,-0.3826,-0.2999,0.5731,0.2954,-1.832,-1.855,-1.7938,-1.8375,0.026,-0.0416,-0.0394,1.855,0.0613,-0.0668,-0.3274,0.1618,-0.0603,0.1769,0.3214,0.1949,0.3274,0.4892,-1.0859,-1.5333,-0.7354,-1.0401,0.3145,-1.0824,-0.8945,1.5333,0.7979,9.8083,9.7838,9.8344,9.8114,0.0172,0.0048,-0.0027,9.8344,0.0506,1.888,1.8346,1.9519,1.8812,0.042,0.376,0.2964,1.9519,0.1173
68,-0.1419,-0.3124,0.1156,-0.1595,0.1177,0.0092,0.0144,0.3124,0.428,2.6874,2.335,3.1333,2.6946,0.2173,-0.0032,-0.0314,3.1333,0.7983,-9.4338,-9.5514,-9.3512,-9.4253,0.0469,-0.0001,-0.0133,9.5514,0.2002,-0.789,-2.1027,0.855,-0.6908,0.8459,0.2195,0.1452,2.1027,2.9578,-1.8736,-2.03,-1.7413,-1.8769,0.0915,0.0149,0.0131,2.03,0.2888,0.2545,-0.5286,1.6051,0.1346,0.6446,-0.1186,-0.0906,1.6051,2.1337,-2.1683,-5.5755,2.0927,-1.9346,2.2755,0.5651,0.4136,5.5755,7.6682,9.8131,9.7471,9.8666,9.8087,0.0326,-0.0014,0.0046,9.8666,0.1195,2.264,1.7984,2.9471,2.1776,0.3865,-0.0654,-0.1371,2.9471,1.1486
69,-0.1327,-0.2534,-0.0292,-0.1452,0.0608,-0.0121,-0.0258,0.2534,0.2241,2.6842,2.3374,3.0495,2.6632,0.2137,-0.0084,0.0206,3.0495,0.7121,-9.434,-9.4978,-9.3682,-9.4386,0.033,-0.0021,0.0059,9.4978,0.1296,-0.5695,-2.2574,1.028,-0.5456,1.07,0.0236,-0.0773,2.2574,3.2854,-1.8586,-1.96,-1.7675,-1.8638,0.0658,0.0058,0.0,1.96,0.1925,0.1359,-0.3432,0.7159,0.044,0.2933,-0.0556,0.0538,0.7159,1.0591,-1.6032,-6.4958,2.7411,-1.5211,2.9219,0.1093,-0.1451,6.4958,9.2369,9.8117,9.7649,9.8633,9.8132,0.031,-0.0015,-0.006,9.8633,0.0984,2.1986,1.7994,3.0741,2.0406,0.3922,-0.1508,-0.0604,3.0741,1.2747
70,-0.1448,-0.2064,-0.0572,-0.1709,0.0544,-0.0011,0.0192,0.2064,0.1492,2.6758,2.4684,2.8508,2.6839,0.1462,-0.0235,-0.0598,2.8508,0.3824,-9.436,-9.4682,-9.4171,-9.4327,0.0195,-0.0011,-0.0145,9.4682,0.0511,-0.5459,-1.5023,0.4789,-0.6229,0.7308,0.3262,0.4535,1.5023,1.9811,-1.8528,-1.9163,-1.785,-1.8638,0.0476,0.0459,0.07,1.9163,0.1313,0.0803,-0.2533,0.3113,0.0977,0.2034,-0.2455,-0.2536,0.3113,0.5646,-1.4939,-4.1002,1.2634,-1.6662,1.9909,0.9054,1.2133,4.1002,5.3636,9.8102,9.7842,9.8424,9.8072,0.0222,-0.0057,-0.0057,9.8424,0.0582,2.0478,1.8138,2.4468,1.9801,0.2379,-0.1494,-0.1269,2.4468,0.633
71,-0.1459,-0.2265,-0.0857,-0.1517,0.0513,0.0152,-0.0247,0.2265,0.1408,2.6523,2.5397,2.8365,2.624,0.11,0.0301,0.0934,2.8365,0.2968,-9.4371,-9.4687,-9.4029,-9.4471,0.0261,0.0001,0.0344,9.4687,0.0658,-0.2197,-0.9889,0.4068,-0.1694,0.5219,-0.4557,-0.4454,0.9889,1.3957,-1.8069,-1.8725,-1.7413,-1.7938,0.0446,-0.0656,-0.0787,1.8725,0.1313,-0.1652,-0.4593,0.1691,-0.1559,0.2,0.1957,0.2162,0.4593,0.6283,-0.5885,-2.6346,1.051,-0.4529,1.3738,-1.521,-1.1785,2.6346,3.6856,9.8045,9.7761,9.86,9.8015,0.0248,0.0146,0.0052,9.86,0.0839,1.8983,1.7654,2.1021,1.8533,0.1161,0.7348,0.6154,2.1021,0.3368
72,-0.1306,-0.2839,0.1129,-0.1764,0.1324,-0.0043,0.0355,0.2839,0.3967,2.6824,1.9885,3.1476,2.7174,0.3813,0.003,-0.0563,3.1476,1.1591,-9.437,-9.5392,-9.3665,-9.4127,0.0629,0.003,-0.0251,9.5392,0.1727,-0.6755,-3.1575,1.5402,-0.6148,1.8809,0.0731,0.0243,3.1575,4.6977,-1.8725,-2.0562,-1.68,-1.8725,0.1271,0.0044,0.0175,2.0562,0.3762,0.0305,-0.8814,0.8115,0.0603,0.5958,0.0631,-0.0119,0.8814,1.6929,-2.1095,-9.079,3.871,-1.6313,5.2463,0.4276,0.0967,9.079,12.95,9.8191,9.7465,9.9019,9.8067,0.0464,-0.0074,0.0003,9.9019,0.1554,2.6332,1.9141,3.7871,2.4686,0.7173,-0.4738,-0.4643,3.7871,1.873
73,-0.1349,-0.2051,-0.0566,-0.1409,0.0497,-0.0006,0.0032,0.2051,0.1485,2.6854,2.4158,2.9699,2.6611,0.2037,0.0095,0.0461,2.9699,0.5541,-9.434,-9.4718,-9.3868,-9.4379,0.0318,0.0013,0.0114,9.4718,0.0851,-0.6024,-1.891,0.6513,-0.5905,1.0048,0.0711,0.0435,1.891,2.5423,-1.8681,-1.9775,-1.785,-1.855,0.0655,0.0104,0.0,1.9775,0.1925,0.0936,-0.1062,0.4401,0.0484,0.1899,0.0026,0.0482,0.4401,0.5462,-1.6819,-5.3783,1.6417,-1.5347,2.7411,0.2301,0.1418,5.3783,7.02,9.8117,9.7772,9.8456,9.807,0.025,-0.0,0.0031,9.8456,0.0683,2.1594,1.8288,2.7267,2.0044,0.366,-0.1605,-0.0623,2.7267,0.8979
74,-0.1355,-0.1945,-0.0834,-0.1377,0.0291,-0.0038,-0.003,0.1945,0.111,2.6949,2.5241,2.8658,2.7072,0.1079,-0.0108,-0.0165,2.8658,0.3417,-9.4327,-9.4653,-9.3916,-9.4265,0.0175,0.0,-0.0058,9.4653,0.0736,-0.5313,-1.4783,0.2866,-0.547,0.5332,0.0001,0.0353,1.4783,1.7649,-1.8577,-1.925,-1.8025,-1.855,0.0322,-0.0031,-0.0088,1.925,0.1225,0.0962,-0.1364,0.2857,0.0966,0.1161,-0.0121,-0.0146,0.2857,0.4221,-1.4517,-4.0383,0.7524,-1.3929,1.4586,0.0201,-0.0078,4.0383,4.7907,9.8117,9.7872,9.8463,9.8102,0.0159,-0.0034,-0.0018,9.8463,0.0592,1.9989,1.8114,2.4301,1.942,0.1885,-0.0471,-0.0118,2.4301,0.6187
75,-0.1392,-0.1696,-0.1062,-0.1407,0.0176,-0.0031,-0.0019,0.1696,0.0634,2.6841,2.6007,2.7611,2.6908,0.0507,-0.0025,0.0129,2.7611,0.1604,-9.4327,-9.4728,-9.4087,-9.4323,0.0169,-0.0002,-0.0028,9.4728,0.0642,-0.5311,-0.971,-0.1051,-0.5117,0.2492,-0.1826,-0.2011,0.971,0.8659,-1.8608,-1.8988,-1.82,-1.8638,0.0193,-0.0051,0.0,1.8988,0.0787,0.0841,-0.0347,0.2066,0.082,0.07,0.0038,-0.0043,0.2066,0.2414,-1.4316,-2.6322,-0.2732,-1.4007,0.6823,-0.4863,-0.5011,2.6322,2.359,9.8083,9.7813,9.8291,9.8084,0.0158,-0.0004,-0.0002,9.8291,0.0479,1.9518,1.8234,2.1395,1.9302,0.0855,0.0627,0.0502,2.1395,0.3161
76,-0.1424,-0.1586,-0.1211,-0.1426,0.0136,0.0131,0.0121,0.1586,0.0376,2.6816,2.5959,2.7443,2.7036,0.0576,0.018,0.0242,2.7443,0.1484,-9.4329,-9.4555,-9.4125,-9.4351,0.0133,-0.0066,0.0013,9.4555,0.043,-0.7138,-1.1106,-0.3707,-0.7128,0.2713,-0.0878,0.0832,1.1106,0.7399,-1.8659,-1.89,-1.8375,-1.8638,0.018,-0.0186,-0.0175,1.89,0.0525,0.0879,-0.02,0.2514,0.0777,0.0773,0.0761,0.1041,0.2514,0.2714,-1.9179,-2.9854,-0.9847,-1.9018,0.74,-0.2817,0.2414,2.9854,2.0007,9.8078,9.79,9.8262,9.8082,0.0127,0.0125,0.0056,9.8262,0.0362,2.0145,1.8931,2.2065,1.9805,0.1099,0.1294,-0.0078,2.2065,0.3134
77,-0.1293,-0.2342,-0.0135,-0.1305,0.0715,-0.0237,-0.0149,0.2342,0.2207,2.6995,2.4481,2.9167,2.7279,0.1688,-0.0159,-0.0727,2.9167,0.4686,-9.4396,-9.5012,-9.3609,-9.4338,0.0454,0.0074,0.0071,9.5012,0.1403,-0.8016,-1.8174,0.129,-0.6296,0.6821,0.5611,0.3587,1.8174,1.9463,-1.8845,-1.9512,-1.8113,-1.8812,0.0426,0.0536,0.0569,1.9512,0.14,0.164,-0.158,0.4528,0.1818,0.224,-0.045,-0.0881,0.4528,0.6108,-2.1997,-5.1027,0.3502,-1.6604,1.9225,1.484,0.9248,5.1027,5.4529,9.8203,9.7761,9.8766,9.8138,0.0381,-0.0103,-0.0043,9.8766,0.1005,2.144,1.875,2.6743,1.9727,0.2967,-0.1107,-0.0774,2.6743,0.7994
78,-0.153,-0.3353,-0.03,-0.1455,0.0772,0.0079,0.0027,0.3353,0.3053,2.6836,2.3003,3.0465,2.6551,0.206,-0.029,0.0123,3.0465,0.7462,-9.4321,-9.5329,-9.3523,-9.4267,0.0444,-0.0095,-0.0184,9.5329,0.1806,-0.2405,-1.7335,1.5019,-0.2709,0.8593,-0.2685,-0.2266,1.7335,3.2354,-1.8309,-1.925,-1.75,-1.8244,0.0497,-0.0244,-0.0262,1.925,0.175,0.119,-0.4277,0.853,0.0937,0.2935,-0.0271,0.0086,0.853,1.2806,-0.7156,-4.889,3.7568,-0.7356,2.2715,-0.6548,-0.5673,4.889,8.6458,9.81,9.7393,9.8807,9.8095,0.0334,-0.0007,0.0016,9.8807,0.1414,2.0332,1.7986,2.6273,1.8953,0.2646,-0.0578,0.0207,2.6273,0.8287
79,-0.1451,-0.2333,-0.0407,-0.1428,0.0497,-0.0007,-0.0023,0.2333,0.1926,2.6546,2.481,2.8353,2.6674,0.0968,0.0059,-0.0016,2.8353,0.3543,-9.4416,-9.4865,-9.4071,-9.4451,0.0174,0.0012,0.0024,9.4865,0.0795,-0.5091,-1.2245,0.282,-0.4975,0.43,-0.0312,-0.0477,1.2245,1.5065,-1.8553,-1.89,-1.82,-1.8506,0.0243,0.003,0.0,1.89,0.07,0.0919,-0.2297,0.496,0.1023,0.1861,0.0081,0.0013,0.496,0.7257,-1.3704,-3.4022,0.7073,-1.3029,1.1635,-0.0794,-0.1546,3.4022,4.1094,9.8094,9.7783,9.8264,9.8112,0.0124,0.0003,-0.0015,9.8264,0.0481,1.9754,1.8205,2.252,1.9159,0.1417,-0.0106,0.0188,2.252,0.4315
81,-0.1464,-0.1835,-0.1085,-0.1474,0.0201,0.0275,0.0044,0.1835,0.075,2.6665,2.5768,2.767,2.6641,0.0525,0.0928,0.0931,2.767,0.1903,-9.4392,-9.4532,-9.4206,-9.4403,0.0079,-0.0202,-0.0293,9.4532,0.0326,-0.5715,-1.04,-0.1651,-0.5928,0.2573,8.9239,2.3407,1.04,0.8748,-1.8493,-1.89,-1.7938,-1.8506,0.0231,0.0872,0.0219,1.89,0.0962,0.1081,-0.0482,0.2425,0.1048,0.0779,-0.34,-0.0474,0.2425,0.2907,-1.5292,-2.8123,-0.434,-1.6121,0.7001,21.8306,6.8308,2.8123,2.3783,9.8099,9.7969,9.8213,9.8082,0.0074,0.0611,0.017,9.8213,0.0244,1.9543,1.804,2.1501,1.9535,0.0967,7.571,0.7517,2.1501,0.3461
82,-0.1189,-0.3355,0.1827,-0.143,0.1346,0.1158,0.0927,0.3355,0.5182,2.7592,1.2585,3.8466,2.7572,0.5868,-4.6265,-4.9794,3.8466,2.5881,-9.4594,-9.5845,-9.2627,-9.4696,0.0769,-0.0819,-0.0294,9.5845,0.3218,8.3524,-1.1582,31.6988,1.7479,11.6386,9.5951,24.8162,31.6988,32.857,-1.7621,-2.0038,-1.4525,-1.8288,0.1539,-1.8345,-1.9775,2.0038,0.5512,-0.2318,-2.0943,1.2053,0.0574,0.7411,-11.2695,-11.1462,2.0943,3.2996,20.3015,-3.5582,69.4273,5.2186,26.1973,-43.1594,-18.6397,69.4273,72.9856,9.8709,9.6109,10.2732,9.8251,0.1695,-0.054,-0.2086,10.2732,0.6623,9.5252,1.8366,31.81,2.7052,10.8402,16.6491,27.4869,31.81,29.9734
83,-0.0031,-0.6526,0.9565,-0.0504,0.4814,0.2021,0.0657,0.9565,1.6091,-1.8672,-3.9824,0.681,-2.2222,1.3033,-1.8139,-1.4586,3.9824,4.6634,-9.5413,-10.5848,-8.6767,-9.499,0.4087,0.291,-0.0079,10.5848,1.9081,17.9476,-10.578,37.146,26.5641,17.4076,18.3534,11.6783,37.146,47.724,-3.5966,-5.1975,-1.6625,-3.8063,1.2188,0.8114,0.0919,5.1975,3.535,-11.5013,-21.5455,-2.2304,-11.0887,4.9596,-43.2844,-47.1379,21.5455,19.315,-22.8579,-103.8073,22.0455,-13.4211,36.3918,-172.4233,-132.0434,103.8073,125.8528,9.8169,9.0008,10.7104,9.6166,0.4184,0.3696,0.4007,10.7104,1.7095,26.1744,11.0854,40.7253,30.1921,10.1307,42.9163,39.6756,40.7253,29.6399
84,0.199,-0.8429,2.4287,0.0154,0.8613,3.9027,4.0725,2.4287,3.2716,-3.6812,-6.5993,-0.9987,-3.6808,1.8062,-1.7025,-1.5391,6.5993,5.6005,-9.2503,-10.6787,-5.3921,-9.5069,1.2201,2.7004,2.7493,10.6787,5.2866,36.301,-9.7691,88.4175,38.2424,38.2075,-22.836,-29.8091,88.4175,98.1866,-2.7852,-7.3325,1.6712,-3.7144,2.8604,-25.9865,-26.6131,7.3325,9.0037,-54.7858,-104.3164,-5.4354,-58.2266,39.9786,23.787,33.428,104.3164,98.8811,-195.2812,-575.7127,21.3635,-145.4645,216.7448,120.7129,99.1334,575.7127,597.0762,10.1865,8.2647,11.6308,10.0173,0.8372,-0.6992,-0.5525,11.6308,3.366,69.0906,10.2824,136.6382,69.8677,51.009,-21.6782,-25.2574,136.6382,126.3558
85,4.1017,2.9149,5.1599,4.0878,0.6123,-2.4733,-2.4947,5.1599,2.245,-5.3837,-6.8662,-4.1308,-5.2199,0.7579,1.9589,1.9305,6.8662,2.7353,-6.5499,-7.6877,-4.8604,-6.7576,0.9097,-2.1463,-2.22,7.6877,2.8273,13.465,-3.3607,60.5363,8.4333,15.4895,-29.3934,-23.1612,60.5363,63.897,-28.7717,-37.4325,-9.555,-30.3275,7.1032,0.7828,-3.8719,37.4325,27.8775,-30.9988,-78.4768,-18.6207,-24.7986,15.611,21.5965,13.8185,78.4768,59.8561,-74.5684,-367.3996,17.4641,-46.3311,92.0245,129.1341,101.0179,367.3996,384.8636,9.4874,8.5462,10.599,9.4648,0.6512,0.2836,0.0492,10.599,2.0528,47.4124,32.8932,99.5718,44.6103,15.6547,-10.4522,-3.5058,99.5718,66.6787
86,1.6284,-2.5667,3.8342,1.5932,1.4696,-1.5928,-1.4835,3.8342,6.4009,-3.4248,-5.5209,-0.7366,-3.2895,1.1925,1.9463,1.6965,5.5209,4.7843,-8.6961,-15.7323,-3.0762,-8.9776,2.4724,-0.9224,-0.6291,15.7323,12.6561,-15.9284,-32.5955,1.5387,-14.7279,11.9172,4.5607,1.9523,32.5955,34.1341,-27.9889,-46.9263,-3.3425,-34.1994,16.9085,25.8202,32.4844,46.9263,43.5838,-9.4023,-22.4318,1.0553,-10.9801,8.0952,10.9127,12.7256,22.4318,23.4871,54.5658,-6.0226,125.155,54.6868,43.7885,-39.5385,-43.8368,125.155,131.1776,9.771,4.3761,16.1952,9.514,2.0018,0.091,0.3601,16.1952,11.8192,36.9602,11.1231,56.5156,41.1045,15.5968,-23.1944,-27.4149,56.5156,45.3925
87,0.0356,-0.9251,1.01,0.1096,0.6394,0.6279,0.5534,1.01,1.9351,-1.4785,-3.8143,1.2106,-1.593,1.5047,0.8572,0.9224,3.8143,5.0248,-9.6185,-10.0961,-9.2191,-9.6068,0.2226,-0.1642,-0.1413,10.0961,0.8769,-11.3676,-24.8294,5.9991,-12.7755,9.7263,4.3065,5.9651,24.8294,30.8286,-2.1687,-4.3312,-0.63,-1.715,1.0168,0.5573,0.1094,4.3312,3.7013,1.5104,-9.6553,7.6307,1.7455,4.2162,5.6752,4.9978,9.6553,17.286,15.0273,-16.2689,57.9204,10.85,23.2008,-12.8626,-8.1822,57.9204,74.1893,9.862,9.325,10.2997,9.8741,0.2521,-0.0088,-0.0061,10.2997,0.9747,13.7659,2.0442,26.0026,13.6896,7.615,-2.7034,-3.8834,26.0026,23.9584
88,0.6634,-0.2703,1.3304,0.663,0.3962,-0.5915,-0.5777,1.3304,1.6007,-0.6213,-1.6091,0.5583,-0.6705,0.6526,0.7007,0.7857,1.6091,2.1674,-9.7827,-10.2882,-9.2905,-9.7481,0.2508,0.0086,-0.024,10.2882,0.9977,-7.0611,-15.7971,3.5641,-6.8104,6.308,8.5192,4.8191,15.7971,19.3611,-1.6113,-2.0562,-1.0762,-1.6056,0.221,-0.1286,-0.14,2.0562,0.98,7.1855,1.9937,12.0369,6.7434,2.8967,-8.9156,-8.387,12.0369,10.0433,2.1647,-7.478,18.6923,2.6678,5.521,-3.1099,-3.7204,18.6923,26.1703,9.8533,9.3208,10.29,9.8679,0.2529,-0.0249,-0.0356,10.29,0.9692,11.0624,2.9375,19.9366,9.8062,5.4046,-4.0415,-3.9123,19.9366,16.999
89,0.072,-0.2953,0.5589,0.0853,0.2891,0.0063,0.0698,0.5589,0.8543,0.0794,-1.6193,1.9239,0.1152,1.0073,-0.4111,-0.1843,1.9239,3.5432,-9.7741,-10.1521,-9.3008,-9.7721,0.1918,-0.0024,0.0108,10.1521,0.8513,1.4581,-6.0428,15.4286,-1.9913,7.5184,0.1586,2.0719,15.4286,21.4713,-1.7399,-2.0825,-1.4875,-1.7456,0.1452,-0.0225,-0.0394,2.0825,0.595,-1.7301,-3.6179,-0.0118,-1.6436,0.8336,1.1822,0.5884,3.6179,3.6061,-0.9452,-18.7606,12.5544,-1.0526,6.9575,-1.4555,0.4845,18.7606,31.3149,9.8284,9.306,10.2721,9.8323,0.2035,0.0287,-0.0105,10.2721,0.9661,7.021,2.7458,15.5859,5.8938,3.8011,-1.2067,-0.8263,15.5859,12.8401
90,0.0782,-1.2386,0.8632,0.1552,0.3969,0.2576,0.1095,1.2386,2.1018,-0.3317,-2.8819,1.8736,-0.0691,1.1788,-0.1579,-0.33,2.8819,4.7556,-9.7765,-10.3777,-9.3485,-9.7612,0.2391,-0.006,-0.0207,10.3777,1.0291,1.6167,-7.1648,11.0906,0.0806,5.6374,-1.2051,-0.368,11.0906,18.2554,-1.7624,-2.2487,-1.4088,-1.785,0.1847,-0.1081,-0.0612,2.2487,0.84,-0.5479,-4.7554,3.7185,-1.0552,2.3977,0.4627,0.9488,4.7554,8.4739,-2.4006,-29.5489,4.2823,-0.5681,6.8663,1.3787,0.4018,29.5489,33.8312,9.8571,9.4521,10.8401,9.8219,0.2741,-0.0328,-0.0202,10.8401,1.3881,5.8142,1.9608,11.3701,5.0676,2.9274,-2.2295,-2.0628,11.3701,9.4092
91,0.3359,-0.0886,0.9748,0.2647,0.2562,0.0118,0.0799,0.9748,1.0634,-0.4896,-1.9107,0.6307,-0.3991,0.6435,-0.0916,-0.2391,1.9107,2.5414,-9.7825,-10.2131,-9.4837,-9.782,0.1729,-0.0016,0.0147,10.2131,0.7294,0.4116,-4.2503,8.3415,-0.2874,3.1315,-1.0023,-0.2996,8.3415,12.5918,-1.8705,-2.135,-1.6012,-1.8462,0.1578,0.004,-0.0088,2.135,0.5338,-0.0852,-3.7359,3.3362,-0.1064,1.7202,0.1712,0.2071,3.7359,7.0721,-1.022,-12.4342,2.3537,-0.1663,3.2269,1.2793,0.3498,12.4342,14.7879,9.8242,9.554,10.2163,9.8017,0.1595,-0.011,-0.0004,10.2163,0.6624,3.5847,1.7234,8.7446,3.0047,1.8023,-1.4778,-0.9962,8.7446,7.0212
92,0.3477,-0.0447,0.7781,0.3446,0.1818,0.0515,-0.0044,0.7781,0.8228,-0.5811,-1.0394,0.003,-0.6382,0.2887,-0.1243,-0.0919,1.0394,1.0424,-9.784,-9.9108,-9.7171,-9.7673,0.053,0.0718,-0.0473,9.9108,0.1937,-0.5907,-1.749,0.9857,-0.587,0.667,1.0537,2.762,1.749,2.7347,-1.8664,-2.1875,-1.5838,-1.855,0.1434,-1.0672,-0.3981,2.1875,0.6038,0.086,-1.9802,1.2459,0.1007,0.5525,-13.6864,-3.5479,1.9802,3.2261,0.2573,-0.4306,1.1649,0.1836,0.3509,-3.4497,-1.8849,1.1649,1.5955,9.8132,9.7561,9.9332,9.8012,0.0456,0.1054,0.052,9.9332,0.177,2.1069,1.6133,3.1109,2.0086,0.3842,14.497,4.2845,3.1109,1.4976
93,0.3992,-1.4486,2.7939,0.3402,0.8239,-0.0202,0.0513,2.7939,4.2425,-0.7054,-4.7292,1.8623,-0.7301,1.5934,-0.0206,0.0012,4.7292,6.5915,-9.7123,-11.9513,-6.0325,-9.8146,1.0172,-0.0588,0.0416,11.9513,5.9189,0.4629,-18.333,7.7818,2.1749,5.6802,-0.9748,-2.7467,18.333,26.1148,-2.9336,-8.3037,1.3475,-2.2531,2.189,1.0853,0.4113,8.3037,9.6512,-13.6005,-53.3342,3.0192,-3.4472,18.8208,13.7232,3.5421,53.3342,56.3534,-3.1924,-36.8019,29.9096,-1.7013,11.9825,3.5115,2.0764,36.8019,66.7116,9.9186,7.0012,12.0971,9.8532,0.8498,-0.108,-0.048,12.0971,5.0959,16.604,1.9472,53.8591,6.2931,17.4958,-14.6463,-4.3481,53.8591,51.912
94,0.379,-0.0011,0.4978,0.3915,0.0922,,,0.4978,0.4989,-0.726,-1.3961,0.167,-0.7289,0.3112,,,1.3961,1.563,-9.7711,-10.1652,-9.408,-9.773,0.1249,,,10.1652,0.7573,-0.5119,-1.2694,0.5237,-0.5718,0.3378,,,1.2694,1.7931,-1.8483,-2.0563,-1.6712,-1.8419,0.0808,,,2.0563,0.385,0.1227,-0.2319,0.7529,0.0949,0.1687,,,0.7529,0.9848,0.3191,-0.4159,0.9308,0.3751,0.2671,,,0.9308,1.3467,9.8106,9.4772,10.1723,9.8052,0.1151,,,10.1723,0.6952,1.9577,1.832,2.1813,1.945,0.066,,,2.1813,0.3494
