AYGX_min,AZ_mean,AYGX_mean,AYGX_std,AZ_mean,GX_std,Gnorm_max,Gnorm_median,timestamp
-0.3136,-9.7926,0.0076,0.1483,-9.7926,0.4884,1.6333,0.7918,0
-0.1602,-9.7865,0.0308,0.0808,-9.7865,0.3036,0.9719,0.7837,1
-0.0339,-9.791,0.0302,0.0348,-9.791,0.1436,0.79,0.7273,2
-0.0415,-9.7905,0.026,0.034,-9.7905,0.1375,0.8184,0.7284,3
-0.6182,-9.7893,0.0128,0.2485,-9.7893,1.1025,4.1419,1.1413,4
-173.33,-9.7788,-8.2088,38.0692,-9.7788,5.5657,30.6506,3.469,5
-5.6775,-9.7897,-0.4599,1.9095,-9.7897,1.9369,8.7457,4.1676,6
-38.8042,-9.7298,-2.4996,11.3183,-9.7298,4.589,14.9574,4.4404,7
-85.5329,-9.6828,-3.9415,24.6063,-9.6828,6.6331,20.0045,7.9923,8
-53.7842,-9.5649,-11.7945,17.9289,-9.5649,6.8476,16.6374,5.0993,9
-23.855,-9.6557,0.4325,8.2206,-9.6557,3.8813,9.6348,3.0164,10
-5.2103,-9.6671,2.1039,4.4692,-9.6671,3.2297,11.12,1.9102,11
2.0584,-9.7126,3.0216,1.0527,-9.7126,0.8904,4.7598,2.687,12
-20.0426,-9.7284,-4.8157,5.8065,-9.7284,2.9324,12.0892,4.2989,13
-13.6628,-9.6537,1.58,9.2461,-9.6537,5.1439,9.9613,5.6954,14
-37.4519,-9.6231,-8.4357,14.2195,-9.6231,6.8002,16.4624,6.487,15
-49.1992,-9.3037,5.268,28.7871,-9.3037,9.8022,34.4309,4.9222,16
-11.9287,-9.8685,6.796,9.3802,-9.8685,6.5461,20.2372,14.7537,17
-18.305,-9.7888,2.9696,11.0465,-9.7888,8.8751,28.2741,16.3502,18
-20.7984,-9.6657,-5.5962,7.2837,-9.6657,4.5063,42.5423,19.3616,19
-19.7188,-9.8699,3.507,11.4385,-9.8699,2.4535,50.0615,32.3797,20
-31.5363,-9.9613,-2.0351,14.746,-9.9613,6.4145,94.91,45.6341,21
-11.6513,-9.6071,6.9028,21.9655,-9.6071,7.355,33.8388,10.9176,22
-34.9825,-9.741,8.4677,41.3231,-9.741,29.2291,76.8114,67.4245,23
-25.0119,-9.6604,6.1231,17.965,-9.6604,8.1705,33.7059,14.4535,24
-37.1854,-9.5232,4.8084,18.3052,-9.5232,8.3165,33.9422,10.7231,25
-32.9388,-9.8163,1.6659,8.6645,-9.8163,7.6718,25.2834,10.0399,27
-17.2572,-9.9578,2.4791,11.724,-9.9578,10.9111,56.9216,25.9219,28
4.0861,-9.0086,46.5329,21.3824,-9.0086,2.9254,56.1942,45.9469,29
-6.993,-10.1185,1.9625,7.1676,-10.1185,5.1094,63.1917,53.7652,30
-0.0481,-10.4817,7.1758,6.3033,-10.4817,4.3541,79.0402,54.9192,31
-4.3425,-10.9603,1.3927,5.2507,-10.9603,3.8355,94.5146,80.0421,32
-9.6878,-9.6104,3.2303,5.873,-9.6104,4.1193,17.041,10.8169,33
-59.732,-9.5508,7.5546,43.8902,-9.5508,14.2789,38.4114,27.9396,34
-25.743,-8.5753,9.8138,26.015,-8.5753,17.3032,71.3943,21.7676,35
-115.5188,-9.1625,108.8829,189.9943,-9.1625,28.1254,114.6444,60.4899,36
-41.6921,-8.8076,5.9634,37.9723,-8.8076,5.7445,31.2018,20.9861,37
-16.5227,-9.5899,5.3994,14.0508,-9.5899,9.5295,39.669,19.359,39
-1.4719,-10.0461,1.8282,3.6972,-10.0461,2.4475,21.6399,18.6511,40
-9.4011,-10.2347,-3.527,4.7218,-10.2347,7.2153,31.0347,26.7446,41
-33.5647,-10.3572,6.5829,22.8151,-10.3572,12.8891,42.8969,25.4208,42
-5.2393,-9.4581,3.5507,8.1458,-9.4581,7.8748,20.6548,15.1398,43
-5.0183,-9.7335,1.9824,5.029,-9.7335,6.104,24.7241,12.8679,44
-65.8933,-10.1691,6.4295,23.3692,-10.1691,11.18,99.5841,69.5095,46
-13.6888,-9.9504,8.7857,15.3644,-9.9504,6.0303,83.623,66.7436,47
-5.2826,-9.9501,0.6247,3.9727,-9.9501,5.926,22.8052,7.6123,48
-36.7407,-7.9864,4.2289,33.9757,-7.9864,4.265,56.1406,32.3729,49
-31.52,-9.6994,13.9289,18.9294,-9.6994,12.7409,39.3282,28.1977,50
-2.9468,-9.7266,0.4954,1.8766,-9.7266,3.9591,12.5595,7.6632,51
-78.6327,-9.7173,-5.256,24.9091,-9.7173,12.6742,29.3005,9.5725,53
-14.2058,-9.7028,1.8405,9.2911,-9.7028,5.9893,9.0881,6.1849,54
9.9145,-9.7063,17.0506,5.0941,-9.7063,2.0406,17.3747,15.7248,55
-2.5471,-9.7828,-2.2485,0.1936,-9.7828,0.2438,3.9993,3.3864,56
3.7629,-9.7182,15.4154,5.8413,-9.7182,3.9313,17.897,15.9147,57
-8.2913,-9.9537,-4.1692,2.0725,-9.9537,1.6029,7.9656,3.7427,58
0.1789,-9.8659,0.8992,0.6288,-9.8659,0.6844,2.6267,1.2091,59
-2.8718,-9.7816,-0.2957,1.6955,-9.7816,2.0185,3.8089,1.6497,60
0.0704,-9.7885,1.1685,0.8286,-9.7885,1.3444,3.8025,2.6443,61
0.3185,-9.7973,0.8382,0.3443,-9.7973,0.7111,3.5705,2.8148,63
-0.8062,-9.8064,0.0421,0.3098,-9.8064,1.8881,3.2318,2.2051,64
-0.8315,-9.8061,0.2981,0.6612,-9.8061,1.5494,4.3881,2.3198,65
-0.8405,-9.7845,1.1439,1.4526,-9.7845,2.7371,6.1181,2.5163,66
-2.7977,-9.7894,-0.1691,1.1245,-9.7894,1.1566,3.5453,2.8316,67
-7.647,-9.8003,3.0644,8.0285,-9.8003,7.078,12.893,5.5817,68
-3.4585,-9.7849,-0.7692,1.3212,-9.7849,1.2034,2.9657,1.8461,69
-15.0854,-9.784,2.8383,7.4794,-9.784,2.3338,13.7243,9.5108,70
-18.4404,-9.7382,-9.4153,5.792,-9.7382,3.3375,9.778,8.3272,71
-23.0784,-9.8062,-0.8538,8.6859,-9.8062,6.3335,13.9383,4.3439,73
-3.9108,-9.7993,-0.1896,1.6481,-9.7993,3.7768,6.9432,2.6201,74
-6.8854,-9.7718,0.3385,3.8023,-9.7718,4.1918,6.4774,4.1083,75
-12.1914,-9.7868,3.1685,9.6833,-9.7868,7.329,15.958,8.5404,76
-5.5602,-9.7183,1.2378,4.5638,-9.7183,3.8074,7.7203,3.4549,77
-12.7879,-9.725,1.4223,6.7202,-9.725,4.414,10.7015,4.9129,78
-1.6734,-9.7993,1.2005,1.0593,-9.7993,1.1492,3.7098,2.4488,79
-0.4684,-9.806,0.2742,0.4341,-9.806,0.8636,2.8999,1.5856,80
-6.3271,-9.7991,-0.1724,3.0177,-9.7991,1.7221,5.8156,3.6505,81
-0.883,-9.8058,-0.0563,0.8818,-9.8058,1.7947,4.1949,1.6259,83
-4.1231,-9.8063,-0.0804,1.157,-9.8063,2.7068,7.2849,3.1904,84
-0.1016,-9.8106,0.2285,0.3089,-9.8106,0.1948,2.1434,1.7637,85
-5.2838,-9.8536,-0.6015,2.1143,-9.8536,1.078,8.2403,4.0492,86
-17.8334,-9.7319,-3.794,6.3217,-9.7319,5.2197,13.8051,9.6568,87
0.2958,-9.7125,2.4101,1.2141,-9.7125,1.2396,6.7753,5.8699,88
-2.2998,-9.7904,-0.1996,1.3282,-9.7904,1.4434,2.093,1.6443,89
-0.7817,-9.793,-0.2417,0.4995,-9.793,0.8418,1.5866,1.1359,90
-0.492,-9.7952,0.2451,0.427,-9.7952,0.8882,1.695,1.1176,92
-0.8376,-9.7922,0.3399,0.8303,-9.7922,1.5598,4.1704,1.1548,93
-0.6082,-9.8117,-0.2674,0.241,-9.8117,0.7312,1.6029,1.1022,94
-0.0537,-9.7913,0.0276,0.0558,-9.7913,0.2342,1.6224,1.1582,95
-1.0927,-9.8142,-0.3055,0.3851,-9.8142,0.4597,2.0962,1.4743,96
-0.4901,-9.7912,-0.1131,0.2289,-9.7912,0.4869,1.3069,1.031,97
-0.2775,-9.7914,0.2116,0.2598,-9.7914,0.4233,0.9903,0.7888,98
-0.1511,-9.7973,-0.0266,0.1113,-9.7973,0.2648,0.9038,0.8311,99
-7.9455,-9.7679,-0.8857,2.5403,-9.7679,2.4729,5.1152,2.4376,100
-6.4349,-9.8132,-2.6426,2.7547,-9.8132,1.5632,5.8088,4.0544,101
-6.2621,-9.7426,-1.1652,2.6693,-9.7426,2.0856,5.1109,2.1377,103
-1.7403,-9.7361,1.2547,1.9072,-9.7361,1.7194,4.6014,2.1443,104
-6.9177,-9.71,6.2668,7.8694,-9.71,4.8983,13.0868,9.9593,105
-30.3951,-9.8263,-2.3336,7.9175,-9.8263,4.0851,14.154,6.5086,106
-7.0323,-9.901,2.0695,5.9573,-9.901,3.8173,14.7083,8.0986,107
-7.0349,-9.7909,1.8917,6.7365,-9.7909,5.4856,18.7524,12.3106,108
-12.6397,-9.8443,23.0448,36.2767,-9.8443,7.5466,47.6241,32.7981,109
-21.8758,-9.818,14.1608,31.9071,-9.818,11.6064,44.8259,27.0672,110
-23.8659,-9.7629,-2.5094,11.953,-9.7629,6.2611,13.5165,7.208,111
-10.4969,-9.7938,1.4459,7.1469,-9.7938,7.841,32.9154,20.8166,113
-13.4933,-9.3617,2.0443,8.6301,-9.3617,4.7378,17.3899,10.4559,114
-23.2098,-9.937,-2.316,7.5298,-9.937,5.0801,23.0762,10.7801,115
-23.2833,-9.5474,-2.6494,14.7566,-9.5474,5.2681,21.3048,12.9255,116
-14.8991,-10.5769,8.0702,18.1341,-10.5769,9.9266,33.7744,16.4745,117
-29.1057,-9.6676,20.9742,45.651,-9.6676,15.9888,38.4449,28.1062,118
-41.3266,-10.2376,-11.3228,18.051,-10.2376,5.2363,21.4739,15.2397,119
-53.7527,-10.1331,-2.4942,21.5378,-10.1331,10.5954,48.4437,18.8506,120
-26.0226,-9.5139,17.7857,29.6105,-9.5139,14.7909,23.8559,22.2032,121
-91.8623,-9.246,0.1327,20.6732,-9.246,8.198,26.6671,13.1042,123
-31.1541,-9.673,-2.4012,13.8731,-9.673,8.1137,25.7002,15.9852,124
-51.5769,-8.4487,-4.7455,22.5628,-8.4487,4.6307,32.9581,20.1445,125
-45.0532,-6.1913,-0.7936,21.1171,-6.1913,3.4091,22.4112,12.3076,126
-0.5253,-8.98,6.9432,8.7183,-8.98,5.5143,18.0116,16.2465,127
1.9533,-8.2847,12.2709,7.0913,-8.2847,7.5258,29.9046,17.8925,128
-15.8504,-9.431,32.5809,33.3237,-9.431,9.5341,42.6016,29.9799,129
-23.81,-9.4758,15.2786,35.2087,-9.4758,10.2834,40.9058,18.4596,130
-13.6947,-10.2892,10.8372,17.6361,-10.2892,14.2631,37.1764,25.0996,131
-45.0193,-8.9343,4.4582,23.1321,-8.9343,11.2402,39.3304,19.4029,133
-8.0848,-9.4494,4.744,10.7124,-9.4494,7.9366,24.2363,17.8118,134
-52.6632,-9.8695,14.3587,40.1707,-9.8695,11.5878,45.5052,26.6865,135
-0.6565,-9.6382,9.0933,12.2227,-9.6382,6.0579,22.3424,17.1958,136
-6.9883,-9.8122,2.2748,5.727,-9.8122,1.4955,15.3007,8.636,137
-17.3487,-9.5896,-1.05,10.2462,-9.5896,4.4871,19.2877,15.8238,138
-0.891,-9.9059,24.7492,27.1811,-9.9059,10.9239,24.0508,17.725,139
-15.2778,-9.9308,1.7512,13.3499,-9.9308,8.9608,38.2812,19.6953,140
-1.102,-9.5833,6.8535,8.198,-9.5833,6.8143,26.3515,13.9531,141
-29.0876,-9.7878,-0.9073,7.7231,-9.7878,6.3598,27.3095,10.3343,143
-10.3699,-10.2602,3.0238,9.0428,-10.2602,5.7101,19.6384,18.4758,144
-21.5934,-9.8071,1.7697,13.0223,-9.8071,3.8024,22.7881,14.5916,145
-11.6931,-9.9941,-2.7874,4.0922,-9.9941,7.0757,11.8098,8.2582,146
-13.4946,-9.9939,-9.554,3.1878,-9.9939,5.8293,32.6256,24.6452,147
-1.371,-10.1205,5.3337,6.8172,-10.1205,4.835,16.497,13.7927,148
-5.4899,-9.6795,3.8386,4.7903,-9.6795,4.7366,18.8369,7.0238,149
-9.9624,-9.8006,6.9693,8.7659,-9.8006,6.8012,25.1864,11.365,150
-11.083,-9.92,7.4175,15.759,-9.92,12.2349,27.9526,15.388,152
-38.7775,-9.4167,6.5816,40.5175,-9.4167,5.379,32.478,23.5248,153
-6.6996,-9.8993,5.1255,6.7013,-9.8993,3.1463,19.2994,12.3697,154
-5.1448,-10.1225,-1.5189,2.5236,-10.1225,4.4348,20.4426,18.3693,155
-2.3165,-9.5386,13.4773,10.4486,-9.5386,5.2602,22.6548,16.7908,156
-2.0814,-9.6851,1.0501,2.1445,-9.6851,3.9194,18.6536,13.8469,157
-4.004,-9.6797,-0.5063,2.4831,-9.6797,0.8393,6.1046,5.418,158
1.6363,-9.6379,3.2774,1.4808,-9.6379,1.6834,7.8543,6.5024,159
-5.8105,-9.9929,9.7693,11.6546,-9.9929,4.5979,48.0459,16.6137,160
-8.9123,-9.9507,2.2,6.3447,-9.9507,1.614,56.5527,51.0509,161
-7.1492,-10.1017,-1.9838,2.4524,-10.1017,2.3712,47.4035,45.1395,163
-11.4983,-9.7042,1.0643,5.738,-9.7042,4.1424,46.7999,10.5602,164
-3.6032,-9.8623,13.3763,14.6342,-9.8623,4.4205,29.3908,24.6503,165
-16.9109,-9.9659,22.7039,37.0456,-9.9659,10.0286,45.402,35.7105,166
-12.6089,-10.0163,10.3147,13.9635,-10.0163,3.0514,69.6737,55.3245,167
-2.4831,-9.5699,1.2563,3.718,-9.5699,6.8789,24.5393,12.4784,168
-6.7485,-9.7949,-2.9286,2.0369,-9.7949,2.3165,23.367,19.3303,169
-4.8504,-10.0462,4.3504,5.7796,-10.0462,4.2022,18.5148,11.1484,170
-4.6607,-9.2052,0.0651,2.7933,-9.2052,5.0701,18.327,12.1842,171
-11.9729,-9.8325,-0.183,4.3609,-9.8325,7.0747,21.8785,8.4712,173
-5.2636,-9.9487,-0.3817,4.845,-9.9487,3.0446,11.4198,8.6073,174
-1.3195,-9.7133,0.9903,1.7593,-9.7133,3.1475,11.4373,10.2668,175
-0.042,-10.0343,5.841,6.1907,-10.0343,5.2819,25.7284,13.971,176
-1.3099,-9.7777,8.8521,8.4038,-9.7777,2.2755,19.8475,19.2148,177
-1.018,-10.2012,0.6209,1.4347,-10.2012,1.7302,10.0651,6.9488,178
-13.9923,-9.6587,4.1927,11.4501,-9.6587,3.9659,24.2389,20.567,179
-22.9963,-9.7715,-0.8131,10.4318,-9.7715,9.2532,30.6092,12.4313,180
-8.7062,-9.83,-3.713,3.8808,-9.83,2.9919,23.7039,21.9341,181
-83.3657,-9.824,3.1528,48.8637,-9.824,21.0797,47.6086,30.554,183
-0.4951,-9.7986,1.4449,2.6512,-9.7986,2.0054,29.1526,17.0109,184
-51.9434,-9.5394,-15.4596,17.059,-9.5394,4.97,28.6192,16.2193,185
-38.1732,-9.2165,-4.4783,15.2683,-9.2165,5.2823,19.8619,16.1851,186
-3.9244,-9.2633,0.9318,3.9413,-9.2633,4.7814,36.3647,13.3423,187
-2.4192,-9.5458,3.0737,4.614,-9.5458,6.0268,15.3343,12.6018,188
-7.2538,-8.7279,1.9195,9.4225,-8.7279,5.5161,16.824,11.5169,189
-22.2573,-9.929,17.0244,20.0324,-9.929,16.7663,33.8184,24.4873,190
-82.3467,-9.8681,3.4558,33.8706,-9.8681,15.2802,54.0915,26.418,192
-15.274,-10.095,0.0705,9.1508,-10.095,9.4539,18.2492,16.8834,193
-20.3189,-6.8858,7.5435,16.8652,-6.8858,9.8421,40.7638,30.0818,194
-11.5024,-10.0003,9.0217,17.9328,-10.0003,10.856,57.8147,46.8581,195
-50.7916,-9.2177,16.4431,44.927,-9.2177,10.7554,51.5126,34.8945,196
-29.0795,-9.733,-1.9053,14.0122,-9.733,10.6862,29.5607,14.708,197
-3.12,-10.071,-0.9327,1.8307,-10.071,1.2064,20.5961,17.175,198
-5.8496,-10.1483,-0.0984,3.1884,-10.1483,5.515,33.0271,15.0469,199
-31.3593,-9.8465,4.5917,17.5598,-9.8465,10.1297,27.1373,16.9395,200
-88.3747,-9.8882,25.2139,64.3242,-9.8882,24.1128,68.9914,28.4788,202
-39.1773,-8.1305,-1.3662,16.9375,-8.1305,7.6727,31.3447,23.3782,203
-19.3769,-9.5465,-2.3497,9.3463,-9.5465,4.5918,25.9232,14.2286,204
-28.9973,-9.6238,-3.9793,12.7565,-9.6238,3.6707,47.9814,27.981,205
-8.9819,-9.7387,7.7089,13.3491,-9.7387,12.7289,34.9847,31.8275,206
-9.3136,-9.3467,1.8194,6.2829,-9.3467,6.7189,18.6154,11.6519,207
-43.8123,-10.0302,27.7902,52.2587,-10.0302,9.8192,37.7691,23.0548,208
-34.7467,-10.4355,26.4981,40.7897,-10.4355,9.7143,41.4907,36.8889,209
-39.9309,-9.8426,-3.7199,12.96,-9.8426,6.8654,31.9753,16.3812,210
-41.3524,-9.7422,0.9641,20.6748,-9.7422,11.97,37.7627,14.9996,212
-34.7208,-9.6339,3.227,18.6497,-9.6339,11.8927,54.5899,36.3753,213
-13.7189,-10.1825,-5.8287,5.6955,-10.1825,5.5165,32.1772,25.425,214
-19.1425,-9.1498,6.4554,14.3605,-9.1498,7.6559,21.0678,14.4895,215
-27.1934,-9.5646,-9.3491,10.6583,-9.5646,9.624,38.6884,26.5315,216
1.6285,-10.0542,51.2883,44.9712,-10.0542,22.0129,43.2537,33.0417,217
-28.8729,-9.7317,6.2496,19.2288,-9.7317,3.3906,20.8384,17.9979,218
-36.3712,-9.7886,-7.0162,15.3596,-9.7886,4.4524,23.0053,12.6212,219
-12.7761,-9.7,-0.2581,8.1149,-9.7,5.4073,31.0704,10.2171,220
-29.125,-9.6918,-4.5812,11.3847,-9.6918,8.248,15.7774,6.0023,222
-67.8253,-9.5631,-0.4471,23.2989,-9.5631,9.448,19.8327,8.1484,223
1.5559,-9.7642,5.0422,2.3081,-9.7642,2.3785,9.0291,4.7613,224
-24.1448,-9.7473,-10.331,9.225,-9.7473,6.7183,15.1642,11.0122,225
-27.6297,-9.723,-8.4091,21.0603,-9.723,10.1932,14.669,9.6005,226
0.0887,-9.7586,2.8097,1.6622,-9.7586,1.4165,5.5377,3.7816,227
-7.1146,-9.7655,-3.4041,2.3751,-9.7655,1.9138,8.6474,4.4749,228
-2.4741,-9.7346,2.5717,3.7842,-9.7346,2.7242,4.7972,2.664,229
-5.4929,-9.7633,1.5347,4.3109,-9.7633,3.7177,6.7754,3.8494,230
0.584,-9.7794,1.0354,0.4097,-9.7794,0.4815,2.0323,1.4283,231
-15.9298,-9.7861,-0.2698,5.9693,-9.7861,5.4383,14.0093,3.676,233
-7.113,-9.8017,-1.1389,2.3609,-9.8017,2.2012,7.8618,3.334,234
-3.3958,-9.7807,0.0575,2.3884,-9.7807,2.8755,3.7361,3.0109,235
0.6179,-9.7636,2.8498,1.5846,-9.7636,1.9231,8.6189,4.8088,236
-4.1569,-9.8341,-0.9607,2.2965,-9.8341,2.6722,7.7138,3.7074,237
-0.2246,-9.8022,-0.0616,0.0926,-9.8022,0.2929,1.2669,0.9917,238
-0.3634,-9.7929,-0.0495,0.2551,-9.7929,0.6404,2.4945,2.1569,239
-0.736,-9.8157,-0.008,0.3211,-9.8157,1.4792,2.5034,1.6837,240
-0.7663,-9.8038,-0.0928,0.1669,-9.8038,0.6553,2.5937,1.2804,242
-7.1796,-9.7728,0.1079,2.6844,-9.7728,2.7656,6.9655,2.2165,243
-17.5538,-9.8086,-0.9601,7.8668,-9.8086,4.1656,10.929,4.8557,244
-51.3555,-9.7848,-6.3465,18.5827,-9.7848,5.3272,13.6127,4.9198,245
-5.8964,-9.6743,3.4835,6.3208,-9.6743,2.7807,9.7868,6.3574,246
-20.2412,-9.702,-11.6891,7.7504,-9.702,1.7947,14.4093,9.3934,247
-0.4962,-9.6797,3.9098,4.947,-9.6797,3.0269,7.6773,4.5218,248
7.1572,-9.7044,21.25,7.7454,-9.7044,3.7079,19.1651,13.3591,249
-10.2245,-9.7432,-2.6808,2.5088,-9.7432,1.9078,6.9809,1.9738,250
1.0721,-9.7398,2.7676,1.1495,-9.7398,1.0323,3.5525,2.651,251
-0.903,-9.7646,-0.2264,0.5904,-9.7646,0.6271,1.1732,0.9903,253
0.36,-9.7818,1.3173,0.722,-9.7818,0.8384,3.1605,2.0487,254
-0.803,-9.7954,0.1168,0.4311,-9.7954,0.7785,1.521,1.0324,255
-1.3079,-9.782,-0.6632,0.3867,-9.782,0.4815,1.8216,1.06,256
-3.2773,-9.7838,-0.749,1.2645,-9.7838,1.7336,4.0304,1.6225,257
-0.4425,-9.7745,0.1878,0.3919,-9.7745,0.5618,1.701,0.8105,258
-6.4767,-9.7089,-1.6249,2.2896,-9.7089,1.8452,6.9174,3.8849,259
-88.1776,-10.0204,-5.8153,21.5922,-10.0204,8.3513,112.9472,87.5601,260
-20.352,-9.8995,5.9753,14.5976,-9.8995,11.8843,95.901,75.267,262
-7.3629,-9.7921,3.1605,9.0069,-9.7921,6.5691,29.9293,6.3818,263
-13.7505,-9.7809,-6.6724,4.3513,-9.7809,1.2368,10.7726,8.4067,264
-2.0408,-9.7623,1.0383,2.5384,-9.7623,2.8962,6.5475,4.7977,265
-6.7295,-9.7336,-2.7577,2.789,-9.7336,2.5219,8.1717,3.4105,266
-8.6215,-9.767,-1.0694,3.4201,-9.767,2.3764,4.3502,2.9024,267
-35.2228,-9.8909,-3.082,16.4775,-9.8909,4.1809,14.8599,9.9831,268
-97.6386,-9.6029,-8.3272,36.3087,-9.6029,11.42,26.4646,12.6832,269
-46.03,-9.65,5.2556,28.8449,-9.65,10.5183,46.6824,10.4762,270
-17.4251,-9.7863,-0.2064,4.5724,-9.7863,3.5646,12.243,3.6148,271
-11.4621,-9.7866,0.6468,4.2693,-9.7866,4.9856,9.5861,5.0691,273
-14.4306,-9.8059,-2.4552,5.1826,-9.8059,3.0882,8.4204,4.2089,274
-0.9713,-9.8312,1.5338,2.8335,-9.8312,2.3194,7.0923,5.2395,275
-21.077,-9.7725,-3.1947,10.2912,-9.7725,3.9228,11.3441,7.0491,276
-15.4573,-9.8284,2.6314,8.0293,-9.8284,4.0538,35.717,20.4194,277
-26.0458,-9.8072,-4.0787,8.0982,-9.8072,3.4779,13.1849,3.7623,278
-2.8996,-9.6724,2.2653,2.4449,-9.6724,1.3328,23.5484,7.7641,279
-5.4606,-9.7891,1.9646,7.0005,-9.7891,3.0829,26.4255,15.6712,280
-36.5459,-9.7437,-2.2476,16.5256,-9.7437,2.4698,22.7962,19.9437,281
-9.312,-9.8652,14.6315,28.7326,-9.8652,13.1746,60.2149,23.2022,283
-50.009,-9.738,2.875,21.8698,-9.738,10.3099,45.1034,18.3078,284
-13.0503,-9.8684,0.8687,13.1198,-9.8684,7.72,24.4926,21.3239,285
-0.0928,-9.9679,1.8422,2.2442,-9.9679,1.5866,13.9136,11.724,286
-0.6756,-9.7225,-0.0295,0.2841,-9.7225,0.9961,5.109,2.3702,287
-5.3198,-10.0176,0.0303,2.0362,-10.0176,2.7935,10.3072,6.417,288
0.8751,-10.1597,4.6266,2.8786,-10.1597,5.8643,22.6267,18.592,289
-8.9409,-9.6785,2.815,6.9795,-9.6785,4.2692,22.7122,13.8737,290
-3.617,-10.2239,0.2665,2.5972,-10.2239,2.5613,19.0372,13.2183,291
-51.0096,-9.8003,2.7706,17.141,-9.8003,8.394,38.4066,15.7901,293
-42.6625,-10.0314,18.8197,29.0641,-10.0314,15.3202,54.8574,37.0687,294
-9.6039,-8.9991,-0.8415,6.0581,-8.9991,2.8357,25.6351,23.0477,295
-24.7825,-9.7998,7.716,30.1265,-9.7998,9.1775,48.1476,26.7295,297
-1.4206,-9.4804,39.9448,22.1742,-9.4804,6.3421,36.9361,27.4371,298
-14.387,-8.6827,1.2824,12.7753,-8.6827,4.274,21.3589,12.1912,299
-7.8257,-9.7775,4.4904,9.4921,-9.7775,5.5933,24.4552,13.3334,300
-59.2908,-9.7422,5.0374,13.662,-9.7422,6.643,27.2673,12.9421,302
-18.8867,-9.5894,-2.8228,9.0865,-9.5894,3.073,16.5063,9.9871,303
-5.3907,-9.7304,-0.2067,3.5316,-9.7304,2.7063,9.7446,6.9289,304
0.0164,-9.9394,3.3017,5.9257,-9.9394,5.8505,13.9803,12.4583,305
-12.5274,-9.648,2.49,11.2345,-9.648,4.3871,13.9199,11.9591,306
-13.2752,-9.8084,-0.2641,6.2666,-9.8084,4.632,19.7462,6.6168,307
-0.1549,-9.8537,1.8752,1.5073,-9.8537,4.5383,10.2963,7.7897,308
-0.7299,-9.8423,4.2884,2.5606,-9.8423,1.2746,10.9646,7.2575,309
-24.6096,-9.7998,4.8433,12.1156,-9.7998,6.5476,22.325,12.459,310
-5.6711,-9.8633,-1.8524,2.2782,-9.8633,1.3731,5.5666,4.6627,311
-34.7332,-9.8558,2.5371,12.496,-9.8558,6.6617,39.856,12.6602,313
-3.3011,-9.7349,0.6717,2.1048,-9.7349,3.5232,10.7547,7.4574,314
-0.1924,-9.9646,0.2915,0.3949,-9.9646,1.1222,8.754,7.2619,315
-3.7453,-9.8267,1.7184,5.4023,-9.8267,2.9382,12.312,6.2245,316
-38.8357,-9.7658,-5.8035,18.3788,-9.7658,4.6523,22.9121,7.6486,317
-74.6606,-9.8784,-25.1617,37.362,-9.8784,4.129,36.5279,21.2474,318
-6.7408,-9.9414,0.0136,3.8324,-9.9414,1.4353,9.7799,6.8601,319
-11.8188,-9.7568,0.7985,5.1725,-9.7568,3.2701,32.2549,9.8325,320
-0.4711,-9.9206,5.7877,4.9757,-9.9206,2.8716,24.0698,11.9381,321
-14.6027,-9.7866,0.2734,4.7475,-9.7866,4.3733,17.1983,7.2765,323
-4.4783,-9.9318,-1.2537,2.0447,-9.9318,0.9628,14.0074,8.2594,324
-17.6903,-9.8994,6.0109,17.1123,-9.8994,10.413,40.8765,8.7613,325
-15.3909,-9.9264,-1.1381,13.7279,-9.9264,3.2078,15.4849,11.4366,326
-2.6629,-9.8946,0.326,1.719,-9.8946,2.2265,6.8565,4.553,327
-10.3093,-9.8445,3.2782,8.4811,-9.8445,3.2982,16.3644,11.2346,328
-16.6959,-9.8885,-4.4715,7.927,-9.8885,2.2626,19.9244,17.8232,329
-12.3626,-9.6642,0.1689,7.0026,-9.6642,2.1222,14.7095,9.3153,330
-1.4832,-9.9434,3.4136,4.7212,-9.9434,2.2599,13.0417,10.3331,331
-32.4233,-9.5857,11.9503,26.501,-9.5857,15.7326,63.076,21.0099,332
-5.3085,-9.9191,2.8419,3.7274,-9.9191,5.0024,27.4058,11.2857,333
-5.829,-9.8259,-1.056,2.5958,-9.8259,1.1156,8.6937,5.9723,334
-0.4572,-9.9236,0.5426,1.0511,-9.9236,4.1156,14.9696,10.9745,335
-9.5009,-9.7104,-0.8314,5.0873,-9.7104,4.1561,18.2852,8.684,336
-3.7774,-9.8216,0.4056,3.2011,-9.8216,2.3544,9.5129,6.8754,337
-8.1718,-9.8622,-0.595,4.4691,-9.8622,2.5163,16.5626,10.6145,338
-18.9797,-9.7463,-0.4755,10.1845,-9.7463,2.1334,12.6679,10.3807,339
-6.9007,-9.7258,0.833,3.0331,-9.7258,3.3853,14.57,7.8094,340
-14.1347,-9.8093,2.7911,9.0126,-9.8093,5.329,35.1765,10.9959,342
-14.5264,-9.8918,6.3936,10.067,-9.8918,3.3735,36.0562,23.7454,343
-4.433,-9.9664,-0.0024,2.094,-9.9664,1.1496,20.879,13.5421,344
0.3296,-10.45,6.6857,5.7806,-10.45,2.5064,27.5213,19.454,345
-11.154,-9.8326,2.6221,7.8888,-9.8326,5.464,29.2517,16.0598,346
-6.8546,-9.5773,1.3835,5.575,-9.5773,1.9462,19.1466,13.4796,347
-11.9107,-10.0195,1.8911,6.4312,-10.0195,2.7231,21.7339,15.9374,348
-9.0457,-9.2424,1.7895,7.1167,-9.2424,5.5046,40.8931,34.9848,349
-32.8614,-9.8706,-5.0609,15.5808,-9.8706,4.0832,35.1624,25.2583,350
-3.9597,-10.173,0.8452,3.7016,-10.173,3.9504,18.9523,14.5261,351
-8.9984,-9.7591,1.4856,5.1168,-9.7591,4.8948,21.5075,9.1719,353
-15.0108,-9.8639,6.3509,14.6536,-9.8639,8.4453,32.7123,18.325,354
-15.2749,-9.5537,1.723,11.7344,-9.5537,7.4684,29.547,24.072,355
-65.0069,-9.9046,4.3998,49.2719,-9.9046,3.7622,36.1885,26.2791,356
-50.3349,-10.4068,-15.9414,17.9767,-10.4068,9.8241,56.482,52.1969,357
-31.1347,-9.669,9.4758,24.6782,-9.669,12.0611,51.7984,16.4914,369
-40.8251,-9.7832,-1.8446,10.7709,-9.7832,5.5761,29.5851,14.0694,370
-9.0705,-9.4866,1.2904,5.6979,-9.4866,4.5222,18.9666,9.3437,371
-8.3673,-9.7789,8.3478,10.5018,-9.7789,7.8105,32.8297,15.4209,372
-6.2289,-9.4684,7.6156,9.4593,-9.4684,7.0719,26.2658,14.5434,373
-14.1302,-8.7648,-1.2418,11.803,-8.7648,7.6002,18.1681,14.1337,374
-17.2247,-9.606,3.7765,9.9488,-9.606,7.395,21.2374,11.2929,375
-19.8655,-9.9756,8.7402,28.6775,-9.9756,8.4204,26.1946,21.2315,376
-29.6061,-8.8881,-1.5571,21.0506,-8.8881,6.4998,25.3969,18.678,377
-0.7509,-9.4509,13.5197,16.2063,-9.4509,8.8776,41.7625,31.1066,378
-13.0664,-9.6452,12.2134,37.597,-9.6452,11.0511,37.2503,31.5469,379
-44.3868,-7.924,-9.821,24.1156,-7.924,12.3464,47.2969,27.4674,380
-36.3052,-9.3894,2.2508,24.3319,-9.3894,7.6425,28.4207,16.6745,381
-70.0593,-9.9927,6.262,31.1728,-9.9927,9.4948,50.5641,18.3124,382
-20.0389,-9.8476,9.9564,26.7766,-9.8476,7.2342,33.609,23.5516,383
-17.3325,-9.3582,2.774,10.9534,-9.3582,7.3535,27.9674,10.6719,384
-70.0672,-8.0359,6.0661,27.9067,-8.0359,12.1297,58.0309,24.8237,385
-12.9663,-9.3958,2.0305,8.6696,-9.3958,6.4972,28.0356,11.5866,386
-11.3854,-9.7744,8.4469,15.9543,-9.7744,11.4569,33.7472,17.5085,387
-19.3601,-9.8401,-0.8209,5.8529,-9.8401,3.9119,14.4793,10.1132,388
-51.9798,-10.0831,4.9775,17.6473,-10.0831,10.4326,57.7179,32.9506,389
-16.6489,-10.1902,2.7628,8.6861,-10.1902,11.3011,51.2074,38.0681,390
-6.8889,-9.7311,8.5971,12.1267,-9.7311,7.9919,24.9237,19.585,391
-21.4989,-9.835,5.4184,12.4122,-9.835,6.1988,28.3134,18.8549,392
-106.1925,-9.9617,6.7964,31.1956,-9.9617,10.2003,37.1838,19.3531,393
-456.0628,-9.7993,-5.3621,126.3579,-9.7993,16.4498,82.1109,44.7904,394
-42.3293,-9.7365,8.8659,33.3492,-9.7365,11.0239,52.085,48.4839,395
-7.1282,-10.1918,57.9958,66.3225,-10.1918,13.2981,79.8872,62.8622,396
-28.7062,-9.6396,-3.1724,12.823,-9.6396,5.0099,14.6729,10.0488,397
-2.1871,-9.8192,5.7675,6.6134,-9.8192,8.0681,29.912,13.6253,398
-2.3724,-9.9724,0.2415,1.5922,-9.9724,2.9395,27.9346,16.8706,399
-10.3726,-9.3387,-2.4007,4.7204,-9.3387,4.7724,21.052,10.4493,400
-21.5127,-9.9534,0.1844,6.1678,-9.9534,4.233,38.393,27.1652,401
-11.2493,-10.3868,4.493,8.8119,-10.3868,5.349,64.5694,42.4529,402
-10.8708,-10.2605,9.8192,15.4993,-10.2605,4.7163,56.925,45.1842,403
-12.4242,-10.4138,2.957,13.3228,-10.4138,8.6008,58.2902,52.7058,404
-4.4465,-10.0456,-0.8974,2.2941,-10.0456,3.0654,28.0146,20.151,405
-12.2884,-9.8861,1.5422,9.1539,-9.8861,7.1002,24.8088,23.9952,406
-14.2239,-9.9019,-0.5912,7.4369,-9.9019,7.6626,34.6639,14.7817,407
-29.4618,-9.9053,4.734,28.4317,-9.9053,2.2732,33.0702,22.0543,408
-18.4945,-9.6084,3.0794,16.7687,-9.6084,6.503,78.514,36.2586,409
-53.2851,-9.9792,26.4472,50.8675,-9.9792,4.9068,38.3105,22.5218,410
-8.9707,-9.5769,29.7099,38.2577,-9.5769,4.9229,58.1818,33.198,411
-3.087,-9.9333,1.0815,2.5605,-9.9333,4.0622,23.1009,11.4042,412
-4.7852,-10.0039,7.9654,8.7598,-10.0039,3.6275,29.1014,21.1253,413
-9.7429,-9.978,15.2851,26.3289,-9.978,11.2687,29.8039,16.7746,414
-17.2498,-9.941,16.304,25.0788,-9.941,2.2102,28.2603,20.345,415
-17.5338,-9.832,8.2917,17.0467,-9.832,7.0146,40.638,29.9735,416
-15.0146,-9.8393,2.4979,12.5342,-9.8393,7.0296,33.3405,12.3104,417
-24.2859,-9.6389,13.0822,29.744,-9.6389,7.4227,37.2334,18.5002,418
-6.2257,-9.708,2.0797,5.0575,-9.708,3.3207,26.6326,7.5686,419
-11.7697,-9.7481,3.8507,11.9228,-9.7481,7.5984,27.5712,22.1954,420
-105.0338,-9.9944,22.7942,46.8917,-9.9944,23.721,86.243,41.0249,421
-55.0293,-9.979,40.7238,60.9682,-9.979,17.0724,93.0447,32.0355,422
-10.2627,-9.8633,9.7257,12.6498,-9.8633,9.8752,44.3142,24.328,423
-10.4592,-9.883,20.337,23.0942,-9.883,13.504,53.4905,23.2397,424
-15.6517,-8.7903,16.8305,21.4143,-8.7903,5.6889,24.9952,18.4064,425
-35.8145,-9.8579,3.7332,18.9968,-9.8579,6.5182,54.8124,19.9974,426
-112.6398,-9.9093,4.7415,45.2419,-9.9093,11.6063,58.3656,33.0024,427
3.3236,-9.654,12.645,8.2421,-9.654,4.4704,32.5957,18.7954,428
-11.3819,-9.7877,4.3478,10.0772,-9.7877,4.2333,32.5868,14.6261,429
-13.4556,-10.0098,12.0891,28.907,-10.0098,7.911,51.6014,17.3132,430
-57.1259,-10.1427,-5.084,16.003,-10.1427,7.8958,34.2294,18.9572,431
-7.9424,-9.5957,0.635,4.6738,-9.5957,3.4675,14.6234,8.7054,432
-22.63,-9.7542,16.7285,29.1216,-9.7542,10.2645,50.0447,21.4269,433
-16.8146,-9.956,1.5485,9.4101,-9.956,6.5733,23.9858,10.2292,434
-17.9367,-9.8223,-1.4124,7.4708,-9.8223,4.1941,18.6754,11.6951,435
-3.7523,-9.9823,1.8969,4.6148,-9.9823,3.2132,15.0909,9.1969,436
-8.2857,-9.3608,0.6564,4.4474,-9.3608,6.1927,22.5925,18.5769,437
-20.5481,-7.6989,6.794,16.78,-7.6989,10.5651,34.0675,31.8861,438
-8.9608,-9.8523,2.0395,6.2847,-9.8523,3.8545,23.8188,11.8599,439
-39.3422,-10.1123,4.5682,20.1703,-10.1123,9.7027,56.5012,22.8628,440
-16.5373,-9.2067,-1.9748,6.2813,-9.2067,5.1448,12.426,7.8138,441
-12.5118,-9.9132,1.3584,6.6786,-9.9132,4.6302,28.7478,23.779,442
-21.7221,-9.6961,2.6893,9.8919,-9.6961,8.766,29.7439,17.5813,443
-19.7328,-9.599,1.4,8.7352,-9.599,6.6018,30.7811,15.6952,444
-10.0795,-10.486,-1.5315,6.0588,-10.486,1.8684,13.627,10.3541,445
-18.5629,-9.9791,0.3185,8.1557,-9.9791,4.6417,24.2729,17.6981,446
3.9868,-9.9357,9.7018,4.3719,-9.9357,0.5875,17.9451,9.9376,447
-0.184,-10.172,4.7786,7.3068,-10.172,6.2013,24.1507,20.2812,448
-7.1096,-9.2918,3.1316,9.7807,-9.2918,4.8224,24.2213,12.3045,449
-7.1457,-10.1885,0.0703,4.5884,-10.1885,6.172,19.9292,15.5038,450
-14.6881,-10.5947,-1.3728,8.6185,-10.5947,8.4932,47.0309,39.1689,451
-7.1657,-9.7187,3.5746,7.9293,-9.7187,3.7679,18.1097,13.6871,452
-7.2643,-9.6381,3.1442,8.2413,-9.6381,3.3508,21.8719,12.6787,453
-29.7672,-9.8974,-1.5552,8.8626,-9.8974,7.0532,19.6135,10.1633,454
-4.9379,-9.4248,8.7882,13.0808,-9.4248,8.3867,16.6698,12.4287,455
-16.2102,-8.7053,-5.4866,6.5345,-8.7053,4.3757,32.6061,12.7875,456
-20.0772,-9.9564,-0.2664,9.1422,-9.9564,4.9302,17.8547,10.0661,457
-122.4905,-9.4361,11.3866,68.8394,-9.4361,15.6826,46.3913,29.9815,458
-44.6014,-9.8381,20.0212,33.0985,-9.8381,12.9794,57.6941,36.1752,459
-62.4471,-9.9221,8.1699,50.5712,-9.9221,12.8546,57.983,14.7748,460
-23.519,-10.1811,1.5805,15.7923,-10.1811,7.9945,36.3262,26.6268,461
-23.3602,-9.9477,23.7054,30.6835,-9.9477,14.9234,61.3953,21.9102,462
-86.1841,-9.2106,-2.8957,29.1734,-9.2106,7.3617,50.6035,14.0208,463
-50.8639,-9.8482,0.3916,19.921,-9.8482,8.7725,40.6077,16.4244,464
-15.1544,-9.6523,5.0236,9.559,-9.6523,6.2928,22.2388,15.8838,465
-14.4499,-9.9713,2.2898,8.7175,-9.9713,8.6125,26.7177,17.8684,466
-1.392,-9.9415,2.7223,5.7635,-9.9415,4.3016,21.4478,19.3723,467
-4.871,-9.883,0.6573,3.0434,-9.883,2.7481,12.0221,9.079,468
-11.6178,-9.7184,-1.3952,5.1633,-9.7184,2.8906,12.6916,5.7806,469
-6.7032,-9.751,5.7474,7.463,-9.751,2.4357,17.9541,11.0592,470
-3.1452,-9.6652,-1.5019,1.2102,-9.6652,2.8342,10.3319,4.1838,471
-18.4065,-9.7411,2.947,7.1283,-9.7411,6.2892,22.8975,11.0999,473
-6.011,-9.912,1.0297,2.8231,-9.912,3.5144,18.229,8.864,474
-11.2576,-9.7213,-0.0949,5.3343,-9.7213,4.3528,14.453,8.8688,475
-6.7848,-10.0505,10.4163,12.8786,-10.0505,9.95,37.5823,25.8661,476
-79.5014,-9.959,28.9759,80.5953,-9.959,4.5781,39.6783,34.059,477
-3.3577,-10.738,8.6555,12.4377,-10.738,8.4508,43.4671,41.8747,478
-28.3366,-10.1129,37.2419,56.3127,-10.1129,11.427,75.2233,36.3688,479
-20.6637,-9.7612,13.4324,37.4921,-9.7612,8.2786,42.7907,19.8987,480
-0.9323,-9.5606,6.0978,10.5921,-9.5606,8.1608,26.7073,7.3754,481
-15.7985,-9.8812,5.882,15.383,-9.8812,8.2961,29.2541,15.2179,483
-16.1688,-9.8806,9.1818,24.0532,-9.8806,10.021,31.4116,21.822,484
-1.7089,-9.7656,0.9448,2.4145,-9.7656,1.0037,10.0775,6.3015,485
-0.7797,-9.966,12.4959,11.6869,-9.966,6.8491,36.4603,23.1555,486
-4.4225,-9.8755,2.2493,4.1059,-9.8755,4.1734,17.3698,9.2015,487
-10.8555,-9.714,0.4741,6.1903,-9.714,4.2327,15.3253,7.329,488
-24.6608,-9.5393,14.8707,18.0223,-9.5393,8.7157,33.4117,19.1737,489
-15.2528,-9.8798,9.2273,16.481,-9.8798,14.2765,43.3735,21.7142,490
-7.2207,-9.6931,-0.5196,2.8732,-9.6931,2.7908,22.8616,11.3994,493
-6.128,-9.9215,0.7978,2.4076,-9.9215,2.5202,14.869,9.1013,494
-5.3226,-9.5544,4.8227,10.9761,-9.5544,4.9698,17.0184,9.7752,495
-3.3703,-9.8428,1.5481,2.7814,-9.8428,3.3927,9.5658,7.0547,496
-23.8369,-7.2213,11.1786,35.932,-7.2213,10.5224,47.238,26.5126,497
-3.3486,-9.826,3.8448,7.8319,-9.826,5.8565,15.23,8.0757,498
-6.5664,-9.8905,0.633,3.1836,-9.8905,4.8807,18.2224,11.1938,499
-0.5529,-9.853,3.157,2.1715,-9.853,5.3234,18.4196,10.3405,500
-3.9818,-10.203,1.7335,2.9852,-10.203,7.2023,16.2806,11.6274,501
-4.8253,-9.6356,-0.3276,2.1293,-9.6356,2.3616,6.1681,2.6109,502
-3.8859,-9.7223,1.6611,4.4698,-9.7223,3.7889,25.5643,13.6503,504
-1.7868,-9.443,-0.2293,0.9143,-9.443,2.2892,10.7754,6.1255,505
-72.0464,-8.7298,-4.7943,32.9266,-8.7298,13.8685,41.8636,30.3495,506
-15.5805,-9.765,-2.8639,10.303,-9.765,8.8399,17.0806,12.6675,507
-3.3652,-10.0311,6.3039,12.0659,-10.0311,5.2218,20.4958,17.9502,508
-31.6394,-9.8989,-1.723,9.8,-9.8989,4.0705,18.9208,8.9331,509
-10.2379,-10.2168,1.2655,6.9937,-10.2168,2.6163,20.386,9.3151,510
-2.1329,-9.6532,0.2278,1.3981,-9.6532,1.9343,10.5001,7.5599,511
-31.2911,-9.8136,24.4896,44.2794,-9.8136,14.4221,64.7999,26.0712,513
-18.4263,-9.6951,46.3977,51.0083,-9.6951,16.0319,66.8426,43.9249,514
-13.628,-9.4583,20.4833,29.0128,-9.4583,4.4139,40.3069,33.7687,515
-23.7273,-9.9861,20.1381,36.1564,-9.9861,5.3735,41.677,30.5651,516
-5.4412,-9.6278,3.0572,5.6979,-9.6278,5.3757,30.5412,16.6139,517
-2.5484,-10.6442,-0.6797,1.182,-10.6442,1.2728,23.0861,15.4237,518
-4.7064,-9.6381,3.8931,6.0171,-9.6381,6.2341,21.7889,11.4707,519
-0.5446,-9.9305,1.4892,3.1789,-9.9305,1.6443,7.4478,5.1366,520
-12.7861,-9.8201,0.3749,5.7749,-9.8201,4.6331,20.564,8.9085,522
-6.8272,-9.8393,2.7402,4.7181,-9.8393,3.3365,22.0385,12.596,523
-6.1852,-9.874,0.4676,4.6628,-9.874,3.1202,19.0517,8.3064,524
-10.8933,-9.8571,3.9822,14.895,-9.8571,1.4727,20.8138,9.9715,525
-19.5506,-9.7828,1.6882,6.3402,-9.7828,6.0813,21.7814,13.1965,528
-7.7391,-9.8627,-0.1693,3.2594,-9.8627,4.0209,9.4164,7.1472,529
-0.8885,-10.0489,1.4775,1.9916,-10.0489,1.1131,9.7617,7.8992,530
-26.1484,-9.8071,-3.0906,9.0039,-9.8071,6.3503,18.4335,6.232,531
-17.519,-9.6964,17.4889,24.8436,-9.6964,6.7737,21.9058,14.5325,532
-14.6617,-9.7539,-2.0124,4.1518,-9.7539,3.1119,8.4282,3.4217,534
-11.6083,-9.6332,-4.1603,6.968,-9.6332,3.3706,9.3754,8.6497,535
-10.657,-9.8325,-2.0368,3.3349,-9.8325,5.2463,43.1953,27.7643,536
-6.0098,-10.1786,1.7572,4.3246,-10.1786,1.6596,45.9616,38.8876,537
-7.3175,-9.807,-0.6464,3.773,-9.807,1.7669,27.619,22.3908,538
-35.9662,-9.8139,5.2696,19.5706,-9.8139,10.0278,41.6151,17.9405,539
-16.1829,-10.2096,3.2608,12.3668,-10.2096,6.2895,73.2415,59.2672,540
-16.2878,-9.8097,0.2498,7.2619,-9.8097,6.4343,71.0886,32.7118,543
-25.9552,-9.7568,-5.6458,11.3642,-9.7568,11.2656,38.1349,11.4993,544
-59.4384,-9.7305,-9.5825,19.5506,-9.7305,9.6863,30.227,11.3312,545
-78.6413,-9.5292,-13.182,31.6566,-9.5292,10.4227,29.3267,9.8752,546
-11.2674,-9.6178,6.9707,18.6088,-9.6178,8.7047,16.6135,6.8643,547
-6.8965,-9.6187,10.4611,10.4308,-9.6187,4.8455,11.4045,8.1177,548
-30.6382,-9.6816,-5.9008,13.6174,-9.6816,6.3359,13.0641,7.2875,549
-17.4329,-9.7586,-1.0295,12.064,-9.7586,5.4533,18.4613,13.4114,550
-11.1587,-9.7723,-0.7365,6.4317,-9.7723,8.0414,10.2062,8.1062,551
-49.3066,-9.8068,-0.886,8.5145,-9.8068,6.5255,21.8506,4.9301,553
-25.6504,-9.8049,1.9365,16.1363,-9.8049,6.7946,33.3128,4.1776,554
-102.5807,-9.5244,-8.5726,27.4622,-9.5244,6.2349,30.762,14.0421,555
-0.1132,-9.8284,0.2344,0.3883,-9.8284,0.8503,2.8064,1.3228,556
-0.3938,-9.8,0.0279,0.1518,-9.8,0.563,2.0953,0.7169,557
