AYGX_min,AZ_mean,AYGX_mean,AYGX_std,AZ_mean.1,GX_std,Gnorm_max,Gnorm_median,timestamp
-92.9046,-9.92,3.8661,30.6711,-9.92,11.1438,28.2242,13.5411,838
-21.5684,-9.9835,7.3524,13.2999,-9.9835,2.7989,34.7759,22.7765,839
-627.6545,-5.7054,-41.4991,201.2674,-5.7054,35.4544,153.3563,67.9786,840
-601.1369,-9.846,-183.2256,218.5312,-9.846,50.7748,122.2642,63.7952,841
-24.6746,-10.3923,46.8874,51.4584,-10.3923,15.4185,77.8518,64.0178,842
