timestamp,AX_mean,AX_min,AX_max,AX_median,AX_std,AX_meandiff,AX_mediandiff,AX_extremum,AX_delta,AY_mean,AY_min,AY_max,AY_median,AY_std,AY_meandiff,AY_mediandiff,AY_extremum,AY_delta,AZ_mean,AZ_min,AZ_max,AZ_median,AZ_std,AZ_meandiff,AZ_mediandiff,AZ_extremum,AZ_delta,GX_mean,GX_min,GX_max,GX_median,GX_std,GX_meandiff,GX_mediandiff,GX_extremum,GX_delta,GY_mean,GY_min,GY_max,GY_median,GY_std,GY_meandiff,GY_mediandiff,GY_extremum,GY_delta,GZ_mean,GZ_min,GZ_max,GZ_median,GZ_std,GZ_meandiff,GZ_mediandiff,GZ_extremum,GZ_delta,AYGX_mean,AYGX_min,AYGX_max,AYGX_median,AYGX_std,AYGX_meandiff,AYGX_mediandiff,AYGX_extremum,AYGX_delta,Anorm_mean,Anorm_min,Anorm_max,Anorm_median,Anorm_std,Anorm_meandiff,Anorm_mediandiff,Anorm_extremum,Anorm_delta,Gnorm_mean,Gnorm_min,Gnorm_max,Gnorm_median,Gnorm_std,Gnorm_meandiff,Gnorm_mediandiff,Gnorm_extremum,Gnorm_delta
73,-0.0018,-0.549,0.776,0.0249,0.3713,0.0294,0.0153,0.776,1.325,0.0352,-0.3154,0.3812,-0.0191,0.209,-0.0501,0.0132,0.3812,0.6965,-9.7947,-11.4547,-8.6764,-9.775,0.7784,-0.0532,-0.1053,11.4547,2.7783,0.9822,-1.9239,2.2067,1.5307,1.2762,-1.8582,-2.2327,2.2067,4.1306,0.7574,-1.4263,3.2725,0.7831,1.0191,0.597,0.2494,3.2725,4.6988,3.1032,0.6508,6.3354,2.3998,2.1593,-4.8392,-4.0882,6.3354,5.6846,0.1088,-0.1991,0.4827,0.0664,0.2131,-0.0917,-0.0441,0.4827,0.6817,9.8036,8.7183,11.4668,9.7772,0.7768,0.0518,0.1082,11.4668,2.7485,3.9279,2.0219,6.5007,3.3229,1.6691,-0.8709,-0.4352,6.5007,4.4788
74,0.0277,-0.7895,0.4944,0.0402,0.3012,0.1021,0.0853,0.7895,1.2839,-0.0149,-0.5152,0.3914,-0.006,0.2498,0.0308,0.0186,0.5152,0.9066,-9.8479,-11.1109,-8.7318,-9.8803,0.6869,-0.0147,0.1823,11.1109,2.3791,-0.876,-3.2232,1.1003,-0.702,1.1482,2.0513,1.6813,3.2232,4.3235,1.3544,-1.7238,3.7975,1.0325,1.2614,-0.5013,-0.3544,3.7975,5.5212,-1.736,-5.28,0.7129,-1.6883,1.5235,-2.2586,-2.2574,5.28,5.9929,0.0171,-0.7588,0.4797,0.0223,0.2625,-0.0569,-0.0397,0.7588,1.2385,9.8554,8.7516,11.1166,9.8853,0.6871,0.017,-0.1856,11.1166,2.365,3.057,1.3228,6.0021,2.8877,1.1571,1.3763,1.3004,6.0021,4.6793
75,0.1298,-0.4915,0.6865,0.1255,0.4059,-1.1652,-1.4706,0.6865,1.178,0.0159,-0.2406,0.2196,0.0126,0.1817,-0.0407,-0.0392,0.2406,0.4602,-9.8626,-10.6235,-9.3222,-9.698,0.4705,-0.3917,-1.0187,10.6235,1.3013,1.1753,0.0685,2.7846,0.9793,0.8664,0.5501,0.8009,2.7846,2.7161,0.8531,-0.6038,3.4388,0.6781,1.2138,1.5039,2.0256,3.4388,4.0425,-3.9946,-4.5717,-3.7377,-3.9457,0.2546,5.1219,5.1659,4.5717,0.834,-0.0398,-0.6699,0.4355,-0.0174,0.312,0.0976,-0.0362,0.6699,1.1054,9.8724,9.3505,10.6261,9.6998,0.4665,0.4522,1.0903,10.6261,1.2756,4.4333,3.8246,5.946,4.1882,0.6885,-0.732,-0.8474,5.946,2.1214
76,-1.0354,-1.653,0.0054,-1.3451,0.6376,0.4356,0.557,1.653,1.6584,-0.0248,-0.7307,0.4123,-0.0266,0.3328,-0.0459,-0.0696,0.7307,1.143,-10.2544,-13.3742,-6.3958,-10.7167,2.0093,0.2998,0.3741,13.3742,6.9785,1.7254,0.6998,2.4691,1.7803,0.54,-4.2979,-3.9505,2.4691,1.7694,2.357,-1.2513,5.845,2.7038,2.4749,1.2906,1.4263,5.845,7.0963,1.1273,0.2295,1.8979,1.2202,0.5369,-7.8096,-7.7889,1.8979,1.6685,0.0578,-0.5113,0.8859,-0.0535,0.4091,0.3361,0.1428,0.8859,1.3972,10.3246,6.3959,13.4481,10.7901,2.0319,-0.2312,-0.3974,13.4481,7.0523,3.7012,2.0539,6.2317,3.3407,1.5009,9.3064,10.1846,6.2317,4.1778
78,-0.1643,-2.7557,3.4529,-0.2312,1.7567,-0.2524,-0.2449,3.4529,6.2086,-0.1166,-1.4416,1.2932,-0.1658,0.6843,0.5593,0.3716,1.4416,2.7347,-9.6547,-14.5718,-4.1324,-9.9685,2.814,0.4062,-0.1468,14.5718,10.4395,-6.8705,-13.8808,0.1346,-6.1208,5.0907,2.975,3.1848,13.8808,14.0154,4.9383,-2.5812,18.2875,5.5563,5.0638,-3.5339,-4.1869,18.2875,20.8688,-14.4919,-37.1581,5.2096,-14.3575,16.374,-11.7521,-12.7052,37.1581,42.3677,0.7299,-10.2749,7.6166,0.232,4.1761,-4.5848,-0.8199,10.2749,17.8916,9.8623,4.4753,14.8617,9.9953,2.6825,-0.4023,0.1438,14.8617,10.3863,22.3141,11.6011,38.3628,23.71,9.4302,4.6994,3.957,38.3628,26.7617
79,-0.4166,-2.4262,0.8812,-0.476,1.064,0.0705,0.1857,2.4262,3.3075,0.4427,-1.2824,2.797,0.2059,1.1885,0.2787,0.3671,2.797,4.0794,-9.2485,-14.2906,-2.7242,-10.1153,3.6527,-0.6071,0.1837,14.2906,11.5664,-3.8955,-8.392,-0.1102,-2.936,2.7762,17.0013,15.2908,8.392,8.2818,1.4044,-7.1488,9.065,1.3694,4.5097,4.3484,3.9156,9.065,16.2138,-26.2441,-30.353,-20.2884,-27.0627,3.2629,-9.2791,-19.5917,30.353,10.0646,-3.8548,-21.5075,3.878,-0.5879,8.227,14.2634,6.2454,21.5075,25.3855,9.46,3.8562,14.584,10.1391,3.4333,0.4622,-0.1887,14.584,10.7277,27.0135,20.6622,30.4564,27.667,3.3842,13.6197,21.7966,30.4564,9.7941
80,-0.3461,-1.7935,0.7234,-0.2904,0.586,0.2205,0.2087,1.7935,2.5169,0.7214,-0.2465,2.2375,0.573,0.6108,-0.2259,-0.1234,2.2375,2.484,-9.8556,-11.608,-8.2718,-9.9316,0.9622,0.1194,0.0715,11.608,3.3362,13.1058,6.2264,19.0485,12.3549,3.9805,-1.4875,-1.741,19.0485,12.8222,5.7528,0.2537,12.0138,5.285,3.4109,-1.4786,-1.1353,12.0138,11.76,-35.5232,-64.5404,3.5547,-46.6543,22.2137,19.0469,24.5535,64.5404,68.0951,10.4085,-4.1295,38.6435,5.6575,11.1987,-3.6787,-1.1548,38.6435,42.773,9.9222,8.3798,11.7705,9.9504,0.9686,-0.1436,-0.0761,11.7705,3.3907,40.6333,10.3754,65.8303,49.4636,18.1451,-14.7757,-19.6188,65.8303,55.4548
82,0.095,-0.5342,0.6912,0.127,0.4156,0.3574,0.4819,0.6912,1.2254,0.2695,-0.2076,0.7815,0.3261,0.3692,-0.7628,-0.7127,0.7815,0.9892,-9.6168,-10.2742,-8.5559,-9.7886,0.6585,-0.2555,0.1499,10.2742,1.7183,10.1309,7.8741,14.6092,8.8729,2.5996,-15.3323,-13.9926,14.6092,6.7351,2.7956,-0.7875,5.9062,3.0144,2.1135,2.3253,2.485,5.9062,6.6938,2.5706,1.8117,3.6332,2.4527,0.6215,20.3844,18.8903,3.6332,1.8215,3.051,-1.692,7.6162,3.3479,3.7878,-0.6774,-1.3346,7.6162,9.3082,9.635,8.5594,10.3025,9.7982,0.66,0.2909,-0.1046,10.3025,1.7431,11.0819,9.0553,15.0748,10.2261,2.2449,13.0553,12.4518,15.0748,6.0194
83,0.4523,-0.5165,1.2781,0.6089,0.6384,-0.4123,-0.5721,1.2781,1.7946,-0.4933,-1.2028,0.2011,-0.3866,0.4835,0.6106,0.3441,1.2028,1.4039,-9.8722,-11.3749,-8.6882,-9.6387,0.9751,-0.0028,-0.2249,11.3749,2.6868,-5.2014,-5.9339,-4.6438,-5.1197,0.5425,6.0086,5.1659,5.9339,1.29,5.1209,2.4675,6.1513,5.4994,1.1942,-3.6503,-4.1519,6.1513,3.6838,22.955,19.266,29.7752,21.343,3.9452,-27.5453,-25.1693,29.7752,10.5092,2.3736,-1.1931,5.6486,2.0133,2.2842,-1.9237,-1.7388,5.6486,6.8417,9.9258,8.784,11.3871,9.6937,0.9442,-0.0389,0.1729,11.3871,2.6031,24.1372,20.1411,30.7638,22.6779,3.8142,-17.2714,-17.5188,30.7638,10.6227
84,0.04,-0.3693,0.4472,0.0368,0.211,0.0106,0.015,0.4472,0.8166,0.1173,-0.4147,0.9024,-0.0425,0.4281,0.0655,0.2471,0.9024,1.3171,-9.875,-10.8698,-9.2109,-9.8636,0.3931,0.0431,-0.0081,10.8698,1.6589,0.8072,-2.1762,5.077,0.0462,2.5704,2.63,2.9963,5.077,7.2531,1.4707,-1.12,3.2112,1.3475,1.0673,-0.4449,-0.3456,3.2112,4.3312,-4.5903,-15.8676,4.0778,-3.8263,5.9033,6.4731,6.4405,15.8676,19.9454,0.4499,-1.4765,2.8452,0.2745,1.1023,1.1767,0.1195,2.8452,4.3217,9.8869,9.2122,10.8918,9.8665,0.3936,-0.0284,0.0257,10.8918,1.6796,6.8658,1.3121,15.9114,5.159,4.2909,1.1313,3.2194,15.9114,14.5993
85,0.0506,-1.2152,0.9885,0.0518,0.4298,0.0191,0.1221,1.2152,2.2037,0.1828,-0.6942,1.0358,0.2047,0.5656,-0.0039,-0.009,1.0358,1.73,-9.8319,-10.5137,-8.967,-9.8717,0.409,-0.1298,0.0802,10.5137,1.5467,3.4372,-0.7364,8.1037,3.0425,3.032,-4.5216,0.345,8.1037,8.8402,1.0258,-2.065,3.885,1.0019,1.3711,2.5207,2.2313,3.885,5.95,1.8827,-13.1056,11.606,2.6142,7.2533,11.6051,11.4704,13.1056,24.7117,1.6266,-1.9395,7.9473,0.394,2.9695,6.733,6.3286,7.9473,9.8868,9.8585,9.0003,10.5373,9.8922,0.4075,0.1937,-0.0859,10.5373,1.537,7.9971,1.2294,14.8355,8.3784,3.7736,8.636,10.1338,14.8355,13.6061
86,0.0697,-0.5517,0.6043,0.1739,0.3305,-0.0843,-0.0769,0.6043,1.156,0.179,-1.6259,1.9795,0.1957,1.2772,1.0012,0.9494,1.9795,3.6054,-9.9617,-13.4542,-5.6949,-9.7915,1.6208,0.0756,-0.0108,13.4542,7.7593,-1.0844,-17.2645,6.06,3.3875,8.3041,6.1887,2.4419,17.2645,23.3245,3.5465,0.665,7.0962,3.2331,1.9403,-5.256,-5.2413,7.0962,6.4313,13.4879,0.1058,28.2984,14.0846,10.4787,-26.2535,-24.6258,28.2984,28.1926,8.3596,-0.2381,24.9189,6.7226,8.1031,-0.9358,-0.0983,24.9189,25.1571,10.0522,6.0451,13.5299,9.8063,1.5733,-0.0305,0.155,13.5299,7.4848,16.6331,3.321,29.1896,18.5122,9.8052,-1.0889,-5.3947,29.1896,25.8686
87,-0.0146,-1.9271,0.9563,0.0971,0.9619,0.0775,-0.1828,1.9271,2.8834,1.1801,-0.0191,2.2608,1.1451,0.7782,-0.9787,-0.9473,2.2608,2.2799,-9.8861,-10.6922,-9.2725,-9.8022,0.4441,-0.0425,-0.0666,10.6922,1.4198,5.1043,0.283,7.7877,5.8294,2.5031,-2.2453,-4.27,7.7877,7.5047,-1.7095,-4.4013,0.2625,-2.0081,1.5463,3.6952,4.0863,4.4013,4.6638,-12.7657,-33.7587,3.2835,-10.5412,13.9837,13.5788,13.2192,33.7587,37.0422,7.4238,-0.0054,16.7112,6.6243,5.9632,-5.9208,-6.4072,16.7112,16.7166,10.0217,9.402,10.9739,9.9613,0.4845,-0.0746,-0.0869,10.9739,1.5719,15.5443,3.2783,34.3325,13.1175,12.1416,-8.9025,-6.9252,34.3325,31.0542
88,0.0629,-0.4503,0.7921,-0.0858,0.3965,0.0327,0.2025,0.7921,1.2424,0.2014,-0.456,0.9766,0.1978,0.4205,0.0645,-0.0904,0.9766,1.4326,-9.9286,-11.3441,-8.0449,-9.8688,0.8413,0.0475,-0.0157,11.3441,3.2993,2.859,-0.7907,7.9158,1.5594,3.2785,-3.3512,-2.1188,7.9158,8.7065,1.9857,-1.0588,4.0513,2.0781,1.5218,1.2791,1.3956,4.0513,5.11,0.8132,-11.9339,5.9274,2.678,5.5483,5.6718,4.5495,11.9339,17.8613,1.503,-0.003,6.0101,0.2172,2.2446,-1.1963,-0.1243,6.0101,6.013,9.9471,8.1164,11.3644,9.8744,0.8341,-0.0549,0.0151,11.3644,3.2479,6.6417,1.7545,14.5028,6.1923,3.2287,0.9017,2.1546,14.5028,12.7483
89,0.0957,-0.2478,0.396,0.1167,0.2231,-0.0154,-0.0575,0.396,0.6437,0.2659,-0.067,0.7893,0.1074,0.3351,-0.0306,0.0563,0.7893,0.8563,-9.8811,-10.8253,-9.158,-9.8845,0.6174,0.0751,0.1561,10.8253,1.6673,-0.4922,-2.7356,1.706,-0.5594,1.8379,2.6959,3.2735,2.7356,4.4416,3.2648,0.1575,4.76,3.4738,1.3881,-2.9023,-2.1263,4.76,4.6025,6.485,2.6992,7.8467,7.2276,1.8244,-8.4261,-6.6823,7.8467,5.1476,0.3067,-0.2522,1.3465,0.0929,0.5908,0.6365,0.4342,1.3465,1.5987,9.8922,9.1634,10.8569,9.8895,0.6186,-0.0684,-0.1417,10.8569,1.6935,7.5434,3.197,9.0755,8.347,2.0303,-1.7302,-3.7586,9.0755,5.8785
90,0.0803,-0.6091,1.5298,0.0592,0.4608,0.008,0.074,1.5298,2.1388,0.2353,-0.2645,0.7989,0.1637,0.3238,-0.1376,-0.0314,0.7989,1.0634,-9.806,-12.04,-8.2573,-9.7284,0.8364,-0.0474,-0.0967,12.04,3.7827,2.2038,-1.1936,4.147,2.7141,1.8985,-1.1078,-1.2729,4.147,5.3407,0.3626,-5.2238,3.3162,1.3475,2.42,0.8967,-0.1619,5.2238,8.54,-1.9411,-10.4391,3.421,0.5453,5.2687,0.5361,-2.3138,10.4391,13.8601,0.9432,-0.0814,3.313,0.5272,1.1164,-0.768,-0.349,3.313,3.3944,9.8239,8.2586,12.0557,9.7478,0.8411,0.038,0.0831,12.0557,3.7971,5.8132,2.4496,11.4699,4.5884,3.2424,-1.4601,-0.4401,11.4699,9.0204
91,0.0883,-0.6428,0.6613,0.1332,0.2612,0.0136,0.0613,0.6613,1.3041,0.0977,-0.6726,0.5924,0.1322,0.301,-0.1598,-0.3019,0.6726,1.265,-9.8534,-11.1603,-8.805,-9.8251,0.4505,0.0078,0.2403,11.1603,2.3554,1.0959,-1.2608,3.1388,1.4413,1.3036,-0.4838,-0.6428,3.1388,4.3996,1.2593,-1.75,3.5,1.1856,1.4124,0.3052,0.3063,3.5,5.25,-1.4051,-7.0723,4.026,-1.7685,3.5365,0.6261,-0.1709,7.0723,11.0983,0.1751,-0.9975,0.8945,0.1782,0.4236,0.5458,0.0246,0.9975,1.8921,9.8619,8.8073,11.1724,9.8309,0.4528,0.0123,-0.2184,11.1724,2.365,4.3531,2.1668,7.2028,4.1483,1.2021,3.5059,4.3012,7.2028,5.036
92,0.1019,-1.3435,0.8786,0.1945,0.4862,-0.0083,-0.0431,1.3435,2.2221,-0.0621,-1.1095,0.9353,-0.1696,0.5787,-0.0131,0.0298,1.1095,2.0448,-9.8456,-11.6865,-8.5846,-9.5848,0.7665,0.013,-0.1358,11.6865,3.102,0.6122,-3.9752,4.9577,0.7985,2.817,-1.0174,-1.1692,4.9577,8.9328,1.5646,-6.5538,10.7888,1.4919,3.8777,-0.1227,-0.0897,10.7888,17.3425,-0.779,-11.038,10.5773,-1.9395,6.8807,-0.8245,-0.2682,11.038,21.6153,0.721,-1.9617,4.1475,0.2028,1.6206,-0.2406,-0.0005,4.1475,6.1092,9.8742,8.5946,11.7059,9.6125,0.7657,-0.0241,0.1244,11.7059,3.1113,7.8591,0.9001,12.5663,8.4495,3.1061,-1.7657,-2.3482,12.5663,11.6663
94,0.0852,-0.6529,0.5712,0.1084,0.2286,-0.004,-0.0324,0.6529,1.2241,-0.0883,-0.4626,0.2992,-0.1101,0.2525,0.188,0.2283,0.4626,0.7618,-9.8196,-10.9864,-8.9911,-9.8564,0.4509,-0.0448,0.0272,10.9864,1.9952,-1.4225,-2.678,-0.1691,-1.54,0.7338,4.1684,4.0521,2.678,2.509,1.3192,-2.5025,3.955,1.3125,1.6402,-0.17,0.0656,3.955,6.4575,-2.428,-8.8797,3.2878,-2.476,2.9187,-2.3705,-2.3819,8.8797,12.1674,0.2397,-0.2972,1.0785,0.2017,0.3692,0.217,0.2552,1.0785,1.3758,9.826,8.9928,11.0066,9.8614,0.4519,0.0529,-0.0077,11.0066,2.0138,4.3277,2.5743,8.9274,3.7531,1.5215,3.195,3.2229,8.9274,6.3532
95,0.0811,-0.4674,0.5044,0.076,0.2267,0.0684,0.0322,0.5044,0.9718,0.0997,-0.9652,0.7815,0.1182,0.4764,0.2529,0.1798,0.9652,1.7468,-9.8644,-10.7269,-8.7969,-9.8292,0.432,-0.0106,-0.0044,10.7269,1.9301,2.7458,0.207,4.6919,2.5121,1.2078,-1.0423,-0.0981,4.6919,4.4849,1.1493,-4.0425,5.985,1.3781,2.3037,0.8534,0.6431,5.985,10.0275,-4.7985,-11.7139,5.2297,-4.8579,5.2924,8.6803,9.0799,11.7139,16.9436,0.4568,-2.2343,2.2898,0.4569,1.1788,0.1738,-0.0038,2.2898,4.5241,9.8788,8.8045,10.728,9.8537,0.4308,0.0066,-0.0069,10.728,1.9235,7.5227,2.948,12.0626,6.976,3.0137,-1.9548,-1.8002,12.0626,9.1146
96,0.1495,-0.0938,0.4528,0.1082,0.1862,-0.2767,-0.2197,0.4528,0.5466,0.3526,0.1682,0.5775,0.298,0.1716,0.3036,0.5131,0.5775,0.4093,-9.875,-10.3905,-9.4929,-9.8336,0.2817,-0.2176,-0.3085,10.3905,0.8976,1.7036,-1.4695,3.7593,2.4141,1.9571,10.118,10.4706,3.7593,5.2288,2.0027,0.8225,3.325,2.0213,0.7651,0.2953,0.56,3.325,2.5025,3.8819,-0.3953,7.7122,4.222,2.9079,10.3082,6.4148,7.7122,8.1075,0.6306,-0.7307,1.8924,0.4532,0.9341,7.3759,6.6043,1.8924,2.6231,9.8854,9.5142,10.3922,9.8468,0.2761,0.2511,0.3185,10.3922,0.878,5.5679,3.7872,8.1292,5.1758,1.6008,17.4371,14.3562,8.1292,4.3421
97,-0.1272,-0.7784,0.5323,-0.1114,0.3421,-0.2123,-0.35,0.7784,1.3107,0.6562,-0.3339,1.4374,0.8111,0.5897,-1.2203,-1.9523,1.4374,1.7713,-10.0926,-11.1819,-9.1712,-10.1421,0.6218,0.216,0.4901,11.1819,2.0107,11.8216,0.9142,16.2585,12.8847,4.2712,-13.6063,-12.8739,16.2585,15.3443,2.298,-3.5525,5.9412,2.5812,2.6307,-3.8019,-4.3356,5.9412,9.4938,14.1901,-3.4143,42.1573,10.6368,16.8128,-26.1468,-25.1604,42.1573,45.5716,8.0065,-3.68,20.0223,7.0575,8.7531,-0.7298,0.1457,20.0223,23.7024,10.1365,9.1884,11.2617,10.1653,0.6166,-0.1573,-0.4015,11.2617,2.0733,23.005,11.9967,42.456,19.532,10.6209,-6.7694,-3.0017,42.456,30.4593
98,-0.3395,-1.0344,0.7669,-0.4614,0.5926,0.2986,0.3832,1.0344,1.8013,-0.5641,-1.6133,1.3823,-1.1412,1.2031,0.7532,1.3362,1.6133,2.9956,-9.8766,-11.1381,-8.9204,-9.652,0.8121,-0.1261,-0.3287,11.1381,2.2177,-1.7847,-15.6977,8.4363,0.0108,8.0674,-1.6398,-4.36,15.6977,24.134,-1.5039,-4.27,3.4737,-1.7544,2.3489,2.0169,3.5525,4.27,7.7438,-11.9567,-20.6692,4.4304,-14.5236,8.6435,36.4884,38.6666,20.6692,25.0996,7.2766,-1.3165,23.3245,7.2032,7.8306,-8.3491,-8.1126,23.3245,24.641,9.9793,9.0621,11.2711,9.7638,0.7896,0.0385,0.2192,11.2711,2.209,16.2356,10.8152,20.9239,16.5303,3.6972,8.773,8.2952,20.9239,10.1087
99,-0.0409,-0.8383,0.6999,-0.0782,0.4395,-0.7098,-0.8116,0.8383,1.5383,0.1891,-0.1783,0.6427,0.1951,0.3274,-0.6973,-0.6514,0.6427,0.821,-10.0027,-10.8835,-9.0115,-9.9807,0.7226,-0.1351,-0.201,10.8835,1.872,-3.4245,-5.7489,1.0129,-4.3492,2.357,1.3634,-2.857,5.7489,6.7618,0.513,-3.885,3.1763,1.7981,2.7992,7.8056,6.1819,3.885,7.0613,24.5317,23.7298,25.8484,24.1429,0.8464,-72.6592,-68.2531,25.8484,2.1185,-1.0725,-3.2854,0.5045,-0.9095,1.3621,4.5667,3.0879,3.2854,3.7899,10.0178,9.03,10.9172,9.9829,0.7204,0.2006,0.2436,10.9172,1.8872,25.0086,24.0671,26.2648,24.8254,0.9015,24.961,20.3437,26.2648,2.1977
100,-0.7507,-1.6434,1.1465,-0.8897,0.6472,0.2428,0.2572,1.6434,2.7899,-0.5082,-1.8401,0.6708,-0.4563,0.668,1.1556,1.1056,1.8401,2.5109,-10.1377,-12.6385,-8.1583,-10.1817,0.8527,0.4714,0.635,12.6385,4.4802,-2.0611,-12.2003,17.6413,-7.2061,9.7671,17.35,22.3148,17.6413,29.8416,8.3186,1.8025,15.2512,7.98,3.2328,-5.1097,-6.1688,15.2512,13.4488,-48.1275,-67.1851,-23.2042,-44.1102,14.2722,37.7668,36.8637,67.1851,43.9809,3.4942,-5.686,12.9863,2.1784,5.6185,6.6788,6.6858,12.9863,18.6723,10.2184,8.2257,12.7535,10.2266,0.8591,-0.4361,-0.624,12.7535,4.5278,49.9696,26.278,68.5047,45.1692,14.0712,-22.8124,-22.8192,68.5047,42.2268
101,-0.5079,-3.313,1.1867,-0.6325,1.0823,-0.3365,-0.1712,3.313,4.4997,0.6474,-0.8677,1.876,0.6493,0.6851,-0.2418,-0.4832,1.876,2.7437,-9.6664,-19.0123,-3.4331,-9.5467,3.0459,-0.4151,-0.6673,19.0123,15.5792,15.2889,10.111,20.5629,15.1087,2.9146,-11.4715,-12.6942,20.5629,10.4519,3.2089,-9.345,20.475,1.8112,7.6237,6.9302,7.5031,20.475,29.82,-10.3607,-57.4405,19.7894,-7.2465,22.541,48.2288,47.7585,57.4405,77.23,10.173,-10.8353,30.6975,8.8642,10.7928,-10.3089,-8.694,30.6975,41.5329,9.7824,3.6441,19.3113,9.6026,3.0456,0.591,0.6896,19.3113,15.6672,27.1572,13.9863,60.9617,22.35,13.1585,13.2952,18.4269,60.9617,46.9754
102,-0.8444,-4.2819,4.5442,-0.8037,1.7674,0.2253,0.1854,4.5442,8.8261,0.4056,-1.3674,3.4433,0.1661,1.3099,-0.6426,-0.3315,3.4433,4.8106,-10.0815,-15.9214,-4.3984,-10.2139,2.6378,0.1485,0.296,15.9214,11.523,3.8174,-0.1549,12.5893,2.4145,3.7519,-4.8021,-2.6028,12.5893,12.7442,10.1391,-1.1288,28.7875,9.3144,7.451,-3.0603,-2.2663,28.7875,29.9162,37.8681,22.6417,49.6444,40.512,8.5479,8.1906,5.3795,49.6444,27.0027,-0.1359,-11.2337,5.8837,0.1702,4.0353,0.6266,-0.185,11.2337,17.1174,10.3734,6.2889,16.9114,10.2922,2.5228,-0.4101,-0.3412,16.9114,10.6225,40.4524,30.3959,50.5038,40.7769,7.2088,6.2159,5.7228,50.5038,20.108
103,-0.6191,-0.9149,-0.199,-0.6182,0.1739,0.6502,0.5238,0.9149,0.716,-0.237,-1.189,0.3961,-0.1655,0.377,-0.0927,-0.1714,1.189,1.5852,-9.933,-10.3506,-9.5994,-9.918,0.2201,0.0967,0.0965,10.3506,0.7512,-0.9847,-4.5779,2.1092,-0.1884,2.2576,-4.7885,-5.2841,4.5779,6.687,7.0788,5.2413,9.695,7.0481,1.5206,-3.5602,-3.6881,9.695,4.4537,46.0587,40.7082,52.2749,45.8914,4.1121,-21.4511,-23.767,52.2749,11.5666,0.4907,-0.6846,3.8262,-0.0147,1.2245,1.9385,1.543,3.8262,4.5108,9.9633,9.6505,10.3821,9.9509,0.2241,-0.0951,-0.0965,10.3821,0.7316,46.6683,41.1488,53.2512,46.4998,4.3166,-20.8683,-23.1818,53.2512,12.1024
104,0.0311,-0.5434,1.8694,-0.0945,0.5092,1.3928,1.5493,1.8694,2.4128,-0.3297,-1.0993,0.459,-0.3369,0.5241,0.5941,0.6223,1.0993,1.5583,-9.8363,-10.7037,-8.1621,-9.8215,0.4482,0.0463,0.0165,10.7037,2.5416,-5.7732,-8.8786,-2.2457,-5.4724,1.8814,0.1445,-0.2069,8.8786,6.6329,3.5185,-0.1137,7.5075,3.36,1.9305,-1.6701,-1.6888,7.5075,7.6212,24.6076,5.6482,45.2526,22.1244,15.5985,-18.283,-15.8396,45.2526,39.6044,2.4292,-1.9513,8.8113,1.5283,3.7046,-3.9835,-3.1564,8.8113,10.7626,9.8683,8.2458,10.729,9.8544,0.4411,0.0343,0.0566,10.729,2.4832,25.8,6.3411,46.0537,23.318,15.3494,-17.0859,-14.5739,46.0537,39.7127
105,1.424,0.9859,1.8147,1.4548,0.341,-1.0239,-0.9858,1.8147,0.8288,0.2644,0.0724,0.4153,0.2854,0.1334,0.3358,0.4443,0.4153,0.3429,-9.79,-10.0296,-9.4456,-9.805,0.2312,0.23,0.0762,10.0296,0.584,-5.6287,-6.395,-4.7434,-5.6793,0.6599,15.6819,16.0969,6.395,1.6516,1.8484,1.1638,2.9663,1.6713,0.5947,0.4211,0.7962,2.9663,1.8025,6.3245,5.5288,7.0619,6.2848,0.4941,-10.3248,-10.4731,7.0619,1.5331,-1.5542,-2.4969,-0.3681,-1.6281,0.9029,7.1155,8.0731,2.4969,2.1288,9.9026,9.5567,10.1851,9.911,0.2265,-0.3001,-0.1434,10.1851,0.6284,8.7141,8.3092,9.0094,8.7441,0.275,4.4027,3.0101,9.0094,0.7002
106,0.4001,-0.1779,0.9297,0.4691,0.3828,0.1725,0.3587,0.9297,1.1076,0.6002,-0.1257,0.9521,0.7298,0.3868,-0.4817,-0.6071,0.9521,1.0777,-9.56,-10.3762,-7.6995,-9.7288,0.8136,-0.2915,0.1097,10.3762,2.6767,10.0533,7.1738,12.6153,10.4177,1.9432,-7.859,-8.03,12.6153,5.4415,2.2695,0.0087,3.8325,2.4675,1.2181,-1.0976,-1.3256,3.8325,3.8237,-4.0003,-13.7241,8.1078,-4.1884,8.1126,13.1592,14.4633,13.7241,21.832,5.5613,-1.4876,10.2376,6.445,3.6044,-4.8234,-6.2006,10.2376,11.7251,9.6025,7.8031,10.4106,9.7676,0.7882,0.3295,-0.0168,10.4106,2.6076,13.1168,9.2438,18.6844,11.7542,3.7585,-3.1824,-0.764,18.6844,9.4406
107,0.5725,-1.6273,1.525,0.8277,0.8497,-0.4739,-0.6993,1.6273,3.1523,0.1185,-1.5493,1.2471,0.1227,0.7752,-0.4365,-0.5104,1.5493,2.7964,-9.8515,-12.5694,-7.9963,-9.6191,1.0798,-0.0107,-0.2522,12.5694,4.5731,2.1943,-1.1099,5.6356,2.3877,1.8711,-6.6911,-6.4844,5.6356,6.7455,1.172,-1.015,3.605,1.1419,1.1371,-0.0323,-0.0525,3.605,4.62,9.1589,2.3019,14.6929,10.2749,4.2643,-3.4673,-4.2383,14.6929,12.391,0.7379,-4.2118,4.5491,0.2444,2.2805,0.5679,1.2323,4.5491,8.761,9.932,8.0511,12.583,9.7508,1.0747,-0.0573,0.1309,12.583,4.5319,9.9344,3.266,15.0867,10.9902,3.7129,-2.3206,-3.656,15.0867,11.8207
108,0.0987,-0.1109,0.3079,0.1284,0.1358,-0.0694,-0.0328,0.3079,0.4188,-0.318,-0.8168,0.2621,-0.3878,0.358,0.4272,0.6206,0.8168,1.0789,-9.8623,-10.2816,-9.2025,-9.8713,0.3712,0.1927,0.1543,10.2816,1.0791,-4.4968,-6.4996,-2.8787,-4.0967,1.5074,5.0099,4.5988,6.4996,3.6208,1.1397,0.2363,2.3013,1.0894,0.772,-0.653,-0.9581,2.3013,2.065,5.6916,0.4182,10.931,6.0366,4.2846,-15.6411,-15.6118,10.931,10.5128,1.3058,-0.8016,3.0606,1.4767,1.3446,-1.4454,-1.4262,3.0606,3.8622,9.8747,9.24,10.2945,9.8817,0.3624,-0.1834,-0.1449,10.2945,1.0545,7.6137,3.0997,12.7474,7.3342,4.0734,2.548,2.5285,12.7474,9.6477
109,0.0293,-0.8099,0.5966,0.0957,0.5161,0.3495,0.1352,0.8099,1.4066,0.1092,-0.8336,0.5092,0.2328,0.4418,-0.003,-0.0266,0.8336,1.3428,-9.6696,-10.8482,-8.8207,-9.7171,0.7099,-0.2452,-0.2771,10.8482,2.0275,0.5131,-0.4742,1.9553,0.5021,0.722,2.9237,2.3113,1.9553,2.4295,0.4867,-2.0738,3.2112,0.1312,1.8291,1.339,1.6362,3.2112,5.285,-9.9495,-13.5322,-6.6877,-9.5752,2.936,8.0966,10.7084,13.5322,6.8446,-0.1397,-1.6299,0.2589,0.0505,0.6215,0.5156,0.215,1.6299,1.8888,9.6913,8.836,10.8816,9.7369,0.707,0.2734,0.2606,10.8816,2.0455,10.1617,6.7609,13.6417,9.8627,2.86,-2.1098,-3.5697,13.6417,6.8808
110,0.3788,-0.4006,3.4673,0.2309,0.7563,0.182,0.3148,3.4673,3.8679,0.1062,-0.9491,0.9814,0.2062,0.4955,-0.0622,-0.1334,0.9814,1.9305,-9.9148,-11.2068,-8.5986,-9.9941,0.5168,0.0922,0.1914,11.2068,2.6082,3.4368,-1.2771,7.7982,2.8134,2.7997,-1.5057,-0.7327,7.7982,9.0753,1.8257,-0.4375,4.2525,1.7675,1.2108,-0.8528,-0.1969,4.2525,4.69,-1.8529,-14.7272,7.2562,1.1332,7.6713,5.9025,3.2306,14.7272,21.9834,0.3759,-3.3261,4.5763,0.2655,2.1268,-0.1611,-0.224,4.5763,7.9024,9.9646,9.0715,11.2375,9.9975,0.4639,-0.1003,-0.0958,11.2375,2.166,8.052,1.6027,16.3687,6.293,4.4774,-2.2025,-0.2684,16.3687,14.766
111,0.5608,-1.2003,1.5891,0.5457,0.6108,-0.5584,-0.5582,1.5891,2.7894,0.044,-0.8767,0.6535,0.0727,0.366,-0.1482,-0.0123,0.8767,1.5301,-9.8226,-11.6264,-8.5975,-9.8027,0.6341,0.0521,0.1429,11.6264,3.0289,1.9311,-2.0987,5.9136,2.0806,2.1784,-8.1959,-8.6546,5.9136,8.0123,0.9729,-2.2488,3.01,1.5706,1.7021,-0.5516,-1.2556,3.01,5.2588,4.0496,-1.3134,8.9042,4.3637,3.1352,5.2399,4.2159,8.9042,10.2176,0.2148,-2.2799,2.757,0.0415,1.0791,4.628,0.6154,2.757,5.0369,9.8643,8.7138,11.6486,9.9017,0.6203,-0.0574,-0.2211,11.6486,2.9348,5.8495,2.3071,9.1694,6.0246,1.9507,11.3474,11.1215,9.1694,6.8622
112,0.0024,-0.3923,0.5287,-0.0125,0.293,0.3987,0.2802,0.5287,0.9209,-0.1043,-1.5906,1.0712,0.0604,0.7984,0.3939,0.1388,1.5906,2.6617,-9.7705,-11.2139,-8.6862,-9.6598,0.6499,-0.2131,-0.2317,11.2139,2.5277,-6.2648,-20.2347,3.7916,-6.574,8.9603,11.7595,13.7301,20.2347,24.0264,0.4213,-2.7125,3.22,0.315,1.3465,3.4257,3.7581,3.22,5.9325,9.2894,-18.3316,29.1482,8.5796,12.9802,-25.3458,-29.6603,29.1482,47.4798,4.8428,-11.8784,25.5355,0.6569,10.5356,-1.7698,0.0258,25.5355,37.4139,9.8069,8.7101,11.2521,9.6806,0.6453,0.2312,0.2307,11.2521,2.542,17.1969,6.0725,32.2498,17.1461,8.5891,2.7192,5.0242,32.2498,26.1773
113,0.4011,-0.5488,2.2591,0.2677,0.6899,0.507,0.5728,2.2591,2.808,0.2897,-0.6834,1.4499,0.1993,0.6119,-0.2654,-0.0811,1.4499,2.1333,-9.9836,-11.8045,-8.593,-9.8916,0.9235,0.1598,-0.2064,11.8045,3.2115,5.4946,-5.3934,10.9638,7.1561,4.7935,-8.828,-10.6693,10.9638,16.3573,3.8471,1.1813,7.9188,4.0731,1.7506,-2.8211,-3.1719,7.9188,6.7375,-16.0563,-25.1827,7.2026,-21.0807,10.4168,23.3071,28.432,25.1827,32.3853,3.073,-5.219,13.7071,0.6827,5.2688,-2.2317,-0.7196,13.7071,18.9261,10.0381,8.6007,11.8136,9.9113,0.9062,-0.1576,0.2332,11.8136,3.2129,19.9162,8.7688,26.952,22.1703,6.0509,-11.2517,-13.0496,26.952,18.1832
114,0.9081,0.411,1.4604,0.8405,0.3446,-0.9815,-0.7236,1.4604,1.0493,0.0242,-0.6666,0.4883,0.1182,0.4347,0.3332,0.2038,0.6666,1.1549,-9.8238,-10.4793,-8.6093,-10.0979,0.6683,-0.0052,0.1833,10.4793,1.87,-3.3333,-7.1083,0.7451,-3.5133,2.7122,9.7963,9.8731,7.1083,7.8534,1.0259,-1.365,4.3313,0.9013,1.9642,-2.1317,-2.1744,4.3313,5.6962,7.2507,4.6099,8.8493,7.3513,1.5161,-24.5223,-24.5708,8.8493,4.2394,0.8413,-0.8121,4.0523,-0.0369,1.9035,1.5202,2.233,4.0523,4.8644,9.8805,8.746,10.5469,10.1445,0.6485,-0.0341,-0.2158,10.5469,1.8009,8.6645,6.0274,9.9558,9.1207,1.3036,9.9104,9.62,9.9558,3.9285
115,-0.0734,-0.6885,0.3942,0.1169,0.4333,1.2575,1.1209,0.6885,1.0827,0.3575,-0.0299,0.7486,0.3219,0.2369,-0.1451,-0.2558,0.7486,0.7785,-9.829,-10.6218,-8.6931,-9.9147,0.6571,0.0495,0.2955,10.6218,1.9287,6.463,5.4088,7.3391,6.3599,0.6863,-7.2711,-7.6185,7.3391,1.9304,-1.1058,-2.485,0.735,-1.2731,1.0411,3.4311,3.7975,2.485,3.22,-17.2715,-22.2192,-11.4681,-17.2195,4.1114,24.4331,24.1871,22.2192,10.751,2.3615,-0.1618,4.6314,2.196,1.5407,-2.819,-2.3362,4.6314,4.7933,9.8464,8.7031,10.6487,9.9288,0.6612,0.0317,-0.18,10.6487,1.9456,18.5749,13.1497,23.0026,18.7407,3.7679,-10.7303,-11.2634,23.0026,9.8529
116,1.1841,1.0072,1.3411,1.2378,0.1395,-1.0446,-1.0074,1.3411,0.334,0.2124,-0.8898,1.3117,0.0661,0.7096,-0.0681,0.0302,1.3117,2.2016,-9.7796,-10.8294,-9.0293,-9.6192,0.6811,0.0415,-0.2875,10.8294,1.8002,-0.8081,-3.4735,2.3241,-1.2586,2.0019,-0.0397,1.06,3.4735,5.7976,2.3253,0.7612,2.94,2.5244,0.7006,-0.447,-0.4244,2.94,2.1788,7.1615,4.6233,9.972,6.9676,2.1799,-13.8855,-11.7438,9.972,5.3488,-0.4575,-2.1258,0.815,-0.1402,1.0381,0.7892,0.0262,2.1258,2.9408,9.8781,9.1504,10.8778,9.7488,0.6544,-0.1118,0.1678,10.8778,1.7275,7.8446,5.4317,10.4484,7.4773,2.1122,0.7358,-0.7983,10.4484,5.0167
117,0.1395,-0.7668,1.2175,0.2304,0.5163,-0.1177,0.1254,1.2175,1.9843,0.1443,-0.8222,1.1711,0.0963,0.5147,-0.6164,-0.4509,1.1711,1.9933,-9.7381,-11.5358,-7.0923,-9.9067,0.9991,-0.1953,0.2644,11.5358,4.4435,-0.8478,-7.8227,5.4801,-0.1986,4.1908,-9.7696,-10.5829,7.8227,13.3028,1.8783,-1.5138,5.6525,2.1,2.1255,-1.3949,-1.96,5.6525,7.1663,-6.724,-17.8039,-1.6193,-4.7762,5.2397,-9.8917,-12.6962,17.8039,16.1846,0.3317,-3.138,5.0974,-0.114,1.9725,4.5688,3.8952,5.0974,8.2354,9.7663,7.0961,11.5743,9.9166,0.9991,0.2174,-0.2359,11.5743,4.4782,8.5804,3.0306,18.5338,6.679,4.9315,11.6319,13.8152,18.5338,15.5032
118,0.0218,-1.4468,0.9063,0.3558,0.8676,-0.5224,-0.8864,1.4468,2.3531,-0.4721,-1.1513,-0.0808,-0.3546,0.3633,0.4525,0.307,1.1513,1.0706,-9.9333,-12.8813,-8.1133,-9.6423,1.6291,-0.1447,-0.4264,12.8813,4.768,-10.6174,-11.9198,-9.0904,-10.7815,0.8947,17.2393,18.6625,11.9198,2.8294,0.4834,-6.8862,6.545,0.14,4.2881,9.8831,9.5725,6.8862,13.4312,-16.6157,-23.0765,-10.0148,-17.4724,4.543,-29.9142,-29.0367,23.0765,13.0616,4.9006,0.8502,11.55,3.7812,3.6706,-3.9195,-3.9964,11.55,10.6998,9.9837,8.1664,12.9625,9.6807,1.6271,0.128,0.4295,12.9625,4.7961,20.2124,13.758,26.2067,20.4942,4.1888,28.0618,27.3292,26.2067,12.4487
119,-0.5005,-0.9621,0.218,-0.5306,0.3254,0.5007,0.442,0.9621,1.1801,-0.0196,-1.2291,1.0664,-0.0476,0.6017,0.3909,0.5155,1.2291,2.2955,-10.078,-11.3706,-8.5801,-10.0688,0.7226,0.3103,0.1057,11.3706,2.7904,6.6219,1.1435,9.8326,7.881,3.0502,3.7654,2.4597,9.8326,8.6892,10.3666,6.685,14.105,9.7125,2.4565,-6.9278,-5.8013,14.105,7.42,-46.5299,-54.4679,-39.4712,-46.5091,5.352,22.1752,21.9168,54.4679,14.9967,0.981,-3.0069,9.0539,-0.2152,3.7617,2.8908,5.1909,9.0539,12.0608,10.1117,8.5907,11.4068,10.1103,0.7308,-0.3242,-0.13,11.4068,2.8161,48.2742,41.6951,56.2401,47.8234,5.3848,-21.4689,-20.6785,56.2401,14.545
120,0.0002,-0.7159,0.6649,-0.0886,0.4459,0.7737,1.2046,0.7159,1.3808,0.3713,-0.1161,0.6792,0.468,0.2902,-0.3638,-0.5128,0.6792,0.7953,-9.7678,-10.5969,-8.363,-9.9631,0.818,-0.0755,0.632,10.5969,2.234,10.3873,8.9082,11.5797,10.3407,0.8385,-5.0201,-4.3486,11.5797,2.6715,3.4387,0.1662,6.1862,3.9112,2.1114,-2.239,-3.3819,6.1862,6.02,-24.3548,-26.9049,-20.461,-24.5922,2.054,20.796,21.8078,26.9049,6.4438,3.8718,-1.1721,7.5457,4.9757,3.039,-2.9612,-4.7461,7.5457,8.7178,9.7875,8.4046,10.6326,9.9802,0.8185,0.1437,-0.5221,10.6326,2.2279,26.8053,23.5111,28.673,27.1449,1.7099,-16.1902,-18.0812,28.673,5.1619
121,0.7739,-1.084,2.6035,1.116,0.9455,-0.4538,-0.6925,2.6035,3.6875,0.0075,-0.7492,0.7522,-0.0449,0.4112,-0.1361,-0.0293,0.7522,1.5014,-9.8433,-14.2131,-7.0986,-9.3311,1.5136,-0.0725,-0.5238,14.2131,7.1145,5.3672,-1.541,10.9609,5.9922,4.2185,-7.0357,-7.3799,10.9609,12.5019,1.1998,-10.2288,15.2075,0.5294,5.6325,0.4284,1.0019,15.2075,25.4362,-3.5587,-14.0239,6.8806,-2.7844,6.6681,7.7941,7.9395,14.0239,20.9045,0.9106,-4.8809,5.4033,0.2296,2.825,-0.4549,-0.1542,5.4033,10.2842,9.9312,7.2116,14.2151,9.4581,1.4731,0.0164,0.4122,14.2151,7.0035,10.6151,2.6743,22.3255,9.0637,4.6286,-4.9143,-2.9511,22.3255,19.6512
122,0.3201,-1.5142,1.5685,0.4235,0.6786,-0.3367,-0.4193,1.5685,3.0828,-0.1286,-0.7678,0.4027,-0.0742,0.2682,0.1021,0.0221,0.7678,1.1705,-9.9158,-11.2295,-8.6887,-9.8549,0.6394,0.0887,0.0164,11.2295,2.5408,-1.6685,-4.8146,1.3412,-1.3877,1.8408,1.6506,0.9994,4.8146,6.1558,1.6282,-1.015,3.9375,1.5313,1.3456,-0.3678,-0.1619,3.9375,4.9525,4.2353,-2.0762,8.1143,5.1551,2.6164,-5.6114,-5.2426,8.1143,10.1905,0.4557,-1.1347,3.2259,0.0754,0.9095,-0.2015,0.062,3.2259,4.3606,9.9476,8.7509,11.3312,9.8703,0.6394,-0.1134,-0.0281,11.3312,2.5803,5.7008,2.0788,8.2197,6.1125,1.598,-2.3473,-2.9833,8.2197,6.1409
123,-0.0166,-0.5211,0.5566,0.0042,0.3153,0.0483,0.0079,0.5566,1.0778,-0.0265,-0.4374,0.462,-0.0521,0.2111,0.0537,0.0931,0.462,0.8994,-9.8271,-10.9386,-8.5043,-9.8385,0.6444,-0.0212,-0.002,10.9386,2.4343,-0.0179,-3.3459,3.4358,-0.3883,1.8866,3.9214,4.4194,3.4358,6.7817,1.2604,-0.9713,3.4738,1.3694,1.1506,-0.3562,-0.2888,3.4738,4.445,-1.3761,-6.3593,1.0341,-0.0875,2.5107,0.0484,-2.7805,6.3593,7.3934,0.2542,-0.1019,1.1308,0.1374,0.3145,0.009,-0.0051,1.1308,1.2327,9.8342,8.5262,10.9396,9.8422,0.6439,0.0199,0.0047,10.9396,2.4134,3.3535,1.158,6.5658,3.1292,1.7565,2.7081,3.0896,6.5658,5.4078
124,0.0317,-0.4889,0.5425,0.0121,0.2678,-0.025,-0.0354,0.5425,1.0314,0.0272,-0.2735,0.4997,0.041,0.2112,-0.0392,-0.049,0.4997,0.7731,-9.8482,-11.2327,-8.5388,-9.8404,0.596,0.0173,0.0323,11.2327,2.6939,3.9036,0.339,6.1118,4.0311,1.7248,-1.7725,-1.7859,6.1118,5.7729,0.9042,-1.155,2.5025,1.0806,0.9735,0.0611,0.1586,2.5025,3.6575,-1.3277,-5.5573,6.2936,-2.868,4.0277,1.4161,1.9277,6.2936,11.8509,0.2632,-1.3326,1.975,0.1323,0.8987,0.038,0.0951,1.975,3.3076,9.854,8.5566,11.244,9.8469,0.5952,-0.0167,-0.0314,11.244,2.6875,6.0616,4.5171,7.1208,6.2189,0.6296,-0.0843,-0.0299,7.1208,2.6037
128,-0.0682,-0.4102,0.5557,-0.1294,0.3375,-0.0796,0.0432,0.5557,0.9659,-0.1297,-0.365,0.2011,-0.155,0.1945,0.0168,0.0859,0.365,0.5661,-9.7791,-11.0434,-9.1068,-9.7113,0.6579,-0.1776,0.1261,11.0434,1.9366,-3.1863,-3.7669,-2.7533,-3.1124,0.369,4.8975,4.9015,3.7669,1.0135,1.1484,-1.1725,2.3013,1.715,1.2769,0.0634,-1.0238,2.3013,3.4738,4.3366,2.1304,6.655,4.8427,1.6502,-8.1253,-8.5765,6.655,4.5246,0.4152,-0.5939,1.1767,0.5125,0.6156,-0.6086,-0.6261,1.1767,1.7705,9.7871,9.126,11.0445,9.7212,0.6547,0.1809,-0.1251,11.0445,1.9185,5.7246,3.7599,7.5398,6.0993,1.2807,-1.2585,-1.781,7.5398,3.7798
129,-0.1478,-0.9116,0.4129,-0.0862,0.4567,0.3442,0.902,0.9116,1.3245,-0.1129,-0.4392,0.073,-0.0691,0.1549,0.1241,0.1849,0.4392,0.5122,-9.9567,-11.4181,-9.1548,-9.5852,0.8781,1.6278,1.0485,11.4181,2.2634,1.7112,1.1214,2.1122,1.7891,0.3052,-1.4122,-1.1669,2.1122,0.9908,1.2119,0.0262,3.64,0.6912,1.3273,-3.8184,-0.0875,3.64,3.6138,-3.7887,-4.4662,-3.0725,-3.7338,0.5082,4.2954,4.5995,4.4662,1.3936,-0.1934,-0.8255,0.1227,-0.1136,0.2828,0.0438,0.1173,0.8255,0.9482,9.968,9.1558,11.4248,9.5961,0.8856,-0.3724,-0.6141,11.4248,2.269,4.4661,3.2781,5.8597,4.3182,0.8644,11.4329,3.6087,5.8597,2.5816
130,0.1964,-4.9419,6.0429,0.8157,2.6757,-0.0036,-0.3848,6.0429,10.9848,0.0112,-1.6247,0.9874,0.1158,0.6375,0.0292,0.0272,1.6247,2.6121,-8.3288,-20.5051,6.6963,-8.5367,6.325,-0.721,-0.5842,20.5051,27.2013,0.299,-4.2684,3.4542,0.6222,2.1551,0.4638,0.182,4.2684,7.7227,-2.6065,-46.76,49.1138,0.6037,21.7225,3.5619,0.2362,49.1138,95.8738,0.5067,-7.4247,6.9113,0.8657,3.3121,-0.9339,-1.195,7.4247,14.336,-0.1496,-2.6951,2.0484,0.0038,1.0444,0.5873,0.4217,2.6951,4.7435,9.5956,1.7264,20.6455,8.982,4.8988,0.2103,0.3797,20.6455,18.9191,15.899,2.5878,49.2496,7.927,15.232,-1.9579,0.0674,49.2496,46.6617
132,0.1892,-4.3204,7.3863,0.0461,2.0932,0.7508,1.0888,7.3863,11.7067,0.0695,-1.6761,1.3147,0.1702,0.7468,-0.2458,-0.2241,1.6761,2.9909,-9.7708,-21.1795,-1.8549,-9.705,3.9948,-0.2167,-0.0972,21.1795,19.3247,1.2266,-6.0804,9.0197,0.9861,4.9435,2.6623,3.3343,9.0197,15.1002,4.5174,-24.325,57.7675,1.0762,14.4637,-3.685,0.0656,57.7675,82.0925,-1.3611,-9.8173,7.0445,-1.5242,5.0955,4.5897,4.8367,9.8173,16.8618,1.025,-8.623,7.2472,0.8471,3.3584,-1.14,-1.076,8.623,15.8702,10.0163,2.0573,21.2025,9.7414,3.9862,0.0465,0.2037,21.2025,19.1451,11.9832,4.5575,58.5122,8.0618,11.6179,-6.5939,-2.4955,58.5122,53.9548
133,0.94,-0.2896,1.7355,1.1349,0.6404,-0.3063,-0.5044,1.7355,2.0252,-0.1763,-0.988,0.4207,-0.0539,0.4817,0.1394,0.0595,0.988,1.4087,-9.9875,-10.9658,-9.4898,-9.8022,0.5399,0.1456,0.0476,10.9658,1.476,3.8889,0.7796,5.8844,4.3204,1.5779,-2.881,-2.9224,5.8844,5.1048,0.8323,-0.4025,2.1962,1.1419,0.9092,0.5411,0.0919,2.1962,2.5988,3.2286,1.6574,4.2722,3.3125,0.776,-3.239,-2.2364,4.2722,2.6148,-0.115,-1.7116,1.8197,-0.2289,1.264,0.7177,0.5645,1.8197,3.5313,10.0627,9.5678,10.9723,9.9452,0.5061,-0.1795,-0.1492,10.9723,1.4045,5.3893,4.0335,6.3399,5.5662,0.8444,-1.0236,-1.1636,6.3399,2.3064
134,0.6337,-0.5095,1.4996,0.6305,0.5132,-0.233,-0.1657,1.4996,2.0091,-0.0369,-0.614,0.5278,0.0057,0.3457,-0.0216,-0.0916,0.614,1.1418,-9.842,-11.3839,-8.3749,-9.7546,0.8701,-0.0896,-0.3032,11.3839,3.0089,1.0078,-3.3439,4.3884,1.398,2.2659,-2.86,-3.2627,4.3884,7.7323,1.3734,-2.1262,4.2088,1.2337,1.4474,0.6712,0.8269,4.2088,6.335,-0.0104,-5.3885,3.9356,1.0761,3.2471,0.4794,-0.4302,5.3885,9.3241,0.6027,-0.2777,2.3162,0.3356,0.7278,-0.5213,-0.2325,2.3162,2.5939,9.8832,8.5106,11.3935,9.796,0.8449,0.0681,0.2713,11.3935,2.8828,4.3657,2.7279,5.8913,4.4026,0.9847,-0.3224,-0.3674,5.8913,3.1634
135,0.4007,-0.4015,1.1383,0.4648,0.3921,-0.0387,0.0052,1.1383,1.5399,-0.0585,-0.5613,0.5266,-0.0859,0.2803,-0.2214,-0.1828,0.5613,1.0879,-9.9316,-11.2001,-7.9526,-10.0578,0.967,-0.0838,0.1792,11.2001,3.2474,-1.8521,-5.6633,2.1733,-1.8646,2.2278,0.178,0.1029,5.6633,7.8365,2.0446,-0.7262,4.2613,2.0606,1.3594,-0.0222,0.1487,4.2613,4.9875,0.469,-3.3759,2.9708,0.6459,1.861,-5.7674,-5.6998,3.3759,6.3467,0.0814,-1.5927,3.0528,0.1031,0.9065,0.654,0.2864,3.0528,4.6455,9.9513,7.9782,11.2299,10.0673,0.9638,0.0926,-0.148,11.2299,3.2517,4.0433,2.0809,6.4014,4.0352,1.1775,2.1075,1.9636,6.4014,4.3205
136,0.362,-0.3095,1.0082,0.47,0.4474,-0.1248,-0.2129,1.0082,1.3176,-0.2799,-1.0753,0.5057,-0.2687,0.4662,0.4295,0.3791,1.0753,1.581,-10.0154,-10.9492,-8.9702,-9.8786,0.589,-0.0018,0.1341,10.9492,1.9789,-1.6741,-3.1168,0.2499,-1.7618,1.0306,5.324,5.5826,3.1168,3.3666,2.0223,0.35,2.8612,2.2094,0.8598,-0.8564,-1.1813,2.8612,2.5112,-5.2984,-8.9941,-1.2431,-5.0539,2.7308,8.6552,8.0898,8.9941,7.751,0.7354,0.0534,2.4142,0.3894,0.8271,-0.1867,0.0791,2.4142,2.3608,10.0439,8.9859,10.9575,9.9193,0.5915,-0.0168,-0.1632,10.9575,1.9716,6.1508,2.4675,9.5407,5.9988,2.446,0.1855,0.5862,9.5407,7.0732
137,0.2371,-0.2902,0.649,0.2571,0.3416,-0.0208,-0.1409,0.649,0.9392,0.1496,-0.0563,0.3782,0.1104,0.1406,-0.0572,-0.0491,0.3782,0.4344,-10.0172,-11.0215,-9.5352,-9.7445,0.5486,0.2209,-0.0519,11.0215,1.4863,3.6498,-0.903,7.4508,3.8209,2.8975,-3.2624,-3.6328,7.4508,8.3537,1.1659,0.0525,2.7475,1.0281,0.8346,0.2023,0.3063,2.7475,2.695,3.3567,-0.3719,6.4806,3.0359,2.8452,-3.0946,-2.6779,6.4806,6.8525,0.5487,-0.1891,1.2998,0.4686,0.561,-0.5996,-0.5152,1.2998,1.4889,10.027,9.5454,11.0235,9.7561,0.5485,-0.2185,0.0524,11.0235,1.4781,6.3363,4.6865,7.5437,6.585,0.9792,-4.5274,-4.8659,7.5437,2.8572
138,0.2163,-0.2114,0.9897,0.1162,0.4091,0.2828,0.4466,0.9897,1.2011,0.0924,-0.1705,0.3507,0.0613,0.1988,0.1058,0.1475,0.3507,0.5212,-9.7962,-10.2755,-9.3899,-9.7964,0.3083,-0.0489,-0.0158,10.2755,0.8856,0.3874,-0.2872,2.0339,0.1881,0.7771,0.4647,-0.168,2.0339,2.3211,1.3683,0.1662,2.4763,1.3344,0.806,-0.14,-0.2013,2.4763,2.31,0.2621,-0.9216,0.9737,0.358,0.6599,-3.3472,-3.439,0.9737,1.8953,-0.0509,-0.1653,0.0525,-0.0467,0.0666,0.3644,0.1874,0.1653,0.2178,9.8085,9.4188,10.279,9.8085,0.2985,0.0599,0.0283,10.279,0.8602,1.8089,1.0045,2.5353,1.7191,0.5823,2.2816,2.5159,2.5353,1.5308
139,0.4992,-0.1176,0.8707,0.5628,0.3257,-0.0879,-0.1376,0.8707,0.9883,0.1981,-0.2938,0.5637,0.2088,0.2858,0.1235,0.1119,0.5637,0.8575,-9.8451,-10.6813,-9.1117,-9.8122,0.4731,-0.1839,-0.2979,10.6813,1.5697,0.852,-1.0466,4.3006,0.0201,2.0544,0.1291,1.5162,4.3006,5.3472,1.2283,-0.3675,2.975,1.1331,1.1176,0.8389,0.5381,2.975,3.3425,-3.0851,-4.1835,-2.1627,-3.081,0.7755,10.6646,11.0899,4.1835,2.0209,0.3135,-0.3514,1.5522,0.1407,0.5934,0.5064,0.4682,1.5522,1.9035,9.8684,9.1532,10.6917,9.8368,0.4664,0.1848,0.2877,10.6917,1.5386,4.0905,2.9911,4.82,4.235,0.6165,4.1829,4.2456,4.82,1.8289
140,0.4113,-0.2349,0.8169,0.4252,0.3507,-0.0282,-0.1239,0.8169,1.0518,0.3216,-0.1101,0.7181,0.3207,0.3575,-0.2745,-0.2771,0.7181,0.8282,-10.029,-10.6915,-8.6889,-10.1102,0.6905,0.2481,0.2406,10.6915,2.0025,0.9811,-1.4949,2.9354,1.5363,1.7503,0.2928,0.7743,2.9354,4.4303,2.0672,0.595,4.7775,1.6712,1.3736,-1.1976,-0.4244,4.7775,4.1825,7.5795,4.3566,9.1844,8.0089,1.6535,-10.2812,-11.1709,9.1844,4.8278,0.8199,-0.0474,1.8377,0.6089,0.8628,-0.1861,-0.0413,1.8377,1.8851,10.0532,8.6928,10.7304,10.1244,0.6965,-0.2514,-0.2312,10.7304,2.0376,8.2734,6.0115,9.3721,8.4806,1.0471,-1.9344,-2.7767,9.3721,3.3606
141,0.3831,-0.1577,1.181,0.3013,0.3577,-0.4414,-0.4623,1.181,1.3387,0.0472,-0.7013,0.8479,0.0437,0.3575,-0.1293,0.041,0.8479,1.5493,-9.7809,-10.9673,-8.5933,-9.8696,0.6783,0.0037,0.139,10.9673,2.3739,1.2739,-5.3735,5.9226,2.3106,3.6867,-1.1724,-1.4939,5.9226,11.2961,0.8696,-2.59,4.0162,1.2469,1.6774,-1.3253,-1.4088,4.0162,6.6062,-2.7017,-9.3126,4.9668,-3.162,4.4706,-0.4085,-1.5591,9.3126,14.2795,0.6338,-0.6866,2.914,0.5676,0.8241,-0.2592,-0.3903,2.914,3.6007,9.8017,8.654,10.9721,9.8932,0.6685,-0.0011,-0.1459,10.9721,2.318,6.339,2.1952,10.1332,5.7039,2.1604,-0.6444,-0.0488,10.1332,7.938
142,-0.0583,-1.0911,0.8745,-0.161,0.5247,-0.1116,-0.0115,1.0911,1.9657,-0.0821,-0.9,0.9981,0.0847,0.4377,0.143,0.0036,0.9981,1.8982,-9.7772,-11.162,-8.8674,-9.7306,0.5992,-0.2833,-0.3823,11.162,2.2946,0.1016,-4.3795,5.7214,0.8167,3.1039,3.0469,2.3448,5.7214,10.1009,-0.4557,-3.4738,1.8813,-0.1619,1.5703,1.3526,1.4744,3.4738,5.355,-3.1103,-7.1131,5.9626,-4.7211,3.6221,2.4616,4.0748,7.1131,13.0758,0.3746,-1.2617,3.0655,0.1773,1.1744,-0.1927,0.0609,3.0655,4.3272,9.8006,8.87,11.1807,9.7473,0.5991,0.2723,0.3703,11.1807,2.3107,5.6946,2.6143,7.9576,5.6551,1.305,-2.0622,-2.029,7.9576,5.3433
143,-0.1699,-0.829,0.517,-0.1725,0.4137,-0.1315,-0.0995,0.829,1.346,0.0609,-0.4368,0.4913,0.0883,0.2914,0.0102,-0.0428,0.4913,0.9281,-10.0606,-11.8622,-8.1059,-10.1128,1.2388,0.9471,0.9044,11.8622,3.7563,3.1485,2.6015,3.6057,3.1615,0.3232,-3.8481,-4.2499,3.6057,1.0042,0.8969,-1.3475,2.2575,1.3125,1.3797,-5.7856,-5.915,2.2575,3.605,-0.6487,-1.4822,0.421,-0.6463,0.67,1.5511,1.975,1.4822,1.9031,0.1819,-1.5751,1.6684,0.2382,0.9958,-0.1118,-0.2536,1.6684,3.2435,10.0729,8.1227,11.8911,10.1176,1.2427,-0.6454,-0.7264,11.8911,3.7684,3.6324,3.099,4.0691,3.6261,0.3274,11.7204,8.7743,4.0691,0.97
144,-0.3014,-8.4923,5.123,-0.272,2.552,0.3852,0.7173,8.4923,13.6153,0.0711,-1.4122,1.7611,0.0455,0.715,-0.1221,-0.0398,1.7611,3.1734,-9.1135,-20.6368,-4.1745,-9.2084,3.7696,-0.6632,-0.5098,20.6368,16.4623,-0.6996,-7.8799,4.7231,-1.0884,2.5056,3.3869,4.4272,7.8799,12.6031,-4.8887,-36.1462,42.0438,-4.6025,18.6593,5.1005,4.7994,42.0438,78.19,0.9024,-4.2712,3.6844,1.3287,1.7269,-5.0782,-6.6133,4.2712,7.9556,0.0701,-3.7421,6.1866,-0.0154,1.9826,-0.8728,-0.1141,6.1866,9.9288,9.4275,4.2765,21.0727,9.3912,3.9062,0.4905,0.4267,21.0727,16.7963,15.3528,2.3622,42.862,12.4004,11.7376,-8.3203,-4.9834,42.862,40.4998
145,0.0837,-4.1771,1.7436,0.4453,1.3931,0.6718,0.2868,4.1771,5.9207,-0.051,-3.4726,1.5427,0.0057,0.9739,0.0668,0.1278,3.4726,5.0153,-9.7767,-14.268,-6.9529,-9.7182,1.6758,-0.1904,-0.2507,14.268,7.3151,2.6873,-7.102,6.1188,3.3389,3.3556,-6.5172,-7.3246,7.102,13.2208,0.2118,-8.7938,9.8263,0.1969,3.6148,1.1072,1.2994,9.8263,18.62,-4.1758,-6.7061,2.0428,-5.2847,2.4225,10.6369,12.3941,6.7061,8.749,-0.8027,-10.9803,4.7637,-0.1295,3.6732,2.2206,0.479,10.9803,15.744,9.9181,7.0999,14.3036,9.8179,1.6743,0.0937,0.1944,14.3036,7.2037,7.0325,2.3787,11.5245,7.417,2.0896,1.4713,1.4659,11.5245,9.1458
146,0.7555,0.3353,1.289,0.7321,0.3235,-0.4696,-0.4567,1.289,0.9537,0.0158,-0.6259,0.5978,0.1334,0.4939,0.0919,-0.1906,0.6259,1.2237,-9.9671,-10.9881,-8.7706,-9.9688,0.6838,-0.0765,-0.2546,10.9881,2.2175,-3.8299,-8.2114,1.0756,-3.9857,3.5986,6.1903,5.4494,8.2114,9.2869,1.3191,-0.7175,3.0013,1.4963,1.1861,0.0503,-0.0831,3.0013,3.7188,6.4611,2.5984,8.444,7.1095,2.0689,1.8872,1.4533,8.444,5.8456,1.4179,-0.7867,4.2062,0.3495,2.1862,-0.366,-0.3674,4.2062,4.9929,10.0117,8.8352,11.0038,10.0123,0.6708,0.0533,0.2302,11.0038,2.1686,8.5038,5.4665,9.835,8.8829,1.5663,0.5473,0.5013,9.835,4.3686
147,0.2859,-0.2521,1.1489,0.2754,0.4422,-0.0454,-0.2003,1.1489,1.4009,0.1077,-0.2549,0.8659,-0.0571,0.4501,-0.2757,-0.0221,0.8659,1.1208,-10.0436,-10.6598,-8.7675,-10.2235,0.6052,0.2604,0.4404,10.6598,1.8923,2.3604,0.0205,5.8161,1.4638,2.4613,0.5369,2.7537,5.8161,5.7956,1.3694,0.2887,2.24,1.4131,0.6824,-0.397,-0.4463,2.24,1.9513,8.3483,4.6731,10.6825,8.5628,2.0165,-13.0525,-13.3441,10.6825,6.0094,1.0519,-0.4924,4.7983,-0.0179,2.2134,-0.6646,0.0416,4.7983,5.2907,10.065,8.7833,10.7215,10.2426,0.6154,-0.2635,-0.4347,10.7215,1.9383,9.0511,5.1451,11.6079,9.3843,2.264,-1.4057,-0.8863,11.6079,6.4628
148,0.2406,-0.3786,1.1367,0.0751,0.4334,-0.2293,-0.2523,1.1367,1.5153,-0.168,-0.7684,0.3632,-0.0793,0.2913,0.2551,0.1909,0.7684,1.1316,-9.7832,-11.2148,-8.4261,-9.7831,0.7415,0.0843,-0.2919,11.2148,2.7886,2.8974,-4.706,9.2982,4.2175,5.0933,0.4901,-0.8682,9.2982,14.0042,0.9723,-0.7087,3.1062,0.9669,1.1052,-0.1159,1.1156,3.1062,3.815,-4.7042,-7.5353,0.1531,-4.7813,2.1302,16.2445,16.2004,7.5353,7.6884,0.3872,-2.2078,3.4177,0.0237,1.6163,-0.0986,0.2799,3.4177,5.6255,9.8015,8.5102,11.2151,9.8079,0.7301,-0.0508,0.3005,11.2151,2.7049,7.6453,4.786,9.9069,8.498,1.7088,5.3288,4.2752,9.9069,5.121
149,0.0113,-1.2129,1.2177,-0.1772,1.0261,0.359,0.5137,1.2177,2.4306,0.0871,-0.3722,0.2986,0.1116,0.2256,-0.2543,-0.2238,0.3722,0.6708,-9.6989,-11.6755,-6.8599,-10.0751,1.5526,-0.0444,0.4131,11.6755,4.8155,3.3875,2.4527,4.798,3.3493,0.7974,-12.2186,-12.0532,4.798,2.3453,0.8564,-7.6125,6.8075,2.0825,5.2177,0.8783,-0.3412,7.6125,14.42,11.5404,9.5996,13.438,11.419,1.4122,-17.7692,-17.3013,13.438,3.8384,0.2886,-1.2516,1.2317,0.3035,0.7759,1.0426,0.6324,1.2516,2.4833,9.7507,6.9539,11.7042,10.1084,1.5404,0.032,-0.4186,11.7042,4.7503,12.9741,9.9798,15.8096,12.7732,1.9074,-1.8543,-1.4739,15.8096,5.8298
150,0.3703,-0.4961,1.4215,0.3365,0.7033,-0.4687,-0.4476,1.4215,1.9176,-0.1672,-0.6511,0.3967,-0.1122,0.383,0.8314,0.8566,0.6511,1.0478,-9.7433,-12.0688,-7.8644,-9.6619,1.3743,-0.1249,-0.1488,12.0688,4.2043,-8.8311,-11.134,-7.4098,-8.7039,1.211,11.2642,20.3248,11.134,3.7243,1.7347,-0.4987,3.5788,1.7413,1.3324,0.1082,0.0131,3.5788,4.0775,-6.2288,-9.9237,-4.6121,-5.8822,1.6764,9.0084,8.0171,9.9237,5.3116,1.3312,-3.5052,4.8243,0.9359,3.21,9.0561,8.5206,4.8243,8.3295,9.7827,7.8748,12.0782,9.6898,1.3564,0.1639,0.1793,12.0782,4.2034,11.1198,8.9608,12.5645,11.2993,1.2836,8.8817,9.1082,12.5645,3.6036
151,-0.0984,-1.1768,1.1356,-0.1111,0.543,-0.1488,-0.2182,1.1768,2.3125,0.6643,-1.3632,2.189,0.7444,0.9179,-1.0457,-1.0984,2.189,3.5522,-9.8682,-12.1717,-7.6311,-9.8107,1.1027,-0.5109,-0.751,12.1717,4.5406,2.4331,-20.7564,17.0177,11.6209,14.8747,-19.044,-28.2422,20.7564,37.7741,1.8429,-1.7587,6.335,1.7544,2.5181,8.5387,8.4394,6.335,8.0937,2.7796,-22.7143,22.3463,2.1349,13.5285,-33.0069,-30.5064,22.7143,45.0606,10.3873,-7.9092,28.2947,9.4566,10.6578,-3.666,-3.4102,28.2947,36.2038,9.9466,7.6482,12.1751,9.869,1.0983,0.487,0.704,12.1751,4.5269,20.0015,14.3028,26.584,20.4076,3.5046,17.2757,13.9626,26.584,12.2812
152,-0.2472,-1.7997,1.4011,-0.3292,0.7634,,,1.7997,3.2009,-0.3814,-1.7809,0.6439,-0.354,0.6098,,,1.7809,2.4248,-10.3791,-16.7992,-4.5469,-10.5618,2.7389,,,16.7992,12.2523,-16.6109,-21.5135,-10.5272,-16.6213,2.6442,,,21.5135,10.9863,10.3815,-3.9812,29.3212,10.1938,8.1897,,,29.3212,33.3025,-30.2273,-49.2298,-8.333,-28.3715,11.0328,,,49.2298,40.8968,6.7212,-9.1909,30.564,6.0463,10.1266,,,30.564,39.7549,10.4336,4.6339,16.8933,10.5731,2.7369,,,16.8933,12.2593,37.2772,23.5464,58.2591,34.3701,9.9948,,,58.2591,34.7128
