AYGX_min,AZ_mean,AYGX_mean,AYGX_std,AZ_mean.1,GX_std,Gnorm_max,Gnorm_median,timestamp
-8.2022,-9.7808,-2.5522,5.4553,-9.7808,1.6568,11.1171,8.7744,60
-293.8957,-9.5057,-36.5363,185.0641,-9.5057,35.2295,50.2066,37.7557,61
-303.9838,-9.6798,-47.0094,128.6003,-9.6798,23.8193,47.8174,14.3725,62
-6.8927,-9.7512,-4.5234,2.3273,-9.7512,1.9313,6.492,4.3248,63
1.0777,-9.7979,1.8448,0.5845,-9.7979,0.6152,5.5745,5.2661,65
