AYGX_min,AZ_mean,AYGX_mean,AYGX_std,AZ_mean.1,GX_std,Gnorm_max,Gnorm_median,timestamp
-39.1727,-9.7333,-2.9259,16.684,-9.7333,16.3795,31.1571,17.4462,208
-24.3228,-9.5837,4.1916,25.3448,-9.5837,11.1854,28.8794,18.454,210
-595.4098,-9.8645,-49.3827,160.9215,-9.8645,48.6056,109.1777,50.5521,211
-264.6969,-9.6606,-68.7865,91.0603,-9.6606,42.9564,78.1381,53.0168,212
-444.8202,-9.8083,-92.7586,138.6808,-9.8083,32.9972,83.3112,44.2266,213
