AYGX_min,AZ_mean,AYGX_mean,AYGX_std,AZ_mean.1,GX_std,Gnorm_max,Gnorm_median,timestamp
-85.084,-6.6575,-9.2587,46.5031,-6.6575,17.0562,124.7198,48.7411,193
-238.2602,-6.8984,-36.3764,73.528,-6.8984,20.3419,69.9726,32.326,194
-280.8912,-6.0159,-13.4481,78.3639,-6.0159,16.518,112.9942,40.7742,195
-36.281,-8.5977,-4.4116,15.6715,-8.5977,8.3919,42.7912,13.9439,196
-110.488,-9.9671,-25.4292,58.7101,-9.9671,17.0123,28.057,19.4096,197
