AYGX_min,AZ_mean,AYGX_mean,AYGX_std,AZ_mean,GX_std,Gnorm_max,Gnorm_median,timestamp
-5.5943,-9.667,1.4661,3.0098,-9.667,1.5698,4.0407,1.4981,0
0.5923,-9.6709,1.6125,0.5459,-9.6709,0.2983,1.4362,1.0687,1
0.7084,-9.6712,1.6743,0.4163,-9.6712,0.2253,1.355,1.0362,2
0.7356,-9.6705,1.7711,0.4475,-9.6705,0.2498,1.5389,1.1125,3
0.8288,-9.6692,1.7681,0.4813,-9.6692,0.265,1.4642,1.088,4
1.0399,-9.672,1.7967,0.4719,-9.672,0.265,1.64,1.0648,5
-0.0534,-9.6684,1.6851,0.8636,-9.6684,0.474,1.6764,1.2299,6
1.0991,-9.6689,1.5189,0.2815,-9.6689,0.1594,1.1281,1.0174,7
1.3587,-9.6678,2.1979,0.4561,-9.6678,0.2717,1.6547,1.2719,8
0.8734,-9.6712,1.7607,0.5002,-9.6712,0.2828,1.3731,1.1131,9
0.6361,-9.6709,1.6836,0.6668,-9.6709,0.3697,1.6637,0.9895,10
1.3068,-9.6744,1.7504,0.4016,-9.6744,0.2247,1.3474,1.0282,11
1.5166,-9.671,1.6942,0.0933,-9.671,0.0523,1.0921,1.0394,12
2.4598,-9.6993,9.4597,5.7224,-9.6993,4.2746,12.4585,3.5906,13
-2.4191,-9.8053,1.3536,2.4674,-9.8053,2.475,12.1362,7.1004,14
-31.2734,-9.49,-10.9615,14.9962,-9.49,6.5744,68.5063,65.4213,18
3.5489,-9.8203,23.9246,14.8929,-9.8203,3.7223,33.6505,24.1612,19
-14.3478,-9.7358,-8.4093,3.5926,-9.7358,4.7733,23.3813,10.0072,20
-4.1342,-9.7435,-0.6232,1.9327,-9.7435,1.6943,7.3936,2.8076,21
-0.7214,-9.7578,2.9519,1.4838,-9.7578,1.8185,6.0883,5.144,22
-27.9717,-9.7792,-4.417,8.659,-9.7792,3.3137,15.5496,9.0862,23
-16.2592,-9.7052,-0.4298,13.0467,-9.7052,6.8552,8.8207,7.1838,24
-1.3817,-9.8023,0.2689,1.4176,-9.8023,2.0998,3.8046,1.7342,25
1.08,-9.7832,1.6071,0.521,-9.7832,0.2581,1.956,1.5971,26
2.0181,-9.7915,4.8446,2.2147,-9.7915,1.6714,10.1393,5.0128,27
-8.2371,-9.7754,2.6741,7.831,-9.7754,3.1451,34.728,29.1934,28
-12.5257,-9.8272,0.183,4.268,-9.8272,3.4153,21.8246,15.5694,29
-12.3433,-9.944,4.8583,10.0372,-9.944,11.3237,45.942,20.0365,30
-30.6984,-9.6208,7.6075,27.0339,-9.6208,9.0368,49.4507,22.2215,31
-7.0077,-9.8855,5.2351,8.3362,-9.8855,9.2684,24.1851,20.0428,33
-12.677,-9.5329,-1.083,5.2456,-9.5329,6.9331,16.6612,10.6315,34
-7.7554,-10.0104,-1.5336,2.8161,-10.0104,2.2977,8.7593,6.851,35
-7.6019,-9.9026,-2.429,3.3815,-9.9026,1.9675,8.1992,7.1687,36
-9.3489,-9.6986,2.6892,7.2563,-9.6986,6.0195,21.6487,15.2331,37
1.0009,-9.9767,2.8046,1.489,-9.9767,2.2153,11.1575,8.999,38
-1.3324,-11.0705,2.4323,5.1635,-11.0705,4.3283,17.9916,11.9108,39
-11.7969,-9.7891,-1.7703,3.4536,-9.7891,5.8704,16.737,7.1487,40
-9.9267,-9.8223,1.8613,4.8053,-9.8223,8.5271,23.435,12.2209,41
-5.417,-10.1758,-0.3825,4.1611,-10.1758,7.371,21.7657,18.8665,42
-7.7823,-9.7592,1.33,2.9211,-9.7592,4.172,14.7047,10.7125,43
-15.2451,-9.8563,3.8125,6.5203,-9.8563,8.4468,26.9672,13.7977,44
-3.5774,-9.8471,2.7947,7.0524,-9.8471,6.7764,16.401,4.5583,45
-0.2637,-9.8028,0.4422,0.6089,-9.8028,1.1349,2.828,2.413,46
-1.1085,-9.8572,0.4652,1.1397,-9.8572,3.4472,9.0049,6.226,47
0.5094,-9.8821,2.4584,1.6296,-9.8821,1.8538,12.2021,11.236,48
-3.9453,-9.8336,-2.2343,2.2461,-9.8336,1.3309,8.7038,7.371,49
-8.7316,-10.0287,2.2136,5.6921,-10.0287,6.9567,57.2389,41.777,50
-33.9871,-10.073,-0.5568,9.6245,-10.073,6.2781,44.0602,22.3195,51
-23.9795,-9.7841,0.6664,7.9832,-9.7841,10.6206,33.0624,12.4427,52
-11.7926,-9.9164,1.8024,5.6366,-9.9164,7.5218,23.7639,11.9772,53
-5.3201,-9.7522,1.1342,4.0855,-9.7522,6.5619,16.8327,11.31,54
-6.9615,-9.8673,1.3403,3.6221,-9.8673,3.3347,13.8918,7.4115,55
-21.8421,-9.6589,-1.6395,7.7324,-9.6589,8.6477,23.6342,14.138,56
-3.7528,-9.919,-1.1268,1.8883,-9.919,1.8548,8.7466,6.07,57
-4.2707,-10.0254,-0.1664,2.976,-10.0254,5.1991,9.9247,7.0673,58
0.0062,-9.7603,0.6607,0.5589,-9.7603,2.2306,6.7218,4.0028,59
-0.403,-9.878,1.2005,1.3892,-9.878,2.8726,8.9619,4.8197,60
-2.0425,-9.7759,0.9941,1.4069,-9.7759,2.6015,12.6526,4.7102,61
-2.6704,-9.8509,0.8878,2.0388,-9.8509,2.428,10.7526,5.8291,62
-1.728,-9.8026,1.9472,3.4779,-9.8026,3.748,10.9469,8.2283,63
-0.5455,-9.8489,1.0069,1.1759,-9.8489,1.8788,8.2981,6.4302,64
-1.3118,-9.7382,-0.871,0.4472,-9.7382,0.9669,10.2287,9.3941,65
-7.6097,-9.7126,3.2156,6.1337,-9.7126,2.3706,18.0157,13.3304,66
-6.2417,-9.6983,-1.5367,2.6823,-9.6983,1.7946,13.9936,11.3856,67
-1.6995,-9.7546,0.1683,1.0351,-9.7546,1.3429,10.0504,7.4113,68
-25.4534,-9.8062,-2.2979,6.1834,-9.8062,3.7581,18.2742,6.5196,69
-2.3117,-9.7964,-0.3085,1.1494,-9.7964,1.537,6.6298,3.2247,70
-33.9128,-9.7146,-8.9153,9.2328,-9.7146,4.0308,13.531,5.8583,71
-0.921,-9.6739,2.9646,3.0114,-9.6739,1.6891,5.382,2.1323,72
0.2649,-9.6869,3.7819,1.9147,-9.6869,1.1085,3.7023,2.5462,73
2.6437,-9.7095,5.2072,1.8839,-9.7095,0.7669,5.1654,4.0293,74
-4.6456,-9.7046,1.2934,3.6198,-9.7046,2.2668,3.0246,2.4892,75
3.008,-9.7474,3.7039,0.6303,-9.7474,0.4112,3.4535,2.7063,76
-2.4659,-9.7415,1.8922,2.5579,-9.7415,2.0129,12.009,3.9925,77
-4.814,-9.7987,5.0001,9.4137,-9.7987,6.2803,28.0208,17.0275,78
-8.1366,-9.7975,-1.472,2.609,-9.7975,4.7687,24.1489,10.783,79
-2.9555,-9.7062,1.5357,3.8525,-9.7062,3.936,8.1476,5.9765,80
-14.577,-9.7518,-2.0536,8.0683,-9.7518,8.3733,28.7369,16.0941,81
-2.5929,-9.6629,3.2904,2.8952,-9.6629,3.0762,18.7198,17.7828,82
-17.4241,-9.7855,4.5532,13.729,-9.7855,14.524,34.3629,23.1575,84
-13.7159,-9.7168,-1.0302,5.4342,-9.7168,6.9029,20.1883,10.6525,85
-16.5469,-9.861,-1.0758,6.1413,-9.861,7.6923,22.8827,13.5471,86
-3.621,-9.8405,1.1263,5.1149,-9.8405,5.6372,19.1542,11.6496,87
-19.7824,-9.8302,0.0905,7.5715,-9.8302,10.7069,27.0109,16.751,88
-8.5302,-9.7373,-0.4792,3.0109,-9.7373,5.2322,18.8948,9.6512,89
-5.4374,-10.1009,0.8094,4.4333,-10.1009,4.4502,19.8633,18.2059,90
-6.9162,-10.1726,5.64,6.5333,-10.1726,4.8328,18.5495,16.694,91
-15.4982,-9.7117,-0.8364,7.151,-9.7117,7.0457,21.0937,16.2403,92
-8.8445,-9.7,0.6921,4.8179,-9.7,3.1312,18.1754,12.098,93
-5.7442,-9.9347,-1.5781,2.1911,-9.9347,4.0493,12.5434,10.2266,94
-2.9485,-9.7968,4.1364,4.8959,-9.7968,2.9071,20.1912,16.7144,95
-9.2642,-9.7779,1.1689,5.1869,-9.7779,7.0923,17.0519,10.7176,96
-5.8085,-9.9617,-0.0341,3.9216,-9.9617,2.9679,17.2555,15.9614,97
-8.033,-9.8192,1.4967,6.5215,-9.8192,6.2065,13.4547,10.5634,98
-7.9019,-9.6293,0.6731,4.5265,-9.6293,7.3552,14.4948,11.3791,99
-0.7726,-9.9298,2.9285,4.7956,-9.9298,4.5521,22.7679,8.2531,100
-1.1684,-9.6017,-0.2019,0.6278,-9.6017,1.2284,4.7371,3.5746,101
-1.5946,-9.7069,0.7798,2.4673,-9.7069,2.0288,13.9338,10.0833,102
-1.9994,-10.3894,2.7212,4.4397,-10.3894,5.4032,46.0997,39.1397,103
-17.0412,-10.5967,-6.2084,6.8173,-10.5967,5.1261,55.7648,39.9265,104
-26.1254,-9.8067,0.8767,13.3312,-9.8067,11.1536,44.6746,25.8939,105
-2.3212,-9.8499,3.7771,5.53,-9.8499,5.0653,21.0626,11.7131,106
-11.3324,-9.8391,-0.0854,3.8115,-9.8391,4.9052,12.6229,6.6274,107
-5.6625,-9.8261,1.7821,5.3158,-9.8261,3.9153,14.2951,4.1109,108
-1.5299,-9.7376,0.1039,1.0444,-9.7376,1.7051,9.2447,4.8132,109
-6.0583,-9.9035,0.8112,2.7962,-9.9035,4.6123,16.8252,7.3032,110
-7.9981,-9.6075,2.1433,4.9218,-9.6075,7.1294,19.6852,13.7646,111
-6.222,-9.7525,0.8661,3.2861,-9.7525,6.1397,19.9977,9.0274,113
-5.9521,-9.8771,1.2229,3.4687,-9.8771,7.8187,22.2085,10.6915,114
-20.5884,-9.8892,0.7322,6.0862,-9.8892,5.9532,22.7591,11.4785,115
-8.5689,-9.7692,-1.8851,3.6577,-9.7692,2.5024,7.4415,5.64,116
-9.3441,-9.8724,-0.6563,3.1364,-9.8724,5.538,11.24,6.2034,117
-6.2035,-9.8882,0.8613,2.837,-9.8882,4.793,12.5733,7.4221,118
-0.6747,-9.9294,0.0138,0.4398,-9.9294,1.9505,5.387,3.9149,120
-0.6637,-9.7123,0.6934,1.3157,-9.7123,1.4685,7.3968,4.8328,121
-0.3177,-9.9098,0.5667,0.4869,-9.9098,0.6515,3.8997,3.2486,122
-1.4729,-9.8527,-0.3917,0.6419,-9.8527,0.8866,5.5369,3.9033,123
0.588,-9.8706,2.1312,1.0159,-9.8706,0.6187,6.8295,5.6526,124
-16.1297,-9.8194,0.7406,5.6059,-9.8194,4.7482,31.323,14.4606,125
-25.9919,-9.9805,-4.0113,11.6565,-9.9805,3.6148,35.9272,19.5616,126
-15.0693,-10.2289,3.9154,10.032,-10.2289,9.2119,50.0962,41.2098,127
-7.9739,-9.6942,3.5113,6.6809,-9.6942,9.9844,33.4861,15.0666,128
-43.4468,-9.8775,3.1682,19.7491,-9.8775,11.5328,29.2195,17.1945,129
-25.0015,-9.8411,-4.6642,7.62,-9.8411,6.0888,20.9896,12.7765,130
-35.5986,-9.9449,-4.1475,15.5589,-9.9449,8.5278,28.6698,24.1041,131
-25.6052,-9.7162,-4.5051,8.8764,-9.7162,6.3008,21.1581,14.2897,132
-10.4172,-10.0707,-2.8707,5.5278,-10.0707,1.8258,21.062,15.8572,133
-4.1733,-9.8432,1.6966,4.105,-9.8432,4.3242,14.0496,6.6681,135
-1.2661,-9.873,0.453,0.8482,-9.873,2.2871,6.8252,4.5449,136
-0.6697,-9.7692,0.3365,0.7522,-9.7692,1.9082,5.8256,3.9795,137
-0.2419,-9.7811,0.418,0.5832,-9.7811,1.0883,6.327,3.7885,138
-3.5895,-9.8952,1.3843,2.8211,-9.8952,4.6334,15.1952,6.379,139
-1.5604,-9.8629,0.5729,2.3239,-9.8629,4.3954,16.3618,6.1855,140
2.9664,-9.7915,6.4581,3.1027,-9.7915,2.0711,13.3514,10.505,141
-0.4547,-9.8599,-0.1277,0.1564,-9.8599,0.4498,5.4779,3.752,142
0.0817,-9.7891,0.4652,0.3783,-9.7891,0.7879,2.5559,2.1786,143
-0.2446,-9.8002,-0.0848,0.0957,-9.8002,0.3248,2.9167,2.4171,144
0.0516,-9.8158,0.7119,0.4367,-9.8158,0.6411,7.1545,6.7474,145
-0.726,-9.8205,-0.1602,0.2651,-9.8205,1.1277,14.6388,7.7189,146
-0.2654,-9.8199,-0.0798,0.1569,-9.8199,0.5242,13.3022,8.0774,147
-1.0753,-9.8007,1.9191,2.2851,-9.8007,1.6449,19.5265,7.7459,148
-4.0984,-9.8391,-0.8561,1.2896,-9.8391,2.5431,35.5705,22.1555,149
-0.5746,-9.816,0.7844,1.2354,-9.816,2.7067,16.4458,6.6992,150
-0.532,-9.8083,0.3964,0.4569,-9.8083,1.1005,9.5115,2.8997,151
-0.5024,-9.8573,0.0573,0.3034,-9.8573,2.0625,13.8491,7.7553,152
-0.0639,-9.8173,0.543,0.4091,-9.8173,0.8097,5.4695,3.2226,153
-0.6943,-9.8005,0.1047,0.5738,-9.8005,0.7694,3.3198,2.3985,154
-3.1646,-9.8345,-1.7167,1.314,-9.8345,1.0352,17.1298,15.0049,155
-1.6253,-9.8176,3.2518,2.63,-9.8176,1.8389,28.465,23.815,156
-8.6612,-9.8549,-0.3826,4.4159,-9.8549,5.4962,41.0291,23.5498,157
-3.3955,-9.8107,-0.3338,2.0071,-9.8107,1.9299,29.6151,23.3545,158
-2.9474,-9.7979,0.4328,1.553,-9.7979,3.383,11.1828,7.5798,160
-3.059,-9.8151,0.5865,2.2717,-9.8151,3.168,10.304,8.1588,161
1.5454,-10.065,2.6582,0.8425,-10.065,0.9818,40.34,36.3993,162
-2.6164,-9.8357,3.0534,4.4803,-9.8357,7.5178,19.2415,10.1049,163
-0.3353,-9.8874,0.3144,0.6233,-9.8874,2.3293,14.8625,14.5019,164
-1.7562,-9.8794,0.2885,1.108,-9.8794,1.948,11.5618,5.3083,165
-0.7758,-9.6371,0.179,0.6943,-9.6371,1.2149,16.3761,14.8339,166
-0.8354,-9.8618,0.318,0.715,-9.8618,0.6928,5.9833,3.4139,167
-0.9612,-9.797,0.54,0.7335,-9.797,1.512,12.2402,4.954,168
0.4502,-9.8054,1.8698,0.9779,-9.8054,0.7735,20.1093,16.1872,169
-3.1375,-9.8501,0.584,1.8282,-9.8501,2.9341,67.2616,40.982,170
-14.0514,-9.911,-0.2321,6.2934,-9.911,6.7906,119.6397,93.3799,171
-2.3934,-9.8422,4.6399,6.0941,-9.8422,3.4414,74.9823,43.1904,172
-2.1042,-9.8606,0.6946,1.7111,-9.8606,3.3052,31.9885,23.9802,173
-2.6759,-9.8143,2.8084,3.043,-9.8143,1.8994,26.9825,17.0077,174
-24.9269,-9.8355,2.9307,10.05,-9.8355,7.4374,66.9708,46.139,175
-4.9152,-9.8864,2.2639,4.5359,-9.8864,5.8313,27.9831,11.2738,176
3.1027,-9.9489,12.7424,7.8687,-9.9489,2.4208,34.889,23.7164,177
-34.529,-10.1309,-6.9373,19.0387,-10.1309,5.7637,71.3432,67.8321,178
-40.6757,-9.8964,-4.9406,12.8109,-9.8964,13.4615,46.5357,21.8193,179
-25.4928,-9.8226,-1.0276,9.7059,-9.8226,6.5761,23.9192,17.0724,180
-31.1209,-9.876,-5.4737,10.4144,-9.876,11.8593,28.848,21.7595,181
-4.7147,-9.8944,0.7666,2.3182,-9.8944,4.5809,16.5282,10.0996,182
-2.6203,-9.8386,4.1277,6.4776,-9.8386,7.025,20.4892,12.2646,183
-3.6681,-9.8377,0.3647,4.1144,-9.8377,2.9877,16.6338,12.1662,184
-1.402,-9.7336,1.7731,2.9053,-9.7336,5.4495,12.6069,10.944,186
-0.4997,-9.9348,0.2427,0.7694,-9.9348,2.3699,7.2788,6.2931,187
-1.4004,-9.8136,0.6249,1.4672,-9.8136,2.2552,9.0989,8.0916,188
1.6276,-9.904,2.25,0.4898,-9.904,0.4866,8.1685,6.3116,189
-0.4566,-9.8272,1.1532,1.6216,-9.8272,2.4183,9.4777,4.8896,190
-2.4758,-9.8296,0.687,1.6266,-9.8296,2.5967,14.7734,6.3716,191
-2.441,-9.8333,-1.2377,0.8516,-9.8333,1.2809,18.966,16.5778,192
-9.2092,-9.7904,-1.6373,3.5299,-9.7904,3.475,7.2154,2.3393,193
0.646,-9.7917,1.4978,0.7432,-9.7917,0.7586,3.0535,1.3151,194
0.371,-9.791,0.4733,0.0668,-9.791,0.0702,0.8001,0.6987,195
0.7363,-9.7907,0.8775,0.1294,-9.7907,0.1409,1.1739,0.9683,196
0.0541,-9.7881,1.0116,0.508,-9.7881,0.6183,2.0003,1.4267,198
1.1205,-9.7921,1.829,0.6159,-9.7921,0.4454,4.4845,4.0801,199
-4.9075,-9.799,0.9208,1.8025,-9.799,1.7218,3.926,2.1219,200
-0.1431,-9.8107,0.7495,0.5875,-9.8107,0.793,2.1859,1.3819,201
-6.3621,-9.8135,-0.0439,2.1584,-9.8135,2.5944,22.9913,4.3252,202
-3.5848,-9.8033,7.1264,9.1165,-9.8033,6.5008,27.029,18.5345,203
-3.4354,-9.7995,1.1351,4.1184,-9.7995,3.7419,16.7368,10.9958,204
-2.5921,-10.3125,13.0637,16.5492,-10.3125,5.6304,53.6967,42.7238,205
-34.0369,-10.3014,-1.0486,16.5059,-10.3014,5.6221,62.0879,43.5459,206
-32.1219,-9.6608,-6.4125,13.9201,-9.6608,4.8149,37.345,15.2927,207
-30.1353,-10.1517,-15.2587,12.8112,-10.1517,3.5867,34.781,29.351,208
-18.6753,-9.7833,-7.1271,7.2029,-9.7833,1.3727,19.2661,11.5356,209
-8.6347,-9.78,0.3589,7.718,-9.78,2.6197,13.612,12.8727,210
-12.3563,-9.6104,0.0155,5.0803,-9.6104,6.9537,29.7304,14.0641,211
-20.9381,-9.8575,-2.6494,7.6872,-9.8575,6.8025,17.9077,12.6415,212
-34.4205,-9.8221,-4.7158,9.4676,-9.8221,7.7353,35.8147,11.6803,213
-0.5782,-9.8979,20.0194,21.1789,-9.8979,10.7541,31.2799,25.3104,214
-17.6214,-9.6425,-4.2703,7.568,-9.6425,4.2118,17.5008,10.9365,215
-18.3093,-9.4409,1.3381,10.5446,-9.4409,3.8702,41.7053,21.3019,216
-7.823,-9.0999,-1.8165,3.1922,-9.0999,4.007,9.6153,6.4779,217
-5.2028,-9.6718,-0.7659,4.122,-9.6718,7.4571,12.2261,8.9719,218
-22.0705,-9.4216,15.0327,23.0747,-9.4216,4.1383,32.8427,24.5239,219
-23.9469,-9.9398,1.3932,10.0798,-9.9398,13.9623,36.1988,17.1857,220
-14.8659,-9.2645,-0.9649,6.8396,-9.2645,9.1881,42.2505,19.9151,221
-9.4324,-10.0517,0.9619,4.4396,-10.0517,6.2224,24.6328,10.8947,222
-8.4308,-9.6014,1.1472,3.9975,-9.6014,5.1258,22.6327,11.9588,223
-3.0894,-9.4858,-0.596,2.1607,-9.4858,2.6634,15.478,8.7801,224
-4.02,-8.9443,4.0967,7.3212,-8.9443,8.0388,15.5911,11.8126,225
-6.1408,-8.8947,-0.5192,2.8444,-8.8947,3.0226,26.0388,6.7994,226
-8.359,-7.8629,-1.2216,3.1317,-7.8629,2.3106,25.3222,6.1624,227
-5.996,-9.7601,-1.9548,2.6102,-9.7601,3.0087,27.3722,21.457,228
-9.6808,-10.487,7.3344,11.8385,-10.487,9.3334,68.539,41.2208,229
-23.2452,-9.8805,2.848,14.8747,-9.8805,8.8778,30.5734,19.8151,230
-35.9589,-9.7993,-1.096,12.2424,-9.7993,11.5091,42.4044,17.7811,231
-21.847,-9.7943,-5.4447,8.0805,-9.7943,9.0445,28.2299,17.9205,232
-16.8804,-9.8117,5.1957,9.6116,-9.8117,10.6938,29.9622,17.0596,233
-15.8471,-9.8111,0.814,8.6246,-9.8111,8.5736,31.1587,16.0953,234
-2.0169,-9.513,5.3005,5.028,-9.513,6.6989,20.6052,14.1934,235
-2.1148,-9.6836,3.4746,6.3327,-9.6836,3.6506,15.9093,6.9331,237
-1.4349,-10.1066,7.3942,5.4368,-10.1066,0.9098,15.2259,13.2495,238
-5.9914,-10.4438,6.6069,10.4783,-10.4438,3.4271,42.1101,27.8798,239
-17.6453,-10.3065,-0.9499,8.4932,-10.3065,11.012,54.3356,39.2547,240
-20.1753,-9.5502,1.2863,11.7167,-9.5502,7.9436,39.805,24.2147,241
-1.5585,-10.0446,2.331,4.3105,-10.0446,4.5721,9.7266,6.9881,242
-13.6206,-9.8273,4.7097,13.3389,-9.8273,12.046,33.1476,16.7412,243
-11.6926,-9.8342,1.4105,7.1313,-9.8342,11.2573,24.7463,13.539,244
-5.9976,-9.9899,1.4241,5.1587,-9.9899,8.6716,18.2673,11.7377,245
-2.3367,-9.7861,1.0494,3.5384,-9.7861,2.7271,19.7564,6.5429,246
-0.3168,-9.827,0.6866,0.9424,-9.827,1.9962,10.358,5.4408,247
-1.473,-9.7813,0.1435,1.2722,-9.7813,1.1006,8.3566,5.4026,248
-0.1908,-10.0935,0.2932,0.399,-10.0935,1.2463,12.652,6.7451,249
-0.9026,-9.9608,1.0512,1.3441,-9.9608,0.8796,15.3819,13.0478,250
-30.1187,-9.9763,12.8392,20.1306,-9.9763,11.7784,74.5555,32.0065,251
-1.408,-9.6151,0.4069,1.0053,-9.6151,2.5145,23.1907,17.911,252
-7.801,-9.8289,4.9425,9.7405,-9.8289,5.7998,37.4723,21.9286,253
-15.7208,-9.9035,-1.4229,4.5447,-9.9035,3.7794,26.3436,11.1623,254
-20.3992,-9.7962,-0.5043,6.774,-9.7962,6.152,23.9555,11.2809,255
-15.5621,-10.13,-3.3561,6.5788,-10.13,1.8679,21.3837,13.9143,256
-4.8486,-9.7018,-1.2111,3.3306,-9.7018,3.0113,18.2426,8.5923,257
-12.7395,-9.9665,-0.0959,7.3816,-9.9665,2.0363,19.6881,13.2181,258
-4.5722,-10.0773,-0.2712,2.6795,-10.0773,1.93,18.2873,11.5924,259
-5.7229,-9.7576,-0.5276,2.1003,-9.7576,3.1771,14.1111,9.5634,260
-17.5634,-9.0767,0.7492,8.8199,-9.0767,6.3248,34.9981,12.6955,261
-1.6228,-10.6446,0.2865,1.7192,-10.6446,3.1489,18.0835,13.7018,262
-6.16,-9.6726,1.5056,3.6973,-9.6726,4.7904,13.6842,7.9044,263
-1.6687,-10.2007,-0.1862,0.7968,-10.2007,1.6396,10.7226,4.2108,264
1.2034,-9.1625,7.0618,4.6322,-9.1625,2.6755,15.1635,13.3214,265
-3.8287,-10.1902,1.0162,3.6455,-10.1902,2.3847,21.1057,10.4456,266
-1.5342,-9.8981,0.7192,2.3196,-9.8981,0.94,9.9454,8.124,267
-10.876,-10.0003,-3.0646,4.2032,-10.0003,1.6421,14.378,11.3456,268
-0.5818,-9.6176,-0.1683,0.2859,-9.6176,1.1141,18.0831,10.977,269
-26.96,-9.8632,-0.4835,8.1076,-9.8632,2.974,18.7986,10.8604,270
-11.8109,-9.8316,-2.5857,4.0717,-9.8316,3.4659,15.7802,10.4929,271
-20.094,-9.861,0.4117,6.6913,-9.861,5.8656,23.7519,13.642,272
-1.4561,-9.9232,2.6311,2.3995,-9.9232,2.1653,16.8959,8.5842,273
-3.1555,-9.9411,8.0366,9.0526,-9.9411,1.6258,33.6136,16.5492,274
-25.2688,-9.7728,-2.9857,11.6204,-9.7728,10.1593,40.6479,22.7119,275
-40.1714,-9.9683,-11.812,15.1651,-9.9683,7.8092,31.7486,22.4278,276
-15.3928,-9.7107,-4.5896,6.914,-9.7107,2.6668,24.8221,13.7495,277
-9.9729,-9.8009,-2.651,4.4516,-9.8009,7.1826,14.5515,9.6305,278
-4.2977,-9.8575,2.8984,4.2504,-9.8575,9.3736,21.3308,14.667,279
-10.4265,-9.7701,1.669,6.8201,-9.7701,6.93,22.1518,7.9661,280
-2.0926,-9.8793,3.7975,3.1952,-9.8793,2.7148,12.3774,9.4755,281
-7.7087,-9.9987,-0.2858,2.6131,-9.9987,5.2838,17.1116,10.8767,282
-7.9684,-9.7757,3.3522,4.7669,-9.7757,8.7268,20.1398,12.696,283
-4.9807,-10.7737,8.4659,10.4441,-10.7737,3.641,22.3788,15.7268,284
-2.4442,-9.551,-0.7505,1.3705,-9.551,3.3193,23.802,13.9521,285
-1.5558,-9.9794,0.1279,0.9797,-9.9794,4.0171,10.2661,5.3938,286
-1.2537,-9.8276,1.0057,2.0847,-9.8276,0.8658,11.8635,7.8413,288
1.1937,-10.0052,20.9563,17.2326,-10.0052,1.4508,35.7483,28.6569,289
-76.7807,-9.9865,12.1018,31.4062,-9.9865,9.6116,74.0081,50.5845,290
-2.5851,-9.9448,5.3106,4.4101,-9.9448,3.5361,71.7978,34.2048,291
-34.2092,-9.9622,23.7262,35.4983,-9.9622,19.1203,41.0573,30.7716,292
-0.4205,-9.8305,12.3798,8.0875,-9.8305,6.1527,47.2519,36.1898,293
-21.957,-9.8673,1.8154,10.4372,-9.8673,4.9028,34.6223,12.6803,294
-28.6496,-10.5525,0.0094,13.1841,-10.5525,10.9612,67.7942,51.6324,295
-14.895,-9.7107,23.2889,27.7931,-9.7107,11.1818,36.8867,27.7104,296
-18.7856,-9.8901,-0.43,7.4976,-9.8901,3.5459,23.8022,16.9532,297
-3.4974,-9.8291,-0.116,2.3128,-9.8291,2.0864,15.2983,9.9182,298
-0.8707,-9.6641,-0.2436,0.4633,-9.6641,1.6781,11.3868,9.8899,299
-11.316,-9.8512,-0.3471,4.68,-9.8512,4.6358,20.8313,11.5002,300
-10.8012,-9.7185,0.6737,5.4818,-9.7185,7.8689,25.6224,12.5825,301
-5.2946,-10.0318,-3.1554,2.1112,-10.0318,6.8515,21.1208,17.4124,302
-6.3474,-9.8908,1.6753,3.4655,-9.8908,3.4579,17.0211,8.4356,303
-8.5584,-9.8107,-0.6947,2.574,-9.8107,5.1096,15.4774,9.5485,304
-32.0483,-10.4102,0.1601,13.6606,-10.4102,5.0057,28.0157,13.9627,305
-9.3497,-10.0489,-0.6654,6.1465,-10.0489,3.3125,19.2827,12.3656,306
-14.1956,-9.8169,-2.4597,6.7231,-9.8169,2.1886,18.8428,13.7696,307
-6.3187,-9.5314,1.8897,5.6864,-9.5314,2.0419,14.7161,10.3577,308
-1.2647,-9.1508,0.8485,1.4838,-9.1508,3.1898,11.7451,9.103,309
-0.3634,-9.8254,1.7602,1.6484,-9.8254,1.2527,10.5148,4.7339,310
-6.9138,-9.9169,-1.1769,2.3158,-9.9169,1.6701,20.0294,8.2748,311
-4.7408,-9.9505,-1.1963,2.3022,-9.9505,1.6286,19.7247,16.0937,312
-0.1371,-9.8128,14.2402,15.2452,-9.8128,6.4793,32.3041,26.6379,313
-1.7865,-10.0822,8.2032,10.2843,-10.0822,11.2969,58.8885,49.3948,314
-4.1653,-9.7483,-0.2027,2.8334,-9.7483,2.1062,14.4629,9.7009,315
-12.6893,-9.7821,-3.9342,4.667,-9.7821,3.756,9.7415,5.0293,316
-2.8939,-9.7818,0.6302,1.7428,-9.7818,1.1962,2.1973,1.8318,317
0.4969,-9.749,2.5599,0.8547,-9.749,0.7178,2.9308,2.1338,318
0.6184,-9.7774,1.4655,0.5167,-9.7774,0.4398,1.9798,1.5174,319
0.9481,-9.7627,1.4292,0.2293,-9.7627,0.1796,1.4752,1.313,320
