AYGX_min,AZ_mean,AYGX_mean,AYGX_std,AZ_mean,GX_std,Gnorm_max,Gnorm_median,timestamp
-3.7502,-9.8404,-0.3303,1.5178,-9.8404,0.9429,3.5064,2.6303,0
-3.853,-9.8358,-0.7022,1.5278,-9.8358,0.8949,3.1831,2.7064,1
-2.0459,-9.8394,-0.2132,0.8429,-9.8394,0.5203,2.8357,2.6354,3
-2.5009,-9.8373,-0.4295,1.4054,-9.8373,0.8623,3.5686,2.6725,4
-3.3627,-9.8423,-0.9122,1.2542,-9.8423,0.8302,3.2162,2.7371,5
-2.6699,-9.8425,0.1501,2.1756,-9.8425,1.4445,4.0123,2.8427,6
-1.9289,-9.8388,-0.1465,0.9359,-9.8388,0.5849,2.8836,2.6533,7
-4.0008,-9.8362,-0.7134,1.7301,-9.8362,1.0723,3.6021,2.7125,8
-3.0238,-9.84,-0.4391,1.1373,-9.84,0.6816,2.9195,2.6549,9
-1.1969,-9.8352,-0.4882,0.6472,-9.8352,0.3908,2.6279,2.6089,10
-0.7073,-9.8389,-0.4113,0.1933,-9.8389,0.1181,2.6129,2.5897,12
-0.602,-9.8377,-0.4031,0.1284,-9.8377,0.0786,2.6049,2.5842,13
-0.5366,-9.8377,-0.4107,0.088,-9.8377,0.054,2.5997,2.5876,14
-0.5034,-9.8376,-0.4217,0.0688,-9.8376,0.0422,2.6108,2.592,15
-0.4953,-9.8392,-0.4226,0.0426,-9.8392,0.026,2.6075,2.5903,16
-0.466,-9.8384,-0.4123,0.0335,-9.8384,0.0204,2.6081,2.5894,17
-0.4472,-9.8388,-0.4073,0.0282,-9.8388,0.0177,2.5901,2.5796,18
-0.4438,-9.8378,-0.4109,0.0208,-9.8378,0.0129,2.6074,2.5826,19
-2.1211,-9.8395,-0.4542,0.7347,-9.8395,0.447,2.785,2.6023,20
-1.7569,-9.8385,-0.3401,0.9265,-9.8385,0.5718,2.7809,2.6164,21
-2.3409,-9.8386,-1.0149,0.8445,-9.8386,0.499,2.9091,2.7482,22
-0.7511,-9.8403,-0.362,0.2916,-9.8403,0.1787,2.6149,2.6006,23
-33.5924,-9.8239,-2.2218,27.0241,-9.8239,2.4142,25.3583,23.927,24
-0.2936,-9.9439,0.3172,0.4435,-9.9439,0.6074,4.7448,3.7298,25
-120.3707,-9.8545,-28.6267,39.8218,-9.8545,10.3981,34.6331,16.9549,26
-571.6017,-6.7005,-291.5785,168.5693,-6.7005,18.9699,112.9195,87.603,27
-277.2474,-6.9028,-130.8231,81.5185,-6.9028,16.654,93.8383,87.6586,28
-2.4926,-9.405,46.8469,34.5341,-9.405,9.8347,54.5734,23.007,29
-4.6877,-9.8908,7.0568,12.321,-9.8908,8.5337,20.4608,9.6148,30
-3.1753,-9.9495,-0.439,1.0878,-9.9495,3.2332,11.6388,9.2895,31
-12.0591,-9.8422,-1.2797,3.6961,-9.8422,6.571,30.15,6.1443,32
-7.0943,-9.8449,-2.0478,1.9737,-9.8449,2.7072,9.7621,4.5329,33
-0.9524,-9.8227,1.7672,1.6293,-9.8227,1.6258,5.3717,3.9358,34
-3.3831,-9.8855,-0.4836,1.7979,-9.8855,1.7624,8.4525,6.5934,35
-3.4861,-9.841,-2.2726,1.045,-9.841,1.2898,8.5147,7.0717,36
-9.8484,-9.9003,-0.5216,5.1914,-9.9003,5.4688,9.6514,6.007,37
-1.5423,-9.9397,0.3582,1.3058,-9.9397,2.2091,5.5312,3.0051,38
-5.2197,-9.9416,-0.5838,1.8581,-9.9416,3.5514,12.7205,3.52,39
-5.4979,-9.9406,-1.0374,2.2357,-9.9406,2.5336,6.6414,4.5333,40
-16.178,-9.8677,-7.8428,6.4747,-9.8677,0.3112,14.9474,14.4172,41
-6.6598,-9.7635,-2.4763,3.1123,-9.7635,1.7294,4.4528,3.1352,42
-0.3109,-9.7654,2.9089,2.0141,-9.7654,1.1451,11.4081,3.703,43
-13.7749,-9.7433,0.3609,5.1623,-9.7433,4.6037,33.7254,22.8275,44
-21.7411,-9.7035,-2.7337,9.5219,-9.7035,5.1078,51.104,42.0972,45
-0.1202,-9.9411,7.5557,5.9038,-9.9411,7.8738,59.4532,17.2935,46
-15.5048,-9.8616,-4.9904,5.4648,-9.8616,2.1489,7.8949,5.7032,47
-2.0068,-9.8586,0.2872,1.2771,-9.8586,0.9317,2.7719,2.6444,48
-4.6826,-9.8576,1.5936,2.6068,-9.8576,1.8129,4.9425,3.4375,49
-1.4976,-9.8811,0.2058,0.9007,-9.8811,0.8356,3.1434,2.7858,50
-18.9111,-9.8065,-11.9416,4.9395,-9.8065,1.2385,8.9839,7.8659,51
-13.478,-9.7896,4.6632,10.3268,-9.7896,5.9355,8.5653,7.2637,52
-54.5913,-9.4877,2.2505,39.4182,-9.4877,14.4751,24.1882,16.3109,53
-8.5584,-9.9564,0.5845,7.5036,-9.9564,5.1328,21.0429,10.8462,54
-1.166,-9.8915,0.6313,1.4159,-9.8915,1.5499,19.5447,7.3875,55
-3.0889,-9.8041,10.0001,10.1768,-9.8041,2.8466,17.4156,13.6552,56
-5.0899,-10.0189,1.4042,3.5013,-10.0189,4.6813,21.1748,10.5798,57
-15.613,-9.9909,3.4735,8.5558,-9.9909,10.2683,30.6266,18.7099,58
-0.8698,-10.081,1.2918,1.9336,-10.081,0.814,14.627,9.1769,59
-1.5989,-9.9699,-0.2439,0.7156,-9.9699,1.0489,14.1314,7.7355,60
-7.0831,-10.0516,10.4306,10.4496,-10.0516,1.639,39.4025,30.1866,62
-12.9374,-10.2471,1.7472,4.9696,-10.2471,2.3575,95.7531,91.4775,63
-3.4488,-9.9823,20.3503,26.6534,-9.9823,8.9066,97.1565,51.8893,64
-28.3394,-9.5284,1.1948,8.8521,-9.5284,7.5419,48.3524,31.396,65
-3.9054,-9.9917,1.3727,4.052,-9.9917,3.8573,19.263,11.2937,67
-0.7592,-9.3561,0.2663,0.7479,-9.3561,0.8394,8.5668,7.5968,68
-4.3845,-9.8984,-1.0084,1.8521,-9.8984,1.1556,14.9642,7.8582,69
-3.3932,-9.7517,4.9797,4.8944,-9.7517,1.2894,27.1257,10.5362,70
-3.9678,-9.8144,-0.3639,2.5394,-9.8144,3.7408,21.6746,11.2866,72
-7.1564,-9.8941,-0.369,1.9721,-9.8941,1.8668,17.518,8.8271,73
-2.6843,-10.1557,3.2587,5.2258,-10.1557,6.8682,30.3587,20.2314,74
-9.7864,-9.9723,-1.2502,4.4015,-9.9723,1.1862,34.995,24.3815,75
-18.2428,-9.9693,-6.1185,7.8162,-9.9693,0.8959,15.0502,13.9921,76
-2.2352,-9.8765,0.4061,1.5854,-9.8765,1.3526,3.7147,3.213,77
-1.8735,-9.8532,0.2724,1.1034,-9.8532,0.8524,2.6302,2.4633,78
-7.1746,-9.814,-5.6059,1.2475,-9.814,0.4615,5.1,4.4769,79
-1.6472,-9.7624,-0.3043,0.8285,-9.7624,0.4586,2.8237,2.6836,80
5.6056,-9.8106,11.5653,5.4753,-9.8106,1.6975,11.0243,8.0719,81
-3.1534,-9.8709,0.3697,2.3487,-9.8709,1.9283,4.2312,3.4627,82
-0.8613,-9.8841,0.1396,0.5606,-9.8841,0.5341,2.7565,2.6358,83
-0.2033,-9.8877,0.5928,0.2719,-9.8877,0.2735,2.7537,2.6381,84
-1.2333,-9.8724,0.3472,0.9294,-9.8724,0.8069,2.9285,2.7194,85
0.022,-9.8759,0.2102,0.1447,-9.8759,0.1402,2.6478,2.5867,86
0.3111,-9.8923,1.3576,0.5641,-9.8923,0.6281,3.5232,2.8686,87
-0.1788,-9.9236,1.895,1.4344,-9.9236,2.3785,6.2174,4.5036,88
-5.8213,-9.8928,2.1223,9.4305,-9.8928,8.8395,16.5049,7.5252,89
-24.3867,-10.4117,-7.3543,11.4556,-10.4117,14.3772,50.2705,19.2058,90
-33.4112,-9.7198,-9.3439,12.9991,-9.7198,8.349,25.3697,18.5376,91
-16.7344,-9.9015,-0.1278,8.6399,-9.9015,3.3786,15.8263,14.9543,92
1.5628,-9.8968,2.3431,1.0121,-9.8968,0.7699,8.5964,7.0555,93
-10.4691,-9.8729,-2.4128,5.1628,-9.8729,4.6159,12.4683,9.2157,94
-31.6311,-9.893,-1.2986,16.4039,-9.893,8.5984,29.2244,22.8522,95
-1.4939,-9.9215,0.7276,4.6424,-9.9215,3.5342,12.6642,8.7804,96
-49.3726,-9.7333,-32.223,13.431,-9.7333,0.7576,23.7695,22.9872,97
-2.394,-9.499,0.6741,0.7065,-9.499,0.2305,3.154,2.5813,98
0.7544,-9.5003,0.8453,0.05,-9.5003,0.018,2.5994,2.5822,99
0.7696,-9.4998,0.8487,0.0322,-9.4998,0.0119,2.5905,2.5781,100
0.7831,-9.4981,0.8307,0.0411,-9.4981,0.0152,2.5975,2.5763,101
0.7812,-9.5001,0.8497,0.0349,-9.5001,0.0124,2.596,2.5755,102
0.7669,-9.4991,0.8296,0.0281,-9.4991,0.0101,2.5914,2.574,103
0.8061,-9.5013,0.8373,0.0257,-9.5013,0.0094,2.5876,2.5596,104
0.7731,-9.4998,0.8188,0.0297,-9.4998,0.0103,2.5887,2.5633,105
0.7667,-9.4994,0.815,0.0311,-9.4994,0.011,2.5875,2.5652,106
0.7876,-9.4997,0.8258,0.0189,-9.4997,0.0067,2.5864,2.5661,107
0.7751,-9.5001,0.8339,0.031,-9.5001,0.0109,2.5876,2.573,108
0.7754,-9.5002,0.814,0.0335,-9.5002,0.0119,2.5693,2.5542,109
0.7954,-9.4993,0.845,0.0305,-9.4993,0.0106,2.5698,2.5574,110
0.7876,-9.5001,0.8387,0.0268,-9.5001,0.0095,2.592,2.5673,111
0.7874,-9.4994,0.832,0.0239,-9.4994,0.0084,2.5809,2.5666,112
0.7741,-9.4996,0.8147,0.023,-9.4996,0.0082,2.5749,2.5533,113
0.779,-9.5002,0.8303,0.0425,-9.5002,0.0149,2.5657,2.5603,114
0.7959,-9.4996,0.839,0.0233,-9.4996,0.0081,2.5771,2.5663,115
0.7577,-9.499,0.8305,0.0325,-9.499,0.0114,2.5744,2.5578,116
0.7754,-9.4993,0.8306,0.0277,-9.4993,0.0097,2.5732,2.5661,117
0.7696,-9.4991,0.825,0.029,-9.4991,0.0101,2.5693,2.5555,118
0.752,-9.5,0.8031,0.0289,-9.5,0.01,2.5776,2.5533,119
0.7453,-9.5,0.8145,0.0341,-9.5,0.0119,2.5643,2.5484,120
0.7969,-9.4987,0.8397,0.0313,-9.4987,0.0111,2.5744,2.5691,121
0.7839,-9.5008,0.8423,0.0326,-9.5008,0.0115,2.5684,2.5449,122
0.7751,-9.5003,0.8359,0.0313,-9.5003,0.0111,2.5799,2.5635,124
0.8016,-9.5003,0.8441,0.023,-9.5003,0.0081,2.5754,2.553,125
0.8058,-9.4983,0.8424,0.0321,-9.4983,0.0113,2.5721,2.5629,126
0.7847,-9.5,0.8379,0.0345,-9.5,0.0123,2.5688,2.5579,127
0.7963,-9.4987,0.8317,0.025,-9.4987,0.0087,2.5776,2.5597,128
0.7973,-9.5,0.8319,0.0201,-9.5,0.0071,2.5776,2.5596,129
0.7951,-9.5006,0.8537,0.0412,-9.5006,0.0144,2.5754,2.5615,130
0.7526,-9.5023,0.8344,0.0381,-9.5023,0.0134,2.5711,2.5509,132
0.8081,-9.502,0.8625,0.0268,-9.502,0.0094,2.5596,2.5509,133
0.7795,-9.5023,0.8352,0.0368,-9.5023,0.0131,2.5655,2.5592,134
0.7876,-9.5016,0.8377,0.0265,-9.5016,0.0092,2.5837,2.5595,135
0.7946,-9.5022,0.8497,0.028,-9.5022,0.0098,2.5776,2.5562,137
0.7906,-9.5016,0.8369,0.0341,-9.5016,0.0119,2.5854,2.5548,138
0.7833,-9.5012,0.839,0.0414,-9.5012,0.0147,2.5662,2.5546,139
0.8395,-9.5007,0.8637,0.0192,-9.5007,0.0069,2.5605,2.5463,140
0.7959,-9.5021,0.8454,0.0499,-9.5021,0.0176,2.5666,2.5586,141
0.8002,-9.5019,0.8422,0.032,-9.5019,0.0112,2.5688,2.5596,142
0.7657,-9.5023,0.8535,0.0368,-9.5023,0.0129,2.5827,2.5541,144
0.7826,-9.5021,0.8637,0.0467,-9.5021,0.0163,2.5854,2.5622,145
0.7999,-9.5015,0.8466,0.0411,-9.5015,0.0143,2.5629,2.551,146
0.7739,-9.5017,0.8284,0.0336,-9.5017,0.0118,2.5605,2.5553,147
-18.1527,-9.6913,21.8751,39.1903,-9.6913,5.2211,33.7902,28.1673,148
-38.896,-9.8952,-24.0373,11.6119,-9.8952,4.3499,42.0451,36.1312,149
-96.4219,-9.4877,38.457,74.6436,-9.4877,8.2362,54.5841,44.4019,151
-31.9723,-9.7821,8.5209,28.4217,-9.7821,13.3054,30.0366,22.3173,152
-14.1747,-9.8942,-1.4558,5.1588,-9.8942,4.1503,12.1077,4.0194,153
-4.2695,-9.8936,-0.6992,1.9583,-9.8936,1.4408,3.5952,2.8965,154
-1.5213,-9.8914,-0.4529,0.8227,-9.8914,0.624,2.6904,2.6127,155
-1.1285,-9.8945,-0.3648,0.533,-9.8945,0.4103,2.6165,2.5666,156
-0.7967,-9.8911,-0.4156,0.3243,-9.8911,0.2474,2.5829,2.5676,157
-0.6687,-9.8937,-0.3857,0.1772,-9.8937,0.1366,2.5912,2.5545,158
-0.5851,-9.8932,-0.3797,0.1159,-9.8932,0.0889,2.579,2.5523,159
-0.5255,-9.8929,-0.402,0.0803,-9.8929,0.0618,2.5716,2.5526,160
-0.4646,-9.892,-0.3917,0.0556,-9.892,0.0424,2.5699,2.5605,161
-0.4334,-9.8933,-0.3831,0.0461,-9.8933,0.0353,2.5592,2.54,162
-0.4155,-9.8932,-0.3883,0.0191,-9.8932,0.0145,2.5703,2.5578,163
-0.3968,-9.8928,-0.3749,0.0162,-9.8928,0.0128,2.5555,2.5398,164
-0.4187,-9.8929,-0.388,0.0212,-9.8929,0.0165,2.5703,2.5482,165
-0.4706,-9.894,-0.3949,0.0449,-9.894,0.0345,2.5685,2.543,166
-0.4232,-9.8926,-0.3823,0.0256,-9.8926,0.0198,2.562,2.55,167
-0.4336,-9.8928,-0.3808,0.017,-9.8928,0.013,2.5613,2.5465,168
-0.4385,-9.893,-0.3892,0.0279,-9.893,0.0219,2.5559,2.5431,169
-0.422,-9.8942,-0.3904,0.0164,-9.8942,0.0129,2.5617,2.5474,170
-0.4074,-9.893,-0.3899,0.0142,-9.893,0.0113,2.5656,2.5502,171
-0.4076,-9.8954,-0.3807,0.0184,-9.8954,0.0144,2.551,2.535,173
-0.4139,-9.8931,-0.3931,0.0142,-9.8931,0.0111,2.5656,2.5486,174
-0.4031,-9.8927,-0.386,0.011,-9.8927,0.0086,2.5629,2.5472,175
-0.4112,-9.8934,-0.3904,0.0162,-9.8934,0.0128,2.549,2.5415,176
-0.4011,-9.8926,-0.3847,0.0093,-9.8926,0.0074,2.5684,2.5447,177
-0.4171,-9.8925,-0.3976,0.0152,-9.8925,0.0117,2.5506,2.5417,178
-0.4234,-9.8937,-0.3973,0.0114,-9.8937,0.0089,2.5561,2.5419,179
-0.3968,-9.8931,-0.3844,0.0104,-9.8931,0.008,2.5569,2.532,180
-0.4173,-9.8939,-0.3958,0.0097,-9.8939,0.0077,2.5652,2.5404,181
-0.4163,-9.8948,-0.4034,0.0101,-9.8948,0.008,2.5534,2.5413,182
-0.4131,-9.894,-0.3986,0.012,-9.894,0.0095,2.5514,2.5458,183
-0.4245,-9.8934,-0.3955,0.0122,-9.8934,0.0096,2.5605,2.5399,184
-0.4228,-9.8942,-0.3989,0.0137,-9.8942,0.0108,2.5624,2.5445,185
-0.4114,-9.8935,-0.3935,0.0125,-9.8935,0.0099,2.5596,2.5514,186
-0.4114,-9.8934,-0.3932,0.0107,-9.8934,0.0084,2.5565,2.5397,187
-0.4165,-9.8939,-0.392,0.0119,-9.8939,0.0094,2.5629,2.5427,188
-0.4102,-9.8921,-0.3884,0.0135,-9.8921,0.0109,2.5407,2.5295,189
-0.4224,-9.8936,-0.3916,0.0157,-9.8936,0.0123,2.5596,2.5453,190
-0.4015,-9.8937,-0.3884,0.0079,-9.8937,0.0063,2.5601,2.5433,191
-0.411,-9.8942,-0.392,0.0115,-9.8942,0.0092,2.5624,2.5417,192
-0.4173,-9.8924,-0.3919,0.0107,-9.8924,0.0084,2.5542,2.5362,193
-0.4106,-9.8939,-0.3836,0.0175,-9.8939,0.0138,2.5561,2.5461,194
-0.4049,-9.8926,-0.3919,0.0104,-9.8926,0.0081,2.5569,2.5435,195
-0.4112,-9.8933,-0.3975,0.0093,-9.8933,0.0072,2.5648,2.5461,196
-0.4197,-9.8936,-0.4012,0.0106,-9.8936,0.0085,2.5707,2.547,197
-0.4215,-9.8932,-0.3919,0.0135,-9.8932,0.0107,2.5605,2.5391,198
-0.4165,-9.8933,-0.3955,0.0124,-9.8933,0.0098,2.551,2.5334,199
-0.4275,-9.8929,-0.3968,0.0144,-9.8929,0.0114,2.5652,2.5419,200
-0.4231,-9.8933,-0.3979,0.0139,-9.8933,0.011,2.5703,2.5458,202
-0.4274,-9.8937,-0.4006,0.0127,-9.8937,0.0102,2.5542,2.5411,203
-0.4454,-9.893,-0.4042,0.0196,-9.893,0.0154,2.5514,2.5484,204
-0.426,-9.8925,-0.3973,0.0169,-9.8925,0.0132,2.5506,2.5376,205
-0.4173,-9.894,-0.3999,0.0106,-9.894,0.0083,2.562,2.5431,207
-0.4226,-9.8936,-0.3965,0.0151,-9.8936,0.0118,2.5617,2.5417,208
-0.4177,-9.894,-0.4033,0.0127,-9.894,0.0098,2.562,2.5445,209
-0.4169,-9.894,-0.4022,0.0089,-9.894,0.0071,2.57,2.5466,210
-0.4365,-9.8933,-0.4032,0.0153,-9.8933,0.012,2.5592,2.5412,212
-0.4308,-9.8932,-0.3991,0.0163,-9.8932,0.0127,2.5652,2.5397,213
-0.4201,-9.8937,-0.4061,0.0115,-9.8937,0.0094,2.5514,2.5393,214
-0.427,-9.8942,-0.4054,0.0115,-9.8942,0.0092,2.5538,2.5344,215
-199.6985,-9.8445,-6.9107,61.4126,-9.8445,23.2667,80.8264,11.3295,217
-444.272,-8.5954,-229.9879,100.6462,-8.5954,6.3826,107.6735,86.8167,218
-121.9775,-8.8119,39.4798,79.4469,-8.8119,16.9115,134.7754,95.8454,219
-6.6452,-9.9266,4.1643,4.4691,-9.9266,3.4859,12.7413,7.6096,220
-15.4653,-9.7836,-0.3411,5.3613,-9.7836,5.8798,25.8368,6.7587,222
-11.5293,-9.8846,-3.3109,5.8678,-9.8846,5.1921,9.1106,7.5644,223
-2.9967,-9.6792,-0.3483,1.9137,-9.6792,4.0044,19.248,12.1925,224
-5.3924,-9.9412,-0.3459,2.7712,-9.9412,4.2697,12.4787,3.0395,225
-1.5963,-9.935,0.063,1.0862,-9.935,2.2972,4.5311,3.1194,227
-1.5208,-9.9456,-0.08,0.8844,-9.9456,2.8289,5.1724,3.6295,228
-12.6293,-9.8008,-3.1551,4.6314,-9.8008,5.2048,24.1747,19.7221,229
-27.1556,-9.7817,-15.7299,6.5406,-9.7817,2.2645,14.2918,12.0458,230
-15.4524,-9.6286,1.079,7.7203,-9.6286,3.0293,6.2494,3.844,232
-16.1999,-9.8101,4.094,9.0934,-9.8101,8.5594,54.5137,36.373,233
-12.639,-10.0184,9.0249,15.7503,-10.0184,6.5626,59.2469,44.8122,234
-0.0006,-10.1149,5.3157,3.5201,-10.1149,2.1976,35.117,21.367,236
-7.1972,-9.8265,3.4314,9.3513,-9.8265,6.2951,27.9013,13.1227,237
-6.5097,-9.9455,-1.9025,2.0932,-9.9455,3.5402,14.3231,6.0432,238
-12.6573,-9.9395,-6.3517,3.4446,-9.9395,0.7906,14.182,10.801,239
-33.0944,-9.9419,-10.0504,15.8964,-9.9419,10.4103,34.4371,24.2341,240
-4.6945,-9.308,21.9335,19.8605,-9.308,7.3634,54.8952,43.5883,241
-11.0625,-9.9267,-2.1251,2.8307,-9.9267,3.8151,17.8722,8.9942,242
-4.5644,-10.1067,-0.9245,2.5049,-10.1067,3.2086,13.979,6.903,243
-5.8591,-9.7603,-0.7104,2.2702,-9.7603,1.9533,19.8584,6.1831,244
-3.9582,-9.8633,0.5671,1.9492,-9.8633,1.886,12.1564,6.7598,245
-9.5982,-10.3695,-4.4016,3.8369,-10.3695,2.3349,15.8789,9.4109,246
-6.2521,-9.8073,-2.3369,2.455,-9.8073,3.5844,16.3687,6.7518,248
0.6446,-9.9794,1.5297,0.8575,-9.9794,0.9638,6.35,5.5691,249
-4.1567,-10.0991,-0.5778,1.2278,-10.0991,3.5691,11.3729,7.3291,250
-2.7256,-10.1823,-0.4257,1.4976,-10.1823,2.9162,10.4193,8.804,251
-2.3741,-9.8104,-0.569,0.9945,-9.8104,3.332,10.9441,7.3507,252
-4.8594,-9.9171,-0.7738,1.8266,-9.9171,3.1627,10.9181,7.0691,253
-6.0512,-10.0229,-0.2446,2.467,-10.0229,3.2609,16.8814,9.849,254
-3.8733,-9.849,0.2489,2.475,-9.849,5.2891,16.5973,10.0882,255
-3.0449,-9.932,-0.7174,1.1118,-9.932,2.388,11.089,4.9164,256
-1.4018,-9.8742,0.547,1.0793,-9.8742,2.4717,15.6736,9.7153,257
-0.6975,-9.9348,0.7985,1.1552,-9.9348,0.6107,9.5541,6.7325,259
-2.7015,-9.9393,0.4365,1.7499,-9.9393,1.1311,9.1332,6.7733,260
-0.9949,-9.8755,-0.1125,0.5689,-9.8755,0.7412,6.3186,4.9021,261
-1.1595,-9.9925,0.1064,0.51,-9.9925,1.6809,7.8146,4.3652,262
-4.1023,-8.7435,0.3661,2.6784,-8.7435,3.6178,39.5134,8.0173,263
-1.6556,-9.5577,0.5758,2.1006,-9.5577,3.0328,10.4463,6.5566,264
-1.7279,-9.9064,-0.2613,0.5828,-9.9064,1.9963,7.9393,4.8759,265
-1.7114,-9.828,1.1134,2.3426,-9.828,1.2306,11.1363,8.5436,266
-1.6649,-10.0143,0.0629,0.7292,-10.0143,1.6749,10.784,5.3855,267
-2.9498,-9.9984,0.8791,2.0376,-9.9984,4.1385,14.0223,7.984,268
-0.6132,-10.0057,0.501,0.8345,-10.0057,1.8887,8.971,5.8126,269
-1.5828,-9.9028,0.2525,0.9363,-9.9028,1.3333,13.0403,10.2506,270
-1.7665,-10.0009,-0.4361,0.9673,-10.0009,2.011,14.432,13.5735,271
-2.0745,-9.9913,0.2311,1.1131,-9.9913,2.7477,10.9927,5.9646,272
-1.1996,-9.969,0.3433,0.5894,-9.969,2.0527,6.3998,4.0686,273
-0.0879,-10.238,0.2073,0.4053,-10.238,1.7459,4.341,3.7874,274
-0.9976,-9.9653,0.2026,0.6501,-9.9653,2.5257,9.5684,7.7398,275
-0.6423,-10.0074,0.2462,0.6324,-10.0074,2.6629,7.8981,6.1307,276
-1.1846,-10.0345,0.2306,1.2253,-10.0345,1.1802,9.1399,6.0754,277
-4.7551,-10.1211,1.4205,4.3677,-10.1211,5.1615,35.1208,18.5824,278
9.2099,-10.2926,14.8956,5.2633,-10.2926,2.837,22.5875,20.7953,279
-5.1704,-9.4233,3.3874,6.7793,-9.4233,3.6923,26.2022,12.9411,280
-3.4423,-10.0454,0.2185,1.5589,-10.0454,2.5284,19.9471,12.7894,282
-1.1596,-10.0866,1.0778,2.5105,-10.0866,1.9397,27.5611,21.3789,283
-2.6529,-9.5164,-0.5273,1.429,-9.5164,1.5096,27.8858,25.2369,284
-3.0905,-10.5093,-0.4081,1.9154,-10.5093,3.3088,32.7961,20.4943,285
-12.2891,-9.8799,2.3215,6.5667,-9.8799,11.6701,27.1157,15.2639,287
-4.4899,-8.9969,29.0678,35.7784,-8.9969,13.1512,39.3551,34.0813,288
0.3321,-9.2878,25.1871,38.3875,-9.2878,16.9931,63.2428,42.5758,289
-7.92,-10.1558,-1.4962,4.2292,-10.1558,8.3104,18.7693,12.8176,290
-12.2162,-10.0061,-1.0462,4.8962,-10.0061,4.8166,20.7363,8.7631,292
-3.9242,-9.7507,-0.9115,1.5464,-9.7507,3.6652,12.9274,6.344,293
-1.5842,-9.7287,-0.0484,0.9988,-9.7287,1.5218,11.4833,9.3898,294
-1.9074,-9.7533,-0.3745,0.6503,-9.7533,2.339,11.2773,6.3397,295
-11.4499,-10.1324,-0.6059,3.5084,-10.1324,5.1167,15.8129,9.5587,297
-7.6605,-9.7667,4.3955,7.3434,-9.7667,7.3671,20.8426,14.0376,298
-13.0303,-8.4656,-3.6786,6.0001,-8.4656,2.6011,19.6517,16.7044,299
-17.8948,-10.2015,1.6907,9.8989,-10.2015,10.646,27.6755,21.8289,300
-4.905,-9.7539,-0.2157,2.6109,-9.7539,3.8189,15.2866,9.3135,302
-8.7378,-9.9818,1.811,4.9663,-9.9818,6.0567,23.0034,12.0094,303
-11.7417,-9.861,2.0339,5.4726,-9.861,6.4814,29.0149,12.1596,305
-5.9564,-9.8272,0.1488,2.222,-9.8272,3.1314,14.8603,6.7554,307
-3.7598,-10.0003,0.1967,2.8844,-10.0003,6.1536,16.6682,11.7264,308
-3.824,-9.5337,-0.4592,2.709,-9.5337,2.0424,14.8426,12.2939,309
-8.476,-9.9652,-0.3604,2.5275,-9.9652,5.7188,15.0945,8.487,312
-7.9744,-8.8999,2.8504,7.2185,-8.8999,3.0922,19.1596,11.6237,315
-7.8948,-9.7849,0.677,6.5835,-9.7849,7.6371,23.9149,9.0538,317
-3.7634,-9.817,-0.607,1.3587,-9.817,2.6218,13.9172,4.6609,318
-3.7623,-9.8773,-1.0164,1.551,-9.8773,1.6905,10.8727,5.3347,319
-7.9947,-10.2667,-2.5048,4.7911,-10.2667,3.6361,18.3523,14.4218,321
-4.2151,-9.9736,-0.5801,1.3237,-9.9736,2.2021,13.7971,5.854,322
-2.7012,-10.1141,0.4034,1.2885,-10.1141,4.0184,13.2366,7.4772,323
-4.5352,-9.9885,-1.2959,2.4821,-9.9885,2.5584,15.4823,11.7989,324
-1.9653,-9.8361,-0.3937,0.7974,-9.8361,2.4502,12.3396,7.704,325
-2.0813,-10.1295,-0.689,0.6092,-10.1295,1.5491,7.3819,5.6641,326
-5.0992,-9.6873,-1.7828,2.4843,-9.6873,0.9916,13.9644,8.6907,327
-2.9701,-9.9645,-0.5464,1.1006,-9.9645,3.8896,9.4434,5.9133,328
-2.9941,-9.8262,-0.155,1.8775,-9.8262,5.0729,15.3279,9.5159,329
-1.5152,-10.3671,-0.4117,0.772,-10.3671,1.7282,8.1697,6.3998,330
-3.8544,-10.0171,-1.0329,1.6631,-10.0171,3.8286,10.6928,5.6809,332
-2.1587,-10.0347,0.5151,1.7638,-10.0347,4.4971,13.1396,7.6631,333
-3.1004,-9.8789,-0.3808,1.2036,-9.8789,3.5219,11.9222,5.6069,334
-2.1377,-9.9796,0.1716,1.3427,-9.9796,2.3365,7.078,4.888,335
-3.8226,-10.0127,-1.4435,1.2692,-10.0127,1.7357,11.5782,8.1141,336
-3.335,-9.9268,1.1103,2.7854,-9.9268,3.9803,16.3704,8.2459,337
-4.7576,-10.0164,0.0196,2.823,-10.0164,4.6075,15.4384,8.3075,338
-1.3293,-10.0947,-0.3517,0.7996,-10.0947,0.8618,7.2919,5.2764,339
-4.4542,-9.9797,-0.5385,1.2225,-9.9797,3.4727,9.8352,4.8525,340
-3.4493,-9.9057,-0.5935,1.7227,-9.9057,1.4351,13.0371,11.3299,341
-1.8736,-10.0492,-0.0493,0.5468,-10.0492,1.9921,7.9395,4.2895,343
-6.9849,-9.7617,-0.7091,1.9663,-9.7617,2.6037,13.4798,9.0572,344
-1.1042,-9.9429,0.5141,0.7907,-9.9429,1.5438,8.3174,4.5714,345
-1.0686,-9.9465,0.5727,1.0557,-9.9465,1.2306,11.9723,9.8881,346
-0.9385,-9.9118,1.175,1.8432,-9.9118,3.6447,18.6999,9.4653,347
-2.7704,-10.0905,0.2914,1.3456,-10.0905,2.3108,8.9552,6.5807,348
-0.4919,-9.956,-0.007,0.3482,-9.956,0.3921,8.8075,7.8272,349
-0.4689,-9.8211,0.3193,0.5818,-9.8211,2.1222,6.3617,3.7896,350
-0.0694,-9.9658,0.0048,0.0392,-9.9658,0.2829,11.9599,11.1585,351
-0.1097,-10.0019,0.4589,0.7141,-10.0019,1.4688,9.071,3.9238,352
-0.8592,-9.9942,0.0395,0.3195,-9.9942,0.6091,5.3408,3.8413,353
-1.1931,-9.9309,0.0036,0.7156,-9.9309,1.1601,19.0528,12.9837,354
-0.7643,-10.0008,0.2726,0.5787,-10.0008,1.5236,18.3236,12.8155,355
-0.3006,-9.941,0.2412,0.461,-9.941,1.0147,16.78,13.3894,356
-6.2158,-9.9938,1.2909,2.6819,-9.9938,5.2593,27.1579,16.6886,357
-29.9795,-9.2249,-0.4997,10.3718,-9.2249,6.1248,27.1538,12.538,358
-9.4134,-9.8394,2.8419,7.2969,-9.8394,3.2442,40.1952,29.6508,359
-15.456,-9.9166,-2.2832,4.3728,-9.9166,4.9325,19.3882,13.5474,360
-9.6931,-10.0544,-2.5752,5.1611,-10.0544,4.2208,17.5945,15.0408,361
-5.8574,-9.8989,0.5078,2.6136,-9.8989,3.0132,11.7513,6.4062,362
-2.1726,-9.9248,-0.1247,1.0495,-9.9248,2.445,6.7876,4.6086,363
-2.8698,-9.8503,-0.3663,0.9611,-9.8503,1.6747,7.0774,5.2335,364
-0.4694,-9.9967,0.4492,0.8424,-9.9967,2.1937,7.9048,5.324,365
-1.3387,-10.0091,1.0985,1.6401,-10.0091,0.5038,9.4617,8.2699,366
-1.3781,-9.9682,1.1334,2.1106,-9.9682,3.6538,17.1851,5.481,367
-9.7477,-9.95,1.3222,6.2193,-9.95,5.1752,15.6026,11.9991,368
0.2492,-10.569,11.3642,7.6505,-10.569,9.7183,46.7068,36.6097,369
-12.4414,-9.9149,3.3254,12.1149,-9.9149,4.603,22.9342,14.9706,370
-6.8373,-10.0201,0.9546,4.4501,-10.0201,6.7455,16.6662,6.9648,372
-2.3413,-10.0532,0.6623,1.4281,-10.0532,3.9738,11.1481,6.5229,373
-2.0969,-10.0092,0.0781,1.1321,-10.0092,2.6165,9.6957,6.8934,374
-0.6613,-9.9422,3.6463,4.231,-9.9422,4.2382,24.758,8.8961,375
-1.6719,-9.9671,0.6834,1.373,-9.9671,2.8804,13.467,5.2652,377
-30.6059,-9.9039,-1.1974,11.1354,-9.9039,12.3606,28.4335,15.764,378
-6.1529,-10.1821,6.569,7.701,-10.1821,2.1305,19.5937,16.5244,379
-4.6862,-9.9237,-0.2918,2.5275,-9.9237,2.5418,10.8084,6.1575,380
-7.8537,-9.9852,0.2817,3.1712,-9.9852,5.7852,13.2789,6.328,382
-3.1456,-9.7273,1.0587,3.2517,-9.7273,3.6796,12.6446,9.8919,383
-4.8941,-10.0794,-0.861,1.9952,-10.0794,1.2541,12.8539,4.3481,384
-4.1753,-9.9788,1.1783,2.7598,-9.9788,2.9536,10.5921,9.1965,385
-4.6934,-9.9799,0.2481,1.6743,-9.9799,3.3534,9.9186,5.3165,387
-1.2543,-10.0174,0.8306,1.7043,-10.0174,3.3805,13.464,6.3907,388
-1.4964,-9.9743,0.4383,1.2609,-9.9743,1.1722,7.0492,5.0957,389
-1.0647,-9.9949,0.3694,0.7113,-9.9949,1.3085,10.189,5.8323,390
-4.5211,-10.11,1.3192,3.7405,-10.11,4.8192,45.8307,17.1107,392
-20.7893,-10.266,9.5476,18.9467,-10.266,11.4806,68.1242,58.0243,393
-6.1987,-9.7127,5.874,6.9386,-9.7127,2.9733,28.1845,21.7973,394
-9.1437,-9.9622,11.6031,13.4818,-9.9622,9.4191,55.061,35.0208,395
-1.8461,-10.1031,0.7526,1.7253,-10.1031,4.082,13.723,8.6142,397
-4.852,-9.8375,3.0615,5.5368,-9.8375,7.4563,25.5815,11.0896,398
-33.3661,-9.9574,-12.1835,11.4689,-9.9574,4.1423,24.5781,19.9631,399
-15.8802,-10.0166,-1.6968,5.2102,-10.0166,7.5412,16.8798,8.9027,400
-5.765,-9.9511,-0.1128,2.1847,-9.9511,3.6395,12.9711,5.9552,402
-2.6322,-9.9999,-0.5075,1.8561,-9.9999,4.5215,9.4336,7.1774,403
-5.8389,-9.7886,-0.8796,2.046,-9.7886,2.823,8.0709,3.9459,404
-2.9886,-9.6836,0.0647,1.7372,-9.6836,1.8598,9.1076,6.7395,406
-5.3893,-9.9471,-0.6717,1.6322,-9.9471,3.318,10.4409,5.421,407
-5.2555,-9.9796,-0.4408,1.9351,-9.9796,4.5883,11.49,5.2758,409
-0.4929,-9.8964,0.5627,0.8056,-9.8964,4.3606,7.879,5.2778,410
-6.2586,-10.0659,-1.7119,2.3437,-10.0659,2.468,11.0373,6.2607,411
-7.9692,-9.907,-0.426,2.8958,-9.907,7.4546,19.3158,10.2457,412
-4.7629,-9.9927,0.6237,2.2438,-9.9927,5.0891,16.5949,8.1061,413
-4.0277,-9.8332,-1.8396,1.52,-9.8332,1.184,6.7784,5.891,414
-3.5115,-9.8531,1.5934,4.3995,-9.8531,1.5012,8.1693,6.9506,415
-1.1952,-10.0186,-0.0176,1.378,-10.0186,2.5558,9.4808,4.8887,416
-5.8213,-9.8021,-1.5126,2.1464,-9.8021,4.6097,13.9917,8.9669,417
-5.3454,-9.9684,-0.6455,1.7038,-9.9684,2.9327,9.3764,5.2679,418
-1.727,-10.1285,0.1071,1.3818,-10.1285,2.4517,6.2284,4.4076,419
-10.7366,-9.9361,-1.8295,4.0771,-9.9361,4.4917,15.6288,10.8702,420
-14.5883,-10.1511,-4.2187,5.2631,-10.1511,7.97,26.5586,20.9135,421
-4.8683,-10.0934,-1.5406,2.283,-10.0934,7.8686,19.5495,14.0937,422
-6.7555,-9.9616,-0.464,3.6939,-9.9616,5.195,15.2828,7.4098,423
-2.3396,-9.9929,-0.4285,1.0561,-9.9929,2.8822,12.9324,5.4696,424
-4.9964,-10.0029,-0.9736,1.5898,-10.0029,3.5757,14.7184,6.6842,425
-3.8434,-9.8872,-1.1963,1.2175,-9.8872,2.3426,11.4531,6.0726,426
-7.9634,-9.9384,-0.9573,3.1562,-9.9384,5.351,17.7158,11.366,427
-9.9392,-10.0696,-0.6827,3.8545,-10.0696,2.312,23.1341,12.1826,428
-8.2881,-9.874,-1.9872,2.2724,-9.874,4.2609,19.1164,9.5336,429
-5.542,-9.3701,-0.9145,2.9259,-9.3701,4.867,16.615,12.0577,430
-3.9416,-10.0644,-0.9602,1.2294,-10.0644,3.5496,14.414,5.6731,432
-4.6979,-9.9856,-1.1661,1.5307,-9.9856,3.9671,9.3084,6.9641,433
-1.3053,-9.6958,-0.2437,0.9529,-9.6958,1.5117,11.4208,7.7091,434
-7.1769,-10.0713,-1.671,2.5068,-10.0713,4.8248,15.6765,9.5094,435
-5.6184,-9.9674,0.7776,4.3815,-9.9674,5.213,15.1251,8.907,437
-1.7589,-9.8787,1.2547,2.8907,-9.8787,1.7893,14.3541,8.6981,438
-1.5491,-9.7717,-0.2284,0.9684,-9.7717,2.6582,10.1543,5.0002,439
-3.0145,-10.0372,-0.1923,1.2182,-10.0372,3.0381,11.5717,4.4127,440
-5.6397,-9.8608,0.1773,2.7664,-9.8608,3.9609,15.8351,7.898,442
-11.9481,-9.9483,-3.6521,5.3189,-9.9483,5.371,15.5784,12.1,443
-25.9168,-10.4453,-4.3566,9.2276,-10.4453,4.0719,26.6719,11.8623,444
-4.7035,-9.9559,4.0679,10.6623,-9.9559,9.7815,17.2513,11.473,445
-9.1781,-10.0333,-0.9859,4.4562,-10.0333,6.6146,13.7497,9.1066,447
-15.5522,-9.9408,-4.406,5.6491,-9.9408,1.3956,14.588,9.9221,448
-3.7117,-10.2731,-0.4956,1.4227,-10.2731,3.764,11.3169,6.636,449
-13.7594,-9.7377,4.0356,10.2653,-9.7377,7.4146,24.173,12.5438,450
-19.9911,-9.9104,-4.2797,6.8785,-9.9104,11.0631,25.0519,11.4164,452
-2.5825,-8.427,0.7411,4.8831,-8.427,4.2786,17.9282,8.2126,453
-5.863,-9.4877,-0.2521,2.8423,-9.4877,3.3726,6.9385,4.4644,454
-6.2156,-9.9248,0.1386,4.566,-9.9248,6.5936,11.5919,8.1967,455
-6.6404,-9.7222,-0.3448,3.7029,-9.7222,4.7565,11.0798,6.8878,457
-4.9439,-10.0167,-1.5764,1.2599,-10.0167,5.0917,11.9529,7.8639,458
-3.7814,-10.1099,-1.5843,1.2869,-10.1099,3.3861,9.0181,6.9855,459
-3.975,-10.1223,0.6883,3.656,-10.1223,12.054,22.8892,12.8242,460
-14.5814,-9.9062,-0.2428,3.5712,-9.9062,5.2395,22.9834,7.6309,462
-5.2008,-9.9826,-0.8722,2.0289,-9.9826,1.6899,7.2724,5.6326,463
-1.8615,-9.6668,0.143,1.59,-9.6668,2.5965,14.0129,12.2445,464
-8.7268,-10.0158,1.6844,5.4322,-10.0158,0.854,16.0797,12.1651,465
-1.9117,-10.4239,7.2077,6.8752,-10.4239,11.703,57.1289,41.0568,467
-1.521,-10.1293,6.9875,9.6445,-10.1293,12.891,35.4687,26.8451,468
-0.4967,-10.017,3.3991,2.7752,-10.017,1.5242,13.5144,9.6575,469
-12.8884,-9.9391,-1.2355,4.7575,-9.9391,5.7493,16.5537,12.208,470
-60.1072,-9.7841,7.8736,30.9077,-9.7841,20.4708,56.9057,19.4734,472
-10.1799,-9.9972,-6.2427,4.0907,-9.9972,4.902,26.0368,24.5349,473
-10.4048,-8.5381,-4.5284,4.0213,-8.5381,6.2619,16.2625,10.8245,474
-6.8567,-9.691,-0.9336,2.1198,-9.691,2.7653,12.4908,7.1968,475
-12.1976,-9.1536,-1.1106,4.6556,-9.1536,6.1687,27.6409,9.4951,477
-4.6177,-9.529,-1.3929,2.5748,-9.529,1.4576,9.3,7.0115,478
-2.5196,-9.5511,-0.1583,1.7868,-9.5511,2.6896,9.8926,8.2825,479
-4.2773,-9.8883,-1.1057,1.1129,-9.8883,2.7267,12.2212,6.4788,480
-5.3231,-9.8427,-0.7329,1.7143,-9.8427,3.3055,18.0109,7.7761,482
-4.1641,-10.0486,-0.2878,1.1087,-10.0486,1.87,10.2917,5.8325,484
-6.6699,-9.9777,-0.7906,2.553,-9.9777,4.7285,15.5513,7.1236,485
-6.4802,-10.0276,-0.8733,2.1581,-10.0276,4.1388,13.1126,6.6318,487
-4.5474,-9.9989,-0.5871,2.0492,-9.9989,5.8006,17.499,9.5038,488
-4.0061,-9.6409,-0.8468,1.8736,-9.6409,4.3466,14.2137,10.6719,489
-1.636,-10.2171,2.2845,3.7985,-10.2171,7.454,15.5017,11.275,490
-6.8918,-9.9307,-0.7136,1.9587,-9.9307,3.6073,16.2374,6.7355,492
-4.6752,-10.0118,-0.7492,1.2825,-10.0118,1.8933,8.7785,4.0857,493
-5.5499,-10.046,-1.762,2.006,-10.046,2.8084,10.1532,6.5155,495
-3.1978,-9.7982,-0.8037,1.6101,-9.7982,1.9735,6.8732,3.7797,496
-7.5959,-9.9859,-0.3512,3.4553,-9.9859,6.3642,17.4921,9.5514,497
-6.1152,-9.9613,-0.3857,1.7486,-9.9613,3.5038,12.3406,6.2906,498
-10.6834,-10.0322,-0.3915,5.1017,-10.0322,8.839,18.6719,14.1075,499
-2.472,-10.1929,-0.0106,1.1939,-10.1929,0.6491,10.7714,6.6339,500
-1.1529,-10.1138,-0.1546,0.9866,-10.1138,2.1607,7.796,5.9872,501
-1.2871,-9.9431,-0.4593,0.729,-9.9431,3.8921,11.8029,9.4072,502
-5.2223,-9.9999,-1.0268,2.3163,-9.9999,6.8996,12.5512,9.4545,503
-6.2452,-9.8842,-0.5061,2.9482,-9.8842,5.1519,13.3372,8.8556,504
-4.5852,-9.9946,-0.8787,1.5836,-9.9946,2.5361,9.6589,5.3828,505
-6.3718,-9.911,-1.0001,1.8208,-9.911,4.0307,9.8866,6.5246,507
-8.722,-9.9522,0.5375,3.7881,-9.9522,3.4419,24.2675,7.7031,508
-2.9215,-10.0454,-0.5875,1.1919,-10.0454,2.9244,13.2115,5.0965,509
-7.9754,-9.9272,-0.7681,5.296,-9.9272,8.5123,20.392,16.0951,510
-9.4877,-9.8936,-0.3941,3.7639,-9.8936,5.1949,15.669,8.4299,511
-6.8098,-9.7595,-1.5422,1.9501,-9.7595,4.9581,12.7471,8.2556,512
-12.1434,-9.8092,-1.0796,3.1399,-9.8092,3.9213,13.1265,7.6018,513
-6.0333,-9.1196,-0.6622,3.3166,-9.1196,3.0939,13.3161,9.4425,514
-5.0271,-10.1065,-0.6093,1.9268,-10.1065,3.278,10.8558,6.3566,515
-3.8192,-9.7554,-0.854,1.4788,-9.7554,1.9855,10.0912,7.4529,516
-7.3368,-9.9135,-0.5555,2.4636,-9.9135,4.4378,11.1688,7.4525,517
-14.4949,-9.8584,-1.0051,3.5797,-9.8584,2.747,14.4556,6.4799,518
-7.1143,-10.013,-1.5028,2.3527,-10.013,2.7116,9.8584,7.4127,519
-4.0643,-9.9127,-1.0816,1.6772,-9.9127,3.9357,11.3604,7.5226,520
-5.0646,-9.9736,-1.4547,1.7552,-9.9736,4.5823,12.7658,7.5904,522
-4.6053,-9.9751,0.0006,2.1493,-9.9751,5.1786,14.3386,7.8964,523
-5.5742,-9.9744,-0.9667,2.3715,-9.9744,1.8018,9.5141,6.1016,524
-2.3381,-9.9704,-0.6394,1.058,-9.9704,3.2804,8.6969,5.3739,525
-4.4232,-9.9543,-0.2836,1.3388,-9.9543,4.0663,9.9482,6.2158,527
-3.5486,-9.9723,-0.6766,1.284,-9.9723,2.7301,9.2895,3.8187,528
-0.6493,-9.9346,-0.0559,0.491,-9.9346,2.1427,8.2589,4.2295,529
-4.1264,-10.1496,0.1901,1.8815,-10.1496,3.0773,10.8873,6.702,530
-2.74,-9.7286,-0.6928,1.0547,-9.7286,0.4324,8.6457,6.568,531
-1.3283,-9.964,-0.1284,0.4765,-9.964,1.6253,10.1115,4.6329,532
-1.9462,-9.9534,-0.1349,0.5556,-9.9534,1.1827,9.327,3.7894,533
-0.4095,-9.9655,0.0704,0.405,-9.9655,0.7403,4.6954,3.7235,534
-0.7011,-10.0014,0.0552,0.2625,-10.0014,1.18,8.1997,4.9791,535
-8.0647,-9.9955,0.1651,1.6542,-9.9955,2.0921,21.9116,6.5815,537
-0.0178,-9.8888,2.2754,1.774,-9.8888,1.555,17.9831,7.9179,538
-1.3918,-9.9901,-0.4179,0.4896,-9.9901,0.6117,7.2651,6.593,539
-3.7683,-9.8617,0.9595,3.2571,-9.8617,7.5536,19.7034,13.0152,540
-9.9159,-10.0719,-0.9171,3.1538,-10.0719,5.4541,23.9166,14.5318,542
-3.9983,-10.1618,0.631,2.6298,-10.1618,2.5641,41.8198,29.5242,543
-2.4908,-10.2452,0.8753,1.8756,-10.2452,3.0995,33.8653,20.1765,545
0.6531,-10.0849,1.3552,0.4896,-10.0849,0.8878,17.2014,15.7235,547
-1.614,-9.9613,1.0044,2.0992,-9.9613,3.3853,16.8127,8.9244,548
-4.0315,-9.9901,2.1837,3.2789,-9.9901,0.9405,17.2884,13.2808,549
-8.0558,-10.088,3.7082,9.5548,-10.088,5.4157,63.0992,54.0712,550
-9.6661,-9.9623,1.188,6.2625,-9.9623,4.6751,52.5213,12.0498,552
-12.6582,-9.8173,1.0731,6.0109,-9.8173,5.1084,29.8117,14.8992,553
-24.9232,-9.1131,0.8355,15.997,-9.1131,8.0661,43.0924,25.2016,554
-9.8905,-10.2149,-0.3406,6.4107,-10.2149,4.2982,53.1348,41.7714,555
-15.9704,-10.0557,17.0612,22.2534,-10.0557,8.5708,49.3061,35.3241,557
-10.4797,-9.8428,2.4408,8.4686,-9.8428,5.6487,53.5033,22.5068,558
-9.213,-9.712,-0.4463,5.8742,-9.712,1.5912,26.2404,22.0533,559
-10.1591,-9.7589,1.7969,7.1261,-9.7589,6.0343,20.7328,16.2328,560
-5.4214,-10.0611,2.6711,4.655,-10.0611,5.7353,19.1265,10.7586,562
-3.7482,-10.0265,-0.8289,1.0949,-10.0265,2.9257,11.5977,8.7496,563
-5.4676,-9.3483,2.009,3.894,-9.3483,4.1158,18.9397,11.0683,564
-5.8652,-10.137,-1.0116,1.7225,-10.137,3.6844,13.1963,7.0759,565
-6.4911,-10.0879,4.682,11.2421,-10.0879,7.3206,35.3613,9.8651,567
-3.5997,-10.0874,-0.0787,2.3794,-10.0874,4.0037,15.0281,7.2851,568
-0.234,-10.2279,1.0317,1.7546,-10.2279,3.4928,8.8315,6.5126,569
-3.7001,-10.0064,-0.2833,1.9412,-10.0064,4.2135,11.9108,6.3795,570
-16.9522,-9.9318,-1.1264,3.4291,-9.9318,5.0346,25.9827,6.7585,572
-15.2844,-10.1697,11.0057,12.7008,-10.1697,3.2662,28.3295,27.1316,573
-0.945,-10.6711,0.0986,0.7943,-10.6711,1.3084,39.3269,38.3815,574
-8.8661,-10.4774,-0.4804,2.9067,-10.4774,3.4536,44.6157,37.0027,575
-1.7602,-9.9777,1.7625,3.6159,-9.9777,5.8122,24.5887,6.4886,577
-0.4354,-10.0338,0.0263,0.3252,-10.0338,1.4211,7.3102,4.4298,578
-0.9908,-10.04,0.4452,1.1427,-10.04,1.6971,14.6653,5.1328,580
-0.9441,-10.1418,-0.282,0.3951,-10.1418,1.2916,10.4975,6.2345,581
-3.864,-10.1627,2.211,4.4806,-10.1627,5.1115,26.1433,22.0912,582
-17.1235,-10.1206,2.9156,8.9197,-10.1206,7.7074,52.2507,26.2532,583
-2.6253,-10.7877,-1.2828,0.9625,-10.7877,2.6527,55.2357,54.1513,584
-2.7188,-9.9394,2.9721,4.6817,-9.9394,2.7811,32.5056,31.6,585
-4.9949,-10.045,0.9865,4.724,-10.045,2.5451,15.2859,10.0135,586
-12.2901,-10.1002,-0.2929,3.6831,-10.1002,5.115,52.9503,46.0095,587
-25.2121,-9.4245,7.6989,12.0288,-9.4245,4.8111,46.5359,25.0849,588
-3.2899,-10.3743,1.7766,5.869,-10.3743,3.9769,50.9878,39.6875,589
-2.2884,-9.8063,7.9565,11.3334,-9.8063,9.3108,49.0954,44.4884,590
-0.2028,-9.9834,1.4569,1.2245,-9.9834,1.7227,12.3025,8.2256,591
-0.3123,-9.9024,0.7067,0.9546,-9.9024,2.0181,14.9763,5.1018,592
-0.4794,-9.9418,-0.021,0.1509,-9.9418,0.7741,6.0185,2.9368,593
-0.484,-9.9965,0.2589,0.3702,-9.9965,1.5965,6.8223,5.2242,594
-0.677,-9.9904,-0.002,0.3221,-9.9904,0.3439,7.7375,4.4495,595
-0.4449,-10.0011,0.4923,0.5589,-10.0011,1.3548,14.0677,4.9025,596
-0.8233,-9.98,-0.0368,0.4422,-9.98,0.9074,9.2913,5.0476,597
-0.2039,-9.9693,0.291,0.4758,-9.9693,1.286,9.6543,6.6936,598
-4.0864,-9.9772,-1.0111,1.361,-9.9772,2.1449,10.005,6.4206,599
-0.7796,-9.9545,0.5559,0.7052,-9.9545,1.2105,3.8141,2.8742,600
-5.931,-9.9384,0.1144,3.1374,-9.9384,3.8252,12.7828,7.1238,602
-4.2941,-9.9406,0.0738,3.2166,-9.9406,5.3701,16.8601,10.9976,603
-1.2131,-9.9463,1.3363,1.7061,-9.9463,1.0708,23.3367,18.7788,604
-1.1367,-9.9857,1.256,1.4251,-9.9857,1.3237,42.252,18.9208,605
-3.7962,-10.0501,2.1819,6.3257,-10.0501,2.3499,55.5188,51.2574,606
-4.6063,-10.0402,1.502,2.3651,-10.0402,3.8083,48.46,13.0915,607
-3.9953,-9.9615,1.4782,2.4302,-9.9615,4.2623,45.9269,26.754,608
-9.7483,-9.9521,0.0906,3.225,-9.9521,3.3038,10.779,9.6634,609
-0.4987,-9.9442,0.6183,1.0198,-9.9442,1.4823,4.5925,3.1471,610
0.002,-9.9793,0.2459,0.2766,-9.9793,0.717,3.9535,3.0578,612
-5.6572,-9.9398,-0.1042,2.2429,-9.9398,3.0615,11.6558,4.1754,613
-0.3203,-9.9518,0.2575,0.5257,-9.9518,1.0613,4.3892,2.8904,614
-1.543,-9.9169,0.7375,1.1942,-9.9169,2.0763,6.4833,3.0352,615
-2.8738,-9.9776,0.2191,1.0772,-9.9776,2.1928,6.45,3.9704,617
-0.061,-9.9562,0.0905,0.1069,-9.9562,0.4285,3.0507,2.5098,618
-0.1046,-9.9551,-0.057,0.032,-9.9551,0.1542,2.4876,2.4382,619
-1.3545,-9.9231,-0.3683,0.6645,-9.9231,1.2529,6.6643,4.9333,620
-0.1755,-9.9421,0.1846,0.1738,-9.9421,0.3754,3.3837,2.488,622
-0.057,-9.9457,0.5205,0.4481,-9.9457,0.9951,3.9308,3.3907,623
-0.177,-9.9505,-0.0354,0.1129,-9.9505,0.6583,2.706,2.5453,624
-0.0126,-9.9499,0.1183,0.0485,-9.9499,0.1766,2.556,2.4909,625
0.0829,-9.9501,0.0997,0.0105,-9.9501,0.0388,2.5023,2.4767,626
0.0085,-9.9486,0.0428,0.0179,-9.9486,0.057,2.4972,2.4547,628
-0.0015,-9.9459,0.0262,0.0169,-9.9459,0.0447,2.4923,2.4571,629
0.1388,-9.947,0.1768,0.0159,-9.947,0.0492,2.5172,2.4914,630
0.038,-9.9461,0.1087,0.0462,-9.9461,0.1229,2.5158,2.4615,632
0.1465,-9.9456,0.1714,0.0129,-9.9456,0.0328,2.547,2.4957,633
0.0773,-9.9466,0.1077,0.0229,-9.9466,0.0666,2.4972,2.4641,634
0.0432,-9.9456,0.0972,0.0323,-9.9456,0.0797,2.5014,2.4539,635
0.1108,-9.9453,0.1244,0.0077,-9.9453,0.0196,2.5008,2.4632,636
0.1496,-9.9459,0.1703,0.0203,-9.9459,0.0344,2.541,2.4683,637
0.1773,-9.9485,0.243,0.0495,-9.9485,0.1994,2.6094,2.5217,638
0.1074,-9.9459,0.1298,0.0118,-9.9459,0.0337,2.5714,2.4769,640
0.1063,-9.9468,0.1262,0.0095,-9.9468,0.0352,2.553,2.4797,641
0.088,-9.9502,0.1134,0.014,-9.9502,0.046,2.5218,2.4691,642
-0.0047,-9.9433,0.0687,0.0781,-9.9433,0.189,2.5655,2.5207,643
0.2613,-9.9458,0.2936,0.0168,-9.9458,0.0677,2.6289,2.5971,644
0.0042,-9.9513,0.0415,0.0205,-9.9513,0.1045,2.5475,2.4553,645
0.0141,-9.9506,0.1595,0.0929,-9.9506,0.4672,2.8758,2.5379,647
-0.0043,-9.9567,0.0175,0.0162,-9.9567,0.2682,2.4972,2.4612,648
-0.4199,-9.9467,-0.3736,0.0343,-9.9467,0.0819,2.8699,2.8132,649
-0.0311,-9.9529,0.4388,0.3716,-9.9529,0.4844,3.7836,3.3285,650
-0.3012,-9.9471,0.0431,0.2863,-9.9471,1.0459,3.015,2.6869,652
0.2035,-9.9535,0.2839,0.0716,-9.9535,0.189,3.2012,2.9504,653
-0.064,-9.9552,-0.0444,0.0186,-9.9552,0.1087,2.5246,2.4839,654
-0.0347,-9.948,0.1364,0.1061,-9.948,0.3709,2.6472,2.4887,655
-0.1516,-9.9513,0.0253,0.0983,-9.9513,0.4262,2.5828,2.4801,657
0.1909,-9.9502,0.2236,0.0164,-9.9502,0.051,2.622,2.5502,658
-1.7877,-9.7907,1.6796,2.6145,-9.7907,2.9165,19.2653,4.0579,659
-4.1234,-9.7986,0.3861,2.067,-9.7986,2.6839,33.0959,7.9711,660
-2.3495,-9.9604,1.6381,2.3176,-9.9604,3.9051,25.487,14.4357,662
-3.4713,-9.9384,-0.0517,2.3649,-9.9384,1.8441,36.207,9.3078,663
-19.3725,-10.1613,6.5106,12.3237,-10.1613,9.4106,58.6469,51.4167,665
-4.465,-9.9889,6.1002,11.839,-9.9889,9.853,29.5119,25.8323,666
-0.0412,-9.1156,3.5933,3.8334,-9.1156,3.1247,26.6406,15.1327,667
-2.9683,-9.352,1.6655,2.8938,-9.352,3.1094,17.6242,9.483,668
-15.9112,-8.0464,-0.544,6.7307,-8.0464,7.7842,27.8564,9.8815,669
-5.4562,-9.9543,-1.0622,2.6452,-9.9543,7.4148,16.8838,11.9215,670
-10.1719,-10.0173,-1.838,5.4277,-10.0173,5.6869,23.8788,19.3654,671
-7.4183,-9.9365,-1.2801,2.2535,-9.9365,5.473,13.8522,7.4713,672
-7.0042,-10.1132,-1.8075,2.5875,-10.1132,6.4517,15.8195,11.6246,673
-5.3398,-9.8463,0.2025,3.5188,-9.8463,7.1738,20.4549,12.2922,674
-5.279,-10.0271,0.2039,2.3273,-10.0271,5.0923,17.7366,7.5938,675
-4.2634,-10.2203,-1.4388,1.8334,-10.2203,3.2408,12.5053,6.1419,676
-4.4454,-9.8152,0.1404,1.8344,-9.8152,5.4569,12.4074,8.2965,677
-5.3252,-9.9273,-0.4599,2.732,-9.9273,5.6478,14.1116,11.4841,678
-3.0208,-9.9643,0.2428,1.7659,-9.9643,0.9235,10.4015,7.8086,679
-4.2744,-9.9501,-1.774,1.6484,-9.9501,4.539,15.3182,9.9709,680
-4.5009,-9.8262,-0.5976,1.2783,-9.8262,2.8954,8.9952,5.6321,681
-2.3623,-10.0074,-0.579,0.9294,-10.0074,2.7299,10.3694,5.9779,682
-8.1986,-9.8759,-0.3777,2.5581,-9.8759,2.875,12.2897,7.5524,683
-0.5557,-10.1514,3.0602,2.9567,-10.1514,3.1034,14.8966,9.1512,684
-2.8746,-9.858,-1.395,0.7555,-9.858,3.4055,13.3095,5.4253,685
-5.8537,-9.9612,-0.5772,3.2995,-9.9612,6.3109,22.64,12.0219,687
-7.2026,-9.9257,0.9596,4.9293,-9.9257,6.157,31.5661,14.8156,688
-0.734,-9.9123,9.3699,11.1014,-9.9123,9.3014,30.44,17.3243,689
-1.9049,-10.0372,0.141,1.1501,-10.0372,3.1819,13.511,7.0641,690
-3.8267,-9.9309,-0.2822,1.8785,-9.9309,4.6637,15.3696,7.3295,692
-1.513,-10.0274,0.1885,1.2034,-10.0274,2.2243,11.7895,8.099,693
-1.8058,-9.8361,-0.5322,0.5498,-9.8361,0.6729,4.6106,3.1151,694
-5.0104,-10.1418,3.1753,3.9377,-10.1418,2.9919,32.9756,18.7069,695
-5.0019,-10.9004,4.1403,9.889,-10.9004,8.5433,59.8187,50.2904,696
-7.6739,-10.2653,0.6939,3.9469,-10.2653,2.9661,45.824,34.7854,697
-11.9092,-10.0276,3.0539,9.4762,-10.0276,8.6782,38.4671,23.3023,698
-1.9606,-10.1153,0.4152,1.44,-10.1153,4.9021,15.6804,10.1452,699
-11.5015,-9.984,-2.1093,3.9339,-9.984,9.697,20.2696,11.504,700
-11.2838,-9.96,-1.7211,2.7075,-9.96,6.0346,16.3116,9.6177,702
-5.8974,-9.8898,-3.2828,2.1405,-9.8898,1.4164,14.7724,12.7325,703
-2.408,-10.0009,2.1837,4.9458,-10.0009,0.5323,16.5036,7.9857,704
-0.8876,-9.9725,7.8319,8.7969,-9.9725,5.4471,26.2729,14.3257,705
-5.1431,-9.9787,-0.511,2.6262,-9.9787,4.1071,17.6322,11.474,707
-5.8629,-9.9504,-0.5069,1.8702,-9.9504,4.6174,12.9513,5.1126,708
0.643,-9.9012,8.4481,7.6462,-9.9012,2.8948,17.8895,16.8455,709
-3.4783,-10.0031,-1.6063,1.5611,-10.0031,4.951,16.2922,5.7467,710
-4.0654,-9.9964,-0.3708,3.1016,-9.9964,6.7099,17.5976,9.8671,712
-4.4237,-9.9062,-0.2589,2.0746,-9.9062,4.6549,12.403,5.5139,713
-4.3987,-10.3652,-0.3629,2.6866,-10.3652,1.6938,14.1792,11.8551,714
-8.2267,-9.956,-1.1782,2.9791,-9.956,4.0801,12.6367,6.5157,715
-0.2409,-9.9651,2.3973,1.787,-9.9651,4.5583,11.4835,7.0252,717
-2.6168,-10.0161,-0.334,0.9773,-10.0161,3.7446,8.3251,5.8594,718
-8.4907,-10.1833,-3.0212,3.4795,-10.1833,3.8943,14.4347,4.7343,719
-0.2576,-10.0544,2.5922,3.5729,-10.0544,4.5156,12.7002,11.5195,720
-0.8811,-9.9869,0.1478,0.4558,-9.9869,2.0137,5.9833,3.6129,722
-0.5349,-9.9706,0.23,0.6587,-9.9706,2.1532,7.7417,4.173,723
-1.196,-10.0181,0.2194,0.6087,-10.0181,1.9709,10.5461,5.5391,725
-3.0841,-9.9518,0.0631,1.1736,-9.9518,3.0973,7.9018,4.006,727
-1.2228,-9.9083,1.3423,2.5881,-9.9083,3.7351,21.7799,17.1249,728
0.4916,-9.8635,9.6957,5.9542,-9.8635,2.0611,37.8859,22.7004,729
-0.2099,-9.9673,0.2971,0.5234,-9.9673,1.3747,9.7838,6.7242,730
-3.842,-9.8649,1.6009,3.5283,-9.8649,4.4586,16.696,7.5608,732
-17.2099,-9.9523,-0.6684,5.7887,-9.9523,6.2493,17.3943,8.7416,733
-2.6987,-9.5357,-0.3615,2.1781,-9.5357,3.4629,9.3161,5.9873,734
-6.598,-10.0598,-0.6117,3.9206,-10.0598,3.3407,11.8567,6.4674,735
-2.3768,-10.0493,-0.4568,0.7414,-10.0493,2.2475,6.9339,4.2376,737
-1.786,-9.9316,0.3761,1.1166,-9.9316,3.6188,8.6606,6.3479,738
-0.7878,-10.2737,0.4769,0.9579,-10.2737,1.0037,6.8696,6.3074,739
-2.5549,-10.0849,0.4086,1.5068,-10.0849,3.8418,9.5771,4.3444,740
-5.8446,-9.9779,-0.1081,2.4022,-9.9779,5.4354,14.1819,5.9356,742
-2.305,-10.0065,0.2324,1.6243,-10.0065,4.1706,12.6981,5.1985,743
-2.3756,-9.9096,1.0517,1.982,-9.9096,4.1366,9.6558,5.564,744
-0.962,-10.0688,0.3285,1.0363,-10.0688,2.0522,7.4871,3.9963,745
-1.4825,-9.9573,0.363,1.063,-9.9573,3.8349,9.5327,4.9762,747
-1.9737,-10.0555,2.2345,3.7237,-10.0555,4.5728,9.2927,8.0038,748
-1.6942,-9.8469,-0.052,1.1032,-9.8469,1.1698,7.3926,5.1156,750
-1.7828,-10.0588,-0.3917,0.8613,-10.0588,0.7271,6.4401,3.6538,751
-3.106,-9.9404,-0.1823,1.154,-9.9404,3.5388,8.7647,4.6058,752
-2.6187,-9.9446,-0.2244,1.0264,-9.9446,3.106,7.019,4.4987,753
-1.5759,-10.0419,0.3901,1.4865,-10.0419,1.3951,7.3944,5.2406,754
-1.7334,-9.8369,0.2223,1.539,-9.8369,3.7955,8.1279,5.0003,755
-2.7314,-10.0186,0.386,1.2063,-10.0186,3.678,7.7716,5.6768,757
-3.4619,-10.0284,-0.3879,1.1531,-10.0284,2.8305,9.4905,5.0084,758
-1.5269,-10.0744,-0.1688,0.8611,-10.0744,1.587,10.8568,6.7519,759
-2.497,-10.5046,-0.8862,1.2406,-10.5046,2.7619,12.7602,8.8885,760
-2.3825,-10.0868,0.9846,1.7034,-10.0868,1.2407,8.3871,5.9021,761
-4.0727,-10.0462,-0.0367,1.8655,-10.0462,4.5784,10.45,5.8484,762
-4.9821,-9.9123,-0.5355,1.4235,-9.9123,3.6631,9.6649,5.1014,763
-3.4528,-10.1903,-1.0654,1.7985,-10.1903,3.3076,10.9948,8.0053,764
-1.9343,-9.8222,0.8063,1.4768,-9.8222,2.442,8.3463,5.7437,765
-6.6626,-10.1121,-2.1759,2.417,-10.1121,3.462,9.7478,6.4002,766
-3.2246,-10.0897,-0.3909,1.7649,-10.0897,3.5056,8.1595,5.3673,767
-3.7315,-9.9618,0.2165,1.4296,-9.9618,2.9984,6.5264,3.9592,768
-1.0548,-9.8875,-0.1072,0.3839,-9.8875,1.3208,8.5893,4.0642,769
-0.7594,-10.0035,0.9729,2.3517,-10.0035,2.2404,9.7732,5.4573,770
-2.8884,-9.9771,0.4023,1.6189,-9.9771,3.4034,11.4921,5.6906,772
-7.1719,-9.8662,-0.5167,1.7351,-9.8662,4.3707,11.494,5.6631,773
-1.9136,-10.027,-0.1948,1.0752,-10.027,2.5883,6.3081,4.204,774
-4.1596,-9.9657,-0.2683,2.1823,-9.9657,4.5139,14.8934,5.5818,775
-1.6796,-9.9899,0.3919,0.9068,-9.9899,3.0732,5.2865,4.1455,777
-3.0731,-10.2026,-0.846,1.2867,-10.2026,1.9922,9.7977,6.8436,778
-1.9151,-10.2426,-0.5591,0.7614,-10.2426,1.8281,5.8954,4.8381,779
-3.332,-9.8802,-0.6102,0.9608,-9.8802,3.125,8.1792,5.5641,780
-13.3211,-9.9217,0.0288,4.2759,-9.9217,7.4397,17.5617,9.4124,782
-3.8135,-9.9535,0.3455,1.5078,-9.9535,2.9299,14.0557,6.3146,783
-4.3555,-9.8129,-0.3716,2.3286,-9.8129,2.4632,10.8405,6.3109,784
-1.6134,-10.0319,0.1223,1.117,-10.0319,2.1958,12.2413,4.6349,785
-5.3497,-9.8863,-1.2372,2.2081,-9.8863,6.4877,12.7024,7.9956,786
-2.8144,-10.0568,-0.4549,1.2047,-10.0568,3.0918,6.5177,4.4989,787
-3.1398,-10.1015,-1.0783,1.6147,-10.1015,0.4955,6.3352,5.9031,788
-1.6139,-9.8074,1.3218,1.9503,-9.8074,4.4795,11.9414,8.2858,789
-1.445,-9.7768,0.5424,1.6485,-9.7768,2.8055,14.4517,5.2784,790
-15.1293,-9.9908,0.9516,9.8871,-9.9908,6.3802,18.1012,9.6081,792
-24.3039,-10.39,17.2358,30.5472,-10.39,19.5647,63.6655,55.2798,793
-2.055,-10.6974,19.0974,15.0938,-10.6974,4.8726,32.9565,29.3343,794
-15.5259,-9.8757,-2.358,7.7764,-9.8757,3.8294,23.0367,14.346,795
-13.8386,-9.7256,-2.3001,3.6893,-9.7256,5.0096,24.5301,9.1216,797
-23.9371,-9.737,-1.8391,6.9933,-9.737,5.9042,19.3292,11.7645,798
-10.6908,-10.4129,-3.2684,3.8087,-10.4129,4.8461,16.258,9.0633,799
-8.493,-10.1418,-0.8074,3.7003,-10.1418,5.4571,16.9948,6.0479,800
-4.5418,-9.9882,-0.8082,2.5838,-9.9882,4.1566,9.9717,6.291,802
-8.2397,-10.0272,-0.5579,3.4972,-10.0272,5.9047,20.3721,7.8792,803
-1.0947,-9.7293,0.7638,1.1389,-9.7293,2.9577,6.8683,5.4703,804
-3.8894,-9.6993,-0.1826,1.1493,-9.6993,1.5524,12.8976,5.3064,805
-7.0862,-9.9904,0.406,1.6604,-9.9904,3.8522,12.5365,5.9784,807
-3.6256,-9.8849,-0.3709,1.6486,-9.8849,4.8051,15.2156,10.7962,808
-5.021,-8.9965,-1.1197,2.9993,-8.9965,4.5203,14.3628,10.9612,809
-5.23,-9.8282,-0.8992,2.0652,-9.8282,2.2164,16.6598,8.9361,810
-11.3216,-9.3192,0.1375,8.6221,-9.3192,6.9476,33.4523,10.5052,812
-13.4736,-8.9772,-0.995,5.3709,-8.9772,3.9068,19.6733,11.5318,813
-2.982,-10.1466,2.5791,4.3188,-10.1466,6.3592,10.9127,8.7033,814
-9.4065,-8.2027,0.4427,4.027,-8.2027,4.4644,33.2826,14.393,815
-6.8863,-10.0405,-1.2117,2.2457,-10.0405,3.2896,13.4396,8.2465,817
-3.5945,-9.9438,0.6588,2.6159,-9.9438,5.1888,10.3964,7.423,818
-7.653,-9.9082,-0.8503,3.9378,-9.9082,2.228,13.1356,10.4873,819
-9.6348,-9.483,-0.7,2.8133,-9.483,3.5787,17.8207,9.477,820
-9.1636,-9.9944,-1.138,2.1903,-9.9944,4.2112,15.904,5.6692,822
-4.3976,-9.8454,-1.8933,1.4119,-9.8454,2.8862,11.796,8.0431,823
-1.8472,-9.676,-0.7564,0.688,-9.676,1.3267,9.3917,5.4986,824
-5.8798,-9.6989,0.0019,3.5291,-9.6989,6.3915,22.8053,11.5653,825
-9.1411,-9.9225,0.0879,2.9311,-9.9225,4.6477,18.7053,7.862,827
-13.6032,-9.1331,-1.616,5.0546,-9.1331,3.2249,13.8392,11.9492,828
-0.45,-9.1552,-0.0306,0.2741,-9.1552,0.7546,24.1107,7.6984,829
-2.7845,-9.8947,0.1534,1.3132,-9.8947,2.6746,8.7594,5.4119,830
-6.7016,-9.1771,0.5939,2.3195,-9.1771,4.3995,26.455,6.2643,832
-0.8338,-9.4438,0.4122,1.2703,-9.4438,2.1166,11.9263,5.7709,833
-6.951,-9.997,-0.7024,2.6719,-9.997,0.9336,8.2014,5.7629,834
-1.4991,-10.1028,0.2661,1.7607,-10.1028,2.1174,7.8127,6.6428,836
-2.6509,-10.1332,-0.1328,1.0338,-10.1332,2.0469,9.9923,4.5473,837
-5.7048,-9.9515,0.03,2.3541,-9.9515,2.7957,18.7854,5.005,838
-0.2686,-10.0195,0.0118,0.1831,-10.0195,1.0332,5.5004,3.9535,839
-1.4713,-8.2323,0.5639,1.3734,-8.2323,1.0185,14.4968,5.4523,840
-0.9597,-9.9313,-0.1637,0.4694,-9.9313,0.8283,6.3899,6.1101,841
-0.2923,-9.9349,-0.0164,0.1285,-9.9349,0.6116,10.483,3.8652,842
-0.5227,-9.9951,0.1369,0.3606,-9.9951,0.838,7.4991,3.8524,843
-0.5675,-9.956,0.0629,0.2767,-9.956,0.3606,6.6455,5.4749,844
-3.1001,-9.9761,-0.0832,0.956,-9.9761,1.609,11.0796,4.4191,845
-0.2829,-9.9621,-0.0333,0.1429,-9.9621,0.224,5.5144,4.0978,846
-0.2303,-9.9905,0.0237,0.1129,-9.9905,0.8113,7.8655,5.318,847
-0.8368,-9.9634,-0.0677,0.2169,-9.9634,0.3357,8.4357,6.9753,848
-0.3075,-9.9949,0.1157,0.2084,-9.9949,1.0237,8.0588,2.9418,849
-0.5363,-9.9425,0.1738,0.6696,-9.9425,0.9356,4.4839,2.4073,850
-1.6248,-9.9666,0.1241,0.653,-9.9666,1.4666,16.6624,8.3066,852
-3.7762,-9.8605,0.5076,1.9239,-9.8605,2.6739,17.335,5.3154,853
-4.2819,-9.8105,-0.4348,1.6714,-9.8105,2.4212,8.3036,5.0356,854
-5.3968,-10.0663,-0.0086,2.2111,-10.0663,1.176,11.5077,5.5026,855
-1.9358,-10.0539,1.8505,2.966,-10.0539,4.6643,20.4452,10.0005,856
-2.7613,-10.0513,0.0075,1.1746,-10.0513,2.8305,9.6462,6.824,857
-3.4741,-10.0046,0.0549,2.2848,-10.0046,6.1031,13.1853,8.623,858
-1.9453,-9.808,-0.8296,0.6188,-9.808,1.4264,6.2566,4.1338,859
-6.2681,-10.0469,-2.803,2.0229,-10.0469,5.525,15.7872,9.0293,860
-11.949,-10.0826,-0.1632,4.4224,-10.0826,6.3576,18.4562,10.2129,862
-8.51,-9.9659,-0.4238,3.9933,-9.9659,4.2422,15.4505,8.6643,863
-21.2856,-10.0333,5.538,20.9731,-10.0333,7.2034,34.4107,26.2433,864
-4.4871,-10.7427,-0.6416,1.2811,-10.7427,2.5255,44.7401,36.8941,865
-0.2577,-10.7109,3.3738,4.0801,-10.7109,4.0189,35.6737,32.2754,866
-12.838,-9.313,2.2558,6.8347,-9.313,2.688,27.7373,18.9707,867
-13.3694,-9.6455,-3.23,4.9911,-9.6455,5.5717,17.7691,10.67,868
-6.7998,-9.973,-2.0013,2.2052,-9.973,4.4988,12.4081,4.8777,869
-5.6683,-9.9581,-1.1451,1.7104,-9.9581,3.2518,9.019,5.3202,870
-5.2086,-9.9215,-1.7492,1.6548,-9.9215,3.9749,10.3134,5.7699,872
-5.3609,-10.0071,-0.388,1.5814,-10.0071,4.7734,13.9843,6.7511,873
-0.2169,-9.9267,0.0693,0.3086,-9.9267,0.8328,4.237,2.7639,874
-0.4939,-9.953,0.2977,0.4569,-9.953,2.215,7.2909,5.7597,875
-1.478,-9.9725,0.2036,0.6235,-9.9725,1.9028,12.3283,3.8171,877
-0.6339,-9.6217,0.2987,1.2175,-9.6217,2.7374,21.6566,15.9145,878
-0.3896,-10.0765,0.7609,1.0427,-10.0765,2.1622,21.744,16.3055,879
-1.5025,-9.9969,0.2531,1.3066,-9.9969,2.1168,14.5885,5.9469,880
-1.8003,-9.96,0.7504,1.2608,-9.96,3.2395,13.55,7.1008,882
-0.481,-9.9833,-0.0736,0.172,-9.9833,0.8253,3.9172,3.1053,883
-0.0941,-9.8189,0.0096,0.055,-9.8189,0.2548,4.6586,3.2309,884
-0.1826,-9.9758,0.1876,0.2755,-9.9758,1.4165,7.5259,5.2724,885
-4.5795,-9.9564,1.1762,3.1094,-9.9564,5.9542,15.6696,10.4428,887
-0.447,-10.0452,1.3344,1.2849,-10.0452,3.3221,13.4163,10.2414,888
0.0065,-9.9918,1.1763,1.1234,-9.9918,1.1027,6.5217,4.5576,889
-1.1787,-10.0086,0.898,1.7272,-10.0086,2.5418,8.6101,6.5049,890
-1.9821,-9.735,0.1045,0.9441,-9.735,2.6084,16.4273,6.8707,892
-1.1527,-10.2712,0.8413,1.6175,-10.2712,0.9309,13.6906,12.2709,893
-0.0996,-9.9307,0.711,0.9498,-9.9307,1.4339,18.1199,12.7384,894
-5.2615,-9.9353,0.0715,1.7001,-9.9353,1.2781,19.8503,15.0235,895
-2.5366,-9.9902,1.1127,1.9792,-9.9902,3.8877,40.9277,27.4402,897
-0.5186,-10.0041,1.1006,1.3611,-10.0041,2.6959,15.4557,10.8116,898
-0.4392,-9.6984,0.1886,0.4998,-9.6984,1.3821,22.7423,19.9361,899
-2.8341,-9.9062,0.0534,1.4876,-9.9062,1.854,8.6555,6.0093,900
-0.407,-10.0112,2.3318,3.0012,-10.0112,4.7718,16.5977,13.908,902
-1.3215,-10.0968,0.7317,0.9039,-10.0968,3.4745,14.7689,8.7682,903
-0.8235,-9.9846,0.0086,0.3249,-9.9846,1.5318,5.3625,3.3595,904
-0.6237,-9.9801,0.1431,0.4192,-9.9801,1.4041,9.5656,6.8372,905
-1.2238,-9.9544,1.0329,2.1032,-9.9544,2.4317,24.5271,5.1407,907
-5.5483,-9.9374,-0.0766,2.5387,-9.9374,4.5039,25.0616,21.914,908
-2.8504,-9.7422,-0.6146,1.5237,-9.7422,4.674,19.0042,17.4288,909
-4.6487,-10.1856,-0.0535,3.0561,-10.1856,4.8279,21.0666,15.7168,910
-9.2621,-9.9926,-0.0014,4.75,-9.9926,4.2408,14.9322,8.2144,912
-3.4144,-10.1572,0.4357,2.2949,-10.1572,3.9027,19.251,9.6914,913
-39.4746,-8.3207,11.9077,43.3466,-8.3207,5.9677,59.2834,44.7497,914
-7.4306,-9.6279,-0.4226,3.8143,-9.6279,5.8811,10.1043,6.1455,917
-9.4376,-10.0197,-2.134,2.1179,-10.0197,5.6911,13.2434,8.5462,918
-4.1336,-9.7993,-1.1465,1.4926,-9.7993,2.0393,7.7235,4.6476,919
-5.0326,-10.0629,-1.7698,2.4486,-10.0629,2.9367,12.8806,6.2292,920
-6.6113,-10.008,-1.7986,2.8185,-10.008,2.3251,12.3921,8.8892,921
-3.3592,-9.971,-1.0558,1.1456,-9.971,3.5556,13.2303,6.9249,922
-5.2995,-9.9984,-1.1979,2.3582,-9.9984,4.2395,14.3711,9.0712,923
-6.0899,-10.0217,-2.6677,2.116,-10.0217,1.6968,13.9124,12.019,924
-2.1882,-10.4564,0.3873,1.8896,-10.4564,1.583,19.6217,18.7012,925
-43.9988,-10.3246,1.2636,27.7832,-10.3246,12.784,51.3274,22.329,926
-24.0084,-9.1755,0.7652,10.098,-9.1755,5.1267,53.9583,14.9728,927
-13.7049,-9.911,-3.4575,4.567,-9.911,5.8459,21.4606,9.8656,928
-8.2507,-9.9582,-0.9556,4.1847,-9.9582,6.5107,24.2818,14.3233,929
-10.989,-9.8854,-3.261,3.93,-9.8854,6.3928,16.717,10.0892,930
-3.7499,-9.989,-1.3764,1.6286,-9.989,6.6238,15.6786,9.5179,931
-8.7281,-9.899,-1.6853,4.1722,-9.899,7.4684,18.8038,9.5173,932
-6.4474,-9.9781,-1.3602,2.732,-9.9781,5.5286,18.6861,9.755,933
-8.7361,-9.9553,-2.3803,3.5376,-9.9553,3.8862,12.4829,6.148,934
-7.0944,-9.9119,-1.2763,2.4911,-9.9119,6.3518,14.9957,10.7814,935
-6.7199,-10.0215,-1.0973,2.2474,-10.0215,5.4476,14.8551,8.9629,936
-6.2414,-9.9887,-0.297,2.3847,-9.9887,7.6165,13.0776,9.9534,937
-6.8706,-9.8724,0.2788,3.0099,-9.8724,6.2751,16.7613,10.9722,938
-10.8526,-10.1552,-1.5953,5.5421,-10.1552,1.2246,12.7118,9.4413,939
-14.4377,-10.0787,-2.1727,3.9705,-10.0787,6.1056,18.1722,9.9223,940
-9.8909,-10.1444,-1.0375,4.1402,-10.1444,5.8179,22.0628,12.7989,942
-6.2282,-10.1821,-1.8145,2.294,-10.1821,4.3501,31.3534,21.9022,943
-3.4559,-10.1716,-0.2441,1.6887,-10.1716,3.0665,23.727,14.9275,944
-1.5907,-10.115,1.137,3.2345,-10.115,4.1722,17.6964,8.2892,945
-12.0018,-9.9486,-1.8393,2.9623,-9.9486,6.0542,16.9752,8.5917,947
-9.5373,-10.0008,-0.9122,2.3072,-10.0008,4.6369,13.6301,7.4542,948
-0.4806,-9.7848,0.6654,1.1152,-9.7848,4.3713,13.1226,7.0172,949
-6.924,-9.9716,-1.2434,2.6419,-9.9716,4.2006,14.0064,7.1434,950
-4.8188,-9.9894,0.1131,2.3054,-9.9894,2.3076,12.3913,8.1585,952
-2.6488,-10.0012,-0.1121,1.7219,-10.0012,2.3012,8.4404,5.3372,953
-1.7089,-9.9529,0.2368,1.3349,-9.9529,1.1773,5.6277,4.4673,954
-4.6301,-9.7088,-1.1033,2.36,-9.7088,3.5899,12.567,8.5904,955
-6.5209,-10.0036,0.6307,3.7273,-10.0036,6.8345,28.8281,11.9103,957
-1.1582,-10.0097,-0.3906,0.5767,-10.0097,0.9207,9.2645,6.1543,958
-4.0059,-9.9603,-0.7792,2.1416,-9.9603,2.3482,11.8831,11.3021,959
-6.635,-10.0136,0.1984,3.9502,-10.0136,2.5052,17.0292,14.7219,960
-4.6914,-10.4701,0.8791,3.4212,-10.4701,4.8976,44.2131,24.8267,962
-4.8256,-10.3996,1.4071,3.477,-10.3996,4.5962,26.17,19.725,963
-11.608,-9.4285,-0.3505,8.108,-9.4285,3.1203,48.3159,38.3781,964
-11.2337,-9.8851,9.7179,11.8935,-9.8851,12.7383,28.5088,13.1083,965
-6.2045,-9.9194,-0.0348,5.4103,-9.9194,4.4328,14.13,5.9725,967
-4.7753,-10.0345,-1.1514,2.012,-10.0345,2.5411,7.5402,7.0465,968
-4.2362,-10.056,-1.0815,1.875,-10.056,2.9339,10.5913,8.1063,969
-3.8096,-9.8726,-0.1802,1.8566,-9.8726,4.1522,9.0153,6.0635,970
-12.4794,-9.7948,-0.6543,3.6443,-9.7948,4.1093,19.5447,8.8211,972
-2.3561,-10.1272,-0.5894,1.7147,-10.1272,2.028,9.8411,4.6247,973
-3.6276,-9.9063,-0.5332,2.135,-9.9063,2.2853,11.3884,7.338,974
-3.6681,-9.9208,-1.0045,1.6246,-9.9208,4.715,16.224,8.2919,975
-3.3886,-9.8825,-0.5692,1.7786,-9.8825,3.9698,15.8564,5.8282,977
-3.6859,-10.0524,-1.4161,1.6866,-10.0524,1.6938,10.676,7.1458,978
-2.9398,-9.7745,-1.2143,1.2037,-9.7745,2.0438,11.4181,7.6804,979
-5.3336,-9.7922,-1.5063,1.7729,-9.7922,3.2525,11.1655,5.8966,980
-8.0949,-9.9847,-1.1673,2.6407,-9.9847,5.0446,17.4546,6.3391,982
-3.8848,-9.9932,-0.9831,2.4208,-9.9932,2.0306,6.0899,4.638,983
-5.0843,-9.9977,-1.8837,2.4376,-9.9977,1.879,14.3863,10.2612,984
-14.9198,-9.9617,-2.0742,4.0666,-9.9617,3.9142,12.6745,5.3138,985
-6.6578,-9.9582,-1.455,2.345,-9.9582,4.3352,10.0417,5.268,987
-0.9164,-10.0103,1.3131,2.0432,-10.0103,4.4118,9.7621,7.6931,988
-7.5615,-10.0054,4.3441,7.7118,-10.0054,8.5397,24.5327,16.5021,989
-5.4221,-9.9343,-0.9646,2.0378,-9.9343,2.9833,13.2659,6.1341,990
-104.3764,-9.4174,1.7065,23.2249,-9.4174,12.2552,56.3309,20.5206,992
-22.844,-9.6925,-3.9855,8.0273,-9.6925,3.0664,18.9255,10.8843,993
-1.8048,-9.8568,-0.1082,1.0393,-9.8568,2.0449,6.7208,3.3447,994
-1.2447,-9.9798,0.2195,0.9848,-9.9798,2.2186,7.6913,5.0669,995
-1.8408,-9.9265,-0.0547,0.5867,-9.9265,1.4133,6.7482,3.5119,997
-7.9703,-9.9393,3.3732,7.1053,-9.9393,9.3342,28.5866,6.4009,998
-14.4698,-10.8655,11.4562,12.8093,-10.8655,15.8882,56.0899,44.5356,999
-2.0578,-9.5089,7.3453,4.413,-9.5089,2.1949,28.4938,21.1262,1000
-4.7787,-9.8482,2.275,4.3016,-9.8482,6.8514,21.2485,9.5681,1002
-0.9138,-9.9977,0.3752,1.2893,-9.9977,1.8227,13.6538,8.2705,1003
