AYGX_min,AZ_mean,AYGX_mean,AYGX_std,AZ_mean.1,GX_std,Gnorm_max,Gnorm_median,timestamp
-145.5623,-9.5901,-60.9033,63.1905,-9.5901,13.4512,38.612,35.0382,72
-5.4444,-9.8053,-2.0026,2.767,-9.8053,1.924,4.4047,3.002,73
-2591.1814,-2.1148,-245.9876,653.6161,-2.1148,77.8191,244.0845,77.7094,74
-19.2868,0.8942,2.7507,20.6034,0.8942,4.4265,12.5862,2.8259,75
-3.2433,0.8209,-2.6139,0.3602,0.8209,0.0363,2.3846,2.359,77
