AYGX_min,AZ_mean,AYGX_mean,AYGX_std,AZ_mean,GX_std,Gnorm_max,Gnorm_median,timestamp
0.0804,-9.8679,0.0843,0.0017,-9.8679,0.0137,3.9702,3.9351,2
0.0765,-9.8682,0.0826,0.0029,-9.8682,0.0114,3.9852,3.9291,3
-0.309,-9.8664,0.1691,0.4013,-9.8664,1.1959,6.0129,3.9527,4
-15.15,-9.8397,-3.0192,6.5225,-9.8397,4.6325,21.292,12.154,5
-52.2485,-9.6886,-22.8994,18.2659,-9.6886,5.821,19.2576,13.812,7
0.8405,-9.6073,12.5617,8.2937,-9.6073,3.4969,17.9962,8.8205,8
-75.9748,-9.604,-7.2411,20.8453,-9.604,8.4671,78.9543,32.2723,9
-32.3828,-9.3949,-8.3861,22.0591,-9.3949,5.7954,15.0607,7.7643,10
-8.8916,-9.4417,5.3637,11.456,-9.4417,5.5645,16.6743,4.3701,11
-23.7553,-9.3486,-6.6565,7.9585,-9.3486,2.3274,8.0022,4.5095,12
-5.5255,-9.3783,-1.075,3.0869,-9.3783,0.9744,5.1045,4.1365,13
-7.6799,-9.4131,1.759,5.9657,-9.4131,2.2174,5.4641,4.4189,14
-26.5276,-9.3885,-3.362,9.221,-9.3885,4.0039,15.0094,5.2855,15
-79.4622,-9.1792,-17.8357,18.7496,-9.1792,3.6899,16.9477,5.6119,16
-9.2513,-9.0995,-4.5487,2.9802,-9.0995,0.7781,4.5636,4.0324,17
-5.2063,-9.0818,-2.7634,1.3978,-9.0818,0.3785,4.1234,3.9467,18
-6.6263,-9.0364,-4.4371,1.4263,-9.0364,0.3482,4.2198,4.0638,19
-10.6245,-9.005,-6.7971,2.7141,-9.005,0.635,4.6373,4.1984,20
-2.76,-8.9894,-1.6952,0.7648,-8.9894,0.193,3.9587,3.9409,21
-3.9139,-8.9683,-3.3794,0.4283,-8.9683,0.1006,4.0255,3.9927,22
-3.5729,-8.9708,-2.8863,0.3029,-8.9708,0.0707,3.9722,3.9301,23
-6.0541,-8.9426,-4.7122,0.8709,-8.9426,0.197,4.1538,4.0361,24
-4.8441,-8.9425,-3.5475,0.9028,-8.9425,0.2161,4.0452,3.9775,25
-3.9237,-8.9302,-3.5704,0.2511,-8.9302,0.0575,3.93,3.9186,26
-4.1701,-8.9217,-3.3257,0.3999,-8.9217,0.0944,4.024,3.981,27
-3.5621,-8.92,-2.9816,0.3111,-8.92,0.0741,4.0195,3.9472,28
-3.442,-8.9163,-3.1985,0.1852,-8.9163,0.0437,3.9909,3.9677,29
-3.1141,-8.9135,-2.678,0.2731,-8.9135,0.0642,3.9747,3.9491,30
-3.5527,-8.9099,-3.1535,0.3217,-8.9099,0.073,3.989,3.9667,31
-5.6261,-8.8591,-2.1619,3.0347,-8.8591,0.6971,6.8125,4.0031,32
-151.9753,-9.068,-2.2574,80.8053,-9.068,15.4208,30.61,10.8443,33
-25.8201,-9.3932,44.014,58.8782,-9.3932,13.1423,26.156,17.5777,34
-20.4128,-9.064,-17.8657,2.4779,-9.064,0.758,7.7314,7.3457,35
-4.528,-9.0289,-3.2596,1.057,-9.0289,0.2572,4.0153,3.9299,36
-4.9782,-9.0201,-4.2288,0.6875,-9.0201,0.1602,4.1105,4.0139,37
-3.6203,-9.0086,-2.288,0.846,-9.0086,0.2083,4.0775,3.9486,38
-12.7435,-9.0276,-2.7402,5.4862,-9.0276,1.3836,4.7847,4.057,39
-8.2108,-9.0168,-5.9516,1.534,-9.0168,0.3806,4.5519,4.3177,40
-7.1303,-8.9779,-3.3285,2.4801,-8.9779,0.5663,4.2635,3.9761,41
-6.3989,-8.9638,-2.6527,2.567,-8.9638,0.5994,4.0279,3.8559,42
-10.3131,-8.9823,-2.5188,3.1495,-8.9823,0.7278,4.5151,3.9479,43
-10.0347,-8.9514,-5.8692,2.9501,-8.9514,0.6906,4.5712,4.0568,44
-6.2566,-8.9531,-4.2404,1.2888,-8.9531,0.3256,4.1777,4.0067,45
-6.6502,-8.9607,-2.8212,3.1847,-8.9607,0.7714,4.1018,3.9564,47
-13.4279,-9.011,2.9766,8.8502,-9.011,2.2315,5.8072,4.4032,48
-7.4817,-9.0551,-2.0072,3.0643,-9.0551,0.7721,4.2912,3.9162,49
-2.7822,-9.0587,-1.5984,0.7437,-9.0587,0.1882,3.884,3.7936,50
-6.956,-9.0482,-5.248,1.0727,-9.0482,0.2814,4.2703,4.109,51
-12.869,-8.9699,-9.9304,1.9357,-8.9699,0.4112,4.8136,4.45,52
-11.073,-8.9451,-4.4047,3.7563,-8.9451,0.8975,4.831,3.9265,53
3.5873,-9.1245,36.414,23.1734,-9.1245,6.7408,44.8405,21.5276,54
-13.5039,-9.9856,3.9739,12.2889,-9.9856,10.7992,55.0675,32.6807,55
-9.2174,-10.1879,3.5062,9.4425,-10.1879,7.4582,81.5917,69.1175,56
-33.085,-9.4667,-4.8157,15.2873,-9.4667,8.6919,66.9502,42.7962,57
-116.2251,-8.37,-4.9783,51.3923,-8.37,11.549,109.867,44.1699,58
-35.0518,-9.2104,-6.8893,13.6039,-9.2104,4.9655,37.995,31.0958,59
-22.9601,-9.8994,10.4116,20.0395,-9.8994,5.805,28.1129,19.3902,60
-13.0823,-10.0282,6.1796,10.0842,-10.0282,2.3804,25.5463,17.7917,61
-0.875,-9.797,4.4006,5.0692,-9.797,3.8007,17.5825,10.5583,62
-3.7216,-9.8981,1.2896,2.7504,-9.8981,2.66,15.5229,7.5682,63
-0.8173,-9.8668,1.2446,1.8787,-9.8668,2.4728,12.3159,7.7695,64
-4.1906,-9.8516,6.2497,9.39,-9.8516,4.9973,26.5929,20.1268,65
-23.148,-9.6979,-7.6457,6.8379,-9.6979,3.3277,17.4721,12.7409,66
-58.2876,-9.494,19.4244,42.4256,-9.494,17.6329,64.718,31.2918,67
-18.6941,-9.1768,17.3239,38.0144,-9.1768,14.5566,57.4266,39.8088,68
-32.4868,-10.6153,28.6294,44.5255,-10.6153,10.0544,42.0214,38.0469,69
-34.2969,-5.4228,7.2381,29.649,-5.4228,14.3841,71.4948,32.1737,70
-16.0199,-4.4251,-3.0887,8.1174,-4.4251,6.6788,61.2515,14.2915,71
-11.335,-8.0345,2.4778,7.0324,-8.0345,2.9333,16.4425,9.7172,72
-11.7475,-8.9306,2.5846,7.4594,-8.9306,3.5455,19.6746,9.0206,73
-2.8584,-8.3067,4.1705,6.8415,-8.3067,4.7486,35.4632,19.0726,74
-5.1561,-10.6134,-0.4909,2.9501,-10.6134,3.8863,13.5041,5.5274,75
-6.5662,-9.847,-0.3852,4.7712,-9.847,3.7443,15.8977,8.5489,76
-9.2443,-9.6769,-1.5578,2.633,-9.6769,5.2309,17.7293,12.6409,77
-9.4127,-9.9372,-0.5546,2.7471,-9.9372,4.1693,14.0488,6.995,78
-10.1294,-10.267,-0.4428,4.4366,-10.267,8.5199,16.9079,10.8033,79
-0.0681,-9.7702,12.6194,11.7987,-9.7702,6.5171,25.2835,18.6301,80
-15.3116,-10.1973,-2.7948,5.2583,-10.1973,3.3808,11.5926,9.4353,81
-17.6702,-9.7737,-4.95,5.379,-9.7737,11.6458,26.4617,18.2299,82
-6.4995,-9.3324,-2.3624,3.3623,-9.3324,5.538,22.6737,13.287,83
-6.2236,-10.008,1.8152,5.1767,-10.008,2.1453,14.995,11.7302,85
-9.4235,-9.6441,-1.1674,3.518,-9.6441,4.1089,20.8874,7.7923,86
-18.4895,-10.0328,-3.1606,6.7831,-10.0328,4.4713,13.5479,7.7192,87
-4.9837,-10.1501,-1.2165,1.9359,-10.1501,4.9426,9.118,7.0872,88
-21.7005,-9.9587,-3.6308,9.7176,-9.9587,7.1491,20.5742,13.6264,89
-9.9416,-9.8033,-2.1862,4.1511,-9.8033,4.86,12.2969,9.7086,90
-16.6593,-9.7806,-2.1375,7.3804,-9.7806,3.1705,15.2391,10.9825,91
-1.2919,-7.9156,2.1775,3.2864,-7.9156,3.9341,15.0723,8.2297,92
-12.4806,-9.4444,0.3798,5.5863,-9.4444,5.3307,18.04,9.5153,93
-7.4357,-9.8043,2.6483,5.1742,-9.8043,5.8161,15.9018,8.4679,94
-10.0352,-9.8994,1.3098,7.0852,-9.8994,8.2531,17.027,10.5347,96
-13.5476,-9.4563,0.7366,5.3705,-9.4563,8.9475,28.1348,12.4164,97
-0.2359,-9.8587,3.5799,3.0595,-9.8587,5.5379,14.1858,8.309,98
-8.1711,-9.837,-1.7083,3.2712,-9.837,1.4966,10.1164,6.9678,99
-0.5809,-9.6427,3.0795,3.0816,-9.6427,2.7048,18.3382,9.899,100
-0.147,-9.8749,3.0972,3.1599,-9.8749,5.1495,11.8798,8.7893,101
-10.2236,-9.4649,-2.0696,4.3846,-9.4649,4.1541,11.8523,8.3432,102
-7.447,-9.9233,3.1105,6.2332,-9.9233,8.5139,16.7243,10.4764,103
-2.7091,-9.4431,-0.1307,2.876,-9.4431,3.2875,11.9398,7.0235,104
-6.0234,-9.8346,-0.5092,2.6242,-9.8346,4.9243,10.7457,6.3727,105
-0.8802,-10.1519,1.8617,3.3308,-10.1519,3.6184,17.7745,11.7422,106
-2.8841,-9.7482,1.8657,4.6402,-9.7482,4.8606,21.4219,8.9922,107
-5.6262,-9.5524,-0.8992,3.3019,-9.5524,2.6103,14.9984,9.7374,108
-7.5094,-9.8718,2.6464,6.2615,-9.8718,5.2673,14.8907,12.3301,109
-0.9213,-9.7314,-0.0781,0.3862,-9.7314,0.6226,11.8251,8.4327,110
-14.6705,-10.2936,-1.769,6.5771,-10.2936,3.5674,12.686,10.635,111
-0.639,-10.014,1.2124,1.6352,-10.014,3.9864,9.6933,7.8472,112
-4.7346,-9.5306,1.9602,4.5693,-9.5306,6.5265,15.3087,10.4284,113
-6.7738,-9.6643,-0.58,2.332,-9.6643,2.9728,13.168,6.4147,114
-11.0934,-9.8636,1.8485,9.3678,-9.8636,6.295,16.6125,11.245,115
-13.2216,-9.5506,0.3214,7.4886,-9.5506,1.9793,20.4716,15.7755,117
-3.096,-10.1355,4.327,6.5681,-10.1355,5.3967,17.7442,10.9583,118
-17.8253,-9.9674,-2.7348,7.6125,-9.9674,6.2873,20.6463,15.2275,119
-4.8629,-9.4684,1.0766,3.0791,-9.4684,2.9135,11.7153,9.1524,120
-3.3678,-9.8221,7.2532,9.917,-9.8221,8.3256,25.411,15.2672,121
-0.3208,-9.3355,0.5391,0.843,-9.3355,1.5249,10.0579,6.5145,122
-2.8047,-9.9082,2.6691,4.2396,-9.9082,3.796,14.3994,8.6647,123
-2.6425,-9.6626,0.3035,1.8615,-9.6626,0.9544,6.3889,5.1854,124
-0.2583,-9.7876,0.5633,0.5681,-9.7876,0.5101,6.0389,5.3307,126
-0.55,-9.8745,0.962,1.3494,-9.8745,2.4211,11.1294,5.5474,127
-0.7208,-9.9662,-0.051,0.5045,-9.9662,2.3009,7.2118,6.1439,128
-3.1136,-9.3737,0.0991,1.5692,-9.3737,0.7547,7.2848,6.0689,129
-0.1313,-9.9337,0.2107,0.2747,-9.9337,0.5593,5.6071,3.8259,130
-0.666,-9.9233,-0.291,0.2174,-9.9233,0.4143,6.8935,4.8251,131
-0.2343,-9.9953,-0.0016,0.1433,-9.9953,0.5242,4.9159,4.4237,132
-0.1172,-9.8117,0.2705,0.2616,-9.8117,0.3826,6.8142,4.623,133
-0.2745,-9.738,-0.0379,0.1722,-9.738,1.157,7.3041,6.2125,134
-2.8942,-9.3711,1.5767,2.6649,-9.3711,2.6664,11.8447,8.267,136
-5.7554,-9.6672,0.3291,3.0033,-9.6672,3.527,15.0103,9.1945,137
-5.8484,-10.0675,0.9247,3.8667,-10.0675,4.7807,26.3672,18.7364,138
-8.5809,-10.2044,4.9517,8.7873,-10.2044,2.5419,33.8865,25.668,139
-2.3928,-10.0065,17.0129,19.6261,-10.0065,4.5909,33.8401,31.3381,140
-3.6694,-9.6757,10.8,12.6313,-9.6757,6.8254,31.721,23.8019,141
-4.8137,-9.7064,-2.3807,2.233,-9.7064,2.6336,17.6035,8.3067,142
-17.9552,-9.9621,-0.8925,10.3125,-9.9621,9.6976,24.4982,17.5455,143
-8.806,-9.7575,0.6847,4.6127,-9.7575,9.3025,18.8868,12.2328,144
-2.103,-9.5801,2.0099,3.1562,-9.5801,2.0578,17.7866,7.841,145
-15.4821,-9.7024,0.2497,5.5574,-9.7024,6.3728,19.0375,11.0954,146
-1.5711,-9.7077,1.9854,3.3226,-9.7077,3.9944,13.7207,9.11,147
-1.6589,-9.6823,-0.1595,0.6813,-9.6823,1.3592,15.4029,6.5461,148
-1.8078,-9.792,0.2877,1.768,-9.792,1.1846,11.8699,7.5618,149
-0.8593,-9.2477,0.4068,1.0902,-9.2477,3.1462,7.3486,6.0046,150
-0.3792,-9.8522,1.0364,1.6258,-9.8522,1.9997,9.0043,6.0954,151
-5.6312,-9.7829,-0.1858,4.1373,-9.7829,1.1331,11.6988,8.3877,152
-2.7674,-9.9376,0.7551,2.0174,-9.9376,1.3163,11.7182,8.4661,153
-1.8753,-9.73,-0.1246,0.6066,-9.73,1.4637,10.5538,4.9348,154
-3.7253,-9.2944,0.4652,4.2608,-9.2944,2.0105,22.1902,8.16,156
-4.7148,-9.8925,0.1037,2.0124,-9.8925,2.0612,9.5821,6.1194,157
-0.7289,-10.3508,-0.1808,0.4808,-10.3508,0.7342,13.4637,7.8152,158
-3.7163,-9.6542,1.0264,3.7009,-9.6542,5.407,16.5483,10.499,159
-9.2167,-9.9648,-0.3734,4.6455,-9.9648,6.9557,26.4844,10.1422,160
-9.7099,-9.3627,-2.1486,5.0205,-9.3627,4.7192,25.0855,10.3684,161
-4.0236,-10.2289,5.6993,6.0186,-10.2289,2.6688,15.1704,13.4156,162
-2.8744,-10.0041,-0.0682,1.4019,-10.0041,2.115,12.3338,6.3047,163
-4.3303,-10.2144,-0.3084,2.4675,-10.2144,3.867,18.4434,9.7837,164
-3.0551,-9.3781,1.0488,2.1553,-9.3781,3.7395,13.1832,7.5167,166
-4.1565,-9.0841,1.9679,3.932,-9.0841,3.5518,22.5955,7.5649,168
-1.3119,-9.7665,0.4897,1.3337,-9.7665,2.8653,9.3709,5.9847,170
0.0103,-9.8672,1.6567,1.1506,-9.8672,1.8852,9.5807,7.6664,171
-0.1818,-9.9566,-0.0487,0.1165,-9.9566,0.6233,8.7092,5.4074,172
-2.2113,-9.9362,0.0994,1.0023,-9.9362,2.2958,12.5941,6.2371,173
-0.4939,-9.7187,-0.0566,0.2076,-9.7187,0.8279,8.2109,4.78,174
-1.0219,-10.028,1.05,2.3807,-10.028,3.2241,11.6283,7.0317,176
-20.2839,-9.8787,-4.958,9.6655,-9.8787,6.8181,20.9861,16.6286,177
-3.3424,-10.0155,-0.311,1.2519,-10.0155,1.1969,11.8408,4.7043,178
-5.4925,-9.7992,1.0008,4.2014,-9.7992,6.8196,20.5907,10.1885,179
-27.0641,-9.8645,0.8314,10.1115,-9.8645,5.0023,18.2505,10.3307,180
-17.7717,-9.7038,-1.5561,9.8389,-9.7038,8.4794,18.5184,10.0947,182
-16.5974,-9.5335,1.1609,8.0587,-9.5335,2.686,32.9038,12.289,183
-3.5366,-9.6662,-0.8309,1.4533,-9.6662,2.2873,14.7248,7.1114,184
-4.4815,-9.7023,0.8627,5.6278,-9.7023,1.9153,13.9651,8.1038,185
-2.1824,-9.6127,1.2893,2.0328,-9.6127,4.9138,21.9382,10.9652,186
-2.6722,-9.8611,0.2075,2.7966,-9.8611,1.2096,15.8828,9.2779,187
-2.3897,-9.88,0.2511,1.4695,-9.88,2.3227,11.887,7.0676,188
-2.1856,-10.051,0.1571,2.9524,-10.051,2.2735,13.3601,7.2443,189
-8.93,-9.737,7.6472,14.0025,-9.737,5.4578,26.6527,15.7116,190
-1.1011,-10.1797,2.0898,2.9072,-10.1797,3.4617,15.7938,7.1919,191
-7.8921,-9.8581,-1.2483,4.8008,-9.8581,1.9262,14.4845,8.3056,192
-3.2699,-9.8497,2.068,2.7111,-9.8497,4.4478,21.0102,11.3138,193
-4.6773,-9.891,0.8003,4.1653,-9.891,4.3337,17.9604,7.6863,195
-12.3273,-9.6307,-1.2285,5.135,-9.6307,3.4421,15.4546,10.3629,196
-4.798,-9.9223,0.7906,3.5923,-9.9223,2.255,9.8287,8.8997,197
-4.1389,-9.9575,-1.201,2.0974,-9.9575,0.75,11.4857,6.0553,198
-6.1621,-10.0575,1.2762,4.9365,-10.0575,3.2481,14.2467,8.8542,199
-2.7284,-9.8957,2.0992,4.5939,-9.8957,4.3922,12.7678,10.2186,200
-1.7708,-10.2223,3.2309,4.7514,-10.2223,6.8894,17.5632,13.0001,201
0.4206,-9.7017,6.8004,6.4283,-9.7017,5.3122,15.9381,13.0556,202
-0.0976,-9.8124,3.4097,3.7473,-9.8124,3.9434,14.6761,8.678,203
-4.0031,-9.9264,-0.2766,2.1617,-9.9264,3.1478,9.6514,6.7449,204
-0.9844,-9.6218,6.8089,7.2695,-9.6218,5.0711,21.7524,10.4213,206
-3.7373,-9.8339,2.9421,4.755,-9.8339,1.9103,13.342,9.0068,207
-3.8845,-9.504,0.0517,1.7827,-9.504,1.4311,18.6813,5.7522,208
-2.9408,-9.8424,2.108,3.4466,-9.8424,4.5175,16.3125,8.2992,209
-1.9345,-9.7176,-0.1957,1.0321,-9.7176,3.1198,9.2997,8.0101,210
-1.1921,-10.1766,-0.1966,0.604,-10.1766,1.1972,6.3004,5.0318,211
-7.3573,-10.0171,-1.4628,3.0511,-10.0171,3.4997,13.0488,8.7235,212
-1.2794,-9.871,0.3894,1.4783,-9.871,3.5645,12.6097,8.9394,213
-1.0478,-10.0879,0.0721,1.0958,-10.0879,2.6572,11.2982,7.4508,214
-1.778,-9.7506,0.342,1.4314,-9.7506,3.0062,11.5229,6.9749,215
-0.473,-9.6572,1.0314,1.1867,-9.6572,0.6174,9.7338,6.8397,216
-0.2446,-9.744,-0.0251,0.0959,-9.744,0.3648,7.1954,4.5674,217
-0.1664,-9.9535,-0.0162,0.0722,-9.9535,0.3096,4.6914,4.2591,218
-0.7439,-10.0016,0.2476,0.4957,-10.0016,0.7609,6.4169,4.7106,219
-0.4384,-9.6792,0.1455,0.3284,-9.6792,1.4816,7.5523,4.1078,220
-0.4187,-9.7695,0.1227,0.5887,-9.7695,0.995,11.8835,5.8226,221
-0.1781,-10.1632,0.5892,0.6431,-10.1632,0.9619,6.064,4.8801,222
-0.8098,-9.5456,0.4023,0.7186,-9.5456,1.7776,19.2417,5.8831,223
-0.5845,-9.9686,0.5025,1.3391,-9.9686,1.8504,12.11,5.9265,224
-0.1864,-9.8662,2.7803,3.2345,-9.8662,3.628,10.3995,7.4,225
-0.3267,-9.7257,0.7895,1.1578,-9.7257,0.7079,7.8706,5.9165,226
-1.5336,-9.8712,0.1189,0.9857,-9.8712,0.524,6.625,4.9402,227
-15.4468,-9.8741,-0.8476,3.9212,-9.8741,8.9134,69.8996,5.0282,228
-0.2067,-9.9136,0.2446,0.6198,-9.9136,1.3167,6.9237,5.0835,231
-0.934,-9.9946,0.0721,0.6645,-9.9946,2.0248,8.8679,5.1458,232
-5.4155,-9.9506,1.9727,3.8556,-9.9506,0.9272,12.7248,7.7542,233
-0.6722,-9.9485,0.277,0.6985,-9.9485,1.9755,9.367,9.1487,234
-4.4641,-10.0555,-0.0952,3.3709,-10.0555,1.3315,8.5865,5.0337,235
-8.8968,-9.9471,-0.8882,4.5006,-9.9471,2.1745,10.2932,9.4889,236
-2.0346,-9.86,1.2231,1.3018,-9.86,1.5218,5.9307,4.6463,237
-1.4505,-9.8742,-0.2153,0.6613,-9.8742,2.3469,5.8141,4.2269,238
-0.1399,-9.8732,0.0042,0.0987,-9.8732,0.2467,4.026,3.8966,239
-0.5279,-9.8666,-0.3054,0.1464,-9.8666,0.3208,4.22,3.9874,240
-0.1711,-9.8697,-0.1247,0.0377,-9.8697,0.077,3.9819,3.942,241
-1.9724,-9.8647,-0.7865,0.6899,-9.8647,1.5345,6.3988,4.799,242
-0.8304,-9.8451,0.0731,0.4285,-9.8451,0.4777,4.2074,4.128,243
0.0,-9.807,1.0448,0.7377,-9.807,0.5009,7.9058,7.804,244
-2.1632,-9.7747,0.3072,2.1158,-9.7747,2.658,23.2717,9.3523,245
-3.5659,-9.8826,3.5937,6.7129,-9.8826,4.1404,17.1154,10.0769,246
-4.7681,-9.7944,-1.079,2.4565,-9.7944,1.7889,13.4944,10.2358,247
-24.2083,-9.9336,-4.7063,11.277,-9.9336,6.6197,26.4182,14.697,248
-1.0699,-10.3769,1.3393,2.2869,-10.3769,5.1461,52.3547,46.2222,249
-11.5462,-9.9924,-0.4416,5.5661,-9.9924,5.3732,35.6306,21.5249,250
2.3804,-10.3803,9.9222,4.1357,-10.3803,3.5507,45.6457,23.2042,251
-13.3288,-10.1119,-1.4835,9.6287,-10.1119,4.4066,24.4292,18.8343,252
-25.292,-9.957,-5.1781,13.2154,-9.957,4.0263,23.5102,16.2438,253
-11.9977,-9.5535,-3.757,6.2151,-9.5535,5.478,17.9761,9.7341,254
-12.0144,-10.1283,-4.1567,5.0276,-10.1283,3.7083,18.5646,15.9326,255
-14.6357,-9.6447,2.4676,9.8528,-9.6447,5.8587,24.1257,11.2708,257
-16.4057,-10.2505,1.2363,11.2167,-10.2505,7.5975,30.6986,24.1664,258
-15.8555,-9.7645,-3.2551,6.0987,-9.7645,6.6061,18.2638,10.0092,259
-17.3851,-9.5388,-3.8127,9.4343,-9.5388,4.5421,23.5038,11.3574,260
-18.131,-9.8651,-2.5181,5.0428,-9.8651,5.9657,18.1161,11.6641,261
-11.4927,-9.8061,-2.7949,3.4813,-9.8061,4.3587,17.2035,8.0636,262
-23.9004,-9.9006,-1.8573,13.4866,-9.9006,2.203,20.0582,13.3956,263
-9.4618,-9.8206,-0.4866,4.2746,-9.8206,5.4773,24.9793,16.44,264
-20.2407,-10.0834,-3.5552,7.8611,-10.0834,3.3106,20.5183,15.2143,265
-1.9557,-10.0163,0.9347,3.1186,-10.0163,6.8881,20.9314,12.6669,266
-17.8031,-9.704,-4.0516,6.6562,-9.704,6.0648,17.0137,10.4722,267
-14.1176,-9.5288,-6.6785,5.0116,-9.5288,8.415,18.3612,12.26,268
-13.9428,-9.8122,-2.2375,5.3647,-9.8122,3.4576,15.5714,9.1926,269
-9.5964,-9.711,-0.7527,6.6057,-9.711,4.0566,17.2944,14.6396,270
-4.1257,-9.9289,0.8185,3.1084,-9.9289,3.9761,9.4419,6.5597,271
-19.6562,-10.0015,-3.3453,6.7887,-10.0015,5.6406,22.4063,13.5756,272
-24.7964,-9.2248,-7.1091,9.0401,-9.2248,7.0371,22.4552,13.8683,273
-21.6013,-9.0498,-0.2592,10.2061,-9.0498,6.07,20.8695,12.9731,274
-18.2958,-8.987,-4.107,7.8678,-8.987,4.9229,24.8894,14.9909,275
-18.1555,-9.6661,-1.5651,5.3577,-9.6661,3.9402,21.9248,8.209,276
-2.6414,-10.205,-0.3597,1.4307,-10.205,1.2961,10.1564,5.9856,277
-2.027,-9.9773,1.4246,2.9096,-9.9773,4.0302,17.4082,9.5073,279
-4.5741,-9.8481,-0.4571,2.6743,-9.8481,2.6661,16.283,7.286,280
-7.0108,-9.5799,-1.5681,2.9933,-9.5799,4.0697,13.2775,10.5005,281
-11.3281,-9.992,-1.2567,4.8397,-9.992,8.8369,24.1364,13.795,283
-3.9197,-9.7106,2.9401,5.0301,-9.7106,7.1069,14.5856,12.9449,284
-3.8624,-10.0893,-0.2372,2.1546,-10.0893,4.5159,14.5996,8.9669,285
-6.873,-10.1861,-2.4422,2.2879,-10.1861,1.894,9.7297,5.2054,286
-4.9012,-9.6401,-0.9501,1.4862,-9.6401,4.7975,13.8771,8.588,287
-2.2348,-8.5384,-0.2452,1.1463,-8.5384,1.5499,20.1699,9.8645,288
-6.5309,-9.85,1.2015,3.9195,-9.85,6.957,21.9929,10.3686,289
-5.3368,-9.894,-0.377,2.6033,-9.894,4.5039,18.7362,8.7422,291
-1.8647,-9.9025,1.0987,1.5407,-9.9025,3.21,10.213,6.9198,292
-1.7176,-9.8499,0.4675,0.9197,-9.8499,2.1974,8.3028,5.5518,293
-0.1741,-9.8828,0.3146,0.47,-9.8828,1.3634,7.1826,4.9407,294
-0.8162,-9.8947,0.0671,0.3728,-9.8947,1.3854,8.8225,5.3619,295
-1.4921,-9.8909,0.6108,1.2793,-9.8909,2.1583,14.1913,10.7411,296
-1.5528,-9.8687,2.0834,2.5833,-9.8687,3.5847,14.1838,10.1663,298
-20.7171,-9.8741,2.2474,8.1516,-9.8741,7.8727,40.2576,17.1857,299
-43.4791,-9.8403,1.8116,15.6646,-9.8403,9.2905,31.6885,14.2661,300
-32.0308,-9.8593,-1.7177,12.8251,-9.8593,8.3796,33.4537,16.6965,301
-9.0821,-9.8176,-1.1661,4.5217,-9.8176,7.7242,19.9081,12.3397,302
-6.5192,-9.8558,-1.7066,3.0175,-9.8558,5.656,13.3764,9.3684,304
-12.2623,-9.8823,-1.412,3.6036,-9.8823,4.6007,17.6221,7.2112,305
-19.4872,-9.9915,0.0251,11.0212,-9.9915,5.9482,26.8977,16.0607,306
-14.3909,-9.8609,-5.0144,4.6896,-9.8609,7.4613,20.0528,11.6008,307
-13.2111,-9.9675,-4.911,6.0113,-9.9675,4.2709,21.9338,17.9098,308
-7.5304,-9.9085,-1.4948,3.095,-9.9085,4.8045,16.4287,10.2353,309
-7.3585,-9.8343,-2.496,3.2277,-9.8343,6.9837,14.4277,11.7573,310
-4.6834,-9.9428,-0.8775,2.4695,-9.9428,4.8552,13.7916,10.5985,311
-9.8534,-9.9115,-2.4709,3.4485,-9.9115,6.6101,16.2534,10.2939,312
-4.7745,-9.9649,-2.1292,1.6543,-9.9649,3.2554,9.9511,6.2519,313
-0.6054,-10.0376,-0.2784,0.2116,-10.0376,2.4252,11.8725,8.5287,314
-9.8949,-9.7576,-1.5996,3.5827,-9.7576,8.0398,20.5671,12.6318,315
-4.957,-9.8298,-0.7672,2.3048,-9.8298,4.4965,14.2254,9.9777,316
-12.9841,-9.914,-2.844,5.0195,-9.914,2.3247,11.4785,8.0276,317
-3.2214,-9.9983,-0.8192,2.4541,-9.9983,5.9779,13.8067,9.2956,318
-3.4408,-9.4231,-1.0909,1.3138,-9.4231,4.3711,15.3603,10.3927,319
-7.4792,-10.0056,0.6148,4.068,-10.0056,5.1469,11.5511,8.8668,320
-8.577,-9.9606,-1.6293,2.8932,-9.9606,5.7196,14.0412,10.3063,321
-5.0164,-10.0628,-1.4687,2.0416,-10.0628,3.5543,14.0877,8.3605,322
-6.0263,-9.5425,-0.585,2.8684,-9.5425,2.8279,14.3199,10.0534,324
-7.1753,-9.7151,-1.0607,2.3395,-9.7151,4.2026,18.6763,8.5014,325
-4.9034,-10.2862,-1.0666,1.9004,-10.2862,2.9526,16.9453,14.1809,326
-1.9027,-10.1243,0.099,1.701,-10.1243,5.1544,14.2749,10.8052,327
-2.2228,-10.0366,0.0513,1.5252,-10.0366,2.0124,10.361,5.9365,328
-6.1055,-9.5891,-0.6274,3.0531,-9.5891,4.3911,13.3135,8.5374,329
-8.4818,-9.8811,-1.728,3.6456,-9.8811,4.5645,15.9203,7.5849,330
-6.1917,-9.9419,-1.134,2.3966,-9.9419,5.5012,12.2468,9.2139,331
-3.5329,-9.4567,1.1903,3.6559,-9.4567,5.0644,15.5002,10.765,332
-9.6872,-9.8188,0.1983,4.0984,-9.8188,6.2946,16.0212,9.4008,334
-7.313,-9.788,-1.0511,2.5286,-9.788,4.6309,14.9934,7.0768,335
-11.81,-9.9353,-1.129,4.0293,-9.9353,7.2989,17.9209,12.6746,336
-4.1289,-9.9215,0.0738,2.1674,-9.9215,4.9087,15.2327,9.1882,337
-5.7508,-9.9014,-1.5749,2.8018,-9.9014,2.0386,10.8878,8.4385,338
-5.1335,-9.8263,0.5241,4.0147,-9.8263,4.8492,14.4844,10.4393,339
-12.4308,-9.8228,-2.1344,3.6737,-9.8228,6.1535,18.4716,9.443,340
-8.5275,-10.1408,-3.3453,2.9019,-10.1408,6.0586,18.6388,11.1703,341
-10.0912,-9.9469,-2.2947,3.8257,-9.9469,5.2939,12.8284,8.5148,342
-12.0677,-9.8462,-0.3189,4.8458,-9.8462,5.6143,20.042,11.1631,344
-6.5438,-9.9232,-1.375,3.2258,-9.9232,5.2486,16.3051,10.4142,345
-10.913,-9.8243,-0.5031,4.1731,-9.8243,6.2365,20.7198,8.2485,346
-2.1525,-10.1465,0.1904,2.3909,-10.1465,2.9844,13.8495,9.6936,347
-4.3916,-10.128,0.4686,3.7196,-10.128,3.8336,24.2079,11.1758,348
-6.9047,-9.6908,-1.1221,2.4588,-9.6908,3.5627,12.7787,8.4287,349
-10.1872,-10.0105,-0.4164,4.193,-10.0105,4.1279,13.2625,8.338,350
-7.6086,-9.8476,-1.2339,2.9119,-9.8476,4.5148,12.0601,6.7797,351
-9.53,-9.783,-2.1098,3.749,-9.783,6.334,19.3015,11.731,352
-5.4322,-9.9835,-1.5434,1.7622,-9.9835,4.4361,11.5632,9.4891,354
-6.8848,-9.8091,0.3723,5.6509,-9.8091,8.3977,30.2843,15.0182,355
-13.1718,-9.8747,-2.6328,4.6328,-9.8747,8.5937,22.8524,14.3174,356
-17.6719,-9.5408,-0.5773,6.6611,-9.5408,7.1229,22.2024,9.826,358
-11.6,-9.6337,-0.5523,3.7861,-9.6337,5.2175,17.2696,8.2893,359
-9.3678,-9.1023,0.4125,3.7805,-9.1023,3.0892,17.3722,9.7101,360
-6.7359,-9.1421,-0.4015,3.7529,-9.1421,4.6351,19.768,9.6936,361
-9.9087,-8.8548,-0.7467,3.3532,-8.8548,3.8734,20.4637,11.1866,362
-18.9937,-7.8783,2.6175,11.1491,-7.8783,8.5861,23.271,15.505,363
-4.7381,-9.6272,4.8943,8.7218,-9.6272,6.1922,20.8786,13.2423,364
-4.7285,-9.5389,1.9971,4.6289,-9.5389,3.2114,15.0183,8.3183,365
-0.9508,-9.391,1.179,1.9349,-9.391,3.1478,8.6907,7.3307,366
-0.1436,-9.6857,2.5364,2.5068,-9.6857,3.3254,20.9381,10.6079,367
-1.7731,-7.5744,0.0932,1.1057,-7.5744,2.3349,19.5839,8.732,368
-11.6049,-8.0531,-1.8089,4.914,-8.0531,2.8683,16.807,9.7492,369
-9.396,-10.3043,-4.2216,4.8947,-10.3043,3.122,20.3057,14.9915,370
-15.1039,-9.4873,4.8301,8.4169,-9.4873,5.5513,22.9637,16.0346,371
-8.3865,-7.9848,26.6131,33.1611,-7.9848,8.7427,40.8371,25.9567,372
-23.0803,-9.125,-0.359,8.5688,-9.125,6.1511,17.3126,14.8104,374
-9.7412,-9.9529,-1.6658,3.7501,-9.9529,7.0602,21.2856,11.7875,375
-0.4754,-9.6013,0.1064,0.3181,-9.6013,1.6791,6.0509,3.9734,378
-1.3446,-9.6506,3.3226,3.8947,-9.6506,3.0887,10.5223,8.873,379
-4.5198,-10.3323,-1.2879,1.4572,-10.3323,1.3985,10.366,9.4276,380
-3.6226,-9.7971,0.0453,2.0205,-9.7971,4.3541,21.0333,13.4888,381
-10.2858,-9.9012,-1.3724,3.845,-9.9012,5.7593,14.6881,7.3059,382
-7.7058,-9.7473,-0.3415,3.4141,-9.7473,2.5206,14.7655,9.9948,384
-11.7254,-9.8729,0.3737,4.3497,-9.8729,6.2415,18.7492,10.3833,385
-0.7673,-10.1244,0.4338,0.9215,-10.1244,2.4323,14.7978,6.4131,386
-1.2538,-9.7085,0.2284,1.3953,-9.7085,1.3732,5.9507,4.8744,387
-5.7026,-9.8578,-1.4711,2.2213,-9.8578,1.3565,9.5467,6.7981,388
-1.6618,-9.6219,1.8958,2.6708,-9.6219,6.6,19.1161,12.1844,389
-1.4577,-10.0739,-0.2955,0.6702,-10.0739,1.4487,8.8576,6.5427,390
-9.7392,-5.7035,-0.8553,4.8219,-5.7035,4.2683,38.4713,16.5625,391
-25.9075,-9.8076,-5.3406,9.5941,-9.8076,6.7746,18.2599,13.2189,392
-0.4141,-9.8259,1.6884,1.5047,-9.8259,3.0443,11.1362,8.9751,394
-0.661,-9.8967,1.0606,1.2395,-9.8967,1.9773,12.9015,6.3881,395
-1.9021,-10.0662,0.228,1.2613,-10.0662,0.582,8.2945,5.3894,396
-4.087,-9.8832,0.7257,2.4436,-9.8832,2.0576,10.3548,8.308,397
-0.7994,-10.0722,0.8158,1.2124,-10.0722,3.0393,13.2594,8.7288,398
-4.4132,-9.8423,0.271,2.672,-9.8423,1.1109,15.862,7.7199,399
-0.7071,-10.1599,0.2172,0.5604,-10.1599,1.2985,11.2758,5.9282,400
-1.4018,-9.9276,1.7469,2.6644,-9.9276,3.299,12.2744,7.4207,401
-3.287,-9.9831,0.0114,1.3124,-9.9831,1.8353,8.8895,6.3737,402
-0.2673,-9.7468,0.1676,0.6645,-9.7468,1.5757,8.2225,3.5781,403
-1.0829,-9.7788,-0.4109,0.3532,-9.7788,0.5869,9.8158,6.6271,404
-0.5948,-9.7637,0.1966,0.3997,-9.7637,1.6852,9.1763,4.6108,405
-1.0887,-9.8662,1.127,1.446,-9.8662,2.0948,10.7334,6.3872,406
0.0469,-9.6369,0.2576,0.2097,-9.6369,0.4209,7.494,2.7474,407
-3.933,-9.6845,0.7297,2.9678,-9.6845,2.4203,10.2283,9.4194,408
-3.9847,-9.7586,5.4607,11.637,-9.7586,6.636,21.7553,13.3555,409
-9.5659,-10.0426,-2.3782,3.3877,-10.0426,1.37,13.2163,8.7319,410
-7.1439,-9.7941,-0.8406,2.6166,-9.7941,3.5621,12.6852,5.9559,411
-3.2579,-9.956,4.0532,6.3044,-9.956,1.9511,16.1373,15.4241,412
-1.5234,-9.8526,-0.2052,0.7352,-9.8526,2.78,9.5921,7.1681,414
-2.0194,-9.8635,0.3344,1.1257,-9.8635,2.1317,11.6233,5.88,415
-1.5743,-9.6118,-0.051,1.5934,-9.6118,1.0661,9.8144,7.4649,416
-0.9549,-9.9207,1.4324,3.0854,-9.9207,3.6185,12.7232,9.7368,417
-6.3849,-10.0171,-1.0926,3.1503,-10.0171,5.313,13.4021,7.8451,418
-2.6153,-10.0133,0.3458,2.1344,-10.0133,4.1475,12.6081,10.236,419
-4.9874,-9.4272,0.4605,2.6099,-9.4272,3.3243,11.9544,9.7534,420
-12.3906,-9.9722,0.9927,6.0035,-9.9722,3.9454,18.9879,8.9951,421
-2.9297,-8.7579,1.0848,2.4659,-8.7579,2.3017,22.0666,14.6089,422
-4.4321,-10.1996,1.4924,3.1292,-10.1996,4.1738,17.9998,12.0423,424
-12.0596,-9.8753,-0.6568,6.7951,-9.8753,7.8906,22.3419,11.5134,425
-3.4802,-9.3807,-0.5918,2.0749,-9.3807,2.8059,12.626,6.7369,426
-12.8462,-10.0858,-3.9449,6.1927,-10.0858,4.2287,14.8139,6.6682,427
-9.914,-9.4544,6.6714,8.9772,-9.4544,4.2738,28.3572,16.3137,428
-16.4501,-9.6897,-2.829,5.0571,-9.6897,4.1145,16.7967,7.5583,429
-1.5733,-9.9245,3.8053,5.5286,-9.9245,5.6432,12.843,9.1882,430
-0.7897,-10.1265,1.638,1.8115,-10.1265,5.5527,19.8043,13.347,431
-4.5609,-9.9854,1.5366,2.8377,-9.9854,3.6728,14.075,7.7143,432
-3.5889,-9.8034,-0.068,1.8032,-9.8034,3.0604,13.5826,6.7036,434
-9.4883,-10.0019,2.7672,5.6373,-10.0019,5.8208,20.5233,11.9251,435
-5.4017,-10.1414,2.3574,5.8773,-10.1414,4.1314,15.3526,9.7161,436
-4.5854,-10.2875,0.1309,3.5609,-10.2875,3.1689,12.9184,8.6372,437
-2.4593,-10.0165,0.0048,1.3511,-10.0165,1.8677,7.6362,5.7462,438
-3.0921,-9.9365,0.7459,3.0475,-9.9365,3.6164,17.029,9.1852,439
-1.1329,-10.0037,2.4081,3.0017,-10.0037,3.2407,15.2568,10.598,440
-6.6295,-9.697,1.4155,4.2143,-9.697,2.5306,13.2042,10.4807,441
-5.5549,-9.9849,-0.8957,2.3198,-9.9849,2.4598,11.2285,7.0346,442
-6.8587,-10.0221,-1.1073,2.7627,-10.0221,4.8777,14.9411,8.4801,443
-10.9432,-9.6971,-1.8026,4.5484,-9.6971,6.848,17.4897,8.7124,445
-10.2212,-9.9698,-0.8961,4.8045,-9.9698,4.1344,14.7337,11.1605,446
-7.2962,-10.0878,-3.4174,3.2438,-10.0878,4.8846,10.2889,6.7347,447
-8.1668,-9.8637,-2.2873,4.2056,-9.8637,2.1203,10.4513,9.1468,448
-3.2988,-10.0345,1.7265,2.5913,-10.0345,1.5319,17.7149,13.1386,449
-5.7699,-10.0328,-0.8198,3.398,-10.0328,2.4848,10.8834,6.4896,450
-6.9614,-10.249,0.984,7.1794,-10.249,3.9604,14.0598,10.1277,451
-7.5367,-10.3159,7.4361,16.2425,-10.3159,5.5976,56.4371,40.8009,452
-6.8285,-9.5151,-0.7859,3.718,-9.5151,3.6788,35.0239,25.7077,453
-39.607,-10.2142,5.084,20.1081,-10.2142,8.7276,51.2114,25.9448,454
-5.6474,-9.7403,0.6803,2.848,-9.7403,4.0138,24.8914,8.3737,455
-0.1271,-9.9243,0.5663,0.568,-9.9243,1.2404,10.3971,7.8496,456
-4.0071,-9.7697,-0.0762,1.6612,-9.7697,1.9747,6.0145,4.8811,457
-0.5698,-9.6681,-0.1264,0.2162,-9.6681,0.5238,6.1156,3.9311,458
-1.0412,-9.8433,-0.1238,0.5565,-9.8433,0.5215,6.3472,5.0017,459
-0.9193,-9.8673,0.7198,0.9849,-9.8673,1.1147,10.8039,6.2734,460
-3.4438,-9.3056,3.8846,3.9573,-9.3056,6.5816,13.9435,11.0416,461
-24.6748,-9.6593,-3.8936,9.2938,-9.6593,4.6935,17.6744,9.4783,462
-7.4194,-9.7956,-0.5398,4.0372,-9.7956,4.4472,18.9975,7.9262,465
-12.9803,-10.3323,-0.8449,5.6392,-10.3323,4.6431,19.0204,14.8483,466
-7.4854,-9.5782,6.4507,10.0763,-9.5782,4.3428,16.7329,14.1276,467
0.6783,-9.8531,4.7453,3.7192,-9.8531,1.2792,29.0753,17.5827,468
-7.2405,-9.2773,-3.4501,3.2735,-9.2773,3.2281,28.2125,19.8342,469
-6.7598,-9.6725,1.8358,5.0904,-9.6725,5.254,21.7636,11.793,470
-5.5906,-9.8135,3.0235,8.0263,-9.8135,6.2772,20.1546,12.6917,471
-8.9636,-9.3257,0.5112,5.3868,-9.3257,3.1619,17.0242,13.017,472
-13.5504,-9.7592,-0.95,5.1355,-9.7592,5.906,18.8905,6.894,473
-8.9519,-9.8279,0.4128,4.7474,-9.8279,6.0622,25.5351,14.1097,475
-8.29,-10.0606,-1.6841,3.2024,-10.0606,4.8434,25.3025,16.3823,476
-3.9171,-9.4229,1.9109,4.4352,-9.4229,3.1446,34.2439,24.5667,477
-8.5992,-8.7355,0.7613,4.2468,-8.7355,2.3398,23.2297,16.617,478
-4.6186,-8.3362,3.429,6.6761,-8.3362,7.4452,44.5648,28.783,479
-12.5288,-10.1132,-1.0208,5.1041,-10.1132,2.9825,35.0257,27.7838,480
-10.6354,-9.9282,-0.3509,6.546,-9.9282,2.2248,28.5029,24.2177,481
-10.6275,-9.2753,-0.6976,5.4164,-9.2753,4.8984,24.2602,11.7137,482
-8.5182,-8.6502,-1.054,3.5659,-8.6502,5.3354,27.1785,12.7474,484
-35.2452,-9.9334,-2.0606,13.3446,-9.9334,7.6555,25.1964,13.8363,485
-4.3169,-9.884,4.7079,10.5085,-9.884,4.8404,19.838,14.5566,486
-2.5205,-9.6314,1.738,2.464,-9.6314,2.1509,19.1146,8.0262,488
-2.1141,-9.9431,0.4436,1.3405,-9.9431,2.4641,22.3655,10.2875,489
-7.1641,-9.6251,1.4505,4.8687,-9.6251,3.1889,29.937,11.5355,490
-2.3897,-10.155,8.0089,8.2963,-10.155,5.1679,29.7102,17.0972,491
-4.1103,-9.8062,0.2043,2.5908,-9.8062,3.3224,15.9875,8.8579,492
-2.2724,-10.0357,0.5641,1.63,-10.0357,1.4177,21.2953,7.4963,493
-0.9684,-8.9287,3.7452,5.5487,-8.9287,4.6929,17.2634,9.5843,494
-6.9684,-10.2137,-0.7652,2.1129,-10.2137,3.6845,12.7136,7.4218,495
-15.0193,-9.8737,0.02,5.0925,-9.8737,5.4824,12.5447,8.8083,496
-1.6177,-9.838,0.0386,1.5231,-9.838,3.5203,9.0594,8.5077,497
-2.5557,-9.986,-0.66,1.3639,-9.986,3.9079,13.8744,7.439,498
-0.4702,-10.0816,0.2552,0.5698,-10.0816,2.4484,9.0171,6.5171,499
-4.7717,-9.9549,0.9121,3.4811,-9.9549,4.2666,17.6622,10.3261,500
-0.8766,-9.9794,-0.0932,0.6464,-9.9794,2.2642,10.1159,7.6433,501
-7.9381,-9.9476,1.5548,5.2193,-9.9476,5.5897,24.4895,9.1955,502
-4.6462,-9.9315,0.7766,2.7676,-9.9315,3.7853,15.8682,8.1071,504
-7.2726,-9.9951,0.3742,1.7941,-9.9951,2.2583,22.9785,5.5679,505
-0.398,-9.6841,0.139,0.4464,-9.6841,1.5009,11.1368,5.6651,506
-1.0242,-10.2334,-0.1896,0.4003,-10.2334,0.6557,9.8506,4.1218,507
-0.1528,-9.783,1.1408,1.0432,-9.783,1.0208,7.6687,6.6092,508
-0.3992,-10.1094,0.0958,0.5381,-10.1094,0.9526,7.9492,5.4859,509
-0.0093,-9.9631,0.5289,0.5579,-9.9631,1.21,7.6466,5.6814,510
-0.3392,-9.8869,0.6238,0.6441,-9.8869,0.4293,7.8969,4.9187,511
-0.1797,-9.8521,0.1645,0.3066,-9.8521,0.7345,7.8271,4.5056,512
-0.2857,-9.8303,0.0157,0.188,-9.8303,0.3594,5.9653,3.934,514
-2.3292,-9.8809,0.2765,1.0674,-9.8809,2.3775,13.9,5.5013,515
-5.1579,-10.1621,-0.5119,2.025,-10.1621,2.1612,13.0935,8.2684,516
-0.4504,-9.7729,0.4766,0.5232,-9.7729,0.57,9.3404,6.9903,517
-2.1664,-10.1213,-0.0028,1.0739,-10.1213,0.886,12.473,11.6108,518
-0.1458,-9.9831,2.8663,2.3456,-9.9831,1.3335,31.7377,27.9004,519
-40.0907,-9.9003,-3.6707,11.4464,-9.9003,3.5051,21.3192,16.2171,520
-30.1741,-9.6783,-10.8905,10.1684,-9.6783,4.9607,17.4481,5.5723,521
-2.1573,-9.7114,3.1171,3.2291,-9.7114,1.8309,6.8434,4.442,523
0.0954,-9.7926,4.7835,3.1937,-9.7926,1.6335,10.3552,5.9354,524
-7.8439,-9.8438,-0.5028,2.1977,-9.8438,2.5243,7.3894,4.1871,525
0.2459,-9.8637,0.3058,0.0584,-9.8637,0.1345,4.0413,3.979,526
-0.2833,-9.8659,-0.2289,0.0384,-9.8659,0.0642,3.9732,3.9089,527
-0.3336,-9.8654,-0.1199,0.1269,-9.8654,0.3294,3.9849,3.8912,529
-2.2539,-9.8554,0.0594,0.7324,-9.8554,1.1365,7.2706,4.0295,530
-6.0944,-9.9134,1.8043,5.9441,-9.9134,4.0055,29.6794,13.5231,531
-7.339,-9.8634,1.9993,5.0369,-9.8634,4.3879,34.2795,29.2002,532
-4.9564,-10.3235,0.2975,5.0265,-10.3235,4.8453,17.19,16.0848,533
-5.8527,-9.4909,-2.8148,1.9161,-9.4909,1.0144,17.5174,12.5388,534
-10.4959,-10.1647,-1.3693,5.8886,-10.1647,1.7902,23.3683,15.438,535
-5.0603,-10.0111,-0.5563,1.9951,-10.0111,4.0168,10.4429,8.5371,536
-13.1034,-9.7891,-1.2885,3.3142,-9.7891,2.8241,10.8103,5.2493,537
-4.1088,-9.757,-0.3996,1.0568,-9.757,1.563,9.314,6.4867,538
-19.3195,-9.8925,-0.6131,4.847,-9.8925,6.1474,16.366,8.8429,540
-12.7826,-9.9748,0.099,4.2073,-9.9748,6.9024,19.9194,12.6547,541
-1.6322,-9.7049,-0.4154,0.916,-9.7049,1.3295,12.9191,8.1613,542
-3.1866,-9.852,-0.7139,1.2728,-9.852,3.9389,12.0149,7.2693,543
-4.5164,-9.6075,-0.1403,1.9032,-9.6075,2.0904,8.1127,5.3736,544
-6.1132,-9.9602,-1.2244,2.2159,-9.9602,3.8469,10.2389,6.6515,545
-5.6373,-9.8464,-0.8353,1.8984,-9.8464,3.6447,13.3119,6.112,546
-2.327,-10.0837,1.5078,2.831,-10.0837,3.7002,15.6657,9.4798,547
-7.2823,-9.927,-2.5151,3.9592,-9.927,2.7278,10.5703,8.1869,549
-6.7689,-9.8866,-0.1707,2.1769,-9.8866,4.5444,12.4036,8.8556,550
-0.6032,-9.8674,0.7934,1.5774,-9.8674,2.0044,11.19,6.0058,551
-8.2301,-10.0459,0.0653,5.5986,-10.0459,2.0585,15.5336,12.9299,552
-1.1704,-9.9951,0.2058,0.8975,-9.9951,2.9307,10.9397,8.8978,553
-0.1609,-9.9274,2.2321,1.8924,-9.9274,0.9467,9.3909,7.4898,554
-6.4899,-9.7147,-1.2195,2.4908,-9.7147,2.6348,7.0738,4.8537,555
-1.7971,-9.9206,0.7032,1.3678,-9.9206,2.6088,14.9246,7.3535,556
-1.1475,-10.1467,0.4689,1.385,-10.1467,1.6846,9.2264,5.2688,557
-1.9633,-9.7716,0.3235,0.8221,-9.7716,2.7557,8.1485,5.9738,559
-2.8452,-9.881,0.327,1.1972,-9.881,2.853,10.666,6.2494,560
-0.7773,-9.9492,0.9223,1.2408,-9.9492,2.9993,14.1324,5.5488,561
-7.261,-9.768,-1.4195,2.7767,-9.768,3.0641,8.7972,6.0913,562
-0.3021,-9.7148,0.0231,0.3123,-9.7148,1.3404,6.8503,5.5183,563
-8.575,-10.0517,-2.554,3.1976,-10.0517,2.4095,10.5926,7.2004,564
-0.1831,-9.7043,0.562,0.5165,-9.7043,1.8809,11.099,6.2183,565
-6.4621,-9.6508,-2.2045,3.5756,-9.6508,1.5026,11.1733,9.6365,566
-1.6941,-9.9147,0.3038,1.1421,-9.9147,2.6269,11.1555,8.3671,567
-5.1052,-10.0256,-0.5848,2.3423,-10.0256,3.0618,9.6522,7.7793,569
-6.366,-9.918,0.4341,2.4154,-9.918,3.987,15.7853,6.5502,570
-0.8416,-9.881,-0.2654,0.3718,-9.881,0.78,7.6059,5.5168,571
-1.7429,-9.8358,0.5996,1.5356,-9.8358,3.1315,8.7514,6.378,572
-3.7883,-10.063,-0.775,1.6226,-10.063,1.504,11.351,8.3186,573
-1.2264,-9.7234,0.1142,1.2888,-9.7234,2.7943,10.8804,8.5941,574
-1.7145,-9.9214,0.7058,1.3768,-9.9214,3.0528,9.1976,7.1156,575
-6.0076,-10.1794,-1.0495,2.4244,-10.1794,1.7915,13.2637,10.7575,576
-1.256,-9.874,-0.1602,0.5474,-9.874,1.315,7.7075,5.778,577
-3.5363,-9.8693,0.0363,2.0236,-9.8693,4.779,13.0745,8.0147,579
-8.2878,-9.8395,0.1129,3.9059,-9.8395,5.5766,13.0079,8.6167,580
-24.0036,-9.9392,0.4696,8.9997,-9.9392,8.6205,28.3544,11.7166,581
-3.0702,-9.871,-0.0087,1.5381,-9.871,1.1281,9.457,6.8764,582
-2.0491,-9.9246,0.1846,1.5605,-9.9246,3.3806,11.7758,7.1104,583
-7.514,-9.9218,-0.6329,3.2028,-9.9218,5.3151,12.3977,8.7107,584
-4.4411,-9.7921,-0.7802,1.8549,-9.7921,2.1693,7.9531,5.3476,585
-1.7195,-10.0691,-0.3184,0.8406,-10.0691,1.8632,8.4806,5.6765,586
-0.1428,-9.9197,0.7204,1.1825,-9.9197,1.7821,8.5626,6.1472,587
-2.757,-9.7752,-0.2921,1.1482,-9.7752,1.0879,8.1377,5.8933,589
-6.8728,-9.7731,-0.3734,2.4826,-9.7731,4.2359,14.3406,7.5293,590
-0.8488,-9.7968,0.0096,0.6526,-9.7968,2.5105,9.191,4.9692,591
-1.0731,-10.0033,0.2086,1.0711,-10.0033,1.1499,14.0673,5.3639,592
-5.2001,-10.0337,-1.1409,2.7244,-10.0337,3.2227,9.3207,7.532,593
-29.5555,-10.0622,-2.4496,16.7138,-10.0622,4.4038,19.4788,14.0154,594
-53.8607,-9.4958,0.576,33.4276,-9.4958,4.1607,39.1608,20.7795,595
-21.1167,-10.0061,0.5461,9.1746,-10.0061,4.9506,19.9586,13.8611,596
-4.5646,-10.5767,2.1842,9.1562,-10.5767,7.859,29.2842,20.0418,597
-11.5117,-9.6633,2.8403,9.8089,-9.6633,2.9531,32.3178,29.3647,599
-5.6204,-9.8838,-0.0211,1.8574,-9.8838,3.7596,18.0945,7.438,600
-1.7495,-9.8353,0.2719,1.1868,-9.8353,1.9451,10.0234,6.5932,601
-2.7504,-9.7301,0.6379,1.5224,-9.7301,2.0417,17.6711,5.6991,602
-1.4121,-9.7648,2.091,3.2452,-9.7648,3.2627,13.1983,9.5738,603
-2.1223,-9.6103,8.0626,6.3083,-9.6103,1.8625,15.7468,13.62,604
-16.039,-10.1482,16.4003,19.1931,-10.1482,3.0082,27.4054,21.0663,605
-1.1258,-10.0985,0.9564,2.2532,-10.0985,2.2714,36.9065,27.4987,606
-7.0408,-9.9377,2.884,7.2041,-9.9377,3.0334,38.271,31.8911,607
-2.3376,-9.8735,1.9245,3.1299,-9.8735,3.278,17.6935,8.9095,609
-9.9372,-9.8003,0.5981,5.1498,-9.8003,7.7262,27.1475,8.2879,610
-9.6751,-7.9515,-2.5099,3.4201,-7.9515,3.6699,19.1907,10.2797,611
-0.063,-9.2781,0.6532,0.5815,-9.2781,1.35,11.217,5.4819,612
-1.3196,-10.0629,0.863,2.2163,-10.0629,1.3977,14.7422,6.5859,613
-1.1833,-9.6273,3.3122,5.0845,-9.6273,3.4459,20.6163,17.5988,614
-8.5053,-10.1665,1.3057,4.5585,-10.1665,2.2171,61.4847,52.6484,615
-3.0488,-9.6483,-1.0987,0.9991,-9.6483,3.3208,14.1969,6.2034,616
-4.0673,-9.8881,-0.3342,1.6871,-9.8881,1.4741,9.7033,7.059,617
-28.188,-9.8944,3.7972,16.852,-9.8944,2.792,28.014,19.1666,619
-128.1933,-9.4892,-7.9788,52.9995,-9.4892,19.8806,40.126,14.6777,620
-1.0239,-9.841,1.3545,2.106,-9.841,2.2432,12.597,7.3877,621
-12.3382,-9.9547,14.0091,40.9719,-9.9547,4.2712,28.2729,8.4258,622
-6.0481,-9.8423,-0.6183,3.1624,-9.8423,3.6122,10.5945,6.6487,623
-19.2516,-9.8526,-5.9373,8.0863,-9.8526,3.922,12.8022,8.6813,624
-14.6852,-10.0718,-2.6131,5.3769,-10.0718,3.3059,8.6736,5.3114,625
-1.2069,-9.9145,1.5007,1.485,-9.9145,2.0682,14.6396,10.9983,626
-0.0345,-9.8823,0.9343,1.3248,-9.8823,1.2153,6.7955,4.1528,627
-0.1643,-9.8658,0.2739,0.239,-9.8658,0.5703,4.1283,3.9797,628
