AYGX_min,AZ_mean,AYGX_mean,AYGX_std,AZ_mean,GX_std,Gnorm_max,Gnorm_median,timestamp
-0.0998,-9.9301,-0.0471,0.0247,-9.9301,0.0963,2.9776,2.8373,0
-0.0901,-9.9291,-0.0475,0.0197,-9.9291,0.0564,2.9194,2.8405,1
-5.2863,-9.9286,0.1199,2.0104,-9.9286,2.8419,9.681,3.0881,2
-16.0666,-9.8894,-5.1211,5.7987,-9.8894,4.182,11.1214,7.3352,4
-3.9842,-9.9196,1.0665,5.2966,-9.9196,6.5498,32.3629,5.3773,5
-2.4171,-9.922,-0.0042,1.4297,-9.922,3.7365,6.3865,5.2656,7
-6.8289,-9.914,0.2418,2.2214,-9.914,4.5973,9.4908,4.6874,8
-6.5339,-9.922,-1.6615,2.0135,-9.922,3.177,9.4262,3.17,9
-1.8279,-9.9165,-0.9211,0.5922,-9.9165,0.9314,4.0025,3.2098,10
-0.9956,-9.9134,-0.3526,0.3307,-9.9134,0.4807,3.1604,2.796,11
-0.6787,-9.9159,-0.1136,0.5307,-9.9159,0.9125,3.3519,2.8827,12
-1.4828,-9.9142,-1.0162,0.4429,-9.9142,0.9688,4.6157,3.6927,13
-0.9944,-9.9018,0.1244,0.5469,-9.9018,0.742,3.0954,2.8323,14
-6.63,-9.9206,-1.2079,1.7049,-9.9206,1.8022,4.7374,3.91,29
-11.8939,-9.9761,-1.2765,7.7431,-9.9761,6.6121,55.8653,8.6081,30
-136.6864,-9.8511,-1.9542,36.2066,-9.8511,12.2322,79.7446,20.2821,31
-90.7106,-9.7945,-9.7023,30.5231,-9.7945,12.0194,28.3705,19.5901,32
-18.6452,-9.9921,-0.0247,9.387,-9.9921,6.2033,44.256,33.229,33
-19.282,-9.8997,-0.5396,7.1576,-9.8997,6.4904,38.6772,19.5342,34
-5.7107,-9.9374,1.9148,4.8336,-9.9374,5.1098,31.0595,18.7021,35
-2.4049,-9.9435,-0.1322,0.9002,-9.9435,3.0571,9.1491,4.5245,36
-17.7292,-9.8749,-0.8826,7.6375,-9.8749,6.2807,11.7788,5.6157,37
-2.685,-9.8811,-2.5531,0.1867,-9.8811,0.0986,4.7562,4.6766,38
-3.8166,-9.8563,-2.5084,0.7274,-9.8563,0.7636,4.8343,3.7425,39
-0.8834,-9.8277,1.1644,1.519,-9.8277,1.0993,3.7092,2.9962,40
4.3691,-9.8501,4.8389,0.2454,-9.8501,0.4266,5.2171,4.8011,41
0.6774,-9.8857,0.7897,0.0771,-9.8857,0.1017,2.8737,2.8367,42
0.1595,-9.8859,0.4099,0.1375,-9.8859,0.1711,2.829,2.8016,44
-0.1257,-9.8882,0.267,0.332,-9.8882,0.3704,2.8797,2.6016,45
-6.0759,-9.8296,-2.1818,3.6089,-9.8296,2.3641,6.7407,4.1008,46
-9.0093,-9.9352,0.4684,4.1205,-9.9352,2.4609,25.2563,18.3565,48
-8.9756,-9.8551,-0.6332,2.7418,-9.8551,2.0283,19.4221,8.3431,49
-4.1614,-9.9734,-0.2022,1.9621,-9.9734,1.7939,33.6001,19.6501,50
-15.6805,-9.9997,-0.193,6.7742,-9.9997,4.4637,73.2858,44.2696,51
-68.5865,-9.9069,-7.0944,19.3097,-9.9069,8.7052,69.305,52.819,53
-58.6083,-9.8219,-7.2202,23.1563,-9.8219,7.5265,36.3176,23.5561,54
-61.6854,-9.8081,0.0767,16.6037,-9.8081,9.501,30.8487,13.4809,56
-5.4054,-9.9146,0.8401,3.4404,-9.9146,5.6477,28.322,18.6818,58
-11.4254,-9.9537,-0.1346,5.8893,-9.9537,4.036,19.786,11.7237,59
-1.0773,-9.9221,0.3492,1.319,-9.9221,0.5491,10.1967,4.2704,61
-1.1405,-9.9132,0.3339,1.0192,-9.9132,0.9506,6.7162,5.4414,62
-60.2136,-9.596,-33.0837,17.51,-9.596,5.0103,20.6866,17.5052,63
19.2724,-9.5051,24.0177,2.8461,-9.5051,1.5766,10.608,9.4443,64
3.3658,-9.7186,3.9653,0.4827,-9.7186,0.2373,3.4526,3.309,65
-13.1472,-9.6817,-6.9685,3.7327,-9.6817,1.4997,5.9871,3.6274,66
0.9666,-9.6848,3.217,1.3054,-9.6848,0.6657,4.0779,3.0962,67
0.9227,-9.7047,2.7861,1.1223,-9.7047,0.5604,3.4906,3.0371,68
5.7357,-9.6953,9.575,1.8273,-9.6953,0.9933,5.9486,5.6687,69
-12.5383,-9.8378,2.3625,4.7903,-9.8378,3.6744,6.8524,4.5647,71
-26.596,-9.6965,-5.7852,14.5135,-9.6965,6.7194,17.5074,15.5013,72
-11.2075,-9.6543,-2.4389,4.7074,-9.6543,3.7172,10.0269,4.0238,73
3.6985,-9.8529,7.1955,2.7387,-9.8529,1.6172,9.8902,7.5593,74
-4.2531,-9.8251,-0.7882,1.5678,-9.8251,0.9906,4.1501,2.5619,76
-3.8329,-9.6173,7.9702,7.1803,-9.6173,2.8911,20.0336,10.8459,77
-67.0046,-9.5039,-34.5994,25.3406,-9.5039,8.081,34.7555,27.6501,78
-29.1372,-9.7546,-4.2882,9.8194,-9.7546,4.4974,25.0475,15.7488,79
2.8562,-9.7565,6.1676,2.3212,-9.7565,1.6992,10.301,7.9548,80
-24.4771,-9.8191,-16.7048,6.7338,-9.8191,2.2596,20.9419,17.9378,81
-4.5511,-9.7049,16.103,17.4797,-9.7049,6.5125,43.0054,12.4006,82
-68.7544,-9.7869,-14.743,20.9325,-9.7869,5.392,59.1773,53.425,83
-37.777,-9.8851,-4.8644,15.8097,-9.8851,12.3663,45.6011,25.7655,84
-13.2481,-9.9072,0.77,8.8565,-9.9072,6.2087,75.2183,59.0391,86
-8.0473,-9.8339,2.8568,7.8883,-9.8339,5.1455,27.5749,8.7796,87
-4.3262,-9.8451,-3.7032,0.3848,-9.8451,0.4427,3.8698,3.4663,88
-1.6847,-9.7886,3.1863,3.9737,-9.7886,2.2556,7.0738,2.6643,89
-11.3901,-9.9111,-0.7761,5.667,-9.9111,5.973,9.5734,5.4145,91
-0.5927,-9.7947,8.3539,8.0081,-9.7947,4.5313,51.6558,33.237,92
-21.2627,-9.8618,1.3407,15.7601,-9.8618,10.2099,54.7575,46.5973,93
-7.1997,-9.9127,6.8976,10.1754,-9.9127,6.6536,79.0509,55.1592,94
-5.9012,-9.9716,-0.0366,3.8441,-9.9716,4.9598,55.4804,45.457,96
-3.2934,-9.9877,0.2746,2.0002,-9.9877,3.1368,57.7545,41.8006,97
-7.5583,-9.8752,-1.428,2.6424,-9.8752,3.4175,10.0983,5.5459,98
-15.0509,-9.9194,-1.2863,10.6956,-9.9194,12.0382,30.6649,23.0167,99
-167.7019,-9.8065,-16.7435,44.551,-9.8065,16.1252,47.4199,23.842,101
-67.979,-9.5452,-44.1562,16.9737,-9.5452,3.9647,17.982,15.0156,102
-5.9449,-8.894,32.4033,32.9152,-8.894,8.4593,22.7801,4.5316,103
-224.0469,-9.6068,8.0117,76.4121,-9.6068,12.0473,44.0837,31.9393,104
-43.9958,-9.781,-3.2231,16.2093,-9.781,6.4607,16.8598,4.1039,106
-1.1908,-9.9117,0.5194,1.077,-9.9117,1.4396,3.8811,2.9433,107
-0.7771,-9.9157,-0.343,0.2307,-9.9157,0.2736,2.7641,2.7281,108
-0.5127,-9.9152,-0.2891,0.1314,-9.9152,0.2043,2.7607,2.7207,109
-0.4923,-9.9176,-0.3454,0.0941,-9.9176,0.1233,2.7394,2.725,110
-0.4772,-9.9259,-0.4107,0.065,-9.9259,0.1162,2.8655,2.8135,112
-10.0338,-9.9293,0.9902,4.2097,-9.9293,5.8515,14.0989,5.0335,113
-3.8155,-9.9306,-1.8498,1.7365,-9.9306,1.155,8.1724,6.6066,114
-14.2598,-9.8952,-6.789,6.6997,-9.8952,4.7378,11.9611,8.8884,115
-1.1609,-9.9076,-0.833,0.3602,-9.9076,0.5962,3.3419,3.2651,116
0.0412,-9.9041,0.1446,0.1252,-9.9041,0.1727,2.758,2.7522,117
-15.2847,-9.7563,-9.1751,8.409,-9.7563,4.9181,10.8546,7.7776,118
-6.2565,-9.8167,-3.2808,1.9696,-9.8167,1.2385,17.8753,4.8703,119
-31.0955,-9.8958,-5.1043,17.7891,-9.8958,9.3487,46.7757,41.2154,121
-11.2766,-9.9296,-0.3818,4.8824,-9.9296,7.2274,49.3055,37.0759,122
-0.4875,-9.9311,-0.2005,0.2397,-9.9311,1.3401,3.7448,3.1053,123
0.4515,-9.9192,0.664,0.2291,-9.9192,0.4119,5.0658,4.4624,124
-0.4242,-9.931,-0.1698,0.2375,-9.931,0.7573,3.5079,3.0847,125
-82.6155,-9.8187,-8.2449,21.4735,-9.8187,9.6282,23.499,5.7944,127
-7.9727,-9.7767,-1.6178,3.5845,-9.7767,1.8092,4.457,3.0593,128
-3.3591,-9.7846,-1.2704,1.621,-9.7846,0.8619,3.1855,2.8168,129
-2.4513,-9.7824,-1.2008,0.9246,-9.7824,0.494,2.9753,2.7675,131
-2.0189,-9.7814,-1.2923,0.523,-9.7814,0.2782,2.9125,2.7842,132
-1.6731,-9.7828,-1.2092,0.3467,-9.7828,0.1856,2.8348,2.7702,133
-1.5445,-9.7818,-1.2437,0.2286,-9.7818,0.1226,2.817,2.7623,134
-1.4177,-9.7835,-1.231,0.131,-9.7835,0.0703,2.8102,2.7753,135
-1.3746,-9.7835,-1.2308,0.082,-9.7835,0.0439,2.7871,2.7686,136
-1.3633,-9.7828,-1.2647,0.0642,-9.7828,0.0343,2.8025,2.78,137
-1.347,-9.7816,-1.2741,0.0481,-9.7816,0.0268,2.8036,2.7879,138
-1.3186,-9.7819,-1.2546,0.0414,-9.7819,0.0224,2.8145,2.7907,139
-1.7754,-9.7779,2.0585,5.5236,-9.7779,2.3973,7.5606,2.7911,140
-86.3221,-9.8861,-10.8629,24.9748,-9.8861,10.8146,26.0973,6.7517,141
-19.8417,-9.6712,-5.0883,10.8902,-9.6712,6.2777,13.3565,9.5344,142
8.8203,-9.588,30.4006,14.567,-9.588,4.4996,39.8027,24.5132,143
-34.2705,-9.9473,-2.2024,15.2427,-9.9473,5.9958,63.9478,42.5322,144
-2.1806,-9.9607,3.1769,5.0632,-9.9607,4.9628,15.0066,9.0249,145
-21.9059,-9.9128,-1.9214,8.9369,-9.9128,6.7831,13.5765,6.7734,146
-1.8148,-9.9006,0.2682,1.5986,-9.9006,2.0095,5.0763,3.0306,147
-1.3455,-9.8788,0.5982,1.5497,-9.8788,1.5768,3.948,2.9197,148
0.4137,-9.9048,1.9309,0.818,-9.9048,0.7842,4.5773,4.159,149
-0.4038,-9.9145,-0.0109,0.2858,-9.9145,0.5088,2.9474,2.7485,150
-0.3582,-9.899,0.3584,0.4215,-9.899,0.5455,2.9622,2.77,151
-0.1555,-9.8961,0.214,0.1462,-9.8961,0.1811,2.7548,2.6785,152
0.0786,-9.8966,0.6257,0.4165,-9.8966,0.5218,3.2253,2.7472,153
-0.076,-9.894,-0.0473,0.0204,-9.894,0.0242,2.7024,2.6527,154
1.237,-9.8948,1.34,0.0885,-9.8948,0.0865,3.2114,3.1739,155
0.1644,-9.8949,0.2889,0.0738,-9.8949,0.0971,2.76,2.6979,156
1.1162,-9.8956,1.1906,0.0716,-9.8956,0.0913,3.1915,3.0763,157
-0.013,-9.9039,0.0855,0.0593,-9.9039,0.0885,2.7826,2.7015,158
0.6086,-9.9008,0.7596,0.1266,-9.9008,0.1597,3.0342,2.8556,159
0.2845,-9.9004,0.3196,0.0269,-9.9004,0.047,2.7548,2.699,160
0.788,-9.902,1.0667,0.1603,-9.902,0.244,3.0597,2.9898,161
0.0525,-9.9472,1.437,1.3413,-9.9472,1.7704,5.0503,3.335,162
-21.3059,-9.9071,-2.6502,6.0582,-9.9071,5.1771,11.68,6.4213,163
-6.3503,-9.8455,-0.3811,4.5837,-9.8455,3.9887,6.6717,4.7688,164
0.8156,-9.9114,2.0431,1.2025,-9.9114,1.2087,4.3805,3.2967,165
1.1269,-9.9164,1.4573,0.3979,-9.9164,0.8535,5.0392,3.5444,166
-0.6186,-9.9213,-0.2568,0.2935,-9.9213,0.5772,2.9404,2.6605,167
0.9281,-9.9125,1.5176,0.55,-9.9125,0.7806,4.3174,3.3541,168
0.12,-9.9251,0.2899,0.1295,-9.9251,0.3215,2.9547,2.7973,169
-0.5207,-9.9237,-0.3504,0.1401,-9.9237,0.2525,2.914,2.8191,170
-0.2221,-9.9182,0.2493,0.3955,-9.9182,0.7926,3.1486,2.7287,171
-0.0173,-9.9229,0.3139,0.2655,-9.9229,0.6427,3.3163,2.8138,172
-2.3897,-9.9176,-0.4574,0.722,-9.9176,1.0909,4.2056,2.8015,173
0.7032,-9.914,1.6076,0.7744,-9.914,0.8725,4.4299,3.4734,174
-2.0475,-9.9932,0.0178,1.0475,-9.9932,1.9669,27.7827,10.2461,175
-3.6765,-9.9917,1.1221,3.728,-9.9917,1.4507,48.8793,46.5404,176
-1.0045,-10.1551,2.4597,2.5681,-10.1551,5.065,69.0753,66.8469,177
-14.0762,-9.9018,-2.818,8.6149,-9.9018,3.7372,20.7553,13.3787,178
-45.9289,-10.1122,-4.1942,17.5596,-10.1122,12.9481,62.9187,40.9988,179
-7.0518,-9.9251,-1.1343,2.6852,-9.9251,4.2908,9.0093,5.5423,180
-7.4413,-9.9197,-0.0663,3.1263,-9.9197,3.0815,20.3983,7.9615,182
-1.7551,-9.8928,1.0319,2.8079,-9.8928,3.1488,20.4726,5.2019,183
-0.2434,-9.9317,0.0774,0.3458,-9.9317,1.127,10.7375,9.6186,184
-11.9375,-10.0217,-2.3427,4.2301,-10.0217,5.2648,41.6698,33.248,185
-3.0661,-10.3892,2.3645,6.619,-10.3892,3.8066,48.2903,44.9827,186
-4.8894,-9.8649,6.0265,6.2041,-9.8649,3.7465,51.3355,28.8568,187
-0.6197,-10.0669,0.1412,0.4561,-10.0669,1.4932,47.7977,47.1632,188
-2.636,-9.7064,2.8043,5.4763,-9.7064,5.4329,39.0478,10.3795,189
-4.659,-10.1817,0.3609,3.2858,-10.1817,5.6506,30.8411,27.3517,190
-10.4437,-9.9994,2.4347,8.1442,-9.9994,5.4011,40.9438,27.4926,192
-2.6393,-9.933,0.9053,2.513,-9.933,2.9304,13.5091,7.6892,193
-0.5882,-9.9134,-0.0462,0.4475,-9.9134,0.84,7.8342,6.714,194
-10.1329,-9.8871,-2.2875,3.7366,-9.8871,4.1042,11.9357,10.4432,195
3.4388,-9.8725,4.2218,0.7181,-9.8725,0.2182,5.7642,5.5063,196
0.1097,-9.9166,0.3294,0.1767,-9.9166,0.3192,2.9459,2.7644,198
-0.9752,-9.8929,0.5563,0.8635,-9.8929,1.5865,5.1065,3.5955,199
-4.95,-9.9987,-1.7813,1.8988,-9.9987,1.1817,6.2931,4.2987,200
-5.2509,-9.9124,-2.2557,1.7524,-9.9124,1.1006,6.8157,5.6284,201
6.5193,-9.8749,8.7663,1.2836,-9.8749,0.7114,12.5533,11.8004,202
-4.4216,-9.9244,-1.5052,1.5382,-9.9244,1.558,5.4324,3.9228,203
-0.3812,-9.8843,0.0411,0.3198,-9.8843,0.3278,2.7062,2.5789,204
1.4,-9.8774,5.0338,3.3122,-9.8774,3.2488,37.6643,6.3775,206
-3.5803,-10.069,2.4494,4.6768,-10.069,4.8683,60.6408,48.704,207
-23.417,-10.1873,-0.0622,10.0659,-10.1873,7.3805,81.0136,66.2941,208
-25.0148,-9.93,1.1071,9.1188,-9.93,10.1702,64.0197,20.0192,209
-4.1197,-9.9242,0.0901,2.2976,-9.9242,3.244,33.759,23.0278,210
-3.0892,-9.9408,0.6834,1.7044,-9.9408,3.5237,22.4814,5.4349,212
-4.1445,-9.9029,-0.5354,1.4818,-9.9029,2.2825,5.4921,3.454,213
-2.0859,-9.915,-1.3779,0.4187,-9.915,0.2334,3.7491,3.5163,214
1.4422,-9.8496,3.9929,1.7485,-9.8496,1.775,7.2871,6.2253,215
-0.3398,-9.9481,1.0892,1.0119,-9.9481,2.8977,7.046,3.5212,216
5.0031,-9.8714,16.1623,7.3752,-9.8714,5.8848,20.4255,12.2304,217
-32.8968,-9.7076,-20.0231,9.4762,-9.7076,4.3222,15.0458,9.7445,218
1.0318,-9.6506,12.5103,7.3309,-9.6506,2.995,16.616,9.8181,219
-34.3773,-9.8876,-8.8198,16.7017,-9.8876,4.4983,49.5534,33.7158,220
-12.5215,-10.0153,8.9171,14.4039,-10.0153,7.047,52.5408,45.9484,222
-20.5408,-9.9775,-0.2335,6.1925,-9.9775,6.7761,61.2187,55.4614,223
-7.0331,-9.9895,1.9415,4.0102,-9.9895,5.478,38.2556,16.4628,224
-8.3543,-9.8101,-3.1007,3.2146,-9.8101,5.2233,15.3912,10.816,225
-2.6318,-9.9372,0.2827,1.4659,-9.9372,1.6306,13.96,8.8656,226
-2.0976,-9.9703,-0.634,0.7844,-9.9703,1.5712,5.2407,4.5456,227
-3.9649,-9.9396,1.8261,4.2383,-9.9396,1.4786,47.0967,43.5554,228
-8.5918,-9.8567,-1.9155,2.6268,-9.8567,2.0771,16.2433,12.4999,229
1.3431,-9.8984,2.7574,0.8541,-9.8984,0.3767,5.6423,5.2832,230
-0.1257,-9.926,0.7454,0.7038,-9.926,1.0355,4.4719,3.1656,231
-4.4699,-9.9147,0.4281,1.9254,-9.9147,2.6644,5.6131,3.5254,232
-3.5307,-9.901,0.0673,1.4555,-9.901,3.9448,11.3859,8.8452,233
-7.3512,-9.7669,0.4289,3.862,-9.7669,2.1697,29.1772,21.897,234
-1.1474,-9.8205,2.5039,2.9635,-9.8205,2.2281,25.8535,21.5599,235
-6.6783,-9.9236,-1.0886,2.3273,-9.9236,2.6842,11.5169,7.1396,236
-7.6782,-9.8701,0.1226,2.7842,-9.8701,2.453,5.1297,2.8045,237
-31.786,-9.7824,-12.5238,11.3757,-9.7824,4.4054,14.9242,7.0625,238
-21.2348,-9.6018,1.8064,15.6194,-9.6018,6.4008,10.9785,7.3505,239
11.0774,-9.7547,14.1698,2.0763,-9.7547,0.6449,9.2912,8.3666,240
-22.2908,-9.7205,-15.7705,4.7022,-9.7205,1.8505,11.0928,9.3311,241
3.1031,-9.6777,12.0393,6.0429,-9.6777,2.3066,13.7792,10.3937,242
-4.2359,-9.8338,-0.261,3.0361,-9.8338,2.641,11.8978,6.1392,243
0.5497,-9.8427,4.0229,2.5712,-9.8427,1.609,7.9904,3.9469,244
-0.3099,-9.8492,0.0264,0.2388,-9.8492,0.181,2.8844,2.7492,245
0.5785,-9.8432,0.8687,0.1842,-9.8432,0.1436,2.7939,2.6885,246
-0.0722,-9.8397,0.7165,0.3142,-9.8397,0.2412,2.7438,2.6659,247
-0.9456,-9.8261,1.0058,1.9221,-9.8261,1.33,4.175,2.5462,248
3.03,-9.8601,4.9499,0.6954,-9.8601,0.3304,5.4864,5.0631,249
-0.9072,-9.8941,-0.3695,0.4928,-9.8941,0.6155,2.7537,2.5772,250
1.6785,-9.9034,5.0966,1.9482,-9.9034,2.1888,10.3281,6.6754,251
-0.061,-9.943,0.062,0.1212,-9.943,1.1623,2.8837,2.3727,252
-1.779,-9.9243,-0.7182,0.6088,-9.9243,1.0964,4.646,3.0956,253
1.4237,-9.8862,2.839,0.8318,-9.8862,1.1776,6.2833,4.9281,254
-1.4903,-9.946,-0.6526,0.5414,-9.946,0.9557,2.9755,2.8292,255
-5.4142,-9.873,-3.7573,1.6214,-9.873,0.8612,5.4028,4.8295,256
-0.6176,-9.9084,1.016,1.0688,-9.9084,1.65,4.7574,3.256,257
-0.7814,-9.9005,-0.3734,0.376,-9.9005,0.4796,2.84,2.7366,258
-0.0238,-9.8905,0.5699,0.2631,-9.8905,0.2955,2.9651,2.7859,259
-1.1663,-9.8701,-0.7647,0.3736,-9.8701,0.3791,2.8663,2.7323,260
2.7842,-9.8522,8.0212,2.7629,-9.8522,1.3547,26.0793,17.8375,261
-4.6459,-9.8918,-0.7082,2.8261,-9.8918,4.9687,63.8812,55.3458,262
-0.1224,-9.9432,1.2424,1.17,-9.9432,0.7257,6.9865,5.4912,263
-2.5129,-9.9501,-0.1129,1.2397,-9.9501,1.7058,19.6226,11.2044,264
-14.3365,-9.9421,-1.9282,6.0456,-9.9421,2.6716,10.9483,6.1176,265
-2.9091,-9.9349,-0.2201,0.9177,-9.9349,2.0415,15.7323,5.5504,267
-3.3517,-9.9402,0.9534,2.3961,-9.9402,1.8884,30.3696,12.6929,268
-6.4663,-9.9714,0.3805,2.6487,-9.9714,3.7973,26.141,14.1262,269
-0.0004,-9.9253,0.7948,0.6599,-9.9253,3.2179,18.7827,16.0637,270
-0.5269,-10.4439,4.2193,4.3893,-10.4439,1.4575,15.2214,9.5751,271
-1.5775,-9.9559,-0.3097,0.6458,-9.9559,1.4239,6.7595,4.1289,272
-34.0946,-9.8714,-5.3822,10.4679,-9.8714,5.5022,15.5454,5.7889,273
-1.7344,-9.8833,3.5739,7.0475,-9.8833,6.0966,15.6565,8.455,275
-0.0506,-9.9806,0.9929,0.8178,-9.9806,1.1804,9.1056,7.4365,276
-1.9566,-9.9499,-0.3376,0.9631,-9.9499,2.6381,6.7434,4.3491,277
-2.4462,-9.8669,-0.7445,1.1078,-9.8669,1.4114,20.461,16.5036,278
-10.6194,-9.8941,-2.1163,4.0144,-9.8941,4.2079,11.2037,7.1531,279
2.4746,-9.8783,2.8941,0.3133,-9.8783,0.147,4.363,4.2874,280
-2.8821,-9.9019,0.297,1.9757,-9.9019,2.566,6.4868,3.2085,282
-1.4665,-9.9021,-0.1008,0.5706,-9.9021,0.7689,3.3021,2.6912,283
-1.6224,-9.8943,1.5495,1.3467,-9.8943,1.6577,4.6072,3.8475,284
-2.2339,-9.8915,-0.3743,1.0616,-9.8915,1.8848,3.6211,2.9482,285
1.2575,-9.8722,2.1979,0.4635,-9.8722,0.5511,3.8258,3.563,286
-1.7318,-9.8767,-0.0897,1.6408,-9.8767,1.612,3.1404,2.7606,287
-21.901,-9.9713,-2.9541,7.5895,-9.9713,7.2618,20.8521,14.5148,288
-4.0854,-9.8456,0.964,2.3066,-9.8456,2.1295,15.9371,10.1231,289
-4.1814,-9.9483,1.9813,3.6202,-9.9483,6.4242,23.219,12.8446,291
-1.3452,-9.8912,1.4777,2.7623,-9.8912,4.8205,17.1242,10.7302,292
-3.0411,-9.8778,0.3618,2.1998,-9.8778,4.627,15.9663,12.6608,293
-0.203,-9.9943,0.4524,0.6393,-9.9943,1.652,9.9547,9.3843,294
-4.6469,-9.871,0.3782,3.5117,-9.871,3.5542,5.7709,4.4487,295
-2.1669,-9.949,0.4351,1.7172,-9.949,2.5794,5.908,3.2104,296
-4.4509,-9.895,-1.1117,2.4075,-9.895,0.7986,7.5858,6.8058,297
-3.4448,-10.0778,-0.5765,1.8357,-10.0778,3.1829,51.3941,42.4188,298
-53.9828,-9.6345,3.1311,34.5512,-9.6345,14.0375,49.0265,25.5693,299
-1.1758,-9.9094,0.3885,1.3804,-9.9094,4.2055,11.1061,4.7953,300
-18.8654,-9.9968,-2.7385,11.6262,-9.9968,11.2169,61.1567,16.566,302
-52.3065,-9.8258,14.0448,48.903,-9.8258,9.8969,106.9145,83.5311,303
-10.9452,-9.9361,-0.0524,6.296,-9.9361,4.5957,44.6365,37.5258,304
-4.0638,-10.3251,23.1754,21.7347,-10.3251,8.1179,37.592,27.9294,305
-1.9217,-10.1621,3.3599,4.1188,-10.1621,2.5532,11.3743,9.6022,306
-3.3697,-9.8573,-1.1157,1.5962,-9.8573,2.5271,16.688,12.7527,307
-2.3183,-9.7393,4.1763,7.6213,-9.7393,4.3413,18.6537,15.7284,308
-5.5793,-9.9484,1.9091,6.4644,-9.9484,6.3953,14.3906,11.3208,309
-4.1537,-9.9058,-0.7934,1.6648,-9.9058,1.6031,6.581,3.5001,310
-5.3673,-9.9402,0.6393,3.5958,-9.9402,5.0367,21.5673,11.4079,312
-15.7289,-10.0738,7.0383,14.1949,-10.0738,2.2177,31.007,24.3189,313
-2.4878,-9.8246,1.4476,2.5277,-9.8246,5.3267,18.3224,13.7094,314
-10.8685,-9.9056,-2.3125,3.4515,-9.9056,3.1049,13.4556,9.298,315
-1.1969,-9.9344,-0.4635,0.6737,-9.9344,1.8306,6.2679,4.1393,316
-6.6949,-9.7713,2.1334,5.7362,-9.7713,3.3972,18.7133,4.4889,318
-15.456,-9.8651,-3.4921,7.0353,-9.8651,3.7991,27.363,17.4914,319
-0.9591,-9.8517,5.537,6.1183,-9.8517,4.6883,27.9721,24.7778,320
-1.0115,-9.7137,12.3325,10.2183,-9.7137,3.1958,14.2833,12.5207,321
2.3846,-9.8598,4.855,1.9643,-9.8598,1.8214,7.3075,6.3278,322
-14.5364,-9.9873,-0.0904,10.1958,-9.9873,4.9948,27.2401,14.67,323
-5.6598,-9.6476,-1.2455,3.365,-9.6476,2.288,29.0676,26.1747,324
-23.7473,-9.6377,1.9168,7.5329,-9.6377,6.0483,35.1187,12.8828,326
-12.5191,-10.0545,4.5442,10.4961,-10.0545,8.0931,35.895,16.9699,327
-15.7778,-10.1895,-2.147,6.4331,-10.1895,2.9249,20.2202,12.8662,328
-49.5338,-9.7961,-2.502,14.1057,-9.7961,8.4592,25.4571,13.5909,330
-48.1319,-10.0155,6.1877,27.3228,-10.0155,11.023,77.7297,50.4073,331
-27.1344,-10.1696,4.1988,19.7797,-10.1696,2.7056,58.1147,23.2636,332
-2.964,-10.3044,13.0277,12.3759,-10.3044,1.506,31.6005,22.3803,333
-51.8671,-10.3155,5.2263,25.3981,-10.3155,6.8527,61.93,29.5414,334
-8.5624,-9.9525,0.8623,5.9381,-9.9525,3.1563,16.248,13.759,335
-63.6044,-10.1694,19.5344,41.3114,-10.1694,27.4992,54.1976,41.2272,336
-9.8462,-9.8593,16.7118,16.745,-9.8593,5.3916,35.9251,25.7893,337
-10.9505,-9.8895,3.9141,8.8467,-9.8895,9.7475,24.332,14.946,338
-2.8673,-9.6706,-0.7862,1.3973,-9.6706,2.4984,7.3078,5.1647,339
-2.8836,-9.5355,-0.1586,1.8752,-9.5355,3.4688,9.2265,5.717,340
-0.6624,-9.8871,0.5508,0.9518,-9.8871,2.2532,11.2124,9.2408,341
-1.2038,-9.9771,0.5897,1.6845,-9.9771,2.6409,9.6354,7.7133,342
0.3505,-10.0038,1.6925,0.8579,-10.0038,1.5925,11.7551,10.3374,343
-32.584,-10.0136,8.5205,18.2787,-10.0136,8.4397,52.8286,30.5599,344
-1.939,-9.8268,2.8676,4.8416,-9.8268,5.819,14.0511,10.6897,345
-31.2109,-8.4501,10.3543,19.0059,-8.4501,10.6251,69.2717,37.4049,347
-26.3629,-9.847,9.5992,22.6638,-9.847,10.9179,44.0805,28.983,348
-10.2684,-9.8283,-0.3059,5.7886,-9.8283,6.5331,30.9097,11.581,349
-1.4662,-9.984,8.8841,8.1352,-9.984,5.9459,28.4108,24.8117,350
-16.6479,-10.0622,-3.9708,7.8008,-10.0622,9.8834,28.5703,24.5488,351
-2.7561,-9.9929,0.8591,4.7403,-9.9929,4.8845,16.0208,13.3476,352
-6.0366,-9.6196,0.878,3.4128,-9.6196,6.2253,21.2384,17.4899,353
-0.2188,-9.8728,2.3316,2.7224,-9.8728,4.9361,13.0367,8.3096,354
-1.9165,-9.9364,1.9031,3.3583,-9.9364,4.1615,12.955,7.5429,356
-22.5935,-10.0982,-3.5639,7.9702,-10.0982,3.9047,16.3217,7.3843,357
-1.3808,-10.3414,1.226,2.2889,-10.3414,4.7676,23.0856,10.4856,358
-8.2932,-9.7325,9.7812,12.3431,-9.7325,1.3698,40.4228,25.5299,359
-16.7205,-9.6802,-5.0632,6.2223,-9.6802,6.6761,32.3212,25.8997,360
-27.6765,-8.792,-7.5396,18.4888,-8.792,7.0201,57.5743,43.823,361
-7.4824,-9.9222,9.201,9.3705,-9.9222,4.2235,23.9181,19.8779,362
-14.092,-9.821,-3.4961,7.9612,-9.821,5.0934,32.9288,22.2108,363
-4.8065,-10.0968,7.4363,9.2861,-10.0968,8.7575,43.4648,29.9049,364
-11.2552,-10.133,3.1418,11.4408,-10.133,7.7376,39.3163,19.0851,366
-22.1588,-9.8017,5.5662,11.779,-9.8017,12.6558,29.7208,19.6744,367
-4.4534,-9.9642,3.6591,6.9453,-9.9642,8.2377,17.4664,13.8361,368
-11.197,-9.916,1.784,4.9613,-9.916,5.4874,28.3344,10.2998,370
-8.3061,-10.1033,4.8745,8.5424,-10.1033,5.9792,24.4674,16.3023,371
-5.0801,-9.69,1.5107,3.3062,-9.69,2.5745,22.8771,12.0495,372
0.4442,-10.5069,3.4234,2.8328,-10.5069,3.274,17.5112,13.9162,373
-3.5225,-9.4202,0.2811,1.6595,-9.4202,3.8307,24.0749,9.3356,374
-6.5581,-10.2039,0.8509,4.2734,-10.2039,5.5247,40.4246,28.5566,375
-21.5667,-9.8742,0.4387,13.9344,-9.8742,11.1029,35.502,19.2502,376
-32.6912,-9.7103,-0.1662,17.2738,-9.7103,9.3011,30.6723,22.1033,377
-7.4782,-9.9241,-1.1842,3.2893,-9.9241,2.2372,27.2218,16.5982,378
-0.8243,-9.8778,-0.013,0.674,-9.8778,0.8827,4.9323,4.0596,379
-0.3879,-9.9179,0.0439,0.3986,-9.9179,0.5747,2.8592,2.6554,380
-0.9999,-9.8528,0.0253,0.9099,-9.8528,2.0622,6.7818,3.0022,381
-27.1035,-9.875,15.5844,21.3523,-9.875,5.8951,28.4631,17.9268,382
-13.4846,-9.9198,0.7267,8.5029,-9.9198,3.3002,28.7597,18.1559,383
-12.5597,-9.873,9.8488,16.4927,-9.873,4.6273,51.3608,23.8572,384
-10.8767,-9.9465,10.2028,17.6112,-9.9465,15.1634,40.5824,27.9431,386
-0.6702,-10.3769,3.8301,5.1766,-10.3769,7.4181,17.524,16.9243,387
-8.9282,-10.3262,4.0862,8.7564,-10.3262,8.2191,25.5964,13.7134,388
-0.5115,-9.8047,2.2656,2.5222,-9.8047,4.7558,11.9185,9.3597,389
-2.4445,-9.7622,1.4538,2.6827,-9.7622,4.1956,21.2704,8.2232,390
-5.6036,-10.0481,-0.93,3.2745,-10.0481,1.4123,12.519,9.0147,391
-3.5145,-9.9014,2.0095,4.0323,-9.9014,1.9028,14.8202,8.634,392
-1.205,-9.9269,1.4915,1.9251,-9.9269,3.3888,6.8717,6.0008,393
-5.9326,-9.9636,-0.2474,3.6564,-9.9636,3.6977,20.6173,13.7364,394
-2.5001,-9.784,-0.0498,1.3519,-9.784,2.1893,10.1741,7.1259,395
-2.1752,-9.911,1.9305,3.6923,-9.911,3.4586,14.8361,9.6552,397
-2.0697,-9.8588,0.3427,2.2034,-9.8588,4.233,8.0423,6.0465,398
-0.0268,-9.6933,0.4772,0.598,-9.6933,3.6285,7.7571,4.2656,399
-6.0237,-9.8109,0.7825,3.6798,-9.8109,4.7514,14.3431,10.4464,400
-2.0967,-10.0084,0.3435,3.0544,-10.0084,5.8237,11.8632,10.0861,401
-2.3195,-9.8075,2.0274,4.6634,-9.8075,4.4563,8.0715,5.155,402
-2.5747,-9.9415,0.0379,1.0895,-9.9415,2.3814,7.7576,5.7797,403
-0.2005,-9.998,0.2358,0.3063,-9.998,0.5322,5.5629,4.1551,404
-3.4923,-9.9162,0.3528,1.747,-9.9162,4.3734,11.8584,4.7036,406
-8.9163,-9.9971,0.1864,3.7857,-9.9971,2.8368,17.0668,10.8276,407
-0.4571,-9.9638,1.4324,1.5143,-9.9638,3.5289,11.6773,8.9739,408
-1.204,-9.9237,0.0767,0.6517,-9.9237,0.7974,5.9313,4.5683,409
-0.584,-10.1427,-0.0724,0.2499,-10.1427,1.5235,4.7618,2.7773,410
-0.3199,-10.0003,0.2902,0.5931,-10.0003,0.867,10.9628,9.6807,411
2.18,-10.0709,8.4787,4.6981,-10.0709,1.8896,27.643,22.1709,412
-11.2327,-10.1369,9.9009,23.8712,-10.1369,11.1259,63.4556,25.7154,413
-4.263,-10.6467,6.4249,8.0145,-10.6467,5.3698,44.7534,22.8182,414
-5.7287,-10.2363,24.1631,14.1277,-10.2363,2.4975,53.8261,38.5642,415
-12.3436,-9.9513,1.9021,6.9498,-9.9513,8.3723,24.6089,16.5643,417
-3.3191,-10.3232,3.2759,3.6532,-10.3232,4.6156,19.1484,11.172,418
-6.1987,-9.8237,-1.5559,2.43,-9.8237,1.9077,14.5195,11.0102,420
-2.0864,-9.8109,0.5491,1.969,-9.8109,1.354,10.0376,8.2061,421
-2.5609,-10.177,3.2549,4.7331,-10.177,4.3947,13.383,9.2908,422
-3.4184,-9.9663,-2.0835,1.1246,-9.9663,4.2265,8.9477,6.0545,423
-6.9595,-10.0391,3.5015,8.9448,-10.0391,10.9669,24.3955,14.6474,424
-3.2939,-9.9375,1.545,5.2108,-9.9375,6.6608,17.5269,13.9887,425
-2.5744,-9.9536,6.4724,10.5587,-9.9536,5.8536,15.8064,11.9086,426
-16.8028,-9.9093,2.3085,8.1327,-9.9093,11.0186,20.8505,13.8774,427
-3.5655,-10.0443,2.965,6.5804,-10.0443,7.6243,16.98,8.2846,428
-4.5643,-9.7353,0.9655,3.3244,-9.7353,6.9642,19.1302,9.6342,429
-7.0478,-10.0339,0.3588,3.3208,-10.0339,5.4404,15.8839,9.5176,430
-1.3529,-10.373,0.6287,1.4324,-10.373,1.5285,10.5541,7.5034,431
0.2968,-9.9059,3.0985,3.299,-9.9059,4.9441,14.2819,13.0452,432
-7.2001,-9.5517,4.8972,10.4927,-9.5517,3.7913,20.7273,17.2001,433
-2.3054,-9.9024,0.5617,1.7221,-9.9024,2.7965,12.367,5.6297,434
-4.5415,-9.8649,0.2161,2.203,-9.8649,4.9775,12.3914,7.3394,435
-2.2634,-9.8166,-0.0257,1.4794,-9.8166,2.8624,9.5004,8.115,436
-3.8314,-10.0395,3.4995,6.0607,-10.0395,10.0271,25.0098,19.4859,437
-1.9655,-9.9399,2.2176,5.2578,-9.9399,4.7315,14.94,7.6178,438
-2.32,-10.0351,0.1606,1.422,-10.0351,3.342,11.3731,8.066,439
-1.0496,-9.9013,0.0147,0.5344,-9.9013,3.4625,12.3232,8.5653,440
-1.1151,-10.0096,1.7249,2.4681,-10.0096,1.5354,11.303,8.5131,441
-3.9425,-9.8866,-0.4889,1.694,-9.8866,1.4204,12.5608,8.2874,442
-1.982,-9.878,0.5844,2.6485,-9.878,2.7643,14.5359,5.0917,443
-10.1505,-9.6987,-1.3081,4.4358,-9.6987,3.2913,20.7066,14.9136,444
-2.9592,-9.9036,0.9988,2.8899,-9.9036,4.5308,18.1119,9.5018,446
-7.8499,-9.3707,6.6235,11.4929,-9.3707,11.6276,36.4338,18.2553,447
0.1292,-10.0178,1.8514,1.6087,-10.0178,3.7914,15.21,12.2994,448
-0.8191,-10.0602,4.0508,3.9794,-10.0602,5.1178,16.6939,13.824,449
-16.4861,-9.8684,2.2003,7.2087,-9.8684,8.1982,19.7054,12.0986,450
-5.4254,-10.0914,1.5029,4.001,-10.0914,2.7819,11.3783,9.6855,451
-3.2053,-10.0091,6.4944,7.6987,-10.0091,6.235,20.6726,10.4535,452
-5.5731,-10.1986,1.8935,7.1814,-10.1986,7.5205,19.787,15.6817,453
-8.1693,-9.8532,0.1754,4.2319,-9.8532,1.6081,12.0699,9.4395,454
-6.6757,-9.8474,-0.6498,3.1598,-9.8474,3.0117,10.3239,6.4645,455
-15.5066,-9.7793,1.7802,9.5902,-9.7793,6.6053,17.2591,6.5596,457
-2.0677,-9.9558,2.4709,4.0499,-9.9558,4.9726,13.2908,7.7122,458
-14.1007,-9.8922,-1.7335,3.8391,-9.8922,6.5201,13.7474,7.602,459
-1.8215,-9.7257,0.4409,1.9935,-9.7257,1.8181,15.6976,12.4268,460
-0.7097,-9.9926,0.5492,1.3246,-9.9926,2.7916,7.6698,5.9361,461
-1.8133,-10.1652,-0.2767,0.7779,-10.1652,1.2434,14.8157,9.7237,462
-9.9152,-9.873,-1.5872,4.1924,-9.873,2.5302,13.0655,9.7252,463
-7.9518,-9.8263,0.5409,3.2796,-9.8263,3.0831,15.4021,5.8348,464
-2.1449,-10.0552,1.8598,3.5385,-10.0552,3.1806,17.2546,9.0353,465
-8.3098,-9.9632,0.4313,4.2214,-9.9632,6.3006,12.4887,8.8814,466
-1.8739,-9.7288,3.2234,3.9646,-9.7288,4.7342,13.5674,8.3106,467
-6.2935,-9.9075,-0.8948,2.4379,-9.9075,2.7861,9.1881,5.3694,468
-6.2528,-9.4743,0.8733,4.8682,-9.4743,2.6707,17.0257,10.4555,469
-1.4221,-9.4003,2.8551,3.8628,-9.4003,7.2381,19.06,9.962,470
-7.1636,-8.7583,0.0933,4.8029,-8.7583,3.8275,17.3701,10.334,471
-3.8191,-9.822,-0.1823,1.9036,-9.822,1.5611,11.1829,6.3679,472
-3.1558,-10.2345,-0.2619,1.8814,-10.2345,2.4477,8.6931,5.4388,473
-5.7308,-9.9292,1.1378,3.9846,-9.9292,4.8496,8.2515,6.5848,474
-9.164,-9.9438,-0.1469,3.686,-9.9438,5.7406,17.1361,8.3497,476
-4.83,-9.8332,0.5319,2.5719,-9.8332,6.2872,13.5552,8.2971,477
-2.5381,-9.7034,0.4,2.3397,-9.7034,2.2944,12.215,9.3628,478
-5.5606,-10.5488,-2.0588,1.9277,-10.5488,3.623,14.546,10.1917,479
-6.6542,-10.1689,-0.8577,4.362,-10.1689,3.7671,9.4536,7.0184,480
-4.3956,-9.997,-1.9685,2.0362,-9.997,5.3456,10.3269,5.1786,481
-0.8595,-9.8004,1.9695,2.7585,-9.8004,3.6125,6.1884,5.5355,482
-4.6587,-10.0086,-1.4985,2.4253,-10.0086,2.439,10.7749,7.6973,483
-2.7944,-9.9376,1.149,2.4808,-9.9376,4.2959,9.3071,7.3129,484
-5.9079,-10.0924,-0.9044,2.4939,-10.0924,3.481,15.2568,6.2756,486
-33.9188,-9.8713,-1.1047,10.432,-9.8713,8.5727,45.1777,9.1008,487
-22.3708,-9.8014,15.8781,29.4997,-9.8014,18.6071,42.6456,22.8626,489
-9.5197,-10.1019,-0.4308,2.7499,-10.1019,2.6508,23.2885,7.4212,490
-2.0757,-10.1658,-0.9204,0.8853,-10.1658,1.8783,11.0955,7.3216,491
-8.4576,-9.6271,-1.9304,4.4129,-9.6271,4.2886,12.0652,7.5014,492
-4.5843,-10.0979,-1.4204,1.9608,-10.0979,3.0239,14.9568,6.9358,493
-24.6233,-9.9842,-0.5215,10.3528,-9.9842,3.3435,13.6511,8.4981,494
-2.7437,-9.9216,-0.0805,1.236,-9.9216,2.7135,12.4043,5.3599,496
-5.415,-10.0717,0.2621,5.5704,-10.0717,5.4773,14.5859,8.445,497
-1.711,-9.7445,2.7377,4.0654,-9.7445,6.8594,14.145,12.3411,498
-13.5779,-9.7184,-0.8767,5.6139,-9.7184,6.5915,27.8211,8.8811,499
-6.5882,-9.773,1.5878,5.2851,-9.773,6.0851,16.5429,12.1587,500
-1.5777,-9.8368,0.6524,2.1165,-9.8368,1.4306,9.3127,6.7786,501
-8.0465,-9.9186,-2.9683,3.0281,-9.9186,1.6947,15.9095,13.1203,502
-2.9124,-9.9029,0.9216,2.2238,-9.9029,3.5209,10.2668,6.0831,503
-0.3525,-9.8887,0.4316,0.6861,-9.8887,1.9846,9.9987,6.1907,504
-2.5879,-10.0684,-0.1695,1.3343,-10.0684,1.5114,7.9161,5.7539,505
-6.1736,-10.0232,0.78,3.1626,-10.0232,6.9739,17.9746,9.6635,507
-11.8404,-9.8806,-0.2833,3.8425,-9.8806,1.9474,14.1452,6.4011,509
-2.7005,-9.7608,4.0913,5.3141,-9.7608,8.4768,14.7298,13.3183,510
-4.558,-9.687,2.5835,4.9526,-9.687,8.6782,19.3359,17.098,511
-103.4776,-9.0527,-1.5207,31.2098,-9.0527,10.5943,42.0175,28.9233,512
-17.2816,-9.1445,-7.1591,6.9878,-9.1445,5.364,30.8773,12.7251,513
-14.4125,-9.8747,0.5051,6.1242,-9.8747,8.9221,23.3649,14.4008,514
-2.3016,-9.6931,0.0584,1.8118,-9.6931,2.2479,9.5328,8.0527,515
-3.3348,-9.7088,-0.0271,2.4358,-9.7088,2.4477,14.8448,8.0702,516
-5.7708,-9.6951,8.2676,11.1312,-9.6951,12.2507,24.9496,17.7355,517
-16.9348,-9.8837,3.6273,17.7875,-9.8837,10.75,30.0667,18.7879,518
-2.4255,-10.2631,2.5518,2.9254,-10.2631,1.5954,11.8364,8.7911,519
-5.9795,-8.5541,-0.7701,4.3499,-8.5541,1.1532,20.4551,8.0374,520
-0.2419,-10.2029,1.9178,1.9845,-10.2029,5.7147,17.9073,11.232,521
-9.4452,-9.0076,1.0443,5.276,-9.0076,3.5749,15.076,8.7406,522
-2.2946,-7.3575,1.7632,3.1381,-7.3575,4.559,21.4565,9.585,523
-9.5598,-9.3267,0.9133,4.2548,-9.3267,4.0206,26.2206,9.6685,524
-1.4341,-9.8953,0.664,1.7511,-9.8953,1.9863,14.713,5.3686,525
-14.056,-9.6418,0.8146,7.2438,-9.6418,5.8529,26.828,11.0878,526
-6.9132,-9.5283,3.2024,9.2201,-9.5283,7.8836,29.4211,9.7958,527
-8.3862,-10.0276,0.9684,4.7258,-10.0276,6.0715,28.6284,21.6164,528
-81.6807,-8.522,7.7726,44.5611,-8.522,5.2452,33.3756,24.3014,529
-2.9673,-9.7235,3.0549,5.7426,-9.7235,5.1153,16.8607,8.2245,530
-0.479,-9.9471,2.2632,2.5643,-9.9471,1.4512,19.8908,8.5154,531
-6.7757,-10.1899,-1.8523,3.8064,-10.1899,5.7374,21.1436,10.2282,532
-11.1378,-9.4657,-1.1989,4.7153,-9.4657,1.4109,11.5829,8.4211,533
-11.0424,-9.9532,2.7874,7.9702,-9.9532,4.6302,22.8791,17.1394,534
-7.7228,-10.7519,15.2558,13.7198,-10.7519,4.5789,51.0339,36.0356,535
-19.6374,-10.0501,5.6983,9.842,-10.0501,15.1846,49.9988,26.75,537
-23.6165,-9.9227,1.3578,8.7142,-9.9227,3.1959,17.6664,13.2388,538
-10.4287,-9.7507,2.6403,7.5432,-9.7507,8.4437,31.0743,12.6059,539
-1.7992,-9.7876,0.4382,1.3658,-9.7876,2.6147,9.6296,6.64,540
-3.8301,-9.9177,0.1198,2.8008,-9.9177,1.1896,11.4567,4.5528,541
-2.3739,-10.2572,0.8558,3.5727,-10.2572,7.2588,24.1465,13.2272,542
-2.0747,-9.9445,2.2337,2.5407,-9.9445,3.9704,19.828,13.4762,543
-14.1163,-9.589,-0.3736,6.3134,-9.589,5.6892,15.8838,11.9866,544
-18.4293,-9.4877,6.2294,13.0779,-9.4877,11.9662,33.3433,18.9162,546
-3.2719,-9.9393,3.4977,5.351,-9.9393,9.2912,26.223,16.7511,547
-0.5677,-9.8405,1.2887,3.3371,-9.8405,3.8644,15.6916,7.4797,548
-2.2349,-8.7951,-0.0001,1.2308,-8.7951,1.1628,15.6708,8.8885,549
-0.6609,-9.0364,0.9004,1.6443,-9.0364,1.9379,9.7319,7.146,550
-3.9299,-8.7748,-0.7345,1.6783,-8.7748,3.5685,23.2588,12.3845,551
-8.2715,-9.1209,3.5983,8.5586,-9.1209,5.2855,37.3843,17.6721,552
-4.6803,-9.6901,-0.348,2.2338,-9.6901,1.5188,14.2815,10.8551,553
-5.6486,-9.844,3.4594,5.5959,-9.844,6.4659,26.6592,13.6576,554
-35.7233,-9.7166,6.532,22.1854,-9.7166,13.8895,43.0159,19.8511,556
-9.8598,-9.5125,0.0103,5.1796,-9.5125,2.9231,19.6532,8.4771,557
-2.3381,-10.4444,0.0079,1.7078,-10.4444,1.5912,22.2464,11.2428,558
-2.4924,-9.4985,1.4433,2.7581,-9.4985,3.9512,14.0671,9.7676,559
-5.7358,-10.1209,2.0727,4.8693,-10.1209,4.4421,18.1539,16.8598,560
-1.6292,-10.2547,1.1848,2.8033,-10.2547,2.8767,12.5331,9.3401,561
-16.5584,-10.1334,-1.748,10.3342,-10.1334,1.1604,26.6314,20.4921,562
-6.8164,-8.4951,7.6418,11.1423,-8.4951,9.6625,20.888,16.0539,563
-1.6199,-9.8523,-0.1279,1.1809,-9.8523,1.7899,16.2425,9.598,564
-1.841,-10.0217,2.4184,2.8116,-10.0217,1.4263,14.8749,13.2351,565
-15.6114,-9.3826,0.0027,3.6387,-9.3826,4.4007,25.3724,10.343,567
-0.4513,-10.3574,0.1124,0.4877,-10.3574,1.0252,9.3817,6.3216,568
-18.8604,-10.0148,0.5584,8.4915,-10.0148,6.2123,21.9419,15.5571,569
-11.8757,-10.2077,0.7355,4.9606,-10.2077,3.1552,22.501,12.1879,571
-27.9761,-9.9823,0.4648,12.0934,-9.9823,9.2789,29.6649,14.5625,572
-1.1922,-10.0698,1.065,3.4319,-10.0698,3.9244,10.8616,7.6808,573
-2.3348,-9.7749,-0.1943,0.9309,-9.7749,1.6321,12.0712,6.8252,574
-0.8826,-9.962,0.6696,1.4487,-9.962,3.0544,11.5496,7.2137,575
-5.4505,-10.1399,-0.3227,1.7797,-10.1399,4.1808,12.6929,5.6451,577
-5.8731,-10.2003,2.1431,3.8537,-10.2003,1.5744,17.9152,9.7525,578
-5.9909,-9.9035,-1.7038,3.0751,-9.9035,3.799,13.0661,9.471,579
-2.2818,-8.8751,-0.5705,0.9427,-8.8751,2.2724,19.1332,15.4508,580
-2.2392,-9.0473,-0.2991,1.6897,-9.0473,2.2833,34.2455,12.6286,581
-28.9191,-8.484,1.7497,22.5172,-8.484,2.694,24.2608,15.8797,582
-16.0432,-9.3769,-3.0481,6.3865,-9.3769,6.0641,22.7475,10.658,583
-4.2335,-10.0394,2.6486,5.3686,-10.0394,2.9044,12.0812,9.311,584
-7.2931,-10.0096,-0.6872,4.365,-10.0096,5.7753,23.975,8.3733,585
-9.4441,-9.682,0.2012,5.4717,-9.682,5.5603,24.9109,11.239,587
-32.7718,-9.7713,4.6611,26.234,-9.7713,12.0023,41.5176,34.5294,588
-3.3907,-10.3519,-0.3736,1.3551,-10.3519,2.0634,25.0862,8.9502,589
1.932,-9.3205,13.7618,10.9123,-9.3205,6.262,26.8506,21.7989,590
-5.3171,-8.7513,1.1647,4.1036,-8.7513,6.0505,15.4005,11.1396,591
-3.5578,-9.6575,-0.8385,1.9513,-9.6575,2.0471,17.7711,6.2435,592
-15.1425,-10.3866,2.9106,11.9382,-10.3866,9.1945,31.9203,18.1388,593
-19.3882,-7.4984,-4.1685,6.8767,-7.4984,7.8488,41.8296,14.1273,594
-12.3069,-9.6756,-2.094,8.8914,-9.6756,10.203,34.1907,23.6711,595
-9.9147,-10.0135,1.7458,7.0995,-10.0135,8.8255,26.0057,8.0741,597
-9.9039,-10.0618,-2.3991,4.7811,-10.0618,0.7571,9.2514,7.455,598
-4.7223,-9.8069,-1.3812,1.6685,-9.8069,1.4924,13.9088,11.0717,600
-17.1115,-9.8274,3.7705,11.7402,-9.8274,4.1133,15.2271,14.1934,601
-4.2729,-9.4649,-0.8329,3.1459,-9.4649,1.2487,12.3108,6.2234,602
-6.3274,-9.9054,-1.421,2.6781,-9.9054,2.4268,9.1319,5.9331,603
-16.147,-9.7875,0.5688,7.0986,-9.7875,3.1209,16.1226,8.6126,604
-5.7906,-10.2306,-0.8316,3.634,-10.2306,1.282,10.0746,7.7971,605
-4.8671,-10.0417,0.5261,3.3761,-10.0417,3.9008,8.974,6.3196,606
-5.4989,-9.7267,4.5138,9.1259,-9.7267,8.6796,26.2093,14.1195,607
-2.7187,-9.8499,2.9237,6.9091,-9.8499,6.0545,19.9106,9.8786,608
-6.5111,-9.7945,-0.1982,2.1842,-9.7945,3.0142,14.7728,9.5411,609
-11.9646,-10.566,-0.7507,5.681,-10.566,3.15,16.088,13.51,610
-3.4845,-8.3969,0.7398,3.4967,-8.3969,2.6976,36.656,8.0447,611
-7.0925,-9.5487,-0.7216,2.7787,-9.5487,2.2495,10.6002,8.7594,612
-5.6401,-9.5661,3.3782,6.3339,-9.5661,6.4784,14.0613,9.07,613
-15.6729,-9.807,-2.0851,7.3715,-9.807,5.8764,14.8973,11.3592,614
-3.0048,-9.3956,2.8929,5.035,-9.3956,4.5667,21.7718,17.2079,615
-3.6576,-9.3817,0.1412,2.5439,-9.3817,2.5684,14.8545,8.3118,616
-12.6504,-10.2706,-2.4229,5.8273,-10.2706,10.4003,22.7233,14.456,617
-1.3705,-9.5369,2.8351,3.4817,-9.5369,6.7134,17.6816,15.3184,618
-7.1136,-10.0212,-0.8893,3.5718,-10.0212,4.4907,9.1608,6.7168,619
-1.8895,-9.9504,-0.6292,0.6649,-9.9504,1.5812,15.4521,9.0403,620
-18.7366,-9.7244,-5.745,7.0861,-9.7244,8.3052,27.5764,16.218,621
-16.031,-9.9556,4.6498,12.2312,-9.9556,7.6239,19.4295,11.2931,622
-58.6739,-9.2699,8.4789,45.9933,-9.2699,19.7656,62.7218,39.9637,623
7.5119,-9.6918,44.4494,24.0881,-9.6918,3.9124,31.2462,29.2738,624
-15.6684,-9.3359,-2.8684,6.0731,-9.3359,7.3279,29.6393,11.0872,625
-26.8333,-9.817,-1.9337,7.3598,-9.817,6.0913,13.8087,7.8858,626
-9.4614,-9.4213,0.1916,5.636,-9.4213,4.0799,17.1218,12.7683,627
-11.8893,-10.0735,-0.7317,6.7459,-10.0735,3.9362,23.7204,13.2102,628
-3.3548,-9.9457,0.1156,2.7427,-9.9457,7.3496,28.2228,11.2783,629
-5.026,-10.04,5.5754,11.0602,-10.04,9.6282,22.351,15.5441,630
-5.6376,-9.8283,-0.3817,3.4135,-9.8283,6.3692,16.5833,9.0774,631
-6.6419,-9.445,1.1356,3.4688,-9.445,4.3173,12.9714,7.4388,633
-9.7162,-9.9462,-0.7227,6.145,-9.9462,7.5682,15.1616,9.5961,634
-16.0012,-9.3267,3.0871,9.3142,-9.3267,9.4276,37.4414,11.6114,636
-2.0902,-9.904,1.5893,2.3093,-9.904,3.958,14.0661,6.3242,637
-0.5964,-10.0045,0.1296,0.6343,-10.0045,2.2038,6.0873,4.7119,638
-0.7516,-9.8397,-0.3041,0.2555,-9.8397,1.6816,5.8753,3.5919,639
-1.6584,-9.9646,-0.0008,0.9886,-9.9646,1.4451,6.0269,5.1129,640
-2.4565,-10.0529,1.8914,4.2145,-10.0529,1.1995,13.5528,7.6247,641
-3.8933,-9.5975,-0.1042,2.7615,-9.5975,5.2103,22.4324,12.3158,642
-0.0034,-10.1172,3.5833,3.0429,-10.1172,2.394,12.4569,9.0001,643
-6.475,-10.0251,1.119,3.0418,-10.0251,7.5969,19.73,13.7256,644
-17.6787,-10.3741,10.9763,18.9743,-10.3741,2.177,27.7243,23.2993,645
-13.9586,-9.9613,1.4875,7.3797,-9.9613,6.8086,22.6772,11.7825,647
-2.2167,-9.6169,3.7495,4.1981,-9.6169,9.6916,18.8455,13.8848,648
-8.3702,-10.2934,1.5921,6.3994,-10.2934,5.1309,36.6492,13.7557,649
-7.2127,-9.3793,0.5085,4.7864,-9.3793,4.1668,28.8954,12.233,650
-5.6803,-9.7829,4.6957,7.5577,-9.7829,1.71,26.0976,23.1772,651
0.3596,-9.9425,1.7288,1.325,-9.9425,2.3763,20.6744,10.0245,652
-1.125,-9.886,2.8947,2.4171,-9.886,6.4355,12.5351,10.1265,654
-4.2222,-9.9103,0.7829,4.0207,-9.9103,4.968,20.9244,7.4436,656
-6.0791,-9.9856,3.2606,6.1902,-9.9856,6.5466,23.6925,18.6407,657
-1.0486,-10.045,0.2731,0.777,-10.045,4.9736,29.0515,25.1229,658
-0.455,-9.933,5.4828,4.1317,-9.933,3.0598,25.4256,20.6623,659
-1.0049,-9.6532,0.0734,0.6341,-9.6532,1.6988,9.6791,5.5472,660
-1.8283,-9.7228,0.7135,1.3792,-9.7228,1.0092,6.1462,4.9814,661
-3.3007,-10.0121,0.1949,1.9861,-10.0121,1.4791,5.8211,4.371,662
-5.0956,-9.9402,-0.0988,1.6076,-9.9402,3.3389,22.0059,13.0469,663
-8.0035,-9.9665,0.9307,2.8571,-9.9665,4.5151,16.6993,11.4652,664
-0.9781,-9.9538,0.4258,1.1765,-9.9538,1.6961,13.5644,7.4179,665
-2.0056,-9.9384,0.9728,1.7869,-9.9384,5.0908,23.3417,14.0842,666
-12.82,-9.9246,-0.1704,4.5291,-9.9246,4.708,21.6588,16.4856,667
-2.9809,-9.9654,1.9713,3.6355,-9.9654,6.9644,25.672,16.2315,668
-11.3865,-9.9781,-0.837,4.0352,-9.9781,3.3708,14.2086,9.3454,669
-11.9118,-10.0336,2.6742,6.4886,-10.0336,8.9868,42.4602,18.4861,670
-23.784,-9.6516,0.2112,9.5357,-9.6516,13.4537,46.1654,24.9079,671
-1.9561,-9.5392,7.488,9.6523,-9.5392,8.1094,16.6617,13.0706,672
-10.5696,-9.9149,0.0846,5.4282,-9.9149,9.1727,38.7794,35.2418,673
-5.0868,-10.0753,-0.5233,2.1582,-10.0753,4.1751,21.5998,13.8542,674
-0.0901,-9.763,2.8036,3.4824,-9.763,6.2712,17.0081,10.1927,675
-35.4485,-9.3379,0.422,7.3343,-9.3379,4.4331,61.4562,12.0369,677
-21.2886,-9.5646,3.9435,10.9142,-9.5646,6.1324,52.9427,20.4947,678
-6.9376,-10.2453,-0.2074,3.2592,-10.2453,5.7975,16.8076,8.9202,679
-0.2254,-9.8638,2.4988,3.0157,-9.8638,3.6559,12.7665,5.8487,680
-8.1301,-9.238,-1.8841,2.9335,-9.238,3.4067,15.5361,11.0832,681
-5.7595,-9.9043,-0.7762,3.2336,-9.9043,4.1661,14.4542,11.1044,682
-4.6201,-9.9282,1.8402,3.3411,-9.9282,5.4227,12.1983,8.6065,683
-43.7214,-9.8425,2.6225,16.1976,-9.8425,10.5605,39.2222,10.4104,686
-1.1926,-9.5702,0.1596,1.3368,-9.5702,1.4919,16.9047,5.8684,687
-7.5556,-9.471,-0.7332,3.842,-9.471,1.6988,11.5156,7.5934,688
-24.8305,-10.068,0.3156,10.3344,-10.068,6.5673,21.139,11.8842,690
-25.2766,-10.2786,-1.8513,10.9461,-10.2786,3.5833,16.1167,8.9443,691
-5.9698,-10.0746,-0.5725,3.0077,-10.0746,6.8665,26.3936,13.3281,692
-3.4623,-9.9636,-0.5227,1.2013,-9.9636,2.396,12.5148,9.3061,693
-1.4609,-10.0852,-0.035,0.8885,-10.0852,1.5013,19.0191,14.2861,694
-0.2401,-9.8842,1.2575,1.7405,-9.8842,6.805,25.097,20.4166,695
-2.7183,-9.9247,1.2024,1.9921,-9.9247,4.0536,13.9331,10.8315,696
-32.5563,-10.0112,1.8868,18.1063,-10.0112,8.7833,24.9362,15.1219,697
-14.4287,-9.9245,1.486,5.3178,-9.9245,7.7271,21.4468,12.1061,698
-4.2673,-9.9971,1.3264,2.4631,-9.9971,4.8307,19.9487,10.7169,699
-3.3517,-9.9893,1.3383,2.3082,-9.9893,6.7044,20.0693,11.2863,700
-7.5432,-9.9016,0.2475,3.8745,-9.9016,5.2341,15.0616,8.6696,701
-13.5721,-9.9051,0.3159,4.96,-9.9051,7.0053,20.8208,9.7143,702
-2.3589,-9.8457,0.564,2.3582,-9.8457,1.2643,12.7122,8.4117,703
-6.1528,-9.9509,1.1333,3.2182,-9.9509,4.3134,13.515,6.394,704
-1.7162,-9.8934,0.429,1.2688,-9.8934,2.8956,6.7066,4.3826,705
-10.9005,-9.8835,10.4651,16.7321,-9.8835,13.6447,32.7763,16.7429,706
-11.1075,-9.8187,1.9699,5.25,-9.8187,7.7827,19.4429,10.8721,707
-11.5497,-9.9467,-1.0886,4.276,-9.9467,2.8092,17.3831,7.4511,708
0.3966,-10.5004,7.2192,7.0117,-10.5004,6.8979,28.616,19.2512,711
-3.775,-9.4895,-0.7592,1.7787,-9.4895,1.8994,8.1235,6.5379,712
-10.0544,-10.4322,9.2311,13.6273,-10.4322,3.3851,21.3364,16.6741,713
-6.2313,-9.8756,-0.4826,4.0703,-9.8756,3.4965,13.8388,7.5663,714
-5.4716,-9.7027,-1.1349,1.4205,-9.7027,2.3777,10.1337,5.3603,716
-1.5018,-9.9625,2.6727,3.6374,-9.9625,7.4003,18.642,14.8353,717
-4.7754,-9.6601,0.0923,1.8905,-9.6601,2.9826,14.3968,8.306,718
-4.7168,-10.6257,5.9812,8.8919,-10.6257,7.5685,16.4388,10.6044,719
-5.6331,-10.0025,2.7439,6.2201,-10.0025,8.8434,19.0937,11.5801,720
-0.8366,-10.1387,6.5514,5.0539,-10.1387,8.4514,18.3234,13.1212,721
-0.6611,-9.8818,-0.1254,0.4059,-9.8818,0.511,5.092,4.1377,722
-0.7677,-10.1151,-0.1153,0.2907,-10.1151,1.082,9.8529,5.6774,723
-2.3894,-9.8632,-0.5009,0.8486,-9.8632,1.8884,9.8634,5.8486,724
-2.0118,-10.0141,-0.8392,0.6525,-10.0141,1.1763,24.1896,20.994,725
-7.6389,-9.8897,-3.0862,3.0498,-9.8897,1.3454,20.6854,19.5183,726
-3.1728,-10.0186,0.9529,1.7014,-10.0186,3.9368,39.578,30.9568,727
-3.3141,-9.9719,2.1966,3.9498,-9.9719,5.0055,35.067,15.3978,728
-13.0849,-10.1094,3.6171,8.7635,-10.1094,5.7757,27.6386,16.9622,729
-53.2311,-9.8035,1.0714,26.0897,-9.8035,11.0275,49.3414,37.3503,730
-13.5339,-9.9574,2.9388,12.6563,-9.9574,8.1175,28.0703,22.5554,731
-2.2008,-9.8474,-0.0225,1.6656,-9.8474,3.142,7.9216,4.6645,732
-3.5786,-9.5718,2.0407,3.9933,-9.5718,3.6898,20.8495,14.4513,733
-10.5506,-9.6834,-0.0858,6.2611,-9.6834,9.4938,19.5735,15.1872,734
-81.1599,-8.5271,2.0621,26.766,-8.5271,7.0513,76.5468,22.9521,737
-64.6649,-9.912,11.8222,42.5208,-9.912,8.2208,55.0249,27.2444,738
-17.2542,-9.1713,-2.7981,8.2067,-9.1713,2.18,15.4943,11.62,739
-11.9913,-9.5342,8.0072,17.5397,-9.5342,4.0194,19.0957,11.2654,740
-6.5635,-9.4528,-0.6401,3.0091,-9.4528,7.1665,18.2246,11.2028,741
-3.7075,-8.9307,1.9904,4.8662,-8.9307,5.4987,33.307,15.5969,742
-4.5953,-9.4931,0.93,2.9218,-9.4931,4.0221,26.5956,12.544,743
-9.717,-9.9401,-0.2744,5.8494,-9.9401,7.2346,18.6755,15.9552,744
-24.0506,-10.009,-2.6599,8.0335,-10.009,7.7333,32.2869,14.7897,746
-5.2985,-9.6684,0.9574,3.1835,-9.6684,4.4233,23.9822,8.7583,747
-11.1451,-9.9799,1.3735,6.1433,-9.9799,4.9024,19.6965,9.919,748
-12.5499,-9.8283,-0.4374,4.1442,-9.8283,5.0196,17.3815,9.5823,749
-9.2403,-9.9883,0.2842,4.523,-9.9883,5.1509,17.1183,8.4858,750
-3.412,-10.0351,0.4357,2.4616,-10.0351,3.7303,17.1871,6.987,751
-5.7353,-9.8677,-0.1936,4.6645,-9.8677,5.097,16.2941,8.6871,752
-6.3544,-9.1822,-0.0611,2.7262,-9.1822,3.6739,18.0807,11.9976,753
-6.2664,-9.8419,2.606,5.4712,-9.8419,6.1928,16.463,11.465,754
-6.4251,-8.6415,0.0086,3.7277,-8.6415,6.2027,31.5939,10.609,756
-39.8336,-9.1451,-0.26,10.8754,-9.1451,7.5705,27.6964,10.2621,757
-11.5105,-10.2536,5.9047,16.0222,-10.2536,9.3185,31.1813,14.4888,758
-10.988,-9.8747,-2.1167,3.8847,-9.8747,4.3763,14.9545,6.9379,759
-2.8951,-9.6409,0.5878,1.9982,-9.6409,3.9215,19.1674,8.3655,760
-11.6546,-9.8865,-2.0266,4.7903,-9.8865,5.5109,11.7548,8.2661,761
-25.5784,-9.6745,-3.9835,13.3103,-9.6745,8.499,26.4978,18.2194,762
-19.1951,-9.9506,-2.2373,9.8833,-9.9506,6.3592,16.3267,12.7976,763
-6.9216,-9.4556,2.3892,6.6806,-9.4556,8.0072,22.7839,12.9247,764
-7.3518,-9.9246,-0.0888,3.0765,-9.9246,4.9857,21.9996,9.398,766
-3.9789,-9.9068,0.7265,2.1163,-9.9068,2.9762,11.242,7.2701,767
-9.2377,-9.9422,1.5157,5.4987,-9.9422,4.1477,19.9934,12.0507,768
-13.701,-10.032,-0.7842,6.4093,-10.032,1.7159,26.2841,18.0656,770
-9.1242,-10.2182,-1.0703,3.8826,-10.2182,2.3218,10.0969,8.4574,771
-7.4432,-10.0564,1.4074,5.5073,-10.0564,9.6809,20.9756,16.869,772
-11.0212,-9.7625,3.0603,8.3054,-9.7625,1.932,22.6458,11.8323,773
-13.0182,-10.1705,-2.7383,4.0895,-10.1705,6.6426,81.3414,39.6214,774
-28.3959,-9.8722,4.271,16.006,-9.8722,9.3363,76.2868,36.354,776
-32.0054,-9.9037,-5.8898,8.5184,-9.9037,6.5492,54.9715,48.0347,777
-7.2472,-9.8351,1.3135,7.4354,-9.8351,5.3593,20.6816,7.3289,778
5.6036,-9.7035,15.5762,8.2335,-9.7035,3.9617,30.2641,25.8292,780
-9.0066,-9.5197,0.8101,4.8648,-9.5197,4.7312,57.6823,13.3207,781
-29.1188,-9.5652,-1.4058,10.8057,-9.5652,6.6064,78.5766,9.0156,782
-3.5216,-9.8862,2.3012,3.1214,-9.8862,6.7769,25.3919,9.029,783
-11.5945,-9.9542,12.2652,18.9844,-9.9542,12.6531,49.6305,28.0959,784
-2.2039,-10.0168,9.2466,9.2796,-10.0168,7.7975,56.481,27.9749,785
-42.0507,-9.8789,-1.2222,17.8551,-9.8789,6.642,38.1614,15.6551,786
-12.3167,-9.9179,0.8865,7.4865,-9.9179,5.3347,25.2584,17.0483,787
-16.6274,-9.6683,-4.7545,9.0826,-9.6683,5.8552,21.1562,15.6764,788
-9.0764,-7.5696,11.0381,28.2201,-7.5696,7.6607,81.0023,16.1107,789
-8.1426,-9.9812,2.2294,6.2752,-9.9812,5.7435,18.7055,8.4321,790
-8.2978,-10.2351,-2.3771,3.1683,-10.2351,4.1051,19.0412,8.5171,791
-64.7597,-8.9788,-3.0649,27.0416,-8.9788,9.0172,78.6917,28.3462,792
-29.5553,-9.8447,4.6377,17.1587,-9.8447,6.8437,45.3976,30.8028,793
-5.2122,-9.5875,-0.6375,2.6999,-9.5875,1.112,20.801,12.7453,794
-10.5477,-10.2847,-1.5791,4.7309,-10.2847,1.4714,25.5804,18.8155,795
-4.9265,-10.0277,5.6418,7.4617,-10.0277,5.3337,31.6418,27.3704,796
-3.5496,-9.9148,0.7521,2.4529,-9.9148,2.0022,12.4804,9.1945,797
-2.6017,-9.2786,1.5276,2.938,-9.2786,1.0245,10.3675,7.8469,798
-5.4161,-9.4944,3.9644,4.799,-9.4944,9.7412,22.4996,17.8654,799
-4.9888,-9.7085,4.3137,7.3929,-9.7085,8.9714,24.2876,13.5939,801
-13.9612,-9.9979,7.204,12.7314,-9.9979,13.7128,33.2544,18.5513,802
-0.2313,-10.6573,1.5622,1.9234,-10.6573,5.8928,20.1804,14.5017,803
-1.1298,-9.4982,0.4522,1.2837,-9.4982,1.7382,13.9616,5.6096,804
-6.3516,-10.7277,-0.1553,3.2301,-10.7277,3.831,18.8634,8.8209,805
-3.8256,-9.5927,-1.1401,2.2555,-9.5927,1.5084,16.9804,10.0952,806
-1.6816,-9.7446,-0.4653,1.1058,-9.7446,1.3951,7.3338,3.9932,807
-3.1878,-9.8673,0.8954,2.3252,-9.8673,4.3041,15.4036,8.9835,808
-1.658,-8.4199,3.6066,5.2313,-8.4199,5.5094,29.9913,11.2517,809
-0.1319,-10.0378,4.1343,3.4364,-10.0378,7.1731,20.7723,12.4597,810
-14.7371,-9.1926,6.1502,18.4375,-9.1926,12.9852,38.9162,19.6139,812
-26.6956,-10.1341,2.0812,11.1856,-10.1341,11.171,37.6084,13.9484,813
-4.7012,-9.593,9.5297,15.0397,-9.593,10.7619,31.2033,23.0304,814
-2.3891,-9.0412,5.4015,8.6863,-9.0412,6.0547,17.3825,11.5846,815
-7.4467,-9.6259,-0.8131,3.4062,-9.6259,4.443,20.7897,12.2109,816
-15.6027,-9.9557,-0.2811,4.7281,-9.9557,5.7883,20.2158,8.4031,818
-3.8,-10.209,-0.1957,1.4791,-10.209,2.4201,19.3076,7.2762,819
-5.6853,-9.9795,0.9957,3.3299,-9.9795,5.628,23.88,10.569,820
-6.1639,-9.4348,2.0341,4.0915,-9.4348,4.436,15.3069,8.2961,822
-5.6607,-9.8836,0.4057,2.6007,-9.8836,4.7339,19.5837,9.5995,823
-4.804,-10.0284,-0.4774,3.1625,-10.0284,3.1011,16.5223,12.6326,824
-3.0725,-9.0398,0.7951,2.7952,-9.0398,4.982,20.1241,10.8601,825
-1.0263,-10.7287,-0.0751,0.9061,-10.7287,1.8767,13.4023,5.8816,826
-13.057,-8.9132,10.4844,16.0959,-8.9132,13.4527,26.906,20.3117,827
-51.8443,-9.3186,-1.7252,13.1978,-9.3186,7.9832,29.012,15.8984,828
-7.9372,-10.5554,-2.3522,4.0208,-10.5554,3.1312,17.566,9.9288,829
-8.9699,-9.8174,4.4162,6.9403,-9.8174,6.5891,21.9887,10.2926,830
-5.4358,-7.8939,0.2679,2.9461,-7.8939,3.9762,37.5808,9.0159,831
-14.1329,-10.2308,4.6192,10.5892,-10.2308,12.3572,31.885,14.8549,832
-11.7399,-8.8855,-0.3695,10.5823,-8.8855,5.7408,28.0798,19.5015,834
-8.7818,-8.7112,3.3869,11.1629,-8.7112,10.0226,30.8024,12.2239,835
-12.8239,-9.5999,3.1769,6.9481,-9.5999,9.7363,30.3193,13.7135,837
-5.0477,-9.6565,6.7198,6.0324,-9.6565,2.3298,20.1969,15.306,838
-5.7984,-9.9992,-0.1977,2.7245,-9.9992,2.4139,13.9073,9.4896,839
-3.1818,-9.9636,-0.3865,2.0299,-9.9636,1.7243,8.405,6.7061,840
-4.811,-10.036,0.1858,3.0781,-10.036,2.9444,13.7948,7.4672,842
-12.2509,-10.6848,-0.8367,7.153,-10.6848,2.624,15.4419,10.7077,843
-2.0961,-10.7403,9.1787,7.3082,-10.7403,1.0118,19.9224,12.6367,844
0.0641,-10.3408,3.2329,3.4455,-10.3408,2.8511,12.2912,8.2519,845
-1.3478,-10.0263,4.8555,5.1431,-10.0263,1.5125,19.1967,13.2238,846
-5.9143,-10.1093,0.3964,3.2893,-10.1093,5.3139,11.9331,7.7614,847
-15.4119,-10.9285,2.8175,8.3774,-10.9285,8.8368,16.2242,12.7657,848
-5.6743,-9.9323,-0.1385,2.2593,-9.9323,4.0466,12.1343,8.5256,849
-1.5334,-9.9403,0.5432,2.2237,-9.9403,3.3296,11.3354,7.6988,850
-7.7119,-9.9774,2.6852,7.659,-9.9774,10.0715,31.3519,12.8668,852
-0.369,-9.3894,0.3001,0.8364,-9.3894,2.3783,16.0117,11.2035,853
-10.4881,-10.0054,-1.6907,3.9477,-10.0054,3.7029,16.4466,9.043,854
-1.5625,-10.2856,1.0982,1.8861,-10.2856,3.0055,15.8396,10.0108,855
-2.344,-9.8463,5.5316,5.9282,-9.8463,2.3518,14.6336,12.4766,856
-4.025,-9.8806,-0.412,2.4251,-9.8806,3.2922,10.1625,9.1466,857
-2.8814,-9.4374,0.1524,2.1801,-9.4374,2.6875,11.0694,6.4011,858
-8.3305,-10.33,-0.7263,3.9826,-10.33,4.8503,16.6698,12.4324,859
-1.5489,-9.3683,-0.3045,0.6604,-9.3683,1.3749,12.4694,8.74,860
-3.8126,-9.9711,0.4622,1.6154,-9.9711,3.9082,11.3501,7.8613,862
-4.474,-10.0333,1.0753,3.0336,-10.0333,3.1851,9.2083,7.4669,863
-6.942,-9.8052,2.2765,7.3192,-9.8052,5.2754,20.3301,13.9937,864
-13.2338,-7.1753,0.1319,8.2392,-7.1753,3.7119,27.5302,9.6046,865
-1.3029,-3.3132,3.3383,6.1191,-3.3132,2.2875,20.3695,8.1534,866
-0.6926,-10.0866,1.9736,3.0134,-10.0866,6.1742,13.8552,9.1787,867
-5.7575,-8.8505,-1.047,2.2107,-8.8505,4.3297,12.1488,8.5164,868
-1.876,-9.7611,-0.5085,1.3163,-9.7611,2.0002,6.5307,5.384,870
-5.2738,-10.3111,2.2742,5.1519,-10.3111,5.6011,12.8592,8.2344,871
-12.3554,-9.9107,1.6788,4.3519,-9.9107,7.7872,16.9544,11.6333,872
-11.3436,-9.3204,-0.7014,5.8634,-9.3204,5.5076,17.7689,15.4311,873
-4.2822,-9.9722,0.5635,1.8574,-9.9722,3.6843,11.3284,7.3961,874
-0.972,-9.6749,1.7593,3.4977,-9.6749,2.4192,9.442,7.3485,875
-23.2092,-9.7237,-0.4398,7.9944,-9.7237,7.5637,18.4818,10.9617,876
-5.8695,-9.9424,2.8848,4.9834,-9.9424,8.1111,21.2154,14.8098,877
-5.4003,-9.1502,1.9915,5.3026,-9.1502,6.2481,25.2587,11.6512,878
-5.9614,-9.9797,2.7364,6.5134,-9.9797,10.5701,24.6557,13.7094,879
-118.9755,-6.5412,-23.9676,57.8924,-6.5412,18.0493,89.9802,37.3105,880
-15.0326,-9.5907,-0.9499,9.9767,-9.5907,6.9714,20.5177,11.2085,881
-35.4103,-10.1792,-3.3302,9.7012,-10.1792,5.6104,39.3179,14.9295,882
-5.2202,-9.3405,4.7064,5.6076,-9.3405,2.1794,14.9616,10.4063,883
-10.1503,-9.257,-0.7076,4.4441,-9.257,5.1063,18.2336,10.0327,884
-12.8733,-10.2076,2.5683,9.3022,-10.2076,4.4287,31.9128,14.6726,885
-2.6556,-9.7845,7.315,7.3948,-9.7845,10.3171,20.6961,18.6354,886
-0.1446,-9.6664,2.9211,2.4069,-9.6664,2.4984,11.4737,9.5591,887
-3.439,-10.7353,3.1833,7.5883,-10.7353,4.5773,22.3873,16.2407,888
-6.5783,-9.9576,2.8149,4.1021,-9.9576,6.9279,22.4706,13.2562,889
0.2347,-10.1593,4.4661,3.4766,-10.1593,6.1977,18.3894,12.5015,890
-1.8776,-9.9136,1.1328,2.001,-9.9136,4.92,12.4829,7.7979,891
-2.0565,-10.0098,0.7389,2.285,-10.0098,3.3759,11.0098,6.1649,892
-0.7045,-9.7504,1.7927,2.449,-9.7504,3.5842,8.9123,7.2304,893
-1.3163,-10.0636,1.0954,2.3168,-10.0636,3.443,9.7299,6.6166,894
-1.0507,-10.4982,1.1833,2.079,-10.4982,5.0264,11.1901,9.5263,895
-1.3402,-9.755,1.1692,2.4891,-9.755,4.4298,10.8938,5.8481,896
-13.221,-8.8723,2.5871,13.2886,-8.8723,6.3117,18.6341,12.8923,897
-1.8977,-9.3568,1.2381,3.0457,-9.3568,4.7005,18.511,7.9714,898
-32.3431,-8.9119,-2.5303,8.5288,-8.9119,3.8343,19.4293,8.1997,899
-22.0615,-9.2971,6.2724,18.599,-9.2971,9.621,29.1837,16.1956,900
-18.2415,-9.5481,1.3397,9.6148,-9.5481,8.9693,23.9645,15.6389,901
-21.0498,-7.093,-0.1064,8.4768,-7.093,6.2808,25.0815,13.043,902
-22.9585,-9.3971,-3.7489,12.086,-9.3971,11.7182,29.0111,20.6579,903
-35.4858,-9.4896,1.9989,18.9175,-9.4896,10.7185,22.2437,19.2599,904
-2.6593,-9.5593,1.4369,2.1268,-9.5593,4.1957,14.7652,10.3114,905
-6.5651,-9.3769,-0.7843,3.0982,-9.3769,3.113,13.321,7.8443,906
-3.5513,-10.0484,3.2987,4.9077,-10.0484,4.6482,17.8796,14.4494,907
-4.6739,-10.3645,-0.7629,1.8757,-10.3645,2.1687,9.9572,8.1238,908
-2.3923,-8.9988,-0.1826,1.3926,-8.9988,3.5774,15.4138,11.3505,909
-7.2912,-9.6149,0.8049,8.0095,-9.6149,6.1647,26.4955,7.4796,911
-10.5315,-9.6057,0.3437,6.9881,-9.6057,7.6605,37.6637,12.3076,912
-2.5325,-10.1573,5.0968,4.6166,-10.1573,5.3778,29.4321,20.1168,913
-3.634,-10.1889,1.3596,3.5721,-10.1889,4.1455,10.662,8.179,914
-5.1278,-9.8333,0.4753,4.6612,-9.8333,6.1411,12.3994,8.2453,915
-8.7779,-9.9259,0.6488,3.0005,-9.9259,5.0959,19.9161,8.572,917
-33.9265,-9.5997,-6.6278,13.5832,-9.5997,7.7995,25.8462,19.4001,918
-103.8312,-9.3744,3.8907,82.4705,-9.3744,29.9915,65.4069,45.2136,919
-4.0976,-9.8802,0.3755,2.4802,-9.8802,1.8613,27.4665,22.5011,920
-7.1869,-9.9146,8.3704,17.2917,-9.9146,13.5005,30.2125,22.357,922
-22.4539,-9.8567,5.4614,15.0565,-9.8567,9.2415,31.8459,23.0129,923
-25.3879,-9.4244,-3.0073,10.7654,-9.4244,8.1048,20.6668,16.4677,924
-13.6451,-8.9242,5.5005,14.8729,-8.9242,1.8112,18.6467,14.4434,925
-10.1754,-9.9646,1.6261,5.7564,-9.9646,5.3715,20.4914,18.0703,926
-3.4117,-9.9416,10.4827,12.6065,-9.9416,8.5811,25.9342,23.8297,927
-5.0053,-9.8289,3.2342,10.5726,-9.8289,2.4977,17.384,14.9575,928
-1.8166,-9.8826,5.8516,6.6545,-9.8826,5.1231,22.2135,16.8499,929
-6.0927,-10.0294,13.4344,17.0039,-10.0294,6.9722,33.4739,27.7973,930
-16.6717,-9.8582,2.5281,6.9698,-9.8582,9.6384,27.5047,14.9076,932
-3.6746,-9.7742,2.3167,3.805,-9.7742,3.0091,12.8539,9.5829,933
-6.9281,-10.0438,1.4282,5.6907,-10.0438,4.9879,18.4367,11.4148,934
-1.7343,-9.2694,2.8637,5.248,-9.2694,5.3233,13.5088,10.5323,935
-1.1016,-10.2951,-0.0739,0.5022,-10.2951,1.8295,8.1627,4.7363,936
-1.7772,-10.1497,-0.5992,0.9454,-10.1497,2.0453,20.4192,6.1645,937
-1.4798,-9.7566,0.1839,1.1013,-9.7566,2.8142,6.4458,5.3564,938
-22.4338,-9.7449,0.7287,9.0948,-9.7449,11.1463,21.8179,11.4125,939
-20.1036,-6.3224,-2.2852,8.1824,-6.3224,7.0966,56.3913,20.7601,940
-21.0337,-9.8266,7.2149,15.3618,-9.8266,11.3897,37.4628,19.4662,942
-4.2824,-9.9327,19.0685,12.0292,-9.9327,4.5282,35.899,31.6362,943
-8.1111,-9.7702,5.5084,11.7756,-9.7702,2.0769,24.1083,22.4458,944
-2.3162,-10.127,3.8711,3.866,-10.127,5.1965,18.3201,13.0993,945
-3.8143,-9.792,-2.5532,0.8661,-9.792,2.375,12.781,7.7108,946
-5.1464,-9.8083,-1.4595,1.9026,-9.8083,1.8634,12.5443,7.81,947
-4.4519,-9.6579,7.9175,8.4659,-9.6579,3.1847,16.5551,15.4035,948
-3.7492,-10.0123,1.7059,5.0654,-10.0123,3.8715,19.612,6.0162,949
-9.1215,-9.9917,4.2401,7.8853,-9.9917,12.0738,24.1389,15.8063,951
-6.5529,-10.0012,-0.1394,3.7529,-10.0012,4.9636,16.411,7.8449,952
-1.9843,-9.9185,4.9062,6.6704,-9.9185,11.0139,20.6844,14.2294,953
-4.9467,-9.6999,-0.2697,2.5005,-9.6999,3.337,12.8569,5.3939,954
-7.9883,-9.8752,-0.1089,4.6837,-9.8752,4.782,15.6365,10.3081,956
-34.0248,-9.5351,1.2955,9.7884,-9.5351,8.7587,38.0215,10.1944,957
-39.0773,-7.4213,-3.6641,13.9142,-7.4213,7.4595,76.5899,13.4888,959
-11.2808,-10.5477,2.4194,9.2852,-10.5477,6.6272,31.3679,25.9962,960
-64.0916,-9.325,-8.1418,18.1677,-9.325,7.7203,26.3583,15.1052,961
-8.1282,-10.0068,2.7457,9.5347,-10.0068,7.4247,28.6986,16.1466,962
-6.5557,-9.707,-0.398,3.1808,-9.707,3.668,11.0173,7.5308,963
-4.1432,-10.3838,3.4434,4.9521,-10.3838,4.4731,23.1094,19.6343,964
-17.1074,-9.661,-1.319,9.5591,-9.661,6.3251,21.3312,12.3251,965
-6.6695,-5.3791,-0.252,4.02,-5.3791,4.5632,33.5304,15.8986,966
-1.7545,-9.3827,1.5949,2.7603,-9.3827,2.61,13.768,11.0747,967
-2.2361,-9.9941,-0.3496,0.9739,-9.9941,2.1329,8.8703,6.5371,968
-7.9665,-9.5746,1.492,4.756,-9.5746,5.8437,17.8967,15.3404,969
-4.3279,-9.9194,1.8538,3.7449,-9.9194,5.1447,9.6552,7.1784,970
-0.5657,-9.2908,5.5996,4.3845,-9.2908,4.1933,16.6417,12.7433,971
-17.1515,-9.7482,-0.0512,5.8863,-9.7482,5.4159,21.1768,10.0935,972
-94.3558,-9.6165,-6.0826,26.6467,-9.6165,11.9353,33.0362,12.9116,973
-4.4667,-10.3229,0.6635,5.4833,-10.3229,2.4821,11.0511,5.7107,974
-11.7113,-9.5246,3.0828,8.8603,-9.5246,6.7182,55.8998,23.7847,975
-1.3292,-7.9525,2.8332,3.2936,-7.9525,4.6112,46.892,14.6711,976
-3.4791,-10.4114,1.9663,4.328,-10.4114,3.0075,18.418,11.884,977
-2.1845,-10.0821,0.3948,1.9583,-10.0821,2.094,13.7542,8.5229,978
-17.1514,-10.0396,9.6395,16.3993,-10.0396,14.907,40.5464,27.5059,979
-15.4406,-9.8502,0.1534,7.4114,-9.8502,8.9106,25.48,14.3668,981
-4.3983,-9.9779,-0.5902,1.6024,-9.9779,3.3368,11.6663,6.0828,982
-18.6746,-9.3483,-0.9156,5.0869,-9.3483,5.5636,32.0763,7.7943,983
-24.4351,-10.0762,1.4256,9.4534,-10.0762,6.2145,21.6635,12.7072,984
-33.4304,-10.0795,-3.9907,14.1849,-10.0795,5.3972,27.804,11.4361,985
-8.5804,-10.0255,-4.3477,2.9423,-10.0255,3.9918,14.6605,8.7605,986
-4.8288,-9.9109,0.6367,3.6781,-9.9109,3.1942,12.3159,9.7236,987
-2.3441,-9.8615,0.8488,2.4927,-9.8615,3.8429,13.5787,10.4821,988
-5.5329,-9.7152,-0.195,3.124,-9.7152,2.7721,12.2556,8.5035,989
-3.7576,-10.0761,1.4771,3.4406,-10.0761,4.9469,18.3837,10.5886,991
-3.6738,-10.0044,-0.9148,1.4624,-10.0044,2.6722,10.5707,5.9675,992
-7.9801,-9.835,-1.2187,2.9286,-9.835,2.9973,8.0058,5.9348,993
-3.9533,-9.9092,2.1898,4.2161,-9.9092,3.6999,15.0554,11.3355,994
-11.9924,-9.9568,1.6653,6.9863,-9.9568,3.906,18.8137,9.568,995
-3.0508,-9.9215,0.6435,2.3946,-9.9215,5.2237,16.272,6.7919,997
-11.0067,-9.9392,1.127,6.1848,-9.9392,9.3142,27.5214,12.9599,998
-11.0137,-9.9617,1.6974,5.1726,-9.9617,6.2979,13.7907,8.0517,999
-6.5074,-10.0636,3.3621,11.0016,-10.0636,7.8242,27.6876,11.0589,1001
-8.3535,-9.9824,5.208,10.3073,-9.9824,6.8866,23.3154,14.8937,1002
-1.4973,-9.9193,-0.1748,0.6808,-9.9193,2.2371,10.3822,7.9203,1003
-0.6091,-10.4967,4.9156,4.3223,-10.4967,8.6652,19.2086,16.6727,1004
-1.361,-9.7419,-0.2745,0.6398,-9.7419,1.3468,5.025,3.5635,1005
-1.9001,-9.9034,0.5234,1.43,-9.9034,2.8311,9.6013,6.2636,1006
-1.1951,-10.0774,-0.1376,0.7854,-10.0774,1.034,7.8873,5.1373,1007
-0.6028,-9.9344,3.6415,4.8806,-9.9344,4.6374,16.0873,9.803,1008
-23.5207,-9.4484,1.0262,12.6859,-9.4484,5.7083,46.9337,20.7423,1009
-21.4838,-9.8658,1.0392,8.3994,-9.8658,5.6905,50.1031,9.6213,1010
-3.4893,-9.9703,0.901,2.712,-9.9703,2.838,17.8441,8.6787,1011
-10.4092,-10.0456,1.6223,4.6735,-10.0456,3.8014,18.3349,11.4874,1012
0.223,-9.6266,2.2806,2.0309,-9.6266,3.759,16.9644,7.0132,1013
-1.8255,-9.5725,0.1578,1.8498,-9.5725,1.4894,13.2115,11.3884,1014
-1.4826,-10.2325,0.8058,1.5643,-10.2325,1.0423,16.5721,11.7536,1015
-4.8086,-10.25,-2.622,1.8933,-10.25,0.7072,9.3497,6.4961,1016
-1.1258,-9.9299,0.0068,0.4831,-9.9299,1.6187,10.1155,8.0206,1017
0.2818,-9.6632,3.1682,1.7498,-9.6632,1.5188,16.9526,11.4148,1018
-25.0061,-9.9001,-0.4475,12.6034,-9.9001,6.519,21.6757,14.7215,1019
-6.5948,-9.7228,10.095,10.2556,-9.7228,2.7684,47.7877,29.0856,1020
-7.8079,-9.7966,2.4916,5.9018,-9.7966,8.3737,31.047,11.8284,1022
-6.6232,-10.0001,-0.2184,2.1873,-10.0001,3.6199,14.4817,8.9007,1023
-2.6362,-9.5646,1.5703,3.1249,-9.5646,1.1499,12.6902,9.2285,1024
-13.3971,-9.9438,-0.0939,8.0864,-9.9438,3.5462,26.6541,24.8154,1025
-1.6922,-9.6558,0.9487,2.7206,-9.6558,2.3311,16.5644,14.9634,1026
-0.1517,-9.9587,1.2321,1.3516,-9.9587,2.257,22.7064,16.2575,1027
-1.1736,-9.2508,1.6612,2.2751,-9.2508,6.5799,16.9687,11.6905,1028
-13.4256,-9.612,0.9125,7.2542,-9.612,3.266,25.5471,17.7898,1029
-4.3526,-10.0783,4.0557,6.5375,-10.0783,10.2007,30.8597,14.6381,1031
-3.4301,-9.7123,2.1699,3.6199,-9.7123,1.53,13.1033,10.939,1032
-2.4859,-10.3572,-0.732,1.2386,-10.3572,3.3458,41.6124,25.5691,1033
-3.4003,-9.5376,0.5482,2.8838,-9.5376,2.4964,38.5152,32.6185,1034
-43.6033,-9.3877,1.3031,25.8659,-9.3877,10.3736,78.7438,41.2068,1036
-32.8389,-10.0567,-0.5564,9.892,-10.0567,7.0206,60.9112,32.6328,1037
-23.1829,-10.1675,4.9701,14.1569,-10.1675,10.9558,51.4015,16.8292,1038
-1.3696,-10.0033,11.8122,9.3378,-10.0033,11.4961,25.1586,17.6063,1039
-7.8569,-9.9315,8.2294,14.1015,-9.9315,1.0414,15.2423,13.5335,1040
-9.0051,-9.8488,7.8928,21.4613,-9.8488,12.4396,45.3603,14.4613,1042
-47.7609,-10.555,49.6334,92.7754,-10.555,9.4708,51.7953,38.9052,1043
-14.0387,-10.1228,15.4485,20.6096,-10.1228,16.0414,45.7656,38.3196,1044
-1.1324,-9.8578,3.0352,3.3236,-9.8578,2.716,10.97,6.8898,1045
-5.0141,-8.7448,6.6472,8.3219,-8.7448,4.8511,17.8341,11.8851,1046
-2.1288,-10.0316,6.46,6.7188,-10.0316,8.1168,27.5422,14.0271,1047
-0.633,-9.935,4.2354,4.8215,-9.935,8.2379,22.6423,17.5814,1048
-4.0679,-10.0211,0.7572,2.9723,-10.0211,4.041,21.7396,8.6444,1049
-6.0724,-10.0198,-0.4318,2.5764,-10.0198,4.0051,21.6419,18.6164,1051
-12.2542,-9.8131,1.0005,6.3633,-9.8131,9.2509,34.0221,19.1206,1052
-10.6699,-9.8498,0.6441,4.9991,-9.8498,5.9288,34.181,13.4418,1053
-19.6488,-9.0041,-1.1356,5.5138,-9.0041,5.1755,17.5306,13.0113,1054
-17.4921,-9.8785,2.79,8.7104,-9.8785,5.7201,18.3451,13.3259,1055
-5.1071,-9.9092,1.6739,4.3681,-9.9092,4.9704,14.2709,7.6738,1056
-1.894,-10.2166,1.9437,3.6773,-10.2166,3.8945,14.5925,10.3092,1057
-1.1466,-9.9175,1.4598,2.183,-9.9175,1.2106,7.2215,5.9071,1058
-1.8043,-9.6475,1.3402,3.5185,-9.6475,4.2641,15.6731,8.9347,1059
-0.3443,-10.4254,7.9057,8.6722,-10.4254,10.8408,30.5659,25.9772,1060
-14.0872,-8.5114,-1.0552,7.2735,-8.5114,3.2109,27.6724,13.6845,1061
-55.454,-9.411,4.3549,23.6045,-9.411,7.3901,63.2708,26.2604,1062
-16.4753,-9.8884,3.5078,8.9187,-9.8884,7.348,31.3071,17.0135,1063
-14.434,-9.9313,-1.0015,8.6071,-9.9313,1.6178,9.8374,7.3151,1064
-11.4411,-9.9827,4.1716,10.8472,-9.9827,5.731,35.8149,25.2695,1065
-1.6783,-9.945,1.4418,3.4518,-9.945,5.2599,18.8153,10.6304,1066
-4.57,-9.7615,9.4301,12.3429,-9.7615,31.0241,130.8964,22.0988,1067
-8.6673,-10.1676,0.0309,5.3494,-10.1676,4.2788,42.9997,30.9278,1068
-10.39,-10.1828,12.6133,18.8157,-10.1828,7.3945,44.717,40.667,1069
-9.6125,-10.0103,4.2751,8.567,-10.0103,5.0152,33.5199,24.0786,1070
-65.8516,-10.1912,1.5656,21.4356,-10.1912,11.8586,45.853,30.5148,1071
-15.2543,-9.4564,0.7357,8.185,-9.4564,5.8814,31.6384,16.0816,1072
-19.186,-9.849,0.1919,6.7981,-9.849,2.6811,39.0819,14.5937,1073
-15.1966,-10.1252,0.2884,7.9413,-10.1252,3.8367,29.3992,24.3025,1074
-4.6216,-9.8143,-1.0758,2.4919,-9.8143,4.0618,16.5782,6.745,1075
-0.8765,-9.8281,4.3665,5.5285,-9.8281,6.7591,25.6921,23.6989,1076
-5.2998,-10.1406,-0.6759,2.462,-10.1406,4.5252,12.7811,8.2609,1077
-0.6844,-9.8357,1.7192,1.8725,-9.8357,1.0141,12.131,9.385,1078
-2.2392,-9.6588,-0.3269,1.0921,-9.6588,1.9898,34.1619,10.4307,1079
-5.6612,-10.1823,-3.1533,2.0686,-10.1823,5.476,31.8976,22.0966,1080
-17.8874,-9.9178,-0.975,8.6867,-9.9178,5.4017,20.3182,11.8869,1082
-1.1414,-9.9366,1.0783,1.6901,-9.9366,3.0346,12.4029,5.381,1083
-80.6967,-9.8756,-6.3798,29.0091,-9.8756,9.3237,22.3141,5.517,1084
-11.2038,-10.0549,0.7264,9.297,-10.0549,4.458,14.2733,10.6946,1085
-5.2776,-10.1927,1.1164,5.067,-10.1927,5.5539,10.1527,5.4063,1086
9.1661,-9.7939,14.5457,5.3686,-9.7939,2.6377,26.3592,12.2028,1087
-66.4158,-9.8815,-6.4971,26.7713,-9.8815,6.7876,18.0075,8.3959,1088
-3.1335,-9.9237,0.6324,1.9214,-9.9237,3.0563,28.2871,3.8896,1089
0.1519,-9.9263,0.2674,0.0754,-9.9263,0.2183,3.416,2.6126,1090
