AYGX_min,AZ_mean,AYGX_mean,AYGX_std,AZ_mean,GX_std,Gnorm_max,Gnorm_median,timestamp
0.1444,-9.8296,0.1769,0.0162,-9.8296,0.0353,0.7761,0.7398,0
0.1475,-9.8294,0.1798,0.0117,-9.8294,0.0231,0.8012,0.728,1
0.1495,-9.8289,0.181,0.0172,-9.8289,0.0366,0.8196,0.7214,2
0.1394,-9.8301,0.1808,0.0219,-9.8301,0.0424,0.8045,0.7394,3
0.1375,-9.829,0.1765,0.0218,-9.829,0.0458,0.8098,0.7317,4
0.1419,-9.8303,0.1768,0.022,-9.8303,0.0461,0.8417,0.7266,5
0.1352,-9.8272,0.2144,0.1081,-9.8272,0.2081,1.6719,0.7458,6
-71.5721,-9.7871,-8.4389,27.8099,-9.7871,11.895,31.5663,13.4277,7
-65.5592,-9.7223,-4.8905,26.1643,-9.7223,13.3381,76.9102,16.1603,8
-277.6766,-9.7697,-25.3729,80.0531,-9.7697,34.0719,81.5743,31.6711,9
-51.4525,-9.5123,-2.4646,12.9139,-9.5123,12.9778,43.7025,22.5707,10
-12.6509,-8.9844,9.9615,19.9157,-8.9844,7.9422,50.2149,20.481,11
-15.0015,-9.7438,-4.8207,5.8333,-9.7438,3.8796,8.5462,4.4287,12
-1.2048,-9.7376,6.5917,5.6934,-9.7376,3.6775,12.428,3.931,13
-7.5528,-9.7846,1.6816,4.7495,-9.7846,3.9761,8.6463,3.6534,14
-5.1104,-9.8309,0.4725,3.382,-9.8309,3.3171,5.5232,3.0022,15
-11.4612,-9.7937,-2.2161,3.7626,-9.7937,3.9572,7.5448,4.0113,16
-14.0189,-9.8209,2.2878,10.6948,-9.8209,5.0922,16.6602,13.1542,17
-6.0601,-9.7756,1.9077,8.3912,-9.7756,4.5064,14.7322,8.4887,18
-4.3261,-9.8371,4.3531,6.4064,-9.8371,3.3588,22.9214,9.0498,19
-9.8444,-9.834,0.2471,5.4175,-9.834,5.9271,29.2384,10.1977,20
-9.4899,-9.8396,5.0749,9.2195,-9.8396,8.1674,30.3506,13.8601,22
-5.6589,-9.6907,1.6628,4.0964,-9.6907,3.8533,17.2095,12.905,23
-10.0612,-8.3729,0.2086,5.0629,-8.3729,4.2924,41.2795,14.4265,24
-6.2192,-9.8087,-0.1633,2.2617,-9.8087,3.7061,21.5684,15.2106,25
-9.227,-9.7191,4.4354,9.3789,-9.7191,3.7504,21.7364,19.6197,26
-1.8212,-9.9113,2.0891,5.3251,-9.9113,4.0301,49.0752,46.3467,27
-0.7943,-10.7117,0.4418,1.167,-10.7117,0.9667,20.2066,11.5861,28
-6.5825,-9.849,0.2203,3.3527,-9.849,2.9443,16.8284,10.3912,29
0.213,-8.9206,3.7493,3.6372,-8.9206,6.4263,27.359,24.6945,30
-3.7591,-9.8384,2.1983,5.3551,-9.8384,6.6498,24.8143,9.6301,32
-1.3385,-9.891,0.8258,1.1027,-9.891,2.6344,10.0313,5.0362,33
-0.7196,-9.9379,1.2584,1.7403,-9.9379,3.0145,13.7484,8.1572,34
-1.0577,-9.861,0.3474,0.9304,-9.861,2.507,10.8708,5.8726,35
-0.9604,-9.7882,1.2088,1.8634,-9.7882,3.6721,12.5495,7.5729,36
-0.5896,-9.8672,0.0526,0.4293,-9.8672,1.6621,12.6361,8.8207,37
-1.4227,-9.7754,1.2346,2.5362,-9.7754,2.2339,15.7906,9.5091,38
-1.9187,-9.8955,0.6046,1.1966,-9.8955,3.3121,11.1111,7.5844,39
-1.6033,-9.8257,0.6823,1.3265,-9.8257,3.1106,12.522,6.097,40
-0.9978,-9.8182,0.128,0.4746,-9.8182,1.7325,7.2453,3.1598,42
-0.7665,-9.923,0.161,0.494,-9.923,1.1613,9.5786,3.9708,43
-0.5244,-9.9287,0.2463,0.6815,-9.9287,0.6917,7.8444,4.3182,44
-1.0009,-9.6611,0.2323,0.7741,-9.6611,1.1255,6.0959,4.7003,45
-1.2947,-9.8432,0.1739,1.1456,-9.8432,3.0754,16.6252,10.4858,46
-9.6138,-9.8491,-0.1677,2.585,-9.8491,3.6796,27.2014,11.5857,47
-15.6489,-9.8752,-0.625,7.8819,-9.8752,4.1978,27.0396,21.5363,48
-2.1982,-9.8124,0.2554,1.1143,-9.8124,2.2668,24.0073,19.8646,49
-0.9366,-9.7954,2.1603,2.7382,-9.7954,5.4088,21.2392,9.0729,51
-1.2513,-9.8682,0.2654,0.6494,-9.8682,1.4279,9.4448,3.3528,52
-0.1016,-9.7681,0.3571,0.3925,-9.7681,0.5426,5.0127,4.1611,53
-1.2448,-9.8703,0.2814,0.7502,-9.8703,2.946,9.1623,5.714,54
-0.7797,-9.6447,0.0412,0.3586,-9.6447,0.5416,5.6919,4.4847,55
-1.7989,-9.9619,0.376,0.9224,-9.9619,3.6627,19.2699,7.3786,57
2.6389,-9.8372,5.6808,2.2693,-9.8372,2.4531,19.7119,15.188,58
-0.9094,-9.8198,1.5907,2.0142,-9.8198,0.6651,22.8425,19.6407,59
-1.613,-9.8516,0.4924,1.5288,-9.8516,2.3235,12.23,8.4675,60
-0.7424,-9.8951,0.0411,0.3343,-9.8951,1.3966,9.4192,5.6385,62
-2.9696,-9.6749,0.1191,1.6497,-9.6749,2.7089,9.4759,5.8817,63
-0.9779,-9.9772,0.4294,1.6679,-9.9772,1.7937,13.3714,9.2244,64
-3.5948,-6.5916,1.0271,7.806,-6.5916,2.7078,52.2403,17.8292,66
-13.4896,-9.9377,13.2811,25.9648,-9.9377,12.5526,106.4881,35.8691,67
-9.2942,-9.7863,16.9216,36.4011,-9.7863,9.308,84.3007,38.6511,68
-8.2181,-10.0275,-1.6319,4.3129,-10.0275,6.6868,45.6999,31.4356,69
-6.6764,-10.0947,14.1406,28.5971,-10.0947,6.7802,26.578,18.5983,70
0.93,-9.3034,14.0629,11.5083,-9.3034,11.4617,32.8072,17.8327,72
-9.6573,-9.1085,-2.0389,4.7576,-9.1085,4.1413,19.0903,12.5464,73
-0.9309,-8.5523,8.8885,8.8806,-8.5523,9.4612,19.0769,13.9741,74
-5.1451,-7.8334,-0.3467,2.4794,-7.8334,2.2511,25.8593,7.4706,75
-32.3826,-9.4418,2.3371,19.0269,-9.4418,12.8368,22.1536,18.4925,76
-1.2486,-9.4966,2.0637,3.4198,-9.4966,3.0422,15.241,8.7897,77
-7.2907,-9.4015,2.5169,6.7982,-9.4015,7.1395,19.7833,13.9648,78
-1.7508,-9.7181,6.4662,7.3978,-9.7181,6.3737,20.356,15.9227,79
-14.7662,-9.9978,13.1576,21.836,-9.9978,9.3856,31.3497,21.7686,80
-5.6768,-9.3965,13.4481,21.2791,-9.3965,10.6066,31.7242,21.1252,81
-7.4397,-9.9986,-0.9562,3.7158,-9.9986,3.6349,11.8069,10.6165,82
-10.7747,-9.6156,-0.3313,5.6942,-9.6156,6.2252,21.4132,11.908,83
-6.3925,-9.0962,2.4303,8.8076,-9.0962,5.7933,30.6884,10.4585,84
-10.8083,-9.741,1.8777,5.1179,-9.741,7.0927,29.1408,12.59,85
-6.868,-7.7338,1.8957,6.6796,-7.7338,4.0676,20.3698,13.9809,86
-43.386,-6.5841,2.6895,19.8434,-6.5841,11.4239,39.7157,17.7766,87
-20.3077,-9.1749,-0.6089,5.0203,-9.1749,5.2276,30.2092,9.8395,88
-13.5498,-9.8145,3.3738,8.6823,-9.8145,11.3522,30.4358,15.2689,89
-0.4604,-8.461,2.1614,3.5516,-8.461,3.3943,54.0087,10.5706,90
-25.1434,-10.2709,35.6349,33.5541,-10.2709,7.6935,39.3603,27.086,91
-7.1378,-8.9365,11.3556,15.2063,-8.9365,6.7943,34.4755,15.6584,92
-3.9185,-8.6706,-0.3791,2.4568,-8.6706,2.3941,27.5504,11.5319,93
-3.7315,-9.0485,6.1149,9.6238,-9.0485,8.1352,28.0066,15.1684,94
-2.2428,-9.8078,0.4243,1.2799,-9.8078,3.7178,18.8518,5.4254,95
-0.9302,-9.4545,0.9979,1.2927,-9.4545,3.2188,8.5198,5.5679,96
-0.9225,-9.8973,0.7222,1.6214,-9.8973,3.7767,21.0678,6.2812,97
-8.4605,-9.7449,-0.8412,2.3138,-9.7449,2.663,14.2871,6.2573,98
-14.3852,-9.4335,1.4135,9.2945,-9.4335,4.3121,17.1404,14.022,99
-3.6183,-9.921,4.5973,5.4696,-9.921,2.5533,17.4846,14.7873,100
-10.6647,-9.9027,2.9288,9.8721,-9.9027,7.8457,27.1385,11.3146,101
-21.3521,-9.7527,-7.9383,4.1574,-9.7527,2.0727,10.4,6.1082,102
-10.4352,-9.7273,-0.8076,9.2731,-9.7273,6.7721,13.4815,4.6722,103
3.1058,-9.7043,4.2643,1.1048,-9.7043,0.662,4.1375,2.6741,104
-1.1887,-9.7302,0.4787,0.9347,-9.7302,0.6597,1.7036,0.9163,105
0.3938,-9.7339,0.9363,0.4565,-9.7339,0.3247,1.6885,0.8781,106
-0.6845,-9.7404,0.8164,0.7161,-9.7404,0.5112,1.3284,0.9544,107
0.5365,-9.7488,0.9466,0.2696,-9.7488,0.2183,1.1899,1.0148,108
-3.3052,-9.7727,1.0396,1.982,-9.7727,1.5897,3.8416,1.5478,109
-3.4552,-9.7327,0.3037,3.6896,-9.7327,2.3351,4.742,2.5806,110
-37.4803,-9.6135,3.9301,19.2378,-9.6135,9.7507,22.9295,9.698,112
-11.3577,-9.7959,4.0904,14.9835,-9.7959,5.247,29.983,22.2473,113
-9.929,-9.7602,2.0519,5.634,-9.7602,3.667,24.4415,12.916,114
-3.3176,-9.8977,1.603,3.6991,-9.8977,2.1801,30.2598,22.4184,115
-2.2881,-9.9949,-0.0936,1.1569,-9.9949,2.3552,15.1601,7.5993,116
-2.1626,-9.6937,0.1576,1.2714,-9.6937,1.9896,8.2768,7.3911,117
-9.1685,-10.1593,9.0128,14.3131,-10.1593,11.3275,48.3773,38.6834,118
-3.0625,-9.8306,0.4986,2.0171,-9.8306,2.5503,16.3835,6.6299,119
-1.4071,-10.0177,-0.1925,0.7689,-10.0177,1.6785,11.6054,3.9774,120
-4.3769,-9.7055,0.8782,2.9191,-9.7055,5.2142,20.1113,13.7039,122
-6.2695,-9.8292,2.8522,5.5213,-9.8292,5.7673,18.9618,14.0104,123
-1.6899,-9.8484,2.1137,3.7368,-9.8484,2.9932,16.2015,8.9279,124
-1.938,-9.6061,0.6942,1.9278,-9.6061,2.6549,15.0147,9.1498,125
-1.4464,-9.8261,1.1404,1.6985,-9.8261,1.9124,11.2348,9.794,126
-3.0506,-10.0397,-0.8818,1.2428,-10.0397,0.5015,15.0602,13.6901,127
-2.1299,-9.7899,6.5927,7.7557,-9.7899,5.0784,28.8566,19.0681,128
-50.0574,-9.7851,1.0852,12.4111,-9.7851,5.5675,20.217,7.76,129
-3.4257,-9.2801,3.5131,4.7052,-9.2801,4.1722,20.543,10.8813,130
-71.5408,-9.3226,11.026,27.7515,-9.3226,13.5389,39.0931,18.4502,132
0.0331,-9.6899,3.1399,2.6391,-9.6899,5.3165,11.2419,9.7437,133
-1.7185,-9.7306,0.3698,2.2616,-9.7306,1.8116,9.0221,5.0305,134
-12.1606,-10.0049,4.4296,9.5904,-10.0049,5.4843,21.2808,13.9494,135
-2.9822,-10.0326,1.2383,2.862,-10.0326,4.267,11.893,7.175,136
0.0685,-9.4914,4.3352,3.396,-9.4914,6.6278,15.3618,12.7479,137
-4.6226,-9.8667,2.2085,3.8758,-9.8667,1.9916,16.0423,11.1756,138
-0.3717,-9.9083,3.4371,4.0601,-9.9083,5.3442,16.6979,7.8532,139
-20.0234,-9.5153,6.6984,12.7566,-9.5153,2.6452,20.0835,15.5007,140
-3.4953,-9.9176,4.1842,10.1239,-9.9176,7.8446,25.8855,10.57,142
-0.2706,-9.882,3.9444,3.5315,-9.882,3.8921,12.8789,9.0802,143
-8.5944,-9.934,0.7803,3.8702,-9.934,5.0275,19.7603,9.3008,145
-7.0973,-9.8456,0.1307,2.8419,-9.8456,4.339,20.3567,7.4738,146
-9.5054,-9.7112,-1.2698,5.0226,-9.7112,3.0323,12.3823,9.9504,147
-8.7826,-9.8141,0.3544,4.5262,-9.8141,6.0689,21.7845,13.531,148
-1.5563,-9.9289,4.1605,7.4105,-9.9289,6.0629,18.9225,10.6492,149
-6.2545,-9.8172,4.1996,7.548,-9.8172,5.882,18.5802,12.5807,150
-10.825,-8.5922,0.0622,4.3732,-8.5922,5.16,43.3426,12.1751,152
-22.9216,-9.7884,-3.049,8.4687,-9.7884,7.9409,29.8114,13.703,153
-15.8158,-8.7763,-0.8305,5.9322,-8.7763,5.7868,23.0725,12.2257,154
-8.4989,-9.202,6.8793,9.5104,-9.202,0.774,24.6253,19.6402,155
-55.6321,-8.2689,3.821,26.8753,-8.2689,11.3312,53.3105,17.5432,157
-45.4765,-7.0275,0.5238,21.4002,-7.0275,6.797,41.4982,29.1889,158
-5.1199,-9.9567,5.7858,7.2613,-9.9567,5.7551,21.3584,17.4014,159
-12.7942,-9.5341,12.4794,18.5125,-9.5341,5.2469,25.1163,18.6923,160
-3.3654,-9.9137,0.7679,2.762,-9.9137,3.2539,12.3964,8.0934,161
-14.1797,-5.575,2.4864,10.2422,-5.575,7.8026,28.6202,21.4248,162
-3.9874,-10.0825,1.6266,3.175,-10.0825,2.7743,10.1229,9.0714,163
-5.4527,-9.866,0.4891,2.5177,-9.866,5.3839,20.6669,8.5331,164
-9.5115,-9.3621,-0.3145,3.9552,-9.3621,5.0482,14.5348,7.0115,166
-2.3399,-9.8209,0.9529,2.6247,-9.8209,4.7371,13.1737,7.6477,167
-5.9084,-9.8045,0.596,3.2568,-9.8045,6.0383,17.2385,8.4666,168
-0.0275,-10.1105,1.3074,1.0845,-10.1105,3.4723,8.8678,6.7424,169
-5.8819,-9.0177,0.7432,3.154,-9.0177,5.4365,21.7101,8.5324,170
-1.6814,-10.2107,1.0868,2.5307,-10.2107,3.3433,14.7166,6.6232,171
-1.5925,-9.3061,7.4118,11.0661,-9.3061,4.8296,35.4636,17.8528,172
-5.1909,-9.9625,0.6253,4.1085,-9.9625,2.5378,13.3624,9.4771,173
-34.3551,-8.6286,-6.3329,12.5946,-8.6286,3.5756,34.4437,18.197,174
-8.6512,-9.4747,3.5417,7.8954,-9.4747,7.5213,26.4788,11.2409,175
-9.0236,-9.4335,0.9426,5.4515,-9.4335,5.2912,10.5431,7.1297,176
-8.5828,-9.4571,0.8662,4.998,-9.4571,7.5565,17.6976,14.4235,177
-4.1876,-9.739,1.5107,3.7138,-9.739,2.7087,10.1826,5.0911,178
-4.8347,-9.9247,-1.9142,1.8367,-9.9247,4.6281,10.6536,8.7093,179
-6.007,-9.9526,0.1037,2.415,-9.9526,3.1726,15.5078,7.7611,180
-1.3252,-9.7253,0.2935,0.7672,-9.7253,1.7985,20.6528,6.0708,182
-0.2193,-9.7711,0.8259,1.0306,-9.7711,3.5004,10.022,7.0767,183
-8.7338,-9.794,1.7525,5.8814,-9.794,5.4366,18.386,7.3072,184
-2.6908,-9.7998,4.5894,6.234,-9.7998,6.8605,21.3563,10.1018,185
-0.7695,-9.723,0.3389,0.9949,-9.723,1.3603,9.1882,5.9562,186
-2.3614,-9.7281,1.9999,2.7479,-9.7281,3.94,14.2407,8.4939,187
-2.0715,-9.8992,0.4576,1.3589,-9.8992,2.9629,23.761,8.9693,188
-3.9277,-9.9252,-0.031,1.5844,-9.9252,2.7674,14.4985,6.341,189
-6.9594,-9.8921,3.4345,6.076,-9.8921,5.3623,23.8303,11.0296,190
-4.3196,-9.566,6.7386,8.0857,-9.566,6.8813,27.9018,21.4518,191
-9.1312,-9.7635,1.3904,5.9486,-9.7635,6.97,14.2359,10.3858,192
-3.9736,-9.7138,0.5282,3.4763,-9.7138,2.6794,22.8382,15.7538,193
-0.297,-10.0321,7.207,6.4908,-10.0321,8.1851,19.2944,14.8876,194
-0.1313,-9.8386,0.3649,0.427,-9.8386,2.727,9.6484,5.9789,195
-10.839,-9.7081,13.3342,21.2649,-9.7081,7.6574,40.0537,22.8394,196
-5.4261,-9.8794,1.7743,5.047,-9.8794,4.9629,18.1284,14.1221,197
-22.4705,-9.9357,1.1765,8.8707,-9.9357,6.6615,25.0334,12.2747,198
-4.6646,-8.7527,5.5464,10.9775,-8.7527,11.8146,34.4059,26.8229,199
-4.9245,-9.689,6.6263,10.199,-9.689,8.4411,29.343,19.8372,200
-1.1497,-9.7868,2.2367,3.6483,-9.7868,3.2303,10.8921,8.623,201
-1.7691,-9.6241,5.6245,8.6107,-9.6241,3.9567,14.971,10.6724,202
-4.4346,-9.4747,-0.7683,1.7738,-9.4747,2.0771,10.7655,7.461,203
-19.0284,-9.8904,0.8491,7.3611,-9.8904,6.9665,30.779,12.1632,204
-0.9552,-9.7723,0.8954,1.4384,-9.7723,4.6597,10.6584,7.658,205
-6.3518,-9.5282,1.8146,5.3208,-9.5282,5.6777,15.6888,10.9331,207
-5.5677,-9.9792,4.6777,8.9701,-9.9792,6.9865,23.5731,15.5503,208
-1.3051,-9.7954,0.1226,0.7742,-9.7954,2.3678,16.9279,11.1363,209
-0.6585,-10.9913,1.4727,1.8821,-10.9913,1.7698,16.0872,8.124,210
-1.7742,-10.4064,3.3422,5.4302,-10.4064,6.4262,17.0791,13.6322,211
-0.0409,-9.8928,2.4433,2.548,-9.8928,3.982,20.5945,18.9781,212
-0.4604,-9.8378,2.5208,2.5747,-9.8378,2.3562,18.4965,17.3987,213
-4.7737,-10.0723,-0.2079,3.6371,-10.0723,3.7678,28.7493,25.3779,214
-0.1601,-9.6838,1.1951,1.8802,-9.6838,3.087,9.4798,4.9241,215
-4.9916,-9.7793,4.1813,6.4459,-9.7793,8.3572,42.4443,24.5406,217
-20.6402,-9.9658,5.4775,12.5648,-9.9658,8.1644,43.677,27.1579,218
-7.921,-9.6144,1.8776,7.2888,-9.6144,9.7969,39.6203,25.2562,219
-6.5976,-9.8592,6.3473,9.734,-9.8592,8.0786,23.0696,11.7432,220
-7.4002,-10.0237,-0.9373,4.3763,-10.0237,0.532,34.3584,25.6468,221
-9.3941,-9.7329,2.8345,7.9328,-9.7329,8.0295,29.8524,13.8592,222
-17.213,-9.953,1.9969,12.8984,-9.953,3.8981,21.9685,19.1566,223
-14.5267,-9.7228,-2.4838,5.6054,-9.7228,8.9524,26.6161,9.7371,224
-7.7241,-10.1252,-2.8304,2.8195,-10.1252,1.4677,14.7302,6.3607,225
-6.4115,-9.8504,0.8283,3.4233,-9.8504,6.1601,17.3671,10.573,227
-7.8886,-9.5442,-0.7342,3.7374,-9.5442,6.1642,20.9224,11.5209,228
-1.5535,-9.6338,0.2138,0.8106,-9.6338,1.8827,8.9938,6.2195,229
-2.8528,-9.9025,1.6544,3.637,-9.9025,5.2898,13.1346,9.7039,230
-0.3651,-10.129,0.3129,0.623,-10.129,1.9247,7.9482,5.5565,231
-1.4894,-9.697,-0.5761,0.4935,-9.697,1.4928,8.3092,6.2905,232
-4.2461,-9.6892,0.9076,2.1718,-9.6892,3.7847,17.7528,8.665,233
-23.0112,-9.2895,-0.3682,8.4548,-9.2895,7.2585,21.3724,11.8219,234
-0.1459,-9.8419,3.0301,2.405,-9.8419,4.4028,18.9722,14.5819,236
-9.4442,-9.7733,5.9764,16.349,-9.7733,12.1866,39.8254,16.2719,237
-3.9418,-9.8804,1.8324,4.166,-9.8804,6.3982,17.2877,6.5018,238
-1.3203,-9.5906,8.5535,6.9863,-9.5906,10.0582,19.7432,15.8353,239
0.2146,-9.711,5.3784,5.7537,-9.711,8.2214,16.4785,13.8528,240
-0.7391,-9.812,0.3484,0.8078,-9.812,1.5181,4.8455,3.6648,241
-5.6457,-9.8826,-0.2225,3.2314,-9.8826,2.5432,7.6626,6.428,242
-1.4659,-9.8557,6.4451,6.5712,-9.8557,4.565,19.8967,15.4402,243
-8.8787,-9.8815,-0.0477,3.5195,-9.8815,4.3781,19.7358,9.7428,244
-0.7338,-9.6462,1.2963,1.1199,-9.6462,0.8541,11.2955,6.3105,246
-5.313,-9.7772,0.3295,2.338,-9.7772,3.1138,14.1835,8.2836,247
-8.02,-9.912,0.7717,5.0246,-9.912,7.5929,20.8651,10.0174,248
-2.4069,-9.8439,4.9311,6.1898,-9.8439,5.8966,23.0036,18.2073,249
-5.9037,-9.8896,1.616,4.2614,-9.8896,9.5329,18.7729,13.8345,250
-6.0457,-9.8676,-0.5046,1.6839,-9.8676,3.867,9.6722,6.4949,251
-12.3566,-8.8584,0.3686,4.9246,-8.8584,8.5389,23.1583,9.301,252
-5.8749,-9.7049,4.7806,10.2778,-9.7049,10.7407,23.3468,17.465,253
-3.6554,-9.9572,0.6175,3.3884,-9.9572,3.0745,14.3161,12.1271,254
-5.9319,-9.9173,-0.2738,1.72,-9.9173,3.384,15.4668,6.6768,255
-0.8472,-9.6296,0.1109,0.6758,-9.6296,1.2211,9.9621,4.3006,256
-1.4474,-9.856,-0.1371,0.711,-9.856,2.5357,12.2135,5.1123,257
-1.5329,-9.8092,0.6904,1.4322,-9.8092,3.9004,14.1573,6.9069,258
-2.3546,-9.7534,2.1022,4.1884,-9.7534,4.0531,13.6673,12.0383,259
-2.5542,-9.8305,2.2698,4.1011,-9.8305,6.9824,15.9741,11.4375,260
-16.7777,-9.5011,2.2089,6.4344,-9.5011,6.8054,25.9753,14.1842,261
-1.2066,-9.9979,1.687,2.7355,-9.9979,4.5248,16.4644,9.5774,262
-6.2467,-9.8471,1.6505,5.7599,-9.8471,5.1055,24.1304,11.0792,263
-7.9651,-9.9097,-1.8749,3.535,-9.9097,2.7155,17.95,11.3352,264
-0.01,-9.6538,5.5831,4.5929,-9.6538,7.0909,15.573,11.0349,265
-7.8832,-9.8672,11.2459,12.1124,-9.8672,8.4254,52.5446,45.8843,266
-5.4974,-9.6794,4.822,9.6736,-9.6794,3.9324,41.6369,38.5667,267
-1.2078,-10.0238,0.724,1.6563,-10.0238,1.5442,10.1382,5.2948,268
0.0,-9.8016,1.1644,1.1296,-9.8016,3.9317,13.7425,12.7392,269
-2.8294,-9.8846,3.9987,6.2411,-9.8846,7.8406,23.0683,10.665,270
-1.0767,-9.8361,3.4029,3.9817,-9.8361,6.7189,22.0341,9.9253,272
-4.7151,-9.7389,3.4646,4.5035,-9.7389,9.4255,20.519,15.5324,273
-4.813,-9.845,-0.628,2.3511,-9.845,2.3039,11.3347,8.8699,274
-2.7304,-9.8345,1.347,2.9635,-9.8345,5.288,15.7536,8.5849,275
-10.351,-9.834,15.1593,22.7354,-9.834,13.6569,54.3557,21.6076,277
-3.8901,-10.1552,1.4481,3.1626,-10.1552,5.2046,34.3735,28.3627,278
-15.152,-9.9534,-0.2823,5.6459,-9.9534,7.0822,37.1027,30.8783,279
3.1311,-9.8854,48.7126,34.6556,-9.8854,7.7387,37.1236,34.7581,280
-44.1454,-9.7785,3.5646,13.9013,-9.7785,13.8152,41.3028,15.4107,282
-42.4648,-8.8541,18.7228,38.0699,-8.8541,11.5639,59.6008,23.3793,283
-4.2563,-9.8686,1.0235,2.5303,-9.8686,4.3826,16.9173,6.492,284
-4.8895,-9.9075,0.3846,2.5655,-9.9075,1.7585,12.5151,8.8563,285
-5.8584,-9.8619,-0.4369,1.4886,-9.8619,2.5315,12.824,6.2456,287
-0.257,-9.8352,0.7549,1.22,-9.8352,2.3804,8.4633,3.9513,288
-0.7188,-9.8715,0.0104,0.3382,-9.8715,1.3049,4.496,2.1039,289
-2.714,-9.8324,-0.0604,1.4492,-9.8324,2.9242,14.3565,5.1765,290
-0.0498,-9.9455,0.0533,0.0848,-9.9455,0.7313,10.1741,6.073,291
-1.1323,-9.8485,1.3083,1.8223,-9.8485,2.7037,21.6388,6.8885,292
-1.5497,-9.801,0.5487,1.9464,-9.801,1.5261,5.2937,3.3474,293
-4.8256,-9.8717,1.2097,2.3103,-9.8717,5.7281,22.1669,10.0635,294
-0.1079,-9.8614,0.5662,0.7718,-9.8614,1.3865,5.8103,3.1583,295
0.0079,-9.8894,2.8204,2.4845,-9.8894,2.92,12.91,9.9235,296
-1.7063,-9.8386,1.525,1.8377,-9.8386,5.4794,14.4543,10.2586,297
-0.4716,-9.8485,0.7106,0.943,-9.8485,2.7243,9.9197,4.4959,298
-0.7579,-9.9019,1.7661,2.3088,-9.9019,3.4228,10.4906,6.7352,299
-0.2572,-9.8143,0.0163,0.1763,-9.8143,1.0694,4.2332,2.7128,300
-6.0545,-9.5455,0.4869,3.3454,-9.5455,1.9477,11.6225,9.9676,301
-2.9352,-9.8619,-0.0389,1.3087,-9.8619,2.529,10.4501,5.7185,302
-1.0186,-9.8678,0.3799,1.2015,-9.8678,1.7299,15.8727,3.7231,303
-7.8707,-9.8301,-0.0657,3.701,-9.8301,4.4472,15.5919,8.4041,304
-0.6948,-9.886,0.9893,1.8451,-9.886,3.6744,13.2246,5.2097,305
-1.7018,-9.8316,-0.1025,0.8881,-9.8316,1.7538,9.3896,5.1236,307
-1.7188,-9.8722,3.7316,5.2518,-9.8722,8.183,34.8883,17.2735,308
-1.457,-9.8264,0.1717,0.6572,-9.8264,1.4687,16.8965,6.404,309
-3.6566,-9.854,0.0399,1.3016,-9.854,2.5739,15.2159,6.1755,310
-2.9752,-9.8266,0.7649,1.9138,-9.8266,4.5177,16.2022,10.896,311
-2.3557,-9.9018,3.4203,3.8605,-9.9018,8.5675,22.668,15.0819,312
-4.2615,-9.857,0.3164,1.9361,-9.857,3.9508,42.4714,38.4784,313
0.5827,-9.9332,9.7655,4.9596,-9.9332,2.6832,43.0548,36.0548,314
-5.6522,-9.9518,2.8592,4.3961,-9.9518,5.2475,35.2047,25.009,315
-0.7952,-9.8586,0.196,0.7266,-9.8586,0.8354,8.3865,4.9216,316
-0.3497,-9.9508,1.325,1.2844,-9.9508,2.0518,33.253,17.2241,317
-6.5394,-9.8208,-0.6533,2.0264,-9.8208,3.5761,28.8006,13.123,318
1.0654,-9.8632,5.0985,2.4888,-9.8632,0.6529,25.2259,12.8781,319
-12.9485,-8.5745,1.1463,6.0234,-8.5745,4.6134,64.5999,20.6894,320
-82.452,-7.865,-30.4193,36.5159,-7.865,19.8823,84.3369,29.6317,321
-0.7886,-10.0382,-0.2533,0.3023,-10.0382,0.9092,12.2157,10.7865,322
-8.2275,-9.5975,-0.9375,4.2382,-9.5975,5.65,27.6614,23.8704,323
-2.0294,-9.9175,-0.1547,2.3456,-9.9175,3.5912,7.0752,4.9579,324
-10.5838,-9.9465,7.8068,15.0448,-9.9465,9.3518,29.4337,21.4304,325
-1.5237,-9.2309,7.2227,6.1033,-9.2309,4.4148,24.193,21.8593,326
-3.6546,-9.4039,1.924,4.0363,-9.4039,6.1221,25.7193,10.3985,327
-1.3713,-10.2258,0.2696,1.033,-10.2258,2.0373,13.7577,4.2406,328
-1.1339,-9.0747,0.1034,0.6539,-9.0747,1.8879,12.1417,7.0402,329
-1.7741,-9.8506,-0.5515,1.2593,-9.8506,1.617,6.1429,3.9376,330
-2.1253,-10.3684,-0.523,0.8896,-10.3684,1.1373,9.1404,6.6186,331
-0.7152,-9.8101,0.4017,1.0045,-9.8101,1.6011,9.7596,4.204,332
0.3175,-10.1046,1.4241,1.036,-10.1046,1.1033,8.1794,5.6277,333
-0.9081,-9.4619,-0.0668,0.517,-9.4619,1.5484,7.2316,5.985,334
-1.0683,-9.6855,0.5221,0.9066,-9.6855,2.2519,25.3287,19.563,335
-0.2787,-10.1717,0.0194,0.1927,-10.1717,0.9345,20.5555,18.7177,336
-15.2465,-9.5581,7.9088,14.4541,-9.5581,11.0396,43.8429,30.0031,337
-7.4111,-9.7977,0.4156,3.1407,-9.7977,4.0709,19.9414,8.9902,338
-5.716,-8.588,2.0433,5.5989,-8.588,3.5589,18.4865,9.2972,339
-2.7543,-10.014,-0.3637,1.1388,-10.014,2.3339,8.8405,4.9948,340
-1.798,-9.7659,3.089,3.6373,-9.7659,2.2729,20.3829,18.1301,341
-2.7518,-9.8773,0.5265,1.6631,-9.8773,2.311,9.7147,7.0771,342
0.7949,-9.9116,2.7097,1.9779,-9.9116,3.167,13.4657,9.8208,343
-1.0401,-9.9795,-0.2826,0.4434,-9.9795,1.4752,10.6934,9.2361,344
-1.7265,-9.8413,1.0034,3.1685,-9.8413,3.0535,12.1861,5.4393,345
-8.7197,-9.7321,3.7245,8.4374,-9.7321,6.5893,25.2992,11.3154,347
-2.7424,-9.8787,0.3005,1.5409,-9.8787,2.6741,9.7115,5.4573,348
-2.3071,-9.896,0.6517,1.3861,-9.896,1.3403,9.6718,7.0365,349
-10.2291,-9.8346,-2.2021,4.5572,-9.8346,3.1301,6.5148,3.1152,350
-15.4309,-9.8122,2.7978,9.0812,-9.8122,4.2823,15.4481,8.3846,351
-8.9876,-9.8572,-1.4938,3.5563,-9.8572,1.3728,7.6332,6.0409,352
-0.787,-9.7655,-0.2345,0.3282,-9.7655,0.9958,3.1958,1.5772,353
-40.5422,-9.7382,-11.7168,11.178,-9.7382,4.5627,18.2751,9.885,354
-7.8976,-9.6025,-6.1912,1.2706,-9.6025,0.5382,4.048,3.2659,355
-15.2031,-9.4376,1.3852,6.9197,-9.4376,1.7883,6.147,4.9681,356
2.4668,-9.6931,7.2821,3.9016,-9.6931,2.7225,12.4213,5.5257,357
-18.6612,-9.904,-0.3778,8.5875,-9.904,2.6106,13.1065,8.2426,358
-34.7673,-9.6648,-15.0842,13.7665,-9.6648,6.9896,16.3959,11.8435,359
-3.3332,-9.8198,3.9004,3.7474,-9.8198,3.4256,12.2053,8.1425,360
-11.2245,-9.7814,0.4113,3.4034,-9.7814,4.4446,32.1076,12.9239,362
-11.55,-9.9149,-0.8876,4.1161,-9.9149,4.3571,20.1574,12.1356,363
-5.7413,-9.637,-1.0867,2.1597,-9.637,2.1876,11.6437,8.288,364
-4.8342,-10.0258,0.2339,2.2733,-10.0258,4.208,34.3997,28.1404,365
-74.4334,-9.6595,5.5,31.8616,-9.6595,8.9851,29.8329,15.9391,366
-6.9713,-9.863,-0.3221,3.4918,-9.863,3.4238,18.0654,11.2782,367
-2.9649,-9.7921,8.1145,7.8757,-9.7921,2.6387,24.2915,19.6077,368
-6.3351,-9.8065,3.1222,4.1326,-9.8065,7.6431,22.4359,11.2146,369
-0.6516,-10.0969,0.1061,0.4335,-10.0969,1.3878,12.0788,9.4307,370
-2.8476,-9.8819,1.7508,3.2752,-9.8819,7.0812,18.644,9.8864,372
-15.748,-8.877,2.2437,8.2207,-8.877,11.4604,39.2104,16.8786,373
-17.3988,-10.0464,-2.6159,9.2814,-10.0464,3.4298,20.0166,17.9538,374
-1.0505,-9.717,0.8844,1.8489,-9.717,3.709,12.515,5.7986,375
-1.959,-9.801,-0.0879,1.1999,-9.801,4.7623,13.8347,8.7149,376
-7.5548,-9.7725,-0.9104,3.1522,-9.7725,2.5588,10.7911,9.0209,377
-3.0674,-9.6929,0.5987,2.3384,-9.6929,3.9086,11.5112,9.2046,378
-5.1193,-9.9038,3.3527,5.7003,-9.9038,7.5067,21.2276,9.0277,379
-1.7082,-10.1061,0.9348,2.3885,-10.1061,1.7811,28.369,22.5037,380
-14.7916,-9.3362,0.9741,6.9551,-9.3362,6.1513,32.384,7.188,382
-19.5348,-9.717,-1.5938,5.8646,-9.717,7.6382,22.774,10.4615,383
-10.8297,-9.1053,-0.479,5.1331,-9.1053,4.8897,19.6233,14.0877,384
-21.3591,-9.5655,1.0747,7.9291,-9.5655,10.9635,30.4684,15.1013,386
-5.0746,-8.9389,-0.7128,2.7252,-8.9389,6.2364,20.6451,11.1321,387
-3.4538,-9.9279,0.5522,2.5694,-9.9279,6.3532,12.7956,9.2694,388
-2.1278,-9.703,1.8141,2.6467,-9.703,6.5519,18.369,10.4631,389
-4.7389,-8.9722,3.5661,10.4049,-8.9722,3.2381,18.4308,9.7206,390
-5.2739,-9.8669,1.0279,4.5217,-9.8669,11.1899,27.3105,15.1411,392
-2.3185,-9.8618,0.2997,1.2917,-9.8618,4.4701,10.9555,7.5692,393
-6.1232,-9.8779,1.4234,3.4352,-9.8779,5.8958,22.2032,10.5831,394
-3.8942,-10.1161,-0.4263,1.8319,-10.1161,3.2941,16.7051,13.0849,395
-0.6518,-9.8701,-0.0687,0.2985,-9.8701,0.982,3.8553,2.2893,396
-0.3973,-9.9093,0.2071,0.5882,-9.9093,1.362,12.8876,3.5693,397
-5.9635,-10.1008,-0.6779,2.2777,-10.1008,1.5749,16.6001,12.4221,398
-17.2535,-9.5078,-0.7499,7.2227,-9.5078,8.7402,41.2862,35.8793,399
-19.5703,-9.8681,-1.5439,4.977,-9.8681,6.1325,35.2423,24.0785,400
-8.3394,-9.9708,-0.8192,3.8509,-9.9708,2.7431,28.8346,20.1008,401
-2.7635,-9.8638,4.4785,5.9846,-9.8638,6.3667,22.9214,12.6317,402
-1.3377,-9.811,0.3939,1.4091,-9.811,3.0522,14.371,8.5518,403
-2.5894,-10.0973,0.4882,1.868,-10.0973,1.5864,9.3536,6.4865,404
-1.842,-9.7553,2.695,3.3178,-9.7553,2.1278,15.7957,9.0548,405
-8.5022,-9.618,-1.1667,3.1797,-9.618,3.5387,27.3589,24.427,406
-2.6689,-10.0803,2.2448,3.9784,-10.0803,2.7962,37.2911,30.228,407
-21.1645,-9.6364,8.3602,17.0857,-9.6364,7.3917,23.2798,19.6172,408
-9.6325,-9.5681,-3.8552,3.8614,-9.5681,6.3537,19.3025,14.8353,409
-9.6012,-9.9925,2.4577,11.6277,-9.9925,10.3411,33.2062,13.5131,410
-1.375,-9.6696,1.9106,2.4619,-9.6696,7.3071,22.1359,16.1348,411
-2.3812,-9.2981,1.6963,2.7064,-9.2981,5.5138,14.4822,9.9433,412
-1.7454,-10.0026,0.1437,1.0337,-10.0026,2.5469,8.3426,5.1935,413
0.0814,-8.9221,1.5843,1.2945,-8.9221,1.1893,17.0774,13.7677,414
-1.0217,-9.8625,0.3691,1.4222,-9.8625,3.3174,9.8143,5.6967,415
-2.8405,-10.0159,3.4059,4.0993,-10.0159,5.1861,16.5744,13.8397,416
-16.5695,-10.0079,-0.672,7.1989,-10.0079,9.0476,21.5356,17.4212,417
-8.8337,-10.0132,-2.6149,3.6273,-10.0132,3.85,18.619,9.7578,418
-4.1203,-9.8462,4.4605,6.6696,-9.8462,4.6848,24.1074,12.4104,419
-12.8595,-9.0719,2.3036,8.3707,-9.0719,8.0892,19.4818,11.8714,420
-10.2476,-9.3701,-0.7521,5.3681,-9.3701,5.2906,20.6112,13.1516,421
-20.9362,-9.9118,3.8214,16.8331,-9.9118,10.2859,27.2713,22.7155,422
-3.7589,-9.781,1.0616,2.6373,-9.781,4.5969,15.3823,6.0484,423
-9.8733,-10.0232,1.0417,5.4082,-10.0232,12.4948,18.9026,16.9094,424
-7.8987,-9.8799,4.2622,9.253,-9.8799,8.8261,25.4224,14.0554,426
-14.3478,-9.8067,3.6179,7.6924,-9.8067,7.7461,19.2764,12.7414,427
-7.4342,-9.8115,1.3705,4.5649,-9.8115,4.5126,14.1618,8.804,428
-8.4979,-9.658,10.0506,11.7913,-9.658,3.2063,27.5961,20.9051,429
-9.9271,-9.8205,-0.1558,2.6849,-9.8205,4.3473,9.0697,5.3164,430
-11.0508,-9.9091,0.7794,6.1427,-9.9091,5.8718,18.1513,8.7639,432
-46.2875,-9.2534,-3.4894,9.6587,-9.2534,6.8252,31.5442,7.709,433
-7.7748,-10.0178,14.745,20.7699,-10.0178,16.2932,38.8726,22.2749,434
-2.3951,-10.1974,-0.1291,1.4094,-10.1974,3.8469,12.1935,8.1625,435
-4.9819,-10.0802,5.4391,6.121,-10.0802,2.8629,17.2491,16.1416,436
-0.6532,-9.003,0.1867,0.6391,-9.003,1.0162,22.5516,10.0734,437
-1.1658,-9.7523,2.0979,2.6723,-9.7523,8.9048,20.9075,14.8201,438
-2.0829,-9.1953,0.3871,2.0196,-9.1953,3.9277,15.5827,9.235,439
-16.7639,-8.7361,-0.7232,6.5315,-8.7361,4.914,28.2236,10.1433,440
-12.7715,-9.6866,-0.1429,5.0879,-9.6866,5.7849,25.1108,9.3562,442
-7.7937,-9.8134,0.2168,2.9598,-9.8134,4.0556,13.5027,9.1623,443
-3.8226,-10.1706,0.3789,3.3814,-10.1706,3.3351,16.3677,12.2409,444
-0.4264,-9.6282,0.0244,0.3044,-9.6282,1.2863,15.6062,8.4261,445
-0.989,-10.0261,0.3787,1.9838,-10.0261,2.8147,13.1718,12.3027,446
-0.2957,-9.8506,1.1864,1.2143,-9.8506,1.4586,7.4297,5.8624,447
-1.8511,-9.9679,0.0068,1.127,-9.9679,1.2297,6.2143,5.7825,448
-0.8248,-9.8654,-0.0703,0.3497,-9.8654,2.3448,8.8113,4.6664,449
-1.1719,-8.9742,0.3207,0.9406,-8.9742,1.5251,16.4312,9.7467,450
-3.3354,-9.7937,2.1233,3.4165,-9.7937,5.14,14.7047,8.1744,452
-4.3162,-9.7409,0.0442,1.2139,-9.7409,2.1213,11.9758,4.4527,453
-6.2314,-8.9826,2.1856,5.6925,-8.9826,6.1461,15.1589,11.1101,454
-4.6835,-9.5509,0.124,4.233,-9.5509,4.7582,18.8397,14.0191,455
-21.821,-10.3102,8.9257,21.9834,-10.3102,13.0414,37.2958,22.1688,456
-7.9829,-9.856,1.6658,5.0627,-9.856,1.8556,11.2497,9.9194,457
-2.1339,-9.8499,-0.1834,1.7994,-9.8499,1.1513,11.324,8.1529,458
-10.4248,-9.7046,0.2196,3.4465,-9.7046,4.916,27.217,10.9445,459
-0.2645,-9.7682,3.6081,3.7559,-9.7682,7.3371,19.5077,17.5158,460
-10.7468,-9.98,2.7055,5.8328,-9.98,8.0962,21.3857,11.6679,462
-5.0757,-10.0354,2.3469,5.1271,-10.0354,7.5975,28.3868,8.2694,463
0.1025,-9.4503,9.0693,6.9307,-9.4503,6.1231,21.3568,13.5421,464
-7.4368,-10.1058,-1.1462,3.2401,-10.1058,5.8304,12.1232,10.813,465
-1.737,-9.8754,0.4903,1.4915,-9.8754,1.5374,7.9868,6.6706,466
-1.5221,-9.4845,0.3139,1.1526,-9.4845,3.8422,10.1096,4.6734,467
-6.9105,-9.8379,1.211,6.7277,-9.8379,4.0789,17.1943,13.2718,468
-4.7357,-9.8589,1.157,3.8311,-9.8589,7.0398,17.1814,8.548,469
-0.5374,-9.6984,0.4495,0.4683,-9.6984,1.8821,8.9621,7.6362,470
-4.4059,-9.8026,1.9423,3.9716,-9.8026,4.7947,15.0798,8.6579,472
-9.8433,-9.7913,5.5477,10.5964,-9.7913,9.3337,28.8895,16.5639,473
-20.4172,-9.9164,2.9887,12.9051,-9.9164,11.1369,31.7311,18.9569,475
-19.5087,-9.8358,8.0452,20.1462,-9.8358,14.1824,36.2204,21.4081,476
-3.6493,-10.154,-1.0225,2.1259,-10.154,1.5397,10.5956,7.3612,478
-0.8658,-9.6361,0.4802,0.9616,-9.6361,2.1665,12.7859,9.0485,479
-7.3587,-9.8089,4.6031,7.6908,-9.8089,6.6732,26.2953,10.9918,480
-5.4621,-9.8693,2.3302,5.4898,-9.8693,8.105,21.1622,12.2373,481
-10.5899,-9.9345,3.0074,10.2196,-9.9345,10.555,26.7016,12.2738,482
-16.8866,-9.6168,-0.5761,4.7759,-9.6168,5.7046,21.7397,12.1897,483
-7.5165,-9.9412,4.5363,8.0661,-9.9412,10.8352,23.0276,13.6576,484
-6.0839,-9.8898,0.5036,2.4377,-9.8898,5.4418,11.4938,6.6238,485
-8.6613,-9.747,-0.2635,2.3571,-9.747,4.2733,13.3273,5.6815,486
-5.949,-9.9253,0.0842,2.5148,-9.9253,4.1522,17.3681,7.5917,487
-8.7465,-9.65,1.1262,5.7746,-9.65,6.3907,17.8533,9.5349,488
-4.1665,-9.9632,-0.073,2.0904,-9.9632,4.3731,10.211,7.0845,489
-4.5767,-9.9323,1.1712,2.7504,-9.9323,4.6189,10.5856,4.3592,490
-2.8944,-9.7411,1.8255,2.8344,-9.7411,3.6082,9.2659,6.692,491
-6.2472,-9.8492,6.4254,15.7444,-9.8492,12.9095,37.6235,12.6011,492
-12.8446,-9.7229,1.2754,4.6578,-9.7229,6.9232,17.0206,9.6806,493
-0.9177,-10.1796,2.0332,3.7421,-10.1796,4.1411,10.1273,6.6898,494
-1.4646,-9.4323,0.9703,1.919,-9.4323,3.4939,13.3321,10.2725,495
-5.3031,-9.8424,1.0102,4.8651,-9.8424,7.5906,24.2744,19.5692,496
-0.3236,-9.7837,4.0532,4.3915,-9.7837,0.7094,13.3549,10.6499,497
-8.408,-10.1156,-0.1269,5.5383,-10.1156,2.4047,13.5754,12.3953,498
1.2064,-9.213,9.8022,7.8938,-9.213,4.9806,18.9186,16.6301,499
-5.0239,-10.0048,0.591,2.5025,-10.0048,3.7138,20.5455,14.9237,500
-55.2279,-9.9302,-9.9919,19.8347,-9.9302,6.9243,45.6233,41.3389,501
-155.2817,-8.8047,-10.4313,51.7938,-8.8047,9.4967,55.5116,24.5754,502
-62.9929,-9.7202,7.6171,27.9909,-9.7202,11.2211,28.0839,17.139,503
-25.093,-9.8347,-6.9386,7.2444,-9.8347,4.6672,15.5844,12.8414,504
-54.6214,-10.1459,-9.3836,22.3518,-10.1459,6.7819,48.1308,13.3639,505
-116.3349,-8.9297,-18.5329,48.4218,-8.9297,26.2502,51.5862,16.4935,506
-4.1962,-9.8311,-0.9131,1.6777,-9.8311,2.0384,6.5108,3.7883,507
-0.2247,-9.8562,-0.0077,0.1521,-9.8562,0.6665,1.6475,0.8875,508
-156.1093,-9.7513,-23.2333,119.0362,-9.7513,22.6128,54.1199,39.6967,509
-47.0715,-9.8082,-1.621,10.0722,-9.8082,4.0902,11.9993,4.1561,510
0.0139,-9.8179,0.2102,0.1116,-9.8179,0.2388,1.3663,0.8065,511
-12.6236,-9.8385,0.0343,4.5522,-9.8385,2.2584,8.8234,1.3494,512
-0.3318,-9.8582,0.3592,0.597,-9.8582,1.1307,7.8016,0.7482,513
0.0855,-9.8232,0.1578,0.0562,-9.8232,0.1154,1.242,0.6706,515
