AYGX_min,AZ_mean,AYGX_mean,AYGX_std,AZ_mean,GX_std,Gnorm_max,Gnorm_median,timestamp
0.1803,-9.7391,0.187,0.0031,-9.7391,0.0106,2.9739,2.9518,1
0.1789,-9.7385,0.1853,0.0035,-9.7385,0.0116,2.9659,2.9534,2
0.1808,-9.7388,0.1859,0.0028,-9.7388,0.0114,2.9848,2.9618,4
0.1797,-9.7383,0.186,0.0034,-9.7383,0.0114,2.9846,2.9635,5
0.1812,-9.7382,0.1867,0.0024,-9.7382,0.0095,2.9884,2.9638,6
0.1803,-9.7393,0.1866,0.0032,-9.7393,0.0117,2.989,2.9726,7
0.1807,-9.7389,0.1866,0.0025,-9.7389,0.013,3.0003,2.9659,8
-1.7329,-9.7367,0.1614,0.6549,-9.7367,0.9409,5.758,2.9696,10
-390.2187,-9.4411,-25.5632,105.6871,-9.4411,23.7025,50.3728,16.6215,11
-97.345,-9.2233,1.1585,55.5866,-9.2233,19.5413,73.869,11.5476,12
-104.3985,-9.5962,0.2522,27.1745,-9.5962,9.049,55.4449,8.6521,14
-13.539,-9.713,2.6864,6.1409,-9.713,8.0493,24.3661,14.2158,15
-7.5189,-9.7134,0.2845,5.6924,-9.7134,6.9688,30.0632,17.7487,16
-37.3658,-9.6151,-1.431,17.6343,-9.6151,8.6658,55.4137,25.0563,17
-19.4539,-9.7064,-0.2445,7.4137,-9.7064,5.4956,16.1496,4.7159,18
-15.2523,-9.7139,-0.3067,5.1857,-9.7139,3.9152,8.5342,4.5133,19
-1.8057,-9.7245,1.2731,2.283,-9.7245,2.1397,9.4524,3.7172,20
-23.6152,-9.7479,0.511,10.46,-9.7479,4.9702,15.0845,5.3914,21
-21.4208,-9.8391,1.8007,10.7235,-9.8391,7.5459,41.831,18.9318,22
-14.5428,-9.7782,12.1751,16.092,-9.7782,6.5761,37.4261,32.9314,25
-18.4963,-9.8032,-1.6224,12.7886,-9.8032,4.9141,23.448,22.163,28
-123.4369,-9.873,106.6431,138.5885,-9.873,8.6938,101.222,84.4806,29
-42.0743,-10.0518,-2.8387,26.1228,-10.0518,16.7327,79.6816,25.1288,31
-10.206,-9.7868,12.486,15.6673,-9.7868,3.2597,38.4299,19.3029,32
-114.6654,-9.3859,4.7107,24.792,-9.3859,14.0003,69.0053,25.596,35
-12.2662,-10.0134,-5.1166,5.2041,-10.0134,3.1991,53.0301,43.9148,36
-7.463,-9.9945,-0.9259,3.8553,-9.9945,4.687,39.5017,30.5229,37
-4.8416,-9.3156,1.991,4.5738,-9.3156,6.2068,41.7449,37.3682,38
-8.0521,-9.4308,29.5175,37.5503,-9.4308,4.5703,43.0424,39.3851,39
-18.2817,-9.5735,10.9007,20.4701,-9.5735,3.2306,40.0998,21.5095,40
-5.4307,-10.1056,-1.6408,1.986,-10.1056,2.7973,17.6266,11.6297,41
-3.4217,-9.9452,7.2366,10.4503,-9.9452,6.8207,24.4205,17.391,42
-7.8831,-9.7448,2.3973,7.2963,-9.7448,5.1718,31.1149,9.9857,43
-17.4228,-9.7643,3.4386,14.0407,-9.7643,7.4467,29.6802,10.0661,45
-191.1785,-9.9921,22.9083,68.981,-9.9921,20.9891,74.618,37.5521,46
-10.4057,-9.8581,0.6049,5.7248,-9.8581,6.0517,54.73,36.2465,47
-8.8247,-8.9321,-2.0802,3.9232,-8.9321,1.0488,31.1359,18.4866,48
0.071,-9.8939,16.3212,16.5887,-9.8939,5.9553,26.0403,17.6838,49
-6.8308,-9.4437,-3.2959,2.4382,-9.4437,1.1459,9.4728,6.0637,50
-19.3635,-10.1991,15.3928,24.8416,-10.1991,8.3638,69.8427,59.3012,51
-25.6948,-10.062,21.3287,44.8716,-10.062,15.8671,66.0091,50.3195,52
-52.1108,-9.2968,-4.6586,29.5588,-9.2968,3.4743,41.438,35.1623,53
-24.3563,-9.8155,-0.466,12.0505,-9.8155,9.4509,29.6699,19.447,55
-38.8143,-9.771,-1.9688,20.7747,-9.771,10.2309,37.561,18.3436,56
-7.5772,-8.9139,-0.8118,3.445,-8.9139,2.698,30.6434,17.6068,57
-15.7926,-10.424,20.9537,35.8609,-10.424,8.2296,39.4761,35.2582,58
12.0791,-9.6499,86.7712,67.8904,-9.6499,12.4085,64.6856,38.9135,59
-11.1648,-10.1218,1.6886,7.9001,-10.1218,4.8723,30.1206,19.3215,60
-20.5904,-10.0825,-4.5422,10.6542,-10.0825,4.4354,21.2029,17.9665,61
-0.7449,-9.7369,34.5342,21.4767,-9.7369,4.3381,48.1209,32.7599,62
-12.455,-9.4809,4.4762,12.1985,-9.4809,0.7091,29.8955,27.743,63
-13.987,-9.8755,2.0404,7.9937,-9.8755,5.2374,27.5448,18.8417,64
-14.0872,-9.6706,3.7094,12.1654,-9.6706,8.8741,31.6019,15.8833,65
-3.2593,-9.8149,1.0476,2.917,-9.8149,4.6309,16.7024,8.9674,66
-8.6467,-10.029,-1.6592,4.0641,-10.029,7.5613,16.9826,14.2358,67
-11.5053,-9.9459,-5.4926,3.9404,-9.9459,5.2952,20.1486,17.9166,68
-6.5997,-10.1767,-1.1043,3.2759,-10.1767,5.6037,18.798,14.1937,69
-42.2761,-9.7433,-0.0891,16.178,-9.7433,10.2533,34.0748,19.1877,70
-2.4259,-9.5866,0.1916,2.2486,-9.5866,3.5589,12.0482,6.8583,71
-11.5888,-9.4526,1.605,8.813,-9.4526,8.5361,20.5844,12.7964,72
-22.0021,-9.6583,-2.4757,10.0436,-9.6583,6.1432,27.5827,10.7213,73
-10.3292,-9.5283,13.0356,15.8433,-9.5283,12.8298,35.4446,24.0086,74
-38.7952,-9.8274,10.334,31.0461,-9.8274,22.1598,54.2041,34.9042,75
-6.352,-9.3193,15.7381,22.7042,-9.3193,13.7321,45.0597,19.1498,76
-7.1935,-9.8428,9.0238,10.7288,-9.8428,5.4604,30.9594,21.1849,77
1.0944,-9.9078,9.61,9.3425,-9.9078,3.9339,28.5262,16.7758,78
-4.3699,-10.3346,-1.825,2.5221,-10.3346,1.937,11.4296,7.3939,79
-5.3024,-9.744,0.4967,3.3129,-9.744,4.1925,12.8055,4.7203,80
-2.7065,-9.6524,0.9804,2.9325,-9.6524,3.1503,12.2687,7.7309,81
-5.21,-9.4415,1.499,4.4052,-9.4415,4.7164,14.9917,11.7314,82
-9.0122,-10.1581,-1.3154,4.7008,-10.1581,1.6978,13.7159,7.6676,83
-3.9006,-9.6902,-0.8484,1.336,-9.6902,1.0506,26.5382,20.5506,84
-14.0841,-9.4706,1.17,6.9468,-9.4706,1.4959,19.2456,12.1216,85
-2.0364,-9.7876,0.8086,2.5454,-9.7876,4.1781,23.1689,13.5929,86
-6.5676,-9.7453,3.6782,8.9098,-9.7453,4.8641,28.892,15.7982,87
-9.2256,-9.6825,-1.2081,4.5669,-9.6825,1.3504,21.6309,15.7191,88
-3.0673,-9.9521,-0.6097,1.4537,-9.9521,1.6616,9.4086,5.6326,89
-13.5846,-9.8385,5.5213,11.9365,-9.8385,4.3091,32.4104,15.5888,90
3.1051,-10.2052,18.4318,15.5712,-10.2052,5.8858,37.0093,25.8427,91
-9.2753,-9.7811,3.3171,10.8034,-9.7811,8.1944,31.2154,17.3066,92
-8.2424,-9.6005,10.5964,18.8373,-9.6005,5.8441,39.8769,35.1203,94
-10.3104,-9.9301,11.2357,16.0944,-9.9301,10.9269,41.9039,25.3135,95
-8.4459,-9.9799,9.9486,12.9109,-9.9799,10.1119,45.1717,24.7414,96
-37.074,-9.5816,0.4444,18.4148,-9.5816,2.7511,48.6348,29.0411,97
-44.7331,-9.6114,12.6946,29.4807,-9.6114,12.9564,60.6631,22.6109,98
-12.3455,-9.8084,3.718,9.5295,-9.8084,7.5985,28.9418,20.2711,99
-12.0021,-9.551,19.8218,23.4341,-9.551,7.3139,35.6465,27.806,100
-5.0639,-9.8226,15.936,18.9392,-9.8226,12.947,32.1923,18.8562,101
-2.3796,-10.0243,2.8181,3.2872,-10.0243,3.1516,11.0247,7.5242,102
-2.5831,-9.5413,6.6096,6.4895,-9.5413,8.7302,28.2363,15.9593,104
-26.848,-9.9107,4.2118,16.3715,-9.9107,12.2317,57.5558,18.7006,105
20.1406,-9.6093,52.6981,20.0743,-9.6093,5.5129,51.9011,35.2832,106
-3.7723,-9.3104,13.9736,11.4542,-9.3104,5.07,27.7765,20.6754,107
-2.165,-9.8975,0.2294,1.4278,-9.8975,2.8697,20.0639,10.8761,108
-46.2567,-9.4129,3.138,21.055,-9.4129,1.9714,20.8646,13.3294,109
-20.7855,-9.8337,-1.5309,8.2001,-9.8337,6.1778,18.0585,13.4406,110
-17.938,-9.7435,2.4695,15.8652,-9.7435,5.2706,23.7388,13.9532,111
-1.1516,-9.8011,1.4514,1.8774,-9.8011,0.5951,9.0054,5.3646,112
0.3477,-9.8125,5.363,5.3471,-9.8125,11.5041,23.1432,17.6791,114
-5.1373,-9.8254,2.5153,4.4071,-9.8254,5.5763,17.995,10.3638,115
-1.9386,-10.0505,0.059,1.1372,-10.0505,1.0122,9.5777,4.2667,116
-3.0821,-9.7066,-0.6931,1.1683,-9.7066,2.1239,11.1508,6.2243,117
-3.3805,-9.7333,-0.171,1.5859,-9.7333,2.1571,11.5302,7.3261,118
-3.0197,-9.7522,0.0021,1.4778,-9.7522,2.0742,14.1819,10.6496,119
-7.883,-9.7829,5.9583,9.4739,-9.7829,5.7801,25.0357,21.385,120
-9.5714,-9.7919,-0.3656,4.0372,-9.7919,2.2982,17.7244,9.2642,121
-4.2162,-9.861,0.3972,4.1738,-9.861,4.5471,13.6871,7.1748,122
-6.0539,-9.9479,17.2659,22.0528,-9.9479,15.9837,44.2454,30.2474,124
-26.5147,-9.8055,-0.9783,8.8062,-9.8055,9.7445,46.3377,17.5819,125
-19.6542,-9.5883,-9.2019,7.3567,-9.5883,9.2713,27.9116,11.9535,126
-18.9507,-9.637,6.7296,19.2529,-9.637,6.4911,27.6979,20.8335,127
-15.1221,-10.7268,6.1272,26.0551,-10.7268,13.9941,61.6111,52.4988,128
-35.9114,-9.4569,20.5259,44.6589,-9.4569,19.7224,78.7421,20.4917,130
-5.3216,-9.506,24.7605,28.4689,-9.506,11.722,39.4513,26.2205,131
-1.0848,-9.8441,2.0882,4.3708,-9.8441,6.3585,13.3838,11.2,132
-21.2816,-9.2715,9.3006,31.5758,-9.2715,10.0131,42.2125,24.1751,134
-14.2565,-9.3337,1.0454,6.6309,-9.3337,6.7135,32.5211,11.8506,135
-15.1665,-9.628,7.1569,17.0663,-9.628,10.391,25.7202,18.4924,136
-7.9636,-9.9324,0.0725,6.9323,-9.9324,5.3449,13.2003,10.6679,137
-0.6595,-10.028,23.2908,18.1678,-10.028,13.4006,28.0246,22.0205,138
-46.7855,-10.2203,15.5981,47.1595,-10.2203,6.8133,32.3795,26.768,139
-14.3335,-8.4565,14.4953,19.159,-8.4565,3.5578,27.8107,21.0086,140
-36.5898,-9.7723,8.4875,19.3976,-9.7723,13.7797,36.8146,22.2573,141
-7.4411,-10.3595,-0.525,3.53,-10.3595,9.8968,28.2258,26.5786,142
-23.665,-9.4093,-5.9,12.1212,-9.4093,4.542,20.386,14.1574,144
-40.6425,-9.589,4.827,23.1177,-9.589,11.9724,35.8791,26.0959,145
-33.8759,-10.408,-13.0662,14.7505,-10.408,5.1747,37.4559,19.4556,146
-9.6958,-8.7188,-0.7243,4.9352,-8.7188,3.9618,14.2292,10.8943,147
-3.6086,-9.7717,11.8493,20.6086,-9.7717,8.2589,31.4079,29.1415,148
-215.5595,-10.631,-5.4351,122.1008,-10.631,28.1992,119.5787,31.703,149
-13.6685,-9.6433,0.3316,9.1078,-9.6433,5.8183,27.5687,17.6556,150
-49.3249,-9.7193,-1.1833,25.4477,-9.7193,14.0984,33.6023,22.1447,151
-6.7326,-10.1653,3.5201,12.0706,-10.1653,4.5523,26.4673,17.1317,152
-1.3323,-9.1834,0.4218,1.6586,-9.1834,1.8468,8.3901,4.9665,154
-28.5593,-9.9105,2.8874,16.9515,-9.9105,9.8215,32.5372,18.9848,155
-17.9202,-9.9149,-2.5691,9.3855,-9.9149,6.3313,18.9656,12.7607,156
-49.3053,-9.5523,-3.6708,32.7171,-9.5523,6.4543,27.3618,23.2702,157
-8.5264,-9.7179,-1.8917,3.8692,-9.7179,1.8346,22.0232,9.0105,158
-2.0659,-10.273,28.5393,28.6473,-10.273,2.3429,46.3949,28.5841,159
-0.8236,-9.9604,11.7085,9.9229,-9.9604,6.1099,59.2654,42.4009,160
-33.8868,-9.7035,-3.5619,27.4621,-9.7035,10.7548,50.8967,45.5798,161
-25.5896,-9.7921,-9.7343,10.1616,-9.7921,4.9414,37.5156,18.9394,162
-3.5625,-9.9673,2.2854,3.2446,-9.9673,2.4264,30.8415,22.832,164
-35.8856,-10.0797,14.2346,25.4534,-10.0797,21.745,55.3767,39.1919,165
-27.8038,-10.8065,-0.3662,19.024,-10.8065,13.0746,47.9536,43.0465,166
-8.6843,-10.3703,36.1156,36.0672,-10.3703,5.6846,46.1606,40.834,167
-29.2988,-9.8062,6.7846,28.372,-9.8062,8.668,45.1109,21.1226,168
-11.043,-9.7216,3.1283,8.5242,-9.7216,8.0792,35.5326,17.0308,170
-32.281,-9.605,2.6262,19.5402,-9.605,12.5045,37.2425,16.6346,171
-6.9595,-10.2221,4.8804,9.5812,-10.2221,5.1511,34.1021,24.4946,172
-10.8551,-9.4261,8.1777,13.8394,-9.4261,6.4792,28.6047,22.7338,173
-3.544,-10.099,-1.316,1.4832,-10.099,3.3974,10.3046,5.6766,174
-0.521,-9.5919,0.6529,1.027,-9.5919,5.128,10.8805,6.5099,175
-1.7466,-9.5752,9.1279,7.84,-9.5752,15.2013,24.437,19.3633,176
-5.3451,-9.1871,5.1762,9.4895,-9.1871,5.1129,22.5129,19.9319,177
-7.0899,-9.8285,-0.603,4.5914,-9.8285,2.7509,16.1657,11.2695,179
-64.57,-9.7442,5.9251,31.3862,-9.7442,12.1206,48.772,17.131,180
-5.5066,-9.9552,0.52,3.627,-9.9552,2.7507,16.1531,10.1665,181
-2.7424,-9.317,14.4808,12.6296,-9.317,10.9002,35.6174,26.5729,182
-25.5031,-9.1007,0.4031,13.4034,-9.1007,2.9466,21.1238,14.2922,183
-35.4765,-10.9925,-3.6756,15.6947,-10.9925,11.0872,60.7607,26.3802,184
-21.846,-9.538,10.9849,21.673,-9.538,19.421,45.8046,27.8868,186
0.0199,-9.6379,9.681,9.0252,-9.6379,5.0361,21.9139,18.1218,187
-50.6028,-9.2692,17.012,39.1266,-9.2692,18.0649,52.4367,34.544,189
-29.1023,-9.4596,36.1813,68.2338,-9.4596,24.3212,86.6472,33.958,190
-2.6393,-9.1127,-0.0736,1.2762,-9.1127,2.9654,13.7599,8.6269,191
-20.2964,-9.697,-0.4479,7.7465,-9.697,8.2314,28.3983,12.9113,192
-16.3445,-8.9061,6.6104,16.9816,-8.9061,5.8999,32.5898,25.1477,193
-18.2496,-9.4743,-4.237,11.3056,-9.4743,7.3492,40.0252,34.3223,194
-19.4941,-9.9902,55.4993,55.84,-9.9902,28.2749,59.7009,47.4775,195
-56.9873,-9.8646,6.8352,30.5425,-9.8646,10.3133,31.0605,26.5218,196
-19.7889,-8.563,20.3402,23.3144,-8.563,5.5403,34.7789,25.9501,197
-5.7614,-10.2362,5.3474,7.068,-10.2362,9.9734,35.1907,21.2403,199
-49.9915,-9.2956,7.8227,25.7369,-9.2956,21.6513,47.9118,28.846,200
-12.4717,-9.7719,14.2679,29.7581,-9.7719,11.9764,38.2318,16.6007,201
-6.4616,-10.3686,5.5131,10.3948,-10.3686,2.1319,18.246,14.0839,202
-85.2481,-8.0843,-5.2318,57.968,-8.0843,9.0933,48.4201,28.8153,203
-6.5881,-9.7292,1.478,5.9576,-9.7292,4.718,17.4306,8.973,204
-2.2814,-9.7724,3.2459,4.8177,-9.7724,3.2211,15.0043,9.7903,205
-5.2569,-9.1316,7.1966,10.7806,-9.1316,6.4508,19.0937,10.5364,206
-33.7782,-8.6306,-1.1121,9.9621,-8.6306,6.2395,30.1534,21.9716,209
-16.76,-9.5935,0.9268,13.9125,-9.5935,11.9197,40.074,18.6913,210
-16.751,-9.796,-4.8979,10.9267,-9.796,1.307,19.8695,16.6745,211
-24.9571,-10.0154,-5.1683,17.6482,-10.0154,3.8712,25.4737,17.4078,212
-19.4501,-10.0991,-2.6605,10.06,-10.0991,3.5133,18.6567,14.1683,213
-6.4808,-9.9923,6.4467,9.6433,-9.9923,4.954,31.263,20.667,214
-26.9735,-10.3077,6.502,24.2871,-10.3077,6.3217,29.0847,23.7286,215
-17.2989,-9.7223,0.1356,7.0239,-9.7223,5.1621,16.2994,11.7572,216
-0.827,-9.9638,2.3051,4.0502,-9.9638,5.1753,20.8421,17.6732,217
-26.1462,-9.0354,-7.6521,9.1939,-9.0354,10.3458,28.9859,19.4425,219
-19.1147,-9.4481,-0.308,7.3212,-9.4481,7.787,28.0496,16.0545,220
-4.9963,-8.7407,0.5416,3.084,-8.7407,1.811,10.9322,8.2126,221
-7.9647,-9.5666,-2.8018,2.7156,-9.5666,0.755,11.77,9.6769,222
-4.5861,-9.9578,-0.5774,2.5063,-9.9578,2.4507,14.6621,10.6717,223
-2.8318,-8.7752,-0.6815,1.7933,-8.7752,1.7742,22.8191,9.2856,224
-2.3505,-9.8208,-0.7055,2.0588,-9.8208,2.4241,24.884,19.6588,225
-9.4177,-9.8413,0.1561,5.4092,-9.8413,2.9155,45.9186,35.3045,226
-8.6758,-9.7856,0.651,5.2956,-9.7856,0.8251,40.4001,38.3892,227
-12.0147,-9.7257,-1.865,4.2357,-9.7257,2.637,17.7851,9.8159,229
-12.2848,-9.786,0.4789,4.9685,-9.786,5.9098,34.0485,15.3705,230
-33.3311,-9.7802,-6.3377,11.7168,-9.7802,4.2154,31.2448,9.7174,231
-13.8609,-9.8151,17.1282,23.1105,-9.8151,5.2557,36.824,31.4823,232
-11.3996,-10.7999,-0.2149,11.8178,-10.7999,1.9275,64.5538,62.983,233
5.7082,-9.6586,26.5039,18.9293,-9.6586,4.874,45.583,24.3803,234
-15.1582,-9.698,3.7188,12.4163,-9.698,4.5805,45.3369,40.9618,235
-4.3753,-9.8202,2.23,4.5643,-9.8202,2.0867,61.652,52.2945,236
-8.8765,-9.7448,0.5794,3.3779,-9.7448,2.7537,55.377,44.1632,237
-4.9916,-10.0075,0.7991,3.9671,-10.0075,2.5389,30.6493,20.3028,239
-13.2132,-10.002,2.2237,10.8297,-10.002,6.8235,73.9882,42.8878,240
-10.6699,-9.6302,-1.1049,7.1836,-9.6302,3.8076,62.2042,57.065,241
-23.6716,-9.9575,0.5499,14.4439,-9.9575,7.3724,50.6678,38.8643,242
-2.1451,-9.8527,0.1546,1.3945,-9.8527,2.1792,8.6284,5.9556,243
-10.599,-9.5083,0.168,5.4543,-9.5083,3.1362,22.7767,11.4401,244
-69.5642,-9.8753,-6.5976,35.6676,-9.8753,8.4835,68.0127,48.5433,245
-6.6335,-10.0777,0.0535,3.8914,-10.0777,2.6118,40.7217,35.1976,246
-18.4532,-9.8297,2.7152,11.4885,-9.8297,5.3114,36.8154,22.4129,247
-2.4553,-9.7034,-1.0203,0.7779,-9.7034,1.7886,10.6319,6.1096,249
-14.9024,-9.827,7.0082,14.5571,-9.827,9.9156,54.3757,18.1518,250
-28.3279,-9.8574,-3.5037,10.8973,-9.8574,7.4859,71.0331,40.3063,252
-7.5558,-10.1521,-1.5587,2.8016,-10.1521,3.3414,5.7358,4.634,253
-6.1868,-9.825,6.8283,13.1431,-9.825,1.289,21.4871,11.3221,254
-5.9829,-9.8433,1.1912,3.4726,-9.8433,3.1498,53.8872,39.837,255
-2.957,-9.7996,-0.4638,1.2412,-9.7996,1.9222,37.2071,28.0494,256
-10.7956,-9.6184,-2.2651,4.3951,-9.6184,3.1448,23.0272,12.8874,257
-2.2912,-9.6761,1.1349,1.7132,-9.6761,2.7129,23.4908,19.8714,258
-8.7729,-9.8183,4.4719,6.0807,-9.8183,5.3207,27.3002,13.3192,260
-2.7762,-9.8803,-0.1657,1.4417,-9.8803,2.0373,18.2397,12.9027,261
-3.0786,-9.8404,0.446,1.6973,-9.8404,2.5137,10.7904,7.1568,262
-37.4852,-9.6571,-8.5364,13.865,-9.6571,5.6259,29.7287,13.865,263
-36.4939,-9.7317,-0.6325,16.5656,-9.7317,0.9411,25.016,20.7239,264
-14.2027,-9.7837,5.4456,14.6482,-9.7837,3.0239,41.4425,35.3159,265
-1.2217,-9.7488,6.6898,6.8478,-9.7488,3.7005,34.2668,28.679,266
-56.5322,-9.9111,-3.5667,28.3717,-9.9111,7.2035,60.9237,14.8909,267
-70.1557,-10.3813,-9.7282,35.854,-10.3813,10.5937,37.7402,32.9423,268
-73.3015,-9.5999,31.9504,68.4483,-9.5999,34.0445,86.6657,41.9054,270
-22.1566,-10.0226,21.4552,27.9651,-10.0226,13.0497,65.8201,50.4903,271
-5.4657,-10.8408,26.1495,26.745,-10.8408,10.8829,46.3878,37.7645,272
-105.5852,-9.777,15.9932,44.4001,-9.777,18.9984,71.8926,29.0792,273
-13.213,-10.8152,44.9875,45.4502,-10.8152,27.5517,96.5314,79.2382,274
-11.8332,-10.4482,68.7473,72.4992,-10.4482,17.7682,84.2978,56.934,275
-8.7146,-9.8643,17.1238,22.7575,-9.8643,15.9109,50.8412,40.386,276
-1.5098,-10.1876,4.502,6.598,-10.1876,4.4566,28.7298,17.0761,277
-27.022,-10.6943,-1.0666,13.0035,-10.6943,7.237,53.2408,37.5074,278
-6.4234,-9.9819,107.3906,93.6769,-9.9819,15.3821,93.5856,74.3935,279
-6.9967,-10.5966,-0.4874,4.2936,-10.5966,3.4697,64.4235,46.7576,280
-10.1458,-9.8534,12.7516,22.1814,-9.8534,11.1415,26.7482,13.823,281
-24.3571,-9.9709,47.9841,77.6124,-9.9709,34.8263,82.956,65.6941,282
-11.2965,-10.3964,31.2562,28.7864,-10.3964,9.2049,63.2136,53.4444,283
-22.2343,-9.9202,24.8769,23.8006,-9.9202,14.3203,69.024,37.4398,284
-15.2364,-10.1647,4.1667,17.9669,-10.1647,9.5994,64.2517,42.4599,285
-15.0571,-9.8259,3.6445,9.0319,-9.8259,6.5776,32.5959,15.2868,286
-7.3851,-9.709,1.8857,7.0737,-9.709,2.4854,9.8544,6.4838,287
-14.8234,-10.1613,-2.7289,9.1132,-10.1613,1.2266,20.6924,17.2929,288
-15.5244,-8.9766,7.0908,16.4857,-8.9766,9.3033,29.4056,23.0881,289
-9.3032,-10.032,5.3037,8.6471,-10.032,4.3702,32.6339,20.0424,290
-36.9065,-9.3063,-2.0683,34.876,-9.3063,11.2552,48.5392,39.7237,291
-14.6462,-9.6054,-1.9067,5.4215,-9.6054,3.0456,38.227,32.6654,292
-148.4346,-9.1728,-20.6339,48.8185,-9.1728,9.5702,87.8854,37.1718,293
-17.0814,-9.7583,-3.2529,6.8714,-9.7583,6.0256,67.9456,55.3589,294
-46.3118,-9.7078,5.8167,30.8952,-9.7078,4.1018,64.3488,56.2586,295
-62.604,-9.5738,-27.3646,16.5467,-9.5738,3.7423,20.7071,12.6619,296
-3.9199,-9.4551,16.9678,19.5418,-9.4551,8.4518,27.552,15.1506,297
-34.1511,-9.7655,-4.5123,13.4251,-9.7655,10.5748,30.0892,7.7382,298
-22.2693,-9.8248,-2.8124,8.0424,-9.8248,7.8475,31.8815,5.7707,299
-5.906,-9.6,-0.9311,2.6667,-9.6,3.3703,12.8734,3.7929,300
-3.4266,-9.6651,0.1557,3.3154,-9.6651,4.22,9.6795,3.9188,301
-4.0702,-9.8698,-1.0005,1.9916,-9.8698,2.2103,7.9459,4.4728,304
-9.8666,-9.7474,-1.2047,3.3034,-9.7474,3.308,13.5652,3.7427,305
-1.685,-9.7965,-0.7141,0.6892,-9.7965,0.8617,3.497,3.1022,306
-3.033,-9.8454,-0.4011,2.0997,-9.8454,2.9169,10.3055,5.0866,307
-6.8264,-9.7734,-1.0982,2.5922,-9.7734,3.7644,13.6233,3.2008,308
-1.7879,-9.7855,-0.6853,0.4909,-9.7855,0.6074,3.4648,2.815,310
-0.9687,-9.776,-0.6697,0.1184,-9.776,0.1343,2.9369,2.8208,311
-0.7466,-9.7769,-0.6654,0.0441,-9.7769,0.0519,2.8684,2.8306,312
-0.6853,-9.7767,-0.6611,0.0139,-9.7767,0.0166,2.8563,2.8307,313
-0.6815,-9.7768,-0.664,0.0073,-9.7768,0.0114,2.8631,2.8354,314
-0.6704,-9.7771,-0.6654,0.0042,-9.7771,0.0088,2.8588,2.8459,315
-10.1543,-9.7556,-1.4195,3.9205,-9.7556,2.8773,7.5499,3.1918,316
-1.88,-9.7996,-0.7266,0.8046,-9.7996,0.9062,3.3858,2.8451,317
-0.7367,-9.78,-0.5859,0.1161,-9.78,0.138,2.8887,2.8318,319
-0.6639,-9.7789,-0.6292,0.0143,-9.7789,0.0192,2.8582,2.8285,320
-0.705,-9.7796,-0.6166,0.0518,-9.7796,0.0623,2.8538,2.8242,321
-0.6795,-9.7789,-0.6298,0.0272,-9.7789,0.0347,2.8558,2.8294,322
-0.6462,-9.7788,-0.6259,0.0169,-9.7788,0.0246,2.8582,2.8321,323
-0.6476,-9.78,-0.6206,0.0136,-9.78,0.0182,2.8285,2.8233,324
-0.6535,-9.7784,-0.6298,0.017,-9.7784,0.0221,2.8549,2.8295,325
-0.6491,-9.7787,-0.6209,0.0161,-9.7787,0.0202,2.8346,2.8215,326
-0.6675,-9.7777,-0.6255,0.0228,-9.7777,0.0256,2.852,2.8219,327
-0.668,-9.7778,-0.6248,0.0164,-9.7778,0.0208,2.8558,2.8303,329
-0.6599,-9.7786,-0.628,0.0193,-9.7786,0.025,2.8517,2.8301,330
-0.6745,-9.778,-0.6323,0.0213,-9.778,0.0254,2.8511,2.8354,331
-0.6656,-9.7785,-0.6287,0.0162,-9.7785,0.0199,2.8587,2.8329,332
-0.6653,-9.7781,-0.6334,0.0187,-9.7781,0.0225,2.8655,2.8414,333
-0.7234,-9.7784,-0.6415,0.0386,-9.7784,0.0484,2.8755,2.8421,334
-0.6831,-9.7771,-0.6483,0.0249,-9.7771,0.0361,2.8717,2.8352,335
-0.7163,-9.7794,-0.6207,0.0553,-9.7794,0.0729,2.8555,2.8219,336
-0.6528,-9.7781,-0.6231,0.0209,-9.7781,0.0312,2.8473,2.8176,337
-0.7065,-9.7783,-0.6334,0.0387,-9.7783,0.0466,2.891,2.8342,339
-0.7003,-9.779,-0.629,0.0341,-9.779,0.0382,2.8572,2.8309,340
-0.6912,-9.7777,-0.6228,0.0284,-9.7777,0.0399,2.8568,2.8132,341
-0.663,-9.7787,-0.6291,0.0192,-9.7787,0.0247,2.8546,2.8325,342
-0.6828,-9.7787,-0.6318,0.0191,-9.7787,0.0201,2.8627,2.8286,343
-0.6644,-9.7793,-0.6317,0.0186,-9.7793,0.0261,2.8433,2.8291,346
-0.6632,-9.7771,-0.6328,0.0225,-9.7771,0.0259,2.8574,2.833,347
-0.6489,-9.78,-0.6211,0.0162,-9.78,0.0187,2.8313,2.8165,349
-0.8779,-9.778,-0.6314,0.0914,-9.778,0.1054,2.926,2.8284,350
-2.0486,-9.7717,-0.6178,0.5885,-9.7717,1.0159,4.193,2.861,351
-36.7802,-9.7601,-0.317,11.5925,-9.7601,6.2112,21.4273,3.0304,352
-3.1199,-9.6553,0.2213,2.4831,-9.6553,1.7851,8.9372,4.3008,353
-17.3706,-9.5801,5.3848,15.2681,-9.5801,7.4926,25.3218,15.1249,354
-8.4365,-9.5102,3.6809,7.6411,-9.5102,5.3831,39.5481,11.9948,355
-18.4392,-9.8527,4.3084,16.2625,-9.8527,10.2761,22.4868,14.1259,357
-44.5374,-9.8835,1.0764,14.4215,-9.8835,7.3595,65.7186,25.3351,358
-25.5849,-9.7294,1.5054,10.9002,-9.7294,8.7594,68.0129,18.9416,359
-2.159,-9.6868,0.2177,2.1118,-9.6868,1.9178,11.1279,6.3525,360
-9.6794,-9.8575,1.0031,4.1001,-9.8575,4.0554,27.6961,19.4962,361
-0.7096,-9.63,-0.1557,0.3823,-9.63,1.2651,18.067,10.9737,362
-4.4934,-9.7722,-0.0275,1.7728,-9.7722,2.2878,17.0853,6.1779,364
-3.5531,-9.7233,0.8204,2.9026,-9.7233,3.5091,31.7599,9.1385,365
-2.5064,-9.5401,0.4785,2.375,-9.5401,3.0593,6.0938,5.0312,366
-15.6864,-9.8865,-6.799,5.6559,-9.8865,5.0978,47.8012,32.4289,367
-6.2189,-9.7516,-0.9196,5.5959,-9.7516,3.8114,21.5949,19.685,368
-6.4024,-10.0201,0.1658,6.6277,-10.0201,1.3926,53.7789,49.4145,369
-24.095,-9.8164,8.8329,20.2449,-9.8164,3.8578,99.8881,33.4439,370
-19.6712,-9.9457,3.7092,12.2998,-9.9457,9.2056,54.5018,42.6895,371
-4.7724,-9.8263,10.0959,10.4758,-9.8263,3.717,37.7146,26.9676,372
-9.9683,-9.7654,2.0084,4.9411,-9.7654,4.5162,21.4528,17.4911,374
-9.9682,-9.5583,2.5805,5.2968,-9.5583,3.7335,26.5465,17.7538,375
-8.0208,-9.5571,-1.3326,7.2179,-9.5571,1.1295,18.2351,13.3597,376
-5.1002,-9.8553,-0.6476,2.165,-9.8553,3.1645,11.4973,7.3049,377
-6.4539,-9.7187,-1.0985,2.6563,-9.7187,1.1946,18.1825,12.051,378
-7.8911,-9.8166,0.3408,5.482,-9.8166,0.6302,14.4929,10.0431,379
-14.31,-9.9729,-3.2325,5.428,-9.9729,4.9159,49.0271,38.3553,380
-5.4377,-9.6969,1.4435,5.1154,-9.6969,6.4036,27.6164,22.2442,381
-10.2241,-9.7932,1.8845,7.5835,-9.7932,2.2835,26.6881,8.4105,382
-3.3322,-9.9048,1.64,5.5484,-9.9048,5.8113,52.6312,43.0587,384
-16.6482,-9.8575,6.612,11.3053,-9.8575,9.3718,62.9243,27.17,385
-32.504,-9.746,2.8949,24.9726,-9.746,1.51,35.1978,21.7655,386
-16.6931,-10.0946,3.4428,22.5936,-10.0946,3.0463,15.9999,13.0546,387
-0.4582,-9.9603,9.5669,6.4766,-9.9603,1.6586,49.5055,33.9714,388
-10.8726,-9.7988,-2.0587,3.5107,-9.7988,1.446,7.5288,5.5134,389
-3.5312,-9.7771,-0.0395,2.1544,-9.7771,3.5812,7.8121,5.3555,391
-16.9029,-9.6995,-3.4821,4.8463,-9.6995,3.3244,16.8351,6.3243,392
-6.2386,-9.679,14.0243,15.448,-9.679,7.8255,67.2413,37.3631,393
-3.2343,-10.0239,10.0981,9.8959,-10.0239,2.9666,20.3474,16.2856,394
-17.6263,-10.3474,-5.63,8.1404,-10.3474,7.1708,85.277,59.6058,395
-12.4464,-9.712,33.9919,37.9331,-9.712,16.6622,60.2877,40.5115,396
-21.325,-9.7617,4.8783,17.9241,-9.7617,6.7955,35.0716,27.0706,397
-9.1923,-10.6456,6.4849,15.7162,-10.6456,15.2666,59.1185,25.726,399
-76.8818,-9.8795,6.5501,34.0161,-9.8795,20.5028,62.8981,28.5583,400
-10.4012,-10.0139,10.8627,21.3646,-10.0139,16.6307,44.8847,33.2656,401
-6.1725,-9.6676,1.144,6.8125,-9.6676,8.9006,24.014,20.2367,402
-17.4452,-10.6561,3.4598,17.1019,-10.6561,18.1669,50.4375,48.9278,403
-1.7286,-9.6919,10.5268,15.4575,-9.6919,12.203,37.5073,30.767,404
-7.7725,-9.5654,0.5077,7.4363,-9.5654,3.1024,19.5964,13.2419,405
-19.2678,-9.6691,-0.9578,9.6919,-9.6691,5.3335,17.7102,15.626,406
-0.7852,-10.0001,1.9504,3.2365,-10.0001,3.5149,9.4942,6.6442,407
-4.8769,-9.5673,5.2482,7.0796,-9.5673,7.6388,18.0227,12.3871,409
-63.4163,-9.4746,8.8367,29.1785,-9.4746,18.3706,38.8676,26.4666,410
-16.7383,-9.5966,8.0792,23.0413,-9.5966,1.4018,30.6388,23.8079,411
-12.2866,-9.7463,5.6467,16.1432,-9.7463,8.7077,30.3966,12.6376,412
-4.4935,-9.9343,2.1276,4.1718,-9.9343,6.1542,17.1715,13.2781,413
-9.4484,-8.8041,4.8104,9.8014,-8.8041,5.138,22.2611,21.3821,414
-30.7952,-9.7766,-3.3482,17.0862,-9.7766,6.3905,32.6432,29.335,415
-17.1827,-9.784,5.059,15.1053,-9.784,11.1926,24.501,13.1946,416
-19.2197,-9.057,-3.7082,9.6358,-9.057,2.7832,17.0814,12.2571,417
-9.7469,-10.0954,-1.7114,4.3685,-10.0954,2.5341,14.6636,8.2428,419
-10.8666,-9.7973,1.3856,7.6378,-9.7973,7.9208,24.8376,10.7695,420
-10.2834,-9.9199,0.7093,6.2182,-9.9199,4.0803,16.8331,12.7457,421
-6.4001,-10.0716,-1.5469,2.3769,-10.0716,1.6759,13.7322,11.1481,422
1.3976,-9.6194,13.8084,10.0849,-9.6194,5.9593,23.6288,19.4518,423
-5.1172,-9.9626,2.5988,4.8823,-9.9626,4.8096,22.8349,18.1634,424
-1.9599,-9.8691,1.6505,2.8002,-9.8691,1.3921,11.1143,9.6488,425
-1.6705,-10.1735,4.1554,6.3912,-10.1735,3.9665,40.5902,31.5377,426
-2.4577,-10.445,-0.2036,1.2354,-10.445,1.7754,50.3979,48.3193,427
-8.6852,-9.8818,29.1261,33.9168,-9.8818,1.4464,42.4023,35.6183,429
-7.2235,-9.8625,0.5144,6.5941,-9.8625,7.1725,20.0302,11.0226,430
-18.6312,-9.6747,3.1876,11.1671,-9.6747,9.131,25.2809,14.7771,431
-15.9479,-9.6835,4.7345,12.3359,-9.6835,13.2654,26.4155,14.6974,432
-5.6009,-9.9517,-2.2781,1.9989,-9.9517,1.4547,13.1366,10.1424,433
-0.8465,-9.8415,1.8051,2.3119,-9.8415,5.6805,19.3375,13.187,434
-22.4104,-9.8511,3.1445,11.0331,-9.8511,6.494,21.5777,14.3128,435
-11.923,-9.603,2.2312,5.9105,-9.603,6.3067,22.5526,12.4618,436
-8.6016,-10.0178,8.1741,15.0491,-10.0178,5.1099,34.2533,25.3477,438
-9.9493,-9.8681,14.402,20.4856,-9.8681,5.9143,43.6381,27.5994,439
-35.0255,-9.8505,3.7488,17.687,-9.8505,11.5322,48.5371,23.2247,440
-2.768,-10.6917,6.1662,15.8176,-10.6917,3.675,60.6331,48.3058,441
-12.4502,-9.6408,16.5874,34.3968,-9.6408,5.2725,36.0638,30.8865,444
-23.6743,-9.7679,2.5368,10.3201,-9.7679,11.4588,26.6805,18.0105,445
-2.0323,-9.8842,8.7858,10.882,-9.8842,7.3192,22.0975,18.8673,446
-7.1721,-9.5828,0.7485,6.099,-9.5828,5.7375,17.4694,10.6512,447
-6.7945,-9.9237,5.6512,11.2927,-9.9237,3.7857,20.1801,14.5479,448
-9.2893,-9.4972,0.5936,9.9129,-9.4972,5.8006,15.992,11.2235,449
-39.7404,-10.2047,0.1492,19.7549,-10.2047,2.6724,16.6989,14.0451,450
-4.773,-9.9683,4.8858,7.8267,-9.9683,7.1805,23.3325,14.8505,451
-3.3886,-9.9056,0.6971,2.7636,-9.9056,3.3367,19.5443,9.1268,452
-4.3441,-10.1531,2.3332,4.5336,-10.1531,1.1925,10.816,8.5512,454
-12.8181,-9.8803,0.933,6.1783,-9.8803,7.6486,16.8461,12.0451,455
-2.0616,-9.6837,-0.1102,1.4608,-9.6837,1.1197,7.8265,4.3534,456
-6.6209,-9.9799,-1.04,2.4822,-9.9799,1.4291,10.3282,5.4609,457
-3.9922,-9.3717,20.2402,24.6122,-9.3717,2.7359,45.1156,29.8305,458
-3.8156,-9.2766,-1.1932,1.4286,-9.2766,2.9423,18.4276,14.8885,459
-3.3514,-9.8069,0.1926,2.5546,-9.8069,3.1635,10.7761,8.9619,460
-6.9042,-9.9967,3.8916,6.4445,-9.9967,4.0955,44.4976,19.4715,461
-6.1752,-10.0526,0.0655,3.5737,-10.0526,3.1582,15.6804,11.5276,462
-7.7656,-9.595,0.839,5.5756,-9.595,2.9064,60.0987,47.6749,464
-19.8235,-9.7332,6.0399,13.6207,-9.7332,9.815,62.816,18.7006,465
-28.2981,-9.8615,10.4943,23.2546,-9.8615,8.78,64.8358,23.3901,466
-6.4724,-9.8854,1.2645,5.2504,-9.8854,3.4045,82.0657,76.7808,467
-3.3254,-10.3279,10.2627,11.1919,-10.3279,3.4401,56.2187,38.1144,468
-15.9593,-9.8677,-3.0248,4.9316,-9.8677,3.3988,13.2567,9.2279,469
-20.6456,-9.7549,-6.0468,7.3632,-9.7549,4.3581,12.6305,6.5284,471
-18.1404,-9.7175,-1.2403,8.9272,-9.7175,5.0759,13.7175,8.5664,472
9.5162,-9.6912,10.6973,1.0647,-9.6912,0.8084,9.0326,8.1463,473
-17.9398,-9.7532,-8.1533,5.8098,-9.7532,4.0059,14.3339,7.0348,474
-30.4767,-9.5466,-14.8747,17.5364,-9.5466,3.5953,47.047,43.4605,475
-7.9403,-9.7033,3.4302,6.238,-9.7033,5.1579,14.3937,10.6398,476
-47.8434,-9.721,-6.6124,24.8322,-9.721,3.0562,24.899,21.0249,477
-11.9403,-9.7722,-2.3525,4.3246,-9.7722,2.5135,6.4578,3.2155,479
-23.7389,-9.7471,-1.0817,6.527,-9.7471,3.2758,10.6457,3.3274,480
