AYGX_min,AZ_mean,AYGX_mean,AYGX_std,AZ_mean.1,GX_std,Gnorm_max,Gnorm_median,timestamp
-26.0822,-9.9067,-3.2869,10.2729,-9.9067,8.8286,14.1091,6.7305,7
-15.1682,-9.877,4.8974,16.9562,-9.877,5.1147,16.267,4.0929,8
-386.2962,-8.6363,-18.9255,166.1155,-8.6363,27.6587,97.7554,21.6874,9
-26.9617,-9.8896,-3.5849,8.8111,-9.8896,4.7655,9.564,4.1703,10
-18.6956,-9.8623,0.7745,8.84,-9.8623,5.0931,12.948,5.3533,12
