AYGX_min,AZ_mean,AYGX_mean,AYGX_std,AZ_mean,GX_std,Gnorm_max,Gnorm_median,timestamp
0.1866,-9.8902,0.2043,0.0085,-9.8902,0.0313,1.438,1.3581,1
0.1847,-9.89,0.2044,0.0121,-9.89,0.042,1.4321,1.3678,2
0.1869,-9.8907,0.2101,0.0192,-9.8907,0.0608,1.488,1.402,3
0.0542,-9.8911,0.2115,0.1127,-9.8911,0.4808,2.7141,1.3509,5
0.1237,-9.8908,0.1917,0.0163,-9.8908,0.032,1.4749,1.3571,6
0.1724,-9.8884,0.192,0.0113,-9.8884,0.0224,1.4446,1.3624,7
-0.1581,-9.8921,0.5459,0.8803,-9.8921,1.9766,6.9997,1.6888,8
-10.0712,-9.8788,-1.3458,2.8332,-9.8788,3.0645,8.1123,3.9791,9
-7.0969,-9.8805,-0.3568,2.4237,-9.8805,3.8449,6.3451,3.4869,10
-5.0042,-9.8798,-0.2055,2.3406,-9.8798,4.4333,8.245,3.6377,12
-21.8802,-9.8436,-10.1908,9.3288,-9.8436,4.7076,15.6871,13.6783,14
-3.7337,-9.876,-0.5074,1.472,-9.876,2.5733,4.9671,2.8911,15
-5.9898,-9.8977,-0.646,2.6915,-9.8977,4.8432,9.6964,5.0056,16
-5.9513,-9.8612,0.0179,4.093,-9.8612,5.6511,12.9187,8.4261,18
-0.7122,-9.8853,-0.0249,0.2897,-9.8853,1.0678,3.8957,1.6156,19
-3.8926,-9.8835,-0.2366,2.1291,-9.8835,3.6617,7.2302,2.9194,20
-4.3519,-9.8793,-1.1258,1.8122,-9.8793,1.8615,5.368,3.4413,21
-4.5134,-9.8733,-1.2257,1.4343,-9.8733,1.5642,5.5331,1.3083,22
-1.4142,-9.8712,-0.6765,0.5313,-9.8712,0.8156,2.3731,1.4879,23
-2.4676,-9.8652,-1.1873,0.9073,-9.8652,1.0426,3.0574,2.2558,24
-0.2564,-9.8625,0.01,0.1792,-9.8625,0.2415,1.0791,0.9773,25
-0.8056,-9.8709,-0.5215,0.1355,-9.8709,0.1952,1.5162,1.2259,26
-0.8501,-9.8739,-0.3976,0.3405,-9.8739,0.5373,1.6205,1.1783,27
-0.8528,-9.8732,-0.4325,0.2588,-9.8732,0.4875,1.7725,1.3907,28
-0.9922,-9.8686,-0.5637,0.2891,-9.8686,0.3971,1.7305,1.2865,29
-0.4123,-9.8754,-0.2461,0.1229,-9.8754,0.2029,1.1888,1.0633,30
-0.7742,-9.8717,-0.307,0.1878,-9.8717,0.2519,1.4503,1.0351,31
-1.8138,-9.8751,-0.442,0.6924,-9.8751,1.0758,2.7866,1.114,32
-0.9614,-9.8779,-0.7526,0.2001,-9.8779,0.18,2.0195,1.773,33
-0.8858,-9.8704,-0.4383,0.2953,-9.8704,0.4218,1.6922,1.1988,34
-1.2881,-9.8748,-0.6771,0.3053,-9.8748,0.3971,2.0397,1.5145,35
-2.0045,-9.8709,-0.8745,0.4121,-9.8709,0.5093,2.5476,1.5885,36
-1.422,-9.8715,-0.1936,0.5847,-9.8715,0.652,1.7176,1.037,37
-0.894,-9.8706,-0.5332,0.3185,-9.8706,0.4811,1.7168,1.3281,38
-1.0499,-9.8709,-0.7177,0.183,-9.8709,0.2082,1.6622,1.4496,39
-1.5446,-9.8689,-1.2263,0.2176,-9.8689,0.2669,2.233,2.0497,40
-1.5107,-9.8703,-1.0292,0.2783,-9.8703,0.3118,2.1736,1.9157,41
-0.8178,-9.8599,-0.5574,0.2485,-9.8599,0.3344,1.5634,1.3035,42
-1.8013,-9.852,-1.4203,0.246,-9.852,0.1801,4.4704,3.9662,43
-5.8449,-9.8394,1.0137,4.4263,-9.8394,5.283,12.6695,3.0478,44
-5.0475,-9.9093,-0.5239,1.9529,-9.9093,4.2115,9.2615,7.0897,45
-27.928,-9.8245,-7.9397,7.9452,-9.8245,2.9291,11.6527,8.3135,46
-34.0119,-9.7163,-4.4748,15.183,-9.7163,7.9808,21.4432,12.4869,47
-31.4364,-9.0919,10.8362,26.555,-9.0919,12.2523,65.1486,49.9203,48
-93.5057,-9.7568,-13.4625,47.2425,-9.7568,6.9774,28.9023,20.8906,49
-27.1609,-9.901,-7.4151,9.1086,-9.901,3.0334,24.5591,15.9132,50
-14.0061,-9.8205,1.7269,8.6074,-9.8205,7.3811,37.5389,30.4346,51
-16.9345,-9.8935,-0.5748,9.1536,-9.8935,3.2006,37.3165,22.1515,52
-2.0584,-9.7532,-0.2376,1.1113,-9.7532,2.1072,19.5885,17.3612,54
-6.1709,-9.8629,1.2872,3.8455,-9.8629,3.6774,19.0736,10.0404,55
-25.5978,-9.9354,6.0422,13.4898,-9.9354,12.9467,53.5305,17.4985,56
-12.6179,-9.6082,-6.29,5.0938,-9.6082,6.8071,38.7872,18.8689,57
-16.7159,-10.0252,-1.4362,7.0906,-10.0252,2.4937,36.8853,25.4216,58
-0.3671,-9.8051,2.819,2.3038,-9.8051,1.0407,31.4234,28.6022,59
-14.5919,-9.9841,0.0085,4.6557,-9.9841,4.4854,75.3452,64.8511,60
-109.2826,-9.663,-16.5142,30.3362,-9.663,8.9211,55.841,30.0136,61
-0.1327,-9.6914,17.0584,10.2057,-9.6914,6.0317,18.2178,14.6078,63
-13.9981,-9.8817,-1.0528,4.5992,-9.8817,5.6776,12.2008,5.2426,64
-14.7191,-9.8313,-2.6742,3.9806,-9.8313,2.9723,9.2934,3.3491,65
-13.9916,-9.8807,-2.0356,4.4522,-9.8807,5.7829,14.3569,9.6851,66
-38.279,-9.5633,-23.7316,11.9073,-9.5633,1.3384,25.8711,23.4847,67
-64.8753,-9.7984,3.5191,29.0095,-9.7984,16.1314,53.8022,42.441,69
-8.8149,-9.9121,-1.5834,2.8575,-9.9121,1.8678,19.5229,7.0397,70
-2.4484,-9.8329,-0.3021,1.6911,-9.8329,3.241,20.9897,19.4688,71
-7.9107,-10.1592,2.2993,5.6248,-10.1592,5.8901,32.0917,26.1247,72
-4.6597,-9.64,-1.3125,3.0462,-9.64,2.2035,12.738,9.3203,73
-11.4748,-9.9041,-1.8867,5.5904,-9.9041,3.5963,22.951,16.6687,74
-17.8339,-9.9219,2.1675,8.7877,-9.9219,4.2504,15.4558,11.3917,75
-8.9237,-9.8557,-2.5593,3.489,-9.8557,3.9967,8.3611,3.4,77
-2.26,-9.8811,-0.0474,1.228,-9.8811,3.8468,11.1434,2.5119,78
-2.0956,-9.8661,-1.4413,0.6245,-9.8661,0.5053,2.4043,1.864,79
0.086,-9.8592,1.0154,0.999,-9.8592,1.0128,2.9495,1.1359,80
-1.2681,-9.891,1.1749,1.6709,-9.891,2.0211,5.5324,2.8351,81
-5.3485,-9.8306,-0.8501,2.3512,-9.8306,1.8128,5.628,2.4766,82
-14.8229,-9.8762,-2.601,5.6123,-9.8762,3.8091,7.4391,3.9635,84
-5.504,-9.8879,1.0605,2.4017,-9.8879,3.3414,8.9591,3.5114,85
-4.0751,-9.8991,-0.5011,2.7556,-9.8991,3.1351,6.7749,5.0072,86
-6.4357,-9.9007,-0.4662,3.015,-9.9007,1.188,7.0413,5.7741,87
-14.8926,-9.8303,3.2566,15.2892,-9.8303,4.7395,19.0313,13.2102,88
2.5432,-9.827,12.708,7.7092,-9.827,6.9429,25.0083,17.6065,89
-14.2049,-9.9211,-1.9769,7.2272,-9.9211,4.404,6.3504,4.6738,90
-1.26,-9.794,-0.2155,0.5959,-9.794,0.5144,3.4773,1.3058,91
-24.1895,-9.3351,25.1694,53.1874,-9.3351,28.4022,136.0986,30.3173,92
-172.2782,-9.9128,-15.4394,38.5892,-9.9128,8.0415,26.9538,11.8344,94
-51.7684,-9.5878,-2.1811,20.0926,-9.5878,9.903,21.0751,15.1062,95
-29.5894,-9.8773,-1.7559,14.1935,-9.8773,9.4343,48.3051,33.4453,96
-114.7078,-9.9564,-17.8005,31.9509,-9.9564,11.7955,38.9631,22.4391,97
-15.6593,-10.0472,-0.3468,13.2088,-10.0472,12.2533,59.912,47.203,98
-61.5318,-9.8345,11.9265,51.7747,-9.8345,20.2719,70.7346,49.0552,99
-34.0956,-9.8843,-5.4798,18.6181,-9.8843,3.3363,43.2819,39.1115,100
-50.9278,-9.8856,1.9193,18.7003,-9.8856,7.3308,49.1216,18.8045,102
-11.3671,-9.8738,0.0702,5.3655,-9.8738,4.613,17.2772,11.8432,104
-8.155,-9.9071,-1.867,3.2154,-9.9071,4.9896,18.0477,11.235,105
-36.4237,-9.9414,-4.2893,12.6782,-9.9414,5.0951,35.5567,13.8682,106
-5.0633,-9.9929,-0.4644,3.0835,-9.9929,0.6974,35.849,34.7223,107
-5.7898,-9.9867,-1.7467,2.261,-9.9867,4.4806,42.427,33.5834,108
-3.6567,-9.9201,1.5789,2.4826,-9.9201,1.1693,9.8491,7.1154,109
-0.2764,-10.5558,15.9417,17.8093,-10.5558,13.8176,55.9499,51.1566,110
-35.4521,-10.2242,2.1607,16.6685,-10.2242,7.6239,35.5044,26.142,111
-22.9303,-10.0614,-0.3786,11.3593,-10.0614,8.0858,27.2376,23.4335,112
-14.3622,-9.9267,4.9106,14.4083,-9.9267,8.1187,21.5164,15.6782,113
-7.9947,-8.6383,3.7097,8.4099,-8.6383,9.9779,29.1289,22.4131,114
-81.6985,-10.1194,-2.7208,29.8355,-10.1194,14.4824,35.0211,22.3804,115
-35.8327,-9.6822,4.8623,15.559,-9.6822,9.0152,44.1871,27.8655,116
-22.7023,-10.3573,76.6514,112.9505,-10.3573,26.8685,82.234,44.0094,117
-85.4967,-11.4017,70.8947,144.5511,-11.4017,56.5468,124.3356,92.1192,118
-50.0987,-10.9613,165.497,253.0043,-10.9613,39.6036,106.9254,83.2339,119
-19.1157,-9.8296,65.8504,75.1357,-9.8296,23.1584,93.4241,60.0696,120
-7.9359,-10.182,50.9786,68.8519,-10.182,55.0784,98.7228,62.0352,121
-7.8873,-9.2275,3.6401,6.8294,-9.2275,12.4069,30.9732,16.4791,123
-157.6453,-10.2135,-28.9206,47.3393,-10.2135,22.448,52.4109,33.5456,125
-386.1943,-9.3686,-45.9019,93.1629,-9.3686,36.1429,88.355,26.0641,126
-43.3714,-9.7082,-4.0164,16.2363,-9.7082,7.4537,20.6839,12.3956,127
-3.9471,-10.065,0.8606,3.1486,-10.065,3.4319,10.2402,7.6116,128
-0.4299,-9.4154,0.7198,1.1361,-9.4154,1.6506,10.292,5.3607,129
-2.1908,-10.3049,-0.4468,0.8113,-10.3049,0.6251,5.5462,3.7985,130
-0.225,-9.8499,0.7952,0.6208,-9.8499,1.1845,6.3524,4.0665,131
-2.2276,-9.8498,-0.1444,0.6651,-9.8498,1.5732,7.4956,2.7299,132
-9.4422,-9.8521,-0.6217,6.4468,-9.8521,6.9983,21.5316,14.4612,133
-124.9899,-9.6943,5.6454,35.0176,-9.6943,16.9643,50.2545,16.9603,135
-39.6733,-9.8237,-8.3379,23.1917,-9.8237,1.3728,26.604,23.9097,136
-59.8401,-10.3849,3.5749,48.9564,-10.3849,23.6463,49.1635,33.6308,137
-15.2305,-9.9156,34.2676,46.3398,-9.9156,23.305,64.8532,35.2453,138
-227.7444,-9.9888,-74.3744,94.9096,-9.9888,23.4527,52.1003,35.7645,139
-12.1009,-10.3884,3.0182,7.6751,-10.3884,6.1833,24.757,15.0248,140
-28.1437,-8.8357,26.7184,52.2104,-8.8357,13.794,45.4051,26.9807,141
-33.1032,-9.9621,-4.2063,17.0196,-9.9621,7.885,29.3225,18.1835,142
-20.8821,-9.9296,-4.2801,18.7816,-9.9296,6.2345,27.7144,22.666,144
-52.1563,-8.589,-24.6005,18.6069,-8.589,19.6283,44.4951,23.8201,145
-65.2109,-9.1501,-5.9289,46.8937,-9.1501,28.0101,58.0203,36.1419,146
-59.8522,-10.2994,29.7253,47.8301,-10.2994,21.7168,45.6096,37.9121,147
-127.9416,-9.3998,-22.1086,55.3618,-9.3998,14.6662,39.774,32.8848,148
-17.1493,-8.7448,1.8567,12.5335,-8.7448,13.3929,35.1333,17.0902,149
-35.5539,-7.4586,-8.1434,15.4958,-7.4586,4.6766,23.6841,17.412,150
-35.0575,-9.5638,-4.5178,10.6254,-9.5638,6.8279,29.5404,20.9745,151
1.4131,-9.2204,10.3366,7.5172,-9.2204,1.927,26.166,21.5756,152
-21.5591,-9.8928,-2.3019,11.3349,-9.8928,2.7812,30.828,26.4121,154
-25.0792,-7.9235,3.312,13.2412,-7.9235,9.1426,37.383,16.5046,155
-15.7305,-6.7329,1.4506,8.1578,-6.7329,5.783,45.3087,18.8023,156
-10.6411,-9.9301,-1.9249,6.053,-9.9301,4.9353,18.1759,14.6005,157
-12.5358,-9.9515,5.9123,13.8123,-9.9515,12.8305,36.2243,28.1132,158
-10.0703,-9.1393,-0.5764,4.6397,-9.1393,4.4391,11.064,8.9647,159
-4.0035,-10.1745,1.9106,3.3876,-10.1745,2.6841,12.4421,8.1089,160
-2.898,-9.3776,0.7966,1.5911,-9.3776,3.917,12.1516,7.1887,161
-0.0949,-9.2514,9.6186,9.5716,-9.2514,10.1136,20.5352,16.3684,162
-21.0821,-9.7729,6.1502,12.7057,-9.7729,14.7563,31.9041,19.5683,164
-55.9941,-9.0575,16.0515,39.1194,-9.0575,26.4856,77.1263,22.966,165
-84.948,-10.1772,-17.1073,35.8212,-10.1772,15.4948,50.9848,27.4351,166
-70.3978,-10.2703,-9.7414,37.4346,-10.2703,5.0598,41.3041,26.7063,167
-8.1575,-10.2352,7.4578,11.5204,-10.2352,14.3556,26.6975,14.7654,168
-15.3384,-10.355,-5.186,6.0743,-10.355,5.5251,19.7296,11.7801,169
-13.9672,-9.054,-4.7567,5.247,-9.054,5.2989,10.7281,8.3551,170
-38.6864,-9.8388,4.1061,20.8479,-9.8388,15.9532,34.2287,19.1644,171
-8.4691,-10.4037,-1.6269,4.0336,-10.4037,4.744,16.0598,10.8773,172
-8.9592,-9.1774,38.6963,64.7623,-9.1774,19.2335,44.8073,20.7681,174
-47.416,-9.3077,-4.6023,15.1637,-9.3077,15.9433,48.7698,13.4913,175
-18.9636,-8.9131,0.9396,8.6131,-8.9131,7.7079,19.9652,12.4035,176
0.4428,-9.6377,14.221,10.9502,-9.6377,4.7469,20.9449,18.1389,177
-117.3092,-9.5271,50.0916,164.4994,-9.5271,20.0462,70.9864,44.5699,178
-164.88,-9.962,0.7494,85.2209,-9.962,16.2838,86.2406,62.5491,179
-41.6259,-9.6435,77.0875,131.8773,-9.6435,51.044,131.4055,53.5759,181
6.082,-10.3899,44.6394,27.9456,-10.3899,36.3209,57.1491,49.4941,183
-15.2021,-10.1958,44.2642,47.4541,-10.1958,27.476,65.1998,37.3171,184
-5.8183,-9.9198,13.6144,19.2537,-9.9198,14.8219,42.9279,19.9634,185
-19.3386,-9.5014,32.8496,81.3605,-9.5014,31.1345,89.6502,21.9294,186
8.447,-10.9715,134.4902,113.0605,-10.9715,47.7722,87.0977,73.8241,187
-2.5648,-10.5433,5.144,7.601,-10.5433,5.062,24.6245,19.5563,188
-2.5089,-9.3166,0.8424,2.7941,-9.3166,5.3285,19.7412,13.0031,189
-14.4589,-10.5846,4.7932,13.6855,-10.5846,4.2342,26.3421,24.4373,190
-11.7563,-10.1792,3.4959,9.5819,-10.1792,4.6009,24.7463,19.857,191
-11.8972,-10.0923,-0.3162,5.7584,-10.0923,5.1484,53.8685,44.7774,192
-22.3908,-10.4355,10.655,19.1229,-10.4355,5.5868,62.8682,49.5985,193
-15.9011,-9.6789,-3.6071,9.4014,-9.6789,4.5319,34.6836,23.4355,194
-6.2935,-10.0047,3.5774,5.144,-10.0047,9.6507,36.2598,19.634,195
-16.0334,-9.8244,0.2995,6.8156,-9.8244,12.4043,28.3027,17.9324,196
0.6047,-9.9018,2.5839,1.0161,-9.9018,1.3501,9.6079,4.9141,197
-7.6184,-10.1648,0.7101,6.6483,-10.1648,0.6667,22.704,16.9003,198
-0.5117,-9.8751,0.4134,1.2408,-9.8751,1.2993,52.8865,48.7051,199
-43.2903,-9.0342,8.9257,34.0,-9.0342,5.4851,43.7969,38.1669,200
-16.1818,-11.2703,-0.507,11.2899,-11.2703,7.5592,50.9545,24.7513,201
-20.1803,-9.9563,27.0275,35.0752,-9.9563,19.0993,74.4328,53.0762,202
-47.4071,-10.1883,-3.6368,18.5888,-10.1883,13.306,38.7444,23.375,203
-50.4432,-9.9967,6.9463,31.7984,-9.9967,14.3746,82.1896,21.197,205
-28.8571,-10.0231,-0.5867,11.8737,-10.0231,8.0476,46.355,22.0261,206
-27.437,-9.8009,-4.7371,10.0105,-9.8009,9.0044,23.6139,18.7518,207
-1.9985,-9.8788,1.8021,5.0997,-9.8788,3.0117,9.1635,5.3861,208
0.8727,-9.8923,1.7912,0.5394,-9.8923,0.4064,4.1351,3.1099,209
-1.513,-9.8775,0.5354,1.7414,-9.8775,2.2237,7.9814,1.7395,211
-1.6666,-9.8916,-0.3768,0.6108,-9.8916,0.7092,1.7255,1.2352,212
-0.1705,-9.8937,0.8236,0.8124,-9.8937,1.1127,2.8619,1.8674,213
0.61,-9.8817,1.1203,0.3484,-9.8817,0.4685,2.5897,1.9888,214
0.3136,-9.8757,0.4214,0.094,-9.8757,0.1055,1.206,1.0835,215
-1.9121,-9.8777,-1.1627,0.6303,-9.8777,0.6185,2.3693,1.8554,216
0.0782,-9.8561,0.7795,0.3761,-9.8561,0.4266,1.716,1.3971,217
-1.4245,-9.8598,-0.2198,0.6672,-9.8598,0.6715,1.6009,1.1085,219
-12.7785,-9.8385,0.1608,3.3486,-9.8385,2.4183,10.4694,2.0175,220
-19.476,-9.8605,-10.4955,4.6523,-9.8605,1.6582,15.4015,9.888,221
4.8657,-9.8254,6.3008,1.2514,-9.8254,1.1436,7.2404,6.3952,222
-0.7973,-9.8653,0.8021,1.3406,-9.8653,1.5167,3.1904,1.5584,223
-1.7782,-9.846,-0.3542,0.6474,-9.846,0.5499,1.5994,1.1781,224
0.0965,-9.8594,1.5684,0.891,-9.8594,0.7907,2.7927,2.1895,225
-17.3221,-9.8242,-6.2635,8.1021,-9.8242,5.1333,9.5761,5.8773,226
0.1733,-9.8666,3.3681,1.82,-9.8666,1.4153,6.0316,4.2463,227
-0.2775,-9.8444,3.0147,1.9068,-9.8444,1.9121,5.1954,3.0184,229
-2.4605,-9.8854,0.8524,1.6126,-9.8854,2.3049,5.48,2.259,230
-3.0854,-9.8813,0.309,2.6399,-9.8813,3.7837,6.4599,3.4213,231
-2.5816,-9.8592,0.4575,2.3227,-9.8592,2.5303,3.7172,2.5717,232
-0.2431,-9.8804,0.5515,0.4008,-9.8804,0.5996,1.9174,1.2787,233
0.8694,-9.8734,1.4161,0.3676,-9.8734,0.3502,2.7513,2.1524,234
-0.1795,-9.8794,0.595,0.5249,-9.8794,0.6886,1.9802,1.3211,235
-0.0179,-9.8852,0.8942,0.645,-9.8852,1.182,3.45,1.8277,236
0.3411,-9.9208,1.8433,1.3402,-9.9208,1.3988,5.449,3.3332,237
-3.5156,-9.871,-0.797,1.2924,-9.871,1.4744,3.5705,1.1295,239
-0.2006,-9.8796,0.8603,0.7305,-9.8796,1.1163,2.8863,1.7995,240
-0.8539,-9.8866,0.3844,0.6094,-9.8866,1.0478,3.5218,1.92,241
0.0113,-9.8906,1.1934,0.7267,-9.8906,1.3038,5.1174,3.7363,242
-3.4899,-9.8904,-0.8295,1.7157,-9.8904,2.9536,4.5354,3.0728,243
0.782,-9.8903,1.2492,0.4744,-9.8903,0.8249,3.5914,2.3225,244
-0.3473,-9.8982,0.0252,0.2572,-9.8982,0.6227,1.4708,1.0192,245
-2.6754,-9.8932,-0.702,1.1001,-9.8932,1.198,2.9131,1.0984,246
-3.8465,-9.8773,0.691,2.4631,-9.8773,3.4901,6.9825,3.0875,247
-6.6431,-9.8688,-0.0471,3.7703,-9.8688,4.2957,8.0918,3.7764,249
-19.1722,-9.8628,-0.8423,6.1655,-9.8628,5.8851,14.5943,4.3384,250
-0.3717,-9.8984,1.2568,1.2209,-9.8984,0.8559,5.1003,3.5253,251
-28.8522,-9.7963,-18.4711,8.2128,-9.7963,2.1211,14.7827,11.4929,252
-15.8196,-9.8341,3.8777,10.97,-9.8341,8.0003,30.7457,19.973,253
-36.0566,-9.7978,-14.555,17.4489,-9.7978,8.9429,18.923,15.2701,254
-19.9213,-9.8398,4.1112,13.073,-9.8398,12.239,28.0815,18.0933,255
-25.818,-9.9639,3.2679,13.707,-9.9639,9.4181,37.4946,21.3985,256
-11.5886,-9.912,-4.5785,4.3941,-9.912,0.9617,35.7461,34.0076,257
-18.747,-10.0219,3.5321,12.0718,-10.0219,5.4408,27.0644,12.2863,259
-105.5206,-9.8116,36.1744,74.8369,-9.8116,44.8841,109.4583,53.7998,260
2.4589,-10.4126,17.7957,20.6045,-10.4126,18.4233,63.3472,53.2659,261
-2.6452,-10.6714,4.5067,5.34,-10.6714,2.8659,12.1498,9.3632,262
-3.6255,-9.7921,0.8881,3.403,-9.7921,4.5186,19.3426,17.0347,263
-36.3852,-11.3105,1.3304,16.1314,-11.3105,13.9013,192.2045,69.248,265
-14.8328,-8.1492,48.4437,39.5248,-8.1492,11.9341,67.0457,39.5292,266
-7.7453,-9.3988,9.1338,23.8273,-9.3988,9.5232,49.6569,36.577,268
-36.3218,-9.9109,-0.7191,8.5187,-9.9109,6.5091,28.9411,17.2692,269
8.3999,-9.8092,20.8476,7.594,-9.8092,4.4614,28.4991,26.6756,270
-145.8638,-9.5498,-8.8448,55.6203,-9.5498,7.0362,69.0787,39.9729,271
-89.8444,-9.6445,-26.7277,53.1913,-9.6445,9.9624,84.7675,43.0794,272
-15.5722,-10.2417,29.7413,41.0809,-10.2417,15.3922,47.9544,40.8816,274
-177.8024,-8.8196,-10.0087,78.9278,-8.8196,21.8416,53.1618,18.1192,276
-91.195,-9.7604,-5.2104,25.9969,-9.7604,7.7191,25.4652,9.6112,277
-157.4095,-9.6424,-35.3905,39.4219,-9.6424,10.8206,36.5295,8.2123,278
-6.9028,-9.9251,8.8522,13.6442,-9.9251,12.1475,35.3501,16.4876,279
-2.5833,-9.8388,0.2958,2.3745,-9.8388,2.9731,24.5688,19.0032,280
-2.8568,-9.8535,-1.6228,1.2778,-9.8535,2.461,12.3364,9.817,281
-2.1096,-9.9255,1.895,1.9212,-9.9255,2.5971,26.0965,9.4719,282
-14.2379,-10.3946,-1.9245,7.5078,-10.3946,7.147,53.6359,32.5349,283
-4.8862,-10.1626,3.5742,6.0237,-10.1626,8.9306,82.1433,60.6966,284
-78.6393,-10.0227,15.5596,66.5234,-10.0227,16.2797,112.5972,102.9604,286
1.5512,-9.7886,16.9508,10.9256,-9.7886,3.9045,53.0864,35.0164,287
-13.9095,-9.9566,0.6374,9.7582,-9.9566,2.8802,33.0684,30.6544,288
1.3871,-9.0564,3.9231,2.3147,-9.0564,1.2965,13.1734,9.9006,289
-0.0904,-10.3209,0.6703,0.7974,-10.3209,1.9288,19.7215,16.1506,290
-2.1485,-10.0253,0.1767,1.5615,-10.0253,3.5017,10.7344,6.885,291
-6.0078,-9.9286,-1.0415,2.2325,-9.9286,2.3646,19.459,11.0107,292
-1.384,-10.1167,0.4004,2.0755,-10.1167,4.311,35.6907,17.6855,293
-35.6257,-10.0123,10.6097,21.5325,-10.0123,11.625,68.405,48.8444,294
-18.2024,-10.4625,-3.1439,6.9114,-10.4625,6.1371,116.0582,91.0703,295
-1.1806,-10.2737,31.9995,38.3078,-10.2737,19.853,125.5925,105.3889,296
-13.8177,-9.8482,1.0819,6.1573,-9.8482,5.5441,15.2672,12.3038,297
-2.358,-9.9017,2.3726,4.0378,-9.9017,3.5927,14.858,6.9255,298
-23.9583,-9.8561,-1.7401,7.0621,-9.8561,8.1768,35.0634,16.2648,300
-40.4038,-8.893,6.1255,24.5309,-8.893,18.6403,57.5532,24.5315,301
-25.8246,-8.0681,0.0113,19.4055,-8.0681,6.7137,30.418,17.9168,302
-11.9068,-9.7927,-2.8108,6.6373,-9.7927,3.6591,13.9511,11.9502,303
-6.9395,-10.1297,7.9012,13.5059,-10.1297,7.4808,67.3877,59.7969,304
-2.4033,-10.1279,0.8881,1.7029,-10.1279,2.5055,12.93,9.7944,305
-10.7034,-10.3134,-4.1171,4.0166,-10.3134,3.6766,13.7837,9.7389,306
-14.5694,-9.87,-0.7251,4.7975,-9.87,6.0474,10.7162,5.1373,307
-1.4926,-9.8935,0.3595,1.4085,-9.8935,3.9082,8.5341,2.9263,309
-21.0192,-9.8822,-0.0724,6.3797,-9.8822,5.836,15.3515,3.7191,310
-7.6123,-9.7482,1.0046,4.5192,-9.7482,4.1107,11.2786,4.1856,311
-1.277,-9.8934,-0.7858,0.35,-9.8934,0.6238,2.536,1.9882,312
-0.0613,-9.9164,0.4805,0.5863,-9.9164,1.7708,5.2593,3.01,313
-2.1601,-9.8807,-1.4136,1.0259,-9.8807,1.6639,3.9951,3.0706,314
0.3107,-9.8951,0.5203,0.1756,-9.8951,0.4915,2.8046,2.1469,315
-1.2148,-9.8961,-0.7879,0.3783,-9.8961,0.4764,2.3816,2.2458,316
-0.3146,-9.8828,-0.0132,0.1807,-9.8828,0.2778,1.1647,0.9555,317
2.8684,-9.8606,3.5743,0.5631,-9.8606,1.0121,5.9318,4.5183,319
-2.9633,-9.8838,0.965,3.2117,-9.8838,4.2944,12.1991,2.8998,320
-6.4782,-9.9176,-2.251,2.2271,-9.9176,2.6403,10.2412,7.6344,321
-4.0112,-9.8042,0.7867,4.0467,-9.8042,4.7027,10.8323,8.0026,322
-0.3012,-9.9531,0.7508,1.9472,-9.9531,1.4054,3.8385,1.3349,323
-5.1419,-9.9188,-0.6083,2.0902,-9.9188,2.7471,5.041,3.4698,324
-0.9672,-9.9028,-0.3189,0.5309,-9.9028,1.4195,3.9655,2.647,325
-6.4433,-9.8825,-0.3193,2.1086,-9.8825,2.1869,5.7417,2.2366,326
-3.7869,-9.9285,2.3673,4.7068,-9.9285,3.2589,9.1075,3.7737,327
-2.3176,-9.9055,0.6006,1.998,-9.9055,3.4225,5.582,3.651,329
-5.0203,-9.9001,-0.1178,2.3099,-9.9001,3.8616,6.7394,4.0869,330
-2.9271,-9.8142,1.606,3.5455,-9.8142,5.1806,7.1226,6.2788,331
-15.471,-9.8765,4.0345,12.0497,-9.8765,1.9014,14.8324,11.7323,332
-6.8586,-9.8953,-1.7997,3.4011,-9.8953,5.4288,9.6861,3.6309,333
-2.3134,-9.9184,-0.0056,1.695,-9.9184,3.0601,4.6697,3.0907,334
-2.3982,-9.8791,-0.7732,1.139,-9.8791,0.9688,5.0347,3.1737,335
-2.2396,-9.8778,0.0176,0.8143,-9.8778,0.9034,4.1556,2.5216,336
-0.8293,-9.8909,0.0751,0.6216,-9.8909,1.0688,2.1633,1.5454,337
-3.9923,-9.9197,-0.2084,2.2148,-9.9197,3.3573,9.2313,2.5987,340
-1.7436,-9.9291,-0.1653,0.5424,-9.9291,1.1761,2.9432,1.6194,341
-17.7718,-9.8963,-5.6295,7.0807,-9.8963,3.4694,14.8099,12.392,342
-4.2269,-9.9204,-1.2882,1.7289,-9.9204,1.4425,4.2627,2.8978,343
-1.5071,-9.8862,-0.4851,0.6391,-9.8862,1.2384,5.6129,2.6347,344
-6.0406,-9.8946,-0.0025,5.8223,-9.8946,3.6478,6.0905,3.2735,345
-0.1101,-9.8836,0.3073,0.4013,-9.8836,0.8063,2.7823,1.6177,346
-17.2227,-9.8822,-0.7447,6.3235,-9.8822,4.5627,8.7573,3.5168,347
-0.9562,-9.9265,-0.1128,0.4622,-9.9265,2.1443,5.8537,2.013,348
-4.6461,-9.8704,-1.1853,3.0296,-9.8704,2.4285,6.8093,3.565,349
-7.0613,-9.838,1.8018,7.4123,-9.838,2.7234,11.7795,7.8738,350
-3.1247,-9.8932,0.0317,1.5096,-9.8932,1.8302,4.9799,3.2861,351
-0.1144,-9.8822,-0.0037,0.0935,-9.8822,0.4378,1.2051,1.0375,352
-2.6906,-9.896,0.0387,1.039,-9.896,2.4346,4.3699,2.4005,353
-1.2048,-9.9014,-0.2273,0.6211,-9.9014,0.5246,3.6342,3.002,354
-1.9359,-9.8737,-0.2218,0.7395,-9.8737,0.9804,2.0938,1.0191,355
-0.3769,-9.8824,0.7423,0.9239,-9.8824,0.7721,5.2852,4.285,356
-4.9583,-9.8959,0.3129,2.4411,-9.8959,2.7411,8.2288,3.3442,357
-0.4514,-9.9055,0.0829,0.2674,-9.9055,1.1657,3.344,1.3275,358
-3.1743,-9.8862,-0.6382,0.9948,-9.8862,3.1138,6.0913,2.8275,360
-3.4909,-9.8823,0.3355,2.0115,-9.8823,3.2066,7.7554,1.8028,361
-2.8505,-9.8981,-0.0523,1.3308,-9.8981,2.6367,4.7062,2.6743,362
-2.154,-9.8886,-1.067,0.6575,-9.8886,0.6859,3.3335,2.4433,363
-12.1346,-9.8674,-3.8151,5.4406,-9.8674,3.3137,10.4023,5.279,364
-8.3463,-9.8615,-5.9102,1.1673,-9.8615,0.2218,7.1926,6.8991,365
-0.0513,-9.9025,0.1168,0.1704,-9.9025,0.3286,1.1401,0.8686,366
-1.9093,-9.9153,-0.2234,1.019,-9.9153,3.9455,6.3899,3.4971,367
-1.1962,-9.9065,-0.1447,0.3593,-9.9065,0.9284,3.0193,1.3912,368
-1.9602,-9.9051,-0.0061,0.5733,-9.9051,1.7777,4.3325,1.3312,370
-0.0276,-9.9083,0.0956,0.1051,-9.9083,0.8159,2.176,1.0296,371
-0.0703,-9.8962,0.0805,0.1955,-9.8962,0.6216,1.4536,0.9242,372
-9.2992,-9.922,-4.1732,3.3775,-9.922,2.9794,10.7726,7.9428,373
-7.2247,-9.8561,-1.4645,2.8944,-9.8561,2.9337,10.4618,3.0927,374
-4.6335,-9.8268,-2.6974,2.1388,-9.8268,1.6651,3.8381,2.9924,375
-14.8678,-9.8467,-5.8593,4.9147,-9.8467,2.9364,9.4705,3.4744,376
-1.1478,-9.877,0.7095,0.835,-9.877,1.1632,9.3762,5.6995,377
-8.508,-9.8799,-1.5517,2.6364,-9.8799,3.8083,7.8707,4.4067,379
-4.755,-9.8758,-0.4275,1.2737,-9.8758,1.4687,3.7328,1.254,380
-0.3375,-9.8844,0.1926,0.2192,-9.8844,0.4172,1.5378,1.0911,381
-0.3654,-9.8873,-0.1981,0.1065,-9.8873,0.2162,1.309,0.9676,382
-1.2788,-9.8947,-0.6974,0.3947,-9.8947,0.5255,2.5421,2.3603,383
-0.2384,-9.8943,0.5612,0.5905,-9.8943,1.0194,3.2423,2.3194,384
-1.7134,-9.8941,-0.4215,0.4448,-9.8941,0.6289,2.3767,2.1209,385
-0.3314,-9.9,-0.153,0.0818,-9.9,0.2109,1.3087,1.0491,386
-0.5339,-9.9001,-0.2758,0.1236,-9.9001,0.2449,1.8604,1.5768,387
-1.2267,-9.8858,0.4769,1.1013,-9.8858,1.892,3.4795,2.2694,389
-0.8048,-9.8937,-0.2038,0.3121,-9.8937,0.9503,2.4488,1.2785,390
-1.013,-9.8968,-0.2868,0.4098,-9.8968,1.1105,2.6675,1.0628,391
-0.1752,-9.9024,0.0154,0.1416,-9.9024,0.8851,1.8625,1.1688,392
-0.583,-9.901,-0.2883,0.173,-9.901,0.4235,2.3542,1.9427,393
-0.2896,-9.903,-0.2017,0.0462,-9.903,0.1198,1.4147,1.2678,394
-0.5412,-9.9013,-0.3238,0.112,-9.9013,0.1336,1.9379,1.7955,395
-0.5691,-9.8932,0.2211,0.3006,-9.8932,0.718,2.0391,1.4094,396
-1.3973,-9.8949,-0.1671,0.8421,-9.8949,1.5991,3.7934,2.0033,397
-34.0009,-9.7715,1.5232,16.6806,-9.7715,13.8942,48.307,25.2112,399
-25.2818,-9.9625,4.4699,17.7707,-9.9625,16.0138,72.8687,45.5431,400
-21.2418,-10.4635,-6.0445,10.3557,-10.4635,10.0211,54.9235,32.6481,401
-10.5336,-10.163,7.2632,8.1989,-10.163,4.1145,30.2117,22.2003,402
-1.4799,-10.1816,60.3422,37.8694,-10.1816,13.162,115.2242,87.1971,403
-7.6538,-9.5755,38.8207,31.2682,-9.5755,6.2695,72.3764,55.3074,404
-0.8352,-9.7244,11.9072,14.1674,-9.7244,9.1922,34.5556,29.4101,405
-13.1912,-9.9985,-3.3872,4.5916,-9.9985,2.8655,17.1591,10.7303,406
-2.5054,-10.0296,-0.2428,1.6453,-10.0296,4.5359,33.8537,27.8928,407
-6.8865,-9.9021,-0.7103,2.9094,-9.9021,4.9825,16.6866,7.8288,409
-10.1044,-9.888,2.9862,5.2271,-9.888,5.072,46.921,22.6202,410
-4.9004,-10.1816,8.0521,9.5399,-10.1816,3.274,71.5291,47.2664,411
-8.0468,-9.6451,1.597,6.7449,-9.6451,9.0894,92.4102,53.9843,413
-8.3878,-9.9415,21.7814,19.0328,-9.9415,6.5681,67.6742,58.279,415
-8.1959,-9.8799,-1.1996,2.8212,-9.8799,5.804,13.1568,6.6098,416
-22.3998,-9.84,-12.2033,4.7134,-9.84,1.7922,12.1837,7.3936,417
0.3979,-9.8008,3.3911,1.9461,-9.8008,1.5407,6.47,2.8586,418
-0.6395,-9.8734,0.0529,0.7799,-9.8734,1.0346,2.5067,1.0641,419
-1.5748,-9.8796,-0.5827,0.5802,-9.8796,0.8385,2.3092,1.0716,420
-1.9461,-9.8735,-1.2676,0.418,-9.8735,0.5551,2.8179,2.1287,421
-27.6116,-9.8419,1.1839,8.3534,-9.8419,5.6667,11.4016,5.9861,422
-9.6982,-9.9138,-4.0623,3.8276,-9.9138,4.3448,19.5118,13.0569,423
-17.8512,-9.9893,-5.9654,8.4388,-9.9893,6.9795,28.9904,16.9617,424
-10.5855,-9.9568,0.1077,6.4794,-9.9568,7.8594,45.6846,23.2488,425
-39.4821,-8.9526,-2.793,18.7395,-8.9526,3.094,43.707,36.2979,426
-1.8307,-9.9612,-0.4862,0.9356,-9.9612,1.6896,17.9787,14.3947,427
-2.2222,-9.8459,1.7436,4.1597,-9.8459,3.3282,13.0594,11.1817,428
0.2792,-10.1282,3.7495,2.3605,-10.1282,1.3992,19.2559,15.8353,429
-4.0751,-10.3787,1.5728,3.0822,-10.3787,2.7249,18.7646,17.3942,430
-9.0418,-10.3946,-1.7228,4.624,-10.3946,4.6919,20.6424,16.8003,431
-13.3116,-9.9719,-0.1417,6.9885,-9.9719,8.9639,38.7845,12.0795,432
-3.7189,-10.1164,1.7281,3.4284,-10.1164,4.5369,25.0924,21.9496,433
-20.5667,-9.2682,0.5347,8.9419,-9.2682,9.0705,35.3826,16.6072,435
-24.1455,-10.3538,56.3091,91.9442,-10.3538,28.8778,128.664,32.4953,436
10.81,-8.9736,178.7964,118.0273,-8.9736,22.8422,145.9713,105.8027,437
-1.5855,-10.5776,0.393,1.6558,-10.5776,3.288,8.749,6.6836,438
-1.1201,-10.0339,4.9562,4.5867,-10.0339,2.0006,11.5363,8.1451,439
-3.3025,-10.155,1.4024,4.5932,-10.155,7.3398,47.3247,32.8473,440
17.1665,-9.9996,35.359,19.1579,-9.9996,3.958,61.7878,44.7285,441
-25.171,-10.0401,6.093,22.9373,-10.0401,12.5778,154.6764,104.54,442
-31.6617,-9.6919,42.6025,46.7147,-9.6919,11.456,102.0265,97.2563,443
-7.1574,-9.9206,-0.5095,2.7113,-9.9206,2.8998,16.0648,8.7223,445
-2.3555,-9.9866,-0.0779,1.4138,-9.9866,1.9506,20.4676,9.2029,446
-0.5528,-9.8244,0.7329,1.3783,-9.8244,0.845,20.2418,17.6491,447
-4.7905,-9.8663,-0.0121,2.4228,-9.8663,2.766,18.355,13.9584,448
-2.1583,-9.7967,-0.0049,2.2625,-9.7967,1.6856,18.2713,10.8824,449
-8.8807,-10.0406,-1.1454,4.4723,-10.0406,1.683,42.0237,37.3796,450
-3.4588,-10.0107,2.1318,2.8564,-10.0107,4.2292,40.9211,22.8541,451
-3.2602,-9.9197,-0.2964,1.3393,-9.9197,4.0701,26.7617,18.7222,452
-0.6071,-9.775,0.4074,1.0254,-9.775,1.8237,5.7981,4.4692,454
-10.7787,-9.8943,0.0872,2.678,-9.8943,3.5797,13.4218,3.1001,455
-14.2064,-10.0682,-5.1719,6.0238,-10.0682,5.7065,22.3893,14.5797,456
-17.5014,-7.5023,-0.3238,8.4496,-7.5023,4.2384,19.9197,16.3217,457
-7.9782,-10.1641,0.2965,5.6483,-10.1641,7.2422,16.4988,10.421,458
-17.7485,-9.9776,7.8811,24.169,-9.9776,5.0673,28.3035,20.1749,459
2.6185,-9.2996,4.7245,2.4353,-9.2996,1.4642,12.8572,9.2917,460
-6.024,-8.6149,3.3919,7.0203,-8.6149,11.2071,27.2135,15.5961,461
-6.2365,-8.3977,5.4926,11.1513,-8.3977,11.7342,32.0361,21.8437,462
-15.1234,-10.5722,-2.1455,9.0145,-10.5722,12.5202,36.0664,15.4512,464
-56.4515,-9.4901,3.8576,15.1772,-9.4901,13.7244,39.5542,19.6212,465
-5.6411,-9.6367,-0.2359,3.0968,-9.6367,3.1028,8.2453,5.0678,466
-4.4351,-10.3419,3.613,9.6305,-10.3419,7.5544,18.1836,13.485,467
-22.2647,-8.606,72.9977,74.9567,-8.606,28.3468,116.0734,86.1762,468
-11.184,-9.8029,0.3757,10.9649,-9.8029,5.8705,24.1284,9.5752,469
-18.8265,-9.1166,-4.6141,7.5806,-9.1166,5.7624,24.2476,12.9582,470
-65.019,-10.0867,26.7655,72.2867,-10.0867,25.3492,66.682,31.6925,471
8.9922,-9.652,100.5321,84.8225,-9.652,14.866,61.6733,49.6756,472
-21.6899,-9.2275,4.405,12.4878,-9.2275,9.8968,34.9073,17.9698,474
-14.1114,-9.0375,2.8805,12.0511,-9.0375,10.2439,44.6908,13.6148,475
-3.021,-10.0024,4.1788,5.0989,-10.0024,3.8552,18.5795,15.337,476
-0.8653,-10.154,1.7201,3.0228,-10.154,4.6036,32.8404,16.3565,477
1.0304,-10.8931,21.5599,19.5933,-10.8931,6.924,32.8288,24.1717,478
-11.2132,-9.6326,3.7157,8.1661,-9.6326,3.4648,25.6103,18.9855,479
-10.9557,-10.264,2.0977,7.3571,-10.264,7.9742,91.8453,75.3223,481
-2.0357,-9.9546,8.4453,7.009,-9.9546,1.2458,70.968,57.762,482
-6.2014,-9.8914,2.113,7.4475,-9.8914,6.5978,19.8749,10.066,484
-138.0149,-9.8331,-3.3481,33.6776,-9.8331,24.1882,106.2173,22.4368,485
-94.2589,-8.4686,3.7649,61.7598,-8.4686,21.8158,100.5455,48.7917,486
-0.8702,-8.8925,3.7122,5.1326,-8.8925,3.886,14.5942,11.9982,487
-8.3577,-9.3835,4.4085,8.9225,-9.3835,11.0272,20.7692,19.1101,488
-1.4082,-10.4186,14.6029,19.3632,-10.4186,9.9558,34.7602,27.05,489
-28.0023,-10.1068,-2.7159,13.6584,-10.1068,7.3829,27.6774,15.7979,490
-24.6201,-9.8696,7.1435,18.3,-9.8696,25.5031,57.53,37.7242,491
-0.1262,-9.7657,1.8625,2.2259,-9.7657,5.4742,41.9598,33.3348,492
-5.9768,-10.3681,18.9211,19.9797,-10.3681,23.3203,71.2412,37.556,494
-7.5775,-9.9536,1.3897,6.0769,-9.9536,9.4147,30.9589,16.6394,495
-0.8952,-9.8666,1.974,2.6471,-9.8666,3.5994,20.1786,16.8906,496
-13.0448,-9.9695,-2.1028,5.2663,-9.9695,3.8469,27.2207,14.9543,497
-1.0198,-10.5467,25.9069,24.9513,-10.5467,14.1888,84.0872,57.8841,498
-16.8712,-10.5537,-5.0331,7.6783,-10.5537,4.9261,47.2922,44.2009,499
-22.517,-10.2569,-7.2906,8.8186,-10.2569,14.1695,39.0408,23.0666,500
-3.9432,-9.8209,0.0843,3.2284,-9.8209,6.4069,22.1601,13.7164,502
-7.1322,-8.9873,2.2981,6.0929,-8.9873,8.1966,23.3656,16.9359,503
0.9731,-10.4918,3.7838,1.78,-10.4918,1.443,10.4396,8.4411,504
-29.7006,-10.0626,14.7891,31.1765,-10.0626,9.7998,41.5504,17.5617,505
-14.0869,-10.0564,14.7076,25.3766,-10.0564,19.9382,82.6924,37.0039,506
-4.5647,-9.6682,5.2409,12.4774,-9.6682,6.4739,45.2004,12.9664,507
5.9124,-9.8447,52.4623,27.9395,-9.8447,6.713,70.4625,49.3226,508
-4.5433,-9.7091,8.349,9.1106,-9.7091,10.3429,35.9025,32.9142,509
-11.6988,-10.5651,4.9825,11.9929,-10.5651,7.3514,36.2439,29.4945,510
-8.8148,-9.7157,13.3695,23.8534,-9.7157,11.9339,50.282,33.2093,511
-28.6089,-8.3615,-1.3386,10.9395,-8.3615,7.326,24.6889,11.5988,512
-6.8542,-9.71,-2.0482,3.1843,-9.71,5.7152,15.9157,10.0445,513
84.7472,-9.4909,206.65,100.1389,-9.4909,8.6734,105.5727,74.0668,514
-45.824,-9.0095,59.2194,84.1247,-9.0095,34.8813,128.8125,71.0762,515
-12.3021,-9.8454,4.2804,10.3399,-9.8454,3.7443,16.7332,8.7673,516
-4.3128,-9.8906,-0.9738,1.6635,-9.8906,1.9576,6.6241,5.477,517
0.0184,-9.9153,0.1814,0.2014,-9.9153,0.5617,2.0047,1.5748,518
-3.8288,-9.8981,-0.4156,2.0406,-9.8981,0.8726,5.1175,3.327,519
-1.3745,-9.9065,-0.3654,0.5254,-9.9065,1.2751,2.7358,1.1048,520
-10.7606,-9.8903,-1.7449,2.176,-9.8903,2.0061,11.207,3.7393,521
-30.1051,-9.8105,-7.4745,12.9744,-9.8105,8.1303,23.0047,11.2255,522
-24.6867,-9.7598,-7.6318,10.1018,-9.7598,3.2565,10.5844,4.9766,523
-18.5119,-9.7725,1.6556,6.7161,-9.7725,4.8427,9.1365,3.8997,525
1.1887,-9.8127,6.6541,3.934,-9.8127,1.5454,8.2878,7.1276,526
0.1115,-9.8821,0.7675,0.372,-9.8821,0.5312,2.5514,2.1021,527
-0.0275,-9.8989,0.1939,0.1796,-9.8989,0.4825,1.3491,1.1529,528
-0.7458,-9.8955,0.0597,0.6344,-9.8955,2.0202,3.0297,2.1908,529
-1.9541,-9.901,-0.046,1.1411,-9.901,1.9621,4.767,1.8546,530
-1.1252,-9.9106,-0.0893,0.6618,-9.9106,2.2763,4.3389,1.9935,531
-2.1763,-9.9203,-0.2319,1.0226,-9.9203,2.2887,5.1732,1.6116,532
-5.7456,-9.8975,-0.3318,2.5152,-9.8975,5.2809,9.3658,5.0055,534
-1.8207,-9.9101,-0.0453,0.7574,-9.9101,1.7776,4.6097,1.6075,535
-0.1405,-9.9064,0.1245,0.2405,-9.9064,0.5997,2.1409,0.8942,536
-0.2419,-9.8961,0.1111,0.2215,-9.8961,0.5381,2.0686,1.4159,537
-0.6416,-9.9086,0.2269,0.5844,-9.9086,1.5099,9.6594,6.1817,538
-2.3486,-9.8736,0.0297,1.1493,-9.8736,2.6911,7.6059,2.8853,539
-3.46,-10.0659,-0.3823,1.3684,-10.0659,3.0161,46.1842,41.9841,540
-2.3969,-9.8954,-0.2698,0.6708,-9.8954,1.169,12.055,7.7396,541
-4.2895,-10.0331,0.2976,1.6743,-10.0331,3.3421,13.6386,6.9865,542
-1.6572,-10.024,0.3692,1.0694,-10.024,1.4863,17.9771,16.9135,544
-5.763,-9.8894,0.0959,1.5001,-9.8894,2.2935,18.3513,11.46,545
-0.7622,-9.9122,5.2728,6.4814,-9.9122,4.7592,23.3691,19.8767,546
-1.9334,-10.177,-0.5107,0.7094,-10.177,1.9931,9.363,4.1881,547
-5.2838,-9.9272,-0.1471,2.9912,-9.9272,2.1689,13.5181,10.7872,548
-0.2858,-9.6085,4.3437,4.3233,-9.6085,3.7974,29.2194,8.3018,549
-1.7367,-10.0592,0.4065,1.4751,-10.0592,1.4501,10.9103,9.4042,550
-7.7074,-9.9286,0.8686,5.2265,-9.9286,7.0394,40.3995,30.3972,551
-8.4223,-10.1491,-1.374,3.7539,-10.1491,6.4051,24.7704,14.6992,552
-4.1487,-9.8821,6.3798,7.5884,-9.8821,3.1501,50.4985,38.0629,554
-28.253,-10.0745,4.8147,15.4129,-10.0745,14.555,96.4473,84.134,555
-12.9545,-9.9228,8.4939,15.2216,-9.9228,11.0225,34.2913,23.5314,556
-0.6751,-9.9176,5.8665,4.2833,-9.9176,6.3309,70.6672,66.9894,558
1.098,-10.0723,5.573,3.0096,-10.0723,2.8826,18.0715,13.7729,559
-0.5878,-9.8969,0.5914,0.9084,-9.8969,1.4064,13.6671,8.6749,560
-8.5631,-9.6508,-1.0125,4.4199,-9.6508,6.2848,20.3193,16.7378,561
-1.7274,-9.9772,7.2228,5.2869,-9.9772,4.7407,46.4011,39.7409,562
-10.9563,-9.539,-0.1011,7.4966,-9.539,5.4601,43.2788,41.2538,563
-1.0021,-9.9763,2.9291,3.019,-9.9763,4.0082,39.5319,21.7424,564
-1.0895,-9.795,1.1778,1.699,-9.795,1.38,11.3873,9.6204,566
-0.836,-9.8421,0.1853,0.7305,-9.8421,2.2227,18.3791,15.1948,567
-0.8051,-10.0202,-0.1564,0.352,-10.0202,1.4581,12.9318,7.6676,568
-14.7516,-9.9259,0.4327,6.085,-9.9259,8.3733,22.2649,18.2041,569
-3.6687,-9.8593,-0.3172,1.8468,-9.8593,1.623,7.1312,5.5925,570
-4.1465,-9.8737,2.2085,5.393,-9.8737,5.3019,11.6353,3.0558,571
-5.5732,-9.8967,0.6372,2.8896,-9.8967,4.9909,9.3955,3.6316,572
-1.8105,-9.8697,0.8314,1.0763,-9.8697,1.4268,15.9338,6.1125,573
-5.8808,-10.0132,1.2075,3.7509,-10.0132,5.7638,13.5241,10.4674,574
-12.6536,-9.8258,-2.3012,5.875,-9.8258,3.4711,32.7337,20.7285,575
-4.877,-9.5866,-0.5833,2.6449,-9.5866,3.5399,14.946,14.0009,576
-7.4415,-9.9593,1.6803,4.3995,-9.9593,6.1125,63.8513,33.0079,578
-65.6418,-10.1803,-5.0099,25.0464,-10.1803,16.9616,73.61,49.2056,579
-5.849,-9.7416,14.5428,9.8994,-9.7416,2.1616,63.5304,42.2182,580
-9.6183,-9.9252,-1.1206,6.0627,-9.9252,3.0857,32.7139,25.5129,581
-14.0755,-9.9115,0.3628,6.1645,-9.9115,7.4433,42.6327,22.0319,582
-36.1726,-10.3818,-2.7096,12.298,-10.3818,14.0296,61.5843,41.0352,583
-12.5195,-9.6623,6.218,16.2481,-9.6623,8.1966,36.3336,12.8834,585
-4.3933,-9.9872,3.1205,5.5866,-9.9872,6.2932,19.5694,15.2163,586
-2.8262,-9.7476,0.0451,1.7945,-9.7476,2.6366,8.3469,3.9178,587
-10.6929,-9.9908,19.5296,26.7471,-9.9908,3.6283,41.2202,27.2245,588
-2.4351,-9.9551,-0.4136,2.4126,-9.9551,3.3826,24.0434,15.7818,589
-3.12,-10.3913,-0.2441,1.2048,-10.3913,2.274,32.1767,24.8789,590
-25.7642,-10.0493,2.1148,13.4748,-10.0493,8.4976,30.4105,22.5735,591
-18.3157,-9.7766,36.0678,38.0131,-9.7766,29.3762,68.1783,51.3479,592
-22.2482,-10.0414,-5.848,12.2597,-10.0414,8.5774,29.4373,25.5602,594
-26.4346,-9.1196,1.6904,15.0279,-9.1196,10.8762,40.4512,12.9585,595
-5.9918,-10.2521,4.8933,10.3074,-10.2521,4.5587,15.4398,11.5227,596
-0.2534,-10.4338,2.6262,4.9793,-10.4338,7.7857,18.955,16.5059,597
-13.8087,-10.2604,-8.3552,5.6311,-10.2604,14.9969,45.2033,31.9162,598
-25.0595,-8.9716,-3.2125,15.5092,-8.9716,18.1715,38.7803,21.5,599
-25.2486,-9.8492,5.3807,27.7804,-9.8492,15.532,41.6409,20.3134,600
-31.3983,-9.7045,-1.6727,13.7173,-9.7045,14.0552,42.2839,14.7395,601
-1.3057,-10.1127,1.8745,2.384,-10.1127,4.7982,12.7781,12.4957,602
-0.5957,-9.9122,34.3354,33.026,-9.9122,42.1017,78.6309,47.0453,604
-70.9564,-10.1037,29.9737,49.3587,-10.1037,31.6791,81.8107,58.1646,605
-22.4396,-9.1834,-7.0542,11.5525,-9.1834,4.2593,47.3472,39.4106,606
-3.0181,-9.7777,10.6911,17.4657,-9.7777,10.9378,25.5183,13.7067,607
-19.2491,-9.9371,-4.7291,9.1398,-9.9371,11.0426,20.2068,13.3912,608
-6.9638,-9.6324,-1.9826,3.0194,-9.6324,3.127,7.3343,5.7315,609
-139.66,-10.0105,-3.9514,37.7167,-10.0105,13.8163,63.3477,23.0302,610
-5.3521,-9.8387,6.8632,8.2528,-9.8387,10.2158,27.0953,22.6891,611
-12.4098,-9.5327,9.3668,13.9482,-9.5327,8.7549,28.3129,20.2546,613
-26.1438,-10.0753,21.1905,30.2313,-10.0753,24.8517,61.5388,26.6251,614
-23.1382,-9.72,-5.6618,8.8359,-9.72,4.2795,31.9107,12.302,615
-10.0109,-7.6817,7.1453,13.6845,-7.6817,13.9624,29.0227,17.8347,616
-40.5253,-9.4048,32.1985,57.253,-9.4048,9.431,36.6818,30.0607,617
-69.6207,-9.7957,1.8492,26.9369,-9.7957,11.7736,50.4213,14.7554,620
-67.0608,-9.8706,-14.1114,16.0169,-9.8706,11.4774,34.4515,13.2697,621
-13.6022,-9.9177,-1.3974,4.576,-9.9177,6.4806,18.9583,9.3012,622
-108.3561,-9.8178,-14.5845,36.1515,-9.8178,14.7604,42.9762,14.9014,623
-14.7557,-10.0466,18.0942,26.9045,-10.0466,6.9952,24.9818,22.8378,624
-16.6268,-9.4699,-2.5556,7.2674,-9.4699,6.5119,13.8821,9.6664,625
-14.5022,-10.179,2.2435,11.6767,-10.179,9.1196,28.5125,21.4876,626
-73.7361,-9.769,-2.0675,22.9314,-9.769,10.4139,28.2851,16.0052,627
2.3915,-10.4909,11.2917,8.9062,-10.4909,5.625,33.1722,17.1064,628
-69.7232,-9.7516,-19.7949,25.7359,-9.7516,20.3449,52.1174,23.7753,630
-37.8161,-10.2116,-12.4178,11.3566,-10.2116,11.2396,25.8926,18.7294,631
-32.9225,-9.8751,-12.154,14.53,-9.8751,9.9568,22.8426,13.7309,632
-18.3587,-9.4318,9.3203,20.1811,-9.4318,19.3497,35.7284,25.1144,633
-19.6435,-9.6608,-2.4403,11.1444,-9.6608,1.4316,19.1832,16.7259,634
-1.2927,-10.2848,1.4056,2.4883,-10.2848,4.4103,10.7137,9.5298,635
-28.2492,-9.9234,-1.5997,11.9995,-9.9234,12.681,35.4673,19.2679,636
-0.654,-9.578,1.6012,1.4901,-9.578,4.0802,25.8788,23.4155,637
-29.0343,-9.7262,5.1781,23.4727,-9.7262,12.3602,57.9843,25.3161,639
-48.0078,-10.0817,1.4569,29.0705,-10.0817,13.4929,75.4816,48.5779,640
-11.4593,-8.7155,1.9625,8.5984,-8.7155,5.1615,26.0248,16.3409,641
-41.3952,-8.3694,-0.2153,16.0399,-8.3694,10.8151,71.0338,39.6827,642
-8.5465,-9.7421,1.4004,6.743,-9.7421,4.2743,25.7066,17.0031,643
-18.174,-10.0118,1.2016,10.4519,-10.0118,9.7742,50.0545,19.8898,645
-1.6742,-9.5553,-0.5081,0.9778,-9.5553,3.4939,13.7377,7.527,646
-12.0637,-10.2729,-2.5068,7.6203,-10.2729,5.195,21.0718,19.1597,647
-11.6517,-9.869,-0.8765,5.2622,-9.869,4.6327,8.994,5.5936,648
-3.7856,-10.089,7.0261,10.0416,-10.089,3.6783,17.188,15.4336,649
-40.7078,-9.6849,-12.9001,15.3362,-9.6849,10.6058,34.0886,16.37,650
-95.6748,-9.8748,9.2303,71.7847,-9.8748,47.2422,101.528,50.059,651
-43.2284,-9.5381,7.165,29.0139,-9.5381,12.6631,53.3629,33.9374,652
-105.9427,-9.8103,36.3835,134.0451,-9.8103,56.4018,106.1462,75.1988,654
-76.8196,-10.2407,33.8076,96.6257,-10.2407,51.7093,124.8304,57.4555,655
-43.9001,-9.9987,86.8843,84.2582,-9.9987,18.3375,83.446,66.9484,656
-61.2845,-10.2109,-20.0598,19.8685,-10.2109,14.6259,68.0241,47.6889,657
-20.7611,-9.9239,24.3987,32.4994,-9.9239,18.0164,51.3393,37.5727,658
-5.0068,-9.676,1.0701,4.7226,-9.676,7.7292,20.0602,10.9803,659
-10.0536,-10.3704,13.9219,28.0216,-10.3704,21.7013,43.0905,34.1005,660
-46.1103,-9.922,-3.7776,18.7414,-9.922,23.0919,43.2932,30.9276,661
-31.0391,-10.0141,-0.6769,18.3967,-10.0141,13.6681,42.8205,28.4463,662
-12.0218,-10.1572,-1.3035,6.9743,-10.1572,16.2262,34.3444,25.1617,664
-36.3083,-9.9758,-0.5708,11.9675,-9.9758,12.915,30.8691,15.9628,665
-13.0762,-9.5204,-0.8262,7.1786,-9.5204,6.1594,23.879,12.1939,666
-12.9502,-9.9764,-1.42,7.8265,-9.9764,6.5548,29.1009,22.3439,667
-5.7251,-9.7656,-0.3887,2.7622,-9.7656,7.5044,17.391,14.5273,668
-75.2777,-7.9907,-13.8907,25.8194,-7.9907,8.1741,49.7044,18.6968,669
-21.5315,-9.8876,-3.3254,16.2069,-9.8876,7.4212,26.5594,21.6059,670
-110.8554,-10.4198,25.583,101.9545,-10.4198,33.1119,115.5812,75.7279,671
192.1481,-10.4163,312.0593,72.4538,-10.4163,13.4626,91.0901,83.3746,672
-66.3696,-7.928,158.8937,144.7577,-7.928,9.5945,132.0301,110.9983,674
-14.2965,-9.9263,-0.7658,7.8415,-9.9263,9.4948,37.319,12.108,675
-2.9744,-9.9092,1.7379,4.0675,-9.9092,9.5682,18.4257,8.2585,676
-94.8046,-9.9905,7.6117,42.0167,-9.9905,28.6249,98.8727,29.9928,677
-12.4342,-10.5483,42.974,48.1993,-10.5483,32.9605,82.4025,56.4072,679
-35.3604,-9.9236,-0.3769,11.0532,-9.9236,10.9217,42.011,14.6023,680
-8.8656,-9.4253,-0.6157,4.4978,-9.4253,0.4574,13.6082,12.0737,681
-8.7213,-9.9462,-0.7363,4.5018,-9.9462,3.8489,13.2053,8.876,682
-2.174,-10.1192,1.7351,5.3872,-10.1192,8.5754,31.7495,27.6171,683
-0.4831,-9.5381,0.3007,0.5005,-9.5381,5.2523,18.8372,9.5964,684
-14.962,-10.0245,-3.8785,6.7466,-10.0245,4.547,35.3545,30.4311,685
-8.5819,-9.8208,1.2488,5.8046,-9.8208,4.0206,26.0898,20.6445,686
-4.4323,-9.5379,5.0622,6.111,-9.5379,1.0325,22.0845,18.9922,688
-31.2116,-8.9513,19.2922,36.352,-8.9513,3.4763,38.2006,34.4769,689
-0.6272,-9.9306,13.8862,19.6391,-9.9306,11.1358,36.9443,29.8595,690
-21.1286,-9.956,0.5028,9.3317,-9.956,9.2605,44.8792,12.086,691
-15.4476,-9.9541,19.0653,25.6578,-9.9541,8.6461,47.4346,39.3416,692
-1.8493,-9.8866,3.5368,4.5785,-9.8866,2.9098,12.5732,11.7385,693
-3.3176,-9.8867,3.2409,6.48,-9.8867,2.949,13.4461,9.4548,694
-6.3569,-9.9589,4.5781,6.8478,-9.9589,2.7028,19.5562,12.9269,695
-7.6597,-9.9125,-0.0013,4.9627,-9.9125,1.3083,10.9138,9.5754,696
-0.9817,-9.8521,3.6826,6.7271,-9.8521,5.9877,15.937,8.3659,697
-5.7512,-9.8969,5.0998,8.0727,-9.8969,4.5775,20.0065,16.1261,698
-12.0416,-10.0395,19.4918,32.4438,-10.0395,17.6232,36.8795,27.406,699
-6.233,-9.8298,5.1032,8.2894,-9.8298,12.9388,22.6382,19.0589,700
-5.0088,-9.9423,2.3422,3.0533,-9.9423,7.6871,15.4788,7.9616,701
-12.4425,-9.8544,1.2502,5.4415,-9.8544,7.7193,24.228,15.8475,702
-13.3983,-9.9657,-0.4057,8.8732,-9.9657,5.655,15.7027,9.026,703
-2.9304,-10.1724,2.3731,3.7338,-10.1724,4.4255,10.5266,9.0072,704
-8.6207,-9.3413,-0.8078,4.3471,-9.3413,6.3657,13.8454,9.8313,705
-15.1468,-9.9413,-5.014,9.028,-9.9413,3.8626,23.7877,13.8861,706
-16.8431,-10.0513,15.0699,28.968,-10.0513,19.866,36.224,22.2853,707
-2.6993,-9.9826,1.0233,2.9653,-9.9826,0.891,10.483,9.1786,708
-7.8758,-9.8663,3.3322,9.6318,-9.8663,12.2226,38.0571,11.5487,710
-4.9449,-9.973,1.8548,4.1756,-9.973,7.9113,27.5967,9.6054,711
-25.4078,-9.5144,-12.4319,12.5199,-9.5144,5.6251,29.889,24.5379,712
-68.4941,-9.9211,8.6828,42.6332,-9.9211,26.0926,60.6679,41.6141,713
-8.31,-9.7047,14.135,17.6687,-9.7047,17.4214,34.2988,24.0578,714
-21.0512,-9.6555,53.7508,59.0178,-9.6555,5.6111,70.7033,61.9911,715
-8.3005,-9.8736,6.3861,10.1256,-9.8736,9.4397,22.3287,11.7231,716
-27.4658,-9.7619,10.5113,37.9003,-9.7619,13.9882,47.0278,25.029,717
-7.7962,-9.7253,19.2597,35.1399,-9.7253,18.5897,48.9408,24.9374,718
-25.2405,-10.0006,9.9723,17.529,-10.0006,18.2726,80.3032,17.2479,720
-72.8545,-9.9391,-4.1651,27.1241,-9.9391,14.3509,46.7179,12.8931,721
-28.1714,-9.7062,3.8667,18.7415,-9.7062,9.9788,28.7404,19.391,722
-106.7331,-8.1257,-25.8045,49.6631,-8.1257,25.8395,52.2183,36.6053,723
-35.6321,-10.163,1.7248,20.0785,-10.163,3.2429,28.6604,14.8812,724
-32.5657,-9.956,-9.0186,13.0432,-9.956,8.5816,32.4346,21.5763,725
-8.8965,-9.8931,4.5115,8.3356,-9.8931,9.7399,22.8265,19.1072,726
-15.1941,-9.9724,-3.3874,6.4637,-9.9724,9.752,30.4031,8.3647,727
-8.1149,-9.8004,-0.1724,3.6785,-9.8004,3.2166,12.1932,5.4038,729
-20.0837,-9.9118,2.6294,12.8623,-9.9118,12.0125,38.8648,18.9311,730
-27.585,-9.995,-9.2094,13.0077,-9.995,8.1547,28.1635,11.2376,731
-2.821,-10.0583,8.459,7.8312,-10.0583,7.7994,28.3739,21.3959,732
-0.8626,-9.8058,1.6957,2.5878,-9.8058,3.3772,9.3915,5.7327,733
-28.756,-10.0811,-12.6525,9.5435,-10.0811,1.1635,22.0724,20.763,734
6.4541,-9.917,33.031,21.4791,-9.917,7.0345,35.2713,29.1457,735
-8.2626,-9.8219,8.469,16.1779,-9.8219,20.1901,45.1805,17.6465,736
-19.5792,-9.8179,22.5166,34.0134,-9.8179,9.6705,51.1132,43.2163,737
-22.3175,-9.8213,-3.5286,14.609,-9.8213,6.7298,34.2457,30.833,739
-19.7938,-9.9049,-2.2699,9.5542,-9.9049,13.627,35.8951,19.0408,740
-9.6526,-9.8982,-0.8965,2.8892,-9.8982,4.0107,11.0557,6.4107,741
-86.07,-9.6126,-4.1079,95.0023,-9.6126,26.7263,92.389,64.4119,742
-51.0307,-10.435,38.8818,67.5965,-10.435,36.9278,118.9365,101.2588,743
0.6748,-10.0,9.337,4.3408,-10.0,5.7483,22.2593,13.8154,744
-6.8945,-10.0106,1.6975,5.6544,-10.0106,0.8494,13.6494,11.4199,745
-7.7604,-10.0237,4.4355,7.9858,-10.0237,6.8996,19.7317,16.0993,746
-17.7048,-9.9389,-0.6996,6.6247,-9.9389,5.9409,17.2116,9.7553,747
-16.1259,-9.9945,1.2026,11.3175,-9.9945,2.0185,17.569,14.2535,749
-29.6629,-9.9144,2.874,11.4255,-9.9144,15.5306,41.1884,21.4808,750
-17.3946,-9.9269,4.2747,13.5201,-9.9269,10.4911,35.4066,20.0248,751
-23.7043,-9.9032,-1.3257,12.5006,-9.9032,6.8042,39.2478,36.9377,752
-23.8172,-9.7397,7.636,21.4762,-9.7397,4.608,31.3381,25.4029,753
-34.8312,-10.1015,16.9672,32.6075,-10.1015,16.0147,54.467,48.1966,754
-13.8026,-9.6627,87.8634,52.2185,-9.6627,9.7369,86.186,74.3774,755
-12.4986,-10.0112,-0.8941,6.2371,-10.0112,8.1545,26.5002,15.9722,756
-7.6994,-9.8621,-2.238,2.8801,-9.8621,7.5273,18.7197,14.6381,757
-4.0469,-9.7333,-0.5561,1.4639,-9.7333,3.9227,8.5671,4.9495,759
-6.3504,-9.9356,0.7019,6.8759,-9.9356,4.5193,20.3233,11.4327,761
-11.8455,-9.7317,-2.8954,5.5818,-9.7317,4.2239,19.3471,7.674,762
-8.0929,-9.7422,-0.9978,3.539,-9.7422,2.6752,10.977,6.3075,763
-2.6527,-9.9402,0.3057,2.3121,-9.9402,1.3143,10.3795,3.7256,764
-4.6876,-9.7878,2.0249,8.8899,-9.7878,0.7679,27.2943,17.3822,765
-11.0022,-9.8959,0.5998,10.2352,-9.8959,8.154,45.1249,28.9043,766
-8.2138,-9.8838,-0.2375,4.3978,-9.8838,3.8712,15.6537,13.3097,767
-11.5761,-9.9592,0.5417,7.9719,-9.9592,3.3748,24.1972,20.0245,768
-2.3706,-9.869,0.0743,1.5471,-9.869,2.3768,9.5817,4.828,769
-5.1457,-9.8139,3.3514,5.1839,-9.8139,3.4989,19.9087,11.8184,771
-9.2225,-9.8286,-3.508,5.3905,-9.8286,0.9516,23.7817,20.8462,772
-22.6517,-9.926,9.0503,24.3421,-9.926,6.7475,51.7137,30.9867,773
0.7997,-10.3036,5.8387,3.609,-10.3036,0.6107,57.9988,45.375,774
-16.3174,-10.27,-3.0169,9.1219,-10.27,3.6465,49.848,39.1169,775
-19.4543,-9.7488,5.4395,11.0393,-9.7488,22.0198,47.7142,36.8683,776
-7.5531,-10.0333,1.3751,6.7922,-10.0333,4.5999,25.6994,16.1484,777
-1.5236,-10.0987,7.1467,7.8439,-10.0987,11.1405,34.4871,28.4219,778
-37.9263,-9.9817,-0.409,20.698,-9.9817,10.7492,48.1026,21.5062,780
-4.1761,-10.1689,1.4609,2.5836,-10.1689,2.5986,19.9441,16.9014,781
-36.9233,-9.6892,-12.4406,13.2054,-9.6892,3.6333,40.1629,37.0369,782
-26.1797,-9.8866,20.0897,35.5375,-9.8866,14.7082,71.6814,49.3158,783
-5.3064,-10.4396,-0.5182,2.39,-10.4396,5.0829,22.5051,11.9216,784
-2.9663,-10.4621,0.7965,2.1296,-10.4621,6.1034,23.6833,11.75,785
-9.6554,-10.3828,2.4667,6.7289,-10.3828,6.0821,37.0058,33.2167,786
-18.323,-10.3251,7.8903,14.1666,-10.3251,8.9352,48.0754,33.8841,787
0.3878,-9.216,8.5305,5.7215,-9.216,1.641,22.1492,8.3577,788
-27.6557,-9.747,-0.0487,11.1501,-9.747,13.9679,47.1295,19.3977,790
-34.4303,-9.746,7.667,21.2535,-9.746,12.9166,35.3406,23.0401,791
-5.5206,-9.7972,2.5439,4.9248,-9.7972,9.1083,19.0105,15.793,792
0.7277,-10.0394,7.2953,4.4178,-10.0394,2.4998,17.8616,14.1551,793
-18.6962,-10.2027,5.2477,18.4688,-10.2027,6.6909,55.6155,48.621,794
1.211,-10.6786,29.7264,21.5341,-10.6786,14.0658,67.1304,38.1089,795
-14.8575,-10.9446,20.5581,23.9952,-10.9446,15.8651,79.75,68.5372,796
-9.8956,-9.6329,11.44,22.1299,-9.6329,12.8711,30.7198,22.0574,797
-28.5865,-9.8201,2.7796,10.315,-9.8201,15.5249,32.4239,21.3165,800
-13.2623,-9.7956,2.1401,10.7391,-9.7956,3.0597,25.1468,15.3292,801
-13.8326,-9.8819,11.1026,24.3306,-9.8819,9.6232,35.179,23.475,802
-6.1644,-8.881,5.8654,9.4969,-8.881,1.9464,33.9966,19.0595,803
-11.0842,-10.0255,-4.462,4.2887,-10.0255,11.0606,30.2178,17.9388,804
-5.9898,-9.856,6.3068,9.8111,-9.856,5.0851,15.5628,13.2039,805
-15.7253,-9.7721,-5.0409,7.6838,-9.7721,7.1547,34.6247,22.3212,806
-12.5614,-9.9991,17.9722,30.0999,-9.9991,13.9858,51.6601,27.8447,807
-0.8954,-9.8752,2.8315,2.9014,-9.8752,3.0588,14.7103,5.802,809
-29.4909,-9.8774,0.8628,9.5935,-9.8774,8.6421,34.4361,12.2187,810
-32.0501,-9.9432,1.8142,26.0165,-9.9432,9.2709,44.0554,36.6593,811
-16.6439,-9.824,5.6397,18.8605,-9.824,3.6731,37.5396,30.387,812
-20.9688,-9.9713,-2.6917,8.515,-9.9713,8.0108,25.3293,18.47,813
-12.4752,-9.8272,0.1233,9.5903,-9.8272,7.3696,31.3948,16.6945,814
-11.3411,-9.8883,-1.1446,8.2195,-9.8883,3.9937,29.2875,26.2566,815
-5.4213,-9.9347,38.0065,23.8563,-9.9347,15.0067,45.1521,31.827,816
-9.5432,-9.9286,3.7136,6.3759,-9.9286,17.157,28.8402,24.4648,817
-3.1177,-9.9241,0.0585,1.8841,-9.9241,5.6943,18.3913,12.7518,819
-29.2584,-9.8834,6.9691,29.6316,-9.8834,18.3957,63.3654,22.1675,820
-0.0025,-10.0388,6.9877,5.2763,-10.0388,5.0492,18.4534,15.745,821
-17.9537,-9.9993,-2.0575,9.2696,-9.9993,6.6273,18.7468,13.3901,822
-6.2448,-9.7656,0.496,5.2847,-9.7656,1.8848,14.2978,12.9055,823
-5.5261,-9.9271,-1.5037,2.6849,-9.9271,2.531,10.3441,7.2944,824
-1.5902,-10.311,11.4491,13.9437,-10.311,8.6987,32.5282,27.6784,825
-13.5432,-9.8405,-0.836,4.5475,-9.8405,11.7409,26.6766,13.7139,826
-10.7714,-10.3817,-4.7434,5.0086,-10.3817,1.8962,18.1912,17.0329,827
-7.6824,-9.81,1.6261,5.3224,-9.81,7.3388,22.8771,10.6414,829
-39.1751,-9.8323,-2.2795,8.4678,-9.8323,12.5835,36.3017,12.9005,830
-11.864,-9.8879,1.3282,7.9153,-9.8879,10.0143,24.553,19.4513,831
-77.6074,-9.9021,-14.8386,29.9515,-9.9021,17.5209,71.0266,27.5469,832
-12.3094,-9.7975,-4.5585,4.3632,-9.7975,1.9131,25.5553,23.3316,833
-0.5672,-9.8972,0.0251,0.5294,-9.8972,1.4493,6.2645,5.0788,834
0.099,-10.4263,3.9175,6.3238,-10.4263,6.1959,17.4779,14.2934,835
-1.1894,-10.0341,1.0742,1.6619,-10.0341,5.8371,13.8636,9.4312,836
-1.6026,-9.9057,-0.2393,0.6399,-9.9057,1.2162,6.1251,4.9052,837
-8.745,-9.9911,1.5542,5.4849,-9.9911,9.3751,32.9634,26.3134,839
-7.9244,-9.7981,0.9884,3.4436,-9.7981,4.7959,25.0976,12.1827,840
-1.2286,-9.9382,-0.0338,0.7711,-9.9382,2.0917,14.2596,9.3256,842
-1.1867,-9.925,0.3829,1.1759,-9.925,3.0455,11.4671,7.3882,843
-5.9622,-10.0682,2.657,5.5347,-10.0682,8.0559,34.1582,23.4616,844
-0.2322,-9.9495,5.7903,8.6458,-9.9495,7.1871,28.285,21.4185,845
-9.7342,-9.8598,-0.1629,4.9554,-9.8598,8.3908,28.2057,14.9434,846
-6.5844,-9.8401,-1.1905,2.8134,-9.8401,3.6785,15.578,13.8504,847
-5.8363,-9.8547,-0.8542,2.8118,-9.8547,5.1062,13.7212,7.9931,849
-20.7211,-9.9088,0.316,6.8889,-9.9088,6.739,23.5836,9.136,850
-11.8609,-9.838,-0.8215,4.878,-9.838,6.6117,19.0796,12.492,852
-1.8384,-10.2659,1.38,1.7718,-10.2659,9.4105,20.2432,9.7398,853
-11.2271,-10.4173,36.1176,55.5352,-10.4173,34.3152,93.4284,77.7915,854
-2.7339,-11.1113,61.6093,77.6622,-11.1113,27.5746,76.6715,65.0043,855
-41.0028,-10.0764,163.4294,173.1646,-10.0764,35.6015,119.4055,109.2117,856
-23.4237,-9.9915,118.1845,103.3931,-9.9915,59.6828,100.9893,77.6894,857
-61.8644,-9.8228,27.954,73.7572,-9.8228,14.7946,69.4646,63.2804,858
-3.7403,-10.0667,21.3992,24.3592,-10.0667,25.3711,39.0688,35.3796,859
-10.2918,-10.2239,2.6329,7.8701,-10.2239,7.882,22.4443,9.9647,861
-2.5826,-10.6507,22.1772,15.0036,-10.6507,7.1771,41.3884,35.8402,862
-3.217,-10.3654,-0.502,2.2509,-10.3654,6.4311,31.6845,29.1076,863
-4.4726,-9.6317,0.0735,4.6796,-9.6317,1.3786,19.6743,16.8859,864
-3.4477,-11.0963,4.0113,8.4347,-11.0963,11.9491,53.8148,42.464,865
-5.0658,-9.2808,11.7447,13.3543,-9.2808,2.242,50.4725,38.548,866
-6.255,-9.861,10.7079,13.8478,-9.861,7.0551,27.054,18.9416,867
-18.1672,-9.9873,-1.2809,8.2729,-9.9873,4.8982,18.0188,15.424,868
-8.4497,-9.9845,3.0089,7.8856,-9.9845,8.6736,48.9247,12.649,869
-9.9821,-9.9184,-0.8661,3.879,-9.9184,4.8898,20.6915,15.211,870
-3.5973,-9.9335,-0.9031,1.2959,-9.9335,1.0242,17.6584,16.3084,871
-15.5402,-9.8375,-3.1267,6.281,-9.8375,5.1914,16.8261,3.9775,872
-43.5472,-9.8688,-0.4892,11.8475,-9.8688,9.9913,29.2434,14.1444,874
-28.9871,-9.9628,-15.5717,12.195,-9.9628,4.521,56.5828,45.546,875
-26.4906,-9.8921,11.6636,41.6457,-9.8921,19.5268,70.9365,21.4008,876
-20.3991,-11.174,1.26,14.7121,-11.174,17.5745,66.416,53.9412,878
-9.4107,-10.8105,20.1272,23.2654,-10.8105,17.0371,59.2808,41.1229,879
-17.4855,-9.874,35.8083,32.1319,-9.874,11.7922,80.9708,71.3148,881
-103.877,-11.504,-25.3836,37.9979,-11.504,24.5402,80.5879,38.8674,882
-244.7715,-7.6824,-14.277,88.0952,-7.6824,26.2781,198.6339,76.6432,883
-114.2589,-10.7929,-52.7794,29.9641,-10.7929,4.7001,60.0519,38.9286,884
-33.5974,-10.029,29.1836,46.068,-10.029,16.5232,133.5596,83.1942,885
-24.2609,-9.8541,8.2063,18.6455,-9.8541,14.5494,52.9367,26.1965,886
-6.5698,-9.8679,-0.8591,2.0582,-9.8679,5.5727,37.0519,10.0843,887
-2.5228,-9.9104,8.2739,8.2337,-9.9104,2.3062,22.6625,18.6824,888
-21.8388,-9.9382,-7.1354,7.0657,-9.9382,6.2914,27.8448,23.4324,889
-14.7941,-11.1238,16.4176,37.8468,-11.1238,23.9059,77.0867,72.7603,890
-4.006,-9.9956,1.4156,2.7482,-9.9956,1.7405,22.183,8.2773,891
-4.1067,-9.8913,-0.2148,2.2769,-9.8913,2.7619,10.4771,6.6714,892
-5.4976,-10.0406,-0.597,2.8113,-10.0406,2.2779,12.8879,10.6379,893
-8.2148,-9.9233,1.8149,7.9151,-9.9233,8.8583,35.8785,15.7347,894
-15.3333,-9.8876,-1.1159,6.8477,-9.8876,8.3166,18.493,11.7977,895
-13.8431,-9.8673,-3.2653,4.4914,-9.8673,3.5999,8.8299,3.3186,896
-4.3007,-9.8628,-1.6882,1.1569,-9.8628,1.0014,3.8111,1.7833,897
-1.0758,-9.8773,-0.06,0.9726,-9.8773,1.1073,2.0495,1.2697,898
-6.042,-9.8461,-1.9861,2.0914,-9.8461,1.8137,4.9285,1.4832,899
-4.8999,-9.8713,2.2763,6.8742,-9.8713,3.5217,12.3769,9.3647,900
-1.2223,-9.9012,-0.5918,0.2605,-9.9012,0.3865,2.2591,1.6298,901
-4.5809,-9.8748,-3.6277,1.1798,-9.8748,1.6723,5.7947,4.6759,902
-3.6289,-9.8781,-2.0175,0.878,-9.8781,0.8138,4.3089,3.0232,903
-3.434,-9.8769,-0.6632,1.1954,-9.8769,1.4686,4.0497,1.4834,904
-1.3932,-9.8982,-0.1194,0.8018,-9.8982,1.332,2.2959,1.7167,905
-3.5676,-9.8825,-0.5226,2.8953,-9.8825,3.2672,5.3526,3.3653,906
-68.517,-9.8974,-4.6072,15.2325,-9.8974,4.0627,27.6814,15.9005,907
-7.9995,-9.8827,2.5454,5.5594,-9.8827,5.6086,19.4921,7.8087,908
-6.4315,-9.889,2.1125,4.6086,-9.889,4.2692,17.748,5.6255,910
-47.9165,-9.8611,-0.1154,12.8305,-9.8611,4.551,16.6273,2.089,911
-1.5837,-9.8808,-0.9915,0.3402,-9.8808,0.3523,2.444,1.9732,912
-1.0355,-9.8748,-0.239,0.4243,-9.8748,0.4571,1.1759,0.8795,913
-4.5195,-9.8918,-2.4216,1.9057,-9.8918,2.0436,6.5372,4.9617,914
0.0753,-9.911,0.5665,0.2503,-9.911,0.6801,2.1776,1.9747,915
-0.5973,-9.9019,-0.0737,0.3254,-9.9019,0.9774,1.5411,1.3443,916
-0.0559,-9.9148,0.0037,0.036,-9.9148,0.3982,1.3149,1.0292,917
-4.2647,-9.8904,-0.7856,1.9212,-9.8904,2.3764,5.5505,2.7336,919
-1.3258,-9.9017,-0.3657,0.566,-9.9017,1.3436,2.9092,1.5056,920
-0.2306,-9.9032,-0.114,0.0912,-9.9032,0.2439,1.0932,0.9466,921
-15.5102,-9.8654,-7.8614,7.5042,-9.8654,1.3993,31.5675,26.7492,922
-15.1176,-9.8266,-3.879,5.4833,-9.8266,3.6996,9.006,3.0996,923
1.2381,-9.8475,3.5261,2.1964,-9.8475,1.9763,7.3886,3.653,924
-2.8906,-9.8001,-2.0152,0.5454,-9.8001,0.3401,2.0701,1.6341,925
-6.9509,-9.8434,0.7142,3.1471,-9.8434,2.6822,5.4773,3.7404,926
-0.1976,-9.8603,1.4316,1.0877,-9.8603,1.0168,2.776,1.7556,927
-6.151,-9.8586,-1.2001,2.2313,-9.8586,2.1812,4.7348,1.8276,929
-6.5417,-9.8471,-0.4937,3.3117,-9.8471,2.7528,5.2488,2.2024,930
0.93,-9.8559,1.6016,0.5811,-9.8559,0.8652,3.9102,2.2158,931
-1.8984,-9.8817,-1.2011,0.5946,-9.8817,0.6685,2.6547,2.1553,932
-1.5756,-9.8785,-0.9096,0.4767,-9.8785,0.6562,2.3802,1.5786,933
-1.9552,-9.9336,-0.3606,0.9632,-9.9336,2.5243,5.925,2.1742,934
-1.2425,-9.8735,-0.472,0.4654,-9.8735,0.7724,8.2784,8.0687,935
-1.9657,-9.9066,-0.4936,0.8583,-9.9066,2.7071,4.0994,3.1731,936
-1.5576,-9.897,-0.4978,0.4809,-9.897,1.0753,3.2516,1.557,937
-4.4497,-9.8796,-0.767,1.7619,-9.8796,2.1398,5.2484,1.7507,939
-9.0083,-9.8822,-2.5088,2.4973,-9.8822,2.2457,7.8294,3.2916,940
-3.5804,-9.8511,-2.3494,0.7551,-9.8511,0.7146,3.431,2.5829,941
-1.7583,-9.8565,-0.2358,0.904,-9.8565,1.1313,2.3649,1.2731,942
-2.1247,-9.8746,-0.7101,0.849,-9.8746,0.818,1.9918,1.1129,943
-0.1748,-9.8778,1.9543,1.3493,-9.8778,1.482,4.9036,3.5138,944
-12.94,-9.8882,-2.9027,5.041,-9.8882,3.2922,7.8465,5.0261,945
-0.9028,-9.9007,-0.3931,0.2713,-9.9007,0.5103,1.9599,1.3837,946
-1.609,-9.8964,-0.2735,0.658,-9.8964,1.3251,2.9267,1.4085,947
-6.5392,-9.8966,-0.7558,2.0899,-9.8966,3.4068,6.7421,3.1163,949
-5.1645,-9.8825,-0.9666,2.1364,-9.8825,2.9092,5.4417,2.9733,950
-1.2259,-9.9056,0.2999,0.7228,-9.9056,2.6157,5.2953,2.6456,951
-1.8303,-9.9257,-0.2015,0.5729,-9.9257,1.0101,6.2068,4.9373,952
-6.1932,-9.9345,-3.3228,1.9397,-9.9345,1.5571,6.9867,5.1803,953
-34.3595,-9.7715,-18.6013,13.0729,-9.7715,1.4115,17.3103,16.372,954
-5.8622,-9.8803,-2.0652,1.8009,-9.8803,1.4907,5.2512,2.5651,955
-14.546,-9.8857,-1.3381,5.0149,-9.8857,6.2199,10.2827,6.0225,956
-33.3067,-9.8383,-6.4294,8.38,-9.8383,3.8556,14.1432,3.863,957
-9.5171,-9.8526,1.5831,9.282,-9.8526,7.6398,10.0683,7.6375,959
-2.1725,-9.8936,-0.5505,1.091,-9.8936,1.498,2.5055,1.4765,960
-1.2326,-9.8877,0.3312,1.4988,-9.8877,2.3154,5.0285,1.6617,961
-3.5685,-9.8851,-1.2354,0.7044,-9.8851,1.2804,5.5588,2.9726,962
-6.9803,-9.8076,-2.405,4.808,-9.8076,4.1999,5.8852,4.9819,963
-1.2989,-9.889,-0.2305,0.453,-9.889,1.5885,4.6048,2.5433,964
-4.0508,-9.8678,-2.8243,0.8398,-9.8678,1.1147,5.1191,3.7053,966
-2.5806,-9.8958,-0.5865,1.1357,-9.8958,1.7114,3.5724,1.4921,967
-0.5639,-9.9028,-0.2855,0.1503,-9.9028,0.2934,1.4781,1.1759,968
-0.7236,-9.9005,-0.3461,0.22,-9.9005,0.5141,1.7753,1.0733,969
-0.4584,-9.9015,-0.2796,0.053,-9.9015,0.0966,1.2403,1.1311,970
-0.4563,-9.9001,-0.3544,0.0782,-9.9001,0.1798,1.4095,1.2839,971
-0.4745,-9.9012,-0.3246,0.1321,-9.9012,0.3129,1.477,1.3153,972
-8.5098,-9.88,-5.0476,2.2965,-9.88,1.4914,6.1528,5.8475,973
-2.1656,-9.8634,-1.4381,0.665,-9.8634,1.1507,4.2385,2.1842,974
-11.5035,-9.8101,0.0207,10.6575,-9.8101,5.8682,8.2581,5.5607,975
-5.6447,-9.8805,-2.6641,2.052,-9.8805,1.7872,5.3344,4.4154,976
-2.4318,-9.8939,-0.1901,0.9288,-9.8939,1.5181,3.2798,1.5991,977
-8.3082,-9.853,-4.0291,4.9521,-9.853,3.9778,7.3804,4.9598,978
-4.1298,-9.8888,-1.9075,1.7098,-9.8888,2.1203,5.3284,4.1352,979
-6.3239,-9.8773,-1.8182,2.3669,-9.8773,2.3303,7.3448,4.7487,980
-19.1418,-9.8232,6.7653,19.3469,-9.8232,7.2804,55.4873,52.6693,981
-7.834,-9.9163,-1.3478,3.5238,-9.9163,5.1492,62.1724,53.0388,982
-19.5141,-9.9015,-0.2991,9.5344,-9.9015,7.8992,61.7041,41.6589,983
-18.5592,-9.9063,-1.0687,5.4294,-9.9063,6.4806,29.2966,19.6866,984
-1.6674,-10.0971,0.4725,1.5184,-10.0971,4.4423,25.1718,20.6441,985
-1.8043,-9.8997,0.1167,1.1036,-9.8997,2.5186,15.9428,10.3924,986
-3.8654,-9.8518,-0.0707,2.3437,-9.8518,3.5889,11.3836,8.4707,987
-3.6905,-9.9396,-0.3964,1.4056,-9.9396,2.4508,21.9351,10.31,989
-3.6835,-9.9081,1.1292,3.8916,-9.9081,6.7718,23.0534,19.0076,990
-5.8959,-9.9232,2.4667,6.8965,-9.9232,7.971,24.0691,16.9122,991
-2.9143,-9.869,-0.8779,1.255,-9.869,1.745,14.6846,7.1136,992
-1.2184,-10.0836,2.6979,2.473,-10.0836,2.0778,21.0696,13.7473,993
-0.2947,-9.8489,4.4107,5.1723,-9.8489,2.0048,17.4285,10.7139,994
-0.9764,-9.8834,-0.0518,0.608,-9.8834,1.5349,5.9979,4.9888,995
-1.1375,-9.9078,0.1553,0.6453,-9.9078,2.2295,9.0912,7.722,996
-3.1177,-9.9664,-0.9391,1.2066,-9.9664,1.2618,10.8059,7.1016,997
3.2039,-9.7107,16.3749,9.9418,-9.7107,3.6035,33.8277,27.8067,999
-2.2782,-9.8985,1.3617,2.5346,-9.8985,4.0414,13.7781,7.6785,1000
-0.6582,-9.7502,8.5548,6.86,-9.7502,4.1811,20.9429,16.627,1001
-6.2689,-10.0135,-1.3473,2.7546,-10.0135,6.1412,19.9973,4.7809,1002
-29.3416,-9.6361,1.4326,17.0149,-9.6361,3.4616,32.9317,28.7043,1003
-37.9048,-9.8649,45.3298,40.2773,-9.8649,7.6354,72.1165,52.1483,1004
-0.4899,-9.8714,1.6966,2.6157,-9.8714,4.8401,17.7239,14.6386,1005
-2.0961,-9.9669,1.2018,1.6876,-9.9669,2.6708,29.3918,23.6529,1006
-3.0007,-9.9556,-1.2907,1.1673,-9.9556,1.9434,34.4453,20.6643,1007
-3.8303,-9.9007,0.2157,2.7757,-9.9007,2.7401,31.5241,28.8388,1009
-3.6605,-9.8411,-0.6573,2.2849,-9.8411,5.0106,9.1121,6.9626,1010
-11.29,-9.846,-3.9842,3.0711,-9.846,0.9973,5.7385,3.3793,1011
-6.732,-9.8146,-1.5341,2.8807,-9.8146,2.1514,4.0045,2.2935,1012
-21.2147,-9.8502,-9.187,8.0371,-9.8502,2.7828,9.7433,8.2896,1013
-27.3378,-9.7922,10.6337,18.0658,-9.7922,9.7308,23.8506,14.8551,1014
-3.8731,-9.9507,-0.2771,2.0799,-9.9507,4.4821,19.3845,12.7609,1015
-4.9258,-9.8633,-1.5611,1.8643,-9.8633,1.5501,6.7475,4.744,1017
-6.8356,-9.8893,-1.7293,1.9465,-9.8893,1.9556,6.5117,2.3886,1018
-1.4521,-9.8717,-1.0725,0.354,-9.8717,0.344,1.7455,1.6356,1019
-0.5381,-9.8791,-0.1297,0.3435,-9.8791,0.5775,1.1507,0.9593,1020
-5.2442,-9.8729,-2.2429,1.5972,-9.8729,1.4706,4.7456,3.3999,1021
1.4062,-9.8172,2.7824,1.1794,-9.8172,1.375,8.4819,4.4421,1022
-49.6231,-9.8405,-15.5361,15.7011,-9.8405,5.0382,18.434,12.5718,1023
-22.2159,-9.9018,1.6831,10.5188,-9.9018,8.3437,28.0833,15.6728,1024
-15.7433,-9.8402,-0.702,7.7261,-9.8402,8.0171,15.3083,6.9213,1025
-17.9221,-9.9195,-1.4272,6.8181,-9.9195,5.8487,18.2065,10.0469,1026
-26.0094,-9.8396,-2.99,11.6628,-9.8396,3.8592,21.5556,18.1655,1027
-2.6553,-9.8716,-0.1937,2.623,-9.8716,2.5934,21.1131,16.9446,1028
-8.1421,-9.8623,-0.7831,4.4852,-9.8623,4.0906,7.1649,4.3332,1029
-44.2306,-9.7695,-21.1607,16.7034,-9.7695,5.1828,22.1578,17.5936,1030
-12.6522,-9.7604,-2.3243,4.2498,-9.7604,3.102,11.1219,3.3298,1031
3.3353,-9.8132,5.2099,1.3876,-9.8132,0.6969,4.6565,3.8062,1032
-19.9355,-9.8195,-9.4219,7.375,-9.8195,3.3841,14.5385,10.6885,1033
-7.5919,-9.7766,-2.8674,3.3618,-9.7766,2.1546,5.6533,3.4567,1034
-53.4561,-9.869,1.3343,17.1569,-9.869,10.1952,21.7937,8.7411,1036
-4.1806,-9.8305,0.7132,2.4098,-9.8305,2.7308,7.0278,3.1567,1037
-6.9734,-9.9033,-1.0565,2.0828,-9.9033,2.5031,8.5221,2.3279,1038
-153.9511,-9.746,-5.7649,63.0063,-9.746,9.7039,78.9445,66.2319,1039
-25.8605,-9.9304,-0.8557,8.637,-9.9304,4.309,12.0406,3.7458,1040
-5.781,-9.8596,0.4204,1.7304,-9.8596,1.0139,3.7664,1.3704,1041
-8.5159,-9.823,9.3619,8.1521,-9.823,3.9832,9.5239,8.4124,1042
0.8811,-9.7664,1.8815,0.6242,-9.7664,0.3345,2.5892,1.2707,1044
-1.3874,-9.7572,1.4237,2.5632,-9.7572,1.6191,6.17,2.4751,1045
1.441,-9.7597,1.5926,0.1052,-9.7597,0.0579,1.3681,1.2344,1046
1.5278,-9.7608,1.5989,0.0425,-9.7608,0.027,1.282,1.2416,1047
1.5478,-9.7598,1.5911,0.0285,-9.7598,0.0156,1.2673,1.2352,1048
1.552,-9.7608,1.5942,0.0457,-9.7608,0.0256,1.2776,1.2357,1049
1.5589,-9.7599,1.5875,0.0262,-9.7599,0.0139,1.2635,1.2324,1050
1.4767,-9.7607,1.6036,0.0879,-9.7607,0.0519,1.4469,1.2431,1051
1.3955,-9.759,1.5929,0.1136,-9.759,0.0603,1.3184,1.2519,1054
1.5405,-9.7599,1.5716,0.0253,-9.7599,0.0136,1.2646,1.2319,1055
1.4968,-9.7596,1.5796,0.0324,-9.7596,0.0183,1.2598,1.2362,1056
1.5046,-9.7596,1.545,0.0241,-9.7596,0.0141,1.2346,1.216,1057
1.5273,-9.7593,1.5824,0.0193,-9.7593,0.0112,1.2565,1.236,1058
1.5595,-9.7574,1.5785,0.0195,-9.7574,0.0114,1.2485,1.2393,1059
1.5289,-9.7584,1.5749,0.0249,-9.7584,0.0136,1.2496,1.2282,1060
1.5779,-9.76,1.6016,0.0158,-9.76,0.0077,1.2695,1.2514,1061
1.5157,-9.7584,1.5857,0.0482,-9.7584,0.0274,1.2682,1.231,1062
1.3414,-9.7596,1.5601,0.096,-9.7596,0.0538,1.3067,1.2192,1063
1.3586,-9.7571,1.6615,0.1666,-9.7571,0.0941,1.3647,1.3097,1064
1.3495,-9.7567,1.5386,0.1031,-9.7567,0.0589,1.3055,1.2386,1065
1.5617,-9.7611,1.6065,0.0382,-9.7611,0.0234,1.2873,1.2427,1066
1.5156,-9.7572,1.6094,0.072,-9.7572,0.0412,1.3266,1.2334,1067
1.4984,-9.7598,1.634,0.098,-9.7598,0.0544,1.3454,1.2421,1068
1.2867,-9.7577,1.5694,0.21,-9.7577,0.1195,1.3228,1.2042,1069
1.1031,-9.7621,1.3623,0.1424,-9.7621,0.0829,1.288,1.1235,1070
-0.1804,-9.7556,1.2534,0.6686,-9.7556,0.3851,2.1243,1.2178,1071
0.1271,-9.751,1.7189,0.6441,-9.751,0.3454,2.0039,1.366,1072
1.2164,-9.7563,1.5768,0.2042,-9.7563,0.1081,1.4159,1.2323,1073
1.4746,-9.7547,1.5702,0.0657,-9.7547,0.0344,1.273,1.2291,1074
-1.8153,-9.7667,1.6061,1.5966,-9.7667,0.8909,3.02,1.3958,1075
1.3759,-9.7563,1.574,0.1305,-9.7563,0.0741,1.4154,1.2155,1076
1.5043,-9.7558,1.581,0.0496,-9.7558,0.0274,1.2734,1.2218,1077
1.5685,-9.7559,1.592,0.0181,-9.7559,0.0102,1.2491,1.2293,1078
1.5595,-9.7553,1.5879,0.0218,-9.7553,0.0125,1.2491,1.2349,1079
1.5802,-9.756,1.5973,0.0143,-9.756,0.008,1.2394,1.2319,1080
1.3148,-9.7589,1.5646,0.2478,-9.7589,0.1433,1.5402,1.202,1081
1.5333,-9.7544,1.6027,0.0471,-9.7544,0.027,1.2943,1.2227,1082
1.5733,-9.7557,1.6033,0.0187,-9.7557,0.0106,1.2602,1.2388,1083
1.5781,-9.7544,1.6016,0.0143,-9.7544,0.0081,1.2428,1.2271,1084
1.5441,-9.7557,1.5979,0.0199,-9.7557,0.0111,1.2544,1.2389,1086
1.5616,-9.7573,1.607,0.0239,-9.7573,0.0135,1.2693,1.239,1087
1.5472,-9.7553,1.593,0.0215,-9.7553,0.0125,1.2542,1.237,1088
1.5754,-9.7547,1.5925,0.0148,-9.7547,0.0079,1.2449,1.227,1089
1.551,-9.7552,1.5996,0.0207,-9.7552,0.0116,1.265,1.2383,1090
1.5632,-9.7549,1.6027,0.0221,-9.7549,0.0124,1.2536,1.2338,1091
1.5525,-9.7557,1.5879,0.0234,-9.7557,0.0131,1.2494,1.2385,1092
1.5456,-9.7547,1.5919,0.019,-9.7547,0.0109,1.2397,1.2324,1093
1.5882,-9.7549,1.6051,0.0181,-9.7549,0.0102,1.2451,1.2366,1094
1.5584,-9.7561,1.5955,0.0214,-9.7561,0.0121,1.2485,1.234,1095
1.5797,-9.7534,1.5984,0.0106,-9.7534,0.0056,1.2439,1.2335,1096
1.5674,-9.7544,1.5991,0.0175,-9.7544,0.0109,1.2374,1.2314,1097
1.5888,-9.7545,1.6111,0.0204,-9.7545,0.0117,1.2525,1.2442,1098
1.5584,-9.7544,1.612,0.0201,-9.7544,0.0112,1.2542,1.2353,1099
1.5632,-9.7545,1.5877,0.0191,-9.7545,0.0101,1.2509,1.2309,1100
1.5711,-9.7553,1.6055,0.0171,-9.7553,0.01,1.259,1.2337,1101
1.56,-9.7556,1.5861,0.0195,-9.7556,0.0112,1.2561,1.2342,1102
1.5898,-9.7543,1.6131,0.0121,-9.7543,0.0073,1.2427,1.2321,1103
1.5797,-9.7534,1.5967,0.0169,-9.7534,0.0091,1.2491,1.2349,1104
1.5808,-9.7548,1.6001,0.014,-9.7548,0.0082,1.2428,1.2287,1105
1.5653,-9.7562,1.5928,0.024,-9.7562,0.0133,1.2469,1.223,1106
0.9073,-9.7537,1.5217,0.3931,-9.7537,0.2134,1.5264,1.2335,1107
-5.3831,-9.7674,-2.0269,3.1773,-9.7674,1.9706,5.6316,3.9857,1108
-12.8969,-9.8675,-6.4877,3.9346,-9.8675,2.9501,14.1339,4.6737,1109
-13.8132,-10.3483,5.8373,18.0288,-10.3483,6.3754,51.9167,22.2673,1110
-60.8318,-9.8039,-8.3494,25.5917,-9.8039,8.6242,32.4831,13.4621,1111
-33.2656,-9.6483,-24.8045,7.0133,-9.6483,2.3162,13.2544,11.5093,1112
-4.7923,-9.8406,4.8779,6.4928,-9.8406,1.6661,17.2484,15.0802,1113
-2.5049,-9.8875,-0.0991,1.6058,-9.8875,2.0274,3.1735,1.9242,1114
-0.9924,-9.9069,-0.6964,0.163,-9.9069,0.2432,2.5888,2.0979,1115
-0.4647,-9.9086,-0.1858,0.1538,-9.9086,0.6435,1.9849,1.3844,1116
-0.0606,-9.9058,-0.0234,0.0228,-9.9058,0.0787,0.884,0.8438,1117
-0.1278,-9.9111,-0.0943,0.0256,-9.9111,0.0787,1.2158,1.1182,1118
-0.2444,-9.9097,-0.2028,0.0338,-9.9097,0.0915,1.7861,1.686,1119
-0.0872,-9.9069,-0.0318,0.0312,-9.9069,0.1678,0.9528,0.8611,1120
-0.248,-9.9078,-0.1926,0.0309,-9.9078,0.0944,1.2219,1.1222,1121
-0.0056,-9.9094,0.0281,0.0198,-9.9094,0.1206,0.8866,0.8376,1122
-0.117,-9.9118,-0.0767,0.025,-9.9118,0.137,1.4355,1.332,1123
-0.4064,-9.9092,-0.2891,0.0843,-9.9092,0.1439,2.0173,1.8447,1124
-0.0369,-9.91,-0.0011,0.022,-9.91,0.2868,0.9382,0.8923,1125
-2.0215,-9.8976,-1.4512,0.375,-9.8976,0.3963,3.8827,3.1291,1126
0.4536,-9.9,0.9243,0.3461,-9.9,0.4187,2.763,2.3346,1127
-21.2734,-9.9013,-5.855,9.4016,-9.9013,3.2561,11.4243,8.5537,1128
-11.9843,-9.8631,-1.8738,4.187,-9.8631,5.7771,11.4848,4.4814,1129
-1.6,-9.8949,-0.5542,0.5297,-9.8949,0.7646,2.4257,1.2617,1130
-0.8147,-9.8942,-0.4827,0.2226,-9.8942,0.3498,1.6456,1.2273,1131
-0.5963,-9.8952,-0.4644,0.0903,-9.8952,0.144,1.3957,1.2263,1132
-0.5468,-9.895,-0.4619,0.0594,-9.895,0.0963,1.3253,1.2367,1133
-0.4961,-9.8969,-0.4597,0.0333,-9.8969,0.0512,1.272,1.2297,1134
-0.4983,-9.8952,-0.4581,0.0254,-9.8952,0.0371,1.2767,1.2291,1135
-0.4815,-9.8957,-0.4578,0.0187,-9.8957,0.0335,1.2776,1.2392,1137
-0.4781,-9.8961,-0.4643,0.0098,-9.8961,0.0146,1.259,1.2403,1138
-0.473,-9.8963,-0.46,0.0061,-9.8963,0.0096,1.2513,1.2334,1139
-0.4671,-9.894,-0.4614,0.005,-9.894,0.0107,1.2428,1.2323,1140
-0.4704,-9.895,-0.4626,0.0053,-9.895,0.0081,1.2455,1.2332,1141
-0.464,-9.8945,-0.4544,0.0053,-9.8945,0.0114,1.2491,1.2256,1142
-0.4661,-9.8943,-0.4576,0.0074,-9.8943,0.0124,1.2374,1.2328,1143
-0.4728,-9.8937,-0.4638,0.0052,-9.8937,0.0099,1.2413,1.228,1144
-0.4762,-9.8952,-0.4618,0.0078,-9.8952,0.0127,1.2439,1.2273,1145
-0.7213,-9.8943,-0.4912,0.19,-9.8943,0.302,1.5495,1.2749,1146
-1.8557,-9.8952,-0.7756,0.7368,-9.8952,1.0796,2.934,1.8777,1147
-2.7835,-9.8984,-1.1279,1.0014,-9.8984,0.6062,3.2075,3.0414,1148
-19.3574,-9.8884,-1.9853,5.7707,-9.8884,4.5868,10.8832,4.1342,1149
-1.8005,-9.8687,-0.1168,1.0985,-9.8687,1.8579,2.8101,1.711,1150
-4.82,-9.8994,-0.395,2.3533,-9.8994,3.2799,5.4014,3.6072,1151
-4.6,-9.9183,-0.2386,3.6818,-9.9183,2.418,8.5997,5.6079,1152
-1.9684,-9.9055,-0.4525,0.7518,-9.9055,1.0133,3.8285,2.1397,1153
-0.7223,-9.9104,-0.1888,0.2511,-9.9104,0.7661,2.2417,1.1601,1154
-0.2272,-9.9021,-0.1702,0.0374,-9.9021,0.0894,1.0683,1.0315,1155
-0.6782,-9.9029,-0.3178,0.1311,-9.9029,0.1664,1.4901,1.2859,1156
-0.5004,-9.9044,-0.3981,0.069,-9.9044,0.2688,1.8391,1.5627,1157
-0.576,-9.9032,-0.4102,0.0939,-9.9032,0.2126,1.649,1.5073,1158
-0.4212,-9.9066,-0.26,0.1035,-9.9066,0.2851,1.501,1.1939,1160
-0.369,-9.903,-0.2972,0.0394,-9.903,0.0946,1.3795,1.236,1161
-0.4236,-9.9031,-0.2776,0.0698,-9.9031,0.1759,1.4164,1.2412,1162
-0.4261,-9.9053,-0.331,0.1137,-9.9053,0.1955,1.4711,1.4291,1164
-0.8214,-9.9023,-0.3115,0.2256,-9.9023,0.5477,1.8595,1.2801,1165
-0.5557,-9.9063,-0.0204,0.3379,-9.9063,1.0922,3.8041,1.5621,1166
-15.6885,-9.8833,-4.4518,5.9751,-9.8833,4.5356,12.258,2.8419,1167
-1.3603,-9.8881,1.2744,2.4458,-9.8881,1.8128,8.1842,7.4547,1168
-0.0079,-9.9062,0.3132,0.2962,-9.9062,1.0645,3.2568,1.1894,1169
0.0683,-9.9073,0.2099,0.1073,-9.9073,0.4422,2.1968,1.2024,1170
0.0701,-9.9078,0.2062,0.0769,-9.9078,0.2877,1.4495,1.1474,1171
0.0027,-9.9063,0.2223,0.0814,-9.9063,0.2795,1.4928,1.1471,1172
-0.6525,-9.9031,0.2826,0.7307,-9.9031,1.8343,4.0021,1.7138,1173
-35.1012,-9.897,0.3667,9.3476,-9.897,8.7561,19.9777,5.4546,1174
-23.1533,-9.8331,-6.0777,9.3937,-9.8331,7.1205,14.3981,4.3041,1175
