AYGX_min,AZ_mean,AYGX_mean,AYGX_std,AZ_mean.1,GX_std,Gnorm_max,Gnorm_median,timestamp
-58.052,-10.2994,-3.3877,17.0427,-10.2994,8.0494,69.0648,40.5892,322
-99.9512,-6.7087,94.3302,191.1622,-6.7087,18.4822,111.0205,93.4053,324
-290.6365,-9.429,85.3581,155.5923,-9.429,56.7003,98.1698,73.5028,325
-8.5184,-9.7462,4.5873,12.8843,-9.7462,6.5837,39.2953,17.9035,326
-11.4901,-9.3396,-1.1796,7.462,-9.3396,7.7156,35.4244,30.4559,327
