AYGX_min,AZ_mean,AYGX_mean,AYGX_std,AZ_mean,GX_std,Gnorm_max,Gnorm_median,timestamp
0.061,-9.6759,0.0663,0.0027,-9.6759,0.0086,2.3357,2.3164,0
0.0602,-9.6759,0.0664,0.0033,-9.6759,0.0111,2.3532,2.3027,1
0.059,-9.676,0.0656,0.0034,-9.676,0.0114,2.3497,2.2895,2
0.0592,-9.6756,0.0673,0.0036,-9.6756,0.0118,2.3365,2.3084,3
0.0603,-9.676,0.0677,0.0036,-9.676,0.0121,2.3676,2.3172,4
0.0582,-9.6763,0.0661,0.0034,-9.6763,0.0112,2.3265,2.3005,5
0.0624,-9.6767,0.0675,0.0036,-9.6767,0.0116,2.3199,2.2912,6
0.0606,-9.6759,0.0649,0.0027,-9.6759,0.0091,2.3165,2.2826,7
0.062,-9.6762,0.0668,0.0038,-9.6762,0.0132,2.3185,2.2991,8
-0.3086,-9.6773,0.1332,0.2466,-9.6773,0.7965,3.3629,2.3805,9
-0.1106,-9.6802,-0.029,0.0392,-9.6802,0.1316,2.4503,2.3583,10
-0.2417,-9.6834,0.0079,0.1024,-9.6834,0.375,2.8806,2.3228,11
-0.2742,-9.6832,-0.0105,0.1463,-9.6832,0.4809,2.7495,2.3501,13
-79.6595,-9.5855,28.8707,84.6495,-9.5855,13.4455,57.6902,12.9767,14
-35.609,-9.6321,-1.3791,15.5918,-9.6321,10.3925,14.2513,11.6759,15
-1.3729,-9.6524,0.4816,1.335,-9.6524,3.6286,10.1861,7.5174,16
-10.3992,-9.6173,-4.9045,3.5373,-9.6173,1.8749,11.1863,7.0457,17
-18.7765,-9.726,-7.7961,7.01,-9.726,4.2503,17.1106,9.5189,18
-244.4175,-8.9085,51.5474,117.2012,-8.9085,23.4471,112.8212,46.7722,19
-84.0919,-9.2623,-28.714,27.1009,-9.2623,7.7075,20.6302,10.2018,20
-5.3975,-9.2396,8.4637,8.4983,-9.2396,2.6751,6.1828,4.2564,21
-5.0909,-9.2295,-0.891,3.4126,-9.2295,1.1047,2.9847,2.6158,22
-7.7597,-9.4427,24.4803,24.8828,-9.4427,6.3609,27.038,12.5716,23
-18.9347,-9.7039,-1.8742,6.3799,-9.7039,4.5126,25.9247,13.9424,24
-0.0679,-9.583,8.6034,7.1486,-9.583,2.9416,18.0569,15.042,25
-5.3011,-9.6391,5.8604,9.5841,-9.6391,7.9224,22.1083,13.4699,26
-22.2301,-9.9668,-7.0057,9.4777,-9.9668,4.8432,27.7497,20.4515,28
-25.2747,-10.089,-2.5577,15.446,-10.089,6.3523,29.4651,21.9237,29
-2.9358,-9.7278,3.3426,5.1691,-9.7278,4.9389,17.2835,8.7895,30
-3.1714,-8.9299,1.7758,3.1992,-8.9299,0.7805,7.758,5.7488,31
-0.3558,-10.2831,0.0246,0.2434,-10.2831,0.9309,10.0289,8.1605,32
-0.1868,-10.0592,0.4301,0.6119,-10.0592,1.5239,13.8603,5.1189,33
-2.7983,-8.9941,-0.6944,1.2536,-8.9941,1.6381,7.3282,4.1012,34
-3.8848,-8.9697,-0.632,2.1672,-8.9697,5.1786,16.6687,11.1874,35
-2.6577,-9.8939,0.6652,2.4285,-9.8939,3.847,15.5258,7.0418,36
-9.7001,-9.0943,-1.6719,3.3801,-9.0943,1.7402,9.7848,5.5586,37
-1.3935,-9.9902,3.8152,5.1652,-9.9902,4.5541,17.5255,10.3735,38
-6.1203,-9.4604,-0.8665,2.4559,-9.4604,1.9799,10.2829,5.9616,39
-1.8138,-9.5769,-0.0799,1.1948,-9.5769,1.9537,13.6636,5.8755,40
-2.7771,-9.362,0.1309,0.911,-9.362,1.0854,11.048,7.4004,41
-3.226,-9.7655,0.0834,2.5354,-9.7655,1.5506,9.9827,5.5693,42
-3.9734,-9.4191,-0.1973,2.0403,-9.4191,1.6784,8.189,5.2757,43
0.4925,-9.6821,1.7496,1.1457,-9.6821,4.166,14.7089,10.5565,44
-3.2876,-9.5971,0.6032,2.7074,-9.5971,4.1899,16.6421,8.6386,45
-1.4022,-9.7189,2.6127,3.3188,-9.7189,3.8582,18.1016,8.5547,46
-3.0547,-9.5393,1.3863,3.1508,-9.5393,2.5073,12.8611,6.7824,48
-7.3585,-9.053,1.9021,6.637,-9.053,2.1531,14.5835,11.7985,49
-3.6176,-9.6776,-0.2912,1.4761,-9.6776,1.8577,12.6179,6.2405,50
-2.27,-9.438,0.9705,2.3782,-9.438,3.3108,13.2247,7.9695,51
-5.249,-9.4072,-0.257,3.2029,-9.4072,1.2845,8.6607,5.2495,52
-2.4372,-9.1466,0.4125,1.6281,-9.1466,1.7148,9.2959,3.4647,53
-2.2153,-9.0721,-0.699,0.7704,-9.0721,2.878,11.8036,7.6643,54
-6.0842,-9.4256,0.2596,4.637,-9.4256,4.1947,18.6816,14.0131,55
-9.462,-9.6902,-0.7828,3.7751,-9.6902,3.8542,19.3432,8.5388,56
-2.6162,-9.8048,2.1429,2.9379,-9.8048,5.0206,13.5628,8.101,58
-1.3369,-8.7359,-0.117,0.9607,-8.7359,2.0866,12.4257,4.287,59
-2.1998,-8.735,-0.1797,0.8118,-8.735,1.3569,8.7777,4.5388,60
-4.4121,-9.5718,0.2345,2.421,-9.5718,4.1049,12.9463,7.3733,61
-3.3975,-9.3285,3.071,7.8246,-9.3285,1.1071,15.1293,13.6716,62
-10.1305,-9.8726,14.8394,13.5475,-9.8726,2.3534,33.9639,27.8516,63
-1.359,-10.3691,0.3406,1.3767,-10.3691,2.2593,18.4605,15.6603,64
-1.7193,-10.1119,0.6738,2.794,-10.1119,1.2191,9.5162,6.7796,65
-1.6199,-9.7288,0.6422,1.4655,-9.7288,1.8088,13.9079,5.594,66
-0.1862,-10.4783,2.077,2.112,-10.4783,5.2649,11.8856,5.7982,67
-4.3644,-9.8125,1.6028,4.1519,-9.8125,5.3482,14.2087,9.3182,68
-6.2478,-9.7083,0.7973,2.429,-9.7083,2.4529,11.3316,5.9669,69
-5.6654,-9.6651,-0.3124,2.0325,-9.6651,2.8885,14.29,6.9152,70
-3.6481,-9.6403,-0.0178,2.3359,-9.6403,0.8262,10.7852,6.6225,71
-0.3221,-9.6366,2.1884,2.0761,-9.6366,3.6609,10.683,8.8587,72
-1.1854,-10.056,2.4894,3.5559,-10.056,2.3223,18.0311,14.3512,73
-0.3325,-10.0313,1.4958,2.0207,-10.0313,2.065,12.0888,5.8513,74
-0.3438,-9.9722,7.5474,8.1756,-9.9722,3.5398,13.7245,11.1393,75
-3.3919,-10.1847,-0.2544,1.6484,-10.1847,1.7221,13.4711,5.2207,76
-3.3108,-9.5669,3.5751,6.0972,-9.5669,3.1056,11.1669,7.7337,77
-1.5004,-9.1731,2.0106,3.5272,-9.1731,1.8659,23.4969,11.1366,78
-2.5474,-9.4928,1.05,1.892,-9.4928,1.4549,15.5796,8.8786,79
-9.4585,-9.5724,0.1165,3.2553,-9.5724,3.3333,16.6794,9.087,80
-4.4579,-9.8142,-0.5333,1.6069,-9.8142,3.2779,14.2789,8.1773,81
-2.0954,-9.2893,-0.2059,1.753,-9.2893,0.9418,10.4839,7.448,82
-1.0802,-9.4738,0.2078,1.4218,-9.4738,1.6009,8.1996,5.4707,83
-4.8037,-9.5809,0.2785,3.7908,-9.5809,3.0467,21.2521,8.378,84
-5.4473,-9.5258,-1.3631,2.2584,-9.5258,2.5017,12.9226,7.8861,85
-2.297,-9.6243,0.399,1.8871,-9.6243,2.0016,13.5551,4.8343,86
-6.9198,-9.4823,1.4011,7.7515,-9.4823,2.5826,16.8572,13.1134,87
1.1939,-10.32,9.1205,7.7907,-10.32,2.6998,20.8504,18.6742,88
-17.5381,-9.4606,2.9677,8.462,-9.4606,6.8075,27.1013,11.4541,89
-21.3246,-9.7149,3.4616,12.8839,-9.7149,11.5876,26.4744,16.2676,90
-10.9244,-9.222,0.0553,6.1064,-9.222,5.8899,22.5364,17.9599,91
5.7828,-8.6741,13.607,11.295,-8.6741,3.6146,23.3379,14.9761,92
-0.3141,-9.97,0.2588,0.5958,-9.97,0.7439,12.6646,9.0274,93
-1.1704,-9.7191,-0.0511,0.7741,-9.7191,1.1349,9.0553,6.3997,94
-0.6951,-10.1324,0.0761,1.1481,-10.1324,1.3808,19.4396,8.6474,95
-3.831,-9.6223,-0.82,1.6502,-9.6223,1.9305,15.1384,7.7109,96
-2.1007,-9.9123,0.857,1.8642,-9.9123,3.8529,8.9723,6.6114,97
-0.4008,-9.3194,2.4757,2.1623,-9.3194,4.0345,10.8611,9.97,98
-0.7242,-9.6875,2.1102,2.69,-9.6875,3.2574,12.9051,8.6078,99
-1.9716,-9.3524,0.6847,1.6816,-9.3524,2.1682,9.903,5.2589,100
-0.0156,-9.3484,1.0499,1.2598,-9.3484,2.8064,11.2815,7.0705,101
-0.1573,-8.7808,5.5892,4.6287,-8.7808,3.8323,17.4045,13.9897,102
-0.1664,-9.1152,0.553,0.6669,-9.1152,1.1402,13.8184,8.9646,103
-1.4316,-9.3824,-0.1407,1.0333,-9.3824,1.6856,14.1689,5.6306,104
-3.2104,-9.2636,-0.8091,1.0755,-9.2636,1.952,11.7847,5.6096,105
-4.0939,-9.8911,1.1456,3.1213,-9.8911,4.2731,23.0191,11.1826,106
-0.2538,-9.5577,1.8489,2.2333,-9.5577,1.7415,10.7544,5.9765,107
-1.2098,-9.7077,0.9598,1.3592,-9.7077,2.9686,11.079,8.1677,108
-1.03,-9.5367,0.3434,1.1345,-9.5367,1.6255,17.7499,9.5764,109
-4.2984,-9.641,-0.082,1.8669,-9.641,2.706,24.8438,5.9939,110
-2.6489,-9.4297,0.2198,1.4003,-9.4297,2.2822,15.5791,6.6585,111
-2.9205,-9.6287,0.0357,1.6371,-9.6287,3.0676,16.1839,5.9127,112
-2.2167,-9.4594,-0.1244,1.455,-9.4594,1.0361,6.8012,4.6796,113
-1.7138,-10.1348,-0.4081,0.9133,-10.1348,1.2856,11.8426,5.5778,114
-2.5843,-9.6584,0.6766,2.2931,-9.6584,2.5358,12.8779,6.8569,116
-2.3385,-9.6576,0.4246,2.2781,-9.6576,4.2131,20.9029,9.4889,118
-3.5244,-9.5833,0.4376,1.5076,-9.5833,1.8241,12.5503,6.765,119
-4.8562,-9.7164,2.0457,6.9094,-9.7164,7.6239,28.8518,13.7646,120
-11.5717,-9.9995,7.0961,14.9031,-9.9995,4.47,30.6718,17.0304,121
-2.9462,-8.818,-0.4469,1.3849,-8.818,0.8105,12.9176,9.9824,122
-11.3782,-9.3262,-3.3521,4.0227,-9.3262,5.5938,12.4065,7.7985,123
-6.9141,-9.5898,-0.2393,2.9763,-9.5898,2.8425,16.7355,7.3037,125
-6.5869,-10.1686,2.9615,5.4012,-10.1686,1.2072,16.5964,15.6709,126
-6.8992,-9.976,1.3759,6.1943,-9.976,1.3018,15.5226,13.2521,128
-5.5191,-9.4288,2.6304,4.7992,-9.4288,7.648,18.054,10.7417,129
-3.9445,-9.7589,0.5551,2.1897,-9.7589,4.7823,17.7753,8.1753,130
-11.9041,-9.2123,0.038,4.9922,-9.2123,2.9092,19.4726,11.7504,131
-3.7372,-9.837,3.9006,5.9058,-9.837,7.6242,45.1384,30.6383,132
-16.9311,-6.4347,3.2836,20.6247,-6.4347,9.0778,68.2182,41.8146,133
0.3139,-9.4531,21.3363,17.7511,-9.4531,5.8779,48.0798,47.3268,134
-10.402,-10.2639,2.1069,4.8042,-10.2639,7.4081,61.5975,53.5981,135
-23.4574,-10.0218,-3.4482,12.7444,-10.0218,6.0571,58.9785,51.8962,136
-5.4981,-9.079,5.918,10.1852,-9.079,6.4846,27.3999,23.2284,138
-42.3922,-9.3535,2.6165,19.1371,-9.3535,10.3642,56.7963,20.8544,139
-13.0841,-9.6486,-1.0322,8.655,-9.6486,8.8056,62.8117,48.8389,141
-22.3081,-9.5157,-6.5691,8.9286,-9.5157,5.0784,32.4422,29.2949,142
-3.0211,-10.4787,0.7078,3.1956,-10.4787,4.7361,39.7727,21.1175,143
-13.8425,-9.4503,17.1237,18.6899,-9.4503,2.5665,41.3825,32.6494,144
-9.4335,-9.7069,-0.9144,3.2454,-9.7069,2.8827,12.6574,8.807,145
-5.2914,-9.6766,0.4528,2.7093,-9.6766,2.0587,13.1638,8.2847,146
-0.2064,-9.6761,0.0984,0.34,-9.6761,1.6508,13.5549,12.9168,148
-4.1105,-9.7905,0.6184,1.5596,-9.7905,4.4226,17.9411,7.4593,149
-30.3395,-9.4218,14.7379,24.8038,-9.4218,18.0708,48.2899,29.074,150
-12.8447,-5.8037,3.1603,11.8088,-5.8037,8.3464,64.2171,33.8558,151
-2.7472,-9.8019,0.693,2.2962,-9.8019,2.2305,16.6246,7.9838,152
-13.2232,-9.0168,-7.1388,3.4593,-9.0168,3.4281,20.2432,15.502,153
-6.223,-9.9065,9.5244,11.2842,-9.9065,9.4067,25.8504,16.6788,154
-30.2135,-9.4586,-2.1013,11.4537,-9.4586,6.4141,33.2859,19.7657,156
-9.0728,-9.9415,1.1459,3.6033,-9.9415,2.6601,27.7065,19.7616,158
-0.3412,-9.5347,4.182,4.1164,-9.5347,3.0608,21.1658,11.3702,159
-1.8712,-9.6485,0.0384,1.7703,-9.6485,2.5133,15.0552,9.943,160
-2.2081,-8.9493,6.6125,7.862,-8.9493,5.2432,23.1467,17.9422,161
-6.6844,-9.3016,-2.4923,2.7522,-9.3016,1.7912,12.1179,6.2877,162
-6.1296,-9.8194,-0.929,2.5379,-9.8194,3.74,16.7229,13.9674,163
-4.4052,-9.8277,-0.9268,2.3288,-9.8277,2.458,15.05,10.5933,164
-6.954,-9.6651,-1.3553,3.3274,-9.6651,6.6551,21.9947,11.4917,165
-6.8708,-9.2574,4.6436,7.5791,-9.2574,6.1103,26.7754,19.8587,166
-5.294,-9.5607,-0.2509,3.6512,-9.5607,2.5703,10.5579,6.9487,168
-0.916,-10.1681,0.3604,1.0182,-10.1681,1.3497,17.0306,8.0097,169
-1.7172,-9.641,-0.1758,0.687,-9.641,0.8175,8.0632,2.4624,170
-7.3329,-9.3887,-4.2592,2.1299,-9.3887,2.0794,13.6992,9.3328,171
-3.4361,-9.3402,0.906,2.1979,-9.3402,3.0306,11.5848,6.7815,172
-1.4769,-9.5645,-0.4926,0.5624,-9.5645,1.0741,8.072,5.766,173
-2.9789,-9.6436,5.3444,5.1934,-9.6436,5.6923,20.867,13.8582,174
-3.8477,-9.696,0.8687,3.3541,-9.696,3.2318,12.5194,7.4976,175
-3.5473,-9.6112,-0.8803,1.4156,-9.6112,2.7363,10.7348,6.1532,176
-1.246,-9.7439,0.0764,0.9129,-9.7439,2.7357,7.4571,5.7022,178
-2.0374,-9.6848,0.7345,1.769,-9.6848,1.8993,10.0049,8.2507,179
-3.9926,-9.5961,-1.551,1.9885,-9.5961,4.221,13.9646,11.6138,180
-2.6591,-9.9,0.2541,2.2217,-9.9,5.1606,14.9277,12.3081,181
-3.6139,-9.7014,-0.8152,2.8249,-9.7014,1.7806,11.5916,10.1988,182
-2.6398,-9.7605,0.39,1.5407,-9.7605,4.5393,11.6509,5.3697,183
-3.5982,-9.6257,1.7932,3.8189,-9.6257,1.6675,12.3161,9.7791,184
-3.6424,-9.6036,-0.7836,2.2466,-9.6036,4.9665,9.1333,6.5752,185
-0.1145,-9.6525,4.9237,4.4612,-9.6525,3.2652,13.841,10.8405,186
-2.9607,-9.8745,-0.5805,2.2449,-9.8745,2.1735,13.052,10.1845,188
-4.0506,-9.6745,0.6642,1.8943,-9.6745,3.6235,13.9781,10.2968,189
-2.8651,-9.6257,0.1402,1.2862,-9.6257,1.313,9.4932,4.9158,190
-2.4962,-9.8774,-0.7641,0.8181,-9.8774,0.8674,10.1102,8.4681,191
-0.7716,-9.6615,-0.1585,0.293,-9.6615,0.6298,9.4761,5.4713,192
-0.1046,-9.5571,0.2028,0.3743,-9.5571,0.4816,7.041,3.4634,193
-0.9087,-9.8596,2.5179,2.4184,-9.8596,2.2811,11.1695,6.9589,194
-2.7995,-9.7315,0.3282,1.6633,-9.7315,2.316,11.8904,6.4753,195
-0.3838,-9.3221,0.31,0.4757,-9.3221,1.0032,14.2417,7.6829,196
-0.4542,-9.8288,0.8756,1.0087,-9.8288,1.9306,10.1534,6.3266,197
-3.333,-9.6487,-0.3686,1.5549,-9.6487,1.4086,4.7459,3.7203,198
-5.1323,-9.6379,0.4779,2.5697,-9.6379,2.8695,12.4026,9.4513,199
-0.8884,-9.6907,-0.1356,0.2841,-9.6907,2.319,8.2283,4.8697,200
-2.0943,-9.7764,5.6897,7.0335,-9.7764,4.3383,34.292,19.5428,201
-7.7528,-10.4056,5.4563,7.1716,-10.4056,10.6563,73.8891,55.0688,202
-2.0485,-9.6023,2.6791,3.1397,-9.6023,2.7745,28.2997,22.8807,203
-4.6567,-9.6711,0.1275,4.1292,-9.6711,2.2348,35.2665,31.377,204
-0.7619,-9.7168,2.5086,2.834,-9.7168,2.7794,29.7662,15.1508,205
2.0243,-9.6534,6.1466,2.7801,-9.6534,1.6125,37.2963,29.8953,206
-42.129,-9.5795,-13.8172,14.4521,-9.5795,5.8662,19.3892,13.3807,207
-82.2332,-9.3506,12.6411,33.9791,-9.3506,11.9605,45.4639,16.8284,208
-59.45,-9.797,-7.2668,23.6945,-9.797,15.4204,29.5019,15.486,209
-15.8307,-9.4767,-3.3637,5.0753,-9.4767,4.5178,9.2726,6.2758,210
-30.9126,-9.5681,-3.9008,14.8091,-9.5681,8.4674,18.2747,10.8101,211
-15.376,-9.6213,-9.1873,5.1524,-9.6213,2.2844,9.5221,7.8954,212
-67.5649,-9.3151,-26.9513,25.2418,-9.3151,6.6466,25.7651,22.6027,213
-99.3285,-9.1044,-43.1941,34.1146,-9.1044,6.291,29.7169,24.1643,214
-63.0112,-8.9765,39.847,53.1168,-8.9765,14.1736,35.3221,14.7311,215
-1.4118,-9.6666,16.3385,17.9362,-9.6666,5.4921,27.2522,13.635,216
-8.1628,-9.6039,0.8332,4.3611,-9.6039,5.6357,23.6743,14.72,217
-3.0688,-9.608,1.426,4.9728,-9.608,2.8945,9.8914,6.9741,218
-28.6404,-9.737,0.8294,9.9074,-9.737,7.7526,35.1181,22.1567,219
-19.2394,-9.8636,-2.231,11.7476,-9.8636,8.4155,59.5009,30.1881,220
-12.2047,-9.8906,-3.5542,5.0215,-9.8906,4.926,33.4213,19.6664,221
-10.1917,-9.7407,0.6123,7.3486,-9.7407,11.8658,32.5061,14.8675,222
-32.1932,-9.6339,-6.9505,14.2224,-9.6339,7.6364,33.5716,23.6642,223
-7.1011,-9.892,-1.6654,3.94,-9.892,4.2084,15.1882,11.4091,224
-1.7609,-9.6268,2.5831,2.2822,-9.6268,1.1756,8.8277,7.3496,225
-5.4998,-9.7247,2.4866,4.6531,-9.7247,4.3947,20.3071,12.0622,226
-7.9438,-9.707,3.4326,7.4559,-9.707,7.0308,23.9708,18.7022,228
-2.1457,-9.7354,1.4074,2.7479,-9.7354,3.3262,11.954,7.2874,229
-2.2587,-9.6621,2.188,4.475,-9.6621,1.629,12.9744,11.614,230
-1.315,-9.7745,0.0632,0.8064,-9.7745,2.0298,8.7302,6.017,231
-2.0803,-9.7333,3.185,4.5445,-9.7333,1.724,16.0969,12.4898,232
-0.4455,-9.7301,1.0336,1.1706,-9.7301,1.2837,7.5561,6.9007,233
-6.2948,-9.6552,-1.7352,2.7505,-9.6552,4.0843,11.4934,8.252,234
-4.137,-9.7295,5.2618,5.9547,-9.7295,0.9882,15.3953,13.0595,235
-3.4463,-9.6449,-0.2233,1.5263,-9.6449,1.6722,7.2272,5.3178,236
-1.3381,-9.6726,0.1129,0.6785,-9.6726,2.2251,8.7375,7.6093,237
-2.2373,-9.5981,-0.0851,1.4755,-9.5981,1.8365,12.578,8.6504,238
-3.0848,-9.682,0.2293,1.1078,-9.682,1.4641,9.6612,5.1873,239
-2.5508,-9.7131,0.3874,1.7981,-9.7131,3.5681,12.5832,6.1191,240
-1.3338,-9.7632,0.5887,1.0568,-9.7632,4.203,17.5235,15.8914,241
-2.033,-9.5331,0.3976,1.8062,-9.5331,0.9455,10.8622,9.9842,242
-1.0933,-9.7699,0.7149,1.4099,-9.7699,1.7804,9.3833,4.158,243
0.0754,-9.8364,2.9613,2.1637,-9.8364,3.2785,18.1152,15.5301,244
-0.5021,-9.7142,5.3001,4.2223,-9.7142,2.5586,13.3911,12.3762,245
-3.3352,-9.7625,0.8214,1.9114,-9.7625,4.4301,16.0296,7.4636,246
-1.1832,-9.636,0.8058,2.1204,-9.636,3.2816,10.4236,5.6743,247
-7.9252,-9.6701,-0.8056,2.7533,-9.6701,4.6074,19.1052,6.9419,249
-1.3181,-9.9689,-0.0983,0.928,-9.9689,2.046,6.3889,3.1346,250
-3.3062,-9.4995,-0.9813,1.8632,-9.4995,1.58,6.9017,5.1747,251
-6.0785,-9.8048,-0.1492,2.8568,-9.8048,2.613,14.188,5.5708,252
-2.8467,-9.5598,-0.8106,2.3319,-9.5598,2.2731,20.1623,14.5944,253
2.7828,-9.673,6.07,2.554,-9.673,1.2796,11.4771,8.7412,254
-0.4817,-9.6468,2.4761,2.4686,-9.6468,1.7943,9.3738,6.9234,255
-0.0978,-9.8049,0.5908,0.6734,-9.8049,1.3696,9.0344,4.2567,256
-4.5832,-9.6947,0.3271,3.6101,-9.6947,4.5835,13.284,10.3185,258
-3.1693,-9.6546,1.7458,3.6351,-9.6546,3.6704,15.0004,8.9213,259
-3.0136,-9.656,0.2726,1.5112,-9.656,2.8179,8.1193,5.3471,260
-1.3517,-9.6641,-0.1206,0.8201,-9.6641,1.4647,6.1026,3.8367,261
-0.1105,-9.6696,0.3979,0.5933,-9.6696,2.3946,8.0783,3.7986,262
-0.7393,-9.9051,-0.1078,0.4887,-9.9051,2.7349,9.9473,6.7216,263
-3.1667,-9.8153,2.3851,4.3636,-9.8153,2.3857,12.3868,11.1941,264
-11.7724,-9.6372,-2.3152,3.3405,-9.6372,2.3793,12.6145,8.2877,265
-0.9429,-9.5688,1.0726,1.5235,-9.5688,5.0919,16.1466,13.4858,266
-4.4996,-9.5983,3.4341,7.3649,-9.5983,4.9764,17.351,10.2397,268
-6.3227,-9.6721,0.9247,3.786,-9.6721,5.3498,18.7218,11.5597,269
-10.3867,-9.6314,4.7194,11.9924,-9.6314,1.3324,18.143,16.2478,270
-30.7287,-9.7745,16.9658,40.4343,-9.7745,11.5822,45.3097,29.0513,271
-21.1251,-9.584,3.6824,20.3251,-9.584,3.7189,35.6777,20.7087,272
-8.0778,-9.8571,-0.6505,3.5995,-9.8571,1.9931,19.9399,11.5904,273
-4.5601,-9.7901,4.9818,7.2254,-9.7901,3.4284,20.3169,16.5674,274
-0.9173,-9.3455,0.3419,1.0655,-9.3455,3.7109,8.3439,6.9753,275
-0.6082,-9.665,0.7505,1.1143,-9.665,2.0616,10.4135,6.8723,276
-14.5443,-9.7456,-0.3886,3.6871,-9.7456,5.0119,13.267,6.3957,278
-6.3415,-9.705,-1.1391,2.4739,-9.705,4.8539,16.5687,7.3627,279
-9.0759,-9.565,3.6816,7.5422,-9.565,7.1941,17.4498,13.4495,280
-0.2231,-9.7172,0.2942,0.3725,-9.7172,1.8564,6.364,3.3949,281
-1.2963,-9.6494,0.5246,1.0068,-9.6494,1.4853,15.5436,12.56,282
-6.9892,-9.6131,-2.1318,2.9859,-9.6131,2.4592,10.1386,8.7302,283
0.001,-9.6518,0.6107,0.5047,-9.6518,2.3833,13.0987,11.4347,284
-0.4137,-9.6642,3.9706,3.0815,-9.6642,3.1991,23.2549,18.2167,285
-0.9502,-9.755,5.2568,5.6039,-9.755,7.5873,17.0513,13.2283,286
-10.3623,-9.6145,-0.727,5.2799,-9.6145,1.3232,17.6407,14.731,287
-0.1322,-9.8125,1.2083,1.2423,-9.8125,2.2652,7.6645,4.8257,288
-7.3364,-9.7306,-1.5862,1.8918,-9.7306,4.3322,11.8664,7.0838,289
-5.0714,-9.7383,0.6628,3.3103,-9.7383,2.7001,12.4511,5.8518,290
-9.2275,-9.7449,-3.1134,3.0878,-9.7449,1.4176,16.0919,4.9541,291
-7.4338,-9.7048,0.0372,3.9492,-9.7048,5.2465,16.8526,12.3546,292
-3.3787,-9.6473,0.4739,3.5894,-9.6473,4.2877,12.1123,8.5676,293
-1.3325,-9.8926,0.1376,0.8089,-9.8926,1.4433,4.0585,2.1952,294
-0.2168,-9.9248,8.3991,5.6411,-9.9248,10.2079,18.4466,14.0996,295
-4.8284,-9.737,0.3978,3.6808,-9.737,5.9917,19.2729,8.3796,296
-3.2516,-9.526,0.2199,1.5875,-9.526,1.4751,6.1875,5.6974,298
-8.6363,-9.7177,-1.0482,2.9711,-9.7177,5.0427,9.818,6.3055,299
-0.6075,-9.6183,0.8647,1.1999,-9.6183,0.5616,6.1878,4.4883,300
-9.6656,-9.8077,-1.2443,5.724,-9.8077,14.3333,26.8677,18.2252,301
-1.0555,-9.8023,1.0718,2.0397,-9.8023,3.4201,8.8723,7.686,302
-3.1223,-9.8693,-0.8625,1.6511,-9.8693,4.3737,9.5811,7.086,303
-2.385,-9.563,-0.6325,0.9847,-9.563,2.9667,8.871,5.8839,304
-1.643,-9.5541,-0.3616,0.7819,-9.5541,1.6458,4.9679,3.9097,305
-5.9807,-9.7845,-0.4655,2.6065,-9.7845,2.1269,9.3593,5.8745,306
-8.121,-9.7214,-1.2629,3.1351,-9.7214,3.2302,13.3576,7.1688,307
-1.3591,-9.6898,-0.4702,0.9506,-9.6898,2.2849,10.4585,5.7729,308
-3.8162,-9.7136,-0.9123,1.6272,-9.7136,3.488,9.8921,6.1291,309
-1.5667,-9.7239,2.595,3.2674,-9.7239,5.8883,10.0925,6.0418,310
-0.6975,-9.7048,0.6731,1.1248,-9.7048,1.7122,6.6641,4.417,311
-2.9552,-9.6381,-0.9579,1.2993,-9.6381,1.5071,10.9608,7.9452,312
-0.1137,-9.7145,1.068,0.7994,-9.7145,2.1666,10.4814,4.4679,313
-1.4396,-9.7655,0.077,1.1562,-9.7655,2.3204,7.4253,5.1628,314
-4.9432,-9.6079,-1.8738,1.5427,-9.6079,2.7296,10.2914,8.1545,315
-2.8274,-9.67,-0.0312,1.1944,-9.67,3.5975,13.0312,7.3067,316
-3.6542,-9.7831,-0.5248,1.3621,-9.7831,5.5232,11.281,7.5963,317
-1.4489,-9.7077,0.2374,0.8682,-9.7077,2.7224,7.647,6.3815,318
-2.6001,-9.7302,1.5219,2.0573,-9.7302,4.3678,8.5043,6.232,319
-3.0403,-9.7052,0.2817,1.9691,-9.7052,2.9619,9.2885,4.9355,321
-5.3223,-9.6257,-1.2571,2.1713,-9.6257,3.386,12.1275,7.918,322
-4.7096,-9.6146,2.6006,4.4008,-9.6146,5.5469,13.3805,8.4897,323
-2.2864,-9.7746,0.1987,1.2528,-9.7746,4.5154,9.695,5.3949,324
-3.3412,-9.766,-1.1458,1.4759,-9.766,1.4697,8.2111,4.85,325
-1.3611,-9.6071,0.8466,1.6483,-9.6071,3.4187,9.7097,5.6741,326
-5.5416,-9.7257,-0.8403,1.8268,-9.7257,3.2595,9.1064,4.977,328
-1.0488,-9.6273,1.1552,2.1444,-9.6273,3.4648,8.3455,5.8211,329
-4.4106,-9.8234,6.8767,8.9058,-9.8234,5.3774,19.8829,12.684,330
-7.6497,-9.7189,0.6845,3.6323,-9.7189,3.6388,8.5764,5.8053,335
-3.2365,-9.6852,-0.5884,1.3282,-9.6852,4.0983,8.0978,6.4892,336
-7.539,-9.4532,-3.3826,3.1492,-9.4532,2.3269,9.655,7.0156,337
-2.4264,-9.585,0.0202,1.7827,-9.585,0.8602,7.2525,5.174,338
-5.205,-9.752,-1.0381,1.5862,-9.752,4.5893,11.0577,6.0963,339
-2.2613,-9.6213,-0.374,0.8542,-9.6213,3.0988,16.742,6.2653,340
-3.7195,-9.6949,-2.0871,1.6624,-9.6949,2.0888,10.8393,7.7974,341
-3.2016,-9.7085,-1.0418,1.1787,-9.7085,1.9771,7.3519,5.1043,342
-2.3312,-9.6644,-0.288,1.4812,-9.6644,3.1544,12.4908,8.9398,343
-4.0113,-9.7641,-2.0128,1.5241,-9.7641,2.1245,9.6707,6.7379,344
-7.7303,-9.9004,0.3026,5.5549,-9.9004,3.9593,16.2441,14.3232,345
-0.5433,-9.653,1.0152,1.5524,-9.653,2.224,10.2877,5.4082,346
-4.666,-9.724,-1.8935,1.8536,-9.724,4.8033,14.111,8.4263,347
-6.498,-9.6532,0.2271,3.7508,-9.6532,5.4453,13.853,8.9811,348
-6.7129,-9.5776,-0.2373,3.0271,-9.5776,3.119,8.5177,5.8844,349
-2.9146,-9.8285,0.4248,1.6919,-9.8285,4.1803,11.7369,9.072,350
-1.5513,-9.7065,-0.5236,0.5865,-9.7065,2.3729,7.6025,5.6138,351
-1.4202,-9.6589,1.7227,3.1509,-9.6589,3.9812,16.129,10.2308,352
-5.2638,-9.5794,-1.2044,1.8036,-9.5794,1.7078,6.3725,3.2659,353
-2.0338,-9.8744,1.1364,4.6252,-9.8744,6.283,15.0388,13.9647,354
-3.1675,-9.6433,4.3625,7.4556,-9.6433,5.4644,20.0074,13.0097,355
-4.1375,-9.651,3.0026,4.1884,-9.651,7.3077,18.4913,12.7986,356
-0.6638,-9.7007,1.05,2.264,-9.7007,3.4181,10.9934,6.6434,357
-6.0752,-9.7623,-2.7401,2.1688,-9.7623,1.5375,9.6291,6.2196,358
-2.7706,-9.8019,2.6349,3.9052,-9.8019,6.6161,28.4864,22.7135,359
-2.9794,-9.966,0.0278,1.7723,-9.966,4.026,36.8342,26.6666,360
-8.3757,-10.236,-2.7046,3.156,-10.236,2.2402,38.2092,37.194,361
-15.9037,-9.5893,-6.9533,6.3638,-9.5893,1.3471,28.5293,24.8624,362
-1.1397,-9.6703,2.6225,5.0099,-9.6703,3.1329,19.1987,5.4286,363
-0.5877,-10.0705,0.3502,0.8438,-10.0705,0.8831,18.1835,9.64,364
-2.0534,-9.507,-0.2946,1.1295,-9.507,1.5498,7.3742,5.6019,365
-3.7789,-9.8038,-0.6714,1.5712,-9.8038,4.4636,17.058,11.5621,366
-2.5769,-9.8772,0.5453,1.6357,-9.8772,1.6713,16.7562,9.0067,367
-3.2694,-11.0185,-1.0299,1.5724,-11.0185,1.9046,18.5839,10.2239,368
-3.6283,-9.4671,0.0384,2.5894,-9.4671,1.1177,13.77,6.4042,369
-3.9503,-10.0279,-0.1844,2.6465,-10.0279,2.6058,19.7651,15.2154,370
-0.2614,-9.5744,0.3604,0.6115,-9.5744,2.149,21.6079,20.6245,371
-10.9908,-8.9547,-2.0805,5.0233,-8.9547,3.5244,31.6888,29.8228,372
-3.8377,-9.7975,-1.1432,1.8237,-9.7975,0.9275,17.6561,15.0916,373
-2.9814,-9.7597,-0.2392,1.8827,-9.7597,0.5091,7.6691,7.1185,374
-1.5972,-9.8883,-0.2185,0.9925,-9.8883,0.8076,12.7035,9.1327,375
-2.0539,-9.7127,0.3635,1.4187,-9.7127,2.8218,18.6524,11.0526,376
-2.1323,-9.6481,-0.0328,1.7836,-9.6481,0.5052,18.2007,16.6094,377
-26.0008,-8.3931,0.1175,6.1103,-8.3931,3.3307,35.1076,12.9409,379
-6.7904,-9.7158,-1.5949,2.5115,-9.7158,2.7538,19.9074,14.5597,380
-16.6228,-9.5791,-3.8819,5.3777,-9.5791,4.0532,21.1014,17.6009,381
-9.1677,-9.6376,-0.6889,3.375,-9.6376,2.531,31.9097,26.2802,382
-2.091,-10.1076,-0.0004,1.2086,-10.1076,1.9559,37.4619,27.0913,383
-9.6807,-9.6058,0.9249,6.4736,-9.6058,2.8894,27.3928,20.575,384
-2.4725,-9.6623,-1.2449,0.952,-9.6623,1.2012,10.0366,8.473,385
-1.5756,-9.6993,0.1699,0.7784,-9.6993,1.3423,10.191,4.4969,386
-2.3946,-10.0154,-0.7034,0.8483,-10.0154,1.4888,8.6883,4.2088,387
-1.9581,-9.7916,-0.5476,0.6718,-9.7916,1.1482,4.5282,2.5181,388
-8.6443,-9.8114,0.6583,5.3994,-9.8114,2.6983,16.9205,9.7129,389
-12.2072,-9.5407,0.5944,6.0463,-9.5407,7.5714,22.2216,10.9687,390
-9.5492,-9.8261,6.5345,9.1622,-9.8261,10.1535,22.6007,17.0138,391
-0.7268,-9.5346,0.7749,1.2919,-9.5346,2.5769,13.1238,8.8283,392
-5.9115,-9.7877,-0.6095,2.3286,-9.7877,1.5269,6.6146,4.2377,393
-7.4591,-9.8277,-0.563,6.44,-9.8277,2.8711,13.1163,9.3693,394
-4.5511,-9.7604,-0.0257,3.3291,-9.7604,1.9191,9.8624,7.7598,395
-4.3659,-9.5961,-0.5742,2.1561,-9.5961,3.0607,14.6094,8.7496,396
-3.6242,-9.1248,-1.3031,1.2018,-9.1248,4.6684,15.3319,11.6649,397
-7.0382,-9.6796,-0.9361,2.349,-9.6796,3.7875,12.0214,5.9426,398
-9.6362,-9.7261,-0.974,3.2711,-9.7261,7.4424,16.2035,9.9674,399
-5.9921,-9.5841,-0.7686,2.1985,-9.5841,6.1573,14.0093,8.5278,400
-5.0553,-9.4347,-0.4408,2.4363,-9.4347,2.5809,12.8136,5.0115,401
-3.7786,-9.3762,-1.0901,1.6257,-9.3762,1.8364,7.4639,4.2866,402
-1.9193,-9.7334,0.8323,1.9315,-9.7334,4.1338,13.8017,7.5549,403
-6.3419,-9.5486,-1.7208,2.8522,-9.5486,2.3488,11.5526,10.1991,404
-4.0125,-10.0163,-0.623,2.2684,-10.0163,2.0017,11.8639,6.9791,405
-4.9308,-9.5593,-0.8702,2.166,-9.5593,3.6772,10.5421,5.9651,406
-1.3647,-9.9113,0.6202,1.3179,-9.9113,5.3662,9.4289,7.6344,407
-4.7231,-10.0047,-0.855,1.7274,-10.0047,5.0511,14.3356,9.6596,408
-2.7382,-9.8375,0.2298,1.3456,-9.8375,3.8478,11.2983,6.0326,409
-17.3019,-9.7216,0.656,6.7497,-9.7216,4.6842,16.1419,7.4554,410
-3.3669,-10.0731,0.2342,2.6387,-10.0731,1.2142,7.562,4.5791,411
-3.1789,-9.5658,0.4222,2.3128,-9.5658,4.3858,13.2701,8.9265,412
-10.7208,-9.9836,-0.8367,4.9029,-9.9836,2.8225,9.8917,7.4892,413
-2.0947,-9.5499,0.389,1.6006,-9.5499,2.4326,12.962,11.3139,414
-4.503,-9.7264,3.6103,8.1811,-9.7264,6.8688,24.5367,14.6349,415
-5.2299,-9.8606,0.5896,3.2438,-9.8606,5.5673,13.1497,7.2009,416
-9.103,-9.77,0.8647,6.8793,-9.77,5.7542,24.4605,14.5273,417
-0.6423,-9.5141,0.3164,0.4253,-9.5141,1.3266,7.2691,4.6346,418
-7.3282,-9.8046,-0.3945,3.4689,-9.8046,6.473,21.9123,9.8502,419
-4.3471,-9.7966,11.747,9.4155,-9.7966,2.1581,23.3624,19.5537,420
-4.267,-9.4183,3.2698,6.5644,-9.4183,2.8962,28.5818,23.05,421
-0.3971,-9.8685,2.0328,1.739,-9.8685,2.4683,34.1003,29.3855,422
-7.5776,-9.8645,-3.0755,4.0127,-9.8645,2.0538,28.127,25.7235,423
-5.9994,-9.6653,-2.4669,2.5761,-9.6653,4.1833,16.0082,8.8595,424
-3.0456,-9.2352,1.0701,3.8297,-9.2352,0.4737,13.1949,9.4674,425
-6.3361,-9.6628,-1.5833,3.4973,-9.6628,2.6722,12.5731,9.6132,426
-2.7925,-9.8574,-0.499,1.7318,-9.8574,0.8773,7.4938,6.2646,427
-5.2325,-9.605,-0.3841,2.2934,-9.605,1.8939,9.905,7.081,428
-0.971,-9.8408,1.1036,1.3056,-9.8408,2.3162,11.2621,6.9331,429
-2.2208,-9.5741,0.6129,2.4592,-9.5741,2.9722,14.9028,5.9212,430
-10.6954,-10.5999,-0.2802,4.6557,-10.5999,4.8325,19.7805,15.1992,431
-8.4421,-9.4597,-1.2092,4.4985,-9.4597,5.1358,8.3869,5.281,432
-6.921,-10.3549,-0.0277,3.5973,-10.3549,3.2813,10.4598,8.6075,433
-0.945,-9.6765,1.7578,2.3398,-9.6765,1.7832,13.1686,7.2733,434
-7.5832,-9.7756,-1.5625,2.8149,-9.7756,2.8197,11.1473,6.3213,435
-2.7852,-9.694,0.9959,2.5072,-9.694,4.7646,19.7622,10.6669,436
-1.6305,-9.5907,-0.6521,0.8314,-9.5907,1.5412,8.9461,7.9118,437
-6.1407,-9.629,-1.4571,3.6271,-9.629,2.9009,10.7404,9.5719,438
-4.5659,-9.5045,-1.0533,1.545,-9.5045,3.9347,13.1732,6.0687,439
-5.4225,-9.5871,0.6103,4.0718,-9.5871,5.8752,20.8148,10.4439,440
-0.9095,-9.7438,-0.0891,0.7552,-9.7438,1.3335,11.9545,7.1815,441
-5.6793,-9.62,-0.9791,2.0368,-9.62,5.5346,13.0385,10.3276,442
-0.2496,-9.5552,0.102,0.3123,-9.5552,0.8272,9.8288,6.428,443
-0.5872,-9.5409,-0.2398,0.3135,-9.5409,0.6108,9.8637,4.9733,444
2.0424,-9.7361,2.993,0.882,-9.7361,0.6275,10.0672,6.4683,445
-0.6314,-9.5988,0.5551,1.0339,-9.5988,2.1498,10.0466,5.219,446
0.0541,-9.6005,3.3783,4.321,-9.6005,3.5102,17.7154,12.2825,447
-2.5942,-9.5346,0.7036,2.3293,-9.5346,2.496,12.9685,6.1833,448
-1.3917,-9.8067,-0.0858,0.6875,-9.8067,1.0837,10.1597,5.2494,449
-6.8616,-9.7617,-1.8684,2.6947,-9.7617,5.179,15.4592,7.9612,450
-0.9827,-9.7065,4.0427,3.4565,-9.7065,3.296,18.1108,11.7807,451
-4.3459,-9.7804,-1.3354,2.0592,-9.7804,1.1864,8.1959,7.5421,452
-1.4546,-10.1049,0.3499,1.9179,-10.1049,3.8301,14.5125,10.869,453
-1.4444,-9.7595,0.045,0.7154,-9.7595,0.8668,11.3847,6.8658,454
-22.8572,-9.8045,-0.0233,10.456,-9.8045,3.254,14.6582,13.0224,455
-2.1017,-10.011,7.4397,8.2524,-10.011,12.0065,32.4071,17.7091,456
-0.8871,-9.8116,4.0986,3.8974,-9.8116,8.9641,22.024,16.3821,458
-16.3245,-9.6469,-2.6187,4.3268,-9.6469,7.3366,18.8668,12.0726,459
-6.2578,-9.7693,0.3525,1.9301,-9.7693,1.6811,24.906,8.326,460
-3.5049,-8.9354,1.1515,2.2199,-8.9354,1.0631,11.1787,7.7848,461
-1.3936,-9.854,1.083,1.9977,-9.854,0.5514,10.5219,7.3215,462
-1.1958,-9.7043,-0.4854,0.5075,-9.7043,1.2313,5.8696,4.5449,463
-0.0152,-9.8014,0.8225,0.8765,-9.8014,1.805,10.4086,8.3762,464
-0.5265,-9.6438,0.9222,1.5314,-9.6438,2.6511,12.0654,8.6036,465
-9.0756,-9.6882,4.1969,7.2235,-9.6882,11.6607,27.3703,22.7318,466
-3.5488,-8.9069,-1.5266,1.5648,-8.9069,2.118,22.9599,13.455,467
-2.0468,-9.6546,0.0546,1.0375,-9.6546,1.2463,11.5162,5.4751,468
-5.9488,-9.4179,0.405,2.9165,-9.4179,2.414,11.3424,6.1435,470
-3.6132,-8.928,1.5478,2.6781,-8.928,4.0222,23.0897,12.6917,471
-1.7347,-9.6385,0.5865,1.8889,-9.6385,3.2559,10.2742,5.89,472
-1.0081,-9.9338,10.3886,11.1007,-9.9338,7.6504,20.3567,17.0766,473
-6.7266,-9.399,-1.4705,3.9363,-9.399,1.7759,11.234,9.0001,474
-3.4706,-8.9574,-1.4038,3.2216,-8.9574,1.2812,8.0291,6.3691,475
-3.0971,-9.9982,0.0253,1.9558,-9.9982,1.5535,8.9776,5.6595,476
-1.6452,-9.7213,1.6075,2.0418,-9.7213,1.1449,10.1589,7.1778,477
-2.4397,-9.7526,-0.5217,0.8502,-9.7526,3.2164,11.4235,5.1763,478
-2.1117,-9.9624,-0.7684,0.9635,-9.9624,3.848,18.2453,6.8812,480
-3.0541,-9.7321,0.007,1.7656,-9.7321,1.7221,12.1694,7.4144,481
-4.1806,-9.7562,0.1116,3.5053,-9.7562,1.5523,40.8377,14.6854,482
-6.145,-6.4144,-1.0914,2.5175,-6.4144,2.0062,38.1948,16.5688,483
-17.3191,-9.1937,6.3331,15.356,-9.1937,5.5826,19.6576,13.3165,484
-25.0166,-9.5316,4.6313,26.6436,-9.5316,3.2614,22.8803,20.0376,485
-10.4339,-9.8843,2.0717,11.8442,-9.8843,4.1593,28.2349,19.7661,486
-7.891,-7.5512,-2.8915,2.8079,-7.5512,1.9964,16.628,9.7675,487
-10.1305,-9.8312,-0.8126,2.9566,-9.8312,6.6075,16.2396,11.3848,489
-2.6028,-9.6177,-0.5441,1.0595,-9.6177,2.4268,10.4442,6.4661,490
-6.0809,-9.6979,-0.8175,2.2418,-9.6979,3.4423,9.5096,7.5424,491
-1.408,-9.5222,0.3494,0.9526,-9.5222,2.41,5.0397,4.0485,492
-3.011,-9.5629,0.5434,1.9672,-9.5629,1.572,6.8083,5.9754,493
-0.2175,-9.4781,0.2769,0.7073,-9.4781,1.9226,9.5662,5.7285,494
-5.1218,-9.5578,-2.1003,1.7269,-9.5578,2.0707,11.3821,9.4169,495
-3.3343,-9.6127,-0.376,1.0247,-9.6127,1.603,12.9072,5.3553,496
-1.8158,-10.0779,-0.3211,1.034,-10.0779,1.4809,12.4954,7.7587,497
-5.2736,-9.8104,-1.0994,1.7877,-9.8104,4.1076,10.9524,8.2139,498
-4.5712,-9.9784,-2.07,2.5641,-9.9784,2.1279,11.7244,7.8768,499
-3.5791,-9.7219,-0.2775,1.9672,-9.7219,4.212,14.4733,7.6426,500
-8.4282,-9.7327,2.2111,4.3565,-9.7327,5.5933,12.9651,8.1773,501
-3.7381,-9.5103,-0.3513,1.6899,-9.5103,2.8061,10.4996,6.4706,502
-7.8687,-9.7665,0.2997,4.9112,-9.7665,8.4136,29.9893,23.2494,503
-2.7691,-9.6875,3.6812,5.1295,-9.6875,6.1197,28.5205,18.9654,504
-1.3782,-9.4035,0.1801,1.1517,-9.4035,1.0281,10.9287,8.012,505
-2.4306,-10.0151,0.0908,1.4097,-10.0151,2.2195,13.3409,7.5974,506
-2.4767,-9.5325,1.4166,2.1555,-9.5325,2.7048,11.7518,6.945,507
-4.9801,-9.8354,-0.6623,2.4639,-9.8354,2.9231,15.8771,9.344,508
-2.1523,-9.6982,-0.6493,0.8821,-9.6982,1.9528,10.6312,4.4952,509
-7.5298,-9.7037,-0.0698,3.6706,-9.7037,7.3889,15.5668,11.0327,510
-3.9487,-9.5457,-0.63,1.7714,-9.5457,2.8205,11.128,6.3762,511
-3.8946,-9.7601,-0.8038,1.7,-9.7601,4.4978,10.6213,7.8536,512
-1.764,-9.6158,-0.1889,0.784,-9.6158,1.9113,7.6448,5.6056,513
-0.414,-9.6129,0.5331,0.9474,-9.6129,1.8542,8.4372,5.3244,514
-1.516,-9.4507,-0.1696,0.6826,-9.4507,1.0048,7.7309,4.2886,515
-7.4781,-9.6791,2.6572,4.2331,-9.6791,3.3172,16.8569,12.3792,516
-6.6615,-9.75,3.1437,8.607,-9.75,3.9415,20.0534,15.8459,517
-4.8255,-9.7982,-0.6129,1.9058,-9.7982,3.2375,11.7125,7.2818,518
-0.6794,-10.2944,2.2081,2.5709,-10.2944,2.9109,10.9501,6.4034,519
-4.4136,-9.4913,-0.2374,1.6778,-9.4913,3.9673,34.4732,12.5245,520
-10.3265,-9.6035,3.7115,10.8431,-9.6035,8.2335,34.7608,12.577,521
-21.6447,-9.5523,-6.9389,7.7399,-9.5523,4.1557,17.9557,11.9967,522
-5.5988,-9.9466,-1.1692,2.1997,-9.9466,3.2603,10.22,7.4789,523
-9.1312,-9.3911,-2.8906,3.7114,-9.3911,4.618,15.0748,10.6225,524
-1.2836,-9.852,-0.0313,1.1626,-9.852,1.4193,7.6773,3.5795,525
-5.4846,-9.6606,-1.1146,2.7098,-9.6606,2.3097,11.4172,9.3751,526
-1.7387,-9.3953,0.4224,1.3628,-9.3953,3.8945,18.1546,11.5031,527
-6.3036,-9.6792,-0.7635,2.3108,-9.6792,2.8181,15.9316,8.0367,528
-2.0273,-10.0129,-0.3764,0.9959,-10.0129,1.8696,14.3372,7.4701,529
-4.4355,-9.6919,-2.5059,1.9482,-9.6919,1.4091,10.6713,8.2189,530
-3.7829,-9.4354,-0.4461,1.3231,-9.4354,4.5472,12.8425,7.6329,531
-1.2058,-9.6256,0.3811,1.0431,-9.6256,1.8086,10.326,7.0304,532
-3.5313,-9.4756,-2.2176,1.0795,-9.4756,1.0158,8.6493,6.7171,533
-0.7771,-9.5604,-0.2238,0.3591,-9.5604,0.7775,5.7124,2.8204,534
-0.6501,-10.3433,5.1408,5.4026,-10.3433,7.9906,22.0433,16.1614,535
-4.2691,-9.6374,-0.9543,1.9139,-9.6374,2.8128,12.8626,10.6207,536
-3.7898,-9.5503,-0.4162,2.3885,-9.5503,4.9735,21.2505,8.4717,538
-4.8097,-9.5101,-0.1445,2.1603,-9.5101,3.3628,11.4761,7.5714,539
-3.7803,-9.6917,-1.2911,1.5687,-9.6917,3.6957,13.4432,5.7694,540
-5.6671,-9.9336,1.4357,4.1289,-9.9336,2.5884,16.0658,15.2988,541
-3.7949,-9.7968,-1.004,1.292,-9.7968,2.9098,9.4674,6.8955,542
-3.5573,-9.672,-1.5126,1.1297,-9.672,1.115,6.6175,5.2388,543
-3.1651,-9.9281,-0.4729,1.1139,-9.9281,2.2601,9.6416,6.2291,544
-9.8431,-9.6755,-0.893,3.5745,-9.6755,2.4285,9.5219,6.3752,545
-3.9596,-9.5473,-0.1988,2.0021,-9.5473,3.6096,11.8819,9.8008,546
-6.8948,-9.7955,-0.798,2.3788,-9.7955,3.854,18.1132,7.9278,548
-4.7049,-9.4403,1.1398,3.817,-9.4403,2.7603,13.2269,10.2573,549
-5.4656,-9.9761,-1.6582,2.9885,-9.9761,1.8536,15.8586,13.2034,550
-1.362,-9.5709,-0.2696,0.6089,-9.5709,2.1682,11.9441,6.2841,551
-4.5657,-9.8393,-1.9926,1.9367,-9.8393,3.1246,11.2212,9.7871,552
-4.6817,-9.8661,-0.8737,2.297,-9.8661,1.6063,10.9372,9.2836,553
-2.6709,-9.8331,-1.0732,0.892,-9.8331,2.3662,8.3399,7.1415,554
-6.4122,-9.3614,-0.3331,2.7508,-9.3614,4.7241,18.6659,13.4678,555
-0.7887,-9.2262,-0.059,0.5106,-9.2262,0.5228,8.7488,6.2452,556
-7.8472,-9.5515,-1.1214,2.9809,-9.5515,2.8427,18.8552,8.6962,558
-6.4262,-9.6506,-1.2693,2.1641,-9.6506,3.9535,13.5529,8.1476,559
-2.3456,-9.7998,-0.2758,1.2275,-9.7998,3.0764,11.508,7.2809,561
-4.9864,-9.3884,-2.0109,1.9244,-9.3884,2.8202,16.4546,11.4745,562
-2.6665,-9.6797,0.037,1.3791,-9.6797,1.932,7.7246,4.9755,563
-5.1187,-9.6095,0.5812,2.7836,-9.6095,3.6354,33.9656,6.4009,565
-3.0803,-8.1972,2.7442,4.9638,-8.1972,6.0389,35.6083,20.1156,566
-25.1658,-9.9377,3.2841,12.4497,-9.9377,6.3362,32.0628,18.1671,568
-16.3751,-9.8854,-0.8634,5.3463,-9.8854,7.8195,45.913,19.4402,569
-6.7974,-9.7819,1.0249,3.8372,-9.7819,6.691,36.678,18.8036,570
-11.5987,-9.2633,2.7703,11.0832,-9.2633,6.708,17.8981,12.9581,571
-0.17,-9.5358,6.9461,7.7504,-9.5358,4.9526,19.1199,13.5034,572
-1.8558,-9.8556,-0.3235,0.958,-9.8556,0.9904,11.9561,9.1627,573
-3.0549,-9.968,1.1531,2.8286,-9.968,2.0498,13.3957,10.2177,574
-6.1476,-9.7715,1.0863,3.7882,-9.7715,4.8528,13.7689,10.0775,575
-2.2407,-9.8982,0.0363,1.3886,-9.8982,2.617,10.3617,7.8134,576
-0.3684,-9.7889,0.766,1.0717,-9.7889,3.1456,17.1449,15.2048,578
-1.6705,-9.6772,0.1607,0.7831,-9.6772,1.767,13.4035,8.1121,579
-0.795,-9.6802,-0.0347,0.414,-9.6802,0.6894,8.9596,8.5993,580
-1.1482,-9.695,0.522,1.0632,-9.695,0.3723,8.3014,6.6529,581
-4.5378,-9.7866,1.5616,5.2714,-9.7866,1.6455,35.509,32.1751,582
0.1162,-9.6759,10.1889,8.0616,-9.6759,5.0323,38.0201,35.6786,583
1.2564,-9.5876,5.3808,2.5123,-9.5876,1.8938,12.8268,11.6688,584
-2.4051,-9.6645,-0.0292,1.8534,-9.6645,1.5636,16.9443,5.136,585
-7.4923,-9.8569,1.0692,8.485,-9.8569,1.8777,21.3135,19.7414,586
-2.1028,-9.6726,2.4147,3.3109,-9.6726,4.3144,14.251,7.2295,588
-1.2728,-9.6747,0.2074,0.7659,-9.6747,1.9645,10.4337,6.0244,589
-2.8721,-9.576,0.0014,1.1268,-9.576,1.8821,11.2168,6.9729,590
0.4124,-9.5849,2.021,0.9149,-9.5849,0.3641,9.3318,6.4182,591
0.4009,-9.7164,2.3363,1.6675,-9.7164,1.9206,19.3558,16.6835,592
-2.2673,-9.79,0.4152,3.0151,-9.79,2.5078,12.2692,5.8626,593
-0.4166,-9.7587,0.3572,0.6726,-9.7587,0.3316,10.8859,9.585,594
-4.3776,-9.6099,-0.7105,1.1934,-9.6099,0.6585,15.406,12.7901,595
-20.6192,-9.6686,-8.372,9.056,-9.6686,3.2205,14.9235,9.2257,596
-5.7459,-9.6706,0.1448,3.1483,-9.6706,6.4202,22.1042,9.5799,598
-5.7145,-9.7123,-0.4917,1.3991,-9.7123,2.3765,14.8191,10.5543,599
-2.8474,-9.8225,-0.161,1.3825,-9.8225,1.9673,15.3012,10.1329,600
-6.7949,-9.7731,0.2131,5.7011,-9.7731,0.6568,14.3059,8.4593,601
-1.6327,-9.7309,0.0357,1.5163,-9.7309,2.3213,8.2833,5.5025,602
-0.3415,-9.8579,0.1123,0.3644,-9.8579,1.3447,10.0281,7.1558,603
-2.4136,-9.8943,1.138,1.866,-9.8943,2.6848,12.9531,9.1669,604
-3.4682,-9.6527,2.0171,3.7902,-9.6527,1.9149,13.2006,11.4102,605
0.2729,-9.9247,2.4219,2.2811,-9.9247,1.5044,13.3297,11.1917,606
-0.9998,-9.5483,-0.2403,0.4303,-9.5483,1.1016,10.4046,5.5898,608
-6.6007,-9.6961,2.4443,5.3046,-9.6961,5.5495,22.6715,10.8838,609
-4.1283,-9.7167,0.2854,4.9221,-9.7167,2.5114,15.9028,14.6974,610
-6.6168,-10.1872,0.2292,3.0517,-10.1872,3.5045,11.9774,8.3844,611
-4.7607,-9.5304,17.3752,22.9049,-9.5304,5.8996,49.2023,46.978,612
-13.2452,-9.902,-1.7805,8.114,-9.902,6.4755,38.0093,32.207,613
-7.6373,-9.8614,17.4846,24.7531,-9.8614,6.3845,28.5495,21.9975,614
-10.6839,-9.5172,-2.0297,6.1491,-9.5172,5.9733,33.14,18.0562,615
-4.0508,-10.5725,3.4696,7.6154,-10.5725,4.022,30.8729,14.8609,616
-17.8624,-9.6798,-0.5151,8.5614,-9.6798,10.1706,19.5542,14.8629,617
-20.2292,-9.0518,1.5313,10.3235,-9.0518,5.9596,24.9786,16.6162,618
-1.5213,-9.7227,1.9303,3.3727,-9.7227,6.0116,17.4353,11.5054,619
-9.6767,-9.7598,2.4188,6.1723,-9.7598,10.4844,38.9552,16.6086,620
-8.2157,-9.8815,15.6275,17.32,-9.8815,6.6923,44.7903,25.0813,621
-65.1841,-5.9548,13.5226,42.2918,-5.9548,10.2288,85.0861,25.2705,622
-24.0463,-9.6734,-1.7193,11.8872,-9.6734,4.4212,43.0152,40.6185,623
-1.3262,-9.7468,0.6365,1.6243,-9.7468,1.7182,8.4033,6.674,624
-0.17,-9.7146,1.3256,1.1689,-9.7146,2.0126,15.5467,6.9953,625
-2.5808,-10.0058,4.9085,5.8339,-10.0058,4.1078,36.1708,21.3179,626
-8.4939,-9.8415,0.6869,8.7314,-9.8415,2.3734,39.4193,37.1315,627
-5.2382,-9.4636,0.225,3.4391,-9.4636,3.7645,24.6487,23.3195,628
-3.0482,-9.5578,-0.8877,1.3297,-9.5578,2.5709,26.6614,13.0334,629
-4.1827,-9.4249,-0.5204,2.7884,-9.4249,2.5292,14.1972,9.6245,630
-8.4353,-9.7826,-2.8283,3.1616,-9.7826,3.1142,9.6521,6.6863,631
-5.4862,-9.6218,-1.0027,3.3872,-9.6218,3.6242,12.7596,10.0228,632
-2.093,-9.7888,0.0857,1.3772,-9.7888,2.6691,13.55,8.1475,633
-0.4328,-9.6258,7.9441,5.399,-9.6258,5.2788,20.0794,12.7086,634
-3.1653,-9.6095,2.8244,4.8937,-9.6095,5.5286,21.4627,14.9168,635
-3.5067,-9.9417,8.8174,10.0337,-9.9417,1.1172,25.513,23.5168,636
-6.0266,-9.7222,0.5356,4.5768,-9.7222,3.6039,36.4601,30.0009,637
-4.2519,-9.8975,1.849,3.2857,-9.8975,3.8958,35.324,18.578,638
-14.0297,-9.8142,4.8039,12.1586,-9.8142,5.8138,35.1058,17.8738,639
-8.888,-9.575,-4.742,2.5264,-9.575,3.003,18.1885,11.7119,640
-0.1928,-9.6505,-0.0709,0.1318,-9.6505,0.7452,7.8138,6.5561,641
-1.4441,-9.2129,-0.1576,0.8621,-9.2129,2.3631,9.9704,5.2898,642
-0.8933,-9.4786,-0.2951,0.4016,-9.4786,0.6817,6.0633,4.5455,643
-0.1241,-9.7336,0.0221,0.0813,-9.7336,0.4923,5.8639,3.8455,644
-0.1186,-9.8809,0.3819,0.5804,-9.8809,1.2815,7.0673,4.0244,645
-0.1735,-9.7146,-0.0266,0.0834,-9.7146,0.5443,6.1264,3.1942,646
-1.6729,-9.7071,0.1495,0.6679,-9.7071,2.1187,6.8689,4.6595,648
0.1792,-9.7363,2.656,2.2974,-9.7363,4.6831,10.5072,9.1519,649
-71.6857,-9.4061,-22.4955,24.346,-9.4061,9.1328,31.6229,13.8204,650
-189.509,-8.083,-29.0489,60.8244,-8.083,18.0534,74.4386,39.1748,651
-68.3544,-8.9941,16.6041,70.1605,-8.9941,18.4882,88.855,30.1807,652
-20.5427,-9.3167,1.6328,14.2739,-9.3167,5.9201,28.6314,15.9998,653
-1.2062,-9.6375,5.2181,5.7864,-9.6375,5.3061,13.7551,9.0633,654
-22.3397,-9.6656,0.0129,7.208,-9.6656,2.937,12.6313,8.0316,655
-0.6531,-9.6386,0.7242,1.3147,-9.6386,1.7403,5.4776,3.3189,656
-10.857,-9.608,-1.5377,3.9793,-9.608,2.5555,21.0101,12.1299,657
-0.1413,-9.6704,-0.0188,0.0566,-9.6704,0.3121,2.9557,2.8522,658
-0.0296,-9.6702,-0.0149,0.006,-9.6702,0.032,2.8311,2.7963,659
