AYGX_min,AZ_mean,AYGX_mean,AYGX_std,AZ_mean,GX_std,Gnorm_max,Gnorm_median,timestamp
-0.4905,-9.8523,-0.0797,0.2014,-9.8523,0.8321,3.0488,2.5361,0
-1.9243,-9.842,-0.1236,0.5575,-9.842,0.9023,3.8637,2.449,1
-2.4133,-9.8798,-0.1038,1.0314,-9.8798,1.4299,5.385,2.5349,2
-0.7726,-9.8464,0.3008,1.3554,-9.8464,1.7128,7.8661,2.4288,3
-0.2104,-9.8658,-0.0026,0.0538,-9.8658,0.605,2.8367,2.4588,4
-40.8145,-9.8027,5.2532,18.6843,-9.8027,11.1671,36.9106,2.5053,5
-189.935,-9.8144,-4.6141,56.4731,-9.8144,18.3519,43.7993,24.6719,6
-56.9953,-9.829,-2.7755,19.0252,-9.829,11.5328,26.0066,15.8895,7
-68.8734,-9.6944,-15.302,20.2255,-9.6944,7.4376,21.1254,11.205,8
-5.7978,-9.6565,2.0188,2.9263,-9.6565,1.3765,5.6381,2.5535,9
-0.0276,-9.6708,1.2679,0.6235,-9.6708,0.3064,2.5998,2.4279,10
-2.7236,-9.7068,2.7559,3.2382,-9.7068,1.886,6.1485,3.2119,11
-0.6109,-9.7122,0.1083,0.5634,-9.7122,0.351,2.5042,2.3217,12
-39.5146,-9.7755,-1.3427,20.1046,-9.7755,16.871,39.0505,7.2214,13
0.7627,-9.8559,1.1509,0.3645,-9.8559,0.3573,5.4727,4.6271,14
-101.2485,-9.8797,-38.2782,28.461,-9.8797,23.9686,103.3825,20.4031,15
-495.1855,-9.0876,-56.5003,165.555,-9.0876,28.7873,100.9601,33.4497,16
-6.0284,-9.6525,-1.0755,2.2928,-9.6525,1.0742,6.7231,3.3523,17
-7.6743,-9.8098,4.4517,15.1233,-9.8098,6.2661,29.3998,11.292,18
-46.0949,-9.8095,-4.4571,14.7433,-9.8095,11.4041,27.884,7.6609,19
-13.9746,-10.0309,-3.2006,5.3502,-10.0309,7.9971,34.0548,12.98,20
-25.4038,-9.9286,5.0685,13.1683,-9.9286,9.0911,37.8193,21.7339,21
-8.5469,-9.8712,0.8957,3.2157,-9.8712,3.3919,38.0478,25.1306,22
-2.6176,-9.9466,-0.0016,1.8303,-9.9466,3.6026,8.92,7.6532,23
-8.2614,-9.8959,2.7031,5.9022,-9.8959,2.3065,15.8904,14.1281,24
-8.4185,-9.4309,6.8472,7.1946,-9.4309,8.1429,32.1224,18.7167,25
-26.0563,-9.8304,0.6815,10.7313,-9.8304,8.5497,27.335,18.7646,27
-2.7377,-9.8166,8.2078,12.1652,-9.8166,9.0805,32.3657,14.0874,28
-2.9793,-10.3271,0.0405,1.6985,-10.3271,1.1075,8.4888,4.6141,29
-16.9422,-10.2086,1.0578,10.5273,-10.2086,4.1136,17.8676,12.8014,30
-3.5476,-9.7072,4.796,6.121,-9.7072,3.5607,14.3889,9.8499,31
-2.8225,-10.0958,7.824,6.6299,-10.0958,6.9268,26.5023,21.1758,32
-4.9641,-9.8055,-0.6867,4.1198,-9.8055,0.8202,11.5014,8.111,33
-19.6826,-9.7389,30.6209,34.8984,-9.7389,6.1433,29.0569,26.7423,34
-6.8728,-9.9653,0.8714,5.0716,-9.9653,6.049,21.2017,15.656,35
-6.4298,-9.8254,6.4985,11.5458,-9.8254,8.8716,28.4988,10.2581,37
-4.0806,-9.9557,1.28,2.2947,-9.9557,4.3041,10.641,6.6426,38
-2.0404,-9.8822,0.5718,2.048,-9.8822,2.9664,11.3084,7.5717,39
-0.4001,-9.6684,0.3193,0.883,-9.6684,1.6695,23.2173,6.2147,40
-3.9312,-9.9359,2.257,5.1104,-9.9359,4.5552,13.2585,6.7156,41
-0.0674,-9.4905,1.2904,1.2486,-9.4905,1.8336,10.3035,5.3108,42
-1.4505,-9.6142,-0.0711,0.6731,-9.6142,1.4885,8.1084,5.499,43
-0.5731,-9.6487,-0.1537,0.1881,-9.6487,0.4327,5.6604,3.0168,44
-1.0731,-9.7334,-0.054,0.4984,-9.7334,1.1149,7.5951,3.7542,45
-2.7109,-9.9185,-0.0468,1.1567,-9.9185,2.1002,8.0408,4.5565,47
-3.289,-9.6248,-0.0657,1.0876,-9.6248,2.5465,24.7602,7.6401,48
-1.0173,-9.9454,1.4182,1.5954,-9.9454,1.3485,12.1014,5.6853,49
-0.4186,-9.6642,-0.0643,0.2296,-9.6642,0.9354,3.7879,2.78,50
-1.0005,-9.7349,0.0071,0.5042,-9.7349,0.3986,5.4509,3.6258,51
-0.4383,-9.7935,0.6802,0.6897,-9.7935,0.4383,6.1513,4.075,52
-0.4383,-10.0038,0.3009,0.5507,-10.0038,1.2197,5.9727,4.6034,53
-3.6487,-9.4945,0.3062,2.1313,-9.4945,3.4109,5.5538,4.4629,54
-2.5924,-9.9684,0.6429,2.8915,-9.9684,4.5858,14.9343,10.6587,55
-0.8631,-9.9623,1.7495,2.2735,-9.9623,1.0957,13.0299,8.4858,57
-0.5778,-9.8634,-0.1931,0.3149,-9.8634,0.9751,6.5823,4.3646,58
-2.6903,-9.8533,0.4512,1.6065,-9.8533,1.1055,7.8192,5.1396,59
-2.1167,-9.9432,-0.4176,1.5677,-9.9432,1.6642,10.2988,4.3619,60
-0.029,-9.803,0.7076,1.0511,-9.803,1.1341,6.4494,4.8224,61
-2.8223,-9.7366,1.1085,2.3263,-9.7366,0.6661,15.6621,14.0645,62
-0.8624,-10.7127,0.2101,0.7375,-10.7127,1.7985,19.4479,14.1353,63
-2.5998,-9.9029,0.4125,1.3437,-9.9029,2.6391,21.8685,18.3329,64
-4.7769,-9.8127,3.6982,10.8535,-9.8127,5.9844,19.8445,5.859,65
-0.8127,-10.069,0.5152,1.0604,-10.069,2.3254,10.78,5.8829,67
-2.3539,-9.8646,1.4906,3.229,-9.8646,4.6075,9.8198,6.3839,68
-4.1024,-10.1509,5.0824,9.3888,-10.1509,8.9987,20.7216,17.2303,69
0.5031,-9.825,4.6375,4.7118,-9.825,6.7438,24.5488,18.1566,70
-4.0648,-9.7027,0.0856,1.9705,-9.7027,2.6081,11.3361,8.1965,71
-8.3017,-9.8942,2.5373,7.1452,-9.8942,3.0035,14.6118,13.7291,72
-2.6861,-10.2003,4.1262,6.0494,-10.2003,2.0951,15.9899,13.6869,73
-3.1036,-9.8968,1.1234,2.5331,-9.8968,6.0227,17.4881,7.0428,74
-0.1354,-10.0544,0.186,0.2634,-10.0544,1.7828,4.3551,3.8653,75
-4.151,-9.9149,0.7494,2.4482,-9.9149,6.88,16.2109,11.1958,77
-7.7945,-10.1844,2.1871,5.9542,-10.1844,4.784,29.1188,24.1131,78
-3.058,-9.8847,0.0321,1.9395,-9.8847,2.3091,31.4602,29.539,79
-5.2478,-10.5674,-2.591,1.8732,-10.5674,2.6219,44.957,40.4779,80
-20.1421,-10.2601,-11.2708,5.462,-10.2601,6.7273,43.3564,41.3995,81
-9.5129,-9.8842,-2.551,3.6161,-9.8842,1.7852,23.4272,18.4415,82
-4.9461,-10.1711,4.6836,7.9987,-10.1711,3.4496,28.7865,26.5439,83
-14.542,-10.0143,-0.9022,4.0135,-10.0143,6.0418,53.2472,30.5123,84
-4.2813,-9.5907,3.3541,6.8418,-9.5907,4.0676,27.0606,22.6303,85
-15.5285,-9.8547,3.9192,11.3407,-9.8547,10.4082,36.7992,17.7179,87
-7.0689,-9.7093,-0.9962,3.7536,-9.7093,3.7017,15.6051,8.545,88
-4.8429,-9.9206,6.1818,10.034,-9.9206,5.7835,21.9954,15.2114,89
-4.3229,-9.6449,3.252,5.991,-9.6449,2.6535,15.5825,11.12,90
-3.8418,-10.0296,0.0229,2.7706,-10.0296,1.3627,12.9307,9.3816,91
-0.4947,-9.7144,2.4894,4.3861,-9.7144,4.3553,12.8008,11.3202,92
-1.1867,-10.826,0.5508,0.9746,-10.826,2.1203,17.2146,10.9586,93
-7.0621,-9.3707,2.0045,3.5718,-9.3707,6.1435,13.8823,10.3758,94
-0.2038,-9.9103,1.8321,1.7315,-9.9103,2.4886,8.4503,7.2023,95
-3.4934,-9.9331,1.1615,3.4265,-9.9331,4.2613,23.7796,6.8132,97
-6.8016,-9.7921,5.5259,8.8495,-9.7921,7.513,21.6365,12.7259,98
-6.3439,-9.9229,2.5046,5.8979,-9.9229,6.1561,15.4087,10.4726,99
-4.933,-9.9214,2.9984,5.422,-9.9214,4.3246,15.8214,11.7616,100
-2.445,-10.2494,3.9327,4.7391,-10.2494,7.8714,20.7291,11.3516,101
-3.4477,-9.7485,0.4675,2.2013,-9.7485,1.2631,8.4633,7.964,102
-1.6908,-9.8727,0.7148,1.6438,-9.8727,1.4292,9.3736,7.8873,103
-2.3982,-9.7579,1.1983,1.9698,-9.7579,3.6632,11.4657,8.804,104
-0.3564,-9.6101,-0.0206,0.1922,-9.6101,0.9413,8.5793,3.2189,105
-12.6001,-9.1266,-0.0709,4.1897,-9.1266,5.5266,27.5319,8.2037,107
-2.9246,-10.3647,1.868,3.6236,-10.3647,1.4519,13.3241,10.1101,108
-10.9965,-9.9851,-0.7474,5.8671,-9.9851,3.2035,25.0322,18.6775,109
-18.6176,-9.9025,-0.6751,9.4202,-9.9025,10.2026,22.6727,11.6837,110
-10.1342,-9.1587,5.3478,12.6842,-9.1587,1.1456,30.8025,14.3565,111
-24.7384,-9.1894,-3.0074,12.0934,-9.1894,7.171,27.1196,22.0596,112
0.1773,-9.6189,5.1889,5.1223,-9.6189,2.3783,13.4141,10.0383,113
-9.6197,-9.9471,5.7242,15.2192,-9.9471,5.7746,20.2258,15.4521,114
-5.026,-9.7908,0.7115,3.8859,-9.7908,5.0803,18.4558,15.3269,115
-9.9903,-9.832,3.2254,7.5357,-9.832,6.805,26.8082,10.4745,117
-1.2629,-9.6182,2.7954,4.859,-9.6182,3.4932,12.8698,5.7575,118
-5.8523,-9.7161,1.2726,4.9568,-9.7161,6.8299,21.51,17.6436,119
-2.3921,-9.8417,0.241,1.5112,-9.8417,1.2422,7.8853,5.8176,120
-9.9203,-9.8145,0.6941,4.274,-9.8145,6.3145,12.6161,9.2752,122
-0.3149,-9.8931,0.055,0.269,-9.8931,1.7177,12.1594,11.0642,123
-2.5407,-9.8378,0.7231,1.7718,-9.8378,2.9012,13.1766,5.6038,124
-3.4595,-10.1603,-0.1796,2.552,-10.1603,1.5222,20.6124,18.9147,125
-235.5293,-9.7447,-9.262,48.5886,-9.7447,10.44,50.5538,27.2779,127
-18.4036,-9.8033,2.3037,10.7281,-9.8033,7.9661,29.5722,26.1571,128
-66.7908,-9.9138,-4.6011,22.0349,-9.9138,7.5376,44.7061,24.4291,129
-19.3106,-9.8415,-6.0786,7.1231,-9.8415,3.7211,26.7681,19.9592,130
-78.9835,-9.5415,-45.1768,20.0284,-9.5415,2.1805,26.4135,23.571,131
-86.074,-9.4088,-29.9012,35.558,-9.4088,10.3686,29.5066,24.5052,132
-26.6078,-9.2235,8.984,47.3656,-9.2235,14.0595,40.5578,22.2194,133
19.0999,-9.6391,31.4882,12.8003,-9.6391,4.2461,19.7497,16.8677,134
-37.4132,-9.7899,-3.5848,11.1646,-9.7899,5.32,19.6747,15.5351,135
-4.245,-9.8275,0.5793,3.3427,-9.8275,4.2744,25.2992,7.155,136
-51.9361,-9.8381,1.1357,20.1234,-9.8381,12.8099,43.6615,26.1623,137
-14.4938,-9.7001,3.6595,8.4284,-9.7001,7.7971,44.5949,28.6489,138
-27.9779,-9.9219,-0.2603,11.9776,-9.9219,6.2918,41.6923,12.6249,139
-21.3532,-9.7197,-0.0736,9.4657,-9.7197,5.1211,20.3653,11.7692,140
-6.911,-9.7765,4.9746,10.7926,-9.7765,4.8326,36.74,28.9713,141
-6.3723,-9.8764,2.7699,4.6779,-9.8764,4.1145,13.4753,5.8295,142
-6.3194,-9.9959,0.2229,5.1509,-9.9959,2.2767,11.7139,8.944,143
-16.6956,-10.0447,-0.7333,8.3493,-10.0447,4.1134,31.0011,22.5618,144
-25.3521,-9.7855,-2.3205,9.8932,-9.7855,2.6079,17.1448,8.4622,145
-22.1763,-9.7195,-3.6283,9.701,-9.7195,7.4962,26.4499,8.9307,146
-34.6441,-9.743,-9.2376,16.3099,-9.743,13.3025,26.8029,16.5264,147
-104.9982,-9.5953,-8.5862,40.9055,-9.5953,27.7853,52.2287,32.5829,148
-28.4221,-9.7029,-6.4096,19.6282,-9.7029,9.9872,23.808,13.605,149
-125.5648,-10.2701,-29.1975,52.3725,-10.2701,14.231,57.1503,18.0632,150
-15.8951,-9.8413,-3.3681,8.6552,-9.8413,7.3467,21.4966,15.584,151
-160.1493,-9.2558,-33.6188,55.11,-9.2558,11.8156,47.5676,24.1264,152
-11.1184,-9.5043,9.7753,15.1512,-9.5043,7.5868,24.1885,18.5169,153
-3.8789,-9.5992,5.823,12.4932,-9.5992,8.2967,29.2867,20.6186,154
-10.0664,-9.6677,7.7889,15.324,-9.6677,7.9046,37.8145,23.4031,155
-4.9923,-9.4319,5.1594,7.6235,-9.4319,2.9205,18.4858,12.8422,156
-3.5816,-9.8732,-0.5854,2.5699,-9.8732,2.1261,12.8025,9.0985,157
-22.6617,-9.4362,0.9748,12.6002,-9.4362,8.477,34.5892,13.7305,158
-5.3839,-9.2321,14.4653,13.9077,-9.2321,1.5857,27.2244,18.1329,159
-38.7842,-10.0413,6.5464,24.3953,-10.0413,12.5134,77.9985,25.1004,161
-4.1,-9.9149,-0.4907,1.7552,-9.9149,2.0363,35.1983,29.4076,162
-23.2765,-9.925,-1.2406,12.6262,-9.925,3.6161,45.4799,41.4432,163
-20.5893,-9.7681,-2.9915,7.4182,-9.7681,5.2,22.7719,12.2698,164
-12.8936,-9.8999,1.5715,5.2738,-9.8999,3.8663,24.7872,21.037,165
-20.621,-9.8612,-2.3235,6.4119,-9.8612,3.9673,51.2115,39.4258,166
-5.4287,-9.8803,2.3937,4.2023,-9.8803,2.6401,26.4323,20.0257,167
-15.2273,-9.9292,3.7692,10.2243,-9.9292,6.3067,38.233,23.6326,168
-5.0935,-9.7109,-0.5421,1.9353,-9.7109,1.3905,8.7826,4.6328,169
-2.3359,-10.2317,2.5785,3.934,-10.2317,3.956,44.9302,35.2338,170
-5.2041,-10.3329,-1.7151,2.418,-10.3329,6.6537,44.0872,31.0853,171
-12.6702,-9.9113,7.4738,14.1885,-9.9113,4.7661,57.9215,42.0796,172
-15.6618,-9.7424,1.2889,12.3361,-9.7424,4.9053,48.8711,39.9034,173
-5.2051,-9.5581,7.0297,7.4219,-9.5581,2.2761,36.533,24.783,174
-0.1051,-9.8136,6.8838,5.5421,-9.8136,7.8111,40.0089,11.946,175
-16.9188,-9.7094,0.7864,7.0791,-9.7094,5.51,21.2991,15.2155,176
-14.8117,-9.6427,2.9668,11.6588,-9.6427,6.3688,30.8016,15.5586,177
-3.5565,-9.8898,0.606,1.8914,-9.8898,4.9685,24.2302,7.3414,178
-5.2248,-9.8484,1.7005,5.5209,-9.8484,7.558,18.2055,10.7638,179
-5.1666,-9.8589,2.9753,6.6196,-9.8589,6.4206,15.0556,7.7559,180
-3.2941,-9.8874,2.6466,3.7333,-9.8874,4.9199,12.6733,8.6488,181
-0.5041,-9.898,1.6094,2.4305,-9.898,2.477,10.0742,6.4604,182
-0.8997,-10.2397,2.2905,3.3818,-10.2397,3.8191,11.9005,8.7735,183
-25.544,-9.5314,-4.7014,11.3421,-9.5314,8.0617,24.4052,12.0863,184
-11.5744,-9.7585,14.7713,26.1266,-9.7585,16.9978,36.5195,23.4096,185
-1.7182,-9.9298,6.6142,9.9372,-9.9298,9.5427,25.124,8.6757,187
-16.0024,-9.9215,-0.3798,5.1623,-9.9215,3.7706,23.7181,8.7062,188
-5.5047,-9.8664,-1.0178,2.2724,-9.8664,3.0383,13.6867,5.5594,189
-13.3981,-9.8162,2.736,12.8916,-9.8162,1.1334,17.4146,14.4942,190
-8.8161,-9.7834,1.6015,7.136,-9.7834,4.8773,20.1547,15.066,191
-0.0799,-9.7054,4.9864,6.7883,-9.7054,5.1094,12.1662,11.3939,192
-7.449,-9.7403,1.2699,4.8458,-9.7403,5.2369,12.9915,9.6303,193
-6.0552,-9.9791,-0.5827,2.6491,-9.9791,3.396,8.0391,5.0372,194
-5.6367,-9.7903,3.7393,6.9922,-9.7903,6.7295,15.1006,8.4737,195
-9.1986,-10.3265,7.8233,9.6152,-10.3265,8.1955,23.4508,15.7718,196
-4.9928,-10.1127,5.4194,9.6499,-10.1127,2.7345,12.931,9.102,198
-2.4233,-10.5315,5.4836,7.0062,-10.5315,5.0043,21.3426,13.599,199
-5.6713,-9.8044,3.8305,7.1674,-9.8044,0.9002,13.7091,10.5521,200
-8.2639,-9.6222,-0.4046,4.8364,-9.6222,3.7272,15.1944,6.7141,201
-5.1406,-9.7946,0.2014,2.8414,-9.7946,2.3947,9.6263,6.8027,202
-1.3771,-9.7731,2.9036,4.1755,-9.7731,3.3582,10.2939,7.5203,203
-5.0096,-9.7278,5.9979,9.0861,-9.7278,10.2723,20.2453,18.3313,204
-33.8939,-10.1247,2.3828,14.8436,-10.1247,7.9446,36.9253,9.6109,205
-5.9645,-9.9189,1.5322,3.0656,-9.9189,4.5115,17.0315,7.3176,207
-5.4098,-9.8786,1.369,3.9276,-9.8786,5.0531,13.259,8.3772,208
-4.6786,-10.2481,1.3983,6.1621,-10.2481,1.6003,14.6463,10.3169,209
-3.4891,-9.7177,0.0507,2.1295,-9.7177,2.7879,8.9392,6.1362,210
-0.932,-9.9868,2.1518,2.9595,-9.9868,2.8491,12.6574,6.1902,211
-1.6722,-9.8687,0.0986,1.0025,-9.8687,1.12,9.055,7.35,212
-0.4077,-9.7027,0.3764,0.5253,-9.7027,0.8139,6.8307,4.3907,213
-2.0094,-10.059,0.5374,1.5358,-10.059,0.4946,9.3436,7.2782,214
-1.492,-9.9534,2.5306,3.681,-9.9534,3.9199,19.4237,12.9538,215
-20.597,-10.0403,2.8895,9.6919,-10.0403,10.6029,50.873,20.5279,217
-16.8866,-9.7406,12.0819,21.9665,-9.7406,11.15,50.1681,25.516,218
-0.0751,-10.0753,13.1776,9.8327,-10.0753,11.4499,40.3905,23.5387,219
-0.3418,-10.0111,3.5432,6.0819,-10.0111,7.4452,21.2484,19.8471,220
-1.146,-9.9581,3.8586,5.0564,-9.9581,2.6394,14.1332,11.4373,221
-1.0473,-10.0391,0.6794,1.4791,-10.0391,1.46,9.9575,8.2366,222
-1.0758,-8.9979,5.34,6.6211,-8.9979,4.6938,16.918,14.0116,223
-2.0208,-9.8321,0.3575,1.9387,-9.8321,1.183,9.5538,6.3534,224
-7.9466,-9.864,2.3997,6.6486,-9.864,6.8244,20.2969,12.0142,225
-4.5922,-9.8775,0.2701,1.8189,-9.8775,3.0609,13.9829,6.6777,227
-2.768,-9.935,1.5546,2.0725,-9.935,5.2464,13.6424,8.5826,228
-0.7145,-10.1305,2.6252,3.3144,-10.1305,3.6575,17.808,13.7587,229
-2.3972,-9.3004,-0.3728,1.2931,-9.3004,1.5914,11.9969,7.7097,230
-1.676,-9.7255,0.2322,1.1107,-9.7255,2.004,14.9028,9.5228,231
-0.188,-9.7825,0.3212,0.7287,-9.7825,1.8956,8.3237,7.0581,232
-2.7887,-10.1148,3.7175,9.9494,-10.1148,6.1098,24.1997,19.2556,233
-18.5566,-9.6989,8.9793,22.6468,-9.6989,10.6612,38.3134,22.8497,234
-2.9492,-9.9997,8.5831,10.1948,-9.9997,9.2033,28.8015,17.1383,235
-11.5843,-9.7657,5.9203,13.2871,-9.7657,12.079,44.3002,15.9302,237
-11.3403,-10.0384,-1.2899,5.6423,-10.0384,8.0387,35.2577,13.8776,238
-3.7296,-10.4789,2.0653,5.3684,-10.4789,8.6885,38.8452,35.3519,239
-2.5208,-9.6895,2.2455,4.8531,-9.6895,5.9373,35.4271,16.3179,240
-3.412,-9.8615,1.7504,4.1689,-9.8615,3.8989,15.971,9.3257,241
-0.2756,-9.7193,1.0357,0.9504,-9.7193,3.0502,19.7749,14.9152,242
-2.8808,-10.1087,0.8383,2.7407,-10.1087,2.3884,25.4295,24.7876,243
-8.1778,-9.7747,1.9281,3.2625,-9.7747,2.4258,19.4042,13.7107,244
-7.0464,-10.255,0.0382,1.9168,-10.255,2.5642,23.3639,17.4577,245
-20.2382,-9.9052,4.8831,18.4596,-9.9052,12.2608,38.929,18.7108,247
-4.7341,-9.915,0.495,2.1458,-9.915,3.9281,13.1286,6.9245,248
-2.947,-9.9253,6.117,8.0332,-9.9253,1.5341,22.2723,18.0891,249
-20.6299,-10.1858,5.6373,21.915,-10.1858,3.4949,63.1344,51.1159,250
-7.4465,-10.4104,12.3206,16.8995,-10.4104,15.7798,100.2742,88.56,251
-4.5458,-10.1148,-1.192,1.9707,-10.1148,3.5454,26.2174,17.3129,252
-1.1518,-9.7598,2.9063,2.1452,-9.7598,1.1067,12.1815,10.9878,253
-13.3002,-9.5841,1.9391,7.5864,-9.5841,7.4167,21.7838,11.2475,254
-7.7382,-10.6347,-0.7404,5.1332,-10.6347,4.4046,43.8689,26.2908,255
-20.3482,-8.7385,4.8595,15.516,-8.7385,7.7948,83.8531,38.3162,257
-35.873,-9.8895,5.0745,21.2976,-9.8895,12.3401,55.4492,26.0435,258
-13.4688,-9.7651,7.1205,17.8785,-9.7651,3.2307,36.2062,25.3413,259
-23.8083,-9.6716,-6.1633,11.7727,-9.6716,3.6056,27.6172,21.1229,260
-11.759,-9.1989,4.0657,11.8355,-9.1989,9.6423,20.5937,17.5061,261
-1.5233,-9.9789,12.1226,9.9788,-9.9789,9.8646,23.3219,17.9638,262
-1.9529,-9.9895,1.8504,3.275,-9.9895,3.6336,8.6752,5.5284,263
-14.7999,-9.8526,-2.5258,5.1237,-9.8526,6.9158,13.9204,8.2688,264
-5.5403,-9.9386,-2.0493,2.5276,-9.9386,4.0032,17.304,7.8852,265
-16.769,-9.7538,2.4753,10.3921,-9.7538,11.5295,34.5057,14.8647,267
-3.4418,-9.7643,3.0436,5.8007,-9.7643,3.9826,17.6141,10.6991,268
-13.2803,-9.8356,-0.878,2.7902,-9.8356,3.6033,26.6035,9.9322,269
-18.6115,-10.0978,-1.6617,8.3623,-10.0978,8.8499,29.0803,13.5671,270
-3.9277,-9.405,7.1483,9.9383,-9.405,7.3255,20.8525,16.7235,271
-1.4772,-8.9158,0.5008,1.8173,-8.9158,1.7896,11.19,6.5879,272
-4.0316,-10.6805,1.0609,3.1802,-10.6805,2.0283,10.9024,7.858,273
-8.3318,-9.8648,-0.8908,2.765,-9.8648,4.4153,14.9301,4.7768,274
-5.7053,-9.7765,-0.7713,3.5871,-9.7765,4.9783,15.362,10.2127,275
-15.1589,-9.8432,3.5211,11.7093,-9.8432,9.8444,27.0396,11.4839,277
-45.7368,-9.1497,-1.5472,14.7085,-9.1497,4.8856,59.8587,11.5326,278
-79.1652,-9.1101,-5.1467,29.1659,-9.1101,9.6965,43.0276,19.7706,279
-0.5947,-9.6725,1.9887,2.3138,-9.6725,5.3307,15.4404,12.421,280
-1.6992,-9.6907,0.301,1.0815,-9.6907,0.7386,6.9185,5.4897,281
-0.8384,-10.0631,0.0842,0.8442,-10.0631,1.2883,6.7974,3.8168,282
-1.1259,-9.8203,-0.1231,0.5208,-9.8203,1.8307,7.7521,2.887,283
-0.7676,-9.8764,-0.0579,0.2783,-9.8764,1.0647,5.6761,2.7529,284
-1.2207,-9.7437,2.2903,3.2631,-9.7437,1.494,12.8192,6.773,285
-1.4932,-9.9247,-0.0185,0.4116,-9.9247,1.6969,8.3454,3.7462,287
-0.6398,-9.7322,0.241,0.5453,-9.7322,1.0914,5.817,3.4609,288
-1.2131,-9.9275,-0.0992,0.7048,-9.9275,0.7774,9.3213,5.8011,289
-0.9468,-9.7359,0.0395,0.8442,-9.7359,1.0988,11.634,7.3274,290
-3.9122,-10.7388,2.2963,5.1911,-10.7388,3.8086,31.7523,21.1365,291
-6.9027,-9.9703,0.7525,4.7806,-9.9703,4.279,23.3605,13.356,292
-2.0299,-9.9136,-0.7298,1.0612,-9.9136,1.1682,10.2981,7.0665,293
-17.2265,-9.8647,-3.3603,6.2252,-9.8647,4.6766,13.2215,6.6202,294
-7.1186,-9.8323,-2.6584,1.8764,-9.8323,1.3783,5.4292,4.2626,295
-2.6609,-9.845,0.7128,2.5278,-9.845,3.0769,6.9738,3.1389,297
-0.5186,-9.855,0.1251,0.4458,-9.855,0.8373,2.737,2.4019,298
-0.9579,-9.8604,-0.5832,0.3022,-9.8604,0.5248,3.0313,2.8402,299
0.0865,-9.8505,0.155,0.0521,-9.8505,0.089,2.3238,2.28,300
0.2937,-9.8527,0.4257,0.0711,-9.8527,0.1387,2.4042,2.3682,301
-0.3425,-9.8499,-0.247,0.0961,-9.8499,0.1589,2.4187,2.3985,302
-29.0987,-9.7013,2.875,21.4599,-9.7013,11.0004,28.0767,8.829,303
-17.3199,-9.9932,2.8199,15.5513,-9.9932,7.417,34.1198,23.7348,304
-17.9914,-9.4672,29.334,26.8053,-9.4672,6.7873,42.7976,32.1572,305
-15.8994,-9.8102,-0.3702,8.2089,-9.8102,13.165,40.3574,20.0269,307
-6.3227,-9.9048,22.0674,35.5285,-9.9048,10.8635,47.3302,28.2403,308
-57.8055,-9.6635,8.6814,41.4365,-9.6635,8.5122,38.0646,17.0306,309
-21.4427,-9.3801,-7.7787,12.4498,-9.3801,4.1393,22.5435,13.517,310
-12.0038,-9.946,0.3803,11.4645,-9.946,7.1254,26.0326,21.9131,311
-16.8382,-9.9824,2.883,19.8096,-9.9824,5.4805,21.7073,15.6483,312
-4.4341,-10.0024,1.8541,4.489,-10.0024,4.0369,18.9009,11.8101,313
-19.1606,-9.8837,22.5437,38.8917,-9.8837,13.1283,41.8479,18.9857,314
-3.3624,-10.0865,3.3467,4.8376,-10.0865,3.6453,15.2291,12.3153,315
-18.8694,-9.7424,9.1975,17.0774,-9.7424,10.2235,46.3116,15.1461,317
-11.1871,-9.4708,-0.3111,9.5612,-9.4708,6.359,17.3849,9.8986,318
-11.4619,-10.9694,9.1165,17.0769,-10.9694,11.3437,20.8493,15.9328,319
-10.5975,-10.6233,0.7289,6.763,-10.6233,12.2626,20.8595,18.6956,320
-12.5372,-10.0369,4.5154,9.7898,-10.0369,2.6675,15.4522,12.3119,321
-5.6822,-9.6476,0.2599,3.5647,-9.6476,4.0074,8.6148,5.0129,322
-10.1248,-9.5795,2.6888,10.0412,-9.5795,2.3291,14.8448,12.2723,323
-22.1084,-8.7006,1.8209,10.9923,-8.7006,14.1588,32.0477,22.2812,324
-17.0874,-9.5696,-4.2008,5.9659,-9.5696,5.6076,11.5955,6.7751,325
-86.2497,-9.8375,4.1442,21.8589,-9.8375,11.0024,38.3946,16.4852,327
-7.2748,-9.8731,1.6262,6.858,-9.8731,1.2183,12.1773,9.4524,329
-5.249,-9.5651,-0.878,2.5344,-9.5651,1.3452,9.2431,3.8501,330
-6.8608,-9.6361,0.2815,4.8108,-9.6361,0.852,9.3285,8.2897,331
-10.8504,-9.6466,2.0988,10.9639,-9.6466,4.3879,14.6461,8.225,332
-4.2819,-9.8866,0.6908,2.6953,-9.8866,2.3891,12.7296,9.1759,333
-3.9809,-9.9437,2.2443,3.3651,-9.9437,5.2055,15.461,11.4254,334
-9.6543,-9.8727,-1.8281,3.1559,-9.8727,1.1468,9.3739,6.2237,335
-2.5711,-9.6055,4.0648,4.7488,-9.6055,3.7594,13.8103,9.2763,336
-25.0777,-9.883,0.9224,7.3384,-9.883,6.92,28.7036,11.634,337
-9.5969,-9.9015,1.6237,6.6879,-9.9015,3.6496,15.4667,7.5927,338
-1.7623,-9.9915,2.1823,3.4527,-9.9915,5.528,15.9594,9.796,339
-17.5192,-9.9353,2.1923,9.8188,-9.9353,9.4042,24.0431,11.7908,340
-0.0755,-9.9613,5.7063,5.4189,-9.9613,8.362,20.9091,16.0021,341
-3.1758,-10.2069,1.8374,4.914,-10.2069,2.3256,10.1577,7.2763,342
0.0819,-9.5344,3.1343,2.2773,-9.5344,1.4182,8.7452,7.0224,343
0.0895,-9.9938,2.2946,2.518,-9.9938,3.5777,15.0056,9.0733,344
-9.4817,-9.6925,3.8346,9.3375,-9.6925,6.2359,21.2746,11.1021,345
-14.6937,-9.6193,0.518,9.0533,-9.6193,5.0914,21.4789,18.2538,346
0.07,-9.764,1.69,1.7477,-9.764,2.4388,8.7035,7.9389,347
0.1376,-9.7855,11.009,8.8462,-9.7855,3.035,15.4528,13.0459,348
-1.7136,-10.0544,-0.2624,1.0957,-10.0544,4.6713,7.6655,7.0735,349
-3.4325,-10.4269,3.8151,5.1758,-10.4269,3.5962,18.9237,14.2562,350
-0.9848,-9.8038,2.3264,3.4213,-9.8038,3.9278,10.0335,6.9355,351
-4.0418,-9.9284,-0.5146,2.5786,-9.9284,0.6137,8.5223,6.6825,352
1.8748,-9.8024,6.1092,4.836,-9.8024,2.5564,14.1197,12.1571,353
-2.0694,-8.4173,-0.2183,2.0053,-8.4173,2.9712,15.1487,11.2424,354
-10.5859,-9.85,0.6589,5.8623,-9.85,2.7906,12.3185,6.3524,355
-4.305,-10.191,-0.7596,1.7033,-10.191,6.2351,14.0047,10.3854,356
-9.6671,-9.909,2.3358,8.9721,-9.909,6.7734,18.9821,6.028,406
-7.991,-9.9589,1.6634,6.4463,-9.9589,4.0659,12.9321,6.7459,407
-8.4532,-9.864,2.0906,5.7838,-9.864,5.0798,14.2924,7.6443,408
-0.5439,-9.5728,1.7518,3.3535,-9.5728,3.725,9.999,6.7884,409
-1.8652,-9.7991,2.2258,4.6617,-9.7991,1.8318,10.2751,6.9868,410
-3.8398,-10.4757,-0.4567,2.049,-10.4757,3.8356,9.1172,7.1183,411
-4.1705,-9.7914,-0.286,2.9483,-9.7914,2.8128,8.4415,5.2866,412
-4.4193,-9.897,-1.7389,1.5982,-9.897,5.0576,12.3776,7.9403,413
-9.2187,-9.4323,-1.8009,4.9313,-9.4323,3.6631,15.611,11.1938,414
-6.8799,-9.8019,-0.9827,4.1846,-9.8019,3.1959,11.3987,6.9795,415
-7.7855,-9.7112,1.0978,6.6563,-9.7112,4.3794,29.963,11.7142,417
-18.3895,-9.397,-0.8532,5.5028,-9.397,5.5881,21.0696,9.1598,418
-3.3751,-10.5395,3.1213,4.5261,-10.5395,6.9641,15.2667,10.6288,419
-1.0371,-9.848,10.2235,10.7864,-9.848,12.2456,30.9387,20.5851,420
-30.1394,-9.6515,-15.3974,13.5091,-9.6515,4.6556,20.6849,12.1487,421
-5.8942,-10.0922,1.9615,7.247,-10.0922,4.3744,13.2959,9.0191,422
-8.443,-9.3896,-2.0565,3.2854,-9.3896,2.9713,16.5034,8.81,423
-13.2876,-9.6707,-3.257,5.4492,-9.6707,2.5749,12.2852,8.6352,424
-3.0955,-9.6455,1.0762,2.6426,-9.6455,4.3696,20.1409,9.4907,425
-7.2903,-9.8743,0.3031,2.9608,-9.8743,4.8584,15.6307,9.3299,427
-2.0725,-9.8821,0.3252,1.1781,-9.8821,3.4286,8.9591,4.7045,428
-2.3941,-9.9118,1.8756,2.9671,-9.9118,3.2125,8.2933,7.4892,429
-14.5269,-8.3448,0.4077,8.3194,-8.3448,5.5007,21.7465,18.0413,430
-10.9571,-8.1472,0.1343,4.9826,-8.1472,6.1439,21.7758,13.3901,431
-1.8601,-9.9191,3.0277,3.8448,-9.9191,0.8951,9.112,7.678,432
-4.1309,-10.1148,0.5751,2.713,-10.1148,2.8155,13.1043,8.4367,433
-1.2918,-9.8758,-0.0361,0.5265,-9.8758,2.6894,9.0136,6.2755,434
-2.398,-9.8225,-0.5705,1.0903,-9.8225,0.653,4.8652,3.4662,435
0.0462,-9.8141,0.5368,0.4481,-9.8141,0.6621,6.535,4.4429,437
-0.5552,-9.858,-0.0333,0.2467,-9.858,0.7614,7.0241,4.8378,438
-1.3554,-9.829,0.1696,1.157,-9.829,2.6151,9.9157,7.8113,439
-0.0999,-9.9778,0.4068,0.5566,-9.9778,2.2005,14.1395,12.8888,440
-0.06,-9.9002,0.4111,0.9245,-9.9002,0.7181,4.2629,3.3704,441
0.223,-9.8984,3.5159,3.567,-9.8984,2.3349,9.8342,8.2979,442
-10.7017,-9.8553,-2.1872,4.0519,-9.8553,5.485,16.6918,9.0587,443
-7.0055,-9.9127,1.2841,7.9624,-9.9127,4.0888,19.5812,13.841,444
-6.0048,-9.8997,0.2669,4.4302,-9.8997,4.3062,16.7042,15.1001,445
-8.8172,-9.9235,5.6706,6.3039,-9.9235,8.2543,25.5689,16.3165,447
-8.1901,-9.8912,1.8225,5.8711,-9.8912,6.3825,17.9945,12.6013,448
-1.768,-9.9192,1.4117,2.2696,-9.9192,0.6576,9.0982,7.1647,449
-2.0472,-10.0397,4.4907,5.4517,-10.0397,5.0324,30.3277,18.5,450
-0.1028,-9.793,1.8459,1.3892,-9.793,0.7162,12.4392,4.5436,451
4.1399,-10.1614,5.6519,1.7718,-10.1614,0.5647,22.2168,10.1074,452
-7.2494,-9.8985,-0.9919,2.8113,-9.8985,2.4094,10.6644,7.3506,453
-5.4878,-9.9261,-0.1748,2.5778,-9.9261,4.6203,17.347,13.4169,454
-5.8713,-9.857,2.7019,4.9292,-9.857,3.7988,8.6269,6.3901,455
-2.8006,-9.8134,1.7864,3.1298,-9.8134,3.4689,15.1828,7.8185,457
-1.2943,-9.8923,0.2741,0.999,-9.8923,2.0103,7.0921,4.413,458
-0.7384,-9.9388,-0.0735,0.3391,-9.9388,1.3243,5.057,3.4409,459
-2.1134,-9.9113,-0.3794,0.9428,-9.9113,3.3794,9.0399,6.4316,460
-0.6037,-9.8156,-0.1699,0.3557,-9.8156,1.3486,6.6455,5.5773,461
-4.6452,-9.8621,1.0533,3.3211,-9.8621,1.9584,9.5029,6.0625,462
-5.2563,-10.0391,-0.8681,2.8311,-10.0391,1.9457,18.3763,10.769,463
-15.0355,-9.9356,2.348,7.8356,-9.9356,2.474,24.4152,20.3586,464
-58.2474,-9.827,-6.8653,18.9496,-9.827,11.3049,31.6591,14.5792,465
-67.6989,-10.099,1.1652,23.9271,-10.099,15.9162,47.0754,19.9529,467
-106.7162,-9.9179,-0.1121,30.3236,-9.9179,10.9658,51.1879,20.2256,468
-6.3386,-9.4602,39.2439,31.8552,-9.4602,10.0639,56.6426,32.9567,469
-22.0631,-9.6324,-0.1861,19.8743,-9.6324,4.7293,25.391,18.1789,470
-13.7374,-9.5107,3.0769,11.7407,-9.5107,3.8082,17.7333,11.361,471
-49.983,-8.4169,0.4345,24.4302,-8.4169,5.8831,23.2018,17.6197,472
-51.5024,-9.4542,5.893,54.7198,-9.4542,10.3151,33.7871,26.0238,473
-34.8313,-9.9108,2.0226,25.7011,-9.9108,14.9531,37.6494,21.2809,474
-7.2606,-9.9375,-0.091,4.9757,-9.9375,4.5497,17.9229,13.8914,475
-7.3528,-9.9394,2.2964,6.5033,-9.9394,5.5715,19.7982,8.5077,477
-9.1445,-9.8298,-1.0724,3.9102,-9.8298,6.0211,19.412,8.8051,478
-16.7116,-8.863,0.8504,10.6787,-8.863,9.7866,54.3727,28.0779,479
-1.7655,-9.4614,1.9864,2.5772,-9.4614,5.9475,18.9998,13.1565,480
-9.0655,-9.7907,-3.3403,3.5989,-9.7907,5.1582,18.5687,13.2308,481
-25.7384,-9.2248,-6.0925,15.5475,-9.2248,1.4102,19.5444,12.6251,482
-14.5667,-10.35,-2.8542,5.3881,-10.35,4.5301,23.7938,7.4064,483
-12.3688,-9.5427,5.5537,14.4723,-9.5427,10.7717,40.1483,17.7668,484
-4.592,-10.2226,-0.0012,4.5508,-10.2226,3.3056,12.7484,9.9982,485
-24.2534,-9.4643,-4.7433,10.3914,-9.4643,7.5516,30.5882,16.9544,487
-8.3311,-10.3395,-1.4003,3.3086,-10.3395,3.0684,17.9345,12.5298,488
-7.2726,-10.1311,7.1875,11.0392,-10.1311,6.2352,28.6186,20.5964,489
-34.8505,-10.1672,-10.5744,18.2049,-10.1672,9.0764,33.7244,24.4821,490
-27.7061,-9.9586,-3.2998,21.0105,-9.9586,1.4155,21.1075,14.8236,491
-6.7947,-10.0799,0.9854,4.8311,-10.0799,5.3457,17.2245,13.4317,492
-20.7181,-10.8396,-2.5904,8.754,-10.8396,5.8943,20.7607,13.1862,493
-9.74,-9.2549,1.8292,6.8179,-9.2549,3.0074,25.1122,13.3424,494
-1.3684,-9.4551,15.8752,20.6543,-9.4551,8.4941,28.4988,20.0397,495
-15.7787,-8.8524,4.3434,10.8264,-8.8524,8.794,43.3869,12.3602,497
-33.1107,-9.9273,2.4735,15.2334,-9.9273,9.8437,37.0992,15.09,498
-0.8354,-9.6896,1.3812,2.0632,-9.6896,1.5521,12.9123,8.5589,499
-2.3646,-9.5388,0.653,1.8591,-9.5388,2.5822,13.0914,7.0936,500
-7.0823,-8.6889,4.4177,8.8032,-8.6889,6.1873,24.2849,18.778,501
-27.3155,-7.7279,-3.6836,9.8418,-7.7279,3.6361,43.4193,13.3569,502
-2.0972,-9.9655,27.0198,23.366,-9.9655,14.3831,33.9578,27.8876,503
-15.6376,-9.9697,0.7849,8.6039,-9.9697,8.7527,21.9108,12.6113,504
-9.2328,-5.939,7.4462,15.3238,-5.939,6.8392,50.1813,26.1702,505
-26.9709,-9.6654,14.3941,33.3255,-9.6654,16.1972,55.7315,17.8681,507
-8.6477,-9.8766,-0.3266,4.1598,-9.8766,5.4277,23.886,12.7032,508
-3.6236,-10.1582,0.7271,3.5496,-10.1582,2.1397,24.1591,15.1444,509
-16.2706,-9.9586,4.6978,16.6893,-9.9586,8.0655,49.8496,18.2952,605
-0.3749,-9.6767,4.4556,7.0775,-9.6767,5.8057,15.8349,11.1426,607
-1.776,-9.8419,1.859,2.8871,-9.8419,2.0544,10.2985,8.3618,608
-0.9813,-9.866,0.2642,1.1616,-9.866,3.173,16.2141,12.2511,609
-1.0195,-9.8117,-0.2779,0.3842,-9.8117,1.4057,4.2644,2.802,610
-0.0427,-10.0903,3.704,4.4119,-10.0903,5.0225,31.2867,28.2315,611
-34.7879,-9.6089,52.1822,74.8109,-9.6089,9.0903,53.1027,45.7364,612
-40.6635,-11.1806,-18.1121,14.549,-11.1806,7.0363,47.9974,46.3927,613
-32.5841,-9.9978,-6.8568,11.9789,-9.9978,7.4062,25.4624,14.306,614
-21.8889,-9.6714,-1.5855,16.6432,-9.6714,5.9636,19.8522,13.1866,615
-29.1511,-9.8534,0.1187,12.5594,-9.8534,11.5118,32.1292,18.6869,617
-14.2061,-9.9622,-1.3309,5.5254,-9.9622,7.4027,29.1894,12.5283,618
-35.6293,-9.8427,6.2805,21.4744,-9.8427,18.7793,39.4243,26.3428,619
-9.9074,-10.0443,4.8095,8.3865,-10.0443,19.7659,31.9807,26.402,620
-6.4927,-9.8483,1.439,5.4597,-9.8483,9.8782,21.6151,12.5454,621
-2.1834,-10.118,0.5218,2.872,-10.118,5.2693,14.5299,8.4255,622
-3.1851,-9.8532,0.2261,2.5987,-9.8532,6.9593,19.172,12.4406,623
-2.4321,-9.8875,4.5013,6.7774,-9.8875,6.6983,13.836,11.6612,624
-3.6888,-10.0278,0.7353,3.9347,-10.0278,3.0073,11.6166,8.4421,625
-15.484,-9.6944,3.9426,13.9596,-9.6944,9.1705,26.8052,14.3243,627
-4.3526,-9.791,3.6888,6.3765,-9.791,4.4312,29.0177,13.8861,628
-1.6963,-10.6191,0.6172,1.7618,-10.6191,3.3952,31.5447,26.8454,629
-3.8244,-9.9917,-0.5922,2.4688,-9.9917,3.5024,14.7537,9.8709,630
-3.3284,-9.6824,0.4708,2.1967,-9.6824,1.277,13.908,8.6759,631
-0.46,-9.9973,0.1183,0.3327,-9.9973,0.7237,10.8795,8.7193,632
-0.395,-10.0453,0.0646,0.4079,-10.0453,0.9115,11.7375,8.3869,633
-7.601,-9.8413,-0.0398,2.7775,-9.8413,3.9788,12.8256,6.4265,634
-5.597,-9.8364,-3.4981,1.7911,-9.8364,0.8557,11.822,9.9795,635
-17.213,-9.7149,-3.0532,8.2312,-9.7149,4.8611,10.1411,5.5077,637
0.0853,-9.6534,2.758,2.6003,-9.6534,1.2235,4.3516,2.6952,639
-4.4812,-9.6972,-0.7261,3.4034,-9.6972,1.8158,3.3774,2.9311,640
1.556,-9.6976,2.9128,0.8583,-9.6976,0.5046,3.1539,2.9689,641
0.7187,-9.7309,1.5027,0.4074,-9.7309,0.231,2.5676,2.4701,642
-0.4697,-9.7195,-0.1492,0.1985,-9.7195,0.1141,2.3031,2.268,643
-18.6099,-9.6695,8.4487,15.5971,-9.6695,9.312,28.8746,16.9602,644
-12.13,-9.6064,7.0076,13.2218,-9.6064,7.2211,36.0996,16.1907,645
-11.1791,-9.7085,2.3592,7.2858,-9.7085,6.1668,38.7389,15.9084,647
-5.9235,-9.1727,6.2582,11.5232,-9.1727,4.3344,18.5734,13.0884,648
-44.3752,-10.49,-18.8805,16.3439,-10.49,10.2667,46.6105,42.1154,649
-8.0669,-9.4629,-1.1237,4.8463,-9.4629,4.4695,21.8311,13.394,650
-0.2466,-10.0195,5.1012,4.6315,-10.0195,4.1603,26.7429,15.6812,651
-11.019,-10.4169,2.3214,15.6059,-10.4169,7.0893,33.9629,26.1194,652
-1.4521,-9.7773,3.474,4.4705,-9.7773,7.3937,16.7673,14.1963,653
-3.595,-9.9438,2.0067,4.6046,-9.9438,6.1472,26.2218,23.0189,654
-1.5178,-10.0127,4.0595,5.281,-10.0127,8.4557,22.2853,10.8002,655
-23.5487,-9.1784,7.5596,20.7715,-9.1784,13.6657,73.1309,29.5189,657
-18.2447,-9.9147,0.8786,19.4537,-9.9147,1.4649,19.3388,14.8034,658
-16.0528,-10.2766,-1.809,8.1117,-10.2766,14.0186,44.9468,36.2575,659
0.4837,-10.1349,9.7554,9.1421,-10.1349,6.8323,25.0507,23.4424,660
-14.7624,-9.8287,-4.7577,7.1474,-9.8287,3.6243,13.8199,11.4847,661
-9.8586,-9.6155,-2.2369,4.7672,-9.6155,6.199,20.3864,14.8445,662
-7.0064,-9.8795,-2.6112,3.1812,-9.8795,7.9497,17.9142,12.7751,663
-9.6405,-9.8407,-1.3888,4.9839,-9.8407,3.3429,23.1632,8.0593,664
-65.3145,-9.8726,-10.5518,18.5426,-9.8726,10.8145,29.211,10.1655,666
-16.6235,-9.7124,9.6019,30.3596,-9.7124,14.6597,36.9645,17.3277,667
-4.7552,-9.8406,-0.2854,2.7876,-9.8406,1.7959,12.2582,6.7915,668
-11.5683,-10.2181,2.659,9.7201,-10.2181,11.9528,29.3026,20.357,669
-2.1778,-9.8148,5.4806,8.359,-9.8148,7.814,15.7786,11.318,670
-1.053,-9.932,0.5713,1.0873,-9.932,2.9603,11.062,7.7169,671
-2.965,-9.9653,5.3439,10.7859,-9.9653,6.5599,16.3774,11.3198,672
-4.8631,-9.7164,5.4073,8.2773,-9.7164,3.8261,18.3678,12.1092,673
0.1055,-9.7957,8.2491,7.9603,-9.7957,3.9475,14.1566,12.4481,674
-4.1711,-9.9507,3.4786,6.964,-9.9507,8.3249,20.4683,13.5791,675
-0.4719,-10.091,0.3603,0.6961,-10.091,2.0829,20.1662,17.2182,676
-1.7347,-10.1269,0.1914,1.2086,-10.1269,2.6866,33.0732,18.5431,677
-2.9805,-9.7661,4.1013,7.7312,-9.7661,6.7535,25.2251,7.8981,678
-1.2256,-9.8743,1.8298,1.745,-9.8743,3.6677,15.398,9.2989,679
-1.7618,-10.008,4.6922,3.5202,-10.008,1.6291,18.0034,14.8527,680
-0.6632,-10.1054,0.1489,0.6089,-10.1054,2.0466,24.9915,23.2696,681
-9.5777,-9.7623,-0.5117,5.1032,-9.7623,2.109,10.2445,4.9935,682
-1.7369,-9.5674,5.6885,7.5895,-9.5674,4.4042,26.4711,21.309,683
-11.0654,-9.7805,4.4671,12.3124,-9.7805,6.8374,28.0575,23.5444,684
-2.8122,-9.7651,0.9553,2.5915,-9.7651,4.8057,13.5504,10.42,685
-8.081,-9.9707,1.1604,4.4427,-9.9707,3.7077,11.0996,7.9201,686
-6.9411,-9.9734,0.1443,3.3983,-9.9734,5.9974,18.0163,15.0501,687
-12.7833,-9.9257,11.0778,24.7347,-9.9257,13.1743,49.1051,20.2219,688
-0.9454,-10.0113,2.1281,2.2459,-10.0113,3.5143,15.0551,9.8881,689
-3.7821,-9.8594,-0.0353,4.2096,-9.8594,4.2866,25.4197,21.406,690
-0.1268,-10.1863,15.6889,15.9008,-10.1863,11.1427,38.6284,29.913,691
-38.4902,-10.4399,-0.644,30.7689,-10.4399,3.6172,27.0715,21.9986,692
-55.4182,-9.883,-1.7578,25.4111,-9.883,8.3132,37.4426,15.065,693
-92.1276,-9.0736,-15.2398,67.7961,-9.0736,27.5196,58.853,33.8339,694
-90.374,-10.2071,-15.0826,41.4486,-10.2071,14.3843,38.1643,20.4224,695
-2.4481,-10.3734,4.0248,4.7227,-10.3734,8.7218,28.4882,22.15,696
-18.532,-10.174,7.6585,12.5933,-10.174,8.5317,39.9094,26.5119,697
-38.5591,-10.3075,1.1126,20.4845,-10.3075,8.5341,33.882,24.6571,698
-10.609,-10.2844,9.2782,15.3428,-10.2844,9.3083,43.2815,16.3979,699
-64.0014,-9.8005,-13.5255,30.1781,-9.8005,9.2155,23.7295,12.805,700
-18.2432,-9.7491,1.8249,10.5304,-9.7491,5.687,29.2975,22.6559,701
-17.1284,-9.8518,1.9731,13.4317,-9.8518,7.5482,21.2498,18.4751,702
-21.9779,-10.6137,4.1782,14.0018,-10.6137,10.6058,33.5823,20.8764,703
-8.7847,-10.2451,-2.242,4.4398,-10.2451,2.7078,12.9405,8.2226,704
-3.1707,-9.698,2.0654,5.1328,-9.698,3.1737,16.13,11.2688,705
-5.3797,-9.7924,7.196,8.718,-9.7924,9.0214,36.0514,13.7288,707
-0.6708,-9.9923,2.7949,2.0224,-9.9923,3.2169,12.3864,8.0299,709
-7.1139,-9.6871,3.1856,7.4207,-9.6871,10.041,20.0342,14.629,710
-2.3722,-10.0201,-0.1891,1.6177,-10.0201,2.2212,12.9746,8.0012,711
-5.1849,-10.0286,1.271,4.9293,-10.0286,6.0466,19.3791,15.6467,712
-3.2128,-9.6613,2.376,2.9457,-9.6613,3.02,13.5843,11.7506,713
-3.2166,-9.8572,-0.4225,1.4994,-9.8572,3.83,12.1252,5.6316,714
-8.1433,-9.9686,1.9515,4.9708,-9.9686,8.0079,22.8186,10.9705,715
-1.6695,-9.9229,1.7535,2.3418,-9.9229,1.6524,6.5601,5.6689,716
-0.5943,-9.9087,1.0985,1.1962,-9.9087,1.7258,9.77,7.5511,717
-2.7816,-9.8549,0.8382,1.5123,-9.8549,3.9387,9.8841,5.3343,718
-0.4626,-9.8385,0.2448,0.5739,-9.8385,0.7537,4.7332,3.6729,719
-3.4728,-9.8062,4.1949,7.7373,-9.8062,5.3076,27.0846,22.5232,720
-12.8724,-10.7771,2.8314,12.1068,-10.7771,3.925,47.3386,34.2037,721
-28.687,-10.1796,-1.3563,13.1811,-10.1796,3.2843,19.3335,14.9653,722
-14.3708,-9.9749,15.1419,16.8773,-9.9749,3.7037,54.2715,37.5389,723
-20.7402,-9.55,12.8218,17.3245,-9.55,8.375,27.3392,19.1935,724
-14.1021,-9.8333,7.4184,13.3035,-9.8333,9.5933,36.3289,14.0455,725
-27.7089,-9.9728,2.1516,10.4664,-9.9728,7.5901,33.4161,15.1398,727
-32.8358,-9.8142,6.8621,22.464,-9.8142,11.9128,40.2903,18.1129,728
-10.346,-9.9176,3.4279,11.4448,-9.9176,8.0446,30.8124,10.7492,729
-24.3144,-9.9674,1.0717,23.2666,-9.9674,12.635,36.3744,19.8364,730
-6.2652,-9.9249,10.7484,12.2255,-9.9249,7.9426,28.2753,21.1447,731
-4.2332,-9.9269,0.1385,4.0007,-9.9269,2.9024,13.2112,9.9655,732
-37.9005,-9.7347,-10.9115,15.9136,-9.7347,9.294,29.3754,10.5609,733
-7.965,-9.8591,2.4284,6.5135,-9.8591,6.0639,27.6438,15.3368,734
-18.7485,-10.0125,2.9722,16.1513,-10.0125,6.6894,22.2246,13.5369,735
-7.5556,-9.9491,1.5011,6.0962,-9.9491,4.2289,14.0806,8.0065,736
-2.2469,-9.8559,0.1119,1.8544,-9.8559,1.8479,13.6085,10.6405,738
-6.3811,-9.3902,-0.4976,3.9156,-9.3902,2.0891,14.3798,9.9741,739
1.8031,-9.9936,8.9411,4.246,-9.9936,3.7505,29.2097,23.8488,740
6.5919,-10.0271,23.8586,13.1181,-10.0271,1.2663,35.4444,33.051,741
-35.3003,-8.6132,2.3188,18.6189,-8.6132,2.7325,62.643,39.1238,742
-24.1474,-9.7607,12.3013,22.7616,-9.7607,3.6842,79.5943,71.774,743
-11.0202,-9.6847,0.6669,13.0531,-9.6847,6.2455,33.2566,31.7456,744
-6.5718,-10.4914,14.6377,18.7301,-10.4914,9.9237,52.3318,34.352,745
-47.0276,-9.9095,-2.2053,15.3901,-9.9095,9.2085,82.4359,19.1385,747
-8.7565,-9.7414,-0.4047,4.7564,-9.7414,6.7631,24.6462,12.6946,748
-4.059,-10.0496,5.3504,9.5026,-10.0496,9.0889,27.1786,25.5697,749
-0.2725,-9.4698,2.952,2.5447,-9.4698,4.9053,20.5917,16.7742,750
-3.6473,-9.5239,2.2524,3.3502,-9.5239,7.6179,15.2825,7.5842,751
-2.8549,-10.0176,-0.574,1.2432,-10.0176,4.034,11.7643,10.0048,752
-4.8427,-9.6061,-0.2475,2.7189,-9.6061,9.2585,24.551,15.3428,753
-5.2668,-9.7868,5.7012,9.7229,-9.7868,5.0703,26.6872,22.1017,754
-9.3305,-9.5454,1.4316,4.9775,-9.5454,6.0968,15.0738,11.79,755
-12.5394,-9.4661,1.2528,8.3617,-9.4661,10.1022,22.0102,16.2381,757
-6.742,-9.7826,-0.0553,3.8093,-9.7826,5.9686,25.2886,8.0284,758
-9.0663,-9.5621,-2.035,3.8685,-9.5621,4.1508,11.2298,9.5081,759
-2.641,-9.699,1.8109,3.2019,-9.699,3.1427,22.8955,11.8002,760
1.2866,-10.1026,8.9913,5.8302,-10.1026,6.9664,24.8428,20.4658,761
-18.2206,-8.918,-1.894,4.8347,-8.918,4.3072,17.3982,7.7797,762
-10.1158,-9.8369,-1.5295,3.3643,-9.8369,3.348,11.8213,7.2713,763
-0.7486,-8.8175,2.9096,3.8051,-8.8175,5.4609,17.6383,9.6176,764
-20.3502,-9.5059,-0.3524,7.847,-9.5059,6.2546,35.0431,15.4719,765
-24.253,-10.6511,-4.31,9.4719,-10.6511,5.5671,32.8567,20.6389,766
-5.5322,-9.5914,1.239,3.3522,-9.5914,4.8081,14.081,9.3527,767
-31.4058,-9.8838,-0.4505,11.9023,-9.8838,9.1778,26.8928,17.2347,768
-8.2676,-9.9753,2.3374,7.5935,-9.9753,3.3065,16.22,12.4893,769
-17.7434,-9.6933,0.9789,13.5174,-9.6933,7.9742,23.7774,19.3576,770
-15.7164,-9.7112,12.2883,24.4959,-9.7112,7.958,29.1623,26.4999,771
-8.4238,-9.5976,-1.9706,3.8546,-9.5976,4.0965,17.1597,13.2336,772
-4.711,-10.4156,-0.5499,3.6642,-10.4156,4.3737,14.4421,10.8909,773
-2.5992,-9.9853,0.2743,1.8561,-9.9853,2.462,19.159,9.3516,774
-2.8699,-8.7382,2.9424,6.7852,-8.7382,3.8057,18.7283,10.5177,775
-6.839,-9.7459,0.6888,3.8378,-9.7459,7.6677,24.0882,10.6048,777
-16.7722,-9.2576,3.0631,6.2369,-9.2576,5.266,43.5709,11.6011,778
-26.1168,-9.9768,0.3569,8.8094,-9.9768,6.1641,25.2813,9.8513,779
-6.5607,-8.5075,-0.5033,4.2921,-8.5075,5.3077,27.8086,10.3466,780
-7.7332,-10.2972,0.3537,4.8754,-10.2972,3.5946,15.6081,9.7471,781
-2.3232,-8.8483,2.0605,4.1185,-8.8483,6.1303,21.9648,13.9132,782
-4.6524,-9.8989,2.0214,5.9618,-9.8989,7.7706,15.3771,12.6781,783
-9.1354,-9.7091,5.9719,12.12,-9.7091,5.0113,38.0277,15.8896,784
-1.9717,-9.8837,1.0736,3.2262,-9.8837,5.5115,16.2636,6.4262,785
-4.4618,-9.9496,0.7463,1.6749,-9.9496,4.0567,16.0976,8.7267,787
-31.3265,-9.8099,1.5141,13.0957,-9.8099,9.1097,52.0184,13.6003,788
-1.093,-10.124,1.6549,3.0653,-10.124,1.9185,9.8341,6.2023,789
-33.5155,-9.9142,-10.7103,11.6618,-9.9142,3.4949,22.8936,14.6187,790
-21.3938,-9.2176,-10.836,7.0937,-9.2176,3.132,18.5604,10.4263,791
-6.5642,-10.2699,1.6475,5.535,-10.2699,3.0568,21.404,13.9152,792
-5.2199,-9.7629,-0.0961,2.8396,-9.7629,2.5379,19.1982,12.488,793
-8.9297,-9.5965,-0.1784,8.1294,-9.5965,6.4625,27.0178,11.4632,794
-10.7288,-10.0984,-0.8791,6.2219,-10.0984,4.1334,20.8094,15.7711,795
-13.293,-9.5214,3.3311,8.0945,-9.5214,6.3847,24.4698,14.0766,797
-9.2718,-9.9736,-1.0559,5.3218,-9.9736,4.9925,20.4098,8.7772,798
-33.1897,-9.0575,-2.3261,11.1933,-9.0575,3.9408,21.647,11.9953,799
-5.1785,-10.0099,6.6979,7.1425,-10.0099,6.9433,19.1988,13.1581,800
-12.175,-8.6492,2.6803,8.6189,-8.6492,4.4462,14.0231,8.4997,801
-9.1556,-9.0351,15.892,20.5634,-9.0351,4.8785,28.4729,19.9847,802
-11.4578,-10.143,-0.2689,5.4411,-10.143,4.3542,22.1418,17.2857,803
-60.4711,-9.1495,-6.567,19.0377,-9.1495,6.2884,39.1185,15.2769,804
-33.7724,-9.3341,-0.8583,27.2549,-9.3341,2.5847,18.2597,13.8635,805
-7.9803,-10.0991,4.4706,9.2706,-10.0991,7.5597,27.0458,15.442,807
-10.561,-10.0514,-2.7182,3.863,-10.0514,2.5372,14.5058,4.1492,808
-1.104,-9.6032,7.0366,6.5927,-9.6032,2.5822,15.0698,11.7704,809
-14.7341,-8.4278,-2.3994,10.2848,-8.4278,5.1424,24.152,16.5964,810
-5.813,-10.3776,3.6526,5.4814,-10.3776,4.8034,29.4388,14.5622,811
-8.6976,-9.9065,-3.6916,3.4858,-9.9065,2.396,12.487,9.6316,812
-6.9733,-10.1634,-2.1071,3.6022,-10.1634,3.433,19.8457,11.7645,813
-4.5765,-9.8222,-1.3103,1.9616,-9.8222,5.1514,16.3466,11.4301,814
-3.5907,-8.6488,-0.5067,1.6033,-8.6488,2.1911,10.1993,8.5773,815
-10.1897,-9.6361,-0.2697,3.6443,-9.6361,5.2896,18.3336,9.6398,817
-3.7146,-9.9519,5.3502,8.9982,-9.9519,4.8722,17.1177,12.7476,818
-5.5851,-10.0238,-2.7895,3.2384,-10.0238,1.85,15.8801,12.932,819
-12.1269,-9.386,-1.305,5.3742,-9.386,3.4259,16.1629,9.9817,820
-33.567,-10.1661,2.2488,18.8129,-10.1661,7.489,29.831,17.0101,821
-4.3554,-10.3441,4.1008,7.0532,-10.3441,6.3771,16.4605,12.8127,822
-0.3768,-9.9521,3.5147,4.9614,-9.9521,5.9459,16.6932,7.4796,823
-3.2227,-9.954,3.6376,5.6671,-9.954,3.8844,15.3451,9.3638,824
-6.998,-9.2573,0.7937,5.3347,-9.2573,8.2233,25.3838,12.8949,825
-12.8738,-9.9134,2.313,6.3792,-9.9134,6.2073,17.1291,7.9725,827
-4.1701,-9.8703,6.3232,11.9849,-9.8703,8.5976,17.1112,9.578,828
-7.0694,-10.1655,5.2873,8.8636,-10.1655,4.8317,18.8144,14.5257,829
-8.4639,-9.4406,3.3752,10.3464,-9.4406,1.8173,15.1659,13.5543,830
-19.7547,-9.3662,3.0769,18.7689,-9.3662,2.4095,24.018,22.3376,831
-9.9893,-9.4814,1.5859,11.3127,-9.4814,8.3072,28.9568,26.2285,832
-2.1301,-9.9946,7.4352,7.6729,-9.9946,4.2235,20.1187,16.5358,833
-9.3025,-9.9377,4.7737,8.1814,-9.9377,6.3783,20.8367,12.7949,834
-9.4562,-9.8285,2.2416,8.6455,-9.8285,5.1805,18.8742,12.722,835
-28.3017,-9.7089,9.2436,19.1832,-9.7089,13.8767,51.4799,27.7522,837
-4.7087,-9.8132,8.6801,11.8352,-9.8132,4.0539,22.6629,19.8138,838
-13.5781,-8.2401,13.1959,19.1854,-8.2401,3.0051,34.4104,28.6126,839
-4.7201,-9.8082,-1.6116,2.2338,-9.8082,4.2887,24.8771,8.5325,840
0.0035,-9.9036,3.5091,2.8525,-9.9036,4.08,11.4168,9.9089,841
-1.7472,-10.0775,-0.3313,0.7005,-10.0775,1.556,7.1544,4.992,842
-15.9272,-9.9696,1.3102,9.6375,-9.9696,3.537,13.5057,9.4926,843
-12.6832,-9.8421,1.0056,4.3532,-9.8421,4.1081,16.2133,9.1021,844
-4.905,-9.9065,2.3902,5.2298,-9.9065,4.1772,19.8868,16.6795,845
-19.3732,-9.7789,0.1825,10.3835,-9.7789,11.7413,30.5495,14.1146,847
-8.7408,-9.7113,0.4736,4.2069,-9.7113,4.8166,29.3093,10.7318,848
-11.5029,-9.8914,2.3277,8.1044,-9.8914,7.9992,23.5619,14.5063,850
-7.9492,-10.1406,0.4664,5.1407,-10.1406,6.774,15.3409,12.5273,851
0.4772,-9.9691,5.4507,2.5548,-9.9691,2.728,10.983,9.3792,852
-0.5988,-9.9084,-0.1376,0.3747,-9.9084,2.9095,15.6739,11.1737,853
-1.4585,-10.0377,0.3828,0.9186,-10.0377,1.9855,10.9844,7.5295,854
-1.4168,-9.7905,0.4618,1.4233,-9.7905,1.5436,8.4422,4.7981,855
-1.5432,-9.7434,1.812,2.6201,-9.7434,2.2898,9.3145,8.0217,856
-12.289,-10.0657,-0.2791,4.506,-10.0657,4.7506,15.3657,11.5895,857
-4.944,-9.9013,0.7329,1.8583,-9.9013,2.962,20.2745,8.1435,858
-4.8851,-9.7195,-0.4052,2.9323,-9.7195,1.2439,8.8202,6.7955,859
-2.8347,-9.6843,0.2385,1.5914,-9.6843,3.5018,17.0523,10.3518,860
-0.7413,-9.8875,2.0936,3.0081,-9.8875,4.0151,19.7632,16.1117,861
-3.3463,-10.2195,3.186,4.0202,-10.2195,2.9923,16.6815,14.6978,862
-6.9719,-9.3038,1.9022,7.2519,-9.3038,2.9667,19.4319,11.5095,863
-4.648,-9.8866,2.5231,5.2514,-9.8866,7.4598,21.3209,18.5653,864
-2.8492,-9.6283,-0.1634,1.3672,-9.6283,2.7806,11.2948,5.4159,865
-7.1805,-10.0695,3.0098,8.369,-10.0695,7.6841,24.0517,12.6666,866
-5.8676,-9.6794,0.5785,2.6875,-9.6794,3.2355,13.4841,7.1852,867
-6.4959,-9.6976,0.1323,1.7455,-9.6976,2.9251,10.757,6.6996,868
-1.5129,-10.3601,-0.1475,0.6153,-10.3601,1.2293,7.7533,5.5593,869
-0.739,-10.0592,-0.0171,0.3353,-10.0592,0.3682,6.1895,3.9729,870
-6.0995,-9.9215,-0.415,1.8054,-9.9215,2.1559,8.1546,5.3519,871
-0.7184,-9.8129,0.2783,0.6583,-9.8129,1.2757,4.8153,3.9814,872
-8.4509,-9.8368,-1.469,3.0731,-9.8368,3.4289,7.9364,4.0506,873
-13.1141,-9.8256,-1.3008,4.5358,-9.8256,4.2952,8.7674,4.3257,874
1.7427,-9.854,3.5082,1.4266,-9.854,1.2673,6.8655,5.7719,875
0.2616,-9.8241,0.9739,0.343,-9.8241,0.4363,2.8479,2.7101,876
0.3866,-9.8229,1.1615,0.6878,-9.8229,0.707,3.2032,2.3653,877
-11.5255,-9.9593,-1.7882,4.4316,-9.9593,3.0069,9.7395,3.8276,878
-12.5843,-9.8298,-2.0551,3.7862,-9.8298,2.7281,10.1746,4.353,879
0.7602,-9.8233,2.4839,0.8549,-9.8233,1.3402,4.8709,4.6188,880
-2.5611,-9.8694,0.1395,1.5559,-9.8694,2.1426,4.2178,2.852,881
-20.0907,-9.8319,-2.4718,5.7485,-9.8319,5.2622,11.1454,5.1058,882
-1.4895,-9.827,0.6873,0.9244,-9.827,1.0722,3.3373,2.8096,883
-1.9704,-9.8419,0.0909,1.035,-9.8419,1.2754,3.635,2.7393,884
-2.239,-9.8311,0.609,1.5047,-9.8311,1.7792,4.7504,3.0741,885
-1.4971,-9.8168,-0.1623,0.497,-9.8168,0.6604,3.1683,2.3908,886
-11.2667,-9.8707,-3.3846,5.0177,-9.8707,2.277,10.6823,5.5554,887
1.1407,-9.7631,14.3798,14.2195,-9.7631,5.0596,27.3086,20.1837,888
-0.0178,-9.8054,4.9003,2.8742,-9.8054,8.2966,28.0279,26.7034,889
-3.5091,-9.8896,2.4547,6.278,-9.8896,2.6734,19.2703,11.7988,890
-0.0068,-10.0551,1.507,1.299,-10.0551,1.0017,8.8798,6.8859,891
-18.1262,-9.8609,-0.2387,5.0836,-9.8609,4.1939,11.2077,5.7985,892
-4.1612,-9.8045,2.0158,4.2587,-9.8045,8.0148,15.8667,12.2786,893
-2.9141,-9.7707,2.0921,2.9325,-9.7707,4.6098,19.4415,12.8122,894
-1.583,-9.7484,0.3574,1.6415,-9.7484,0.6695,10.2943,7.7179,895
-0.2463,-9.8257,0.7817,0.9756,-9.8257,0.76,6.8022,6.2028,896
-0.0095,-10.5803,0.4857,1.0803,-10.5803,1.4111,32.5771,13.8769,897
-2.9995,-9.0414,0.9992,3.5949,-9.0414,2.1188,16.361,12.8127,898
-6.7264,-10.0944,4.721,19.1441,-10.0944,10.2986,49.1259,37.6217,899
-15.4598,-10.157,-1.6007,4.2969,-10.157,4.5495,21.2564,13.3952,900
-5.2188,-10.1528,-1.0542,2.9465,-10.1528,1.069,26.3037,22.7304,901
-7.8307,-9.9333,19.914,22.175,-9.9333,4.8038,47.7413,27.8072,902
-9.9225,-10.2296,3.906,9.6339,-10.2296,10.8879,46.7416,37.671,903
-1.5362,-9.9148,4.0442,4.7981,-9.9148,2.5826,24.125,18.1802,904
-2.8746,-9.8918,5.8717,9.7382,-9.8918,5.5313,31.1885,12.9132,905
-4.5069,-10.0705,4.655,6.7542,-10.0705,2.5322,35.6726,22.7641,906
-0.6336,-9.8566,1.0474,1.4396,-9.8566,2.4955,10.5427,6.7046,907
-0.0045,-10.1248,2.7128,2.3356,-10.1248,4.1557,11.5216,5.65,908
-2.7525,-10.0319,3.7336,6.1641,-10.0319,8.6439,23.8787,16.4146,909
-3.5732,-8.0981,0.9369,3.7288,-8.0981,3.3671,25.8986,13.5678,910
-7.0532,-9.8205,1.8886,4.6525,-9.8205,10.5914,19.6373,13.1392,912
-7.1866,-8.3713,-0.4382,3.2967,-8.3713,3.5229,30.908,9.1437,913
-3.4025,-10.2382,0.7518,2.5369,-10.2382,2.6806,12.318,10.1731,914
0.0637,-9.7556,3.654,2.5905,-9.7556,3.4879,12.9019,6.8712,915
-13.7553,-9.6419,-0.2036,8.4707,-9.6419,1.9487,23.6145,21.4436,916
-53.1834,-9.1181,-2.7991,15.6134,-9.1181,9.1808,94.2097,15.1373,918
-4.3797,-9.6829,8.6642,12.1158,-9.6829,11.8247,40.1464,20.1212,919
-12.5014,-9.8532,0.2315,5.8649,-9.8532,3.8192,15.6824,10.605,920
-105.8875,-9.2381,-2.105,23.1224,-9.2381,5.5717,51.9778,17.0698,922
-15.4304,-9.7906,3.6856,9.9064,-9.7906,7.0058,19.115,13.149,923
-14.4819,-10.1644,11.5009,18.0929,-10.1644,7.2668,33.7715,28.5721,924
-20.3668,-9.7073,31.6584,40.6024,-9.7073,6.5052,37.2499,30.5096,925
-0.4353,-9.8151,3.6921,3.2406,-9.8151,4.1756,23.5796,11.3789,926
-4.1815,-9.6476,-0.2129,2.7354,-9.6476,1.4158,11.6941,7.633,927
-1.6526,-11.0022,39.6251,30.6137,-11.0022,13.4493,55.6204,41.4056,928
-16.3115,-9.6519,-7.1849,6.3894,-9.6519,4.819,24.1579,21.2136,929
-9.0403,-10.0614,2.5777,12.8134,-10.0614,5.8011,21.1687,12.4337,930
-91.9663,-9.8991,-5.6542,20.0973,-9.8991,10.0175,34.1694,17.505,932
-17.6146,-10.0474,-2.5994,6.4561,-10.0474,6.0442,18.6423,11.9821,933
-6.3465,-9.5416,5.0399,6.5526,-9.5416,4.1041,18.7694,12.9949,934
-24.2091,-9.9042,4.5141,29.3674,-9.9042,8.3113,31.0287,21.2139,935
-5.4304,-9.6767,13.2053,20.5643,-9.6767,10.0882,25.5879,18.9129,936
-8.4486,-9.5118,2.5893,8.0418,-9.5118,6.7587,17.596,10.0799,937
-2.6821,-9.9877,-0.3055,1.2804,-9.9877,1.2952,8.0861,4.4742,938
-4.1043,-9.8354,-0.0084,1.9023,-9.8354,2.6847,8.9933,5.3675,939
-0.6089,-10.0253,0.2364,0.4754,-10.0253,1.4551,9.3646,6.9607,940
-4.7933,-9.6903,5.0186,7.9669,-9.6903,6.0238,35.034,15.3245,990
-22.5821,-9.9213,-1.4048,7.8487,-9.9213,8.7672,30.3742,19.5992,992
-33.3274,-9.8709,4.2301,15.3883,-9.8709,13.5522,38.513,19.1077,993
-1.3184,-10.0108,2.1319,2.1969,-10.0108,2.2676,26.2322,22.5901,994
-0.0147,-9.6632,2.919,3.5553,-9.6632,4.6213,15.3128,6.5133,995
-2.9817,-9.7669,-0.1392,1.5458,-9.7669,2.1879,13.4884,10.5903,996
-14.8113,-9.6963,1.2788,13.6876,-9.6963,2.8766,14.8919,10.2714,997
-11.5727,-10.1735,2.4445,6.8404,-10.1735,9.9102,40.9081,26.9546,998
-13.1327,-9.8605,6.835,12.0078,-9.8605,8.5136,34.5907,16.1059,999
3.0576,-10.1156,13.4836,7.1413,-10.1156,2.2229,38.3779,31.4846,1000
-19.9149,-10.2049,4.2404,17.6878,-10.2049,9.8915,56.1013,30.956,1002
-63.82,-9.9948,6.2634,38.1054,-9.9948,16.8478,64.2259,25.4563,1006
-10.086,-9.8326,0.1806,3.8556,-9.8326,6.1367,16.4551,10.4461,1007
-23.4201,-9.8652,-1.725,10.7076,-9.8652,8.8006,31.0779,11.9675,1016
-14.6039,-9.8508,-1.874,4.245,-9.8508,6.5973,20.7966,9.4803,1017
-4.043,-9.7912,1.177,3.3256,-9.7912,4.703,17.1292,9.477,1018
-1.8795,-9.8273,3.5222,4.4731,-9.8273,5.4508,31.7139,10.9497,1019
-3.2489,-9.7812,1.0254,2.6352,-9.7812,2.6401,11.4107,9.4954,1020
-3.1037,-9.9792,-0.7201,1.0815,-9.9792,3.9422,15.6948,8.6346,1021
-2.9246,-10.4607,-0.5751,1.4132,-10.4607,1.3489,27.8258,19.7647,1022
-2.7664,-9.8175,6.7523,6.6435,-9.8175,1.6173,18.6108,15.6906,1023
-8.1488,-7.2066,0.9606,6.8709,-7.2066,2.1444,14.4531,12.6735,1024
-10.1318,-8.9975,-0.7933,5.8763,-8.9975,1.4626,21.1081,15.2799,1025
-2.467,-10.1097,2.4385,6.4571,-10.1097,4.5418,12.1697,10.3585,1026
-2.3744,-9.9772,1.3778,3.541,-9.9772,6.161,14.5357,13.8369,1027
-7.8748,-9.1299,16.7041,23.9185,-9.1299,9.5152,22.0768,17.2007,1028
-9.815,-9.5521,4.5868,12.7891,-9.5521,3.3648,20.8413,12.8752,1029
1.1503,-9.417,14.6237,9.2786,-9.417,3.0645,22.7542,18.073,1030
-5.935,-9.7835,6.819,10.1272,-9.7835,4.0484,27.179,18.7488,1031
-9.0764,-10.1163,-0.8311,6.1555,-10.1163,5.3089,24.6968,14.1337,1033
-12.2987,-9.9289,-3.6149,5.6288,-9.9289,2.2506,15.1053,12.0542,1034
-3.7723,-9.7519,1.7278,3.5433,-9.7519,1.8754,17.2889,13.0908,1035
-5.964,-9.804,-0.1783,6.3065,-9.804,3.6081,11.0185,8.8007,1036
-11.0992,-9.2514,3.4206,9.9511,-9.2514,4.4305,31.2561,18.2367,1037
-15.3632,-9.3265,2.642,10.0449,-9.3265,7.7286,28.1535,17.0251,1038
-49.5037,-9.9372,19.8844,35.8605,-9.9372,15.924,52.8864,28.7543,1039
-30.7232,-9.8013,12.6175,22.7063,-9.8013,9.6226,27.3844,18.0205,1041
0.1054,-9.6657,2.9053,2.3238,-9.6657,1.7101,18.605,8.7253,1042
-27.3503,-9.8017,-0.0992,15.0868,-9.8017,9.7938,20.584,13.7329,1043
-0.7485,-10.0624,25.452,29.4075,-10.0624,12.9459,25.3049,18.4815,1045
-12.5149,-9.711,1.5281,11.7682,-9.711,7.0296,21.72,18.0088,1046
-3.4131,-9.9053,0.2797,3.5044,-9.9053,2.5898,17.653,8.2273,1047
-2.3884,-10.0484,4.4248,4.8544,-10.0484,2.9707,21.6749,13.0312,1048
-1.726,-9.7538,0.1117,1.3378,-9.7538,3.1587,9.557,6.4478,1049
0.0088,-9.8296,0.9863,0.9094,-9.8296,1.2042,9.8375,4.5127,1050
-1.7236,-9.9799,0.7092,1.5663,-9.9799,2.5491,10.7045,6.4278,1051
-2.1602,-9.3951,0.9518,2.3237,-9.3951,5.8092,14.4457,7.2579,1052
-19.2127,-9.9558,13.1216,34.3555,-9.9558,11.3198,41.4199,13.5081,1054
-1.5306,-9.6833,5.2765,4.7311,-9.6833,10.0411,18.2461,12.4026,1055
-10.034,-9.7643,-3.1017,4.0824,-9.7643,3.9975,18.011,12.4297,1056
-11.958,-9.9985,-0.2368,7.1487,-9.9985,4.407,22.9198,13.3197,1057
-10.1542,-10.1193,-1.5855,5.1457,-10.1193,3.0839,16.8566,12.3361,1058
-4.0996,-10.0265,6.2128,7.1834,-10.0265,9.3524,20.2339,15.0522,1059
-0.8942,-10.2198,4.716,3.5363,-10.2198,3.6946,15.1846,10.452,1060
-1.1893,-9.6769,0.6524,1.3024,-9.6769,2.8832,9.9966,7.7626,1061
-0.9227,-10.1968,0.2554,0.7814,-10.1968,1.3242,9.5084,2.9473,1062
-27.3303,-9.897,1.3518,9.2654,-9.897,8.7873,25.5658,10.9757,1064
-21.0029,-8.0762,-0.1145,6.0132,-8.0762,4.778,25.4205,11.8682,1065
-42.8982,-9.6778,-11.2512,20.7981,-9.6778,15.7864,33.5042,23.2323,1066
-13.8525,-10.1243,-4.5018,7.7563,-10.1243,1.6784,15.4818,13.182,1067
-21.1349,-10.7451,6.5297,21.846,-10.7451,4.4659,14.6746,12.0184,1068
-1.7616,-9.9607,9.0505,12.2674,-9.9607,5.7872,19.6773,15.5531,1069
-1.7884,-9.8675,8.8038,12.6007,-9.8675,7.9241,22.1912,17.793,1070
-4.1093,-9.9389,0.3981,1.8608,-9.9389,4.3343,12.4951,8.3785,1071
-0.7516,-9.6894,4.1133,4.5402,-9.6894,1.9006,14.2607,13.2092,1072
-10.8743,-9.7737,8.7385,16.1796,-9.7737,8.8219,34.3169,13.0002,1074
-15.9789,-9.3788,-2.9226,5.0387,-9.3788,7.0354,17.829,12.4684,1075
-8.694,-10.0266,19.9617,24.6283,-10.0266,17.3821,34.9959,27.5884,1076
-8.6547,-10.0334,-0.5897,5.4904,-10.0334,4.5838,15.0285,8.0178,1077
-4.1275,-9.6476,-0.104,2.983,-9.6476,6.2292,13.2267,9.554,1078
-3.9668,-10.2391,8.7182,14.0356,-10.2391,7.2982,16.6385,8.7056,1079
-10.8179,-9.7915,0.3681,9.4812,-9.7915,7.9594,33.9626,27.9408,1080
-9.5071,-9.8814,1.6558,5.6431,-9.8814,11.2829,26.0457,20.2479,1081
-10.1025,-9.7455,-0.8285,4.1891,-9.7455,4.0682,12.2356,8.7473,1082
-7.219,-9.9245,0.3739,2.2452,-9.9245,3.1644,17.9324,5.2716,1084
-3.8239,-9.8348,0.9674,2.456,-9.8348,4.295,9.9294,5.5884,1085
-0.1768,-9.4751,2.7082,3.1585,-9.4751,2.8837,10.4823,7.8491,1086
-0.8538,-9.8699,1.2381,1.4775,-9.8699,1.805,9.7646,7.8615,1087
-0.2993,-9.4537,0.6024,0.939,-9.4537,2.398,13.1173,8.8624,1088
-2.0322,-9.9037,3.4181,3.0627,-9.9037,2.3876,10.3008,8.2982,1089
-0.1114,-10.0197,0.1595,0.2782,-10.0197,1.1103,3.7807,2.9439,1090
-0.5904,-9.9827,-0.0091,0.3868,-9.9827,1.6205,7.4371,3.98,1091
-1.2916,-9.8054,0.1951,0.7022,-9.8054,2.5579,7.8875,4.015,1093
-0.1966,-9.5527,0.062,0.2535,-9.5527,1.0801,5.6625,3.7644,1094
-3.0215,-9.4188,10.3542,11.5756,-9.4188,5.0812,24.9944,20.6034,1095
-6.4686,-9.7974,3.3535,5.5639,-9.7974,4.9491,24.8257,13.1792,1096
-26.4092,-9.8061,18.8465,34.2354,-9.8061,3.4035,24.7309,22.7899,1097
-22.0493,-9.8604,2.5873,10.1319,-9.8604,8.8233,28.6984,11.854,1099
-4.6523,-10.5356,-2.0744,1.8878,-10.5356,4.5409,14.8578,6.2798,1100
-2.4671,-9.7996,-0.2449,2.1634,-9.7996,4.1577,13.5546,9.3009,1101
-8.0983,-9.709,0.0891,5.2362,-9.709,4.5786,12.5376,8.9728,1102
-6.9893,-9.7999,2.401,5.8261,-9.7999,5.6567,19.8419,13.2049,1103
-6.3211,-9.8201,-1.5413,3.2522,-9.8201,1.7345,14.0178,10.4097,1104
-13.1635,-9.6545,-3.8061,5.0829,-9.6545,5.8404,19.0253,15.9845,1105
-11.0981,-9.7441,2.6977,11.4289,-9.7441,5.3978,20.3678,12.366,1106
-17.1873,-9.6215,21.6949,25.3328,-9.6215,7.9871,29.5612,23.9377,1107
-23.936,-9.8333,5.2733,13.6611,-9.8333,10.108,25.7273,15.0206,1109
-18.5735,-9.7623,-1.039,8.159,-9.7623,11.0879,22.7909,14.0105,1111
-9.152,-9.7804,-2.9985,4.7057,-9.7804,1.7629,10.9936,8.1066,1112
-11.4599,-9.395,-0.5582,5.5254,-9.395,7.7096,22.6805,14.4251,1113
-19.434,-9.8537,-4.8108,7.9456,-9.8537,5.2142,16.3103,11.4029,1114
-5.4789,-9.9699,-0.8726,4.9205,-9.9699,3.4915,10.0908,8.1094,1115
-3.1586,-9.3529,1.7432,3.5456,-9.3529,3.4778,15.3647,9.0636,1116
-5.8717,-9.5748,2.9581,7.4407,-9.5748,6.1957,14.9884,10.2404,1117
-12.5579,-9.9767,1.9465,9.6536,-9.9767,6.7198,16.9707,11.1725,1118
-16.7658,-9.6239,-1.3387,6.5334,-9.6239,9.6507,22.4325,15.0253,1119
-13.5942,-9.962,0.9,5.8551,-9.962,6.0276,18.4,10.8257,1120
-14.4751,-9.2825,2.4069,9.9063,-9.2825,9.6875,22.5471,14.9127,1121
-6.2163,-10.5534,6.0568,9.9286,-10.5534,7.0189,17.2209,12.0202,1122
-17.798,-9.7847,-4.4491,7.4885,-9.7847,6.8026,18.492,5.967,1123
-6.963,-10.2694,0.2625,4.9409,-10.2694,5.4962,16.061,11.4256,1124
-19.8726,-9.7143,-6.511,8.9161,-9.7143,5.8917,26.1904,12.2762,1125
-3.5311,-9.6802,2.8587,5.0582,-9.6802,8.2733,19.9475,9.0439,1126
-2.5611,-9.6593,9.3199,11.4964,-9.6593,4.9584,27.5461,20.3744,1127
-19.1418,-10.1674,-0.0576,14.0559,-10.1674,16.0656,32.5753,23.3907,1128
-3.8695,-9.454,2.7404,4.6687,-9.454,5.2008,19.099,14.8581,1130
-14.7033,-9.8891,22.4575,25.4512,-9.8891,13.726,39.3797,28.0322,1131
-15.3892,-10.0425,-2.5298,9.2232,-10.0425,1.9201,14.8902,10.9168,1132
-8.7134,-9.876,1.6266,7.1252,-9.876,7.8138,25.4975,15.0558,1133
-0.6859,-9.8168,4.7396,3.8442,-9.8168,3.0474,21.3195,12.8837,1134
-1.1403,-9.955,0.3945,0.8403,-9.955,2.202,9.9394,5.186,1135
-1.0279,-10.1069,0.0408,0.5487,-10.1069,1.4197,6.9212,3.3424,1136
-10.3529,-9.5449,-1.0072,3.9373,-9.5449,3.4208,8.8732,5.3892,1137
-15.5393,-9.7418,2.6351,8.326,-9.7418,11.1418,26.2001,11.8904,1138
-11.402,-8.5536,-1.1749,3.257,-8.5536,3.1437,32.9681,6.0416,1139
-19.2832,-9.7898,0.3718,5.9443,-9.7898,10.6586,27.6751,15.5408,1140
-6.8415,-9.5347,0.449,5.5025,-9.5347,11.0708,22.2117,14.0859,1141
-9.3713,-9.5964,-2.0643,3.199,-9.5964,3.8696,17.8025,9.757,1195
-33.7464,-9.8208,-11.5922,12.774,-9.8208,8.9443,27.2473,19.2254,1196
-41.4512,-9.3043,1.4414,23.5171,-9.3043,11.5753,40.3053,16.0976,1197
-12.6688,-10.0725,-3.8242,6.2667,-10.0725,8.8259,26.5085,14.4186,1198
-11.5988,-9.692,-1.7369,4.479,-9.692,7.7628,21.3589,14.485,1199
-23.5123,-9.8331,3.6382,12.1409,-9.8331,8.5612,35.4644,14.3598,1201
-8.1513,-9.5371,-0.1799,4.8122,-9.5371,2.6414,16.2302,8.3517,1202
-1.6227,-9.1037,6.124,7.7975,-9.1037,4.8949,23.8974,18.4896,1205
-17.2541,-9.9016,-4.5138,5.4261,-9.9016,7.6936,23.2421,9.3242,1206
-14.615,-10.0058,-3.6146,6.1899,-10.0058,3.2023,16.8225,14.4114,1207
-8.9047,-9.8504,-1.7877,3.7269,-9.8504,9.0089,17.9744,10.4869,1208
-1.0746,-9.8338,-0.0213,0.6089,-9.8338,1.2156,8.2289,6.8074,1209
-2.6297,-10.02,6.2914,6.6799,-10.02,2.6555,22.2664,17.8538,1210
-2.9229,-9.9224,2.6222,5.0018,-9.9224,7.6083,15.2335,10.2323,1211
-0.604,-9.78,19.3815,18.9772,-9.78,14.3187,40.0539,30.179,1212
-3.5533,-9.8496,-0.2567,1.9033,-9.8496,1.0662,14.8986,6.981,1213
-6.4429,-9.8523,8.9105,9.8173,-9.8523,14.566,27.2105,19.2165,1214
-5.4655,-9.8382,0.5544,4.3203,-9.8382,2.643,15.5743,10.0962,1215
-7.1361,-9.8893,-2.5443,3.4667,-9.8893,6.6401,26.8534,12.6156,1216
-4.3545,-10.0333,0.5956,4.3017,-10.0333,2.8488,11.0965,8.803,1217
0.066,-9.9872,4.6862,3.6247,-9.9872,6.043,19.3787,13.4514,1218
-8.0669,-9.7872,-1.6164,3.8971,-9.7872,1.7045,12.3243,9.3769,1219
-15.8366,-9.9759,-3.3583,7.3159,-9.9759,5.8018,19.6083,12.8929,1220
-8.5185,-9.8791,2.0267,7.204,-9.8791,7.9316,22.4603,14.8251,1221
-8.025,-9.8419,-0.1368,2.7478,-9.8419,3.2928,14.7345,7.2378,1223
-9.5934,-9.8676,-0.8784,5.5584,-9.8676,4.428,17.2679,8.8651,1224
-3.5578,-9.822,4.8055,5.3504,-9.822,0.8492,12.6137,12.0813,1225
-1.2517,-9.8411,0.743,1.0748,-9.8411,3.7044,14.7778,7.6166,1226
-26.1596,-9.8092,-4.4558,10.1428,-9.8092,6.1112,19.2407,10.0925,1228
-49.5467,-9.6421,5.417,21.3126,-9.6421,8.2175,15.7024,8.7221,1229
-0.2003,-9.7978,1.2141,0.7102,-9.7978,0.5775,2.7901,2.6302,1230
-0.4503,-9.7542,0.1782,0.6913,-9.7542,0.4531,2.4469,2.2218,1231
0.9471,-9.7598,1.2504,0.184,-9.7598,0.1369,2.4905,2.3914,1232
-2.652,-9.7552,-0.091,1.1655,-9.7552,0.7705,2.6485,2.2446,1234
-2.4662,-9.7279,-0.4535,1.1415,-9.7279,0.6958,2.7346,2.2798,1235
0.309,-9.7273,0.5297,0.1894,-9.7273,0.1142,2.299,2.2236,1236
-0.6693,-9.7281,-0.1001,0.4941,-9.7281,0.3041,2.4609,2.2183,1237
3.9999,-9.7525,4.9039,0.6344,-9.7525,0.4554,4.3425,3.8734,1238
-6.2594,-9.8684,-1.7048,2.4163,-9.8684,3.5724,7.8621,4.1238,1239
-1.6623,-9.7966,0.9475,2.122,-9.7966,2.2784,5.5264,2.6732,1240
-18.4964,-9.8298,-4.459,7.0143,-9.8298,5.1684,10.8566,4.0006,1241
-31.2466,-9.5868,-18.7226,10.0071,-9.5868,2.3771,11.0326,9.7092,1242
-0.5907,-9.6153,2.8487,3.0454,-9.6153,1.4269,4.7686,2.5629,1244
-0.3147,-9.6529,0.8647,0.5312,-9.6529,0.2605,2.3699,2.2522,1245
0.5077,-9.6629,0.9148,0.341,-9.6629,0.1628,2.3591,2.2295,1246
1.1119,-9.6778,1.481,0.1976,-9.6778,0.1019,2.4466,2.3404,1247
1.2564,-9.6949,1.6732,0.2452,-9.6949,0.1213,2.4405,2.3982,1248
0.5596,-9.6928,1.2592,0.8406,-9.6928,0.4392,2.6002,2.3666,1249
-1.1749,-9.7137,0.806,2.2317,-9.7137,1.178,3.5768,2.0697,1250
-36.0604,-9.7345,-12.3787,12.9923,-9.7345,5.7418,13.6074,8.609,1251
-12.7736,-9.8268,-2.3884,5.0894,-9.8268,5.6964,12.7758,7.1691,1252
-31.5318,-9.7436,-1.1649,12.266,-9.7436,8.0262,19.246,10.9857,1254
-12.9443,-9.8133,4.6142,9.331,-9.8133,4.7851,29.403,21.3318,1255
-2.4537,-9.5982,9.1215,9.9346,-9.5982,3.5665,26.0616,11.4365,1256
-6.7753,-9.7904,1.7397,3.8367,-9.7904,2.9914,16.2316,12.1201,1257
0.5537,-9.9793,15.0653,10.9443,-9.9793,6.1957,26.7478,22.1552,1258
-3.8456,-9.8383,7.5906,8.9568,-9.8383,8.6642,22.2903,18.9528,1259
-6.8243,-10.2035,11.2116,11.9841,-10.2035,2.2574,33.0026,27.478,1260
0.665,-10.1075,10.0255,11.1158,-10.1075,14.6974,35.2297,26.2048,1261
-4.7267,-9.6729,2.3253,6.5208,-9.6729,5.7489,32.5806,29.7329,1263
-10.0059,-9.5777,2.0674,9.1119,-9.5777,7.7857,33.648,23.3663,1264
-5.969,-10.1869,0.0176,3.0432,-10.1869,3.6068,27.687,24.3199,1265
-6.2704,-9.9836,3.0597,4.2194,-9.9836,4.1568,29.8081,16.6959,1266
-11.0438,-9.859,2.2986,4.9068,-9.859,1.1249,23.38,11.1909,1268
-0.1132,-10.0655,0.1185,0.1475,-10.0655,0.3671,10.7205,9.6983,1269
-8.341,-9.8822,4.1316,7.0063,-9.8822,7.9193,39.4159,29.9607,1270
-17.6893,-9.7214,-9.7963,4.0881,-9.7214,1.1264,9.4671,7.8252,1271
0.1197,-9.7356,6.2059,4.1836,-9.7356,2.2099,27.4661,25.123,1272
-9.9644,-9.8275,-0.2331,2.8264,-9.8275,3.6187,29.2037,10.8584,1274
-22.7162,-9.936,-4.7186,9.3884,-9.936,6.6383,78.1292,43.0219,1275
-29.3612,-9.964,-9.4286,12.7182,-9.964,7.9673,72.2343,43.046,1276
-57.1107,-9.2931,-16.3644,25.5654,-9.2931,13.629,53.44,31.3263,1277
-6.2185,-9.9605,1.1471,3.9979,-9.9605,4.4309,9.2418,7.6951,1278
-6.7462,-9.8899,2.0097,5.9944,-9.8899,3.1805,19.9743,9.9848,1280
-4.2312,-9.9655,1.0517,3.188,-9.9655,3.575,48.7845,11.6457,1281
-4.9085,-9.9677,1.0589,3.8357,-9.9677,6.12,12.4544,9.6362,1282
-5.1111,-9.8642,2.5841,4.0231,-9.8642,6.3076,27.545,13.4475,1284
-1.9007,-9.8858,0.3602,1.2559,-9.8858,1.868,28.057,16.3204,1285
-2.0631,-9.8931,1.0699,1.964,-9.8931,1.9312,29.7301,27.7219,1286
-0.5708,-9.9551,1.5765,2.1574,-9.9551,3.4501,15.4717,14.0032,1287
-2.615,-10.0853,-0.6447,1.2522,-10.0853,1.5995,25.0165,23.381,1288
-32.6696,-9.7588,-3.4384,13.4147,-9.7588,8.5114,14.564,8.2406,1289
0.834,-9.8082,2.3489,1.0817,-9.8082,0.977,4.5358,3.1165,1291
-2.4826,-9.8365,1.1632,1.6476,-9.8365,2.5048,5.2147,3.6408,1292
0.3413,-9.8398,0.5555,0.1152,-9.8398,0.2183,2.6194,2.4751,1293
0.227,-9.8484,0.3543,0.0781,-9.8484,0.1393,2.4424,2.3483,1294
0.2055,-9.8451,0.2276,0.0233,-9.8451,0.0475,2.2902,2.268,1295
-0.2287,-9.8523,0.0387,0.1562,-9.8523,0.3789,2.3461,2.2397,1296
-0.5889,-9.8544,0.008,0.2711,-9.8544,0.7406,2.5951,2.2716,1298
-12.905,-9.8735,-0.5996,3.1343,-9.8735,6.9627,62.7414,2.3639,1321
-0.2627,-9.8625,-0.0148,0.1421,-9.8625,0.4274,2.3215,2.263,1322
-0.027,-9.8556,0.0792,0.0679,-9.8556,0.1887,2.2975,2.2396,1330
-0.0237,-9.8552,0.1707,0.1365,-9.8552,0.3933,2.4333,2.2605,1331
-4.3129,-9.8643,-0.6214,1.4662,-9.8643,2.7579,6.291,2.3675,1332
-7.133,-9.8116,-0.8787,3.5625,-9.8116,3.857,7.4982,5.3204,1333
-5.8475,-9.8151,0.6186,3.9595,-9.8151,3.8816,6.2172,5.2459,1334
-12.9858,-9.8174,-1.7521,3.758,-9.8174,3.6402,8.1509,3.379,1335
-8.1213,-9.8998,-0.6286,2.3074,-9.8998,3.765,52.3981,10.3332,1336
-9.0537,-9.8779,0.5717,4.2988,-9.8779,10.6415,62.6505,42.968,1337
-5.3308,-9.9233,-0.0024,2.7705,-9.9233,3.3317,76.6629,71.1345,1338
-6.5393,-9.8693,1.2926,4.8942,-9.8693,7.0687,61.0645,57.9521,1339
-4.6167,-9.8881,3.6658,6.5882,-9.8881,4.9914,48.4701,11.223,1340
-1.715,-9.9148,1.2883,2.6091,-9.9148,2.569,10.4573,7.7891,1341
2.1276,-9.7263,3.7675,0.9982,-9.7263,0.5224,11.8202,7.7454,1342
-1.8771,-9.8706,1.4926,2.9094,-9.8706,3.6172,16.8454,10.1371,1343
-0.4067,-9.9179,0.014,0.2827,-9.9179,0.7344,12.1059,9.7716,1344
-0.1636,-9.7312,0.2177,0.3131,-9.7312,0.921,18.9428,14.0455,1345
-5.6606,-8.4592,1.1745,6.1041,-8.4592,3.9649,60.7088,19.8422,1346
-0.5409,-10.0336,11.4323,12.0897,-10.0336,7.9152,46.4341,42.178,1348
-3.8536,-9.5779,2.1373,3.8619,-9.5779,1.7774,17.3251,8.9378,1349
-2.5056,-9.7003,6.0001,7.4162,-9.7003,7.6523,24.3805,14.5182,1350
-2.2762,-9.5972,0.1691,1.8628,-9.5972,3.0978,29.6052,21.2057,1351
-5.2449,-8.6574,2.8579,5.1539,-8.6574,7.0545,53.0622,16.2123,1352
-21.3768,-9.7701,5.9746,13.9645,-9.7701,5.3934,29.3957,22.7474,1353
-5.8949,-9.998,11.852,8.3071,-9.998,11.5359,62.3206,37.956,1354
-7.1442,-9.8853,-0.1379,2.681,-9.8853,3.875,21.8719,14.7026,1355
-0.373,-9.8289,6.8661,5.6915,-9.8289,3.5436,11.2394,9.5918,1356
-7.7285,-9.2129,6.0206,10.1813,-9.2129,8.0665,37.8964,23.1812,1357
-3.9481,-9.4117,2.8243,6.1982,-9.4117,6.7373,34.5539,20.7264,1358
-4.3366,-10.0376,0.9024,3.5301,-10.0376,5.752,18.9364,12.0384,1359
-6.9782,-9.7294,0.289,4.1036,-9.7294,3.6142,16.8415,10.0191,1360
-88.6049,-9.8983,-2.0843,44.9977,-9.8983,18.3227,83.3289,30.4067,1361
-35.7277,-9.8114,-0.3813,18.5593,-9.8114,9.7658,65.3966,34.1997,1362
-43.493,-9.9197,-21.3788,19.1812,-9.9197,11.584,71.4448,62.2795,1363
-34.3436,-9.8406,-5.7271,15.026,-9.8406,8.6771,22.6604,10.3697,1364
-15.904,-9.8339,-2.3228,11.5643,-9.8339,11.4987,19.7198,11.6547,1365
-140.3758,-9.6138,-7.9928,65.0726,-9.6138,21.691,41.2943,16.2253,1366
-8.1831,-9.5194,11.6317,17.8466,-9.5194,4.4627,19.424,16.526,1367
3.3064,-9.7062,17.5871,14.3223,-9.7062,6.0272,21.6877,19.5805,1368
-23.5333,-9.8682,-3.7979,11.9435,-9.8682,4.6122,13.3921,10.642,1369
-1.2859,-9.872,0.5262,0.9919,-9.872,4.5447,13.7108,4.6511,1370
-3.5079,-9.7456,-1.4786,1.6015,-9.7456,2.0375,6.9149,4.5803,1371
-11.2278,-10.0629,-0.8059,4.2745,-10.0629,4.2302,16.7173,4.4488,1372
-3.2032,-9.8513,-0.5419,0.9534,-9.8513,2.3061,5.6361,2.6973,1373
-31.1246,-9.8132,0.8337,10.1499,-9.8132,5.3883,26.0209,5.7236,1374
-21.3005,-9.7808,0.3312,9.4779,-9.7808,7.9992,20.0867,15.009,1375
-8.0073,-9.9386,-1.0684,3.3208,-9.9386,5.1125,10.3508,7.9372,1376
-1.1845,-9.8422,8.4128,4.5308,-9.8422,1.2758,32.2918,27.0091,1377
-9.3281,-9.844,0.1504,5.8877,-9.844,9.0853,34.0258,13.0658,1378
-28.3546,-9.7318,-6.1399,13.4123,-9.7318,5.8219,59.769,49.6048,1380
-6.818,-9.7379,4.2616,7.5445,-9.7379,5.5284,26.8616,11.3769,1381
-4.3991,-9.7724,0.0739,4.5358,-9.7724,1.2723,14.9124,13.1108,1382
-18.4776,-9.8671,-2.9911,6.9447,-9.8671,5.7486,24.9661,18.459,1383
-5.7934,-9.9665,3.0198,8.8131,-9.9665,4.9787,38.1712,25.1043,1384
-24.7638,-9.7529,1.856,15.5638,-9.7529,10.8044,42.2964,25.7771,1385
-33.7667,-9.8524,-0.3501,13.1385,-9.8524,10.701,18.1077,10.4851,1386
-23.4165,-9.8383,-0.5749,11.6613,-9.8383,6.7589,12.3022,5.7458,1387
-9.6942,-9.8472,-0.5572,1.9949,-9.8472,2.3398,7.401,3.035,1388
-4.5597,-9.8745,-0.4658,1.3013,-9.8745,2.1578,4.9668,2.8803,1389
-2.2413,-9.8759,-0.0818,1.0242,-9.8759,1.0728,3.7406,2.3444,1390
