AYGX_min,AZ_mean,AYGX_mean,AYGX_std,AZ_mean.1,GX_std,Gnorm_max,Gnorm_median,timestamp
-4.2238,-9.8848,2.3658,5.0298,-9.8848,4.4972,29.094,9.0642,672
-173.6518,-9.4919,-50.2695,43.4679,-9.4919,8.0105,43.7905,28.8744,673
-248.997,-9.2636,-40.5172,90.392,-9.2636,23.004,73.8488,30.7221,675
-74.3555,-8.4208,-41.9948,19.7816,-8.4208,3.7228,68.2662,64.7548,676
-66.3865,-9.1071,-14.9878,25.2572,-9.1071,6.9775,59.3737,56.1625,677
