AYGX_min,AZ_mean,AYGX_mean,AYGX_std,AZ_mean,GX_std,Gnorm_max,Gnorm_median,timestamp
-2.3915,-9.8568,-1.437,0.546,-9.8568,0.2362,3.7027,3.4315,2
-2.2189,-9.8578,-1.4373,0.3043,-9.8578,0.1387,3.622,3.4386,3
-1.964,-9.8564,-1.4141,0.2576,-9.8564,0.1286,3.5649,3.4312,5
-1.6185,-9.8564,-1.4142,0.11,-9.8564,0.0533,3.5019,3.4165,6
-1.5247,-9.8566,-1.4134,0.0613,-9.8566,0.0361,3.4874,3.4308,7
-1.4829,-9.8566,-1.416,0.0491,-9.8566,0.0464,3.4948,3.4289,8
-1.4436,-9.8567,-1.3961,0.0372,-9.8567,0.0265,3.4222,3.4005,9
-71.5532,-9.7135,-16.8389,22.6418,-9.7135,7.6537,26.7098,6.9034,10
-10.0419,-9.7211,7.1696,13.7076,-9.7211,9.6045,23.6019,8.6023,11
-35.8596,-9.8173,0.8568,17.0383,-9.8173,17.3078,66.8877,17.7327,12
-114.2357,-9.8636,-22.4817,37.3115,-9.8636,12.3627,57.9219,20.1102,13
-77.341,-9.453,-9.1645,31.6868,-9.453,11.3185,61.8429,41.4344,15
-29.5913,-9.7451,-5.6431,14.2402,-9.7451,8.4988,46.7159,40.493,16
-5.207,-9.8211,1.4488,4.6676,-9.8211,5.6138,27.1994,20.6876,17
-12.3345,-9.8566,-2.9147,4.4575,-9.8566,5.0917,26.4926,13.0171,18
-35.9091,-9.8401,-4.284,10.835,-9.8401,7.7308,13.8036,6.8655,19
-15.9646,-9.8159,-0.9459,6.3329,-9.8159,5.0247,9.686,4.1102,20
-3.5102,-9.8546,-1.5121,1.081,-9.8546,0.7584,4.4151,3.4452,21
-25.2383,-9.792,-6.0532,9.3535,-9.792,5.5314,11.6937,4.8179,23
0.3086,-9.8277,1.5038,0.9853,-9.8277,0.8047,4.0263,3.5164,24
-7.0259,-9.8807,-1.0168,2.3871,-9.8807,2.3033,8.5291,6.0171,25
-2.7133,-9.8709,-2.3002,0.3202,-9.8709,0.2615,5.2589,4.9187,26
-3.3071,-9.8458,-2.3381,0.664,-9.8458,0.7178,4.524,3.9769,27
-2.6869,-9.8407,-2.1047,0.3686,-9.8407,0.2888,3.9058,3.5466,28
-4.2156,-9.8249,-3.6782,0.472,-9.8249,0.3075,4.6795,4.4114,29
-29.1274,-9.792,2.028,19.1562,-9.792,8.081,22.2352,9.0722,31
0.9558,-9.9313,3.6511,2.1534,-9.9313,0.9355,18.8366,13.7694,32
-12.6936,-9.8758,-3.2008,4.8703,-9.8758,3.4425,23.9728,18.6818,33
-0.7679,-10.1281,4.8825,3.8306,-10.1281,2.8657,40.5336,29.9033,34
-2.4899,-9.7644,0.5425,2.129,-9.7644,2.558,17.4676,12.5854,35
-24.0949,-9.892,17.1665,24.9268,-9.892,20.8228,54.8721,36.4773,37
-40.9169,-8.8745,14.4611,30.2414,-8.8745,29.5127,63.8451,34.5497,38
-3.2368,-9.8492,8.2394,8.1367,-9.8492,5.1924,23.7375,22.2321,39
-4.8443,-9.2457,1.0663,7.1668,-9.2457,3.1935,16.8388,8.068,40
-42.8839,-7.8031,-3.3247,22.8072,-7.8031,4.0891,27.2679,17.2285,41
-10.6239,-8.4395,1.967,10.5225,-8.4395,9.6741,25.1143,12.6479,42
-22.8726,-8.5357,1.4014,12.9978,-8.5357,14.9919,33.9549,25.2869,43
-3.33,-8.7341,0.8065,2.1298,-8.7341,3.74,14.2521,9.3734,44
-3.1018,-7.9485,0.802,3.1405,-7.9485,2.5433,21.9273,9.881,45
-3.1242,-9.8352,1.5001,4.4911,-9.8352,5.2128,18.7285,7.6286,47
-14.673,-9.3398,-3.6273,5.0039,-9.3398,4.8994,10.2484,7.1709,48
-19.3805,-9.6242,-1.7163,8.8194,-9.6242,10.1532,32.1527,26.9373,49
0.4783,-9.9502,7.3571,4.8037,-9.9502,2.6682,17.1676,13.0227,50
-1.2616,-10.795,0.6149,1.5256,-10.795,2.171,11.9094,6.7637,51
-6.2797,-9.6656,6.1584,8.8379,-9.6656,2.4761,24.2901,19.287,52
-4.577,-9.8448,4.8046,10.2796,-9.8448,8.3856,22.0891,12.2364,53
-43.2931,-10.2376,9.5727,21.5919,-10.2376,15.685,43.2816,21.8555,55
-46.2525,-10.0176,6.6389,21.3426,-10.0176,19.6217,37.586,29.9779,56
-79.4266,-9.427,12.8227,40.794,-9.427,28.7341,53.9067,33.1222,57
-23.1014,-9.689,4.2028,17.2326,-9.689,8.1588,35.5698,27.5503,58
-9.2518,-9.7336,2.9274,6.9792,-9.7336,4.0312,20.3989,16.6082,59
-11.3064,-10.2058,7.8997,9.5538,-10.2058,2.5544,17.9872,14.1653,60
-12.6935,-9.7289,0.1235,4.0881,-9.7289,3.213,17.2472,8.8458,61
-7.5947,-8.4437,4.0281,10.0634,-8.4437,9.854,34.1593,21.5323,62
-7.4888,-10.2517,-1.0499,2.8551,-10.2517,2.7015,9.9645,6.3848,63
-6.9556,-9.8429,-0.1713,2.9808,-9.8429,6.1981,28.7114,7.1041,65
-4.2891,-9.8489,13.0995,10.5552,-9.8489,14.9078,31.4337,24.2324,66
-11.6524,-9.5137,7.6431,13.2836,-9.5137,6.6505,31.0243,29.6182,67
-23.8618,-8.1477,13.6644,23.4483,-8.1477,2.2842,42.1146,31.949,68
-1.6895,-10.0863,2.4495,3.6165,-10.0863,0.8763,19.077,12.3266,69
-3.1221,-9.5142,-0.1121,2.3973,-9.5142,2.8931,33.8387,32.5785,70
-22.9047,-9.6081,10.8344,18.2318,-9.6081,11.2641,38.2564,28.0728,72
-41.2479,-11.078,-13.4365,20.199,-11.078,3.685,46.8389,24.0608,74
-20.114,-9.2958,4.4167,11.8697,-9.2958,5.1913,62.2581,34.5616,75
-37.3046,-9.7704,-0.1088,8.758,-9.7704,3.1719,16.4201,8.8239,76
-2.8407,-9.787,0.5601,1.9156,-9.787,2.1198,11.6963,7.5223,77
-11.0013,-9.9907,5.0778,10.3654,-9.9907,2.4381,25.9548,16.0646,78
-0.009,-10.1837,7.9704,7.5918,-10.1837,5.9807,21.0277,18.168,79
-6.2287,-9.7525,3.4733,6.6478,-9.7525,4.0909,19.9657,16.1779,80
-3.5334,-9.7154,4.0148,5.4699,-9.7154,6.6256,10.8745,7.6858,81
-18.9264,-10.0838,3.3334,15.8986,-10.0838,8.4601,20.4965,16.5809,82
-4.0558,-9.0484,-0.9917,1.88,-9.0484,2.8292,9.1114,5.1849,83
-22.0609,-9.6907,3.4014,11.6497,-9.6907,10.5097,21.2679,16.3629,84
-28.8733,-9.6719,-0.7672,17.1048,-9.6719,3.0353,19.9047,13.5489,85
-17.7468,-9.9934,-1.3273,4.4553,-9.9934,3.5918,13.4394,6.3159,86
-5.549,-9.2663,-1.0622,2.0211,-9.2663,2.3649,20.8734,6.242,87
-29.9069,-10.3773,-4.361,12.4163,-10.3773,10.1996,21.9119,10.5724,88
-5.322,-9.8475,-1.0769,2.2749,-9.8475,2.4713,17.2602,9.1749,89
-9.0544,-9.8885,1.9746,5.6698,-9.8885,8.8339,22.9385,10.6082,90
-6.8621,-9.8389,0.5157,3.6034,-9.8389,6.5762,13.5737,10.4505,91
-1.9428,-10.139,0.2622,1.539,-10.139,2.1114,12.3093,6.3474,92
-6.8431,-9.8565,4.2971,8.3206,-9.8565,12.0677,26.335,16.2984,93
-6.8809,-10.1828,2.7688,7.5686,-10.1828,6.2603,20.5544,14.4296,94
-6.2087,-9.9191,1.6574,3.886,-9.9191,7.472,18.4229,8.9684,95
-7.3775,-9.8782,2.627,6.2665,-9.8782,8.6027,17.5978,12.5467,96
-5.111,-9.4227,5.9039,6.8863,-9.4227,11.0645,21.5183,12.6584,97
-2.3159,-9.9418,-0.3443,0.954,-9.9418,2.3386,6.8477,5.1104,98
-13.1911,-9.8635,27.9198,43.665,-9.8635,25.2206,49.0219,32.0816,99
-27.23,-10.0184,20.2474,31.3282,-10.0184,9.8658,38.4776,25.9153,100
-10.7709,-9.6237,14.9692,23.7629,-9.6237,8.2148,37.5677,22.198,101
-11.778,-10.1784,-1.5482,8.6966,-10.1784,8.196,18.286,11.2631,102
-21.3732,-9.9243,0.6459,11.2432,-9.9243,12.8091,27.8624,13.227,103
-9.2432,-9.8148,0.3744,4.4713,-9.8148,7.7701,19.2339,12.0255,105
-16.4909,-9.9062,3.5391,6.9871,-9.9062,9.9395,21.2445,12.7659,107
-4.7587,-9.9001,4.4548,5.9702,-9.9001,9.3458,17.9814,11.3421,108
-6.3325,-9.9014,8.9258,11.2239,-9.9014,13.5145,22.8696,16.9648,109
-0.3033,-9.8542,7.7164,11.0658,-9.8542,11.1177,26.89,15.8443,110
-1.7068,-9.8546,9.585,7.3127,-9.8546,1.838,15.0876,11.8452,111
-4.7502,-9.881,6.7659,8.4025,-9.881,11.4136,23.738,15.3902,112
-6.6733,-9.7365,0.6245,3.711,-9.7365,5.0888,17.1321,12.6736,113
-18.5521,-9.7555,1.7227,8.8331,-9.7555,8.9977,22.6749,13.2184,115
-6.6875,-9.9869,2.161,4.7232,-9.9869,3.6122,15.3921,9.4107,116
-5.8549,-10.2067,4.4619,11.1009,-10.2067,11.1103,26.8119,15.6093,117
-30.3736,-9.6977,2.6874,18.8574,-9.6977,14.7538,25.5412,17.2633,118
-12.5106,-10.2926,1.0652,8.5736,-10.2926,5.3649,15.2935,10.2264,119
-29.6159,-9.9577,-1.2335,10.9907,-9.9577,5.1836,18.2014,6.4871,120
-5.89,-9.8711,0.8437,4.2205,-9.8711,6.2268,11.666,8.5648,121
-27.189,-8.8516,-5.3127,9.5169,-8.8516,5.4879,26.0183,9.4081,122
-5.2545,-9.2941,2.4708,5.0951,-9.2941,3.0878,18.6012,11.3339,124
-10.7637,-9.5911,0.9054,8.0402,-9.5911,6.9186,12.2888,8.7415,125
-40.0627,-9.0783,-1.5683,13.3822,-9.0783,6.2762,21.2109,9.405,126
-31.2079,-9.8491,11.1649,26.4474,-9.8491,20.8249,37.0005,28.6609,127
-15.1184,-9.8314,0.5604,8.6551,-9.8314,11.2843,23.3118,13.4436,128
-4.6008,-9.6941,1.3107,5.3341,-9.6941,4.503,15.6646,13.2909,129
-7.8795,-9.6068,17.0927,15.8249,-9.6068,6.7583,25.2497,23.5442,130
-38.637,-8.9985,6.1277,37.0607,-8.9985,21.5589,34.7842,24.4943,131
-11.9733,-9.2233,-1.5901,7.4224,-9.2233,8.6043,26.3021,10.3881,132
-27.3143,-9.8504,-1.6084,11.6705,-9.8504,4.3767,20.3979,10.284,133
-26.4033,-9.8528,-3.0386,10.2308,-9.8528,10.7672,23.1567,9.6593,134
-0.2353,-8.8983,2.1821,4.2199,-8.8983,2.5394,15.5712,8.1532,135
-15.7997,-10.0027,3.4287,10.4774,-10.0027,11.6107,37.4948,19.8225,136
-0.2359,-7.7538,20.633,16.6565,-7.7538,5.6168,46.1976,28.6588,137
-6.3094,-10.3794,6.2319,12.0066,-10.3794,4.4314,24.6908,19.9082,138
-3.4719,-8.1822,4.7521,10.1331,-8.1822,5.6026,30.8089,23.0705,139
-16.2128,-10.19,-3.1851,7.956,-10.19,6.9516,13.3232,8.7678,140
-10.076,-9.5519,-2.3596,4.9346,-9.5519,3.8156,24.2956,19.208,141
-3.865,-9.4771,2.3154,8.1126,-9.4771,8.3898,24.1796,12.7049,142
-10.8034,-8.5027,-0.2239,4.0098,-8.5027,6.3356,21.8521,14.051,143
-16.6513,-9.8048,0.7102,8.2018,-9.8048,5.8643,26.0911,13.9981,144
-1.2831,-9.8143,1.2327,1.7541,-9.8143,1.6345,9.2831,7.6128,145
-11.7694,-9.5632,-0.9788,4.2406,-9.5632,5.6419,22.1301,11.0147,146
-11.2196,-9.5311,0.6643,5.7256,-9.5311,2.9366,21.5231,8.4979,147
-18.7631,-9.8298,-0.7328,8.9948,-9.8298,6.1041,18.3822,9.3497,148
-7.7798,-9.948,-0.4768,2.5143,-9.948,1.5663,12.693,8.3646,149
-3.3378,-9.7026,1.6262,3.1694,-9.7026,3.0067,11.6453,8.7918,150
-13.5858,-10.0123,-1.8008,4.7238,-10.0123,5.2207,13.4343,5.588,151
-1.308,-9.937,0.9314,2.0848,-9.937,2.96,11.2628,8.6675,152
-4.9809,-9.7267,3.1775,4.8345,-9.7267,2.8999,25.2521,11.6123,153
-4.8905,-9.9577,1.5799,3.8437,-9.9577,4.6363,13.9373,11.3259,154
-13.465,-9.8003,1.8413,7.1055,-9.8003,6.0447,17.6438,12.0588,155
-17.8499,-10.0033,0.257,5.821,-10.0033,5.4611,17.0236,10.8976,156
-15.0975,-9.8606,2.8376,6.964,-9.8606,3.319,16.6607,12.7756,157
-3.9562,-9.5029,-0.2224,1.5075,-9.5029,3.4301,14.2855,8.0602,158
-4.0304,-9.6508,5.963,9.8267,-9.6508,2.7574,16.2685,12.3561,159
-2.658,-9.6459,-0.1649,1.8155,-9.6459,0.8738,10.2929,7.187,160
-29.7293,-6.3311,-3.8955,11.7079,-6.3311,6.3015,51.7842,33.7164,161
-11.4911,-9.7586,1.9244,7.9159,-9.7586,15.401,35.0123,17.3961,162
-0.7661,-9.873,3.3962,3.4616,-9.873,8.063,23.985,14.6484,163
-4.8634,-9.993,3.0339,6.1603,-9.993,7.0796,21.8009,12.2269,165
-5.6667,-10.1135,0.2625,3.0823,-10.1135,4.8584,16.2193,9.9546,166
-8.4103,-9.8396,2.8018,6.1377,-9.8396,8.2892,22.9153,11.7538,168
-12.2052,-9.8716,-0.4161,2.9211,-9.8716,3.2758,11.9104,6.2451,169
-6.968,-9.5054,-0.808,3.7136,-9.5054,5.1896,21.9769,7.8674,170
-8.6747,-9.6198,-0.2011,3.8878,-9.6198,7.5064,15.1006,12.7793,172
-6.2825,-7.4806,0.6206,3.3556,-7.4806,2.6534,14.8545,11.7978,173
-4.4127,-9.7218,-0.1977,2.053,-9.7218,5.0626,24.5195,10.0209,174
-14.2246,-9.3311,-0.1022,6.371,-9.3311,6.2735,18.9657,8.1911,175
-5.5917,-9.4698,0.9608,3.209,-9.4698,5.4887,23.0061,9.1593,176
-25.8174,-8.9522,2.4916,10.1619,-8.9522,10.8952,23.4512,14.4538,177
-15.9589,-7.0054,-0.5712,6.4431,-7.0054,6.4919,50.5911,13.1723,178
-23.0851,-7.4346,0.2286,15.3251,-7.4346,6.5881,29.9066,19.9886,179
-31.3112,-9.7247,0.4503,9.2671,-9.7247,7.96,20.0705,14.6914,181
-2.5469,-9.5871,-0.0751,2.0758,-9.5871,2.8524,14.18,6.0182,182
-6.5202,-9.9535,-1.0142,1.9127,-9.9535,2.6574,14.5828,6.0017,183
-0.8678,-9.4065,0.4513,1.9066,-9.4065,2.6295,8.4129,6.344,184
-5.383,-9.8474,1.9472,4.1349,-9.8474,7.4291,16.747,11.6486,185
-7.697,-9.8671,-0.099,3.2192,-9.8671,2.8403,18.0189,10.75,186
-3.0913,-9.8564,1.9251,3.1222,-9.8564,3.379,15.0199,12.4233,187
-11.0663,-9.2261,-1.3692,6.9054,-9.2261,1.9279,16.162,12.9251,188
-13.2763,-9.8192,-2.6554,4.9059,-9.8192,5.3718,19.549,10.9149,189
-0.9982,-9.8137,1.0842,1.6628,-9.8137,3.2637,12.2016,9.3218,190
-5.4234,-10.1734,-2.7408,2.2414,-10.1734,2.5039,18.1287,11.4459,191
-3.9813,-9.4895,0.0338,2.1446,-9.4895,3.6763,13.8775,8.1194,192
-3.2806,-7.4253,2.1835,4.4431,-7.4253,3.7598,40.9581,12.4326,193
-3.6484,-9.2825,0.7429,3.2148,-9.2825,3.4633,12.5248,10.0321,194
-4.3793,-9.9251,1.7722,2.9869,-9.9251,6.1398,17.5407,12.6738,195
-2.6856,-9.6801,0.2976,1.9555,-9.6801,3.1217,16.6909,10.302,196
-0.9839,-9.4886,1.8563,2.752,-9.4886,5.4974,17.0288,13.1222,197
-2.5762,-10.0413,2.5753,5.9025,-10.0413,3.2484,19.8732,12.8492,198
-2.0898,-9.9563,0.3554,1.866,-9.9563,1.0286,9.3247,8.7762,199
-2.7861,-9.9118,-0.5022,1.2122,-9.9118,1.8512,19.9058,9.3042,200
-4.8383,-10.0691,-1.2475,2.0345,-10.0691,2.2189,14.1022,8.2523,201
-2.1279,-10.1191,0.4828,2.6105,-10.1191,2.754,11.5811,8.92,202
-2.4687,-9.6134,0.5067,2.8563,-9.6134,2.5638,10.0959,7.8394,203
-4.3109,-10.0361,1.7456,4.046,-10.0361,7.8914,22.6681,13.5572,205
-15.2914,-10.0163,0.3273,10.0497,-10.0163,10.3107,19.2791,12.2443,206
-5.4187,-9.9329,0.7947,2.8269,-9.9329,6.3589,16.3392,9.1723,208
-4.6718,-9.8562,-0.3851,2.5278,-9.8562,5.2478,17.3098,10.0446,209
-1.0864,-9.9921,0.6258,1.4461,-9.9921,4.4514,10.6349,4.3601,210
-3.7149,-9.713,1.2144,4.1106,-9.713,6.6826,20.3604,14.2472,211
-4.0905,-9.683,-0.1626,1.6883,-9.683,3.7672,14.4368,10.7019,212
-4.1396,-10.0548,1.6705,3.654,-10.0548,6.5883,17.6994,14.0186,213
-3.6802,-9.9207,-0.1062,1.2994,-9.9207,3.8854,10.1291,6.688,215
-5.6391,-8.8537,0.7875,3.9995,-8.8537,4.8075,12.9537,8.1169,216
-6.9973,-8.4774,-0.5535,2.3799,-8.4774,2.851,14.4438,6.3132,217
-0.052,-9.84,2.0482,1.7553,-9.84,3.4199,8.644,7.1233,218
-0.9448,-10.0191,1.1181,1.3048,-10.0191,1.7461,12.337,9.5815,219
-2.3824,-9.4705,0.1796,2.2041,-9.4705,3.7624,17.8725,13.8084,220
-2.6107,-8.1242,-0.7021,1.1433,-8.1242,1.3876,13.9366,11.7103,221
-5.822,-9.9956,0.7253,4.4405,-9.9956,3.0628,28.2479,19.8,222
-7.949,-9.8003,-0.6973,2.8621,-9.8003,2.9513,33.3653,25.5799,223
-8.0926,-10.1978,0.4178,3.8116,-10.1978,4.4461,37.3491,28.6883,225
-18.894,-9.0805,10.918,19.7521,-9.0805,13.2992,40.4221,18.0016,226
-10.2739,-8.4266,1.6736,12.3646,-8.4266,5.7547,21.3851,13.3791,227
-11.2588,-9.7615,1.6545,11.3842,-9.7615,2.0878,23.51,17.545,228
-7.6289,-9.8011,-0.6808,7.078,-9.8011,3.5571,33.0167,31.218,229
-3.4977,-10.8261,2.3658,4.6706,-10.8261,1.9347,35.9683,34.0829,230
-8.5965,-10.3639,2.1707,5.9098,-10.3639,2.6762,45.8986,38.9361,231
-16.5261,-9.6333,18.4431,38.9072,-9.6333,10.4997,52.1228,29.565,232
-2.3873,-10.2842,0.2421,2.2272,-10.2842,2.8812,22.6009,17.5037,233
-19.4776,-8.9787,4.2547,18.5218,-8.9787,7.82,29.4746,22.3254,235
-30.4624,-9.2941,-0.4365,10.8036,-9.2941,13.6472,34.2719,19.6951,236
-17.5371,-9.3026,20.2682,34.6235,-9.3026,2.1991,37.8428,34.5763,237
-20.3831,-9.8898,2.4331,15.1649,-9.8898,3.5543,39.8075,30.2957,238
-6.364,-10.9208,-3.7318,1.9713,-10.9208,7.0899,75.6316,60.6461,239
52.2252,-9.5196,73.2174,18.2766,-9.5196,9.6718,47.9685,39.7195,240
-0.4563,-9.8983,2.6898,3.7133,-9.8983,3.4709,18.2457,13.2705,241
-5.4305,-9.4617,11.45,13.7643,-9.4617,2.55,31.3919,22.2856,242
-3.6185,-9.9626,-0.0306,1.9293,-9.9626,3.433,16.967,13.004,243
-4.6924,-9.9872,0.741,2.3608,-9.9872,1.8937,16.8025,8.9603,244
-9.1912,-9.8798,2.7429,6.5543,-9.8798,9.5304,22.6974,12.7948,245
-38.093,-9.7989,-12.9455,8.9667,-9.7989,5.6904,23.9565,9.1872,246
-14.7461,-9.7583,1.4491,9.128,-9.7583,5.3954,11.358,6.0174,247
-11.9576,-9.8318,-5.2271,2.728,-9.8318,1.8115,6.8363,4.8994,248
-5.0035,-9.7732,-2.8112,1.3959,-9.7732,1.0383,4.6776,3.8456,249
-5.2474,-9.7528,-1.9504,2.0281,-9.7528,1.0208,3.9724,2.9344,250
-8.2299,-9.7436,-6.9382,0.753,-9.7436,0.1992,5.0325,4.7942,251
-3.3748,-9.6538,6.9083,5.4384,-9.6538,2.9015,10.3019,6.7579,252
-28.5599,-9.9517,-5.0228,14.1095,-9.9517,8.6526,24.6746,14.0837,253
-27.9482,-9.7325,-0.7917,10.4709,-9.7325,8.6714,33.1466,13.2341,255
-42.5028,-9.8774,12.3947,25.43,-9.8774,15.0897,60.3326,28.063,256
-9.9396,-9.851,2.0721,6.3495,-9.851,8.6088,23.2557,17.945,257
-10.5435,-10.0084,0.5569,4.4873,-10.0084,8.8025,27.2544,14.1558,258
-4.6495,-9.6876,0.6992,2.4783,-9.6876,4.586,19.4962,9.5356,259
-7.9108,-9.0267,-0.6203,4.1775,-9.0267,2.652,18.169,11.8256,260
-1.058,-10.0983,-0.2084,0.5975,-10.0983,1.8108,10.8411,10.2211,261
-5.5187,-9.9388,1.9835,6.8671,-9.9388,4.854,17.3532,8.1511,262
-2.6102,-9.9295,2.1266,4.7041,-9.9295,5.0621,14.686,7.4873,263
-8.1552,-9.9524,0.5725,2.4212,-9.9524,4.4278,16.027,6.575,265
-4.9829,-9.3081,0.7288,3.1341,-9.3081,4.122,13.685,8.3083,266
-1.5572,-9.9536,-0.3935,0.807,-9.9536,2.9644,9.7817,7.6406,267
-3.1877,-9.9313,1.1501,2.4814,-9.9313,1.6395,8.7363,6.5695,268
-3.412,-9.882,0.0239,1.5062,-9.882,2.7631,11.1944,4.9277,269
-1.0171,-8.9184,1.1162,1.6218,-8.9184,1.7294,8.392,7.1614,270
-0.886,-9.8563,0.1212,0.5238,-9.8563,3.0726,12.3902,6.4426,271
-7.0117,-8.9096,1.2397,4.973,-8.9096,7.1058,26.6797,13.9839,272
-8.9355,-10.0151,-3.1902,2.8072,-10.0151,4.2815,10.2957,8.3097,273
-5.5729,-9.8656,0.0131,1.3868,-9.8656,2.0557,11.1699,5.6727,275
-0.7903,-9.9261,0.009,0.3866,-9.9261,1.6276,6.5003,3.4896,276
-0.0941,-10.0852,0.071,0.1933,-10.0852,0.9654,7.1835,5.9397,277
-2.9725,-10.0643,-0.4091,1.3502,-10.0643,0.7603,9.6325,8.4659,278
-0.5841,-10.1668,-0.0069,0.3548,-10.1668,0.9431,11.2445,9.563,279
-10.8444,-9.447,-0.2517,4.4877,-9.447,2.6204,15.7335,12.1175,280
-21.2418,-9.6848,-0.3772,12.1047,-9.6848,3.934,15.2322,10.3654,281
-11.8229,-9.9298,0.9902,6.6293,-9.9298,7.6021,24.0751,12.8309,282
-4.5431,-9.7016,4.432,9.6174,-9.7016,8.4152,15.1963,12.6298,283
-9.136,-9.9855,0.2544,4.1038,-9.9855,6.8808,18.6356,13.6469,285
-6.7063,-10.0202,1.601,3.6148,-10.0202,3.4752,13.8587,8.0611,286
-1.113,-9.5678,6.5501,8.2752,-9.5678,6.2643,19.6196,15.9548,287
-1.0547,-9.6326,12.5656,11.9662,-9.6326,13.9157,27.4872,23.2231,288
-10.0946,-9.7741,-0.7737,6.0833,-9.7741,9.3855,28.3101,14.9544,290
-8.6216,-10.4454,-2.2431,3.6801,-10.4454,3.5668,28.0817,13.3077,291
-1.2195,-10.2844,2.1055,2.7116,-10.2844,9.6686,23.0251,17.9702,292
-11.3714,-10.0997,1.575,5.7264,-10.0997,8.6603,14.9856,12.4867,293
-4.3099,-10.1645,-1.8307,1.7175,-10.1645,4.3722,17.0748,13.6576,294
-5.5471,-9.8603,1.4645,3.8925,-9.8603,7.0492,25.3799,10.6964,295
-1.761,-9.9618,0.6361,1.9285,-9.9618,3.9302,16.3819,9.8009,296
-5.0902,-9.7475,0.4253,4.334,-9.7475,1.4547,16.4214,15.3534,297
-3.1916,-10.0142,0.1624,2.238,-10.0142,2.7556,12.4621,6.3267,298
-3.6586,-9.7432,2.5107,3.8598,-9.7432,6.6703,13.0575,9.8063,299
0.1199,-9.939,2.9597,3.3718,-9.939,2.901,11.3299,8.6582,300
-17.2413,-9.3405,2.421,8.3498,-9.3405,1.6361,24.2814,12.1061,301
-1.8806,-9.9528,2.8929,3.5476,-9.9528,1.9384,15.3348,13.0266,302
-0.509,-9.5307,1.2311,2.3653,-9.5307,3.3152,13.3794,8.3095,303
-14.4748,-8.6543,3.8897,10.6762,-8.6543,10.7396,37.8656,17.5857,305
-16.8844,-9.9175,1.9623,10.8441,-9.9175,7.197,17.3245,9.1703,306
-9.3902,-9.6557,-1.9546,4.237,-9.6557,4.7731,13.3737,11.5293,307
-7.0911,-9.8382,-0.4398,3.2169,-9.8382,4.0051,18.2299,9.5434,308
-3.6363,-8.0053,3.0358,4.3851,-8.0053,5.5513,15.4915,14.5442,309
-3.5465,-9.9252,0.2028,1.5934,-9.9252,4.8621,10.676,7.7152,310
-3.2886,-8.7631,-0.2527,1.1404,-8.7631,2.4181,14.8397,7.1451,311
-35.0394,-6.9108,-2.8257,14.8544,-6.9108,6.5479,52.4082,12.8026,312
-1.4591,-9.9637,2.8706,4.0857,-9.9637,8.1501,16.1974,11.0514,313
-6.679,-9.7903,0.6359,3.7376,-9.7903,4.9674,12.5956,8.5937,314
-5.6853,-9.9162,0.8659,3.6154,-9.9162,5.6808,16.1626,9.0598,315
-1.5993,-9.8943,0.3522,1.1331,-9.8943,2.3816,13.6241,5.0344,316
-2.9661,-9.9967,0.2483,1.4414,-9.9967,3.7053,11.9669,5.3295,317
-5.185,-9.8911,1.0274,3.4153,-9.8911,6.7042,15.6336,8.7292,318
-1.9851,-9.7469,0.0478,1.6763,-9.7469,2.1287,6.0469,4.6729,319
-2.7314,-10.3528,0.1189,1.6343,-10.3528,4.0987,12.0054,10.1031,320
-3.5513,-9.7629,0.5817,2.4886,-9.7629,1.0303,11.6155,10.1838,321
-1.3792,-9.8652,0.4582,1.1989,-9.8652,2.8778,7.2242,5.8392,322
-7.7299,-9.9374,-0.8132,3.6556,-9.9374,2.2809,12.9409,9.3285,323
-2.3816,-10.0348,3.8517,5.7269,-10.0348,8.8445,33.2554,20.1097,325
-4.7893,-9.858,-0.7944,1.6792,-9.858,3.0591,21.9562,8.8248,326
-77.1254,-9.3659,7.2497,33.7982,-9.3659,13.911,40.1148,27.081,328
-13.9309,-9.6728,0.2612,7.3558,-9.6728,7.5915,19.1969,11.3915,329
-7.9308,-10.0444,0.4334,3.1152,-10.0444,4.2625,12.1007,8.0837,330
-5.7246,-9.8362,1.2868,4.3009,-9.8362,6.301,33.6454,12.194,331
-4.666,-9.9746,2.3572,5.517,-9.9746,6.8038,23.2942,12.3227,332
-2.8994,-9.6209,2.1156,4.895,-9.6209,3.656,16.9227,6.5896,333
-10.5442,-9.9597,0.2212,4.7247,-9.9597,5.3704,17.5131,12.1562,335
-4.6657,-9.7318,0.9737,2.3418,-9.7318,2.2995,15.2798,8.4752,336
-2.5365,-9.9549,0.3864,1.9254,-9.9549,3.8745,14.6811,8.2403,337
-0.7663,-9.7124,0.7908,1.0641,-9.7124,3.5105,14.2035,10.9598,338
-2.16,-9.8098,0.6428,1.807,-9.8098,2.9096,28.8522,24.2715,339
-0.0003,-9.6792,0.6134,0.6959,-9.6792,1.6251,23.502,19.5285,340
-2.4088,-9.6554,1.0054,3.0084,-9.6554,0.877,47.5642,42.5902,341
-3.4399,-9.8479,2.5516,4.6966,-9.8479,6.6494,21.0116,19.0119,342
-18.354,-9.8698,0.2354,7.2718,-9.8698,2.1545,14.006,9.8131,344
-0.1901,-9.7105,2.1785,1.9421,-9.7105,4.8678,24.2765,12.5714,345
-2.9286,-9.9096,0.5807,1.9818,-9.9096,5.2919,26.0196,13.9224,346
-1.8487,-10.0373,0.4507,1.1893,-10.0373,1.5088,10.8516,6.8622,347
-1.7232,-9.8385,4.6293,2.9667,-9.8385,1.6646,12.5866,11.14,348
-1.8624,-10.3131,-0.3659,1.6358,-10.3131,3.0699,16.3221,10.8801,349
-0.6428,-9.9175,0.4616,1.0176,-9.9175,0.3902,5.4601,4.1937,350
-5.7828,-9.8585,-0.1825,3.155,-9.8585,4.4401,23.777,13.2665,351
-30.7542,-9.8797,-7.326,9.3921,-9.8797,6.1602,23.3812,11.7924,352
-19.3474,-9.8723,-3.2506,9.3071,-9.8723,4.2372,13.2532,10.1187,353
-2.0605,-9.707,5.5923,5.996,-9.707,5.0701,49.9476,15.4959,354
-8.2068,-9.8933,1.5827,4.1626,-9.8933,3.8173,32.4461,8.3433,355
-7.9588,-9.6868,-2.4225,3.3686,-9.6868,6.214,24.2372,9.3139,356
-7.2953,-9.9236,4.582,6.7713,-9.9236,3.8273,33.7279,27.8716,357
-12.9524,-9.8071,1.005,8.6845,-9.8071,7.728,28.5435,24.812,358
-12.1878,-9.7986,0.7295,4.5456,-9.7986,6.5154,15.0746,10.2675,360
-16.9542,-7.4585,2.7876,11.6296,-7.4585,9.3587,39.3247,15.7745,361
-11.5916,-9.8397,-2.6054,3.9485,-9.8397,4.2469,13.9562,8.256,362
-11.3099,-9.8323,5.7104,13.0606,-9.8323,9.5342,29.0597,20.6638,363
-1.3057,-9.7142,0.4997,1.9262,-9.7142,3.8881,9.6549,5.4038,364
-3.2261,-9.874,-0.5477,2.217,-9.874,4.552,12.5042,6.8374,365
-0.905,-9.9582,3.2116,6.0039,-9.9582,6.5778,18.7448,10.7308,366
-2.9256,-10.1207,-0.1105,2.516,-10.1207,3.6795,14.6842,12.0354,367
-7.6807,-9.5622,0.9928,4.2619,-9.5622,6.7386,18.8262,10.7269,368
-10.5761,-9.224,1.1252,6.2506,-9.224,7.6261,25.2495,12.0094,370
-5.615,-9.8485,1.4787,5.5819,-9.8485,4.9392,19.0812,11.6624,371
-15.5247,-10.8222,-1.4566,9.5288,-10.8222,4.3687,27.8449,16.9611,372
-3.208,-10.381,6.9752,9.3084,-10.381,8.2721,26.6049,24.0736,373
-17.0008,-9.8284,-1.3307,9.8974,-9.8284,3.2622,21.7991,16.8412,374
-5.5476,-10.0053,-0.1813,3.0804,-10.0053,2.6926,12.5049,8.219,375
-4.0337,-9.7547,1.8437,4.5504,-9.7547,6.4283,16.134,10.0168,376
-94.2304,-10.4526,-16.0067,33.1725,-10.4526,15.6034,35.6991,22.8686,377
-6.3008,-9.9495,0.8363,4.7798,-9.9495,5.0653,19.4977,9.2703,378
-10.6765,-9.1594,1.101,6.3881,-9.1594,6.0204,24.5272,11.9139,380
-20.4985,-10.0147,3.6739,13.2602,-10.0147,10.0118,29.0765,13.527,381
-3.2281,-8.9167,-0.5649,1.7367,-8.9167,4.3278,29.3729,16.1305,382
-5.655,-9.4884,2.2002,6.4224,-9.4884,3.0656,16.7346,9.158,383
-36.7308,-10.6147,-2.0063,22.1244,-10.6147,6.8831,32.7893,26.0056,384
-3.667,-10.2735,4.1823,5.977,-10.2735,8.7677,28.2879,21.36,385
-38.4329,-9.9533,1.3636,21.2181,-9.9533,6.5532,22.2973,19.15,386
-21.0848,-10.2058,5.5053,13.4223,-10.2058,14.2863,51.6072,20.8931,387
-9.4553,-9.5217,19.3254,31.0763,-9.5217,13.0509,44.5632,28.7782,388
-2.2033,-9.9016,1.1002,3.0315,-9.9016,6.1765,13.1098,8.1041,389
-4.6761,-9.8328,-0.016,2.3321,-9.8328,4.2308,11.7736,5.7489,390
-1.9465,-9.7455,-0.056,0.5014,-9.7455,1.5186,6.8984,3.9369,391
-41.5364,-8.612,-2.4865,14.6893,-8.612,7.4155,63.2369,12.9947,392
-15.0635,-9.9885,4.4017,17.6227,-9.9885,7.1723,31.5257,24.4873,393
-4.3131,-9.9197,-1.947,1.9199,-9.9197,3.911,21.0419,14.274,394
-22.8642,-9.825,4.0177,11.6273,-9.825,1.2159,24.9719,23.8195,395
-13.4251,-10.4436,-2.144,5.9657,-10.4436,3.9193,21.5374,19.7361,396
-16.1156,-10.2172,-0.2743,6.5824,-10.2172,3.9689,20.315,8.846,397
-0.6822,-9.773,0.3699,0.9301,-9.773,3.3394,10.1848,7.3153,399
-7.491,-9.7283,0.5539,3.4407,-9.7283,7.4194,20.409,10.2878,400
-8.0586,-9.9132,-0.5311,2.9643,-9.9132,3.8358,14.8666,6.8028,401
-3.5756,-10.0344,1.901,4.7748,-10.0344,2.818,11.6678,9.8132,402
-22.1057,-10.026,1.2026,11.0937,-10.026,8.8153,30.512,17.3339,403
-5.528,-9.9786,-0.5758,2.808,-9.9786,2.8562,6.7459,4.9188,404
-10.4323,-9.9636,2.0353,6.7891,-9.9636,2.6333,19.737,15.2617,405
-11.4751,-10.0182,1.5119,8.7139,-10.0182,8.9337,19.8142,15.3228,406
-5.6296,-9.2895,-0.5854,2.3071,-9.2895,4.7662,10.7903,6.1169,407
-7.2055,-9.8196,0.2022,2.6792,-9.8196,4.2947,14.4548,8.8938,408
-2.1307,-10.0199,0.2982,2.0123,-10.0199,3.4791,10.9066,7.7665,409
-13.6049,-10.1684,6.8727,14.0376,-10.1684,14.4903,32.8214,26.134,410
-11.4361,-9.97,1.4217,5.5848,-9.97,10.5703,26.2798,17.5465,411
-11.1889,-9.8262,-0.1807,4.7411,-9.8262,5.7622,14.9285,7.6783,412
-1.1585,-10.3585,3.7459,5.5574,-10.3585,5.282,14.6868,13.4545,413
-2.6251,-9.8444,1.3098,2.969,-9.8444,2.3285,11.1555,7.6016,414
-8.5682,-9.7889,-1.3047,4.3624,-9.7889,4.3559,15.1126,12.5979,415
-23.7525,-9.8836,1.6002,9.2747,-9.8836,8.8577,34.4542,15.104,417
-30.0098,-10.0173,-3.0786,12.3079,-10.0173,1.0594,21.0955,17.8618,418
-14.116,-10.1824,2.3475,10.3777,-10.1824,7.9754,40.1426,33.0177,419
-8.3123,-9.9955,4.8586,10.1563,-9.9955,4.5576,24.8559,20.7329,420
-2.5158,-9.5831,0.2226,1.1445,-9.5831,3.0057,34.9612,26.255,421
-1.2764,-10.3068,-0.4684,0.4588,-10.3068,0.7666,31.7908,25.6458,422
-7.7628,-10.0286,-0.2622,4.7449,-10.0286,0.861,28.0398,26.0285,423
-14.906,-9.8722,-0.8485,7.3967,-9.8722,3.459,15.1313,9.7027,424
-18.0925,-9.9236,10.8742,13.4545,-9.9236,12.6167,54.9757,36.7786,425
-29.99,-9.6825,-1.7655,9.7986,-9.6825,6.6422,60.2353,43.365,427
-4.5342,-9.3416,6.7405,9.7614,-9.3416,10.0086,30.4289,17.9617,428
-4.2169,-10.0733,-0.3261,1.2897,-10.0733,3.3463,18.0801,16.1262,429
-4.4804,-10.3823,-0.4113,1.7795,-10.3823,3.9476,24.2267,18.6146,430
-2.5497,-9.3925,4.7248,6.1842,-9.3925,3.9695,28.4717,22.1232,431
-9.7768,-9.8659,-0.6508,3.0197,-9.8659,5.4396,18.7226,12.2839,432
-1.269,-9.3347,5.1636,3.9284,-9.3347,4.1487,27.4166,16.1394,433
-8.2609,-9.6303,4.0644,7.2592,-9.6303,4.7534,20.7793,16.9234,434
-13.2008,-9.7276,-0.6675,3.7375,-9.7276,3.1627,17.4716,10.7878,435
-2.1244,-10.0798,0.6569,1.7769,-10.0798,3.5268,11.5296,7.5413,436
-1.6961,-9.9957,6.473,5.2588,-9.9957,2.0689,20.2959,15.7177,437
-0.8902,-9.9478,1.6174,1.8384,-9.9478,1.1279,13.0623,8.7239,438
-8.0156,-8.3026,-1.2412,5.2057,-8.3026,3.779,18.571,16.2045,439
-0.4349,-10.2865,3.4157,5.837,-10.2865,6.3778,26.5914,23.5277,440
-2.0288,-9.6969,1.8845,2.03,-9.6969,1.296,12.5127,11.2361,441
-2.4564,-9.0992,3.9444,5.1633,-9.0992,8.4081,30.2143,20.0423,442
-4.2087,-9.8933,0.6842,2.4303,-9.8933,2.0065,11.6505,8.0657,443
-5.7822,-9.7227,0.0698,2.721,-9.7227,4.0998,14.7972,8.6206,445
-46.717,-9.1306,2.8253,26.6585,-9.1306,7.7597,28.2616,19.7535,446
-18.5731,-10.1731,-0.7114,12.5687,-10.1731,3.3373,13.8444,9.2822,447
-27.2786,-9.8121,-2.6034,8.7989,-9.8121,6.4595,33.526,11.9394,448
-10.8006,-9.891,2.3771,9.8994,-9.891,7.4967,29.8401,16.2128,449
0.15,-9.8357,3.9691,2.2675,-9.8357,2.8275,25.2423,21.8722,450
-3.9376,-8.5984,-0.0498,2.647,-8.5984,3.4319,18.0928,8.3728,451
-14.7728,-9.8327,3.09,7.9307,-9.8327,7.9115,28.543,14.6596,453
-11.8303,-10.5425,4.791,9.4711,-10.5425,4.4351,20.4367,17.1284,454
-5.2573,-9.658,1.0828,6.6034,-9.658,4.5526,15.3408,9.8237,455
-1.177,-10.5959,3.0524,4.0195,-10.5959,2.2835,16.785,11.4618,456
-1.0953,-9.8669,4.3503,6.015,-9.8669,5.8446,17.6044,15.7567,457
-10.6619,-9.6017,-2.4822,4.7777,-9.6017,6.4724,21.5969,14.5488,458
-2.6728,-9.9759,0.8686,2.5075,-9.9759,2.4839,12.5522,10.1256,459
-2.8061,-9.7663,0.8809,3.4021,-9.7663,5.0183,14.7114,10.2566,460
-0.4214,-10.3946,0.4957,0.862,-10.3946,2.2215,9.0921,8.4464,461
-3.8145,-9.5077,-1.9203,1.4493,-9.5077,5.264,21.6725,14.833,462
-4.7869,-9.8163,0.3473,2.9881,-9.8163,2.4817,16.746,7.3473,463
-2.5922,-9.9385,-0.2125,1.2731,-9.9385,1.2916,9.6169,4.2822,464
-3.6238,-9.7584,1.8449,4.387,-9.7584,5.9504,17.2607,10.1668,465
-5.6008,-9.6828,0.1064,3.6774,-9.6828,4.7896,14.5194,10.2706,466
-2.7306,-10.4185,0.8649,2.0117,-10.4185,4.0275,14.792,11.9219,467
-31.6809,-10.0886,2.7342,16.6256,-10.0886,9.1674,28.5563,23.7163,468
-6.5862,-10.1324,0.2111,4.7918,-10.1324,4.1313,15.5543,8.1115,469
-3.8464,-9.9712,-0.1223,2.7144,-9.9712,4.0585,16.0497,11.2954,470
-0.2056,-10.1541,0.8047,1.0984,-10.1541,2.4261,9.8098,9.0717,471
-3.1696,-9.6971,0.532,2.5739,-9.6971,2.0728,14.8905,8.6513,472
-3.899,-9.9343,1.8817,3.7472,-9.9343,7.6694,15.2592,11.1055,473
-4.7593,-9.991,1.2622,4.7296,-9.991,5.384,21.3245,10.1368,475
-5.6006,-9.7732,0.8975,3.4384,-9.7732,5.9763,16.2477,8.8051,476
-1.5277,-9.1593,-0.3367,0.7183,-9.1593,1.9704,5.8662,3.8817,477
-6.4197,-9.7455,-0.2801,3.8921,-9.7455,4.3444,12.4935,9.0517,478
-1.0927,-10.0108,0.5969,1.8043,-10.0108,3.9281,12.9352,11.0107,479
-1.9404,-10.1639,0.2999,1.8781,-10.1639,5.1146,8.6238,7.1851,480
-3.6618,-9.5818,-0.2757,3.1162,-9.5818,1.9701,7.2243,5.0348,481
-5.8637,-9.751,0.0039,2.3899,-9.751,3.4953,9.4382,5.3875,482
-6.0574,-9.9791,-0.7563,1.5222,-9.9791,2.8604,10.5947,4.9326,483
-36.2509,-9.8621,1.6499,13.2166,-9.8621,7.224,26.1027,13.8658,485
-15.7779,-10.0772,-0.1651,6.2207,-10.0772,6.9889,18.9729,12.2827,486
-1.8386,-9.6236,-0.5593,0.8359,-9.6236,1.6325,10.6664,4.3942,487
-1.1104,-9.7553,0.4849,1.1048,-9.7553,4.073,12.392,6.519,488
-7.6799,-9.9155,0.9593,3.8652,-9.9155,6.2345,16.4657,10.0773,490
-4.8592,-9.8719,0.7003,2.4808,-9.8719,4.3413,14.2957,7.5378,491
-5.3531,-9.9384,1.5181,4.3097,-9.9384,6.0231,15.7906,9.1989,492
-2.4167,-9.4592,0.5007,2.7064,-9.4592,1.3241,9.2768,6.0161,493
-5.262,-9.6904,-0.2634,1.9757,-9.6904,2.7736,7.9278,5.3317,495
-7.7767,-9.9017,-0.1625,3.7817,-9.9017,6.051,17.8562,9.2154,496
-18.2878,-9.8681,2.1165,7.928,-9.8681,8.1604,22.6333,9.9377,498
-4.928,-9.8896,1.364,4.5276,-9.8896,4.2528,23.5025,10.8868,499
-9.1888,-9.4918,0.0196,4.8527,-9.4918,2.4496,12.7284,11.3611,500
-1.7082,-9.5063,-0.3506,0.9437,-9.5063,3.9479,17.1017,10.8517,501
-22.5751,-9.3941,2.3877,11.0886,-9.3941,9.7964,27.9702,15.9863,502
-5.3879,-10.0641,4.0116,7.7398,-10.0641,4.6451,23.0538,20.7535,503
-20.2231,-9.8447,-1.6019,4.5123,-9.8447,4.6832,22.4227,7.2294,505
-2.479,-9.4318,-0.5549,1.3868,-9.4318,1.9967,10.7477,4.8958,506
-2.6548,-9.9795,-0.2723,1.6745,-9.9795,3.7416,16.0183,9.2557,508
-4.5357,-10.2105,1.5637,4.3438,-10.2105,3.6054,31.5548,10.5791,509
-7.3615,-8.2067,0.1234,4.0252,-8.2067,5.7041,27.7189,11.3171,510
-5.2475,-9.3476,-1.7252,2.2013,-9.3476,2.6547,18.9597,11.246,511
-7.4301,-9.9017,-0.2777,3.4346,-9.9017,4.9208,12.228,6.6661,512
-1.6539,-9.5094,0.276,1.4482,-9.5094,2.9605,15.7464,6.9789,513
-1.6513,-10.3214,-0.2973,0.752,-10.3214,1.5255,10.6409,3.6467,514
-7.5049,-9.9205,0.2288,3.837,-9.9205,2.514,17.1536,8.647,515
-12.118,-9.9574,-0.7908,2.8536,-9.9574,3.4028,13.4489,6.7735,516
-0.2818,-9.7121,4.2826,4.8588,-9.7121,0.7701,13.3064,10.5408,517
-1.4606,-9.0872,0.06,1.1371,-9.0872,3.1043,21.2626,9.8949,518
-11.2555,-9.7611,-0.6257,4.2417,-9.7611,6.1154,22.2419,15.0186,519
-9.5914,-9.3936,2.287,7.0149,-9.3936,8.5374,26.0181,16.5204,520
-4.1443,-9.3625,3.3614,8.0791,-9.3625,3.8171,17.9215,14.0153,521
-7.414,-10.6445,-1.3904,4.3313,-10.6445,2.9786,16.693,10.5274,522
-20.1056,-8.8834,2.5344,8.4694,-8.8834,9.4343,26.0594,12.4145,523
-4.8919,-8.8538,-0.2305,2.9343,-8.8538,4.9277,15.7931,12.4681,524
-2.6613,-9.2072,0.7591,2.9786,-9.2072,4.2554,15.9109,8.3478,525
-11.7353,-9.0149,1.1085,5.242,-9.0149,7.1638,16.6534,12.7307,526
-7.0487,-9.8869,0.3619,3.3148,-9.8869,4.6046,10.321,7.4122,527
-3.9065,-9.8689,0.706,5.4892,-9.8689,4.8249,12.8967,8.7973,528
-4.8264,-9.839,-1.04,1.8271,-9.839,2.187,7.9912,4.7342,529
-6.3874,-9.6168,0.5939,3.917,-9.6168,3.3067,19.4667,6.4571,530
-2.2534,-7.923,1.6159,3.7433,-7.923,6.3325,14.9642,11.447,531
-9.2865,-9.3916,0.4814,6.4415,-9.3916,1.3675,14.9999,12.543,532
-30.3546,-8.5493,10.3522,25.2127,-8.5493,13.3197,46.9012,22.2415,533
-31.2153,-8.5919,11.4147,33.0932,-8.5919,20.005,49.0712,33.9687,535
-35.8875,-9.9566,17.1299,31.9026,-9.9566,18.7192,52.3218,35.3443,536
-4.0493,-8.368,-0.1325,2.1905,-8.368,4.1872,18.6828,7.9709,537
-30.214,-3.3991,-3.9778,12.5911,-3.3991,8.1467,44.7854,20.0683,538
-5.317,-9.4373,-0.5972,2.3459,-9.4373,2.5721,28.7822,8.1631,539
-113.0473,-9.6973,-19.1207,33.2557,-9.6973,8.9084,37.7488,23.9627,540
-0.0494,-9.7444,10.9829,10.1625,-9.7444,7.7859,16.9853,13.216,541
-15.2853,-9.3881,35.9603,44.3622,-9.3881,10.6516,25.8867,11.0023,542
-140.4898,-9.7071,-3.3302,33.1316,-9.7071,9.5524,60.1171,5.652,543
1.0278,-9.675,7.3923,8.4612,-9.675,17.0625,65.2543,13.9851,544
-872.0421,-0.0402,-121.9919,300.1852,-0.0402,88.9388,289.0161,93.2182,545
-20.3747,0.1895,-5.6784,17.6533,0.1895,1.8435,4.2233,3.3576,546
-18.2334,0.2438,-17.752,0.2227,0.2438,0.0217,3.3972,3.3673,547
-18.1132,0.2444,-17.8226,0.1568,0.2444,0.0157,3.4081,3.3697,548
-17.9818,0.2442,-17.7041,0.1432,0.2442,0.0146,3.3946,3.3666,550
-18.4561,0.2432,-17.8174,0.246,0.2432,0.0249,3.4332,3.3706,551
-21.7949,0.4758,123.0608,136.4991,0.4758,14.7521,69.1152,10.4964,552
-96.3069,-4.761,108.1822,131.2212,-4.761,16.6254,74.659,39.5338,553
95.2977,-5.937,135.1733,29.359,-5.937,2.7035,59.4767,55.2437,554
60.2385,-9.1133,103.8323,30.6121,-9.1133,4.2073,43.242,37.7103,555
-1.0809,-9.9017,-0.038,0.3128,-9.9017,1.37,4.2122,3.2251,556
-3.9231,-9.8951,-0.2375,1.6328,-9.8951,4.2015,6.8603,4.8548,557
-1.1796,-9.8781,2.7275,2.9811,-9.8781,2.9592,10.5345,9.3476,558
-21.7565,-9.9456,-3.4362,9.3349,-9.9456,8.2076,94.2791,85.1595,560
-21.7929,-9.7096,-3.3134,13.1634,-9.7096,6.7518,10.0877,7.2343,562
-89.5406,-9.7509,-7.1326,26.4862,-9.7509,9.9356,19.396,10.0871,563
-21.4519,-9.9447,-0.3733,11.7944,-9.9447,6.2533,21.1457,9.107,564
-5.312,-9.8147,-0.8153,2.2596,-9.8147,2.4228,10.2634,7.5016,565
0.0123,-9.8873,10.8437,10.3807,-9.8873,6.367,27.9886,17.3567,566
-17.4581,-9.8191,-1.5015,8.1473,-9.8191,3.6758,24.244,19.7615,567
-5.6552,-9.1845,0.1306,3.8789,-9.1845,4.8822,18.1898,9.7288,568
-58.5535,-8.8347,4.0087,24.1513,-8.8347,7.9076,36.4578,26.5071,569
-46.6031,-8.8914,-3.8911,15.6026,-8.8914,10.8504,36.8396,15.3063,570
-26.7909,-8.7759,0.2009,9.4511,-8.7759,8.7711,30.9139,15.8017,571
-22.5402,-9.0598,1.4341,11.3048,-9.0598,10.0893,34.2764,18.2924,572
-11.9962,-8.7997,1.4832,7.6211,-8.7997,4.5506,23.6265,11.0891,573
-14.4799,-10.0008,2.4909,8.2525,-10.0008,8.2372,28.2383,12.9906,574
-4.0012,-8.8961,0.165,2.9097,-8.8961,3.4882,20.7186,12.7676,575
-3.8734,-11.2734,-0.6142,1.8747,-11.2734,2.3659,19.688,11.1955,576
-21.1606,-6.4096,-0.7642,12.0847,-6.4096,4.3371,28.4393,12.2321,577
-30.0136,-9.5116,6.7539,17.9115,-9.5116,10.054,34.5274,18.0907,578
-24.2194,-9.6622,0.3759,8.3973,-9.6622,8.4472,23.54,11.1019,580
-29.5487,-10.2456,0.3406,11.6397,-10.2456,12.9063,39.6622,21.2412,581
-46.0957,-8.4753,18.1237,40.5697,-8.4753,17.9822,70.7964,26.577,583
-6.9147,-9.2739,4.3968,10.1738,-9.2739,6.8661,26.4068,11.4133,584
-5.4298,-8.1922,12.0998,20.3774,-8.1922,14.7644,44.8713,33.964,585
-7.5404,-9.9678,-1.8571,2.9073,-9.9678,2.6123,30.0472,18.8374,586
-9.2282,-9.5959,-1.6547,5.5027,-9.5959,1.7838,12.0148,8.2541,587
-13.3893,-8.8926,0.1382,6.4231,-8.8926,4.4751,20.229,13.4915,588
-17.0733,-9.7815,0.7056,9.5319,-9.7815,9.2007,35.3073,19.2867,590
-9.9969,-9.1735,-1.0661,3.1626,-9.1735,5.3265,18.6034,8.7581,591
-2.1631,-9.1501,1.3675,2.3473,-9.1501,2.6362,15.7443,13.1873,592
-18.6513,-4.0618,4.7728,11.4391,-4.0618,8.0986,28.5859,20.2338,593
-18.0449,-9.6693,-1.5534,14.211,-9.6693,2.6822,17.8743,14.1146,594
-29.2216,-8.0965,-2.474,11.7216,-8.0965,6.494,17.4441,15.6763,595
-20.9146,-9.2593,-2.6916,7.5504,-9.2593,4.2496,12.3581,7.4636,596
-6.7819,-10.0461,1.1908,5.0856,-10.0461,5.3805,34.8662,15.5845,597
-27.3704,-10.0487,7.7018,21.5104,-10.0487,5.0784,30.8127,26.5128,598
-14.8279,-9.8619,2.0341,6.2933,-9.8619,7.1673,23.6423,10.0391,600
-11.4246,-9.9019,0.3656,3.6976,-9.9019,3.8846,18.2112,9.5062,601
-13.4649,-9.6813,-1.8734,7.4373,-9.6813,3.415,13.5987,11.6201,602
-4.1069,-9.5725,0.3097,2.2205,-9.5725,3.7111,14.7286,9.747,603
-6.2626,-9.82,0.5545,5.1131,-9.82,1.8624,16.9423,14.1028,604
-2.4444,-10.0392,0.6947,2.9674,-10.0392,2.8662,14.9821,10.0438,605
-2.6684,-9.78,1.816,4.3767,-9.78,7.5625,17.5533,12.8903,606
-5.927,-10.0408,1.473,4.9997,-10.0408,2.4284,23.0215,9.7129,607
-6.3521,-9.2971,0.2149,2.819,-9.2971,2.0115,13.4943,8.1814,608
-117.0852,-9.6761,6.6121,26.2502,-9.6761,11.0954,56.0821,31.1082,610
0.2649,-10.6215,6.2177,6.6276,-10.6215,6.2696,54.9707,39.3701,611
-10.1465,-9.5225,-2.8974,5.7192,-9.5225,8.3594,16.729,11.5994,612
-11.4594,-10.0553,0.0055,8.693,-10.0553,5.1653,14.0868,8.0712,613
-5.628,-9.9137,1.5384,5.5353,-9.9137,2.7566,9.9717,8.7392,614
-7.3069,-9.6524,1.4804,6.3772,-9.6524,1.6021,16.452,12.0871,615
-9.2382,-9.7286,0.0939,4.8366,-9.7286,4.1109,31.9133,10.8453,617
-3.7382,-9.7504,2.3335,4.1454,-9.7504,6.1645,13.5843,8.6457,618
-12.7536,-10.0422,-0.2162,5.4594,-10.0422,5.3776,21.2306,11.3501,620
-17.9364,-9.5739,3.2708,12.8928,-9.5739,6.7081,24.9898,16.9322,621
-10.8009,-9.9996,2.6767,13.0807,-9.9996,3.671,22.2421,19.0661,622
-2.179,-9.5069,3.8501,7.8646,-9.5069,4.3942,18.4773,11.0503,623
-8.5273,-9.1911,-0.8937,3.6069,-9.1911,4.6155,12.1433,9.9445,624
-3.2411,-9.5614,-0.5275,2.9887,-9.5614,2.6315,11.6627,6.7053,625
-3.8643,-9.4696,-0.7117,1.575,-9.4696,1.7789,9.6299,6.1115,626
-21.9073,-10.0275,7.32,14.624,-10.0275,3.6406,20.7207,16.7445,627
-1.7909,-9.7113,0.0067,1.1097,-9.7113,1.6012,12.8717,6.5604,628
-2.6339,-9.6385,-0.3831,1.2622,-9.6385,1.1088,7.5248,4.8762,629
-3.8958,-9.9501,2.4364,4.3293,-9.9501,4.0592,14.7403,11.2089,630
-4.7441,-9.8021,1.3292,2.5527,-9.8021,6.2787,14.3215,10.0951,631
-5.8372,-9.7956,0.9154,3.1819,-9.7956,5.0877,17.4187,8.9508,632
-75.4153,-9.9292,0.1726,14.0789,-9.9292,8.5763,23.692,10.6267,634
-0.275,-10.4728,0.8146,1.1062,-10.4728,3.1289,7.7074,3.7652,635
-0.4961,-9.6472,1.6407,2.3052,-9.6472,3.1044,9.6136,7.3238,636
-7.1474,-9.7469,-0.2107,5.0641,-9.7469,3.7391,12.3222,8.5445,637
-8.1693,-9.9511,0.3526,2.8735,-9.9511,5.5149,12.2951,8.8378,638
-4.5107,-9.9347,0.2311,2.3718,-9.9347,4.6301,18.3714,9.7877,640
-25.1006,-6.4698,-0.4702,8.4417,-6.4698,5.999,44.1937,16.5926,641
-20.3959,-8.3759,-0.6121,6.9394,-8.3759,5.9183,27.3306,11.0301,642
-8.5953,-9.0261,4.0096,13.872,-9.0261,6.4216,16.3202,12.4901,643
-14.7211,-9.9743,-0.5899,7.7758,-9.9743,5.0572,27.4053,19.6002,644
-8.293,-9.6123,-0.5314,3.353,-9.6123,5.2576,12.3545,6.6454,645
-3.3129,-10.3132,1.0582,3.094,-10.3132,3.3528,13.3106,10.4703,646
-1.5486,-8.5225,0.5996,2.2484,-8.5225,2.2315,29.4172,11.206,647
-13.2483,-9.8747,2.5777,5.5486,-9.8747,4.1212,19.3002,15.3506,648
-13.5379,-9.6408,-0.1304,5.6142,-9.6408,4.1149,34.8533,26.8269,650
-44.7483,-10.503,-3.7963,16.9742,-10.503,12.3055,69.8575,52.873,651
-24.2456,-9.2992,21.0659,37.8165,-9.2992,8.3465,54.4798,27.7138,652
-2.596,-10.2965,-0.3799,0.9755,-10.2965,1.2645,8.7996,6.3706,653
-6.2675,-10.1344,-0.0576,4.3669,-10.1344,1.7692,15.2618,12.9935,654
-2.0511,-8.5685,4.6141,6.572,-8.5685,6.0581,38.6012,34.8341,655
-5.3051,-9.4365,0.6517,5.0108,-9.4365,3.5891,20.0757,15.9541,656
-11.1599,-9.6973,0.3424,5.3658,-9.6973,5.965,28.668,11.931,657
-0.5701,-9.0888,2.7496,2.3303,-9.0888,5.2325,19.179,16.1075,658
-7.1462,-9.2971,0.3134,2.8232,-9.2971,4.2887,13.6113,8.9851,660
-10.548,-9.5347,1.3235,3.9802,-9.5347,7.0051,21.9926,10.8614,661
-8.2214,-9.1398,0.6443,3.38,-9.1398,5.4798,20.5453,9.4172,662
-4.3931,-8.9919,-0.1278,3.9978,-8.9919,2.8381,13.9377,7.2267,663
-7.808,-9.818,8.9445,10.8495,-9.818,1.8918,23.9684,19.5285,664
-7.1446,-10.0215,-1.1005,2.1033,-10.0215,3.3295,43.9069,36.6033,665
-1.6976,-9.6337,8.3107,9.1599,-9.6337,1.4603,55.5362,40.3182,666
-15.5192,-9.7974,4.5545,10.6053,-9.7974,8.6184,55.5097,24.6692,667
-11.9171,-10.075,-4.1918,3.9298,-10.075,5.2911,44.2761,32.8104,668
-14.8684,-9.8903,9.7608,18.2564,-9.8903,13.5707,61.1683,23.9801,670
-8.3651,-9.8842,0.4413,3.9543,-9.8842,1.5741,14.5211,8.3467,671
-0.2551,-9.8535,1.673,1.1133,-9.8535,3.4741,15.7895,10.6816,672
-1.5832,-9.9776,0.377,1.0696,-9.9776,2.7922,10.7953,9.4187,673
-2.7214,-9.8251,0.2964,2.3619,-9.8251,1.5836,9.7567,6.5835,674
-4.4134,-9.8999,2.6159,3.3969,-9.8999,1.8958,17.6086,12.3892,675
-16.0445,-10.3981,0.5639,7.5122,-10.3981,1.7653,38.0384,28.4977,676
-12.9307,-10.3937,-3.8664,5.125,-10.3937,5.6721,60.005,55.7067,677
-37.2606,-9.9599,0.9147,15.9487,-9.9599,6.3206,34.4179,23.4043,678
-10.3198,-9.775,-0.5381,5.0033,-9.775,5.6186,19.9848,18.3668,679
-4.9589,-9.8861,1.3307,3.307,-9.8861,4.8809,26.9744,15.2781,680
-3.2397,-9.968,0.5982,1.5244,-9.968,4.9662,15.6439,8.5047,681
-5.8495,-9.8616,0.7036,4.0482,-9.8616,2.3598,12.0632,7.8482,682
-2.4556,-9.8166,-0.3518,1.1037,-9.8166,4.2049,12.763,8.0929,683
-3.9272,-9.9631,0.3587,2.521,-9.9631,4.1431,16.9463,10.6629,684
-1.3458,-9.8607,6.0727,5.1998,-9.8607,2.6336,14.3794,10.779,685
-1.1342,-10.0742,-0.2584,0.6526,-10.0742,0.8128,10.7467,8.8143,686
-2.2282,-9.7821,0.1159,1.3829,-9.7821,1.736,8.9728,7.4847,687
-4.4501,-9.6825,3.4097,6.1671,-9.6825,8.4142,24.8979,13.3367,688
-2.241,-9.8955,-0.1659,0.9253,-9.8955,2.6664,17.1987,9.7554,689
-0.8527,-9.9883,2.545,4.402,-9.9883,6.538,21.0196,13.8344,691
-9.3215,-9.8257,-0.7967,3.9676,-9.8257,3.6024,13.9964,9.0095,692
-5.2913,-9.845,2.1553,5.1364,-9.845,6.2952,16.683,11.4723,693
-2.9553,-10.0982,0.1511,1.7496,-10.0982,2.8463,6.3514,5.187,694
-10.0251,-9.7538,0.3755,7.0737,-9.7538,4.8831,13.393,11.5356,695
-6.3301,-5.6466,-0.8418,3.2388,-5.6466,5.0566,29.4728,21.4263,696
-13.0152,-10.0189,1.8595,7.2561,-10.0189,5.5695,43.3797,11.8811,697
-5.0559,-8.2377,2.221,6.3742,-8.2377,1.4736,17.2456,11.5704,698
-5.2794,-9.8843,3.4656,6.4727,-9.8843,8.226,24.9409,14.0221,699
-16.8249,-9.5698,1.0115,6.9759,-9.5698,6.2015,17.6034,9.6113,700
-13.8602,-9.9349,0.9146,5.6457,-9.9349,6.8119,18.7762,10.669,701
-20.5798,-9.9751,2.6023,10.101,-9.9751,7.9183,19.9829,15.7174,702
-15.6114,-9.8642,1.9471,7.8196,-9.8642,5.4683,21.2942,13.1271,703
-3.069,-10.0425,1.0871,4.8859,-10.0425,5.7045,26.6247,18.8837,704
-10.3335,-9.7102,2.1491,7.4571,-9.7102,3.8907,14.62,11.1056,705
-4.9587,-9.8736,0.1905,2.58,-9.8736,1.5507,7.6607,5.2116,706
-5.5349,-9.9291,0.0543,2.1265,-9.9291,2.4396,19.0481,5.6871,707
-2.1954,-10.026,-0.0319,1.5195,-10.026,2.7369,10.4318,5.7589,708
-4.3756,-9.8766,1.2764,3.6828,-9.8766,2.9294,10.1453,5.9851,710
-1.9066,-9.9267,2.1085,4.1555,-9.9267,7.3273,15.4417,14.1906,711
-3.9725,-8.7794,-0.2267,2.8353,-8.7794,1.5977,18.0275,7.8636,712
3.1748,-10.1679,14.7418,8.6368,-10.1679,5.3689,25.1117,23.7166,713
-3.3811,-7.8433,-1.1614,2.0027,-7.8433,3.3286,20.5567,11.9041,714
-7.2112,-9.3555,-0.1176,4.3269,-9.3555,2.0436,8.7509,4.644,715
-4.1707,-10.0314,1.1909,3.5112,-10.0314,1.7328,14.1334,11.1526,716
-2.6355,-9.7572,1.4059,4.449,-9.7572,4.0906,16.4923,8.4623,717
-5.1854,-10.5257,-0.204,2.444,-10.5257,2.1826,10.1194,6.0544,718
-2.5866,-9.8816,0.8967,2.7445,-9.8816,3.9319,11.7131,8.7239,720
-2.5019,-9.9293,-0.4544,0.9818,-9.9293,2.8382,13.5239,6.8965,721
-0.5629,-9.9054,0.1248,0.5452,-9.9054,0.4767,9.1707,5.9074,722
-0.313,-9.8625,0.742,0.888,-9.8625,0.692,11.3889,5.2547,723
-22.136,-9.9037,3.1546,14.9561,-9.9037,7.4931,25.7276,19.0527,724
-46.5161,-9.9235,-5.6657,17.9944,-9.9235,2.9297,19.3418,13.8797,726
-6.8744,-9.9109,5.8929,11.353,-9.9109,11.3918,29.258,17.0428,727
-16.2273,-9.8787,-1.5485,5.9445,-9.8787,10.4591,26.5021,15.8664,728
-9.8525,-10.0863,-1.6208,3.5639,-10.0863,4.3758,20.2664,15.5082,729
-19.9192,-8.7845,-1.446,4.9022,-8.7845,5.8369,17.9727,11.8102,730
-3.1593,-9.689,2.0164,4.0006,-9.689,1.8182,11.9759,9.1143,731
-6.0996,-10.1793,-2.5343,2.0308,-10.1793,2.7527,20.0355,17.009,733
-5.6773,-9.971,0.4464,5.9092,-9.971,1.7795,15.8674,13.4321,734
-3.937,-9.9909,-0.6858,2.4768,-9.9909,4.8357,19.0577,13.2993,735
-0.4657,-9.5166,3.677,3.5008,-9.5166,6.4887,16.8482,14.2599,736
-8.0273,-9.4342,3.6339,10.4469,-9.4342,6.4209,22.1957,14.6607,737
-9.5285,-9.7931,0.6302,4.1294,-9.7931,5.6838,12.9127,7.7682,738
-12.9456,-10.015,-0.1736,3.363,-10.015,3.7484,15.9776,6.5507,740
-6.4805,-9.9292,0.192,3.4861,-9.9292,3.2264,14.9894,8.0534,741
-5.9872,-9.6677,1.092,4.8534,-9.6677,9.4885,25.115,18.5491,742
