AYGX_min,AZ_mean,AYGX_mean,AYGX_std,AZ_mean.1,GX_std,Gnorm_max,Gnorm_median,timestamp
-3.5527,-8.9099,-3.1535,0.3217,-8.9099,0.073,3.989,3.9667,31
-5.6261,-8.8591,-2.1619,3.0347,-8.8591,0.6971,6.8125,4.0031,32
-151.9753,-9.068,-2.2574,80.8053,-9.068,15.4208,30.61,10.8443,33
-25.8201,-9.3932,44.014,58.8782,-9.3932,13.1423,26.156,17.5777,34
-20.4128,-9.064,-17.8657,2.4779,-9.064,0.758,7.7314,7.3457,35
