AYGX_min,AZ_mean,AYGX_mean,AYGX_std,AZ_mean.1,GX_std,Gnorm_max,Gnorm_median,timestamp
-245.4829,-9.6153,-28.1382,154.388,-9.6153,26.1004,46.7717,30.1173,13
-275.1618,-8.7378,33.0664,154.5891,-8.7378,41.164,71.3706,37.4754,14
-532.8617,-7.9577,-104.2909,194.4655,-7.9577,30.1712,65.0735,17.0006,15
-153.5186,-8.7866,10.8017,150.3071,-8.7866,34.301,57.0138,29.8499,16
-89.7106,-8.6407,19.3235,37.2545,-8.6407,6.5469,20.5748,6.5141,17
