AYGX_min,AZ_mean,AYGX_mean,AYGX_std,AZ_mean,GX_std,Gnorm_max,Gnorm_median,timestamp
0.5081,-9.6687,0.5471,0.0273,-9.6687,0.016,5.7611,5.694,0
0.4548,-9.6674,0.5256,0.026,-9.6674,0.0149,5.7246,5.6847,1
0.4828,-9.6676,0.5233,0.0295,-9.6676,0.0174,5.7262,5.6805,2
0.4488,-9.6689,0.5291,0.0286,-9.6689,0.0169,5.7595,5.6896,3
0.4837,-9.668,0.5213,0.0249,-9.668,0.0149,5.7433,5.6797,4
0.4813,-9.6682,0.5191,0.0221,-9.6682,0.013,5.7245,5.6939,5
0.1124,-9.6672,0.5438,0.2053,-9.6672,0.1162,5.7658,5.7063,6
-0.3762,-9.668,0.491,0.4486,-9.668,0.2645,5.8191,5.6903,7
-0.3215,-9.6684,0.5078,0.5434,-9.6684,0.3262,5.793,5.7063,8
0.067,-9.6602,8.6925,12.7921,-9.6602,6.6171,21.1292,5.7091,9
-10.8847,-9.7502,-2.3076,5.4872,-9.7502,6.0328,20.8932,10.9002,10
-20.5152,-9.7292,3.3281,12.7735,-9.7292,6.782,24.0099,10.8626,12
-30.3894,-9.7269,-12.1606,12.1352,-9.7269,4.4396,20.7998,11.39,13
-785.9312,-7.9239,5.1822,246.2135,-7.9239,41.0955,188.315,62.0072,14
-24.8575,-9.3966,28.1632,38.4574,-9.3966,9.4559,82.853,43.2803,15
-14.2475,-9.3357,19.1726,34.446,-9.3357,8.3045,18.1285,10.7746,16
-18.0701,-9.7509,9.927,18.0682,-9.7509,7.2205,36.685,23.4334,17
-12.9866,-9.8626,-3.0483,5.2907,-9.8626,4.0901,52.5218,44.1833,18
-93.2918,-9.7874,3.4568,42.0098,-9.7874,11.1802,45.6095,18.6245,19
-19.5261,-9.8411,-0.7942,7.14,-9.8411,4.3188,31.7689,22.7866,20
-6.7339,-9.7886,3.9239,5.9345,-9.7886,2.3185,25.1856,15.2565,21
-16.1519,-9.6559,4.8234,14.4351,-9.6559,5.1753,28.9152,8.8859,22
-3.2398,-9.7824,1.7296,3.521,-9.7824,2.8587,37.0355,19.8518,23
-8.0357,-9.6274,14.2142,17.0278,-9.6274,8.7638,41.6366,38.1173,24
-28.5821,-9.7924,14.8236,23.716,-9.7924,14.2587,35.4019,29.8132,25
-15.9929,-9.876,4.5169,12.4765,-9.876,8.3785,40.5825,28.819,26
-23.6294,-10.0006,25.2614,35.866,-10.0006,13.2757,63.1471,44.5237,27
-27.141,-9.8809,2.9005,19.7888,-9.8809,4.6562,73.8194,45.8546,28
-1.3921,-9.8332,1.4863,3.2739,-9.8332,3.6228,34.9606,31.0589,29
-10.0688,-9.6423,0.738,4.033,-9.6423,2.5946,24.0918,17.9844,30
-3.4486,-10.2409,1.3645,3.2496,-10.2409,2.3724,11.6479,10.2525,31
-6.8919,-9.7383,0.2472,4.4179,-9.7383,5.6345,20.7771,14.5508,32
-5.449,-9.7499,6.8465,11.1279,-9.7499,8.6097,21.8181,13.8959,33
-1.9368,-9.863,0.2004,1.9353,-9.863,2.7186,18.879,16.4653,34
-0.7737,-9.7844,2.8226,3.1995,-9.7844,4.7658,28.5192,11.5384,35
-0.2441,-9.831,1.731,2.0629,-9.831,4.048,14.7662,12.0072,36
-0.0081,-9.73,9.2515,9.5787,-9.73,7.5063,30.4709,26.8735,37
-5.3692,-9.7898,-1.6447,2.3566,-9.7898,1.4621,32.8782,30.4754,38
-1.0277,-9.7471,-0.0166,0.4929,-9.7471,0.3828,16.5224,12.6254,39
-5.2677,-9.8136,2.7812,6.9876,-9.8136,5.259,21.473,15.0653,40
-5.8617,-9.7673,-0.1471,2.746,-9.7673,3.1559,12.9473,7.7839,41
-3.4112,-9.7707,10.9597,15.3845,-9.7707,6.9025,37.733,24.163,42
-0.5128,-9.707,0.4816,0.8648,-9.707,1.7456,9.5955,7.449,43
-1.0255,-9.7588,1.645,1.7874,-9.7588,0.9941,19.3203,13.7114,44
-1.6686,-9.8046,0.6816,1.3312,-9.8046,1.7592,28.0028,12.1375,45
-1.6131,-9.6566,-0.1615,1.6332,-9.6566,1.6644,18.515,15.3835,46
-5.296,-9.8133,2.1842,4.4481,-9.8133,4.0846,16.6619,12.0492,47
-0.6577,-9.8098,-0.1056,0.3573,-9.8098,0.523,8.2011,6.439,48
-1.8786,-9.8952,-0.6313,1.0688,-9.8952,1.7082,19.451,18.2571,49
-9.7033,-9.8452,2.6807,6.7263,-9.8452,4.5236,35.9647,15.9819,50
-2.911,-9.5007,10.7535,11.4545,-9.5007,5.328,34.8644,14.2847,51
-48.5934,-9.7593,-2.9613,16.8986,-9.7593,8.7792,23.8457,18.6871,52
-106.4507,-11.4494,17.6348,86.1025,-11.4494,22.0785,129.9482,53.5206,53
-57.5269,-9.5158,-8.8316,27.1244,-9.5158,19.8748,64.6865,37.0802,54
-47.0555,-9.8073,-2.8102,22.7263,-9.8073,10.4485,45.3284,26.0866,55
-3.6065,-9.7946,18.6489,25.7374,-9.7946,9.234,36.4145,27.6444,56
-14.2236,-10.0451,-1.3331,6.9589,-10.0451,6.3893,29.1901,16.5326,57
6.9604,-9.4973,38.4717,17.6418,-9.4973,7.5439,35.7295,27.0547,58
-8.7343,-9.607,-0.2366,7.0999,-9.607,6.3902,20.2582,15.2016,59
-3.5949,-9.7672,9.8315,11.4517,-9.7672,10.2075,24.9346,18.3052,60
-4.3315,-9.8533,0.1433,3.2739,-9.8533,4.0716,13.5568,7.9618,61
-8.253,-9.7838,0.2065,3.68,-9.7838,3.3509,11.7597,8.7281,62
-3.8396,-9.8258,6.2044,6.9086,-9.8258,6.1364,26.25,22.8766,63
-8.4007,-9.2968,2.6419,6.6434,-9.2968,6.5048,21.1572,16.4953,64
-8.7116,-9.4859,1.4612,5.1583,-9.4859,5.5787,25.6557,11.5928,65
-4.2141,-9.6501,1.7338,4.7005,-9.6501,4.172,12.5166,9.4302,66
-3.983,-9.6586,4.7782,5.1724,-9.6586,9.8699,27.6674,14.483,67
-9.8177,-9.7831,4.86,10.3981,-9.7831,3.444,13.1198,11.4789,68
-13.5473,-9.6971,0.8919,6.7707,-9.6971,7.0333,16.9627,12.5338,69
-13.7116,-9.8163,5.277,9.8095,-9.8163,9.0573,29.018,18.0964,70
-5.5407,-9.8756,0.7685,3.7121,-9.8756,2.995,11.428,8.4355,71
-8.8254,-9.7651,7.1268,13.9582,-9.7651,6.6092,32.3779,10.4768,72
-34.3456,-10.01,-7.7864,14.9946,-10.01,4.448,44.2209,20.6271,73
-7.5961,-10.0046,-0.9299,4.7919,-10.0046,5.9226,28.754,18.9344,74
-6.806,-9.7751,4.7407,8.7077,-9.7751,5.5346,29.0424,11.2218,75
-12.5328,-9.7499,-1.07,3.7426,-9.7499,4.5884,24.9316,10.8132,76
-4.2244,-9.7413,-0.859,2.2199,-9.7413,3.5629,18.6792,11.3543,77
-2.6426,-10.0892,-0.5937,1.1296,-10.0892,2.2415,14.9163,6.0127,78
-0.2914,-10.0793,2.0221,3.3871,-10.0793,2.9023,20.3849,15.6048,79
-7.9745,-9.8435,8.4771,11.6756,-9.8435,6.9832,34.2694,18.8381,80
-3.2729,-10.002,0.2411,2.1625,-10.002,2.9636,25.2166,10.0812,81
-5.7568,-9.8108,8.5303,10.388,-9.8108,6.8916,39.2136,17.7369,82
-26.08,-9.6224,4.2345,15.1713,-9.6224,9.9945,33.6229,24.19,83
-3.6123,-9.5013,-0.3624,3.5974,-9.5013,0.8711,15.4232,12.0648,84
-6.0286,-9.5445,3.803,8.8752,-9.5445,2.231,19.2567,15.756,85
-7.6797,-10.1048,-1.3016,3.1195,-10.1048,3.1391,19.5554,12.216,86
-3.3014,-7.4386,2.6409,4.8947,-7.4386,3.3543,19.5225,11.4043,87
-11.8863,-9.6669,-0.4826,6.413,-9.6669,6.0825,38.9251,24.9187,88
-1.9399,-10.1005,12.9208,15.6715,-10.1005,8.1836,48.7348,43.0305,89
-8.9111,-9.6425,11.4794,18.488,-9.6425,7.3469,39.6076,19.4075,90
-14.8684,-9.9468,-5.3122,7.1449,-9.9468,3.5266,22.1574,13.5072,91
-8.7001,-9.8941,12.4949,16.7711,-9.8941,11.119,33.6368,23.4185,92
-22.2526,-9.985,31.1823,38.1858,-9.985,2.865,43.3072,37.9376,93
-30.234,-9.3771,3.6338,14.6626,-9.3771,4.783,29.9057,27.1525,94
-5.9944,-9.839,0.9355,3.5871,-9.839,3.4565,29.9237,11.581,95
-11.4403,-9.6559,3.1915,9.4499,-9.6559,6.1291,30.7914,12.8401,96
-12.4558,-9.8516,1.6298,6.3832,-9.8516,6.3952,20.1652,12.8806,97
-6.7662,-9.7095,0.9507,4.2553,-9.7095,3.1496,14.2659,8.7661,98
-3.275,-9.7597,-0.8884,1.763,-9.7597,2.766,27.596,21.8495,99
-5.1304,-9.8919,5.9443,4.9284,-9.8919,10.667,46.2404,16.3106,100
-10.8137,-9.8289,25.4713,40.8006,-9.8289,13.9513,71.8896,37.7262,101
-19.3151,-10.1972,10.4831,17.5749,-10.1972,6.6088,82.4827,36.9983,102
-16.2877,-9.4483,15.9508,23.7663,-9.4483,5.686,76.8898,32.9825,103
-8.9607,-9.6153,8.9633,14.777,-9.6153,8.3318,40.8952,21.8578,104
-10.3753,-9.7906,1.0024,6.5047,-9.7906,5.1502,39.2772,20.9546,105
-37.3662,-9.786,5.4696,26.3956,-9.786,5.9981,27.0172,19.3509,106
-10.9105,-9.7095,2.2925,4.137,-9.7095,3.2215,24.8821,9.1957,107
-2.782,-9.7435,-0.0795,0.9537,-9.7435,1.8119,10.9436,8.167,108
0.0989,-9.7493,0.487,0.3284,-9.7493,1.0517,7.2574,6.5298,109
-42.7766,-9.7916,14.3355,30.2133,-9.7916,9.4415,76.6381,38.7938,110
-23.3884,-10.0391,9.831,18.2273,-10.0391,10.1652,83.1001,53.3355,111
-4.8583,-9.5405,23.7676,29.6157,-9.5405,8.736,35.97,17.5567,112
-47.2466,-10.4627,-0.3059,21.2666,-10.4627,6.4671,81.9835,38.8694,113
-25.2536,-9.2875,1.4239,13.078,-9.2875,3.1641,30.9818,11.2333,114
-23.3773,-9.8665,5.4782,16.9922,-9.8665,7.7234,37.6533,23.357,115
-24.1865,-9.8791,5.0144,20.2656,-9.8791,15.7841,60.0475,37.247,116
-8.0509,-9.7039,-0.6934,3.5883,-9.7039,3.5253,15.3383,9.8331,117
-0.654,-10.1708,10.1914,6.8929,-10.1708,6.6276,39.9202,33.5572,118
-4.3502,-10.1422,3.465,7.042,-10.1422,7.2861,27.2572,17.3867,119
-11.283,-9.7183,6.8126,11.6894,-9.7183,7.3073,33.7759,16.9344,120
-5.9845,-9.8919,2.9745,5.2524,-9.8919,5.6349,23.7232,16.2576,121
-2.6763,-9.9932,-0.2038,1.5558,-9.9932,2.2933,19.6347,14.1235,122
-1.6971,-9.9931,0.5575,2.3042,-9.9931,1.4605,13.9736,11.4588,123
-1.6427,-9.6092,12.7073,9.5019,-9.6092,5.807,28.9092,18.3649,124
-13.3419,-9.732,1.4817,7.8196,-9.732,5.5042,27.0412,15.5033,125
-3.0987,-9.7366,9.3084,11.41,-9.7366,7.186,36.2518,20.8251,126
-2.4285,-9.7684,0.5918,1.5444,-9.7684,2.2124,11.3145,7.2703,127
-0.3248,-9.454,1.0309,0.7604,-9.454,1.9965,13.2621,11.0821,128
-5.9636,-10.2793,3.3908,6.4662,-10.2793,3.1642,22.1247,20.0862,129
-8.831,-9.6994,2.9579,7.7437,-9.6994,9.8755,24.5989,18.7437,130
-8.4099,-9.8372,0.6974,4.1696,-9.8372,5.5893,19.7883,13.1552,131
-2.8487,-9.6684,-0.1308,1.0553,-9.6684,1.4604,23.4779,6.9983,132
-16.3327,-8.9935,-1.6087,4.5776,-8.9935,2.9796,24.4854,12.2966,133
-0.61,-9.8953,2.3023,2.2271,-9.8953,1.7085,14.4453,8.4788,134
-3.2945,-9.79,0.7458,2.6835,-9.79,6.205,19.0329,11.5018,135
-4.728,-9.7974,0.7055,2.4051,-9.7974,4.2418,16.7915,10.5905,136
-8.6168,-9.7884,-0.425,2.5596,-9.7884,3.6251,22.1016,11.7108,137
0.7353,-10.0278,6.0366,4.4468,-10.0278,4.1524,26.8393,17.9983,138
-4.3636,-9.8861,0.0005,2.2819,-9.8861,4.4346,17.4112,13.1966,139
-11.419,-9.8423,1.9768,4.9908,-9.8423,7.5627,21.1445,13.7319,140
-4.6539,-9.7561,2.6366,5.0891,-9.7561,7.4702,26.6841,17.91,141
-9.5065,-9.8803,1.3488,4.7955,-9.8803,5.858,20.7345,11.9957,143
-14.47,-10.4073,1.1455,9.5306,-10.4073,2.9891,24.9803,11.1396,144
-5.9095,-9.7308,4.152,9.7857,-9.7308,7.9084,35.797,15.6876,145
-1.6042,-9.7715,8.2135,15.5082,-9.7715,7.3765,25.5191,15.392,146
-5.2472,-9.9035,1.1327,2.7015,-9.9035,3.1782,18.0993,12.3796,147
-4.4505,-8.7518,-0.1792,1.8299,-8.7518,1.6007,33.0189,12.6503,148
-15.1195,-9.659,2.4741,15.9213,-9.659,6.3035,40.5039,19.1466,149
-16.472,-9.8265,-2.7066,5.0803,-9.8265,6.4675,20.4572,11.2931,150
-5.0115,-9.8565,2.1572,6.5444,-9.8565,6.2355,23.8908,11.7716,151
-8.8502,-9.7358,2.4127,6.1541,-9.7358,4.6543,18.5109,10.3203,153
2.4832,-9.9541,7.6111,4.1874,-9.9541,3.6328,28.3323,21.4134,154
-7.0964,-9.6737,0.8064,4.3044,-9.6737,4.4711,42.8415,12.4045,155
-24.1872,-8.9094,15.4355,23.1129,-8.9094,6.6989,52.2801,27.6403,156
-18.0824,-10.6428,5.9925,15.4195,-10.6428,6.2124,27.943,15.8694,157
-22.789,-8.6547,6.6142,29.2994,-8.6547,7.0595,60.0969,32.2942,158
0.6423,-10.264,6.167,8.0316,-10.264,5.2024,27.8025,16.3429,159
-18.3758,-9.7079,0.4547,4.9326,-9.7079,3.6776,33.025,12.4449,161
-5.921,-9.7998,5.8055,8.5107,-9.7998,10.8318,38.1259,20.396,162
-11.7059,-9.7557,4.0939,8.2968,-9.7557,7.6405,34.1433,12.5183,164
-5.8783,-9.7699,1.6667,8.2421,-9.7699,9.922,29.3821,17.8361,165
-5.0292,-9.8713,7.5872,8.6237,-9.8713,9.6511,27.0701,17.8674,166
-7.6828,-9.8871,5.1871,7.3859,-9.8871,6.2202,21.6057,14.2136,167
-6.9542,-10.047,-1.7073,4.4866,-10.047,3.3855,22.7103,21.6493,168
-1.9108,-9.2266,2.1121,3.8646,-9.2266,6.8835,24.6595,18.1741,169
-9.9938,-9.6978,-0.8473,3.6012,-9.6978,4.0645,36.5168,9.506,170
-12.033,-9.7924,0.0485,4.5259,-9.7924,4.3925,21.0109,9.808,171
-8.3081,-9.8026,-1.9028,3.6786,-9.8026,2.0203,14.6573,11.5254,172
-7.3848,-9.8731,3.9102,6.4239,-9.8731,11.5572,20.421,14.5974,174
-17.3175,-9.8382,5.372,13.3844,-9.8382,12.847,33.4807,17.7752,175
-2.2174,-9.7846,4.0497,3.6568,-9.7846,5.6596,18.8703,12.1219,176
-5.8416,-9.6873,1.1641,4.1842,-9.6873,4.3183,24.3764,10.8013,177
-2.7786,-10.4065,6.5894,15.2219,-10.4065,8.8543,25.8772,17.0348,178
-4.9429,-10.2964,-0.3932,3.1656,-10.2964,3.3459,28.1465,21.2769,179
-8.4435,-9.913,0.6395,4.3565,-9.913,6.3962,24.425,16.8052,181
-17.5833,-10.0443,3.7818,11.624,-10.0443,12.224,46.6358,28.5899,182
-4.8602,-9.8112,-1.0952,1.9452,-9.8112,1.6147,20.7073,14.4345,183
-2.5943,-9.8155,-0.1633,1.2042,-9.8155,1.8487,12.0003,8.9836,184
-3.5989,-10.2137,0.2099,2.5598,-10.2137,4.7096,32.022,24.1513,185
-6.6981,-9.9077,-0.4825,2.1804,-9.9077,4.9014,26.6768,16.0583,186
-2.256,-9.7932,0.1354,1.8978,-9.7932,4.9601,20.6558,11.9194,187
-7.4453,-9.8402,0.6008,4.674,-9.8402,11.151,30.9917,12.0626,188
-9.1902,-10.1057,0.5566,7.9599,-10.1057,5.9587,30.6312,20.5789,189
-51.7427,-9.7932,-1.0748,33.2027,-9.7932,1.9395,41.9448,29.7393,190
-0.8457,-9.8433,2.7417,3.7634,-9.8433,4.4341,30.6628,10.0766,191
-3.6816,-9.9656,0.6144,2.8765,-9.9656,3.5551,18.8587,16.511,192
-11.055,-9.7665,0.6828,4.5928,-9.7665,9.8168,25.7716,13.7415,193
-0.5225,-9.8833,8.4869,6.0987,-9.8833,14.1971,49.3272,24.7874,194
-39.6499,-9.8334,-1.69,12.6874,-9.8334,9.2847,29.9981,12.3425,196
-30.7268,-9.8501,3.3004,11.7359,-9.8501,6.0337,21.363,12.9968,198
-34.0276,-9.83,3.1594,20.9857,-9.83,3.3838,36.9596,25.6736,199
-1.9322,-9.8727,-0.2116,1.5233,-9.8727,3.9524,18.5175,16.201,200
-11.9317,-9.867,0.2925,5.5151,-9.867,4.1106,18.0178,13.3003,201
-9.7211,-9.7314,7.4383,13.6068,-9.7314,6.6133,30.3733,15.8208,202
-3.4532,-9.7005,5.555,6.5358,-9.7005,7.0568,23.7137,16.3123,203
-17.4761,-9.6596,-2.1802,7.9671,-9.6596,5.2535,23.4472,16.6888,204
-24.3748,-9.2866,-1.2965,11.0308,-9.2866,5.2858,20.1654,13.2218,205
-79.0921,-10.0663,48.2256,82.6852,-10.0663,17.184,60.4145,51.0972,206
-55.7089,-9.9465,13.8276,40.4684,-9.9465,17.6195,53.9428,48.5974,207
-23.8698,-9.9827,22.825,25.3541,-9.9827,14.7132,76.6467,23.4505,208
-13.9061,-10.0004,-0.1463,10.8787,-10.0004,12.0198,45.4558,37.65,209
-3.2578,-9.5453,1.4623,1.9617,-9.5453,2.1941,60.5695,45.78,210
-15.1373,-9.6977,2.2323,10.2371,-9.6977,6.0499,40.9235,17.4631,211
-2.7714,-9.8972,2.8845,5.6555,-9.8972,6.4268,37.0261,23.6302,212
-23.8664,-9.8266,0.5965,9.4225,-9.8266,8.1003,17.7981,12.9423,213
-20.3753,-9.7682,1.9476,23.0877,-9.7682,1.619,26.0453,18.3038,214
-16.686,-9.7388,-7.6819,7.1992,-9.7388,1.2839,31.3824,30.4237,215
-16.0433,-10.0181,5.5776,14.7404,-10.0181,7.5464,62.354,16.4611,216
-2.4884,-9.6632,5.4817,9.1211,-9.6632,4.6011,50.4945,10.9817,217
-11.086,-9.728,2.5734,8.1194,-9.728,6.1496,38.315,23.9093,218
-8.978,-9.8354,-2.0603,4.0568,-9.8354,3.3122,16.8786,13.886,219
-22.8421,-9.7539,-5.387,9.3828,-9.7539,4.9413,16.8343,8.2697,220
-14.9532,-9.762,1.4796,8.221,-9.762,7.8081,20.2806,15.8684,221
-2.3115,-9.8257,2.2553,2.93,-9.8257,5.3417,22.603,14.1918,222
-3.795,-9.9727,0.3001,1.9446,-9.9727,5.2874,23.3647,19.372,223
-1.8626,-9.9504,5.9543,4.8818,-9.9504,1.2711,20.7189,19.4278,224
-2.6305,-9.8176,3.1207,4.2431,-9.8176,1.5226,20.7597,17.0051,225
-2.5675,-9.7793,1.3239,2.4399,-9.7793,5.4521,18.3041,8.624,226
-0.9025,-9.6632,-0.0038,1.403,-9.6632,1.9144,10.8608,8.9573,227
-3.8709,-9.8321,0.0489,1.743,-9.8321,4.9329,17.5623,10.3678,228
-2.4163,-9.8006,1.1651,2.704,-9.8006,1.5476,21.5453,20.4774,229
-0.6505,-9.4551,1.086,0.8845,-9.4551,1.2144,11.892,8.8355,230
0.0129,-9.8689,0.3151,0.3526,-9.8689,1.0373,8.7478,7.212,231
-1.2712,-9.9099,-0.0165,0.6069,-9.9099,2.256,13.3979,11.5024,232
-3.036,-9.8642,1.0959,1.9875,-9.8642,1.9084,12.1689,7.1321,233
-0.1841,-9.7626,0.0793,0.3511,-9.7626,1.2215,7.0956,6.1305,234
-0.4789,-10.0273,0.2479,0.4714,-10.0273,1.7647,7.7089,6.6937,235
-0.3858,-9.7144,0.0751,0.4767,-9.7144,1.2063,10.2851,6.7439,236
-2.0424,-9.7887,0.4748,1.2445,-9.7887,1.9883,9.6903,7.2211,237
-1.6753,-9.9359,-0.0205,0.6027,-9.9359,1.9408,9.4673,8.0086,238
-2.1562,-9.7824,-0.4906,0.9944,-9.7824,1.7162,8.0736,6.6937,239
-0.9598,-9.8892,1.1432,1.3701,-9.8892,2.0963,10.5266,9.4463,240
-0.8923,-9.7035,0.0813,0.5107,-9.7035,1.6387,9.0346,7.2197,241
-1.6194,-9.905,0.0244,0.796,-9.905,2.637,12.6569,8.5405,242
-1.359,-9.6943,-0.1288,0.6168,-9.6943,1.4225,7.9744,6.1599,243
-0.3594,-9.7074,0.6316,0.9811,-9.7074,1.6471,8.9751,7.3822,244
-0.5228,-9.7556,0.1464,0.8226,-9.7556,1.2429,9.5637,5.4247,245
-1.1152,-10.0393,-0.0229,0.5477,-10.0393,1.3359,17.5825,7.2785,246
-1.3176,-9.7216,0.6121,1.4292,-9.7216,3.4091,10.6098,6.7994,247
-1.8867,-9.8107,1.096,1.8315,-9.8107,2.6027,14.2625,10.7238,248
0.6101,-9.8702,3.2942,1.7817,-9.8702,0.8765,16.9334,14.3438,249
-7.1995,-9.9577,-1.7154,4.0549,-9.9577,1.9732,19.5075,18.3568,250
-5.4683,-9.8329,2.0913,5.1938,-9.8329,5.9533,24.8263,16.2093,251
-1.8698,-9.8494,0.9645,1.4289,-9.8494,4.6893,12.4176,9.3329,252
-1.6149,-9.5477,1.8332,2.421,-9.5477,7.1056,18.7836,11.7228,253
-10.9562,-9.9161,-2.0188,6.4751,-9.9161,10.1905,38.7848,24.4526,254
-6.5801,-10.1521,3.3458,5.3042,-10.1521,3.9612,46.9404,39.8723,255
-2.351,-10.579,1.5335,2.5933,-10.579,3.9512,57.6509,39.6362,256
-11.012,-10.5366,-0.4395,3.5858,-10.5366,6.124,51.9284,39.3445,257
-64.7119,-9.8165,9.3481,26.4998,-9.8165,10.2036,38.2114,32.0691,258
-6.1023,-9.6248,15.8867,14.642,-9.6248,6.5085,29.7808,17.8136,259
-4.0444,-9.9345,-0.8437,2.1483,-9.9345,2.4854,13.3213,6.6068,260
-12.071,-9.8117,4.9174,11.5299,-9.8117,3.681,32.9525,18.664,261
-2.5423,-9.8013,2.3317,2.7253,-9.8013,3.5965,24.3176,13.0199,262
-12.5852,-9.8954,2.1138,11.2709,-9.8954,6.258,46.152,30.2795,263
-49.3263,-9.7596,-6.9812,14.3427,-9.7596,4.84,18.9046,11.5855,264
-20.077,-9.6778,-7.2151,8.6525,-9.6778,3.9675,11.5923,6.7638,265
-7.2106,-9.7903,0.7196,4.3239,-9.7903,3.6942,21.3006,8.7619,266
-3.3436,-9.7603,6.505,7.2327,-9.7603,5.3561,36.9366,15.6968,267
-4.6087,-9.8635,10.6695,11.6619,-9.8635,5.6007,55.09,29.8662,268
-8.9639,-9.7948,-1.5156,3.7512,-9.7948,2.4605,36.8441,25.0589,269
-20.7808,-9.665,0.2494,12.9238,-9.665,2.7025,63.8541,39.9314,270
-6.705,-10.1377,31.3179,27.4478,-10.1377,14.3031,64.5777,37.8442,271
-8.5555,-9.8588,11.4165,15.726,-9.8588,8.4029,34.4706,19.5174,272
-21.8417,-9.7662,-1.4655,10.711,-9.7662,11.1627,32.311,15.2232,273
-19.8786,-9.697,-1.8214,11.2281,-9.697,4.2794,18.3701,12.5212,274
-24.9451,-9.8339,6.6227,19.3068,-9.8339,4.6268,21.5503,16.1629,275
-65.4808,-9.8482,-6.8907,15.7052,-9.8482,8.0763,31.1534,21.864,276
-22.6002,-9.8678,-0.0353,10.4182,-9.8678,10.3581,30.047,20.7805,277
-13.3024,-9.7336,-0.1742,8.0271,-9.7336,4.5354,16.6673,11.6079,278
-15.0412,-10.0755,4.8388,14.825,-10.0755,13.9439,40.0602,29.6911,279
-15.3726,-9.8226,-2.0786,9.5361,-9.8226,4.7654,32.0946,25.1073,280
-14.5487,-9.7783,2.4798,8.7174,-9.7783,9.7704,23.2889,19.2477,281
-26.7785,-9.9091,3.3926,12.3581,-9.9091,10.7842,31.5159,16.5713,282
-64.5678,-9.7519,6.4552,30.7506,-9.7519,11.8439,31.8861,18.8657,283
-30.7643,-10.348,-8.3891,13.2474,-10.348,2.3389,39.5929,30.5234,284
-17.3006,-9.771,-4.4856,5.8019,-9.771,9.2388,26.0282,16.2705,285
-3.2133,-9.7744,2.5358,4.5495,-9.7744,5.9073,28.7286,10.8545,286
-12.697,-9.865,2.7814,7.9375,-9.865,6.7541,28.7021,13.7261,287
-18.2665,-9.803,0.4369,7.3696,-9.803,8.225,23.3216,13.588,288
-8.0092,-9.9546,-1.5955,4.1572,-9.9546,2.0278,11.4819,7.9833,289
-16.4996,-10.0037,-3.6209,6.8094,-10.0037,3.4802,18.4717,13.8025,290
-14.1875,-9.7792,0.1157,5.0985,-9.7792,6.0337,17.4122,11.6548,291
-2.8857,-9.8438,1.3328,3.4346,-9.8438,2.8604,13.6926,7.638,292
-13.0728,-9.8594,3.4837,11.796,-9.8594,14.9492,29.367,22.2916,293
-0.7483,-9.5871,6.2793,5.8685,-9.5871,5.581,21.733,13.9583,294
-8.8434,-9.7611,14.9703,18.0465,-9.7611,5.1274,24.6132,21.9309,295
-11.6923,-9.619,-0.2222,4.4158,-9.619,5.6268,11.4554,8.9076,296
-5.9579,-9.965,2.7357,4.5525,-9.965,3.9355,19.9949,12.8516,297
-15.8253,-9.7941,1.1576,5.2488,-9.7941,5.7017,17.3865,8.6396,298
-6.1587,-9.8969,3.3266,8.6902,-9.8969,2.4574,14.0552,10.8779,299
-6.845,-9.7706,2.1653,8.3014,-9.7706,3.5509,18.4282,14.918,300
-5.1011,-9.9263,-0.6301,3.3332,-9.9263,1.9933,13.1192,10.4255,301
-28.4537,-9.8697,-5.1761,13.1672,-9.8697,12.4724,28.288,22.7912,302
-19.2033,-10.0737,5.6502,13.1208,-10.0737,10.25,40.0971,21.9263,303
-12.5785,-9.9263,-5.9665,6.0533,-9.9263,1.2179,36.1964,29.4115,304
-60.203,-9.4636,10.4136,30.2981,-9.4636,6.6666,52.7668,26.2342,305
-12.9855,-9.8406,-1.6526,6.3957,-9.8406,5.4605,27.4943,14.1015,306
-42.3807,-9.8542,11.7034,30.0444,-9.8542,13.458,49.3154,28.8978,307
-24.6903,-9.7782,1.2027,14.0848,-9.7782,10.2905,38.103,28.3495,308
-25.4311,-10.228,31.6157,55.6672,-10.228,13.3166,56.4466,47.437,309
-54.4773,-10.2973,13.2984,36.6961,-10.2973,9.6386,69.5542,31.4063,310
-34.8344,-9.8517,-5.6571,16.9018,-9.8517,12.6262,49.3553,22.9948,311
-23.9074,-9.7324,10.8446,16.8956,-9.7324,7.2264,41.633,20.4386,312
-6.9749,-9.7629,6.4438,8.29,-9.7629,9.5304,28.6579,19.1943,313
-3.0051,-9.8016,26.3817,21.2552,-9.8016,4.0493,35.2256,21.4643,314
-104.5872,-10.8665,-0.8102,46.7774,-10.8665,8.9297,92.0366,72.3389,315
-5.7438,-9.6812,0.048,2.5393,-9.6812,3.246,18.6964,9.8568,316
-2.9146,-9.5903,1.4432,2.5973,-9.5903,4.0796,19.0747,13.9671,317
-11.3275,-10.2351,11.1548,17.3886,-10.2351,12.9123,38.3231,29.5186,318
4.97,-10.2227,32.2804,25.9284,-10.2227,8.0123,39.831,32.506,319
-0.1295,-10.0111,1.2165,1.8125,-10.0111,1.3537,17.5672,13.8865,320
-17.2666,-10.2221,8.7718,14.562,-10.2221,9.9356,49.9475,31.8995,321
-3.5828,-9.1397,8.0051,13.9982,-9.1397,7.7987,42.7371,22.5453,322
-6.4569,-9.8914,17.1163,18.0302,-9.8914,12.9667,38.309,25.5741,323
-5.1405,-9.7272,3.7342,6.2565,-9.7272,5.9479,34.0476,28.4682,324
-2.6724,-9.7716,0.4892,1.7879,-9.7716,2.8919,12.2854,8.5345,325
-3.3128,-9.9219,0.2342,1.4747,-9.9219,3.0972,12.9242,8.4696,326
-0.9812,-9.8266,0.7522,1.3239,-9.8266,0.8506,9.4087,7.5079,327
-1.7694,-10.0998,-0.0635,1.3921,-10.0998,0.6678,11.9091,10.3464,328
0.1582,-9.8179,0.9988,0.5955,-9.8179,0.9625,9.7968,6.4566,329
-1.4675,-9.7801,4.1066,4.3232,-9.7801,7.4516,21.8407,16.0434,330
-4.7557,-9.9427,1.9643,5.2502,-9.9427,6.1653,31.4388,12.968,331
-2.7663,-9.7487,9.972,12.767,-9.7487,8.3995,32.4691,19.3746,332
-5.5081,-9.8403,3.5897,5.4575,-9.8403,9.1515,24.7205,17.5223,333
0.1214,-9.9994,19.5054,17.2434,-9.9994,6.8655,26.2709,24.1088,334
-3.0187,-10.2545,-0.3525,1.3329,-10.2545,1.8997,19.5509,15.9287,335
-20.0033,-9.8717,0.1664,8.0729,-9.8717,11.1687,29.1865,23.7111,336
-3.6498,-9.5226,11.3204,10.0481,-9.5226,2.7028,33.0213,24.6511,337
-9.1619,-10.2432,9.028,18.1422,-10.2432,11.5702,39.9192,21.9683,338
-7.0156,-9.5961,0.5201,8.7317,-9.5961,2.893,20.9271,17.7585,339
-7.8158,-9.8075,0.8867,7.7807,-9.8075,4.7785,23.8179,21.3475,340
-26.4862,-10.0073,16.1777,26.0641,-10.0073,19.7296,40.282,34.2467,341
-5.7722,-9.762,13.0637,12.3495,-9.762,14.7213,35.8799,27.0342,342
-47.8268,-10.096,28.2075,49.6892,-10.096,17.6219,45.759,38.5808,343
3.9267,-10.3044,28.681,15.6256,-10.3044,5.9945,47.4276,27.0342,344
-13.8643,-9.7832,-0.031,4.671,-9.7832,4.5645,17.4204,12.3862,345
-21.1865,-9.8348,8.5137,15.1778,-9.8348,12.3778,28.1288,19.5661,346
-6.0226,-9.7877,0.904,5.918,-9.7877,4.9205,35.1605,26.5798,347
-21.1458,-9.7152,11.5018,24.2187,-9.7152,14.0491,36.3988,25.8528,348
-8.466,-9.77,-0.1,5.7794,-9.77,4.5542,23.1521,19.2986,349
6.214,-10.3603,32.1057,16.3021,-10.3603,5.2147,48.7546,38.0973,350
-48.0038,-10.0134,12.6265,31.9051,-10.0134,10.6672,56.6157,35.4367,351
-26.3231,-9.5652,26.3666,26.9348,-9.5652,11.3717,66.6536,37.2955,352
-7.6913,-9.7938,1.1443,5.1796,-9.7938,3.2768,33.859,21.4788,353
-0.9576,-10.0509,0.2326,0.7908,-10.0509,2.0003,19.1953,17.3996,354
-1.2334,-9.8295,0.5755,1.2509,-9.8295,0.9739,9.2245,6.7022,355
-0.4259,-9.7634,1.0796,1.0965,-9.7634,1.8834,13.4384,8.4787,356
