{
    "08-03-2023": {
        "type": "dos",
        "tirage vertical prise large": {
            "poids": [
                "45",
                "45",
                "45"
            ],
            "reps": "8"
        },
        "tirage vertical prise serree": {
            "poids": [
                "45",
                "45",
                "45"
            ],
            "reps": "8"
        },
        "brachial curl halteres": {
            "poids": [
                "10",
                "10"
            ],
            "reps": "10"
        },
        "rear delt": {
            "poids": [
                "45",
                "45",
                "45",
                "45"
            ],
            "reps": "10"
        }
    },
    "10-03-2023": {
        "type": "jambes",
        "presse": {
            "poids": [
                "100",
                "100",
                "100",
                "100"
            ],
            "reps": "8"
        },
        "adducteurs": {
            "poids": [
                "59",
                "59",
                "59",
                "59"
            ],
            "reps": "8"
        },
        "abducteurs": {
            "poids": [
                "52",
                "52",
                "52",
                "52"
            ],
            "reps": "8"
        },
        "isquio": {
            "poids": [
                "39",
                "39",
                "39",
                "39"
            ],
            "reps": "8"
        }
    },
    "11-03-2023": {
        "type": "pecs",
        "dc": {
            "poids": [
                "60",
                "60",
                "60",
                "60"
            ],
            "reps": "6"
        },
        "converging chest press": {
            "poids": [
                "39",
                "52000",
                "39",
                "39"
            ],
            "reps": "8"
        },
        "triceps poulie haute": {
            "poids": [
                "23",
                "23",
                "23",
                "23"
            ],
            "reps": "8"
        },
        "triceps poulie basse": {
            "poids": [
                "23",
                "23",
                "23",
                "23"
            ],
            "reps": "8"
        },
        "butterfly": {
            "poids": [
                "52",
                "52",
                "52",
                "52"
            ],
            "reps": "8"
        },
        "di halteres": {
            "poids": [
                "10",
                "10",
                "10",
                "10"
            ],
            "reps": "10"
        }
    },
    "16-03-2023": {
        "type": "dos",
        "tractions": {
            "poids": [
                "0",
                "0",
                "0",
                "0"
            ],
            "reps": "8"
        },
        "tirage vertical prise large": {
            "poids": [
                "52",
                "52",
                "52",
                "52000"
            ],
            "reps": "8"
        },
        "biceps curl supination": {
            "poids": [
                "8",
                "8",
                "6",
                "6"
            ],
            "reps": "20"
        },
        "rear delt": {
            "poids": [
                "45",
                "45",
                "45",
                "45"
            ],
            "reps": "8"
        }
    },
    "17-03-2023": {
        "type": "jambes",
        "presse horizontale": {
            "poids": [
                "73",
                "73",
                "86",
                "86",
                "100"
            ],
            "reps": "8"
        },
        "mollets": {
            "poids": [
                "50",
                "50",
                "50",
                "50"
            ],
            "reps": "20"
        },
        "adducteurs": {
            "poids": [
                "52",
                "59",
                "59",
                "66"
            ],
            "reps": "8"
        },
        "abducteurs": {
            "poids": [
                "52",
                "59",
                "59",
                "66"
            ],
            "reps": "8"
        },
        "butterfly": {
            "poids": [
                "59",
                "59",
                "59",
                "59"
            ],
            "reps": "8"
        }
    },
    "19-03-2023": {
        "type": "pecs",
        "dc": {
            "poids": [
                "60",
                "60",
                "60",
                "60"
            ],
            "reps": "6"
        },
        "chestpress": {
            "poids": [
                "45",
                "45",
                "39",
                "32"
            ],
            "reps": "8"
        },
        "di halteres": {
            "poids": [
                "14",
                "14",
                "14",
                "14"
            ],
            "reps": "8"
        },
        "butterfly": {
            "poids": [
                "66",
                "52",
                "52",
                "52"
            ],
            "reps": "8"
        },
        "haut pecs poulie": {
            "poids": [
                "9",
                "9",
                "9",
                "9"
            ],
            "reps": "8"
        },
        "triceps poulie haute": {
            "poids": [
                "23",
                "27",
                "27",
                "27"
            ],
            "reps": "8"
        },
        "triceps poulie basse": {
            "poids": [
                "18",
                "18",
                "18",
                "18"
            ],
            "reps": "8"
        }
    },
    "20-03-2023": {
        "type": "dos",
        "tirage vertical prise large": {
            "poids": [
                "54",
                "54",
                "56",
                "59"
            ],
            "reps": "8"
        },
        "th": {
            "poids": [
                "59",
                "61",
                "59",
                "52"
            ],
            "reps": "8"
        },
        "rear delt": {
            "poids": [
                "52",
                "52",
                "52000",
                "45"
            ],
            "reps": "8"
        },
        "shoulder press": {
            "poids": [
                "41",
                "45",
                "50",
                "50"
            ],
            "reps": "8"
        },
        "trapezes": {
            "poids": [
                "10",
                "10",
                "10",
                "10"
            ],
            "reps": "20"
        }
    },
    "22-03-2023": {
        "type": "pecs",
        "di": {
            "poids": [
                "60",
                "60",
                "60000",
                "50"
            ],
            "reps": "8"
        },
        "dc": {
            "poids": [
                "60000",
                "60000",
                "50",
                "55000"
            ],
            "reps": "8"
        },
        "butterfly": {
            "poids": [
                "52",
                "59",
                "59",
                "66"
            ],
            "reps": "8"
        },
        "triceps poulie haute": {
            "poids": [
                "21",
                "18",
                "18",
                "18"
            ],
            "reps": "8"
        },
        "converging chest press": {
            "poids": [
                "45000",
                "32",
                "39"
            ],
            "reps": "8"
        },
        "bas pecs poulie": {
            "poids": [
                "14",
                "14",
                "9",
                "9"
            ],
            "reps": "8"
        },
        "haut pecs poulie": {
            "poids": [
                "9",
                "14000",
                "9",
                "9"
            ],
            "reps": "8"
        }
    },
    "24-03-2023": {
        "type": "jambes",
        "adducteurs": {
            "poids": [
                "59",
                "66",
                "73",
                "73"
            ],
            "reps": "8"
        },
        "presse horizontale": {
            "poids": [
                "73",
                "86",
                "100",
                "107"
            ],
            "reps": "8"
        },
        "mollets": {
            "poids": [
                "50",
                "50",
                "50",
                "70"
            ],
            "reps": "8"
        },
        "reverse grip curl barre": {
            "poids": [
                "10",
                "10",
                "15",
                "15"
            ],
            "reps": "8"
        },
        "abducteurs": {
            "poids": [
                "66",
                "66",
                "66",
                "66"
            ],
            "reps": "8"
        },
        "brachial curl halteres": {
            "poids": [
                "10",
                "10",
                "12",
                "10"
            ],
            "reps": "10"
        },
        "triceps poulie basse": {
            "poids": [
                "23",
                "27",
                "32",
                "23"
            ],
            "reps": "8"
        },
        "triceps poulie haute": {
            "poids": [
                "23",
                "27",
                "23",
                "23"
            ],
            "reps": "8"
        }
    },
    "25-03-2023": {
        "type": "pecs",
        "dc": {
            "poids": [
                "60",
                "70000",
                "60",
                "60000"
            ],
            "reps": "8"
        },
        "di": {
            "poids": [
                "50000",
                "40",
                "45000",
                "45000"
            ],
            "reps": "8"
        },
        "butterfly": {
            "poids": [
                "66",
                "73000",
                "59000",
                "52"
            ],
            "reps": "8"
        },
        "shoulder press": {
            "poids": [
                "36",
                "36000",
                "27",
                "27000"
            ],
            "reps": "12"
        },
        "haut pecs poulie": {
            "poids": [
                "14",
                "9",
                "14000",
                "9"
            ],
            "reps": "8"
        },
        "bas pecs poulie": {
            "poids": [
                "16000",
                "11",
                "14",
                "14000"
            ],
            "reps": "8"
        }
    },
    "02-04-2023": {
        "type": "pecs",
        "dc": {
            "poids": [
                "60",
                "60",
                "60",
                "70000"
            ],
            "reps": "8"
        },
        "butterfly": {
            "poids": [
                "66",
                "66",
                "66000",
                "52"
            ],
            "reps": "8"
        },
        "triceps poulie haute": {
            "poids": [
                "32",
                "32",
                "32",
                "32"
            ],
            "reps": "8"
        },
        "triceps poulie basse": {
            "poids": [
                "27",
                "27",
                "27",
                "27"
            ],
            "reps": "8"
        }
    },
    "04-04-2023": {
        "type": "dos",
        "tractions": {
            "poids": [
                "0",
                "0"
            ],
            "reps": "8"
        },
        "tirage vertical prise serree": {
            "poids": [
                "45",
                "45",
                "45",
                "39"
            ],
            "reps": "12"
        },
        "d th": {
            "poids": [
                "23",
                "27",
                "23",
                "27"
            ],
            "reps": "12"
        },
        "rear delt": {
            "poids": [
                "39",
                "39",
                "39",
                "39"
            ],
            "reps": "8"
        }
    },
    "05-04-2023": {
        "type": "pecs",
        "dc": {
            "poids": [
                "40",
                "50",
                "60",
                "65000",
                "65000"
            ],
            "reps": "8"
        },
        "butterfly": {
            "poids": [
                "52",
                "59",
                "66",
                "66000"
            ],
            "reps": "8"
        },
        "triceps poulie haute": {
            "poids": [
                "36",
                "36",
                "36",
                "36"
            ],
            "reps": "8"
        },
        "di": {
            "poids": [
                "50000",
                "40",
                "40",
                "45000"
            ],
            "reps": "8"
        }
    },
    "07-04-2023": {
        "type": "street",
        "tractions": {
            "poids": [
                "0",
                "0",
                "0",
                "0"
            ],
            "reps": "10"
        },
        "pompes haut pecs": {
            "poids": [
                "0",
                "0",
                "0",
                "0"
            ],
            "reps": "20"
        },
        "dips": {
            "poids": [
                "0",
                "0",
                "0",
                "0"
            ],
            "reps": "10"
        }
    },
    "08-04-2023": {
        "type": "street",
        "tractions biceps": {
            "poids": [
                "0",
                "0",
                "0",
                "0"
            ],
            "reps": "10"
        },
        "tractions brachial": {
            "poids": [
                "0",
                "0",
                "0",
                "0"
            ],
            "reps": "10"
        }
    },
    "09-04-2023": {
        "type": "street",
        "pompes haut pecs": {
            "poids": [
                "0",
                "0"
            ],
            "reps": "20"
        },
        "dips": {
            "poids": [
                "0",
                "0"
            ],
            "reps": "10"
        }
    },
    "10-04-2023": {
        "type": "jambes",
        "1 leg press": {
            "poids": [
                "39",
                "39",
                "45",
                "45"
            ],
            "reps": "8"
        },
        "bss": {
            "poids": [
                "0",
                "8",
                "8"
            ],
            "reps": "10"
        },
        "dc": {
            "poids": [
                "40",
                "60",
                "60",
                "60",
                "60"
            ],
            "reps": "8"
        },
        "gainage fred": {
            "poids": [
                "150"
            ],
            "reps": "1"
        }
    },
    "13-04-2023": {
        "type": "pecs",
        "di": {
            "poids": [
                "40",
                "40",
                "50",
                "50"
            ],
            "reps": "8"
        },
        "elevations lat": {
            "poids": [
                "6",
                "6",
                "6"
            ],
            "reps": "10"
        },
        "shoulder press": {
            "poids": [
                "36",
                "41",
                "45",
                "45"
            ],
            "reps": "8"
        }
    },
    "14-04-2023": {
        "type": "pecs",
        "dc": {
            "poids": [
                "65000",
                "65000",
                "62500",
                "62500"
            ],
            "reps": "8"
        },
        "di halteres": {
            "poids": [
                "14",
                "16",
                "16",
                "16"
            ],
            "reps": "10"
        },
        "butterfly": {
            "poids": [
                "59",
                "66000",
                "59000",
                "45"
            ],
            "reps": "8"
        },
        "converging chest press": {
            "poids": [
                "45",
                "45",
                "52",
                "52000"
            ],
            "reps": "8"
        },
        "triceps poulie haute": {
            "poids": [
                "32",
                "32000",
                "23",
                "27000"
            ],
            "reps": "8"
        }
    },
    "23-04-2023": {
        "type": "fullbody",
        "dc": {
            "poids": [
                "40",
                "60",
                "60",
                "60"
            ],
            "reps": "8"
        },
        "th": {
            "poids": [
                "52",
                "59",
                "66",
                "59",
                "59"
            ],
            "reps": "8"
        },
        "shoulder press": {
            "poids": [
                "23",
                "36",
                "41",
                "41"
            ],
            "reps": "8"
        },
        "biceps poulie": {
            "poids": [
                "23",
                "27",
                "32",
                "32"
            ],
            "reps": "8"
        },
        "triceps poulie haute": {
            "poids": [
                "32",
                "36",
                "36",
                "32"
            ],
            "reps": "8"
        },
        "elevations lat": {
            "poids": [
                "7",
                "5",
                "5",
                "5"
            ],
            "reps": "8"
        },
        "converging chest press": {
            "poids": [
                "39",
                "45",
                "52",
                "52"
            ],
            "reps": "8"
        },
        "butterfly": {
            "poids": [
                "52",
                "66",
                "73",
                "52"
            ],
            "reps": "8"
        },
        "di": {
            "poids": [
                "40",
                "50",
                "40",
                "50000"
            ],
            "reps": "8"
        }
    }
}