{
    "exos": [
        {
            "value": "elevations lat",
            "label": "\u00e9l\u00e9vations lat\u00e9rales"
        },
        {
            "value": "pistol_bosu",
            "label": "pistol squat bosu"
        },
        {
            "value": "squats guid\u00e9s",
            "label": "squats guid\u00e9s"
        },
        {
            "value": "leg extension",
            "label": "leg extension"
        },
        {
            "value": "biceps poulie",
            "label": "biceps poulie"
        },
        {
            "value": "gainage fred",
            "label": "gainage fred"
        },
        {
            "value": "1 leg press",
            "label": "presse \u00e0 une jambe"
        },
        {
            "value": "bss",
            "label": "bulgarial split squats"
        },
        {
            "value": "dips",
            "label": "dips"
        },
        {
            "value": "pompes",
            "label": "pompes"
        },
        {
            "value": "pompes haut pecs",
            "label": "pompes haut pecs"
        },
        {
            "value": "tractions brachial",
            "label": "tractions brachial"
        },
        {
            "value": "tractions biceps",
            "label": "tractions biceps"
        },
        {
            "value": "di",
            "label": "D\u00e9velopp\u00e9 inclin\u00e9"
        },
        {
            "value": "dc",
            "label": "D\u00e9velopp\u00e9 couch\u00e9"
        },
        {
            "value": "tirage vertical prise large",
            "label": "tirage vertical prise large"
        },
        {
            "value": "tirage vertical prise serree",
            "label": "tirage vertical prise serree"
        },
        {
            "value": "brachial curl halteres",
            "label": "brachial curl halteres"
        },
        {
            "value": "presse",
            "label": "presse"
        },
        {
            "value": "adducteurs",
            "label": "Brise-past\u00e8que"
        },
        {
            "value": "isquio",
            "label": "isquio-jambiers"
        },
        {
            "value": "abducteurs",
            "label": "Ouvre-past\u00e8que (abducteurs)"
        },
        {
            "value": "triceps poulie haute",
            "label": "triceps poulie haute"
        },
        {
            "value": "triceps poulie basse",
            "label": "triceps poulie basse"
        },
        {
            "value": "butterfly",
            "label": "Chest fly"
        },
        {
            "value": "di halteres",
            "label": "d\u00e9velopp\u00e9 inclin\u00e9 halteres"
        },
        {
            "value": "tractions",
            "label": "tractions"
        },
        {
            "value": "biceps curl supination",
            "label": "biceps curl supination"
        },
        {
            "value": "rear delt",
            "label": "rear delt"
        },
        {
            "value": "presse horizontale",
            "label": "presse horizontale"
        },
        {
            "value": "mollets",
            "label": "mollets"
        },
        {
            "value": "chestpress",
            "label": "chest press"
        },
        {
            "value": "haut pecs poulie",
            "label": "haut pecs poulie"
        },
        {
            "value": "th",
            "label": "tirage horizontal"
        },
        {
            "value": "shoulder press",
            "label": "shoulder press"
        },
        {
            "value": "trapezes",
            "label": "trapezes (shrugs)"
        },
        {
            "value": "converging chest press",
            "label": "converging chest press"
        },
        {
            "value": "bas pecs poulie",
            "label": "bas pecs poulie"
        },
        {
            "value": "reverse grip curl barre",
            "label": "reverse grip curl barre"
        },
        {
            "value": "d th",
            "label": "tirage horizontal divergent"
        },
        {
            "value": "d tv",
            "label": "tirage vertical divergent"
        },
        {
            "value": "rowing haltere",
            "label": "tirage b\u00fbcheron"
        },
        {
            "value": "abaisseur 1 bras",
            "label": "abaisseur poulie 1 bras"
        },
        {
            "value": "abaisseur",
            "label": "abaisseurs poulie"
        },
        {
            "value": "cv_sp",
            "label": "converging shoulder press"
        },
        {
            "value": "biceps curl machine",
            "label": "biceps curl machine"
        },
        {
            "value": "squat",
            "label": "squat"
        },
        {
            "value": "front_raise",
            "label": "front raise"
        },
        {
            "value": "front_twist",
            "label": "rotation epaules avant"
        }
    ],
    "seances": [
        {
            "value": "pecs",
            "label": "pecs/triceps"
        },
        {
            "value": "dos",
            "label": "dos/biceps"
        },
        {
            "value": "jambes",
            "label": "legday"
        },
        {
            "value": "street",
            "label": "street"
        },
        {
            "value": "fullbody",
            "label": "fullbody"
        }
    ]
}