{
    "nbexos": 56,
    "reps": 1756,
    "echecs": 21,
    "progression": {
        "tirage vertical prise large": {
            "PR": 59,
            "reps": 8,
            "improvement": "31.1 %"
        },
        "rear delt": {
            "PR": 52,
            "reps": 8,
            "improvement": "15.6 %"
        },
        "Brise-past\u00e8que": {
            "PR": 73,
            "reps": 8,
            "improvement": "23.7 %"
        },
        "Ouvre-past\u00e8que (abducteurs)": {
            "PR": 66,
            "reps": 8,
            "improvement": "26.9 %"
        },
        "D\u00e9velopp\u00e9 couch\u00e9": {
            "PR": 60,
            "reps": 8,
            "improvement": "0.0 %"
        },
        "triceps poulie haute": {
            "PR": 27,
            "reps": 8,
            "improvement": "17.4 %"
        },
        "triceps poulie basse": {
            "PR": 32,
            "reps": 8,
            "improvement": "39.1 %"
        },
        "Chest fly": {
            "PR": 66,
            "reps": 8,
            "improvement": "26.9 %"
        },
        "haut pecs poulie": {
            "PR": 14,
            "reps": 8,
            "improvement": "55.6 %"
        }
    }
}